{"text_format":"1","workbook":"xlsx","n_sheets":7,"sheets":["Index","Notes & Assumptions","Inputs","Calculations","Outputs|Models","Outputs|Tables","Outputs|RIN"],"not_rendered":{"charts":0,"images":0,"macros":1,"external_links":0,"defined_names":146,"comments":0,"pivot_tables":0},"unopened":[],"bounds":{"document_bytes":16777216,"sheet_cells":100000,"rows_first":2000,"rows_last":500,"rows_between":2000,"halvings":0,"cell_chars":16384,"cell_head_chars":4096},"cells_cut":0,"cells_raw":0,"read":"whole","date_system":"1900"}

{"sheet":"Index","index":0,"n_rows":23,"n_cols":11,"rows_kept":23,"cut":false,"hidden":false,"merged":[]}
["Index and File Details"]
[]
[null,"Index",null,null,null,null,null,"File Details"]
[]
[null,"Inputs",null,"Inputs / Calculations",null,"Outputs",null,null,"Model","Accelerated Syncons - Capex Forecast Model"]
[null,null,null,null,null,null,null,null,"Author","Transgrid"]
[null,"Notes & Assumptions",null,"Calculations",null,{"$f":"'Outputs|Models'!$A$1","v":"Outputs | Models"},null,null,"Revision","2026-04-10"]
[null,"Inputs",null,null,null,{"$f":"'Outputs|Tables'!$A$1","v":"Outputs | Tables"},null,null,"Status","Regulatory proposal"]
[null,null,null,null,null,{"$f":"'Outputs|RIN'!$A$1","v":"Outputs | RIN"}]
[]
{"$rows_left_out":14}
{"sheet":"Notes & Assumptions","index":1,"n_rows":10,"n_cols":5,"rows_kept":10,"cut":false,"hidden":false,"merged":[]}
["Assumptions & Notes"]
[]
[null,null,null,null,"User inputs in cells coloured like this"]
[null,null,"*",null,"1.     Financial years are recorded in the Capex Forecast Model as tax years (e.g. 2017/18 is shown as 2018, 2018/19 is shown as 2019)"]
[null,null,"*",null,"2.     Escalation is treated as follows:"]
[null,null,null,null,"a.    CPI escalation and Labour escalation are treated separately. "]
[]
[]
["Modifications"]
["Date","Version",null,"Who","Notes"]
{"$rows_left_out":1}
{"sheet":"Inputs","index":2,"n_rows":295,"n_cols":61,"rows_kept":295,"cut":false,"hidden":false,"merged":[[211,1,211,3],[167,1,167,3],[85,1,85,3],[41,1,45,1],[82,15,85,15],[82,11,85,11],[82,12,85,12],[82,13,85,13],[82,14,85,14],[6,1,6,3],[123,1,123,3],[203,1,203,3],[159,1,159,3],[15,1,15,3],[38,1,38,3],[27,1,27,3],[65,1,65,3],[21,1,21,3],[47,1,53,1],[73,1,73,3]]}
["Inputs",null,null,null,null,null,{"$f":"Report_Month&\" Year\"","v":"September Year"}]
[null,"Section Check",null,{"$f":"IF(SUM(W62,Z119:AH119,W157,W201,I64)=0,0,1)","v":0}]
[]
[null,"Output Reporting Format and Year"]
[]
[]
[null,"Output basis",null,null,null,"Input"]
[null,"Item","Source","Units"]
[null,"Dollar Basis","Transgrid","%",null,2026,{"$f":"\"Real $\"&Report_Year","v":"Real $2026"}]
[null,"Timing","Transgrid","%",null,"September",{"$f":"\"◄ Financial values in this document are presented in \"&Report_Month&\" years\"","v":"◄ Financial values in this document are presented in September years"}]
{"$rows_left_out":286}
{"sheet":"Calculations","index":3,"n_rows":249,"n_cols":35,"rows_kept":249,"cut":false,"hidden":false,"merged":[]}
["Calculations",null,null,null,{"$f":"Inputs!$G$9","v":"Real $2026"},null,null,null,{"$f":"Report_Month&\" Year\"","v":"September Year"}]
[]
[null,"Incremental Capital Expenditure (Excluding Equity Raising Costs) by Capex Category",null,null,null,null,null,null,null,null,null,null,null,null,"Total",null,"Contestable",null,"Mapping","Mapping",null,"Mapping",null,null,null,null,null,null,null,null,"June year | $Nominal | Used for RIN population"]
[null,"Capex category","Dollar basis","Units",{"$f":"Inputs!L$23","v":2022},{"$f":"Inputs!M$23","v":2023},{"$f":"Inputs!N$23","v":2024},{"$f":"Inputs!O$23","v":2025},{"$f":"Inputs!P$23","v":2026},{"$f":"Inputs!Q$23","v":2027},{"$f":"Inputs!R$23","v":2028},{"$f":"Inputs!S$23","v":2029},{"$f":"Inputs!T$23","v":2030},{"$f":"Inputs!U$23","v":2031},null,null,"Yes/No",null,"RAB Asset Class","RIN Network and Non network",null,"RIN Cost Categories",null,null,null,null,null,null,null,null,{"$f":"E4","v":2022},{"$f":"F4","v":2023},{"$f":"G4","v":2024},{"$f":"H4","v":2025},{"$f":"I4","v":2026}]
[]
[null,"Direct Non-Labour Costs"]
[null,{"$f":"Inputs!$B$221","v":"Synchronous Condensers - Synchronous Condensers - Contestable"},{"$f":"Inputs!$G$9","v":"Real $2026"},"$Million",{"$f":"Inputs!X103","v":0},{"$f":"Inputs!Y103","v":0},{"$f":"Inputs!Z103","v":0},{"$f":"Inputs!AA103","v":0},{"$f":"Inputs!AB103","v":143.05025049665829},{"$f":"Inputs!AC103","v":249.29345209983424},{"$f":"Inputs!AD103","v":178.15308317455933},{"$f":"Inputs!AE103","v":28.244612920255101},{"$f":"Inputs!AF103","v":0},{"$f":"Inputs!AG103","v":0},{"$f":"SUM(E7:N7)","v":598.74139869130704},null,{"$f":"Inputs!I221","v":"Yes"},null,{"$f":"Inputs!C221","v":"Synchronous Condensers"},{"$f":"Inputs!D221","v":"Synchronous Condensers"},null,{"$f":"_xlfn.XLOOKUP($T7,Inputs!$B$251:$B$264,Inputs!$C$251:$C$264)","v":"Synchronous Condenser"},null,null,null,null,null,null,null,null,{"$f":"Inputs!BE103","v":0},{"$f":"Inputs!BF103","v":0},{"$f":"Inputs!BG103","v":0},{"$f":"Inputs!BH103","v":0},{"$f":"Inputs!BI103","v":79.95201349471526}]
[null,{"$f":"Inputs!$B$222","v":"Synchronous Condensers - Other - Non-Contestable"},{"$f":"Inputs!$G$9","v":"Real $2026"},"$Million",{"$f":"Inputs!X104","v":0},{"$f":"Inputs!Y104","v":0},{"$f":"Inputs!Z104","v":0},{"$f":"Inputs!AA104","v":0},{"$f":"Inputs!AB104","v":2.0394151741924382},{"$f":"Inputs!AC104","v":1.9740160804596889},{"$f":"Inputs!AD104","v":1.9230566016388346},{"$f":"Inputs!AE104","v":1.8734126483131366},{"$f":"Inputs!AF104","v":0},{"$f":"Inputs!AG104","v":0},7.8099005046040988,null,{"$f":"Inputs!I222","v":"No"},null,{"$f":"Inputs!C222","v":"Synchronous Condensers"},{"$f":"Inputs!D222","v":"Other"},null,{"$f":"_xlfn.XLOOKUP($T8,Inputs!$B$251:$B$264,Inputs!$C$251:$C$264)","v":"Other (Including non-network capital costs)"},null,null,null,null,null,null,null,null,{"$f":"Inputs!BE104","v":0},{"$f":"Inputs!BF104","v":0},{"$f":"Inputs!BG104","v":0},{"$f":"Inputs!BH104","v":0},{"$f":"Inputs!BI104","v":0}]
[null,{"$f":"Inputs!$B$223","v":"Transmission Lines - Transmission towers - Contestable"},{"$f":"Inputs!$G$9","v":"Real $2026"},"$Million",{"$f":"Inputs!X105","v":0},{"$f":"Inputs!Y105","v":0},{"$f":"Inputs!Z105","v":0},{"$f":"Inputs!AA105","v":0},{"$f":"Inputs!AB105","v":3.3434719238354385},{"$f":"Inputs!AC105","v":8.9451766660472671},{"$f":"Inputs!AD105","v":2.076230850333749},{"$f":"Inputs!AE105","v":0},{"$f":"Inputs!AF105","v":0},{"$f":"Inputs!AG105","v":0},14.364879440216454,null,{"$f":"Inputs!I223","v":"Yes"},null,{"$f":"Inputs!C223","v":"Transmission Lines"},{"$f":"Inputs!D223","v":"Transmission towers"},null,{"$f":"_xlfn.XLOOKUP($T9,Inputs!$B$251:$B$264,Inputs!$C$251:$C$264)","v":"Towers - new infrastructure"},null,null,null,null,null,null,null,null,{"$f":"Inputs!BE105","v":0},{"$f":"Inputs!BF105","v":0},{"$f":"Inputs!BG105","v":0},{"$f":"Inputs!BH105","v":0},{"$f":"Inputs!BI105","v":0.63258770622783655}]
[null,{"$f":"Inputs!$B$224","v":"Transmission Lines - Transmission Tower support structures - Contestable"},{"$f":"Inputs!$G$9","v":"Real $2026"},"$Million",{"$f":"Inputs!X106","v":0},{"$f":"Inputs!Y106","v":0},{"$f":"Inputs!Z106","v":0},{"$f":"Inputs!AA106","v":0},{"$f":"Inputs!AB106","v":0.43302925434247447},{"$f":"Inputs!AC106","v":1.1585331864299513},{"$f":"Inputs!AD106","v":0.26890272071778171},{"$f":"Inputs!AE106","v":0},{"$f":"Inputs!AF106","v":0},{"$f":"Inputs!AG106","v":0},1.8604651614902075,null,{"$f":"Inputs!I224","v":"Yes"},null,{"$f":"Inputs!C224","v":"Transmission Lines"},{"$f":"Inputs!D224","v":"Transmission Tower support structures"},null,{"$f":"_xlfn.XLOOKUP($T10,Inputs!$B$251:$B$264,Inputs!$C$251:$C$264)","v":"Towers - new infrastructure"},null,null,null,null,null,null,null,null,{"$f":"Inputs!BE106","v":0},{"$f":"Inputs!BF106","v":0},{"$f":"Inputs!BG106","v":0},{"$f":"Inputs!BH106","v":0},{"$f":"Inputs!BI106","v":8.1929499925281507E-2}]
{"$rows_left_out":240}
{"sheet":"Outputs|Models","index":4,"n_rows":86,"n_cols":23,"rows_kept":86,"cut":false,"hidden":false,"merged":[]}
["Outputs | Models",null,null,null,null,null,null,null,{"$f":"Report_Month&\" Year\"","v":"September Year"}]
[]
["Outputs | PTRM"]
[]
[null,"As Incurred",null,"Dollar basis","Units",{"$f":"Inputs!L$23","v":2022},{"$f":"F5+1","v":2023},{"$f":"Inputs!N$23","v":2024},{"$f":"H5+1","v":2025},2026,2027,2028,2029,2030,2031,"Total"]
[null,"Capex"]
[null,{"$f":"Inputs!$B$240","v":"Transmission Lines"},null,{"$f":"Inputs!$G$9","v":"Real $2026"},"$Million",null,null,null,null,null,{"$f":"K68","v":17.412358560387787},4.2047697898419916,0,0,0,{"$f":"SUM(F7:O7)","v":21.617128350229777}]
[null,{"$f":"Inputs!$B$241","v":"Substations"},null,{"$f":"Inputs!$G$9","v":"Real $2026"},"$Million",null,null,null,null,null,68.01453462459763,65.498381391307475,12.434042652916212,0,0,145.94695866882131]
[null,{"$f":"Inputs!$B$242","v":"Secondary System"},null,{"$f":"Inputs!$G$9","v":"Real $2026"},"$Million",null,null,null,null,null,53.284614198745423,28.837850643096818,4.0482929567634169,0,0,86.170757798605663]
[null,{"$f":"Inputs!$B$243","v":"Minor Plant, Motor Vehicles & Mobile Plant"},null,{"$f":"Inputs!$G$9","v":"Real $2026"},"$Million",null,null,null,null,null,0,0,0,0,0,0]
{"$rows_left_out":77}
{"sheet":"Outputs|Tables","index":5,"n_rows":264,"n_cols":14,"rows_kept":264,"cut":false,"hidden":false,"merged":[]}
["Outputs | Tables",null,null,null,null,{"$f":"Inputs!G9","v":"Real $2026"},null,null,null,null,null,null,{"$f":"Report_Month&\" Year\"","v":"September Year"}]
[]
["Unused: Total capex for the Project, including pre-period capex ($M, September 2026)"]
[]
[null,"As Incurred",null,"Dollar basis","Units","Pre-period",{"$f":"Inputs!Q$23","v":2027},{"$f":"Inputs!R$23","v":2028},{"$f":"Inputs!S$23","v":2029},{"$f":"Inputs!T$23","v":2030},{"$f":"Inputs!U$23","v":2031},"Total"]
[null,"Capex"]
[null,"Pre-period costs",null,{"$f":"Inputs!$G$9","v":"Real $2026"},"$Million",312.50263137258526,null,null,null,null,null,312.50263137258526]
[null,"Direct costs"]
[null,"OEM costs",null,{"$f":"Inputs!$G$9","v":"Real $2026"},"$Million",null,"c-i-c","c-i-c","c-i-c","c-i-c","c-i-c","c-i-c"]
[null,"LTSA Capital Spares",null,{"$f":"Inputs!$G$9","v":"Real $2026"},"$Million",null,"c-i-c","c-i-c","c-i-c","c-i-c","c-i-c","c-i-c"]
{"$rows_left_out":255}
{"sheet":"Outputs|RIN","index":6,"n_rows":398,"n_cols":28,"rows_kept":398,"cut":false,"hidden":false,"merged":[]}
["Outputs | RIN",null,null,null,null,null,null,null,null,null,null,null,{"$f":"Report_Month&\" Year\"","v":"September Year"}]
[]
["Table 5.1 - Network capital costs as-incurred - contestable (nominal $m)"]
[null,null,null,null,null,"September year",null,null,null,null,null,null,null,null,null,null,null,"June year"]
[null,"As Incurred",null,"Dollar basis","Units",{"$f":"Inputs!L$23","v":2022},{"$f":"Inputs!M$23","v":2023},{"$f":"Inputs!N$23","v":2024},{"$f":"Inputs!O$23","v":2025},{"$f":"Inputs!P$23","v":2026},{"$f":"Inputs!Q$23","v":2027},{"$f":"Inputs!R$23","v":2028},{"$f":"Inputs!S$23","v":2029},{"$f":"Inputs!T$23","v":2030},{"$f":"Inputs!U$23","v":2031},"Total",null,{"$f":"F5","v":2022},{"$f":"G5","v":2023},{"$f":"H5","v":2024},{"$f":"I5","v":2025},{"$f":"J5","v":2026},"Sept 26 Qtr"]
[null,"Asset category"]
[null,"Synchronous Condensers",null,"Nominal","$Million",{"$f":"F25*Inputs!L$30","v":0},{"$f":"G25*Inputs!M$30","v":0},{"$f":"H25*Inputs!N$30","v":0},{"$f":"I25*Inputs!O$30","v":0},{"$f":"J25*Inputs!P$30","v":140.28556059293118},{"$f":"K25*Inputs!Q$30","v":252.57489497429151},{"$f":"L25*Inputs!R$30","v":185.28116439499152},{"$f":"M25*Inputs!S$30","v":30.153114366647621},{"$f":"N25*Inputs!T$30","v":0},{"$f":"O25*Inputs!U$30","v":0},{"$f":"SUM(F7:O7)","v":608.29473432886186},null,{"$f":"SUMIFS(Calculations!AE$7:AE$21,Calculations!$T$7:$T$21,$B7,Calculations!$Q$7:$Q$21,$F$38)\n+SUMIFS(Calculations!AE$24:AE$38,Calculations!$T$24:$T$38,$B7,Calculations!$Q$24:$Q$38,$F$38)","v":0},{"$f":"SUMIFS(Calculations!AF$7:AF$21,Calculations!$T$7:$T$21,$B7,Calculations!$Q$7:$Q$21,$F$38)\n+SUMIFS(Calculations!AF$24:AF$38,Calculations!$T$24:$T$38,$B7,Calculations!$Q$24:$Q$38,$F$38)","v":0},{"$f":"SUMIFS(Calculations!AG$7:AG$21,Calculations!$T$7:$T$21,$B7,Calculations!$Q$7:$Q$21,$F$38)\n+SUMIFS(Calculations!AG$24:AG$38,Calculations!$T$24:$T$38,$B7,Calculations!$Q$24:$Q$38,$F$38)","v":0},{"$f":"SUMIFS(Calculations!AH$7:AH$21,Calculations!$T$7:$T$21,$B7,Calculations!$Q$7:$Q$21,$F$38)\n+SUMIFS(Calculations!AH$24:AH$38,Calculations!$T$24:$T$38,$B7,Calculations!$Q$24:$Q$38,$F$38)","v":0},{"$f":"SUMIFS(Calculations!AI$7:AI$21,Calculations!$T$7:$T$21,$B7,Calculations!$Q$7:$Q$21,$F$38)\n+SUMIFS(Calculations!AI$24:AI$38,Calculations!$T$24:$T$38,$B7,Calculations!$Q$24:$Q$38,$F$38)","v":79.95201349471526},{"$f":"SUM(F7:J7)-SUM(R7:V7)","v":60.333547098215917},"◄ Includes direct portion (70%) of labour costs allocated to network asset classes"]
[null,"Transmission towers",null,"Nominal","$Million",{"$f":"F26*Inputs!L$30","v":0},{"$f":"G26*Inputs!M$30","v":0},{"$f":"H26*Inputs!N$30","v":0},{"$f":"I26*Inputs!O$30","v":0},{"$f":"J26*Inputs!P$30","v":3.2788536303397633},{"$f":"K26*Inputs!Q$30","v":9.0629217812290612},{"$f":"L26*Inputs!R$30","v":2.1593029020200225},{"$f":"M26*Inputs!S$30","v":0},{"$f":"N26*Inputs!T$30","v":0},{"$f":"O26*Inputs!U$30","v":0},{"$f":"SUM(F8:O8)","v":14.501078313588849},null,{"$f":"SUMIFS(Calculations!AE$7:AE$21,Calculations!$T$7:$T$21,$B8,Calculations!$Q$7:$Q$21,$F$38)\n+SUMIFS(Calculations!AE$24:AE$38,Calculations!$T$24:$T$38,$B8,Calculations!$Q$24:$Q$38,$F$38)","v":0},{"$f":"SUMIFS(Calculations!AF$7:AF$21,Calculations!$T$7:$T$21,$B8,Calculations!$Q$7:$Q$21,$F$38)\n+SUMIFS(Calculations!AF$24:AF$38,Calculations!$T$24:$T$38,$B8,Calculations!$Q$24:$Q$38,$F$38)","v":0},{"$f":"SUMIFS(Calculations!AG$7:AG$21,Calculations!$T$7:$T$21,$B8,Calculations!$Q$7:$Q$21,$F$38)\n+SUMIFS(Calculations!AG$24:AG$38,Calculations!$T$24:$T$38,$B8,Calculations!$Q$24:$Q$38,$F$38)","v":0},{"$f":"SUMIFS(Calculations!AH$7:AH$21,Calculations!$T$7:$T$21,$B8,Calculations!$Q$7:$Q$21,$F$38)\n+SUMIFS(Calculations!AH$24:AH$38,Calculations!$T$24:$T$38,$B8,Calculations!$Q$24:$Q$38,$F$38)","v":0},{"$f":"SUMIFS(Calculations!AI$7:AI$21,Calculations!$T$7:$T$21,$B8,Calculations!$Q$7:$Q$21,$F$38)\n+SUMIFS(Calculations!AI$24:AI$38,Calculations!$T$24:$T$38,$B8,Calculations!$Q$24:$Q$38,$F$38)","v":0.63258770622783655},2.6462659241119266]
[null,"Transmission Tower support structures",null,"Nominal","$Million",{"$f":"F27*Inputs!L$30","v":0},{"$f":"G27*Inputs!M$30","v":0},{"$f":"H27*Inputs!N$30","v":0},{"$f":"I27*Inputs!O$30","v":0},{"$f":"J27*Inputs!P$30","v":0.42466022595320169},{"$f":"K27*Inputs!Q$30","v":1.1737829269963838},{"$f":"L27*Inputs!R$30","v":0.27966178477390835},{"$f":"M27*Inputs!S$30","v":0},{"$f":"N27*Inputs!T$30","v":0},{"$f":"O27*Inputs!U$30","v":0},1.878104937723494,null,{"$f":"SUMIFS(Calculations!AE$7:AE$21,Calculations!$T$7:$T$21,$B9,Calculations!$Q$7:$Q$21,$F$38)\n+SUMIFS(Calculations!AE$24:AE$38,Calculations!$T$24:$T$38,$B9,Calculations!$Q$24:$Q$38,$F$38)","v":0},{"$f":"SUMIFS(Calculations!AF$7:AF$21,Calculations!$T$7:$T$21,$B9,Calculations!$Q$7:$Q$21,$F$38)\n+SUMIFS(Calculations!AF$24:AF$38,Calculations!$T$24:$T$38,$B9,Calculations!$Q$24:$Q$38,$F$38)","v":0},{"$f":"SUMIFS(Calculations!AG$7:AG$21,Calculations!$T$7:$T$21,$B9,Calculations!$Q$7:$Q$21,$F$38)\n+SUMIFS(Calculations!AG$24:AG$38,Calculations!$T$24:$T$38,$B9,Calculations!$Q$24:$Q$38,$F$38)","v":0},{"$f":"SUMIFS(Calculations!AH$7:AH$21,Calculations!$T$7:$T$21,$B9,Calculations!$Q$7:$Q$21,$F$38)\n+SUMIFS(Calculations!AH$24:AH$38,Calculations!$T$24:$T$38,$B9,Calculations!$Q$24:$Q$38,$F$38)","v":0},{"$f":"SUMIFS(Calculations!AI$7:AI$21,Calculations!$T$7:$T$21,$B9,Calculations!$Q$7:$Q$21,$F$38)\n+SUMIFS(Calculations!AI$24:AI$38,Calculations!$T$24:$T$38,$B9,Calculations!$Q$24:$Q$38,$F$38)","v":8.1929499925281507E-2},0.34273072602792021]
[null,"Conductors",null,"Nominal","$Million",{"$f":"F28*Inputs!L$30","v":0},{"$f":"G28*Inputs!M$30","v":0},{"$f":"H28*Inputs!N$30","v":0},{"$f":"I28*Inputs!O$30","v":0},{"$f":"J28*Inputs!P$30","v":1.8026475417866523},{"$f":"K28*Inputs!Q$30","v":4.982611458823909},{"$f":"L28*Inputs!R$30","v":1.1871411496632842},{"$f":"M28*Inputs!S$30","v":0},{"$f":"N28*Inputs!T$30","v":0},{"$f":"O28*Inputs!U$30","v":0},7.9724001502738453,null,{"$f":"SUMIFS(Calculations!AE$7:AE$21,Calculations!$T$7:$T$21,$B10,Calculations!$Q$7:$Q$21,$F$38)\n+SUMIFS(Calculations!AE$24:AE$38,Calculations!$T$24:$T$38,$B10,Calculations!$Q$24:$Q$38,$F$38)","v":0},{"$f":"SUMIFS(Calculations!AF$7:AF$21,Calculations!$T$7:$T$21,$B10,Calculations!$Q$7:$Q$21,$F$38)\n+SUMIFS(Calculations!AF$24:AF$38,Calculations!$T$24:$T$38,$B10,Calculations!$Q$24:$Q$38,$F$38)","v":0},{"$f":"SUMIFS(Calculations!AG$7:AG$21,Calculations!$T$7:$T$21,$B10,Calculations!$Q$7:$Q$21,$F$38)\n+SUMIFS(Calculations!AG$24:AG$38,Calculations!$T$24:$T$38,$B10,Calculations!$Q$24:$Q$38,$F$38)","v":0},{"$f":"SUMIFS(Calculations!AH$7:AH$21,Calculations!$T$7:$T$21,$B10,Calculations!$Q$7:$Q$21,$F$38)\n+SUMIFS(Calculations!AH$24:AH$38,Calculations!$T$24:$T$38,$B10,Calculations!$Q$24:$Q$38,$F$38)","v":0},{"$f":"SUMIFS(Calculations!AI$7:AI$21,Calculations!$T$7:$T$21,$B10,Calculations!$Q$7:$Q$21,$F$38)\n+SUMIFS(Calculations!AI$24:AI$38,Calculations!$T$24:$T$38,$B10,Calculations!$Q$24:$Q$38,$F$38)","v":0.3477839520021217},1.4548635897845306]
{"$rows_left_out":388}