{"text_format":"1","workbook":"xlsx","n_sheets":7,"sheets":["Index","Notes & Assumptions","Inputs","Calculations","Outputs|Models","Outputs|Tables","Outputs|RIN"],"not_rendered":{"charts":0,"images":0,"macros":1,"external_links":0,"defined_names":140,"comments":0,"pivot_tables":0},"unopened":[],"bounds":{"document_bytes":16777216,"sheet_cells":100000,"rows_first":2000,"rows_last":500,"rows_between":2000,"halvings":0,"cell_chars":16384,"cell_head_chars":4096},"cells_cut":0,"cells_raw":0,"read":"whole","date_system":"1900"}

{"sheet":"Index","index":0,"n_rows":24,"n_cols":11,"rows_kept":24,"cut":false,"hidden":false,"merged":[]}
["Index and File Details"]
[]
[null,"Index",null,null,null,null,null,"File Details"]
[]
[null,"Inputs",null,"Calculations",null,"Outputs",null,null,"Model","Accelerated Syncons - Opex Forecast Model"]
[null,null,null,null,null,null,null,null,"Author","Transgrid"]
[null,"Notes & Assumptions",null,"Calculations",null,"Outputs|Models",null,null,"Revision","2026-04-10"]
[null,{"$f":"Inputs!A1","v":"Inputs"},null,null,null,"Outputs|Tables",null,null,"Status","Regulatory proposal"]
[null,null,null,null,null,"Outputs|RIN"]
[]
[]
[null,"Model Checks",null,null,null,null,null,"Instructions"]
[]
[null,"Worksheet",null,null,null,null,null,null,"Input Sheets"]
[null,{"$f":"B7","v":"Notes & Assumptions"},null,"N/A",null,null,null,null,"Fill in any cells marked as input cells as seen on the right =>",null,"user input"]
[null,{"$f":"B8","v":"Inputs"},null,"N/A",null,null,null,null,"Historical / Not applicable"]
[null,{"$f":"D7","v":"Calculations"},null,{"$f":"IF(SUM(Calculations!A2:A97)=0,0,1)","v":0},null,null,null,null,"Cells not marked as inputs should not be modified."]
[null,{"$f":"F7","v":"Outputs|Models"},null,{"$f":"IF(SUM('Outputs|Models'!A3:A23)=0,0,1)","v":0},null,null,null,null,"Confidential information",null,"user input"]
[null,{"$f":"F8","v":"Outputs|Tables"},null,{"$f":"IF(SUM('Outputs|Tables'!A3:A124)=0,0,1)","v":0}]
[null,{"$f":"F9","v":"Outputs|RIN"},null,{"$f":"IF(SUM('Outputs|RIN'!A3:A260)=0,0,1)","v":0}]
[]
[null,"Total Error Check",null,{"$f":"IF(SUM(D15:D18)=0,0,1)","v":0}]
[]
[null,"End"]

{"sheet":"Notes & Assumptions","index":1,"n_rows":11,"n_cols":5,"rows_kept":11,"cut":false,"hidden":false,"merged":[]}
["Assumptions & Notes"]
[]
[null,null,null,null,"User inputs in cells coloured like this"]
[null,null,"*",null,"1.     Inputs and calculations are in $. Some outputs are $million."]
[null,null,"*",null,"2.     Financial years are recorded in the Opex Forecast Model as tax years (e.g. 2017/18 is shown as 2018, 2018/19 is shown as 2019)"]
[null,null,"*",null,"3.     Escalation is treated as follows:"]
[null,null,null,null,"a.    CPI escalation and Commodity escalation are treated separately. "]
[]
[]
["Modifications"]
["Date","Version",null,"Who","Notes"]

{"sheet":"Inputs","index":2,"n_rows":132,"n_cols":30,"rows_kept":132,"cut":false,"hidden":false,"merged":[[6,1,6,3]]}
["Inputs"]
[]
[]
[null,"Output Reporting Format and Year"]
[]
[]
[null,"Output basis",null,null,null,null,"Input"]
[null,"Item","Source","Units"]
[null,"Dollar Basis","Transgrid","%",null,null,2026,{"$f":"\"Real $\"&Report_Year","v":"Real $2026"}]
[null,"Timing","Transgrid","%",null,null,"September",{"$f":"\"◄ Financial values in this document are presented in \"&Report_Month&\" years\"","v":"◄ Financial values in this document are presented in September years"}]
[]
[]
[null,"Indexation and escalation"]
[]
[]
[null,"Forecasts",null,null,null,null,null,null,null,null,null,null,null,"Rates"]
[null,"Item","Source","Units",null,null,null,null,null,null,null,null,null,{"$f":"O17-1","v":2025},2026,{"$f":"O17+1","v":2027},{"$f":"P17+1","v":2028},{"$f":"Q17+1","v":2029},{"$f":"R17+1","v":2030},{"$f":"S17+1","v":2031}]
[null,"Actual / Forecast Inflation ","ABS September to September / RBA Forecast","%",null,null,null,null,null,null,null,null,null,2.4017467248908186E-2,3.9803563181593393E-2,2.6499209007902591E-2,2.6499209007902591E-2,2.6499209007902591E-2,2.6499209007902591E-2,2.6499209007902591E-2,"◄ Forecast inflation from RBA for 2026 (as a geometric of the inflation forecast to June and December 2026). Forecast inflation for 2027 to 2031 as per Regulatory Proposal, updated for RBAs February 2026 MPS."]
[null,"Real labour escalation","Oxford Economics","%",null,null,null,null,null,null,null,null,null,null,null,7.6312109863876376E-3,9.5684171403631613E-3,1.181283722157267E-2,1.3128691912961177E-2,1.2655487486794792E-2]
[]
[]
[null,"Cumulative factors",null,null,null,null,"Labour escalation",null,null,null,null,null,null,"Cumulative Factors"]
[null,"Item","Source","Units",null,null,"Year",null,null,null,null,null,null,{"$f":"N$17","v":2025},2026,2027,2028,2029,2030,2031]
[null,{"$f":"\"Nominal (mid year) to Real \"&Report_Year&\" (end year)\"","v":"Nominal (mid year) to Real 2026 (end year)"},"Calculated","Factor",null,null,null,null,null,null,null,null,null,{"$f":"N25*(1+N18)^0.5","v":1.0362416572167232},1.0197075870962191,0.98700804022984456,0.96152830081941731,0.93670632415656818,0.91252513001143176,0.88896817650095872]
[null,{"$f":"\"Nominal (end year) to Real \"&Report_Year&\" (end year)\"","v":"Nominal (end year) to Real 2026 (end year)"},"Calculated","Factor",null,null,null,null,null,null,null,null,null,{"$f":"_xlfn.IFS(N$23=Report_Year,1,\n     N$23<Report_Year,PRODUCT(--1+_xlfn._xlws.FILTER($N$18:$T$18,($N$17:$T$17<Report_Year)*($N$17:$T$17>=N$23))),\n     N$23>Report_Year,1/PRODUCT(--1+_xlfn._xlws.FILTER($N$18:$T$18,($N$17:$T$17>Report_Year)*($N$17:$T$17<=N$23)))\n)","v":1.0240174672489082},{"$f":"_xlfn.IFS(O$23=Report_Year,1,\n     O$23<Report_Year,PRODUCT(--1+_xlfn._xlws.FILTER($N$18:$T$18,($N$17:$T$17<Report_Year)*($N$17:$T$17>=O$23))),\n     O$23>Report_Year,1/PRODUCT(--1+_xlfn._xlws.FILTER($N$18:$T$18,($N$17:$T$17>Report_Year)*($N$17:$T$17<=O$23)))\n)","v":1},{"$f":"_xlfn.IFS(P$23=Report_Year,1,\n     P$23<Report_Year,PRODUCT(--1+_xlfn._xlws.FILTER($N$18:$T$18,($N$17:$T$17<Report_Year)*($N$17:$T$17>=P$23))),\n     P$23>Report_Year,1/PRODUCT(--1+_xlfn._xlws.FILTER($N$18:$T$18,($N$17:$T$17>Report_Year)*($N$17:$T$17<=P$23)))\n)","v":0.97418487147835831},{"$f":"_xlfn.IFS(Q$23=Report_Year,1,\n     Q$23<Report_Year,PRODUCT(--1+_xlfn._xlws.FILTER($N$18:$T$18,($N$17:$T$17<Report_Year)*($N$17:$T$17>=Q$23))),\n     Q$23>Report_Year,1/PRODUCT(--1+_xlfn._xlws.FILTER($N$18:$T$18,($N$17:$T$17>Report_Year)*($N$17:$T$17<=Q$23)))\n)","v":0.94903616381730538},{"$f":"_xlfn.IFS(R$23=Report_Year,1,\n     R$23<Report_Year,PRODUCT(--1+_xlfn._xlws.FILTER($N$18:$T$18,($N$17:$T$17<Report_Year)*($N$17:$T$17>=R$23))),\n     R$23>Report_Year,1/PRODUCT(--1+_xlfn._xlws.FILTER($N$18:$T$18,($N$17:$T$17>Report_Year)*($N$17:$T$17<=R$23)))\n)","v":0.92453667327667577},{"$f":"_xlfn.IFS(S$23=Report_Year,1,\n     S$23<Report_Year,PRODUCT(--1+_xlfn._xlws.FILTER($N$18:$T$18,($N$17:$T$17<Report_Year)*($N$17:$T$17>=S$23))),\n     S$23>Report_Year,1/PRODUCT(--1+_xlfn._xlws.FILTER($N$18:$T$18,($N$17:$T$17>Report_Year)*($N$17:$T$17<=S$23)))\n)","v":0.90066964023306728},{"$f":"_xlfn.IFS(T$23=Report_Year,1,\n     T$23<Report_Year,PRODUCT(--1+_xlfn._xlws.FILTER($N$18:$T$18,($N$17:$T$17<Report_Year)*($N$17:$T$17>=T$23))),\n     T$23>Report_Year,1/PRODUCT(--1+_xlfn._xlws.FILTER($N$18:$T$18,($N$17:$T$17>Report_Year)*($N$17:$T$17<=T$23)))\n)","v":0.87741873771490975}]
[null,{"$f":"\"Labour escalation from \"&G26","v":"Labour escalation from 2027"},"Calculated","Factor",null,null,2027,{"$f":"\"◄ Labour rates apply for the year to \"&Report_Month&\" \"&G26&\", so labour escalation applies from \"&G26+1&\" onwards\"","v":"◄ Labour rates apply for the year to September 2027, so labour escalation applies from 2028 onwards"},null,null,null,null,null,1,1,{"$f":"IF(P$23>$G26,O26*(1+P19),1)","v":1},{"$f":"IF(Q$23>$G26,P26*(1+Q19),1)","v":1.0095684171403632},{"$f":"IF(R$23>$G26,Q26*(1+R19),1)","v":1.021494284516083},{"$f":"IF(S$23>$G26,R26*(1+S19),1)","v":1.0349051682683454},{"$f":"IF(T$23>$G26,S26*(1+T19),1)","v":1.0480023976753847}]
[]
[]
[null,"Contestable costs"]
[]
{"$rows_left_out":103}
{"sheet":"Calculations","index":3,"n_rows":97,"n_cols":10,"rows_kept":97,"cut":false,"hidden":false,"merged":[]}
["Calculations"]
[]
[null,"Contestable costs",null,null,null,null,null,null,null,"Total"]
[null,"Component","Dollar basis",null,{"$f":"Inputs!P$23","v":2027},{"$f":"Inputs!Q$23","v":2028},{"$f":"Inputs!R$23","v":2029},{"$f":"Inputs!S$23","v":2030},{"$f":"Inputs!T$23","v":2031}]
[null,"Contestable"]
[null,{"$f":"Inputs!B34","v":"c-i-c"},{"$f":"Inputs!$H$9","v":"Real $2026"},"Dollars","c-i-c","c-i-c","c-i-c","c-i-c","c-i-c","c-i-c"]
[null,{"$f":"Inputs!B35","v":"c-i-c"},{"$f":"Inputs!$H$9","v":"Real $2026"},"Dollars","c-i-c","c-i-c","c-i-c","c-i-c","c-i-c","c-i-c"]
[null,{"$f":"Inputs!B36","v":"c-i-c"},{"$f":"Inputs!$H$9","v":"Real $2026"},"Dollars","c-i-c","c-i-c","c-i-c","c-i-c","c-i-c","c-i-c"]
[null,{"$f":"Inputs!B37","v":"c-i-c"},{"$f":"Inputs!$H$9","v":"Real $2026"},"Dollars","c-i-c","c-i-c","c-i-c","c-i-c","c-i-c","c-i-c"]
[null,{"$f":"Inputs!B38","v":"c-i-c"},{"$f":"Inputs!$H$9","v":"Real $2026"},"Dollars","c-i-c","c-i-c","c-i-c","c-i-c","c-i-c","c-i-c"]
[]
[null,"Total contestable costs",{"$f":"Inputs!$H$9","v":"Real $2026"},"Dollars",0,2029989.6576743766,7110706.6963715162,6710706.5527107101,8564997.5530823395,24416400.459838942]
[]
[{"$f":"IF(SUM(E14:I14)=0,0,1)","v":0},"Check - Contestable costs",null,null,0,0,0,0,0]
[]
[null,{"$f":"Inputs!$B$41","v":"Maintenance expenditure"},null,null,null,null,null,null,null,"Total"]
[null,"Activity","Dollar basis","Units",{"$f":"Inputs!P$23","v":2027},{"$f":"Inputs!Q$23","v":2028},{"$f":"Inputs!R$23","v":2029},{"$f":"Inputs!S$23","v":2030},{"$f":"Inputs!T$23","v":2031}]
[]
[null,{"$f":"Inputs!B45","v":"Substation Maintenance"}]
[null,"Labour",{"$f":"Inputs!$H$9","v":"Real $2026"},"Dollars","c-i-c","c-i-c","c-i-c","c-i-c","c-i-c","c-i-c"]
[null,"Labour escalation",{"$f":"Inputs!$H$9","v":"Real $2026"},"Dollars","c-i-c","c-i-c","c-i-c","c-i-c","c-i-c","c-i-c"]
[null,"Materials",{"$f":"Inputs!$H$9","v":"Real $2026"},"Dollars","c-i-c","c-i-c","c-i-c","c-i-c","c-i-c","c-i-c"]
[null,"Sub-Total",{"$f":"Inputs!$H$9","v":"Real $2026"},"Dollars",0,1532958.4953806985,2670499.252920866,3482496.0336423367,3502994.9237926276,11188948.705736529]
[]
[null,"Labour",{"$f":"Inputs!$H$9","v":"Real $2026"},"Dollars","c-i-c","c-i-c","c-i-c","c-i-c","c-i-c","c-i-c"]
[null,"Labour escalation",{"$f":"Inputs!$H$9","v":"Real $2026"},"Dollars","c-i-c","c-i-c","c-i-c","c-i-c","c-i-c","c-i-c"]
[null,"Materials",{"$f":"Inputs!$H$9","v":"Real $2026"},"Dollars","c-i-c","c-i-c","c-i-c","c-i-c","c-i-c","c-i-c"]
[null,"Total maintenance costs",{"$f":"Inputs!$H$9","v":"Real $2026"},"Dollars",0,1532958.4953806985,2670499.252920866,3482496.0336423367,3502994.9237926276,11188948.705736529]
[]
[{"$f":"IF(SUM(E30:I30)=0,0,1)","v":0},"Check - Labour",null,null,0,0,0,0,0]
{"$rows_left_out":68}
{"sheet":"Outputs|Models","index":4,"n_rows":23,"n_cols":10,"rows_kept":23,"cut":false,"hidden":false,"merged":[]}
["Outputs|Models"]
[]
[null,"PTRM and Proposal"]
[]
[null,"Operating Costs",null,null,null,null,null,null,null,"Total"]
[null,"Component","Dollar basis","Units",{"$f":"Inputs!P$23","v":2027},{"$f":"Inputs!Q$23","v":2028},{"$f":"Inputs!R$23","v":2029},{"$f":"Inputs!S$23","v":2030},{"$f":"Inputs!T$23","v":2031},"Next period"]
[]
[null,"Costs"]
[null,"Contestable costs",{"$f":"Inputs!$H$9","v":"Real $2026"},"$Million",0,2.0299896576743768,7.1107066963715164,6.7107065527107101,8.564997553082339,{"$f":"SUM(E9:I9)","v":24.416400459838943}]
[null,"Maintenance costs (excl labour escalation)",{"$f":"Inputs!$H$9","v":"Real $2026"},"$Million",0,1.5196430066628388,2.6309575598039667,3.3996710255384013,3.3894766273483041,{"$f":"SUM(E10:I10)","v":10.939748219353511}]
[null,"Operating costs (excl labour escalation)",{"$f":"Inputs!$H$9","v":"Real $2026"},"$Million",0.49172127515600855,3.0431977228694671,4.588210767285549,5.5777326310273896,5.1720757962769257,{"$f":"SUM(E11:I11)","v":18.87293819261534}]
[null,"Insurance costs",{"$f":"Inputs!$H$9","v":"Real $2026"},"$Million",0,0.23204447397260278,0.77688489886027412,0.89100967032255063,0.86196233000000011,{"$f":"SUM(E12:I12)","v":2.7619013731554274}]
[null,"Real input cost escalation",{"$f":"Inputs!$H$9","v":"Real $2026"},"$Million",0,4.224270562807074E-2,0.13773211507836877,0.27825136510134757,0.36068628047790641,{"$f":"SUM(E13:I13)","v":0.81891246628569347}]
[]
[null,"Total (excluding debt raising costs and IP fees)",{"$f":"Inputs!$H$9","v":"Real $2026"},"$Million",{"$f":"SUM(E9:E13)","v":0.49172127515600855},{"$f":"SUM(F9:F13)","v":6.8671175668073552},{"$f":"SUM(G9:G13)","v":15.244492037399674},{"$f":"SUM(H9:H13)","v":16.857371244700399},{"$f":"SUM(I9:I13)","v":18.349198587185477},{"$f":"SUM(E15:I15)","v":57.809900711248908}]
[]
[null,"Debt Raising Costs",{"$f":"Inputs!$H$9","v":"Real $2026"},"$Million",0.15748572463445881,0.38779472481527294,0.55713548779356048,0.58023660376832042,0.56273049008255005,2.2453830310941627]
[]
[null,"Total (including debt raising costs and IP fees)",{"$f":"Inputs!$H$9","v":"Real $2026"},"$Million",{"$f":"E15+E17","v":0.64920699979046737},{"$f":"F15+F17","v":7.2549122916226283},{"$f":"G15+G17","v":15.801627525193235},{"$f":"H15+H17","v":17.437607848468719},{"$f":"I15+I17","v":18.911929077268027},{"$f":"SUM(E19:I19)","v":60.055283742343079}]
[]
[{"$f":"IF(SUM(E21:I21)=0,0,1)","v":0},"Check - Calculations",null,null,{"$f":"IF(ROUND(E15-Calculations!E89/10^6,3)=0,0,1)","v":0},{"$f":"IF(ROUND(F15-Calculations!F89/10^6,3)=0,0,1)","v":0},{"$f":"IF(ROUND(G15-Calculations!G89/10^6,3)=0,0,1)","v":0},{"$f":"IF(ROUND(H15-Calculations!H89/10^6,3)=0,0,1)","v":0},{"$f":"IF(ROUND(I15-Calculations!I89/10^6,3)=0,0,1)","v":0}]
[]
[null,"End"]

{"sheet":"Outputs|Tables","index":5,"n_rows":124,"n_cols":12,"rows_kept":124,"cut":false,"hidden":false,"merged":[]}
["Outputs|Tables"]
[]
["Table 2‑1 - Incremental forecast opex for Syncons over the 2026-31 regulatory period ($M, real 2026)"]
[]
[null,"Component",null,"Dollar basis","Units","Pre-period",{"$f":"Inputs!P$17","v":2027},{"$f":"Inputs!Q$17","v":2028},{"$f":"Inputs!R$17","v":2029},{"$f":"Inputs!S$17","v":2030},{"$f":"Inputs!T$17","v":2031},"Total"]
[]
[null,"Contestable costs",null,{"$f":"Inputs!$H$9","v":"Real $2026"},"$Million",null,{"$f":"'Outputs|Models'!E9","v":0},{"$f":"'Outputs|Models'!F9","v":2.0299896576743768},{"$f":"'Outputs|Models'!G9","v":7.1107066963715164},{"$f":"'Outputs|Models'!H9","v":6.7107065527107101},{"$f":"'Outputs|Models'!I9","v":8.564997553082339},{"$f":"SUM(G7:K7)","v":24.416400459838943}]
[null,"Maintenance costs (excluding labour escalation)",null,{"$f":"Inputs!$H$9","v":"Real $2026"},"$Million",null,{"$f":"'Outputs|Models'!E10","v":0},{"$f":"'Outputs|Models'!F10","v":1.5196430066628388},{"$f":"'Outputs|Models'!G10","v":2.6309575598039667},{"$f":"'Outputs|Models'!H10","v":3.3996710255384013},{"$f":"'Outputs|Models'!I10","v":3.3894766273483041},{"$f":"SUM(G8:K8)","v":10.939748219353511}]
[null,"Operating costs (excluding labour escalation)",null,{"$f":"Inputs!$H$9","v":"Real $2026"},"$Million",null,{"$f":"'Outputs|Models'!E11","v":0.49172127515600855},{"$f":"'Outputs|Models'!F11","v":3.0431977228694671},{"$f":"'Outputs|Models'!G11","v":4.588210767285549},{"$f":"'Outputs|Models'!H11","v":5.5777326310273896},{"$f":"'Outputs|Models'!I11","v":5.1720757962769257},{"$f":"SUM(G9:K9)","v":18.87293819261534}]
[null,"Insurance costs (excluding labour escalation",null,{"$f":"Inputs!$H$9","v":"Real $2026"},"$Million",null,{"$f":"'Outputs|Models'!E12","v":0},{"$f":"'Outputs|Models'!F12","v":0.23204447397260278},{"$f":"'Outputs|Models'!G12","v":0.77688489886027412},{"$f":"'Outputs|Models'!H12","v":0.89100967032255063},{"$f":"'Outputs|Models'!I12","v":0.86196233000000011},{"$f":"SUM(G10:K10)","v":2.7619013731554274}]
[null,"Real labour cost escalation",null,{"$f":"Inputs!$H$9","v":"Real $2026"},"$Million",null,{"$f":"'Outputs|Models'!E13","v":0},{"$f":"'Outputs|Models'!F13","v":4.224270562807074E-2},{"$f":"'Outputs|Models'!G13","v":0.13773211507836877},{"$f":"'Outputs|Models'!H13","v":0.27825136510134757},{"$f":"'Outputs|Models'!I13","v":0.36068628047790641},{"$f":"SUM(G11:K11)","v":0.81891246628569347}]
[null,"Total operating costs excluding debt raising costs",null,{"$f":"Inputs!$H$9","v":"Real $2026"},"$Million",{"$f":"SUM(F7:F11)","v":0},{"$f":"SUM(G7:G11)","v":0.49172127515600855},6.8671175668073552,15.244492037399674,16.857371244700399,18.349198587185477,57.809900711248915]
[]
[null,"Debt raising costs",null,{"$f":"Inputs!$H$9","v":"Real $2026"},"$Million",null,{"$f":"'Outputs|Models'!E17","v":0.15748572463445881},{"$f":"'Outputs|Models'!F17","v":0.38779472481527294},{"$f":"'Outputs|Models'!G17","v":0.55713548779356048},{"$f":"'Outputs|Models'!H17","v":0.58023660376832042},{"$f":"'Outputs|Models'!I17","v":0.56273049008255005},{"$f":"SUM(F14:K14)","v":2.2453830310941627}]
[null,"Total operating costs including debt raising costs",null,{"$f":"Inputs!$H$9","v":"Real $2026"},"$Million",{"$f":"F12+F14","v":0},0.64920699979046737,7.2549122916226283,15.801627525193235,17.437607848468719,18.911929077268027,{"$f":"SUM(F15:K15)","v":60.055283742343079}]
[]
[{"$f":"IF(SUM(E17:I17)=0,0,1)","v":0},"Check - Total opex",null,null,null,"NA",{"$f":"IF(ROUND(Calculations!E93/10^6-G15,6)=0,0,1)","v":0},{"$f":"IF(ROUND(Calculations!F93/10^6-H15,6)=0,0,1)","v":0},{"$f":"IF(ROUND(Calculations!G93/10^6-I15,6)=0,0,1)","v":0},{"$f":"IF(ROUND(Calculations!H93/10^6-J15,6)=0,0,1)","v":0},{"$f":"IF(ROUND(Calculations!I93/10^6-K15,6)=0,0,1)","v":0}]
[]
[]
["Table 2‑2 - Forecast incremental opex for the Project by category ($M, real 2026)"]
[]
[null,"Component",null,"Dollar basis","Units","Value"]
[]
[null,"Contestable costs",null,{"$f":"Inputs!$H$9","v":"Real $2026"},"$Million",{"$f":"L7","v":24.416400459838943}]
[null,"Maintenance costs (excluding labour escalation)",null,{"$f":"Inputs!$H$9","v":"Real $2026"},"$Million",{"$f":"L8","v":10.939748219353511}]
[null,"Operating costs (excluding labour escalation)",null,{"$f":"Inputs!$H$9","v":"Real $2026"},"$Million",{"$f":"L9","v":18.87293819261534}]
[null,"Insurance costs (excluding labour escalation",null,{"$f":"Inputs!$H$9","v":"Real $2026"},"$Million",{"$f":"L10","v":2.7619013731554274}]
[null,"Real labour cost escalation",null,{"$f":"Inputs!$H$9","v":"Real $2026"},"$Million",{"$f":"L11","v":0.81891246628569347}]
[null,"Total operating costs excluding debt raising costs",null,{"$f":"Inputs!$H$9","v":"Real $2026"},"$Million",{"$f":"SUM(F24:F28)","v":57.809900711248915}]
[]
{"$rows_left_out":95}
{"sheet":"Outputs|RIN","index":6,"n_rows":260,"n_cols":28,"rows_kept":260,"cut":false,"hidden":false,"merged":[]}
["Outputs|RIN"]
[]
["Table 6.1 - Operating and maintenance costs by category - contestable (nominal $)"]
[]
[null,"As Incurred",null,"Dollar basis","Units",{"$f":"G5-1","v":2022},{"$f":"H5-1","v":2023},{"$f":"I5-1","v":2024},{"$f":"J5-1","v":2025},{"$f":"Inputs!O$17","v":2026},{"$f":"Inputs!P$17","v":2027},{"$f":"Inputs!Q$17","v":2028},{"$f":"Inputs!R$17","v":2029},{"$f":"Inputs!S$17","v":2030},{"$f":"Inputs!T$17","v":2031},"Total"]
[null,"Category"]
[null,"Contestable costs",null,"Nominal","$Million",null,null,null,null,null,{"$f":"K20/Inputs!P$24","v":0},{"$f":"L20/Inputs!Q$24","v":2.1112115534658868},{"$f":"M20/Inputs!R$24","v":7.5911804084104579},{"$f":"N20/Inputs!S$24","v":7.3539964347356008},{"$f":"O20/Inputs!T$24","v":9.6347628402118648},{"$f":"SUM(F7:O7)","v":26.691151236823806},"◄ Values converted to nominal mid-year dollars"]
[null,"Maintenance costs",null,"Nominal","$Million",null,null,null,null,null,{"$f":"K21/Inputs!P$24","v":0},{"$f":"L21/Inputs!Q$24","v":0},{"$f":"M21/Inputs!R$24","v":0},{"$f":"N21/Inputs!S$24","v":0},{"$f":"O21/Inputs!T$24","v":0},{"$f":"SUM(F8:O8)","v":0}]
[null,"Operating costs",null,"Nominal","$Million",null,null,null,null,null,{"$f":"K22/Inputs!P$24","v":0},{"$f":"L22/Inputs!Q$24","v":0},{"$f":"M22/Inputs!R$24","v":0},{"$f":"N22/Inputs!S$24","v":0},{"$f":"O22/Inputs!T$24","v":0},0]
[null,"Insurance costs",null,"Nominal","$Million",null,null,null,null,null,{"$f":"K23/Inputs!P$24","v":0},{"$f":"L23/Inputs!Q$24","v":0},{"$f":"M23/Inputs!R$24","v":0},{"$f":"N23/Inputs!S$24","v":0},{"$f":"O23/Inputs!T$24","v":0},0]
[null,"[Transgrid to specify]",null,"Nominal","$Million",null,null,null,null,null,{"$f":"K24/Inputs!P$24","v":0},{"$f":"L24/Inputs!Q$24","v":0},{"$f":"M24/Inputs!R$24","v":0},{"$f":"N24/Inputs!S$24","v":0},{"$f":"O24/Inputs!T$24","v":0},0]
[null,"Debt raising costs",null,"Nominal","$Million",null,null,null,null,null,{"$f":"K25/Inputs!P$24","v":0},{"$f":"L25/Inputs!Q$24","v":0},{"$f":"M25/Inputs!R$24","v":0},{"$f":"N25/Inputs!S$24","v":0},{"$f":"O25/Inputs!T$24","v":0},0]
[null,"Total operating costs",null,"Nominal","$Million",{"$f":"SUM(F7:F12)","v":0},{"$f":"SUM(G7:G12)","v":0},{"$f":"SUM(H7:H12)","v":0},{"$f":"SUM(I7:I12)","v":0},{"$f":"SUM(J7:J12)","v":0},{"$f":"SUM(K7:K12)","v":0},2.1112115534658868,7.5911804084104579,7.3539964347356008,9.6347628402118648,26.691151236823806]
[]
[]
["Table 6.2 - Operating and maintenance costs by category - contestable (real $m, September 2026)"]
[]
[null,"As Incurred",null,"Dollar basis","Units",{"$f":"G18-1","v":2022},{"$f":"H18-1","v":2023},{"$f":"I18-1","v":2024},{"$f":"J18-1","v":2025},{"$f":"Inputs!O$17","v":2026},{"$f":"Inputs!P$17","v":2027},{"$f":"Inputs!Q$17","v":2028},{"$f":"Inputs!R$17","v":2029},{"$f":"Inputs!S$17","v":2030},{"$f":"Inputs!T$17","v":2031},"Total"]
[null,"Category"]
[null,"Contestable costs",null,{"$f":"Inputs!$H$9","v":"Real $2026"},"$Million",null,null,null,null,null,{"$f":"Calculations!E12/10^6","v":0},{"$f":"Calculations!F12/10^6","v":2.0299896576743768},{"$f":"Calculations!G12/10^6","v":7.1107066963715164},{"$f":"Calculations!H12/10^6","v":6.7107065527107101},{"$f":"Calculations!I12/10^6","v":8.564997553082339},{"$f":"SUM(F20:O20)","v":24.416400459838943},"◄ Includes 100% of contestable costs"]
[null,"Maintenance costs",null,{"$f":"Inputs!$H$9","v":"Real $2026"},"$Million",null,null,null,null,null,null,null,null,null,null,0]
[null,"Operating costs",null,{"$f":"Inputs!$H$9","v":"Real $2026"},"$Million",null,null,null,null,null,null,null,null,null,null,0]
[null,"Insurance costs",null,{"$f":"Inputs!$H$9","v":"Real $2026"},"$Million",null,null,null,null,null,null,null,null,null,null,0]
[null,"[Transgrid to specify]",null,{"$f":"Inputs!$H$9","v":"Real $2026"},"$Million",null,null,null,null,null,null,null,null,null,null,0]
[null,"Debt raising costs",null,{"$f":"Inputs!$H$9","v":"Real $2026"},"$Million",null,null,null,null,null,null,null,null,null,null,0]
[null,"Total operating costs",null,{"$f":"Inputs!$H$9","v":"Real $2026"},"$Million",{"$f":"SUM(F20:F25)","v":0},{"$f":"SUM(G20:G25)","v":0},{"$f":"SUM(H20:H25)","v":0},{"$f":"SUM(I20:I25)","v":0},{"$f":"SUM(J20:J25)","v":0},{"$f":"SUM(K20:K25)","v":0},2.0299896576743768,7.1107066963715164,6.7107065527107101,8.564997553082339,24.416400459838943]
[]
[]
["Table 6.3 - Operating and maintenance direct and indirect costs - contestable (nominal $)"]
[]
{"$rows_left_out":230}