{"text_format":"1","workbook":"xlsx","n_sheets":8,"sheets":["Index","Notes & Assumptions","Inputs","Calculations","Outputs|Models","Outputs|Tables","Outputs|Initiative","Outputs|DGA"],"not_rendered":{"charts":0,"images":0,"macros":1,"external_links":0,"defined_names":146,"comments":0,"pivot_tables":0},"unopened":[],"bounds":{"document_bytes":16777216,"sheet_cells":100000,"rows_first":2000,"rows_last":500,"rows_between":2000,"halvings":0,"cell_chars":16384,"cell_head_chars":4096},"cells_cut":0,"cells_raw":0,"read":"whole","date_system":"1900"}

{"sheet":"Index","index":0,"n_rows":25,"n_cols":11,"rows_kept":25,"cut":false,"hidden":false,"merged":[]}
["Index and File Details"]
[]
[null,"Index",null,null,null,null,null,"File Details"]
[]
[null,"Inputs",null,"Inputs / Calculations",null,"Outputs",null,null,"Model","Transgrid | System Operability - Capex Forecast Model"]
[null,null,null,null,null,null,null,null,"Author","Transgrid"]
[null,"Notes & Assumptions",null,"Calculations",null,{"$f":"'Outputs|Models'!$A$1","v":"Outputs | Models"},null,null,"Revision","2025-12-15"]
[null,"Inputs",null,null,null,{"$f":"'Outputs|Tables'!$A$1","v":"Outputs | Tables"},null,null,"Status","Regulatory proposal"]
[null,null,null,null,null,"Outputs | Initiative"]
[null,null,null,null,null,"Outputs | DGA"]
[]
[null,"Model Checks",null,null,null,null,null,"Instructions"]
[]
[null,"Worksheet",null,null,null,null,null,null,"Input Sheets"]
[null,{"$f":"B8","v":"Inputs"},null,{"$f":"Inputs!C2","v":0},null,null,null,null,"Fill in any cells marked as input cells as seen on the right =>",null,"user input"]
{"$rows_left_out":11}
{"sheet":"Notes & Assumptions","index":1,"n_rows":10,"n_cols":5,"rows_kept":10,"cut":false,"hidden":false,"merged":[]}
["Assumptions & Notes"]
[]
[null,null,null,null,"User inputs in cells coloured like this"]
[null,null,"*",null,"1.     Financial years are recorded in the Capex Forecast Model as tax years (e.g. 2017/18 is shown as 2018, 2018/19 is shown as 2019)"]
[null,null,"*",null,"2.     Escalation is treated as follows:"]
[null,null,null,null,"a.    CPI escalation and Labour escalation are treated separately. "]
[]
[]
["Modifications"]
["Date","Version",null,"Who","Notes"]

{"sheet":"Inputs","index":2,"n_rows":282,"n_cols":64,"rows_kept":282,"cut":false,"hidden":false,"merged":[[195,0,195,2],[160,0,160,2],[123,4,123,5],[123,0,123,2],[160,4,160,5],[13,0,13,2],[8,0,8,2],[24,0,24,2]]}
[" "]
["Section Check",null,{"$f":"IF(SUM(V109,X120:AI120,W151,W187,H109)=0,0,1)","v":0}]
[]
["Output Reporting Format and Year"]
["Real",2023,{"$f":" IF(Real_or_Nom=\"Real\", \"Real $\" & Report_Year, \"$ Nominal\")","v":"Real $2023"}]
[]
["Inflation and Labour Escalation"]
[]
["Forecasts",null,null,null,null,null,null,null,null,null,"Rates"]
["Item","Source","Units",null,null,null,null,null,null,null,{"$f":"K15","v":2023},2024,2025,2026,2027,2028,2029,2030,2031,2032,2033]
["Actual / Forecast Inflation ","ABS June to June / RBA Forecast","%",null,null,null,null,null,null,null,6.0269627279936566E-2,3.8145100972326373E-2,2.0893371757924939E-2,2.9193048507912156E-2,2.9193048507912156E-2,2.9193048507912156E-2,2.9193048507912156E-2,2.9193048507912156E-2,2.9193048507912156E-2,2.9193048507912156E-2,2.9193048507912156E-2,"◄ Note: Actual June year on year inflation used for 2023 to 2025. Estimated inflation for 2026 to 2027 as per RBAs August 2025 MPS. Forecast inflation from current AER PTRM."]
["Real labour escalation","AER Final Determination / Transgrid proposal","%",null,null,null,null,null,null,null,null,3.9046564755527329E-3,1.3076482545953276E-2,1.1546438954636147E-2,4.3304575862308627E-3,3.00941333753012E-3,7.1734897799806269E-3,7.1734897799806269E-3,7.1734897799806269E-3,7.1734897799806269E-3,7.1734897799806269E-3,"◄ Note: Based on Final Decision values applied to both the opex and capex models with placeholder values for 2028-29 to 2032-33"]
[]
["Cumulative Factors",null,null,null,null,null,null,null,null,null,"Cumulative factors"]
["Item","Source","Units",null,null,null,null,null,null,null,2023,{"$f":"K15+1","v":2024},2025,2026,2027,2028,2029,2030,2031,2032,2033,"Nominal"]
{"$rows_left_out":268}
{"sheet":"Calculations","index":3,"n_rows":238,"n_cols":21,"rows_kept":238,"cut":false,"hidden":false,"merged":[]}
["Calculations",null,{"$f":"Inputs!$C$5","v":"Real $2023"}]
[]
[null,"Incremental Capital Expenditure (Excluding Equity Raising Costs) by Capex Category",null,null,null,null,null,null,null,null,null,null,null,null,null,"Total",null,"Mapping","Mapping"]
[null,"Capex category","Dollar basis","Units",{"$f":"Inputs!K$15","v":2023},{"$f":"Inputs!L$15","v":2024},{"$f":"Inputs!M$15","v":2025},{"$f":"Inputs!N$15","v":2026},{"$f":"Inputs!O$15","v":2027},{"$f":"Inputs!P$15","v":2028},{"$f":"Inputs!Q$15","v":2029},{"$f":"Inputs!R$15","v":2030},{"$f":"Inputs!S$15","v":2031},{"$f":"Inputs!T$15","v":2032},{"$f":"Inputs!U$15","v":2033},null,null,"RAB Asset Class","RIN Network and Non network"]
[]
[null,"Direct Non-Labour Costs"]
[null,{"$f":"Inputs!$A$204","v":"Communications (short life) - SCADA, network control and protection systems"},{"$f":"Inputs!$C$5","v":"Real $2023"},"$Million",{"$f":"Inputs!X112","v":0},{"$f":"Inputs!Y112","v":0},{"$f":"Inputs!Z112","v":0},{"$f":"Inputs!AA112","v":0},{"$f":"Inputs!AB112","v":0.66942447000299887},{"$f":"Inputs!AC112","v":9.4994988695702158},{"$f":"Inputs!AD112","v":14.435721563509876},{"$f":"Inputs!AE112","v":27.671462014609613},{"$f":"Inputs!AF112","v":7.7785721832247239},{"$f":"Inputs!AG112","v":0},{"$f":"Inputs!AH112","v":0},{"$f":"SUM(E7:O7)","v":60.054679100917426},null,{"$f":"Inputs!B204","v":"Communications (short life)"},{"$f":"Inputs!C204","v":"SCADA, network control and protection systems"}]
[null,{"$f":"Inputs!$A$205","v":"Communications (short life) - Other"},{"$f":"Inputs!$C$5","v":"Real $2023"},"$Million",{"$f":"Inputs!X113","v":0},{"$f":"Inputs!Y113","v":0},{"$f":"Inputs!Z113","v":0},{"$f":"Inputs!AA113","v":0},{"$f":"Inputs!AB113","v":2.1242982478050987},{"$f":"Inputs!AC113","v":1.8680643583567709},{"$f":"Inputs!AD113","v":1.8545633696901052},{"$f":"Inputs!AE113","v":1.8545633696901052},{"$f":"Inputs!AF113","v":1.5454694747417541},{"$f":"Inputs!AG113","v":0},{"$f":"Inputs!AH113","v":0},9.2469588202838331,null,{"$f":"Inputs!B205","v":"Communications (short life)"},{"$f":"Inputs!C205","v":"Other"}]
[null,{"$f":"Inputs!$A$206","v":"Business IT - SCADA, network control and protection systems"},{"$f":"Inputs!$C$5","v":"Real $2023"},"$Million",{"$f":"Inputs!X114","v":0},{"$f":"Inputs!Y114","v":0},{"$f":"Inputs!Z114","v":0},{"$f":"Inputs!AA114","v":0},{"$f":"Inputs!AB114","v":2.7244795342272399},{"$f":"Inputs!AC114","v":7.314457618560338},{"$f":"Inputs!AD114","v":0},{"$f":"Inputs!AE114","v":0},{"$f":"Inputs!AF114","v":0},{"$f":"Inputs!AG114","v":0},{"$f":"Inputs!AH114","v":0},10.038937152787579,null,{"$f":"Inputs!B206","v":"Business IT"},{"$f":"Inputs!C206","v":"SCADA, network control and protection systems"}]
[null,{"$f":"Inputs!$A$207","v":"Business IT - Other"},{"$f":"Inputs!$C$5","v":"Real $2023"},"$Million",{"$f":"Inputs!X115","v":0},{"$f":"Inputs!Y115","v":0},{"$f":"Inputs!Z115","v":0},{"$f":"Inputs!AA115","v":0},{"$f":"Inputs!AB115","v":4.6927726006797164},{"$f":"Inputs!AC115","v":18.09145803729071},{"$f":"Inputs!AD115","v":9.964307142751343},{"$f":"Inputs!AE115","v":2.1582631489806436},{"$f":"Inputs!AF115","v":1.012267044286975},{"$f":"Inputs!AG115","v":0},{"$f":"Inputs!AH115","v":0},35.919067973989385,null,{"$f":"Inputs!B207","v":"Business IT"},{"$f":"Inputs!C207","v":"Other"}]
[null,{"$f":"Inputs!$A$208","v":"Minor Plant, Motor Vehicles & Mobile Plant - Other"},{"$f":"Inputs!$C$5","v":"Real $2023"},"$Million",{"$f":"Inputs!X116","v":0},{"$f":"Inputs!Y116","v":0},{"$f":"Inputs!Z116","v":0},{"$f":"Inputs!AA116","v":0},{"$f":"Inputs!AB116","v":4.0464851340174084},{"$f":"Inputs!AC116","v":0.59609538232985049},{"$f":"Inputs!AD116","v":0.14918540749672499},{"$f":"Inputs!AE116","v":0.14918540749672499},{"$f":"Inputs!AF116","v":0.6338342286655253},{"$f":"Inputs!AG116","v":0},{"$f":"Inputs!AH116","v":0},5.5747855600062346,null,{"$f":"Inputs!B208","v":"Minor Plant, Motor Vehicles & Mobile Plant"},{"$f":"Inputs!C208","v":"Other"}]
[null,{"$f":"Inputs!$A$209","v":"[Spare 1] - [Spare 2]"},{"$f":"Inputs!$C$5","v":"Real $2023"},"$Million",{"$f":"Inputs!X117","v":0},{"$f":"Inputs!Y117","v":0},{"$f":"Inputs!Z117","v":0},{"$f":"Inputs!AA117","v":0},{"$f":"Inputs!AB117","v":0},{"$f":"Inputs!AC117","v":0},{"$f":"Inputs!AD117","v":0},{"$f":"Inputs!AE117","v":0},{"$f":"Inputs!AF117","v":0},{"$f":"Inputs!AG117","v":0},{"$f":"Inputs!AH117","v":0},0,null,{"$f":"Inputs!B209","v":"[Spare 1]"},{"$f":"Inputs!C209","v":"[Spare 2]"}]
[null,"Sub-Total",{"$f":"Inputs!$C$5","v":"Real $2023"},"$Million",{"$f":"SUM(E7:E12)","v":0},{"$f":"SUM(F7:F12)","v":0},{"$f":"SUM(G7:G12)","v":0},{"$f":"SUM(H7:H12)","v":0},{"$f":"SUM(I7:I12)","v":14.257459986732464},37.36957426610789,26.403777483448046,31.833473940777086,10.97014293091898,0,0,{"$f":"SUM(P7:P12)","v":120.83442860798446}]
[]
[null,"Labour Costs",null,null,null,null,null,null,null,null,null,null,null,null,null,null,null,null,null,null,"← This value is pro-rated over the escalated capital forecast by year and asset class"]
{"$rows_left_out":224}
{"sheet":"Outputs|Models","index":4,"n_rows":53,"n_cols":17,"rows_kept":53,"cut":false,"hidden":false,"merged":[]}
["Outputs | Models"]
[]
["Outputs | PTRM"]
[]
[null,"As Incurred",null,"Dollar basis","Units",{"$f":"Inputs!K$15","v":2023},{"$f":"Inputs!L$15","v":2024},{"$f":"Inputs!M$15","v":2025},{"$f":"Inputs!N$15","v":2026},{"$f":"Inputs!O$15","v":2027},{"$f":"Inputs!P$15","v":2028},{"$f":"Inputs!Q$15","v":2029},{"$f":"Inputs!R$15","v":2030},{"$f":"Inputs!S$15","v":2031},{"$f":"Inputs!T$15","v":2032},{"$f":"Inputs!U$15","v":2033},"Total"]
[null,"Capex"]
[null,{"$f":"Inputs!$A$217","v":"Communications (short life)"},null,{"$f":"Inputs!$C$5","v":"Real $2023"},"$Million",null,{"$f":"G39","v":2.1119244806749511},2.2109702341356088,0.61333042123005976,3.7715289763808388,14.188968129235123,null,null,null,null,null,{"$f":"SUM(G7:P7)","v":22.896722241656583}]
[null,{"$f":"Inputs!$A$219","v":"Business IT"},null,{"$f":"Inputs!$C$5","v":"Real $2023"},"$Million",null,1.4005417335241932,1.4662248166643945,0.40673559080017152,10.013299163015146,31.711609630575573,null,null,null,null,null,{"$f":"SUM(G8:P8)","v":44.998410934579482}]
[null,{"$f":"Inputs!$A$220","v":"Minor Plant, Motor Vehicles & Mobile Plant"},null,{"$f":"Inputs!$C$5","v":"Real $2023"},"$Million",null,0.16988813615166432,0.17785560781229431,4.9337731089034713E-2,5.4627597213422785,0.74404498240076111,null,null,null,null,null,{"$f":"SUM(G9:P9)","v":6.6038861787960332}]
[null,{"$f":"$B$42","v":"Equity Raising Costs"},null,{"$f":"Inputs!$C$5","v":"Real $2023"},"$Million",null,0.80061603253192715,0,0,0,0,null,null,null,null,null,{"$f":"SUM(G10:P10)","v":0.80061603253192715}]
[null,"Total As Incurred",null,{"$f":"Inputs!$C$5","v":"Real $2023"},"$Million",{"$f":"SUM(F7:F10)","v":0},{"$f":"SUM(G7:G10)","v":4.4829703828827361},3.8550506586122979,1.069403743119266,19.247587860738264,46.644622742211453,0,null,null,null,0,{"$f":"SUM(G11:P11)","v":75.299635387564024}]
[]
[{"$f":"IF(SUM(F13:P13)=0,0,1)","v":0},"Check - As incurred",null,null,null,{"$f":"IF(ROUND(F11-F$43,3)=0,0,1)","v":0},0,0,0,0,0]
[]
[null,"As Commissioned",null,"Dollar basis","Units",{"$f":"Inputs!K$15","v":2023},{"$f":"Inputs!L$15","v":2024},{"$f":"Inputs!M$15","v":2025},{"$f":"Inputs!N$15","v":2026},{"$f":"Inputs!O$15","v":2027},{"$f":"Inputs!P$15","v":2028},{"$f":"Inputs!Q$15","v":2029},{"$f":"Inputs!R$15","v":2030},{"$f":"Inputs!S$15","v":2031},{"$f":"Inputs!T$15","v":2032},{"$f":"Inputs!U$15","v":2033},"Total"]
{"$rows_left_out":39}
{"sheet":"Outputs|Tables","index":5,"n_rows":76,"n_cols":16,"rows_kept":76,"cut":false,"hidden":false,"merged":[]}
["Outputs | Tables",null,null,{"$f":"Inputs!C5","v":"Real $2023"}]
[]
["Contingent Project Application: Table x-x: Total forecast capex ($M, Real 2022-23)"]
[]
[null,null,null,null,null,"Current Regulatory Period (2023-28)",null,null,null,null,"Next Regulatory Period (2028-33)",null,null,null,null," "]
[null,"Capex nature",null,"Dollar basis","Units",{"$f":"Inputs!L$15","v":2024},{"$f":"Inputs!M$15","v":2025},{"$f":"Inputs!N$15","v":2026},{"$f":"Inputs!O$15","v":2027},{"$f":"Inputs!P$15","v":2028},{"$f":"Inputs!Q$15","v":2029},{"$f":"Inputs!R$15","v":2030},{"$f":"Inputs!S$15","v":2031},{"$f":"Inputs!T$15","v":2032},{"$f":"Inputs!U$15","v":2033},"Total"]
[null,"Direct Costs",null,{"$f":"Inputs!$C$5","v":"Real $2023"},"$Million",{"$f":"SUM(F8:F20)","v":0},0,0,14.257459986732462,37.369574266107882,26.403777483448049,31.833473940777086,10.970142930918977,0,0,{"$f":"SUM(F7:O7)","v":120.83442860798446}]
[null,"Outage management",null,{"$f":"Inputs!$C$5","v":"Real $2023"},"$Million",0,0,0,0,0,0,0,0,0,0,{"$f":"SUM(F8:O8)","v":0}]
[null,"Alarm management, visualisation and situation awareness enhancement",null,{"$f":"Inputs!$C$5","v":"Real $2023"},"$Million",0,0,0,0.30878575897880939,4.4865970692841737,7.8912703212837023,9.4252330505826905,1.9586574297224182,0,0,{"$f":"SUM(F9:O9)","v":24.070543629851795}]
[null,"Fault level and system parameter monitoring and power system analysis capability",null,{"$f":"Inputs!$C$5","v":"Real $2023"},"$Million",0,0,0,0,0,0.40597801745177609,5.1509886192807564,0,0,0,5.5569666367325325]
[null,"SCADA/AEMS system",null,{"$f":"Inputs!$C$5","v":"Real $2023"},"$Million",0,0,0,3.100843956848701,11.673573574045156,4.3276645322902763,4.3276645322902754,3.6063871102418958,0,0,27.036133705716306]
[null,"Facilities",null,{"$f":"Inputs!$C$5","v":"Real $2023"},"$Million",0,0,0,3.8756016231474941,0.4458239237826393,0,0,0.50951305575158778,0,0,4.8309386026817212]
[null,"Data management and network modelling system",null,{"$f":"Inputs!$C$5","v":"Real $2023"},"$Million",0,0,0,0.65102652581786635,12.479826825693012,7.1612917839965293,0,0,0,0,20.292145135507408]
[null,"Training technologies, operational document management system and operational planning systems",null,{"$f":"Inputs!$C$5","v":"Real $2023"},"$Million",0,0,0,2.6346262635208824,4.4757279732469355,3.3991035980945652,0,0,0,0,10.509457834862383]
[null,"Operational forecasts and look-ahead contingency assessment",null,{"$f":"Inputs!$C$5","v":"Real $2023"},"$Million",0,0,0,0,0,0,2.4017578399788286,0.55972334333098084,0,0,2.9614811833098096]
{"$rows_left_out":62}
{"sheet":"Outputs|Initiative","index":6,"n_rows":123,"n_cols":65,"rows_kept":123,"cut":false,"hidden":false,"merged":[]}
["Outputs | Initiatives",null,null,{"$f":"Inputs!C5","v":"Real $2023"}]
[]
["Contingent Project Application: Table 4-1: Overview of forecast capex"]
[null,"Note: The presentation of direct, labour and indirect costs will not align with the values in Output|Tables as the allocation of labour to initiatives is based on the PACR methodology rather than the regulatory methodology."]
[null,null,null,null,null,"Current Regulatory Period (2023-28)",null,null,null,null,"Next Regulatory Period (2028-33)",null,null,null,null," "," ",null,"Direct Costs",null,null,null,null,null,null,null,null,null,null,"Direct Labour costs directly attributable to an initiative",null,null,null,null,null,null,null,null,null,null,null,"Indirect Labour costs directly attributable to an initiative",null,null,null,null,null,null,null,null,null,null,null,"Contingency"]
[null,"Capex",null,"Dollar basis","Units",{"$f":"Inputs!L$15","v":2024},{"$f":"Inputs!M$15","v":2025},{"$f":"Inputs!N$15","v":2026},{"$f":"Inputs!O$15","v":2027},{"$f":"Inputs!P$15","v":2028},{"$f":"Inputs!Q$15","v":2029},{"$f":"Inputs!R$15","v":2030},{"$f":"Inputs!S$15","v":2031},{"$f":"Inputs!T$15","v":2032},{"$f":"Inputs!U$15","v":2033},"Total","Current Period",null,{"$f":"F6","v":2024},{"$f":"G6","v":2025},2026,2027,2028,2029,2030,2031,2032,2033,"Total",{"$f":"F6","v":2024},2025,2026,2027,2028,2029,2030,2031,2032,2033,"Total",null,{"$f":"F6","v":2024},2025,2026,2027,2028,2029,2030,2031,2032,2033,"Total",null,{"$f":"F6","v":2024},2025,2026,2027,2028,2029,2030,2031,2032,2033,"Total"]
[null,"Direct Costs",null,{"$f":"Inputs!$C$5","v":"Real $2023"},"$Million",{"$f":"SUM(F8:F20)","v":0},0,1.0694037431192658,17.46061681238109,43.083496840444148,29.9197437633742,33.563517788758567,12.187052411868024,0,0,137.28383135994528,61.613517395944498,null,{"$f":"SUM(S8:S20)","v":0},{"$f":"SUM(T8:T20)","v":0},0,14.257459986732462,37.369574266107882,26.403777483448049,31.833473940777086,10.970142930918977,0,0,{"$f":"SUM(S7:AB7)","v":120.83442860798446},{"$f":"SUM(AD8:AD20)","v":0},0,0.74858262018348598,2.242209777954038,3.9997458020353789,2.4611763959483066,1.2110306935870372,0.85183663666433285,0,0,{"$f":"SUM(AD7:AM7)","v":11.51458192637258},null,{"$f":"SUM(AP8:AP20)","v":0},0,0.3208211229357798,0.96094704769458805,1.7141767723008772,1.054789883977846,0.51901315439444451,0.36507284428471415,0,0,{"$f":"SUM(AP7:AY7)","v":4.9348208255882495},null,{"$f":"SUM(BB8:BB20)","v":0},0,0,3.2184692303311992,3.2184692303311992,3.2184692303311997,3.2184692303311992,2.6820576919426666,0,0,{"$f":"SUM(BB7:BK7)","v":15.555934613267464}]
[null,"Outage management",null,{"$f":"Inputs!$C$5","v":"Real $2023"},"$Million",{"$f":"S8+AD8+AP8+BB8","v":0},{"$f":"T8+AE8+AQ8+BC8","v":0},{"$f":"U8+AF8+AR8+BD8","v":0},{"$f":"V8+AG8+AS8+BE8","v":0},{"$f":"W8+AH8+AT8+BF8","v":0.59264792333098093},{"$f":"X8+AI8+AU8+BG8","v":0.11852958466619615},{"$f":"Y8+AJ8+AV8+BH8","v":0},{"$f":"Z8+AK8+AW8+BI8","v":0},{"$f":"AA8+AL8+AX8+BJ8","v":0},{"$f":"AB8+AM8+AY8+BK8","v":0},{"$f":"SUM(F8:O8)","v":0.71117750799717705},{"$f":"SUM(F8:J8)","v":0.59264792333098093},null,0,0,0,0,0,0,0,0,0,0,{"$f":"SUM(S8:AB8)","v":0},0,0,0,0,0.41485354633168664,8.2970709266337303E-2,0,0,0,0,{"$f":"SUM(AD8:AM8)","v":0.49782425559802396},"Outage management",0,0,0,0,0.17779437699929432,3.5558875399858851E-2,0,0,0,0,{"$f":"SUM(AP8:AY8)","v":0.21335325239915318},null,{"$f":"S$20*BB75","v":0},{"$f":"T$20*BC75","v":0},0,0,0,0,0,0,0,0,{"$f":"SUM(BB8:BK8)","v":0}]
[null,"Alarm management, visualisation and situation awareness enhancement",null,{"$f":"Inputs!$C$5","v":"Real $2023"},"$Million",{"$f":"S9+AD9+AP9+BB9","v":0},0,0,0.4697092204953694,5.1302909153504137,9.0177345518996219,10.605338435037464,2.1598117566181183,0,0,27.382884879400986,{"$f":"SUM(F9:J9)","v":5.6000001358457832},null,0,0,0,0.30878575897880939,4.4865970692841737,7.8912703212837023,9.4252330505826905,1.9586574297224182,0,0,24.070543629851795,null,null,null,null,null,null,null,null,null,null,0,null,null,null,null,null,null,null,null,null,null,null,0,null,{"$f":"S$20*BB76","v":0},0,0,0.16092346151656001,0.64369384606624003,1.1264642306159203,1.1801053844547735,0.20115432689570004,0,0,3.3123412495491942]
[null,"Fault level and system parameter monitoring and power system analysis capability",null,{"$f":"Inputs!$C$5","v":"Real $2023"},"$Million",0,0,0,0,0,0.56690147896833598,5.6337590038304359,0,0,0,6.2006604827987717,0,null,0,0,0,0,0,0.40597801745177609,5.1509886192807564,0,0,0,5.5569666367325325,null,null,null,null,null,null,null,null,null,null,0,null,null,null,null,null,null,null,null,null,null,null,0,null,{"$f":"S$20*BB77","v":0},0,0,0,0,0.16092346151655995,0.48277038454967985,0,0,0,0.64369384606623981]
[null,"SCADA/AEMS system",null,{"$f":"Inputs!$C$5","v":"Real $2023"},"$Million",0,0,0,4.8317957878847819,12.86209932161238,4.7567937630011023,4.7567937630011023,3.9639948025009182,0,0,31.171477438000284,17.693895109497163,null,0,0,0,3.100843956848701,11.673573574045156,4.3276645322902763,4.3276645322902754,3.6063871102418958,0,0,27.036133705716306,0,0,0,0.91127582022767728,0.53157756179947846,0,0,0,0,0,1.4428533820271556,"SCADA Dual Homing",0,0,0,0.39054678009757604,0.2278189550569194,0,0,0,0,0,0.61836573515449544,null,{"$f":"S$20*BB78","v":0},0,0,0.42912923071082659,0.42912923071082659,0.42912923071082654,0.42912923071082654,0.35760769225902228,0,0,2.0741246151023285]
[null,"Facilities",null,{"$f":"Inputs!$C$5","v":"Real $2023"},"$Million",0,0,0,4.0471552804347208,0.50300847621171485,0,0,0.50951305575158778,0,0,5.0596768123980231,4.5501637566464357,null,0,0,0,3.8756016231474941,0.4458239237826393,0,0,0.50951305575158778,0,0,4.8309386026817212,0,0,0,0.12008756010105849,4.0029186700352853E-2,0,0,0,0,0,0.16011674680141136,"Newcastle and Wallgrove facilities internal costs",0,0,0,5.1466097186167938E-2,1.7155365728722654E-2,0,0,0,0,0,6.8621462914890588E-2,null,{"$f":"S$20*BB79","v":0},0,0,0,0,0,0,0,0,0,0]
[null,"Data management and network modelling system",null,{"$f":"Inputs!$C$5","v":"Real $2023"},"$Million",0,0,0,1.0345929306270552,15.152617764824758,9.3285226064703899,0,0,0,0,25.515733301922204,16.187210695451814,null,0,0,0,0.65102652581786635,12.479826825693012,7.1612917839965293,0,0,0,0,20.292145135507408,0,0,0,0.11830125261764288,1.2701727343970641,1.0664758834853347,0,0,0,0,2.4549498705000419,"Data Management",0,0,0,5.0700536836132674E-2,0.54435974331302761,0.45706109292228642,0,0,0,0,1.0521213730714467,null,{"$f":"S$20*BB80","v":0},0,0,0.2145646153554133,0.85825846142165318,0.64369384606623981,0,0,0,0,1.7165169228433064]
[null,"Training technologies, operational document management system and operational planning systems",null,{"$f":"Inputs!$C$5","v":"Real $2023"},"$Million",0,0,0,2.8598787019400782,5.1461611035221653,3.4532753432124199,0,0,0,0,11.459315148674664,8.0060398054622439,null,0,0,0,2.6346262635208824,4.4757279732469355,3.3991035980945652,0,0,0,0,10.509457834862383,{"$f":"AD78","v":0},{"$f":"AE78","v":0},0,0.15767670689343685,0.46930319119266051,3.7920221582498213E-2,0,0,0,0,0.66490011966859552,"Below",{"$f":"AP78","v":0},{"$f":"AQ78","v":0},0,6.7575731525758659E-2,0.20112993908256882,1.6251523535356381E-2,0,0,0,0,0.28495719414368387,null,{"$f":"S$20*BB81","v":0},0,0,0,0,0,0,0,0,0,0]
[null,"Operational forecasts and look-ahead contingency assessment",null,{"$f":"Inputs!$C$5","v":"Real $2023"},"$Million",0,0,0,0,0,0,2.8308870706896552,0.64912526639573642,0,0,3.4800123370853915,0,null,0,0,0,0,0,0,2.4017578399788286,0.55972334333098084,0,0,2.9614811833098096,null,null,null,null,null,null,null,null,null,null,0,null,null,null,null,null,null,null,null,null,null,null,0,null,{"$f":"S$20*BB82","v":0},0,0,0,0,0,0.42912923071082654,8.940192306475557E-2,0,0,0.51853115377558212]
{"$rows_left_out":109}
{"sheet":"Outputs|DGA","index":7,"n_rows":63,"n_cols":12,"rows_kept":63,"cut":false,"hidden":false,"merged":[]}
["Outputs |DGA Report Tables"]
[]
["Contingent Project Application: Equivalent table to Table 3 Capex Costs from February 2026 in the DGA report"]
[]
[null,"Capex",null,"Dollar basis","Units","DGA Report","CPA","Differences",null,null,null,"CPA"]
[null,"Cost Categories",null,null,null,null,null,null,null,null,null,"Real $2023, $Million"]
[null,"SI Costs",null,"Real $2025","$Million",97.974431999999993,{"$f":"$L7*$G$17","v":97.974432321999984},{"$f":"ROUND(G7-F7,1)","v":0},"Not applicable",null,null,{"$f":"SUMIF(Inputs!$BK$27:$BK$106,B7,Inputs!$AI$27:$AI$106)","v":92.443059996128412}]
[null,"Internal Costs",null,"Real $2025","$Million",{"$f":"169.602782-SUM(F7,F9,F10)","v":49.014275999999995},{"$f":"$L8*$G$17","v":51.885017871430989},{"$f":"ROUND(G8-F8,1)","v":2.9},"The CPA adopted standard regulatory assumptions for the average labour hours per month, labour related costs and labour escalation.",null,null,{"$f":"'Outputs|Tables'!P27-SUM(L7,L9,L10)","v":48.955729635923234}]
[null,"Contingency (P50 Confidence Level)",null,"Real $2025","$Million",16.486730999999999,{"$f":"$L9*$G$17","v":16.486731000000002},{"$f":"ROUND(G9-F9,1)","v":0},"Not applicable",null,null,{"$f":"'Outputs|Tables'!P20","v":15.555934613267466}]
[null,"CPA Costs",null,"Real $2025","$Million",6.1273429999999998,{"$f":"$L10*$G$17","v":6.1273432758464814},{"$f":"ROUND(G10-F10,1)","v":0},"Forecasts were updated to include latest actuals from Finance source systems",null,null,{"$f":"'Outputs|Initiative'!P60","v":5.7814099928064531}]
[null,"Total project cost (Excl ERC)",null,"Real $2025","$Million",{"$f":"SUM(F7:F10)","v":169.60278199999996},{"$f":"SUM(G7:G10)","v":172.47352446927744},{"$f":"SUM(H7:H10)","v":2.9},null,null,null,{"$f":"SUM(L7:L10)","v":162.73613423812557}]
[null,"Equity Raising Costs",null,"Real $2025","$Million",null,{"$f":"$L12*$G$17","v":0.84852125512172094},{"$f":"ROUND(G12-F12,1)","v":0.8},"Forecasts were updated to include latest actuals from Finance source systems",null,null,{"$f":"'Outputs|Initiative'!P64","v":0.80061603253192715}]
[null,"Total project cost",null,"Real $2025","$Million",{"$f":"F11+F12","v":169.60278199999996},{"$f":"G11+G12","v":173.32204572439915},{"$f":"H11+H12","v":3.7},null,null,null,{"$f":"L11+L12","v":163.53675027065751}]
[]
[{"$f":"IF(SUM(G15:L15)=0,0,1)","v":0},"Check - As incurred",null,null,null,null,{"$f":"IF(ROUND(G11-'Outputs|Tables'!P56,3)=0,0,1)","v":0},null,null,null,null,{"$f":"IF(ROUND(L11-'Outputs|Tables'!P27,3)=0,0,1)","v":0}]
{"$rows_left_out":48}