{"text_format":"1","workbook":"xlsx","n_sheets":5,"sheets":["Index","Notes & Assumptions","Inputs","Calculations","Outputs"],"not_rendered":{"charts":0,"images":0,"macros":1,"external_links":0,"defined_names":141,"comments":0,"pivot_tables":0},"unopened":[],"bounds":{"document_bytes":16777216,"sheet_cells":100000,"rows_first":2000,"rows_last":500,"rows_between":2000,"halvings":0,"cell_chars":16384,"cell_head_chars":4096},"cells_cut":0,"cells_raw":0,"read":"whole","date_system":"1900"}

{"sheet":"Index","index":0,"n_rows":22,"n_cols":11,"rows_kept":22,"cut":false,"hidden":false,"merged":[]}
["Index and File Details"]
[]
[null,"Index",null,null,null,null,null,"File Details"]
[]
[null,"Inputs",null,"Calculations",null,"Outputs",null,null,"Model","Transgrid | System Operability Opex Forecast Model"]
[null,null,null,null,null,null,null,null,"Author","Transgrid"]
[null,"Notes & Assumptions",null,"Calculations",null,"Outputs",null,null,"Revision","2025-12-15"]
[null,{"$f":"Inputs!A1","v":"Inputs"},null,null,null,null,null,null,"Status","Revenue Proposal"]
[]
[]
[]
[null,"Model Checks",null,null,null,null,null,"Instructions"]
[]
[null,"Worksheet",null,null,null,null,null,null,"Input Sheets"]
[null,{"$f":"B7","v":"Notes & Assumptions"},null,"N/A",null,null,null,null,"Fill in any cells marked as input cells as seen on the right =>",null,"user input"]
[null,{"$f":"B8","v":"Inputs"},null,"N/A",null,null,null,null,"Historical / Not applicable"]
[null,{"$f":"D7","v":"Calculations"},null,{"$f":"IF(SUM(Calculations!A2:A55)=0,0,1)","v":0},null,null,null,null,"Cells not marked as inputs should not be modified."]
[null,{"$f":"F7","v":"Outputs"},null,{"$f":"IF(SUM(Outputs!A3:A92)=0,0,1)","v":0},null,null,null,null,"Confidential information",null,"user input"]
[]
[null,"Total Error Check",null,{"$f":"IF(SUM(D15:D18)=0,0,1)","v":0}]
{"$rows_left_out":3}
{"sheet":"Notes & Assumptions","index":1,"n_rows":12,"n_cols":5,"rows_kept":12,"cut":false,"hidden":false,"merged":[]}
["Assumptions & Notes"]
[]
[null,null,null,null,"User inputs in cells coloured like this"]
[null,null,"*",null,"1.     Inputs and calculations are in $. Some outputs are $million."]
[null,null,"*",null,"2.     Financial years are recorded in the Opex Forecast Model as tax years (e.g. 2017/18 is shown as 2018, 2018/19 is shown as 2019)"]
[null,null,"*",null,"3.     Escalation is treated as follows:"]
[null,null,null,null,"a.    CPI escalation and Commodity escalation are treated separately. "]
[]
[]
["Modifications"]
["Date","Version",null,"Who","Notes"]
["2023-06-26","v1.1",null,null,"Initial model development"]

{"sheet":"Inputs","index":2,"n_rows":63,"n_cols":36,"rows_kept":63,"cut":false,"hidden":false,"merged":[[20,23,20,33],[20,5,20,7],[58,11,58,21],[20,11,20,21]]}
["Inputs"]
[]
[null,"Output Reporting Format and Year"]
[null,"Real",2023,"The Financial Year that results are reported in.",null,null,null,{"$f":" IF(Real_or_Nom=\"Real\", \"Real $\" & Report_Year, \"$ Nominal\")","v":"Real $2023"}]
[]
[null,"Indexation and escalation"]
[]
[null,"Forecasts",null,null,null,null,null,null,null,null,null,"Rates"]
[null,"Item","Source","Units",null,null,null,null,null,null,null,2023,{"$f":"L9+1","v":2024},2025,2026,2027,2028,{"$f":"Q9+1","v":2029},{"$f":"R9+1","v":2030},{"$f":"S9+1","v":2031},{"$f":"T9+1","v":2032},2033]
[null,"Actual / Forecast Inflation ","ABS / RBA / PTRM","%",null,null,null,null,null,null,null,6.0269627279936566E-2,3.8145100972326373E-2,2.0893371757924939E-2,2.9193048507912156E-2,2.9193048507912156E-2,2.9193048507912156E-2,2.9193048507912156E-2,2.9193048507912156E-2,2.9193048507912156E-2,2.9193048507912156E-2,2.9193048507912156E-2,null,"Note: Currently set to June to June unlagged for actual/estimates and PTRM for forecasts"]
[null,"Real labour escalation","Transgrid AER FD","%",null,null,null,null,null,null,null,null,3.9046564755527329E-3,1.3076482545953276E-2,1.1546438954636147E-2,4.3304575862308627E-3,3.00941333753012E-3,7.1734897799806269E-3,7.1734897799806269E-3,7.1734897799806269E-3,7.1734897799806269E-3,7.1734897799806269E-3,null,"Note: Based on Final Decision values applied to both the opex and capex models"]
[]
[null,"Cumulative factors",null,null,null,null,null,null,null,null,null,"Cumulative Factors"]
[null,"Item","Source","Units",null,null,null,null,null,null,null,{"$f":"L$9","v":2023},2024,2025,2026,2027,2028,2029,2030,2031,2032,2033]
[null,"Nominal (mid year) to Real 2023 (end year)","Calculated","Factor",null,null,null,null,null,null,null,{"$f":"(1+L10)^0.5","v":1.0296939483554988},{"$f":"L15/(1+L10)^0.5/(1+M10)^0.5","v":0.98145630781500182},0.95334863498959577,0.93006464345756967,0.90368337097296259,0.87805040296676229,0.85314451379139133,0.82894507986451171,0.80543206259145184,0.78258599177203836,0.76038794947809263,null,"Note: this index converts from nominal mid year dollars for each year between 2021-22 to 2030-31 to dollars as at the end of 2025-26 (i.e., Real 2026, 30 June 2026)."]
[null,"Nominal (end year) to Real 2023 (end year)","Calculated","Factor",null,null,null,null,null,null,null,1,{"$f":"L16/(1+M10)","v":0.96325648414985565},0.9435426958362737,0.91677911855719263,0.89077468982743979,0.86550787640749571,0.84095775584792232,0.81710399916430965,0.79392685400364704,0.77140712828818092,0.74952617432321356]
[null,"Labour escalation from 2027","Calculated","Factor",null,null,null,null,null,null,null,{"$f":"M17","v":1},{"$f":"N17","v":1},{"$f":"O17","v":1},{"$f":"P17","v":1},1,{"$f":"P17*(1+Q11)","v":1.00300941333753},1.0102044911133312,1.0174511827060233,1.0247498583667942,1.0321008910028251,1.0395046561963428]
[]
[null,"Operating costs"]
[]
{"$rows_left_out":44}
{"sheet":"Calculations","index":3,"n_rows":55,"n_cols":16,"rows_kept":55,"cut":false,"hidden":false,"merged":[]}
["Calculations"]
[]
[null,{"$f":"Inputs!$B$19","v":"Operating costs"},null,null,null,"2023-28 Regulatory Period",null,null,null,null,"2023-28 Regulatory Period",null,null,null,null,"Total"]
[null,"Component","Dollar basis","Unit",{"$f":"Inputs!L$14","v":2023},{"$f":"Inputs!M$14","v":2024},{"$f":"Inputs!N$14","v":2025},{"$f":"Inputs!O$14","v":2026},{"$f":"Inputs!P$14","v":2027},{"$f":"Inputs!Q$14","v":2028},{"$f":"Inputs!R$14","v":2029},{"$f":"Inputs!S$14","v":2030},{"$f":"Inputs!T$14","v":2031},{"$f":"Inputs!U$14","v":2032},{"$f":"Inputs!V$14","v":2033}]
[null,{"$f":"Inputs!B23","v":"Network Operations"}]
[null,"Labour",{"$f":"Inputs!$H$4","v":"Real $2023"},"Dollars",{"$f":"SUMPRODUCT(Inputs!$J$24:$J$34,Inputs!L$24:L$34)*Inputs!$AJ$23*INDEX(IF($D$52=\"Mid\",Inputs!$L$15:$V$15,Inputs!$L$16:$V$16),MATCH($C$52,Inputs!$L$14:$V$14,0))","v":0},{"$f":"SUMPRODUCT(Inputs!$J$24:$J$34,Inputs!M$24:M$34)*Inputs!$AJ$23*INDEX(IF($D$52=\"Mid\",Inputs!$L$15:$V$15,Inputs!$L$16:$V$16),MATCH($C$52,Inputs!$L$14:$V$14,0))","v":0},{"$f":"SUMPRODUCT(Inputs!$J$24:$J$34,Inputs!N$24:N$34)*Inputs!$AJ$23*INDEX(IF($D$52=\"Mid\",Inputs!$L$15:$V$15,Inputs!$L$16:$V$16),MATCH($C$52,Inputs!$L$14:$V$14,0))","v":0},{"$f":"SUMPRODUCT(Inputs!$J$24:$J$34,Inputs!O$24:O$34)*Inputs!$AJ$23*INDEX(IF($D$52=\"Mid\",Inputs!$L$15:$V$15,Inputs!$L$16:$V$16),MATCH($C$52,Inputs!$L$14:$V$14,0))","v":0},{"$f":"SUMPRODUCT(Inputs!$J$24:$J$34,Inputs!P$24:P$34)*Inputs!$AJ$23*INDEX(IF($D$52=\"Mid\",Inputs!$L$15:$V$15,Inputs!$L$16:$V$16),MATCH($C$52,Inputs!$L$14:$V$14,0))","v":0},{"$f":"SUMPRODUCT(Inputs!$J$24:$J$34,Inputs!Q$24:Q$34)*Inputs!$AJ$23*INDEX(IF($D$52=\"Mid\",Inputs!$L$15:$V$15,Inputs!$L$16:$V$16),MATCH($C$52,Inputs!$L$14:$V$14,0))","v":106148.55328158078},{"$f":"SUMPRODUCT(Inputs!$J$24:$J$34,Inputs!R$24:R$34)*Inputs!$AJ$23*INDEX(IF($D$52=\"Mid\",Inputs!$L$15:$V$15,Inputs!$L$16:$V$16),MATCH($C$52,Inputs!$L$14:$V$14,0))","v":536343.03198306274},{"$f":"SUMPRODUCT(Inputs!$J$24:$J$34,Inputs!S$24:S$34)*Inputs!$AJ$23*INDEX(IF($D$52=\"Mid\",Inputs!$L$15:$V$15,Inputs!$L$16:$V$16),MATCH($C$52,Inputs!$L$14:$V$14,0))","v":1598117.3643472122},{"$f":"SUMPRODUCT(Inputs!$J$24:$J$34,Inputs!T$24:T$34)*Inputs!$AJ$23*INDEX(IF($D$52=\"Mid\",Inputs!$L$15:$V$15,Inputs!$L$16:$V$16),MATCH($C$52,Inputs!$L$14:$V$14,0))","v":1752373.0231983061},{"$f":"SUMPRODUCT(Inputs!$J$24:$J$34,Inputs!U$24:U$34)*Inputs!$AJ$23*INDEX(IF($D$52=\"Mid\",Inputs!$L$15:$V$15,Inputs!$L$16:$V$16),MATCH($C$52,Inputs!$L$14:$V$14,0))","v":2060884.491867325},{"$f":"SUMPRODUCT(Inputs!$J$24:$J$34,Inputs!V$24:V$34)*Inputs!$AJ$23*INDEX(IF($D$52=\"Mid\",Inputs!$L$15:$V$15,Inputs!$L$16:$V$16),MATCH($C$52,Inputs!$L$14:$V$14,0))","v":2060884.491867325},{"$f":"SUM(E6:O6)","v":8114750.9565448118}]
[null,"Labour escalation",{"$f":"Inputs!$H$4","v":"Real $2023"},"Dollars",{"$f":"E6*(Inputs!L$17-1)","v":0},{"$f":"F6*(Inputs!M$17-1)","v":0},{"$f":"G6*(Inputs!N$17-1)","v":0},{"$f":"H6*(Inputs!O$17-1)","v":0},{"$f":"I6*(Inputs!P$17-1)","v":0},{"$f":"J6*(Inputs!Q$17-1)","v":319.4448720051052},{"$f":"K6*(Inputs!R$17-1)","v":5473.1077035682838},{"$f":"L6*(Inputs!S$17-1)","v":27889.038110891615},{"$f":"M6*(Inputs!T$17-1)","v":43370.98412994908},{"$f":"N6*(Inputs!U$17-1)","v":66156.228442845575},{"$f":"O6*(Inputs!V$17-1)","v":81414.533311593303},{"$f":"SUM(E7:O7)","v":224623.33657085296}]
[null,"Non labour",{"$f":"Inputs!$H$4","v":"Real $2023"},"Dollars",{"$f":"SUMPRODUCT(Inputs!$I$24:$I$34,Inputs!X$24:X$34)*INDEX(IF($D$53=\"Mid\",Inputs!$L$15:$V$15,Inputs!$L$16:$V$16),MATCH($C$53,Inputs!$L$14:$V$14,0))","v":0},{"$f":"SUMPRODUCT(Inputs!$I$24:$I$34,Inputs!Y$24:Y$34)*INDEX(IF($D$53=\"Mid\",Inputs!$L$15:$V$15,Inputs!$L$16:$V$16),MATCH($C$53,Inputs!$L$14:$V$14,0))","v":0},{"$f":"SUMPRODUCT(Inputs!$I$24:$I$34,Inputs!Z$24:Z$34)*INDEX(IF($D$53=\"Mid\",Inputs!$L$15:$V$15,Inputs!$L$16:$V$16),MATCH($C$53,Inputs!$L$14:$V$14,0))","v":0},{"$f":"SUMPRODUCT(Inputs!$I$24:$I$34,Inputs!AA$24:AA$34)*INDEX(IF($D$53=\"Mid\",Inputs!$L$15:$V$15,Inputs!$L$16:$V$16),MATCH($C$53,Inputs!$L$14:$V$14,0))","v":0},{"$f":"SUMPRODUCT(Inputs!$I$24:$I$34,Inputs!AB$24:AB$34)*INDEX(IF($D$53=\"Mid\",Inputs!$L$15:$V$15,Inputs!$L$16:$V$16),MATCH($C$53,Inputs!$L$14:$V$14,0))","v":0},{"$f":"SUMPRODUCT(Inputs!$I$24:$I$34,Inputs!AC$24:AC$34)*INDEX(IF($D$53=\"Mid\",Inputs!$L$15:$V$15,Inputs!$L$16:$V$16),MATCH($C$53,Inputs!$L$14:$V$14,0))","v":0},{"$f":"SUMPRODUCT(Inputs!$I$24:$I$34,Inputs!AD$24:AD$34)*INDEX(IF($D$53=\"Mid\",Inputs!$L$15:$V$15,Inputs!$L$16:$V$16),MATCH($C$53,Inputs!$L$14:$V$14,0))","v":1175147.2806986589},{"$f":"SUMPRODUCT(Inputs!$I$24:$I$34,Inputs!AE$24:AE$34)*INDEX(IF($D$53=\"Mid\",Inputs!$L$15:$V$15,Inputs!$L$16:$V$16),MATCH($C$53,Inputs!$L$14:$V$14,0))","v":2716866.0882145376},{"$f":"SUMPRODUCT(Inputs!$I$24:$I$34,Inputs!AF$24:AF$34)*INDEX(IF($D$53=\"Mid\",Inputs!$L$15:$V$15,Inputs!$L$16:$V$16),MATCH($C$53,Inputs!$L$14:$V$14,0))","v":3240775.089390731},{"$f":"SUMPRODUCT(Inputs!$I$24:$I$34,Inputs!AG$24:AG$34)*INDEX(IF($D$53=\"Mid\",Inputs!$L$15:$V$15,Inputs!$L$16:$V$16),MATCH($C$53,Inputs!$L$14:$V$14,0))","v":3261573.2865208182},{"$f":"SUMPRODUCT(Inputs!$I$24:$I$34,Inputs!AH$24:AH$34)*INDEX(IF($D$53=\"Mid\",Inputs!$L$15:$V$15,Inputs!$L$16:$V$16),MATCH($C$53,Inputs!$L$14:$V$14,0))","v":3261573.2865208182},{"$f":"SUM(E8:O8)","v":13655935.031345563}]
[null,"Sub-Total",{"$f":"Inputs!$H$4","v":"Real $2023"},"Dollars",{"$f":"SUM(E6:E8)","v":0},0,0,0,0,106467.99815358588,1716963.4203852899,4342872.4906726414,5036519.0967189856,5388614.0068309885,5403872.3116997369,21995309.324461229]
[null,{"$f":"Inputs!B35","v":"Network Planning"}]
[null,{"$f":"$B$6","v":"Labour"},{"$f":"Inputs!$H$4","v":"Real $2023"},"Dollars",{"$f":"SUMPRODUCT(Inputs!$J$36:$J$38,Inputs!L$36:L$38)*Inputs!$AJ$23*INDEX(IF($D$52=\"Mid\",Inputs!$L$15:$V$15,Inputs!$L$16:$V$16),MATCH($C$52,Inputs!$L$14:$V$14,0))","v":0},{"$f":"SUMPRODUCT(Inputs!$J$36:$J$38,Inputs!M$36:M$38)*Inputs!$AJ$23*INDEX(IF($D$52=\"Mid\",Inputs!$L$15:$V$15,Inputs!$L$16:$V$16),MATCH($C$52,Inputs!$L$14:$V$14,0))","v":0},{"$f":"SUMPRODUCT(Inputs!$J$36:$J$38,Inputs!N$36:N$38)*Inputs!$AJ$23*INDEX(IF($D$52=\"Mid\",Inputs!$L$15:$V$15,Inputs!$L$16:$V$16),MATCH($C$52,Inputs!$L$14:$V$14,0))","v":0},{"$f":"SUMPRODUCT(Inputs!$J$36:$J$38,Inputs!O$36:O$38)*Inputs!$AJ$23*INDEX(IF($D$52=\"Mid\",Inputs!$L$15:$V$15,Inputs!$L$16:$V$16),MATCH($C$52,Inputs!$L$14:$V$14,0))","v":0},{"$f":"SUMPRODUCT(Inputs!$J$36:$J$38,Inputs!P$36:P$38)*Inputs!$AJ$23*INDEX(IF($D$52=\"Mid\",Inputs!$L$15:$V$15,Inputs!$L$16:$V$16),MATCH($C$52,Inputs!$L$14:$V$14,0))","v":0},{"$f":"SUMPRODUCT(Inputs!$J$36:$J$38,Inputs!Q$36:Q$38)*Inputs!$AJ$23*INDEX(IF($D$52=\"Mid\",Inputs!$L$15:$V$15,Inputs!$L$16:$V$16),MATCH($C$52,Inputs!$L$14:$V$14,0))","v":385639.33583627379},{"$f":"SUMPRODUCT(Inputs!$J$36:$J$38,Inputs!R$36:R$38)*Inputs!$AJ$23*INDEX(IF($D$52=\"Mid\",Inputs!$L$15:$V$15,Inputs!$L$16:$V$16),MATCH($C$52,Inputs!$L$14:$V$14,0))","v":578459.00375441066},{"$f":"SUMPRODUCT(Inputs!$J$36:$J$38,Inputs!S$36:S$38)*Inputs!$AJ$23*INDEX(IF($D$52=\"Mid\",Inputs!$L$15:$V$15,Inputs!$L$16:$V$16),MATCH($C$52,Inputs!$L$14:$V$14,0))","v":925534.40600705717},{"$f":"SUMPRODUCT(Inputs!$J$36:$J$38,Inputs!T$36:T$38)*Inputs!$AJ$23*INDEX(IF($D$52=\"Mid\",Inputs!$L$15:$V$15,Inputs!$L$16:$V$16),MATCH($C$52,Inputs!$L$14:$V$14,0))","v":1079790.1403415666},{"$f":"SUMPRODUCT(Inputs!$J$36:$J$38,Inputs!U$36:U$38)*Inputs!$AJ$23*INDEX(IF($D$52=\"Mid\",Inputs!$L$15:$V$15,Inputs!$L$16:$V$16),MATCH($C$52,Inputs!$L$14:$V$14,0))","v":1388301.6090105856},{"$f":"SUMPRODUCT(Inputs!$J$36:$J$38,Inputs!V$36:V$38)*Inputs!$AJ$23*INDEX(IF($D$52=\"Mid\",Inputs!$L$15:$V$15,Inputs!$L$16:$V$16),MATCH($C$52,Inputs!$L$14:$V$14,0))","v":1388301.6090105856},{"$f":"SUM(E11:O11)","v":5746026.1039604796}]
[null,{"$f":"$B$7","v":"Labour escalation"},{"$f":"Inputs!$H$4","v":"Real $2023"},"Dollars",{"$f":"E11*(Inputs!L$17-1)","v":0},{"$f":"F11*(Inputs!M$17-1)","v":0},{"$f":"G11*(Inputs!N$17-1)","v":0},{"$f":"H11*(Inputs!O$17-1)","v":0},{"$f":"I11*(Inputs!P$17-1)","v":0},{"$f":"J11*(Inputs!Q$17-1)","v":1160.548160741901},{"$f":"K11*(Inputs!R$17-1)","v":5902.8797632383121},{"$f":"L11*(Inputs!S$17-1)","v":16151.670019939907},{"$f":"M11*(Inputs!T$17-1)","v":26724.653039314628},{"$f":"N11*(Inputs!U$17-1)","v":44565.718629895506},{"$f":"O11*(Inputs!V$17-1)","v":54844.377760792711},{"$f":"SUM(E12:O12)","v":149349.84737392297}]
[null,{"$f":"$B$8","v":"Non labour"},{"$f":"Inputs!$H$4","v":"Real $2023"},"Dollars",{"$f":"SUMPRODUCT(Inputs!$I$36:$I$38,Inputs!X$36:X$38)*INDEX(IF($D$53=\"Mid\",Inputs!$L$15:$V$15,Inputs!$L$16:$V$16),MATCH($C$53,Inputs!$L$14:$V$14,0))","v":0},{"$f":"SUMPRODUCT(Inputs!$I$36:$I$38,Inputs!Y$36:Y$38)*INDEX(IF($D$53=\"Mid\",Inputs!$L$15:$V$15,Inputs!$L$16:$V$16),MATCH($C$53,Inputs!$L$14:$V$14,0))","v":0},{"$f":"SUMPRODUCT(Inputs!$I$36:$I$38,Inputs!Z$36:Z$38)*INDEX(IF($D$53=\"Mid\",Inputs!$L$15:$V$15,Inputs!$L$16:$V$16),MATCH($C$53,Inputs!$L$14:$V$14,0))","v":0},{"$f":"SUMPRODUCT(Inputs!$I$36:$I$38,Inputs!AA$36:AA$38)*INDEX(IF($D$53=\"Mid\",Inputs!$L$15:$V$15,Inputs!$L$16:$V$16),MATCH($C$53,Inputs!$L$14:$V$14,0))","v":0},{"$f":"SUMPRODUCT(Inputs!$I$36:$I$38,Inputs!AB$36:AB$38)*INDEX(IF($D$53=\"Mid\",Inputs!$L$15:$V$15,Inputs!$L$16:$V$16),MATCH($C$53,Inputs!$L$14:$V$14,0))","v":0},{"$f":"SUMPRODUCT(Inputs!$I$36:$I$38,Inputs!AC$36:AC$38)*INDEX(IF($D$53=\"Mid\",Inputs!$L$15:$V$15,Inputs!$L$16:$V$16),MATCH($C$53,Inputs!$L$14:$V$14,0))","v":248009.4113149847},{"$f":"SUMPRODUCT(Inputs!$I$36:$I$38,Inputs!AD$36:AD$38)*INDEX(IF($D$53=\"Mid\",Inputs!$L$15:$V$15,Inputs!$L$16:$V$16),MATCH($C$53,Inputs!$L$14:$V$14,0))","v":449403.72477064212},{"$f":"SUMPRODUCT(Inputs!$I$36:$I$38,Inputs!AE$36:AE$38)*INDEX(IF($D$53=\"Mid\",Inputs!$L$15:$V$15,Inputs!$L$16:$V$16),MATCH($C$53,Inputs!$L$14:$V$14,0))","v":904781.01834862377},{"$f":"SUMPRODUCT(Inputs!$I$36:$I$38,Inputs!AF$36:AF$38)*INDEX(IF($D$53=\"Mid\",Inputs!$L$15:$V$15,Inputs!$L$16:$V$16),MATCH($C$53,Inputs!$L$14:$V$14,0))","v":904781.01834862377},{"$f":"SUMPRODUCT(Inputs!$I$36:$I$38,Inputs!AG$36:AG$38)*INDEX(IF($D$53=\"Mid\",Inputs!$L$15:$V$15,Inputs!$L$16:$V$16),MATCH($C$53,Inputs!$L$14:$V$14,0))","v":904781.01834862377},{"$f":"SUMPRODUCT(Inputs!$I$36:$I$38,Inputs!AH$36:AH$38)*INDEX(IF($D$53=\"Mid\",Inputs!$L$15:$V$15,Inputs!$L$16:$V$16),MATCH($C$53,Inputs!$L$14:$V$14,0))","v":904781.01834862377},{"$f":"SUM(E13:O13)","v":4316537.2094801227}]
[null,"Sub-Total",{"$f":"Inputs!$H$4","v":"Real $2023"},"Dollars",{"$f":"SUM(E11:E13)","v":0},0,0,0,0,634809.29531200044,1033765.6082882911,1846467.0943756208,2011295.811729505,2337648.3459891048,2347927.0051200017,10211913.160814526]
[null,{"$f":"Inputs!B39","v":"Asset Management"}]
[null,{"$f":"$B$6","v":"Labour"},{"$f":"Inputs!$H$4","v":"Real $2023"},"Dollars",{"$f":"SUMPRODUCT(Inputs!$J$40:$J$41,Inputs!L$40:L$41)*Inputs!$AJ$23*INDEX(IF($D$52=\"Mid\",Inputs!$L$15:$V$15,Inputs!$L$16:$V$16),MATCH($C$52,Inputs!$L$14:$V$14,0))","v":0},{"$f":"SUMPRODUCT(Inputs!$J$40:$J$41,Inputs!M$40:M$41)*Inputs!$AJ$23*INDEX(IF($D$52=\"Mid\",Inputs!$L$15:$V$15,Inputs!$L$16:$V$16),MATCH($C$52,Inputs!$L$14:$V$14,0))","v":0},{"$f":"SUMPRODUCT(Inputs!$J$40:$J$41,Inputs!N$40:N$41)*Inputs!$AJ$23*INDEX(IF($D$52=\"Mid\",Inputs!$L$15:$V$15,Inputs!$L$16:$V$16),MATCH($C$52,Inputs!$L$14:$V$14,0))","v":0},{"$f":"SUMPRODUCT(Inputs!$J$40:$J$41,Inputs!O$40:O$41)*Inputs!$AJ$23*INDEX(IF($D$52=\"Mid\",Inputs!$L$15:$V$15,Inputs!$L$16:$V$16),MATCH($C$52,Inputs!$L$14:$V$14,0))","v":0},{"$f":"SUMPRODUCT(Inputs!$J$40:$J$41,Inputs!P$40:P$41)*Inputs!$AJ$23*INDEX(IF($D$52=\"Mid\",Inputs!$L$15:$V$15,Inputs!$L$16:$V$16),MATCH($C$52,Inputs!$L$14:$V$14,0))","v":0},{"$f":"SUMPRODUCT(Inputs!$J$40:$J$41,Inputs!Q$40:Q$41)*Inputs!$AJ$23*INDEX(IF($D$52=\"Mid\",Inputs!$L$15:$V$15,Inputs!$L$16:$V$16),MATCH($C$52,Inputs!$L$14:$V$14,0))","v":0},{"$f":"SUMPRODUCT(Inputs!$J$40:$J$41,Inputs!R$40:R$41)*Inputs!$AJ$23*INDEX(IF($D$52=\"Mid\",Inputs!$L$15:$V$15,Inputs!$L$16:$V$16),MATCH($C$52,Inputs!$L$14:$V$14,0))","v":0},{"$f":"SUMPRODUCT(Inputs!$J$40:$J$41,Inputs!S$40:S$41)*Inputs!$AJ$23*INDEX(IF($D$52=\"Mid\",Inputs!$L$15:$V$15,Inputs!$L$16:$V$16),MATCH($C$52,Inputs!$L$14:$V$14,0))","v":0},{"$f":"SUMPRODUCT(Inputs!$J$40:$J$41,Inputs!T$40:T$41)*Inputs!$AJ$23*INDEX(IF($D$52=\"Mid\",Inputs!$L$15:$V$15,Inputs!$L$16:$V$16),MATCH($C$52,Inputs!$L$14:$V$14,0))","v":0},{"$f":"SUMPRODUCT(Inputs!$J$40:$J$41,Inputs!U$40:U$41)*Inputs!$AJ$23*INDEX(IF($D$52=\"Mid\",Inputs!$L$15:$V$15,Inputs!$L$16:$V$16),MATCH($C$52,Inputs!$L$14:$V$14,0))","v":0},{"$f":"SUMPRODUCT(Inputs!$J$40:$J$41,Inputs!V$40:V$41)*Inputs!$AJ$23*INDEX(IF($D$52=\"Mid\",Inputs!$L$15:$V$15,Inputs!$L$16:$V$16),MATCH($C$52,Inputs!$L$14:$V$14,0))","v":0},{"$f":"SUM(E16:O16)","v":0}]
[null,{"$f":"$B$7","v":"Labour escalation"},{"$f":"Inputs!$H$4","v":"Real $2023"},"Dollars",{"$f":"E16*(Inputs!L$17-1)","v":0},{"$f":"F16*(Inputs!M$17-1)","v":0},{"$f":"G16*(Inputs!N$17-1)","v":0},{"$f":"H16*(Inputs!O$17-1)","v":0},{"$f":"I16*(Inputs!P$17-1)","v":0},{"$f":"J16*(Inputs!Q$17-1)","v":0},{"$f":"K16*(Inputs!R$17-1)","v":0},{"$f":"L16*(Inputs!S$17-1)","v":0},{"$f":"M16*(Inputs!T$17-1)","v":0},{"$f":"N16*(Inputs!U$17-1)","v":0},{"$f":"O16*(Inputs!V$17-1)","v":0},{"$f":"SUM(E17:O17)","v":0}]
[null,{"$f":"$B$8","v":"Non labour"},{"$f":"Inputs!$H$4","v":"Real $2023"},"Dollars",{"$f":"SUMPRODUCT(Inputs!$I$40:$I$41,Inputs!X$40:X$41)*INDEX(IF($D$53=\"Mid\",Inputs!$L$15:$V$15,Inputs!$L$16:$V$16),MATCH($C$53,Inputs!$L$14:$V$14,0))","v":0},{"$f":"SUMPRODUCT(Inputs!$I$40:$I$41,Inputs!Y$40:Y$41)*INDEX(IF($D$53=\"Mid\",Inputs!$L$15:$V$15,Inputs!$L$16:$V$16),MATCH($C$53,Inputs!$L$14:$V$14,0))","v":0},{"$f":"SUMPRODUCT(Inputs!$I$40:$I$41,Inputs!Z$40:Z$41)*INDEX(IF($D$53=\"Mid\",Inputs!$L$15:$V$15,Inputs!$L$16:$V$16),MATCH($C$53,Inputs!$L$14:$V$14,0))","v":0},{"$f":"SUMPRODUCT(Inputs!$I$40:$I$41,Inputs!AA$40:AA$41)*INDEX(IF($D$53=\"Mid\",Inputs!$L$15:$V$15,Inputs!$L$16:$V$16),MATCH($C$53,Inputs!$L$14:$V$14,0))","v":0},{"$f":"SUMPRODUCT(Inputs!$I$40:$I$41,Inputs!AB$40:AB$41)*INDEX(IF($D$53=\"Mid\",Inputs!$L$15:$V$15,Inputs!$L$16:$V$16),MATCH($C$53,Inputs!$L$14:$V$14,0))","v":0},{"$f":"SUMPRODUCT(Inputs!$I$40:$I$41,Inputs!AC$40:AC$41)*INDEX(IF($D$53=\"Mid\",Inputs!$L$15:$V$15,Inputs!$L$16:$V$16),MATCH($C$53,Inputs!$L$14:$V$14,0))","v":0},{"$f":"SUMPRODUCT(Inputs!$I$40:$I$41,Inputs!AD$40:AD$41)*INDEX(IF($D$53=\"Mid\",Inputs!$L$15:$V$15,Inputs!$L$16:$V$16),MATCH($C$53,Inputs!$L$14:$V$14,0))","v":0},{"$f":"SUMPRODUCT(Inputs!$I$40:$I$41,Inputs!AE$40:AE$41)*INDEX(IF($D$53=\"Mid\",Inputs!$L$15:$V$15,Inputs!$L$16:$V$16),MATCH($C$53,Inputs!$L$14:$V$14,0))","v":0},{"$f":"SUMPRODUCT(Inputs!$I$40:$I$41,Inputs!AF$40:AF$41)*INDEX(IF($D$53=\"Mid\",Inputs!$L$15:$V$15,Inputs!$L$16:$V$16),MATCH($C$53,Inputs!$L$14:$V$14,0))","v":0},{"$f":"SUMPRODUCT(Inputs!$I$40:$I$41,Inputs!AG$40:AG$41)*INDEX(IF($D$53=\"Mid\",Inputs!$L$15:$V$15,Inputs!$L$16:$V$16),MATCH($C$53,Inputs!$L$14:$V$14,0))","v":0},{"$f":"SUMPRODUCT(Inputs!$I$40:$I$41,Inputs!AH$40:AH$41)*INDEX(IF($D$53=\"Mid\",Inputs!$L$15:$V$15,Inputs!$L$16:$V$16),MATCH($C$53,Inputs!$L$14:$V$14,0))","v":0},{"$f":"SUM(E18:O18)","v":0}]
[null,"Sub-Total",{"$f":"Inputs!$H$4","v":"Real $2023"},"Dollars",{"$f":"SUM(E16:E18)","v":0},0,0,0,0,0,0,0,0,0,0,0]
[null,{"$f":"Inputs!B42","v":"Commercial"}]
{"$rows_left_out":36}
{"sheet":"Outputs","index":4,"n_rows":95,"n_cols":18,"rows_kept":95,"cut":false,"hidden":false,"merged":[]}
["Outputs"]
[]
[null,"PTRM and CPA"]
[]
[null,"Operating Costs - by driver",null,null,null,"2023-28 Regulatory Period",null,null,null,null,"2028-33 Regulatory Period",null,null,null,null,"Total","Total"]
[null,"Item","Dollar basis","Units",{"$f":"Inputs!L$14","v":2023},{"$f":"Inputs!M$14","v":2024},{"$f":"Inputs!N$14","v":2025},{"$f":"Inputs!O$14","v":2026},{"$f":"Inputs!P$14","v":2027},{"$f":"Inputs!Q$14","v":2028},{"$f":"Inputs!R$14","v":2029},{"$f":"Inputs!S$14","v":2030},{"$f":"Inputs!T$14","v":2031},{"$f":"Inputs!U$14","v":2032},{"$f":"Inputs!V$14","v":2033},"2023-28","All years"]
[]
[null,"Costs"]
[null,"Labour costs (excl labour escalation)",{"$f":"Inputs!$H$4","v":"Real $2023"},"$Million",{"$f":"Calculations!E41/10^6","v":0},{"$f":"Calculations!F41/10^6","v":0},{"$f":"Calculations!G41/10^6","v":0},{"$f":"Calculations!H41/10^6","v":0},{"$f":"Calculations!I41/10^6","v":0},{"$f":"Calculations!J41/10^6","v":0.49178788911785459},{"$f":"Calculations!K41/10^6","v":1.1148020357374735},{"$f":"Calculations!L41/10^6","v":2.5236517703542694},{"$f":"Calculations!M41/10^6","v":2.8321631635398723},{"$f":"Calculations!N41/10^6","v":3.449186100877911},{"$f":"Calculations!O41/10^6","v":3.449186100877911},{"$f":"SUM(F9:J9)","v":0.49178788911785459},{"$f":"SUM(E9:O9)","v":13.860777060505292}]
[null,"Non labour costs",{"$f":"Inputs!$H$4","v":"Real $2023"},"$Million",{"$f":"Calculations!E43/10^6","v":0},{"$f":"Calculations!F43/10^6","v":0},{"$f":"Calculations!G43/10^6","v":0},{"$f":"Calculations!H43/10^6","v":0},{"$f":"Calculations!I43/10^6","v":0},{"$f":"Calculations!J43/10^6","v":0.24800941131498469},{"$f":"Calculations!K43/10^6","v":1.6245510054693011},{"$f":"Calculations!L43/10^6","v":3.6216471065631612},{"$f":"Calculations!M43/10^6","v":4.1455561077393543},{"$f":"Calculations!N43/10^6","v":4.1663543048694418},{"$f":"Calculations!O43/10^6","v":4.1663543048694418},{"$f":"SUM(F10:J10)","v":0.24800941131498469},{"$f":"SUM(E10:O10)","v":17.972472240825685}]
[null,"Real input cost escalation",{"$f":"Inputs!$H$4","v":"Real $2023"},"$Million",{"$f":"Calculations!E42/10^6","v":0},{"$f":"Calculations!F42/10^6","v":0},{"$f":"Calculations!G42/10^6","v":0},{"$f":"Calculations!H42/10^6","v":0},{"$f":"Calculations!I42/10^6","v":0},{"$f":"Calculations!J42/10^6","v":1.4799930327470063E-3},{"$f":"Calculations!K42/10^6","v":1.1375987466806597E-2},{"$f":"Calculations!L42/10^6","v":4.4040708130831524E-2},{"$f":"Calculations!M42/10^6","v":7.0095637169263703E-2},{"$f":"Calculations!N42/10^6","v":0.11072194707274108},{"$f":"Calculations!O42/10^6","v":0.13625891107238602},{"$f":"SUM(F11:J11)","v":1.4799930327470063E-3},{"$f":"SUM(E11:O11)","v":0.37397318394477597}]
[]
[null,"Total (excluding debt raising costs)",{"$f":"Inputs!$H$4","v":"Real $2023"},"$Million",{"$f":"SUM(E9:E11)","v":0},0,0,0,0,0.74127729346558635,2.750729028673581,6.1893395850482618,7.0478149084484905,7.7262623528200942,7.7517993168197394,{"$f":"SUM(F13:J13)","v":0.74127729346558635},{"$f":"SUM(E13:O13)","v":32.207222485275757}]
[]
[null,"Debt Raising Costs",{"$f":"Inputs!$H$4","v":"Real $2023"},"$Million",{"$f":"Calculations!E46/10^6","v":0},{"$f":"Calculations!F46/10^6","v":0},{"$f":"Calculations!G46/10^6","v":2.3120939057149803E-3},{"$f":"Calculations!H46/10^6","v":4.1787954404232117E-3},{"$f":"Calculations!I46/10^6","v":4.6433114701321049E-3},{"$f":"Calculations!J46/10^6","v":1.4265432747821721E-2},{"$f":"Calculations!K46/10^6","v":0},{"$f":"Calculations!L46/10^6","v":0},{"$f":"Calculations!M46/10^6","v":0},{"$f":"Calculations!N46/10^6","v":0},{"$f":"Calculations!O46/10^6","v":0},{"$f":"SUM(F15:J15)","v":2.5399633564092021E-2},{"$f":"SUM(E15:O15)","v":2.5399633564092021E-2}]
[]
[null,"Total (including debt raising costs)",{"$f":"Inputs!$H$4","v":"Real $2023"},"$Million",{"$f":"E13+E15","v":0},0,2.3120939057149803E-3,4.1787954404232117E-3,4.6433114701321049E-3,0.75554272621340812,{"$f":"K13+K15","v":2.750729028673581},{"$f":"L13+L15","v":6.1893395850482618},{"$f":"M13+M15","v":7.0478149084484905},{"$f":"N13+N15","v":7.7262623528200942},{"$f":"O13+O15","v":7.7517993168197394},0.76667692702967838,32.232622118839849]
[]
[{"$f":"IF(SUM(E19:O19)=0,0,1)","v":0},"Check - Calculations",null,null,{"$f":"IF(ROUND(E13-Calculations!E44/10^6,3)=0,0,1)","v":0},{"$f":"IF(ROUND(F13-Calculations!F44/10^6,3)=0,0,1)","v":0},{"$f":"IF(ROUND(G13-Calculations!G44/10^6,3)=0,0,1)","v":0},{"$f":"IF(ROUND(H13-Calculations!H44/10^6,3)=0,0,1)","v":0},{"$f":"IF(ROUND(I13-Calculations!I44/10^6,3)=0,0,1)","v":0},{"$f":"IF(ROUND(J13-Calculations!J44/10^6,3)=0,0,1)","v":0},{"$f":"IF(ROUND(K13-Calculations!K44/10^6,3)=0,0,1)","v":0},{"$f":"IF(ROUND(L13-Calculations!L44/10^6,3)=0,0,1)","v":0},{"$f":"IF(ROUND(M13-Calculations!M44/10^6,3)=0,0,1)","v":0},{"$f":"IF(ROUND(N13-Calculations!N44/10^6,3)=0,0,1)","v":0},{"$f":"IF(ROUND(O13-Calculations!O44/10^6,3)=0,0,1)","v":0}]
[]
{"$rows_left_out":75}