{"text_format":"1","workbook":"xlsx","n_sheets":18,"sheets":["NOTES","Formulae","Model update","Metering","Prop2020DistTar","2020DistRevCapForm","2020DistTarRebalCont","Est2019DistRev","Prop2020TransTar","Est2019TransRev","2020TransRevCont","TUoS cost audit template","Prop2020JSTar","Est2019JSRev","2020JSRevCont","JS cost audit template","Prop2020TSSComp","Indicative prices for 2021"],"not_rendered":{"charts":0,"images":44,"macros":1,"external_links":0,"defined_names":79,"comments":6,"pivot_tables":0},"unopened":[],"bounds":{"document_bytes":16777216,"sheet_cells":100000,"rows_first":2000,"rows_last":500,"rows_between":2000,"halvings":0,"cell_chars":16384,"cell_head_chars":4096},"cells_cut":0,"cells_raw":0,"read":"whole","date_system":"1900"}

{"sheet":"NOTES","index":0,"n_rows":86,"n_cols":5,"rows_kept":86,"cut":false,"hidden":false,"merged":[]}
[]
["The model has actual and test data to illustrate the workings of the model.",null,null,{"$f":"'Model update'!C5","v":2020}]
[]
["Issue","Location","Item","Comment"]
[]
[1,"'Model update'!C25","CPI",{"$f":"\"Updated June \"&D2-1&\" CPI for \"&D2","v":"Updated June 2019 CPI for 2020"},"NOTE: This worksheet is programmed to update for each year - use as checklist and note any placeholders or changes"]
[null,null,null,null,"NOTE: Worksheet names in this file are programmed to update each year once each worksheet is accessed and a cell is selected"]
[{"$f":"A6+1","v":2},"'Model update'!G37:G41","Real Vanilla WACC (rvw)",{"$f":"\"Updated \"&$D$2&\" values\"","v":"Updated 2020 values"}]
[]
[{"$f":"A8+1","v":3},"'Model update'!G54:G58",{"$f":"\"DuoS Xt for \"&D2","v":"DuoS Xt for 2020"},{"$f":"\"Updated \"&$D$2&\" values \"","v":"Updated 2020 values "}]
[]
[{"$f":"A10+1","v":4},"'Model update'!G66:G70",{"$f":"\"Metering Xt for \"&D2","v":"Metering Xt for 2020"},{"$f":"\"Updated \"&$D$2&\" values \"","v":"Updated 2020 values "}]
[]
[{"$f":"A12+1","v":5},"'Model update'!H79:H83","Real Pre-tax WACC (rptw)",{"$f":"\"Updated \"&$D$2&\" values \"","v":"Updated 2020 values "}]
[]
[{"$f":"A14+1","v":6},"'Model update'!G94:G98",{"$f":"\"f factor (t) \"&D2","v":"f factor (t) 2020"},"Updated 2020 values"]
[]
[{"$f":"A16+1","v":7},"'Model update'!G105:G109",{"$f":"\"S factor (t) \"&D2","v":"S factor (t) 2020"},"Updated 2020 values"]
[]
[{"$f":"A18+1","v":8},"'Model update'!G116:G120",{"$f":"\"Pass through amounts (t) \"&D2","v":"Pass through amounts (t) 2020"},{"$f":"\"NIL for \"&D2","v":"NIL for 2020"}]
[]
[{"$f":"A20+1","v":9},"'Model update'!G127:G131",{"$f":"\"Licence Fee (t-1) \"&$D$2-2&\"-\"&$D$2-1","v":"Licence Fee (t-1) 2018-2019"},{"$f":"\"Placeholders used, \"&D2-1&\" figures escalated\"","v":"Placeholders used, 2019 figures escalated"}]
[]
[{"$f":"A22+1","v":10},"Metering!E8:E11",{"$f":"\"Metering - \"&D2-1&\" tariffs\"","v":"Metering - 2019 tariffs"},{"$f":"\"Updated from \"&D2-1&\" model\"","v":"Updated from 2019 model"}]
[null,"Metering!E32","Metering - Table 2 - B factor t-1"]
[null,"Metering!D36","Metering - Table 3 - t-1 AAR"]
[null,"Metering!D53:D54","Metering - Table 4 - T factor and AAR t-2"]
[null,"Metering!D68","Metering - Table 5 - U/O balance b/f"]
[null,{"$f":"\"'\"&$D$2&\" Unmetered supply'!C7:E7\"","v":"'2020 Unmetered supply'!C7:E7"},{"$f":"\"Unmetered Supply - \"&D2-1&\" tariffs\"","v":"Unmetered Supply - 2019 tariffs"}]
[]
[{"$f":"A24+1","v":11},"Metering!D49","Metering - Table 4 - t-2 revenue",{"$f":"\"Updated from \"&$D$2-2&\" Annual RIN\"","v":"Updated from 2018 Annual RIN"}]
[null,{"$f":"\"'\"&$D$2&\" Unmetered supply'!M7\"","v":"'2020 Unmetered supply'!M7"},"Unmetered Supply - public lights t-2"]
[]
[{"$f":"A31+1","v":12},{"$f":"\"'\"&$D$2&\"DistRevCapForm'!H21\"","v":"'2020DistRevCapForm'!H21"},"Dist - Table 3 - t-2 AAR",{"$f":"\"Updated from \"&$D$2-1&\" model\"","v":"Updated from 2019 model"}]
[null,{"$f":"\"'\"&$D$2&\"DistRevCapForm'!H28\"","v":"'2020DistRevCapForm'!H28"},"Dist - Table 4 - t-1 approved under/over recovery"]
[null,{"$f":"\"'\"&$D$2&\"DistRevCapForm'!C55\"","v":"'2020DistRevCapForm'!C55"},"Dist - Table 6 - Licence fee t-2"]
[null,{"$f":"\"'\"&$D$2&\"DistRevCapForm'!C57\"","v":"'2020DistRevCapForm'!C57"},"Dist - Table 6 - Pass through (2014/15)"]
[null,{"$f":"\"'\"&$D$2&\"DistRevCapForm'!C71\"","v":"'2020DistRevCapForm'!C71"},"Dist - Table 7 - U/O balance b/f"]
[null,{"$f":"\"Est\"&$D$2-1&\"DistRev!D6:P35\"","v":"Est2019DistRev!D6:P35"},{"$f":"\"Dist - \"&D2-1&\" tariffs\"","v":"Dist - 2019 tariffs"}]
[null,{"$f":"\"Est\"&$D$2-1&\"DistRev!R6:AD35\"","v":"Est2019DistRev!R6:AD35"},{"$f":"\"Dist - Estimated \"&D2-1&\" quantities\"","v":"Dist - Estimated 2019 quantities"}]
[]
[{"$f":"A34+1","v":13},{"$f":"\"'\"&$D$2&\"DistRevCapForm'!C47\"","v":"'2020DistRevCapForm'!C47"},"Dist - Table 6 - t-2 revenue",{"$f":"\"Updated from \"&$D$2-2&\" Annual RIN\"","v":"Updated from 2018 Annual RIN"}]
[]
[{"$f":"A42+1","v":14},{"$f":"\"'\"&$D$2&\"TransRevCont'!C20:C23\"","v":"'2020TransRevCont'!C20:C23"},"Trans - Table 3 - Trans charges forecasts t",{"$f":"\"Updated from \"&$D$2-1&\" model\"","v":"Updated from 2019 model"}]
[null,{"$f":"\"'\"&$D$2&\"TransRevCont'!D42:D45\"","v":"'2020TransRevCont'!D42:D45"},"Trans - Table 4 - Trans charges estimates t-1"]
[null,{"$f":"\"'\"&$D$2&\"TransRevCont'!C60\"","v":"'2020TransRevCont'!C60"},"Trans - Table 5 - U/O balance b/f"]
[null,{"$f":"\"Est\"&$D$2-1&\"TransRev!D6:P35\"","v":"Est2019TransRev!D6:P35"},{"$f":"\"Trans - \"&D2-1&\" tariffs\"","v":"Trans - 2019 tariffs"}]
[null,{"$f":"\"Est\"&$D$2-1&\"TransRev!R6:AD35\"","v":"Est2019TransRev!R6:AD35"},{"$f":"\"Trans - Estimated \"&D2-1&\" quantities\"","v":"Trans - Estimated 2019 quantities"}]
[]
[{"$f":"A44+1","v":15},{"$f":"\"'\"&$D$2&\"TransRevCont'!C34\"","v":"'2020TransRevCont'!C34"},"Trans - Table 4 - t-2 revenue",{"$f":"\"Updated from \"&$D$2-2&\" Annual RIN\"","v":"Updated from 2018 Annual RIN"}]
[null,"TUoS cost audit template'!F4","Trans - t-2 AEMO charges"]
[null,"TUoS cost audit template'!F11:F12","Trans - t-2 connection charges"]
[null,"TUoS cost audit template'!C20:E22","Trans - t-2 internetwork charges"]
[null,"TUoS cost audit template'!F29","Trans - t-2 embedded generators"]
[]
[{"$f":"A50+1","v":16},{"$f":"\"'\"&$D$2&\"JSRevCont'!C20:C21\"","v":"'2020JSRevCont'!C20:C21"},"JUoS - Table 3 - FiT charges forecasts t",{"$f":"\"Updated from \"&$D$2-1&\" model\"","v":"Updated from 2019 model"}]
[null,{"$f":"\"'\"&$D$2&\"JSRevCont'!D40:D41\"","v":"'2020JSRevCont'!D40:D41"},"JUoS - Table 4 - FiT charges estiamtes t-1"]
[null,{"$f":"\"'\"&$D$2&\"JSRevCont'!C56\"","v":"'2020JSRevCont'!C56"},"JUoS - Table 5 - U/O blance b/f"]
[null,{"$f":"\"Est\"&$D$2-1&\"JSRev!D6:P54\"","v":"Est2019JSRev!D6:P54"},{"$f":"\"JUoS - \"&D2-1&\" tariffs\"","v":"JUoS - 2019 tariffs"}]
[null,{"$f":"\"Est\"&$D$2-1&\"JSRev!R6:AD54\"","v":"Est2019JSRev!R6:AD54"},{"$f":"\"JUoS - Estimated \"&D2-1&\" quantities\"","v":"JUoS - Estimated 2019 quantities"}]
[]
[{"$f":"A56+1","v":17},{"$f":"\"'\"&$D$2&\"JSRevCont'!C32\"","v":"'2020JSRevCont'!C32"},"JUoS - Table 4 - t-2 revenue",{"$f":"\"Updated from \"&$D$2-2&\" Annual RIN\"","v":"Updated from 2018 Annual RIN"}]
[null,"JS cost audit template'!F4:F5","JUoS - t-2 FiT charges"]
[]
[{"$f":"A62+1","v":18},{"$f":"\"Prop\"&D2&\"TSSComp!R6:AD54\"","v":"Prop2020TSSComp!R6:AD54"},{"$f":"\"Indicative \"&D2&\" tariffs\"","v":"Indicative 2020 tariffs"},{"$f":"\"Updated from \"&$D$2-1&\" model\"","v":"Updated from 2019 model"}]
[]
["DNSP required to populate/update with relevant data:"]
[]
[{"$f":"A65+1","v":19},{"$f":"\"'Indicative prices for \"&D2+1&\"'!A1:O65\"","v":"'Indicative prices for 2021'!A1:O65"},{"$f":"\"TSS indicative prices for \"&D2+1","v":"TSS indicative prices for 2021"},"DNSP required to populate with relevant data"]
[]
[{"$f":"A69+1","v":20},"The following is test data to illustrate the workings of the model.",null,"Input data required from DNSPs"]
[null,"Metering!D8:D11",{"$f":"\"Proposed Metering Tariffs P(t) for \"&D2","v":"Proposed Metering Tariffs P(t) for 2020"}]
[null,"Metering!F8:F11",{"$f":"\"Forecast Quantities (Qt) for \"&D2","v":"Forecast Quantities (Qt) for 2020"}]
[null,"Metering!D80:D83",{"$f":"\"Estimated Quantities (Qt-1) for \"&D2-1","v":"Estimated Quantities (Qt-1) for 2019"}]
[]
[null,{"$f":"\"'Prop\"&$D$2&\"DistTar!D6:P54\"","v":"'Prop2020DistTar!D6:P54"},{"$f":"\"Proposed Distribution Tariffs (Pt) for \"&D2","v":"Proposed Distribution Tariffs (Pt) for 2020"}]
[null,{"$f":"\"'Prop\"&$D$2&\"DistTar!AF6:AR54\"","v":"'Prop2020DistTar!AF6:AR54"},{"$f":"\"Forecast Quantities (Qt) for \"&D2","v":"Forecast Quantities (Qt) for 2020"}]
[null,{"$f":"\"Est\"&$D$2-1&\"DistRev!R6:AD54\"","v":"Est2019DistRev!R6:AD54"},{"$f":"\"Estimated Distribution Quantities (Qt-1) for \"&D2-1","v":"Estimated Distribution Quantities (Qt-1) for 2019"}]
[]
[null,{"$f":"\"'Prop\"&D2&\"TransTar!D6:P54\"","v":"'Prop2020TransTar!D6:P54"},{"$f":"\"Proposed Transmission Tariffs (Pt) for \"&D2","v":"Proposed Transmission Tariffs (Pt) for 2020"}]
[null,{"$f":"\"'\"&$D$2&\"TransRevCont'!C20:C23\"","v":"'2020TransRevCont'!C20:C23"},"Table 3 - Transmission charges for year t"]
[null,{"$f":"\"'\"&$D$2&\"TransRevCont'!D42:D45\"","v":"'2020TransRevCont'!D42:D45"},"Transmission charges for year t-1"]
[]
[null,{"$f":"\"'Prop\"&D2&\"JSTar!D6:P54\"","v":"'Prop2020JSTar!D6:P54"},{"$f":"\"Proposed Jurisdictional scheme Tariffs (Pt) for \"&D2","v":"Proposed Jurisdictional scheme Tariffs (Pt) for 2020"}]
[null,{"$f":"\"'\"&$D$2&\"JSRevCont'!C20:C21\"","v":"'2020JSRevCont'!C20:C21"},"Table 3 - PFIT & TFIT charges for year t"]
[null,{"$f":"\"'\"&$D$2&\"JSRevCont'!D40:D41\"","v":"'2020JSRevCont'!D40:D41"},"PFIT & TFIT charges for year t-1"]

{"sheet":"Formulae","index":1,"n_rows":239,"n_cols":11,"rows_kept":239,"cut":false,"hidden":false,"merged":[[83,7,84,7],[113,7,114,7],[139,7,140,7],[220,7,221,7]]}
[]
[null,"DUoS"]
[null,"Figure 14.1 Revenue cap formulae"]
[null,"(1)   ",null,null,null,null,null,"i=1,..,n and j=1,..,m and t=1,..,5"]
[null,"(2)   ",null,null,null,null,null,"t = 1,2,…,5"]
[null,"(3)   ",null,null,null,null,null,"t = 1"]
[null,"(4)   ",null,null,null,null,null,"t = 2,…,5"]
[]
[null,"where;"]
[null,null," is the total annual revenue in year t."]
[null,null,null,"is the price of component 'j' of tariff 'i' in year t."]
[null,null,null,"is the forecast quantity of component 'j' of tariff 'i' in year t."]
[null," ","is the adjusted annual smoothed revenue requirement for year t."]
[null," ",null,"is the annual adjustment f–factor scheme amount in year t. This amount will be calculated as per the method set out in the relevant f–factor scheme."]
[null,null,null,"is the sum of:"]
[null,"·        the final carryover amount from the application of the DMIS from the 2011–15 regulatory control period. This amount will be calculated using the method set out in the DMIS and will be deducted from/added to allowed revenue in the 2017 pricing proposal."]
[null,null,null,"is the sum of:"]
[null,"·        the recovery of license fee charges by the Victorian Essential Services Commission indexed by one and a half years of interest, calculated using the following method:"]
[]
[null,"where:"]
[null,null," are the licence fees paid by DNSP to the Victorian Essential Services Commission in the financial year ending in June of regulatory year t–1,"]
[null,null,"is the approved nominal weighted average cost of capital  (WACC) for the relevant regulatory year using the following method:"]
[]
[]
[null,"·        any under or over recovery of actual revenue collected through DUoS charges in regulatory year t–2 as calculated using the method in appendix A,"]
[null,"·        the AER approved pass through amounts (positive or negative) with respect to regulatory year t."]
[null,null,"is the annual smoothed revenue requirement as stated in the Post Tax Revenue Model (PTRM) for year t (when year t is the first year of the 2016–20 regulatory control period).[43]"]
[null," ","is the s‑factor determined in accordance with the service target performance incentive scheme (STPIS) for regulatory year t.[44]"]
[null,null," is the annual percentage change in the ABS CPI All Groups, Weighted Average of Eight Capital Cities[45] from the June quarter in year t–2 to the June quarter in year t–1, calculated using the following method :"]
[null,"The ABS CPI All Groups, Weighted Average of Eight Capital Cities for the June quarter in regulatory year t–1"]
[null,"divided by"]
[null,"The ABS CPI All Groups, Weighted Average of Eight Capital Cities for the June quarter in regulatory year t–2"]
[null,"minus one."]
[null,"For example, for the 2017 regulatory year, t–2 is June quarter 2015 and t–1 is June quarter 2016 and for the 2018 regulatory year, t–2 is June quarter 2016 and t–1 is June quarter 2017 and so on."]
[null," ","is the X factor for each year of the 2016–20 regulatory control period as determined in the PTRM, and annually revised for the return on debt update in accordance with the formula specified in attachment 3—rate of return—calculated for the relevant year."]
[]
[]
[null,"[43] ","Our final F&A stated that if necessary an adjustment for inflation may be required to the annual smoothed revenue requirement for year t. However, as the annual smoothed revenue requirement for year t as stated in our preliminary decision PTRM is in nominal dollars there is no need to adjust it for inflation. This approach is consistent with past regulatory practice."]
[null,"[44] ","For the first two regulatory years of the 2016–20 regulatory control period, the value of St is to be adjusted to account for the change in revenue requirements between the regulatory control periods, as explained in attachment 11. In the formulas in the STPIS, the AR(t+1) is equivalent to ARt in this formula. Calculations of the S factor adjustment are to be made accordingly."]
[null,"[45] ","If the ABS does not or ceases to publish the index, then CPI will mean an index which the AER considers is the best available alternative index"]
[]
[]
[]
[null,"Figure 14.2 Side constraints [46]"]
[]
[]
[]
[]
[]
[null,null,"where each tariff class has \"n\" tariffs, with each up to \"m\" components, and where:"]
[null,null,null,"is the proposed price for component ‘j’ of tariff 'i' for year t."]
[null,null,"is the price charged for component ‘j’ of tariff 'i' in year t–1."]
[null,null,null,"is the forecast quantity of component ‘j’ of tariff 'i' in year t."]
[null,null," is the annual percentage change in the ABS CPI All Groups, Weighted Average of Eight Capital Cities[4] from the June quarter in year t–2 to the June quarter in year t–1, calculated using the following method :"]
[null,null,"The ABS CPI All Groups, Weighted Average of Eight Capital Cities[47] for the June quarter in regulatory year t–1"]
[null,null,"divided by"]
[null,null,"The ABS CPI All Groups, Weighted Average of Eight Capital Cities for the June quarter in regulatory year t–2"]
[null,null,"minus one."]
[null,"For example, for the 2017 regulatory year, t–2 is June quarter 2015 and t–1 is June quarter 2016 and for the 2018 regulatory year, t–2 is June quarter 2016 and t–1 is June quarter 2017 and so on."]
[null,null,null,"is the X factor for each year of the 2016–20 regulatory control period as determined in the PTRM, and annually revised for the return on debt update in accordance with the formula specified in attachment 3—rate of return—calculated for the relevant year. If X>0, then X will be set equal to zero for the purposes of the side constraint formula."]
[null," ","is the s‑factor determined in accordance with the STPIS for regulatory year t.[5]"]
[null,null,null,"is the annual percentage change from the f–factor scheme amount in year t. This amount will be calculated as per the method set out in attachment 19—f–factor scheme."]
[null,null,null,"is the annual percentage change from the final carryover amount from the application of the DMIS from the 2011–15 regulatory control period. This amount will be calculated using the method set out in the DMIS and will be deducted from/added to allowed revenue in the 2017 pricing proposal."]
[null,null,null,"is annual percentage change from the sum of:"]
[null,"·        the recovery of license fee charges by the Victorian Essential Services Commission indexed by one and a half years of interest, calculated using the following method:"]
[]
[null,"where:"]
[null," are the licence fees paid byDNSP to the Victorian Essential Services Commission in the financial year ending in June of regulatory year t–1,"]
[null," ","is the approved nominal weighted average cost of capital (WACC) for the relevant regulatory year using the following method:"]
[]
[]
[null,"where the "]
[null," is as set out in our final decision PTRM and updated annually"]
[null,"·        the AER approved pass through amounts (positive or negative) with respect to regulatory year t."]
[null,"With the exception of the CPI, X factor and S factor, the percentage for each of the other factors above can be calculated by dividing the incremental revenues (as used in the total annual revenue formula) for each factor by the expected revenues for regulatory year t–1 (based on the prices in year t–1 multiplied by the forecast quantities for year t)."]
[]
[null,"[46] ","All parameters are in nominal terms unless otherwise specified."]
[null,"[47] ","If the ABS does not or ceases to publish the index, then CPI will mean an index which the AER considers is the best available alternative index."]
[]
[]
[]
[]
[null,null,null,null,null,null,null,"Table 14.1","Example calculation of DUoS unders and overs account ($'000, nominal)"]
[null,null,null,null,null,null,null,null,"Year t–2","Year t–1","Year t"]
[null,null,null,null,null,null,null,null,"(actual)","(estimate)","(forecast)"]
[null,null,null,null,null,null,null,"(A) Revenue from DUoS charges","46 779","40 269","39 510"]
[null,null,null,null,null,null,null,"(B) Less TAR for regulatory year =","43 039","41 427","44 429"]
[null,null,null,null,null,null,null,"+ Adjusted annual smoothed revenues (AARt)","40 189","41 393","44 393"]
[null,null,null,null,null,null,null,"+ f–factor scheme amount (It)  ","–12",10,14]
[null,null,null,null,null,null,null,"+ DMIS carryover amount (Tt) ",1013,0,0]
[null,null,null,null,null,null,null,"+ Annual adjustments (Bt)a =","1849",24,22]
[null,null,null,null,null,null,null,"+ License fee recovery",25,24,22]
[null,null,null,null,null,null,null,"+ Approved pass through amounts",1824,0,0]
[]
[null,null,null,null,null,null,null,"(A minus B) Under/over recovery of revenue for regulatory year",3740,"–1158","–4919b"]
[]
[null,null,null,null,null,null,null,"DUoS unders and overs account"]
[null,null,null,null,null,null,null,"Nominal WACC (per cent)",0.05,5.5E-2,0.06]
[null,null,null,null,null,null,null,"Opening balance",1737,"5656c",4778]
[null,null,null,null,null,null,null,"Interest on opening balance",87,311,287]
[null,null,null,null,null,null,null,"Under/over recovery of revenue for regulatory year",3740,"–1158","–4919b"]
[null,null,null,null,null,null,null,"Interest on under/over recovery for regulatory year",92,"–31","–145"]
[null,null,null,null,null,null,null,"Closing balance",5656,4778,"0d"]
[null,null,null,null,null,null,"Notes:","(a) Bt parameter calculations in the DUoS unders and overs account exclude approved DUoS revenue under/over recovery for regulatory year."]
[null,null,null,null,null,null,null,"(b) Approved DUoS revenue under/over recovery for regulatory year t."]
[null,null,null,null,null,null,null,"(c) Opening balance is the previous year's closing balance."]
[null,null,null,null,null,null,null,"(d) The DNSP is expected to achieve a closing balance as close to zero as practicable in its DUoS unders and overs account in each forecast year in its annual pricing proposals in the 2016–20 regulatory control period."]
[]
[]
[]
[]
[]
[null,null,null,null,null,null,null,"Table 14.2","Example calculation of designated pricing proposal charges unders and overs account ($'000, nominal)"]
[null,null,null,null,null,null,null,null,"Year t–2","Year t–1","Year t"]
[null,null,null,null,null,null,null,null,"(actual)","(estimate)","(forecast)"]
[null,null,null,null,null,null,null,"(A) Revenue from designated pricing proposal charges (DPPC)","40 077","34 944","36 609"]
[null,null,null,null,null,null,null,"(B) Less DPPC related payments for regulatory year =","34 365","38 734","39 200"]
[null,null,null,null,null,null,null,"+ DPPC charges to be paid to TNSP","33 672","37 933","38 000"]
[null,null,null,null,null,null,null,"+ Avoided TUoS/DPPC payments",572,734,800]
[null,null,null,null,null,null,null,"+ Inter–distributor payments",121,67,400]
[]
[null,null,null,null,null,null,null,"(A minus B) Under/over recovery of revenue for regulatory year",5712,"–3790","–2540a"]
[]
[null,null,null,null,null,null,null,"DPPC unders and overs account"]
[null,null,null,null,null,null,null,"Nominal WACC (per cent)",0.05,5.5E-2,0.06]
[null,null,null,null,null,null,null,"Opening balance",167,"6028b",2467]
[null,null,null,null,null,null,null,"Interest on opening balance",8,332,148]
[null,null,null,null,null,null,null,"Under/over recovery of revenue for regulatory year",5712,"–3790","–2540a"]
[null,null,null,null,null,null,null,"Interest on under/over recovery for regulatory year",141,"–103","–75"]
[null,null,null,null,null,null,null,"Closing balance",6028,2467,"0c"]
[null,null,null,null,null,null,"Notes:","(a) Approved DPPC revenue under/over recovery for regulatory year t."]
[null,null,null,null,null,null,null,"(b) Opening balance is the previous year's closing balance."]
[null,null,null,null,null,null,null,"(c)The DNSP is expected to achieve a closing balance as close to zero as practicable in its DPPC unders and overs account in each forecast year in its annual pricing proposals in the 2016–20 regulatory control period."]
[]
[]
[]
[]
[]
[null,null,null,null,null,null,null,"Table 14.3 Example calculation of jurisdictional scheme amounts unders and overs account ($'000, nominal)"]
[null,null,null,null,null,null,null,null,"Year t–2","Year t–1","Year t"]
[null,null,null,null,null,null,null,null,"(actual)","(estimate)","(forecast)"]
[null,null,null,null,null,null,null,"(A) Revenue from jurisdictional schemes","19 777","23 121","26 965"]
[null,null,null,null,null,null,null,"(B) Less jurisdictional scheme payments for regulatory year =","20 272","20 959","28 641"]
[null,null,null,null,null,null,null,"+ Jurisdictional scheme 1 payments","14 159","13 954","13 961"]
[null,null,null,null,null,null,null,"+ Jurisdictional scheme 2 payments","6113",7005,"14 680"]
[]
[null,null,null,null,null,null,null,"(A minus B) Under/over recovery of revenue for regulatory year","–495",2162,"–1676a"]
[]
[null,null,null,null,null,null,null,"Jurisdictional scheme amount unders and overs account"]
[null,null,null,null,null,null,null,"Nominal WACC (per cent)",0.05,5.5E-2,0.06]
[null,null,null,null,null,null,null,"Opening balance","–52","–562b",1628]
[null,null,null,null,null,null,null,"Interest on opening balance","–3","–31",98]
[null,null,null,null,null,null,null,"Under/over recovery of revenue for regulatory year","–495",2162,"–1676a"]
[null,null,null,null,null,null,null,"Interest on under/over recovery for regulatory year","–12",59,"–50"]
[null,null,null,null,null,null,null,"Closing balance","–562",1628,"0c"]
[null,null,null,null,null,null,"Notes:","(a) Approved jurisdictional scheme amounts revenue under/over recovery for regulatory year t."]
[null,null,null,null,null,null,null,"(b) Opening balance is the previous year's closing balance."]
[null,null,null,null,null,null,null,"(c) The DNSP is expected to achieve a closing balance as close to zero as practicable in its jurisdictional scheme amount unders and overs account in each forecast year in its annual pricing proposals in the 2016–20 regulatory control period."]
[]
[]
[]
[]
[]
[]
[]
[null,"Metering"]
[null,"Figure 16.3","Annual metering charges revenue cap formula"]
["(1)   ",null,null,null,null,null,null,"i=1,..,n and j=1,..,m and t=1,..,5"]
[]
["(2)   ",null,null,null,null,null,null,"t = 1,2,…,5"]
[]
["(3)   ",null,null,null,null,null,null,"t = 1,2,…,5"]
[]
[]
[null,"where;"]
[null," ","is the total annual revenue for annual metering charges in year t."]
[null,null,null,null,"is the price of component 'j' of metering service 'i' in year t."]
[null,null,null,null,"is the forecast quantity of component 'j' of metering service 'i' in year t."]
[null,null,null,"is the annual revenue requirement for year t. When year t is the first year of the 2016–20 regulatory control period,"]
[null,null,null," is the annual revenue requirement in the annual metering charges Post Tax Revenue Model (PTRM) for year t."]
[null,null,null,null,"is equal to zero for all years except 2017 and is a once off adjustment to 2017 charges for the unders and overs recoveries relating to Advanced Metering Infrastructure actual revenues and actual costs incurred in 2014 and 2015."]
[null,null,null,null,"is the sum of annual adjustment factors in year t as calculated in the unders and overs account in appendix C."]
[]
[null,null,null,"is the annual revenue requirement for year t–1."]
[null," ","is the annual percentage change in the ABS CPI All Groups, Weighted Average of Eight Capital Cities[39] from the June quarter in year t–2 to the June quarter in year t–1, calculated using the following method:"]
[null,"The ABS CPI All Groups, Weighted Average of Eight Capital Cities for the June quarter in regulatory year t–1"]
[null,"divided by"]
[null,"The ABS CPI All Groups, Weighted Average of Eight Capital Cities for the June quarter in regulatory year t–2"]
[null,"minus one."]
[null,"For example, for the 2017 regulatory year, t–2 is June quarter 2015 and t–1 is June quarter 2016 and for the 2018 regulatory year, t–2 is June quarter 2016 and t–1 is June quarter 2017 and so on."]
[null," ",null,"is the X factor for each year of the 2016–20 regulatory control period as determined in the annual metering charges PTRM."]
[]
[]
[null,"[39] ","If the ABS does not or ceases to publish the index, then CPI will mean an index which the AER considers is the best available alternative index"]
[]
[]
[]
[]
[null,"Figure 16.4 Side constraints"]
[]
[null,"where:"]
[null,null,null,null,"is the price of annual metering charges service 'i' in year t."]
[null,null,null,"is the price of annual metering charges service 'i' in year t–1."]
[null," ","is the annual percentage change in the ABS CPI All Groups, Weighted Average of Eight Capital Cities from the June quarter in year t–2 to the June quarter in year t–1, calculated using the following method:"]
[null,"The ABS CPI All Groups, Weighted Average of Eight Capital Cities[40] for the June quarter in regulatory year t–1"]
[null,"divided by"]
[null,"The ABS CPI All Groups, Weighted Average of Eight Capital Cities for the June quarter in regulatory year t–2"]
[null,"minus one."]
[null,"For example, for the 2017 regulatory year, t–2 is June quarter 2015 and t–1 is June quarter 2016 and for the 2018 regulatory year, t–2 is June quarter 2016 and t–1 is June quarter 2017 and so on."]
[null," ",null,"is the X factor for each year of the 2016–20 regulatory control period as determined in the annual metering charges PTRM."]
[null,null,null,null,"is the annual percentage change for the unders and overs recoveries relating to Advanced Metering Infrastructure actual revenues and actual costs incurred in 2014 and 2015. It is equal to zero for all years except 2017 and is a once off adjustment to 2017 charges."]
[null,null,null,null,"is the annual percentage change from the sum of annual adjustment factors in year t as calculated in the unders and overs account in appendix C."]
[null,"With the exception of the CPI and the X factor, the percentage for each of the other factors above can be calculated by dividing the incremental revenues (as used in the total annual revenue formula) for each factor by the expected revenues for regulatory year t–1 (based on the prices in year t–1 multiplied by the forecast quantities for year t)."]
[]
[null,"[40] ","If the ABS does not or ceases to publish the index, then CPI will mean an index which the AER considers is the best available alternative index."]
[]
[]
[]
[]
[null,null,null,null,null,null,null,"Table 16.xx","Example calculation of annual metering charges unders and overs account ($'000, nominal)"]
[null,null,null,null,null,null,null,null,"Year t–2","Year t–1","Year t"]
[null,null,null,null,null,null,null,null,"(actual)","(estimate)","(forecast)"]
[null,null,null,null,null,null,null,"(A) Revenue from annual metering charges","8 449","7 389","6 460"]
[null,null,null,null,null,null,null,"(B) Less TARM for regulatory year =","7 366","7 422","7 573"]
[null,null,null,null,null,null,null,"+ Annual revenue requirement (ARt)","7 349","7 412","7 559"]
[null,null,null,null,null,null,null,"+ T factor (Tt) – true‑ups relating to the AMI–Order in Council  ","17",10,14]
[]
[null,null,null,null,null,null,null,"(A minus B) Under/over recovery of revenue for regulatory year","1 083","–33","–1 113a"]
[]
[null,null,null,null,null,null,null,"Annual metering charges unders and overs account"]
[null,null,null,null,null,null,null,"Nominal WACC (per cent)",0.05,5.5E-2,0.06]
[null,null,null,null,null,null,null,"Opening balance","–50","1 057b","1 081"]
[null,null,null,null,null,null,null,"Interest on opening balance","–3",58,65]
[null,null,null,null,null,null,null,"Under/over recovery of revenue for regulatory year","1 083","–33","–1 113b"]
[null,null,null,null,null,null,null,"Interest on under/over recovery for regulatory year",27,"–1","–33"]
[null,null,null,null,null,null,null,"Closing balance","1 057","1 081","0c"]
[null,null,null,null,null,null,"Notes:","(a) Approved annual metering charges revenue under/over recovery for regulatory year t. This is the Bt parameter in the annual metering charges revenue cap formula."]
[null,null,null,null,null,null,null,"(b) Opening balance is the previous year's closing balance."]
[null,null,null,null,null,null,null,"(c) The DNSP is expected to achieve a closing balance as close to zero as practicable in its annual metering charges unders and overs account in each forecast year in its annual pricing proposals in the 2016–20 regulatory control period."]

{"sheet":"Model update","index":2,"n_rows":292,"n_cols":14,"rows_kept":292,"cut":false,"hidden":false,"merged":[]}
[]
[]
["Tariff Approval Template for ",null,{"$f":"A38","v":"CitiPower"}]
[]
["calendar year commencing",null,2020]
[]
["t","=",{"$f":"C5","v":2020}]
["t-1","=",{"$f":"C7-1","v":2019}]
["t-2","=",2018]
["t-3","=",2017]
["t-4","=",2016]
[]
["Please fill in yellow highlighted cells where appropriate"]
[]
["CPI","The ABS changed the index reference base in September 2012 from 1989-90 to 2011-12."]
["CPI Index Sept 2011",null,99.8]
["CPI Index Sept 2012",null,101.8,null,"CPI 2013",{"$f":"C17/C16-1","v":2.0040080160320661E-2}]
["CPI Index Sept 2013",null,104,null,"CPI 2014",{"$f":"C18/C17-1","v":2.16110019646365E-2}]
["CPI Index Sept 2014",null,106.4,null,"CPI 2015",{"$f":"C19/C18-1","v":2.3076923076923217E-2}]
["CPI Index Sept 2015",null,108,null,"CPI 2016",{"$f":"C20/C19-1","v":1.5037593984962294E-2}]
["CPI Index June 2015",null,107.5]
["CPI Index June 2016",null,108.6,null,"CPI 2017",{"$f":"IF(OR(C21=\"\",C22=\"\"),0,C22/C21-1)","v":1.0232558139534831E-2}]
["CPI Index June 2017",null,110.7,null,"CPI 2018",{"$f":"IF(OR(C22=\"\",C23=\"\"),0,C23/C22-1)","v":1.9337016574585641E-2}]
["CPI Index June 2018",null,113,null,"CPI 2019",2.0776874435411097E-2]
["CPI Index June 2019",null,114.8,null,"CPI 2020",1.5929203539823078E-2]
[]
[]
[{"$f":"\"CPI \" &$C$9","v":"CPI 2018"},null,{"$f":"VLOOKUP(A28,E$17:F$25,2,FALSE)","v":1.9337016574585641E-2},"(t-2)"]
[{"$f":"\"CPI \" &$C$8","v":"CPI 2019"},null,{"$f":"VLOOKUP(A29,E$17:F$25,2,FALSE)","v":2.0776874435411097E-2},"(t-1)"]
[{"$f":"\"CPI \" &$C$5","v":"CPI 2020"},null,1.5929203539823078E-2,"(t)"]
[]
[]
[]
[]
["Real Vanilla WACC (rvw)"]
[{"$f":"\"rvw for \"&C$5","v":"rvw for 2020"},null,null,"rvw for 2016","rvw for 2017","rvw for 2018","rvw for 2019","rvw for 2020"]
[{"$f":"$A$54","v":"Jemena"},{"$f":"HLOOKUP($A$36,$D$36:$H$41,2,FALSE)","v":3.6561951019833616E-2},null,3.9328628706946173E-2,3.8730571453602453E-2,3.8214665412155749E-2,3.7669116070430331E-2,3.6561951019833616E-2]
[{"$f":"$A$55","v":"CitiPower"},{"$f":"HLOOKUP($A$36,$D$36:$H$41,3,FALSE)","v":3.3621044143256104E-2},null,3.6700024103140591E-2,3.6127568814887212E-2,3.5630478851561828E-2,3.5080474747029383E-2,3.3621044143256104E-2]
[{"$f":"$A$56","v":"Powercor"},{"$f":"HLOOKUP($A$36,$D$36:$H$41,4,FALSE)","v":3.3621044143256104E-2},null,3.6700024103140591E-2,3.6127568814887212E-2,3.5630478851561828E-2,3.5080474747029383E-2,3.3621044143256104E-2]
[{"$f":"$A$57","v":"AusNet Services"},{"$f":"HLOOKUP($A$36,$D$36:$H$41,5,FALSE)","v":3.625857577663285E-2},null,3.8716794887975373E-2,3.8262336193053012E-2,3.8013284689562575E-2,3.7427334064515393E-2,3.625857577663285E-2]
[{"$f":"$A$58","v":"United Energy"},{"$f":"HLOOKUP($A$36,$D$36:$H$41,6,FALSE)","v":3.6002053810034157E-2},null,3.9330190400643471E-2,3.869503168791262E-2,3.8123822021083775E-2,3.7516149645275165E-2,3.6002053810034157E-2]
[]
[{"$f":"\"rvw (t) \"&C$5","v":"rvw (t) 2020"},{"$f":"VLOOKUP(C$3,A37:B41,2,FALSE)","v":3.3621044143256104E-2},"(t)",{"$f":"VLOOKUP($C$3,$A$37:$H$41,4,FALSE)","v":3.6700024103140591E-2},{"$f":"VLOOKUP($C$3,$A37:$H$41,5,FALSE)","v":3.6127568814887212E-2},{"$f":"VLOOKUP($C$3,$A$37:$H$41,6,FALSE)","v":3.5630478851561828E-2},{"$f":"VLOOKUP($C$3,$A$37:$H$41,7,FALSE)","v":3.5080474747029383E-2},{"$f":"VLOOKUP($C$3,$A$37:$H$41,8,FALSE)","v":3.3621044143256104E-2}]
[]
[{"$f":"\"rvw for \"&C$5-1","v":"rvw for 2019"},{"$f":"IF(C$5=2016,F$184,HLOOKUP($A45,D$36:H$43,8,FALSE))","v":3.5080474747029383E-2},"(t-1)"]
[]
[{"$f":"\"rvw for \"&C$5-2","v":"rvw for 2018"},{"$f":"IF(OR(C$5=2016,C$5=2017),F$183,HLOOKUP($A47,D$36:H$43,8,FALSE))","v":3.5630478851561828E-2},"(t-2)"]
[]
[]
[]
[]
["DuoS"]
[{"$f":"\"Xt for \"&C$5","v":"Xt for 2020"},null,null,"AR for 2016","Xt for 2017","Xt for 2018","Xt for 2019","Xt for 2020"]
["Jemena",{"$f":"IF(C$5=2016,\"n/a\",HLOOKUP($A$53,$E$53:$H$58,2,FALSE))","v":-1.7120864674444958E-2},null,238498758,-3.2500000000000001E-2,2.7000000000000001E-3,-1.1948008629939944E-2,-1.7120864674444958E-2]
["CitiPower",{"$f":"IF(C$5=2016,\"n/a\",HLOOKUP($A$53,$E$53:$H$58,3,FALSE))","v":-1.8785503133769275E-2},null,282881283,4.0000000000000001E-3,-5.0000000000000001E-4,-1.2324590345473526E-3,-1.8785503133769275E-2]
["Powercor",{"$f":"IF(C$5=2016,\"n/a\",HLOOKUP($A$53,$E$53:$H$58,4,FALSE))","v":-2.4019258545807588E-2},null,621773294,4.6800000000000001E-2,-8.0999999999999996E-3,-3.0211641246695703E-2,-2.4019258545807588E-2]
["AusNet Services",{"$f":"IF(C$5=2016,\"n/a\",HLOOKUP($A$53,$E$53:$H$58,5,FALSE))","v":-2.1667027203212185E-2},null,586045137,3.0000000000000001E-3,-1.84E-2,-3.0132176370631356E-2,-2.1667027203212185E-2]
["United Energy",{"$f":"IF(C$5=2016,\"n/a\",HLOOKUP($A$53,$E$53:$H$58,6,FALSE))","v":4.9205877696530077E-3},null,375069867,-3.8300000000000001E-2,-3.1600000000000003E-2,-2.6112020009605556E-2,4.9205877696530077E-3]
[]
[{"$f":"\"Xt for\"&C$5","v":"Xt for2020"},{"$f":"VLOOKUP(C$3,A54:B58,2,FALSE)","v":-1.8785503133769275E-2},null,{"$f":"VLOOKUP($C$3,$A$54:$H$58,4,FALSE)","v":282881283},{"$f":"VLOOKUP($C$3,$A$54:$H$58,5,FALSE)","v":4.0000000000000001E-3},{"$f":"VLOOKUP($C$3,$A$54:$H$58,6,FALSE)","v":-5.0000000000000001E-4},{"$f":"VLOOKUP($C$3,$A$54:$H$58,7,FALSE)","v":-1.2324590345473526E-3},{"$f":"VLOOKUP($C$3,$A$54:$H$58,8,FALSE)","v":-1.8785503133769275E-2}]
[]
[]
[]
["Metering"]
[{"$f":"\"Xt for \"&C$5","v":"Xt for 2020"},null,null,"AR for 2016","Xt for 2017","Xt for 2018","Xt for 2019","Xt for 2020"]
["Jemena",{"$f":"IF(C$5=2016,\"n/a\",HLOOKUP($A$65,$E$65:$H$70,2,FALSE))","v":-1.2476416215758738E-2},null,44212949.016624629,0.3473,-1.3599999999999999E-2,-1.1818442457176899E-2,-1.2476416215758738E-2]
["CitiPower",{"$f":"IF(C$5=2016,\"n/a\",HLOOKUP($A$65,$E$65:$H$70,3,FALSE))","v":7.9701945111617906E-2},null,32973195.03847561,0.14019999999999999,7.6700000000000004E-2,7.9367999046920018E-2,7.9701945111617906E-2]
["Powercor",{"$f":"IF(C$5=2016,\"n/a\",HLOOKUP($A$65,$E$65:$H$70,4,FALSE))","v":8.5349518366271346E-2},null,79145313.202280506,0.1096,8.1900000000000001E-2,8.490086085041551E-2,8.5349518366271346E-2]
["AusNet Services",{"$f":"IF(C$5=2016,\"n/a\",HLOOKUP($A$65,$E$65:$H$70,5,FALSE))","v":0.1693082632350488},null,92754610.443801105,2.3099999999999999E-2,0.1658,0.16934859267057342,0.1693082632350488]
["United Energy",{"$f":"IF(C$5=2016,\"n/a\",HLOOKUP($A$65,$E$65:$H$70,6,FALSE))","v":5.9781102527883455E-2},null,62733316.946996652,0.30809999999999998,5.7000000000000002E-2,5.9542008892518941E-2,5.9781102527883455E-2]
[]
[{"$f":"\"Xt for\"&C$5","v":"Xt for2020"},{"$f":"VLOOKUP(C$3,A66:B70,2,FALSE)","v":7.9701945111617906E-2},null,{"$f":"VLOOKUP($C$3,$A$66:$H$70,4,FALSE)","v":32973195.03847561},{"$f":"VLOOKUP($C$3,$A$66:$H$70,5,FALSE)","v":0.14019999999999999},{"$f":"VLOOKUP($C$3,$A$66:$H$70,6,FALSE)","v":7.6700000000000004E-2},{"$f":"VLOOKUP($C$3,$A$66:$H$70,7,FALSE)","v":7.9367999046920018E-2},{"$f":"VLOOKUP($C$3,$A$66:$H$70,8,FALSE)","v":7.9701945111617906E-2}]
[]
[]
[]
["DuoS"]
["Real Pre-tax WACC (rptw)"]
[{"$f":"\"rptw for \"&C$5","v":"rptw for 2020"},null,null,"rptw for 2016","rptw for 2017","rptw for 2018","rptw for 2019","rptw for 2020"]
[{"$f":"$A$54","v":"Jemena"},{"$f":"HLOOKUP($A$78,$D$78:$H$83,2,FALSE)","v":4.4196767875078757E-2},null,4.7233747078506916E-2,4.6635535420744167E-2,4.6119496184403141E-2,4.5303932925675694E-2,4.4196767875078757E-2]
[{"$f":"$A$55","v":"CitiPower"},{"$f":"HLOOKUP($A$78,$D$78:$H$83,3,FALSE)","v":4.1119999026076437E-2},null,4.6963445562191453E-2,4.6365388308847733E-2,4.5849482267400932E-2,4.2579429629849841E-2,4.1119999026076437E-2]
[{"$f":"$A$56","v":"Powercor"},{"$f":"HLOOKUP($A$78,$D$78:$H$83,4,FALSE)","v":4.0122578034408329E-2},null,4.3470888279073527E-2,4.2898285196230956E-2,4.240106689588341E-2,4.1582008638181511E-2,4.0122578034408329E-2]
[{"$f":"$A$57","v":"AusNet Services"},{"$f":"HLOOKUP($A$78,$D$78:$H$83,5,FALSE)","v":4.2610738945548343E-2},null,4.5338770460766176E-2,4.4884194435220071E-2,4.4635078632446534E-2,4.3779497233430886E-2,4.2610738945548343E-2]
[{"$f":"$A$58","v":"United Energy"},{"$f":"HLOOKUP($A$78,$D$78:$H$83,6,FALSE)","v":4.4593132318394124E-2},null,4.8191817712942786E-2,4.7556495017062606E-2,4.6985137877234795E-2,4.6107228153634994E-2,4.4593132318394124E-2]
[]
[{"$f":"\"rptw (t) \"&C$5","v":"rptw (t) 2020"},{"$f":"VLOOKUP(C$3,A79:B83,2,FALSE)","v":4.1119999026076437E-2},"(t)",{"$f":"VLOOKUP($C$3,$A$79:$H$83,4,FALSE)","v":4.6963445562191453E-2},{"$f":"VLOOKUP($C$3,$A79:$H$83,5,FALSE)","v":4.6365388308847733E-2},{"$f":"VLOOKUP($C$3,$A$79:$H$83,6,FALSE)","v":4.5849482267400932E-2},{"$f":"VLOOKUP($C$3,$A$79:$H$83,7,FALSE)","v":4.2579429629849841E-2},{"$f":"VLOOKUP($C$3,$A$79:$H$83,8,FALSE)","v":4.1119999026076437E-2}]
[]
[{"$f":"\"rptw for \"&C$5-1","v":"rptw for 2019"},{"$f":"IF(C$5=2016,B$184,HLOOKUP($A87,D$78:H$85,8,FALSE))","v":4.2579429629849841E-2},"(t-1)"]
[]
[{"$f":"\"rptw for \"&C$5-2","v":"rptw for 2018"},{"$f":"IF(OR(C$5=2016,C$5=2017),B$183,HLOOKUP($A89,D$78:H$85,8,FALSE))","v":4.5849482267400932E-2},"(t-2)"]
[]
[]
[]
["F factor Scheme",{"$f":"$C$5","v":2020},null,2016,{"$f":"+D93+1","v":2017},{"$f":"+E93+1","v":2018},2019,2020]
[{"$f":"$A$54","v":"Jemena"},{"$f":"HLOOKUP($B$93,$D$93:$H$98,2,FALSE)","v":112800},null,-680000,70000,655000,117300,112800]
[{"$f":"$A$55","v":"CitiPower"},{"$f":"HLOOKUP($B$93,$D$93:$H$98,3,FALSE)","v":36300},null,-15000,410000,140000,43200,36300]
[{"$f":"$A$56","v":"Powercor"},{"$f":"HLOOKUP($B$93,$D$93:$H$98,4,FALSE)","v":995100},null,-1530000,1420000,1755000,4639200,995100]
[{"$f":"$A$57","v":"AusNet Services"},{"$f":"HLOOKUP($B$93,$D$93:$H$98,5,FALSE)","v":316200},null,1870000,3420000,750000,1485000,316200]
[{"$f":"$A$58","v":"United Energy"},{"$f":"HLOOKUP($B$93,$D$93:$H$98,6,FALSE)","v":5100},null,-2245000,555000,1000000,224400,5100]
[]
[{"$f":"\"Ifactor (t) \"&C$5","v":"Ifactor (t) 2020"},{"$f":"VLOOKUP(C$3,A94:B98,2,FALSE)","v":36300},null,{"$f":"VLOOKUP($C$3,$A$94:$H$98,4,FALSE)","v":-15000},{"$f":"VLOOKUP($C$3,$A$94:$H$98,5,FALSE)","v":410000},{"$f":"VLOOKUP($C$3,$A$94:$H$98,6,FALSE)","v":140000},{"$f":"VLOOKUP($C$3,$A$94:$H$98,7,FALSE)","v":43200},{"$f":"VLOOKUP($C$3,$A$94:$H$98,8,FALSE)","v":36300}]
[]
[]
[]
["S factor Scheme",{"$f":"$C$5","v":2020},null,2016,{"$f":"+D104+1","v":2017},{"$f":"+E104+1","v":2018},2019,2020]
[{"$f":"$A$54","v":"Jemena"},{"$f":"HLOOKUP($B$104,$D$104:$H$109,2,FALSE)","v":3.0753780801318076E-3},null,3.997406405685925E-2,1.4883104689629834E-2,-3.9711537226499671E-2,6.9506796510601099E-3,3.0753780801318076E-3]
[{"$f":"$A$55","v":"CitiPower"},{"$f":"HLOOKUP($B$104,$D$104:$H$109,3,FALSE)","v":1.356911180924536E-2},null,-1.2687890034873129E-2,4.0321456836540648E-3,1.8570526636221274E-2,-9.6087080522934132E-3,1.356911180924536E-2]
[{"$f":"$A$56","v":"Powercor"},{"$f":"HLOOKUP($B$104,$D$104:$H$109,4,FALSE)","v":3.5510891556229662E-3},null,-1.184910821327374E-2,5.1006485422781411E-2,-1.3841682273256106E-2,-9.7090848862635415E-4,3.5510891556229662E-3]
[{"$f":"$A$57","v":"AusNet Services"},{"$f":"HLOOKUP($B$104,$D$104:$H$109,5,FALSE)","v":-7.0048391824403256E-3},null,3.3573974889361931E-2,3.2178765868161374E-2,-6.3433641222553572E-2,1.5065238061258368E-2,-7.0048391824403256E-3]
[{"$f":"$A$58","v":"United Energy"},{"$f":"HLOOKUP($B$104,$D$104:$H$109,6,FALSE)","v":5.0505619391283396E-3},null,-2.9478704479005153E-2,2.8366723271978866E-2,2.2767038821999375E-2,1.6824143991347684E-2,5.0505619391283396E-3]
[]
[{"$f":"\"S factor (t) \"&C$5","v":"S factor (t) 2020"},{"$f":"VLOOKUP(C$3,A105:B109,2,FALSE)","v":1.356911180924536E-2},null,{"$f":"VLOOKUP($C$3,$A$105:$H$109,4,FALSE)","v":-1.2687890034873129E-2},{"$f":"VLOOKUP($C$3,$A$105:$H$109,5,FALSE)","v":4.0321456836540648E-3},{"$f":"VLOOKUP($C$3,$A$105:$H$109,6,FALSE)","v":1.8570526636221274E-2},{"$f":"VLOOKUP($C$3,$A$105:$H$109,7,FALSE)","v":-9.6087080522934132E-3},{"$f":"VLOOKUP($C$3,$A$105:$H$109,8,FALSE)","v":1.356911180924536E-2}]
[]
[]
[]
["Pass through Amounts",{"$f":"$C$5","v":2020},null,2016,{"$f":"+D115+1","v":2017},{"$f":"+E115+1","v":2018},2019,2020]
[{"$f":"$A$54","v":"Jemena"},{"$f":"HLOOKUP($B$115,$D$115:$H$120,2,FALSE)","v":0},null,0,0,0,0,0]
[{"$f":"$A$55","v":"CitiPower"},{"$f":"HLOOKUP($B$115,$D$115:$H$120,3,FALSE)","v":0},null,0,0,0,0,0]
[{"$f":"$A$56","v":"Powercor"},{"$f":"HLOOKUP($B$115,$D$115:$H$120,4,FALSE)","v":0},null,0,0,0,0,0]
[{"$f":"$A$57","v":"AusNet Services"},{"$f":"HLOOKUP($B$115,$D$115:$H$120,5,FALSE)","v":0},null,{"$f":"-(5723000*(1+0.0975))","v":-6280992.5},0,0,0,0]
[{"$f":"$A$58","v":"United Energy"},{"$f":"HLOOKUP($B$115,$D$115:$H$120,6,FALSE)","v":0},null,0,0,0,0,0]
[]
[{"$f":"\"Pass through amounts (t) \"&C$5","v":"Pass through amounts (t) 2020"},{"$f":"VLOOKUP(C$3,A116:B120,2,FALSE)","v":0},null,{"$f":"VLOOKUP($C$3,$A$116:$H$120,4,FALSE)","v":0},{"$f":"VLOOKUP($C$3,$A$116:$H$120,5,FALSE)","v":0},{"$f":"VLOOKUP($C$3,$A$116:$H$120,6,FALSE)","v":0},{"$f":"VLOOKUP($C$3,$A$116:$H$120,7,FALSE)","v":0},{"$f":"VLOOKUP($C$3,$A$116:$H$120,8,FALSE)","v":0}]
[]
[]
[]
[" License Fees",{"$f":"$C$5","v":2020},null,2016,{"$f":"+D126+1","v":2017},{"$f":"+E126+1","v":2018},2019,2020]
[{"$f":"$A$54","v":"Jemena"},{"$f":"HLOOKUP($B$126,$D$126:$H$131,2,FALSE)","v":130256},null,36033,39516,76545,77350,130256]
[{"$f":"$A$55","v":"CitiPower"},{"$f":"HLOOKUP($B$126,$D$126:$H$131,3,FALSE)","v":132030},null,36475,40445,78091,78912,132030]
[{"$f":"$A$56","v":"Powercor"},{"$f":"HLOOKUP($B$126,$D$126:$H$131,4,FALSE)","v":317568},null,85205,94964,185081,187026,317568]
[{"$f":"$A$57","v":"AusNet Services"},{"$f":"HLOOKUP($B$126,$D$126:$H$131,5,FALSE)","v":285784},null,74811,85031,168235,170003,285784]
[{"$f":"$A$58","v":"United Energy"},{"$f":"HLOOKUP($B$126,$D$126:$H$131,6,FALSE)","v":263285},null,74197,81712,158262,159925,263285]
[]
[{"$f":"\"Licence Fee (t-1) \"&TEXT(C$5-2,\"####\")&\"-\"&RIGHT(TEXT(C$5-1,\"##\"),2)","v":"Licence Fee (t-1) 2018-19"},{"$f":"VLOOKUP(C$3,A127:B131,2,FALSE)","v":132030},null,{"$f":"VLOOKUP($C$3,$A$127:$H$131,4,FALSE)","v":36475},{"$f":"VLOOKUP($C$3,$A$127:$H$131,5,FALSE)","v":40445},{"$f":"VLOOKUP($C$3,$A$127:$H$131,6,FALSE)","v":78091},{"$f":"VLOOKUP($C$3,$A$127:$H$131,7,FALSE)","v":78912},{"$f":"VLOOKUP($C$3,$A$127:$H$131,8,FALSE)","v":132030}]
[]
[]
[]
["DMIA Carryover adjustment",{"$f":"$C$5","v":2020},null,2016,{"$f":"+D137+1","v":2017},{"$f":"+E137+1","v":2018},2019,2020]
[{"$f":"$A$54","v":"Jemena"},{"$f":"HLOOKUP($B$137,$D$137:$H$142,2,FALSE)","v":0},null,null,{"$f":"H154","v":-91239.844462589012}]
[{"$f":"$A$55","v":"CitiPower"},{"$f":"HLOOKUP($B$137,$D$137:$H$142,3,FALSE)","v":0}]
[{"$f":"$A$56","v":"Powercor"},{"$f":"HLOOKUP($B$137,$D$137:$H$142,4,FALSE)","v":0}]
[{"$f":"$A$57","v":"AusNet Services"},{"$f":"HLOOKUP($B$137,$D$137:$H$142,5,FALSE)","v":0}]
[{"$f":"$A$58","v":"United Energy"},{"$f":"HLOOKUP($B$137,$D$137:$H$142,6,FALSE)","v":0},null,null,{"$f":"H163","v":-479660.69376433094}]
[]
[{"$f":"\"T factor (t) \"&C$5","v":"T factor (t) 2020"},{"$f":"VLOOKUP(C$3,A138:B142,2,FALSE)","v":0},null,{"$f":"VLOOKUP($C$3,$A$138:$H$142,4,FALSE)","v":0},{"$f":"VLOOKUP($C$3,$A$138:$H$142,5,FALSE)","v":0},{"$f":"VLOOKUP($C$3,$A$138:$H$142,6,FALSE)","v":0},{"$f":"VLOOKUP($C$3,$A$138:$H$142,7,FALSE)","v":0},{"$f":"VLOOKUP($C$3,$A$138:$H$142,8,FALSE)","v":0}]
[]
[]
["DMIA Carryover adjustment"]
["Jemena",null,"2011-15",2016,2017]
["CPI - PTRM",null,null,2.3230798209937155E-2,2.3230798209937155E-2]
["Nominal Vanilla WACC - PTRM",null,0.1033058647680111,{"$f":"(1+D149)*(1+D37)-1","v":6.3473062354247878E-2},{"$f":"(1+E149)*(1+E37)-1","v":6.2861111753533594E-2}]
[]
[null,null,2011,2012,2013,2014,2015,"Total"]
["Ex-ante revenue minus ex post expenditure ($nominal)",null,-263938,-16375.399999999965,163676.67136000004,153066.62606841602,125690.58545944223,{"$f":"SUM(C153:G153)","v":162120.48288785832}]
["DMIA Carryover adjustment",null,{"$f":"0-(C153/(1+$C150))*(1+$C150)^5*(1+$D150)*(1+$E150)","v":442067.55283107725},{"$f":"C154-(D153/(1+$C150))*(1+$C150)^4*(1+$D150)*(1+$E150)","v":466926.49868923979},{"$f":"D154-(E153/(1+$C150))*(1+$C150)^3*(1+$D150)*(1+$E150)","v":241719.62134028116},{"$f":"E154-(F153/(1+$C150))*(1+$C150)^2*(1+$D150)*(1+$E150)","v":50831.261139433307},{"$f":"F154-(G153/(1+$C150))*(1+$C150)^1*(1+$D150)*(1+$E150)","v":-91239.844462589012},{"$f":"G154","v":-91239.844462589012}]
[]
[]
["UED",null,"2011-15",2016,2017]
["CPI - PTRM",null,null,2.3230798209937155E-2,2.3230798209937155E-2]
["Nominal Vanilla WACC - PTRM",null,9.4897728819182986E-2,{"$f":"(1+D158)*(1+D41)-1","v":6.3474660327336396E-2},{"$f":"(1+E158)*(1+E41)-1","v":6.2824746370718776E-2}]
[]
[null,null,2011,2012,2013,2014,2015,"Total"]
["Ex-ante revenue minus ex post expenditure ($nominal)",null,406960,327739.20000000007,91075.342720000073,-227853.74786316796,-450364.82908111555,{"$f":"SUM(C162:G162)","v":147555.96577571658}]
["DMIA Carryover adjustment",null,{"$f":"0-(C162/(1+$C159))*(1+$C159)^5*(1+$D159)*(1+$E159)","v":-661050.66784974851},{"$f":"C163-(D162/(1+$C159))*(1+$C159)^4*(1+$D159)*(1+$E159)","v":-1147276.3094659143},{"$f":"D163-(E162/(1+$C159))*(1+$C159)^3*(1+$D159)*(1+$E159)","v":-1270682.4380397256},{"$f":"E163-(F162/(1+$C159))*(1+$C159)^2*(1+$D159)*(1+$E159)","v":-988702.28916018433},{"$f":"F163-(G162/(1+$C159))*(1+$C159)^1*(1+$D159)*(1+$E159)","v":-479660.69376433094},{"$f":"G163","v":-479660.69376433094}]
[]
[]
[]
[]
[]
[]
[]
[]
["Regulatory Period 2011-15"]
[]
["DuoS"]
["Real Pre-tax WACC for distribution tariffs",null,null,"Real Vanilla WACC for distribution tariffs"]
[]
[{"$f":"$A$54","v":"Jemena"},8.6999999999999994E-2,null,{"$f":"$A$54","v":"Jemena"},null,7.5600000000000001E-2]
[{"$f":"$A$55","v":"CitiPower"},7.8600000000000003E-2,null,{"$f":"$A$55","v":"CitiPower"},null,6.7400000000000002E-2]
[{"$f":"$A$56","v":"Powercor"},7.7600000000000002E-2,null,{"$f":"$A$56","v":"Powercor"},null,6.7400000000000002E-2]
[{"$f":"$A$57","v":"AusNet Services"},7.8E-2,null,{"$f":"$A$57","v":"AusNet Services"},null,6.9900000000000004E-2]
[{"$f":"$A$58","v":"United Energy"},7.9100000000000004E-2,null,{"$f":"$A$58","v":"United Energy"},null,6.7400000000000002E-2]
[]
[" pretax WACCD",{"$f":"VLOOKUP($C$3,A177:B181,2,FALSE)","v":7.8600000000000003E-2},null,"Real Vanilla WACCD",null,{"$f":"VLOOKUP($C$3,D177:F181,3,FALSE)","v":6.7400000000000002E-2}]
[]
[]
[]
[]
["Pass Through Costs",null,null,null,2014,2015]
[]
[{"$f":"A204","v":"F Factor pass through"},null,null,null,10000,-65000]
["VBRC",null,null,null,0,0]
["Powerline Replacement program",null,null,null,0,0]
["TOTAL PASS THROUGH AMOUNTS",null,null,null,{"$f":"SUM(E190:E192)","v":10000},{"$f":"SUM(F190:F192)","v":-65000}]
[]
[]
[]
["F factor Scheme",2014,2015]
[{"$f":"$A$54","v":"Jemena"},370000,-855000]
[{"$f":"$A$55","v":"CitiPower"},10000,-65000]
[{"$f":"$A$56","v":"Powercor"},2470000,-2405000]
[{"$f":"$A$57","v":"AusNet Services"},1970000,2020000]
[{"$f":"$A$58","v":"United Energy"},980000,-70000]
[]
["F Factor pass through",{"$f":"VLOOKUP($C$3,$A$198:$C$202,2,FALSE)","v":10000},{"$f":"VLOOKUP($C$3,$A$198:$C$202,3,FALSE)","v":-65000}]
[]
[]
[]
["VBRC",2014,2015]
[{"$f":"$A$54","v":"Jemena"},0,0]
[{"$f":"$A$55","v":"CitiPower"},0,0]
[{"$f":"$A$56","v":"Powercor"},{"$f":"H245","v":7193170.4538582545},{"$f":"I245","v":8768550.3783121537}]
[{"$f":"$A$57","v":"AusNet Services"},{"$f":"H262","v":6039778.1580883265},{"$f":"I262","v":8341755.2122622114}]
[{"$f":"$A$58","v":"United Energy"},0,0]
[]
["VBRC pass through",{"$f":"VLOOKUP($C$3,$A$209:$C$213,2,FALSE)","v":0},{"$f":"VLOOKUP($C$3,$A$209:$C$213,3,FALSE)","v":0}]
[]
[]
[]
["Powerline Replacement program",2014,2015]
[{"$f":"$A$54","v":"Jemena"},0,0]
[{"$f":"$A$55","v":"CitiPower"},0,0]
[{"$f":"$A$56","v":"Powercor"},{"$f":"H249","v":0},8777690.4553783704]
[{"$f":"$A$57","v":"AusNet Services"},0,5723419.3099999996]
[{"$f":"$A$58","v":"United Energy"},0,0]
[]
["Powerline Replacement program",{"$f":"VLOOKUP($C$3,$A$219:$C$224,2,FALSE)","v":0},{"$f":"VLOOKUP($C$3,$A$219:$C$224,3,FALSE)","v":0}]
[]
[]
[]
[]
["VBRC"]
[]
["Powercor",null,null,null,2011,2012,2013,2014,2015]
["Pass through amounts approved (Nominal $) - Forecast CPI",null,null,null,null,null,10270612,7181525,8777217]
["(As per AER's Final Decision on Powercor's VBRC pass through, table 7.2,  7 March 2012)"]
["Forecast CPI in PTRM",null,null,null,2.5748753401775293E-2,2.5748753401775293E-2,2.5748753401775293E-2,2.5748753401775293E-2,2.5748753401775293E-2]
[null,null,null,null,{"$f":"1+E236","v":1.0257487534017753},{"$f":"E237*(1+F236)","v":1.052160505105296},{"$f":"F237*(1+G236)","v":1.0792523264903395},{"$f":"G237*(1+H236)","v":1.1070417285034315},{"$f":"H237*(1+I236)","v":1.1355466729761414}]
[]
["Pass through amounts approved (Real $2010)",null,null,null,null,null,{"$f":"G234/G237","v":9516414.0469350498},{"$f":"H234/H237","v":6487131.257200608},{"$f":"I234/I237","v":7729507.9179756576}]
[]
[]
["Actual CPI",null,null,null,{"$f":"173.3/168.6-1","v":2.7876631079478242E-2},{"$f":"179.4/173.3-1","v":3.5199076745527913E-2},{"$f":"C17/C16-1","v":2.0040080160320661E-2},{"$f":"C18/C17-1","v":2.16110019646365E-2},{"$f":"C19/C18-1","v":2.3076923076923217E-2}]
[null,null,null,null,{"$f":"1+E242","v":1.0278766310794782},{"$f":"E243*(1+F242)","v":1.0640569395017794},{"$f":"F243*(1+G242)","v":1.0853807258645405},{"$f":"G243*(1+H242)","v":1.1088368908635777},1.1344254344988911]
[]
["Pass through amounts approved (Nominal $) - Actual CPI",null,null,null,null,null,{"$f":"G239*G243","v":10328932.385889873},{"$f":"H239*H243","v":7193170.4538582545},{"$f":"I239*I243","v":8768550.3783121537}]
[]
[]
[]
[]
["AusNet Services",null,null,null,2011,2012,2013,2014,2015]
["Pass through amounts approved (Nominal $) - Forecast CPI",null,null,null,null,null,5790000,6030000,8350000]
["As per AER's Final Decision on AusNet Services's VBRC pass through, table 1.3,  19 October 2012"]
["Forecast CPI in PTRM",null,null,null,2.5748753401775293E-2,2.5748753401775293E-2,2.5748753401775293E-2,2.5748753401775293E-2,2.5748753401775293E-2]
[null,null,null,null,{"$f":"1+E253","v":1.0257487534017753},{"$f":"E254*(1+F253)","v":1.052160505105296},{"$f":"F254*(1+G253)","v":1.0792523264903395},{"$f":"G254*(1+H253)","v":1.1070417285034315},{"$f":"H254*(1+I253)","v":1.1355466729761414}]
[]
["Pass through amounts approved (Real $2010)",null,null,null,null,null,{"$f":"G251/G254","v":5364825.1274368009},{"$f":"H251/H254","v":5446949.14811543},{"$f":"I251/I254","v":7353286.4819334811}]
[]
[]
["Actual CPI",null,null,null,{"$f":"173.3/168.6-1","v":2.7876631079478242E-2},{"$f":"179.4/173.3-1","v":3.5199076745527913E-2},{"$f":"C17/C16-1","v":2.0040080160320661E-2},{"$f":"C18/C17-1","v":2.16110019646365E-2},{"$f":"C19/C18-1","v":2.3076923076923217E-2}]
[null,null,null,null,{"$f":"1+E259","v":1.0278766310794782},{"$f":"E260*(1+F259)","v":1.0640569395017794},{"$f":"F260*(1+G259)","v":1.0853807258645405},{"$f":"G260*(1+H259)","v":1.1088368908635777},1.1344254344988911]
[]
["Pass through amounts approved (Nominal $) - Actual CPI",null,null,null,null,null,{"$f":"G256*G260","v":5822877.7909536809},{"$f":"H256*H260","v":6039778.1580883265},{"$f":"I256*I260","v":8341755.2122622114}]
[]
[]
[]
[]
[]
[]
[]
["AMI Transitional Adjustment in 2018 prices ($)"]
[{"$f":"C3","v":"CitiPower"}]
[null,null,2009,2010,2011,2012,2013,2014,2015,2016,2017,2018,2019,2020]
["CPI",null,4.9810844892812067E-2,1.2612612612612484E-2,2.7876631079478242E-2,3.5199076745527913E-2,{"$f":"$F17","v":2.0040080160320661E-2},{"$f":"$F18","v":2.16110019646365E-2},{"$f":"$F19","v":2.3076923076923217E-2},{"$f":"$F20","v":1.5037593984962294E-2},{"$f":"$F22","v":1.0232558139534831E-2},{"$f":"$F23","v":1.9337016574585641E-2},{"$f":"$F24","v":2.0776874435411097E-2},{"$f":"$F25","v":1.5929203539823078E-2}]
[]
["Vanilla' WACC (Real)",null,6.7716458658346301E-2,{"$f":"$C275","v":6.7716458658346301E-2},{"$f":"$C275","v":6.7716458658346301E-2},6.7716458658346301E-2,6.7716458658346301E-2,5.0239094369083762E-2,{"$f":"H275","v":5.0239094369083762E-2},{"$f":"D43","v":3.6700024103140591E-2},{"$f":"E43","v":3.6127568814887212E-2},{"$f":"F43","v":3.5630478851561828E-2},{"$f":"G43","v":3.5080474747029383E-2},{"$f":"H43","v":3.3621044143256104E-2}]
["Vanilla' WACC (nominal)",null,{"$f":"(1+C275)*(1+C273)-1","v":0.1209003175700798},8.1183152731514552E-2,9.7480796473851994E-2,0.10529909222912481,8.9113582078353293E-2,7.2935813500832225E-2,7.4475381162216747E-2,5.2289498149804103E-2,4.6729804402760422E-2,5.5656482586260436E-2,5.6586211801394226E-2,5.0085804138458423E-2]
[]
["Future value index",null,{"$f":"(1+C276)^0.5","v":1.0587257990481198},{"$f":"C278*(D276+1)","v":1.1446764972930381},1.2562604739540626,1.3885435614647554,1.5122816520987139,1.6225811446369161,1.7434234938503763,1.8345862334063905,1.9203160892534681,2.0271941282351196,2.1419053645379749,2.2491844171093374]
[]
["AMI Transitional Adjustment - Revenue and Costs 2009-2015"]
["Over \\ (under) recovery of revenue and costs (000's)"]
["NPV at 1 January 2009",null,null,296.83499067157391]
[]
["AMI Transitional Adjustment in 2018 prices ($)",null,null,{"$f":"-D282*L278*10^3","v":-601742.15014414105}]
[]
["AMI Transitional Adjustment - Revenue 2016-2020"]
["Increase \\ (Reduction) in revenue 2016-2020 (000's)"]
["NPV at 1 January 2016",null,null,-1035.5446757456407]
[]
["AMI Transitional Adjustment in 2018 prices ($)",null,null,{"$f":"D288*L278/I278*10^3","v":-1204096.4766170951}]
[]
["Total AMI Transitional Adjustment in 2018 prices ($)",null,null,{"$f":"SUM(D284,D290)","v":-1805838.6267612362}]

{"sheet":"Metering","index":3,"n_rows":89,"n_cols":12,"rows_kept":89,"cut":false,"hidden":false,"merged":[[23,7,23,8]]}
[null,{"$f":"\"Tariff Approval - \"&'Model update'!C3","v":"Tariff Approval - CitiPower"}]
[]
[null,{"$f":"\"PROPOSED \"&'Model update'!$C$5&\" METERING TARIFFS AND REVENUE\"","v":"PROPOSED 2020 METERING TARIFFS AND REVENUE"}]
[]
[null,null,null,{"$f":"\"Proposed Metering Tariffs P(t) for \" &'Model update'!$C$5","v":"Proposed Metering Tariffs P(t) for 2020"},{"$f":"\"Current Metering Tariffs P(t-1) for\" &'Model update'!$C$8","v":"Current Metering Tariffs P(t-1) for2019"},{"$f":"\"Forecast Quantities   (Qt) for \"&'Model update'!$C$5","v":"Forecast Quantities   (Qt) for 2020"},null,{"$f":"\"Forecast Revenue (Pt \"&'Model update'!$C$5&\")*(Qt \" &'Model update'!$C$5&\")\"","v":"Forecast Revenue (Pt 2020)*(Qt 2020)"},{"$f":"\"Revenue                    (Pt-1 \"&'Model update'!$C$8&\")*(Qt \" &'Model update'!$C$5&\")\"","v":"Revenue                    (Pt-1 2019)*(Qt 2020)"},null,"Movement","Side Constraint"]
[null,"Proposed tariff","Existing tariff","PropTar\n$/Cust/year","ExistTar\n$/Cust/year","FcastVol\nCust #",null,"PropRev\nFixed","ExistRev\nFixed"]
[]
[null,"Single phase","Single phase",71.3,73,258691.84228157168,null,{"$f":"D8*F8","v":18444728.35467606},{"$f":"E8*F8","v":18884504.486554731},null,{"$f":"IFERROR(H8/I8,\"\")","v":0.97671232876712333},{"$f":"IF(B8=\"\",\"\",IF(K8<$I$30,\"COMPLIANT\",\"BREACHED\"))","v":"COMPLIANT"}]
[null,"Three phase direct connected meter","Three phase direct connected meter",88.1,91.25,64117.554536285425,null,5648756.5546467453,5850726.851436045,null,{"$f":"IFERROR(H9/I9,\"\")","v":0.96547945205479446},"COMPLIANT"]
[null,"Three phase CT connected meter","Three phase CT connected meter",110.8,113.15,3178.196668877099,null,352144.19091158255,359612.95308344375,null,0.97923110914714973,"COMPLIANT"]
[null,null,null,null,null,null,null,0,0,null,"",""]
[null,null,null,null,null,null,null,0,0,null,"",""]
[null,null,null,null,null,null,null,0,0,null,"",""]
[null,null,null,null,null,null,null,0,0,null,"",""]
[null,null,null,null,null,null,null,0,0,null,"",""]
[null,null,null,null,null,null,null,0,0,null,"",""]
[null,null,null,null,null,null,null,{"$f":"SUM(H7:H16)","v":24445629.100234389},{"$f":"SUM(I7:I16)","v":25094844.29107422}]
[]
[]
[]
[]
[null,"Year (t)",null,{"$f":"'Model update'!C5","v":2020},{"$f":"D22-1","v":2019}]
[]
[null,"Table 1- Compliance with AER Final Determination Total Metering Annual Revenue",null,null,null,null,null,"Metering tariff rebalancing control"]
[null,"Revenue from  Metering charges for year t",null,{"$f":"H17","v":24445629.100234389},null,null,null,{"$f":"\"CPI \"&'Model update'!$C$5","v":"CPI 2020"},{"$f":"D37","v":1.5929203539823078E-2}]
[null,"Total Annual Metering Revenue for year t",null,{"$f":"D33","v":24448666.477566846},null,null,null,{"$f":"\"X \"& 'Model update'!$C$5","v":"X 2020"},{"$f":"MIN(D38,0)","v":0}]
[null,null,null,{"$f":"IF(D25=\"\",\"\",IF(D26>=D25,\"METERING REVENUE CAP FORMULA COMPLIANT\",\"METERING REVENUE CAP FORMULA BREACHED\"))","v":"METERING REVENUE CAP FORMULA COMPLIANT"},null,null,null,{"$f":"\"Tt \"&'Model update'!$C$5","v":"Tt 2020"},{"$f":"(D31-E31)/I$17","v":0}]
[null,null,null,null,null,null,null,{"$f":"\"Bt \"&'Model update'!$C$5","v":"Bt 2020"},{"$f":"(D32-E32)/I$17","v":2.572814727606099E-2}]
[null,"Table 2 - Total Annual Revenue for year t (TARMt)"]
[null,"Adjusted Annual Smoothed Metering Revenue for year t",null,{"$f":"D39","v":23683686.436046377},null,null,null,null,{"$f":"(1+I25)*(1-I26)*(1+0.02)+SUM(I27:I28)","v":1.0619759348866806}]
[null,"T factor for year t",null,0,0]
[null,"B factor for year t",null,{"$f":"-F68*(1+F66)^0.5","v":764980.04152046971},119336.19172989385]
[null,"Total Annual Revenue for year t",null,{"$f":"SUM(D30:D32)","v":24448666.477566846}]
[]
[null,"Table 3 -  Adjusted Annual Revenue for year t (ARt)"]
[null,"Adjusted Annual Smoothed Revenue for year t-1",null,25331292.739726018]
[null,"CPI for period t",null,{"$f":"'Model update'!C30","v":1.5929203539823078E-2}]
[null,"X factor for period t",null,{"$f":"'Model update'!B72","v":7.9701945111617906E-2}]
[null,"Adjusted Annual Smoothed Revenue for year t",null,{"$f":"IF(D22=2016,'Model update'!D72,(D36*(1+D37)*(1-D38)))","v":23683686.436046377}]
[]
[]
[]
[]
[null,"Table 4 - Metering Services Recovery Arrangements"]
[null,null,null,"Year t-2","Year t-1","Year t"]
[null,null,null,"(actual)","(estimate)","(forecast)"]
[null,null,null,{"$f":"E47-1","v":2018},{"$f":"F47-1","v":2019},{"$f":"D$22","v":2020}]
[]
[null,"(A) Revenue from Metering proposal charges",null,25001850.210000005,{"$f":"E89","v":24799708.069338664},{"$f":"D25","v":24445629.100234389}]
[]
[]
[null,"(B) Less TARM for regulatory year = ",null,{"$f":"SUM(D53:D54)","v":25149231.401168231},{"$f":"SUM(E53:E54)","v":25331292.739726018},{"$f":"SUM(F53:F54)","v":23683686.436046377}]
[null,"+ Adjusted annual smoothed revenue",null,26955070.027929466,{"$f":"D36","v":25331292.739726018},{"$f":"D30","v":23683686.436046377}]
[null,"+ T factor",null,-1805838.6267612362,{"$f":"E31","v":0},{"$f":"D31","v":0}]
[]
[]
[null,"(A minus B) Under/over recovery of revenue for regulatory year",null,{"$f":"D49-D52","v":-147381.1911682263},{"$f":"E49-E52","v":-531584.67038735375},{"$f":"F49-F52","v":761942.66418801248}]
[]
[]
[]
[null,"Table 5 - Metering Services Unders and Overs Account"]
[null,null,null,"Year t-2","Year t-1","Year t"]
[null,null,null,"(actual)","(estimate)","(forecast)"]
[null,"Calendar year",null,{"$f":"E64-1","v":2018},{"$f":"F64-1","v":2019},{"$f":"D$22","v":2020}]
[]
[null,"Nominal WACC",null,{"$f":"(1+'Model update'!$B$47)*(1+'Model update'!$C$28)-1","v":5.5656482586260436E-2},{"$f":"(1+'Model update'!$B$45)*(1+'Model update'!$C$29)-1","v":5.6586211801394226E-2},{"$f":"(1+'Model update'!$B$43)*(1+'Model update'!$C$30)-1","v":5.0085804138458423E-2}]
[]
[null,"Opening balance",null,-35951.462836458959,{"$f":"D72","v":-189379.41340465427},{"$f":"E72","v":-746513.57706409984}]
[null,"Interest on Opening balance",null,{"$f":"D68*D66","v":-2000.9319653079672},{"$f":"E68*E66","v":-10716.263597739564},{"$f":"F68*F66","v":-37389.732807532491}]
[null,"Under/over recovery of revenue for regulatory year",null,{"$f":"D57","v":-147381.1911682263},{"$f":"E57","v":-531584.67038735375},{"$f":"F57","v":761942.66418801248}]
[null,"Interest on under/over recovery for regulatory year",null,{"$f":"D70*((1+D66)^0.5-1)","v":-4045.8274346610524},{"$f":"E70*((1+E66)^0.5-1)","v":-14833.229674352266},{"$f":"F70*((1+F66)^0.5-1)","v":18848.132918567902}]
[null,"Closing balance of Metering Services overs/ (unders) account",null,{"$f":"SUM(D68:D71)","v":-189379.41340465427},{"$f":"SUM(E68:E71)","v":-746513.57706409984},-3112.5127650519898]
[]
[null,"The DNSP is expected to achieve a closing balance as close to zero as practicable in its annual metering charges unders and overs account in each forecast year in its annual pricing proposals in the 2016–20 regulatory control period."]
[]
[]
[null,null,{"$f":"\"Current Metering Tariffs P(t-1) for \" &'Model update'!$C$8","v":"Current Metering Tariffs P(t-1) for 2019"},{"$f":"\"Estimated Quantities   (Qt-1) for \"&'Model update'!$C$5-1","v":"Estimated Quantities   (Qt-1) for 2019"},{"$f":"\"Revenue                    (Pt-1 \"&'Model update'!$C$8&\")*(Qt-1 \" &'Model update'!$C$5-1&\")\"","v":"Revenue                    (Pt-1 2019)*(Qt-1 2019)"}]
[null,"Existing tariff","ExistTar\n$/Cust/year","FcastVol\nCust #","ExistRev\nFixed"]
[]
[null,"Single phase",{"$f":"E8","v":73},256734.93460620803,{"$f":"C80*D80","v":18741650.226253185}]
[null,"Three phase direct connected meter",{"$f":"E9","v":91.25},62596.594105881406,5711939.2121616779]
[null,"Three phase CT connected meter",113.15,3058.9361990614198,346118.63092379965]
[null,null,null,null,0]
[null,null,null,null,0]
[null,null,null,null,0]
[null,null,null,null,0]
[null,null,null,null,0]
[null,null,null,null,0]
[null,null,null,null,{"$f":"SUM(E79:E88)","v":24799708.069338664}]

{"sheet":"Prop2020DistTar","index":4,"n_rows":66,"n_cols":74,"rows_kept":66,"cut":false,"hidden":false,"merged":[]}
[null,{"$f":"\"Tariff Approval - \"&'Model update'!$C$3","v":"Tariff Approval - CitiPower"},{"$f":"\"Prop\"&'Model update'!$C$5&\"DistTar\"","v":"Prop2020DistTar"}]
[]
[null,{"$f":"\"PROPOSED \"&'Model update'!$C$5&\" DISTRIBUTION TARIFFS\"","v":"PROPOSED 2020 DISTRIBUTION TARIFFS"}]
[null,null,null,{"$f":"\"Proposed Distribution Tariffs (Pt) for \"&'Model update'!$C$5","v":"Proposed Distribution Tariffs (Pt) for 2020"},null,null,null,null,null,null,null,null,null,null,null,null,null,{"$f":"\"Current Distribution Tariffs (Pt-1) for \"&'Model update'!$C$8","v":"Current Distribution Tariffs (Pt-1) for 2019"},null,null,null,null,null,null,null,null,null,null,null,null,null,{"$f":"\"Forecast Quantities (Qt) for \"&'Model update'!$C$5","v":"Forecast Quantities (Qt) for 2020"},null,null,null,null,null,null,null,null,null,null,null,null,null,{"$f":"\"Forecast Revenue (Pt \"&'Model update'!$C$5&\")*(Qt \" &'Model update'!$C$5&\")\"","v":"Forecast Revenue (Pt 2020)*(Qt 2020)"},null,null,null,null,null,null,null,null,null,null,null,null,null,null,{"$f":"\"Revenue (Pt-1 \"&'Model update'!$C$8&\")*(Qt \" &'Model update'!$C$5&\")\"","v":"Revenue (Pt-1 2019)*(Qt 2020)"}]
[null,"Proposed tariff","Existing tariff","PropTar\nFixed","PropTar\nAnytime","PropTar\nPkBlk","PropTar\nOPkBlk1","PropTar\nDem kVA","PropTar\nDem kW Sum","PropTar\nDem kW Win","PropTar\nSumBlk1","PropTar\nSumBlk2","PropTar\nSumBlk3","PropTar\nWtrBlk1","PropTar\nWtrBlk2","PropTar\nWtrBlk3",null,"ExistTar\nFixed","ExistTar\nAnytime","ExistTar\nPk","ExistTar\nOPkBlk","ExistTar\nDem kVA","ExistTar\nDem kW Sum","ExistTar\nDem kW Win","ExistTar\nSumBlk1","ExistTar\nSumBlk2","ExistTar\nSumBlk3","ExistTar\nWtrBlk1","ExistTar\nWtrBlk2","ExistTar\nWtrBlk3",null,"FcastVol\nFixed","FcastVol\nAnytime","FcastVol\nPk","FcastVol\nOpk","FcastVol\nDem kVA","FcastVol\nDem kW Sum","FcastVol\nDem kW Win","FcastVol\nSumBlk1","FcastVol\nSumBlk2","FcastVol\nSumBlk3","FcastVol\nWtrBlk1","FcastVol\nWtrBlk2","FcastVol\nWtrBlk3",null,"PropRev\nFixed","PropRev\nAnytime","PropRev\nPk","PropRev\nOpk","PropRev\nDem kVA","PropRev\nDem kW Sum","PropRev\nDem kW Win","PropRev\nSumBlk1","PropRev\nSumBlk2","PropRev\nSumBlk3","PropRev\nWtrBlk1","PropRev\nWtrBlk2","PropRev\nWtrBlk3","PropRev\nTotal",null,"ExistRev\nFixed","ExistRev\nAnytime","ExistRev\nPk","ExistRev\nOpk","ExistRev\nDem kVA","ExistRev\nDem kW Sum","ExistRev\nDem kW Win","ExistRev\nSumBlk1","ExistRev\nSumBlk2","ExistRev\nSumBlk3","ExistRev\nWtrBlk1","ExistRev\nWtrBlk2","ExistRev\nWtrBlk3","ExistRev\nTotal"]
[{"$f":"Est2019DistRev!A6","v":"C1R"},{"$f":"C6","v":"Residential Single Rate"},{"$f":"Est2019DistRev!B6","v":"Residential Single Rate"},95,4.9000000000000004,0,0,0,0,0,0,0,0,0,0,0,null,{"$f":"Est2019DistRev!D6","v":90},{"$f":"Est2019DistRev!E6","v":4.72},{"$f":"Est2019DistRev!F6","v":0},{"$f":"Est2019DistRev!G6","v":0},{"$f":"Est2019DistRev!H6","v":0},{"$f":"Est2019DistRev!I6","v":0},{"$f":"Est2019DistRev!J6","v":0},{"$f":"Est2019DistRev!K6","v":0},{"$f":"Est2019DistRev!L6","v":0},{"$f":"Est2019DistRev!M6","v":0},{"$f":"Est2019DistRev!N6","v":0},{"$f":"Est2019DistRev!O6","v":0},{"$f":"Est2019DistRev!P6","v":0},null,206178.44076359438,848271452.54835963,0,0,0,0,0,0,0,0,0,0,0,null,{"$f":"D6*AF6","v":19586951.872541465},{"$f":"E6/100*AG6","v":41565301.174869627},0,0,{"$f":"H6*AJ6","v":0},{"$f":"I6*AK6","v":0},0,0,0,{"$f":"M6/100*AO6","v":0},{"$f":"N6/100*AP6","v":0},{"$f":"O6/100*AQ6","v":0},{"$f":"P6/100*AR6","v":0},{"$f":"SUM(AT6:BF6)","v":61152253.047411092},null,{"$f":"R6*AF6","v":18556059.668723494},{"$f":"S6/100*AG6","v":40038412.560282573},0,0,{"$f":"V6*AJ6","v":0},{"$f":"W6*AK6","v":0},0,0,0,{"$f":"AA6/100*AO6","v":0},{"$f":"AB6/100*AP6","v":0},{"$f":"AC6/100*AQ6","v":0},{"$f":"AD6/100*AR6","v":0},{"$f":"SUM(BI6:BU6)","v":58594472.229006067}]
[{"$f":"Est2019DistRev!A7","v":"C1RB"},{"$f":"C7","v":"Residential Single Rate - Bulk"},{"$f":"Est2019DistRev!B7","v":"Residential Single Rate - Bulk"},95,4.2,0,0,0,0,0,0,0,0,0,0,0,null,{"$f":"Est2019DistRev!D7","v":85},{"$f":"Est2019DistRev!E7","v":4.1500000000000004},{"$f":"Est2019DistRev!F7","v":0},{"$f":"Est2019DistRev!G7","v":0},{"$f":"Est2019DistRev!H7","v":0},{"$f":"Est2019DistRev!I7","v":0},{"$f":"Est2019DistRev!J7","v":0},{"$f":"Est2019DistRev!K7","v":0},{"$f":"Est2019DistRev!L7","v":0},{"$f":"Est2019DistRev!M7","v":0},{"$f":"Est2019DistRev!N7","v":0},{"$f":"Est2019DistRev!O7","v":0},{"$f":"Est2019DistRev!P7","v":0},null,31089.947611169671,107478291.59874508,0,0,0,0,0,0,0,0,0,0,0,null,{"$f":"D7*AF7","v":2953545.0230611186},{"$f":"E7/100*AG7","v":4514088.2471472938},0,0,{"$f":"H7*AJ7","v":0},{"$f":"I7*AK7","v":0},{"$f":"J7*AL7","v":0},0,0,0,0,0,0,{"$f":"SUM(AT7:BF7)","v":7467633.2702084128},null,{"$f":"R7*AF7","v":2642645.546949422},{"$f":"S7/100*AG7","v":4460349.1013479214},{"$f":"T7/100*AH7","v":0},{"$f":"U7/100*AI7","v":0},{"$f":"V7*AJ7","v":0},{"$f":"W7*AK7","v":0},{"$f":"X7*AL7","v":0},{"$f":"Y7/100*AM7","v":0},{"$f":"Z7/100*AN7","v":0},0,0,0,0,{"$f":"SUM(BI7:BU7)","v":7102994.6482973434}]
[{"$f":"Est2019DistRev!A8","v":"C13R"},"Residential - flexible pricing",{"$f":"Est2019DistRev!B8","v":"Residential - flexible pricing"},95,0,0,0,0,0,0,10.42,7.02,2.75,10.42,7.02,2.75,null,{"$f":"Est2019DistRev!D8","v":90},{"$f":"Est2019DistRev!E8","v":0},{"$f":"Est2019DistRev!F8","v":0},{"$f":"Est2019DistRev!G8","v":0},{"$f":"Est2019DistRev!H8","v":0},{"$f":"Est2019DistRev!I8","v":0},{"$f":"Est2019DistRev!J8","v":0},{"$f":"Est2019DistRev!K8","v":10.79},{"$f":"Est2019DistRev!L8","v":7.27},{"$f":"Est2019DistRev!M8","v":2.86},{"$f":"Est2019DistRev!N8","v":10.79},{"$f":"Est2019DistRev!O8","v":7.27},{"$f":"Est2019DistRev!P8","v":2.86},null,697.78377437315021,0,0,0,0,0,0,182885.28410131854,388824.70973085507,289537.60955412494,700283.25333285017,1488842.7685394138,1108664.046848356,null,66289.458565449269,0,0,0,0,0,0,19056.646603357392,27295.494623106024,7962.2842627384362,72969.514997282982,104516.76235146685,30488.261288329792,328578.42269173072,null,62800.539693583516,0,0,0,0,0,0,19733.32215453227,28267.556397433164,8280.775633247973,75560.563034614534,108238.86927281538,31707.791739862983,334589.41792608984]
[{"$f":"Est2019DistRev!A9","v":"C13RB"},"Residential - flexible pricing bulk",{"$f":"Est2019DistRev!B9","v":"Residential - flexible pricing bulk"},95,0,0,0,0,0,0,9.69,6.52,2.56,9.69,6.52,2.56,null,{"$f":"Est2019DistRev!D9","v":85},{"$f":"Est2019DistRev!E9","v":0},{"$f":"Est2019DistRev!F9","v":0},{"$f":"Est2019DistRev!G9","v":0},{"$f":"Est2019DistRev!H9","v":0},{"$f":"Est2019DistRev!I9","v":0},{"$f":"Est2019DistRev!J9","v":0},{"$f":"Est2019DistRev!K9","v":9.0500000000000007},{"$f":"Est2019DistRev!L9","v":6.1},{"$f":"Est2019DistRev!M9","v":2.39},{"$f":"Est2019DistRev!N9","v":9.0500000000000007},{"$f":"Est2019DistRev!O9","v":6.1},{"$f":"Est2019DistRev!P9","v":2.39},null,92.829526834867764,0,0,0,0,0,0,15622.006825940556,33980.313696763908,24260.31259187479,58675.496976719034,127628.40368701438,91120.552820082667,null,8818.8050493124374,0,0,0,0,0,0,1513.7724614336398,2215.5164530290067,621.06400235199465,5685.6556570440744,8321.371920393336,2332.6861521941164,29508.871695758608,null,7890.50978096376,0,0,0,0,0,0,1413.7916177476204,2072.7991355025983,579.8214709458075,5310.1324763930734,7785.3326249078764,2177.7812123999756,27230.168318860713]
[{"$f":"Est2019DistRev!A10","v":"C2R"},"Residential Two Rate 5d",{"$f":"Est2019DistRev!B10","v":"Residential Two Rate 5d"},95,0,9.39,2.4700000000000002,0,0,0,0,0,0,0,0,0,null,{"$f":"Est2019DistRev!D10","v":90},{"$f":"Est2019DistRev!E10","v":0},{"$f":"Est2019DistRev!F10","v":9.7200000000000006},{"$f":"Est2019DistRev!G10","v":2.31},{"$f":"Est2019DistRev!H10","v":0},{"$f":"Est2019DistRev!I10","v":0},{"$f":"Est2019DistRev!J10","v":0},{"$f":"Est2019DistRev!K10","v":0},{"$f":"Est2019DistRev!L10","v":0},{"$f":"Est2019DistRev!M10","v":0},{"$f":"Est2019DistRev!N10","v":0},{"$f":"Est2019DistRev!O10","v":0},{"$f":"Est2019DistRev!P10","v":0},null,10806.12165035933,0,33449615.665798429,29269859.989206955,0,0,0,0,0,0,0,0,0,null,1026581.5567841363,0,3140918.9110184731,722965.54173341184,0,0,0,0,0,0,0,0,0,4890466.0095360214,null,972550.94853233965,0,3251302.6427156078,676133.76575068058,0,0,0,0,0,0,0,0,0,4899987.356998628]
[{"$f":"Est2019DistRev!A11","v":"C2RB"},"Residential Two Rate 5d - Bulk",{"$f":"Est2019DistRev!B11","v":"Residential Two Rate 5d - Bulk"},95,0,8.4499999999999993,2.34,0,0,0,0,0,0,0,0,0,null,{"$f":"Est2019DistRev!D11","v":85},{"$f":"Est2019DistRev!E11","v":0},{"$f":"Est2019DistRev!F11","v":8.56},{"$f":"Est2019DistRev!G11","v":2.16},{"$f":"Est2019DistRev!H11","v":0},{"$f":"Est2019DistRev!I11","v":0},{"$f":"Est2019DistRev!J11","v":0},{"$f":"Est2019DistRev!K11","v":0},{"$f":"Est2019DistRev!L11","v":0},{"$f":"Est2019DistRev!M11","v":0},{"$f":"Est2019DistRev!N11","v":0},{"$f":"Est2019DistRev!O11","v":0},{"$f":"Est2019DistRev!P11","v":0},null,4316.8242068076952,0,12001250.20375419,10487452.702396166,0,0,0,0,0,0,0,0,0,null,410098.29964673106,0,1014105.642217229,245406.39323607023,0,0,0,0,0,0,0,0,0,1669610.3351000303,null,366930.05757865409,0,1027307.0174413588,226528.9783717572,0,0,0,0,0,0,0,0,0,1620766.05339177]
[{"$f":"Est2019DistRev!A12","v":"C3R"},"Residential Interval",{"$f":"Est2019DistRev!B12","v":"Residential Interval"},95,0,9.39,2.4700000000000002,0,0,0,0,0,0,0,0,0,null,{"$f":"Est2019DistRev!D12","v":90},{"$f":"Est2019DistRev!E12","v":0},{"$f":"Est2019DistRev!F12","v":9.7200000000000006},{"$f":"Est2019DistRev!G12","v":2.31},{"$f":"Est2019DistRev!H12","v":0},{"$f":"Est2019DistRev!I12","v":0},{"$f":"Est2019DistRev!J12","v":0},{"$f":"Est2019DistRev!K12","v":0},{"$f":"Est2019DistRev!L12","v":0},{"$f":"Est2019DistRev!M12","v":0},{"$f":"Est2019DistRev!N12","v":0},{"$f":"Est2019DistRev!O12","v":0},{"$f":"Est2019DistRev!P12","v":0},null,17021.34204511912,0,51729844.462038442,45571765.373176172,0,0,0,0,0,0,0,0,0,null,1617027.4942863164,0,4857432.3949854104,1125622.6047174516,0,0,0,0,0,0,0,0,0,7600082.4939891789,null,1531920.7840607208,0,5028140.8817101372,1052707.7801203695,0,0,0,0,0,0,0,0,0,7612769.4458912276]
[{"$f":"Est2019DistRev!A13","v":"C3RB"},"Residential Interval - Bulk",{"$f":"Est2019DistRev!B13","v":"Residential Interval - Bulk"},95,0,8.4499999999999993,2.34,0,0,0,0,0,0,0,0,0,null,{"$f":"Est2019DistRev!D13","v":85},{"$f":"Est2019DistRev!E13","v":0},{"$f":"Est2019DistRev!F13","v":8.56},{"$f":"Est2019DistRev!G13","v":2.16},{"$f":"Est2019DistRev!H13","v":0},{"$f":"Est2019DistRev!I13","v":0},{"$f":"Est2019DistRev!J13","v":0},{"$f":"Est2019DistRev!K13","v":0},{"$f":"Est2019DistRev!L13","v":0},{"$f":"Est2019DistRev!M13","v":0},{"$f":"Est2019DistRev!N13","v":0},{"$f":"Est2019DistRev!O13","v":0},{"$f":"Est2019DistRev!P13","v":0},null,8705.3498093096259,0,15093462.866443299,14304461.07940924,0,0,0,0,0,0,0,0,0,null,827008.23188441445,0,1275397.6122144586,334724.38925817615,0,0,0,0,0,0,0,0,0,2437130.2333570491,null,739954.73379131826,0,1292000.4213675465,308976.35931523959,0,0,0,0,0,0,0,0,0,2340931.5144741042]
[{"$f":"Est2019DistRev!A14","v":"C2ROP"},"Residential Two Rate 5d - Controlled Load",{"$f":"Est2019DistRev!B14","v":"Residential Two Rate 5d - Controlled Load"},0,0,0,0,0,0,0,0,0,0,0,0,0,null,{"$f":"Est2019DistRev!D14","v":0},{"$f":"Est2019DistRev!E14","v":0},{"$f":"Est2019DistRev!F14","v":0},{"$f":"Est2019DistRev!G14","v":1.76},{"$f":"Est2019DistRev!H14","v":0},{"$f":"Est2019DistRev!I14","v":0},{"$f":"Est2019DistRev!J14","v":0},{"$f":"Est2019DistRev!K14","v":0},{"$f":"Est2019DistRev!L14","v":0},{"$f":"Est2019DistRev!M14","v":0},{"$f":"Est2019DistRev!N14","v":0},{"$f":"Est2019DistRev!O14","v":0},{"$f":"Est2019DistRev!P14","v":0},null,0,0,0,0,0,0,0,0,0,0,0,0,0,null,0,0,0,0,0,0,0,0,0,0,0,0,0,0,null,0,0,0,0,0,0,0,0,0,0,0,0,0,0]
[{"$f":"Est2019DistRev!A15","v":"C2RBOP"},"Residential Two Rate 5d - Bulk - Controlled Load",{"$f":"Est2019DistRev!B15","v":"Residential Two Rate 5d - Bulk - Controlled Load"},0,0,0,0,0,0,0,0,0,0,0,0,0,null,{"$f":"Est2019DistRev!D15","v":0},{"$f":"Est2019DistRev!E15","v":0},{"$f":"Est2019DistRev!F15","v":0},{"$f":"Est2019DistRev!G15","v":1.44},{"$f":"Est2019DistRev!H15","v":0},{"$f":"Est2019DistRev!I15","v":0},{"$f":"Est2019DistRev!J15","v":0},{"$f":"Est2019DistRev!K15","v":0},{"$f":"Est2019DistRev!L15","v":0},{"$f":"Est2019DistRev!M15","v":0},{"$f":"Est2019DistRev!N15","v":0},{"$f":"Est2019DistRev!O15","v":0},{"$f":"Est2019DistRev!P15","v":0},null,0,0,0,0,0,0,0,0,0,0,0,0,0,null,0,0,0,0,0,0,0,0,0,0,0,0,0,0,null,0,0,0,0,0,0,0,0,0,0,0,0,0,0]
[{"$f":"Est2019DistRev!A16","v":"CDS"},"Dedicated Circuit",{"$f":"Est2019DistRev!B16","v":"Dedicated Circuit"},0,0,0,1.7,0,0,0,0,0,0,0,0,0,null,{"$f":"Est2019DistRev!D16","v":0},{"$f":"Est2019DistRev!E16","v":0},{"$f":"Est2019DistRev!F16","v":0},{"$f":"Est2019DistRev!G16","v":1.76},{"$f":"Est2019DistRev!H16","v":0},{"$f":"Est2019DistRev!I16","v":0},{"$f":"Est2019DistRev!J16","v":0},{"$f":"Est2019DistRev!K16","v":0},{"$f":"Est2019DistRev!L16","v":0},{"$f":"Est2019DistRev!M16","v":0},{"$f":"Est2019DistRev!N16","v":0},{"$f":"Est2019DistRev!O16","v":0},{"$f":"Est2019DistRev!P16","v":0},null,32498.745053272465,0,0,50045800.11975988,0,0,0,0,0,0,0,0,0,null,0,0,0,850778.60203591804,0,0,0,0,0,0,0,0,0,850778.60203591804,null,0,0,0,880806.08210777398,0,0,0,0,0,0,0,0,0,880806.08210777398]
[{"$f":"Est2019DistRev!A17","v":"CDSB"},"Dedicated Circuit - Bulk",{"$f":"Est2019DistRev!B17","v":"Dedicated Circuit - Bulk"},0,0,0,1.38,0,0,0,0,0,0,0,0,0,null,{"$f":"Est2019DistRev!D17","v":0},{"$f":"Est2019DistRev!E17","v":0},{"$f":"Est2019DistRev!F17","v":0},{"$f":"Est2019DistRev!G17","v":1.44},{"$f":"Est2019DistRev!H17","v":0},{"$f":"Est2019DistRev!I17","v":0},{"$f":"Est2019DistRev!J17","v":0},{"$f":"Est2019DistRev!K17","v":0},{"$f":"Est2019DistRev!L17","v":0},{"$f":"Est2019DistRev!M17","v":0},{"$f":"Est2019DistRev!N17","v":0},{"$f":"Est2019DistRev!O17","v":0},{"$f":"Est2019DistRev!P17","v":0},null,5581.4193302891908,0,0,9263135.8289495241,0,0,0,0,0,0,0,0,0,null,0,0,0,127831.27443950342,0,0,0,0,0,0,0,0,0,127831.27443950342,null,0,0,0,133389.15593687314,0,0,0,0,0,0,0,0,0,133389.15593687314]
[{"$f":"Est2019DistRev!A18","v":"CR"},"Residential Demand",{"$f":"Est2019DistRev!B18","v":"Residential Demand"},95,2.79,0,0,0,6.81,2.34,0,0,0,0,0,0,null,{"$f":"Est2019DistRev!D18","v":90},{"$f":"Est2019DistRev!E18","v":2.89},{"$f":"Est2019DistRev!F18","v":0},{"$f":"Est2019DistRev!G18","v":0},{"$f":"Est2019DistRev!H18","v":0},{"$f":"Est2019DistRev!I18","v":7.04},{"$f":"Est2019DistRev!J18","v":2.41},{"$f":"Est2019DistRev!K18","v":0},{"$f":"Est2019DistRev!L18","v":0},{"$f":"Est2019DistRev!M18","v":0},{"$f":"Est2019DistRev!N18","v":0},{"$f":"Est2019DistRev!O18","v":0},{"$f":"Est2019DistRev!P18","v":0},null,8.4225614876243853,49160.9218844563,0,0,0,91.993203745090227,214.72009856865083,0,0,0,0,0,0,null,800.14334132431657,1371.5897205763308,0,0,0,626.47371750406444,502.44503065064288,0,0,0,0,0,0,3300.6518100553549,null,758.03053388619469,1420.7506424607873,0,0,0,647.63215436543521,517.47543755044853,0,0,0,0,0,0,3343.8887682628656]
[{"$f":"Est2019DistRev!A19","v":"CRB"},"Residential Bulk Demand",{"$f":"Est2019DistRev!B19","v":"Residential Bulk Demand"},95,2.2200000000000002,0,0,0,5.54,1.87,0,0,0,0,0,0,null,{"$f":"Est2019DistRev!D19","v":85},{"$f":"Est2019DistRev!E19","v":2.0299999999999998},{"$f":"Est2019DistRev!F19","v":0},{"$f":"Est2019DistRev!G19","v":0},{"$f":"Est2019DistRev!H19","v":0},{"$f":"Est2019DistRev!I19","v":5.54},{"$f":"Est2019DistRev!J19","v":1.86},{"$f":"Est2019DistRev!K19","v":0},{"$f":"Est2019DistRev!L19","v":0},{"$f":"Est2019DistRev!M19","v":0},{"$f":"Est2019DistRev!N19","v":0},{"$f":"Est2019DistRev!O19","v":0},{"$f":"Est2019DistRev!P19","v":0},null,1.9569063180827886,11446.587208253419,0,0,0,18.995011764705886,47.503513725490194,0,0,0,0,0,0,null,185.90610021786492,254.11423602322591,0,0,0,105.23236517647061,88.831570666666664,0,0,0,0,0,0,634.08427208422813,null,166.33703703703702,232.36572032754438,0,0,0,105.23236517647061,88.356535529411772,0,0,0,0,0,0,592.29165807046377]
[{"$f":"Est2019DistRev!A20","v":"C1G"},"Non-Residential Single Rate",{"$f":"Est2019DistRev!B20","v":"Non-Residential Single Rate"},160,6.36,0,0,0,0,0,0,0,0,0,0,0,null,{"$f":"Est2019DistRev!D20","v":150},{"$f":"Est2019DistRev!E20","v":5.96},{"$f":"Est2019DistRev!F20","v":0},{"$f":"Est2019DistRev!G20","v":0},{"$f":"Est2019DistRev!H20","v":0},{"$f":"Est2019DistRev!I20","v":0},{"$f":"Est2019DistRev!J20","v":0},{"$f":"Est2019DistRev!K20","v":0},{"$f":"Est2019DistRev!L20","v":0},{"$f":"Est2019DistRev!M20","v":0},{"$f":"Est2019DistRev!N20","v":0},{"$f":"Est2019DistRev!O20","v":0},{"$f":"Est2019DistRev!P20","v":0},null,19278.928459938834,234414508.13361585,0,0,0,0,0,0,0,0,0,0,0,null,3084628.5535902134,14908762.717297969,0,0,0,0,0,0,0,0,0,0,0,17993391.270888183,null,2891839.2689908249,13971104.684763504,0,0,0,0,0,0,0,0,0,0,0,16862943.953754328]
[{"$f":"Est2019DistRev!A21","v":"C1GB"},"Non-Residential Single Rate - Bulk",{"$f":"Est2019DistRev!B21","v":"Non-Residential Single Rate - Bulk"},160,5.78,0,0,0,0,0,0,0,0,0,0,0,null,{"$f":"Est2019DistRev!D21","v":140},{"$f":"Est2019DistRev!E21","v":4.84},{"$f":"Est2019DistRev!F21","v":0},{"$f":"Est2019DistRev!G21","v":0},{"$f":"Est2019DistRev!H21","v":0},{"$f":"Est2019DistRev!I21","v":0},{"$f":"Est2019DistRev!J21","v":0},{"$f":"Est2019DistRev!K21","v":0},{"$f":"Est2019DistRev!L21","v":0},{"$f":"Est2019DistRev!M21","v":0},{"$f":"Est2019DistRev!N21","v":0},{"$f":"Est2019DistRev!O21","v":0},{"$f":"Est2019DistRev!P21","v":0},null,5769.6090324287434,81668548.051084116,0,0,0,0,0,0,0,0,0,0,0,null,923137.44518859894,4720442.0773526626,0,0,0,0,0,0,0,0,0,0,0,5643579.5225412613,null,807745.2645400241,3952757.7256724709,0,0,0,0,0,0,0,0,0,0,0,4760502.9902124945]
[{"$f":"Est2019DistRev!A22","v":"C2G5"},"Non-Residential Two Rate 5d",{"$f":"Est2019DistRev!B22","v":"Non-Residential Two Rate 5d"},160,0,9.8800000000000008,3.09,0,0,0,0,0,0,0,0,0,null,{"$f":"Est2019DistRev!D22","v":150},{"$f":"Est2019DistRev!E22","v":0},{"$f":"Est2019DistRev!F22","v":8.9600000000000009},{"$f":"Est2019DistRev!G22","v":2.58},{"$f":"Est2019DistRev!H22","v":0},{"$f":"Est2019DistRev!I22","v":0},{"$f":"Est2019DistRev!J22","v":0},{"$f":"Est2019DistRev!K22","v":0},{"$f":"Est2019DistRev!L22","v":0},{"$f":"Est2019DistRev!M22","v":0},{"$f":"Est2019DistRev!N22","v":0},{"$f":"Est2019DistRev!O22","v":0},{"$f":"Est2019DistRev!P22","v":0},null,6175.6551246567678,0,70438600.5182468,44830727.118458346,0,0,0,0,0,0,0,0,0,null,988104.81994508288,0,6959333.7312027849,1385269.4679603628,0,0,0,0,0,0,0,0,0,9332708.0191082302,null,926348.26869851514,0,6311298.6064349143,1156632.7596562253,0,0,0,0,0,0,0,0,0,8394279.634789655]
[{"$f":"Est2019DistRev!A23","v":"C2G5B"},"Non-Residential Two Rate 5d - Bulk",{"$f":"Est2019DistRev!B23","v":"Non-Residential Two Rate 5d - Bulk"},160,0,8.19,2.65,0,0,0,0,0,0,0,0,0,null,{"$f":"Est2019DistRev!D23","v":140},{"$f":"Est2019DistRev!E23","v":0},{"$f":"Est2019DistRev!F23","v":6.99},{"$f":"Est2019DistRev!G23","v":2.11},{"$f":"Est2019DistRev!H23","v":0},{"$f":"Est2019DistRev!I23","v":0},{"$f":"Est2019DistRev!J23","v":0},{"$f":"Est2019DistRev!K23","v":0},{"$f":"Est2019DistRev!L23","v":0},{"$f":"Est2019DistRev!M23","v":0},{"$f":"Est2019DistRev!N23","v":0},{"$f":"Est2019DistRev!O23","v":0},{"$f":"Est2019DistRev!P23","v":0},null,999.43191263014216,0,16508026.378642861,10058974.835898034,0,0,0,0,0,0,0,0,0,null,159909.10602082274,0,1352007.3604108503,266562.83315129788,0,0,0,0,0,0,0,0,0,1778479.2995829708,null,139920.46776821991,0,1153911.0438671361,212244.36903744849,0,0,0,0,0,0,0,0,0,1506075.8806728045]
[{"$f":"Est2019DistRev!A24","v":"C3G"},"Non-Residential Interval",{"$f":"Est2019DistRev!B24","v":"Non-Residential Interval"},160,0,9.8800000000000008,2.86,0,0,0,0,0,0,0,0,0,null,{"$f":"Est2019DistRev!D24","v":150},{"$f":"Est2019DistRev!E24","v":0},{"$f":"Est2019DistRev!F24","v":8.9600000000000009},{"$f":"Est2019DistRev!G24","v":2.37},{"$f":"Est2019DistRev!H24","v":0},{"$f":"Est2019DistRev!I24","v":0},{"$f":"Est2019DistRev!J24","v":0},{"$f":"Est2019DistRev!K24","v":0},{"$f":"Est2019DistRev!L24","v":0},{"$f":"Est2019DistRev!M24","v":0},{"$f":"Est2019DistRev!N24","v":0},{"$f":"Est2019DistRev!O24","v":0},{"$f":"Est2019DistRev!P24","v":0},null,3789.6292029166912,0,44801539.356732354,25848586.997369338,0,0,0,0,0,0,0,0,0,null,606340.67246667063,0,4426392.0884451568,739269.5881247631,0,0,0,0,0,0,0,0,0,5772002.3490365911,null,568444.38043750369,0,4014217.9263632195,612611.51183765335,0,0,0,0,0,0,0,0,0,5195273.8186383769]
[{"$f":"Est2019DistRev!A25","v":"C3GB"},"Non-Residential Interval - Bulk",{"$f":"Est2019DistRev!B25","v":"Non-Residential Interval - Bulk"},160,0,8.19,2.65,0,0,0,0,0,0,0,0,0,null,{"$f":"Est2019DistRev!D25","v":140},{"$f":"Est2019DistRev!E25","v":0},{"$f":"Est2019DistRev!F25","v":6.99},{"$f":"Est2019DistRev!G25","v":2.11},{"$f":"Est2019DistRev!H25","v":0},{"$f":"Est2019DistRev!I25","v":0},{"$f":"Est2019DistRev!J25","v":0},{"$f":"Est2019DistRev!K25","v":0},{"$f":"Est2019DistRev!L25","v":0},{"$f":"Est2019DistRev!M25","v":0},{"$f":"Est2019DistRev!N25","v":0},{"$f":"Est2019DistRev!O25","v":0},{"$f":"Est2019DistRev!P25","v":0},null,1768.9772717301021,0,27824537.942965478,14553393.117495544,0,0,0,0,0,0,0,0,0,null,283036.36347681633,0,2278829.6575288726,385664.91761363193,0,0,0,0,0,0,0,0,0,2947530.9386193212,null,247656.81804221429,0,1944935.2022132869,307076.59477915592,0,0,0,0,0,0,0,0,0,2499668.6150346575]
[{"$f":"Est2019DistRev!A26","v":"C14G"},"Non-Residential Flexible Pricing",{"$f":"Est2019DistRev!B26","v":"Non-Residential Flexible Pricing"},160,0,0,0,0,0,0,12.04,8.41,3.31,12.04,8.41,3.31,null,{"$f":"Est2019DistRev!D26","v":150},{"$f":"Est2019DistRev!E26","v":0},{"$f":"Est2019DistRev!F26","v":0},{"$f":"Est2019DistRev!G26","v":0},{"$f":"Est2019DistRev!H26","v":0},{"$f":"Est2019DistRev!I26","v":0},{"$f":"Est2019DistRev!J26","v":0},{"$f":"Est2019DistRev!K26","v":10.92},{"$f":"Est2019DistRev!L26","v":7.63},{"$f":"Est2019DistRev!M26","v":3},{"$f":"Est2019DistRev!N26","v":10.92},{"$f":"Est2019DistRev!O26","v":7.63},{"$f":"Est2019DistRev!P26","v":3},null,20.735050198175649,0,0,0,0,0,0,54335.809564896466,14519.639818854528,41864.179794472628,174859.38124809813,46726.003624512079,134724.12823034308,null,3317.6080317081041,0,0,0,0,0,0,6542.0314716135344,1221.101708765666,1385.7043511970439,21053.069502271013,3929.656904821466,4459.3686444243558,41908.540614801183,null,3110.2575297263475,0,0,0,0,0,0,5933.4704044866949,1107.8485181786004,1255.9253938341787,19094.644432292316,3565.1940765502713,4041.7238469102922,38109.064201978705]
[{"$f":"Est2019DistRev!A27","v":"C14GB"},"Non-Residential - Flexible Pricing Bulk",{"$f":"Est2019DistRev!B27","v":"Non-Residential - Flexible Pricing Bulk"},160,0,0,0,0,0,0,10.83,7.57,2.97,10.83,7.57,2.97,null,{"$f":"Est2019DistRev!D27","v":140},{"$f":"Est2019DistRev!E27","v":0},{"$f":"Est2019DistRev!F27","v":0},{"$f":"Est2019DistRev!G27","v":0},{"$f":"Est2019DistRev!H27","v":0},{"$f":"Est2019DistRev!I27","v":0},{"$f":"Est2019DistRev!J27","v":0},{"$f":"Est2019DistRev!K27","v":9.6},{"$f":"Est2019DistRev!L27","v":6.71},{"$f":"Est2019DistRev!M27","v":2.64},{"$f":"Est2019DistRev!N27","v":9.6},{"$f":"Est2019DistRev!O27","v":6.71},{"$f":"Est2019DistRev!P27","v":2.64},null,0.91833100642885634,0,0,0,0,0,0,22949.497197675988,5681.9549022702613,20258.102900905364,41846.928543241178,10360.678438101071,36939.344562270453,null,146.932961028617,0,0,0,0,0,0,2485.4305465083098,430.1239861018588,601.66565615688933,4532.0223612330201,784.30335776425113,1097.0985334994325,10077.577402292378,null,128.56634090003988,0,0,0,0,0,0,2203.1517309768947,381.25917394233448,534.81391658390157,4017.305140151153,695.20152319658177,975.19869644393998,8935.496522194846]
[{"$f":"Est2019DistRev!A28","v":"C2G7"},"Non-Residential Two Rate 7d",{"$f":"Est2019DistRev!B28","v":"Non-Residential Two Rate 7d"},160,0,7.77,2.86,0,0,0,0,0,0,0,0,0,null,{"$f":"Est2019DistRev!D28","v":150},{"$f":"Est2019DistRev!E28","v":0},{"$f":"Est2019DistRev!F28","v":7.05},{"$f":"Est2019DistRev!G28","v":2.37},{"$f":"Est2019DistRev!H28","v":0},{"$f":"Est2019DistRev!I28","v":0},{"$f":"Est2019DistRev!J28","v":0},{"$f":"Est2019DistRev!K28","v":0},{"$f":"Est2019DistRev!L28","v":0},{"$f":"Est2019DistRev!M28","v":0},{"$f":"Est2019DistRev!N28","v":0},{"$f":"Est2019DistRev!O28","v":0},{"$f":"Est2019DistRev!P28","v":0},null,2306.9483847452143,0,38369324.717720643,9290402.2119519673,0,0,0,0,0,0,0,0,0,null,369111.74155923427,0,2981296.5305668935,265705.50326182629,0,0,0,0,0,0,0,0,0,3616113.7753879544,null,346042.25771178212,0,2705037.3925993051,220182.53242326164,0,0,0,0,0,0,0,0,0,3271262.1827343488]
[{"$f":"Est2019DistRev!A29","v":"C2G7B"},"Non-Residential Two Rate 7d - Bulk",{"$f":"Est2019DistRev!B29","v":"Non-Residential Two Rate 7d - Bulk"},160,0,7.14,2.65,0,0,0,0,0,0,0,0,0,null,{"$f":"Est2019DistRev!D29","v":140},{"$f":"Est2019DistRev!E29","v":0},{"$f":"Est2019DistRev!F29","v":6.27},{"$f":"Est2019DistRev!G29","v":2.11},{"$f":"Est2019DistRev!H29","v":0},{"$f":"Est2019DistRev!I29","v":0},{"$f":"Est2019DistRev!J29","v":0},{"$f":"Est2019DistRev!K29","v":0},{"$f":"Est2019DistRev!L29","v":0},{"$f":"Est2019DistRev!M29","v":0},{"$f":"Est2019DistRev!N29","v":0},{"$f":"Est2019DistRev!O29","v":0},{"$f":"Est2019DistRev!P29","v":0},null,223.54159787790852,0,4879506.8354705516,1213336.752724601,0,0,0,0,0,0,0,0,0,null,35766.65566046536,0,348396.78805259732,32153.423947201925,0,0,0,0,0,0,0,0,0,416316.8676602646,null,31295.823702907193,0,305945.07858400355,25601.405482489077,0,0,0,0,0,0,0,0,0,362842.30776939983]
[{"$f":"Est2019DistRev!A30","v":"C2L7"},"Large Two Rate 7d",{"$f":"Est2019DistRev!B30","v":"Large Two Rate 7d"},160,0,9.8800000000000008,3.09,0,0,0,0,0,0,0,0,0,null,{"$f":"Est2019DistRev!D30","v":150},{"$f":"Est2019DistRev!E30","v":0},{"$f":"Est2019DistRev!F30","v":8.9600000000000009},{"$f":"Est2019DistRev!G30","v":2.58},{"$f":"Est2019DistRev!H30","v":0},{"$f":"Est2019DistRev!I30","v":0},{"$f":"Est2019DistRev!J30","v":0},{"$f":"Est2019DistRev!K30","v":0},{"$f":"Est2019DistRev!L30","v":0},{"$f":"Est2019DistRev!M30","v":0},{"$f":"Est2019DistRev!N30","v":0},{"$f":"Est2019DistRev!O30","v":0},{"$f":"Est2019DistRev!P30","v":0},null,1,0,43593.813751616013,17808.880496742764,0,0,0,0,0,0,0,0,0,null,160,0,4307.0687986596622,550.29440734935133,0,0,0,0,0,0,0,0,0,5017.3632060090131,null,150,0,3906.0057121447953,459.46911681596333,0,0,0,0,0,0,0,0,0,4515.4748289607587]
[{"$f":"Est2019DistRev!A31","v":"CG"},"Non-Residential Demand Tariff",{"$f":"Est2019DistRev!B31","v":"Non-Residential Demand Tariff"},160,3.61,0,0,0,11.51,3.84,0,0,0,0,0,0,null,{"$f":"Est2019DistRev!D31","v":150},{"$f":"Est2019DistRev!E31","v":3.27},{"$f":"Est2019DistRev!F31","v":0},{"$f":"Est2019DistRev!G31","v":0},{"$f":"Est2019DistRev!H31","v":0},{"$f":"Est2019DistRev!I31","v":10.43},{"$f":"Est2019DistRev!J31","v":3.48},{"$f":"Est2019DistRev!K31","v":0},{"$f":"Est2019DistRev!L31","v":0},{"$f":"Est2019DistRev!M31","v":0},{"$f":"Est2019DistRev!N31","v":0},{"$f":"Est2019DistRev!O31","v":0},{"$f":"Est2019DistRev!P31","v":0},null,66.714761999582805,5507232.35853214,0,0,0,1303.8375558307982,2992.2591172023403,0,0,0,0,0,0,null,10674.36191993325,198811.08814301025,0,0,0,15007.170267612488,11490.275010056987,0,0,0,0,0,0,235982.895340613,null,10007.214299937421,180086.49812400097,0,0,0,13599.025707315226,10413.061727864144,0,0,0,0,0,0,214105.79985911775]
[{"$f":"Est2019DistRev!A32","v":"CGB"},"Non-Residential Bulk Demand Tariff",{"$f":"Est2019DistRev!B32","v":"Non-Residential Bulk Demand Tariff"},160,3.35,0,0,0,9.7799999999999994,3.26,0,0,0,0,0,0,null,{"$f":"Est2019DistRev!D32","v":140},{"$f":"Est2019DistRev!E32","v":3},{"$f":"Est2019DistRev!F32","v":0},{"$f":"Est2019DistRev!G32","v":0},{"$f":"Est2019DistRev!H32","v":0},{"$f":"Est2019DistRev!I32","v":8.35},{"$f":"Est2019DistRev!J32","v":2.78},{"$f":"Est2019DistRev!K32","v":0},{"$f":"Est2019DistRev!L32","v":0},{"$f":"Est2019DistRev!M32","v":0},{"$f":"Est2019DistRev!N32","v":0},{"$f":"Est2019DistRev!O32","v":0},{"$f":"Est2019DistRev!P32","v":0},null,148.11154188428057,12837801.451158172,0,0,0,2650.3625109708137,6065.86859366513,0,0,0,0,0,0,null,23697.84670148489,430066.34861379879,0,0,0,25920.545357294555,19774.731615348323,0,0,0,0,0,0,499459.47228792653,null,20735.615863799281,385134.04353474511,0,0,0,22130.526966606292,16863.114690389059,0,0,0,0,0,0,444863.30105553975]
[{"$f":"Est2019DistRev!A33","v":"CMG"},"Medium Business Demand",{"$f":"Est2019DistRev!B33","v":"Medium Business Demand"},1200,0,3.03,3.03,0,9.7200000000000006,3.24,0,0,0,0,0,0,null,{"$f":"Est2019DistRev!D33","v":1000},{"$f":"Est2019DistRev!E33","v":0},{"$f":"Est2019DistRev!F33","v":4.2},{"$f":"Est2019DistRev!G33","v":3.21},{"$f":"Est2019DistRev!H33","v":0},{"$f":"Est2019DistRev!I33","v":5.69},{"$f":"Est2019DistRev!J33","v":2.84},{"$f":"Est2019DistRev!K33","v":0},{"$f":"Est2019DistRev!L33","v":0},{"$f":"Est2019DistRev!M33","v":0},{"$f":"Est2019DistRev!N33","v":0},{"$f":"Est2019DistRev!O33","v":0},{"$f":"Est2019DistRev!P33","v":0},{"$f":"Est2019DistRev!Q33","v":0},4403.4018551523304,0,339952679.85718626,250709652.79220656,0,724859.65449187229,1273831.0316474377,0,0,0,0,0,0,null,5284082.2261827961,0,10300566.199672742,7596502.4796038577,0,7045635.8416609988,4127212.5425376985,0,0,0,0,0,0,34353999.289658092,null,4403401.8551523304,0,14278012.554001823,8047779.8546298295,0,4124451.4340587538,3617680.1298787231,0,0,0,0,0,0,34471325.827721462]
[{"$f":"Est2019DistRev!A34","v":"CMGB"},"Medium Business Bulk Demand",{"$f":"Est2019DistRev!B34","v":"Medium Business Bulk Demand"},1200,0,2.57,2.57,0,8.0299999999999994,2.92,0,0,0,0,0,0,null,{"$f":"Est2019DistRev!D34","v":975},{"$f":"Est2019DistRev!E34","v":0},{"$f":"Est2019DistRev!F34","v":3.33},{"$f":"Est2019DistRev!G34","v":2.66},{"$f":"Est2019DistRev!H34","v":0},{"$f":"Est2019DistRev!I34","v":4.55},{"$f":"Est2019DistRev!J34","v":2.2799999999999998},{"$f":"Est2019DistRev!K34","v":0},{"$f":"Est2019DistRev!L34","v":0},{"$f":"Est2019DistRev!M34","v":0},{"$f":"Est2019DistRev!N34","v":0},{"$f":"Est2019DistRev!O34","v":0},{"$f":"Est2019DistRev!P34","v":0},{"$f":"Est2019DistRev!Q34","v":0},2080.7408836331665,0,235523158.73965827,157971528.62473217,0,491954.4922444757,811784.27501472388,0,0,0,0,0,0,null,2496889.0603597998,0,6052945.1796092167,4059868.2856556163,0,3950394.5727231395,2370410.0830429937,0,0,0,0,0,0,18930507.181390766,null,2028722.3615423373,0,7842921.1860306207,4202042.6614178764,0,2238392.9397123642,1850868.1470335703,0,0,0,0,0,0,18162947.295736767]
[{"$f":"Est2019DistRev!A35","v":"CMGO"},"Medium Business Opt-out",{"$f":"Est2019DistRev!B35","v":"Medium Business Opt-out"},1200,0,7.95,3.18,0,0,0,0,0,0,0,0,0,null,{"$f":"Est2019DistRev!D35","v":1000},{"$f":"Est2019DistRev!E35","v":0},{"$f":"Est2019DistRev!F35","v":8.32},{"$f":"Est2019DistRev!G35","v":3.32},{"$f":"Est2019DistRev!H35","v":0},{"$f":"Est2019DistRev!I35","v":0},{"$f":"Est2019DistRev!J35","v":0},{"$f":"Est2019DistRev!K35","v":0},{"$f":"Est2019DistRev!L35","v":0},{"$f":"Est2019DistRev!M35","v":0},{"$f":"Est2019DistRev!N35","v":0},{"$f":"Est2019DistRev!O35","v":0},{"$f":"Est2019DistRev!P35","v":0},{"$f":"Est2019DistRev!Q35","v":0},41.341540163281572,0,2405969.966489397,2106689.7659207499,0,0,0,0,0,0,0,0,0,null,{"$f":"D35*AF35","v":49609.848195937884},{"$f":"E35/100*AG35","v":0},191274.61233590706,66992.734556279844,0,0,0,0,0,0,0,0,0,{"$f":"SUM(AT35:BF35)","v":307877.19508812478},null,{"$f":"R35*AF35","v":41341.54016328157},{"$f":"S35/100*AG35","v":0},{"$f":"T35/100*AH35","v":200176.70121191783},{"$f":"U35/100*AI35","v":69942.100228568903},0,0,0,{"$f":"Y35/100*AM35","v":0},{"$f":"Z35/100*AN35","v":0},0,0,0,0,{"$f":"SUM(BI35:BU35)","v":311460.34160376829}]
[{"$f":"Est2019DistRev!A36","v":"CMGBO"},"Medium Business Bulk Opt-out",{"$f":"Est2019DistRev!B36","v":"Medium Business Bulk Opt-out"},1200,0,6.35,2.54,0,0,0,0,0,0,0,0,0,null,{"$f":"Est2019DistRev!D36","v":975},{"$f":"Est2019DistRev!E36","v":0},{"$f":"Est2019DistRev!F36","v":6.54},{"$f":"Est2019DistRev!G36","v":2.75},{"$f":"Est2019DistRev!H36","v":0},{"$f":"Est2019DistRev!I36","v":0},{"$f":"Est2019DistRev!J36","v":0},{"$f":"Est2019DistRev!K36","v":0},{"$f":"Est2019DistRev!L36","v":0},{"$f":"Est2019DistRev!M36","v":0},{"$f":"Est2019DistRev!N36","v":0},{"$f":"Est2019DistRev!O36","v":0},{"$f":"Est2019DistRev!P36","v":0},null,81.750047252346079,0,5074192.3018221091,4451924.7145162309,0,0,0,0,0,0,0,0,0,null,98100.056702815287,0,322211.21116570395,113078.88774871227,0,0,0,0,0,0,0,0,0,533390.1556172315,null,79706.296071037432,0,331852.17653916596,122427.92964919635,0,0,0,0,0,0,0,0,0,533986.40225939977]
[{"$f":"Est2019DistRev!A37","v":"C2U"},"Unmetered Supplies / Public Lighting",{"$f":"Est2019DistRev!B37","v":"Unmetered Supplies / Public Lighting"},0,0,11.72,3.29,0,0,0,0,0,0,0,0,0,null,{"$f":"Est2019DistRev!D37","v":0},{"$f":"Est2019DistRev!E37","v":0},{"$f":"Est2019DistRev!F37","v":11.24},{"$f":"Est2019DistRev!G37","v":3.15},{"$f":"Est2019DistRev!H37","v":0},{"$f":"Est2019DistRev!I37","v":0},{"$f":"Est2019DistRev!J37","v":0},{"$f":"Est2019DistRev!K37","v":0},{"$f":"Est2019DistRev!L37","v":0},{"$f":"Est2019DistRev!M37","v":0},{"$f":"Est2019DistRev!N37","v":0},{"$f":"Est2019DistRev!O37","v":0},{"$f":"Est2019DistRev!P37","v":0},null,4483.011669203448,0,7396578.4907364566,10316991.681946272,0,0,0,0,0,0,0,0,0,null,0,0,866878.99911431281,339429.02633603232,0,0,0,0,0,0,0,0,0,1206308.0254503451,null,0,0,831375.42235877772,324985.23798130755,0,0,0,0,0,0,0,0,0,1156360.6603400852]
[{"$f":"Est2019DistRev!A38","v":"CLLV"},"Large low Voltage",{"$f":"Est2019DistRev!B38","v":"Large low Voltage"},6550,0,2.3199999999999998,1.42,71.75,0,0,0,0,0,0,0,0,null,{"$f":"Est2019DistRev!D38","v":6200},{"$f":"Est2019DistRev!E38","v":0},{"$f":"Est2019DistRev!F38","v":2.33},{"$f":"Est2019DistRev!G38","v":1.41},{"$f":"Est2019DistRev!H38","v":71.900000000000006},{"$f":"Est2019DistRev!I38","v":0},{"$f":"Est2019DistRev!J38","v":0},{"$f":"Est2019DistRev!K38","v":0},{"$f":"Est2019DistRev!L38","v":0},{"$f":"Est2019DistRev!M38","v":0},{"$f":"Est2019DistRev!N38","v":0},{"$f":"Est2019DistRev!O38","v":0},{"$f":"Est2019DistRev!P38","v":0},null,400.17646833010758,0,126570892.63338222,97426022.677969709,78034.411324370973,0,0,0,0,0,0,0,0,null,2621155.8675622046,0,2936444.7090944671,1383449.5220271698,5598969.0125236176,0,0,0,{"$f":"L38/100*AN38","v":0},0,0,0,0,12540019.111207459,null,2481094.1036466672,0,2949101.7983578057,1373706.9197593729,5610674.1742222738,0,0,0,0,0,0,0,0,12414576.995986119]
[{"$f":"Est2019DistRev!A39","v":"CLLVB"},"Large low Voltage Bulk",{"$f":"Est2019DistRev!B39","v":"Large low Voltage Bulk"},6550,0,2.2000000000000002,1.35,66.75,0,0,0,0,0,0,0,0,null,{"$f":"Est2019DistRev!D39","v":6000},{"$f":"Est2019DistRev!E39","v":0},{"$f":"Est2019DistRev!F39","v":2.11},{"$f":"Est2019DistRev!G39","v":1.31},{"$f":"Est2019DistRev!H39","v":66.14},{"$f":"Est2019DistRev!I39","v":0},{"$f":"Est2019DistRev!J39","v":0},{"$f":"Est2019DistRev!K39","v":0},{"$f":"Est2019DistRev!L39","v":0},{"$f":"Est2019DistRev!M39","v":0},{"$f":"Est2019DistRev!N39","v":0},{"$f":"Est2019DistRev!O39","v":0},{"$f":"Est2019DistRev!P39","v":0},null,1842.9367112714808,0,1137722434.8069408,873988483.91062069,686083.36790021718,0,0,0,0,0,0,0,0,null,12071235.4588282,0,25029893.5657527,11798844.53279338,45796064.807339497,0,0,0,0,0,0,0,0,94696038.364713773,null,11057620.267628886,0,24005943.374426447,11449249.139229132,45377553.952920362,0,0,0,0,0,0,0,0,91890366.734204829]
[{"$f":"Est2019DistRev!A40","v":"CHV"},"High Voltage",{"$f":"Est2019DistRev!B40","v":"High Voltage"},33700,0,1.24,0.64,35.119999999999997,0,0,0,0,0,0,0,0,null,{"$f":"Est2019DistRev!D40","v":31800},{"$f":"Est2019DistRev!E40","v":0},{"$f":"Est2019DistRev!F40","v":1.24},{"$f":"Est2019DistRev!G40","v":0.64},{"$f":"Est2019DistRev!H40","v":35.020000000000003},{"$f":"Est2019DistRev!I40","v":0},{"$f":"Est2019DistRev!J40","v":0},{"$f":"Est2019DistRev!K40","v":0},{"$f":"Est2019DistRev!L40","v":0},{"$f":"Est2019DistRev!M40","v":0},{"$f":"Est2019DistRev!N40","v":0},{"$f":"Est2019DistRev!O40","v":0},{"$f":"Est2019DistRev!P40","v":0},null,93.927461142717462,0,365684368.45994318,176784509.13387427,202579.31528420353,0,0,0,0,0,0,0,0,null,3165355.4405095787,0,4534486.168903295,1131420.8584567953,7114585.552781228,0,0,0,0,0,0,0,0,15945848.020650897,null,2986893.2643384151,0,4534486.168903295,1131420.8584567953,7094327.6212528087,0,0,0,0,0,0,0,0,15747127.912951315]
[{"$f":"Est2019DistRev!A41","v":"CST"},"Subtransmission",{"$f":"Est2019DistRev!B41","v":"Subtransmission"},148700,0,0.12,0.05,0.97,0,0,0,0,0,0,0,0,null,{"$f":"Est2019DistRev!D41","v":146800},{"$f":"Est2019DistRev!E41","v":0},{"$f":"Est2019DistRev!F41","v":0.11},{"$f":"Est2019DistRev!G41","v":0.04},{"$f":"Est2019DistRev!H41","v":0.86},{"$f":"Est2019DistRev!I41","v":0},{"$f":"Est2019DistRev!J41","v":0},{"$f":"Est2019DistRev!K41","v":0},{"$f":"Est2019DistRev!L41","v":0},{"$f":"Est2019DistRev!M41","v":0},{"$f":"Est2019DistRev!N41","v":0},{"$f":"Est2019DistRev!O41","v":0},{"$f":"Est2019DistRev!P41","v":0},null,5.9999568574023607,0,65603250.462830529,24435184.096122243,37985.587976324139,0,0,0,0,0,0,0,0,null,892193.58469573106,0,78723.900555396627,12217.592048061122,36846.020337034417,0,0,0,0,0,0,0,0,1019981.0976362232,null,880793.66666666651,0,72163.57550911358,9774.0736384488973,32667.605659638761,0,0,0,0,0,0,0,0,995398.92147386773]
[null,null,null,null,null,null,null,null,null,null,null,null,null,null,null,null,null,null,null,null,null,null,null,null,null,null,null,null,null,null,null,null,null,null,null,null,null,null,null,null,null,null,null,null,null,0,0,0,0,0,0,0,0,0,0,0,0,0,0,null,0,0,0,0,0,0,0,0,0,0,0,0,0,0]
[null,null,null,null,null,null,null,null,null,null,null,null,null,null,null,null,null,null,null,null,null,null,null,null,null,null,null,null,null,null,null,null,null,null,null,null,null,null,null,null,null,null,null,null,null,0,0,0,0,0,0,0,0,0,0,0,0,0,0,null,0,0,0,0,0,0,0,0,0,0,0,0,0,0]
[null,null,null,null,null,null,null,null,null,null,null,null,null,null,null,null,null,null,null,null,null,null,null,null,null,null,null,null,null,null,null,null,null,null,null,null,null,null,null,null,null,null,null,null,null,0,0,0,0,0,0,0,0,0,0,0,0,0,0,null,0,0,0,0,0,0,0,0,0,0,0,0,0,0]
[null,null,null,null,null,null,null,null,null,null,null,null,null,null,null,null,null,null,null,null,null,null,null,null,null,null,null,null,null,null,null,null,null,null,null,null,null,null,null,null,null,null,null,null,null,0,0,0,0,0,0,0,0,0,0,0,0,0,0,null,0,0,0,0,0,0,0,0,0,0,0,0,0,0]
[null,null,null,null,null,null,null,null,null,null,null,null,null,null,null,null,null,null,null,null,null,null,null,null,null,null,null,null,null,null,null,null,null,null,null,null,null,null,null,null,null,null,null,null,null,0,0,0,0,0,0,0,0,0,0,0,0,0,0,null,0,0,0,0,0,0,0,0,0,0,0,0,0,0]
[null,null,null,null,null,null,null,null,null,null,null,null,null,null,null,null,null,null,null,null,null,null,null,null,null,null,null,null,null,null,null,null,null,null,null,null,null,null,null,null,null,null,null,null,null,0,0,0,0,0,0,0,0,0,0,0,0,0,0,null,0,0,0,0,0,0,0,0,0,0,0,0,0,0]
[null,null,null,null,null,null,null,null,null,null,null,null,null,null,null,null,null,null,null,null,null,null,null,null,null,null,null,null,null,null,null,null,null,null,null,null,null,null,null,null,null,null,null,null,null,0,0,0,0,0,0,0,0,0,0,0,0,0,0,null,0,0,0,0,0,0,0,0,0,0,0,0,0,0]
[null,null,null,null,null,null,null,null,null,null,null,null,null,null,null,null,null,null,null,null,null,null,null,null,null,null,null,null,null,null,null,null,null,null,null,null,null,null,null,null,null,null,null,null,null,0,0,0,0,0,0,0,0,0,0,0,0,0,0,null,0,0,0,0,0,0,0,0,0,0,0,0,0,0]
[null,null,null,null,null,null,null,null,null,null,null,null,null,null,null,null,null,null,null,null,null,null,null,null,null,null,null,null,null,null,null,null,null,null,null,null,null,null,null,null,null,null,null,null,null,0,0,0,0,0,0,0,0,0,0,0,0,0,0,null,0,0,0,0,0,0,0,0,0,0,0,0,0,0]
[null,null,null,null,null,null,null,null,null,null,null,null,null,null,null,null,null,null,null,null,null,null,null,null,null,null,null,null,null,null,null,null,null,null,null,null,null,null,null,null,null,null,null,null,null,0,0,0,0,0,0,0,0,0,0,0,0,0,0,null,0,0,0,0,0,0,0,0,0,0,0,0,0,0]
[null,null,null,null,null,null,null,null,null,null,null,null,null,null,null,null,null,null,null,null,null,null,null,null,null,null,null,null,null,null,null,null,null,null,null,null,null,null,null,null,null,null,null,null,null,0,0,0,0,0,0,0,0,0,0,0,0,0,0,null,0,0,0,0,0,0,0,0,0,0,0,0,0,0]
[null,null,null,null,null,null,null,null,null,null,null,null,null,null,null,null,null,null,null,null,null,null,null,null,null,null,null,null,null,null,null,null,null,null,null,null,null,null,null,null,null,null,null,null,null,0,0,0,0,0,0,0,0,0,0,0,0,0,0,null,0,0,0,0,0,0,0,0,0,0,0,0,0,0]
[null,null,null,null,null,null,null,null,null,null,null,null,null,null,null,null,null,null,null,null,null,null,null,null,null,null,null,null,null,null,null,null,null,null,null,null,null,null,null,null,null,null,null,null,null,0,0,0,0,0,0,0,0,0,0,0,0,0,0,null,0,0,0,0,0,0,0,0,0,0,0,0,0,0]
[null,null,null,null,null,null,null,null,null,null,null,null,null,null,null,null,null,null,null,null,null,null,null,null,null,null,null,null,null,null,null,null,null,null,null,null,null,null,null,null,null,null,null,null,null,0,0,0,0,0,0,0,0,0,0,0,0,0,0,null,0,0,0,0,0,0,0,0,0,0,0,0,0,0]
[null,null,null,null,null,null,null,null,null,null,null,null,null,null,null,null,null,null,null,null,null,null,null,null,null,null,null,null,null,null,null,null,null,null,null,null,null,null,null,null,null,null,null,null,null,0,0,0,0,0,0,0,0,0,0,0,0,0,0,null,0,0,0,0,0,0,0,0,0,0,0,0,0,0]
[null,null,null,null,null,null,null,null,null,null,null,null,null,null,null,null,null,null,null,null,null,null,null,null,null,null,null,null,null,null,null,null,null,null,null,null,null,null,null,null,null,null,null,null,null,0,0,0,0,0,0,0,0,0,0,0,0,0,0,null,0,0,0,0,0,0,0,0,0,0,0,0,0,0]
[null,null,null,null,null,null,null,null,null,null,null,null,null,null,null,null,null,null,null,null,null,null,null,null,null,null,null,null,null,null,null,null,null,null,null,null,null,null,null,null,null,null,null,null,null,0,0,0,0,0,0,0,0,0,0,0,0,0,0,null,0,0,0,0,0,0,0,0,0,0,0,0,0,0]
[null,null,null,null,null,null,null,null,null,null,null,null,null,null,null,null,null,null,null,null,null,null,null,null,null,null,null,null,null,null,null,null,null,null,null,null,null,null,null,null,null,null,null,null,null,0,0,0,0,0,0,0,0,0,0,0,0,0,0,null,0,0,0,0,0,0,0,0,0,0,0,0,0,0]
[null,null,null,null,null,null,null,null,null,null,null,null,null,null,null,null,null,null,null,null,null,null,null,null,null,null,null,null,null,null,null,null,null,null,null,null,null,null,null,null,null,null,null,null,null,0,0,0,0,0,0,0,0,0,0,0,0,0,0,null,0,0,0,0,0,0,0,0,0,0,0,0,0,0]
[null,null,null,null,null,null,null,null,null,null,null,null,null,null,null,null,null,null,null,null,null,null,null,null,null,null,null,null,null,null,null,null,null,null,null,null,null,null,null,null,null,null,null,null,null,0,0,0,0,0,0,0,0,0,0,0,0,0,0,null,0,0,0,0,0,0,0,0,0,0,0,0,0,0]
[null,null,null,null,null,null,null,null,null,null,null,null,null,null,null,null,null,null,null,null,null,null,null,null,null,null,null,null,null,null,null,null,null,null,null,null,null,null,null,null,null,null,null,null,null,0,0,0,0,0,0,0,0,0,0,0,0,0,0,null,0,0,0,0,0,0,0,0,0,0,0,0,0,0]
[null,null,null,null,null,null,null,null,null,null,null,null,null,null,null,null,null,null,null,null,null,null,null,null,null,null,null,null,null,null,null,null,null,null,null,null,null,null,null,null,null,null,null,null,null,0,0,0,0,0,0,0,0,0,0,0,0,0,0,null,0,0,0,0,0,0,0,0,0,0,0,0,0,0]
[null,null,null,null,null,null,null,null,null,null,null,null,null,null,null,null,null,null,null,null,null,null,null,null,null,null,null,null,null,null,null,null,null,null,null,null,null,null,null,null,null,null,null,null,null,0,0,0,0,0,0,0,0,0,0,0,0,0,0,null,0,0,0,0,0,0,0,0,0,0,0,0,0,0]
[null,null,null,null,null,null,null,null,null,null,null,null,null,null,null,null,null,null,null,null,null,null,null,null,null,null,null,null,null,null,null,null,null,null,null,null,null,null,null,null,null,null,null,null,null,0,0,0,0,0,0,0,0,0,0,0,0,0,0,null,0,0,0,0,0,0,0,0,0,0,0,0,0,0]
[null,null,null,null,null,null,null,null,null,null,null,null,null,null,null,null,null,null,null,null,null,null,null,null,null,null,null,null,null,null,null,{"$f":"SUM(AF6:AF65)","v":370982.67050395434},1290238441.6505878,2601072828.4805541,1862946692.4052012,1004682.6824851158,1220879.3350186595,2094935.6579853231,275792.59768983157,443006.61814874376,375920.20484137774,975665.06010090851,1673557.8542890414,1371448.0724610523,null,{"$f":"SUM(AT6:AT65)","v":59663960.441819608},66339097.357380964,78951842.331645131,32984308.753112867,58546465.392981373,11037689.836091725,6529478.9088074155,29597.881082912878,31162.236771002554,10570.718272444365,104240.26251783108,117552.09453444589,38377.414618447699,314384343.62963617,null,{"$f":"SUM(BI6:BI65)","v":54834674.715817384},62989497.73008801,82084035.176347628,32544679.538926274,58115223.354055084,6399326.7909645811,5496430.2853036262,29283.735907743481,31829.463225056697,10651.336414611862,103982.64508345108,120284.59749747011,38902.495495617186,302798801.86512649]

{"sheet":"2020DistRevCapForm","index":5,"n_rows":77,"n_cols":8,"rows_kept":77,"cut":false,"hidden":false,"merged":[]}
[]
[null,{"$f":"\"Tariff Approval - \"&'Model update'!$C$3","v":"Tariff Approval - CitiPower"},{"$f":"'Model update'!$C$5&\"DistRevCapForm\"","v":"2020DistRevCapForm"}]
[]
[null," DUoS"]
[]
[null,"Year (t)",{"$f":"'Model update'!C5","v":2020},null,null,null,null,{"$f":"C6-1","v":2019}]
[]
[null,"Table 1- Compliance with AER Final Determination Total Annual Revenue"]
[null,"Revenue from DUoS charges for year t",{"$f":"Prop2020DistTar!BG66","v":314384343.62963617}]
[null,"Total Annual Revenue for year t",{"$f":"C18","v":314525472.40553391}]
[null,null,{"$f":"IF(C9=\"\",\"\",IF(C10>=C9,\"DUoS REVENUE CAP FORMULA COMPLIANT\",\"DUoS REVENUE CAP FORMULA BREACHED\"))","v":"DUoS REVENUE CAP FORMULA COMPLIANT"}]
[]
[null,"Table 2 - Total Annual Revenue for year t (TARt)"]
[null,"Adjusted Annual Smoothed Revenue for year t",{"$f":"C25","v":311232622.70495588},null,null,null,null,{"$f":"H25","v":296678137.75492048}]
[null,"I factor for year t (F factor Scheme)",{"$f":"'Model update'!B$100","v":36300},null,null,null,null,{"$f":"INDEX('Model update'!$D$100:$H$100,1,MATCH($H$6,'Model update'!$D$93:$H$93,0))","v":43200}]
[null,"T factor for year t (DMIS carry over amount)",{"$f":"'Model update'!B144","v":0},null,null,null,null,{"$f":"INDEX('Model update'!$D$144:$H$144,1,MATCH($H$6,'Model update'!$D$137:$H$137,0))","v":0}]
[null,"B factor for year t",{"$f":"C32","v":3256549.7005780432},null,null,null,null,{"$f":"H32","v":4562308.7779724663}]
[null,"Total Annual Revenue for year t",{"$f":"C14+C15+C16+C17","v":314525472.40553391},null,null,null,null,{"$f":"H14+H15+H16+H17","v":301283646.53289294}]
[]
[null,"Table 3 -  Adjusted Annual Revenue for year t (AARt)"]
[null,"Adjusted Annual Smoothed Revenue for year t-1",{"$f":"H25","v":296678137.75492048},null,null,null,null,293098089.74326599]
[null,"CPI for period t",{"$f":"'Model update'!C30","v":1.5929203539823078E-2},null,null,null,null,{"$f":"'Model update'!C29","v":2.0776874435411097E-2}]
[null,"X factor for period t",{"$f":"'Model update'!B60","v":-1.8785503133769275E-2},null,null,null,null,{"$f":"INDEX('Model update'!$E$60:$H$60,1,MATCH(\"Xt for \"&$H$6,'Model update'!$E$53:$H$53,0))","v":-1.2324590345473526E-3}]
[null,"S factor for period t",{"$f":"'Model update'!B111","v":1.356911180924536E-2},null,null,null,null,{"$f":"INDEX('Model update'!$D$111:$H$111,1,MATCH($H$6,'Model update'!$D$104:$H$104,0))","v":-9.6087080522934132E-3}]
[null,"Adjusted Annual Smoothed Revenue for year t",{"$f":"IF(C6=2016,'Model update'!D60*(1+C24),(C21*(1+C22)*(1-C23)*(1+C24)))","v":311232622.70495588},null,null,null,null,{"$f":"IF(H6=2016,'Model update'!D60*(1+H24),(H21*(1+H22)*(1-H23)*(1+H24)))","v":296678137.75492048}]
[]
[null,"Table 4- B factor for year t"]
[null,"DUoS revenue under/over recovery approved",{"$f":"-E71*(1+E69)^0.5","v":3114038.2107850555},null,null,null,null,4476642.6181702744]
[null,"License Fee Recovery Amount for year t",{"$f":"C38","v":142511.48979298773},null,null,null,null,{"$f":"H38","v":85666.159802192225}]
[null,"Approved Pass through Amount for year t",{"$f":"'Model update'!B122","v":0},null,null,null,null,{"$f":"INDEX('Model update'!$D$122:$H$122,1,MATCH($H$6,'Model update'!$D$115:$H$115,0))","v":0}]
[null,"Pass Through revenue under/over recovery for years 2014 and 2015"]
[null,"B factor for year t",{"$f":"SUM(C28:C31)","v":3256549.7005780432},null,null,null,null,{"$f":"SUM(H28:H31)","v":4562308.7779724663}]
[]
[null,"Table 5 - License Fee Recovery Amount for year t"]
[null,"Lt-1",{"$f":"'Model update'!B133","v":132030},null,null,null,null,{"$f":"INDEX('Model update'!$D$133:$H$133,1,MATCH($H$6,'Model update'!$D$126:$H$126,0))","v":78912}]
[null,"Nominal WACC t",{"$f":"(1+'Model update'!$B$43)*(1+'Model update'!$C$30)-1","v":5.0085804138458423E-2},null,null,null,null,{"$f":"(1+'Model update'!$B$45)*(1+'Model update'!$C$29)-1","v":5.6586211801394226E-2}]
[null,"Nominal WACC t-1",{"$f":"(1+'Model update'!$B$45)*(1+'Model update'!$C$29)-1","v":5.6586211801394226E-2},null,null,null,null,{"$f":"(1+'Model update'!$B$47)*(1+'Model update'!$C$28)-1","v":5.5656482586260436E-2}]
[null,"License Fee Recovery Amount for year t",{"$f":"C35*(1+C36)*(1+C37)^0.5","v":142511.48979298773},null,null,null,null,{"$f":"H35*(1+H36)*(1+H37)^0.5","v":85666.159802192225}]
[]
[]
[]
[null,"Table 6 - DUoS Recovery Arrangements"]
[null,null,"Year t-2","Year t-1","Year t"]
[null,null,"(actual)","(estimate)","(forecast)"]
[null,null,{"$f":"D45-1","v":2018},{"$f":"E45-1","v":2019},{"$f":"C$6","v":2020}]
[]
[null,"(A) Revenue from DUoS Charges ",290594469.42042124,{"$f":"Est2019DistRev!AS66","v":301246306.61228108},{"$f":"C9","v":314384343.62963617}]
[]
[]
[null,"(B) Less TAR for regulatory year = ",{"$f":"SUM(C51:C54)","v":293322431.16127348},{"$f":"SUM(D51:D54)","v":296807003.91472268},{"$f":"SUM(E51:E54)","v":311411434.19474888}]
[null,"+ Adjusted annual smoothed revenue",{"$f":"H21","v":293098089.74326599},{"$f":"C21","v":296678137.75492048},{"$f":"C14","v":311232622.70495588}]
[null,"+It",{"$f":"INDEX('Model update'!$D$100:$H$100,1,MATCH($C$45,'Model update'!$D$93:$H$93,0))","v":140000},{"$f":"H15","v":43200},{"$f":"C15","v":36300}]
[null,"+Tt",{"$f":"INDEX('Model update'!$D$144:$H$144,1,MATCH($C$45,'Model update'!$D$137:$H$137,0))","v":0},{"$f":"H16","v":0},{"$f":"C16","v":0}]
[null,"+Bt =",{"$f":"SUM(C55:C57)","v":84341.418007484201},{"$f":"SUM(D55:D57)","v":85666.159802192225},{"$f":"SUM(E55:E57)","v":142511.48979298773}]
[null,"+Licence fee recovery",84341.418007484201,{"$f":"H29","v":85666.159802192225},{"$f":"C29","v":142511.48979298773}]
[null,"+Approved pass throughs",0,{"$f":"H30","v":0},{"$f":"C30","v":0}]
[null,"+Pass Through revenue under/over recovery for years 2014 and 2015",0,{"$f":"H31","v":0}]
[]
[]
[null,"(A minus B) Under/over recovery of revenue for regulatory year",{"$f":"C47-C50","v":-2727961.7408522367},{"$f":"D47-D50","v":4439302.697558403},{"$f":"E47-E50","v":2972909.43488729}]
[]
[]
[]
[null,"Table 7 - DUoS Unders and Overs Account"]
[null,null,"Year t-2","Year t-1","Year t"]
[null,null,"(actual)","(estimate)","(forecast)"]
[null,"Calendar year",{"$f":"D67-1","v":2018},{"$f":"E67-1","v":2019},{"$f":"C$6","v":2020}]
[]
[null,"Nominal WACC",{"$f":"(1+'Model update'!$B$47)*(1+'Model update'!$C$28)-1","v":5.5656482586260436E-2},{"$f":"(1+'Model update'!$B$45)*(1+'Model update'!$C$29)-1","v":5.6586211801394226E-2},{"$f":"(1+'Model update'!$B$43)*(1+'Model update'!$C$30)-1","v":5.0085804138458423E-2}]
[]
[null,"Opening balance",-4160502.2125339503,{"$f":"C75","v":-7194909.3782951999},{"$f":"D75","v":-3038865.954237103}]
[null,"Interest on Opening balance",{"$f":"C71*C69","v":-231558.91894199382},{"$f":"D71*D69","v":-407132.66597204981},{"$f":"E71*E69","v":-152204.0449869491}]
[null,"Under/over recovery of revenue for regulatory year",{"$f":"C60","v":-2727961.7408522367},{"$f":"D60","v":4439302.697558403},{"$f":"E60","v":2972909.43488729}]
[null,"Interest on under/over recovery for regulatory year",{"$f":"C73*((1+C69)^0.5-1)","v":-74886.505967018704},{"$f":"D73*((1+D69)^0.5-1)","v":123873.39247174404},{"$f":"E73*((1+E69)^0.5-1)","v":73540.693830728531}]
[null,"Closing balance of DUoS overs/ (unders) account",{"$f":"SUM(C71:C74)","v":-7194909.3782951999},{"$f":"SUM(D71:D74)","v":-3038865.954237103},-144619.87050603377]
[]
[null,"The DNSP is expected to achieve a closing balance as close to zero as practicable in its DUoS unders and overs account in each forecast year in its annual pricing proposals in the 2016–20 regulatory control period."]

{"sheet":"2020DistTarRebalCont","index":6,"n_rows":104,"n_cols":62,"rows_kept":104,"cut":false,"hidden":false,"merged":[]}
[null,{"$f":"\"Tariff Approval - \"&'Model update'!C3","v":"Tariff Approval - CitiPower"},{"$f":"'Model update'!$C$5&\"DistTarRebalCont\"","v":"2020DistTarRebalCont"}]
[]
[null,{"$f":"'Model update'!C5&\" DISTRIBUTION TARIFF REBALANCING CONTROL\"","v":"2020 DISTRIBUTION TARIFF REBALANCING CONTROL"}]
[]
[]
[null,"Distribution tariff rebalancing control"]
[]
[null,{"$f":"\"CPI \"&'Model update'!$C$5","v":"CPI 2020"},{"$f":"'2020DistRevCapForm'!C22","v":1.5929203539823078E-2}]
[null,{"$f":"\"X \"& 'Model update'!$C$5","v":"X 2020"},{"$f":"MIN('2020DistRevCapForm'!C23,0)","v":-1.8785503133769275E-2}]
[null,{"$f":"\"St \"&'Model update'!$C$5","v":"St 2020"},{"$f":"'2020DistRevCapForm'!C24","v":1.356911180924536E-2}]
[null,{"$f":"\"It \"&'Model update'!$C$5","v":"It 2020"},{"$f":"('2020DistRevCapForm'!C15-'2020DistRevCapForm'!H15)/Prop2020DistTar!BV$66","v":-2.2787408528364712E-5}]
[null,{"$f":"\"Tt \"&'Model update'!$C$5","v":"Tt 2020"},{"$f":"('2020DistRevCapForm'!C16-'2020DistRevCapForm'!H16)/Prop2020DistTar!BV$66","v":0}]
[null,{"$f":"\"Bt \"&'Model update'!$C$5","v":"Bt 2020"},{"$f":"('2020DistRevCapForm'!C17-'2020DistRevCapForm'!H17)/Prop2020DistTar!BV$66","v":-4.3122993530735239E-3}]
[]
[]
[null,null,{"$f":"(1+C8)*(1-C9)*(1+0.02)*(1+C10)+SUM(C11:C13)","v":1.0657042412501565}]
[]
[]
[]
[null,"Rebalancing control summary",{"$f":"\"Pt-1*(Qt \" &'Model update'!$C$5&\")\"","v":"Pt-1*(Qt 2020)"},{"$f":"\"Pt*(Qt \" &'Model update'!$C$5&\")\"","v":"Pt*(Qt 2020)"}]
[null,"Tariff Class (Input Class Name)","Existing ($)","Proposed ($)","Movement"]
[null,"Residential",{"$f":"IF(B22=\"\",\"\",SUMIF($B$44:$B$103,$B22,$I$44:$I$103))","v":83551872.252775058},{"$f":"IF(B22=\"\",\"\",SUMIF($B$44:$B$103,$B22,$F$44:$F$103))","v":86557807.296546832},{"$f":"IF(B22=\"\",\"\",D22/C22)","v":1.0359768723635268},{"$f":"IF(B22=\"\",\"\",IF(E22<$C$16,\"COMPLIANT\",\"BREACHED\"))","v":"COMPLIANT"}]
[null,"Small business",{"$f":"IF(B23=\"\",\"\",SUMIF($B$44:$B$103,$B23,$I$44:$I$103))","v":98199459.047735348},{"$f":"IF(B23=\"\",\"\",SUMIF($B$44:$B$103,$B23,$F$44:$F$103))","v":103624649.73888098},1.0552466453863907,"COMPLIANT"]
[null,"LLV",{"$f":"IF(B24=\"\",\"\",SUMIF($B$44:$B$103,$B24,$I$44:$I$103))","v":104304943.73019095},{"$f":"IF(B24=\"\",\"\",SUMIF($B$44:$B$103,$B24,$F$44:$F$103))","v":107236057.47592123},1.0281013884951828,"COMPLIANT"]
[null,"HV",{"$f":"IF(B25=\"\",\"\",SUMIF($B$44:$B$103,$B25,$I$44:$I$103))","v":15747127.912951315},{"$f":"IF(B25=\"\",\"\",SUMIF($B$44:$B$103,$B25,$F$44:$F$103))","v":15945848.020650897},1.0126194509118163,"COMPLIANT"]
[null,"SubTrans",{"$f":"IF(B26=\"\",\"\",SUMIF($B$44:$B$103,$B26,$I$44:$I$103))","v":995398.92147386773},{"$f":"IF(B26=\"\",\"\",SUMIF($B$44:$B$103,$B26,$F$44:$F$103))","v":1019981.0976362232},1.024695803493495,"COMPLIANT"]
[null,null,{"$f":"IF(B27=\"\",\"\",SUMIF($B$44:$B$103,$B27,$I$44:$I$103))","v":""},{"$f":"IF(B27=\"\",\"\",SUMIF($B$44:$B$103,$B27,$F$44:$F$103))","v":""},{"$f":"IF(B27=\"\",\"\",D27/C27)","v":""},{"$f":"IF(B27=\"\",\"\",IF(E27<$C$16,\"COMPLIANT\",\"BREACHED\"))","v":""}]
[null,null,"","","",""]
[null,null,"","","",""]
[null,null,"","","",""]
[null,null,"","","",""]
[null,null,{"$f":"IF(B32=\"\",\"\",SUMIF($B$44:$B$103,$B32,$I$44:$I$103))","v":""},{"$f":"IF(B32=\"\",\"\",SUMIF($B$44:$B$103,$B32,$F$44:$F$103))","v":""},"",""]
[null,null,"","","",""]
[null,null,"","","",""]
[null,null,"","","",""]
[null,null,"","","",""]
[null,null,"","","",""]
[null,null,"","","",""]
[null,"Check Total",{"$f":"IF(ABS(SUM(C22:C38)-I104)<0.01,\"Ok\",\"Error\")","v":"Ok"},{"$f":"IF(ABS(SUM(D22:D38)-F104)<0.01,\"Ok\",\"Error\")","v":"Ok"}]
[null,null,{"$f":"IF(ABS(SUM(C22:C38)-Prop2020DistTar!BV66)<0.01,\"Ok\",\"Error\")","v":"Ok"},{"$f":"IF(ABS(SUM(D22:D38)-Prop2020DistTar!BG66)<0.01,\"Ok\",\"Error\")","v":"Ok"}]
[]
[null,null,null,null,null,{"$f":"\"Revenue (Pt \"&'Model update'!$C$5&\")*(Qt \" &'Model update'!$C$5&\")\"","v":"Revenue (Pt 2020)*(Qt 2020)"},null,null,{"$f":"\"Revenue (Pt-1 \"&'Model update'!$C$8&\")*(Qt \" &'Model update'!$C$5&\")\"","v":"Revenue (Pt-1 2019)*(Qt 2020)"}]
["New Tariff Test","Destination tariff class","Source tariff class","Proposed tariff","Existing tariff","PropRev\nTotal",null,null,"ExistRev\nTotal"]
[{"$f":"OR(EXACT(D44,Prop2020DistTar!C$6:C$65))","v":true},"Residential","Residential",{"$f":"IF(Prop2020DistTar!B6=\"\",\"\",Prop2020DistTar!B6)","v":"Residential Single Rate"},{"$f":"IF(Prop2020DistTar!C6=\"\",\"\",Prop2020DistTar!C6)","v":"Residential Single Rate"},{"$f":"Prop2020DistTar!BG6","v":61152253.047411092},null,null,{"$f":"Prop2020DistTar!BV6","v":58594472.229006067}]
[{"$f":"OR(EXACT(D45,Prop2020DistTar!C$6:C$65))","v":true},"Residential","Residential",{"$f":"IF(Prop2020DistTar!B7=\"\",\"\",Prop2020DistTar!B7)","v":"Residential Single Rate - Bulk"},{"$f":"IF(Prop2020DistTar!C7=\"\",\"\",Prop2020DistTar!C7)","v":"Residential Single Rate - Bulk"},{"$f":"Prop2020DistTar!BG7","v":7467633.2702084128},null,null,{"$f":"Prop2020DistTar!BV7","v":7102994.6482973434}]
[{"$f":"OR(EXACT(D46,Prop2020DistTar!C$6:C$65))","v":true},"Residential","Residential",{"$f":"IF(Prop2020DistTar!B8=\"\",\"\",Prop2020DistTar!B8)","v":"Residential - flexible pricing"},{"$f":"IF(Prop2020DistTar!C8=\"\",\"\",Prop2020DistTar!C8)","v":"Residential - flexible pricing"},{"$f":"Prop2020DistTar!BG8","v":328578.42269173072},null,null,{"$f":"Prop2020DistTar!BV8","v":334589.41792608984}]
[{"$f":"OR(EXACT(D47,Prop2020DistTar!C$6:C$65))","v":true},"Residential","Residential",{"$f":"IF(Prop2020DistTar!B9=\"\",\"\",Prop2020DistTar!B9)","v":"Residential - flexible pricing bulk"},{"$f":"IF(Prop2020DistTar!C9=\"\",\"\",Prop2020DistTar!C9)","v":"Residential - flexible pricing bulk"},{"$f":"Prop2020DistTar!BG9","v":29508.871695758608},null,null,{"$f":"Prop2020DistTar!BV9","v":27230.168318860713}]
[{"$f":"OR(EXACT(D48,Prop2020DistTar!C$6:C$65))","v":true},"Residential","Residential",{"$f":"IF(Prop2020DistTar!B10=\"\",\"\",Prop2020DistTar!B10)","v":"Residential Two Rate 5d"},{"$f":"IF(Prop2020DistTar!C10=\"\",\"\",Prop2020DistTar!C10)","v":"Residential Two Rate 5d"},{"$f":"Prop2020DistTar!BG10","v":4890466.0095360214},null,null,{"$f":"Prop2020DistTar!BV10","v":4899987.356998628}]
[{"$f":"OR(EXACT(D49,Prop2020DistTar!C$6:C$65))","v":true},"Residential","Residential",{"$f":"IF(Prop2020DistTar!B11=\"\",\"\",Prop2020DistTar!B11)","v":"Residential Two Rate 5d - Bulk"},{"$f":"IF(Prop2020DistTar!C11=\"\",\"\",Prop2020DistTar!C11)","v":"Residential Two Rate 5d - Bulk"},{"$f":"Prop2020DistTar!BG11","v":1669610.3351000303},null,null,{"$f":"Prop2020DistTar!BV11","v":1620766.05339177}]
[{"$f":"OR(EXACT(D50,Prop2020DistTar!C$6:C$65))","v":true},"Residential","Residential",{"$f":"IF(Prop2020DistTar!B12=\"\",\"\",Prop2020DistTar!B12)","v":"Residential Interval"},{"$f":"IF(Prop2020DistTar!C12=\"\",\"\",Prop2020DistTar!C12)","v":"Residential Interval"},{"$f":"Prop2020DistTar!BG12","v":7600082.4939891789},null,null,{"$f":"Prop2020DistTar!BV12","v":7612769.4458912276}]
[{"$f":"OR(EXACT(D51,Prop2020DistTar!C$6:C$65))","v":true},"Residential","Residential",{"$f":"IF(Prop2020DistTar!B13=\"\",\"\",Prop2020DistTar!B13)","v":"Residential Interval - Bulk"},{"$f":"IF(Prop2020DistTar!C13=\"\",\"\",Prop2020DistTar!C13)","v":"Residential Interval - Bulk"},{"$f":"Prop2020DistTar!BG13","v":2437130.2333570491},null,null,{"$f":"Prop2020DistTar!BV13","v":2340931.5144741042}]
[{"$f":"OR(EXACT(D52,Prop2020DistTar!C$6:C$65))","v":true},"Residential","Residential",{"$f":"IF(Prop2020DistTar!B14=\"\",\"\",Prop2020DistTar!B14)","v":"Residential Two Rate 5d - Controlled Load"},{"$f":"IF(Prop2020DistTar!C14=\"\",\"\",Prop2020DistTar!C14)","v":"Residential Two Rate 5d - Controlled Load"},{"$f":"Prop2020DistTar!BG14","v":0},null,null,{"$f":"Prop2020DistTar!BV14","v":0}]
[{"$f":"OR(EXACT(D53,Prop2020DistTar!C$6:C$65))","v":true},"Residential","Residential",{"$f":"IF(Prop2020DistTar!B15=\"\",\"\",Prop2020DistTar!B15)","v":"Residential Two Rate 5d - Bulk - Controlled Load"},{"$f":"IF(Prop2020DistTar!C15=\"\",\"\",Prop2020DistTar!C15)","v":"Residential Two Rate 5d - Bulk - Controlled Load"},{"$f":"Prop2020DistTar!BG15","v":0},null,null,{"$f":"Prop2020DistTar!BV15","v":0}]
[{"$f":"OR(EXACT(D54,Prop2020DistTar!C$6:C$65))","v":true},"Residential","Residential",{"$f":"IF(Prop2020DistTar!B16=\"\",\"\",Prop2020DistTar!B16)","v":"Dedicated Circuit"},{"$f":"IF(Prop2020DistTar!C16=\"\",\"\",Prop2020DistTar!C16)","v":"Dedicated Circuit"},{"$f":"Prop2020DistTar!BG16","v":850778.60203591804},null,null,{"$f":"Prop2020DistTar!BV16","v":880806.08210777398}]
[{"$f":"OR(EXACT(D55,Prop2020DistTar!C$6:C$65))","v":true},"Residential","Residential",{"$f":"IF(Prop2020DistTar!B17=\"\",\"\",Prop2020DistTar!B17)","v":"Dedicated Circuit - Bulk"},{"$f":"IF(Prop2020DistTar!C17=\"\",\"\",Prop2020DistTar!C17)","v":"Dedicated Circuit - Bulk"},{"$f":"Prop2020DistTar!BG17","v":127831.27443950342},null,null,{"$f":"Prop2020DistTar!BV17","v":133389.15593687314}]
[{"$f":"OR(EXACT(D56,Prop2020DistTar!C$6:C$65))","v":true},"Residential","Residential",{"$f":"IF(Prop2020DistTar!B18=\"\",\"\",Prop2020DistTar!B18)","v":"Residential Demand"},{"$f":"IF(Prop2020DistTar!C18=\"\",\"\",Prop2020DistTar!C18)","v":"Residential Demand"},{"$f":"Prop2020DistTar!BG18","v":3300.6518100553549},null,null,{"$f":"Prop2020DistTar!BV18","v":3343.8887682628656}]
[{"$f":"OR(EXACT(D57,Prop2020DistTar!C$6:C$65))","v":true},"Residential","Residential",{"$f":"IF(Prop2020DistTar!B19=\"\",\"\",Prop2020DistTar!B19)","v":"Residential Bulk Demand"},{"$f":"IF(Prop2020DistTar!C19=\"\",\"\",Prop2020DistTar!C19)","v":"Residential Bulk Demand"},{"$f":"Prop2020DistTar!BG19","v":634.08427208422813},null,null,{"$f":"Prop2020DistTar!BV19","v":592.29165807046377}]
[{"$f":"OR(EXACT(D58,Prop2020DistTar!C$6:C$65))","v":true},"Small business","Small business",{"$f":"IF(Prop2020DistTar!B20=\"\",\"\",Prop2020DistTar!B20)","v":"Non-Residential Single Rate"},{"$f":"IF(Prop2020DistTar!C20=\"\",\"\",Prop2020DistTar!C20)","v":"Non-Residential Single Rate"},{"$f":"Prop2020DistTar!BG20","v":17993391.270888183},null,null,{"$f":"Prop2020DistTar!BV20","v":16862943.953754328}]
[{"$f":"OR(EXACT(D59,Prop2020DistTar!C$6:C$65))","v":true},"Small business","Small business",{"$f":"IF(Prop2020DistTar!B21=\"\",\"\",Prop2020DistTar!B21)","v":"Non-Residential Single Rate - Bulk"},{"$f":"IF(Prop2020DistTar!C21=\"\",\"\",Prop2020DistTar!C21)","v":"Non-Residential Single Rate - Bulk"},{"$f":"Prop2020DistTar!BG21","v":5643579.5225412613},null,null,{"$f":"Prop2020DistTar!BV21","v":4760502.9902124945}]
[{"$f":"OR(EXACT(D60,Prop2020DistTar!C$6:C$65))","v":true},"Small business","Small business",{"$f":"IF(Prop2020DistTar!B22=\"\",\"\",Prop2020DistTar!B22)","v":"Non-Residential Two Rate 5d"},{"$f":"IF(Prop2020DistTar!C22=\"\",\"\",Prop2020DistTar!C22)","v":"Non-Residential Two Rate 5d"},{"$f":"Prop2020DistTar!BG22","v":9332708.0191082302},null,null,{"$f":"Prop2020DistTar!BV22","v":8394279.634789655}]
[{"$f":"OR(EXACT(D61,Prop2020DistTar!C$6:C$65))","v":true},"Small business","Small business",{"$f":"IF(Prop2020DistTar!B23=\"\",\"\",Prop2020DistTar!B23)","v":"Non-Residential Two Rate 5d - Bulk"},{"$f":"IF(Prop2020DistTar!C23=\"\",\"\",Prop2020DistTar!C23)","v":"Non-Residential Two Rate 5d - Bulk"},{"$f":"Prop2020DistTar!BG23","v":1778479.2995829708},null,null,{"$f":"Prop2020DistTar!BV23","v":1506075.8806728045}]
[{"$f":"OR(EXACT(D62,Prop2020DistTar!C$6:C$65))","v":true},"Small business","Small business",{"$f":"IF(Prop2020DistTar!B24=\"\",\"\",Prop2020DistTar!B24)","v":"Non-Residential Interval"},{"$f":"IF(Prop2020DistTar!C24=\"\",\"\",Prop2020DistTar!C24)","v":"Non-Residential Interval"},{"$f":"Prop2020DistTar!BG24","v":5772002.3490365911},null,null,{"$f":"Prop2020DistTar!BV24","v":5195273.8186383769}]
[{"$f":"OR(EXACT(D63,Prop2020DistTar!C$6:C$65))","v":true},"Small business","Small business",{"$f":"IF(Prop2020DistTar!B25=\"\",\"\",Prop2020DistTar!B25)","v":"Non-Residential Interval - Bulk"},{"$f":"IF(Prop2020DistTar!C25=\"\",\"\",Prop2020DistTar!C25)","v":"Non-Residential Interval - Bulk"},{"$f":"Prop2020DistTar!BG25","v":2947530.9386193212},null,null,{"$f":"Prop2020DistTar!BV25","v":2499668.6150346575}]
[{"$f":"OR(EXACT(D64,Prop2020DistTar!C$6:C$65))","v":true},"Small business","Small business",{"$f":"IF(Prop2020DistTar!B26=\"\",\"\",Prop2020DistTar!B26)","v":"Non-Residential Flexible Pricing"},{"$f":"IF(Prop2020DistTar!C26=\"\",\"\",Prop2020DistTar!C26)","v":"Non-Residential Flexible Pricing"},{"$f":"Prop2020DistTar!BG26","v":41908.540614801183},null,null,{"$f":"Prop2020DistTar!BV26","v":38109.064201978705}]
[{"$f":"OR(EXACT(D65,Prop2020DistTar!C$6:C$65))","v":true},"Small business","Small business",{"$f":"IF(Prop2020DistTar!B27=\"\",\"\",Prop2020DistTar!B27)","v":"Non-Residential - Flexible Pricing Bulk"},{"$f":"IF(Prop2020DistTar!C27=\"\",\"\",Prop2020DistTar!C27)","v":"Non-Residential - Flexible Pricing Bulk"},{"$f":"Prop2020DistTar!BG27","v":10077.577402292378},null,null,{"$f":"Prop2020DistTar!BV27","v":8935.496522194846}]
[{"$f":"OR(EXACT(D66,Prop2020DistTar!C$6:C$65))","v":true},"Small business","Small business",{"$f":"IF(Prop2020DistTar!B28=\"\",\"\",Prop2020DistTar!B28)","v":"Non-Residential Two Rate 7d"},{"$f":"IF(Prop2020DistTar!C28=\"\",\"\",Prop2020DistTar!C28)","v":"Non-Residential Two Rate 7d"},{"$f":"Prop2020DistTar!BG28","v":3616113.7753879544},null,null,{"$f":"Prop2020DistTar!BV28","v":3271262.1827343488}]
[{"$f":"OR(EXACT(D67,Prop2020DistTar!C$6:C$65))","v":true},"Small business","Small business",{"$f":"IF(Prop2020DistTar!B29=\"\",\"\",Prop2020DistTar!B29)","v":"Non-Residential Two Rate 7d - Bulk"},{"$f":"IF(Prop2020DistTar!C29=\"\",\"\",Prop2020DistTar!C29)","v":"Non-Residential Two Rate 7d - Bulk"},{"$f":"Prop2020DistTar!BG29","v":416316.8676602646},null,null,{"$f":"Prop2020DistTar!BV29","v":362842.30776939983}]
[{"$f":"OR(EXACT(D68,Prop2020DistTar!C$6:C$65))","v":true},"Small business","Small business",{"$f":"IF(Prop2020DistTar!B30=\"\",\"\",Prop2020DistTar!B30)","v":"Large Two Rate 7d"},{"$f":"IF(Prop2020DistTar!C30=\"\",\"\",Prop2020DistTar!C30)","v":"Large Two Rate 7d"},{"$f":"Prop2020DistTar!BG30","v":5017.3632060090131},null,null,{"$f":"Prop2020DistTar!BV30","v":4515.4748289607587}]
[{"$f":"OR(EXACT(D69,Prop2020DistTar!C$6:C$65))","v":true},"Small business","Small business",{"$f":"IF(Prop2020DistTar!B31=\"\",\"\",Prop2020DistTar!B31)","v":"Non-Residential Demand Tariff"},{"$f":"IF(Prop2020DistTar!C31=\"\",\"\",Prop2020DistTar!C31)","v":"Non-Residential Demand Tariff"},{"$f":"Prop2020DistTar!BG31","v":235982.895340613},null,null,{"$f":"Prop2020DistTar!BV31","v":214105.79985911775}]
[{"$f":"OR(EXACT(D70,Prop2020DistTar!C$6:C$65))","v":true},"Small business","Small business",{"$f":"IF(Prop2020DistTar!B32=\"\",\"\",Prop2020DistTar!B32)","v":"Non-Residential Bulk Demand Tariff"},{"$f":"IF(Prop2020DistTar!C32=\"\",\"\",Prop2020DistTar!C32)","v":"Non-Residential Bulk Demand Tariff"},{"$f":"Prop2020DistTar!BG32","v":499459.47228792653},null,null,{"$f":"Prop2020DistTar!BV32","v":444863.30105553975}]
[{"$f":"OR(EXACT(D71,Prop2020DistTar!C$6:C$65))","v":true},"Small business","Small business",{"$f":"IF(Prop2020DistTar!B33=\"\",\"\",Prop2020DistTar!B33)","v":"Medium Business Demand"},{"$f":"IF(Prop2020DistTar!C33=\"\",\"\",Prop2020DistTar!C33)","v":"Medium Business Demand"},{"$f":"Prop2020DistTar!BG33","v":34353999.289658092},null,null,{"$f":"Prop2020DistTar!BV33","v":34471325.827721462}]
[{"$f":"OR(EXACT(D72,Prop2020DistTar!C$6:C$65))","v":true},"Small business","Small business",{"$f":"IF(Prop2020DistTar!B34=\"\",\"\",Prop2020DistTar!B34)","v":"Medium Business Bulk Demand"},{"$f":"IF(Prop2020DistTar!C34=\"\",\"\",Prop2020DistTar!C34)","v":"Medium Business Bulk Demand"},{"$f":"Prop2020DistTar!BG34","v":18930507.181390766},null,null,{"$f":"Prop2020DistTar!BV34","v":18162947.295736767}]
[{"$f":"OR(EXACT(D73,Prop2020DistTar!C$6:C$65))","v":true},"Small business","Small business",{"$f":"IF(Prop2020DistTar!B35=\"\",\"\",Prop2020DistTar!B35)","v":"Medium Business Opt-out"},{"$f":"IF(Prop2020DistTar!C35=\"\",\"\",Prop2020DistTar!C35)","v":"Medium Business Opt-out"},{"$f":"Prop2020DistTar!BG35","v":307877.19508812478},null,null,{"$f":"Prop2020DistTar!BV35","v":311460.34160376829}]
[{"$f":"OR(EXACT(D74,Prop2020DistTar!C$6:C$65))","v":true},"Small business","Small business",{"$f":"IF(Prop2020DistTar!B36=\"\",\"\",Prop2020DistTar!B36)","v":"Medium Business Bulk Opt-out"},{"$f":"IF(Prop2020DistTar!C36=\"\",\"\",Prop2020DistTar!C36)","v":"Medium Business Bulk Opt-out"},{"$f":"Prop2020DistTar!BG36","v":533390.1556172315},null,null,{"$f":"Prop2020DistTar!BV36","v":533986.40225939977}]
[{"$f":"OR(EXACT(D75,Prop2020DistTar!C$6:C$65))","v":true},"Small business","Small business",{"$f":"IF(Prop2020DistTar!B37=\"\",\"\",Prop2020DistTar!B37)","v":"Unmetered Supplies / Public Lighting"},{"$f":"IF(Prop2020DistTar!C37=\"\",\"\",Prop2020DistTar!C37)","v":"Unmetered Supplies / Public Lighting"},{"$f":"Prop2020DistTar!BG37","v":1206308.0254503451},null,null,{"$f":"Prop2020DistTar!BV37","v":1156360.6603400852}]
[{"$f":"OR(EXACT(D76,Prop2020DistTar!C$6:C$65))","v":true},"LLV","LLV",{"$f":"IF(Prop2020DistTar!B38=\"\",\"\",Prop2020DistTar!B38)","v":"Large low Voltage"},{"$f":"IF(Prop2020DistTar!C38=\"\",\"\",Prop2020DistTar!C38)","v":"Large low Voltage"},{"$f":"Prop2020DistTar!BG38","v":12540019.111207459},null,null,{"$f":"Prop2020DistTar!BV38","v":12414576.995986119}]
[{"$f":"OR(EXACT(D77,Prop2020DistTar!C$6:C$65))","v":true},"LLV","LLV",{"$f":"IF(Prop2020DistTar!B39=\"\",\"\",Prop2020DistTar!B39)","v":"Large low Voltage Bulk"},{"$f":"IF(Prop2020DistTar!C39=\"\",\"\",Prop2020DistTar!C39)","v":"Large low Voltage Bulk"},{"$f":"Prop2020DistTar!BG39","v":94696038.364713773},null,null,{"$f":"Prop2020DistTar!BV39","v":91890366.734204829}]
[{"$f":"OR(EXACT(D78,Prop2020DistTar!C$6:C$65))","v":true},"HV","HV",{"$f":"IF(Prop2020DistTar!B40=\"\",\"\",Prop2020DistTar!B40)","v":"High Voltage"},{"$f":"IF(Prop2020DistTar!C40=\"\",\"\",Prop2020DistTar!C40)","v":"High Voltage"},{"$f":"Prop2020DistTar!BG40","v":15945848.020650897},null,null,{"$f":"Prop2020DistTar!BV40","v":15747127.912951315}]
[{"$f":"OR(EXACT(D79,Prop2020DistTar!C$6:C$65))","v":true},"SubTrans","SubTrans",{"$f":"IF(Prop2020DistTar!B41=\"\",\"\",Prop2020DistTar!B41)","v":"Subtransmission"},{"$f":"IF(Prop2020DistTar!C41=\"\",\"\",Prop2020DistTar!C41)","v":"Subtransmission"},{"$f":"Prop2020DistTar!BG41","v":1019981.0976362232},null,null,{"$f":"Prop2020DistTar!BV41","v":995398.92147386773}]
[{"$f":"OR(EXACT(D80,Prop2020DistTar!C$6:C$65))","v":true},null,null,{"$f":"IF(Prop2020DistTar!B42=\"\",\"\",Prop2020DistTar!B42)","v":""},{"$f":"IF(Prop2020DistTar!C42=\"\",\"\",Prop2020DistTar!C42)","v":""},{"$f":"Prop2020DistTar!BG42","v":0},null,null,{"$f":"Prop2020DistTar!BV42","v":0}]
[{"$f":"OR(EXACT(D81,Prop2020DistTar!C$6:C$65))","v":true},null,null,{"$f":"IF(Prop2020DistTar!B43=\"\",\"\",Prop2020DistTar!B43)","v":""},{"$f":"IF(Prop2020DistTar!C43=\"\",\"\",Prop2020DistTar!C43)","v":""},{"$f":"Prop2020DistTar!BG43","v":0},null,null,{"$f":"Prop2020DistTar!BV43","v":0}]
[{"$f":"OR(EXACT(D82,Prop2020DistTar!C$6:C$65))","v":true},null,null,{"$f":"IF(Prop2020DistTar!B44=\"\",\"\",Prop2020DistTar!B44)","v":""},{"$f":"IF(Prop2020DistTar!C44=\"\",\"\",Prop2020DistTar!C44)","v":""},{"$f":"Prop2020DistTar!BG44","v":0},null,null,{"$f":"Prop2020DistTar!BV44","v":0}]
[{"$f":"OR(EXACT(D83,Prop2020DistTar!C$6:C$65))","v":true},null,null,{"$f":"IF(Prop2020DistTar!B45=\"\",\"\",Prop2020DistTar!B45)","v":""},{"$f":"IF(Prop2020DistTar!C45=\"\",\"\",Prop2020DistTar!C45)","v":""},{"$f":"Prop2020DistTar!BG45","v":0},null,null,{"$f":"Prop2020DistTar!BV45","v":0}]
[{"$f":"OR(EXACT(D84,Prop2020DistTar!C$6:C$65))","v":true},null,null,{"$f":"IF(Prop2020DistTar!B46=\"\",\"\",Prop2020DistTar!B46)","v":""},{"$f":"IF(Prop2020DistTar!C46=\"\",\"\",Prop2020DistTar!C46)","v":""},{"$f":"Prop2020DistTar!BG46","v":0},null,null,{"$f":"Prop2020DistTar!BV46","v":0}]
[{"$f":"OR(EXACT(D85,Prop2020DistTar!C$6:C$65))","v":true},null,null,{"$f":"IF(Prop2020DistTar!B47=\"\",\"\",Prop2020DistTar!B47)","v":""},{"$f":"IF(Prop2020DistTar!C47=\"\",\"\",Prop2020DistTar!C47)","v":""},{"$f":"Prop2020DistTar!BG47","v":0},null,null,{"$f":"Prop2020DistTar!BV47","v":0}]
[{"$f":"OR(EXACT(D86,Prop2020DistTar!C$6:C$65))","v":true},null,null,{"$f":"IF(Prop2020DistTar!B48=\"\",\"\",Prop2020DistTar!B48)","v":""},{"$f":"IF(Prop2020DistTar!C48=\"\",\"\",Prop2020DistTar!C48)","v":""},{"$f":"Prop2020DistTar!BG48","v":0},null,null,{"$f":"Prop2020DistTar!BV48","v":0}]
[{"$f":"OR(EXACT(D87,Prop2020DistTar!C$6:C$65))","v":true},null,null,{"$f":"IF(Prop2020DistTar!B49=\"\",\"\",Prop2020DistTar!B49)","v":""},{"$f":"IF(Prop2020DistTar!C49=\"\",\"\",Prop2020DistTar!C49)","v":""},{"$f":"Prop2020DistTar!BG49","v":0},null,null,{"$f":"Prop2020DistTar!BV49","v":0}]
[{"$f":"OR(EXACT(D88,Prop2020DistTar!C$6:C$65))","v":true},null,null,{"$f":"IF(Prop2020DistTar!B50=\"\",\"\",Prop2020DistTar!B50)","v":""},{"$f":"IF(Prop2020DistTar!C50=\"\",\"\",Prop2020DistTar!C50)","v":""},{"$f":"Prop2020DistTar!BG50","v":0},null,null,{"$f":"Prop2020DistTar!BV50","v":0}]
[{"$f":"OR(EXACT(D89,Prop2020DistTar!C$6:C$65))","v":true},null,null,{"$f":"IF(Prop2020DistTar!B51=\"\",\"\",Prop2020DistTar!B51)","v":""},{"$f":"IF(Prop2020DistTar!C51=\"\",\"\",Prop2020DistTar!C51)","v":""},{"$f":"Prop2020DistTar!BG51","v":0},null,null,{"$f":"Prop2020DistTar!BV51","v":0}]
[{"$f":"OR(EXACT(D90,Prop2020DistTar!C$6:C$65))","v":true},null,null,{"$f":"IF(Prop2020DistTar!B52=\"\",\"\",Prop2020DistTar!B52)","v":""},{"$f":"IF(Prop2020DistTar!C52=\"\",\"\",Prop2020DistTar!C52)","v":""},{"$f":"Prop2020DistTar!BG52","v":0},null,null,{"$f":"Prop2020DistTar!BV52","v":0}]
[{"$f":"OR(EXACT(D91,Prop2020DistTar!C$6:C$65))","v":true},null,null,{"$f":"IF(Prop2020DistTar!B53=\"\",\"\",Prop2020DistTar!B53)","v":""},{"$f":"IF(Prop2020DistTar!C53=\"\",\"\",Prop2020DistTar!C53)","v":""},{"$f":"Prop2020DistTar!BG53","v":0},null,null,{"$f":"Prop2020DistTar!BV53","v":0}]
[{"$f":"OR(EXACT(D92,Prop2020DistTar!C$6:C$65))","v":true},null,null,{"$f":"IF(Prop2020DistTar!B54=\"\",\"\",Prop2020DistTar!B54)","v":""},{"$f":"IF(Prop2020DistTar!C54=\"\",\"\",Prop2020DistTar!C54)","v":""},{"$f":"Prop2020DistTar!BG54","v":0},null,null,{"$f":"Prop2020DistTar!BV54","v":0}]
[{"$f":"OR(EXACT(D93,Prop2020DistTar!C$6:C$65))","v":true},null,null,{"$f":"IF(Prop2020DistTar!B55=\"\",\"\",Prop2020DistTar!B55)","v":""},{"$f":"IF(Prop2020DistTar!C55=\"\",\"\",Prop2020DistTar!C55)","v":""},{"$f":"Prop2020DistTar!BG55","v":0},null,null,{"$f":"Prop2020DistTar!BV55","v":0}]
[{"$f":"OR(EXACT(D94,Prop2020DistTar!C$6:C$65))","v":true},null,null,{"$f":"IF(Prop2020DistTar!B56=\"\",\"\",Prop2020DistTar!B56)","v":""},{"$f":"IF(Prop2020DistTar!C56=\"\",\"\",Prop2020DistTar!C56)","v":""},{"$f":"Prop2020DistTar!BG56","v":0},null,null,{"$f":"Prop2020DistTar!BV56","v":0}]
[{"$f":"OR(EXACT(D95,Prop2020DistTar!C$6:C$65))","v":true},null,null,{"$f":"IF(Prop2020DistTar!B57=\"\",\"\",Prop2020DistTar!B57)","v":""},{"$f":"IF(Prop2020DistTar!C57=\"\",\"\",Prop2020DistTar!C57)","v":""},{"$f":"Prop2020DistTar!BG57","v":0},null,null,{"$f":"Prop2020DistTar!BV57","v":0}]
[{"$f":"OR(EXACT(D96,Prop2020DistTar!C$6:C$65))","v":true},null,null,{"$f":"IF(Prop2020DistTar!B58=\"\",\"\",Prop2020DistTar!B58)","v":""},{"$f":"IF(Prop2020DistTar!C58=\"\",\"\",Prop2020DistTar!C58)","v":""},{"$f":"Prop2020DistTar!BG58","v":0},null,null,{"$f":"Prop2020DistTar!BV58","v":0}]
[{"$f":"OR(EXACT(D97,Prop2020DistTar!C$6:C$65))","v":true},null,null,{"$f":"IF(Prop2020DistTar!B59=\"\",\"\",Prop2020DistTar!B59)","v":""},{"$f":"IF(Prop2020DistTar!C59=\"\",\"\",Prop2020DistTar!C59)","v":""},{"$f":"Prop2020DistTar!BG59","v":0},null,null,{"$f":"Prop2020DistTar!BV59","v":0}]
[{"$f":"OR(EXACT(D98,Prop2020DistTar!C$6:C$65))","v":true},null,null,{"$f":"IF(Prop2020DistTar!B60=\"\",\"\",Prop2020DistTar!B60)","v":""},{"$f":"IF(Prop2020DistTar!C60=\"\",\"\",Prop2020DistTar!C60)","v":""},{"$f":"Prop2020DistTar!BG60","v":0},null,null,{"$f":"Prop2020DistTar!BV60","v":0}]
[{"$f":"OR(EXACT(D99,Prop2020DistTar!C$6:C$65))","v":true},null,null,{"$f":"IF(Prop2020DistTar!B61=\"\",\"\",Prop2020DistTar!B61)","v":""},{"$f":"IF(Prop2020DistTar!C61=\"\",\"\",Prop2020DistTar!C61)","v":""},{"$f":"Prop2020DistTar!BG61","v":0},null,null,{"$f":"Prop2020DistTar!BV61","v":0}]
[{"$f":"OR(EXACT(D100,Prop2020DistTar!C$6:C$65))","v":true},null,null,{"$f":"IF(Prop2020DistTar!B62=\"\",\"\",Prop2020DistTar!B62)","v":""},{"$f":"IF(Prop2020DistTar!C62=\"\",\"\",Prop2020DistTar!C62)","v":""},{"$f":"Prop2020DistTar!BG62","v":0},null,null,{"$f":"Prop2020DistTar!BV62","v":0}]
[{"$f":"OR(EXACT(D101,Prop2020DistTar!C$6:C$65))","v":true},null,null,{"$f":"IF(Prop2020DistTar!B63=\"\",\"\",Prop2020DistTar!B63)","v":""},{"$f":"IF(Prop2020DistTar!C63=\"\",\"\",Prop2020DistTar!C63)","v":""},{"$f":"Prop2020DistTar!BG63","v":0},null,null,{"$f":"Prop2020DistTar!BV63","v":0}]
[{"$f":"OR(EXACT(D102,Prop2020DistTar!C$6:C$65))","v":true},null,null,{"$f":"IF(Prop2020DistTar!B64=\"\",\"\",Prop2020DistTar!B64)","v":""},{"$f":"IF(Prop2020DistTar!C64=\"\",\"\",Prop2020DistTar!C64)","v":""},{"$f":"Prop2020DistTar!BG64","v":0},null,null,{"$f":"Prop2020DistTar!BV64","v":0}]
[{"$f":"OR(EXACT(D103,Prop2020DistTar!C$6:C$65))","v":true},null,null,{"$f":"IF(Prop2020DistTar!B65=\"\",\"\",Prop2020DistTar!B65)","v":""},{"$f":"IF(Prop2020DistTar!C65=\"\",\"\",Prop2020DistTar!C65)","v":""},{"$f":"Prop2020DistTar!BG65","v":0},null,null,{"$f":"Prop2020DistTar!BV65","v":0}]
[null,null,null,null,null,{"$f":"SUM(F44:F103)","v":314384343.62963617},null,null,{"$f":"SUM(I44:I103)","v":302798801.86512649},null,null,null,null,null,null,null,null,null,null,null,null,null,null,null,null,null,null,null,null,null,null,null,null,null,null,null,null,null,null,null,null,null,null,null,null,null,null,null,null,null,null,null,null,null,null,null,null,null,null,null,null,{"$f":"SUM(BJ44:BJ103)","v":0}]

{"sheet":"Est2019DistRev","index":7,"n_rows":66,"n_cols":45,"rows_kept":66,"cut":false,"hidden":false,"merged":[]}
[null,{"$f":"\"Tariff Approval - \"&'Model update'!C3","v":"Tariff Approval - CitiPower"},null,{"$f":"\"Est\"&'Model update'!$C$5-1&\"DistRev\"","v":"Est2019DistRev"}]
[]
[null,{"$f":"\"ESTIMATED \"&'Model update'!$C$8&\" Distribution Revenue\"","v":"ESTIMATED 2019 Distribution Revenue"}]
[null,null,null,{"$f":"\"Current Distribution Tariffs (Pt-1) for \"&'Model update'!$C$8","v":"Current Distribution Tariffs (Pt-1) for 2019"},null,null,null,null,null,null,null,null,null,null,null,null,null,{"$f":"\" Estimated Distribution Quantities for \"&'Model update'!$C$8&\" (Qt-1)\"","v":" Estimated Distribution Quantities for 2019 (Qt-1)"},null,null,null,null,null,null,null,null,null,null,null,null,null,{"$f":"\"Estimated Revenue (Pt-1 \"&'Model update'!$C$8&\")*(Qt-1 \" &'Model update'!$C$8&\")\"","v":"Estimated Revenue (Pt-1 2019)*(Qt-1 2019)"}]
[null,{"$f":"\"Tariffs \"&'Model update'!C8","v":"Tariffs 2019"},null,"CurrentTar\nFixed","CurrentTar\nAnytime","CurrentTar\nPkBlk","CurrentTar\nOPkBlk1","CurrentTar\nDem kVA","CurrentTar\nDem kW Sum","CurrentTar\nDem kW Win","CurrentTar\nSumBlk1","CurrentTar\nSumBlk2","CurrentTar\nSumBlk3","CurrentTar\nWtrBlk1","CurrentTar\nWtrBlk2","CurrentTar\nWtrBlk3",null,"EstVol\nFixed","EstVol\nAnytime","EstVol\nPk","EstVol\nOpk","EstVol\nDem kVA","EstVol\nDem kW Sum","EstVol\nDem kW Win","EstVol\nSumBlk1","EstVol\nSumBlk2","EstVol\nSumBlk3","EstVol\nWtrBlk1","EstVol\nWtrBlk2","EstVol\nWtrBlk3",null,"EstRev\nFixed","EstRev\nAnytime","EstRev\nPk","EstRev\nOpk","EstRev\nDem kVA","EstRev\nDem kW Sum","EstRev\nDem kW Win","EstRev\nSumBlk1","EstRev\nSumBlk2","EstRev\nSumBlk3","EstRev\nWtrBlk1","EstRev\nWtrBlk2","EstRev\nWtrBlk3","EstRev\nTotal"]
["C1R","Residential Single Rate",null,90,4.72,0,0,0,0,0,0,0,0,0,0,0,null,205044.5,853857291.19384253,0,0,0,0,0,0,0,0,0,0,0,null,{"$f":"D6*R6","v":18454005},{"$f":"E6/100*S6","v":40302064.144349366},0,0,{"$f":"H6*V6","v":0},{"$f":"I6*W6","v":0},0,0,0,{"$f":"M6/100*AA6","v":0},{"$f":"N6/100*AB6","v":0},{"$f":"O6/100*AC6","v":0},{"$f":"P6/100*AD6","v":0},{"$f":"SUM(AF6:AR6)","v":58756069.144349366}]
["C1RB","Residential Single Rate - Bulk",null,85,4.1500000000000004,0,0,0,0,0,0,0,0,0,0,0,null,31480.916666666668,106631799.39951396,0,0,0,0,0,0,0,0,0,0,0,null,{"$f":"D7*R7","v":2675877.916666667},{"$f":"E7/100*S7","v":4425219.67507983},0,0,{"$f":"H7*V7","v":0},{"$f":"I7*W7","v":0},{"$f":"J7*X7","v":0},0,0,0,0,0,0,{"$f":"SUM(AF7:AR7)","v":7101097.591746497}]
["C13R","Residential - flexible pricing",null,90,0,0,0,0,0,0,10.79,7.27,2.86,10.79,7.27,2.86,null,693.41666666666663,0,0,0,0,0,0,205405.52138504913,427210.15422574908,316794.33869324729,740099.69108086498,1539287.2647098142,1141446.3964847678,null,62407.5,0,0,0,0,0,0,22163.255757446801,31058.178212211958,9060.3180866268722,79856.756667625334,111906.18414440349,32645.366939464358,349097.5598077788]
["C13RB","Residential - flexible pricing bulk",null,85,0,0,0,0,0,0,9.0500000000000007,6.1,2.39,9.0500000000000007,6.1,2.39,null,90,0,0,0,0,0,0,15231.12129347165,32311.930045800349,23662.580933605816,55378.784196646673,117482.84098758313,86034.700781977721,null,7650,0,0,0,0,0,0,1378.4164770591844,1971.0277327938213,565.53568431317899,5011.7799697965247,7166.4533002425705,2056.2293486892677,25799.442512894548]
["C2R","Residential Two Rate 5d",null,90,0,9.7200000000000006,2.31,0,0,0,0,0,0,0,0,0,null,10820.083333333334,0,35024034.503626086,30157186.273130894,0,0,0,0,0,0,0,0,0,null,973807.5,0,3404336.153752456,696631.00290932367,0,0,0,0,0,0,0,0,0,5074774.6566617787]
["C2RB","Residential Two Rate 5d - Bulk",null,85,0,8.56,2.16,0,0,0,0,0,0,0,0,0,null,4352.5,0,12294584.523796603,10585730.046510926,0,0,0,0,0,0,0,0,0,null,369962.5,0,1052416.4352369893,228651.76900463601,0,0,0,0,0,0,0,0,0,1651030.7042416253]
["C3R","Residential Interval",null,90,0,9.7200000000000006,2.31,0,0,0,0,0,0,0,0,0,null,17057.166666666668,0,60669728.275751241,52545941.858520873,0,0,0,0,0,0,0,0,0,null,1535145,0,5897097.588403021,1213811.2569318321,0,0,0,0,0,0,0,0,0,8646053.845334854]
["C3RB","Residential Interval - Bulk",null,85,0,8.56,2.16,0,0,0,0,0,0,0,0,0,null,8658,0,15600572.119172478,14572772.142298045,0,0,0,0,0,0,0,0,0,null,735930,0,1335408.9734011642,314771.87827363779,0,0,0,0,0,0,0,0,0,2386110.8516748021]
["C2ROP","Residential Two Rate 5d - Controlled Load",null,0,0,0,1.76,0,0,0,0,0,0,0,0,0,null,9732.6666666666661,0,0,19246331.235837448,0,0,0,0,0,0,0,0,0,null,0,0,0,338735.42975073913,0,0,0,0,0,0,0,0,0,338735.42975073913]
["C2RBOP","Residential Two Rate 5d - Bulk - Controlled Load",null,0,0,0,1.44,0,0,0,0,0,0,0,0,0,null,3683.8333333333335,0,0,7176762.3174721245,0,0,0,0,0,0,0,0,0,null,0,0,0,103345.37737159859,0,0,0,0,0,0,0,0,0,103345.37737159859]
["CDS","Dedicated Circuit",null,0,0,0,1.76,0,0,0,0,0,0,0,0,0,null,22825.5,0,0,31802481.572760597,0,0,0,0,0,0,0,0,0,null,0,0,0,559723.67568058649,0,0,0,0,0,0,0,0,0,559723.67568058649]
["CDSB","Dedicated Circuit - Bulk",null,0,0,0,1.44,0,0,0,0,0,0,0,0,0,null,1105.5833333333333,0,0,2202095.0102876872,0,0,0,0,0,0,0,0,0,null,0,0,0,31710.168148142693,0,0,0,0,0,0,0,0,0,31710.168148142693]
["CR","Residential Demand",null,90,2.89,0,0,0,7.04,2.41,0,0,0,0,0,0,null,4,14863.138507993855,0,0,0,50.493333333333332,120.75099999999999,0,0,0,0,0,0,null,360,429.54470288102243,0,0,0,355.47306666666668,291.00990999999999,0,0,0,0,0,0,1436.0276795476891]
["CRB","Residential Bulk Demand",null,85,2.0299999999999998,0,0,0,5.54,1.86,0,0,0,0,0,0,null,0,0,0,0,0,0,0,0,0,0,0,0,0,null,0,0,0,0,0,0,0,0,0,0,0,0,0,0]
["C1G","Non-Residential Single Rate",null,150,5.96,0,0,0,0,0,0,0,0,0,0,0,null,20319.916666666668,233254649.14212352,0,0,0,0,0,0,0,0,0,0,0,null,3047987.5,13901977.088870563,0,0,0,0,0,0,0,0,0,0,0,16949964.588870563]
["C1GB","Non-Residential Single Rate - Bulk",null,140,4.84,0,0,0,0,0,0,0,0,0,0,0,null,5859.166666666667,77076676.161172211,0,0,0,0,0,0,0,0,0,0,0,null,820283.33333333337,3730511.1262007351,0,0,0,0,0,0,0,0,0,0,0,4550794.4595340686]
["C2G5","Non-Residential Two Rate 5d",null,150,0,8.9600000000000009,2.58,0,0,0,0,0,0,0,0,0,null,8457.4166666666661,0,92130994.291198537,57478450.853033125,0,0,0,0,0,0,0,0,0,null,1268612.5,0,8254937.0884913905,1482944.0320082547,0,0,0,0,0,{"$f":"M22/100*AA22","v":0},0,0,0,11006493.620499646]
["C2G5B","Non-Residential Two Rate 5d - Bulk",null,140,0,6.99,2.11,0,0,0,0,0,0,0,0,0,null,1060,0,17530830.09980379,10374374.192942632,0,0,0,0,0,0,0,0,0,null,148400,0,1225405.023976285,218899.29547108951,0,0,0,0,0,0,0,0,0,1592704.3194473744]
["C3G","Non-Residential Interval",null,150,0,8.9600000000000009,2.37,0,0,0,0,0,0,0,0,0,null,3960.0833333333335,0,45937500.616836645,25953497.24992197,0,0,0,0,0,0,0,0,0,null,594012.5,0,4116000.0552685638,615097.8848231507,0,0,0,0,0,0,0,0,0,5325110.4400917143]
["C3GB","Non-Residential Interval - Bulk",null,140,0,6.99,2.11,0,0,0,0,0,0,0,0,0,null,1945.0833333333333,0,29899979.142567024,15763990.484742738,0,0,0,0,0,0,0,0,0,null,272311.66666666663,0,2090008.5420654351,332620.19922807172,0,0,0,0,0,0,0,0,0,2694940.4079601732]
["C14G","Non-Residential Flexible Pricing",null,150,0,0,0,0,0,0,10.92,7.63,3,10.92,7.63,3,null,22,0,0,0,0,0,0,90532.516087055192,28600.363735072933,77063.914568834094,309844.84003868263,97883.893097818145,263748.95246890507,null,3300,0,0,0,0,0,0,9886.1507567064273,2182.2077529860644,2311.9174370650226,33835.056532224145,7468.5410433635234,7912.4685740671521,66896.342096412336]
["C14GB","Non-Residential - Flexible Pricing Bulk",null,140,0,0,0,0,0,0,9.6,6.71,2.64,9.6,6.71,2.64,null,7,0,0,0,0,0,0,103639.4071436401,27419.302376645079,92664.296651991201,277642.32949385105,73454.289200989399,248240.81777803652,null,980,0,0,0,0,0,0,9949.38308578945,1839.8351894728846,2446.3374316125678,26653.663631409701,4928.7828053863877,6553.5575893401638,53351.559733011149]
["C2G7","Non-Residential Two Rate 7d",null,150,0,7.05,2.37,0,0,0,0,0,0,0,0,0,null,2325,0,39141830.195678435,9312690.0588423535,0,0,0,0,0,0,0,0,0,null,348750,0,2759499.0287953294,220710.75439456379,0,0,0,0,0,0,0,0,0,3328959.7831898932]
["C2G7B","Non-Residential Two Rate 7d - Bulk",null,140,0,6.27,2.11,0,0,0,0,0,0,0,0,0,null,253.08333333333334,0,5750711.7271070778,1391434.2626145822,0,0,0,0,0,0,0,0,0,null,35431.666666666672,0,360569.62528961373,29359.262941167679,0,0,0,0,0,0,0,0,0,425360.55489744811]
["C2L7","Large Two Rate 7d",null,150,0,8.9600000000000009,2.58,0,0,0,0,0,0,0,0,0,null,4,0,168556.17919268721,75139.006775332673,0,0,0,0,0,0,0,0,0,null,600,0,15102.633655664777,1938.5863748035829,0,0,0,0,0,0,0,0,0,17641.220030468361]
["CG","Non-Residential Demand Tariff",null,150,3.27,0,0,0,10.43,3.48,0,0,0,0,0,0,null,8,717136.61553414329,0,0,0,822.73759999999993,1909.0406952380938,0,0,0,0,0,0,null,1200,23450.367327966487,0,0,0,8581.1531679999989,6643.4616194285663,0,0,0,0,0,0,39874.982115395047]
["CGB","Non-Residential Bulk Demand Tariff",null,140,3,0,0,0,8.35,2.78,0,0,0,0,0,0,null,4,534045.01309481997,0,0,0,411.36879999999996,954.5203476190469,0,0,0,0,0,0,null,560,16021.350392844599,0,0,0,3434.9294799999998,2653.56656638095,0,0,0,0,0,0,22669.846439225548]
["CMG","Medium Business Demand",null,1000,0,4.2,3.21,0,5.69,2.84,0,0,0,0,0,0,null,4548,0,365166105.04280096,263865736.50712213,0,730223.77142460272,1303005.7703119123,0,0,0,0,0,0,null,4548000,0,15336976.411797641,8470090.1418786198,0,4154973.2594059897,3700536.3876858307,0,0,0,0,0,0,36210576.200768083]
["CMGB","Medium Business Bulk Demand",null,975,0,3.33,2.66,0,4.55,2.2799999999999998,0,0,0,0,0,0,null,2221.9166666666665,0,255479964.6620293,173141256.77774215,0,520621.07651825261,868527.91268999258,0,0,0,0,0,0,null,2166368.75,0,8507482.8232455757,4605557.4302879414,0,2368825.8981580492,1980243.6409331828,0,0,0,0,0,0,19628478.542624746]
["CMGO","Medium Business Opt-out",null,1000,0,8.32,3.32,0,0,0,0,0,0,0,0,0,null,7,0,296417.25372207933,286499.78848501295,0,0,0,0,0,0,0,0,0,null,7000,0,24661.915509677001,9511.7929777024292,0,0,0,0,0,0,0,0,0,41173.70848737943]
["CMGBO","Medium Business Bulk Opt-out",null,975,0,6.54,2.75,0,0,0,0,0,0,0,0,0,null,9,0,630002.22370326216,505149.35184775549,0,0,0,0,0,0,0,0,0,null,8775,0,41202.145430193348,13891.607175813277,0,0,0,0,0,0,0,0,0,63868.752606006623]
["C2U","Unmetered Supplies / Public Lighting",null,0,0,11.24,3.15,0,0,0,0,0,0,0,0,0,null,4425.5,0,7430325.4446869912,18727648.893831097,0,0,0,0,0,0,0,0,0,null,0,0,835168.57998281776,589920.94015567959,0,0,0,0,0,0,0,0,0,1425089.5201384975]
["CLLV","Large low Voltage",null,6200,0,2.33,1.41,71.900000000000006,0,0,0,0,0,0,0,0,null,334.33333333333331,0,103909055.5023116,80266733.268921614,59781.404083333327,0,0,0,0,0,0,0,0,null,2072866.6666666665,0,2421080.9932038602,1131760.9390917947,4298282.9535916662,0,0,0,{"$f":"L38/100*Z38","v":0},0,0,0,0,9923991.552553989]
["CLLVB","Large low Voltage Bulk",null,6000,0,2.11,1.31,66.14,0,0,0,0,0,0,0,0,null,1731.1666666666667,0,1101354717.2937953,829525555.83137512,627630.98033333279,0,0,0,0,0,0,0,0,null,10387000,0,23238584.534899078,10866784.781391015,41511513.039246634,0,0,0,0,0,0,0,0,86003882.355536729]
["CHV","High Voltage",null,31800,0,1.24,0.64,35.020000000000003,0,0,0,0,0,0,0,0,null,88,0,345704462.09037936,319905209.40701491,191921.57674999998,0,0,0,0,0,0,0,0,null,2798400,0,4286735.3299207035,2047393.3402048955,6721093.6177850002,0,0,0,0,0,0,0,0,15853622.287910599]
["CST","Subtransmission",null,146800,0,0.11,0.04,0.86,0,0,0,0,0,0,0,0,null,6,0,63161450.703406543,37546309.7185238,35559.269916666664,0,0,0,0,0,0,0,0,null,880800,0,69477.595773747205,15018.523887409521,30580.972128333331,0,0,0,0,0,0,0,0,995877.09178948996]
[null,null,null,null,null,null,null,null,null,null,null,null,null,null,null,null,null,null,null,null,null,null,null,null,null,null,null,null,null,null,null,0,0,0,0,0,0,0,0,0,0,0,0,0,0]
[null,null,null,null,null,null,null,null,null,null,null,null,null,null,null,null,null,null,null,null,null,null,null,null,null,null,null,null,null,null,null,0,0,0,0,0,0,0,0,0,0,0,0,0,0]
[null,null,null,null,null,null,null,null,null,null,null,null,null,null,null,null,null,null,null,null,null,null,null,null,null,null,null,null,null,null,null,0,0,0,0,0,0,0,0,0,0,0,0,0,0]
[null,null,null,null,null,null,null,null,null,null,null,null,null,null,null,null,null,null,null,null,null,null,null,null,null,null,null,null,null,null,null,0,0,0,0,0,0,0,0,0,0,0,0,0,0]
[null,null,null,null,null,null,null,null,null,null,null,null,null,null,null,null,null,null,null,null,null,null,null,null,null,null,null,null,null,null,null,0,0,0,0,0,0,0,0,0,0,0,0,0,0]
[null,null,null,null,null,null,null,null,null,null,null,null,null,null,null,null,null,null,null,null,null,null,null,null,null,null,null,null,null,null,null,0,0,0,0,0,0,0,0,0,0,0,0,0,0]
[null,null,null,null,null,null,null,null,null,null,null,null,null,null,null,null,null,null,null,null,null,null,null,null,null,null,null,null,null,null,null,0,0,0,0,0,0,0,0,0,0,0,0,0,0]
[null,null,null,null,null,null,null,null,null,null,null,null,null,null,null,null,null,null,null,null,null,null,null,null,null,null,null,null,null,null,null,0,0,0,0,0,0,0,0,0,0,0,0,0,0]
[null,null,null,null,null,null,null,null,null,null,null,null,null,null,null,null,null,null,null,null,null,null,null,null,null,null,null,null,null,null,null,0,0,0,0,0,0,0,0,0,0,0,0,0,0]
[null,null,null,null,null,null,null,null,null,null,null,null,null,null,null,null,null,null,null,null,null,null,null,null,null,null,null,null,null,null,null,0,0,0,0,0,0,0,0,0,0,0,0,0,0]
[null,null,null,null,null,null,null,null,null,null,null,null,null,null,null,null,null,null,null,null,null,null,null,null,null,null,null,null,null,null,null,0,0,0,0,0,0,0,0,0,0,0,0,0,0]
[null,null,null,null,null,null,null,null,null,null,null,null,null,null,null,null,null,null,null,null,null,null,null,null,null,null,null,null,null,null,null,0,0,0,0,0,0,0,0,0,0,0,0,0,0]
[null,null,null,null,null,null,null,null,null,null,null,null,null,null,null,null,null,null,null,null,null,null,null,null,null,null,null,null,null,null,null,0,0,0,0,0,0,0,0,0,{"$f":"M54/100*AA54","v":0},{"$f":"N54/100*AB54","v":0},{"$f":"O54/100*AC54","v":0},{"$f":"P54/100*AD54","v":0},0]
[null,null,null,null,null,null,null,null,null,null,null,null,null,null,null,null,null,null,null,null,null,null,null,null,null,null,null,null,null,null,null,0,0,0,0,0,0,0,0,0,0,0,0,0,0]
[null,null,null,null,null,null,null,null,null,null,null,null,null,null,null,null,null,null,null,null,null,null,null,null,null,null,null,null,null,null,null,0,0,0,0,0,0,0,0,0,0,0,0,0,0]
[null,null,null,null,null,null,null,null,null,null,null,null,null,null,null,null,null,null,null,null,null,null,null,null,null,null,null,null,null,null,null,0,0,0,0,0,0,0,0,0,0,0,0,0,0]
[null,null,null,null,null,null,null,null,null,null,null,null,null,null,null,null,null,null,null,null,null,null,null,null,null,null,null,null,null,null,null,0,0,0,0,0,0,0,0,0,0,0,0,0,0]
[null,null,null,null,null,null,null,null,null,null,null,null,null,null,null,null,null,null,null,null,null,null,null,null,null,null,null,null,null,null,null,0,0,0,0,0,0,0,0,0,0,0,0,0,0]
[null,null,null,null,null,null,null,null,null,null,null,null,null,null,null,null,null,null,null,null,null,null,null,null,null,null,null,null,null,null,null,0,0,0,0,0,0,0,0,0,0,0,0,0,0]
[null,null,null,null,null,null,null,null,null,null,null,null,null,null,null,null,null,null,null,null,null,null,null,null,null,null,null,null,null,null,null,0,0,0,0,0,0,0,0,0,0,0,0,0,0]
[null,null,null,null,null,null,null,null,null,null,null,null,null,null,null,null,null,null,null,null,null,null,null,null,null,null,null,null,null,null,null,0,0,0,0,0,0,0,0,0,0,0,0,0,0]
[null,null,null,null,null,null,null,null,null,null,null,null,null,null,null,null,null,null,null,null,null,null,null,null,null,null,null,null,null,null,null,0,0,0,0,0,0,0,0,0,0,0,0,0,0]
[null,null,null,null,null,null,null,null,null,null,null,null,null,null,null,null,null,null,null,null,null,null,null,null,null,null,null,null,null,null,null,0,0,0,0,0,0,0,0,0,0,0,0,0,0]
[null,null,null,null,null,null,null,null,null,null,null,null,null,null,null,null,null,null,null,null,null,null,null,null,null,null,null,null,null,null,null,0,0,0,0,0,0,0,0,0,0,0,0,0,0]
[null,null,null,null,null,null,null,null,null,null,null,null,null,null,null,null,null,{"$f":"SUM(R6:R65)","v":373143.83333333331},1272086460.663789,2597281821.8915658,2012408976.1105549,914893.23108333279,1252129.4476761888,2174517.9950447618,414808.56590921606,515541.75038326747,{"$f":"SUM(AA6:AA65)","v":510185.1308476784},1382965.6448100451,1828108.2879962048,1739470.8675136871,null,54226785,62399673.296924189,85272151.478099212,34138880.070362471,52561470.582751632,6536170.7132787053,5690368.0667148232,{"$f":"SUM(AM6:AM65)","v":43377.206077001865},37051.248887464724,14384.108639617642,145357.25680105572,131469.96129339599,49167.622451560943,301246306.61228108]

{"sheet":"Prop2020TransTar","index":8,"n_rows":66,"n_cols":45,"rows_kept":66,"cut":false,"hidden":false,"merged":[]}
[null,{"$f":"\"Tariff Approval - \"&'Model update'!C3","v":"Tariff Approval - CitiPower"},null,{"$f":"\"Prop\"&'Model update'!$C$5&\"TransTar\"","v":"Prop2020TransTar"}]
[]
[null,{"$f":"\"PROPOSED \"&'Model update'!$C$5&\" TRANSMISSION TARIFFS\"","v":"PROPOSED 2020 TRANSMISSION TARIFFS"}]
[null,null,null,{"$f":"\"Proposed Transmission Tariffs (Pt) for \"&'Model update'!$C$5","v":"Proposed Transmission Tariffs (Pt) for 2020"},null,null,null,null,null,null,null,null,null,null,null,null,null,{"$f":"\"Forecast Quantities (Qt) for \"&'Model update'!$C$5","v":"Forecast Quantities (Qt) for 2020"},null,null,null,null,null,null,null,null,null,null,null,null,null,{"$f":"\"Forecast Revenue (Pt \"&'Model update'!$C$5&\")*(Qt \" &'Model update'!$C$5&\")\"","v":"Forecast Revenue (Pt 2020)*(Qt 2020)"}]
[null,"Proposed tariff",null,{"$f":"Prop2020DistTar!D5","v":"PropTar\nFixed"},{"$f":"Prop2020DistTar!E5","v":"PropTar\nAnytime"},{"$f":"Prop2020DistTar!F5","v":"PropTar\nPkBlk"},{"$f":"Prop2020DistTar!G5","v":"PropTar\nOPkBlk1"},{"$f":"Prop2020DistTar!H5","v":"PropTar\nDem kVA"},{"$f":"Prop2020DistTar!I5","v":"PropTar\nDem kW Sum"},{"$f":"Prop2020DistTar!J5","v":"PropTar\nDem kW Win"},{"$f":"Prop2020DistTar!K5","v":"PropTar\nSumBlk1"},{"$f":"Prop2020DistTar!L5","v":"PropTar\nSumBlk2"},{"$f":"Prop2020DistTar!M5","v":"PropTar\nSumBlk3"},{"$f":"Prop2020DistTar!N5","v":"PropTar\nWtrBlk1"},{"$f":"Prop2020DistTar!O5","v":"PropTar\nWtrBlk2"},{"$f":"Prop2020DistTar!P5","v":"PropTar\nWtrBlk3"},null,{"$f":"Prop2020DistTar!AF5","v":"FcastVol\nFixed"},{"$f":"Prop2020DistTar!AG5","v":"FcastVol\nAnytime"},{"$f":"Prop2020DistTar!AH5","v":"FcastVol\nPk"},{"$f":"Prop2020DistTar!AI5","v":"FcastVol\nOpk"},{"$f":"Prop2020DistTar!AJ5","v":"FcastVol\nDem kVA"},{"$f":"Prop2020DistTar!AK5","v":"FcastVol\nDem kW Sum"},{"$f":"Prop2020DistTar!AL5","v":"FcastVol\nDem kW Win"},{"$f":"Prop2020DistTar!AM5","v":"FcastVol\nSumBlk1"},{"$f":"Prop2020DistTar!AN5","v":"FcastVol\nSumBlk2"},{"$f":"Prop2020DistTar!AO5","v":"FcastVol\nSumBlk3"},{"$f":"Prop2020DistTar!AP5","v":"FcastVol\nWtrBlk1"},{"$f":"Prop2020DistTar!AQ5","v":"FcastVol\nWtrBlk2"},{"$f":"Prop2020DistTar!AR5","v":"FcastVol\nWtrBlk3"},null,{"$f":"Prop2020DistTar!AT5","v":"PropRev\nFixed"},{"$f":"Prop2020DistTar!AU5","v":"PropRev\nAnytime"},{"$f":"Prop2020DistTar!AV5","v":"PropRev\nPk"},{"$f":"Prop2020DistTar!AW5","v":"PropRev\nOpk"},{"$f":"Prop2020DistTar!AX5","v":"PropRev\nDem kVA"},{"$f":"Prop2020DistTar!AY5","v":"PropRev\nDem kW Sum"},{"$f":"Prop2020DistTar!AZ5","v":"PropRev\nDem kW Win"},{"$f":"Prop2020DistTar!BA5","v":"PropRev\nSumBlk1"},{"$f":"Prop2020DistTar!BB5","v":"PropRev\nSumBlk2"},{"$f":"Prop2020DistTar!BC5","v":"PropRev\nSumBlk3"},{"$f":"Prop2020DistTar!BD5","v":"PropRev\nWtrBlk1"},{"$f":"Prop2020DistTar!BE5","v":"PropRev\nWtrBlk2"},{"$f":"Prop2020DistTar!BF5","v":"PropRev\nWtrBlk3"},"PropRev\nTotal"]
[null,{"$f":"Prop2020DistTar!B6","v":"Residential Single Rate"},"C1R",0,2.1,0,0,0,0,0,0,0,0,0,0,0,null,{"$f":"Prop2020DistTar!AF6","v":206178.44076359438},{"$f":"Prop2020DistTar!AG6","v":848271452.54835963},{"$f":"Prop2020DistTar!AH6","v":0},{"$f":"Prop2020DistTar!AI6","v":0},{"$f":"Prop2020DistTar!AJ6","v":0},{"$f":"Prop2020DistTar!AK6","v":0},{"$f":"Prop2020DistTar!AL6","v":0},{"$f":"Prop2020DistTar!AM6","v":0},{"$f":"Prop2020DistTar!AN6","v":0},{"$f":"Prop2020DistTar!AO6","v":0},{"$f":"Prop2020DistTar!AP6","v":0},{"$f":"Prop2020DistTar!AQ6","v":0},{"$f":"Prop2020DistTar!AR6","v":0},null,{"$f":"D6*R6","v":0},{"$f":"E6/100*S6","v":17813700.503515553},0,0,{"$f":"H6*V6","v":0},{"$f":"I6*W6","v":0},0,0,0,{"$f":"M6/100*AA6","v":0},{"$f":"N6/100*AB6","v":0},{"$f":"O6/100*AC6","v":0},{"$f":"P6/100*AD6","v":0},{"$f":"SUM(AF6:AR6)","v":17813700.503515553}]
[null,{"$f":"Prop2020DistTar!B7","v":"Residential Single Rate - Bulk"},"C1RB",0,1.17,0,0,0,0,0,0,0,0,0,0,0,null,{"$f":"Prop2020DistTar!AF7","v":31089.947611169671},{"$f":"Prop2020DistTar!AG7","v":107478291.59874508},{"$f":"Prop2020DistTar!AH7","v":0},{"$f":"Prop2020DistTar!AI7","v":0},{"$f":"Prop2020DistTar!AJ7","v":0},{"$f":"Prop2020DistTar!AK7","v":0},{"$f":"Prop2020DistTar!AL7","v":0},{"$f":"Prop2020DistTar!AM7","v":0},{"$f":"Prop2020DistTar!AN7","v":0},{"$f":"Prop2020DistTar!AO7","v":0},{"$f":"Prop2020DistTar!AP7","v":0},{"$f":"Prop2020DistTar!AQ7","v":0},{"$f":"Prop2020DistTar!AR7","v":0},null,{"$f":"D7*R7","v":0},{"$f":"E7/100*S7","v":1257496.0117053173},0,0,{"$f":"H7*V7","v":0},{"$f":"I7*W7","v":0},{"$f":"J7*X7","v":0},0,0,0,0,0,0,{"$f":"SUM(AF7:AR7)","v":1257496.0117053173}]
[null,{"$f":"Prop2020DistTar!B8","v":"Residential - flexible pricing"},"C13R",0,0,0,0,0,0,0,2.92,1.97,0.77,2.92,1.97,0.77,null,{"$f":"Prop2020DistTar!AF8","v":697.78377437315021},{"$f":"Prop2020DistTar!AG8","v":0},{"$f":"Prop2020DistTar!AH8","v":0},{"$f":"Prop2020DistTar!AI8","v":0},{"$f":"Prop2020DistTar!AJ8","v":0},{"$f":"Prop2020DistTar!AK8","v":0},{"$f":"Prop2020DistTar!AL8","v":0},{"$f":"Prop2020DistTar!AM8","v":182885.28410131854},{"$f":"Prop2020DistTar!AN8","v":388824.70973085507},{"$f":"Prop2020DistTar!AO8","v":289537.60955412494},{"$f":"Prop2020DistTar!AP8","v":700283.25333285017},{"$f":"Prop2020DistTar!AQ8","v":1488842.7685394138},{"$f":"Prop2020DistTar!AR8","v":1108664.046848356},null,0,0,0,0,0,0,0,5340.2502957585011,7659.8467816978446,2229.4395935667621,20448.270997319225,29330.202540226452,8536.7131607323408,73544.723369301122]
[null,{"$f":"Prop2020DistTar!B9","v":"Residential - flexible pricing bulk"},"C13RB",0,0,0,0,0,0,0,2.71,1.83,0.71,2.71,1.83,0.71,null,{"$f":"Prop2020DistTar!AF9","v":92.829526834867764},{"$f":"Prop2020DistTar!AG9","v":0},{"$f":"Prop2020DistTar!AH9","v":0},{"$f":"Prop2020DistTar!AI9","v":0},{"$f":"Prop2020DistTar!AJ9","v":0},{"$f":"Prop2020DistTar!AK9","v":0},{"$f":"Prop2020DistTar!AL9","v":0},{"$f":"Prop2020DistTar!AM9","v":15622.006825940556},{"$f":"Prop2020DistTar!AN9","v":33980.313696763908},{"$f":"Prop2020DistTar!AO9","v":24260.31259187479},{"$f":"Prop2020DistTar!AP9","v":58675.496976719034},{"$f":"Prop2020DistTar!AQ9","v":127628.40368701438},{"$f":"Prop2020DistTar!AR9","v":91120.552820082667},null,0,0,0,0,0,0,0,423.35638498298908,621.8397406507795,172.24821940231101,1590.1059680690857,2335.599787472363,646.95592502258694,5790.1060256001147]
[null,{"$f":"Prop2020DistTar!B10","v":"Residential Two Rate 5d"},"C2R",0,0,2.63,0.69,0,0,0,0,0,0,0,0,0,null,{"$f":"Prop2020DistTar!AF10","v":10806.12165035933},{"$f":"Prop2020DistTar!AG10","v":0},{"$f":"Prop2020DistTar!AH10","v":33449615.665798429},{"$f":"Prop2020DistTar!AI10","v":29269859.989206955},{"$f":"Prop2020DistTar!AJ10","v":0},{"$f":"Prop2020DistTar!AK10","v":0},{"$f":"Prop2020DistTar!AL10","v":0},{"$f":"Prop2020DistTar!AM10","v":0},{"$f":"Prop2020DistTar!AN10","v":0},{"$f":"Prop2020DistTar!AO10","v":0},{"$f":"Prop2020DistTar!AP10","v":0},{"$f":"Prop2020DistTar!AQ10","v":0},{"$f":"Prop2020DistTar!AR10","v":0},null,0,0,879724.89201049868,201962.033925528,0,0,0,0,0,0,0,0,0,1081686.9259360267]
[null,{"$f":"Prop2020DistTar!B11","v":"Residential Two Rate 5d - Bulk"},"C2RB",0,0,2.36,0.65,0,0,0,0,0,0,0,0,0,null,{"$f":"Prop2020DistTar!AF11","v":4316.8242068076952},{"$f":"Prop2020DistTar!AG11","v":0},{"$f":"Prop2020DistTar!AH11","v":12001250.20375419},{"$f":"Prop2020DistTar!AI11","v":10487452.702396166},{"$f":"Prop2020DistTar!AJ11","v":0},{"$f":"Prop2020DistTar!AK11","v":0},{"$f":"Prop2020DistTar!AL11","v":0},{"$f":"Prop2020DistTar!AM11","v":0},{"$f":"Prop2020DistTar!AN11","v":0},{"$f":"Prop2020DistTar!AO11","v":0},{"$f":"Prop2020DistTar!AP11","v":0},{"$f":"Prop2020DistTar!AQ11","v":0},{"$f":"Prop2020DistTar!AR11","v":0},null,0,0,283229.5048085989,68168.442565575082,0,0,0,0,0,0,0,0,0,351397.94737417396]
[null,{"$f":"Prop2020DistTar!B12","v":"Residential Interval"},"C3R",0,0,2.63,0.69,0,0,0,0,0,0,0,0,0,null,{"$f":"Prop2020DistTar!AF12","v":17021.34204511912},{"$f":"Prop2020DistTar!AG12","v":0},{"$f":"Prop2020DistTar!AH12","v":51729844.462038442},{"$f":"Prop2020DistTar!AI12","v":45571765.373176172},{"$f":"Prop2020DistTar!AJ12","v":0},{"$f":"Prop2020DistTar!AK12","v":0},{"$f":"Prop2020DistTar!AL12","v":0},{"$f":"Prop2020DistTar!AM12","v":0},{"$f":"Prop2020DistTar!AN12","v":0},{"$f":"Prop2020DistTar!AO12","v":0},{"$f":"Prop2020DistTar!AP12","v":0},{"$f":"Prop2020DistTar!AQ12","v":0},{"$f":"Prop2020DistTar!AR12","v":0},null,0,0,1360494.909351611,314445.18107491557,0,0,0,0,0,0,0,0,0,1674940.0904265265]
[null,{"$f":"Prop2020DistTar!B13","v":"Residential Interval - Bulk"},"C3RB",0,0,2.36,0.65,0,0,0,0,0,0,0,0,0,null,{"$f":"Prop2020DistTar!AF13","v":8705.3498093096259},{"$f":"Prop2020DistTar!AG13","v":0},{"$f":"Prop2020DistTar!AH13","v":15093462.866443299},{"$f":"Prop2020DistTar!AI13","v":14304461.07940924},{"$f":"Prop2020DistTar!AJ13","v":0},{"$f":"Prop2020DistTar!AK13","v":0},{"$f":"Prop2020DistTar!AL13","v":0},{"$f":"Prop2020DistTar!AM13","v":0},{"$f":"Prop2020DistTar!AN13","v":0},{"$f":"Prop2020DistTar!AO13","v":0},{"$f":"Prop2020DistTar!AP13","v":0},{"$f":"Prop2020DistTar!AQ13","v":0},{"$f":"Prop2020DistTar!AR13","v":0},null,0,0,356205.72364806186,92978.997016160065,0,0,0,0,0,0,0,0,0,449184.72066422191]
[null,{"$f":"Prop2020DistTar!B14","v":"Residential Two Rate 5d - Controlled Load"},"C2ROP",0,0,0,0,0,0,0,0,0,0,0,0,0,null,{"$f":"Prop2020DistTar!AF14","v":0},{"$f":"Prop2020DistTar!AG14","v":0},{"$f":"Prop2020DistTar!AH14","v":0},{"$f":"Prop2020DistTar!AI14","v":0},{"$f":"Prop2020DistTar!AJ14","v":0},{"$f":"Prop2020DistTar!AK14","v":0},{"$f":"Prop2020DistTar!AL14","v":0},{"$f":"Prop2020DistTar!AM14","v":0},{"$f":"Prop2020DistTar!AN14","v":0},{"$f":"Prop2020DistTar!AO14","v":0},{"$f":"Prop2020DistTar!AP14","v":0},{"$f":"Prop2020DistTar!AQ14","v":0},{"$f":"Prop2020DistTar!AR14","v":0},null,0,0,0,0,0,0,0,0,0,0,0,0,0,0]
[null,{"$f":"Prop2020DistTar!B15","v":"Residential Two Rate 5d - Bulk - Controlled Load"},"C2RBOP",0,0,0,0,0,0,0,0,0,0,0,0,0,null,{"$f":"Prop2020DistTar!AF15","v":0},{"$f":"Prop2020DistTar!AG15","v":0},{"$f":"Prop2020DistTar!AH15","v":0},{"$f":"Prop2020DistTar!AI15","v":0},{"$f":"Prop2020DistTar!AJ15","v":0},{"$f":"Prop2020DistTar!AK15","v":0},{"$f":"Prop2020DistTar!AL15","v":0},{"$f":"Prop2020DistTar!AM15","v":0},{"$f":"Prop2020DistTar!AN15","v":0},{"$f":"Prop2020DistTar!AO15","v":0},{"$f":"Prop2020DistTar!AP15","v":0},{"$f":"Prop2020DistTar!AQ15","v":0},{"$f":"Prop2020DistTar!AR15","v":0},null,0,0,0,0,0,0,0,0,0,0,0,0,0,0]
[null,{"$f":"Prop2020DistTar!B16","v":"Dedicated Circuit"},"CDS",0,0,0,0.47,0,0,0,0,0,0,0,0,0,null,{"$f":"Prop2020DistTar!AF16","v":32498.745053272465},{"$f":"Prop2020DistTar!AG16","v":0},{"$f":"Prop2020DistTar!AH16","v":0},{"$f":"Prop2020DistTar!AI16","v":50045800.11975988},{"$f":"Prop2020DistTar!AJ16","v":0},{"$f":"Prop2020DistTar!AK16","v":0},{"$f":"Prop2020DistTar!AL16","v":0},{"$f":"Prop2020DistTar!AM16","v":0},{"$f":"Prop2020DistTar!AN16","v":0},{"$f":"Prop2020DistTar!AO16","v":0},{"$f":"Prop2020DistTar!AP16","v":0},{"$f":"Prop2020DistTar!AQ16","v":0},{"$f":"Prop2020DistTar!AR16","v":0},null,0,0,0,235215.26056287141,0,0,0,0,0,0,0,0,0,235215.26056287141]
[null,{"$f":"Prop2020DistTar!B17","v":"Dedicated Circuit - Bulk"},"CDSB",0,0,0,0.39,0,0,0,0,0,0,0,0,0,null,{"$f":"Prop2020DistTar!AF17","v":5581.4193302891908},{"$f":"Prop2020DistTar!AG17","v":0},{"$f":"Prop2020DistTar!AH17","v":0},{"$f":"Prop2020DistTar!AI17","v":9263135.8289495241},{"$f":"Prop2020DistTar!AJ17","v":0},{"$f":"Prop2020DistTar!AK17","v":0},{"$f":"Prop2020DistTar!AL17","v":0},{"$f":"Prop2020DistTar!AM17","v":0},{"$f":"Prop2020DistTar!AN17","v":0},{"$f":"Prop2020DistTar!AO17","v":0},{"$f":"Prop2020DistTar!AP17","v":0},{"$f":"Prop2020DistTar!AQ17","v":0},{"$f":"Prop2020DistTar!AR17","v":0},null,0,0,0,36126.22973290315,0,0,0,0,0,0,0,0,0,36126.22973290315]
[null,{"$f":"Prop2020DistTar!B18","v":"Residential Demand"},"CR",0,0.78,0,0,0,1.9,0.65,0,0,0,0,0,0,null,{"$f":"Prop2020DistTar!AF18","v":8.4225614876243853},{"$f":"Prop2020DistTar!AG18","v":49160.9218844563},{"$f":"Prop2020DistTar!AH18","v":0},{"$f":"Prop2020DistTar!AI18","v":0},{"$f":"Prop2020DistTar!AJ18","v":0},{"$f":"Prop2020DistTar!AK18","v":91.993203745090227},{"$f":"Prop2020DistTar!AL18","v":214.72009856865083},{"$f":"Prop2020DistTar!AM18","v":0},{"$f":"Prop2020DistTar!AN18","v":0},{"$f":"Prop2020DistTar!AO18","v":0},{"$f":"Prop2020DistTar!AP18","v":0},{"$f":"Prop2020DistTar!AQ18","v":0},{"$f":"Prop2020DistTar!AR18","v":0},null,0,383.45519069875917,0,0,0,174.78708711567143,139.56806406962303,0,0,0,0,0,0,697.81034188405363]
[null,{"$f":"Prop2020DistTar!B19","v":"Residential Bulk Demand"},"CRB",0,0.62,0,0,0,1.55,0.52,0,0,0,0,0,0,null,{"$f":"Prop2020DistTar!AF19","v":1.9569063180827886},{"$f":"Prop2020DistTar!AG19","v":11446.587208253419},{"$f":"Prop2020DistTar!AH19","v":0},{"$f":"Prop2020DistTar!AI19","v":0},{"$f":"Prop2020DistTar!AJ19","v":0},{"$f":"Prop2020DistTar!AK19","v":18.995011764705886},{"$f":"Prop2020DistTar!AL19","v":47.503513725490194},{"$f":"Prop2020DistTar!AM19","v":0},{"$f":"Prop2020DistTar!AN19","v":0},{"$f":"Prop2020DistTar!AO19","v":0},{"$f":"Prop2020DistTar!AP19","v":0},{"$f":"Prop2020DistTar!AQ19","v":0},{"$f":"Prop2020DistTar!AR19","v":0},null,0,70.968840691171195,0,0,0,29.442268235294126,24.701827137254902,0,0,0,0,0,0,125.11293606372021]
[null,{"$f":"Prop2020DistTar!B20","v":"Non-Residential Single Rate"},"C1G",0,2.23,0,0,0,0,0,0,0,0,0,0,0,null,{"$f":"Prop2020DistTar!AF20","v":19278.928459938834},{"$f":"Prop2020DistTar!AG20","v":234414508.13361585},{"$f":"Prop2020DistTar!AH20","v":0},{"$f":"Prop2020DistTar!AI20","v":0},{"$f":"Prop2020DistTar!AJ20","v":0},{"$f":"Prop2020DistTar!AK20","v":0},{"$f":"Prop2020DistTar!AL20","v":0},{"$f":"Prop2020DistTar!AM20","v":0},{"$f":"Prop2020DistTar!AN20","v":0},{"$f":"Prop2020DistTar!AO20","v":0},{"$f":"Prop2020DistTar!AP20","v":0},{"$f":"Prop2020DistTar!AQ20","v":0},{"$f":"Prop2020DistTar!AR20","v":0},null,0,5227443.5313796336,0,0,0,0,0,0,0,0,0,0,0,5227443.5313796336]
[null,{"$f":"Prop2020DistTar!B21","v":"Non-Residential Single Rate - Bulk"},"C1GB",0,1.51,0,0,0,0,0,0,0,0,0,0,0,null,{"$f":"Prop2020DistTar!AF21","v":5769.6090324287434},{"$f":"Prop2020DistTar!AG21","v":81668548.051084116},{"$f":"Prop2020DistTar!AH21","v":0},{"$f":"Prop2020DistTar!AI21","v":0},{"$f":"Prop2020DistTar!AJ21","v":0},{"$f":"Prop2020DistTar!AK21","v":0},{"$f":"Prop2020DistTar!AL21","v":0},{"$f":"Prop2020DistTar!AM21","v":0},{"$f":"Prop2020DistTar!AN21","v":0},{"$f":"Prop2020DistTar!AO21","v":0},{"$f":"Prop2020DistTar!AP21","v":0},{"$f":"Prop2020DistTar!AQ21","v":0},{"$f":"Prop2020DistTar!AR21","v":0},null,0,1233195.0755713703,0,0,0,0,0,0,0,0,0,0,0,1233195.0755713703]
[null,{"$f":"Prop2020DistTar!B22","v":"Non-Residential Two Rate 5d"},"C2G5",0,0,2.58,0.81,0,0,0,0,0,0,0,0,0,null,{"$f":"Prop2020DistTar!AF22","v":6175.6551246567678},{"$f":"Prop2020DistTar!AG22","v":0},{"$f":"Prop2020DistTar!AH22","v":70438600.5182468},{"$f":"Prop2020DistTar!AI22","v":44830727.118458346},{"$f":"Prop2020DistTar!AJ22","v":0},{"$f":"Prop2020DistTar!AK22","v":0},{"$f":"Prop2020DistTar!AL22","v":0},{"$f":"Prop2020DistTar!AM22","v":0},{"$f":"Prop2020DistTar!AN22","v":0},{"$f":"Prop2020DistTar!AO22","v":0},{"$f":"Prop2020DistTar!AP22","v":0},{"$f":"Prop2020DistTar!AQ22","v":0},{"$f":"Prop2020DistTar!AR22","v":0},null,0,0,1817315.8933707674,363128.88965951267,0,0,0,0,0,0,0,0,0,2180444.7830302799]
[null,{"$f":"Prop2020DistTar!B23","v":"Non-Residential Two Rate 5d - Bulk"},"C2G5B",0,0,2.14,0.69,0,0,0,0,0,0,0,0,0,null,{"$f":"Prop2020DistTar!AF23","v":999.43191263014216},{"$f":"Prop2020DistTar!AG23","v":0},{"$f":"Prop2020DistTar!AH23","v":16508026.378642861},{"$f":"Prop2020DistTar!AI23","v":10058974.835898034},{"$f":"Prop2020DistTar!AJ23","v":0},{"$f":"Prop2020DistTar!AK23","v":0},{"$f":"Prop2020DistTar!AL23","v":0},{"$f":"Prop2020DistTar!AM23","v":0},{"$f":"Prop2020DistTar!AN23","v":0},{"$f":"Prop2020DistTar!AO23","v":0},{"$f":"Prop2020DistTar!AP23","v":0},{"$f":"Prop2020DistTar!AQ23","v":0},{"$f":"Prop2020DistTar!AR23","v":0},null,0,0,353271.76450295729,69406.926367696433,0,0,0,0,0,0,0,0,0,422678.69087065372]
[null,{"$f":"Prop2020DistTar!B24","v":"Non-Residential Interval"},"C3G",0,0,2.58,0.75,0,0,0,0,0,0,0,0,0,null,{"$f":"Prop2020DistTar!AF24","v":3789.6292029166912},{"$f":"Prop2020DistTar!AG24","v":0},{"$f":"Prop2020DistTar!AH24","v":44801539.356732354},{"$f":"Prop2020DistTar!AI24","v":25848586.997369338},{"$f":"Prop2020DistTar!AJ24","v":0},{"$f":"Prop2020DistTar!AK24","v":0},{"$f":"Prop2020DistTar!AL24","v":0},{"$f":"Prop2020DistTar!AM24","v":0},{"$f":"Prop2020DistTar!AN24","v":0},{"$f":"Prop2020DistTar!AO24","v":0},{"$f":"Prop2020DistTar!AP24","v":0},{"$f":"Prop2020DistTar!AQ24","v":0},{"$f":"Prop2020DistTar!AR24","v":0},null,0,0,1155879.7154036947,193864.40248027002,0,0,0,0,0,0,0,0,0,1349744.1178839647]
[null,{"$f":"Prop2020DistTar!B25","v":"Non-Residential Interval - Bulk"},"C3GB",0,0,2.14,0.69,0,0,0,0,0,0,0,0,0,null,{"$f":"Prop2020DistTar!AF25","v":1768.9772717301021},{"$f":"Prop2020DistTar!AG25","v":0},{"$f":"Prop2020DistTar!AH25","v":27824537.942965478},{"$f":"Prop2020DistTar!AI25","v":14553393.117495544},{"$f":"Prop2020DistTar!AJ25","v":0},{"$f":"Prop2020DistTar!AK25","v":0},{"$f":"Prop2020DistTar!AL25","v":0},{"$f":"Prop2020DistTar!AM25","v":0},{"$f":"Prop2020DistTar!AN25","v":0},{"$f":"Prop2020DistTar!AO25","v":0},{"$f":"Prop2020DistTar!AP25","v":0},{"$f":"Prop2020DistTar!AQ25","v":0},{"$f":"Prop2020DistTar!AR25","v":0},null,0,0,595445.11197946128,100418.41251071925,0,0,0,0,0,0,0,0,0,695863.52449018054]
[null,{"$f":"Prop2020DistTar!B26","v":"Non-Residential Flexible Pricing"},"C14G",0,0,0,0,0,0,0,3.14,2.19,0.86,3.14,2.19,0.86,null,{"$f":"Prop2020DistTar!AF26","v":20.735050198175649},{"$f":"Prop2020DistTar!AG26","v":0},{"$f":"Prop2020DistTar!AH26","v":0},{"$f":"Prop2020DistTar!AI26","v":0},{"$f":"Prop2020DistTar!AJ26","v":0},{"$f":"Prop2020DistTar!AK26","v":0},{"$f":"Prop2020DistTar!AL26","v":0},{"$f":"Prop2020DistTar!AM26","v":54335.809564896466},{"$f":"Prop2020DistTar!AN26","v":14519.639818854528},{"$f":"Prop2020DistTar!AO26","v":41864.179794472628},{"$f":"Prop2020DistTar!AP26","v":174859.38124809813},{"$f":"Prop2020DistTar!AQ26","v":46726.003624512079},{"$f":"Prop2020DistTar!AR26","v":134724.12823034308},null,0,0,0,0,0,0,0,1706.1444203377494,317.98011203291418,360.03194623246458,5490.5845711902821,1023.2994793768145,1158.6275027809504,10056.668031951174]
[null,{"$f":"Prop2020DistTar!B27","v":"Non-Residential - Flexible Pricing Bulk"},"C14GB",0,0,0,0,0,0,0,2.83,1.97,0.78,2.83,1.97,0.78,null,{"$f":"Prop2020DistTar!AF27","v":0.91833100642885634},{"$f":"Prop2020DistTar!AG27","v":0},{"$f":"Prop2020DistTar!AH27","v":0},{"$f":"Prop2020DistTar!AI27","v":0},{"$f":"Prop2020DistTar!AJ27","v":0},{"$f":"Prop2020DistTar!AK27","v":0},{"$f":"Prop2020DistTar!AL27","v":0},{"$f":"Prop2020DistTar!AM27","v":22949.497197675988},{"$f":"Prop2020DistTar!AN27","v":5681.9549022702613},{"$f":"Prop2020DistTar!AO27","v":20258.102900905364},{"$f":"Prop2020DistTar!AP27","v":41846.928543241178},{"$f":"Prop2020DistTar!AQ27","v":10360.678438101071},{"$f":"Prop2020DistTar!AR27","v":36939.344562270453},null,0,0,0,0,0,0,0,649.47077069423051,111.93451157472414,158.01320262706184,1184.2680777737255,204.10536523059108,288.12688758570954,2595.9188154860421]
[null,{"$f":"Prop2020DistTar!B28","v":"Non-Residential Two Rate 7d"},"C2G7",0,0,2.0299999999999998,0.75,0,0,0,0,0,0,0,0,0,null,{"$f":"Prop2020DistTar!AF28","v":2306.9483847452143},{"$f":"Prop2020DistTar!AG28","v":0},{"$f":"Prop2020DistTar!AH28","v":38369324.717720643},{"$f":"Prop2020DistTar!AI28","v":9290402.2119519673},{"$f":"Prop2020DistTar!AJ28","v":0},{"$f":"Prop2020DistTar!AK28","v":0},{"$f":"Prop2020DistTar!AL28","v":0},{"$f":"Prop2020DistTar!AM28","v":0},{"$f":"Prop2020DistTar!AN28","v":0},{"$f":"Prop2020DistTar!AO28","v":0},{"$f":"Prop2020DistTar!AP28","v":0},{"$f":"Prop2020DistTar!AQ28","v":0},{"$f":"Prop2020DistTar!AR28","v":0},null,0,0,778897.291769729,69678.016589639752,0,0,0,0,0,0,0,0,0,848575.3083593687]
[null,{"$f":"Prop2020DistTar!B29","v":"Non-Residential Two Rate 7d - Bulk"},"C2G7B",0,0,1.87,0.69,0,0,0,0,0,0,0,0,0,null,{"$f":"Prop2020DistTar!AF29","v":223.54159787790852},{"$f":"Prop2020DistTar!AG29","v":0},{"$f":"Prop2020DistTar!AH29","v":4879506.8354705516},{"$f":"Prop2020DistTar!AI29","v":1213336.752724601},{"$f":"Prop2020DistTar!AJ29","v":0},{"$f":"Prop2020DistTar!AK29","v":0},{"$f":"Prop2020DistTar!AL29","v":0},{"$f":"Prop2020DistTar!AM29","v":0},{"$f":"Prop2020DistTar!AN29","v":0},{"$f":"Prop2020DistTar!AO29","v":0},{"$f":"Prop2020DistTar!AP29","v":0},{"$f":"Prop2020DistTar!AQ29","v":0},{"$f":"Prop2020DistTar!AR29","v":0},null,0,0,91246.777823299315,8372.0235937997459,0,0,0,0,0,0,0,0,0,99618.801417099065]
[null,{"$f":"Prop2020DistTar!B30","v":"Large Two Rate 7d"},"C2L7",0,0,2.58,0.81,0,0,0,0,0,0,0,0,0,null,{"$f":"Prop2020DistTar!AF30","v":1},{"$f":"Prop2020DistTar!AG30","v":0},{"$f":"Prop2020DistTar!AH30","v":43593.813751616013},{"$f":"Prop2020DistTar!AI30","v":17808.880496742764},{"$f":"Prop2020DistTar!AJ30","v":0},{"$f":"Prop2020DistTar!AK30","v":0},{"$f":"Prop2020DistTar!AL30","v":0},{"$f":"Prop2020DistTar!AM30","v":0},{"$f":"Prop2020DistTar!AN30","v":0},{"$f":"Prop2020DistTar!AO30","v":0},{"$f":"Prop2020DistTar!AP30","v":0},{"$f":"Prop2020DistTar!AQ30","v":0},{"$f":"Prop2020DistTar!AR30","v":0},null,0,0,1124.7203947916933,144.2519320236164,0,0,0,0,0,0,0,0,0,1268.9723268153098]
[null,{"$f":"Prop2020DistTar!B31","v":"Non-Residential Demand Tariff"},"CG",0,0.94,0,0,0,3,1,0,0,0,0,0,0,null,{"$f":"Prop2020DistTar!AF31","v":66.714761999582805},{"$f":"Prop2020DistTar!AG31","v":5507232.35853214},{"$f":"Prop2020DistTar!AH31","v":0},{"$f":"Prop2020DistTar!AI31","v":0},{"$f":"Prop2020DistTar!AJ31","v":0},{"$f":"Prop2020DistTar!AK31","v":1303.8375558307982},{"$f":"Prop2020DistTar!AL31","v":2992.2591172023403},{"$f":"Prop2020DistTar!AM31","v":0},{"$f":"Prop2020DistTar!AN31","v":0},{"$f":"Prop2020DistTar!AO31","v":0},{"$f":"Prop2020DistTar!AP31","v":0},{"$f":"Prop2020DistTar!AQ31","v":0},{"$f":"Prop2020DistTar!AR31","v":0},null,0,51767.984170202108,0,0,0,3911.5126674923949,2992.2591172023403,0,0,0,0,0,0,58671.755954896842]
[null,{"$f":"Prop2020DistTar!B32","v":"Non-Residential Bulk Demand Tariff"},"CGB",0,0.87,0,0,0,2.5499999999999998,0.85,0,0,0,0,0,0,null,{"$f":"Prop2020DistTar!AF32","v":148.11154188428057},{"$f":"Prop2020DistTar!AG32","v":12837801.451158172},{"$f":"Prop2020DistTar!AH32","v":0},{"$f":"Prop2020DistTar!AI32","v":0},{"$f":"Prop2020DistTar!AJ32","v":0},{"$f":"Prop2020DistTar!AK32","v":2650.3625109708137},{"$f":"Prop2020DistTar!AL32","v":6065.86859366513},{"$f":"Prop2020DistTar!AM32","v":0},{"$f":"Prop2020DistTar!AN32","v":0},{"$f":"Prop2020DistTar!AO32","v":0},{"$f":"Prop2020DistTar!AP32","v":0},{"$f":"Prop2020DistTar!AQ32","v":0},{"$f":"Prop2020DistTar!AR32","v":0},null,0,111688.87262507608,0,0,0,6758.4244029755746,5155.98830461536,0,0,0,0,0,0,123603.28533266702]
[null,{"$f":"Prop2020DistTar!B33","v":"Medium Business Demand"},"CMG",0,0,1.38,1.38,0,4.42,1.47,0,0,0,0,0,0,null,{"$f":"Prop2020DistTar!AF33","v":4403.4018551523304},{"$f":"Prop2020DistTar!AG33","v":0},{"$f":"Prop2020DistTar!AH33","v":339952679.85718626},{"$f":"Prop2020DistTar!AI33","v":250709652.79220656},{"$f":"Prop2020DistTar!AJ33","v":0},{"$f":"Prop2020DistTar!AK33","v":724859.65449187229},{"$f":"Prop2020DistTar!AL33","v":1273831.0316474377},{"$f":"Prop2020DistTar!AM33","v":0},{"$f":"Prop2020DistTar!AN33","v":0},{"$f":"Prop2020DistTar!AO33","v":0},{"$f":"Prop2020DistTar!AP33","v":0},{"$f":"Prop2020DistTar!AQ33","v":0},{"$f":"Prop2020DistTar!AR33","v":0},null,0,0,4691346.9820291707,3459793.2085324503,0,3203879.6728540757,1872531.6165217333,0,0,0,0,0,0,13227551.479937429]
[null,{"$f":"Prop2020DistTar!B34","v":"Medium Business Bulk Demand"},"CMGB",0,0,1.17,1.17,0,3.65,1.33,0,0,0,0,0,0,null,{"$f":"Prop2020DistTar!AF34","v":2080.7408836331665},{"$f":"Prop2020DistTar!AG34","v":0},{"$f":"Prop2020DistTar!AH34","v":235523158.73965827},{"$f":"Prop2020DistTar!AI34","v":157971528.62473217},{"$f":"Prop2020DistTar!AJ34","v":0},{"$f":"Prop2020DistTar!AK34","v":491954.4922444757},{"$f":"Prop2020DistTar!AL34","v":811784.27501472388},{"$f":"Prop2020DistTar!AM34","v":0},{"$f":"Prop2020DistTar!AN34","v":0},{"$f":"Prop2020DistTar!AO34","v":0},{"$f":"Prop2020DistTar!AP34","v":0},{"$f":"Prop2020DistTar!AQ34","v":0},{"$f":"Prop2020DistTar!AR34","v":0},null,0,0,2755620.9572540014,1848266.884909366,0,1795633.8966923363,1079673.0857695828,0,0,0,0,0,0,7479194.8246252863]
[null,{"$f":"Prop2020DistTar!B35","v":"Medium Business Opt-out"},"CMGO",0,0,3.61,1.45,0,0,0,0,0,0,0,0,0,null,{"$f":"Prop2020DistTar!AF35","v":41.341540163281572},{"$f":"Prop2020DistTar!AG35","v":0},{"$f":"Prop2020DistTar!AH35","v":2405969.966489397},{"$f":"Prop2020DistTar!AI35","v":2106689.7659207499},{"$f":"Prop2020DistTar!AJ35","v":0},{"$f":"Prop2020DistTar!AK35","v":0},{"$f":"Prop2020DistTar!AL35","v":0},{"$f":"Prop2020DistTar!AM35","v":0},{"$f":"Prop2020DistTar!AN35","v":0},{"$f":"Prop2020DistTar!AO35","v":0},{"$f":"Prop2020DistTar!AP35","v":0},{"$f":"Prop2020DistTar!AQ35","v":0},{"$f":"Prop2020DistTar!AR35","v":0},null,{"$f":"D35*R35","v":0},{"$f":"E35/100*S35","v":0},86855.515790267236,30547.00160585087,0,0,0,0,0,0,0,0,0,{"$f":"SUM(AF35:AR35)","v":117402.51739611811}]
[null,{"$f":"Prop2020DistTar!B36","v":"Medium Business Bulk Opt-out"},"CMGBO",0,0,2.89,1.1499999999999999,0,0,0,0,0,0,0,0,0,null,{"$f":"Prop2020DistTar!AF36","v":81.750047252346079},{"$f":"Prop2020DistTar!AG36","v":0},{"$f":"Prop2020DistTar!AH36","v":5074192.3018221091},{"$f":"Prop2020DistTar!AI36","v":4451924.7145162309},{"$f":"Prop2020DistTar!AJ36","v":0},{"$f":"Prop2020DistTar!AK36","v":0},{"$f":"Prop2020DistTar!AL36","v":0},{"$f":"Prop2020DistTar!AM36","v":0},{"$f":"Prop2020DistTar!AN36","v":0},{"$f":"Prop2020DistTar!AO36","v":0},{"$f":"Prop2020DistTar!AP36","v":0},{"$f":"Prop2020DistTar!AQ36","v":0},{"$f":"Prop2020DistTar!AR36","v":0},null,0,0,146644.15752265896,51197.134216936654,0,0,0,0,0,0,0,0,0,197841.29173959562]
[null,{"$f":"Prop2020DistTar!B37","v":"Unmetered Supplies / Public Lighting"},"C2U",0,0,0,0,0,0,0,0,0,0,0,0,0,null,{"$f":"Prop2020DistTar!AF37","v":4483.011669203448},{"$f":"Prop2020DistTar!AG37","v":0},{"$f":"Prop2020DistTar!AH37","v":7396578.4907364566},{"$f":"Prop2020DistTar!AI37","v":10316991.681946272},{"$f":"Prop2020DistTar!AJ37","v":0},{"$f":"Prop2020DistTar!AK37","v":0},{"$f":"Prop2020DistTar!AL37","v":0},{"$f":"Prop2020DistTar!AM37","v":0},{"$f":"Prop2020DistTar!AN37","v":0},{"$f":"Prop2020DistTar!AO37","v":0},{"$f":"Prop2020DistTar!AP37","v":0},{"$f":"Prop2020DistTar!AQ37","v":0},{"$f":"Prop2020DistTar!AR37","v":0},null,0,0,0,0,0,0,0,0,0,0,0,0,0,0]
[null,{"$f":"Prop2020DistTar!B38","v":"Large low Voltage"},"CLLV",0,0,1.28,0.78,39.74,0,0,0,0,0,0,0,0,null,{"$f":"Prop2020DistTar!AF38","v":400.17646833010758},{"$f":"Prop2020DistTar!AG38","v":0},{"$f":"Prop2020DistTar!AH38","v":126570892.63338222},{"$f":"Prop2020DistTar!AI38","v":97426022.677969709},{"$f":"Prop2020DistTar!AJ38","v":78034.411324370973},{"$f":"Prop2020DistTar!AK38","v":0},{"$f":"Prop2020DistTar!AL38","v":0},{"$f":"Prop2020DistTar!AM38","v":0},{"$f":"Prop2020DistTar!AN38","v":0},{"$f":"Prop2020DistTar!AO38","v":0},{"$f":"Prop2020DistTar!AP38","v":0},{"$f":"Prop2020DistTar!AQ38","v":0},{"$f":"Prop2020DistTar!AR38","v":0},null,0,0,1620107.4257072925,759922.97688816383,3101087.5060305027,0,0,0,0,0,0,0,0,5481117.9086259585]
[null,{"$f":"Prop2020DistTar!B39","v":"Large low Voltage Bulk"},"CLLVB",0,0,1.22,0.74,36.97,0,0,0,0,0,0,0,0,null,{"$f":"Prop2020DistTar!AF39","v":1842.9367112714808},{"$f":"Prop2020DistTar!AG39","v":0},{"$f":"Prop2020DistTar!AH39","v":1137722434.8069408},{"$f":"Prop2020DistTar!AI39","v":873988483.91062069},{"$f":"Prop2020DistTar!AJ39","v":686083.36790021718},{"$f":"Prop2020DistTar!AK39","v":0},{"$f":"Prop2020DistTar!AL39","v":0},{"$f":"Prop2020DistTar!AM39","v":0},{"$f":"Prop2020DistTar!AN39","v":0},{"$f":"Prop2020DistTar!AO39","v":0},{"$f":"Prop2020DistTar!AP39","v":0},{"$f":"Prop2020DistTar!AQ39","v":0},{"$f":"Prop2020DistTar!AR39","v":0},null,0,0,13880213.704644676,6467514.7809385937,25364502.111271027,0,0,0,0,0,0,0,0,45712230.596854299]
[null,{"$f":"Prop2020DistTar!B40","v":"High Voltage"},"CHV",0,0,1.36,0.7,38.68,0,0,0,0,0,0,0,0,null,{"$f":"Prop2020DistTar!AF40","v":93.927461142717462},{"$f":"Prop2020DistTar!AG40","v":0},{"$f":"Prop2020DistTar!AH40","v":365684368.45994318},{"$f":"Prop2020DistTar!AI40","v":176784509.13387427},{"$f":"Prop2020DistTar!AJ40","v":202579.31528420353},{"$f":"Prop2020DistTar!AK40","v":0},{"$f":"Prop2020DistTar!AL40","v":0},{"$f":"Prop2020DistTar!AM40","v":0},{"$f":"Prop2020DistTar!AN40","v":0},{"$f":"Prop2020DistTar!AO40","v":0},{"$f":"Prop2020DistTar!AP40","v":0},{"$f":"Prop2020DistTar!AQ40","v":0},{"$f":"Prop2020DistTar!AR40","v":0},null,0,0,4973307.4110552277,1237491.5639371197,7835767.9151929924,0,0,0,0,0,0,0,0,14046566.890185341]
[null,{"$f":"Prop2020DistTar!B41","v":"Subtransmission"},"CST",0,0,2.02,0.83,16.37,0,0,0,0,0,0,0,0,null,{"$f":"Prop2020DistTar!AF41","v":5.9999568574023607},{"$f":"Prop2020DistTar!AG41","v":0},{"$f":"Prop2020DistTar!AH41","v":65603250.462830529},{"$f":"Prop2020DistTar!AI41","v":24435184.096122243},{"$f":"Prop2020DistTar!AJ41","v":37985.587976324139},{"$f":"Prop2020DistTar!AK41","v":0},{"$f":"Prop2020DistTar!AL41","v":0},{"$f":"Prop2020DistTar!AM41","v":0},{"$f":"Prop2020DistTar!AN41","v":0},{"$f":"Prop2020DistTar!AO41","v":0},{"$f":"Prop2020DistTar!AP41","v":0},{"$f":"Prop2020DistTar!AQ41","v":0},{"$f":"Prop2020DistTar!AR41","v":0},null,0,0,1325185.6593491766,202812.02799781461,621824.07517242618,0,0,0,0,0,0,0,0,2149821.7625194173]
[null,null,null,null,null,null,null,null,null,null,null,null,null,null,null,null,null,null,null,null,null,null,null,null,null,null,null,null,null,null,null,0,0,0,0,0,0,0,0,0,0,0,0,0,0]
[null,null,null,null,null,null,null,null,null,null,null,null,null,null,null,null,null,null,null,null,null,null,null,null,null,null,null,null,null,null,null,0,0,0,0,0,0,0,0,0,0,0,0,0,0]
[null,null,null,null,null,null,null,null,null,null,null,null,null,null,null,null,null,null,null,null,null,null,null,null,null,null,null,null,null,null,null,0,0,0,0,0,0,0,0,0,0,0,0,0,0]
[null,null,null,null,null,null,null,null,null,null,null,null,null,null,null,null,null,null,null,null,null,null,null,null,null,null,null,null,null,null,null,0,0,0,0,0,0,0,0,0,0,0,0,0,0]
[null,null,null,null,null,null,null,null,null,null,null,null,null,null,null,null,null,null,null,null,null,null,null,null,null,null,null,null,null,null,null,0,0,0,0,0,0,0,0,0,0,0,0,0,0]
[null,null,null,null,null,null,null,null,null,null,null,null,null,null,null,null,null,null,null,null,null,null,null,null,null,null,null,null,null,null,null,0,0,0,0,0,0,0,0,0,0,0,0,0,0]
[null,null,null,null,null,null,null,null,null,null,null,null,null,null,null,null,null,null,null,null,null,null,null,null,null,null,null,null,null,null,null,0,0,0,0,0,0,0,0,0,0,0,0,0,0]
[null,null,null,null,null,null,null,null,null,null,null,null,null,null,null,null,null,null,null,null,null,null,null,null,null,null,null,null,null,null,null,0,0,0,0,0,0,0,0,0,0,0,0,0,0]
[null,null,null,null,null,null,null,null,null,null,null,null,null,null,null,null,null,null,null,null,null,null,null,null,null,null,null,null,null,null,null,0,0,0,0,0,0,0,0,0,0,0,0,0,0]
[null,null,null,null,null,null,null,null,null,null,null,null,null,null,null,null,null,null,null,null,null,null,null,null,null,null,null,null,null,null,null,0,0,0,0,0,0,0,0,0,0,0,0,0,0]
[null,null,null,null,null,null,null,null,null,null,null,null,null,null,null,null,null,null,null,null,null,null,null,null,null,null,null,null,null,null,null,0,0,0,0,0,0,0,0,0,0,0,0,0,0]
[null,null,null,null,null,null,null,null,null,null,null,null,null,null,null,null,null,null,null,null,null,null,null,null,null,null,null,null,null,null,null,0,0,0,0,0,0,0,0,0,0,0,0,0,0]
[null,null,null,null,null,null,null,null,null,null,null,null,null,null,null,null,null,null,null,null,null,null,null,null,null,null,null,null,null,null,null,0,0,0,0,0,0,0,0,0,0,0,0,0,0]
[null,null,null,null,null,null,null,null,null,null,null,null,null,null,null,null,null,null,null,null,null,null,null,null,null,null,null,null,null,null,null,0,{"$f":"E55/100*S55","v":0},0,0,0,0,0,0,0,0,0,0,0,0]
[null,null,null,null,null,null,null,null,null,null,null,null,null,null,null,null,null,null,null,null,null,null,null,null,null,null,null,null,null,null,null,0,0,0,0,0,0,0,0,0,0,0,0,0,0]
[null,null,null,null,null,null,null,null,null,null,null,null,null,null,null,null,null,null,null,null,null,null,null,null,null,null,null,null,null,null,null,0,0,0,0,0,0,0,0,0,0,0,0,0,0]
[null,null,null,null,null,null,null,null,null,null,null,null,null,null,null,null,null,null,null,null,null,null,null,null,null,null,null,null,null,null,null,0,0,0,0,0,0,0,0,0,0,0,0,0,0]
[null,null,null,null,null,null,null,null,null,null,null,null,null,null,null,null,null,null,null,null,null,null,null,null,null,null,null,null,null,null,null,0,0,0,0,0,0,0,0,0,0,0,0,0,0]
[null,null,null,null,null,null,null,null,null,null,null,null,null,null,null,null,null,null,null,null,null,null,null,null,null,null,null,null,null,null,null,0,0,0,0,0,0,0,0,0,0,0,0,0,0]
[null,null,null,null,null,null,null,null,null,null,null,null,null,null,null,null,null,null,null,null,null,null,null,null,null,null,null,null,null,null,null,0,0,0,0,0,0,0,0,0,0,0,0,0,0]
[null,null,null,null,null,null,null,null,null,null,null,null,null,null,null,null,null,null,null,null,null,null,null,null,null,null,null,null,null,null,null,0,0,0,0,0,0,0,0,0,0,0,0,0,0]
[null,null,null,null,null,null,null,null,null,null,null,null,null,null,null,null,null,null,null,null,null,null,null,null,null,null,null,null,null,null,null,0,0,0,0,0,0,0,0,0,0,0,0,0,0]
[null,null,null,null,null,null,null,null,null,null,null,null,null,null,null,null,null,null,null,null,null,null,null,null,null,null,null,null,null,null,null,0,0,0,0,0,0,0,0,0,0,0,0,0,0]
[null,null,null,null,null,null,null,null,null,null,null,null,null,null,null,null,null,null,null,null,null,null,null,null,null,null,null,null,null,null,null,0,0,0,0,0,0,0,0,0,0,0,0,0,0]
[null,null,null,null,null,null,null,null,null,null,null,null,null,null,null,null,null,{"$f":"SUM(R6:R65)","v":370982.67050395434},1290238441.6505878,2601072828.4805541,1862946692.4052012,1004682.6824851158,1220879.3350186595,2094935.6579853231,{"$f":"SUM(Y6:Y65)","v":275792.59768983157},443006.61814874376,375920.20484137774,975665.06010090851,1673557.8542890414,1371448.0724610523,null,{"$f":"SUM(AF6:AF65)","v":0},25695746.402998541,37152118.118415937,15811454.647037908,36923181.607666947,5010387.7359722313,2960517.2196043404,{"$f":"SUM(AM6:AM65)","v":8119.2218717734704},8711.6011459562615,2919.7329618285994,28713.22961435232,32893.207172306218,10630.423476121587,123645393.14793825]

{"sheet":"Est2019TransRev","index":9,"n_rows":66,"n_cols":45,"rows_kept":66,"cut":false,"hidden":false,"merged":[]}
[null,{"$f":"\"Tariff Approval - \"&'Model update'!C3","v":"Tariff Approval - CitiPower"},null,{"$f":"\"Est\"&'Model update'!$C$5-1&\"TransRev\"","v":"Est2019TransRev"}]
[]
[null,{"$f":"\"ESTIMATED \"&'Model update'!C8&\" TRANSMISSION TARIFF REVENUE\"","v":"ESTIMATED 2019 TRANSMISSION TARIFF REVENUE"}]
[null,null,null,{"$f":"\"Current Transmission Tariffs (Pt-1) for \"&'Model update'!$C$8","v":"Current Transmission Tariffs (Pt-1) for 2019"},null,null,null,null,null,null,null,null,null,null,null,null,null,{"$f":"\"Estimated Quantities (Qt-1) for \"&'Model update'!$C$8","v":"Estimated Quantities (Qt-1) for 2019"},null,null,null,null,null,null,null,null,null,null,null,null,null,{"$f":"\"Estimated Revenue (Pt-1 \"&'Model update'!$C$8&\")*(Qt-1 \" &'Model update'!$C$8&\")\"","v":"Estimated Revenue (Pt-1 2019)*(Qt-1 2019)"}]
[null,{"$f":"\"Tariffs \"&'Model update'!C8","v":"Tariffs 2019"},null,{"$f":"Est2019DistRev!D5","v":"CurrentTar\nFixed"},{"$f":"Est2019DistRev!E5","v":"CurrentTar\nAnytime"},{"$f":"Est2019DistRev!F5","v":"CurrentTar\nPkBlk"},{"$f":"Est2019DistRev!G5","v":"CurrentTar\nOPkBlk1"},{"$f":"Est2019DistRev!H5","v":"CurrentTar\nDem kVA"},{"$f":"Est2019DistRev!I5","v":"CurrentTar\nDem kW Sum"},{"$f":"Est2019DistRev!J5","v":"CurrentTar\nDem kW Win"},{"$f":"Est2019DistRev!K5","v":"CurrentTar\nSumBlk1"},{"$f":"Est2019DistRev!L5","v":"CurrentTar\nSumBlk2"},{"$f":"Est2019DistRev!M5","v":"CurrentTar\nSumBlk3"},{"$f":"Est2019DistRev!N5","v":"CurrentTar\nWtrBlk1"},{"$f":"Est2019DistRev!O5","v":"CurrentTar\nWtrBlk2"},{"$f":"Est2019DistRev!P5","v":"CurrentTar\nWtrBlk3"},null,{"$f":"Est2019DistRev!R5","v":"EstVol\nFixed"},{"$f":"Est2019DistRev!S5","v":"EstVol\nAnytime"},{"$f":"Est2019DistRev!T5","v":"EstVol\nPk"},{"$f":"Est2019DistRev!U5","v":"EstVol\nOpk"},{"$f":"Est2019DistRev!V5","v":"EstVol\nDem kVA"},{"$f":"Est2019DistRev!W5","v":"EstVol\nDem kW Sum"},{"$f":"Est2019DistRev!X5","v":"EstVol\nDem kW Win"},{"$f":"Est2019DistRev!Y5","v":"EstVol\nSumBlk1"},{"$f":"Est2019DistRev!Z5","v":"EstVol\nSumBlk2"},{"$f":"Est2019DistRev!AA5","v":"EstVol\nSumBlk3"},{"$f":"Est2019DistRev!AB5","v":"EstVol\nWtrBlk1"},{"$f":"Est2019DistRev!AC5","v":"EstVol\nWtrBlk2"},{"$f":"Est2019DistRev!AD5","v":"EstVol\nWtrBlk3"},null,{"$f":"Est2019DistRev!AF5","v":"EstRev\nFixed"},{"$f":"Est2019DistRev!AG5","v":"EstRev\nAnytime"},{"$f":"Est2019DistRev!AH5","v":"EstRev\nPk"},{"$f":"Est2019DistRev!AI5","v":"EstRev\nOpk"},{"$f":"Est2019DistRev!AJ5","v":"EstRev\nDem kVA"},{"$f":"Est2019DistRev!AK5","v":"EstRev\nDem kW Sum"},{"$f":"Est2019DistRev!AL5","v":"EstRev\nDem kW Win"},{"$f":"Est2019DistRev!AM5","v":"EstRev\nSumBlk1"},{"$f":"Est2019DistRev!AN5","v":"EstRev\nSumBlk2"},{"$f":"Est2019DistRev!AO5","v":"EstRev\nSumBlk3"},{"$f":"Est2019DistRev!AP5","v":"EstRev\nWtrBlk1"},{"$f":"Est2019DistRev!AQ5","v":"EstRev\nWtrBlk2"},{"$f":"Est2019DistRev!AR5","v":"EstRev\nWtrBlk3"},"EstRev\nTotal"]
[null,{"$f":"Est2019DistRev!B6","v":"Residential Single Rate"},null,0,1.82,0,0,0,0,0,0,0,0,0,0,0,null,{"$f":"Est2019DistRev!R6","v":205044.5},{"$f":"Est2019DistRev!S6","v":853857291.19384253},{"$f":"Est2019DistRev!T6","v":0},{"$f":"Est2019DistRev!U6","v":0},{"$f":"Est2019DistRev!V6","v":0},{"$f":"Est2019DistRev!W6","v":0},{"$f":"Est2019DistRev!X6","v":0},{"$f":"Est2019DistRev!Y6","v":0},{"$f":"Est2019DistRev!Z6","v":0},{"$f":"Est2019DistRev!AA6","v":0},{"$f":"Est2019DistRev!AB6","v":0},{"$f":"Est2019DistRev!AC6","v":0},{"$f":"Est2019DistRev!AD6","v":0},null,{"$f":"D6*R6","v":0},{"$f":"E6/100*S6","v":15540202.699727936},0,0,{"$f":"H6*V6","v":0},{"$f":"I6*W6","v":0},0,0,0,{"$f":"M6/100*AA6","v":0},{"$f":"N6/100*AB6","v":0},{"$f":"O6/100*AC6","v":0},{"$f":"P6/100*AD6","v":0},{"$f":"SUM(AF6:AR6)","v":15540202.699727936}]
[null,{"$f":"Est2019DistRev!B7","v":"Residential Single Rate - Bulk"},null,0,0.84,0,0,0,0,0,0,0,0,0,0,0,null,{"$f":"Est2019DistRev!R7","v":31480.916666666668},{"$f":"Est2019DistRev!S7","v":106631799.39951396},{"$f":"Est2019DistRev!T7","v":0},{"$f":"Est2019DistRev!U7","v":0},{"$f":"Est2019DistRev!V7","v":0},{"$f":"Est2019DistRev!W7","v":0},{"$f":"Est2019DistRev!X7","v":0},{"$f":"Est2019DistRev!Y7","v":0},{"$f":"Est2019DistRev!Z7","v":0},{"$f":"Est2019DistRev!AA7","v":0},{"$f":"Est2019DistRev!AB7","v":0},{"$f":"Est2019DistRev!AC7","v":0},{"$f":"Est2019DistRev!AD7","v":0},null,{"$f":"D7*R7","v":0},{"$f":"E7/100*S7","v":895707.11495591723},0,0,{"$f":"H7*V7","v":0},{"$f":"I7*W7","v":0},{"$f":"J7*X7","v":0},0,0,0,0,0,0,{"$f":"SUM(AF7:AR7)","v":895707.11495591723}]
[null,{"$f":"Est2019DistRev!B8","v":"Residential - flexible pricing"},null,0,0,0,0,0,0,0,2.17,1.46,0.56999999999999995,2.17,1.46,0.56999999999999995,null,{"$f":"Est2019DistRev!R8","v":693.41666666666663},{"$f":"Est2019DistRev!S8","v":0},{"$f":"Est2019DistRev!T8","v":0},{"$f":"Est2019DistRev!U8","v":0},{"$f":"Est2019DistRev!V8","v":0},{"$f":"Est2019DistRev!W8","v":0},{"$f":"Est2019DistRev!X8","v":0},{"$f":"Est2019DistRev!Y8","v":205405.52138504913},{"$f":"Est2019DistRev!Z8","v":427210.15422574908},{"$f":"Est2019DistRev!AA8","v":316794.33869324729},{"$f":"Est2019DistRev!AB8","v":740099.69108086498},{"$f":"Est2019DistRev!AC8","v":1539287.2647098142},{"$f":"Est2019DistRev!AD8","v":1141446.3964847678},null,0,0,0,0,0,0,0,4457.2998140555665,6237.2682516959367,1805.7277305515095,16060.16329645477,22473.594064763289,6506.2444599631754,57540.297617484248]
[null,{"$f":"Est2019DistRev!B9","v":"Residential - flexible pricing bulk"},null,0,0,0,0,0,0,0,1.82,1.22,0.48,1.82,1.22,0.48,null,{"$f":"Est2019DistRev!R9","v":90},{"$f":"Est2019DistRev!S9","v":0},{"$f":"Est2019DistRev!T9","v":0},{"$f":"Est2019DistRev!U9","v":0},{"$f":"Est2019DistRev!V9","v":0},{"$f":"Est2019DistRev!W9","v":0},{"$f":"Est2019DistRev!X9","v":0},{"$f":"Est2019DistRev!Y9","v":15231.12129347165},{"$f":"Est2019DistRev!Z9","v":32311.930045800349},{"$f":"Est2019DistRev!AA9","v":23662.580933605816},{"$f":"Est2019DistRev!AB9","v":55378.784196646673},{"$f":"Est2019DistRev!AC9","v":117482.84098758313},{"$f":"Est2019DistRev!AD9","v":86034.700781977721},null,0,0,0,0,0,0,0,277.20640754118403,394.20554655876424,113.58038848130791,1007.8938723789695,1433.2906600485142,412.96656375349301,3639.1434387622326]
[null,{"$f":"Est2019DistRev!B10","v":"Residential Two Rate 5d"},null,0,0,1.95,0.46,0,0,0,0,0,0,0,0,0,null,{"$f":"Est2019DistRev!R10","v":10820.083333333334},{"$f":"Est2019DistRev!S10","v":0},{"$f":"Est2019DistRev!T10","v":35024034.503626086},{"$f":"Est2019DistRev!U10","v":30157186.273130894},{"$f":"Est2019DistRev!V10","v":0},{"$f":"Est2019DistRev!W10","v":0},{"$f":"Est2019DistRev!X10","v":0},{"$f":"Est2019DistRev!Y10","v":0},{"$f":"Est2019DistRev!Z10","v":0},{"$f":"Est2019DistRev!AA10","v":0},{"$f":"Est2019DistRev!AB10","v":0},{"$f":"Est2019DistRev!AC10","v":0},{"$f":"Est2019DistRev!AD10","v":0},null,0,0,682968.67282070871,138723.05685640211,0,0,0,0,0,0,0,0,0,821691.72967711079]
[null,{"$f":"Est2019DistRev!B11","v":"Residential Two Rate 5d - Bulk"},null,0,0,1.72,0.43,0,0,0,0,0,0,0,0,0,null,{"$f":"Est2019DistRev!R11","v":4352.5},{"$f":"Est2019DistRev!S11","v":0},{"$f":"Est2019DistRev!T11","v":12294584.523796603},{"$f":"Est2019DistRev!U11","v":10585730.046510926},{"$f":"Est2019DistRev!V11","v":0},{"$f":"Est2019DistRev!W11","v":0},{"$f":"Est2019DistRev!X11","v":0},{"$f":"Est2019DistRev!Y11","v":0},{"$f":"Est2019DistRev!Z11","v":0},{"$f":"Est2019DistRev!AA11","v":0},{"$f":"Est2019DistRev!AB11","v":0},{"$f":"Est2019DistRev!AC11","v":0},{"$f":"Est2019DistRev!AD11","v":0},null,0,0,211466.85380930157,45518.639199996978,0,0,0,0,0,0,0,0,0,256985.49300929855]
[null,{"$f":"Est2019DistRev!B12","v":"Residential Interval"},null,0,0,1.95,0.46,0,0,0,0,0,0,0,0,0,null,{"$f":"Est2019DistRev!R12","v":17057.166666666668},{"$f":"Est2019DistRev!S12","v":0},{"$f":"Est2019DistRev!T12","v":60669728.275751241},{"$f":"Est2019DistRev!U12","v":52545941.858520873},{"$f":"Est2019DistRev!V12","v":0},{"$f":"Est2019DistRev!W12","v":0},{"$f":"Est2019DistRev!X12","v":0},{"$f":"Est2019DistRev!Y12","v":0},{"$f":"Est2019DistRev!Z12","v":0},{"$f":"Est2019DistRev!AA12","v":0},{"$f":"Est2019DistRev!AB12","v":0},{"$f":"Est2019DistRev!AC12","v":0},{"$f":"Est2019DistRev!AD12","v":0},null,0,0,1183059.7013771492,241711.332549196,0,0,0,0,0,0,0,0,0,1424771.0339263452]
[null,{"$f":"Est2019DistRev!B13","v":"Residential Interval - Bulk"},null,0,0,1.72,0.43,0,0,0,0,0,0,0,0,0,null,{"$f":"Est2019DistRev!R13","v":8658},{"$f":"Est2019DistRev!S13","v":0},{"$f":"Est2019DistRev!T13","v":15600572.119172478},{"$f":"Est2019DistRev!U13","v":14572772.142298045},{"$f":"Est2019DistRev!V13","v":0},{"$f":"Est2019DistRev!W13","v":0},{"$f":"Est2019DistRev!X13","v":0},{"$f":"Est2019DistRev!Y13","v":0},{"$f":"Est2019DistRev!Z13","v":0},{"$f":"Est2019DistRev!AA13","v":0},{"$f":"Est2019DistRev!AB13","v":0},{"$f":"Est2019DistRev!AC13","v":0},{"$f":"Est2019DistRev!AD13","v":0},null,0,0,268329.84044976661,62662.920211881596,0,0,0,0,0,0,0,0,0,330992.76066164818]
[null,{"$f":"Est2019DistRev!B14","v":"Residential Two Rate 5d - Controlled Load"},null,0,0,0,0.35,0,0,0,0,0,0,0,0,0,null,{"$f":"Est2019DistRev!R14","v":9732.6666666666661},{"$f":"Est2019DistRev!S14","v":0},{"$f":"Est2019DistRev!T14","v":0},{"$f":"Est2019DistRev!U14","v":19246331.235837448},{"$f":"Est2019DistRev!V14","v":0},{"$f":"Est2019DistRev!W14","v":0},{"$f":"Est2019DistRev!X14","v":0},{"$f":"Est2019DistRev!Y14","v":0},{"$f":"Est2019DistRev!Z14","v":0},{"$f":"Est2019DistRev!AA14","v":0},{"$f":"Est2019DistRev!AB14","v":0},{"$f":"Est2019DistRev!AC14","v":0},{"$f":"Est2019DistRev!AD14","v":0},null,0,0,0,67362.159325431057,0,0,0,0,0,0,0,0,0,67362.159325431057]
[null,{"$f":"Est2019DistRev!B15","v":"Residential Two Rate 5d - Bulk - Controlled Load"},null,0,0,0,0.28999999999999998,0,0,0,0,0,0,0,0,0,null,{"$f":"Est2019DistRev!R15","v":3683.8333333333335},{"$f":"Est2019DistRev!S15","v":0},{"$f":"Est2019DistRev!T15","v":0},{"$f":"Est2019DistRev!U15","v":7176762.3174721245},{"$f":"Est2019DistRev!V15","v":0},{"$f":"Est2019DistRev!W15","v":0},{"$f":"Est2019DistRev!X15","v":0},{"$f":"Est2019DistRev!Y15","v":0},{"$f":"Est2019DistRev!Z15","v":0},{"$f":"Est2019DistRev!AA15","v":0},{"$f":"Est2019DistRev!AB15","v":0},{"$f":"Est2019DistRev!AC15","v":0},{"$f":"Est2019DistRev!AD15","v":0},null,0,0,0,20812.610720669159,0,0,0,0,0,0,0,0,0,20812.610720669159]
[null,{"$f":"Est2019DistRev!B16","v":"Dedicated Circuit"},null,0,0,0,0.35,0,0,0,0,0,0,0,0,0,null,{"$f":"Est2019DistRev!R16","v":22825.5},{"$f":"Est2019DistRev!S16","v":0},{"$f":"Est2019DistRev!T16","v":0},{"$f":"Est2019DistRev!U16","v":31802481.572760597},{"$f":"Est2019DistRev!V16","v":0},{"$f":"Est2019DistRev!W16","v":0},{"$f":"Est2019DistRev!X16","v":0},{"$f":"Est2019DistRev!Y16","v":0},{"$f":"Est2019DistRev!Z16","v":0},{"$f":"Est2019DistRev!AA16","v":0},{"$f":"Est2019DistRev!AB16","v":0},{"$f":"Est2019DistRev!AC16","v":0},{"$f":"Est2019DistRev!AD16","v":0},null,0,0,0,111308.68550466208,0,0,0,0,0,0,0,0,0,111308.68550466208]
[null,{"$f":"Est2019DistRev!B17","v":"Dedicated Circuit - Bulk"},null,0,0,0,0.28999999999999998,0,0,0,0,0,0,0,0,0,null,{"$f":"Est2019DistRev!R17","v":1105.5833333333333},{"$f":"Est2019DistRev!S17","v":0},{"$f":"Est2019DistRev!T17","v":0},{"$f":"Est2019DistRev!U17","v":2202095.0102876872},{"$f":"Est2019DistRev!V17","v":0},{"$f":"Est2019DistRev!W17","v":0},{"$f":"Est2019DistRev!X17","v":0},{"$f":"Est2019DistRev!Y17","v":0},{"$f":"Est2019DistRev!Z17","v":0},{"$f":"Est2019DistRev!AA17","v":0},{"$f":"Est2019DistRev!AB17","v":0},{"$f":"Est2019DistRev!AC17","v":0},{"$f":"Est2019DistRev!AD17","v":0},null,0,0,0,6386.075529834292,0,0,0,0,0,0,0,0,0,6386.075529834292]
[null,{"$f":"Est2019DistRev!B18","v":"Residential Demand"},null,0,0.57999999999999996,0,0,0,1.42,0.49,0,0,0,0,0,0,null,{"$f":"Est2019DistRev!R18","v":4},{"$f":"Est2019DistRev!S18","v":14863.138507993855},{"$f":"Est2019DistRev!T18","v":0},{"$f":"Est2019DistRev!U18","v":0},{"$f":"Est2019DistRev!V18","v":0},{"$f":"Est2019DistRev!W18","v":50.493333333333332},{"$f":"Est2019DistRev!X18","v":120.75099999999999},{"$f":"Est2019DistRev!Y18","v":0},{"$f":"Est2019DistRev!Z18","v":0},{"$f":"Est2019DistRev!AA18","v":0},{"$f":"Est2019DistRev!AB18","v":0},{"$f":"Est2019DistRev!AC18","v":0},{"$f":"Est2019DistRev!AD18","v":0},null,0,86.206203346364362,0,0,0,71.700533333333325,59.167989999999996,0,0,0,0,0,0,217.0747266796977]
[null,{"$f":"Est2019DistRev!B19","v":"Residential Bulk Demand"},null,0,0.41,0,0,0,1.1100000000000001,0.37,0,0,0,0,0,0,null,{"$f":"Est2019DistRev!R19","v":0},{"$f":"Est2019DistRev!S19","v":0},{"$f":"Est2019DistRev!T19","v":0},{"$f":"Est2019DistRev!U19","v":0},{"$f":"Est2019DistRev!V19","v":0},{"$f":"Est2019DistRev!W19","v":0},{"$f":"Est2019DistRev!X19","v":0},{"$f":"Est2019DistRev!Y19","v":0},{"$f":"Est2019DistRev!Z19","v":0},{"$f":"Est2019DistRev!AA19","v":0},{"$f":"Est2019DistRev!AB19","v":0},{"$f":"Est2019DistRev!AC19","v":0},{"$f":"Est2019DistRev!AD19","v":0},null,0,0,0,0,0,0,0,0,0,0,0,0,0,0]
[null,{"$f":"Est2019DistRev!B20","v":"Non-Residential Single Rate"},null,0,1.99,0,0,0,0,0,0,0,0,0,0,0,null,{"$f":"Est2019DistRev!R20","v":20319.916666666668},{"$f":"Est2019DistRev!S20","v":233254649.14212352},{"$f":"Est2019DistRev!T20","v":0},{"$f":"Est2019DistRev!U20","v":0},{"$f":"Est2019DistRev!V20","v":0},{"$f":"Est2019DistRev!W20","v":0},{"$f":"Est2019DistRev!X20","v":0},{"$f":"Est2019DistRev!Y20","v":0},{"$f":"Est2019DistRev!Z20","v":0},{"$f":"Est2019DistRev!AA20","v":0},{"$f":"Est2019DistRev!AB20","v":0},{"$f":"Est2019DistRev!AC20","v":0},{"$f":"Est2019DistRev!AD20","v":0},null,0,4641767.5179282585,0,0,0,0,0,0,0,0,0,0,0,4641767.5179282585]
[null,{"$f":"Est2019DistRev!B21","v":"Non-Residential Single Rate - Bulk"},null,0,1.61,0,0,0,0,0,0,0,0,0,0,0,null,{"$f":"Est2019DistRev!R21","v":5859.166666666667},{"$f":"Est2019DistRev!S21","v":77076676.161172211},{"$f":"Est2019DistRev!T21","v":0},{"$f":"Est2019DistRev!U21","v":0},{"$f":"Est2019DistRev!V21","v":0},{"$f":"Est2019DistRev!W21","v":0},{"$f":"Est2019DistRev!X21","v":0},{"$f":"Est2019DistRev!Y21","v":0},{"$f":"Est2019DistRev!Z21","v":0},{"$f":"Est2019DistRev!AA21","v":0},{"$f":"Est2019DistRev!AB21","v":0},{"$f":"Est2019DistRev!AC21","v":0},{"$f":"Est2019DistRev!AD21","v":0},null,0,1240934.4861948725,0,0,0,0,0,0,0,0,0,0,0,1240934.4861948725]
[null,{"$f":"Est2019DistRev!B22","v":"Non-Residential Two Rate 5d"},null,0,0,2.99,0.86,0,0,0,0,0,0,0,0,0,null,{"$f":"Est2019DistRev!R22","v":8457.4166666666661},{"$f":"Est2019DistRev!S22","v":0},{"$f":"Est2019DistRev!T22","v":92130994.291198537},{"$f":"Est2019DistRev!U22","v":57478450.853033125},{"$f":"Est2019DistRev!V22","v":0},{"$f":"Est2019DistRev!W22","v":0},{"$f":"Est2019DistRev!X22","v":0},{"$f":"Est2019DistRev!Y22","v":0},{"$f":"Est2019DistRev!Z22","v":0},{"$f":"Est2019DistRev!AA22","v":0},{"$f":"Est2019DistRev!AB22","v":0},{"$f":"Est2019DistRev!AC22","v":0},{"$f":"Est2019DistRev!AD22","v":0},null,0,0,2754716.7293068366,494314.67733608489,0,0,0,0,0,0,0,0,0,3249031.4066429213]
[null,{"$f":"Est2019DistRev!B23","v":"Non-Residential Two Rate 5d - Bulk"},null,0,0,2.33,0.7,0,0,0,0,0,0,0,0,0,null,{"$f":"Est2019DistRev!R23","v":1060},{"$f":"Est2019DistRev!S23","v":0},{"$f":"Est2019DistRev!T23","v":17530830.09980379},{"$f":"Est2019DistRev!U23","v":10374374.192942632},{"$f":"Est2019DistRev!V23","v":0},{"$f":"Est2019DistRev!W23","v":0},{"$f":"Est2019DistRev!X23","v":0},{"$f":"Est2019DistRev!Y23","v":0},{"$f":"Est2019DistRev!Z23","v":0},{"$f":"Est2019DistRev!AA23","v":0},{"$f":"Est2019DistRev!AB23","v":0},{"$f":"Est2019DistRev!AC23","v":0},{"$f":"Est2019DistRev!AD23","v":0},null,0,0,408468.34132542834,72620.619350598412,0,0,0,0,0,0,0,0,0,481088.96067602676]
[null,{"$f":"Est2019DistRev!B24","v":"Non-Residential Interval"},null,0,0,2.99,0.79,0,0,0,0,0,0,0,0,0,null,{"$f":"Est2019DistRev!R24","v":3960.0833333333335},{"$f":"Est2019DistRev!S24","v":0},{"$f":"Est2019DistRev!T24","v":45937500.616836645},{"$f":"Est2019DistRev!U24","v":25953497.24992197},{"$f":"Est2019DistRev!V24","v":0},{"$f":"Est2019DistRev!W24","v":0},{"$f":"Est2019DistRev!X24","v":0},{"$f":"Est2019DistRev!Y24","v":0},{"$f":"Est2019DistRev!Z24","v":0},{"$f":"Est2019DistRev!AA24","v":0},{"$f":"Est2019DistRev!AB24","v":0},{"$f":"Est2019DistRev!AC24","v":0},{"$f":"Est2019DistRev!AD24","v":0},null,0,0,1373531.2684434159,205032.62827438358,0,0,0,0,0,0,0,0,0,1578563.8967177994]
[null,{"$f":"Est2019DistRev!B25","v":"Non-Residential Interval - Bulk"},null,0,0,2.33,0.7,0,0,0,0,0,0,0,0,0,null,{"$f":"Est2019DistRev!R25","v":1945.0833333333333},{"$f":"Est2019DistRev!S25","v":0},{"$f":"Est2019DistRev!T25","v":29899979.142567024},{"$f":"Est2019DistRev!U25","v":15763990.484742738},{"$f":"Est2019DistRev!V25","v":0},{"$f":"Est2019DistRev!W25","v":0},{"$f":"Est2019DistRev!X25","v":0},{"$f":"Est2019DistRev!Y25","v":0},{"$f":"Est2019DistRev!Z25","v":0},{"$f":"Est2019DistRev!AA25","v":0},{"$f":"Est2019DistRev!AB25","v":0},{"$f":"Est2019DistRev!AC25","v":0},{"$f":"Est2019DistRev!AD25","v":0},null,0,0,696669.51402181166,110347.93339319916,0,0,0,0,0,0,0,0,0,807017.44741501077]
[null,{"$f":"Est2019DistRev!B26","v":"Non-Residential Flexible Pricing"},null,0,0,0,0,0,0,0,3.64,2.54,1,3.64,2.54,1,null,{"$f":"Est2019DistRev!R26","v":22},{"$f":"Est2019DistRev!S26","v":0},{"$f":"Est2019DistRev!T26","v":0},{"$f":"Est2019DistRev!U26","v":0},{"$f":"Est2019DistRev!V26","v":0},{"$f":"Est2019DistRev!W26","v":0},{"$f":"Est2019DistRev!X26","v":0},{"$f":"Est2019DistRev!Y26","v":90532.516087055192},{"$f":"Est2019DistRev!Z26","v":28600.363735072933},{"$f":"Est2019DistRev!AA26","v":77063.914568834094},{"$f":"Est2019DistRev!AB26","v":309844.84003868263},{"$f":"Est2019DistRev!AC26","v":97883.893097818145},{"$f":"Est2019DistRev!AD26","v":263748.95246890507},null,0,0,0,0,0,0,0,3295.3835855688089,726.44923887085247,770.63914568834093,11278.352177408047,2486.2508846845808,2637.489524689051,21194.564556909681]
[null,{"$f":"Est2019DistRev!B27","v":"Non-Residential - Flexible Pricing Bulk"},null,0,0,0,0,0,0,0,3.2,2.2400000000000002,0.88,3.2,2.2400000000000002,0.88,null,{"$f":"Est2019DistRev!R27","v":7},{"$f":"Est2019DistRev!S27","v":0},{"$f":"Est2019DistRev!T27","v":0},{"$f":"Est2019DistRev!U27","v":0},{"$f":"Est2019DistRev!V27","v":0},{"$f":"Est2019DistRev!W27","v":0},{"$f":"Est2019DistRev!X27","v":0},{"$f":"Est2019DistRev!Y27","v":103639.4071436401},{"$f":"Est2019DistRev!Z27","v":27419.302376645079},{"$f":"Est2019DistRev!AA27","v":92664.296651991201},{"$f":"Est2019DistRev!AB27","v":277642.32949385105},{"$f":"Est2019DistRev!AC27","v":73454.289200989399},{"$f":"Est2019DistRev!AD27","v":248240.81777803652},null,0,0,0,0,0,0,0,3316.4610285964832,614.1923732368499,815.44581053752256,8884.5545438032332,1645.3760781021629,2184.5191964467217,17460.549030722974]
[null,{"$f":"Est2019DistRev!B28","v":"Non-Residential Two Rate 7d"},null,0,0,2.35,0.79,0,0,0,0,0,0,0,0,0,null,{"$f":"Est2019DistRev!R28","v":2325},{"$f":"Est2019DistRev!S28","v":0},{"$f":"Est2019DistRev!T28","v":39141830.195678435},{"$f":"Est2019DistRev!U28","v":9312690.0588423535},{"$f":"Est2019DistRev!V28","v":0},{"$f":"Est2019DistRev!W28","v":0},{"$f":"Est2019DistRev!X28","v":0},{"$f":"Est2019DistRev!Y28","v":0},{"$f":"Est2019DistRev!Z28","v":0},{"$f":"Est2019DistRev!AA28","v":0},{"$f":"Est2019DistRev!AB28","v":0},{"$f":"Est2019DistRev!AC28","v":0},{"$f":"Est2019DistRev!AD28","v":0},null,0,0,919833.00959844328,73570.251464854606,0,0,0,0,0,0,0,0,0,993403.26106329786]
[null,{"$f":"Est2019DistRev!B29","v":"Non-Residential Two Rate 7d - Bulk"},null,0,0,2.09,0.7,0,0,0,0,0,0,0,0,0,null,{"$f":"Est2019DistRev!R29","v":253.08333333333334},{"$f":"Est2019DistRev!S29","v":0},{"$f":"Est2019DistRev!T29","v":5750711.7271070778},{"$f":"Est2019DistRev!U29","v":1391434.2626145822},{"$f":"Est2019DistRev!V29","v":0},{"$f":"Est2019DistRev!W29","v":0},{"$f":"Est2019DistRev!X29","v":0},{"$f":"Est2019DistRev!Y29","v":0},{"$f":"Est2019DistRev!Z29","v":0},{"$f":"Est2019DistRev!AA29","v":0},{"$f":"Est2019DistRev!AB29","v":0},{"$f":"Est2019DistRev!AC29","v":0},{"$f":"Est2019DistRev!AD29","v":0},null,0,0,120189.87509653791,9740.0398383020747,0,0,0,0,0,0,0,0,0,129929.91493484]
[null,{"$f":"Est2019DistRev!B30","v":"Large Two Rate 7d"},null,0,0,2.99,0.86,0,0,0,0,0,0,0,0,0,null,{"$f":"Est2019DistRev!R30","v":4},{"$f":"Est2019DistRev!S30","v":0},{"$f":"Est2019DistRev!T30","v":168556.17919268721},{"$f":"Est2019DistRev!U30","v":75139.006775332673},{"$f":"Est2019DistRev!V30","v":0},{"$f":"Est2019DistRev!W30","v":0},{"$f":"Est2019DistRev!X30","v":0},{"$f":"Est2019DistRev!Y30","v":0},{"$f":"Est2019DistRev!Z30","v":0},{"$f":"Est2019DistRev!AA30","v":0},{"$f":"Est2019DistRev!AB30","v":0},{"$f":"Est2019DistRev!AC30","v":0},{"$f":"Est2019DistRev!AD30","v":0},null,0,0,5039.8297578613483,646.195458267861,0,0,0,0,0,0,0,0,0,5686.0252161292092]
[null,{"$f":"Est2019DistRev!B31","v":"Non-Residential Demand Tariff"},null,0,1.0900000000000001,0,0,0,3.48,1.1599999999999999,0,0,0,0,0,0,null,{"$f":"Est2019DistRev!R31","v":8},{"$f":"Est2019DistRev!S31","v":717136.61553414329},{"$f":"Est2019DistRev!T31","v":0},{"$f":"Est2019DistRev!U31","v":0},{"$f":"Est2019DistRev!V31","v":0},{"$f":"Est2019DistRev!W31","v":822.73759999999993},{"$f":"Est2019DistRev!X31","v":1909.0406952380938},{"$f":"Est2019DistRev!Y31","v":0},{"$f":"Est2019DistRev!Z31","v":0},{"$f":"Est2019DistRev!AA31","v":0},{"$f":"Est2019DistRev!AB31","v":0},{"$f":"Est2019DistRev!AC31","v":0},{"$f":"Est2019DistRev!AD31","v":0},null,0,7816.7891093221615,0,0,0,2863.1268479999999,2214.4872064761885,0,0,0,0,0,0,12894.40316379835]
[null,{"$f":"Est2019DistRev!B32","v":"Non-Residential Bulk Demand Tariff"},null,0,1,0,0,0,2.78,0.93,0,0,0,0,0,0,null,{"$f":"Est2019DistRev!R32","v":4},{"$f":"Est2019DistRev!S32","v":534045.01309481997},{"$f":"Est2019DistRev!T32","v":0},{"$f":"Est2019DistRev!U32","v":0},{"$f":"Est2019DistRev!V32","v":0},{"$f":"Est2019DistRev!W32","v":411.36879999999996},{"$f":"Est2019DistRev!X32","v":954.5203476190469},{"$f":"Est2019DistRev!Y32","v":0},{"$f":"Est2019DistRev!Z32","v":0},{"$f":"Est2019DistRev!AA32","v":0},{"$f":"Est2019DistRev!AB32","v":0},{"$f":"Est2019DistRev!AC32","v":0},{"$f":"Est2019DistRev!AD32","v":0},null,0,5340.4501309481993,0,0,0,1143.6052639999998,887.7039232857137,0,0,0,0,0,0,7371.7593182339133]
[null,{"$f":"Est2019DistRev!B33","v":"Medium Business Demand"},null,0,0,1.54,1.17,0,2.08,1.04,0,0,0,0,0,0,null,{"$f":"Est2019DistRev!R33","v":4548},{"$f":"Est2019DistRev!S33","v":0},{"$f":"Est2019DistRev!T33","v":365166105.04280096},{"$f":"Est2019DistRev!U33","v":263865736.50712213},{"$f":"Est2019DistRev!V33","v":0},{"$f":"Est2019DistRev!W33","v":730223.77142460272},{"$f":"Est2019DistRev!X33","v":1303005.7703119123},{"$f":"Est2019DistRev!Y33","v":0},{"$f":"Est2019DistRev!Z33","v":0},{"$f":"Est2019DistRev!AA33","v":0},{"$f":"Est2019DistRev!AB33","v":0},{"$f":"Est2019DistRev!AC33","v":0},{"$f":"Est2019DistRev!AD33","v":0},null,{"$f":"D33*R33","v":0},{"$f":"E33/100*S33","v":0},5623558.0176591352,3087229.1171333287,0,1518865.4445631737,1355126.0011243888,0,0,0,0,0,0,{"$f":"SUM(AF33:AR33)","v":11584778.580480028}]
[null,{"$f":"Est2019DistRev!B34","v":"Medium Business Bulk Demand"},null,0,0,1.22,0.97,0,1.67,0.83,0,0,0,0,0,0,null,{"$f":"Est2019DistRev!R34","v":2221.9166666666665},{"$f":"Est2019DistRev!S34","v":0},{"$f":"Est2019DistRev!T34","v":255479964.6620293},{"$f":"Est2019DistRev!U34","v":173141256.77774215},{"$f":"Est2019DistRev!V34","v":0},{"$f":"Est2019DistRev!W34","v":520621.07651825261},{"$f":"Est2019DistRev!X34","v":868527.91268999258},{"$f":"Est2019DistRev!Y34","v":0},{"$f":"Est2019DistRev!Z34","v":0},{"$f":"Est2019DistRev!AA34","v":0},{"$f":"Est2019DistRev!AB34","v":0},{"$f":"Est2019DistRev!AC34","v":0},{"$f":"Est2019DistRev!AD34","v":0},null,0,0,3116855.5688767573,1679470.190744099,0,869437.19778548181,720878.16753269383,0,0,0,0,0,0,6386641.1249390319]
[null,{"$f":"Est2019DistRev!B35","v":"Medium Business Opt-out"},null,0,0,3.04,1.22,0,0,0,0,0,0,0,0,0,null,{"$f":"Est2019DistRev!R35","v":7},{"$f":"Est2019DistRev!S35","v":0},{"$f":"Est2019DistRev!T35","v":296417.25372207933},{"$f":"Est2019DistRev!U35","v":286499.78848501295},{"$f":"Est2019DistRev!V35","v":0},{"$f":"Est2019DistRev!W35","v":0},{"$f":"Est2019DistRev!X35","v":0},{"$f":"Est2019DistRev!Y35","v":0},{"$f":"Est2019DistRev!Z35","v":0},{"$f":"Est2019DistRev!AA35","v":0},{"$f":"Est2019DistRev!AB35","v":0},{"$f":"Est2019DistRev!AC35","v":0},{"$f":"Est2019DistRev!AD35","v":0},null,{"$f":"D35*R35","v":0},{"$f":"E35/100*S35","v":0},{"$f":"F35/100*T35","v":9011.0845131512124},{"$f":"G35/100*U35","v":3495.2974195171578},0,0,0,{"$f":"K35/100*Y35","v":0},{"$f":"L35/100*Z35","v":0},0,0,0,0,{"$f":"SUM(AF35:AR35)","v":12506.38193266837}]
[null,{"$f":"Est2019DistRev!B36","v":"Medium Business Bulk Opt-out"},null,0,0,2.39,1.01,0,0,0,0,0,0,0,0,0,null,{"$f":"Est2019DistRev!R36","v":9},{"$f":"Est2019DistRev!S36","v":0},{"$f":"Est2019DistRev!T36","v":630002.22370326216},{"$f":"Est2019DistRev!U36","v":505149.35184775549},{"$f":"Est2019DistRev!V36","v":0},{"$f":"Est2019DistRev!W36","v":0},{"$f":"Est2019DistRev!X36","v":0},{"$f":"Est2019DistRev!Y36","v":0},{"$f":"Est2019DistRev!Z36","v":0},{"$f":"Est2019DistRev!AA36","v":0},{"$f":"Est2019DistRev!AB36","v":0},{"$f":"Est2019DistRev!AC36","v":0},{"$f":"Est2019DistRev!AD36","v":0},null,{"$f":"D36*R36","v":0},{"$f":"E36/100*S36","v":0},{"$f":"F36/100*T36","v":15057.053146507966},{"$f":"G36/100*U36","v":5102.0084536623299},0,0,0,{"$f":"K36/100*Y36","v":0},{"$f":"L36/100*Z36","v":0},0,0,0,0,{"$f":"SUM(AF36:AR36)","v":20159.061600170295}]
[null,{"$f":"Est2019DistRev!B37","v":"Unmetered Supplies / Public Lighting"},null,0,0,0,0,0,0,0,0,0,0,0,0,0,null,{"$f":"Est2019DistRev!R37","v":4425.5},{"$f":"Est2019DistRev!S37","v":0},{"$f":"Est2019DistRev!T37","v":7430325.4446869912},{"$f":"Est2019DistRev!U37","v":18727648.893831097},{"$f":"Est2019DistRev!V37","v":0},{"$f":"Est2019DistRev!W37","v":0},{"$f":"Est2019DistRev!X37","v":0},{"$f":"Est2019DistRev!Y37","v":0},{"$f":"Est2019DistRev!Z37","v":0},{"$f":"Est2019DistRev!AA37","v":0},{"$f":"Est2019DistRev!AB37","v":0},{"$f":"Est2019DistRev!AC37","v":0},{"$f":"Est2019DistRev!AD37","v":0},null,0,0,0,0,0,0,0,0,0,0,0,0,0,0]
[null,{"$f":"Est2019DistRev!B38","v":"Large low Voltage"},null,0,0,1.0900000000000001,0.67,33.840000000000003,0,0,0,0,0,0,0,0,null,{"$f":"Est2019DistRev!R38","v":334.33333333333331},{"$f":"Est2019DistRev!S38","v":0},{"$f":"Est2019DistRev!T38","v":103909055.5023116},{"$f":"Est2019DistRev!U38","v":80266733.268921614},{"$f":"Est2019DistRev!V38","v":59781.404083333327},{"$f":"Est2019DistRev!W38","v":0},{"$f":"Est2019DistRev!X38","v":0},{"$f":"Est2019DistRev!Y38","v":0},{"$f":"Est2019DistRev!Z38","v":0},{"$f":"Est2019DistRev!AA38","v":0},{"$f":"Est2019DistRev!AB38","v":0},{"$f":"Est2019DistRev!AC38","v":0},{"$f":"Est2019DistRev!AD38","v":0},null,0,0,1132608.7049751964,537787.11290177482,2023002.7141799999,0,0,0,0,0,0,0,0,3693398.5320569715]
[null,{"$f":"Est2019DistRev!B39","v":"Large low Voltage Bulk"},null,0,0,1,0.62,31.13,0,0,0,0,0,0,0,0,null,{"$f":"Est2019DistRev!R39","v":1731.1666666666667},{"$f":"Est2019DistRev!S39","v":0},{"$f":"Est2019DistRev!T39","v":1101354717.2937953},{"$f":"Est2019DistRev!U39","v":829525555.83137512},{"$f":"Est2019DistRev!V39","v":627630.98033333279},{"$f":"Est2019DistRev!W39","v":0},{"$f":"Est2019DistRev!X39","v":0},{"$f":"Est2019DistRev!Y39","v":0},{"$f":"Est2019DistRev!Z39","v":0},{"$f":"Est2019DistRev!AA39","v":0},{"$f":"Est2019DistRev!AB39","v":0},{"$f":"Est2019DistRev!AC39","v":0},{"$f":"Est2019DistRev!AD39","v":0},null,0,0,11013547.172937954,5143058.4461545255,19538152.417776648,0,0,0,0,0,0,0,0,35694758.036869124]
[null,{"$f":"Est2019DistRev!B40","v":"High Voltage"},null,0,0,1.22,0.63,34.6,0,0,0,0,0,0,0,0,null,{"$f":"Est2019DistRev!R40","v":88},{"$f":"Est2019DistRev!S40","v":0},{"$f":"Est2019DistRev!T40","v":345704462.09037936},{"$f":"Est2019DistRev!U40","v":319905209.40701491},{"$f":"Est2019DistRev!V40","v":191921.57674999998},{"$f":"Est2019DistRev!W40","v":0},{"$f":"Est2019DistRev!X40","v":0},{"$f":"Est2019DistRev!Y40","v":0},{"$f":"Est2019DistRev!Z40","v":0},{"$f":"Est2019DistRev!AA40","v":0},{"$f":"Est2019DistRev!AB40","v":0},{"$f":"Est2019DistRev!AC40","v":0},{"$f":"Est2019DistRev!AD40","v":0},null,0,0,4217594.4375026282,2015402.819264194,6640486.5555499997,0,0,0,0,0,0,0,0,12873483.812316822]
[null,{"$f":"Est2019DistRev!B41","v":"Subtransmission"},null,0,0,2,0.83,16.25,0,0,0,0,0,0,0,0,null,{"$f":"Est2019DistRev!R41","v":6},{"$f":"Est2019DistRev!S41","v":0},{"$f":"Est2019DistRev!T41","v":63161450.703406543},{"$f":"Est2019DistRev!U41","v":37546309.7185238},{"$f":"Est2019DistRev!V41","v":35559.269916666664},{"$f":"Est2019DistRev!W41","v":0},{"$f":"Est2019DistRev!X41","v":0},{"$f":"Est2019DistRev!Y41","v":0},{"$f":"Est2019DistRev!Z41","v":0},{"$f":"Est2019DistRev!AA41","v":0},{"$f":"Est2019DistRev!AB41","v":0},{"$f":"Est2019DistRev!AC41","v":0},{"$f":"Est2019DistRev!AD41","v":0},null,0,0,1263229.0140681309,311634.37066374754,577838.1361458333,0,0,0,0,0,0,0,0,2152701.5208777119]
[null,null,null,null,null,null,null,null,null,null,null,null,null,null,null,null,null,null,null,null,null,null,null,null,null,null,null,null,null,null,null,0,0,0,0,0,0,0,0,0,0,0,0,0,0]
[null,null,null,null,null,null,null,null,null,null,null,null,null,null,null,null,null,null,null,null,null,null,null,null,null,null,null,null,null,null,null,0,0,0,0,0,0,0,0,0,0,0,0,0,0]
[null,null,null,null,null,null,null,null,null,null,null,null,null,null,null,null,null,null,null,null,null,null,null,null,null,null,null,null,null,null,null,0,0,0,0,0,0,0,0,0,0,0,0,0,0]
[null,null,null,null,null,null,null,null,null,null,null,null,null,null,null,null,null,null,null,null,null,null,null,null,null,null,null,null,null,null,null,0,0,0,0,0,0,0,0,0,0,0,0,0,0]
[null,null,null,null,null,null,null,null,null,null,null,null,null,null,null,null,null,null,null,null,null,null,null,null,null,null,null,null,null,null,null,0,0,0,0,0,0,0,0,0,0,0,0,0,0]
[null,null,null,null,null,null,null,null,null,null,null,null,null,null,null,null,null,null,null,null,null,null,null,null,null,null,null,null,null,null,null,0,0,0,0,0,0,0,0,0,0,0,0,0,0]
[null,null,null,null,null,null,null,null,null,null,null,null,null,null,null,null,null,null,null,null,null,null,null,null,null,null,null,null,null,null,null,0,0,0,0,0,0,0,0,0,0,0,0,0,0]
[null,null,null,null,null,null,null,null,null,null,null,null,null,null,null,null,null,null,null,null,null,null,null,null,null,null,null,null,null,null,null,0,0,0,0,0,0,0,0,0,0,0,0,0,0]
[null,null,null,null,null,null,null,null,null,null,null,null,null,null,null,null,null,null,null,null,null,null,null,null,null,null,null,null,null,null,null,0,0,0,0,0,0,0,0,0,0,0,0,0,0]
[null,null,null,null,null,null,null,null,null,null,null,null,null,null,null,null,null,null,null,null,null,null,null,null,null,null,null,null,null,null,null,0,0,0,0,0,0,0,0,0,0,0,0,0,0]
[null,null,null,null,null,null,null,null,null,null,null,null,null,null,null,null,null,null,null,null,null,null,null,null,null,null,null,null,null,null,null,0,0,0,0,0,0,0,0,0,0,0,0,0,0]
[null,null,null,null,null,null,null,null,null,null,null,null,null,null,null,null,null,null,null,null,null,null,null,null,null,null,null,null,null,null,null,0,0,0,0,0,0,0,0,0,0,0,0,0,0]
[null,null,null,null,null,null,null,null,null,null,null,null,null,null,null,null,null,null,null,null,null,null,null,null,null,null,null,null,null,null,null,0,0,0,0,0,0,0,0,0,0,0,0,0,0]
[null,null,null,null,null,null,null,null,null,null,null,null,null,null,null,null,null,null,null,null,null,null,null,null,null,null,null,null,null,null,null,0,0,0,0,0,0,0,0,0,0,0,0,0,0]
[null,null,null,null,null,null,null,null,null,null,null,null,null,null,null,null,null,null,null,null,null,null,null,null,null,null,null,null,null,null,null,0,0,0,0,0,0,0,0,0,0,0,0,0,0]
[null,null,null,null,null,null,null,null,null,null,null,null,null,null,null,null,null,null,null,null,null,null,null,null,null,null,null,null,null,null,null,0,0,0,0,0,0,0,0,0,0,0,0,0,0]
[null,null,null,null,null,null,null,null,null,null,null,null,null,null,null,null,null,null,null,null,null,null,null,null,null,null,null,null,null,null,null,0,{"$f":"E58/100*S58","v":0},0,0,0,0,0,0,0,0,0,0,0,0]
[null,null,null,null,null,null,null,null,null,null,null,null,null,null,null,null,null,null,null,null,null,null,null,null,null,null,null,null,null,null,null,0,0,0,0,0,0,0,0,0,0,0,0,0,0]
[null,null,null,null,null,null,null,null,null,null,null,null,null,null,null,null,null,null,null,null,null,null,null,null,null,null,null,null,null,null,null,0,0,0,0,0,0,0,0,0,0,0,0,0,0]
[null,null,null,null,null,null,null,null,null,null,null,null,null,null,null,null,null,null,null,null,null,null,null,null,null,null,null,null,null,null,null,0,0,0,0,0,0,0,0,0,0,0,0,0,0]
[null,null,null,null,null,null,null,null,null,null,null,null,null,null,null,null,null,null,null,null,null,null,null,null,null,null,null,null,null,null,null,0,0,0,0,0,0,0,0,0,0,0,0,0,0]
[null,null,null,null,null,null,null,null,null,null,null,null,null,null,null,null,null,null,null,null,null,null,null,null,null,null,null,null,null,null,null,0,0,0,0,0,0,0,0,0,0,0,0,0,0]
[null,null,null,null,null,null,null,null,null,null,null,null,null,null,null,null,null,null,null,null,null,null,null,null,null,null,null,null,null,null,null,0,0,0,0,0,0,0,0,0,0,0,0,0,0]
[null,null,null,null,null,null,null,null,null,null,null,null,null,null,null,null,null,null,null,null,null,null,null,null,null,null,null,null,null,null,null,0,0,0,0,{"$f":"H65*V65","v":0},0,0,0,0,0,0,0,0,0]
[null,null,null,null,null,null,null,null,null,null,null,null,null,null,null,null,null,{"$f":"SUM(R6:R65)","v":373143.83333333331},1272086460.663789,2597281821.8915658,2012408976.1105549,914893.23108333279,1252129.4476761888,2174517.9950447618,414808.56590921606,515541.75038326747,510185.1308476784,1382965.6448100451,1828108.2879962048,1739470.8675136871,null,{"$f":"SUM(AF6:AF65)","v":0},22331855.264250599,35015734.689686723,14443937.187748613,28779479.82365248,2392381.0749939885,2079165.5277768446,{"$f":"SUM(AM6:AM65)","v":11346.350835762041},7972.1154103624031,3505.3930752586807,37230.963890045023,28038.511687598548,11741.21974485244,105142388.12275313]

{"sheet":"2020TransRevCont","index":10,"n_rows":66,"n_cols":5,"rows_kept":66,"cut":false,"hidden":false,"merged":[]}
[]
[null,{"$f":"\"Tariff Approval - \"&'Model update'!$C$3","v":"Tariff Approval - CitiPower"},{"$f":"'Model update'!$C$5&\"TransRevCont\"","v":"2020TransRevCont"}]
[]
[null," Designated pricing proposal charges (DPPC)"]
[]
[null,"Year (t)",{"$f":"'Model update'!C5","v":2020}]
[]
[null,"Table 1- Compliance with DPPC Revenue Formula"]
[null,"Revenue from designated pricing proposal charges for year t",{"$f":"Prop2020TransTar!AS66","v":123645393.14793825}]
[null,"Total DPPC related payments for year t",{"$f":"C17","v":123657337.89593779}]
[null,null,{"$f":"IF(C9=\"\",\"\",IF(C10>=C9,\"DPPC REVENUE FORMULA COMPLIANT\",\"DPPC REVENUE FORMULA BREACHED\"))","v":"DPPC REVENUE FORMULA COMPLIANT"}]
[]
[null,"Table 2 - Total DPPC related payments for year t"]
[null,"Transmission charges for year t",{"$f":"C24","v":115418459.32378189}]
[null,"DPPC revenue under/over recovery approved",{"$f":"-E60*(1+E58)^0.5","v":8238878.5721558938}]
[null,"Transmission revenue under/over recovery for years 2014 and 2015"]
[null,"Total DPPC related payments for year t",{"$f":"SUM(C14:C16)","v":123657337.89593779}]
[]
[null,"Table 3 - Transmission charges for year t"]
[null,"AEMO (TCt)",84003877.598729998]
[null,"Transmission connection (TCt)",27441984.172690906]
[null,"Embedded generators (Gt)",0]
[null,"Inter-network (Dt)",-3972597.5523609994]
[null,"TC + G - D",{"$f":"C20+C21+C22-C23","v":115418459.32378189}]
[]
[]
[]
[]
[null,"Table 4 - DPPC Recovery Arrangements"]
[null,null,"Year t-2","Year t-1","Year t"]
[null,null,"(actual)","(estimate)","(forecast)"]
[null,null,{"$f":"D32-1","v":2018},{"$f":"E32-1","v":2019},{"$f":"C$6","v":2020}]
[]
[null,"(A) Revenue from designated pricing proposal charges",103354553.35465561,{"$f":"Est2019TransRev!AS66","v":105142388.12275313},{"$f":"C9","v":123645393.14793825}]
[]
[]
[null,"(B) Less Total DPPC related payments =",{"$f":"SUM(C39:C41)","v":99517110.653129593},{"$f":"SUM(D39:D41)","v":108210877.82944301},{"$f":"SUM(E39:E41)","v":115418459.32378189}]
[]
[null,"+ Transmission revenue under/over recovery for years 2014 and 2015"]
[]
[null,"+Transmission charges  =",{"$f":"C42+C43+C44-C45","v":99517110.653129593},{"$f":"D42+D43+D44-D45","v":108210877.82944301},{"$f":"E42+E43+E44-E45","v":115418459.32378189}]
[null,"+AEMO",{"$f":"'TUoS cost audit template'!F7","v":67054039.626625545},75180831.553972512,{"$f":"C20","v":84003877.598729998}]
[null,"+PowerNet ",{"$f":"'TUoS cost audit template'!F18","v":29086396.790909089},26999399.926363636,{"$f":"C21","v":27441984.172690906}]
[null,"+Embedded generators",{"$f":"'TUoS cost audit template'!F64","v":0},0,{"$f":"C22","v":0}]
[null,"-Inter-network",{"$f":"'TUoS cost audit template'!F28","v":-3376674.2355949627},-6030646.3491068631,{"$f":"C23","v":-3972597.5523609994}]
[]
[]
[]
[null,"(A minus B) Under/over recovery of revenue for regulatory year",{"$f":"C34-C37","v":3837442.701526016},{"$f":"D34-D37","v":-3068489.7066898793},{"$f":"E34-E37","v":8226933.8241563588}]
[]
[]
[]
[null,"Table 5 - DPPC Unders and Overs Account"]
[null,null,"Year t-2","Year t-1","Year t"]
[null,null,"(actual)","(estimate)","(forecast)"]
[null,"Calendar year",{"$f":"D56-1","v":2018},{"$f":"E56-1","v":2019},{"$f":"C$6","v":2020}]
[]
[null,"Nominal WACC",{"$f":"(1+'Model update'!$B$47)*(1+'Model update'!$C$28)-1","v":5.5656482586260436E-2},{"$f":"(1+'Model update'!$B$45)*(1+'Model update'!$C$29)-1","v":5.6586211801394226E-2},{"$f":"(1+'Model update'!$B$43)*(1+'Model update'!$C$30)-1","v":5.0085804138458423E-2}]
[]
[null,"Opening balance",-8115330.03678679,{"$f":"C64","v":-4624214.6927913409},{"$f":"D64","v":-8039993.6992765097}]
[null,"Interest on Opening balance",{"$f":"C60*C58","v":-451670.72487418022},{"$f":"D60*D58","v":-261666.79202140996},{"$f":"E60*E58","v":-402689.54969640303}]
[null,"Under/over recovery of revenue for regulatory year",{"$f":"C49","v":3837442.701526016},{"$f":"D49","v":-3068489.7066898793},{"$f":"E49","v":8226933.8241563588}]
[null,"Interest on under/over recovery for regulatory year",{"$f":"C62*((1+C58)^0.5-1)","v":105343.36734361343},{"$f":"D62*((1+D58)^0.5-1)","v":-85622.507773880308},{"$f":"E62*((1+E58)^0.5-1)","v":203509.20025617428}]
[null,"Closing balance of DPPC overs/ (unders) account",{"$f":"SUM(C60:C63)","v":-4624214.6927913409},{"$f":"SUM(D60:D63)","v":-8039993.6992765097},-12240.224560380128]
[]
[null,"The DNSP is expected to achieve a closing balance as close to zero as practicable in its DPPC unders and overs account in each forecast year in its annual pricing proposals in the 2016–20 regulatory control period."]

{"sheet":"TUoS cost audit template","index":11,"n_rows":69,"n_cols":6,"rows_kept":69,"cut":false,"hidden":false,"merged":[[63,1,63,3],[36,1,36,4],[37,1,37,3],[38,1,38,3],[39,1,39,3],[61,1,61,3],[62,1,62,4],[35,1,35,3],[8,1,8,3],[17,1,17,3],[20,1,21,1],[20,2,20,5],[29,1,29,3],[30,1,30,3],[31,1,31,3],[9,1,9,4],[11,1,11,4],[10,1,10,4],[16,1,16,4],[15,1,15,4],[14,1,14,4],[13,1,13,4],[12,1,12,4],[6,1,6,3],[1,1,1,3],[2,1,2,4],[3,1,3,4],[4,1,4,4],[5,1,5,4]]}
[null,{"$f":"\"Tariff Approval - \"&'Model update'!C3","v":"Tariff Approval - CitiPower"}]
[null,"TUOS charges (AEMO)",null,null,null,"t-2 actual"]
[null,"AEMO (Locational & Non-Locational)",null,null,null,27083563.60439682]
[null,"AEMO (TUoS Common Service Charge)",null,null,null,38981041.858895391]
[null,"Grid equalisation",null,null,null,1184000.0333333337]
[null,"Adjustment",null,null,null,-194565.87000000002]
[null,null,null,null,"Total",{"$f":"SUM(F3:F6)","v":67054039.626625545}]
[]
[null,"Transmission connection fees (SPI Powernet)",null,null,null,"t-2 actual"]
[]
[null,"Ausnet Services (Connection)",null,null,null,7971906]
[null,"Ausnet Services (Augmentation)",null,null,null,21114490.790909089]
[]
[]
[]
[]
[]
[null,null,null,null,"Total",{"$f":"SUM(F10:F17)","v":29086396.790909089}]
[]
[null,"Cross boundary network charges (internetwork charges)",null,null,null,"t-2 actual"]
[null,"Distribution Business","Amount (payable)/receivable"]
[null,null,"HV crossings","Subtransmission crossings","TUoS Adjustment","Total"]
[]
[null,"Jemena",null,-3376674.2355949627,null,-3376674.2355949627]
[null,"United Energy",null,0,null,0]
[]
[]
[null,"Total",null,null,null,{"$f":"SUM(F23:F27)","v":-3376674.2355949627}]
[]
[null,"Payments to embedded generators",null,null,null,"t-2 actual"]
[null,"Avoided transmission costs"]
[]
[]
[]
[]
[]
[null,"Total",null,null,null,{"$f":"SUM(F32:F36)","v":0}]
[]
[null,"Avoided TUoS usage charges"]
[]
[]
[]
[]
[]
[]
[]
[]
[]
[]
[]
[]
[]
[]
[]
[]
[]
[]
[]
[]
[]
[]
[]
[null,"Total",null,null,null,{"$f":"SUM(F40:F62)","v":0}]
[null,"Total payments to embedded generators",null,null,null,{"$f":"F63+F37","v":0}]
[]
[null,"Where the following definitions apply"]
[null,"HV Crossings","Payments/Receipts for energy transferred utilising the distributor’s HV and LV line assets."]
[null,"Sub-transmission Crossings","Payments/Receipts for the Sub-transmission assets in shared loops that support each distributor’s Zone Substation capacity to ensure N-1 reliability is maintained."]
[null,"TuoS Adjustment ","Payments/Receipts for the adjustment of TuoS paid by a distributor for energy delivered to another distribution business through a shared loop."]

{"sheet":"Prop2020JSTar","index":12,"n_rows":66,"n_cols":45,"rows_kept":66,"cut":false,"hidden":false,"merged":[]}
[null,{"$f":"\"Tariff Approval - \"&'Model update'!C3","v":"Tariff Approval - CitiPower"},null,{"$f":"\"Prop\"&'Model update'!$C$5&\"JSTar\"","v":"Prop2020JSTar"}]
[]
[null,{"$f":"\"PROPOSED \"&'Model update'!$C$5&\" JURISDICTIONAL SCHEME TARIFFS\"","v":"PROPOSED 2020 JURISDICTIONAL SCHEME TARIFFS"}]
[null,null,null,{"$f":"\"Proposed Jurisdictional scheme Tariffs (Pt) for \"&'Model update'!$C$5","v":"Proposed Jurisdictional scheme Tariffs (Pt) for 2020"},null,null,null,null,null,null,null,null,null,null,null,null,null,{"$f":"\"Forecast Quantities (Qt) for \"&'Model update'!$C$5","v":"Forecast Quantities (Qt) for 2020"},null,null,null,null,null,null,null,null,null,null,null,null,null,{"$f":"\"Forecast Revenue (Pt \"&'Model update'!$C$5&\")*(Qt \" &'Model update'!$C$5&\")\"","v":"Forecast Revenue (Pt 2020)*(Qt 2020)"}]
[null,"Proposed tariff",null,{"$f":"Prop2020DistTar!D5","v":"PropTar\nFixed"},{"$f":"Prop2020DistTar!E5","v":"PropTar\nAnytime"},{"$f":"Prop2020DistTar!F5","v":"PropTar\nPkBlk"},{"$f":"Prop2020DistTar!G5","v":"PropTar\nOPkBlk1"},{"$f":"Prop2020DistTar!H5","v":"PropTar\nDem kVA"},{"$f":"Prop2020DistTar!I5","v":"PropTar\nDem kW Sum"},{"$f":"Prop2020DistTar!J5","v":"PropTar\nDem kW Win"},{"$f":"Prop2020DistTar!K5","v":"PropTar\nSumBlk1"},{"$f":"Prop2020DistTar!L5","v":"PropTar\nSumBlk2"},{"$f":"Prop2020DistTar!M5","v":"PropTar\nSumBlk3"},{"$f":"Prop2020DistTar!N5","v":"PropTar\nWtrBlk1"},{"$f":"Prop2020DistTar!O5","v":"PropTar\nWtrBlk2"},{"$f":"Prop2020DistTar!P5","v":"PropTar\nWtrBlk3"},null,{"$f":"Prop2020DistTar!AF5","v":"FcastVol\nFixed"},{"$f":"Prop2020DistTar!AG5","v":"FcastVol\nAnytime"},{"$f":"Prop2020DistTar!AH5","v":"FcastVol\nPk"},{"$f":"Prop2020DistTar!AI5","v":"FcastVol\nOpk"},{"$f":"Prop2020DistTar!AJ5","v":"FcastVol\nDem kVA"},{"$f":"Prop2020DistTar!AK5","v":"FcastVol\nDem kW Sum"},{"$f":"Prop2020DistTar!AL5","v":"FcastVol\nDem kW Win"},{"$f":"Prop2020DistTar!AM5","v":"FcastVol\nSumBlk1"},{"$f":"Prop2020DistTar!AN5","v":"FcastVol\nSumBlk2"},{"$f":"Prop2020DistTar!AO5","v":"FcastVol\nSumBlk3"},{"$f":"Prop2020DistTar!AP5","v":"FcastVol\nWtrBlk1"},{"$f":"Prop2020DistTar!AQ5","v":"FcastVol\nWtrBlk2"},{"$f":"Prop2020DistTar!AR5","v":"FcastVol\nWtrBlk3"},null,{"$f":"Prop2020DistTar!AT5","v":"PropRev\nFixed"},{"$f":"Prop2020DistTar!AU5","v":"PropRev\nAnytime"},{"$f":"Prop2020DistTar!AV5","v":"PropRev\nPk"},{"$f":"Prop2020DistTar!AW5","v":"PropRev\nOpk"},{"$f":"Prop2020DistTar!AX5","v":"PropRev\nDem kVA"},{"$f":"Prop2020DistTar!AY5","v":"PropRev\nDem kW Sum"},{"$f":"Prop2020DistTar!AZ5","v":"PropRev\nDem kW Win"},{"$f":"Prop2020DistTar!BA5","v":"PropRev\nSumBlk1"},{"$f":"Prop2020DistTar!BB5","v":"PropRev\nSumBlk2"},{"$f":"Prop2020DistTar!BC5","v":"PropRev\nSumBlk3"},{"$f":"Prop2020DistTar!BD5","v":"PropRev\nWtrBlk1"},{"$f":"Prop2020DistTar!BE5","v":"PropRev\nWtrBlk2"},{"$f":"Prop2020DistTar!BF5","v":"PropRev\nWtrBlk3"},"PropRev\nTotal"]
[null,{"$f":"Prop2020DistTar!B6","v":"Residential Single Rate"},"C1R",0,0.06,0,0,0,0,0,0,0,0,0,0,0,null,{"$f":"Prop2020DistTar!AF6","v":206178.44076359438},{"$f":"Prop2020DistTar!AG6","v":848271452.54835963},{"$f":"Prop2020DistTar!AH6","v":0},{"$f":"Prop2020DistTar!AI6","v":0},{"$f":"Prop2020DistTar!AJ6","v":0},{"$f":"Prop2020DistTar!AK6","v":0},{"$f":"Prop2020DistTar!AL6","v":0},{"$f":"Prop2020DistTar!AM6","v":0},{"$f":"Prop2020DistTar!AN6","v":0},{"$f":"Prop2020DistTar!AO6","v":0},{"$f":"Prop2020DistTar!AP6","v":0},{"$f":"Prop2020DistTar!AQ6","v":0},{"$f":"Prop2020DistTar!AR6","v":0},null,{"$f":"D6*R6","v":0},{"$f":"E6/100*S6","v":508962.87152901571},0,0,{"$f":"H6*V6","v":0},{"$f":"I6*W6","v":0},0,0,0,{"$f":"M6/100*AA6","v":0},{"$f":"N6/100*AB6","v":0},{"$f":"O6/100*AC6","v":0},{"$f":"P6/100*AD6","v":0},{"$f":"SUM(AF6:AR6)","v":508962.87152901571}]
[null,{"$f":"Prop2020DistTar!B7","v":"Residential Single Rate - Bulk"},"C1RB",0,0.06,0,0,0,0,0,0,0,0,0,0,0,null,{"$f":"Prop2020DistTar!AF7","v":31089.947611169671},{"$f":"Prop2020DistTar!AG7","v":107478291.59874508},{"$f":"Prop2020DistTar!AH7","v":0},{"$f":"Prop2020DistTar!AI7","v":0},{"$f":"Prop2020DistTar!AJ7","v":0},{"$f":"Prop2020DistTar!AK7","v":0},{"$f":"Prop2020DistTar!AL7","v":0},{"$f":"Prop2020DistTar!AM7","v":0},{"$f":"Prop2020DistTar!AN7","v":0},{"$f":"Prop2020DistTar!AO7","v":0},{"$f":"Prop2020DistTar!AP7","v":0},{"$f":"Prop2020DistTar!AQ7","v":0},{"$f":"Prop2020DistTar!AR7","v":0},null,{"$f":"D7*R7","v":0},{"$f":"E7/100*S7","v":64486.97495924704},0,0,{"$f":"H7*V7","v":0},{"$f":"I7*W7","v":0},{"$f":"J7*X7","v":0},0,0,0,0,0,0,{"$f":"SUM(AF7:AR7)","v":64486.97495924704}]
[null,{"$f":"Prop2020DistTar!B8","v":"Residential - flexible pricing"},"C13R",0,0,0,0,0,0,0,0.06,0.06,0.06,0.06,0.06,0.06,null,{"$f":"Prop2020DistTar!AF8","v":697.78377437315021},{"$f":"Prop2020DistTar!AG8","v":0},{"$f":"Prop2020DistTar!AH8","v":0},{"$f":"Prop2020DistTar!AI8","v":0},{"$f":"Prop2020DistTar!AJ8","v":0},{"$f":"Prop2020DistTar!AK8","v":0},{"$f":"Prop2020DistTar!AL8","v":0},{"$f":"Prop2020DistTar!AM8","v":182885.28410131854},{"$f":"Prop2020DistTar!AN8","v":388824.70973085507},{"$f":"Prop2020DistTar!AO8","v":289537.60955412494},{"$f":"Prop2020DistTar!AP8","v":700283.25333285017},{"$f":"Prop2020DistTar!AQ8","v":1488842.7685394138},{"$f":"Prop2020DistTar!AR8","v":1108664.046848356},null,0,0,0,0,0,0,0,109.73117046079112,233.29482583851302,173.72256573247495,420.16995199971007,893.30566112364818,665.19842810901355,2495.4226032641509]
[null,{"$f":"Prop2020DistTar!B9","v":"Residential - flexible pricing bulk"},"C13RB",0,0,0,0,0,0,0,0.06,0.06,0.06,0.06,0.06,0.06,null,{"$f":"Prop2020DistTar!AF9","v":92.829526834867764},{"$f":"Prop2020DistTar!AG9","v":0},{"$f":"Prop2020DistTar!AH9","v":0},{"$f":"Prop2020DistTar!AI9","v":0},{"$f":"Prop2020DistTar!AJ9","v":0},{"$f":"Prop2020DistTar!AK9","v":0},{"$f":"Prop2020DistTar!AL9","v":0},{"$f":"Prop2020DistTar!AM9","v":15622.006825940556},{"$f":"Prop2020DistTar!AN9","v":33980.313696763908},{"$f":"Prop2020DistTar!AO9","v":24260.31259187479},{"$f":"Prop2020DistTar!AP9","v":58675.496976719034},{"$f":"Prop2020DistTar!AQ9","v":127628.40368701438},{"$f":"Prop2020DistTar!AR9","v":91120.552820082667},null,0,0,0,0,0,0,0,9.3732040955643328,20.388188218058342,14.556187555124874,35.20529818603142,76.577042212208625,54.672331692049596,210.77225195903719]
[null,{"$f":"Prop2020DistTar!B10","v":"Residential Two Rate 5d"},"C2R",0,0,0.06,0.06,0,0,0,0,0,0,0,0,0,null,{"$f":"Prop2020DistTar!AF10","v":10806.12165035933},{"$f":"Prop2020DistTar!AG10","v":0},{"$f":"Prop2020DistTar!AH10","v":33449615.665798429},{"$f":"Prop2020DistTar!AI10","v":29269859.989206955},{"$f":"Prop2020DistTar!AJ10","v":0},{"$f":"Prop2020DistTar!AK10","v":0},{"$f":"Prop2020DistTar!AL10","v":0},{"$f":"Prop2020DistTar!AM10","v":0},{"$f":"Prop2020DistTar!AN10","v":0},{"$f":"Prop2020DistTar!AO10","v":0},{"$f":"Prop2020DistTar!AP10","v":0},{"$f":"Prop2020DistTar!AQ10","v":0},{"$f":"Prop2020DistTar!AR10","v":0},null,0,0,20069.769399479057,17561.91599352417,0,0,0,0,0,0,0,0,0,37631.685393003223]
[null,{"$f":"Prop2020DistTar!B11","v":"Residential Two Rate 5d - Bulk"},"C2RB",0,0,0.06,0.06,0,0,0,0,0,0,0,0,0,null,{"$f":"Prop2020DistTar!AF11","v":4316.8242068076952},{"$f":"Prop2020DistTar!AG11","v":0},{"$f":"Prop2020DistTar!AH11","v":12001250.20375419},{"$f":"Prop2020DistTar!AI11","v":10487452.702396166},{"$f":"Prop2020DistTar!AJ11","v":0},{"$f":"Prop2020DistTar!AK11","v":0},{"$f":"Prop2020DistTar!AL11","v":0},{"$f":"Prop2020DistTar!AM11","v":0},{"$f":"Prop2020DistTar!AN11","v":0},{"$f":"Prop2020DistTar!AO11","v":0},{"$f":"Prop2020DistTar!AP11","v":0},{"$f":"Prop2020DistTar!AQ11","v":0},{"$f":"Prop2020DistTar!AR11","v":0},null,0,0,7200.7501222525134,6292.4716214376986,0,0,0,0,0,0,0,0,0,13493.221743690212]
[null,{"$f":"Prop2020DistTar!B12","v":"Residential Interval"},"C3R",0,0,0.06,0.06,0,0,0,0,0,0,0,0,0,null,{"$f":"Prop2020DistTar!AF12","v":17021.34204511912},{"$f":"Prop2020DistTar!AG12","v":0},{"$f":"Prop2020DistTar!AH12","v":51729844.462038442},{"$f":"Prop2020DistTar!AI12","v":45571765.373176172},{"$f":"Prop2020DistTar!AJ12","v":0},{"$f":"Prop2020DistTar!AK12","v":0},{"$f":"Prop2020DistTar!AL12","v":0},{"$f":"Prop2020DistTar!AM12","v":0},{"$f":"Prop2020DistTar!AN12","v":0},{"$f":"Prop2020DistTar!AO12","v":0},{"$f":"Prop2020DistTar!AP12","v":0},{"$f":"Prop2020DistTar!AQ12","v":0},{"$f":"Prop2020DistTar!AR12","v":0},null,0,0,31037.906677223062,27343.0592239057,0,0,0,0,0,0,0,0,0,58380.965901128759]
[null,{"$f":"Prop2020DistTar!B13","v":"Residential Interval - Bulk"},"C3RB",0,0,0.06,0.06,0,0,0,0,0,0,0,0,0,null,{"$f":"Prop2020DistTar!AF13","v":8705.3498093096259},{"$f":"Prop2020DistTar!AG13","v":0},{"$f":"Prop2020DistTar!AH13","v":15093462.866443299},{"$f":"Prop2020DistTar!AI13","v":14304461.07940924},{"$f":"Prop2020DistTar!AJ13","v":0},{"$f":"Prop2020DistTar!AK13","v":0},{"$f":"Prop2020DistTar!AL13","v":0},{"$f":"Prop2020DistTar!AM13","v":0},{"$f":"Prop2020DistTar!AN13","v":0},{"$f":"Prop2020DistTar!AO13","v":0},{"$f":"Prop2020DistTar!AP13","v":0},{"$f":"Prop2020DistTar!AQ13","v":0},{"$f":"Prop2020DistTar!AR13","v":0},null,0,0,9056.077719865978,8582.6766476455432,0,0,0,0,0,0,0,0,0,17638.754367511523]
[null,{"$f":"Prop2020DistTar!B14","v":"Residential Two Rate 5d - Controlled Load"},"C2ROP",0,0,0,0,0,0,0,0,0,0,0,0,0,null,{"$f":"Prop2020DistTar!AF14","v":0},{"$f":"Prop2020DistTar!AG14","v":0},{"$f":"Prop2020DistTar!AH14","v":0},{"$f":"Prop2020DistTar!AI14","v":0},{"$f":"Prop2020DistTar!AJ14","v":0},{"$f":"Prop2020DistTar!AK14","v":0},{"$f":"Prop2020DistTar!AL14","v":0},{"$f":"Prop2020DistTar!AM14","v":0},{"$f":"Prop2020DistTar!AN14","v":0},{"$f":"Prop2020DistTar!AO14","v":0},{"$f":"Prop2020DistTar!AP14","v":0},{"$f":"Prop2020DistTar!AQ14","v":0},{"$f":"Prop2020DistTar!AR14","v":0},null,0,0,0,0,0,0,0,0,0,0,0,0,0,0]
[null,{"$f":"Prop2020DistTar!B15","v":"Residential Two Rate 5d - Bulk - Controlled Load"},"C2RBOP",0,0,0,0,0,0,0,0,0,0,0,0,0,null,{"$f":"Prop2020DistTar!AF15","v":0},{"$f":"Prop2020DistTar!AG15","v":0},{"$f":"Prop2020DistTar!AH15","v":0},{"$f":"Prop2020DistTar!AI15","v":0},{"$f":"Prop2020DistTar!AJ15","v":0},{"$f":"Prop2020DistTar!AK15","v":0},{"$f":"Prop2020DistTar!AL15","v":0},{"$f":"Prop2020DistTar!AM15","v":0},{"$f":"Prop2020DistTar!AN15","v":0},{"$f":"Prop2020DistTar!AO15","v":0},{"$f":"Prop2020DistTar!AP15","v":0},{"$f":"Prop2020DistTar!AQ15","v":0},{"$f":"Prop2020DistTar!AR15","v":0},null,0,0,0,0,0,0,0,0,0,0,0,0,0,0]
[null,{"$f":"Prop2020DistTar!B16","v":"Dedicated Circuit"},"CDS",0,0,0,0.06,0,0,0,0,0,0,0,0,0,null,{"$f":"Prop2020DistTar!AF16","v":32498.745053272465},{"$f":"Prop2020DistTar!AG16","v":0},{"$f":"Prop2020DistTar!AH16","v":0},{"$f":"Prop2020DistTar!AI16","v":50045800.11975988},{"$f":"Prop2020DistTar!AJ16","v":0},{"$f":"Prop2020DistTar!AK16","v":0},{"$f":"Prop2020DistTar!AL16","v":0},{"$f":"Prop2020DistTar!AM16","v":0},{"$f":"Prop2020DistTar!AN16","v":0},{"$f":"Prop2020DistTar!AO16","v":0},{"$f":"Prop2020DistTar!AP16","v":0},{"$f":"Prop2020DistTar!AQ16","v":0},{"$f":"Prop2020DistTar!AR16","v":0},null,0,0,0,30027.480071855924,0,0,0,0,0,0,0,0,0,30027.480071855924]
[null,{"$f":"Prop2020DistTar!B17","v":"Dedicated Circuit - Bulk"},"CDSB",0,0,0,0.06,0,0,0,0,0,0,0,0,0,null,{"$f":"Prop2020DistTar!AF17","v":5581.4193302891908},{"$f":"Prop2020DistTar!AG17","v":0},{"$f":"Prop2020DistTar!AH17","v":0},{"$f":"Prop2020DistTar!AI17","v":9263135.8289495241},{"$f":"Prop2020DistTar!AJ17","v":0},{"$f":"Prop2020DistTar!AK17","v":0},{"$f":"Prop2020DistTar!AL17","v":0},{"$f":"Prop2020DistTar!AM17","v":0},{"$f":"Prop2020DistTar!AN17","v":0},{"$f":"Prop2020DistTar!AO17","v":0},{"$f":"Prop2020DistTar!AP17","v":0},{"$f":"Prop2020DistTar!AQ17","v":0},{"$f":"Prop2020DistTar!AR17","v":0},null,0,0,0,5557.8814973697135,0,0,0,0,0,0,0,0,0,5557.8814973697135]
[null,{"$f":"Prop2020DistTar!B18","v":"Residential Demand"},"CR",0,0.06,0,0,0,0,0,0,0,0,0,0,0,null,{"$f":"Prop2020DistTar!AF18","v":8.4225614876243853},{"$f":"Prop2020DistTar!AG18","v":49160.9218844563},{"$f":"Prop2020DistTar!AH18","v":0},{"$f":"Prop2020DistTar!AI18","v":0},{"$f":"Prop2020DistTar!AJ18","v":0},{"$f":"Prop2020DistTar!AK18","v":91.993203745090227},{"$f":"Prop2020DistTar!AL18","v":214.72009856865083},{"$f":"Prop2020DistTar!AM18","v":0},{"$f":"Prop2020DistTar!AN18","v":0},{"$f":"Prop2020DistTar!AO18","v":0},{"$f":"Prop2020DistTar!AP18","v":0},{"$f":"Prop2020DistTar!AQ18","v":0},{"$f":"Prop2020DistTar!AR18","v":0},null,0,29.496553130673778,0,0,0,0,0,0,0,0,0,0,0,29.496553130673778]
[null,{"$f":"Prop2020DistTar!B19","v":"Residential Bulk Demand"},"CRB",0,0.06,0,0,0,0,0,0,0,0,0,0,0,null,{"$f":"Prop2020DistTar!AF19","v":1.9569063180827886},{"$f":"Prop2020DistTar!AG19","v":11446.587208253419},{"$f":"Prop2020DistTar!AH19","v":0},{"$f":"Prop2020DistTar!AI19","v":0},{"$f":"Prop2020DistTar!AJ19","v":0},{"$f":"Prop2020DistTar!AK19","v":18.995011764705886},{"$f":"Prop2020DistTar!AL19","v":47.503513725490194},{"$f":"Prop2020DistTar!AM19","v":0},{"$f":"Prop2020DistTar!AN19","v":0},{"$f":"Prop2020DistTar!AO19","v":0},{"$f":"Prop2020DistTar!AP19","v":0},{"$f":"Prop2020DistTar!AQ19","v":0},{"$f":"Prop2020DistTar!AR19","v":0},null,0,6.8679523249520509,0,0,0,0,0,0,0,0,0,0,0,6.8679523249520509]
[null,{"$f":"Prop2020DistTar!B20","v":"Non-Residential Single Rate"},"C1G",0,0.05,0,0,0,0,0,0,0,0,0,0,0,null,{"$f":"Prop2020DistTar!AF20","v":19278.928459938834},{"$f":"Prop2020DistTar!AG20","v":234414508.13361585},{"$f":"Prop2020DistTar!AH20","v":0},{"$f":"Prop2020DistTar!AI20","v":0},{"$f":"Prop2020DistTar!AJ20","v":0},{"$f":"Prop2020DistTar!AK20","v":0},{"$f":"Prop2020DistTar!AL20","v":0},{"$f":"Prop2020DistTar!AM20","v":0},{"$f":"Prop2020DistTar!AN20","v":0},{"$f":"Prop2020DistTar!AO20","v":0},{"$f":"Prop2020DistTar!AP20","v":0},{"$f":"Prop2020DistTar!AQ20","v":0},{"$f":"Prop2020DistTar!AR20","v":0},null,0,117207.25406680793,0,0,0,0,0,0,0,0,0,0,0,117207.25406680793]
[null,{"$f":"Prop2020DistTar!B21","v":"Non-Residential Single Rate - Bulk"},"C1GB",0,0.05,0,0,0,0,0,0,0,0,0,0,0,null,{"$f":"Prop2020DistTar!AF21","v":5769.6090324287434},{"$f":"Prop2020DistTar!AG21","v":81668548.051084116},{"$f":"Prop2020DistTar!AH21","v":0},{"$f":"Prop2020DistTar!AI21","v":0},{"$f":"Prop2020DistTar!AJ21","v":0},{"$f":"Prop2020DistTar!AK21","v":0},{"$f":"Prop2020DistTar!AL21","v":0},{"$f":"Prop2020DistTar!AM21","v":0},{"$f":"Prop2020DistTar!AN21","v":0},{"$f":"Prop2020DistTar!AO21","v":0},{"$f":"Prop2020DistTar!AP21","v":0},{"$f":"Prop2020DistTar!AQ21","v":0},{"$f":"Prop2020DistTar!AR21","v":0},null,0,40834.274025542058,0,0,0,0,0,0,0,0,0,0,0,40834.274025542058]
[null,{"$f":"Prop2020DistTar!B22","v":"Non-Residential Two Rate 5d"},"C2G5",0,0,0.05,0.05,0,0,0,0,0,0,0,0,0,null,{"$f":"Prop2020DistTar!AF22","v":6175.6551246567678},{"$f":"Prop2020DistTar!AG22","v":0},{"$f":"Prop2020DistTar!AH22","v":70438600.5182468},{"$f":"Prop2020DistTar!AI22","v":44830727.118458346},{"$f":"Prop2020DistTar!AJ22","v":0},{"$f":"Prop2020DistTar!AK22","v":0},{"$f":"Prop2020DistTar!AL22","v":0},{"$f":"Prop2020DistTar!AM22","v":0},{"$f":"Prop2020DistTar!AN22","v":0},{"$f":"Prop2020DistTar!AO22","v":0},{"$f":"Prop2020DistTar!AP22","v":0},{"$f":"Prop2020DistTar!AQ22","v":0},{"$f":"Prop2020DistTar!AR22","v":0},null,0,0,35219.300259123404,22415.363559229172,0,0,0,0,0,0,0,0,0,57634.663818352579]
[null,{"$f":"Prop2020DistTar!B23","v":"Non-Residential Two Rate 5d - Bulk"},"C2G5B",0,0,0.05,0.05,0,0,0,0,0,0,0,0,0,null,{"$f":"Prop2020DistTar!AF23","v":999.43191263014216},{"$f":"Prop2020DistTar!AG23","v":0},{"$f":"Prop2020DistTar!AH23","v":16508026.378642861},{"$f":"Prop2020DistTar!AI23","v":10058974.835898034},{"$f":"Prop2020DistTar!AJ23","v":0},{"$f":"Prop2020DistTar!AK23","v":0},{"$f":"Prop2020DistTar!AL23","v":0},{"$f":"Prop2020DistTar!AM23","v":0},{"$f":"Prop2020DistTar!AN23","v":0},{"$f":"Prop2020DistTar!AO23","v":0},{"$f":"Prop2020DistTar!AP23","v":0},{"$f":"Prop2020DistTar!AQ23","v":0},{"$f":"Prop2020DistTar!AR23","v":0},null,0,0,8254.0131893214311,5029.4874179490171,0,0,0,0,0,0,0,0,0,13283.500607270449]
[null,{"$f":"Prop2020DistTar!B24","v":"Non-Residential Interval"},"C3G",0,0,0.05,0.05,0,0,0,0,0,0,0,0,0,null,{"$f":"Prop2020DistTar!AF24","v":3789.6292029166912},{"$f":"Prop2020DistTar!AG24","v":0},{"$f":"Prop2020DistTar!AH24","v":44801539.356732354},{"$f":"Prop2020DistTar!AI24","v":25848586.997369338},{"$f":"Prop2020DistTar!AJ24","v":0},{"$f":"Prop2020DistTar!AK24","v":0},{"$f":"Prop2020DistTar!AL24","v":0},{"$f":"Prop2020DistTar!AM24","v":0},{"$f":"Prop2020DistTar!AN24","v":0},{"$f":"Prop2020DistTar!AO24","v":0},{"$f":"Prop2020DistTar!AP24","v":0},{"$f":"Prop2020DistTar!AQ24","v":0},{"$f":"Prop2020DistTar!AR24","v":0},null,0,0,22400.769678366178,12924.293498684669,0,0,0,0,0,0,0,0,0,35325.063177050848]
[null,{"$f":"Prop2020DistTar!B25","v":"Non-Residential Interval - Bulk"},"C3GB",0,0,0.05,0.05,0,0,0,0,0,0,0,0,0,null,{"$f":"Prop2020DistTar!AF25","v":1768.9772717301021},{"$f":"Prop2020DistTar!AG25","v":0},{"$f":"Prop2020DistTar!AH25","v":27824537.942965478},{"$f":"Prop2020DistTar!AI25","v":14553393.117495544},{"$f":"Prop2020DistTar!AJ25","v":0},{"$f":"Prop2020DistTar!AK25","v":0},{"$f":"Prop2020DistTar!AL25","v":0},{"$f":"Prop2020DistTar!AM25","v":0},{"$f":"Prop2020DistTar!AN25","v":0},{"$f":"Prop2020DistTar!AO25","v":0},{"$f":"Prop2020DistTar!AP25","v":0},{"$f":"Prop2020DistTar!AQ25","v":0},{"$f":"Prop2020DistTar!AR25","v":0},null,0,0,13912.268971482739,7276.6965587477725,0,0,0,0,0,0,0,0,0,21188.965530230511]
[null,{"$f":"Prop2020DistTar!B26","v":"Non-Residential Flexible Pricing"},"C14G",0,0,0,0,0,0,0,0.05,0.05,0.05,0.05,0.05,0.05,null,{"$f":"Prop2020DistTar!AF26","v":20.735050198175649},{"$f":"Prop2020DistTar!AG26","v":0},{"$f":"Prop2020DistTar!AH26","v":0},{"$f":"Prop2020DistTar!AI26","v":0},{"$f":"Prop2020DistTar!AJ26","v":0},{"$f":"Prop2020DistTar!AK26","v":0},{"$f":"Prop2020DistTar!AL26","v":0},{"$f":"Prop2020DistTar!AM26","v":54335.809564896466},{"$f":"Prop2020DistTar!AN26","v":14519.639818854528},{"$f":"Prop2020DistTar!AO26","v":41864.179794472628},{"$f":"Prop2020DistTar!AP26","v":174859.38124809813},{"$f":"Prop2020DistTar!AQ26","v":46726.003624512079},{"$f":"Prop2020DistTar!AR26","v":134724.12823034308},null,0,0,0,0,0,0,0,27.167904782448232,7.2598199094272644,20.932089897236313,87.429690624049073,23.363001812256041,67.362064115171535,233.51457114058846]
[null,{"$f":"Prop2020DistTar!B27","v":"Non-Residential - Flexible Pricing Bulk"},"C14GB",0,0,0,0,0,0,0,0.05,0.05,0.05,0.05,0.05,0.05,null,{"$f":"Prop2020DistTar!AF27","v":0.91833100642885634},{"$f":"Prop2020DistTar!AG27","v":0},{"$f":"Prop2020DistTar!AH27","v":0},{"$f":"Prop2020DistTar!AI27","v":0},{"$f":"Prop2020DistTar!AJ27","v":0},{"$f":"Prop2020DistTar!AK27","v":0},{"$f":"Prop2020DistTar!AL27","v":0},{"$f":"Prop2020DistTar!AM27","v":22949.497197675988},{"$f":"Prop2020DistTar!AN27","v":5681.9549022702613},{"$f":"Prop2020DistTar!AO27","v":20258.102900905364},{"$f":"Prop2020DistTar!AP27","v":41846.928543241178},{"$f":"Prop2020DistTar!AQ27","v":10360.678438101071},{"$f":"Prop2020DistTar!AR27","v":36939.344562270453},null,0,0,0,0,0,0,0,11.474748598837994,2.8409774511351307,10.129051450452682,20.923464271620588,5.180339219050536,18.469672281135228,69.018253272232158]
[null,{"$f":"Prop2020DistTar!B28","v":"Non-Residential Two Rate 7d"},"C2G7",0,0,0.05,0.05,0,0,0,0,0,0,0,0,0,null,{"$f":"Prop2020DistTar!AF28","v":2306.9483847452143},{"$f":"Prop2020DistTar!AG28","v":0},{"$f":"Prop2020DistTar!AH28","v":38369324.717720643},{"$f":"Prop2020DistTar!AI28","v":9290402.2119519673},{"$f":"Prop2020DistTar!AJ28","v":0},{"$f":"Prop2020DistTar!AK28","v":0},{"$f":"Prop2020DistTar!AL28","v":0},{"$f":"Prop2020DistTar!AM28","v":0},{"$f":"Prop2020DistTar!AN28","v":0},{"$f":"Prop2020DistTar!AO28","v":0},{"$f":"Prop2020DistTar!AP28","v":0},{"$f":"Prop2020DistTar!AQ28","v":0},{"$f":"Prop2020DistTar!AR28","v":0},null,0,0,19184.662358860322,4645.2011059759834,0,0,0,0,0,0,0,0,0,23829.863464836304]
[null,{"$f":"Prop2020DistTar!B29","v":"Non-Residential Two Rate 7d - Bulk"},"C2G7B",0,0,0.05,0.05,0,0,0,0,0,0,0,0,0,null,{"$f":"Prop2020DistTar!AF29","v":223.54159787790852},{"$f":"Prop2020DistTar!AG29","v":0},{"$f":"Prop2020DistTar!AH29","v":4879506.8354705516},{"$f":"Prop2020DistTar!AI29","v":1213336.752724601},{"$f":"Prop2020DistTar!AJ29","v":0},{"$f":"Prop2020DistTar!AK29","v":0},{"$f":"Prop2020DistTar!AL29","v":0},{"$f":"Prop2020DistTar!AM29","v":0},{"$f":"Prop2020DistTar!AN29","v":0},{"$f":"Prop2020DistTar!AO29","v":0},{"$f":"Prop2020DistTar!AP29","v":0},{"$f":"Prop2020DistTar!AQ29","v":0},{"$f":"Prop2020DistTar!AR29","v":0},null,0,0,2439.7534177352759,606.66837636230048,0,0,0,0,0,0,0,0,0,3046.4217940975764]
[null,{"$f":"Prop2020DistTar!B30","v":"Large Two Rate 7d"},"C2L7",0,0,0.05,0.05,0,0,0,0,0,0,0,0,0,null,{"$f":"Prop2020DistTar!AF30","v":1},{"$f":"Prop2020DistTar!AG30","v":0},{"$f":"Prop2020DistTar!AH30","v":43593.813751616013},{"$f":"Prop2020DistTar!AI30","v":17808.880496742764},{"$f":"Prop2020DistTar!AJ30","v":0},{"$f":"Prop2020DistTar!AK30","v":0},{"$f":"Prop2020DistTar!AL30","v":0},{"$f":"Prop2020DistTar!AM30","v":0},{"$f":"Prop2020DistTar!AN30","v":0},{"$f":"Prop2020DistTar!AO30","v":0},{"$f":"Prop2020DistTar!AP30","v":0},{"$f":"Prop2020DistTar!AQ30","v":0},{"$f":"Prop2020DistTar!AR30","v":0},null,0,0,21.796906875808006,8.9044402483713814,0,0,0,0,0,0,0,0,0,30.701347124179385]
[null,{"$f":"Prop2020DistTar!B31","v":"Non-Residential Demand Tariff"},"CG",0,0.05,0,0,0,0,0,0,0,0,0,0,0,null,{"$f":"Prop2020DistTar!AF31","v":66.714761999582805},{"$f":"Prop2020DistTar!AG31","v":5507232.35853214},{"$f":"Prop2020DistTar!AH31","v":0},{"$f":"Prop2020DistTar!AI31","v":0},{"$f":"Prop2020DistTar!AJ31","v":0},{"$f":"Prop2020DistTar!AK31","v":1303.8375558307982},{"$f":"Prop2020DistTar!AL31","v":2992.2591172023403},{"$f":"Prop2020DistTar!AM31","v":0},{"$f":"Prop2020DistTar!AN31","v":0},{"$f":"Prop2020DistTar!AO31","v":0},{"$f":"Prop2020DistTar!AP31","v":0},{"$f":"Prop2020DistTar!AQ31","v":0},{"$f":"Prop2020DistTar!AR31","v":0},null,0,2753.61617926607,0,0,0,0,0,0,0,0,0,0,0,2753.61617926607]
[null,{"$f":"Prop2020DistTar!B32","v":"Non-Residential Bulk Demand Tariff"},"CGB",0,0.05,0,0,0,0,0,0,0,0,0,0,0,null,{"$f":"Prop2020DistTar!AF32","v":148.11154188428057},{"$f":"Prop2020DistTar!AG32","v":12837801.451158172},{"$f":"Prop2020DistTar!AH32","v":0},{"$f":"Prop2020DistTar!AI32","v":0},{"$f":"Prop2020DistTar!AJ32","v":0},{"$f":"Prop2020DistTar!AK32","v":2650.3625109708137},{"$f":"Prop2020DistTar!AL32","v":6065.86859366513},{"$f":"Prop2020DistTar!AM32","v":0},{"$f":"Prop2020DistTar!AN32","v":0},{"$f":"Prop2020DistTar!AO32","v":0},{"$f":"Prop2020DistTar!AP32","v":0},{"$f":"Prop2020DistTar!AQ32","v":0},{"$f":"Prop2020DistTar!AR32","v":0},null,0,6418.9007255790857,0,0,0,0,0,0,0,0,0,0,0,6418.9007255790857]
[null,{"$f":"Prop2020DistTar!B33","v":"Medium Business Demand"},"CMG",0,0,0.04,0.04,0,0,0,0,0,0,0,0,0,null,{"$f":"Prop2020DistTar!AF33","v":4403.4018551523304},{"$f":"Prop2020DistTar!AG33","v":0},{"$f":"Prop2020DistTar!AH33","v":339952679.85718626},{"$f":"Prop2020DistTar!AI33","v":250709652.79220656},{"$f":"Prop2020DistTar!AJ33","v":0},{"$f":"Prop2020DistTar!AK33","v":724859.65449187229},{"$f":"Prop2020DistTar!AL33","v":1273831.0316474377},{"$f":"Prop2020DistTar!AM33","v":0},{"$f":"Prop2020DistTar!AN33","v":0},{"$f":"Prop2020DistTar!AO33","v":0},{"$f":"Prop2020DistTar!AP33","v":0},{"$f":"Prop2020DistTar!AQ33","v":0},{"$f":"Prop2020DistTar!AR33","v":0},null,{"$f":"D33*R33","v":0},{"$f":"E33/100*S33","v":0},135981.07194287452,100283.86111688263,0,0,0,0,0,0,0,0,0,{"$f":"SUM(AF33:AR33)","v":236264.93305975717}]
[null,{"$f":"Prop2020DistTar!B34","v":"Medium Business Bulk Demand"},"CMGB",0,0,0.04,0.04,0,0,0,0,0,0,0,0,0,null,{"$f":"Prop2020DistTar!AF34","v":2080.7408836331665},{"$f":"Prop2020DistTar!AG34","v":0},{"$f":"Prop2020DistTar!AH34","v":235523158.73965827},{"$f":"Prop2020DistTar!AI34","v":157971528.62473217},{"$f":"Prop2020DistTar!AJ34","v":0},{"$f":"Prop2020DistTar!AK34","v":491954.4922444757},{"$f":"Prop2020DistTar!AL34","v":811784.27501472388},{"$f":"Prop2020DistTar!AM34","v":0},{"$f":"Prop2020DistTar!AN34","v":0},{"$f":"Prop2020DistTar!AO34","v":0},{"$f":"Prop2020DistTar!AP34","v":0},{"$f":"Prop2020DistTar!AQ34","v":0},{"$f":"Prop2020DistTar!AR34","v":0},null,0,0,94209.263495863313,63188.611449892873,0,0,0,0,0,0,0,0,0,157397.87494575619]
[null,{"$f":"Prop2020DistTar!B35","v":"Medium Business Opt-out"},"CMGO",0,0,0.04,0.04,0,0,0,0,0,0,0,0,0,null,{"$f":"Prop2020DistTar!AF35","v":41.341540163281572},{"$f":"Prop2020DistTar!AG35","v":0},{"$f":"Prop2020DistTar!AH35","v":2405969.966489397},{"$f":"Prop2020DistTar!AI35","v":2106689.7659207499},{"$f":"Prop2020DistTar!AJ35","v":0},{"$f":"Prop2020DistTar!AK35","v":0},{"$f":"Prop2020DistTar!AL35","v":0},{"$f":"Prop2020DistTar!AM35","v":0},{"$f":"Prop2020DistTar!AN35","v":0},{"$f":"Prop2020DistTar!AO35","v":0},{"$f":"Prop2020DistTar!AP35","v":0},{"$f":"Prop2020DistTar!AQ35","v":0},{"$f":"Prop2020DistTar!AR35","v":0},null,{"$f":"D35*R35","v":0},{"$f":"E35/100*S35","v":0},{"$f":"F35/100*T35","v":962.38798659575889},{"$f":"G35/100*U35","v":842.67590636829993},0,0,0,{"$f":"K35/100*Y35","v":0},{"$f":"L35/100*Z35","v":0},0,0,0,0,{"$f":"SUM(AF35:AR35)","v":1805.0638929640588}]
[null,{"$f":"Prop2020DistTar!B36","v":"Medium Business Bulk Opt-out"},"CMGBO",0,0,0.04,0.04,0,0,0,0,0,0,0,0,0,null,{"$f":"Prop2020DistTar!AF36","v":81.750047252346079},{"$f":"Prop2020DistTar!AG36","v":0},{"$f":"Prop2020DistTar!AH36","v":5074192.3018221091},{"$f":"Prop2020DistTar!AI36","v":4451924.7145162309},{"$f":"Prop2020DistTar!AJ36","v":0},{"$f":"Prop2020DistTar!AK36","v":0},{"$f":"Prop2020DistTar!AL36","v":0},{"$f":"Prop2020DistTar!AM36","v":0},{"$f":"Prop2020DistTar!AN36","v":0},{"$f":"Prop2020DistTar!AO36","v":0},{"$f":"Prop2020DistTar!AP36","v":0},{"$f":"Prop2020DistTar!AQ36","v":0},{"$f":"Prop2020DistTar!AR36","v":0},null,0,0,2029.6769207288437,1780.7698858064925,0,0,0,0,0,0,0,0,0,3810.4468065353362]
[null,{"$f":"Prop2020DistTar!B37","v":"Unmetered Supplies / Public Lighting"},"C2U",0,0,0,0,0,0,0,0,0,0,0,0,0,null,{"$f":"Prop2020DistTar!AF37","v":4483.011669203448},{"$f":"Prop2020DistTar!AG37","v":0},{"$f":"Prop2020DistTar!AH37","v":7396578.4907364566},{"$f":"Prop2020DistTar!AI37","v":10316991.681946272},{"$f":"Prop2020DistTar!AJ37","v":0},{"$f":"Prop2020DistTar!AK37","v":0},{"$f":"Prop2020DistTar!AL37","v":0},{"$f":"Prop2020DistTar!AM37","v":0},{"$f":"Prop2020DistTar!AN37","v":0},{"$f":"Prop2020DistTar!AO37","v":0},{"$f":"Prop2020DistTar!AP37","v":0},{"$f":"Prop2020DistTar!AQ37","v":0},{"$f":"Prop2020DistTar!AR37","v":0},null,0,0,0,0,0,0,0,0,0,0,0,0,0,0]
[null,{"$f":"Prop2020DistTar!B38","v":"Large low Voltage"},"CLLV",0,0,0.04,0.04,0,0,0,0,0,0,0,0,0,null,{"$f":"Prop2020DistTar!AF38","v":400.17646833010758},{"$f":"Prop2020DistTar!AG38","v":0},{"$f":"Prop2020DistTar!AH38","v":126570892.63338222},{"$f":"Prop2020DistTar!AI38","v":97426022.677969709},{"$f":"Prop2020DistTar!AJ38","v":78034.411324370973},{"$f":"Prop2020DistTar!AK38","v":0},{"$f":"Prop2020DistTar!AL38","v":0},{"$f":"Prop2020DistTar!AM38","v":0},{"$f":"Prop2020DistTar!AN38","v":0},{"$f":"Prop2020DistTar!AO38","v":0},{"$f":"Prop2020DistTar!AP38","v":0},{"$f":"Prop2020DistTar!AQ38","v":0},{"$f":"Prop2020DistTar!AR38","v":0},null,0,0,50628.357053352891,38970.409071187889,0,0,0,0,{"$f":"L38/100*Z38","v":0},0,0,0,0,89598.76612454078]
[null,{"$f":"Prop2020DistTar!B39","v":"Large low Voltage Bulk"},"CLLVB",0,0,0.04,0.04,0,0,0,0,0,0,0,0,0,null,{"$f":"Prop2020DistTar!AF39","v":1842.9367112714808},{"$f":"Prop2020DistTar!AG39","v":0},{"$f":"Prop2020DistTar!AH39","v":1137722434.8069408},{"$f":"Prop2020DistTar!AI39","v":873988483.91062069},{"$f":"Prop2020DistTar!AJ39","v":686083.36790021718},{"$f":"Prop2020DistTar!AK39","v":0},{"$f":"Prop2020DistTar!AL39","v":0},{"$f":"Prop2020DistTar!AM39","v":0},{"$f":"Prop2020DistTar!AN39","v":0},{"$f":"Prop2020DistTar!AO39","v":0},{"$f":"Prop2020DistTar!AP39","v":0},{"$f":"Prop2020DistTar!AQ39","v":0},{"$f":"Prop2020DistTar!AR39","v":0},null,0,0,455088.97392277635,349595.39356424828,0,0,0,0,0,0,0,0,0,804684.36748702463]
[null,{"$f":"Prop2020DistTar!B40","v":"High Voltage"},"CHV",0,0,0,0,0,0,0,0,0,0,0,0,0,null,{"$f":"Prop2020DistTar!AF40","v":93.927461142717462},{"$f":"Prop2020DistTar!AG40","v":0},{"$f":"Prop2020DistTar!AH40","v":365684368.45994318},{"$f":"Prop2020DistTar!AI40","v":176784509.13387427},{"$f":"Prop2020DistTar!AJ40","v":202579.31528420353},{"$f":"Prop2020DistTar!AK40","v":0},{"$f":"Prop2020DistTar!AL40","v":0},{"$f":"Prop2020DistTar!AM40","v":0},{"$f":"Prop2020DistTar!AN40","v":0},{"$f":"Prop2020DistTar!AO40","v":0},{"$f":"Prop2020DistTar!AP40","v":0},{"$f":"Prop2020DistTar!AQ40","v":0},{"$f":"Prop2020DistTar!AR40","v":0},null,0,0,0,0,0,0,0,0,0,0,0,0,0,0]
[null,{"$f":"Prop2020DistTar!B41","v":"Subtransmission"},"CST",0,0,0,0,0,0,0,0,0,0,0,0,0,null,{"$f":"Prop2020DistTar!AF41","v":5.9999568574023607},{"$f":"Prop2020DistTar!AG41","v":0},{"$f":"Prop2020DistTar!AH41","v":65603250.462830529},{"$f":"Prop2020DistTar!AI41","v":24435184.096122243},{"$f":"Prop2020DistTar!AJ41","v":37985.587976324139},{"$f":"Prop2020DistTar!AK41","v":0},{"$f":"Prop2020DistTar!AL41","v":0},{"$f":"Prop2020DistTar!AM41","v":0},{"$f":"Prop2020DistTar!AN41","v":0},{"$f":"Prop2020DistTar!AO41","v":0},{"$f":"Prop2020DistTar!AP41","v":0},{"$f":"Prop2020DistTar!AQ41","v":0},{"$f":"Prop2020DistTar!AR41","v":0},null,0,0,0,0,0,0,0,0,0,0,0,0,0,0]
[null,null,null,null,null,null,null,null,null,null,null,null,null,null,null,null,null,null,null,null,null,null,null,null,null,null,null,null,null,null,null,0,0,0,0,0,0,0,0,0,0,0,0,0,0]
[null,null,null,null,null,null,null,null,null,null,null,null,null,null,null,null,null,null,null,null,null,null,null,null,null,null,null,null,null,null,null,0,0,0,0,0,0,0,0,0,0,0,0,0,0]
[null,null,null,null,null,null,null,null,null,null,null,null,null,null,null,null,null,null,null,null,null,null,null,null,null,null,null,null,null,null,null,0,0,0,0,0,0,0,0,0,0,0,0,0,0]
[null,null,null,null,null,null,null,null,null,null,null,null,null,null,null,null,null,null,null,null,null,null,null,null,null,null,null,null,null,null,null,0,0,0,0,0,0,0,0,0,0,0,0,0,0]
[null,null,null,null,null,null,null,null,null,null,null,null,null,null,null,null,null,null,null,null,null,null,null,null,null,null,null,null,null,null,null,0,0,0,0,0,0,0,0,0,0,0,0,0,0]
[null,null,null,null,null,null,null,null,null,null,null,null,null,null,null,null,null,null,null,null,null,null,null,null,null,null,null,null,null,null,null,0,0,0,0,0,0,0,0,0,0,0,0,0,0]
[null,null,null,null,null,null,null,null,null,null,null,null,null,null,null,null,null,null,null,null,null,null,null,null,null,null,null,null,null,null,null,0,0,0,0,0,0,0,0,0,0,0,0,0,0]
[null,null,null,null,null,null,null,null,null,null,null,null,null,null,null,null,null,null,null,null,null,null,null,null,null,null,null,null,null,null,null,0,0,0,0,0,0,0,0,0,0,0,0,0,0]
[null,null,null,null,null,null,null,null,null,null,null,null,null,null,null,null,null,null,null,null,null,null,null,null,null,null,null,null,null,null,null,0,0,0,0,0,0,0,0,0,0,0,0,0,0]
[null,null,null,null,null,null,null,null,null,null,null,null,null,null,null,null,null,null,null,null,null,null,null,null,null,null,null,null,null,null,null,0,0,0,0,0,0,0,0,0,0,0,0,0,0]
[null,null,null,null,null,null,null,null,null,null,null,null,null,null,null,null,null,null,null,null,null,null,null,null,null,null,null,null,null,null,null,0,0,0,0,0,0,0,0,0,0,0,0,0,0]
[null,null,null,null,null,null,null,null,null,null,null,null,null,null,null,null,null,null,null,null,null,null,null,null,null,null,null,null,null,null,null,0,0,0,0,0,0,0,0,0,0,0,0,0,0]
[null,null,null,null,null,null,null,null,null,null,null,null,null,null,null,null,null,null,null,null,null,null,null,null,null,null,null,null,null,null,null,0,0,0,0,0,0,0,0,0,0,0,0,0,0]
[null,null,null,null,null,null,null,null,null,null,null,null,null,null,null,null,null,null,null,null,null,null,null,null,null,null,null,null,null,null,null,0,0,0,0,0,0,0,0,0,0,0,0,0,0]
[null,null,null,null,null,null,null,null,null,null,null,null,null,null,null,null,null,null,null,null,null,null,null,null,null,null,null,null,null,null,null,0,0,0,0,0,0,0,0,0,0,0,0,0,0]
[null,null,null,null,null,null,null,null,null,null,null,null,null,null,null,null,null,null,null,null,null,null,null,null,null,null,null,null,null,null,null,0,0,0,0,0,0,0,0,0,0,0,0,0,0]
[null,null,null,null,null,null,null,null,null,null,null,null,null,null,null,null,null,null,null,null,null,null,null,null,null,null,null,null,null,null,null,0,0,0,0,0,0,0,0,0,0,0,0,0,0]
[null,null,null,null,null,null,null,null,null,null,null,null,null,null,null,null,null,null,null,null,null,null,null,null,null,null,null,null,null,null,null,0,0,0,0,0,0,0,0,0,0,0,0,0,0]
[null,null,null,null,null,null,null,null,null,null,null,null,null,null,null,null,null,null,null,null,null,null,null,null,null,null,null,null,null,null,null,0,0,0,0,0,0,0,0,0,0,0,0,0,0]
[null,null,null,null,null,null,null,null,null,null,null,null,null,null,null,null,null,null,null,null,null,null,null,null,null,null,null,null,null,null,null,0,0,0,0,0,0,0,0,0,0,0,0,0,0]
[null,null,null,null,null,null,null,null,null,null,null,null,null,null,null,null,null,null,null,null,null,null,null,null,null,null,null,null,null,null,null,0,0,0,0,0,0,0,0,0,0,0,0,0,0]
[null,null,null,null,null,null,null,null,null,null,null,null,null,null,null,null,null,null,null,null,null,null,null,null,null,null,null,null,null,null,null,0,0,0,0,0,0,0,0,0,0,0,0,0,0]
[null,null,null,null,null,null,null,null,null,null,null,null,null,null,null,null,null,null,null,null,null,null,null,null,null,null,null,null,null,null,null,0,0,0,0,0,0,0,0,0,0,0,0,0,0]
[null,null,null,null,null,null,null,null,null,null,null,null,null,null,null,null,null,null,null,null,null,null,null,null,null,null,null,null,null,null,null,0,0,0,0,0,0,0,0,0,0,0,0,0,0]
[null,null,null,null,null,null,null,null,null,null,null,null,null,null,null,null,null,{"$f":"SUM(R6:R65)","v":370982.67050395434},1290238441.6505878,2601072828.4805541,1862946692.4052012,1004682.6824851158,1220879.3350186595,2094935.6579853231,{"$f":"SUM(Y6:Y65)","v":275792.59768983157},443006.61814874376,375920.20484137774,975665.06010090851,1673557.8542890414,1371448.0724610523,null,{"$f":"SUM(AF6:AF65)","v":0},740700.25599091349,907696.8000227774,702933.82100732252,0,0,0,{"$f":"SUM(AM6:AM65)","v":157.74702793764169},263.78381141713373,219.33989463528883,563.7284050814111,998.4260443671634,805.7024961973699,2354339.6047006492]

{"sheet":"Est2019JSRev","index":13,"n_rows":66,"n_cols":45,"rows_kept":66,"cut":false,"hidden":false,"merged":[]}
[null,{"$f":"\"Tariff Approval - \"&'Model update'!C3","v":"Tariff Approval - CitiPower"},null,{"$f":"\"Est\"&'Model update'!$C$5-1&\"JSRev\"","v":"Est2019JSRev"}]
[]
[null,{"$f":"\"ESTIMATED \"&'Model update'!C8&\" JURISDICTIONAL SCHEME REVENUE\"","v":"ESTIMATED 2019 JURISDICTIONAL SCHEME REVENUE"}]
[null,null,null,{"$f":"\"Current Jurisdictional scheme Tariffs (Pt-1) for \"&'Model update'!$C$8","v":"Current Jurisdictional scheme Tariffs (Pt-1) for 2019"},null,null,null,null,null,null,null,null,null,null,null,null,null,{"$f":"\"Estimated Quantities (Qt-1) for \"&'Model update'!$C$8","v":"Estimated Quantities (Qt-1) for 2019"},null,null,null,null,null,null,null,null,null,null,null,null,null,{"$f":"\"Estimated Revenue (Pt-1 \"&'Model update'!$C$8&\")*(Qt-1 \" &'Model update'!$C$8&\")\"","v":"Estimated Revenue (Pt-1 2019)*(Qt-1 2019)"}]
[null,{"$f":"\"Tariffs \"&'Model update'!C8","v":"Tariffs 2019"},null,{"$f":"Est2019DistRev!D5","v":"CurrentTar\nFixed"},{"$f":"Est2019DistRev!E5","v":"CurrentTar\nAnytime"},{"$f":"Est2019DistRev!F5","v":"CurrentTar\nPkBlk"},{"$f":"Est2019DistRev!G5","v":"CurrentTar\nOPkBlk1"},{"$f":"Est2019DistRev!H5","v":"CurrentTar\nDem kVA"},{"$f":"Est2019DistRev!I5","v":"CurrentTar\nDem kW Sum"},{"$f":"Est2019DistRev!J5","v":"CurrentTar\nDem kW Win"},{"$f":"Est2019DistRev!K5","v":"CurrentTar\nSumBlk1"},{"$f":"Est2019DistRev!L5","v":"CurrentTar\nSumBlk2"},{"$f":"Est2019DistRev!M5","v":"CurrentTar\nSumBlk3"},{"$f":"Est2019DistRev!N5","v":"CurrentTar\nWtrBlk1"},{"$f":"Est2019DistRev!O5","v":"CurrentTar\nWtrBlk2"},{"$f":"Est2019DistRev!P5","v":"CurrentTar\nWtrBlk3"},null,{"$f":"Est2019DistRev!R5","v":"EstVol\nFixed"},{"$f":"Est2019DistRev!S5","v":"EstVol\nAnytime"},{"$f":"Est2019DistRev!T5","v":"EstVol\nPk"},{"$f":"Est2019DistRev!U5","v":"EstVol\nOpk"},{"$f":"Est2019DistRev!V5","v":"EstVol\nDem kVA"},{"$f":"Est2019DistRev!W5","v":"EstVol\nDem kW Sum"},{"$f":"Est2019DistRev!X5","v":"EstVol\nDem kW Win"},{"$f":"Est2019DistRev!Y5","v":"EstVol\nSumBlk1"},{"$f":"Est2019DistRev!Z5","v":"EstVol\nSumBlk2"},{"$f":"Est2019DistRev!AA5","v":"EstVol\nSumBlk3"},{"$f":"Est2019DistRev!AB5","v":"EstVol\nWtrBlk1"},{"$f":"Est2019DistRev!AC5","v":"EstVol\nWtrBlk2"},{"$f":"Est2019DistRev!AD5","v":"EstVol\nWtrBlk3"},null,{"$f":"Est2019DistRev!AF5","v":"EstRev\nFixed"},{"$f":"Est2019DistRev!AG5","v":"EstRev\nAnytime"},{"$f":"Est2019DistRev!AH5","v":"EstRev\nPk"},{"$f":"Est2019DistRev!AI5","v":"EstRev\nOpk"},{"$f":"Est2019DistRev!AJ5","v":"EstRev\nDem kVA"},{"$f":"Est2019DistRev!AK5","v":"EstRev\nDem kW Sum"},{"$f":"Est2019DistRev!AL5","v":"EstRev\nDem kW Win"},{"$f":"Est2019DistRev!AM5","v":"EstRev\nSumBlk1"},{"$f":"Est2019DistRev!AN5","v":"EstRev\nSumBlk2"},{"$f":"Est2019DistRev!AO5","v":"EstRev\nSumBlk3"},{"$f":"Est2019DistRev!AP5","v":"EstRev\nWtrBlk1"},{"$f":"Est2019DistRev!AQ5","v":"EstRev\nWtrBlk2"},{"$f":"Est2019DistRev!AR5","v":"EstRev\nWtrBlk3"},"EstRev\nTotal"]
[null,{"$f":"Est2019TransRev!B6","v":"Residential Single Rate"},null,0,0.05,0,0,0,0,0,0,0,0,0,0,0,null,{"$f":"Est2019DistRev!R6","v":205044.5},{"$f":"Est2019DistRev!S6","v":853857291.19384253},{"$f":"Est2019DistRev!T6","v":0},{"$f":"Est2019DistRev!U6","v":0},{"$f":"Est2019DistRev!V6","v":0},{"$f":"Est2019DistRev!W6","v":0},{"$f":"Est2019DistRev!X6","v":0},{"$f":"Est2019DistRev!Y6","v":0},{"$f":"Est2019DistRev!Z6","v":0},{"$f":"Est2019DistRev!AA6","v":0},{"$f":"Est2019DistRev!AB6","v":0},{"$f":"Est2019DistRev!AC6","v":0},{"$f":"Est2019DistRev!AD6","v":0},null,{"$f":"D6*R6","v":0},{"$f":"E6/100*S6","v":426928.64559692127},0,0,{"$f":"H6*V6","v":0},{"$f":"I6*W6","v":0},0,0,0,{"$f":"M6/100*AA6","v":0},{"$f":"N6/100*AB6","v":0},{"$f":"O6/100*AC6","v":0},{"$f":"P6/100*AD6","v":0},{"$f":"SUM(AF6:AR6)","v":426928.64559692127}]
[null,{"$f":"Est2019TransRev!B7","v":"Residential Single Rate - Bulk"},null,0,0.05,0,0,0,0,0,0,0,0,0,0,0,null,{"$f":"Est2019DistRev!R7","v":31480.916666666668},{"$f":"Est2019DistRev!S7","v":106631799.39951396},{"$f":"Est2019DistRev!T7","v":0},{"$f":"Est2019DistRev!U7","v":0},{"$f":"Est2019DistRev!V7","v":0},{"$f":"Est2019DistRev!W7","v":0},{"$f":"Est2019DistRev!X7","v":0},{"$f":"Est2019DistRev!Y7","v":0},{"$f":"Est2019DistRev!Z7","v":0},{"$f":"Est2019DistRev!AA7","v":0},{"$f":"Est2019DistRev!AB7","v":0},{"$f":"Est2019DistRev!AC7","v":0},{"$f":"Est2019DistRev!AD7","v":0},null,{"$f":"D7*R7","v":0},{"$f":"E7/100*S7","v":53315.899699756977},0,0,{"$f":"H7*V7","v":0},{"$f":"I7*W7","v":0},{"$f":"J7*X7","v":0},0,0,0,0,0,0,{"$f":"SUM(AF7:AR7)","v":53315.899699756977}]
[null,{"$f":"Est2019TransRev!B8","v":"Residential - flexible pricing"},null,0,0,0,0,0,0,0,0.05,0.05,0.05,0.05,0.05,0.05,null,{"$f":"Est2019DistRev!R8","v":693.41666666666663},{"$f":"Est2019DistRev!S8","v":0},{"$f":"Est2019DistRev!T8","v":0},{"$f":"Est2019DistRev!U8","v":0},{"$f":"Est2019DistRev!V8","v":0},{"$f":"Est2019DistRev!W8","v":0},{"$f":"Est2019DistRev!X8","v":0},{"$f":"Est2019DistRev!Y8","v":205405.52138504913},{"$f":"Est2019DistRev!Z8","v":427210.15422574908},{"$f":"Est2019DistRev!AA8","v":316794.33869324729},{"$f":"Est2019DistRev!AB8","v":740099.69108086498},{"$f":"Est2019DistRev!AC8","v":1539287.2647098142},{"$f":"Est2019DistRev!AD8","v":1141446.3964847678},null,0,0,0,0,0,0,0,102.70276069252456,213.60507711287454,158.39716934662366,370.0498455404325,769.64363235490714,570.72319824238389,2185.1216832897462]
[null,{"$f":"Est2019TransRev!B9","v":"Residential - flexible pricing bulk"},null,0,0,0,0,0,0,0,0.05,0.05,0.05,0.05,0.05,0.05,null,{"$f":"Est2019DistRev!R9","v":90},{"$f":"Est2019DistRev!S9","v":0},{"$f":"Est2019DistRev!T9","v":0},{"$f":"Est2019DistRev!U9","v":0},{"$f":"Est2019DistRev!V9","v":0},{"$f":"Est2019DistRev!W9","v":0},{"$f":"Est2019DistRev!X9","v":0},{"$f":"Est2019DistRev!Y9","v":15231.12129347165},{"$f":"Est2019DistRev!Z9","v":32311.930045800349},{"$f":"Est2019DistRev!AA9","v":23662.580933605816},{"$f":"Est2019DistRev!AB9","v":55378.784196646673},{"$f":"Est2019DistRev!AC9","v":117482.84098758313},{"$f":"Est2019DistRev!AD9","v":86034.700781977721},null,0,0,0,0,0,0,0,7.6155606467358252,16.155965022900176,11.831290466802908,27.689392098323339,58.741420493791566,43.017350390988859,165.05097911954269]
[null,{"$f":"Est2019TransRev!B10","v":"Residential Two Rate 5d"},null,0,0,0.05,0.05,0,0,0,0,0,0,0,0,0,null,{"$f":"Est2019DistRev!R10","v":10820.083333333334},{"$f":"Est2019DistRev!S10","v":0},{"$f":"Est2019DistRev!T10","v":35024034.503626086},{"$f":"Est2019DistRev!U10","v":30157186.273130894},{"$f":"Est2019DistRev!V10","v":0},{"$f":"Est2019DistRev!W10","v":0},{"$f":"Est2019DistRev!X10","v":0},{"$f":"Est2019DistRev!Y10","v":0},{"$f":"Est2019DistRev!Z10","v":0},{"$f":"Est2019DistRev!AA10","v":0},{"$f":"Est2019DistRev!AB10","v":0},{"$f":"Est2019DistRev!AC10","v":0},{"$f":"Est2019DistRev!AD10","v":0},null,0,0,17512.017251813042,15078.593136565447,0,0,0,0,0,0,0,0,0,32590.610388378489]
[null,{"$f":"Est2019TransRev!B11","v":"Residential Two Rate 5d - Bulk"},null,0,0,0.05,0.05,0,0,0,0,0,0,0,0,0,null,{"$f":"Est2019DistRev!R11","v":4352.5},{"$f":"Est2019DistRev!S11","v":0},{"$f":"Est2019DistRev!T11","v":12294584.523796603},{"$f":"Est2019DistRev!U11","v":10585730.046510926},{"$f":"Est2019DistRev!V11","v":0},{"$f":"Est2019DistRev!W11","v":0},{"$f":"Est2019DistRev!X11","v":0},{"$f":"Est2019DistRev!Y11","v":0},{"$f":"Est2019DistRev!Z11","v":0},{"$f":"Est2019DistRev!AA11","v":0},{"$f":"Est2019DistRev!AB11","v":0},{"$f":"Est2019DistRev!AC11","v":0},{"$f":"Est2019DistRev!AD11","v":0},null,0,0,6147.2922618983021,5292.8650232554628,0,0,0,0,0,0,0,0,0,11440.157285153764]
[null,{"$f":"Est2019TransRev!B12","v":"Residential Interval"},null,0,0,0.05,0.05,0,0,0,0,0,0,0,0,0,null,{"$f":"Est2019DistRev!R12","v":17057.166666666668},{"$f":"Est2019DistRev!S12","v":0},{"$f":"Est2019DistRev!T12","v":60669728.275751241},{"$f":"Est2019DistRev!U12","v":52545941.858520873},{"$f":"Est2019DistRev!V12","v":0},{"$f":"Est2019DistRev!W12","v":0},{"$f":"Est2019DistRev!X12","v":0},{"$f":"Est2019DistRev!Y12","v":0},{"$f":"Est2019DistRev!Z12","v":0},{"$f":"Est2019DistRev!AA12","v":0},{"$f":"Est2019DistRev!AB12","v":0},{"$f":"Est2019DistRev!AC12","v":0},{"$f":"Est2019DistRev!AD12","v":0},null,0,0,30334.864137875622,26272.970929260438,0,0,0,0,0,0,0,0,0,56607.83506713606]
[null,{"$f":"Est2019TransRev!B13","v":"Residential Interval - Bulk"},null,0,0,0.05,0.05,0,0,0,0,0,0,0,0,0,null,{"$f":"Est2019DistRev!R13","v":8658},{"$f":"Est2019DistRev!S13","v":0},{"$f":"Est2019DistRev!T13","v":15600572.119172478},{"$f":"Est2019DistRev!U13","v":14572772.142298045},{"$f":"Est2019DistRev!V13","v":0},{"$f":"Est2019DistRev!W13","v":0},{"$f":"Est2019DistRev!X13","v":0},{"$f":"Est2019DistRev!Y13","v":0},{"$f":"Est2019DistRev!Z13","v":0},{"$f":"Est2019DistRev!AA13","v":0},{"$f":"Est2019DistRev!AB13","v":0},{"$f":"Est2019DistRev!AC13","v":0},{"$f":"Est2019DistRev!AD13","v":0},null,0,0,7800.2860595862394,7286.3860711490224,0,0,0,0,0,0,0,0,0,15086.672130735262]
[null,{"$f":"Est2019TransRev!B14","v":"Residential Two Rate 5d - Controlled Load"},null,0,0,0,0.05,0,0,0,0,0,0,0,0,0,null,{"$f":"Est2019DistRev!R14","v":9732.6666666666661},{"$f":"Est2019DistRev!S14","v":0},{"$f":"Est2019DistRev!T14","v":0},{"$f":"Est2019DistRev!U14","v":19246331.235837448},{"$f":"Est2019DistRev!V14","v":0},{"$f":"Est2019DistRev!W14","v":0},{"$f":"Est2019DistRev!X14","v":0},{"$f":"Est2019DistRev!Y14","v":0},{"$f":"Est2019DistRev!Z14","v":0},{"$f":"Est2019DistRev!AA14","v":0},{"$f":"Est2019DistRev!AB14","v":0},{"$f":"Est2019DistRev!AC14","v":0},{"$f":"Est2019DistRev!AD14","v":0},null,0,0,0,9623.1656179187248,0,0,0,0,0,0,0,0,0,9623.1656179187248]
[null,{"$f":"Est2019TransRev!B15","v":"Residential Two Rate 5d - Bulk - Controlled Load"},null,0,0,0,0.05,0,0,0,0,0,0,0,0,0,null,{"$f":"Est2019DistRev!R15","v":3683.8333333333335},{"$f":"Est2019DistRev!S15","v":0},{"$f":"Est2019DistRev!T15","v":0},{"$f":"Est2019DistRev!U15","v":7176762.3174721245},{"$f":"Est2019DistRev!V15","v":0},{"$f":"Est2019DistRev!W15","v":0},{"$f":"Est2019DistRev!X15","v":0},{"$f":"Est2019DistRev!Y15","v":0},{"$f":"Est2019DistRev!Z15","v":0},{"$f":"Est2019DistRev!AA15","v":0},{"$f":"Est2019DistRev!AB15","v":0},{"$f":"Est2019DistRev!AC15","v":0},{"$f":"Est2019DistRev!AD15","v":0},null,0,0,0,3588.3811587360624,0,0,0,0,0,0,0,0,0,3588.3811587360624]
[null,{"$f":"Est2019TransRev!B16","v":"Dedicated Circuit"},null,0,0,0,0.05,0,0,0,0,0,0,0,0,0,null,{"$f":"Est2019DistRev!R16","v":22825.5},{"$f":"Est2019DistRev!S16","v":0},{"$f":"Est2019DistRev!T16","v":0},{"$f":"Est2019DistRev!U16","v":31802481.572760597},{"$f":"Est2019DistRev!V16","v":0},{"$f":"Est2019DistRev!W16","v":0},{"$f":"Est2019DistRev!X16","v":0},{"$f":"Est2019DistRev!Y16","v":0},{"$f":"Est2019DistRev!Z16","v":0},{"$f":"Est2019DistRev!AA16","v":0},{"$f":"Est2019DistRev!AB16","v":0},{"$f":"Est2019DistRev!AC16","v":0},{"$f":"Est2019DistRev!AD16","v":0},null,0,0,0,15901.240786380298,0,0,0,0,0,0,0,0,0,15901.240786380298]
[null,{"$f":"Est2019TransRev!B17","v":"Dedicated Circuit - Bulk"},null,0,0,0,0.05,0,0,0,0,0,0,0,0,0,null,{"$f":"Est2019DistRev!R17","v":1105.5833333333333},{"$f":"Est2019DistRev!S17","v":0},{"$f":"Est2019DistRev!T17","v":0},{"$f":"Est2019DistRev!U17","v":2202095.0102876872},{"$f":"Est2019DistRev!V17","v":0},{"$f":"Est2019DistRev!W17","v":0},{"$f":"Est2019DistRev!X17","v":0},{"$f":"Est2019DistRev!Y17","v":0},{"$f":"Est2019DistRev!Z17","v":0},{"$f":"Est2019DistRev!AA17","v":0},{"$f":"Est2019DistRev!AB17","v":0},{"$f":"Est2019DistRev!AC17","v":0},{"$f":"Est2019DistRev!AD17","v":0},null,0,0,0,1101.0475051438436,0,0,0,0,0,0,0,0,0,1101.0475051438436]
[null,{"$f":"Est2019TransRev!B18","v":"Residential Demand"},null,0,0.05,0,0,0,0,0,0,0,0,0,0,0,null,{"$f":"Est2019DistRev!R18","v":4},{"$f":"Est2019DistRev!S18","v":14863.138507993855},{"$f":"Est2019DistRev!T18","v":0},{"$f":"Est2019DistRev!U18","v":0},{"$f":"Est2019DistRev!V18","v":0},{"$f":"Est2019DistRev!W18","v":50.493333333333332},{"$f":"Est2019DistRev!X18","v":120.75099999999999},{"$f":"Est2019DistRev!Y18","v":0},{"$f":"Est2019DistRev!Z18","v":0},{"$f":"Est2019DistRev!AA18","v":0},{"$f":"Est2019DistRev!AB18","v":0},{"$f":"Est2019DistRev!AC18","v":0},{"$f":"Est2019DistRev!AD18","v":0},null,0,7.431569253996928,0,0,0,0,0,0,0,0,0,0,0,7.431569253996928]
[null,{"$f":"Est2019TransRev!B19","v":"Residential Bulk Demand"},null,0,0.05,0,0,0,0,0,0,0,0,0,0,0,null,{"$f":"Est2019DistRev!R19","v":0},{"$f":"Est2019DistRev!S19","v":0},{"$f":"Est2019DistRev!T19","v":0},{"$f":"Est2019DistRev!U19","v":0},{"$f":"Est2019DistRev!V19","v":0},{"$f":"Est2019DistRev!W19","v":0},{"$f":"Est2019DistRev!X19","v":0},{"$f":"Est2019DistRev!Y19","v":0},{"$f":"Est2019DistRev!Z19","v":0},{"$f":"Est2019DistRev!AA19","v":0},{"$f":"Est2019DistRev!AB19","v":0},{"$f":"Est2019DistRev!AC19","v":0},{"$f":"Est2019DistRev!AD19","v":0},null,0,0,0,0,0,0,0,0,0,0,0,0,0,0]
[null,{"$f":"Est2019TransRev!B20","v":"Non-Residential Single Rate"},null,0,0.05,0,0,0,0,0,0,0,0,0,0,0,null,{"$f":"Est2019DistRev!R20","v":20319.916666666668},{"$f":"Est2019DistRev!S20","v":233254649.14212352},{"$f":"Est2019DistRev!T20","v":0},{"$f":"Est2019DistRev!U20","v":0},{"$f":"Est2019DistRev!V20","v":0},{"$f":"Est2019DistRev!W20","v":0},{"$f":"Est2019DistRev!X20","v":0},{"$f":"Est2019DistRev!Y20","v":0},{"$f":"Est2019DistRev!Z20","v":0},{"$f":"Est2019DistRev!AA20","v":0},{"$f":"Est2019DistRev!AB20","v":0},{"$f":"Est2019DistRev!AC20","v":0},{"$f":"Est2019DistRev!AD20","v":0},null,0,116627.32457106176,0,0,0,0,0,0,0,0,0,0,0,116627.32457106176]
[null,{"$f":"Est2019TransRev!B21","v":"Non-Residential Single Rate - Bulk"},null,0,0.05,0,0,0,0,0,0,0,0,0,0,0,null,{"$f":"Est2019DistRev!R21","v":5859.166666666667},{"$f":"Est2019DistRev!S21","v":77076676.161172211},{"$f":"Est2019DistRev!T21","v":0},{"$f":"Est2019DistRev!U21","v":0},{"$f":"Est2019DistRev!V21","v":0},{"$f":"Est2019DistRev!W21","v":0},{"$f":"Est2019DistRev!X21","v":0},{"$f":"Est2019DistRev!Y21","v":0},{"$f":"Est2019DistRev!Z21","v":0},{"$f":"Est2019DistRev!AA21","v":0},{"$f":"Est2019DistRev!AB21","v":0},{"$f":"Est2019DistRev!AC21","v":0},{"$f":"Est2019DistRev!AD21","v":0},null,0,38538.338080586109,0,0,0,0,0,0,0,0,0,0,0,38538.338080586109]
[null,{"$f":"Est2019TransRev!B22","v":"Non-Residential Two Rate 5d"},null,0,0,0.05,0.05,0,0,0,0,0,0,0,0,0,null,{"$f":"Est2019DistRev!R22","v":8457.4166666666661},{"$f":"Est2019DistRev!S22","v":0},{"$f":"Est2019DistRev!T22","v":92130994.291198537},{"$f":"Est2019DistRev!U22","v":57478450.853033125},{"$f":"Est2019DistRev!V22","v":0},{"$f":"Est2019DistRev!W22","v":0},{"$f":"Est2019DistRev!X22","v":0},{"$f":"Est2019DistRev!Y22","v":0},{"$f":"Est2019DistRev!Z22","v":0},{"$f":"Est2019DistRev!AA22","v":0},{"$f":"Est2019DistRev!AB22","v":0},{"$f":"Est2019DistRev!AC22","v":0},{"$f":"Est2019DistRev!AD22","v":0},null,0,0,46065.497145599271,28739.225426516565,0,0,0,0,0,0,0,0,0,74804.722572115832]
[null,{"$f":"Est2019TransRev!B23","v":"Non-Residential Two Rate 5d - Bulk"},null,0,0,0.05,0.05,0,0,0,0,0,0,0,0,0,null,{"$f":"Est2019DistRev!R23","v":1060},{"$f":"Est2019DistRev!S23","v":0},{"$f":"Est2019DistRev!T23","v":17530830.09980379},{"$f":"Est2019DistRev!U23","v":10374374.192942632},{"$f":"Est2019DistRev!V23","v":0},{"$f":"Est2019DistRev!W23","v":0},{"$f":"Est2019DistRev!X23","v":0},{"$f":"Est2019DistRev!Y23","v":0},{"$f":"Est2019DistRev!Z23","v":0},{"$f":"Est2019DistRev!AA23","v":0},{"$f":"Est2019DistRev!AB23","v":0},{"$f":"Est2019DistRev!AC23","v":0},{"$f":"Est2019DistRev!AD23","v":0},null,0,0,8765.4150499018961,5187.1870964713162,0,0,0,0,0,0,0,0,0,13952.602146373212]
[null,{"$f":"Est2019TransRev!B24","v":"Non-Residential Interval"},null,0,0,0.05,0.05,0,0,0,0,0,0,0,0,0,null,{"$f":"Est2019DistRev!R24","v":3960.0833333333335},{"$f":"Est2019DistRev!S24","v":0},{"$f":"Est2019DistRev!T24","v":45937500.616836645},{"$f":"Est2019DistRev!U24","v":25953497.24992197},{"$f":"Est2019DistRev!V24","v":0},{"$f":"Est2019DistRev!W24","v":0},{"$f":"Est2019DistRev!X24","v":0},{"$f":"Est2019DistRev!Y24","v":0},{"$f":"Est2019DistRev!Z24","v":0},{"$f":"Est2019DistRev!AA24","v":0},{"$f":"Est2019DistRev!AB24","v":0},{"$f":"Est2019DistRev!AC24","v":0},{"$f":"Est2019DistRev!AD24","v":0},null,0,0,22968.750308418323,12976.748624960985,0,0,0,0,0,0,0,0,0,35945.498933379306]
[null,{"$f":"Est2019TransRev!B25","v":"Non-Residential Interval - Bulk"},null,0,0,0.05,0.05,0,0,0,0,0,0,0,0,0,null,{"$f":"Est2019DistRev!R25","v":1945.0833333333333},{"$f":"Est2019DistRev!S25","v":0},{"$f":"Est2019DistRev!T25","v":29899979.142567024},{"$f":"Est2019DistRev!U25","v":15763990.484742738},{"$f":"Est2019DistRev!V25","v":0},{"$f":"Est2019DistRev!W25","v":0},{"$f":"Est2019DistRev!X25","v":0},{"$f":"Est2019DistRev!Y25","v":0},{"$f":"Est2019DistRev!Z25","v":0},{"$f":"Est2019DistRev!AA25","v":0},{"$f":"Est2019DistRev!AB25","v":0},{"$f":"Est2019DistRev!AC25","v":0},{"$f":"Est2019DistRev!AD25","v":0},null,0,0,14949.989571283511,7881.9952423713694,0,0,0,0,0,0,0,0,0,22831.984813654883]
[null,{"$f":"Est2019TransRev!B26","v":"Non-Residential Flexible Pricing"},null,0,0,0,0,0,0,0,0.05,0.05,0.05,0.05,0.05,0.05,null,{"$f":"Est2019DistRev!R26","v":22},{"$f":"Est2019DistRev!S26","v":0},{"$f":"Est2019DistRev!T26","v":0},{"$f":"Est2019DistRev!U26","v":0},{"$f":"Est2019DistRev!V26","v":0},{"$f":"Est2019DistRev!W26","v":0},{"$f":"Est2019DistRev!X26","v":0},{"$f":"Est2019DistRev!Y26","v":90532.516087055192},{"$f":"Est2019DistRev!Z26","v":28600.363735072933},{"$f":"Est2019DistRev!AA26","v":77063.914568834094},{"$f":"Est2019DistRev!AB26","v":309844.84003868263},{"$f":"Est2019DistRev!AC26","v":97883.893097818145},{"$f":"Est2019DistRev!AD26","v":263748.95246890507},null,0,0,0,0,0,0,0,45.2662580435276,14.300181867536466,38.531957284417047,154.9224200193413,48.941946548909073,131.87447623445254,433.83723999818403]
[null,{"$f":"Est2019TransRev!B27","v":"Non-Residential - Flexible Pricing Bulk"},null,0,0,0,0,0,0,0,0.05,0.05,0.05,0.05,0.05,0.05,null,{"$f":"Est2019DistRev!R27","v":7},{"$f":"Est2019DistRev!S27","v":0},{"$f":"Est2019DistRev!T27","v":0},{"$f":"Est2019DistRev!U27","v":0},{"$f":"Est2019DistRev!V27","v":0},{"$f":"Est2019DistRev!W27","v":0},{"$f":"Est2019DistRev!X27","v":0},{"$f":"Est2019DistRev!Y27","v":103639.4071436401},{"$f":"Est2019DistRev!Z27","v":27419.302376645079},{"$f":"Est2019DistRev!AA27","v":92664.296651991201},{"$f":"Est2019DistRev!AB27","v":277642.32949385105},{"$f":"Est2019DistRev!AC27","v":73454.289200989399},{"$f":"Est2019DistRev!AD27","v":248240.81777803652},null,0,0,0,0,0,0,0,51.81970357182005,13.709651188322539,46.332148325995604,138.82116474692552,36.727144600494697,124.12040888901826,411.53022132257666]
[null,{"$f":"Est2019TransRev!B28","v":"Non-Residential Two Rate 7d"},null,0,0,0.05,0.05,0,0,0,0,0,0,0,0,0,null,{"$f":"Est2019DistRev!R28","v":2325},{"$f":"Est2019DistRev!S28","v":0},{"$f":"Est2019DistRev!T28","v":39141830.195678435},{"$f":"Est2019DistRev!U28","v":9312690.0588423535},{"$f":"Est2019DistRev!V28","v":0},{"$f":"Est2019DistRev!W28","v":0},{"$f":"Est2019DistRev!X28","v":0},{"$f":"Est2019DistRev!Y28","v":0},{"$f":"Est2019DistRev!Z28","v":0},{"$f":"Est2019DistRev!AA28","v":0},{"$f":"Est2019DistRev!AB28","v":0},{"$f":"Est2019DistRev!AC28","v":0},{"$f":"Est2019DistRev!AD28","v":0},null,0,0,19570.915097839217,4656.3450294211771,0,0,0,0,0,0,0,0,0,24227.260127260393]
[null,{"$f":"Est2019TransRev!B29","v":"Non-Residential Two Rate 7d - Bulk"},null,0,0,0.05,0.05,0,0,0,0,0,0,0,0,0,null,{"$f":"Est2019DistRev!R29","v":253.08333333333334},{"$f":"Est2019DistRev!S29","v":0},{"$f":"Est2019DistRev!T29","v":5750711.7271070778},{"$f":"Est2019DistRev!U29","v":1391434.2626145822},{"$f":"Est2019DistRev!V29","v":0},{"$f":"Est2019DistRev!W29","v":0},{"$f":"Est2019DistRev!X29","v":0},{"$f":"Est2019DistRev!Y29","v":0},{"$f":"Est2019DistRev!Z29","v":0},{"$f":"Est2019DistRev!AA29","v":0},{"$f":"Est2019DistRev!AB29","v":0},{"$f":"Est2019DistRev!AC29","v":0},{"$f":"Est2019DistRev!AD29","v":0},null,0,0,2875.3558635535392,695.71713130729108,0,0,0,0,0,0,0,0,0,3571.0729948608305]
[null,{"$f":"Est2019TransRev!B30","v":"Large Two Rate 7d"},null,0,0,0.05,0.05,0,0,0,0,0,0,0,0,0,null,{"$f":"Est2019DistRev!R30","v":4},{"$f":"Est2019DistRev!S30","v":0},{"$f":"Est2019DistRev!T30","v":168556.17919268721},{"$f":"Est2019DistRev!U30","v":75139.006775332673},{"$f":"Est2019DistRev!V30","v":0},{"$f":"Est2019DistRev!W30","v":0},{"$f":"Est2019DistRev!X30","v":0},{"$f":"Est2019DistRev!Y30","v":0},{"$f":"Est2019DistRev!Z30","v":0},{"$f":"Est2019DistRev!AA30","v":0},{"$f":"Est2019DistRev!AB30","v":0},{"$f":"Est2019DistRev!AC30","v":0},{"$f":"Est2019DistRev!AD30","v":0},null,0,0,84.278089596343605,37.569503387666337,0,0,0,0,0,0,0,0,0,121.84759298400994]
[null,{"$f":"Est2019TransRev!B31","v":"Non-Residential Demand Tariff"},null,0,0.05,0,0,0,0,0,0,0,0,0,0,0,null,{"$f":"Est2019DistRev!R31","v":8},{"$f":"Est2019DistRev!S31","v":717136.61553414329},{"$f":"Est2019DistRev!T31","v":0},{"$f":"Est2019DistRev!U31","v":0},{"$f":"Est2019DistRev!V31","v":0},{"$f":"Est2019DistRev!W31","v":822.73759999999993},{"$f":"Est2019DistRev!X31","v":1909.0406952380938},{"$f":"Est2019DistRev!Y31","v":0},{"$f":"Est2019DistRev!Z31","v":0},{"$f":"Est2019DistRev!AA31","v":0},{"$f":"Est2019DistRev!AB31","v":0},{"$f":"Est2019DistRev!AC31","v":0},{"$f":"Est2019DistRev!AD31","v":0},null,0,358.56830776707164,0,0,0,0,0,0,0,0,0,0,0,358.56830776707164]
[null,{"$f":"Est2019TransRev!B32","v":"Non-Residential Bulk Demand Tariff"},null,0,0.05,0,0,0,0,0,0,0,0,0,0,0,null,{"$f":"Est2019DistRev!R32","v":4},{"$f":"Est2019DistRev!S32","v":534045.01309481997},{"$f":"Est2019DistRev!T32","v":0},{"$f":"Est2019DistRev!U32","v":0},{"$f":"Est2019DistRev!V32","v":0},{"$f":"Est2019DistRev!W32","v":411.36879999999996},{"$f":"Est2019DistRev!X32","v":954.5203476190469},{"$f":"Est2019DistRev!Y32","v":0},{"$f":"Est2019DistRev!Z32","v":0},{"$f":"Est2019DistRev!AA32","v":0},{"$f":"Est2019DistRev!AB32","v":0},{"$f":"Est2019DistRev!AC32","v":0},{"$f":"Est2019DistRev!AD32","v":0},null,0,267.02250654740999,0,0,0,0,0,0,0,0,0,0,0,267.02250654740999]
[null,{"$f":"Est2019TransRev!B33","v":"Medium Business Demand"},null,0,0,0.05,0.05,0,0,0,0,0,0,0,0,0,null,{"$f":"Est2019DistRev!R33","v":4548},{"$f":"Est2019DistRev!S33","v":0},{"$f":"Est2019DistRev!T33","v":365166105.04280096},{"$f":"Est2019DistRev!U33","v":263865736.50712213},{"$f":"Est2019DistRev!V33","v":0},{"$f":"Est2019DistRev!W33","v":730223.77142460272},{"$f":"Est2019DistRev!X33","v":1303005.7703119123},{"$f":"Est2019DistRev!Y33","v":0},{"$f":"Est2019DistRev!Z33","v":0},{"$f":"Est2019DistRev!AA33","v":0},{"$f":"Est2019DistRev!AB33","v":0},{"$f":"Est2019DistRev!AC33","v":0},{"$f":"Est2019DistRev!AD33","v":0},null,{"$f":"D33*R33","v":0},{"$f":"E33/100*S33","v":0},182583.05252140047,131932.86825356106,0,0,0,0,0,0,0,0,0,{"$f":"SUM(AF33:AR33)","v":314515.92077496153}]
[null,{"$f":"Est2019TransRev!B34","v":"Medium Business Bulk Demand"},null,0,0,0.05,0.05,0,0,0,0,0,0,0,0,0,null,{"$f":"Est2019DistRev!R34","v":2221.9166666666665},{"$f":"Est2019DistRev!S34","v":0},{"$f":"Est2019DistRev!T34","v":255479964.6620293},{"$f":"Est2019DistRev!U34","v":173141256.77774215},{"$f":"Est2019DistRev!V34","v":0},{"$f":"Est2019DistRev!W34","v":520621.07651825261},{"$f":"Est2019DistRev!X34","v":868527.91268999258},{"$f":"Est2019DistRev!Y34","v":0},{"$f":"Est2019DistRev!Z34","v":0},{"$f":"Est2019DistRev!AA34","v":0},{"$f":"Est2019DistRev!AB34","v":0},{"$f":"Est2019DistRev!AC34","v":0},{"$f":"Est2019DistRev!AD34","v":0},null,0,0,127739.98233101465,86570.628388871075,0,0,0,0,0,0,0,0,0,214310.61071988574]
[null,{"$f":"Est2019TransRev!B35","v":"Medium Business Opt-out"},null,0,0,0.05,0.05,0,0,0,0,0,0,0,0,0,null,{"$f":"Est2019DistRev!R35","v":7},{"$f":"Est2019DistRev!S35","v":0},{"$f":"Est2019DistRev!T35","v":296417.25372207933},{"$f":"Est2019DistRev!U35","v":286499.78848501295},{"$f":"Est2019DistRev!V35","v":0},{"$f":"Est2019DistRev!W35","v":0},{"$f":"Est2019DistRev!X35","v":0},{"$f":"Est2019DistRev!Y35","v":0},{"$f":"Est2019DistRev!Z35","v":0},{"$f":"Est2019DistRev!AA35","v":0},{"$f":"Est2019DistRev!AB35","v":0},{"$f":"Est2019DistRev!AC35","v":0},{"$f":"Est2019DistRev!AD35","v":0},null,{"$f":"D35*R35","v":0},{"$f":"E35/100*S35","v":0},{"$f":"F35/100*T35","v":148.20862686103968},{"$f":"G35/100*U35","v":143.24989424250649},0,0,0,{"$f":"K35/100*Y35","v":0},{"$f":"L35/100*Z35","v":0},0,0,0,0,{"$f":"SUM(AF35:AR35)","v":291.45852110354616}]
[null,{"$f":"Est2019TransRev!B36","v":"Medium Business Bulk Opt-out"},null,0,0,0.05,0.05,0,0,0,0,0,0,0,0,0,null,{"$f":"Est2019DistRev!R36","v":9},{"$f":"Est2019DistRev!S36","v":0},{"$f":"Est2019DistRev!T36","v":630002.22370326216},{"$f":"Est2019DistRev!U36","v":505149.35184775549},{"$f":"Est2019DistRev!V36","v":0},{"$f":"Est2019DistRev!W36","v":0},{"$f":"Est2019DistRev!X36","v":0},{"$f":"Est2019DistRev!Y36","v":0},{"$f":"Est2019DistRev!Z36","v":0},{"$f":"Est2019DistRev!AA36","v":0},{"$f":"Est2019DistRev!AB36","v":0},{"$f":"Est2019DistRev!AC36","v":0},{"$f":"Est2019DistRev!AD36","v":0},null,0,0,315.00111185163109,252.57467592387775,0,0,0,0,0,0,0,0,0,567.57578777550884]
[null,{"$f":"Est2019TransRev!B37","v":"Unmetered Supplies / Public Lighting"},null,0,0,0,0,0,0,0,0,0,0,0,0,0,null,{"$f":"Est2019DistRev!R37","v":4425.5},{"$f":"Est2019DistRev!S37","v":0},{"$f":"Est2019DistRev!T37","v":7430325.4446869912},{"$f":"Est2019DistRev!U37","v":18727648.893831097},{"$f":"Est2019DistRev!V37","v":0},{"$f":"Est2019DistRev!W37","v":0},{"$f":"Est2019DistRev!X37","v":0},{"$f":"Est2019DistRev!Y37","v":0},{"$f":"Est2019DistRev!Z37","v":0},{"$f":"Est2019DistRev!AA37","v":0},{"$f":"Est2019DistRev!AB37","v":0},{"$f":"Est2019DistRev!AC37","v":0},{"$f":"Est2019DistRev!AD37","v":0},null,0,0,0,0,0,0,0,0,0,0,0,0,0,0]
[null,{"$f":"Est2019TransRev!B38","v":"Large low Voltage"},null,0,0,0.04,0.04,0,0,0,0,0,0,0,0,0,null,{"$f":"Est2019DistRev!R38","v":334.33333333333331},{"$f":"Est2019DistRev!S38","v":0},{"$f":"Est2019DistRev!T38","v":103909055.5023116},{"$f":"Est2019DistRev!U38","v":80266733.268921614},{"$f":"Est2019DistRev!V38","v":59781.404083333327},{"$f":"Est2019DistRev!W38","v":0},{"$f":"Est2019DistRev!X38","v":0},{"$f":"Est2019DistRev!Y38","v":0},{"$f":"Est2019DistRev!Z38","v":0},{"$f":"Est2019DistRev!AA38","v":0},{"$f":"Est2019DistRev!AB38","v":0},{"$f":"Est2019DistRev!AC38","v":0},{"$f":"Est2019DistRev!AD38","v":0},null,0,0,41563.622200924641,32106.693307568647,0,0,0,0,{"$f":"L38/100*Z38","v":0},0,0,0,0,73670.315508493281]
[null,{"$f":"Est2019TransRev!B39","v":"Large low Voltage Bulk"},null,0,0,0.04,0.04,0,0,0,0,0,0,0,0,0,null,{"$f":"Est2019DistRev!R39","v":1731.1666666666667},{"$f":"Est2019DistRev!S39","v":0},{"$f":"Est2019DistRev!T39","v":1101354717.2937953},{"$f":"Est2019DistRev!U39","v":829525555.83137512},{"$f":"Est2019DistRev!V39","v":627630.98033333279},{"$f":"Est2019DistRev!W39","v":0},{"$f":"Est2019DistRev!X39","v":0},{"$f":"Est2019DistRev!Y39","v":0},{"$f":"Est2019DistRev!Z39","v":0},{"$f":"Est2019DistRev!AA39","v":0},{"$f":"Est2019DistRev!AB39","v":0},{"$f":"Est2019DistRev!AC39","v":0},{"$f":"Est2019DistRev!AD39","v":0},null,0,0,440541.88691751816,331810.22233255004,0,0,0,0,0,0,0,0,0,772352.1092500682]
[null,{"$f":"Est2019TransRev!B40","v":"High Voltage"},null,0,0,0,0,0,0,0,0,0,0,0,0,0,null,{"$f":"Est2019DistRev!R40","v":88},{"$f":"Est2019DistRev!S40","v":0},{"$f":"Est2019DistRev!T40","v":345704462.09037936},{"$f":"Est2019DistRev!U40","v":319905209.40701491},{"$f":"Est2019DistRev!V40","v":191921.57674999998},{"$f":"Est2019DistRev!W40","v":0},{"$f":"Est2019DistRev!X40","v":0},{"$f":"Est2019DistRev!Y40","v":0},{"$f":"Est2019DistRev!Z40","v":0},{"$f":"Est2019DistRev!AA40","v":0},{"$f":"Est2019DistRev!AB40","v":0},{"$f":"Est2019DistRev!AC40","v":0},{"$f":"Est2019DistRev!AD40","v":0},null,0,0,0,0,0,0,0,0,0,0,0,0,0,0]
[null,{"$f":"Est2019TransRev!B41","v":"Subtransmission"},null,0,0,0,0,0,0,0,0,0,0,0,0,0,null,{"$f":"Est2019DistRev!R41","v":6},{"$f":"Est2019DistRev!S41","v":0},{"$f":"Est2019DistRev!T41","v":63161450.703406543},{"$f":"Est2019DistRev!U41","v":37546309.7185238},{"$f":"Est2019DistRev!V41","v":35559.269916666664},{"$f":"Est2019DistRev!W41","v":0},{"$f":"Est2019DistRev!X41","v":0},{"$f":"Est2019DistRev!Y41","v":0},{"$f":"Est2019DistRev!Z41","v":0},{"$f":"Est2019DistRev!AA41","v":0},{"$f":"Est2019DistRev!AB41","v":0},{"$f":"Est2019DistRev!AC41","v":0},{"$f":"Est2019DistRev!AD41","v":0},null,0,0,0,0,0,0,0,0,0,0,0,0,0,0]
[null,null,null,null,null,null,null,null,null,null,null,null,null,null,null,null,null,{"$f":"Est2019DistRev!R42","v":0},{"$f":"Est2019DistRev!S42","v":0},{"$f":"Est2019DistRev!T42","v":0},{"$f":"Est2019DistRev!U42","v":0},{"$f":"Est2019DistRev!V42","v":0},{"$f":"Est2019DistRev!W42","v":0},{"$f":"Est2019DistRev!X42","v":0},{"$f":"Est2019DistRev!Y42","v":0},{"$f":"Est2019DistRev!Z42","v":0},{"$f":"Est2019DistRev!AA42","v":0},{"$f":"Est2019DistRev!AB42","v":0},{"$f":"Est2019DistRev!AC42","v":0},{"$f":"Est2019DistRev!AD42","v":0},null,0,0,0,0,0,0,0,0,0,0,0,0,0,0]
[null,null,null,null,null,null,null,null,null,null,null,null,null,null,null,null,null,{"$f":"Est2019DistRev!R43","v":0},{"$f":"Est2019DistRev!S43","v":0},{"$f":"Est2019DistRev!T43","v":0},{"$f":"Est2019DistRev!U43","v":0},{"$f":"Est2019DistRev!V43","v":0},{"$f":"Est2019DistRev!W43","v":0},{"$f":"Est2019DistRev!X43","v":0},{"$f":"Est2019DistRev!Y43","v":0},{"$f":"Est2019DistRev!Z43","v":0},{"$f":"Est2019DistRev!AA43","v":0},{"$f":"Est2019DistRev!AB43","v":0},{"$f":"Est2019DistRev!AC43","v":0},{"$f":"Est2019DistRev!AD43","v":0},null,0,0,0,0,0,0,0,0,0,0,0,0,0,0]
[null,null,null,null,null,null,null,null,null,null,null,null,null,null,null,null,null,{"$f":"Est2019DistRev!R44","v":0},{"$f":"Est2019DistRev!S44","v":0},{"$f":"Est2019DistRev!T44","v":0},{"$f":"Est2019DistRev!U44","v":0},{"$f":"Est2019DistRev!V44","v":0},{"$f":"Est2019DistRev!W44","v":0},{"$f":"Est2019DistRev!X44","v":0},{"$f":"Est2019DistRev!Y44","v":0},{"$f":"Est2019DistRev!Z44","v":0},{"$f":"Est2019DistRev!AA44","v":0},{"$f":"Est2019DistRev!AB44","v":0},{"$f":"Est2019DistRev!AC44","v":0},{"$f":"Est2019DistRev!AD44","v":0},null,0,0,0,0,0,0,0,0,0,0,0,0,0,0]
[null,null,null,null,null,null,null,null,null,null,null,null,null,null,null,null,null,{"$f":"Est2019DistRev!R45","v":0},{"$f":"Est2019DistRev!S45","v":0},{"$f":"Est2019DistRev!T45","v":0},{"$f":"Est2019DistRev!U45","v":0},{"$f":"Est2019DistRev!V45","v":0},{"$f":"Est2019DistRev!W45","v":0},{"$f":"Est2019DistRev!X45","v":0},{"$f":"Est2019DistRev!Y45","v":0},{"$f":"Est2019DistRev!Z45","v":0},{"$f":"Est2019DistRev!AA45","v":0},{"$f":"Est2019DistRev!AB45","v":0},{"$f":"Est2019DistRev!AC45","v":0},{"$f":"Est2019DistRev!AD45","v":0},null,0,0,0,0,0,0,0,0,0,0,0,0,0,0]
[null,null,null,null,null,null,null,null,null,null,null,null,null,null,null,null,null,{"$f":"Est2019DistRev!R46","v":0},{"$f":"Est2019DistRev!S46","v":0},{"$f":"Est2019DistRev!T46","v":0},{"$f":"Est2019DistRev!U46","v":0},{"$f":"Est2019DistRev!V46","v":0},{"$f":"Est2019DistRev!W46","v":0},{"$f":"Est2019DistRev!X46","v":0},{"$f":"Est2019DistRev!Y46","v":0},{"$f":"Est2019DistRev!Z46","v":0},{"$f":"Est2019DistRev!AA46","v":0},{"$f":"Est2019DistRev!AB46","v":0},{"$f":"Est2019DistRev!AC46","v":0},{"$f":"Est2019DistRev!AD46","v":0},null,0,0,0,0,0,0,0,0,0,0,0,0,0,0]
[null,null,null,null,null,null,null,null,null,null,null,null,null,null,null,null,null,{"$f":"Est2019DistRev!R47","v":0},{"$f":"Est2019DistRev!S47","v":0},{"$f":"Est2019DistRev!T47","v":0},{"$f":"Est2019DistRev!U47","v":0},{"$f":"Est2019DistRev!V47","v":0},{"$f":"Est2019DistRev!W47","v":0},{"$f":"Est2019DistRev!X47","v":0},{"$f":"Est2019DistRev!Y47","v":0},{"$f":"Est2019DistRev!Z47","v":0},{"$f":"Est2019DistRev!AA47","v":0},{"$f":"Est2019DistRev!AB47","v":0},{"$f":"Est2019DistRev!AC47","v":0},{"$f":"Est2019DistRev!AD47","v":0},null,0,0,0,0,0,0,0,0,0,0,0,0,0,0]
[null,null,null,null,null,null,null,null,null,null,null,null,null,null,null,null,null,{"$f":"Est2019DistRev!R48","v":0},{"$f":"Est2019DistRev!S48","v":0},{"$f":"Est2019DistRev!T48","v":0},{"$f":"Est2019DistRev!U48","v":0},{"$f":"Est2019DistRev!V48","v":0},{"$f":"Est2019DistRev!W48","v":0},{"$f":"Est2019DistRev!X48","v":0},{"$f":"Est2019DistRev!Y48","v":0},{"$f":"Est2019DistRev!Z48","v":0},{"$f":"Est2019DistRev!AA48","v":0},{"$f":"Est2019DistRev!AB48","v":0},{"$f":"Est2019DistRev!AC48","v":0},{"$f":"Est2019DistRev!AD48","v":0},null,0,0,0,0,0,0,0,0,0,0,0,0,0,0]
[null,null,null,null,null,null,null,null,null,null,null,null,null,null,null,null,null,{"$f":"Est2019DistRev!R49","v":0},{"$f":"Est2019DistRev!S49","v":0},{"$f":"Est2019DistRev!T49","v":0},{"$f":"Est2019DistRev!U49","v":0},{"$f":"Est2019DistRev!V49","v":0},{"$f":"Est2019DistRev!W49","v":0},{"$f":"Est2019DistRev!X49","v":0},{"$f":"Est2019DistRev!Y49","v":0},{"$f":"Est2019DistRev!Z49","v":0},{"$f":"Est2019DistRev!AA49","v":0},{"$f":"Est2019DistRev!AB49","v":0},{"$f":"Est2019DistRev!AC49","v":0},{"$f":"Est2019DistRev!AD49","v":0},null,0,0,0,0,0,0,0,0,0,0,0,0,0,0]
[null,null,null,null,null,null,null,null,null,null,null,null,null,null,null,null,null,{"$f":"Est2019DistRev!R50","v":0},{"$f":"Est2019DistRev!S50","v":0},{"$f":"Est2019DistRev!T50","v":0},{"$f":"Est2019DistRev!U50","v":0},{"$f":"Est2019DistRev!V50","v":0},{"$f":"Est2019DistRev!W50","v":0},{"$f":"Est2019DistRev!X50","v":0},{"$f":"Est2019DistRev!Y50","v":0},{"$f":"Est2019DistRev!Z50","v":0},{"$f":"Est2019DistRev!AA50","v":0},{"$f":"Est2019DistRev!AB50","v":0},{"$f":"Est2019DistRev!AC50","v":0},{"$f":"Est2019DistRev!AD50","v":0},null,0,0,0,0,0,0,0,0,0,0,0,0,0,0]
[null,null,null,null,null,null,null,null,null,null,null,null,null,null,null,null,null,{"$f":"Est2019DistRev!R51","v":0},{"$f":"Est2019DistRev!S51","v":0},{"$f":"Est2019DistRev!T51","v":0},{"$f":"Est2019DistRev!U51","v":0},{"$f":"Est2019DistRev!V51","v":0},{"$f":"Est2019DistRev!W51","v":0},{"$f":"Est2019DistRev!X51","v":0},{"$f":"Est2019DistRev!Y51","v":0},{"$f":"Est2019DistRev!Z51","v":0},{"$f":"Est2019DistRev!AA51","v":0},{"$f":"Est2019DistRev!AB51","v":0},{"$f":"Est2019DistRev!AC51","v":0},{"$f":"Est2019DistRev!AD51","v":0},null,0,0,0,0,0,0,0,0,0,0,0,0,0,0]
[null,null,null,null,null,null,null,null,null,null,null,null,null,null,null,null,null,{"$f":"Est2019DistRev!R52","v":0},{"$f":"Est2019DistRev!S52","v":0},{"$f":"Est2019DistRev!T52","v":0},{"$f":"Est2019DistRev!U52","v":0},{"$f":"Est2019DistRev!V52","v":0},{"$f":"Est2019DistRev!W52","v":0},{"$f":"Est2019DistRev!X52","v":0},{"$f":"Est2019DistRev!Y52","v":0},{"$f":"Est2019DistRev!Z52","v":0},{"$f":"Est2019DistRev!AA52","v":0},{"$f":"Est2019DistRev!AB52","v":0},{"$f":"Est2019DistRev!AC52","v":0},{"$f":"Est2019DistRev!AD52","v":0},null,0,0,0,0,0,0,0,0,0,0,0,0,0,0]
[null,null,null,null,null,null,null,null,null,null,null,null,null,null,null,null,null,{"$f":"Est2019DistRev!R53","v":0},{"$f":"Est2019DistRev!S53","v":0},{"$f":"Est2019DistRev!T53","v":0},{"$f":"Est2019DistRev!U53","v":0},{"$f":"Est2019DistRev!V53","v":0},{"$f":"Est2019DistRev!W53","v":0},{"$f":"Est2019DistRev!X53","v":0},{"$f":"Est2019DistRev!Y53","v":0},{"$f":"Est2019DistRev!Z53","v":0},{"$f":"Est2019DistRev!AA53","v":0},{"$f":"Est2019DistRev!AB53","v":0},{"$f":"Est2019DistRev!AC53","v":0},{"$f":"Est2019DistRev!AD53","v":0},null,0,0,0,0,0,0,0,0,0,0,0,0,0,0]
[null,null,null,null,null,null,null,null,null,null,null,null,null,null,null,null,null,{"$f":"Est2019DistRev!R54","v":0},{"$f":"Est2019DistRev!S54","v":0},{"$f":"Est2019DistRev!T54","v":0},{"$f":"Est2019DistRev!U54","v":0},{"$f":"Est2019DistRev!V54","v":0},{"$f":"Est2019DistRev!W54","v":0},{"$f":"Est2019DistRev!X54","v":0},{"$f":"Est2019DistRev!Y54","v":0},{"$f":"Est2019DistRev!Z54","v":0},{"$f":"Est2019DistRev!AA54","v":0},{"$f":"Est2019DistRev!AB54","v":0},{"$f":"Est2019DistRev!AC54","v":0},{"$f":"Est2019DistRev!AD54","v":0},null,0,0,0,0,0,0,0,0,0,0,0,0,0,0]
[null,null,null,null,null,null,null,null,null,null,null,null,null,null,null,null,null,null,null,null,null,null,null,null,null,null,null,null,null,null,null,0,0,0,0,0,0,0,0,0,0,0,0,0,0]
[null,null,null,null,null,null,null,null,null,null,null,null,null,null,null,null,null,null,null,null,null,null,null,null,null,null,null,null,null,null,null,0,0,0,0,0,0,0,0,0,0,0,0,0,0]
[null,null,null,null,null,null,null,null,null,null,null,null,null,null,null,null,null,null,null,null,null,null,null,null,null,null,null,null,null,null,null,0,0,0,0,0,0,0,0,0,0,0,0,0,0]
[null,null,null,null,null,null,null,null,null,null,null,null,null,null,null,null,null,null,null,null,null,null,null,null,null,null,null,null,null,null,null,0,0,0,0,0,0,0,0,0,0,0,0,0,0]
[null,null,null,null,null,null,null,null,null,null,null,null,null,null,null,null,null,null,null,null,null,null,null,null,null,null,null,null,null,null,null,0,0,0,0,0,0,0,0,0,0,0,0,0,0]
[null,null,null,null,null,null,null,null,null,null,null,null,null,null,null,null,null,null,null,null,null,null,null,null,null,null,null,null,null,null,null,0,0,0,0,0,0,0,0,0,0,0,0,0,0]
[null,null,null,null,null,null,null,null,null,null,null,null,null,null,null,null,null,null,null,null,null,null,null,null,null,null,null,null,null,null,null,0,0,0,0,0,0,0,0,0,0,0,0,0,0]
[null,null,null,null,null,null,null,null,null,null,null,null,null,null,null,null,null,null,null,null,null,null,null,null,null,null,null,null,null,null,null,0,0,0,0,0,0,0,0,0,0,0,0,0,0]
[null,null,null,null,null,null,null,null,null,null,null,null,null,null,null,null,null,null,null,null,null,null,null,null,null,null,null,null,null,null,null,0,0,0,0,0,0,0,0,0,0,0,0,0,0]
[null,null,null,null,null,null,null,null,null,null,null,null,null,null,null,null,null,null,null,null,null,null,null,null,null,null,null,null,null,null,null,0,0,0,0,0,0,0,0,0,0,0,0,0,0]
[null,null,null,null,null,null,null,null,null,null,null,null,null,null,null,null,null,null,null,null,null,null,null,null,null,null,null,null,null,null,null,0,0,0,0,0,0,0,0,0,0,0,0,0,0]
[null,null,null,null,null,null,null,null,null,null,null,null,null,null,null,null,null,{"$f":"SUM(R6:R65)","v":373143.83333333331},1272086460.663789,2597281821.8915658,2012408976.1105549,914893.23108333279,1252129.4476761888,2174517.9950447618,414808.56590921606,515541.75038326747,510185.1308476784,1382965.6448100451,1828108.2879962048,{"$f":"SUM(AD6:AD65)","v":1739470.8675136871},null,0,636043.23033189459,969966.41454693605,727135.67513556289,0,0,0,{"$f":"SUM(AM6:AM65)","v":207.40428295460802},257.77087519163371,255.0925654238392,691.48282240502272,914.05414399810252,869.73543375684358,2336340.8601381229]

{"sheet":"2020JSRevCont","index":14,"n_rows":62,"n_cols":5,"rows_kept":62,"cut":false,"hidden":false,"merged":[]}
[]
[null,{"$f":"\"Tariff Approval - \"&'Model update'!$C$3","v":"Tariff Approval - CitiPower"},{"$f":"'Model update'!$C$5&\"JSRevCont\"","v":"2020JSRevCont"}]
[]
[null," Jurisdictional Scheme Amounts (JSA)"]
[]
[null,"Year (t)",{"$f":"'Model update'!C5","v":2020}]
[]
[null,"Table 1- Compliance with JSA Revenue Formula"]
[null,"Revenue from  Jurisdictional Scheme Amounts charges for year t",{"$f":"Prop2020JSTar!AS66","v":2354339.6047006492}]
[null,"Total JSA related payments for year t",{"$f":"C17","v":2359194.1748454808}]
[null,null,{"$f":"IF(C9=\"\",\"\",IF(C10>=C9,\"JSA REVENUE FORMULA COMPLIANT\",\"JSA REVENUE FORMULA BREACHED\"))","v":"JSA REVENUE FORMULA COMPLIANT"}]
[]
[null,"Table 2 - Total JSA related payments for year t"]
[null,"PFIT & TFIT charges for year t",{"$f":"C22","v":2000000}]
[null,"JSA revenue under/over recovery approved",{"$f":"-E56*(1+E54)^0.5","v":359194.17484548094}]
[null,"JSA revenue under/over recovery for years 2014 and 2015"]
[null,"Total JSA related payments for year t",{"$f":"SUM(C14:C16)","v":2359194.1748454808}]
[]
[null,"Table 3 - PFIT & TFIT charges for year t"]
[null,"PFIT",2000000]
[null,"TFIT",0]
[null,"PFIT & TFIT charges",{"$f":"SUM(C20:C21)","v":2000000}]
[]
[]
[]
[]
[null,"Table 4 - JSA Recovery Arrangements"]
[null,null,"Year t-2","Year t-1","Year t"]
[null,null,"(actual)","(estimate)","(forecast)"]
[null,null,{"$f":"D30-1","v":2018},{"$f":"E30-1","v":2019},{"$f":"C$6","v":2020}]
[]
[null,"(A) Revenue from JSA proposal charges",2146870.5607349193,{"$f":"Est2019JSRev!AS66","v":2336340.8601381229},{"$f":"C9","v":2354339.6047006492}]
[]
[]
[null,"(B) Less Total JSA related payments =",{"$f":"SUM(C37:C39)","v":2314046.6199999996},{"$f":"SUM(D37:D39)","v":2000000},{"$f":"SUM(E37:E39)","v":2000000}]
[]
[null,"+ JSA revenue under/over recovery for years 2014 and 2015"]
[]
[null,"+PFIT & TFIT charges  =",{"$f":"SUM(C40:C41)","v":2314046.6199999996},{"$f":"SUM(D40:D41)","v":2000000},{"$f":"SUM(E40:E41)","v":2000000}]
[null,"+PFIT amount",{"$f":"'JS cost audit template'!F4","v":2314046.6199999996},2000000,{"$f":"C20","v":2000000}]
[null,"+TFIT amount",{"$f":"'JS cost audit template'!F5","v":0},0,{"$f":"C21","v":0}]
[]
[]
[]
[null,"(A minus B) Under/over recovery of revenue for regulatory year",{"$f":"C32-C35","v":-167176.05926508037},{"$f":"D32-D35","v":336340.86013812292},{"$f":"E32-E35","v":354339.60470064916}]
[]
[]
[]
[null,"Table 5 - JSA Unders and Overs Account"]
[null,null,"Year t-2","Year t-1","Year t"]
[null,null,"(actual)","(estimate)","(forecast)"]
[null,"Calendar year",{"$f":"D52-1","v":2018},{"$f":"E52-1","v":2019},{"$f":"C$6","v":2020}]
[]
[null,"Nominal WACC",{"$f":"(1+'Model update'!$B$47)*(1+'Model update'!$C$28)-1","v":5.5656482586260436E-2},{"$f":"(1+'Model update'!$B$45)*(1+'Model update'!$C$29)-1","v":5.6586211801394226E-2},{"$f":"(1+'Model update'!$B$43)*(1+'Model update'!$C$30)-1","v":5.0085804138458423E-2}]
[]
[null,"Opening balance",-461509.92313195125,{"$f":"C60","v":-658961.22666830558},{"$f":"D60","v":-350523.29965567158}]
[null,"Interest on Opening balance",{"$f":"C56*C54","v":-25686.019000179836},{"$f":"D56*D54","v":-37288.119541159285},{"$f":"E56*E54","v":-17556.241332520138}]
[null,"Under/over recovery of revenue for regulatory year",{"$f":"C45","v":-167176.05926508037},{"$f":"D45","v":336340.86013812292},{"$f":"E45","v":354339.60470064916}]
[null,"Interest on under/over recovery for regulatory year",{"$f":"C58*((1+C54)^0.5-1)","v":-4589.2252710941639},{"$f":"D58*((1+D54)^0.5-1)","v":9385.1864156703068},{"$f":"E58*((1+E54)^0.5-1)","v":8765.2789135097719}]
[null,"Closing balance of JSA overs/ (unders) account",{"$f":"SUM(C56:C59)","v":-658961.22666830558},{"$f":"SUM(D56:D59)","v":-350523.29965567158},-4974.6573740328004]
[]
[null,"The DNSP is expected to achieve a closing balance as close to zero as practicable in its jurisdictional scheme amount unders and overs account in each forecast year in its annual pricing proposals in the 2016–20 regulatory control period."]

{"sheet":"JS cost audit template","index":15,"n_rows":12,"n_cols":6,"rows_kept":12,"cut":false,"hidden":false,"merged":[[6,1,6,3],[1,1,1,3],[2,1,2,3],[3,1,3,3],[4,1,4,3],[5,1,5,3]]}
[null,{"$f":"\"Tariff Approval - \"&'Model update'!C3","v":"Tariff Approval - CitiPower"}]
[null,"Jurisdictional scheme amounts",null,null,null,"t-2 actual"]
[]
[null,"PFIT",null,null,null,2314046.6199999996]
[]
[]
[null,null,null,null,"Total",{"$f":"SUM(F3:F6)","v":2314046.6199999996}]
[]
[]
[null,"Where the following definitions apply"]
[null,"PFIT","Premium feed-in tariff payments"]
[null,"TFIT","Transitional feed-in tariff payments"]

{"sheet":"Prop2020TSSComp","index":16,"n_rows":65,"n_cols":47,"rows_kept":65,"cut":false,"hidden":false,"merged":[]}
[null,{"$f":"\"Tariff Approval - \"&'Model update'!$C$3","v":"Tariff Approval - CitiPower"},{"$f":"\"Prop\"&'Model update'!$C$5&\"TSSComp\"","v":"Prop2020TSSComp"}]
[]
[null,{"$f":"\"COMPARISON OF \"&'Model update'!$C$5&\" PROPOSED AND TSS INDICATIVE DISTRIBUTION TARIFFS\"","v":"COMPARISON OF 2020 PROPOSED AND TSS INDICATIVE DISTRIBUTION TARIFFS"},null,null,null,null,null,null,null,null,null,null,null,null,null,null,null,null,null,null,null,null,null,null,null,null,null,null,null,null,null,null,null,null,null,null,null,null,null,null,null,null,null,null,null,"Materiality threshold"]
[null,null,null,{"$f":"\"Proposed NUOS Tariffs (Pt) for \"&'Model update'!$C$5","v":"Proposed NUOS Tariffs (Pt) for 2020"},null,null,null,null,null,null,null,null,null,null,null,null,null,{"$f":"\"TSS indicative tariffs for \"&'Model update'!$C$5","v":"TSS indicative tariffs for 2020"},null,null,null,null,null,null,null,null,null,null,null,null,null,null,{"$f":"\"Percentage difference between proposed \"&'Model update'!$C$5&\" tariffs and indicative TSS tariffs\"","v":"Percentage difference between proposed 2020 tariffs and indicative TSS tariffs"},null,null,null,null,null,null,null,null,null,null,null,null,0.1]
[null,"TSS name","Proposal name","PropTar\nFixed","PropTar\nAnytime","PropTar\nPkBlk","PropTar\nOPkBlk1","PropTar\nDem kVA","PropTar\nDem kW Sum","PropTar\nDem kW Win","PropTar\nSumBlk1","PropTar\nSumBlk2","PropTar\nSumBlk3","PropTar\nWtrBlk1","PropTar\nWtrBlk2","PropTar\nWtrBlk3",null,"IndTar\nFixed","IndTar\nAnytime","IndTar\nPkBlk","IndTar\nOPkBlk1","IndTar\nDem kVA","IndTar\nDem kW Sum","IndTar\nDem kW Win","IndTar\nSumBlk1","IndTar\nSumBlk2","IndTar\nSumBlk3","IndTar\nWtrBlk1","IndTar\nWtrBlk2","IndTar\nWtrBlk3",null,null,"\nFixed","\nPkBlk1","\nPkBlk2","\nPkBlk3","\nPkBlk4","\nOPkBlk1","\nOPkBlk2","\nOPkBlk3","\nOPkBlk4","\nDemBlk1","\nDemBlk2","\nDemBlk3","\nDemBlk4","Explanation required?","Explanation"]
[null,"Residential flat",{"$f":"Prop2020DistTar!B6","v":"Residential Single Rate"},{"$f":"SUM(Prop2020DistTar!D6,Prop2020TransTar!D6,Prop2020JSTar!D6)","v":95},{"$f":"SUM(Prop2020DistTar!E6,Prop2020TransTar!E6,Prop2020JSTar!E6)","v":7.06},{"$f":"SUM(Prop2020DistTar!F6,Prop2020TransTar!F6,Prop2020JSTar!F6)","v":0},{"$f":"SUM(Prop2020DistTar!G6,Prop2020TransTar!G6,Prop2020JSTar!G6)","v":0},{"$f":"SUM(Prop2020DistTar!H6,Prop2020TransTar!H6,Prop2020JSTar!H6)","v":0},{"$f":"SUM(Prop2020DistTar!I6,Prop2020TransTar!I6,Prop2020JSTar!I6)","v":0},{"$f":"SUM(Prop2020DistTar!J6,Prop2020TransTar!J6,Prop2020JSTar!J6)","v":0},{"$f":"SUM(Prop2020DistTar!K6,Prop2020TransTar!K6,Prop2020JSTar!K6)","v":0},{"$f":"SUM(Prop2020DistTar!L6,Prop2020TransTar!L6,Prop2020JSTar!L6)","v":0},{"$f":"SUM(Prop2020DistTar!M6,Prop2020TransTar!M6,Prop2020JSTar!M6)","v":0},{"$f":"SUM(Prop2020DistTar!N6,Prop2020TransTar!N6,Prop2020JSTar!N6)","v":0},{"$f":"SUM(Prop2020DistTar!O6,Prop2020TransTar!O6,Prop2020JSTar!O6)","v":0},{"$f":"SUM(Prop2020DistTar!P6,Prop2020TransTar!P6,Prop2020JSTar!P6)","v":0},"C1R",95,6.92,0,0,0,0,0,0,0,0,0,0,0,null,null,{"$f":"IFERROR(D6/R6-1,0)","v":0},2.0231213872832221E-2,0,0,0,0,0,0,0,0,0,0,0,{"$f":"IF(MAX(ABS(AG6:AS6))>$AT$4,\"EXPLAIN\",\"\")","v":""}]
[null,"Residential flat (bulk)",{"$f":"Prop2020DistTar!B7","v":"Residential Single Rate - Bulk"},{"$f":"SUM(Prop2020DistTar!D7,Prop2020TransTar!D7,Prop2020JSTar!D7)","v":95},{"$f":"SUM(Prop2020DistTar!E7,Prop2020TransTar!E7,Prop2020JSTar!E7)","v":5.43},{"$f":"SUM(Prop2020DistTar!F7,Prop2020TransTar!F7,Prop2020JSTar!F7)","v":0},{"$f":"SUM(Prop2020DistTar!G7,Prop2020TransTar!G7,Prop2020JSTar!G7)","v":0},{"$f":"SUM(Prop2020DistTar!H7,Prop2020TransTar!H7,Prop2020JSTar!H7)","v":0},{"$f":"SUM(Prop2020DistTar!I7,Prop2020TransTar!I7,Prop2020JSTar!I7)","v":0},{"$f":"SUM(Prop2020DistTar!J7,Prop2020TransTar!J7,Prop2020JSTar!J7)","v":0},{"$f":"SUM(Prop2020DistTar!K7,Prop2020TransTar!K7,Prop2020JSTar!K7)","v":0},{"$f":"SUM(Prop2020DistTar!L7,Prop2020TransTar!L7,Prop2020JSTar!L7)","v":0},{"$f":"SUM(Prop2020DistTar!M7,Prop2020TransTar!M7,Prop2020JSTar!M7)","v":0},{"$f":"SUM(Prop2020DistTar!N7,Prop2020TransTar!N7,Prop2020JSTar!N7)","v":0},{"$f":"SUM(Prop2020DistTar!O7,Prop2020TransTar!O7,Prop2020JSTar!O7)","v":0},{"$f":"SUM(Prop2020DistTar!P7,Prop2020TransTar!P7,Prop2020JSTar!P7)","v":0},"C1RB",95,5.47,0,0,0,0,0,0,0,0,0,0,0,null,null,0,-7.3126142595978383E-3,0,0,0,0,0,0,0,0,0,0,0,{"$f":"IF(MAX(ABS(AG7:AS7))>$AT$4,\"EXPLAIN\",\"\")","v":""}]
["C1R","Residential flexible",{"$f":"Prop2020DistTar!B8","v":"Residential - flexible pricing"},{"$f":"SUM(Prop2020DistTar!D8,Prop2020TransTar!D8,Prop2020JSTar!D8)","v":95},{"$f":"SUM(Prop2020DistTar!E8,Prop2020TransTar!E8,Prop2020JSTar!E8)","v":0},{"$f":"SUM(Prop2020DistTar!F8,Prop2020TransTar!F8,Prop2020JSTar!F8)","v":0},{"$f":"SUM(Prop2020DistTar!G8,Prop2020TransTar!G8,Prop2020JSTar!G8)","v":0},{"$f":"SUM(Prop2020DistTar!H8,Prop2020TransTar!H8,Prop2020JSTar!H8)","v":0},{"$f":"SUM(Prop2020DistTar!I8,Prop2020TransTar!I8,Prop2020JSTar!I8)","v":0},{"$f":"SUM(Prop2020DistTar!J8,Prop2020TransTar!J8,Prop2020JSTar!J8)","v":0},{"$f":"SUM(Prop2020DistTar!K8,Prop2020TransTar!K8,Prop2020JSTar!K8)","v":13.4},{"$f":"SUM(Prop2020DistTar!L8,Prop2020TransTar!L8,Prop2020JSTar!L8)","v":9.0500000000000007},{"$f":"SUM(Prop2020DistTar!M8,Prop2020TransTar!M8,Prop2020JSTar!M8)","v":3.58},{"$f":"SUM(Prop2020DistTar!N8,Prop2020TransTar!N8,Prop2020JSTar!N8)","v":13.4},{"$f":"SUM(Prop2020DistTar!O8,Prop2020TransTar!O8,Prop2020JSTar!O8)","v":9.0500000000000007},{"$f":"SUM(Prop2020DistTar!P8,Prop2020TransTar!P8,Prop2020JSTar!P8)","v":3.58},"C13R",95,0,0,0,0,0,0,13.66,9.2200000000000006,3.65,13.66,9.2200000000000006,3.65,null,null,0,0,0,0,0,0,0,-1.9033674963396807E-2,-1.8438177874186557E-2,-1.9178082191780743E-2,-1.9033674963396807E-2,-1.8438177874186557E-2,-1.9178082191780743E-2,{"$f":"IF(MAX(ABS(AG8:AS8))>$AT$4,\"EXPLAIN\",\"\")","v":""}]
["C1RB","Residential flexible (bulk)",{"$f":"Prop2020DistTar!B9","v":"Residential - flexible pricing bulk"},{"$f":"SUM(Prop2020DistTar!D9,Prop2020TransTar!D9,Prop2020JSTar!D9)","v":95},{"$f":"SUM(Prop2020DistTar!E9,Prop2020TransTar!E9,Prop2020JSTar!E9)","v":0},{"$f":"SUM(Prop2020DistTar!F9,Prop2020TransTar!F9,Prop2020JSTar!F9)","v":0},{"$f":"SUM(Prop2020DistTar!G9,Prop2020TransTar!G9,Prop2020JSTar!G9)","v":0},{"$f":"SUM(Prop2020DistTar!H9,Prop2020TransTar!H9,Prop2020JSTar!H9)","v":0},{"$f":"SUM(Prop2020DistTar!I9,Prop2020TransTar!I9,Prop2020JSTar!I9)","v":0},{"$f":"SUM(Prop2020DistTar!J9,Prop2020TransTar!J9,Prop2020JSTar!J9)","v":0},{"$f":"SUM(Prop2020DistTar!K9,Prop2020TransTar!K9,Prop2020JSTar!K9)","v":12.459999999999999},{"$f":"SUM(Prop2020DistTar!L9,Prop2020TransTar!L9,Prop2020JSTar!L9)","v":8.41},{"$f":"SUM(Prop2020DistTar!M9,Prop2020TransTar!M9,Prop2020JSTar!M9)","v":3.33},{"$f":"SUM(Prop2020DistTar!N9,Prop2020TransTar!N9,Prop2020JSTar!N9)","v":12.459999999999999},{"$f":"SUM(Prop2020DistTar!O9,Prop2020TransTar!O9,Prop2020JSTar!O9)","v":8.41},{"$f":"SUM(Prop2020DistTar!P9,Prop2020TransTar!P9,Prop2020JSTar!P9)","v":3.33},"C13RB",95,0,0,0,0,0,0,11.75,7.9300000000000006,3.14,11.75,7.9300000000000006,3.14,null,null,0,0,0,0,0,0,0,6.0425531914893638E-2,6.0529634300126034E-2,6.0509554140127264E-2,6.0425531914893638E-2,6.0529634300126034E-2,6.0509554140127264E-2,{"$f":"IF(MAX(ABS(AG9:AS9))>$AT$4,\"EXPLAIN\",\"\")","v":""}]
["C13R","Residential two rate 5d",{"$f":"Prop2020DistTar!B10","v":"Residential Two Rate 5d"},{"$f":"SUM(Prop2020DistTar!D10,Prop2020TransTar!D10,Prop2020JSTar!D10)","v":95},{"$f":"SUM(Prop2020DistTar!E10,Prop2020TransTar!E10,Prop2020JSTar!E10)","v":0},{"$f":"SUM(Prop2020DistTar!F10,Prop2020TransTar!F10,Prop2020JSTar!F10)","v":12.08},{"$f":"SUM(Prop2020DistTar!G10,Prop2020TransTar!G10,Prop2020JSTar!G10)","v":3.22},{"$f":"SUM(Prop2020DistTar!H10,Prop2020TransTar!H10,Prop2020JSTar!H10)","v":0},{"$f":"SUM(Prop2020DistTar!I10,Prop2020TransTar!I10,Prop2020JSTar!I10)","v":0},{"$f":"SUM(Prop2020DistTar!J10,Prop2020TransTar!J10,Prop2020JSTar!J10)","v":0},{"$f":"SUM(Prop2020DistTar!K10,Prop2020TransTar!K10,Prop2020JSTar!K10)","v":0},{"$f":"SUM(Prop2020DistTar!L10,Prop2020TransTar!L10,Prop2020JSTar!L10)","v":0},{"$f":"SUM(Prop2020DistTar!M10,Prop2020TransTar!M10,Prop2020JSTar!M10)","v":0},{"$f":"SUM(Prop2020DistTar!N10,Prop2020TransTar!N10,Prop2020JSTar!N10)","v":0},{"$f":"SUM(Prop2020DistTar!O10,Prop2020TransTar!O10,Prop2020JSTar!O10)","v":0},{"$f":"SUM(Prop2020DistTar!P10,Prop2020TransTar!P10,Prop2020JSTar!P10)","v":0},"C2R",95,0,12.31,3.2800000000000002,0,0,0,0,0,0,0,0,0,null,null,0,0,-1.8683996750609277E-2,-1.8292682926829285E-2,0,0,0,0,0,0,0,0,0,{"$f":"IF(MAX(ABS(AG10:AS10))>$AT$4,\"EXPLAIN\",\"\")","v":""}]
["C13RB","Residential two rate 5d (bulk)",{"$f":"Prop2020DistTar!B11","v":"Residential Two Rate 5d - Bulk"},{"$f":"SUM(Prop2020DistTar!D11,Prop2020TransTar!D11,Prop2020JSTar!D11)","v":95},{"$f":"SUM(Prop2020DistTar!E11,Prop2020TransTar!E11,Prop2020JSTar!E11)","v":0},{"$f":"SUM(Prop2020DistTar!F11,Prop2020TransTar!F11,Prop2020JSTar!F11)","v":10.87},{"$f":"SUM(Prop2020DistTar!G11,Prop2020TransTar!G11,Prop2020JSTar!G11)","v":3.05},{"$f":"SUM(Prop2020DistTar!H11,Prop2020TransTar!H11,Prop2020JSTar!H11)","v":0},{"$f":"SUM(Prop2020DistTar!I11,Prop2020TransTar!I11,Prop2020JSTar!I11)","v":0},{"$f":"SUM(Prop2020DistTar!J11,Prop2020TransTar!J11,Prop2020JSTar!J11)","v":0},{"$f":"SUM(Prop2020DistTar!K11,Prop2020TransTar!K11,Prop2020JSTar!K11)","v":0},{"$f":"SUM(Prop2020DistTar!L11,Prop2020TransTar!L11,Prop2020JSTar!L11)","v":0},{"$f":"SUM(Prop2020DistTar!M11,Prop2020TransTar!M11,Prop2020JSTar!M11)","v":0},{"$f":"SUM(Prop2020DistTar!N11,Prop2020TransTar!N11,Prop2020JSTar!N11)","v":0},{"$f":"SUM(Prop2020DistTar!O11,Prop2020TransTar!O11,Prop2020JSTar!O11)","v":0},{"$f":"SUM(Prop2020DistTar!P11,Prop2020TransTar!P11,Prop2020JSTar!P11)","v":0},"C2RB",95,0,11.040000000000001,3.11,0,0,0,0,0,0,0,0,0,null,null,0,0,-1.5398550724637805E-2,-1.9292604501607746E-2,0,0,0,0,0,0,0,0,0,{"$f":"IF(MAX(ABS(AG11:AS11))>$AT$4,\"EXPLAIN\",\"\")","v":""}]
["C2R","Residential Interval",{"$f":"Prop2020DistTar!B12","v":"Residential Interval"},{"$f":"SUM(Prop2020DistTar!D12,Prop2020TransTar!D12,Prop2020JSTar!D12)","v":95},{"$f":"SUM(Prop2020DistTar!E12,Prop2020TransTar!E12,Prop2020JSTar!E12)","v":0},{"$f":"SUM(Prop2020DistTar!F12,Prop2020TransTar!F12,Prop2020JSTar!F12)","v":12.08},{"$f":"SUM(Prop2020DistTar!G12,Prop2020TransTar!G12,Prop2020JSTar!G12)","v":3.22},{"$f":"SUM(Prop2020DistTar!H12,Prop2020TransTar!H12,Prop2020JSTar!H12)","v":0},{"$f":"SUM(Prop2020DistTar!I12,Prop2020TransTar!I12,Prop2020JSTar!I12)","v":0},{"$f":"SUM(Prop2020DistTar!J12,Prop2020TransTar!J12,Prop2020JSTar!J12)","v":0},{"$f":"SUM(Prop2020DistTar!K12,Prop2020TransTar!K12,Prop2020JSTar!K12)","v":0},{"$f":"SUM(Prop2020DistTar!L12,Prop2020TransTar!L12,Prop2020JSTar!L12)","v":0},{"$f":"SUM(Prop2020DistTar!M12,Prop2020TransTar!M12,Prop2020JSTar!M12)","v":0},{"$f":"SUM(Prop2020DistTar!N12,Prop2020TransTar!N12,Prop2020JSTar!N12)","v":0},{"$f":"SUM(Prop2020DistTar!O12,Prop2020TransTar!O12,Prop2020JSTar!O12)","v":0},{"$f":"SUM(Prop2020DistTar!P12,Prop2020TransTar!P12,Prop2020JSTar!P12)","v":0},"C3R",95,0,12.31,3.2800000000000002,0,0,0,0,0,0,0,0,0,null,null,0,0,-1.8683996750609277E-2,-1.8292682926829285E-2,0,0,0,0,0,0,0,0,0,{"$f":"IF(MAX(ABS(AG12:AS12))>$AT$4,\"EXPLAIN\",\"\")","v":""}]
["C2RB","Residential Interval - Bulk",{"$f":"Prop2020DistTar!B13","v":"Residential Interval - Bulk"},{"$f":"SUM(Prop2020DistTar!D13,Prop2020TransTar!D13,Prop2020JSTar!D13)","v":95},{"$f":"SUM(Prop2020DistTar!E13,Prop2020TransTar!E13,Prop2020JSTar!E13)","v":0},{"$f":"SUM(Prop2020DistTar!F13,Prop2020TransTar!F13,Prop2020JSTar!F13)","v":10.87},{"$f":"SUM(Prop2020DistTar!G13,Prop2020TransTar!G13,Prop2020JSTar!G13)","v":3.05},{"$f":"SUM(Prop2020DistTar!H13,Prop2020TransTar!H13,Prop2020JSTar!H13)","v":0},{"$f":"SUM(Prop2020DistTar!I13,Prop2020TransTar!I13,Prop2020JSTar!I13)","v":0},{"$f":"SUM(Prop2020DistTar!J13,Prop2020TransTar!J13,Prop2020JSTar!J13)","v":0},{"$f":"SUM(Prop2020DistTar!K13,Prop2020TransTar!K13,Prop2020JSTar!K13)","v":0},{"$f":"SUM(Prop2020DistTar!L13,Prop2020TransTar!L13,Prop2020JSTar!L13)","v":0},{"$f":"SUM(Prop2020DistTar!M13,Prop2020TransTar!M13,Prop2020JSTar!M13)","v":0},{"$f":"SUM(Prop2020DistTar!N13,Prop2020TransTar!N13,Prop2020JSTar!N13)","v":0},{"$f":"SUM(Prop2020DistTar!O13,Prop2020TransTar!O13,Prop2020JSTar!O13)","v":0},{"$f":"SUM(Prop2020DistTar!P13,Prop2020TransTar!P13,Prop2020JSTar!P13)","v":0},"C3RB",95,0,11.040000000000001,3.11,0,0,0,0,0,0,0,0,0,null,null,0,0,-1.5398550724637805E-2,-1.9292604501607746E-2,0,0,0,0,0,0,0,0,0,{"$f":"IF(MAX(ABS(AG13:AS13))>$AT$4,\"EXPLAIN\",\"\")","v":""}]
["C3R","Residential controlled load",{"$f":"Prop2020DistTar!B14","v":"Residential Two Rate 5d - Controlled Load"},{"$f":"SUM(Prop2020DistTar!D14,Prop2020TransTar!D14,Prop2020JSTar!D14)","v":0},{"$f":"SUM(Prop2020DistTar!E14,Prop2020TransTar!E14,Prop2020JSTar!E14)","v":0},{"$f":"SUM(Prop2020DistTar!F14,Prop2020TransTar!F14,Prop2020JSTar!F14)","v":0},{"$f":"SUM(Prop2020DistTar!G14,Prop2020TransTar!G14,Prop2020JSTar!G14)","v":0},{"$f":"SUM(Prop2020DistTar!H14,Prop2020TransTar!H14,Prop2020JSTar!H14)","v":0},{"$f":"SUM(Prop2020DistTar!I14,Prop2020TransTar!I14,Prop2020JSTar!I14)","v":0},{"$f":"SUM(Prop2020DistTar!J14,Prop2020TransTar!J14,Prop2020JSTar!J14)","v":0},{"$f":"SUM(Prop2020DistTar!K14,Prop2020TransTar!K14,Prop2020JSTar!K14)","v":0},{"$f":"SUM(Prop2020DistTar!L14,Prop2020TransTar!L14,Prop2020JSTar!L14)","v":0},{"$f":"SUM(Prop2020DistTar!M14,Prop2020TransTar!M14,Prop2020JSTar!M14)","v":0},{"$f":"SUM(Prop2020DistTar!N14,Prop2020TransTar!N14,Prop2020JSTar!N14)","v":0},{"$f":"SUM(Prop2020DistTar!O14,Prop2020TransTar!O14,Prop2020JSTar!O14)","v":0},{"$f":"SUM(Prop2020DistTar!P14,Prop2020TransTar!P14,Prop2020JSTar!P14)","v":0},"C2ROP",0,0,0,2.27,0,0,0,0,0,0,0,0,0,null,null,0,0,0,-1,0,0,0,0,0,0,0,0,0,{"$f":"IF(MAX(ABS(AG14:AS14))>$AT$4,\"EXPLAIN\",\"\")","v":"EXPLAIN"},"Customers from C2ROP and C2RBOP are transferred to CDS and CDSB respectevly"]
["C3RB","Residential controlled load (bulk)",{"$f":"Prop2020DistTar!B15","v":"Residential Two Rate 5d - Bulk - Controlled Load"},{"$f":"SUM(Prop2020DistTar!D15,Prop2020TransTar!D15,Prop2020JSTar!D15)","v":0},{"$f":"SUM(Prop2020DistTar!E15,Prop2020TransTar!E15,Prop2020JSTar!E15)","v":0},{"$f":"SUM(Prop2020DistTar!F15,Prop2020TransTar!F15,Prop2020JSTar!F15)","v":0},{"$f":"SUM(Prop2020DistTar!G15,Prop2020TransTar!G15,Prop2020JSTar!G15)","v":0},{"$f":"SUM(Prop2020DistTar!H15,Prop2020TransTar!H15,Prop2020JSTar!H15)","v":0},{"$f":"SUM(Prop2020DistTar!I15,Prop2020TransTar!I15,Prop2020JSTar!I15)","v":0},{"$f":"SUM(Prop2020DistTar!J15,Prop2020TransTar!J15,Prop2020JSTar!J15)","v":0},{"$f":"SUM(Prop2020DistTar!K15,Prop2020TransTar!K15,Prop2020JSTar!K15)","v":0},{"$f":"SUM(Prop2020DistTar!L15,Prop2020TransTar!L15,Prop2020JSTar!L15)","v":0},{"$f":"SUM(Prop2020DistTar!M15,Prop2020TransTar!M15,Prop2020JSTar!M15)","v":0},{"$f":"SUM(Prop2020DistTar!N15,Prop2020TransTar!N15,Prop2020JSTar!N15)","v":0},{"$f":"SUM(Prop2020DistTar!O15,Prop2020TransTar!O15,Prop2020JSTar!O15)","v":0},{"$f":"SUM(Prop2020DistTar!P15,Prop2020TransTar!P15,Prop2020JSTar!P15)","v":0},"C2RBOP",0,0,0,1.87,0,0,0,0,0,0,0,0,0,null,null,0,0,0,-1,0,0,0,0,0,0,0,0,0,{"$f":"IF(MAX(ABS(AG15:AS15))>$AT$4,\"EXPLAIN\",\"\")","v":"EXPLAIN"},"Customers from C2ROP and C2RBOP are transferred to CDS and CDSB respectevly"]
["C2ROP","Dedicated Circuit",{"$f":"Prop2020DistTar!B16","v":"Dedicated Circuit"},{"$f":"SUM(Prop2020DistTar!D16,Prop2020TransTar!D16,Prop2020JSTar!D16)","v":0},{"$f":"SUM(Prop2020DistTar!E16,Prop2020TransTar!E16,Prop2020JSTar!E16)","v":0},{"$f":"SUM(Prop2020DistTar!F16,Prop2020TransTar!F16,Prop2020JSTar!F16)","v":0},{"$f":"SUM(Prop2020DistTar!G16,Prop2020TransTar!G16,Prop2020JSTar!G16)","v":2.23},{"$f":"SUM(Prop2020DistTar!H16,Prop2020TransTar!H16,Prop2020JSTar!H16)","v":0},{"$f":"SUM(Prop2020DistTar!I16,Prop2020TransTar!I16,Prop2020JSTar!I16)","v":0},{"$f":"SUM(Prop2020DistTar!J16,Prop2020TransTar!J16,Prop2020JSTar!J16)","v":0},{"$f":"SUM(Prop2020DistTar!K16,Prop2020TransTar!K16,Prop2020JSTar!K16)","v":0},{"$f":"SUM(Prop2020DistTar!L16,Prop2020TransTar!L16,Prop2020JSTar!L16)","v":0},{"$f":"SUM(Prop2020DistTar!M16,Prop2020TransTar!M16,Prop2020JSTar!M16)","v":0},{"$f":"SUM(Prop2020DistTar!N16,Prop2020TransTar!N16,Prop2020JSTar!N16)","v":0},{"$f":"SUM(Prop2020DistTar!O16,Prop2020TransTar!O16,Prop2020JSTar!O16)","v":0},{"$f":"SUM(Prop2020DistTar!P16,Prop2020TransTar!P16,Prop2020JSTar!P16)","v":0},"CDS",0,0,0,2.27,0,0,0,0,0,0,0,0,0,null,null,0,0,0,-1.7621145374449365E-2,0,0,0,0,0,0,0,0,0]
["C2RBOP","Dedicated Circuit - Bulk",{"$f":"Prop2020DistTar!B17","v":"Dedicated Circuit - Bulk"},{"$f":"SUM(Prop2020DistTar!D17,Prop2020TransTar!D17,Prop2020JSTar!D17)","v":0},{"$f":"SUM(Prop2020DistTar!E17,Prop2020TransTar!E17,Prop2020JSTar!E17)","v":0},{"$f":"SUM(Prop2020DistTar!F17,Prop2020TransTar!F17,Prop2020JSTar!F17)","v":0},{"$f":"SUM(Prop2020DistTar!G17,Prop2020TransTar!G17,Prop2020JSTar!G17)","v":1.83},{"$f":"SUM(Prop2020DistTar!H17,Prop2020TransTar!H17,Prop2020JSTar!H17)","v":0},{"$f":"SUM(Prop2020DistTar!I17,Prop2020TransTar!I17,Prop2020JSTar!I17)","v":0},{"$f":"SUM(Prop2020DistTar!J17,Prop2020TransTar!J17,Prop2020JSTar!J17)","v":0},{"$f":"SUM(Prop2020DistTar!K17,Prop2020TransTar!K17,Prop2020JSTar!K17)","v":0},{"$f":"SUM(Prop2020DistTar!L17,Prop2020TransTar!L17,Prop2020JSTar!L17)","v":0},{"$f":"SUM(Prop2020DistTar!M17,Prop2020TransTar!M17,Prop2020JSTar!M17)","v":0},{"$f":"SUM(Prop2020DistTar!N17,Prop2020TransTar!N17,Prop2020JSTar!N17)","v":0},{"$f":"SUM(Prop2020DistTar!O17,Prop2020TransTar!O17,Prop2020JSTar!O17)","v":0},{"$f":"SUM(Prop2020DistTar!P17,Prop2020TransTar!P17,Prop2020JSTar!P17)","v":0},"CDSB",0,0,0,1.87,0,0,0,0,0,0,0,0,0,null,null,0,0,0,-2.1390374331550777E-2,0,0,0,0,0,0,0,0,0,{"$f":"IF(MAX(ABS(AG17:AS17))>$AT$4,\"EXPLAIN\",\"\")","v":""}]
["CDS","Residential cost-reflective",{"$f":"Prop2020DistTar!B18","v":"Residential Demand"},{"$f":"SUM(Prop2020DistTar!D18,Prop2020TransTar!D18,Prop2020JSTar!D18)","v":95},{"$f":"SUM(Prop2020DistTar!E18,Prop2020TransTar!E18,Prop2020JSTar!E18)","v":3.6300000000000003},{"$f":"SUM(Prop2020DistTar!F18,Prop2020TransTar!F18,Prop2020JSTar!F18)","v":0},{"$f":"SUM(Prop2020DistTar!G18,Prop2020TransTar!G18,Prop2020JSTar!G18)","v":0},{"$f":"SUM(Prop2020DistTar!H18,Prop2020TransTar!H18,Prop2020JSTar!H18)","v":0},{"$f":"SUM(Prop2020DistTar!I18,Prop2020TransTar!I18,Prop2020JSTar!I18)","v":8.7099999999999991},{"$f":"SUM(Prop2020DistTar!J18,Prop2020TransTar!J18,Prop2020JSTar!J18)","v":2.9899999999999998},{"$f":"SUM(Prop2020DistTar!K18,Prop2020TransTar!K18,Prop2020JSTar!K18)","v":0},{"$f":"SUM(Prop2020DistTar!L18,Prop2020TransTar!L18,Prop2020JSTar!L18)","v":0},{"$f":"SUM(Prop2020DistTar!M18,Prop2020TransTar!M18,Prop2020JSTar!M18)","v":0},{"$f":"SUM(Prop2020DistTar!N18,Prop2020TransTar!N18,Prop2020JSTar!N18)","v":0},{"$f":"SUM(Prop2020DistTar!O18,Prop2020TransTar!O18,Prop2020JSTar!O18)","v":0},{"$f":"SUM(Prop2020DistTar!P18,Prop2020TransTar!P18,Prop2020JSTar!P18)","v":0},"CR",95,3.7,0,0,0,8.8800000000000008,3.0500000000000003,0,0,0,0,0,0,null,null,0,-1.8918918918918837E-2,0,0,0,-1.9144144144144337E-2,-1.9672131147541183E-2,0,0,0,0,0,0,{"$f":"IF(MAX(ABS(AG18:AS18))>$AT$4,\"EXPLAIN\",\"\")","v":""}]
["CDSB","Residential cost-reflective (bulk)",{"$f":"Prop2020DistTar!B19","v":"Residential Bulk Demand"},{"$f":"SUM(Prop2020DistTar!D19,Prop2020TransTar!D19,Prop2020JSTar!D19)","v":95},{"$f":"SUM(Prop2020DistTar!E19,Prop2020TransTar!E19,Prop2020JSTar!E19)","v":2.9000000000000004},{"$f":"SUM(Prop2020DistTar!F19,Prop2020TransTar!F19,Prop2020JSTar!F19)","v":0},{"$f":"SUM(Prop2020DistTar!G19,Prop2020TransTar!G19,Prop2020JSTar!G19)","v":0},{"$f":"SUM(Prop2020DistTar!H19,Prop2020TransTar!H19,Prop2020JSTar!H19)","v":0},{"$f":"SUM(Prop2020DistTar!I19,Prop2020TransTar!I19,Prop2020JSTar!I19)","v":7.09},{"$f":"SUM(Prop2020DistTar!J19,Prop2020TransTar!J19,Prop2020JSTar!J19)","v":2.39},{"$f":"SUM(Prop2020DistTar!K19,Prop2020TransTar!K19,Prop2020JSTar!K19)","v":0},{"$f":"SUM(Prop2020DistTar!L19,Prop2020TransTar!L19,Prop2020JSTar!L19)","v":0},{"$f":"SUM(Prop2020DistTar!M19,Prop2020TransTar!M19,Prop2020JSTar!M19)","v":0},{"$f":"SUM(Prop2020DistTar!N19,Prop2020TransTar!N19,Prop2020JSTar!N19)","v":0},{"$f":"SUM(Prop2020DistTar!O19,Prop2020TransTar!O19,Prop2020JSTar!O19)","v":0},{"$f":"SUM(Prop2020DistTar!P19,Prop2020TransTar!P19,Prop2020JSTar!P19)","v":0},"CRB",95,2.7600000000000002,0,0,0,7.23,2.4300000000000002,0,0,0,0,0,0,null,null,0,5.0724637681159424E-2,0,0,0,-1.9363762102351356E-2,-1.6460905349794275E-2,0,0,0,0,0,0,{"$f":"IF(MAX(ABS(AG19:AS19))>$AT$4,\"EXPLAIN\",\"\")","v":""}]
["CR","Small business flat",{"$f":"Prop2020DistTar!B20","v":"Non-Residential Single Rate"},{"$f":"SUM(Prop2020DistTar!D20,Prop2020TransTar!D20,Prop2020JSTar!D20)","v":160},{"$f":"SUM(Prop2020DistTar!E20,Prop2020TransTar!E20,Prop2020JSTar!E20)","v":8.64},{"$f":"SUM(Prop2020DistTar!F20,Prop2020TransTar!F20,Prop2020JSTar!F20)","v":0},{"$f":"SUM(Prop2020DistTar!G20,Prop2020TransTar!G20,Prop2020JSTar!G20)","v":0},{"$f":"SUM(Prop2020DistTar!H20,Prop2020TransTar!H20,Prop2020JSTar!H20)","v":0},{"$f":"SUM(Prop2020DistTar!I20,Prop2020TransTar!I20,Prop2020JSTar!I20)","v":0},{"$f":"SUM(Prop2020DistTar!J20,Prop2020TransTar!J20,Prop2020JSTar!J20)","v":0},{"$f":"SUM(Prop2020DistTar!K20,Prop2020TransTar!K20,Prop2020JSTar!K20)","v":0},{"$f":"SUM(Prop2020DistTar!L20,Prop2020TransTar!L20,Prop2020JSTar!L20)","v":0},{"$f":"SUM(Prop2020DistTar!M20,Prop2020TransTar!M20,Prop2020JSTar!M20)","v":0},{"$f":"SUM(Prop2020DistTar!N20,Prop2020TransTar!N20,Prop2020JSTar!N20)","v":0},{"$f":"SUM(Prop2020DistTar!O20,Prop2020TransTar!O20,Prop2020JSTar!O20)","v":0},{"$f":"SUM(Prop2020DistTar!P20,Prop2020TransTar!P20,Prop2020JSTar!P20)","v":0},"C1G",160,8.4,0,0,0,0,0,0,0,0,0,0,0,null,null,0,2.8571428571428692E-2,0,0,0,0,0,0,0,0,0,0,0,{"$f":"IF(MAX(ABS(AG20:AS20))>$AT$4,\"EXPLAIN\",\"\")","v":""}]
["CRB","Small business flat (bulk)",{"$f":"Prop2020DistTar!B21","v":"Non-Residential Single Rate - Bulk"},{"$f":"SUM(Prop2020DistTar!D21,Prop2020TransTar!D21,Prop2020JSTar!D21)","v":160},{"$f":"SUM(Prop2020DistTar!E21,Prop2020TransTar!E21,Prop2020JSTar!E21)","v":7.34},{"$f":"SUM(Prop2020DistTar!F21,Prop2020TransTar!F21,Prop2020JSTar!F21)","v":0},{"$f":"SUM(Prop2020DistTar!G21,Prop2020TransTar!G21,Prop2020JSTar!G21)","v":0},{"$f":"SUM(Prop2020DistTar!H21,Prop2020TransTar!H21,Prop2020JSTar!H21)","v":0},{"$f":"SUM(Prop2020DistTar!I21,Prop2020TransTar!I21,Prop2020JSTar!I21)","v":0},{"$f":"SUM(Prop2020DistTar!J21,Prop2020TransTar!J21,Prop2020JSTar!J21)","v":0},{"$f":"SUM(Prop2020DistTar!K21,Prop2020TransTar!K21,Prop2020JSTar!K21)","v":0},{"$f":"SUM(Prop2020DistTar!L21,Prop2020TransTar!L21,Prop2020JSTar!L21)","v":0},{"$f":"SUM(Prop2020DistTar!M21,Prop2020TransTar!M21,Prop2020JSTar!M21)","v":0},{"$f":"SUM(Prop2020DistTar!N21,Prop2020TransTar!N21,Prop2020JSTar!N21)","v":0},{"$f":"SUM(Prop2020DistTar!O21,Prop2020TransTar!O21,Prop2020JSTar!O21)","v":0},{"$f":"SUM(Prop2020DistTar!P21,Prop2020TransTar!P21,Prop2020JSTar!P21)","v":0},"C1GB",160,7.03,0,0,0,0,0,0,0,0,0,0,0,null,null,0,4.409672830725464E-2,0,0,0,0,0,0,0,0,0,0,0,{"$f":"IF(MAX(ABS(AG21:AS21))>$AT$4,\"EXPLAIN\",\"\")","v":""}]
["C1G","Non-residential two rate 5d",{"$f":"Prop2020DistTar!B22","v":"Non-Residential Two Rate 5d"},{"$f":"SUM(Prop2020DistTar!D22,Prop2020TransTar!D22,Prop2020JSTar!D22)","v":160},{"$f":"SUM(Prop2020DistTar!E22,Prop2020TransTar!E22,Prop2020JSTar!E22)","v":0},{"$f":"SUM(Prop2020DistTar!F22,Prop2020TransTar!F22,Prop2020JSTar!F22)","v":12.510000000000002},{"$f":"SUM(Prop2020DistTar!G22,Prop2020TransTar!G22,Prop2020JSTar!G22)","v":3.9499999999999997},{"$f":"SUM(Prop2020DistTar!H22,Prop2020TransTar!H22,Prop2020JSTar!H22)","v":0},{"$f":"SUM(Prop2020DistTar!I22,Prop2020TransTar!I22,Prop2020JSTar!I22)","v":0},{"$f":"SUM(Prop2020DistTar!J22,Prop2020TransTar!J22,Prop2020JSTar!J22)","v":0},{"$f":"SUM(Prop2020DistTar!K22,Prop2020TransTar!K22,Prop2020JSTar!K22)","v":0},{"$f":"SUM(Prop2020DistTar!L22,Prop2020TransTar!L22,Prop2020JSTar!L22)","v":0},{"$f":"SUM(Prop2020DistTar!M22,Prop2020TransTar!M22,Prop2020JSTar!M22)","v":0},{"$f":"SUM(Prop2020DistTar!N22,Prop2020TransTar!N22,Prop2020JSTar!N22)","v":0},{"$f":"SUM(Prop2020DistTar!O22,Prop2020TransTar!O22,Prop2020JSTar!O22)","v":0},{"$f":"SUM(Prop2020DistTar!P22,Prop2020TransTar!P22,Prop2020JSTar!P22)","v":0},"C2G5",160,0,12.6,3.98,0,0,0,0,0,0,0,0,0,null,null,0,0,-7.1428571428570065E-3,-7.5376884422111434E-3,0,0,0,0,0,0,0,0,0,{"$f":"IF(MAX(ABS(AG22:AS22))>$AT$4,\"EXPLAIN\",\"\")","v":""}]
["C1GB","Non-residential two rate 5d (bulk)",{"$f":"Prop2020DistTar!B23","v":"Non-Residential Two Rate 5d - Bulk"},{"$f":"SUM(Prop2020DistTar!D23,Prop2020TransTar!D23,Prop2020JSTar!D23)","v":160},{"$f":"SUM(Prop2020DistTar!E23,Prop2020TransTar!E23,Prop2020JSTar!E23)","v":0},{"$f":"SUM(Prop2020DistTar!F23,Prop2020TransTar!F23,Prop2020JSTar!F23)","v":10.38},{"$f":"SUM(Prop2020DistTar!G23,Prop2020TransTar!G23,Prop2020JSTar!G23)","v":3.3899999999999997},{"$f":"SUM(Prop2020DistTar!H23,Prop2020TransTar!H23,Prop2020JSTar!H23)","v":0},{"$f":"SUM(Prop2020DistTar!I23,Prop2020TransTar!I23,Prop2020JSTar!I23)","v":0},{"$f":"SUM(Prop2020DistTar!J23,Prop2020TransTar!J23,Prop2020JSTar!J23)","v":0},{"$f":"SUM(Prop2020DistTar!K23,Prop2020TransTar!K23,Prop2020JSTar!K23)","v":0},{"$f":"SUM(Prop2020DistTar!L23,Prop2020TransTar!L23,Prop2020JSTar!L23)","v":0},{"$f":"SUM(Prop2020DistTar!M23,Prop2020TransTar!M23,Prop2020JSTar!M23)","v":0},{"$f":"SUM(Prop2020DistTar!N23,Prop2020TransTar!N23,Prop2020JSTar!N23)","v":0},{"$f":"SUM(Prop2020DistTar!O23,Prop2020TransTar!O23,Prop2020JSTar!O23)","v":0},{"$f":"SUM(Prop2020DistTar!P23,Prop2020TransTar!P23,Prop2020JSTar!P23)","v":0},"C2G5B",160,0,10.200000000000001,3.41,0,0,0,0,0,0,0,0,0,null,null,0,0,1.7647058823529349E-2,-5.8651026392962935E-3,0,0,0,0,0,0,0,0,0,{"$f":"IF(MAX(ABS(AG23:AS23))>$AT$4,\"EXPLAIN\",\"\")","v":""}]
["C2G5","Non-Residential Interval",{"$f":"Prop2020DistTar!B24","v":"Non-Residential Interval"},{"$f":"SUM(Prop2020DistTar!D24,Prop2020TransTar!D24,Prop2020JSTar!D24)","v":160},{"$f":"SUM(Prop2020DistTar!E24,Prop2020TransTar!E24,Prop2020JSTar!E24)","v":0},{"$f":"SUM(Prop2020DistTar!F24,Prop2020TransTar!F24,Prop2020JSTar!F24)","v":12.510000000000002},{"$f":"SUM(Prop2020DistTar!G24,Prop2020TransTar!G24,Prop2020JSTar!G24)","v":3.6599999999999997},{"$f":"SUM(Prop2020DistTar!H24,Prop2020TransTar!H24,Prop2020JSTar!H24)","v":0},{"$f":"SUM(Prop2020DistTar!I24,Prop2020TransTar!I24,Prop2020JSTar!I24)","v":0},{"$f":"SUM(Prop2020DistTar!J24,Prop2020TransTar!J24,Prop2020JSTar!J24)","v":0},{"$f":"SUM(Prop2020DistTar!K24,Prop2020TransTar!K24,Prop2020JSTar!K24)","v":0},{"$f":"SUM(Prop2020DistTar!L24,Prop2020TransTar!L24,Prop2020JSTar!L24)","v":0},{"$f":"SUM(Prop2020DistTar!M24,Prop2020TransTar!M24,Prop2020JSTar!M24)","v":0},{"$f":"SUM(Prop2020DistTar!N24,Prop2020TransTar!N24,Prop2020JSTar!N24)","v":0},{"$f":"SUM(Prop2020DistTar!O24,Prop2020TransTar!O24,Prop2020JSTar!O24)","v":0},{"$f":"SUM(Prop2020DistTar!P24,Prop2020TransTar!P24,Prop2020JSTar!P24)","v":0},"C3G",160,0,12.6,3.69,0,0,0,0,0,0,0,0,0,null,null,0,0,-7.1428571428570065E-3,-8.1300813008130524E-3,0,0,0,0,0,0,0,0,0,{"$f":"IF(MAX(ABS(AG24:AS24))>$AT$4,\"EXPLAIN\",\"\")","v":""}]
["C2G5B","Non-Residential Interval - Bulk",{"$f":"Prop2020DistTar!B25","v":"Non-Residential Interval - Bulk"},{"$f":"SUM(Prop2020DistTar!D25,Prop2020TransTar!D25,Prop2020JSTar!D25)","v":160},{"$f":"SUM(Prop2020DistTar!E25,Prop2020TransTar!E25,Prop2020JSTar!E25)","v":0},{"$f":"SUM(Prop2020DistTar!F25,Prop2020TransTar!F25,Prop2020JSTar!F25)","v":10.38},{"$f":"SUM(Prop2020DistTar!G25,Prop2020TransTar!G25,Prop2020JSTar!G25)","v":3.3899999999999997},{"$f":"SUM(Prop2020DistTar!H25,Prop2020TransTar!H25,Prop2020JSTar!H25)","v":0},{"$f":"SUM(Prop2020DistTar!I25,Prop2020TransTar!I25,Prop2020JSTar!I25)","v":0},{"$f":"SUM(Prop2020DistTar!J25,Prop2020TransTar!J25,Prop2020JSTar!J25)","v":0},{"$f":"SUM(Prop2020DistTar!K25,Prop2020TransTar!K25,Prop2020JSTar!K25)","v":0},{"$f":"SUM(Prop2020DistTar!L25,Prop2020TransTar!L25,Prop2020JSTar!L25)","v":0},{"$f":"SUM(Prop2020DistTar!M25,Prop2020TransTar!M25,Prop2020JSTar!M25)","v":0},{"$f":"SUM(Prop2020DistTar!N25,Prop2020TransTar!N25,Prop2020JSTar!N25)","v":0},{"$f":"SUM(Prop2020DistTar!O25,Prop2020TransTar!O25,Prop2020JSTar!O25)","v":0},{"$f":"SUM(Prop2020DistTar!P25,Prop2020TransTar!P25,Prop2020JSTar!P25)","v":0},"C3GB",160,0,10.200000000000001,3.41,0,0,0,0,0,0,0,0,0,null,null,0,0,1.7647058823529349E-2,-5.8651026392962935E-3,0,0,0,0,{"$f":"IFERROR(L25/Z25-1,0)","v":0},0,0,0,0,{"$f":"IF(MAX(ABS(AG25:AS25))>$AT$4,\"EXPLAIN\",\"\")","v":""}]
["C3G","Non-residential flexible pricing",{"$f":"Prop2020DistTar!B26","v":"Non-Residential Flexible Pricing"},{"$f":"SUM(Prop2020DistTar!D26,Prop2020TransTar!D26,Prop2020JSTar!D26)","v":160},{"$f":"SUM(Prop2020DistTar!E26,Prop2020TransTar!E26,Prop2020JSTar!E26)","v":0},{"$f":"SUM(Prop2020DistTar!F26,Prop2020TransTar!F26,Prop2020JSTar!F26)","v":0},{"$f":"SUM(Prop2020DistTar!G26,Prop2020TransTar!G26,Prop2020JSTar!G26)","v":0},{"$f":"SUM(Prop2020DistTar!H26,Prop2020TransTar!H26,Prop2020JSTar!H26)","v":0},{"$f":"SUM(Prop2020DistTar!I26,Prop2020TransTar!I26,Prop2020JSTar!I26)","v":0},{"$f":"SUM(Prop2020DistTar!J26,Prop2020TransTar!J26,Prop2020JSTar!J26)","v":0},{"$f":"SUM(Prop2020DistTar!K26,Prop2020TransTar!K26,Prop2020JSTar!K26)","v":15.23},{"$f":"SUM(Prop2020DistTar!L26,Prop2020TransTar!L26,Prop2020JSTar!L26)","v":10.65},{"$f":"SUM(Prop2020DistTar!M26,Prop2020TransTar!M26,Prop2020JSTar!M26)","v":4.22},{"$f":"SUM(Prop2020DistTar!N26,Prop2020TransTar!N26,Prop2020JSTar!N26)","v":15.23},{"$f":"SUM(Prop2020DistTar!O26,Prop2020TransTar!O26,Prop2020JSTar!O26)","v":10.65},{"$f":"SUM(Prop2020DistTar!P26,Prop2020TransTar!P26,Prop2020JSTar!P26)","v":4.22},"C14G",160,0,0,0,0,0,0,15.34,10.73,4.25,15.34,10.73,4.25,null,null,{"$f":"IFERROR(D26/R26-1,0)","v":0},0,0,0,0,0,0,-7.1707953063885332E-3,-7.45573159366264E-3,-7.058823529411784E-3,-7.1707953063885332E-3,-7.45573159366264E-3,-7.058823529411784E-3,{"$f":"IF(MAX(ABS(AG26:AS26))>$AT$4,\"EXPLAIN\",\"\")","v":""}]
["C3GB","Non-residential flexible pricing (bulk)",{"$f":"Prop2020DistTar!B27","v":"Non-Residential - Flexible Pricing Bulk"},{"$f":"SUM(Prop2020DistTar!D27,Prop2020TransTar!D27,Prop2020JSTar!D27)","v":160},{"$f":"SUM(Prop2020DistTar!E27,Prop2020TransTar!E27,Prop2020JSTar!E27)","v":0},{"$f":"SUM(Prop2020DistTar!F27,Prop2020TransTar!F27,Prop2020JSTar!F27)","v":0},{"$f":"SUM(Prop2020DistTar!G27,Prop2020TransTar!G27,Prop2020JSTar!G27)","v":0},{"$f":"SUM(Prop2020DistTar!H27,Prop2020TransTar!H27,Prop2020JSTar!H27)","v":0},{"$f":"SUM(Prop2020DistTar!I27,Prop2020TransTar!I27,Prop2020JSTar!I27)","v":0},{"$f":"SUM(Prop2020DistTar!J27,Prop2020TransTar!J27,Prop2020JSTar!J27)","v":0},{"$f":"SUM(Prop2020DistTar!K27,Prop2020TransTar!K27,Prop2020JSTar!K27)","v":13.71},{"$f":"SUM(Prop2020DistTar!L27,Prop2020TransTar!L27,Prop2020JSTar!L27)","v":9.5900000000000016},{"$f":"SUM(Prop2020DistTar!M27,Prop2020TransTar!M27,Prop2020JSTar!M27)","v":3.8},{"$f":"SUM(Prop2020DistTar!N27,Prop2020TransTar!N27,Prop2020JSTar!N27)","v":13.71},{"$f":"SUM(Prop2020DistTar!O27,Prop2020TransTar!O27,Prop2020JSTar!O27)","v":9.5900000000000016},{"$f":"SUM(Prop2020DistTar!P27,Prop2020TransTar!P27,Prop2020JSTar!P27)","v":3.8},"C14GB",160,0,0,0,0,0,0,13.73,9.620000000000001,3.81,13.73,9.620000000000001,3.81,null,null,0,0,0,0,0,0,0,-1.4566642388929019E-3,-3.1185031185030354E-3,-2.624671916010568E-3,-1.4566642388929019E-3,-3.1185031185030354E-3,-2.624671916010568E-3,{"$f":"IF(MAX(ABS(AG27:AS27))>$AT$4,\"EXPLAIN\",\"\")","v":""}]
["C14G","Non-residential two rate 7d",{"$f":"Prop2020DistTar!B28","v":"Non-Residential Two Rate 7d"},{"$f":"SUM(Prop2020DistTar!D28,Prop2020TransTar!D28,Prop2020JSTar!D28)","v":160},{"$f":"SUM(Prop2020DistTar!E28,Prop2020TransTar!E28,Prop2020JSTar!E28)","v":0},{"$f":"SUM(Prop2020DistTar!F28,Prop2020TransTar!F28,Prop2020JSTar!F28)","v":9.85},{"$f":"SUM(Prop2020DistTar!G28,Prop2020TransTar!G28,Prop2020JSTar!G28)","v":3.6599999999999997},{"$f":"SUM(Prop2020DistTar!H28,Prop2020TransTar!H28,Prop2020JSTar!H28)","v":0},{"$f":"SUM(Prop2020DistTar!I28,Prop2020TransTar!I28,Prop2020JSTar!I28)","v":0},{"$f":"SUM(Prop2020DistTar!J28,Prop2020TransTar!J28,Prop2020JSTar!J28)","v":0},{"$f":"SUM(Prop2020DistTar!K28,Prop2020TransTar!K28,Prop2020JSTar!K28)","v":0},{"$f":"SUM(Prop2020DistTar!L28,Prop2020TransTar!L28,Prop2020JSTar!L28)","v":0},{"$f":"SUM(Prop2020DistTar!M28,Prop2020TransTar!M28,Prop2020JSTar!M28)","v":0},{"$f":"SUM(Prop2020DistTar!N28,Prop2020TransTar!N28,Prop2020JSTar!N28)","v":0},{"$f":"SUM(Prop2020DistTar!O28,Prop2020TransTar!O28,Prop2020JSTar!O28)","v":0},{"$f":"SUM(Prop2020DistTar!P28,Prop2020TransTar!P28,Prop2020JSTar!P28)","v":0},"C2G7",160,0,9.92,3.69,0,0,0,0,0,0,0,0,0,null,null,0,0,-7.0564516129032473E-3,-8.1300813008130524E-3,0,0,0,0,0,0,0,0,0,{"$f":"IF(MAX(ABS(AG28:AS28))>$AT$4,\"EXPLAIN\",\"\")","v":""}]
["C14GB","Non-residential two rate 7d (bulk)",{"$f":"Prop2020DistTar!B29","v":"Non-Residential Two Rate 7d - Bulk"},{"$f":"SUM(Prop2020DistTar!D29,Prop2020TransTar!D29,Prop2020JSTar!D29)","v":160},{"$f":"SUM(Prop2020DistTar!E29,Prop2020TransTar!E29,Prop2020JSTar!E29)","v":0},{"$f":"SUM(Prop2020DistTar!F29,Prop2020TransTar!F29,Prop2020JSTar!F29)","v":9.06},{"$f":"SUM(Prop2020DistTar!G29,Prop2020TransTar!G29,Prop2020JSTar!G29)","v":3.3899999999999997},{"$f":"SUM(Prop2020DistTar!H29,Prop2020TransTar!H29,Prop2020JSTar!H29)","v":0},{"$f":"SUM(Prop2020DistTar!I29,Prop2020TransTar!I29,Prop2020JSTar!I29)","v":0},{"$f":"SUM(Prop2020DistTar!J29,Prop2020TransTar!J29,Prop2020JSTar!J29)","v":0},{"$f":"SUM(Prop2020DistTar!K29,Prop2020TransTar!K29,Prop2020JSTar!K29)","v":0},{"$f":"SUM(Prop2020DistTar!L29,Prop2020TransTar!L29,Prop2020JSTar!L29)","v":0},{"$f":"SUM(Prop2020DistTar!M29,Prop2020TransTar!M29,Prop2020JSTar!M29)","v":0},{"$f":"SUM(Prop2020DistTar!N29,Prop2020TransTar!N29,Prop2020JSTar!N29)","v":0},{"$f":"SUM(Prop2020DistTar!O29,Prop2020TransTar!O29,Prop2020JSTar!O29)","v":0},{"$f":"SUM(Prop2020DistTar!P29,Prop2020TransTar!P29,Prop2020JSTar!P29)","v":0},"C2G7B",160,0,8.9700000000000006,3.41,0,0,0,0,0,0,0,0,0,null,null,0,0,1.0033444816053505E-2,-5.8651026392962935E-3,0,0,0,0,0,0,0,0,0,{"$f":"IF(MAX(ABS(AG29:AS29))>$AT$4,\"EXPLAIN\",\"\")","v":""}]
["C2G7","Large two rate 7d",{"$f":"Prop2020DistTar!B30","v":"Large Two Rate 7d"},{"$f":"SUM(Prop2020DistTar!D30,Prop2020TransTar!D30,Prop2020JSTar!D30)","v":160},{"$f":"SUM(Prop2020DistTar!E30,Prop2020TransTar!E30,Prop2020JSTar!E30)","v":0},{"$f":"SUM(Prop2020DistTar!F30,Prop2020TransTar!F30,Prop2020JSTar!F30)","v":12.510000000000002},{"$f":"SUM(Prop2020DistTar!G30,Prop2020TransTar!G30,Prop2020JSTar!G30)","v":3.9499999999999997},{"$f":"SUM(Prop2020DistTar!H30,Prop2020TransTar!H30,Prop2020JSTar!H30)","v":0},{"$f":"SUM(Prop2020DistTar!I30,Prop2020TransTar!I30,Prop2020JSTar!I30)","v":0},{"$f":"SUM(Prop2020DistTar!J30,Prop2020TransTar!J30,Prop2020JSTar!J30)","v":0},{"$f":"SUM(Prop2020DistTar!K30,Prop2020TransTar!K30,Prop2020JSTar!K30)","v":0},{"$f":"SUM(Prop2020DistTar!L30,Prop2020TransTar!L30,Prop2020JSTar!L30)","v":0},{"$f":"SUM(Prop2020DistTar!M30,Prop2020TransTar!M30,Prop2020JSTar!M30)","v":0},{"$f":"SUM(Prop2020DistTar!N30,Prop2020TransTar!N30,Prop2020JSTar!N30)","v":0},{"$f":"SUM(Prop2020DistTar!O30,Prop2020TransTar!O30,Prop2020JSTar!O30)","v":0},{"$f":"SUM(Prop2020DistTar!P30,Prop2020TransTar!P30,Prop2020JSTar!P30)","v":0},"C2L7",160,0,12.6,3.98,0,0,0,0,0,0,0,0,0,null,null,0,0,-7.1428571428570065E-3,-7.5376884422111434E-3,0,0,0,0,0,0,0,0,0,{"$f":"IF(MAX(ABS(AG30:AS30))>$AT$4,\"EXPLAIN\",\"\")","v":""}]
["C2G7B","Small business cost-reflective",{"$f":"Prop2020DistTar!B31","v":"Non-Residential Demand Tariff"},{"$f":"SUM(Prop2020DistTar!D31,Prop2020TransTar!D31,Prop2020JSTar!D31)","v":160},{"$f":"SUM(Prop2020DistTar!E31,Prop2020TransTar!E31,Prop2020JSTar!E31)","v":4.5999999999999996},{"$f":"SUM(Prop2020DistTar!F31,Prop2020TransTar!F31,Prop2020JSTar!F31)","v":0},{"$f":"SUM(Prop2020DistTar!G31,Prop2020TransTar!G31,Prop2020JSTar!G31)","v":0},{"$f":"SUM(Prop2020DistTar!H31,Prop2020TransTar!H31,Prop2020JSTar!H31)","v":0},{"$f":"SUM(Prop2020DistTar!I31,Prop2020TransTar!I31,Prop2020JSTar!I31)","v":14.51},{"$f":"SUM(Prop2020DistTar!J31,Prop2020TransTar!J31,Prop2020JSTar!J31)","v":4.84},{"$f":"SUM(Prop2020DistTar!K31,Prop2020TransTar!K31,Prop2020JSTar!K31)","v":0},{"$f":"SUM(Prop2020DistTar!L31,Prop2020TransTar!L31,Prop2020JSTar!L31)","v":0},{"$f":"SUM(Prop2020DistTar!M31,Prop2020TransTar!M31,Prop2020JSTar!M31)","v":0},{"$f":"SUM(Prop2020DistTar!N31,Prop2020TransTar!N31,Prop2020JSTar!N31)","v":0},{"$f":"SUM(Prop2020DistTar!O31,Prop2020TransTar!O31,Prop2020JSTar!O31)","v":0},{"$f":"SUM(Prop2020DistTar!P31,Prop2020TransTar!P31,Prop2020JSTar!P31)","v":0},"CG",160,4.63,0,0,0,14.61,4.87,0,0,0,0,0,0,null,null,0,-6.4794816414687206E-3,0,0,0,-6.8446269678302807E-3,-6.1601642710472637E-3,0,0,0,0,0,0,{"$f":"IF(MAX(ABS(AG31:AS31))>$AT$4,\"EXPLAIN\",\"\")","v":""}]
["C2L7","Small business cost-reflective (bulk)",{"$f":"Prop2020DistTar!B32","v":"Non-Residential Bulk Demand Tariff"},{"$f":"SUM(Prop2020DistTar!D32,Prop2020TransTar!D32,Prop2020JSTar!D32)","v":160},{"$f":"SUM(Prop2020DistTar!E32,Prop2020TransTar!E32,Prop2020JSTar!E32)","v":4.2699999999999996},{"$f":"SUM(Prop2020DistTar!F32,Prop2020TransTar!F32,Prop2020JSTar!F32)","v":0},{"$f":"SUM(Prop2020DistTar!G32,Prop2020TransTar!G32,Prop2020JSTar!G32)","v":0},{"$f":"SUM(Prop2020DistTar!H32,Prop2020TransTar!H32,Prop2020JSTar!H32)","v":0},{"$f":"SUM(Prop2020DistTar!I32,Prop2020TransTar!I32,Prop2020JSTar!I32)","v":12.329999999999998},{"$f":"SUM(Prop2020DistTar!J32,Prop2020TransTar!J32,Prop2020JSTar!J32)","v":4.1099999999999994},{"$f":"SUM(Prop2020DistTar!K32,Prop2020TransTar!K32,Prop2020JSTar!K32)","v":0},{"$f":"SUM(Prop2020DistTar!L32,Prop2020TransTar!L32,Prop2020JSTar!L32)","v":0},{"$f":"SUM(Prop2020DistTar!M32,Prop2020TransTar!M32,Prop2020JSTar!M32)","v":0},{"$f":"SUM(Prop2020DistTar!N32,Prop2020TransTar!N32,Prop2020JSTar!N32)","v":0},{"$f":"SUM(Prop2020DistTar!O32,Prop2020TransTar!O32,Prop2020JSTar!O32)","v":0},{"$f":"SUM(Prop2020DistTar!P32,Prop2020TransTar!P32,Prop2020JSTar!P32)","v":0},"CGB",160,4.3,0,0,0,12.07,4.0200000000000005,0,0,0,0,0,0,null,null,0,-6.9767441860465462E-3,0,0,0,2.1541010770505187E-2,2.2388059701492269E-2,0,0,0,0,0,0,{"$f":"IF(MAX(ABS(AG32:AS32))>$AT$4,\"EXPLAIN\",\"\")","v":""}]
["CG","Medium business",{"$f":"Prop2020DistTar!B33","v":"Medium Business Demand"},{"$f":"SUM(Prop2020DistTar!D33,Prop2020TransTar!D33,Prop2020JSTar!D33)","v":1200},{"$f":"SUM(Prop2020DistTar!E33,Prop2020TransTar!E33,Prop2020JSTar!E33)","v":0},{"$f":"SUM(Prop2020DistTar!F33,Prop2020TransTar!F33,Prop2020JSTar!F33)","v":4.45},{"$f":"SUM(Prop2020DistTar!G33,Prop2020TransTar!G33,Prop2020JSTar!G33)","v":4.45},{"$f":"SUM(Prop2020DistTar!H33,Prop2020TransTar!H33,Prop2020JSTar!H33)","v":0},{"$f":"SUM(Prop2020DistTar!I33,Prop2020TransTar!I33,Prop2020JSTar!I33)","v":14.14},{"$f":"SUM(Prop2020DistTar!J33,Prop2020TransTar!J33,Prop2020JSTar!J33)","v":4.71},{"$f":"SUM(Prop2020DistTar!K33,Prop2020TransTar!K33,Prop2020JSTar!K33)","v":0},{"$f":"SUM(Prop2020DistTar!L33,Prop2020TransTar!L33,Prop2020JSTar!L33)","v":0},{"$f":"SUM(Prop2020DistTar!M33,Prop2020TransTar!M33,Prop2020JSTar!M33)","v":0},{"$f":"SUM(Prop2020DistTar!N33,Prop2020TransTar!N33,Prop2020JSTar!N33)","v":0},{"$f":"SUM(Prop2020DistTar!O33,Prop2020TransTar!O33,Prop2020JSTar!O33)","v":0},{"$f":"SUM(Prop2020DistTar!P33,Prop2020TransTar!P33,Prop2020JSTar!P33)","v":0},"CMG",1200,0,4.5999999999999996,4.5999999999999996,0,12.55,6.28,0,0,0,0,0,0,null,null,0,0,-3.2608695652173836E-2,-3.2608695652173836E-2,0,0.12669322709163344,-0.25,0,0,0,0,0,0,{"$f":"IF(MAX(ABS(AG33:AS33))>$AT$4,\"EXPLAIN\",\"\")","v":"EXPLAIN"},"In 2019 we have proposed to more closely align the prices for bulk and non-bulk customers. This transition will occur incrementally and facilitate tariff structure simplification in the future."]
["CGB","Medium business (bulk)",{"$f":"Prop2020DistTar!B34","v":"Medium Business Bulk Demand"},{"$f":"SUM(Prop2020DistTar!D34,Prop2020TransTar!D34,Prop2020JSTar!D34)","v":1200},{"$f":"SUM(Prop2020DistTar!E34,Prop2020TransTar!E34,Prop2020JSTar!E34)","v":0},{"$f":"SUM(Prop2020DistTar!F34,Prop2020TransTar!F34,Prop2020JSTar!F34)","v":3.78},{"$f":"SUM(Prop2020DistTar!G34,Prop2020TransTar!G34,Prop2020JSTar!G34)","v":3.78},{"$f":"SUM(Prop2020DistTar!H34,Prop2020TransTar!H34,Prop2020JSTar!H34)","v":0},{"$f":"SUM(Prop2020DistTar!I34,Prop2020TransTar!I34,Prop2020JSTar!I34)","v":11.68},{"$f":"SUM(Prop2020DistTar!J34,Prop2020TransTar!J34,Prop2020JSTar!J34)","v":4.25},{"$f":"SUM(Prop2020DistTar!K34,Prop2020TransTar!K34,Prop2020JSTar!K34)","v":0},{"$f":"SUM(Prop2020DistTar!L34,Prop2020TransTar!L34,Prop2020JSTar!L34)","v":0},{"$f":"SUM(Prop2020DistTar!M34,Prop2020TransTar!M34,Prop2020JSTar!M34)","v":0},{"$f":"SUM(Prop2020DistTar!N34,Prop2020TransTar!N34,Prop2020JSTar!N34)","v":0},{"$f":"SUM(Prop2020DistTar!O34,Prop2020TransTar!O34,Prop2020JSTar!O34)","v":0},{"$f":"SUM(Prop2020DistTar!P34,Prop2020TransTar!P34,Prop2020JSTar!P34)","v":0},"CMGB",1200,0,3.7039999999999997,3.7039999999999997,0,9.6210000000000004,4.8099999999999996,0,0,0,0,0,0,null,null,0,0,2.051835853131756E-2,2.051835853131756E-2,0,0.21401101756574148,-0.11642411642411632,0,0,0,0,0,0,{"$f":"IF(MAX(ABS(AG34:AS34))>$AT$4,\"EXPLAIN\",\"\")","v":"EXPLAIN"},"In 2019 we have proposed to more closely align the prices for bulk and non-bulk customers. This transition will occur incrementally and facilitate tariff structure simplification in the future."]
["CMG","Medium Business Opt-out",{"$f":"Prop2020DistTar!B35","v":"Medium Business Opt-out"},{"$f":"SUM(Prop2020DistTar!D35,Prop2020TransTar!D35,Prop2020JSTar!D35)","v":1200},{"$f":"SUM(Prop2020DistTar!E35,Prop2020TransTar!E35,Prop2020JSTar!E35)","v":0},{"$f":"SUM(Prop2020DistTar!F35,Prop2020TransTar!F35,Prop2020JSTar!F35)","v":11.6},{"$f":"SUM(Prop2020DistTar!G35,Prop2020TransTar!G35,Prop2020JSTar!G35)","v":4.67},{"$f":"SUM(Prop2020DistTar!H35,Prop2020TransTar!H35,Prop2020JSTar!H35)","v":0},{"$f":"SUM(Prop2020DistTar!I35,Prop2020TransTar!I35,Prop2020JSTar!I35)","v":0},{"$f":"SUM(Prop2020DistTar!J35,Prop2020TransTar!J35,Prop2020JSTar!J35)","v":0},{"$f":"SUM(Prop2020DistTar!K35,Prop2020TransTar!K35,Prop2020JSTar!K35)","v":0},{"$f":"SUM(Prop2020DistTar!L35,Prop2020TransTar!L35,Prop2020JSTar!L35)","v":0},{"$f":"SUM(Prop2020DistTar!M35,Prop2020TransTar!M35,Prop2020JSTar!M35)","v":0},{"$f":"SUM(Prop2020DistTar!N35,Prop2020TransTar!N35,Prop2020JSTar!N35)","v":0},{"$f":"SUM(Prop2020DistTar!O35,Prop2020TransTar!O35,Prop2020JSTar!O35)","v":0},{"$f":"SUM(Prop2020DistTar!P35,Prop2020TransTar!P35,Prop2020JSTar!P35)","v":0},"CMGO",1200,0,11.98,4.82,0,0,0,0,0,0,0,0,0,null,null,0,0,-3.171953255425719E-2,-3.112033195020758E-2,0,0,0,0,0,0,0,0,0,{"$f":"IF(MAX(ABS(AG35:AS35))>$AT$4,\"EXPLAIN\",\"\")","v":""}]
["CMGB","Medium Business Bulk Opt-out",{"$f":"Prop2020DistTar!B36","v":"Medium Business Bulk Opt-out"},{"$f":"SUM(Prop2020DistTar!D36,Prop2020TransTar!D36,Prop2020JSTar!D36)","v":1200},{"$f":"SUM(Prop2020DistTar!E36,Prop2020TransTar!E36,Prop2020JSTar!E36)","v":0},{"$f":"SUM(Prop2020DistTar!F36,Prop2020TransTar!F36,Prop2020JSTar!F36)","v":9.2799999999999994},{"$f":"SUM(Prop2020DistTar!G36,Prop2020TransTar!G36,Prop2020JSTar!G36)","v":3.73},{"$f":"SUM(Prop2020DistTar!H36,Prop2020TransTar!H36,Prop2020JSTar!H36)","v":0},{"$f":"SUM(Prop2020DistTar!I36,Prop2020TransTar!I36,Prop2020JSTar!I36)","v":0},{"$f":"SUM(Prop2020DistTar!J36,Prop2020TransTar!J36,Prop2020JSTar!J36)","v":0},{"$f":"SUM(Prop2020DistTar!K36,Prop2020TransTar!K36,Prop2020JSTar!K36)","v":0},{"$f":"SUM(Prop2020DistTar!L36,Prop2020TransTar!L36,Prop2020JSTar!L36)","v":0},{"$f":"SUM(Prop2020DistTar!M36,Prop2020TransTar!M36,Prop2020JSTar!M36)","v":0},{"$f":"SUM(Prop2020DistTar!N36,Prop2020TransTar!N36,Prop2020JSTar!N36)","v":0},{"$f":"SUM(Prop2020DistTar!O36,Prop2020TransTar!O36,Prop2020JSTar!O36)","v":0},{"$f":"SUM(Prop2020DistTar!P36,Prop2020TransTar!P36,Prop2020JSTar!P36)","v":0},"CMGBO",1200,0,9.76,4.1100000000000003,0,0,0,0,0,0,0,0,0,null,null,0,0,-4.9180327868852514E-2,-9.2457420924574318E-2,0,0,0,0,0,0,0,0,0,{"$f":"IF(MAX(ABS(AG36:AS36))>$AT$4,\"EXPLAIN\",\"\")","v":""}]
["CMGO","Unmetered supplies",{"$f":"Prop2020DistTar!B37","v":"Unmetered Supplies / Public Lighting"},{"$f":"SUM(Prop2020DistTar!D37,Prop2020TransTar!D37,Prop2020JSTar!D37)","v":0},{"$f":"SUM(Prop2020DistTar!E37,Prop2020TransTar!E37,Prop2020JSTar!E37)","v":0},{"$f":"SUM(Prop2020DistTar!F37,Prop2020TransTar!F37,Prop2020JSTar!F37)","v":11.72},{"$f":"SUM(Prop2020DistTar!G37,Prop2020TransTar!G37,Prop2020JSTar!G37)","v":3.29},{"$f":"SUM(Prop2020DistTar!H37,Prop2020TransTar!H37,Prop2020JSTar!H37)","v":0},{"$f":"SUM(Prop2020DistTar!I37,Prop2020TransTar!I37,Prop2020JSTar!I37)","v":0},{"$f":"SUM(Prop2020DistTar!J37,Prop2020TransTar!J37,Prop2020JSTar!J37)","v":0},{"$f":"SUM(Prop2020DistTar!K37,Prop2020TransTar!K37,Prop2020JSTar!K37)","v":0},{"$f":"SUM(Prop2020DistTar!L37,Prop2020TransTar!L37,Prop2020JSTar!L37)","v":0},{"$f":"SUM(Prop2020DistTar!M37,Prop2020TransTar!M37,Prop2020JSTar!M37)","v":0},{"$f":"SUM(Prop2020DistTar!N37,Prop2020TransTar!N37,Prop2020JSTar!N37)","v":0},{"$f":"SUM(Prop2020DistTar!O37,Prop2020TransTar!O37,Prop2020JSTar!O37)","v":0},{"$f":"SUM(Prop2020DistTar!P37,Prop2020TransTar!P37,Prop2020JSTar!P37)","v":0},"C2U",0,0,11.8,3.31,0,0,0,0,0,0,0,0,0,null,null,0,0,-6.7796610169491567E-3,-6.0422960725076136E-3,0,0,0,0,0,0,0,0,0,{"$f":"IF(MAX(ABS(AG37:AS37))>$AT$4,\"EXPLAIN\",\"\")","v":""}]
["CMGBO","Large low voltage",{"$f":"Prop2020DistTar!B38","v":"Large low Voltage"},{"$f":"SUM(Prop2020DistTar!D38,Prop2020TransTar!D38,Prop2020JSTar!D38)","v":6550},{"$f":"SUM(Prop2020DistTar!E38,Prop2020TransTar!E38,Prop2020JSTar!E38)","v":0},{"$f":"SUM(Prop2020DistTar!F38,Prop2020TransTar!F38,Prop2020JSTar!F38)","v":3.6399999999999997},{"$f":"SUM(Prop2020DistTar!G38,Prop2020TransTar!G38,Prop2020JSTar!G38)","v":2.2400000000000002},{"$f":"SUM(Prop2020DistTar!H38,Prop2020TransTar!H38,Prop2020JSTar!H38)","v":111.49000000000001},{"$f":"SUM(Prop2020DistTar!I38,Prop2020TransTar!I38,Prop2020JSTar!I38)","v":0},{"$f":"SUM(Prop2020DistTar!J38,Prop2020TransTar!J38,Prop2020JSTar!J38)","v":0},{"$f":"SUM(Prop2020DistTar!K38,Prop2020TransTar!K38,Prop2020JSTar!K38)","v":0},{"$f":"SUM(Prop2020DistTar!L38,Prop2020TransTar!L38,Prop2020JSTar!L38)","v":0},{"$f":"SUM(Prop2020DistTar!M38,Prop2020TransTar!M38,Prop2020JSTar!M38)","v":0},{"$f":"SUM(Prop2020DistTar!N38,Prop2020TransTar!N38,Prop2020JSTar!N38)","v":0},{"$f":"SUM(Prop2020DistTar!O38,Prop2020TransTar!O38,Prop2020JSTar!O38)","v":0},{"$f":"SUM(Prop2020DistTar!P38,Prop2020TransTar!P38,Prop2020JSTar!P38)","v":0},"CLLV",6500,0,3.63,2.23,111.03,0,0,0,0,0,0,0,0,null,null,7.692307692307665E-3,0,2.7548209366390353E-3,4.484304932735439E-3,4.1430244078177747E-3,0,0,0,0,0,0,0,0,{"$f":"IF(MAX(ABS(AG38:AS38))>$AT$4,\"EXPLAIN\",\"\")","v":""}]
["C2U","Large low voltage (bulk)",{"$f":"Prop2020DistTar!B39","v":"Large low Voltage Bulk"},{"$f":"SUM(Prop2020DistTar!D39,Prop2020TransTar!D39,Prop2020JSTar!D39)","v":6550},{"$f":"SUM(Prop2020DistTar!E39,Prop2020TransTar!E39,Prop2020JSTar!E39)","v":0},{"$f":"SUM(Prop2020DistTar!F39,Prop2020TransTar!F39,Prop2020JSTar!F39)","v":3.46},{"$f":"SUM(Prop2020DistTar!G39,Prop2020TransTar!G39,Prop2020JSTar!G39)","v":2.13},{"$f":"SUM(Prop2020DistTar!H39,Prop2020TransTar!H39,Prop2020JSTar!H39)","v":103.72},{"$f":"SUM(Prop2020DistTar!I39,Prop2020TransTar!I39,Prop2020JSTar!I39)","v":0},{"$f":"SUM(Prop2020DistTar!J39,Prop2020TransTar!J39,Prop2020JSTar!J39)","v":0},{"$f":"SUM(Prop2020DistTar!K39,Prop2020TransTar!K39,Prop2020JSTar!K39)","v":0},{"$f":"SUM(Prop2020DistTar!L39,Prop2020TransTar!L39,Prop2020JSTar!L39)","v":0},{"$f":"SUM(Prop2020DistTar!M39,Prop2020TransTar!M39,Prop2020JSTar!M39)","v":0},{"$f":"SUM(Prop2020DistTar!N39,Prop2020TransTar!N39,Prop2020JSTar!N39)","v":0},{"$f":"SUM(Prop2020DistTar!O39,Prop2020TransTar!O39,Prop2020JSTar!O39)","v":0},{"$f":"SUM(Prop2020DistTar!P39,Prop2020TransTar!P39,Prop2020JSTar!P39)","v":0},"CLLVB",6500,0,3.35,2.09,103.3,0,0,0,0,0,0,0,0,null,null,7.692307692307665E-3,0,3.2835820895522394E-2,1.9138755980861344E-2,4.0658276863505538E-3,0,0,0,0,0,0,0,0,{"$f":"IF(MAX(ABS(AG39:AS39))>$AT$4,\"EXPLAIN\",\"\")","v":""}]
["CLLV","High voltage",{"$f":"Prop2020DistTar!B40","v":"High Voltage"},{"$f":"SUM(Prop2020DistTar!D40,Prop2020TransTar!D40,Prop2020JSTar!D40)","v":33700},{"$f":"SUM(Prop2020DistTar!E40,Prop2020TransTar!E40,Prop2020JSTar!E40)","v":0},{"$f":"SUM(Prop2020DistTar!F40,Prop2020TransTar!F40,Prop2020JSTar!F40)","v":2.6},{"$f":"SUM(Prop2020DistTar!G40,Prop2020TransTar!G40,Prop2020JSTar!G40)","v":1.3399999999999999},{"$f":"SUM(Prop2020DistTar!H40,Prop2020TransTar!H40,Prop2020JSTar!H40)","v":73.8},{"$f":"SUM(Prop2020DistTar!I40,Prop2020TransTar!I40,Prop2020JSTar!I40)","v":0},{"$f":"SUM(Prop2020DistTar!J40,Prop2020TransTar!J40,Prop2020JSTar!J40)","v":0},{"$f":"SUM(Prop2020DistTar!K40,Prop2020TransTar!K40,Prop2020JSTar!K40)","v":0},{"$f":"SUM(Prop2020DistTar!L40,Prop2020TransTar!L40,Prop2020JSTar!L40)","v":0},{"$f":"SUM(Prop2020DistTar!M40,Prop2020TransTar!M40,Prop2020JSTar!M40)","v":0},{"$f":"SUM(Prop2020DistTar!N40,Prop2020TransTar!N40,Prop2020JSTar!N40)","v":0},{"$f":"SUM(Prop2020DistTar!O40,Prop2020TransTar!O40,Prop2020JSTar!O40)","v":0},{"$f":"SUM(Prop2020DistTar!P40,Prop2020TransTar!P40,Prop2020JSTar!P40)","v":0},"CHV",33400,0,2.58,1.33,73.100000000000009,0,0,0,0,0,0,0,0,null,null,8.9820359281436168E-3,0,7.7519379844961378E-3,7.5187969924810361E-3,9.5759233926127063E-3,0,0,0,0,0,0,0,0,{"$f":"IF(MAX(ABS(AG40:AS40))>$AT$4,\"EXPLAIN\",\"\")","v":""}]
["CLLVB","Subtransmission",{"$f":"Prop2020DistTar!B41","v":"Subtransmission"},{"$f":"SUM(Prop2020DistTar!D41,Prop2020TransTar!D41,Prop2020JSTar!D41)","v":148700},{"$f":"SUM(Prop2020DistTar!E41,Prop2020TransTar!E41,Prop2020JSTar!E41)","v":0},{"$f":"SUM(Prop2020DistTar!F41,Prop2020TransTar!F41,Prop2020JSTar!F41)","v":2.14},{"$f":"SUM(Prop2020DistTar!G41,Prop2020TransTar!G41,Prop2020JSTar!G41)","v":0.88},{"$f":"SUM(Prop2020DistTar!H41,Prop2020TransTar!H41,Prop2020JSTar!H41)","v":17.34},{"$f":"SUM(Prop2020DistTar!I41,Prop2020TransTar!I41,Prop2020JSTar!I41)","v":0},{"$f":"SUM(Prop2020DistTar!J41,Prop2020TransTar!J41,Prop2020JSTar!J41)","v":0},{"$f":"SUM(Prop2020DistTar!K41,Prop2020TransTar!K41,Prop2020JSTar!K41)","v":0},{"$f":"SUM(Prop2020DistTar!L41,Prop2020TransTar!L41,Prop2020JSTar!L41)","v":0},{"$f":"SUM(Prop2020DistTar!M41,Prop2020TransTar!M41,Prop2020JSTar!M41)","v":0},{"$f":"SUM(Prop2020DistTar!N41,Prop2020TransTar!N41,Prop2020JSTar!N41)","v":0},{"$f":"SUM(Prop2020DistTar!O41,Prop2020TransTar!O41,Prop2020JSTar!O41)","v":0},{"$f":"SUM(Prop2020DistTar!P41,Prop2020TransTar!P41,Prop2020JSTar!P41)","v":0},"CST",154100,0,2.2200000000000002,0.91,17.97,0,0,0,0,0,0,0,0,null,null,-3.5042180402336198E-2,0,-3.6036036036036112E-2,-3.2967032967032961E-2,-3.5058430717863076E-2,0,0,0,0,0,0,0,0,{"$f":"IF(MAX(ABS(AG41:AS41))>$AT$4,\"EXPLAIN\",\"\")","v":""}]
["CHV",null,null,null,null,null,null,null,null,null,null,null,null,null,null,null,null,null,null,null,null,null,null,null,null,null,null,null,null,null,null,null,0,0,0,0,0,0,0,0,0,0,0,0,0,{"$f":"IF(MAX(ABS(AG42:AS42))>$AT$4,\"EXPLAIN\",\"\")","v":""}]
["CST",null,null,null,null,null,null,null,null,null,null,null,null,null,null,null,null,null,null,null,null,null,null,null,null,null,null,null,null,null,null,null,0,0,0,0,0,0,0,0,0,0,0,0,0,{"$f":"IF(MAX(ABS(AG43:AS43))>$AT$4,\"EXPLAIN\",\"\")","v":""}]
[null,null,null,null,null,null,null,null,null,null,null,null,null,null,null,null,null,null,null,null,null,null,null,null,null,null,null,null,null,null,null,null,0,0,0,0,0,0,0,0,0,0,0,0,0,{"$f":"IF(MAX(ABS(AG44:AS44))>$AT$4,\"EXPLAIN\",\"\")","v":""}]
[null,null,null,null,null,null,null,null,null,null,null,null,null,null,null,null,null,null,null,null,null,null,null,null,null,null,null,null,null,null,null,null,0,0,0,0,0,0,0,0,0,0,0,0,0,{"$f":"IF(MAX(ABS(AG45:AS45))>$AT$4,\"EXPLAIN\",\"\")","v":""}]
[null,null,null,null,null,null,null,null,null,null,null,null,null,null,null,null,null,null,null,null,null,null,null,null,null,null,null,null,null,null,null,null,0,0,0,0,0,0,0,0,0,0,0,0,0,{"$f":"IF(MAX(ABS(AG46:AS46))>$AT$4,\"EXPLAIN\",\"\")","v":""}]
[null,null,null,null,null,null,null,null,null,null,null,null,null,null,null,null,null,null,null,null,null,null,null,null,null,null,null,null,null,null,null,null,{"$f":"IFERROR(D47/R47-1,0)","v":0},0,0,0,0,0,0,0,0,0,0,0,0,{"$f":"IF(MAX(ABS(AG47:AS47))>$AT$4,\"EXPLAIN\",\"\")","v":""}]
[null,null,null,null,null,null,null,null,null,null,null,null,null,null,null,null,null,null,null,null,null,null,null,null,null,null,null,null,null,null,null,null,0,0,0,0,0,0,0,0,0,0,0,0,0,{"$f":"IF(MAX(ABS(AG48:AS48))>$AT$4,\"EXPLAIN\",\"\")","v":""}]
[null,null,null,null,null,null,null,null,null,null,null,null,null,null,null,null,null,null,null,null,null,null,null,null,null,null,null,null,null,null,null,null,0,0,0,0,0,0,0,0,0,0,0,0,0,{"$f":"IF(MAX(ABS(AG49:AS49))>$AT$4,\"EXPLAIN\",\"\")","v":""}]
[null,null,null,null,null,null,null,null,null,null,null,null,null,null,null,null,null,null,null,null,null,null,null,null,null,null,null,null,null,null,null,null,0,0,0,0,0,0,0,0,0,0,0,0,0,{"$f":"IF(MAX(ABS(AG50:AS50))>$AT$4,\"EXPLAIN\",\"\")","v":""}]
[null,null,null,null,null,null,null,null,null,null,null,null,null,null,null,null,null,null,null,null,null,null,null,null,null,null,null,null,null,null,null,null,0,0,0,0,0,0,0,0,0,0,0,0,0,{"$f":"IF(MAX(ABS(AG51:AS51))>$AT$4,\"EXPLAIN\",\"\")","v":""}]
[null,null,null,null,null,null,null,null,null,null,null,null,null,null,null,null,null,null,null,null,null,null,null,null,null,null,null,null,null,null,null,null,0,0,0,0,0,0,0,0,0,0,0,0,0,{"$f":"IF(MAX(ABS(AG52:AS52))>$AT$4,\"EXPLAIN\",\"\")","v":""}]
[null,null,null,null,null,null,null,null,null,null,null,null,null,null,null,null,null,null,null,null,null,null,null,null,null,null,null,null,null,null,null,null,0,0,0,0,0,0,0,0,0,0,0,0,0,{"$f":"IF(MAX(ABS(AG53:AS53))>$AT$4,\"EXPLAIN\",\"\")","v":""}]
[null,null,null,null,null,null,null,null,null,null,null,null,null,null,null,null,null,null,null,null,null,null,null,null,null,null,null,null,null,null,null,null,0,0,0,0,0,0,0,0,0,0,0,0,0,{"$f":"IF(MAX(ABS(AG54:AS54))>$AT$4,\"EXPLAIN\",\"\")","v":""}]
[null,null,null,null,null,null,null,null,null,null,null,null,null,null,null,null,null,null,null,null,null,null,null,null,null,null,null,null,null,null,null,null,0,0,0,0,0,0,0,0,0,0,0,0,0,{"$f":"IF(MAX(ABS(AG55:AS55))>$AT$4,\"EXPLAIN\",\"\")","v":""}]
[null,null,null,null,null,null,null,null,null,null,null,null,null,null,null,null,null,null,null,null,null,null,null,null,null,null,null,null,null,null,null,null,0,0,0,0,0,0,0,0,0,0,0,0,0,{"$f":"IF(MAX(ABS(AG56:AS56))>$AT$4,\"EXPLAIN\",\"\")","v":""}]
[null,null,null,null,null,null,null,null,null,null,null,null,null,null,null,null,null,null,null,null,null,null,null,null,null,null,null,null,null,null,null,null,0,0,0,0,0,0,0,0,0,0,0,0,0,{"$f":"IF(MAX(ABS(AG57:AS57))>$AT$4,\"EXPLAIN\",\"\")","v":""}]
[null,null,null,null,null,null,null,null,null,null,null,null,null,null,null,null,null,null,null,null,null,null,null,null,null,null,null,null,null,null,null,null,0,0,0,0,0,0,0,0,0,0,0,0,0,{"$f":"IF(MAX(ABS(AG58:AS58))>$AT$4,\"EXPLAIN\",\"\")","v":""}]
[null,null,null,null,null,null,null,null,null,null,null,null,null,null,null,null,null,null,null,null,null,null,null,null,null,null,null,null,null,null,null,null,0,0,0,0,0,0,0,0,0,0,0,0,0,{"$f":"IF(MAX(ABS(AG59:AS59))>$AT$4,\"EXPLAIN\",\"\")","v":""}]
[null,null,null,null,null,null,null,null,null,null,null,null,null,null,null,null,null,null,null,null,null,null,null,null,null,null,null,null,null,null,null,null,0,0,0,0,0,0,0,0,0,0,0,0,0,{"$f":"IF(MAX(ABS(AG60:AS60))>$AT$4,\"EXPLAIN\",\"\")","v":""}]
[null,null,null,null,null,null,null,null,null,null,null,null,null,null,null,null,null,null,null,null,null,null,null,null,null,null,null,null,null,null,null,null,0,0,0,0,0,0,0,0,0,0,0,0,0,{"$f":"IF(MAX(ABS(AG61:AS61))>$AT$4,\"EXPLAIN\",\"\")","v":""}]
[null,null,null,null,null,null,null,null,null,null,null,null,null,null,null,null,null,null,null,null,null,null,null,null,null,null,null,null,null,null,null,null,0,0,0,0,0,0,0,0,0,0,0,0,0,{"$f":"IF(MAX(ABS(AG62:AS62))>$AT$4,\"EXPLAIN\",\"\")","v":""}]
[null,null,null,null,null,null,null,null,null,null,null,null,null,null,null,null,null,null,null,null,null,null,null,null,null,null,null,null,null,null,null,null,0,0,0,0,0,0,0,0,0,0,0,0,0,{"$f":"IF(MAX(ABS(AG63:AS63))>$AT$4,\"EXPLAIN\",\"\")","v":""}]
[null,null,null,null,null,null,null,null,null,null,null,null,null,null,null,null,null,null,null,null,null,null,null,null,null,null,null,null,null,null,null,null,0,0,0,0,0,0,0,0,0,0,0,0,0,{"$f":"IF(MAX(ABS(AG64:AS64))>$AT$4,\"EXPLAIN\",\"\")","v":""}]
[null,null,null,null,null,null,null,null,null,null,null,null,null,null,null,null,null,null,null,null,null,null,null,null,null,null,null,null,null,null,null,null,0,0,0,0,0,0,0,0,0,0,0,0,0,{"$f":"IF(MAX(ABS(AG65:AS65))>$AT$4,\"EXPLAIN\",\"\")","v":""}]

{"sheet":"Indicative prices for 2021","index":17,"n_rows":41,"n_cols":16,"rows_kept":41,"cut":false,"hidden":false,"merged":[]}
[null,{"$f":"\"Tariff Approval - \"&'Model update'!$C$3","v":"Tariff Approval - CitiPower"},{"$f":"\"Indicative prices for \"&'Model update'!$C$5+1","v":"Indicative prices for 2021"}]
[]
[null,{"$f":"\"TSS - updated indicative prices for \"&'Model update'!$C$5+1","v":"TSS - updated indicative prices for 2021"}]
[null,null,null,{"$f":"\"TSS indicative tariffs for \"&'Model update'!$C$5+1","v":"TSS indicative tariffs for 2021"}]
[null,"TSS name","Proposal name","IndTar\nFixed","IndTar\nAnytime","IndTar\nPkBlk","IndTar\nOPkBlk1","IndTar\nDem kVA","IndTar\nDem kW Sum","IndTar\nDem kW Win","IndTar\nSumBlk1","IndTar\nSumBlk2","IndTar\nSumBlk3","IndTar\nWtrBlk1","IndTar\nWtrBlk2","IndTar\nWtrBlk3"]
[null,"Residential flat",{"$f":"Prop2020DistTar!B6","v":"Residential Single Rate"}]
[null,"Residential flat (bulk)",{"$f":"Prop2020DistTar!B7","v":"Residential Single Rate - Bulk"}]
[null,"Residential flexible",{"$f":"Prop2020DistTar!B8","v":"Residential - flexible pricing"}]
[null,"Residential flexible (bulk)",{"$f":"Prop2020DistTar!B9","v":"Residential - flexible pricing bulk"}]
[null,"Residential two rate 5d",{"$f":"Prop2020DistTar!B10","v":"Residential Two Rate 5d"}]
[null,"Residential two rate 5d (bulk)",{"$f":"Prop2020DistTar!B11","v":"Residential Two Rate 5d - Bulk"}]
[null,"Residential Interval",{"$f":"Prop2020DistTar!B12","v":"Residential Interval"}]
[null,"Residential Interval - Bulk",{"$f":"Prop2020DistTar!B13","v":"Residential Interval - Bulk"}]
[null,"Residential controlled load",{"$f":"Prop2020DistTar!B14","v":"Residential Two Rate 5d - Controlled Load"}]
[null,"Residential controlled load (bulk)",{"$f":"Prop2020DistTar!B15","v":"Residential Two Rate 5d - Bulk - Controlled Load"}]
[null,"Dedicated Circuit",{"$f":"Prop2020DistTar!B16","v":"Dedicated Circuit"}]
[null,"Dedicated Circuit - Bulk",{"$f":"Prop2020DistTar!B17","v":"Dedicated Circuit - Bulk"}]
[null,"Residential cost-reflective",{"$f":"Prop2020DistTar!B18","v":"Residential Demand"}]
[null,"Residential cost-reflective (bulk)",{"$f":"Prop2020DistTar!B19","v":"Residential Bulk Demand"}]
[null,"Small business flat",{"$f":"Prop2020DistTar!B20","v":"Non-Residential Single Rate"}]
[null,"Small business flat (bulk)",{"$f":"Prop2020DistTar!B21","v":"Non-Residential Single Rate - Bulk"}]
[null,"Non-residential two rate 5d",{"$f":"Prop2020DistTar!B22","v":"Non-Residential Two Rate 5d"}]
[null,"Non-residential two rate 5d (bulk)",{"$f":"Prop2020DistTar!B23","v":"Non-Residential Two Rate 5d - Bulk"}]
[null,"Non-Residential Interval",{"$f":"Prop2020DistTar!B24","v":"Non-Residential Interval"}]
[null,"Non-Residential Interval - Bulk",{"$f":"Prop2020DistTar!B25","v":"Non-Residential Interval - Bulk"}]
[null,"Non-residential flexible pricing",{"$f":"Prop2020DistTar!B26","v":"Non-Residential Flexible Pricing"}]
[null,"Non-residential flexible pricing (bulk)",{"$f":"Prop2020DistTar!B27","v":"Non-Residential - Flexible Pricing Bulk"}]
[null,"Non-residential two rate 7d",{"$f":"Prop2020DistTar!B28","v":"Non-Residential Two Rate 7d"}]
[null,"Non-residential two rate 7d (bulk)",{"$f":"Prop2020DistTar!B29","v":"Non-Residential Two Rate 7d - Bulk"}]
[null,"Large two rate 7d",{"$f":"Prop2020DistTar!B30","v":"Large Two Rate 7d"}]
[null,"Small business cost-reflective",{"$f":"Prop2020DistTar!B31","v":"Non-Residential Demand Tariff"}]
[null,"Small business cost-reflective (bulk)",{"$f":"Prop2020DistTar!B32","v":"Non-Residential Bulk Demand Tariff"}]
[null,"Medium business",{"$f":"Prop2020DistTar!B33","v":"Medium Business Demand"}]
[null,"Medium business (bulk)",{"$f":"Prop2020DistTar!B34","v":"Medium Business Bulk Demand"}]
[null,"Medium Business Opt-out",{"$f":"Prop2020DistTar!B35","v":"Medium Business Opt-out"}]
[null,"Medium Business Bulk Opt-out",{"$f":"Prop2020DistTar!B36","v":"Medium Business Bulk Opt-out"}]
[null,"Unmetered supplies",{"$f":"Prop2020DistTar!B37","v":"Unmetered Supplies / Public Lighting"}]
[null,"Large low voltage",{"$f":"Prop2020DistTar!B38","v":"Large low Voltage"}]
[null,"Large low voltage (bulk)",{"$f":"Prop2020DistTar!B39","v":"Large low Voltage Bulk"}]
[null,"High voltage",{"$f":"Prop2020DistTar!B40","v":"High Voltage"}]
[null,"Subtransmission",{"$f":"Prop2020DistTar!B41","v":"Subtransmission"}]