{"text_format":"1","workbook":"xlsx","n_sheets":8,"sheets":["inputs¦other","Input¦Historic","Input¦Forecast","Outputs│Tables","AER DRAFT inputs¦other","AER DRAFT Input¦Historic","AER DRAFT Input¦Forecast","AER DRAFT Outputs│Tables"],"not_rendered":{"charts":0,"images":1,"macros":1,"external_links":4,"defined_names":60,"comments":2,"pivot_tables":0},"unopened":[],"bounds":{"document_bytes":16777216,"sheet_cells":100000,"rows_first":2000,"rows_last":500,"rows_between":2000,"halvings":0,"cell_chars":16384,"cell_head_chars":4096},"cells_cut":0,"cells_raw":0,"read":"whole","date_system":"1900"}

{"sheet":"inputs¦other","index":0,"n_rows":54,"n_cols":13,"rows_kept":54,"cut":false,"hidden":false,"merged":[]}
[]
[]
[]
[]
[]
[]
[]
[]
[]
[{"$f":"RIGHT(CELL(\"filename\",A1),LEN(CELL(\"filename\",A1))-FIND(\"]\",CELL(\"filename\",A1)))","v":"inputs¦other"}]
[]
["inflation",null,2012,2013,2014,2015,2016,2017,2018,2019,2020,2021,2022]
["Inflation index","Base 2016/17",{"$f":"D13/(1+C15)","v":0.90888790489087035},{"$f":"E13/(1+D15)","v":0.92329020332717182},{"$f":"F13/(1+E15)","v":0.9463955637707947},{"$f":"G13/(1+F15)","v":0.97412199630314222},{"$f":"H13/(1+G15)","v":0.987060998151571},1,{"$f":"H13*(1+I15)","v":1.0229999999999999},{"$f":"I13*(1+J15)","v":1.0465289999999998},{"$f":"J13*(1+K15)","v":1.0705991669999997},{"$f":"K13*(1+L15)","v":1.0952229478409996},{"$f":"L13*(1+M15)","v":1.1204130756413424}]
["Inflation index","Base 2011/12",1,{"$f":"C14*(1+C15)","v":1.015846066779853},{"$f":"D14*(1+D15)","v":1.041267640022592},1.0717735279138789,1.0860096089298128,{"$f":"G14*(1+G15)","v":1.1002456899457469}]
["CPI",null,{"$f":"'[2]Actual CPI'!$I$18","v":1.5846066779853007E-2},{"$f":"'[3]input⁞inflation'!J18","v":2.5025025025025016E-2},{"$f":"'[3]input⁞inflation'!K18","v":2.9296875E-2},{"$f":"'[3]input⁞inflation'!L18","v":1.3282732447817747E-2},{"$f":"'[3]input⁞inflation'!M18","v":1.3108614232209881E-2},2.3E-2,{"$f":"H15","v":2.3E-2},{"$f":"I15","v":2.3E-2},{"$f":"J15","v":2.3E-2},{"$f":"K15","v":2.3E-2},{"$f":"L15","v":2.3E-2}]
{"$rows_left_out":40}
{"sheet":"Input¦Historic","index":1,"n_rows":101,"n_cols":21,"rows_kept":101,"cut":false,"hidden":false,"merged":[[12,0,12,6],[14,9,14,18]]}
[]
[]
[]
[]
[]
[]
[]
[]
[]
[]
[]
[]
[]
[]
[null,null,null,null,null,null,null,null,null,"aa asset class"]
{"$rows_left_out":87}
{"sheet":"Input¦Forecast","index":2,"n_rows":99,"n_cols":23,"rows_kept":99,"cut":false,"hidden":false,"merged":[[12,0,12,7],[14,11,14,20]]}
[]
[]
[]
[]
[]
[]
[]
[]
[]
[]
[]
[]
[]
[]
[null,null,null,null,null,null,null,null,null,null,null,"aa asset class"]
{"$rows_left_out":85}
{"sheet":"Outputs│Tables","index":3,"n_rows":84,"n_cols":28,"rows_kept":84,"cut":false,"hidden":false,"merged":[]}
[]
[]
[]
[]
[]
[]
[]
[]
[]
[{"$f":"RIGHT(CELL(\"filename\",A1),LEN(CELL(\"filename\",A1))-FIND(\"]\",CELL(\"filename\",A1)))","v":"Outputs│Tables"}]
[]
[null,null,null,null,null,null,null,null,null,null,null,null,null,null,null,null,null,null,null,null,null,null,null,null,null,null,"Gross Capex"]
["Capex by project ($m nominal)",null,null,null,null,null,null,null,null,null,null,null,null,"Capex by project ($m real 2016/17)",null,null,null,null,null,null,null,null,null,null,null,null,"Proposal ($2016/17)"]
["Project name",null,2013,2014,2015,2016,2017,2018,2019,2020,2021,2022,null,"Project name",null,2013,2014,2015,2016,2017,2018,2019,2020,2021,2022,null,"Current","Forecast"]
[{"$f":"'inputs¦other'!A38","v":"Aquarium Passage"},"$m nominal",{"$f":"SUMIF('Input¦Historic'!$G$17:$G$98,$A15,'Input¦Historic'!B$17:B$98)/1000000","v":0.20340742000000001},{"$f":"SUMIF('Input¦Historic'!$G$17:$G$98,$A15,'Input¦Historic'!C$17:C$98)/1000000","v":0.60615213000000001},{"$f":"SUMIF('Input¦Historic'!$G$17:$G$98,$A15,'Input¦Historic'!D$17:D$98)/1000000","v":1.1201981299999999},{"$f":"SUMIF('Input¦Historic'!$G$17:$G$98,$A15,'Input¦Historic'!E$17:E$98)/1000000","v":0},{"$f":"SUMIF('Input¦Forecast'!$J$17:$J$95,$A15,'Input¦Forecast'!B$17:B$95)/1000*'inputs¦other'!H$13","v":0},{"$f":"SUMIF('Input¦Forecast'!$J$17:$J$95,$A15,'Input¦Forecast'!C$17:C$95)/1000*'inputs¦other'!I$13","v":0},{"$f":"SUMIF('Input¦Forecast'!$J$17:$J$95,$A15,'Input¦Forecast'!D$17:D$95)/1000*'inputs¦other'!J$13","v":0},{"$f":"SUMIF('Input¦Forecast'!$J$17:$J$95,$A15,'Input¦Forecast'!E$17:E$95)/1000*'inputs¦other'!K$13","v":0},{"$f":"SUMIF('Input¦Forecast'!$J$17:$J$95,$A15,'Input¦Forecast'!F$17:F$95)/1000*'inputs¦other'!L$13","v":0},{"$f":"SUMIF('Input¦Forecast'!$J$17:$J$95,$A15,'Input¦Forecast'!G$17:G$95)/1000*'inputs¦other'!M$13","v":0},null,{"$f":"A15","v":"Aquarium Passage"},"$m real 2016/17",{"$f":"C15/'inputs¦other'!D$13","v":0.2203071355755756},{"$f":"D15/'inputs¦other'!E$13","v":0.64048496548828138},{"$f":"E15/'inputs¦other'!F$13","v":1.1499567140986717},{"$f":"F15/'inputs¦other'!G$13","v":0},{"$f":"G15/'inputs¦other'!H$13","v":0},{"$f":"H15/'inputs¦other'!I$13","v":0},{"$f":"I15/'inputs¦other'!J$13","v":0},{"$f":"J15/'inputs¦other'!K$13","v":0},{"$f":"K15/'inputs¦other'!L$13","v":0},{"$f":"L15/'inputs¦other'!M$13","v":0},null,{"$f":"SUM(P15:T15)","v":2.0107488151625286},{"$f":"SUM(U15:Y15)","v":0}]
{"$rows_left_out":70}
{"sheet":"AER DRAFT inputs¦other","index":4,"n_rows":54,"n_cols":13,"rows_kept":54,"cut":false,"hidden":false,"merged":[]}
[]
[]
[]
[]
[]
[]
[]
[]
[]
[{"$f":"RIGHT(CELL(\"filename\",A1),LEN(CELL(\"filename\",A1))-FIND(\"]\",CELL(\"filename\",A1)))","v":"AER DRAFT inputs¦other"}]
[]
["inflation",null,2012,2013,2014,2015,2016,2017,2018,2019,2020,2021,2022]
["Inflation index","Base 2016/17",{"$f":"D13/(1+C15)","v":0.90889957514783848},{"$f":"E13/(1+D15)","v":0.92330205851181113},{"$f":"F13/(1+E15)","v":0.94638460997460627},{"$f":"G13/(1+F15)","v":0.9741136790468623},{"$f":"H13/(1+G15)","v":0.98706939097818569},1,{"$f":"H13*(1+I15)","v":1.02},{"$f":"I13*(1+J15)","v":1.0404},{"$f":"J13*(1+K15)","v":1.0612079999999999},{"$f":"K13*(1+L15)","v":1.08243216},{"$f":"L13*(1+M15)","v":1.1040808032}]
["Inflation index","Base 2011/12",1,{"$f":"C14*(1+C15)^(10/12)","v":1.0131877248424552},{"$f":"D14*(1+D15)","v":1.0385174179635166},{"$f":"E14*(1+E15)","v":1.0689459783098478},{"$f":"F14*(1+F15)","v":1.083162959821369},{"$f":"G14*(1+G15)","v":1.097352394595029}]
["CPI",null,1.5846066779853007E-2,2.5000000000000001E-2,2.93E-2,1.3299999999999999E-2,1.3100000000000001E-2,0.02,{"$f":"H15","v":0.02},{"$f":"I15","v":0.02},{"$f":"J15","v":0.02},{"$f":"K15","v":0.02},{"$f":"L15","v":0.02}]
{"$rows_left_out":40}
{"sheet":"AER DRAFT Input¦Historic","index":5,"n_rows":101,"n_cols":21,"rows_kept":101,"cut":false,"hidden":false,"merged":[[12,0,12,6],[14,9,14,18]]}
[]
[]
[]
[]
[]
[]
[]
[]
[]
[]
[]
[]
[]
[]
[null,null,null,null,null,null,null,null,null,"aa asset class"]
{"$rows_left_out":87}
{"sheet":"AER DRAFT Input¦Forecast","index":6,"n_rows":99,"n_cols":23,"rows_kept":99,"cut":false,"hidden":false,"merged":[[12,0,12,7],[14,11,14,20]]}
[]
[]
[]
[]
[]
[]
[]
[]
[]
[]
[]
[]
[]
[]
[null,null,null,null,null,null,null,null,null,null,null,"aa asset class"]
{"$rows_left_out":85}
{"sheet":"AER DRAFT Outputs│Tables","index":7,"n_rows":80,"n_cols":29,"rows_kept":80,"cut":false,"hidden":false,"merged":[]}
[]
[]
[]
[]
[]
[]
[]
[]
[]
[{"$f":"RIGHT(CELL(\"filename\",A1),LEN(CELL(\"filename\",A1))-FIND(\"]\",CELL(\"filename\",A1)))","v":"AER DRAFT Outputs│Tables"}]
["Proposed capex and draft decision - based on AER adjusted inflation ('AER DRAFT inputs|other' worksheet)"]
[null,null,null,null,null,null,null,null,null,null,null,null,null,null,null,null,null,null,null,null,null,null,null,null,null,null,null,"Gross Capex"]
["Capex by project ($m nominal)",null,null,null,null,null,null,null,null,null,null,null,null,"Capex by project ($m real 2016/17)",null,null,null,null,null,null,null,null,null,null,null,null,null,"Draft Decision ($2016/17)"]
["Project name",null,2013,2014,2015,2016,2017,2018,2019,2020,2021,2022,null,"Project name",null,2013,2014,2015,2016,2017,2018,2019,2020,2021,2022,null,null,"Current","Forecast"]
[{"$f":"'inputs¦other'!A38","v":"Aquarium Passage"},"$m nominal",{"$f":"SUMIF('AER DRAFT Input¦Historic'!$G$17:$G$98,$A15,'AER DRAFT Input¦Historic'!B$17:B$98)/1000000","v":0.20340742000000001},{"$f":"SUMIF('AER DRAFT Input¦Historic'!$G$17:$G$98,$A15,'AER DRAFT Input¦Historic'!C$17:C$98)/1000000","v":0.60615213000000001},{"$f":"SUMIF('AER DRAFT Input¦Historic'!$G$17:$G$98,$A15,'AER DRAFT Input¦Historic'!D$17:D$98)/1000000","v":1.1201981299999999},{"$f":"SUMIF('AER DRAFT Input¦Historic'!$G$17:$G$98,$A15,'AER DRAFT Input¦Historic'!E$17:E$98)/1000000","v":0},{"$f":"SUMIF('AER DRAFT Input¦Forecast'!$J$17:$J$95,$A15,'AER DRAFT Input¦Forecast'!B$17:B$95)/1000*'AER DRAFT inputs¦other'!H$13","v":0},{"$f":"SUMIF('AER DRAFT Input¦Forecast'!$J$17:$J$95,$A15,'AER DRAFT Input¦Forecast'!C$17:C$95)/1000*'AER DRAFT inputs¦other'!I$13","v":0},{"$f":"SUMIF('AER DRAFT Input¦Forecast'!$J$17:$J$95,$A15,'AER DRAFT Input¦Forecast'!D$17:D$95)/1000*'AER DRAFT inputs¦other'!J$13","v":0},{"$f":"SUMIF('AER DRAFT Input¦Forecast'!$J$17:$J$95,$A15,'AER DRAFT Input¦Forecast'!E$17:E$95)/1000*'AER DRAFT inputs¦other'!K$13","v":0},{"$f":"SUMIF('AER DRAFT Input¦Forecast'!$J$17:$J$95,$A15,'AER DRAFT Input¦Forecast'!F$17:F$95)/1000*'AER DRAFT inputs¦other'!L$13","v":0},{"$f":"SUMIF('AER DRAFT Input¦Forecast'!$J$17:$J$95,$A15,'AER DRAFT Input¦Forecast'!G$17:G$95)/1000*'AER DRAFT inputs¦other'!M$13","v":0},null,{"$f":"A15","v":"Aquarium Passage"},"$m real 2016/17",{"$f":"C15/'AER DRAFT inputs¦other'!D$13","v":0.22030430683524568},{"$f":"D15/'AER DRAFT inputs¦other'!E$13","v":0.64049237869185605},{"$f":"E15/'AER DRAFT inputs¦other'!F$13","v":1.14996653275219},{"$f":"F15/'AER DRAFT inputs¦other'!G$13","v":0},{"$f":"G15/'AER DRAFT inputs¦other'!H$13","v":0},{"$f":"H15/'AER DRAFT inputs¦other'!I$13","v":0},{"$f":"I15/'AER DRAFT inputs¦other'!J$13","v":0},{"$f":"J15/'AER DRAFT inputs¦other'!K$13","v":0},{"$f":"K15/'AER DRAFT inputs¦other'!L$13","v":0},{"$f":"L15/'AER DRAFT inputs¦other'!M$13","v":0},null,null,{"$f":"SUM(P15:T15)","v":2.0107632182792918},{"$f":"SUM(U15:Y15)","v":0}]
{"$rows_left_out":65}