{"text_format":"1","workbook":"xlsx","n_sheets":10,"sheets":["Index","Input|General","Input|Inflation","Input|Reported opex","Input|Rate of change","Input|Step changes","Calc|Opex forecast","Output|Models","Lookup|Tables","Check|List"],"not_rendered":{"charts":0,"images":0,"macros":1,"external_links":0,"defined_names":9,"comments":0,"pivot_tables":0},"unopened":[],"bounds":{"document_bytes":16777216,"sheet_cells":100000,"rows_first":2000,"rows_last":500,"rows_between":2000,"halvings":0,"cell_chars":16384,"cell_head_chars":4096},"cells_cut":0,"cells_raw":0,"read":"whole","date_system":"1900"}

{"sheet":"Index","index":0,"n_rows":17,"n_cols":4,"rows_kept":17,"cut":false,"hidden":false,"merged":[]}
[null,"AER opex model"]
[null,"Index"]
[]
[null,"Model index"]
[]
[null,null,"Sheet Name","Sheet Description"]
[null,null,"Input | General","Inputs NSP name, regulatory years for the prior and forecast regulatory control period etc."]
[null,null,"Input | Inflation","Inputs inflation data."]
[null,null,"Input | Reported opex","Inputs the reported operating expenditure (opex) from the prior regulatory control period."]
[null,null,"Input | Rate of change","Inputs the cost escalation weights, cost escalation forecast, and inflation actuals and forecast"]
{"$rows_left_out":8}
{"sheet":"Input|General","index":1,"n_rows":14,"n_cols":22,"rows_kept":14,"cut":false,"hidden":false,"merged":[]}
[null,{"$f":"Index!$B$1","v":"AER opex model"},null,null,null,null,null,null,null,"Back to Index",null,"Key:","Input","External Link","Internal Link",null,null,"Worksheet check:",{"$f":"IF(COUNTA($S$5:$S$13)=COUNTIF($S5:$S14,\"OK\"),\"OK\",\"Check\")","v":"OK"},null,"Overall Check:",{"$f":"'Check|List'!$S$1","v":"Ok"}]
[null,{"$f":"Index!$C$7","v":"Input | General"}]
[]
[null,"Input | General inputs"]
[]
[null,null,"Inputs","Source",null,null,"Value"]
[null,null,"NSP name","NSP",null,null,"AusNet Services Tx",null,null,null,null,null,null,null,null,null,null,null,{"$f":"IF(COUNTBLANK($G7),\"Check\",\"Ok\")","v":"Ok"}]
[null,null,"Prior regulatory control period, first year","NSP",null,null,"2014-15",null,null,null,null,null,null,null,null,null,null,null,{"$f":"IF(COUNTBLANK($G8),\"Check\",\"Ok\")","v":"Ok"}]
[null,null,"Forecast base year","NSP",null,null,"2014-15",null,null,null,null,null,null,null,null,null,null,null,"Ok"]
[null,null,"Prior regulatory control period, last year","NSP",null,null,"2016-17",null,null,null,null,null,null,null,null,null,null,null,"Ok"]
{"$rows_left_out":5}
{"sheet":"Input|Inflation","index":2,"n_rows":52,"n_cols":22,"rows_kept":52,"cut":false,"hidden":false,"merged":[]}
[null,{"$f":"Index!$B$1","v":"AER opex model"},null,null,null,null,null,null,null,"Back to Index",null,"Key:","Input","External Link","Internal Link",null,null,"Worksheet check:",{"$f":"IF(COUNTA($S$5:$S$51)=COUNTIF($S5:$S52,\"OK\"),\"OK\",\"Check\")","v":"OK"},null,"Overall Check:",{"$f":"'Check|List'!$S$1","v":"Ok"}]
[null,{"$f":"Index!$C$7","v":"Input | General"}]
[]
[null,"Input | General inputs"]
[]
[null,null,null,"Index value, old base","Index value, new base"]
[null,null,"Source","ABS","ABS"]
[null,null,"Unit","index","index"]
[null,null,"2007-03-31",155.6,null,null,null,null,null,null,null,null,null,null,null,null,null,null,{"$f":"IF(COUNTBLANK($D9),\"Check\",\"Ok\")","v":"Ok"}]
[null,null,"2007-06-30",157.5,null,null,null,null,null,null,null,null,null,null,null,null,null,null,"Ok"]
{"$rows_left_out":43}
{"sheet":"Input|Reported opex","index":3,"n_rows":57,"n_cols":22,"rows_kept":57,"cut":false,"hidden":false,"merged":[]}
[null,null,{"$f":"Index!$B$1","v":"AER opex model"},null,null,null,null,null,null,"Back to Index",null,"Key:","Input","External Link","Internal Link",null,null,"Worksheet check:",{"$f":"IF(COUNTA($W$32:$W$250)=COUNTIF($W$32:$W$250,\"OK\"),\"OK\",\"Check\")","v":"OK"},null,"Overall Check:",{"$f":"'Check|List'!$S$1","v":"Ok"}]
[null,null,{"$f":"Index!$C$9","v":"Input | Reported opex"}]
[]
[null,null,null,"Source","Unit","Basis",null,null,null,{"$f":"'Input|General'!$G$8","v":"2014-15"},{"$f":"IF(OFFSET('Lookup|Tables'!$G$26:$G$43,MATCH('Input|General'!$G$8,'Lookup|Tables'!$G$26:$G$42,0),0,1,1)<='Input|General'!$G$12,OFFSET('Lookup|Tables'!$G$26:$G$43,MATCH('Input|General'!$G$8,'Lookup|Tables'!$G$26:$G$42,0),0,1,1),\"\")","v":"2015-16"},{"$f":"IF(OFFSET('Lookup|Tables'!$G$28:$G$43,MATCH('Input|General'!$G$8,'Lookup|Tables'!$G$28:$G$42,0)+1,0,1,1)<='Input|General'!$G$12,OFFSET('Lookup|Tables'!$G$28:$G$43,MATCH('Input|General'!$G$8,'Lookup|Tables'!$G$28:$G$42,0)+1,0,1,1),\"\")","v":"2016-17"},{"$f":"IF(OFFSET('Lookup|Tables'!$G$28:$G$43,MATCH('Input|General'!$G$8,'Lookup|Tables'!$G$28:$G$42,0)+2,0,1,1)<='Input|General'!$G$12,OFFSET('Lookup|Tables'!$G$28:$G$43,MATCH('Input|General'!$G$8,'Lookup|Tables'!$G$28:$G$42,0)+2,0,1,1),\"\")","v":"2017-18"},{"$f":"IF(OFFSET('Lookup|Tables'!$G$28:$G$43,MATCH('Input|General'!$G$8,'Lookup|Tables'!$G$28:$G$42,0)+3,0,1,1)<='Input|General'!$G$12,OFFSET('Lookup|Tables'!$G$28:$G$43,MATCH('Input|General'!$G$8,'Lookup|Tables'!$G$28:$G$42,0)+3,0,1,1),\"\")","v":"2018-19"},{"$f":"IF(OFFSET('Lookup|Tables'!$G$28:$G$43,MATCH('Input|General'!$G$8,'Lookup|Tables'!$G$28:$G$42,0)+4,0,1,1)<='Input|General'!$G$12,OFFSET('Lookup|Tables'!$G$28:$G$43,MATCH('Input|General'!$G$8,'Lookup|Tables'!$G$28:$G$42,0)+4,0,1,1),\"\")","v":"2019-20"},{"$f":"IF(OFFSET('Lookup|Tables'!$G$28:$G$43,MATCH('Input|General'!$G$8,'Lookup|Tables'!$G$28:$G$42,0)+5,0,1,1)<='Input|General'!$G$12,OFFSET('Lookup|Tables'!$G$28:$G$43,MATCH('Input|General'!$G$8,'Lookup|Tables'!$G$28:$G$42,0)+5,0,1,1),\"\")","v":"2020-21"},{"$f":"IF(OFFSET('Lookup|Tables'!$G$28:$G$43,MATCH('Input|General'!$G$8,'Lookup|Tables'!$G$28:$G$42,0)+6,0,1,1)<='Input|General'!$G$12,OFFSET('Lookup|Tables'!$G$28:$G$43,MATCH('Input|General'!$G$8,'Lookup|Tables'!$G$28:$G$42,0)+6,0,1,1),\"\")","v":"2021-22"},{"$f":"IF(OFFSET('Lookup|Tables'!$G$28:$G$43,MATCH('Input|General'!$G$8,'Lookup|Tables'!$G$28:$G$42,0)+7,0,1,1)<='Input|General'!$G$12,OFFSET('Lookup|Tables'!$G$28:$G$43,MATCH('Input|General'!$G$8,'Lookup|Tables'!$G$28:$G$42,0)+7,0,1,1),\"\")","v":""},{"$f":"IF(OFFSET('Lookup|Tables'!$G$28:$G$43,MATCH('Input|General'!$G$8,'Lookup|Tables'!$G$28:$G$42,0)+8,0,1,1)<='Input|General'!$G$12,OFFSET('Lookup|Tables'!$G$28:$G$43,MATCH('Input|General'!$G$8,'Lookup|Tables'!$G$28:$G$42,0)+8,0,1,1),\"\")","v":""}]
[]
[]
[]
[null,"Input | Opex allowances"]
[]
[null,null,"Cost category","Source","Unit","Basis",null,null,null,{"$f":"IF(RIGHT(J$4,2)<=RIGHT('Input|General'!$G$10,2),'Input|Reported opex'!J$4,\"\")","v":"2014-15"},{"$f":"IF(RIGHT(K$4,2)<=RIGHT('Input|General'!$G$10,2),'Input|Reported opex'!K$4,\"\")","v":"2015-16"},{"$f":"IF(RIGHT(L$4,2)<=RIGHT('Input|General'!$G$10,2),'Input|Reported opex'!L$4,\"\")","v":"2016-17"},{"$f":"IF(RIGHT(M$4,2)<=RIGHT('Input|General'!$G$10,2),'Input|Reported opex'!M$4,\"\")","v":""},{"$f":"IF(RIGHT(N$4,2)<=RIGHT('Input|General'!$G$10,2),'Input|Reported opex'!N$4,\"\")","v":""},{"$f":"IF(RIGHT(O$4,2)<=RIGHT('Input|General'!$G$10,2),'Input|Reported opex'!O$4,\"\")","v":""},{"$f":"IF(RIGHT(P$4,2)<=RIGHT('Input|General'!$G$10,2),'Input|Reported opex'!P$4,\"\")","v":""},{"$f":"IF(RIGHT(Q$4,2)<=RIGHT('Input|General'!$G$10,2),'Input|Reported opex'!Q$4,\"\")","v":""},{"$f":"IF(RIGHT(R$4,2)<=RIGHT('Input|General'!$G$10,2),'Input|Reported opex'!R$4,\"\")","v":""},{"$f":"IF(RIGHT(S$4,2)<=RIGHT('Input|General'!$G$10,2),'Input|Reported opex'!S$4,\"\")","v":""},"Notes"]
{"$rows_left_out":48}
{"sheet":"Input|Rate of change","index":4,"n_rows":91,"n_cols":23,"rows_kept":91,"cut":false,"hidden":false,"merged":[[2,10,2,12],[2,14,2,19]]}
[null,{"$f":"Index!$B$1","v":"AER opex model"},null,null,null,null,null,null,null,null,"Back to Index",null,"Key:","Input","External Link","Internal Link",null,null,"Worksheet check:",{"$f":"IF(COUNTIF(W5:W90,\"Check\")=0,\"Ok\",\"Check\")","v":"Ok"},null,"Overall Check:",{"$f":"'Check|List'!$S$1","v":"Ok"}]
[null,{"$f":"Index!$C$10","v":"Input | Rate of change"}]
[]
[null,null,null,"Source","Unit","Basis",null,null,null,{"$f":"IF(OFFSET('Lookup|Tables'!$G$26:$G$43,MATCH('Input|General'!$G$8,'Lookup|Tables'!$G$26:$G$42,0)-2,0,1,1)<='Input|General'!$G$12,OFFSET('Lookup|Tables'!$G$26:$G$43,MATCH('Input|General'!$G$8,'Lookup|Tables'!$G$26:$G$42,0)-2,0,1,1),\"\")","v":"2013-14"},{"$f":"'Input|General'!$G$8","v":"2014-15"},{"$f":"IF(OFFSET('Lookup|Tables'!$G$26:$G$43,MATCH('Input|General'!$G$8,'Lookup|Tables'!$G$26:$G$42,0),0,1,1)<='Input|General'!$G$12,OFFSET('Lookup|Tables'!$G$26:$G$43,MATCH('Input|General'!$G$8,'Lookup|Tables'!$G$26:$G$42,0),0,1,1),\"\")","v":"2015-16"},{"$f":"IF(OFFSET('Lookup|Tables'!$G$26:$G$43,MATCH('Input|General'!$G$8,'Lookup|Tables'!$G$26:$G$42,0)+1,0,1,1)<='Input|General'!$G$12,OFFSET('Lookup|Tables'!$G$26:$G$43,MATCH('Input|General'!$G$8,'Lookup|Tables'!$G$26:$G$42,0)+1,0,1,1),\"\")","v":"2016-17"},{"$f":"IF(OFFSET('Lookup|Tables'!$G$26:$G$43,MATCH('Input|General'!$G$8,'Lookup|Tables'!$G$26:$G$42,0)+2,0,1,1)<='Input|General'!$G$12,OFFSET('Lookup|Tables'!$G$26:$G$43,MATCH('Input|General'!$G$8,'Lookup|Tables'!$G$26:$G$42,0)+2,0,1,1),\"\")","v":"2017-18"},{"$f":"IF(OFFSET('Lookup|Tables'!$G$26:$G$43,MATCH('Input|General'!$G$8,'Lookup|Tables'!$G$26:$G$42,0)+3,0,1,1)<='Input|General'!$G$12,OFFSET('Lookup|Tables'!$G$26:$G$43,MATCH('Input|General'!$G$8,'Lookup|Tables'!$G$26:$G$42,0)+3,0,1,1),\"\")","v":"2018-19"},{"$f":"IF(OFFSET('Lookup|Tables'!$G$26:$G$43,MATCH('Input|General'!$G$8,'Lookup|Tables'!$G$26:$G$42,0)+4,0,1,1)<='Input|General'!$G$12,OFFSET('Lookup|Tables'!$G$26:$G$43,MATCH('Input|General'!$G$8,'Lookup|Tables'!$G$26:$G$42,0)+4,0,1,1),\"\")","v":"2019-20"},{"$f":"IF(OFFSET('Lookup|Tables'!$G$26:$G$43,MATCH('Input|General'!$G$8,'Lookup|Tables'!$G$26:$G$42,0)+5,0,1,1)<='Input|General'!$G$12,OFFSET('Lookup|Tables'!$G$26:$G$43,MATCH('Input|General'!$G$8,'Lookup|Tables'!$G$26:$G$42,0)+5,0,1,1),\"\")","v":"2020-21"},{"$f":"IF(OFFSET('Lookup|Tables'!$G$26:$G$43,MATCH('Input|General'!$G$8,'Lookup|Tables'!$G$26:$G$42,0)+6,0,1,1)<='Input|General'!$G$12,OFFSET('Lookup|Tables'!$G$26:$G$43,MATCH('Input|General'!$G$8,'Lookup|Tables'!$G$26:$G$42,0)+6,0,1,1),\"\")","v":"2021-22"},{"$f":"IF(OFFSET('Lookup|Tables'!$G$26:$G$43,MATCH('Input|General'!$G$8,'Lookup|Tables'!$G$26:$G$42,0)+7,0,1,1)<='Input|General'!$G$12,OFFSET('Lookup|Tables'!$G$26:$G$43,MATCH('Input|General'!$G$8,'Lookup|Tables'!$G$26:$G$42,0)+7,0,1,1),\"\")","v":""},{"$f":"IF(OFFSET('Lookup|Tables'!$G$28:$G$43,MATCH('Input|General'!$G$8,'Lookup|Tables'!$G$28:$G$42,0)+8,0,1,1)<='Input|General'!$G$12,OFFSET('Lookup|Tables'!$G$28:$G$43,MATCH('Input|General'!$G$8,'Lookup|Tables'!$G$28:$G$42,0)+8,0,1,1),\"\")","v":""}]
[]
[]
[]
[null,"Input | Inflation"]
[]
[null,null,"Inflation",null,null,null,null,null,null,{"$f":"J$4","v":"2013-14"},{"$f":"K$4","v":"2014-15"},{"$f":"L$4","v":"2015-16"},"2016-17","2017-18","2018-19","2019-20","2020-21","2021-22","",""]
{"$rows_left_out":82}
{"sheet":"Input|Step changes","index":5,"n_rows":39,"n_cols":22,"rows_kept":39,"cut":false,"hidden":false,"merged":[[2,9,2,11],[2,13,2,18]]}
[null,{"$f":"Index!$B$1","v":"AER opex model"},null,null,null,null,null,null,null,"Back to Index",null,"Key:","Input","External Link","Internal Link",null,null,"Worksheet check:",{"$f":"IF(COUNTA($W$8:$W$232)=COUNTIF($W$8:$W$232,\"OK\"),\"OK\",\"Check\")","v":"OK"},null,"Overall Check:",{"$f":"'Check|List'!$S$1","v":"Ok"}]
[null,{"$f":"Index!$C$11","v":"Input | Step changes"}]
[]
[null,null,null,"Source","Unit","Basis",null,null,null,{"$f":"'Input|General'!$G$8","v":"2014-15"},{"$f":"IF(OFFSET('Lookup|Tables'!$G$26:$G$43,MATCH('Input|General'!$G$8,'Lookup|Tables'!$G$26:$G$42,0),0,1,1)<='Input|General'!$G$12,OFFSET('Lookup|Tables'!$G$26:$G$43,MATCH('Input|General'!$G$8,'Lookup|Tables'!$G$26:$G$42,0),0,1,1),\"\")","v":"2015-16"},{"$f":"IF(OFFSET('Lookup|Tables'!$G$28:$G$43,MATCH('Input|General'!$G$8,'Lookup|Tables'!$G$28:$G$42,0)+1,0,1,1)<='Input|General'!$G$12,OFFSET('Lookup|Tables'!$G$28:$G$43,MATCH('Input|General'!$G$8,'Lookup|Tables'!$G$28:$G$42,0)+1,0,1,1),\"\")","v":"2016-17"},{"$f":"IF(OFFSET('Lookup|Tables'!$G$28:$G$43,MATCH('Input|General'!$G$8,'Lookup|Tables'!$G$28:$G$42,0)+2,0,1,1)<='Input|General'!$G$12,OFFSET('Lookup|Tables'!$G$28:$G$43,MATCH('Input|General'!$G$8,'Lookup|Tables'!$G$28:$G$42,0)+2,0,1,1),\"\")","v":"2017-18"},{"$f":"IF(OFFSET('Lookup|Tables'!$G$28:$G$43,MATCH('Input|General'!$G$8,'Lookup|Tables'!$G$28:$G$42,0)+3,0,1,1)<='Input|General'!$G$12,OFFSET('Lookup|Tables'!$G$28:$G$43,MATCH('Input|General'!$G$8,'Lookup|Tables'!$G$28:$G$42,0)+3,0,1,1),\"\")","v":"2018-19"},{"$f":"IF(OFFSET('Lookup|Tables'!$G$28:$G$43,MATCH('Input|General'!$G$8,'Lookup|Tables'!$G$28:$G$42,0)+4,0,1,1)<='Input|General'!$G$12,OFFSET('Lookup|Tables'!$G$28:$G$43,MATCH('Input|General'!$G$8,'Lookup|Tables'!$G$28:$G$42,0)+4,0,1,1),\"\")","v":"2019-20"},{"$f":"IF(OFFSET('Lookup|Tables'!$G$28:$G$43,MATCH('Input|General'!$G$8,'Lookup|Tables'!$G$28:$G$42,0)+5,0,1,1)<='Input|General'!$G$12,OFFSET('Lookup|Tables'!$G$28:$G$43,MATCH('Input|General'!$G$8,'Lookup|Tables'!$G$28:$G$42,0)+5,0,1,1),\"\")","v":"2020-21"},{"$f":"IF(OFFSET('Lookup|Tables'!$G$28:$G$43,MATCH('Input|General'!$G$8,'Lookup|Tables'!$G$28:$G$42,0)+6,0,1,1)<='Input|General'!$G$12,OFFSET('Lookup|Tables'!$G$28:$G$43,MATCH('Input|General'!$G$8,'Lookup|Tables'!$G$28:$G$42,0)+6,0,1,1),\"\")","v":"2021-22"},{"$f":"IF(OFFSET('Lookup|Tables'!$G$28:$G$43,MATCH('Input|General'!$G$8,'Lookup|Tables'!$G$28:$G$42,0)+7,0,1,1)<='Input|General'!$G$12,OFFSET('Lookup|Tables'!$G$28:$G$43,MATCH('Input|General'!$G$8,'Lookup|Tables'!$G$28:$G$42,0)+7,0,1,1),\"\")","v":""},{"$f":"IF(OFFSET('Lookup|Tables'!$G$28:$G$43,MATCH('Input|General'!$G$8,'Lookup|Tables'!$G$28:$G$42,0)+8,0,1,1)<='Input|General'!$G$12,OFFSET('Lookup|Tables'!$G$28:$G$43,MATCH('Input|General'!$G$8,'Lookup|Tables'!$G$28:$G$42,0)+8,0,1,1),\"\")","v":""}]
[]
[]
[]
[null,"Input |Step changes"]
[]
[null,null,"Step change","Source","Unit","Basis",null,null,null,{"$f":"IF(RIGHT(J$4,2)>=RIGHT('Input|General'!$G$11,2),IF(RIGHT(J$4,2)<=RIGHT('Input|General'!$G$12,2),J$4,\"\"),\"\")","v":""},{"$f":"IF(RIGHT(K$4,2)>=RIGHT('Input|General'!$G$11,2),IF(RIGHT(K$4,2)<=RIGHT('Input|General'!$G$12,2),K$4,\"\"),\"\")","v":""},{"$f":"IF(RIGHT(L$4,2)>=RIGHT('Input|General'!$G$11,2),IF(RIGHT(L$4,2)<=RIGHT('Input|General'!$G$12,2),L$4,\"\"),\"\")","v":""},{"$f":"IF(RIGHT(M$4,2)>=RIGHT('Input|General'!$G$11,2),IF(RIGHT(M$4,2)<=RIGHT('Input|General'!$G$12,2),M$4,\"\"),\"\")","v":"2017-18"},{"$f":"IF(RIGHT(N$4,2)>=RIGHT('Input|General'!$G$11,2),IF(RIGHT(N$4,2)<=RIGHT('Input|General'!$G$12,2),N$4,\"\"),\"\")","v":"2018-19"},{"$f":"IF(RIGHT(O$4,2)>=RIGHT('Input|General'!$G$11,2),IF(RIGHT(O$4,2)<=RIGHT('Input|General'!$G$12,2),O$4,\"\"),\"\")","v":"2019-20"},{"$f":"IF(RIGHT(P$4,2)>=RIGHT('Input|General'!$G$11,2),IF(RIGHT(P$4,2)<=RIGHT('Input|General'!$G$12,2),P$4,\"\"),\"\")","v":"2020-21"},{"$f":"IF(RIGHT(Q$4,2)>=RIGHT('Input|General'!$G$11,2),IF(RIGHT(Q$4,2)<=RIGHT('Input|General'!$G$12,2),Q$4,\"\"),\"\")","v":"2021-22"},{"$f":"IF(RIGHT(R$4,2)>=RIGHT('Input|General'!$G$11,2),IF(RIGHT(R$4,2)<=RIGHT('Input|General'!$G$12,2),R$4,\"\"),\"\")","v":""},{"$f":"IF(RIGHT(S$4,2)>=RIGHT('Input|General'!$G$11,2),IF(RIGHT(S$4,2)<=RIGHT('Input|General'!$G$12,2),S$4,\"\"),\"\")","v":""}]
{"$rows_left_out":30}
{"sheet":"Calc|Opex forecast","index":6,"n_rows":89,"n_cols":22,"rows_kept":89,"cut":false,"hidden":false,"merged":[[2,9,2,11],[2,13,2,18]]}
[null,{"$f":"Index!$B$1","v":"AER opex model"},null,null,null,null,null,null,null,"Back to Index",null,"Key:","Input","External Link","Internal Link",null,null,"Worksheet check:","n/a",null,"Overall Check:",{"$f":"'Check|List'!$S$1","v":"Ok"}]
[null,{"$f":"Index!$C$12","v":"Calc | Opex Forecast"}]
[]
[null,null,null,"Source","Unit","Basis",null,null,null,{"$f":"'Input|General'!$G$8","v":"2014-15"},{"$f":"IF(OFFSET('Lookup|Tables'!$G$26:$G$43,MATCH('Input|General'!$G$8,'Lookup|Tables'!$G$26:$G$42,0),0,1,1)<='Input|General'!$G$12,OFFSET('Lookup|Tables'!$G$26:$G$43,MATCH('Input|General'!$G$8,'Lookup|Tables'!$G$26:$G$42,0),0,1,1),\"\")","v":"2015-16"},{"$f":"IF(OFFSET('Lookup|Tables'!$G$28:$G$43,MATCH('Input|General'!$G$8,'Lookup|Tables'!$G$28:$G$42,0)+1,0,1,1)<='Input|General'!$G$12,OFFSET('Lookup|Tables'!$G$28:$G$43,MATCH('Input|General'!$G$8,'Lookup|Tables'!$G$28:$G$42,0)+1,0,1,1),\"\")","v":"2016-17"},{"$f":"IF(OFFSET('Lookup|Tables'!$G$28:$G$43,MATCH('Input|General'!$G$8,'Lookup|Tables'!$G$28:$G$42,0)+2,0,1,1)<='Input|General'!$G$12,OFFSET('Lookup|Tables'!$G$28:$G$43,MATCH('Input|General'!$G$8,'Lookup|Tables'!$G$28:$G$42,0)+2,0,1,1),\"\")","v":"2017-18"},{"$f":"IF(OFFSET('Lookup|Tables'!$G$28:$G$43,MATCH('Input|General'!$G$8,'Lookup|Tables'!$G$28:$G$42,0)+3,0,1,1)<='Input|General'!$G$12,OFFSET('Lookup|Tables'!$G$28:$G$43,MATCH('Input|General'!$G$8,'Lookup|Tables'!$G$28:$G$42,0)+3,0,1,1),\"\")","v":"2018-19"},{"$f":"IF(OFFSET('Lookup|Tables'!$G$28:$G$43,MATCH('Input|General'!$G$8,'Lookup|Tables'!$G$28:$G$42,0)+4,0,1,1)<='Input|General'!$G$12,OFFSET('Lookup|Tables'!$G$28:$G$43,MATCH('Input|General'!$G$8,'Lookup|Tables'!$G$28:$G$42,0)+4,0,1,1),\"\")","v":"2019-20"},{"$f":"IF(OFFSET('Lookup|Tables'!$G$28:$G$43,MATCH('Input|General'!$G$8,'Lookup|Tables'!$G$28:$G$42,0)+5,0,1,1)<='Input|General'!$G$12,OFFSET('Lookup|Tables'!$G$28:$G$43,MATCH('Input|General'!$G$8,'Lookup|Tables'!$G$28:$G$42,0)+5,0,1,1),\"\")","v":"2020-21"},{"$f":"IF(OFFSET('Lookup|Tables'!$G$28:$G$43,MATCH('Input|General'!$G$8,'Lookup|Tables'!$G$28:$G$42,0)+6,0,1,1)<='Input|General'!$G$12,OFFSET('Lookup|Tables'!$G$28:$G$43,MATCH('Input|General'!$G$8,'Lookup|Tables'!$G$28:$G$42,0)+6,0,1,1),\"\")","v":"2021-22"},{"$f":"IF(OFFSET('Lookup|Tables'!$G$28:$G$43,MATCH('Input|General'!$G$8,'Lookup|Tables'!$G$28:$G$42,0)+7,0,1,1)<='Input|General'!$G$12,OFFSET('Lookup|Tables'!$G$28:$G$43,MATCH('Input|General'!$G$8,'Lookup|Tables'!$G$28:$G$42,0)+7,0,1,1),\"\")","v":""},{"$f":"IF(OFFSET('Lookup|Tables'!$G$28:$G$43,MATCH('Input|General'!$G$8,'Lookup|Tables'!$G$28:$G$42,0)+8,0,1,1)<='Input|General'!$G$12,OFFSET('Lookup|Tables'!$G$28:$G$43,MATCH('Input|General'!$G$8,'Lookup|Tables'!$G$28:$G$42,0)+8,0,1,1),\"\")","v":""}]
[]
[]
[]
[null,"Calc | Estimated final year expenditure",null,null,"$millions","2016-17"]
[]
[null,null,null,"Source","Unit","Basis",null,null,null,{"$f":"IF(RIGHT(J$4,2)>=RIGHT('Input|General'!$G$9,2),IF(RIGHT(J$4,2)<=RIGHT('Input|General'!$G$10,2),J$4,\"\"),\"\")","v":"2014-15"},{"$f":"IF(RIGHT(K$4,2)>=RIGHT('Input|General'!$G$9,2),IF(RIGHT(K$4,2)<=RIGHT('Input|General'!$G$10,2),K$4,\"\"),\"\")","v":"2015-16"},{"$f":"IF(RIGHT(L$4,2)>=RIGHT('Input|General'!$G$9,2),IF(RIGHT(L$4,2)<=RIGHT('Input|General'!$G$10,2),L$4,\"\"),\"\")","v":"2016-17"},{"$f":"IF(RIGHT(M$4,2)>=RIGHT('Input|General'!$G$9,2),IF(RIGHT(M$4,2)<=RIGHT('Input|General'!$G$10,2),M$4,\"\"),\"\")","v":""},{"$f":"IF(RIGHT(N$4,2)>=RIGHT('Input|General'!$G$9,2),IF(RIGHT(N$4,2)<=RIGHT('Input|General'!$G$10,2),N$4,\"\"),\"\")","v":""},{"$f":"IF(RIGHT(O$4,2)>=RIGHT('Input|General'!$G$9,2),IF(RIGHT(O$4,2)<=RIGHT('Input|General'!$G$10,2),O$4,\"\"),\"\")","v":""},{"$f":"IF(RIGHT(P$4,2)>=RIGHT('Input|General'!$G$9,2),IF(RIGHT(P$4,2)<=RIGHT('Input|General'!$G$10,2),P$4,\"\"),\"\")","v":""},{"$f":"IF(RIGHT(Q$4,2)>=RIGHT('Input|General'!$G$9,2),IF(RIGHT(Q$4,2)<=RIGHT('Input|General'!$G$10,2),Q$4,\"\"),\"\")","v":""},{"$f":"IF(RIGHT(R$4,2)>=RIGHT('Input|General'!$G$9,2),IF(RIGHT(R$4,2)<=RIGHT('Input|General'!$G$10,2),R$4,\"\"),\"\")","v":""},{"$f":"IF(RIGHT(S$4,2)>=RIGHT('Input|General'!$G$9,2),IF(RIGHT(S$4,2)<=RIGHT('Input|General'!$G$10,2),S$4,\"\"),\"\")","v":""}]
{"$rows_left_out":80}
{"sheet":"Output|Models","index":7,"n_rows":15,"n_cols":22,"rows_kept":15,"cut":false,"hidden":false,"merged":[[2,9,2,11],[2,13,2,18]]}
[null,{"$f":"Index!$B$1","v":"AER opex model"},null,null,null,null,null,null,null,"Back to Index",null,"Key:","Input","External Link","Internal Link",null,null,"Worksheet check:",{"$f":"IF(COUNTA($W$14:$W$471)=COUNTIF($W$14:$W$471,\"OK\"),\"OK\",\"Check\")","v":"OK"},null,"Overall Check:",{"$f":"'Check|List'!$S$1","v":"Ok"}]
[null,{"$f":"Index!$C$13","v":"Output | Models"}]
[]
[null,null,null,"Source","Unit","Basis",null,null,null,{"$f":"'Input|General'!$G$8","v":"2014-15"},{"$f":"IF(OFFSET('Lookup|Tables'!$G$28:$G$43,MATCH('Input|General'!$G$8,'Lookup|Tables'!$G$28:$G$42,0)+1,0,1,1)<='Input|General'!$G$12,OFFSET('Lookup|Tables'!$G$28:$G$43,MATCH('Input|General'!$G$8,'Lookup|Tables'!$G$28:$G$42,0),0,1,1),\"\")","v":"2015-16"},{"$f":"IF(OFFSET('Lookup|Tables'!$G$28:$G$43,MATCH('Input|General'!$G$8,'Lookup|Tables'!$G$28:$G$42,0)+1,0,1,1)<='Input|General'!$G$12,OFFSET('Lookup|Tables'!$G$28:$G$43,MATCH('Input|General'!$G$8,'Lookup|Tables'!$G$28:$G$42,0)+1,0,1,1),\"\")","v":"2016-17"},{"$f":"IF(OFFSET('Lookup|Tables'!$G$28:$G$43,MATCH('Input|General'!$G$8,'Lookup|Tables'!$G$28:$G$42,0)+2,0,1,1)<='Input|General'!$G$12,OFFSET('Lookup|Tables'!$G$28:$G$43,MATCH('Input|General'!$G$8,'Lookup|Tables'!$G$28:$G$42,0)+2,0,1,1),\"\")","v":"2017-18"},{"$f":"IF(OFFSET('Lookup|Tables'!$G$28:$G$43,MATCH('Input|General'!$G$8,'Lookup|Tables'!$G$28:$G$42,0)+3,0,1,1)<='Input|General'!$G$12,OFFSET('Lookup|Tables'!$G$28:$G$43,MATCH('Input|General'!$G$8,'Lookup|Tables'!$G$28:$G$42,0)+3,0,1,1),\"\")","v":"2018-19"},{"$f":"IF(OFFSET('Lookup|Tables'!$G$28:$G$43,MATCH('Input|General'!$G$8,'Lookup|Tables'!$G$28:$G$42,0)+4,0,1,1)<='Input|General'!$G$12,OFFSET('Lookup|Tables'!$G$28:$G$43,MATCH('Input|General'!$G$8,'Lookup|Tables'!$G$28:$G$42,0)+4,0,1,1),\"\")","v":"2019-20"},{"$f":"IF(OFFSET('Lookup|Tables'!$G$28:$G$43,MATCH('Input|General'!$G$8,'Lookup|Tables'!$G$28:$G$42,0)+5,0,1,1)<='Input|General'!$G$12,OFFSET('Lookup|Tables'!$G$28:$G$43,MATCH('Input|General'!$G$8,'Lookup|Tables'!$G$28:$G$42,0)+5,0,1,1),\"\")","v":"2020-21"},{"$f":"IF(OFFSET('Lookup|Tables'!$G$28:$G$43,MATCH('Input|General'!$G$8,'Lookup|Tables'!$G$28:$G$42,0)+6,0,1,1)<='Input|General'!$G$12,OFFSET('Lookup|Tables'!$G$28:$G$43,MATCH('Input|General'!$G$8,'Lookup|Tables'!$G$28:$G$42,0)+6,0,1,1),\"\")","v":"2021-22"},{"$f":"IF(OFFSET('Lookup|Tables'!$G$28:$G$43,MATCH('Input|General'!$G$8,'Lookup|Tables'!$G$28:$G$42,0)+7,0,1,1)<='Input|General'!$G$12,OFFSET('Lookup|Tables'!$G$28:$G$43,MATCH('Input|General'!$G$8,'Lookup|Tables'!$G$28:$G$42,0)+7,0,1,1),\"\")","v":""},{"$f":"IF(OFFSET('Lookup|Tables'!$G$28:$G$43,MATCH('Input|General'!$G$8,'Lookup|Tables'!$G$28:$G$42,0)+8,0,1,1)<='Input|General'!$G$12,OFFSET('Lookup|Tables'!$G$28:$G$43,MATCH('Input|General'!$G$8,'Lookup|Tables'!$G$28:$G$42,0)+8,0,1,1),\"\")","v":""}]
[]
[]
[]
[null,"Inputs for Post Tax Revenue Model",null,null,"$millions","2016-17",null,null,null,"Note. The dollar base should be consistent with the post tax revenue model"]
[]
[]
{"$rows_left_out":6}
{"sheet":"Lookup|Tables","index":8,"n_rows":44,"n_cols":22,"rows_kept":44,"cut":false,"hidden":false,"merged":[]}
[null,{"$f":"Index!$B$1","v":"AER opex model"},null,null,null,null,null,null,null,"Back to Index",null,"Key:","Input","External Link","Internal Link",null,null,null,null,null,"Overall Check:",{"$f":"'Check|List'!$S$1","v":"Ok"}]
[null,{"$f":"Index!$C$14","v":"Lookup | Tables"}]
[]
[]
[]
[]
[null,"Unit Denominations"]
[]
[null,null,{"$f":"B7","v":"Unit Denominations"},"Source",null,null,"Ref"]
[null,null,"Dollars","AER",null,null,"$dollars"]
{"$rows_left_out":35}
{"sheet":"Check|List","index":9,"n_rows":17,"n_cols":19,"rows_kept":17,"cut":false,"hidden":false,"merged":[]}
[null,{"$f":"Index!$B$1","v":"AER opex model"},null,null,null,null,null,null,null,"Back to Index",null,"Key:","Input","External Link","Internal Link",null,null,"Overall Check:",{"$f":"IF(COUNTIF(G10:G15,\"Check\")=0,\"Ok\",\"Check\")","v":"Ok"}]
[null,{"$f":"Index!$C$15","v":"Check | List"}]
[]
[]
[]
[]
[null,"Check List"]
[]
[null,null,"Sheet","Source","Unit",null,"Status"]
[null,null,{"$f":"Index!C7","v":"Input | General"},{"$f":"C10","v":"Input | General"},"Ok/Check",null,{"$f":"'Input|General'!S1","v":"OK"}]
{"$rows_left_out":7}