{"text_format":"1","workbook":"xlsx","n_sheets":16,"sheets":["Introduction","Contents","Dashboard","Calculations","New data sheet","1. Revenue","2. RAB - Closing","3. Capex","4. Capex by Driver","5. Opex","6. Reliability - outage events","7. Reliability -outage duration","8. Market impact","9. Maximum demand","10. Energy delivered","11. Circuit length"],"not_rendered":{"charts":22,"images":3,"macros":1,"external_links":2,"defined_names":68,"comments":0,"pivot_tables":0},"unopened":[],"bounds":{"document_bytes":16777216,"sheet_cells":100000,"rows_first":2000,"rows_last":500,"rows_between":2000,"halvings":0,"cell_chars":16384,"cell_head_chars":4096},"cells_cut":0,"cells_raw":0,"read":"whole","date_system":"1900"}

{"sheet":"Introduction","index":0,"n_rows":29,"n_cols":10,"rows_kept":29,"cut":false,"hidden":false,"merged":[[10,2,10,14],[16,2,16,14],[12,2,13,14]]}
[]
[null,null,null,"Electricity Transmission Network Service Provider"]
[null,null,"Operational Performance Data"]
[]
[]
[null,"Introduction"]
[]
[]
[]
[]
[null,null,"This workbook contains operational performance data for electricity transmission businesses in the National Energy Market (NEM). The charts and data are presented for a range of financial and network operational performance measures.  "]
[null,null,"Interpretation"]
[null,null,"The data covers the regulatory years from 2006 to 2022. It is reported on an end of year basis. All transmission businesses report on a financial year basis, hence the label 2015 refers to data collected for the year ending 30 June 2015 (or 31 March 2015 for AusNet (T)). Exceptions to this are tables 6,7 and 8, which are reported on a calendar year basis, in line with STPIS reporting timeframes.\n\nAll financial values have been converted to June 2022 dollars (or March 2022 dollars for AusNet (T))."]
[]
[]
{"$rows_left_out":15}
{"sheet":"Contents","index":1,"n_rows":23,"n_cols":8,"rows_kept":23,"cut":false,"hidden":false,"merged":[[23,2,23,8],[12,2,12,8],[13,2,13,8],[14,2,14,8],[15,2,15,8],[16,2,16,8]]}
[]
[]
[null,null,null,null,null,null,null,"Electricity Transmission Network Service Provider"]
[null,"Operational Performance Data"]
[]
[null,"Contents"]
[]
[]
[]
[]
[]
[]
[null,null,"1. Revenue"]
[null,null,"2. Regulated asset base - closing"]
[null,null,"3. Capital expenditure"]
{"$rows_left_out":9}
{"sheet":"Dashboard","index":2,"n_rows":126,"n_cols":17,"rows_kept":126,"cut":false,"hidden":false,"merged":[[2,5,2,9]]}
[]
[]
[null,null,null,null,null,"Transmission total"]
[]
[]
[null,null,null,null,null,null,"Summary statistics"]
[]
[]
[null,null,null,null,null,null,null,2022,"5 year trend"]
[null,null,null,null,null,null,"Actual revenue from customers",{"$f":"\"$\"&TEXT(Calculations!U10,\"#,##0\")&\"m\"","v":"$2,459m"}]
[null,null,null,null,null,null,"Budgeted revenue from customers",{"$f":"\"$\"&TEXT(Calculations!U11,\"#,##0\")&\"m\"","v":"$2,584m"}]
[null,null,null,null,null,null,"Actual closing RAB",{"$f":"\"$\"&TEXT(Calculations!U12,\"#,##0\")&\"m\"","v":"$22,828m"}]
[null,null,null,null,null,null,"Forecast closing RAB",{"$f":"\"$\"&TEXT(Calculations!U13,\"#,##0\")&\"m\"","v":"$23,811m"}]
[null,null,null,null,null,null,"Actual annual capex",{"$f":"\"$\"&TEXT(Calculations!U14,\"#,##0\")&\"m\"","v":"$1,250m"}]
[null,null,null,null,null,null,"Forecast annual capex",{"$f":"\"$\"&TEXT(Calculations!U15,\"#,##0\")&\"m\"","v":"$2,148m"}]
{"$rows_left_out":112}
{"sheet":"Calculations","index":3,"n_rows":36,"n_cols":21,"rows_kept":36,"cut":false,"hidden":true,"merged":[]}
[]
[]
[null,null,null,"Calculations"]
[]
[null,null,null,"Summary statistics"]
[]
[null,null,null,"Match",{"$f":"Dashboard!F3","v":"Transmission total"}]
[]
[null,null,null,null,"2006","2007","2008","2009","2010","2011","2012","2013","2014","2015",2016,2017,"2018","2019","2020","2021","2022"]
[null,null,null,"Actual revenue from customers",{"$f":"IFERROR(INDEX('New data sheet'!$F:$K,MATCH($D10&E$9,'New data sheet'!$L:$L,0),MATCH($E$7,'New data sheet'!$F$6:$K$6,0)),\"\")","v":1898.8674679313026},{"$f":"IFERROR(INDEX('New data sheet'!$F:$K,MATCH($D10&F$9,'New data sheet'!$L:$L,0),MATCH($E$7,'New data sheet'!$F$6:$K$6,0)),\"\")","v":1963.741979457031},{"$f":"IFERROR(INDEX('New data sheet'!$F:$K,MATCH($D10&G$9,'New data sheet'!$L:$L,0),MATCH($E$7,'New data sheet'!$F$6:$K$6,0)),\"\")","v":2045.0735114914733},{"$f":"IFERROR(INDEX('New data sheet'!$F:$K,MATCH($D10&H$9,'New data sheet'!$L:$L,0),MATCH($E$7,'New data sheet'!$F$6:$K$6,0)),\"\")","v":2193.2704689620705},{"$f":"IFERROR(INDEX('New data sheet'!$F:$K,MATCH($D10&I$9,'New data sheet'!$L:$L,0),MATCH($E$7,'New data sheet'!$F$6:$K$6,0)),\"\")","v":2519.8664941968477},{"$f":"IFERROR(INDEX('New data sheet'!$F:$K,MATCH($D10&J$9,'New data sheet'!$L:$L,0),MATCH($E$7,'New data sheet'!$F$6:$K$6,0)),\"\")","v":2790.8799260823926},{"$f":"IFERROR(INDEX('New data sheet'!$F:$K,MATCH($D10&K$9,'New data sheet'!$L:$L,0),MATCH($E$7,'New data sheet'!$F$6:$K$6,0)),\"\")","v":2991.8646952906356},{"$f":"IFERROR(INDEX('New data sheet'!$F:$K,MATCH($D10&L$9,'New data sheet'!$L:$L,0),MATCH($E$7,'New data sheet'!$F$6:$K$6,0)),\"\")","v":3104.589567869225},{"$f":"IFERROR(INDEX('New data sheet'!$F:$K,MATCH($D10&M$9,'New data sheet'!$L:$L,0),MATCH($E$7,'New data sheet'!$F$6:$K$6,0)),\"\")","v":2928.5686436238666},{"$f":"IFERROR(INDEX('New data sheet'!$F:$K,MATCH($D10&N$9,'New data sheet'!$L:$L,0),MATCH($E$7,'New data sheet'!$F$6:$K$6,0)),\"\")","v":2929.4181787455759},{"$f":"IFERROR(INDEX('New data sheet'!$F:$K,MATCH($D10&O$9,'New data sheet'!$L:$L,0),MATCH($E$7,'New data sheet'!$F$6:$K$6,0)),\"\")","v":2908.0555896820615},{"$f":"IFERROR(INDEX('New data sheet'!$F:$K,MATCH($D10&P$9,'New data sheet'!$L:$L,0),MATCH($E$7,'New data sheet'!$F$6:$K$6,0)),\"\")","v":2936.0939186686005},{"$f":"IFERROR(INDEX('New data sheet'!$F:$K,MATCH($D10&Q$9,'New data sheet'!$L:$L,0),MATCH($E$7,'New data sheet'!$F$6:$K$6,0)),\"\")","v":2448.703326872891},{"$f":"IFERROR(INDEX('New data sheet'!$F:$K,MATCH($D10&R$9,'New data sheet'!$L:$L,0),MATCH($E$7,'New data sheet'!$F$6:$K$6,0)),\"\")","v":2279.004949705517},{"$f":"IFERROR(INDEX('New data sheet'!$F:$K,MATCH($D10&S$9,'New data sheet'!$L:$L,0),MATCH($E$7,'New data sheet'!$F$6:$K$6,0)),\"\")","v":2337.7092501811862},{"$f":"IFERROR(INDEX('New data sheet'!$F:$K,MATCH($D10&T$9,'New data sheet'!$L:$L,0),MATCH($E$7,'New data sheet'!$F$6:$K$6,0)),\"\")","v":2398.1214873528493},{"$f":"IFERROR(INDEX('New data sheet'!$F:$K,MATCH($D10&U$9,'New data sheet'!$L:$L,0),MATCH($E$7,'New data sheet'!$F$6:$K$6,0)),\"\")","v":2458.7968573385183}]
[null,null,null,"Budgeted revenue from Customers",{"$f":"IFERROR(INDEX('New data sheet'!$F:$K,MATCH($D11&E$9,'New data sheet'!$L:$L,0),MATCH($E$7,'New data sheet'!$F$6:$K$6,0)),\"\")","v":""},{"$f":"IFERROR(INDEX('New data sheet'!$F:$K,MATCH($D11&F$9,'New data sheet'!$L:$L,0),MATCH($E$7,'New data sheet'!$F$6:$K$6,0)),\"\")","v":""},{"$f":"IFERROR(INDEX('New data sheet'!$F:$K,MATCH($D11&G$9,'New data sheet'!$L:$L,0),MATCH($E$7,'New data sheet'!$F$6:$K$6,0)),\"\")","v":""},{"$f":"IFERROR(INDEX('New data sheet'!$F:$K,MATCH($D11&H$9,'New data sheet'!$L:$L,0),MATCH($E$7,'New data sheet'!$F$6:$K$6,0)),\"\")","v":""},{"$f":"IFERROR(INDEX('New data sheet'!$F:$K,MATCH($D11&I$9,'New data sheet'!$L:$L,0),MATCH($E$7,'New data sheet'!$F$6:$K$6,0)),\"\")","v":""},{"$f":"IFERROR(INDEX('New data sheet'!$F:$K,MATCH($D11&J$9,'New data sheet'!$L:$L,0),MATCH($E$7,'New data sheet'!$F$6:$K$6,0)),\"\")","v":""},{"$f":"IFERROR(INDEX('New data sheet'!$F:$K,MATCH($D11&K$9,'New data sheet'!$L:$L,0),MATCH($E$7,'New data sheet'!$F$6:$K$6,0)),\"\")","v":""},{"$f":"IFERROR(INDEX('New data sheet'!$F:$K,MATCH($D11&L$9,'New data sheet'!$L:$L,0),MATCH($E$7,'New data sheet'!$F$6:$K$6,0)),\"\")","v":""},{"$f":"IFERROR(INDEX('New data sheet'!$F:$K,MATCH($D11&M$9,'New data sheet'!$L:$L,0),MATCH($E$7,'New data sheet'!$F$6:$K$6,0)),\"\")","v":""},{"$f":"IFERROR(INDEX('New data sheet'!$F:$K,MATCH($D11&N$9,'New data sheet'!$L:$L,0),MATCH($E$7,'New data sheet'!$F$6:$K$6,0)),\"\")","v":3027.7675534739656},{"$f":"IFERROR(INDEX('New data sheet'!$F:$K,MATCH($D11&O$9,'New data sheet'!$L:$L,0),MATCH($E$7,'New data sheet'!$F$6:$K$6,0)),\"\")","v":3108.5301649767757},{"$f":"IFERROR(INDEX('New data sheet'!$F:$K,MATCH($D11&P$9,'New data sheet'!$L:$L,0),MATCH($E$7,'New data sheet'!$F$6:$K$6,0)),\"\")","v":3071.9094682440532},{"$f":"IFERROR(INDEX('New data sheet'!$F:$K,MATCH($D11&Q$9,'New data sheet'!$L:$L,0),MATCH($E$7,'New data sheet'!$F$6:$K$6,0)),\"\")","v":2551.3155510387724},{"$f":"IFERROR(INDEX('New data sheet'!$F:$K,MATCH($D11&R$9,'New data sheet'!$L:$L,0),MATCH($E$7,'New data sheet'!$F$6:$K$6,0)),\"\")","v":2311.8800844527309},{"$f":"IFERROR(INDEX('New data sheet'!$F:$K,MATCH($D11&S$9,'New data sheet'!$L:$L,0),MATCH($E$7,'New data sheet'!$F$6:$K$6,0)),\"\")","v":2461.5087252772355},{"$f":"IFERROR(INDEX('New data sheet'!$F:$K,MATCH($D11&T$9,'New data sheet'!$L:$L,0),MATCH($E$7,'New data sheet'!$F$6:$K$6,0)),\"\")","v":2539.0602115121287},{"$f":"IFERROR(INDEX('New data sheet'!$F:$K,MATCH($D11&U$9,'New data sheet'!$L:$L,0),MATCH($E$7,'New data sheet'!$F$6:$K$6,0)),\"\")","v":2583.9037616140085}]
[null,null,null,"Actual closing RAB",{"$f":"IFERROR(INDEX('New data sheet'!$F:$K,MATCH($D12&E$9,'New data sheet'!$L:$L,0),MATCH($E$7,'New data sheet'!$F$6:$K$6,0)),\"\")","v":14281.724180992402},{"$f":"IFERROR(INDEX('New data sheet'!$F:$K,MATCH($D12&F$9,'New data sheet'!$L:$L,0),MATCH($E$7,'New data sheet'!$F$6:$K$6,0)),\"\")","v":15461.661521134512},{"$f":"IFERROR(INDEX('New data sheet'!$F:$K,MATCH($D12&G$9,'New data sheet'!$L:$L,0),MATCH($E$7,'New data sheet'!$F$6:$K$6,0)),\"\")","v":16939.653825360299},{"$f":"IFERROR(INDEX('New data sheet'!$F:$K,MATCH($D12&H$9,'New data sheet'!$L:$L,0),MATCH($E$7,'New data sheet'!$F$6:$K$6,0)),\"\")","v":18209.148928642295},{"$f":"IFERROR(INDEX('New data sheet'!$F:$K,MATCH($D12&I$9,'New data sheet'!$L:$L,0),MATCH($E$7,'New data sheet'!$F$6:$K$6,0)),\"\")","v":19057.717603694509},{"$f":"IFERROR(INDEX('New data sheet'!$F:$K,MATCH($D12&J$9,'New data sheet'!$L:$L,0),MATCH($E$7,'New data sheet'!$F$6:$K$6,0)),\"\")","v":19883.277707249832},{"$f":"IFERROR(INDEX('New data sheet'!$F:$K,MATCH($D12&K$9,'New data sheet'!$L:$L,0),MATCH($E$7,'New data sheet'!$F$6:$K$6,0)),\"\")","v":20952.006669314433},{"$f":"IFERROR(INDEX('New data sheet'!$F:$K,MATCH($D12&L$9,'New data sheet'!$L:$L,0),MATCH($E$7,'New data sheet'!$F$6:$K$6,0)),\"\")","v":21902.565029623158},{"$f":"IFERROR(INDEX('New data sheet'!$F:$K,MATCH($D12&M$9,'New data sheet'!$L:$L,0),MATCH($E$7,'New data sheet'!$F$6:$K$6,0)),\"\")","v":22768.917078378836},{"$f":"IFERROR(INDEX('New data sheet'!$F:$K,MATCH($D12&N$9,'New data sheet'!$L:$L,0),MATCH($E$7,'New data sheet'!$F$6:$K$6,0)),\"\")","v":22680.918989518657},{"$f":"IFERROR(INDEX('New data sheet'!$F:$K,MATCH($D12&O$9,'New data sheet'!$L:$L,0),MATCH($E$7,'New data sheet'!$F$6:$K$6,0)),\"\")","v":22546.596368575105},{"$f":"IFERROR(INDEX('New data sheet'!$F:$K,MATCH($D12&P$9,'New data sheet'!$L:$L,0),MATCH($E$7,'New data sheet'!$F$6:$K$6,0)),\"\")","v":22440.729819519536},{"$f":"IFERROR(INDEX('New data sheet'!$F:$K,MATCH($D12&Q$9,'New data sheet'!$L:$L,0),MATCH($E$7,'New data sheet'!$F$6:$K$6,0)),\"\")","v":22315.648304731785},{"$f":"IFERROR(INDEX('New data sheet'!$F:$K,MATCH($D12&R$9,'New data sheet'!$L:$L,0),MATCH($E$7,'New data sheet'!$F$6:$K$6,0)),\"\")","v":22196.693313955162},{"$f":"IFERROR(INDEX('New data sheet'!$F:$K,MATCH($D12&S$9,'New data sheet'!$L:$L,0),MATCH($E$7,'New data sheet'!$F$6:$K$6,0)),\"\")","v":22136.397373865671},{"$f":"IFERROR(INDEX('New data sheet'!$F:$K,MATCH($D12&T$9,'New data sheet'!$L:$L,0),MATCH($E$7,'New data sheet'!$F$6:$K$6,0)),\"\")","v":22552.494328971203},{"$f":"IFERROR(INDEX('New data sheet'!$F:$K,MATCH($D12&U$9,'New data sheet'!$L:$L,0),MATCH($E$7,'New data sheet'!$F$6:$K$6,0)),\"\")","v":22827.69801782252}]
[null,null,null,"Forecast closing RAB",{"$f":"IFERROR(INDEX('New data sheet'!$F:$K,MATCH($D13&E$9,'New data sheet'!$L:$L,0),MATCH($E$7,'New data sheet'!$F$6:$K$6,0)),\"\")","v":14545.962834782544},{"$f":"IFERROR(INDEX('New data sheet'!$F:$K,MATCH($D13&F$9,'New data sheet'!$L:$L,0),MATCH($E$7,'New data sheet'!$F$6:$K$6,0)),\"\")","v":14725.53533201171},{"$f":"IFERROR(INDEX('New data sheet'!$F:$K,MATCH($D13&G$9,'New data sheet'!$L:$L,0),MATCH($E$7,'New data sheet'!$F$6:$K$6,0)),\"\")","v":16876.049219117202},{"$f":"IFERROR(INDEX('New data sheet'!$F:$K,MATCH($D13&H$9,'New data sheet'!$L:$L,0),MATCH($E$7,'New data sheet'!$F$6:$K$6,0)),\"\")","v":18324.650920727752},{"$f":"IFERROR(INDEX('New data sheet'!$F:$K,MATCH($D13&I$9,'New data sheet'!$L:$L,0),MATCH($E$7,'New data sheet'!$F$6:$K$6,0)),\"\")","v":19647.620400235606},{"$f":"IFERROR(INDEX('New data sheet'!$F:$K,MATCH($D13&J$9,'New data sheet'!$L:$L,0),MATCH($E$7,'New data sheet'!$F$6:$K$6,0)),\"\")","v":20843.968001932204},{"$f":"IFERROR(INDEX('New data sheet'!$F:$K,MATCH($D13&K$9,'New data sheet'!$L:$L,0),MATCH($E$7,'New data sheet'!$F$6:$K$6,0)),\"\")","v":21921.560703254137},{"$f":"IFERROR(INDEX('New data sheet'!$F:$K,MATCH($D13&L$9,'New data sheet'!$L:$L,0),MATCH($E$7,'New data sheet'!$F$6:$K$6,0)),\"\")","v":23046.069387677442},{"$f":"IFERROR(INDEX('New data sheet'!$F:$K,MATCH($D13&M$9,'New data sheet'!$L:$L,0),MATCH($E$7,'New data sheet'!$F$6:$K$6,0)),\"\")","v":23967.057860345787},{"$f":"IFERROR(INDEX('New data sheet'!$F:$K,MATCH($D13&N$9,'New data sheet'!$L:$L,0),MATCH($E$7,'New data sheet'!$F$6:$K$6,0)),\"\")","v":23760.200170292974},{"$f":"IFERROR(INDEX('New data sheet'!$F:$K,MATCH($D13&O$9,'New data sheet'!$L:$L,0),MATCH($E$7,'New data sheet'!$F$6:$K$6,0)),\"\")","v":24210.938012194678},{"$f":"IFERROR(INDEX('New data sheet'!$F:$K,MATCH($D13&P$9,'New data sheet'!$L:$L,0),MATCH($E$7,'New data sheet'!$F$6:$K$6,0)),\"\")","v":24528.408109815507},{"$f":"IFERROR(INDEX('New data sheet'!$F:$K,MATCH($D13&Q$9,'New data sheet'!$L:$L,0),MATCH($E$7,'New data sheet'!$F$6:$K$6,0)),\"\")","v":22685.920245760601},{"$f":"IFERROR(INDEX('New data sheet'!$F:$K,MATCH($D13&R$9,'New data sheet'!$L:$L,0),MATCH($E$7,'New data sheet'!$F$6:$K$6,0)),\"\")","v":22325.720813774955},{"$f":"IFERROR(INDEX('New data sheet'!$F:$K,MATCH($D13&S$9,'New data sheet'!$L:$L,0),MATCH($E$7,'New data sheet'!$F$6:$K$6,0)),\"\")","v":22322.022979680965},{"$f":"IFERROR(INDEX('New data sheet'!$F:$K,MATCH($D13&T$9,'New data sheet'!$L:$L,0),MATCH($E$7,'New data sheet'!$F$6:$K$6,0)),\"\")","v":22626.43982864881},{"$f":"IFERROR(INDEX('New data sheet'!$F:$K,MATCH($D13&U$9,'New data sheet'!$L:$L,0),MATCH($E$7,'New data sheet'!$F$6:$K$6,0)),\"\")","v":23811.29442076648}]
[null,null,null,"Actual annual capex",{"$f":"IFERROR(INDEX('New data sheet'!$F:$K,MATCH($D14&E$9,'New data sheet'!$L:$L,0),MATCH($E$7,'New data sheet'!$F$6:$K$6,0)),\"\")","v":969.93545149704471},{"$f":"IFERROR(INDEX('New data sheet'!$F:$K,MATCH($D14&F$9,'New data sheet'!$L:$L,0),MATCH($E$7,'New data sheet'!$F$6:$K$6,0)),\"\")","v":1069.5411102153687},{"$f":"IFERROR(INDEX('New data sheet'!$F:$K,MATCH($D14&G$9,'New data sheet'!$L:$L,0),MATCH($E$7,'New data sheet'!$F$6:$K$6,0)),\"\")","v":1822.2810319685032},{"$f":"IFERROR(INDEX('New data sheet'!$F:$K,MATCH($D14&H$9,'New data sheet'!$L:$L,0),MATCH($E$7,'New data sheet'!$F$6:$K$6,0)),\"\")","v":1926.8156861099974},{"$f":"IFERROR(INDEX('New data sheet'!$F:$K,MATCH($D14&I$9,'New data sheet'!$L:$L,0),MATCH($E$7,'New data sheet'!$F$6:$K$6,0)),\"\")","v":1568.494153993506},{"$f":"IFERROR(INDEX('New data sheet'!$F:$K,MATCH($D14&J$9,'New data sheet'!$L:$L,0),MATCH($E$7,'New data sheet'!$F$6:$K$6,0)),\"\")","v":1566.151289953945},{"$f":"IFERROR(INDEX('New data sheet'!$F:$K,MATCH($D14&K$9,'New data sheet'!$L:$L,0),MATCH($E$7,'New data sheet'!$F$6:$K$6,0)),\"\")","v":1736.0460050825943},{"$f":"IFERROR(INDEX('New data sheet'!$F:$K,MATCH($D14&L$9,'New data sheet'!$L:$L,0),MATCH($E$7,'New data sheet'!$F$6:$K$6,0)),\"\")","v":1700.8868554947751},{"$f":"IFERROR(INDEX('New data sheet'!$F:$K,MATCH($D14&M$9,'New data sheet'!$L:$L,0),MATCH($E$7,'New data sheet'!$F$6:$K$6,0)),\"\")","v":1346.8122044674376},{"$f":"IFERROR(INDEX('New data sheet'!$F:$K,MATCH($D14&N$9,'New data sheet'!$L:$L,0),MATCH($E$7,'New data sheet'!$F$6:$K$6,0)),\"\")","v":806.32367382527855},{"$f":"IFERROR(INDEX('New data sheet'!$F:$K,MATCH($D14&O$9,'New data sheet'!$L:$L,0),MATCH($E$7,'New data sheet'!$F$6:$K$6,0)),\"\")","v":802.3882070747901},{"$f":"IFERROR(INDEX('New data sheet'!$F:$K,MATCH($D14&P$9,'New data sheet'!$L:$L,0),MATCH($E$7,'New data sheet'!$F$6:$K$6,0)),\"\")","v":765.48472478695396},{"$f":"IFERROR(INDEX('New data sheet'!$F:$K,MATCH($D14&Q$9,'New data sheet'!$L:$L,0),MATCH($E$7,'New data sheet'!$F$6:$K$6,0)),\"\")","v":804.96553771575623},{"$f":"IFERROR(INDEX('New data sheet'!$F:$K,MATCH($D14&R$9,'New data sheet'!$L:$L,0),MATCH($E$7,'New data sheet'!$F$6:$K$6,0)),\"\")","v":815.19978151732721},{"$f":"IFERROR(INDEX('New data sheet'!$F:$K,MATCH($D14&S$9,'New data sheet'!$L:$L,0),MATCH($E$7,'New data sheet'!$F$6:$K$6,0)),\"\")","v":927.18893281206158},{"$f":"IFERROR(INDEX('New data sheet'!$F:$K,MATCH($D14&T$9,'New data sheet'!$L:$L,0),MATCH($E$7,'New data sheet'!$F$6:$K$6,0)),\"\")","v":1420.9457852030075},{"$f":"IFERROR(INDEX('New data sheet'!$F:$K,MATCH($D14&U$9,'New data sheet'!$L:$L,0),MATCH($E$7,'New data sheet'!$F$6:$K$6,0)),\"\")","v":1249.8813416607929}]
[null,null,null,"Forecast annual capex",{"$f":"IFERROR(INDEX('New data sheet'!$F:$K,MATCH($D15&E$9,'New data sheet'!$L:$L,0),MATCH($E$7,'New data sheet'!$F$6:$K$6,0)),\"\")","v":852.53525482795681},{"$f":"IFERROR(INDEX('New data sheet'!$F:$K,MATCH($D15&F$9,'New data sheet'!$L:$L,0),MATCH($E$7,'New data sheet'!$F$6:$K$6,0)),\"\")","v":809.63773966515987},{"$f":"IFERROR(INDEX('New data sheet'!$F:$K,MATCH($D15&G$9,'New data sheet'!$L:$L,0),MATCH($E$7,'New data sheet'!$F$6:$K$6,0)),\"\")","v":1764.9336345631239},{"$f":"IFERROR(INDEX('New data sheet'!$F:$K,MATCH($D15&H$9,'New data sheet'!$L:$L,0),MATCH($E$7,'New data sheet'!$F$6:$K$6,0)),\"\")","v":1731.3138437300615},{"$f":"IFERROR(INDEX('New data sheet'!$F:$K,MATCH($D15&I$9,'New data sheet'!$L:$L,0),MATCH($E$7,'New data sheet'!$F$6:$K$6,0)),\"\")","v":1911.993850676716},{"$f":"IFERROR(INDEX('New data sheet'!$F:$K,MATCH($D15&J$9,'New data sheet'!$L:$L,0),MATCH($E$7,'New data sheet'!$F$6:$K$6,0)),\"\")","v":1961.9320572365104},{"$f":"IFERROR(INDEX('New data sheet'!$F:$K,MATCH($D15&K$9,'New data sheet'!$L:$L,0),MATCH($E$7,'New data sheet'!$F$6:$K$6,0)),\"\")","v":1858.8062191321183},{"$f":"IFERROR(INDEX('New data sheet'!$F:$K,MATCH($D15&L$9,'New data sheet'!$L:$L,0),MATCH($E$7,'New data sheet'!$F$6:$K$6,0)),\"\")","v":1902.9740826988525},{"$f":"IFERROR(INDEX('New data sheet'!$F:$K,MATCH($D15&M$9,'New data sheet'!$L:$L,0),MATCH($E$7,'New data sheet'!$F$6:$K$6,0)),\"\")","v":1771.1108742136823},{"$f":"IFERROR(INDEX('New data sheet'!$F:$K,MATCH($D15&N$9,'New data sheet'!$L:$L,0),MATCH($E$7,'New data sheet'!$F$6:$K$6,0)),\"\")","v":1189.7514563977743},{"$f":"IFERROR(INDEX('New data sheet'!$F:$K,MATCH($D15&O$9,'New data sheet'!$L:$L,0),MATCH($E$7,'New data sheet'!$F$6:$K$6,0)),\"\")","v":1391.1835756000592},{"$f":"IFERROR(INDEX('New data sheet'!$F:$K,MATCH($D15&P$9,'New data sheet'!$L:$L,0),MATCH($E$7,'New data sheet'!$F$6:$K$6,0)),\"\")","v":1305.3395726845556},{"$f":"IFERROR(INDEX('New data sheet'!$F:$K,MATCH($D15&Q$9,'New data sheet'!$L:$L,0),MATCH($E$7,'New data sheet'!$F$6:$K$6,0)),\"\")","v":765.11684891242237},{"$f":"IFERROR(INDEX('New data sheet'!$F:$K,MATCH($D15&R$9,'New data sheet'!$L:$L,0),MATCH($E$7,'New data sheet'!$F$6:$K$6,0)),\"\")","v":780.73405569249132},{"$f":"IFERROR(INDEX('New data sheet'!$F:$K,MATCH($D15&S$9,'New data sheet'!$L:$L,0),MATCH($E$7,'New data sheet'!$F$6:$K$6,0)),\"\")","v":1033.3614951842171},{"$f":"IFERROR(INDEX('New data sheet'!$F:$K,MATCH($D15&T$9,'New data sheet'!$L:$L,0),MATCH($E$7,'New data sheet'!$F$6:$K$6,0)),\"\")","v":1281.5841977471134},{"$f":"IFERROR(INDEX('New data sheet'!$F:$K,MATCH($D15&U$9,'New data sheet'!$L:$L,0),MATCH($E$7,'New data sheet'!$F$6:$K$6,0)),\"\")","v":2147.5360134823413}]
{"$rows_left_out":22}
{"sheet":"New data sheet","index":4,"n_rows":283,"n_cols":12,"rows_kept":283,"cut":false,"hidden":true,"merged":[[0,3,0,12]]}
[null,null,null,"This sheet contains the data, as reported in the tables on worksheets 1-12, reformatted for presentation on the Dashboard."]
[]
[]
[null,null,null,"Raw data"]
[]
[null,null,null,"Category","Year","Powerlink","Transgrid","AusNet (T)","ElectraNet","TasNetworks (T)","Transmission total",{"$f":"D6&E6","v":"CategoryYear"}]
[null,null,null,"Actual revenue from customers","2006",557.52402469039987,470.04823595856647,481.96604117697734,217.59795337642566,171.73121272893337,1898.8674679313026,{"$f":"D7&E7","v":"Actual revenue from customers2006"}]
[null,null,null,"Actual revenue from customers","2007",591.94738314293227,455.93082628451015,528.88808311911237,239.23913355850695,147.73655335196946,1963.741979457031,{"$f":"D8&E8","v":"Actual revenue from customers2007"}]
[null,null,null,"Actual revenue from customers","2008",640.3363078040552,469.1281137890702,527.64710002691106,246.57380770298258,161.38818216845414,2045.0735114914733,"Actual revenue from customers2008"]
[null,null,null,"Actual revenue from customers","2009",667.59330877113609,576.59419742205887,499.46191158903258,275.9760025422359,173.64504863760706,2193.2704689620705,"Actual revenue from customers2009"]
[null,null,null,"Actual revenue from customers","2010",751.99464873635247,702.20109670316572,594.47214762171279,266.97680384618531,204.22179728943146,2519.8664941968477,"Actual revenue from customers2010"]
[null,null,null,"Actual revenue from customers","2011",855.24019672008649,793.79355198640667,589.54046191042301,308.82743052464252,243.47828494083365,2790.8799260823926,"Actual revenue from customers2011"]
[null,null,null,"Actual revenue from customers","2012",946.20046843431726,817.34305552061687,615.95772633123352,356.827222601747,255.53622240272077,2991.8646952906356,"Actual revenue from customers2012"]
[null,null,null,"Actual revenue from customers","2013",935.49387452722897,855.49706436339989,691.31324574499331,369.42479772711323,252.86058550648946,3104.589567869225,"Actual revenue from customers2013"]
[null,null,null,"Actual revenue from customers","2014",961.06003792919216,801.14676444668419,600.23271544590455,318.11995741084837,248.00916839123749,2928.5686436238666,"Actual revenue from customers2014"]
{"$rows_left_out":269}
{"sheet":"1. Revenue","index":5,"n_rows":59,"n_cols":20,"rows_kept":59,"cut":false,"hidden":false,"merged":[[3,1,3,13],[29,1,29,13],[31,1,31,19],[58,1,58,19],[56,1,56,19],[55,1,55,19],[43,1,43,19],[42,1,42,19]]}
[]
[]
[]
[null,"Revenue"]
[]
[]
[]
[]
[]
[]
[]
[]
[]
[]
[]
{"$rows_left_out":45}
{"sheet":"2. RAB - Closing","index":6,"n_rows":61,"n_cols":20,"rows_kept":61,"cut":false,"hidden":false,"merged":[[60,1,60,19],[59,1,59,19],[29,1,29,13],[3,1,3,17],[43,1,44,19],[42,1,42,19],[57,1,57,19],[56,1,56,19],[31,1,31,19]]}
[]
[]
[]
[null,"Regulatory Asset Base"]
[]
[]
[]
[]
[]
[]
[]
[]
[]
[]
[]
{"$rows_left_out":47}
{"sheet":"3. Capex","index":7,"n_rows":56,"n_cols":29,"rows_kept":56,"cut":false,"hidden":false,"merged":[[55,1,55,19],[54,1,54,19],[3,1,3,13],[29,1,29,13],[31,1,31,19],[43,1,43,19],[42,1,42,19]]}
[]
[]
[]
[null,"Capital expenditure"]
[]
[]
[]
[]
[]
[]
[]
[]
[]
[]
[]
{"$rows_left_out":42}
{"sheet":"4. Capex by Driver","index":8,"n_rows":96,"n_cols":19,"rows_kept":96,"cut":false,"hidden":false,"merged":[[51,1,51,16],[52,1,52,16],[79,1,79,16],[78,1,78,16],[3,1,3,13],[36,1,36,16],[48,1,48,16],[47,1,47,16],[49,1,49,16]]}
[]
[]
[]
[null,"Capital expenditure by driver"]
[]
[]
[]
[null,null,null,null,null,null,null,null,null,null,null,null,null,null,null,null,null,null," "]
[]
[]
[]
[]
[]
[]
[]
{"$rows_left_out":82}
{"sheet":"5. Opex","index":9,"n_rows":57,"n_cols":20,"rows_kept":57,"cut":false,"hidden":false,"merged":[[3,1,3,13],[56,1,56,19],[55,1,55,19],[43,1,43,19],[42,1,42,19],[31,1,31,19]]}
[]
[]
[]
[null,"Operating expenditure"]
[]
[]
[]
[]
[]
[]
[]
[]
[]
[]
[]
{"$rows_left_out":43}
{"sheet":"6. Reliability - outage events","index":10,"n_rows":46,"n_cols":19,"rows_kept":46,"cut":false,"hidden":false,"merged":[[3,1,3,12],[28,1,32,18],[43,1,43,18],[44,1,44,18],[45,1,45,18]]}
[]
[]
[]
[null,"Network Reliability - Outage events"]
[]
[]
[]
[]
[]
[]
[]
[]
[]
[]
[]
{"$rows_left_out":32}
{"sheet":"7. Reliability -outage duration","index":11,"n_rows":47,"n_cols":19,"rows_kept":47,"cut":false,"hidden":false,"merged":[[3,1,3,12],[28,1,34,18],[44,1,44,18],[45,1,45,18],[46,1,46,18]]}
[]
[]
[]
[null,"Network Reliability - Outage Duration"]
[]
[]
[]
[]
[]
[]
[]
[]
[]
[]
[]
{"$rows_left_out":33}
{"sheet":"8. Market impact","index":12,"n_rows":42,"n_cols":19,"rows_kept":42,"cut":false,"hidden":false,"merged":[[3,1,3,12],[29,1,29,18],[39,1,39,18],[40,1,40,18],[41,1,41,18]]}
[]
[]
[]
[null,"Quality of Services - Market impact"]
[]
[]
[]
[]
[]
[]
[]
[]
[]
[]
[]
{"$rows_left_out":28}
{"sheet":"9. Maximum demand","index":13,"n_rows":43,"n_cols":20,"rows_kept":43,"cut":false,"hidden":false,"merged":[[42,1,42,19],[3,1,3,13],[26,1,27,19],[38,1,38,19],[39,1,39,19],[41,1,41,19]]}
[]
[]
[]
[null,"Maximum demand"]
[]
[]
[]
[]
[]
[]
[]
[]
[]
[]
[]
{"$rows_left_out":29}
{"sheet":"10. Energy delivered","index":14,"n_rows":42,"n_cols":20,"rows_kept":42,"cut":false,"hidden":false,"merged":[[3,1,3,13],[26,1,26,19],[40,1,40,19],[41,1,41,19]]}
[]
[]
[]
[null,"Energy delivered"]
[]
[]
[]
[]
[]
[]
[]
[]
[]
[]
[]
{"$rows_left_out":28}
{"sheet":"11. Circuit length","index":15,"n_rows":57,"n_cols":20,"rows_kept":57,"cut":false,"hidden":false,"merged":[[3,1,3,13],[26,1,26,19],[55,1,55,19],[56,1,56,19]]}
[]
[]
[]
[null,"Circuit length"]
[]
[]
[]
[]
[]
[]
[]
[]
[]
[]
[]
{"$rows_left_out":42}