{"text_format":"1","workbook":"xlsx","n_sheets":15,"sheets":["Version history","Index","Input|General","Input|Inflation","Input|Reported opex","Input|Rate of change","Input|Step changes","Input|Dx Tx split","Calc|Opex forecast","Output|Models","Output|Decision tables","Output|Decomposition","Lookup|Tables","Check|List","Movements in provisions"],"not_rendered":{"charts":1,"images":0,"macros":1,"external_links":15,"defined_names":18,"comments":3,"pivot_tables":0},"unopened":[],"bounds":{"document_bytes":16777216,"sheet_cells":100000,"rows_first":2000,"rows_last":500,"rows_between":2000,"halvings":0,"cell_chars":16384,"cell_head_chars":4096},"cells_cut":0,"cells_raw":0,"read":"whole","date_system":"1900"}

{"sheet":"Version history","index":0,"n_rows":19,"n_cols":4,"rows_kept":19,"cut":false,"hidden":false,"merged":[]}
[null,"AER opex model"]
[null,"Version history"]
[]
[null,"AER opex model version history"]
[]
[null,null,"Version","Description of changes"]
[null,null,1.4,"Dollar basis automatically set to last month of previous control period on opex forecast sheet ('Calc|Opex forecast'!F8)"]
[null,null,null,"CPI values updated with the latest ABS values"]
[null,null,null,"CPI index corrected on the rate of change sheet ('Input|Rate of change'!21:21)"]
[null,null,1.5,"Row label corrected. Change from 'Total opex' to 'Total opex, categories forecast specifically' ('Input|Reported opex'!C29)"]
{"$rows_left_out":10}
{"sheet":"Index","index":1,"n_rows":20,"n_cols":4,"rows_kept":20,"cut":false,"hidden":false,"merged":[]}
[null,"AER opex model"]
[null,"Index"]
[]
[null,"Model index"]
[]
[null,null,"Sheet Name","Sheet Description"]
[null,null,"Input | General","Inputs NSP name, regulatory years for the prior and forecast regulatory control period etc."]
[null,null,"Input | Inflation","Inputs inflation data."]
[null,null,"Input | Reported opex","Inputs the reported operating expenditure (opex) from the prior regulatory control period."]
[null,null,"Input | Rate of change","Inputs the cost escalation weights, cost escalation forecast, and inflation actuals and forecast"]
{"$rows_left_out":11}
{"sheet":"Input|General","index":2,"n_rows":16,"n_cols":22,"rows_kept":16,"cut":false,"hidden":false,"merged":[]}
[null,{"$f":"Index!$B$1","v":"AER opex model"},null,null,null,null,null,null,null,"Back to Index",null,"Key:","Input","External Link","Internal Link",null,null,"Worksheet check:",{"$f":"IF(COUNTA($S$5:$S$15)=COUNTIF($S5:$S16,\"OK\"),\"OK\",\"Check\")","v":"OK"},null,"Overall Check:",{"$f":"'Check|List'!$S$1","v":"Check"}]
[null,{"$f":"Index!$C$7","v":"Input | General"}]
[]
[null,"Input | General inputs"]
[]
[null,null,"Inputs","Source",null,null,"Value"]
[null,null,"NSP name","NSP",null,null,"Evoenergy",null,null,null,null,null,null,null,null,null,null,null,{"$f":"IF(COUNTBLANK($G7),\"Check\",\"Ok\")","v":"Ok"}]
[null,null,"Decision stage","AER",null,null,"draft",null,null,null,null,null,null,null,null,null,null,null,{"$f":"IF(COUNTBLANK($G8),\"Check\",\"Ok\")","v":"Ok"}]
[null,null,"Year ending","NSP",null,null,"2000-06-01",null,null,null,null,null,null,null,null,null,null,null,{"$f":"IF(COUNTBLANK($G9),\"Check\",\"Ok\")","v":"Ok"}]
[null,null,"Previous regulatory control period, first year","NSP",null,null,2015,null,null,null,null,null,null,null,null,null,null,null,{"$f":"IF(COUNTBLANK($G10),\"Check\",\"Ok\")","v":"Ok"}]
{"$rows_left_out":7}
{"sheet":"Input|Inflation","index":3,"n_rows":66,"n_cols":23,"rows_kept":66,"cut":false,"hidden":false,"merged":[]}
[null,{"$f":"Index!$B$1","v":"AER opex model"},null,null,null,null,null,null,null,null,"Back to Index",null,"Key:","Input","External Link","Internal Link",null,null,"Worksheet check:",{"$f":"IF(COUNTA($T$5:$T$65)=COUNTIF($T5:$T66,\"OK\"),\"OK\",\"Check\")","v":"OK"},null,"Overall Check:",{"$f":"'Check|List'!$S$1","v":"Check"}]
[null,{"$f":"Index!$C$7","v":"Input | General"}]
[]
[null,"Input | General inputs"]
[]
[null,null,null,"Index value, new base","Percentage Change from Corresponding Quarter of Previous Year","Index value, new base","Percentage Change from Corresponding Quarter of Previous Year"]
[null,null,"Source","ABS","Calculated","ABS","Calculated"]
[null,null,"Unit","index","Percent","index","Percent"]
[null,null,"2007-03-31",155.6,null,null,null,null,null,null,null,null,null,null,null,null,null,null,null,{"$f":"IF(C9>EOMONTH(DATE('Input|General'!$G$12,MONTH('Input|General'!$G$9),1),0),\"Ok\",IF(ISBLANK($D9),\"Check\",\"Ok\"))","v":"Ok"}]
[null,null,"2007-06-30",157.5,null,null,null,null,null,null,null,null,null,null,null,null,null,null,null,{"$f":"IF(C10>EOMONTH(DATE('Input|General'!$G$12,MONTH('Input|General'!$G$9),1),0),\"Ok\",IF(ISBLANK($D10),\"Check\",\"Ok\"))","v":"Ok"}]
{"$rows_left_out":57}
{"sheet":"Input|Reported opex","index":4,"n_rows":67,"n_cols":22,"rows_kept":67,"cut":false,"hidden":false,"merged":[]}
[null,null,{"$f":"Index!$B$1","v":"AER opex model"},null,null,null,null,null,null,"Back to Index",null,"Key:","Input","External Link","Internal Link",null,null,"Worksheet check:",{"$f":"IF(COUNTA($W$37:$W$260)=COUNTIF($W$37:$W$260,\"OK\"),\"OK\",\"Check\")","v":"OK"},null,"Overall Check:",{"$f":"'Check|List'!$S$1","v":"Check"}]
[null,null,{"$f":"Index!$C$9","v":"Input | Reported opex"}]
[null,null,null,null,null,null,null,null,null,"Year ending"]
[null,null,null,"Source","Unit","Basis",null,null,null,{"$f":"DATE(PPFirstYear,MONTH('Input|General'!$G$9),1)","v":"2015-06-01"},{"$f":"DATE(PPFirstYear+1,MONTH('Input|General'!$G$9),1)","v":"2016-06-01"},{"$f":"DATE(PPFirstYear+2,MONTH('Input|General'!$G$9),1)","v":"2017-06-01"},{"$f":"DATE(PPFirstYear+3,MONTH('Input|General'!$G$9),1)","v":"2018-06-01"},{"$f":"DATE(PPFirstYear+4,MONTH('Input|General'!$G$9),1)","v":"2019-06-01"},{"$f":"DATE(PPFirstYear+5,MONTH('Input|General'!$G$9),1)","v":"2020-06-01"},{"$f":"DATE(PPFirstYear+6,MONTH('Input|General'!$G$9),1)","v":"2021-06-01"},{"$f":"DATE(PPFirstYear+7,MONTH('Input|General'!$G$9),1)","v":"2022-06-01"},{"$f":"DATE(PPFirstYear+8,MONTH('Input|General'!$G$9),1)","v":"2023-06-01"},{"$f":"DATE(PPFirstYear+9,MONTH('Input|General'!$G$9),1)","v":"2024-06-01"}]
[]
[]
[]
[null,"Input | Opex allowances"]
[]
[null,null,"Cost category","Source","Unit","Basis",null,null,null,{"$f":"IF(YEAR(J$4)<=PPLastYear,J$4,\"\")","v":"2015-06-01"},"2016-06-01","2017-06-01","2018-06-01","2019-06-01","","","","","","Notes"]
{"$rows_left_out":58}
{"sheet":"Input|Rate of change","index":5,"n_rows":108,"n_cols":23,"rows_kept":108,"cut":false,"hidden":false,"merged":[[2,10,2,12],[2,14,2,19]]}
[null,{"$f":"Index!$B$1","v":"AER opex model"},null,null,null,null,null,null,null,null,"Back to Index",null,"Key:","Input","External Link","Internal Link",null,null,"Worksheet check:",{"$f":"IF(COUNTIF(W5:W107,\"Check\")=0,\"Ok\",\"Check\")","v":"Check"},null,"Overall Check:",{"$f":"'Check|List'!$S$1","v":"Check"}]
[null,{"$f":"Index!$C$10","v":"Input | Rate of change"}]
[null,null,null,null,null,null,null,null,null,"Year ending"]
[null,null,null,"Source","Unit","Basis",null,null,null,{"$f":"DATE(PPFirstYear-1,MONTH('Input|General'!$G$9),1)","v":"2014-06-01"},{"$f":"DATE(PPFirstYear,MONTH('Input|General'!$G$9),1)","v":"2015-06-01"},{"$f":"DATE(PPFirstYear+1,MONTH('Input|General'!$G$9),1)","v":"2016-06-01"},{"$f":"DATE(PPFirstYear+2,MONTH('Input|General'!$G$9),1)","v":"2017-06-01"},{"$f":"DATE(PPFirstYear+3,MONTH('Input|General'!$G$9),1)","v":"2018-06-01"},{"$f":"DATE(PPFirstYear+4,MONTH('Input|General'!$G$9),1)","v":"2019-06-01"},{"$f":"DATE(PPFirstYear+5,MONTH('Input|General'!$G$9),1)","v":"2020-06-01"},{"$f":"DATE(PPFirstYear+6,MONTH('Input|General'!$G$9),1)","v":"2021-06-01"},{"$f":"DATE(PPFirstYear+7,MONTH('Input|General'!$G$9),1)","v":"2022-06-01"},{"$f":"DATE(PPFirstYear+8,MONTH('Input|General'!$G$9),1)","v":"2023-06-01"},{"$f":"DATE(PPFirstYear+9,MONTH('Input|General'!$G$9),1)","v":"2024-06-01"}]
[]
[]
[]
[null,"Input | Inflation"]
[]
[null,null,"Inflation",null,null,null,null,null,null,{"$f":"IF(YEAR(J$4)<=PPLastYear,J$4,\"\")","v":"2014-06-01"},"2015-06-01","2016-06-01","2017-06-01","2018-06-01","2019-06-01","","","","",""]
{"$rows_left_out":99}
{"sheet":"Input|Step changes","index":6,"n_rows":43,"n_cols":23,"rows_kept":43,"cut":false,"hidden":false,"merged":[[2,13,2,18]]}
[null,{"$f":"Index!$B$1","v":"AER opex model"},null,null,null,null,null,null,null,"Back to Index",null,"Key:","Input","External Link","Internal Link",null,null,"Worksheet check:",{"$f":"IF(COUNTA($W$8:$W$236)=COUNTIF($W$8:$W$236,\"OK\"),\"OK\",\"Check\")","v":"OK"},null,"Overall Check:",{"$f":"'Check|List'!$S$1","v":"Check"}]
[null,{"$f":"Index!$C$11","v":"Input | Step changes"}]
[null,null,null,null,null,null,null,null,null,"Year ending"]
[null,null,null,"Source","Unit","Basis",null,null,null,{"$f":"DATE(PPFirstYear,MONTH('Input|General'!$G$9),1)","v":"2015-06-01"},{"$f":"DATE(PPFirstYear+1,MONTH('Input|General'!$G$9),1)","v":"2016-06-01"},{"$f":"DATE(PPFirstYear+2,MONTH('Input|General'!$G$9),1)","v":"2017-06-01"},{"$f":"DATE(PPFirstYear+3,MONTH('Input|General'!$G$9),1)","v":"2018-06-01"},{"$f":"DATE(PPFirstYear+4,MONTH('Input|General'!$G$9),1)","v":"2019-06-01"},{"$f":"DATE(PPFirstYear+5,MONTH('Input|General'!$G$9),1)","v":"2020-06-01"},{"$f":"DATE(PPFirstYear+6,MONTH('Input|General'!$G$9),1)","v":"2021-06-01"},{"$f":"DATE(PPFirstYear+7,MONTH('Input|General'!$G$9),1)","v":"2022-06-01"},{"$f":"DATE(PPFirstYear+8,MONTH('Input|General'!$G$9),1)","v":"2023-06-01"},{"$f":"DATE(PPFirstYear+9,MONTH('Input|General'!$G$9),1)","v":"2024-06-01"}]
[]
[]
[]
[null,"Input |Step changes"]
[]
[null,null,"Step change","Source","Unit","Basis",null,null,null,{"$f":"IF(YEAR(J$4)>=FPFirstYear,IF(YEAR(J$4)<=FPLastYear,J$4,\"\"),\"\")","v":""},"","","","","2020-06-01","2021-06-01","2022-06-01","2023-06-01","2024-06-01"]
{"$rows_left_out":34}
{"sheet":"Input|Dx Tx split","index":7,"n_rows":17,"n_cols":22,"rows_kept":17,"cut":false,"hidden":false,"merged":[[2,13,2,18]]}
[null,{"$f":"[1]Index!$B$1","v":"AER opex model"},null,null,null,null,null,null,null,"Back to Index",null,"Key:","Input","External Link","Internal Link",null,null,"Worksheet check:",{"$f":"IF(COUNTA($V$8:$V$210)=COUNTIF($V$8:$V$210,\"OK\"),\"OK\",\"Check\")","v":"OK"},null,"Overall Check:",{"$f":"'Check|List'!$S$1","v":"Check"}]
[null,{"$f":"[1]Index!$C$11","v":"Input | Step changes"}]
[null,null,null,null,null,null,null,null,null,"Year ending"]
[null,null,null,"Source","Unit","Basis",null,null,null,{"$f":"DATE(PPFirstYear,MONTH('Input|General'!$G$9),1)","v":"2015-06-01"},{"$f":"DATE(PPFirstYear+1,MONTH('Input|General'!$G$9),1)","v":"2016-06-01"},{"$f":"DATE(PPFirstYear+2,MONTH('Input|General'!$G$9),1)","v":"2017-06-01"},{"$f":"DATE(PPFirstYear+3,MONTH('Input|General'!$G$9),1)","v":"2018-06-01"},{"$f":"DATE(PPFirstYear+4,MONTH('Input|General'!$G$9),1)","v":"2019-06-01"},{"$f":"DATE(PPFirstYear+5,MONTH('Input|General'!$G$9),1)","v":"2020-06-01"},{"$f":"DATE(PPFirstYear+6,MONTH('Input|General'!$G$9),1)","v":"2021-06-01"},{"$f":"DATE(PPFirstYear+7,MONTH('Input|General'!$G$9),1)","v":"2022-06-01"},{"$f":"DATE(PPFirstYear+8,MONTH('Input|General'!$G$9),1)","v":"2023-06-01"},{"$f":"DATE(PPFirstYear+9,MONTH('Input|General'!$G$9),1)","v":"2024-06-01"}]
[]
[]
[]
[null,"Input | Dx/Tx split"]
[]
[null,null,"Dx/Tx split","Source","Unit",null,null,null,null,{"$f":"IF(YEAR(J$4)>=FPFirstYear,IF(YEAR(J$4)<=FPLastYear,J$4,\"\"),\"\")","v":""},"","","","","2020-06-01","2021-06-01","2022-06-01","2023-06-01","2024-06-01"]
{"$rows_left_out":8}
{"sheet":"Calc|Opex forecast","index":8,"n_rows":87,"n_cols":22,"rows_kept":87,"cut":false,"hidden":false,"merged":[[2,13,2,18]]}
[null,{"$f":"Index!$B$1","v":"AER opex model"},null,null,null,null,null,null,null,"Back to Index",null,"Key:","Input","External Link","Internal Link",null,null,"Worksheet check:",{"$f":"IF(COUNTA($V$8:$V$210)=COUNTIF($V$8:$V$210,\"OK\"),\"OK\",\"Check\")","v":"Check"},null,"Overall Check:",{"$f":"'Check|List'!$S$1","v":"Check"}]
[null,{"$f":"Index!$C$13","v":"Calc | Opex Forecast"}]
[null,null,null,null,null,null,null,null,null,"Year ending"]
[null,null,null,"Source","Unit","Basis",null,null,null,{"$f":"DATE(PPFirstYear,MONTH('Input|General'!$G$9),1)","v":"2015-06-01"},{"$f":"DATE(PPFirstYear+1,MONTH('Input|General'!$G$9),1)","v":"2016-06-01"},{"$f":"DATE(PPFirstYear+2,MONTH('Input|General'!$G$9),1)","v":"2017-06-01"},{"$f":"DATE(PPFirstYear+3,MONTH('Input|General'!$G$9),1)","v":"2018-06-01"},{"$f":"DATE(PPFirstYear+4,MONTH('Input|General'!$G$9),1)","v":"2019-06-01"},{"$f":"DATE(PPFirstYear+5,MONTH('Input|General'!$G$9),1)","v":"2020-06-01"},{"$f":"DATE(PPFirstYear+6,MONTH('Input|General'!$G$9),1)","v":"2021-06-01"},{"$f":"DATE(PPFirstYear+7,MONTH('Input|General'!$G$9),1)","v":"2022-06-01"},{"$f":"DATE(PPFirstYear+8,MONTH('Input|General'!$G$9),1)","v":"2023-06-01"},{"$f":"DATE(PPFirstYear+9,MONTH('Input|General'!$G$9),1)","v":"2024-06-01"}]
[]
[]
[]
[null,"Calc | Estimated final year expenditure",null,null,"$millions",{"$f":"DATE(PPLastYear,MONTH('Input|General'!$G$9),1)","v":"2019-06-01"}]
[]
[null,null,null,"Source","Unit","Basis",null,null,null,{"$f":"IF(YEAR(J$4)<=PPLastYear,J$4,\"\")","v":"2015-06-01"},"2016-06-01","2017-06-01","2018-06-01","2019-06-01","","","","",""]
{"$rows_left_out":78}
{"sheet":"Output|Models","index":9,"n_rows":22,"n_cols":22,"rows_kept":22,"cut":false,"hidden":false,"merged":[[2,13,2,18]]}
[null,{"$f":"Index!$B$1","v":"AER opex model"},null,null,null,null,null,null,null,"Back to Index",null,"Key:","Input","External Link","Internal Link",null,null,"Worksheet check:","n/a",null,"Overall Check:",{"$f":"'Check|List'!$S$1","v":"Check"}]
[null,{"$f":"Index!$C$14","v":"Output | Models"}]
[null,null,null,null,null,null,null,null,null,"Year ending"]
[null,null,null,"Source","Unit","Basis",null,null,null,{"$f":"DATE(PPFirstYear,MONTH('Input|General'!$G$9),1)","v":"2015-06-01"},{"$f":"DATE(PPFirstYear+1,MONTH('Input|General'!$G$9),1)","v":"2016-06-01"},{"$f":"DATE(PPFirstYear+2,MONTH('Input|General'!$G$9),1)","v":"2017-06-01"},{"$f":"DATE(PPFirstYear+3,MONTH('Input|General'!$G$9),1)","v":"2018-06-01"},{"$f":"DATE(PPFirstYear+4,MONTH('Input|General'!$G$9),1)","v":"2019-06-01"},{"$f":"DATE(PPFirstYear+5,MONTH('Input|General'!$G$9),1)","v":"2020-06-01"},{"$f":"DATE(PPFirstYear+6,MONTH('Input|General'!$G$9),1)","v":"2021-06-01"},{"$f":"DATE(PPFirstYear+7,MONTH('Input|General'!$G$9),1)","v":"2022-06-01"},{"$f":"DATE(PPFirstYear+8,MONTH('Input|General'!$G$9),1)","v":"2023-06-01"},{"$f":"DATE(PPFirstYear+9,MONTH('Input|General'!$G$9),1)","v":"2024-06-01"}]
[]
[]
[]
[null,"Inputs for Post Tax Revenue Model",null,null,"$millions",{"$f":"DATE(PPLastYear,MONTH('Input|General'!$G$9),1)","v":"2019-06-01"},null,null,null,"Note. The dollar base should be consistent with the post tax revenue model"]
[]
[]
{"$rows_left_out":13}
{"sheet":"Output|Decision tables","index":10,"n_rows":35,"n_cols":22,"rows_kept":35,"cut":false,"hidden":false,"merged":[]}
[null,{"$f":"Index!$B$1","v":"AER opex model"},null,null,null,null,null,null,null,"Back to Index",null,"Key:","Input","External Link","Internal Link",null,null,"Worksheet check:","n/a",null,"Overall Check:",{"$f":"'Check|List'!$S$1","v":"Check"}]
[null,{"$f":"Index!$C$15","v":"Output | Decision tables"}]
[]
[]
[]
[]
[null,"Table X.1",{"$f":"\"Our draft decision on total opex ($million \"&IF(MONTH('Calc|Opex forecast'!$F$80)=12,YEAR('Calc|Opex forecast'!$F$80),YEAR('Calc|Opex forecast'!$F$80)-1&\"-\"&RIGHT(YEAR('Calc|Opex forecast'!$F$80),2))&\")\"","v":"Our draft decision on total opex ($million 2018-19)"}]
[]
[null,null,{"$f":"TRANSPOSE('Lookup|Tables'!G70:G74)","v":"2019–20"},"2020–21","2021–22","2022–23","2023–24","Total",null,"excludes debt raising costs"]
[null,"Year ending",{"$f":"TRANSPOSE('Lookup|Tables'!$H$70:$H$74)","v":"2020-06-01"},"2021-06-01","2022-06-01","2023-06-01","2024-06-01"]
{"$rows_left_out":26}
{"sheet":"Output|Decomposition","index":11,"n_rows":31,"n_cols":27,"rows_kept":31,"cut":false,"hidden":false,"merged":[]}
[null,{"$f":"Index!$B$1","v":"AER opex model"},null,null,null,null,null,null,null,null,null,null,null,null,"Back to Index",null,"Key:","Input","External Link","Internal Link",null,null,"Worksheet check:","n/a",null,"Overall Check:",{"$f":"'Check|List'!$S$1","v":"Check"}]
[null,{"$f":"Index!#REF!","v":{"$error":"#REF!"}}]
[]
[]
[]
[]
[null,"Decomposition"]
[null,null,"Including debt raising costs"]
[null,null,{"$f":"'Calc|Opex forecast'!J75","v":""},{"$f":"'Calc|Opex forecast'!K75","v":""},{"$f":"'Calc|Opex forecast'!L75","v":""},{"$f":"'Calc|Opex forecast'!M75","v":""},{"$f":"'Calc|Opex forecast'!N75","v":""},{"$f":"'Calc|Opex forecast'!O75","v":"2020-06-01"},{"$f":"'Calc|Opex forecast'!P75","v":"2021-06-01"},{"$f":"'Calc|Opex forecast'!Q75","v":"2022-06-01"},{"$f":"'Calc|Opex forecast'!R75","v":"2023-06-01"},{"$f":"'Calc|Opex forecast'!S75","v":"2024-06-01"},null,"TOTAL"]
[null,"AER alternative estimate",{"$f":"'Calc|Opex forecast'!J83","v":""},{"$f":"'Calc|Opex forecast'!K83","v":""},{"$f":"'Calc|Opex forecast'!L83","v":""},{"$f":"'Calc|Opex forecast'!M83","v":""},{"$f":"'Calc|Opex forecast'!N83","v":""},{"$f":"'Calc|Opex forecast'!O83","v":57.696830176891737},{"$f":"'Calc|Opex forecast'!P83","v":58.457869955551459},{"$f":"'Calc|Opex forecast'!Q83","v":59.374123521100408},{"$f":"'Calc|Opex forecast'!R83","v":60.311236818249235},{"$f":"'Calc|Opex forecast'!S83","v":61.236963507179297},null,{"$f":"SUM(C10:L10)","v":297.07702397897214}]
{"$rows_left_out":22}
{"sheet":"Lookup|Tables","index":12,"n_rows":76,"n_cols":22,"rows_kept":76,"cut":false,"hidden":false,"merged":[]}
[null,{"$f":"Index!$B$1","v":"AER opex model"},null,null,null,null,null,null,null,"Back to Index",null,"Key:","Input","External Link","Internal Link",null,null,null,null,null,"Overall Check:",{"$f":"'Check|List'!$S$1","v":"Check"}]
[null,{"$f":"Index!$C$17","v":"Lookup | Tables"}]
[]
[]
[]
[]
[null,"Unit Denominations"]
[]
[null,null,{"$f":"B7","v":"Unit Denominations"},"Source",null,null,"Ref"]
[null,null,"Dollars","AER",null,null,"$dollars"]
{"$rows_left_out":67}
{"sheet":"Check|List","index":13,"n_rows":20,"n_cols":19,"rows_kept":20,"cut":false,"hidden":false,"merged":[]}
[null,{"$f":"Index!$B$1","v":"AER opex model"},null,null,null,null,null,null,null,"Back to Index",null,"Key:","Input","External Link","Internal Link",null,null,"Overall Check:",{"$f":"IF(COUNTIF(G10:G18,\"Check\")=0,\"Ok\",\"Check\")","v":"Check"}]
[null,{"$f":"Index!$C$18","v":"Check | List"}]
[]
[]
[]
[]
[null,"Check List"]
[]
[null,null,"Sheet","Source","Unit",null,"Status"]
[null,null,{"$f":"Index!C7","v":"Input | General"},{"$f":"C10","v":"Input | General"},"Ok/Check",null,{"$f":"'Input|General'!S1","v":"OK"}]
{"$rows_left_out":11}
{"sheet":"Movements in provisions","index":14,"n_rows":3,"n_cols":6,"rows_kept":3,"cut":false,"hidden":false,"merged":[]}
[]
[null,"2015-06-01","2016-06-01","2017-06-01","2018-06-01","2019-06-01"]
[null,{"$f":"SUM('[13]3.2.3 Provisions'!$E$18,'[13]3.2.3 Provisions'!$E$22,'[13]3.2.3 Provisions'!$E$26,'[13]3.2.3 Provisions'!$E$38,'[13]3.2.3 Provisions'!$E$42,'[13]3.2.3 Provisions'!$E$46,'[13]3.2.3 Provisions'!$E$58,'[13]3.2.3 Provisions'!$E$62,'[13]3.2.3 Provisions'!$E$66,'[13]3.2.3 Provisions'!$E$78,'[13]3.2.3 Provisions'!$E$82,'[13]3.2.3 Provisions'!$E$86,'[13]3.2.3 Provisions'!$E$90)","v":6681341},{"$f":"SUM('[14]3.2.3 Provisions'!$C$18,'[14]3.2.3 Provisions'!$C$22,'[14]3.2.3 Provisions'!$C$26,'[14]3.2.3 Provisions'!$C$38,'[14]3.2.3 Provisions'!$C$42,'[14]3.2.3 Provisions'!$C$46,'[14]3.2.3 Provisions'!$C$58,'[14]3.2.3 Provisions'!$C$62,'[14]3.2.3 Provisions'!$C$66,'[14]3.2.3 Provisions'!$C$78,'[14]3.2.3 Provisions'!$C$82,'[14]3.2.3 Provisions'!$C$86)","v":-15206772.310000001},{"$f":"SUM('[15]3.2.3 Provisions'!$C$18,'[15]3.2.3 Provisions'!$C$22,'[15]3.2.3 Provisions'!$C$26,'[15]3.2.3 Provisions'!$C$38,'[15]3.2.3 Provisions'!$C$42,'[15]3.2.3 Provisions'!$C$46,'[15]3.2.3 Provisions'!$C$58,'[15]3.2.3 Provisions'!$C$62,'[15]3.2.3 Provisions'!$C$66,'[15]3.2.3 Provisions'!$C$78,'[15]3.2.3 Provisions'!$C$82,'[15]3.2.3 Provisions'!$C$86)","v":-980022}]