{"text_format":"1","workbook":"xlsx","n_sheets":6,"sheets":["inputs¦other","Input¦Historic","Input¦Forecast","Outputs│Tables","Outputs│Revised Proposal","AER Final Decision"],"not_rendered":{"charts":0,"images":1,"macros":1,"external_links":1,"defined_names":35,"comments":3,"pivot_tables":0},"unopened":[],"bounds":{"document_bytes":16777216,"sheet_cells":100000,"rows_first":2000,"rows_last":500,"rows_between":2000,"halvings":0,"cell_chars":16384,"cell_head_chars":4096},"cells_cut":0,"cells_raw":0,"read":"whole","date_system":"1900"}

{"sheet":"inputs¦other","index":0,"n_rows":54,"n_cols":13,"rows_kept":54,"cut":false,"hidden":false,"merged":[]}
[]
[]
[]
[]
[]
[]
[]
[]
[]
[{"$f":"RIGHT(CELL(\"filename\",A1),LEN(CELL(\"filename\",A1))-FIND(\"]\",CELL(\"filename\",A1)))","v":"inputs¦other"}]
[]
["inflation",null,2012,2013,2014,2015,2016,2017,2018,2019,2020,2021,2022]
["Inflation index","Base 2016/17",{"$f":"D13/(1+C15)","v":0.90888790489087035},0.92329020332717182,0.9463955637707947,{"$f":"G13/(1+F15)","v":0.97412199630314222},{"$f":"H13/(1+G15)","v":0.987060998151571},1,{"$f":"H13*(1+I15)","v":1.0229999999999999},{"$f":"I13*(1+J15)","v":1.0465289999999998},{"$f":"J13*(1+K15)","v":1.0705991669999997},{"$f":"K13*(1+L15)","v":1.0952229478409996},{"$f":"L13*(1+M15)","v":1.1204130756413424}]
["Inflation index","Base 2011/12",1,{"$f":"C14*(1+C15)","v":1.015846066779853},{"$f":"D14*(1+D15)","v":1.041267640022592},1.0717735279138789,1.0860096089298128,1.1002456899457469]
["CPI",null,1.5846066779853007E-2,2.5025025025025016E-2,2.9296875E-2,1.3282732447817747E-2,1.3108614232209881E-2,2.3E-2,{"$f":"H15","v":2.3E-2},{"$f":"I15","v":2.3E-2},{"$f":"J15","v":2.3E-2},{"$f":"K15","v":2.3E-2},{"$f":"L15","v":2.3E-2}]
{"$rows_left_out":40}
{"sheet":"Input¦Historic","index":1,"n_rows":101,"n_cols":21,"rows_kept":101,"cut":false,"hidden":false,"merged":[[12,0,12,6],[14,9,14,18]]}
[]
[]
[]
[]
[]
[]
[]
[]
[]
[]
[]
[]
[]
[]
[null,null,null,null,null,null,null,null,null,"aa asset class"]
{"$rows_left_out":87}
{"sheet":"Input¦Forecast","index":2,"n_rows":99,"n_cols":23,"rows_kept":99,"cut":false,"hidden":false,"merged":[[12,0,12,7],[14,11,14,20]]}
[]
[]
[]
[]
[]
[]
[]
[]
[]
[]
[]
[]
[]
[]
[null,null,null,null,null,null,null,null,null,null,null,"aa asset class"]
{"$rows_left_out":85}
{"sheet":"Outputs│Tables","index":3,"n_rows":81,"n_cols":25,"rows_kept":81,"cut":false,"hidden":false,"merged":[]}
[]
[]
[]
[]
[]
[]
[]
[]
[]
[{"$f":"RIGHT(CELL(\"filename\",A1),LEN(CELL(\"filename\",A1))-FIND(\"]\",CELL(\"filename\",A1)))","v":"Outputs│Tables"}]
[]
[]
["Capex by project ($m nominal)",null,null,null,null,null,null,null,null,null,null,null,null,"Capex by project ($m real 2016/17)"]
["Project name",null,2013,2014,2015,2016,2017,2018,2019,2020,2021,2022,null,"Project name",null,2013,2014,2015,2016,2017,2018,2019,2020,2021,2022]
[{"$f":"'inputs¦other'!A38","v":"Aquarium Passage"},"$m nominal",{"$f":"SUMIF('Input¦Historic'!$G$17:$G$98,$A15,'Input¦Historic'!B$17:B$98)/1000000","v":0.20340742000000001},{"$f":"SUMIF('Input¦Historic'!$G$17:$G$98,$A15,'Input¦Historic'!C$17:C$98)/1000000","v":0.60615213000000001},{"$f":"SUMIF('Input¦Historic'!$G$17:$G$98,$A15,'Input¦Historic'!D$17:D$98)/1000000","v":1.1201981299999999},{"$f":"SUMIF('Input¦Historic'!$G$17:$G$98,$A15,'Input¦Historic'!E$17:E$98)/1000000","v":0},{"$f":"SUMIF('Input¦Forecast'!$J$17:$J$95,$A15,'Input¦Forecast'!B$17:B$95)/1000*'inputs¦other'!H$13","v":0},{"$f":"SUMIF('Input¦Forecast'!$J$17:$J$95,$A15,'Input¦Forecast'!C$17:C$95)/1000*'inputs¦other'!I$13","v":0},{"$f":"SUMIF('Input¦Forecast'!$J$17:$J$95,$A15,'Input¦Forecast'!D$17:D$95)/1000*'inputs¦other'!J$13","v":0},{"$f":"SUMIF('Input¦Forecast'!$J$17:$J$95,$A15,'Input¦Forecast'!E$17:E$95)/1000*'inputs¦other'!K$13","v":0},{"$f":"SUMIF('Input¦Forecast'!$J$17:$J$95,$A15,'Input¦Forecast'!F$17:F$95)/1000*'inputs¦other'!L$13","v":0},{"$f":"SUMIF('Input¦Forecast'!$J$17:$J$95,$A15,'Input¦Forecast'!G$17:G$95)/1000*'inputs¦other'!M$13","v":0},null,{"$f":"A15","v":"Aquarium Passage"},"$m real 2016/17",{"$f":"C15/'inputs¦other'!D$13","v":0.2203071355755756},{"$f":"D15/'inputs¦other'!E$13","v":0.64048496548828138},{"$f":"E15/'inputs¦other'!F$13","v":1.1499567140986717},{"$f":"F15/'inputs¦other'!G$13","v":0},{"$f":"G15/'inputs¦other'!H$13","v":0},{"$f":"H15/'inputs¦other'!I$13","v":0},{"$f":"I15/'inputs¦other'!J$13","v":0},{"$f":"J15/'inputs¦other'!K$13","v":0},{"$f":"K15/'inputs¦other'!L$13","v":0},{"$f":"L15/'inputs¦other'!M$13","v":0}]
{"$rows_left_out":67}
{"sheet":"Outputs│Revised Proposal","index":4,"n_rows":68,"n_cols":16,"rows_kept":68,"cut":false,"hidden":false,"merged":[]}
[]
[]
[]
[]
[]
[]
[]
[]
[]
[null,{"$f":"RIGHT(CELL(\"filename\",B1),LEN(CELL(\"filename\",B1))-FIND(\"]\",CELL(\"filename\",B1)))","v":"Outputs│Revised Proposal"}]
[]
[]
[null,"Capex by project ($m nominal)",null,null,null,null,null,null,null,"Capex by project ($m real 2016/17)"]
[null,"Project name",null,2013,2014,2015,2016,2017,null,"Project name",null,2018,2019,2020,2021,2022]
[null,"Aquarium Passage","$m nominal",{"$f":"SUMIF('Input¦Historic'!$G$17:$G$97,$B15,'Input¦Historic'!B$17:B$97)/1000000","v":0.20340742000000001},{"$f":"SUMIF('Input¦Historic'!$G$17:$G$97,$B15,'Input¦Historic'!C$17:C$97)/1000000","v":0.60615213000000001},{"$f":"SUMIF('Input¦Historic'!$G$17:$G$97,$B15,'Input¦Historic'!D$17:D$97)/1000000","v":1.1201981299999999},{"$f":"SUMIF('Input¦Historic'!$G$17:$G$97,$B15,'Input¦Historic'!E$17:E$97)/1000000","v":0},{"$f":"SUMIF('Input¦Forecast'!$J$17:$J$95,$B15,'Input¦Forecast'!B$17:B$95)/1000*'inputs¦other'!H$13","v":0},null,{"$f":"B15","v":"Aquarium Passage"},"$m real 2016/17",{"$f":"SUMIF('Input¦Forecast'!$J$17:$J$95,$B15,'Input¦Forecast'!C$17:C$95)/1000","v":0},{"$f":"SUMIF('Input¦Forecast'!$J$17:$J$95,$B15,'Input¦Forecast'!D$17:D$95)/1000","v":0},{"$f":"SUMIF('Input¦Forecast'!$J$17:$J$95,$B15,'Input¦Forecast'!E$17:E$95)/1000","v":0},{"$f":"SUMIF('Input¦Forecast'!$J$17:$J$95,$B15,'Input¦Forecast'!F$17:F$95)/1000","v":0},{"$f":"SUMIF('Input¦Forecast'!$J$17:$J$95,$B15,'Input¦Forecast'!G$17:G$95)/1000","v":0}]
{"$rows_left_out":54}
{"sheet":"AER Final Decision","index":5,"n_rows":62,"n_cols":16,"rows_kept":62,"cut":false,"hidden":false,"merged":[]}
[]
[]
[]
[]
[]
[]
[]
[]
[]
[null,{"$f":"RIGHT(CELL(\"filename\",B1),LEN(CELL(\"filename\",B1))-FIND(\"]\",CELL(\"filename\",B1)))","v":"AER Final Decision"}]
[]
[]
[null,"Capex by project ($m nominal)",null,null,null,null,null,null,null,"Capex by project ($m real 2016/17)"]
[null,"Project name",null,2013,2014,2015,2016,2017,null,"Project name",null,2018,2019,2020,2021,2022]
[null,"Aquarium Passage","$m nominal",{"$f":"SUMIF('Input¦Historic'!$G$17:$G$97,$B15,'Input¦Historic'!B$17:B$97)/1000000","v":0.20340742000000001},{"$f":"SUMIF('Input¦Historic'!$G$17:$G$97,$B15,'Input¦Historic'!C$17:C$97)/1000000","v":0.60615213000000001},{"$f":"SUMIF('Input¦Historic'!$G$17:$G$97,$B15,'Input¦Historic'!D$17:D$97)/1000000","v":1.1201981299999999},{"$f":"SUMIF('Input¦Historic'!$G$17:$G$97,$B15,'Input¦Historic'!E$17:E$97)/1000000","v":0},{"$f":"SUMIF('Input¦Forecast'!$J$17:$J$95,$B15,'Input¦Forecast'!B$17:B$95)/1000*'inputs¦other'!H$13","v":0},null,{"$f":"B15","v":"Aquarium Passage"},"$m real 2016/17",{"$f":"SUMIF('Input¦Forecast'!$J$17:$J$95,$B15,'Input¦Forecast'!C$17:C$95)/1000","v":0},{"$f":"SUMIF('Input¦Forecast'!$J$17:$J$95,$B15,'Input¦Forecast'!D$17:D$95)/1000","v":0},{"$f":"SUMIF('Input¦Forecast'!$J$17:$J$95,$B15,'Input¦Forecast'!E$17:E$95)/1000","v":0},{"$f":"SUMIF('Input¦Forecast'!$J$17:$J$95,$B15,'Input¦Forecast'!F$17:F$95)/1000","v":0},{"$f":"SUMIF('Input¦Forecast'!$J$17:$J$95,$B15,'Input¦Forecast'!G$17:G$95)/1000","v":0}]
{"$rows_left_out":47}