{"text_format":"1","workbook":"xlsx","n_sheets":2,"sheets":["2019 scenario - input","2019 scenario - output"],"not_rendered":{"charts":0,"images":0,"macros":1,"external_links":1,"defined_names":6,"comments":0,"pivot_tables":0},"unopened":[],"bounds":{"document_bytes":16777216,"sheet_cells":100000,"rows_first":2000,"rows_last":500,"rows_between":2000,"halvings":0,"cell_chars":16384,"cell_head_chars":4096},"cells_cut":0,"cells_raw":0,"read":"whole","date_system":"1900"}

{"sheet":"2019 scenario - input","index":0,"n_rows":149,"n_cols":190,"rows_kept":149,"cut":false,"hidden":false,"merged":[[2,3,3,3],[2,4,3,5],[2,6,3,6]]}
[null,"Unit cost - historical","Calibration period:"]
[null,"Replacement lives - calibrated"]
[null,null,null,"Unit cost","Replacement \nlife",null,"Method","Volume",null,null,null,null,null,null,null,null,null,null,null,null,null,null,null,null,null,null,null,null,null,null,null,null,null,null,null,null,null,null,null,null,null,null,null,null,null,null,null,null,null,null,null,null,null,null,null,null,null,null,null,null,null,null,null,null,null,null,null,null,null,null,null,null,null,null,null,null,null,null,null,null,null,null,null,null,null,null,null,null,null,null,null,null,null,null,null,null,null,null,null,"Replacement Cost (NOT depreciated)"]
[null,null,null,null,null,null,null,"Installation date",null,null,null,null,null,null,null,null,null,null,null,null,null,null,null,null,null,null,null,null,null,null,null,null,null,null,null,null,null,null,null,null,null,null,null,null,null,null,null,null,null,null,null,null,null,null,null,null,null,null,null,null,null,null,null,null,null,null,null,null,null,null,null,null,null,null,null,null,null,null,null,null,null,null,null,null,null,null,null,null,null,null,null,null,null,null,null,null,null,null,null,"Installation date"]
["ID","Asset group","Asset category","$ ('000)","μ","σ","#",2020,{"$f":"IFERROR(IF($H5=\"\",\"\",H5-1),\"\")","v":2019},{"$f":"IFERROR(IF($H5=\"\",\"\",I5-1),\"\")","v":2018},2017,2016,2015,2014,2013,2012,2011,2010,2009,2008,2007,2006,2005,2004,2003,2002,2001,2000,1999,1998,1997,1996,1995,1994,1993,1992,1991,1990,1989,1988,1987,1986,1985,1984,1983,1982,1981,1980,1979,1978,1977,1976,1975,1974,1973,1972,1971,1970,1969,1968,1967,1966,1965,1964,1963,1962,1961,1960,1959,1958,1957,1956,1955,{"$f":"IFERROR(IF($H5=\"\",\"\",BU5-1),\"\")","v":1954},1953,1952,1951,1950,1949,1948,1947,1946,1945,1944,1943,1942,1941,1940,1939,1938,1937,1936,1935,1934,1933,1932,1931,1930,null,{"$f":"H5","v":2020},{"$f":"I5","v":2019},2018,2017,2016,2015,2014,2013,2012,2011,2010,2009,2008,2007,2006,2005,2004,2003,2002,2001,2000,1999,1998,1997,1996,1995,1994,1993,1992,1991,1990,1989,1988,1987,1986,1985,1984,1983,1982,1981,1980,1979,1978,1977,1976,1975,1974,1973,1972,1971,1970,1969,1968,1967,1966,1965,1964,1963,1962,1961,1960,1959,1958,1957,1956,{"$f":"BU5","v":1955},1954,1953,1952,1951,1950,1949,1948,1947,1946,1945,1944,1943,1942,1941,1940,1939,1938,1937,1936,1935,1934,1933,1932,1931,1930]
[2,"POLES","˂ = 1 kv ; wood",1,71.327772846508665,8.4455771174330447,2,192,234,210,189,359,383,425,431,229,401,617,396,452,436,618,582,562,490,746,647,414,56,38,28,22,17,28,38,44,376,1204,1219,1054,3088,2085,2400,1871,1782,1952,3567,1917,2234,1823,3406,3080,2502,3085,2669,2134,2255,3089,3055,3042,2116,2402,2416,1467,1699,1459,1363,1140,1038,1087,271,412,387,410,521,387,692,270,184,131,118,89,32,26,116,345,842,437,752,209,165,64,127,59,25,12,25,0,null,192,234,210,189,359,383,425,431,229,401,617,396,452,436,618,582,562,490,746,647,414,56,38,28,22,17,28,38,44,376,1204,1219,1054,3088,2085,2400,1871,1782,1952,3567,1917,2234,1823,3406,3080,2502,3085,2669,2134,2255,3089,3055,3042,2116,2402,2416,1467,1699,1459,1363,1140,1038,1087,271,412,387,410,521,387,692,270,184,131,118,89,32,26,116,345,842,437,752,209,165,64,127,59,25,12,25,0]
[2,"POLES","˃ 11 kv & < = 22 kv ; wood",1,70.894627445270075,8.4198947407476581,2,854,1148,1142,1553,1668,1486,1316,1614,1204,1187,1615,1580,1620,1784,2643,3097,2706,2168,3554,3163,1828,354,179,132,195,197,562,154,566,1535,1473,2691,1509,4458,4248,5376,4962,5065,6790,6752,2722,4642,6910,6861,5278,3970,3584,3457,3066,4724,7430,7705,7882,9261,10970,10776,4776,4390,4390,3736,3460,3346,3331,736,1610,1269,900,1075,1041,1100,613,216,162,206,239,196,63,308,552,1501,1190,2320,569,297,130,76,55,29,6,8,0,null,854,1148,1142,1553,1668,1486,1316,1614,1204,1187,1615,1580,1620,1784,2643,3097,2706,2168,3554,3163,1828,354,179,132,195,197,562,154,566,1535,1473,2691,1509,4458,4248,5376,4962,5065,6790,6752,2722,4642,6910,6861,5278,3970,3584,3457,3066,4724,7430,7705,7882,9261,10970,10776,4776,4390,4390,3736,3460,3346,3331,736,1610,1269,900,1075,1041,1100,613,216,162,206,239,196,63,308,552,1501,1190,2320,569,297,130,76,55,29,6,8,0]
[2,"POLES","> 1 kv & < = 11 kv ; wood",1,64.838048193634293,8.0522076596194587,2,3,9,4,3,33,3,7,7,4,2,5,12,6,10,3,13,5,8,5,9,1,2,2,8,3,0,9,0,5,30,13,7,7,4,20,23,21,3,4,15,7,30,10,3,9,12,7,20,9,23,10,20,14,31,22,2,10,16,19,10,21,8,3,0,0,5,1,0,0,3,0,0,0,0,0,0,0,0,6,1,2,2,0,0,0,0,0,0,0,0,0,null,3,9,4,3,33,3,7,7,4,2,5,12,6,10,3,13,5,8,5,9,1,2,2,8,3,0,9,0,5,30,13,7,7,4,20,23,21,3,4,15,7,30,10,3,9,12,7,20,9,23,10,20,14,31,22,2,10,16,19,10,21,8,3,0,0,5,1,0,0,3,0,0,0,0,0,0,0,0,6,1,2,2,0,0,0,0,0,0,0,0,0]
[2,"POLES","> 22 kv & < = 66 kv ; wood",1,74.509930070768178,8.6319134652038869,2,77,243,356,444,610,154,282,502,316,325,83,319,176,354,147,621,266,252,327,270,280,29,12,15,24,11,40,7,34,258,175,52,41,45,88,267,124,120,315,191,118,50,370,676,792,378,203,318,210,714,524,156,412,367,286,455,240,172,268,120,143,31,401,288,57,22,57,26,44,30,19,20,6,5,4,1,198,32,167,57,18,17,0,1,46,24,1,0,0,2,0,null,77,243,356,444,610,154,282,502,316,325,83,319,176,354,147,621,266,252,327,270,280,29,12,15,24,11,40,7,34,258,175,52,41,45,88,267,124,120,315,191,118,50,370,676,792,378,203,318,210,714,524,156,412,367,286,455,240,172,268,120,143,31,401,288,57,22,57,26,44,30,19,20,6,5,4,1,198,32,167,57,18,17,0,1,46,24,1,0,0,2,0]
[2,"POLES","staking of a wooden pole",1,33.890053426912402,5.8215164198782778,2,53,344,626,666,852,1245,1246,1071,784,749,486,656,985,814,897,613,553,510,335,192,210,152,1568,1395,731,632,446,530,885,992,0,0,0,0,0,0,0,0,0,0,0,0,0,0,0,0,0,0,0,0,0,0,0,0,0,0,0,0,0,0,0,0,0,0,0,0,0,0,0,0,0,0,0,0,0,0,0,0,0,0,0,0,0,0,0,0,0,0,0,0,0,null,53,344,626,666,852,1245,1246,1071,784,749,486,656,985,814,897,613,553,510,335,192,210,152,1568,1395,731,632,446,530,885,992,0,0,0,0,0,0,0,0,0,0,0,0,0,0,0,0,0,0,0,0,0,0,0,0,0,0,0,0,0,0,0,0,0,0,0,0,0,0,0,0,0,0,0,0,0,0,0,0,0,0,0,0,0,0,0,0,0,0,0,0,0]
[{"$f":"IFERROR(IF($B11=\"\",\"\",INDEX('2019 scenario - output'!$A$6:$A$12,MATCH('2019 scenario - input'!$B11,'2019 scenario - output'!$B$6:$B$12,0))),\"\")","v":""},null,null,null,null,null,null,null,null,null,null,null,null,null,null,null,null,null,null,null,null,null,null,null,null,null,null,null,null,null,null,null,null,null,null,null,null,null,null,null,null,null,null,null,null,null,null,null,null,null,null,null,null,null,null,null,null,null,null,null,null,null,null,null,null,null,null,null,null,null,null,null,null,null,null,null,null,null,null,null,null,null,null,null,null,null,null,null,null,null,null,null,null,null,null,null,null,null,null,{"$f":"IFERROR($D11*H11,\"\")","v":0},{"$f":"IFERROR($D11*I11,\"\")","v":0},{"$f":"IFERROR($D11*J11,\"\")","v":0},{"$f":"IFERROR($D11*K11,\"\")","v":0},{"$f":"IFERROR($D11*L11,\"\")","v":0},{"$f":"IFERROR($D11*M11,\"\")","v":0},{"$f":"IFERROR($D11*N11,\"\")","v":0},{"$f":"IFERROR($D11*O11,\"\")","v":0},{"$f":"IFERROR($D11*P11,\"\")","v":0},{"$f":"IFERROR($D11*Q11,\"\")","v":0},{"$f":"IFERROR($D11*R11,\"\")","v":0},{"$f":"IFERROR($D11*S11,\"\")","v":0},{"$f":"IFERROR($D11*T11,\"\")","v":0},{"$f":"IFERROR($D11*U11,\"\")","v":0},{"$f":"IFERROR($D11*V11,\"\")","v":0},{"$f":"IFERROR($D11*W11,\"\")","v":0},{"$f":"IFERROR($D11*X11,\"\")","v":0},{"$f":"IFERROR($D11*Y11,\"\")","v":0},{"$f":"IFERROR($D11*Z11,\"\")","v":0},{"$f":"IFERROR($D11*AA11,\"\")","v":0},{"$f":"IFERROR($D11*AB11,\"\")","v":0},{"$f":"IFERROR($D11*AC11,\"\")","v":0},{"$f":"IFERROR($D11*AD11,\"\")","v":0},{"$f":"IFERROR($D11*AE11,\"\")","v":0},{"$f":"IFERROR($D11*AF11,\"\")","v":0},{"$f":"IFERROR($D11*AG11,\"\")","v":0},{"$f":"IFERROR($D11*AH11,\"\")","v":0},{"$f":"IFERROR($D11*AI11,\"\")","v":0},{"$f":"IFERROR($D11*AJ11,\"\")","v":0},{"$f":"IFERROR($D11*AK11,\"\")","v":0},{"$f":"IFERROR($D11*AL11,\"\")","v":0},{"$f":"IFERROR($D11*AM11,\"\")","v":0},{"$f":"IFERROR($D11*AN11,\"\")","v":0},{"$f":"IFERROR($D11*AO11,\"\")","v":0},{"$f":"IFERROR($D11*AP11,\"\")","v":0},{"$f":"IFERROR($D11*AQ11,\"\")","v":0},{"$f":"IFERROR($D11*AR11,\"\")","v":0},{"$f":"IFERROR($D11*AS11,\"\")","v":0},{"$f":"IFERROR($D11*AT11,\"\")","v":0},{"$f":"IFERROR($D11*AU11,\"\")","v":0},{"$f":"IFERROR($D11*AV11,\"\")","v":0},{"$f":"IFERROR($D11*AW11,\"\")","v":0},{"$f":"IFERROR($D11*AX11,\"\")","v":0},{"$f":"IFERROR($D11*AY11,\"\")","v":0},{"$f":"IFERROR($D11*AZ11,\"\")","v":0},{"$f":"IFERROR($D11*BA11,\"\")","v":0},{"$f":"IFERROR($D11*BB11,\"\")","v":0},{"$f":"IFERROR($D11*BC11,\"\")","v":0},{"$f":"IFERROR($D11*BD11,\"\")","v":0},{"$f":"IFERROR($D11*BE11,\"\")","v":0},{"$f":"IFERROR($D11*BF11,\"\")","v":0},{"$f":"IFERROR($D11*BG11,\"\")","v":0},{"$f":"IFERROR($D11*BH11,\"\")","v":0},{"$f":"IFERROR($D11*BI11,\"\")","v":0},{"$f":"IFERROR($D11*BJ11,\"\")","v":0},{"$f":"IFERROR($D11*BK11,\"\")","v":0},{"$f":"IFERROR($D11*BL11,\"\")","v":0},{"$f":"IFERROR($D11*BM11,\"\")","v":0},{"$f":"IFERROR($D11*BN11,\"\")","v":0},{"$f":"IFERROR($D11*BO11,\"\")","v":0},{"$f":"IFERROR($D11*BP11,\"\")","v":0},{"$f":"IFERROR($D11*BQ11,\"\")","v":0},{"$f":"IFERROR($D11*BR11,\"\")","v":0},{"$f":"IFERROR($D11*BS11,\"\")","v":0},{"$f":"IFERROR($D11*BT11,\"\")","v":0},{"$f":"IFERROR($D11*BU11,\"\")","v":0},{"$f":"IFERROR($D11*BV11,\"\")","v":0},{"$f":"IFERROR($D11*BW11,\"\")","v":0},{"$f":"IFERROR($D11*BX11,\"\")","v":0},{"$f":"IFERROR($D11*BY11,\"\")","v":0},{"$f":"IFERROR($D11*BZ11,\"\")","v":0},{"$f":"IFERROR($D11*CA11,\"\")","v":0},{"$f":"IFERROR($D11*CB11,\"\")","v":0},{"$f":"IFERROR($D11*CC11,\"\")","v":0},{"$f":"IFERROR($D11*CD11,\"\")","v":0},{"$f":"IFERROR($D11*CE11,\"\")","v":0},{"$f":"IFERROR($D11*CF11,\"\")","v":0},{"$f":"IFERROR($D11*CG11,\"\")","v":0},{"$f":"IFERROR($D11*CH11,\"\")","v":0},{"$f":"IFERROR($D11*CI11,\"\")","v":0},{"$f":"IFERROR($D11*CJ11,\"\")","v":0},{"$f":"IFERROR($D11*CK11,\"\")","v":0},{"$f":"IFERROR($D11*CL11,\"\")","v":0},{"$f":"IFERROR($D11*CM11,\"\")","v":0},{"$f":"IFERROR($D11*CN11,\"\")","v":0},{"$f":"IFERROR($D11*CO11,\"\")","v":0},{"$f":"IFERROR($D11*CP11,\"\")","v":0},{"$f":"IFERROR($D11*CQ11,\"\")","v":0},{"$f":"IFERROR($D11*CR11,\"\")","v":0},{"$f":"IFERROR($D11*CS11,\"\")","v":0},{"$f":"IFERROR($D11*CT11,\"\")","v":0}]
[{"$f":"IFERROR(IF($B12=\"\",\"\",INDEX('2019 scenario - output'!$A$6:$A$12,MATCH('2019 scenario - input'!$B12,'2019 scenario - output'!$B$6:$B$12,0))),\"\")","v":""},null,null,null,null,null,null,null,null,null,null,null,null,null,null,null,null,null,null,null,null,null,null,null,null,null,null,null,null,null,null,null,null,null,null,null,null,null,null,null,null,null,null,null,null,null,null,null,null,null,null,null,null,null,null,null,null,null,null,null,null,null,null,null,null,null,null,null,null,null,null,null,null,null,null,null,null,null,null,null,null,null,null,null,null,null,null,null,null,null,null,null,null,null,null,null,null,null,null,0,0,0,0,0,0,0,0,0,0,0,0,0,0,0,0,0,0,0,0,0,0,0,0,0,0,0,0,0,0,0,0,0,0,0,0,0,0,0,0,0,0,0,0,0,0,0,0,0,0,0,0,0,0,0,0,0,0,0,0,0,0,0,0,0,0,0,0,0,0,0,0,0,0,0,0,0,0,0,0,0,0,0,0,0,0,0,0,0,0,0]
[{"$f":"IFERROR(IF($B13=\"\",\"\",INDEX('2019 scenario - output'!$A$6:$A$12,MATCH('2019 scenario - input'!$B13,'2019 scenario - output'!$B$6:$B$12,0))),\"\")","v":""},null,null,null,null,null,null,null,null,null,null,null,null,null,null,null,null,null,null,null,null,null,null,null,null,null,null,null,null,null,null,null,null,null,null,null,null,null,null,null,null,null,null,null,null,null,null,null,null,null,null,null,null,null,null,null,null,null,null,null,null,null,null,null,null,null,null,null,null,null,null,null,null,null,null,null,null,null,null,null,null,null,null,null,null,null,null,null,null,null,null,null,null,null,null,null,null,null,null,0,0,0,0,0,0,0,0,0,0,0,0,0,0,0,0,0,0,0,0,0,0,0,0,0,0,0,0,0,0,0,0,0,0,0,0,0,0,0,0,0,0,0,0,0,0,0,0,0,0,0,0,0,0,0,0,0,0,0,0,0,0,0,0,0,0,0,0,0,0,0,0,0,0,0,0,0,0,0,0,0,0,0,0,0,0,0,0,0,0,0]
[{"$f":"IFERROR(IF($B14=\"\",\"\",INDEX('2019 scenario - output'!$A$6:$A$12,MATCH('2019 scenario - input'!$B14,'2019 scenario - output'!$B$6:$B$12,0))),\"\")","v":""},null,null,null,null,null,null,null,null,null,null,null,null,null,null,null,null,null,null,null,null,null,null,null,null,null,null,null,null,null,null,null,null,null,null,null,null,null,null,null,null,null,null,null,null,null,null,null,null,null,null,null,null,null,null,null,null,null,null,null,null,null,null,null,null,null,null,null,null,null,null,null,null,null,null,null,null,null,null,null,null,null,null,null,null,null,null,null,null,null,null,null,null,null,null,null,null,null,null,0,0,0,0,0,0,0,0,0,0,0,0,0,0,0,0,0,0,0,0,0,0,0,0,0,0,0,0,0,0,0,0,0,0,0,0,0,0,0,0,0,0,0,0,0,0,0,0,0,0,0,0,0,0,0,0,0,0,0,0,0,0,0,0,0,0,0,0,0,0,0,0,0,0,0,0,0,0,0,0,0,0,0,0,0,0,0,0,0,0,0]
[{"$f":"IFERROR(IF($B15=\"\",\"\",INDEX('2019 scenario - output'!$A$6:$A$12,MATCH('2019 scenario - input'!$B15,'2019 scenario - output'!$B$6:$B$12,0))),\"\")","v":""},null,null,null,null,null,null,null,null,null,null,null,null,null,null,null,null,null,null,null,null,null,null,null,null,null,null,null,null,null,null,null,null,null,null,null,null,null,null,null,null,null,null,null,null,null,null,null,null,null,null,null,null,null,null,null,null,null,null,null,null,null,null,null,null,null,null,null,null,null,null,null,null,null,null,null,null,null,null,null,null,null,null,null,null,null,null,null,null,null,null,null,null,null,null,null,null,null,null,0,0,0,0,0,0,0,0,0,0,0,0,0,0,0,0,0,0,0,0,0,0,0,0,0,0,0,0,0,0,0,0,0,0,0,0,0,0,0,0,0,0,0,0,0,0,0,0,0,0,0,0,0,0,0,0,0,0,0,0,0,0,0,0,0,0,0,0,0,0,0,0,0,0,0,0,0,0,0,0,0,0,0,0,0,0,0,0,0,0,0]
{"$rows_left_out":135}
{"sheet":"2019 scenario - output","index":1,"n_rows":156,"n_cols":43,"rows_kept":156,"cut":false,"hidden":false,"merged":[]}
[null,null,null,"Replacement expenditure forecast ($,000)",null,null,null,null,null,null,null,null,null,null,null,null,null,null,null,null,null,null,null,"Replacement quantity forecast (#)"]
[null,null,null,1,2,3,4,5,6,7,8,9,10,11,12,13,14,15,16,17,18,19,20,1,2,3,4,5,6,7,8,9,10,11,12,13,14,15,16,17,18,19,20]
[]
[]
["ID","Asset group",null,2020,{"$f":"IFERROR(IF($D5=\"\",\"\",D5+1),\"\")","v":2021},{"$f":"IFERROR(IF($D5=\"\",\"\",E5+1),\"\")","v":2022},2023,2024,2025,2026,2027,2028,2029,2030,2031,2032,2033,2034,2035,2036,2037,2038,2039,{"$f":"IFERROR(IF(D5=\"\",\"\",D5),\"\")","v":2020},{"$f":"IFERROR(IF(E5=\"\",\"\",E5),\"\")","v":2021},2022,2023,2024,2025,2026,2027,2028,2029,2030,2031,2032,2033,2034,2035,2036,2037,2038,2039]
[2,"POLES",null,{"$f":"IFERROR(IF($A6=\"\",\"\",SUMIFS(D$16:D$156,$A$16:$A$156,$A6)),\"\")","v":4481.7432965889493},4536.1378006640289,4632.2067655977635,4770.0293844653215,4947.6747709959873,5161.4736468608262,5406.3746771133192,5676.3440612460845,5964.7668562803719,6264.8137049172146,6569.7461891500752,6873.1462440438818,7169.0677909866499,7452.1197226543336,7717.4966970498663,7960.9768228855792,8178.9033630281583,8368.1623577784176,8526.1617090171894,8650.8120389570449,4481.7432965889493,4536.1378006640289,4632.2067655977635,4770.0293844653215,4947.6747709959873,5161.4736468608262,5406.3746771133192,5676.3440612460845,5964.7668562803719,6264.8137049172146,6569.7461891500752,6873.1462440438818,7169.0677909866499,7452.1197226543336,7717.4966970498663,7960.9768228855792,8178.9033630281583,8368.1623577784176,8526.1617090171894,8650.8120389570449]
[null,null,null,{"$f":"IFERROR(IF($A7=\"\",\"\",SUMIFS(D$16:D$156,$A$16:$A$156,$A7)),\"\")","v":""},"","","","","","","","","",{"$f":"IFERROR(IF($A7=\"\",\"\",SUMIFS(N$16:N$156,$A$16:$A$156,$A7)),\"\")","v":""},"","","","","","","","","","",null,{"$f":"IFERROR(IF($A7=\"\",\"\",SUMIFS(Z$16:Z$156,$A$16:$A$156,$A7)),\"\")","v":""},null,{"$f":"IFERROR(IF($A7=\"\",\"\",SUMIFS(AB$16:AB$156,$A$16:$A$156,$A7)),\"\")","v":""},"","","","","","","","","","","","","","",""]
[null,null,null,"","","","","","","","","","","","","","","","","","","","","",null,"",null,"","","","","","","","","","","","","","","",""]
[null,null,null,"","","","","","","","","","","","","","","","","","","","","",{"$f":"IFERROR(IF($A9=\"\",\"\",SUMIFS(Y$16:Y$156,$A$16:$A$156,$A9)),\"\")","v":""},"",{"$f":"IFERROR(IF($A9=\"\",\"\",SUMIFS(AA$16:AA$156,$A$16:$A$156,$A9)),\"\")","v":""},"","","","","","","","","","","","","","","",""]
[null,null,null,"","","","","","","","","","","","","","","","","","","","","",{"$f":"IFERROR(IF($A10=\"\",\"\",SUMIFS(Y$16:Y$156,$A$16:$A$156,$A10)),\"\")","v":""},"",{"$f":"IFERROR(IF($A10=\"\",\"\",SUMIFS(AA$16:AA$156,$A$16:$A$156,$A10)),\"\")","v":""},"","","","","","","","","","","","","","","",""]
[null,null,null,"","","","","","","","","","","","","","","","","","","","","",{"$f":"IFERROR(IF($A11=\"\",\"\",SUMIFS(Y$16:Y$156,$A$16:$A$156,$A11)),\"\")","v":""},"",{"$f":"IFERROR(IF($A11=\"\",\"\",SUMIFS(AA$16:AA$156,$A$16:$A$156,$A11)),\"\")","v":""},"","","","","","","","","","","","","","","",""]
[null,null,null,"","","","","","","","","","","","","","","","","","","","","",{"$f":"IFERROR(IF($A12=\"\",\"\",SUMIFS(Y$16:Y$156,$A$16:$A$156,$A12)),\"\")","v":""},"",{"$f":"IFERROR(IF($A12=\"\",\"\",SUMIFS(AA$16:AA$156,$A$16:$A$156,$A12)),\"\")","v":""},"","","","","","","","","","","","","","","",""]
[null,null,"Total",{"$f":"IFERROR(SUM(D$6:D$12),\"\")","v":4481.7432965889493},4536.1378006640289,4632.2067655977635,4770.0293844653215,4947.6747709959873,5161.4736468608262,5406.3746771133192,5676.3440612460845,5964.7668562803719,6264.8137049172146,6569.7461891500752,6873.1462440438818,7169.0677909866499,7452.1197226543336,7717.4966970498663,7960.9768228855792,8178.9033630281583,8368.1623577784176,8526.1617090171894,8650.8120389570449]
[]
["ID","Asset group","Asset category"]
{"$rows_left_out":141}