{"text_format":"1","workbook":"xlsx","n_sheets":20,"sheets":["Contribution model","Outputs>>","Compliance","Tables","Charts","Historical CD by DNSP","Inputs>>","General","Financial","Historical CD Year Financial","Energy","Exemptions","Calculations>>","Contribution Det Under & Over","Contribution Det Itemised","Cost Movements","Apportion to DNSP","Cash Flow Model","Lookups","Glossary"],"not_rendered":{"charts":12,"images":0,"macros":1,"external_links":0,"defined_names":48,"comments":0,"pivot_tables":0},"unopened":[],"bounds":{"document_bytes":16777216,"sheet_cells":100000,"rows_first":2000,"rows_last":500,"rows_between":2000,"halvings":0,"cell_chars":16384,"cell_head_chars":4096},"cells_cut":0,"cells_raw":0,"read":"whole","date_system":"1900"}

{"sheet":"Contribution model","index":0,"n_rows":66,"n_cols":9,"rows_kept":66,"cut":false,"hidden":false,"merged":[[44,8,44,9],[39,8,39,9],[14,8,14,9],[9,8,9,9],[10,8,10,9],[11,8,11,9],[13,8,13,9],[12,8,12,9]]}
[]
[null,null,null,null,null,null,"AER contribution determination model"]
[null,null,null,null,null,null,{"$f":"forecastyear","v":"2023–24"}]
[null,null,null,null,null,null,"Electicity Distribution Network Service Provider"]
[]
[]
[null,"Description Table 1 | Keys"]
[]
{"$rows_left_out":59}
{"sheet":"Outputs>>","index":1,"n_rows":12,"n_cols":6,"rows_kept":12,"cut":false,"hidden":false,"merged":[]}
[null,{"$f":"'Contribution model'!G2&\" - \"&'Contribution model'!G3","v":"AER contribution determination model - 2023–24"},null,null,null,"Back to Index"]
[null,"Index"]
[]
[null,"Model Index"]
[]
[null,null,"Sheet Name","Sheet Description"]
[null,null,"Compliance","Compliance and Validation Checks"]
[null,null,"Tables","Tables of outputs"]
{"$rows_left_out":5}
{"sheet":"Compliance","index":2,"n_rows":14,"n_cols":23,"rows_kept":14,"cut":false,"hidden":false,"merged":[]}
[null,{"$f":"'Outputs>>'!B1","v":"AER contribution determination model - 2023–24"},null,null,null,null,null,null,null,"Back to Index"]
[null,"Compliance",null,null,null,null,null,null,null,null,null,null,null,null,null,null,null,null,null,{"$f":"IF(COUNTIF(T5:T99,\"NON-COMPLIANT\")>0,\"NON-COMPLIANT\",\"COMPLIANT\")","v":"COMPLIANT"}]
[]
[]
[null,"Compliance table 1 | Contribution Determination Check",null,null,"Source","Unit",null,null,null,"2023–24","2024–25","2025–26","2026–27","2027–28","2028–29","2029–30","2030–31","2031–32",null,"Compliance",null,null,"Notes"]
[]
[null,"Contribution Determination "]
[null,{"$f":"Tables!C67","v":"Ausgrid"},null,null,"'Apportion to DNSP'",{"$f":"IF(B8=0,0,revenueunits)","v":"$millions"},null,null,null,{"$f":"IF(J$5<forecastyear,'Historical CD by DNSP'!K7,'Apportion to DNSP'!N234)","v":""},{"$f":"IF(K$5<forecastyear,'Historical CD by DNSP'!L7,'Apportion to DNSP'!O234)","v":""},{"$f":"IF(L$5<forecastyear,'Historical CD by DNSP'!M7,'Apportion to DNSP'!P234)","v":""},{"$f":"IF(M$5<forecastyear,'Historical CD by DNSP'!N7,'Apportion to DNSP'!Q234)","v":""},{"$f":"IF(N$5<forecastyear,'Historical CD by DNSP'!O7,'Apportion to DNSP'!R234)","v":""},{"$f":"IF(O$5<forecastyear,'Historical CD by DNSP'!P7,'Apportion to DNSP'!S234)","v":""},{"$f":"IF(P$5<forecastyear,'Historical CD by DNSP'!Q7,'Apportion to DNSP'!T234)","v":""},{"$f":"IF(Q$5<forecastyear,'Historical CD by DNSP'!R7,'Apportion to DNSP'!U234)","v":""},{"$f":"IF(R$5<forecastyear,'Historical CD by DNSP'!S7,'Apportion to DNSP'!V234)","v":""}]
{"$rows_left_out":7}
{"sheet":"Tables","index":3,"n_rows":130,"n_cols":23,"rows_kept":130,"cut":false,"hidden":false,"merged":[]}
[null,{"$f":"'Inputs>>'!B1","v":"AER contribution determination model - 2023–24"},null,null,null,null,null,null,null,"Back to Index"]
[null,"Tables"]
[]
[null,"Output Table 1 | Contribution Determination for Forecast Year",null,null,"Source","Unit",null,null,null,{"$f":"forecastyear","v":"2023–24"},null,null,null,null,null,null,null,null,null,null,null,null,"Notes"]
[]
[null,null,"Apportioned Total Costs by DNSP"]
[null,null,"Ausgrid",null,"'Apportion to DNSP'",{"$f":"IF(C7=0,0,revenueunits)","v":"$millions"},null,null,null,{"$f":"INDEX('Apportion to DNSP'!$M$234:$V$237,1,MATCH($J$4,'Apportion to DNSP'!$M$231:$V$231,0))","v":""}]
[null,null,"Endeavour Energy",null,"'Apportion to DNSP'",{"$f":"IF(C8=0,0,revenueunits)","v":"$millions"},null,null,null,{"$f":"INDEX('Apportion to DNSP'!$M$234:$V$237,2,MATCH($J$4,'Apportion to DNSP'!$M$231:$V$231,0))","v":""}]
{"$rows_left_out":123}
{"sheet":"Charts","index":4,"n_rows":446,"n_cols":13,"rows_kept":446,"cut":false,"hidden":false,"merged":[]}
[null,{"$f":"'Inputs>>'!B1","v":"AER contribution determination model - 2023–24"},null,null,null,null,null,null,null,"Back to Index"]
[null,"Charts"]
[]
[null,"Output Chart 1 | Contribution Determination by Year and DNSP"]
[]
[]
[]
[]
{"$rows_left_out":439}
{"sheet":"Historical CD by DNSP","index":5,"n_rows":52,"n_cols":23,"rows_kept":52,"cut":false,"hidden":false,"merged":[]}
[null,{"$f":"'Inputs>>'!B1","v":"AER contribution determination model - 2023–24"},null,null,null,null,null,null,null,"Back to Index"]
[null,"Historical Contribution Determination by DNSP"]
[]
[null,"Output Table 9 | Historical Contribution Determination by DNSP",null,null,"Source","Unit",null,null,null,{"$f":"Financial!K14","v":"2022–23"},{"$f":"Financial!L14","v":"2023–24"},{"$f":"Financial!M14","v":"2024–25"},{"$f":"Financial!N14","v":"2025–26"},{"$f":"Financial!O14","v":"2026–27"},{"$f":"Financial!P14","v":"2027–28"},{"$f":"Financial!Q14","v":"2028–29"},{"$f":"Financial!R14","v":"2029–30"},{"$f":"Financial!S14","v":"2030–31"},{"$f":"Financial!T14","v":"2031–32"},null,null,null,"Notes"]
[]
[null,null,"Apportioned Total Costs by DNSP"]
[null,null,"Ausgrid",null,"AER",{"$f":"IF(C7=0,0,revenueunits)","v":"$millions"},null,null,null,null,null,null,null,null,null,null,null,null,null,null,null,null,"Update from Output Table 6"]
[null,null,"Endeavour Energy",null,"AER",{"$f":"IF(C8=0,0,revenueunits)","v":"$millions"},null,null,null,null,null,null,null,null,null,null,null,null,null,null,null,null,"Update from Output Table 6"]
{"$rows_left_out":45}
{"sheet":"Inputs>>","index":6,"n_rows":47,"n_cols":16384,"rows_kept":47,"cut":false,"hidden":false,"merged":[]}
[null,{"$f":"'Contribution model'!G2&\" - \"&'Contribution model'!G3","v":"AER contribution determination model - 2023–24"},null,null,null,"Back to Index"]
[null,"Inputs"]
[]
[null,"Model Index - Inputs "]
[]
[null,null,"Sheet Name","Sheet Description"]
[null,null,"General","Inputs Entity name, Contribution Determination years for t and t+1 and Energy forecasting year for Apportioning"]
[null,null,"Financial","Input Financial Information, Revenues, Expenditure for Contribution Determination"]
{"$rows_left_out":40}
{"sheet":"General","index":7,"n_rows":34,"n_cols":23,"rows_kept":34,"cut":false,"hidden":false,"merged":[]}
[null,{"$f":"'Inputs>>'!B1","v":"AER contribution determination model - 2023–24"},null,null,null,null,null,"Back to Index"]
[null,"General"]
[]
[]
[1,"Input table 1 | General inputs"]
[]
[null,null,"Inputs",null,"Source",null,"Value",null,null,null,null,null,null,null,null,null,null,null,null,null,null,null,"Notes"]
[null,null,"Year ending",null,"AER",null,"2000-06-01",null,null,null,null,null,null,null,null,null,null,null,null,null,null,null,"Fixed at June"]
{"$rows_left_out":27}
{"sheet":"Financial","index":8,"n_rows":75,"n_cols":23,"rows_kept":75,"cut":false,"hidden":false,"merged":[]}
[null,{"$f":"'Inputs>>'!B1","v":"AER contribution determination model - 2023–24"},null,null,null,"All inputs are GST exclusive",null,null,null,"Back to Index"]
[null,"Financial"]
[]
[]
[null,"Input table 3 | Financial information",null,null,"Source","Unit",{"$f":"\"Confidentiality Claimed Re Actuals Up to (\" &General!$E$27 & \") (Actuals)\"","v":"Confidentiality Claimed Re Actuals Up to (2021–22) (Actuals)"},{"$f":"\"Confidentiality Claimed Re Forecast (\" & General!$F$27 & \" and beyond)\"","v":"Confidentiality Claimed Re Forecast (2022–23 and beyond)"},null,{"$f":"INDEX(Lookups!L55:L81,MATCH(L5,Lookups!I55:I81,0)-2)","v":"2021–22"},{"$f":"INDEX(Lookups!L55:L81,MATCH(L5,Lookups!I55:I81,0)-1)","v":"2022–23"},{"$f":"RCD_firstyear","v":"2023–24"},{"$f":"RCD_secondyear","v":"2024–25"},{"$f":"RCD_thirdyear","v":"2025–26"},{"$f":"RCD_fourthyear","v":"2026–27"},{"$f":"RCD_fifthyear","v":"2027–28"},{"$f":"RCD_sixthyear","v":"2028–29"},{"$f":"RCD_seventhyear","v":"2029–30"},{"$f":"RCD_eighthyear","v":"2030–31"},{"$f":"RCD_lastyear","v":"2031–32"},null,null,"Notes"]
[]
[null,null,"Economic Variables"]
[null,null,"Contribution Determination Interest Rate",null,"SFV","Per cent","No","No"]
{"$rows_left_out":68}
{"sheet":"Historical CD Year Financial","index":9,"n_rows":75,"n_cols":23,"rows_kept":75,"cut":false,"hidden":false,"merged":[]}
[null,{"$f":"'Inputs>>'!B1","v":"AER contribution determination model - 2023–24"},null,null,null,"All inputs are GST exclusive",null,null,null,"Back to Index"]
[null,"Financial"]
[]
[]
[null,"Input table 3 | Financial information",null,null,"Source","Unit",{"$f":"\"Confidentiality Claimed Re Actuals Up to (\" &General!$E$27 & \") (Actuals)\"","v":"Confidentiality Claimed Re Actuals Up to (2021–22) (Actuals)"},{"$f":"\"Confidentiality Claimed Re Forecast (\" & General!$F$27 & \" and beyond)\"","v":"Confidentiality Claimed Re Forecast (2022–23 and beyond)"},null,{"$f":"INDEX(Lookups!L55:L81,MATCH(L5,Lookups!I55:I81,0)-2)","v":"2021–22"},{"$f":"INDEX(Lookups!L55:L81,MATCH(L5,Lookups!I55:I81,0)-1)","v":"2022–23"},{"$f":"RCD_firstyear","v":"2023–24"},{"$f":"RCD_secondyear","v":"2024–25"},{"$f":"RCD_thirdyear","v":"2025–26"},{"$f":"RCD_fourthyear","v":"2026–27"},{"$f":"RCD_fifthyear","v":"2027–28"},{"$f":"RCD_sixthyear","v":"2028–29"},{"$f":"RCD_seventhyear","v":"2029–30"},{"$f":"RCD_eighthyear","v":"2030–31"},{"$f":"RCD_lastyear","v":"2031–32"},null,null,"Notes"]
[]
[null,null,"Economic Variables"]
[null,null,"Contribution Determination Interest Rate",null,"SFV","Per cent","No","No"]
{"$rows_left_out":68}
{"sheet":"Energy","index":10,"n_rows":23,"n_cols":23,"rows_kept":23,"cut":false,"hidden":false,"merged":[]}
[null,{"$f":"'Inputs>>'!B1","v":"AER contribution determination model - 2023–24"},null,null,null,null,null,null,null,"Back to Index"]
[null,"Energy"]
[null,{"$f":" \"RIN Year \"&energy_forecastyear","v":"RIN Year 2021–22"}]
[]
[]
[]
[null,"Input table 8 | Annual Volumetric Energy Delivery - DOPED01",null,null,"Source","Unit",null,null,null,{"$f":"INDEX(Lookups!$I$51:$I$81,MATCH(N7,Lookups!$I$51:$I$81,0)-4)","v":"2019–20"},{"$f":"INDEX(Lookups!$I$51:$I$81,MATCH(N7,Lookups!$I$51:$I$81,0)-3)","v":"2020–21"},{"$f":"INDEX(Lookups!$I$51:$I$81,MATCH(N7,Lookups!$I$51:$I$81,0)-2)","v":"2021–22"},{"$f":"INDEX(Lookups!$I$51:$I$81,MATCH(N7,Lookups!$I$51:$I$81,0)-1)","v":"2022–23"},{"$f":"RCD_firstyear","v":"2023–24"},{"$f":"RCD_secondyear","v":"2024–25"},{"$f":"RCD_thirdyear","v":"2025–26"},{"$f":"RCD_fourthyear","v":"2026–27"},{"$f":"RCD_fifthyear","v":"2027–28"},{"$f":"RCD_sixthyear","v":"2028–29"},{"$f":"RCD_seventhyear","v":"2029–30"},{"$f":"RCD_eighthyear","v":"2030–31"},{"$f":"RCD_lastyear","v":"2031–32"},"Notes"]
[]
{"$rows_left_out":16}
{"sheet":"Exemptions","index":11,"n_rows":100,"n_cols":23,"rows_kept":100,"cut":false,"hidden":false,"merged":[]}
[null,{"$f":"'Inputs>>'!B1","v":"AER contribution determination model - 2023–24"},null,null,null,null,null,null,null,"Back to Index"]
[null,"Exemptions"]
[]
[]
[null,"Input table 10 | EITE Exemption Rates",null,null,"Source","Unit",null,null,null,"Value",null,null,null,null,null,null,null,null,null,null,null,null,"Notes"]
[]
[null,null,"Percent of volumetric energy exempted",null,"SFV","Per cent",null,null,null,0.9]
[null,null,"Percent of peak demand exempted",null,"SFV","Per cent",null,null,null,0]
{"$rows_left_out":93}
{"sheet":"Calculations>>","index":12,"n_rows":18,"n_cols":5,"rows_kept":18,"cut":false,"hidden":false,"merged":[]}
[null,{"$f":"'Contribution model'!G2&\" - \"&'Contribution model'!G3","v":"AER contribution determination model - 2023–24"},null,null,"Back to Index"]
[null,"Calculations"]
[]
[null,"Model Index"]
[]
[null,null,"Sheet Name","Sheet Description"]
[null,null,"Contribution Determination Under & Over","Calculates Contribution Determination Unders & Overs and Determination"]
[null,null,"Contribution Determination Itemised","Calculates Contribution Determinations by item and their components"]
{"$rows_left_out":11}
{"sheet":"Contribution Det Under & Over","index":13,"n_rows":25,"n_cols":23,"rows_kept":25,"cut":false,"hidden":false,"merged":[]}
[null,{"$f":"'Calculations>>'!B1","v":"AER contribution determination model - 2023–24"},null,null,null,null,null,null,null,"Back to Index"]
[null,"Contribution Determination Unders & Overs"]
[]
[null,"Calculation table 1 | Contribution Determination Unders & Overs",null,null,"Source","Unit",null,null,null,{"$f":"Financial!J14","v":"2021–22"},{"$f":"Financial!K14","v":"2022–23"},{"$f":"Financial!L14","v":"2023–24"},{"$f":"Financial!M14","v":"2024–25"},{"$f":"Financial!N14","v":"2025–26"},{"$f":"Financial!O14","v":"2026–27"},{"$f":"Financial!P14","v":"2027–28"},{"$f":"Financial!Q14","v":"2028–29"},{"$f":"Financial!R14","v":"2029–30"},{"$f":"Financial!S14","v":"2030–31"},{"$f":"Financial!T14","v":"2031–32"},null,null,"Notes"]
[]
[null,null,"Contribution Determinations Unders & Overs"]
[null,null,"Revised Target Costs",null,"Calculation",{"$f":"IF(C7=0,0,revenueunits)","v":"$millions"},null,null,null,null,{"$f":"'Contribution Det Itemised'!K41","v":0},{"$f":"'Contribution Det Itemised'!L41","v":0},{"$f":"'Contribution Det Itemised'!M41","v":0},{"$f":"'Contribution Det Itemised'!N41","v":0},{"$f":"'Contribution Det Itemised'!O41","v":0},{"$f":"'Contribution Det Itemised'!P41","v":0},{"$f":"'Contribution Det Itemised'!Q41","v":0},{"$f":"'Contribution Det Itemised'!R41","v":0},{"$f":"'Contribution Det Itemised'!S41","v":0},{"$f":"'Contribution Det Itemised'!T41","v":0}]
[null,null,"Balancing adjustment made when year was 't'",null,"Calculation",{"$f":"IF(C8=0,0,revenueunits)","v":"$millions"},null,null,null,null,{"$f":"-K18*(1+K17)^0.5","v":0},0,0,0,0,0,0,0,0,0]
{"$rows_left_out":18}
{"sheet":"Contribution Det Itemised","index":14,"n_rows":57,"n_cols":23,"rows_kept":57,"cut":false,"hidden":false,"merged":[]}
[null,{"$f":"'Calculations>>'!B1","v":"AER contribution determination model - 2023–24"},null,null,null,null,null,null,null,"Back to Index"]
[null,"Contribution Determination Itemised"]
[]
[null,"Calculation table 2 | Revenues & Expenditure Itemised",null,null,"Source","Unit",null,null,null,{"$f":"RCD_minustwo","v":"2021–22"},{"$f":"RCD_minusone","v":"2022–23"},{"$f":"RCD_firstyear","v":"2023–24"},{"$f":"RCD_secondyear","v":"2024–25"},{"$f":"RCD_thirdyear","v":"2025–26"},{"$f":"RCD_fourthyear","v":"2026–27"},{"$f":"RCD_fifthyear","v":"2027–28"},{"$f":"RCD_sixthyear","v":"2028–29"},{"$f":"RCD_seventhyear","v":"2029–30"},{"$f":"RCD_eighthyear","v":"2030–31"},{"$f":"RCD_lastyear","v":"2031–32"},null,null,"Notes"]
[]
[null,null,"Revenues (Excl. Contribution Determinations)"]
[null,null,"LTESA - Generation",null,"'Financial'!",{"$f":"IF(E7=0,0,revenueunits)","v":"$millions"},null,null,null,null,{"$f":"Financial!K23","v":0},{"$f":"Financial!L23","v":0},{"$f":"Financial!M23","v":0},{"$f":"Financial!N23","v":0},{"$f":"Financial!O23","v":0},{"$f":"Financial!P23","v":0},{"$f":"Financial!Q23","v":0},{"$f":"Financial!R23","v":0},{"$f":"Financial!S23","v":0},{"$f":"Financial!T23","v":0}]
[null,null,"LTESA - LDS & Firming",null,"'Financial'!","$millions",null,null,null,null,{"$f":"Financial!K24","v":0},{"$f":"Financial!L24","v":0},{"$f":"Financial!M24","v":0},{"$f":"Financial!N24","v":0},{"$f":"Financial!O24","v":0},{"$f":"Financial!P24","v":0},{"$f":"Financial!Q24","v":0},{"$f":"Financial!R24","v":0},{"$f":"Financial!S24","v":0},{"$f":"Financial!T24","v":0}]
{"$rows_left_out":50}
{"sheet":"Cost Movements","index":15,"n_rows":112,"n_cols":23,"rows_kept":112,"cut":false,"hidden":false,"merged":[]}
[null,{"$f":"'Calculations>>'!B1","v":"AER contribution determination model - 2023–24"},null,null,null,null,null,null,null,"Back to Index"]
[null,"Contribution Determination Itemised"]
[]
[null,"Calculation table 5 | Revenues & Expenditure from Previous Year",null,null,"Source","Unit",null,null,null,{"$f":"RCD_minustwo","v":"2021–22"},{"$f":"RCD_minusone","v":"2022–23"},{"$f":"RCD_firstyear","v":"2023–24"},{"$f":"RCD_secondyear","v":"2024–25"},{"$f":"RCD_thirdyear","v":"2025–26"},{"$f":"RCD_fourthyear","v":"2026–27"},{"$f":"RCD_fifthyear","v":"2027–28"},{"$f":"RCD_sixthyear","v":"2028–29"},{"$f":"RCD_seventhyear","v":"2029–30"},{"$f":"RCD_eighthyear","v":"2030–31"},{"$f":"RCD_lastyear","v":"2031–32"},null,null,"Notes"]
[]
[null,null,"Revenues (Excl. Contribution Determinations)"]
[null,null,"LTESA - Generation",null,"'Historical CD Year Financial'!",{"$f":"IF(C7=0,0,revenueunits)","v":"$millions"},null,null,null,null,{"$f":"'Historical CD Year Financial'!K23","v":0},{"$f":"'Historical CD Year Financial'!L23","v":0},{"$f":"'Historical CD Year Financial'!M23","v":0},{"$f":"'Historical CD Year Financial'!N23","v":0},{"$f":"'Historical CD Year Financial'!O23","v":0},{"$f":"'Historical CD Year Financial'!P23","v":0},{"$f":"'Historical CD Year Financial'!Q23","v":0},{"$f":"'Historical CD Year Financial'!R23","v":0},{"$f":"'Historical CD Year Financial'!S23","v":0},{"$f":"'Historical CD Year Financial'!T23","v":0}]
[null,null,"LTESA - LDS & Firming",null,"'Historical CD Year Financial'!","$millions",null,null,null,null,{"$f":"'Historical CD Year Financial'!K24","v":0},{"$f":"'Historical CD Year Financial'!L24","v":0},{"$f":"'Historical CD Year Financial'!M24","v":0},{"$f":"'Historical CD Year Financial'!N24","v":0},{"$f":"'Historical CD Year Financial'!O24","v":0},{"$f":"'Historical CD Year Financial'!P24","v":0},{"$f":"'Historical CD Year Financial'!Q24","v":0},{"$f":"'Historical CD Year Financial'!R24","v":0},{"$f":"'Historical CD Year Financial'!S24","v":0},{"$f":"'Historical CD Year Financial'!T24","v":0}]
{"$rows_left_out":105}
{"sheet":"Apportion to DNSP","index":16,"n_rows":257,"n_cols":23,"rows_kept":257,"cut":false,"hidden":false,"merged":[]}
[null,{"$f":"'Calculations>>'!B1","v":"AER contribution determination model - 2023–24"},null,null,null,null,null,null,null,"Back to Index"]
[null,"Apportion to DNSP"]
[null,{"$f":" \"RIN Year \"&energy_forecastyear","v":"RIN Year 2021–22"}]
[]
[null,"Calculation table 8 | DNSP Volumetric Energy Apportioning",null,null,"Source","Unit",null,null,null,{"$f":"Energy!J7","v":"2019–20"},{"$f":"Energy!K7","v":"2020–21"},{"$f":"Energy!L7","v":"2021–22"},{"$f":"Energy!M7","v":"2022–23"},{"$f":"Energy!N7","v":"2023–24"},{"$f":"Energy!O7","v":"2024–25"},{"$f":"Energy!P7","v":"2025–26"},{"$f":"Energy!Q7","v":"2026–27"},{"$f":"Energy!R7","v":"2027–28"},{"$f":"Energy!S7","v":"2028–29"},{"$f":"Energy!T7","v":"2029–30"},{"$f":"Energy!U7","v":"2030–31"},{"$f":"Energy!V7","v":"2031–32"},"Notes"]
[]
[null,"Calculation table 8.1 | DNSP Volumetric Energy Delivered",null,null,"Source","Unit",null,null,null,{"$f":"J5","v":"2019–20"},{"$f":"K5","v":"2020–21"},"2021–22","2022–23","2023–24","2024–25","2025–26","2026–27","2027–28","2028–29","2029–30","2030–31","2031–32","Notes"]
[]
{"$rows_left_out":250}
{"sheet":"Cash Flow Model","index":17,"n_rows":73,"n_cols":46,"rows_kept":73,"cut":false,"hidden":false,"merged":[]}
[null,{"$f":"'Calculations>>'!B1","v":"AER contribution determination model - 2023–24"},null,null,null,null,null,null,null,"Back to Index"]
[null,"Cash Flow Model"]
[null,"Illustrative for consultation with SFV - Phasing of Expenditure"]
[]
[null,"Input table 14 | Cash Flow Balance",null,null,null,{"$f":"RCD_minusone","v":"2022–23"},null,null,null,{"$f":"RCD_firstyear","v":"2023–24"},null,null,null,{"$f":"RCD_secondyear","v":"2024–25"},null,null,null,{"$f":"RCD_thirdyear","v":"2025–26"},null,null,null,{"$f":"RCD_fourthyear","v":"2026–27"},null,null,null,{"$f":"RCD_fifthyear","v":"2027–28"},null,null,null,{"$f":"RCD_sixthyear","v":"2028–29"},null,null,null,{"$f":"RCD_seventhyear","v":"2029–30"},null,null,null,{"$f":"RCD_eighthyear","v":"2030–31"},null,null,null,{"$f":"RCD_lastyear","v":"2031–32"},null,null,null,"2032-33"]
[null,null,null,null,null,"Q1","Q2","Q3","Q4","Q1","Q2","Q3","Q4","Q1","Q2","Q3","Q4","Q1","Q2","Q3","Q4","Q1","Q2","Q3","Q4","Q1","Q2","Q3","Q4","Q1","Q2","Q3","Q4","Q1","Q2","Q3","Q4","Q1","Q2","Q3","Q4","Q1","Q2","Q3","Q4","Q1"]
[]
[]
{"$rows_left_out":66}
{"sheet":"Lookups","index":18,"n_rows":116,"n_cols":12,"rows_kept":116,"cut":false,"hidden":false,"merged":[]}
[null,{"$f":"'Contribution model'!G2&\" - \"&'Contribution model'!G3","v":"AER contribution determination model - 2023–24"},null,null,null,null,"Back to Index"]
[null,"Lookups"]
[null,0]
[]
[null,"Unit Denominations"]
[]
[null,null,{"$f":"B5","v":"Unit Denominations"},"Source",null,null,"Ref"]
[null,null,"Cents","AER",null,null,"cents"]
{"$rows_left_out":109}
{"sheet":"Glossary","index":19,"n_rows":37,"n_cols":7,"rows_kept":37,"cut":false,"hidden":false,"merged":[[16,3,16,8],[7,3,7,8],[14,3,14,8],[10,3,10,8],[6,3,6,8],[8,3,8,8],[9,3,9,8],[12,3,12,8],[13,3,13,8],[11,3,11,8],[15,3,15,8],[22,3,22,8],[29,3,29,8],[30,3,30,8],[23,3,23,8],[24,3,24,8],[25,3,25,8],[26,3,26,8],[27,3,27,8],[28,3,28,8],[17,3,17,8],[18,3,18,8],[19,3,19,8],[20,3,20,8],[21,3,21,8]]}
[null,{"$f":"'Contribution model'!G2&\" - \"&'Contribution model'!G3","v":"AER contribution determination model - 2023–24"},null,null,null,null,"Back to Index"]
[null,"Glossary"]
[null,0]
[]
[null,"Glossary"]
[]
[null,null,"Term","Definition or extended form"]
[null,null,"Administration Expenditure","The costs of administering the fund."]
{"$rows_left_out":29}