{"text_format":"1","workbook":"xlsx","n_sheets":16,"sheets":["Contribution model","Outputs>>","Validation","Tables","Historical outputs","Inputs>>","General","Financial","Energy","Exemptions","Calculations>>","Net costs","Adjustments","Apportionment","Lookups","Glossary"],"not_rendered":{"charts":0,"images":0,"macros":1,"external_links":0,"defined_names":31,"comments":0,"pivot_tables":0},"unopened":[],"bounds":{"document_bytes":16777216,"sheet_cells":100000,"rows_first":2000,"rows_last":500,"rows_between":2000,"halvings":0,"cell_chars":16384,"cell_head_chars":4096},"cells_cut":0,"cells_raw":0,"read":"whole","date_system":"1900"}

{"sheet":"Contribution model","index":0,"n_rows":39,"n_cols":9,"rows_kept":39,"cut":false,"hidden":false,"merged":[[35,8,35,9],[14,8,14,9],[9,8,9,9],[10,8,10,9],[11,8,11,9],[13,8,13,9],[12,8,12,9]]}
[]
[null,null,null,null,null,null,"AER contribution determination model"]
[null,null,null,null,null,null,{"$f":"forecastyear","v":"2024–25"}]
[]
[]
[]
[null,"Legend"]
[]
[null,null,"Key:",null,null,null,"Version Record","Date","Description"]
[null,null,null,"Annual SFV input",null,null,"0","2022-05-31","Draft contribution determination model for public consultation"]
{"$rows_left_out":30}
{"sheet":"Outputs>>","index":1,"n_rows":10,"n_cols":6,"rows_kept":10,"cut":false,"hidden":false,"merged":[]}
[null,{"$f":"'Contribution model'!G2&\" - \"&'Contribution model'!G3","v":"AER contribution determination model - 2024–25"},null,null,null,"Back to Index"]
[]
[null,"Output sheets"]
[]
[null,null,"Sheet Name","Sheet Description"]
[null,null,"Validation","Validation checks"]
[null,null,"Tables","Tables of outputs"]
[null,null,"Historical outputs","Historical contribution determination (requires manual update every year)"]
[]
[null,"End"]
{"$rows_left_out":1}
{"sheet":"Validation","index":2,"n_rows":13,"n_cols":23,"rows_kept":13,"cut":false,"hidden":false,"merged":[]}
[null,{"$f":"'Outputs>>'!B1","v":"AER contribution determination model - 2024–25"},null,null,null,null,null,null,null,"Back to Index"]
[null,null,null,null,null,null,null,null,null,null,null,null,null,null,null,null,null,null,null,{"$f":"IF(COUNTIF(T4:T98,\"NOT VALID\")>0,\"NOT VALID\",\"VALID\")","v":"VALID"}]
[]
[null,"Validation check",null,null,null,"Unit",null,null,null,"2023–24","2024–25","2025–26","2026–27","2027–28","2028–29","2029–30","2030–31","2031–32",null,"Compliance",null,null,"Notes"]
[]
[]
[null,{"$f":"Tables!C5","v":"Ausgrid"},null,null,null,"$millions",null,null,null,{"$f":"IF(J$4<forecastyear,'Historical outputs'!K5,Apportionment!L202)","v":0},{"$f":"IF(K$4<forecastyear,'Historical outputs'!L5,Apportionment!M202)","v":""},{"$f":"IF(L$4<forecastyear,'Historical outputs'!M5,Apportionment!N202)","v":""},{"$f":"IF(M$4<forecastyear,'Historical outputs'!N5,Apportionment!O202)","v":""},{"$f":"IF(N$4<forecastyear,'Historical outputs'!O5,Apportionment!P202)","v":""},{"$f":"IF(O$4<forecastyear,'Historical outputs'!P5,Apportionment!Q202)","v":""},{"$f":"IF(P$4<forecastyear,'Historical outputs'!Q5,Apportionment!R202)","v":""},{"$f":"IF(Q$4<forecastyear,'Historical outputs'!R5,Apportionment!S202)","v":""},{"$f":"IF(R$4<forecastyear,'Historical outputs'!S5,Apportionment!T202)","v":""}]
[null,{"$f":"Tables!C6","v":"Endeavour Energy"},null,null,null,"$millions",null,null,null,{"$f":"IF(J$4<forecastyear,'Historical outputs'!K6,Apportionment!L203)","v":0},{"$f":"IF(K$4<forecastyear,'Historical outputs'!L6,Apportionment!M203)","v":""},{"$f":"IF(L$4<forecastyear,'Historical outputs'!M6,Apportionment!N203)","v":""},{"$f":"IF(M$4<forecastyear,'Historical outputs'!N6,Apportionment!O203)","v":""},{"$f":"IF(N$4<forecastyear,'Historical outputs'!O6,Apportionment!P203)","v":""},{"$f":"IF(O$4<forecastyear,'Historical outputs'!P6,Apportionment!Q203)","v":""},{"$f":"IF(P$4<forecastyear,'Historical outputs'!Q6,Apportionment!R203)","v":""},{"$f":"IF(Q$4<forecastyear,'Historical outputs'!R6,Apportionment!S203)","v":""},{"$f":"IF(R$4<forecastyear,'Historical outputs'!S6,Apportionment!T203)","v":""}]
[null,{"$f":"Tables!C7","v":"Essential Energy"},null,null,null,"$millions",null,null,null,{"$f":"IF(J$4<forecastyear,'Historical outputs'!K7,Apportionment!L204)","v":0},{"$f":"IF(K$4<forecastyear,'Historical outputs'!L7,Apportionment!M204)","v":""},{"$f":"IF(L$4<forecastyear,'Historical outputs'!M7,Apportionment!N204)","v":""},{"$f":"IF(M$4<forecastyear,'Historical outputs'!N7,Apportionment!O204)","v":""},{"$f":"IF(N$4<forecastyear,'Historical outputs'!O7,Apportionment!P204)","v":""},{"$f":"IF(O$4<forecastyear,'Historical outputs'!P7,Apportionment!Q204)","v":""},{"$f":"IF(P$4<forecastyear,'Historical outputs'!Q7,Apportionment!R204)","v":""},{"$f":"IF(Q$4<forecastyear,'Historical outputs'!R7,Apportionment!S204)","v":""},{"$f":"IF(R$4<forecastyear,'Historical outputs'!S7,Apportionment!T204)","v":""}]
[null,{"$f":"Adjustments!C24","v":"Contribution determination amount"},null,null,null,"$millions",null,null,null,{"$f":"IF(J$4<forecastyear,'Historical outputs'!K8,Adjustments!L24)","v":0},{"$f":"IF(K$4<forecastyear,'Historical outputs'!L8,Adjustments!M24)","v":0},{"$f":"IF(L$4<forecastyear,'Historical outputs'!M8,Adjustments!N24)","v":0},{"$f":"IF(M$4<forecastyear,'Historical outputs'!N8,Adjustments!O24)","v":0},{"$f":"IF(N$4<forecastyear,'Historical outputs'!O8,Adjustments!P24)","v":0},{"$f":"IF(O$4<forecastyear,'Historical outputs'!P8,Adjustments!Q24)","v":0},{"$f":"IF(P$4<forecastyear,'Historical outputs'!Q8,Adjustments!R24)","v":0},{"$f":"IF(Q$4<forecastyear,'Historical outputs'!R8,Adjustments!S24)","v":0},{"$f":"IF(R$4<forecastyear,'Historical outputs'!S8,Adjustments!T24)","v":0}]
{"$rows_left_out":4}
{"sheet":"Tables","index":3,"n_rows":45,"n_cols":23,"rows_kept":45,"cut":false,"hidden":false,"merged":[]}
[null,{"$f":"'Inputs>>'!B1","v":"AER contribution determination model - 2024–25"},null,null,null,null,null,null,null,"Back to Index"]
[]
[null,"Table 1 | Contribution determination for target year (t)",null,null,null,"Unit",null,null,null,{"$f":"forecastyear","v":"2024–25"},null,null,null,null,null,null,null,null,null,null,null,null,"Notes"]
[]
[null,null,"Ausgrid",null,null,"$millions",null,null,null,{"$f":"INDEX(Apportionment!J202:T202,1,MATCH($J$3,Apportionment!$J$187:$T$187,0))","v":""}]
[null,null,"Endeavour Energy",null,null,"$millions",null,null,null,{"$f":"INDEX(Apportionment!J203:T203,1,MATCH($J$3,Apportionment!$J$187:$T$187,0))","v":""}]
[null,null,"Essential Energy",null,null,"$millions",null,null,null,{"$f":"INDEX(Apportionment!J204:T204,1,MATCH($J$3,Apportionment!$J$187:$T$187,0))","v":""}]
[null,null,"Contribution determination amount",null,null,"$millions",null,null,null,{"$f":"SUM(J5:J7)","v":0}]
[null,null,"Minimum prudent balance allowance",null,null,"$millions",null,null,null,{"$f":"INDEX(Financial!$K$65:$T$65,0,MATCH(Tables!J3,Financial!$K$62:$T$62,0))","v":0}]
[]
{"$rows_left_out":36}
{"sheet":"Historical outputs","index":4,"n_rows":11,"n_cols":23,"rows_kept":11,"cut":false,"hidden":false,"merged":[]}
[null,{"$f":"'Inputs>>'!B1","v":"AER contribution determination model - 2024–25"},null,null,null,null,null,null,null,"Back to Index"]
[]
[null,"Table 1 | Historical gazetted numbers ",null,null,"Source","Unit",null,null,null,{"$f":"Financial!K7","v":"2022–23"},{"$f":"Financial!L7","v":"2023–24"},{"$f":"Financial!M7","v":"2024–25"},{"$f":"Financial!N7","v":"2025–26"},{"$f":"Financial!O7","v":"2026–27"},{"$f":"Financial!P7","v":"2027–28"},{"$f":"Financial!Q7","v":"2028–29"},{"$f":"Financial!R7","v":"2029–30"},{"$f":"Financial!S7","v":"2030–31"},{"$f":"Financial!T7","v":"2031–32"},null,null,null,"Notes"]
[]
[null,null,"Ausgrid",null,"Previous contribution determinations","$millions"]
[null,null,"Endeavour Energy",null,"Previous contribution determinations","$millions"]
[null,null,"Essential Energy",null,"Previous contribution determinations","$millions"]
[null,null,"Contribution determination amount",null,"Previous contribution determinations","$millions"]
[null,null,"Minimum prudent balance allowance",null,"Previous contribution determinations","$millions"]
[]
{"$rows_left_out":2}
{"sheet":"Inputs>>","index":5,"n_rows":11,"n_cols":16384,"rows_kept":11,"cut":false,"hidden":false,"merged":[]}
[null,{"$f":"'Contribution model'!G2&\" - \"&'Contribution model'!G3","v":"AER contribution determination model - 2024–25"},null,null,null,"Back to Index"]
[]
[null,"Input sheets"]
[]
[null,null,"Sheet Name","Sheet Description"]
[null,null,"General","General inputs including target year"]
[null,null,"Financial","Financial inputs including costs and revenues"]
[null,null,"Energy","Annual volumetric energy and annual peak demand for DNSPs"]
[null,null,"Exemptions","Exemptions for emissions intensive trade exposed and green hydrogen"]
[]
{"$rows_left_out":2}
{"sheet":"General","index":6,"n_rows":24,"n_cols":23,"rows_kept":24,"cut":false,"hidden":false,"merged":[]}
[null,{"$f":"'Inputs>>'!B1","v":"AER contribution determination model - 2024–25"},null,null,null,null,null,"Back to Index"]
[]
[1,"Table 1 | General inputs"]
[]
[null,null,"Inputs",null,"Source",null,"Value",null,null,null,null,null,null,null,null,null,null,null,null,null,null,null,"Notes"]
[null,null,"Target year (t)",null,"SFV",null,"2024–25"]
[null,null,"Energy data year to underpin apportionment for target year",null,"Calculated",null,{"$f":"INDEX(Lookups!I39:I65,MATCH(forecastyear,Lookups!I39:I65,0)-2)","v":"2022–23"},null,null,null,null,null,null,null,null,null,null,null,null,null,null,null,"Fixed at t-2"]
[]
[null,null,"Unit for inputs and revenues",null,"AER",null,"$millions"]
[null,null,"Unit for output tables (from revenues)",null,"AER",null,"$millions"]
{"$rows_left_out":15}
{"sheet":"Financial","index":7,"n_rows":67,"n_cols":23,"rows_kept":67,"cut":false,"hidden":false,"merged":[]}
[null,{"$f":"'Inputs>>'!B1","v":"AER contribution determination model - 2024–25"},null,null,null,null,null,null,null,"Back to Index"]
[null,"Financial"]
[null,"Table 1 | Interest rate ",null,null,"Source","Unit",{"$f":"\"Confidentiality claimed re actuals data (\" &General!$E$17 & \")\"","v":"Confidentiality claimed re actuals data (2022–23)"},{"$f":"\"Confidentiality claimed re forecast data (\" & General!$F$17 & \" and beyond)\"","v":"Confidentiality claimed re forecast data (2023–24 and beyond)"},null,"2021–22","2022–23","2023–24","2024–25","2025–26","2026–27","2027–28","2028–29","2029–30","2030–31","2031–32",null,null,"Notes"]
[]
[null,null,"Interest rate",null,"SFV","Per cent","No","No"]
[]
[null,"Table 2 | Revenues",null,null,{"$f":"E3","v":"Source"},"Unit",{"$f":"\"Confidentiality claimed re actuals data (\" &General!$E$17 & \")\"","v":"Confidentiality claimed re actuals data (2022–23)"},{"$f":"\"Confidentiality claimed re forecast data (\" & General!$F$17 & \" and beyond)\"","v":"Confidentiality claimed re forecast data (2023–24 and beyond)"},null,"2021–22","2022–23","2023–24","2024–25","2025–26","2026–27","2027–28","2028–29","2029–30","2030–31","2031–32",null,null,"Notes"]
[]
[null,null,"Contribution determinations"]
[null,null,"Contribution determination actual revenue ",null,"SFV","$millions","No","No",null,null,null,null,null,null,null,null,null,null,null,null,null,null,"Historical amounts prior to forecast year only"]
{"$rows_left_out":58}
{"sheet":"Energy","index":8,"n_rows":19,"n_cols":23,"rows_kept":19,"cut":false,"hidden":false,"merged":[]}
[null,{"$f":"'Inputs>>'!B1","v":"AER contribution determination model - 2024–25"},null,null,null,null,null,null,null,"Back to Index"]
[null,"Energy"]
[null,{"$f":" \"RIN Year \"&energy_forecastyear","v":"RIN Year 2022–23"}]
[]
[null,"Table 1 | Volumetric energy delivered by DNSP - DOPED01",null,null,"Source","Unit",null,null,null,"2021–22","2022–23","2023–24","2024–25","2025–26","2026–27","2027–28","2028–29","2029–30","2030–31","2031–32",null,null,"Notes"]
[]
[null,null,"Ausgrid",null,"DNSPs","GWh"]
[null,null,"Endeavour Energy",null,"DNSPs","GWh"]
[null,null,"Essential Energy",null,"DNSPs","GWh"]
[null,null,"Total ",null,"Calculation","GWh",null,null,null,{"$f":"SUM(J7:J9)","v":0},{"$f":"SUM(K7:K9)","v":0},{"$f":"SUM(L7:L9)","v":0},{"$f":"SUM(M7:M9)","v":0},0,0,0,0,0,0,0]
{"$rows_left_out":10}
{"sheet":"Exemptions","index":9,"n_rows":89,"n_cols":23,"rows_kept":89,"cut":false,"hidden":false,"merged":[]}
[null,{"$f":"'Inputs>>'!B1","v":"AER contribution determination model - 2024–25"},null,null,null,null,null,null,null,"Back to Index"]
[]
[null,"Table 1 | Exemption rates for emissions intensive trade exposed ",null,null,"Source","Unit",null,null,null,"Value",null,null,null,null,null,null,null,null,null,null,null,null,"Notes"]
[]
[null,null,"Per cent of volumetric energy exempted",null,"Regulation","Per cent",null,null,null,0.9]
[]
[null,"Table 2 | Volume of energy delivered to emissions intensive trade exposed entities",null,null,{"$f":"E3","v":"Source"},{"$f":"F3","v":"Unit"},null,null,null,"2021–22","2022–23","2023–24","2024–25","2025–26","2026–27","2027–28","2028–29","2029–30","2030–31","2031–32",null,null,"Notes"]
[null,null,null,null,null,null,null,null,null,null,null,null,null,null,null,null,null,null,null,null,null,null,"Provide full annual consumption of entities "]
[null,null,"DNSP",null,null,null,null,null,null,null,null,null,null,null,null,null,null,null,null,null,null,null,"eligible for exemptions"]
[null,null,"Ausgrid",null,"SFV","GWh"]
{"$rows_left_out":80}
{"sheet":"Calculations>>","index":10,"n_rows":9,"n_cols":5,"rows_kept":9,"cut":false,"hidden":false,"merged":[]}
[null,{"$f":"'Contribution model'!G2&\" - \"&'Contribution model'!G3","v":"AER contribution determination model - 2024–25"},null,null,"Back to Index"]
[]
[null,"Calculation sheets"]
[]
[null,null,"Net costs","Calculates target costs and volumetric component "]
[null,null,"Adjustments","Calculates contribution determination amount including true-up and minimum prudent balance allowance"]
[null,null,"Apportionment","Calculates amounts apportioned to DNSPs"]
[]
[null,"End"]

{"sheet":"Net costs","index":11,"n_rows":39,"n_cols":23,"rows_kept":39,"cut":false,"hidden":false,"merged":[]}
[null,{"$f":"'Calculations>>'!B1","v":"AER contribution determination model - 2024–25"},null,null,null,null,null,null,null,"Back to Index"]
[]
[null,"Table 1 | Summary of revenues and expenditure",null,null,null,"Unit",null,null,null,"2021–22","2022–23","2023–24","2024–25","2025–26","2026–27","2027–28","2028–29","2029–30","2030–31","2031–32",null,null,"Notes"]
[]
[null,null,"Revenue (excluding contribution determinations)"]
[null,null,"LTESA - Generation",null,null,"$millions",null,null,null,null,{"$f":"Financial!K13","v":0},{"$f":"Financial!L13","v":0},{"$f":"Financial!M13","v":0},{"$f":"Financial!N13","v":0},{"$f":"Financial!O13","v":0},{"$f":"Financial!P13","v":0},{"$f":"Financial!Q13","v":0},{"$f":"Financial!R13","v":0},{"$f":"Financial!S13","v":0},{"$f":"Financial!T13","v":0}]
[null,null,"LTESA - LDS & Firming",null,null,"$millions",null,null,null,null,{"$f":"Financial!K14","v":0},{"$f":"Financial!L14","v":0},{"$f":"Financial!M14","v":0},{"$f":"Financial!N14","v":0},{"$f":"Financial!O14","v":0},{"$f":"Financial!P14","v":0},{"$f":"Financial!Q14","v":0},{"$f":"Financial!R14","v":0},{"$f":"Financial!S14","v":0},{"$f":"Financial!T14","v":0}]
[null,null,"Risk management contracts ",null,null,"$millions",null,null,null,null,{"$f":"Financial!K15","v":0},{"$f":"Financial!L15","v":0},{"$f":"Financial!M15","v":0},{"$f":"Financial!N15","v":0},{"$f":"Financial!O15","v":0},{"$f":"Financial!P15","v":0},{"$f":"Financial!Q15","v":0},{"$f":"Financial!R15","v":0},{"$f":"Financial!S15","v":0},{"$f":"Financial!T15","v":0}]
[null,null,"Access fees",null,null,"$millions",null,null,null,null,{"$f":"Financial!K16","v":0},{"$f":"Financial!L16","v":0},{"$f":"Financial!M16","v":0},{"$f":"Financial!N16","v":0},{"$f":"Financial!O16","v":0},{"$f":"Financial!P16","v":0},{"$f":"Financial!Q16","v":0},{"$f":"Financial!R16","v":0},{"$f":"Financial!S16","v":0},{"$f":"Financial!T16","v":0}]
[null,null,"Revenues from investment activities ",null,null,"$millions",null,null,null,null,{"$f":"Financial!K17","v":0},{"$f":"Financial!L17","v":0},{"$f":"Financial!M17","v":0},{"$f":"Financial!N17","v":0},{"$f":"Financial!O17","v":0},{"$f":"Financial!P17","v":0},{"$f":"Financial!Q17","v":0},{"$f":"Financial!R17","v":0},{"$f":"Financial!S17","v":0},{"$f":"Financial!T17","v":0}]
{"$rows_left_out":30}
{"sheet":"Adjustments","index":12,"n_rows":26,"n_cols":23,"rows_kept":26,"cut":false,"hidden":false,"merged":[]}
[null,{"$f":"'Calculations>>'!B1","v":"AER contribution determination model - 2024–25"},null,null,null,null,null,null,null,"Back to Index"]
[]
[null,"Table 1 | True up ",null,null,null,"Unit",null,null,null,{"$f":"Financial!J7","v":"2021–22"},{"$f":"Financial!K7","v":"2022–23"},{"$f":"Financial!L7","v":"2023–24"},{"$f":"Financial!M7","v":"2024–25"},{"$f":"Financial!N7","v":"2025–26"},{"$f":"Financial!O7","v":"2026–27"},{"$f":"Financial!P7","v":"2027–28"},{"$f":"Financial!Q7","v":"2028–29"},{"$f":"Financial!R7","v":"2029–30"},{"$f":"Financial!S7","v":"2030–31"},{"$f":"Financial!T7","v":"2031–32"},null,null,"Notes"]
[]
[null,null,"Contribution determination actual revenue ",null,null,"$millions",null,null,null,null,{"$f":"Financial!K10","v":0},{"$f":"Financial!L10","v":0},{"$f":"Financial!M10","v":0},{"$f":"Financial!N10","v":0},{"$f":"Financial!O10","v":0},{"$f":"Financial!P10","v":0},{"$f":"Financial!Q10","v":0},{"$f":"Financial!R10","v":0},{"$f":"Financial!S10","v":0},{"$f":"Financial!T10","v":0}]
[null,null,"Contribution determination amount (recalculated)",null,null,"$millions",null,null,null,null,{"$f":"SUM(K20:K23)","v":0},{"$f":"SUM(L20:L23)","v":0},0,0,0,0,0,0,0,0]
[null,null,"Net under/over-recovery ",null,null,"$millions",null,null,null,null,{"$f":"IF(K3<forecastyear,K5-K6,K24-K6)","v":0},0,0,0,0,0,0,0,0,0]
[]
[null,null,"Interest rate applicable to balance",null,null,"Per cent",null,null,null,null,{"$f":"Financial!K5","v":0},{"$f":"Financial!L5","v":0},{"$f":"Financial!M5","v":0},{"$f":"Financial!N5","v":0},{"$f":"Financial!O5","v":0},{"$f":"Financial!P5","v":0},{"$f":"Financial!Q5","v":0},{"$f":"Financial!R5","v":0},{"$f":"Financial!S5","v":0},{"$f":"Financial!T5","v":0}]
[]
{"$rows_left_out":17}
{"sheet":"Apportionment","index":13,"n_rows":219,"n_cols":23,"rows_kept":219,"cut":false,"hidden":false,"merged":[]}
[null,{"$f":"'Calculations>>'!B1","v":"AER contribution determination model - 2024–25"},null,null,null,null,null,null,null,"Back to Index"]
[]
[null,"Table 1 | Exemptions and apportionment rates for volumetric energy component",null,null,null,"Unit",null,null,null,"2021–22","2022–23","2023–24","2024–25","2025–26","2026–27","2027–28","2028–29","2029–30","2030–31","2031–32",null,null,"Notes"]
[]
[null,"Table 1.1 | Overall volumetric energy delivered",null,null,null,"Unit",null,null,null,"2021–22","2022–23","2023–24","2024–25","2025–26","2026–27","2027–28","2028–29","2029–30","2030–31","2031–32",null,null,"Notes"]
[]
[null,null,"Ausgrid",null,null,"GWh",null,null,null,{"$f":"Energy!J7","v":0},null,{"$f":"Energy!L7","v":0},{"$f":"Energy!M7","v":0},{"$f":"Energy!N7","v":0},{"$f":"Energy!O7","v":0},{"$f":"Energy!P7","v":0},{"$f":"Energy!Q7","v":0},{"$f":"Energy!R7","v":0},{"$f":"Energy!S7","v":0},{"$f":"Energy!T7","v":0}]
[null,null,"Endeavour Energy",null,null,"GWh",null,null,null,{"$f":"Energy!J8","v":0},{"$f":"Energy!K8","v":0},{"$f":"Energy!L8","v":0},{"$f":"Energy!M8","v":0},{"$f":"Energy!N8","v":0},{"$f":"Energy!O8","v":0},{"$f":"Energy!P8","v":0},{"$f":"Energy!Q8","v":0},{"$f":"Energy!R8","v":0},{"$f":"Energy!S8","v":0},{"$f":"Energy!T8","v":0}]
[null,null,"Essential Energy",null,null,"GWh",null,null,null,{"$f":"Energy!J9","v":0},{"$f":"Energy!K9","v":0},{"$f":"Energy!L9","v":0},{"$f":"Energy!M9","v":0},{"$f":"Energy!N9","v":0},{"$f":"Energy!O9","v":0},{"$f":"Energy!P9","v":0},{"$f":"Energy!Q9","v":0},{"$f":"Energy!R9","v":0},{"$f":"Energy!S9","v":0},{"$f":"Energy!T9","v":0}]
[null,null,"Total",null,null,"GWh",null,null,null,{"$f":"Energy!J10","v":0},{"$f":"Energy!K10","v":0},{"$f":"Energy!L10","v":0},{"$f":"Energy!M10","v":0},{"$f":"Energy!N10","v":0},{"$f":"Energy!O10","v":0},{"$f":"Energy!P10","v":0},{"$f":"Energy!Q10","v":0},{"$f":"Energy!R10","v":0},{"$f":"Energy!S10","v":0},{"$f":"Energy!T10","v":0}]
{"$rows_left_out":210}
{"sheet":"Lookups","index":14,"n_rows":68,"n_cols":9,"rows_kept":68,"cut":false,"hidden":false,"merged":[]}
[null,{"$f":"'Contribution model'!G2&\" - \"&'Contribution model'!G3","v":"AER contribution determination model - 2024–25"},null,null,null,null,"Back to Index"]
[null,"Lookups"]
[null,0]
[]
[null,"Unit Denominations"]
[]
[null,null,{"$f":"B5","v":"Unit Denominations"},"Source",null,null,"Ref"]
[null,null,"Cents","AER",null,null,"cents"]
[null,null,"Dollars","AER",null,null,"$dollars"]
[null,null,"Thousands","AER",null,null,"$000"]
{"$rows_left_out":59}
{"sheet":"Glossary","index":15,"n_rows":37,"n_cols":7,"rows_kept":37,"cut":false,"hidden":false,"merged":[[16,3,16,8],[7,3,7,8],[14,3,14,8],[10,3,10,8],[6,3,6,8],[8,3,8,8],[9,3,9,8],[12,3,12,8],[13,3,13,8],[11,3,11,8],[15,3,15,8],[22,3,22,8],[29,3,29,8],[30,3,30,8],[23,3,23,8],[24,3,24,8],[25,3,25,8],[26,3,26,8],[27,3,27,8],[28,3,28,8],[17,3,17,8],[18,3,18,8],[19,3,19,8],[20,3,20,8],[21,3,21,8]]}
[null,{"$f":"'Contribution model'!G2&\" - \"&'Contribution model'!G3","v":"AER contribution determination model - 2024–25"},null,null,null,null,"Back to Index"]
[null,"Glossary"]
[null,0]
[]
[null,"Glossary"]
[]
[null,null,"Term","Definition or extended form"]
[null,null,"Administration Expenditure","The costs of administering the fund."]
[null,null,"AER","Australian Energy Regulator"]
[null,null,"Consumer Trustee","A person or body authorised under section 60 of the EII Act to exercise the functions of the Consumer Trustee. The Consumer Trustee is required to act independently and in the long-term financial interests of NSW electricity consumers. AEMO Services Ltd has been appointed to undertake this role."]
{"$rows_left_out":27}