{"text_format":"1","workbook":"xlsx","n_sheets":18,"sheets":["NOTES","Formulae","Model update","2018 Unmetered supply","Metering","Prop2018DistTar","2018DistRevCapForm","2018DistTarRebalCont","Est2017DistRev","Prop2018TransTar","Est2017TransRev","2018TransRevCont","TUoS cost audit template","Prop2018JSTar","Est2017JSRev","2018JSRevCont","JS cost audit template","Prop2018TSSComp"],"not_rendered":{"charts":0,"images":44,"macros":0,"external_links":0,"defined_names":6,"comments":11,"pivot_tables":0},"unopened":[],"bounds":{"document_bytes":16777216,"sheet_cells":100000,"rows_first":2000,"rows_last":500,"rows_between":2000,"halvings":0,"cell_chars":16384,"cell_head_chars":4096},"cells_cut":0,"cells_raw":0,"read":"whole","date_system":"1900"}

{"sheet":"NOTES","index":0,"n_rows":35,"n_cols":4,"rows_kept":35,"cut":false,"hidden":false,"merged":[]}
[]
["The model has actual and test data to illustrate the workings of the model."]
[]
["Issue","Location","Item","Comment"]
[1,"Model update'!F37:F41","Real Vanilla WACC (rvw)","Values require updating"]
[]
[2,"Model update'!F54:F58","DuoS Xt for2018","Values require updating"]
[]
[3,"Model update'!F66:F70","Metering Xt for2018","Values require updating"]
[]
[4,"Model update'!F94:F98","Ifactor (t) 2018","Values require updating"]
[]
[5,"Model update'!F105:F109","S factor (t) 2018","Values are placeholders - may require updating"]
[]
[6,"Model update'!F127:F131","Licence Fee (t-1) 2017","Values require updating"]
[]
[7,"The following is test data to illustrate the workings of the model.",null,"Input data required from DNSPs"]
[null,"2018 Unmetered supply'!G7:I7","Proposed 2018 Unmetered Supply Tariffs"]
[null,"2018 Unmetered supply'!K7:M7","Qt-2 (2016)"]
[]
[null,"Metering!D8:D11","Proposed Metering Tariffs P(t) for 2018"]
[null,"Metering!F8:F11","Forecast Quantities   (Qt) for 2018"]
[null,"Metering!D80:D83","Estimated Quantities   (Qt-1) for 2017"]
[]
[null,"Prop2018DistTar!D6:P30","Proposed Distribution Tariffs (Pt) for 2018"]
[null,"Prop2018DistTar!AF6:AR30","Forecast Quantities (Qt) for 2018"]
[null,"Est2017DistRev!R6:AD30"," Estimated Distribution Quantities for 2017 (Qt-1)"]
[]
[null,"Prop2018TransTar!D6:P30","Proposed Transmission Tariffs (Pt) for 2018"]
[null,"2018TransRevCont'!C20:C23","Table 3 - Transmission charges for year t"]
[null,"2018TransRevCont'!D42:D45","Transmission charges for year t-1"]
[]
[null,"Prop2018JSTar!D6:P30","Proposed Jurisdictional scheme Tariffs (Pt) for 2018"]
[null,"2018JSRevCont'!C20:C21","Table 3 - PFIT & TFIT charges for year t"]
[null,"2018JSRevCont'!D40:D41","PFIT & TFIT charges for year t-1"]

{"sheet":"Formulae","index":1,"n_rows":239,"n_cols":11,"rows_kept":239,"cut":false,"hidden":false,"merged":[[83,7,84,7],[113,7,114,7],[139,7,140,7],[220,7,221,7]]}
[]
[null,"DUoS"]
[null,"Figure 14.1 Revenue cap formulae"]
[null,"(1)   ",null,null,null,null,null,"i=1,..,n and j=1,..,m and t=1,..,5"]
[null,"(2)   ",null,null,null,null,null,"t = 1,2,…,5"]
[null,"(3)   ",null,null,null,null,null,"t = 1"]
[null,"(4)   ",null,null,null,null,null,"t = 2,…,5"]
[]
[null,"where;"]
[null,null," is the total annual revenue in year t."]
[null,null,null,"is the price of component 'j' of tariff 'i' in year t."]
[null,null,null,"is the forecast quantity of component 'j' of tariff 'i' in year t."]
[null," ","is the adjusted annual smoothed revenue requirement for year t."]
[null," ",null,"is the annual adjustment f–factor scheme amount in year t. This amount will be calculated as per the method set out in the relevant f–factor scheme."]
[null,null,null,"is the sum of:"]
[null,"·        the final carryover amount from the application of the DMIS from the 2011–15 regulatory control period. This amount will be calculated using the method set out in the DMIS and will be deducted from/added to allowed revenue in the 2017 pricing Proposal."]
[null,null,null,"is the sum of:"]
[null,"·        the recovery of license fee charges by the Victorian Essential Services Commission indexed by one and a half years of interest, calculated using the following method:"]
[]
[null,"where:"]
[null,null," are the licence fees paid by DNSP to the Victorian Essential Services Commission in the financial year ending in June of regulatory year t–1,"]
[null,null,"is the approved nominal weighted average cost of capital  (WACC) for the relevant regulatory year using the following method:"]
[]
[]
[null,"·        any under or over recovery of actual revenue collected through DUoS charges in regulatory year t–2 as calculated using the method in appendix A,"]
[null,"·        the AER approved pass through amounts (positive or negative) with respect to regulatory year t."]
[null,null,"is the annual smoothed revenue requirement as stated in the Post Tax Revenue Model (PTRM) for year t (when year t is the first year of the 2016–20 regulatory control period).[43]"]
[null," ","is the s‑factor determined in accordance with the service target performance incentive scheme (STPIS) for regulatory year t.[44]"]
[null,null," is the annual percentage change in the ABS CPI All Groups, Weighted Average of Eight Capital Cities[45] from the June quarter in year t–2 to the June quarter in year t–1, calculated using the following method :"]
[null,"The ABS CPI All Groups, Weighted Average of Eight Capital Cities for the June quarter in regulatory year t–1"]
[null,"divided by"]
[null,"The ABS CPI All Groups, Weighted Average of Eight Capital Cities for the June quarter in regulatory year t–2"]
[null,"minus one."]
[null,"For example, for the 2017 regulatory year, t–2 is June quarter 2015 and t–1 is June quarter 2016 and for the 2018 regulatory year, t–2 is June quarter 2016 and t–1 is June quarter 2017 and so on."]
[null," ","is the X factor for each year of the 2016–20 regulatory control period as determined in the PTRM, and annually revised for the return on debt update in accordance with the formula specified in attachment 3—rate of return—calculated for the relevant year."]
[]
[]
[null,"[43] ","Our final F&A stated that if necessary an adjustment for inflation may be required to the annual smoothed revenue requirement for year t. However, as the annual smoothed revenue requirement for year t as stated in our preliminary decision PTRM is in nominal dollars there is no need to adjust it for inflation. This approach is consistent with past regulatory practice."]
[null,"[44] ","For the first two regulatory years of the 2016–20 regulatory control period, the value of St is to be adjusted to account for the change in revenue requirements between the regulatory control periods, as explained in attachment 11. In the formulas in the STPIS, the AR(t+1) is equivalent to ARt in this formula. Calculations of the S factor adjustment are to be made accordingly."]
[null,"[45] ","If the ABS does not or ceases to publish the index, then CPI will mean an index which the AER considers is the best available alternative index"]
[]
[]
[]
[null,"Figure 14.2 Side constraints [46]"]
[]
[]
[]
[]
[]
[null,null,"where each tariff class has \"n\" tariffs, with each up to \"m\" components, and where:"]
[null,null,null,"is the Proposed price for component ‘j’ of tariff 'i' for year t."]
[null,null,"is the price charged for component ‘j’ of tariff 'i' in year t–1."]
[null,null,null,"is the forecast quantity of component ‘j’ of tariff 'i' in year t."]
[null,null," is the annual percentage change in the ABS CPI All Groups, Weighted Average of Eight Capital Cities[4] from the June quarter in year t–2 to the June quarter in year t–1, calculated using the following method :"]
[null,null,"The ABS CPI All Groups, Weighted Average of Eight Capital Cities[47] for the June quarter in regulatory year t–1"]
[null,null,"divided by"]
[null,null,"The ABS CPI All Groups, Weighted Average of Eight Capital Cities for the June quarter in regulatory year t–2"]
[null,null,"minus one."]
[null,"For example, for the 2017 regulatory year, t–2 is June quarter 2015 and t–1 is June quarter 2016 and for the 2018 regulatory year, t–2 is June quarter 2016 and t–1 is June quarter 2017 and so on."]
[null,null,null,"is the X factor for each year of the 2016–20 regulatory control period as determined in the PTRM, and annually revised for the return on debt update in accordance with the formula specified in attachment 3—rate of return—calculated for the relevant year. If X>0, then X will be set equal to zero for the purposes of the side constraint formula."]
[null," ","is the s‑factor determined in accordance with the STPIS for regulatory year t.[5]"]
[null,null,null,"is the annual percentage change from the f–factor scheme amount in year t. This amount will be calculated as per the method set out in attachment 19—f–factor scheme."]
[null,null,null,"is the annual percentage change from the final carryover amount from the application of the DMIS from the 2011–15 regulatory control period. This amount will be calculated using the method set out in the DMIS and will be deducted from/added to allowed revenue in the 2017 pricing Proposal."]
[null,null,null,"is annual percentage change from the sum of:"]
[null,"·        the recovery of license fee charges by the Victorian Essential Services Commission indexed by one and a half years of interest, calculated using the following method:"]
[]
[null,"where:"]
[null," are the licence fees paid byDNSP to the Victorian Essential Services Commission in the financial year ending in June of regulatory year t–1,"]
[null," ","is the approved nominal weighted average cost of capital (WACC) for the relevant regulatory year using the following method:"]
[]
[]
[null,"where the "]
[null," is as set out in our final decision PTRM and updated annually"]
[null,"·        the AER approved pass through amounts (positive or negative) with respect to regulatory year t."]
[null,"With the exception of the CPI, X factor and S factor, the percentage for each of the other factors above can be calculated by dividing the incremental revenues (as used in the total annual revenue formula) for each factor by the expected revenues for regulatory year t–1 (based on the prices in year t–1 multiplied by the forecast quantities for year t)."]
[]
[null,"[46] ","All parameters are in nominal terms unless otherwise specified."]
[null,"[47] ","If the ABS does not or ceases to publish the index, then CPI will mean an index which the AER considers is the best available alternative index."]
[]
[]
[]
[]
[null,null,null,null,null,null,null,"Table 14.1","Example calculation of DUoS unders and overs account ($'000, nominal)"]
[null,null,null,null,null,null,null,null,"Year t–2","Year t–1","Year t"]
[null,null,null,null,null,null,null,null,"(actual)","(estimate)","(forecast)"]
[null,null,null,null,null,null,null,"(A) Revenue from DUoS charges","46 779","40 269","39 510"]
[null,null,null,null,null,null,null,"(B) Less TAR for regulatory year =","43 039","41 427","44 429"]
[null,null,null,null,null,null,null,"+ Adjusted annual smoothed revenues (AARt)","40 189","41 393","44 393"]
[null,null,null,null,null,null,null,"+ f–factor scheme amount (It)  ","–12",10,14]
[null,null,null,null,null,null,null,"+ DMIS carryover amount (Tt) ",1013,0,0]
[null,null,null,null,null,null,null,"+ Annual adjustments (Bt)a =","1849",24,22]
[null,null,null,null,null,null,null,"+ License fee recovery",25,24,22]
[null,null,null,null,null,null,null,"+ Approved pass through amounts",1824,0,0]
[]
[null,null,null,null,null,null,null,"(A minus B) Under/over recovery of revenue for regulatory year",3740,"–1158","–4919b"]
[]
[null,null,null,null,null,null,null,"DUoS unders and overs account"]
[null,null,null,null,null,null,null,"Nominal WACC (per cent)",0.05,5.5E-2,0.06]
[null,null,null,null,null,null,null,"Opening balance",1737,"5656c",4778]
[null,null,null,null,null,null,null,"Interest on opening balance",87,311,287]
[null,null,null,null,null,null,null,"Under/over recovery of revenue for regulatory year",3740,"–1158","–4919b"]
[null,null,null,null,null,null,null,"Interest on under/over recovery for regulatory year",92,"–31","–145"]
[null,null,null,null,null,null,null,"Closing balance",5656,4778,"0d"]
[null,null,null,null,null,null,"Notes:","(a) Bt parameter calculations in the DUoS unders and overs account exclude approved DUoS revenue under/over recovery for regulatory year."]
[null,null,null,null,null,null,null,"(b) Approved DUoS revenue under/over recovery for regulatory year t."]
[null,null,null,null,null,null,null,"(c) Opening balance is the previous year's closing balance."]
[null,null,null,null,null,null,null,"(d) The DNSP is expected to achieve a closing balance as close to zero as practicable in its DUoS unders and overs account in each forecast year in its annual pricing Proposals in the 2016–20 regulatory control period."]
[]
[]
[]
[]
[]
[null,null,null,null,null,null,null,"Table 14.2","Example calculation of designated pricing Proposal charges unders and overs account ($'000, nominal)"]
[null,null,null,null,null,null,null,null,"Year t–2","Year t–1","Year t"]
[null,null,null,null,null,null,null,null,"(actual)","(estimate)","(forecast)"]
[null,null,null,null,null,null,null,"(A) Revenue from designated pricing Proposal charges (DPPC)","40 077","34 944","36 609"]
[null,null,null,null,null,null,null,"(B) Less DPPC related payments for regulatory year =","34 365","38 734","39 200"]
[null,null,null,null,null,null,null,"+ DPPC charges to be paid to TNSP","33 672","37 933","38 000"]
[null,null,null,null,null,null,null,"+ Avoided TUoS/DPPC payments",572,734,800]
[null,null,null,null,null,null,null,"+ Inter–distributor payments",121,67,400]
[]
[null,null,null,null,null,null,null,"(A minus B) Under/over recovery of revenue for regulatory year",5712,"–3790","–2540a"]
[]
[null,null,null,null,null,null,null,"DPPC unders and overs account"]
[null,null,null,null,null,null,null,"Nominal WACC (per cent)",0.05,5.5E-2,0.06]
[null,null,null,null,null,null,null,"Opening balance",167,"6028b",2467]
[null,null,null,null,null,null,null,"Interest on opening balance",8,332,148]
[null,null,null,null,null,null,null,"Under/over recovery of revenue for regulatory year",5712,"–3790","–2540a"]
[null,null,null,null,null,null,null,"Interest on under/over recovery for regulatory year",141,"–103","–75"]
[null,null,null,null,null,null,null,"Closing balance",6028,2467,"0c"]
[null,null,null,null,null,null,"Notes:","(a) Approved DPPC revenue under/over recovery for regulatory year t."]
[null,null,null,null,null,null,null,"(b) Opening balance is the previous year's closing balance."]
[null,null,null,null,null,null,null,"(c)The DNSP is expected to achieve a closing balance as close to zero as practicable in its DPPC unders and overs account in each forecast year in its annual pricing Proposals in the 2016–20 regulatory control period."]
[]
[]
[]
[]
[]
[null,null,null,null,null,null,null,"Table 14.3 Example calculation of jurisdictional scheme amounts unders and overs account ($'000, nominal)"]
[null,null,null,null,null,null,null,null,"Year t–2","Year t–1","Year t"]
[null,null,null,null,null,null,null,null,"(actual)","(estimate)","(forecast)"]
[null,null,null,null,null,null,null,"(A) Revenue from jurisdictional schemes","19 777","23 121","26 965"]
[null,null,null,null,null,null,null,"(B) Less jurisdictional scheme payments for regulatory year =","20 272","20 959","28 641"]
[null,null,null,null,null,null,null,"+ Jurisdictional scheme 1 payments","14 159","13 954","13 961"]
[null,null,null,null,null,null,null,"+ Jurisdictional scheme 2 payments","6113",7005,"14 680"]
[]
[null,null,null,null,null,null,null,"(A minus B) Under/over recovery of revenue for regulatory year","–495",2162,"–1676a"]
[]
[null,null,null,null,null,null,null,"Jurisdictional scheme amount unders and overs account"]
[null,null,null,null,null,null,null,"Nominal WACC (per cent)",0.05,5.5E-2,0.06]
[null,null,null,null,null,null,null,"Opening balance","–52","–562b",1628]
[null,null,null,null,null,null,null,"Interest on opening balance","–3","–31",98]
[null,null,null,null,null,null,null,"Under/over recovery of revenue for regulatory year","–495",2162,"–1676a"]
[null,null,null,null,null,null,null,"Interest on under/over recovery for regulatory year","–12",59,"–50"]
[null,null,null,null,null,null,null,"Closing balance","–562",1628,"0c"]
[null,null,null,null,null,null,"Notes:","(a) Approved jurisdictional scheme amounts revenue under/over recovery for regulatory year t."]
[null,null,null,null,null,null,null,"(b) Opening balance is the previous year's closing balance."]
[null,null,null,null,null,null,null,"(c) The DNSP is expected to achieve a closing balance as close to zero as practicable in its jurisdictional scheme amount unders and overs account in each forecast year in its annual pricing Proposals in the 2016–20 regulatory control period."]
[]
[]
[]
[]
[]
[]
[]
[null,"Metering"]
[null,"Figure 16.3","Annual metering charges revenue cap formula"]
["(1)   ",null,null,null,null,null,null,"i=1,..,n and j=1,..,m and t=1,..,5"]
[]
["(2)   ",null,null,null,null,null,null,"t = 1,2,…,5"]
[]
["(3)   ",null,null,null,null,null,null,"t = 1,2,…,5"]
[]
[]
[null,"where;"]
[null," ","is the total annual revenue for annual metering charges in year t."]
[null,null,null,null,"is the price of component 'j' of metering service 'i' in year t."]
[null,null,null,null,"is the forecast quantity of component 'j' of metering service 'i' in year t."]
[null,null,null,"is the annual revenue requirement for year t. When year t is the first year of the 2016–20 regulatory control period,"]
[null,null,null," is the annual revenue requirement in the annual metering charges Post Tax Revenue Model (PTRM) for year t."]
[null,null,null,null,"is equal to zero for all years except 2017 and is a once off adjustment to 2017 charges for the unders and overs recoveries relating to Advanced Metering Infrastructure actual revenues and actual costs incurred in 2014 and 2015."]
[null,null,null,null,"is the sum of annual adjustment factors in year t as calculated in the unders and overs account in appendix C."]
[]
[null,null,null,"is the annual revenue requirement for year t–1."]
[null," ","is the annual percentage change in the ABS CPI All Groups, Weighted Average of Eight Capital Cities[39] from the June quarter in year t–2 to the June quarter in year t–1, calculated using the following method:"]
[null,"The ABS CPI All Groups, Weighted Average of Eight Capital Cities for the June quarter in regulatory year t–1"]
[null,"divided by"]
[null,"The ABS CPI All Groups, Weighted Average of Eight Capital Cities for the June quarter in regulatory year t–2"]
[null,"minus one."]
[null,"For example, for the 2017 regulatory year, t–2 is June quarter 2015 and t–1 is June quarter 2016 and for the 2018 regulatory year, t–2 is June quarter 2016 and t–1 is June quarter 2017 and so on."]
[null," ",null,"is the X factor for each year of the 2016–20 regulatory control period as determined in the annual metering charges PTRM."]
[]
[]
[null,"[39] ","If the ABS does not or ceases to publish the index, then CPI will mean an index which the AER considers is the best available alternative index"]
[]
[]
[]
[]
[null,"Figure 16.4 Side constraints"]
[]
[null,"where:"]
[null,null,null,null,"is the price of annual metering charges service 'i' in year t."]
[null,null,null,"is the price of annual metering charges service 'i' in year t–1."]
[null," ","is the annual percentage change in the ABS CPI All Groups, Weighted Average of Eight Capital Cities from the June quarter in year t–2 to the June quarter in year t–1, calculated using the following method:"]
[null,"The ABS CPI All Groups, Weighted Average of Eight Capital Cities[40] for the June quarter in regulatory year t–1"]
[null,"divided by"]
[null,"The ABS CPI All Groups, Weighted Average of Eight Capital Cities for the June quarter in regulatory year t–2"]
[null,"minus one."]
[null,"For example, for the 2017 regulatory year, t–2 is June quarter 2015 and t–1 is June quarter 2016 and for the 2018 regulatory year, t–2 is June quarter 2016 and t–1 is June quarter 2017 and so on."]
[null," ",null,"is the X factor for each year of the 2016–20 regulatory control period as determined in the annual metering charges PTRM."]
[null,null,null,null,"is the annual percentage change for the unders and overs recoveries relating to Advanced Metering Infrastructure actual revenues and actual costs incurred in 2014 and 2015. It is equal to zero for all years except 2017 and is a once off adjustment to 2017 charges."]
[null,null,null,null,"is the annual percentage change from the sum of annual adjustment factors in year t as calculated in the unders and overs account in appendix C."]
[null,"With the exception of the CPI and the X factor, the percentage for each of the other factors above can be calculated by dividing the incremental revenues (as used in the total annual revenue formula) for each factor by the expected revenues for regulatory year t–1 (based on the prices in year t–1 multiplied by the forecast quantities for year t)."]
[]
[null,"[40] ","If the ABS does not or ceases to publish the index, then CPI will mean an index which the AER considers is the best available alternative index."]
[]
[]
[]
[]
[null,null,null,null,null,null,null,"Table 16.xx","Example calculation of annual metering charges unders and overs account ($'000, nominal)"]
[null,null,null,null,null,null,null,null,"Year t–2","Year t–1","Year t"]
[null,null,null,null,null,null,null,null,"(actual)","(estimate)","(forecast)"]
[null,null,null,null,null,null,null,"(A) Revenue from annual metering charges","8 449","7 389","6 460"]
[null,null,null,null,null,null,null,"(B) Less TARM for regulatory year =","7 366","7 422","7 573"]
[null,null,null,null,null,null,null,"+ Annual revenue requirement (ARt)","7 349","7 412","7 559"]
[null,null,null,null,null,null,null,"+ T factor (Tt) – true‑ups relating to the AMI–Order in Council  ","17",10,14]
[]
[null,null,null,null,null,null,null,"(A minus B) Under/over recovery of revenue for regulatory year","1 083","–33","–1 113a"]
[]
[null,null,null,null,null,null,null,"Annual metering charges unders and overs account"]
[null,null,null,null,null,null,null,"Nominal WACC (per cent)",0.05,5.5E-2,0.06]
[null,null,null,null,null,null,null,"Opening balance","–50","1 057b","1 081"]
[null,null,null,null,null,null,null,"Interest on opening balance","–3",58,65]
[null,null,null,null,null,null,null,"Under/over recovery of revenue for regulatory year","1 083","–33","–1 113b"]
[null,null,null,null,null,null,null,"Interest on under/over recovery for regulatory year",27,"–1","–33"]
[null,null,null,null,null,null,null,"Closing balance","1 057","1 081","0c"]
[null,null,null,null,null,null,"Notes:","(a) Approved annual metering charges revenue under/over recovery for regulatory year t. This is the Bt parameter in the annual metering charges revenue cap formula."]
[null,null,null,null,null,null,null,"(b) Opening balance is the previous year's closing balance."]
[null,null,null,null,null,null,null,"(c) The DNSP is expected to achieve a closing balance as close to zero as practicable in its annual metering charges unders and overs account in each forecast year in its annual pricing Proposals in the 2016–20 regulatory control period."]

{"sheet":"Model update","index":2,"n_rows":292,"n_cols":14,"rows_kept":292,"cut":false,"hidden":false,"merged":[]}
[]
[]
["Tariff Approval Template for ",null,{"$f":"A58","v":"United Energy"}]
[]
["calendar year commencing",null,2018]
[]
["t","=",{"$f":"C5","v":2018}]
["t-1","=",{"$f":"C7-1","v":2017}]
["t-2","=",{"$f":"C8-1","v":2016}]
["t-3","=",{"$f":"C9-1","v":2015}]
["t-4","=",{"$f":"C10-1","v":2014}]
[]
["Please fill in yellow highlighted cells where appropriate"]
[]
["CPI","The ABS changed the index reference base in September 2012 from 1989-90 to 2011-12."]
["CPI Index Sept 2011",null,99.8]
["CPI Index Sept 2012",null,101.8,null,"CPI 2013",{"$f":"C17/C16-1","v":2.0040080160320661E-2}]
["CPI Index Sept 2013",null,104,null,"CPI 2014",{"$f":"C18/C17-1","v":2.16110019646365E-2}]
["CPI Index Sept 2014",null,106.4,null,"CPI 2015",{"$f":"C19/C18-1","v":2.3076923076923217E-2}]
["CPI Index Sept 2015",null,108,null,"CPI 2016",{"$f":"C20/C19-1","v":1.5037593984962294E-2}]
["CPI Index June 2015",null,107.5]
["CPI Index June 2016",null,108.6,null,"CPI 2017",{"$f":"IF(OR(C21=\"\",C22=\"\"),0,C22/C21-1)","v":1.0232558139534831E-2}]
["CPI Index June 2017",null,110.7,null,"CPI 2018",{"$f":"IF(OR(C22=\"\",C23=\"\"),0,C23/C22-1)","v":1.9337016574585641E-2}]
["CPI Index June 2018",null,null,null,"CPI 2019",{"$f":"IF(OR(C23=\"\",C24=\"\"),0,C24/C23-1)","v":0}]
["CPI Index June 2019",null,null,null,"CPI 2020",{"$f":"IF(OR(C24=\"\",C25=\"\"),0,C25/C24-1)","v":0}]
[]
[]
[{"$f":"\"CPI \" &$C$9","v":"CPI 2016"},null,{"$f":"VLOOKUP(A28,E$17:F$25,2,FALSE)","v":1.5037593984962294E-2},"(t-2)"]
[{"$f":"\"CPI \" &$C$8","v":"CPI 2017"},null,{"$f":"VLOOKUP(A29,E$17:F$25,2,FALSE)","v":1.0232558139534831E-2},"(t-1)"]
[{"$f":"\"CPI \" &$C$5","v":"CPI 2018"},null,{"$f":"VLOOKUP(A30,E$17:F$25,2,FALSE)","v":1.9337016574585641E-2},"(t)"]
[]
[]
[]
[]
["Real Vanilla WACC (rvw)"]
[{"$f":"\"rvw for \"&C$5","v":"rvw for 2018"},null,null,"rvw for 2016","rvw for 2017","rvw for 2018","rvw for 2019","rvw for 2020"]
[{"$f":"$A$54","v":"Jemena"},{"$f":"HLOOKUP($A$36,$D$36:$H$41,2,FALSE)","v":3.8482708197709714E-2},null,3.9596959091813176E-2,3.8998747434050608E-2,3.8482708197709714E-2,3.8482708197709714E-2,3.8482708197709714E-2]
[{"$f":"$A$55","v":"CitiPower"},{"$f":"HLOOKUP($A$36,$D$36:$H$41,3,FALSE)","v":3.5897854460483589E-2},null,3.6967675843673664E-2,3.6395072760831051E-2,3.5897854460483589E-2,3.5897854460483589E-2,3.5897854460483589E-2]
[{"$f":"$A$56","v":"Powercor"},{"$f":"HLOOKUP($A$36,$D$36:$H$41,4,FALSE)","v":3.5897854460483589E-2},null,3.6967675843673664E-2,3.6395072760831051E-2,3.5897854460483589E-2,3.5897854460483589E-2,3.5897854460483589E-2]
[{"$f":"$A$57","v":"AusNet Services"},{"$f":"HLOOKUP($A$36,$D$36:$H$41,5,FALSE)","v":3.8281275483315946E-2},null,3.8984967311635851E-2,3.8530391286089614E-2,3.8281275483315946E-2,3.8281275483315946E-2,3.8281275483315946E-2]
[{"$f":"$A$58","v":"United Energy"},{"$f":"HLOOKUP($A$36,$D$36:$H$41,6,FALSE)","v":3.8391841352995247E-2},null,3.9598521188703287E-2,3.8963198492823106E-2,3.8391841352995247E-2,3.8391841352995247E-2,3.8391841352995247E-2]
[]
[{"$f":"\"rvw (t) \"&C$5","v":"rvw (t) 2018"},{"$f":"VLOOKUP(C$3,A37:B41,2,FALSE)","v":3.8391841352995247E-2},"(t)",{"$f":"VLOOKUP($C$3,$A$37:$H$41,4,FALSE)","v":3.9598521188703287E-2},{"$f":"VLOOKUP($C$3,$A37:$H$41,5,FALSE)","v":3.8963198492823106E-2},{"$f":"VLOOKUP($C$3,$A$37:$H$41,6,FALSE)","v":3.8391841352995247E-2},{"$f":"VLOOKUP($C$3,$A$37:$H$41,7,FALSE)","v":3.8391841352995247E-2},{"$f":"VLOOKUP($C$3,$A$37:$H$41,8,FALSE)","v":3.8391841352995247E-2}]
[]
[{"$f":"\"rvw for \"&C$5-1","v":"rvw for 2017"},{"$f":"IF(C$5=2016,F$183,HLOOKUP($A45,D$36:H$43,8,FALSE))","v":3.8963198492823106E-2},"(t-1)"]
[]
[{"$f":"\"rvw for \"&C$5-2","v":"rvw for 2016"},{"$f":"IF(OR(C$5=2016,C$5=2017),F$183,HLOOKUP($A47,D$36:H$43,8,FALSE))","v":3.9598521188703287E-2},"(t-2)"]
[]
[]
[]
[]
["DuoS"]
[{"$f":"\"Xt for \"&C$5","v":"Xt for 2018"},null,null,"AR for 2016","Xt for 2017","Xt for 2018","Xt for 2019","Xt for 2020"]
["Jemena",{"$f":"IF(C$5=2016,\"n/a\",HLOOKUP($A$53,$E$53:$H$58,2,FALSE))","v":2.7000000000000001E-3},null,238498758,-3.2500000000000001E-2,2.7000000000000001E-3,-2.0199999999999999E-2,-0.02]
["CitiPower",{"$f":"IF(C$5=2016,\"n/a\",HLOOKUP($A$53,$E$53:$H$58,3,FALSE))","v":-5.0000000000000001E-4},null,282881283,4.0000000000000001E-3,-5.0000000000000001E-4,-1.2E-2,-2.4E-2]
["Powercor",{"$f":"IF(C$5=2016,\"n/a\",HLOOKUP($A$53,$E$53:$H$58,4,FALSE))","v":-8.0999999999999996E-3},null,621773294,4.6800000000000001E-2,-8.0999999999999996E-3,-1.7999999999999999E-2,-2.5999999999999999E-2]
["AusNet Services",{"$f":"IF(C$5=2016,\"n/a\",HLOOKUP($A$53,$E$53:$H$58,5,FALSE))","v":-1.84E-2},null,586045137,3.0000000000000001E-3,-1.84E-2,-2.5000000000000001E-2,-0.03]
["United Energy",{"$f":"IF(C$5=2016,\"n/a\",HLOOKUP($A$53,$E$53:$H$58,6,FALSE))","v":-3.1600000000000003E-2},null,375069867,-3.8300000000000001E-2,-3.1600000000000003E-2,-3.5000000000000003E-2,0]
[]
[{"$f":"\"Xt for\"&C$5","v":"Xt for2018"},{"$f":"VLOOKUP(C$3,A54:B58,2,FALSE)","v":-3.1600000000000003E-2},null,{"$f":"VLOOKUP($C$3,$A$54:$H$58,4,FALSE)","v":375069867},{"$f":"VLOOKUP($C$3,$A$54:$H$58,5,FALSE)","v":-3.8300000000000001E-2},{"$f":"VLOOKUP($C$3,$A$54:$H$58,6,FALSE)","v":-3.1600000000000003E-2},{"$f":"VLOOKUP($C$3,$A$54:$H$58,7,FALSE)","v":-3.5000000000000003E-2},{"$f":"VLOOKUP($C$3,$A$54:$H$58,8,FALSE)","v":0}]
[]
[]
[]
["Metering"]
[{"$f":"\"Xt for \"&C$5","v":"Xt for 2018"},null,null,"AR for 2016","Xt for 2017","Xt for 2018","Xt for 2019","Xt for 2020"]
["Jemena",{"$f":"IF(C$5=2016,\"n/a\",HLOOKUP($A$65,$E$65:$H$70,2,FALSE))","v":-1.3599999999999999E-2},null,44212949.016624629,0.3473,-1.3599999999999999E-2,-1.4999999999999999E-2,-1.4999999999999999E-2]
["CitiPower",{"$f":"IF(C$5=2016,\"n/a\",HLOOKUP($A$65,$E$65:$H$70,3,FALSE))","v":7.6700000000000004E-2},null,32973195.03847561,0.14019999999999999,7.6700000000000004E-2,7.4999999999999997E-2,7.4999999999999997E-2]
["Powercor",{"$f":"IF(C$5=2016,\"n/a\",HLOOKUP($A$65,$E$65:$H$70,4,FALSE))","v":8.1900000000000001E-2},null,79145313.202280506,0.1096,8.1900000000000001E-2,0.08,0.08]
["AusNet Services",{"$f":"IF(C$5=2016,\"n/a\",HLOOKUP($A$65,$E$65:$H$70,5,FALSE))","v":0.1658},null,92754610.443801105,2.3099999999999999E-2,0.1658,0.16500000000000001,0.16500000000000001]
["United Energy",{"$f":"IF(C$5=2016,\"n/a\",HLOOKUP($A$65,$E$65:$H$70,6,FALSE))","v":5.7000000000000002E-2},null,62733316.946996652,0.30809999999999998,5.7000000000000002E-2,5.5E-2,5.5E-2]
[]
[{"$f":"\"Xt for\"&C$5","v":"Xt for2018"},{"$f":"VLOOKUP(C$3,A66:B70,2,FALSE)","v":5.7000000000000002E-2},null,{"$f":"VLOOKUP($C$3,$A$66:$H$70,4,FALSE)","v":62733316.946996652},{"$f":"VLOOKUP($C$3,$A$66:$H$70,5,FALSE)","v":0.30809999999999998},{"$f":"VLOOKUP($C$3,$A$66:$H$70,6,FALSE)","v":5.7000000000000002E-2},{"$f":"VLOOKUP($C$3,$A$66:$H$70,7,FALSE)","v":5.5E-2},{"$f":"VLOOKUP($C$3,$A$66:$H$70,8,FALSE)","v":5.5E-2}]
[]
[]
[]
["DuoS"]
["Real Pre-tax WACC (rptw)"]
[{"$f":"\"rptw for \"&C$5","v":"rptw for 2018"},null,null,"rptw for 2016","rptw for 2017","rptw for 2018","rptw for 2019","rptw for 2020"]
[{"$f":"$A$54","v":"Jemena"},{"$f":"HLOOKUP($A$78,$D$78:$H$83,2,FALSE)","v":4.6119496184403141E-2},null,4.7233747078506916E-2,4.6635535420744167E-2,4.6119496184403141E-2]
[{"$f":"$A$55","v":"CitiPower"},{"$f":"HLOOKUP($A$78,$D$78:$H$83,3,FALSE)","v":4.3398745398363081E-2},null,4.4468566781553198E-2,4.3895963698710627E-2,4.3398745398363081E-2]
[{"$f":"$A$56","v":"Powercor"},{"$f":"HLOOKUP($A$78,$D$78:$H$83,4,FALSE)","v":4.240106689588341E-2},null,4.3470888279073527E-2,4.2898285196230956E-2,4.240106689588341E-2]
[{"$f":"$A$57","v":"AusNet Services"},{"$f":"HLOOKUP($A$78,$D$78:$H$83,5,FALSE)","v":4.4635078632446534E-2},null,4.5338770460766176E-2,4.4884194435220071E-2,4.4635078632446534E-2]
[{"$f":"$A$58","v":"United Energy"},{"$f":"HLOOKUP($A$78,$D$78:$H$83,6,FALSE)","v":4.6985137877234795E-2},null,4.8191817712942786E-2,4.7556495017062606E-2,4.6985137877234795E-2]
[]
[{"$f":"\"rptw (t) \"&C$5","v":"rptw (t) 2018"},{"$f":"VLOOKUP(C$3,A79:B83,2,FALSE)","v":4.6985137877234795E-2},"(t)",{"$f":"VLOOKUP($C$3,$A$79:$H$83,4,FALSE)","v":4.8191817712942786E-2},{"$f":"VLOOKUP($C$3,$A79:$H$83,5,FALSE)","v":4.7556495017062606E-2},{"$f":"VLOOKUP($C$3,$A$79:$H$83,6,FALSE)","v":4.6985137877234795E-2},{"$f":"VLOOKUP($C$3,$A$79:$H$83,7,FALSE)","v":0},{"$f":"VLOOKUP($C$3,$A$79:$H$83,8,FALSE)","v":0}]
[]
[{"$f":"\"rptw for \"&C$5-1","v":"rptw for 2017"},{"$f":"IF(C$5=2016,B$183,HLOOKUP($A87,D$78:H$85,8,FALSE))","v":4.7556495017062606E-2},"(t-1)"]
[]
[{"$f":"\"rptw for \"&C$5-2","v":"rptw for 2016"},{"$f":"IF(OR(C$5=2016,C$5=2017),B$183,HLOOKUP($A89,D$78:H$85,8,FALSE))","v":4.8191817712942786E-2},"(t-2)"]
[]
[]
[]
["F factor Scheme",{"$f":"$C$5","v":2018},null,2016,{"$f":"+D93+1","v":2017},{"$f":"+E93+1","v":2018},{"$f":"+F93+1","v":2019},{"$f":"+G93+1","v":2020}]
[{"$f":"$A$54","v":"Jemena"},{"$f":"HLOOKUP($B$93,$D$93:$H$98,2,FALSE)","v":655000},null,-680000,70000,655000]
[{"$f":"$A$55","v":"CitiPower"},{"$f":"HLOOKUP($B$93,$D$93:$H$98,3,FALSE)","v":140000},null,-15000,410000,140000]
[{"$f":"$A$56","v":"Powercor"},{"$f":"HLOOKUP($B$93,$D$93:$H$98,4,FALSE)","v":1755000},null,-1530000,1420000,1755000]
[{"$f":"$A$57","v":"AusNet Services"},{"$f":"HLOOKUP($B$93,$D$93:$H$98,5,FALSE)","v":750000},null,1870000,3420000,750000]
[{"$f":"$A$58","v":"United Energy"},{"$f":"HLOOKUP($B$93,$D$93:$H$98,6,FALSE)","v":1000000},null,-2245000,555000,1000000]
[]
[{"$f":"\"Ifactor (t) \"&C$5","v":"Ifactor (t) 2018"},{"$f":"VLOOKUP(C$3,A94:B98,2,FALSE)","v":1000000},null,{"$f":"VLOOKUP($C$3,$A$94:$H$98,4,FALSE)","v":-2245000},{"$f":"VLOOKUP($C$3,$A$94:$H$98,5,FALSE)","v":555000},{"$f":"VLOOKUP($C$3,$A$94:$H$98,6,FALSE)","v":1000000},{"$f":"VLOOKUP($C$3,$A$94:$H$98,7,FALSE)","v":0},{"$f":"VLOOKUP($C$3,$A$94:$H$98,8,FALSE)","v":0}]
[]
[]
[]
["S factor Scheme",{"$f":"$C$5","v":2018},null,2016,{"$f":"+D104+1","v":2017},{"$f":"+E104+1","v":2018},{"$f":"+F104+1","v":2019},{"$f":"+G104+1","v":2020}]
[{"$f":"$A$54","v":"Jemena"},{"$f":"HLOOKUP($B$104,$D$104:$H$109,2,FALSE)","v":-3.9711537226499671E-2},null,3.997406405685925E-2,1.4883104689629834E-2,-3.9711537226499671E-2]
[{"$f":"$A$55","v":"CitiPower"},{"$f":"HLOOKUP($B$104,$D$104:$H$109,3,FALSE)","v":1.8570526636221274E-2},null,-1.2687890034873129E-2,4.0321456836540648E-3,1.8570526636221274E-2]
[{"$f":"$A$56","v":"Powercor"},{"$f":"HLOOKUP($B$104,$D$104:$H$109,4,FALSE)","v":-1.3841682273256106E-2},null,-1.184910821327374E-2,5.1006485422781411E-2,-1.3841682273256106E-2]
[{"$f":"$A$57","v":"AusNet Services"},{"$f":"HLOOKUP($B$104,$D$104:$H$109,5,FALSE)","v":-6.3433641222553572E-2},null,3.3573974889361931E-2,3.2178765868161374E-2,-6.3433641222553572E-2]
[{"$f":"$A$58","v":"United Energy"},{"$f":"HLOOKUP($B$104,$D$104:$H$109,6,FALSE)","v":2.2767038821999375E-2},null,-2.9478704479005153E-2,2.8366723271978866E-2,2.2767038821999375E-2]
[]
[{"$f":"\"S factor (t) \"&C$5","v":"S factor (t) 2018"},{"$f":"VLOOKUP(C$3,A105:B109,2,FALSE)","v":2.2767038821999375E-2},null,{"$f":"VLOOKUP($C$3,$A$105:$H$109,4,FALSE)","v":-2.9478704479005153E-2},{"$f":"VLOOKUP($C$3,$A$105:$H$109,5,FALSE)","v":2.8366723271978866E-2},{"$f":"VLOOKUP($C$3,$A$105:$H$109,6,FALSE)","v":2.2767038821999375E-2},{"$f":"VLOOKUP($C$3,$A$105:$H$109,7,FALSE)","v":0},{"$f":"VLOOKUP($C$3,$A$105:$H$109,8,FALSE)","v":0}]
[]
[]
[]
["Pass through Amounts",{"$f":"$C$5","v":2018},null,2016,{"$f":"+D115+1","v":2017},{"$f":"+E115+1","v":2018},{"$f":"+F115+1","v":2019},{"$f":"+G115+1","v":2020}]
[{"$f":"$A$54","v":"Jemena"},{"$f":"HLOOKUP($B$115,$D$115:$H$120,2,FALSE)","v":0},null,0,0,0]
[{"$f":"$A$55","v":"CitiPower"},{"$f":"HLOOKUP($B$115,$D$115:$H$120,3,FALSE)","v":0},null,0,0,0]
[{"$f":"$A$56","v":"Powercor"},{"$f":"HLOOKUP($B$115,$D$115:$H$120,4,FALSE)","v":0},null,0,0,0]
[{"$f":"$A$57","v":"AusNet Services"},{"$f":"HLOOKUP($B$115,$D$115:$H$120,5,FALSE)","v":0},null,{"$f":"-(5723000*(1+0.0975))","v":-6280992.5},0,0]
[{"$f":"$A$58","v":"United Energy"},{"$f":"HLOOKUP($B$115,$D$115:$H$120,6,FALSE)","v":0},null,0,0,0]
[]
[{"$f":"\"Pass through amounts (t) \"&C$5","v":"Pass through amounts (t) 2018"},{"$f":"VLOOKUP(C$3,A116:B120,2,FALSE)","v":0},null,{"$f":"VLOOKUP($C$3,$A$116:$H$120,4,FALSE)","v":0},{"$f":"VLOOKUP($C$3,$A$116:$H$120,5,FALSE)","v":0},{"$f":"VLOOKUP($C$3,$A$116:$H$120,6,FALSE)","v":0},{"$f":"VLOOKUP($C$3,$A$116:$H$120,7,FALSE)","v":0},{"$f":"VLOOKUP($C$3,$A$116:$H$120,8,FALSE)","v":0}]
[]
[]
[]
[" License Fees",{"$f":"$C$5","v":2018},null,2016,{"$f":"+D126+1","v":2017},{"$f":"+E126+1","v":2018},{"$f":"+F126+1","v":2019},{"$f":"+G126+1","v":2020}]
[{"$f":"$A$54","v":"Jemena"},{"$f":"HLOOKUP($B$126,$D$126:$H$131,2,FALSE)","v":76545},null,36033,39516,76545]
[{"$f":"$A$55","v":"CitiPower"},{"$f":"HLOOKUP($B$126,$D$126:$H$131,3,FALSE)","v":78091},null,36475,40445,78091]
[{"$f":"$A$56","v":"Powercor"},{"$f":"HLOOKUP($B$126,$D$126:$H$131,4,FALSE)","v":185081},null,85205,94964,185081]
[{"$f":"$A$57","v":"AusNet Services"},{"$f":"HLOOKUP($B$126,$D$126:$H$131,5,FALSE)","v":168235},null,74811,85031,168235]
[{"$f":"$A$58","v":"United Energy"},{"$f":"HLOOKUP($B$126,$D$126:$H$131,6,FALSE)","v":158262},null,74197,81712,158262]
[]
[{"$f":"\"Licence Fee (t-1) \"&C$5-1","v":"Licence Fee (t-1) 2017"},{"$f":"VLOOKUP(C$3,A127:B131,2,FALSE)","v":158262},null,{"$f":"VLOOKUP($C$3,$A$127:$H$131,4,FALSE)","v":74197},{"$f":"VLOOKUP($C$3,$A$127:$H$131,5,FALSE)","v":81712},{"$f":"VLOOKUP($C$3,$A$127:$H$131,6,FALSE)","v":158262},{"$f":"VLOOKUP($C$3,$A$127:$H$131,7,FALSE)","v":0},{"$f":"VLOOKUP($C$3,$A$127:$H$131,8,FALSE)","v":0}]
[]
[]
[]
["DMIA Carryover adjustment",{"$f":"$C$5","v":2018},null,2016,{"$f":"+D137+1","v":2017},{"$f":"+E137+1","v":2018},{"$f":"+F137+1","v":2019},{"$f":"+G137+1","v":2020}]
[{"$f":"$A$54","v":"Jemena"},{"$f":"HLOOKUP($B$137,$D$137:$H$142,2,FALSE)","v":0},null,null,{"$f":"H154","v":-91286.962539198226}]
[{"$f":"$A$55","v":"CitiPower"},{"$f":"HLOOKUP($B$137,$D$137:$H$142,3,FALSE)","v":0}]
[{"$f":"$A$56","v":"Powercor"},{"$f":"HLOOKUP($B$137,$D$137:$H$142,4,FALSE)","v":0}]
[{"$f":"$A$57","v":"AusNet Services"},{"$f":"HLOOKUP($B$137,$D$137:$H$142,5,FALSE)","v":0}]
[{"$f":"$A$58","v":"United Energy"},{"$f":"HLOOKUP($B$137,$D$137:$H$142,6,FALSE)","v":0},null,null,{"$f":"H163","v":-479908.40011946909}]
[]
[{"$f":"\"T factor (t) \"&C$5","v":"T factor (t) 2018"},{"$f":"VLOOKUP(C$3,A138:B142,2,FALSE)","v":0},null,{"$f":"VLOOKUP($C$3,$A$138:$H$142,4,FALSE)","v":0},{"$f":"VLOOKUP($C$3,$A$138:$H$142,5,FALSE)","v":-479908.40011946909},{"$f":"VLOOKUP($C$3,$A$138:$H$142,6,FALSE)","v":0},{"$f":"VLOOKUP($C$3,$A$138:$H$142,7,FALSE)","v":0},{"$f":"VLOOKUP($C$3,$A$138:$H$142,8,FALSE)","v":0}]
[]
[]
["DMIA Carryover adjustment"]
["Jemena",null,"2011-15",2016,2017]
["CPI - PTRM",null,null,2.3230798209937155E-2,2.3230798209937155E-2]
["Nominal Vanilla WACC - PTRM",null,0.1033058647680111,{"$f":"(1+D149)*(1+D37)-1","v":6.3747626268139346E-2},{"$f":"(1+E149)*(1+E37)-1","v":6.3135517676068398E-2}]
[]
[null,null,2011,2012,2013,2014,2015,"Total"]
["Ex-ante revenue minus ex post expenditure ($nominal)",null,-263938,-16375.399999999965,163676.67136000004,153066.62606841602,125690.58545944223,{"$f":"SUM(C153:G153)","v":162120.48288785832}]
["DMIA Carryover adjustment",null,{"$f":"0-(C153/(1+$C150))*(1+$C150)^5*(1+$D150)*(1+$E150)","v":442295.84533796879},{"$f":"C154-(D153/(1+$C150))*(1+$C150)^4*(1+$D150)*(1+$E150)","v":467167.62885189749},{"$f":"D154-(E153/(1+$C150))*(1+$C150)^3*(1+$D150)*(1+$E150)","v":241844.45017688599},{"$f":"E154-(F153/(1+$C150))*(1+$C150)^2*(1+$D150)*(1+$E150)","v":50857.51141715594},{"$f":"F154-(G153/(1+$C150))*(1+$C150)^1*(1+$D150)*(1+$E150)","v":-91286.962539198226},{"$f":"G154","v":-91286.962539198226}]
[]
[]
["UED",null,"2011-15",2016,2017]
["CPI - PTRM",null,null,2.3230798209937155E-2,2.3230798209937155E-2]
["Nominal Vanilla WACC - PTRM",null,9.4897728819182986E-2,{"$f":"(1+D158)*(1+D41)-1","v":6.3749224653787184E-2},{"$f":"(1+E158)*(1+E41)-1","v":6.3099142904560868E-2}]
[]
[null,null,2011,2012,2013,2014,2015,"Total"]
["Ex-ante revenue minus ex post expenditure ($nominal)",null,406960,327739.20000000007,91075.342720000073,-227853.74786316796,-450364.82908111555,{"$f":"SUM(C162:G162)","v":147555.96577571658}]
["DMIA Carryover adjustment",null,{"$f":"0-(C162/(1+$C159))*(1+$C159)^5*(1+$D159)*(1+$E159)","v":-661392.04760761408},{"$f":"C163-(D162/(1+$C159))*(1+$C159)^4*(1+$D159)*(1+$E159)","v":-1147868.7858490096},{"$f":"D163-(E162/(1+$C159))*(1+$C159)^3*(1+$D159)*(1+$E159)","v":-1271338.6438105071},{"$f":"E163-(F162/(1+$C159))*(1+$C159)^2*(1+$D159)*(1+$E159)","v":-989212.87475443596},{"$f":"F163-(G162/(1+$C159))*(1+$C159)^1*(1+$D159)*(1+$E159)","v":-479908.40011946909},{"$f":"G163","v":-479908.40011946909}]
[]
[]
[]
[]
[]
[]
[]
[]
["Regulatory Period 2011-15"]
[]
["DuoS"]
["Real Pre-tax WACC for distribution tariffs",null,null,"Real Vanilla WACC for distribution tariffs"]
[]
[{"$f":"$A$54","v":"Jemena"},8.6999999999999994E-2,null,{"$f":"$A$54","v":"Jemena"},null,7.5600000000000001E-2]
[{"$f":"$A$55","v":"CitiPower"},7.8600000000000003E-2,null,{"$f":"$A$55","v":"CitiPower"},null,6.7400000000000002E-2]
[{"$f":"$A$56","v":"Powercor"},7.7600000000000002E-2,null,{"$f":"$A$56","v":"Powercor"},null,6.7400000000000002E-2]
[{"$f":"$A$57","v":"AusNet Services"},7.8E-2,null,{"$f":"$A$57","v":"AusNet Services"},null,6.9900000000000004E-2]
[{"$f":"$A$58","v":"United Energy"},7.9100000000000004E-2,null,{"$f":"$A$58","v":"United Energy"},null,6.7400000000000002E-2]
[]
[" pretax WACCD",{"$f":"VLOOKUP($C$3,A177:B181,2,FALSE)","v":7.9100000000000004E-2},null,"Real Vanilla WACCD",null,{"$f":"VLOOKUP($C$3,D177:F181,3,FALSE)","v":6.7400000000000002E-2}]
[]
[]
[]
[]
["Pass Through Costs",null,null,null,2014,2015]
[]
[{"$f":"A204","v":"F Factor pass through"},null,null,null,{"$f":"B204","v":980000},{"$f":"C204","v":-70000}]
["VBRC",null,null,null,{"$f":"B215","v":0},{"$f":"C215","v":0}]
["Powerline Replacement program",null,null,null,{"$f":"B226","v":0},{"$f":"C226","v":0}]
["TOTAL PASS THROUGH AMOUNTS",null,null,null,{"$f":"SUM(E190:E192)","v":980000},{"$f":"SUM(F190:F192)","v":-70000}]
[]
[]
[]
["F factor Scheme",2014,2015]
[{"$f":"$A$54","v":"Jemena"},370000,-855000]
[{"$f":"$A$55","v":"CitiPower"},10000,-65000]
[{"$f":"$A$56","v":"Powercor"},2470000,-2405000]
[{"$f":"$A$57","v":"AusNet Services"},1970000,2020000]
[{"$f":"$A$58","v":"United Energy"},980000,-70000]
[]
["F Factor pass through",{"$f":"VLOOKUP($C$3,$A$198:$C$202,2,FALSE)","v":980000},{"$f":"VLOOKUP($C$3,$A$198:$C$202,3,FALSE)","v":-70000}]
[]
[]
[]
["VBRC",2014,2015]
[{"$f":"$A$54","v":"Jemena"},0,0]
[{"$f":"$A$55","v":"CitiPower"},0,0]
[{"$f":"$A$56","v":"Powercor"},{"$f":"H245","v":7193170.4538582545},{"$f":"I245","v":8768550.3783121537}]
[{"$f":"$A$57","v":"AusNet Services"},{"$f":"H262","v":6039778.1580883265},{"$f":"I262","v":8341755.2122622114}]
[{"$f":"$A$58","v":"United Energy"},0,0]
[]
["VBRC pass through",{"$f":"VLOOKUP($C$3,$A$209:$C$213,2,FALSE)","v":0},{"$f":"VLOOKUP($C$3,$A$209:$C$213,3,FALSE)","v":0}]
[]
[]
[]
["Powerline Replacement program",2014,2015]
[{"$f":"$A$54","v":"Jemena"},0,0]
[{"$f":"$A$55","v":"CitiPower"},0,0]
[{"$f":"$A$56","v":"Powercor"},{"$f":"H249","v":0},8777690.4553783704]
[{"$f":"$A$57","v":"AusNet Services"},0,5723419.3099999996]
[{"$f":"$A$58","v":"United Energy"},0,0]
[]
["Powerline Replacement program",{"$f":"VLOOKUP($C$3,$A$219:$C$224,2,FALSE)","v":0},{"$f":"VLOOKUP($C$3,$A$219:$C$224,3,FALSE)","v":0}]
[]
[]
[]
[]
["VBRC"]
[]
["Powercor",null,null,null,2011,2012,2013,2014,2015]
["Pass through amounts approved (Nominal $) - Forecast CPI",null,null,null,null,null,10270612,7181525,8777217]
["(As per AER's Final Decision on Powercor's VBRC pass through, table 7.2,  7 March 2012)"]
["Forecast CPI in PTRM",null,null,null,2.5748753401775293E-2,2.5748753401775293E-2,2.5748753401775293E-2,2.5748753401775293E-2,2.5748753401775293E-2]
[null,null,null,null,{"$f":"1+E236","v":1.0257487534017753},{"$f":"E237*(1+F236)","v":1.052160505105296},{"$f":"F237*(1+G236)","v":1.0792523264903395},{"$f":"G237*(1+H236)","v":1.1070417285034315},{"$f":"H237*(1+I236)","v":1.1355466729761414}]
[]
["Pass through amounts approved (Real $2010)",null,null,null,null,null,{"$f":"G234/G237","v":9516414.0469350498},{"$f":"H234/H237","v":6487131.257200608},{"$f":"I234/I237","v":7729507.9179756576}]
[]
[]
["Actual CPI",null,null,null,{"$f":"173.3/168.6-1","v":2.7876631079478242E-2},{"$f":"179.4/173.3-1","v":3.5199076745527913E-2},{"$f":"C17/C16-1","v":2.0040080160320661E-2},{"$f":"C18/C17-1","v":2.16110019646365E-2},{"$f":"C19/C18-1","v":2.3076923076923217E-2}]
[null,null,null,null,{"$f":"1+E242","v":1.0278766310794782},{"$f":"E243*(1+F242)","v":1.0640569395017794},{"$f":"F243*(1+G242)","v":1.0853807258645405},{"$f":"G243*(1+H242)","v":1.1088368908635777},{"$f":"H243*(1+I242)","v":1.1344254344988911}]
[]
["Pass through amounts approved (Nominal $) - Actual CPI",null,null,null,null,null,{"$f":"G239*G243","v":10328932.385889873},{"$f":"H239*H243","v":7193170.4538582545},{"$f":"I239*I243","v":8768550.3783121537}]
[]
[]
[]
[]
["AusNet Services",null,null,null,2011,2012,2013,2014,2015]
["Pass through amounts approved (Nominal $) - Forecast CPI",null,null,null,null,null,5790000,6030000,8350000]
["As per AER's Final Decision on AusNet Services's VBRC pass through, table 1.3,  19 October 2012"]
["Forecast CPI in PTRM",null,null,null,2.5748753401775293E-2,2.5748753401775293E-2,2.5748753401775293E-2,2.5748753401775293E-2,2.5748753401775293E-2]
[null,null,null,null,{"$f":"1+E253","v":1.0257487534017753},{"$f":"E254*(1+F253)","v":1.052160505105296},{"$f":"F254*(1+G253)","v":1.0792523264903395},{"$f":"G254*(1+H253)","v":1.1070417285034315},{"$f":"H254*(1+I253)","v":1.1355466729761414}]
[]
["Pass through amounts approved (Real $2010)",null,null,null,null,null,{"$f":"G251/G254","v":5364825.1274368009},{"$f":"H251/H254","v":5446949.14811543},{"$f":"I251/I254","v":7353286.4819334811}]
[]
[]
["Actual CPI",null,null,null,{"$f":"173.3/168.6-1","v":2.7876631079478242E-2},{"$f":"179.4/173.3-1","v":3.5199076745527913E-2},{"$f":"C17/C16-1","v":2.0040080160320661E-2},{"$f":"C18/C17-1","v":2.16110019646365E-2},{"$f":"C19/C18-1","v":2.3076923076923217E-2}]
[null,null,null,null,{"$f":"1+E259","v":1.0278766310794782},{"$f":"E260*(1+F259)","v":1.0640569395017794},{"$f":"F260*(1+G259)","v":1.0853807258645405},{"$f":"G260*(1+H259)","v":1.1088368908635777},{"$f":"H260*(1+I259)","v":1.1344254344988911}]
[]
["Pass through amounts approved (Nominal $) - Actual CPI",null,null,null,null,null,{"$f":"G256*G260","v":5822877.7909536809},{"$f":"H256*H260","v":6039778.1580883265},{"$f":"I256*I260","v":8341755.2122622114}]
[]
[]
[]
[]
[]
[]
[]
["AMI Transitional Adjustment in 2018 prices ($)"]
[{"$f":"C3","v":"United Energy"}]
[null,null,2009,2010,2011,2012,2013,2014,2015,2016,2017,2018,2019,2020]
["CPI",null,4.9810844892812067E-2,1.2612612612612484E-2,2.7876631079478242E-2,3.5199076745527913E-2,{"$f":"$F17","v":2.0040080160320661E-2},{"$f":"$F18","v":2.16110019646365E-2},{"$f":"$F19","v":2.3076923076923217E-2},{"$f":"$F20","v":1.5037593984962294E-2},{"$f":"$F22","v":1.0232558139534831E-2},{"$f":"$F23","v":1.9337016574585641E-2},{"$f":"$F24","v":0},{"$f":"$F25","v":0}]
[]
["Vanilla' WACC (Real)",null,6.7716458658346301E-2,{"$f":"$C275","v":6.7716458658346301E-2},{"$f":"$C275","v":6.7716458658346301E-2},6.7716458658346301E-2,6.7716458658346301E-2,5.0239094369083762E-2,{"$f":"H275","v":5.0239094369083762E-2},{"$f":"D43","v":3.9598521188703287E-2},{"$f":"E43","v":3.8963198492823106E-2},{"$f":"F43","v":3.8391841352995247E-2},{"$f":"G43","v":3.8391841352995247E-2},{"$f":"H43","v":3.8391841352995247E-2}]
["Vanilla' WACC (nominal)",null,{"$f":"(1+C275)*(1+C273)-1","v":0.1209003175700798},8.1183152731514552E-2,9.7480796473851994E-2,0.10529909222912481,8.9113582078353293E-2,7.2935813500832225E-2,7.4475381162216747E-2,5.5231581657706252E-2,4.9594449826237952E-2,5.8471241600152712E-2,3.8391841352995337E-2,3.8391841352995337E-2]
[]
["Future value index",null,{"$f":"(1+C276)^0.5","v":1.0587257990481198},{"$f":"C278*(D276+1)","v":1.1446764972930381},1.2562604739540626,1.3885435614647554,1.5122816520987139,1.6225811446369161,1.7434234938503763,1.8397155309149369,1.9309552105074483,2.0438605591401031,2.1223281294742544,2.2038082143200293]
[]
["AMI Transitional Adjustment - Revenue and Costs 2009-2015"]
["Over \\ (under) recovery of revenue and costs (000's)"]
["NPV at 1 January 2009",null,null,-481.92374450009083]
[]
["AMI Transitional Adjustment in 2018 prices ($)",null,null,{"$f":"-D282*L278*10^3","v":984984.93389684777}]
[]
["AMI Transitional Adjustment - Revenue 2016-2020"]
["Increase \\ (Reduction) in revenue 2016-2020 (000's)"]
["NPV at 1 January 2016",null,null,-4121.1152311637416]
[]
["AMI Transitional Adjustment in 2018 prices ($)",null,null,{"$f":"D288*L278/I278*10^3","v":-4831290.2231487278}]
[]
["Total AMI Transitional Adjustment in 2018 prices ($)",null,null,{"$f":"SUM(D284,D290)","v":-3846305.2892518798}]

{"sheet":"2018 Unmetered supply","index":3,"n_rows":27,"n_cols":23,"rows_kept":27,"cut":false,"hidden":false,"merged":[[3,19,3,21]]}
[null,{"$f":"\"Tariff Approval - \" &'Model update'!C3","v":"Tariff Approval - United Energy"}]
[]
[null,{"$f":"\"PROPOSED \"&'Model update'!C5&\" UNMETERED SUPPLY TARIFF\"","v":"PROPOSED 2018 UNMETERED SUPPLY TARIFF"}]
[null,null,{"$f":"\"P t-1 (\"&'Model update'!$C$8&\")\"","v":"P t-1 (2017)"},null,null,null,{"$f":"\"Pt (\"&'Model update'!$C$7&\")\"","v":"Pt (2018)"},null,null,null,{"$f":"\"Qt-2 (\"&'Model update'!$C$9&\")\"","v":"Qt-2 (2016)"},null,null,null,"P t-1 * Qt-2",null,null,null,null,"Pt * Qt-2"]
[null,null,"($) per NMI","($) per meter","($) per light",null,"($) per NMI","($) per meter","($) per light",null,"NMIs","Meters","Lights",null,"$ Comp1","$ Comp2","$ Comp3","Total $",null,"NMIs","Meters","Lights"]
[null,"Proposed tariff","ExistTarComp1","ExistTarComp2","ExistTarComp3",null,"PropTarComp1","PropTarComp2","PropTarComp3",null,"ActVolComp1","ActVolComp2","ActVolComp3",null,"$Comp1","ExistRevComp2","ExistRevComp3","Exist Rev Total",null,"$PropRevComp1","$PropRevComp2","$PropRevComp3","Total $"]
[null,"metering data services - unmetered supplies",null,null,1.3220000000000001,null,null,null,{"$f":"ROUNDDOWN(E7*(1+C14),3)","v":1.347},null,null,null,120358,null,{"$f":"IF($B7=\"\",\"\",C7*K7)","v":0},{"$f":"IF($B7=\"\",\"\",D7*L7)","v":0},{"$f":"IF($B7=\"\",\"\",E7*M7)","v":159113.27600000001},{"$f":"SUM(O7:Q7)","v":159113.27600000001},null,{"$f":"IF($B7=\"\",\"\",G7*K7)","v":0},{"$f":"IF($B7=\"\",\"\",H7*L7)","v":0},{"$f":"IF($B7=\"\",\"\",I7*M7)","v":162122.226},{"$f":"SUM(T7:V7)","v":162122.226}]
[]
[]
[null,"UNMETERED SUPPLY TARIFF CONTROL"]
[]
[null,"CPI"]
[]
[null,{"$f":"\"CPI \"&'Model update'!C5","v":"CPI 2018"},{"$f":"'Model update'!C30","v":1.9337016574585641E-2}]
[]
[]
[]
[]
[null,{"$f":"\"\"&'Model update'!C5& \" Unmetered Supplies price control\"","v":"2018 Unmetered Supplies price control"}]
[]
[null,"Average price movement allowed",null,null,null,null,{"$f":"1+C14","v":1.0193370165745856}]
[]
[null,"Proposed metering tariff revenue (Pt*Qt-2)",null,null,null,null,{"$f":"'2018 Unmetered supply'!W7","v":162122.226}]
[null,"Existing metering tariff revenue (Pt-1*Qt-2)",null,null,null,null,{"$f":"'2018 Unmetered supply'!R7","v":159113.27600000001}]
[null,"Average price movement",null,null,null,null,{"$f":"IF(G23>0,G23/G24,\"\")","v":1.018910741301059}]
[]
[null,{"$f":"IF(G25=\"\",\"\", IF(G25<=G21,\"UNMETERED SUPPLIES PRICE CONTROL FORMULA COMPLIANT\",\"UNMETERED SUPPLIES CONTROL FORMULA BREACHED\"))","v":"UNMETERED SUPPLIES PRICE CONTROL FORMULA COMPLIANT"}]

{"sheet":"Metering","index":4,"n_rows":89,"n_cols":12,"rows_kept":89,"cut":false,"hidden":false,"merged":[[23,7,23,8]]}
[null,{"$f":"\"Tariff Approval - \"&'Model update'!C3","v":"Tariff Approval - United Energy"}]
[]
[null,{"$f":"\"PROPOSED \"&'Model update'!$C$5&\" METERING TARIFFS AND REVENUE\"","v":"PROPOSED 2018 METERING TARIFFS AND REVENUE"}]
[]
[null,null,null,{"$f":"\"Proposed Metering Tariffs P(t) for \" &'Model update'!$C$5","v":"Proposed Metering Tariffs P(t) for 2018"},{"$f":"\"Current Metering Tariffs P(t-1) for\" &'Model update'!$C$8","v":"Current Metering Tariffs P(t-1) for2017"},{"$f":"\"Forecast Quantities   (Qt) for \"&'Model update'!$C$5","v":"Forecast Quantities   (Qt) for 2018"},null,{"$f":"\"Forecast Revenue (Pt \"&'Model update'!$C$5&\")*(Qt \" &'Model update'!$C$5&\")\"","v":"Forecast Revenue (Pt 2018)*(Qt 2018)"},{"$f":"\"Revenue                    (Pt-1 \"&'Model update'!$C$8&\")*(Qt \" &'Model update'!$C$5&\")\"","v":"Revenue                    (Pt-1 2017)*(Qt 2018)"},null,"Movement","Side Constraint"]
[null,"Proposed tariff","Existing tariff","PropTar\n$/Cust/year","ExistTar\n$/Cust/year","FcastVol\nCust #",null,"PropRev\nFixed","ExistRev\nFixed"]
[]
[null,"single phase single element meter","single phase single element meter",57.581000000000003,60.886181615246755,531954,null,{"$f":"D8*F8","v":30630443.274},{"$f":"E8*F8","v":32388647.854956973},null,{"$f":"IFERROR(H8/I8,\"\")","v":0.94571540655755149},{"$f":"IF(B8=\"\",\"\",IF(K8<$I$30,\"COMPLIANT\",\"BREACHED\"))","v":"COMPLIANT"}]
[null,"single phase single element meter with contactor","single phase single element meter with contactor",57.581000000000003,60.886181615246755,55062,null,3170525.0220000003,3352514.932098717,null,{"$f":"IFERROR(H9/I9,\"\")","v":0.94571540655755149},"COMPLIANT"]
[null,"three phase direct connected meter","three phase direct connected meter",64.927000000000007,68.654074583745754,102706,null,6668392.4620000003,7051185.3841981916,null,0.94571225952220239,"COMPLIANT"]
[null,"three phase Current transformer connected meter","three phase Current transformer connected meter",68.844999999999999,72.797394206498197,3188,null,219477.86,232078.09273031625,null,0.94570692743085316,"COMPLIANT"]
[null,null,null,null,null,null,null,0,0,null,"",""]
[null,null,null,null,null,null,null,0,0,null,"",""]
[null,null,null,null,null,null,null,0,0,null,"",""]
[null,null,null,null,null,null,null,0,0,null,"",""]
[null,null,null,null,null,null,null,0,0,null,"",""]
[null,null,null,null,null,null,null,{"$f":"SUM(H7:H16)","v":40688838.618000001},{"$f":"SUM(I7:I16)","v":43024426.263984196}]
[]
[]
[]
[]
[null,"Year (t)",null,{"$f":"'Model update'!C5","v":2018}]
[]
[null,"Table 1- Compliance with AER Final Determination Total Metering Annual Revenue",null,null,null,null,null,"Metering tariff rebalancing control"]
[null,"Revenue from  Metering charges for year t",null,{"$f":"H17","v":40688838.618000001},null,null,null,{"$f":"\"CPI \"&'Model update'!$C$5","v":"CPI 2018"},{"$f":"D37","v":1.9337016574585641E-2}]
[null,"Total Annual Metering Revenue for year t",null,{"$f":"D33","v":40688838.618000001},null,null,null,{"$f":"\"X \"& 'Model update'!$C$5","v":"X 2018"},{"$f":"MIN(D38,0)","v":0}]
[null,null,null,{"$f":"IF(D25=\"\",\"\",IF(D26>=D25,\"METERING REVENUE CAP FORMULA COMPLIANT\",\"METERING REVENUE CAP FORMULA BREACHED\"))","v":"METERING REVENUE CAP FORMULA COMPLIANT"},{"$f":"IF(C43=0,\"\",IF(C42>C43,\"MAXIMUM TRANSMISSION REVENUE FORMULA COMPLIANT\",\"MAXIMUM TRANSMISSION REVENUE FORMULA BREACHED\"))","v":""},null,null,{"$f":"\"Tt \"&'Model update'!$C$5","v":"Tt 2018"},{"$f":"D31/I17","v":-8.939817734354373E-2}]
[null,null,null,null,null,null,null,{"$f":"\"Bt \"&'Model update'!$C$5","v":"Bt 2018"},{"$f":"D32/I17","v":5.5448584704784525E-2}]
[null,"Table 2 - Total Annual Revenue for year t (TARMt)"]
[null,"Adjusted Annual Smoothed Metering Revenue for year t",null,{"$f":"D39","v":42149500.363178596},null,null,null,null,{"$f":"(1+I25)*(1-I26)*(1+0.02)+SUM(I27:I28)","v":1.0057741642673181}]
[null,"T factor for year t",null,{"$f":"'Model update'!$D$292","v":-3846305.2892518798}]
[null,"B factor for year t",null,{"$f":"F57","v":2385643.5440732837}]
[null,"Total Annual Revenue for year t",null,{"$f":"SUM(D30:D32)","v":40688838.618000001}]
[]
[null,"Table 3 -  Adjusted Annual Revenue for year t (ARt)"]
[null,"Adjusted Annual Smoothed Revenue for year t-1",null,43849328.04395432]
[null,"CPI for period t",null,{"$f":"'Model update'!C30","v":1.9337016574585641E-2}]
[null,"X factor for period t",null,{"$f":"'Model update'!B72","v":5.7000000000000002E-2}]
[null,"Adjusted Annual Smoothed Revenue for year t",null,{"$f":"IF(D22=2016,'Model update'!D72,(D36*(1+D37)*(1-D38)))","v":42149500.363178596}]
[]
[]
[]
[]
[null,"Table 4 - Metering Services Recovery Arrangements"]
[null,null,null,"Year t-2","Year t-1","Year t"]
[null,null,null,"(actual)","(estimate)","(forecast)"]
[null,null,null,{"$f":"E47-1","v":2016},{"$f":"F47-1","v":2017},{"$f":"D$22","v":2018}]
[]
[null,"(A) Revenue from Metering Proposal charges",null,61655903.110000007,{"$f":"E89","v":42719995.355907962},{"$f":"D25","v":40688838.618000001}]
[]
[]
[null,"(B) Less TARM for regulatory year = ",null,{"$f":"SUM(D53:D54)","v":62733316.946996652},{"$f":"SUM(E53:E54)","v":43849328.04395432},{"$f":"SUM(F53:F54)","v":38303195.073926717}]
[null,"+ Adjusted annual smoothed revenue",null,62733316.946996652,{"$f":"D36","v":43849328.04395432},{"$f":"D30","v":42149500.363178596}]
[null,"+ T factor",null,0,0,{"$f":"D31","v":-3846305.2892518798}]
[]
[]
[null,"(A minus B) Under/over recovery of revenue for regulatory year",null,{"$f":"D49-D52","v":-1077413.8369966447},{"$f":"E49-E52","v":-1129332.6880463585},{"$f":"F49-F52","v":2385643.5440732837}]
[]
[]
[]
[null,"Table 5 - Metering Services Unders and Overs Account"]
[null,null,null,"Year t-2","Year t-1","Year t"]
[null,null,null,"(actual)","(estimate)","(forecast)"]
[null,"Calendar year",null,{"$f":"E64-1","v":2016},{"$f":"F64-1","v":2017},{"$f":"D$22","v":2018}]
[]
[null,"Nominal WACC",null,{"$f":"(1+'Model update'!$B$47)*(1+'Model update'!$C$28)-1","v":5.5231581657706252E-2},{"$f":"(1+'Model update'!$B$45)*(1+'Model update'!$C$29)-1","v":4.9594449826237952E-2},{"$f":"(1+'Model update'!$B$43)*(1+'Model update'!$C$30)-1","v":5.8471241600152712E-2}]
[]
[null,"Opening balance",null,0,{"$f":"D72","v":-1106767.6055042034},{"$f":"E72","v":-2318655.2780434401}]
[null,"Interest on Opening balance",null,{"$f":"D68*D66","v":0},{"$f":"E68*E66","v":-54889.530480483729},{"$f":"F68*F66","v":-135574.65294994725}]
[null,"Under/over recovery of revenue for regulatory year",null,{"$f":"D57","v":-1077413.8369966447},{"$f":"E57","v":-1129332.6880463585},{"$f":"F57","v":2385643.5440732837}]
[null,"Interest on under/over recovery for regulatory year",null,{"$f":"D70*((1+D66)^0.5-1)","v":-29353.768507558729},{"$f":"E70*((1+E66)^0.5-1)","v":-27665.454012394446},{"$f":"F70*((1+F66)^0.5-1)","v":68754.999627695972}]
[null,"Closing balance of Metering Services overs/ (unders) account",null,{"$f":"SUM(D68:D71)","v":-1106767.6055042034},{"$f":"SUM(E68:E71)","v":-2318655.2780434401},{"$f":"SUM(F68:F71)","v":168.61270759216859}]
[]
[null,"The DNSP is expected to achieve a closing balance as close to zero as practicable in its annual metering charges unders and overs account in each forecast year in its annual pricing Proposals in the 2016–20 regulatory control period."]
[]
[]
[null,null,{"$f":"\"Current Metering Tariffs P(t-1) for \" &'Model update'!$C$8","v":"Current Metering Tariffs P(t-1) for 2017"},{"$f":"\"Estimated Quantities   (Qt-1) for \"&'Model update'!$C$5-1","v":"Estimated Quantities   (Qt-1) for 2017"},{"$f":"\"Revenue                    (Pt-1 \"&'Model update'!$C$8&\")*(Qt-1 \" &'Model update'!$C$5-1&\")\"","v":"Revenue                    (Pt-1 2017)*(Qt-1 2017)"}]
[null,"Existing tariff","ExistTar\n$/Cust/year","FcastVol\nCust #","ExistRev\nFixed"]
[]
[null,"single phase single element meter",{"$f":"E8","v":60.886181615246755},526954,{"$f":"C80*D80","v":32084216.946880739}]
[null,"single phase single element meter with contactor",{"$f":"E9","v":60.886181615246755},55062,3352514.932098717]
[null,"three phase direct connected meter",{"$f":"E10","v":68.654074583745754},102706,7051185.3841981916]
[null,"three phase Current transformer connected meter",{"$f":"E11","v":72.797394206498197},3188,232078.09273031625]
[null,null,null,null,0]
[null,null,null,null,0]
[null,null,null,null,0]
[null,null,null,null,0]
[null,null,null,null,0]
[null,null,null,null,{"$f":"SUM(E79:E88)","v":42719995.355907962}]

{"sheet":"Prop2018DistTar","index":5,"n_rows":66,"n_cols":74,"rows_kept":66,"cut":false,"hidden":false,"merged":[]}
[null,{"$f":"\"Tariff Approval - \"&'Model update'!$C$3","v":"Tariff Approval - United Energy"}]
[]
[null,{"$f":"\"PROPOSED \"&'Model update'!$C$5&\" DISTRIBUTION TARIFFS\"","v":"PROPOSED 2018 DISTRIBUTION TARIFFS"}]
[null,null,null,{"$f":"\"Proposed Distribution Tariffs (Pt) for \"&'Model update'!$C$5","v":"Proposed Distribution Tariffs (Pt) for 2018"},null,null,null,null,null,null,null,null,null,null,null,null,null,{"$f":"\"Current Distribution Tariffs (Pt-1) for \"&'Model update'!$C$8","v":"Current Distribution Tariffs (Pt-1) for 2017"},null,null,null,null,null,null,null,null,null,null,null,null,null,{"$f":"\"Forecast Quantities (Qt) for \"&'Model update'!$C$5","v":"Forecast Quantities (Qt) for 2018"},null,null,null,null,null,null,null,null,null,null,null,null,null,{"$f":"\"Forecast Revenue (Pt \"&'Model update'!$C$5&\")*(Qt \" &'Model update'!$C$5&\")\"","v":"Forecast Revenue (Pt 2018)*(Qt 2018)"},null,null,null,null,null,null,null,null,null,null,null,null,null,null,{"$f":"\"Revenue (Pt-1 \"&'Model update'!$C$8&\")*(Qt \" &'Model update'!$C$5&\")\"","v":"Revenue (Pt-1 2017)*(Qt 2018)"}]
[null,"Proposed tariff","Existing tariff","PropTar\nFixed","PropTar\nPkBlk1","PropTar\nPkBlk2","PropTar\nPkBlk3","PropTar\nPkBlk4","PropTar\nOPkBlk1","PropTar\nOPkBlk2","PropTar\nOPkBlk3","PropTar\nOPkBlk4","PropTar\nDemBlk1","PropTar\nDemBlk2","PropTar\nDemBlk3","PropTar\nDemBlk4",null,"ExistTar\nFixed","ExistTar\nPkBlk1","ExistTar\nPkBlk2","ExistTar\nPkBlk3","ExistTar\nPkBlk4","ExistTar\nOPkBlk1","ExistTar\nOPkBlk2","ExistTar\nOPkBlk3","ExistTar\nOPkBlk4","ExistTar\nDemBlk1","ExistTar\nDemBlk2","ExistTar\nDemBlk3","ExistTar\nDemBlk4",null,"FcastVol\nFixed","FcastVol\nPkBlk1","FcastVol\nPkBlk2","FcastVol\nPkBlk3","FcastVol\nPkBlk4","FcastVol\nOPkBlk1","FcastVol\nOPkBlk2","FcastVol\nOPkBlk3","FcastVol\nOPkBlk4","FcastVol\nDemBlk1","FcastVol\nDemBlk2","FcastVol\nDemBlk3","FcastVol\nDemBlk4",null,"PropRev\nFixed","PropRev\nPkBlk1","PropRev\nPkBlk2","PropRev\nPkBlk3","PropRev\nPkBlk4","PropRev\nOPkBlk1","PropRev\nOPkBlk2","PropRev\nOPkBlk3","PropRev\nOPkBlk4","PropRev\nDemBlk1","PropRev\nDemBlk2","PropRev\nDemBlk3","PropRev\nDemBlk4","PropRev\nTotal",null,"ExistRev\nFixed","ExistRev\nPkBlk1","ExistRev\nPkBlk2","ExistRev\nPkBlk3","ExistRev\nPkBlk4","ExistRev\nOPkBlk1","ExistRev\nOPkBlk2","ExistRev\nOPkBlk3","ExistRev\nOPkBlk4","ExistRev\nDemBlk1","ExistRev\nDemBlk2","ExistRev\nDemBlk3","ExistRev\nDemBlk4","ExistRev\nTotal"]
[null,"Low voltage small 1 rate","Low voltage small 1 rate",6.8650000000000002,8.4649999999999999,0,0,5.4489999999999998,0,0,0,0,0,0,0,0,null,6.6520000000000001,8.202,0,0,5.28,0,0,0,0,0,0,0,0,null,205549567.62323707,885866510.70770717,0,0,1445601999.1844056,0,0,0,0,0,0,0,null,null,{"$f":"D6/100*AF6","v":14110977.817335226},{"$f":"E6/100*AG6","v":74988600.13140741},{"$f":"F6/100*AH6","v":0},{"$f":"G6/100*AI6","v":0},{"$f":"H6/100*AJ6","v":78770852.935558259},{"$f":"I6/100*AK6","v":0},{"$f":"J6/100*AL6","v":0},{"$f":"K6/100*AM6","v":0},{"$f":"L6/100*AN6","v":0},{"$f":"M6/100*AO6","v":0},{"$f":"N6/100*AP6","v":0},{"$f":"O6/100*AQ6","v":0},{"$f":"P6/100*AR6","v":0},{"$f":"SUM(AT6:BF6)","v":167870430.88430089},null,{"$f":"R6/100*AF6","v":13673157.238297729},{"$f":"S6/100*AG6","v":72658771.208246142},{"$f":"T6/100*AH6","v":0},{"$f":"U6/100*AI6","v":0},{"$f":"V6/100*AJ6","v":76327785.556936607},{"$f":"W6/100*AK6","v":0},{"$f":"X6/100*AL6","v":0},{"$f":"Y6/100*AM6","v":0},{"$f":"Z6/100*AN6","v":0},{"$f":"AA6/100*AO6","v":0},{"$f":"AB6/100*AP6","v":0},{"$f":"AC6/100*AQ6","v":0},{"$f":"AD6/100*AR6","v":0},{"$f":"SUM(BI6:BU6)","v":162659714.00348049}]
[null,"Winter economy tariff","Winter economy tariff",8.8409999999999993,6.593,0,0,4.8849999999999998,1.831,0,0,0,0,0,0,0,null,8.5670000000000002,6.3890000000000002,0,0,4.734,1.774,0,0,0,0,0,0,0,null,50220,265149.05092429707,0,0,483663.45314424351,0,0,0,0,0,0,0,null,null,4439.9501999999993,17481.276927438907,0,0,23626.959686096296,0,0,0,0,0,0,0,0,45548.186813535198,null,4302.3473999999997,16940.372863553341,0,0,22896.627871848486,0,0,0,0,0,0,0,0,44139.348135401829]
[null,"Reverse cycle airconditioning time of use","Reverse cycle airconditioning time of use",0,0,0,0,0,0,0,0,0,0,0,0,0,null,0,0,0,5.5529999999999999,0,0,1.3959999999999999,1.371,0,0,69.766999999999996,0,0,null,0,0,0,0,0,0,0,0,0,0,0,0,null,null,0,0,0,0,0,0,0,0,0,0,0,0,0,0,null,0,0,0,0,0,0,0,0,0,0,0,0,0,0]
[null,"Low voltage small 2 rate","Low voltage small 2 rate",14.02,0,0,10.063000000000001,0,0,7.6319999999999997,1.7450000000000001,0,0,0,0,0,null,13.586,0,0,9.7509999999999994,0,0,7.3959999999999999,1.6910000000000001,0,0,0,0,0,null,1500124.8362499997,0,0,4199343.7007283811,0,0,6958274.448766781,14004754.286124827,0,0,0,0,null,null,210317.50204224995,0,0,422579.95660429704,0,0,531055.50592988078,244382.96229287825,0,0,0,0,0,1408335.926869306,null,203806.96025292497,0,0,409478.00425802445,0,0,514633.97823079111,236820.39497837084,0,0,0,0,0,1364739.3377201112]
[null,"Dedicated circuit","Dedicated circuit",0,0,0,0,0,0,0,1.931,0,0,0,0,0,null,0,0,0,0,0,0,0,1.871,0,0,0,0,0,null,1899.9900000000002,0,0,0,0,0,0,95116849.231297255,0,0,0,0,null,null,0,0,0,0,0,0,0,1836706.3586563501,0,0,0,0,0,1836706.3586563501,null,0,0,0,0,0,0,0,1779636.2491175716,0,0,0,0,0,1779636.2491175716]
[null,"Low voltage medium 1 rate","Low voltage medium 1 rate",11.651999999999999,10.241,0,0,6.391,0,0,0,0,0,0,0,0,null,10.987,9.657,0,0,6.0259999999999998,0,0,0,0,0,0,0,0,null,12033520.757353125,153338365.9234888,0,0,231891372.16376382,0,0,12,0,0,0,0,null,null,1402145.8386467861,15703382.054224487,0,0,14820177.594986144,0,0,0,0,0,0,0,0,31925705.487857416,null,1322122.9256103877,14807885.997231314,0,0,13973774.086588409,0,0,0,0,0,0,0,0,30103783.00943011]
[null,"Low voltage medium 2 rate 5 day","Low voltage medium 2 rate 5 day",22.303000000000001,0,0,10.83,0,0,8.1159999999999997,2.0219999999999998,0,0,0,0,0,null,21.03,0,0,10.212,0,0,7.6529999999999996,1.907,0,0,0,0,0,null,3807335.9830250018,0,0,51707044.732552052,0,0,74994609.046321467,77026041.232533157,0,0,0,0,null,null,849150.14429406624,0,0,5599872.9445353877,0,0,6086562.4701994499,1557466.5537218202,0,0,0,0,0,14093052.112750726,null,800682.75723015796,0,0,5280323.4080882156,0,0,5739337.4303149823,1468886.6063044074,0,0,0,0,0,13289230.201937763]
[null,"Low voltage medium 2 rate 7 day","Low voltage medium 2 rate 7 day",23.742000000000001,0,0,10.307,0,0,7.9809999999999999,1.88,0,0,0,0,0,null,22.387,0,0,9.7189999999999994,0,0,7.5259999999999998,1.7729999999999999,0,0,0,0,0,null,1844598.2368041668,0,0,22006070.238745652,0,0,33856652.726462662,14992889.813662352,0,0,0,0,null,null,437944.51338204532,0,0,2268165.6595075144,0,0,2702099.4540989846,281866.32849685219,0,0,0,0,0,5690075.9554853961,null,412950.20727334887,0,0,2138769.96650369,0,0,2548051.6841935799,265823.9363962335,0,0,0,0,0,5365595.7943668524]
[null,"Unmetered supplies","Unmetered supplies",0,0,0,8.4589999999999996,0,0,6.1879999999999997,1.5249999999999999,0,0,0,0,0,null,0,0,0,8.1969999999999992,0,0,5.9960000000000004,1.478,0,0,0,0,0,null,3707289.0420999988,0,0,10816030.725244839,0,0,18164542.768627141,66285006.261596173,0,0,0,0,null,null,0,0,0,914928.03904846089,0,0,1124021.9065226475,1010846.3454893416,0,0,0,0,0,3049796.29106045,null,0,0,0,886590.03854831925,0,0,1089145.9844068834,979692.39254639146,0,0,0,0,0,2955428.4155015941]
[null,"Low voltage large 1 rate","Low voltage large 1 rate",13.641,6.2469999999999999,0,0,4.9290000000000003,0,0,0,0,0,0,0,0,null,12.657,5.7960000000000003,0,0,4.5730000000000004,0,0,0,0,0,0,0,0,null,2621.992916666667,577413.25391898619,0,0,774143.47562545771,0,0,0,0,0,0,0,null,null,357.66605376250004,36071.005972319064,0,0,38157.531913578809,0,0,0,0,0,0,0,0,74586.203939660365,null,331.86564346250003,33466.872197144439,0,0,35401.581140352188,0,0,0,0,0,0,0,0,69200.318980959128]
[null,"Low voltage large 2 rate","Low voltage large 2 rate",19.678000000000001,0,0,9.7799999999999994,0,0,7.7759999999999998,1.861,0,0,0,0,0,null,18.257999999999999,0,0,9.0739999999999998,0,0,7.2149999999999999,1.7270000000000001,0,0,0,0,0,null,8128.178041666677,0,0,903588.49940318661,0,0,1258017.5391398347,1362054.1475024181,0,0,0,0,null,null,1599.4628750391687,0,0,88370.955241631644,0,0,97823.443843513538,25347.827685020005,0,0,0,0,0,213141.68964520434,null,1484.0427468475018,0,0,81991.62043584515,0,0,90765.965448939067,23522.675127366761,0,0,0,0,0,197764.30375899849]
[null,"Low voltage KW time of use","Low voltage KW time of use",0,0,0,8.9130000000000003,0,0,5.2220000000000004,2.0750000000000002,0,0,42.68,0,0,null,0,0,0,8.4039999999999999,0,0,4.9240000000000004,1.9570000000000001,0,0,40.244999999999997,0,0,null,85424.52922499986,0,0,2797481.7148522977,0,0,4144236.3214554214,6586209.0446983874,0,0,682957.56934354687,0,null,null,0,0,0,249339.54524478529,0,0,216412.02070640211,136663.83767749154,0,0,291486.29059582582,0,0,893901.69422450475,null,0,0,0,235100.36331618711,0,0,204062.19646846497,128892.11100474745,0,0,274856.27378231043,0,0,842910.94457170996]
[null,"Low voltage KW time of use - HOT","Low voltage KW time of use - HOT",0,0,0,7.76,0,0,5.9649999999999999,1.7529999999999999,0,0,68.290999999999997,0,0,null,0,0,0,7.3170000000000002,0,0,5.625,1.653,0,0,64.394000000000005,0,0,null,3704.5014208333332,0,0,38522.958026668151,0,0,57008.244498067019,138325.92722822793,0,0,151569.56785218362,0,null,null,0,0,0,2989.3815428694488,0,0,3400.541784309698,2424.8535043108354,0,0,103508.37358193472,0,0,112323.15041342471,null,0,0,0,2818.7248388113085,0,0,3206.7137530162699,2286.5275770826074,0,0,97601.707522735131,0,0,105913.67369164532]
[null,"Low voltage large KVA time of use","Low voltage large KVA time of use",0,0,0,1.4059999999999999,0,0,1.1919999999999999,1.18,0,14.196,21.178000000000001,0,0,null,0,0,0,1.3049999999999999,0,0,1.1060000000000001,1.095,0,13.172000000000001,19.649999999999999,0,0,null,1207904.4289999995,0,0,460697092.68562466,0,0,653613576.1763531,1268388147.0325294,0,331111136.77099401,96046797.401065037,0,null,null,0,0,0,6477401.1231598826,0,0,7791073.8280221289,14966980.134983847,0,47004536.976010308,20340790.753597554,0,0,96580782.815773726,null,0,0,0,6012097.059547401,0,0,7228966.1525104651,13888850.210006196,0,43613958.935475335,18873195.689309277,0,0,89617068.046848685]
[null,"Low voltage large KVA time of use - HOT","Low voltage large KVA time of use - HOT",0,0,0,0,0,0,0,0,0,0,0,0,0,null,0,0,0,1.139,0,0,0.94199999999999995,0.93600000000000005,0,13.106999999999999,30.917000000000002,0,0,null,3.1E-7,0,0,0,0,0,0,0,0,0,0,0,null,null,0,0,0,0,0,0,0,0,0,0,0,0,0,0,null,0,0,0,0,0,0,0,0,0,0,0,0,0,0]
[null,"High voltage KVA time of use","High voltage KVA time of use",0,0,0,0.84299999999999997,0,0,0.74399999999999999,0.73099999999999998,0,8.5909999999999993,11.798,0,0,null,0,0,0,0.78600000000000003,0,0,0.69399999999999995,0.68200000000000005,0,8.0120000000000005,11.003,0,0,null,34316.689999999988,0,0,170523448.74060524,0,0,248821547.84836793,637350623.78137767,0,103610388.30378608,31102876.482047074,0,null,null,0,0,0,1437512.6728833022,0,0,1851232.3159918573,4659033.0598418703,0,8901168.4591782615,3669517.3673519138,0,0,20518463.875247203,null,0,0,0,1340314.3071011573,0,0,1726821.5420676733,4346731.2541889958,0,8301264.3108993424,3422249.4993196395,0,0,19137380.913576808]
[null,"High voltage KVA time of use - HOT","High voltage KVA time of use - HOT",0,0,0,0,0,0,0,0,0,0,0,0,0,null,0,0,0,0.81399999999999995,0,0,0.67300000000000004,0.66500000000000004,0,9.2409999999999997,22.376999999999999,0,0,null,0,0,0,0,0,0,0,0,0,0,0,0,null,null,0,0,0,0,0,0,0,0,0,0,0,0,0,0,null,0,0,0,0,0,0,0,0,0,0,0,0,0,0]
[null,"Subtransmission KVA time of use","Subtransmission KVA time of use",0,0,0,0.48,0,0,0.374,0.32400000000000001,0,0.84099999999999997,1.232,0,0,null,0,0,0,0.44800000000000001,0,0,0.34899999999999998,0.30199999999999999,0,0.78400000000000003,1.149,0,0,null,372,0,0,8273861.7699614735,0,0,11602727.599683488,16115661.387170799,0,4238689.6126332916,1512895.9876330707,0,null,null,0,0,0,39714.536495815068,0,0,43394.201222816242,52214.742894433395,0,35647.379642245978,18638.878567639429,0,0,189609.73882295011,null,0,0,0,37066.900729427405,0,0,40493.519322895365,48669.297389255815,0,33231.326563045004,17383.174897903984,0,0,176844.21890252756]
[null,"TOD","TOD",6.53,0,4.4240000000000004,15.698,0,0,9.2520000000000007,3.0270000000000001,3.2589999999999999,0,0,0,0,null,6.3280000000000003,0,4.2869999999999999,15.212,0,0,8.9649999999999999,2.9329999999999998,3.1579999999999999,0,0,0,0,null,15707814.647299996,0,12080098.602927629,22156770.540210932,0,0,42584001.269890659,107941636.15173109,25155080.815130644,0,0,0,null,null,1025720.2964686897,0,534423.56219351827,3478169.8394023124,0,0,3939871.7974902838,3267393.3263129001,819804.08376510767,0,0,0,0,13065382.905632813,null,993990.51088114374,0,517873.82710750744,3370487.9345768872,0,0,3817655.7138456972,3165928.1883302727,794397.45214182569,0,0,0,0,12660333.626883334]
[null,"TOD9","TOD9",6.774,0,5.4870000000000001,17.7,0,0,11,4.1929999999999996,4.4080000000000004,0,0,0,0,null,6.5640000000000001,0,5.3170000000000002,17.152000000000001,0,0,10.659000000000001,4.0629999999999997,4.2709999999999999,0,0,0,0,null,817673.4375,0,471688.28190885769,634148.94264614163,0,0,1239459.5235104598,4524672.0305463392,942133.89760566922,0,0,0,null,null,55389.198656249995,0,25881.536028339022,112244.36284836706,0,0,136340.54758615058,189719.498240808,41529.262206457897,0,0,0,0,561104.40556637256,null,53672.084437500002,0,25079.665949093964,108769.22664266621,0,0,132113.9906109799,183837.42460109777,40238.538766738129,0,0,0,0,543710.93100807595]
[null,"TOU","TOU",0,0,0,9.6460000000000008,0,0,5.86,2.8290000000000002,0,0,41.890999999999998,0,0,null,0,0,0,9.0960000000000001,0,0,5.5259999999999998,2.6680000000000001,0,0,39.500999999999998,0,0,null,219431.88199375005,0,0,4014520.9534145421,0,0,6566809.1726725269,7462286.8817174928,0,0,1110253.6036445084,0,null,null,0,0,0,387240.69116636674,0,0,384815.01751861011,211108.0958837879,0,0,465096.33710272104,0,0,1448260.1416714857,null,0,0,0,365160.82592258672,0,0,362881.87488188379,199093.81400422272,0,0,438561.27597561723,0,0,1365697.7907843105]
[null,"TODFLEX","TODFLEX",7.2949999999999999,0,4.7290000000000001,17.414000000000001,0,0,9.9960000000000004,4.0090000000000003,4.7290000000000001,0,0,0,0,null,7.069,0,4.5819999999999999,16.873999999999999,0,0,9.6859999999999999,3.8849999999999998,4.5819999999999999,0,0,0,0,null,762427.32999999984,0,1766358.3410498402,897799.59964108723,0,0,1502959.0853530241,3382265.656111144,2942300.1035350314,0,0,0,null,null,55619.073723499991,0,83531.085948246939,156342.82228149896,0,0,150235.79017188831,135595.03015349575,139141.37189617162,0,0,0,0,720465.17417480156,null,53895.987957699988,0,80934.539186903683,151494.70444343705,0,0,145576.61700729391,131401.02073991793,134816.19074397514,0,0,0,0,698119.06007922767]
[null,"Low Voltage KW 1 rate","Low Voltage KW 1 rate",0,2.7120000000000002,2.7120000000000002,2.7120000000000002,2.7120000000000002,2.7120000000000002,2.7120000000000002,2.7120000000000002,2.7120000000000002,0,0,26.13,10.311,null,0,2.6280000000000001,2.6280000000000001,2.6280000000000001,2.6280000000000001,2.6280000000000001,2.6280000000000001,2.6280000000000001,2.6280000000000001,0,0,25.32,9.9920000000000009,null,1115018.7925630142,0,0,5256477.6292454861,0,0,7359068.6809436809,0,0,0,0,779540.58692469075,2537178.5160448891,null,0,0,0,142555.67330513761,0,0,199577.94262719265,0,0,0,0,203693.95536342167,261608.47678938849,807436.04808514041,null,0,0,0,138140.23209657139,0,0,193396.32493519995,0,0,0,0,197379.67660933168,253514.87732320535,782431.11096430838]
[null,"Low voltage medium KW time of use (opt-in)","Low voltage medium KW time of use (opt-in)",0,3.6859999999999999,3.6859999999999999,3.6859999999999999,3.6859999999999999,3.6859999999999999,3.6859999999999999,3.6859999999999999,3.6859999999999999,0,0,30.492000000000001,20.327999999999999,null,0,3.476,3.476,3.476,3.476,3.476,3.476,3.476,3.476,0,0,28.751999999999999,19.167999999999999,null,175817.14583333323,0,0,8362481.4638386657,0,0,12391679.133156199,0,0,0,0,616176.69832109148,1472922.2518598167,null,0,0,0,308241.06675709318,0,0,456757.29284813744,0,0,0,0,187884.59885206723,299415.6353580635,1252298.5938153614,null,0,0,0,290679.85568303202,0,0,430734.76666850946,0,0,0,0,177163.12430128022,282329.73723648966,1180907.4838893113]
[null,"Low voltage medium KW 1 rate (mandatory)","Low voltage medium KW 1 rate (mandatory)",0,5.657,5.657,5.657,5.657,5.657,5.657,5.657,5.657,0,0,18.954999999999998,12.635999999999999,null,0,5.3339999999999996,5.3339999999999996,5.3339999999999996,5.3339999999999996,5.3339999999999996,5.3339999999999996,5.3339999999999996,5.3339999999999996,0,0,17.873000000000001,11.914999999999999,null,2702828.704859375,0,0,283403271.17653072,0,0,388617179.88766599,0,0,0,0,25908737.341048431,46484440.594827987,null,0,0,0,16032123.050456343,0,0,21984073.866245266,0,0,0,0,4911001.1629957296,5873773.9135624645,48800971.993259802,null,0,0,0,15116730.484556148,0,0,20728840.375208102,0,0,0,0,4630668.6249655858,5538621.0968737546,46014860.581603587]
[null,null,null,null,null,null,null,null,null,null,null,null,null,null,null,null,null,null,null,null,null,null,null,null,null,null,null,null,null,null,null,null,null,null,null,null,null,null,null,null,null,null,null,null,null,0,0,0,0,0,0,0,0,0,0,0,0,0,0,null,0,0,0,0,0,0,0,0,0,0,0,0,0,0]
[null,null,null,null,null,null,null,null,null,null,null,null,null,null,null,null,null,null,null,null,null,null,null,null,null,null,null,null,null,null,null,null,null,null,null,null,null,null,null,null,null,null,null,null,null,0,0,0,0,0,0,0,0,0,0,0,0,0,0,null,0,0,0,0,0,0,0,0,0,0,0,0,0,0]
[null,null,null,null,null,null,null,null,null,null,null,null,null,null,null,null,null,null,null,null,null,null,null,null,null,null,null,null,null,null,null,null,null,null,null,null,null,null,null,null,null,null,null,null,null,0,0,0,0,0,0,0,0,0,0,0,0,0,0,null,0,0,0,0,0,0,0,0,0,0,0,0,0,0]
[null,null,null,null,null,null,null,null,null,null,null,null,null,null,null,null,null,null,null,null,null,null,null,null,null,null,null,null,null,null,null,null,null,null,null,null,null,null,null,null,null,null,null,null,null,0,0,0,0,0,0,0,0,0,0,0,0,0,0,null,0,0,0,0,0,0,0,0,0,0,0,0,0,0]
[null,null,null,null,null,null,null,null,null,null,null,null,null,null,null,null,null,null,null,null,null,null,null,null,null,null,null,null,null,null,null,null,null,null,null,null,null,null,null,null,null,null,null,null,null,0,0,0,0,0,0,0,0,0,0,0,0,0,0,null,0,0,0,0,0,0,0,0,0,0,0,0,0,0]
[null,null,null,null,null,null,null,null,null,null,null,null,null,null,null,null,null,null,null,null,null,null,null,null,null,null,null,null,null,null,null,null,null,null,null,null,null,null,null,null,null,null,null,null,null,0,0,0,0,0,0,0,0,0,0,0,0,0,0,null,0,0,0,0,0,0,0,0,0,0,0,0,0,0]
[null,null,null,null,null,null,null,null,null,null,null,null,null,null,null,null,null,null,null,null,null,null,null,null,null,null,null,null,null,null,null,null,null,null,null,null,null,null,null,null,null,null,null,null,null,0,0,0,0,0,0,0,0,0,0,0,0,0,0,null,0,0,0,0,0,0,0,0,0,0,0,0,0,0]
[null,null,null,null,null,null,null,null,null,null,null,null,null,null,null,null,null,null,null,null,null,null,null,null,null,null,null,null,null,null,null,null,null,null,null,null,null,null,null,null,null,null,null,null,null,0,0,0,0,0,0,0,0,0,0,0,0,0,0,null,{"$f":"R38/100*AF38","v":0},0,0,0,0,0,0,0,0,0,0,0,0,0]
[null,null,null,null,null,null,null,null,null,null,null,null,null,null,null,null,null,null,null,null,null,null,null,null,null,null,null,null,null,null,null,null,null,null,null,null,null,null,null,null,null,null,null,null,null,0,0,0,0,0,0,0,0,0,0,0,0,0,0,null,0,0,0,0,0,0,0,0,0,0,0,0,0,0]
[null,null,null,null,null,null,null,null,null,null,null,null,null,null,null,null,null,null,null,null,null,null,null,null,null,null,null,null,null,null,null,null,null,null,null,null,null,null,null,null,null,null,null,null,null,0,0,0,0,0,0,0,0,0,0,0,0,0,0,null,0,0,0,0,0,0,0,0,0,0,0,0,0,0]
[null,null,null,null,null,null,null,null,null,null,null,null,null,null,null,null,null,null,null,null,null,null,null,null,null,null,null,null,null,null,null,null,null,null,null,null,null,null,null,null,null,null,null,null,null,0,0,0,0,0,0,0,0,0,0,0,0,0,0,null,0,0,0,0,0,0,0,0,0,0,0,0,0,0]
[null,null,null,null,null,null,null,null,null,null,null,null,null,null,null,null,null,null,null,null,null,null,null,null,null,null,null,null,null,null,null,null,null,null,null,null,null,null,null,null,null,null,null,null,null,0,0,0,0,0,0,0,0,0,0,0,0,0,0,null,0,0,0,0,0,0,0,0,0,0,0,0,0,0]
[null,null,null,null,null,null,null,null,null,null,null,null,null,null,null,null,null,null,null,null,null,null,null,null,null,null,null,null,null,null,null,null,null,null,null,null,null,null,null,null,null,null,null,null,null,0,0,0,0,0,0,0,0,0,0,0,0,0,0,null,0,0,0,0,0,0,0,0,0,0,0,0,0,0]
[null,null,null,null,null,null,null,null,null,null,null,null,null,null,null,null,null,null,null,null,null,null,null,null,null,null,null,null,null,null,null,null,null,null,null,null,null,null,null,null,null,null,null,null,null,0,0,0,0,0,0,0,0,0,0,0,0,0,0,null,0,0,0,0,0,0,0,0,0,0,0,0,0,0]
[null,null,null,null,null,null,null,null,null,null,null,null,null,null,null,null,null,null,null,null,null,null,null,null,null,null,null,null,null,null,null,null,null,null,null,null,null,null,null,null,null,null,null,null,null,0,0,0,0,0,0,0,0,0,0,0,0,0,0,null,0,0,0,0,0,0,0,0,0,0,0,0,0,0]
[null,null,null,null,null,null,null,null,null,null,null,null,null,null,null,null,null,null,null,null,null,null,null,null,null,null,null,null,null,null,null,null,null,null,null,null,null,null,null,null,null,null,null,null,null,0,0,0,0,0,0,0,0,0,0,0,0,0,0,null,0,0,0,0,0,0,0,0,0,0,0,0,0,0]
[null,null,null,null,null,null,null,null,null,null,null,null,null,null,null,null,null,null,null,null,null,null,null,null,null,null,null,null,null,null,null,null,null,null,null,null,null,null,null,null,null,null,null,null,null,0,0,0,0,0,0,0,0,0,0,0,0,0,0,null,0,0,0,0,0,0,0,0,0,0,0,0,0,0]
[null,null,null,null,null,null,null,null,null,null,null,null,null,null,null,null,null,null,null,null,null,null,null,null,null,null,null,null,null,null,null,null,null,null,null,null,null,null,null,null,null,null,null,null,null,0,0,0,0,0,0,0,0,0,0,0,0,0,0,null,0,0,0,0,0,0,0,0,0,0,0,0,0,0]
[null,null,null,null,null,null,null,null,null,null,null,null,null,null,null,null,null,null,null,null,null,null,null,null,null,null,null,null,null,null,null,null,null,null,null,null,null,null,null,null,null,null,null,null,null,0,0,0,0,0,0,0,0,0,0,0,0,0,0,null,0,0,0,0,0,0,0,0,0,0,0,0,0,0]
[null,null,null,null,null,null,null,null,null,null,null,null,null,null,null,null,null,null,null,null,null,null,null,null,null,null,null,null,null,null,null,null,null,null,null,null,null,null,null,null,null,null,null,null,null,0,0,0,0,0,0,0,0,0,0,0,0,0,0,null,0,0,0,0,0,0,0,0,0,0,0,0,0,0]
[null,null,null,null,null,null,null,null,null,null,null,null,null,null,null,null,null,null,null,null,null,null,null,null,null,null,null,null,null,null,null,null,null,null,null,null,null,null,null,null,null,null,null,null,null,0,0,0,0,0,0,0,0,0,0,0,0,0,0,null,0,0,0,0,0,0,0,0,0,0,0,0,0,0]
[null,null,null,null,null,null,null,null,null,null,null,null,null,null,null,null,null,null,null,null,null,null,null,null,null,null,null,null,null,null,null,null,null,null,null,null,null,null,null,null,null,null,null,null,null,0,0,0,0,0,0,0,0,0,0,0,0,0,0,null,0,0,0,0,0,0,0,0,0,0,0,0,0,0]
[null,null,null,null,null,null,null,null,null,null,null,null,null,null,null,null,null,null,null,null,null,null,null,null,null,null,null,null,null,null,null,null,null,null,null,null,null,null,null,null,null,null,null,null,null,0,0,0,0,0,0,0,0,0,0,0,0,0,0,null,0,0,0,0,0,0,0,0,0,0,0,0,0,0]
[null,null,null,null,null,null,null,null,null,null,null,null,null,null,null,null,null,null,null,null,null,null,null,null,null,null,null,null,null,null,null,null,null,null,null,null,null,null,null,null,null,null,null,null,null,0,0,0,0,0,0,0,0,0,0,0,0,0,0,null,0,0,0,0,0,0,0,0,0,0,0,0,0,0]
[null,null,null,null,null,null,null,null,null,null,null,null,null,null,null,null,null,null,null,null,null,null,null,null,null,null,null,null,null,null,null,null,null,null,null,null,null,null,null,null,null,null,null,null,null,0,0,0,0,0,0,0,0,0,0,0,0,0,0,null,0,0,0,0,0,0,0,0,0,0,0,0,0,0]
[null,null,null,null,null,null,null,null,null,null,null,null,null,null,null,null,null,null,null,null,null,null,null,null,null,null,null,null,null,null,null,null,null,null,null,null,null,null,null,null,null,null,null,null,null,0,0,0,0,0,0,0,0,0,0,0,0,0,0,null,0,0,0,0,0,0,0,0,0,0,0,0,0,0]
[null,null,null,null,null,null,null,null,null,null,null,null,null,null,null,null,null,null,null,null,null,null,null,null,null,null,null,null,null,null,null,null,null,null,null,null,null,null,null,null,null,null,null,null,null,0,0,0,0,0,0,0,0,0,0,0,0,0,0,null,0,0,0,0,0,0,0,0,0,0,0,0,0,0]
[null,null,null,null,null,null,null,null,null,null,null,null,null,null,null,null,null,null,null,null,null,null,null,null,null,null,null,null,null,null,null,null,null,null,null,null,null,null,null,null,null,null,null,null,null,0,0,0,0,0,0,0,0,0,0,0,0,0,0,null,0,0,0,0,0,0,0,0,0,0,0,0,0,0]
[null,null,null,null,null,null,null,null,null,null,null,null,null,null,null,null,null,null,null,null,null,null,null,null,null,null,null,null,null,null,null,null,null,null,null,null,null,null,null,null,null,null,null,null,null,0,0,0,0,0,0,0,0,0,0,0,0,0,0,null,0,0,0,0,0,0,0,0,0,0,0,0,0,0]
[null,null,null,null,null,null,null,null,null,null,null,null,null,null,null,null,null,null,null,null,null,null,null,null,null,null,null,null,null,null,null,null,null,null,null,null,null,null,null,null,null,null,null,null,null,0,0,0,0,0,0,0,0,0,0,0,0,0,0,null,0,0,0,0,0,0,0,0,0,0,0,0,0,0]
[null,null,null,null,null,null,null,null,null,null,null,null,null,null,null,null,null,null,null,null,null,null,null,null,null,null,null,null,null,null,null,null,null,null,null,null,null,null,null,null,null,null,null,null,null,0,0,0,0,0,0,0,0,0,0,0,0,0,0,null,0,0,0,0,0,0,0,0,0,0,0,0,0,0]
[null,null,null,null,null,null,null,null,null,null,null,null,null,null,null,null,null,null,null,null,null,null,null,null,null,null,null,null,null,null,null,null,null,null,null,null,null,null,null,null,null,null,null,null,null,0,0,0,0,0,0,0,0,0,0,0,0,0,0,null,0,0,0,0,0,0,0,0,0,0,0,0,0,0]
[null,null,null,null,null,null,null,null,null,null,null,null,null,null,null,null,null,null,null,null,null,null,null,null,null,null,null,null,null,null,null,null,null,null,null,null,null,null,null,null,null,null,null,null,null,0,0,0,0,0,0,0,0,0,0,0,0,0,0,null,0,0,0,0,0,0,0,0,0,0,0,0,0,0]
[null,null,null,null,null,null,null,null,null,null,null,null,null,null,null,null,null,null,null,null,null,null,null,null,null,null,null,null,null,null,null,null,null,null,null,null,null,null,null,null,null,null,null,null,null,0,0,0,0,0,0,0,0,0,0,0,0,0,0,null,0,0,0,0,0,0,0,0,0,0,0,0,0,0]
[null,null,null,null,null,null,null,null,null,null,null,null,null,null,null,null,null,null,null,null,null,null,null,null,null,null,null,null,null,null,null,null,null,null,null,null,null,null,null,null,null,null,null,null,null,0,0,0,0,0,0,0,0,0,0,0,0,0,0,null,0,0,0,0,0,0,0,0,0,0,0,0,0,0]
[null,null,null,null,null,null,null,null,null,null,null,null,null,null,null,null,null,null,null,null,null,null,null,null,null,null,null,null,null,null,null,{"$f":"SUM(AF6:AF65)","v":251338040.72942334},1040047438.9360393,14318145.225886328,1056687956.0712721,1678751178.2769392,0,1513732349.4728687,2320677434.8658266,29039514.816271342,438960214.68741339,130607350.61158541,27304454.626294214,50494541.362732694,null,{"$f":"SUM(AT6:AT65)","v":18153661.463677611},90745534.468531668,643836.18417010433,38117792.320481069,93652815.022144079,0,47698747.942809507,28577748.955835205,1000474.7178677372,55941352.814830817,24889038.000797592,5302579.7172112186,6434798.0257099168,411158379.63406646,null,{"$f":"SUM(BI6:BI65)","v":17520396.927731205},87517064.450538158,623888.03224350512,35966013.657288402,90359857.852537215,0,44996684.82987535,26850072.102312129,969452.18165253894,51948454.57293772,23123847.620807484,5005211.4258761974,6074465.7114334498,390955409.36523342]

{"sheet":"2018DistRevCapForm","index":6,"n_rows":77,"n_cols":8,"rows_kept":77,"cut":false,"hidden":false,"merged":[]}
[]
[null,{"$f":"\"Tariff Approval - \"&'Model update'!$C$3","v":"Tariff Approval - United Energy"}]
[]
[null," DUoS"]
[]
[null,"Year (t)",{"$f":"'Model update'!C5","v":2018},null,null,null,null,{"$f":"C6-1","v":2017}]
[]
[null,"Table 1- Compliance with AER Final Determination Total Annual Revenue"]
[null,"Revenue from DUoS charges for year t",{"$f":"Prop2018DistTar!BG66","v":411158379.63406646}]
[null,"Total Annual Revenue for year t",{"$f":"C18","v":411158379.63406646}]
[null,null,{"$f":"IF(C9=\"\",\"\",IF(C10>=C9,\"DUoS REVENUE CAP FORMULA COMPLIANT\",\"DUoS REVENUE CAP FORMULA BREACHED\"))","v":"DUoS REVENUE CAP FORMULA COMPLIANT"}]
[]
[null,"Table 2 - Total Annual Revenue for year t (TARt)"]
[null,"Adjusted Annual Smoothed Revenue for year t",{"$f":"C25","v":422294403.72386879},null,null,null,null,{"$f":"H25","v":392653500.6452322}]
[null,"I factor for year t (F factor Scheme)",{"$f":"'Model update'!B$100","v":1000000},null,null,null,null,{"$f":"INDEX('Model update'!$D$100:$H$100,1,MATCH($H$6,'Model update'!$D$93:$H$93,0))","v":555000}]
[null,"T factor for year t (DMIS carry over amount)",{"$f":"'Model update'!B144","v":0},null,null,null,null,{"$f":"INDEX('Model update'!$D$144:$H$144,1,MATCH($H$6,'Model update'!$D$137:$H$137,0))","v":-479908.40011946909}]
[null,"B factor for year t",{"$f":"C32","v":-12136024.089802297},null,null,null,null,{"$f":"H32","v":-3697992.1186625324}]
[null,"Total Annual Revenue for year t",{"$f":"C14+C15+C16+C17","v":411158379.63406646},null,null,null,null,{"$f":"H14+H15+H16+H17","v":389030600.12645018}]
[]
[null,"Table 3 -  Adjusted Annual Revenue for year t (AARt)"]
[null,"Adjusted Annual Smoothed Revenue for year t-1",{"$f":"H25","v":392653500.6452322},null,null,null,null,364013293.23172724]
[null,"CPI for period t",{"$f":"'Model update'!C30","v":1.9337016574585641E-2},null,null,null,null,{"$f":"'Model update'!C29","v":1.0232558139534831E-2}]
[null,"X factor for period t",{"$f":"'Model update'!B60","v":-3.1600000000000003E-2},null,null,null,null,{"$f":"INDEX('Model update'!$E$60:$H$60,1,MATCH(\"Xt for \"&$H$6,'Model update'!$E$53:$H$53,0))","v":-3.8300000000000001E-2}]
[null,"S factor for period t",{"$f":"'Model update'!B111","v":2.2767038821999375E-2},null,null,null,null,{"$f":"INDEX('Model update'!$D$111:$H$111,1,MATCH($H$6,'Model update'!$D$104:$H$104,0))","v":2.8366723271978866E-2}]
[null,"Adjusted Annual Smoothed Revenue for year t",{"$f":"IF(C6=2016,'Model update'!D60*(1+C24),(C21*(1+C22)*(1-C23)*(1+C24)))","v":422294403.72386879},null,null,null,null,{"$f":"IF(H6=2016,'Model update'!D60*(1+H24),(H21*(1+H22)*(1-H23)*(1+H24)))","v":392653500.6452322}]
[]
[null,"Table 4- B factor for year t"]
[null,"DUoS revenue under/over recovery approved",{"$f":"E60","v":-12307643.527750313},null,null,null,null,-3646193.9367125034]
[null,"License Fee Recovery Amount for year t",{"$f":"C38","v":171619.43794801732},null,null,null,null,{"$f":"H38","v":88101.084872067004}]
[null,"Approved Pass through Amount for year t",{"$f":"'Model update'!B122","v":0},null,null,null,null,{"$f":"INDEX('Model update'!$D$122:$H$122,1,MATCH($H$6,'Model update'!$D$115:$H$115,0))","v":0}]
[null,"Pass Through revenue under/over recovery for years 2014 and 2015",null,null,null,null,null,-139899.26682209599]
[null,"B factor for year t",{"$f":"SUM(C28:C31)","v":-12136024.089802297},null,null,null,null,{"$f":"SUM(H28:H31)","v":-3697992.1186625324}]
[]
[null,"Table 5 - License Fee Recovery Amount for year t"]
[null,"Lt-1",{"$f":"'Model update'!B133","v":158262},null,null,null,null,{"$f":"INDEX('Model update'!$D$133:$H$133,1,MATCH($H$6,'Model update'!$D$126:$H$126,0))","v":81712}]
[null,"Nominal WACC t",{"$f":"(1+'Model update'!$B$43)*(1+'Model update'!$C$30)-1","v":5.8471241600152712E-2},null,null,null,null,{"$f":"(1+'Model update'!$B$45)*(1+'Model update'!$C$29)-1","v":4.9594449826237952E-2}]
[null,"Nominal WACC t-1",{"$f":"(1+'Model update'!$B$45)*(1+'Model update'!$C$29)-1","v":4.9594449826237952E-2},null,null,null,null,{"$f":"(1+'Model update'!$B$47)*(1+'Model update'!$C$28)-1","v":5.5231581657706252E-2}]
[null,"License Fee Recovery Amount for year t",{"$f":"C35*(1+C36)*(1+C37)^0.5","v":171619.43794801732},null,null,null,null,{"$f":"H35*(1+H36)*(1+H37)^0.5","v":88101.084872067004}]
[]
[]
[]
[null,"Table 6 - DUoS Recovery Arrangements"]
[null,null,"Year t-2","Year t-1","Year t"]
[null,null,"(actual)","(estimate)","(forecast)"]
[null,null,{"$f":"D45-1","v":2016},{"$f":"E45-1","v":2017},{"$f":"C$6","v":2018}]
[]
[null,"(A) Revenue from DUoS Charges ",370195702.15683949,{"$f":"Est2017DistRev!AS66","v":395656128.4331044},{"$f":"C9","v":411158379.63406646}]
[]
[]
[null,"(B) Less TAR for regulatory year = ",{"$f":"SUM(C51:C54)","v":361928144.113069},{"$f":"SUM(D51:D54)","v":392676794.06316268},{"$f":"SUM(E51:E54)","v":423466023.16181678}]
[null,"+ Adjusted annual smoothed revenue",{"$f":"H21","v":364013293.23172724},{"$f":"C21","v":392653500.6452322},{"$f":"C14","v":422294403.72386879}]
[null,"+It",-2289171.3080627741,{"$f":"H15","v":555000},{"$f":"C15","v":1000000}]
[null,"+Tt",{"$f":"INDEX('Model update'!$D$144:$H$144,1,MATCH($C$45,'Model update'!$D$137:$H$137,0))","v":0},{"$f":"H16","v":-479908.40011946909},{"$f":"C16","v":0}]
[null,"+Bt =",{"$f":"SUM(C55:C57)","v":204022.18940457568},{"$f":"SUM(D55:D57)","v":-51798.181950028986},{"$f":"SUM(E55:E57)","v":171619.43794801732}]
[null,"+Licence fee recovery",81303.343570283396,{"$f":"H29","v":88101.084872067004},{"$f":"C29","v":171619.43794801732}]
[null,"+Approved pass throughs",{"$f":"INDEX('Model update'!$D$122:$H$122,1,MATCH($C$45,'Model update'!$D$115:$H$115,0))","v":0},{"$f":"H30","v":0},{"$f":"C30","v":0}]
[null,"+Pass Through revenue under/over recovery for years 2014 and 2015",122718.84583429228,{"$f":"H31","v":-139899.26682209599},{"$f":"C31","v":0}]
[]
[]
[null,"(A minus B) Under/over recovery of revenue for regulatory year",{"$f":"C47-C50","v":8267558.0437704921},{"$f":"D47-D50","v":2979334.3699417114},{"$f":"E47-E50","v":-12307643.527750313}]
[]
[]
[]
[null,"Table 7 - DUoS Unders and Overs Account"]
[null,null,"Year t-2","Year t-1","Year t"]
[null,null,"(actual)","(estimate)","(forecast)"]
[null,"Calendar year",{"$f":"D67-1","v":2016},{"$f":"E67-1","v":2017},{"$f":"C$6","v":2018}]
[]
[null,"Nominal WACC",{"$f":"(1+'Model update'!$B$47)*(1+'Model update'!$C$28)-1","v":5.5231581657706252E-2},{"$f":"(1+'Model update'!$B$45)*(1+'Model update'!$C$29)-1","v":4.9594449826237952E-2},{"$f":"(1+'Model update'!$B$43)*(1+'Model update'!$C$30)-1","v":5.8471241600152712E-2}]
[]
[null,"Opening balance",0,{"$f":"C75","v":8492804.8121024631},{"$f":"D75","v":11966320.422531141}]
[null,"Interest on Opening balance",{"$f":"C71*C69","v":0},{"$f":"D71*D69","v":421195.98213784787},{"$f":"E71*E69","v":699685.61249065981}]
[null,"Under/over recovery of revenue for regulatory year",{"$f":"C60","v":8267558.0437704921},{"$f":"D60","v":2979334.3699417114},{"$f":"E60","v":-12307643.527750313}]
[null,"Interest on under/over recovery for regulatory year",{"$f":"C73*((1+C69)^0.5-1)","v":225246.76833197183},{"$f":"D73*((1+D69)^0.5-1)","v":72985.258349119089},{"$f":"E73*((1+E69)^0.5-1)","v":-354710.16961882426}]
[null,"Closing balance of DUoS overs/ (unders) account",{"$f":"SUM(C71:C74)","v":8492804.8121024631},{"$f":"SUM(D71:D74)","v":11966320.422531141},{"$f":"SUM(E71:E74)","v":3652.3376526630018}]
[]
[null,"The DNSP is expected to achieve a closing balance as close to zero as practicable in its DUoS unders and overs account in each forecast year in its annual pricing Proposals in the 2016–20 regulatory control period."]

{"sheet":"2018DistTarRebalCont","index":7,"n_rows":99,"n_cols":9,"rows_kept":99,"cut":false,"hidden":false,"merged":[]}
[null,{"$f":"\"Tariff Approval - \"&'Model update'!C3","v":"Tariff Approval - United Energy"}]
[]
[null,{"$f":"'Model update'!C5&\" DISTRIBUTION TARIFF REBALANCING CONTROL\"","v":"2018 DISTRIBUTION TARIFF REBALANCING CONTROL"}]
[]
[]
[null,"Distribution tariff rebalancing control"]
[]
[null,{"$f":"\"CPI \"&'Model update'!$C$5","v":"CPI 2018"},{"$f":"'2018DistRevCapForm'!C22","v":1.9337016574585641E-2}]
[null,{"$f":"\"X \"& 'Model update'!$C$5","v":"X 2018"},{"$f":"MIN('2018DistRevCapForm'!C23,0)","v":-3.1600000000000003E-2}]
[null,{"$f":"\"St \"&'Model update'!$C$5","v":"St 2018"},{"$f":"'2018DistRevCapForm'!C24","v":2.2767038821999375E-2}]
[null,{"$f":"\"It \"&'Model update'!$C$5","v":"It 2018"},{"$f":"('2018DistRevCapForm'!C15-'2018DistRevCapForm'!H15)/Prop2018DistTar!$BV$66","v":1.1382372243487178E-3}]
[null,{"$f":"\"Tt \"&'Model update'!$C$5","v":"Tt 2018"},{"$f":"('2018DistRevCapForm'!C16-'2018DistRevCapForm'!H16)/Prop2018DistTar!$BV$66","v":1.2275272029070076E-3}]
[null,{"$f":"\"Bt \"&'Model update'!$C$5","v":"Bt 2018"},{"$f":"('2018DistRevCapForm'!C17-'2018DistRevCapForm'!H17)/Prop2018DistTar!$BV$66","v":-2.1583105819765989E-2}]
[]
[]
[null,null,{"$f":"(1+C8)*(1-C9)*(1+0.02)*(1+C10)+SUM(C11:C13)","v":1.0777811345933841}]
[]
[]
[]
[null,"Rebalancing control summary",{"$f":"\"Pt-1*(Qt \" &'Model update'!$C$5&\")\"","v":"Pt-1*(Qt 2018)"},{"$f":"\"Pt-1*(Qt \" &'Model update'!$C$5&\")\"","v":"Pt-1*(Qt 2018)"}]
[null,"Tariff Class (Input Class Name)","Existing ($)","Proposed ($)","Movement"]
[null,"Low Voltage Small",{"$f":"IF(B22=\"\",\"\",SUMIF($B$39:$B$98,$B22,$I$39:$I$98))","v":183488252.08289012},{"$f":"IF(B22=\"\",\"\",SUMIF($B$39:$B$98,$B22,$F$39:$F$98))","v":189365206.18115968},{"$f":"IF(B22=\"\",\"\",D22/C22)","v":1.0320290483535406},{"$f":"IF(B22=\"\",\"\",IF(E22<$C$16,\"COMPLIANT\",\"BREACHED\"))","v":"COMPLIANT"}]
[null,"Low Voltage Medium",98268899.480275288,104216589.12947813,1.060524638829365,{"$f":"IF(B23=\"\",\"\",IF(E23<$C$16,\"COMPLIANT\",\"BREACHED\"))","v":"COMPLIANT"}]
[null,"Low Voltage Large",89884032.66958864,96868510.709358588,1.0777054370206631,"COMPLIANT"]
[null,"High Voltage Large",19137380.913576808,20518463.875247203,1.0721667697323514,"COMPLIANT"]
[null,"Subtransmission Large",176844.21890252756,189609.73882295011,1.0721851129748188,"COMPLIANT"]
[null,null,"","","",""]
[null,null,"","","",""]
[null,null,"","","",""]
[null,null,"","","",""]
[null,null,"","","",""]
[null,null,"","","",""]
[null,null,"","","",""]
[null,"Check Total",{"$f":"IF(ABS(SUM(C22:C33)-I99)<0.01,\"Ok\",\"Error\")","v":"Ok"},{"$f":"IF(ABS(SUM(D22:D33)-F99)<0.01,\"Ok\",\"Error\")","v":"Ok"}]
[null,null,{"$f":"IF(ABS(SUM(C22:C33)-Prop2018DistTar!BV66)<0.01,\"Ok\",\"Error\")","v":"Ok"},{"$f":"IF(ABS(SUM(D22:D33)-Prop2018DistTar!BG66)<0.01,\"Ok\",\"Error\")","v":"Ok"}]
[]
[null,null,null,null,null,{"$f":"\"Forecast Revenue (Pt \"&'Model update'!$C$5&\")*(Qt \" &'Model update'!$C$5&\")\"","v":"Forecast Revenue (Pt 2018)*(Qt 2018)"},null,null,{"$f":"\"Revenue (Pt-1 \"&'Model update'!$C$8&\")*(Qt \" &'Model update'!$C$5&\")\"","v":"Revenue (Pt-1 2017)*(Qt 2018)"}]
["New Tariff Test","Destination tariff class","Source tariff class","Proposed tariff","Existing tariff","PropRev\nTotal",null,null,"ExistRev\nTotal"]
[{"$f":"OR(EXACT(D39,Prop2018DistTar!C$6:C$65))","v":true},"Low Voltage Small","Low Voltage Small",{"$f":"IF(Prop2018DistTar!B6=\"\",\"\",Prop2018DistTar!B6)","v":"Low voltage small 1 rate"},{"$f":"IF(Prop2018DistTar!C6=\"\",\"\",Prop2018DistTar!C6)","v":"Low voltage small 1 rate"},{"$f":"Prop2018DistTar!BG6","v":167870430.88430089},null,null,{"$f":"Prop2018DistTar!BV6","v":162659714.00348049}]
[{"$f":"OR(EXACT(D40,Prop2018DistTar!C$6:C$65))","v":true},"Low Voltage Small","Low Voltage Small",{"$f":"IF(Prop2018DistTar!B7=\"\",\"\",Prop2018DistTar!B7)","v":"Winter economy tariff"},{"$f":"IF(Prop2018DistTar!C7=\"\",\"\",Prop2018DistTar!C7)","v":"Winter economy tariff"},{"$f":"Prop2018DistTar!BG7","v":45548.186813535198},null,null,{"$f":"Prop2018DistTar!BV7","v":44139.348135401829}]
[{"$f":"OR(EXACT(D41,Prop2018DistTar!C$6:C$65))","v":true},"Low Voltage Medium","Low Voltage Medium",{"$f":"IF(Prop2018DistTar!B8=\"\",\"\",Prop2018DistTar!B8)","v":"Reverse cycle airconditioning time of use"},{"$f":"IF(Prop2018DistTar!C8=\"\",\"\",Prop2018DistTar!C8)","v":"Reverse cycle airconditioning time of use"},{"$f":"Prop2018DistTar!BG8","v":0},null,null,{"$f":"Prop2018DistTar!BV8","v":0}]
[{"$f":"OR(EXACT(D42,Prop2018DistTar!C$6:C$65))","v":true},"Low Voltage Small","Low Voltage Small",{"$f":"IF(Prop2018DistTar!B9=\"\",\"\",Prop2018DistTar!B9)","v":"Low voltage small 2 rate"},{"$f":"IF(Prop2018DistTar!C9=\"\",\"\",Prop2018DistTar!C9)","v":"Low voltage small 2 rate"},{"$f":"Prop2018DistTar!BG9","v":1408335.926869306},null,null,{"$f":"Prop2018DistTar!BV9","v":1364739.3377201112}]
[{"$f":"OR(EXACT(D43,Prop2018DistTar!C$6:C$65))","v":true},"Low Voltage Small","Low Voltage Small",{"$f":"IF(Prop2018DistTar!B10=\"\",\"\",Prop2018DistTar!B10)","v":"Dedicated circuit"},{"$f":"IF(Prop2018DistTar!C10=\"\",\"\",Prop2018DistTar!C10)","v":"Dedicated circuit"},{"$f":"Prop2018DistTar!BG10","v":1836706.3586563501},null,null,{"$f":"Prop2018DistTar!BV10","v":1779636.2491175716}]
[{"$f":"OR(EXACT(D44,Prop2018DistTar!C$6:C$65))","v":true},"Low Voltage Medium","Low Voltage Medium",{"$f":"IF(Prop2018DistTar!B11=\"\",\"\",Prop2018DistTar!B11)","v":"Low voltage medium 1 rate"},{"$f":"IF(Prop2018DistTar!C11=\"\",\"\",Prop2018DistTar!C11)","v":"Low voltage medium 1 rate"},{"$f":"Prop2018DistTar!BG11","v":31925705.487857416},null,null,{"$f":"Prop2018DistTar!BV11","v":30103783.00943011}]
[{"$f":"OR(EXACT(D45,Prop2018DistTar!C$6:C$65))","v":true},"Low Voltage Medium","Low Voltage Medium",{"$f":"IF(Prop2018DistTar!B12=\"\",\"\",Prop2018DistTar!B12)","v":"Low voltage medium 2 rate 5 day"},{"$f":"IF(Prop2018DistTar!C12=\"\",\"\",Prop2018DistTar!C12)","v":"Low voltage medium 2 rate 5 day"},{"$f":"Prop2018DistTar!BG12","v":14093052.112750726},null,null,{"$f":"Prop2018DistTar!BV12","v":13289230.201937763}]
[{"$f":"OR(EXACT(D46,Prop2018DistTar!C$6:C$65))","v":true},"Low Voltage Medium","Low Voltage Medium",{"$f":"IF(Prop2018DistTar!B13=\"\",\"\",Prop2018DistTar!B13)","v":"Low voltage medium 2 rate 7 day"},{"$f":"IF(Prop2018DistTar!C13=\"\",\"\",Prop2018DistTar!C13)","v":"Low voltage medium 2 rate 7 day"},{"$f":"Prop2018DistTar!BG13","v":5690075.9554853961},null,null,{"$f":"Prop2018DistTar!BV13","v":5365595.7943668524}]
[{"$f":"OR(EXACT(D47,Prop2018DistTar!C$6:C$65))","v":true},"Low Voltage Small","Low Voltage Small",{"$f":"IF(Prop2018DistTar!B14=\"\",\"\",Prop2018DistTar!B14)","v":"Unmetered supplies"},{"$f":"IF(Prop2018DistTar!C14=\"\",\"\",Prop2018DistTar!C14)","v":"Unmetered supplies"},{"$f":"Prop2018DistTar!BG14","v":3049796.29106045},null,null,{"$f":"Prop2018DistTar!BV14","v":2955428.4155015941}]
[{"$f":"OR(EXACT(D48,Prop2018DistTar!C$6:C$65))","v":true},"Low Voltage Large","Low Voltage Large",{"$f":"IF(Prop2018DistTar!B15=\"\",\"\",Prop2018DistTar!B15)","v":"Low voltage large 1 rate"},{"$f":"IF(Prop2018DistTar!C15=\"\",\"\",Prop2018DistTar!C15)","v":"Low voltage large 1 rate"},{"$f":"Prop2018DistTar!BG15","v":74586.203939660365},null,null,{"$f":"Prop2018DistTar!BV15","v":69200.318980959128}]
[{"$f":"OR(EXACT(D49,Prop2018DistTar!C$6:C$65))","v":true},"Low Voltage Large","Low Voltage Large",{"$f":"IF(Prop2018DistTar!B16=\"\",\"\",Prop2018DistTar!B16)","v":"Low voltage large 2 rate"},{"$f":"IF(Prop2018DistTar!C16=\"\",\"\",Prop2018DistTar!C16)","v":"Low voltage large 2 rate"},{"$f":"Prop2018DistTar!BG16","v":213141.68964520434},null,null,{"$f":"Prop2018DistTar!BV16","v":197764.30375899849}]
[{"$f":"OR(EXACT(D50,Prop2018DistTar!C$6:C$65))","v":true},"Low Voltage Medium","Low Voltage Medium",{"$f":"IF(Prop2018DistTar!B17=\"\",\"\",Prop2018DistTar!B17)","v":"Low voltage KW time of use"},{"$f":"IF(Prop2018DistTar!C17=\"\",\"\",Prop2018DistTar!C17)","v":"Low voltage KW time of use"},{"$f":"Prop2018DistTar!BG17","v":893901.69422450475},null,null,{"$f":"Prop2018DistTar!BV17","v":842910.94457170996}]
[{"$f":"OR(EXACT(D51,Prop2018DistTar!C$6:C$65))","v":true},"Low Voltage Medium","Low Voltage Medium",{"$f":"IF(Prop2018DistTar!B18=\"\",\"\",Prop2018DistTar!B18)","v":"Low voltage KW time of use - HOT"},{"$f":"IF(Prop2018DistTar!C18=\"\",\"\",Prop2018DistTar!C18)","v":"Low voltage KW time of use - HOT"},{"$f":"Prop2018DistTar!BG18","v":112323.15041342471},null,null,{"$f":"Prop2018DistTar!BV18","v":105913.67369164532}]
[{"$f":"OR(EXACT(D52,Prop2018DistTar!C$6:C$65))","v":true},"Low Voltage Large","Low Voltage Large",{"$f":"IF(Prop2018DistTar!B19=\"\",\"\",Prop2018DistTar!B19)","v":"Low voltage large KVA time of use"},{"$f":"IF(Prop2018DistTar!C19=\"\",\"\",Prop2018DistTar!C19)","v":"Low voltage large KVA time of use"},{"$f":"Prop2018DistTar!BG19","v":96580782.815773726},null,null,{"$f":"Prop2018DistTar!BV19","v":89617068.046848685}]
[{"$f":"OR(EXACT(D53,Prop2018DistTar!C$6:C$65))","v":true},"Low Voltage Large","Low Voltage Large",{"$f":"IF(Prop2018DistTar!B20=\"\",\"\",Prop2018DistTar!B20)","v":"Low voltage large KVA time of use - HOT"},{"$f":"IF(Prop2018DistTar!C20=\"\",\"\",Prop2018DistTar!C20)","v":"Low voltage large KVA time of use - HOT"},{"$f":"Prop2018DistTar!BG20","v":0},null,null,{"$f":"Prop2018DistTar!BV20","v":0}]
[{"$f":"OR(EXACT(D54,Prop2018DistTar!C$6:C$65))","v":true},"High Voltage Large","High Voltage Large",{"$f":"IF(Prop2018DistTar!B21=\"\",\"\",Prop2018DistTar!B21)","v":"High voltage KVA time of use"},{"$f":"IF(Prop2018DistTar!C21=\"\",\"\",Prop2018DistTar!C21)","v":"High voltage KVA time of use"},{"$f":"Prop2018DistTar!BG21","v":20518463.875247203},null,null,{"$f":"Prop2018DistTar!BV21","v":19137380.913576808}]
[{"$f":"OR(EXACT(D55,Prop2018DistTar!C$6:C$65))","v":true},"High Voltage Large","High Voltage Large",{"$f":"IF(Prop2018DistTar!B22=\"\",\"\",Prop2018DistTar!B22)","v":"High voltage KVA time of use - HOT"},{"$f":"IF(Prop2018DistTar!C22=\"\",\"\",Prop2018DistTar!C22)","v":"High voltage KVA time of use - HOT"},{"$f":"Prop2018DistTar!BG22","v":0},null,null,{"$f":"Prop2018DistTar!BV22","v":0}]
[{"$f":"OR(EXACT(D56,Prop2018DistTar!C$6:C$65))","v":true},"Subtransmission Large","Subtransmission Large",{"$f":"IF(Prop2018DistTar!B23=\"\",\"\",Prop2018DistTar!B23)","v":"Subtransmission KVA time of use"},{"$f":"IF(Prop2018DistTar!C23=\"\",\"\",Prop2018DistTar!C23)","v":"Subtransmission KVA time of use"},{"$f":"Prop2018DistTar!BG23","v":189609.73882295011},null,null,{"$f":"Prop2018DistTar!BV23","v":176844.21890252756}]
[{"$f":"OR(EXACT(D57,Prop2018DistTar!C$6:C$65))","v":true},"Low Voltage Small","Low Voltage Small",{"$f":"IF(Prop2018DistTar!B24=\"\",\"\",Prop2018DistTar!B24)","v":"TOD"},{"$f":"IF(Prop2018DistTar!C24=\"\",\"\",Prop2018DistTar!C24)","v":"TOD"},{"$f":"Prop2018DistTar!BG24","v":13065382.905632813},null,null,{"$f":"Prop2018DistTar!BV24","v":12660333.626883334}]
[{"$f":"OR(EXACT(D58,Prop2018DistTar!C$6:C$65))","v":true},"Low Voltage Small","Low Voltage Small",{"$f":"IF(Prop2018DistTar!B25=\"\",\"\",Prop2018DistTar!B25)","v":"TOD9"},{"$f":"IF(Prop2018DistTar!C25=\"\",\"\",Prop2018DistTar!C25)","v":"TOD9"},{"$f":"Prop2018DistTar!BG25","v":561104.40556637256},null,null,{"$f":"Prop2018DistTar!BV25","v":543710.93100807595}]
[{"$f":"OR(EXACT(D59,Prop2018DistTar!C$6:C$65))","v":true},"Low Voltage Medium","Low Voltage Medium",{"$f":"IF(Prop2018DistTar!B26=\"\",\"\",Prop2018DistTar!B26)","v":"TOU"},{"$f":"IF(Prop2018DistTar!C26=\"\",\"\",Prop2018DistTar!C26)","v":"TOU"},{"$f":"Prop2018DistTar!BG26","v":1448260.1416714857},null,null,{"$f":"Prop2018DistTar!BV26","v":1365697.7907843105}]
[{"$f":"OR(EXACT(D60,Prop2018DistTar!C$6:C$65))","v":true},"Low Voltage Small","Low Voltage Small",{"$f":"IF(Prop2018DistTar!B27=\"\",\"\",Prop2018DistTar!B27)","v":"TODFLEX"},{"$f":"IF(Prop2018DistTar!C27=\"\",\"\",Prop2018DistTar!C27)","v":"TODFLEX"},{"$f":"Prop2018DistTar!BG27","v":720465.17417480156},null,null,{"$f":"Prop2018DistTar!BV27","v":698119.06007922767}]
[{"$f":"OR(EXACT(D61,Prop2018DistTar!C$6:C$65))","v":true},"Low Voltage Small","Low Voltage Small",{"$f":"IF(Prop2018DistTar!B28=\"\",\"\",Prop2018DistTar!B28)","v":"Low Voltage KW 1 rate"},{"$f":"IF(Prop2018DistTar!C28=\"\",\"\",Prop2018DistTar!C28)","v":"Low Voltage KW 1 rate"},{"$f":"Prop2018DistTar!BG28","v":807436.04808514041},null,null,{"$f":"Prop2018DistTar!BV28","v":782431.11096430838}]
[{"$f":"OR(EXACT(D62,Prop2018DistTar!C$6:C$65))","v":true},"Low Voltage Medium","Low Voltage Medium",{"$f":"IF(Prop2018DistTar!B29=\"\",\"\",Prop2018DistTar!B29)","v":"Low voltage medium KW time of use (opt-in)"},{"$f":"IF(Prop2018DistTar!C29=\"\",\"\",Prop2018DistTar!C29)","v":"Low voltage medium KW time of use (opt-in)"},{"$f":"Prop2018DistTar!BG29","v":1252298.5938153614},null,null,{"$f":"Prop2018DistTar!BV29","v":1180907.4838893113}]
[{"$f":"OR(EXACT(D63,Prop2018DistTar!C$6:C$65))","v":true},"Low Voltage Medium","Low Voltage Medium",{"$f":"IF(Prop2018DistTar!B30=\"\",\"\",Prop2018DistTar!B30)","v":"Low voltage medium KW 1 rate (mandatory)"},{"$f":"IF(Prop2018DistTar!C30=\"\",\"\",Prop2018DistTar!C30)","v":"Low voltage medium KW 1 rate (mandatory)"},{"$f":"Prop2018DistTar!BG30","v":48800971.993259802},null,null,{"$f":"Prop2018DistTar!BV30","v":46014860.581603587}]
[{"$f":"OR(EXACT(D64,Prop2018DistTar!C$6:C$65))","v":true},null,null,{"$f":"IF(Prop2018DistTar!B31=\"\",\"\",Prop2018DistTar!B31)","v":""},{"$f":"IF(Prop2018DistTar!C31=\"\",\"\",Prop2018DistTar!C31)","v":""},{"$f":"Prop2018DistTar!BG31","v":0},null,null,{"$f":"Prop2018DistTar!BV31","v":0}]
[{"$f":"OR(EXACT(D65,Prop2018DistTar!C$6:C$65))","v":true},null,null,{"$f":"IF(Prop2018DistTar!B32=\"\",\"\",Prop2018DistTar!B32)","v":""},{"$f":"IF(Prop2018DistTar!C32=\"\",\"\",Prop2018DistTar!C32)","v":""},{"$f":"Prop2018DistTar!BG32","v":0},null,null,{"$f":"Prop2018DistTar!BV32","v":0}]
[{"$f":"OR(EXACT(D66,Prop2018DistTar!C$6:C$65))","v":true},null,null,{"$f":"IF(Prop2018DistTar!B33=\"\",\"\",Prop2018DistTar!B33)","v":""},{"$f":"IF(Prop2018DistTar!C33=\"\",\"\",Prop2018DistTar!C33)","v":""},{"$f":"Prop2018DistTar!BG33","v":0},null,null,{"$f":"Prop2018DistTar!BV33","v":0}]
[{"$f":"OR(EXACT(D67,Prop2018DistTar!C$6:C$65))","v":true},null,null,{"$f":"IF(Prop2018DistTar!B34=\"\",\"\",Prop2018DistTar!B34)","v":""},{"$f":"IF(Prop2018DistTar!C34=\"\",\"\",Prop2018DistTar!C34)","v":""},{"$f":"Prop2018DistTar!BG34","v":0},null,null,{"$f":"Prop2018DistTar!BV34","v":0}]
[{"$f":"OR(EXACT(D68,Prop2018DistTar!C$6:C$65))","v":true},null,null,{"$f":"IF(Prop2018DistTar!B35=\"\",\"\",Prop2018DistTar!B35)","v":""},{"$f":"IF(Prop2018DistTar!C35=\"\",\"\",Prop2018DistTar!C35)","v":""},{"$f":"Prop2018DistTar!BG35","v":0},null,null,{"$f":"Prop2018DistTar!BV35","v":0}]
[{"$f":"OR(EXACT(D69,Prop2018DistTar!C$6:C$65))","v":true},null,null,{"$f":"IF(Prop2018DistTar!B36=\"\",\"\",Prop2018DistTar!B36)","v":""},{"$f":"IF(Prop2018DistTar!C36=\"\",\"\",Prop2018DistTar!C36)","v":""},{"$f":"Prop2018DistTar!BG36","v":0},null,null,{"$f":"Prop2018DistTar!BV36","v":0}]
[{"$f":"OR(EXACT(D70,Prop2018DistTar!C$6:C$65))","v":true},null,null,{"$f":"IF(Prop2018DistTar!B37=\"\",\"\",Prop2018DistTar!B37)","v":""},{"$f":"IF(Prop2018DistTar!C37=\"\",\"\",Prop2018DistTar!C37)","v":""},{"$f":"Prop2018DistTar!BG37","v":0},null,null,{"$f":"Prop2018DistTar!BV37","v":0}]
[{"$f":"OR(EXACT(D71,Prop2018DistTar!C$6:C$65))","v":true},null,null,{"$f":"IF(Prop2018DistTar!B38=\"\",\"\",Prop2018DistTar!B38)","v":""},{"$f":"IF(Prop2018DistTar!C38=\"\",\"\",Prop2018DistTar!C38)","v":""},{"$f":"Prop2018DistTar!BG38","v":0},null,null,{"$f":"Prop2018DistTar!BV38","v":0}]
[{"$f":"OR(EXACT(D72,Prop2018DistTar!C$6:C$65))","v":true},null,null,{"$f":"IF(Prop2018DistTar!B39=\"\",\"\",Prop2018DistTar!B39)","v":""},{"$f":"IF(Prop2018DistTar!C39=\"\",\"\",Prop2018DistTar!C39)","v":""},{"$f":"Prop2018DistTar!BG39","v":0},null,null,{"$f":"Prop2018DistTar!BV39","v":0}]
[{"$f":"OR(EXACT(D73,Prop2018DistTar!C$6:C$65))","v":true},null,null,{"$f":"IF(Prop2018DistTar!B40=\"\",\"\",Prop2018DistTar!B40)","v":""},{"$f":"IF(Prop2018DistTar!C40=\"\",\"\",Prop2018DistTar!C40)","v":""},{"$f":"Prop2018DistTar!BG40","v":0},null,null,{"$f":"Prop2018DistTar!BV40","v":0}]
[{"$f":"OR(EXACT(D74,Prop2018DistTar!C$6:C$65))","v":true},null,null,{"$f":"IF(Prop2018DistTar!B41=\"\",\"\",Prop2018DistTar!B41)","v":""},{"$f":"IF(Prop2018DistTar!C41=\"\",\"\",Prop2018DistTar!C41)","v":""},{"$f":"Prop2018DistTar!BG41","v":0},null,null,{"$f":"Prop2018DistTar!BV41","v":0}]
[{"$f":"OR(EXACT(D75,Prop2018DistTar!C$6:C$65))","v":true},null,null,{"$f":"IF(Prop2018DistTar!B42=\"\",\"\",Prop2018DistTar!B42)","v":""},{"$f":"IF(Prop2018DistTar!C42=\"\",\"\",Prop2018DistTar!C42)","v":""},{"$f":"Prop2018DistTar!BG42","v":0},null,null,{"$f":"Prop2018DistTar!BV42","v":0}]
[{"$f":"OR(EXACT(D76,Prop2018DistTar!C$6:C$65))","v":true},null,null,{"$f":"IF(Prop2018DistTar!B43=\"\",\"\",Prop2018DistTar!B43)","v":""},{"$f":"IF(Prop2018DistTar!C43=\"\",\"\",Prop2018DistTar!C43)","v":""},{"$f":"Prop2018DistTar!BG43","v":0},null,null,{"$f":"Prop2018DistTar!BV43","v":0}]
[{"$f":"OR(EXACT(D77,Prop2018DistTar!C$6:C$65))","v":true},null,null,{"$f":"IF(Prop2018DistTar!B44=\"\",\"\",Prop2018DistTar!B44)","v":""},{"$f":"IF(Prop2018DistTar!C44=\"\",\"\",Prop2018DistTar!C44)","v":""},{"$f":"Prop2018DistTar!BG44","v":0},null,null,{"$f":"Prop2018DistTar!BV44","v":0}]
[{"$f":"OR(EXACT(D78,Prop2018DistTar!C$6:C$65))","v":true},null,null,{"$f":"IF(Prop2018DistTar!B45=\"\",\"\",Prop2018DistTar!B45)","v":""},{"$f":"IF(Prop2018DistTar!C45=\"\",\"\",Prop2018DistTar!C45)","v":""},{"$f":"Prop2018DistTar!BG45","v":0},null,null,{"$f":"Prop2018DistTar!BV45","v":0}]
[{"$f":"OR(EXACT(D79,Prop2018DistTar!C$6:C$65))","v":true},null,null,{"$f":"IF(Prop2018DistTar!B46=\"\",\"\",Prop2018DistTar!B46)","v":""},{"$f":"IF(Prop2018DistTar!C46=\"\",\"\",Prop2018DistTar!C46)","v":""},{"$f":"Prop2018DistTar!BG46","v":0},null,null,{"$f":"Prop2018DistTar!BV46","v":0}]
[{"$f":"OR(EXACT(D80,Prop2018DistTar!C$6:C$65))","v":true},null,null,{"$f":"IF(Prop2018DistTar!B47=\"\",\"\",Prop2018DistTar!B47)","v":""},{"$f":"IF(Prop2018DistTar!C47=\"\",\"\",Prop2018DistTar!C47)","v":""},{"$f":"Prop2018DistTar!BG47","v":0},null,null,{"$f":"Prop2018DistTar!BV47","v":0}]
[{"$f":"OR(EXACT(D81,Prop2018DistTar!C$6:C$65))","v":true},null,null,{"$f":"IF(Prop2018DistTar!B48=\"\",\"\",Prop2018DistTar!B48)","v":""},{"$f":"IF(Prop2018DistTar!C48=\"\",\"\",Prop2018DistTar!C48)","v":""},{"$f":"Prop2018DistTar!BG48","v":0},null,null,{"$f":"Prop2018DistTar!BV48","v":0}]
[{"$f":"OR(EXACT(D82,Prop2018DistTar!C$6:C$65))","v":true},null,null,{"$f":"IF(Prop2018DistTar!B49=\"\",\"\",Prop2018DistTar!B49)","v":""},{"$f":"IF(Prop2018DistTar!C49=\"\",\"\",Prop2018DistTar!C49)","v":""},{"$f":"Prop2018DistTar!BG49","v":0},null,null,{"$f":"Prop2018DistTar!BV49","v":0}]
[{"$f":"OR(EXACT(D83,Prop2018DistTar!C$6:C$65))","v":true},null,null,{"$f":"IF(Prop2018DistTar!B50=\"\",\"\",Prop2018DistTar!B50)","v":""},{"$f":"IF(Prop2018DistTar!C50=\"\",\"\",Prop2018DistTar!C50)","v":""},{"$f":"Prop2018DistTar!BG50","v":0},null,null,{"$f":"Prop2018DistTar!BV50","v":0}]
[{"$f":"OR(EXACT(D84,Prop2018DistTar!C$6:C$65))","v":true},null,null,{"$f":"IF(Prop2018DistTar!B51=\"\",\"\",Prop2018DistTar!B51)","v":""},{"$f":"IF(Prop2018DistTar!C51=\"\",\"\",Prop2018DistTar!C51)","v":""},{"$f":"Prop2018DistTar!BG51","v":0},null,null,{"$f":"Prop2018DistTar!BV51","v":0}]
[{"$f":"OR(EXACT(D85,Prop2018DistTar!C$6:C$65))","v":true},null,null,{"$f":"IF(Prop2018DistTar!B52=\"\",\"\",Prop2018DistTar!B52)","v":""},{"$f":"IF(Prop2018DistTar!C52=\"\",\"\",Prop2018DistTar!C52)","v":""},{"$f":"Prop2018DistTar!BG52","v":0},null,null,{"$f":"Prop2018DistTar!BV52","v":0}]
[{"$f":"OR(EXACT(D86,Prop2018DistTar!C$6:C$65))","v":true},null,null,{"$f":"IF(Prop2018DistTar!B53=\"\",\"\",Prop2018DistTar!B53)","v":""},{"$f":"IF(Prop2018DistTar!C53=\"\",\"\",Prop2018DistTar!C53)","v":""},{"$f":"Prop2018DistTar!BG53","v":0},null,null,{"$f":"Prop2018DistTar!BV53","v":0}]
[{"$f":"OR(EXACT(D87,Prop2018DistTar!C$6:C$65))","v":true},null,null,{"$f":"IF(Prop2018DistTar!B54=\"\",\"\",Prop2018DistTar!B54)","v":""},{"$f":"IF(Prop2018DistTar!C54=\"\",\"\",Prop2018DistTar!C54)","v":""},{"$f":"Prop2018DistTar!BG54","v":0},null,null,{"$f":"Prop2018DistTar!BV54","v":0}]
[{"$f":"OR(EXACT(D88,Prop2018DistTar!C$6:C$65))","v":true},null,null,{"$f":"IF(Prop2018DistTar!B55=\"\",\"\",Prop2018DistTar!B55)","v":""},{"$f":"IF(Prop2018DistTar!C55=\"\",\"\",Prop2018DistTar!C55)","v":""},{"$f":"Prop2018DistTar!BG55","v":0},null,null,{"$f":"Prop2018DistTar!BV55","v":0}]
[{"$f":"OR(EXACT(D89,Prop2018DistTar!C$6:C$65))","v":true},null,null,{"$f":"IF(Prop2018DistTar!B56=\"\",\"\",Prop2018DistTar!B56)","v":""},{"$f":"IF(Prop2018DistTar!C56=\"\",\"\",Prop2018DistTar!C56)","v":""},{"$f":"Prop2018DistTar!BG56","v":0},null,null,{"$f":"Prop2018DistTar!BV56","v":0}]
[{"$f":"OR(EXACT(D90,Prop2018DistTar!C$6:C$65))","v":true},null,null,{"$f":"IF(Prop2018DistTar!B57=\"\",\"\",Prop2018DistTar!B57)","v":""},{"$f":"IF(Prop2018DistTar!C57=\"\",\"\",Prop2018DistTar!C57)","v":""},{"$f":"Prop2018DistTar!BG57","v":0},null,null,{"$f":"Prop2018DistTar!BV57","v":0}]
[{"$f":"OR(EXACT(D91,Prop2018DistTar!C$6:C$65))","v":true},null,null,{"$f":"IF(Prop2018DistTar!B58=\"\",\"\",Prop2018DistTar!B58)","v":""},{"$f":"IF(Prop2018DistTar!C58=\"\",\"\",Prop2018DistTar!C58)","v":""},{"$f":"Prop2018DistTar!BG58","v":0},null,null,{"$f":"Prop2018DistTar!BV58","v":0}]
[{"$f":"OR(EXACT(D92,Prop2018DistTar!C$6:C$65))","v":true},null,null,{"$f":"IF(Prop2018DistTar!B59=\"\",\"\",Prop2018DistTar!B59)","v":""},{"$f":"IF(Prop2018DistTar!C59=\"\",\"\",Prop2018DistTar!C59)","v":""},{"$f":"Prop2018DistTar!BG59","v":0},null,null,{"$f":"Prop2018DistTar!BV59","v":0}]
[{"$f":"OR(EXACT(D93,Prop2018DistTar!C$6:C$65))","v":true},null,null,{"$f":"IF(Prop2018DistTar!B60=\"\",\"\",Prop2018DistTar!B60)","v":""},{"$f":"IF(Prop2018DistTar!C60=\"\",\"\",Prop2018DistTar!C60)","v":""},{"$f":"Prop2018DistTar!BG60","v":0},null,null,{"$f":"Prop2018DistTar!BV60","v":0}]
[{"$f":"OR(EXACT(D94,Prop2018DistTar!C$6:C$65))","v":true},null,null,{"$f":"IF(Prop2018DistTar!B61=\"\",\"\",Prop2018DistTar!B61)","v":""},{"$f":"IF(Prop2018DistTar!C61=\"\",\"\",Prop2018DistTar!C61)","v":""},{"$f":"Prop2018DistTar!BG61","v":0},null,null,{"$f":"Prop2018DistTar!BV61","v":0}]
[{"$f":"OR(EXACT(D95,Prop2018DistTar!C$6:C$65))","v":true},null,null,{"$f":"IF(Prop2018DistTar!B62=\"\",\"\",Prop2018DistTar!B62)","v":""},{"$f":"IF(Prop2018DistTar!C62=\"\",\"\",Prop2018DistTar!C62)","v":""},{"$f":"Prop2018DistTar!BG62","v":0},null,null,{"$f":"Prop2018DistTar!BV62","v":0}]
[{"$f":"OR(EXACT(D96,Prop2018DistTar!C$6:C$65))","v":true},null,null,{"$f":"IF(Prop2018DistTar!B63=\"\",\"\",Prop2018DistTar!B63)","v":""},{"$f":"IF(Prop2018DistTar!C63=\"\",\"\",Prop2018DistTar!C63)","v":""},{"$f":"Prop2018DistTar!BG63","v":0},null,null,{"$f":"Prop2018DistTar!BV63","v":0}]
[{"$f":"OR(EXACT(D97,Prop2018DistTar!C$6:C$65))","v":true},null,null,{"$f":"IF(Prop2018DistTar!B64=\"\",\"\",Prop2018DistTar!B64)","v":""},{"$f":"IF(Prop2018DistTar!C64=\"\",\"\",Prop2018DistTar!C64)","v":""},{"$f":"Prop2018DistTar!BG64","v":0},null,null,{"$f":"Prop2018DistTar!BV64","v":0}]
[{"$f":"OR(EXACT(D98,Prop2018DistTar!C$6:C$65))","v":true},null,null,{"$f":"IF(Prop2018DistTar!B65=\"\",\"\",Prop2018DistTar!B65)","v":""},{"$f":"IF(Prop2018DistTar!C65=\"\",\"\",Prop2018DistTar!C65)","v":""},{"$f":"Prop2018DistTar!BG65","v":0},null,null,{"$f":"Prop2018DistTar!BV65","v":0}]
[null,null,null,null,null,{"$f":"SUM(F39:F98)","v":411158379.63406646},null,null,{"$f":"SUM(I39:I98)","v":390955409.36523342}]

{"sheet":"Est2017DistRev","index":8,"n_rows":66,"n_cols":45,"rows_kept":66,"cut":false,"hidden":false,"merged":[]}
[null,{"$f":"\"Tariff Approval - \"&'Model update'!C3","v":"Tariff Approval - United Energy"}]
[]
[null,{"$f":"\"ESTIMATED \"&'Model update'!$C$8&\" Distribution Revenue\"","v":"ESTIMATED 2017 Distribution Revenue"}]
[null,null,null,{"$f":"\"Current Distribution Tariffs (Pt-1) for \"&'Model update'!$C$8","v":"Current Distribution Tariffs (Pt-1) for 2017"},null,null,null,null,null,null,null,null,null,null,null,null,null,{"$f":"\" Estimated Distribution Quantities for \"&'Model update'!$C$8&\" (Qt-1)\"","v":" Estimated Distribution Quantities for 2017 (Qt-1)"},null,null,null,null,null,null,null,null,null,null,null,null,null,{"$f":"\"Estimated Revenue (Pt-1 \"&'Model update'!$C$8&\")*(Qt-1 \" &'Model update'!$C$8&\")\"","v":"Estimated Revenue (Pt-1 2017)*(Qt-1 2017)"}]
[null,{"$f":"\"Tariffs \"&'Model update'!C8","v":"Tariffs 2017"},null,"Current\nFixed","\nCurrentPkBlk1","\nCurrentPkBlk2","\nCurrent PkBlk3","\nCurrent PkBlk4","\nCurrent OPkBlk1","\nCurrent OPkBlk2","\nCurrent OPkBlk3","\nCurrent OPkBlk4","\nCurrent DemBlk1","\nCurrent DemBlk2","\nCurrent DemBlk3","\nCurrent DemBlk4",null,"EstVol\nFixed","EstVol\nPkBlk1","EstVol\nPkBlk2","EstVol\nPkBlk3","EstVol\nPkBlk4","EstVol\nOPkBlk1","EstVol\nOPkBlk2","EstVol\nOPkBlk3","EstVol\nOPkBlk4","EstVol\nDemBlk1","EstVol\nDemBlk2","EstVol\nDemBlk3","EstVol\nDemBlk4",null,"EstRev\nFixed","EstRev\nPkBlk1","EstRev\nPkBlk2","EstRev\nPkBlk3","EstRev\nPkBlk4","EstRev\nOPkBlk1","EstRev\nOPkBlk2","EstRev\nOPkBlk3","EstRev\nOPkBlk4","EstRev\nDemBlk1","EstRev\nDemBlk2","EstRev\nDemBlk3","EstRev\nDemBlk4","EstRev\nTotal"]
[null,{"$f":"Prop2018DistTar!B6","v":"Low voltage small 1 rate"},null,6.6520000000000001,8.202,0,0,5.28,0,0,0,0,0,0,0,0,null,201584381.14774334,908301740.93542182,0,0,1512903696.7798095,0,0,0,0,0,0,0,null,null,{"$f":"D6/100*R6","v":13409393.033947887},{"$f":"E6/100*S6","v":74498908.791523293},{"$f":"F6/100*T6","v":0},{"$f":"G6/100*U6","v":0},{"$f":"H6/100*V6","v":79881315.189973935},{"$f":"I6/100*W6","v":0},{"$f":"J6/100*X6","v":0},{"$f":"K6/100*Y6","v":0},{"$f":"L6/100*Z6","v":0},{"$f":"M6/100*AA6","v":0},{"$f":"N6/100*AB6","v":0},{"$f":"O6/100*AC6","v":0},{"$f":"P6/100*AD6","v":0},{"$f":"SUM(AF6:AR6)","v":167789617.01544511}]
[null,{"$f":"Prop2018DistTar!B7","v":"Winter economy tariff"},null,8.5670000000000002,6.3890000000000002,0,0,4.734,1.774,0,0,0,0,0,0,0,null,48925.374102868365,190882.73431960001,0,0,434825.1493697461,0,0,0,0,0,0,0,null,null,4191.4367993927326,12195.497895679246,0,0,20584.622571163782,0,0,0,0,0,0,0,0,36971.557266235759]
[null,{"$f":"Prop2018DistTar!B8","v":"Reverse cycle airconditioning time of use"},null,0,0,0,5.5529999999999999,0,0,1.3959999999999999,1.371,0,0,69.766999999999996,0,0,null,0,0,0,0,0,0,0,0,0,0,0,0,null,null,0,0,0,0,0,0,0,0,0,0,0,0,0,0]
[null,{"$f":"Prop2018DistTar!B9","v":"Low voltage small 2 rate"},null,13.586,0,0,9.7509999999999994,0,0,7.3959999999999999,1.6910000000000001,0,0,0,0,0,null,1561827.9666133672,0,0,4402929.9605265837,0,0,7259168.6504886504,15381833.08293198,0,0,0,0,null,null,212189.94754409208,0,0,429329.70045094716,0,0,536888.11339014058,260106.79743237983,0,0,0,0,0,1438514.5588175596]
[null,{"$f":"Prop2018DistTar!B10","v":"Dedicated circuit"},null,0,0,0,0,0,0,0,1.871,0,0,0,0,0,null,667.9000000000002,0,0,0,0,0,0,98711981.428355873,0,0,0,0,null,null,0,0,0,0,0,0,0,1846901.1725245384,0,0,0,0,0,1846901.1725245384]
[null,{"$f":"Prop2018DistTar!B11","v":"Low voltage medium 1 rate"},null,10.987,9.657,0,0,6.0259999999999998,0,0,0,0,0,0,0,0,null,11864291.38330999,155269969.61677647,0,0,233793484.4810552,0,0,4,0,0,0,0,null,null,1303529.6942842687,14994420.965892104,0,0,14088395.374828387,0,0,0,0,0,0,0,0,30386346.035004761]
[null,{"$f":"Prop2018DistTar!B12","v":"Low voltage medium 2 rate 5 day"},null,21.03,0,0,10.212,0,0,7.6529999999999996,1.907,0,0,0,0,0,null,3762110.1235585408,0,0,52750944.988502115,0,0,73732469.07894589,78832208.16821827,0,0,0,0,null,null,791171.75898436119,0,0,5386926.5022258358,0,0,5642745.858611729,1503330.2097679225,0,0,0,0,0,13324174.329589847]
[null,{"$f":"Prop2018DistTar!B13","v":"Low voltage medium 2 rate 7 day"},null,22.387,0,0,9.7189999999999994,0,0,7.5259999999999998,1.7729999999999999,0,0,0,0,0,null,1819379.4139505203,0,0,22682579.555723179,0,0,34109458.955907114,15078122.186198868,0,0,0,0,null,null,407304.46940110304,0,0,2204519.9070207356,0,0,2567077.881021569,267335.10636130592,0,0,0,0,0,5446237.3638047138]
[null,{"$f":"Prop2018DistTar!B14","v":"Unmetered supplies"},null,0,0,0,8.1969999999999992,0,0,5.9960000000000004,1.478,0,0,0,0,0,null,1207792.6233333333,0,0,10724484.114269339,0,0,18203252.788676005,66747582.584354617,0,0,0,0,null,null,0,0,0,879085.96284665749,0,0,1091467.0372090135,986529.27059676126,0,0,0,0,0,2957082.270652432]
[null,{"$f":"Prop2018DistTar!B15","v":"Low voltage large 1 rate"},null,12.657,5.7960000000000003,0,0,4.5730000000000004,0,0,0,0,0,0,0,0,null,2527.3829423333332,597942.04072884563,0,0,774047.21553278971,0,0,0,0,0,0,0,null,null,319.89085901112998,34656.720680643899,0,0,35397.179166314476,0,0,0,0,0,0,0,0,70373.790705969499]
[null,{"$f":"Prop2018DistTar!B16","v":"Low voltage large 2 rate"},null,18.257999999999999,0,0,9.0739999999999998,0,0,7.2149999999999999,1.7270000000000001,0,0,0,0,0,null,8044.8880293333341,0,0,1050283.8111005772,0,0,1490905.349524372,1781684.6179572449,0,0,0,0,null,null,1468.8356563956802,0,0,95302.753019266383,0,0,107568.82096818343,30769.69335212162,0,0,0,0,0,235110.10299596711]
[null,{"$f":"Prop2018DistTar!B17","v":"Low voltage KW time of use"},null,0,0,0,8.4039999999999999,0,0,4.9240000000000004,1.9570000000000001,0,0,40.244999999999997,0,0,null,27933.548999999955,0,0,2946856.8788030911,0,0,4098087.3279617415,6713595.5614513857,0,0,681904.88486550353,0,null,null,0,0,0,247653.85209461179,0,0,201789.82002883617,131385.06513760361,0,0,274432.62091412186,0,0,855261.3581751734]
[null,{"$f":"Prop2018DistTar!B18","v":"Low voltage KW time of use - HOT"},null,0,0,0,7.3170000000000002,0,0,5.625,1.653,0,0,64.394000000000005,0,0,null,1211.3601666666668,0,0,528234.45105634362,0,0,47405.284144822312,824959.35507952259,0,0,147592.39700308887,0,null,null,0,0,0,38650.914783792665,0,0,2666.5472331462552,13636.578139464507,0,0,95040.648126169064,0,0,149994.68828257249]
[null,{"$f":"Prop2018DistTar!B19","v":"Low voltage large KVA time of use"},null,0,0,0,1.3049999999999999,0,0,1.1060000000000001,1.095,0,13.172000000000001,19.649999999999999,0,0,null,393917,0,0,470238596.56056643,0,0,644313381.27950871,1280147668.2341452,0,326079395.88434523,95406197.355043739,0,null,null,0,0,0,6136613.6851153914,0,0,7126105.9969513668,14017616.967163889,0,42951178.025885954,18747317.780266091,0,0,88978832.45538269]
[null,{"$f":"Prop2018DistTar!B20","v":"Low voltage large KVA time of use - HOT"},null,0,0,0,1.139,0,0,0.94199999999999995,0.93600000000000005,0,13.106999999999999,30.917000000000002,0,0,null,122,0,0,188523.44384695461,0,0,250916.26398103044,851041.21817480796,0,101243.67601797367,35569.13953,0,null,null,0,0,0,2147.2820254168132,0,0,2363.6312067013068,7965.7458021162029,0,13270.008615675808,10996.9108684901,0,0,36743.578518400231]
[null,{"$f":"Prop2018DistTar!B21","v":"High voltage KVA time of use"},null,0,0,0,0.78600000000000003,0,0,0.69399999999999995,0.68200000000000005,0,8.0120000000000005,11.003,0,0,null,11224,0,0,170765372.54893374,0,0,244972690.63313803,637251511.64700031,0,102140766.37008053,31103115.871042162,0,null,null,0,0,0,1342215.8282346195,0,0,1700110.4729939778,4346055.3094325429,0,8183518.2015708536,3422275.8392907693,0,0,18994175.651522763]
[null,{"$f":"Prop2018DistTar!B22","v":"High voltage KVA time of use - HOT"},null,0,0,0,0.81399999999999995,0,0,0.67300000000000004,0.66500000000000004,0,9.2409999999999997,22.376999999999999,0,0,null,0,0,0,0,0,0,0,0,0,0,0,0,null,null,0,0,0,0,0,0,0,0,0,0,0,0,0,0]
[null,{"$f":"Prop2018DistTar!B23","v":"Subtransmission KVA time of use"},null,0,0,0,0.44800000000000001,0,0,0.34899999999999998,0.30199999999999999,0,0.78400000000000003,1.149,0,0,null,122,0,0,8375947.4608702408,0,0,10969980.420095619,16019608.096385615,0,4212706.5388447102,1491519.6516332473,0,null,null,0,0,0,37524.24462469868,0,0,38285.231666133703,48379.216451084561,0,33027.619264542525,17137.560797266011,0,0,174353.87280372551]
[null,{"$f":"Prop2018DistTar!B24","v":"TOD"},null,6.3280000000000003,0,4.2869999999999999,15.212,0,0,8.9649999999999999,2.9329999999999998,3.1579999999999999,0,0,0,0,null,15198052.004909774,0,12731795.324180052,23296164.487819981,0,0,43672101.32037928,113014927.77794422,25410429.370784484,0,0,0,null,null,961732.73087069055,0,545812.06554759876,3543812.5418871758,0,0,3915203.8833720023,3314727.8317271038,802461.35952937393,0,0,0,0,13083750.412933946]
[null,{"$f":"Prop2018DistTar!B25","v":"TOD9"},null,6.5640000000000001,0,5.3170000000000002,17.152000000000001,0,0,10.659000000000001,4.0629999999999997,4.2709999999999999,0,0,0,0,null,507569.125,0,414508.77210607479,566017.93396961363,0,0,1129836.4645922717,4122935.4131283127,837207.53875769,0,0,0,null,null,33316.837364999999,0,22039.431412879996,97083.39603446814,0,0,120429.26876089025,167514.86583540335,35757.133980340936,0,0,0,0,476140.93338898267]
[null,{"$f":"Prop2018DistTar!B26","v":"TOU"},null,0,0,0,9.0960000000000001,0,0,5.5259999999999998,2.6680000000000001,0,0,39.500999999999998,0,0,null,69979.847750000001,0,0,4185987.602249383,0,0,6328508.679877107,7803457.3088545976,0,0,1107863.226842352,0,null,null,0,0,0,380757.43230060389,0,0,349713.38965000893,208196.24100024067,0,0,437617.05323499744,0,0,1376284.1161858509]
[null,{"$f":"Prop2018DistTar!B27","v":"TODFLEX"},null,7.069,0,4.5819999999999999,16.873999999999999,0,0,9.6859999999999999,3.8849999999999998,4.5819999999999999,0,0,0,0,null,737072.00530785555,0,1783010.1473744609,906586.54332218936,0,0,1458281.7540951683,3606690.1799522913,3051735.8094899915,0,0,0,null,null,52103.620055212312,0,81697.5249526978,152977.41332018623,0,0,141249.170701658,140119.91349114649,139830.53479083141,0,0,0,0,707978.1773117322]
[null,{"$f":"Prop2018DistTar!B28","v":"Low Voltage KW 1 rate"},null,0,2.6280000000000001,2.6280000000000001,2.6280000000000001,2.6280000000000001,2.6280000000000001,2.6280000000000001,2.6280000000000001,2.6280000000000001,0,0,25.32,9.9920000000000009,null,1144.1666666666667,0,0,8858.6022025064794,0,0,15647.932465664373,0,0,0,0,2496.3872000000001,5053.3891355263158,null,0,0,0,232.80406588187029,0,0,411.22766519765975,0,0,0,0,632.08523904000003,504.93464242178953,1781.0516125413194]
[null,{"$f":"Prop2018DistTar!B29","v":"Low voltage medium KW time of use (opt-in)"},null,0,3.476,3.476,3.476,3.476,3.476,3.476,3.476,3.476,0,0,28.751999999999999,19.167999999999999,null,47608.166666666642,0,0,4039834.9124667267,0,0,10179811.629829049,0,0,0,0,250018.88786840491,1076707.6308603093,null,{"$f":"D29/100*R29","v":0},0,0,140424.66155734341,0,0,353850.25225285772,0,0,0,0,71885.430639923783,206383.3186833041,{"$f":"SUM(AF29:AR29)","v":772543.66313342901}]
[null,{"$f":"Prop2018DistTar!B30","v":"Low voltage medium KW 1 rate (mandatory)"},null,0,5.3339999999999996,5.3339999999999996,5.3339999999999996,5.3339999999999996,5.3339999999999996,5.3339999999999996,5.3339999999999996,5.3339999999999996,0,0,17.873000000000001,11.914999999999999,null,887309.86353125004,0,0,291747036.79085952,0,0,385398691.39153147,0,0,0,0,26661191.226126004,47275303.633664787,null,0,0,0,15561786.942424446,0,0,20557166.198824286,0,0,0,0,4765154.7078455007,5632852.427951159,46516960.277045391]
[null,null,null,null,null,null,null,null,null,null,null,null,null,null,null,null,null,null,null,null,null,null,null,null,null,null,null,null,null,null,null,0,0,0,0,0,0,0,0,0,0,0,0,0,0]
[null,null,null,null,null,null,null,null,null,null,null,null,null,null,null,null,null,null,null,null,null,null,null,null,null,null,null,null,null,null,null,0,0,0,0,0,0,0,0,0,0,0,0,0,0]
[null,null,null,null,null,null,null,null,null,null,null,null,null,null,null,null,null,null,null,null,null,null,null,null,null,null,null,null,null,null,null,0,0,0,0,0,0,0,0,0,0,0,0,0,0]
[null,null,null,null,null,null,null,null,null,null,null,null,null,null,null,null,null,null,null,null,null,null,null,null,null,null,null,null,null,null,null,0,0,0,0,0,0,0,0,0,0,0,0,0,0]
[null,null,null,null,null,null,null,null,null,null,null,null,null,null,null,null,null,null,null,null,null,null,null,null,null,null,null,null,null,null,null,0,0,0,0,0,0,0,0,0,0,0,0,0,0]
[null,null,null,null,null,null,null,null,null,null,null,null,null,null,null,null,null,null,null,null,null,null,null,null,null,null,null,null,null,null,null,0,0,0,0,0,0,0,0,0,0,0,0,0,0]
[null,null,null,null,null,null,null,null,null,null,null,null,null,null,null,null,null,null,null,null,null,null,null,null,null,null,null,null,null,null,null,0,0,0,0,0,0,0,0,0,0,0,0,0,0]
[null,null,null,null,null,null,null,null,null,null,null,null,null,null,null,null,null,null,null,null,null,null,null,null,null,null,null,null,null,null,null,0,0,0,0,0,0,0,0,0,0,0,0,0,0]
[null,null,null,null,null,null,null,null,null,null,null,null,null,null,null,null,null,null,null,null,null,null,null,null,null,null,null,null,null,null,null,0,0,0,0,0,0,0,0,0,0,0,0,0,0]
[null,null,null,null,null,null,null,null,null,null,null,null,null,null,null,null,null,null,null,null,null,null,null,null,null,null,null,null,null,null,null,0,0,0,0,0,0,0,0,0,0,0,0,0,0]
[null,null,null,null,null,null,null,null,null,null,null,null,null,null,null,null,null,null,null,null,null,null,null,null,null,null,null,null,null,null,null,0,0,0,0,0,0,0,0,0,0,0,0,0,0]
[null,null,null,null,null,null,null,null,null,null,null,null,null,null,null,null,null,null,null,null,null,null,null,null,null,null,null,null,null,null,null,0,0,0,0,0,0,0,0,0,0,0,0,0,0]
[null,null,null,null,null,null,null,null,null,null,null,null,null,null,null,null,null,null,null,null,null,null,null,null,null,null,null,null,null,null,null,0,0,0,0,0,0,0,0,0,0,0,0,0,0]
[null,null,null,null,null,null,null,null,null,null,null,null,null,null,null,null,null,null,null,null,null,null,null,null,null,null,null,null,null,null,null,0,0,0,0,0,0,0,0,0,0,0,0,0,0]
[null,null,null,null,null,null,null,null,null,null,null,null,null,null,null,null,null,null,null,null,null,null,null,null,null,null,null,null,null,null,null,0,0,0,0,0,0,0,0,0,0,0,0,0,0]
[null,null,null,null,null,null,null,null,null,null,null,null,null,null,null,null,null,null,null,null,null,null,null,null,null,null,null,null,null,null,null,0,0,0,0,0,0,0,0,0,0,0,0,0,0]
[null,null,null,null,null,null,null,null,null,null,null,null,null,null,null,null,null,null,null,null,null,null,null,null,null,null,null,null,null,null,null,0,0,0,0,0,0,0,0,0,0,0,0,0,0]
[null,null,null,null,null,null,null,null,null,null,null,null,null,null,null,null,null,null,null,null,null,null,null,null,null,null,null,null,null,null,null,0,0,0,0,0,0,0,0,0,0,0,0,0,0]
[null,null,null,null,null,null,null,null,null,null,null,null,null,null,null,null,null,null,null,null,null,null,null,null,null,null,null,null,null,null,null,0,0,0,0,0,0,0,0,0,0,0,0,0,0]
[null,null,null,null,null,null,null,null,null,null,null,null,null,null,null,null,null,null,null,null,null,null,null,null,null,null,null,null,null,null,null,0,0,0,0,0,0,0,0,0,0,0,0,0,0]
[null,null,null,null,null,null,null,null,null,null,null,null,null,null,null,null,null,null,null,null,null,null,null,null,null,null,null,null,null,null,null,0,0,0,0,0,0,0,0,0,0,0,0,0,0]
[null,null,null,null,null,null,null,null,null,null,null,null,null,null,null,null,null,null,null,null,null,null,null,null,null,null,null,null,null,null,null,0,0,0,0,0,0,0,0,0,0,0,0,0,0]
[null,null,null,null,null,null,null,null,null,null,null,null,null,null,null,null,null,null,null,null,null,null,null,null,null,null,null,null,null,null,null,0,0,0,0,0,0,0,0,0,0,0,0,0,0]
[null,null,null,null,null,null,null,null,null,null,null,null,null,null,null,null,null,null,null,null,null,null,null,null,null,null,null,null,null,null,null,0,0,0,0,0,0,0,0,0,0,0,0,0,0]
[null,null,null,null,null,null,null,null,null,null,null,null,null,null,null,null,null,null,null,null,null,null,null,null,null,null,null,null,null,null,null,0,0,0,0,0,0,0,0,0,0,0,0,0,0]
[null,null,null,null,null,null,null,null,null,null,null,null,null,null,null,null,null,null,null,null,null,null,null,null,null,null,null,null,null,null,null,0,0,0,0,0,0,0,0,0,0,0,0,0,0]
[null,null,null,null,null,null,null,null,null,null,null,null,null,null,null,null,null,null,null,null,null,null,null,null,null,null,null,null,null,null,null,0,0,0,0,0,0,0,0,0,0,0,0,0,0]
[null,null,null,null,null,null,null,null,null,null,null,null,null,null,null,null,null,null,null,null,null,null,null,null,null,null,null,null,null,null,null,0,0,0,0,0,0,0,0,0,0,0,0,0,0]
[null,null,null,null,null,null,null,null,null,null,null,null,null,null,null,null,null,null,null,null,null,null,null,null,null,null,null,null,null,null,null,0,0,0,0,0,0,0,0,0,0,0,0,0,0]
[null,null,null,null,null,null,null,null,null,null,null,null,null,null,null,null,null,null,null,null,null,null,null,null,null,null,null,null,null,null,null,0,0,0,0,0,0,0,0,0,0,0,0,0,0]
[null,null,null,null,null,null,null,null,null,null,null,null,null,null,null,null,null,null,null,null,null,null,null,null,null,null,null,null,null,null,null,0,0,0,0,0,0,0,0,0,0,0,0,0,0]
[null,null,null,null,null,null,null,null,null,null,null,null,null,null,null,null,null,null,null,null,null,null,null,null,null,null,null,null,null,null,null,0,0,0,0,0,0,0,0,0,0,0,0,0,0]
[null,null,null,null,null,null,null,null,null,null,null,null,null,null,null,null,null,null,null,null,null,null,null,null,null,null,null,null,null,null,null,0,0,0,0,0,0,0,0,0,0,0,0,0,0]
[null,null,null,null,null,null,null,null,null,null,null,null,null,null,null,null,null,null,null,null,null,null,null,null,null,null,null,null,null,null,null,0,0,0,0,0,0,0,0,0,0,0,0,0,0]
[null,null,null,null,null,null,null,null,null,null,null,null,null,null,null,null,null,null,null,null,null,null,null,null,null,null,null,null,null,null,null,0,0,0,0,0,0,0,0,0,0,0,0,0,0]
[null,null,null,null,null,null,null,null,null,null,null,null,null,null,null,null,null,{"$f":"SUM(R6:R65)","v":239743213.29258254},1064360535.3272467,14929314.243660588,1069405240.6470885,1747906053.6257672,0,1487630595.2051415,2346889810.8601327,29299372.719032165,432534112.46928847,129973762.5259601,26913706.50119441,48357064.653660625,null,{"$f":"SUM(AF6:AF65)","v":17176722.255767416},89540181.975991711,649549.02191317652,36677045.824032083,94025692.366539806,0,44455092.802507699,{"$f":"SUM(AM6:AM65)","v":27290569.984215625},978049.02830054623,51180993.855337024,23004818.413497902,4837672.2237244649,5839740.6812768849,395656128.4331044]

{"sheet":"Prop2018TransTar","index":9,"n_rows":66,"n_cols":45,"rows_kept":66,"cut":false,"hidden":false,"merged":[]}
[null,{"$f":"\"Tariff Approval - \"&'Model update'!C3","v":"Tariff Approval - United Energy"}]
[]
[null,{"$f":"\"PROPOSED \"&'Model update'!$C$5&\" TRANSMISSION TARIFFS\"","v":"PROPOSED 2018 TRANSMISSION TARIFFS"}]
[null,null,null,{"$f":"\"Proposed Transmission Tariffs (Pt) for \"&'Model update'!$C$5","v":"Proposed Transmission Tariffs (Pt) for 2018"},null,null,null,null,null,null,null,null,null,null,null,null,null,{"$f":"\"Forecast Quantities (Qt) for \"&'Model update'!$C$5","v":"Forecast Quantities (Qt) for 2018"},null,null,null,null,null,null,null,null,null,null,null,null,null,{"$f":"\"Forecast Revenue (Pt \"&'Model update'!$C$5&\")*(Qt \" &'Model update'!$C$5&\")\"","v":"Forecast Revenue (Pt 2018)*(Qt 2018)"}]
[null,"Proposed tariff",null,"PropTar\nFixed","PropTar\nPkBlk1","PropTar\nPkBlk2","PropTar\nPkBlk3","PropTar\nPkBlk4","PropTar\nOPkBlk1","PropTar\nOPkBlk2","PropTar\nOPkBlk3","PropTar\nOPkBlk4","PropTar\nDemBlk1","PropTar\nDemBlk2","PropTar\nDemBlk3","PropTar\nDemBlk4",null,"FcastVol\nFixed","FcastVol\nPkBlk1","FcastVol\nPkBlk2","FcastVol\nPkBlk3","FcastVol\nPkBlk4","FcastVol\nOPkBlk1","FcastVol\nOPkBlk2","FcastVol\nOPkBlk3","FcastVol\nOPkBlk4","FcastVol\nDemBlk1","FcastVol\nDemBlk2","FcastVol\nDemBlk3","FcastVol\nDemBlk4",null,"PropRev\nFixed","PropRev\nPkBlk1","PropRev\nPkBlk2","PropRev\nPkBlk3","PropRev\nPkBlk4","PropRev\nOPkBlk1","PropRev\nOPkBlk2","PropRev\nOPkBlk3","PropRev\nOPkBlk4","PropRev\nDemBlk1","PropRev\nDemBlk2","PropRev\nDemBlk3","PropRev\nDemBlk4","PropRev\nSumBlk1"]
[null,{"$f":"Prop2018DistTar!B6","v":"Low voltage small 1 rate"},null,0,1.7549999999999999,0,0,1.4670000000000001,0,0,0,0,0,0,0,0,null,{"$f":"Prop2018DistTar!AF6","v":205549567.62323707},{"$f":"Prop2018DistTar!AG6","v":885866510.70770717},{"$f":"Prop2018DistTar!AH6","v":0},{"$f":"Prop2018DistTar!AI6","v":0},{"$f":"Prop2018DistTar!AJ6","v":1445601999.1844056},{"$f":"Prop2018DistTar!AK6","v":0},{"$f":"Prop2018DistTar!AL6","v":0},{"$f":"Prop2018DistTar!AM6","v":0},{"$f":"Prop2018DistTar!AN6","v":0},{"$f":"Prop2018DistTar!AO6","v":0},{"$f":"Prop2018DistTar!AP6","v":0},{"$f":"Prop2018DistTar!AQ6","v":0},{"$f":"Prop2018DistTar!AR6","v":0},null,{"$f":"D6/100*R6","v":0},{"$f":"E6/100*S6","v":15546957.26292026},{"$f":"F6/100*T6","v":0},{"$f":"G6/100*U6","v":0},{"$f":"H6/100*V6","v":21206981.328035232},{"$f":"I6/100*W6","v":0},{"$f":"J6/100*X6","v":0},{"$f":"K6/100*Y6","v":0},{"$f":"L6/100*Z6","v":0},{"$f":"M6/100*AA6","v":0},{"$f":"N6/100*AB6","v":0},{"$f":"O6/100*AC6","v":0},{"$f":"P6/100*AD6","v":0},{"$f":"SUM(AF6:AR6)","v":36753938.590955496}]
[null,{"$f":"Prop2018DistTar!B7","v":"Winter economy tariff"},null,0,1.964,0,0,1.571,1.571,0,0,0,0,0,0,0,null,{"$f":"Prop2018DistTar!AF7","v":50220},{"$f":"Prop2018DistTar!AG7","v":265149.05092429707},{"$f":"Prop2018DistTar!AH7","v":0},{"$f":"Prop2018DistTar!AI7","v":0},{"$f":"Prop2018DistTar!AJ7","v":483663.45314424351},{"$f":"Prop2018DistTar!AK7","v":0},{"$f":"Prop2018DistTar!AL7","v":0},{"$f":"Prop2018DistTar!AM7","v":0},{"$f":"Prop2018DistTar!AN7","v":0},{"$f":"Prop2018DistTar!AO7","v":0},{"$f":"Prop2018DistTar!AP7","v":0},{"$f":"Prop2018DistTar!AQ7","v":0},{"$f":"Prop2018DistTar!AR7","v":0},null,0,5207.5273601531944,0,0,7598.3528488960646,0,0,0,0,0,0,0,0,12805.880209049259]
[null,{"$f":"Prop2018DistTar!B8","v":"Reverse cycle airconditioning time of use"},null,0,0,0,0,0,0,0,0,0,0,0,0,0,null,{"$f":"Prop2018DistTar!AF8","v":0},{"$f":"Prop2018DistTar!AG8","v":0},{"$f":"Prop2018DistTar!AH8","v":0},{"$f":"Prop2018DistTar!AI8","v":0},{"$f":"Prop2018DistTar!AJ8","v":0},{"$f":"Prop2018DistTar!AK8","v":0},{"$f":"Prop2018DistTar!AL8","v":0},{"$f":"Prop2018DistTar!AM8","v":0},{"$f":"Prop2018DistTar!AN8","v":0},{"$f":"Prop2018DistTar!AO8","v":0},{"$f":"Prop2018DistTar!AP8","v":0},{"$f":"Prop2018DistTar!AQ8","v":0},{"$f":"Prop2018DistTar!AR8","v":0},null,0,0,0,0,0,0,0,0,0,0,0,0,0,0]
[null,{"$f":"Prop2018DistTar!B9","v":"Low voltage small 2 rate"},null,0,0,0,2.9470000000000001,0,0,2.359,0,0,0,0,0,0,null,{"$f":"Prop2018DistTar!AF9","v":1500124.8362499997},{"$f":"Prop2018DistTar!AG9","v":0},{"$f":"Prop2018DistTar!AH9","v":0},{"$f":"Prop2018DistTar!AI9","v":4199343.7007283811},{"$f":"Prop2018DistTar!AJ9","v":0},{"$f":"Prop2018DistTar!AK9","v":0},{"$f":"Prop2018DistTar!AL9","v":6958274.448766781},{"$f":"Prop2018DistTar!AM9","v":14004754.286124827},{"$f":"Prop2018DistTar!AN9","v":0},{"$f":"Prop2018DistTar!AO9","v":0},{"$f":"Prop2018DistTar!AP9","v":0},{"$f":"Prop2018DistTar!AQ9","v":0},{"$f":"Prop2018DistTar!AR9","v":0},null,0,0,0,123754.6588604654,0,0,164145.69424640835,0,0,0,0,0,0,287900.35310687375]
[null,{"$f":"Prop2018DistTar!B10","v":"Dedicated circuit"},null,0,0,0,0,0,0,0,0,0,0,0,0,0,null,{"$f":"Prop2018DistTar!AF10","v":1899.9900000000002},{"$f":"Prop2018DistTar!AG10","v":0},{"$f":"Prop2018DistTar!AH10","v":0},{"$f":"Prop2018DistTar!AI10","v":0},{"$f":"Prop2018DistTar!AJ10","v":0},{"$f":"Prop2018DistTar!AK10","v":0},{"$f":"Prop2018DistTar!AL10","v":0},{"$f":"Prop2018DistTar!AM10","v":95116849.231297255},{"$f":"Prop2018DistTar!AN10","v":0},{"$f":"Prop2018DistTar!AO10","v":0},{"$f":"Prop2018DistTar!AP10","v":0},{"$f":"Prop2018DistTar!AQ10","v":0},{"$f":"Prop2018DistTar!AR10","v":0},null,0,0,0,0,0,0,0,0,0,0,0,0,0,0]
[null,{"$f":"Prop2018DistTar!B11","v":"Low voltage medium 1 rate"},null,0,2.0619999999999998,0,0,1.647,0,0,0,0,0,0,0,0,null,{"$f":"Prop2018DistTar!AF11","v":12033520.757353125},{"$f":"Prop2018DistTar!AG11","v":153338365.9234888},{"$f":"Prop2018DistTar!AH11","v":0},{"$f":"Prop2018DistTar!AI11","v":0},{"$f":"Prop2018DistTar!AJ11","v":231891372.16376382},{"$f":"Prop2018DistTar!AK11","v":0},{"$f":"Prop2018DistTar!AL11","v":0},{"$f":"Prop2018DistTar!AM11","v":12},{"$f":"Prop2018DistTar!AN11","v":0},{"$f":"Prop2018DistTar!AO11","v":0},{"$f":"Prop2018DistTar!AP11","v":0},{"$f":"Prop2018DistTar!AQ11","v":0},{"$f":"Prop2018DistTar!AR11","v":0},null,0,3161837.1053423388,0,0,3819250.8995371899,0,0,0,0,0,0,0,0,6981088.0048795287]
[null,{"$f":"Prop2018DistTar!B12","v":"Low voltage medium 2 rate 5 day"},null,0,0,0,1.786,0,0,1.4279999999999999,0,0,0,0,0,0,null,{"$f":"Prop2018DistTar!AF12","v":3807335.9830250018},{"$f":"Prop2018DistTar!AG12","v":0},{"$f":"Prop2018DistTar!AH12","v":0},{"$f":"Prop2018DistTar!AI12","v":51707044.732552052},{"$f":"Prop2018DistTar!AJ12","v":0},{"$f":"Prop2018DistTar!AK12","v":0},{"$f":"Prop2018DistTar!AL12","v":74994609.046321467},{"$f":"Prop2018DistTar!AM12","v":77026041.232533157},{"$f":"Prop2018DistTar!AN12","v":0},{"$f":"Prop2018DistTar!AO12","v":0},{"$f":"Prop2018DistTar!AP12","v":0},{"$f":"Prop2018DistTar!AQ12","v":0},{"$f":"Prop2018DistTar!AR12","v":0},null,0,0,0,923487.81892337964,0,0,1070923.0171814705,0,0,0,0,0,0,1994410.8361048503]
[null,{"$f":"Prop2018DistTar!B13","v":"Low voltage medium 2 rate 7 day"},null,0,0,0,2.1259999999999999,0,0,1.702,0,0,0,0,0,0,null,{"$f":"Prop2018DistTar!AF13","v":1844598.2368041668},{"$f":"Prop2018DistTar!AG13","v":0},{"$f":"Prop2018DistTar!AH13","v":0},{"$f":"Prop2018DistTar!AI13","v":22006070.238745652},{"$f":"Prop2018DistTar!AJ13","v":0},{"$f":"Prop2018DistTar!AK13","v":0},{"$f":"Prop2018DistTar!AL13","v":33856652.726462662},{"$f":"Prop2018DistTar!AM13","v":14992889.813662352},{"$f":"Prop2018DistTar!AN13","v":0},{"$f":"Prop2018DistTar!AO13","v":0},{"$f":"Prop2018DistTar!AP13","v":0},{"$f":"Prop2018DistTar!AQ13","v":0},{"$f":"Prop2018DistTar!AR13","v":0},null,0,0,0,467849.0532757325,0,0,576240.22940439451,0,0,0,0,0,0,1044089.2826801271]
[null,{"$f":"Prop2018DistTar!B14","v":"Unmetered supplies"},null,0,0,0,2.7610000000000001,0,0,2.2069999999999999,0,0,0,0,0,0,null,{"$f":"Prop2018DistTar!AF14","v":3707289.0420999988},{"$f":"Prop2018DistTar!AG14","v":0},{"$f":"Prop2018DistTar!AH14","v":0},{"$f":"Prop2018DistTar!AI14","v":10816030.725244839},{"$f":"Prop2018DistTar!AJ14","v":0},{"$f":"Prop2018DistTar!AK14","v":0},{"$f":"Prop2018DistTar!AL14","v":18164542.768627141},{"$f":"Prop2018DistTar!AM14","v":66285006.261596173},{"$f":"Prop2018DistTar!AN14","v":0},{"$f":"Prop2018DistTar!AO14","v":0},{"$f":"Prop2018DistTar!AP14","v":0},{"$f":"Prop2018DistTar!AQ14","v":0},{"$f":"Prop2018DistTar!AR14","v":0},null,0,0,0,298630.60832401004,0,0,400891.45890360099,0,0,0,0,0,0,699522.06722761109]
[null,{"$f":"Prop2018DistTar!B15","v":"Low voltage large 1 rate"},null,0,2.056,0,0,1.643,0,0,0,0,0,0,0,0,null,{"$f":"Prop2018DistTar!AF15","v":2621.992916666667},{"$f":"Prop2018DistTar!AG15","v":577413.25391898619},{"$f":"Prop2018DistTar!AH15","v":0},{"$f":"Prop2018DistTar!AI15","v":0},{"$f":"Prop2018DistTar!AJ15","v":774143.47562545771},{"$f":"Prop2018DistTar!AK15","v":0},{"$f":"Prop2018DistTar!AL15","v":0},{"$f":"Prop2018DistTar!AM15","v":0},{"$f":"Prop2018DistTar!AN15","v":0},{"$f":"Prop2018DistTar!AO15","v":0},{"$f":"Prop2018DistTar!AP15","v":0},{"$f":"Prop2018DistTar!AQ15","v":0},{"$f":"Prop2018DistTar!AR15","v":0},null,0,11871.616500574357,0,0,12719.177304526271,0,0,0,0,0,0,0,0,24590.793805100628]
[null,{"$f":"Prop2018DistTar!B16","v":"Low voltage large 2 rate"},null,0,0,0,1.58,0,0,1.266,0,0,0,0,0,0,null,{"$f":"Prop2018DistTar!AF16","v":8128.178041666677},{"$f":"Prop2018DistTar!AG16","v":0},{"$f":"Prop2018DistTar!AH16","v":0},{"$f":"Prop2018DistTar!AI16","v":903588.49940318661},{"$f":"Prop2018DistTar!AJ16","v":0},{"$f":"Prop2018DistTar!AK16","v":0},{"$f":"Prop2018DistTar!AL16","v":1258017.5391398347},{"$f":"Prop2018DistTar!AM16","v":1362054.1475024181},{"$f":"Prop2018DistTar!AN16","v":0},{"$f":"Prop2018DistTar!AO16","v":0},{"$f":"Prop2018DistTar!AP16","v":0},{"$f":"Prop2018DistTar!AQ16","v":0},{"$f":"Prop2018DistTar!AR16","v":0},null,0,0,0,14276.69829057035,0,0,15926.502045510306,0,0,0,0,0,0,30203.200336080656]
[null,{"$f":"Prop2018DistTar!B17","v":"Low voltage KW time of use"},null,0,0,0,1.6539999999999999,0,0,1.323,0,0,0,7.7149999999999999,0,0,null,{"$f":"Prop2018DistTar!AF17","v":85424.52922499986},{"$f":"Prop2018DistTar!AG17","v":0},{"$f":"Prop2018DistTar!AH17","v":0},{"$f":"Prop2018DistTar!AI17","v":2797481.7148522977},{"$f":"Prop2018DistTar!AJ17","v":0},{"$f":"Prop2018DistTar!AK17","v":0},{"$f":"Prop2018DistTar!AL17","v":4144236.3214554214},{"$f":"Prop2018DistTar!AM17","v":6586209.0446983874},{"$f":"Prop2018DistTar!AN17","v":0},{"$f":"Prop2018DistTar!AO17","v":0},{"$f":"Prop2018DistTar!AP17","v":682957.56934354687},{"$f":"Prop2018DistTar!AQ17","v":0},{"$f":"Prop2018DistTar!AR17","v":0},null,0,0,0,46270.347563657,0,0,54828.246532855221,0,0,0,52690.176474854641,0,0,153788.77057136685]
[null,{"$f":"Prop2018DistTar!B18","v":"Low voltage KW time of use - HOT"},null,0,0,0,0.90500000000000003,0,0,0.72299999999999998,0,0,0,8.1080000000000005,0,0,null,{"$f":"Prop2018DistTar!AF18","v":3704.5014208333332},{"$f":"Prop2018DistTar!AG18","v":0},{"$f":"Prop2018DistTar!AH18","v":0},{"$f":"Prop2018DistTar!AI18","v":38522.958026668151},{"$f":"Prop2018DistTar!AJ18","v":0},{"$f":"Prop2018DistTar!AK18","v":0},{"$f":"Prop2018DistTar!AL18","v":57008.244498067019},{"$f":"Prop2018DistTar!AM18","v":138325.92722822793},{"$f":"Prop2018DistTar!AN18","v":0},{"$f":"Prop2018DistTar!AO18","v":0},{"$f":"Prop2018DistTar!AP18","v":151569.56785218362},{"$f":"Prop2018DistTar!AQ18","v":0},{"$f":"Prop2018DistTar!AR18","v":0},null,0,0,0,348.63277014134678,0,0,412.16960772102453,0,0,0,12289.260561455048,0,0,13050.06293931742]
[null,{"$f":"Prop2018DistTar!B19","v":"Low voltage large KVA time of use"},null,0,0,0,0.90200000000000002,0,0,0.72299999999999998,0,0,3.6789999999999998,5.0289999999999999,0,0,null,{"$f":"Prop2018DistTar!AF19","v":1207904.4289999995},{"$f":"Prop2018DistTar!AG19","v":0},{"$f":"Prop2018DistTar!AH19","v":0},{"$f":"Prop2018DistTar!AI19","v":460697092.68562466},{"$f":"Prop2018DistTar!AJ19","v":0},{"$f":"Prop2018DistTar!AK19","v":0},{"$f":"Prop2018DistTar!AL19","v":653613576.1763531},{"$f":"Prop2018DistTar!AM19","v":1268388147.0325294},{"$f":"Prop2018DistTar!AN19","v":0},{"$f":"Prop2018DistTar!AO19","v":331111136.77099401},{"$f":"Prop2018DistTar!AP19","v":96046797.401065037},{"$f":"Prop2018DistTar!AQ19","v":0},{"$f":"Prop2018DistTar!AR19","v":0},null,0,0,0,4155487.7760243346,0,0,4725626.1557550328,0,0,12181578.721804868,4830193.4412995605,0,0,25892886.094883796]
[null,{"$f":"Prop2018DistTar!B20","v":"Low voltage large KVA time of use - HOT"},null,0,0,0,0,0,0,0,0,0,0,0,0,0,null,{"$f":"Prop2018DistTar!AF20","v":3.1E-7},{"$f":"Prop2018DistTar!AG20","v":0},{"$f":"Prop2018DistTar!AH20","v":0},{"$f":"Prop2018DistTar!AI20","v":0},{"$f":"Prop2018DistTar!AJ20","v":0},{"$f":"Prop2018DistTar!AK20","v":0},{"$f":"Prop2018DistTar!AL20","v":0},{"$f":"Prop2018DistTar!AM20","v":0},{"$f":"Prop2018DistTar!AN20","v":0},{"$f":"Prop2018DistTar!AO20","v":0},{"$f":"Prop2018DistTar!AP20","v":0},{"$f":"Prop2018DistTar!AQ20","v":0},{"$f":"Prop2018DistTar!AR20","v":0},null,0,0,0,0,0,0,0,0,0,0,0,0,0,0]
[null,{"$f":"Prop2018DistTar!B21","v":"High voltage KVA time of use"},null,0,0,0,0.63300000000000001,0,0,0.50700000000000001,0,0,4.2130000000000001,4.4219999999999997,0,0,null,{"$f":"Prop2018DistTar!AF21","v":34316.689999999988},{"$f":"Prop2018DistTar!AG21","v":0},{"$f":"Prop2018DistTar!AH21","v":0},{"$f":"Prop2018DistTar!AI21","v":170523448.74060524},{"$f":"Prop2018DistTar!AJ21","v":0},{"$f":"Prop2018DistTar!AK21","v":0},{"$f":"Prop2018DistTar!AL21","v":248821547.84836793},{"$f":"Prop2018DistTar!AM21","v":637350623.78137767},{"$f":"Prop2018DistTar!AN21","v":0},{"$f":"Prop2018DistTar!AO21","v":103610388.30378608},{"$f":"Prop2018DistTar!AP21","v":31102876.482047074},{"$f":"Prop2018DistTar!AQ21","v":0},{"$f":"Prop2018DistTar!AR21","v":0},null,0,0,0,1079413.4305280312,0,0,1261525.2475912254,0,0,4365105.659238508,1375369.1980361214,0,0,8081413.5353938863]
[null,{"$f":"Prop2018DistTar!B22","v":"High voltage KVA time of use - HOT"},null,0,0,0,0,0,0,0,0,0,0,0,0,0,null,{"$f":"Prop2018DistTar!AF22","v":0},{"$f":"Prop2018DistTar!AG22","v":0},{"$f":"Prop2018DistTar!AH22","v":0},{"$f":"Prop2018DistTar!AI22","v":0},{"$f":"Prop2018DistTar!AJ22","v":0},{"$f":"Prop2018DistTar!AK22","v":0},{"$f":"Prop2018DistTar!AL22","v":0},{"$f":"Prop2018DistTar!AM22","v":0},{"$f":"Prop2018DistTar!AN22","v":0},{"$f":"Prop2018DistTar!AO22","v":0},{"$f":"Prop2018DistTar!AP22","v":0},{"$f":"Prop2018DistTar!AQ22","v":0},{"$f":"Prop2018DistTar!AR22","v":0},null,0,0,0,0,0,0,0,0,0,0,0,0,0,0]
[null,{"$f":"Prop2018DistTar!B23","v":"Subtransmission KVA time of use"},null,0,0,0,0.42699999999999999,0,0,0.34399999999999997,0,0,3.0289999999999999,3.6749999999999998,0,0,null,{"$f":"Prop2018DistTar!AF23","v":372},{"$f":"Prop2018DistTar!AG23","v":0},{"$f":"Prop2018DistTar!AH23","v":0},{"$f":"Prop2018DistTar!AI23","v":8273861.7699614735},{"$f":"Prop2018DistTar!AJ23","v":0},{"$f":"Prop2018DistTar!AK23","v":0},{"$f":"Prop2018DistTar!AL23","v":11602727.599683488},{"$f":"Prop2018DistTar!AM23","v":16115661.387170799},{"$f":"Prop2018DistTar!AN23","v":0},{"$f":"Prop2018DistTar!AO23","v":4238689.6126332916},{"$f":"Prop2018DistTar!AP23","v":1512895.9876330707},{"$f":"Prop2018DistTar!AQ23","v":0},{"$f":"Prop2018DistTar!AR23","v":0},null,0,0,0,35329.389757735487,0,0,39913.382942911194,0,0,128389.90836666239,55598.927545515347,0,0,259231.60861282444]
[null,{"$f":"Prop2018DistTar!B24","v":"TOD"},null,0,0,2.4129999999999998,2.843,0,0,2.4129999999999998,0,2.1309999999999998,0,0,0,0,null,{"$f":"Prop2018DistTar!AF24","v":15707814.647299996},{"$f":"Prop2018DistTar!AG24","v":0},{"$f":"Prop2018DistTar!AH24","v":12080098.602927629},{"$f":"Prop2018DistTar!AI24","v":22156770.540210932},{"$f":"Prop2018DistTar!AJ24","v":0},{"$f":"Prop2018DistTar!AK24","v":0},{"$f":"Prop2018DistTar!AL24","v":42584001.269890659},{"$f":"Prop2018DistTar!AM24","v":107941636.15173109},{"$f":"Prop2018DistTar!AN24","v":25155080.815130644},{"$f":"Prop2018DistTar!AO24","v":0},{"$f":"Prop2018DistTar!AP24","v":0},{"$f":"Prop2018DistTar!AQ24","v":0},{"$f":"Prop2018DistTar!AR24","v":0},null,0,0,291492.77928864368,629916.98645819677,0,0,1027551.9506424615,0,536054.77217043401,0,0,0,0,2485016.4885597359]
[null,{"$f":"Prop2018DistTar!B25","v":"TOD9"},null,0,0,3.5470000000000002,3.8149999999999999,0,0,3.5470000000000002,0,3.37,0,0,0,0,null,{"$f":"Prop2018DistTar!AF25","v":817673.4375},{"$f":"Prop2018DistTar!AG25","v":0},{"$f":"Prop2018DistTar!AH25","v":471688.28190885769},{"$f":"Prop2018DistTar!AI25","v":634148.94264614163},{"$f":"Prop2018DistTar!AJ25","v":0},{"$f":"Prop2018DistTar!AK25","v":0},{"$f":"Prop2018DistTar!AL25","v":1239459.5235104598},{"$f":"Prop2018DistTar!AM25","v":4524672.0305463392},{"$f":"Prop2018DistTar!AN25","v":942133.89760566922},{"$f":"Prop2018DistTar!AO25","v":0},{"$f":"Prop2018DistTar!AP25","v":0},{"$f":"Prop2018DistTar!AQ25","v":0},{"$f":"Prop2018DistTar!AR25","v":0},null,0,0,16730.783359307185,24192.782161950301,0,0,43963.629298916014,0,31749.912349311053,0,0,0,0,116637.10716948455]
[null,{"$f":"Prop2018DistTar!B26","v":"TOU"},null,0,0,0,2.1120000000000001,0,0,0.97,0,0,0,5.5339999999999998,0,0,null,{"$f":"Prop2018DistTar!AF26","v":219431.88199375005},{"$f":"Prop2018DistTar!AG26","v":0},{"$f":"Prop2018DistTar!AH26","v":0},{"$f":"Prop2018DistTar!AI26","v":4014520.9534145421},{"$f":"Prop2018DistTar!AJ26","v":0},{"$f":"Prop2018DistTar!AK26","v":0},{"$f":"Prop2018DistTar!AL26","v":6566809.1726725269},{"$f":"Prop2018DistTar!AM26","v":7462286.8817174928},{"$f":"Prop2018DistTar!AN26","v":0},{"$f":"Prop2018DistTar!AO26","v":0},{"$f":"Prop2018DistTar!AP26","v":1110253.6036445084},{"$f":"Prop2018DistTar!AQ26","v":0},{"$f":"Prop2018DistTar!AR26","v":0},null,0,0,0,84786.682536115128,0,0,63698.048974923513,0,0,0,61441.434425687097,0,0,209926.16593672574]
[null,{"$f":"Prop2018DistTar!B27","v":"TODFLEX"},null,0,0,1.6120000000000001,3.226,0,0,3.0089999999999999,0,1.4219999999999999,0,0,0,0,null,{"$f":"Prop2018DistTar!AF27","v":762427.32999999984},{"$f":"Prop2018DistTar!AG27","v":0},{"$f":"Prop2018DistTar!AH27","v":1766358.3410498402},{"$f":"Prop2018DistTar!AI27","v":897799.59964108723},{"$f":"Prop2018DistTar!AJ27","v":0},{"$f":"Prop2018DistTar!AK27","v":0},{"$f":"Prop2018DistTar!AL27","v":1502959.0853530241},{"$f":"Prop2018DistTar!AM27","v":3382265.656111144},{"$f":"Prop2018DistTar!AN27","v":2942300.1035350314},{"$f":"Prop2018DistTar!AO27","v":0},{"$f":"Prop2018DistTar!AP27","v":0},{"$f":"Prop2018DistTar!AQ27","v":0},{"$f":"Prop2018DistTar!AR27","v":0},null,0,0,28473.696457723428,28963.015084421473,0,0,45224.038878272491,0,41839.507472268146,0,0,0,0,144500.25789268553]
[null,{"$f":"Prop2018DistTar!B28","v":"Low Voltage KW 1 rate"},null,0,0.59299999999999997,0.59299999999999997,0.59299999999999997,0.59299999999999997,0.59299999999999997,0.59299999999999997,0.59299999999999997,0.59299999999999997,0,0,4.4409999999999998,2.887,null,{"$f":"Prop2018DistTar!AF28","v":1115018.7925630142},{"$f":"Prop2018DistTar!AG28","v":0},{"$f":"Prop2018DistTar!AH28","v":0},{"$f":"Prop2018DistTar!AI28","v":5256477.6292454861},{"$f":"Prop2018DistTar!AJ28","v":0},{"$f":"Prop2018DistTar!AK28","v":0},{"$f":"Prop2018DistTar!AL28","v":7359068.6809436809},{"$f":"Prop2018DistTar!AM28","v":0},{"$f":"Prop2018DistTar!AN28","v":0},{"$f":"Prop2018DistTar!AO28","v":0},{"$f":"Prop2018DistTar!AP28","v":0},{"$f":"Prop2018DistTar!AQ28","v":779540.58692469075},{"$f":"Prop2018DistTar!AR28","v":2537178.5160448891},null,0,0,0,31170.91234142573,0,0,43639.277277996021,0,0,0,0,34619.397465325514,73248.343758215953,182677.93084296322]
[null,{"$f":"Prop2018DistTar!B29","v":"Low voltage medium KW time of use (opt-in)"},null,0,0.75,0.75,0.75,0.75,0.75,0.75,0.75,0.75,0,0,6.1980000000000004,4.1319999999999997,null,{"$f":"Prop2018DistTar!AF29","v":175817.14583333323},{"$f":"Prop2018DistTar!AG29","v":0},{"$f":"Prop2018DistTar!AH29","v":0},{"$f":"Prop2018DistTar!AI29","v":8362481.4638386657},{"$f":"Prop2018DistTar!AJ29","v":0},{"$f":"Prop2018DistTar!AK29","v":0},{"$f":"Prop2018DistTar!AL29","v":12391679.133156199},{"$f":"Prop2018DistTar!AM29","v":0},{"$f":"Prop2018DistTar!AN29","v":0},{"$f":"Prop2018DistTar!AO29","v":0},{"$f":"Prop2018DistTar!AP29","v":0},{"$f":"Prop2018DistTar!AQ29","v":616176.69832109148},{"$f":"Prop2018DistTar!AR29","v":1472922.2518598167},null,0,0,0,62718.610978789991,0,0,92937.593498671486,0,0,0,0,38190.631761941251,60861.147446847623,254707.98368625034]
[null,{"$f":"Prop2018DistTar!B30","v":"Low voltage medium KW 1 rate (mandatory)"},null,0,1.129,1.129,1.129,1.129,1.129,1.129,1.129,1.129,0,0,3.7850000000000001,2.5230000000000001,null,{"$f":"Prop2018DistTar!AF30","v":2702828.704859375},{"$f":"Prop2018DistTar!AG30","v":0},{"$f":"Prop2018DistTar!AH30","v":0},{"$f":"Prop2018DistTar!AI30","v":283403271.17653072},{"$f":"Prop2018DistTar!AJ30","v":0},{"$f":"Prop2018DistTar!AK30","v":0},{"$f":"Prop2018DistTar!AL30","v":388617179.88766599},{"$f":"Prop2018DistTar!AM30","v":0},{"$f":"Prop2018DistTar!AN30","v":0},{"$f":"Prop2018DistTar!AO30","v":0},{"$f":"Prop2018DistTar!AP30","v":0},{"$f":"Prop2018DistTar!AQ30","v":25908737.341048431},{"$f":"Prop2018DistTar!AR30","v":46484440.594827987},null,0,0,0,3199622.9315830315,0,0,4387487.9609317491,0,0,0,0,980645.70835868316,1172802.4362075103,9740559.0370809734]
[null,null,null,null,null,null,null,null,null,null,null,null,null,null,null,null,null,null,null,null,null,null,null,null,null,null,null,null,null,null,null,0,0,0,0,0,0,0,0,0,0,0,0,0,0]
[null,null,null,null,null,null,null,null,null,null,null,null,null,null,null,null,null,null,null,null,null,null,null,null,null,null,null,null,null,null,null,0,0,0,0,0,0,0,0,0,0,0,0,0,0]
[null,null,null,null,null,null,null,null,null,null,null,null,null,null,null,null,null,null,null,null,null,null,null,null,null,null,null,null,null,null,null,0,0,0,0,0,0,0,0,0,0,0,0,0,0]
[null,null,null,null,null,null,null,null,null,null,null,null,null,null,null,null,null,null,null,null,null,null,null,null,null,null,null,null,null,null,null,0,0,0,0,0,0,0,0,0,0,0,0,0,0]
[null,null,null,null,null,null,null,null,null,null,null,null,null,null,null,null,null,null,null,null,null,null,null,null,null,null,null,null,null,null,null,0,0,0,0,0,0,0,0,0,0,0,0,0,0]
[null,null,null,null,null,null,null,null,null,null,null,null,null,null,null,null,null,null,null,null,null,null,null,null,null,null,null,null,null,null,null,0,0,0,0,0,0,0,0,0,0,0,0,0,0]
[null,null,null,null,null,null,null,null,null,null,null,null,null,null,null,null,null,null,null,null,null,null,null,null,null,null,null,null,null,null,null,0,0,0,0,0,0,0,0,0,0,0,0,0,0]
[null,null,null,null,null,null,null,null,null,null,null,null,null,null,null,null,null,null,null,null,null,null,null,null,null,null,null,null,null,null,null,0,0,0,0,0,0,0,0,0,0,0,0,0,0]
[null,null,null,null,null,null,null,null,null,null,null,null,null,null,null,null,null,null,null,null,null,null,null,null,null,null,null,null,null,null,null,0,0,0,0,0,0,0,0,0,0,0,0,0,0]
[null,null,null,null,null,null,null,null,null,null,null,null,null,null,null,null,null,null,null,null,null,null,null,null,null,null,null,null,null,null,null,0,0,0,0,0,0,0,0,0,0,0,0,0,0]
[null,null,null,null,null,null,null,null,null,null,null,null,null,null,null,null,null,null,null,null,null,null,null,null,null,null,null,null,null,null,null,0,0,0,0,0,0,0,0,0,0,0,0,0,0]
[null,null,null,null,null,null,null,null,null,null,null,null,null,null,null,null,null,null,null,null,null,null,null,null,null,null,null,null,null,null,null,0,0,0,0,0,0,0,0,0,0,0,0,0,0]
[null,null,null,null,null,null,null,null,null,null,null,null,null,null,null,null,null,null,null,null,null,null,null,null,null,null,null,null,null,null,null,0,0,0,0,0,0,0,0,0,0,0,0,0,0]
[null,null,null,null,null,null,null,null,null,null,null,null,null,null,null,null,null,null,null,null,null,null,null,null,null,null,null,null,null,null,null,0,0,0,0,0,0,0,0,0,0,0,0,0,0]
[null,null,null,null,null,null,null,null,null,null,null,null,null,null,null,null,null,null,null,null,null,null,null,null,null,null,null,null,null,null,null,0,0,0,0,0,0,0,0,0,0,0,0,0,0]
[null,null,null,null,null,null,null,null,null,null,null,null,null,null,null,null,null,null,null,null,null,null,null,null,null,null,null,null,null,null,null,0,0,0,0,0,0,0,0,0,0,0,0,0,0]
[null,null,null,null,null,null,null,null,null,null,null,null,null,null,null,null,null,null,null,null,null,null,null,null,null,null,null,null,null,null,null,0,0,0,0,0,0,0,0,0,0,0,0,0,0]
[null,null,null,null,null,null,null,null,null,null,null,null,null,null,null,null,null,null,null,null,null,null,null,null,null,null,null,null,null,null,null,0,0,0,0,0,0,0,0,0,0,0,0,0,0]
[null,null,null,null,null,null,null,null,null,null,null,null,null,null,null,null,null,null,null,null,null,null,null,null,null,null,null,null,null,null,null,0,0,0,0,0,0,0,0,0,0,0,0,0,0]
[null,null,null,null,null,null,null,null,null,null,null,null,null,null,null,null,null,null,null,null,null,null,null,null,null,null,null,null,null,null,null,0,0,0,0,0,0,0,0,0,0,0,0,0,0]
[null,null,null,null,null,null,null,null,null,null,null,null,null,null,null,null,null,null,null,null,null,null,null,null,null,null,null,null,null,null,null,0,0,0,0,0,0,0,0,0,0,0,0,0,0]
[null,null,null,null,null,null,null,null,null,null,null,null,null,null,null,null,null,null,null,null,null,null,null,null,null,null,null,null,null,null,null,0,0,0,0,0,0,0,0,0,0,0,0,0,0]
[null,null,null,null,null,null,null,null,null,null,null,null,null,null,null,null,null,null,null,null,null,null,null,null,null,null,null,null,null,null,null,0,0,0,0,0,0,0,0,0,0,0,0,0,0]
[null,null,null,null,null,null,null,null,null,null,null,null,null,null,null,null,null,null,null,null,null,null,null,null,null,null,null,null,null,null,null,0,0,0,0,0,0,0,0,0,0,0,0,0,0]
[null,null,null,null,null,null,null,null,null,null,null,null,null,null,null,null,null,null,null,null,null,null,null,null,null,null,null,null,null,null,null,0,0,0,0,0,0,0,0,0,0,0,0,0,0]
[null,null,null,null,null,null,null,null,null,null,null,null,null,null,null,null,null,null,null,null,null,null,null,null,null,null,null,null,null,null,null,0,0,0,0,0,0,0,0,0,0,0,0,0,0]
[null,null,null,null,null,null,null,null,null,null,null,null,null,null,null,null,null,null,null,null,null,null,null,null,null,null,null,null,null,null,null,0,0,0,0,0,0,0,0,0,0,0,0,0,0]
[null,null,null,null,null,null,null,null,null,null,null,null,null,null,null,null,null,null,null,null,null,null,null,null,null,null,null,null,null,null,null,0,0,0,0,0,0,0,0,0,0,0,0,0,0]
[null,null,null,null,null,null,null,null,null,null,null,null,null,null,null,null,null,null,null,null,null,null,null,null,null,null,null,null,null,null,null,0,0,0,0,0,0,0,0,0,0,0,0,0,0]
[null,null,null,null,null,null,null,null,null,null,null,null,null,null,null,null,null,null,null,null,null,null,null,null,null,null,null,null,null,null,null,0,0,0,0,0,0,0,0,0,0,0,0,0,0]
[null,null,null,null,null,null,null,null,null,null,null,null,null,null,null,null,null,null,null,null,null,null,null,null,null,null,null,null,null,null,null,0,0,0,0,0,0,0,0,0,0,0,0,0,0]
[null,null,null,null,null,null,null,null,null,null,null,null,null,null,null,null,null,null,null,null,null,null,null,null,null,null,null,null,null,null,null,0,0,0,0,0,0,0,0,0,0,0,0,0,0]
[null,null,null,null,null,null,null,null,null,null,null,null,null,null,null,null,null,null,null,null,null,null,null,null,null,null,null,null,null,null,null,0,0,0,0,0,0,0,0,0,0,0,0,0,0]
[null,null,null,null,null,null,null,null,null,null,null,null,null,null,null,null,null,null,null,null,null,null,null,null,null,null,null,null,null,null,null,0,0,0,0,0,0,0,0,0,0,0,0,0,0]
[null,null,null,null,null,null,null,null,null,null,null,null,null,null,null,null,null,null,null,null,null,null,null,null,null,null,null,null,null,null,null,0,0,0,0,0,0,0,0,0,0,0,0,0,0]
[null,null,null,null,null,null,null,null,null,null,null,null,null,null,null,null,null,{"$f":"SUM(R6:R65)","v":251338040.72942334},1040047438.9360393,14318145.225886328,1056687956.0712721,1678751178.2769392,0,1513732349.4728687,{"$f":"SUM(Y6:Y65)","v":2320677434.8658266},29039514.816271342,438960214.68741339,130607350.61158541,27304454.626294214,50494541.362732694,null,{"$f":"SUM(AF6:AF65)","v":0},18725873.512123328,336697.25910567428,11206220.335461989,25046549.757725842,0,14014934.603714123,{"$f":"SUM(AM6:AM65)","v":0},609644.19199201325,16675074.289410038,6387582.4383431934,1053455.7375859499,1306911.9274125739,95362944.052874699]

{"sheet":"Est2017TransRev","index":10,"n_rows":66,"n_cols":45,"rows_kept":66,"cut":false,"hidden":false,"merged":[]}
[null,{"$f":"\"Tariff Approval - \"&'Model update'!C3","v":"Tariff Approval - United Energy"}]
[]
[null,{"$f":"\"ESTIMATED \"&'Model update'!C8&\" TRANSMISSION TARIFF REVENUE\"","v":"ESTIMATED 2017 TRANSMISSION TARIFF REVENUE"}]
[null,null,null,{"$f":"\"Current Transmission Tariffs (Pt-1) for \"&'Model update'!$C$8","v":"Current Transmission Tariffs (Pt-1) for 2017"},null,null,null,null,null,null,null,null,null,null,null,null,null,{"$f":"\"Estimated Quantities (Qt-1) for \"&'Model update'!$C$8","v":"Estimated Quantities (Qt-1) for 2017"},null,null,null,null,null,null,null,null,null,null,null,null,null,{"$f":"\"Estimated Revenue (Pt-1 \"&'Model update'!$C$8&\")*(Qt-1 \" &'Model update'!$C$8&\")\"","v":"Estimated Revenue (Pt-1 2017)*(Qt-1 2017)"}]
[null,{"$f":"\"Tariffs \"&'Model update'!C8","v":"Tariffs 2017"},null,"Current\nFixed","\nCurrentPkBlk1","\nCurrentPkBlk2","\nCurrent PkBlk3","\nCurrent PkBlk4","\nCurrent OPkBlk1","\nCurrent OPkBlk2","\nCurrent OPkBlk3","\nCurrent OPkBlk4","\nCurrent DemBlk1","\nCurrent DemBlk2","\nCurrent DemBlk3","\nCurrent DemBlk4",null,"EstVol\nFixed","EstVol\nPkBlk1","EstVol\nPkBlk2","EstVol\nPkBlk3","EstVol\nPkBlk4","EstVol\nOPkBlk1","EstVol\nOPkBlk2","EstVol\nOPkBlk3","EstVol\nOPkBlk4","EstVol\nDemBlk1","EstVol\nDemBlk2","EstVol\nDemBlk3","EstVol\nDemBlk4",null,"EstRev\nFixed","EstRev\nPkBlk1","EstRev\nPkBlk2","EstRev\nPkBlk3","EstRev\nPkBlk4","EstRev\nOPkBlk1","EstRev\nOPkBlk2","EstRev\nOPkBlk3","EstRev\nOPkBlk4","EstRev\nDemBlk1","EstRev\nDemBlk2","EstRev\nDemBlk3","EstRev\nDemBlk4","EstRev\nTotal"]
[null,{"$f":"Est2017DistRev!B6","v":"Low voltage small 1 rate"},null,0,2.0699999999999998,0,0,1.73,0,0,0,0,0,0,0,0,null,{"$f":"Est2017DistRev!R6","v":201584381.14774334},{"$f":"Est2017DistRev!S6","v":908301740.93542182},{"$f":"Est2017DistRev!T6","v":0},{"$f":"Est2017DistRev!U6","v":0},{"$f":"Est2017DistRev!V6","v":1512903696.7798095},{"$f":"Est2017DistRev!W6","v":0},{"$f":"Est2017DistRev!X6","v":0},{"$f":"Est2017DistRev!Y6","v":0},{"$f":"Est2017DistRev!Z6","v":0},{"$f":"Est2017DistRev!AA6","v":0},{"$f":"Est2017DistRev!AB6","v":0},{"$f":"Est2017DistRev!AC6","v":0},{"$f":"Est2017DistRev!AD6","v":0},null,{"$f":"D6/100*R6","v":0},{"$f":"E6/100*S6","v":18801846.037363231},{"$f":"F6/100*T6","v":0},{"$f":"G6/100*U6","v":0},{"$f":"H6/100*V6","v":26173233.954290703},{"$f":"I6/100*W6","v":0},{"$f":"J6/100*X6","v":0},{"$f":"K6/100*Y6","v":0},{"$f":"L6/100*Z6","v":0},{"$f":"M6/100*AA6","v":0},{"$f":"N6/100*AB6","v":0},{"$f":"O6/100*AC6","v":0},{"$f":"P6/100*AD6","v":0},{"$f":"SUM(AF6:AR6)","v":44975079.991653934}]
[null,{"$f":"Est2017DistRev!B7","v":"Winter economy tariff"},null,0,2.3159999999999998,0,0,1.853,1.853,0,0,0,0,0,0,0,null,{"$f":"Est2017DistRev!R7","v":48925.374102868365},{"$f":"Est2017DistRev!S7","v":190882.73431960001},{"$f":"Est2017DistRev!T7","v":0},{"$f":"Est2017DistRev!U7","v":0},{"$f":"Est2017DistRev!V7","v":434825.1493697461},{"$f":"Est2017DistRev!W7","v":0},{"$f":"Est2017DistRev!X7","v":0},{"$f":"Est2017DistRev!Y7","v":0},{"$f":"Est2017DistRev!Z7","v":0},{"$f":"Est2017DistRev!AA7","v":0},{"$f":"Est2017DistRev!AB7","v":0},{"$f":"Est2017DistRev!AC7","v":0},{"$f":"Est2017DistRev!AD7","v":0},null,0,4420.8441268419365,0,0,8057.3100178213954,0,0,0,0,0,0,0,0,12478.154144663331]
[null,{"$f":"Est2017DistRev!B8","v":"Reverse cycle airconditioning time of use"},null,0,0,0,15.694000000000001,0,0,3.4950000000000001,0,0,0,9.952,0,0,null,{"$f":"Est2017DistRev!R8","v":0},{"$f":"Est2017DistRev!S8","v":0},{"$f":"Est2017DistRev!T8","v":0},{"$f":"Est2017DistRev!U8","v":0},{"$f":"Est2017DistRev!V8","v":0},{"$f":"Est2017DistRev!W8","v":0},{"$f":"Est2017DistRev!X8","v":0},{"$f":"Est2017DistRev!Y8","v":0},{"$f":"Est2017DistRev!Z8","v":0},{"$f":"Est2017DistRev!AA8","v":0},{"$f":"Est2017DistRev!AB8","v":0},{"$f":"Est2017DistRev!AC8","v":0},{"$f":"Est2017DistRev!AD8","v":0},null,0,0,0,0,0,0,0,0,0,0,0,0,0,0]
[null,{"$f":"Est2017DistRev!B9","v":"Low voltage small 2 rate"},null,0,0,0,3.476,0,0,2.782,0,0,0,0,0,0,null,{"$f":"Est2017DistRev!R9","v":1561827.9666133672},{"$f":"Est2017DistRev!S9","v":0},{"$f":"Est2017DistRev!T9","v":0},{"$f":"Est2017DistRev!U9","v":4402929.9605265837},{"$f":"Est2017DistRev!V9","v":0},{"$f":"Est2017DistRev!W9","v":0},{"$f":"Est2017DistRev!X9","v":7259168.6504886504},{"$f":"Est2017DistRev!Y9","v":15381833.08293198},{"$f":"Est2017DistRev!Z9","v":0},{"$f":"Est2017DistRev!AA9","v":0},{"$f":"Est2017DistRev!AB9","v":0},{"$f":"Est2017DistRev!AC9","v":0},{"$f":"Est2017DistRev!AD9","v":0},null,0,0,0,153045.84542790405,0,0,201950.07185659427,0,0,0,0,0,0,354995.91728449834]
[null,{"$f":"Est2017DistRev!B10","v":"Dedicated circuit"},null,0,0,0,0,0,0,0,0,0,0,0,0,0,null,{"$f":"Est2017DistRev!R10","v":667.9000000000002},{"$f":"Est2017DistRev!S10","v":0},{"$f":"Est2017DistRev!T10","v":0},{"$f":"Est2017DistRev!U10","v":0},{"$f":"Est2017DistRev!V10","v":0},{"$f":"Est2017DistRev!W10","v":0},{"$f":"Est2017DistRev!X10","v":0},{"$f":"Est2017DistRev!Y10","v":98711981.428355873},{"$f":"Est2017DistRev!Z10","v":0},{"$f":"Est2017DistRev!AA10","v":0},{"$f":"Est2017DistRev!AB10","v":0},{"$f":"Est2017DistRev!AC10","v":0},{"$f":"Est2017DistRev!AD10","v":0},null,0,0,0,0,0,0,0,0,0,0,0,0,0,0]
[null,{"$f":"Est2017DistRev!B11","v":"Low voltage medium 1 rate"},null,0,2.4319999999999999,0,0,1.9419999999999999,0,0,0,0,0,0,0,0,null,{"$f":"Est2017DistRev!R11","v":11864291.38330999},{"$f":"Est2017DistRev!S11","v":155269969.61677647},{"$f":"Est2017DistRev!T11","v":0},{"$f":"Est2017DistRev!U11","v":0},{"$f":"Est2017DistRev!V11","v":233793484.4810552},{"$f":"Est2017DistRev!W11","v":0},{"$f":"Est2017DistRev!X11","v":0},{"$f":"Est2017DistRev!Y11","v":4},{"$f":"Est2017DistRev!Z11","v":0},{"$f":"Est2017DistRev!AA11","v":0},{"$f":"Est2017DistRev!AB11","v":0},{"$f":"Est2017DistRev!AC11","v":0},{"$f":"Est2017DistRev!AD11","v":0},null,0,3776165.6610800033,0,0,4540269.4686220922,0,0,0,0,0,0,0,0,8316435.1297020949]
[null,{"$f":"Est2017DistRev!B12","v":"Low voltage medium 2 rate 5 day"},null,0,0,0,2.1059999999999999,0,0,1.6839999999999999,0,0,0,0,0,0,null,{"$f":"Est2017DistRev!R12","v":3762110.1235585408},{"$f":"Est2017DistRev!S12","v":0},{"$f":"Est2017DistRev!T12","v":0},{"$f":"Est2017DistRev!U12","v":52750944.988502115},{"$f":"Est2017DistRev!V12","v":0},{"$f":"Est2017DistRev!W12","v":0},{"$f":"Est2017DistRev!X12","v":73732469.07894589},{"$f":"Est2017DistRev!Y12","v":78832208.16821827},{"$f":"Est2017DistRev!Z12","v":0},{"$f":"Est2017DistRev!AA12","v":0},{"$f":"Est2017DistRev!AB12","v":0},{"$f":"Est2017DistRev!AC12","v":0},{"$f":"Est2017DistRev!AD12","v":0},null,0,0,0,1110934.9014578545,0,0,1241654.7792894489,0,0,0,0,0,0,2352589.6807473032]
[null,{"$f":"Est2017DistRev!B13","v":"Low voltage medium 2 rate 7 day"},null,0,0,0,2.5070000000000001,0,0,2.0070000000000001,0,0,0,0,0,0,null,{"$f":"Est2017DistRev!R13","v":1819379.4139505203},{"$f":"Est2017DistRev!S13","v":0},{"$f":"Est2017DistRev!T13","v":0},{"$f":"Est2017DistRev!U13","v":22682579.555723179},{"$f":"Est2017DistRev!V13","v":0},{"$f":"Est2017DistRev!W13","v":0},{"$f":"Est2017DistRev!X13","v":34109458.955907114},{"$f":"Est2017DistRev!Y13","v":15078122.186198868},{"$f":"Est2017DistRev!Z13","v":0},{"$f":"Est2017DistRev!AA13","v":0},{"$f":"Est2017DistRev!AB13","v":0},{"$f":"Est2017DistRev!AC13","v":0},{"$f":"Est2017DistRev!AD13","v":0},null,0,0,0,568652.26946198009,0,0,684576.84124505578,0,0,0,0,0,0,1253229.1107070358]
[null,{"$f":"Est2017DistRev!B14","v":"Unmetered supplies"},null,0,0,0,3.2570000000000001,0,0,2.6030000000000002,0,0,0,0,0,0,null,{"$f":"Est2017DistRev!R14","v":1207792.6233333333},{"$f":"Est2017DistRev!S14","v":0},{"$f":"Est2017DistRev!T14","v":0},{"$f":"Est2017DistRev!U14","v":10724484.114269339},{"$f":"Est2017DistRev!V14","v":0},{"$f":"Est2017DistRev!W14","v":0},{"$f":"Est2017DistRev!X14","v":18203252.788676005},{"$f":"Est2017DistRev!Y14","v":66747582.584354617},{"$f":"Est2017DistRev!Z14","v":0},{"$f":"Est2017DistRev!AA14","v":0},{"$f":"Est2017DistRev!AB14","v":0},{"$f":"Est2017DistRev!AC14","v":0},{"$f":"Est2017DistRev!AD14","v":0},null,0,0,0,349296.44760175236,0,0,473830.6700892364,0,0,0,0,0,0,823127.11769098882]
[null,{"$f":"Est2017DistRev!B15","v":"Low voltage large 1 rate"},null,0,2.4249999999999998,0,0,1.9379999999999999,0,0,0,0,0,0,0,0,null,{"$f":"Est2017DistRev!R15","v":2527.3829423333332},{"$f":"Est2017DistRev!S15","v":597942.04072884563},{"$f":"Est2017DistRev!T15","v":0},{"$f":"Est2017DistRev!U15","v":0},{"$f":"Est2017DistRev!V15","v":774047.21553278971},{"$f":"Est2017DistRev!W15","v":0},{"$f":"Est2017DistRev!X15","v":0},{"$f":"Est2017DistRev!Y15","v":0},{"$f":"Est2017DistRev!Z15","v":0},{"$f":"Est2017DistRev!AA15","v":0},{"$f":"Est2017DistRev!AB15","v":0},{"$f":"Est2017DistRev!AC15","v":0},{"$f":"Est2017DistRev!AD15","v":0},null,0,14500.094487674505,0,0,15001.035037025464,0,0,0,0,0,0,0,0,29501.129524699969]
[null,{"$f":"Est2017DistRev!B16","v":"Low voltage large 2 rate"},null,0,0,0,1.8640000000000001,0,0,1.4930000000000001,0,0,0,0,0,0,null,{"$f":"Est2017DistRev!R16","v":8044.8880293333341},{"$f":"Est2017DistRev!S16","v":0},{"$f":"Est2017DistRev!T16","v":0},{"$f":"Est2017DistRev!U16","v":1050283.8111005772},{"$f":"Est2017DistRev!V16","v":0},{"$f":"Est2017DistRev!W16","v":0},{"$f":"Est2017DistRev!X16","v":1490905.349524372},{"$f":"Est2017DistRev!Y16","v":1781684.6179572449},{"$f":"Est2017DistRev!Z16","v":0},{"$f":"Est2017DistRev!AA16","v":0},{"$f":"Est2017DistRev!AB16","v":0},{"$f":"Est2017DistRev!AC16","v":0},{"$f":"Est2017DistRev!AD16","v":0},null,0,0,0,19577.29023891476,0,0,22259.216868398875,0,0,0,0,0,0,41836.507107313635]
[null,{"$f":"Est2017DistRev!B17","v":"Low voltage KW time of use"},null,0,0,0,1.9510000000000001,0,0,1.56,0,0,0,9.1,0,0,null,{"$f":"Est2017DistRev!R17","v":27933.548999999955},{"$f":"Est2017DistRev!S17","v":0},{"$f":"Est2017DistRev!T17","v":0},{"$f":"Est2017DistRev!U17","v":2946856.8788030911},{"$f":"Est2017DistRev!V17","v":0},{"$f":"Est2017DistRev!W17","v":0},{"$f":"Est2017DistRev!X17","v":4098087.3279617415},{"$f":"Est2017DistRev!Y17","v":6713595.5614513857},{"$f":"Est2017DistRev!Z17","v":0},{"$f":"Est2017DistRev!AA17","v":0},{"$f":"Est2017DistRev!AB17","v":681904.88486550353},{"$f":"Est2017DistRev!AC17","v":0},{"$f":"Est2017DistRev!AD17","v":0},null,0,0,0,57493.17770544831,0,0,63930.162316203168,0,0,0,62053.344522760817,0,0,183476.6845444123]
[null,{"$f":"Est2017DistRev!B18","v":"Low voltage KW time of use - HOT"},null,0,0,0,1.0669999999999999,0,0,0.85299999999999998,0,0,0,9.5630000000000006,0,0,null,{"$f":"Est2017DistRev!R18","v":1211.3601666666668},{"$f":"Est2017DistRev!S18","v":0},{"$f":"Est2017DistRev!T18","v":0},{"$f":"Est2017DistRev!U18","v":528234.45105634362},{"$f":"Est2017DistRev!V18","v":0},{"$f":"Est2017DistRev!W18","v":0},{"$f":"Est2017DistRev!X18","v":47405.284144822312},{"$f":"Est2017DistRev!Y18","v":824959.35507952259},{"$f":"Est2017DistRev!Z18","v":0},{"$f":"Est2017DistRev!AA18","v":0},{"$f":"Est2017DistRev!AB18","v":147592.39700308887},{"$f":"Est2017DistRev!AC18","v":0},{"$f":"Est2017DistRev!AD18","v":0},null,0,0,0,5636.2615927711859,0,0,404.36707375533427,0,0,0,14114.26092540539,0,0,20154.889591931911]
[null,{"$f":"Est2017DistRev!B19","v":"Low voltage large KVA time of use"},null,0,0,0,1.0629999999999999,0,0,0.85299999999999998,0,0,4.3390000000000004,5.931,0,0,null,{"$f":"Est2017DistRev!R19","v":393917},{"$f":"Est2017DistRev!S19","v":0},{"$f":"Est2017DistRev!T19","v":0},{"$f":"Est2017DistRev!U19","v":470238596.56056643},{"$f":"Est2017DistRev!V19","v":0},{"$f":"Est2017DistRev!W19","v":0},{"$f":"Est2017DistRev!X19","v":644313381.27950871},{"$f":"Est2017DistRev!Y19","v":1280147668.2341452},{"$f":"Est2017DistRev!Z19","v":0},{"$f":"Est2017DistRev!AA19","v":326079395.88434523},{"$f":"Est2017DistRev!AB19","v":95406197.355043739},{"$f":"Est2017DistRev!AC19","v":0},{"$f":"Est2017DistRev!AD19","v":0},null,0,0,0,4998636.281438821,0,0,5495993.1423142087,0,0,14148584.987421742,5658541.5651276447,0,0,30301755.976302419]
[null,{"$f":"Est2017DistRev!B20","v":"Low voltage large KVA time of use - HOT"},null,0,0,0,0.67100000000000004,0,0,0.53800000000000003,0,0,2.738,7.2,0,0,null,{"$f":"Est2017DistRev!R20","v":122},{"$f":"Est2017DistRev!S20","v":0},{"$f":"Est2017DistRev!T20","v":0},{"$f":"Est2017DistRev!U20","v":188523.44384695461},{"$f":"Est2017DistRev!V20","v":0},{"$f":"Est2017DistRev!W20","v":0},{"$f":"Est2017DistRev!X20","v":250916.26398103044},{"$f":"Est2017DistRev!Y20","v":851041.21817480796},{"$f":"Est2017DistRev!Z20","v":0},{"$f":"Est2017DistRev!AA20","v":101243.67601797367},{"$f":"Est2017DistRev!AB20","v":35569.13953},{"$f":"Est2017DistRev!AC20","v":0},{"$f":"Est2017DistRev!AD20","v":0},null,0,0,0,1264.9923082130656,0,0,1349.9295002179438,0,0,2772.0518493721192,2560.9780461600003,0,0,7947.9517039631291]
[null,{"$f":"Est2017DistRev!B21","v":"High voltage KVA time of use"},null,0,0,0,0.747,0,0,0.59799999999999998,0,0,4.9690000000000003,5.2160000000000002,0,0,null,{"$f":"Est2017DistRev!R21","v":11224},{"$f":"Est2017DistRev!S21","v":0},{"$f":"Est2017DistRev!T21","v":0},{"$f":"Est2017DistRev!U21","v":170765372.54893374},{"$f":"Est2017DistRev!V21","v":0},{"$f":"Est2017DistRev!W21","v":0},{"$f":"Est2017DistRev!X21","v":244972690.63313803},{"$f":"Est2017DistRev!Y21","v":637251511.64700031},{"$f":"Est2017DistRev!Z21","v":0},{"$f":"Est2017DistRev!AA21","v":102140766.37008053},{"$f":"Est2017DistRev!AB21","v":31103115.871042162},{"$f":"Est2017DistRev!AC21","v":0},{"$f":"Est2017DistRev!AD21","v":0},null,0,0,0,1275617.3329405352,0,0,1464936.6899861654,0,0,5075374.6809293022,1622338.5238335594,0,0,9438267.2276895624]
[null,{"$f":"Est2017DistRev!B22","v":"High voltage KVA time of use - HOT"},null,0,0,0,0.43,0,0,0.34200000000000003,0,0,2.8490000000000002,5.7510000000000003,0,0,null,{"$f":"Est2017DistRev!R22","v":0},{"$f":"Est2017DistRev!S22","v":0},{"$f":"Est2017DistRev!T22","v":0},{"$f":"Est2017DistRev!U22","v":0},{"$f":"Est2017DistRev!V22","v":0},{"$f":"Est2017DistRev!W22","v":0},{"$f":"Est2017DistRev!X22","v":0},{"$f":"Est2017DistRev!Y22","v":0},{"$f":"Est2017DistRev!Z22","v":0},{"$f":"Est2017DistRev!AA22","v":0},{"$f":"Est2017DistRev!AB22","v":0},{"$f":"Est2017DistRev!AC22","v":0},{"$f":"Est2017DistRev!AD22","v":0},null,0,0,0,0,0,0,0,0,0,0,0,0,0,0]
[null,{"$f":"Est2017DistRev!B23","v":"Subtransmission KVA time of use"},null,0,0,0,0.504,0,0,0.40600000000000003,0,0,3.5720000000000001,4.3339999999999996,0,0,null,{"$f":"Est2017DistRev!R23","v":122},{"$f":"Est2017DistRev!S23","v":0},{"$f":"Est2017DistRev!T23","v":0},{"$f":"Est2017DistRev!U23","v":8375947.4608702408},{"$f":"Est2017DistRev!V23","v":0},{"$f":"Est2017DistRev!W23","v":0},{"$f":"Est2017DistRev!X23","v":10969980.420095619},{"$f":"Est2017DistRev!Y23","v":16019608.096385615},{"$f":"Est2017DistRev!Z23","v":0},{"$f":"Est2017DistRev!AA23","v":4212706.5388447102},{"$f":"Est2017DistRev!AB23","v":1491519.6516332473},{"$f":"Est2017DistRev!AC23","v":0},{"$f":"Est2017DistRev!AD23","v":0},null,0,0,0,42214.775202786019,0,0,44538.120505588216,0,0,150477.87756753305,64642.46170178493,0,0,301873.23497769225]
[null,{"$f":"Est2017DistRev!B24","v":"TOD"},null,0,0,2.8460000000000001,3.3530000000000002,0,0,2.8460000000000001,0,2.5129999999999999,0,0,0,0,null,{"$f":"Est2017DistRev!R24","v":15198052.004909774},{"$f":"Est2017DistRev!S24","v":0},{"$f":"Est2017DistRev!T24","v":12731795.324180052},{"$f":"Est2017DistRev!U24","v":23296164.487819981},{"$f":"Est2017DistRev!V24","v":0},{"$f":"Est2017DistRev!W24","v":0},{"$f":"Est2017DistRev!X24","v":43672101.32037928},{"$f":"Est2017DistRev!Y24","v":113014927.77794422},{"$f":"Est2017DistRev!Z24","v":25410429.370784484},{"$f":"Est2017DistRev!AA24","v":0},{"$f":"Est2017DistRev!AB24","v":0},{"$f":"Est2017DistRev!AC24","v":0},{"$f":"Est2017DistRev!AD24","v":0},null,0,0,362346.89492616424,781120.3952766041,0,0,1242908.0035779942,0,638564.09008781402,0,0,0,0,3024939.383868577]
[null,{"$f":"Est2017DistRev!B25","v":"TOD9"},null,0,0,4.1829999999999998,4.5,0,0,4.1829999999999998,0,3.9750000000000001,0,0,0,0,null,{"$f":"Est2017DistRev!R25","v":507569.125},{"$f":"Est2017DistRev!S25","v":0},{"$f":"Est2017DistRev!T25","v":414508.77210607479},{"$f":"Est2017DistRev!U25","v":566017.93396961363},{"$f":"Est2017DistRev!V25","v":0},{"$f":"Est2017DistRev!W25","v":0},{"$f":"Est2017DistRev!X25","v":1129836.4645922717},{"$f":"Est2017DistRev!Y25","v":4122935.4131283127},{"$f":"Est2017DistRev!Z25","v":837207.53875769},{"$f":"Est2017DistRev!AA25","v":0},{"$f":"Est2017DistRev!AB25","v":0},{"$f":"Est2017DistRev!AC25","v":0},{"$f":"Est2017DistRev!AD25","v":0},null,0,0,17338.901937197108,25470.807028632611,0,0,47261.059313894722,0,33278.999665618176,0,0,0,0,123349.76794534261]
[null,{"$f":"Est2017DistRev!B26","v":"TOU"},null,0,0,0,2.4910000000000001,0,0,1.1439999999999999,0,0,0,6.5270000000000001,0,0,null,{"$f":"Est2017DistRev!R26","v":69979.847750000001},{"$f":"Est2017DistRev!S26","v":0},{"$f":"Est2017DistRev!T26","v":0},{"$f":"Est2017DistRev!U26","v":4185987.602249383},{"$f":"Est2017DistRev!V26","v":0},{"$f":"Est2017DistRev!W26","v":0},{"$f":"Est2017DistRev!X26","v":6328508.679877107},{"$f":"Est2017DistRev!Y26","v":7803457.3088545976},{"$f":"Est2017DistRev!Z26","v":0},{"$f":"Est2017DistRev!AA26","v":0},{"$f":"Est2017DistRev!AB26","v":1107863.226842352},{"$f":"Est2017DistRev!AC26","v":0},{"$f":"Est2017DistRev!AD26","v":0},null,0,0,0,104272.95117203213,0,0,72398.1392977941,0,0,0,72310.232816000309,0,0,248981.32328582654]
[null,{"$f":"Est2017DistRev!B27","v":"TODFLEX"},null,0,0,1.901,3.8050000000000002,0,0,3.5489999999999999,0,1.677,0,0,0,0,null,{"$f":"Est2017DistRev!R27","v":737072.00530785555},{"$f":"Est2017DistRev!S27","v":0},{"$f":"Est2017DistRev!T27","v":1783010.1473744609},{"$f":"Est2017DistRev!U27","v":906586.54332218936},{"$f":"Est2017DistRev!V27","v":0},{"$f":"Est2017DistRev!W27","v":0},{"$f":"Est2017DistRev!X27","v":1458281.7540951683},{"$f":"Est2017DistRev!Y27","v":3606690.1799522913},{"$f":"Est2017DistRev!Z27","v":3051735.8094899915},{"$f":"Est2017DistRev!AA27","v":0},{"$f":"Est2017DistRev!AB27","v":0},{"$f":"Est2017DistRev!AC27","v":0},{"$f":"Est2017DistRev!AD27","v":0},null,0,0,33895.022901588498,34495.617973409302,0,0,51754.419452837523,0,51177.609525147156,0,0,0,0,171322.66985298248]
[null,{"$f":"Est2017DistRev!B28","v":"Low Voltage KW 1 rate"},null,0,0.69899999999999995,0.69899999999999995,0.69899999999999995,0.69899999999999995,0.69899999999999995,0.69899999999999995,0.69899999999999995,0.69899999999999995,0,0,5.2380000000000004,3.4049999999999998,null,{"$f":"Est2017DistRev!R28","v":1144.1666666666667},{"$f":"Est2017DistRev!S28","v":0},{"$f":"Est2017DistRev!T28","v":0},{"$f":"Est2017DistRev!U28","v":8858.6022025064794},{"$f":"Est2017DistRev!V28","v":0},{"$f":"Est2017DistRev!W28","v":0},{"$f":"Est2017DistRev!X28","v":15647.932465664373},{"$f":"Est2017DistRev!Y28","v":0},{"$f":"Est2017DistRev!Z28","v":0},{"$f":"Est2017DistRev!AA28","v":0},{"$f":"Est2017DistRev!AB28","v":0},{"$f":"Est2017DistRev!AC28","v":2496.3872000000001},{"$f":"Est2017DistRev!AD28","v":5053.3891355263158},null,0,0,0,61.921629395520291,0,0,109.37904793499396,0,0,0,0,130.76076153600002,172.06790006467105,474.12933893118532]
[null,{"$f":"Est2017DistRev!B29","v":"Low voltage medium KW time of use (opt-in)"},null,0,0.88400000000000001,0.88400000000000001,0.88400000000000001,0.88400000000000001,0.88400000000000001,0.88400000000000001,0.88400000000000001,0.88400000000000001,0,0,7.31,4.8739999999999997,null,{"$f":"Est2017DistRev!R29","v":47608.166666666642},{"$f":"Est2017DistRev!S29","v":0},{"$f":"Est2017DistRev!T29","v":0},{"$f":"Est2017DistRev!U29","v":4039834.9124667267},{"$f":"Est2017DistRev!V29","v":0},{"$f":"Est2017DistRev!W29","v":0},{"$f":"Est2017DistRev!X29","v":10179811.629829049},{"$f":"Est2017DistRev!Y29","v":0},{"$f":"Est2017DistRev!Z29","v":0},{"$f":"Est2017DistRev!AA29","v":0},{"$f":"Est2017DistRev!AB29","v":0},{"$f":"Est2017DistRev!AC29","v":250018.88786840491},{"$f":"Est2017DistRev!AD29","v":1076707.6308603093},null,0,0,0,35712.140626205866,0,0,89989.534807688804,0,0,0,0,18276.380703180399,52478.729928131477,196456.78606520654]
[null,{"$f":"Est2017DistRev!B30","v":"Low voltage medium KW 1 rate (mandatory)"},null,0,1.3320000000000001,1.3320000000000001,1.3320000000000001,1.3320000000000001,1.3320000000000001,1.3320000000000001,1.3320000000000001,1.3320000000000001,0,0,4.4640000000000004,2.976,null,{"$f":"Est2017DistRev!R30","v":887309.86353125004},{"$f":"Est2017DistRev!S30","v":0},{"$f":"Est2017DistRev!T30","v":0},{"$f":"Est2017DistRev!U30","v":291747036.79085952},{"$f":"Est2017DistRev!V30","v":0},{"$f":"Est2017DistRev!W30","v":0},{"$f":"Est2017DistRev!X30","v":385398691.39153147},{"$f":"Est2017DistRev!Y30","v":0},{"$f":"Est2017DistRev!Z30","v":0},{"$f":"Est2017DistRev!AA30","v":0},{"$f":"Est2017DistRev!AB30","v":0},{"$f":"Est2017DistRev!AC30","v":26661191.226126004},{"$f":"Est2017DistRev!AD30","v":47275303.633664787},null,0,0,0,3886070.5300542489,0,0,5133510.569335199,0,0,0,0,1190155.5763342651,1406913.036137864,11616649.711861577]
[null,null,null,null,null,null,null,null,null,null,null,null,null,null,null,null,null,null,null,null,null,null,null,null,null,null,null,null,null,null,null,0,0,0,0,0,0,0,0,0,0,0,0,0,0]
[null,null,null,null,null,null,null,null,null,null,null,null,null,null,null,null,null,null,null,null,null,null,null,null,null,null,null,null,null,null,null,0,0,0,0,0,0,0,0,0,0,0,0,0,0]
[null,null,null,null,null,null,null,null,null,null,null,null,null,null,null,null,null,null,null,null,null,null,null,null,null,null,null,null,null,null,null,0,0,0,0,0,0,0,0,0,0,0,0,0,0]
[null,null,null,null,null,null,null,null,null,null,null,null,null,null,null,null,null,null,null,null,null,null,null,null,null,null,null,null,null,null,null,0,0,0,0,0,0,0,0,0,0,0,0,0,0]
[null,null,null,null,null,null,null,null,null,null,null,null,null,null,null,null,null,null,null,null,null,null,null,null,null,null,null,null,null,null,null,0,0,0,0,0,0,0,0,0,0,0,0,0,0]
[null,null,null,null,null,null,null,null,null,null,null,null,null,null,null,null,null,null,null,null,null,null,null,null,null,null,null,null,null,null,null,0,0,0,0,0,0,0,0,0,0,0,0,0,0]
[null,null,null,null,null,null,null,null,null,null,null,null,null,null,null,null,null,null,null,null,null,null,null,null,null,null,null,null,null,null,null,0,0,0,0,0,0,0,0,0,0,0,0,0,0]
[null,null,null,null,null,null,null,null,null,null,null,null,null,null,null,null,null,null,null,null,null,null,null,null,null,null,null,null,null,null,null,0,0,0,0,0,0,0,0,0,0,0,0,0,0]
[null,null,null,null,null,null,null,null,null,null,null,null,null,null,null,null,null,null,null,null,null,null,null,null,null,null,null,null,null,null,null,0,0,0,0,0,0,0,0,0,0,0,0,0,0]
[null,null,null,null,null,null,null,null,null,null,null,null,null,null,null,null,null,null,null,null,null,null,null,null,null,null,null,null,null,null,null,0,0,0,0,0,0,0,0,0,0,0,0,0,0]
[null,null,null,null,null,null,null,null,null,null,null,null,null,null,null,null,null,null,null,null,null,null,null,null,null,null,null,null,null,null,null,0,0,0,0,0,0,0,0,0,0,0,0,0,0]
[null,null,null,null,null,null,null,null,null,null,null,null,null,null,null,null,null,null,null,null,null,null,null,null,null,null,null,null,null,null,null,0,0,0,0,0,0,0,0,0,0,0,0,0,0]
[null,null,null,null,null,null,null,null,null,null,null,null,null,null,null,null,null,null,null,null,null,null,null,null,null,null,null,null,null,null,null,0,0,0,0,0,0,0,0,0,0,0,0,0,0]
[null,null,null,null,null,null,null,null,null,null,null,null,null,null,null,null,null,null,null,null,null,null,null,null,null,null,null,null,null,null,null,0,0,0,0,0,0,0,0,0,0,0,0,0,0]
[null,null,null,null,null,null,null,null,null,null,null,null,null,null,null,null,null,null,null,null,null,null,null,null,null,null,null,null,null,null,null,0,0,0,0,0,0,0,0,0,0,0,0,0,0]
[null,null,null,null,null,null,null,null,null,null,null,null,null,null,null,null,null,null,null,null,null,null,null,null,null,null,null,null,null,null,null,0,0,0,0,0,0,0,0,0,0,0,0,0,0]
[null,null,null,null,null,null,null,null,null,null,null,null,null,null,null,null,null,null,null,null,null,null,null,null,null,null,null,null,null,null,null,0,0,0,0,0,0,0,0,0,0,0,0,0,0]
[null,null,null,null,null,null,null,null,null,null,null,null,null,null,null,null,null,null,null,null,null,null,null,null,null,null,null,null,null,null,null,0,0,0,0,0,0,0,0,0,0,0,0,0,0]
[null,null,null,null,null,null,null,null,null,null,null,null,null,null,null,null,null,null,null,null,null,null,null,null,null,null,null,null,null,null,null,0,0,0,0,0,0,0,0,0,0,0,0,0,0]
[null,null,null,null,null,null,null,null,null,null,null,null,null,null,null,null,null,null,null,null,null,null,null,null,null,null,null,null,null,null,null,0,0,0,0,0,0,0,0,0,0,0,0,0,0]
[null,null,null,null,null,null,null,null,null,null,null,null,null,null,null,null,null,null,null,null,null,null,null,null,null,null,null,null,null,null,null,0,0,0,0,0,0,0,0,0,0,0,0,0,0]
[null,null,null,null,null,null,null,null,null,null,null,null,null,null,null,null,null,null,null,null,null,null,null,null,null,null,null,null,null,null,null,0,0,0,0,0,0,0,0,0,0,0,0,0,0]
[null,null,null,null,null,null,null,null,null,null,null,null,null,null,null,null,null,null,null,null,null,null,null,null,null,null,null,null,null,null,null,0,0,0,0,0,0,0,0,0,0,0,0,0,0]
[null,null,null,null,null,null,null,null,null,null,null,null,null,null,null,null,null,null,null,null,null,null,null,null,null,null,null,null,null,null,null,0,0,0,0,0,0,0,0,0,0,0,0,0,0]
[null,null,null,null,null,null,null,null,null,null,null,null,null,null,null,null,null,null,null,null,null,null,null,null,null,null,null,null,null,null,null,0,0,0,0,0,0,0,0,0,0,0,0,0,0]
[null,null,null,null,null,null,null,null,null,null,null,null,null,null,null,null,null,null,null,null,null,null,null,null,null,null,null,null,null,null,null,0,0,0,0,0,0,0,0,0,0,0,0,0,0]
[null,null,null,null,null,null,null,null,null,null,null,null,null,null,null,null,null,null,null,null,null,null,null,null,null,null,null,null,null,null,null,0,0,0,0,0,0,0,0,0,0,0,0,0,0]
[null,null,null,null,null,null,null,null,null,null,null,null,null,null,null,null,null,null,null,null,null,null,null,null,null,null,null,null,null,null,null,0,0,0,0,0,0,0,0,0,0,0,0,0,0]
[null,null,null,null,null,null,null,null,null,null,null,null,null,null,null,null,null,null,null,null,null,null,null,null,null,null,null,null,null,null,null,0,0,0,0,0,0,0,0,0,0,0,0,0,0]
[null,null,null,null,null,null,null,null,null,null,null,null,null,null,null,null,null,null,null,null,null,null,null,null,null,null,null,null,null,null,null,0,0,0,0,0,0,0,0,0,0,0,0,0,0]
[null,null,null,null,null,null,null,null,null,null,null,null,null,null,null,null,null,null,null,null,null,null,null,null,null,null,null,null,null,null,null,0,0,0,0,0,0,0,0,0,0,0,0,0,0]
[null,null,null,null,null,null,null,null,null,null,null,null,null,null,null,null,null,null,null,null,null,null,null,null,null,null,null,null,null,null,null,0,0,0,0,0,0,0,0,0,0,0,0,0,0]
[null,null,null,null,null,null,null,null,null,null,null,null,null,null,null,null,null,null,null,null,null,null,null,null,null,null,null,null,null,null,null,0,0,0,0,0,0,0,0,0,0,0,0,0,0]
[null,null,null,null,null,null,null,null,null,null,null,null,null,null,null,null,null,null,null,null,null,null,null,null,null,null,null,null,null,null,null,0,0,0,0,0,0,0,0,0,0,0,0,0,0]
[null,null,null,null,null,null,null,null,null,null,null,null,null,null,null,null,null,null,null,null,null,null,null,null,null,null,null,null,null,null,null,0,0,0,0,0,0,0,0,0,0,0,0,0,0]
[null,null,null,null,null,null,null,null,null,null,null,null,null,null,null,null,null,{"$f":"SUM(R6:R65)","v":239743213.29258254},1064360535.3272467,14929314.243660588,1069405240.6470885,1747906053.6257672,0,1487630595.2051415,2346889810.8601327,29299372.719032165,432534112.46928847,129973762.5259601,26913706.50119441,48357064.653660625,null,{"$f":"SUM(AF6:AF65)","v":0},22596932.637057751,413580.81976494985,13449573.939137509,30736561.767967641,0,16333355.095878217,{"$f":"SUM(AM6:AM65)","v":0},723020.69927857933,19377209.597767949,7496561.3669733163,1208562.7177989813,1459563.8339660601,113794922.47559097]

{"sheet":"2018TransRevCont","index":11,"n_rows":66,"n_cols":5,"rows_kept":66,"cut":false,"hidden":false,"merged":[]}
[]
[null,{"$f":"\"Tariff Approval - \"&'Model update'!$C$3","v":"Tariff Approval - United Energy"}]
[]
[null," Designated pricing proposal charges (DPPC)"]
[]
[null,"Year (t)",{"$f":"'Model update'!C5","v":2018}]
[]
[null,"Table 1- Compliance with DPPC Revenue Formula"]
[null,"Revenue from designated pricing proposal charges for year t",{"$f":"Prop2018TransTar!AS66","v":95362944.052874699}]
[null,"Total DPPC related payments for year t",{"$f":"C17","v":95362944.052874699}]
[null,null,{"$f":"IF(C9=\"\",\"\",IF(C10>=C9,\"DPPC REVENUE FORMULA COMPLIANT\",\"DPPC REVENUE FORMULA BREACHED\"))","v":"DPPC REVENUE FORMULA COMPLIANT"}]
[]
[null,"Table 2 - Total DPPC related payments for year t"]
[null,"Transmission charges for year t",{"$f":"C24","v":107501080.34934661}]
[null,"DPPC revenue under/over recovery approved",{"$f":"E49","v":-12138136.296471909}]
[null,"Transmission revenue under/over recovery for years 2014 and 2015"]
[null,"Total DPPC related payments for year t",{"$f":"SUM(C14:C16)","v":95362944.052874699}]
[]
[null,"Table 3 - Transmission charges for year t"]
[null,"AEMO (TCt)",95962384.969200015]
[null,"Transmission connection (TCt)",9929732.8302635998]
[null,"Embedded generators (Gt)",214764.22758599999]
[null,"Inter-network (Dt)",-1394198.3222969905]
[null,"TC + G - D",{"$f":"C20+C21+C22-C23","v":107501080.34934661}]
[]
[]
[]
[]
[null,"Table 4 - DPPC Recovery Arrangements"]
[null,null,"Year t-2","Year t-1","Year t"]
[null,null,"(actual)","(estimate)","(forecast)"]
[null,null,{"$f":"D32-1","v":2016},{"$f":"E32-1","v":2017},{"$f":"C$6","v":2018}]
[]
[null,"(A) Revenue from designated pricing proposal charges",120724059.49528103,{"$f":"Est2017TransRev!AS66","v":113794922.47559097},{"$f":"C9","v":95362944.052874699}]
[]
[]
[null,"(B) Less Total DPPC related payments =",{"$f":"SUM(C39:C41)","v":115098121.70451088},{"$f":"SUM(D39:D41)","v":108195521.23029266},{"$f":"SUM(E39:E41)","v":107501080.34934661}]
[]
[null,"+ Transmission revenue under/over recovery for years 2014 and 2015",3853188.1966950279,-86801.769410898632,{"$f":"C16","v":0}]
[]
[null,"+Transmission charges  =",{"$f":"C42+C43+C44-C45","v":111244933.50781585},{"$f":"D42+D43+D44-D45","v":108282322.99970356},{"$f":"E42+E43+E44-E45","v":107501080.34934661}]
[null,"+AEMO",{"$f":"'TUoS cost audit template'!F7","v":96488879.730000019},96738970.356666669,{"$f":"C20","v":95962384.969200015}]
[null,"+Transmission connection",{"$f":"'TUoS cost audit template'!F14","v":13094345.9},10097368.684180001,{"$f":"C21","v":9929732.8302635998}]
[null,"+Embedded generators",{"$f":"'TUoS cost audit template'!F42","v":367248.79},210553.16429999997,{"$f":"C22","v":214764.22758599999}]
[null,"-Inter-network",{"$f":"'TUoS cost audit template'!F24","v":-1294459.0878158188},-1235430.7945568804,{"$f":"C23","v":-1394198.3222969905}]
[]
[]
[]
[null,"(A minus B) Under/over recovery of revenue for regulatory year",{"$f":"C34-C37","v":5625937.7907701433},{"$f":"D34-D37","v":5599401.2452983111},{"$f":"E34-E37","v":-12138136.296471909}]
[]
[]
[]
[null,"Table 5 - DPPC Unders and Overs Account"]
[null,null,"Year t-2","Year t-1","Year t"]
[null,null,"(actual)","(estimate)","(forecast)"]
[null,"Calendar year",{"$f":"D56-1","v":2016},{"$f":"E56-1","v":2017},{"$f":"C$6","v":2018}]
[]
[null,"Nominal WACC",{"$f":"(1+'Model update'!$B$47)*(1+'Model update'!$C$28)-1","v":5.5231581657706252E-2},{"$f":"(1+'Model update'!$B$45)*(1+'Model update'!$C$29)-1","v":4.9594449826237952E-2},{"$f":"(1+'Model update'!$B$43)*(1+'Model update'!$C$30)-1","v":5.8471241600152712E-2}]
[]
[null,"Opening balance",0,{"$f":"C64","v":5779214.5261131171},{"$f":"D64","v":11802402.216334796}]
[null,"Interest on Opening balance",{"$f":"C60*C58","v":0},{"$f":"D60*D58","v":286616.96485038253},{"$f":"E60*E58","v":690101.11145348963}]
[null,"Under/over recovery of revenue for regulatory year",{"$f":"C49","v":5625937.7907701433},{"$f":"D49","v":5599401.2452983111},{"$f":"E49","v":-12138136.296471909}]
[null,"Interest on under/over recovery for regulatory year",{"$f":"C62*((1+C58)^0.5-1)","v":153276.73534297428},{"$f":"D62*((1+D58)^0.5-1)","v":137169.48007298415},{"$f":"E62*((1+E58)^0.5-1)","v":-349824.91773264372}]
[null,"Closing balance of DPPC overs/ (unders) account",{"$f":"SUM(C60:C63)","v":5779214.5261131171},{"$f":"SUM(D60:D63)","v":11802402.216334796},{"$f":"SUM(E60:E63)","v":4542.1135837335023}]
[]
[null,"The DNSP is expected to achieve a closing balance as close to zero as practicable in its DPPC unders and overs account in each forecast year in its annual pricing proposals in the 2016–20 regulatory control period."]

{"sheet":"TUoS cost audit template","index":12,"n_rows":47,"n_cols":6,"rows_kept":47,"cut":false,"hidden":false,"merged":[[6,1,6,3],[1,1,1,3],[2,1,2,3],[3,1,3,3],[4,1,4,3],[5,1,5,3],[31,1,31,3],[8,1,8,3],[9,1,9,3],[10,1,10,3],[11,1,11,3],[12,1,12,3],[13,1,13,3],[16,1,17,1],[16,2,16,5],[25,1,25,3],[26,1,26,3],[27,1,27,3],[41,1,41,3],[32,1,32,4],[33,1,33,3],[34,1,34,3],[35,1,35,3],[39,1,39,3],[40,1,40,4]]}
[null,{"$f":"\"Tariff Approval - \"&'Model update'!C3","v":"Tariff Approval - United Energy"}]
[null,"TUOS charges (AEMO)",null,null,null,"t-2 actual"]
[]
[null,"AEMO (TUOS Locational Charge)",null,null,null,27503217.480000012]
[null,"AEMO (TUOS Non Locational and Common Service)",null,null,null,63842064.270000003]
[null,"Grid equalisation",null,null,null,5143597.9800000004]
[null,null,null,null,"Total",{"$f":"SUM(F3:F6)","v":96488879.730000019}]
[]
[null,"Transmission connection fees",null,null,null,"t-2 actual"]
[]
[null,"AusNet (Connection)",null,null,null,9064646.0099999998]
[null,"AusNet & AEMO (Augmentation)",null,null,null,4029699.89]
[]
[null,null,null,null,"Total",{"$f":"SUM(F10:F13)","v":13094345.9}]
[]
[null,"Cross boundary network charges (internetwork charges)",null,null,null,"t-2 actual"]
[null,"Distribution Business","Amount (payable)/receivable"]
[null,null,"HV crossings","Subtransmission crossings","TUoS Adjustment","Total"]
[]
[null,"Citipower invoiced for 2013/14",null,539433.24,null,539433.24]
[null,"Ausnet invoiced for 2013/14",null,-354745.22810603899,null,-354745.22810603899]
[null,"Ausnet invoiced for 2014/15",null,-1479147.09970978,null,-1479147.09970978]
[]
[null,"Total",null,null,null,{"$f":"SUM(F19:F23)","v":-1294459.0878158188}]
[]
[null,"Payments to embedded generators",null,null,null,"t-2 actual"]
[null,"Avoided transmission costs"]
[]
[]
[null,"Energy Australia avoided TUOS",null,null,null,367248.79]
[]
[]
[null,"Total",null,null,null,{"$f":"SUM(F28:F32)","v":367248.79}]
[]
[null,"Avoided TUoS usage charges"]
[]
[]
[]
[]
[]
[null,"Total",null,null,null,{"$f":"SUM(F36:F40)","v":0}]
[null,"Total payments to embedded generators",null,null,null,{"$f":"F41+F33","v":367248.79}]
[]
[null,"Where the following definitions apply"]
[null,"HV Crossings","Payments/Receipts for energy transferred utilising the distributor’s HV and LV line assets."]
[null,"Sub-transmission Crossings","Payments/Receipts for the Sub-transmission assets in shared loops that support each distributor’s Zone Substation capacity to ensure N-1 reliability is maintained."]
[null,"TuoS Adjustment ","Payments/Receipts for the adjustment of TuoS paid by a distributor for energy delivered to another distribution business through a shared loop."]

{"sheet":"Prop2018JSTar","index":13,"n_rows":66,"n_cols":45,"rows_kept":66,"cut":false,"hidden":false,"merged":[]}
[null,{"$f":"\"Tariff Approval - \"&'Model update'!C3","v":"Tariff Approval - United Energy"}]
[]
[null,{"$f":"\"PROPOSED \"&'Model update'!$C$5&\" JURISDICTIONAL SCHEME TARIFFS\"","v":"PROPOSED 2018 JURISDICTIONAL SCHEME TARIFFS"}]
[null,null,null,{"$f":"\"Proposed Jurisdictional scheme Tariffs (Pt) for \"&'Model update'!$C$5","v":"Proposed Jurisdictional scheme Tariffs (Pt) for 2018"},null,null,null,null,null,null,null,null,null,null,null,null,null,{"$f":"\"Forecast Quantities (Qt) for \"&'Model update'!$C$5","v":"Forecast Quantities (Qt) for 2018"},null,null,null,null,null,null,null,null,null,null,null,null,null,{"$f":"\"Forecast Revenue (Pt \"&'Model update'!$C$5&\")*(Qt \" &'Model update'!$C$5&\")\"","v":"Forecast Revenue (Pt 2018)*(Qt 2018)"}]
[null,"Proposed tariff",null,"PropTar\nFixed","PropTar\nPkBlk1","PropTar\nPkBlk2","PropTar\nPkBlk3","PropTar\nPkBlk4","PropTar\nOPkBlk1","PropTar\nOPkBlk2","PropTar\nOPkBlk3","PropTar\nOPkBlk4","PropTar\nDemBlk1","PropTar\nDemBlk2","PropTar\nDemBlk3","PropTar\nDemBlk4",null,"FcastVol\nFixed","FcastVol\nPkBlk1","FcastVol\nPkBlk2","FcastVol\nPkBlk3","FcastVol\nPkBlk4","FcastVol\nOPkBlk1","FcastVol\nOPkBlk2","FcastVol\nOPkBlk3","FcastVol\nOPkBlk4","FcastVol\nDemBlk1","FcastVol\nDemBlk2","FcastVol\nDemBlk3","FcastVol\nDemBlk4",null,"PropRev\nFixed","PropRev\nPkBlk1","PropRev\nPkBlk2","PropRev\nPkBlk3","PropRev\nPkBlk4","PropRev\nOPkBlk1","PropRev\nOPkBlk2","PropRev\nOPkBlk3","PropRev\nOPkBlk4","PropRev\nDemBlk1","PropRev\nDemBlk2","PropRev\nDemBlk3","PropRev\nDemBlk4","PropRev\nSumBlk1"]
[null,{"$f":"Prop2018DistTar!B6","v":"Low voltage small 1 rate"},null,5.4089999999999998,0,0,0,0,0,0,0,0,0,0,0,0,null,{"$f":"Prop2018TransTar!R6","v":205549567.62323707},{"$f":"Prop2018TransTar!S6","v":885866510.70770717},{"$f":"Prop2018TransTar!T6","v":0},{"$f":"Prop2018TransTar!U6","v":0},{"$f":"Prop2018TransTar!V6","v":1445601999.1844056},{"$f":"Prop2018TransTar!W6","v":0},{"$f":"Prop2018TransTar!X6","v":0},{"$f":"Prop2018TransTar!Y6","v":0},{"$f":"Prop2018TransTar!Z6","v":0},{"$f":"Prop2018TransTar!AA6","v":0},{"$f":"Prop2018TransTar!AB6","v":0},{"$f":"Prop2018TransTar!AC6","v":0},{"$f":"Prop2018TransTar!AD6","v":0},null,{"$f":"D6/100*R6","v":11118176.112740893},{"$f":"E6/100*S6","v":0},{"$f":"F6/100*T6","v":0},{"$f":"G6/100*U6","v":0},{"$f":"H6/100*V6","v":0},{"$f":"I6/100*W6","v":0},{"$f":"J6/100*X6","v":0},{"$f":"K6/100*Y6","v":0},{"$f":"L6/100*Z6","v":0},{"$f":"M6/100*AA6","v":0},{"$f":"N6/100*AB6","v":0},{"$f":"O6/100*AC6","v":0},{"$f":"P6/100*AD6","v":0},{"$f":"SUM(AF6:AR6)","v":11118176.112740893}]
[null,{"$f":"Prop2018DistTar!B7","v":"Winter economy tariff"},null,5.4089999999999998,0,0,0,0,0,0,0,0,0,0,0,0,null,{"$f":"Prop2018TransTar!R7","v":50220},{"$f":"Prop2018TransTar!S7","v":265149.05092429707},{"$f":"Prop2018TransTar!T7","v":0},{"$f":"Prop2018TransTar!U7","v":0},{"$f":"Prop2018TransTar!V7","v":483663.45314424351},{"$f":"Prop2018TransTar!W7","v":0},{"$f":"Prop2018TransTar!X7","v":0},{"$f":"Prop2018TransTar!Y7","v":0},{"$f":"Prop2018TransTar!Z7","v":0},{"$f":"Prop2018TransTar!AA7","v":0},{"$f":"Prop2018TransTar!AB7","v":0},{"$f":"Prop2018TransTar!AC7","v":0},{"$f":"Prop2018TransTar!AD7","v":0},null,2716.3998000000001,0,0,0,0,0,0,0,0,0,0,0,0,2716.3998000000001]
[null,{"$f":"Prop2018DistTar!B8","v":"Reverse cycle airconditioning time of use"},null,5.4089999999999998,0,0,0,0,0,0,0,0,0,0,0,0,null,{"$f":"Prop2018TransTar!R8","v":0},{"$f":"Prop2018TransTar!S8","v":0},{"$f":"Prop2018TransTar!T8","v":0},{"$f":"Prop2018TransTar!U8","v":0},{"$f":"Prop2018TransTar!V8","v":0},{"$f":"Prop2018TransTar!W8","v":0},{"$f":"Prop2018TransTar!X8","v":0},{"$f":"Prop2018TransTar!Y8","v":0},{"$f":"Prop2018TransTar!Z8","v":0},{"$f":"Prop2018TransTar!AA8","v":0},{"$f":"Prop2018TransTar!AB8","v":0},{"$f":"Prop2018TransTar!AC8","v":0},{"$f":"Prop2018TransTar!AD8","v":0},null,0,0,0,0,0,0,0,0,0,0,0,0,0,0]
[null,{"$f":"Prop2018DistTar!B9","v":"Low voltage small 2 rate"},null,5.4089999999999998,0,0,0,0,0,0,0,0,0,0,0,0,null,{"$f":"Prop2018TransTar!R9","v":1500124.8362499997},{"$f":"Prop2018TransTar!S9","v":0},{"$f":"Prop2018TransTar!T9","v":0},{"$f":"Prop2018TransTar!U9","v":4199343.7007283811},{"$f":"Prop2018TransTar!V9","v":0},{"$f":"Prop2018TransTar!W9","v":0},{"$f":"Prop2018TransTar!X9","v":6958274.448766781},{"$f":"Prop2018TransTar!Y9","v":14004754.286124827},{"$f":"Prop2018TransTar!Z9","v":0},{"$f":"Prop2018TransTar!AA9","v":0},{"$f":"Prop2018TransTar!AB9","v":0},{"$f":"Prop2018TransTar!AC9","v":0},{"$f":"Prop2018TransTar!AD9","v":0},null,81141.752392762486,0,0,0,0,0,0,0,0,0,0,0,0,81141.752392762486]
[null,{"$f":"Prop2018DistTar!B10","v":"Dedicated circuit"},null,0,0,0,0,0,0,0,0,0,0,0,0,0,null,{"$f":"Prop2018TransTar!R10","v":1899.9900000000002},{"$f":"Prop2018TransTar!S10","v":0},{"$f":"Prop2018TransTar!T10","v":0},{"$f":"Prop2018TransTar!U10","v":0},{"$f":"Prop2018TransTar!V10","v":0},{"$f":"Prop2018TransTar!W10","v":0},{"$f":"Prop2018TransTar!X10","v":0},{"$f":"Prop2018TransTar!Y10","v":95116849.231297255},{"$f":"Prop2018TransTar!Z10","v":0},{"$f":"Prop2018TransTar!AA10","v":0},{"$f":"Prop2018TransTar!AB10","v":0},{"$f":"Prop2018TransTar!AC10","v":0},{"$f":"Prop2018TransTar!AD10","v":0},null,0,0,0,0,0,0,0,0,0,0,0,0,0,0]
[null,{"$f":"Prop2018DistTar!B11","v":"Low voltage medium 1 rate"},null,5.4089999999999998,0,0,0,0,0,0,0,0,0,0,0,0,null,{"$f":"Prop2018TransTar!R11","v":12033520.757353125},{"$f":"Prop2018TransTar!S11","v":153338365.9234888},{"$f":"Prop2018TransTar!T11","v":0},{"$f":"Prop2018TransTar!U11","v":0},{"$f":"Prop2018TransTar!V11","v":231891372.16376382},{"$f":"Prop2018TransTar!W11","v":0},{"$f":"Prop2018TransTar!X11","v":0},{"$f":"Prop2018TransTar!Y11","v":12},{"$f":"Prop2018TransTar!Z11","v":0},{"$f":"Prop2018TransTar!AA11","v":0},{"$f":"Prop2018TransTar!AB11","v":0},{"$f":"Prop2018TransTar!AC11","v":0},{"$f":"Prop2018TransTar!AD11","v":0},null,650893.13776523049,0,0,0,0,0,0,0,0,0,0,0,0,650893.13776523049]
[null,{"$f":"Prop2018DistTar!B12","v":"Low voltage medium 2 rate 5 day"},null,5.4089999999999998,0,0,0,0,0,0,0,0,0,0,0,0,null,{"$f":"Prop2018TransTar!R12","v":3807335.9830250018},{"$f":"Prop2018TransTar!S12","v":0},{"$f":"Prop2018TransTar!T12","v":0},{"$f":"Prop2018TransTar!U12","v":51707044.732552052},{"$f":"Prop2018TransTar!V12","v":0},{"$f":"Prop2018TransTar!W12","v":0},{"$f":"Prop2018TransTar!X12","v":74994609.046321467},{"$f":"Prop2018TransTar!Y12","v":77026041.232533157},{"$f":"Prop2018TransTar!Z12","v":0},{"$f":"Prop2018TransTar!AA12","v":0},{"$f":"Prop2018TransTar!AB12","v":0},{"$f":"Prop2018TransTar!AC12","v":0},{"$f":"Prop2018TransTar!AD12","v":0},null,205938.80332182234,0,0,0,0,0,0,0,0,0,0,0,0,205938.80332182234]
[null,{"$f":"Prop2018DistTar!B13","v":"Low voltage medium 2 rate 7 day"},null,5.4089999999999998,0,0,0,0,0,0,0,0,0,0,0,0,null,{"$f":"Prop2018TransTar!R13","v":1844598.2368041668},{"$f":"Prop2018TransTar!S13","v":0},{"$f":"Prop2018TransTar!T13","v":0},{"$f":"Prop2018TransTar!U13","v":22006070.238745652},{"$f":"Prop2018TransTar!V13","v":0},{"$f":"Prop2018TransTar!W13","v":0},{"$f":"Prop2018TransTar!X13","v":33856652.726462662},{"$f":"Prop2018TransTar!Y13","v":14992889.813662352},{"$f":"Prop2018TransTar!Z13","v":0},{"$f":"Prop2018TransTar!AA13","v":0},{"$f":"Prop2018TransTar!AB13","v":0},{"$f":"Prop2018TransTar!AC13","v":0},{"$f":"Prop2018TransTar!AD13","v":0},null,99774.318628737383,0,0,0,0,0,0,0,0,0,0,0,0,99774.318628737383]
[null,{"$f":"Prop2018DistTar!B14","v":"Unmetered supplies"},null,0,0,0,0,0,0,0,0,0,0,0,0,0,null,{"$f":"Prop2018TransTar!R14","v":3707289.0420999988},{"$f":"Prop2018TransTar!S14","v":0},{"$f":"Prop2018TransTar!T14","v":0},{"$f":"Prop2018TransTar!U14","v":10816030.725244839},{"$f":"Prop2018TransTar!V14","v":0},{"$f":"Prop2018TransTar!W14","v":0},{"$f":"Prop2018TransTar!X14","v":18164542.768627141},{"$f":"Prop2018TransTar!Y14","v":66285006.261596173},{"$f":"Prop2018TransTar!Z14","v":0},{"$f":"Prop2018TransTar!AA14","v":0},{"$f":"Prop2018TransTar!AB14","v":0},{"$f":"Prop2018TransTar!AC14","v":0},{"$f":"Prop2018TransTar!AD14","v":0},null,0,0,0,0,0,0,0,0,0,0,0,0,0,0]
[null,{"$f":"Prop2018DistTar!B15","v":"Low voltage large 1 rate"},null,5.4089999999999998,0,0,0,0,0,0,0,0,0,0,0,0,null,{"$f":"Prop2018TransTar!R15","v":2621.992916666667},{"$f":"Prop2018TransTar!S15","v":577413.25391898619},{"$f":"Prop2018TransTar!T15","v":0},{"$f":"Prop2018TransTar!U15","v":0},{"$f":"Prop2018TransTar!V15","v":774143.47562545771},{"$f":"Prop2018TransTar!W15","v":0},{"$f":"Prop2018TransTar!X15","v":0},{"$f":"Prop2018TransTar!Y15","v":0},{"$f":"Prop2018TransTar!Z15","v":0},{"$f":"Prop2018TransTar!AA15","v":0},{"$f":"Prop2018TransTar!AB15","v":0},{"$f":"Prop2018TransTar!AC15","v":0},{"$f":"Prop2018TransTar!AD15","v":0},null,141.82359686250001,0,0,0,0,0,0,0,0,0,0,0,0,141.82359686250001]
[null,{"$f":"Prop2018DistTar!B16","v":"Low voltage large 2 rate"},null,5.4089999999999998,0,0,0,0,0,0,0,0,0,0,0,0,null,{"$f":"Prop2018TransTar!R16","v":8128.178041666677},{"$f":"Prop2018TransTar!S16","v":0},{"$f":"Prop2018TransTar!T16","v":0},{"$f":"Prop2018TransTar!U16","v":903588.49940318661},{"$f":"Prop2018TransTar!V16","v":0},{"$f":"Prop2018TransTar!W16","v":0},{"$f":"Prop2018TransTar!X16","v":1258017.5391398347},{"$f":"Prop2018TransTar!Y16","v":1362054.1475024181},{"$f":"Prop2018TransTar!Z16","v":0},{"$f":"Prop2018TransTar!AA16","v":0},{"$f":"Prop2018TransTar!AB16","v":0},{"$f":"Prop2018TransTar!AC16","v":0},{"$f":"Prop2018TransTar!AD16","v":0},null,439.65315027375055,0,0,0,0,0,0,0,0,0,0,0,0,439.65315027375055]
[null,{"$f":"Prop2018DistTar!B17","v":"Low voltage KW time of use"},null,5.4089999999999998,0,0,0,0,0,0,0,0,0,0,0,0,null,{"$f":"Prop2018TransTar!R17","v":85424.52922499986},{"$f":"Prop2018TransTar!S17","v":0},{"$f":"Prop2018TransTar!T17","v":0},{"$f":"Prop2018TransTar!U17","v":2797481.7148522977},{"$f":"Prop2018TransTar!V17","v":0},{"$f":"Prop2018TransTar!W17","v":0},{"$f":"Prop2018TransTar!X17","v":4144236.3214554214},{"$f":"Prop2018TransTar!Y17","v":6586209.0446983874},{"$f":"Prop2018TransTar!Z17","v":0},{"$f":"Prop2018TransTar!AA17","v":0},{"$f":"Prop2018TransTar!AB17","v":682957.56934354687},{"$f":"Prop2018TransTar!AC17","v":0},{"$f":"Prop2018TransTar!AD17","v":0},null,4620.6127857802421,0,0,0,0,0,0,0,0,0,0,0,0,4620.6127857802421]
[null,{"$f":"Prop2018DistTar!B18","v":"Low voltage KW time of use - HOT"},null,5.4089999999999998,0,0,0,0,0,0,0,0,0,0,0,0,null,{"$f":"Prop2018TransTar!R18","v":3704.5014208333332},{"$f":"Prop2018TransTar!S18","v":0},{"$f":"Prop2018TransTar!T18","v":0},{"$f":"Prop2018TransTar!U18","v":38522.958026668151},{"$f":"Prop2018TransTar!V18","v":0},{"$f":"Prop2018TransTar!W18","v":0},{"$f":"Prop2018TransTar!X18","v":57008.244498067019},{"$f":"Prop2018TransTar!Y18","v":138325.92722822793},{"$f":"Prop2018TransTar!Z18","v":0},{"$f":"Prop2018TransTar!AA18","v":0},{"$f":"Prop2018TransTar!AB18","v":151569.56785218362},{"$f":"Prop2018TransTar!AC18","v":0},{"$f":"Prop2018TransTar!AD18","v":0},null,200.376481852875,0,0,0,0,0,0,0,0,0,0,0,0,200.376481852875]
[null,{"$f":"Prop2018DistTar!B19","v":"Low voltage large KVA time of use"},null,5.4089999999999998,0,0,0,0,0,0,0,0,0,0,0,0,null,{"$f":"Prop2018TransTar!R19","v":1207904.4289999995},{"$f":"Prop2018TransTar!S19","v":0},{"$f":"Prop2018TransTar!T19","v":0},{"$f":"Prop2018TransTar!U19","v":460697092.68562466},{"$f":"Prop2018TransTar!V19","v":0},{"$f":"Prop2018TransTar!W19","v":0},{"$f":"Prop2018TransTar!X19","v":653613576.1763531},{"$f":"Prop2018TransTar!Y19","v":1268388147.0325294},{"$f":"Prop2018TransTar!Z19","v":0},{"$f":"Prop2018TransTar!AA19","v":331111136.77099401},{"$f":"Prop2018TransTar!AB19","v":96046797.401065037},{"$f":"Prop2018TransTar!AC19","v":0},{"$f":"Prop2018TransTar!AD19","v":0},null,65335.550564609977,0,0,0,0,0,0,0,0,0,0,0,0,65335.550564609977]
[null,{"$f":"Prop2018DistTar!B20","v":"Low voltage large KVA time of use - HOT"},null,5.4089999999999998,0,0,0,0,0,0,0,0,0,0,0,0,null,{"$f":"Prop2018TransTar!R20","v":3.1E-7},{"$f":"Prop2018TransTar!S20","v":0},{"$f":"Prop2018TransTar!T20","v":0},{"$f":"Prop2018TransTar!U20","v":0},{"$f":"Prop2018TransTar!V20","v":0},{"$f":"Prop2018TransTar!W20","v":0},{"$f":"Prop2018TransTar!X20","v":0},{"$f":"Prop2018TransTar!Y20","v":0},{"$f":"Prop2018TransTar!Z20","v":0},{"$f":"Prop2018TransTar!AA20","v":0},{"$f":"Prop2018TransTar!AB20","v":0},{"$f":"Prop2018TransTar!AC20","v":0},{"$f":"Prop2018TransTar!AD20","v":0},null,1.67679E-8,0,0,0,0,0,0,0,0,0,0,0,0,1.67679E-8]
[null,{"$f":"Prop2018DistTar!B21","v":"High voltage KVA time of use"},null,5.4089999999999998,0,0,0,0,0,0,0,0,0,0,0,0,null,{"$f":"Prop2018TransTar!R21","v":34316.689999999988},{"$f":"Prop2018TransTar!S21","v":0},{"$f":"Prop2018TransTar!T21","v":0},{"$f":"Prop2018TransTar!U21","v":170523448.74060524},{"$f":"Prop2018TransTar!V21","v":0},{"$f":"Prop2018TransTar!W21","v":0},{"$f":"Prop2018TransTar!X21","v":248821547.84836793},{"$f":"Prop2018TransTar!Y21","v":637350623.78137767},{"$f":"Prop2018TransTar!Z21","v":0},{"$f":"Prop2018TransTar!AA21","v":103610388.30378608},{"$f":"Prop2018TransTar!AB21","v":31102876.482047074},{"$f":"Prop2018TransTar!AC21","v":0},{"$f":"Prop2018TransTar!AD21","v":0},null,1856.1897620999994,0,0,0,0,0,0,0,0,0,0,0,0,1856.1897620999994]
[null,{"$f":"Prop2018DistTar!B22","v":"High voltage KVA time of use - HOT"},null,5.4089999999999998,0,0,0,0,0,0,0,0,0,0,0,0,null,{"$f":"Prop2018TransTar!R22","v":0},{"$f":"Prop2018TransTar!S22","v":0},{"$f":"Prop2018TransTar!T22","v":0},{"$f":"Prop2018TransTar!U22","v":0},{"$f":"Prop2018TransTar!V22","v":0},{"$f":"Prop2018TransTar!W22","v":0},{"$f":"Prop2018TransTar!X22","v":0},{"$f":"Prop2018TransTar!Y22","v":0},{"$f":"Prop2018TransTar!Z22","v":0},{"$f":"Prop2018TransTar!AA22","v":0},{"$f":"Prop2018TransTar!AB22","v":0},{"$f":"Prop2018TransTar!AC22","v":0},{"$f":"Prop2018TransTar!AD22","v":0},null,0,0,0,0,0,0,0,0,0,0,0,0,0,0]
[null,{"$f":"Prop2018DistTar!B23","v":"Subtransmission KVA time of use"},null,5.4089999999999998,0,0,0,0,0,0,0,0,0,0,0,0,null,{"$f":"Prop2018TransTar!R23","v":372},{"$f":"Prop2018TransTar!S23","v":0},{"$f":"Prop2018TransTar!T23","v":0},{"$f":"Prop2018TransTar!U23","v":8273861.7699614735},{"$f":"Prop2018TransTar!V23","v":0},{"$f":"Prop2018TransTar!W23","v":0},{"$f":"Prop2018TransTar!X23","v":11602727.599683488},{"$f":"Prop2018TransTar!Y23","v":16115661.387170799},{"$f":"Prop2018TransTar!Z23","v":0},{"$f":"Prop2018TransTar!AA23","v":4238689.6126332916},{"$f":"Prop2018TransTar!AB23","v":1512895.9876330707},{"$f":"Prop2018TransTar!AC23","v":0},{"$f":"Prop2018TransTar!AD23","v":0},null,20.121479999999998,0,0,0,0,0,0,0,0,0,0,0,0,20.121479999999998]
[null,{"$f":"Prop2018DistTar!B24","v":"TOD"},null,5.4089999999999998,0,0,0,0,0,0,0,0,0,0,0,0,null,{"$f":"Prop2018TransTar!R24","v":15707814.647299996},{"$f":"Prop2018TransTar!S24","v":0},{"$f":"Prop2018TransTar!T24","v":12080098.602927629},{"$f":"Prop2018TransTar!U24","v":22156770.540210932},{"$f":"Prop2018TransTar!V24","v":0},{"$f":"Prop2018TransTar!W24","v":0},{"$f":"Prop2018TransTar!X24","v":42584001.269890659},{"$f":"Prop2018TransTar!Y24","v":107941636.15173109},{"$f":"Prop2018TransTar!Z24","v":25155080.815130644},{"$f":"Prop2018TransTar!AA24","v":0},{"$f":"Prop2018TransTar!AB24","v":0},{"$f":"Prop2018TransTar!AC24","v":0},{"$f":"Prop2018TransTar!AD24","v":0},null,849635.69427245681,0,0,0,0,0,0,0,0,0,0,0,0,849635.69427245681]
[null,{"$f":"Prop2018DistTar!B25","v":"TOD9"},null,5.4089999999999998,0,0,0,0,0,0,0,0,0,0,0,0,null,{"$f":"Prop2018TransTar!R25","v":817673.4375},{"$f":"Prop2018TransTar!S25","v":0},{"$f":"Prop2018TransTar!T25","v":471688.28190885769},{"$f":"Prop2018TransTar!U25","v":634148.94264614163},{"$f":"Prop2018TransTar!V25","v":0},{"$f":"Prop2018TransTar!W25","v":0},{"$f":"Prop2018TransTar!X25","v":1239459.5235104598},{"$f":"Prop2018TransTar!Y25","v":4524672.0305463392},{"$f":"Prop2018TransTar!Z25","v":942133.89760566922},{"$f":"Prop2018TransTar!AA25","v":0},{"$f":"Prop2018TransTar!AB25","v":0},{"$f":"Prop2018TransTar!AC25","v":0},{"$f":"Prop2018TransTar!AD25","v":0},null,44227.956234375,0,0,0,0,0,0,0,0,0,0,0,0,44227.956234375]
[null,{"$f":"Prop2018DistTar!B26","v":"TOU"},null,5.4089999999999998,0,0,0,0,0,0,0,0,0,0,0,0,null,{"$f":"Prop2018TransTar!R26","v":219431.88199375005},{"$f":"Prop2018TransTar!S26","v":0},{"$f":"Prop2018TransTar!T26","v":0},{"$f":"Prop2018TransTar!U26","v":4014520.9534145421},{"$f":"Prop2018TransTar!V26","v":0},{"$f":"Prop2018TransTar!W26","v":0},{"$f":"Prop2018TransTar!X26","v":6566809.1726725269},{"$f":"Prop2018TransTar!Y26","v":7462286.8817174928},{"$f":"Prop2018TransTar!Z26","v":0},{"$f":"Prop2018TransTar!AA26","v":0},{"$f":"Prop2018TransTar!AB26","v":1110253.6036445084},{"$f":"Prop2018TransTar!AC26","v":0},{"$f":"Prop2018TransTar!AD26","v":0},null,11869.070497041939,0,0,0,0,0,0,0,0,0,0,0,0,11869.070497041939]
[null,{"$f":"Prop2018DistTar!B27","v":"TODFLEX"},null,5.4089999999999998,0,0,0,0,0,0,0,0,0,0,0,0,null,{"$f":"Prop2018TransTar!R27","v":762427.32999999984},{"$f":"Prop2018TransTar!S27","v":0},{"$f":"Prop2018TransTar!T27","v":1766358.3410498402},{"$f":"Prop2018TransTar!U27","v":897799.59964108723},{"$f":"Prop2018TransTar!V27","v":0},{"$f":"Prop2018TransTar!W27","v":0},{"$f":"Prop2018TransTar!X27","v":1502959.0853530241},{"$f":"Prop2018TransTar!Y27","v":3382265.656111144},{"$f":"Prop2018TransTar!Z27","v":2942300.1035350314},{"$f":"Prop2018TransTar!AA27","v":0},{"$f":"Prop2018TransTar!AB27","v":0},{"$f":"Prop2018TransTar!AC27","v":0},{"$f":"Prop2018TransTar!AD27","v":0},null,41239.694279699994,0,0,0,0,0,0,0,0,0,0,0,0,41239.694279699994]
[null,{"$f":"Prop2018DistTar!B28","v":"Low Voltage KW 1 rate"},null,5.4089999999999998,0,0,0,0,0,0,0,0,0,0,0,0,null,{"$f":"Prop2018TransTar!R28","v":1115018.7925630142},{"$f":"Prop2018TransTar!S28","v":0},{"$f":"Prop2018TransTar!T28","v":0},{"$f":"Prop2018TransTar!U28","v":5256477.6292454861},{"$f":"Prop2018TransTar!V28","v":0},{"$f":"Prop2018TransTar!W28","v":0},{"$f":"Prop2018TransTar!X28","v":7359068.6809436809},{"$f":"Prop2018TransTar!Y28","v":0},{"$f":"Prop2018TransTar!Z28","v":0},{"$f":"Prop2018TransTar!AA28","v":0},{"$f":"Prop2018TransTar!AB28","v":0},{"$f":"Prop2018TransTar!AC28","v":779540.58692469075},{"$f":"Prop2018TransTar!AD28","v":2537178.5160448891},null,60311.366489733438,0,0,0,0,0,0,0,0,0,0,0,0,60311.366489733438]
[null,{"$f":"Prop2018DistTar!B29","v":"Low voltage medium KW time of use (opt-in)"},null,5.4089999999999998,0,0,0,0,0,0,0,0,0,0,0,0,null,{"$f":"Prop2018TransTar!R29","v":175817.14583333323},{"$f":"Prop2018TransTar!S29","v":0},{"$f":"Prop2018TransTar!T29","v":0},{"$f":"Prop2018TransTar!U29","v":8362481.4638386657},{"$f":"Prop2018TransTar!V29","v":0},{"$f":"Prop2018TransTar!W29","v":0},{"$f":"Prop2018TransTar!X29","v":12391679.133156199},{"$f":"Prop2018TransTar!Y29","v":0},{"$f":"Prop2018TransTar!Z29","v":0},{"$f":"Prop2018TransTar!AA29","v":0},{"$f":"Prop2018TransTar!AB29","v":0},{"$f":"Prop2018TransTar!AC29","v":616176.69832109148},{"$f":"Prop2018TransTar!AD29","v":1472922.2518598167},null,9509.9494181249938,0,0,0,0,0,0,0,0,0,0,0,0,9509.9494181249938]
[null,{"$f":"Prop2018DistTar!B30","v":"Low voltage medium KW 1 rate (mandatory)"},null,5.4089999999999998,0,0,0,0,0,0,0,0,0,0,0,0,null,{"$f":"Prop2018TransTar!R30","v":2702828.704859375},{"$f":"Prop2018TransTar!S30","v":0},{"$f":"Prop2018TransTar!T30","v":0},{"$f":"Prop2018TransTar!U30","v":283403271.17653072},{"$f":"Prop2018TransTar!V30","v":0},{"$f":"Prop2018TransTar!W30","v":0},{"$f":"Prop2018TransTar!X30","v":388617179.88766599},{"$f":"Prop2018TransTar!Y30","v":0},{"$f":"Prop2018TransTar!Z30","v":0},{"$f":"Prop2018TransTar!AA30","v":0},{"$f":"Prop2018TransTar!AB30","v":0},{"$f":"Prop2018TransTar!AC30","v":25908737.341048431},{"$f":"Prop2018TransTar!AD30","v":46484440.594827987},null,146196.00464584358,0,0,0,0,0,0,0,0,0,0,0,0,146196.00464584358]
[null,null,null,null,null,null,null,null,null,null,null,null,null,null,null,null,null,null,null,null,null,null,null,null,null,null,null,null,null,null,null,0,0,0,0,0,0,0,0,0,0,0,0,0,0]
[null,null,null,null,null,null,null,null,null,null,null,null,null,null,null,null,null,null,null,null,null,null,null,null,null,null,null,null,null,null,null,0,0,0,0,0,0,0,0,0,0,0,0,0,0]
[null,null,null,null,null,null,null,null,null,null,null,null,null,null,null,null,null,null,null,null,null,null,null,null,null,null,null,null,null,null,null,0,0,0,0,0,0,0,0,0,0,0,0,0,0]
[null,null,null,null,null,null,null,null,null,null,null,null,null,null,null,null,null,null,null,null,null,null,null,null,null,null,null,null,null,null,null,0,0,0,0,0,0,0,0,0,0,0,0,0,0]
[null,null,null,null,null,null,null,null,null,null,null,null,null,null,null,null,null,null,null,null,null,null,null,null,null,null,null,null,null,null,null,0,0,0,0,0,0,0,0,0,0,0,0,0,0]
[null,null,null,null,null,null,null,null,null,null,null,null,null,null,null,null,null,null,null,null,null,null,null,null,null,null,null,null,null,null,null,0,0,0,0,0,0,0,0,0,0,0,0,0,0]
[null,null,null,null,null,null,null,null,null,null,null,null,null,null,null,null,null,null,null,null,null,null,null,null,null,null,null,null,null,null,null,0,0,0,0,0,0,0,0,0,0,0,0,0,0]
[null,null,null,null,null,null,null,null,null,null,null,null,null,null,null,null,null,null,null,null,null,null,null,null,null,null,null,null,null,null,null,0,0,0,0,0,0,0,0,0,0,0,0,0,0]
[null,null,null,null,null,null,null,null,null,null,null,null,null,null,null,null,null,null,null,null,null,null,null,null,null,null,null,null,null,null,null,0,0,0,0,0,0,0,0,0,0,0,0,0,0]
[null,null,null,null,null,null,null,null,null,null,null,null,null,null,null,null,null,null,null,null,null,null,null,null,null,null,null,null,null,null,null,0,0,0,0,0,0,0,0,0,0,0,0,0,0]
[null,null,null,null,null,null,null,null,null,null,null,null,null,null,null,null,null,null,null,null,null,null,null,null,null,null,null,null,null,null,null,0,0,0,0,0,0,0,0,0,0,0,0,0,0]
[null,null,null,null,null,null,null,null,null,null,null,null,null,null,null,null,null,null,null,null,null,null,null,null,null,null,null,null,null,null,null,0,0,0,0,0,0,0,0,0,0,0,0,0,0]
[null,null,null,null,null,null,null,null,null,null,null,null,null,null,null,null,null,null,null,null,null,null,null,null,null,null,null,null,null,null,null,0,0,0,0,0,0,0,0,0,0,0,0,0,0]
[null,null,null,null,null,null,null,null,null,null,null,null,null,null,null,null,null,null,null,null,null,null,null,null,null,null,null,null,null,null,null,0,0,0,0,0,0,0,0,0,0,0,0,0,0]
[null,null,null,null,null,null,null,null,null,null,null,null,null,null,null,null,null,null,null,null,null,null,null,null,null,null,null,null,null,null,null,0,0,0,0,0,0,0,0,0,0,0,0,0,0]
[null,null,null,null,null,null,null,null,null,null,null,null,null,null,null,null,null,null,null,null,null,null,null,null,null,null,null,null,null,null,null,0,0,0,0,0,0,0,0,0,0,0,0,0,0]
[null,null,null,null,null,null,null,null,null,null,null,null,null,null,null,null,null,null,null,null,null,null,null,null,null,null,null,null,null,null,null,0,0,0,0,0,0,0,0,0,0,0,0,0,0]
[null,null,null,null,null,null,null,null,null,null,null,null,null,null,null,null,null,null,null,null,null,null,null,null,null,null,null,null,null,null,null,0,0,0,0,0,0,0,0,0,0,0,0,0,0]
[null,null,null,null,null,null,null,null,null,null,null,null,null,null,null,null,null,null,null,null,null,null,null,null,null,null,null,null,null,null,null,0,0,0,0,0,0,0,0,0,0,0,0,0,0]
[null,null,null,null,null,null,null,null,null,null,null,null,null,null,null,null,null,null,null,null,null,null,null,null,null,null,null,null,null,null,null,0,0,0,0,0,0,0,0,0,0,0,0,0,0]
[null,null,null,null,null,null,null,null,null,null,null,null,null,null,null,null,null,null,null,null,null,null,null,null,null,null,null,null,null,null,null,0,0,0,0,0,0,0,0,0,0,0,0,0,0]
[null,null,null,null,null,null,null,null,null,null,null,null,null,null,null,null,null,null,null,null,null,null,null,null,null,null,null,null,null,null,null,0,0,0,0,0,0,0,0,0,0,0,0,0,0]
[null,null,null,null,null,null,null,null,null,null,null,null,null,null,null,null,null,null,null,null,null,null,null,null,null,null,null,null,null,null,null,0,0,0,0,0,0,0,0,0,0,0,0,0,0]
[null,null,null,null,null,null,null,null,null,null,null,null,null,null,null,null,null,null,null,null,null,null,null,null,null,null,null,null,null,null,null,0,0,0,0,0,0,0,0,0,0,0,0,0,0]
[null,null,null,null,null,null,null,null,null,null,null,null,null,null,null,null,null,null,null,null,null,null,null,null,null,null,null,null,null,null,null,0,0,0,0,0,0,0,0,0,0,0,0,0,0]
[null,null,null,null,null,null,null,null,null,null,null,null,null,null,null,null,null,null,null,null,null,null,null,null,null,null,null,null,null,null,null,0,0,0,0,0,0,0,0,0,0,0,0,0,0]
[null,null,null,null,null,null,null,null,null,null,null,null,null,null,null,null,null,null,null,null,null,null,null,null,null,null,null,null,null,null,null,0,0,0,0,0,0,0,0,0,0,0,0,0,0]
[null,null,null,null,null,null,null,null,null,null,null,null,null,null,null,null,null,null,null,null,null,null,null,null,null,null,null,null,null,null,null,0,0,0,0,0,0,0,0,0,0,0,0,0,0]
[null,null,null,null,null,null,null,null,null,null,null,null,null,null,null,null,null,null,null,null,null,null,null,null,null,null,null,null,null,null,null,0,0,0,0,0,0,0,0,0,0,0,0,0,0]
[null,null,null,null,null,null,null,null,null,null,null,null,null,null,null,null,null,null,null,null,null,null,null,null,null,null,null,null,null,null,null,0,0,0,0,0,0,0,0,0,0,0,0,0,0]
[null,null,null,null,null,null,null,null,null,null,null,null,null,null,null,null,null,null,null,null,null,null,null,null,null,null,null,null,null,null,null,0,0,0,0,0,0,0,0,0,0,0,0,0,0]
[null,null,null,null,null,null,null,null,null,null,null,null,null,null,null,null,null,null,null,null,null,null,null,null,null,null,null,null,null,null,null,0,0,0,0,0,0,0,0,0,0,0,0,0,0]
[null,null,null,null,null,null,null,null,null,null,null,null,null,null,null,null,null,null,null,null,null,null,null,null,null,null,null,null,null,null,null,0,0,0,0,0,0,0,0,0,0,0,0,0,0]
[null,null,null,null,null,null,null,null,null,null,null,null,null,null,null,null,null,null,null,null,null,null,null,null,null,null,null,null,null,null,null,0,0,0,0,0,0,0,0,0,0,0,0,0,0]
[null,null,null,null,null,null,null,null,null,null,null,null,null,null,null,null,null,null,null,null,null,null,null,null,null,null,null,null,null,null,null,0,0,0,0,0,0,0,0,0,0,0,0,0,0]
[null,null,null,null,null,null,null,null,null,null,null,null,null,null,null,null,null,{"$f":"SUM(R6:R65)","v":251338040.72942334},1040047438.9360393,14318145.225886328,1056687956.0712721,1678751178.2769392,0,1513732349.4728687,{"$f":"SUM(Y6:Y65)","v":2320677434.8658266},29039514.816271342,438960214.68741339,130607350.61158541,27304454.626294214,50494541.362732694,null,{"$f":"SUM(AF6:AF65)","v":13394244.588308219},0,0,0,0,0,0,{"$f":"SUM(AM6:AM65)","v":0},0,0,0,0,0,13394244.588308219]

{"sheet":"Est2017JSRev","index":14,"n_rows":66,"n_cols":45,"rows_kept":66,"cut":false,"hidden":false,"merged":[]}
[null,{"$f":"\"Tariff Approval - \"&'Model update'!C3","v":"Tariff Approval - United Energy"}]
[]
[null,{"$f":"\"ESTIMATED \"&'Model update'!C8&\" JURISDICTIONAL SCHEME REVENUE\"","v":"ESTIMATED 2017 JURISDICTIONAL SCHEME REVENUE"}]
[null,null,null,{"$f":"\"Current Jurisdictional scheme Tariffs (Pt-1) for \"&'Model update'!$C$8","v":"Current Jurisdictional scheme Tariffs (Pt-1) for 2017"},null,null,null,null,null,null,null,null,null,null,null,null,null,{"$f":"\"Estimated Quantities (Qt-1) for \"&'Model update'!$C$8","v":"Estimated Quantities (Qt-1) for 2017"},null,null,null,null,null,null,null,null,null,null,null,null,null,{"$f":"\"Estimated Revenue (Pt-1 \"&'Model update'!$C$8&\")*(Qt-1 \" &'Model update'!$C$8&\")\"","v":"Estimated Revenue (Pt-1 2017)*(Qt-1 2017)"}]
[null,{"$f":"\"Tariffs \"&'Model update'!C8","v":"Tariffs 2017"},null,"Current\nFixed","\nCurrentPkBlk1","\nCurrentPkBlk2","\nCurrent PkBlk3","\nCurrent PkBlk4","\nCurrent OPkBlk1","\nCurrent OPkBlk2","\nCurrent OPkBlk3","\nCurrent OPkBlk4","\nCurrent DemBlk1","\nCurrent DemBlk2","\nCurrent DemBlk3","\nCurrent DemBlk4",null,"EstVol\nFixed","EstVol\nPkBlk1","EstVol\nPkBlk2","EstVol\nPkBlk3","EstVol\nPkBlk4","EstVol\nOPkBlk1","EstVol\nOPkBlk2","EstVol\nOPkBlk3","EstVol\nOPkBlk4","EstVol\nDemBlk1","EstVol\nDemBlk2","EstVol\nDemBlk3","EstVol\nDemBlk4",null,"EstRev\nFixed","EstRev\nPkBlk1","EstRev\nPkBlk2","EstRev\nPkBlk3","EstRev\nPkBlk4","EstRev\nOPkBlk1","EstRev\nOPkBlk2","EstRev\nOPkBlk3","EstRev\nOPkBlk4","EstRev\nDemBlk1","EstRev\nDemBlk2","EstRev\nDemBlk3","EstRev\nDemBlk4","EstRev\nTotal"]
[null,{"$f":"Est2017TransRev!B6","v":"Low voltage small 1 rate"},null,6.2469999999999999,0,0,0,0,0,0,0,0,0,0,0,0,null,{"$f":"Est2017TransRev!R6","v":201584381.14774334},{"$f":"Est2017TransRev!S6","v":908301740.93542182},{"$f":"Est2017TransRev!T6","v":0},{"$f":"Est2017TransRev!U6","v":0},{"$f":"Est2017TransRev!V6","v":1512903696.7798095},{"$f":"Est2017TransRev!W6","v":0},{"$f":"Est2017TransRev!X6","v":0},{"$f":"Est2017TransRev!Y6","v":0},{"$f":"Est2017TransRev!Z6","v":0},{"$f":"Est2017TransRev!AA6","v":0},{"$f":"Est2017TransRev!AB6","v":0},{"$f":"Est2017TransRev!AC6","v":0},{"$f":"Est2017TransRev!AD6","v":0},null,{"$f":"D6/100*R6","v":12592976.290299525},{"$f":"E6/100*S6","v":0},{"$f":"F6/100*T6","v":0},{"$f":"G6/100*U6","v":0},{"$f":"H6/100*V6","v":0},{"$f":"I6/100*W6","v":0},{"$f":"J6/100*X6","v":0},{"$f":"K6/100*Y6","v":0},{"$f":"L6/100*Z6","v":0},{"$f":"M6/100*AA6","v":0},{"$f":"N6/100*AB6","v":0},{"$f":"O6/100*AC6","v":0},{"$f":"P6/100*AD6","v":0},{"$f":"SUM(AF6:AR6)","v":12592976.290299525}]
[null,{"$f":"Est2017TransRev!B7","v":"Winter economy tariff"},null,6.2469999999999999,0,0,0,0,0,0,0,0,0,0,0,0,null,{"$f":"Est2017TransRev!R7","v":48925.374102868365},{"$f":"Est2017TransRev!S7","v":190882.73431960001},{"$f":"Est2017TransRev!T7","v":0},{"$f":"Est2017TransRev!U7","v":0},{"$f":"Est2017TransRev!V7","v":434825.1493697461},{"$f":"Est2017TransRev!W7","v":0},{"$f":"Est2017TransRev!X7","v":0},{"$f":"Est2017TransRev!Y7","v":0},{"$f":"Est2017TransRev!Z7","v":0},{"$f":"Est2017TransRev!AA7","v":0},{"$f":"Est2017TransRev!AB7","v":0},{"$f":"Est2017TransRev!AC7","v":0},{"$f":"Est2017TransRev!AD7","v":0},null,3056.3681202061866,0,0,0,0,0,0,0,0,0,0,0,0,3056.3681202061866]
[null,{"$f":"Est2017TransRev!B8","v":"Reverse cycle airconditioning time of use"},null,6.2469999999999999,0,0,0,0,0,0,0,0,0,0,0,0,null,{"$f":"Est2017TransRev!R8","v":0},{"$f":"Est2017TransRev!S8","v":0},{"$f":"Est2017TransRev!T8","v":0},{"$f":"Est2017TransRev!U8","v":0},{"$f":"Est2017TransRev!V8","v":0},{"$f":"Est2017TransRev!W8","v":0},{"$f":"Est2017TransRev!X8","v":0},{"$f":"Est2017TransRev!Y8","v":0},{"$f":"Est2017TransRev!Z8","v":0},{"$f":"Est2017TransRev!AA8","v":0},{"$f":"Est2017TransRev!AB8","v":0},{"$f":"Est2017TransRev!AC8","v":0},{"$f":"Est2017TransRev!AD8","v":0},null,0,0,0,0,0,0,0,0,0,0,0,0,0,0]
[null,{"$f":"Est2017TransRev!B9","v":"Low voltage small 2 rate"},null,6.2469999999999999,0,0,0,0,0,0,0,0,0,0,0,0,null,{"$f":"Est2017TransRev!R9","v":1561827.9666133672},{"$f":"Est2017TransRev!S9","v":0},{"$f":"Est2017TransRev!T9","v":0},{"$f":"Est2017TransRev!U9","v":4402929.9605265837},{"$f":"Est2017TransRev!V9","v":0},{"$f":"Est2017TransRev!W9","v":0},{"$f":"Est2017TransRev!X9","v":7259168.6504886504},{"$f":"Est2017TransRev!Y9","v":15381833.08293198},{"$f":"Est2017TransRev!Z9","v":0},{"$f":"Est2017TransRev!AA9","v":0},{"$f":"Est2017TransRev!AB9","v":0},{"$f":"Est2017TransRev!AC9","v":0},{"$f":"Est2017TransRev!AD9","v":0},null,97567.393074337044,0,0,0,0,0,0,0,0,0,0,0,0,97567.393074337044]
[null,{"$f":"Est2017TransRev!B10","v":"Dedicated circuit"},null,0,0,0,0,0,0,0,0,0,0,0,0,0,null,{"$f":"Est2017TransRev!R10","v":667.9000000000002},{"$f":"Est2017TransRev!S10","v":0},{"$f":"Est2017TransRev!T10","v":0},{"$f":"Est2017TransRev!U10","v":0},{"$f":"Est2017TransRev!V10","v":0},{"$f":"Est2017TransRev!W10","v":0},{"$f":"Est2017TransRev!X10","v":0},{"$f":"Est2017TransRev!Y10","v":98711981.428355873},{"$f":"Est2017TransRev!Z10","v":0},{"$f":"Est2017TransRev!AA10","v":0},{"$f":"Est2017TransRev!AB10","v":0},{"$f":"Est2017TransRev!AC10","v":0},{"$f":"Est2017TransRev!AD10","v":0},null,0,0,0,0,0,0,0,0,0,0,0,0,0,0]
[null,{"$f":"Est2017TransRev!B11","v":"Low voltage medium 1 rate"},null,6.2469999999999999,0,0,0,0,0,0,0,0,0,0,0,0,null,{"$f":"Est2017TransRev!R11","v":11864291.38330999},{"$f":"Est2017TransRev!S11","v":155269969.61677647},{"$f":"Est2017TransRev!T11","v":0},{"$f":"Est2017TransRev!U11","v":0},{"$f":"Est2017TransRev!V11","v":233793484.4810552},{"$f":"Est2017TransRev!W11","v":0},{"$f":"Est2017TransRev!X11","v":0},{"$f":"Est2017TransRev!Y11","v":4},{"$f":"Est2017TransRev!Z11","v":0},{"$f":"Est2017TransRev!AA11","v":0},{"$f":"Est2017TransRev!AB11","v":0},{"$f":"Est2017TransRev!AC11","v":0},{"$f":"Est2017TransRev!AD11","v":0},null,741162.28271537507,0,0,0,0,0,0,0,0,0,0,0,0,741162.28271537507]
[null,{"$f":"Est2017TransRev!B12","v":"Low voltage medium 2 rate 5 day"},null,6.2469999999999999,0,0,0,0,0,0,0,0,0,0,0,0,null,{"$f":"Est2017TransRev!R12","v":3762110.1235585408},{"$f":"Est2017TransRev!S12","v":0},{"$f":"Est2017TransRev!T12","v":0},{"$f":"Est2017TransRev!U12","v":52750944.988502115},{"$f":"Est2017TransRev!V12","v":0},{"$f":"Est2017TransRev!W12","v":0},{"$f":"Est2017TransRev!X12","v":73732469.07894589},{"$f":"Est2017TransRev!Y12","v":78832208.16821827},{"$f":"Est2017TransRev!Z12","v":0},{"$f":"Est2017TransRev!AA12","v":0},{"$f":"Est2017TransRev!AB12","v":0},{"$f":"Est2017TransRev!AC12","v":0},{"$f":"Est2017TransRev!AD12","v":0},null,235019.01941870202,0,0,0,0,0,0,0,0,0,0,0,0,235019.01941870202]
[null,{"$f":"Est2017TransRev!B13","v":"Low voltage medium 2 rate 7 day"},null,6.2469999999999999,0,0,0,0,0,0,0,0,0,0,0,0,null,{"$f":"Est2017TransRev!R13","v":1819379.4139505203},{"$f":"Est2017TransRev!S13","v":0},{"$f":"Est2017TransRev!T13","v":0},{"$f":"Est2017TransRev!U13","v":22682579.555723179},{"$f":"Est2017TransRev!V13","v":0},{"$f":"Est2017TransRev!W13","v":0},{"$f":"Est2017TransRev!X13","v":34109458.955907114},{"$f":"Est2017TransRev!Y13","v":15078122.186198868},{"$f":"Est2017TransRev!Z13","v":0},{"$f":"Est2017TransRev!AA13","v":0},{"$f":"Est2017TransRev!AB13","v":0},{"$f":"Est2017TransRev!AC13","v":0},{"$f":"Est2017TransRev!AD13","v":0},null,113656.631989489,0,0,0,0,0,0,0,0,0,0,0,0,113656.631989489]
[null,{"$f":"Est2017TransRev!B14","v":"Unmetered supplies"},null,0,0,0,0,0,0,0,0,0,0,0,0,0,null,{"$f":"Est2017TransRev!R14","v":1207792.6233333333},{"$f":"Est2017TransRev!S14","v":0},{"$f":"Est2017TransRev!T14","v":0},{"$f":"Est2017TransRev!U14","v":10724484.114269339},{"$f":"Est2017TransRev!V14","v":0},{"$f":"Est2017TransRev!W14","v":0},{"$f":"Est2017TransRev!X14","v":18203252.788676005},{"$f":"Est2017TransRev!Y14","v":66747582.584354617},{"$f":"Est2017TransRev!Z14","v":0},{"$f":"Est2017TransRev!AA14","v":0},{"$f":"Est2017TransRev!AB14","v":0},{"$f":"Est2017TransRev!AC14","v":0},{"$f":"Est2017TransRev!AD14","v":0},null,0,0,0,0,0,0,0,0,0,0,0,0,0,0]
[null,{"$f":"Est2017TransRev!B15","v":"Low voltage large 1 rate"},null,6.2469999999999999,0,0,0,0,0,0,0,0,0,0,0,0,null,{"$f":"Est2017TransRev!R15","v":2527.3829423333332},{"$f":"Est2017TransRev!S15","v":597942.04072884563},{"$f":"Est2017TransRev!T15","v":0},{"$f":"Est2017TransRev!U15","v":0},{"$f":"Est2017TransRev!V15","v":774047.21553278971},{"$f":"Est2017TransRev!W15","v":0},{"$f":"Est2017TransRev!X15","v":0},{"$f":"Est2017TransRev!Y15","v":0},{"$f":"Est2017TransRev!Z15","v":0},{"$f":"Est2017TransRev!AA15","v":0},{"$f":"Est2017TransRev!AB15","v":0},{"$f":"Est2017TransRev!AC15","v":0},{"$f":"Est2017TransRev!AD15","v":0},null,157.88561240756331,0,0,0,0,0,0,0,0,0,0,0,0,157.88561240756331]
[null,{"$f":"Est2017TransRev!B16","v":"Low voltage large 2 rate"},null,6.2469999999999999,0,0,0,0,0,0,0,0,0,0,0,0,null,{"$f":"Est2017TransRev!R16","v":8044.8880293333341},{"$f":"Est2017TransRev!S16","v":0},{"$f":"Est2017TransRev!T16","v":0},{"$f":"Est2017TransRev!U16","v":1050283.8111005772},{"$f":"Est2017TransRev!V16","v":0},{"$f":"Est2017TransRev!W16","v":0},{"$f":"Est2017TransRev!X16","v":1490905.349524372},{"$f":"Est2017TransRev!Y16","v":1781684.6179572449},{"$f":"Est2017TransRev!Z16","v":0},{"$f":"Est2017TransRev!AA16","v":0},{"$f":"Est2017TransRev!AB16","v":0},{"$f":"Est2017TransRev!AC16","v":0},{"$f":"Est2017TransRev!AD16","v":0},null,502.56415519245337,0,0,0,0,0,0,0,0,0,0,0,0,502.56415519245337]
[null,{"$f":"Est2017TransRev!B17","v":"Low voltage KW time of use"},null,6.2469999999999999,0,0,0,0,0,0,0,0,0,0,0,0,null,{"$f":"Est2017TransRev!R17","v":27933.548999999955},{"$f":"Est2017TransRev!S17","v":0},{"$f":"Est2017TransRev!T17","v":0},{"$f":"Est2017TransRev!U17","v":2946856.8788030911},{"$f":"Est2017TransRev!V17","v":0},{"$f":"Est2017TransRev!W17","v":0},{"$f":"Est2017TransRev!X17","v":4098087.3279617415},{"$f":"Est2017TransRev!Y17","v":6713595.5614513857},{"$f":"Est2017TransRev!Z17","v":0},{"$f":"Est2017TransRev!AA17","v":0},{"$f":"Est2017TransRev!AB17","v":681904.88486550353},{"$f":"Est2017TransRev!AC17","v":0},{"$f":"Est2017TransRev!AD17","v":0},null,1745.0088060299972,0,0,0,0,0,0,0,0,0,0,0,0,1745.0088060299972]
[null,{"$f":"Est2017TransRev!B18","v":"Low voltage KW time of use - HOT"},null,6.2469999999999999,0,0,0,0,0,0,0,0,0,0,0,0,null,{"$f":"Est2017TransRev!R18","v":1211.3601666666668},{"$f":"Est2017TransRev!S18","v":0},{"$f":"Est2017TransRev!T18","v":0},{"$f":"Est2017TransRev!U18","v":528234.45105634362},{"$f":"Est2017TransRev!V18","v":0},{"$f":"Est2017TransRev!W18","v":0},{"$f":"Est2017TransRev!X18","v":47405.284144822312},{"$f":"Est2017TransRev!Y18","v":824959.35507952259},{"$f":"Est2017TransRev!Z18","v":0},{"$f":"Est2017TransRev!AA18","v":0},{"$f":"Est2017TransRev!AB18","v":147592.39700308887},{"$f":"Est2017TransRev!AC18","v":0},{"$f":"Est2017TransRev!AD18","v":0},null,75.673669611666668,0,0,0,0,0,0,0,0,0,0,0,0,75.673669611666668]
[null,{"$f":"Est2017TransRev!B19","v":"Low voltage large KVA time of use"},null,6.2469999999999999,0,0,0,0,0,0,0,0,0,0,0,0,null,{"$f":"Est2017TransRev!R19","v":393917},{"$f":"Est2017TransRev!S19","v":0},{"$f":"Est2017TransRev!T19","v":0},{"$f":"Est2017TransRev!U19","v":470238596.56056643},{"$f":"Est2017TransRev!V19","v":0},{"$f":"Est2017TransRev!W19","v":0},{"$f":"Est2017TransRev!X19","v":644313381.27950871},{"$f":"Est2017TransRev!Y19","v":1280147668.2341452},{"$f":"Est2017TransRev!Z19","v":0},{"$f":"Est2017TransRev!AA19","v":326079395.88434523},{"$f":"Est2017TransRev!AB19","v":95406197.355043739},{"$f":"Est2017TransRev!AC19","v":0},{"$f":"Est2017TransRev!AD19","v":0},null,24607.994989999999,0,0,0,0,0,0,0,0,0,0,0,0,24607.994989999999]
[null,{"$f":"Est2017TransRev!B20","v":"Low voltage large KVA time of use - HOT"},null,6.2469999999999999,0,0,0,0,0,0,0,0,0,0,0,0,null,{"$f":"Est2017TransRev!R20","v":122},{"$f":"Est2017TransRev!S20","v":0},{"$f":"Est2017TransRev!T20","v":0},{"$f":"Est2017TransRev!U20","v":188523.44384695461},{"$f":"Est2017TransRev!V20","v":0},{"$f":"Est2017TransRev!W20","v":0},{"$f":"Est2017TransRev!X20","v":250916.26398103044},{"$f":"Est2017TransRev!Y20","v":851041.21817480796},{"$f":"Est2017TransRev!Z20","v":0},{"$f":"Est2017TransRev!AA20","v":101243.67601797367},{"$f":"Est2017TransRev!AB20","v":35569.13953},{"$f":"Est2017TransRev!AC20","v":0},{"$f":"Est2017TransRev!AD20","v":0},null,7.62134,0,0,0,0,0,0,0,0,0,0,0,0,7.62134]
[null,{"$f":"Est2017TransRev!B21","v":"High voltage KVA time of use"},null,6.2469999999999999,0,0,0,0,0,0,0,0,0,0,0,0,null,{"$f":"Est2017TransRev!R21","v":11224},{"$f":"Est2017TransRev!S21","v":0},{"$f":"Est2017TransRev!T21","v":0},{"$f":"Est2017TransRev!U21","v":170765372.54893374},{"$f":"Est2017TransRev!V21","v":0},{"$f":"Est2017TransRev!W21","v":0},{"$f":"Est2017TransRev!X21","v":244972690.63313803},{"$f":"Est2017TransRev!Y21","v":637251511.64700031},{"$f":"Est2017TransRev!Z21","v":0},{"$f":"Est2017TransRev!AA21","v":102140766.37008053},{"$f":"Est2017TransRev!AB21","v":31103115.871042162},{"$f":"Est2017TransRev!AC21","v":0},{"$f":"Est2017TransRev!AD21","v":0},null,701.16327999999999,0,0,0,0,0,0,0,0,0,0,0,0,701.16327999999999]
[null,{"$f":"Est2017TransRev!B22","v":"High voltage KVA time of use - HOT"},null,6.2469999999999999,0,0,0,0,0,0,0,0,0,0,0,0,null,{"$f":"Est2017TransRev!R22","v":0},{"$f":"Est2017TransRev!S22","v":0},{"$f":"Est2017TransRev!T22","v":0},{"$f":"Est2017TransRev!U22","v":0},{"$f":"Est2017TransRev!V22","v":0},{"$f":"Est2017TransRev!W22","v":0},{"$f":"Est2017TransRev!X22","v":0},{"$f":"Est2017TransRev!Y22","v":0},{"$f":"Est2017TransRev!Z22","v":0},{"$f":"Est2017TransRev!AA22","v":0},{"$f":"Est2017TransRev!AB22","v":0},{"$f":"Est2017TransRev!AC22","v":0},{"$f":"Est2017TransRev!AD22","v":0},null,0,0,0,0,0,0,0,0,0,0,0,0,0,0]
[null,{"$f":"Est2017TransRev!B23","v":"Subtransmission KVA time of use"},null,6.2469999999999999,0,0,0,0,0,0,0,0,0,0,0,0,null,{"$f":"Est2017TransRev!R23","v":122},{"$f":"Est2017TransRev!S23","v":0},{"$f":"Est2017TransRev!T23","v":0},{"$f":"Est2017TransRev!U23","v":8375947.4608702408},{"$f":"Est2017TransRev!V23","v":0},{"$f":"Est2017TransRev!W23","v":0},{"$f":"Est2017TransRev!X23","v":10969980.420095619},{"$f":"Est2017TransRev!Y23","v":16019608.096385615},{"$f":"Est2017TransRev!Z23","v":0},{"$f":"Est2017TransRev!AA23","v":4212706.5388447102},{"$f":"Est2017TransRev!AB23","v":1491519.6516332473},{"$f":"Est2017TransRev!AC23","v":0},{"$f":"Est2017TransRev!AD23","v":0},null,7.62134,0,0,0,0,0,0,0,0,0,0,0,0,7.62134]
[null,{"$f":"Est2017TransRev!B24","v":"TOD"},null,6.2469999999999999,0,0,0,0,0,0,0,0,0,0,0,0,null,{"$f":"Est2017TransRev!R24","v":15198052.004909774},{"$f":"Est2017TransRev!S24","v":0},{"$f":"Est2017TransRev!T24","v":12731795.324180052},{"$f":"Est2017TransRev!U24","v":23296164.487819981},{"$f":"Est2017TransRev!V24","v":0},{"$f":"Est2017TransRev!W24","v":0},{"$f":"Est2017TransRev!X24","v":43672101.32037928},{"$f":"Est2017TransRev!Y24","v":113014927.77794422},{"$f":"Est2017TransRev!Z24","v":25410429.370784484},{"$f":"Est2017TransRev!AA24","v":0},{"$f":"Est2017TransRev!AB24","v":0},{"$f":"Est2017TransRev!AC24","v":0},{"$f":"Est2017TransRev!AD24","v":0},null,949422.30874671356,0,0,0,0,0,0,0,0,0,0,0,0,949422.30874671356]
[null,{"$f":"Est2017TransRev!B25","v":"TOD9"},null,6.2469999999999999,0,0,0,0,0,0,0,0,0,0,0,0,null,{"$f":"Est2017TransRev!R25","v":507569.125},{"$f":"Est2017TransRev!S25","v":0},{"$f":"Est2017TransRev!T25","v":414508.77210607479},{"$f":"Est2017TransRev!U25","v":566017.93396961363},{"$f":"Est2017TransRev!V25","v":0},{"$f":"Est2017TransRev!W25","v":0},{"$f":"Est2017TransRev!X25","v":1129836.4645922717},{"$f":"Est2017TransRev!Y25","v":4122935.4131283127},{"$f":"Est2017TransRev!Z25","v":837207.53875769},{"$f":"Est2017TransRev!AA25","v":0},{"$f":"Est2017TransRev!AB25","v":0},{"$f":"Est2017TransRev!AC25","v":0},{"$f":"Est2017TransRev!AD25","v":0},null,31707.84323875,0,0,0,0,0,0,0,0,0,0,0,0,31707.84323875]
[null,{"$f":"Est2017TransRev!B26","v":"TOU"},null,6.2469999999999999,0,0,0,0,0,0,0,0,0,0,0,0,null,{"$f":"Est2017TransRev!R26","v":69979.847750000001},{"$f":"Est2017TransRev!S26","v":0},{"$f":"Est2017TransRev!T26","v":0},{"$f":"Est2017TransRev!U26","v":4185987.602249383},{"$f":"Est2017TransRev!V26","v":0},{"$f":"Est2017TransRev!W26","v":0},{"$f":"Est2017TransRev!X26","v":6328508.679877107},{"$f":"Est2017TransRev!Y26","v":7803457.3088545976},{"$f":"Est2017TransRev!Z26","v":0},{"$f":"Est2017TransRev!AA26","v":0},{"$f":"Est2017TransRev!AB26","v":1107863.226842352},{"$f":"Est2017TransRev!AC26","v":0},{"$f":"Est2017TransRev!AD26","v":0},null,4371.6410889424997,0,0,0,0,0,0,0,0,0,0,0,0,4371.6410889424997]
[null,{"$f":"Est2017TransRev!B27","v":"TODFLEX"},null,6.2469999999999999,0,0,0,0,0,0,0,0,0,0,0,0,null,{"$f":"Est2017TransRev!R27","v":737072.00530785555},{"$f":"Est2017TransRev!S27","v":0},{"$f":"Est2017TransRev!T27","v":1783010.1473744609},{"$f":"Est2017TransRev!U27","v":906586.54332218936},{"$f":"Est2017TransRev!V27","v":0},{"$f":"Est2017TransRev!W27","v":0},{"$f":"Est2017TransRev!X27","v":1458281.7540951683},{"$f":"Est2017TransRev!Y27","v":3606690.1799522913},{"$f":"Est2017TransRev!Z27","v":3051735.8094899915},{"$f":"Est2017TransRev!AA27","v":0},{"$f":"Est2017TransRev!AB27","v":0},{"$f":"Est2017TransRev!AC27","v":0},{"$f":"Est2017TransRev!AD27","v":0},null,46044.888171581733,0,0,0,0,0,0,0,0,0,0,0,0,46044.888171581733]
[null,{"$f":"Est2017TransRev!B28","v":"Low Voltage KW 1 rate"},null,6.2469999999999999,0,0,0,0,0,0,0,0,0,0,0,0,null,{"$f":"Est2017TransRev!R28","v":1144.1666666666667},{"$f":"Est2017TransRev!S28","v":0},{"$f":"Est2017TransRev!T28","v":0},{"$f":"Est2017TransRev!U28","v":8858.6022025064794},{"$f":"Est2017TransRev!V28","v":0},{"$f":"Est2017TransRev!W28","v":0},{"$f":"Est2017TransRev!X28","v":15647.932465664373},{"$f":"Est2017TransRev!Y28","v":0},{"$f":"Est2017TransRev!Z28","v":0},{"$f":"Est2017TransRev!AA28","v":0},{"$f":"Est2017TransRev!AB28","v":0},{"$f":"Est2017TransRev!AC28","v":2496.3872000000001},{"$f":"Est2017TransRev!AD28","v":5053.3891355263158},null,71.476091666666676,0,0,0,0,0,0,0,0,0,0,0,0,71.476091666666676]
[null,{"$f":"Est2017TransRev!B29","v":"Low voltage medium KW time of use (opt-in)"},null,6.2469999999999999,0,0,0,0,0,0,0,0,0,0,0,0,null,{"$f":"Est2017TransRev!R29","v":47608.166666666642},{"$f":"Est2017TransRev!S29","v":0},{"$f":"Est2017TransRev!T29","v":0},{"$f":"Est2017TransRev!U29","v":4039834.9124667267},{"$f":"Est2017TransRev!V29","v":0},{"$f":"Est2017TransRev!W29","v":0},{"$f":"Est2017TransRev!X29","v":10179811.629829049},{"$f":"Est2017TransRev!Y29","v":0},{"$f":"Est2017TransRev!Z29","v":0},{"$f":"Est2017TransRev!AA29","v":0},{"$f":"Est2017TransRev!AB29","v":0},{"$f":"Est2017TransRev!AC29","v":250018.88786840491},{"$f":"Est2017TransRev!AD29","v":1076707.6308603093},null,2974.0821716666651,0,0,0,0,0,0,0,0,0,0,0,0,2974.0821716666651]
[null,{"$f":"Est2017TransRev!B30","v":"Low voltage medium KW 1 rate (mandatory)"},null,6.2469999999999999,0,0,0,0,0,0,0,0,0,0,0,0,null,{"$f":"Est2017TransRev!R30","v":887309.86353125004},{"$f":"Est2017TransRev!S30","v":0},{"$f":"Est2017TransRev!T30","v":0},{"$f":"Est2017TransRev!U30","v":291747036.79085952},{"$f":"Est2017TransRev!V30","v":0},{"$f":"Est2017TransRev!W30","v":0},{"$f":"Est2017TransRev!X30","v":385398691.39153147},{"$f":"Est2017TransRev!Y30","v":0},{"$f":"Est2017TransRev!Z30","v":0},{"$f":"Est2017TransRev!AA30","v":0},{"$f":"Est2017TransRev!AB30","v":0},{"$f":"Est2017TransRev!AC30","v":26661191.226126004},{"$f":"Est2017TransRev!AD30","v":47275303.633664787},null,55430.247174797187,0,0,0,0,0,0,0,0,0,0,0,0,55430.247174797187]
[null,null,null,null,null,null,null,null,null,null,null,null,null,null,null,null,null,null,null,null,null,null,null,null,null,null,null,null,null,null,null,0,0,0,0,0,0,0,0,0,0,0,0,0,0]
[null,null,null,null,null,null,null,null,null,null,null,null,null,null,null,null,null,null,null,null,null,null,null,null,null,null,null,null,null,null,null,0,0,0,0,0,0,0,0,0,0,0,0,0,0]
[null,null,null,null,null,null,null,null,null,null,null,null,null,null,null,null,null,null,null,null,null,null,null,null,null,null,null,null,null,null,null,0,0,0,0,0,0,0,0,0,0,0,0,0,0]
[null,null,null,null,null,null,null,null,null,null,null,null,null,null,null,null,null,null,null,null,null,null,null,null,null,null,null,null,null,null,null,0,0,0,0,0,0,0,0,0,0,0,0,0,0]
[null,null,null,null,null,null,null,null,null,null,null,null,null,null,null,null,null,null,null,null,null,null,null,null,null,null,null,null,null,null,null,0,0,0,0,0,0,0,0,0,0,0,0,0,0]
[null,null,null,null,null,null,null,null,null,null,null,null,null,null,null,null,null,null,null,null,null,null,null,null,null,null,null,null,null,null,null,0,0,0,0,0,0,0,0,0,0,0,0,0,0]
[null,null,null,null,null,null,null,null,null,null,null,null,null,null,null,null,null,null,null,null,null,null,null,null,null,null,null,null,null,null,null,0,0,0,0,0,0,0,0,0,0,0,0,0,0]
[null,null,null,null,null,null,null,null,null,null,null,null,null,null,null,null,null,null,null,null,null,null,null,null,null,null,null,null,null,null,null,0,0,0,0,0,0,0,0,0,0,0,0,0,0]
[null,null,null,null,null,null,null,null,null,null,null,null,null,null,null,null,null,null,null,null,null,null,null,null,null,null,null,null,null,null,null,0,0,0,0,0,0,0,0,0,0,0,0,0,0]
[null,null,null,null,null,null,null,null,null,null,null,null,null,null,null,null,null,null,null,null,null,null,null,null,null,null,null,null,null,null,null,0,0,0,0,0,0,0,0,0,0,0,0,0,0]
[null,null,null,null,null,null,null,null,null,null,null,null,null,null,null,null,null,null,null,null,null,null,null,null,null,null,null,null,null,null,null,0,0,0,0,0,0,0,0,0,0,0,0,0,0]
[null,null,null,null,null,null,null,null,null,null,null,null,null,null,null,null,null,null,null,null,null,null,null,null,null,null,null,null,null,null,null,0,0,0,0,0,0,0,0,0,0,0,0,0,0]
[null,null,null,null,null,null,null,null,null,null,null,null,null,null,null,null,null,null,null,null,null,null,null,null,null,null,null,null,null,null,null,0,0,0,0,0,0,0,0,0,0,0,0,0,0]
[null,null,null,null,null,null,null,null,null,null,null,null,null,null,null,null,null,null,null,null,null,null,null,null,null,null,null,null,null,null,null,0,0,0,0,0,0,0,0,0,0,0,0,0,0]
[null,null,null,null,null,null,null,null,null,null,null,null,null,null,null,null,null,null,null,null,null,null,null,null,null,null,null,null,null,null,null,0,0,0,0,0,0,0,0,0,0,0,0,0,0]
[null,null,null,null,null,null,null,null,null,null,null,null,null,null,null,null,null,null,null,null,null,null,null,null,null,null,null,null,null,null,null,0,0,0,0,0,0,0,0,0,0,0,0,0,0]
[null,null,null,null,null,null,null,null,null,null,null,null,null,null,null,null,null,null,null,null,null,null,null,null,null,null,null,null,null,null,null,0,0,0,0,0,0,0,0,0,0,0,0,0,0]
[null,null,null,null,null,null,null,null,null,null,null,null,null,null,null,null,null,null,null,null,null,null,null,null,null,null,null,null,null,null,null,0,0,0,0,0,0,0,0,0,0,0,0,0,0]
[null,null,null,null,null,null,null,null,null,null,null,null,null,null,null,null,null,null,null,null,null,null,null,null,null,null,null,null,null,null,null,0,0,0,0,0,0,0,0,0,0,0,0,0,0]
[null,null,null,null,null,null,null,null,null,null,null,null,null,null,null,null,null,null,null,null,null,null,null,null,null,null,null,null,null,null,null,0,0,0,0,0,0,0,0,0,0,0,0,0,0]
[null,null,null,null,null,null,null,null,null,null,null,null,null,null,null,null,null,null,null,null,null,null,null,null,null,null,null,null,null,null,null,0,0,0,0,0,0,0,0,0,0,0,0,0,0]
[null,null,null,null,null,null,null,null,null,null,null,null,null,null,null,null,null,null,null,null,null,null,null,null,null,null,null,null,null,null,null,0,0,0,0,0,0,0,0,0,0,0,0,0,0]
[null,null,null,null,null,null,null,null,null,null,null,null,null,null,null,null,null,null,null,null,null,null,null,null,null,null,null,null,null,null,null,0,0,0,0,0,0,0,0,0,0,0,0,0,0]
[null,null,null,null,null,null,null,null,null,null,null,null,null,null,null,null,null,null,null,null,null,null,null,null,null,null,null,null,null,null,null,0,0,0,0,0,0,0,0,0,0,0,0,0,0]
[null,null,null,null,null,null,null,null,null,null,null,null,null,null,null,null,null,null,null,null,null,null,null,null,null,null,null,null,null,null,null,0,0,0,0,0,0,0,0,0,0,0,0,0,0]
[null,null,null,null,null,null,null,null,null,null,null,null,null,null,null,null,null,null,null,null,null,null,null,null,null,null,null,null,null,null,null,0,0,0,0,0,0,0,0,0,0,0,0,0,0]
[null,null,null,null,null,null,null,null,null,null,null,null,null,null,null,null,null,null,null,null,null,null,null,null,null,null,null,null,null,null,null,0,0,0,0,0,0,0,0,0,0,0,0,0,0]
[null,null,null,null,null,null,null,null,null,null,null,null,null,null,null,null,null,null,null,null,null,null,null,null,null,null,null,null,null,null,null,0,0,0,0,0,0,0,0,0,0,0,0,0,0]
[null,null,null,null,null,null,null,null,null,null,null,null,null,null,null,null,null,null,null,null,null,null,null,null,null,null,null,null,null,null,null,0,0,0,0,0,0,0,0,0,0,0,0,0,0]
[null,null,null,null,null,null,null,null,null,null,null,null,null,null,null,null,null,null,null,null,null,null,null,null,null,null,null,null,null,null,null,0,0,0,0,0,0,0,0,0,0,0,0,0,0]
[null,null,null,null,null,null,null,null,null,null,null,null,null,null,null,null,null,null,null,null,null,null,null,null,null,null,null,null,null,null,null,0,0,0,0,0,0,0,0,0,0,0,0,0,0]
[null,null,null,null,null,null,null,null,null,null,null,null,null,null,null,null,null,null,null,null,null,null,null,null,null,null,null,null,null,null,null,0,0,0,0,0,0,0,0,0,0,0,0,0,0]
[null,null,null,null,null,null,null,null,null,null,null,null,null,null,null,null,null,null,null,null,null,null,null,null,null,null,null,null,null,null,null,0,0,0,0,0,0,0,0,0,0,0,0,0,0]
[null,null,null,null,null,null,null,null,null,null,null,null,null,null,null,null,null,null,null,null,null,null,null,null,null,null,null,null,null,null,null,0,0,0,0,0,0,0,0,0,0,0,0,0,0]
[null,null,null,null,null,null,null,null,null,null,null,null,null,null,null,null,null,null,null,null,null,null,null,null,null,null,null,null,null,null,null,0,0,0,0,0,0,0,0,0,0,0,0,0,0]
[null,null,null,null,null,null,null,null,null,null,null,null,null,null,null,null,null,{"$f":"SUM(R6:R65)","v":239743213.29258254},1064360535.3272467,14929314.243660588,1069405240.6470885,1747906053.6257672,0,1487630595.2051415,2346889810.8601327,29299372.719032165,432534112.46928847,129973762.5259601,26913706.50119441,48357064.653660625,null,{"$f":"SUM(AF6:AF65)","v":14901266.005494995},0,0,0,0,0,0,{"$f":"SUM(AM6:AM65)","v":0},0,0,0,0,0,14901266.005494995]

{"sheet":"2018JSRevCont","index":15,"n_rows":62,"n_cols":5,"rows_kept":62,"cut":false,"hidden":false,"merged":[]}
[]
[null,{"$f":"\"Tariff Approval - \"&'Model update'!$C$3","v":"Tariff Approval - United Energy"}]
[]
[null," Jurisdictional Scheme Amounts (JSA)"]
[]
[null,"Year (t)",{"$f":"'Model update'!C5","v":2018}]
[]
[null,"Table 1- Compliance with JSA Revenue Formula"]
[null,"Revenue from  Jurisdictional Scheme Amounts charges for year t",{"$f":"Prop2018JSTar!AS66","v":13394244.588308219}]
[null,"Total JSA related payments for year t",{"$f":"C17","v":13394244.588308219}]
[null,null,{"$f":"IF(C9=\"\",\"\",IF(C10>=C9,\"JSA REVENUE FORMULA COMPLIANT\",\"JSA REVENUE FORMULA BREACHED\"))","v":"JSA REVENUE FORMULA COMPLIANT"}]
[]
[null,"Table 2 - Total JSA related payments for year t"]
[null,"PFIT & TFIT charges for year t",{"$f":"C22","v":15058465.408509919}]
[null,"JSA revenue under/over recovery approved",{"$f":"E45","v":-1664220.8202017006}]
[null,"JSA revenue under/over recovery for years 2014 and 2015"]
[null,"Total JSA related payments for year t",{"$f":"SUM(C14:C16)","v":13394244.588308219}]
[]
[null,"Table 3 - PFIT & TFIT charges for year t"]
[null,"PFIT",15058465.408509919]
[null,"TFIT",0]
[null,"PFIT & TFIT charges",{"$f":"SUM(C20:C21)","v":15058465.408509919}]
[]
[]
[]
[]
[null,"Table 4 - JSA Recovery Arrangements"]
[null,null,"Year t-2","Year t-1","Year t"]
[null,null,"(actual)","(estimate)","(forecast)"]
[null,null,{"$f":"D30-1","v":2016},{"$f":"E30-1","v":2017},{"$f":"C$6","v":2018}]
[]
[null,"(A) Revenue from JSA proposal charges",20899860.490000602,{"$f":"Est2017JSRev!AS66","v":14901266.005494995},{"$f":"C9","v":13394244.588308219}]
[]
[]
[null,"(B) Less Total JSA related payments =",{"$f":"SUM(C37:C39)","v":20584874.59506961},{"$f":"SUM(D37:D39)","v":13652725.397177817},{"$f":"SUM(E37:E39)","v":15058465.408509919}]
[]
[null,"+ JSA revenue under/over recovery for years 2014 and 2015",3260108.955069609,317074.79294948664,{"$f":"C16","v":0}]
[]
[null,"+PFIT & TFIT charges  =",{"$f":"SUM(C40:C41)","v":17324765.640000001},{"$f":"SUM(D40:D41)","v":13335650.604228331},{"$f":"SUM(E40:E41)","v":15058465.408509919}]
[null,"+PFIT amount",{"$f":"'JS cost audit template'!F4","v":12466346.640000001},13335650.604228331,{"$f":"C20","v":15058465.408509919}]
[null,"+TFIT amount",{"$f":"'JS cost audit template'!F5","v":4858419},0,{"$f":"C21","v":0}]
[]
[]
[]
[null,"(A minus B) Under/over recovery of revenue for regulatory year",{"$f":"C32-C35","v":314985.89493099228},{"$f":"D32-D35","v":1248540.6083171777},{"$f":"E32-E35","v":-1664220.8202017006}]
[]
[]
[]
[null,"Table 5 - JSA Unders and Overs Account"]
[null,null,"Year t-2","Year t-1","Year t"]
[null,null,"(actual)","(estimate)","(forecast)"]
[null,"Calendar year",{"$f":"D52-1","v":2016},{"$f":"E52-1","v":2017},{"$f":"C$6","v":2018}]
[]
[null,"Nominal WACC",{"$f":"(1+'Model update'!$B$47)*(1+'Model update'!$C$28)-1","v":5.5231581657706252E-2},{"$f":"(1+'Model update'!$B$45)*(1+'Model update'!$C$29)-1","v":4.9594449826237952E-2},{"$f":"(1+'Model update'!$B$43)*(1+'Model update'!$C$30)-1","v":5.8471241600152712E-2}]
[]
[null,"Opening balance",0,{"$f":"C60","v":323567.57703443029},{"$f":"D60","v":1618741.0519289016}]
[null,"Interest on Opening balance",{"$f":"C56*C54","v":0},{"$f":"D56*D54","v":16047.155964631436},{"$f":"E56*E54","v":94649.799135420151}]
[null,"Under/over recovery of revenue for regulatory year",{"$f":"C45","v":314985.89493099228},{"$f":"D45","v":1248540.6083171777},{"$f":"E45","v":-1664220.8202017006}]
[null,"Interest on under/over recovery for regulatory year",{"$f":"C58*((1+C54)^0.5-1)","v":8581.6821034379918},{"$f":"D58*((1+D54)^0.5-1)","v":30585.710612662224},{"$f":"E58*((1+E54)^0.5-1)","v":-47963.369111717082}]
[null,"Closing balance of JSA overs/ (unders) account",{"$f":"SUM(C56:C59)","v":323567.57703443029},{"$f":"SUM(D56:D59)","v":1618741.0519289016},{"$f":"SUM(E56:E59)","v":1206.6617509041826}]
[]
[null,"The DNSP is expected to achieve a closing balance as close to zero as practicable in its jurisdictional scheme amount unders and overs account in each forecast year in its annual pricing proposals in the 2016–20 regulatory control period."]

{"sheet":"JS cost audit template","index":16,"n_rows":12,"n_cols":6,"rows_kept":12,"cut":false,"hidden":false,"merged":[[6,1,6,3],[1,1,1,3],[2,1,2,3],[3,1,3,3],[4,1,4,3],[5,1,5,3]]}
[null,{"$f":"\"Tariff Approval - \"&'Model update'!C3","v":"Tariff Approval - United Energy"}]
[null,"Jurisdictional scheme amounts",null,null,null,"t-2 actual"]
[]
[null,"PFIT",null,null,null,12466346.640000001]
[null,"TFIT",null,null,null,4858419]
[]
[null,null,null,null,"Total",{"$f":"SUM(F3:F6)","v":17324765.640000001}]
[]
[]
[null,"Where the following definitions apply"]
[null,"PFIT","Premium feed-in tariff payments"]
[null,"TFIT","Transitional feed-in tariff payments"]

{"sheet":"Prop2018TSSComp","index":17,"n_rows":65,"n_cols":47,"rows_kept":65,"cut":false,"hidden":false,"merged":[]}
[null,{"$f":"\"Tariff Approval - \"&'Model update'!$C$3","v":"Tariff Approval - United Energy"}]
[]
[null,{"$f":"\"COMPARISON OF \"&'Model update'!$C$5&\" PROPOSED AND TSS INDICATIVE DISTRIBUTION TARIFFS\"","v":"COMPARISON OF 2018 PROPOSED AND TSS INDICATIVE DISTRIBUTION TARIFFS"},null,null,null,null,null,null,null,null,null,null,null,null,null,null,null,null,null,null,null,null,null,null,null,null,null,null,null,null,null,null,null,null,null,null,null,null,null,null,null,null,null,null,null,"Materiality threshold"]
[null,null,null,{"$f":"\"Proposed NUOS Tariffs (Pt) for \"&'Model update'!$C$5","v":"Proposed NUOS Tariffs (Pt) for 2018"},null,null,null,null,null,null,null,null,null,null,null,null,null,{"$f":"\"TSS indicative tariffs for \"&'Model update'!$C$5","v":"TSS indicative tariffs for 2018"},null,null,null,null,null,null,null,null,null,null,null,null,null,null,{"$f":"\"Percentage difference between proposed \"&'Model update'!$C$5&\" tariffs and indecative TSS tariffs\"","v":"Percentage difference between proposed 2018 tariffs and indecative TSS tariffs"},null,null,null,null,null,null,null,null,null,null,null,null,0.15]
[null,"TSS name","Proposal name","PropTar\nFixed","PropTar\nPkBlk1","PropTar\nPkBlk2","PropTar\nPkBlk3","PropTar\nPkBlk4","PropTar\nOPkBlk1","PropTar\nOPkBlk2","PropTar\nOPkBlk3","PropTar\nOPkBlk4","PropTar\nDemBlk1","PropTar\nDemBlk2","PropTar\nDemBlk3","PropTar\nDemBlk4",null,"IndTar\nFixed","IndTar\nPkBlk1","IndTar\nPkBlk2","IndTar\nPkBlk3","IndTar\nPkBlk4","IndTar\nOPkBlk1","IndTar\nOPkBlk2","IndTar\nOPkBlk3","IndTar\nOPkBlk4","IndTar\nDemBlk1","IndTar\nDemBlk2","IndTar\nDemBlk3","IndTar\nDemBlk4",null,null,"\nFixed","\nPkBlk1","\nPkBlk2","\nPkBlk3","\nPkBlk4","\nOPkBlk1","\nOPkBlk2","\nOPkBlk3","\nOPkBlk4","\nDemBlk1","\nDemBlk2","\nDemBlk3","\nDemBlk4","Explanation required?"]
[null,"Low voltage small 1 rate",{"$f":"Prop2018DistTar!C6","v":"Low voltage small 1 rate"},{"$f":"SUM(Prop2018DistTar!D6,Prop2018TransTar!D6)","v":6.8650000000000002},{"$f":"SUM(Prop2018DistTar!E6,Prop2018TransTar!E6)","v":10.219999999999999},{"$f":"SUM(Prop2018DistTar!F6,Prop2018TransTar!F6)","v":0},{"$f":"SUM(Prop2018DistTar!G6,Prop2018TransTar!G6)","v":0},{"$f":"SUM(Prop2018DistTar!H6,Prop2018TransTar!H6)","v":6.9160000000000004},{"$f":"SUM(Prop2018DistTar!I6,Prop2018TransTar!I6)","v":0},{"$f":"SUM(Prop2018DistTar!J6,Prop2018TransTar!J6)","v":0},{"$f":"SUM(Prop2018DistTar!K6,Prop2018TransTar!K6)","v":0},{"$f":"SUM(Prop2018DistTar!L6,Prop2018TransTar!L6)","v":0},{"$f":"SUM(Prop2018DistTar!M6,Prop2018TransTar!M6)","v":0},{"$f":"SUM(Prop2018DistTar!N6,Prop2018TransTar!N6)","v":0},{"$f":"SUM(Prop2018DistTar!O6,Prop2018TransTar!O6)","v":0},{"$f":"SUM(Prop2018DistTar!P6,Prop2018TransTar!P6)","v":0},null,6.1360000000000001,10.247999999999999,null,null,7.056,null,null,null,null,null,null,null,null,null,null,{"$f":"IFERROR(D6/R6-1,0)","v":0.11880704041720991},{"$f":"IFERROR(E6/S6-1,0)","v":-2.732240437158473E-3},{"$f":"IFERROR(F6/T6-1,0)","v":0},{"$f":"IFERROR(G6/U6-1,0)","v":0},{"$f":"IFERROR(H6/V6-1,0)","v":-1.9841269841269771E-2},{"$f":"IFERROR(I6/W6-1,0)","v":0},{"$f":"IFERROR(J6/X6-1,0)","v":0},{"$f":"IFERROR(K6/Y6-1,0)","v":0},{"$f":"IFERROR(L6/Z6-1,0)","v":0},{"$f":"IFERROR(M6/AA6-1,0)","v":0},{"$f":"IFERROR(N6/AB6-1,0)","v":0},{"$f":"IFERROR(O6/AC6-1,0)","v":0},{"$f":"IFERROR(P6/AD6-1,0)","v":0},{"$f":"IF(MAX(ABS(AG6:AS6))>$AT$4,\"EXPLAIN\",\"\")","v":""}]
[null,"Winter Energy Tariff",{"$f":"Prop2018DistTar!C7","v":"Winter economy tariff"},{"$f":"SUM(Prop2018DistTar!D7,Prop2018TransTar!D7)","v":8.8409999999999993},{"$f":"SUM(Prop2018DistTar!E7,Prop2018TransTar!E7)","v":8.5570000000000004},{"$f":"SUM(Prop2018DistTar!F7,Prop2018TransTar!F7)","v":0},{"$f":"SUM(Prop2018DistTar!G7,Prop2018TransTar!G7)","v":0},{"$f":"SUM(Prop2018DistTar!H7,Prop2018TransTar!H7)","v":6.4559999999999995},{"$f":"SUM(Prop2018DistTar!I7,Prop2018TransTar!I7)","v":3.4020000000000001},{"$f":"SUM(Prop2018DistTar!J7,Prop2018TransTar!J7)","v":0},{"$f":"SUM(Prop2018DistTar!K7,Prop2018TransTar!K7)","v":0},{"$f":"SUM(Prop2018DistTar!L7,Prop2018TransTar!L7)","v":0},{"$f":"SUM(Prop2018DistTar!M7,Prop2018TransTar!M7)","v":0},{"$f":"SUM(Prop2018DistTar!N7,Prop2018TransTar!N7)","v":0},{"$f":"SUM(Prop2018DistTar!O7,Prop2018TransTar!O7)","v":0},{"$f":"SUM(Prop2018DistTar!P7,Prop2018TransTar!P7)","v":0},null,7.9029999999999996,8.5609999999999999,null,null,6.5,3.77,null,null,null,null,null,null,null,null,null,0.11868910540301147,-4.6723513608215583E-4,0,0,-6.7692307692308606E-3,-9.7612732095490706E-2,0,0,0,0,0,0,0,{"$f":"IF(MAX(ABS(AG7:AS7))>$AT$4,\"EXPLAIN\",\"\")","v":""}]
[null,"Reverse cycle airconditioning time of use",{"$f":"Prop2018DistTar!C8","v":"Reverse cycle airconditioning time of use"},{"$f":"SUM(Prop2018DistTar!D8,Prop2018TransTar!D8)","v":0},{"$f":"SUM(Prop2018DistTar!E8,Prop2018TransTar!E8)","v":0},{"$f":"SUM(Prop2018DistTar!F8,Prop2018TransTar!F8)","v":0},{"$f":"SUM(Prop2018DistTar!G8,Prop2018TransTar!G8)","v":0},{"$f":"SUM(Prop2018DistTar!H8,Prop2018TransTar!H8)","v":0},{"$f":"SUM(Prop2018DistTar!I8,Prop2018TransTar!I8)","v":0},{"$f":"SUM(Prop2018DistTar!J8,Prop2018TransTar!J8)","v":0},{"$f":"SUM(Prop2018DistTar!K8,Prop2018TransTar!K8)","v":0},{"$f":"SUM(Prop2018DistTar!L8,Prop2018TransTar!L8)","v":0},{"$f":"SUM(Prop2018DistTar!M8,Prop2018TransTar!M8)","v":0},{"$f":"SUM(Prop2018DistTar!N8,Prop2018TransTar!N8)","v":0},{"$f":"SUM(Prop2018DistTar!O8,Prop2018TransTar!O8)","v":0},{"$f":"SUM(Prop2018DistTar!P8,Prop2018TransTar!P8)","v":0},null,null,null,null,23.198,null,null,5.3129999999999997,1.2649999999999999,null,null,75.819999999999993,null,null,null,null,0,0,0,-1,0,0,-1,-1,0,0,-1,0,0,{"$f":"IF(MAX(ABS(AG8:AS8))>$AT$4,\"EXPLAIN\",\"\")","v":"EXPLAIN"},"Tariff discontinued in 2018"]
[null,"Low voltage small 2 rate",{"$f":"Prop2018DistTar!C9","v":"Low voltage small 2 rate"},{"$f":"SUM(Prop2018DistTar!D9,Prop2018TransTar!D9)","v":14.02},{"$f":"SUM(Prop2018DistTar!E9,Prop2018TransTar!E9)","v":0},{"$f":"SUM(Prop2018DistTar!F9,Prop2018TransTar!F9)","v":0},{"$f":"SUM(Prop2018DistTar!G9,Prop2018TransTar!G9)","v":13.010000000000002},{"$f":"SUM(Prop2018DistTar!H9,Prop2018TransTar!H9)","v":0},{"$f":"SUM(Prop2018DistTar!I9,Prop2018TransTar!I9)","v":0},{"$f":"SUM(Prop2018DistTar!J9,Prop2018TransTar!J9)","v":9.9909999999999997},{"$f":"SUM(Prop2018DistTar!K9,Prop2018TransTar!K9)","v":1.7450000000000001},{"$f":"SUM(Prop2018DistTar!L9,Prop2018TransTar!L9)","v":0},{"$f":"SUM(Prop2018DistTar!M9,Prop2018TransTar!M9)","v":0},{"$f":"SUM(Prop2018DistTar!N9,Prop2018TransTar!N9)","v":0},{"$f":"SUM(Prop2018DistTar!O9,Prop2018TransTar!O9)","v":0},{"$f":"SUM(Prop2018DistTar!P9,Prop2018TransTar!P9)","v":0},null,12.532999999999999,null,null,12.999000000000001,null,null,10.026999999999999,1.56,null,null,null,null,null,null,null,0.11864677252054578,0,0,8.4621893991854158E-4,0,0,-3.590306173332003E-3,0.11858974358974361,0,0,0,0,0,{"$f":"IF(MAX(ABS(AG9:AS9))>$AT$4,\"EXPLAIN\",\"\")","v":""}]
[null,"Dedicated circuit",{"$f":"Prop2018DistTar!C10","v":"Dedicated circuit"},{"$f":"SUM(Prop2018DistTar!D10,Prop2018TransTar!D10)","v":0},{"$f":"SUM(Prop2018DistTar!E10,Prop2018TransTar!E10)","v":0},{"$f":"SUM(Prop2018DistTar!F10,Prop2018TransTar!F10)","v":0},{"$f":"SUM(Prop2018DistTar!G10,Prop2018TransTar!G10)","v":0},{"$f":"SUM(Prop2018DistTar!H10,Prop2018TransTar!H10)","v":0},{"$f":"SUM(Prop2018DistTar!I10,Prop2018TransTar!I10)","v":0},{"$f":"SUM(Prop2018DistTar!J10,Prop2018TransTar!J10)","v":0},{"$f":"SUM(Prop2018DistTar!K10,Prop2018TransTar!K10)","v":1.931},{"$f":"SUM(Prop2018DistTar!L10,Prop2018TransTar!L10)","v":0},{"$f":"SUM(Prop2018DistTar!M10,Prop2018TransTar!M10)","v":0},{"$f":"SUM(Prop2018DistTar!N10,Prop2018TransTar!N10)","v":0},{"$f":"SUM(Prop2018DistTar!O10,Prop2018TransTar!O10)","v":0},{"$f":"SUM(Prop2018DistTar!P10,Prop2018TransTar!P10)","v":0},null,null,null,null,null,null,null,null,1.726,null,null,null,null,null,null,null,0,0,0,0,0,0,0,0.11877172653534185,0,0,0,0,0,{"$f":"IF(MAX(ABS(AG10:AS10))>$AT$4,\"EXPLAIN\",\"\")","v":""}]
[null,"Low voltage medium 1 rate",{"$f":"Prop2018DistTar!C11","v":"Low voltage medium 1 rate"},{"$f":"SUM(Prop2018DistTar!D11,Prop2018TransTar!D11)","v":11.651999999999999},{"$f":"SUM(Prop2018DistTar!E11,Prop2018TransTar!E11)","v":12.302999999999999},{"$f":"SUM(Prop2018DistTar!F11,Prop2018TransTar!F11)","v":0},{"$f":"SUM(Prop2018DistTar!G11,Prop2018TransTar!G11)","v":0},{"$f":"SUM(Prop2018DistTar!H11,Prop2018TransTar!H11)","v":8.0380000000000003},{"$f":"SUM(Prop2018DistTar!I11,Prop2018TransTar!I11)","v":0},{"$f":"SUM(Prop2018DistTar!J11,Prop2018TransTar!J11)","v":0},{"$f":"SUM(Prop2018DistTar!K11,Prop2018TransTar!K11)","v":0},{"$f":"SUM(Prop2018DistTar!L11,Prop2018TransTar!L11)","v":0},{"$f":"SUM(Prop2018DistTar!M11,Prop2018TransTar!M11)","v":0},{"$f":"SUM(Prop2018DistTar!N11,Prop2018TransTar!N11)","v":0},{"$f":"SUM(Prop2018DistTar!O11,Prop2018TransTar!O11)","v":0},{"$f":"SUM(Prop2018DistTar!P11,Prop2018TransTar!P11)","v":0},null,10.557,12.109,null,null,8.0500000000000007,null,null,null,null,null,null,null,null,null,null,0.1037226484796816,1.6021141299859432E-2,0,0,-1.4906832298137163E-3,0,0,0,0,0,0,0,0,{"$f":"IF(MAX(ABS(AG11:AS11))>$AT$4,\"EXPLAIN\",\"\")","v":""}]
[null,"Low voltage medium 2 rate 5 day",{"$f":"Prop2018DistTar!C12","v":"Low voltage medium 2 rate 5 day"},{"$f":"SUM(Prop2018DistTar!D12,Prop2018TransTar!D12)","v":22.303000000000001},{"$f":"SUM(Prop2018DistTar!E12,Prop2018TransTar!E12)","v":0},{"$f":"SUM(Prop2018DistTar!F12,Prop2018TransTar!F12)","v":0},{"$f":"SUM(Prop2018DistTar!G12,Prop2018TransTar!G12)","v":12.616},{"$f":"SUM(Prop2018DistTar!H12,Prop2018TransTar!H12)","v":0},{"$f":"SUM(Prop2018DistTar!I12,Prop2018TransTar!I12)","v":0},{"$f":"SUM(Prop2018DistTar!J12,Prop2018TransTar!J12)","v":9.5440000000000005},{"$f":"SUM(Prop2018DistTar!K12,Prop2018TransTar!K12)","v":2.0219999999999998},{"$f":"SUM(Prop2018DistTar!L12,Prop2018TransTar!L12)","v":0},{"$f":"SUM(Prop2018DistTar!M12,Prop2018TransTar!M12)","v":0},{"$f":"SUM(Prop2018DistTar!N12,Prop2018TransTar!N12)","v":0},{"$f":"SUM(Prop2018DistTar!O12,Prop2018TransTar!O12)","v":0},{"$f":"SUM(Prop2018DistTar!P12,Prop2018TransTar!P12)","v":0},null,18.861999999999998,null,null,11.269,null,null,8.5500000000000007,1.71,null,null,null,null,null,null,null,0.18243028310889642,0,0,0.11953145798207476,0,0,0.1162573099415205,0.18245614035087709,0,0,0,0,0,{"$f":"IF(MAX(ABS(AG12:AS12))>$AT$4,\"EXPLAIN\",\"\")","v":"EXPLAIN"},"see comment"]
[null,"Low voltage medium 2 rate 5 day",{"$f":"Prop2018DistTar!C13","v":"Low voltage medium 2 rate 7 day"},{"$f":"SUM(Prop2018DistTar!D13,Prop2018TransTar!D13)","v":23.742000000000001},{"$f":"SUM(Prop2018DistTar!E13,Prop2018TransTar!E13)","v":0},{"$f":"SUM(Prop2018DistTar!F13,Prop2018TransTar!F13)","v":0},{"$f":"SUM(Prop2018DistTar!G13,Prop2018TransTar!G13)","v":12.433},{"$f":"SUM(Prop2018DistTar!H13,Prop2018TransTar!H13)","v":0},{"$f":"SUM(Prop2018DistTar!I13,Prop2018TransTar!I13)","v":0},{"$f":"SUM(Prop2018DistTar!J13,Prop2018TransTar!J13)","v":9.6829999999999998},{"$f":"SUM(Prop2018DistTar!K13,Prop2018TransTar!K13)","v":1.88},{"$f":"SUM(Prop2018DistTar!L13,Prop2018TransTar!L13)","v":0},{"$f":"SUM(Prop2018DistTar!M13,Prop2018TransTar!M13)","v":0},{"$f":"SUM(Prop2018DistTar!N13,Prop2018TransTar!N13)","v":0},{"$f":"SUM(Prop2018DistTar!O13,Prop2018TransTar!O13)","v":0},{"$f":"SUM(Prop2018DistTar!P13,Prop2018TransTar!P13)","v":0},null,20.651,null,null,11.769,null,null,9.1869999999999994,1.635,null,null,null,null,null,null,null,0.14967798169580182,0,0,5.6419406916475401E-2,0,0,5.3989332752802932E-2,0.14984709480122316,0,0,0,0,0,{"$f":"IF(MAX(ABS(AG13:AS13))>$AT$4,\"EXPLAIN\",\"\")","v":""},"see comment"]
[null,"Unmetered supplies",{"$f":"Prop2018DistTar!C14","v":"Unmetered supplies"},{"$f":"SUM(Prop2018DistTar!D14,Prop2018TransTar!D14)","v":0},{"$f":"SUM(Prop2018DistTar!E14,Prop2018TransTar!E14)","v":0},{"$f":"SUM(Prop2018DistTar!F14,Prop2018TransTar!F14)","v":0},{"$f":"SUM(Prop2018DistTar!G14,Prop2018TransTar!G14)","v":11.219999999999999},{"$f":"SUM(Prop2018DistTar!H14,Prop2018TransTar!H14)","v":0},{"$f":"SUM(Prop2018DistTar!I14,Prop2018TransTar!I14)","v":0},{"$f":"SUM(Prop2018DistTar!J14,Prop2018TransTar!J14)","v":8.3949999999999996},{"$f":"SUM(Prop2018DistTar!K14,Prop2018TransTar!K14)","v":1.5249999999999999},{"$f":"SUM(Prop2018DistTar!L14,Prop2018TransTar!L14)","v":0},{"$f":"SUM(Prop2018DistTar!M14,Prop2018TransTar!M14)","v":0},{"$f":"SUM(Prop2018DistTar!N14,Prop2018TransTar!N14)","v":0},{"$f":"SUM(Prop2018DistTar!O14,Prop2018TransTar!O14)","v":0},{"$f":"SUM(Prop2018DistTar!P14,Prop2018TransTar!P14)","v":0},null,null,null,null,11.313000000000001,null,null,8.5289999999999999,1.3640000000000001,null,null,null,null,null,null,null,0,0,0,-8.2206311323258507E-3,0,0,-1.571110329464187E-2,0.11803519061583567,0,0,0,0,0,{"$f":"IF(MAX(ABS(AG14:AS14))>$AT$4,\"EXPLAIN\",\"\")","v":""}]
[null,"Low voltage large 1 rate",{"$f":"Prop2018DistTar!C15","v":"Low voltage large 1 rate"},{"$f":"SUM(Prop2018DistTar!D15,Prop2018TransTar!D15)","v":13.641},{"$f":"SUM(Prop2018DistTar!E15,Prop2018TransTar!E15)","v":8.3030000000000008},{"$f":"SUM(Prop2018DistTar!F15,Prop2018TransTar!F15)","v":0},{"$f":"SUM(Prop2018DistTar!G15,Prop2018TransTar!G15)","v":0},{"$f":"SUM(Prop2018DistTar!H15,Prop2018TransTar!H15)","v":6.5720000000000001},{"$f":"SUM(Prop2018DistTar!I15,Prop2018TransTar!I15)","v":0},{"$f":"SUM(Prop2018DistTar!J15,Prop2018TransTar!J15)","v":0},{"$f":"SUM(Prop2018DistTar!K15,Prop2018TransTar!K15)","v":0},{"$f":"SUM(Prop2018DistTar!L15,Prop2018TransTar!L15)","v":0},{"$f":"SUM(Prop2018DistTar!M15,Prop2018TransTar!M15)","v":0},{"$f":"SUM(Prop2018DistTar!N15,Prop2018TransTar!N15)","v":0},{"$f":"SUM(Prop2018DistTar!O15,Prop2018TransTar!O15)","v":0},{"$f":"SUM(Prop2018DistTar!P15,Prop2018TransTar!P15)","v":0},null,11.676,8.14,0,0,6.4509999999999996,0,0,0,0,0,0,0,0,null,null,0.1682939362795477,2.0024570024570032E-2,0,0,1.8756781894279984E-2,0,0,0,0,0,0,0,0,{"$f":"IF(MAX(ABS(AG15:AS15))>$AT$4,\"EXPLAIN\",\"\")","v":"EXPLAIN"},"see comment"]
[null,"Low voltage large 2 rate",{"$f":"Prop2018DistTar!C16","v":"Low voltage large 2 rate"},{"$f":"SUM(Prop2018DistTar!D16,Prop2018TransTar!D16)","v":19.678000000000001},{"$f":"SUM(Prop2018DistTar!E16,Prop2018TransTar!E16)","v":0},{"$f":"SUM(Prop2018DistTar!F16,Prop2018TransTar!F16)","v":0},{"$f":"SUM(Prop2018DistTar!G16,Prop2018TransTar!G16)","v":11.36},{"$f":"SUM(Prop2018DistTar!H16,Prop2018TransTar!H16)","v":0},{"$f":"SUM(Prop2018DistTar!I16,Prop2018TransTar!I16)","v":0},{"$f":"SUM(Prop2018DistTar!J16,Prop2018TransTar!J16)","v":9.0419999999999998},{"$f":"SUM(Prop2018DistTar!K16,Prop2018TransTar!K16)","v":1.861},{"$f":"SUM(Prop2018DistTar!L16,Prop2018TransTar!L16)","v":0},{"$f":"SUM(Prop2018DistTar!M16,Prop2018TransTar!M16)","v":0},{"$f":"SUM(Prop2018DistTar!N16,Prop2018TransTar!N16)","v":0},{"$f":"SUM(Prop2018DistTar!O16,Prop2018TransTar!O16)","v":0},{"$f":"SUM(Prop2018DistTar!P16,Prop2018TransTar!P16)","v":0},null,16.841999999999999,0,0,10.518000000000001,0,0,8.375,1.593,0,0,0,0,0,null,null,0.16838855242845274,0,0,8.0053242061228325E-2,0,0,7.96417910447762E-2,0.16823603264281228,0,0,0,0,0,{"$f":"IF(MAX(ABS(AG16:AS16))>$AT$4,\"EXPLAIN\",\"\")","v":"EXPLAIN"},"see comment"]
[null,"Low voltage KW time of use",{"$f":"Prop2018DistTar!C17","v":"Low voltage KW time of use"},{"$f":"SUM(Prop2018DistTar!D17,Prop2018TransTar!D17)","v":0},{"$f":"SUM(Prop2018DistTar!E17,Prop2018TransTar!E17)","v":0},{"$f":"SUM(Prop2018DistTar!F17,Prop2018TransTar!F17)","v":0},{"$f":"SUM(Prop2018DistTar!G17,Prop2018TransTar!G17)","v":10.567},{"$f":"SUM(Prop2018DistTar!H17,Prop2018TransTar!H17)","v":0},{"$f":"SUM(Prop2018DistTar!I17,Prop2018TransTar!I17)","v":0},{"$f":"SUM(Prop2018DistTar!J17,Prop2018TransTar!J17)","v":6.5449999999999999},{"$f":"SUM(Prop2018DistTar!K17,Prop2018TransTar!K17)","v":2.0750000000000002},{"$f":"SUM(Prop2018DistTar!L17,Prop2018TransTar!L17)","v":0},{"$f":"SUM(Prop2018DistTar!M17,Prop2018TransTar!M17)","v":0},{"$f":"SUM(Prop2018DistTar!N17,Prop2018TransTar!N17)","v":50.394999999999996},{"$f":"SUM(Prop2018DistTar!O17,Prop2018TransTar!O17)","v":0},{"$f":"SUM(Prop2018DistTar!P17,Prop2018TransTar!P17)","v":0},null,0,null,null,9.4920000000000009,null,null,5.9790000000000001,1.756,null,null,45.21,null,null,null,null,0,0,0,0.11325326590813312,0,0,9.4664659642080595E-2,0.18166287015945337,0,0,0.11468701614687005,0,0,{"$f":"IF(MAX(ABS(AG17:AS17))>$AT$4,\"EXPLAIN\",\"\")","v":"EXPLAIN"},"see comment"]
[null,"Low voltage KW time of use - HOT",{"$f":"Prop2018DistTar!C18","v":"Low voltage KW time of use - HOT"},{"$f":"SUM(Prop2018DistTar!D18,Prop2018TransTar!D18)","v":0},{"$f":"SUM(Prop2018DistTar!E18,Prop2018TransTar!E18)","v":0},{"$f":"SUM(Prop2018DistTar!F18,Prop2018TransTar!F18)","v":0},{"$f":"SUM(Prop2018DistTar!G18,Prop2018TransTar!G18)","v":8.6649999999999991},{"$f":"SUM(Prop2018DistTar!H18,Prop2018TransTar!H18)","v":0},{"$f":"SUM(Prop2018DistTar!I18,Prop2018TransTar!I18)","v":0},{"$f":"SUM(Prop2018DistTar!J18,Prop2018TransTar!J18)","v":6.6879999999999997},{"$f":"SUM(Prop2018DistTar!K18,Prop2018TransTar!K18)","v":1.7529999999999999},{"$f":"SUM(Prop2018DistTar!L18,Prop2018TransTar!L18)","v":0},{"$f":"SUM(Prop2018DistTar!M18,Prop2018TransTar!M18)","v":0},{"$f":"SUM(Prop2018DistTar!N18,Prop2018TransTar!N18)","v":76.399000000000001},{"$f":"SUM(Prop2018DistTar!O18,Prop2018TransTar!O18)","v":0},{"$f":"SUM(Prop2018DistTar!P18,Prop2018TransTar!P18)","v":0},null,0,null,null,7.9790000000000001,null,null,6.1710000000000003,1.5249999999999999,null,null,70.415000000000006,null,null,null,null,0,0,0,8.5975686176212429E-2,0,0,8.3778966131907273E-2,0.14950819672131144,0,0,8.4981893062557656E-2,0,0,{"$f":"IF(MAX(ABS(AG18:AS18))>$AT$4,\"EXPLAIN\",\"\")","v":""}]
[null,"Low voltage large KVA time of use",{"$f":"Prop2018DistTar!C19","v":"Low voltage large KVA time of use"},{"$f":"SUM(Prop2018DistTar!D19,Prop2018TransTar!D19)","v":0},{"$f":"SUM(Prop2018DistTar!E19,Prop2018TransTar!E19)","v":0},{"$f":"SUM(Prop2018DistTar!F19,Prop2018TransTar!F19)","v":0},{"$f":"SUM(Prop2018DistTar!G19,Prop2018TransTar!G19)","v":2.3079999999999998},{"$f":"SUM(Prop2018DistTar!H19,Prop2018TransTar!H19)","v":0},{"$f":"SUM(Prop2018DistTar!I19,Prop2018TransTar!I19)","v":0},{"$f":"SUM(Prop2018DistTar!J19,Prop2018TransTar!J19)","v":1.915},{"$f":"SUM(Prop2018DistTar!K19,Prop2018TransTar!K19)","v":1.18},{"$f":"SUM(Prop2018DistTar!L19,Prop2018TransTar!L19)","v":0},{"$f":"SUM(Prop2018DistTar!M19,Prop2018TransTar!M19)","v":17.875},{"$f":"SUM(Prop2018DistTar!N19,Prop2018TransTar!N19)","v":26.207000000000001},{"$f":"SUM(Prop2018DistTar!O19,Prop2018TransTar!O19)","v":0},{"$f":"SUM(Prop2018DistTar!P19,Prop2018TransTar!P19)","v":0},null,0,null,null,2.4279999999999999,null,null,2.0030000000000001,1.01,null,17.149000000000001,24.957000000000001,null,null,null,null,0,0,0,-4.9423393739703503E-2,0,0,-4.3934098851722503E-2,0.16831683168316824,0,4.2334830019242986E-2,5.0086148174860678E-2,0,0,{"$f":"IF(MAX(ABS(AG19:AS19))>$AT$4,\"EXPLAIN\",\"\")","v":"EXPLAIN"},"see comment"]
[null,"Low voltage large KVA time of use - HOT",{"$f":"Prop2018DistTar!C20","v":"Low voltage large KVA time of use - HOT"},{"$f":"SUM(Prop2018DistTar!D20,Prop2018TransTar!D20)","v":0},{"$f":"SUM(Prop2018DistTar!E20,Prop2018TransTar!E20)","v":0},{"$f":"SUM(Prop2018DistTar!F20,Prop2018TransTar!F20)","v":0},{"$f":"SUM(Prop2018DistTar!G20,Prop2018TransTar!G20)","v":0},{"$f":"SUM(Prop2018DistTar!H20,Prop2018TransTar!H20)","v":0},{"$f":"SUM(Prop2018DistTar!I20,Prop2018TransTar!I20)","v":0},{"$f":"SUM(Prop2018DistTar!J20,Prop2018TransTar!J20)","v":0},{"$f":"SUM(Prop2018DistTar!K20,Prop2018TransTar!K20)","v":0},{"$f":"SUM(Prop2018DistTar!L20,Prop2018TransTar!L20)","v":0},{"$f":"SUM(Prop2018DistTar!M20,Prop2018TransTar!M20)","v":0},{"$f":"SUM(Prop2018DistTar!N20,Prop2018TransTar!N20)","v":0},{"$f":"SUM(Prop2018DistTar!O20,Prop2018TransTar!O20)","v":0},{"$f":"SUM(Prop2018DistTar!P20,Prop2018TransTar!P20)","v":0},null,0,null,null,1.8240000000000001,null,null,1.4890000000000001,0.86299999999999999,null,15.244999999999999,36.813000000000002,null,null,null,null,0,0,0,-1,0,0,-1,-1,0,-1,-1,0,0,{"$f":"IF(MAX(ABS(AG20:AS20))>$AT$4,\"EXPLAIN\",\"\")","v":"EXPLAIN"},"Tariff discontinued in 2018"]
[null,"High voltage KVA time of use",{"$f":"Prop2018DistTar!C21","v":"High voltage KVA time of use"},{"$f":"SUM(Prop2018DistTar!D21,Prop2018TransTar!D21)","v":0},{"$f":"SUM(Prop2018DistTar!E21,Prop2018TransTar!E21)","v":0},{"$f":"SUM(Prop2018DistTar!F21,Prop2018TransTar!F21)","v":0},{"$f":"SUM(Prop2018DistTar!G21,Prop2018TransTar!G21)","v":1.476},{"$f":"SUM(Prop2018DistTar!H21,Prop2018TransTar!H21)","v":0},{"$f":"SUM(Prop2018DistTar!I21,Prop2018TransTar!I21)","v":0},{"$f":"SUM(Prop2018DistTar!J21,Prop2018TransTar!J21)","v":1.2509999999999999},{"$f":"SUM(Prop2018DistTar!K21,Prop2018TransTar!K21)","v":0.73099999999999998},{"$f":"SUM(Prop2018DistTar!L21,Prop2018TransTar!L21)","v":0},{"$f":"SUM(Prop2018DistTar!M21,Prop2018TransTar!M21)","v":12.803999999999998},{"$f":"SUM(Prop2018DistTar!N21,Prop2018TransTar!N21)","v":16.22},{"$f":"SUM(Prop2018DistTar!O21,Prop2018TransTar!O21)","v":0},{"$f":"SUM(Prop2018DistTar!P21,Prop2018TransTar!P21)","v":0},null,0,null,null,1.5860000000000001,null,null,1.33,0.63,null,13.114000000000001,16.157,null,null,null,null,0,0,0,-6.9356872635561229E-2,0,0,-5.9398496240601673E-2,0.16031746031746019,0,-2.3638859234406118E-2,3.8992387200593726E-3,0,0,{"$f":"IF(MAX(ABS(AG21:AS21))>$AT$4,\"EXPLAIN\",\"\")","v":"EXPLAIN"},"see comment"]
[null,"High voltage KVA time of use - HOT",{"$f":"Prop2018DistTar!C22","v":"High voltage KVA time of use - HOT"},{"$f":"SUM(Prop2018DistTar!D22,Prop2018TransTar!D22)","v":0},{"$f":"SUM(Prop2018DistTar!E22,Prop2018TransTar!E22)","v":0},{"$f":"SUM(Prop2018DistTar!F22,Prop2018TransTar!F22)","v":0},{"$f":"SUM(Prop2018DistTar!G22,Prop2018TransTar!G22)","v":0},{"$f":"SUM(Prop2018DistTar!H22,Prop2018TransTar!H22)","v":0},{"$f":"SUM(Prop2018DistTar!I22,Prop2018TransTar!I22)","v":0},{"$f":"SUM(Prop2018DistTar!J22,Prop2018TransTar!J22)","v":0},{"$f":"SUM(Prop2018DistTar!K22,Prop2018TransTar!K22)","v":0},{"$f":"SUM(Prop2018DistTar!L22,Prop2018TransTar!L22)","v":0},{"$f":"SUM(Prop2018DistTar!M22,Prop2018TransTar!M22)","v":0},{"$f":"SUM(Prop2018DistTar!N22,Prop2018TransTar!N22)","v":0},{"$f":"SUM(Prop2018DistTar!O22,Prop2018TransTar!O22)","v":0},{"$f":"SUM(Prop2018DistTar!P22,Prop2018TransTar!P22)","v":0},null,0,null,null,1.246,null,null,1.0149999999999999,0.61399999999999999,null,11.805,27.265999999999998,null,null,null,null,0,0,0,-1,0,0,-1,-1,0,-1,-1,0,0,{"$f":"IF(MAX(ABS(AG22:AS22))>$AT$4,\"EXPLAIN\",\"\")","v":"EXPLAIN"},"Tariff discontinued in 2018"]
[null,"Subtransmission KVA time of use",{"$f":"Prop2018DistTar!C23","v":"Subtransmission KVA time of use"},{"$f":"SUM(Prop2018DistTar!D23,Prop2018TransTar!D23)","v":0},{"$f":"SUM(Prop2018DistTar!E23,Prop2018TransTar!E23)","v":0},{"$f":"SUM(Prop2018DistTar!F23,Prop2018TransTar!F23)","v":0},{"$f":"SUM(Prop2018DistTar!G23,Prop2018TransTar!G23)","v":0.90700000000000003},{"$f":"SUM(Prop2018DistTar!H23,Prop2018TransTar!H23)","v":0},{"$f":"SUM(Prop2018DistTar!I23,Prop2018TransTar!I23)","v":0},{"$f":"SUM(Prop2018DistTar!J23,Prop2018TransTar!J23)","v":0.71799999999999997},{"$f":"SUM(Prop2018DistTar!K23,Prop2018TransTar!K23)","v":0.32400000000000001},{"$f":"SUM(Prop2018DistTar!L23,Prop2018TransTar!L23)","v":0},{"$f":"SUM(Prop2018DistTar!M23,Prop2018TransTar!M23)","v":3.87},{"$f":"SUM(Prop2018DistTar!N23,Prop2018TransTar!N23)","v":4.907},{"$f":"SUM(Prop2018DistTar!O23,Prop2018TransTar!O23)","v":0},{"$f":"SUM(Prop2018DistTar!P23,Prop2018TransTar!P23)","v":0},null,0,null,null,0.99299999999999999,null,null,0.79,0.27900000000000003,null,4.8369999999999997,6.0519999999999996,null,null,null,null,0,0,0,-8.660624370594161E-2,0,0,-9.1139240506329156E-2,0.16129032258064502,0,-0.19991730411412023,-0.18919365499008589,0,0,{"$f":"IF(MAX(ABS(AG23:AS23))>$AT$4,\"EXPLAIN\",\"\")","v":"EXPLAIN"},"see comment"]
[null,"Time of Day",{"$f":"Prop2018DistTar!C24","v":"TOD"},{"$f":"SUM(Prop2018DistTar!D24,Prop2018TransTar!D24)","v":6.53},{"$f":"SUM(Prop2018DistTar!E24,Prop2018TransTar!E24)","v":0},{"$f":"SUM(Prop2018DistTar!F24,Prop2018TransTar!F24)","v":6.8369999999999997},{"$f":"SUM(Prop2018DistTar!G24,Prop2018TransTar!G24)","v":18.541},{"$f":"SUM(Prop2018DistTar!H24,Prop2018TransTar!H24)","v":0},{"$f":"SUM(Prop2018DistTar!I24,Prop2018TransTar!I24)","v":0},{"$f":"SUM(Prop2018DistTar!J24,Prop2018TransTar!J24)","v":11.665000000000001},{"$f":"SUM(Prop2018DistTar!K24,Prop2018TransTar!K24)","v":3.0270000000000001},{"$f":"SUM(Prop2018DistTar!L24,Prop2018TransTar!L24)","v":5.39},{"$f":"SUM(Prop2018DistTar!M24,Prop2018TransTar!M24)","v":0},{"$f":"SUM(Prop2018DistTar!N24,Prop2018TransTar!N24)","v":0},{"$f":"SUM(Prop2018DistTar!O24,Prop2018TransTar!O24)","v":0},{"$f":"SUM(Prop2018DistTar!P24,Prop2018TransTar!P24)","v":0},null,5.8369999999999997,0,6.8049999999999997,17.39,0,0,11.12,2.7050000000000001,5.431,0,0,0,0,null,null,0.11872537262292293,0,4.7024246877296338E-3,6.6187464059804579E-2,0,0,4.901079136690667E-2,0.11903881700554542,-7.5492542809796337E-3,0,0,0,0,{"$f":"IF(MAX(ABS(AG24:AS24))>$AT$4,\"EXPLAIN\",\"\")","v":""}]
[null,"Time of Day 9pm off-peak",{"$f":"Prop2018DistTar!C25","v":"TOD9"},{"$f":"SUM(Prop2018DistTar!D25,Prop2018TransTar!D25)","v":6.774},{"$f":"SUM(Prop2018DistTar!E25,Prop2018TransTar!E25)","v":0},{"$f":"SUM(Prop2018DistTar!F25,Prop2018TransTar!F25)","v":9.0340000000000007},{"$f":"SUM(Prop2018DistTar!G25,Prop2018TransTar!G25)","v":21.515000000000001},{"$f":"SUM(Prop2018DistTar!H25,Prop2018TransTar!H25)","v":0},{"$f":"SUM(Prop2018DistTar!I25,Prop2018TransTar!I25)","v":0},{"$f":"SUM(Prop2018DistTar!J25,Prop2018TransTar!J25)","v":14.547000000000001},{"$f":"SUM(Prop2018DistTar!K25,Prop2018TransTar!K25)","v":4.1929999999999996},{"$f":"SUM(Prop2018DistTar!L25,Prop2018TransTar!L25)","v":7.7780000000000005},{"$f":"SUM(Prop2018DistTar!M25,Prop2018TransTar!M25)","v":0},{"$f":"SUM(Prop2018DistTar!N25,Prop2018TransTar!N25)","v":0},{"$f":"SUM(Prop2018DistTar!O25,Prop2018TransTar!O25)","v":0},{"$f":"SUM(Prop2018DistTar!P25,Prop2018TransTar!P25)","v":0},null,6.0549999999999997,0,9.7230000000000008,21.004000000000001,0,0,14.651,3.7480000000000002,8.5190000000000001,0,0,0,0,null,null,0.11874483897605281,0,-7.0862902396379712E-2,2.432869929537218E-2,0,0,-7.0984915705412099E-3,0.11872998932764123,-8.6982040145556994E-2,0,0,0,0,{"$f":"IF(MAX(ABS(AG25:AS25))>$AT$4,\"EXPLAIN\",\"\")","v":""}]
[null,"Time of Use",{"$f":"Prop2018DistTar!C26","v":"TOU"},{"$f":"SUM(Prop2018DistTar!D26,Prop2018TransTar!D26)","v":0},{"$f":"SUM(Prop2018DistTar!E26,Prop2018TransTar!E26)","v":0},{"$f":"SUM(Prop2018DistTar!F26,Prop2018TransTar!F26)","v":0},{"$f":"SUM(Prop2018DistTar!G26,Prop2018TransTar!G26)","v":11.758000000000001},{"$f":"SUM(Prop2018DistTar!H26,Prop2018TransTar!H26)","v":0},{"$f":"SUM(Prop2018DistTar!I26,Prop2018TransTar!I26)","v":0},{"$f":"SUM(Prop2018DistTar!J26,Prop2018TransTar!J26)","v":6.83},{"$f":"SUM(Prop2018DistTar!K26,Prop2018TransTar!K26)","v":2.8290000000000002},{"$f":"SUM(Prop2018DistTar!L26,Prop2018TransTar!L26)","v":0},{"$f":"SUM(Prop2018DistTar!M26,Prop2018TransTar!M26)","v":0},{"$f":"SUM(Prop2018DistTar!N26,Prop2018TransTar!N26)","v":47.424999999999997},{"$f":"SUM(Prop2018DistTar!O26,Prop2018TransTar!O26)","v":0},{"$f":"SUM(Prop2018DistTar!P26,Prop2018TransTar!P26)","v":0},null,0,0,0,11.327999999999999,0,0,6.5119999999999996,2.5910000000000002,0,0,44.892000000000003,0,0,null,null,0,0,0,3.7959039548022711E-2,0,0,4.8832923832923925E-2,9.1856426090312526E-2,0,0,5.6424307226231818E-2,0,0,{"$f":"IF(MAX(ABS(AG26:AS26))>$AT$4,\"EXPLAIN\",\"\")","v":""}]
[null,"Time of Day Flexible",{"$f":"Prop2018DistTar!C27","v":"TODFLEX"},{"$f":"SUM(Prop2018DistTar!D27,Prop2018TransTar!D27)","v":7.2949999999999999},{"$f":"SUM(Prop2018DistTar!E27,Prop2018TransTar!E27)","v":0},{"$f":"SUM(Prop2018DistTar!F27,Prop2018TransTar!F27)","v":6.3410000000000002},{"$f":"SUM(Prop2018DistTar!G27,Prop2018TransTar!G27)","v":20.64},{"$f":"SUM(Prop2018DistTar!H27,Prop2018TransTar!H27)","v":0},{"$f":"SUM(Prop2018DistTar!I27,Prop2018TransTar!I27)","v":0},{"$f":"SUM(Prop2018DistTar!J27,Prop2018TransTar!J27)","v":13.005000000000001},{"$f":"SUM(Prop2018DistTar!K27,Prop2018TransTar!K27)","v":4.0090000000000003},{"$f":"SUM(Prop2018DistTar!L27,Prop2018TransTar!L27)","v":6.1509999999999998},{"$f":"SUM(Prop2018DistTar!M27,Prop2018TransTar!M27)","v":0},{"$f":"SUM(Prop2018DistTar!N27,Prop2018TransTar!N27)","v":0},{"$f":"SUM(Prop2018DistTar!O27,Prop2018TransTar!O27)","v":0},{"$f":"SUM(Prop2018DistTar!P27,Prop2018TransTar!P27)","v":0},null,6.5209999999999999,0,6.4160000000000004,19.948,0,0,13.023,3.5840000000000001,6.1589999999999998,0,0,0,0,null,null,0.1186934519245515,0,-1.1689526184538668E-2,3.4690194505714977E-2,0,0,-1.3821700069107656E-3,0.11858258928571441,-1.2989121610651466E-3,0,0,0,0,{"$f":"IF(MAX(ABS(AG27:AS27))>$AT$4,\"EXPLAIN\",\"\")","v":""}]
[null,"Seasonal Demand KW 1 rate",{"$f":"Prop2018DistTar!C28","v":"Low Voltage KW 1 rate"},{"$f":"SUM(Prop2018DistTar!D28,Prop2018TransTar!D28)","v":0},{"$f":"SUM(Prop2018DistTar!E28,Prop2018TransTar!E28)","v":3.3050000000000002},{"$f":"SUM(Prop2018DistTar!F28,Prop2018TransTar!F28)","v":3.3050000000000002},{"$f":"SUM(Prop2018DistTar!G28,Prop2018TransTar!G28)","v":3.3050000000000002},{"$f":"SUM(Prop2018DistTar!H28,Prop2018TransTar!H28)","v":3.3050000000000002},{"$f":"SUM(Prop2018DistTar!I28,Prop2018TransTar!I28)","v":3.3050000000000002},{"$f":"SUM(Prop2018DistTar!J28,Prop2018TransTar!J28)","v":3.3050000000000002},{"$f":"SUM(Prop2018DistTar!K28,Prop2018TransTar!K28)","v":3.3050000000000002},{"$f":"SUM(Prop2018DistTar!L28,Prop2018TransTar!L28)","v":3.3050000000000002},{"$f":"SUM(Prop2018DistTar!M28,Prop2018TransTar!M28)","v":0},{"$f":"SUM(Prop2018DistTar!N28,Prop2018TransTar!N28)","v":0},{"$f":"SUM(Prop2018DistTar!O28,Prop2018TransTar!O28)","v":30.570999999999998},{"$f":"SUM(Prop2018DistTar!P28,Prop2018TransTar!P28)","v":13.198},null,0,3.39,3.39,3.39,3.39,3.39,3.39,3.39,3.39,null,null,30.581,13.667999999999999,null,null,0,-2.5073746312684331E-2,-2.5073746312684331E-2,-2.5073746312684331E-2,-2.5073746312684331E-2,-2.5073746312684331E-2,-2.5073746312684331E-2,-2.5073746312684331E-2,-2.5073746312684331E-2,0,0,-3.2700042510058758E-4,-3.4386889083991679E-2,{"$f":"IF(MAX(ABS(AG28:AS28))>$AT$4,\"EXPLAIN\",\"\")","v":""}]
[null,"Low voltage medium KW time of use",{"$f":"Prop2018DistTar!C29","v":"Low voltage medium KW time of use (opt-in)"},{"$f":"SUM(Prop2018DistTar!D29,Prop2018TransTar!D29)","v":0},{"$f":"SUM(Prop2018DistTar!E29,Prop2018TransTar!E29)","v":4.4359999999999999},{"$f":"SUM(Prop2018DistTar!F29,Prop2018TransTar!F29)","v":4.4359999999999999},{"$f":"SUM(Prop2018DistTar!G29,Prop2018TransTar!G29)","v":4.4359999999999999},{"$f":"SUM(Prop2018DistTar!H29,Prop2018TransTar!H29)","v":4.4359999999999999},{"$f":"SUM(Prop2018DistTar!I29,Prop2018TransTar!I29)","v":4.4359999999999999},{"$f":"SUM(Prop2018DistTar!J29,Prop2018TransTar!J29)","v":4.4359999999999999},{"$f":"SUM(Prop2018DistTar!K29,Prop2018TransTar!K29)","v":4.4359999999999999},{"$f":"SUM(Prop2018DistTar!L29,Prop2018TransTar!L29)","v":4.4359999999999999},{"$f":"SUM(Prop2018DistTar!M29,Prop2018TransTar!M29)","v":0},{"$f":"SUM(Prop2018DistTar!N29,Prop2018TransTar!N29)","v":0},{"$f":"SUM(Prop2018DistTar!O29,Prop2018TransTar!O29)","v":36.69},{"$f":"SUM(Prop2018DistTar!P29,Prop2018TransTar!P29)","v":24.46},null,0,4.4880000000000004,4.4880000000000004,4.4880000000000004,4.4880000000000004,4.4880000000000004,4.4880000000000004,4.4880000000000004,4.4880000000000004,0,0,46.783000000000001,31.189,null,null,0,-1.1586452762923471E-2,-1.1586452762923471E-2,-1.1586452762923471E-2,-1.1586452762923471E-2,-1.1586452762923471E-2,-1.1586452762923471E-2,-1.1586452762923471E-2,-1.1586452762923471E-2,0,0,-0.21574076053267222,-0.21574914232581999,{"$f":"IF(MAX(ABS(AG29:AS29))>$AT$4,\"EXPLAIN\",\"\")","v":"EXPLAIN"},"see comment"]
[null,"Low voltage medium KW 1 rate - transitional",{"$f":"Prop2018DistTar!C30","v":"Low voltage medium KW 1 rate (mandatory)"},{"$f":"SUM(Prop2018DistTar!D30,Prop2018TransTar!D30)","v":0},{"$f":"SUM(Prop2018DistTar!E30,Prop2018TransTar!E30)","v":6.7859999999999996},{"$f":"SUM(Prop2018DistTar!F30,Prop2018TransTar!F30)","v":6.7859999999999996},{"$f":"SUM(Prop2018DistTar!G30,Prop2018TransTar!G30)","v":6.7859999999999996},{"$f":"SUM(Prop2018DistTar!H30,Prop2018TransTar!H30)","v":6.7859999999999996},{"$f":"SUM(Prop2018DistTar!I30,Prop2018TransTar!I30)","v":6.7859999999999996},{"$f":"SUM(Prop2018DistTar!J30,Prop2018TransTar!J30)","v":6.7859999999999996},{"$f":"SUM(Prop2018DistTar!K30,Prop2018TransTar!K30)","v":6.7859999999999996},{"$f":"SUM(Prop2018DistTar!L30,Prop2018TransTar!L30)","v":6.7859999999999996},{"$f":"SUM(Prop2018DistTar!M30,Prop2018TransTar!M30)","v":0},{"$f":"SUM(Prop2018DistTar!N30,Prop2018TransTar!N30)","v":0},{"$f":"SUM(Prop2018DistTar!O30,Prop2018TransTar!O30)","v":22.74},{"$f":"SUM(Prop2018DistTar!P30,Prop2018TransTar!P30)","v":15.158999999999999},null,0,6.1520000000000001,6.1520000000000001,6.1520000000000001,6.1520000000000001,6.1520000000000001,6.1520000000000001,6.1520000000000001,6.1520000000000001,0,0,21.373999999999999,14.25,null,null,0,0.10305591677503245,0.10305591677503245,0.10305591677503245,0.10305591677503245,0.10305591677503245,0.10305591677503245,0.10305591677503245,0.10305591677503245,0,0,6.3909422663048554E-2,6.3789473684210396E-2,{"$f":"IF(MAX(ABS(AG30:AS30))>$AT$4,\"EXPLAIN\",\"\")","v":""}]
[null,null,null,null,null,null,null,null,null,null,null,null,null,null,null,null,null,null,null,null,null,null,null,null,null,null,null,null,null,null,null,null,0,0,0,0,0,0,0,0,0,0,0,0,0,{"$f":"IF(MAX(ABS(AG31:AS31))>$AT$4,\"EXPLAIN\",\"\")","v":""}]
[null,null,null,null,null,null,null,null,null,null,null,null,null,null,null,null,null,null,null,null,null,null,null,null,null,null,null,null,null,null,null,null,0,0,0,0,0,0,0,0,0,0,0,0,0,{"$f":"IF(MAX(ABS(AG32:AS32))>$AT$4,\"EXPLAIN\",\"\")","v":""}]
[null,null,null,null,null,null,null,null,null,null,null,null,null,null,null,null,null,null,null,null,null,null,null,null,null,null,null,null,null,null,null,null,0,0,0,0,0,0,0,0,0,0,0,0,0,{"$f":"IF(MAX(ABS(AG33:AS33))>$AT$4,\"EXPLAIN\",\"\")","v":""}]
[null,null,null,null,null,null,null,null,null,null,null,null,null,null,null,null,null,null,null,null,null,null,null,null,null,null,null,null,null,null,null,null,0,0,0,0,0,0,0,0,0,0,0,0,0,{"$f":"IF(MAX(ABS(AG34:AS34))>$AT$4,\"EXPLAIN\",\"\")","v":""}]
[null,null,null,null,null,null,null,null,null,null,null,null,null,null,null,null,null,null,null,null,null,null,null,null,null,null,null,null,null,null,null,null,0,0,0,0,0,0,0,0,0,0,0,0,0,{"$f":"IF(MAX(ABS(AG35:AS35))>$AT$4,\"EXPLAIN\",\"\")","v":""}]
[null,null,null,null,null,null,null,null,null,null,null,null,null,null,null,null,null,null,null,null,null,null,null,null,null,null,null,null,null,null,null,null,0,0,0,0,0,0,0,0,0,0,0,0,0,{"$f":"IF(MAX(ABS(AG36:AS36))>$AT$4,\"EXPLAIN\",\"\")","v":""}]
[null,null,null,null,null,null,null,null,null,null,null,null,null,null,null,null,null,null,null,null,null,null,null,null,null,null,null,null,null,null,null,null,0,0,0,0,0,0,0,0,0,0,0,0,0,{"$f":"IF(MAX(ABS(AG37:AS37))>$AT$4,\"EXPLAIN\",\"\")","v":""}]
[null,null,null,null,null,null,null,null,null,null,null,null,null,null,null,null,null,null,null,null,null,null,null,null,null,null,null,null,null,null,null,null,{"$f":"IFERROR(D38/R38-1,0)","v":0},{"$f":"IFERROR(E38/S38-1,0)","v":0},{"$f":"IFERROR(F38/T38-1,0)","v":0},{"$f":"IFERROR(G38/U38-1,0)","v":0},{"$f":"IFERROR(H38/V38-1,0)","v":0},{"$f":"IFERROR(I38/W38-1,0)","v":0},{"$f":"IFERROR(J38/X38-1,0)","v":0},{"$f":"IFERROR(K38/Y38-1,0)","v":0},{"$f":"IFERROR(L38/Z38-1,0)","v":0},{"$f":"IFERROR(M38/AA38-1,0)","v":0},{"$f":"IFERROR(N38/AB38-1,0)","v":0},{"$f":"IFERROR(O38/AC38-1,0)","v":0},{"$f":"IFERROR(P38/AD38-1,0)","v":0},{"$f":"IF(MAX(ABS(AG38:AS38))>$AT$4,\"EXPLAIN\",\"\")","v":""}]
[null,null,null,null,null,null,null,null,null,null,null,null,null,null,null,null,null,null,null,null,null,null,null,null,null,null,null,null,null,null,null,null,0,0,0,0,0,0,0,0,0,0,0,0,0,{"$f":"IF(MAX(ABS(AG39:AS39))>$AT$4,\"EXPLAIN\",\"\")","v":""}]
[null,null,null,null,null,null,null,null,null,null,null,null,null,null,null,null,null,null,null,null,null,null,null,null,null,null,null,null,null,null,null,null,0,0,0,0,0,0,0,0,0,0,0,0,0,{"$f":"IF(MAX(ABS(AG40:AS40))>$AT$4,\"EXPLAIN\",\"\")","v":""}]
[null,null,null,null,null,null,null,null,null,null,null,null,null,null,null,null,null,null,null,null,null,null,null,null,null,null,null,null,null,null,null,null,0,0,0,0,0,0,0,0,0,0,0,0,0,{"$f":"IF(MAX(ABS(AG41:AS41))>$AT$4,\"EXPLAIN\",\"\")","v":""}]
[null,null,null,null,null,null,null,null,null,null,null,null,null,null,null,null,null,null,null,null,null,null,null,null,null,null,null,null,null,null,null,null,0,0,0,0,0,0,0,0,0,0,0,0,0,{"$f":"IF(MAX(ABS(AG42:AS42))>$AT$4,\"EXPLAIN\",\"\")","v":""}]
[null,null,null,null,null,null,null,null,null,null,null,null,null,null,null,null,null,null,null,null,null,null,null,null,null,null,null,null,null,null,null,null,0,0,0,0,0,0,0,0,0,0,0,0,0,{"$f":"IF(MAX(ABS(AG43:AS43))>$AT$4,\"EXPLAIN\",\"\")","v":""}]
[null,null,null,null,null,null,null,null,null,null,null,null,null,null,null,null,null,null,null,null,null,null,null,null,null,null,null,null,null,null,null,null,0,0,0,0,0,0,0,0,0,0,0,0,0,{"$f":"IF(MAX(ABS(AG44:AS44))>$AT$4,\"EXPLAIN\",\"\")","v":""}]
[null,null,null,null,null,null,null,null,null,null,null,null,null,null,null,null,null,null,null,null,null,null,null,null,null,null,null,null,null,null,null,null,0,0,0,0,0,0,0,0,0,0,0,0,0,{"$f":"IF(MAX(ABS(AG45:AS45))>$AT$4,\"EXPLAIN\",\"\")","v":""}]
[null,null,null,null,null,null,null,null,null,null,null,null,null,null,null,null,null,null,null,null,null,null,null,null,null,null,null,null,null,null,null,null,0,0,0,0,0,0,0,0,0,0,0,0,0,{"$f":"IF(MAX(ABS(AG46:AS46))>$AT$4,\"EXPLAIN\",\"\")","v":""}]
[null,null,null,null,null,null,null,null,null,null,null,null,null,null,null,null,null,null,null,null,null,null,null,null,null,null,null,null,null,null,null,null,0,0,0,0,0,0,0,0,0,0,0,0,0,{"$f":"IF(MAX(ABS(AG47:AS47))>$AT$4,\"EXPLAIN\",\"\")","v":""}]
[null,null,null,null,null,null,null,null,null,null,null,null,null,null,null,null,null,null,null,null,null,null,null,null,null,null,null,null,null,null,null,null,0,0,0,0,0,0,0,0,0,0,0,0,0,{"$f":"IF(MAX(ABS(AG48:AS48))>$AT$4,\"EXPLAIN\",\"\")","v":""}]
[null,null,null,null,null,null,null,null,null,null,null,null,null,null,null,null,null,null,null,null,null,null,null,null,null,null,null,null,null,null,null,null,0,0,0,0,0,0,0,0,0,0,0,0,0,{"$f":"IF(MAX(ABS(AG49:AS49))>$AT$4,\"EXPLAIN\",\"\")","v":""}]
[null,null,null,null,null,null,null,null,null,null,null,null,null,null,null,null,null,null,null,null,null,null,null,null,null,null,null,null,null,null,null,null,0,0,0,0,0,0,0,0,0,0,0,0,0,{"$f":"IF(MAX(ABS(AG50:AS50))>$AT$4,\"EXPLAIN\",\"\")","v":""}]
[null,null,null,null,null,null,null,null,null,null,null,null,null,null,null,null,null,null,null,null,null,null,null,null,null,null,null,null,null,null,null,null,0,0,0,0,0,0,0,0,0,0,0,0,0,{"$f":"IF(MAX(ABS(AG51:AS51))>$AT$4,\"EXPLAIN\",\"\")","v":""}]
[null,null,null,null,null,null,null,null,null,null,null,null,null,null,null,null,null,null,null,null,null,null,null,null,null,null,null,null,null,null,null,null,0,0,0,0,0,0,0,0,0,0,0,0,0,{"$f":"IF(MAX(ABS(AG52:AS52))>$AT$4,\"EXPLAIN\",\"\")","v":""}]
[null,null,null,null,null,null,null,null,null,null,null,null,null,null,null,null,null,null,null,null,null,null,null,null,null,null,null,null,null,null,null,null,0,0,0,0,0,0,0,0,0,0,0,0,0,{"$f":"IF(MAX(ABS(AG53:AS53))>$AT$4,\"EXPLAIN\",\"\")","v":""}]
[null,null,null,null,null,null,null,null,null,null,null,null,null,null,null,null,null,null,null,null,null,null,null,null,null,null,null,null,null,null,null,null,0,0,0,0,0,0,0,0,0,0,0,0,0,{"$f":"IF(MAX(ABS(AG54:AS54))>$AT$4,\"EXPLAIN\",\"\")","v":""}]
[null,null,null,null,null,null,null,null,null,null,null,null,null,null,null,null,null,null,null,null,null,null,null,null,null,null,null,null,null,null,null,null,0,0,0,0,0,0,0,0,0,0,0,0,0,{"$f":"IF(MAX(ABS(AG55:AS55))>$AT$4,\"EXPLAIN\",\"\")","v":""}]
[null,null,null,null,null,null,null,null,null,null,null,null,null,null,null,null,null,null,null,null,null,null,null,null,null,null,null,null,null,null,null,null,0,0,0,0,0,0,0,0,0,0,0,0,0,{"$f":"IF(MAX(ABS(AG56:AS56))>$AT$4,\"EXPLAIN\",\"\")","v":""}]
[null,null,null,null,null,null,null,null,null,null,null,null,null,null,null,null,null,null,null,null,null,null,null,null,null,null,null,null,null,null,null,null,0,0,0,0,0,0,0,0,0,0,0,0,0,{"$f":"IF(MAX(ABS(AG57:AS57))>$AT$4,\"EXPLAIN\",\"\")","v":""}]
[null,null,null,null,null,null,null,null,null,null,null,null,null,null,null,null,null,null,null,null,null,null,null,null,null,null,null,null,null,null,null,null,0,0,0,0,0,0,0,0,0,0,0,0,0,{"$f":"IF(MAX(ABS(AG58:AS58))>$AT$4,\"EXPLAIN\",\"\")","v":""}]
[null,null,null,null,null,null,null,null,null,null,null,null,null,null,null,null,null,null,null,null,null,null,null,null,null,null,null,null,null,null,null,null,0,0,0,0,0,0,0,0,0,0,0,0,0,{"$f":"IF(MAX(ABS(AG59:AS59))>$AT$4,\"EXPLAIN\",\"\")","v":""}]
[null,null,null,null,null,null,null,null,null,null,null,null,null,null,null,null,null,null,null,null,null,null,null,null,null,null,null,null,null,null,null,null,0,0,0,0,0,0,0,0,0,0,0,0,0,{"$f":"IF(MAX(ABS(AG60:AS60))>$AT$4,\"EXPLAIN\",\"\")","v":""}]
[null,null,null,null,null,null,null,null,null,null,null,null,null,null,null,null,null,null,null,null,null,null,null,null,null,null,null,null,null,null,null,null,0,0,0,0,0,0,0,0,0,0,0,0,0,{"$f":"IF(MAX(ABS(AG61:AS61))>$AT$4,\"EXPLAIN\",\"\")","v":""}]
[null,null,null,null,null,null,null,null,null,null,null,null,null,null,null,null,null,null,null,null,null,null,null,null,null,null,null,null,null,null,null,null,0,0,0,0,0,0,0,0,0,0,0,0,0,{"$f":"IF(MAX(ABS(AG62:AS62))>$AT$4,\"EXPLAIN\",\"\")","v":""}]
[null,null,null,null,null,null,null,null,null,null,null,null,null,null,null,null,null,null,null,null,null,null,null,null,null,null,null,null,null,null,null,null,0,0,0,0,0,0,0,0,0,0,0,0,0,{"$f":"IF(MAX(ABS(AG63:AS63))>$AT$4,\"EXPLAIN\",\"\")","v":""}]
[null,null,null,null,null,null,null,null,null,null,null,null,null,null,null,null,null,null,null,null,null,null,null,null,null,null,null,null,null,null,null,null,0,0,0,0,0,0,0,0,0,0,0,0,0,{"$f":"IF(MAX(ABS(AG64:AS64))>$AT$4,\"EXPLAIN\",\"\")","v":""}]
[null,null,null,null,null,null,null,null,null,null,null,null,null,null,null,null,null,null,null,null,null,null,null,null,null,null,null,null,null,null,null,null,0,0,0,0,0,0,0,0,0,0,0,0,0,{"$f":"IF(MAX(ABS(AG65:AS65))>$AT$4,\"EXPLAIN\",\"\")","v":""}]