{"text_format":"1","workbook":"xlsx","n_sheets":28,"sheets":["AER CF","AER NRs","AER lookups","AER ETL","Instructions","CONTENTS","Business & other details","E1. Expenditure Summary","E2. Mains Repex","E3. Mains Augex","E4. Meter replacement","E5. New Connections","E6. Non-network","E10. Overheads","E12. ICT","E13. Other capex","E17. Step changes","E20. Opex","E21. ARS","E25. Escalators","N1. Demand","N2. Network characteristics","S1.1 Customer numbers","S1.2 Customer numbers","S10. Supply Quality","S11. Network reliability","F3. Revenue","Additional disclosures"],"not_rendered":{"charts":0,"images":5,"macros":1,"external_links":0,"defined_names":757,"comments":3,"pivot_tables":0},"unopened":[],"bounds":{"document_bytes":16777216,"sheet_cells":100000,"rows_first":2000,"rows_last":500,"rows_between":2000,"halvings":0,"cell_chars":16384,"cell_head_chars":4096},"cells_cut":0,"cells_raw":0,"read":"whole","date_system":"1900"}

{"sheet":"AER CF","index":0,"n_rows":76,"n_cols":25,"rows_kept":76,"cut":false,"hidden":true,"merged":[[41,38,41,59],[41,69,41,90],[3,1,3,22],[39,38,39,59],[39,69,39,90],[40,38,40,59],[40,69,40,90]]}
[null,"AER CONDITIONAL FORMATTING"]
[]
[null,"CELLS FLAGED \"Y\" and greyed out will be greyed out in the worksheets."]
[null,"CONDITIONAL FORMATTING MAP"]
[null,null,null,null,null,"=INDEX(dms_CF_3.6.1, MATCH(dms_TradingName,dms_CF_TradingName))=\"Y\"","=INDEX(dms_CF_3.6.5, MATCH(dms_TradingName,dms_CF_TradingName))=\"Y\"","=INDEX(dms_CF_3.6.6.1, MATCH(dms_TradingName,dms_CF_TradingName))=\"Y\"","=INDEX(dms_CF_3.6.6.2, MATCH(dms_TradingName,dms_CF_TradingName))=\"Y\"","=INDEX(dms_CF_3.6.6.3, MATCH(dms_TradingName,dms_CF_TradingName))=\"Y\"","=INDEX(dms_CF_3.6.7.1, MATCH(dms_TradingName,dms_CF_TradingName))=\"Y\"","=INDEX(dms_CF_3.6.7.2, MATCH(dms_TradingName,dms_CF_TradingName))=\"Y\"","=INDEX(dms_CF_3.6.7.3, MATCH(dms_TradingName,dms_CF_TradingName))=\"Y\"","=INDEX(dms_CF_3.6.7.4, MATCH(dms_TradingName,dms_CF_TradingName))=\"Y\"","=INDEX(dms_CF_3.6.8, MATCH(dms_TradingName,dms_CF_TradingName))=\"Y\"","=INDEX(dms_CF_4.1, MATCH(dms_TradingName,dms_CF_TradingName))=\"Y\"","=INDEX(dms_CF_6.8, MATCH(dms_TradingName,dms_CF_TradingName))=\"Y\"","=INDEX(dms_CF_7.12, MATCH(dms_TradingName,dms_CF_TradingName))=\"Y\"","=INDEX(dms_CF_8.1_A, MATCH(dms_TradingName,dms_CF_TradingName))=\"Y\"","=INDEX(dms_CF_8.1_B, MATCH(dms_TradingName,dms_CF_TradingName))=\"Y\"",{"$f":"INDEX(dms_CF_8.1_Neg, MATCH(dms_TradingName,dms_CF_TradingName))=\"Y\"","v":{"$error":"#N/A"}},"=INDEX(dms_CF_4.4.1_Neg, MATCH(dms_TradingName,dms_CF_TradingName))=\"Y\"",null,null,"=INDEX(dms_CF_F10, MATCH(dms_TradingName,dms_CF_TradingName))=\"Y\""]
[null,"dms_CF_TradingName","JurisdictionList","Sector","Segment","dms_CF_3.6.1","dms_CF_3.6.5","dms_CF_3.6.6.1","dms_CF_3.6.6.2","dms_CF_3.6.6.3","dms_CF_3.6.7.1","dms_CF_3.6.7.2","dms_CF_3.6.7.3","dms_CF_3.6.7.4","dms_CF_3.6.8","dms_CF_4.1","dms_CF_6.8 (set from dms_MAIFI_flag)","dms_CF_7.12","dms_CF_8.1_A  (and 8.4)","dms_CF_8.1_B  (and 8.4)","dms_CF_8.1_Neg  (and 8.4)","dms_CF_4.4.1","dms_CF_MAIFI_flag (set from dms_MAIFI_flag)","9.5 TUOS (set from Jurisdiction)","dms_CF_F10"]
[null,"Amadeus","NT","Gas","Transmission","-","-","-","-","-","-","-","-","-","-","-","-","-","-","-","-","-","-","-","-"]
[null,"APA GasNet","Vic","Gas","Transmission","-","-","-","-","-","-","-","-","-","-","-","-","-","-","-","-","-","-","-","-"]
{"$rows_left_out":69}
{"sheet":"AER NRs","index":1,"n_rows":232,"n_cols":16,"rows_kept":232,"cut":false,"hidden":true,"merged":[[195,1,196,1],[199,1,200,1],[208,1,213,1],[135,1,150,1],[152,1,158,1],[160,1,174,1],[176,1,177,1],[179,1,184,1],[191,1,192,1],[65,1,78,1],[84,1,97,1],[100,1,107,1],[110,1,115,1],[118,1,132,1],[4,1,28,1],[32,1,55,1],[33,10,35,10],[33,36,33,57],[33,67,33,88],[34,36,34,57],[34,67,34,88],[35,36,35,57],[35,67,35,88],[36,10,40,10],[44,10,45,10]]}
[null,"AER NAMED RANGES"]
[]
[null,"DROP DOWN SELECTORS USED IN WORKBOOKS"]
[]
[null,"COVER SHEET","dms_DataQuality_List","dms_Confid_status_List"]
[null,null,"-- select --","-- select --"]
[null,null,"Actual","Public"]
[null,null,"Estimate","Confidential"]
{"$rows_left_out":225}
{"sheet":"AER lookups","index":2,"n_rows":101,"n_cols":37,"rows_kept":101,"cut":false,"hidden":true,"merged":[[33,1,33,4],[10,25,10,35],[11,25,11,28],[11,30,11,34],[11,35,13,35]]}
[null,"AER LOOKUP TABLES"]
[]
[null,"Data in these columns used for data validation and database purposes."]
[null,"Date last modified:","2017-01-16","added (Albury and Victora) for AGN"]
[null,null,"2016-10-17","updated TransGrid's correct legal name, corrected TasNetworks (T) to June financial year"]
[null,null,"2017-02-01","inserted Power and Water, added NRs (dms_FeederCat_1 and dms_FeederCat_2)"]
[null,null,"2017-03-03","inserted AEMO as a business"]
[null,null,"2018-03-28","major changes to accommodate STPIS"]
{"$rows_left_out":94}
{"sheet":"AER ETL","index":3,"n_rows":145,"n_cols":8,"rows_kept":145,"cut":false,"hidden":true,"merged":[[34,0,59,0],[34,37,34,58],[34,68,34,89],[32,37,32,58],[71,1,73,1],[32,68,32,89],[33,37,33,58],[33,68,33,89],[11,0,15,0],[12,4,12,8],[14,2,14,4],[18,0,25,0],[26,0,31,0]]}
[null,"AER ETL INFORMATION"]
[]
[null,"USES NAMED RANGES FLAG","yes","dms_Defined_Names_Used"]
[]
[null,"IF THIS IS AN ABC RIN - make sure the the named range CRY is applied and the named range dms_dollar_nom_UOM is applied"]
[null,"IF THIS IS A RESET RIN - make sure the named ranges CRY and dms_dollar_nom_UOM are NOT present in the workbook"]
[null,"FOR ABC RINS THAT SPAN MULTIPLE YEARS - make sure MultiYear Flag is set and final year entered as required"]
[]
{"$rows_left_out":138}
{"sheet":"Instructions","index":4,"n_rows":27,"n_cols":4,"rows_kept":27,"cut":false,"hidden":false,"merged":[[18,1,24,1],[18,2,18,4],[26,2,26,4],[10,2,10,4],[12,1,14,1],[12,2,12,4],[13,2,13,3],[14,2,14,4],[16,2,16,4],[7,1,8,1],[7,2,7,3],[8,2,8,4],[1,1,1,4],[2,1,2,4],[3,1,3,4],[4,1,4,4],[5,2,5,4]]}
[]
[null,{"$f":"CONCATENATE(dms_Sector,\" \",dms_Segment,\" \", \"Pipeline Service Provider\")","v":"Gas Distribution Pipeline Service Provider"}]
[null,{"$f":"IF(dms_Model=\"Reset\",\"Regulatory Proposal RIN Template\",\"Annual Reporting RIN\")","v":"Regulatory Proposal RIN Template"}]
[]
[null,"INSTRUCTIONS"]
[null,"GENERAL","Complete the Business & other details worksheet before entering data or values in any other worksheets. The Business & other details worksheet is linked to other worksheets within the workbook and automatically generates certain column headings and conditional formatting."]
[]
[null,"CONFIDENTIAL INFORMATION","\nPlease use the macro at the top of each \nworksheet to identify confidential information\nin the confidential workbook. \n\n"]
{"$rows_left_out":20}
{"sheet":"CONTENTS","index":5,"n_rows":37,"n_cols":4,"rows_kept":37,"cut":false,"hidden":false,"merged":[]}
[null,{"$f":"INDEX(dms_Worksheet_List,MATCH(dms_Model,dms_Model_List))","v":"REGULATORY REPORTING STATEMENT"}]
[null,{"$f":"dms_TradingName","v":"AGN (Albury and Victoria)"}]
[null,{"$f":"dms_Header_Span","v":"2021-22 to 2027-28"}]
[]
[]
[]
[null,null,"CONTENTS"]
[]
{"$rows_left_out":30}
{"sheet":"Business & other details","index":6,"n_rows":76,"n_cols":79,"rows_kept":76,"cut":false,"hidden":false,"merged":[[63,25,63,34],[63,37,63,52],[71,25,73,34],[71,37,73,81],[75,25,75,34],[75,37,75,52],[65,25,65,34],[65,37,65,52],[67,25,67,34],[67,37,67,52],[69,25,69,34],[69,37,69,52],[53,37,53,44],[53,46,53,53],[53,55,53,62],[53,64,53,71],[53,73,53,80],[55,25,55,34],[55,37,55,44],[57,25,57,34],[57,37,57,44],[51,25,51,34],[51,37,51,44],[51,46,51,53],[51,55,51,62],[51,64,51,71],[51,73,51,80],[52,37,52,44],[52,46,52,53],[52,55,52,62],[52,64,52,71],[52,73,52,80],[48,37,48,44],[48,46,48,53],[48,55,48,62],[48,64,48,71],[48,73,48,80],[49,37,49,44],[49,46,49,53],[49,55,49,62],[49,64,49,71],[49,73,49,80],[43,37,43,44],[43,46,43,53],[43,55,43,62],[43,64,43,71],[43,73,43,80],[47,25,47,34],[47,37,47,44],[47,46,47,53],[47,55,47,62],[47,64,47,71],[47,73,47,80],[45,25,45,34],[41,25,41,34],[41,37,41,44],[41,46,41,53],[41,55,41,62],[41,64,41,71],[41,73,41,80],[42,37,42,44],[42,46,42,53],[42,55,42,62],[42,64,42,71],[42,73,42,80],[31,21,31,35],[31,37,31,58],[31,60,31,66],[31,68,31,89],[32,21,32,35],[32,37,32,58],[32,60,32,66],[32,68,32,89],[33,21,33,35],[33,37,33,58],[33,60,33,66],[33,68,33,89],[23,21,23,35],[23,37,23,58],[23,60,23,66],[23,68,23,89],[24,21,24,35],[24,37,24,51],[24,60,24,66],[24,68,24,82],[25,21,25,35],[25,37,25,40],[25,49,25,51],[25,60,25,66],[25,68,25,71],[25,80,25,82],[0,7,2,15],[3,21,3,57],[6,21,6,75],[8,16,8,93],[15,21,15,35],[15,37,15,58],[16,21,16,35],[16,37,16,48],[22,21,22,35],[22,37,22,58],[22,60,22,66],[22,68,22,89]]}
[null,null,null,null,null,null,null,null,null,null,null,null,null,null,null,null,null,null,null,null,null,{"$f":"INDEX(dms_Worksheet_List,MATCH(dms_Model,dms_Model_List))","v":"REGULATORY REPORTING STATEMENT"}]
[null,null,null,null,null,null,null,null,null,null,null,null,null,null,null,null,null,null,null,null,null,{"$f":"dms_TradingName","v":"AGN (Albury and Victoria)"}]
[null,null,null,null,null,null,null,null,null,null,null,null,null,null,null,null,null,null,null,null,null,{"$f":"dms_Header_Span","v":"2021-22 to 2027-28"}]
[null,null,null,null,null,null,null,null,null,null,null,null,null,null,null,null,null,null,null,null,null,"BUSINESS & OTHER DETAILS"]
[]
[null,null,null,null,null,null,null,null,null,null,null,null,null,null,null,null,null,null,null,null,null,"INSTRUCTIONS"]
[null,null,null,null,null,null,null,null,null,null,null,null,null,null,null,null,null,null,null,null,null,"Complete the following business details regulatory template before entering data or values in any other regulatory template. This regulatory template is linked to other cells within the spreadsheet and automatically generates column headings and conditional formatting to distinguish business specific input and non-input cells. "]
[]
{"$rows_left_out":69}
{"sheet":"E1. Expenditure Summary","index":7,"n_rows":189,"n_cols":9,"rows_kept":189,"cut":false,"hidden":false,"merged":[]}
[null,{"$f":"INDEX(dms_Worksheet_List,MATCH(dms_Model,dms_Model_List))","v":"REGULATORY REPORTING STATEMENT"}]
[null,{"$f":"dms_TradingName","v":"AGN (Albury and Victoria)"}]
[null,{"$f":"dms_Header_Span","v":"2021-22 to 2027-28"}]
[null,"E1. EXPENDITURE SUMMARY"]
[]
[]
[null,"E1.1 - CAPEX"]
[null,"E1.1.1 - REFERENCE SERVICES"]
{"$rows_left_out":182}
{"sheet":"E2. Mains Repex","index":8,"n_rows":796,"n_cols":10,"rows_kept":796,"cut":false,"hidden":false,"merged":[[769,3,769,9],[770,3,770,9]]}
[null,{"$f":"INDEX(dms_Worksheet_List,MATCH(dms_Model,dms_Model_List))","v":"REGULATORY REPORTING STATEMENT"}]
[null,{"$f":"dms_TradingName","v":"AGN (Albury and Victoria)"}]
[null,{"$f":"dms_Header_Span","v":"2021-22 to 2027-28"}]
[null,"E2. MAINS REPLACEMENT"]
[]
[]
[]
[null,"Please list all projects here:"]
{"$rows_left_out":789}
{"sheet":"E3. Mains Augex","index":9,"n_rows":758,"n_cols":9,"rows_kept":758,"cut":false,"hidden":false,"merged":[]}
[null,{"$f":"INDEX(dms_Worksheet_List,MATCH(dms_Model,dms_Model_List))","v":"REGULATORY REPORTING STATEMENT"}]
[null,{"$f":"dms_TradingName","v":"AGN (Albury and Victoria)"}]
[null,{"$f":"dms_Header_Span","v":"2021-22 to 2027-28"}]
[null,"E3. MAINS AUGMENTATION"]
[]
[]
[null,"Please list all projects here:"]
[null,"3093 - MAJOR PROJECTS - DANDENONG TO CRIB POINT DUPLICATION (Asset Class - Mains and Services)"]
{"$rows_left_out":751}
{"sheet":"E4. Meter replacement","index":10,"n_rows":217,"n_cols":9,"rows_kept":217,"cut":false,"hidden":false,"merged":[]}
[null,{"$f":"INDEX(dms_Worksheet_List,MATCH(dms_Model,dms_Model_List))","v":"REGULATORY REPORTING STATEMENT"}]
[null,{"$f":"dms_TradingName","v":"AGN (Albury and Victoria)"}]
[null,{"$f":"dms_Header_Span","v":"2021-22 to 2027-28"}]
[null,"E4. METER REPLACEMENT"]
[]
[null,"E4.1 - CAPEX"]
[null,"E4.1.1 - NEW METERS ACQUIRED"]
[null,null,"EXPENDITURE"]
{"$rows_left_out":210}
{"sheet":"E5. New Connections","index":11,"n_rows":284,"n_cols":10,"rows_kept":284,"cut":false,"hidden":false,"merged":[]}
[null,{"$f":"INDEX(dms_Worksheet_List,MATCH(dms_Model,dms_Model_List))","v":"REGULATORY REPORTING STATEMENT"}]
[null,{"$f":"dms_TradingName","v":"AGN (Albury and Victoria)"}]
[null,{"$f":"dms_Header_Span","v":"2021-22 to 2027-28"}]
[null,"E5. NEW CONNECTIONS"]
[]
[null,"E5.1 - EXPENDITURE"]
[null,"E5.1.1 - CAPEX - BY CONNECTION TYPE"]
[null,"A. DIRECT INTERNAL LABOUR EXPENDITURE"]
{"$rows_left_out":277}
{"sheet":"E6. Non-network","index":12,"n_rows":142,"n_cols":9,"rows_kept":142,"cut":false,"hidden":false,"merged":[]}
[null,{"$f":"INDEX(dms_Worksheet_List,MATCH(dms_Model,dms_Model_List))","v":"REGULATORY REPORTING STATEMENT"}]
[null,{"$f":"dms_TradingName","v":"AGN (Albury and Victoria)"}]
[null,{"$f":"dms_Header_Span","v":"2021-22 to 2027-28"}]
[null,"E6. NON-NETWORK EXPENDITURE"]
[]
[null,"E6.5 - TELEMETRY"]
[]
[null,"Please list all projects here:"]
{"$rows_left_out":135}
{"sheet":"E10. Overheads","index":13,"n_rows":32,"n_cols":9,"rows_kept":32,"cut":false,"hidden":false,"merged":[]}
[null,{"$f":"INDEX(dms_Worksheet_List,MATCH(dms_Model,dms_Model_List))","v":"REGULATORY REPORTING STATEMENT"}]
[null,{"$f":"dms_TradingName","v":"AGN (Albury and Victoria)"}]
[null,{"$f":"dms_Header_Span","v":"2021-22 to 2027-28"}]
[null,"E10. OVERHEADS EXPENDITURE"]
[]
[null,"E10.1 - NETWORK"]
[null,null,"EXPENDITURE"]
[null,null,{"$f":"CONCATENATE(\"$0's, real \",dms_DollarReal)","v":"$0's, real June 2023"}]
{"$rows_left_out":25}
{"sheet":"E12. ICT","index":14,"n_rows":139,"n_cols":9,"rows_kept":139,"cut":false,"hidden":false,"merged":[]}
[null,{"$f":"INDEX(dms_Worksheet_List,MATCH(dms_Model,dms_Model_List))","v":"REGULATORY REPORTING STATEMENT"}]
[null,{"$f":"dms_TradingName","v":"AGN (Albury and Victoria)"}]
[null,{"$f":"dms_Header_Span","v":"2021-22 to 2027-28"}]
[null,"E12. INFORMATION AND COMMUNICATION TECHNOLOGY"]
[]
[null,"Please list all projects here:"]
[null,"3237 MAJOR PROJECTS - BUSINESS INTELLIGENCE (Asset Class - Computer Equipment)"]
[null,"3244 MAJOR PROJECTS - MAXIMO FUNCTIONAL ENHANCE (EAM) (Asset Class - Computer Equipment)"]
{"$rows_left_out":132}
{"sheet":"E13. Other capex","index":15,"n_rows":291,"n_cols":9,"rows_kept":291,"cut":false,"hidden":false,"merged":[]}
[null,{"$f":"INDEX(dms_Worksheet_List,MATCH(dms_Model,dms_Model_List))","v":"REGULATORY REPORTING STATEMENT"}]
[null,{"$f":"dms_TradingName","v":"AGN (Albury and Victoria)"}]
[null,{"$f":"dms_Header_Span","v":"2021-22 to 2027-28"}]
[null,"E13. OTHER CAPITAL EXPENDITURE"]
[]
[null,"Please list all projects here:"]
[null,"2139 - NETWORK - REGULATOR STAY IN BUSINESS (Asset Class - Other Assets)"]
[null,"2190 - OTHER - NON RETIC CAPITAL (Asset Class - Other Assets)"]
{"$rows_left_out":284}
{"sheet":"E17. Step changes","index":16,"n_rows":70,"n_cols":10,"rows_kept":70,"cut":false,"hidden":false,"merged":[[69,1,69,2],[36,1,36,2],[20,1,20,2]]}
[null,{"$f":"INDEX(dms_Worksheet_List,MATCH(dms_Model,dms_Model_List))","v":"REGULATORY REPORTING STATEMENT"}]
[null,{"$f":"dms_TradingName","v":"AGN (Albury and Victoria)"}]
[null,{"$f":"dms_Header_Span","v":"2021-22 to 2027-28"}]
[null,"E17. STEP CHANGES"]
[]
[null,"E17.1 - STEP CHANGES FOR REFERENCE SERVICES"]
[null,"E17.1.1 - FORECAST OPEX"]
[null,null,null,"EXPENDITURE"]
{"$rows_left_out":63}
{"sheet":"E20. Opex","index":17,"n_rows":131,"n_cols":12,"rows_kept":131,"cut":false,"hidden":false,"merged":[[6,1,6,3],[7,1,7,2],[7,3,8,3],[8,1,8,2],[9,1,9,2]]}
[null,{"$f":"INDEX(dms_Worksheet_List,MATCH(dms_Model,dms_Model_List))","v":"REGULATORY REPORTING STATEMENT"}]
[null,{"$f":"dms_TradingName","v":"AGN (Albury and Victoria)"}]
[null,{"$f":"dms_Header_Span","v":"2021-22 to 2027-28"}]
[null,"E20. OPERATING EXPENDITURE"]
[]
[]
[null,"IMPORTANT!"]
[null,{"$f":"CONCATENATE(\"Has \",dms_TradingName,\" used a base-step-trend model to derive its opex forecast? \")","v":"Has AGN (Albury and Victoria) used a base-step-trend model to derive its opex forecast? "},null,"Yes"]
{"$rows_left_out":124}
{"sheet":"E21. ARS","index":18,"n_rows":32,"n_cols":9,"rows_kept":32,"cut":false,"hidden":false,"merged":[]}
[null,{"$f":"INDEX(dms_Worksheet_List,MATCH(dms_Model,dms_Model_List))","v":"REGULATORY REPORTING STATEMENT"}]
[null,{"$f":"dms_TradingName","v":"AGN (Albury and Victoria)"}]
[null,{"$f":"dms_Header_Span","v":"2021-22 to 2027-28"}]
[null,"E21. ANCILLARY REFERENCE SERVICES"]
[]
[null,"E21.1 - VOLUMES"]
[null,null,"VOLUME"]
[null,null,"0's"]
{"$rows_left_out":25}
{"sheet":"E25. Escalators","index":19,"n_rows":19,"n_cols":9,"rows_kept":19,"cut":false,"hidden":false,"merged":[[6,1,7,1]]}
[null,{"$f":"INDEX(dms_Worksheet_List,MATCH(dms_Model,dms_Model_List))","v":"REGULATORY REPORTING STATEMENT"}]
[null,{"$f":"dms_TradingName","v":"AGN (Albury and Victoria)"}]
[null,{"$f":"dms_Header_Span","v":"2021-22 to 2027-28"}]
[null,"E25. ESCALATORS"]
[]
[null,"E25.1 - FORECAST CAPEX AND OPEX PRICE CHANGES"]
[null,null,"Price changes (% YoY real)"]
[null,null,{"$f":"VLOOKUP(CRCP_y4,'AER lookups'!$B$52:$C$101,2,0)","v":2022},{"$f":"CONCATENATE(\"1 Jan-30 Jun \"&(C8+1))","v":"1 Jan-30 Jun 2023"},{"$f":"FRCP_y1","v":"2023-24"},{"$f":"FRCP_y2","v":"2024-25"},{"$f":"FRCP_y3","v":"2025-26"},{"$f":"FRCP_y4","v":"2026-27"},{"$f":"FRCP_y5","v":"2027-28"}]
{"$rows_left_out":12}
{"sheet":"N1. Demand","index":20,"n_rows":96,"n_cols":9,"rows_kept":96,"cut":false,"hidden":false,"merged":[]}
[null,{"$f":"INDEX(dms_Worksheet_List,MATCH(dms_Model,dms_Model_List))","v":"REGULATORY REPORTING STATEMENT"}]
[null,{"$f":"dms_TradingName","v":"AGN (Albury and Victoria)"}]
[null,{"$f":"dms_Header_Span","v":"2021-22 to 2027-28"}]
[null,"N1. DEMAND"]
[]
[null,"N1.1 - DEMAND - BY CUSTOMER TYPE"]
[null,null,"VOLUME"]
[null,null,"GJ"]
{"$rows_left_out":89}
{"sheet":"N2. Network characteristics","index":21,"n_rows":63,"n_cols":10,"rows_kept":63,"cut":false,"hidden":false,"merged":[]}
[null,{"$f":"INDEX(dms_Worksheet_List,MATCH(dms_Model,dms_Model_List))","v":"REGULATORY REPORTING STATEMENT"}]
[null,{"$f":"dms_TradingName","v":"AGN (Albury and Victoria)"}]
[null,{"$f":"dms_Header_Span","v":"2021-22 to 2027-28"}]
[null,"N2. NETWORK CHARACTERISTICS"]
[]
[null,"N2.1 - NETWORK LENGTH - BY PRESSURE AND ASSET TYPE"]
[null,null,null,"LENGTH"]
[null,null,null,"KM"]
{"$rows_left_out":56}
{"sheet":"S1.1 Customer numbers","index":22,"n_rows":34,"n_cols":9,"rows_kept":34,"cut":false,"hidden":false,"merged":[]}
[null,{"$f":"INDEX(dms_Worksheet_List,MATCH(dms_Model,dms_Model_List))","v":"REGULATORY REPORTING STATEMENT"}]
[null,{"$f":"dms_TradingName","v":"AGN (Albury and Victoria)"}]
[null,{"$f":"dms_Header_Span","v":"2021-22 to 2027-28"}]
[null,"S1. CUSTOMER NUMBERS"]
[]
[null,"S1.1 - CUSTOMER NUMBERS - BY CUSTOMER TYPE "]
[null,"A. RESIDENTIAL"]
[null,null,"VOLUMES"]
{"$rows_left_out":27}
{"sheet":"S1.2 Customer numbers","index":23,"n_rows":329,"n_cols":9,"rows_kept":329,"cut":false,"hidden":false,"merged":[]}
[null,{"$f":"INDEX(dms_Worksheet_List,MATCH(dms_Model,dms_Model_List))","v":"REGULATORY REPORTING STATEMENT"}]
[null,{"$f":"dms_TradingName","v":"AGN (Albury and Victoria)"}]
[null,{"$f":"dms_Header_Span","v":"2021-22 to 2027-28"}]
[null,"S1. CUSTOMER NUMBERS"]
[]
[null,"S1.2 - CUSTOMER NUMBERS - BY TARIFF"]
[null,"S1.2.1 - CUSTOMER NUMBERS - BEGINNING OF YEAR"]
[null,null,"VOLUMES"]
{"$rows_left_out":322}
{"sheet":"S10. Supply Quality","index":24,"n_rows":14,"n_cols":9,"rows_kept":14,"cut":false,"hidden":false,"merged":[]}
[null,{"$f":"INDEX(dms_Worksheet_List,MATCH(dms_Model,dms_Model_List))","v":"REGULATORY REPORTING STATEMENT"}]
[null,{"$f":"dms_TradingName","v":"AGN (Albury and Victoria)"}]
[null,{"$f":"dms_Header_Span","v":"2021-22 to 2027-28"}]
[null,"S10. SUPPLY QUALITY"]
[]
[null,"S10.1 - PRESSURE FAULTS"]
[null,null,"VOLUMES"]
[null,null,"0's"]
{"$rows_left_out":7}
{"sheet":"S11. Network reliability","index":25,"n_rows":39,"n_cols":9,"rows_kept":39,"cut":false,"hidden":false,"merged":[]}
[null,{"$f":"INDEX(dms_Worksheet_List,MATCH(dms_Model,dms_Model_List))","v":"REGULATORY REPORTING STATEMENT"}]
[null,{"$f":"dms_TradingName","v":"AGN (Albury and Victoria)"}]
[null,{"$f":"dms_Header_Span","v":"2021-22 to 2027-28"}]
[null,"S11. NETWORK RELIABILITY"]
[]
[null,"S11.1 - NETWORK OUTAGES"]
[null,"S11.1.1 - PLANNED"]
[null,null,"VOLUMES"]
{"$rows_left_out":32}
{"sheet":"F3. Revenue","index":26,"n_rows":185,"n_cols":9,"rows_kept":185,"cut":false,"hidden":false,"merged":[]}
[null,{"$f":"INDEX(dms_Worksheet_List,MATCH(dms_Model,dms_Model_List))","v":"REGULATORY REPORTING STATEMENT"}]
[null,{"$f":"dms_TradingName","v":"AGN (Albury and Victoria)"}]
[null,{"$f":"dms_Header_Span","v":"2021-22 to 2027-28"}]
[null,"F3. REVENUE"]
[]
[null,"F3.1 - REFERENCE SERVICES"]
[null,"F3.1.1 -  REVENUE - BY TARIFF"]
[null,null,"REVENUE"]
{"$rows_left_out":178}
{"sheet":"Additional disclosures","index":27,"n_rows":39,"n_cols":6,"rows_kept":39,"cut":false,"hidden":false,"merged":[]}
["E13. OTHER CAPITAL EXPENDITURE"]
["E13.1 - CAPEX - BY PROJECT"]
["B. DIRECT CONTRACTOR EXPENDITURE",{"$f":"FRCP_y1","v":"2023-24"},{"$f":"FRCP_y2","v":"2024-25"},{"$f":"FRCP_y3","v":"2025-26"},{"$f":"FRCP_y4","v":"2026-27"},{"$f":"FRCP_y5","v":"2027-28"}]
["Cathodic Protection"]
["Mains & Services Integrity Management"]
["New Growth Areas"]
["Contributed projects"]
["Network Reinforcement"]
{"$rows_left_out":31}