{"text_format":"1","workbook":"xlsx","n_sheets":6,"sheets":["NOTES","Model update","Prop2022DistTar","2022TarContForm","2022RebalContForm","ARS"],"not_rendered":{"charts":0,"images":0,"macros":1,"external_links":2,"defined_names":22,"comments":1,"pivot_tables":0},"unopened":[],"bounds":{"document_bytes":16777216,"sheet_cells":100000,"rows_first":2000,"rows_last":500,"rows_between":2000,"halvings":0,"cell_chars":16384,"cell_head_chars":4096},"cells_cut":0,"cells_raw":0,"read":"whole","date_system":"1900"}

{"sheet":"NOTES","index":0,"n_rows":22,"n_cols":5,"rows_kept":22,"cut":false,"hidden":false,"merged":[]}
[]
["The model has actual and test data to illustrate the workings of the model.",null,null,{"$f":"'Model update'!B5","v":2022}]
[]
["Issue","Location","Item","Comment"]
[]
[1,"'Model update'!B21","CPI",{"$f":"\"Updated June \"&D2-1&\" CPI for \"&D2","v":"Updated June 2021 CPI for 2022"},"NOTE: This worksheet is programmed to update for each year - use as checklist and note any placeholders or changes"]
[null,null,null,null,"NOTE: Worksheet names in this file are programmed to update each year once each worksheet is accessed and a cell is selected"]
[{"$f":"A6+1","v":2},"'Model update'!B36",{"$f":"\"Xt for \"&D2","v":"Xt for 2022"},{"$f":"\"Updated \"&$D$2&\" value\"","v":"Updated 2022 value"}]
[]
[{"$f":"A8+1","v":3},"'Model update'!B46",{"$f":"\"Pass Through Amount for \"&D2","v":"Pass Through Amount for 2022"},"NIL for 2022"]
[]
[{"$f":"A10+1","v":4},"'Model update'!B58","Real Pre-tax WACC (rptw)",{"$f":"\"Updated \"&$D$2&\" value\"","v":"Updated 2022 value"}]
[]
[{"$f":"A12+1","v":5},{"$f":"\"Prop\"&D2&\"DistTar!E8:E96\"","v":"Prop2022DistTar!E8:E96"},{"$f":"D2-1&\" tariffs\"","v":"2021 tariffs"},{"$f":"\"Updated from \"&D2-1&\" model\"","v":"Updated from 2021 model"}]
[]
[{"$f":"A14+1","v":6},"ARS!B6:B12",{"$f":"D2-1&\" ARS tariffs\"","v":"2021 ARS tariffs"},{"$f":"\"Updated from \"&D2-1&\" model\"","v":"Updated from 2021 model"}]
[]
[{"$f":"A16+1","v":7},"The following is test data to illustrate the workings of the model.",null,"Input data required from DNSPs"]
[null,{"$f":"\"Prop\"&D2&\"DistTar!D8:D96\"","v":"Prop2022DistTar!D8:D96"},{"$f":"\"Proposed \"&D2&\" Tariffs\"","v":"Proposed 2022 Tariffs"}]
[null,{"$f":"\"Prop\"&D2&\"DistTar!F8:F96\"","v":"Prop2022DistTar!F8:F96"},{"$f":"\"Actual \"&D2-2&\" Volumes\"","v":"Actual 2020 Volumes"}]
[]
[null,"ARS!C6:C12",{"$f":"\"Proposed \"&D2&\" Ancillary Reference Services Charges\"","v":"Proposed 2022 Ancillary Reference Services Charges"},"Calculated using formula"]

{"sheet":"Model update","index":1,"n_rows":58,"n_cols":2,"rows_kept":58,"cut":false,"hidden":false,"merged":[[54,0,55,1]]}
[]
[]
["Tariff Approval Template for ","Aust. Gas Networks (Vic & Albury)"]
[]
["Calendar year commencing",2022]
[]
["t",{"$f":"B5","v":2022}]
["t-1",{"$f":"B7-1","v":2021}]
["t-2",2020]
["t-3",2019]
[]
[]
["Please fill in yellow highlighted cells where appropriate"]
[]
["CPI"]
[]
["CPI Index June 2016",108.6]
["CPI Index June 2017",110.7]
["CPI Index June 2018",113]
["CPI Index June 2019",114.8]
["CPI Index June 2020",114.4]
["CPI Index June 2021",118.8]
[]
[]
[{"$f":"\"CPI Index June \" &$B$10","v":"CPI Index June 2019"},{"$f":"VLOOKUP(A25,A$17:B$22,2,FALSE)","v":114.8}]
[{"$f":"\"CPI Index June \" &$B$9","v":"CPI Index June 2020"},{"$f":"VLOOKUP(A26,A$17:B$22,2,FALSE)","v":114.4}]
[{"$f":"\"CPI Index June \" &$B$8","v":"CPI Index June 2021"},{"$f":"VLOOKUP(A27,A$17:B$22,2,FALSE)","v":118.8}]
[]
[{"$f":"\"CPI \" &$B$8","v":"CPI 2021"},{"$f":"B26/B25-1","v":-3.4843205574912606E-3}]
[{"$f":"\"CPI \" &$B$5","v":"CPI 2022"},{"$f":"B27/B26-1","v":3.8461538461538325E-2}]
[]
[]
[{"$f":"\"Xt for \"&B$5","v":"Xt for 2022"}]
[2019,-1.2932003198752063E-2]
[2020,-5.9643805428307873E-3]
[2021,-2.9121585433830224E-3]
[2022,{"$f":"'[1]Model update'!$B$37","v":-5.6359370969629296E-3}]
[]
[]
[{"$f":"\"Xt for \"&B$5","v":"Xt for 2022"},{"$f":"VLOOKUP(B5,A34:B38,2,FALSE)","v":-5.6359370969629296E-3}]
[]
[]
["Pass Through Amounts :  PT (t)"]
[2019,0]
[2020,0]
[2021,0]
[2022,0]
[]
[]
[{"$f":"\"Pass Through Amount for \"&B$5","v":"Pass Through Amount for 2022"},{"$f":"VLOOKUP(B5,A44:B48,2,FALSE)","v":0}]
["The Pass Through Amount is to include an amount that reflects the time value of money between incurring the costs and recovering the costs"]
["and excludes any amounts already passed through in reference tariffs."]
[]
[]
["Pre-tax WACC for distribution tariffs "]
[]
[]
[" Pretax WACCD",3.605542631615144E-2]

{"sheet":"Prop2022DistTar","index":2,"n_rows":101,"n_cols":8,"rows_kept":101,"cut":false,"hidden":false,"merged":[]}
[null,{"$f":"\"Tariff Approval - \"&'Model update'!B3","v":"Tariff Approval - Aust. Gas Networks (Vic & Albury)"},null,{"$f":"\"Prop\"&'Model update'!B5&\"DistTar\"","v":"Prop2022DistTar"}]
[]
[null,{"$f":"\"PROPOSED \"&'Model update'!$B$5&\" DISTRIBUTION TARIFFS\"","v":"PROPOSED 2022 DISTRIBUTION TARIFFS"}]
[]
[null,"Proposed tariff name","Existing tariff name",{"$f":"\"Prop\n\"&'Model update'!$B$5&\" Tariff\"","v":"Prop\n2022 Tariff"},{"$f":"\"Exist\n\"&'Model update'!$B$8&\" Tariff\"","v":"Exist\n2021 Tariff"},{"$f":"\"Actual \"&'Model update'!$B$9&\" Volumes\"","v":"Actual 2020 Volumes"},"Prop Tar\nRevenue","Exist Tar\nRevenue"]
[null,"Tariff V - AGN Central - Residential","Tariff V - AGN Central - Residential"]
[]
[null,"Fixed Charge","Fixed Charge",{"$f":"ROUND([2]Prop2022DistTar!D8,4)","v":0.193},0.193,210211700,{"$f":"D8*$F8","v":40570858.100000001},{"$f":"E8*$F8","v":40570858.100000001}]
[null,"GJ 0 - 0.0274","GJ 0 - 0.0274",{"$f":"ROUND([2]Prop2022DistTar!D9,4)","v":13.2331},11.8856,5089650.0896270648,{"$f":"D9*$F9","v":67351848.60104391},60493545.105271444]
[null,"GJ 0.0274 - 0.0493","GJ 0.0274 - 0.0493",{"$f":"ROUND([2]Prop2022DistTar!D10,4)","v":7.6085000000000003},6.8338000000000001,3282266.5365116103,24973124.943048589,22430353.057213042]
[null,"GJ > 0.0493","GJ > 0.0493",{"$f":"ROUND([2]Prop2022DistTar!D11,4)","v":3.7513999999999998},3.7513999999999998,20196474.250040032,75765053.501600176,75765053.501600176]
[null,"Tariff V - AGN Central - Non Residential","Tariff V - AGN Central - Non Residential"]
[]
[null,"Fixed Charge","Fixed Charge",{"$f":"ROUND([2]Prop2022DistTar!D14,4)","v":0.193},0.193,7357700,{"$f":"D14*$F14","v":1420036.1},{"$f":"E14*$F14","v":1420036.1}]
[null,"GJ 0 - 0.05","GJ 0 - 0.05",{"$f":"ROUND([2]Prop2022DistTar!D15,4)","v":9.3412000000000006},8.39,260279.12842858184,{"$f":"D15*$F15","v":2431319.3944770689},2183741.8875158019]
[null,"GJ 0.05 - 0.55","GJ 0.05 - 0.55",{"$f":"ROUND([2]Prop2022DistTar!D16,4)","v":3.9599000000000002},3.9599000000000002,1346836.6677376083,5333338.5205741553,5333338.5205741553]
[null,"GJ 0.55 - 1.37","GJ 0.55 - 1.37",{"$f":"ROUND([2]Prop2022DistTar!D17,4)","v":2.9535999999999998},2.9535999999999998,1013097.1393793365,2992283.710870808,2992283.710870808]
[null,"GJ > 1.37","GJ > 1.37",{"$f":"ROUND([2]Prop2022DistTar!D18,4)","v":1.1929000000000001},1.1929000000000001,3454727.2837079535,4121144.1767352181,4121144.1767352181]
[null,"Tariff V - AGN North - Residential","Tariff V - AGN North - Residential"]
[]
[null,"Fixed Charge","Fixed Charge",{"$f":"ROUND([2]Prop2022DistTar!D21,4)","v":0.193},0.193,29660925,{"$f":"D21*$F21","v":5724558.5250000004},{"$f":"E21*$F21","v":5724558.5250000004}]
[null,"GJ 0 - 0.0274","GJ 0 - 0.0274",{"$f":"ROUND([2]Prop2022DistTar!D22,4)","v":11.6431},10.4575,688391.1033751379,{"$f":"D22*$F22","v":8015006.4557070686},7198849.963545504]
[null,"GJ 0.0274 - 0.0493","GJ 0.0274 - 0.0493",{"$f":"ROUND([2]Prop2022DistTar!D23,4)","v":6.8155000000000001},6.1215000000000002,420751.27034647524,2867630.283046402,2575628.9014259484]
[null,"GJ > 0.0493","GJ > 0.0493",{"$f":"ROUND([2]Prop2022DistTar!D24,4)","v":3.3609},3.3609,2776289.6384657924,9330831.8459196817,9330831.8459196817]
[null,"Tariff V - AGN North - Non Residential","Tariff V - AGN North - Non Residential"]
[]
[null,"Fixed Charge","Fixed Charge",{"$f":"ROUND([2]Prop2022DistTar!D27,4)","v":0.193},0.193,1196858,{"$f":"D27*$F27","v":230993.59400000001},{"$f":"E27*$F27","v":230993.59400000001}]
[null,"GJ 0 - 0.05","GJ 0 - 0.05",{"$f":"ROUND([2]Prop2022DistTar!D28,4)","v":8.3790999999999993},7.5259,36017.447575653983,{"$f":"D28*$F28","v":301793.79498116224},271063.70870961429]
[null,"GJ 0.05 - 0.55","GJ 0.05 - 0.55",{"$f":"ROUND([2]Prop2022DistTar!D29,4)","v":3.5788000000000002},3.5788000000000002,173290.66479011832,620172.63115087547,620172.63115087547]
[null,"GJ 0.55 - 1.37","GJ 0.55 - 1.37",{"$f":"ROUND([2]Prop2022DistTar!D30,4)","v":2.6690999999999998},2.6690999999999998,114823.45676968904,306475.28846397699,306475.28846397699]
[null,"GJ > 1.37","GJ > 1.37",{"$f":"ROUND([2]Prop2022DistTar!D31,4)","v":1.0785},1.0785,417484.61388794519,450257.15607814887,450257.15607814887]
[null,"Tariff V - Murray Valley - Residential","Tariff V - Murray Valley - Residential"]
[]
[null,"Fixed Charge","Fixed Charge",{"$f":"ROUND([2]Prop2022DistTar!D34,4)","v":0.2457},0.2457,3082859,{"$f":"D34*$F34","v":757458.45629999996},{"$f":"E34*$F34","v":757458.45629999996}]
[null,"GJ 0 - 0.0274","GJ 0 - 0.0274",{"$f":"ROUND([2]Prop2022DistTar!D35,4)","v":10.136699999999999},9.1044999999999998,61237.19952777763,{"$f":"D35*$F35","v":620743.12045322347},557534.08310065139]
[null,"GJ 0.0274 - 0.0493","GJ 0.0274 - 0.0493",{"$f":"ROUND([2]Prop2022DistTar!D36,4)","v":6.1322999999999999},5.5079000000000002,33277.759149794489,204069.20243428473,183290.56962115306]
[null,"GJ > 0.0493","GJ > 0.0493",{"$f":"ROUND([2]Prop2022DistTar!D37,4)","v":3.4455},3.4455,216314.8497688447,745312.81487855443,745312.81487855443]
[null,"Tariff V - Murray Valley - Non Residential","Tariff V - Murray Valley - Non Residential"]
[]
[null,"Fixed Charge","Fixed Charge",{"$f":"ROUND([2]Prop2022DistTar!D40,4)","v":0.2457},0.2457,133894,{"$f":"D40*$F40","v":32897.755799999999},{"$f":"E40*$F40","v":32897.755799999999}]
[null,"GJ 0 - 0.05","GJ 0 - 0.05",{"$f":"ROUND([2]Prop2022DistTar!D41,4)","v":7.492},6.7290999999999999,4363.7335579930013,{"$f":"D41*$F41","v":32693.091816483568},29363.999485090706]
[null,"GJ 0.05 - 0.55","GJ 0.05 - 0.55",{"$f":"ROUND([2]Prop2022DistTar!D42,4)","v":3.9744000000000002},3.9744000000000002,19533.933169653013,77635.663989468943,77635.663989468943]
[null,"GJ 0.55 - 1.37","GJ 0.55 - 1.37",{"$f":"ROUND([2]Prop2022DistTar!D43,4)","v":2.9661},2.9661,10791.869502720994,32009.76413202074,32009.76413202074]
[null,"GJ > 1.37","GJ > 1.37",{"$f":"ROUND([2]Prop2022DistTar!D44,4)","v":1.3427},1.3427,25569.568025606,34332.258987981179,34332.258987981179]
[null,"Tariff V - Bairnsdale - Residential","Tariff V - Bairnsdale - Residential"]
[]
[null,"Fixed Charge","Fixed Charge",{"$f":"ROUND([2]Prop2022DistTar!D47,4)","v":0.31759999999999999},0.31759999999999999,1725031,{"$f":"D47*$F47","v":547869.8456},{"$f":"E47*$F47","v":547869.8456}]
[null,"GJ 0 - 0.0274","GJ 0 - 0.0274",{"$f":"ROUND([2]Prop2022DistTar!D48,4)","v":21.6053},19.4053,35064.938512722591,{"$f":"D48*$F48","v":757588.51604892535},{"$f":"E48*$F48","v":680445.65132093569}]
[null,"GJ 0.0274 - 0.0493","GJ 0.0274 - 0.0493",{"$f":"ROUND([2]Prop2022DistTar!D49,4)","v":12.5664},11.286799999999999,18002.240041649886,226223.34925938913,203187.68290209392]
[null,"GJ > 0.0493","GJ > 0.0493",{"$f":"ROUND([2]Prop2022DistTar!D50,4)","v":6.2016999999999998},6.2016999999999998,80647.197390457804,500149.72405640216,500149.72405640216]
[null,"Tariff V - Bairnsdale - Non Residential","Tariff V - Bairnsdale - Non Residential"]
[]
[null,"Fixed Charge","Fixed Charge",{"$f":"ROUND([2]Prop2022DistTar!D53,4)","v":0.31759999999999999},0.31759999999999999,44767,{"$f":"D53*$F53","v":14217.9992},{"$f":"E53*$F53","v":14217.9992}]
[null,"GJ 0 - 0.05","GJ 0 - 0.05",{"$f":"ROUND([2]Prop2022DistTar!D54,4)","v":15.3606},13.7965,1750.1146743840004,{"$f":"D54*$F54","v":26882.811467342875},{"$f":"E54*$F54","v":24145.457105138863}]
[null,"GJ 0.05 - 0.55","GJ 0.05 - 0.55",{"$f":"ROUND([2]Prop2022DistTar!D55,4)","v":6.7260999999999997},6.7260999999999997,12304.525360697004,82761.468028584117,82761.468028584117]
[null,"GJ 0.55 - 1.37","GJ 0.55 - 1.37",{"$f":"ROUND([2]Prop2022DistTar!D56,4)","v":5.0148999999999999},5.0148999999999999,9092.5019583729973,45597.98807104474,45597.98807104474]
[null,"GJ > 1.37","GJ > 1.37",{"$f":"ROUND([2]Prop2022DistTar!D57,4)","v":2.0105},2.0256000000000003,41529.113477980005,83494.282647478802,84121.372260996315]
[]
[null,"Tariff D -  AGN Central","Tariff D -  AGN Central"]
[null,"0 - 10","0 - 10",{"$f":"ROUND([2]Prop2022DistTar!D60,4)","v":1524.8607},1460.155,1415.4355000000003,{"$f":"D60*$F60","v":2158341.9673348502},2066755.2225025003]
{"$rows_left_out":42}
{"sheet":"2022TarContForm","index":3,"n_rows":44,"n_cols":6,"rows_kept":44,"cut":false,"hidden":false,"merged":[[43,1,43,3]]}
[null,{"$f":"\"Tariff Approval - \"&'Model update'!B3","v":"Tariff Approval - Aust. Gas Networks (Vic & Albury)"},null,null,null,{"$f":"'Model update'!B5&\"TarContForm\"","v":"2022TarContForm"}]
[]
[null,{"$f":"'Model update'!$B$5&\"  TARIFF CONTROL FORMULA\"","v":"2022  TARIFF CONTROL FORMULA"}]
[]
[]
[null,"CPI"]
[]
[null,{"$f":"\"CPI June\"&'Model update'!$B$9","v":"CPI June2020"},{"$f":"'Model update'!B26","v":114.4}]
[null,{"$f":"\"CPI June\"&'Model update'!$B$8","v":"CPI June2021"},{"$f":"'Model update'!B27","v":118.8}]
[]
[null,{"$f":"\"CPI \"&'Model update'!$B$5","v":"CPI 2022"},{"$f":"(C9/C8-1)","v":3.8461538461538325E-2}]
[]
[]
[]
[null,"X factor"]
[]
[null,{"$f":"\"X \"&'Model update'!$B$5","v":"X 2022"},{"$f":"'Model update'!B40","v":-5.6359370969629296E-3}]
[]
[]
[null,"Pass Through Factor (PT)"]
[]
[null,"pass through"]
[null,{"$f":"\"AP (t) \"&'Model update'!$B$7","v":"AP (t) 2022"},{"$f":"'Model update'!B50","v":0}]
[]
[null,"Revenue"]
[null,"∑∑p(t-1)q(t-2)",{"$f":"C41","v":258644026.02524579}]
[]
[null,"PT' (t-1)",0]
[null,{"$f":"\"PT' \"&'Model update'!$B$5","v":"PT' 2022"},{"$f":"IF(C26=\"\",0,(C23)/((1+C11)*(1-C17)*C26))","v":0}]
[]
[null,{"$f":"\"PTt \"&'Model update'!$B$5","v":"PTt 2022"},{"$f":"((1+C29)/(1+C28))-1","v":0}]
[]
[]
[]
[]
[null,{"$f":"'Model update'!$B$5&\"  Distribution price control\"","v":"2022  Distribution price control"}]
[]
[null,"Average price movement allowed",{"$f":"(1+C11)*(1-C17)*(1+C31)","v":1.044314242369923}]
[]
[null,"Proposed distribution tariff revenue",{"$f":"IF(Prop2022DistTar!G101=0,\"\",Prop2022DistTar!G101)","v":270105638.32141531}]
[null,"Existing distribution tariff revenue",{"$f":"IF(Prop2022DistTar!H101=0,\"\",Prop2022DistTar!H101)","v":258644026.02524579}]
[null,"Average price movement",{"$f":"IF(C40=\"\",\"\",C40/C41)","v":1.0443142355627064}]
[]
[null,{"$f":"IF(C40=\"\",\"\",IF(C38>=C42,\"DISTRIBUTION PRICE CONTROL FORMULA COMPLIANT\",\"DISTRIBUTION PRICE CONTROL FORMULA BREACHED\"))","v":"DISTRIBUTION PRICE CONTROL FORMULA COMPLIANT"}]

{"sheet":"2022RebalContForm","index":4,"n_rows":454,"n_cols":7,"rows_kept":454,"cut":false,"hidden":false,"merged":[[399,1,399,2],[429,1,429,2],[453,1,453,2],[243,1,243,2],[153,1,153,2],[273,1,273,2],[369,1,369,2],[297,1,297,2],[321,1,321,2],[345,1,345,2],[63,1,63,2],[93,1,93,2],[123,1,123,2],[183,1,183,2],[213,1,213,2]]}
[null,{"$f":"\"Tariff Approval - \"&'Model update'!B3","v":"Tariff Approval - Aust. Gas Networks (Vic & Albury)"},{"$f":"'Model update'!B7&\"RebalContForm\"","v":"2022RebalContForm"}]
[]
[null,{"$f":"'Model update'!$B$5&\"  REBALANCING CONTROL FORMULA\"","v":"2022  REBALANCING CONTROL FORMULA"}]
[]
[]
[null,"Rebalancing control"]
[]
[null,{"$f":"\"CPI \"&'Model update'!$B$5","v":"CPI 2022"},{"$f":"'2022TarContForm'!C11","v":3.8461538461538325E-2}]
[null,{"$f":"\"Y  \"&'Model update'!$B$5","v":"Y  2022"},0.02]
[null,{"$f":"\"PTt \"&'Model update'!$B$5","v":"PTt 2022"},{"$f":"'2022TarContForm'!C29","v":0}]
[null,{"$f":"\"Xt \"&'Model update'!$B$5","v":"Xt 2022"},{"$f":"'2022TarContForm'!C17","v":-5.6359370969629296E-3}]
[]
[null,"Rebalancing control",{"$f":"(1+C8)*(1+C9)*(1+C10)*(1-C11)","v":1.0652005272173215}]
[]
[]
[]
[null,"Rebalancing control summary"]
[null,null,"Existing","Proposed","Movement","Assessment"]
[null,{"$f":"B38","v":"Tariff V - AGN Central - Residential"},{"$f":"C59","v":199259809.76408467},{"$f":"C60","v":208660885.14569268},{"$f":"IF(C19=0,0,D19/C19)","v":1.0471799877393162},{"$f":"IF(E19=0,\"\",IF($C$13<=E19,\"Breached\",\"Compliant\"))","v":"Compliant"}]
[null,{"$f":"B68","v":"Tariff V - AGN North - Residential"},{"$f":"C89","v":24829869.235891134},{"$f":"C90","v":25938027.10967315},{"$f":"IF(C20=0,0,D20/C20)","v":1.0446300326133089},{"$f":"IF(E20=0,\"\",IF($C$13<=E20,\"Breached\",\"Compliant\"))","v":"Compliant"}]
[null,{"$f":"B98","v":"Tariff V - Murray Valley - Residential"},{"$f":"C119","v":2243595.9239003588},{"$f":"C120","v":2327583.5940660625},1.0374344012979377,"Compliant"]
[null,{"$f":"B128","v":"Tariff V - Bairnsdale - Residential"},{"$f":"C149","v":1931652.903879432},{"$f":"C150","v":2031831.4349647167},1.0518615590223748,"Compliant"]
[null,{"$f":"B158","v":"Tariff V - AGN Central - Non Residential"},{"$f":"C179","v":16050544.395695984},{"$f":"C180","v":16298121.90265725},1.0154248666498598,"Compliant"]
[null,{"$f":"B188","v":"Tariff V - AGN North - Non Residential"},{"$f":"C209","v":1878962.3784026154},{"$f":"C210","v":1909692.4646741636},1.0163548172250649,{"$f":"IF(E24=0,\"\",IF($C$13<=E24,\"Breached\",\"Compliant\"))","v":"Compliant"}]
[null,{"$f":"B218","v":"Tariff V - Murray Valley - Non Residential"},{"$f":"C239","v":206239.44239456157},{"$f":"C240","v":209568.53472595444},1.0161418800048145,"Compliant"]
[null,{"$f":"B248","v":"Tariff V - Bairnsdale - Non Residential"},{"$f":"C269","v":250844.28466576402},{"$f":"C270","v":252954.54941445054},{"$f":"IF(C26=0,0,D26/C26)","v":1.0084126483148632},{"$f":"IF(E26=0,\"\",IF($C$13<=E26,\"Breached\",\"Compliant\"))","v":"Compliant"}]
[null,{"$f":"B278","v":"Tariff D -  AGN Central"},{"$f":"C293","v":3290883.397293881},{"$f":"C294","v":3436716.4498734609},{"$f":"IF(C27=0,0,D27/C27)","v":1.0443142569862851},{"$f":"IF(E27=0,\"\",IF($C$13<=E27,\"Breached\",\"Compliant\"))","v":"Compliant"}]
[null,{"$f":"B302","v":"Tariff D - AGN North"},{"$f":"C317","v":1269708.7063402298},{"$f":"C318","v":1325974.9005290498},1.0443142540551682,"Compliant"]
[null,{"$f":"B326","v":"Tariff D - Murray Valley"},{"$f":"C341","v":301501.92724756006},{"$f":"C342","v":314862.75740972004},1.0443142446356224,"Compliant"]
[null,{"$f":"B350","v":"Tariff D - Bairnsdale"},{"$f":"C365","v":46828.248768400001},{"$f":"C366","v":48903.406464679996},1.0443142280750914,"Compliant"]
[null,{"$f":"B374","v":"Tariff V - Albury - Residential"},{"$f":"C395","v":6451575.5844198121},{"$f":"C396","v":6706321.0860458333},1.0394857811541753,"Compliant"]
[null,{"$f":"B404","v":"Tariff V - Albury - Non Residential"},{"$f":"C425","v":533108.27968431613},{"$f":"C426","v":540910.68699960446},1.014635689619956,"Compliant"]
[null,{"$f":"B434","v":"Tariff D - Albury"},{"$f":"C449","v":98901.552577139984},{"$f":"C450","v":103284.29822457999},1.0443142249361719,"Compliant"]
[null,null,{"$f":"SUM(C19:C33)","v":258644026.02524585},{"$f":"SUM(D19:D33)","v":270105638.32141536},1.0443142355627064]
[]
[]
[]
[null,{"$f":"Prop2022DistTar!B6","v":"Tariff V - AGN Central - Residential"},1,2,3,4,5]
[null,null,1,2,3,4,5]
[null,"Distribution tariff","Fixed","Blk1","Blk2","Blk3"]
[]
[null,{"$f":"\"Existing : \"&Prop2022DistTar!C6","v":"Existing : Tariff V - AGN Central - Residential"},{"$f":"INDEX(Prop2022DistTar!$E$8:$E$11,C$39)","v":0.193},{"$f":"INDEX(Prop2022DistTar!$E$8:$E$11,D$39)","v":11.8856},{"$f":"INDEX(Prop2022DistTar!$E$8:$E$11,E$39)","v":6.8338000000000001},{"$f":"INDEX(Prop2022DistTar!$E$8:$E$11,F$39)","v":3.7513999999999998}]
[]
[null,{"$f":"\"Proposed : \"&B38","v":"Proposed : Tariff V - AGN Central - Residential"},{"$f":"INDEX(Prop2022DistTar!$D$8:$D$11,C$38)","v":0.193},{"$f":"INDEX(Prop2022DistTar!$D$8:$D$11,D$38)","v":13.2331},{"$f":"INDEX(Prop2022DistTar!$D$8:$D$11,E$38)","v":7.6085000000000003},{"$f":"INDEX(Prop2022DistTar!$D$8:$D$11,F$38)","v":3.7513999999999998}]
[]
[null,"Distribution volumes (actual)",{"$f":"C$40","v":"Fixed"},{"$f":"D$40","v":"Blk1"},"Blk2","Blk3"]
[]
[null,{"$f":"B42","v":"Existing : Tariff V - AGN Central - Residential"},{"$f":"INDEX(Prop2022DistTar!$F$8:$F$11,C$13)","v":210211700},{"$f":"INDEX(Prop2022DistTar!$F$8:$F$11,D$38)","v":5089650.0896270648},{"$f":"INDEX(Prop2022DistTar!$F$8:$F$11,E$38)","v":3282266.5365116103},{"$f":"INDEX(Prop2022DistTar!$F$8:$F$11,F$38)","v":20196474.250040032}]
[]
[null,{"$f":"B44","v":"Proposed : Tariff V - AGN Central - Residential"},{"$f":"INDEX(Prop2022DistTar!$F$8:$F$11,C$38)","v":210211700},{"$f":"INDEX(Prop2022DistTar!$F$8:$F$11,D$38)","v":5089650.0896270648},{"$f":"INDEX(Prop2022DistTar!$F$8:$F$11,E$38)","v":3282266.5365116103},{"$f":"INDEX(Prop2022DistTar!$F$8:$F$11,F$38)","v":20196474.250040032}]
[]
[null,"Distribution revenue",{"$f":"C$40","v":"Fixed"},"Blk1","Blk2","Blk3"]
[]
[null,{"$f":"B48","v":"Existing : Tariff V - AGN Central - Residential"},{"$f":"INDEX(Prop2022DistTar!$H$8:$H$11,C$39)","v":40570858.100000001},{"$f":"INDEX(Prop2022DistTar!$H$8:$H$11,D$39)","v":60493545.105271444},{"$f":"INDEX(Prop2022DistTar!$H$8:$H$11,E$39)","v":22430353.057213042},{"$f":"INDEX(Prop2022DistTar!$H$8:$H$11,F$39)","v":75765053.501600176}]
[]
[null,{"$f":"B50","v":"Proposed : Tariff V - AGN Central - Residential"},{"$f":"INDEX(Prop2022DistTar!$G$8:$G$11,C$38)","v":40570858.100000001},{"$f":"INDEX(Prop2022DistTar!$G$8:$G$11,D$38)","v":67351848.60104391},{"$f":"INDEX(Prop2022DistTar!$G$8:$G$11,E$38)","v":24973124.943048589},{"$f":"INDEX(Prop2022DistTar!$G$8:$G$11,F$38)","v":75765053.501600176}]
[]
[null,"Revenue","Total"]
[null,{"$f":"B54","v":"Existing : Tariff V - AGN Central - Residential"},{"$f":"SUM(C54:F54)","v":199259809.76408467}]
[null,{"$f":"B56","v":"Proposed : Tariff V - AGN Central - Residential"},{"$f":"SUM(C56:F56)","v":208660885.14569268}]
{"$rows_left_out":395}
{"sheet":"ARS","index":5,"n_rows":14,"n_cols":3,"rows_kept":14,"cut":false,"hidden":false,"merged":[]}
[{"$f":"\"Tariff Approval - \"&'Model update'!B3","v":"Tariff Approval - Aust. Gas Networks (Vic & Albury)"}]
[]
["Ancillary Reference Services (Exc GST)"]
[]
[null,{"$f":"'Model update'!$B$8","v":2021},{"$f":"'Model update'!$B$5","v":2022}]
["Meter and Gas Installation Test ",220,{"$f":"ROUND(B6*(1+'Model update'!$B$30),0)","v":228}]
["Disconnection",73,{"$f":"ROUND(B7*(1+'Model update'!$B$30),0)","v":76}]
["Reconnection",85,{"$f":"ROUND(B8*(1+'Model update'!$B$30),0)","v":88}]
["Meter Removal",104,{"$f":"ROUND(B9*(1+'Model update'!$B$30),0)","v":108}]
["Meter Reinstallation",104,{"$f":"ROUND(B10*(1+'Model update'!$B$30),0)","v":108}]
["Special Meter Read - Metropolitan",9.3000000000000007,{"$f":"ROUND(B11*(1+'Model update'!$B$30),1)","v":9.6999999999999993}]
["Special Meter Read - Non Metropolitan",12.8,{"$f":"ROUND(B12*(1+'Model update'!$B$30),1)","v":13.3}]
[]
[{"$f":"\"Note: \"&'Model update'!$B$5&\" formula is as per AA2018-22, Section 4.4.2, p9 : ART = ARTt-1 * (1+CPI)\"","v":"Note: 2022 formula is as per AA2018-22, Section 4.4.2, p9 : ART = ARTt-1 * (1+CPI)"}]