{"text_format":"1","workbook":"xlsx","n_sheets":29,"sheets":["AER CF","AER NRs","AER lookups","AER ETL","Instructions","CONTENTS","Business & other details","E1. Expenditure Summary","E2. Mains Repex","E3. Mains Augex","E4. Meter replacement","E5. New Connections","E6. Non-network","E10. Overheads","E12. ICT","E13. Other capex","E17. Step changes","E20. Opex","E21. ARS","E25. Escalators","N1. Demand","N2. Network characteristics","S1.1 Customer numbers","S1.2 Customer numbers","S10. Supply Quality","S11. Network reliability","F2. Capex","F3. Revenue","Additional disclosures"],"not_rendered":{"charts":0,"images":5,"macros":1,"external_links":5,"defined_names":2926,"comments":1,"pivot_tables":0},"unopened":[],"bounds":{"document_bytes":16777216,"sheet_cells":100000,"rows_first":2000,"rows_last":500,"rows_between":2000,"halvings":0,"cell_chars":16384,"cell_head_chars":4096},"cells_cut":0,"cells_raw":0,"read":"whole","date_system":"1900"}

{"sheet":"AER CF","index":0,"n_rows":127,"n_cols":24,"rows_kept":127,"cut":false,"hidden":true,"merged":[[33,37,33,58],[33,68,33,89],[3,1,3,21],[31,37,31,58],[31,68,31,89],[32,37,32,58],[32,68,32,89]]}
[null,"AER CONDITIONAL FORMATTING"]
[]
[]
[null,"CONDITIONAL FORMATTING MAP"]
[null,null,null,null,null,"=INDEX(dms_CF_3.6.1, MATCH(dms_TradingName,dms_CF_TradingName))=\"Y\"","=INDEX(dms_CF_3.6.5, MATCH(dms_TradingName,dms_CF_TradingName))=\"Y\"","=INDEX(dms_CF_3.6.6, MATCH(dms_TradingName,dms_CF_TradingName))=\"Y\"","=INDEX(dms_CF_3.6.7.1, MATCH(dms_TradingName,dms_CF_TradingName))=\"Y\"","=INDEX(dms_CF_3.6.7.2, MATCH(dms_TradingName,dms_CF_TradingName))=\"Y\"","=INDEX(dms_CF_3.6.7.3, MATCH(dms_TradingName,dms_CF_TradingName))=\"Y\"","=INDEX(dms_CF_3.6.7.4, MATCH(dms_TradingName,dms_CF_TradingName))=\"Y\"","=INDEX(dms_CF_3.6.8, MATCH(dms_TradingName,dms_CF_TradingName))=\"Y\"","=INDEX(dms_CF_4.1, MATCH(dms_TradingName,dms_CF_TradingName))=\"Y\"","=INDEX(dms_CF_6.6.1, MATCH(dms_TradingName,dms_CF_TradingName))=\"Y\"","=INDEX(dms_CF_6.8, MATCH(dms_TradingName,dms_CF_TradingName))=\"Y\"","=INDEX(dms_CF_7.12, MATCH(dms_TradingName,dms_CF_TradingName))=\"Y\"","=INDEX(dms_CF_8.1_A, MATCH(dms_TradingName,dms_CF_TradingName))=\"Y\"","=INDEX(dms_CF_8.1_B, MATCH(dms_TradingName,dms_CF_TradingName))=\"Y\"","=INDEX(dms_CF_8.1_Neg, MATCH(dms_TradingName,dms_CF_TradingName))=\"Y\"","=INDEX(dms_CF_4.4.1_Neg, MATCH(dms_TradingName,dms_CF_TradingName))=\"Y\""]
[null,"dms_CF_TradingName","JurisdictionList","Sector","Segment","dms_CF_3.6.1","dms_CF_3.6.5","dms_CF_3.6.6","dms_CF_3.6.7.1","dms_CF_3.6.7.2","dms_CF_3.6.7.3","dms_CF_3.6.7.4","dms_CF_3.6.8","dms_CF_4.1","dms_CF_6.6.1","dms_CF_6.8","dms_CF_7.12","dms_CF_8.1_A","dms_CF_8.1_B","dms_CF_8.1_Neg","dms_CF_4.4.1","dms_CF_MAIFI_flag","Spare1","Spare2"]
[null,"ActewAGL Distribution","ACT","Electricity","Distribution",null,"Y",null,"Y","Y","N","Y","N","N","N","Y","Y","N","Y","Y","N","N","N","N"]
[null,"Ausgrid","NSW","Electricity","Distribution",null,"Y",null,"N","N","N","Y","N","N","N","Y","Y","N","Y","Y","N","N","N","N"]
[null,"AusNet (D)","Vic","Electricity","Distribution",null,"N",null,"N","N","N","N","N","Y","N","Y","N","N","N","Y","N","N","N","N"]
[null,"AusNet (T)","Vic","Electricity","Transmission",null,"N",null,"N","N","N","N","N","Y","N","Y","N","N","N","Y","N","N","N","N"]
[null,"CitiPower","Vic","Electricity","Distribution",null,"N",null,"N","N","N","N","N","Y","N","Y","N","N","N","Y","N","N","N","N"]
[null,"Directlink","Qld","Electricity","Transmission",null,"N",null,"N","N","N","N","N","Y","N","Y","N","N","Y","Y","N","N","N","N"]
[null,"ElectraNet","SA","Electricity","Transmission",null,"N",null,"N","N","N","N","N","Y","N","Y","N","N","Y","Y","N","N","N","N"]
[null,"Endeavour Energy","NSW","Electricity","Distribution",null,"Y",null,"N","N","N","Y","N","N","N","Y","Y","N","Y","Y","Y","N","N","N"]
[null,"Energex","Qld","Electricity","Distribution",null,"Y",null,"N","N","N","N","N","N","N","Y","Y","N","Y","Y","Y","N","N","N"]
[null,"Ergon Energy","Qld","Electricity","Distribution",null,"Y",null,"N","N","N","N","N","N","N","Y","Y","N","Y","Y","N","N","N","N"]
[null,"Essential Energy","NSW","Electricity","Distribution",null,"Y",null,"N","N","N","Y","N","N","N","Y","Y","N","Y","Y","N","N","N","N"]
[null,"Jemena Electricity","Vic","Electricity","Distribution",null,"N",null,"N","N","N","N","N","Y","N","Y","N","N","N","Y","N","N","N","N"]
[null,"Murraylink","SA","Electricity","Transmission",null,"N",null,"N","N","N","N","N","Y","N","Y","N","N","Y","Y","N","N","N","N"]
[null,"Power and Water","NT","Electricity","Distribution",null,"N",null,"N","Y","N","N","Y","Y","Y","Y","Y","N","Y","Y","N","N","N","N"]
[null,"Powercor Australia","Vic","Electricity","Distribution",null,"N",null,"N","N","N","N","N","Y","N","Y","N","N","N","Y","N","N","N","N"]
[null,"Powerlink","Qld","Electricity","Transmission",null,"N",null,"N","N","N","N","N","Y","N","Y","N","N","Y","Y","N","N","N","N"]
[null,"SA Power Networks","SA","Electricity","Distribution",null,"Y",null,"N","N","N","N","N","Y","N","Y","Y","Y","Y","N","N","N","N","N"]
[null,"TasNetworks (D)","Tas","Electricity","Distribution",null,"Y",null,"N","N","N","N","N","N","N","Y","Y","N","Y","Y","N","N","N","N"]
[null,"TasNetworks (T)","Tas","Electricity","Transmission",null,"N",null,"N","N","N","N","N","Y","N","Y","N","N","Y","Y","N","N","N","N"]
[null,"TransGrid","NSW","Electricity","Transmission",null,"N",null,"N","N","N","N","N","Y","N","Y","N","N","Y","Y","N","N","N","N"]
[null,"United Energy","Vic","Electricity","Distribution",null,"N",null,"N","N","N","N","N","Y","N","Y","N","N","N","Y","N","N","N","N"]
[]
[]
[null,"Confidential"]
[null,"Amended"]
[]
[null,"Worksheet 6.2 STPIS reliability"]
[null,"Formula",null,null,null,"Applied to:"]
[]
[null,"=INDEX(dms_CBD_flag,MATCH(dms_TradingName,dms_TradingName_List))=\"NO\"",null,null,null,"$D$11,$D$17,$D$23,$D$33,$D$39,$D$45,$D$55,$D$61,$D$67,$D$77,$D$83,$D$89"]
[null,"=INDEX(dms_Urban_flag,MATCH(dms_TradingName,dms_TradingName_List))=\"NO\"",null,null,null,"$D$12,$D$18,$D$24,$D$56,$D$62,$D$78,$D$68,$D$84"]
[null,"=INDEX(dms_ShortRural_flag,MATCH(dms_TradingName,dms_TradingName_List))=\"NO\"",null,null,null,"$D$13,$D$19,$D$25,$D$57,$D$63,$D$69,$D$79,$D$85"]
[null,"=INDEX(dms_LongRural_flag,MATCH(dms_TradingName,dms_TradingName_List))=\"NO\"",null,null,null,"$D$14,$D$20,$D$26,$D$58,$D$64,$D$65,$D$70,$D$71,$D$80,$D$86"]
[null,"=INDEX(dms_FeederType_5_flag,MATCH(dms_TradingName,dms_TradingName_List))=\"NO\"",null,null,null,"$D$87,$D$81,$D$71,$D$65,$D$59,$D$49,$D$43,$D$37,$D$21,$D$15"]
[null,"=dms_MAIFI_Flag=\"No\"",null,null,null,"$D$55:$D$72"]
[]
[]
[null,"Business & other details"]
[null,"=(INDEX(dms_Model_Span,MATCH(dms_Model,dms_Model_List))>1)"]
[null,"=(INDEX(dms_Model_Span,MATCH(dms_Model,dms_Model_List))=1)"]
[]
[]
[null,"STYLES IN USE"]
[null,null,"dms_1"]
[null,null,"dms_2"]
[null,null,"dms_3"]
[null,null,"dms_4"]
[null,null,"dms_5"]
[null,null,"dms_NUM"]
[null,null,"dms_NUM%"]
[null,null,"dms_Row_Locked"]
[null,null,"dms_Row1"]
[null,null,"dms_Row2"]
[null,null,"dms_T1"]
[null,null,"dms_T2"]
[null,null,"dms_BH"]
[null,null,"dms_BY1"]
[null,null,"dms_BY2"]
[null,null,"dms_GH"]
[null,null,"dms_GY1"]
[null,null,"dms_GY2"]
[]
[]
[]
[]
[]
[]
[]
[]
[]
[]
[]
[]
[]
[]
[]
[]
[]
[]
[]
[]
[]
[]
[]
[]
[]
[]
[]
[]
[]
[]
[]
[]
[]
[]
[]
[]
[]
[]
[]
[]
[]
[]
[]
[]
[]
[]
[]
[]
[]
[]
[]
[]
[]
[]
[]
[]
[]
[]
[null,null,"0"]
[null,null,{"$f":"IFERROR(IF(dms_Model=\"ARR\",(MAX(0,dms_0608_LastRow-dms_0608_OffsetRows)),\"not an ARR\"),\"0\")","v":"not an ARR"}]

{"sheet":"AER NRs","index":1,"n_rows":226,"n_cols":15,"rows_kept":226,"cut":false,"hidden":true,"merged":[[31,36,31,57],[31,67,31,88],[32,36,32,57],[32,67,32,88],[33,36,33,57],[33,67,33,88],[108,1,113,1],[4,1,26,1],[30,1,53,1],[30,10,30,11],[31,10,33,10],[34,10,38,10],[42,10,43,10],[63,1,76,1],[82,1,95,1],[98,1,105,1],[189,1,190,1],[193,1,194,1],[197,1,198,1],[206,1,211,1],[116,1,130,1],[133,1,148,1],[150,1,156,1],[158,1,172,1],[174,1,175,1],[177,1,182,1]]}
[null,"AER NAMED RANGES"]
[]
[null,"DROP DOWN SELECTORS USED IN WORKBOOKS"]
[]
[null,"COVER SHEET","dms_DataQuality_List","dms_Confid_status_List"]
[null,null,"-- select --","-- select --"]
[null,null,"Actual","Public"]
[null,null,"Estimate","Confidential"]
[null,null,"Consolidated"]
[]
[]
[null,null,"For all files either AER or business needs to be able to specify the type of submission","For PTRM & RFM templates we must provide a choice in case they change their form of control - otherwise it is drawn from the business specific lookup table above."]
[null,null,"dms_SourceList","dms_FormControl_Choices"]
[null,null,"-- select --","Revenue cap"]
[null,null,"After appeal","Revenue yield"]
[null,null,"Draft decision","Weighted average price cap"]
[null,null,"Final decision"]
[null,null,"PTRM update 1"]
[null,null,"PTRM update 2"]
[null,null,"PTRM update 3"]
[null,null,"PTRM update 4"]
[null,null,"PTRM update 5"]
[null,null,"PTRM update 6"]
[null,null,"PTRM update 7"]
[null,null,"Regulatory proposal"]
[null,null,"Reporting"]
[null,null,"Revised regulatory proposal"]
[]
[]
[null,null,null,null,null,null,null,null,null,null,"This is used to create an image to insert on 6.3 STPIS sheet - not for dropdown lists."]
[null,"CA & RESET RINS \nDNSP","dms_DNSP_020301_SubstationType","dms_DNSP_020301_ProjectType","dms_DNSP_020301_ProjectTrigger","dms_DNSP_020302_ProjectType","dms_DNSP_020302_ProjectTrigger","dms_STPIS_Exclusion_List","dms_Reason_Interruption","dms_Reason_Interruption_Detailed","Reason for interruption",null,null,"dms_N0205_AssetType"]
[null,null,"Subtransmission substation","New substation establishment","Demand growth","New line on new route - single circuit","Demand growth","Weather","Animal","Animal impact","Animal","Animal impact",null,"Cast Iron"]
[null,null,"Zone substation","Substation upgrade - capacity"," Voltage issues","New line on new route - dual circuit"," Voltage issues","Equipment failure","Asset failure","Animal nesting/burrowing, etc and other",null,"Animal nesting/burrowing, etc and other",null,"PVC"]
[null,null,"Switching station","Substation upgrade - voltage"," Reactive power issue","New line on new route - other"," Reactive power issue","Operational error","Other","Other",null,"Other",null,"Polyamide"]
[null,null,"Other","Other"," Fault level issues","Line rebuild over existing route - single circuit"," Fault level issues","Vegetation","Overloads","LV","Asset failure","LV",null,"High density polyethylene (80)"]
[null,null,null,null," Safety","Line rebuild over existing route - dual circuit"," Net market benefit","Animals","Planned","Distribution substation",null,"Distribution substation",null,"High density polyethylene (100)"]
[null,null,null,null," Environment","Reconductor - Single circuit"," Safety","Third party impacts","Network business","HV",null,"HV",null,"High density polyethylene (250)"]
[null,null,null,null," Other","Reconductor - Dual circuit"," Environment","Transmission failure","Third party","Zone substation",null,"Zone substation",null,"High density polyethylene (575)"]
[null,null,null,null,null,"Reconductor - Other"," Other","Load shedding","Unknown","Subtransmission",null,"Subtransmission",null,"Medium density polyethylene"]
[null,null,null,null,null,"Line upgrade - raising/retensoring",null,"Inter-distributor connection failure","Vegetation","insert description of 'other'","Other","insert description of 'other'",null,"Unprotected steel"]
[null,null,null,null,null,"Line upgrade - voltage upgrade",null,"Other","Weather","Network error","Overloads",null,null,"Protected steel"]
[null,null,null,null,null,"Line upgrade - capacity",null,null,"2 - STPIS Exclusion (3.3)(a)","Switching and protection error","Planned",null,null,"Other"]
[null,null,null,null,null,"String spare circuit",null,null,"3 - STPIS Exclusion (3.3)(a)","Fire","Network business","Network error"]
[null,null,null,null,null,"Other",null,null,"4 - STPIS Exclusion (3.3)(a)","Other",null,"Switching and protection error"]
[null,null,null,null,null,null,null,null,"5 - STPIS Exclusion (3.3)(a)","Dig-in","Third party","Fire"]
[null,null,null,null,null,null,null,null,"6 - STPIS Exclusion (3.3)(a)","Unauthorised access",null,"Other"]
[null,null,null,null,null,null,null,null,"7 - STPIS Exclusion (3.3)(a)","Vehicle impact",null,"Dig-in"]
[null,null,null,null,null,null,null,null,null,"Unknown",null,"Unauthorised access"]
[null,null,null,null,null,null,null,null,null,"Blow-in/Fall-in - NSP responsibility",null,"Vehicle impact"]
[null,null,null,null,null,null,null,null,null,"Grow-in - NSP responsibility","Unknown","Unknown"]
[null,null,null,null,null,null,null,null,null,"Blow-in/Fall-in - Other responsible party","Vegetation","Blow-in/Fall-in - NSP responsibility"]
[null,null,null,null,null,null,null,null,null,"Grow-in - Other responsible party",null,"Grow-in - NSP responsibility"]
[null,null,null,null,null,null,null,null,null,null,null,"Blow-in/Fall-in - Other responsible party"]
[null,null,null,null,null,null,null,null,null,null,null,"Grow-in - Other responsible party"]
[null,null,null,null,null,null,null,null,null,null,"Weather"]
[null,null,null,null,null,null,null,null,null,null,"2 - STPIS Exclusion (3.3)(a)"]
[null,null,null,null,null,null,null,null,null,null,"3 - STPIS Exclusion (3.3)(a)"]
[null,null,null,null,null,null,null,null,null,null,"4 - STPIS Exclusion (3.3)(a)"]
[null,null,null,null,null,null,null,null,null,null,"5 - STPIS Exclusion (3.3)(a)"]
[null,null,null,null,null,null,null,null,null,null,"6 - STPIS Exclusion (3.3)(a)"]
[null,null,null,null,null,null,null,null,null,null,"7 - STPIS Exclusion (3.3)(a)"]
[]
[]
[null,"CA & RESET RINS \nTNSP ","dms_TNSP_0203_SubstationType","dms_TNSP_020301_ProjectType","dms_TNSP_020301_ProjectTrigger","dms_TNSP_020302_ProjectType","dms_TNSP_0203_ProjectTrigger"]
[null,null,"Terminal station","New substation establishment","Demand growth","New line on new route - single circuit","Demand growth"]
[null,null,"Switching station","Capacity upgrade"," Voltage issues","New line on new route - dual circuit"," Voltage issues"]
[null,null,"Transmission substation","Voltage upgrade"," Reactive power issue","New line on new route - other"," Reactive power issue"]
[null,null,"Other","Other"," Fault level issues","Line rebuild over existing route - single circuit"," Fault level issues"]
[null,null,null,null,"Net market benefit","Line rebuild over existing route - dual circuit"," Net market benefit"]
[null,null,null,null," Safety","Reconductor - Single circuit"," Safety"]
[null,null,null,null," Environment","Reconductor - Dual circuit"," Environment"]
[null,null,null,null," Other","Reconductor - Other"," Other"]
[null,null,null,null,null,"Line upgrade - raising/retensoring"]
[null,null,null,null,null,"Line upgrade - voltage upgrade"]
[null,null,null,null,null,"Line upgrade - capacity"]
[null,null,null,null,null,"String spare circuit"]
[null,null,null,null,null,"Other"]
[]
[]
[]
[null,"NAMED RANGES USED IN ETL PROCESS"]
[]
[null,"CA & RESET RINS \nDNSP ONLY","dms_020303_01_UOM","dms_020501_01_UOM","dms_020501_02_UOM","dms_020501_03_UOM","dms_020501_04_UOM","dms_020701_01_UOM","dms_020701_02_UOM","dms_020701_01_Rows","dms_040102_01_UOM","dms_040102_04_UOM","dms_E050201_UOM","dms_E050302_UOM"]
[null,null,"Circuit line length in km","0's","0's","0's","0's","km","km","Route line length within zone","0's","days","per metre per connection","metres per connection"]
[null,null,"Circuit line length in km","0's","0's","0's","0's","0's","0's","Number of maintenance spans","0's","0's","per service per connection","number per connection"]
[null,null,"Circuit line length in km","MVA added","MVA added","MVA added","MVA added","km","km","Total length of maintenance spans","0's","$0s","number per connection","number per connection"]
[null,null,"Circuit line length in km","0's","0's","0's","0's","km","km","Length of vegetation corridors","$0s","0's"]
[null,null,"Number","total spend $0s","total spend $0s","total spend $0s","total spend $0s","0's","0's","Average number of trees per maintenance span"]
[null,null,"Number","net circuit km added","net circuit km added","net circuit km added","net circuit km added","years","years","Average frequency of cutting cycle"]
[null,null,"Number","total spend $0s","total spend $0s","total spend $0s","total spend $0s"]
[null,null,null,"net circuit km added","net circuit km added","net circuit km added","net circuit km added"]
[null,null,null,"total spend $0s","total spend $0s","total spend $0s","total spend $0s"]
[null,null,null,"0's",null,"$0s"]
[null,null,null,"0's"]
[null,null,null,"0's"]
[null,null,null,"$0s"]
[]
[]
[null,"CA & RESET RINS \nTNSP ONLY","dms_020701_01_UOM"]
[null,null,"km"]
[null,null,"0's"]
[null,null,"km"]
[null,null,"0's"]
[null,null,"km"]
[null,null,"metres"]
[null,null,"years"]
[]
[]
[null,"CA & RESET RINS \nDNSP & TNSP","dms_020603_01_UOM"]
[null,null,"0's"]
[null,null,"0's"]
[null,null,"0's"]
[null,null,"0's"]
[null,null,"(per cent)"]
[]
[]
[null,"EB & RESET RINS \nDNSP ONLY","dms_030601_01_UOM","dms_030601_02_UOM","dms_030701_01_UOM","dms_030702_01_UOM","dms_030703_01_UOM"]
[null,null,"minutes/customer","minutes/customer","Customer / km","%","km"]
[null,null,"minutes/customer","minutes/customer","MWh/customer","Number of spans"]
[null,null,"interruptions/customer","interruptions/customer","kVA / customer","Number of spans"]
[null,null,"interruptions/customer","interruptions/customer",null,"Number of spans"]
[null,null,null,null,null,"Number of spans"]
[null,null,null,null,null,"Years"]
[null,null,null,null,null,"Years"]
[null,null,null,null,null,"Trees"]
[null,null,null,null,null,"Trees"]
[null,null,null,null,null,"Defects"]
[null,null,null,null,null,"Defects"]
[null,null,null,null,null,"Spans"]
[null,null,null,null,null,"km"]
[null,null,null,null,null,"Spans"]
[]
[null,null,"WHEN INSERTING COVER SHEET INTO A TNSP FILE - APPLY THESE NAMED RANGES"]
[null,"EB & RESET RINS \nTNSP ONLY","dms_030601_01_UOM",null,"dms_030701_01_UOM","dms_030702_01_UOM"]
[null,null,"%",null,"Number of spans","km"]
[null,null,"number",null,"Years","%"]
[null,null,"number",null,"Trees","km"]
[null,null,"%",null,"Defects","number"]
[null,null,"number",null,"Number of spans"]
[null,null,"number",null,"km"]
[null,null,"%",null,"km"]
[null,null,"number",null,"Number of spans"]
[null,null,"number"]
[null,null,"%"]
[null,null,"number"]
[null,null,"%"]
[null,null,"number"]
[null,null,"%"]
[null,null,"number"]
[]
[null,"EB & RESET RINS \nDNSP & TNSP","dms_EB_RAB_PIT"]
[null,null,"Beginning of year"]
[null,null,"End of year"]
[null,null,"End of year"]
[null,null,"End of year"]
[null,null,"End of year"]
[null,null,"End of year"]
[]
[null,"ARR \nDNSP ONLY","dms_030605_UOM","dms_03060703_UOM","Spare","Spare"]
[null,null,"number","number"]
[null,null,"number","number"]
[null,null,"number","number"]
[null,null,"number","number"]
[null,null,"number","(per cent)"]
[null,null,"number"]
[null,null,"number"]
[null,null,"number"]
[null,null,"number"]
[null,null,"number"]
[null,null,"number"]
[null,null,"number"]
[null,null,"(per cent)"]
[null,null,"(per cent)",""]
[]
[null,"RFM","dms_Beg","dms_Mid","dms_End"]
[null,null,"Beginning of year","Mid year","End of Year"]
[]
[null,"PTRM","dms_PTRM_RAB_PIT","dms_PTRM_TAB_PIT","DMS_Xfactor"]
[null,null,"Beginning of year","Beginning of year","x factors"]
[null,null,"End of year","End of year"]
[null,null,"End of year","End of year"]
[null,null,"End of year","End of year"]
[null,null,"End of year"]
[]
[]
[null,"STPIS & MIC NAMED RANGES "]
[]
[null,"These \"row descriptions\" are the column headings in the various templates but become row descriptions in the ETL process"]
[]
[null,"Table 6.3 sustained interruptions - row descriptions","dms_060301_CustNo_Affected_Row","dms_060301_Avg_Duration_Sustained_Int_Row","dms_060301_Effect_unplanned_SAIDI_Row","dms_060301_Effect_unplanned_SAIFI_Row"]
[null,null,"Number of customers affected by the interruption","Average duration of sustained customer interruption","Effect on unplanned SAIDI","Effect on unplanned SAIFI"]
[]
[]
[null,"Table 6.1 telephone answering - row descriptions and start date","dms_060101_Rows","dms_060102_Rows","dms_060101_StartDateTxt"]
[null,null,"Total number of calls \n(after removing excluded events)","Number of calls answered within 30 seconds \n(after excluding excluded events) ",{"$f":"dms_060701_StartDateTxt","v":"1-Jul-2014"}]
[]
[]
[null,"Table 6.8.1 - row descriptions","dms_060801_01_Rows","dms_060801_02_Rows","dms_060801_03_Rows","dms_060801_04_Rows"]
[null,null,"Number of interruptions","Duration of interruptions","Total unplanned minutes off supply","Effect on unplanned MAIFI"]
[]
[]
[null,"Table 7.9.4 - market impact component - row descriptions","dms_070904_01_Rows","without exclusions","with exclusions"]
[]
[]
[null,"These headings (Lists) are determined from the INDEX/MATCH function on the NSP selected on the Business & other details sheet"]
[]
[null,"Table 6.7.1 - daily performance data - unplanned - MAIFI  -- row descriptions and header named range values","dms_060701_Feeder_Header_Lvl4",{"$f":"INDEX(dms_FeederName_1,MATCH(dms_TradingName,dms_TradingName_List))","v":"CBD"},{"$f":"INDEX(dms_FeederName_1,MATCH(dms_TradingName,dms_TradingName_List))","v":"CBD"},{"$f":"INDEX(dms_FeederName_2,MATCH(dms_TradingName,dms_TradingName_List))","v":"Urban"},{"$f":"INDEX(dms_FeederName_2,MATCH(dms_TradingName,dms_TradingName_List))","v":"Urban"},{"$f":"INDEX(dms_FeederName_3,MATCH(dms_TradingName,dms_TradingName_List))","v":"Short rural"},{"$f":"INDEX(dms_FeederName_3,MATCH(dms_TradingName,dms_TradingName_List))","v":"Short rural"},{"$f":"INDEX(dms_FeederName_4,MATCH(dms_TradingName,dms_TradingName_List))","v":"Long rural"},{"$f":"INDEX(dms_FeederName_4,MATCH(dms_TradingName,dms_TradingName_List))","v":"Long rural"},{"$f":"IF((INDEX(dms_FeederName_5,MATCH(dms_TradingName,dms_TradingName_List))=0),\"Network\",(INDEX(dms_FeederName_5,MATCH(dms_TradingName,dms_TradingName_List))))","v":"Network"},{"$f":"IF((INDEX(dms_FeederName_5,MATCH(dms_TradingName,dms_TradingName_List))=0),\"Network\",(INDEX(dms_FeederName_5,MATCH(dms_TradingName,dms_TradingName_List))))","v":"Network"},"Network","Network"]
[]
[null,null,"dms_060701_Rows","All events","After removing excluded events","All events","After removing excluded events","All events","After removing excluded events","All events","After removing excluded events","All events","After removing excluded events","All events","After removing excluded events"]
[null,null,null,"the number of column headings changes from 10 to 12 depending on the number of feeder categories for the NSP"]
[]
[null,null,"dms_0603_FeederList",{"$f":"INDEX(dms_FeederName_1,MATCH(dms_TradingName,dms_TradingName_List))","v":"CBD"},{"$f":"INDEX(dms_FeederName_2,MATCH(dms_TradingName,dms_TradingName_List))","v":"Urban"},{"$f":"INDEX(dms_FeederName_3,MATCH(dms_TradingName,dms_TradingName_List))","v":"Short rural"},{"$f":"INDEX(dms_FeederName_4,MATCH(dms_TradingName,dms_TradingName_List))","v":"Long rural"}]
[]
[]
[null,"Use these to add to specific worksheets in existing files","Use these to add to specific worksheets in existing files"]
[]
[]
[null,"ARRs 6.7 STPIS daily performance","dms_060101_Values","dms_060102_Values","dms_060701_Values"]
[null,null,"dms_LeapYear"]
[]
[]
[null,"ARR's  6.8 STPIS exclusions","dms_060801_Event_Date","dms_060801_OutageID","dms_060801_FeederID","dms_060801_FeederClass","dms_060801_CauseID","dms_060801_01_Values","dms_060801_02_Values","dms_060801_03_Values","dms_060801_Excl_Cat","dms_060801_04_Values"]
[null,null,"dms_060801_StartCell"]
[]
[]
[null,"CA 6.3 sustained interruptions","dms_060301_Event_Date","dms_060301_Event_Time","dms_060301_AssetID","dms_060301_FeederClass","dms_060301_Reason","dms_060301_DetailedReason","dms_060301_CustNo_Affected_Values","dms_060301_Avg_Duration_Sustained_Int_Values","dms_060301_Effect_unplanned_SAIDI_Values","dms_060301_Effect_unplanned_SAIFI_Values","dms_060301_MED"]

{"sheet":"AER lookups","index":2,"n_rows":100,"n_cols":38,"rows_kept":100,"cut":false,"hidden":true,"merged":[[34,1,34,4],[13,25,13,28],[13,31,13,35]]}
[null,"AER LOOKUP TABLES"]
[]
[null,"Data in these columns used for data validation and database purposes."]
[null,"Date last modified:","2017-01-16","added (Albury and Victora) for AGN"]
[null,null,"2016-10-17","updated TransGrid's correct legal name, corrected TasNetworks (T) to June financial year"]
[null,null,"2017-02-01","inserted Power and Water, added NRs (dms_FeederCat_1 and dms_FeederCat_2)"]
[null,null,"2017-03-03","inserted AEMO as a business"]
[null,null,"2018-03-28","major changes to accommodate STPIS"]
[null,null,"Template Version",5]
[]
[]
[]
[]
[null,null,null,null,null,null,null,null,null,null,null,null,null,null,null,null,null,null,null,null,null,null,null,null,null,"Feeder Types",null,null,null,"TasNetworks (D)","MAIFI flag","Feeder Names"]
[]
[null,"dms_TradingName_List","dms_TradingNameFull_List","dms_ABN_List","dms_JurisdictionList","dms_Sector_List","dms_Segment_List","dms_FormControl_List","dms_RPT_List","dms_RPTMonth_List","dms_CRCPlength_List","dms_FRCPlength_List","dms_PRCPlength_List","dms_663_List","dms_DeterminationRef_List","dms_Addr1_List","dms_Addr2_List","dms_Suburb_List","dms_State_List","dms_PostCode_List","dms_PAddr1_List","dms_PAddr2_List","dms_PSuburb_List","dms_PState_List","dms_PPostCode_List","dms_CBD_flag","dms_Urban_flag","dms_ShortRural_flag","dms_LongRural_flag","dms_FeederType_5_flag","dms_MAIFI_flag_List","dms_FeederName_1","dms_FeederName_2","dms_FeederName_3","dms_FeederName_4","dms_FeederName_5","dms_Public_Lighting_List","Name"]
[null,"AGN (Albury and Victoria)","Australian Gas Networks Limited (reporting data for Albury and Victoria)",19078551685,"Vic","Gas","Distribution","Weighted average price cap","Calendar","December",5,5,5,"x",null,"Level 6","400 King William Street","ADELAIDE","SA",5000,"PO Box 6468","Halifax Street","ADELAIDE","SA",5000,"NO","NO","NO","NO","NO","-","CBD","Urban","Short rural","Long rural",null,"NO","AGN (Albury)"]
[null,"AGN (Albury)","Australian Gas Networks Limited (reporting data for Albury)",19078551685,"Vic","Gas","Distribution","Weighted average price cap","Calendar","December",5,5,5,"x",null,"Level 6","400 King William Street","ADELAIDE","SA",5000,"PO Box 6468","Halifax Street","ADELAIDE","SA",5000,"NO","NO","NO","NO","NO","-","CBD","Urban","Short rural","Long rural",null,"NO"]
[null,"AGN (SA)","Australian Gas Networks Limited (reporting data for SA)",19078551685,"SA","Gas","Distribution","Weighted average price cap","Financial","June",5,5,5,5,"distribution determination","Level 6","400 King William Street","ADELAIDE","SA",5000,"PO Box 6468","Halifax Street","ADELAIDE","SA",5000,"NO","NO","NO","NO","NO","-","CBD","Urban","Short rural","Long rural",null,"NO","AGN (SA)"]
[null,"AGN (Victoria)","Australian Gas Networks Limited (reporting data for Victoria)",19078551685,"Vic","Gas","Distribution","Weighted average price cap","Calendar","December",5,5,5,"x",null,"Level 6","400 King William Street","ADELAIDE","SA",5000,"PO Box 6468","Halifax Street","ADELAIDE","SA",5000,"NO","NO","NO","NO","NO","-","CBD","Urban","Short rural","Long rural",null,"NO","AGN (Victoria)"]
[null,"Amadeus","APT Pipelines (NT) Pty Ltd",39009737393,"NT","Gas","Transmission","Weighted average price cap","Financial","June",5,5,5,"x","n/a","Level 19, HSBC Building","580 George Street","SYDNEY","NSW",2000,"Level 19, HSBC Building","580 George Street","SYDNEY","NSW",2000,"NO","NO","NO","NO","NO","-","CBD","Urban","Short rural","Long rural",null,"NO","Amadeus"]
[null,"APA GasNet","APA GasNet Australia (Operations) Pty Ltd","065083009","Vic","Gas","Transmission","Weighted average price cap","Calendar","December",5,5,5,"x",null,"Level 19, HSBC Building","580 George Street","SYDNEY","NSW",2000,"PO Box R41",null,"ROYAL EXCHANGE","NSW",1225,"NO","NO","NO","NO","NO","-","CBD","Urban","Short rural","Long rural",null,"NO","APA GasNet"]
[null,"AusNet (Gas)","AusNet Gas Services","086015036","Vic","Gas","Distribution","Weighted average price cap","Calendar","December",5,5,5,"X",null,"Level 19, HSBC Building","580 George Street","SYDNEY","NSW",2000,"PO Box R41",null,"ROYAL EXCHANGE","NSW",1225,"NO","NO","NO","NO","NO","-","CBD","Urban","Short rural","Long rural",null,"NO","AusNet (Gas)"]
[null,"Australian Distribution Co. (Gas)","Australian Gas Distribution Co. ",11222333444,"NSW","Gas","Distribution","Weighted average price cap","Financial","June",5,5,5,null,null,"123 Straight Street",null,"SYDNEY","NSW",2000,"PO Box 123",null,"SYDNEY","NSW",2000,"NO","NO","NO","NO","NO","-","CBD","Urban","Short rural","Long rural",null,"NO","Australian Distribution Co. (Vic)"]
[null,"Central Ranges Pipeline (D)","Central Ranges Pipeline Pty Ltd",108218355,"NSW","Gas","Distribution","Weighted average price cap","Financial","June",15,5,5,5,"distribution determination","Level 19","580 George Street","SYDNEY","NSW",2000,"PO Box R41",null,"ROYAL EXCHANGE","NSW",1225,"NO","NO","NO","NO","NO","-","CBD","Urban","Short rural","Long rural",null,"NO"]
[null,"Central Ranges Pipeline (T)","Central Ranges Pipeline Pty Ltd",108218355,"NSW","Gas","Transmission","Weighted average price cap","Financial","June",14,5,5,5,"transmission determination","Level 19","580 George Street","SYDNEY","NSW",2000,"PO Box R41",null,"ROYAL EXCHANGE","NSW",1225,"NO","NO","NO","NO","NO","-","CBD","Urban","Short rural","Long rural",null,"NO"]
[null,"Evoenergy Gas","Evoenergy Gas",76670568688,"ACT","Gas","Distribution","Weighted average price cap","Financial","June",5,5,5,"x",null,"40 Bunda Street",null,"CANBERRA","ACT",2600,"GPO BOX 366",null,"CANBERRA","ACT",2601,"NO","NO","NO","NO","NO","-","CBD","Urban","Short rural","Long rural",null,"NO","ActewAGL Gas"]
[null,"JGN","Jemena Gas Networks (NSW) Ltd","003 004 322","NSW","Gas","Distribution","Weighted average price cap","Financial","June",5,5,5,null,null,"please provide street address",null,null,null,null,"please provide postal address",null,null,null,null,"NO","NO","NO","NO","NO","-","CBD","Urban","Short rural","Long rural",null,"NO","JGN"]
[null,"Multinet Gas","Multinet Gas (DB No.1) Pty Ltd (ACN 086 026 986), Multinet Gas (DB No.2) Pty Ltd (ACN 086 230 122)","086026986","Vic","Gas","Distribution","Weighted average price cap","Calendar","December",5,5,5,"x",null,"43-45 Centreway",null,"MT WAVERLEY","Vic",3149,null,null,null,null,null,"NO","NO","NO","NO","NO","-","CBD","Urban","Short rural","Long rural",null,"NO","Multinet Gas"]
[null,"Roma to Brisbane Pipeline","APT Petroleum Pipelines Limited t/a Roma to Brisbane Pipeline","009 737 393","Qld","Gas","Transmission","Weighted average price cap","Financial","June",5,5,5,"x","n/a","580 George Street",null,"SYDNEY","NSW",2000,"PO Box R41",null,"ROYAL EXCHANGE","NSW",1225,"NO","NO","NO","NO","NO","-","CBD","Urban","Short rural","Long rural",null,"NO","Roma to Brisbane Pipeline"]
[]
[]
[]
[]
[null,"The Reg Year Ending (dms_RYE) must be set to the last year of the regulatory period. For forecast data is is usually (FRCP_y5) for actual it is a single year (CRY). For historical actual data the RYE will need to be set manually in the business details sheet by setting the dms_Multiyear_flag to 1 and putting the correct value in 'dms_Specified_FinalYear. See cells C67:C68"]
[null,"dms_Model_List ","dms_Model_Name_Format1","dms_Worksheet_List","dms_Model_Span_List"]
[null,"ARR","Annual Reporting",{"$f":"IF(dms_MultiYear_ResponseFlag=\"yes\",\"NEW HISTORICAL ANNUAL REPORTING\",\"ANNUAL REPORTING\")","v":"ANNUAL REPORTING"},1]
[null,"CA","Category Analysis",{"$f":"IF(dms_MultiYear_ResponseFlag=\"yes\",\"NEW HISTORICAL CATEGORY ANALYSIS\",\"CATEGORY ANALYSIS\")","v":"CATEGORY ANALYSIS"},1]
[null,"CESS","Capitlal Expenditure","CAPITLAL EXPENDITURE SHARING SCHEMING",5]
[null,"CPI","CPI","CPI",5]
[null,"EB","Economic Benchmarking",{"$f":"IF(dms_MultiYear_ResponseFlag=\"yes\",\"NEW HISTORICAL ECONOMIC BENCHMARKING\",\"ECONOMIC BENCHMARKING\")","v":"ECONOMIC BENCHMARKING"},1]
[null,"Pricing","Pricing Proposal","PRICING PROPOSAL",5]
[null,"PTRM","Post Tax Revenue Model","POST TAX REVENUE MODEL",5]
[null,"Reset","Regulatory Reporting (Reset)","REGULATORY REPORTING STATEMENT",5]
[null,"RFM","Roll Forward Model","ROLL FORWARD MODEL",5]
[null,"WACC","Weighted Average Cost of Capital","WEIGHTED AVERAGE COST OF CAPITAL",1]
[]
[]
[]
[null,"Financial","Calendar",null,"PREVIOUS",null,"CURRENT",null,"FORTHCOMING"]
[null,"1987-88","1988","PRCP_y1",{"$f":"INDEX(INDIRECT(dms_RPT),dms_PRCP_start_row)","v":"2011-12"},"CRCP_y1",{"$f":"INDEX(INDIRECT(dms_RPT),dms_CRCP_start_row)","v":"2016-17"},{"$f":"FRCP_y1","v":"2021-22"},{"$f":"INDEX(INDIRECT(dms_RPT),dms_FRCP_start_row)","v":"2021-22"}]
[null,"1988-89","1989","PRCP_y2",{"$f":"INDEX(INDIRECT(dms_RPT),dms_PRCP_start_row+1)","v":"2012-13"},"CRCP_y2",{"$f":"INDEX(INDIRECT(dms_RPT),dms_CRCP_start_row+1)","v":"2017-18"},"FRCP_y2",{"$f":"INDEX(INDIRECT(dms_RPT),dms_FRCP_start_row+1)","v":"2022-23"}]
[null,"1989-90","1990","PRCP_y3",{"$f":"INDEX(INDIRECT(dms_RPT),dms_PRCP_start_row+2)","v":"2013-14"},"CRCP_y3",{"$f":"INDEX(INDIRECT(dms_RPT),dms_CRCP_start_row+2)","v":"2018-19"},"FRCP_y3",{"$f":"INDEX(INDIRECT(dms_RPT),dms_FRCP_start_row+2)","v":"2023-24"}]
[null,"1990-91","1991","PRCP_y4",{"$f":"INDEX(INDIRECT(dms_RPT),dms_PRCP_start_row+3)","v":"2014-15"},"CRCP_y4",{"$f":"INDEX(INDIRECT(dms_RPT),dms_CRCP_start_row+3)","v":"2019-20"},"FRCP_y4",{"$f":"INDEX(INDIRECT(dms_RPT),dms_FRCP_start_row+3)","v":"2024-25"}]
[null,"1991-92","1992","PRCP_y5",{"$f":"INDEX(INDIRECT(dms_RPT),dms_PRCP_start_row+4)","v":"2015-16"},"CRCP_y5",{"$f":"INDEX(INDIRECT(dms_RPT),dms_CRCP_start_row+4)","v":"2020-21"},"FRCP_y5",{"$f":"INDEX(INDIRECT(dms_RPT),dms_FRCP_start_row+4)","v":"2025-26"}]
[null,"1992-93","1993","PRCP_y6",{"$f":"INDEX(INDIRECT(dms_RPT),dms_PRCP_start_row+5)","v":"2016-17"},"CRCP_y6",{"$f":"INDEX(INDIRECT(dms_RPT),dms_CRCP_start_row+5)","v":"2021-22"},"FRCP_y6",{"$f":"INDEX(INDIRECT(dms_RPT),dms_FRCP_start_row+5)","v":"2026-27"}]
[null,"1993-94","1994","PRCP_y7",{"$f":"INDEX(INDIRECT(dms_RPT),dms_PRCP_start_row+6)","v":"2017-18"},"CRCP_y7",{"$f":"INDEX(INDIRECT(dms_RPT),dms_CRCP_start_row+6)","v":"2022-23"},"FRCP_y7",{"$f":"INDEX(INDIRECT(dms_RPT),dms_FRCP_start_row+6)","v":"2027-28"}]
[null,"1994-95","1995","PRCP_y8",{"$f":"INDEX(INDIRECT(dms_RPT),dms_PRCP_start_row+7)","v":"2018-19"},"CRCP_y8",{"$f":"INDEX(INDIRECT(dms_RPT),dms_CRCP_start_row+7)","v":"2023-24"},"FRCP_y8",{"$f":"INDEX(INDIRECT(dms_RPT),dms_FRCP_start_row+7)","v":"2028-29"}]
[null,"1995-96","1996","PRCP_y9",{"$f":"INDEX(INDIRECT(dms_RPT),dms_PRCP_start_row+8)","v":"2019-20"},"CRCP_y9",{"$f":"INDEX(INDIRECT(dms_RPT),dms_CRCP_start_row+8)","v":"2024-25"},"FRCP_y9",{"$f":"INDEX(INDIRECT(dms_RPT),dms_FRCP_start_row+8)","v":"2029-30"}]
[null,"1996-97","1997","PRCP_y10",{"$f":"INDEX(INDIRECT(dms_RPT),dms_PRCP_start_row+9)","v":"2020-21"},"CRCP_y10",{"$f":"INDEX(INDIRECT(dms_RPT),dms_CRCP_start_row+9)","v":"2025-26"},"FRCP_y10",{"$f":"INDEX(INDIRECT(dms_RPT),dms_FRCP_start_row+9)","v":"2030-31"}]
[null,"1997-98","1998","PRCP_y11",{"$f":"INDEX(INDIRECT(dms_RPT),dms_PRCP_start_row+10)","v":"2021-22"},"CRCP_y11",{"$f":"INDEX(INDIRECT(dms_RPT),dms_CRCP_start_row+10)","v":"2026-27"},"FRCP_y11",{"$f":"INDEX(INDIRECT(dms_RPT),dms_FRCP_start_row+10)","v":"2031-32"}]
[null,"1998-99","1999","PRCP_y12",{"$f":"INDEX(INDIRECT(dms_RPT),dms_PRCP_start_row+11)","v":"2022-23"},"CRCP_y12",{"$f":"INDEX(INDIRECT(dms_RPT),dms_CRCP_start_row+11)","v":"2027-28"},"FRCP_y12",{"$f":"INDEX(INDIRECT(dms_RPT),dms_FRCP_start_row+11)","v":"2032-33"}]
[null,"1999-00","2000","PRCP_y13",{"$f":"INDEX(INDIRECT(dms_RPT),dms_PRCP_start_row+12)","v":"2023-24"},"CRCP_y13",{"$f":"INDEX(INDIRECT(dms_RPT),dms_CRCP_start_row+12)","v":"2028-29"},"FRCP_y13",{"$f":"INDEX(INDIRECT(dms_RPT),dms_FRCP_start_row+12)","v":"2033-34"}]
[null,"2000-01","2001","PRCP_y14",{"$f":"INDEX(INDIRECT(dms_RPT),dms_PRCP_start_row+13)","v":"2024-25"},"CRCP_y14",{"$f":"INDEX(INDIRECT(dms_RPT),dms_CRCP_start_row+13)","v":"2029-30"},"FRCP_y14",{"$f":"INDEX(INDIRECT(dms_RPT),dms_FRCP_start_row+13)","v":"2034-35"}]
[null,"2001-02","2002","PRCP_y15",{"$f":"INDEX(INDIRECT(dms_RPT),dms_PRCP_start_row+14)","v":"2025-26"},"CRCP_y15",{"$f":"INDEX(INDIRECT(dms_RPT),dms_CRCP_start_row+14)","v":"2030-31"},"FRCP_y15",{"$f":"INDEX(INDIRECT(dms_RPT),dms_FRCP_start_row+14)","v":"2035-36"}]
[null,"2002-03","2003","PRCP_y16",{"$f":"INDEX(INDIRECT(dms_RPT),dms_PRCP_start_row+15)","v":"2026-27"},"CRCP_y16",{"$f":"INDEX(INDIRECT(dms_RPT),dms_CRCP_start_row+15)","v":"2031-32"},"FRCP_y16",{"$f":"INDEX(INDIRECT(dms_RPT),dms_FRCP_start_row+15)","v":"2036-37"}]
[null,"2003-04","2004"]
[null,"2004-05","2005"]
[null,"2005-06","2006",null,"CRY - FRY"]
[null,"2006-07","2007","dms_y1",{"$f":"IFERROR(INDEX(INDIRECT(dms_RPT),dms_CRY_start_row),0)","v":"2019-20"}]
[null,"2007-08","2008","dms_y2",{"$f":"IFERROR(INDEX(INDIRECT(dms_RPT),dms_CRY_start_row+1),0)","v":"2020-21"}]
[null,"2008-09","2009","dms_y3",{"$f":"IFERROR(INDEX(INDIRECT(dms_RPT),dms_CRY_start_row+2),0)","v":"2021-22"}]
[null,"2009-10",2010,"dms_y4",{"$f":"IFERROR(INDEX(INDIRECT(dms_RPT),dms_CRY_start_row+3),0)","v":"2022-23"}]
[null,"2010-11",2011,"dms_y5",{"$f":"IFERROR(INDEX(INDIRECT(dms_RPT),dms_CRY_start_row+4),0)","v":"2023-24"}]
[null,"2011-12",2012,"dms_y6",{"$f":"IFERROR(INDEX(INDIRECT(dms_RPT),dms_CRY_start_row+5),0)","v":"2024-25"}]
[null,"2012-13",2013,"dms_y7",{"$f":"IFERROR(INDEX(INDIRECT(dms_RPT),dms_CRY_start_row+6),0)","v":"2025-26"}]
[null,"2013-14",2014,"dms_y8",{"$f":"IFERROR(INDEX(INDIRECT(dms_RPT),dms_CRY_start_row+7),0)","v":"2026-27"}]
[null,"2014-15",2015,"dms_y9",{"$f":"IFERROR(INDEX(INDIRECT(dms_RPT),dms_CRY_start_row+8),0)","v":"2027-28"}]
[null,"2015-16",2016,"dms_y10",{"$f":"IFERROR(INDEX(INDIRECT(dms_RPT),dms_CRY_start_row+9),0)","v":"2028-29"}]
[null,"2016-17",2017,"dms_y11",{"$f":"IFERROR(INDEX(INDIRECT(dms_RPT),dms_CRY_start_row+10),0)","v":"2029-30"}]
[null,"2017-18",2018,"dms_y12",{"$f":"IFERROR(INDEX(INDIRECT(dms_RPT),dms_CRY_start_row+11),0)","v":"2030-31"}]
[null,"2018-19",2019,"dms_y13",{"$f":"IFERROR(INDEX(INDIRECT(dms_RPT),dms_CRY_start_row+12),0)","v":"2031-32"}]
[null,"2019-20",2020,"dms_y14",{"$f":"IFERROR(INDEX(INDIRECT(dms_RPT),dms_CRY_start_row+13),0)","v":"2032-33"}]
[null,"2020-21",2021,"dms_y15",{"$f":"IFERROR(INDEX(INDIRECT(dms_RPT),dms_CRY_start_row+14),0)","v":"2033-34"}]
[null,"2021-22",2022,"dms_y16",{"$f":"IFERROR(INDEX(INDIRECT(dms_RPT),dms_CRY_start_row+15),0)","v":"2034-35"}]
[null,"2022-23",2023]
[null,"2023-24",2024]
[null,"2024-25",2025]
[null,"2025-26",2026]
[null,"2026-27",2027]
[null,"2027-28",2028]
[null,"2028-29",2029]
[null,"2029-30",2030]
[null,"2030-31",2031]
[null,"2031-32",2032]
[null,"2032-33",2033]
[null,"2033-34",2034]
[null,"2034-35",2035]
[null,"2035-36",2036]
[null,"2036-37",2037]

{"sheet":"AER ETL","index":3,"n_rows":145,"n_cols":8,"rows_kept":145,"cut":false,"hidden":true,"merged":[[11,0,15,0],[12,4,12,8],[14,2,14,4],[18,0,25,0],[26,0,31,0],[71,1,73,1],[32,68,32,89],[33,37,33,58],[33,68,33,89],[34,0,59,0],[34,37,34,58],[34,68,34,89],[32,37,32,58]]}
["FINAL RIN - 20200224","AER ETL INFORMATION"]
[]
[null,"USES NAMED RANGES FLAG","yes","dms_Defined_Names_Used"]
[]
[null,"IF THIS IS AN ABC RIN - make sure the the named range CRY is applied and the named range dms_dollar_nom_UOM is applied"]
[null,"IF THIS IS A RESET RIN - make sure the named ranges CRY and dms_dollar_nom_UOM are NOT present in the workbook"]
[null,"FOR ABC RINS THAT SPAN MULTIPLE YEARS - make sure MultiYear Flag is set and final year entered as required"]
[]
[null,"Full trading name",{"$f":"INDEX(dms_TradingNameFull_List,MATCH(dms_TradingName,dms_TradingName_List))","v":"Australian Gas Networks Limited (reporting data for SA)"},null,"dms_TradingNameFull"]
[null,"Trading name",{"$f":"dms_TradingName","v":"AGN (SA)"}]
["Selected here","Model / RIN","Reset","dms_Model"]
["Read from Business & other details","Source",{"$f":"dms_Selected_Source","v":"Regulatory proposal"},"dms_Source"]
[null,"Data quality",{"$f":"dms_Selected_Quality","v":"Consolidated"},"dms_DQ_1"]
[null,"Data status",{"$f":"dms_Selected_Status","v":"Public"},"dms_DQ_2"]
[null,"Amendment reason",{"$f":"dms_Amendment_Text","v":"."},null,null,"dms_AmendmentReason"]
[null,"Submission date",{"$f":"dms_Typed_Submission_Date","v":"2020-07-01"},"dms_SubmissionDate"]
[]
["Redundant","EBSS - First application of scheme in forthcoming period?","No"]
["Pre-populated from lookup table","Data ingestion data quality",{"$f":"dms_Selected_Quality","v":"Consolidated"},"dms_DataQuality","=IF(dms_DQ_2=\"Confidential\",\"Consolidated\",\"Public\")"]
[null,"Sector",{"$f":"INDEX(dms_Sector_List,MATCH(dms_TradingName,dms_TradingName_List))","v":"Gas"},"dms_Sector","=INDEX(dms_Sector_List,MATCH(dms_TradingName,dms_TradingName_List))"]
[null,"Segment",{"$f":"INDEX(dms_Segment_List,MATCH(dms_TradingName,dms_TradingName_List))","v":"Distribution"},"dms_Segment","=INDEX(dms_Segment_List,MATCH(dms_TradingName,dms_TradingName_List))"]
[null,"Regulatory Year Ending",{"$f":"dms_RYE_result","v":"2026"},"dms_RYE","=IF(dms_MultiYear_Flag=1,LEFT(dms_Specified_FinalYear,2)&RIGHT(dms_Specified_FinalYear,2),INDEX(dms_RYE_Formula_Result,MATCH(dms_Model,dms_Model_List)))"]
[null,"Reporting Period Type",{"$f":"INDEX(dms_RPT_List,MATCH(dms_TradingName,dms_TradingName_List))","v":"Financial"},"dms_RPT","=INDEX(dms_RPT_List,MATCH(dms_TradingName,dms_TradingName_List))"]
[null,"EB/CA Unit of Measure for Monetary Values","$0s","dms_dollar_nom_UOM","If the cover sheet is attached to an ABC RIN apply the NAMED RANGE to the cell"]
[null,"Security Classification","Public","dms_Classification","Always Public"]
[null,"Jurisdiction",{"$f":"INDEX(dms_JurisdictionList,MATCH(dms_TradingName,dms_TradingName_List))","v":"SA"},"dms_Jurisdiction","=INDEX(dms_JurisdictionList,MATCH(dms_TradingName,dms_TradingName_List))"]
["Relevant for PTRM, RFMs and Reset RINS","$ REAL REFERENCES"]
[null,"Does the named range CRY exist in this file? ",{"$f":"IFERROR(CRY,\"NO\")","v":"NO"}]
[null,"CRY-1  (last full calendar year before CRY)",{"$f":"IFERROR(IF(dms_RPT=\"calendar\",CRY-1,LEFT(CRY,4)),\"CRY not present\")","v":"CRY not present"},"dms_Cal_Year_B4_CRY","'=IF(dms_RPT=\"financial\",VALUE(LEFT(dms_SingleYear_FinalYear_Result,4)),VALUE(LEFT(dms_SingleYear_FinalYear_Result,4)-1))"]
[null,"Dollar $ real month",{"$f":"INDEX(dms_RPTMonth_List,MATCH(dms_TradingName,dms_TradingName_List))","v":"June"},"dms_RPTMonth","=INDEX(dms_RPTMonth_List,MATCH(dms_TradingName,dms_TradingName_List))"]
[null,"Dollar $ real  (the last month before the FRCP_y1)",{"$f":"IF(dms_SingleYearModel=\"yes\",CONCATENATE(dms_RPTMonth)&\" \"&VALUE((LEFT(CRY,2))&RIGHT(CRY,2)),CONCATENATE(dms_RPTMonth)&\" \"&dms_DollarReal_year)","v":"June 2021"},"dms_DollarReal","=IF(SUM(dms_SingleYear_Model)>0,CONCATENATE(dms_RPTMonth)&\" \"&VALUE((LEFT(CRY,2))&RIGHT(CRY,2)),CONCATENATE(dms_RPTMonth)&\" \"&VALUE((LEFT(dms_RYE,2)&RIGHT(dms_RYE,2))))"]
[null,"Dollar $ real previous year (PRCP_y5)",{"$f":"IF(dms_SingleYearModel=\"yes\",CONCATENATE(dms_RPTMonth)&\" \"&VALUE((LEFT(CRY,2))&RIGHT(CRY,2)),CONCATENATE(dms_RPTMonth)&\" \"&dms_Previous_DollarReal_year)","v":"June 2016"},"dms_DollarReal_Prev","=IF(SUM(dms_SingleYear_Model)>0,CONCATENATE(dms_RPTMonth)&\" \"&VALUE(((LEFT(CRY,2))&RIGHT(CRY,2))-1),CONCATENATE(dms_RPTMonth)&\" \"&VALUE(((LEFT(dms_CRCP_FirstYear_Result,2)&RIGHT(dms_CRCP_FirstYear_Result,2))))-1)"]
[null,"PTRM/ RFMs"]
[null,"Form of control",{"$f":"INDEX(dms_FormControl_List,MATCH(dms_TradingName,dms_TradingName_List))","v":"Weighted average price cap"},"dms_FormControl","=INDEX(dms_FormControl_List,MATCH(dms_TradingName,dms_TradingName_List))"]
["All potential values for Regulatory Years or RYEs as calculated","This block works out the various RYE's for ALL RIN types and MODELS"]
[null,"dms_start_year",{"$f":"FRCP_y1","v":"2021-22"},"FRCP_y1 from cover sheet"]
[null,"dms_CRY_start_year",{"$f":"IFERROR(CRY,CRCP_y4)","v":"2019-20"}]
[null,"dms_CRY_start_row",{"$f":"IFERROR(MATCH(dms_CRY_start_year,INDIRECT(dms_RPT),0),0)","v":33}]
[null,"dms_FRCP_start_row",{"$f":"MATCH(dms_start_year,INDIRECT(dms_RPT),0)","v":35},"Uses FRCP_y1 as a start reference"]
[null,"dms_CRCP_start_row",{"$f":"dms_FRCP_start_row-dms_CRCPlength_Num","v":30},"Uses the value in dms_CRCPlength_Num"]
[null,"dms_PRCP_start_row",{"$f":"dms_FRCP_start_row-dms_CRCPlength_Num-dms_PRCPlength_Num","v":25},"Uses the value in dms_CRCPlength_Num and dms_PRCPlength_Num"]
[null,"dms_RYE_start_row",{"$f":"dms_FRCP_start_row+(dms_FRCPlength_Num-1)","v":39},"Uses the value in dms_FRCPlength_Num-1"]
[null,"FRCP_start_year",{"$f":"INDEX(INDIRECT(dms_RPT),dms_FRCP_start_row)","v":"2021-22"},"Converts the FRCP start row to display the year"]
[null,"CRCP_start_year",{"$f":"INDEX(INDIRECT(dms_RPT),dms_CRCP_start_row)","v":"2016-17"},"Converts the CRCP start row to display the year"]
[null,"PRCP_start_year",{"$f":"INDEX(INDIRECT(dms_RPT),dms_PRCP_start_row)","v":"2011-12"},"Converts the PRCP start row to display the year"]
[null,"FRCP_final_year",{"$f":"INDEX(INDIRECT(dms_RPT),dms_FRCP_start_row+dms_FRCPlength_Num-1)","v":"2025-26"},"Finds the FRCP final year"]
[null,"CRCP_final_year",{"$f":"INDEX(INDIRECT(dms_RPT),dms_CRCP_start_row+dms_CRCPlength_Num-1)","v":"2020-21"},"Finds the CRCP final year"]
[null,"PRCP_final_year",{"$f":"INDEX(INDIRECT(dms_RPT),dms_PRCP_start_row+dms_FRCPlength_Num-1)","v":"2015-16"},"Finds the PRCP final year"]
[null,"dms_Reset_final_year",{"$f":"INDEX(INDIRECT(dms_RPT),dms_RYE_start_row)","v":"2025-26"},"For Resets and PTRM/RFMs (same as FRCP_final_year)"]
[null,"dms_SpecifiedYear_final_year",{"$f":"FRY","v":"2025-26"},"FRY from cover sheet"]
[null,"dms_DollarReal_year",{"$f":"LEFT(CRCP_final_year,2)&RIGHT(CRCP_final_year,2)","v":"2021"},"Uses the value in CRCP_final_year"]
[null,"dms_Previous_DollarReal_year",{"$f":"LEFT(PRCP_final_year,2)&RIGHT(PRCP_final_year,2)","v":"2016"},"Uses the value in PRCP_final_year"]
[null,"dms_CRY_RYE",{"$f":"IFERROR(LEFT(CRY,2)&RIGHT(CRY,2),0)","v":0},"For ABC single year RINS"]
[null,"dms_Reset_RYE",{"$f":"IF(dms_Model_Span>1,IF(dms_Model=\"RFM\",(LEFT(dms_DollarReal_year,2)&RIGHT(dms_DollarReal_year,2)),(LEFT(dms_Reset_final_year,2)&RIGHT(dms_Reset_final_year,2))),0)","v":"2026"},"If model span > 1 then uses dms_Reset_RYE otherwise it's a multi year ABC and uses dms_Specified_RYE"]
[null,"dms_Specified_RYE",{"$f":"IF(dms_MultiYear_ResponseFlag=\"Yes\",(LEFT(dms_Specified_FinalYear,2)&RIGHT(dms_Specified_FinalYear,2)),0)","v":0},"If multi year ABC - uses dms_Specified_FinalYear"]
[null,"dms_Model_Span",{"$f":"INDEX(dms_Model_Span_List,MATCH(dms_Model,dms_Model_List))","v":5},"A result of 5 is used to signify that it is more than 1 year span"]
[null,"dms_RYE_result",{"$f":"IF(dms_MultiYear_ResponseFlag=\"yes\",dms_Specified_RYE,(IF(dms_Model_Span>1,dms_Reset_RYE,dms_CRY_RYE)))","v":"2026"},"Nested IF - feeds into dms_RYE"]
[null,"dms_Reset_Span",{"$f":"IF(dms_Reset_RYE>0,CONCATENATE(FRCP_y1,\" to \",FRCP_final_year),0)","v":"2021-22 to 2025-26"},"Reset span of years as text"]
[null,"dms_SpecifiedYear_Span",{"$f":"IF(dms_Specified_RYE>0,CONCATENATE(CRY,\" to \",dms_Specified_FinalYear),0)","v":0},"Multi year ABC span of years as text"]
[null,"dms_Header_Span",{"$f":"IF(dms_MultiYear_Flag=1,dms_SpecifiedYear_Span,IF(dms_Model_Span>1,dms_y1&\" - \"&FRCP_final_year,CRY))","v":"2019-20 - 2025-26"},"NESTED IF - for Sheet Headers"]
[null,"ABC RINS THAT SPAN MULTIPLE YEARS"]
[null,"This is a multi year ABC RIN?","No"]
[null,null,{"$f":"IF(dms_MultiYear_ResponseFlag=\"No\",0,1)","v":0},"dms_MultiYear_Flag","This is set from the answer provided above"]
[null,null,{"$f":"IF(dms_MultiYear_Flag=1,FRY,\"not a Multiple year submission\")","v":"not a Multiple year submission"},"dms_Specified_FinalYear","The result here is returned to dms_CRCP_FinalYear_Result if response to Q in C73 is \"yes\" and dms_MultiYear_Flag is set to 1"]
[null," Start year for 5.2 in Multi year ABC RINS",{"$f":"IFERROR(IF(dms_MultiYear_Flag=1,FRY,CRY),\"not an ABC\")","v":"not an ABC"},"dms_0502_Inst_Year","=IF(dms_MultiYear_Flag=1,FRY,CRY)",null,"For single year RINS this is CRY - multi year RINS need to start a the end of the span of years (ie. FRY)"]
[null,"WHAT IS THE RYE?"]
[null,"Reg Period Lengths"]
[null,"PRCP length in years",{"$f":"INDEX(dms_PRCPlength_List,MATCH(dms_TradingName,dms_TradingName_List))","v":5},"dms_PRCPlength_Num","=INDEX(dms_PRCPlength_List,MATCH(dms_TradingName,dms_TradingName_List))"]
[null,"CRCP length in years",{"$f":"INDEX(dms_CRCPlength_List,MATCH(dms_TradingName,dms_TradingName_List))","v":5},"dms_CRCPlength_Num","=INDEX(dms_CRCPlength_List,MATCH(dms_TradingName,dms_TradingName_List))"]
[null,"FRCP length in years",{"$f":"INDEX(dms_FRCPlength_List,MATCH(dms_TradingName,dms_TradingName_List))","v":5},"dms_FRCPlength_Num","=INDEX(dms_FRCPlength_List,MATCH(dms_TradingName,dms_TradingName_List))"]
[null,"Single year RIN?"]
[null,"Single Year ABC RIN ?",{"$f":"IF(dms_Model=\"EB\",1,0)","v":0},"dms_EB"]
[null,null,{"$f":"IF(dms_Model=\"CA\",1,0)","v":0},"dms_CA","=dms_SingleYear_Model"]
[null,null,{"$f":"IF(dms_Model=\"ARR\",1,0)","v":0},"dms_ARR"]
[null,"Is this a single Year ABC RIN?",{"$f":"IF(SUM(dms_SingleYear_Model)=1,\"yes\",\"no\")","v":"no"},"dms_SingleYearModel","=IF(SUM(dms_SingleYear_Model)=1,\"yes\",\"no\")"]
[null,"Single Year Final Year Result",{"$f":"IF(AND(dms_SingleYearModel=\"yes\",dms_MultiYear_Flag=0),CRY,0)","v":0},"dms_SingleYear_FinalYear_Result","=IFERROR(IF(SUM(dms_SingleYear_Model)<>0,(INDIRECT(dms_SingleYear_FinalYear_Ref)),\"not a single year RIN\"),\"CRY not present\")"]
[null,"Multi year RIN?"]
[]
[null,"Multi Year Reset/Model?",{"$f":"IF(dms_Model_Span>1,\"yes\",\"no\")","v":"yes"}]
[null,"Final year result for Reset/Model",{"$f":"IF(dms_Model_Span>1,dms_Reset_final_year,0)","v":"2025-26"},"dms_MultiYear_FinalYear_Result"]
[]
[null,"Multi Year ABC RIN?",{"$f":"IF(dms_MultiYear_Flag=1,\"yes\",\"no\")","v":"no"},"dms_MultiYear_ABC_RIN"]
[null,"Final year result for ABC multi year",{"$f":"IF(dms_MultiYear_Flag=1,C50,0)","v":0}]
[]
[null,"EB RINS"]
[null,"Calendar Year for table 3.6 data",{"$f":"IFERROR(IF(dms_Segment=\"Transmission\",dms_Cal_Year_B4_CRY,CRY),\"CRY not present\")","v":"CRY not present"},"dms_0306_Year","=IF(dms_Segment=\"Transmission\",dms_Cal_Year_B4_CRY,CRY)"]
[null,"CA RINS"]
[null,"Find how many rows in tables 6.3 sustained interruptions?",null,null,"dms_060301_MaxRows only returns a valid value when cover sheet is attached to a CA file"]
[null,null,{"$f":"IF(dms_Model<>\"CA\",\"not a CA\",\"Is a CA\")","v":"not a CA"},null,"=IF(dms_Model<>\"CA\",\"not a CA\",\"Is a CA\")"]
[null,"dms_060301_Avg_Duration_Sustained_Int_Values present?",{"$f":"IFERROR(IF(INDEX(dms_060301_Avg_Duration_Sustained_Int_Values,1,1)<>\"\",\"yes\",\"no\"),\"no\")","v":"no"},"dms_060301_checkvalue","=IFERROR(IF(INDEX(dms_060301_Avg_Duration_Sustained_Int_Values,1,1)<>\"\",\"yes\",\"no\"),\"no\")"]
[null,null,{"$f":"IF(AND(dms_Model=\"CA\",(dms_060301_checkvalue=\"no\")),\"error - NR not present\",\"no errors\")","v":"no errors"},null,"=IF(AND(dms_Model=\"CA\",(dms_060301_checkvalue=\"no\")),\"error - NR not present\",\"no errors\")"]
[null,"Table 6.3.1 - last row reference",{"$f":"IFERROR(IF(dms_Model=\"CA\",LOOKUP(2,1/(dms_060301_Avg_Duration_Sustained_Int_Values<>\"\"),(ROW(dms_060301_Avg_Duration_Sustained_Int_Values))),\"not a CA\"),\"6.3 not present\")","v":"not a CA"},"dms_060301_LastRow","=IFERROR(IF(dms_Model=\"CA\",LOOKUP(2,1/(dms_060301_Avg_Duration_Sustained_Int_Values<>\"\"),(ROW(dms_060301_Avg_Duration_Sustained_Int_Values))),\"not a CA\"),\"6.3 not present\")"]
[null,"Table 6.3.1 - max number rows",{"$f":"IFERROR(IF(dms_Model=\"CA\",(dms_060301_LastRow-15),\"not a CA\"),\"error\")","v":"not a CA"},"dms_060301_MaxRows","=IFERROR(IF(dms_Model=\"CA\",(dms_060301_LastRow-15),\"not a CA\"),\"error\")"]
[null,"Table 6.6.3 - Public lighting repair - no. business days",{"$f":"INDEX(dms_663_List,MATCH(dms_TradingName,dms_TradingName_List))","v":5},"dms_663","=INDEX(dms_663_List,MATCH(dms_TradingName,dms_TradingName_List))"]
[null,"ARR or RESET RINS"]
[null,"How many rows in tables 6.1 or 6.7?  (leap year?)","insert dms_LeapYear NR if required",null,"'dms_LeapYear is used to determine dms_060701_Max_Rows BUT it is only found on worksheet 6.1 or 6.7 and the date value in the cell is used to determine whether it is a leap year"]
[null,"Is dms_LeapYear named range present?",{"$f":"IFERROR(IF(dms_LeapYear,\"yes\"),\"no\")","v":"no"}]
[null,"Table 6.7.1 - includes a leap year?",{"$f":"\nIFERROR(IF(MONTH(DATE(YEAR(dms_LeapYear),2,29))=2,\"is a leap year\",\"not a leap year\"),\n\"dms_LeapYear not present\")","v":"dms_LeapYear not present"},"dms_LeapYear_Result","=IFERROR(IF(MONTH(DATE(YEAR(dms_LeapYear),2,29))=2,\"is a leap year\",\"not a leap year\"),\"dms_LeapYear not present\")"]
[null,"MaxRows if Reset and leap year",{"$f":"IF(dms_LeapYear_Result=\"is a leap year\",1827,1826)","v":1826},"dms_060701_Reset_MaxRows","=IF(dms_LeapYear_Result=\"is a leap year\",1827,1826)",null,null,"number of days present in Reset RIN table"]
[null,"MaxRows if ARR and leap year",{"$f":"IF(dms_LeapYear_Result=\"is a leap year\",366,365)","v":365},"dms_060701_ARR_MaxRows","=IF(dms_LeapYear_Result=\"is a leap year\",366,365)",null,null,"number of days present in ARR RIN table"]
[null,"Table 6.7.1 - Max Rows (leap year/ non leap year)",{"$f":"IF(dms_Model=\"ARR\",dms_060701_ARR_MaxRows,IF(dms_Model=\"Reset\",dms_060701_Reset_MaxRows,\"not a relevant RIN type\"))","v":1826},"dms_060701_MaxRows","=IF(dms_Model=\"ARR\",dms_060701_ARR_MaxRows,IF(dms_Model=\"Reset\",dms_060701_Reset_MaxRows,\"not a relevant RIN type\"))"]
[null,"How many columns in 6.7?   (4 or 5 feeder categories)",{"$f":"IF(dms_FifthFeeder_flag_NSP=\"NO\",\"This NSP has only 4 feeder categories\",\"This NSP has 5 feeder categories\")","v":"This NSP has only 4 feeder categories"}]
[null,"Table 6.7.1 - Last column (# of feeder categories > 4)",{"$f":"IF(dms_FifthFeeder_flag_NSP=\"NO\",10,12)","v":10},"dms_060701_MaxCols","=IF(dms_FifthFeeder_flag_NSP=\"NO\",8,10)"]
[null,"Table 6.7.1 - Number of offset rows",{"$f":"IF(dms_Model=\"ARR\",15,9)","v":9},"dms_060701_OffsetRows","=IF(dms_Model=\"ARR\",15,9)"]
[null,"Start date for telephone answering in 6.1 or 6.7?",null,null,"Using 060101 as naming standard not 060701 for start dates"]
[null,"Table 6.1.1 and 6.7.1 - Start Date as Text",{"$f":"IF(dms_SingleYearModel=\"yes\",(CONCATENATE(IF(LEN(CRY)=4,\"1-Jan-\",\"1-Jul-\"),LEFT(CRY,4))),(CONCATENATE(IF(LEN(PRCP_y4)=4,\"1-Jan-\",\"1-Jul-\"),LEFT(PRCP_y4,4))))","v":"1-Jul-2014"},"dms_060101_StartDateTxt","=IF(SUM(dms_SingleYear_Model)>1,(CONCATENATE(IF(LEN(CRY)=4,\"1-Jan-\",\"1-Jul-\"),LEFT(CRY,4))),(CONCATENATE(IF(LEN(CRCP_y4)=4,\"1-Jan-\",\"1-Jul-\"),LEFT(CRCP_y4,4))))"]
[null,"Table 6.1.1 and 6.7.1 - Start Date as Date Value",{"$f":"DATEVALUE(dms_060701_StartDateTxt)","v":41821},"dms_060101_StartDateVal","=DATEVALUE(dms_060701_StartDateTxt)"]
[null,"ARRs"]
[null,"How many rows in table 6.8?","insert dms_060801_StartCell NR if required",null,"dms_060801_StartCell is only found on worksheet 6.8 and is used to determine the starting date for the date range"]
[null,"Is dms_060801_StartCell named range present?","yes",null,"=IFERROR(IF((ROW(dms_060801_StartCell)-1)=1,\"yes\",\"yes\"),\"no\")"]
[null,"Table 6.8 - Number of offset rows",12,"dms_0608_OffsetRows","=IFERROR(IF(dms_Model=\"ARR\",(ROW(dms_060801_StartCell)-1),\"not an ARR\"),\"6.8 error\")"]
[null,"Table 6.8 - Last row","0","dms_0608_LastRow","=IFERROR(IF(dms_060801_StartCell<>\"\",IF(dms_Model=\"ARR\",(LOOKUP(2,1/(dms_060801_01_Values<>\"\"),(ROW(dms_060801_01_Values)))),\"not an ARR\"),0),\"0\")"]
[null,"Table 6.8 - MaxRows",{"$f":"IFERROR(IF(dms_Model=\"ARR\",(MAX(0,dms_0608_LastRow-dms_0608_OffsetRows)),\"not an ARR\"),\"0\")","v":"not an ARR"},"dms_060801_MaxRows","=IFERROR(IF(dms_Model=\"ARR\",(MAX(0,dms_0608_LastRow-dms_0608_OffsetRows)),\"not an ARR\"),\"0\")"]
[null,"TNSP RESET RINS"]
[null,"Table 7.9.4 only appears in TNSPs Reset RIN"]
[null,"Table 7.9.4 - first year",{"$f":"LEFT(PRCP_y3,4)","v":"2013"},"dms_070904_Start_Year","=LEFT(PRCP_y3,4)"]
[]
[null,"MISC"]
[null,"Distribution Determination Reference",{"$f":"INDEX(dms_DeterminationRef_List,MATCH(dms_TradingName,dms_TradingName_List))","v":"distribution determination"},"dms_DeterminationRef"]
[null,"Public lighting NSP?",{"$f":"INDEX(dms_Public_Lighting_List,MATCH(dms_TradingName,dms_TradingName_List))","v":"NO"},"dms_Public_Lighting","=INDEX(dms_Public_Lighting_List,MATCH(dms_TradingName,dms_TradingName_List))"]
[null,"CBD Feeder for this business",{"$f":"INDEX(dms_CBD_flag,MATCH(dms_TradingName,dms_TradingName_List))","v":"NO"},"dms_CBD_flag_NSP"]
[null,"Urban Feeder for this business",{"$f":"INDEX(dms_Urban_flag,MATCH(dms_TradingName,dms_TradingName_List))","v":"NO"},"dms_Urban_flag_NSP"]
[null,"Short rural Feeder for this business",{"$f":"INDEX(dms_ShortRural_flag,MATCH(dms_TradingName,dms_TradingName_List))","v":"NO"},"dms_ShortRural_flag_NSP"]
[null,"Long rural Feeder for this business",{"$f":"INDEX(dms_LongRural_flag,MATCH(dms_TradingName,dms_TradingName_List))","v":"NO"},"dms_LongRural_flag_NSP"]
[null,"Fifth Feeder Category (eg. TasNetworks (D))",{"$f":"INDEX(dms_FeederType_5_flag,MATCH(dms_TradingName,dms_TradingName_List))","v":"NO"},"dms_FifthFeeder_flag_NSP","=INDEX(dms_FeederType_5_flag,MATCH(dms_TradingName,dms_TradingName_List))"]
[]
[null,"DISCARD FILES"]
[null,"discard this record?","NO","dms_DISCARD","If record is to be discarded from DB set this flag to YES"]
[]
[null,"SUBSET FILES"]
[null,"Is this Submission File a Subset File","NO","dms_Partial"]
[]
[]
[null,"REGULATORY YEARS FOR MULTI RYE SUBMISSIONS"]
[null,"Multiple RYE flag","NO","dms_Multi_RYE_flag"]
[null,null,"Manually specify RYE","Named ranges to apply"]
[null,null,2013,"dms_RYE_01"]
[null,null,2014,"dms_RYE_02"]
[null,null,2015,"dms_RYE_03"]
[null,null,2016,"dms_RYE_04"]
[null,null,2017,"dms_RYE_05"]
[null,null,2018,"dms_RYE_06"]
[null,null,2019,"dms_RYE_07"]
[null,null,2020,"dms_RYE_08"]
[null,null,2021,"dms_RYE_09"]

{"sheet":"Instructions","index":4,"n_rows":27,"n_cols":4,"rows_kept":27,"cut":false,"hidden":false,"merged":[[7,1,8,1],[7,2,7,3],[8,2,8,4],[1,1,1,4],[2,1,2,4],[3,1,3,4],[4,1,4,4],[5,2,5,4],[18,1,24,1],[18,2,18,4],[26,2,26,4],[10,2,10,4],[12,1,14,1],[12,2,12,4],[13,2,13,3],[14,2,14,4],[16,2,16,4]]}
[]
[null,{"$f":"CONCATENATE(dms_Sector,\" \",dms_Segment,\" \", \"Pipeline Service Provider\")","v":"Gas Distribution Pipeline Service Provider"}]
[null,{"$f":"IF(dms_Model=\"Reset\",\"Regulatory Proposal RIN Template\",\"Annual Reporting RIN\")","v":"Regulatory Proposal RIN Template"}]
[null,{"$f":"CONCATENATE(\"This template is to be used by \",dms_TradingNameFull,\" to fulfil its reporting obligations to the AER.\")","v":"This template is to be used by Australian Gas Networks Limited (reporting data for SA) to fulfil its reporting obligations to the AER."}]
[null,"INSTRUCTIONS"]
[null,"GENERAL","Complete the Business & other details worksheet before entering data or values in any other worksheets. The Business & other details worksheet is linked to other worksheets within the workbook and automatically generates certain column headings and conditional formatting."]
[]
[null,"CONFIDENTIAL INFORMATION","\nPlease use the macro at the top of each \nworksheet to identify confidential information\nin the confidential workbook. \n\n"]
[null,null,"-Do this by selecting the cell or cells that contain confidential information and then run the Mark selection as CONFIDENTIAL macro. This will format the cells a specific colour that is identified by the AER's database which in turn marks that information as confidential.\n\n-To reverse this, select the cell or cells and run the Return selection to NON-CONFIDENTIAL macro."]
[]
[null,"RESPONSES","\nPlease return two (2) files to the AER: \n\n1. A confidential version which must contain a complete set of all responses with confidential information marked using the Mark selection CONFIDENTIAL macro and which has been completed using the locked template file provided by the AER. \n\n2. A public version with confidential information either removed completely or aggregated in some form together with writtten consent to disclose the public version of the response.\n\nUse the drop down box on the Business and other details worksheet to identify the file as either confidential ('consolidated') or public. "]
[]
[null,"AMENDMENTS","\nIf an NSP wishes to correct data previously submitted to the AER it should resubmit that data using the original completed submission as the starting point. Please make any necessary changes to the data. Data that is not being amended should be left unchanged. \n\nNSPs must identify the reason for the amendments in the Amendment Reason box on the  Business and other details worksheet. NSPs may provide further details regarding any amendments in the Amendments worksheet. \n\n."]
[null,null,"NSP may use Amended Data macro \nto highlight cells that contain amended data.\nNB: if data is also CONFIDENTIAL, re-apply \nthe Confidentiality macro after applying the \nAmended macro"]
[null,null,"Please resubmit two (2) files - a confidential version and a public version of the amended submission to the AER"]
[]
[null,"UNITS OF MEASURE","\nAll amounts are to be unrounded and reported on a one for one basis: that is 1000 is to be entered as '1000'. Applicable units of measure may be identified in the table column headings or row descriptors.\n\n"]
[]
[null,"INPUT / NON-INPUT CELLS"]
[null,null,null,"Yellow = Input cell (mandatory)"]
[null,null,null,"Darker yellow = input cell (mandatory)"]
[null,null,null,"Orange = input cell (if data available)"]
[null,null,null,"Grey = Not applicable/No inputs required"]
[null,null,null," \nPLEASE DO NOT ENTER TEXT into cells that are to contain numeric data."]
[]
[]
[null,"NAVIGATION","\nMany tables in the worksheets have been \"grouped\" to allow for easy navigation. To ungroup or group data use the outline symbols in the left margin (for Row groupings) or above the columns (for column groupings). \n\n\n\n"]

{"sheet":"CONTENTS","index":5,"n_rows":36,"n_cols":4,"rows_kept":36,"cut":false,"hidden":false,"merged":[[6,2,6,3]]}
[null,{"$f":"INDEX(dms_Worksheet_List,MATCH(dms_Model,dms_Model_List))","v":"REGULATORY REPORTING STATEMENT"}]
[null,{"$f":"INDEX(dms_TradingNameFull_List,MATCH(dms_TradingName,dms_TradingName_List))","v":"Australian Gas Networks Limited (reporting data for SA)"}]
[null,{"$f":"dms_Header_Span","v":"2019-20 - 2025-26"}]
[]
[]
[]
[null,null,"CONTENTS"]
[]
[null,null,"SUBMISSION","Business & other details"]
[]
[null,null,"EXPENDITURE","E1. Expenditure Summary"]
[null,null,null,"E2. Mains Repex"]
[null,null,null,"E3. Mains Augex"]
[null,null,null,"E4. Meter replacement"]
[null,null,null,"E5. New Connections"]
[null,null,null,"E6. Non-network"]
[null,null,null,"E10. Overheads"]
[null,null,null,"E12. ICT"]
[null,null,null,"E13. Other capex"]
[null,null,null,"E17. Step changes"]
[null,null,null,"E20. Opex"]
[null,null,null,"E21. ARS"]
[null,null,null,"E25. Escalators"]
[]
[null,null,"NETWORK","N1. Demand"]
[null,null,null,"N2. Network characteristcs"]
[]
[null,null,"SERVICE","S1.1. Customer numbers - by customer type"]
[null,null,null,"S1.2. Customer numbers - by tariff"]
[null,null,null,"S10. Supply Quality"]
[null,null,null,"S11. Network reliability"]
[]
[null,null,"FINANCIAL","F2. Capex"]
[null,null,null,"F3. Revenue"]
[]
[null,null,"ADMIN","Additional disclosures"]

{"sheet":"Business & other details","index":6,"n_rows":74,"n_cols":79,"rows_kept":74,"cut":false,"hidden":false,"merged":[[0,7,2,15],[3,21,3,57],[6,21,6,75],[8,16,8,93],[15,21,15,35],[15,37,15,58],[23,21,23,35],[23,37,23,58],[23,60,23,66],[23,68,23,89],[24,21,24,35],[24,37,24,51],[24,60,24,66],[24,68,24,82],[16,21,16,35],[16,37,16,48],[22,21,22,35],[22,37,22,58],[22,60,22,66],[22,68,22,89],[31,21,31,35],[31,37,31,58],[31,60,31,66],[31,68,31,89],[32,21,32,35],[32,37,32,58],[32,60,32,66],[32,68,32,89],[25,21,25,35],[25,37,25,40],[25,49,25,51],[25,60,25,66],[25,68,25,71],[25,80,25,82],[33,21,33,35],[33,37,33,58],[33,60,33,66],[33,68,33,89],[41,25,41,34],[41,37,41,44],[41,46,41,53],[41,55,41,62],[41,64,41,71],[41,73,41,80],[45,25,45,34],[45,37,45,44],[45,46,45,53],[45,55,45,62],[45,64,45,71],[45,73,45,80],[42,37,42,44],[42,46,42,53],[42,55,42,62],[42,64,42,71],[42,73,42,80],[43,37,43,44],[43,46,43,53],[43,55,43,62],[43,64,43,71],[43,73,43,80],[46,37,46,44],[46,46,46,53],[46,55,46,62],[46,64,46,71],[46,73,46,80],[47,37,47,44],[47,46,47,53],[47,55,47,62],[47,64,47,71],[47,73,47,80],[50,64,50,71],[50,73,50,80],[51,37,51,44],[51,46,51,53],[51,55,51,62],[51,64,51,71],[51,73,51,80],[49,25,49,34],[49,37,49,44],[49,46,49,53],[49,55,49,62],[49,64,49,71],[49,73,49,80],[53,25,53,34],[53,37,53,44],[55,25,55,34],[55,37,55,44],[61,25,61,34],[61,37,61,52],[50,37,50,44],[50,46,50,53],[50,55,50,62],[69,25,71,34],[69,37,71,81],[73,25,73,34],[73,37,73,52],[63,25,63,34],[63,37,63,52],[65,25,65,34],[65,37,65,52],[67,25,67,34],[67,37,67,52]]}
[null,null,null,null,null,null,null,null,null,null,null,null,null,null,null,null,null,null,null,null,null,{"$f":"INDEX(dms_Worksheet_List,MATCH(dms_Model,dms_Model_List))","v":"REGULATORY REPORTING STATEMENT"}]
[null,null,null,null,null,null,null,null,null,null,null,null,null,null,null,null,null,null,null,null,null,{"$f":"INDEX(dms_TradingNameFull_List,MATCH(dms_TradingName,dms_TradingName_List))","v":"Australian Gas Networks Limited (reporting data for SA)"}]
[null,null,null,null,null,null,null,null,null,null,null,null,null,null,null,null,null,null,null,null,null,{"$f":"dms_Header_Span","v":"2019-20 - 2025-26"}]
[null,null,null,null,null,null,null,null,null,null,null,null,null,null,null,null,null,null,null,null,null,"BUSINESS & OTHER DETAILS"]
[]
[null,null,null,null,null,null,null,null,null,null,null,null,null,null,null,null,null,null,null,null,null,"INSTRUCTIONS"]
[null,null,null,null,null,null,null,null,null,null,null,null,null,null,null,null,null,null,null,null,null,"Complete the following business details regulatory template before entering data or values in any other regulatory template. This regulatory template is linked to other cells within the spreadsheet and automatically generates column headings and conditional formatting to distinguish business specific input and non-input cells. "]
[]
[null,null,null,null,null,null,null,null,null,null,null,null,null,null,null,null,"SUBMISSION PARTICULARS INPUT SHEET"]
[]
[]
[null,null,null,null,null,null,null,null,null,null,null,null,null,null,null,null,null,null,null,null,null,"ENTITY DETAILS"]
[]
[null,null,null,null,null,null,null,null,null,null,null,null,null,null,null,null,null,null,null,null,null,"Business Name"]
[]
[null,null,null,null,null,null,null,null,null,null,null,null,null,null,null,null,null,null,null,null,null,"Short name",null,null,null,null,null,null,null,null,null,null,null,null,null,null,null,"AGN (SA)"]
[null,null,null,null,null,null,null,null,null,null,null,null,null,null,null,null,null,null,null,null,null,"ACN/ABN",null,null,null,null,null,null,null,null,null,null,null,null,null,null,null,{"$f":"INDEX(dms_ABN_List,MATCH(dms_TradingName,dms_TradingName_List))","v":19078551685}]
[]
[]
[]
[null,null,null,null,null,null,null,null,null,null,null,null,null,null,null,null,null,null,null,null,null,"Business Address",null,null,null,null,null,null,null,null,null,null,null,null,null,null,null,null,null,null,null,null,null,null,null,null,null,null,null,null,null,null,null,null,null,null,null,null,null,null,null,null,null,null,null,null,null,null,"Postal Address"]
[]
[null,null,null,null,null,null,null,null,null,null,null,null,null,null,null,null,null,null,null,null,null,"Address 1",null,null,null,null,null,null,null,null,null,null,null,null,null,null,null,{"$f":"INDEX(dms_Addr1_List,MATCH(dms_TradingName,dms_TradingName_List))","v":"Level 6"},null,null,null,null,null,null,null,null,null,null,null,null,null,null,null,null,null,null,null,null,null,null,"Address 1",null,null,null,null,null,null,null,{"$f":"INDEX(dms_PAddr1_List,MATCH(dms_TradingName,dms_TradingName_List))","v":"PO Box 6468"}]
[null,null,null,null,null,null,null,null,null,null,null,null,null,null,null,null,null,null,null,null,null,"Address 2",null,null,null,null,null,null,null,null,null,null,null,null,null,null,null,{"$f":"IF(ISBLANK(INDEX(dms_Addr2_List,MATCH(dms_TradingName,dms_TradingName_List))),\"\",(INDEX(dms_Addr2_List,MATCH(dms_TradingName,dms_TradingName_List))))","v":"400 King William Street"},null,null,null,null,null,null,null,null,null,null,null,null,null,null,null,null,null,null,null,null,null,null,"Address 2",null,null,null,null,null,null,null,{"$f":"IF(ISBLANK(INDEX(dms_PAddr2_List,MATCH(dms_TradingName,dms_TradingName_List))),\"\",(INDEX(dms_PAddr2_List,MATCH(dms_TradingName,dms_TradingName_List))))","v":"Halifax Street"}]
[null,null,null,null,null,null,null,null,null,null,null,null,null,null,null,null,null,null,null,null,null,"Suburb",null,null,null,null,null,null,null,null,null,null,null,null,null,null,null,{"$f":"INDEX(dms_Suburb_List,MATCH(dms_TradingName,dms_TradingName_List))","v":"ADELAIDE"},null,null,null,null,null,null,null,null,null,null,null,null,null,null,null,null,null,null,null,null,null,null,"Suburb",null,null,null,null,null,null,null,{"$f":"INDEX(dms_PSuburb_List,MATCH(dms_TradingName,dms_TradingName_List))","v":"ADELAIDE"}]
[null,null,null,null,null,null,null,null,null,null,null,null,null,null,null,null,null,null,null,null,null,"State",null,null,null,null,null,null,null,null,null,null,null,null,null,null,null,{"$f":"INDEX(dms_State_List,MATCH(dms_TradingName,dms_TradingName_List))","v":"SA"},null,null,null,null,null,null,null,null,null,"Post code",null,null,null,null,null,null,null,null,null,null,null,null,"State",null,null,null,null,null,null,null,{"$f":"INDEX(dms_PState_List,MATCH(dms_TradingName,dms_TradingName_List))","v":"SA"},null,null,null,null,null,null,null,null,null,"Post code"]
[]
[null,null,null,null,null,null,null,null,null,null,null,null,null,null,null,null,null,null,null,null,null,null,null,null,null,null,null,null,null,null,null,null,null,null,null,null,null,null,null,null,null,null,null,null,null,null,null,null,null,null,null,null,"`"]
[]
[null,null,null,null,null,null,null,null,null,null,null,null,null,null,null,null,null,null,null,null,null,"Contact Names"]
[]
[null,null,null,null,null,null,null,null,null,null,null,null,null,null,null,null,null,null,null,null,null,"Name",null,null,null,null,null,null,null,null,null,null,null,null,null,null,null,"Peter Bucki",null,null,null,null,null,null,null,null,null,null,null,null,null,null,null,null,null,null,null,null,null,null,"Name",null,null,null,null,null,null,null,"-- enter name --"]
[null,null,null,null,null,null,null,null,null,null,null,null,null,null,null,null,null,null,null,null,null,"Phone",null,null,null,null,null,null,null,null,null,null,null,null,null,null,null,84181112,null,null,null,null,null,null,null,null,null,null,null,null,null,null,null,null,null,null,null,null,null,null,"Phone",null,null,null,null,null,null,null,"-- enter phone number --"]
[null,null,null,null,null,null,null,null,null,null,null,null,null,null,null,null,null,null,null,null,null,"Email",null,null,null,null,null,null,null,null,null,null,null,null,null,null,null,"peter.bucki@agig.com.au",null,null,null,null,null,null,null,null,null,null,null,null,null,null,null,null,null,null,null,null,null,null,"Email",null,null,null,null,null,null,null,"-- enter email address --"]
[]
[]
[]
[]
[null,null,null,null,null,null,null,null,null,null,null,null,null,null,null,null,"REGULATORY PERIODS"]
[]
[]
[null,null,null,null,null,null,null,null,null,null,null,null,null,null,null,null,null,null,null,null,null,null,null,null,null,"Forthcoming period",null,null,null,null,null,null,null,null,null,null,null,"2021-22",null,null,null,null,null,null,null,null,{"$f":"FRCP_y2","v":"2022-23"},null,null,null,null,null,null,null,null,{"$f":"FRCP_y3","v":"2023-24"},null,null,null,null,null,null,null,null,{"$f":"FRCP_y4","v":"2024-25"},null,null,null,null,null,null,null,null,{"$f":"FRCP_y5","v":"2025-26"}]
[null,null,null,null,null,null,null,null,null,null,null,null,null,null,null,null,null,null,null,null,null,null,null,null,null,null,null,null,null,null,null,null,null,null,null,null,null,{"$f":"FRCP_y6","v":"2026-27"},null,null,null,null,null,null,null,null,{"$f":"FRCP_y7","v":"2027-28"},null,null,null,null,null,null,null,null,{"$f":"FRCP_y8","v":"2028-29"},null,null,null,null,null,null,null,null,{"$f":"FRCP_y9","v":"2029-30"},null,null,null,null,null,null,null,null,{"$f":"FRCP_y10","v":"2030-31"}]
[null,null,null,null,null,null,null,null,null,null,null,null,null,null,null,null,null,null,null,null,null,null,null,null,null,null,null,null,null,null,null,null,null,null,null,null,null,{"$f":"FRCP_y11","v":"2031-32"},null,null,null,null,null,null,null,null,{"$f":"FRCP_y12","v":"2032-33"},null,null,null,null,null,null,null,null,{"$f":"FRCP_y13","v":"2033-34"},null,null,null,null,null,null,null,null,{"$f":"FRCP_y14","v":"2034-35"},null,null,null,null,null,null,null,null,{"$f":"FRCP_y15","v":"2035-36"}]
[]
[null,null,null,null,null,null,null,null,null,null,null,null,null,null,null,null,null,null,null,null,null,null,null,"RESETS",null,"Current period",null,null,null,null,null,null,null,null,null,null,null,{"$f":"CRCP_y1","v":"2016-17"},null,null,null,null,null,null,null,null,{"$f":"CRCP_y2","v":"2017-18"},null,null,null,null,null,null,null,null,{"$f":"CRCP_y3","v":"2018-19"},null,null,null,null,null,null,null,null,{"$f":"CRCP_y4","v":"2019-20"},null,null,null,null,null,null,null,null,{"$f":"CRCP_y5","v":"2020-21"}]
[null,null,null,null,null,null,null,null,null,null,null,null,null,null,null,null,null,null,null,null,null,null,null,null,null,null,null,null,null,null,null,null,null,null,null,null,null,{"$f":"CRCP_y6","v":"2021-22"},null,null,null,null,null,null,null,null,{"$f":"CRCP_y7","v":"2022-23"},null,null,null,null,null,null,null,null,{"$f":"CRCP_y8","v":"2023-24"},null,null,null,null,null,null,null,null,{"$f":"CRCP_y9","v":"2024-25"},null,null,null,null,null,null,null,null,{"$f":"CRCP_y10","v":"2025-26"}]
[null,null,null,null,null,null,null,null,null,null,null,null,null,null,null,null,null,null,null,null,null,null,null,null,null,null,null,null,null,null,null,null,null,null,null,null,null,{"$f":"CRCP_y11","v":"2026-27"},null,null,null,null,null,null,null,null,{"$f":"CRCP_y12","v":"2027-28"},null,null,null,null,null,null,null,null,{"$f":"CRCP_y13","v":"2028-29"},null,null,null,null,null,null,null,null,{"$f":"CRCP_y14","v":"2029-30"},null,null,null,null,null,null,null,null,{"$f":"CRCP_y15","v":"2030-31"}]
[]
[null,null,null,null,null,null,null,null,null,null,null,null,null,null,null,null,null,null,null,null,null,null,null,null,null,"Previous period",null,null,null,null,null,null,null,null,null,null,null,{"$f":"PRCP_y1","v":"2011-12"},null,null,null,null,null,null,null,null,{"$f":"PRCP_y2","v":"2012-13"},null,null,null,null,null,null,null,null,{"$f":"PRCP_y3","v":"2013-14"},null,null,null,null,null,null,null,null,{"$f":"PRCP_y4","v":"2014-15"},null,null,null,null,null,null,null,null,{"$f":"PRCP_y5","v":"2015-16"}]
[null,null,null,null,null,null,null,null,null,null,null,null,null,null,null,null,null,null,null,null,null,null,null,null,null,null,null,null,null,null,null,null,null,null,null,null,null,{"$f":"PRCP_y6","v":"2016-17"},null,null,null,null,null,null,null,null,{"$f":"PRCP_y7","v":"2017-18"},null,null,null,null,null,null,null,null,{"$f":"PRCP_y8","v":"2018-19"},null,null,null,null,null,null,null,null,{"$f":"PRCP_y9","v":"2019-20"},null,null,null,null,null,null,null,null,{"$f":"PRCP_y10","v":"2020-21"}]
[null,null,null,null,null,null,null,null,null,null,null,null,null,null,null,null,null,null,null,null,null,null,null,null,null,null,null,null,null,null,null,null,null,null,null,null,null,{"$f":"PRCP_y11","v":"2021-22"},null,null,null,null,null,null,null,null,{"$f":"PRCP_y12","v":"2022-23"},null,null,null,null,null,null,null,null,{"$f":"PRCP_y13","v":"2023-24"},null,null,null,null,null,null,null,null,{"$f":"PRCP_y14","v":"2024-25"},null,null,null,null,null,null,null,null,{"$f":"PRCP_y15","v":"2025-26"}]
[]
[null,null,null,null,null,null,null,null,null,null,null,null,null,null,null,null,null,null,null,null,null,null,null,null,null,"Commencing year",null,null,null,null,null,null,null,null,null,null,null,"2019-20"]
[null,null,null,null,null,null,null,null,null,null,null,null,null,null,null,null,null,null,null,null,null,null,null,"ANNUAL RINS"]
[null,null,null,null,null,null,null,null,null,null,null,null,null,null,null,null,null,null,null,null,null,null,null,null,null,"Final year",null,null,null,null,null,null,null,null,null,null,null,"2025-26"]
[]
[]
[]
[null,null,null,null,null,null,null,null,null,null,null,null,null,null,null,null,"SUBMISSION DETAILS"]
[]
[null,null,null,null,null,null,null,null,null,null,null,null,null,null,null,null,null,null,null,null,null,null,null,null,null,"RIN type",null,null,null,null,null,null,null,null,null,null,null,{"$f":"INDIRECT(dms_Model)","v":"Regulatory Reporting (Reset)"}]
[]
[null,null,null,null,null,null,null,null,null,null,null,null,null,null,null,null,null,null,null,null,null,null,null,null,null,"Source",null,null,null,null,null,null,null,null,null,null,null,"Regulatory proposal"]
[]
[null,null,null,null,null,null,null,null,null,null,null,null,null,null,null,null,null,null,null,null,null,null,null,"THIS FILE",null,"Data Quality",null,null,null,null,null,null,null,null,null,null,null,"Consolidated"]
[]
[null,null,null,null,null,null,null,null,null,null,null,null,null,null,null,null,null,null,null,null,null,null,null,null,null,"Confidentiality Status",null,null,null,null,null,null,null,null,null,null,null,"Public"]
[]
[null,null,null,null,null,null,null,null,null,null,null,null,null,null,null,null,null,null,null,null,null,null,null,null,null,"Amended RIN \nAmendment Reason",null,null,null,null,null,null,null,null,null,null,null,"."]
[]
[]
[]
[null,null,null,null,null,null,null,null,null,null,null,null,null,null,null,null,null,null,null,null,null,null,null,null,null,"Submission Date",null,null,null,null,null,null,null,null,null,null,null,"2020-07-01",null,null,null,null,null,null,null,null,null,null,null,null,null,null,null,null,null,null,"Please enter date this file submitted to AER"]

{"sheet":"E1. Expenditure Summary","index":7,"n_rows":189,"n_cols":9,"rows_kept":189,"cut":false,"hidden":false,"merged":[[162,2,162,8],[163,2,163,8],[8,2,8,8],[9,2,9,8],[55,2,55,8],[56,2,56,8],[147,2,147,8],[99,2,99,8],[100,2,100,8],[114,2,114,8],[115,2,115,8],[146,2,146,8]]}
[null,{"$f":"INDEX(dms_Worksheet_List,MATCH(dms_Model,dms_Model_List))","v":"REGULATORY REPORTING STATEMENT"}]
[null,{"$f":"INDEX(dms_TradingNameFull_List,MATCH(dms_TradingName,dms_TradingName_List))","v":"Australian Gas Networks Limited (reporting data for SA)"}]
[null,{"$f":"dms_Header_Span","v":"2019-20 - 2025-26"}]
[null,"E1. EXPENDITURE SUMMARY"]
[]
[]
[null,"E1.1 - CAPEX"]
[null,"E1.1.1 - REFERENCE SERVICES"]
[null,null,"EXPENDITURE"]
[null,null,{"$f":"CONCATENATE(\"$0's, real \",dms_DollarReal)","v":"$0's, real June 2021"}]
[null,null,{"$f":"CRCP_y4","v":"2019-20"},{"$f":"CRCP_y5","v":"2020-21"},{"$f":"FRCP_y1","v":"2021-22"},{"$f":"FRCP_y2","v":"2022-23"},{"$f":"FRCP_y3","v":"2023-24"},{"$f":"FRCP_y4","v":"2024-25"},{"$f":"FRCP_y5","v":"2025-26"}]
[null,"Connections",21438611.15256156,49814736.556975357,26763087.612647347,27619776.680455085,27643865.927639876,26729445.713046167,26379129.361123685]
[null,"Mains replacement",59983180.396559715,55510367.567647733,51315195.65454451,51561344.51351323,54359144.020241305,55269024.656361505,48488837.200121537]
[null,"Mains augmentation",2567833.9853639533,1527961.1507250438,3597618.0854984168,1216426.7636656705,0,0,0]
[null,"Telemetry",109276.443961786,484439.6551893744,521713.11053173983,358132.67563050496,360251.08093930967,324309.07129431376,268788.20917434618]
[null,"Meter replacement",3563542.9696961204,3357679.2048133099,3183411.2412452889,3105013.9226672845,4504920.9291907623,3758412.9631190151,4430487.2546021491]
[null,"ICT",9022536.3822341375,23115474.971777681,2167895.2554134433,5105052.4962991066,10319709.836269302,10364127.894524764,5534545.5922057834]
[null,"Capitalised network overheads",9387852.1075141858,8323408.6122542787,9530382.6529776305,9690783.1879507247,9758168.633105468,9731237.0046472531,9472490.5285784844]
[null,"Capitalised corporate overheads"]
[null,"Other capex",7682803.3423324721,14489267.715588961,13006441.770311221,20006673.471711677,15320596.651257448,14649924.274591427,12415671.548912266]
[null,"Capital contributions included in the above",3969787.0467316033,3353820.8925049128,0,0,680242.74605930189,883826.13625965139,693107.87533474946]
[null,"Total (less capital contributions)",{"$f":"SUM(C12:C20)-C21","v":109785849.73349233},153269514.54246685,110085745.38316959,118663203.71189329,121586414.33258417,119942655.4413248,106296841.8193835]
[]
[null,"E1.1.2 - NON-REFERENCE SERVICES"]
[]
[]
[]
[]
[]
[]
[]
[]
[]
[]
[]
[]
[]
[]
[]
[]
[]
[]
[]
[]
[]
[]
[]
[]
[]
[null,"Capital contributions included in the above"]
[null,"Total",{"$f":"SUM(C25:C49)-C50","v":0},0,0,0,0,0,0]
[]
[]
[null,"E1.2 - OPEX"]
[null,"E1.2.1 - REFERENCE SERVICES"]
[null,null,"EXPENDITURE"]
[null,null,{"$f":"CONCATENATE(\"$0's, real \",dms_DollarReal)","v":"$0's, real June 2021"}]
[null,null,{"$f":"CRCP_y4","v":"2019-20"},{"$f":"CRCP_y5","v":"2020-21"},{"$f":"FRCP_y1","v":"2021-22"},{"$f":"FRCP_y2","v":"2022-23"},{"$f":"FRCP_y3","v":"2023-24"},{"$f":"FRCP_y4","v":"2024-25"},{"$f":"FRCP_y5","v":"2025-26"}]
[null,{"$f":"'E20. Opex'!B44","v":"repairs and maintenance"},{"$f":"'E20. Opex'!F44","v":43357040.100000009},{"$f":"'E20. Opex'!G44","v":43958938.080598027},{"$f":"'E20. Opex'!H44","v":44235516.059540547},{"$f":"'E20. Opex'!I44","v":44647639.101255521},{"$f":"'E20. Opex'!J44","v":45151308.528453767},{"$f":"'E20. Opex'!K44","v":45649775.572518542},{"$f":"'E20. Opex'!L44","v":46106446.227526642}]
[null,{"$f":"'E20. Opex'!B45","v":"marketing and retail incentives"},{"$f":"'E20. Opex'!F45","v":5278996.8000000007},{"$f":"'E20. Opex'!G45","v":5352281.726880963},{"$f":"'E20. Opex'!H45","v":5385956.8638926344},{"$f":"'E20. Opex'!I45","v":5436135.4787935065},{"$f":"'E20. Opex'!J45","v":5497460.4513540147},{"$f":"'E20. Opex'!K45","v":5558152.000510836},{"$f":"'E20. Opex'!L45","v":5613754.572108929}]
[null,{"$f":"'E20. Opex'!B46","v":"debt raising"},{"$f":"'E20. Opex'!F46","v":1209087},{"$f":"'E20. Opex'!G46","v":1212370.3441061461},{"$f":"'E20. Opex'!H46","v":859896.91038351331},{"$f":"'E20. Opex'!I46","v":866952.17463698599},{"$f":"'E20. Opex'!J46","v":876502.83596260974},{"$f":"'E20. Opex'!K46","v":885806.77459380287},{"$f":"'E20. Opex'!L46","v":895757.60783955466}]
[null,{"$f":"'E20. Opex'!B47","v":"equity raising"},{"$f":"'E20. Opex'!F47","v":0},{"$f":"'E20. Opex'!G47","v":0},{"$f":"'E20. Opex'!H47","v":0},{"$f":"'E20. Opex'!I47","v":0},{"$f":"'E20. Opex'!J47","v":0},{"$f":"'E20. Opex'!K47","v":0},{"$f":"'E20. Opex'!L47","v":0}]
[null,{"$f":"'E20. Opex'!B48","v":"unaccounted for gas"},{"$f":"'E20. Opex'!F48","v":8859178.0941212829},{"$f":"'E20. Opex'!G48","v":8854274.4724426232},{"$f":"'E20. Opex'!H48","v":9443174.4000000004},{"$f":"'E20. Opex'!I48","v":9443174.4000000004},{"$f":"'E20. Opex'!J48","v":9443174.4000000004},{"$f":"'E20. Opex'!K48","v":9443174.4000000004},{"$f":"'E20. Opex'!L48","v":9443174.4000000004}]
[null,{"$f":"'E20. Opex'!B49","v":"jurisdictional charges"},{"$f":"'E20. Opex'!F49","v":0},{"$f":"'E20. Opex'!G49","v":0},{"$f":"'E20. Opex'!H49","v":0},{"$f":"'E20. Opex'!I49","v":0},{"$f":"'E20. Opex'!J49","v":0},{"$f":"'E20. Opex'!K49","v":0},{"$f":"'E20. Opex'!L49","v":0}]
[null,{"$f":"'E20. Opex'!B50","v":"GSL payments"},{"$f":"'E20. Opex'!F50","v":0},{"$f":"'E20. Opex'!G50","v":0},{"$f":"'E20. Opex'!H50","v":0},{"$f":"'E20. Opex'!I50","v":0},{"$f":"'E20. Opex'!J50","v":0},{"$f":"'E20. Opex'!K50","v":0},{"$f":"'E20. Opex'!L50","v":0}]
[null,{"$f":"'E20. Opex'!B51","v":"other opex"},{"$f":"'E20. Opex'!F51","v":9358128.4499999993},{"$f":"'E20. Opex'!G51","v":9488041.3454199973},{"$f":"'E20. Opex'!H51","v":13275669.584822878},{"$f":"'E20. Opex'!I51","v":13640519.169940909},{"$f":"'E20. Opex'!J51","v":13919948.207036102},{"$f":"'E20. Opex'!K51","v":14117409.571969522},{"$f":"'E20. Opex'!L51","v":14280106.395895462}]
[null,"Total",{"$f":"SUM(C59:C66)","v":68062430.444121286},68865905.969447762,73200213.818639576,74034420.324626923,74888394.422806486,75654318.319592699,76339239.203370586]
[]
[null,"E1.2.2 - NON-REFERENCE SERVICES"]
[null,{"$f":"IF(ISBLANK('E20. Opex'!B58),\"\",'E20. Opex'!B58)","v":"Special account investigation"}]
[null,{"$f":"IF(ISBLANK('E20. Opex'!B59),\"\",'E20. Opex'!B59)","v":"No access"}]
[null,{"$f":"IF(ISBLANK('E20. Opex'!B60),\"\",'E20. Opex'!B60)","v":"Same day service premium"}]
[null,{"$f":"IF(ISBLANK('E20. Opex'!B61),\"\",'E20. Opex'!B61)","v":"MFX unable to be completed"}]
[null,{"$f":"IF(ISBLANK('E20. Opex'!B62),\"\",'E20. Opex'!B62)","v":""}]
[null,{"$f":"IF(ISBLANK('E20. Opex'!B63),\"\",'E20. Opex'!B63)","v":""}]
[null,{"$f":"IF(ISBLANK('E20. Opex'!B64),\"\",'E20. Opex'!B64)","v":""}]
[null,{"$f":"IF(ISBLANK('E20. Opex'!B65),\"\",'E20. Opex'!B65)","v":""}]
[null,{"$f":"IF(ISBLANK('E20. Opex'!B66),\"\",'E20. Opex'!B66)","v":""}]
[null,{"$f":"IF(ISBLANK('E20. Opex'!B67),\"\",'E20. Opex'!B67)","v":""}]
[null,{"$f":"IF(ISBLANK('E20. Opex'!B68),\"\",'E20. Opex'!B68)","v":""}]
[null,{"$f":"IF(ISBLANK('E20. Opex'!B69),\"\",'E20. Opex'!B69)","v":""}]
[null,{"$f":"IF(ISBLANK('E20. Opex'!B70),\"\",'E20. Opex'!B70)","v":""}]
[null,{"$f":"IF(ISBLANK('E20. Opex'!B71),\"\",'E20. Opex'!B71)","v":""}]
[null,{"$f":"IF(ISBLANK('E20. Opex'!B72),\"\",'E20. Opex'!B72)","v":""}]
[null,{"$f":"IF(ISBLANK('E20. Opex'!B73),\"\",'E20. Opex'!B73)","v":""}]
[null,{"$f":"IF(ISBLANK('E20. Opex'!B74),\"\",'E20. Opex'!B74)","v":""}]
[null,{"$f":"IF(ISBLANK('E20. Opex'!B75),\"\",'E20. Opex'!B75)","v":""}]
[null,{"$f":"IF(ISBLANK('E20. Opex'!B76),\"\",'E20. Opex'!B76)","v":""}]
[null,{"$f":"IF(ISBLANK('E20. Opex'!B77),\"\",'E20. Opex'!B77)","v":""}]
[null,{"$f":"IF(ISBLANK('E20. Opex'!B78),\"\",'E20. Opex'!B78)","v":""}]
[null,{"$f":"IF(ISBLANK('E20. Opex'!B79),\"\",'E20. Opex'!B79)","v":""}]
[null,{"$f":"IF(ISBLANK('E20. Opex'!B80),\"\",'E20. Opex'!B80)","v":""}]
[null,{"$f":"IF(ISBLANK('E20. Opex'!B81),\"\",'E20. Opex'!B81)","v":""}]
[null,{"$f":"IF(ISBLANK('E20. Opex'!B82),\"\",'E20. Opex'!B82)","v":""}]
[null,"Total",{"$f":"SUM(C70:C94)","v":0},{"$f":"SUM(D70:D94)","v":0},0,0,0,0,0]
[]
[]
[null,"E1.3 - CAPCONS"]
[null,"E1.3.1 - REFERENCE SERVICES"]
[null,null,"EXPENDITURE"]
[null,null,{"$f":"CONCATENATE(\"$0's, real \",dms_DollarReal)","v":"$0's, real June 2021"}]
[null,null,{"$f":"CRCP_y4","v":"2019-20"},{"$f":"CRCP_y5","v":"2020-21"},{"$f":"FRCP_y1","v":"2021-22"},{"$f":"FRCP_y2","v":"2022-23"},{"$f":"FRCP_y3","v":"2023-24"},{"$f":"FRCP_y4","v":"2024-25"},{"$f":"FRCP_y5","v":"2025-26"}]
[null,"Connections"]
[null,"Mains replacement"]
[null,"Mains augmentation"]
[null,"Telemetry"]
[null,"Meter replacement"]
[null,"ICT"]
[null,"Capitalised network overheads"]
[null,"Capitalised corporate overheads"]
[null,"Other capex",3969787.0467316033,3353820.8925049128,0,0,680242.74605930189,883826.13625965139,693107.87533474946]
[null,"Total",{"$f":"SUM(C103:C111)","v":3969787.0467316033},3353820.8925049128,0,0,680242.74605930189,883826.13625965139,693107.87533474946]
[]
[null,"E1.3.2 - NON-REFERENCE SERVICES"]
[null,null,"EXPENDITURE"]
[null,null,{"$f":"CONCATENATE(\"$0's, real \",dms_DollarReal)","v":"$0's, real June 2021"}]
[null,null,{"$f":"CRCP_y4","v":"2019-20"},{"$f":"CRCP_y5","v":"2020-21"},{"$f":"FRCP_y1","v":"2021-22"},{"$f":"FRCP_y2","v":"2022-23"},{"$f":"FRCP_y3","v":"2023-24"},{"$f":"FRCP_y4","v":"2024-25"},{"$f":"FRCP_y5","v":"2025-26"}]
[]
[]
[]
[]
[]
[]
[]
[]
[]
[]
[]
[]
[]
[]
[]
[]
[]
[]
[]
[]
[]
[]
[]
[]
[null,"Total",{"$f":"SUM(C118:C141)","v":0},0,0,0,0,0,0]
[]
[]
[null,"E1.4 - CAPITALISED OVERHEADS"]
[null,"E1.4.1 - REFERENCE SERVICES"]
[null,null,"EXPENDITURE"]
[null,null,{"$f":"CONCATENATE(\"$0's, real \",dms_DollarReal)","v":"$0's, real June 2021"}]
[null,null,{"$f":"CRCP_y4","v":"2019-20"},{"$f":"CRCP_y5","v":"2020-21"},{"$f":"FRCP_y1","v":"2021-22"},{"$f":"FRCP_y2","v":"2022-23"},{"$f":"FRCP_y3","v":"2023-24"},{"$f":"FRCP_y4","v":"2024-25"},{"$f":"FRCP_y5","v":"2025-26"}]
[null,"Connections",2110881.3968116431,3312139.8156475136,2536537.6743562948,2456192.7341156928,2397628.028959326,2341329.4802707303,2562372.4732171157]
[null,"Mains replacement",5906043.9465812175,3690837.5173629145,4863524.3036459628,4585286.8841240965,4714717.0976130776,4841215.1214415114,4710028.9019775651]
[null,"Mains augmentation",252833.2153250433,101592.84809808682,219271.55104951109,108175.33440137358,0,0,0]
[null,"Telemetry",10759.540859581424,32209.984055543573,49446.647532700939,31848.297902985269,31245.560638440245,28407.412465346839,26109.106896025722]
[null,"Meter replacement",350872.38198131497,223249.25817311392,301715.65640177147,276125.06518129428,390724.10191635671,329213.07699572889,430361.38261874125]
[null,"ICT",0,0,205467.62275724285,453986.03304284404,895056.63277824293,907831.70130996488,537605.58519923501]
[null,"Other capex",756461.62595538353,963379.1889171073,1354419.197234147,1779168.8391824374,1328797.2112000252,1283240.2121639713,1206013.0786698007]
[null,"Capital contributions included in the above"]
[null,"Total (less capital contributions)",{"$f":"SUM(C150:C156)-C157","v":9387852.107514184},8323408.6122542787,9530382.6529776305,9690783.1879507247,9758168.633105468,9731237.0046472531,9472490.5285784844]
[]
[]
[]
[null,"E1.4.2 - NON-REFERENCE SERVICES"]
[null,null,"EXPENDITURE"]
[null,null,{"$f":"CONCATENATE(\"$0's, real \",dms_DollarReal)","v":"$0's, real June 2021"}]
[null,null,{"$f":"CRCP_y4","v":"2019-20"},{"$f":"CRCP_y5","v":"2020-21"},{"$f":"FRCP_y1","v":"2021-22"},{"$f":"FRCP_y2","v":"2022-23"},{"$f":"FRCP_y3","v":"2023-24"},{"$f":"FRCP_y4","v":"2024-25"},{"$f":"FRCP_y5","v":"2025-26"}]
[]
[]
[]
[]
[]
[]
[]
[]
[]
[]
[]
[]
[]
[]
[]
[]
[]
[]
[]
[]
[]
[]
[null,"Capital contributions included in the above"]
[null,"Total (less capital contributions)",{"$f":"SUM(C166:C187)-C188","v":0},0,0,0,0,0,0]

{"sheet":"E2. Mains Repex","index":8,"n_rows":816,"n_cols":10,"rows_kept":816,"cut":false,"hidden":false,"merged":[[790,3,790,9],[228,3,228,9],[229,3,229,9],[316,3,316,9],[317,3,317,9],[373,3,373,9],[374,3,374,9],[432,3,432,9],[433,3,433,9],[465,3,465,9],[466,3,466,9],[789,3,789,9],[172,3,172,9],[62,3,62,9],[63,3,63,9],[78,3,78,9],[79,3,79,9],[171,3,171,9]]}
[null,{"$f":"INDEX(dms_Worksheet_List,MATCH(dms_Model,dms_Model_List))","v":"REGULATORY REPORTING STATEMENT"}]
[null,{"$f":"INDEX(dms_TradingNameFull_List,MATCH(dms_TradingName,dms_TradingName_List))","v":"Australian Gas Distribution Co. "}]
[null,{"$f":"dms_Header_Span","v":"2019-20 - 2025-26"}]
[null,"E2. MAINS REPLACEMENT"]
[]
[]
[]
[null,"Please list all projects here:"]
[]
[]
[]
[]
[]
[]
[]
[]
[]
[]
[]
[]
[]
[]
[]
[]
[]
[]
[]
[]
[]
[]
[]
[]
[]
[]
[]
[]
[]
[]
[]
[]
[]
[]
[]
[]
[]
[]
[]
[]
[]
[]
[]
[]
[]
[]
[]
[]
[]
[]
[]
[]
[null,"E2.1 - CAPEX"]
[null,"E2.1.1 - PROACTIVE - BY PROJECT"]
[null,null,null,"EXPENDITURE"]
[null,null,null,{"$f":"CONCATENATE(\"$0's, real \",dms_DollarReal)","v":"$0's, real June 2021"}]
[null,null,null,{"$f":"CRCP_y4","v":"2019-20"},{"$f":"CRCP_y5","v":"2020-21"},{"$f":"FRCP_y1","v":"2021-22"},{"$f":"FRCP_y2","v":"2022-23"},{"$f":"FRCP_y3","v":"2023-24"},{"$f":"FRCP_y4","v":"2024-25"},{"$f":"FRCP_y5","v":"2025-26"}]
[null,"A. DIRECT INTERNAL LABOUR EXPENDITURE"]
[]
[]
[]
[]
[]
[null,{"$f":"IF(ISBLANK(dms_E2_Projects_35),\"\",dms_E2_Projects_35)","v":""}]
[null,{"$f":"IF(ISBLANK(dms_E2_Projects_49),\"\",dms_E2_Projects_49)","v":""}]
[null,{"$f":"IF(ISBLANK(dms_E2_Projects_50),\"\",dms_E2_Projects_50)","v":""}]
[null,"Other projects with expenditure of less than $500,000"]
[null,null,"Total",{"$f":"SUM(D67:D75)","v":0},0,0,0,0,0,0]
[]
[null,"B. DIRECT CONTRACTOR EXPENDITURE"]
[null,null,null,"EXPENDITURE"]
[null,null,null,{"$f":"CONCATENATE(\"$0's, real \",dms_DollarReal)","v":"$0's, real June 2021"}]
[null,null,null,{"$f":"CRCP_y4","v":"2019-20"},{"$f":"CRCP_y5","v":"2020-21"},{"$f":"FRCP_y1","v":"2021-22"},{"$f":"FRCP_y2","v":"2022-23"},{"$f":"FRCP_y3","v":"2023-24"},{"$f":"FRCP_y4","v":"2024-25"},{"$f":"FRCP_y5","v":"2025-26"}]
[null,"Bower Road-Trunk SIB"]
[null,"Churchill Road Trunk-Trunk SIB"]
[null,"Kelly Rd-Trunk SIB"]
[null,"Angle Park-HDPE Class 250"]
[null,"Ascot Park-HDPE Class 250"]
[null,"Black Forest-HDPE Class 250"]
[null,"Croydon Park-HDPE Class 250"]
[null,"Davaren Park-HDPE Class 250"]
[null,"Evandale-HDPE Class 250"]
[null,"Ferryden Park-HDPE Class 250"]
[null,"Hendon-HDPE Class 250"]
[null,"Highbury-HDPE Class 250"]
[null,"Hilton Mile End B-HDPE Class 250"]
[null,"Ingle Farm-HDPE Class 250"]
[null,"Mitcham-HDPE Class 250"]
[null,"Newton PE-HDPE Class 250"]
[null,"North Haven-HDPE Class 250"]
[null,"Park Holme-HDPE Class 250"]
[null,"Plympton Park-HDPE Class 250"]
[null,"Port Adelaide-HDPE Class 250"]
[null,"Redwood Park-HDPE Class 250"]
[null,"Rostrevor Magill-HDPE Class 250"]
[null,"Surrey Downs-HDPE Class 250"]
[null,"West Croydon-HDPE Class 250"]
[null,"West Lakes Delfin Island-HDPE Class 250"]
[null,"West Lakes-HDPE Class 250"]
[null,"HDPE_Reallocation-HDPE Class 250"]
[null,"HDPE_Reallocation-HDPE Class 575"]
[null,"Aberfoyle Park-HDPE Class 575"]
[null,"Allenby Gardens-HDPE Class 575"]
[null,"Andrews Farm-HDPE Class 575"]
[null,"Angle Vale-HDPE Class 575"]
[null,"Belair-HDPE Class 575"]
[null,"Blakeview-HDPE Class 575"]
[null,"Coromandel Valley-HDPE Class 575"]
[null,"Eastwood-HDPE Class 575"]
[null,"Edwardstown-HDPE Class 575"]
[null,"Elizabeth North-HDPE Class 575"]
[null,"Elizabeth Park A-HDPE Class 575"]
[null,"Elizabeth Vale-HDPE Class 575"]
[null,"Evanston Park-HDPE Class 575"]
[null,"Flagstaff Hill-HDPE Class 575"]
[null,"Fullarton-HDPE Class 575"]
[null,"Gawler East-HDPE Class 575"]
[null,"Glenunga-HDPE Class 575"]
[null,"Gulfview Heights-HDPE Class 575"]
[null,"Hawthorndene-HDPE Class 575"]
[null,"Kings Park-HDPE Class 575"]
[null,"Kurralta Park A-HDPE Class 575"]
[null,"Malvern-HDPE Class 575"]
[null,"Melrose Park-HDPE Class 575"]
[null,"Morphett Vale A-HDPE Class 575"]
[null,"Norwood A-HDPE Class 575"]
[null,"Pennington-HDPE Class 575"]
[null,"Salisbury Heights A-HDPE Class 575"]
[null,"Torrens Park A-HDPE Class 575"]
[null,"Torrensville B-HDPE Class 575"]
[null,"Unley-HDPE Class 575"]
[null,"Westbourne Park-HDPE Class 575"]
[null,"Woodcroft-HDPE Class 575"]
[null,"Cheltenham Parade-CI - Block PI"]
[null,"Fulham-CI - Block PI"]
[null,"Fulham Gardens-CI - Block PI"]
[null,"Hilton Mile End A-CI - Block PI"]
[null,"Brooklyn Park-CI - Block PI"]
[null,"Kilburn-CI - Block PI"]
[null,"Medindie-CI - Block PI"]
[null,"Newton CI-CI - Block PI"]
[null,"Torrensville A-CI - Block PI"]
[null,"Tranmere-CI - Block PI"]
[null,"Vale Park-CI - Block PI"]
[null,"Churchill Road Trunk-CI - Block PI"]
[null,"CBD Block"]
[null,"Mains Replacement - General Block Replacement"]
[null,"Mains Replacement - North Adelaide Block Replacement"]
[null,"Mains Replacement - HDPE Replacement Class 250"]
[null,"HDPE 575 DN40 MP"]
[null,"HDPE 575 DN40 HP"]
[null,{"$f":"IF(ISBLANK(dms_E2_Projects_43),\"\",dms_E2_Projects_43)","v":""}]
[null,{"$f":"IF(ISBLANK(dms_E2_Projects_44),\"\",dms_E2_Projects_44)","v":""}]
[null,{"$f":"IF(ISBLANK(dms_E2_Projects_45),\"\",dms_E2_Projects_45)","v":""}]
[null,{"$f":"IF(ISBLANK(dms_E2_Projects_46),\"\",dms_E2_Projects_46)","v":""}]
[null,{"$f":"IF(ISBLANK(dms_E2_Projects_47),\"\",dms_E2_Projects_47)","v":""}]
[null,{"$f":"IF(ISBLANK(dms_E2_Projects_48),\"\",dms_E2_Projects_48)","v":""}]
[null,{"$f":"IF(ISBLANK(dms_E2_Projects_49),\"\",dms_E2_Projects_49)","v":""}]
[null,{"$f":"IF(ISBLANK(dms_E2_Projects_50),\"\",dms_E2_Projects_50)","v":""}]
[null,"Other projects with expenditure of less than $500,000"]
[null,null,"Total",{"$f":"SUM(D82:D168)","v":0},{"$f":"SUM(E82:E168)","v":0},0,0,0,0,0]
[]
[null,"C. OTHER INTERNAL DIRECT EXPENDITURE"]
[null,null,null,"EXPENDITURE"]
[null,null,null,{"$f":"CONCATENATE(\"$0's, real \",dms_DollarReal)","v":"$0's, real June 2021"}]
[null,null,null,{"$f":"CRCP_y4","v":"2019-20"},{"$f":"CRCP_y5","v":"2020-21"},{"$f":"FRCP_y1","v":"2021-22"},{"$f":"FRCP_y2","v":"2022-23"},{"$f":"FRCP_y3","v":"2023-24"},{"$f":"FRCP_y4","v":"2024-25"},{"$f":"FRCP_y5","v":"2025-26"}]
[null,{"$f":"IF(ISBLANK(dms_E2_Projects_01),\"\",dms_E2_Projects_01)","v":""}]
[null,{"$f":"IF(ISBLANK(dms_E2_Projects_02),\"\",dms_E2_Projects_02)","v":""}]
[null,{"$f":"IF(ISBLANK(dms_E2_Projects_03),\"\",dms_E2_Projects_03)","v":""}]
[null,{"$f":"IF(ISBLANK(dms_E2_Projects_04),\"\",dms_E2_Projects_04)","v":""}]
[null,{"$f":"IF(ISBLANK(dms_E2_Projects_05),\"\",dms_E2_Projects_05)","v":""}]
[null,{"$f":"IF(ISBLANK(dms_E2_Projects_06),\"\",dms_E2_Projects_06)","v":""}]
[null,{"$f":"IF(ISBLANK(dms_E2_Projects_07),\"\",dms_E2_Projects_07)","v":""}]
[null,{"$f":"IF(ISBLANK(dms_E2_Projects_08),\"\",dms_E2_Projects_08)","v":""}]
[null,{"$f":"IF(ISBLANK(dms_E2_Projects_09),\"\",dms_E2_Projects_09)","v":""}]
[null,{"$f":"IF(ISBLANK(dms_E2_Projects_10),\"\",dms_E2_Projects_10)","v":""}]
[null,{"$f":"IF(ISBLANK(dms_E2_Projects_11),\"\",dms_E2_Projects_11)","v":""}]
[null,{"$f":"IF(ISBLANK(dms_E2_Projects_12),\"\",dms_E2_Projects_12)","v":""}]
[null,{"$f":"IF(ISBLANK(dms_E2_Projects_13),\"\",dms_E2_Projects_13)","v":""}]
[null,{"$f":"IF(ISBLANK(dms_E2_Projects_14),\"\",dms_E2_Projects_14)","v":""}]
[null,{"$f":"IF(ISBLANK(dms_E2_Projects_15),\"\",dms_E2_Projects_15)","v":""}]
[null,{"$f":"IF(ISBLANK(dms_E2_Projects_16),\"\",dms_E2_Projects_16)","v":""}]
[null,{"$f":"IF(ISBLANK(dms_E2_Projects_17),\"\",dms_E2_Projects_17)","v":""}]
[null,{"$f":"IF(ISBLANK(dms_E2_Projects_18),\"\",dms_E2_Projects_18)","v":""}]
[null,{"$f":"IF(ISBLANK(dms_E2_Projects_18),\"\",dms_E2_Projects_18)","v":""}]
[null,{"$f":"IF(ISBLANK(dms_E2_Projects_19),\"\",dms_E2_Projects_19)","v":""}]
[null,{"$f":"IF(ISBLANK(dms_E2_Projects_20),\"\",dms_E2_Projects_20)","v":""}]
[null,{"$f":"IF(ISBLANK(dms_E2_Projects_21),\"\",dms_E2_Projects_21)","v":""}]
[null,{"$f":"IF(ISBLANK(dms_E2_Projects_22),\"\",dms_E2_Projects_22)","v":""}]
[null,{"$f":"IF(ISBLANK(dms_E2_Projects_23),\"\",dms_E2_Projects_23)","v":""}]
[null,{"$f":"IF(ISBLANK(dms_E2_Projects_24),\"\",dms_E2_Projects_24)","v":""}]
[null,{"$f":"IF(ISBLANK(dms_E2_Projects_25),\"\",dms_E2_Projects_26)","v":""}]
[null,{"$f":"IF(ISBLANK(dms_E2_Projects_27),\"\",dms_E2_Projects_27)","v":""}]
[null,{"$f":"IF(ISBLANK(dms_E2_Projects_28),\"\",dms_E2_Projects_28)","v":""}]
[null,{"$f":"IF(ISBLANK(dms_E2_Projects_29),\"\",dms_E2_Projects_29)","v":""}]
[null,{"$f":"IF(ISBLANK(dms_E2_Projects_30),\"\",dms_E2_Projects_30)","v":""}]
[null,{"$f":"IF(ISBLANK(dms_E2_Projects_31),\"\",dms_E2_Projects_31)","v":""}]
[null,{"$f":"IF(ISBLANK(dms_E2_Projects_32),\"\",dms_E2_Projects_32)","v":""}]
[null,{"$f":"IF(ISBLANK(dms_E2_Projects_33),\"\",dms_E2_Projects_33)","v":""}]
[null,{"$f":"IF(ISBLANK(dms_E2_Projects_34),\"\",dms_E2_Projects_34)","v":""}]
[null,{"$f":"IF(ISBLANK(dms_E2_Projects_35),\"\",dms_E2_Projects_35)","v":""}]
[null,{"$f":"IF(ISBLANK(dms_E2_Projects_36),\"\",dms_E2_Projects_36)","v":""}]
[null,{"$f":"IF(ISBLANK(dms_E2_Projects_37),\"\",dms_E2_Projects_37)","v":""}]
[null,{"$f":"IF(ISBLANK(dms_E2_Projects_38),\"\",dms_E2_Projects_38)","v":""}]
[null,{"$f":"IF(ISBLANK(dms_E2_Projects_39),\"\",dms_E2_Projects_39)","v":""}]
[null,{"$f":"IF(ISBLANK(dms_E2_Projects_40),\"\",dms_E2_Projects_40)","v":""}]
[null,{"$f":"IF(ISBLANK(dms_E2_Projects_41),\"\",dms_E2_Projects_41)","v":""}]
[null,{"$f":"IF(ISBLANK(dms_E2_Projects_42),\"\",dms_E2_Projects_42)","v":""}]
[null,{"$f":"IF(ISBLANK(dms_E2_Projects_43),\"\",dms_E2_Projects_43)","v":""}]
[null,{"$f":"IF(ISBLANK(dms_E2_Projects_44),\"\",dms_E2_Projects_44)","v":""}]
[null,{"$f":"IF(ISBLANK(dms_E2_Projects_45),\"\",dms_E2_Projects_45)","v":""}]
[null,{"$f":"IF(ISBLANK(dms_E2_Projects_46),\"\",dms_E2_Projects_46)","v":""}]
[null,{"$f":"IF(ISBLANK(dms_E2_Projects_47),\"\",dms_E2_Projects_47)","v":""}]
[null,{"$f":"IF(ISBLANK(dms_E2_Projects_48),\"\",dms_E2_Projects_48)","v":""}]
[null,{"$f":"IF(ISBLANK(dms_E2_Projects_49),\"\",dms_E2_Projects_49)","v":""}]
[null,{"$f":"IF(ISBLANK(dms_E2_Projects_50),\"\",dms_E2_Projects_50)","v":""}]
[null,"Other projects with expenditure of less than $500,000"]
[null,null,"Total",{"$f":"SUM(D175:D225)","v":0},{"$f":"SUM(E175:E225)","v":0},0,0,0,0,0]
[]
[null,"D. TOTAL OVERHEAD EXPENDITURE"]
[null,null,null,"EXPENDITURE"]
[null,null,null,{"$f":"CONCATENATE(\"$0's, real \",dms_DollarReal)","v":"$0's, real June 2021"}]
[null,null,null,{"$f":"CRCP_y4","v":"2019-20"},{"$f":"CRCP_y5","v":"2020-21"},{"$f":"FRCP_y1","v":"2021-22"},{"$f":"FRCP_y2","v":"2022-23"},{"$f":"FRCP_y3","v":"2023-24"},{"$f":"FRCP_y4","v":"2024-25"},{"$f":"FRCP_y5","v":"2025-26"}]
[null,{"$f":"B88","v":"Croydon Park-HDPE Class 250"},null,45912.748286150272,0]
[null,"Davaren Park-HDPE Class 250",null,212211.45862317862,0]
[null,"Evandale-HDPE Class 250",null,102944.87779601902,0]
[null,"Ferryden Park-HDPE Class 250",null,0,2215.5959204264295]
[null,"Hendon-HDPE Class 250",null,878.01547577021859,0]
[null,"Highbury-HDPE Class 250",null,0,88545.822876197082]
[null,"Hilton Mile End B-HDPE Class 250",null,56516.469835104072,0]
[null,"Ingle Farm-HDPE Class 250",null,0,25510.558661247971]
[null,"Mitcham-HDPE Class 250",null,76086.97267661395,0]
[null,"Newton PE-HDPE Class 250",null,0,83864.986424591945]
[null,"North Haven-HDPE Class 250",null,0,26758.78171500934]
[null,"Park Holme-HDPE Class 250",null,114211.32886137343,0]
[null,"Plympton Park-HDPE Class 250",null,48521.907871512085,10921.951720411975]
[null,"Port Adelaide-HDPE Class 250",null,303793.35461649566,29208.419458016022]
[null,"Redwood Park-HDPE Class 250",null,0,16086.474605349638]
[null,"Rostrevor Magill-HDPE Class 250",null,43161.392335230747,0]
[null,"Surrey Downs-HDPE Class 250",null,256715.55114592143,0]
[null,"West Croydon-HDPE Class 250",null,0,34201.3116730615]
[null,"West Lakes Delfin Island-HDPE Class 250",null,0,60928.887811726803]
[null,"West Lakes-HDPE Class 250",null,121304.76967878021,1357.4425709654884]
[null,"HDPE_Reallocation-HDPE Class 250",null,0,42814.050744014945]
[null,"HDPE_Reallocation-HDPE Class 575",null,0,82554.352218142521]
[null,"Aberfoyle Park-HDPE Class 575",null,57764.176037514386,0]
[null,"Allenby Gardens-HDPE Class 575",null,122298.31350662545,0]
[null,"Andrews Farm-HDPE Class 575",null,200591.87770787245,1053.1882016111549]
[null,"Angle Vale-HDPE Class 575",null,8572.2037239671354,0]
[null,"Belair-HDPE Class 575",null,-27726.804498006906,-10063.798370951035]
[null,"Blakeview-HDPE Class 575",null,29058.659735902434,10547.212266498902]
[null,"Coromandel Valley-HDPE Class 575",null,53104.700667361692,0]
[null,"Eastwood-HDPE Class 575",null,44326.563872141174,0]
[null,"Edwardstown-HDPE Class 575",null,45815.820183606171,0]
[null,"Elizabeth North-HDPE Class 575",null,0,96527.432572314763]
[null,"Elizabeth Park A-HDPE Class 575",null,0,51885.743444342661]
[null,"Elizabeth Vale-HDPE Class 575",null,0,92766.411143950798]
[null,"Evanston Park-HDPE Class 575",null,0,65441.772853532711]
[null,"Flagstaff Hill-HDPE Class 575",null,0,46914.654252070301]
[null,"Fullarton-HDPE Class 575",null,48503.746209177145,0]
[null,"Gawler East-HDPE Class 575",null,5521.1453498214623,0]
[null,"Glenunga-HDPE Class 575",null,0,37086.941737084511]
[null,"Gulfview Heights-HDPE Class 575",null,5835.9474969604053,0]
[null,"Hawthorndene-HDPE Class 575",null,154543.6386954411,0]
[null,"Kings Park-HDPE Class 575",null,0,80273.279094950558]
[null,"Kurralta Park A-HDPE Class 575",null,121295.68884761275,0]
[null,"Malvern-HDPE Class 575",null,186774.53545251288,0]
[null,"Melrose Park-HDPE Class 575",null,36928.713414376012,0]
[null,"Morphett Vale A-HDPE Class 575",null,63565.818172286577,0]
[null,"Norwood A-HDPE Class 575",null,0,228163.18256505296]
[null,"Pennington-HDPE Class 575",null,28155.419729111465,0]
[null,"Salisbury Heights A-HDPE Class 575",null,280973.02409639664,19017.68661385771]
[null,"Torrens Park A-HDPE Class 575",null,52426.66527352397,0]
[null,"Torrensville B-HDPE Class 575",null,5932.8096960800804,0]
[null,"Unley-HDPE Class 575",null,0,204615.91797007868]
[null,"Westbourne Park-HDPE Class 575",null,57124.481930828202,71770.100213432073]
[null,"Woodcroft-HDPE Class 575",null,130473.38221420193,0]
[null,"Cheltenham Parade-CI - Block PI",null,95457.697232439488,0]
[null,"Fulham-CI - Block PI",null,66108.450899178031,0]
[null,"Fulham Gardens-CI - Block PI",null,0,82693.414622767363]
[null,"Hilton Mile End A-CI - Block PI",null,0,76119.803256670362]
[null,"Brooklyn Park-CI - Block PI",null,3051.1592722697555,0]
[null,"Kilburn-CI - Block PI",null,0,112258.31350312397]
[null,"Medindie-CI - Block PI",null,829.7861724585473,0]
[null,"Newton CI-CI - Block PI",null,296881.93401493464,0]
[null,"Torrensville A-CI - Block PI",null,318534.16695252486,6829.1155392195406]
[null,"Tranmere-CI - Block PI",null,323409.16071571875,216290.34651394808]
[null,{"$f":"B152","v":"Vale Park-CI - Block PI"},null,0,64789.044859262307]
[null,"Churchill Road Trunk-CI - Block PI",null,0,157594.97398198937]
[null,"CBD Block",null,0,225080.64395161017]
[null,"Mains Replacement - General Block Replacement",null,282827.43071891798,54667.945419085649]
[null,"Mains Replacement - North Adelaide Block Replacement",null,177885.41072080107,120052.34906894658]
[null,"Mains Replacement - HDPE Replacement Class 250",null,140726.54868539175,412636.17354284215]
[null,"HDPE 575 DN40 MP",null,152525.0708250367,214084.01687820026]
[null,"HDPE 575 DN40 HP",null,116688.6805019832,0]
[null,"",null,579094.97437391477,254089.53522188211]
[null,"",null,null,null,2621763.7312670602,2471775.2188961213,2471630.7773635969,2509906.6989134755,2638701.608568884]
[null,"",null,null,null,570091.33609675767,537476.97409420228,527305.08352383971,428376.78625100543,0]
[null,"",null,null,null,157138.83979428251,148149.08204633728,0,0,0]
[null,"",null,null,null,341923.51870244968,322362.41206907947,632523.24030253175,802898.19812164281,894744.531295461]
[null,"",null,null,null,941749.46452017955,887872.90824436059,871069.68410946347,884559.15640395193,936459.62360954355]
[null,{"$f":"IF(ISBLANK(dms_E2_Projects_48),\"\",dms_E2_Projects_48)","v":""}]
[null,{"$f":"IF(ISBLANK(dms_E2_Projects_49),\"\",dms_E2_Projects_49)","v":""}]
[null,{"$f":"IF(ISBLANK(dms_E2_Projects_50),\"\",dms_E2_Projects_50)","v":""}]
[null,"Other projects with expenditure of less than $500,000"]
[null,null,"Total",{"$f":"SUM(D232:D313)","v":5648139.8458030354},{"$f":"SUM(E232:E313)","v":3498154.037316537},4632666.890380729,4367636.5953501007,4502528.7852994315,4625740.8396900753,4469905.7634738889]
[]
[null,"E. RELATED PARTY MARGIN EXPENDITURE"]
[null,null,null,"EXPENDITURE"]
[null,null,null,{"$f":"CONCATENATE(\"$0's, real \",dms_DollarReal)","v":"$0's, real June 2021"}]
[null,null,null,{"$f":"CRCP_y4","v":"2019-20"},{"$f":"CRCP_y5","v":"2020-21"},{"$f":"FRCP_y1","v":"2021-22"},{"$f":"FRCP_y2","v":"2022-23"},{"$f":"FRCP_y3","v":"2023-24"},{"$f":"FRCP_y4","v":"2024-25"},{"$f":"FRCP_y5","v":"2025-26"}]
[null,{"$f":"IF(ISBLANK(dms_E2_Projects_01),\"\",dms_E2_Projects_01)","v":""}]
[null,{"$f":"IF(ISBLANK(dms_E2_Projects_02),\"\",dms_E2_Projects_02)","v":""}]
[null,{"$f":"IF(ISBLANK(dms_E2_Projects_03),\"\",dms_E2_Projects_03)","v":""}]
[null,{"$f":"IF(ISBLANK(dms_E2_Projects_04),\"\",dms_E2_Projects_04)","v":""}]
[null,{"$f":"IF(ISBLANK(dms_E2_Projects_05),\"\",dms_E2_Projects_05)","v":""}]
[null,{"$f":"IF(ISBLANK(dms_E2_Projects_06),\"\",dms_E2_Projects_06)","v":""}]
[null,{"$f":"IF(ISBLANK(dms_E2_Projects_07),\"\",dms_E2_Projects_07)","v":""}]
[null,{"$f":"IF(ISBLANK(dms_E2_Projects_08),\"\",dms_E2_Projects_08)","v":""}]
[null,{"$f":"IF(ISBLANK(dms_E2_Projects_09),\"\",dms_E2_Projects_09)","v":""}]
[null,{"$f":"IF(ISBLANK(dms_E2_Projects_10),\"\",dms_E2_Projects_10)","v":""}]
[null,{"$f":"IF(ISBLANK(dms_E2_Projects_11),\"\",dms_E2_Projects_11)","v":""}]
[null,{"$f":"IF(ISBLANK(dms_E2_Projects_12),\"\",dms_E2_Projects_12)","v":""}]
[null,{"$f":"IF(ISBLANK(dms_E2_Projects_13),\"\",dms_E2_Projects_13)","v":""}]
[null,{"$f":"IF(ISBLANK(dms_E2_Projects_14),\"\",dms_E2_Projects_14)","v":""}]
[null,{"$f":"IF(ISBLANK(dms_E2_Projects_15),\"\",dms_E2_Projects_15)","v":""}]
[null,{"$f":"IF(ISBLANK(dms_E2_Projects_16),\"\",dms_E2_Projects_16)","v":""}]
[null,{"$f":"IF(ISBLANK(dms_E2_Projects_17),\"\",dms_E2_Projects_17)","v":""}]
[null,{"$f":"IF(ISBLANK(dms_E2_Projects_18),\"\",dms_E2_Projects_18)","v":""}]
[null,{"$f":"IF(ISBLANK(dms_E2_Projects_18),\"\",dms_E2_Projects_18)","v":""}]
[null,{"$f":"IF(ISBLANK(dms_E2_Projects_19),\"\",dms_E2_Projects_19)","v":""}]
[null,{"$f":"IF(ISBLANK(dms_E2_Projects_20),\"\",dms_E2_Projects_20)","v":""}]
[null,{"$f":"IF(ISBLANK(dms_E2_Projects_21),\"\",dms_E2_Projects_21)","v":""}]
[null,{"$f":"IF(ISBLANK(dms_E2_Projects_22),\"\",dms_E2_Projects_22)","v":""}]
[null,{"$f":"IF(ISBLANK(dms_E2_Projects_23),\"\",dms_E2_Projects_23)","v":""}]
[null,{"$f":"IF(ISBLANK(dms_E2_Projects_24),\"\",dms_E2_Projects_24)","v":""}]
[null,{"$f":"IF(ISBLANK(dms_E2_Projects_25),\"\",dms_E2_Projects_26)","v":""}]
[null,{"$f":"IF(ISBLANK(dms_E2_Projects_27),\"\",dms_E2_Projects_27)","v":""}]
[null,{"$f":"IF(ISBLANK(dms_E2_Projects_28),\"\",dms_E2_Projects_28)","v":""}]
[null,{"$f":"IF(ISBLANK(dms_E2_Projects_29),\"\",dms_E2_Projects_29)","v":""}]
[null,{"$f":"IF(ISBLANK(dms_E2_Projects_30),\"\",dms_E2_Projects_30)","v":""}]
[null,{"$f":"IF(ISBLANK(dms_E2_Projects_31),\"\",dms_E2_Projects_31)","v":""}]
[null,{"$f":"IF(ISBLANK(dms_E2_Projects_32),\"\",dms_E2_Projects_32)","v":""}]
[null,{"$f":"IF(ISBLANK(dms_E2_Projects_33),\"\",dms_E2_Projects_33)","v":""}]
[null,{"$f":"IF(ISBLANK(dms_E2_Projects_34),\"\",dms_E2_Projects_34)","v":""}]
[null,{"$f":"IF(ISBLANK(dms_E2_Projects_35),\"\",dms_E2_Projects_35)","v":""}]
[null,{"$f":"IF(ISBLANK(dms_E2_Projects_36),\"\",dms_E2_Projects_36)","v":""}]
[null,{"$f":"IF(ISBLANK(dms_E2_Projects_37),\"\",dms_E2_Projects_37)","v":""}]
[null,{"$f":"IF(ISBLANK(dms_E2_Projects_38),\"\",dms_E2_Projects_38)","v":""}]
[null,{"$f":"IF(ISBLANK(dms_E2_Projects_39),\"\",dms_E2_Projects_39)","v":""}]
[null,{"$f":"IF(ISBLANK(dms_E2_Projects_40),\"\",dms_E2_Projects_40)","v":""}]
[null,{"$f":"IF(ISBLANK(dms_E2_Projects_41),\"\",dms_E2_Projects_41)","v":""}]
[null,{"$f":"IF(ISBLANK(dms_E2_Projects_42),\"\",dms_E2_Projects_42)","v":""}]
[null,{"$f":"IF(ISBLANK(dms_E2_Projects_43),\"\",dms_E2_Projects_43)","v":""}]
[null,{"$f":"IF(ISBLANK(dms_E2_Projects_44),\"\",dms_E2_Projects_44)","v":""}]
[null,{"$f":"IF(ISBLANK(dms_E2_Projects_45),\"\",dms_E2_Projects_45)","v":""}]
[null,{"$f":"IF(ISBLANK(dms_E2_Projects_46),\"\",dms_E2_Projects_46)","v":""}]
[null,{"$f":"IF(ISBLANK(dms_E2_Projects_47),\"\",dms_E2_Projects_47)","v":""}]
[null,{"$f":"IF(ISBLANK(dms_E2_Projects_48),\"\",dms_E2_Projects_48)","v":""}]
[null,{"$f":"IF(ISBLANK(dms_E2_Projects_49),\"\",dms_E2_Projects_49)","v":""}]
[null,{"$f":"IF(ISBLANK(dms_E2_Projects_50),\"\",dms_E2_Projects_50)","v":""}]
[null,"Other projects with expenditure of less than $500,000"]
[null,null,"Total",{"$f":"SUM(D320:D370)","v":0},{"$f":"SUM(E320:E370)","v":0},0,0,0,0,0]
[]
[null,"F. CAPITAL CONTRIBUTIONS included in the above"]
[null,null,null,"EXPENDITURE"]
[null,null,null,{"$f":"CONCATENATE(\"$0's, real \",dms_DollarReal)","v":"$0's, real June 2021"}]
[null,null,null,{"$f":"CRCP_y4","v":"2019-20"},{"$f":"CRCP_y5","v":"2020-21"},{"$f":"FRCP_y1","v":"2021-22"},{"$f":"FRCP_y2","v":"2022-23"},{"$f":"FRCP_y3","v":"2023-24"},{"$f":"FRCP_y4","v":"2024-25"},{"$f":"FRCP_y5","v":"2025-26"}]
[null,{"$f":"IF(ISBLANK(dms_E2_Projects_01),\"\",dms_E2_Projects_01)","v":""}]
[null,{"$f":"IF(ISBLANK(dms_E2_Projects_02),\"\",dms_E2_Projects_02)","v":""}]
[null,{"$f":"IF(ISBLANK(dms_E2_Projects_03),\"\",dms_E2_Projects_03)","v":""}]
[null,{"$f":"IF(ISBLANK(dms_E2_Projects_04),\"\",dms_E2_Projects_04)","v":""}]
[null,{"$f":"IF(ISBLANK(dms_E2_Projects_05),\"\",dms_E2_Projects_05)","v":""}]
[null,{"$f":"IF(ISBLANK(dms_E2_Projects_06),\"\",dms_E2_Projects_06)","v":""}]
[null,{"$f":"IF(ISBLANK(dms_E2_Projects_07),\"\",dms_E2_Projects_07)","v":""}]
[null,{"$f":"IF(ISBLANK(dms_E2_Projects_08),\"\",dms_E2_Projects_08)","v":""}]
[null,{"$f":"IF(ISBLANK(dms_E2_Projects_09),\"\",dms_E2_Projects_09)","v":""}]
[null,{"$f":"IF(ISBLANK(dms_E2_Projects_10),\"\",dms_E2_Projects_10)","v":""}]
[null,{"$f":"IF(ISBLANK(dms_E2_Projects_11),\"\",dms_E2_Projects_11)","v":""}]
[null,{"$f":"IF(ISBLANK(dms_E2_Projects_12),\"\",dms_E2_Projects_12)","v":""}]
[null,{"$f":"IF(ISBLANK(dms_E2_Projects_13),\"\",dms_E2_Projects_13)","v":""}]
[null,{"$f":"IF(ISBLANK(dms_E2_Projects_14),\"\",dms_E2_Projects_14)","v":""}]
[null,{"$f":"IF(ISBLANK(dms_E2_Projects_15),\"\",dms_E2_Projects_15)","v":""}]
[null,{"$f":"IF(ISBLANK(dms_E2_Projects_16),\"\",dms_E2_Projects_16)","v":""}]
[null,{"$f":"IF(ISBLANK(dms_E2_Projects_17),\"\",dms_E2_Projects_17)","v":""}]
[null,{"$f":"IF(ISBLANK(dms_E2_Projects_18),\"\",dms_E2_Projects_18)","v":""}]
[null,{"$f":"IF(ISBLANK(dms_E2_Projects_18),\"\",dms_E2_Projects_18)","v":""}]
[null,{"$f":"IF(ISBLANK(dms_E2_Projects_19),\"\",dms_E2_Projects_19)","v":""}]
[null,{"$f":"IF(ISBLANK(dms_E2_Projects_20),\"\",dms_E2_Projects_20)","v":""}]
[null,{"$f":"IF(ISBLANK(dms_E2_Projects_21),\"\",dms_E2_Projects_21)","v":""}]
[null,{"$f":"IF(ISBLANK(dms_E2_Projects_22),\"\",dms_E2_Projects_22)","v":""}]
[null,{"$f":"IF(ISBLANK(dms_E2_Projects_23),\"\",dms_E2_Projects_23)","v":""}]
[null,{"$f":"IF(ISBLANK(dms_E2_Projects_24),\"\",dms_E2_Projects_24)","v":""}]
[null,{"$f":"IF(ISBLANK(dms_E2_Projects_25),\"\",dms_E2_Projects_26)","v":""}]
[null,{"$f":"IF(ISBLANK(dms_E2_Projects_27),\"\",dms_E2_Projects_27)","v":""}]
[null,{"$f":"IF(ISBLANK(dms_E2_Projects_28),\"\",dms_E2_Projects_28)","v":""}]
[null,{"$f":"IF(ISBLANK(dms_E2_Projects_29),\"\",dms_E2_Projects_29)","v":""}]
[null,{"$f":"IF(ISBLANK(dms_E2_Projects_30),\"\",dms_E2_Projects_30)","v":""}]
[null,{"$f":"IF(ISBLANK(dms_E2_Projects_31),\"\",dms_E2_Projects_31)","v":""}]
[null,{"$f":"IF(ISBLANK(dms_E2_Projects_32),\"\",dms_E2_Projects_32)","v":""}]
[null,{"$f":"IF(ISBLANK(dms_E2_Projects_33),\"\",dms_E2_Projects_33)","v":""}]
[null,{"$f":"IF(ISBLANK(dms_E2_Projects_34),\"\",dms_E2_Projects_34)","v":""}]
[null,{"$f":"IF(ISBLANK(dms_E2_Projects_35),\"\",dms_E2_Projects_35)","v":""}]
[null,{"$f":"IF(ISBLANK(dms_E2_Projects_36),\"\",dms_E2_Projects_36)","v":""}]
[null,{"$f":"IF(ISBLANK(dms_E2_Projects_37),\"\",dms_E2_Projects_37)","v":""}]
[null,{"$f":"IF(ISBLANK(dms_E2_Projects_38),\"\",dms_E2_Projects_38)","v":""}]
[null,{"$f":"IF(ISBLANK(dms_E2_Projects_39),\"\",dms_E2_Projects_39)","v":""}]
[null,{"$f":"IF(ISBLANK(dms_E2_Projects_40),\"\",dms_E2_Projects_40)","v":""}]
[null,{"$f":"IF(ISBLANK(dms_E2_Projects_41),\"\",dms_E2_Projects_41)","v":""}]
[null,{"$f":"IF(ISBLANK(dms_E2_Projects_42),\"\",dms_E2_Projects_42)","v":""}]
[null,{"$f":"IF(ISBLANK(dms_E2_Projects_43),\"\",dms_E2_Projects_43)","v":""}]
[null,{"$f":"IF(ISBLANK(dms_E2_Projects_44),\"\",dms_E2_Projects_44)","v":""}]
[null,{"$f":"IF(ISBLANK(dms_E2_Projects_45),\"\",dms_E2_Projects_45)","v":""}]
[null,{"$f":"IF(ISBLANK(dms_E2_Projects_46),\"\",dms_E2_Projects_46)","v":""}]
[null,{"$f":"IF(ISBLANK(dms_E2_Projects_47),\"\",dms_E2_Projects_47)","v":""}]
[null,{"$f":"IF(ISBLANK(dms_E2_Projects_48),\"\",dms_E2_Projects_48)","v":""}]
[null,{"$f":"IF(ISBLANK(dms_E2_Projects_49),\"\",dms_E2_Projects_49)","v":""}]
[null,{"$f":"IF(ISBLANK(dms_E2_Projects_50),\"\",dms_E2_Projects_50)","v":""}]
[null,"Other projects with expenditure of less than $500,000"]
[null,null,"Total",{"$f":"SUM(D377:D427)","v":0},{"$f":"SUM(E377:E427)","v":0},0,0,0,0,0]
[]
[]
[]
[null,"E2.1.2 - REACTIVE - BY CONNECTION TYPE"]
[null,null,null,"EXPENDITURE"]
[null,null,null,{"$f":"CONCATENATE(\"$0's, real \",dms_DollarReal)","v":"$0's, real June 2021"}]
[null,null,null,{"$f":"CRCP_y4","v":"2019-20"},{"$f":"CRCP_y5","v":"2020-21"},{"$f":"FRCP_y1","v":"2021-22"},{"$f":"FRCP_y2","v":"2022-23"},{"$f":"FRCP_y3","v":"2023-24"},{"$f":"FRCP_y4","v":"2024-25"},{"$f":"FRCP_y5","v":"2025-26"}]
[null,"A. DIRECT INTERNAL LABOUR EXPENDITURE"]
[null,"Mains"]
[null,"Services"]
[null,null,"Total",{"$f":"SUM(D437:D438)","v":0},{"$f":"SUM(E437:E438)","v":0},0,0,0,0,0]
[null,"B. DIRECT CONTRACTOR EXPENDITURE"]
[null,"Mains"]
[null,"Services",null,2619335.0984029067,2897968.4831073564,2435783.72192501,2447467.6953796316,2446461.7472613491,2459930.6356346975,2472021.3003360555]
[null,null,"Total",{"$f":"SUM(D441:D442)","v":2619335.0984029067},{"$f":"SUM(E441:E442)","v":2897968.4831073564},2435783.72192501,2447467.6953796316,2446461.7472613491,2459930.6356346975,2472021.3003360555]
[null,"C. OTHER INTERNAL DIRECT EXPENDITURE"]
[null,"Mains"]
[null,"Services"]
[null,null,"Total",{"$f":"SUM(D445:D446)","v":0},{"$f":"SUM(E445:E446)","v":0},0,0,0,0,0]
[null,"D. TOTAL OVERHEAD EXPENDITURE"]
[null,"Mains"]
[null,"Services",null,257904.10077818192,192683.48004637734,230857.41326523374,217650.28877399617,212188.3123136464,215474.2817514365,240123.13850367605]
[null,null,"Total",{"$f":"SUM(D449:D450)","v":257904.10077818192},{"$f":"SUM(E449:E450)","v":192683.48004637734},230857.41326523374,217650.28877399617,212188.3123136464,215474.2817514365,240123.13850367605]
[null,"E. RELATED PARTY MARGIN EXPENDITURE"]
[null,"Mains"]
[null,"Services"]
[null,null,"Total",{"$f":"SUM(D453:D454)","v":0},{"$f":"SUM(E453:E454)","v":0},0,0,0,0,0]
[null,"F. CAPITAL CONTRIBUTIONS included in the above"]
[null,"Mains"]
[null,"Services"]
[null,null,"Total",{"$f":"SUM(D457:D458)","v":0},{"$f":"SUM(E457:E458)","v":0},0,0,0,0,0]
[null,null,"TOTAL",{"$f":"SUM(D459,D455,D451,D447,D443,D439)","v":2877239.1991810887},{"$f":"SUM(E459,E455,E451,E447,E443,E439)","v":3090651.9631537339},2666641.1351902438,2665117.9841536279,2658650.0595749957,2675404.9173861342,2712144.4388397317]
[]
[]
[]
[null,"E2.2 - VOLUMES"]
[null,"E2.2.1 - PROACTIVE - BY CONNECTION TYPE - BY PROJECT"]
[null,null,null,"LENGTH"]
[null,null,null,"0s, metres"]
[null,null,null,{"$f":"CRCP_y4","v":"2019-20"},{"$f":"CRCP_y5","v":"2020-21"},{"$f":"FRCP_y1","v":"2021-22"},{"$f":"FRCP_y2","v":"2022-23"},{"$f":"FRCP_y3","v":"2023-24"},{"$f":"FRCP_y4","v":"2024-25"},{"$f":"FRCP_y5","v":"2025-26"}]
[null,"A. LOW PRESSURE TO HIGH PRESSURE"]
[null,"Cheltenham Parade-CI - Block PI",null,32,0]
[null,"Fulham-CI - Block PI",null,11449,0]
[null,"Hilton Mile End A-CI - Block PI",null,12472,12352]
[null,"Brooklyn Park-CI - Block PI",null,0,3700]
[null,"Kilburn-CI - Block PI",null,0,9000]
[null,"Medindie-CI - Block PI",null,0,12854]
[null,"Torrensville A-CI - Block PI",null,6860,6856]
[null,"Tranmere-CI - Block PI",null,5427,23565]
[null,"Vale Park-CI - Block PI",null,5882,12226]
[null,"Mains Replacement - General Block Replacement",null,0,0,102000,102000,104000,104000,100000]
[null,"Mains Replacement - North Adelaide Block Replacement",null,0,0,10000,10000,10000,8000,0]
[null,{"$f":"IF(ISBLANK(dms_E2_Projects_14),\"\",dms_E2_Projects_14)","v":""}]
[null,{"$f":"IF(ISBLANK(dms_E2_Projects_15),\"\",dms_E2_Projects_15)","v":""}]
[null,{"$f":"IF(ISBLANK(dms_E2_Projects_16),\"\",dms_E2_Projects_16)","v":""}]
[null,{"$f":"IF(ISBLANK(dms_E2_Projects_17),\"\",dms_E2_Projects_17)","v":""}]
[null,{"$f":"IF(ISBLANK(dms_E2_Projects_18),\"\",dms_E2_Projects_18)","v":""}]
[null,{"$f":"IF(ISBLANK(dms_E2_Projects_18),\"\",dms_E2_Projects_18)","v":""}]
[null,{"$f":"IF(ISBLANK(dms_E2_Projects_19),\"\",dms_E2_Projects_19)","v":""}]
[null,{"$f":"IF(ISBLANK(dms_E2_Projects_20),\"\",dms_E2_Projects_20)","v":""}]
[null,{"$f":"IF(ISBLANK(dms_E2_Projects_21),\"\",dms_E2_Projects_21)","v":""}]
[null,{"$f":"IF(ISBLANK(dms_E2_Projects_22),\"\",dms_E2_Projects_22)","v":""}]
[null,{"$f":"IF(ISBLANK(dms_E2_Projects_23),\"\",dms_E2_Projects_23)","v":""}]
[null,{"$f":"IF(ISBLANK(dms_E2_Projects_24),\"\",dms_E2_Projects_24)","v":""}]
[null,{"$f":"IF(ISBLANK(dms_E2_Projects_25),\"\",dms_E2_Projects_26)","v":""}]
[null,{"$f":"IF(ISBLANK(dms_E2_Projects_27),\"\",dms_E2_Projects_27)","v":""}]
[null,{"$f":"IF(ISBLANK(dms_E2_Projects_28),\"\",dms_E2_Projects_28)","v":""}]
[null,{"$f":"IF(ISBLANK(dms_E2_Projects_29),\"\",dms_E2_Projects_29)","v":""}]
[null,{"$f":"IF(ISBLANK(dms_E2_Projects_30),\"\",dms_E2_Projects_30)","v":""}]
[null,{"$f":"IF(ISBLANK(dms_E2_Projects_31),\"\",dms_E2_Projects_31)","v":""}]
[null,{"$f":"IF(ISBLANK(dms_E2_Projects_32),\"\",dms_E2_Projects_32)","v":""}]
[null,{"$f":"IF(ISBLANK(dms_E2_Projects_33),\"\",dms_E2_Projects_33)","v":""}]
[null,{"$f":"IF(ISBLANK(dms_E2_Projects_34),\"\",dms_E2_Projects_34)","v":""}]
[null,{"$f":"IF(ISBLANK(dms_E2_Projects_35),\"\",dms_E2_Projects_35)","v":""}]
[null,{"$f":"IF(ISBLANK(dms_E2_Projects_36),\"\",dms_E2_Projects_36)","v":""}]
[null,{"$f":"IF(ISBLANK(dms_E2_Projects_37),\"\",dms_E2_Projects_37)","v":""}]
[null,{"$f":"IF(ISBLANK(dms_E2_Projects_38),\"\",dms_E2_Projects_38)","v":""}]
[null,{"$f":"IF(ISBLANK(dms_E2_Projects_39),\"\",dms_E2_Projects_39)","v":""}]
[null,{"$f":"IF(ISBLANK(dms_E2_Projects_40),\"\",dms_E2_Projects_40)","v":""}]
[null,{"$f":"IF(ISBLANK(dms_E2_Projects_41),\"\",dms_E2_Projects_41)","v":""}]
[null,{"$f":"IF(ISBLANK(dms_E2_Projects_42),\"\",dms_E2_Projects_42)","v":""}]
[null,{"$f":"IF(ISBLANK(dms_E2_Projects_43),\"\",dms_E2_Projects_43)","v":""}]
[null,{"$f":"IF(ISBLANK(dms_E2_Projects_44),\"\",dms_E2_Projects_44)","v":""}]
[null,{"$f":"IF(ISBLANK(dms_E2_Projects_45),\"\",dms_E2_Projects_45)","v":""}]
[null,{"$f":"IF(ISBLANK(dms_E2_Projects_46),\"\",dms_E2_Projects_46)","v":""}]
[null,{"$f":"IF(ISBLANK(dms_E2_Projects_47),\"\",dms_E2_Projects_47)","v":""}]
[null,{"$f":"IF(ISBLANK(dms_E2_Projects_48),\"\",dms_E2_Projects_48)","v":""}]
[null,{"$f":"IF(ISBLANK(dms_E2_Projects_49),\"\",dms_E2_Projects_49)","v":""}]
[null,{"$f":"IF(ISBLANK(dms_E2_Projects_50),\"\",dms_E2_Projects_50)","v":""}]
[null,"Aggregate of other projects with total expenditure of less than $500,000"]
[null,null,"Total",{"$f":"SUM(D470:D518)","v":42122},80553,112000,112000,114000,112000,100000]
[]
[null,"B. LOW PRESSURE TO MEDIUM PRESSURE"]
[null,"Fulham Gardens-CI - Block PI",null,12284,390]
[null,"Newton CI-CI - Block PI",null,10907,3122]
[null,{"$f":"IF(ISBLANK(dms_E2_Projects_03),\"\",dms_E2_Projects_03)","v":""}]
[null,{"$f":"IF(ISBLANK(dms_E2_Projects_04),\"\",dms_E2_Projects_04)","v":""}]
[null,{"$f":"IF(ISBLANK(dms_E2_Projects_05),\"\",dms_E2_Projects_05)","v":""}]
[null,{"$f":"IF(ISBLANK(dms_E2_Projects_06),\"\",dms_E2_Projects_06)","v":""}]
[null,{"$f":"IF(ISBLANK(dms_E2_Projects_07),\"\",dms_E2_Projects_07)","v":""}]
[null,{"$f":"IF(ISBLANK(dms_E2_Projects_08),\"\",dms_E2_Projects_08)","v":""}]
[null,{"$f":"IF(ISBLANK(dms_E2_Projects_09),\"\",dms_E2_Projects_09)","v":""}]
[null,{"$f":"IF(ISBLANK(dms_E2_Projects_10),\"\",dms_E2_Projects_10)","v":""}]
[null,{"$f":"IF(ISBLANK(dms_E2_Projects_11),\"\",dms_E2_Projects_11)","v":""}]
[null,{"$f":"IF(ISBLANK(dms_E2_Projects_12),\"\",dms_E2_Projects_12)","v":""}]
[null,{"$f":"IF(ISBLANK(dms_E2_Projects_13),\"\",dms_E2_Projects_13)","v":""}]
[null,{"$f":"IF(ISBLANK(dms_E2_Projects_14),\"\",dms_E2_Projects_14)","v":""}]
[null,{"$f":"IF(ISBLANK(dms_E2_Projects_15),\"\",dms_E2_Projects_15)","v":""}]
[null,{"$f":"IF(ISBLANK(dms_E2_Projects_16),\"\",dms_E2_Projects_16)","v":""}]
[null,{"$f":"IF(ISBLANK(dms_E2_Projects_17),\"\",dms_E2_Projects_17)","v":""}]
[null,{"$f":"IF(ISBLANK(dms_E2_Projects_18),\"\",dms_E2_Projects_18)","v":""}]
[null,{"$f":"IF(ISBLANK(dms_E2_Projects_18),\"\",dms_E2_Projects_18)","v":""}]
[null,{"$f":"IF(ISBLANK(dms_E2_Projects_19),\"\",dms_E2_Projects_19)","v":""}]
[null,{"$f":"IF(ISBLANK(dms_E2_Projects_20),\"\",dms_E2_Projects_20)","v":""}]
[null,{"$f":"IF(ISBLANK(dms_E2_Projects_21),\"\",dms_E2_Projects_21)","v":""}]
[null,{"$f":"IF(ISBLANK(dms_E2_Projects_22),\"\",dms_E2_Projects_22)","v":""}]
[null,{"$f":"IF(ISBLANK(dms_E2_Projects_23),\"\",dms_E2_Projects_23)","v":""}]
[null,{"$f":"IF(ISBLANK(dms_E2_Projects_24),\"\",dms_E2_Projects_24)","v":""}]
[null,{"$f":"IF(ISBLANK(dms_E2_Projects_25),\"\",dms_E2_Projects_26)","v":""}]
[null,{"$f":"IF(ISBLANK(dms_E2_Projects_27),\"\",dms_E2_Projects_27)","v":""}]
[null,{"$f":"IF(ISBLANK(dms_E2_Projects_28),\"\",dms_E2_Projects_28)","v":""}]
[null,{"$f":"IF(ISBLANK(dms_E2_Projects_29),\"\",dms_E2_Projects_29)","v":""}]
[null,{"$f":"IF(ISBLANK(dms_E2_Projects_30),\"\",dms_E2_Projects_30)","v":""}]
[null,{"$f":"IF(ISBLANK(dms_E2_Projects_31),\"\",dms_E2_Projects_31)","v":""}]
[null,{"$f":"IF(ISBLANK(dms_E2_Projects_32),\"\",dms_E2_Projects_32)","v":""}]
[null,{"$f":"IF(ISBLANK(dms_E2_Projects_33),\"\",dms_E2_Projects_33)","v":""}]
[null,{"$f":"IF(ISBLANK(dms_E2_Projects_34),\"\",dms_E2_Projects_34)","v":""}]
[null,{"$f":"IF(ISBLANK(dms_E2_Projects_35),\"\",dms_E2_Projects_35)","v":""}]
[null,{"$f":"IF(ISBLANK(dms_E2_Projects_36),\"\",dms_E2_Projects_36)","v":""}]
[null,{"$f":"IF(ISBLANK(dms_E2_Projects_37),\"\",dms_E2_Projects_37)","v":""}]
[null,{"$f":"IF(ISBLANK(dms_E2_Projects_38),\"\",dms_E2_Projects_38)","v":""}]
[null,{"$f":"IF(ISBLANK(dms_E2_Projects_39),\"\",dms_E2_Projects_39)","v":""}]
[null,{"$f":"IF(ISBLANK(dms_E2_Projects_40),\"\",dms_E2_Projects_40)","v":""}]
[null,{"$f":"IF(ISBLANK(dms_E2_Projects_41),\"\",dms_E2_Projects_41)","v":""}]
[null,{"$f":"IF(ISBLANK(dms_E2_Projects_42),\"\",dms_E2_Projects_42)","v":""}]
[null,{"$f":"IF(ISBLANK(dms_E2_Projects_43),\"\",dms_E2_Projects_43)","v":""}]
[null,{"$f":"IF(ISBLANK(dms_E2_Projects_44),\"\",dms_E2_Projects_44)","v":""}]
[null,{"$f":"IF(ISBLANK(dms_E2_Projects_45),\"\",dms_E2_Projects_45)","v":""}]
[null,{"$f":"IF(ISBLANK(dms_E2_Projects_46),\"\",dms_E2_Projects_46)","v":""}]
[null,{"$f":"IF(ISBLANK(dms_E2_Projects_47),\"\",dms_E2_Projects_47)","v":""}]
[null,{"$f":"IF(ISBLANK(dms_E2_Projects_48),\"\",dms_E2_Projects_48)","v":""}]
[null,{"$f":"IF(ISBLANK(dms_E2_Projects_49),\"\",dms_E2_Projects_49)","v":""}]
[null,{"$f":"IF(ISBLANK(dms_E2_Projects_50),\"\",dms_E2_Projects_50)","v":""}]
[null,"Aggregate of other projects with total expenditure of less than $500,000"]
[null,null,"Total",{"$f":"SUM(D522:D572)","v":23191},{"$f":"SUM(E522:E572)","v":3512},0,0,0,0,0]
[]
[null,"C. LOW PRESSURE TO LOW PRESSURE"]
[null,"CBD Block",null,9188,5970]
[null,{"$f":"IF(ISBLANK(dms_E2_Projects_02),\"\",dms_E2_Projects_02)","v":""}]
[null,{"$f":"IF(ISBLANK(dms_E2_Projects_03),\"\",dms_E2_Projects_03)","v":""}]
[null,{"$f":"IF(ISBLANK(dms_E2_Projects_04),\"\",dms_E2_Projects_04)","v":""}]
[null,{"$f":"IF(ISBLANK(dms_E2_Projects_05),\"\",dms_E2_Projects_05)","v":""}]
[null,{"$f":"IF(ISBLANK(dms_E2_Projects_06),\"\",dms_E2_Projects_06)","v":""}]
[null,{"$f":"IF(ISBLANK(dms_E2_Projects_07),\"\",dms_E2_Projects_07)","v":""}]
[null,{"$f":"IF(ISBLANK(dms_E2_Projects_08),\"\",dms_E2_Projects_08)","v":""}]
[null,{"$f":"IF(ISBLANK(dms_E2_Projects_09),\"\",dms_E2_Projects_09)","v":""}]
[null,{"$f":"IF(ISBLANK(dms_E2_Projects_10),\"\",dms_E2_Projects_10)","v":""}]
[null,{"$f":"IF(ISBLANK(dms_E2_Projects_11),\"\",dms_E2_Projects_11)","v":""}]
[null,{"$f":"IF(ISBLANK(dms_E2_Projects_12),\"\",dms_E2_Projects_12)","v":""}]
[null,{"$f":"IF(ISBLANK(dms_E2_Projects_13),\"\",dms_E2_Projects_13)","v":""}]
[null,{"$f":"IF(ISBLANK(dms_E2_Projects_14),\"\",dms_E2_Projects_14)","v":""}]
[null,{"$f":"IF(ISBLANK(dms_E2_Projects_15),\"\",dms_E2_Projects_15)","v":""}]
[null,{"$f":"IF(ISBLANK(dms_E2_Projects_16),\"\",dms_E2_Projects_16)","v":""}]
[null,{"$f":"IF(ISBLANK(dms_E2_Projects_17),\"\",dms_E2_Projects_17)","v":""}]
[null,{"$f":"IF(ISBLANK(dms_E2_Projects_18),\"\",dms_E2_Projects_18)","v":""}]
[null,{"$f":"IF(ISBLANK(dms_E2_Projects_18),\"\",dms_E2_Projects_18)","v":""}]
[null,{"$f":"IF(ISBLANK(dms_E2_Projects_19),\"\",dms_E2_Projects_19)","v":""}]
[null,{"$f":"IF(ISBLANK(dms_E2_Projects_20),\"\",dms_E2_Projects_20)","v":""}]
[null,{"$f":"IF(ISBLANK(dms_E2_Projects_21),\"\",dms_E2_Projects_21)","v":""}]
[null,{"$f":"IF(ISBLANK(dms_E2_Projects_22),\"\",dms_E2_Projects_22)","v":""}]
[null,{"$f":"IF(ISBLANK(dms_E2_Projects_23),\"\",dms_E2_Projects_23)","v":""}]
[null,{"$f":"IF(ISBLANK(dms_E2_Projects_24),\"\",dms_E2_Projects_24)","v":""}]
[null,{"$f":"IF(ISBLANK(dms_E2_Projects_25),\"\",dms_E2_Projects_26)","v":""}]
[null,{"$f":"IF(ISBLANK(dms_E2_Projects_27),\"\",dms_E2_Projects_27)","v":""}]
[null,{"$f":"IF(ISBLANK(dms_E2_Projects_28),\"\",dms_E2_Projects_28)","v":""}]
[null,{"$f":"IF(ISBLANK(dms_E2_Projects_29),\"\",dms_E2_Projects_29)","v":""}]
[null,{"$f":"IF(ISBLANK(dms_E2_Projects_30),\"\",dms_E2_Projects_30)","v":""}]
[null,{"$f":"IF(ISBLANK(dms_E2_Projects_31),\"\",dms_E2_Projects_31)","v":""}]
[null,{"$f":"IF(ISBLANK(dms_E2_Projects_32),\"\",dms_E2_Projects_32)","v":""}]
[null,{"$f":"IF(ISBLANK(dms_E2_Projects_33),\"\",dms_E2_Projects_33)","v":""}]
[null,{"$f":"IF(ISBLANK(dms_E2_Projects_34),\"\",dms_E2_Projects_34)","v":""}]
[null,{"$f":"IF(ISBLANK(dms_E2_Projects_35),\"\",dms_E2_Projects_35)","v":""}]
[null,{"$f":"IF(ISBLANK(dms_E2_Projects_36),\"\",dms_E2_Projects_36)","v":""}]
[null,{"$f":"IF(ISBLANK(dms_E2_Projects_37),\"\",dms_E2_Projects_37)","v":""}]
[null,{"$f":"IF(ISBLANK(dms_E2_Projects_38),\"\",dms_E2_Projects_38)","v":""}]
[null,{"$f":"IF(ISBLANK(dms_E2_Projects_39),\"\",dms_E2_Projects_39)","v":""}]
[null,{"$f":"IF(ISBLANK(dms_E2_Projects_40),\"\",dms_E2_Projects_40)","v":""}]
[null,{"$f":"IF(ISBLANK(dms_E2_Projects_41),\"\",dms_E2_Projects_41)","v":""}]
[null,{"$f":"IF(ISBLANK(dms_E2_Projects_42),\"\",dms_E2_Projects_42)","v":""}]
[null,{"$f":"IF(ISBLANK(dms_E2_Projects_43),\"\",dms_E2_Projects_43)","v":""}]
[null,{"$f":"IF(ISBLANK(dms_E2_Projects_44),\"\",dms_E2_Projects_44)","v":""}]
[null,{"$f":"IF(ISBLANK(dms_E2_Projects_45),\"\",dms_E2_Projects_45)","v":""}]
[null,{"$f":"IF(ISBLANK(dms_E2_Projects_46),\"\",dms_E2_Projects_46)","v":""}]
[null,{"$f":"IF(ISBLANK(dms_E2_Projects_47),\"\",dms_E2_Projects_47)","v":""}]
[null,{"$f":"IF(ISBLANK(dms_E2_Projects_48),\"\",dms_E2_Projects_48)","v":""}]
[null,{"$f":"IF(ISBLANK(dms_E2_Projects_49),\"\",dms_E2_Projects_49)","v":""}]
[null,{"$f":"IF(ISBLANK(dms_E2_Projects_50),\"\",dms_E2_Projects_50)","v":""}]
[null,"Aggregate of other projects with total expenditure of less than $500,000"]
[null,null,"Total",{"$f":"SUM(D576:D626)","v":9188},{"$f":"SUM(E576:E626)","v":5970},0,0,0,0,0]
[]
[null,"D. MEDIUM PRESSURE TO MEDIUM PRESSURE"]
[null,"Bower Road-Trunk SIB",null,956.5,0]
[null,"Churchill Road Trunk-Trunk SIB",null,4421,0]
[null,"Kelly Rd-Trunk SIB",null,2144.65,0]
[null,"Angle Park-HDPE Class 250",null,0,142]
[null,"Black Forest-HDPE Class 250",null,0,5675]
[null,"Evandale-HDPE Class 250",null,3293,0]
[null,"Ferryden Park-HDPE Class 250",null,0,5375]
[null,"Hendon-HDPE Class 250",null,0,1715]
[null,"Highbury-HDPE Class 250",null,4943,0]
[null,"Hilton Mile End B-HDPE Class 250",null,2100,700]
[null,"Davaren Park-HDPE Class 250",null,0,1635]
[null,"Ingle Farm-HDPE Class 250",null,13148,1872]
[null,"Mitcham-HDPE Class 250",null,0,1031]
[null,"Newton PE-HDPE Class 250",null,1868,0]
[null,"North Haven-HDPE Class 250",null,11110.5,0]
[null,"Plympton Park-HDPE Class 250",null,0,3905]
[null,"Port Adelaide-HDPE Class 250",null,5250,87]
[null,"Redwood Park-HDPE Class 250",null,0,2744]
[null,"Rostrevor Magill-HDPE Class 250",null,0,5291]
[null,"Surrey Downs-HDPE Class 250",null,2500,0]
[null,"West Croydon-HDPE Class 250",null,5293,0]
[null,"West Lakes Delfin Island-HDPE Class 250",null,8681.5,67.5]
[null,"West Lakes-HDPE Class 250",null,371,0]
[null,"HDPE_Reallocation-HDPE Class 250",null,-1200,-645]
[null,"Mains Replacement - General Block Replacement",null,null,null,2000,2000,2000,2000]
[null,"Mains Replacement - HDPE Replacement Class 250",null,null,null,7000,7000,0,0,0]
[null,"HDPE 575 DN40 MP",null,null,null,10000,10000,20000,25000,25000]
[null,{"$f":"IF(ISBLANK(dms_E2_Projects_31),\"\",dms_E2_Projects_31)","v":""}]
[null,{"$f":"IF(ISBLANK(dms_E2_Projects_32),\"\",dms_E2_Projects_32)","v":""}]
[null,{"$f":"IF(ISBLANK(dms_E2_Projects_33),\"\",dms_E2_Projects_33)","v":""}]
[null,{"$f":"IF(ISBLANK(dms_E2_Projects_34),\"\",dms_E2_Projects_34)","v":""}]
[null,{"$f":"IF(ISBLANK(dms_E2_Projects_35),\"\",dms_E2_Projects_35)","v":""}]
[null,{"$f":"IF(ISBLANK(dms_E2_Projects_36),\"\",dms_E2_Projects_36)","v":""}]
[null,{"$f":"IF(ISBLANK(dms_E2_Projects_37),\"\",dms_E2_Projects_37)","v":""}]
[null,{"$f":"IF(ISBLANK(dms_E2_Projects_38),\"\",dms_E2_Projects_38)","v":""}]
[null,{"$f":"IF(ISBLANK(dms_E2_Projects_39),\"\",dms_E2_Projects_39)","v":""}]
[null,{"$f":"IF(ISBLANK(dms_E2_Projects_40),\"\",dms_E2_Projects_40)","v":""}]
[null,{"$f":"IF(ISBLANK(dms_E2_Projects_41),\"\",dms_E2_Projects_41)","v":""}]
[null,{"$f":"IF(ISBLANK(dms_E2_Projects_42),\"\",dms_E2_Projects_42)","v":""}]
[null,{"$f":"IF(ISBLANK(dms_E2_Projects_43),\"\",dms_E2_Projects_43)","v":""}]
[null,{"$f":"IF(ISBLANK(dms_E2_Projects_44),\"\",dms_E2_Projects_44)","v":""}]
[null,{"$f":"IF(ISBLANK(dms_E2_Projects_45),\"\",dms_E2_Projects_45)","v":""}]
[null,{"$f":"IF(ISBLANK(dms_E2_Projects_46),\"\",dms_E2_Projects_46)","v":""}]
[null,{"$f":"IF(ISBLANK(dms_E2_Projects_47),\"\",dms_E2_Projects_47)","v":""}]
[null,{"$f":"IF(ISBLANK(dms_E2_Projects_48),\"\",dms_E2_Projects_48)","v":""}]
[null,{"$f":"IF(ISBLANK(dms_E2_Projects_49),\"\",dms_E2_Projects_49)","v":""}]
[null,{"$f":"IF(ISBLANK(dms_E2_Projects_50),\"\",dms_E2_Projects_50)","v":""}]
[null,"Aggregate of other projects with total expenditure of less than $500,000"]
[null,null,"Total",{"$f":"SUM(D630:D677)","v":64880.149999999994},29594.5,19000,19000,22000,27000,25000]
[]
[null,"E. MEDIUM PRESSURE TO HIGH PRESSURE"]
[null,"Park Holme-HDPE Class 250",null,0,2192]
[null,"Croydon Park-HDPE Class 250",null,2446,0]
[null,"Ascot Park-HDPE Class 250",null,38,0]
[null,"Churchill Road Trunk-CI - Block PI",null,4500,0]
[null,{"$f":"IF(ISBLANK(dms_E2_Projects_05),\"\",dms_E2_Projects_05)","v":""}]
[null,{"$f":"IF(ISBLANK(dms_E2_Projects_06),\"\",dms_E2_Projects_06)","v":""}]
[null,{"$f":"IF(ISBLANK(dms_E2_Projects_07),\"\",dms_E2_Projects_07)","v":""}]
[null,{"$f":"IF(ISBLANK(dms_E2_Projects_08),\"\",dms_E2_Projects_08)","v":""}]
[null,{"$f":"IF(ISBLANK(dms_E2_Projects_09),\"\",dms_E2_Projects_09)","v":""}]
[null,{"$f":"IF(ISBLANK(dms_E2_Projects_10),\"\",dms_E2_Projects_10)","v":""}]
[null,{"$f":"IF(ISBLANK(dms_E2_Projects_11),\"\",dms_E2_Projects_11)","v":""}]
[null,{"$f":"IF(ISBLANK(dms_E2_Projects_12),\"\",dms_E2_Projects_12)","v":""}]
[null,{"$f":"IF(ISBLANK(dms_E2_Projects_13),\"\",dms_E2_Projects_13)","v":""}]
[null,{"$f":"IF(ISBLANK(dms_E2_Projects_14),\"\",dms_E2_Projects_14)","v":""}]
[null,{"$f":"IF(ISBLANK(dms_E2_Projects_15),\"\",dms_E2_Projects_15)","v":""}]
[null,{"$f":"IF(ISBLANK(dms_E2_Projects_16),\"\",dms_E2_Projects_16)","v":""}]
[null,{"$f":"IF(ISBLANK(dms_E2_Projects_17),\"\",dms_E2_Projects_17)","v":""}]
[null,{"$f":"IF(ISBLANK(dms_E2_Projects_18),\"\",dms_E2_Projects_18)","v":""}]
[null,{"$f":"IF(ISBLANK(dms_E2_Projects_18),\"\",dms_E2_Projects_18)","v":""}]
[null,{"$f":"IF(ISBLANK(dms_E2_Projects_19),\"\",dms_E2_Projects_19)","v":""}]
[null,{"$f":"IF(ISBLANK(dms_E2_Projects_20),\"\",dms_E2_Projects_20)","v":""}]
[null,{"$f":"IF(ISBLANK(dms_E2_Projects_21),\"\",dms_E2_Projects_21)","v":""}]
[null,{"$f":"IF(ISBLANK(dms_E2_Projects_22),\"\",dms_E2_Projects_22)","v":""}]
[null,{"$f":"IF(ISBLANK(dms_E2_Projects_23),\"\",dms_E2_Projects_23)","v":""}]
[null,{"$f":"IF(ISBLANK(dms_E2_Projects_24),\"\",dms_E2_Projects_24)","v":""}]
[null,{"$f":"IF(ISBLANK(dms_E2_Projects_25),\"\",dms_E2_Projects_26)","v":""}]
[null,{"$f":"IF(ISBLANK(dms_E2_Projects_27),\"\",dms_E2_Projects_27)","v":""}]
[null,{"$f":"IF(ISBLANK(dms_E2_Projects_28),\"\",dms_E2_Projects_28)","v":""}]
[null,{"$f":"IF(ISBLANK(dms_E2_Projects_29),\"\",dms_E2_Projects_29)","v":""}]
[null,{"$f":"IF(ISBLANK(dms_E2_Projects_30),\"\",dms_E2_Projects_30)","v":""}]
[null,{"$f":"IF(ISBLANK(dms_E2_Projects_31),\"\",dms_E2_Projects_31)","v":""}]
[null,{"$f":"IF(ISBLANK(dms_E2_Projects_32),\"\",dms_E2_Projects_32)","v":""}]
[null,{"$f":"IF(ISBLANK(dms_E2_Projects_33),\"\",dms_E2_Projects_33)","v":""}]
[null,{"$f":"IF(ISBLANK(dms_E2_Projects_34),\"\",dms_E2_Projects_34)","v":""}]
[null,{"$f":"IF(ISBLANK(dms_E2_Projects_35),\"\",dms_E2_Projects_35)","v":""}]
[null,{"$f":"IF(ISBLANK(dms_E2_Projects_36),\"\",dms_E2_Projects_36)","v":""}]
[null,{"$f":"IF(ISBLANK(dms_E2_Projects_37),\"\",dms_E2_Projects_37)","v":""}]
[null,{"$f":"IF(ISBLANK(dms_E2_Projects_38),\"\",dms_E2_Projects_38)","v":""}]
[null,{"$f":"IF(ISBLANK(dms_E2_Projects_39),\"\",dms_E2_Projects_39)","v":""}]
[null,{"$f":"IF(ISBLANK(dms_E2_Projects_40),\"\",dms_E2_Projects_40)","v":""}]
[null,{"$f":"IF(ISBLANK(dms_E2_Projects_41),\"\",dms_E2_Projects_41)","v":""}]
[null,{"$f":"IF(ISBLANK(dms_E2_Projects_42),\"\",dms_E2_Projects_42)","v":""}]
[null,{"$f":"IF(ISBLANK(dms_E2_Projects_43),\"\",dms_E2_Projects_43)","v":""}]
[null,{"$f":"IF(ISBLANK(dms_E2_Projects_44),\"\",dms_E2_Projects_44)","v":""}]
[null,{"$f":"IF(ISBLANK(dms_E2_Projects_45),\"\",dms_E2_Projects_45)","v":""}]
[null,{"$f":"IF(ISBLANK(dms_E2_Projects_46),\"\",dms_E2_Projects_46)","v":""}]
[null,{"$f":"IF(ISBLANK(dms_E2_Projects_47),\"\",dms_E2_Projects_47)","v":""}]
[null,{"$f":"IF(ISBLANK(dms_E2_Projects_48),\"\",dms_E2_Projects_48)","v":""}]
[null,{"$f":"IF(ISBLANK(dms_E2_Projects_49),\"\",dms_E2_Projects_49)","v":""}]
[null,{"$f":"IF(ISBLANK(dms_E2_Projects_50),\"\",dms_E2_Projects_50)","v":""}]
[null,"Aggregate of other projects with total expenditure of less than $500,000"]
[null,null,"Total",{"$f":"SUM(D681:D731)","v":6984},{"$f":"SUM(E681:E731)","v":2192},0,0,0,0,0]
[]
[null,"F. HIGH PRESSURE TO HIGH PRESSURE"]
[null,"Aberfoyle Park-HDPE Class 575",null,2193,0,"Brooke Palmer","Brooke Palmer","Brooke Palmer","Brooke Palmer","Brooke Palmer"]
[null,"Allenby Gardens-HDPE Class 575",null,1830.5,0]
[null,"Andrews Farm-HDPE Class 575",null,1892,0]
[null,"Angle Vale-HDPE Class 575",null,0,5903]
[null,"Belair-HDPE Class 575",null,0,3173]
[null,"Blakeview-HDPE Class 575",null,0,5673]
[null,"Coromandel Valley-HDPE Class 575",null,0,4002]
[null,"Eastwood-HDPE Class 575",null,0,2869]
[null,"Edwardstown-HDPE Class 575",null,2003,0]
[null,"Elizabeth North-HDPE Class 575",null,228,0]
[null,"Elizabeth Park A-HDPE Class 575",null,0,2268]
[null,"Elizabeth Vale-HDPE Class 575",null,241,0]
[null,"Evanston Park-HDPE Class 575",null,6382,0]
[null,"Flagstaff Hill-HDPE Class 575",null,0,4909]
[null,"Fullarton-HDPE Class 575",null,5009,0]
[null,"Gawler East-HDPE Class 575",null,7713,0]
[null,"Glenunga-HDPE Class 575",null,1525,0]
[null,"Gulfview Heights-HDPE Class 575",null,2625,0]
[null,"Hawthorndene-HDPE Class 575",null,0,13953]
[null,"Kings Park-HDPE Class 575",null,1162.7,0]
[null,"Kurralta Park A-HDPE Class 575",null,11603,1163]
[null,"Malvern-HDPE Class 575",null,2165,0]
[null,"Melrose Park-HDPE Class 575",null,245,0]
[null,"Morphett Vale A-HDPE Class 575",null,0,12513]
[null,"Norwood A-HDPE Class 575",null,2359,4389]
[null,"Pennington-HDPE Class 575",null,5388,0]
[null,"Salisbury Heights A-HDPE Class 575",null,3942,0]
[null,"Torrens Park A-HDPE Class 575",null,2730,0]
[null,"Torrensville B-HDPE Class 575",null,0,5057]
[null,"Unley-HDPE Class 575",null,0,4655]
[null,"Westbourne Park-HDPE Class 575",null,126,0]
[null,"Woodcroft-HDPE Class 575",null,0,6865]
[null,"HDPE_Reallocation-HDPE Class 575",null,1200,645]
[null,"HDPE 575 DN40 HP",null,null,null,40000,40000,40000,40000,38000]
[null,{"$f":"IF(ISBLANK(dms_E2_Projects_35),\"\",dms_E2_Projects_35)","v":""}]
[null,{"$f":"IF(ISBLANK(dms_E2_Projects_36),\"\",dms_E2_Projects_36)","v":""}]
[null,{"$f":"IF(ISBLANK(dms_E2_Projects_37),\"\",dms_E2_Projects_37)","v":""}]
[null,{"$f":"IF(ISBLANK(dms_E2_Projects_38),\"\",dms_E2_Projects_38)","v":""}]
[null,{"$f":"IF(ISBLANK(dms_E2_Projects_39),\"\",dms_E2_Projects_39)","v":""}]
[null,{"$f":"IF(ISBLANK(dms_E2_Projects_40),\"\",dms_E2_Projects_40)","v":""}]
[null,{"$f":"IF(ISBLANK(dms_E2_Projects_41),\"\",dms_E2_Projects_41)","v":""}]
[null,{"$f":"IF(ISBLANK(dms_E2_Projects_42),\"\",dms_E2_Projects_42)","v":""}]
[null,{"$f":"IF(ISBLANK(dms_E2_Projects_43),\"\",dms_E2_Projects_43)","v":""}]
[null,{"$f":"IF(ISBLANK(dms_E2_Projects_44),\"\",dms_E2_Projects_44)","v":""}]
[null,{"$f":"IF(ISBLANK(dms_E2_Projects_45),\"\",dms_E2_Projects_45)","v":""}]
[null,{"$f":"IF(ISBLANK(dms_E2_Projects_46),\"\",dms_E2_Projects_46)","v":""}]
[null,{"$f":"IF(ISBLANK(dms_E2_Projects_47),\"\",dms_E2_Projects_47)","v":""}]
[null,{"$f":"IF(ISBLANK(dms_E2_Projects_48),\"\",dms_E2_Projects_48)","v":""}]
[null,{"$f":"IF(ISBLANK(dms_E2_Projects_49),\"\",dms_E2_Projects_49)","v":""}]
[null,{"$f":"IF(ISBLANK(dms_E2_Projects_50),\"\",dms_E2_Projects_50)","v":""}]
[null,"Aggregate of other projects with total expenditure of less than $500,000"]
[null,null,"Total",{"$f":"SUM(D735:D785)","v":62562.2},{"$f":"SUM(E735:E785)","v":78037},40000,40000,40000,40000,38000]
[]
[]
[null,"E2.2.2 - REACTIVE - BY CONNECTION TYPE"]
[null,null,null,"VOLUMES"]
[null,null,null,"0s"]
[null,null,null,{"$f":"CRCP_y4","v":"2019-20"},{"$f":"CRCP_y5","v":"2020-21"},{"$f":"FRCP_y1","v":"2021-22"},{"$f":"FRCP_y2","v":"2022-23"},{"$f":"FRCP_y3","v":"2023-24"},{"$f":"FRCP_y4","v":"2024-25"},{"$f":"FRCP_y5","v":"2025-26"}]
[null,"A. LOW PRESSURE TO HIGH PRESSURE"]
[null,"Mains","Length of mains replaced"]
[null,"Services","Number of services replaced",724.6,729.6,582,582,581,581,581]
[null,null,"Total",{"$f":"SUM(D794:D795)","v":724.6},{"$f":"SUM(E794:E795)","v":729.6},582,582,581,581,581]
[null,"B. LOW PRESSURE TO MEDIUM PRESSURE"]
[null,"Mains","Length of mains replaced"]
[null,"Services","Number of services replaced"]
[null,null,"Total",{"$f":"SUM(D798:D799)","v":0},{"$f":"SUM(E798:E799)","v":0},0,0,0,0,0]
[null,"C. LOW PRESSURE TO LOW PRESSURE"]
[null,"Mains","Length of mains replaced"]
[null,"Services","Number of services replaced"]
[null,null,"Total",{"$f":"SUM(D802:D803)","v":0},{"$f":"SUM(E802:E803)","v":0},0,0,0,0,0]
[null,"D. MEDIUM PRESSURE TO MEDIUM PRESSURE"]
[null,"Mains","Length of mains replaced"]
[null,"Services","Number of services replaced"]
[null,null,"Total",{"$f":"SUM(D806:D807)","v":0},{"$f":"SUM(E806:E807)","v":0},0,0,0,0,0]
[null,"E. MEDIUM PRESSURE TO HIGH PRESSURE"]
[null,"Mains","Length of mains replaced"]
[null,"Services","Number of services replaced"]
[null,null,"Total",{"$f":"SUM(D810:D811)","v":0},{"$f":"SUM(E810:E811)","v":0},0,0,0,0,0]
[null,"F. HIGH PRESSURE TO HIGH PRESSURE"]
[null,"Mains","Length of mains replaced"]
[null,"Services","Number of services replaced"]
[null,null,"Total",{"$f":"SUM(D814:D815)","v":0},{"$f":"SUM(E814:E815)","v":0},0,0,0,0,0]

{"sheet":"E3. Mains Augex","index":9,"n_rows":745,"n_cols":9,"rows_kept":745,"cut":false,"hidden":false,"merged":[[347,2,347,8],[61,2,61,8],[62,2,62,8],[118,2,118,8],[119,2,119,8],[175,2,175,8],[176,2,176,8],[232,2,232,8],[233,2,233,8],[289,2,289,8],[290,2,290,8],[346,2,346,8],[692,2,692,8],[406,2,406,8],[407,2,407,8],[463,2,463,8],[464,2,464,8],[520,2,520,8],[521,2,521,8],[577,2,577,8],[578,2,578,8],[634,2,634,8],[635,2,635,8],[691,2,691,8]]}
[null,{"$f":"INDEX(dms_Worksheet_List,MATCH(dms_Model,dms_Model_List))","v":"REGULATORY REPORTING STATEMENT"}]
[null,{"$f":"INDEX(dms_TradingNameFull_List,MATCH(dms_TradingName,dms_TradingName_List))","v":"Australian Gas Distribution Co. "}]
[null,{"$f":"dms_Header_Span","v":"2019-20 - 2025-26"}]
[null,"E3. MAINS AUGMENTATION"]
[]
[]
[null,"Please list all projects here:"]
[null,"2160 NEW MAIN - IMPROVED SUPPLY"]
[null,"3065 MAJOR PROJECTS - ADELAIDE CBD HP MAINS EXT EAST"]
[null,"SA115 Northern Metro HP and Gawler Gate Station (mains only)"]
[null,"SA116 Southern Metro HP Duplication (McLaren Vale to Aldinga)"]
[null,"Northern Metro HP and Gawler Gate Station (mains only)"]
[null,"Southern Metro HP Duplication (McLaren Vale to Aldinga)"]
[]
[]
[]
[]
[]
[]
[]
[]
[]
[]
[]
[]
[]
[]
[]
[]
[]
[]
[]
[]
[]
[]
[]
[]
[]
[]
[]
[]
[]
[]
[]
[]
[]
[]
[]
[]
[]
[]
[]
[]
[]
[]
[]
[]
[]
[]
[null,"E3.1 - CAPEX BY PROJECT"]
[null,"A. DIRECT INTERNAL LABOUR EXPENDITURE"]
[null,null,"EXPENDITURE"]
[null,null,{"$f":"CONCATENATE(\"$0's, real \",dms_DollarReal)","v":"$0's, real June 2021"}]
[null,null,{"$f":"CRCP_y4","v":"2019-20"},{"$f":"CRCP_y5","v":"2020-21"},{"$f":"FRCP_y1","v":"2021-22"},{"$f":"FRCP_y2","v":"2022-23"},{"$f":"FRCP_y3","v":"2023-24"},{"$f":"FRCP_y4","v":"2024-25"},{"$f":"FRCP_y5","v":"2025-26"}]
[]
[]
[]
[]
[]
[]
[]
[]
[]
[]
[]
[]
[]
[]
[]
[]
[]
[]
[]
[]
[]
[]
[]
[]
[]
[]
[]
[]
[]
[]
[]
[]
[]
[]
[]
[]
[]
[]
[]
[]
[]
[]
[]
[]
[]
[]
[]
[]
[]
[]
[null,"Aggregate of other projects with total expenditure of less than $500,000"]
[null,"Total",{"$f":"SUM(C65:C115)","v":0},{"$f":"SUM(D65:D115)","v":0},0,0,0,0,0]
[]
[null,"B. DIRECT CONTRACTOR EXPENDITURE"]
[null,null,"EXPENDITURE"]
[null,null,{"$f":"CONCATENATE(\"$0's, real \",dms_DollarReal)","v":"$0's, real June 2021"}]
[null,null,{"$f":"CRCP_y4","v":"2019-20"},{"$f":"CRCP_y5","v":"2020-21"},{"$f":"FRCP_y1","v":"2021-22"},{"$f":"FRCP_y2","v":"2022-23"},{"$f":"FRCP_y3","v":"2023-24"},{"$f":"FRCP_y4","v":"2024-25"},{"$f":"FRCP_y5","v":"2025-26"}]
[null,"2160 NEW MAIN - IMPROVED SUPPLY"]
[null,"3065 MAJOR PROJECTS - ADELAIDE CBD HP MAINS EXT EAST"]
[null,"SA115 Northern Metro HP and Gawler Gate Station (mains only)"]
[null,"SA116 Southern Metro HP Duplication (McLaren Vale to Aldinga)"]
[]
[]
[]
[]
[]
[]
[]
[]
[]
[]
[]
[]
[]
[]
[]
[]
[]
[]
[]
[]
[]
[]
[]
[]
[]
[]
[]
[]
[]
[]
[]
[]
[]
[]
[]
[]
[]
[]
[]
[]
[]
[]
[]
[]
[]
[]
[null,"Aggregate of other projects with total expenditure of less than $500,000"]
[null,"Total",{"$f":"SUM(C122:C172)","v":0},{"$f":"SUM(D122:D172)","v":0},0,0,0,0,0]
[]
[null,"C. OTHER INTERNAL DIRECT EXPENDITURE"]
[null,null,"EXPENDITURE"]
[null,null,{"$f":"CONCATENATE(\"$0's, real \",dms_DollarReal)","v":"$0's, real June 2021"}]
[null,null,{"$f":"CRCP_y4","v":"2019-20"},{"$f":"CRCP_y5","v":"2020-21"},{"$f":"FRCP_y1","v":"2021-22"},{"$f":"FRCP_y2","v":"2022-23"},{"$f":"FRCP_y3","v":"2023-24"},{"$f":"FRCP_y4","v":"2024-25"},{"$f":"FRCP_y5","v":"2025-26"}]
[]
[]
[]
[]
[]
[]
[]
[]
[]
[]
[]
[]
[]
[]
[]
[]
[]
[]
[]
[]
[]
[]
[]
[]
[]
[]
[]
[]
[]
[]
[]
[]
[]
[]
[]
[]
[]
[]
[]
[]
[]
[]
[]
[]
[]
[]
[]
[]
[]
[]
[null,"Aggregate of other projects with total expenditure of less than $500,000"]
[null,"Total",{"$f":"SUM(C179:C229)","v":0},0,0,0,0,0,0]
[]
[null,"D. TOTAL OVERHEAD EXPENDITURE"]
[null,null,"EXPENDITURE"]
[null,null,{"$f":"CONCATENATE(\"$0's, real \",dms_DollarReal)","v":"$0's, real June 2021"}]
[null,null,{"$f":"CRCP_y4","v":"2019-20"},{"$f":"CRCP_y5","v":"2020-21"},{"$f":"FRCP_y1","v":"2021-22"},{"$f":"FRCP_y2","v":"2022-23"},{"$f":"FRCP_y3","v":"2023-24"},{"$f":"FRCP_y4","v":"2024-25"},{"$f":"FRCP_y5","v":"2025-26"}]
[null,"2160 NEW MAIN - IMPROVED SUPPLY",230409.29032789779,101592.84809808682,0,0,0,0,0]
[null,"3065 MAJOR PROJECTS - ADELAIDE CBD HP MAINS EXT EAST",22423.924997145499,0,0,0,0,0,0]
[null,"Augmentation Overhead (ex Gate Station)",0,0,219271.55104951109,108175.33440137358,0,0,0]
[]
[]
[]
[]
[]
[]
[]
[]
[]
[]
[]
[]
[]
[]
[]
[]
[]
[]
[]
[]
[]
[]
[]
[]
[]
[]
[]
[]
[]
[]
[]
[]
[]
[]
[]
[]
[]
[]
[]
[]
[]
[]
[]
[]
[]
[]
[]
[null,"Aggregate of other projects with total expenditure of less than $500,000"]
[null,"Total",{"$f":"SUM(C236:C286)","v":252833.2153250433},{"$f":"SUM(D236:D286)","v":101592.84809808682},219271.55104951109,108175.33440137358,0,0,0]
[]
[null,"E. RELATED PARTY MARGIN EXPENDITURE"]
[null,null,"EXPENDITURE"]
[null,null,{"$f":"CONCATENATE(\"$0's, real \",dms_DollarReal)","v":"$0's, real June 2021"}]
[null,null,{"$f":"CRCP_y4","v":"2019-20"},{"$f":"CRCP_y5","v":"2020-21"},{"$f":"FRCP_y1","v":"2021-22"},{"$f":"FRCP_y2","v":"2022-23"},{"$f":"FRCP_y3","v":"2023-24"},{"$f":"FRCP_y4","v":"2024-25"},{"$f":"FRCP_y5","v":"2025-26"}]
[null,{"$f":"IF(ISBLANK(dms_E3_Projects_01),\"\",dms_E3_Projects_01)","v":{"$error":"#REF!"}}]
[null,{"$f":"IF(ISBLANK(dms_E3_Projects_02),\"\",dms_E3_Projects_02)","v":{"$error":"#REF!"}}]
[null,{"$f":"IF(ISBLANK(dms_E3_Projects_03),\"\",dms_E3_Projects_03)","v":{"$error":"#REF!"}}]
[null,{"$f":"IF(ISBLANK(dms_E3_Projects_04),\"\",dms_E3_Projects_04)","v":{"$error":"#REF!"}}]
[null,{"$f":"IF(ISBLANK(dms_E3_Projects_05),\"\",dms_E3_Projects_05)","v":{"$error":"#REF!"}}]
[null,{"$f":"IF(ISBLANK(dms_E3_Projects_06),\"\",dms_E3_Projects_06)","v":{"$error":"#REF!"}}]
[null,{"$f":"IF(ISBLANK(dms_E3_Projects_07),\"\",dms_E3_Projects_07)","v":{"$error":"#REF!"}}]
[null,{"$f":"IF(ISBLANK(dms_E3_Projects_08),\"\",dms_E3_Projects_08)","v":{"$error":"#REF!"}}]
[null,{"$f":"IF(ISBLANK(dms_E3_Projects_09),\"\",dms_E3_Projects_09)","v":{"$error":"#REF!"}}]
[null,{"$f":"IF(ISBLANK(dms_E3_Projects_10),\"\",dms_E3_Projects_10)","v":{"$error":"#REF!"}}]
[null,{"$f":"IF(ISBLANK(dms_E3_Projects_11),\"\",dms_E3_Projects_11)","v":{"$error":"#REF!"}}]
[null,{"$f":"IF(ISBLANK(dms_E3_Projects_12),\"\",dms_E3_Projects_12)","v":{"$error":"#REF!"}}]
[null,{"$f":"IF(ISBLANK(dms_E3_Projects_13),\"\",dms_E3_Projects_13)","v":{"$error":"#REF!"}}]
[null,{"$f":"IF(ISBLANK(dms_E3_Projects_14),\"\",dms_E3_Projects_14)","v":{"$error":"#REF!"}}]
[null,{"$f":"IF(ISBLANK(dms_E3_Projects_15),\"\",dms_E3_Projects_15)","v":{"$error":"#REF!"}}]
[null,{"$f":"IF(ISBLANK(dms_E3_Projects_16),\"\",dms_E3_Projects_16)","v":{"$error":"#REF!"}}]
[null,{"$f":"IF(ISBLANK(dms_E3_Projects_17),\"\",dms_E3_Projects_17)","v":{"$error":"#REF!"}}]
[null,{"$f":"IF(ISBLANK(dms_E3_Projects_18),\"\",dms_E3_Projects_18)","v":{"$error":"#REF!"}}]
[null,{"$f":"IF(ISBLANK(dms_E3_Projects_18),\"\",dms_E3_Projects_18)","v":{"$error":"#REF!"}}]
[null,{"$f":"IF(ISBLANK(dms_E3_Projects_19),\"\",dms_E3_Projects_19)","v":{"$error":"#REF!"}}]
[null,{"$f":"IF(ISBLANK(dms_E3_Projects_20),\"\",dms_E3_Projects_20)","v":{"$error":"#REF!"}}]
[null,{"$f":"IF(ISBLANK(dms_E3_Projects_21),\"\",dms_E3_Projects_21)","v":{"$error":"#REF!"}}]
[null,{"$f":"IF(ISBLANK(dms_E3_Projects_22),\"\",dms_E3_Projects_22)","v":{"$error":"#REF!"}}]
[null,{"$f":"IF(ISBLANK(dms_E3_Projects_23),\"\",dms_E3_Projects_23)","v":{"$error":"#REF!"}}]
[null,{"$f":"IF(ISBLANK(dms_E3_Projects_24),\"\",dms_E3_Projects_24)","v":{"$error":"#REF!"}}]
[null,{"$f":"IF(ISBLANK(dms_E3_Projects_25),\"\",dms_E3_Projects_26)","v":{"$error":"#REF!"}}]
[null,{"$f":"IF(ISBLANK(dms_E3_Projects_27),\"\",dms_E3_Projects_27)","v":{"$error":"#REF!"}}]
[null,{"$f":"IF(ISBLANK(dms_E3_Projects_28),\"\",dms_E3_Projects_28)","v":{"$error":"#REF!"}}]
[null,{"$f":"IF(ISBLANK(dms_E3_Projects_29),\"\",dms_E3_Projects_29)","v":{"$error":"#REF!"}}]
[null,{"$f":"IF(ISBLANK(dms_E3_Projects_30),\"\",dms_E3_Projects_30)","v":{"$error":"#REF!"}}]
[null,{"$f":"IF(ISBLANK(dms_E3_Projects_31),\"\",dms_E3_Projects_31)","v":{"$error":"#REF!"}}]
[null,{"$f":"IF(ISBLANK(dms_E3_Projects_32),\"\",dms_E3_Projects_32)","v":{"$error":"#REF!"}}]
[null,{"$f":"IF(ISBLANK(dms_E3_Projects_33),\"\",dms_E3_Projects_33)","v":{"$error":"#REF!"}}]
[null,{"$f":"IF(ISBLANK(dms_E3_Projects_34),\"\",dms_E3_Projects_34)","v":{"$error":"#REF!"}}]
[null,{"$f":"IF(ISBLANK(dms_E3_Projects_35),\"\",dms_E3_Projects_35)","v":{"$error":"#REF!"}}]
[null,{"$f":"IF(ISBLANK(dms_E3_Projects_36),\"\",dms_E3_Projects_36)","v":{"$error":"#REF!"}}]
[null,{"$f":"IF(ISBLANK(dms_E3_Projects_37),\"\",dms_E3_Projects_37)","v":{"$error":"#REF!"}}]
[null,{"$f":"IF(ISBLANK(dms_E3_Projects_38),\"\",dms_E3_Projects_38)","v":{"$error":"#REF!"}}]
[null,{"$f":"IF(ISBLANK(dms_E3_Projects_39),\"\",dms_E3_Projects_39)","v":{"$error":"#REF!"}}]
[null,{"$f":"IF(ISBLANK(dms_E3_Projects_40),\"\",dms_E3_Projects_40)","v":{"$error":"#REF!"}}]
[null,{"$f":"IF(ISBLANK(dms_E3_Projects_41),\"\",dms_E3_Projects_41)","v":{"$error":"#REF!"}}]
[null,{"$f":"IF(ISBLANK(dms_E3_Projects_42),\"\",dms_E3_Projects_42)","v":{"$error":"#REF!"}}]
[null,{"$f":"IF(ISBLANK(dms_E3_Projects_43),\"\",dms_E3_Projects_43)","v":{"$error":"#REF!"}}]
[null,{"$f":"IF(ISBLANK(dms_E3_Projects_44),\"\",dms_E3_Projects_44)","v":{"$error":"#REF!"}}]
[null,{"$f":"IF(ISBLANK(dms_E3_Projects_45),\"\",dms_E3_Projects_45)","v":{"$error":"#REF!"}}]
[null,{"$f":"IF(ISBLANK(dms_E3_Projects_46),\"\",dms_E3_Projects_46)","v":{"$error":"#REF!"}}]
[null,{"$f":"IF(ISBLANK(dms_E3_Projects_47),\"\",dms_E3_Projects_47)","v":{"$error":"#REF!"}}]
[null,{"$f":"IF(ISBLANK(dms_E3_Projects_48),\"\",dms_E3_Projects_48)","v":{"$error":"#REF!"}}]
[null,{"$f":"IF(ISBLANK(dms_E3_Projects_49),\"\",dms_E3_Projects_49)","v":{"$error":"#REF!"}}]
[null,{"$f":"IF(ISBLANK(dms_E3_Projects_50),\"\",dms_E3_Projects_50)","v":{"$error":"#REF!"}}]
[null,"Aggregate of other projects with total expenditure of less than $500,000"]
[null,"Total",{"$f":"SUM(C293:C343)","v":0},{"$f":"SUM(D293:D343)","v":0},0,0,0,0,0]
[]
[null,"F. CAPITAL CONTRIBUTIONS included in the above"]
[null,null,"EXPENDITURE"]
[null,null,{"$f":"CONCATENATE(\"$0's, real \",dms_DollarReal)","v":"$0's, real June 2021"}]
[null,null,{"$f":"CRCP_y4","v":"2019-20"},{"$f":"CRCP_y5","v":"2020-21"},{"$f":"FRCP_y1","v":"2021-22"},{"$f":"FRCP_y2","v":"2022-23"},{"$f":"FRCP_y3","v":"2023-24"},{"$f":"FRCP_y4","v":"2024-25"},{"$f":"FRCP_y5","v":"2025-26"}]
[null,{"$f":"IF(ISBLANK(dms_E3_Projects_01),\"\",dms_E3_Projects_01)","v":{"$error":"#REF!"}}]
[null,{"$f":"IF(ISBLANK(dms_E3_Projects_02),\"\",dms_E3_Projects_02)","v":{"$error":"#REF!"}}]
[null,{"$f":"IF(ISBLANK(dms_E3_Projects_03),\"\",dms_E3_Projects_03)","v":{"$error":"#REF!"}}]
[null,{"$f":"IF(ISBLANK(dms_E3_Projects_04),\"\",dms_E3_Projects_04)","v":{"$error":"#REF!"}}]
[null,{"$f":"IF(ISBLANK(dms_E3_Projects_05),\"\",dms_E3_Projects_05)","v":{"$error":"#REF!"}}]
[null,{"$f":"IF(ISBLANK(dms_E3_Projects_06),\"\",dms_E3_Projects_06)","v":{"$error":"#REF!"}}]
[null,{"$f":"IF(ISBLANK(dms_E3_Projects_07),\"\",dms_E3_Projects_07)","v":{"$error":"#REF!"}}]
[null,{"$f":"IF(ISBLANK(dms_E3_Projects_08),\"\",dms_E3_Projects_08)","v":{"$error":"#REF!"}}]
[null,{"$f":"IF(ISBLANK(dms_E3_Projects_09),\"\",dms_E3_Projects_09)","v":{"$error":"#REF!"}}]
[null,{"$f":"IF(ISBLANK(dms_E3_Projects_10),\"\",dms_E3_Projects_10)","v":{"$error":"#REF!"}}]
[null,{"$f":"IF(ISBLANK(dms_E3_Projects_11),\"\",dms_E3_Projects_11)","v":{"$error":"#REF!"}}]
[null,{"$f":"IF(ISBLANK(dms_E3_Projects_12),\"\",dms_E3_Projects_12)","v":{"$error":"#REF!"}}]
[null,{"$f":"IF(ISBLANK(dms_E3_Projects_13),\"\",dms_E3_Projects_13)","v":{"$error":"#REF!"}}]
[null,{"$f":"IF(ISBLANK(dms_E3_Projects_14),\"\",dms_E3_Projects_14)","v":{"$error":"#REF!"}}]
[null,{"$f":"IF(ISBLANK(dms_E3_Projects_15),\"\",dms_E3_Projects_15)","v":{"$error":"#REF!"}}]
[null,{"$f":"IF(ISBLANK(dms_E3_Projects_16),\"\",dms_E3_Projects_16)","v":{"$error":"#REF!"}}]
[null,{"$f":"IF(ISBLANK(dms_E3_Projects_17),\"\",dms_E3_Projects_17)","v":{"$error":"#REF!"}}]
[null,{"$f":"IF(ISBLANK(dms_E3_Projects_18),\"\",dms_E3_Projects_18)","v":{"$error":"#REF!"}}]
[null,{"$f":"IF(ISBLANK(dms_E3_Projects_18),\"\",dms_E3_Projects_18)","v":{"$error":"#REF!"}}]
[null,{"$f":"IF(ISBLANK(dms_E3_Projects_19),\"\",dms_E3_Projects_19)","v":{"$error":"#REF!"}}]
[null,{"$f":"IF(ISBLANK(dms_E3_Projects_20),\"\",dms_E3_Projects_20)","v":{"$error":"#REF!"}}]
[null,{"$f":"IF(ISBLANK(dms_E3_Projects_21),\"\",dms_E3_Projects_21)","v":{"$error":"#REF!"}}]
[null,{"$f":"IF(ISBLANK(dms_E3_Projects_22),\"\",dms_E3_Projects_22)","v":{"$error":"#REF!"}}]
[null,{"$f":"IF(ISBLANK(dms_E3_Projects_23),\"\",dms_E3_Projects_23)","v":{"$error":"#REF!"}}]
[null,{"$f":"IF(ISBLANK(dms_E3_Projects_24),\"\",dms_E3_Projects_24)","v":{"$error":"#REF!"}}]
[null,{"$f":"IF(ISBLANK(dms_E3_Projects_25),\"\",dms_E3_Projects_26)","v":{"$error":"#REF!"}}]
[null,{"$f":"IF(ISBLANK(dms_E3_Projects_27),\"\",dms_E3_Projects_27)","v":{"$error":"#REF!"}}]
[null,{"$f":"IF(ISBLANK(dms_E3_Projects_28),\"\",dms_E3_Projects_28)","v":{"$error":"#REF!"}}]
[null,{"$f":"IF(ISBLANK(dms_E3_Projects_29),\"\",dms_E3_Projects_29)","v":{"$error":"#REF!"}}]
[null,{"$f":"IF(ISBLANK(dms_E3_Projects_30),\"\",dms_E3_Projects_30)","v":{"$error":"#REF!"}}]
[null,{"$f":"IF(ISBLANK(dms_E3_Projects_31),\"\",dms_E3_Projects_31)","v":{"$error":"#REF!"}}]
[null,{"$f":"IF(ISBLANK(dms_E3_Projects_32),\"\",dms_E3_Projects_32)","v":{"$error":"#REF!"}}]
[null,{"$f":"IF(ISBLANK(dms_E3_Projects_33),\"\",dms_E3_Projects_33)","v":{"$error":"#REF!"}}]
[null,{"$f":"IF(ISBLANK(dms_E3_Projects_34),\"\",dms_E3_Projects_34)","v":{"$error":"#REF!"}}]
[null,{"$f":"IF(ISBLANK(dms_E3_Projects_35),\"\",dms_E3_Projects_35)","v":{"$error":"#REF!"}}]
[null,{"$f":"IF(ISBLANK(dms_E3_Projects_36),\"\",dms_E3_Projects_36)","v":{"$error":"#REF!"}}]
[null,{"$f":"IF(ISBLANK(dms_E3_Projects_37),\"\",dms_E3_Projects_37)","v":{"$error":"#REF!"}}]
[null,{"$f":"IF(ISBLANK(dms_E3_Projects_38),\"\",dms_E3_Projects_38)","v":{"$error":"#REF!"}}]
[null,{"$f":"IF(ISBLANK(dms_E3_Projects_39),\"\",dms_E3_Projects_39)","v":{"$error":"#REF!"}}]
[null,{"$f":"IF(ISBLANK(dms_E3_Projects_40),\"\",dms_E3_Projects_40)","v":{"$error":"#REF!"}}]
[null,{"$f":"IF(ISBLANK(dms_E3_Projects_41),\"\",dms_E3_Projects_41)","v":{"$error":"#REF!"}}]
[null,{"$f":"IF(ISBLANK(dms_E3_Projects_42),\"\",dms_E3_Projects_42)","v":{"$error":"#REF!"}}]
[null,{"$f":"IF(ISBLANK(dms_E3_Projects_43),\"\",dms_E3_Projects_43)","v":{"$error":"#REF!"}}]
[null,{"$f":"IF(ISBLANK(dms_E3_Projects_44),\"\",dms_E3_Projects_44)","v":{"$error":"#REF!"}}]
[null,{"$f":"IF(ISBLANK(dms_E3_Projects_45),\"\",dms_E3_Projects_45)","v":{"$error":"#REF!"}}]
[null,{"$f":"IF(ISBLANK(dms_E3_Projects_46),\"\",dms_E3_Projects_46)","v":{"$error":"#REF!"}}]
[null,{"$f":"IF(ISBLANK(dms_E3_Projects_47),\"\",dms_E3_Projects_47)","v":{"$error":"#REF!"}}]
[null,{"$f":"IF(ISBLANK(dms_E3_Projects_48),\"\",dms_E3_Projects_48)","v":{"$error":"#REF!"}}]
[null,{"$f":"IF(ISBLANK(dms_E3_Projects_49),\"\",dms_E3_Projects_49)","v":{"$error":"#REF!"}}]
[null,{"$f":"IF(ISBLANK(dms_E3_Projects_50),\"\",dms_E3_Projects_50)","v":{"$error":"#REF!"}}]
[null,"Aggregate of other projects with total expenditure of less than $500,000"]
[null,"Total",{"$f":"SUM(C350:C400)","v":0},{"$f":"SUM(D350:D400)","v":0},0,0,0,0,0]
[]
[]
[]
[null,"E3.2 - VOLUMES - BY PRESSURE TYPE - BY PROJECT"]
[null,"A. LOW PRESSURE TO LOW PRESSURE"]
[null,null,"LENGTH"]
[null,null,"0s, metres"]
[null,null,{"$f":"CRCP_y4","v":"2019-20"},{"$f":"CRCP_y5","v":"2020-21"},{"$f":"FRCP_y1","v":"2021-22"},{"$f":"FRCP_y2","v":"2022-23"},{"$f":"FRCP_y3","v":"2023-24"},{"$f":"FRCP_y4","v":"2024-25"},{"$f":"FRCP_y5","v":"2025-26"}]
[]
[]
[]
[]
[]
[]
[]
[]
[]
[]
[]
[]
[]
[]
[]
[]
[]
[]
[]
[]
[]
[]
[]
[]
[]
[]
[]
[]
[]
[]
[]
[]
[]
[]
[]
[]
[]
[]
[]
[]
[]
[]
[]
[]
[]
[]
[]
[]
[]
[]
[null,"Aggregate of other projects with total expenditure of less than $500,000"]
[null,"Total",{"$f":"SUM(C410:C460)","v":0},{"$f":"SUM(D410:D460)","v":0},0,0,0,0,0]
[]
[null,"B. LOW PRESSURE TO MEDIUM PRESSURE"]
[null,null,"LENGTH"]
[null,null,"0s, metres"]
[null,null,{"$f":"CRCP_y4","v":"2019-20"},{"$f":"CRCP_y5","v":"2020-21"},{"$f":"FRCP_y1","v":"2021-22"},{"$f":"FRCP_y2","v":"2022-23"},{"$f":"FRCP_y3","v":"2023-24"},{"$f":"FRCP_y4","v":"2024-25"},{"$f":"FRCP_y5","v":"2025-26"}]
[]
[]
[]
[]
[]
[]
[]
[]
[]
[]
[]
[]
[]
[]
[]
[]
[]
[]
[]
[]
[]
[]
[]
[]
[]
[]
[]
[]
[]
[]
[]
[]
[]
[]
[]
[]
[]
[]
[]
[]
[]
[]
[]
[]
[]
[]
[]
[]
[]
[]
[null,"Aggregate of other projects with total expenditure of less than $500,000"]
[null,"Total",{"$f":"SUM(C467:C517)","v":0},{"$f":"SUM(D467:D517)","v":0},0,0,0,0,0]
[]
[null,"C. LOW PRESSURE TO HIGH PRESSURE"]
[null,null,"LENGTH"]
[null,null,"0s, metres"]
[null,null,{"$f":"CRCP_y4","v":"2019-20"},{"$f":"CRCP_y5","v":"2020-21"},{"$f":"FRCP_y1","v":"2021-22"},{"$f":"FRCP_y2","v":"2022-23"},{"$f":"FRCP_y3","v":"2023-24"},{"$f":"FRCP_y4","v":"2024-25"},{"$f":"FRCP_y5","v":"2025-26"}]
[]
[]
[]
[]
[]
[]
[]
[]
[]
[]
[]
[]
[]
[]
[]
[]
[]
[]
[]
[]
[]
[]
[]
[]
[]
[]
[]
[]
[]
[]
[]
[]
[]
[]
[]
[]
[]
[]
[]
[]
[]
[]
[]
[]
[]
[]
[]
[]
[]
[]
[null,"Aggregate of other projects with total expenditure of less than $500,000"]
[null,"Total",{"$f":"SUM(C524:C574)","v":0},{"$f":"SUM(D524:D574)","v":0},0,0,0,0,0]
[]
[null,"D. MEDIUM PRESSURE TO MEDIUM PRESSURE"]
[null,null,"LENGTH"]
[null,null,"0s, metres"]
[null,null,{"$f":"CRCP_y4","v":"2019-20"},{"$f":"CRCP_y5","v":"2020-21"},{"$f":"FRCP_y1","v":"2021-22"},{"$f":"FRCP_y2","v":"2022-23"},{"$f":"FRCP_y3","v":"2023-24"},{"$f":"FRCP_y4","v":"2024-25"},{"$f":"FRCP_y5","v":"2025-26"}]
[]
[]
[]
[]
[]
[]
[]
[]
[]
[]
[]
[]
[]
[]
[]
[]
[]
[]
[]
[]
[]
[]
[]
[]
[]
[]
[]
[]
[]
[]
[]
[]
[]
[]
[]
[]
[]
[]
[]
[]
[]
[]
[]
[]
[]
[]
[]
[]
[]
[]
[null,"Aggregate of other projects with total expenditure of less than $500,000"]
[null,"Total",{"$f":"SUM(C581:C631)","v":0},{"$f":"SUM(D581:D631)","v":0},0,0,0,0,0]
[]
[null,"E. MEDIUM PRESSURE TO HIGH PRESSURE"]
[null,null,"LENGTH"]
[null,null,"0s, metres"]
[null,null,{"$f":"CRCP_y4","v":"2019-20"},{"$f":"CRCP_y5","v":"2020-21"},{"$f":"FRCP_y1","v":"2021-22"},{"$f":"FRCP_y2","v":"2022-23"},{"$f":"FRCP_y3","v":"2023-24"},{"$f":"FRCP_y4","v":"2024-25"},{"$f":"FRCP_y5","v":"2025-26"}]
[null,{"$f":"IF(ISBLANK(dms_E3_Projects_01),\"\",dms_E3_Projects_01)","v":{"$error":"#REF!"}}]
[null,{"$f":"IF(ISBLANK(dms_E3_Projects_02),\"\",dms_E3_Projects_02)","v":{"$error":"#REF!"}}]
[null,{"$f":"IF(ISBLANK(dms_E3_Projects_03),\"\",dms_E3_Projects_03)","v":{"$error":"#REF!"}}]
[null,{"$f":"IF(ISBLANK(dms_E3_Projects_04),\"\",dms_E3_Projects_04)","v":{"$error":"#REF!"}}]
[null,{"$f":"IF(ISBLANK(dms_E3_Projects_05),\"\",dms_E3_Projects_05)","v":{"$error":"#REF!"}}]
[null,{"$f":"IF(ISBLANK(dms_E3_Projects_06),\"\",dms_E3_Projects_06)","v":{"$error":"#REF!"}}]
[null,{"$f":"IF(ISBLANK(dms_E3_Projects_07),\"\",dms_E3_Projects_07)","v":{"$error":"#REF!"}}]
[null,{"$f":"IF(ISBLANK(dms_E3_Projects_08),\"\",dms_E3_Projects_08)","v":{"$error":"#REF!"}}]
[null,{"$f":"IF(ISBLANK(dms_E3_Projects_09),\"\",dms_E3_Projects_09)","v":{"$error":"#REF!"}}]
[null,{"$f":"IF(ISBLANK(dms_E3_Projects_10),\"\",dms_E3_Projects_10)","v":{"$error":"#REF!"}}]
[null,{"$f":"IF(ISBLANK(dms_E3_Projects_11),\"\",dms_E3_Projects_11)","v":{"$error":"#REF!"}}]
[null,{"$f":"IF(ISBLANK(dms_E3_Projects_12),\"\",dms_E3_Projects_12)","v":{"$error":"#REF!"}}]
[null,{"$f":"IF(ISBLANK(dms_E3_Projects_13),\"\",dms_E3_Projects_13)","v":{"$error":"#REF!"}}]
[null,{"$f":"IF(ISBLANK(dms_E3_Projects_14),\"\",dms_E3_Projects_14)","v":{"$error":"#REF!"}}]
[null,{"$f":"IF(ISBLANK(dms_E3_Projects_15),\"\",dms_E3_Projects_15)","v":{"$error":"#REF!"}}]
[null,{"$f":"IF(ISBLANK(dms_E3_Projects_16),\"\",dms_E3_Projects_16)","v":{"$error":"#REF!"}}]
[null,{"$f":"IF(ISBLANK(dms_E3_Projects_17),\"\",dms_E3_Projects_17)","v":{"$error":"#REF!"}}]
[null,{"$f":"IF(ISBLANK(dms_E3_Projects_18),\"\",dms_E3_Projects_18)","v":{"$error":"#REF!"}}]
[null,{"$f":"IF(ISBLANK(dms_E3_Projects_18),\"\",dms_E3_Projects_18)","v":{"$error":"#REF!"}}]
[null,{"$f":"IF(ISBLANK(dms_E3_Projects_19),\"\",dms_E3_Projects_19)","v":{"$error":"#REF!"}}]
[null,{"$f":"IF(ISBLANK(dms_E3_Projects_20),\"\",dms_E3_Projects_20)","v":{"$error":"#REF!"}}]
[null,{"$f":"IF(ISBLANK(dms_E3_Projects_21),\"\",dms_E3_Projects_21)","v":{"$error":"#REF!"}}]
[null,{"$f":"IF(ISBLANK(dms_E3_Projects_22),\"\",dms_E3_Projects_22)","v":{"$error":"#REF!"}}]
[null,{"$f":"IF(ISBLANK(dms_E3_Projects_23),\"\",dms_E3_Projects_23)","v":{"$error":"#REF!"}}]
[null,{"$f":"IF(ISBLANK(dms_E3_Projects_24),\"\",dms_E3_Projects_24)","v":{"$error":"#REF!"}}]
[null,{"$f":"IF(ISBLANK(dms_E3_Projects_25),\"\",dms_E3_Projects_26)","v":{"$error":"#REF!"}}]
[null,{"$f":"IF(ISBLANK(dms_E3_Projects_27),\"\",dms_E3_Projects_27)","v":{"$error":"#REF!"}}]
[null,{"$f":"IF(ISBLANK(dms_E3_Projects_28),\"\",dms_E3_Projects_28)","v":{"$error":"#REF!"}}]
[null,{"$f":"IF(ISBLANK(dms_E3_Projects_29),\"\",dms_E3_Projects_29)","v":{"$error":"#REF!"}}]
[null,{"$f":"IF(ISBLANK(dms_E3_Projects_30),\"\",dms_E3_Projects_30)","v":{"$error":"#REF!"}}]
[null,{"$f":"IF(ISBLANK(dms_E3_Projects_31),\"\",dms_E3_Projects_31)","v":{"$error":"#REF!"}}]
[null,{"$f":"IF(ISBLANK(dms_E3_Projects_32),\"\",dms_E3_Projects_32)","v":{"$error":"#REF!"}}]
[null,{"$f":"IF(ISBLANK(dms_E3_Projects_33),\"\",dms_E3_Projects_33)","v":{"$error":"#REF!"}}]
[null,{"$f":"IF(ISBLANK(dms_E3_Projects_34),\"\",dms_E3_Projects_34)","v":{"$error":"#REF!"}}]
[null,{"$f":"IF(ISBLANK(dms_E3_Projects_35),\"\",dms_E3_Projects_35)","v":{"$error":"#REF!"}}]
[null,{"$f":"IF(ISBLANK(dms_E3_Projects_36),\"\",dms_E3_Projects_36)","v":{"$error":"#REF!"}}]
[null,{"$f":"IF(ISBLANK(dms_E3_Projects_37),\"\",dms_E3_Projects_37)","v":{"$error":"#REF!"}}]
[null,{"$f":"IF(ISBLANK(dms_E3_Projects_38),\"\",dms_E3_Projects_38)","v":{"$error":"#REF!"}}]
[null,{"$f":"IF(ISBLANK(dms_E3_Projects_39),\"\",dms_E3_Projects_39)","v":{"$error":"#REF!"}}]
[null,{"$f":"IF(ISBLANK(dms_E3_Projects_40),\"\",dms_E3_Projects_40)","v":{"$error":"#REF!"}}]
[null,{"$f":"IF(ISBLANK(dms_E3_Projects_41),\"\",dms_E3_Projects_41)","v":{"$error":"#REF!"}}]
[null,{"$f":"IF(ISBLANK(dms_E3_Projects_42),\"\",dms_E3_Projects_42)","v":{"$error":"#REF!"}}]
[null,{"$f":"IF(ISBLANK(dms_E3_Projects_43),\"\",dms_E3_Projects_43)","v":{"$error":"#REF!"}}]
[null,{"$f":"IF(ISBLANK(dms_E3_Projects_44),\"\",dms_E3_Projects_44)","v":{"$error":"#REF!"}}]
[null,{"$f":"IF(ISBLANK(dms_E3_Projects_45),\"\",dms_E3_Projects_45)","v":{"$error":"#REF!"}}]
[null,{"$f":"IF(ISBLANK(dms_E3_Projects_46),\"\",dms_E3_Projects_46)","v":{"$error":"#REF!"}}]
[null,{"$f":"IF(ISBLANK(dms_E3_Projects_47),\"\",dms_E3_Projects_47)","v":{"$error":"#REF!"}}]
[null,{"$f":"IF(ISBLANK(dms_E3_Projects_48),\"\",dms_E3_Projects_48)","v":{"$error":"#REF!"}}]
[null,{"$f":"IF(ISBLANK(dms_E3_Projects_49),\"\",dms_E3_Projects_49)","v":{"$error":"#REF!"}}]
[null,{"$f":"IF(ISBLANK(dms_E3_Projects_50),\"\",dms_E3_Projects_50)","v":{"$error":"#REF!"}}]
[null,"Aggregate of other projects with total expenditure of less than $500,000"]
[null,"Total",{"$f":"SUM(C638:C688)","v":0},{"$f":"SUM(D638:D688)","v":0},0,0,0,0,0]
[]
[null,"F. HIGH PRESSURE TO HIGH PRESSURE"]
[null,null,"LENGTH"]
[null,null,"0s, metres"]
[null,null,{"$f":"CRCP_y4","v":"2019-20"},{"$f":"CRCP_y5","v":"2020-21"},{"$f":"FRCP_y1","v":"2021-22"},{"$f":"FRCP_y2","v":"2022-23"},{"$f":"FRCP_y3","v":"2023-24"},{"$f":"FRCP_y4","v":"2024-25"},{"$f":"FRCP_y5","v":"2025-26"}]
[null,"2160 NEW MAIN - IMPROVED SUPPLY",1090,1200,0,0,0,0,0]
[null,"Northern Metro HP and Gawler Gate Station (mains only)",0,0,0,1300,0,0,0]
[null,"Southern Metro HP Duplication (McLaren Vale to Aldinga)",0,0,2800,0,0,0,0]
[]
[]
[]
[]
[]
[]
[]
[]
[]
[]
[]
[]
[]
[]
[]
[]
[]
[]
[]
[]
[]
[]
[]
[]
[]
[]
[]
[]
[]
[]
[]
[]
[]
[]
[]
[]
[]
[]
[]
[]
[]
[]
[]
[]
[]
[]
[null,"Aggregate of other projects with total expenditure of less than $500,000"]
[null,"Total",{"$f":"SUM(C695:C744)","v":1090},{"$f":"SUM(D695:D744)","v":1200},2800,1300,0,0,0]

{"sheet":"E4. Meter replacement","index":10,"n_rows":207,"n_cols":9,"rows_kept":207,"cut":false,"hidden":false,"merged":[[80,2,80,8],[7,2,7,8],[8,2,8,8],[43,2,43,8],[44,2,44,8],[79,2,79,8],[201,2,201,8],[115,2,115,8],[116,2,116,8],[153,2,153,8],[154,2,154,8],[163,2,163,8],[164,2,164,8],[180,2,180,8],[181,2,181,8],[190,2,190,8],[191,2,191,8],[200,2,200,8]]}
[null,{"$f":"INDEX(dms_Worksheet_List,MATCH(dms_Model,dms_Model_List))","v":"REGULATORY REPORTING STATEMENT"}]
[null,{"$f":"INDEX(dms_TradingNameFull_List,MATCH(dms_TradingName,dms_TradingName_List))","v":"Australian Gas Distribution Co. "}]
[null,{"$f":"dms_Header_Span","v":"2019-20 - 2025-26"}]
[null,"E4. METER REPLACEMENT"]
[]
[null,"E4.1 - CAPEX"]
[null,"E4.1.1 - NEW METERS ACQUIRED"]
[null,null,"EXPENDITURE"]
[null,null,{"$f":"CONCATENATE(\"$0's, real \",dms_DollarReal)","v":"$0's, real June 2021"}]
[null,null,{"$f":"CRCP_y4","v":"2019-20"},{"$f":"CRCP_y5","v":"2020-21"},{"$f":"FRCP_y1","v":"2021-22"},{"$f":"FRCP_y2","v":"2022-23"},{"$f":"FRCP_y3","v":"2023-24"},{"$f":"FRCP_y4","v":"2024-25"},{"$f":"FRCP_y5","v":"2025-26"}]
[null,"A. DIRECT INTERNAL LABOUR EXPENDITURE"]
[null,"Residential"]
[null,"Industrial and Commercial"]
[null,"Other"]
[null,"Total",{"$f":"SUM(C12:C14)","v":0},{"$f":"SUM(D12:D14)","v":0},0,0,0,0,0]
[null,"B. DIRECT CONTRACTOR EXPENDITURE"]
[null,"Residential"]
[null,"Industrial and Commercial"]
[null,"Other"]
[null,"Total",{"$f":"SUM(C17:C19)","v":0},{"$f":"SUM(D17:D19)","v":0},0,0,0,0,0]
[null,"C. OTHER INTERNAL DIRECT EXPENDITURE"]
[null,"Residential"]
[null,"Industrial and Commercial"]
[null,"Other"]
[null,"Total",{"$f":"SUM(C22:C24)","v":0},{"$f":"SUM(D22:D24)","v":0},0,0,0,0,0]
[null,"D. TOTAL OVERHEAD EXPENDITURE"]
[null,"Residential",179139.06991253229,119728.64231521185,167138.48127385508,149546.55173656726,221201.4014794871,178230.27018186913,240223.36424811347]
[null,"Industrial and Commercial",31384.359276256728,14220.912588656489,13890.912567207781,16128.48737220932,13233.059670326946,19297.576015568196,17993.465323131277]
[null,"Other"]
[null,"Total",{"$f":"SUM(C27:C29)","v":210523.42918878901},{"$f":"SUM(D27:D29)","v":133949.55490386835},181029.39384106288,165675.03910877657,234434.46114981404,197527.84619743732,258216.82957124474]
[null,"E. RELATED PARTY MARGIN EXPENDITURE"]
[null,"Residential"]
[null,"Industrial and Commercial"]
[null,"Other"]
[null,"Total",{"$f":"SUM(C32:C34)","v":0},{"$f":"SUM(D32:D34)","v":0},0,0,0,0,0]
[null,"F. CAPITAL CONTRIBUTIONS included in the above"]
[null,"Residential"]
[null,"Industrial and Commercial"]
[null,"Other"]
[null,"Total",{"$f":"SUM(C37:C39)","v":0},{"$f":"SUM(D37:D39)","v":0},0,0,0,0,0]
[null,"TOTAL",{"$f":"SUM(C15,C20,C25,C30,C35,C40)","v":210523.42918878901},{"$f":"SUM(D15,D20,D25,D30,D35,D40)","v":133949.55490386835},181029.39384106288,165675.03910877657,234434.46114981404,197527.84619743732,258216.82957124474]
[]
[null,"E4.1.2 - METER REFURBISHMENT"]
[null,null,"EXPENDITURE"]
[null,null,{"$f":"CONCATENATE(\"$0's, real \",dms_DollarReal)","v":"$0's, real June 2021"}]
[null,null,{"$f":"CRCP_y4","v":"2019-20"},{"$f":"CRCP_y5","v":"2020-21"},{"$f":"FRCP_y1","v":"2021-22"},{"$f":"FRCP_y2","v":"2022-23"},{"$f":"FRCP_y3","v":"2023-24"},{"$f":"FRCP_y4","v":"2024-25"},{"$f":"FRCP_y5","v":"2025-26"}]
[null,"A. DIRECT INTERNAL LABOUR EXPENDITURE"]
[null,"Residential"]
[null,"Industrial and Commercial"]
[null,"Other"]
[null,"Total",{"$f":"SUM(C48:C50)","v":0},{"$f":"SUM(D48:D50)","v":0},0,0,0,0,0]
[null,"B. DIRECT CONTRACTOR EXPENDITURE"]
[null,"Residential"]
[null,"Industrial and Commercial"]
[null,"Other"]
[null,"Total",{"$f":"SUM(C53:C55)","v":0},{"$f":"SUM(D53:D55)","v":0},0,0,0,0,0]
[null,"C. OTHER INTERNAL DIRECT EXPENDITURE"]
[null,"Residential"]
[null,"Industrial and Commercial"]
[null,"Other"]
[null,"Total",{"$f":"SUM(C58:C60)","v":0},{"$f":"SUM(D58:D60)","v":0},0,0,0,0,0]
[null,"D. TOTAL OVERHEAD EXPENDITURE"]
[null,"Residential",119426.04660835484,79819.094876807911,111425.65418257006,99697.701157711504,147467.60098632475,118820.1801212461,160148.90949874232]
[null,"Industrial and Commercial",20922.906184171155,9480.608392437658,9260.6083781385223,10752.324914806215,8822.0397802179632,12865.050677045465,11995.643548754186]
[null,"Other"]
[null,"Total",{"$f":"SUM(C63:C65)","v":140348.95279252599},{"$f":"SUM(D63:D65)","v":89299.703269245569},120686.26256070858,110450.02607251772,156289.6407665427,131685.23079829157,172144.55304749651]
[null,"E. RELATED PARTY MARGIN EXPENDITURE"]
[null,"Residential"]
[null,"Industrial and Commercial"]
[null,"Other"]
[null,"Total",{"$f":"SUM(C68:C70)","v":0},{"$f":"SUM(D68:D70)","v":0},0,0,0,0,0]
[null,"F. CAPITAL CONTRIBUTIONS included in the above"]
[null,"Residential"]
[null,"Industrial and Commercial"]
[null,"Other"]
[null,"Total",{"$f":"SUM(C73:C75)","v":0},{"$f":"SUM(D73:D75)","v":0},0,0,0,0,0]
[null,"TOTAL",{"$f":"SUM(C51,C56,C61,C66,C71,C76)","v":140348.95279252599},{"$f":"SUM(D51,D56,D61,D66,D71,D76)","v":89299.703269245569},120686.26256070858,110450.02607251772,156289.6407665427,131685.23079829157,172144.55304749651]
[]
[null,"E4.1.3 - METER INSTALLATION"]
[null,null,"EXPENDITURE"]
[null,null,{"$f":"CONCATENATE(\"$0's, real \",dms_DollarReal)","v":"$0's, real June 2021"}]
[null,null,{"$f":"CRCP_y4","v":"2019-20"},{"$f":"CRCP_y5","v":"2020-21"},{"$f":"FRCP_y1","v":"2021-22"},{"$f":"FRCP_y2","v":"2022-23"},{"$f":"FRCP_y3","v":"2023-24"},{"$f":"FRCP_y4","v":"2024-25"},{"$f":"FRCP_y5","v":"2025-26"}]
[null,"A. DIRECT INTERNAL LABOUR EXPENDITURE"]
[null,"Residential"]
[null,"Industrial and Commercial"]
[null,"Other"]
[null,"Total",{"$f":"SUM(C84:C86)","v":0},{"$f":"SUM(D84:D86)","v":0},0,0,0,0,0]
[null,"B. DIRECT CONTRACTOR EXPENDITURE"]
[null,"Residential"]
[null,"Industrial and Commercial"]
[null,"Other"]
[null,"Total",{"$f":"SUM(C89:C91)","v":0},{"$f":"SUM(D89:D91)","v":0},0,0,0,0,0]
[null,"C. OTHER INTERNAL DIRECT EXPENDITURE"]
[null,"Residential"]
[null,"Industrial and Commercial"]
[null,"Other"]
[null,"Total",{"$f":"SUM(C94:C96)","v":0},{"$f":"SUM(D94:D96)","v":0},0,0,0,0,0]
[null,"D. TOTAL OVERHEAD EXPENDITURE"]
[null,"Residential"]
[null,"Industrial and Commercial"]
[null,"Other"]
[null,"Total",{"$f":"SUM(C99:C101)","v":0},{"$f":"SUM(D99:D101)","v":0},0,0,0,0,0]
[null,"E. RELATED PARTY MARGIN EXPENDITURE"]
[null,"Residential"]
[null,"Industrial and Commercial"]
[null,"Other"]
[null,"Total",{"$f":"SUM(C104:C106)","v":0},{"$f":"SUM(D104:D106)","v":0},0,0,0,0,0]
[null,"F. CAPITAL CONTRIBUTIONS included in the above"]
[null,"Residential"]
[null,"Industrial and Commercial"]
[null,"Other"]
[null,"Total",{"$f":"SUM(C109:C111)","v":0},{"$f":"SUM(D109:D111)","v":0},0,0,0,0,0]
[null,"TOTAL",{"$f":"SUM(C87,C92,C97,C102,C107,C112)","v":0},{"$f":"SUM(D87,D92,D97,D102,D107,D112)","v":0},0,0,0,0,0]
[]
[null,"E4.1.4 - OTHER METER REPLACEMENT CAPEX"]
[null,null,"EXPENDITURE"]
[null,null,{"$f":"CONCATENATE(\"$0's, real \",dms_DollarReal)","v":"$0's, real June 2021"}]
[null,null,{"$f":"CRCP_y4","v":"2019-20"},{"$f":"CRCP_y5","v":"2020-21"},{"$f":"FRCP_y1","v":"2021-22"},{"$f":"FRCP_y2","v":"2022-23"},{"$f":"FRCP_y3","v":"2023-24"},{"$f":"FRCP_y4","v":"2024-25"},{"$f":"FRCP_y5","v":"2025-26"}]
[null,"A. DIRECT INTERNAL LABOUR EXPENDITURE"]
[null,"Residential"]
[null,"Industrial and Commercial"]
[null,"Other"]
[null,"Total",{"$f":"SUM(C120:C122)","v":0},{"$f":"SUM(D120:D122)","v":0},0,0,0,0,0]
[null,"B. DIRECT CONTRACTOR EXPENDITURE"]
[null,"Residential"]
[null,"Industrial and Commercial"]
[null,"Other"]
[null,"Total",{"$f":"SUM(C125:C127)","v":0},{"$f":"SUM(D125:D127)","v":0},0,0,0,0,0]
[null,"C. OTHER INTERNAL DIRECT EXPENDITURE"]
[null,"Residential"]
[null,"Industrial and Commercial"]
[null,"Other"]
[null,"Total",{"$f":"SUM(C130:C132)","v":0},{"$f":"SUM(D130:D132)","v":0},0,0,0,0,0]
[null,"D. TOTAL OVERHEAD EXPENDITURE"]
[null,"Residential"]
[null,"Industrial and Commercial"]
[null,"Other"]
[null,"Total",{"$f":"SUM(C135:C137)","v":0},{"$f":"SUM(D135:D137)","v":0},0,0,0,0,0]
[null,"E. RELATED PARTY MARGIN EXPENDITURE"]
[null,"Residential"]
[null,"Industrial and Commercial"]
[null,"Other"]
[null,"Total",{"$f":"SUM(C140:C142)","v":0},{"$f":"SUM(D140:D142)","v":0},0,0,0,0,0]
[null,"F. CAPITAL CONTRIBUTIONS included in the above"]
[null,"Residential"]
[null,"Industrial and Commercial"]
[null,"Other"]
[null,"Total",{"$f":"SUM(C145:C147)","v":0},{"$f":"SUM(D145:D147)","v":0},0,0,0,0,0]
[null,"TOTAL",{"$f":"SUM(C123,C128,C133,C138,C143,C148)","v":0},{"$f":"SUM(D123,D128,D133,D138,D143,D148)","v":0},0,0,0,0,0]
[]
[]
[null,"E4.2 - VOLUMES"]
[null,"E4.2.1 - NUMBER OF NEW METERS ACQUIRED"]
[null,null,"VOLUMES"]
[null,null,"0s"]
[null,null,{"$f":"CRCP_y4","v":"2019-20"},{"$f":"CRCP_y5","v":"2020-21"},{"$f":"FRCP_y1","v":"2021-22"},{"$f":"FRCP_y2","v":"2022-23"},{"$f":"FRCP_y3","v":"2023-24"},{"$f":"FRCP_y4","v":"2024-25"},{"$f":"FRCP_y5","v":"2025-26"}]
[null,"Residential"]
[null,"Industrial and commercial"]
[null,"Other meters"]
[null,"Total",{"$f":"SUM(C157:C159)","v":0},{"$f":"SUM(D157:D159)","v":0},0,0,0,0,0]
[]
[]
[null,"E4.2.2 - NUMBER OF METERS REFURBISHED"]
[null,null,"VOLUMES"]
[null,null,"0s"]
[null,null,{"$f":"CRCP_y4","v":"2019-20"},{"$f":"CRCP_y5","v":"2020-21"},{"$f":"FRCP_y1","v":"2021-22"},{"$f":"FRCP_y2","v":"2022-23"},{"$f":"FRCP_y3","v":"2023-24"},{"$f":"FRCP_y4","v":"2024-25"},{"$f":"FRCP_y5","v":"2025-26"}]
[null,"A. REFURBISHABLE METERS REMOVED"]
[null,"Residential"]
[null,"Industrial and commercial"]
[null,"Other meters"]
[null,"Total",{"$f":"SUM(C168:C170)","v":0},0,0,0,0,0,0]
[null,"B. METERS DECOMMISSIONED"]
[null,"Residential"]
[null,"Industrial and commercial"]
[null,"Other meters"]
[null,"Total",{"$f":"SUM(C173:C175)","v":0},0,0,0,0,0,0]
[null,"TOTAL",{"$f":"SUM(C171,C176)","v":0},{"$f":"SUM(D171,D176)","v":0},0,0,0,0,0]
[]
[]
[null,"E4.2.3 - NUMBER OF METERS INSTALLED"]
[null,null,"VOLUMES"]
[null,null,"0s"]
[null,null,{"$f":"CRCP_y4","v":"2019-20"},{"$f":"CRCP_y5","v":"2020-21"},{"$f":"FRCP_y1","v":"2021-22"},{"$f":"FRCP_y2","v":"2022-23"},{"$f":"FRCP_y3","v":"2023-24"},{"$f":"FRCP_y4","v":"2024-25"},{"$f":"FRCP_y5","v":"2025-26"}]
[null,"Residential"]
[null,"Industrial and commercial"]
[null,"Other meters"]
[null,"Total",{"$f":"SUM(C184:C186)","v":0},{"$f":"SUM(D184:D186)","v":0},0,0,0,0,0]
[]
[]
[null,"E4.2.4 - NUMBER OF METERS REMOVED / DECOMMISSIONED"]
[null,null,"VOLUMES"]
[null,null,"0s"]
[null,null,{"$f":"CRCP_y4","v":"2019-20"},{"$f":"CRCP_y5","v":"2020-21"},{"$f":"FRCP_y1","v":"2021-22"},{"$f":"FRCP_y2","v":"2022-23"},{"$f":"FRCP_y3","v":"2023-24"},{"$f":"FRCP_y4","v":"2024-25"},{"$f":"FRCP_y5","v":"2025-26"}]
[null,"Residential",9597,9498.6,9219,8749.1999999999989,13191,10466.4,12658.8]
[null,"Industrial and commercial",651,442.2,300.59999999999997,370.2,309.59999999999997,444.59999999999997,372]
[null,"Other meters"]
[null,"Total",{"$f":"SUM(C194:C196)","v":10248},{"$f":"SUM(D194:D196)","v":9940.8000000000011},9519.6,9119.4,13500.6,10911,13030.8]
[]
[]
[null,"E4.2.5 - OTHER METER REPLACEMENT VOLUMES"]
[null,null,"VOLUMES"]
[null,null,"0s"]
[null,null,{"$f":"CRCP_y4","v":"2019-20"},{"$f":"CRCP_y5","v":"2020-21"},{"$f":"FRCP_y1","v":"2021-22"},{"$f":"FRCP_y2","v":"2022-23"},{"$f":"FRCP_y3","v":"2023-24"},{"$f":"FRCP_y4","v":"2024-25"},{"$f":"FRCP_y5","v":"2025-26"}]
[null,"Residential"]
[null,"Industrial and commercial"]
[null,"Other meters"]
[null,"Total",{"$f":"SUM(C204:C206)","v":0},{"$f":"SUM(D204:D206)","v":0},0,0,0,0,0]

{"sheet":"E5. New Connections","index":11,"n_rows":284,"n_cols":10,"rows_kept":284,"cut":false,"hidden":false,"merged":[[164,3,164,9],[8,3,8,9],[9,3,9,9],[39,3,39,9],[40,3,40,9],[70,3,70,9],[71,3,71,9],[101,3,101,9],[102,3,102,9],[132,3,132,9],[133,3,133,9],[163,3,163,9],[264,3,264,9],[265,3,265,9],[275,3,275,9],[276,3,276,9],[196,3,196,9],[197,3,197,9],[225,3,225,9],[226,3,226,9],[236,3,236,9],[237,3,237,9]]}
[null,{"$f":"INDEX(dms_Worksheet_List,MATCH(dms_Model,dms_Model_List))","v":"REGULATORY REPORTING STATEMENT"}]
[null,{"$f":"INDEX(dms_TradingNameFull_List,MATCH(dms_TradingName,dms_TradingName_List))","v":"Australian Gas Distribution Co. "}]
[null,{"$f":"dms_Header_Span","v":"2019-20 - 2025-26"}]
[null,"E5. NEW CONNECTIONS"]
[]
[null,"E5.1 - EXPENDITURE"]
[null,"E5.1.1 - CAPEX - BY CONNECTION TYPE"]
[null,"A. DIRECT INTERNAL LABOUR EXPENDITURE"]
[null,null,null,"EXPENDITURE"]
[null,null,null,{"$f":"CONCATENATE(\"$0's, real \",dms_DollarReal)","v":"$0's, real June 2021"}]
[null,null,null,{"$f":"CRCP_y4","v":"2019-20"},{"$f":"CRCP_y5","v":"2020-21"},{"$f":"FRCP_y1","v":"2021-22"},{"$f":"FRCP_y2","v":"2022-23"},{"$f":"FRCP_y3","v":"2023-24"},{"$f":"FRCP_y4","v":"2024-25"},{"$f":"FRCP_y5","v":"2025-26"}]
[null,"(i)  ELECTRICITY TO GAS"]
[null,"Distribution Mains"]
[null,"Inlet service pipes"]
[null,"Meters"]
[null,null,"Total",{"$f":"SUM(D13:D15)","v":0},{"$f":"SUM(E13:E15)","v":0},0,0,0,0,0]
[null,"(ii)  NEW HOMES"]
[null,"Distribution Mains"]
[null,"Inlet service pipes"]
[null,"Meters"]
[null,null,"Total",{"$f":"SUM(D18:D20)","v":0},{"$f":"SUM(E18:E20)","v":0},0,0,0,0,0]
[null,"(iii)  NEW MEDIUM DENSITY / HIGH RISE"]
[null,"Distribution Mains"]
[null,"Inlet service pipes"]
[null,"Meters"]
[null,null,"Total",{"$f":"SUM(D23:D25)","v":0},{"$f":"SUM(E23:E25)","v":0},0,0,0,0,0]
[null,"(iv)  INDUSTRIAL & COMMERCIAL TARIFF"]
[null,"Distribution Mains"]
[null,"Inlet service pipes"]
[null,"Meters"]
[null,null,"Total",{"$f":"SUM(D28:D30)","v":0},{"$f":"SUM(E28:E30)","v":0},0,0,0,0,0]
[null,"(v)  INDUSTRIAL & COMMERCIAL CONTRACT"]
[null,"Distribution Mains"]
[null,"Inlet service pipes"]
[null,"Meters"]
[null,null,"Total",{"$f":"SUM(D33:D35)","v":0},{"$f":"SUM(E33:E35)","v":0},0,0,0,0,0]
[null,null,"TOTAL",{"$f":"SUM(D36,D31,D26,D21,D16)","v":0},{"$f":"SUM(E36,E31,E26,E21,E16)","v":0},0,0,0,0,0]
[]
[null,"B. DIRECT CONTRACTOR EXPENDITURE"]
[null,null,null,"EXPENDITURE"]
[null,null,null,{"$f":"CONCATENATE(\"$0's, real \",dms_DollarReal)","v":"$0's, real June 2021"}]
[null,null,null,{"$f":"CRCP_y4","v":"2019-20"},{"$f":"CRCP_y5","v":"2020-21"},{"$f":"FRCP_y1","v":"2021-22"},{"$f":"FRCP_y2","v":"2022-23"},{"$f":"FRCP_y3","v":"2023-24"},{"$f":"FRCP_y4","v":"2024-25"},{"$f":"FRCP_y5","v":"2025-26"}]
[null,"(i)  ELECTRICITY TO GAS"]
[null,"Distribution Mains"]
[null,"Inlet service pipes"]
[null,"Meters"]
[null,null,"Total",{"$f":"SUM(D44:D46)","v":0},{"$f":"SUM(E44:E46)","v":0},0,0,0,0,0]
[null,"(ii)  NEW HOMES"]
[null,"Distribution Mains"]
[null,"Inlet service pipes"]
[null,"Meters"]
[null,null,"Total",{"$f":"SUM(D49:D51)","v":0},{"$f":"SUM(E49:E51)","v":0},0,0,0,0,0]
[null,"(iii)  NEW MEDIUM DENSITY / HIGH RISE"]
[null,"Distribution Mains"]
[null,"Inlet service pipes"]
[null,"Meters"]
[null,null,"Total",{"$f":"SUM(D54:D56)","v":0},{"$f":"SUM(E54:E56)","v":0},0,0,0,0,0]
[null,"(iv)  INDUSTRIAL & COMMERCIAL TARIFF"]
[null,"Distribution Mains"]
[null,"Inlet service pipes"]
[null,"Meters"]
[null,null,"Total",{"$f":"SUM(D59:D61)","v":0},{"$f":"SUM(E59:E61)","v":0},0,0,0,0,0]
[null,"(v)  INDUSTRIAL & COMMERCIAL CONTRACT"]
[null,"Distribution Mains"]
[null,"Inlet service pipes"]
[null,"Meters"]
[null,null,"Total",{"$f":"SUM(D64:D66)","v":0},{"$f":"SUM(E64:E66)","v":0},0,0,0,0,0]
[null,null,"TOTAL",{"$f":"SUM(D67,D62,D57,D52,D47)","v":0},{"$f":"SUM(E67,E62,E57,E52,E47)","v":0},0,0,0,0,0]
[]
[null,"C. OTHER INTERNAL DIRECT EXPENDITURE"]
[null,null,null,"EXPENDITURE"]
[null,null,null,{"$f":"CONCATENATE(\"$0's, real \",dms_DollarReal)","v":"$0's, real June 2021"}]
[null,null,null,{"$f":"CRCP_y4","v":"2019-20"},{"$f":"CRCP_y5","v":"2020-21"},{"$f":"FRCP_y1","v":"2021-22"},{"$f":"FRCP_y2","v":"2022-23"},{"$f":"FRCP_y3","v":"2023-24"},{"$f":"FRCP_y4","v":"2024-25"},{"$f":"FRCP_y5","v":"2025-26"}]
[null,"(i)  ELECTRICITY TO GAS"]
[null,"Distribution Mains"]
[null,"Inlet service pipes"]
[null,"Meters"]
[null,null,"Total",{"$f":"SUM(D75:D77)","v":0},{"$f":"SUM(E75:E77)","v":0},0,0,0,0,0]
[null,"(ii)  NEW HOMES"]
[null,"Distribution Mains"]
[null,"Inlet service pipes"]
[null,"Meters"]
[null,null,"Total",{"$f":"SUM(D80:D82)","v":0},{"$f":"SUM(E80:E82)","v":0},0,0,0,0,0]
[null,"(iii)  NEW MEDIUM DENSITY / HIGH RISE"]
[null,"Distribution Mains"]
[null,"Inlet service pipes"]
[null,"Meters"]
[null,null,"Total",{"$f":"SUM(D85:D87)","v":0},{"$f":"SUM(E85:E87)","v":0},0,0,0,0,0]
[null,"(iv)  INDUSTRIAL & COMMERCIAL TARIFF"]
[null,"Distribution Mains"]
[null,"Inlet service pipes"]
[null,"Meters"]
[null,null,"Total",{"$f":"SUM(D90:D92)","v":0},{"$f":"SUM(E90:E92)","v":0},0,0,0,0,0]
[null,"(v)  INDUSTRIAL & COMMERCIAL CONTRACT"]
[null,"Distribution Mains"]
[null,"Inlet service pipes"]
[null,"Meters"]
[null,null,"Total",{"$f":"SUM(D95:D97)","v":0},{"$f":"SUM(E95:E97)","v":0},0,0,0,0,0]
[null,null,"TOTAL",{"$f":"SUM(D98,D93,D88,D83,D78)","v":0},{"$f":"SUM(E98,E93,E88,E83,E78)","v":0},0,0,0,0,0]
[]
[null,"D. TOTAL OVERHEAD EXPENDITURE"]
[null,null,null,"EXPENDITURE"]
[null,null,null,{"$f":"CONCATENATE(\"$0's, real \",dms_DollarReal)","v":"$0's, real June 2021"}]
[null,null,null,{"$f":"CRCP_y4","v":"2019-20"},{"$f":"CRCP_y5","v":"2020-21"},{"$f":"FRCP_y1","v":"2021-22"},{"$f":"FRCP_y2","v":"2022-23"},{"$f":"FRCP_y3","v":"2023-24"},{"$f":"FRCP_y4","v":"2024-25"},{"$f":"FRCP_y5","v":"2025-26"}]
[null,"(i)  ELECTRICITY TO GAS"]
[null,"Distribution Mains",null,160131.45091383465,103565.37707258514,163066.00647227341,673534.25869459682,426678.11682357691,447444.05030020612,495643.27750001621]
[null,"Inlet service pipes",null,259217.83896818396,167649.72204695892,215876.24883894305,222244.80705108092,236450.84727947577,258856.19927081061,284515.33636536548]
[null,"Meters",null,22858.552740143321,14783.820544662211,19053.230771378796,19615.319514116542,28045.037940236412,30133.660194593718,33231.922557598169]
[null,null,"Total",{"$f":"SUM(D106:D108)","v":442207.8426221619},{"$f":"SUM(E106:E108)","v":285998.91966420622},397995.48608259525,915394.3852597943,691174.00204328902,736433.90976561047,813390.5364229799]
[null,"(ii)  NEW HOMES"]
[null,"Distribution Mains",null,275459.39451913536,2071103.8277840011,851893.67038916168,305294.4167272583,182711.14471148895,214117.81759693302,216485.17023507797]
[null,"Inlet service pipes",null,735858.57133615762,523814.95955256833,520766.77016284748,536129.89375132264,570399.6836255393,624448.99592202168,686347.54206484533]
[null,"Meters",null,142666.45770803056,101555.9615459061,105833.14404174732,111055.37936255441,118344.297913865,128953.26145138548,141854.09133850952]
[null,null,"Total",{"$f":"SUM(D111:D113)","v":1153984.4235633234},{"$f":"SUM(E111:E113)","v":2696474.7488824753},1478493.5845937566,952479.68984113529,871455.12625089323,967520.07497034012,1044686.8036384329]
[null,"(iii)  NEW MEDIUM DENSITY / HIGH RISE"]
[null,"Distribution Mains",null,0,0]
[null,"Inlet service pipes",null,141073.60085543577,100533.18420266621,261706.60269208622,269427.20068611956,286649.17181947042,313811.16200277786,344917.71324749757]
[null,"Meters",null,14969.82944011385,10400.710575103059,27100.641743535562,27900.136896236516,29683.532748696467,32496.25263205884,35717.445725730708]
[null,null,"Total",{"$f":"SUM(D116:D118)","v":156043.43029554962},{"$f":"SUM(E116:E118)","v":110933.89477776927},288807.24443562177,297327.33758235606,316332.70456816687,346307.41463483672,380635.1589732283]
[null,"(iv)  INDUSTRIAL & COMMERCIAL TARIFF"]
[null,"Distribution Mains",null,114051.01396854388,72693.961087616713,291192.62478929223,80566.784304519853,309801.17083930131,79925.92477648241,88790.310964943084]
[null,"Inlet service pipes",null,153162.34133073324,97622.782063607272,52568.240677701397,139272.62441936298,136513.85317123748,138164.79581326433,153488.31081998665]
[null,"Meters",null,91432.345031331177,48415.509171839054,27480.493777327309,71151.91270852396,72351.172086437917,72977.360310196484,81381.352397545314]
[null,null,"Total",{"$f":"SUM(D121:D123)","v":358645.70033060829},{"$f":"SUM(E121:E123)","v":218732.25232306303},371241.35924432095,290991.32143240678,518666.19609697675,291068.08089994319,323659.97418247507]
[null,"(v)  INDUSTRIAL & COMMERCIAL CONTRACT"]
[null,"Distribution Mains"]
[null,"Inlet service pipes"]
[null,"Meters"]
[null,null,"Total",{"$f":"SUM(D126:D128)","v":0},{"$f":"SUM(E126:E128)","v":0},0,0,0,0,0]
[null,null,"TOTAL",{"$f":"SUM(D129,D124,D119,D114,D109)","v":2110881.3968116431},{"$f":"SUM(E129,E124,E119,E114,E109)","v":3312139.8156475136},2536537.6743562943,2456192.7341156928,2397628.028959326,2341329.4802707303,2562372.4732171162]
[]
[null,"E. RELATED PARTY MARGIN EXPENDITURE"]
[null,null,null,"EXPENDITURE"]
[null,null,null,{"$f":"CONCATENATE(\"$0's, real \",dms_DollarReal)","v":"$0's, real June 2021"}]
[null,null,null,{"$f":"CRCP_y4","v":"2019-20"},{"$f":"CRCP_y5","v":"2020-21"},{"$f":"FRCP_y1","v":"2021-22"},{"$f":"FRCP_y2","v":"2022-23"},{"$f":"FRCP_y3","v":"2023-24"},{"$f":"FRCP_y4","v":"2024-25"},{"$f":"FRCP_y5","v":"2025-26"}]
[null,"(i)  ELECTRICITY TO GAS"]
[null,"Distribution Mains"]
[null,"Inlet service pipes"]
[null,"Meters"]
[null,null,"Total",{"$f":"SUM(D137:D139)","v":0},{"$f":"SUM(E137:E139)","v":0},0,0,0,0,0]
[null,"(ii)  NEW HOMES"]
[null,"Distribution Mains"]
[null,"Inlet service pipes"]
[null,"Meters"]
[null,null,"Total",{"$f":"SUM(D142:D144)","v":0},{"$f":"SUM(E142:E144)","v":0},0,0,0,0,0]
[null,"(iii)  NEW MEDIUM DENSITY / HIGH RISE"]
[null,"Distribution Mains"]
[null,"Inlet service pipes"]
[null,"Meters"]
[null,null,"Total",{"$f":"SUM(D147:D149)","v":0},{"$f":"SUM(E147:E149)","v":0},0,0,0,0,0]
[null,"(iv)  INDUSTRIAL & COMMERCIAL TARIFF"]
[null,"Distribution Mains"]
[null,"Inlet service pipes"]
[null,"Meters"]
[null,null,"Total",{"$f":"SUM(D152:D154)","v":0},{"$f":"SUM(E152:E154)","v":0},0,0,0,0,0]
[null,"(v)  INDUSTRIAL & COMMERCIAL CONTRACT"]
[null,"Distribution Mains"]
[null,"Inlet service pipes"]
[null,"Meters"]
[null,null,"Total",{"$f":"SUM(D157:D159)","v":0},{"$f":"SUM(E157:E159)","v":0},0,0,0,0,0]
[null,null,"TOTAL",{"$f":"SUM(D160,D155,D150,D145,D140)","v":0},{"$f":"SUM(E160,E155,E150,E145,E140)","v":0},0,0,0,0,0]
[]
[null,"F. CAPITAL CONTRIBUTIONS included in the above"]
[null,null,null,"EXPENDITURE"]
[null,null,null,{"$f":"CONCATENATE(\"$0's, real \",dms_DollarReal)","v":"$0's, real June 2021"}]
[null,null,null,{"$f":"CRCP_y4","v":"2019-20"},{"$f":"CRCP_y5","v":"2020-21"},{"$f":"FRCP_y1","v":"2021-22"},{"$f":"FRCP_y2","v":"2022-23"},{"$f":"FRCP_y3","v":"2023-24"},{"$f":"FRCP_y4","v":"2024-25"},{"$f":"FRCP_y5","v":"2025-26"}]
[null,"(i)  ELECTRICITY TO GAS"]
[null,"Distribution Mains"]
[null,"Inlet service pipes"]
[null,"Meters"]
[null,null,"Total",{"$f":"SUM(D168:D170)","v":0},{"$f":"SUM(E168:E170)","v":0},0,0,0,0,0]
[null,"(ii)  NEW HOMES"]
[null,"Distribution Mains"]
[null,"Inlet service pipes"]
[null,"Meters"]
[null,null,"Total",{"$f":"SUM(D173:D175)","v":0},{"$f":"SUM(E173:E175)","v":0},0,0,0,0,0]
[null,"(iii)  NEW MEDIUM DENSITY / HIGH RISE"]
[null,"Distribution Mains"]
[null,"Inlet service pipes"]
[null,"Meters"]
[null,null,"Total",{"$f":"SUM(D178:D180)","v":0},{"$f":"SUM(E178:E180)","v":0},0,0,0,0,0]
[null,"(iv)  INDUSTRIAL & COMMERCIAL TARIFF"]
[null,"Distribution Mains"]
[null,"Inlet service pipes"]
[null,"Meters"]
[null,null,"Total",{"$f":"SUM(D183:D185)","v":0},{"$f":"SUM(E183:E185)","v":0},0,0,0,0,0]
[null,"(v)  INDUSTRIAL & COMMERCIAL CONTRACT"]
[null,"Distribution Mains"]
[null,"Inlet service pipes"]
[null,"Meters"]
[null,null,"Total",{"$f":"SUM(D188:D190)","v":0},{"$f":"SUM(E188:E190)","v":0},0,0,0,0,0]
[null,null,"TOTAL",{"$f":"SUM(D191,D186,D181,D176,D171)","v":0},{"$f":"SUM(E191,E186,E181,E176,E171)","v":0},0,0,0,0,0]
[]
[]
[null,"E5.2 - UNIT RATES"]
[null,"E5.2.1 - UNIT RATES - PER CONNECTION - BY CONNECTION TYPE"]
[null,null,null,"RATES PER CONNECTION"]
[null,null,null,{"$f":"CONCATENATE(\"$0's, real \",dms_DollarReal)","v":"$0's, real June 2021"}]
[null,null,"Units",{"$f":"CRCP_y4","v":"2019-20"},{"$f":"CRCP_y5","v":"2020-21"},{"$f":"FRCP_y1","v":"2021-22"},{"$f":"FRCP_y2","v":"2022-23"},{"$f":"FRCP_y3","v":"2023-24"},{"$f":"FRCP_y4","v":"2024-25"},{"$f":"FRCP_y5","v":"2025-26"}]
[null,"A. ELECTRICITY TO GAS"]
[null,"Distribution mains","per metre per connection"]
[null,"Inlet service pipes","per service per connection"]
[null,"Meters","number per connection"]
[null,"B. NEW HOMES"]
[null,"Distribution mains","per metre per connection"]
[null,"Inlet service pipes","per service per connection"]
[null,"Meters","number per connection"]
[null,"C. NEW MEDIUM DENSITY / HIGH RISE"]
[null,"Distribution mains","per metre per connection"]
[null,"Inlet service pipes","per service per connection"]
[null,"Meters","number per connection"]
[null,"D. INDUSTRIAL & COMMERCIAL TARIFF"]
[null,"Distribution mains","per metre per connection"]
[null,"Inlet service pipes","per service per connection"]
[null,"Meters","number per connection"]
[null,"E. INDUSTRIAL & COMMERCIAL CONTRACT"]
[null,"Distribution mains","per metre per connection"]
[null,"Inlet service pipes","per service per connection"]
[null,"Meters","number per connection"]
[]
[]
[]
[]
[null,"E5.3 - VOLUMES"]
[null,"E5.3.1 - NUMBER OF NEW CONNECTIONS"]
[null,null,null,"VOLUMES"]
[null,null,null,"0s"]
[null,null,null,{"$f":"CRCP_y4","v":"2019-20"},{"$f":"CRCP_y5","v":"2020-21"},{"$f":"FRCP_y1","v":"2021-22"},{"$f":"FRCP_y2","v":"2022-23"},{"$f":"FRCP_y3","v":"2023-24"},{"$f":"FRCP_y4","v":"2024-25"},{"$f":"FRCP_y5","v":"2025-26"}]
[null,"Electricity to gas"]
[null,"New homes"]
[null,"New medium density / high rise"]
[null,"Industrial and commericla tariff"]
[null,"Industrial and commericla contract"]
[null,null,"Total",{"$f":"SUM(D229:D233)","v":0},{"$f":"SUM(E229:E233)","v":0},0,0,0,0,0]
[]
[null,"E5.3.2 - VOLUMES - PER CONNECTION - BY CONNECTION TYPE"]
[null,null,null,"VOLUMES"]
[null,null,null,"0s"]
[null,null,"Units",{"$f":"CRCP_y4","v":"2019-20"},{"$f":"CRCP_y5","v":"2020-21"},{"$f":"FRCP_y1","v":"2021-22"},{"$f":"FRCP_y2","v":"2022-23"},{"$f":"FRCP_y3","v":"2023-24"},{"$f":"FRCP_y4","v":"2024-25"},{"$f":"FRCP_y5","v":"2025-26"}]
[null,"A. ELECTRICITY TO GAS"]
[null,"Distribution mains","metres per connection",8.0855783250676065,8.0855783250676065,9.8794923301077144,21.852818587120623,11.638416761511658,11.540768768838095,11.558404950658865]
[null,"Inlet service pipes","number per connection",1,1,1,1,1,1,1]
[null,"Meters","number per connection",1,1,1,1,1,1,1]
[null,"B. NEW HOMES"]
[null,"Distribution mains","metres per connection",5.2887747298093863,11.917320389494005,7.8065158608060541,6.481307254722684,5.305071571453909,5.7708682124902824,5.2838361634411646]
[null,"Inlet service pipes","number per connection",1,1,1,1,1,1,1]
[null,"Meters","number per connection",1,1,1,1,1,1,1]
[null,"C. NEW MEDIUM DENSITY / HIGH RISE"]
[null,"Distribution mains","metres per connection"]
[null,"Inlet service pipes","number per connection",1,1,1,1,1,1,1]
[null,"Meters","number per connection",4,3.9999999999999991,4,4,4,4,4]
[null,"D. INDUSTRIAL & COMMERCIAL TARIFF"]
[null,"Distribution mains","metres per connection",7.2040011258112147,7.2040011258112147,47.122297799979222,7.5985808664536325,41.302287111693651,5.2641002490265647,5.2440262670152125]
[null,"Inlet service pipes","number per connection",1,1,1,1,1,1,1]
[null,"Meters","number per connection",1,1,1,1,1,1,1]
[null,"E. INDUSTRIAL & COMMERCIAL CONTRACT"]
[null,"Distribution mains","metres per connection"]
[null,"Inlet service pipes","number per connection",1,1,1,1,1,1,1]
[null,"Meters","number per connection",1,1,1,1,1,1,1]
[]
[]
[]
[null,"E5.4 -  CAPITAL CONTRIBUTIONS"]
[null,"E5.4.1 - VALUE OF CAPITAL CONTRIBUTIONS - BY CONNECTION TYPE"]
[null,null,null,"VALUE"]
[null,null,null,{"$f":"CONCATENATE(\"$0's, real \",dms_DollarReal)","v":"$0's, real June 2021"}]
[null,null,null,{"$f":"CRCP_y4","v":"2019-20"},{"$f":"CRCP_y5","v":"2020-21"},{"$f":"FRCP_y1","v":"2021-22"},{"$f":"FRCP_y2","v":"2022-23"},{"$f":"FRCP_y3","v":"2023-24"},{"$f":"FRCP_y4","v":"2024-25"},{"$f":"FRCP_y5","v":"2025-26"}]
[null,"Electricity to gas"]
[null,"New homes"]
[null,"New medium density / high rise"]
[null,"Industrial & commercial tariff"]
[null,"Industrial & commercial contract"]
[null,null,"Total",{"$f":"SUM(D268:D272)","v":0},0,0,0,0,0,0]
[]
[null,"E5.4.2 - NUMBER OF CAPITAL CONTRIBUTIONS - BY CONNECTION TYPE"]
[null,null,null,"VOLUMES"]
[null,null,null,"0's"]
[null,null,null,{"$f":"CRCP_y4","v":"2019-20"},{"$f":"CRCP_y5","v":"2020-21"},{"$f":"FRCP_y1","v":"2021-22"},{"$f":"FRCP_y2","v":"2022-23"},{"$f":"FRCP_y3","v":"2023-24"},{"$f":"FRCP_y4","v":"2024-25"},{"$f":"FRCP_y5","v":"2025-26"}]
[null,"Electricity to gas"]
[null,"New homes"]
[null,"New medium density / high rise"]
[null,"Industrial & commercial tariff"]
[null,"Industrial & commercial contract"]
[null,null,"Total",{"$f":"SUM(D279:D283)","v":0},{"$f":"SUM(E279:E283)","v":0},0,0,0,0,0]

{"sheet":"E6. Non-network","index":12,"n_rows":142,"n_cols":9,"rows_kept":142,"cut":false,"hidden":false,"merged":[[27,2,27,8],[28,2,28,8]]}
[null,{"$f":"INDEX(dms_Worksheet_List,MATCH(dms_Model,dms_Model_List))","v":"REGULATORY REPORTING STATEMENT"}]
[null,{"$f":"INDEX(dms_TradingNameFull_List,MATCH(dms_TradingName,dms_TradingName_List))","v":"Australian Gas Distribution Co. "}]
[null,{"$f":"dms_Header_Span","v":"2019-20 - 2025-26"}]
[null,"E6. NON-NETWORK EXPENDITURE"]
[]
[null,"E6.5 - TELEMETRY"]
[]
[null,"Please list all projects here:"]
[]
[]
[]
[]
[]
[]
[]
[]
[]
[]
[]
[]
[]
[]
[]
[]
[]
[null,"E6.5.1 - CAPEX - BY PROJECT"]
[null,"A. DIRECT INTERNAL LABOUR EXPENDITURE"]
[null,null,"EXPENDITURE"]
[null,null,{"$f":"CONCATENATE(\"$0's, real \",dms_DollarReal)","v":"$0's, real June 2021"}]
[null,null,{"$f":"CRCP_y4","v":"2019-20"},{"$f":"CRCP_y5","v":"2020-21"},{"$f":"FRCP_y1","v":"2021-22"},{"$f":"FRCP_y2","v":"2022-23"},{"$f":"FRCP_y3","v":"2023-24"},{"$f":"FRCP_y4","v":"2024-25"},{"$f":"FRCP_y5","v":"2025-26"}]
[]
[null,{"$f":"IF(ISBLANK(dms_E65_Projects_02),\"\",dms_E65_Projects_02)","v":""}]
[null,{"$f":"IF(ISBLANK(dms_E65_Projects_03),\"\",dms_E65_Projects_03)","v":""}]
[null,{"$f":"IF(ISBLANK(dms_E65_Projects_04),\"\",dms_E65_Projects_04)","v":""}]
[null,{"$f":"IF(ISBLANK(dms_E65_Projects_05),\"\",dms_E65_Projects_05)","v":""}]
[null,{"$f":"IF(ISBLANK(dms_E65_Projects_06),\"\",dms_E65_Projects_06)","v":""}]
[null,{"$f":"IF(ISBLANK(dms_E65_Projects_07),\"\",dms_E65_Projects_07)","v":""}]
[null,{"$f":"IF(ISBLANK(dms_E65_Projects_08),\"\",dms_E65_Projects_08)","v":""}]
[null,{"$f":"IF(ISBLANK(dms_E65_Projects_09),\"\",dms_E65_Projects_09)","v":""}]
[null,{"$f":"IF(ISBLANK(dms_E65_Projects_10),\"\",dms_E65_Projects_10)","v":""}]
[null,{"$f":"IF(ISBLANK(dms_E65_Projects_11),\"\",dms_E65_Projects_11)","v":""}]
[null,{"$f":"IF(ISBLANK(dms_E65_Projects_12),\"\",dms_E65_Projects_12)","v":""}]
[null,{"$f":"IF(ISBLANK(dms_E65_Projects_13),\"\",dms_E65_Projects_13)","v":""}]
[null,{"$f":"IF(ISBLANK(dms_E65_Projects_14),\"\",dms_E65_Projects_14)","v":""}]
[null,{"$f":"IF(ISBLANK(dms_E65_Projects_15),\"\",dms_E65_Projects_15)","v":""}]
[null,"Aggregate of other projects with total expenditure of less than $500,000"]
[null,"Total",{"$f":"SUM(C31:C46)","v":0},{"$f":"SUM(D31:D46)","v":0},0,0,0,0,0]
[]
[null,"B. DIRECT CONTRACTOR EXPENDITURE"]
[null,"2175 TELEMETRY - SYSTEM - CAPITAL WORKS",109276.443961786,484439.6551893744,0,0,0,0,0]
[null,"SA110 SCADA Equipment Replacement",0,0,349187.01949201844,264444.83531185199,266009.06382583594,267473.56511672266,268788.20917434618]
[null,"SA111 Additional Network Pressure Monitoring",0,0,172526.09103972139,93687.84031865299,94242.017113473703,56835.506177591124,0]
[null,{"$f":"IF(ISBLANK(dms_E65_Projects_04),\"\",dms_E65_Projects_04)","v":""}]
[null,{"$f":"IF(ISBLANK(dms_E65_Projects_05),\"\",dms_E65_Projects_05)","v":""}]
[null,{"$f":"IF(ISBLANK(dms_E65_Projects_06),\"\",dms_E65_Projects_06)","v":""}]
[null,{"$f":"IF(ISBLANK(dms_E65_Projects_07),\"\",dms_E65_Projects_07)","v":""}]
[null,{"$f":"IF(ISBLANK(dms_E65_Projects_08),\"\",dms_E65_Projects_08)","v":""}]
[null,{"$f":"IF(ISBLANK(dms_E65_Projects_09),\"\",dms_E65_Projects_09)","v":""}]
[null,{"$f":"IF(ISBLANK(dms_E65_Projects_10),\"\",dms_E65_Projects_10)","v":""}]
[null,{"$f":"IF(ISBLANK(dms_E65_Projects_11),\"\",dms_E65_Projects_11)","v":""}]
[null,{"$f":"IF(ISBLANK(dms_E65_Projects_12),\"\",dms_E65_Projects_12)","v":""}]
[null,{"$f":"IF(ISBLANK(dms_E65_Projects_13),\"\",dms_E65_Projects_13)","v":""}]
[null,{"$f":"IF(ISBLANK(dms_E65_Projects_14),\"\",dms_E65_Projects_14)","v":""}]
[null,{"$f":"IF(ISBLANK(dms_E65_Projects_15),\"\",dms_E65_Projects_15)","v":""}]
[null,"Aggregate of other projects with total expenditure of less than $500,000"]
[null,"Total",{"$f":"SUM(C50:C65)","v":109276.443961786},{"$f":"SUM(D50:D65)","v":484439.6551893744},521713.11053173983,358132.67563050496,360251.08093930967,324309.07129431376,268788.20917434618]
[]
[null,"C. OTHER INTERNAL DIRECT EXPENDITURE"]
[]
[null,{"$f":"IF(ISBLANK(dms_E65_Projects_02),\"\",dms_E65_Projects_02)","v":""}]
[null,{"$f":"IF(ISBLANK(dms_E65_Projects_03),\"\",dms_E65_Projects_03)","v":""}]
[null,{"$f":"IF(ISBLANK(dms_E65_Projects_04),\"\",dms_E65_Projects_04)","v":""}]
[null,{"$f":"IF(ISBLANK(dms_E65_Projects_05),\"\",dms_E65_Projects_05)","v":""}]
[null,{"$f":"IF(ISBLANK(dms_E65_Projects_06),\"\",dms_E65_Projects_06)","v":""}]
[null,{"$f":"IF(ISBLANK(dms_E65_Projects_07),\"\",dms_E65_Projects_07)","v":""}]
[null,{"$f":"IF(ISBLANK(dms_E65_Projects_08),\"\",dms_E65_Projects_08)","v":""}]
[null,{"$f":"IF(ISBLANK(dms_E65_Projects_09),\"\",dms_E65_Projects_09)","v":""}]
[null,{"$f":"IF(ISBLANK(dms_E65_Projects_10),\"\",dms_E65_Projects_10)","v":""}]
[null,{"$f":"IF(ISBLANK(dms_E65_Projects_11),\"\",dms_E65_Projects_11)","v":""}]
[null,{"$f":"IF(ISBLANK(dms_E65_Projects_12),\"\",dms_E65_Projects_12)","v":""}]
[null,{"$f":"IF(ISBLANK(dms_E65_Projects_13),\"\",dms_E65_Projects_13)","v":""}]
[null,{"$f":"IF(ISBLANK(dms_E65_Projects_14),\"\",dms_E65_Projects_14)","v":""}]
[null,{"$f":"IF(ISBLANK(dms_E65_Projects_15),\"\",dms_E65_Projects_15)","v":""}]
[null,"Aggregate of other projects with total expenditure of less than $500,000"]
[null,"Total",{"$f":"SUM(C69:C84)","v":0},{"$f":"SUM(D69:D84)","v":0},0,0,0,0,0]
[]
[null,"D. TOTAL OVERHEAD EXPENDITURE"]
[null,"2175 TELEMETRY - SYSTEM - CAPITAL WORKS",10759.540859581424,32209.984055543573,0,0,0,0,0]
[null,"Telemetry overheads",0,0,49446.647532700939,31848.297902985269,31245.560638440245,28407.412465346839,26109.106896025722]
[null,{"$f":"IF(ISBLANK(dms_E65_Projects_03),\"\",dms_E65_Projects_03)","v":""}]
[null,{"$f":"IF(ISBLANK(dms_E65_Projects_04),\"\",dms_E65_Projects_04)","v":""}]
[null,{"$f":"IF(ISBLANK(dms_E65_Projects_05),\"\",dms_E65_Projects_05)","v":""}]
[null,{"$f":"IF(ISBLANK(dms_E65_Projects_06),\"\",dms_E65_Projects_06)","v":""}]
[null,{"$f":"IF(ISBLANK(dms_E65_Projects_07),\"\",dms_E65_Projects_07)","v":""}]
[null,{"$f":"IF(ISBLANK(dms_E65_Projects_08),\"\",dms_E65_Projects_08)","v":""}]
[null,{"$f":"IF(ISBLANK(dms_E65_Projects_09),\"\",dms_E65_Projects_09)","v":""}]
[null,{"$f":"IF(ISBLANK(dms_E65_Projects_10),\"\",dms_E65_Projects_10)","v":""}]
[null,{"$f":"IF(ISBLANK(dms_E65_Projects_11),\"\",dms_E65_Projects_11)","v":""}]
[null,{"$f":"IF(ISBLANK(dms_E65_Projects_12),\"\",dms_E65_Projects_12)","v":""}]
[null,{"$f":"IF(ISBLANK(dms_E65_Projects_13),\"\",dms_E65_Projects_13)","v":""}]
[null,{"$f":"IF(ISBLANK(dms_E65_Projects_14),\"\",dms_E65_Projects_14)","v":""}]
[null,{"$f":"IF(ISBLANK(dms_E65_Projects_15),\"\",dms_E65_Projects_15)","v":""}]
[null,"Aggregate of other projects with total expenditure of less than $500,000"]
[null,"Total",{"$f":"SUM(C88:C103)","v":10759.540859581424},{"$f":"SUM(D88:D103)","v":32209.984055543573},49446.647532700939,31848.297902985269,31245.560638440245,28407.412465346839,26109.106896025722]
[]
[null,"E. RELATED PARTY MARGIN EXPENDITURE"]
[]
[null,{"$f":"IF(ISBLANK(dms_E65_Projects_02),\"\",dms_E65_Projects_02)","v":""}]
[null,{"$f":"IF(ISBLANK(dms_E65_Projects_03),\"\",dms_E65_Projects_03)","v":""}]
[null,{"$f":"IF(ISBLANK(dms_E65_Projects_04),\"\",dms_E65_Projects_04)","v":""}]
[null,{"$f":"IF(ISBLANK(dms_E65_Projects_05),\"\",dms_E65_Projects_05)","v":""}]
[null,{"$f":"IF(ISBLANK(dms_E65_Projects_06),\"\",dms_E65_Projects_06)","v":""}]
[null,{"$f":"IF(ISBLANK(dms_E65_Projects_07),\"\",dms_E65_Projects_07)","v":""}]
[null,{"$f":"IF(ISBLANK(dms_E65_Projects_08),\"\",dms_E65_Projects_08)","v":""}]
[null,{"$f":"IF(ISBLANK(dms_E65_Projects_09),\"\",dms_E65_Projects_09)","v":""}]
[null,{"$f":"IF(ISBLANK(dms_E65_Projects_10),\"\",dms_E65_Projects_10)","v":""}]
[null,{"$f":"IF(ISBLANK(dms_E65_Projects_11),\"\",dms_E65_Projects_11)","v":""}]
[null,{"$f":"IF(ISBLANK(dms_E65_Projects_12),\"\",dms_E65_Projects_12)","v":""}]
[null,{"$f":"IF(ISBLANK(dms_E65_Projects_13),\"\",dms_E65_Projects_13)","v":""}]
[null,{"$f":"IF(ISBLANK(dms_E65_Projects_14),\"\",dms_E65_Projects_14)","v":""}]
[null,{"$f":"IF(ISBLANK(dms_E65_Projects_15),\"\",dms_E65_Projects_15)","v":""}]
[null,"Aggregate of other projects with total expenditure of less than $500,000"]
[null,"Total",{"$f":"SUM(C107:C122)","v":0},{"$f":"SUM(D107:D122)","v":0},0,0,0,0,0]
[]
[null,"F. CAPITAL CONTRIBUTIONS included in the above"]
[]
[null,{"$f":"IF(ISBLANK(dms_E65_Projects_02),\"\",dms_E65_Projects_02)","v":""}]
[null,{"$f":"IF(ISBLANK(dms_E65_Projects_03),\"\",dms_E65_Projects_03)","v":""}]
[null,{"$f":"IF(ISBLANK(dms_E65_Projects_04),\"\",dms_E65_Projects_04)","v":""}]
[null,{"$f":"IF(ISBLANK(dms_E65_Projects_05),\"\",dms_E65_Projects_05)","v":""}]
[null,{"$f":"IF(ISBLANK(dms_E65_Projects_06),\"\",dms_E65_Projects_06)","v":""}]
[null,{"$f":"IF(ISBLANK(dms_E65_Projects_07),\"\",dms_E65_Projects_07)","v":""}]
[null,{"$f":"IF(ISBLANK(dms_E65_Projects_08),\"\",dms_E65_Projects_08)","v":""}]
[null,{"$f":"IF(ISBLANK(dms_E65_Projects_09),\"\",dms_E65_Projects_09)","v":""}]
[null,{"$f":"IF(ISBLANK(dms_E65_Projects_10),\"\",dms_E65_Projects_10)","v":""}]
[null,{"$f":"IF(ISBLANK(dms_E65_Projects_11),\"\",dms_E65_Projects_11)","v":""}]
[null,{"$f":"IF(ISBLANK(dms_E65_Projects_12),\"\",dms_E65_Projects_12)","v":""}]
[null,{"$f":"IF(ISBLANK(dms_E65_Projects_13),\"\",dms_E65_Projects_13)","v":""}]
[null,{"$f":"IF(ISBLANK(dms_E65_Projects_14),\"\",dms_E65_Projects_14)","v":""}]
[null,{"$f":"IF(ISBLANK(dms_E65_Projects_15),\"\",dms_E65_Projects_15)","v":""}]
[null,"Aggregate of other projects with total expenditure of less than $500,000"]
[null,"Total",{"$f":"SUM(C126:C141)","v":0},{"$f":"SUM(D126:D141)","v":0},0,0,0,0,0]

{"sheet":"E10. Overheads","index":13,"n_rows":32,"n_cols":9,"rows_kept":32,"cut":false,"hidden":false,"merged":[[6,2,6,8],[7,2,7,8],[21,2,21,8],[22,2,22,8]]}
[null,{"$f":"INDEX(dms_Worksheet_List,MATCH(dms_Model,dms_Model_List))","v":"REGULATORY REPORTING STATEMENT"}]
[null,{"$f":"INDEX(dms_TradingNameFull_List,MATCH(dms_TradingName,dms_TradingName_List))","v":"Australian Gas Networks Limited (reporting data for SA)"}]
[null,{"$f":"dms_Header_Span","v":"2019-20 - 2025-26"}]
[null,"E10. OVERHEADS EXPENDITURE"]
[]
[null,"E10.1 - NETWORK"]
[null,null,"EXPENDITURE"]
[null,null,{"$f":"CONCATENATE(\"$0's, real \",dms_DollarReal)","v":"$0's, real June 2021"}]
[null,null,{"$f":"CRCP_y4","v":"2019-20"},{"$f":"CRCP_y5","v":"2020-21"},{"$f":"FRCP_y1","v":"2021-22"},{"$f":"FRCP_y2","v":"2022-23"},{"$f":"FRCP_y3","v":"2023-24"},{"$f":"FRCP_y4","v":"2024-25"},{"$f":"FRCP_y5","v":"2025-26"}]
[null,"E10.1.1 - OPEX"]
[null,"Reference services"]
[null,"Non-reference services"]
[null,"Total",{"$f":"SUM(C11:C12)","v":0},{"$f":"SUM(D11:D12)","v":0},0,0,0,0,0]
[null,"E10.1.2 - CAPEX"]
[null,"Reference services",9387852.1075141858,8323408.6122542787,9530382.6529776305,9690783.1879507247,9758168.633105468,9731237.0046472531,9472490.5285784844]
[null,"Non-reference services"]
[null,"Total",{"$f":"SUM(C15:C16)","v":9387852.1075141858},{"$f":"SUM(D15:D16)","v":8323408.6122542787},9530382.6529776305,9690783.1879507247,9758168.633105468,9731237.0046472531,9472490.5285784844]
[]
[]
[]
[null,"E10.2 - CORPORATE"]
[null,null,"EXPENDITURE"]
[null,null,{"$f":"CONCATENATE(\"$0's, real \",dms_DollarReal)","v":"$0's, real June 2021"}]
[null,null,{"$f":"CRCP_y4","v":"2019-20"},{"$f":"CRCP_y5","v":"2020-21"},{"$f":"FRCP_y1","v":"2021-22"},{"$f":"FRCP_y2","v":"2022-23"},{"$f":"FRCP_y3","v":"2023-24"},{"$f":"FRCP_y4","v":"2024-25"},{"$f":"FRCP_y5","v":"2025-26"}]
[null,"E10.2.1 - OPEX"]
[null,"Reference services"]
[null,"Non-reference services"]
[null,"Total",{"$f":"SUM(C26:C27)","v":0},0,0,0,0,0,0]
[null,"E10.2.2 - CAPEX"]
[null,"Reference services"]
[null,"Non-reference services"]
[null,"Total",{"$f":"SUM(C30:C31)","v":0},0,0,0,0,0,0]

{"sheet":"E12. ICT","index":14,"n_rows":139,"n_cols":9,"rows_kept":139,"cut":false,"hidden":false,"merged":[[24,2,24,8],[25,2,25,8]]}
[null,{"$f":"INDEX(dms_Worksheet_List,MATCH(dms_Model,dms_Model_List))","v":"REGULATORY REPORTING STATEMENT"}]
[null,{"$f":"INDEX(dms_TradingNameFull_List,MATCH(dms_TradingName,dms_TradingName_List))","v":"Australian Gas Distribution Co. "}]
[null,{"$f":"dms_Header_Span","v":"2019-20 - 2025-26"}]
[null,"E12. INFORMATION AND COMMUNICATION TECHNOLOGY"]
[]
[null,"Please list all projects here:"]
[null,"Geospatial Information System"]
[null,"Metering & Billing System"]
[null,"Enterprise Asset Management"]
[null,"FRC Market Gateway"]
[null,"Middleware - BizTalk"]
[null,"Licence Growth"]
[null,"Infrastructure Renewal (AGN)"]
[null,"Business Intelligence"]
[null,"Mobility Integration"]
[null,"Develop Digital Capability"]
[null,"AGIG Strategy & Roadmap"]
[null,"Life support data solution"]
[]
[]
[]
[]
[null,"E12.1 - CAPEX - BY PROJECT"]
[null,"A. DIRECT INTERNAL LABOUR EXPENDITURE"]
[null,null,"EXPENDITURE"]
[null,null,{"$f":"CONCATENATE(\"$0's, real \",dms_DollarReal)","v":"$0's, real June 2021"}]
[null,null,{"$f":"CRCP_y4","v":"2019-20"},{"$f":"CRCP_y5","v":"2020-21"},{"$f":"FRCP_y1","v":"2021-22"},{"$f":"FRCP_y2","v":"2022-23"},{"$f":"FRCP_y3","v":"2023-24"},{"$f":"FRCP_y4","v":"2024-25"},{"$f":"FRCP_y5","v":"2025-26"}]
[]
[null,{"$f":"IF(ISBLANK(dms_E12_Projects_02),\"\",dms_E12_Projects_02)","v":""}]
[null,{"$f":"IF(ISBLANK(dms_E12_Projects_03),\"\",dms_E12_Projects_03)","v":""}]
[null,{"$f":"IF(ISBLANK(dms_E12_Projects_04),\"\",dms_E12_Projects_04)","v":""}]
[null,{"$f":"IF(ISBLANK(dms_E12_Projects_05),\"\",dms_E12_Projects_05)","v":""}]
[null,{"$f":"IF(ISBLANK(dms_E12_Projects_06),\"\",dms_E12_Projects_06)","v":""}]
[null,{"$f":"IF(ISBLANK(dms_E12_Projects_07),\"\",dms_E12_Projects_07)","v":""}]
[null,{"$f":"IF(ISBLANK(dms_E12_Projects_08),\"\",dms_E12_Projects_08)","v":""}]
[null,{"$f":"IF(ISBLANK(dms_E12_Projects_09),\"\",dms_E12_Projects_09)","v":""}]
[null,{"$f":"IF(ISBLANK(dms_E12_Projects_10),\"\",dms_E12_Projects_10)","v":""}]
[null,{"$f":"IF(ISBLANK(dms_E12_Projects_11),\"\",dms_E12_Projects_11)","v":""}]
[null,{"$f":"IF(ISBLANK(dms_E12_Projects_12),\"\",dms_E12_Projects_12)","v":""}]
[null,{"$f":"IF(ISBLANK(dms_E12_Projects_13),\"\",dms_E12_Projects_13)","v":""}]
[null,{"$f":"IF(ISBLANK(dms_E12_Projects_14),\"\",dms_E12_Projects_14)","v":""}]
[null,{"$f":"IF(ISBLANK(dms_E12_Projects_15),\"\",dms_E12_Projects_15)","v":""}]
[null,"Aggregate of other projects with total expenditure of less than $500,000"]
[null,"Total",{"$f":"SUM(C28:C43)","v":0},{"$f":"SUM(D28:D43)","v":0},0,0,0,0,0]
[]
[null,"B. DIRECT CONTRACTOR EXPENDITURE"]
[null,"Geospatial Information System",4053063.285740315,8319453.8483810127]
[null,"Metering & Billing System",2594406.3096794407,0]
[null,"Enterprise Asset Management",327971.76122525497,270172.9133814121]
[null,"FRC Market Gateway",192600.86649134103,189121.03936698847]
[null,"Middleware - BizTalk",0,162103.74802884724]
[null,"Licence Growth",110057.63799505201,108069.16535256481]
[null,"Infrastructure Renewal (AGN)",39324.495831436885,105535.94965563706,24912.395410768637,11633.079950874873,36254.966672256516,25318.58962809512,56586.991405125511]
[null,"Business Intelligence",201772.33632426203,2343511.0438186545]
[null,"Mobility Integration",929568.82203380833,9027319.3114505392]
[null,"Develop Digital Capability",288597.29176564113,51734.787013936926]
[null,"AGIG Strategy & Roadmap",285173.57514758612,2111989.2705399254,754917.94060100976,1015090.0924991082,4496974.122595368,5780307.5515660653,2104275.9565055259]
[null,"Life support data solution",0,426463.89478816366]
[null,"Digital Customer Experience (SA137)",null,null,376373.57547970372,1195506.6985229447,362967.59141042968,309180.95135055576,0]
[null,"Apps Renewal (SA117)",null,null,1011691.3439219611,2882822.625326179,2956399.2419543811,4249320.8019800475,3373682.6442951318]
[null,"AIPM (SA121)",null,null,0,0,2467113.9136368674,0,0]
[null,"Aggregate of other projects with total expenditure of less than $500,000"]
[null,"Total",{"$f":"SUM(C47:C62)","v":9022536.3822341375},{"$f":"SUM(D47:D62)","v":23115474.971777681},2167895.2554134433,5105052.4962991066,10319709.836269302,10364127.894524764,5534545.5922057834]
[]
[null,"C. OTHER INTERNAL DIRECT EXPENDITURE"]
[]
[null,{"$f":"IF(ISBLANK(dms_E12_Projects_02),\"\",dms_E12_Projects_02)","v":""}]
[null,{"$f":"IF(ISBLANK(dms_E12_Projects_03),\"\",dms_E12_Projects_03)","v":""}]
[null,{"$f":"IF(ISBLANK(dms_E12_Projects_04),\"\",dms_E12_Projects_04)","v":""}]
[null,{"$f":"IF(ISBLANK(dms_E12_Projects_05),\"\",dms_E12_Projects_05)","v":""}]
[null,{"$f":"IF(ISBLANK(dms_E12_Projects_06),\"\",dms_E12_Projects_06)","v":""}]
[null,{"$f":"IF(ISBLANK(dms_E12_Projects_07),\"\",dms_E12_Projects_07)","v":""}]
[null,{"$f":"IF(ISBLANK(dms_E12_Projects_08),\"\",dms_E12_Projects_08)","v":""}]
[null,{"$f":"IF(ISBLANK(dms_E12_Projects_09),\"\",dms_E12_Projects_09)","v":""}]
[null,{"$f":"IF(ISBLANK(dms_E12_Projects_10),\"\",dms_E12_Projects_10)","v":""}]
[null,{"$f":"IF(ISBLANK(dms_E12_Projects_11),\"\",dms_E12_Projects_11)","v":""}]
[null,{"$f":"IF(ISBLANK(dms_E12_Projects_12),\"\",dms_E12_Projects_12)","v":""}]
[null,{"$f":"IF(ISBLANK(dms_E12_Projects_13),\"\",dms_E12_Projects_13)","v":""}]
[null,{"$f":"IF(ISBLANK(dms_E12_Projects_14),\"\",dms_E12_Projects_14)","v":""}]
[null,{"$f":"IF(ISBLANK(dms_E12_Projects_15),\"\",dms_E12_Projects_15)","v":""}]
[null,"Aggregate of other projects with total expenditure of less than $500,000"]
[null,"Total",{"$f":"SUM(C66:C81)","v":0},{"$f":"SUM(D66:D81)","v":0},0,0,0,0,0]
[]
[null,"D. TOTAL OVERHEAD EXPENDITURE"]
[null,"IT Overheads",null,null,205467.62275724285,453986.03304284404,895056.63277824293,907831.70130996488,537605.58519923501]
[null,{"$f":"IF(ISBLANK(dms_E12_Projects_02),\"\",dms_E12_Projects_02)","v":""}]
[null,{"$f":"IF(ISBLANK(dms_E12_Projects_03),\"\",dms_E12_Projects_03)","v":""}]
[null,{"$f":"IF(ISBLANK(dms_E12_Projects_04),\"\",dms_E12_Projects_04)","v":""}]
[null,{"$f":"IF(ISBLANK(dms_E12_Projects_05),\"\",dms_E12_Projects_05)","v":""}]
[null,{"$f":"IF(ISBLANK(dms_E12_Projects_06),\"\",dms_E12_Projects_06)","v":""}]
[null,{"$f":"IF(ISBLANK(dms_E12_Projects_07),\"\",dms_E12_Projects_07)","v":""}]
[null,{"$f":"IF(ISBLANK(dms_E12_Projects_08),\"\",dms_E12_Projects_08)","v":""}]
[null,{"$f":"IF(ISBLANK(dms_E12_Projects_09),\"\",dms_E12_Projects_09)","v":""}]
[null,{"$f":"IF(ISBLANK(dms_E12_Projects_10),\"\",dms_E12_Projects_10)","v":""}]
[null,{"$f":"IF(ISBLANK(dms_E12_Projects_11),\"\",dms_E12_Projects_11)","v":""}]
[null,{"$f":"IF(ISBLANK(dms_E12_Projects_12),\"\",dms_E12_Projects_12)","v":""}]
[null,{"$f":"IF(ISBLANK(dms_E12_Projects_13),\"\",dms_E12_Projects_13)","v":""}]
[null,{"$f":"IF(ISBLANK(dms_E12_Projects_14),\"\",dms_E12_Projects_14)","v":""}]
[null,{"$f":"IF(ISBLANK(dms_E12_Projects_15),\"\",dms_E12_Projects_15)","v":""}]
[null,"Aggregate of other projects with total expenditure of less than $500,000"]
[null,"Total",{"$f":"SUM(C85:C100)","v":0},{"$f":"SUM(D85:D100)","v":0},205467.62275724285,453986.03304284404,895056.63277824293,907831.70130996488,537605.58519923501]
[]
[null,"E. RELATED PARTY MARGIN EXPENDITURE"]
[null,{"$f":"IF(ISBLANK(dms_E12_Projects_01),\"\",dms_E12_Projects_01)","v":"Project 1"}]
[null,{"$f":"IF(ISBLANK(dms_E12_Projects_02),\"\",dms_E12_Projects_02)","v":""}]
[null,{"$f":"IF(ISBLANK(dms_E12_Projects_03),\"\",dms_E12_Projects_03)","v":""}]
[null,{"$f":"IF(ISBLANK(dms_E12_Projects_04),\"\",dms_E12_Projects_04)","v":""}]
[null,{"$f":"IF(ISBLANK(dms_E12_Projects_05),\"\",dms_E12_Projects_05)","v":""}]
[null,{"$f":"IF(ISBLANK(dms_E12_Projects_06),\"\",dms_E12_Projects_06)","v":""}]
[null,{"$f":"IF(ISBLANK(dms_E12_Projects_07),\"\",dms_E12_Projects_07)","v":""}]
[null,{"$f":"IF(ISBLANK(dms_E12_Projects_08),\"\",dms_E12_Projects_08)","v":""}]
[null,{"$f":"IF(ISBLANK(dms_E12_Projects_09),\"\",dms_E12_Projects_09)","v":""}]
[null,{"$f":"IF(ISBLANK(dms_E12_Projects_10),\"\",dms_E12_Projects_10)","v":""}]
[null,{"$f":"IF(ISBLANK(dms_E12_Projects_11),\"\",dms_E12_Projects_11)","v":""}]
[null,{"$f":"IF(ISBLANK(dms_E12_Projects_12),\"\",dms_E12_Projects_12)","v":""}]
[null,{"$f":"IF(ISBLANK(dms_E12_Projects_13),\"\",dms_E12_Projects_13)","v":""}]
[null,{"$f":"IF(ISBLANK(dms_E12_Projects_14),\"\",dms_E12_Projects_14)","v":""}]
[null,{"$f":"IF(ISBLANK(dms_E12_Projects_15),\"\",dms_E12_Projects_15)","v":""}]
[null,"Aggregate of other projects with total expenditure of less than $500,000"]
[null,"Total",{"$f":"SUM(C104:C119)","v":0},{"$f":"SUM(D104:D119)","v":0},0,0,0,0,0]
[]
[null,"F. CAPITAL CONTRIBUTIONS included in the above"]
[null,{"$f":"IF(ISBLANK(dms_E12_Projects_01),\"\",dms_E12_Projects_01)","v":"Project 1"}]
[null,{"$f":"IF(ISBLANK(dms_E12_Projects_02),\"\",dms_E12_Projects_02)","v":""}]
[null,{"$f":"IF(ISBLANK(dms_E12_Projects_03),\"\",dms_E12_Projects_03)","v":""}]
[null,{"$f":"IF(ISBLANK(dms_E12_Projects_04),\"\",dms_E12_Projects_04)","v":""}]
[null,{"$f":"IF(ISBLANK(dms_E12_Projects_05),\"\",dms_E12_Projects_05)","v":""}]
[null,{"$f":"IF(ISBLANK(dms_E12_Projects_06),\"\",dms_E12_Projects_06)","v":""}]
[null,{"$f":"IF(ISBLANK(dms_E12_Projects_07),\"\",dms_E12_Projects_07)","v":""}]
[null,{"$f":"IF(ISBLANK(dms_E12_Projects_08),\"\",dms_E12_Projects_08)","v":""}]
[null,{"$f":"IF(ISBLANK(dms_E12_Projects_09),\"\",dms_E12_Projects_09)","v":""}]
[null,{"$f":"IF(ISBLANK(dms_E12_Projects_10),\"\",dms_E12_Projects_10)","v":""}]
[null,{"$f":"IF(ISBLANK(dms_E12_Projects_11),\"\",dms_E12_Projects_11)","v":""}]
[null,{"$f":"IF(ISBLANK(dms_E12_Projects_12),\"\",dms_E12_Projects_12)","v":""}]
[null,{"$f":"IF(ISBLANK(dms_E12_Projects_13),\"\",dms_E12_Projects_13)","v":""}]
[null,{"$f":"IF(ISBLANK(dms_E12_Projects_14),\"\",dms_E12_Projects_14)","v":""}]
[null,{"$f":"IF(ISBLANK(dms_E12_Projects_15),\"\",dms_E12_Projects_15)","v":""}]
[null,"Aggregate of other projects with total expenditure of less than $500,000"]
[null,"Total",{"$f":"SUM(C123:C138)","v":0},{"$f":"SUM(D123:D138)","v":0},0,0,0,0,0]

{"sheet":"E13. Other capex","index":15,"n_rows":153,"n_cols":9,"rows_kept":153,"cut":false,"hidden":false,"merged":[[23,2,23,8],[24,2,24,8]]}
[null,{"$f":"INDEX(dms_Worksheet_List,MATCH(dms_Model,dms_Model_List))","v":"REGULATORY REPORTING STATEMENT"}]
[null,{"$f":"INDEX(dms_TradingNameFull_List,MATCH(dms_TradingName,dms_TradingName_List))","v":"Australian Gas Distribution Co. "}]
[null,{"$f":"dms_Header_Span","v":"2019-20 - 2025-26"}]
[null,"E13. OTHER CAPITAL EXPENDITURE"]
[]
[null,"Please list all projects here:"]
[]
[]
[]
[]
[]
[]
[]
[]
[]
[]
[]
[]
[]
[]
[]
[]
[null,"E13.1 - CAPEX - BY PROJECT"]
[null,null,"EXPENDITURE"]
[null,null,{"$f":"CONCATENATE(\"$0's, real \",dms_DollarReal)","v":"$0's, real June 2021"}]
[null,null,{"$f":"CRCP_y4","v":"2019-20"},{"$f":"CRCP_y5","v":"2020-21"},{"$f":"FRCP_y1","v":"2021-22"},{"$f":"FRCP_y2","v":"2022-23"},{"$f":"FRCP_y3","v":"2023-24"},{"$f":"FRCP_y4","v":"2024-25"},{"$f":"FRCP_y5","v":"2025-26"}]
[null,"A. DIRECT INTERNAL LABOUR EXPENDITURE"]
[]
[null,{"$f":"IF(ISBLANK(dms_E13_Projects_02),\"\",dms_E13_Projects_02)","v":""}]
[null,{"$f":"IF(ISBLANK(dms_E13_Projects_03),\"\",dms_E13_Projects_03)","v":""}]
[null,{"$f":"IF(ISBLANK(dms_E13_Projects_04),\"\",dms_E13_Projects_04)","v":""}]
[null,{"$f":"IF(ISBLANK(dms_E13_Projects_05),\"\",dms_E13_Projects_05)","v":""}]
[null,{"$f":"IF(ISBLANK(dms_E13_Projects_06),\"\",dms_E13_Projects_06)","v":""}]
[null,{"$f":"IF(ISBLANK(dms_E13_Projects_07),\"\",dms_E13_Projects_07)","v":""}]
[null,{"$f":"IF(ISBLANK(dms_E13_Projects_08),\"\",dms_E13_Projects_08)","v":""}]
[null,{"$f":"IF(ISBLANK(dms_E13_Projects_09),\"\",dms_E13_Projects_09)","v":""}]
[null,{"$f":"IF(ISBLANK(dms_E13_Projects_10),\"\",dms_E13_Projects_10)","v":""}]
[null,{"$f":"IF(ISBLANK(dms_E13_Projects_11),\"\",dms_E13_Projects_11)","v":""}]
[null,{"$f":"IF(ISBLANK(dms_E13_Projects_12),\"\",dms_E13_Projects_12)","v":""}]
[null,{"$f":"IF(ISBLANK(dms_E13_Projects_13),\"\",dms_E13_Projects_13)","v":""}]
[null,{"$f":"IF(ISBLANK(dms_E13_Projects_14),\"\",dms_E13_Projects_14)","v":""}]
[null,{"$f":"IF(ISBLANK(dms_E13_Projects_15),\"\",dms_E13_Projects_15)","v":""}]
[null,"Aggregate of other projects with total expenditure of less than $500,000"]
[null,"Total",{"$f":"SUM(C28:C43)","v":0},{"$f":"SUM(D28:D43)","v":0},0,0,0,0,0]
[]
[null,"B. DIRECT CONTRACTOR EXPENDITURE"]
[null,"2142 NETWORK - REGULATOR CAPEX"]
[null,"2139 NETWORK - REGULATOR STAY IN BUSINESS"]
[null,"2152 NETWORK - STOPPLE EQUIPMENT"]
[null,"2190 OTHER - NON RETIC CAPITAL"]
[null,"2106 C P - CORROSION PROTECTION - CAPEX"]
[null,"2130 MAINS ALTERATION - CHARGEABLE - CAPEX"]
[null,"2131 MAINS ALTERATION - NON CHARGEABLE - CAPEX"]
[null,"HDPE Camera Inspections"]
[null,"Northern Metro HP Main and Gawler Gate Station (SA115)"]
[null,"DCVG Dig Up and Repair TP (SA101)"]
[null,"Replacement of Valves (SA103)"]
[null,"TP M53 Replacement (SA104)"]
[null,"TP Modifications for ILI (SA105)"]
[null,"Additional emergency isolation valves (SA107)"]
[null,"I and C Meter Set Refurbishment (SA108)"]
[null,"CP Assets Replacement (SA112)"]
[null,"CP Remote Monitoring (SA126)"]
[null,"Isolated Steel Sections from CP (SA127)"]
[null,"I&C Overpressure risk reduction (SA129)"]
[null,"Slab Sensitive TP Areas (SA131)"]
[null,"Small Plant and Equipment (SA113)"]
[null,"DRS Overpressure risk reduction (SA106)"]
[null,"DRS Operability Risk Reduction (SA109)"]
[null,{"$f":"IF(ISBLANK(dms_E13_Projects_13),\"\",dms_E13_Projects_13)","v":""}]
[null,{"$f":"IF(ISBLANK(dms_E13_Projects_14),\"\",dms_E13_Projects_14)","v":""}]
[null,{"$f":"IF(ISBLANK(dms_E13_Projects_15),\"\",dms_E13_Projects_15)","v":""}]
[null,"Aggregate of other projects with total expenditure of less than $500,000"]
[null,"Total",{"$f":"SUM(C47:C73)","v":0},{"$f":"SUM(D47:D73)","v":0},0,0,0,0,0]
[]
[null,"C. OTHER INTERNAL DIRECT EXPENDITURE"]
[null,{"$f":"IF(ISBLANK(dms_E13_Projects_01),\"\",dms_E13_Projects_01)","v":"Project 1"}]
[null,{"$f":"IF(ISBLANK(dms_E13_Projects_02),\"\",dms_E13_Projects_02)","v":""}]
[null,{"$f":"IF(ISBLANK(dms_E13_Projects_03),\"\",dms_E13_Projects_03)","v":""}]
[null,{"$f":"IF(ISBLANK(dms_E13_Projects_04),\"\",dms_E13_Projects_04)","v":""}]
[null,{"$f":"IF(ISBLANK(dms_E13_Projects_05),\"\",dms_E13_Projects_05)","v":""}]
[null,{"$f":"IF(ISBLANK(dms_E13_Projects_06),\"\",dms_E13_Projects_06)","v":""}]
[null,{"$f":"IF(ISBLANK(dms_E13_Projects_07),\"\",dms_E13_Projects_07)","v":""}]
[null,{"$f":"IF(ISBLANK(dms_E13_Projects_08),\"\",dms_E13_Projects_08)","v":""}]
[null,{"$f":"IF(ISBLANK(dms_E13_Projects_09),\"\",dms_E13_Projects_09)","v":""}]
[null,{"$f":"IF(ISBLANK(dms_E13_Projects_10),\"\",dms_E13_Projects_10)","v":""}]
[null,{"$f":"IF(ISBLANK(dms_E13_Projects_11),\"\",dms_E13_Projects_11)","v":""}]
[null,{"$f":"IF(ISBLANK(dms_E13_Projects_12),\"\",dms_E13_Projects_12)","v":""}]
[null,{"$f":"IF(ISBLANK(dms_E13_Projects_13),\"\",dms_E13_Projects_13)","v":""}]
[null,{"$f":"IF(ISBLANK(dms_E13_Projects_14),\"\",dms_E13_Projects_14)","v":""}]
[null,{"$f":"IF(ISBLANK(dms_E13_Projects_15),\"\",dms_E13_Projects_15)","v":""}]
[null,"Aggregate of other projects with total expenditure of less than $500,000"]
[null,"Total",{"$f":"SUM(C77:C92)","v":0},{"$f":"SUM(D77:D92)","v":0},0,0,0,0,0]
[]
[null,"D. TOTAL OVERHEAD EXPENDITURE"]
[null,"2142 NETWORK - REGULATOR CAPEX",136969.26835379162,188427.24728860622]
[null,"2139 NETWORK - REGULATOR STAY IN BUSINESS",22957.959597273206,3044.1057546677312]
[null,"2152 NETWORK - STOPPLE EQUIPMENT",229261.63268736569,516143.60914538364]
[null,"2190 OTHER - NON RETIC CAPITAL",82735.257024453982,54757.708832079057]
[null,"2106 C P - CORROSION PROTECTION - CAPEX",27635.827686464996,19636.154703186356]
[null,"2130 MAINS ALTERATION - CHARGEABLE - CAPEX",246787.94525251442,181370.36319318425]
[null,"2131 MAINS ALTERATION - NON CHARGEABLE - CAPEX",10113.735353519533,0]
[null,"HDPE Camera Inspections",null,null,202371.69634148423,190794.21156730381,187183.38182935666,180578.01629089535,0]
[null,"Other Distribution overheads",null,null,715286.36610163748,1034570.8975991207,966256.27603120869,924589.03791488777,995263.56734999537]
[null,"Other Non-distribution overheads",null,null,105575.00967156437,99535.167692160438,67747.045050168017,68796.182569139288,88971.960498789922]
[null,"Regulators Overheads",null,null,69393.818996259331,73376.7049133744,107610.50828929173,109276.97538904881,121777.55082101547]
[null,"Northern Metro HP Main and Gawler Gate Station (SA115) overheads",null,null,261792.30612320179,380891.85741047794,0,0,0]
[]
[null,{"$f":"IF(ISBLANK(dms_E13_Projects_02),\"\",dms_E13_Projects_02)","v":""}]
[null,{"$f":"IF(ISBLANK(dms_E13_Projects_12),\"\",dms_E13_Projects_12)","v":""}]
[null,{"$f":"IF(ISBLANK(dms_E13_Projects_13),\"\",dms_E13_Projects_13)","v":""}]
[null,{"$f":"IF(ISBLANK(dms_E13_Projects_14),\"\",dms_E13_Projects_14)","v":""}]
[null,{"$f":"IF(ISBLANK(dms_E13_Projects_15),\"\",dms_E13_Projects_15)","v":""}]
[null,"Aggregate of other projects with total expenditure of less than $500,000"]
[null,"Total",{"$f":"SUM(C96:C114)","v":756461.62595538353},963379.1889171073,1354419.197234147,1779168.8391824374,1328797.2112000252,1283240.2121639713,1206013.0786698007]
[]
[null,"E. RELATED PARTY MARGIN EXPENDITURE"]
[]
[null,{"$f":"IF(ISBLANK(dms_E13_Projects_02),\"\",dms_E13_Projects_02)","v":""}]
[null,{"$f":"IF(ISBLANK(dms_E13_Projects_03),\"\",dms_E13_Projects_03)","v":""}]
[null,{"$f":"IF(ISBLANK(dms_E13_Projects_04),\"\",dms_E13_Projects_04)","v":""}]
[null,{"$f":"IF(ISBLANK(dms_E13_Projects_05),\"\",dms_E13_Projects_05)","v":""}]
[null,{"$f":"IF(ISBLANK(dms_E13_Projects_06),\"\",dms_E13_Projects_06)","v":""}]
[null,{"$f":"IF(ISBLANK(dms_E13_Projects_07),\"\",dms_E13_Projects_07)","v":""}]
[null,{"$f":"IF(ISBLANK(dms_E13_Projects_08),\"\",dms_E13_Projects_08)","v":""}]
[null,{"$f":"IF(ISBLANK(dms_E13_Projects_09),\"\",dms_E13_Projects_09)","v":""}]
[null,{"$f":"IF(ISBLANK(dms_E13_Projects_10),\"\",dms_E13_Projects_10)","v":""}]
[null,{"$f":"IF(ISBLANK(dms_E13_Projects_11),\"\",dms_E13_Projects_11)","v":""}]
[null,{"$f":"IF(ISBLANK(dms_E13_Projects_12),\"\",dms_E13_Projects_12)","v":""}]
[null,{"$f":"IF(ISBLANK(dms_E13_Projects_13),\"\",dms_E13_Projects_13)","v":""}]
[null,{"$f":"IF(ISBLANK(dms_E13_Projects_14),\"\",dms_E13_Projects_14)","v":""}]
[null,{"$f":"IF(ISBLANK(dms_E13_Projects_15),\"\",dms_E13_Projects_15)","v":""}]
[null,"Aggregate of other projects with total expenditure of less than $500,000"]
[null,"Total",{"$f":"SUM(C118:C133)","v":0},{"$f":"SUM(D118:D133)","v":0},0,0,0,0,0]
[]
[null,"F. CAPITAL CONTRIBUTIONS included in the above"]
[null,null,3969787.0467316033,3353820.8925049128,0,0,680242.74605930189,883826.13625965139,693107.87533474946]
[null,{"$f":"IF(ISBLANK(dms_E13_Projects_02),\"\",dms_E13_Projects_02)","v":""}]
[null,{"$f":"IF(ISBLANK(dms_E13_Projects_03),\"\",dms_E13_Projects_03)","v":""}]
[null,{"$f":"IF(ISBLANK(dms_E13_Projects_04),\"\",dms_E13_Projects_04)","v":""}]
[null,{"$f":"IF(ISBLANK(dms_E13_Projects_05),\"\",dms_E13_Projects_05)","v":""}]
[null,{"$f":"IF(ISBLANK(dms_E13_Projects_06),\"\",dms_E13_Projects_06)","v":""}]
[null,{"$f":"IF(ISBLANK(dms_E13_Projects_07),\"\",dms_E13_Projects_07)","v":""}]
[null,{"$f":"IF(ISBLANK(dms_E13_Projects_08),\"\",dms_E13_Projects_08)","v":""}]
[null,{"$f":"IF(ISBLANK(dms_E13_Projects_09),\"\",dms_E13_Projects_09)","v":""}]
[null,{"$f":"IF(ISBLANK(dms_E13_Projects_10),\"\",dms_E13_Projects_10)","v":""}]
[null,{"$f":"IF(ISBLANK(dms_E13_Projects_11),\"\",dms_E13_Projects_11)","v":""}]
[null,{"$f":"IF(ISBLANK(dms_E13_Projects_12),\"\",dms_E13_Projects_12)","v":""}]
[null,{"$f":"IF(ISBLANK(dms_E13_Projects_13),\"\",dms_E13_Projects_13)","v":""}]
[null,{"$f":"IF(ISBLANK(dms_E13_Projects_14),\"\",dms_E13_Projects_14)","v":""}]
[null,{"$f":"IF(ISBLANK(dms_E13_Projects_15),\"\",dms_E13_Projects_15)","v":""}]
[null,"Aggregate of other projects with total expenditure of less than $500,000"]
[null,"Total",{"$f":"SUM(C137:C152)","v":3969787.0467316033},{"$f":"SUM(D137:D152)","v":3353820.8925049128},0,0,680242.74605930189,883826.13625965139,693107.87533474946]

{"sheet":"E17. Step changes","index":16,"n_rows":70,"n_cols":10,"rows_kept":70,"cut":false,"hidden":false,"merged":[[7,3,7,9],[8,3,8,9],[41,3,41,9],[42,3,42,9],[69,1,69,2],[23,3,23,9],[24,3,24,9],[36,1,36,2],[20,1,20,2]]}
[null,{"$f":"INDEX(dms_Worksheet_List,MATCH(dms_Model,dms_Model_List))","v":"REGULATORY REPORTING STATEMENT"}]
[null,{"$f":"INDEX(dms_TradingNameFull_List,MATCH(dms_TradingName,dms_TradingName_List))","v":"Australian Gas Networks Limited (reporting data for SA)"}]
[null,{"$f":"dms_Header_Span","v":"2019-20 - 2025-26"}]
[null,"E17. STEP CHANGES"]
[]
[null,"E17.1 - STEP CHANGES FOR REFERENCE SERVICES"]
[null,"E17.1.1 - FORECAST OPEX"]
[null,null,null,"EXPENDITURE"]
[null,null,null,{"$f":"CONCATENATE(\"$0's, real \",dms_DollarReal)","v":"$0's, real June 2021"}]
[null,"Step change","Description",{"$f":"CRCP_y4","v":"2019-20"},{"$f":"CRCP_y5","v":"2020-21"},{"$f":"FRCP_y1","v":"2021-22"},{"$f":"FRCP_y2","v":"2022-23"},{"$f":"FRCP_y3","v":"2023-24"},{"$f":"FRCP_y4","v":"2024-25"},{"$f":"FRCP_y5","v":"2025-26"}]
[null,"Customer Relationship Management System","Customer database to manage customer information","N/A","N/A",{"$f":"'[4]Input - Non-Base Year Costs'!F7*[4]Assumptions!$E$14*1000000","v":6865.1550000000007},{"$f":"'[4]Input - Non-Base Year Costs'!G7*[4]Assumptions!$E$14*1000000","v":300324.91500000004},{"$f":"'[4]Input - Non-Base Year Costs'!H7*[4]Assumptions!$E$14*1000000","v":342642.96},{"$f":"'[4]Input - Non-Base Year Costs'!I7*[4]Assumptions!$E$14*1000000","v":355451.08500000002},{"$f":"'[4]Input - Non-Base Year Costs'!J7*[4]Assumptions!$E$14*1000000","v":355451.08500000002}]
[null,"Vulnerable Customer Initiative","An initiative to help our vulnerable customers","N/A","N/A",{"$f":"'[4]Input - Non-Base Year Costs'!F8*[4]Assumptions!$E$14*1000000","v":911938.50000000012},{"$f":"'[4]Input - Non-Base Year Costs'!G8*[4]Assumptions!$E$14*1000000","v":732624.75},{"$f":"'[4]Input - Non-Base Year Costs'!H8*[4]Assumptions!$E$14*1000000","v":732624.75},{"$f":"'[4]Input - Non-Base Year Costs'!I8*[4]Assumptions!$E$14*1000000","v":732624.75},{"$f":"'[4]Input - Non-Base Year Costs'!J8*[4]Assumptions!$E$14*1000000","v":732624.75}]
[null,"Insurance","Additional forecast insurance expenditure driven by rise in premia","N/A","N/A",{"$f":"'[4]Input - Non-Base Year Costs'!F9*[4]Assumptions!$E$14*1000000","v":391251.31085699995},{"$f":"'[4]Input - Non-Base Year Costs'!G9*[4]Assumptions!$E$14*1000000","v":528172.87218299997},{"$f":"'[4]Input - Non-Base Year Costs'!H9*[4]Assumptions!$E$14*1000000","v":628872.31826099998},{"$f":"'[4]Input - Non-Base Year Costs'!I9*[4]Assumptions!$E$14*1000000","v":675371.50906499999},{"$f":"'[4]Input - Non-Base Year Costs'!J9*[4]Assumptions!$E$14*1000000","v":709631.0711820001}]
[]
[]
[]
[]
[]
[]
[]
[null,"Total",null,{"$f":"SUM(D11:D20)","v":0},0,1310054.9658570001,1561122.537183,1704140.0282609998,1763447.3440649998,1797706.9061819999]
[]
[null,"E17.1.2 - FORECAST CAPEX"]
[null,null,null,"EXPENDITURE"]
[null,null,null,{"$f":"CONCATENATE(\"$0's, real \", dms_DollarReal)","v":"$0's, real June 2021"}]
[null,"Step change","Description",{"$f":"CRCP_y4","v":"2019-20"},{"$f":"CRCP_y5","v":"2020-21"},{"$f":"FRCP_y1","v":"2021-22"},{"$f":"FRCP_y2","v":"2022-23"},{"$f":"FRCP_y3","v":"2023-24"},{"$f":"FRCP_y4","v":"2024-25"},{"$f":"FRCP_y5","v":"2025-26"}]
[null,null,null,"N/A","N/A","N/A","N/A","N/A","N/A","N/A"]
[]
[]
[]
[]
[]
[]
[]
[]
[]
[null,"Total",null,{"$f":"SUM(D27:D36)","v":0},0,0,0,0,0,0]
[]
[]
[]
[null,"E17.2 - CATEGORY SPECIFIC FORECASTS"]
[null,null,null,"EXPENDITURE"]
[null,null,null,{"$f":"CONCATENATE(\"$0's, real \",dms_DollarReal)","v":"$0's, real June 2021"}]
[null,"Category desription",null,{"$f":"CRCP_y4","v":"2019-20"},{"$f":"CRCP_y5","v":"2020-21"},{"$f":"FRCP_y1","v":"2021-22"},{"$f":"FRCP_y2","v":"2022-23"},{"$f":"FRCP_y3","v":"2023-24"},{"$f":"FRCP_y4","v":"2024-25"},{"$f":"FRCP_y5","v":"2025-26"}]
[null,"Unaccounted For Gas",null,8859178.0941212829,8854274.4724426232,9443174.4000000004,9443174.4000000004,9443174.4000000004,9443174.4000000004,9443174.4000000004]
[null,"Debt Raising Costs",null,1209087,1212370.3441061461,859896.91038351331,866952.17463698599,876502.83596260974,885806.77459380287,895757.60783955466]
[null,"Capitalised Overheads Expensed",null,1072487.8580152674,1072487.8580152674,0,0,0,0,0]
[null,"Ancillary Reference Services",null,2386925.2607337888,2403612.007946955,2417877.0339636607,2442706.9340348709,2470407.110798351,2500972.6664399547,2530842.7142726919]
[]
[]
[]
[]
[]
[]
[]
[]
[]
[]
[]
[]
[]
[]
[]
[]
[]
[]
[]
[]
[]
[null,"Total",null,{"$f":"SUM(D45:D69)","v":13527678.212870339},13542744.682510991,12720948.344347175,12752833.508671857,12790084.346760962,12829953.841033757,12869774.722112246]

{"sheet":"E20. Opex","index":17,"n_rows":131,"n_cols":12,"rows_kept":131,"cut":false,"hidden":false,"merged":[[40,2,40,11],[54,2,54,11],[55,2,55,11],[25,2,25,11],[26,2,26,11],[13,2,13,11],[14,2,14,11],[6,1,6,3],[7,1,7,2],[7,3,8,3],[8,1,8,2],[9,1,9,2],[102,2,102,11],[103,2,103,11],[89,2,89,11],[41,2,41,11],[88,2,88,11]]}
[null,{"$f":"INDEX(dms_Worksheet_List,MATCH(dms_Model,dms_Model_List))","v":"REGULATORY REPORTING STATEMENT"}]
[null,{"$f":"INDEX(dms_TradingNameFull_List,MATCH(dms_TradingName,dms_TradingName_List))","v":"Australian Gas Networks Limited (reporting data for SA)"}]
[null,{"$f":"dms_Header_Span","v":"2019-20 - 2025-26"}]
[null,"E20. OPERATING EXPENDITURE"]
[]
[]
[null,"IMPORTANT!"]
[null,{"$f":"CONCATENATE(\"Has \",dms_TradingName,\" used a base-step-trend model to derive its opex forecast? \")","v":"Has AGN (SA) used a base-step-trend model to derive its opex forecast? "},null,"Yes"]
[null,"Yes /  No"]
[null,"Please nominate the base year",null,"2019-20"]
[null,null,null,null,"2015-16","2016-17","2017-18","2018-19","2019-20"]
[null,"E20.1 - OPEX - BY DRIVER"]
[null,"E20.1.1 - REFERENCE SERVICES  "]
[null,null,"EXPENDITURE"]
[null,null,{"$f":"CONCATENATE(\"$0's, real \",dms_DollarReal)","v":"$0's, real June 2021"}]
[null,null,{"$f":"CRCP_y1","v":"2016-17"},{"$f":"CRCP_y2","v":"2017-18"},{"$f":"CRCP_y3","v":"2018-19"},{"$f":"CRCP_y4","v":"2019-20"},{"$f":"CRCP_y5","v":"2020-21"},{"$f":"FRCP_y1","v":"2021-22"},{"$f":"FRCP_y2","v":"2022-23"},{"$f":"FRCP_y3","v":"2023-24"},{"$f":"FRCP_y4","v":"2024-25"},{"$f":"FRCP_y5","v":"2025-26"}]
[null,"Base year total opex, excluding category specific",null,60624557.287200518,54831622.643006325,57994165.350000001,57994165.350000001,57994165.350000001,57994165.350000001,57994165.350000001,57994165.350000001,57994165.350000001]
[null,"Increment from base year to final year",null,null,null,null,0]
[null,"Price growth",null,null,null,null,null,368992.85049335734,527212.99327803601,660465.29821397003,932104.58329964103,1049328.2961587366]
[null,"Output growth",null,null,null,null,null,806052.30794203794,716445.516332275,1185560.7456944762,1498626.0583192385,1855988.206141738]
[null,"Productivity growth",null,null,null,null,null,0,482640.419161756,553978.65387608507,636021.14287506556,772275.72277586441]
[null,"Step changes",null,null,null,null,null,1310054.9658570001,1561122.537183,1704140.0282610001,1763447.3440650003,1797706.9061820002]
[null,"Category specific",null,null,null,{"$f":"IF(ISBLANK('E17. Step changes'!D70),\"\",'E17. Step changes'!D70)","v":13527678.212870339},{"$f":"IF(ISBLANK('E17. Step changes'!E70),\"\",'E17. Step changes'!E70)","v":13542744.682510991},{"$f":"IF(ISBLANK('E17. Step changes'!F70),\"\",'E17. Step changes'!F70)","v":12720948.344347175},{"$f":"IF(ISBLANK('E17. Step changes'!G70),\"\",'E17. Step changes'!G70)","v":12752833.508671857},{"$f":"IF(ISBLANK('E17. Step changes'!H70),\"\",'E17. Step changes'!H70)","v":12790084.346760962},{"$f":"IF(ISBLANK('E17. Step changes'!I70),\"\",'E17. Step changes'!I70)","v":12829953.841033757},{"$f":"IF(ISBLANK('E17. Step changes'!J70),\"\",'E17. Step changes'!J70)","v":12869774.722112246}]
[]
[null,"E20.1.2 - NON-REFERENCE SERVICES  "]
[null,null,"EXPENDITURE"]
[null,null,{"$f":"CONCATENATE(\"$0's, real \",dms_DollarReal)","v":"$0's, real June 2021"}]
[null,null,{"$f":"CRCP_y1","v":"2016-17"},{"$f":"CRCP_y2","v":"2017-18"},{"$f":"CRCP_y3","v":"2018-19"},{"$f":"CRCP_y4","v":"2019-20"},{"$f":"CRCP_y5","v":"2020-21"},{"$f":"FRCP_y1","v":"2021-22"},{"$f":"FRCP_y2","v":"2022-23"},{"$f":"FRCP_y3","v":"2023-24"},{"$f":"FRCP_y4","v":"2024-25"},{"$f":"FRCP_y5","v":"2025-26"}]
[null,"Base year total opex, excluding category specific",null,null,0,317068,320901.73378122202,323901.62277789216,325823.9234905293,329169.90649439493,332902.67708102107,337021.57523958018]
[null,"Increment from base year to final year"]
[null,"Price growth"]
[null,"Output growth"]
[null,"Productivity growth"]
[null,"Step changes"]
[null,"Category specific"]
[]
[]
[]
[null,"E20.2 - OPEX - BY CATEGORY"]
[null,"E20.2.1 - REFERENCE SERVICES"]
[null,null,"EXPENDITURE"]
[null,null,{"$f":"CONCATENATE(\"$0's, real \",dms_DollarReal)","v":"$0's, real June 2021"}]
[null,null,{"$f":"CRCP_y1","v":"2016-17"},{"$f":"CRCP_y2","v":"2017-18"},{"$f":"CRCP_y3","v":"2018-19"},{"$f":"CRCP_y4","v":"2019-20"},{"$f":"CRCP_y5","v":"2020-21"},{"$f":"FRCP_y1","v":"2021-22"},{"$f":"FRCP_y2","v":"2022-23"},{"$f":"FRCP_y3","v":"2023-24"},{"$f":"FRCP_y4","v":"2024-25"},{"$f":"FRCP_y5","v":"2025-26"}]
[null,"repairs and maintenance",null,null,null,43357040.100000009,43958938.080598027,44235516.059540547,44647639.101255521,45151308.528453767,45649775.572518542,46106446.227526642]
[null,"marketing and retail incentives",null,null,null,5278996.8000000007,5352281.726880963,5385956.8638926344,5436135.4787935065,5497460.4513540147,5558152.000510836,5613754.572108929]
[null,"debt raising",null,null,null,1209087,1212370.3441061461,859896.91038351331,866952.17463698599,876502.83596260974,885806.77459380287,895757.60783955466]
[null,"equity raising"]
[null,"unaccounted for gas",null,null,null,8859178.0941212829,8854274.4724426232,9443174.4000000004,9443174.4000000004,9443174.4000000004,9443174.4000000004,9443174.4000000004]
[null,"jurisdictional charges"]
[null,"GSL payments"]
[null,"other opex",null,null,null,9358128.4499999993,9488041.3454199973,13275669.584822878,13640519.169940909,13919948.207036102,14117409.571969522,14280106.395895462]
[null,"TOTAL",null,null,null,{"$f":"SUM(F44:F51)","v":68062430.444121286},68865905.969447762,73200213.818639576,74034420.324626923,74888394.422806486,75654318.319592699,76339239.203370586]
[]
[null,"E20.2.2 - NON-REFERENCE SERVICES"]
[null,null,"EXPENDITURE"]
[null,null,{"$f":"CONCATENATE(\"$0's, real \",dms_DollarReal)","v":"$0's, real June 2021"}]
[null,null,{"$f":"CRCP_y1","v":"2016-17"},{"$f":"CRCP_y2","v":"2017-18"},{"$f":"CRCP_y3","v":"2018-19"},{"$f":"CRCP_y4","v":"2019-20"},{"$f":"CRCP_y5","v":"2020-21"},{"$f":"FRCP_y1","v":"2021-22"},{"$f":"FRCP_y2","v":"2022-23"},{"$f":"FRCP_y3","v":"2023-24"},{"$f":"FRCP_y4","v":"2024-25"},{"$f":"FRCP_y5","v":"2025-26"}]
[null,"Special account investigation",null,null,null,12153.191174274647,12266.802977017323,12339.604353874487,12466.323429626118,12607.690925570858,12763.681845777179,12916.123250823761]
[null,"No access",null,null,null,189904.74510128229,191680.03359390594,192817.62179743449,194797.72343781867,197006.72006249285,199444.22108712918,201826.25768584007]
[null,"Same day service premium",null,null,null,46178.685352151013,46610.378034008114,46887.002652750773,47368.499260788718,47905.655717939837,48498.377046741785,49077.611222962674]
[null,"MFX unable to be completed",null,null,null,72665.112153514056,73344.408172960742,73779.694686469564,74537.360366161418,75382.610375017553,76315.295259932056,77226.757248450493]
[]
[]
[]
[]
[]
[]
[]
[]
[]
[]
[]
[]
[]
[]
[]
[]
[]
[]
[]
[]
[]
[null,"TOTAL",null,null,null,{"$f":"SUM(F58:F82)","v":320901.73378122202},{"$f":"SUM(G58:G82)","v":323901.62277789216},325823.9234905293,329169.90649439493,332902.67708102107,337021.57523958018,341046.74940807698]
[]
[]
[]
[null,"E20.3 - OPEX - BY CATEGORY - RELATED PARTY MARGIN EXPENDITURE"]
[null,"20.3.1 - REFERENCE SERVICES"]
[null,null,"EXPENDITURE"]
[null,null,{"$f":"CONCATENATE(\"$0's, real \",dms_DollarReal)","v":"$0's, real June 2021"}]
[null,null,{"$f":"CRCP_y1","v":"2016-17"},{"$f":"CRCP_y2","v":"2017-18"},{"$f":"CRCP_y3","v":"2018-19"},{"$f":"CRCP_y4","v":"2019-20"},{"$f":"CRCP_y5","v":"2020-21"},{"$f":"FRCP_y1","v":"2021-22"},{"$f":"FRCP_y2","v":"2022-23"},{"$f":"FRCP_y3","v":"2023-24"},{"$f":"FRCP_y4","v":"2024-25"},{"$f":"FRCP_y5","v":"2025-26"}]
[null,"repairs and maintenance",null,null,null,"N/A","N/A","N/A","N/A","N/A","N/A","N/A"]
[null,"marketing and retail incentives"]
[null,"debt raising"]
[null,"equity raising"]
[null,"unaccounted for gas"]
[null,"jurisdictional charges"]
[null,"GSL payments"]
[null,"other opex"]
[null,"TOTAL",null,null,null,{"$f":"SUM(F92:F99)","v":0},0,0,0,0,0,0]
[]
[null,"20.3.2 - NON-REFERENCE SERVICES"]
[null,null,"EXPENDITURE"]
[null,null,{"$f":"CONCATENATE(\"$0's, real \",dms_DollarReal)","v":"$0's, real June 2021"}]
[null,null,{"$f":"CRCP_y1","v":"2016-17"},{"$f":"CRCP_y2","v":"2017-18"},{"$f":"CRCP_y3","v":"2018-19"},{"$f":"CRCP_y4","v":"2019-20"},{"$f":"CRCP_y5","v":"2020-21"},{"$f":"FRCP_y1","v":"2021-22"},{"$f":"FRCP_y2","v":"2022-23"},{"$f":"FRCP_y3","v":"2023-24"},{"$f":"FRCP_y4","v":"2024-25"},{"$f":"FRCP_y5","v":"2025-26"}]
[null,{"$f":"IF(ISBLANK(B58),\"\",B58)","v":"Special account investigation"},null,null,null,12153.191174274647,12266.802977017323,12339.604353874487,12466.323429626118,12607.690925570858,12763.681845777179,12916.123250823761]
[null,"No access",null,null,null,189904.74510128229,191680.03359390594,192817.62179743449,194797.72343781867,197006.72006249285,199444.22108712918,201826.25768584007]
[null,"Same day service premium",null,null,null,46178.685352151013,46610.378034008114,46887.002652750773,47368.499260788718,47905.655717939837,48498.377046741785,49077.611222962674]
[null,"MFX unable to be completed",null,null,null,72665.112153514056,73344.408172960742,73779.694686469564,74537.360366161418,75382.610375017553,76315.295259932056,77226.757248450493]
[null,""]
[null,""]
[null,""]
[null,""]
[null,""]
[null,""]
[null,""]
[null,""]
[null,""]
[null,""]
[null,""]
[null,""]
[null,""]
[null,""]
[null,""]
[null,""]
[null,""]
[null,""]
[null,""]
[null,""]
[null,""]
[null,"TOTAL",null,null,null,{"$f":"SUM(F106:F130)","v":320901.73378122202},{"$f":"SUM(G106:G130)","v":323901.62277789216},325823.9234905293,329169.90649439493,332902.67708102107,337021.57523958018,341046.74940807698]

{"sheet":"E21. ARS","index":18,"n_rows":32,"n_cols":9,"rows_kept":32,"cut":false,"hidden":false,"merged":[[6,2,6,8],[7,2,7,8],[21,2,21,8],[22,2,22,8]]}
[null,{"$f":"INDEX(dms_Worksheet_List,MATCH(dms_Model,dms_Model_List))","v":"REGULATORY REPORTING STATEMENT"}]
[null,{"$f":"INDEX(dms_TradingNameFull_List,MATCH(dms_TradingName,dms_TradingName_List))","v":"Australian Gas Networks Limited (reporting data for SA)"}]
[null,{"$f":"dms_Header_Span","v":"2019-20 - 2025-26"}]
[null,"E21. ANCILLARY REFERENCE SERVICES"]
[]
[null,"E21.1 - VOLUMES"]
[null,null,"VOLUME"]
[null,null,"0's"]
[null,"Description",{"$f":"CRCP_y4","v":"2019-20"},{"$f":"CRCP_y5","v":"2020-21"},{"$f":"FRCP_y1","v":"2021-22"},{"$f":"FRCP_y2","v":"2022-23"},{"$f":"FRCP_y3","v":"2023-24"},{"$f":"FRCP_y4","v":"2024-25"},{"$f":"FRCP_y5","v":"2025-26"}]
[null,"Special Meter Read",108053.89318280182,109064.01450993509,109711.29077554148,110837.94872727961,112094.84562680895,113481.75923556874,114837.11414287954]
[null,"Disconnection",6701.0558598328153,6763.6994096295548,6803.8408083779959,6873.7114779775593,6951.6590288311672,7037.6696786218117,7121.7231881832222]
[null,"Reconnection",6719.2735014997825,6782.0873554645241,6822.3378835253761,6892.3985051039144,6970.5579659281257,7056.8024462120839,7141.0844655412193]
[null,"Meter Removal",2281.2535731857974,2302.5794395567159,2316.2448545663801,2340.031063489113,2366.5669009191133,2395.8476749152032,2424.4621758291769]
[null,"Meter Reinstallation",43.519921759977507,43.926759494648977,44.187457296519234,44.641231468514583,45.147460842733757,45.706055910094832,46.251940355215005]
[null,"Meter Gas and Installation Test",51.61665138974076,52.099179865746457,52.40837958424374,52.946576858005663,53.546988441381892,54.209508172438056,54.856952514324767]
[]
[null,"Total",{"$f":"SUM(C10:C16)","v":123850.61269046995},{"$f":"SUM(D10:D16)","v":125008.40665394628},{"$f":"SUM(E10:E16)","v":125750.310158892},127041.67758217672,128482.32397177148,130071.99459940036,131625.49286530272]
[]
[null,"E21.2 - omitted"]
[]
[null,"E21.3 - EXPENDITURE"]
[null,null,"EXPENDITURE"]
[null,null,{"$f":"CONCATENATE(\"$0's, real \",dms_DollarReal)","v":"$0's, real June 2021"}]
[null,null,{"$f":"CRCP_y4","v":"2019-20"},{"$f":"CRCP_y5","v":"2020-21"},{"$f":"FRCP_y1","v":"2021-22"},{"$f":"FRCP_y2","v":"2022-23"},{"$f":"FRCP_y3","v":"2023-24"},{"$f":"FRCP_y4","v":"2024-25"},{"$f":"FRCP_y5","v":"2025-26"}]
[null,{"$f":"IF(ISBLANK(B10),\"\",B10)","v":"Special Meter Read"},1188460.2435467923,1199704.1596092861,1206824.1985309562,1219217.4360000757,1233043.3018948985,1248299.3515912562,1263208.255571675]
[null,"Disconnection",505004.7250440878,507277.45572221663,510288.06062834972,515528.36084831692,521374.42716233752,527825.22589663591,534129.23911374167]
[null,"Reconnection",506377.64228480577,508656.55165983929,511675.34126440319,516929.88788279356,522791.84744460945,529260.1834659063,535581.3349155914]
[null,"Meter Removal",171919.7478099039,172693.45796675369,173718.3640924785,175502.32976168348,177492.51756893349,179688.57561864023,181834.66318718827]
[null,"Meter Reinstallation",3545.6721532055299,3558.067519066567,3579.184041018058,3615.9397489496814,3656.9443282614343,3702.1905287176814,3746.4071687724154]
[null,"Meter Gas and Installation Test",11617.229894994049,11722.315469792953,11791.885406454841,11912.979793051274,12048.072399310926,12197.139338798563,12342.814315723073]
[null,""]
[null,"Total",{"$f":"SUM(C25:C31)","v":2386925.2607337888},2403612.007946955,2417877.0339636607,2442706.9340348709,2470407.110798351,2500972.6664399547,2530842.7142726919]

{"sheet":"E25. Escalators","index":19,"n_rows":17,"n_cols":9,"rows_kept":17,"cut":false,"hidden":false,"merged":[[6,1,7,1],[6,2,6,8]]}
[null,{"$f":"INDEX(dms_Worksheet_List,MATCH(dms_Model,dms_Model_List))","v":"REGULATORY REPORTING STATEMENT"}]
[null,{"$f":"INDEX(dms_TradingNameFull_List,MATCH(dms_TradingName,dms_TradingName_List))","v":"Australian Gas Networks Limited (reporting data for SA)"}]
[null,{"$f":"dms_Header_Span","v":"2019-20 - 2025-26"}]
[null,"E25. ESCALATORS"]
[]
[null,"E25.1 - FORECAST CAPEX AND OPEX PRICE CHANGES"]
[null,null,"Price changes (% YoY real)"]
[null,null,{"$f":"CRCP_y4","v":"2019-20"},{"$f":"CRCP_y5","v":"2020-21"},{"$f":"FRCP_y1","v":"2021-22"},{"$f":"FRCP_y2","v":"2022-23"},{"$f":"FRCP_y3","v":"2023-24"},{"$f":"FRCP_y4","v":"2024-25"},{"$f":"FRCP_y5","v":"2025-26"}]
[null,"E25.1.1 - OPEX"]
[null,"Labour ",5.2769552515647966E-3,7.7515805496839452E-3,7.3189381268192006E-3,7.9880841938120267E-3,9.819259798970784E-3,9.1038409518769837E-3,8.0985492276420355E-3]
[null,"Materials",0,0,0,0,0,0,0]
[]
[]
[]
[]
[null,"E25.1.2 - CAPEX"]
[null,"Weighted real input cost escalation",null,null,4.4000000000000003E-3,4.7999999999999996E-3,5.8999999999999999E-3,5.4000000000000003E-3,4.7999999999999996E-3]

{"sheet":"N1. Demand","index":20,"n_rows":96,"n_cols":9,"rows_kept":96,"cut":false,"hidden":false,"merged":[[17,2,17,8],[18,2,18,8],[6,2,6,8],[7,2,7,8]]}
[null,{"$f":"INDEX(dms_Worksheet_List,MATCH(dms_Model,dms_Model_List))","v":"REGULATORY REPORTING STATEMENT"}]
[null,{"$f":"INDEX(dms_TradingNameFull_List,MATCH(dms_TradingName,dms_TradingName_List))","v":"Australian Gas Networks Limited (reporting data for SA)"}]
[null,{"$f":"dms_Header_Span","v":"2019-20 - 2025-26"}]
[null,"N1. DEMAND"]
[]
[null,"N1.1 - DEMAND - BY CUSTOMER TYPE"]
[null,null,"VOLUME"]
[null,null,"GJ"]
[null,null,{"$f":"CRCP_y4","v":"2019-20"},{"$f":"CRCP_y5","v":"2020-21"},{"$f":"FRCP_y1","v":"2021-22"},{"$f":"FRCP_y2","v":"2022-23"},{"$f":"FRCP_y3","v":"2023-24"},{"$f":"FRCP_y4","v":"2024-25"},{"$f":"FRCP_y5","v":"2025-26"}]
[null,"Residential",7254573.7726430176,7135021.1679674499,7063354.9040597994,6965197.9495364288,6922094.7084605135,6753763.4636724368,6661180.7991883755]
[null,"Commercial",3333179.9222986856,3342236.532934716,3361719.3630592166,3391167.8427428734,3412491.965113,3411364.4678160837,3423291.8618088453]
[null,"Industrial",10915304.236263737,10564890.307217939,10272242.917695809,9982565.98056495,9698534.3954074588,9420162.3885285184,9147402.2699099332]
[null,"Total",{"$f":"SUM(C10:C12)","v":21503057.93120544},21042148.008120105,20697317.184814826,20338931.772844255,20033121.068980969,19585290.32001704,19231874.930907153]
[]
[]
[]
[null,"N1.2 - DEMAND - BY TARIFF"]
[null,null,"VOLUMES"]
[null,null,"GJ"]
[null,"Tariff",{"$f":"CRCP_y4","v":"2019-20"},{"$f":"CRCP_y5","v":"2020-21"},{"$f":"FRCP_y1","v":"2021-22"},{"$f":"FRCP_y2","v":"2022-23"},{"$f":"FRCP_y3","v":"2023-24"},{"$f":"FRCP_y4","v":"2024-25"},{"$f":"FRCP_y5","v":"2025-26"}]
[null,"Tariff R - SA excl New Towns",7249464.2603765475,7129995.8585114032,7058380.0702989493,6953397.4540223842,6835464.0031470517,6711463.3271528836,6601318.0819494817]
[null,"Tariff R - New Towns",5109.5122664694927,5025.3094560464006,4974.8337608499378,11800.495514044584,86630.705313461818,42300.136519553096,59862.717238894082]
[null,"Tariff C - SA excl New Towns",3322565.6091946242,3331593.379593045,3351014.1678044433,3378637.6196016413,3388136.4249725579,3382555.6278506718,3384008.6799464994]
[null,"Tariff C - New Towns",10614.313104061674,10643.153341670599,10705.195254773233,12530.223141232182,24355.540140442237,28808.839965412019,39283.181862346115]
[null,"Northern",7903282.5294526117,7649563.5103982715,7437670.6532833865,7224699.9246576894,7015656.9389969213,6810587.9493117267,6609550.5974183911]
[null,"Central",1561599.0615063508,1511467.0586878951,1469599.4314611836,1411512.3924447626,1355124.9422516315,1300441.2604466463,1247385.9492314938]
[null,"Southern",346371.82190253609,335252.2499330822,325965.76489430183,314543.44781777298,303296.16292870679,292219.37722500617,281308.62945745548]
[null,"Peterborough"]
[null,"Port Pirie"]
[null,"Riverland"]
[null,"South East"]
[null,"Whyalla"]
[]
[]
[]
[]
[]
[]
[]
[]
[]
[]
[]
[]
[]
[]
[]
[]
[]
[]
[]
[]
[]
[]
[]
[]
[]
[]
[]
[]
[]
[]
[]
[]
[]
[]
[]
[]
[]
[]
[]
[]
[]
[]
[]
[]
[]
[]
[]
[]
[]
[]
[]
[]
[]
[]
[]
[]
[]
[]
[]
[]
[]
[]
[]
[null,"Total",{"$f":"SUM(C21:C95)","v":20399007.107803199},19973540.519921415,19658310.116757892,19307121.557199527,19008664.717750773,18568376.5184719,18222717.837104563]

{"sheet":"N2. Network characteristics","index":21,"n_rows":1257,"n_cols":10,"rows_kept":1257,"cut":false,"hidden":false,"merged":[[66,3,66,9],[67,3,67,9],[6,3,6,9],[7,3,7,9],[56,3,56,9],[57,3,57,9]]}
[null,{"$f":"INDEX(dms_Worksheet_List,MATCH(dms_Model,dms_Model_List))","v":"REGULATORY REPORTING STATEMENT"}]
[null,{"$f":"INDEX(dms_TradingNameFull_List,MATCH(dms_TradingName,dms_TradingName_List))","v":"Australian Gas Networks Limited (reporting data for SA)"}]
[null,{"$f":"dms_Header_Span","v":"2019-20 - 2025-26"}]
[null,"N2. NETWORK CHARACTERISTICS"]
[]
[null,"N2.1 - NETWORK LENGTH - BY PRESSURE AND ASSET TYPE"]
[null,null,null,"LENGTH"]
[null,null,null,"KM"]
[null,null,null,{"$f":"CRCP_y4","v":"2019-20"},{"$f":"CRCP_y5","v":"2020-21"},{"$f":"FRCP_y1","v":"2021-22"},{"$f":"FRCP_y2","v":"2022-23"},{"$f":"FRCP_y3","v":"2023-24"},{"$f":"FRCP_y4","v":"2024-25"},{"$f":"FRCP_y5","v":"2025-26"}]
[null,"N2.1.1 - LOW PRESSURE"]
[null,null,"Cast Iron",305.928,300.10484500000024,239.93838267475331,179.77192034950659,116.35671765316613,54.145672851562502,0]
[null,null,"PVC",0,0,0,0,0,0,0]
[null,null,"Polyamide",0,0,0,0,0,0,0]
[null,null,"High density polyethylene (80)",0,0,0,0,0,0,0]
[null,null,"High density polyethylene (100)",21.728999999999999,30.268214038898211,28.53676720647773,26.686534412955456,24.728682388663973,22.782146153846142,20.844999999999999]
[null,null,"High density polyethylene (250)",149.68899999999999,117.99799950000003,111.2176578947368,84.03331578947369,55.344623684210518,27.078299999999999,0]
[null,null,"High density polyethylene (575)",48.143999999999998,36.37715046755455,34.025894736842098,25.703789473684203,16.922084210526315,8.2728000000000019,0]
[null,null,"Medium density polyethylene",58.155999999999999,44.315059753687081,42.36122267206477,32.10644534412954,21.266760323886643,10.528338461538459,0]
[null,null,"Other polyethylene",0,0,0,0,0,0,0]
[null,null,"Unprotected steel",35.474499999999999,32.106106206613752,27.455544534412962,20.770089068825914,13.710222064777327,6.7394076923076947,0]
[null,null,"Protected steel",15.486499999999999,17.000781200000006,13.501720647773283,11.959441295546554,10.335438866396766,7.5520153846153857,6.0990000000000002]
[null,null,"Other",2.5999999999999999E-2,0,0,0,0,0,0]
[null,"N2.1.2 - MEDIUM PRESSURE"]
[null,null,"Cast Iron",15.7295,7,3.5,0,0,0,0]
[null,null,"PVC",0,0,0,0,0,0,0]
[null,null,"Polyamide",0,0,0,0,0,0,0]
[null,null,"High density polyethylene (80)",0,0,0,0,0,0,0]
[null,null,"High density polyethylene (100)",470.06256182071428,544.11641642722827,568.14436641727218,592.60613012715112,616.88403429042,646.48018017989125,676.01511171520417]
[null,null,"High density polyethylene (250)",65.504000000000005,13.999999999999998,6.9999999999999991,0,0,0,0]
[null,null,"High density polyethylene (575)",490.91,470.20721396997425,460.21069729685689,450.21418062373959,430.22114727750494,405.22985559471186,380.23856391191856]
[null,null,"Medium density polyethylene",1386.45,1386.9919914890545,1386.9919914890545,1386.9919914890545,1386.9919914890545,1386.9919914890545,1386.9919914890545]
[null,null,"Other polyethylene",0,0,0,0,0,0,0]
[null,null,"Unprotected steel",4.1989999999999998,0.99999999999999978,0.49999999999999989,0,0,0,0]
[null,null,"Protected steel",480.31099999999998,480.00185572681039,480.00185572681039,480.00185572681039,480.00185572681039,480.00185572681039,480.00185572681039]
[null,null,"Other",1.0860000000000001,1.0076813996316758,0.93556482470688374,0.86915913877245277,0.80801209831717569,0.7517072728519113,0.69986120888757941]
[null,"N2.1.3 - HIGH PRESSURE"]
[null,null,"Cast Iron",0.11799999999999999,0,0,0,0,0,0]
[null,null,"PVC",0,0,0,0,0,0,0]
[null,null,"Polyamide",0,0,0,0,0,0,0]
[null,null,"High density polyethylene (80)",0,0,0,0,0,0,0]
[null,null,"High density polyethylene (100)",856.61913817928587,1094.5816219323933,1267.8307207801895,1466.3661269874765,1677.6832504794345,1882.5796019797062,2072.0463506055194]
[null,null,"High density polyethylene (250)",0.155,0,0,0,0,0,0]
[null,null,"High density polyethylene (575)",703.31479999999999,603.27384005695274,563.40382413805662,523.53380821916051,483.6637923002645,443.7937763813685,405.91726125841717]
[null,null,"Medium density polyethylene",1926.5409999999999,1926.0018867903673,1925.4629249713594,1924.9241145004644,1924.3854553351794,1923.8469474330191,1923.3085907515044]
[null,null,"Other polyethylene",0,0,0,0,0,0,0]
[null,null,"Unprotected steel",0.16900000000000001,0.16900000000000001,0.16900000000000001,0.16900000000000001,0.16900000000000001,0.16900000000000001,0.16900000000000001]
[null,null,"Protected steel",1140.162,1140.0038296189489,1140.5038296189489,1140.5038296189489,1141.0038296189489,1142.2038296189489,1142.2038296189489]
[null,null,"Other",0.19500000000000001,0.19500000000000001,0.19500000000000001,0.19500000000000001,0.19500000000000001,0.19500000000000001,0.19500000000000001]
[null,"N2.1.4 - TRANSMISSION"]
[null,null,"Protected steel",214,254,254,254,254,254,254]
[null,null,"Other",0,0,0,0,0,0,0]
[null,null,"Total",{"$f":"SUM(D11:D51)","v":8390.1589999999997},8500.7204935781137,8555.8869656303159,8601.4067321657003,8654.6718978075623,8703.3424262202334,8748.731416286264]
[]
[]
[]
[null,"N2.2 - CITY GATES / REGULATORS"]
[null,null,null,"VOLUMES"]
[null,null,null," 0's"]
[null,null,null,{"$f":"CRCP_y4","v":"2019-20"},{"$f":"CRCP_y5","v":"2020-21"},{"$f":"FRCP_y1","v":"2021-22"},{"$f":"FRCP_y2","v":"2022-23"},{"$f":"FRCP_y3","v":"2023-24"},{"$f":"FRCP_y4","v":"2024-25"},{"$f":"FRCP_y5","v":"2025-26"}]
[null,null,"City Gate",0,1,1,1,1,1,1]
[null,null,"Field Regulator",251,252,230,208,186,164,146]
[null,null,"District Regulator",0,0,0,0,0,0,0]
[null,null,"Total",{"$f":"SUM(D60:D62)","v":251},{"$f":"SUM(E60:E62)","v":253},{"$f":"SUM(F60:F62)","v":231},{"$f":"SUM(G60:G62)","v":209},187,165,147]
[]
[]
[null,"N2.5 - NETWORK LENGTH - BY POST CODE"]
[null,null,null,"VOLUMES"]
[null,null,null,"Metres, 0's"]
[null,"Post Code\n","Asset Type\n(drop down)",{"$f":"CRCP_y4","v":"2019-20"},{"$f":"CRCP_y5","v":"2020-21"},{"$f":"FRCP_y1","v":"2021-22"},{"$f":"FRCP_y2","v":"2022-23"},{"$f":"FRCP_y3","v":"2023-24"},{"$f":"FRCP_y4","v":"2024-25"},{"$f":"FRCP_y5","v":"2025-26"}]
[null,5000,"Cast Iron",6523.5,0,0,0,0,0,0]
[null,5000,"High density polyethylene (100)",56708.5,64017,64567,64567,64567,64567,64567]
[null,5000,"High density polyethylene (250)",84,0,0,0,0,0,0]
[null,5000,"High density polyethylene (575)",2054,1973,1973,1973,1973,1973,1973]
[null,5000,"Medium density polyethylene",23401,23117,23117,23117,23117,23117,23117]
[null,5000,"Other",134,108,108,108,108,108,108]
[null,5000,"Protected steel",27639.5,27846,27846,27846,27846,27846,27846]
[null,5000,"PVC",0,0,0,0,0,0,0]
[null,5000,"Unprotected steel",617.5,101,101,101,101,101,101]
[null,5006,"Cast Iron",22879,22879,16858.21052631579,10837.421052631578,4816.6315789473683,0,0]
[null,5006,"High density polyethylene (100)",377.92596050334816,490.20950133500389,10513.007330456632,20545.556082670188,30585.289086458317,38643.530214310878,38745.658572022185]
[null,5006,"High density polyethylene (250)",8025,8025,5913.1578947368416,3801.3157894736842,1689.4736842105262,0,0]
[null,5006,"High density polyethylene (575)",2748,2748,2085.894736842105,1423.7894736842104,761.68421052631572,232,232]
[null,5006,"Medium density polyethylene",5714,5714,5207.6842105263158,4701.3684210526317,4195.0526315789475,3790,3790]
[null,5006,"Other",0,0,0,0,0,0,0]
[null,5006,"Protected steel",10021,10021,9824.105263157895,9627.21052631579,9429.3157894736833,9272,9272]
[null,5006,"PVC",0,0,0,0,0,0,0]
[null,5006,"Unprotected steel",1692,1692,1246.7368421052631,801.47368421052624,356.21052631578948,0,0]
[null,5007,"Cast Iron",445,259.54911199565191,158.39613802907596,57.2431640625,37.795166015625,18.34716796875,0]
[null,5007,"High density polyethylene (100)",11016.506252318772,11718.465790326543,12229.120451053264,12735.681389472935,13334.527614009001,14037.987556258659,14733.31682635904]
[null,5007,"High density polyethylene (250)",187,66.380151878193175,33.190075939096587,0,0,0,0]
[null,5007,"High density polyethylene (575)",12132,11632.491424468571,11294.326211508916,10956.160998549267,10413.457275475745,9768.4842973452869,9130.1926543571171]
[null,5007,"Medium density polyethylene",25477,25475.586246243489,25470.812623079251,25466.04034041601,25461.269397877335,25456.4997950869,25451.731531668484]
[null,5007,"Other",0,0,0,0,0,0,0]
[null,5007,"Protected steel",7252,7257.0982078691459,7244.8260078691455,7239.8260078691455,7234.5260078691454,7229.2260078691452,7223.8260078691455]
[null,5007,"PVC",0,0,0,0,0,0,0]
[null,5007,"Unprotected steel",0,0,0,0,0,0,0]
[null,5008,"Cast Iron",5139,6243.4212483215033,4991.2723624420014,3739.1234765624995,2468.7802441406247,1198.43701171875,0]
[null,5008,"High density polyethylene (100)",15350.448217663408,16898.069033007112,19635.74471374062,23849.686156794636,28297.404452137143,32981.129050428914,37626.156138624297]
[null,5008,"High density polyethylene (250)",4991,3210.1735113908644,2751.3354095415862,1827.6923076923076,1222.2692307692307,616.84615384615381,0]
[null,5008,"High density polyethylene (575)",26036,24483.632003935767,23839.721788319497,22560.232088430064,20797.238634915102,18816.954843048916,16821.839579265154]
[null,5008,"Medium density polyethylene",23044,22761.997367284115,22711.166510888979,22370.657622695369,22009.737284940511,21648.817036060977,21281.09302987796]
[null,5008,"Other",0,0,0,0,0,0,0]
[null,5008,"Protected steel",8060,8056.4091053102538,8056.4091053102538,8056.4091053102538,8056.4091053102538,8056.4091053102538,8056.4091053102538]
[null,5008,"PVC",0,0,0,0,0,0,0]
[null,5008,"Unprotected steel",1193,962.90573147574048,810.32900834105658,596.92307692307691,399.19230769230762,201.46153846153845,0]
[null,5009,"Cast Iron",1321,1654.5525,1331.39771484375,1008.2429296875,665.698857421875,323.15478515625,0]
[null,5009,"High density polyethylene (100)",6153.4044514320121,6649.5473328873786,7657.5794674483877,8693.6791337805516,9784.5365476127026,10907.765298434068,11987.242901038962]
[null,5009,"High density polyethylene (250)",1649,113.66183335868863,79.601512833190469,36.307692307692307,24.280769230769231,12.253846153846155,0]
[null,5009,"High density polyethylene (575)",10947.5,10532.704424051051,9961.6136207252475,9390.5228173994456,8759.2987920981286,8098.0081558090533,7462.2653985874913]
[null,5009,"Medium density polyethylene",15523,15496.881824025546,15489.82174345692,15456.561967148191,15421.456736373773,15386.352204783423,15350.632987565416]
[null,5009,"Other",0,0,0,0,0,0,0]
[null,5009,"Protected steel",5777,5794.9365246294083,5762.8400015524858,5749.7630784755629,5735.9015400140242,5722.0400015524856,5707.9169246294086]
[null,5009,"PVC",0,0,0,0,0,0,0]
[null,5009,"Unprotected steel",181,138.31474222951383,115.26784059314178,83.692307692307679,55.969230769230762,28.246153846153845,0]
[null,5010,"Cast Iron",810,1003.2563853187544,805.3985832843772,607.54078125000001,401.1326953125,194.724609375,0]
[null,5010,"High density polyethylene (100)",7164.9395659868997,12293.49989633423,12711.609322532211,13236.757128925119,13858.121347834609,14525.484376051705,15180.839265549657]
[null,5010,"High density polyethylene (250)",4527,354.27000000000004,339.23076923076923,258.46153846153845,172.84615384615384,87.230769230769226,0]
[null,5010,"High density polyethylene (575)",3575,3425.0112770796777,3346.0488588803164,3267.0864406809555,3118.1723001699693,2934.2822985031703,2750.8428316307582]
[null,5010,"Medium density polyethylene",13930,13907.066112908615,13901.626797048422,13869.823569824999,13836.162886652011,13802.502439770778,13768.222998345711]
[null,5010,"Other",0,0,0,0,0,0,0]
[null,5010,"Protected steel",11795,11789.728099693753,11789.728099693753,11789.728099693753,11789.728099693753,11789.728099693753,11789.728099693753]
[null,5010,"PVC",0,0,0,0,0,0,0]
[null,5010,"Unprotected steel",0,0,0,0,0,0,0]
[null,5011,"Cast Iron",2651,3203.895,2578.1342578125,1952.373515625,1289.06712890625,625.7607421875,0]
[null,5011,"High density polyethylene (100)",9103.5998820087698,10547.804094634941,12390.860781273899,15731.721469026437,19362.597587827622,23136.172229548523,26896.888978544721]
[null,5011,"High density polyethylene (250)",5227,4167.6426926621789,3910.4862886387818,2912.6153846153848,1947.8115384615385,983.00769230769265,0]
[null,5011,"High density polyethylene (575)",10851,10217.625105014398,9946.9706420830644,9429.4295257088306,8711.629343283008,7903.2015509083176,7089.4168995112959]
[null,5011,"Medium density polyethylene",48145,47704.058438031105,47622.271195605368,47088.855490314672,46523.61755927388,45958.380479167041,45382.536557447514]
[null,5011,"Other",102,102,102,102,102,102,102]
[null,5011,"Protected steel",5311,5325.2096644678368,5297.8332183139901,5286.6793721601443,5274.8562952370676,5263.0332183139908,5250.9870644678367]
[null,5011,"PVC",0,0,0,0,0,0,0]
[null,5011,"Unprotected steel",73,64.244178024302485,54.838276181649675,41.230769230769226,27.573076923076918,13.915384615384617,0]
[null,5012,"Cast Iron",0,0,0,0,0,0,0]
[null,5012,"High density polyethylene (100)",30025.343466995906,32011.075412818122,32538.643338476035,33085.1894297076,33799.965069434242,34614.959416112717,35418.114513711647]
[null,5012,"High density polyethylene (250)",104,36.917303718353423,18.458651859176712,0,0,0,0]
[null,5012,"High density polyethylene (575)",11373,10910.177401238727,10552.949768385104,10195.722135531483,9665.5707488329608,9048.9574852119913,8441.5594155414547]
[null,5012,"Medium density polyethylene",12541,12537.715055213133,12534.371376528172,12530.701115816661,12527.008700837818,12523.317208255623,12519.618945503365]
[null,5012,"Other",5,5,5,5,5,5,5]
[null,5012,"Protected steel",5435,5433.791597016304,5433.791597016304,5433.791597016304,5433.791597016304,5433.791597016304,5433.791597016304]
[null,5012,"PVC",0,0,0,0,0,0,0]
[null,5012,"Unprotected steel",16,3.8554216867469875,1.9277108433734937,0,0,0,0]
[null,5013,"Cast Iron",1431,641.31900041562767,321.04112130156381,0.76324218749999995,0.50393554687499997,0.24462890625,0]
[null,5013,"High density polyethylene (100)",28394,29996.816261369637,30322.512648967942,30648.209036566252,30659.305360175364,30673.110938026599,30686.901838143458]
[null,5013,"High density polyethylene (250)",0,0,0,0,0,0,0]
[null,5013,"High density polyethylene (575)",266,254.7782689291316,249.35976044488805,243.94125196064451,233.10423499215742,219.55796378154855,206.01169257093966]
[null,5013,"Medium density polyethylene",35041,35031.414734932128,35021.683045506797,35011.954088877697,35002.227864277418,34992.504370938768,34982.783608094767]
[null,5013,"Other",0,0,0,0,0,0,0]
[null,5013,"Protected steel",19903,19899.055120134086,19899.055120134086,19899.055120134086,19899.055120134086,19899.055120134086,19899.055120134086]
[null,5013,"PVC",0,0,0,0,0,0,0]
[null,5013,"Unprotected steel",0,0,0,0,0,0,0]
[null,5014,"Cast Iron",10279,12282.040328185945,9782.8302617492227,7283.6201953125001,4809.056923828125,2334.49365234375,0]
[null,5014,"High density polyethylene (100)",3610.8967455099473,5876.3176091522291,9475.0634039225097,13536.887977024915,18303.246402720517,23435.294852651743,28439.852615067219]
[null,5014,"High density polyethylene (250)",4290,1998.4801852140622,1880.3463810685696,1404.9230769230769,939.54230769230776,474.16153846153861,0]
[null,5014,"High density polyethylene (575)",35566,34014.09139285679,33279.066676799601,32472.389367939915,30945.442442528238,29061.118401148258,27174.955898229815]
[null,5014,"Medium density polyethylene",16223,16200.14490436963,16194.124549215503,16162.723008798865,16129.533454418888,16096.344347488348,16062.559534035445]
[null,5014,"Other",0,0,0,0,0,0,0]
[null,5014,"Protected steel",9226,9261.8789905709036,9192.0218521093666,9163.5603136478276,9133.3910828785956,9103.2218521093655,9072.4833905709038]
[null,5014,"PVC",0,0,0,0,0,0,0]
[null,5014,"Unprotected steel",620,581.11947511789344,500.76923076923077,381.53846153846155,255.15384615384613,128.76923076923077,0]
[null,5015,"Cast Iron",11248,14043.850442323677,11293.41012350559,8542.9698046875001,5640.5505761718741,2738.13134765625,0]
[null,5015,"High density polyethylene (100)",9903.6371131073665,11073.264548876186,15008.996615271886,20844.450675684373,27079.529766640215,33361.700454309677,39532.757579222423]
[null,5015,"High density polyethylene (250)",7602,6412.2870000000003,6140.0769230769229,4678.1538461538457,3128.5153846153844,1578.876923076923,0]
[null,5015,"High density polyethylene (575)",6155,5571.3346507829183,5376.40312341764,4729.9703209035943,3986.2467510077795,3211.2547204980024,2424.9113302063779]
[null,5015,"Medium density polyethylene",8099,7825.4916083013104,7777.2827760433875,7453.3148172880447,7109.9161235064767,6766.5174639198467,6416.6419154416308]
[null,5015,"Other",0,0,0,0,0,0,0]
[null,5015,"Protected steel",5316,5467.2360528465188,5208.5758374619036,5103.1912220772883,4991.4835297695954,4879.7758374619034,4765.9604528465188]
[null,5015,"PVC",0,0,0,0,0,0,0]
[null,5015,"Unprotected steel",2357,1840.1387160192867,1539.5092678405931,1124.3076923076924,751.88076923076915,379.45384615384614,0]
[null,5016,"Cast Iron",14649,18347.872499999998,14764.303652343748,11180.734804687498,7382.1518261718738,3583.56884765625,0]
[null,5016,"High density polyethylene (100)",28488.938662806609,30349.57286822614,34770.600378839226,39839.334127749375,45216.937921228979,50613.488151906764,55816.299943898412]
[null,5016,"High density polyethylene (250)",1470,1239.9449999999999,1187.3076923076924,904.61538461538453,604.96153846153845,305.30769230769238,0]
[null,5016,"High density polyethylene (575)",1067,909.78217379308524,864.01807234423745,661.90741379706151,447.76213986527017,233.61686593347886,15.536740313661685]
[null,5016,"Medium density polyethylene",4758,4704.0273678152844,4693.5878061154135,4630.4202983920068,4563.5377555070099,4496.6555619776764,4428.5352561674399]
[null,5016,"Other",0,0,0,0,0,0,0]
[null,5016,"Protected steel",2772,2809.6646637498884,2745.4716175960421,2719.3177714421959,2691.594694519119,2663.8716175960421,2635.6254637498882]
[null,5016,"PVC",0,0,0,0,0,0,0]
[null,5016,"Unprotected steel",3523,3302.0708239360301,2845.5,2168,1449.85,731.70000000000027,0]
[null,5017,"Cast Iron",16581,20767.702499999999,16711.510605468749,12655.318710937499,8355.7553027343747,4056.19189453125,0]
[null,5017,"High density polyethylene (100)",9755.1240580468202,562.97171589014204,5639.0863621054132,11271.649593610646,17246.746957609586,23234.273427408527,29004.843179217642]
[null,5017,"High density polyethylene (250)",1263,1065.3405,1020.1153846153846,777.23076923076928,519.77307692307693,262.31538461538469,0]
[null,5017,"High density polyethylene (575)",1162,996.97092345413716,949.56724560196676,740.7203827115419,517.71511846915382,293.84411508924563,65.830804017029593]
[null,5017,"Medium density polyethylene",2317,2183.2477227115169,2159.8038060175668,2002.0828713650349,1834.9004062898207,1667.7179492512048,1497.3816540930845]
[null,5017,"Other",0,0,0,0,0,0,0]
[null,5017,"Protected steel",2284,2463.6311592133975,2158.7141899826283,2034.4834207518593,1902.7988053672439,1771.1141899826284,1636.9449592133976]
[null,5017,"PVC",0,0,0,0,0,0,0]
[null,5017,"Unprotected steel",3637,3408.9218241996427,2937.5769230769229,2238.1538461538462,1496.7653846153844,755.37692307692305,0]
[null,5018,"Cast Iron",639,800.34749999999997,644.02962890624997,487.71175781249997,322.01481445312498,156.31787109375,0]
[null,5018,"High density polyethylene (100)",19782.5,21749.152471435144,22310.27205383261,22940.60732020242,23486.323693098468,24101.360307994062,24708.956312162496]
[null,5018,"High density polyethylene (250)",1744.5,815.15116870776751,562.33844973849909,246.76923076923077,165.02692307692308,83.284615384615392,0]
[null,5018,"High density polyethylene (575)",6806,6518.8755576378553,6380.2350736387516,6241.5945896396479,5964.3136216414405,5617.7124116436817,5271.1112016459219]
[null,5018,"Medium density polyethylene",1655,1655.6565328717227,1655.6565328717227,1655.6565328717227,1655.6565328717227,1655.6565328717227,1655.6565328717227]
[null,5018,"Other",0,0,0,0,0,0,0]
[null,5018,"Protected steel",1704,1702.8966648692203,1702.8966648692203,1702.8966648692203,1702.8966648692203,1702.8966648692203,1702.8966648692203]
[null,5018,"PVC",0,0,0,0,0,0,0]
[null,5018,"Unprotected steel",120,100.63720156981873,85.240500463392024,63.38461538461538,42.388461538461534,21.392307692307696,0]
[null,5019,"Cast Iron",21390,26065.759155156979,20851.914167422241,15638.0691796875,10325.135419921875,5012.20166015625,0]
[null,5019,"High density polyethylene (100)",9050.8932453061989,9977.907282365717,15742.653635835661,22179.14122168313,28802.447027804665,35449.60972231505,41817.555176713809]
[null,5019,"High density polyethylene (250)",2227,1815.4546555737268,1717.4342893253249,1291.0769230769229,863.40769230769229,435.73846153846171,0]
[null,5019,"High density polyethylene (575)",3172,2908.3877615941929,2817.2190382695871,2545.419824721122,2219.6483207011152,1873.8425945222607,1523.4022529587905]
[null,5019,"Medium density polyethylene",11494,11353.45176679131,11328.208950917811,11158.208950917811,10978.008950917811,10797.808950917812,10614.208950917811]
[null,5019,"Other",0,0,0,0,0,0,0]
[null,5019,"Protected steel",3247,3316.3861885497108,3196.0242270112494,3146.9857654727875,3095.0049962420185,3043.0242270112494,2990.0626885497109]
[null,5019,"PVC",0,0,0,0,0,0,0]
[null,5019,"Unprotected steel",1350,1259.7701876308138,1084.8869323447636,825.84615384615381,552.28461538461534,278.72307692307709,0]
[null,5020,"Cast Iron",0,0,0,0,0,0,0]
[null,5020,"High density polyethylene (100)",16531,18174.408669546032,18355.523436182233,18536.638202818434,18568.741847070945,18608.871402386583,18649.000957702221]
[null,5020,"High density polyethylene (250)",930,330.12588901989119,165.06294450994559,0,0,0,0]
[null,5020,"High density polyethylene (575)",788,754.75667637652521,738.70485425026993,722.65303212401454,690.54938787150388,650.41983255586558,610.29027724022728]
[null,5020,"Medium density polyethylene",1171,1171.4645317176962,1171.4645317176962,1171.4645317176962,1171.4645317176962,1171.4645317176962,1171.4645317176962]
[null,5020,"Other",0,0,0,0,0,0,0]
[null,5020,"Protected steel",47,46.969567634303608,46.969567634303608,46.969567634303608,46.969567634303608,46.969567634303608,46.969567634303608]
[null,5020,"PVC",0,0,0,0,0,0,0]
[null,5020,"Unprotected steel",0,0,0,0,0,0,0]
[null,5021,"Cast Iron",0,0,0,0,0,0,0]
[null,5021,"High density polyethylene (100)",22095.370127540005,24674.340085333853,26262.979230205063,27881.237477374296,28593.461273594607,29432.449681143633,30267.258612260677]
[null,5021,"High density polyethylene (250)",6477.5,2275.3838157177447,1137.6919078588724,0,0,0,0]
[null,5021,"High density polyethylene (575)",10301,9866.4321362367846,9656.5973396345562,9446.7625430323278,9027.0929498278711,8502.5059583222992,7977.9189668167282]
[null,5021,"Medium density polyethylene",355,355.14082729272599,355.14082729272599,355.14082729272599,355.14082729272599,355.14082729272599,355.14082729272599]
[null,5021,"Other",0,0,0,0,0,0,0]
[null,5021,"Protected steel",1804,1802.8319151549726,1802.8319151549726,1802.8319151549726,1802.8319151549726,1802.8319151549726,1802.8319151549726]
[null,5021,"PVC",0,0,0,0,0,0,0]
[null,5021,"Unprotected steel",21,5.0602409638554207,2.5301204819277103,0,0,0,0]
[null,5022,"Cast Iron",8492,10636.23,8558.8413281249996,6481.4526562499996,4279.4206640624998,2077.388671875,0]
[null,5022,"High density polyethylene (100)",13912.50774849622,15505.346082616334,18459.050218434597,21807.730599097755,25192.804521089718,28656.46983195416,32006.127387174234]
[null,5022,"High density polyethylene (250)",1845,811.25546317777867,529.12927005042775,196.92307692307691,131.69230769230768,66.461538461538481,0]
[null,5022,"High density polyethylene (575)",6459,6156.7854062342176,6019.1313432040643,5840.1046533674507,5531.9435813865293,5160.8076260257631,4788.6101322034583]
[null,5022,"Medium density polyethylene",52423,52285.227930180008,52257.643586137245,52071.874355368018,51874.958970752632,51678.043586137246,51477.412816906479]
[null,5022,"Other",0,0,0,0,0,0,0]
[null,5022,"Protected steel",6331,6326.9006955909817,6326.9006955909817,6326.9006955909817,6326.9006955909817,6326.9006955909817,6326.9006955909817]
[null,5022,"PVC",0,0,0,0,0,0,0]
[null,5022,"Unprotected steel",2075,1878.7247287383329,1610.6765523632994,1218.4615384615386,814.84615384615381,411.23076923076928,0]
[null,5023,"Cast Iron",31213,39083.013885318753,31447.703446565625,23812.393007812498,15722.285126953124,7632.17724609375,0]
[null,5023,"High density polyethylene (100)",9684.9298560385359,10844.08568728178,20523.665460276228,32478.725976193644,45239.764256526665,58207.341059324921,70780.01832082191]
[null,5023,"High density polyethylene (250)",6238,4601.2659483385951,4186.3470895539122,3006.7692307692305,2010.7769230769231,1014.7846153846158,0]
[null,5023,"High density polyethylene (575)",20926,19700.450186198635,19204.060341626144,18230.686082205259,16859.145255671177,15306.878837888189,13742.373958566741]
[null,5023,"Medium density polyethylene",23193,22398.854559310115,22259.105304915429,21317.951458761585,20320.328381838506,19322.705304915431,18306.259151069276]
[null,5023,"Other",0,0,0,0,0,0,0]
[null,5023,"Protected steel",5242,5318.7852041618871,5183.791004161887,5128.791004161887,5070.4910041618868,5012.1910041618867,4952.791004161887]
[null,5023,"PVC",0,0,0,0,0,0,0]
[null,5023,"Unprotected steel",4438,4149.9421357848723,3574.9175162187207,2722.4615384615381,1820.6461538461535,918.83076923076942,0]
[null,5024,"Cast Iron",12055,12827.556677217213,10020.097674546107,7212.638671875,4762.19091796875,2311.7431640625,0]
[null,5024,"High density polyethylene (100)",25567.842916572903,15080.321583897949,18900.339773431078,24739.632826186698,30399.853025369088,36077.32494552045,41670.124582664001]
[null,5024,"High density polyethylene (250)",7046,5908.6156592692605,5646.2554257884758,4292.3076923076924,2870.4807692307695,1448.6538461538466,0]
[null,5024,"High density polyethylene (575)",2818,2428.0013569908647,2315.1317937018066,1824.9618620364377,1299.6181525518541,771.20870800381715,233.11849422501066]
[null,5024,"Medium density polyethylene",34852,34350.833245075984,34256.259884419778,33668.63024759289,33046.260715597396,32423.893595448142,31789.948117237065]
[null,5024,"Other",0,0,0,0,0,0,0]
[null,5024,"Protected steel",417,501.12014986424663,359.04583447963125,301.16121909501589,239.80352678732356,178.44583447963129,115.93044986424665]
[null,5024,"PVC",0,0,0,0,0,0,0]
[null,5024,"Unprotected steel",1950,1827.7144781933746,1575,1200,802.5,405,0]
[null,5025,"Cast Iron",28147,35247.678291610711,28362.275102836604,21476.871914062496,14180.242353515623,6883.61279296875,0]
[null,5025,"High density polyethylene (100)",610.16097896228541,680.66357684001673,8264.0649069959254,17596.661915490571,27602.993329516299,37674.687019210833,47377.923271376283]
[null,5025,"High density polyethylene (250)",7327,5598.3095000000003,5360.6538461538457,4084.3076923076924,2731.3807692307691,1378.4538461538468,0]
[null,5025,"High density polyethylene (575)",7899,7359.277736463413,7156.1284357308159,6665.6192596794335,6031.1355229612818,5335.7241212943627,4632.9396427043648]
[null,5025,"Medium density polyethylene",5617,5272.8735017303734,5212.6219842042619,4806.8527534350314,4376.7373688196467,3946.6219842042619,3508.3912149734929]
[null,5025,"Other",0,0,0,0,0,0,0]
[null,5025,"Protected steel",160,159.89640045720378,159.89640045720378,159.89640045720378,159.89640045720378,159.89640045720378,159.89640045720378]
[null,5025,"PVC",0,0,0,0,0,0,0]
[null,5025,"Unprotected steel",1142,1070.38458158812,922.38461538461536,702.76923076923072,469.97692307692307,237.18461538461543,0]
[null,5031,"Cast Iron",17264,42.521900377261979,21.260950188630989,0,0,0,0]
[null,5031,"High density polyethylene (100)",24632.529963082125,51905.250200387556,53146.523293974089,55810.461839779062,58742.09016845985,61747.841225238946,64801.279458155688]
[null,5031,"High density polyethylene (250)",6027,3363.8780000000002,3221.0769230769229,2454.1538461538457,1641.2153846153847,828.27692307692314,0]
[null,5031,"High density polyethylene (575)",12677,9987.391127051369,9673.8063917402997,8736.7841387188309,7614.5588634451251,6423.7263078145297,5216.8975983377804]
[null,5031,"Medium density polyethylene",6483,6078.8735390339625,6008.061042905776,5531.7974600710704,5026.9646772827491,4522.131925301388,4007.77612719526]
[null,5031,"Other",12,11.524861878453038,11.087349795997273,10.684484158376863,10.31352132447225,9.9719349212451647,9.6573986383472974]
[null,5031,"Protected steel",9707,10002.611176344344,9497.5629455751114,9291.7937148058809,9073.6783301904979,8855.5629455751114,8633.3321763443437]
[null,5031,"PVC",0,0,0,0,0,0,0]
[null,5031,"Unprotected steel",992,921.43525274173055,792.98424467099164,603.07692307692309,403.30769230769226,203.53846153846155,0]
[null,5032,"Cast Iron",32398,35837.193160528164,28819.603123232831,21802.013085937499,14394.918896484374,6987.82470703125,0]
[null,5032,"High density polyethylene (100)",4928.2615239114702,9416.4993518983156,18015.735964033636,29378.508318763983,41411.567308661688,53488.504534843749,65222.812965185891]
[null,5032,"High density polyethylene (250)",9096,7594.3118518743904,7245.9363874756564,5499.0769230769229,3677.5076923076922,1855.9384615384615,0]
[null,5032,"High density polyethylene (575)",4750,4291.6372436385118,4142.1006552979316,3633.5515988360703,3049.3957936046554,2441.2539216807718,1823.9005112953491]
[null,5032,"Medium density polyethylene",14435,13607.754895617478,13461.84660282689,12489.152571958848,11458.20133529152,10427.250584995982,9376.8810901664183]
[null,5032,"Other",0,0,0,0,0,0,0]
[null,5032,"Protected steel",2249,2355.7579128235666,2173.5629435927972,2099.3321743620281,2020.6475589774127,1941.9629435927973,1861.7937128235665]
[null,5032,"PVC",0,0,0,0,0,0,0]
[null,5032,"Unprotected steel",4163,3892.8838555063821,3353.4893419833179,2553.8461538461538,1707.8846153846152,861.92307692307713,0]
[null,5033,"Cast Iron",6610,8224.2917286910924,6608.711059658046,4993.1303906249996,3296.7463476562498,1600.3623046875,0]
[null,5033,"High density polyethylene (100)",3012.1317639688846,3378.7253500039988,5880.2282226370735,9182.7141020070303,12699.874638526593,16354.590114998779,19935.209581361145]
[null,5033,"High density polyethylene (250)",3622,2491.8866075698224,2198.8348614772185,1519.3846153846152,1016.0884615384614,512.79230769230776,0]
[null,5033,"High density polyethylene (575)",13845,13165.594785227166,12864.065193682687,12429.873374878365,11721.470506500485,10881.067882566596,10037.261412478865]
[null,5033,"Medium density polyethylene",21221,20977.449326679805,20933.617061560097,20638.424753867788,20325.520907713944,20012.617061560097,19693.809369252405]
[null,5033,"Other",0,0,0,0,0,0,0]
[null,5033,"Protected steel",2468,2503.4179549165824,2441.1129395319667,2415.7283241473515,2388.8206318396592,2361.9129395319669,2334.4975549165824]
[null,5033,"PVC",0,0,0,0,0,0,0]
[null,5033,"Unprotected steel",992,904.72343784793259,776.49119555143659,588.30769230769226,393.43076923076922,198.55384615384617,0]
[null,5034,"Cast Iron",466,583.66499999999996,469.66792968749996,355.67085937499996,234.83396484374998,113.9970703125,0]
[null,5034,"High density polyethylene (100)",11433.310099805984,12327.358256176694,12961.506477472249,14128.800666644614,15443.168054326652,16824.08558138584,18202.262241498785]
[null,5034,"High density polyethylene (250)",3274,2718.6287185309147,2588.9265515731495,1960.6153846153845,1311.1615384615384,661.70769230769247,0]
[null,5034,"High density polyethylene (575)",10148.299999999999,6586.7456758800399,6368.2748661037558,6140.0605029129074,5808.4500335111443,5425.5165110039243,5047.9864013457009]
[null,5034,"Medium density polyethylene",23952,23942.825929364,23935.679324402892,23926.078318968055,23916.306122667596,23906.535811894959,23896.709693812973]
[null,5034,"Other",6,6,6,6,6,6,6]
[null,5034,"Protected steel",4621,4620.2266746934756,4620.2266746934756,4620.2266746934756,4620.2266746934756,4620.2266746934756,4620.2266746934756]
[null,5034,"PVC",0,0,0,0,0,0,0]
[null,5034,"Unprotected steel",32,30.306815851908265,26.807692307692307,21.615384615384613,16.111538461538458,10.607692307692307,5]
[null,5035,"Cast Iron",0,0,0,0,0,0,0]
[null,5035,"High density polyethylene (100)",5006.5479719497134,10491.058924598639,10822.977975144229,11186.280233954456,11819.307549779107,12589.320585317693,13358.760163485764]
[null,5035,"High density polyethylene (250)",4512,43.862000000000002,42,32,21.4,10.800000000000004,0]
[null,5035,"High density polyethylene (575)",12869,12326.0960257481,12063.950214907009,11801.804404065919,11277.512782383736,10622.148255281008,9966.7837281782813]
[null,5035,"Medium density polyethylene",7929,7916.8449817246219,7914.175028617351,7896.2760997526238,7877.3040979842472,7858.33210023417,7839.0024141935719]
[null,5035,"Other",0,0,0,0,0,0,0]
[null,5035,"Protected steel",3040,3038.4227976293264,3038.4227976293264,3038.4227976293264,3038.4227976293264,3038.4227976293264,3038.4227976293264]
[null,5035,"PVC",0,0,0,0,0,0,0]
[null,5035,"Unprotected steel",22,5.3012048192771077,2.6506024096385539,0,0,0,0]
[null,5037,"Cast Iron",1195,1422.6866035232431,1132.2713681678715,841.85613281249994,555.84090820312497,269.82568359375,0]
[null,5037,"High density polyethylene (100)",15643.254523503974,19413.648102089348,20979.911075124888,22578.601429662915,23645.692959519001,24876.881076401769,26090.211425365855]
[null,5037,"High density polyethylene (250)",5981,1692.2949636341737,846.53342412477912,0.61538461538461542,0.41153846153846152,0.20769230769230773,0]
[null,5037,"High density polyethylene (575)",15055,14418.259625621453,14111.253719544393,13801.999301140893,13186.202002795433,12417.219802940534,11648.179910777941]
[null,5037,"Medium density polyethylene",23423,23416.72920216776,23413.950604496589,23395.943061576894,23376.862476253915,23357.781925441035,23338.343716820869]
[null,5037,"Other",0,0,0,0,0,0,0]
[null,5037,"Protected steel",4011,4009.3929912073527,4009.3929912073527,4009.3929912073527,4009.3929912073527,4009.3929912073527,4009.3929912073527]
[null,5037,"PVC",0,0,0,0,0,0,0]
[null,5037,"Unprotected steel",23,5.5421686746987948,2.7710843373493974,0,0,0,0]
[null,5038,"Cast Iron",88,48.242619253149186,28.319141657824591,8.3956640624999999,5.5432910156249999,2.69091796875,0]
[null,5038,"High density polyethylene (100)",8862.1848873913605,14165.121380784203,14639.965913130349,15167.778172771619,15918.281155621762,16808.243569369617,17695.471664016291]
[null,5038,"High density polyethylene (250)",4056,53.601085206455451,26.800542603227726,0,0,0,0]
[null,5038,"High density polyethylene (575)",12422,11898.95388987829,11638.512614699768,11378.071339521246,10868.052748745162,10233.245500170295,9598.981449574474]
[null,5038,"Medium density polyethylene",55907,55893.752356448313,55887.044580616574,55847.259069556007,55805.143053049484,55763.027300253692,55720.134888017667]
[null,5038,"Other",0,0,0,0,0,0,0]
[null,5038,"Protected steel",3628,3626.9725329310741,3626.9725329310741,3626.9725329310741,3626.9725329310741,3626.9725329310741,3626.9725329310741]
[null,5038,"PVC",0,0,0,0,0,0,0]
[null,5038,"Unprotected steel",257,61.92771084337349,30.963855421686745,0,0,0,0]
[null,5039,"Cast Iron",22,26.302499999999998,21.165292968749998,16.028085937499998,10.582646484374999,5.13720703125,0]
[null,5039,"High density polyethylene (100)",28902.325458128318,30731.287449261181,31647.730153256707,33485.014112939876,35419.076322585475,37382.193337013428,39341.558046226084]
[null,5039,"High density polyethylene (250)",3988,3255.8925370504189,3102.2458839098249,2350.7692307692305,1572.0769230769229,793.3846153846157,0]
[null,5039,"High density polyethylene (575)",9404,9004.8068373941933,8480.1490454096438,7891.1838008889681,7265.8778737584444,6624.8766053229965,6005.9790649830902]
[null,5039,"Medium density polyethylene",12073,11818.201074231543,11771.4879003767,11472.269169523139,11155.258883634859,10838.249350192806,10515.309799754916]
[null,5039,"Other",0,0,0,0,0,0,0]
[null,5039,"Protected steel",7046,7062.4732530237079,7032.7367684083229,7020.6213837929381,7007.7790761006308,6994.9367684083227,6981.8521530237076]
[null,5039,"PVC",0,0,0,0,0,0,0]
[null,5039,"Unprotected steel",91,85.293342315690822,73.5,56,37.449999999999996,18.900000000000006,0]
[null,5040,"Cast Iron",159,71.168233262996367,35.584116631498183,0,0,0,0]
[null,5040,"High density polyethylene (100)",329.89764869023651,368.18714340117504,694.721388168055,1022.4385933499092,1166.7017355398123,1345.9125662871895,1525.0642838888868]
[null,5040,"High density polyethylene (250)",1225,434.84324091329756,217.42162045664878,0,0,0,0]
[null,5040,"High density polyethylene (575)",3393,3249.8596484080581,3180.7431097349818,3111.626571061905,2973.3934937157519,2800.6021470330606,2627.8108003503694]
[null,5040,"Medium density polyethylene",7283,7285.0496167568308,7284.8595973375714,7284.0145893206891,7283.1234487369766,7282.2323294266134,7281.3258467682408]
[null,5040,"Other",0,0,0,0,0,0,0]
[null,5040,"Protected steel",1988,1986.712775680757,1986.712775680757,1986.712775680757,1986.712775680757,1986.712775680757,1986.712775680757]
[null,5040,"PVC",0,0,0,0,0,0,0]
[null,5040,"Unprotected steel",161,38.795180722891558,19.397590361445779,0,0,0,0]
[null,5041,"Cast Iron",13,5.8187863674147966,2.9093931837073983,0,0,0,0]
[null,5041,"High density polyethylene (100)",9157.9193554272933,9855.7115208894684,10483.179212343623,11127.379703313538,11832.230522178239,12575.039239451569,13293.631103356778]
[null,5041,"High density polyethylene (250)",0,0,0,0,0,0,0]
[null,5041,"High density polyethylene (575)",10518,9000.5881023865386,8512.2421067559244,8023.8961111253102,7484.3187288861518,6919.1256533427222,6375.7883082503968]
[null,5041,"Medium density polyethylene",34724,34714.425161773543,34704.749900144969,34695.077355466899,34685.407526976378,34675.740413910658,34666.076015507206]
[null,5041,"Other",0,0,0,0,0,0,0]
[null,5041,"Protected steel",6428,6426.8248737039603,6426.8248737039603,6426.8248737039603,6426.8248737039603,6426.8248737039603,6426.8248737039603]
[null,5041,"PVC",0,0,0,0,0,0,0]
[null,5041,"Unprotected steel",39,39,39,39,39,39,39]
[null,5042,"Cast Iron",1533,1920.0825,1545.06638671875,1170.0502734375,772.53319335937499,375.01611328125,0]
[null,5042,"High density polyethylene (100)",3274.6977447861864,3630.9532823281552,4441.1955214676191,5935.1572392087601,7514.0334927064687,9104.7751114461626,10681.138847705617]
[null,5042,"High density polyethylene (250)",2937,2477.3595,2372.1923076923076,1807.3846153846152,1208.6884615384615,609.9923076923078,0]
[null,5042,"High density polyethylene (575)",2540,2388.9469519285876,2237.7629796173928,2008.9303816332031,1774.1208605720901,1539.3113395109772,1308.970371425997]
[null,5042,"Medium density polyethylene",58739,58602.353589253653,58565.08173063412,58407.456378740535,58241.354829045558,58075.257849496251,57906.338515732328]
[null,5042,"Other",0,0,0,0,0,0,0]
[null,5042,"Protected steel",8204,8204.0468912378128,8201.2148450839668,8200.0609989301192,8198.8379220070437,8197.6148450839664,8196.3686912378125]
[null,5042,"PVC",0,0,0,0,0,0,0]
[null,5042,"Unprotected steel",987,367.34789072813908,246.73679332715477,114.46153846153845,76.546153846153842,38.630769230769232,0]
[null,5043,"Cast Iron",5,6.2624999999999993,5.0393554687499993,3.8162109374999997,2.5196777343749996,1.22314453125,0]
[null,5043,"High density polyethylene (100)",10046,13607.460084820457,13663.098814414483,13722.947965374336,13823.078693253008,13943.151976793613,14062.591749984031]
[null,5043,"High density polyethylene (250)",571,1.6870000000000001,1.6153846153846154,1.2307692307692308,0.82307692307692304,0.41538461538461546,0]
[null,5043,"High density polyethylene (575)",2193,2098.9132112618354,2044.5692415836747,1986.3278505396879,1887.9013481718332,1769.5322901420448,1651.7310460982621]
[null,5043,"Medium density polyethylene",94548,94521.94213276291,94495.603265502737,94469.271794569548,94442.94771788636,94416.631033376747,94390.321738964893]
[null,5043,"Other",0,0,0,0,0,0,0]
[null,5043,"Protected steel",2522,2521.5769687031043,2521.5769687031043,2521.5769687031043,2521.5769687031043,2521.5769687031043,2521.5769687031043]
[null,5043,"PVC",0,0,0,0,0,0,0]
[null,5043,"Unprotected steel",8,8,8,8,8,8,8]
[null,5044,"Cast Iron",1,1.2524999999999999,1.0078710937499999,0.76324218749999995,0.50393554687499997,0.24462890625,0]
[null,5044,"High density polyethylene (100)",4949.3792870653633,5338.5438520688003,5441.218853764356,5570.4286078514906,5708.8271658763306,5854.7121097403869,5999.3193640415593]
[null,5044,"High density polyethylene (250)",1,0.84350000000000003,0.80769230769230771,0.61538461538461542,0.41153846153846152,0.20769230769230773,0]
[null,5044,"High density polyethylene (575)",124,119.49844293896946,111.57414300932957,103.64984307968969,95.725543150049816,87.80124322040993,80.273158287252045]
[null,5044,"Medium density polyethylene",51159,51133.190812232875,51116.849460611164,51089.049463611496,51060.445800746391,51031.846163192837,51002.981319051258]
[null,5044,"Other",0,0,0,0,0,0,0]
[null,5044,"Protected steel",5043,5042.2829595692219,5042.2829595692219,5042.2829595692219,5042.2829595692219,5042.2829595692219,5042.2829595692219]
[null,5044,"PVC",0,0,0,0,0,0,0]
[null,5044,"Unprotected steel",76,71.234000175741784,61.384615384615387,46.769230769230766,31.276923076923076,15.784615384615385,0]
[null,5045,"Cast Iron",1,1.2524999999999999,1.0078710937499999,0.76324218749999995,0.50393554687499997,0.24462890625,0]
[null,5045,"High density polyethylene (100)",12344.916448220705,13973.291967332927,14315.751765477507,14706.434996932181,15143.35228410122,15617.607791607203,16086.323648333422]
[null,5045,"High density polyethylene (250)",0,0,0,0,0,0,0]
[null,5045,"High density polyethylene (575)",869,832.66315707094191,812.56689584318792,792.47063461543382,755.79292261258877,710.82448522219795,666.03178835444032]
[null,5045,"Medium density polyethylene",77346,77344.319379311361,77333.040093214775,77312.920908071595,77292.181379610411,77271.444583986653,77250.502828125231]
[null,5045,"Other",4,3.6832412523020257,3.3915665306648486,3.1229894389179083,2.875680882981499,2.647956614163443,2.438265758898198]
[null,5045,"Protected steel",2840,2838.1828408343922,2838.1828408343922,2838.1828408343922,2838.1828408343922,2838.1828408343922,2838.1828408343922]
[null,5045,"PVC",0,0,0,0,0,0,0]
[null,5045,"Unprotected steel",65,15.662650602409636,7.8313253012048181,0,0,0,0]
[null,5046,"Cast Iron",0,0,0,0,0,0,0]
[null,5046,"High density polyethylene (100)",5340.8324159616586,5652.1037747555965,5662.745540549492,5674.3570114022532,5686.6829382127062,5699.7241248167147,5712.4910816624824]
[null,5046,"High density polyethylene (250)",0,0,0,0,0,0,0]
[null,5046,"High density polyethylene (575)",43,41.438976180449089,38.691033462912678,35.943090745376267,33.195148027839856,30.447205310303445,27.836659728643852]
[null,5046,"Medium density polyethylene",52409,52394.282810487814,52379.569753770891,52364.860828688688,52350.156034080981,52335.45536878788,52320.758831649808]
[null,5046,"Other",0,0,0,0,0,0,0]
[null,5046,"Protected steel",108,107.98465481221089,107.98465481221089,107.98465481221089,107.98465481221089,107.98465481221089,107.98465481221089]
[null,5046,"PVC",0,0,0,0,0,0,0]
[null,5046,"Unprotected steel",0,0,0,0,0,0,0]
[null,5047,"Cast Iron",0,0,0,0,0,0,0]
[null,5047,"High density polyethylene (100)",2622.0261101210931,2895.3974557658244,2998.112827184551,3112.3784633044334,3235.1540637203802,3366.4492030106785,3495.6799553491369]
[null,5047,"High density polyethylene (250)",0,0,0,0,0,0,0]
[null,5047,"High density polyethylene (575)",136,131.0628083846762,122.37164071990988,113.68047305514355,104.98930539037723,96.2981377256109,88.0415284440829]
[null,5047,"Medium density polyethylene",46280,46267.003920497926,46254.011490479053,46241.02270891855,46228.037574791881,46215.056087074794,46202.078244743323]
[null,5047,"Other",0,0,0,0,0,0,0]
[null,5047,"Protected steel",433,432.93847716377149,432.93847716377149,432.93847716377149,432.93847716377149,432.93847716377149,432.93847716377149]
[null,5047,"PVC",0,0,0,0,0,0,0]
[null,5047,"Unprotected steel",0,0,0,0,0,0,0]
[null,5048,"Cast Iron",32,15.932968540187993,8.7297264575939959,1.5264843749999999,1.0078710937499999,0.4892578125,0]
[null,5048,"High density polyethylene (100)",6130.1861859030887,6970.3521534607553,7263.7562234139477,7586.3173695800997,7962.3254238594754,8382.4536663304716,8798.4953654250348]
[null,5048,"High density polyethylene (250)",45,17.927937042812406,10.507737752175434,2.4615384615384617,1.6461538461538461,0.83076923076923093,0]
[null,5048,"High density polyethylene (575)",2309,2211.749182013285,2163.5386305075822,2115.3280790018794,2020.6324283945082,1902.6942282363029,1784.8423006982991]
[null,5048,"Medium density polyethylene",72563,72554.263402687415,72538.755102624855,72523.087397023162,72507.412498670863,72491.741944809153,72476.07188806418]
[null,5048,"Other",0,0,0,0,0,0,0]
[null,5048,"Protected steel",1155,1154.2764005798167,1154.2764005798167,1154.2764005798167,1154.2764005798167,1154.2764005798167,1154.2764005798167]
[null,5048,"PVC",0,0,0,0,0,0,0]
[null,5048,"Unprotected steel",1,0.93728947599660239,0.80769230769230771,0.61538461538461542,0.41153846153846152,0.20769230769230773,0]
[null,5049,"Cast Iron",0,0,0,0,0,0,0]
[null,5049,"High density polyethylene (100)",763.76057815702563,906.36933846713987,1024.1556348942668,1150.3352673309087,1297.6507371646398,1458.6330899597913,1616.7056279862243]
[null,5049,"High density polyethylene (250)",0,0,0,0,0,0,0]
[null,5049,"High density polyethylene (575)",1274,1223.4312172146317,1173.9703449706533,1124.5094727266751,1060.096776319408,988.20816783049668,918.04501174561983]
[null,5049,"Medium density polyethylene",50914,50902.632861712962,50889.553684484155,50876.478180073565,50863.406347449811,50850.338185581815,50837.27369343875]
[null,5049,"Other",0,0,0,0,0,0,0]
[null,5049,"Protected steel",13221,13213.768674024353,13213.768674024353,13213.768674024353,13213.768674024353,13213.768674024353,13213.768674024353]
[null,5049,"PVC",0,0,0,0,0,0,0]
[null,5049,"Unprotected steel",0,0,0,0,0,0,0]
[null,5050,"Cast Iron",15,6.713984270093996,3.356992135046998,0,0,0,0]
[null,5050,"High density polyethylene (100)",3144.0709346243439,3357.2238388778605,3578.2896912312208,3802.6740897860323,4026.1465232610094,4252.0667346961545,4467.9839523169167]
[null,5050,"High density polyethylene (250)",0,0,0,0,0,0,0]
[null,5050,"High density polyethylene (575)",2984,2875.6722074990716,2684.9777640309635,2494.2833205628554,2303.5888770947472,2112.8944336266391,1931.7347123319362]
[null,5050,"Medium density polyethylene",24478,24471.12623089776,24464.254392047242,24457.384482906404,24450.516502933358,24443.650451586367,24436.78632832384]
[null,5050,"Other",0,0,0,0,0,0,0]
[null,5050,"Protected steel",822,821.88320607071626,821.88320607071626,821.88320607071626,821.88320607071626,821.88320607071626,821.88320607071626]
[null,5050,"PVC",0,0,0,0,0,0,0]
[null,5050,"Unprotected steel",0,0,0,0,0,0,0]
[null,5051,"Cast Iron",0,0,0,0,0,0,0]
[null,5051,"High density polyethylene (100)",17364.207187125576,38013.605160421881,38927.405086640669,39906.03518329496,40932.430629920724,42006.645167411196,43052.408983965826]
[null,5051,"High density polyethylene (250)",0,0,0,0,0,0,0]
[null,5051,"High density polyethylene (575)",23996,5821.6943047928589,5435.6403058012902,5049.5863068097215,4663.5323078181527,4277.4783088265831,3910.7270097845931]
[null,5051,"Medium density polyethylene",25928,25920.719050360207,25913.440145314198,25906.163284287821,25898.888466707089,25891.615691998173,25884.344959587408]
[null,5051,"Other",0,0,0,0,0,0,0]
[null,5051,"Protected steel",9592,9590.6371199882124,9590.6371199882124,9590.6371199882124,9590.6371199882124,9590.6371199882124,9590.6371199882124]
[null,5051,"PVC",0,0,0,0,0,0,0]
[null,5051,"Unprotected steel",0,0,0,0,0,0,0]
[null,5052,"Cast Iron",0,0,0,0,0,0,0]
[null,5052,"High density polyethylene (100)",8584.4871426051741,12460.895660895001,13074.932090457856,13692.771918751596,14313.414002079391,14936.861493264134,15530.618541432994]
[null,5052,"High density polyethylene (250)",0,0,0,0,0,0,0]
[null,5052,"High density polyethylene (575)",12297,8792.772527219011,8209.6974259445415,7626.6223246700702,7043.5472233956007,6460.4721221211303,5906.550775910383]
[null,5052,"Medium density polyethylene",2413,2412.3223954226773,2411.6449811263174,2410.9677570574868,2410.2907231627664,2409.613879388753,2408.9372256820584]
[null,5052,"Other",0,0,0,0,0,0,0]
[null,5052,"Protected steel",11023,11021.433796250007,11021.433796250007,11021.433796250007,11021.433796250007,11021.433796250007,11021.433796250007]
[null,5052,"PVC",0,0,0,0,0,0,0]
[null,5052,"Unprotected steel",0,0,0,0,0,0,0]
[null,5061,"Cast Iron",0,0,0,0,0,0,0]
[null,5061,"High density polyethylene (100)",13194,18853.98590162841,20620.21010691379,22386.43431219917,24152.65851748455,25918.882722769929,27596.795717791043]
[null,5061,"High density polyethylene (250)",18,0,0,0,0,0,0]
[null,5061,"High density polyethylene (575)",32293,26634.661015703532,24868.436810418152,23102.212605132772,21335.988399847392,19569.764194562013,17891.851199540899]
[null,5061,"Medium density polyethylene",10011,10008.188769405893,10005.378328245155,10002.568676296101,9999.7598133371102,9996.9517391466234,9994.1444535031424]
[null,5061,"Other",0,0,0,0,0,0,0]
[null,5061,"Protected steel",2435,2434.6540228493845,2434.6540228493845,2434.6540228493845,2434.6540228493845,2434.6540228493845,2434.6540228493845]
[null,5061,"PVC",0,0,0,0,0,0,0]
[null,5061,"Unprotected steel",0,0,0,0,0,0,0]
[null,5062,"Cast Iron",49,61.372499999999995,49.385683593749995,37.398867187500002,24.692841796875001,11.98681640625,0]
[null,5062,"High density polyethylene (100)",7947.1339656609025,9404.1385259057643,11003.547771238791,12634.066587494559,14336.794720957474,16076.20857670662,17741.193846133057]
[null,5062,"High density polyethylene (250)",927,53.984000000000002,51.692307692307693,39.384615384615387,26.338461538461537,13.292307692307695,0]
[null,5062,"High density polyethylene (575)",26374,25385.530317516954,23842.763098074327,22284.106391524874,20658.532285264053,19000.111017609088,17414.910946065254]
[null,5062,"Medium density polyethylene",46341,46330.381113870579,46318.363677573732,46306.349615943211,46294.338928031364,46282.331612890797,46270.327669574392]
[null,5062,"Other",0,0,0,0,0,0,0]
[null,5062,"Protected steel",5251,5250.2407705724618,5250.2407705724618,5250.2407705724618,5250.2407705724618,5250.2407705724618,5250.2407705724618]
[null,5062,"PVC",0,0,0,0,0,0,0]
[null,5062,"Unprotected steel",27,11.060240963855421,8.5301204819277103,6,6,6,6]
[null,5063,"Cast Iron",86,107.71499999999999,86.676914062499989,65.638828125000003,43.338457031250002,21.0380859375,0]
[null,5063,"High density polyethylene (100)",10062.201597747218,13790.073502846739,16084.044407803867,18402.428643343934,20731.83801797764,23070.108666720393,25297.108443471931]
[null,5063,"High density polyethylene (250)",74,62.419000000000004,59.769230769230766,45.538461538461533,30.45384615384615,15.369230769230775,0]
[null,5063,"High density polyethylene (575)",36862,32758.956216325718,30586.611639646293,28414.267062966868,26241.922486287447,24069.577909608022,22005.850561762571]
[null,5063,"Medium density polyethylene",4278,4275.9813187242953,4274.6389606485955,4272.478177078845,4270.2600379664154,4268.04223552443,4265.8055388891153]
[null,5063,"Other",0,0,0,0,0,0,0]
[null,5063,"Protected steel",3758,3757.466044298968,3757.466044298968,3757.466044298968,3757.466044298968,3757.466044298968,3757.466044298968]
[null,5063,"PVC",0,0,0,0,0,0,0]
[null,5063,"Unprotected steel",0,0,0,0,0,0,0]
[null,5064,"Cast Iron",113,141.5325,113.88943359375,86.246367187499999,56.944716796874999,27.64306640625,0]
[null,5064,"High density polyethylene (100)",10474.194795005444,11166.457517246707,12119.071980666915,13495.826103874228,14911.234664562748,16333.589192579799,17724.871829993208]
[null,5064,"High density polyethylene (250)",1449,1222.2315000000001,1170.3461538461538,891.69230769230762,596.31923076923078,300.94615384615395,0]
[null,5064,"High density polyethylene (575)",12022,11574.547781960089,10808.35950373531,10027.630845799564,9245.7829570945851,8463.9350683896082,7719.81784335065]
[null,5064,"Medium density polyethylene",28428,28246.900530645642,28208.977106372542,27997.641973215039,27774.089766302488,27550.539715798408,27322.918744174163]
[null,5064,"Other",10,10,10,10,10,10,10]
[null,5064,"Protected steel",4347,4346.3823561914887,4346.3823561914887,4346.3823561914887,4346.3823561914887,4346.3823561914887,4346.3823561914887]
[null,5064,"PVC",0,0,0,0,0,0,0]
[null,5064,"Unprotected steel",0,0,0,0,0,0,0]
[null,5065,"Cast Iron",0,0,0,0,0,0,0]
[null,5065,"High density polyethylene (100)",2724.9935925896643,3058.703915905412,3720.5216343364164,4403.2338375121763,5098.7588992269475,5806.4990087494407,6486.0486407251465]
[null,5065,"High density polyethylene (250)",0,0,0,0,0,0,0]
[null,5065,"High density polyethylene (575)",8155,7858.9500174781933,7337.7994858151833,6816.6489541521732,6295.4984224891632,5774.3478908261532,5279.2548857462934]
[null,5065,"Medium density polyethylene",40624,40610.957488842876,40599.270152859041,40585.948493950265,40572.514651309371,40559.084008652899,40545.618103543777]
[null,5065,"Other",0,0,0,0,0,0,0]
[null,5065,"Protected steel",4381,4380.3775252990363,4380.3775252990363,4380.3775252990363,4380.3775252990363,4380.3775252990363,4380.3775252990363]
[null,5065,"PVC",0,0,0,0,0,0,0]
[null,5065,"Unprotected steel",43,40.3034474678539,34.730769230769226,26.46153846153846,17.696153846153845,8.9307692307692292,0]
[null,5066,"Cast Iron",80,100.19999999999999,80.629687499999989,61.059374999999996,40.314843749999994,19.5703125,0]
[null,5066,"High density polyethylene (100)",20516,21671.151031307549,22003.804926597648,23364.903968912498,24803.734922285039,26242.565875657579,27702.463481481685]
[null,5066,"High density polyethylene (250)",4573,3857.3254999999999,3693.5769230769229,2814.1538461538457,1881.9653846153847,949.77692307692314,0]
[null,5066,"High density polyethylene (575)",1318,1236.9822056532635,1159.032208100768,1037.3111705936112,912.22090231722359,787.13063404083607,664.19564840903695]
[null,5066,"Medium density polyethylene",46207,45912.362755666079,45850.673879482936,45506.843003101407,45143.134863376021,44779.430228553058,44409.102174571359]
[null,5066,"Other",0,0,0,0,0,0,0]
[null,5066,"Protected steel",201,214.12401889889333,191.93965736043177,182.90119582197025,173.320426591201,163.73965736043178,153.97811889889331]
[null,5066,"PVC",0,0,0,0,0,0,0]
[null,5066,"Unprotected steel",0,0,0,0,0,0,0]
[null,5067,"Cast Iron",683,855.45749999999998,688.37595703124998,521.29441406249998,344.18797851562499,167.08154296875,0]
[null,5067,"High density polyethylene (100)",9467.9516752930012,14656.847977111011,15186.351786027273,15737.000688838454,16303.193113717753,16871.211501465681,17414.753433188045]
[null,5067,"High density polyethylene (250)",46,38.801000000000002,37.153846153846153,28.307692307692307,18.930769230769229,9.553846153846159,0]
[null,5067,"High density polyethylene (575)",9323,4740.88142556804,4429.2386730625403,4099.3080203020108,3767.4807872502497,3435.4091102067173,3118.1672137097262]
[null,5067,"Medium density polyethylene",41772,41749.653083534264,41736.210445135541,41711.635868338024,41686.279904859904,41660.927169179136,41635.316121927775]
[null,5067,"Other",0,0,0,0,0,0,0]
[null,5067,"Protected steel",3656,3673.1105883358678,3643.3741037204832,3631.2587191050989,3618.4164114127911,3605.5741037204834,3592.4894883358679]
[null,5067,"PVC",0,0,0,0,0,0,0]
[null,5067,"Unprotected steel",0,0,0,0,0,0,0]
[null,5068,"Cast Iron",256,320.64,258.01499999999999,195.39,129.00749999999999,62.625,0]
[null,5068,"High density polyethylene (100)",14743.423208388325,15711.369644501438,16051.708983944722,16482.47550090812,16932.488675780696,17391.839964624698,17840.214627455287]
[null,5068,"High density polyethylene (250)",145,122.3075,117.11538461538461,89.230769230769226,59.67307692307692,30.115384615384627,0]
[null,5068,"High density polyethylene (575)",2528,2415.2107012481679,2257.6345049138772,2072.3266565535164,1884.8841928085405,1697.4417290635645,1516.774273121222]
[null,5068,"Medium density polyethylene",44575,44538.9875058119,44522.420731999395,44482.277099891966,44440.475425831261,44398.677247296931,44356.328717153548]
[null,5068,"Other",0,0,0,0,0,0,0]
[null,5068,"Protected steel",1536,1535.7817573292216,1535.7817573292216,1535.7817573292216,1535.7817573292216,1535.7817573292216,1535.7817573292216]
[null,5068,"PVC",0,0,0,0,0,0,0]
[null,5068,"Unprotected steel",60,56.237368559796145,48.46153846153846,36.92307692307692,24.692307692307693,12.461538461538467,0]
[null,5069,"Cast Iron",679,850.44749999999999,684.34447265624999,518.24144531249999,342.172236328125,166.10302734375,0]
[null,5069,"High density polyethylene (100)",7877.9147543775352,8518.8667910348686,8978.0235227138437,9516.8273838265141,10133.137417825905,10784.017863940637,11420.919456216665]
[null,5069,"High density polyethylene (250)",82,69.167000000000002,66.230769230769226,50.46153846153846,33.746153846153845,17.030769230769238,0]
[null,5069,"High density polyethylene (575)",4050,3884.1713303222696,3736.6205850665046,3583.9732118708125,3379.2132563907289,3148.5931636146038,2922.5617334609665]
[null,5069,"Medium density polyethylene",33130,33098.54897449891,33087.292613080397,33046.071243039711,33002.740027583597,32959.410504698149,32915.378827754233]
[null,5069,"Other",4,3.6832412523020257,3.3915665306648486,3.1229894389179083,2.875680882981499,2.647956614163443,2.438265758898198]
[null,5069,"Protected steel",6321,6320.1018802591216,6320.1018802591216,6320.1018802591216,6320.1018802591216,6320.1018802591216,6320.1018802591216]
[null,5069,"PVC",0,0,0,0,0,0,0]
[null,5069,"Unprotected steel",318,298.05805336691958,256.84615384615381,195.69230769230768,130.86923076923077,66.046153846153857,0]
[null,5070,"Cast Iron",6643,8290.2974999999988,6671.0987695312488,5051.9000390624988,3335.5493847656244,1619.19873046875,0]
[null,5070,"High density polyethylene (100)",25269.254721169695,26967.739348305542,29058.47555028084,31434.897067568858,33904.724458631987,36397.050926354241,38790.347388075825]
[null,5070,"High density polyethylene (250)",601,362.82835189340631,299.51252210054935,188.30769230769232,125.93076923076922,63.553846153846166,0]
[null,5070,"High density polyethylene (575)",2380,2271.6749653028182,2142.5640012618637,1987.9698975212771,1822.369827623648,1652.2475438782669,1487.1142823966779]
[null,5070,"Medium density polyethylene",40961,40790.132970630664,40751.784862344284,40550.833356733958,40338.426964140213,40126.023376082958,39909.803361005419]
[null,5070,"Other",0,0,0,0,0,0,0]
[null,5070,"Protected steel",4374,4373.3552709393052,4373.3552709393052,4373.3552709393052,4373.3552709393052,4373.3552709393052,4373.3552709393052]
[null,5070,"PVC",0,0,0,0,0,0,0]
[null,5070,"Unprotected steel",420,382.52036998937433,328.23540315106584,248.61538461538461,166.26153846153846,83.907692307692344,0]
[null,5072,"Cast Iron",511,640.02749999999992,515.02212890624992,390.01675781249992,257.51106445312496,125.00537109375,0]
[null,5072,"High density polyethylene (100)",12769.765772203942,14262.293319626464,15258.197819125393,17909.397794838693,20715.436698935027,23561.956055593342,26431.934351572985]
[null,5072,"High density polyethylene (250)",8786,7344.5514740932322,7010.6766985850763,5323.0769230769229,3559.8076923076924,1796.5384615384619,0]
[null,5072,"High density polyethylene (575)",3466,3175.5571927407059,3024.6243158187526,2663.6803876074819,2267.647035751269,1862.1516643802779,1454.897672083757]
[null,5072,"Medium density polyethylene",46080,46011.829662125318,45992.424176362561,45904.899776327191,45812.577489249918,45720.257314537404,45626.339251596466]
[null,5072,"Other",0,0,0,0,0,0,0]
[null,5072,"Protected steel",1596,1614.51355450746,1582.8890391228445,1570.0044237382292,1556.3467314305369,1542.6890391228446,1528.7736545074599]
[null,5072,"PVC",0,0,0,0,0,0,0]
[null,5072,"Unprotected steel",2,1.8745789519932048,1.6153846153846154,1.2307692307692308,0.82307692307692304,0.41538461538461546,0]
[null,5073,"Cast Iron",13019,0,0,0,0,0,0]
[null,5073,"High density polyethylene (100)",17095.605696421946,42137.917054634854,42882.707511550558,43652.796496002004,43969.319590202977,44316.083551794829,44658.26160255642]
[null,5073,"High density polyethylene (250)",6933,990.73264113388848,495.36632056694424,0,0,0,0]
[null,5073,"High density polyethylene (575)",2402,1395.4891120271027,1352.0060488260078,1308.5229856249132,1241.8788542035745,1163.6541886721138,1086.4456228896956]
[null,5073,"Medium density polyethylene",48678,45489.549059808065,45486.859054094137,45484.169803771903,45481.481308629256,45478.79356845413,45476.106583034503]
[null,5073,"Other",0,0,0,0,0,0,0]
[null,5073,"Protected steel",1827,1674.6765928643067,1674.6765928643067,1674.6765928643067,1674.6765928643067,1674.6765928643067,1674.6765928643067]
[null,5073,"PVC",0,0,0,0,0,0,0]
[null,5073,"Unprotected steel",404,9.6385542168674689,4.8192771084337345,0,0,0,0]
[null,5074,"Cast Iron",0,0,0,0,0,0,0]
[null,5074,"High density polyethylene (100)",17883.852824186986,23137.938234341593,23696.645688132245,24325.050568849711,25018.337237272135,25731.94709719632,26454.111373586507]
[null,5074,"High density polyethylene (250)",1509,0,0,0,0,0,0]
[null,5074,"High density polyethylene (575)",3159,1437.5374486654566,1400.9305413336176,1364.3236340017781,1299.9927039366478,1221.7997625048718,1144.0509653030233]
[null,5074,"Medium density polyethylene",52647,52363.759076123024,52303.484488736234,51970.401851896924,51618.099703918815,51265.801120723663,50907.098409002727]
[null,5074,"Other",0,0,0,0,0,0,0]
[null,5074,"Protected steel",2291,2514.2619317237418,2136.1837701852801,1982.1453086468186,1818.8645394160494,1655.5837701852802,1489.2222317237415]
[null,5074,"PVC",0,0,0,0,0,0,0]
[null,5074,"Unprotected steel",246,194.36427882526857,162.95736793327154,119.38461538461539,79.83846153846153,40.292307692307702,0]
[null,5075,"Cast Iron",7,8.7675000000000001,7.0550976562500001,5.3426953125000001,3.527548828125,1.71240234375,0]
[null,5075,"High density polyethylene (100)",6678.1688825500705,7354.7424464262413,8195.9046537367503,9064.0246101796929,9262.4437645454273,9486.5720798121347,9710.3432343171116]
[null,5075,"High density polyethylene (250)",4195,1561.906604273634,838.45870598297086,91.692307692307679,61.319230769230771,30.946153846153848,0]
[null,5075,"High density polyethylene (575)",1985,1901.2588865576174,1860.823776252266,1820.3886659469149,1739.5184453362124,1638.4306695728342,1537.3428938094557]
[null,5075,"Medium density polyethylene",55637,55646.271531686885,55642.072842382739,55633.290038425635,55624.185111804938,55615.08113917576,55605.870427962509]
[null,5075,"Other",0,0,0,0,0,0,0]
[null,5075,"Protected steel",3822,3827.9483261374885,3813.7880953682579,3808.018864599027,3801.9034799836427,3795.7880953682579,3789.5573261374884]
[null,5075,"PVC",0,0,0,0,0,0,0]
[null,5075,"Unprotected steel",0,0,0,0,0,0,0]
[null,5076,"Cast Iron",282,170.49246195408915,106.23539113329457,41.978320312500003,27.716455078125001,13.45458984375,0]
[null,5076,"High density polyethylene (100)",11113.96768013429,12354.48917902124,13459.288907083112,17666.304371061015,22138.336659193741,26692.038761500018,31318.91347916879]
[null,5076,"High density polyethylene (250)",13488,11196.373407459529,10660.977896037455,8072.6153846153848,5398.5615384615385,2724.5076923076922,0]
[null,5076,"High density polyethylene (575)",7992,7543.8965456320066,7358.3992130783799,7018.504034109339,6524.9059838635621,5960.3988056717271,5391.9300890183531]
[null,5076,"Medium density polyethylene",22853,21954.156662876809,21796.217732337987,20732.56388618414,19605.090809261063,18477.617732337985,17328.871578491831]
[null,5076,"Other",0,0,0,0,0,0,0]
[null,5076,"Protected steel",2474,2497.9097143094787,2454.9570143094788,2437.4570143094788,2418.9070143094787,2400.3570143094789,2381.4570143094788]
[null,5076,"PVC",0,0,0,0,0,0,0]
[null,5076,"Unprotected steel",3,0.72289156626506013,0.36144578313253006,0,0,0,0]
[null,5081,"Cast Iron",9604,0,0,0,0,0,0]
[null,5081,"High density polyethylene (100)",13129.424309234335,40261.165704164909,40485.04772768054,40720.426143394034,40963.387396220423,41214.828451265967,41458.176833040125]
[null,5081,"High density polyethylene (250)",3358,1.7748703710746838,0.88743518553734191,0,0,0,0]
[null,5081,"High density polyethylene (575)",4961,1951.4866689630094,1822.0777386604225,1692.6688083578358,1563.2598780552489,1433.8509477526623,1310.9124639652046]
[null,5081,"Medium density polyethylene",19669,17808.490016814107,17804.107738668157,17799.72669112798,17795.346873848004,17790.968286482756,17786.590928686855]
[null,5081,"Other",0,0,0,0,0,0,0]
[null,5081,"Protected steel",1704,1206.7683592815772,1206.7683592815772,1206.7683592815772,1206.7683592815772,1206.7683592815772,1206.7683592815772]
[null,5081,"PVC",0,0,0,0,0,0,0]
[null,5081,"Unprotected steel",455,0,0,0,0,0,0]
[null,5082,"Cast Iron",776,0,0,0,0,0,0]
[null,5082,"High density polyethylene (100)",28401.214695381921,31506.677194591277,32567.954256298031,33676.337434864348,34679.024733596321,35850.810292609822,37015.94882690136]
[null,5082,"High density polyethylene (250)",2484,818.21524106542927,409.10762053271463,0,0,0,0]
[null,5082,"High density polyethylene (575)",13279,12634.511824978101,12365.806767024504,12097.101709070908,11559.691593163716,10887.928948279725,10216.166303395734]
[null,5082,"Medium density polyethylene",32531,32531.9001767103,32531.9001767103,32531.9001767103,32531.9001767103,32531.9001767103,32531.9001767103]
[null,5082,"Other",0,0,0,0,0,0,0]
[null,5082,"Protected steel",8928,8922.2191455119719,8922.2191455119719,8922.2191455119719,8922.2191455119719,8922.2191455119719,8922.2191455119719]
[null,5082,"PVC",0,0,0,0,0,0,0]
[null,5082,"Unprotected steel",116,16.626506024096383,8.3132530120481913,0,0,0,0]
[null,5083,"Cast Iron",1620,0,0,0,0,0,0]
[null,5083,"High density polyethylene (100)",28258.82931108935,31192.229669487715,31518.829869909347,31859.46924468322,32077.377763938453,32325.451804037886,32571.544811837986]
[null,5083,"High density polyethylene (250)",991,345.3897742111335,172.69488710556675,0,0,0,0]
[null,5083,"High density polyethylene (575)",2030,1862.9463649141389,1823.326067914689,1783.7057709152389,1704.465176916339,1605.4144344177139,1506.363691919089]
[null,5083,"Medium density polyethylene",1964,1777.7049298568284,1777.7049298568284,1777.7049298568284,1777.7049298568284,1777.7049298568284,1777.7049298568284]
[null,5083,"Other",0,0,0,0,0,0,0]
[null,5083,"Protected steel",1690,1688.905729829215,1688.905729829215,1688.905729829215,1688.905729829215,1688.905729829215,1688.905729829215]
[null,5083,"PVC",0,0,0,0,0,0,0]
[null,5083,"Unprotected steel",0,0,0,0,0,0,0]
[null,5084,"Cast Iron",11360,2955.9,2378.5757812500001,1801.2515625000001,1189.287890625,577.32421875,0]
[null,5084,"High density polyethylene (100)",3315,3610.911737662866,4943.9572268733846,6915.8313046670428,9034.7852321740938,11187.50298604443,13330.929923896205]
[null,5084,"High density polyethylene (250)",1672,1321.4202815071185,1235.7641792150978,916.92307692307691,613.19230769230762,309.46153846153857,0]
[null,5084,"High density polyethylene (575)",4677,4346.8442609157455,4218.9356000727339,3905.1499202441746,3509.5288953813533,3080.1440441552477,2646.3797865919346]
[null,5084,"Medium density polyethylene",32798,32657.036609187704,32630.171922962305,32450.034962603586,32259.098040705274,32068.161157256574,31873.62431224668]
[null,5084,"Other",0,0,0,0,0,0,0]
[null,5084,"Protected steel",2197,2296.8159032328913,2126.8931340021218,2057.6623647713523,1984.277749386737,1910.8931340021218,1836.1239032328908]
[null,5084,"PVC",0,0,0,0,0,0,0]
[null,5084,"Unprotected steel",2676,2501.2233815611589,2154.5125115848009,1640.6153846153845,1097.1615384615384,553.70769230769247,0]
[null,5085,"Cast Iron",3018,3772.8008905620563,3034.6983163747782,2296.5957421875,1516.342060546875,736.08837890625,0]
[null,5085,"High density polyethylene (100)",19908.472804237954,23191.421545532896,25243.007856184071,27481.262826333339,29805.039788680231,32263.677597507463,34662.678957690689]
[null,5085,"High density polyethylene (250)",954,419.25204455558514,273.30650304702334,101.53846153846153,67.903846153846146,34.269230769230774,0]
[null,5085,"High density polyethylene (575)",4092,3917.1089730080043,3833.2908045184531,3746.3247187718885,3576.1887011249123,3364.588871373885,3152.9082723920878]
[null,5085,"Medium density polyethylene",93062,93056.238595411429,93048.814237801576,92998.814237801576,92945.814237801576,92892.814237801576,92838.814237801576]
[null,5085,"Other",0,0,0,0,0,0,0]
[null,5085,"Protected steel",5375,5390.0226376705932,5358.8701299782851,5346.1778222859775,5332.7239761321316,5319.2701299782848,5305.5624376705928]
[null,5085,"PVC",0,0,0,0,0,0,0]
[null,5085,"Unprotected steel",401,173.91864990791203,124.59360518999074,68.307692307692307,45.680769230769229,23.053846153846152,0]
[null,5086,"Cast Iron",1285,1609.4624999999999,1295.1143554687499,980.76621093749986,647.55717773437493,314.34814453125,0]
[null,5086,"High density polyethylene (100)",14812.966974619721,16556.188038059398,18222.932219315469,20279.45645613845,22874.647763791545,25756.61386655812,28631.266183170788]
[null,5086,"High density polyethylene (250)",1980,1457.1326963577126,1324.4612712557794,950.15384615384608,635.4153846153846,320.67692307692323,0]
[null,5086,"High density polyethylene (575)",26851,25586.503911961048,25012.589424193371,24255.346231410109,22961.940615074356,21407.509556193127,19848.374651158054]
[null,5086,"Medium density polyethylene",43547,43435.312836283825,43412.853473373762,43261.848433158942,43101.785712852339,42941.723004758212,42778.641078103901]
[null,5086,"Other",0,0,0,0,0,0,0]
[null,5086,"Protected steel",6355,6551.334783142479,6214.3212908347869,6077.0135985270945,5931.4674446809404,5785.9212908347863,5637.6289831424783]
[null,5086,"PVC",0,0,0,0,0,0,0]
[null,5086,"Unprotected steel",123,41.476089766641032,26.501853568118626,10.46153846153846,6.9961538461538453,3.5307692307692307,0]
[null,5087,"Cast Iron",6884,8620.6001979026787,6936.6164661388393,5252.6327343749999,3468.08443359375,1683.5361328125,0]
[null,5087,"High density polyethylene (100)",24781.209303669282,26204.149955199497,28058.770859184613,30111.000883048044,32264.054473956527,34421.173191500726,36480.704810656091]
[null,5087,"High density polyethylene (250)",466,333.47083705422227,299.49957237326498,211.69230769230768,141.56923076923076,71.446153846153834,0]
[null,5087,"High density polyethylene (575)",764,718.29750737589359,677.92211068319591,614.76178908259249,547.42355174308659,478.87327961105245,411.31366623364187]
[null,5087,"Medium density polyethylene",26851,26755.194617082634,26733.655074803577,26618.450581172248,26496.647549036446,26374.845977985762,26250.845867609904]
[null,5087,"Other",0,0,0,0,0,0,0]
[null,5087,"Protected steel",1731,1730.7424262625398,1730.7424262625398,1730.7424262625398,1730.7424262625398,1730.7424262625398,1730.7424262625398]
[null,5087,"PVC",0,0,0,0,0,0,0]
[null,5087,"Unprotected steel",374,350.5462640227293,302.07692307692309,230.15384615384613,153.9153846153846,77.676923076923117,0]
[null,5088,"Cast Iron",0,0,0,0,0,0,0]
[null,5088,"High density polyethylene (100)",3299.7818895626419,3684.4384760869002,3874.7073255157666,4070.4172977749358,4402.6228780325091,4808.4574722879734,5213.5242834957289]
[null,5088,"High density polyethylene (250)",38,13.489014820167597,6.7445074100837985,0,0,0,0]
[null,5088,"High density polyethylene (575)",6835,6546.6521358293776,6407.4209121834956,6268.1896885376136,5989.7272412458487,5641.6491821311438,5293.5711230164379]
[null,5088,"Medium density polyethylene",10200,10204.046305312128,10204.046305312128,10204.046305312128,10204.046305312128,10204.046305312128,10204.046305312128]
[null,5088,"Other",0,0,0,0,0,0,0]
[null,5088,"Protected steel",4463,4460.1102202531283,4460.1102202531283,4460.1102202531283,4460.1102202531283,4460.1102202531283,4460.1102202531283]
[null,5088,"PVC",0,0,0,0,0,0,0]
[null,5088,"Unprotected steel",0,0,0,0,0,0,0]
[null,5089,"Cast Iron",119,112.82695281028199,84.653437342640999,56.479921875000002,37.291230468750001,18.1025390625,0]
[null,5089,"High density polyethylene (100)",6065.9505744469925,6703.4056163694368,7042.2470496767592,8265.8758353517824,9628.6392149842995,11034.145128389091,12459.79044586393]
[null,5089,"High density polyethylene (250)",5098,4300.1630000000005,4117.6153846153848,3137.2307692307691,2098.023076923077,1058.815384615385,0]
[null,5089,"High density polyethylene (575)",4326,4103.7528003507277,4007.4992588332811,3855.9323140854576,3619.5022707436578,3342.7695242587151,3064.6175470045423]
[null,5089,"Medium density polyethylene",23878,23859.074515448181,23854.134462115471,23820.865231346241,23785.599846730856,23750.334462115472,23714.403692884702]
[null,5089,"Other",0,0,0,0,0,0,0]
[null,5089,"Protected steel",3166,3163.9500240469197,3163.9500240469197,3163.9500240469197,3163.9500240469197,3163.9500240469197,3163.9500240469197]
[null,5089,"PVC",0,0,0,0,0,0,0]
[null,5089,"Unprotected steel",102,24.578313253012045,12.289156626506022,0,0,0,0]
[null,5090,"Cast Iron",11,4.9235884647355972,2.4617942323677986,0,0,0,0]
[null,5090,"High density polyethylene (100)",1341.0788382121289,1523.838708732834,1677.1806532384512,1862.6647068885989,2157.3249259004033,2508.5546344474537,2859.7830939141495]
[null,5090,"High density polyethylene (250)",152,128.21200000000002,122.76923076923077,93.538461538461533,62.553846153846152,31.569230769230771,0]
[null,5090,"High density polyethylene (575)",5210,4990.2059440630665,4884.0765109694239,4777.9470778757814,4565.6882116884972,4300.3646289543904,4035.0410462202844]
[null,5090,"Medium density polyethylene",19431,19435.096929938329,19434.468715063649,19430.23794583288,19425.753330448264,19421.268715063648,19416.699484294419]
[null,5090,"Other",0,0,0,0,0,0,0]
[null,5090,"Protected steel",13161,13152.541466616663,13152.541466616663,13152.541466616663,13152.541466616663,13152.541466616663,13152.541466616663]
[null,5090,"PVC",0,0,0,0,0,0,0]
[null,5090,"Unprotected steel",169,40.722891566265055,20.361445783132528,0,0,0,0]
[null,5091,"Cast Iron",273,122.19451371571074,61.097256857855371,0,0,0,0]
[null,5091,"High density polyethylene (100)",2799.7056483739716,3260.3172112442808,3597.3074067962343,3951.8169404116938,4390.136810360942,4907.3789183584322,5422.0850113339529]
[null,5091,"High density polyethylene (250)",0,0,0,0,0,0,0]
[null,5091,"High density polyethylene (575)",6500,6225.9024486530179,6092.6245802051317,5959.3467117572463,5694.0690877533525,5362.791585971454,5031.5779898341507]
[null,5091,"Medium density polyethylene",31128,31140.338886590092,31140.334956295788,31140.331027105171,31140.327099017923,31140.323172033739,31140.31924615231]
[null,5091,"Other",0,0,0,0,0,0,0]
[null,5091,"Protected steel",11670,11663.292800625497,11663.292800625497,11663.292800625497,11663.292800625497,11663.292800625497,11663.292800625497]
[null,5091,"PVC",0,0,0,0,0,0,0]
[null,5091,"Unprotected steel",0,0,0,0,0,0,0]
[null,5092,"Cast Iron",668,306.24020893279624,156.55469431014814,6.8691796874999991,4.5354199218749995,2.20166015625,0]
[null,5092,"High density polyethylene (100)",2730.862929466789,3078.3219142698299,3741.2049610342847,4486.9915504070495,5297.471472284652,6214.0972044428363,7119.7934591282192]
[null,5092,"High density polyethylene (250)",384,299.4425,286.73076923076923,218.46153846153845,146.09615384615384,73.730769230769226,0]
[null,5092,"High density polyethylene (575)",13559,12998.007501879021,12562.463143660687,12112.678207374911,11461.108599999494,10709.194734002334,9968.4568428034436]
[null,5092,"Medium density polyethylene",36377,36383.202909074949,36381.056433250436,36373.670224524591,36365.915131094378,36358.160383631854,36350.282905116779]
[null,5092,"Other",0,0,0,0,0,0,0]
[null,5092,"Protected steel",64188,64149.53915647036,64149.53915647036,64149.53915647036,64149.53915647036,64149.53915647036,64149.53915647036]
[null,5092,"PVC",0,0,0,0,0,0,0]
[null,5092,"Unprotected steel",0,0,0,0,0,0,0]
[null,5093,"Cast Iron",1202,538.01393951019895,269.00696975509948,0,0,0,0]
[null,5093,"High density polyethylene (100)",2489,2736.4408189764731,3197.7124725517788,4096.8734498564372,4827.5276188017078,5591.5280222909896,6366.797656549501]
[null,5093,"High density polyethylene (250)",1392,1174.152,1124.3076923076924,856.61538461538464,572.86153846153843,289.10769230769233,0]
[null,5093,"High density polyethylene (575)",4514,4190.0028775331612,4070.7258889691511,3765.5718814195925,3379.4177124743214,2959.9173089850397,2535.6476747265278]
[null,5093,"Medium density polyethylene",43816,43789.882128849182,43782.314995131448,43731.353456669909,43677.334225900682,43623.314995131448,43568.276533592987]
[null,5093,"Other",0,0,0,0,0,0,0]
[null,5093,"Protected steel",4963,4969.0379390875914,4953.4616852414374,4947.1155313952841,4940.3886083183606,4933.6616852414381,4926.8078390875917]
[null,5093,"PVC",0,0,0,0,0,0,0]
[null,5093,"Unprotected steel",0,0,0,0,0,0,0]
[null,5094,"Cast Iron",6384,2945.2059196559885,1514.1996590467443,83.193398437500008,54.928974609375004,26.66455078125,0]
[null,5094,"High density polyethylene (100)",651.4860417591641,767.28636988584776,2297.6294083951411,3832.9394917059581,4000.2937517996152,4188.7385510824488,4373.8664904703674]
[null,5094,"High density polyethylene (250)",21,7.454455558513672,3.727227779256836,0,0,0,0]
[null,5094,"High density polyethylene (575)",2029,1945.2737976110182,1890.0981634702398,1834.9225293294617,1744.8932560287562,1637.4371631480867,1530.9971700164601]
[null,5094,"Medium density polyethylene",9933,9935.3685623498368,9934.7172564370503,9934.0661334201886,9933.4151932478926,9932.7644358688158,9932.1138612316299]
[null,5094,"Other",0,0,0,0,0,0,0]
[null,5094,"Protected steel",10173,10169.301946963737,10169.301946963737,10169.301946963737,10169.301946963737,10169.301946963737,10169.301946963737]
[null,5094,"PVC",0,0,0,0,0,0,0]
[null,5094,"Unprotected steel",447,107.71084337349396,53.855421686746979,0,0,0,0]
[null,5095,"Cast Iron",79,53.068140226357187,34.92973417567859,16.791328125,11.08658203125,5.3818359375,0]
[null,5095,"High density polyethylene (100)",25265.379089399645,28674.119810836466,29141.70581455942,30351.130432710594,31808.889474176005,33367.699167465311,34945.80152523359]
[null,5095,"High density polyethylene (250)",4524,3055.1570000000002,2925.4615384615386,2228.9230769230771,1490.5923076923077,752.26153846153875,0]
[null,5095,"High density polyethylene (575)",11111,10509.664934349488,10256.203190150785,9818.2135343623995,9164.7611458625488,8410.679314083889,7651.8628669206155]
[null,5095,"Medium density polyethylene",67203,67209.89016284814,67206.434059051724,67183.327667045145,67158.836667929267,67134.345677086341,67109.393156052538]
[null,5095,"Other",8,7.3664825046040514,6.7831330613296972,6.2459788778358165,5.7513617659629981,5.2959132283268859,4.8765315177963959]
[null,5095,"Protected steel",7983,8009.7906449858538,7955.9817680627766,7934.0586911396995,7910.8202296012387,7887.581768062777,7863.9048449858537]
[null,5095,"PVC",0,0,0,0,0,0,0]
[null,5095,"Unprotected steel",34,31.867842183884481,27.46153846153846,20.92307692307692,13.992307692307691,7.0615384615384613,0]
[null,5096,"Cast Iron",19,19.772994756697997,15.229192690849001,10.685390625,7.0550976562500001,3.4248046875,0]
[null,5096,"High density polyethylene (100)",2784,6308.0410163367869,6871.5657214387902,8329.8675903524472,9924.9395792377836,11555.547613426741,13194.529322060882]
[null,5096,"High density polyethylene (250)",7932,4110.3755000000001,3935.8846153846152,2998.7692307692305,2005.4269230769228,1012.0846153846155,0]
[null,5096,"High density polyethylene (575)",8596,8167.6478293143746,7788.3330782893081,7282.6519345184224,6696.1717770633741,6074.1555743047047,5462.5217472811419]
[null,5096,"Medium density polyethylene",62448,62451.872478278834,62445.145758496175,62430.396663689055,62415.083679887808,62399.772191287826,62384.273735930779]
[null,5096,"Other",0,0,0,0,0,0,0]
[null,5096,"Protected steel",11516,11511.552912995112,11507.776851456651,11506.238389918188,11504.607620687419,11502.976851456649,11501.315312995112]
[null,5096,"PVC",0,0,0,0,0,0,0]
[null,5096,"Unprotected steel",0,0,0,0,0,0,0]
[null,5097,"Cast Iron",21,14.228984270093996,9.4042186975469981,4.5794531249999997,3.0236132812500003,1.4677734375,0]
[null,5097,"High density polyethylene (100)",812.31385667106599,2393.3124973573713,2608.5334975117544,2840.4875379178238,3265.1965652548774,3787.7376471077846,4310.1549661085901]
[null,5097,"High density polyethylene (250)",1355,0,0,0,0,0,0]
[null,5097,"High density polyethylene (575)",9614,9208.8970715199066,9009.4867978669336,8810.0765242139605,8416.4962397647105,7925.830949917322,7435.4276732127682]
[null,5097,"Medium density polyethylene",46419,46419.405248620962,46415.731344658991,46396.337465394863,46375.836155637538,46355.335107621198,46334.465090503116]
[null,5097,"Other",0,0,0,0,0,0,0]
[null,5097,"Protected steel",29669,29650.564709395792,29650.564709395792,29650.564709395792,29650.564709395792,29650.564709395792,29650.564709395792]
[null,5097,"PVC",0,0,0,0,0,0,0]
[null,5097,"Unprotected steel",11,2.6506024096385539,1.3253012048192769,0,0,0,0]
[null,5098,"Cast Iron",211,215.17853603171559,164.83243207835778,114.486328125,75.59033203125,36.6943359375,0]
[null,5098,"High density polyethylene (100)",11745.686340994655,12957.856839730603,14115.802742585833,18140.450869554497,22551.213594623474,27052.067440881834,31624.080169588968]
[null,5098,"High density polyethylene (250)",14626,12337.031000000001,11813.307692307691,9000.6153846153848,6019.1615384615379,3037.7076923076929,0]
[null,5098,"High density polyethylene (575)",9067,8593.7957710161954,8390.5431999912253,8061.0741370421965,7554.3437034518302,6963.8402768484893,6370.0983887066868]
[null,5098,"Medium density polyethylene",37170,36619.743778641503,36521.456705975688,35859.53362905261,35157.895167514151,34456.256705975691,33741.379782898766]
[null,5098,"Other",0,0,0,0,0,0,0]
[null,5098,"Protected steel",2940,3061.4492571438095,2853.7658725284246,2769.1504879130403,2679.4581802207322,2589.7658725284246,2498.3812571438093]
[null,5098,"PVC",0,0,0,0,0,0,0]
[null,5098,"Unprotected steel",38,35.617000087870892,30.692307692307693,23.384615384615383,15.638461538461538,7.8923076923076927,0]
[null,5106,"Cast Iron",0,0,0,0,0,0,0]
[null,5106,"High density polyethylene (100)",1104.3566771480182,1225.7937511892703,1487.2258701245655,1753.3448968443786,1887.3170310095968,2024.7462541770008,2157.130192450506]
[null,5106,"High density polyethylene (250)",764,271.20019270021169,135.60009635010584,0,0,0,0]
[null,5106,"High density polyethylene (575)",1372,1322.1924492924686,1234.513904909679,1146.8353605268892,1059.1568161440996,971.47827176130977,888.1836545976596]
[null,5106,"Medium density polyethylene",727,726.79584810289532,726.59175353453486,726.38771627881999,726.18373631965642,725.9798136409546,725.77594822662923]
[null,5106,"Other",967,890.42357274401468,819.9112087882271,754.98269685840432,695.19585346077747,640.14351147401237,589.45074721363937]
[null,5106,"Protected steel",6153,6151.9079179489145,6151.9079179489145,6151.9079179489145,6151.9079179489145,6151.9079179489145,6151.9079179489145]
[null,5106,"PVC",0,0,0,0,0,0,0]
[null,5106,"Unprotected steel",0,0,0,0,0,0,0]
[null,5107,"Cast Iron",36,16.113562248225591,8.0567811241127956,0,0,0,0]
[null,5107,"High density polyethylene (100)",5899.208090305865,7048.4363449366665,8271.7997285762704,9549.2511054992738,11312.961571067499,13423.935587772659,15527.277384874851]
[null,5107,"High density polyethylene (250)",903,320.54158901608787,160.27079450804393,0,0,0,0]
[null,5107,"High density polyethylene (575)",30178,28904.881953922304,28290.14605528508,27675.410156647857,26445.938359373406,24909.098612780344,23372.258866187283]
[null,5107,"Medium density polyethylene",52526,52546.836885571058,52546.836885571058,52546.836885571058,52546.836885571058,52546.836885571058,52546.836885571058]
[null,5107,"Other",0,0,0,0,0,0,0]
[null,5107,"Protected steel",16276,16265.461336509055,16265.461336509055,16265.461336509055,16265.461336509055,16265.461336509055,16265.461336509055]
[null,5107,"PVC",0,0,0,0,0,0,0]
[null,5107,"Unprotected steel",18,4.3373493975903612,2.1686746987951806,0,0,0,0]
[null,5108,"Cast Iron",85,38.045910863865977,19.022955431932989,0,0,0,0]
[null,5108,"High density polyethylene (100)",33962.208570785617,37907.13201502103,41559.598779879889,45386.040497841939,49855.730886955178,54748.968226007513,59534.244693628374]
[null,5108,"High density polyethylene (250)",635,286.47427784961775,191.47992738634733,76.92307692307692,51.442307692307693,25.961538461538467,0]
[null,5108,"High density polyethylene (575)",60371,57984.961168099275,55522.641617462272,53052.52722409361,49929.269594693906,46479.740347278683,43120.389657730339]
[null,5108,"Medium density polyethylene",83668,83681.126026944985,83676.363514253608,83656.863894893453,83636.326429519017,83615.789579495889,83594.907190805112]
[null,5108,"Other",0,0,0,0,0,0,0]
[null,5108,"Protected steel",59988,59950.928399899582,59950.928399899582,59950.928399899582,59950.928399899582,59950.928399899582,59950.928399899582]
[null,5108,"PVC",0,0,0,0,0,0,0]
[null,5108,"Unprotected steel",395,95.180722891566248,47.590361445783124,0,0,0,0]
[null,5109,"Cast Iron",1,1.2524999999999999,1.0078710937499999,0.76324218749999995,0.50393554687499997,0.24462890625,0]
[null,5109,"High density polyethylene (100)",47886,50582.21574796224,50941.972034579558,51301.878222018633,51661.810625653627,52021.74302928862,52363.691138801049]
[null,5109,"High density polyethylene (250)",0,0,0,0,0,0,0]
[null,5109,"High density polyethylene (575)",5626,5421.6464018532633,5062.1347441421995,4702.4731856093731,4342.8000886150076,3983.1269916206425,3641.4235110144573]
[null,5109,"Medium density polyethylene",56611,56595.10553941445,56579.213955877749,56563.326834922795,56547.444175296427,56531.565975745842,56515.692235018585]
[null,5109,"Other",0,0,0,0,0,0,0]
[null,5109,"Protected steel",18011,18008.429281288405,18008.429281288405,18008.429281288405,18008.429281288405,18008.429281288405,18008.429281288405]
[null,5109,"PVC",0,0,0,0,0,0,0]
[null,5109,"Unprotected steel",0,0,0,0,0,0,0]
[null,5110,"Cast Iron",0,0,0,0,0,0,0]
[null,5110,"High density polyethylene (100)",1572.3816864231019,1888.7532057569335,2696.9160945760959,3522.4798019515729,4396.3084033745581,5300.694133829702,6171.071066876425]
[null,5110,"High density polyethylene (250)",0,0,0,0,0,0,0]
[null,5110,"High density polyethylene (575)",11615,11183.103756187469,10516.591137016298,9850.0785178451242,9148.1215198672471,8428.4423324860145,7740.3165571230074]
[null,5110,"Medium density polyethylene",23430,23426.767427310962,23421.576631480173,23416.387293298372,23411.199412356236,23406.012988244547,23400.828020554211]
[null,5110,"Other",0,0,0,0,0,0,0]
[null,5110,"Protected steel",7474,7471.6305551449568,7471.6305551449568,7471.6305551449568,7471.6305551449568,7471.6305551449568,7471.6305551449568]
[null,5110,"PVC",0,0,0,0,0,0,0]
[null,5110,"Unprotected steel",0,0,0,0,0,0,0]
[null,5111,"Cast Iron",0,0,0,0,0,0,0]
[null,5111,"High density polyethylene (100)",414.21830810307813,482.5814669457294,516.26177873819279,554.07949878181648,594.94556424492589,638.86340482720595,682.19742622073306]
[null,5111,"High density polyethylene (250)",0,0,0,0,0,0,0]
[null,5111,"High density polyethylene (575)",0,0,0,0,0,0,0]
[null,5111,"Medium density polyethylene",8451,8448.6268395014686,8446.2543454200186,8443.8825175685106,8441.5113557598579,8439.1408598070248,8436.7710295230318]
[null,5111,"Other",0,0,0,0,0,0,0]
[null,5111,"Protected steel",36,35.994884937403633,35.994884937403633,35.994884937403633,35.994884937403633,35.994884937403633,35.994884937403633]
[null,5111,"PVC",0,0,0,0,0,0,0]
[null,5111,"Unprotected steel",0,0,0,0,0,0,0]
[null,5112,"Cast Iron",4,1.790395805358399,0.89519790267919952,0,0,0,0]
[null,5112,"High density polyethylene (100)",15591.895334480809,17096.818878473896,18983.548905431449,20922.190476540283,22949.167700890717,25078.530417864957,27137.675288328253]
[null,5112,"High density polyethylene (250)",435,154.41372228349749,77.206861141748746,0,0,0,0]
[null,5112,"High density polyethylene (575)",25976,24995.967889880696,23609.922583988635,22223.87727809657,20709.641468853588,19131.310407935147,17615.872087143758]
[null,5112,"Medium density polyethylene",9249,9247.8844658375419,9245.9019130978431,9243.9199170870343,9241.9384776487768,9239.9575946267796,9237.9772678647896]
[null,5112,"Other",0,0,0,0,0,0,0]
[null,5112,"Protected steel",37229,37218.651140025744,37218.651140025744,37218.651140025744,37218.651140025744,37218.651140025744,37218.651140025744]
[null,5112,"PVC",0,0,0,0,0,0,0]
[null,5112,"Unprotected steel",0,0,0,0,0,0,0]
[null,5113,"Cast Iron",11,7.3382916107167979,4.8140090866083991,2.2897265624999998,1.5118066406250001,0.73388671875,0]
[null,5113,"High density polyethylene (100)",27096.068903228945,34126.64746748445,35483.984746002243,36964.237527981575,38537.073720735701,40202.457321758411,41832.929666764496]
[null,5113,"High density polyethylene (250)",1623,0,0,0,0,0,0]
[null,5113,"High density polyethylene (575)",7937,5462.1104212890605,5107.8833547964832,4753.6562883039069,4395.660710271537,4035.78087646927,3693.4239704146416]
[null,5113,"Medium density polyethylene",47856,47845.333053907409,47833.046673186233,47820.763742654788,47808.484261344209,47796.208228285905,47783.935642511562]
[null,5113,"Other",0,0,0,0,0,0,0]
[null,5113,"Protected steel",17684,17681.487367584607,17681.487367584607,17681.487367584607,17681.487367584607,17681.487367584607,17681.487367584607]
[null,5113,"PVC",0,0,0,0,0,0,0]
[null,5113,"Unprotected steel",0,0,0,0,0,0,0]
[null,5114,"Cast Iron",0,0,0,0,0,0,0]
[null,5114,"High density polyethylene (100)",24219.818472925879,33132.061001099966,36234.820797419277,39471.950803798965,42814.826479818912,46263.139396739993,49595.252367905145]
[null,5114,"High density polyethylene (250)",0,0,0,0,0,0,0]
[null,5114,"High density polyethylene (575)",35771,29005.355932073413,27081.923841087111,25158.491750100813,23235.059659114511,21311.627568128213,19484.367081691227]
[null,5114,"Medium density polyethylene",89899,89873.101200859528,89847.750279529268,89821.751435138998,89795.713521735452,89769.682691175214,89743.64355685396]
[null,5114,"Other",0,0,0,0,0,0,0]
[null,5114,"Protected steel",46858,46860.576966497916,46845.000712651759,46838.654558805611,46831.927635728687,46825.200712651764,46818.346866497915]
[null,5114,"PVC",0,0,0,0,0,0,0]
[null,5114,"Unprotected steel",0,0,0,0,0,0,0]
[null,5115,"Cast Iron",0,0,0,0,0,0,0]
[null,5115,"High density polyethylene (100)",10502.996867758593,2739.5757911190312,3722.619891561556,4826.4245953348236,6019.2028810393285,7301.0548530346286,8565.8666024582017]
[null,5115,"High density polyethylene (250)",0,0,0,0,0,0,0]
[null,5115,"High density polyethylene (575)",0,0,0,0,0,0,0]
[null,5115,"Medium density polyethylene",59195,59178.377205572062,59161.759079060241,59145.145619153722,59128.536824542054,59111.932693915158,59095.333225963317]
[null,5115,"Other",0,0,0,0,0,0,0]
[null,5115,"Protected steel",16985,16982.586685050021,16982.586685050021,16982.586685050021,16982.586685050021,16982.586685050021,16982.586685050021]
[null,5115,"PVC",0,0,0,0,0,0,0]
[null,5115,"Unprotected steel",0,0,0,0,0,0,0]
[null,5116,"Cast Iron",0,0,0,0,0,0,0]
[null,5116,"High density polyethylene (100)",20126.215090713362,21980.773398196259,22742.303179338254,23589.41893104904,24486.717378330315,25432.891911504557,26359.232610565537]
[null,5116,"High density polyethylene (250)",0,0,0,0,0,0,0]
[null,5116,"High density polyethylene (575)",3423,3298.7352433878427,3079.9862219430256,2861.2372004982085,2642.4881790533914,2423.7391576085743,2215.9275872359976]
[null,5116,"Medium density polyethylene",34840,34810.926779057183,34797.809571573336,34765.372309832972,34731.576246152203,34697.782918224097,34663.538479126575]
[null,5116,"Other",0,0,0,0,0,0,0]
[null,5116,"Protected steel",8291,8289.8219726670413,8289.8219726670413,8289.8219726670413,8289.8219726670413,8289.8219726670413,8289.8219726670413]
[null,5116,"PVC",0,0,0,0,0,0,0]
[null,5116,"Unprotected steel",0,0,0,0,0,0,0]
[null,5117,"Cast Iron",0,0,0,0,0,0,0]
[null,5117,"High density polyethylene (100)",10769.743445100627,18752.412721487261,19606.837690642918,20566.066227660649,21602.511576905821,22716.260615172279,23815.157182041534]
[null,5117,"High density polyethylene (250)",0,0,0,0,0,0,0]
[null,5117,"High density polyethylene (575)",5923,19.273942409511204,17.995829517633801,16.717716625756402,15.439603733879002,14.161490842001601,12.947283594718069]
[null,5117,"Medium density polyethylene",11048,11044.897565118001,11041.796001443659,11038.695308732327,11035.595486739427,11032.496535220447,11029.398453930948]
[null,5117,"Other",0,0,0,0,0,0,0]
[null,5117,"Protected steel",2003,2002.7154036005411,2002.7154036005411,2002.7154036005411,2002.7154036005411,2002.7154036005411,2002.7154036005411]
[null,5117,"PVC",0,0,0,0,0,0,0]
[null,5117,"Unprotected steel",0,0,0,0,0,0,0]
[null,5118,"Cast Iron",0,0,0,0,0,0,0]
[null,5118,"High density polyethylene (100)",38904.512519842596,42655.731890109892,44444.719510564406,47677.072636721889,49715.054107024363,51858.782764138516,53951.18499155801]
[null,5118,"High density polyethylene (250)",0,0,0,0,0,0,0]
[null,5118,"High density polyethylene (575)",9732,9378.7003764681522,8756.7706432806081,8134.8409100930658,7512.9111769055226,6890.9814437179793,6300.1481971898138]
[null,5118,"Medium density polyethylene",36147,36136.849410420022,36126.701671269366,36116.556781747597,36106.414741054497,36096.275548390076,36086.13920295456]
[null,5118,"Other",0,0,0,0,0,0,0]
[null,5118,"Protected steel",14207,14204.981397380372,14204.981397380372,14204.981397380372,14204.981397380372,14204.981397380372,14204.981397380372]
[null,5118,"PVC",0,0,0,0,0,0,0]
[null,5118,"Unprotected steel",10,10,10,10,10,10,10]
[null,5120,"Cast Iron",0,0,0,0,0,0,0]
[null,5120,"High density polyethylene (100)",10108.741045742889,11739.886497398649,12536.497419019486,13430.660669562212,14396.698189448749,15434.690844566983,16458.793521868443]
[null,5120,"High density polyethylene (250)",0,0,0,0,0,0,0]
[null,5120,"High density polyethylene (575)",39,37.584187698546849,35.091867559385918,32.599547420224987,30.107227281064056,27.614907141903124,25.247203009700236]
[null,5120,"Medium density polyethylene",13417,13413.232316363887,13409.465690746703,13405.700122851344,13401.935612380785,13398.172159038086,13394.409762526389]
[null,5120,"Other",0,0,0,0,0,0,0]
[null,5120,"Protected steel",4466,4465.3654480679061,4465.3654480679061,4465.3654480679061,4465.3654480679061,4465.3654480679061,4465.3654480679061]
[null,5120,"PVC",0,0,0,0,0,0,0]
[null,5120,"Unprotected steel",0,0,0,0,0,0,0]
[null,5121,"Cast Iron",0,0,0,0,0,0,0]
[null,5121,"High density polyethylene (100)",3129.04601049757,3841.2571738981846,4242.0879678866158,4692.1582298641169,5178.5069776933087,5701.1750283730489,6216.8950225616391]
[null,5121,"High density polyethylene (250)",0,0,0,0,0,0,0]
[null,5121,"High density polyethylene (575)",0,0,0,0,0,0,0]
[null,5121,"Medium density polyethylene",4824,4822.6453524736817,4821.2910853515759,4819.9371985268599,4818.5836918927407,4817.2305653424546,4815.8778187692697]
[null,5121,"Other",0,0,0,0,0,0,0]
[null,5121,"Protected steel",1857,1856.7361480210707,1856.7361480210707,1856.7361480210707,1856.7361480210707,1856.7361480210707,1856.7361480210707]
[null,5121,"PVC",0,0,0,0,0,0,0]
[null,5121,"Unprotected steel",0,0,0,0,0,0,0]
[null,5125,"Cast Iron",0,0,0,0,0,0,0]
[null,5125,"High density polyethylene (100)",5073.4130757394214,6678.9730278338429,12516.849804001442,18475.972036029212,24524.425077967069,30662.309436092492,36540.540867125666]
[null,5125,"High density polyethylene (250)",0,0,0,0,0,0,0]
[null,5125,"High density polyethylene (575)",75907,73151.357323938355,68300.471559751459,63449.58579556457,58598.700031377673,53747.814267190784,49139.472791213237]
[null,5125,"Medium density polyethylene",33583,33573.587710726686,33564.167356757083,33554.749648156299,33545.334584181481,33535.922164089985,33526.512387139366]
[null,5125,"Other",0,0,0,0,0,0,0]
[null,5125,"Protected steel",19040,19036.643224068121,19036.643224068121,19036.643224068121,19036.643224068121,19036.643224068121,19036.643224068121]
[null,5125,"PVC",0,0,0,0,0,0,0]
[null,5125,"Unprotected steel",0,0,0,0,0,0,0]
[null,5126,"Cast Iron",0,0,0,0,0,0,0]
[null,5126,"High density polyethylene (100)",2167.9988991539908,2395.6351090443059,2537.7593029366653,2681.0471428996639,2957.8439362126214,3301.8248443782113,3645.6415533969639]
[null,5126,"High density polyethylene (250)",0,0,0,0,0,0,0]
[null,5126,"High density polyethylene (575)",6512,6237.2785235582887,6104.6269173575593,5971.9753111568298,5706.6720987553717,5375.0430832535485,5043.4140677517253]
[null,5126,"Medium density polyethylene",16291,16297.436161378268,16297.425212701284,16297.414267098846,16297.403324570088,16297.392385114146,16297.381448730159]
[null,5126,"Other",0,0,0,0,0,0,0]
[null,5126,"Protected steel",24831,24815.66596502273,24815.66596502273,24815.66596502273,24815.66596502273,24815.66596502273,24815.66596502273]
[null,5126,"PVC",0,0,0,0,0,0,0]
[null,5126,"Unprotected steel",0,0,0,0,0,0,0]
[null,5127,"Cast Iron",0,0,0,0,0,0,0]
[null,5127,"High density polyethylene (100)",10373.825810885603,11044.485374065807,12786.930392259877,14537.326991936645,16392.317132809076,18302.53990515996,20132.691616676184]
[null,5127,"High density polyethylene (250)",0,0,0,0,0,0,0]
[null,5127,"High density polyethylene (575)",29555,28453.548262858643,26775.832593890711,25098.116924922782,23321.666253612268,21495.848081130451,19748.978941979909]
[null,5127,"Medium density polyethylene",692,692.00147720915334,691.88834088033718,691.77523632180487,691.66216352463437,691.54912247990694,691.43611317870591]
[null,5127,"Other",0,0,0,0,0,0,0]
[null,5127,"Protected steel",10983,10979.143898029339,10979.143898029339,10979.143898029339,10979.143898029339,10979.143898029339,10979.143898029339]
[null,5127,"PVC",0,0,0,0,0,0,0]
[null,5127,"Unprotected steel",0,0,0,0,0,0,0]
[null,5157,"Cast Iron",0,0,0,0,0,0,0]
[null,5157,"High density polyethylene (100)",370.93256557940384,421.96227084783254,444.50352118810099,469.81381819646379,497.16428388401357,526.55721364871658,555.55941025844697]
[null,5157,"High density polyethylene (250)",0,0,0,0,0,0,0]
[null,5157,"High density polyethylene (575)",0,0,0,0,0,0,0]
[null,5157,"Medium density polyethylene",0,0,0,0,0,0,0]
[null,5157,"Other",0,0,0,0,0,0,0]
[null,5157,"Protected steel",0,0,0,0,0,0,0]
[null,5157,"PVC",0,0,0,0,0,0,0]
[null,5157,"Unprotected steel",0,0,0,0,0,0,0]
[null,5158,"Cast Iron",0,0,0,0,0,0,0]
[null,5158,"High density polyethylene (100)",655.04962321872779,760.19684397001356,1571.4651146191445,2389.004144648939,3211.1633232051408,4037.9478484263382,4825.8364452851465]
[null,5158,"High density polyethylene (250)",0,0,0,0,0,0,0]
[null,5158,"High density polyethylene (575)",11896,11464.140945177265,10703.919397088586,9943.6978489999092,9183.4763009112321,8423.2547528225532,7701.0442821383094]
[null,5158,"Medium density polyethylene",29164,29155.810335726052,29147.622971225828,29139.43790585352,29131.255138963501,29123.074669910322,29114.896498048722]
[null,5158,"Other",0,0,0,0,0,0,0]
[null,5158,"Protected steel",118708,118691.10051347406,118691.10051347406,118691.10051347406,118691.10051347406,118691.10051347406,118691.10051347406]
[null,5158,"PVC",0,0,0,0,0,0,0]
[null,5158,"Unprotected steel",0,0,0,0,0,0,0]
[null,5159,"Cast Iron",0,0,0,0,0,0,0]
[null,5159,"High density polyethylene (100)",3961.0082989192247,9593.5806827638226,10718.179887211709,11863.369162409508,13023.728719108967,14199.275625424923,15324.067767669691]
[null,5159,"High density polyethylene (250)",0,0,0,0,0,0,0]
[null,5159,"High density polyethylene (575)",19884,14431.364379121515,13474.37735132831,12517.390323535106,11560.403295741904,10603.4162679487,9694.2785915451568]
[null,5159,"Medium density polyethylene",20594,20588.26433886349,20582.502527417782,20576.742333970338,20570.983758066799,20565.226799252938,20559.471457074651]
[null,5159,"Other",0,0,0,0,0,0,0]
[null,5159,"Protected steel",173344,173319.3704052582,173319.3704052582,173319.3704052582,173319.3704052582,173319.3704052582,173319.3704052582]
[null,5159,"PVC",0,0,0,0,0,0,0]
[null,5159,"Unprotected steel",0,0,0,0,0,0,0]
[null,5160,"Cast Iron",0,0,0,0,0,0,0]
[null,5160,"High density polyethylene (100)",348.46913373758508,403.62953191121272,462.2221308764822,524.07940353993297,588.34201126094661,655.0126602869309,719.62180308721327]
[null,5160,"High density polyethylene (250)",0,0,0,0,0,0,0]
[null,5160,"High density polyethylene (575)",501,482.81225735825569,450.79552941672682,418.77880147519789,386.76207353366902,354.7453455921401,324.3294540476877]
[null,5160,"Medium density polyethylene",3082,3081.1345307470747,3080.2693045301739,3079.4043212810498,3078.5395809314737,3077.6750834132354,3076.8108286581451]
[null,5160,"Other",0,0,0,0,0,0,0]
[null,5160,"Protected steel",12936,12934.161987507039,12934.161987507039,12934.161987507039,12934.161987507039,12934.161987507039,12934.161987507039]
[null,5160,"PVC",0,0,0,0,0,0,0]
[null,5160,"Unprotected steel",0,0,0,0,0,0,0]
[null,5161,"Cast Iron",0,0,0,0,0,0,0]
[null,5161,"High density polyethylene (100)",291.24752309647914,336.14846434233488,399.51170079126962,465.49314089914174,533.40361209278217,603.24528472902261,670.61501357774227]
[null,5161,"High density polyethylene (250)",0,0,0,0,0,0,0]
[null,5161,"High density polyethylene (575)",658,634.11270527291867,592.06279113015216,550.01287698738565,507.9629628446192,465.91304870185274,425.96563026622459]
[null,5161,"Medium density polyethylene",9275,9272.3954486304738,9269.7916286558611,9267.1885398707782,9264.5861820698956,9261.9845550479422,9259.3836585997069]
[null,5161,"Other",0,0,0,0,0,0,0]
[null,5161,"Protected steel",57241,57232.866908386706,57232.866908386706,57232.866908386706,57232.866908386706,57232.866908386706,57232.866908386706]
[null,5161,"PVC",0,0,0,0,0,0,0]
[null,5161,"Unprotected steel",0,0,0,0,0,0,0]
[null,5162,"Cast Iron",0,0,0,0,0,0,0]
[null,5162,"High density polyethylene (100)",7508.5599687384065,28882.363003794504,31048.222152868933,33258.353725130917,35501.104181061302,37776.510220233024,39955.395976459287]
[null,5162,"High density polyethylene (250)",0,0,0,0,0,0,0]
[null,5162,"High density polyethylene (575)",47630,27226.371047675526,25420.908776609511,23615.446505543492,21809.984234477477,20004.521963411462,18289.332805898746]
[null,5162,"Medium density polyethylene",22039,22032.81113664334,22026.624011207172,22020.438623203459,22014.254972144307,22008.073057541955,22001.892878908784]
[null,5162,"Other",17,17,17,17,17,17,17]
[null,5162,"Protected steel",139450,139430.18623669268,139430.18623669268,139430.18623669268,139430.18623669268,139430.18623669268,139430.18623669268]
[null,5162,"PVC",0,0,0,0,0,0,0]
[null,5162,"Unprotected steel",0,0,0,0,0,0,0]
[null,5163,"Cast Iron",0,0,0,0,0,0,0]
[null,5163,"High density polyethylene (100)",4968.9177467324334,5769.0053694005519,6895.490370888404,8069.7710572776814,9279.2664839816425,10524.016271176857,11725.151368803565]
[null,5163,"High density polyethylene (250)",0,0,0,0,0,0,0]
[null,5163,"High density polyethylene (575)",11539,11120.101073167489,10382.693840198823,9645.2866072301567,8907.8793742614907,8170.4721412928238,7469.9352699725914]
[null,5163,"Medium density polyethylene",7747,7744.8245326728056,7742.6496762476499,7740.4754305529823,7738.3017954173019,7736.1287706691546,7733.9563561371351]
[null,5163,"Other",0,0,0,0,0,0,0]
[null,5163,"Protected steel",66066,66056.61300762523,66056.61300762523,66056.61300762523,66056.61300762523,66056.61300762523,66056.61300762523]
[null,5163,"PVC",0,0,0,0,0,0,0]
[null,5163,"Unprotected steel",0,0,0,0,0,0,0]
[null,5164,"Cast Iron",0,0,0,0,0,0,0]
[null,5164,"High density polyethylene (100)",218.5264628783778,245.96141184015062,258.87353269777805,273.17556413977962,288.50164912113968,304.85293980659611,320.92822167758857]
[null,5164,"High density polyethylene (250)",0,0,0,0,0,0,0]
[null,5164,"High density polyethylene (575)",25,24.092428011889005,22.494786897042253,20.897145782195505,19.299504667348753,17.701863552502001,16.184104493397587]
[null,5164,"Medium density polyethylene",3247,3246.0881964100427,3245.176648867448,3244.2653573003145,3243.3543216367602,3242.4435418049243,3241.5330177329652]
[null,5164,"Other",0,0,0,0,0,0,0]
[null,5164,"Protected steel",37019,37013.740152715138,37013.740152715138,37013.740152715138,37013.740152715138,37013.740152715138,37013.740152715138]
[null,5164,"PVC",0,0,0,0,0,0,0]
[null,5164,"Unprotected steel",0,0,0,0,0,0,0]
[null,5165,"Cast Iron",2,2.5049999999999999,2.0157421874999999,1.5264843749999999,1.0078710937499999,0.4892578125,0]
[null,5165,"High density polyethylene (100)",27303.984588155869,29018.679852027777,29153.510789927135,29304.632772815436,29467.78697126171,29642.957534239722,29815.713681073066]
[null,5165,"High density polyethylene (250)",0,0,0,0,0,0,0]
[null,5165,"High density polyethylene (575)",27,26.019822252840125,24.294369848805633,22.568917444771145,20.843465040736653,19.118012636702161,17.478832852869395]
[null,5165,"Medium density polyethylene",3471,3470.0252940373448,3469.0508617859291,3468.0767031688915,3467.1028181093916,3466.1292065306102,3465.15586835575]
[null,5165,"Other",8,8,8,8,8,8,8]
[null,5165,"Protected steel",7076,7074.9946060296697,7074.9946060296697,7074.9946060296697,7074.9946060296697,7074.9946060296697,7074.9946060296697]
[null,5165,"PVC",0,0,0,0,0,0,0]
[null,5165,"Unprotected steel",0,0,0,0,0,0,0]
[null,5166,"Cast Iron",0,0,0,0,0,0,0]
[null,5166,"High density polyethylene (100)",13235.055127448773,13985.179711721255,14058.520648430875,14132.314114167964,14206.440992685311,14280.901659106315,14351.815612673185]
[null,5166,"High density polyethylene (250)",0,0,0,0,0,0,0]
[null,5166,"High density polyethylene (575)",1090,1050.4298613183607,980.77270871104236,911.11555610372397,841.45840349640571,771.80125088908733,705.62695591213492]
[null,5166,"Medium density polyethylene",109,108.96939125614249,108.93879110765378,108.90819955212019,108.87761658712868,108.84704221026692,108.81647641912323]
[null,5166,"Other",0,0,0,0,0,0,0]
[null,5166,"Protected steel",468,467.93350418624721,467.93350418624721,467.93350418624721,467.93350418624721,467.93350418624721,467.93350418624721]
[null,5166,"PVC",0,0,0,0,0,0,0]
[null,5166,"Unprotected steel",0,0,0,0,0,0,0]
[null,5167,"Cast Iron",0,0,0,0,0,0,0]
[null,5167,"High density polyethylene (100)",1898.7506705429421,2211.0402565213458,2435.7459523621446,2679.3177988482084,2936.7897829111453,3208.1775436242597,3473.3468005295099]
[null,5167,"High density polyethylene (250)",0,0,0,0,0,0,0]
[null,5167,"High density polyethylene (575)",1113,1072.5948950892985,1001.4679126563211,930.34093022334378,859.21394779036643,788.08696535738909,720.5163320460606]
[null,5167,"Medium density polyethylene",3704,3702.9652844232769,3701.9276867277335,3700.8903804043193,3699.8533653712129,3698.8166415466158,3697.7802088487529]
[null,5167,"Other",0,0,0,0,0,0,0]
[null,5167,"Protected steel",32742,32737.347850568603,32737.347850568603,32737.347850568603,32737.347850568603,32737.347850568603,32737.347850568603]
[null,5167,"PVC",0,0,0,0,0,0,0]
[null,5167,"Unprotected steel",0,0,0,0,0,0,0]
[null,5168,"Cast Iron",0,0,0,0,0,0,0]
[null,5168,"High density polyethylene (100)",1474.6448190294309,1702.5318076442877,2524.1035013931692,3358.9817034498205,4203.6638289259099,5058.16090823579,5875.1177949287357]
[null,5168,"High density polyethylene (250)",0,0,0,0,0,0,0]
[null,5168,"High density polyethylene (575)",11161,10755.823561627727,10042.572662315544,9329.3217630033596,8616.0708636911768,7902.819964378994,7225.2316100324188]
[null,5168,"Medium density polyethylene",13644,13640.168571548698,13636.338219016772,13632.508942102091,13628.680740502605,13624.853613916348,13621.027562041445]
[null,5168,"Other",0,0,0,0,0,0,0]
[null,5168,"Protected steel",19712,19709.199219058344,19709.199219058344,19709.199219058344,19709.199219058344,19709.199219058344,19709.199219058344]
[null,5168,"PVC",0,0,0,0,0,0,0]
[null,5168,"Unprotected steel",0,0,0,0,0,0,0]
[null,5169,"Cast Iron",0,0,0,0,0,0,0]
[null,5169,"High density polyethylene (100)",14010.672793290312,16646.912302456247,20131.785632626237,23786.357348097721,27565.9588561653,31470.730828105112,35246.384376540867]
[null,5169,"High density polyethylene (250)",0,0,0,0,0,0,0]
[null,5169,"High density polyethylene (575)",32915,31720.090720453063,29616.63642864583,27513.182136838601,25409.727845031368,23306.273553224135,21307.991976007266]
[null,5169,"Medium density polyethylene",60894,60876.900102307714,60859.805006508897,60842.71471125511,60825.6292151983,60808.548516990777,60791.472615285238]
[null,5169,"Other",0,0,0,0,0,0,0]
[null,5169,"Protected steel",29830,29825.761602298622,29825.761602298622,29825.761602298622,29825.761602298622,29825.761602298622,29825.761602298622]
[null,5169,"PVC",0,0,0,0,0,0,0]
[null,5169,"Unprotected steel",0,0,0,0,0,0,0]
[null,5170,"Cast Iron",0,0,0,0,0,0,0]
[null,5170,"High density polyethylene (100)",4611.9671722854418,5355.9476768523255,12231.966262643469,12652.472761635243,13105.756912286013,13591.855592798909,14070.9833204264]
[null,5170,"High density polyethylene (250)",0,0,0,0,0,0,0]
[null,5170,"High density polyethylene (575)",217,209.12227514319656,195.25475026632677,181.38722538945697,167.51970051258718,153.65217563571736,140.47802700269108]
[null,5170,"Medium density polyethylene",754,753.78826612047192,753.57659169881617,753.36497671833615,753.1534211623399,752.94192501414022,752.7304882570545]
[null,5170,"Other",0,0,0,0,0,0,0]
[null,5170,"Protected steel",3314,3313.52913007099,3313.52913007099,3313.52913007099,3313.52913007099,3313.52913007099,3313.52913007099]
[null,5170,"PVC",0,0,0,0,0,0,0]
[null,5170,"Unprotected steel",0,0,0,0,0,0,0]
[null,5171,"Cast Iron",0,0,0,0,0,0,0]
[null,5171,"High density polyethylene (100)",24685.136507946161,28659.589146967824,30592.260163496288,32762.347301937039,35107.357074019368,37627.486285557243,40114.114310052995]
[null,5171,"High density polyethylene (250)",0,0,0,0,0,0,0]
[null,5171,"High density polyethylene (575)",0,0,0,0,0,0,0]
[null,5171,"Medium density polyethylene",2,1.9994383716723392,1.9988769010578675,1.9983155881122971,1.9977544327913521,1.9971934350507694,1.996632594846298]
[null,5171,"Other",0,0,0,0,0,0,0]
[null,5171,"Protected steel",0,0,0,0,0,0,0]
[null,5171,"PVC",0,0,0,0,0,0,0]
[null,5171,"Unprotected steel",0,0,0,0,0,0,0]
[null,5173,"Cast Iron",0,0,0,0,0,0,0]
[null,5173,"High density polyethylene (100)",2938.5191522877526,3416.3243141065168,6255.5286801863249,6873.4255415079042,7512.4623607776357,8172.6629226055747,8811.0330135657659]
[null,5173,"High density polyethylene (250)",0,0,0,0,0,0,0]
[null,5173,"High density polyethylene (575)",5565,5362.9744754464928,5007.3395632816064,4651.7046511167191,4296.0697389518327,3940.4348267869455,3602.581660230303]
[null,5173,"Medium density polyethylene",35190,35180.11814957481,35170.239074113182,35160.36277283587,35150.489244963843,35140.61848971829,35130.750506320619]
[null,5173,"Other",8,8,8,8,8,8,8]
[null,5173,"Protected steel",5549,5548.2115699347987,5548.2115699347987,5548.2115699347987,5548.2115699347987,5548.2115699347987,5548.2115699347987]
[null,5173,"PVC",0,0,0,0,0,0,0]
[null,5173,"Unprotected steel",0,0,0,0,0,0,0]
[null,5250,"Cast Iron",0,0,0,0,0,0,0]
[null,5250,"High density polyethylene (100)",0,0,2371,2371,3574.9825000000001,6918.84,8122.8225000000002]
[null,5250,"High density polyethylene (250)",0,0,0,0,0,0,0]
[null,5250,"High density polyethylene (575)",0,0,0,0,0,0,0]
[null,5250,"Medium density polyethylene",0,0,0,0,0,0,0]
[null,5250,"Other",0,0,0,0,0,0,0]
[null,5250,"Protected steel",0,0,0,0,0,0,0]
[null,5250,"PVC",0,0,0,0,0,0,0]
[null,5250,"Unprotected steel",0,0,0,0,0,0,0]
[null,5251,"Cast Iron",0,0,0,0,0,0,0]
[null,5251,"High density polyethylene (100)",845,29786,32721.239999999998,40260.846999999994,47220.453999999998,54180.061000000002,61139.668000000005]
[null,5251,"High density polyethylene (250)",0,0,0,0,0,0,0]
[null,5251,"High density polyethylene (575)",0,0,0,0,0,0,0]
[null,5251,"Medium density polyethylene",0,0,0,0,0,0,0]
[null,5251,"Other",0,0,0,0,0,0,0]
[null,5251,"Protected steel",0,0,0,0,0,0,0]
[null,5251,"PVC",0,0,0,0,0,0,0]
[null,5251,"Unprotected steel",0,0,0,0,0,0,0]
[null,5252,"Cast Iron",0,0,0,0,0,0,0]
[null,5252,"High density polyethylene (100)",0,0,12329,17729,18435.559230769231,19788.07041512831,20494.629645897541]
[null,5252,"High density polyethylene (250)",0,0,0,0,0,0,0]
[null,5252,"High density polyethylene (575)",0,0,0,0,0,0,0]
[null,5252,"Medium density polyethylene",0,0,0,0,0,0,0]
[null,5252,"Other",0,0,0,0,0,0,0]
[null,5252,"Protected steel",0,0,500,500,500,500,500]
[null,5252,"PVC",0,0,0,0,0,0,0]
[null,5252,"Unprotected steel",0,0,0,0,0,0,0]
[null,5253,"Cast Iron",0,0,0,0,0,0,0]
[null,5253,"High density polyethylene (100)",881.68524014864465,1037.2443170647502,1118.1072220236556,1208.69950107318,1306.4601548982137,1411.3972486519224,1514.8783777566073]
[null,5253,"High density polyethylene (250)",0,0,0,0,0,0,0]
[null,5253,"High density polyethylene (575)",26,25.056125132364567,23.394578372923945,21.733031613483327,20.071484854042705,18.409938094602083,16.831468673133493]
[null,5253,"Medium density polyethylene",30942,30933.311048142761,30924.62453626627,30915.940463685351,30907.258829715011,30898.579633670455,30889.902874867079]
[null,5253,"Other",0,0,0,0,0,0,0]
[null,5253,"Protected steel",0,0,0,0,0,0,0]
[null,5253,"PVC",0,0,0,0,0,0,0]
[null,5253,"Unprotected steel",0,0,0,0,0,0,0]
[null,5254,"Cast Iron",0,0,0,0,0,0,0]
[null,5254,"High density polyethylene (100)",0,0,0,0,9500,9500,9500]
[null,5254,"High density polyethylene (250)",0,0,0,0,0,0,0]
[null,5254,"High density polyethylene (575)",0,0,0,0,0,0,0]
[null,5254,"Medium density polyethylene",0,0,0,0,0,0,0]
[null,5254,"Other",0,0,0,0,0,0,0]
[null,5254,"Protected steel",0,0,0,0,500,500,500]
[null,5254,"PVC",0,0,0,0,0,0,0]
[null,5254,"Unprotected steel",0,0,0,0,0,0,0]
[null,5290,"Cast Iron",0,0,0,0,0,0,0]
[null,5290,"High density polyethylene (100)",30934.121941503112,34806.024106665456,36095.01191905528,37463.513774363309,39550.119885889115,42024.680675274292,44488.483576045619]
[null,5290,"High density polyethylene (250)",18,11.274792593719495,9.4968193737828237,6.1538461538461533,4.115384615384615,2.0769230769230775,0]
[null,5290,"High density polyethylene (575)",32544,31171.09114545161,30507.98489852254,29844.878651593466,28518.921780313703,26861.539596858587,25204.170194532391]
[null,5290,"Medium density polyethylene",107741,107782.34192860265,107782.07811418132,107780.50428992728,107778.83816791129,107777.17205582287,107775.47518442845]
[null,5290,"Other",22,22,22,22,22,22,22]
[null,5290,"Protected steel",44309,44285.889798370728,44285.889798370728,44285.889798370728,44285.889798370728,44285.889798370728,44285.889798370728]
[null,5290,"PVC",0,0,0,0,0,0,0]
[null,5290,"Unprotected steel",28,6.7469879518072284,3.3734939759036142,0,0,0,0]
[null,5291,"Cast Iron",0,0,0,0,0,0,0]
[null,5291,"High density polyethylene (100)",3549.0965368965872,4367.7207809377715,4732.1522796296604,5141.3518285391829,5583.5354274954834,6058.7401869209361,6527.6278402805856]
[null,5291,"High density polyethylene (250)",0,0,0,0,0,0,0]
[null,5291,"High density polyethylene (575)",0,0,0,0,0,0,0]
[null,5291,"Medium density polyethylene",3800,3801.5074470770669,3801.5074470770669,3801.5074470770669,3801.5074470770669,3801.5074470770669,3801.5074470770669]
[null,5291,"Other",0,0,0,0,0,0,0]
[null,5291,"Protected steel",0,0,0,0,0,0,0]
[null,5291,"PVC",0,0,0,0,0,0,0]
[null,5291,"Unprotected steel",0,0,0,0,0,0,0]
[null,5308,"Cast Iron",0,0,0,0,0,0,0]
[null,5308,"High density polyethylene (100)",0,0,0,0,0,0,0]
[null,5308,"High density polyethylene (250)",0,0,0,0,0,0,0]
[null,5308,"High density polyethylene (575)",0,0,0,0,0,0,0]
[null,5308,"Medium density polyethylene",90,89.974726725255266,89.949460547604048,89.924201465053372,89.898949475610848,89.873704577284627,89.848466768083412]
[null,5308,"Other",0,0,0,0,0,0,0]
[null,5308,"Protected steel",0,0,0,0,0,0,0]
[null,5308,"PVC",0,0,0,0,0,0,0]
[null,5308,"Unprotected steel",0,0,0,0,0,0,0]
[null,5343,"Cast Iron",0,0,0,0,0,0,0]
[null,5343,"High density polyethylene (100)",0,0,46.139875396774187,92.279750793548374,138.41962619032245,184.55950158709663,228.39238321403212]
[null,5343,"High density polyethylene (250)",0,0,0,0,0,0,0]
[null,5343,"High density polyethylene (575)",722,695.78932098335451,649.64944558658033,603.50957018980614,557.36969479303207,511.22981939625788,467.39693776932239]
[null,5343,"Medium density polyethylene",6697,6695.119387544828,6693.2393031922702,6691.3597467940272,6689.480718201843,6687.6022172675011,6685.7242438428284]
[null,5343,"Other",0,0,0,0,0,0,0]
[null,5343,"Protected steel",806,805.47811730316403,805.47811730316403,805.47811730316403,805.47811730316403,805.47811730316403,805.47811730316403]
[null,5343,"PVC",0,0,0,0,0,0,0]
[null,5343,"Unprotected steel",8,1.9277108433734937,0.96385542168674687,0,0,0,0]
[null,5344,"Cast Iron",0,0,0,0,0,0,0]
[null,5344,"High density polyethylene (100)",0,0,91.78701447392902,183.57402894785804,183.98143560080868,184.49069391699697,184.99995223318527]
[null,5344,"High density polyethylene (250)",516,183.16662229490737,91.583311147453685,0,0,0,0]
[null,5344,"High density polyethylene (575)",10,9.5781304108696084,9.3744270843942878,9.1707237579189655,8.7633171049683227,8.2540587887800196,7.7448004725917166]
[null,5344,"Medium density polyethylene",0,0,0,0,0,0,0]
[null,5344,"Other",0,0,0,0,0,0,0]
[null,5344,"Protected steel",5,4.9967625142876182,4.9967625142876182,4.9967625142876182,4.9967625142876182,4.9967625142876182,4.9967625142876182]
[null,5344,"PVC",0,0,0,0,0,0,0]
[null,5344,"Unprotected steel",0,0,0,0,0,0,0]
[null,5352,"Cast Iron",0,0,0,0,0,0,0]
[null,5352,"High density polyethylene (100)",9571.4542023732047,11170.119206269897,11962.571333991009,12852.371075121582,13813.894256004898,14847.22157283016,15866.812414732549]
[null,5352,"High density polyethylene (250)",0,0,0,0,0,0,0]
[null,5352,"High density polyethylene (575)",0,0,0,0,0,0,0]
[null,5352,"Medium density polyethylene",22104,22097.792883722694,22091.587510491554,22085.383879817109,22079.181991210025,22072.981844181104,22066.783438241288]
[null,5352,"Other",0,0,0,0,0,0,0]
[null,5352,"Protected steel",129,128.98167102569636,128.98167102569636,128.98167102569636,128.98167102569636,128.98167102569636,128.98167102569636]
[null,5352,"PVC",0,0,0,0,0,0,0]
[null,5352,"Unprotected steel",0,0,0,0,0,0,0]
[null,5353,"Cast Iron",0,0,0,0,0,0,0]
[null,5353,"High density polyethylene (100)",1149.2837384973757,1358.4994286859703,1596.0938372785649,1846.9624306769656,2107.6111322962161,2378.0509457561393,2640.140835572558]
[null,5353,"High density polyethylene (250)",0,0,0,0,0,0,0]
[null,5353,"High density polyethylene (575)",2027,1953.4140632039605,1823.8773216121858,1694.3405800204114,1564.8038384286369,1435.2670968368623,1312.2071923246763]
[null,5353,"Medium density polyethylene",3685,3683.965199806285,3682.9306901991213,3681.8964710969076,3680.8625424180664,3679.8289040810428,3678.7955560043042]
[null,5353,"Other",0,0,0,0,0,0,0]
[null,5353,"Protected steel",7470,7468.9386245112537,7468.9386245112537,7468.9386245112537,7468.9386245112537,7468.9386245112537,7468.9386245112537]
[null,5353,"PVC",0,0,0,0,0,0,0]
[null,5353,"Unprotected steel",0,0,0,0,0,0,0]
[null,5355,"Cast Iron",0,0,0,0,0,0,0]
[null,5355,"High density polyethylene (100)",4661.7367548762613,5502.8233793581749,6292.4695237892774,7135.2662799468744,8017.2231609855207,8938.3842260420533,9834.1964964955041]
[null,5355,"High density polyethylene (250)",0,0,0,0,0,0,0]
[null,5355,"High density polyethylene (575)",5586,5383.2121149764798,5026.2351842751214,4669.2582535737638,4312.2813228724053,3955.3043921710478,3616.1763080047576]
[null,5355,"Medium density polyethylene",21949,21942.836409918087,21936.674550659569,21930.514421738404,21924.356022668693,21918.199352964668,21912.044412140698]
[null,5355,"Other",0,0,0,0,0,0,0]
[null,5355,"Protected steel",4686,4685.3341893520392,4685.3341893520392,4685.3341893520392,4685.3341893520392,4685.3341893520392,4685.3341893520392]
[null,5355,"PVC",0,0,0,0,0,0,0]
[null,5355,"Unprotected steel",0,0,0,0,0,0,0]
[null,5372,"Cast Iron",0,0,0,0,0,0,0]
[null,5372,"High density polyethylene (100)",2135.1209531745117,2568.2773380903277,2844.4630631636683,3149.3951559820498,3475.5068987462328,3822.8221207238203,4163.9721293579541]
[null,5372,"High density polyethylene (250)",0,0,0,0,0,0,0]
[null,5372,"High density polyethylene (575)",660,636.04009951386979,593.86237408191562,551.68464864996133,509.5069232180071,467.32919778605287,427.26035862569637]
[null,5372,"Medium density polyethylene",6545,6543.1620712977301,6541.324658711872,6539.4877620974921,6537.6513813096999,6535.8155162036428,6533.9801666345102]
[null,5372,"Other",0,0,0,0,0,0,0]
[null,5372,"Protected steel",2599,2598.6307208975568,2598.6307208975568,2598.6307208975568,2598.6307208975568,2598.6307208975568,2598.6307208975568]
[null,5372,"PVC",0,0,0,0,0,0,0]
[null,5372,"Unprotected steel",0,0,0,0,0,0,0]
[null,5400,"Cast Iron",0,0,0,0,0,0,0]
[null,5400,"High density polyethylene (100)",0,0,212.98444452896206,425.96888905792412,425.96888905792412,425.96888905792412,425.96888905792412]
[null,5400,"High density polyethylene (250)",1200,425.96888905792412,212.98444452896206,0,0,0,0]
[null,5400,"High density polyethylene (575)",0,0,0,0,0,0,0]
[null,5400,"Medium density polyethylene",132,131.96293253037439,131.92587546981926,131.88882881541161,131.85179256422924,131.81476671335076,131.77775125985565]
[null,5400,"Other",0,0,0,0,0,0,0]
[null,5400,"Protected steel",0,0,0,0,0,0,0]
[null,5400,"PVC",0,0,0,0,0,0,0]
[null,5400,"Unprotected steel",0,0,0,0,0,0,0]
[null,5422,"Cast Iron",0,0,0,0,0,0,0]
[null,5422,"High density polyethylene (100)",1018.1844920599201,1083.4892007728297,1091.498403279749,1100.2402718311446,1109.5219515505742,1119.3440497806903,1128.9605143314475]
[null,5422,"High density polyethylene (250)",0,0,0,0,0,0,0]
[null,5422,"High density polyethylene (575)",32,30.838307855217927,28.793327228214086,26.748346601210244,24.703365974206406,22.658385347202561,20.715653751548913]
[null,5422,"Medium density polyethylene",1083,1082.6958782605716,1082.3918419228353,1082.0878909628088,1081.7840253565171,1081.4802450799914,1081.1765501092702]
[null,5422,"Other",0,0,0,0,0,0,0]
[null,5422,"Protected steel",2682,2681.6189278365705,2681.6189278365705,2681.6189278365705,2681.6189278365705,2681.6189278365705,2681.6189278365705]
[null,5422,"PVC",0,0,0,0,0,0,0]
[null,5422,"Unprotected steel",0,0,0,0,0,0,0]
[null,5501,"Cast Iron",0,0,0,0,0,0,0]
[null,5501,"High density polyethylene (100)",14680.079403840189,17043.534291742646,18192.787222515166,19483.218435357881,20877.666497241011,22376.248437734801,23854.909068774869]
[null,5501,"High density polyethylene (250)",0,0,0,0,0,0,0]
[null,5501,"High density polyethylene (575)",0,0,0,0,0,0,0]
[null,5501,"Medium density polyethylene",1756,1755.5068903283138,1755.0139191288079,1754.5210863625969,1754.0283919908072,1753.5358359745755,1753.0434182750496]
[null,5501,"Other",0,0,0,0,0,0,0]
[null,5501,"Protected steel",23,22.996732043341211,22.996732043341211,22.996732043341211,22.996732043341211,22.996732043341211,22.996732043341211]
[null,5501,"PVC",0,0,0,0,0,0,0]
[null,5501,"Unprotected steel",0,0,0,0,0,0,0]
[null,5502,"Cast Iron",0,0,0,0,0,0,0]
[null,5502,"High density polyethylene (100)",0,0,0,0,0,0,0]
[null,5502,"High density polyethylene (250)",0,0,0,0,0,0,0]
[null,5502,"High density polyethylene (575)",0,0,0,0,0,0,0]
[null,5502,"Medium density polyethylene",869,868.75597249163138,868.51201350964345,868.26812303479312,868.02430104784253,867.78054752955927,867.53686246071641]
[null,5502,"Other",0,0,0,0,0,0,0]
[null,5502,"Protected steel",15,14.997868723918181,14.997868723918181,14.997868723918181,14.997868723918181,14.997868723918181,14.997868723918181]
[null,5502,"PVC",0,0,0,0,0,0,0]
[null,5502,"Unprotected steel",0,0,0,0,0,0,0]
[null,5540,"Cast Iron",0,0,0,0,0,0,0]
[null,5540,"High density polyethylene (100)",884.53586264361172,1160.9502953906754,7755.0525227050257,14393.551441068352,21049.048885784992,27719.900574069958,34067.341957880286]
[null,5540,"High density polyethylene (250)",0,0,0,0,0,0,0]
[null,5540,"High density polyethylene (575)",100469,96821.685997059059,90401.149790357536,83980.613583655999,77560.077376954476,71139.541170252953,65040.031773886498]
[null,5540,"Medium density polyethylene",15540,15512.096229348355,15503.662076651157,15471.648781903848,15437.975162089368,15404.302755328516,15370.077715126803]
[null,5540,"Other",0,0,0,0,0,0,0]
[null,5540,"Protected steel",9621,9619.6329995211199,9619.6329995211199,9619.6329995211199,9619.6329995211199,9619.6329995211199,9619.6329995211199]
[null,5540,"PVC",0,0,0,0,0,0,0]
[null,5540,"Unprotected steel",0,0,0,0,0,0,0]
[null,5600,"Cast Iron",0,0,0,0,0,0,0]
[null,5600,"High density polyethylene (100)",14.804301814267207,30.064937750503287,228.01577898705224,427.291883804051,814.70702812875334,1296.6810023540779,1778.467971995505]
[null,5600,"High density polyethylene (250)",0,0,0,0,0,0,0]
[null,5600,"High density polyethylene (575)",9188,8800.3862215069967,8613.2236051414711,8426.0609887759456,8051.7357560448954,7583.8292151310825,7115.9226742172696]
[null,5600,"Medium density polyethylene",3198,3199.2686357243315,3199.2686357243315,3199.2686357243315,3199.2686357243315,3199.2686357243315,3199.2686357243315]
[null,5600,"Other",0,0,0,0,0,0,0]
[null,5600,"Protected steel",22237,22222.601606042754,22222.601606042754,22222.601606042754,22222.601606042754,22222.601606042754,22222.601606042754]
[null,5600,"PVC",0,0,0,0,0,0,0]
[null,5600,"Unprotected steel",0,0,0,0,0,0,0]
[null,5608,"Cast Iron",0,0,0,0,0,0,0]
[null,5608,"High density polyethylene (100)",94.211505361302528,119.60840411713838,264.49686310503517,410.926075686464,690.83653061168502,1038.0564794810646,1385.0590165171322]
[null,5608,"High density polyethylene (250)",0,0,0,0,0,0,0]
[null,5608,"High density polyethylene (575)",6497,6222.9113279419844,6090.5652767309684,5958.2192255199516,5693.5271230979197,5362.6619950703789,5031.7968670428381]
[null,5608,"Medium density polyethylene",7656,7659.0371091636907,7659.0371091636907,7659.0371091636907,7659.0371091636907,7659.0371091636907,7659.0371091636907]
[null,5608,"Other",0,0,0,0,0,0,0]
[null,5608,"Protected steel",39237,39211.594154620652,39211.594154620652,39211.594154620652,39211.594154620652,39211.594154620652,39211.594154620652]
[null,5608,"PVC",0,0,0,0,0,0,0]
[null,5608,"Unprotected steel",0,0,0,0,0,0,0]
[null,5609,"Cast Iron",0,0,0,0,0,0,0]
[null,5609,"High density polyethylene (100)",0,0,23.996251858792903,47.992503717585805,95.985007435171383,155.97563708215353,215.96626672913567]
[null,5609,"High density polyethylene (250)",0,0,0,0,0,0,0]
[null,5609,"High density polyethylene (575)",1178,1128.3037624004398,1104.3075105416469,1080.311258682854,1032.3187549652685,972.32812531828631,912.33749567130417]
[null,5609,"Medium density polyethylene",10051,10054.987197518842,10054.987197518842,10054.987197518842,10054.987197518842,10054.987197518842,10054.987197518842]
[null,5609,"Other",0,0,0,0,0,0,0]
[null,5609,"Protected steel",6279,6274.934365442391,6274.934365442391,6274.934365442391,6274.934365442391,6274.934365442391,6274.934365442391]
[null,5609,"PVC",0,0,0,0,0,0,0]
[null,5609,"Unprotected steel",0,0,0,0,0,0,0]
[null,5950,"Cast Iron",0,0,0,0,0,0,0]
[null,5950,"High density polyethylene (100)",435.1058515135112,516.95193525382138,582.24533944733912,747.87059306365086,924.48052237585784,1105.1912745044506,1287.4136734443105]
[null,5950,"High density polyethylene (250)",412,347.52199999999999,332.76923076923077,253.53846153846152,169.55384615384614,85.569230769230785,0]
[null,5950,"High density polyethylene (575)",0,0,0,0,0,0,0]
[null,5950,"Medium density polyethylene",2112,2081.1646640210015,2075.3409710923324,2039.2232229923522,2000.9710113790834,1962.7189515944933,1923.7555051344082]
[null,5950,"Other",0,0,0,0,0,0,0]
[null,5950,"Protected steel",0,0,0,0,0,0,0]
[null,5950,"PVC",0,0,0,0,0,0,0]
[null,5950,"Unprotected steel",0,0,0,0,0,0,0]

{"sheet":"S1.1 Customer numbers","index":22,"n_rows":34,"n_cols":9,"rows_kept":34,"cut":false,"hidden":false,"merged":[[28,2,28,8],[7,2,7,8],[8,2,8,8],[17,2,17,8],[18,2,18,8],[27,2,27,8]]}
[null,{"$f":"INDEX(dms_Worksheet_List,MATCH(dms_Model,dms_Model_List))","v":"REGULATORY REPORTING STATEMENT"}]
[null,{"$f":"INDEX(dms_TradingNameFull_List,MATCH(dms_TradingName,dms_TradingName_List))","v":"Australian Gas Networks Limited (reporting data for SA)"}]
[null,{"$f":"dms_Header_Span","v":"2019-20 - 2025-26"}]
[null,"S1. CUSTOMER NUMBERS"]
[]
[null,"S1.1 - CUSTOMER NUMBERS - BY CUSTOMER TYPE "]
[null,"A. RESIDENTIAL"]
[null,null,"VOLUMES"]
[null,null,"0's"]
[null,null,{"$f":"CRCP_y4","v":"2019-20"},{"$f":"CRCP_y5","v":"2020-21"},{"$f":"FRCP_y1","v":"2021-22"},{"$f":"FRCP_y2","v":"2022-23"},{"$f":"FRCP_y3","v":"2023-24"},{"$f":"FRCP_y4","v":"2024-25"},{"$f":"FRCP_y5","v":"2025-26"}]
[null,"Customer numbers as at 1 July",443043,448399.92316990031,452591.70480901777,455474.02914004115,460455.69217453728,466316.16847842385,472716.18556804693]
[null,"Customer numbers as at 30 June",448399.92316990031,452591.70480901777,455474.02914004115,460455.69217453728,466316.16847842385,472716.18556804693,478985.24097837979]
[null,"Total customer connections",7254.0831677521865,7559.8805849935616,6274.5734567293803,6943.6146462040342,7842.4484320402153,8404.324057742042,8298.007592795926]
[null,"Total customer disconnections",1897.15999785189,3368.0989458761242,3392.2491257059673,1961.951611707922,1981.9721281536879,2004.3069681189484,2028.9521824630142]
[]
[]
[null,"B. COMMERCIAL"]
[null,null,"VOLUMES"]
[null,null,"0's"]
[null,null,{"$f":"CRCP_y4","v":"2019-20"},{"$f":"CRCP_y5","v":"2020-21"},{"$f":"FRCP_y1","v":"2021-22"},{"$f":"FRCP_y2","v":"2022-23"},{"$f":"FRCP_y3","v":"2023-24"},{"$f":"FRCP_y4","v":"2024-25"},{"$f":"FRCP_y5","v":"2025-26"}]
[null,"Customer numbers as at 1 July",11233,11349.881586233187,11291.427268706595,11236.216364261662,11349.972731264928,11471.675936940546,11590.119579672055]
[null,"Customer numbers as at 30 June",11349.881586233187,11291.427268706595,11236.216364261662,11349.972731264928,11471.675936940546,11590.119579672055,11707.39178302539]
[null,"Total customer connections",266.65434855833621,260.87686000688058,265.58087661963725,267.98552708857034,276.34538510716783,275.47687815989156,274.66636738749963]
[null,"Total customer disconnections",149.7727623251495,319.33117753347227,320.79178106457135,154.2291600853026,154.6421794315477,157.03323542838621,157.39416403416377]
[]
[]
[null,"C. INDUSTRIAL"]
[null,null,"VOLUMES"]
[null,null,"0's"]
[null,null,{"$f":"CRCP_y4","v":"2019-20"},{"$f":"CRCP_y5","v":"2020-21"},{"$f":"FRCP_y1","v":"2021-22"},{"$f":"FRCP_y2","v":"2022-23"},{"$f":"FRCP_y3","v":"2023-24"},{"$f":"FRCP_y4","v":"2024-25"},{"$f":"FRCP_y5","v":"2025-26"}]
[null,"Customer numbers as at 1 July",115,112,109,106,103,101,100]
[null,"Customer numbers as at 30 June",112,109,106,103,101,100,98]
[null,"Total customer connections",3,3,3,3,4,5,4]
[null,"Total customer disconnections",6,6,6,6,6,6,6]

{"sheet":"S1.2 Customer numbers","index":23,"n_rows":329,"n_cols":9,"rows_kept":329,"cut":false,"hidden":false,"merged":[[170,2,170,8],[250,2,250,8],[251,2,251,8],[7,2,7,8],[8,2,8,8],[88,2,88,8],[89,2,89,8],[169,2,169,8]]}
[null,{"$f":"INDEX(dms_Worksheet_List,MATCH(dms_Model,dms_Model_List))","v":"REGULATORY REPORTING STATEMENT"}]
[null,{"$f":"INDEX(dms_TradingNameFull_List,MATCH(dms_TradingName,dms_TradingName_List))","v":"Australian Gas Networks Limited (reporting data for SA)"}]
[null,{"$f":"dms_Header_Span","v":"2019-20 - 2025-26"}]
[null,"S1. CUSTOMER NUMBERS"]
[]
[null,"S1.2 - CUSTOMER NUMBERS - BY TARIFF"]
[null,"S1.2.1 - CUSTOMER NUMBERS AS AT 1 JULY"]
[null,null,"VOLUMES"]
[null,null,"0's"]
[null,null,{"$f":"CRCP_y4","v":"2019-20"},{"$f":"CRCP_y5","v":"2020-21"},{"$f":"FRCP_y1","v":"2021-22"},{"$f":"FRCP_y2","v":"2022-23"},{"$f":"FRCP_y3","v":"2023-24"},{"$f":"FRCP_y4","v":"2024-25"},{"$f":"FRCP_y5","v":"2025-26"}]
[null,{"$f":"IF(ISBLANK('N1. Demand'!B21),\"\",'N1. Demand'!B21)","v":"Tariff R - SA excl New Towns"},436708,{"$f":"C92","v":445717.67418636923},449884.38132957416,455072.75914004113,459747.14217453729,464961.98823598342,470716.37508316606]
[null,{"$f":"IF(ISBLANK('N1. Demand'!B22),\"\",'N1. Demand'!B22)","v":"Tariff R - New Towns"},200,{"$f":"C93","v":201},202.87901037874036,401.26999999999987,708.55,1354.1802424404234,1999.8104848808473]
[null,{"$f":"IF(ISBLANK('N1. Demand'!B23),\"\",'N1. Demand'!B23)","v":"Tariff C - SA excl New Towns"},11154.677438870005,{"$f":"C94","v":11272.647151714826},11214.590608043847,11200.396371554647,11305.915448140229,11410.252284177552,11512.331042144715]
[null,{"$f":"IF(ISBLANK('N1. Demand'!B24),\"\",'N1. Demand'!B24)","v":"Tariff C - New Towns"},30.322561129994547,{"$f":"C95","v":31.322561129994547},30.840343370143852,35.819992707013995,44.057283124698294,61.423652762995047,77.788537527340239]
[null,{"$f":"IF(ISBLANK('N1. Demand'!B25),\"\",'N1. Demand'!B25)","v":"Northern"},60.087358934805565,{"$f":"C96","v":58.477876106194699},56.911504424778769,55.345132743362832,53.778761061946909,52.212389380530979,50.646017699115049]
[null,{"$f":"IF(ISBLANK('N1. Demand'!B26),\"\",'N1. Demand'!B26)","v":"Central"},34.626613623447277,{"$f":"C97","v":33.699115044247797},32.796460176991161,31.893805309734518,30.991150442477878,30.088495575221241,29.185840707964605]
[null,{"$f":"IF(ISBLANK('N1. Demand'!B27),\"\",'N1. Demand'!B27)","v":"Southern"},13.239587561906312,{"$f":"C98","v":12.884955752212392},12.539823008849559,12.194690265486726,11.849557522123893,11.504424778761061,11.159292035398231]
[null,{"$f":"IF(ISBLANK('N1. Demand'!B28),\"\",'N1. Demand'!B28)","v":"Peterborough"},0,{"$f":"C99","v":0},0,0,0,0,0]
[null,{"$f":"IF(ISBLANK('N1. Demand'!B29),\"\",'N1. Demand'!B29)","v":"Port Pirie"},1.0184298124543316,{"$f":"C100","v":0.99115044247787631},0.96460176991150459,0.93805309734513276,0.91150442477876104,0.88495575221238942,0.8584070796460177]
[null,{"$f":"IF(ISBLANK('N1. Demand'!B30),\"\",'N1. Demand'!B30)","v":"Riverland"},2.0368596249086632,{"$f":"C101","v":1.9823008849557526},1.9292035398230092,1.8761061946902655,1.8230088495575221,1.7699115044247788,1.7168141592920354]
[null,{"$f":"IF(ISBLANK('N1. Demand'!B31),\"\",'N1. Demand'!B31)","v":"South East"},3.0552894373629949,{"$f":"C102","v":2.9734513274336289},2.8938053097345136,2.8141592920353982,2.7345132743362832,3.6548672566371683,5.5752212389380524]
[null,{"$f":"IF(ISBLANK('N1. Demand'!B32),\"\",'N1. Demand'!B32)","v":"Whyalla"},1.0184298124543316,{"$f":"C103","v":0.99115044247787631},0.96460176991150459,0.93805309734513276,0.91150442477876104,0.88495575221238942,0.8584070796460177]
[null,{"$f":"IF(ISBLANK('N1. Demand'!B33),\"\",'N1. Demand'!B33)","v":""},null,{"$f":"C104","v":0},0,0,0,0,0]
[null,{"$f":"IF(ISBLANK('N1. Demand'!B34),\"\",'N1. Demand'!B34)","v":""},null,{"$f":"C105","v":0},0,0,0,0,0]
[null,{"$f":"IF(ISBLANK('N1. Demand'!B35),\"\",'N1. Demand'!B35)","v":""},null,{"$f":"C106","v":0},0,0,0,0,0]
[null,{"$f":"IF(ISBLANK('N1. Demand'!B36),\"\",'N1. Demand'!B36)","v":""},null,{"$f":"C107","v":0},0,0,0,0,0]
[null,{"$f":"IF(ISBLANK('N1. Demand'!B37),\"\",'N1. Demand'!B37)","v":""},null,{"$f":"C108","v":0},0,0,0,0,0]
[null,{"$f":"IF(ISBLANK('N1. Demand'!B38),\"\",'N1. Demand'!B38)","v":""},null,{"$f":"C109","v":0},0,0,0,0,0]
[null,{"$f":"IF(ISBLANK('N1. Demand'!B39),\"\",'N1. Demand'!B39)","v":""},null,{"$f":"C110","v":0},0,0,0,0,0]
[null,{"$f":"IF(ISBLANK('N1. Demand'!B40),\"\",'N1. Demand'!B40)","v":""},null,{"$f":"C111","v":0},0,0,0,0,0]
[null,{"$f":"IF(ISBLANK('N1. Demand'!B41),\"\",'N1. Demand'!B41)","v":""},null,{"$f":"C112","v":0},0,0,0,0,0]
[null,{"$f":"IF(ISBLANK('N1. Demand'!B42),\"\",'N1. Demand'!B42)","v":""},null,{"$f":"C113","v":0},0,0,0,0,0]
[null,{"$f":"IF(ISBLANK('N1. Demand'!B43),\"\",'N1. Demand'!B43)","v":""},null,{"$f":"C114","v":0},0,0,0,0,0]
[null,{"$f":"IF(ISBLANK('N1. Demand'!B44),\"\",'N1. Demand'!B44)","v":""},null,{"$f":"C115","v":0},0,0,0,0,0]
[null,{"$f":"IF(ISBLANK('N1. Demand'!B45),\"\",'N1. Demand'!B45)","v":""},null,{"$f":"C116","v":0},0,0,0,0,0]
[null,{"$f":"IF(ISBLANK('N1. Demand'!B46),\"\",'N1. Demand'!B46)","v":""},null,{"$f":"C117","v":0},0,0,0,0,0]
[null,{"$f":"IF(ISBLANK('N1. Demand'!B47),\"\",'N1. Demand'!B47)","v":""},null,{"$f":"C118","v":0},0,0,0,0,0]
[null,{"$f":"IF(ISBLANK('N1. Demand'!B48),\"\",'N1. Demand'!B48)","v":""},null,{"$f":"C119","v":0},0,0,0,0,0]
[null,{"$f":"IF(ISBLANK('N1. Demand'!B49),\"\",'N1. Demand'!B49)","v":""},null,{"$f":"C120","v":0},0,0,0,0,0]
[null,{"$f":"IF(ISBLANK('N1. Demand'!B50),\"\",'N1. Demand'!B50)","v":""},null,{"$f":"C121","v":0},0,0,0,0,0]
[null,{"$f":"IF(ISBLANK('N1. Demand'!B51),\"\",'N1. Demand'!B51)","v":""},null,{"$f":"C122","v":0},0,0,0,0,0]
[null,{"$f":"IF(ISBLANK('N1. Demand'!B52),\"\",'N1. Demand'!B52)","v":""},null,{"$f":"C123","v":0},0,0,0,0,0]
[null,{"$f":"IF(ISBLANK('N1. Demand'!B53),\"\",'N1. Demand'!B53)","v":""},null,{"$f":"C124","v":0},0,0,0,0,0]
[null,{"$f":"IF(ISBLANK('N1. Demand'!B54),\"\",'N1. Demand'!B54)","v":""},null,{"$f":"C125","v":0},0,0,0,0,0]
[null,{"$f":"IF(ISBLANK('N1. Demand'!B55),\"\",'N1. Demand'!B55)","v":""},null,{"$f":"C126","v":0},0,0,0,0,0]
[null,{"$f":"IF(ISBLANK('N1. Demand'!B56),\"\",'N1. Demand'!B56)","v":""},null,{"$f":"C127","v":0},0,0,0,0,0]
[null,{"$f":"IF(ISBLANK('N1. Demand'!B57),\"\",'N1. Demand'!B57)","v":""},null,{"$f":"C128","v":0},0,0,0,0,0]
[null,{"$f":"IF(ISBLANK('N1. Demand'!B58),\"\",'N1. Demand'!B58)","v":""},null,{"$f":"C129","v":0},0,0,0,0,0]
[null,{"$f":"IF(ISBLANK('N1. Demand'!B59),\"\",'N1. Demand'!B59)","v":""},null,{"$f":"C130","v":0},0,0,0,0,0]
[null,{"$f":"IF(ISBLANK('N1. Demand'!B60),\"\",'N1. Demand'!B60)","v":""},null,{"$f":"C131","v":0},{"$f":"D131","v":0},{"$f":"E131","v":0},{"$f":"F131","v":0},{"$f":"G131","v":0},{"$f":"H131","v":0}]
[null,{"$f":"IF(ISBLANK('N1. Demand'!B61),\"\",'N1. Demand'!B61)","v":""},null,0,0,0,0,0,0]
[null,{"$f":"IF(ISBLANK('N1. Demand'!B62),\"\",'N1. Demand'!B62)","v":""},null,0,0,0,0,0,0]
[null,{"$f":"IF(ISBLANK('N1. Demand'!B63),\"\",'N1. Demand'!B63)","v":""},null,{"$f":"C134","v":0},0,0,0,0,0]
[null,{"$f":"IF(ISBLANK('N1. Demand'!B64),\"\",'N1. Demand'!B64)","v":""},null,{"$f":"C135","v":0},0,0,0,0,0]
[null,{"$f":"IF(ISBLANK('N1. Demand'!B65),\"\",'N1. Demand'!B65)","v":""},null,{"$f":"C136","v":0},0,0,0,0,0]
[null,{"$f":"IF(ISBLANK('N1. Demand'!B66),\"\",'N1. Demand'!B66)","v":""},null,{"$f":"C137","v":0},0,0,0,0,0]
[null,{"$f":"IF(ISBLANK('N1. Demand'!B67),\"\",'N1. Demand'!B67)","v":""},null,{"$f":"C138","v":0},0,0,0,0,0]
[null,{"$f":"IF(ISBLANK('N1. Demand'!B68),\"\",'N1. Demand'!B68)","v":""},null,{"$f":"C139","v":0},{"$f":"D139","v":0},{"$f":"E139","v":0},{"$f":"F139","v":0},{"$f":"G139","v":0},{"$f":"H139","v":0}]
[null,{"$f":"IF(ISBLANK('N1. Demand'!B69),\"\",'N1. Demand'!B69)","v":""},null,0,0,0,0,0,0]
[null,{"$f":"IF(ISBLANK('N1. Demand'!B70),\"\",'N1. Demand'!B70)","v":""},null,0,0,0,0,0,0]
[null,{"$f":"IF(ISBLANK('N1. Demand'!B71),\"\",'N1. Demand'!B71)","v":""},null,0,0,0,0,0,0]
[null,{"$f":"IF(ISBLANK('N1. Demand'!B72),\"\",'N1. Demand'!B72)","v":""},null,0,0,0,0,0,0]
[null,{"$f":"IF(ISBLANK('N1. Demand'!B73),\"\",'N1. Demand'!B73)","v":""},null,0,0,0,0,0,0]
[null,{"$f":"IF(ISBLANK('N1. Demand'!B74),\"\",'N1. Demand'!B74)","v":""},null,0,0,0,0,0,0]
[null,{"$f":"IF(ISBLANK('N1. Demand'!B75),\"\",'N1. Demand'!B75)","v":""},null,0,0,0,0,0,0]
[null,{"$f":"IF(ISBLANK('N1. Demand'!B76),\"\",'N1. Demand'!B76)","v":""},null,0,0,0,0,0,0]
[null,{"$f":"IF(ISBLANK('N1. Demand'!B77),\"\",'N1. Demand'!B77)","v":""},null,0,0,0,0,0,0]
[null,{"$f":"IF(ISBLANK('N1. Demand'!B78),\"\",'N1. Demand'!B78)","v":""},null,0,0,0,0,0,0]
[null,{"$f":"IF(ISBLANK('N1. Demand'!B79),\"\",'N1. Demand'!B79)","v":""},null,0,0,0,0,0,0]
[null,{"$f":"IF(ISBLANK('N1. Demand'!B80),\"\",'N1. Demand'!B80)","v":""},null,0,0,0,0,0,0]
[null,{"$f":"IF(ISBLANK('N1. Demand'!B81),\"\",'N1. Demand'!B81)","v":""},null,0,0,0,0,0,0]
[null,{"$f":"IF(ISBLANK('N1. Demand'!B82),\"\",'N1. Demand'!B82)","v":""},null,0,0,0,0,0,0]
[null,{"$f":"IF(ISBLANK('N1. Demand'!B83),\"\",'N1. Demand'!B83)","v":""},null,0,0,0,0,0,0]
[null,{"$f":"IF(ISBLANK('N1. Demand'!B84),\"\",'N1. Demand'!B84)","v":""},null,0,0,0,0,0,0]
[null,{"$f":"IF(ISBLANK('N1. Demand'!B85),\"\",'N1. Demand'!B85)","v":""},null,0,0,0,0,0,0]
[null,{"$f":"IF(ISBLANK('N1. Demand'!B86),\"\",'N1. Demand'!B86)","v":""},null,0,0,0,0,0,0]
[null,{"$f":"IF(ISBLANK('N1. Demand'!B87),\"\",'N1. Demand'!B87)","v":""},null,0,0,0,0,0,0]
[null,{"$f":"IF(ISBLANK('N1. Demand'!B88),\"\",'N1. Demand'!B88)","v":""},null,0,0,0,0,0,0]
[null,{"$f":"IF(ISBLANK('N1. Demand'!B89),\"\",'N1. Demand'!B89)","v":""},null,0,0,0,0,0,0]
[null,{"$f":"IF(ISBLANK('N1. Demand'!B90),\"\",'N1. Demand'!B90)","v":""},null,0,0,0,0,0,0]
[null,{"$f":"IF(ISBLANK('N1. Demand'!B91),\"\",'N1. Demand'!B91)","v":""},null,0,0,0,0,0,0]
[null,{"$f":"IF(ISBLANK('N1. Demand'!B92),\"\",'N1. Demand'!B92)","v":""},null,0,0,0,0,0,0]
[null,{"$f":"IF(ISBLANK('N1. Demand'!B93),\"\",'N1. Demand'!B93)","v":""},null,0,0,0,0,0,0]
[null,{"$f":"IF(ISBLANK('N1. Demand'!B94),\"\",'N1. Demand'!B94)","v":""},null,0,0,0,0,0,0]
[null,{"$f":"IF(ISBLANK('N1. Demand'!B95),\"\",'N1. Demand'!B95)","v":""},null,0,0,0,0,0,0]
[null,"Total",{"$f":"SUM(C11:C85)","v":448208.08256880735},{"$f":"SUM(D11:D85)","v":457334.64389921405},461441.69129136688,466816.24550430273,471908.66490580217,477888.8444153645,484406.30514771899]
[]
[null,"S1.2.2 - CUSTOMER NUMBERS AS AT 30 JUNE"]
[null,null,"VOLUMES"]
[null,null,"0's"]
[null,null,{"$f":"CRCP_y4","v":"2019-20"},{"$f":"CRCP_y5","v":"2020-21"},{"$f":"FRCP_y1","v":"2021-22"},{"$f":"FRCP_y2","v":"2022-23"},{"$f":"FRCP_y3","v":"2023-24"},{"$f":"FRCP_y4","v":"2024-25"},{"$f":"FRCP_y5","v":"2025-26"}]
[null,{"$f":"IF(ISBLANK(B11),\"\",B11)","v":"Tariff R - SA excl New Towns"},445717.67418636923,449884.38132957416,455072.75914004113,459747.14217453729,464961.98823598342,470716.37508316606,476339.80025105854]
[null,"Tariff R - New Towns",201,202.87901037874036,401.26999999999987,708.55,1354.1802424404234,1999.8104848808473,2645.440727321271]
[null,"Tariff C - SA excl New Towns",11272.647151714826,11214.590608043847,11200.396371554647,11305.915448140229,11410.252284177552,11512.331042144715,11612.237913973833]
[null,"Tariff C - New Towns",31.322561129994547,30.840343370143852,35.819992707013995,44.057283124698294,61.423652762995047,77.788537527340239,95.153869051557507]
[null,"Northern",58.477876106194699,56.911504424778769,55.345132743362832,53.778761061946909,52.212389380530979,50.646017699115049,49.079646017699119]
[null,"Central",33.699115044247797,32.796460176991161,31.893805309734518,30.991150442477878,30.088495575221241,29.185840707964605,28.283185840707965]
[null,"Southern",12.884955752212392,12.539823008849559,12.194690265486726,11.849557522123893,11.504424778761061,11.159292035398231,10.814159292035399]
[null,"Peterborough",0,0,0,0,0,0,0]
[null,"Port Pirie",0.99115044247787631,0.96460176991150459,0.93805309734513276,0.91150442477876104,0.88495575221238942,0.8584070796460177,0.83185840707964598]
[null,"Riverland",1.9823008849557526,1.9292035398230092,1.8761061946902655,1.8230088495575221,1.7699115044247788,1.7168141592920354,1.663716814159292]
[null,"South East",2.9734513274336289,2.8938053097345136,2.8141592920353982,2.7345132743362832,3.6548672566371683,5.5752212389380524,6.4955752212389379]
[null,"Whyalla",0.99115044247787631,0.96460176991150459,0.93805309734513276,0.91150442477876104,0.88495575221238942,0.8584070796460177,0.83185840707964598]
[null,""]
[null,""]
[null,""]
[null,""]
[null,""]
[null,""]
[null,""]
[null,""]
[null,""]
[null,""]
[null,""]
[null,""]
[null,""]
[null,""]
[null,""]
[null,""]
[null,""]
[null,""]
[null,""]
[null,""]
[null,{"$f":"IF(ISBLANK(B43),\"\",B43)","v":""}]
[null,""]
[null,""]
[null,""]
[null,""]
[null,""]
[null,""]
[null,""]
[null,""]
[null,""]
[null,""]
[null,""]
[null,""]
[null,""]
[null,""]
[null,""]
[null,""]
[null,{"$f":"IF(ISBLANK(B60),\"\",B60)","v":""}]
[null,""]
[null,""]
[null,""]
[null,""]
[null,""]
[null,""]
[null,""]
[null,""]
[null,""]
[null,""]
[null,""]
[null,""]
[null,""]
[null,""]
[null,""]
[null,""]
[null,""]
[null,""]
[null,""]
[null,""]
[null,""]
[null,""]
[null,""]
[null,""]
[null,""]
[null,"Total",{"$f":"SUM(C92:C166)","v":457334.64389921405},{"$f":"SUM(D92:D166)","v":461441.69129136688},{"$f":"SUM(E92:E166)","v":466816.24550430273},{"$f":"SUM(F92:F166)","v":471908.66490580217},{"$f":"SUM(G92:G166)","v":477888.8444153645},{"$f":"SUM(H92:H166)","v":484406.30514771899},{"$f":"SUM(I92:I166)","v":490790.63276140508}]
[]
[null,"S1.2.3 - TOTAL CUSTOMER CONNECTIONS"]
[null,null,"VOLUMES"]
[null,null,"0's"]
[null,null,{"$f":"CRCP_y4","v":"2019-20"},{"$f":"CRCP_y5","v":"2020-21"},{"$f":"FRCP_y1","v":"2021-22"},{"$f":"FRCP_y2","v":"2022-23"},{"$f":"FRCP_y3","v":"2023-24"},{"$f":"FRCP_y4","v":"2024-25"},{"$f":"FRCP_y5","v":"2025-26"}]
[null,{"$f":"IF(ISBLANK(B11),\"\",B11)","v":"Tariff R - SA excl New Towns"},7210.6905260550093,7514.6587172658274,6237.0400687719821,7097.1751198521451,8295.0801282999455,9494.3688918638309,10029.462571610802]
[null,"Tariff R - New Towns",43.392641697176792,45.221867727733709,37.533387957398084,42.709526351888883,49.918303740268563,57.135408318635385,60.355506065971021]
[null,"Tariff C - SA excl New Towns",264.83980118475426,259.10162767441318,263.77363407981301,271.11325520456506,288.13599408993622,303.53558514927983,319.98597286026444]
[null,"Tariff C - New Towns",1.8145473735819087,1.7752323324673631,1.8072425398242324,1.8575298840052319,1.9741610172315882,2.0796711685984288,2.1923808432086576]
[null,"Northern",0,0,0,0,0,0,0]
[null,"Central",0,0,0,0,0,0,0]
[null,"Southern",0,0,0,0,0,0,0]
[null,"Peterborough",0,0,0,0,0,0,0]
[null,"Port Pirie",0,0,0,0,0,0,0]
[null,"Riverland",0,0,0,0,0,0,0]
[null,"South East",0,0,0,0,0,0,0]
[null,"Whyalla",0,0,0,0,0,0,0]
[null,""]
[null,""]
[null,""]
[null,""]
[null,""]
[null,""]
[null,""]
[null,""]
[null,""]
[null,""]
[null,""]
[null,""]
[null,""]
[null,""]
[null,""]
[null,""]
[null,""]
[null,""]
[null,""]
[null,""]
[null,{"$f":"IF(ISBLANK(B43),\"\",B43)","v":""}]
[null,""]
[null,""]
[null,""]
[null,""]
[null,""]
[null,""]
[null,""]
[null,""]
[null,""]
[null,""]
[null,""]
[null,""]
[null,""]
[null,""]
[null,""]
[null,""]
[null,{"$f":"IF(ISBLANK(B60),\"\",B60)","v":""}]
[null,""]
[null,""]
[null,""]
[null,""]
[null,""]
[null,""]
[null,""]
[null,""]
[null,""]
[null,""]
[null,""]
[null,""]
[null,""]
[null,""]
[null,""]
[null,""]
[null,""]
[null,""]
[null,""]
[null,""]
[null,""]
[null,""]
[null,""]
[null,""]
[null,""]
[null,"Total",{"$f":"SUM(C173:C247)","v":7520.7375163105226},{"$f":"SUM(D173:D247)","v":7820.7574450004413},{"$f":"SUM(E173:E247)","v":6540.1543333490172},{"$f":"SUM(F173:F247)","v":7412.8554312926035},{"$f":"SUM(G173:G247)","v":8635.1085871473824},{"$f":"SUM(H173:H247)","v":9857.1195565003454},{"$f":"SUM(I173:I247)","v":10411.996431380247}]
[]
[null,"S1.2.4 - TOTAL CUSTOMER DISCONNECTIONS"]
[null,null,"VOLUMES"]
[null,null,"0's"]
[null,null,{"$f":"CRCP_y4","v":"2019-20"},{"$f":"CRCP_y5","v":"2020-21"},{"$f":"FRCP_y1","v":"2021-22"},{"$f":"FRCP_y2","v":"2022-23"},{"$f":"FRCP_y3","v":"2023-24"},{"$f":"FRCP_y4","v":"2024-25"},{"$f":"FRCP_y5","v":"2025-26"}]
[null,{"$f":"IF(ISBLANK(B11),\"\",B11)","v":"Tariff R - SA excl New Towns"},1885.811522500109,3347.9515740609304,3371.9572917890791,1950.2155643887372,1970.1163216483133,1992.3175585536744,2016.815349587192]
[null,"Tariff R - New Towns",11.348475351780811,20.147371815193711,20.291833916888017,11.73604731918463,11.855806505374488,11.989409565273876,12.136832875822099]
[null,"Tariff C - SA excl New Towns",148.75357859917418,150.30138899929298,151.75205331764144,153.17965116532596,154.58305510286908,155.96464514867691,157.31631281631266]
[null,"Tariff C - New Towns",1.0191837259753225,1.0297885341792792,1.0397277469299031,1.0495089199766237,1.0591243286786067,1.0685902797092777,1.0778512178510982]
[null,"Northern",2,2,2,2,2,2,2]
[null,"Central",1,1,1,1,1,1,1]
[null,"Southern",0,0,0,0,0,0,0]
[null,"Peterborough",0,0,0,0,0,0,0]
[null,"Port Pirie",0,0,0,0,0,0,0]
[null,"Riverland",0,0,0,0,0,0,0]
[null,"South East",0,0,0,0,0,0,0]
[null,"Whyalla",0,0,0,0,0,0,0]
[null,""]
[null,""]
[null,""]
[null,""]
[null,""]
[null,""]
[null,""]
[null,""]
[null,""]
[null,""]
[null,""]
[null,""]
[null,""]
[null,""]
[null,""]
[null,""]
[null,""]
[null,""]
[null,""]
[null,""]
[null,{"$f":"IF(ISBLANK(B43),\"\",B43)","v":""}]
[null,""]
[null,""]
[null,""]
[null,""]
[null,""]
[null,""]
[null,""]
[null,""]
[null,""]
[null,""]
[null,""]
[null,""]
[null,""]
[null,""]
[null,""]
[null,""]
[null,{"$f":"IF(ISBLANK(B60),\"\",B60)","v":""}]
[null,""]
[null,""]
[null,""]
[null,""]
[null,""]
[null,""]
[null,""]
[null,""]
[null,""]
[null,""]
[null,""]
[null,""]
[null,""]
[null,""]
[null,""]
[null,""]
[null,""]
[null,""]
[null,""]
[null,""]
[null,""]
[null,""]
[null,""]
[null,""]
[null,""]
[null,"Total",{"$f":"SUM(C254:C328)","v":2049.9327601770392},{"$f":"SUM(D254:D328)","v":3522.4301234095965},{"$f":"SUM(E254:E328)","v":3548.0409067705391},{"$f":"SUM(F254:F328)","v":2119.1807717932243},{"$f":"SUM(G254:G328)","v":2140.6143075852351},{"$f":"SUM(H254:H328)","v":2164.3402035473346},{"$f":"SUM(I254:I328)","v":2190.3463464971783}]

{"sheet":"S10. Supply Quality","index":24,"n_rows":14,"n_cols":9,"rows_kept":14,"cut":false,"hidden":false,"merged":[[6,2,6,8],[7,2,7,8]]}
[null,{"$f":"INDEX(dms_Worksheet_List,MATCH(dms_Model,dms_Model_List))","v":"REGULATORY REPORTING STATEMENT"}]
[null,{"$f":"INDEX(dms_TradingNameFull_List,MATCH(dms_TradingName,dms_TradingName_List))","v":"Australian Gas Networks Limited (reporting data for SA)"}]
[null,{"$f":"dms_Header_Span","v":"2019-20 - 2025-26"}]
[null,"S10. SUPPLY QUALITY"]
[]
[null,"S10.1 - PRESSURE FAULTS"]
[null,null,"VOLUMES"]
[null,null,"0's"]
[null,null,{"$f":"CRCP_y4","v":"2019-20"},{"$f":"CRCP_y5","v":"2020-21"},{"$f":"FRCP_y1","v":"2021-22"},{"$f":"FRCP_y2","v":"2022-23"},{"$f":"FRCP_y3","v":"2023-24"},{"$f":"FRCP_y4","v":"2024-25"},{"$f":"FRCP_y5","v":"2025-26"}]
[null,"Poor Pressure events - mains","NULL","NULL","NULL","NULL","NULL","NULL","NULL"]
[null,"Poor Pressure events - services","NULL","NULL","NULL","NULL","NULL","NULL","NULL"]
[null,"Poor Pressure event - meters",255,243,231,220,209,199,189]
[null,"Pressure events impacting 5+ customers",0,0,0,0,0,0,0]
[null,"Pressure events with >12 hr resolution",79,72,66,60,55,50,46]

{"sheet":"S11. Network reliability","index":25,"n_rows":321,"n_cols":9,"rows_kept":321,"cut":false,"hidden":false,"merged":[[307,2,307,8],[308,2,308,8],[27,2,27,8],[7,2,7,8],[8,2,8,8],[15,2,15,8],[16,2,16,8],[26,2,26,8],[119,2,119,8],[120,2,120,8],[212,2,212,8],[213,2,213,8]]}
[null,{"$f":"INDEX(dms_Worksheet_List,MATCH(dms_Model,dms_Model_List))","v":"REGULATORY REPORTING STATEMENT"}]
[null,{"$f":"INDEX(dms_TradingNameFull_List,MATCH(dms_TradingName,dms_TradingName_List))","v":"Australian Gas Networks Limited (reporting data for SA)"}]
[null,{"$f":"dms_Header_Span","v":"2019-20 - 2025-26"}]
[null,"S11. NETWORK RELIABILITY"]
[]
[null,"S11.1 - NETWORK OUTAGES"]
[null,"S11.1.1 - PLANNED"]
[null,null,"VOLUMES"]
[null,null,"0's"]
[null,null,{"$f":"CRCP_y4","v":"2019-20"},{"$f":"CRCP_y5","v":"2020-21"},{"$f":"FRCP_y1","v":"2021-22"},{"$f":"FRCP_y2","v":"2022-23"},{"$f":"FRCP_y3","v":"2023-24"},{"$f":"FRCP_y4","v":"2024-25"},{"$f":"FRCP_y5","v":"2025-26"}]
[null,"Count of outage events",11465,11662,11341,10716,10555,10586,9662]
[null,"Outages affecting 5+ customers",0,0,0,0,0,0,0]
[null,"Outages with >12 hr supply interruption",0,0,0,0,0,0,0]
[]
[null,"S11.1.2 - UNPLANNED"]
[null,null,"VOLUMES"]
[null,null,"0's"]
[null,null,{"$f":"CRCP_y4","v":"2019-20"},{"$f":"CRCP_y5","v":"2020-21"},{"$f":"FRCP_y1","v":"2021-22"},{"$f":"FRCP_y2","v":"2022-23"},{"$f":"FRCP_y3","v":"2023-24"},{"$f":"FRCP_y4","v":"2024-25"},{"$f":"FRCP_y5","v":"2025-26"}]
[null,"Count of outage events",280,267,255,243,232,221,211]
[null,"Outages affecting 5+ customers",27,26,25,24,23,22,21]
[null,"Outages with >12 hr supply interruption",19,18,17,16,15,14,13]
[]
[]
[]
[null,"S11.2 - LEAKS - BY ASSET TYPE AND CAUSE OF LEAK"]
[null,"S11.2.1 - LOW PRESSURE"]
[null,null,"VOLUMES"]
[null,null,"Number per KM"]
[null,null,{"$f":"CRCP_y4","v":"2019-20"},{"$f":"CRCP_y5","v":"2020-21"},{"$f":"FRCP_y1","v":"2021-22"},{"$f":"FRCP_y2","v":"2022-23"},{"$f":"FRCP_y3","v":"2023-24"},{"$f":"FRCP_y4","v":"2024-25"},{"$f":"FRCP_y5","v":"2025-26"}]
[null,"Cast Iron"]
[null,"Broken pipe - cracked",0.22218508742320259,0.22218508742320259,0.22218508742320259,0.22218508742320259,0.22218508742320259,0.22218508742320259,0]
[null,"Broken pipe - full break",0.10493407320205485,0.10493407320205485,0.10493407320205485,0.10493407320205485,0.10493407320205485,0.10493407320205485,0]
[null,"Corrosion",0.16763767006961722,0.16763767006961722,0.16763767006961722,0.16763767006961722,0.16763767006961722,0.16763767006961722,0]
[null,"Joint leak",0.76754297689802997,0.76754297689802997,0.76754297689802997,0.76754297689802997,0.76754297689802997,0.76754297689802997,0]
[null,"3rd party damage",6.4638329839766584E-2,6.4638329839766584E-2,6.4638329839766584E-2,6.4638329839766584E-2,6.4638329839766584E-2,6.4638329839766584E-2,0]
[null,"Identified water in main",0,0,0,0,0,0,0]
[null,"Other ",0.12022668045384727,0.12022668045384727,0.12022668045384727,0.12022668045384727,0.12022668045384727,0.12022668045384727,0]
[null,"PVC"]
[null,"Broken pipe - cracked",0,0,0,0,0,0,0]
[null,"Broken pipe - full break",0,0,0,0,0,0,0]
[null,"Corrosion",0,0,0,0,0,0,0]
[null,"Joint leak",0,0,0,0,0,0,0]
[null,"3rd party damage",0,0,0,0,0,0,0]
[null,"Identified water in main",0,0,0,0,0,0,0]
[null,"Other ",0,0,0,0,0,0,0]
[null,"Polyamide"]
[null,"Broken pipe - cracked",0,0,0,0,0,0,0]
[null,"Broken pipe - full break",0,0,0,0,0,0,0]
[null,"Corrosion",0,0,0,0,0,0,0]
[null,"Joint leak",0,0,0,0,0,0,0]
[null,"3rd party damage",0,0,0,0,0,0,0]
[null,"Identified water in main",0,0,0,0,0,0,0]
[null,"Other ",0,0,0,0,0,0,0]
[null,"High density polyethylene (80)"]
[null,"Broken pipe - cracked","Null","Null","Null","Null","Null","Null","Null"]
[null,"Broken pipe - full break","Null","Null","Null","Null","Null","Null","Null"]
[null,"Corrosion","Null","Null","Null","Null","Null","Null","Null"]
[null,"Joint leak","Null","Null","Null","Null","Null","Null","Null"]
[null,"3rd party damage","Null","Null","Null","Null","Null","Null","Null"]
[null,"Identified water in main","Null","Null","Null","Null","Null","Null","Null"]
[null,"Other ","Null","Null","Null","Null","Null","Null","Null"]
[null,"High density polyethylene (100)"]
[null,"Broken pipe - cracked","Null","Null","Null","Null","Null","Null","Null"]
[null,"Broken pipe - full break","Null","Null","Null","Null","Null","Null","Null"]
[null,"Corrosion","Null","Null","Null","Null","Null","Null","Null"]
[null,"Joint leak","Null","Null","Null","Null","Null","Null","Null"]
[null,"3rd party damage","Null","Null","Null","Null","Null","Null","Null"]
[null,"Identified water in main","Null","Null","Null","Null","Null","Null","Null"]
[null,"Other ","Null","Null","Null","Null","Null","Null","Null"]
[null,"High density polyethylene (250)"]
[null,"Broken pipe - cracked","Null","Null","Null","Null","Null","Null","Null"]
[null,"Broken pipe - full break","Null","Null","Null","Null","Null","Null","Null"]
[null,"Corrosion","Null","Null","Null","Null","Null","Null","Null"]
[null,"Joint leak","Null","Null","Null","Null","Null","Null","Null"]
[null,"3rd party damage","Null","Null","Null","Null","Null","Null","Null"]
[null,"Identified water in main","Null","Null","Null","Null","Null","Null","Null"]
[null,"Other ","Null","Null","Null","Null","Null","Null","Null"]
[null,"High density polyethylene (575)"]
[null,"Broken pipe - cracked","Null","Null","Null","Null","Null","Null","Null"]
[null,"Broken pipe - full break","Null","Null","Null","Null","Null","Null","Null"]
[null,"Corrosion","Null","Null","Null","Null","Null","Null","Null"]
[null,"Joint leak","Null","Null","Null","Null","Null","Null","Null"]
[null,"3rd party damage","Null","Null","Null","Null","Null","Null","Null"]
[null,"Identified water in main","Null","Null","Null","Null","Null","Null","Null"]
[null,"Other ","Null","Null","Null","Null","Null","Null","Null"]
[null,"Medium density polyethylene"]
[null,"Broken pipe - cracked","Null","Null","Null","Null","Null","Null","Null"]
[null,"Broken pipe - full break","Null","Null","Null","Null","Null","Null","Null"]
[null,"Corrosion","Null","Null","Null","Null","Null","Null","Null"]
[null,"Joint leak","Null","Null","Null","Null","Null","Null","Null"]
[null,"3rd party damage","Null","Null","Null","Null","Null","Null","Null"]
[null,"Identified water in main","Null","Null","Null","Null","Null","Null","Null"]
[null,"Other ","Null","Null","Null","Null","Null","Null","Null"]
[null,"Other polyethylene"]
[null,"Broken pipe - cracked",0.19047564721802288,0.19047564721802288,0.19047564721802288,0.19047564721802288,0.19047564721802288,0.19047564721802288,0.19047564721802288]
[null,"Broken pipe - full break",6.5292008247599662E-2,6.5292008247599662E-2,6.5292008247599662E-2,6.5292008247599662E-2,6.5292008247599662E-2,6.5292008247599662E-2,6.5292008247599662E-2]
[null,"Corrosion",0,0,0,0,0,0,0]
[null,"Joint leak",0.32978443131877327,0.32978443131877327,0.32978443131877327,0.32978443131877327,0.32978443131877327,0.32978443131877327,0.32978443131877327]
[null,"3rd party damage",0.21136983410468158,0.21136983410468158,0.21136983410468158,0.21136983410468158,0.21136983410468158,0.21136983410468158,0.21136983410468158]
[null,"Identified water in main",0,0,0,0,0,0,0]
[null,"Other ",0.11474211942167339,0.11474211942167339,0.11474211942167339,0.11474211942167339,0.11474211942167339,0.11474211942167339,0.11474211942167339]
[null,"Unprotected steel"]
[null,"Broken pipe - cracked",8.5195492413439974E-2,8.5195492413439974E-2,8.5195492413439974E-2,8.5195492413439974E-2,8.5195492413439974E-2,8.5195492413439974E-2,0]
[null,"Broken pipe - full break",3.711480376700263E-2,3.711480376700263E-2,3.711480376700263E-2,3.711480376700263E-2,3.711480376700263E-2,3.711480376700263E-2,0]
[null,"Corrosion",0.82722416996614145,0.82722416996614145,0.82722416996614145,0.82722416996614145,0.82722416996614145,0.82722416996614145,0]
[null,"Joint leak",0.84680213044106045,0.84680213044106045,0.84680213044106045,0.84680213044106045,0.84680213044106045,0.84680213044106045,0]
[null,"3rd party damage",0.17429351369501403,0.17429351369501403,0.17429351369501403,0.17429351369501403,0.17429351369501403,0.17429351369501403,0]
[null,"Identified water in main",0,0,0,0,0,0,0]
[null,"Other ",9.9681090998855443E-2,9.9681090998855443E-2,9.9681090998855443E-2,9.9681090998855443E-2,9.9681090998855443E-2,9.9681090998855443E-2,0]
[null,"Protected steel"]
[null,"Broken pipe - cracked",0,0,0,0,0,0,0]
[null,"Broken pipe - full break",0,0,0,0,0,0,0]
[null,"Corrosion",7.2621641249092234E-3,7.2621641249092234E-3,7.2621641249092234E-3,7.2621641249092234E-3,7.2621641249092234E-3,7.2621641249092234E-3,7.2621641249092234E-3]
[null,"Joint leak",1.3435003631082063E-2,1.3435003631082063E-2,1.3435003631082063E-2,1.3435003631082063E-2,1.3435003631082063E-2,1.3435003631082063E-2,1.3435003631082063E-2]
[null,"3rd party damage",0,0,0,0,0,0,0]
[null,"Identified water in main",0,0,0,0,0,0,0]
[null,"Other ",0,0,0,0,0,0,0]
[]
[null,"S11.2.2 - MEDIUM PRESSURE"]
[null,null,"VOLUMES"]
[null,null,"Number per KM"]
[null,null,{"$f":"CRCP_y4","v":"2019-20"},{"$f":"CRCP_y5","v":"2020-21"},{"$f":"FRCP_y1","v":"2021-22"},{"$f":"FRCP_y2","v":"2022-23"},{"$f":"FRCP_y3","v":"2023-24"},{"$f":"FRCP_y4","v":"2024-25"},{"$f":"FRCP_y5","v":"2025-26"}]
[null,"Cast Iron"]
[null,"Broken pipe - cracked",7.0960811430817575E-2,7.0960811430817575E-2,7.0960811430817575E-2,7.0960811430817575E-2,7.0960811430817575E-2,7.0960811430817575E-2,0]
[null,"Broken pipe - full break",3.3011626765637195E-2,3.3011626765637195E-2,3.3011626765637195E-2,3.3011626765637195E-2,3.3011626765637195E-2,3.3011626765637195E-2,0]
[null,"Corrosion",4.9597628547591067E-2,4.9597628547591067E-2,4.9597628547591067E-2,4.9597628547591067E-2,4.9597628547591067E-2,4.9597628547591067E-2,0]
[null,"Joint leak",0.34468126665368054,0.34468126665368054,0.34468126665368054,0.34468126665368054,0.34468126665368054,0.34468126665368054,0]
[null,"3rd party damage",2.7340621432615047E-2,2.7340621432615047E-2,2.7340621432615047E-2,2.7340621432615047E-2,2.7340621432615047E-2,2.7340621432615047E-2,0]
[null,"Identified water in main",0,0,0,0,0,0,0]
[null,"Other ",7.0110062871042128E-2,7.0110062871042128E-2,7.0110062871042128E-2,7.0110062871042128E-2,7.0110062871042128E-2,7.0110062871042128E-2,0]
[null,"PVC"]
[null,"Broken pipe - cracked",0,0,0,0,0,0,0]
[null,"Broken pipe - full break",0,0,0,0,0,0,0]
[null,"Corrosion",0,0,0,0,0,0,0]
[null,"Joint leak",0,0,0,0,0,0,0]
[null,"3rd party damage",0,0,0,0,0,0,0]
[null,"Identified water in main",0,0,0,0,0,0,0]
[null,"Other ",0,0,0,0,0,0,0]
[null,"Polyamide"]
[null,"Broken pipe - cracked",0,0,0,0,0,0,0]
[null,"Broken pipe - full break",0,0,0,0,0,0,0]
[null,"Corrosion",0,0,0,0,0,0,0]
[null,"Joint leak",0,0,0,0,0,0,0]
[null,"3rd party damage",0,0,0,0,0,0,0]
[null,"Identified water in main",0,0,0,0,0,0,0]
[null,"Other ",0,0,0,0,0,0,0]
[null,"High density polyethylene (80)"]
[null,"Broken pipe - cracked","Null","Null","Null","Null","Null","Null","Null"]
[null,"Broken pipe - full break","Null","Null","Null","Null","Null","Null","Null"]
[null,"Corrosion","Null","Null","Null","Null","Null","Null","Null"]
[null,"Joint leak","Null","Null","Null","Null","Null","Null","Null"]
[null,"3rd party damage","Null","Null","Null","Null","Null","Null","Null"]
[null,"Identified water in main","Null","Null","Null","Null","Null","Null","Null"]
[null,"Other ","Null","Null","Null","Null","Null","Null","Null"]
[null,"High density polyethylene (100)"]
[null,"Broken pipe - cracked","Null","Null","Null","Null","Null","Null","Null"]
[null,"Broken pipe - full break","Null","Null","Null","Null","Null","Null","Null"]
[null,"Corrosion","Null","Null","Null","Null","Null","Null","Null"]
[null,"Joint leak","Null","Null","Null","Null","Null","Null","Null"]
[null,"3rd party damage","Null","Null","Null","Null","Null","Null","Null"]
[null,"Identified water in main","Null","Null","Null","Null","Null","Null","Null"]
[null,"Other ","Null","Null","Null","Null","Null","Null","Null"]
[null,"High density polyethylene (250)"]
[null,"Broken pipe - cracked","Null","Null","Null","Null","Null","Null","Null"]
[null,"Broken pipe - full break","Null","Null","Null","Null","Null","Null","Null"]
[null,"Corrosion","Null","Null","Null","Null","Null","Null","Null"]
[null,"Joint leak","Null","Null","Null","Null","Null","Null","Null"]
[null,"3rd party damage","Null","Null","Null","Null","Null","Null","Null"]
[null,"Identified water in main","Null","Null","Null","Null","Null","Null","Null"]
[null,"Other ","Null","Null","Null","Null","Null","Null","Null"]
[null,"High density polyethylene (575)"]
[null,"Broken pipe - cracked","Null","Null","Null","Null","Null","Null","Null"]
[null,"Broken pipe - full break","Null","Null","Null","Null","Null","Null","Null"]
[null,"Corrosion","Null","Null","Null","Null","Null","Null","Null"]
[null,"Joint leak","Null","Null","Null","Null","Null","Null","Null"]
[null,"3rd party damage","Null","Null","Null","Null","Null","Null","Null"]
[null,"Identified water in main","Null","Null","Null","Null","Null","Null","Null"]
[null,"Other ","Null","Null","Null","Null","Null","Null","Null"]
[null,"Medium density polyethylene"]
[null,"Broken pipe - cracked","Null","Null","Null","Null","Null","Null","Null"]
[null,"Broken pipe - full break","Null","Null","Null","Null","Null","Null","Null"]
[null,"Corrosion","Null","Null","Null","Null","Null","Null","Null"]
[null,"Joint leak","Null","Null","Null","Null","Null","Null","Null"]
[null,"3rd party damage","Null","Null","Null","Null","Null","Null","Null"]
[null,"Identified water in main","Null","Null","Null","Null","Null","Null","Null"]
[null,"Other ","Null","Null","Null","Null","Null","Null","Null"]
[null,"Other polyethylene"]
[null,"Broken pipe - cracked",5.1337431569503489E-2,5.1337431569503489E-2,5.1337431569503489E-2,5.1337431569503489E-2,5.1337431569503489E-2,5.1337431569503489E-2,5.1337431569503489E-2]
[null,"Broken pipe - full break",1.9098608319537011E-2,1.9098608319537011E-2,1.9098608319537011E-2,1.9098608319537011E-2,1.9098608319537011E-2,1.9098608319537011E-2,1.9098608319537011E-2]
[null,"Corrosion",0,0,0,0,0,0,0]
[null,"Joint leak",0.13865926495380554,0.13865926495380554,0.13865926495380554,0.13865926495380554,0.13865926495380554,0.13865926495380554,0.13865926495380554]
[null,"3rd party damage",0.12088477730952703,0.12088477730952703,0.12088477730952703,0.12088477730952703,0.12088477730952703,0.12088477730952703,0.12088477730952703]
[null,"Identified water in main",0,0,0,0,0,0,0]
[null,"Other ",8.070857768007729E-2,8.070857768007729E-2,8.070857768007729E-2,8.070857768007729E-2,8.070857768007729E-2,8.070857768007729E-2,8.070857768007729E-2]
[null,"Unprotected steel"]
[null,"Broken pipe - cracked",0.73264185013065464,0.73264185013065464,0.73264185013065464,0.73264185013065464,0.73264185013065464,0,0]
[null,"Broken pipe - full break",0.44448732667586544,0.44448732667586544,0.44448732667586544,0.44448732667586544,0.44448732667586544,0,0]
[null,"Corrosion",1.7067232966579506,1.7067232966579506,1.7067232966579506,1.7067232966579506,1.7067232966579506,0,0]
[null,"Joint leak",4.6207979432914703,4.6207979432914703,4.6207979432914703,4.6207979432914703,4.6207979432914703,0,0]
[null,"3rd party damage",1.2984936779306693,1.2984936779306693,1.2984936779306693,1.2984936779306693,1.2984936779306693,0,0]
[null,"Identified water in main",0,0,0,0,0,0,0]
[null,"Other ",1.7064787009965232,1.7064787009965232,1.7064787009965232,1.7064787009965232,1.7064787009965232,0,0]
[null,"Protected steel"]
[null,"Broken pipe - cracked",0,0,0,0,0,0,0]
[null,"Broken pipe - full break",0,0,0,0,0,0,0]
[null,"Corrosion",2.3052097740894421E-4,2.3052097740894421E-4,2.3052097740894421E-4,2.3052097740894421E-4,2.3052097740894421E-4,2.3052097740894421E-4,2.3052097740894421E-4]
[null,"Joint leak",2.3133689592153055E-4,2.3133689592153055E-4,2.3133689592153055E-4,2.3133689592153055E-4,2.3133689592153055E-4,2.3133689592153055E-4,2.3133689592153055E-4]
[null,"3rd party damage",0,0,0,0,0,0,0]
[null,"Identified water in main",0,0,0,0,0,0,0]
[null,"Other ",0,0,0,0,0,0,0]
[]
[null,"S11.2.3 - HIGH PRESSURE"]
[null,null,"VOLUMES"]
[null,null,"Number per KM"]
[null,null,{"$f":"CRCP_y4","v":"2019-20"},{"$f":"CRCP_y5","v":"2020-21"},{"$f":"FRCP_y1","v":"2021-22"},{"$f":"FRCP_y2","v":"2022-23"},{"$f":"FRCP_y3","v":"2023-24"},{"$f":"FRCP_y4","v":"2024-25"},{"$f":"FRCP_y5","v":"2025-26"}]
[null,"Cast Iron"]
[null,"Broken pipe - cracked",0,0,0,0,0,0,0]
[null,"Broken pipe - full break",0,0,0,0,0,0,0]
[null,"Corrosion",0,0,0,0,0,0,0]
[null,"Joint leak",0,0,0,0,0,0,0]
[null,"3rd party damage",0,0,0,0,0,0,0]
[null,"Identified water in main",0,0,0,0,0,0,0]
[null,"Other ",0,0,0,0,0,0,0]
[null,"PVC"]
[null,"Broken pipe - cracked",0,0,0,0,0,0,0]
[null,"Broken pipe - full break",0,0,0,0,0,0,0]
[null,"Corrosion",0,0,0,0,0,0,0]
[null,"Joint leak",0,0,0,0,0,0,0]
[null,"3rd party damage",0,0,0,0,0,0,0]
[null,"Identified water in main",0,0,0,0,0,0,0]
[null,"Other ",0,0,0,0,0,0,0]
[null,"Polyamide"]
[null,"Broken pipe - cracked",0,0,0,0,0,0,0]
[null,"Broken pipe - full break",0,0,0,0,0,0,0]
[null,"Corrosion",0,0,0,0,0,0,0]
[null,"Joint leak",0,0,0,0,0,0,0]
[null,"3rd party damage",0,0,0,0,0,0,0]
[null,"Identified water in main",0,0,0,0,0,0,0]
[null,"Other ",0,0,0,0,0,0,0]
[null,"High density polyethylene (80)"]
[null,"Broken pipe - cracked","Null","Null","Null","Null","Null","Null","Null"]
[null,"Broken pipe - full break","Null","Null","Null","Null","Null","Null","Null"]
[null,"Corrosion","Null","Null","Null","Null","Null","Null","Null"]
[null,"Joint leak","Null","Null","Null","Null","Null","Null","Null"]
[null,"3rd party damage","Null","Null","Null","Null","Null","Null","Null"]
[null,"Identified water in main","Null","Null","Null","Null","Null","Null","Null"]
[null,"Other ","Null","Null","Null","Null","Null","Null","Null"]
[null,"High density polyethylene (100)"]
[null,"Broken pipe - cracked","Null","Null","Null","Null","Null","Null","Null"]
[null,"Broken pipe - full break","Null","Null","Null","Null","Null","Null","Null"]
[null,"Corrosion","Null","Null","Null","Null","Null","Null","Null"]
[null,"Joint leak","Null","Null","Null","Null","Null","Null","Null"]
[null,"3rd party damage","Null","Null","Null","Null","Null","Null","Null"]
[null,"Identified water in main","Null","Null","Null","Null","Null","Null","Null"]
[null,"Other ","Null","Null","Null","Null","Null","Null","Null"]
[null,"High density polyethylene (250)"]
[null,"Broken pipe - cracked","Null","Null","Null","Null","Null","Null","Null"]
[null,"Broken pipe - full break","Null","Null","Null","Null","Null","Null","Null"]
[null,"Corrosion","Null","Null","Null","Null","Null","Null","Null"]
[null,"Joint leak","Null","Null","Null","Null","Null","Null","Null"]
[null,"3rd party damage","Null","Null","Null","Null","Null","Null","Null"]
[null,"Identified water in main","Null","Null","Null","Null","Null","Null","Null"]
[null,"Other ","Null","Null","Null","Null","Null","Null","Null"]
[null,"High density polyethylene (575)"]
[null,"Broken pipe - cracked","Null","Null","Null","Null","Null","Null","Null"]
[null,"Broken pipe - full break","Null","Null","Null","Null","Null","Null","Null"]
[null,"Corrosion","Null","Null","Null","Null","Null","Null","Null"]
[null,"Joint leak","Null","Null","Null","Null","Null","Null","Null"]
[null,"3rd party damage","Null","Null","Null","Null","Null","Null","Null"]
[null,"Identified water in main","Null","Null","Null","Null","Null","Null","Null"]
[null,"Other ","Null","Null","Null","Null","Null","Null","Null"]
[null,"Medium density polyethylene"]
[null,"Broken pipe - cracked","Null","Null","Null","Null","Null","Null","Null"]
[null,"Broken pipe - full break","Null","Null","Null","Null","Null","Null","Null"]
[null,"Corrosion","Null","Null","Null","Null","Null","Null","Null"]
[null,"Joint leak","Null","Null","Null","Null","Null","Null","Null"]
[null,"3rd party damage","Null","Null","Null","Null","Null","Null","Null"]
[null,"Identified water in main","Null","Null","Null","Null","Null","Null","Null"]
[null,"Other ","Null","Null","Null","Null","Null","Null","Null"]
[null,"Other polyethylene"]
[null,"Broken pipe - cracked",2.7834845609149381E-2,2.7834845609149381E-2,2.7834845609149381E-2,2.7834845609149381E-2,2.7834845609149381E-2,2.7834845609149381E-2,2.7834845609149381E-2]
[null,"Broken pipe - full break",1.5923951717759011E-2,1.5923951717759011E-2,1.5923951717759011E-2,1.5923951717759011E-2,1.5923951717759011E-2,1.5923951717759011E-2,1.5923951717759011E-2]
[null,"Corrosion",0,0,0,0,0,0,0]
[null,"Joint leak",0.12506784280471428,0.12506784280471428,0.12506784280471428,0.12506784280471428,0.12506784280471428,0.12506784280471428,0.12506784280471428]
[null,"3rd party damage",9.1571174600745861E-2,9.1571174600745861E-2,9.1571174600745861E-2,9.1571174600745861E-2,9.1571174600745861E-2,9.1571174600745861E-2,9.1571174600745861E-2]
[null,"Identified water in main",0,0,0,0,0,0,0]
[null,"Other ",7.1247132376994593E-2,7.1247132376994593E-2,7.1247132376994593E-2,7.1247132376994593E-2,7.1247132376994593E-2,7.1247132376994593E-2,7.1247132376994593E-2]
[null,"Unprotected steel"]
[null,"Broken pipe - cracked",0,0,0,0,0,0,0]
[null,"Broken pipe - full break",0,0,0,0,0,0,0]
[null,"Corrosion",0,0,0,0,0,0,0]
[null,"Joint leak",0,0,0,0,0,0,0]
[null,"3rd party damage",0,0,0,0,0,0,0]
[null,"Identified water in main",0,0,0,0,0,0,0]
[null,"Other ",0,0,0,0,0,0,0]
[null,"Protected steel"]
[null,"Broken pipe - cracked",8.6211173024352931E-3,8.6211173024352931E-3,8.6211173024352931E-3,8.6211173024352931E-3,8.6211173024352931E-3,8.6211173024352931E-3,8.6211173024352931E-3]
[null,"Broken pipe - full break",6.7571341863323382E-3,6.7571341863323382E-3,6.7571341863323382E-3,6.7571341863323382E-3,6.7571341863323382E-3,6.7571341863323382E-3,6.7571341863323382E-3]
[null,"Corrosion",2.6057187027156647E-2,2.6057187027156647E-2,2.6057187027156647E-2,2.6057187027156647E-2,2.6057187027156647E-2,2.6057187027156647E-2,2.6057187027156647E-2]
[null,"Joint leak",9.2170273862155316E-2,9.2170273862155316E-2,9.2170273862155316E-2,9.2170273862155316E-2,9.2170273862155316E-2,9.2170273862155316E-2,9.2170273862155316E-2]
[null,"3rd party damage",3.0578655314619913E-2,3.0578655314619913E-2,3.0578655314619913E-2,3.0578655314619913E-2,3.0578655314619913E-2,3.0578655314619913E-2,3.0578655314619913E-2]
[null,"Identified water in main",0,0,0,0,0,0,0]
[null,"Other ",3.1440104709507595E-2,3.1440104709507595E-2,3.1440104709507595E-2,3.1440104709507595E-2,3.1440104709507595E-2,3.1440104709507595E-2,3.1440104709507595E-2]
[]
[]
[]
[null,"S11.3 - UNACCOUNTED FOR GAS - TRANSMISSION AND DISTRIBUTION"]
[null,null,"VOLUMES"]
[null,null,"GJ"]
[null,"Place of loss",{"$f":"CRCP_y4","v":"2019-20"},{"$f":"CRCP_y5","v":"2020-21"},{"$f":"FRCP_y1","v":"2021-22"},{"$f":"FRCP_y2","v":"2022-23"},{"$f":"FRCP_y3","v":"2023-24"},{"$f":"FRCP_y4","v":"2024-25"},{"$f":"FRCP_y5","v":"2025-26"}]
[null,"Transmission and distribution",768000,768000,768000,768000,768000,768000,768000]
[]
[]
[]
[]
[]
[]
[]
[]
[]
[null,"Total",{"$f":"SUM(C311:C320)","v":768000},768000,768000,768000,768000,768000,768000]

{"sheet":"F2. Capex","index":26,"n_rows":42,"n_cols":4,"rows_kept":42,"cut":false,"hidden":false,"merged":[[8,2,8,3],[9,2,9,3]]}
[null,{"$f":"INDEX(dms_Worksheet_List,MATCH(dms_Model,dms_Model_List))","v":"REGULATORY REPORTING STATEMENT"}]
[null,{"$f":"INDEX(dms_TradingNameFull_List,MATCH(dms_TradingName,dms_TradingName_List))","v":"Australian Gas Networks Limited (reporting data for SA)"}]
[null,{"$f":"dms_Header_Span","v":"2019-20 - 2025-26"}]
[null,"F2. CAPITAL EXPENDITURE"]
[]
[]
[null,"F2.7 - IMMEDIATE EXPENSING CAPEX"]
[null,"F2.7.1 - ACTUAL - AS INCURRED"]
[null,null,"EXPENDITURE"]
[null,null,"$0's, nominal"]
[null,"Asset class",{"$f":"dms_y1","v":"2019-20"},{"$f":"dms_y2","v":"2020-21"}]
[null,null,"N/A","N/A"]
[]
[]
[]
[]
[]
[]
[]
[]
[]
[]
[]
[]
[]
[]
[]
[]
[]
[]
[]
[]
[]
[]
[]
[]
[]
[]
[]
[]
[]
[null,"Total",{"$f":"SUM(C12:C41)","v":0},0]

{"sheet":"F3. Revenue","index":27,"n_rows":185,"n_cols":9,"rows_kept":185,"cut":false,"hidden":false,"merged":[[7,2,7,8],[8,2,8,8],[139,2,139,8],[140,2,140,8],[155,2,155,8],[113,2,113,8],[114,2,114,8],[181,2,181,8],[182,2,182,8],[88,2,88,8],[89,2,89,8],[168,2,168,8],[169,2,169,8],[156,2,156,8]]}
[null,{"$f":"INDEX(dms_Worksheet_List,MATCH(dms_Model,dms_Model_List))","v":"REGULATORY REPORTING STATEMENT"}]
[null,{"$f":"INDEX(dms_TradingNameFull_List,MATCH(dms_TradingName,dms_TradingName_List))","v":"Australian Gas Networks Limited (reporting data for SA)"}]
[null,{"$f":"dms_Header_Span","v":"2019-20 - 2025-26"}]
[null,"F3. REVENUE"]
[]
[null,"F3.1 - REFERENCE SERVICES"]
[null,"F3.1.1 -  REVENUE - BY TARIFF"]
[null,null,"REVENUE"]
[null,null,{"$f":"CONCATENATE(\"$0's, real \",dms_DollarReal)","v":"$0's, real June 2021"}]
[null,"Tariff",{"$f":"CRCP_y4","v":"2019-20"},{"$f":"CRCP_y5","v":"2020-21"},{"$f":"FRCP_y1","v":"2021-22"},{"$f":"FRCP_y2","v":"2022-23"},{"$f":"FRCP_y3","v":"2023-24"},{"$f":"FRCP_y4","v":"2024-25"},{"$f":"FRCP_y5","v":"2025-26"}]
[null,{"$f":"IF(ISBLANK('N1. Demand'!B21),\"\",'N1. Demand'!B21)","v":"Tariff R - SA excl New Towns"},{"$f":"'[5]F3. Revenue'!C11","v":175877809.37939873},{"$f":"'[5]F3. Revenue'!D11","v":180010937.89981461},{"$f":"'[5]F3. Revenue'!E11","v":165343589.01167688},{"$f":"'[5]F3. Revenue'!F11","v":166080789.49927595},{"$f":"'[5]F3. Revenue'!G11","v":166755533.37543565},{"$f":"'[5]F3. Revenue'!H11","v":167396398.93738523},{"$f":"'[5]F3. Revenue'!I11","v":168290749.30159792}]
[null,{"$f":"IF(ISBLANK('N1. Demand'!B22),\"\",'N1. Demand'!B22)","v":"Tariff R - New Towns"},{"$f":"'[5]F3. Revenue'!C12","v":100303.72546975398},{"$f":"'[5]F3. Revenue'!D12","v":102660.8630182932},{"$f":"'[5]F3. Revenue'!E12","v":93801.761286754147},{"$f":"'[5]F3. Revenue'!F12","v":233620.29178544649},{"$f":"'[5]F3. Revenue'!G12","v":1774623.7350961345},{"$f":"'[5]F3. Revenue'!H12","v":874385.84011577046},{"$f":"'[5]F3. Revenue'!I12","v":1255431.575529105}]
[null,{"$f":"IF(ISBLANK('N1. Demand'!B23),\"\",'N1. Demand'!B23)","v":"Tariff C - SA excl New Towns"},{"$f":"'[5]F3. Revenue'!C13","v":33299369.288966633},{"$f":"'[5]F3. Revenue'!D13","v":34081904.467257351},{"$f":"'[5]F3. Revenue'!E13","v":31612321.429871034},{"$f":"'[5]F3. Revenue'!F13","v":32256231.325070407},{"$f":"'[5]F3. Revenue'!G13","v":32770702.114182442},{"$f":"'[5]F3. Revenue'!H13","v":33157808.936676938},{"$f":"'[5]F3. Revenue'!I13","v":33613049.163400821}]
[null,{"$f":"IF(ISBLANK('N1. Demand'!B24),\"\",'N1. Demand'!B24)","v":"Tariff C - New Towns"},{"$f":"'[5]F3. Revenue'!C14","v":126637.15212749138},{"$f":"'[5]F3. Revenue'!D14","v":129613.12520248744},{"$f":"'[5]F3. Revenue'!E14","v":120327.13488268411},{"$f":"'[5]F3. Revenue'!F14","v":156836.48091215437},{"$f":"'[5]F3. Revenue'!G14","v":257412.94897252758},{"$f":"'[5]F3. Revenue'!H14","v":354144.4555446303},{"$f":"'[5]F3. Revenue'!I14","v":475470.42012986616}]
[null,{"$f":"IF(ISBLANK('N1. Demand'!B25),\"\",'N1. Demand'!B25)","v":"Northern"},{"$f":"'[5]F3. Revenue'!C15","v":7851582.0874212384},{"$f":"'[5]F3. Revenue'!D15","v":8036094.2664756384},{"$f":"'[5]F3. Revenue'!E15","v":7300710.9318101304},{"$f":"'[5]F3. Revenue'!F15","v":7183567.0103643378},{"$f":"'[5]F3. Revenue'!G15","v":7062771.3854801552},{"$f":"'[5]F3. Revenue'!H15","v":6937901.8523876583},{"$f":"'[5]F3. Revenue'!I15","v":6808871.1558717964}]
[null,{"$f":"IF(ISBLANK('N1. Demand'!B26),\"\",'N1. Demand'!B26)","v":"Central"},{"$f":"'[5]F3. Revenue'!C16","v":4747578.4044843912},{"$f":"'[5]F3. Revenue'!D16","v":4859146.4969897745},{"$f":"'[5]F3. Revenue'!E16","v":4360822.9365705783},{"$f":"'[5]F3. Revenue'!F16","v":4290281.6162346937},{"$f":"'[5]F3. Revenue'!G16","v":4218007.7201275071},{"$f":"'[5]F3. Revenue'!H16","v":4145061.8264561826},{"$f":"'[5]F3. Revenue'!I16","v":4071368.69250549}]
[null,{"$f":"IF(ISBLANK('N1. Demand'!B27),\"\",'N1. Demand'!B27)","v":"Southern"},{"$f":"'[5]F3. Revenue'!C17","v":1357215.3395332326},{"$f":"'[5]F3. Revenue'!D17","v":1389109.9000122638},{"$f":"'[5]F3. Revenue'!E17","v":1246668.8027834031},{"$f":"'[5]F3. Revenue'!F17","v":1219914.6453292889},{"$f":"'[5]F3. Revenue'!G17","v":1192538.5778951703},{"$f":"'[5]F3. Revenue'!H17","v":1164804.2185804306},{"$f":"'[5]F3. Revenue'!I17","v":1136695.6335392056}]
[null,{"$f":"IF(ISBLANK('N1. Demand'!B28),\"\",'N1. Demand'!B28)","v":"Peterborough"}]
[null,{"$f":"IF(ISBLANK('N1. Demand'!B29),\"\",'N1. Demand'!B29)","v":"Port Pirie"}]
[null,{"$f":"IF(ISBLANK('N1. Demand'!B30),\"\",'N1. Demand'!B30)","v":"Riverland"}]
[null,{"$f":"IF(ISBLANK('N1. Demand'!B31),\"\",'N1. Demand'!B31)","v":"South East"}]
[null,{"$f":"IF(ISBLANK('N1. Demand'!B32),\"\",'N1. Demand'!B32)","v":"Whyalla"}]
[null,{"$f":"IF(ISBLANK('N1. Demand'!B33),\"\",'N1. Demand'!B33)","v":""}]
[null,{"$f":"IF(ISBLANK('N1. Demand'!B34),\"\",'N1. Demand'!B34)","v":""}]
[null,{"$f":"IF(ISBLANK('N1. Demand'!B35),\"\",'N1. Demand'!B35)","v":""}]
[null,{"$f":"IF(ISBLANK('N1. Demand'!B36),\"\",'N1. Demand'!B36)","v":""}]
[null,{"$f":"IF(ISBLANK('N1. Demand'!B37),\"\",'N1. Demand'!B37)","v":""}]
[null,{"$f":"IF(ISBLANK('N1. Demand'!B38),\"\",'N1. Demand'!B38)","v":""}]
[null,{"$f":"IF(ISBLANK('N1. Demand'!B39),\"\",'N1. Demand'!B39)","v":""}]
[null,{"$f":"IF(ISBLANK('N1. Demand'!B40),\"\",'N1. Demand'!B40)","v":""}]
[null,{"$f":"IF(ISBLANK('N1. Demand'!B41),\"\",'N1. Demand'!B41)","v":""}]
[null,{"$f":"IF(ISBLANK('N1. Demand'!B42),\"\",'N1. Demand'!B42)","v":""}]
[null,{"$f":"IF(ISBLANK('N1. Demand'!B43),\"\",'N1. Demand'!B43)","v":""}]
[null,{"$f":"IF(ISBLANK('N1. Demand'!B44),\"\",'N1. Demand'!B44)","v":""}]
[null,{"$f":"IF(ISBLANK('N1. Demand'!B45),\"\",'N1. Demand'!B45)","v":""}]
[null,{"$f":"IF(ISBLANK('N1. Demand'!B46),\"\",'N1. Demand'!B46)","v":""}]
[null,{"$f":"IF(ISBLANK('N1. Demand'!B47),\"\",'N1. Demand'!B47)","v":""}]
[null,{"$f":"IF(ISBLANK('N1. Demand'!B48),\"\",'N1. Demand'!B48)","v":""}]
[null,{"$f":"IF(ISBLANK('N1. Demand'!B49),\"\",'N1. Demand'!B49)","v":""}]
[null,{"$f":"IF(ISBLANK('N1. Demand'!B50),\"\",'N1. Demand'!B50)","v":""}]
[null,{"$f":"IF(ISBLANK('N1. Demand'!B51),\"\",'N1. Demand'!B51)","v":""}]
[null,{"$f":"IF(ISBLANK('N1. Demand'!B52),\"\",'N1. Demand'!B52)","v":""}]
[null,{"$f":"IF(ISBLANK('N1. Demand'!B53),\"\",'N1. Demand'!B53)","v":""}]
[null,{"$f":"IF(ISBLANK('N1. Demand'!B54),\"\",'N1. Demand'!B54)","v":""}]
[null,{"$f":"IF(ISBLANK('N1. Demand'!B55),\"\",'N1. Demand'!B55)","v":""}]
[null,{"$f":"IF(ISBLANK('N1. Demand'!B56),\"\",'N1. Demand'!B56)","v":""}]
[null,{"$f":"IF(ISBLANK('N1. Demand'!B57),\"\",'N1. Demand'!B57)","v":""}]
[null,{"$f":"IF(ISBLANK('N1. Demand'!B58),\"\",'N1. Demand'!B58)","v":""}]
[null,{"$f":"IF(ISBLANK('N1. Demand'!B59),\"\",'N1. Demand'!B59)","v":""}]
[null,{"$f":"IF(ISBLANK('N1. Demand'!B60),\"\",'N1. Demand'!B60)","v":""}]
[null,{"$f":"IF(ISBLANK('N1. Demand'!B61),\"\",'N1. Demand'!B61)","v":""}]
[null,{"$f":"IF(ISBLANK('N1. Demand'!B62),\"\",'N1. Demand'!B62)","v":""}]
[null,{"$f":"IF(ISBLANK('N1. Demand'!B63),\"\",'N1. Demand'!B63)","v":""}]
[null,{"$f":"IF(ISBLANK('N1. Demand'!B64),\"\",'N1. Demand'!B64)","v":""}]
[null,{"$f":"IF(ISBLANK('N1. Demand'!B65),\"\",'N1. Demand'!B65)","v":""}]
[null,{"$f":"IF(ISBLANK('N1. Demand'!B66),\"\",'N1. Demand'!B66)","v":""}]
[null,{"$f":"IF(ISBLANK('N1. Demand'!B67),\"\",'N1. Demand'!B67)","v":""}]
[null,{"$f":"IF(ISBLANK('N1. Demand'!B68),\"\",'N1. Demand'!B68)","v":""}]
[null,{"$f":"IF(ISBLANK('N1. Demand'!B69),\"\",'N1. Demand'!B69)","v":""}]
[null,{"$f":"IF(ISBLANK('N1. Demand'!B70),\"\",'N1. Demand'!B70)","v":""}]
[null,{"$f":"IF(ISBLANK('N1. Demand'!B71),\"\",'N1. Demand'!B71)","v":""}]
[null,{"$f":"IF(ISBLANK('N1. Demand'!B72),\"\",'N1. Demand'!B72)","v":""}]
[null,{"$f":"IF(ISBLANK('N1. Demand'!B73),\"\",'N1. Demand'!B73)","v":""}]
[null,{"$f":"IF(ISBLANK('N1. Demand'!B74),\"\",'N1. Demand'!B74)","v":""}]
[null,{"$f":"IF(ISBLANK('N1. Demand'!B75),\"\",'N1. Demand'!B75)","v":""}]
[null,{"$f":"IF(ISBLANK('N1. Demand'!B76),\"\",'N1. Demand'!B76)","v":""}]
[null,{"$f":"IF(ISBLANK('N1. Demand'!B77),\"\",'N1. Demand'!B77)","v":""}]
[null,{"$f":"IF(ISBLANK('N1. Demand'!B78),\"\",'N1. Demand'!B78)","v":""}]
[null,{"$f":"IF(ISBLANK('N1. Demand'!B79),\"\",'N1. Demand'!B79)","v":""}]
[null,{"$f":"IF(ISBLANK('N1. Demand'!B80),\"\",'N1. Demand'!B80)","v":""}]
[null,{"$f":"IF(ISBLANK('N1. Demand'!B81),\"\",'N1. Demand'!B81)","v":""}]
[null,{"$f":"IF(ISBLANK('N1. Demand'!B82),\"\",'N1. Demand'!B82)","v":""}]
[null,{"$f":"IF(ISBLANK('N1. Demand'!B83),\"\",'N1. Demand'!B83)","v":""}]
[null,{"$f":"IF(ISBLANK('N1. Demand'!B84),\"\",'N1. Demand'!B84)","v":""}]
[null,{"$f":"IF(ISBLANK('N1. Demand'!B85),\"\",'N1. Demand'!B85)","v":""}]
[null,{"$f":"IF(ISBLANK('N1. Demand'!B86),\"\",'N1. Demand'!B86)","v":""}]
[null,{"$f":"IF(ISBLANK('N1. Demand'!B87),\"\",'N1. Demand'!B87)","v":""}]
[null,{"$f":"IF(ISBLANK('N1. Demand'!B88),\"\",'N1. Demand'!B88)","v":""}]
[null,{"$f":"IF(ISBLANK('N1. Demand'!B89),\"\",'N1. Demand'!B89)","v":""}]
[null,{"$f":"IF(ISBLANK('N1. Demand'!B90),\"\",'N1. Demand'!B90)","v":""}]
[null,{"$f":"IF(ISBLANK('N1. Demand'!B91),\"\",'N1. Demand'!B91)","v":""}]
[null,{"$f":"IF(ISBLANK('N1. Demand'!B92),\"\",'N1. Demand'!B92)","v":""}]
[null,{"$f":"IF(ISBLANK('N1. Demand'!B93),\"\",'N1. Demand'!B93)","v":""}]
[null,{"$f":"IF(ISBLANK('N1. Demand'!B94),\"\",'N1. Demand'!B94)","v":""}]
[null,{"$f":"IF(ISBLANK('N1. Demand'!B95),\"\",'N1. Demand'!B95)","v":""}]
[null,"Total",{"$f":"SUM(C11:C85)","v":223360495.3774015},228609467.01877043,210078242.00888148,211421240.86897227,214031589.85718957,214030506.06714684,215651635.9425742]
[]
[null,"F3.1.2 - STAND ALONE COST PER UNIT - BY TARIFF CLASS"]
[null,null,"STAND ALONE COST PER UNIT"]
[null,null,{"$f":"CONCATENATE(\"$0's, real \",dms_DollarReal)","v":"$0's, real June 2021"}]
[null,"Tariff Class",{"$f":"CRCP_y4","v":"2019-20"},{"$f":"CRCP_y5","v":"2020-21"},{"$f":"FRCP_y1","v":"2021-22"},{"$f":"FRCP_y2","v":"2022-23"},{"$f":"FRCP_y3","v":"2023-24"},{"$f":"FRCP_y4","v":"2024-25"},{"$f":"FRCP_y5","v":"2025-26"}]
[null,"Tariff R",198758770.47775164,198758770.47775164,197147236.18667853,197147236.18667853,197147236.18667853,197147236.18667853,197147236.18667853]
[null,"Tariff C",51950570.959316455,51950570.959316455,51069150.856731169,51069150.856731169,51069150.856731169,51069150.856731169,51069150.856731169]
[null,"Tariff D - Adelaide Northern",31161151.140442628,31161151.140442628,26105022.781707946,26105022.781707946,26105022.781707946,26105022.781707946,26105022.781707946]
[null,"Tariff D - Adelaide Central",31161151.140442628,31161151.140442628,26105022.781707946,26105022.781707946,26105022.781707946,26105022.781707946,26105022.781707946]
[null,"Tariff D - Adelaide Southern",31161151.140442628,31161151.140442628,26105022.781707946,26105022.781707946,26105022.781707946,26105022.781707946,26105022.781707946]
[null,"Tariff D - Port Pirie",31161151.140442628,31161151.140442628,26105022.781707946,26105022.781707946,26105022.781707946,26105022.781707946,26105022.781707946]
[null,"Tariff D - Riverland",31161151.140442628,31161151.140442628,26105022.781707946,26105022.781707946,26105022.781707946,26105022.781707946,26105022.781707946]
[null,"Tariff D - South East",31161151.140442628,31161151.140442628,26105022.781707946,26105022.781707946,26105022.781707946,26105022.781707946,26105022.781707946]
[null,"Tariff D - Whyalla",31161151.140442628,31161151.140442628,26105022.781707946,26105022.781707946,26105022.781707946,26105022.781707946,26105022.781707946]
[null,"Tariff D - Peterborough",31161151.140442628,31161151.140442628,26105022.781707946,26105022.781707946,26105022.781707946,26105022.781707946,26105022.781707946]
[]
[]
[]
[]
[]
[]
[]
[]
[]
[]
[]
[null,"F3.1.3 -  AVOIDABLE COST PER UNIT - BY TARIFF CLASS"]
[null,null,"AVOIDABLE COST PER UNIT"]
[null,null,{"$f":"CONCATENATE(\"$0's, real \",dms_DollarReal)","v":"$0's, real June 2021"}]
[null,"Tariff Class",{"$f":"CRCP_y4","v":"2019-20"},{"$f":"CRCP_y5","v":"2020-21"},{"$f":"FRCP_y1","v":"2021-22"},{"$f":"FRCP_y2","v":"2022-23"},{"$f":"FRCP_y3","v":"2023-24"},{"$f":"FRCP_y4","v":"2024-25"},{"$f":"FRCP_y5","v":"2025-26"}]
[null,{"$f":"IF(ISBLANK(B92),\"\",B92)","v":"Tariff R"},861172.30876266921,861172.30876266921,1209604.5326531597,1209604.5326531597,1209604.5326531597,1209604.5326531597,1209604.5326531597]
[null,{"$f":"IF(ISBLANK(B93),\"\",B93)","v":"Tariff C"},2652575.4536923994,2652575.4536923994,6007461.0747526772,6007461.0747526772,6007461.0747526772,6007461.0747526772,6007461.0747526772]
[null,"Tariff D - Adelaide Northern",2401943.2507818788,2401943.2507818788,2012210.1073683228,2012210.1073683228,2012210.1073683228,2012210.1073683228,2012210.1073683228]
[null,"Tariff D - Adelaide Central",1407495.1255315682,1407495.1255315682,1179118.5810673656,1179118.5810673656,1179118.5810673656,1179118.5810673656,1179118.5810673656]
[null,"Tariff D - Adelaide Southern",653469.69185322837,653469.69185322837,547439.37783621543,547439.37783621543,547439.37783621543,547439.37783621543,547439.37783621543]
[null,"Tariff D - Port Pirie",88418.720363391112,88418.720363391112,74072.125866368195,74072.125866368195,74072.125866368195,74072.125866368195,74072.125866368195]
[null,"Tariff D - Riverland",23520.481037294783,23520.481037294783,19704.108187403388,19704.108187403388,19704.108187403388,19704.108187403388,19704.108187403388]
[null,"Tariff D - South East",23520.481037294783,23520.481037294783,118224.64912442032,118224.64912442032,118224.64912442032,118224.64912442032,118224.64912442032]
[null,"Tariff D - Whyalla",141122.8862237687,141122.8862237687,19704.108187403388,19704.108187403388,19704.108187403388,19704.108187403388,19704.108187403388]
[null,"Tariff D - Peterborough",19948.425388755801,19948.425388755801,0,0,0,0,0]
[null,""]
[null,""]
[null,""]
[null,""]
[null,""]
[null,""]
[null,""]
[null,""]
[null,""]
[null,""]
[]
[]
[null,"F3.2 - ANCILLARY REFERENCE SERVICES"]
[null,null,"REVENUE"]
[null,null,{"$f":"CONCATENATE(\"$0's, real \",dms_DollarReal)","v":"$0's, real June 2021"}]
[null,"Service Name",{"$f":"CRCP_y4","v":"2019-20"},{"$f":"CRCP_y5","v":"2020-21"},{"$f":"FRCP_y1","v":"2021-22"},{"$f":"FRCP_y2","v":"2022-23"},{"$f":"FRCP_y3","v":"2023-24"},{"$f":"FRCP_y4","v":"2024-25"},{"$f":"FRCP_y5","v":"2025-26"}]
[null,"Special Meter Read",1188460.2435467923,1199704.1596092861,1206824.1985309562,1219217.4360000757,1233043.3018948985,1248299.3515912562,1263208.255571675]
[null,"Disconnection",505004.7250440878,507277.45572221663,510288.06062834972,515528.36084831692,521374.42716233752,527825.22589663591,534129.23911374167]
[null,"Reconnection",506377.64228480577,508656.55165983929,511675.34126440319,516929.88788279356,522791.84744460945,529260.1834659063,535581.3349155914]
[null,"Meter Removal",171919.7478099039,172693.45796675369,173718.3640924785,175502.32976168348,177492.51756893349,179688.57561864023,181834.66318718827]
[null,"Meter Reinstallation",3545.6721532055299,3558.067519066567,3579.184041018058,3615.9397489496814,3656.9443282614343,3702.1905287176814,3746.4071687724154]
[null,"Meter Gas and Installation Test",11617.229894994049,11722.315469792953,11791.885406454841,11912.979793051274,12048.072399310926,12197.139338798563,12342.814315723073]
[]
[]
[]
[null,"Total",{"$f":"SUM(C143:C151)","v":2386925.2607337888},2403612.007946955,{"$f":"SUM(E143:E151)","v":2417877.0339636607},{"$f":"SUM(F143:F151)","v":2442706.9340348709},2470407.110798351,2500972.6664399547,2530842.7142726919]
[]
[]
[null,"F3.3 - REBATEABLE SERVICES"]
[null,null,"REVENUE"]
[null,null,{"$f":"CONCATENATE(\"$0's, real \",dms_DollarReal)","v":"$0's, real June 2021"}]
[null,"Service Name",{"$f":"CRCP_y4","v":"2019-20"},{"$f":"CRCP_y5","v":"2020-21"},{"$f":"FRCP_y1","v":"2021-22"},{"$f":"FRCP_y2","v":"2022-23"},{"$f":"FRCP_y3","v":"2023-24"},{"$f":"FRCP_y4","v":"2024-25"},{"$f":"FRCP_y5","v":"2025-26"}]
[null,null,"N/A","N/A","N/A","N/A","N/A","N/A","N/A"]
[]
[]
[]
[]
[]
[null,"Total",{"$f":"SUM(C159:C164)","v":0},{"$f":"SUM(D159:D164)","v":0},0,0,0,0,0]
[]
[]
[null,"F3.4 - NON-REFERENCE SERVICES"]
[null,null,"REVENUE"]
[null,null,{"$f":"CONCATENATE(\"$0's, real \",dms_DollarReal)","v":"$0's, real June 2021"}]
[null,"Service Name",{"$f":"CRCP_y4","v":"2019-20"},{"$f":"CRCP_y5","v":"2020-21"},{"$f":"FRCP_y1","v":"2021-22"},{"$f":"FRCP_y2","v":"2022-23"},{"$f":"FRCP_y3","v":"2023-24"},{"$f":"FRCP_y4","v":"2024-25"},{"$f":"FRCP_y5","v":"2025-26"}]
[null,"Meter Alter Position / Removal Total",215292.06785455035,217304.6849190238,218594.35104386965,220839.16160135804,223343.46685690171,226106.82401109848,228807.30200477989]
[null,"Out of Hours Special Meter Reading",26231.919600000831,26477.143725287817,26634.281043141331,26907.796415296383,27212.929506226898,27549.626363743959,27878.661809953152]
[null,"Same Day Service",45428.18598821888,45852.86276911047,46124.991664364446,46598.66295439448,47127.089505608485,47710.177884124765,48279.998304247863]
[null,"Relocate / Remove Service Pipe",5445.2591548943055,5496.1631273668299,5528.7819151515159,5528.7819151515159,5528.7819151515159,5528.7819151515159,5528.7819151515159]
[null,"Other Negotiated Service",46935.788425580598,47374.558741928995,47655.718642424246,48145.1094241272,48691.072602420776,49293.511642679892,49882.242407461235]
[null,"Upgrade Service Request",0,0,0,0,0,0,0]
[null,"Total",{"$f":"SUM(C172:C177)","v":339333.22102324502},{"$f":"SUM(D172:D177)","v":342505.41328271787},344538.1243089512,348019.51231032761,351903.34038630937,356188.92181679863,360376.98644159368]
[]
[]
[null,"F3.5 - TOTAL REVENUE"]
[null,null,"REVENUE"]
[null,null,{"$f":"CONCATENATE(\"$0's, real \",dms_DollarReal)","v":"$0's, real June 2021"}]
[null,null,{"$f":"CRCP_y4","v":"2019-20"},{"$f":"CRCP_y5","v":"2020-21"},{"$f":"FRCP_y1","v":"2021-22"},{"$f":"FRCP_y2","v":"2022-23"},{"$f":"FRCP_y3","v":"2023-24"},{"$f":"FRCP_y4","v":"2024-25"},{"$f":"FRCP_y5","v":"2025-26"}]
[null,"Total",{"$f":"SUM(C178,C165,C152,C86)","v":226086753.85915855},231355584.44000009,212840657.1671541,214211967.31531748,216853900.30837423,216887667.65540358,218542855.64328849]

{"sheet":"Additional disclosures","index":28,"n_rows":14,"n_cols":9,"rows_kept":14,"cut":false,"hidden":false,"merged":[[2,2,2,8],[3,2,3,8]]}
[]
[null,"F3.4 - NON-REFERENCE SERVICES"]
[null,null,"REVENUE"]
[null,null,"$0's, real June 2021"]
[null,"Service Name","2019-20","2020-21","2021-22","2022-23","2023-24","2024-25","2025-26"]
[null,"Cut-off Service in Street for Debt",0,0,0,0,0,0,0]
[null,"Reconnect Service in Street After Cut-Off",0,0,0,0,0,0,0]
[]
[]
[]
[]
[null,"Total",0,0,0,0,0,0,0]
[]
[null,"*Additional Non-Reference services which are forecast to generate zero revenue "]