{"text_format":"1","workbook":"xlsx","n_sheets":17,"sheets":["AER CF","AER NRs","AER lookups","AER ETL","Instructions","CONTENTS","Business & other details","E2. Mains Repex","E3. Mains Augex","E4. Meter replacement","E5. New Connections","E6. Non-network","E10. Overheads","E12. ICT","E13. Other capex","N2. Network characteristics","Additional disclosures"],"not_rendered":{"charts":0,"images":5,"macros":1,"external_links":1,"defined_names":1246,"comments":1,"pivot_tables":0},"unopened":[],"bounds":{"document_bytes":16777216,"sheet_cells":100000,"rows_first":2000,"rows_last":500,"rows_between":2000,"halvings":0,"cell_chars":16384,"cell_head_chars":4096},"cells_cut":0,"cells_raw":0,"read":"whole","date_system":"1900"}

{"sheet":"AER CF","index":0,"n_rows":127,"n_cols":24,"rows_kept":127,"cut":false,"hidden":true,"merged":[[33,37,33,58],[33,68,33,89],[3,1,3,21],[31,37,31,58],[31,68,31,89],[32,37,32,58],[32,68,32,89]]}
[null,"AER CONDITIONAL FORMATTING"]
[]
[]
[null,"CONDITIONAL FORMATTING MAP"]
[null,null,null,null,null,"=INDEX(dms_CF_3.6.1, MATCH(dms_TradingName,dms_CF_TradingName))=\"Y\"","=INDEX(dms_CF_3.6.5, MATCH(dms_TradingName,dms_CF_TradingName))=\"Y\"","=INDEX(dms_CF_3.6.6, MATCH(dms_TradingName,dms_CF_TradingName))=\"Y\"","=INDEX(dms_CF_3.6.7.1, MATCH(dms_TradingName,dms_CF_TradingName))=\"Y\"","=INDEX(dms_CF_3.6.7.2, MATCH(dms_TradingName,dms_CF_TradingName))=\"Y\"","=INDEX(dms_CF_3.6.7.3, MATCH(dms_TradingName,dms_CF_TradingName))=\"Y\"","=INDEX(dms_CF_3.6.7.4, MATCH(dms_TradingName,dms_CF_TradingName))=\"Y\"","=INDEX(dms_CF_3.6.8, MATCH(dms_TradingName,dms_CF_TradingName))=\"Y\"","=INDEX(dms_CF_4.1, MATCH(dms_TradingName,dms_CF_TradingName))=\"Y\"","=INDEX(dms_CF_6.6.1, MATCH(dms_TradingName,dms_CF_TradingName))=\"Y\"","=INDEX(dms_CF_6.8, MATCH(dms_TradingName,dms_CF_TradingName))=\"Y\"","=INDEX(dms_CF_7.12, MATCH(dms_TradingName,dms_CF_TradingName))=\"Y\"","=INDEX(dms_CF_8.1_A, MATCH(dms_TradingName,dms_CF_TradingName))=\"Y\"","=INDEX(dms_CF_8.1_B, MATCH(dms_TradingName,dms_CF_TradingName))=\"Y\"","=INDEX(dms_CF_8.1_Neg, MATCH(dms_TradingName,dms_CF_TradingName))=\"Y\"","=INDEX(dms_CF_4.4.1_Neg, MATCH(dms_TradingName,dms_CF_TradingName))=\"Y\""]
[null,"dms_CF_TradingName","JurisdictionList","Sector","Segment","dms_CF_3.6.1","dms_CF_3.6.5","dms_CF_3.6.6","dms_CF_3.6.7.1","dms_CF_3.6.7.2","dms_CF_3.6.7.3","dms_CF_3.6.7.4","dms_CF_3.6.8","dms_CF_4.1","dms_CF_6.6.1","dms_CF_6.8","dms_CF_7.12","dms_CF_8.1_A","dms_CF_8.1_B","dms_CF_8.1_Neg","dms_CF_4.4.1","dms_CF_MAIFI_flag","Spare1","Spare2"]
[null,"ActewAGL Distribution","ACT","Electricity","Distribution",null,"Y",null,"Y","Y","N","Y","N","N","N","Y","Y","N","Y","Y","N","N","N","N"]
[null,"Ausgrid","NSW","Electricity","Distribution",null,"Y",null,"N","N","N","Y","N","N","N","Y","Y","N","Y","Y","N","N","N","N"]
[null,"AusNet (D)","Vic","Electricity","Distribution",null,"N",null,"N","N","N","N","N","Y","N","Y","N","N","N","Y","N","N","N","N"]
[null,"AusNet (T)","Vic","Electricity","Transmission",null,"N",null,"N","N","N","N","N","Y","N","Y","N","N","N","Y","N","N","N","N"]
[null,"CitiPower","Vic","Electricity","Distribution",null,"N",null,"N","N","N","N","N","Y","N","Y","N","N","N","Y","N","N","N","N"]
[null,"Directlink","Qld","Electricity","Transmission",null,"N",null,"N","N","N","N","N","Y","N","Y","N","N","Y","Y","N","N","N","N"]
[null,"ElectraNet","SA","Electricity","Transmission",null,"N",null,"N","N","N","N","N","Y","N","Y","N","N","Y","Y","N","N","N","N"]
[null,"Endeavour Energy","NSW","Electricity","Distribution",null,"Y",null,"N","N","N","Y","N","N","N","Y","Y","N","Y","Y","Y","N","N","N"]
[null,"Energex","Qld","Electricity","Distribution",null,"Y",null,"N","N","N","N","N","N","N","Y","Y","N","Y","Y","Y","N","N","N"]
[null,"Ergon Energy","Qld","Electricity","Distribution",null,"Y",null,"N","N","N","N","N","N","N","Y","Y","N","Y","Y","N","N","N","N"]
[null,"Essential Energy","NSW","Electricity","Distribution",null,"Y",null,"N","N","N","Y","N","N","N","Y","Y","N","Y","Y","N","N","N","N"]
[null,"Jemena Electricity","Vic","Electricity","Distribution",null,"N",null,"N","N","N","N","N","Y","N","Y","N","N","N","Y","N","N","N","N"]
[null,"Murraylink","SA","Electricity","Transmission",null,"N",null,"N","N","N","N","N","Y","N","Y","N","N","Y","Y","N","N","N","N"]
[null,"Power and Water","NT","Electricity","Distribution",null,"N",null,"N","Y","N","N","Y","Y","Y","Y","Y","N","Y","Y","N","N","N","N"]
[null,"Powercor Australia","Vic","Electricity","Distribution",null,"N",null,"N","N","N","N","N","Y","N","Y","N","N","N","Y","N","N","N","N"]
[null,"Powerlink","Qld","Electricity","Transmission",null,"N",null,"N","N","N","N","N","Y","N","Y","N","N","Y","Y","N","N","N","N"]
[null,"SA Power Networks","SA","Electricity","Distribution",null,"Y",null,"N","N","N","N","N","Y","N","Y","Y","Y","Y","N","N","N","N","N"]
[null,"TasNetworks (D)","Tas","Electricity","Distribution",null,"Y",null,"N","N","N","N","N","N","N","Y","Y","N","Y","Y","N","N","N","N"]
[null,"TasNetworks (T)","Tas","Electricity","Transmission",null,"N",null,"N","N","N","N","N","Y","N","Y","N","N","Y","Y","N","N","N","N"]
[null,"TransGrid","NSW","Electricity","Transmission",null,"N",null,"N","N","N","N","N","Y","N","Y","N","N","Y","Y","N","N","N","N"]
[null,"United Energy","Vic","Electricity","Distribution",null,"N",null,"N","N","N","N","N","Y","N","Y","N","N","N","Y","N","N","N","N"]
[]
[]
[null,"Confidential"]
[null,"Amended"]
[]
[null,"Worksheet 6.2 STPIS reliability"]
[null,"Formula",null,null,null,"Applied to:"]
[]
[null,"=INDEX(dms_CBD_flag,MATCH(dms_TradingName,dms_TradingName_List))=\"NO\"",null,null,null,"$D$11,$D$17,$D$23,$D$33,$D$39,$D$45,$D$55,$D$61,$D$67,$D$77,$D$83,$D$89"]
[null,"=INDEX(dms_Urban_flag,MATCH(dms_TradingName,dms_TradingName_List))=\"NO\"",null,null,null,"$D$12,$D$18,$D$24,$D$56,$D$62,$D$78,$D$68,$D$84"]
[null,"=INDEX(dms_ShortRural_flag,MATCH(dms_TradingName,dms_TradingName_List))=\"NO\"",null,null,null,"$D$13,$D$19,$D$25,$D$57,$D$63,$D$69,$D$79,$D$85"]
[null,"=INDEX(dms_LongRural_flag,MATCH(dms_TradingName,dms_TradingName_List))=\"NO\"",null,null,null,"$D$14,$D$20,$D$26,$D$58,$D$64,$D$65,$D$70,$D$71,$D$80,$D$86"]
[null,"=INDEX(dms_FeederType_5_flag,MATCH(dms_TradingName,dms_TradingName_List))=\"NO\"",null,null,null,"$D$87,$D$81,$D$71,$D$65,$D$59,$D$49,$D$43,$D$37,$D$21,$D$15"]
[null,"=dms_MAIFI_Flag=\"No\"",null,null,null,"$D$55:$D$72"]
[]
[]
[null,"Business & other details"]
[null,"=(INDEX(dms_Model_Span,MATCH(dms_Model,dms_Model_List))>1)"]
[null,"=(INDEX(dms_Model_Span,MATCH(dms_Model,dms_Model_List))=1)"]
[]
[]
[null,"STYLES IN USE"]
[null,null,"dms_1"]
[null,null,"dms_2"]
[null,null,"dms_3"]
[null,null,"dms_4"]
[null,null,"dms_5"]
[null,null,"dms_NUM"]
[null,null,"dms_NUM%"]
[null,null,"dms_Row_Locked"]
[null,null,"dms_Row1"]
[null,null,"dms_Row2"]
[null,null,"dms_T1"]
[null,null,"dms_T2"]
[null,null,"dms_BH"]
[null,null,"dms_BY1"]
[null,null,"dms_BY2"]
[null,null,"dms_GH"]
[null,null,"dms_GY1"]
[null,null,"dms_GY2"]
[]
[]
[]
[]
[]
[]
[]
[]
[]
[]
[]
[]
[]
[]
[]
[]
[]
[]
[]
[]
[]
[]
[]
[]
[]
[]
[]
[]
[]
[]
[]
[]
[]
[]
[]
[]
[]
[]
[]
[]
[]
[]
[]
[]
[]
[]
[]
[]
[]
[]
[]
[]
[]
[]
[]
[]
[]
[]
[null,null,"0"]
[null,null,{"$f":"IFERROR(IF(dms_Model=\"ARR\",(MAX(0,dms_0608_LastRow-dms_0608_OffsetRows)),\"not an ARR\"),\"0\")","v":0}]

{"sheet":"AER NRs","index":1,"n_rows":226,"n_cols":15,"rows_kept":226,"cut":false,"hidden":true,"merged":[[31,36,31,57],[31,67,31,88],[32,36,32,57],[32,67,32,88],[33,36,33,57],[33,67,33,88],[108,1,113,1],[4,1,26,1],[30,1,53,1],[30,10,30,11],[31,10,33,10],[34,10,38,10],[42,10,43,10],[63,1,76,1],[82,1,95,1],[98,1,105,1],[189,1,190,1],[193,1,194,1],[197,1,198,1],[206,1,211,1],[116,1,130,1],[133,1,148,1],[150,1,156,1],[158,1,172,1],[174,1,175,1],[177,1,182,1]]}
[null,"AER NAMED RANGES"]
[]
[null,"DROP DOWN SELECTORS USED IN WORKBOOKS"]
[]
[null,"COVER SHEET","dms_DataQuality_List","dms_Confid_status_List"]
[null,null,"-- select --","-- select --"]
[null,null,"Actual","Public"]
[null,null,"Estimate","Confidential"]
[null,null,"Consolidated"]
[]
[]
[null,null,"For all files either AER or business needs to be able to specify the type of submission","For PTRM & RFM templates we must provide a choice in case they change their form of control - otherwise it is drawn from the business specific lookup table above."]
[null,null,"dms_SourceList","dms_FormControl_Choices"]
[null,null,"-- select --","Revenue cap"]
[null,null,"After appeal","Revenue yield"]
[null,null,"Draft decision","Weighted average price cap"]
[null,null,"Final decision"]
[null,null,"PTRM update 1"]
[null,null,"PTRM update 2"]
[null,null,"PTRM update 3"]
[null,null,"PTRM update 4"]
[null,null,"PTRM update 5"]
[null,null,"PTRM update 6"]
[null,null,"PTRM update 7"]
[null,null,"Regulatory proposal"]
[null,null,"Reporting"]
[null,null,"Revised regulatory proposal"]
[]
[]
[null,null,null,null,null,null,null,null,null,null,"This is used to create an image to insert on 6.3 STPIS sheet - not for dropdown lists."]
[null,"CA & RESET RINS \nDNSP","dms_DNSP_020301_SubstationType","dms_DNSP_020301_ProjectType","dms_DNSP_020301_ProjectTrigger","dms_DNSP_020302_ProjectType","dms_DNSP_020302_ProjectTrigger","dms_STPIS_Exclusion_List","dms_Reason_Interruption","dms_Reason_Interruption_Detailed","Reason for interruption",null,null,"dms_N0205_AssetType"]
[null,null,"Subtransmission substation","New substation establishment","Demand growth","New line on new route - single circuit","Demand growth","Weather","Animal","Animal impact","Animal","Animal impact",null,"Cast Iron"]
[null,null,"Zone substation","Substation upgrade - capacity"," Voltage issues","New line on new route - dual circuit"," Voltage issues","Equipment failure","Asset failure","Animal nesting/burrowing, etc and other",null,"Animal nesting/burrowing, etc and other",null,"PVC"]
[null,null,"Switching station","Substation upgrade - voltage"," Reactive power issue","New line on new route - other"," Reactive power issue","Operational error","Other","Other",null,"Other",null,"Polyamide"]
[null,null,"Other","Other"," Fault level issues","Line rebuild over existing route - single circuit"," Fault level issues","Vegetation","Overloads","LV","Asset failure","LV",null,"High density polyethylene (80)"]
[null,null,null,null," Safety","Line rebuild over existing route - dual circuit"," Net market benefit","Animals","Planned","Distribution substation",null,"Distribution substation",null,"High density polyethylene (100)"]
[null,null,null,null," Environment","Reconductor - Single circuit"," Safety","Third party impacts","Network business","HV",null,"HV",null,"High density polyethylene (250)"]
[null,null,null,null," Other","Reconductor - Dual circuit"," Environment","Transmission failure","Third party","Zone substation",null,"Zone substation",null,"High density polyethylene (575)"]
[null,null,null,null,null,"Reconductor - Other"," Other","Load shedding","Unknown","Subtransmission",null,"Subtransmission",null,"Medium density polyethylene"]
[null,null,null,null,null,"Line upgrade - raising/retensoring",null,"Inter-distributor connection failure","Vegetation","insert description of 'other'","Other","insert description of 'other'",null,"Unprotected steel"]
[null,null,null,null,null,"Line upgrade - voltage upgrade",null,"Other","Weather","Network error","Overloads",null,null,"Protected steel"]
[null,null,null,null,null,"Line upgrade - capacity",null,null,"2 - STPIS Exclusion (3.3)(a)","Switching and protection error","Planned",null,null,"Other"]
[null,null,null,null,null,"String spare circuit",null,null,"3 - STPIS Exclusion (3.3)(a)","Fire","Network business","Network error"]
[null,null,null,null,null,"Other",null,null,"4 - STPIS Exclusion (3.3)(a)","Other",null,"Switching and protection error"]
[null,null,null,null,null,null,null,null,"5 - STPIS Exclusion (3.3)(a)","Dig-in","Third party","Fire"]
[null,null,null,null,null,null,null,null,"6 - STPIS Exclusion (3.3)(a)","Unauthorised access",null,"Other"]
[null,null,null,null,null,null,null,null,"7 - STPIS Exclusion (3.3)(a)","Vehicle impact",null,"Dig-in"]
[null,null,null,null,null,null,null,null,null,"Unknown",null,"Unauthorised access"]
[null,null,null,null,null,null,null,null,null,"Blow-in/Fall-in - NSP responsibility",null,"Vehicle impact"]
[null,null,null,null,null,null,null,null,null,"Grow-in - NSP responsibility","Unknown","Unknown"]
[null,null,null,null,null,null,null,null,null,"Blow-in/Fall-in - Other responsible party","Vegetation","Blow-in/Fall-in - NSP responsibility"]
[null,null,null,null,null,null,null,null,null,"Grow-in - Other responsible party",null,"Grow-in - NSP responsibility"]
[null,null,null,null,null,null,null,null,null,null,null,"Blow-in/Fall-in - Other responsible party"]
[null,null,null,null,null,null,null,null,null,null,null,"Grow-in - Other responsible party"]
[null,null,null,null,null,null,null,null,null,null,"Weather"]
[null,null,null,null,null,null,null,null,null,null,"2 - STPIS Exclusion (3.3)(a)"]
[null,null,null,null,null,null,null,null,null,null,"3 - STPIS Exclusion (3.3)(a)"]
[null,null,null,null,null,null,null,null,null,null,"4 - STPIS Exclusion (3.3)(a)"]
[null,null,null,null,null,null,null,null,null,null,"5 - STPIS Exclusion (3.3)(a)"]
[null,null,null,null,null,null,null,null,null,null,"6 - STPIS Exclusion (3.3)(a)"]
[null,null,null,null,null,null,null,null,null,null,"7 - STPIS Exclusion (3.3)(a)"]
[]
[]
[null,"CA & RESET RINS \nTNSP ","dms_TNSP_0203_SubstationType","dms_TNSP_020301_ProjectType","dms_TNSP_020301_ProjectTrigger","dms_TNSP_020302_ProjectType","dms_TNSP_0203_ProjectTrigger"]
[null,null,"Terminal station","New substation establishment","Demand growth","New line on new route - single circuit","Demand growth"]
[null,null,"Switching station","Capacity upgrade"," Voltage issues","New line on new route - dual circuit"," Voltage issues"]
[null,null,"Transmission substation","Voltage upgrade"," Reactive power issue","New line on new route - other"," Reactive power issue"]
[null,null,"Other","Other"," Fault level issues","Line rebuild over existing route - single circuit"," Fault level issues"]
[null,null,null,null,"Net market benefit","Line rebuild over existing route - dual circuit"," Net market benefit"]
[null,null,null,null," Safety","Reconductor - Single circuit"," Safety"]
[null,null,null,null," Environment","Reconductor - Dual circuit"," Environment"]
[null,null,null,null," Other","Reconductor - Other"," Other"]
[null,null,null,null,null,"Line upgrade - raising/retensoring"]
[null,null,null,null,null,"Line upgrade - voltage upgrade"]
[null,null,null,null,null,"Line upgrade - capacity"]
[null,null,null,null,null,"String spare circuit"]
[null,null,null,null,null,"Other"]
[]
[]
[]
[null,"NAMED RANGES USED IN ETL PROCESS"]
[]
[null,"CA & RESET RINS \nDNSP ONLY","dms_020303_01_UOM","dms_020501_01_UOM","dms_020501_02_UOM","dms_020501_03_UOM","dms_020501_04_UOM","dms_020701_01_UOM","dms_020701_02_UOM","dms_020701_01_Rows","dms_040102_01_UOM","dms_040102_04_UOM","dms_E050201_UOM","dms_E050302_UOM"]
[null,null,"Circuit line length in km","0's","0's","0's","0's","km","km","Route line length within zone","0's","days","per metre per connection","metres per connection"]
[null,null,"Circuit line length in km","0's","0's","0's","0's","0's","0's","Number of maintenance spans","0's","0's","per service per connection","number per connection"]
[null,null,"Circuit line length in km","MVA added","MVA added","MVA added","MVA added","km","km","Total length of maintenance spans","0's","$0s","number per connection","number per connection"]
[null,null,"Circuit line length in km","0's","0's","0's","0's","km","km","Length of vegetation corridors","$0s","0's"]
[null,null,"Number","total spend $0s","total spend $0s","total spend $0s","total spend $0s","0's","0's","Average number of trees per maintenance span"]
[null,null,"Number","net circuit km added","net circuit km added","net circuit km added","net circuit km added","years","years","Average frequency of cutting cycle"]
[null,null,"Number","total spend $0s","total spend $0s","total spend $0s","total spend $0s"]
[null,null,null,"net circuit km added","net circuit km added","net circuit km added","net circuit km added"]
[null,null,null,"total spend $0s","total spend $0s","total spend $0s","total spend $0s"]
[null,null,null,"0's",null,"$0s"]
[null,null,null,"0's"]
[null,null,null,"0's"]
[null,null,null,"$0s"]
[]
[]
[null,"CA & RESET RINS \nTNSP ONLY","dms_020701_01_UOM"]
[null,null,"km"]
[null,null,"0's"]
[null,null,"km"]
[null,null,"0's"]
[null,null,"km"]
[null,null,"metres"]
[null,null,"years"]
[]
[]
[null,"CA & RESET RINS \nDNSP & TNSP","dms_020603_01_UOM"]
[null,null,"0's"]
[null,null,"0's"]
[null,null,"0's"]
[null,null,"0's"]
[null,null,"(per cent)"]
[]
[]
[null,"EB & RESET RINS \nDNSP ONLY","dms_030601_01_UOM","dms_030601_02_UOM","dms_030701_01_UOM","dms_030702_01_UOM","dms_030703_01_UOM"]
[null,null,"minutes/customer","minutes/customer","Customer / km","%","km"]
[null,null,"minutes/customer","minutes/customer","MWh/customer","Number of spans"]
[null,null,"interruptions/customer","interruptions/customer","kVA / customer","Number of spans"]
[null,null,"interruptions/customer","interruptions/customer",null,"Number of spans"]
[null,null,null,null,null,"Number of spans"]
[null,null,null,null,null,"Years"]
[null,null,null,null,null,"Years"]
[null,null,null,null,null,"Trees"]
[null,null,null,null,null,"Trees"]
[null,null,null,null,null,"Defects"]
[null,null,null,null,null,"Defects"]
[null,null,null,null,null,"Spans"]
[null,null,null,null,null,"km"]
[null,null,null,null,null,"Spans"]
[]
[null,null,"WHEN INSERTING COVER SHEET INTO A TNSP FILE - APPLY THESE NAMED RANGES"]
[null,"EB & RESET RINS \nTNSP ONLY","dms_030601_01_UOM",null,"dms_030701_01_UOM","dms_030702_01_UOM"]
[null,null,"%",null,"Number of spans","km"]
[null,null,"number",null,"Years","%"]
[null,null,"number",null,"Trees","km"]
[null,null,"%",null,"Defects","number"]
[null,null,"number",null,"Number of spans"]
[null,null,"number",null,"km"]
[null,null,"%",null,"km"]
[null,null,"number",null,"Number of spans"]
[null,null,"number"]
[null,null,"%"]
[null,null,"number"]
[null,null,"%"]
[null,null,"number"]
[null,null,"%"]
[null,null,"number"]
[]
[null,"EB & RESET RINS \nDNSP & TNSP","dms_EB_RAB_PIT"]
[null,null,"Beginning of year"]
[null,null,"End of year"]
[null,null,"End of year"]
[null,null,"End of year"]
[null,null,"End of year"]
[null,null,"End of year"]
[]
[null,"ARR \nDNSP ONLY","dms_030605_UOM","dms_03060703_UOM","dms_E020202_UOM","Spare"]
[null,null,"number","number","Length of mains replaced"]
[null,null,"number","number","Number of services replaced"]
[null,null,"number","number"]
[null,null,"number","number"]
[null,null,"number","(per cent)"]
[null,null,"number"]
[null,null,"number"]
[null,null,"number"]
[null,null,"number"]
[null,null,"number"]
[null,null,"number"]
[null,null,"number"]
[null,null,"(per cent)"]
[null,null,"(per cent)",""]
[]
[null,"RFM","dms_Beg","dms_Mid","dms_End"]
[null,null,"Beginning of year","Mid year","End of Year"]
[]
[null,"PTRM","dms_PTRM_RAB_PIT","dms_PTRM_TAB_PIT","DMS_Xfactor"]
[null,null,"Beginning of year","Beginning of year","x factors"]
[null,null,"End of year","End of year"]
[null,null,"End of year","End of year"]
[null,null,"End of year","End of year"]
[null,null,"End of year"]
[]
[]
[null,"STPIS & MIC NAMED RANGES "]
[]
[null,"These \"row descriptions\" are the column headings in the various templates but become row descriptions in the ETL process"]
[]
[null,"Table 6.3 sustained interruptions - row descriptions","dms_060301_CustNo_Affected_Row","dms_060301_Avg_Duration_Sustained_Int_Row","dms_060301_Effect_unplanned_SAIDI_Row","dms_060301_Effect_unplanned_SAIFI_Row"]
[null,null,"Number of customers affected by the interruption","Average duration of sustained customer interruption","Effect on unplanned SAIDI","Effect on unplanned SAIFI"]
[]
[]
[null,"Table 6.1 telephone answering - row descriptions and start date","dms_060101_Rows","dms_060102_Rows","dms_060101_StartDateTxt"]
[null,null,"Total number of calls \n(after removing excluded events)","Number of calls answered within 30 seconds \n(after excluding excluded events) ",{"$f":"dms_060701_StartDateTxt","v":"1-Jul-2014"}]
[]
[]
[null,"Table 6.8.1 - row descriptions","dms_060801_01_Rows","dms_060801_02_Rows","dms_060801_03_Rows","dms_060801_04_Rows"]
[null,null,"Number of interruptions","Duration of interruptions","Total unplanned minutes off supply","Effect on unplanned MAIFI"]
[]
[]
[null,"Table 7.9.4 - market impact component - row descriptions","dms_070904_01_Rows","without exclusions","with exclusions"]
[]
[]
[null,"These headings (Lists) are determined from the INDEX/MATCH function on the NSP selected on the Business & other details sheet"]
[]
[null,"Table 6.7.1 - daily performance data - unplanned - MAIFI  -- row descriptions and header named range values","dms_060701_Feeder_Header_Lvl4",{"$f":"INDEX(dms_FeederName_1,MATCH(dms_TradingName,dms_TradingName_List))","v":"CBD"},{"$f":"INDEX(dms_FeederName_1,MATCH(dms_TradingName,dms_TradingName_List))","v":"CBD"},{"$f":"INDEX(dms_FeederName_2,MATCH(dms_TradingName,dms_TradingName_List))","v":"Urban"},{"$f":"INDEX(dms_FeederName_2,MATCH(dms_TradingName,dms_TradingName_List))","v":"Urban"},{"$f":"INDEX(dms_FeederName_3,MATCH(dms_TradingName,dms_TradingName_List))","v":"Short rural"},{"$f":"INDEX(dms_FeederName_3,MATCH(dms_TradingName,dms_TradingName_List))","v":"Short rural"},{"$f":"INDEX(dms_FeederName_4,MATCH(dms_TradingName,dms_TradingName_List))","v":"Long rural"},{"$f":"INDEX(dms_FeederName_4,MATCH(dms_TradingName,dms_TradingName_List))","v":"Long rural"},{"$f":"IF((INDEX(dms_FeederName_5,MATCH(dms_TradingName,dms_TradingName_List))=0),\"Network\",(INDEX(dms_FeederName_5,MATCH(dms_TradingName,dms_TradingName_List))))","v":"Network"},{"$f":"IF((INDEX(dms_FeederName_5,MATCH(dms_TradingName,dms_TradingName_List))=0),\"Network\",(INDEX(dms_FeederName_5,MATCH(dms_TradingName,dms_TradingName_List))))","v":"Network"},"Network","Network"]
[]
[null,null,"dms_060701_Rows","All events","After removing excluded events","All events","After removing excluded events","All events","After removing excluded events","All events","After removing excluded events","All events","After removing excluded events","All events","After removing excluded events"]
[null,null,null,"the number of column headings changes from 10 to 12 depending on the number of feeder categories for the NSP"]
[]
[null,null,"dms_0603_FeederList",{"$f":"INDEX(dms_FeederName_1,MATCH(dms_TradingName,dms_TradingName_List))","v":"CBD"},{"$f":"INDEX(dms_FeederName_2,MATCH(dms_TradingName,dms_TradingName_List))","v":"Urban"},{"$f":"INDEX(dms_FeederName_3,MATCH(dms_TradingName,dms_TradingName_List))","v":"Short rural"},{"$f":"INDEX(dms_FeederName_4,MATCH(dms_TradingName,dms_TradingName_List))","v":"Long rural"}]
[]
[]
[null,"Use these to add to specific worksheets in existing files","Use these to add to specific worksheets in existing files"]
[]
[]
[null,"ARRs 6.7 STPIS daily performance","dms_060101_Values","dms_060102_Values","dms_060701_Values"]
[null,null,"dms_LeapYear"]
[]
[]
[null,"ARR's  6.8 STPIS exclusions","dms_060801_Event_Date","dms_060801_OutageID","dms_060801_FeederID","dms_060801_FeederClass","dms_060801_CauseID","dms_060801_01_Values","dms_060801_02_Values","dms_060801_03_Values","dms_060801_Excl_Cat","dms_060801_04_Values"]
[null,null,"dms_060801_StartCell"]
[]
[]
[null,"CA 6.3 sustained interruptions","dms_060301_Event_Date","dms_060301_Event_Time","dms_060301_AssetID","dms_060301_FeederClass","dms_060301_Reason","dms_060301_DetailedReason","dms_060301_CustNo_Affected_Values","dms_060301_Avg_Duration_Sustained_Int_Values","dms_060301_Effect_unplanned_SAIDI_Values","dms_060301_Effect_unplanned_SAIFI_Values","dms_060301_MED"]

{"sheet":"AER lookups","index":2,"n_rows":100,"n_cols":38,"rows_kept":100,"cut":false,"hidden":true,"merged":[[34,1,34,4],[13,25,13,28],[13,31,13,35]]}
[null,"AER LOOKUP TABLES"]
[]
[null,"Data in these columns used for data validation and database purposes."]
[null,"Date last modified:","2017-01-16","added (Albury and Victora) for AGN"]
[null,null,"2016-10-17","updated TransGrid's correct legal name, corrected TasNetworks (T) to June financial year"]
[null,null,"2017-02-01","inserted Power and Water, added NRs (dms_FeederCat_1 and dms_FeederCat_2)"]
[null,null,"2017-03-03","inserted AEMO as a business"]
[null,null,"2018-03-28","major changes to accommodate STPIS"]
[null,null,"Template Version",5]
[]
[]
[]
[]
[null,null,null,null,null,null,null,null,null,null,null,null,null,null,null,null,null,null,null,null,null,null,null,null,null,"Feeder Types",null,null,null,"TasNetworks (D)","MAIFI flag","Feeder Names"]
[]
[null,"dms_TradingName_List","dms_TradingNameFull_List","dms_ABN_List","dms_JurisdictionList","dms_Sector_List","dms_Segment_List","dms_FormControl_List","dms_RPT_List","dms_RPTMonth_List","dms_CRCPlength_List","dms_FRCPlength_List","dms_PRCPlength_List","dms_663_List","dms_DeterminationRef_List","dms_Addr1_List","dms_Addr2_List","dms_Suburb_List","dms_State_List","dms_PostCode_List","dms_PAddr1_List","dms_PAddr2_List","dms_PSuburb_List","dms_PState_List","dms_PPostCode_List","dms_CBD_flag","dms_Urban_flag","dms_ShortRural_flag","dms_LongRural_flag","dms_FeederType_5_flag","dms_MAIFI_flag_List","dms_FeederName_1","dms_FeederName_2","dms_FeederName_3","dms_FeederName_4","dms_FeederName_5","dms_Public_Lighting_List","Name"]
[null,"AGN (Albury and Victoria)","Australian Gas Networks Limited (reporting data for Albury and Victoria)",19078551685,"Vic","Gas","Distribution","Weighted average price cap","Calendar","December",5,5,5,"x",null,"Level 6","400 King William Street","ADELAIDE","SA",5000,"PO Box 6468","Halifax Street","ADELAIDE","SA",5000,"NO","NO","NO","NO","NO","-","CBD","Urban","Short rural","Long rural",null,"NO","AGN (Albury)"]
[null,"AGN (Albury)","Australian Gas Networks Limited (reporting data for Albury)",19078551685,"Vic","Gas","Distribution","Weighted average price cap","Calendar","December",5,5,5,"x",null,"Level 6","400 King William Street","ADELAIDE","SA",5000,"PO Box 6468","Halifax Street","ADELAIDE","SA",5000,"NO","NO","NO","NO","NO","-","CBD","Urban","Short rural","Long rural",null,"NO"]
[null,"AGN (SA)","Australian Gas Networks Limited (reporting data for SA)",19078551685,"SA","Gas","Distribution","Weighted average price cap","Financial","June",5,5,5,5,"distribution determination","Level 6","400 King William Street","ADELAIDE","SA",5000,"PO Box 6468","Halifax Street","ADELAIDE","SA",5000,"NO","NO","NO","NO","NO","-","CBD","Urban","Short rural","Long rural",null,"NO","AGN (SA)"]
[null,"AGN (Victoria)","Australian Gas Networks Limited (reporting data for Victoria)",19078551685,"Vic","Gas","Distribution","Weighted average price cap","Calendar","December",5,5,5,"x",null,"Level 6","400 King William Street","ADELAIDE","SA",5000,"PO Box 6468","Halifax Street","ADELAIDE","SA",5000,"NO","NO","NO","NO","NO","-","CBD","Urban","Short rural","Long rural",null,"NO","AGN (Victoria)"]
[null,"Amadeus","APT Pipelines (NT) Pty Ltd",39009737393,"NT","Gas","Transmission","Weighted average price cap","Financial","June",5,5,5,"x","n/a","Level 19, HSBC Building","580 George Street","SYDNEY","NSW",2000,"Level 19, HSBC Building","580 George Street","SYDNEY","NSW",2000,"NO","NO","NO","NO","NO","-","CBD","Urban","Short rural","Long rural",null,"NO","Amadeus"]
[null,"APA GasNet","APA GasNet Australia (Operations) Pty Ltd","065083009","Vic","Gas","Transmission","Weighted average price cap","Calendar","December",5,5,5,"x",null,"Level 19, HSBC Building","580 George Street","SYDNEY","NSW",2000,"PO Box R41",null,"ROYAL EXCHANGE","NSW",1225,"NO","NO","NO","NO","NO","-","CBD","Urban","Short rural","Long rural",null,"NO","APA GasNet"]
[null,"AusNet (Gas)","AusNet Gas Services","086015036","Vic","Gas","Distribution","Weighted average price cap","Calendar","December",5,5,5,"X",null,"Level 19, HSBC Building","580 George Street","SYDNEY","NSW",2000,"PO Box R41",null,"ROYAL EXCHANGE","NSW",1225,"NO","NO","NO","NO","NO","-","CBD","Urban","Short rural","Long rural",null,"NO","AusNet (Gas)"]
[null,"Australian Distribution Co. (Gas)","Australian Gas Distribution Co. ",11222333444,"NSW","Gas","Distribution","Weighted average price cap","Financial","June",5,5,5,null,null,"123 Straight Street",null,"SYDNEY","NSW",2000,"PO Box 123",null,"SYDNEY","NSW",2000,"NO","NO","NO","NO","NO","-","CBD","Urban","Short rural","Long rural",null,"NO","Australian Distribution Co. (Vic)"]
[null,"Central Ranges Pipeline (D)","Central Ranges Pipeline Pty Ltd",108218355,"NSW","Gas","Distribution","Weighted average price cap","Financial","June",15,5,5,5,"distribution determination","Level 19","580 George Street","SYDNEY","NSW",2000,"PO Box R41",null,"ROYAL EXCHANGE","NSW",1225,"NO","NO","NO","NO","NO","-","CBD","Urban","Short rural","Long rural",null,"NO"]
[null,"Central Ranges Pipeline (T)","Central Ranges Pipeline Pty Ltd",108218355,"NSW","Gas","Transmission","Weighted average price cap","Financial","June",14,5,5,5,"transmission determination","Level 19","580 George Street","SYDNEY","NSW",2000,"PO Box R41",null,"ROYAL EXCHANGE","NSW",1225,"NO","NO","NO","NO","NO","-","CBD","Urban","Short rural","Long rural",null,"NO"]
[null,"Evoenergy Gas","Evoenergy Gas",76670568688,"ACT","Gas","Distribution","Weighted average price cap","Financial","June",5,5,5,"x",null,"40 Bunda Street",null,"CANBERRA","ACT",2600,"GPO BOX 366",null,"CANBERRA","ACT",2601,"NO","NO","NO","NO","NO","-","CBD","Urban","Short rural","Long rural",null,"NO","ActewAGL Gas"]
[null,"JGN","Jemena Gas Networks (NSW) Ltd","003 004 322","NSW","Gas","Distribution","Weighted average price cap","Financial","June",5,5,5,null,null,"please provide street address",null,null,null,null,"please provide postal address",null,null,null,null,"NO","NO","NO","NO","NO","-","CBD","Urban","Short rural","Long rural",null,"NO","JGN"]
[null,"Multinet Gas","Multinet Gas (DB No.1) Pty Ltd (ACN 086 026 986), Multinet Gas (DB No.2) Pty Ltd (ACN 086 230 122)","086026986","Vic","Gas","Distribution","Weighted average price cap","Calendar","December",5,5,5,"x",null,"43-45 Centreway",null,"MT WAVERLEY","Vic",3149,null,null,null,null,null,"NO","NO","NO","NO","NO","-","CBD","Urban","Short rural","Long rural",null,"NO","Multinet Gas"]
[null,"Roma to Brisbane Pipeline","APT Petroleum Pipelines Limited t/a Roma to Brisbane Pipeline","009 737 393","Qld","Gas","Transmission","Weighted average price cap","Financial","June",5,5,5,"x","n/a","580 George Street",null,"SYDNEY","NSW",2000,"PO Box R41",null,"ROYAL EXCHANGE","NSW",1225,"NO","NO","NO","NO","NO","-","CBD","Urban","Short rural","Long rural",null,"NO","Roma to Brisbane Pipeline"]
[]
[]
[]
[]
[null,"The Reg Year Ending (dms_RYE) must be set to the last year of the regulatory period. For forecast data is is usually (FRCP_y5) for actual it is a single year (CRY). For historical actual data the RYE will need to be set manually in the business details sheet by setting the dms_Multiyear_flag to 1 and putting the correct value in 'dms_Specified_FinalYear. See cells C67:C68"]
[null,"dms_Model_List ","dms_Model_Name_Format1","dms_Worksheet_List","dms_Model_Span_List"]
[null,"ARR","Annual Reporting",{"$f":"IF(dms_MultiYear_ResponseFlag=\"yes\",\"HISTORICAL ANNUAL REPORTING\",\"ANNUAL REPORTING\")","v":"HISTORICAL ANNUAL REPORTING"},1]
[null,"CA","Category Analysis",{"$f":"IF(dms_MultiYear_ResponseFlag=\"yes\",\"NEW HISTORICAL CATEGORY ANALYSIS\",\"CATEGORY ANALYSIS\")","v":"NEW HISTORICAL CATEGORY ANALYSIS"},1]
[null,"CESS","Capitlal Expenditure","CAPITLAL EXPENDITURE SHARING SCHEMING",5]
[null,"CPI","CPI","CPI",5]
[null,"EB","Economic Benchmarking",{"$f":"IF(dms_MultiYear_ResponseFlag=\"yes\",\"NEW HISTORICAL ECONOMIC BENCHMARKING\",\"ECONOMIC BENCHMARKING\")","v":"NEW HISTORICAL ECONOMIC BENCHMARKING"},1]
[null,"Pricing","Pricing Proposal","PRICING PROPOSAL",5]
[null,"PTRM","Post Tax Revenue Model","POST TAX REVENUE MODEL",5]
[null,"Reset","Regulatory Reporting (Reset)","REGULATORY REPORTING STATEMENT",5]
[null,"RFM","Roll Forward Model","ROLL FORWARD MODEL",5]
[null,"WACC","Weighted Average Cost of Capital","WEIGHTED AVERAGE COST OF CAPITAL",1]
[]
[]
[]
[null,"Financial","Calendar",null,"PREVIOUS",null,"CURRENT",null,"FORTHCOMING"]
[null,"1987-88","1988","PRCP_y1",{"$f":"INDEX(INDIRECT(dms_RPT),dms_PRCP_start_row)","v":"2011-12"},"CRCP_y1",{"$f":"INDEX(INDIRECT(dms_RPT),dms_CRCP_start_row)","v":"2016-17"},{"$f":"FRCP_y1","v":"2021-22"},{"$f":"INDEX(INDIRECT(dms_RPT),dms_FRCP_start_row)","v":"2021-22"}]
[null,"1988-89","1989","PRCP_y2",{"$f":"INDEX(INDIRECT(dms_RPT),dms_PRCP_start_row+1)","v":"2012-13"},"CRCP_y2",{"$f":"INDEX(INDIRECT(dms_RPT),dms_CRCP_start_row+1)","v":"2017-18"},"FRCP_y2",{"$f":"INDEX(INDIRECT(dms_RPT),dms_FRCP_start_row+1)","v":"2022-23"}]
[null,"1989-90","1990","PRCP_y3",{"$f":"INDEX(INDIRECT(dms_RPT),dms_PRCP_start_row+2)","v":"2013-14"},"CRCP_y3",{"$f":"INDEX(INDIRECT(dms_RPT),dms_CRCP_start_row+2)","v":"2018-19"},"FRCP_y3",{"$f":"INDEX(INDIRECT(dms_RPT),dms_FRCP_start_row+2)","v":"2023-24"}]
[null,"1990-91","1991","PRCP_y4",{"$f":"INDEX(INDIRECT(dms_RPT),dms_PRCP_start_row+3)","v":"2014-15"},"CRCP_y4",{"$f":"INDEX(INDIRECT(dms_RPT),dms_CRCP_start_row+3)","v":"2019-20"},"FRCP_y4",{"$f":"INDEX(INDIRECT(dms_RPT),dms_FRCP_start_row+3)","v":"2024-25"}]
[null,"1991-92","1992","PRCP_y5",{"$f":"INDEX(INDIRECT(dms_RPT),dms_PRCP_start_row+4)","v":"2015-16"},"CRCP_y5",{"$f":"INDEX(INDIRECT(dms_RPT),dms_CRCP_start_row+4)","v":"2020-21"},"FRCP_y5",{"$f":"INDEX(INDIRECT(dms_RPT),dms_FRCP_start_row+4)","v":"2025-26"}]
[null,"1992-93","1993","PRCP_y6",{"$f":"INDEX(INDIRECT(dms_RPT),dms_PRCP_start_row+5)","v":"2016-17"},"CRCP_y6",{"$f":"INDEX(INDIRECT(dms_RPT),dms_CRCP_start_row+5)","v":"2021-22"},"FRCP_y6",{"$f":"INDEX(INDIRECT(dms_RPT),dms_FRCP_start_row+5)","v":"2026-27"}]
[null,"1993-94","1994","PRCP_y7",{"$f":"INDEX(INDIRECT(dms_RPT),dms_PRCP_start_row+6)","v":"2017-18"},"CRCP_y7",{"$f":"INDEX(INDIRECT(dms_RPT),dms_CRCP_start_row+6)","v":"2022-23"},"FRCP_y7",{"$f":"INDEX(INDIRECT(dms_RPT),dms_FRCP_start_row+6)","v":"2027-28"}]
[null,"1994-95","1995","PRCP_y8",{"$f":"INDEX(INDIRECT(dms_RPT),dms_PRCP_start_row+7)","v":"2018-19"},"CRCP_y8",{"$f":"INDEX(INDIRECT(dms_RPT),dms_CRCP_start_row+7)","v":"2023-24"},"FRCP_y8",{"$f":"INDEX(INDIRECT(dms_RPT),dms_FRCP_start_row+7)","v":"2028-29"}]
[null,"1995-96","1996","PRCP_y9",{"$f":"INDEX(INDIRECT(dms_RPT),dms_PRCP_start_row+8)","v":"2019-20"},"CRCP_y9",{"$f":"INDEX(INDIRECT(dms_RPT),dms_CRCP_start_row+8)","v":"2024-25"},"FRCP_y9",{"$f":"INDEX(INDIRECT(dms_RPT),dms_FRCP_start_row+8)","v":"2029-30"}]
[null,"1996-97","1997","PRCP_y10",{"$f":"INDEX(INDIRECT(dms_RPT),dms_PRCP_start_row+9)","v":"2020-21"},"CRCP_y10",{"$f":"INDEX(INDIRECT(dms_RPT),dms_CRCP_start_row+9)","v":"2025-26"},"FRCP_y10",{"$f":"INDEX(INDIRECT(dms_RPT),dms_FRCP_start_row+9)","v":"2030-31"}]
[null,"1997-98","1998","PRCP_y11",{"$f":"INDEX(INDIRECT(dms_RPT),dms_PRCP_start_row+10)","v":"2021-22"},"CRCP_y11",{"$f":"INDEX(INDIRECT(dms_RPT),dms_CRCP_start_row+10)","v":"2026-27"},"FRCP_y11",{"$f":"INDEX(INDIRECT(dms_RPT),dms_FRCP_start_row+10)","v":"2031-32"}]
[null,"1998-99","1999","PRCP_y12",{"$f":"INDEX(INDIRECT(dms_RPT),dms_PRCP_start_row+11)","v":"2022-23"},"CRCP_y12",{"$f":"INDEX(INDIRECT(dms_RPT),dms_CRCP_start_row+11)","v":"2027-28"},"FRCP_y12",{"$f":"INDEX(INDIRECT(dms_RPT),dms_FRCP_start_row+11)","v":"2032-33"}]
[null,"1999-00","2000","PRCP_y13",{"$f":"INDEX(INDIRECT(dms_RPT),dms_PRCP_start_row+12)","v":"2023-24"},"CRCP_y13",{"$f":"INDEX(INDIRECT(dms_RPT),dms_CRCP_start_row+12)","v":"2028-29"},"FRCP_y13",{"$f":"INDEX(INDIRECT(dms_RPT),dms_FRCP_start_row+12)","v":"2033-34"}]
[null,"2000-01","2001","PRCP_y14",{"$f":"INDEX(INDIRECT(dms_RPT),dms_PRCP_start_row+13)","v":"2024-25"},"CRCP_y14",{"$f":"INDEX(INDIRECT(dms_RPT),dms_CRCP_start_row+13)","v":"2029-30"},"FRCP_y14",{"$f":"INDEX(INDIRECT(dms_RPT),dms_FRCP_start_row+13)","v":"2034-35"}]
[null,"2001-02","2002","PRCP_y15",{"$f":"INDEX(INDIRECT(dms_RPT),dms_PRCP_start_row+14)","v":"2025-26"},"CRCP_y15",{"$f":"INDEX(INDIRECT(dms_RPT),dms_CRCP_start_row+14)","v":"2030-31"},"FRCP_y15",{"$f":"INDEX(INDIRECT(dms_RPT),dms_FRCP_start_row+14)","v":"2035-36"}]
[null,"2002-03","2003","PRCP_y16",{"$f":"INDEX(INDIRECT(dms_RPT),dms_PRCP_start_row+15)","v":"2026-27"},"CRCP_y16",{"$f":"INDEX(INDIRECT(dms_RPT),dms_CRCP_start_row+15)","v":"2031-32"},"FRCP_y16",{"$f":"INDEX(INDIRECT(dms_RPT),dms_FRCP_start_row+15)","v":"2036-37"}]
[null,"2003-04","2004"]
[null,"2004-05","2005"]
[null,"2005-06","2006",null,"CRY - FRY"]
[null,"2006-07","2007","dms_y1",{"$f":"IFERROR(INDEX(INDIRECT(dms_RPT),dms_CRY_start_row),0)","v":"2014-15"}]
[null,"2007-08","2008","dms_y2",{"$f":"IFERROR(INDEX(INDIRECT(dms_RPT),dms_CRY_start_row+1),0)","v":"2015-16"}]
[null,"2008-09","2009","dms_y3",{"$f":"IFERROR(INDEX(INDIRECT(dms_RPT),dms_CRY_start_row+2),0)","v":"2016-17"}]
[null,"2009-10",2010,"dms_y4",{"$f":"IFERROR(INDEX(INDIRECT(dms_RPT),dms_CRY_start_row+3),0)","v":"2017-18"}]
[null,"2010-11",2011,"dms_y5",{"$f":"IFERROR(INDEX(INDIRECT(dms_RPT),dms_CRY_start_row+4),0)","v":"2018-19"}]
[null,"2011-12",2012,"dms_y6",{"$f":"IFERROR(INDEX(INDIRECT(dms_RPT),dms_CRY_start_row+5),0)","v":"2019-20"}]
[null,"2012-13",2013,"dms_y7",{"$f":"IFERROR(INDEX(INDIRECT(dms_RPT),dms_CRY_start_row+6),0)","v":"2020-21"}]
[null,"2013-14",2014,"dms_y8",{"$f":"IFERROR(INDEX(INDIRECT(dms_RPT),dms_CRY_start_row+7),0)","v":"2021-22"}]
[null,"2014-15",2015,"dms_y9",{"$f":"IFERROR(INDEX(INDIRECT(dms_RPT),dms_CRY_start_row+8),0)","v":"2022-23"}]
[null,"2015-16",2016,"dms_y10",{"$f":"IFERROR(INDEX(INDIRECT(dms_RPT),dms_CRY_start_row+9),0)","v":"2023-24"}]
[null,"2016-17",2017,"dms_y11",{"$f":"IFERROR(INDEX(INDIRECT(dms_RPT),dms_CRY_start_row+10),0)","v":"2024-25"}]
[null,"2017-18",2018,"dms_y12",{"$f":"IFERROR(INDEX(INDIRECT(dms_RPT),dms_CRY_start_row+11),0)","v":"2025-26"}]
[null,"2018-19",2019,"dms_y13",{"$f":"IFERROR(INDEX(INDIRECT(dms_RPT),dms_CRY_start_row+12),0)","v":"2026-27"}]
[null,"2019-20",2020,"dms_y14",{"$f":"IFERROR(INDEX(INDIRECT(dms_RPT),dms_CRY_start_row+13),0)","v":"2027-28"}]
[null,"2020-21",2021,"dms_y15",{"$f":"IFERROR(INDEX(INDIRECT(dms_RPT),dms_CRY_start_row+14),0)","v":"2028-29"}]
[null,"2021-22",2022,"dms_y16",{"$f":"IFERROR(INDEX(INDIRECT(dms_RPT),dms_CRY_start_row+15),0)","v":"2029-30"}]
[null,"2022-23",2023]
[null,"2023-24",2024]
[null,"2024-25",2025]
[null,"2025-26",2026]
[null,"2026-27",2027]
[null,"2027-28",2028]
[null,"2028-29",2029]
[null,"2029-30",2030]
[null,"2030-31",2031]
[null,"2031-32",2032]
[null,"2032-33",2033]
[null,"2033-34",2034]
[null,"2034-35",2035]
[null,"2035-36",2036]
[null,"2036-37",2037]

{"sheet":"AER ETL","index":3,"n_rows":145,"n_cols":8,"rows_kept":145,"cut":false,"hidden":true,"merged":[[11,0,15,0],[12,4,12,8],[14,2,14,4],[18,0,25,0],[26,0,31,0],[71,1,73,1],[32,68,32,89],[33,37,33,58],[33,68,33,89],[34,0,59,0],[34,37,34,58],[34,68,34,89],[32,37,32,58]]}
["FINAL RIN - 20200224","AER ETL INFORMATION"]
[]
[null,"USES NAMED RANGES FLAG","yes","dms_Defined_Names_Used"]
[]
[null,"IF THIS IS AN ABC RIN - make sure the the named range CRY is applied and the named range dms_dollar_nom_UOM is applied"]
[null,"IF THIS IS A RESET RIN - make sure the named ranges CRY and dms_dollar_nom_UOM are NOT present in the workbook"]
[null,"FOR ABC RINS THAT SPAN MULTIPLE YEARS - make sure MultiYear Flag is set and final year entered as required"]
[]
[null,"Full trading name",{"$f":"INDEX(dms_TradingNameFull_List,MATCH(dms_TradingName,dms_TradingName_List))","v":"Australian Gas Networks Limited (reporting data for SA)"},null,"dms_TradingNameFull"]
[null,"Trading name",{"$f":"dms_TradingName","v":"AGN (SA)"}]
["Selected here","Model / RIN","ARR","dms_Model"]
["Read from Business & other details","Source","Reporting","dms_Source"]
[null,"Data quality",{"$f":"dms_Selected_Quality","v":"Consolidated"},"dms_DQ_1"]
[null,"Data status",{"$f":"dms_Selected_Status","v":"Public"},"dms_DQ_2"]
[null,"Amendment reason",{"$f":"dms_Amendment_Text","v":"."},null,null,"dms_AmendmentReason"]
[null,"Submission date",{"$f":"dms_Typed_Submission_Date","v":"2020-07-01"},"dms_SubmissionDate"]
[]
["Redundant","EBSS - First application of scheme in forthcoming period?","No"]
["Pre-populated from lookup table","Data ingestion data quality",{"$f":"dms_Selected_Quality","v":"Consolidated"},"dms_DataQuality","=IF(dms_DQ_2=\"Confidential\",\"Consolidated\",\"Public\")"]
[null,"Sector",{"$f":"INDEX(dms_Sector_List,MATCH(dms_TradingName,dms_TradingName_List))","v":"Gas"},"dms_Sector","=INDEX(dms_Sector_List,MATCH(dms_TradingName,dms_TradingName_List))"]
[null,"Segment",{"$f":"INDEX(dms_Segment_List,MATCH(dms_TradingName,dms_TradingName_List))","v":"Distribution"},"dms_Segment","=INDEX(dms_Segment_List,MATCH(dms_TradingName,dms_TradingName_List))"]
[null,"Regulatory Year Ending",{"$f":"dms_RYE_result","v":"2019"},"dms_RYE","=IF(dms_MultiYear_Flag=1,LEFT(dms_Specified_FinalYear,2)&RIGHT(dms_Specified_FinalYear,2),INDEX(dms_RYE_Formula_Result,MATCH(dms_Model,dms_Model_List)))"]
[null,"Reporting Period Type",{"$f":"INDEX(dms_RPT_List,MATCH(dms_TradingName,dms_TradingName_List))","v":"Financial"},"dms_RPT","=INDEX(dms_RPT_List,MATCH(dms_TradingName,dms_TradingName_List))"]
[null,"EB/CA Unit of Measure for Monetary Values","$0s","dms_dollar_nom_UOM","If the cover sheet is attached to an ABC RIN apply the NAMED RANGE to the cell"]
[null,"Security Classification","Public","dms_Classification","Always Public"]
[null,"Jurisdiction",{"$f":"INDEX(dms_JurisdictionList,MATCH(dms_TradingName,dms_TradingName_List))","v":"SA"},"dms_Jurisdiction","=INDEX(dms_JurisdictionList,MATCH(dms_TradingName,dms_TradingName_List))"]
["Relevant for PTRM, RFMs and Reset RINS","$ REAL REFERENCES"]
[null,"Does the named range CRY exist in this file? ",{"$f":"IFERROR(\"Yes \"&CRY,\"NO\")","v":"Yes 2014-15"}]
[null,"CRY-1  (last full calendar year before CRY)",{"$f":"IFERROR(IF(dms_RPT=\"calendar\",CRY-1,LEFT(CRY,4)),\"CRY not present\")","v":"2014"},"dms_Cal_Year_B4_CRY","'=IF(dms_RPT=\"financial\",VALUE(LEFT(dms_SingleYear_FinalYear_Result,4)),VALUE(LEFT(dms_SingleYear_FinalYear_Result,4)-1))"]
[null,"Dollar $ real month",{"$f":"INDEX(dms_RPTMonth_List,MATCH(dms_TradingName,dms_TradingName_List))","v":"June"},"dms_RPTMonth","=INDEX(dms_RPTMonth_List,MATCH(dms_TradingName,dms_TradingName_List))"]
[null,"Dollar $ real  (the last month before the FRCP_y1)",{"$f":"IF(dms_SingleYearModel=\"yes\",CONCATENATE(dms_RPTMonth)&\" \"&VALUE((LEFT(CRY,2))&RIGHT(CRY,2)),CONCATENATE(dms_RPTMonth)&\" \"&dms_DollarReal_year)","v":"June 2015"},"dms_DollarReal","=IF(SUM(dms_SingleYear_Model)>0,CONCATENATE(dms_RPTMonth)&\" \"&VALUE((LEFT(CRY,2))&RIGHT(CRY,2)),CONCATENATE(dms_RPTMonth)&\" \"&VALUE((LEFT(dms_RYE,2)&RIGHT(dms_RYE,2))))"]
[null,"Dollar $ real previous year (PRCP_y5)",{"$f":"IF(dms_SingleYearModel=\"yes\",CONCATENATE(dms_RPTMonth)&\" \"&VALUE((LEFT(CRY,2))&RIGHT(CRY,2)),CONCATENATE(dms_RPTMonth)&\" \"&dms_Previous_DollarReal_year)","v":"June 2015"},"dms_DollarReal_Prev","=IF(SUM(dms_SingleYear_Model)>0,CONCATENATE(dms_RPTMonth)&\" \"&VALUE(((LEFT(CRY,2))&RIGHT(CRY,2))-1),CONCATENATE(dms_RPTMonth)&\" \"&VALUE(((LEFT(dms_CRCP_FirstYear_Result,2)&RIGHT(dms_CRCP_FirstYear_Result,2))))-1)"]
[null,"PTRM/ RFMs"]
[null,"Form of control",{"$f":"INDEX(dms_FormControl_List,MATCH(dms_TradingName,dms_TradingName_List))","v":"Weighted average price cap"},"dms_FormControl","=INDEX(dms_FormControl_List,MATCH(dms_TradingName,dms_TradingName_List))"]
["All potential values for Regulatory Years or RYEs as calculated","This block works out the various RYE's for ALL RIN types and MODELS"]
[null,"dms_start_year",{"$f":"FRCP_y1","v":"2021-22"},"FRCP_y1 from cover sheet"]
[null,"dms_CRY_start_year",{"$f":"IFERROR(CRY,CRCP_y4)","v":"2014-15"}]
[null,"dms_CRY_start_row",{"$f":"IFERROR(MATCH(dms_CRY_start_year,INDIRECT(dms_RPT),0),0)","v":28}]
[null,"dms_FRCP_start_row",{"$f":"MATCH(dms_start_year,INDIRECT(dms_RPT),0)","v":35},"Uses FRCP_y1 as a start reference"]
[null,"dms_CRCP_start_row",{"$f":"dms_FRCP_start_row-dms_CRCPlength_Num","v":30},"Uses the value in dms_CRCPlength_Num"]
[null,"dms_PRCP_start_row",{"$f":"dms_FRCP_start_row-dms_CRCPlength_Num-dms_PRCPlength_Num","v":25},"Uses the value in dms_CRCPlength_Num and dms_PRCPlength_Num"]
[null,"dms_RYE_start_row",{"$f":"dms_FRCP_start_row+(dms_FRCPlength_Num-1)","v":39},"Uses the value in dms_FRCPlength_Num-1"]
[null,"FRCP_start_year",{"$f":"INDEX(INDIRECT(dms_RPT),dms_FRCP_start_row)","v":"2021-22"},"Converts the FRCP start row to display the year"]
[null,"CRCP_start_year",{"$f":"INDEX(INDIRECT(dms_RPT),dms_CRCP_start_row)","v":"2016-17"},"Converts the CRCP start row to display the year"]
[null,"PRCP_start_year",{"$f":"INDEX(INDIRECT(dms_RPT),dms_PRCP_start_row)","v":"2011-12"},"Converts the PRCP start row to display the year"]
[null,"FRCP_final_year",{"$f":"INDEX(INDIRECT(dms_RPT),dms_FRCP_start_row+dms_FRCPlength_Num-1)","v":"2025-26"},"Finds the FRCP final year"]
[null,"CRCP_final_year",{"$f":"INDEX(INDIRECT(dms_RPT),dms_CRCP_start_row+dms_CRCPlength_Num-1)","v":"2020-21"},"Finds the CRCP final year"]
[null,"PRCP_final_year",{"$f":"INDEX(INDIRECT(dms_RPT),dms_PRCP_start_row+dms_FRCPlength_Num-1)","v":"2015-16"},"Finds the PRCP final year"]
[null,"dms_Reset_final_year",{"$f":"INDEX(INDIRECT(dms_RPT),dms_RYE_start_row)","v":"2025-26"},"For Resets and PTRM/RFMs (same as FRCP_final_year)"]
[null,"dms_SpecifiedYear_final_year",{"$f":"FRY","v":"2018-19"},"FRY from cover sheet"]
[null,"dms_DollarReal_year",{"$f":"LEFT(CRCP_final_year,2)&RIGHT(CRCP_final_year,2)","v":"2021"},"Uses the value in CRCP_final_year"]
[null,"dms_Previous_DollarReal_year",{"$f":"LEFT(PRCP_final_year,2)&RIGHT(PRCP_final_year,2)","v":"2016"},"Uses the value in PRCP_final_year"]
[null,"dms_CRY_RYE",{"$f":"IFERROR(LEFT(CRY,2)&RIGHT(CRY,2),0)","v":"2015"},"For ABC single year RINS"]
[null,"dms_Reset_RYE",{"$f":"IF(dms_Model_Span>1,IF(dms_Model=\"RFM\",(LEFT(dms_DollarReal_year,2)&RIGHT(dms_DollarReal_year,2)),(LEFT(dms_Reset_final_year,2)&RIGHT(dms_Reset_final_year,2))),0)","v":0},"If model span > 1 then uses dms_Reset_RYE otherwise it's a multi year ABC and uses dms_Specified_RYE"]
[null,"dms_Specified_RYE",{"$f":"IF(dms_MultiYear_ResponseFlag=\"Yes\",(LEFT(dms_Specified_FinalYear,2)&RIGHT(dms_Specified_FinalYear,2)),0)","v":"2019"},"If multi year ABC - uses dms_Specified_FinalYear"]
[null,"dms_Model_Span",{"$f":"INDEX(dms_Model_Span_List,MATCH(dms_Model,dms_Model_List))","v":1},"A result of 5 is used to signify that it is more than 1 year span"]
[null,"dms_RYE_result",{"$f":"IF(dms_MultiYear_ResponseFlag=\"yes\",dms_Specified_RYE,(IF(dms_Model_Span>1,dms_Reset_RYE,dms_CRY_RYE)))","v":"2019"},"Nested IF - feeds into dms_RYE"]
[null,"dms_Reset_Span",{"$f":"IF(dms_Reset_RYE>0,CONCATENATE(FRCP_y1,\" to \",FRCP_final_year),0)","v":0},"Reset span of years as text"]
[null,"dms_SpecifiedYear_Span",{"$f":"IF(dms_Specified_RYE>0,CONCATENATE(CRY,\" to \",dms_Specified_FinalYear),0)","v":"2014-15 to 2018-19"},"Multi year ABC span of years as text"]
[null,"dms_Header_Span",{"$f":"IF(dms_MultiYear_Flag=1,dms_SpecifiedYear_Span,IF(dms_Model_Span>1,dms_Reset_Span,CRY))","v":"2014-15 to 2018-19"},"NESTED IF - for Sheet Headers"]
[null,"ABC RINS THAT SPAN MULTIPLE YEARS"]
[null,"This is a multi year ABC RIN?","Yes"]
[null,null,{"$f":"IF(dms_MultiYear_ResponseFlag=\"No\",0,1)","v":1},"dms_MultiYear_Flag","This is set from the answer provided above"]
[null,null,{"$f":"IF(dms_MultiYear_Flag=1,FRY,\"not a Multiple year submission\")","v":"2018-19"},"dms_Specified_FinalYear","The result here is returned to dms_CRCP_FinalYear_Result if response to Q in C73 is \"yes\" and dms_MultiYear_Flag is set to 1"]
[null," Start year for 5.2 in Multi year ABC RINS",{"$f":"IFERROR(IF(dms_MultiYear_Flag=1,FRY,CRY),\"not an ABC\")","v":"2018-19"},"dms_0502_Inst_Year","=IF(dms_MultiYear_Flag=1,FRY,CRY)",null,"For single year RINS this is CRY - multi year RINS need to start a the end of the span of years (ie. FRY)"]
[null,"WHAT IS THE RYE?"]
[null,"Reg Period Lengths"]
[null,"PRCP length in years",{"$f":"INDEX(dms_PRCPlength_List,MATCH(dms_TradingName,dms_TradingName_List))","v":5},"dms_PRCPlength_Num","=INDEX(dms_PRCPlength_List,MATCH(dms_TradingName,dms_TradingName_List))"]
[null,"CRCP length in years",{"$f":"INDEX(dms_CRCPlength_List,MATCH(dms_TradingName,dms_TradingName_List))","v":5},"dms_CRCPlength_Num","=INDEX(dms_CRCPlength_List,MATCH(dms_TradingName,dms_TradingName_List))"]
[null,"FRCP length in years",{"$f":"INDEX(dms_FRCPlength_List,MATCH(dms_TradingName,dms_TradingName_List))","v":5},"dms_FRCPlength_Num","=INDEX(dms_FRCPlength_List,MATCH(dms_TradingName,dms_TradingName_List))"]
[null,"Single year RIN?"]
[null,"Single Year ABC RIN ?",{"$f":"IF(dms_Model=\"EB\",1,0)","v":0},"dms_EB"]
[null,null,{"$f":"IF(dms_Model=\"CA\",1,0)","v":0},"dms_CA","=dms_SingleYear_Model"]
[null,null,{"$f":"IF(dms_Model=\"ARR\",1,0)","v":1},"dms_ARR"]
[null,"Is this a single Year ABC RIN?",{"$f":"IF(SUM(dms_SingleYear_Model)=1,\"yes\",\"no\")","v":"yes"},"dms_SingleYearModel","=IF(SUM(dms_SingleYear_Model)=1,\"yes\",\"no\")"]
[null,"Single Year Final Year Result",{"$f":"IF(AND(dms_SingleYearModel=\"yes\",dms_MultiYear_Flag=0),CRY,0)","v":0},"dms_SingleYear_FinalYear_Result","=IFERROR(IF(SUM(dms_SingleYear_Model)<>0,(INDIRECT(dms_SingleYear_FinalYear_Ref)),\"not a single year RIN\"),\"CRY not present\")"]
[null,"Multi year RIN?"]
[]
[null,"Multi Year Reset/Model?",{"$f":"IF(dms_Model_Span>1,\"yes\",\"no\")","v":"no"}]
[null,"Final year result for Reset/Model",{"$f":"IF(dms_Model_Span>1,dms_Reset_final_year,0)","v":0},"dms_MultiYear_FinalYear_Result"]
[]
[null,"Multi Year ABC RIN?",{"$f":"IF(dms_MultiYear_Flag=1,\"yes\",\"no\")","v":"yes"},"dms_MultiYear_ABC_RIN"]
[null,"Final year result for ABC multi year",{"$f":"IF(dms_MultiYear_Flag=1,C50,0)","v":"2018-19"}]
[]
[null,"EB RINS"]
[null,"Calendar Year for table 3.6 data",{"$f":"IFERROR(IF(dms_Segment=\"Transmission\",dms_Cal_Year_B4_CRY,CRY),\"CRY not present\")","v":"2014-15"},"dms_0306_Year","=IF(dms_Segment=\"Transmission\",dms_Cal_Year_B4_CRY,CRY)"]
[null,"CA RINS"]
[null,"Find how many rows in tables 6.3 sustained interruptions?",null,null,"dms_060301_MaxRows only returns a valid value when cover sheet is attached to a CA file"]
[null,null,{"$f":"IF(dms_Model<>\"CA\",\"not a CA\",\"Is a CA\")","v":"not a CA"},null,"=IF(dms_Model<>\"CA\",\"not a CA\",\"Is a CA\")"]
[null,"dms_060301_Avg_Duration_Sustained_Int_Values present?",{"$f":"IFERROR(IF(INDEX(dms_060301_Avg_Duration_Sustained_Int_Values,1,1)<>\"\",\"yes\",\"no\"),\"no\")","v":"no"},"dms_060301_checkvalue","=IFERROR(IF(INDEX(dms_060301_Avg_Duration_Sustained_Int_Values,1,1)<>\"\",\"yes\",\"no\"),\"no\")"]
[null,null,{"$f":"IF(AND(dms_Model=\"CA\",(dms_060301_checkvalue=\"no\")),\"error - NR not present\",\"no errors\")","v":"no errors"},null,"=IF(AND(dms_Model=\"CA\",(dms_060301_checkvalue=\"no\")),\"error - NR not present\",\"no errors\")"]
[null,"Table 6.3.1 - last row reference",{"$f":"IFERROR(IF(dms_Model=\"CA\",LOOKUP(2,1/(dms_060301_Avg_Duration_Sustained_Int_Values<>\"\"),(ROW(dms_060301_Avg_Duration_Sustained_Int_Values))),\"not a CA\"),\"6.3 not present\")","v":"not a CA"},"dms_060301_LastRow","=IFERROR(IF(dms_Model=\"CA\",LOOKUP(2,1/(dms_060301_Avg_Duration_Sustained_Int_Values<>\"\"),(ROW(dms_060301_Avg_Duration_Sustained_Int_Values))),\"not a CA\"),\"6.3 not present\")"]
[null,"Table 6.3.1 - max number rows",{"$f":"IFERROR(IF(dms_Model=\"CA\",(dms_060301_LastRow-15),\"not a CA\"),\"error\")","v":"not a CA"},"dms_060301_MaxRows","=IFERROR(IF(dms_Model=\"CA\",(dms_060301_LastRow-15),\"not a CA\"),\"error\")"]
[null,"Table 6.6.3 - Public lighting repair - no. business days",{"$f":"INDEX(dms_663_List,MATCH(dms_TradingName,dms_TradingName_List))","v":5},"dms_663","=INDEX(dms_663_List,MATCH(dms_TradingName,dms_TradingName_List))"]
[null,"ARR or RESET RINS"]
[null,"How many rows in tables 6.1 or 6.7?  (leap year?)","insert dms_LeapYear NR if required",null,"'dms_LeapYear is used to determine dms_060701_Max_Rows BUT it is only found on worksheet 6.1 or 6.7 and the date value in the cell is used to determine whether it is a leap year"]
[null,"Is dms_LeapYear named range present?",{"$f":"IFERROR(IF(dms_LeapYear,\"yes\"),\"no\")","v":"no"}]
[null,"Table 6.7.1 - includes a leap year?",{"$f":"\nIFERROR(IF(MONTH(DATE(YEAR(dms_LeapYear),2,29))=2,\"is a leap year\",\"not a leap year\"),\n\"dms_LeapYear not present\")","v":"dms_LeapYear not present"},"dms_LeapYear_Result","=IFERROR(IF(MONTH(DATE(YEAR(dms_LeapYear),2,29))=2,\"is a leap year\",\"not a leap year\"),\"dms_LeapYear not present\")"]
[null,"MaxRows if Reset and leap year",{"$f":"IF(dms_LeapYear_Result=\"is a leap year\",1827,1826)","v":1826},"dms_060701_Reset_MaxRows","=IF(dms_LeapYear_Result=\"is a leap year\",1827,1826)",null,null,"number of days present in Reset RIN table"]
[null,"MaxRows if ARR and leap year",{"$f":"IF(dms_LeapYear_Result=\"is a leap year\",366,365)","v":365},"dms_060701_ARR_MaxRows","=IF(dms_LeapYear_Result=\"is a leap year\",366,365)",null,null,"number of days present in ARR RIN table"]
[null,"Table 6.7.1 - Max Rows (leap year/ non leap year)",{"$f":"IF(dms_Model=\"ARR\",dms_060701_ARR_MaxRows,IF(dms_Model=\"Reset\",dms_060701_Reset_MaxRows,\"not a relevant RIN type\"))","v":365},"dms_060701_MaxRows","=IF(dms_Model=\"ARR\",dms_060701_ARR_MaxRows,IF(dms_Model=\"Reset\",dms_060701_Reset_MaxRows,\"not a relevant RIN type\"))"]
[null,"How many columns in 6.7?   (4 or 5 feeder categories)",{"$f":"IF(dms_FifthFeeder_flag_NSP=\"NO\",\"This NSP has only 4 feeder categories\",\"This NSP has 5 feeder categories\")","v":"This NSP has only 4 feeder categories"}]
[null,"Table 6.7.1 - Last column (# of feeder categories > 4)",{"$f":"IF(dms_FifthFeeder_flag_NSP=\"NO\",10,12)","v":10},"dms_060701_MaxCols","=IF(dms_FifthFeeder_flag_NSP=\"NO\",8,10)"]
[null,"Table 6.7.1 - Number of offset rows",{"$f":"IF(dms_Model=\"ARR\",15,9)","v":15},"dms_060701_OffsetRows","=IF(dms_Model=\"ARR\",15,9)"]
[null,"Start date for telephone answering in 6.1 or 6.7?",null,null,"Using 060101 as naming standard not 060701 for start dates"]
[null,"Table 6.1.1 and 6.7.1 - Start Date as Text",{"$f":"IF(dms_SingleYearModel=\"yes\",(CONCATENATE(IF(LEN(CRY)=4,\"1-Jan-\",\"1-Jul-\"),LEFT(CRY,4))),(CONCATENATE(IF(LEN(PRCP_y4)=4,\"1-Jan-\",\"1-Jul-\"),LEFT(PRCP_y4,4))))","v":"1-Jul-2014"},"dms_060101_StartDateTxt","=IF(SUM(dms_SingleYear_Model)>1,(CONCATENATE(IF(LEN(CRY)=4,\"1-Jan-\",\"1-Jul-\"),LEFT(CRY,4))),(CONCATENATE(IF(LEN(CRCP_y4)=4,\"1-Jan-\",\"1-Jul-\"),LEFT(CRCP_y4,4))))"]
[null,"Table 6.1.1 and 6.7.1 - Start Date as Date Value",{"$f":"DATEVALUE(dms_060701_StartDateTxt)","v":41821},"dms_060101_StartDateVal","=DATEVALUE(dms_060701_StartDateTxt)"]
[null,"ARRs"]
[null,"How many rows in table 6.8?","insert dms_060801_StartCell NR if required",null,"dms_060801_StartCell is only found on worksheet 6.8 and is used to determine the starting date for the date range"]
[null,"Is dms_060801_StartCell named range present?","yes",null,"=IFERROR(IF((ROW(dms_060801_StartCell)-1)=1,\"yes\",\"yes\"),\"no\")"]
[null,"Table 6.8 - Number of offset rows",12,"dms_0608_OffsetRows","=IFERROR(IF(dms_Model=\"ARR\",(ROW(dms_060801_StartCell)-1),\"not an ARR\"),\"6.8 error\")"]
[null,"Table 6.8 - Last row","0","dms_0608_LastRow","=IFERROR(IF(dms_060801_StartCell<>\"\",IF(dms_Model=\"ARR\",(LOOKUP(2,1/(dms_060801_01_Values<>\"\"),(ROW(dms_060801_01_Values)))),\"not an ARR\"),0),\"0\")"]
[null,"Table 6.8 - MaxRows",{"$f":"IFERROR(IF(dms_Model=\"ARR\",(MAX(0,dms_0608_LastRow-dms_0608_OffsetRows)),\"not an ARR\"),\"0\")","v":0},"dms_060801_MaxRows","=IFERROR(IF(dms_Model=\"ARR\",(MAX(0,dms_0608_LastRow-dms_0608_OffsetRows)),\"not an ARR\"),\"0\")"]
[null,"TNSP RESET RINS"]
[null,"Table 7.9.4 only appears in TNSPs Reset RIN"]
[null,"Table 7.9.4 - first year",{"$f":"LEFT(PRCP_y3,4)","v":"2013"},"dms_070904_Start_Year","=LEFT(PRCP_y3,4)"]
[]
[null,"MISC"]
[null,"Distribution Determination Reference",{"$f":"INDEX(dms_DeterminationRef_List,MATCH(dms_TradingName,dms_TradingName_List))","v":"distribution determination"},"dms_DeterminationRef"]
[null,"Public lighting NSP?",{"$f":"INDEX(dms_Public_Lighting_List,MATCH(dms_TradingName,dms_TradingName_List))","v":"NO"},"dms_Public_Lighting","=INDEX(dms_Public_Lighting_List,MATCH(dms_TradingName,dms_TradingName_List))"]
[null,"CBD Feeder for this business",{"$f":"INDEX(dms_CBD_flag,MATCH(dms_TradingName,dms_TradingName_List))","v":"NO"},"dms_CBD_flag_NSP"]
[null,"Urban Feeder for this business",{"$f":"INDEX(dms_Urban_flag,MATCH(dms_TradingName,dms_TradingName_List))","v":"NO"},"dms_Urban_flag_NSP"]
[null,"Short rural Feeder for this business",{"$f":"INDEX(dms_ShortRural_flag,MATCH(dms_TradingName,dms_TradingName_List))","v":"NO"},"dms_ShortRural_flag_NSP"]
[null,"Long rural Feeder for this business",{"$f":"INDEX(dms_LongRural_flag,MATCH(dms_TradingName,dms_TradingName_List))","v":"NO"},"dms_LongRural_flag_NSP"]
[null,"Fifth Feeder Category (eg. TasNetworks (D))",{"$f":"INDEX(dms_FeederType_5_flag,MATCH(dms_TradingName,dms_TradingName_List))","v":"NO"},"dms_FifthFeeder_flag_NSP","=INDEX(dms_FeederType_5_flag,MATCH(dms_TradingName,dms_TradingName_List))"]
[]
[null,"DISCARD FILES"]
[null,"discard this record?","NO","dms_DISCARD","If record is to be discarded from DB set this flag to YES"]
[]
[null,"SUBSET FILES"]
[null,"Is this Submission File a Subset File","NO","dms_Partial"]
[]
[]
[null,"REGULATORY YEARS FOR MULTI RYE SUBMISSIONS"]
[null,"Multiple RYE flag","YES","dms_Multi_RYE_flag"]
[null,null,"Manually specify RYE","Named ranges to apply"]
[null,null,2015,"dms_RYE_01"]
[null,null,2016,"dms_RYE_02"]
[null,null,2017,"dms_RYE_03"]
[null,null,2018,"dms_RYE_04"]
[null,null,2019,"dms_RYE_05"]
[null,null,2020,"dms_RYE_06"]
[null,null,2021,"dms_RYE_07"]
[null,null,2022,"dms_RYE_08"]
[null,null,2023,"dms_RYE_09"]

{"sheet":"Instructions","index":4,"n_rows":27,"n_cols":4,"rows_kept":27,"cut":false,"hidden":false,"merged":[[7,1,8,1],[7,2,7,3],[8,2,8,4],[1,1,1,4],[2,1,2,4],[3,1,3,4],[4,1,4,4],[5,2,5,4],[18,1,24,1],[18,2,18,4],[26,2,26,4],[10,2,10,4],[12,1,14,1],[12,2,12,4],[13,2,13,3],[14,2,14,4],[16,2,16,4]]}
[]
[null,{"$f":"CONCATENATE(dms_Sector,\" \",dms_Segment,\" \", \"Pipeline Service Provider\")","v":"Gas Distribution Pipeline Service Provider"}]
[null,{"$f":"IF(dms_Model=\"Reset\",\"Regulatory Proposal RIN Template\",\"Annual Reporting RIN\")","v":"Annual Reporting RIN"}]
[null,{"$f":"CONCATENATE(\"This template is to be used by \",dms_TradingNameFull,\" to fulfil its reporting obligations to the AER.\")","v":"This template is to be used by Australian Gas Networks Limited (reporting data for SA) to fulfil its reporting obligations to the AER."}]
[null,"INSTRUCTIONS"]
[null,"GENERAL","Complete the Business & other details worksheet before entering data or values in any other worksheets. The Business & other details worksheet is linked to other worksheets within the workbook and automatically generates certain column headings and conditional formatting."]
[]
[null,"CONFIDENTIAL INFORMATION","\nPlease use the macro at the top of each \nworksheet to identify confidential information\nin the confidential workbook. \n\n"]
[null,null,"-Do this by selecting the cell or cells that contain confidential information and then run the Mark selection as CONFIDENTIAL macro. This will format the cells a specific colour that is identified by the AER's database which in turn marks that information as confidential.\n\n-To reverse this, select the cell or cells and run the Return selection to NON-CONFIDENTIAL macro."]
[]
[null,"RESPONSES","\nPlease return two (2) files to the AER: \n\n1. A confidential version which must contain a complete set of all responses with confidential information marked using the Mark selection CONFIDENTIAL macro and which has been completed using the locked template file provided by the AER. \n\n2. A public version with confidential information either removed completely or aggregated in some form together with writtten consent to disclose the public version of the response.\n\nUse the drop down box on the Business and other details worksheet to identify the file as either confidential ('consolidated') or public. "]
[]
[null,"AMENDMENTS","\nIf an NSP wishes to correct data previously submitted to the AER it should resubmit that data using the original completed submission as the starting point. Please make any necessary changes to the data. Data that is not being amended should be left unchanged. \n\nNSPs must identify the reason for the amendments in the Amendment Reason box on the  Business and other details worksheet. NSPs may provide further details regarding any amendments in the Amendments worksheet. \n\n."]
[null,null,"NSP may use Amended Data macro \nto highlight cells that contain amended data.\nNB: if data is also CONFIDENTIAL, re-apply \nthe Confidentiality macro after applying the \nAmended macro"]
[null,null,"Please resubmit two (2) files - a confidential version and a public version of the amended submission to the AER"]
[]
[null,"UNITS OF MEASURE","\nAll amounts are to be unrounded and reported on a one for one basis: that is 1000 is to be entered as '1000'. Applicable units of measure may be identified in the table column headings or row descriptors.\n\n"]
[]
[null,"INPUT / NON-INPUT CELLS"]
[null,null,null,"Yellow = Input cell (mandatory)"]
[null,null,null,"Darker yellow = input cell (mandatory)"]
[null,null,null,"Orange = input cell (if data available)"]
[null,null,null,"Grey = Not applicable/No inputs required"]
[null,null,null," \nPLEASE DO NOT ENTER TEXT into cells that are to contain numeric data."]
[]
[]
[null,"NAVIGATION","\nMany tables in the worksheets have been \"grouped\" to allow for easy navigation. To ungroup or group data use the outline symbols in the left margin (for Row groupings) or above the columns (for column groupings). \n\n\n\n"]

{"sheet":"CONTENTS","index":5,"n_rows":22,"n_cols":4,"rows_kept":22,"cut":false,"hidden":false,"merged":[[6,2,6,3]]}
[null,{"$f":"INDEX(dms_Worksheet_List,MATCH(dms_Model,dms_Model_List))","v":"HISTORICAL ANNUAL REPORTING"}]
[null,{"$f":"INDEX(dms_TradingNameFull_List,MATCH(dms_TradingName,dms_TradingName_List))","v":"Australian Gas Networks Limited (reporting data for SA)"}]
[null,{"$f":"dms_Header_Span","v":"2014-15 to 2018-19"}]
[]
[]
[]
[null,null,"CONTENTS"]
[]
[null,null,"SUBMISSION","Business & other details"]
[]
[null,null,"EXPENDITURE","E2. Mains Repex"]
[null,null,null,"E3. Mains Augex"]
[null,null,null,"E4. Meter replacement"]
[null,null,null,"E5. New Connections"]
[null,null,null,"E6. Non-network"]
[null,null,null,"E10. Overheads"]
[null,null,null,"E12. ICT"]
[null,null,null,"E13. Other capex"]
[]
[null,null,"NETWORK","N2. Network characteristcs"]
[]
[null,null,"ADMIN","Additional disclosures"]

{"sheet":"Business & other details","index":6,"n_rows":74,"n_cols":81,"rows_kept":74,"cut":false,"hidden":false,"merged":[[0,7,2,15],[3,21,3,57],[6,21,6,75],[8,16,8,93],[15,21,15,35],[15,37,15,58],[23,21,23,35],[23,37,23,58],[23,60,23,66],[23,68,23,89],[24,21,24,35],[24,37,24,51],[24,60,24,66],[24,68,24,82],[16,21,16,35],[16,37,16,48],[22,21,22,35],[22,37,22,58],[22,60,22,66],[22,68,22,89],[31,21,31,35],[31,37,31,58],[31,60,31,66],[31,68,31,89],[32,21,32,35],[32,37,32,58],[32,60,32,66],[32,68,32,89],[25,21,25,35],[25,37,25,40],[25,49,25,51],[25,60,25,66],[25,68,25,71],[25,80,25,82],[33,21,33,35],[33,37,33,58],[33,60,33,66],[33,68,33,89],[41,25,41,34],[41,37,41,44],[41,46,41,53],[41,55,41,62],[41,64,41,71],[41,73,41,80],[45,25,45,34],[45,37,45,44],[45,46,45,53],[45,55,45,62],[45,64,45,71],[45,73,45,80],[42,37,42,44],[42,46,42,53],[42,55,42,62],[42,64,42,71],[42,73,42,80],[43,37,43,44],[43,46,43,53],[43,55,43,62],[43,64,43,71],[43,73,43,80],[46,37,46,44],[46,46,46,53],[46,55,46,62],[46,64,46,71],[46,73,46,80],[47,37,47,44],[47,46,47,53],[47,55,47,62],[47,64,47,71],[47,73,47,80],[50,64,50,71],[50,73,50,80],[51,37,51,44],[51,46,51,53],[51,55,51,62],[51,64,51,71],[51,73,51,80],[49,25,49,34],[49,37,49,44],[49,46,49,53],[49,55,49,62],[49,64,49,71],[49,73,49,80],[53,25,53,34],[53,37,53,44],[55,25,55,34],[55,37,55,44],[61,25,61,34],[61,37,61,52],[50,37,50,44],[50,46,50,53],[50,55,50,62],[69,25,71,34],[69,37,71,81],[73,25,73,34],[73,37,73,52],[63,25,63,34],[63,37,63,52],[65,25,65,34],[65,37,65,52],[67,25,67,34],[67,37,67,52]]}
[null,null,null,null,null,null,null,null,null,null,null,null,null,null,null,null,null,null,null,null,null,{"$f":"INDEX(dms_Worksheet_List,MATCH(dms_Model,dms_Model_List))","v":"HISTORICAL ANNUAL REPORTING"}]
[null,null,null,null,null,null,null,null,null,null,null,null,null,null,null,null,null,null,null,null,null,{"$f":"INDEX(dms_TradingNameFull_List,MATCH(dms_TradingName,dms_TradingName_List))","v":"Australian Gas Networks Limited (reporting data for SA)"}]
[null,null,null,null,null,null,null,null,null,null,null,null,null,null,null,null,null,null,null,null,null,{"$f":"dms_Header_Span","v":"2014-15 to 2018-19"}]
[null,null,null,null,null,null,null,null,null,null,null,null,null,null,null,null,null,null,null,null,null,"BUSINESS & OTHER DETAILS"]
[]
[null,null,null,null,null,null,null,null,null,null,null,null,null,null,null,null,null,null,null,null,null,"INSTRUCTIONS"]
[null,null,null,null,null,null,null,null,null,null,null,null,null,null,null,null,null,null,null,null,null,"Complete the following business details regulatory template before entering data or values in any other regulatory template. This regulatory template is linked to other cells within the spreadsheet and automatically generates column headings and conditional formatting to distinguish business specific input and non-input cells. "]
[]
[null,null,null,null,null,null,null,null,null,null,null,null,null,null,null,null,"SUBMISSION PARTICULARS INPUT SHEET"]
[]
[]
[null,null,null,null,null,null,null,null,null,null,null,null,null,null,null,null,null,null,null,null,null,"ENTITY DETAILS"]
[]
[null,null,null,null,null,null,null,null,null,null,null,null,null,null,null,null,null,null,null,null,null,"Business Name"]
[]
[null,null,null,null,null,null,null,null,null,null,null,null,null,null,null,null,null,null,null,null,null,"Short name",null,null,null,null,null,null,null,null,null,null,null,null,null,null,null,"AGN (SA)"]
[null,null,null,null,null,null,null,null,null,null,null,null,null,null,null,null,null,null,null,null,null,"ACN/ABN",null,null,null,null,null,null,null,null,null,null,null,null,null,null,null,{"$f":"INDEX(dms_ABN_List,MATCH(dms_TradingName,dms_TradingName_List))","v":19078551685}]
[]
[]
[]
[null,null,null,null,null,null,null,null,null,null,null,null,null,null,null,null,null,null,null,null,null,"Business Address",null,null,null,null,null,null,null,null,null,null,null,null,null,null,null,null,null,null,null,null,null,null,null,null,null,null,null,null,null,null,null,null,null,null,null,null,null,null,null,null,null,null,null,null,null,null,"Postal Address"]
[]
[null,null,null,null,null,null,null,null,null,null,null,null,null,null,null,null,null,null,null,null,null,"Address 1",null,null,null,null,null,null,null,null,null,null,null,null,null,null,null,"Level 6 400 King William Street",null,null,null,null,null,null,null,null,null,null,null,null,null,null,null,null,null,null,null,null,null,null,"Address 1",null,null,null,null,null,null,null,"PO Box 6468 Halifax Street"]
[null,null,null,null,null,null,null,null,null,null,null,null,null,null,null,null,null,null,null,null,null,"Address 2",null,null,null,null,null,null,null,null,null,null,null,null,null,null,null,{"$f":"IF(ISBLANK(INDEX(dms_Addr2_List,MATCH(dms_TradingName,dms_TradingName_List))),\"\",(INDEX(dms_Addr2_List,MATCH(dms_TradingName,dms_TradingName_List))))","v":"400 King William Street"},null,null,null,null,null,null,null,null,null,null,null,null,null,null,null,null,null,null,null,null,null,null,"Address 2",null,null,null,null,null,null,null,{"$f":"IF(ISBLANK(INDEX(dms_PAddr2_List,MATCH(dms_TradingName,dms_TradingName_List))),\"\",(INDEX(dms_PAddr2_List,MATCH(dms_TradingName,dms_TradingName_List))))","v":"Halifax Street"}]
[null,null,null,null,null,null,null,null,null,null,null,null,null,null,null,null,null,null,null,null,null,"Suburb",null,null,null,null,null,null,null,null,null,null,null,null,null,null,null,"ADELAIDE",null,null,null,null,null,null,null,null,null,null,null,null,null,null,null,null,null,null,null,null,null,null,"Suburb",null,null,null,null,null,null,null,"ADELAIDE"]
[null,null,null,null,null,null,null,null,null,null,null,null,null,null,null,null,null,null,null,null,null,"State",null,null,null,null,null,null,null,null,null,null,null,null,null,null,null,{"$f":"INDEX(dms_State_List,MATCH(dms_TradingName,dms_TradingName_List))","v":"SA"},null,null,null,null,null,null,null,null,null,"Post code",null,5000,null,null,null,null,null,null,null,null,null,null,"State",null,null,null,null,null,null,null,{"$f":"INDEX(dms_PState_List,MATCH(dms_TradingName,dms_TradingName_List))","v":"SA"},null,null,null,null,null,null,null,null,null,"Post code",null,5000]
[]
[null,null,null,null,null,null,null,null,null,null,null,null,null,null,null,null,null,null,null,null,null,null,null,null,null,null,null,null,null,null,null,null,null,null,null,null,null,null,null,null,null,null,null,null,null,null,null,null,null,null,null,null,"`"]
[]
[null,null,null,null,null,null,null,null,null,null,null,null,null,null,null,null,null,null,null,null,null,"Contact Names"]
[]
[null,null,null,null,null,null,null,null,null,null,null,null,null,null,null,null,null,null,null,null,null,"Name",null,null,null,null,null,null,null,null,null,null,null,null,null,null,null,"Peter Bucki",null,null,null,null,null,null,null,null,null,null,null,null,null,null,null,null,null,null,null,null,null,null,"Name",null,null,null,null,null,null,null,"-- enter name --"]
[null,null,null,null,null,null,null,null,null,null,null,null,null,null,null,null,null,null,null,null,null,"Phone",null,null,null,null,null,null,null,null,null,null,null,null,null,null,null,"08 8418 1112",null,null,null,null,null,null,null,null,null,null,null,null,null,null,null,null,null,null,null,null,null,null,"Phone",null,null,null,null,null,null,null,"-- enter phone number --"]
[null,null,null,null,null,null,null,null,null,null,null,null,null,null,null,null,null,null,null,null,null,"Email",null,null,null,null,null,null,null,null,null,null,null,null,null,null,null,"peter.bucki@agig.com.au",null,null,null,null,null,null,null,null,null,null,null,null,null,null,null,null,null,null,null,null,null,null,"Email",null,null,null,null,null,null,null,"-- enter email address --"]
[]
[]
[]
[]
[null,null,null,null,null,null,null,null,null,null,null,null,null,null,null,null,"REGULATORY PERIODS"]
[]
[]
[null,null,null,null,null,null,null,null,null,null,null,null,null,null,null,null,null,null,null,null,null,null,null,null,null,"Forthcoming period",null,null,null,null,null,null,null,null,null,null,null,"2021-22",null,null,null,null,null,null,null,null,{"$f":"FRCP_y2","v":"2022-23"},null,null,null,null,null,null,null,null,{"$f":"FRCP_y3","v":"2023-24"},null,null,null,null,null,null,null,null,{"$f":"FRCP_y4","v":"2024-25"},null,null,null,null,null,null,null,null,{"$f":"FRCP_y5","v":"2025-26"}]
[null,null,null,null,null,null,null,null,null,null,null,null,null,null,null,null,null,null,null,null,null,null,null,null,null,null,null,null,null,null,null,null,null,null,null,null,null,{"$f":"FRCP_y6","v":"2026-27"},null,null,null,null,null,null,null,null,{"$f":"FRCP_y7","v":"2027-28"},null,null,null,null,null,null,null,null,{"$f":"FRCP_y8","v":"2028-29"},null,null,null,null,null,null,null,null,{"$f":"FRCP_y9","v":"2029-30"},null,null,null,null,null,null,null,null,{"$f":"FRCP_y10","v":"2030-31"}]
[null,null,null,null,null,null,null,null,null,null,null,null,null,null,null,null,null,null,null,null,null,null,null,null,null,null,null,null,null,null,null,null,null,null,null,null,null,{"$f":"FRCP_y11","v":"2031-32"},null,null,null,null,null,null,null,null,{"$f":"FRCP_y12","v":"2032-33"},null,null,null,null,null,null,null,null,{"$f":"FRCP_y13","v":"2033-34"},null,null,null,null,null,null,null,null,{"$f":"FRCP_y14","v":"2034-35"},null,null,null,null,null,null,null,null,{"$f":"FRCP_y15","v":"2035-36"}]
[]
[null,null,null,null,null,null,null,null,null,null,null,null,null,null,null,null,null,null,null,null,null,null,null,"RESETS",null,"Current period",null,null,null,null,null,null,null,null,null,null,null,{"$f":"CRCP_y1","v":"2016-17"},null,null,null,null,null,null,null,null,{"$f":"CRCP_y2","v":"2017-18"},null,null,null,null,null,null,null,null,{"$f":"CRCP_y3","v":"2018-19"},null,null,null,null,null,null,null,null,{"$f":"CRCP_y4","v":"2019-20"},null,null,null,null,null,null,null,null,{"$f":"CRCP_y5","v":"2020-21"}]
[null,null,null,null,null,null,null,null,null,null,null,null,null,null,null,null,null,null,null,null,null,null,null,null,null,null,null,null,null,null,null,null,null,null,null,null,null,{"$f":"CRCP_y6","v":"2021-22"},null,null,null,null,null,null,null,null,{"$f":"CRCP_y7","v":"2022-23"},null,null,null,null,null,null,null,null,{"$f":"CRCP_y8","v":"2023-24"},null,null,null,null,null,null,null,null,{"$f":"CRCP_y9","v":"2024-25"},null,null,null,null,null,null,null,null,{"$f":"CRCP_y10","v":"2025-26"}]
[null,null,null,null,null,null,null,null,null,null,null,null,null,null,null,null,null,null,null,null,null,null,null,null,null,null,null,null,null,null,null,null,null,null,null,null,null,{"$f":"CRCP_y11","v":"2026-27"},null,null,null,null,null,null,null,null,{"$f":"CRCP_y12","v":"2027-28"},null,null,null,null,null,null,null,null,{"$f":"CRCP_y13","v":"2028-29"},null,null,null,null,null,null,null,null,{"$f":"CRCP_y14","v":"2029-30"},null,null,null,null,null,null,null,null,{"$f":"CRCP_y15","v":"2030-31"}]
[]
[null,null,null,null,null,null,null,null,null,null,null,null,null,null,null,null,null,null,null,null,null,null,null,null,null,"Previous period",null,null,null,null,null,null,null,null,null,null,null,{"$f":"PRCP_y1","v":"2011-12"},null,null,null,null,null,null,null,null,{"$f":"PRCP_y2","v":"2012-13"},null,null,null,null,null,null,null,null,{"$f":"PRCP_y3","v":"2013-14"},null,null,null,null,null,null,null,null,{"$f":"PRCP_y4","v":"2014-15"},null,null,null,null,null,null,null,null,{"$f":"PRCP_y5","v":"2015-16"}]
[null,null,null,null,null,null,null,null,null,null,null,null,null,null,null,null,null,null,null,null,null,null,null,null,null,null,null,null,null,null,null,null,null,null,null,null,null,{"$f":"PRCP_y6","v":"2016-17"},null,null,null,null,null,null,null,null,{"$f":"PRCP_y7","v":"2017-18"},null,null,null,null,null,null,null,null,{"$f":"PRCP_y8","v":"2018-19"},null,null,null,null,null,null,null,null,{"$f":"PRCP_y9","v":"2019-20"},null,null,null,null,null,null,null,null,{"$f":"PRCP_y10","v":"2020-21"}]
[null,null,null,null,null,null,null,null,null,null,null,null,null,null,null,null,null,null,null,null,null,null,null,null,null,null,null,null,null,null,null,null,null,null,null,null,null,{"$f":"PRCP_y11","v":"2021-22"},null,null,null,null,null,null,null,null,{"$f":"PRCP_y12","v":"2022-23"},null,null,null,null,null,null,null,null,{"$f":"PRCP_y13","v":"2023-24"},null,null,null,null,null,null,null,null,{"$f":"PRCP_y14","v":"2024-25"},null,null,null,null,null,null,null,null,{"$f":"PRCP_y15","v":"2025-26"}]
[]
[null,null,null,null,null,null,null,null,null,null,null,null,null,null,null,null,null,null,null,null,null,null,null,null,null,"Commencing year",null,null,null,null,null,null,null,null,null,null,null,"2014-15"]
[null,null,null,null,null,null,null,null,null,null,null,null,null,null,null,null,null,null,null,null,null,null,null,"ANNUAL RINS"]
[null,null,null,null,null,null,null,null,null,null,null,null,null,null,null,null,null,null,null,null,null,null,null,null,null,"Final year",null,null,null,null,null,null,null,null,null,null,null,"2018-19"]
[]
[]
[]
[null,null,null,null,null,null,null,null,null,null,null,null,null,null,null,null,"SUBMISSION DETAILS"]
[]
[null,null,null,null,null,null,null,null,null,null,null,null,null,null,null,null,null,null,null,null,null,null,null,null,null,"RIN type",null,null,null,null,null,null,null,null,null,null,null,{"$f":"INDIRECT(dms_Model)","v":"Annual Reporting"}]
[]
[null,null,null,null,null,null,null,null,null,null,null,null,null,null,null,null,null,null,null,null,null,null,null,null,null,"Source",null,null,null,null,null,null,null,null,null,null,null,"Reporting"]
[]
[null,null,null,null,null,null,null,null,null,null,null,null,null,null,null,null,null,null,null,null,null,null,null,"THIS FILE",null,"Data Quality",null,null,null,null,null,null,null,null,null,null,null,"Consolidated"]
[]
[null,null,null,null,null,null,null,null,null,null,null,null,null,null,null,null,null,null,null,null,null,null,null,null,null,"Confidentiality Status",null,null,null,null,null,null,null,null,null,null,null,"Public"]
[]
[null,null,null,null,null,null,null,null,null,null,null,null,null,null,null,null,null,null,null,null,null,null,null,null,null,"Amended RIN \nAmendment Reason",null,null,null,null,null,null,null,null,null,null,null,"."]
[]
[]
[]
[null,null,null,null,null,null,null,null,null,null,null,null,null,null,null,null,null,null,null,null,null,null,null,null,null,"Submission Date",null,null,null,null,null,null,null,null,null,null,null,"2020-07-01",null,null,null,null,null,null,null,null,null,null,null,null,null,null,null,null,null,null,"Please enter date this file submitted to AER"]

{"sheet":"E2. Mains Repex","index":7,"n_rows":1280,"n_cols":8,"rows_kept":1280,"cut":false,"hidden":false,"merged":[[360,3,360,7],[148,3,148,7],[149,3,149,7],[206,3,206,7],[207,3,207,7],[359,3,359,7],[1254,3,1254,7],[416,3,416,7],[417,3,417,7],[559,3,559,7],[560,3,560,7],[696,3,696,7],[697,3,697,7],[831,3,831,7],[832,3,832,7],[864,3,864,7],[865,3,865,7],[1253,3,1253,7]]}
[null,{"$f":"INDEX(dms_Worksheet_List,MATCH(dms_Model,dms_Model_List))","v":"HISTORICAL ANNUAL REPORTING"}]
[null,{"$f":"INDEX(dms_TradingNameFull_List,MATCH(dms_TradingName,dms_TradingName_List))","v":"Australian Gas Distribution Co. "}]
[null,{"$f":"dms_Header_Span","v":"2014-15 to 2018-19"}]
[null,"E2. MAINS REPLACEMENT"]
[]
[]
[null,"Please list all projects here:"]
[null,"Beaumont-CI Block"]
[null,"Brahma Lodge-CI Block"]
[null,"Christies Beach-CI Block"]
[null,"Felixstow-CI Block"]
[null,"Fulham-CI Block"]
[null,"Fulham Gardens-CI Block"]
[null,"Largs North BLOCK-CI Block"]
[null,"Mansfield Park-CI Block"]
[null,"Mt Gambier A-CI Block"]
[null,"Mt Gambier B-CI Block"]
[null,"Mt Gambier C-CI Block"]
[null,"Newton CI-CI Block"]
[null,"O'Sullivan's Beach-CI Block"]
[null,"Seacombe  Gardens/Oaklands-CI Block"]
[null,"Unley Road-CI Block"]
[null,"CBD-CI Block"]
[null,"Miscellaneous projects-CI Block"]
[null,"Ascot Park-HDPE Class 250"]
[null,"Ascot Park A-HDPE Class 250"]
[null,"Ascot Park A-HDPE Class 575"]
[null,"Ashford-HDPE Class 250"]
[null,"Broadview-HDPE Class 250"]
[null,"Broadview A-HDPE Class 250"]
[null,"Clarence Park-HDPE Class 250"]
[null,"Collinswood  HDPE-HDPE Class 250"]
[null,"Collinswood  HDPE-HDPE Class 575"]
[null,"Croydon Park-HDPE Class 250"]
[null,"Croydon Park-HDPE Class 575"]
[null,"Enfield-HDPE Class 250"]
[null,"Evandale-HDPE Class 250"]
[null,"Everard Park-HDPE Class 250"]
[null,"Grange-HDPE Class 250"]
[null,"Highbury-HDPE Class 250"]
[null,"Hillcrest-HDPE Class 250"]
[null,"Holden Hill - Gilles Plains-HDPE Class 250"]
[null,"Hove-HDPE Class 250"]
[null,"Ingle Farm-HDPE Class 250"]
[null,"Nailsworth -HDPE Class 250"]
[null,"Newton PE-HDPE Class 250"]
[null,"North Haven-HDPE Class 250"]
[null,"Paradise - Athelstone-HDPE Class 250"]
[null,"Paradise - Athelstone-HDPE Class 575"]
[null,"Prospect Area A -HDPE Class 250"]
[null,"Prospect Area A -HDPE Class 575"]
[null,"Prospect Area B-HDPE Class 250"]
[null,"Prospect Area C-HDPE Class 250"]
[null,"Royal Park-HDPE Class 250"]
[null,"Seaton-HDPE Class 250"]
[null,"Sefton Park  HDPE-HDPE Class 250"]
[null,"South Plympton-HDPE Class 250"]
[null,"South Plympton A-HDPE Class 250"]
[null,"Surrey downs-HDPE Class 250"]
[null,"Trinity Gardens-HDPE Class 250"]
[null,"Trinity Gardens-HDPE Class 575"]
[null,"HDPE_Reallocation-HDPE Class 250"]
[null,"HDPE_Reallocation-HDPE Class 575"]
[null,"Underdale-HDPE Class 250"]
[null,"West Croydon-HDPE Class 250"]
[null,"West Lakes  -HDPE Class 250"]
[null,"West Lakes Shore-HDPE Class 250"]
[null,"Woodville Gardens-HDPE Class 250"]
[null,"Woodville south-HDPE Class 250"]
[null,"Aberfoyle Park-HDPE Class 575"]
[null,"Allenby Gardens-HDPE Class 575"]
[null,"Andrews Farm-HDPE Class 575"]
[null,"Auldana-HDPE Class 575"]
[null,"Blackwood-HDPE Class 575"]
[null,"Brompton - Hindmarsh-HDPE Class 575"]
[null,"Burnside-HDPE Class 575"]
[null,"Clarence Gardens-HDPE Class 575"]
[null,"Eden Hills-HDPE Class 575"]
[null,"Edwardstown-HDPE Class 575"]
[null,"Elizabeth downs-HDPE Class 575"]
[null,"Elizabeth North-HDPE Class 575"]
[null,"Elizabeth Park-HDPE Class 575"]
[null,"Elizabeth Vale-HDPE Class 575"]
[null,"Evanston Park-HDPE Class 575"]
[null,"Fullarton-HDPE Class 575"]
[null,"Gawler-HDPE Class 575"]
[null,"Gawler East-HDPE Class 575"]
[null,"Glengowrie  HDPE-HDPE Class 575"]
[null,"Glenunga-HDPE Class 575"]
[null,"Glynde-HDPE Class 575"]
[null,"Golden Grove-HDPE Class 575"]
[null,"Gulfview Heights-HDPE Class 575"]
[null,"Hackney-HDPE Class 575"]
[null,"Kensington-HDPE Class 575"]
[null,"Kings Park-HDPE Class 575"]
[null,"Kurralta Park-HDPE Class 575"]
[null,"Kurralta Park A-HDPE Class 575"]
[null,"Malvern-HDPE Class 575"]
[null,"Melrose Park-HDPE Class 575"]
[null,"Morphett Vale-HDPE Class 575"]
[null,"Morphettville-HDPE Class 575"]
[null,"Myrtle Bank-HDPE Class 575"]
[null,"Norwood  HDPE-HDPE Class 575"]
[null,"Norwood A-HDPE Class 575"]
[null,"Nuriootpa-HDPE Class 575"]
[null,"Parafield Gardens-HDPE Class 575"]
[null,"Parkside-HDPE Class 575"]
[null,"Pennington-HDPE Class 575"]
[null,"Peterborough-HDPE Class 575"]
[null,"Salisbury Heights-HDPE Class 575"]
[null,"Salisbury Heights A-HDPE Class 575"]
[null,"Smithfield HDPE-HDPE Class 575"]
[null,"St Peters   HDPE-HDPE Class 575"]
[null,"Torrens Park-HDPE Class 575"]
[null,"Torrens Park A-HDPE Class 575"]
[null,"Unley / Hyde Park -HDPE Class 575"]
[null,"Unley A-HDPE Class 575"]
[null,"Walkerville-HDPE Class 575"]
[null,"Wayville-HDPE Class 575"]
[null,"Westbourne Park-HDPE Class 575"]
[null,"Willaston-HDPE Class 575"]
[null,"Woodcroft-HDPE Class 575"]
[null,"Wynn Vale-HDPE Class 575"]
[null,"Trunk PI 1415 - Sals HW & WLC-Trunk PI"]
[null,"MRP 1314 - West Terrace-Trunk PI"]
[null,"Trunk CL16 - Anzac Hway-Trunk PI"]
[null,"Trunk CL17 Philip HWYElizabeth-Trunk PI"]
[null,"Trunk CL17 Victoria Sq-Trunk PI"]
[null,"Trunk CL15 - Morphett Road-Trunk SIB"]
[null,"Trunk CL17 Feed Works-Trunk SIB"]
[null,"Trunk CL16 Waterloo Cnr Rd (2)-Trunk SIB"]
[null,"Trunk CL17 -Salisbury Highway-Trunk SIB"]
[null,"Trunk CL17 Exeter Tr &Chief St-Trunk SIB"]
[null,"Trunk CL18 - Brooker Tce-Trunk SIB"]
[null,"Trunk CL18 - Hancock Road-Trunk SIB"]
[null,"Trunk CL18 - OG Road-Trunk SIB"]
[null,"Trunk CL19 - Churchill Road-Trunk SIB"]
[null,"Assorted proactive Trunk-Trunk PI"]
[null,"Assorted proactive Trunk-Trunk SIB"]
[null,"Assorted proactive piecemeal PI-Piecemeal"]
[null,"Assorted reactive piecemeal-Piecemeal"]
[]
[]
[]
[]
[]
[null,"E2.1 - CAPEX"]
[null,"E2.1.1 - PROACTIVE - BY PROJECT"]
[null,null,null,"EXPENDITURE"]
[null,null,null,"$0's"]
[null,null,null,{"$f":"dms_y1","v":"2014-15"},{"$f":"dms_y2","v":"2015-16"},{"$f":"dms_y3","v":"2016-17"},{"$f":"dms_y4","v":"2017-18"},{"$f":"dms_y5","v":"2018-19"}]
[null,"A. DIRECT INTERNAL LABOUR EXPENDITURE"]
[null,{"$f":"IF(B8=0,\"\",B8)","v":"Beaumont-CI Block"},null,0,0,0,0,0]
[null,"Brahma Lodge-CI Block",null,0,0,0,0,0]
[null,"Christies Beach-CI Block",null,0,0,0,0,0]
[null,"Felixstow-CI Block",null,0,0,0,0,0]
[null,"Fulham-CI Block",null,0,0,0,0,0]
[null,"Fulham Gardens-CI Block",null,0,0,0,0,0]
[null,"Largs North BLOCK-CI Block",null,0,0,0,0,0]
[null,"Mansfield Park-CI Block",null,0,0,0,0,0]
[null,"Mt Gambier A-CI Block",null,0,0,0,0,0]
[null,"Mt Gambier B-CI Block",null,0,0,0,0,0]
[null,"Mt Gambier C-CI Block",null,0,0,0,0,0]
[null,"Newton CI-CI Block",null,0,0,0,0,0]
[null,"O'Sullivan's Beach-CI Block",null,0,0,0,0,0]
[null,"Seacombe  Gardens/Oaklands-CI Block",null,0,0,0,0,0]
[null,"Unley Road-CI Block",null,0,0,0,0,0]
[null,"CBD-CI Block",null,0,0,0,0,0]
[null,"Miscellaneous projects-CI Block",null,0,0,0,0,0]
[null,"Ascot Park-HDPE Class 250",null,0,0,0,0,0]
[null,"Ascot Park A-HDPE Class 250",null,0,0,0,0,0]
[null,"Ascot Park A-HDPE Class 575",null,0,0,0,0,0]
[null,"Ashford-HDPE Class 250",null,0,0,0,0,0]
[null,"Broadview-HDPE Class 250",null,0,0,0,0,0]
[null,"Broadview A-HDPE Class 250",null,0,0,0,0,0]
[null,"Clarence Park-HDPE Class 250",null,0,0,0,0,0]
[null,"Collinswood  HDPE-HDPE Class 250",null,0,0,0,0,0]
[null,"Collinswood  HDPE-HDPE Class 575",null,0,0,0,0,0]
[null,"Croydon Park-HDPE Class 250",null,0,0,0,0,0]
[null,"Croydon Park-HDPE Class 575",null,0,0,0,0,0]
[null,"Enfield-HDPE Class 250",null,0,0,0,0,0]
[null,"Evandale-HDPE Class 250",null,0,0,0,0,0]
[null,"Everard Park-HDPE Class 250",null,0,0,0,0,0]
[null,"Grange-HDPE Class 250",null,0,0,0,0,0]
[null,{"$f":"IF(B40=0,\"\",B40)","v":"Highbury-HDPE Class 250"},null,0,0,0,0,0]
[null,"Hillcrest-HDPE Class 250",null,0,0,0,0,0]
[null,"Holden Hill - Gilles Plains-HDPE Class 250",null,0,0,0,0,0]
[null,"Hove-HDPE Class 250",null,0,0,0,0,0]
[null,"Ingle Farm-HDPE Class 250",null,0,0,0,0,0]
[null,"Nailsworth -HDPE Class 250",null,0,0,0,0,0]
[null,"Newton PE-HDPE Class 250",null,0,0,0,0,0]
[null,"North Haven-HDPE Class 250",null,0,0,0,0,0]
[null,"Paradise - Athelstone-HDPE Class 250",null,0,0,0,0,0]
[null,"Paradise - Athelstone-HDPE Class 575",null,0,0,0,0,0]
[null,"Prospect Area A -HDPE Class 250",null,0,0,0,0,0]
[null,"Prospect Area A -HDPE Class 575",null,0,0,0,0,0]
[null,"Prospect Area B-HDPE Class 250",null,0,0,0,0,0]
[null,"Prospect Area C-HDPE Class 250",null,0,0,0,0,0]
[null,"Royal Park-HDPE Class 250",null,0,0,0,0,0]
[null,"Seaton-HDPE Class 250",null,0,0,0,0,0]
[null,"Sefton Park  HDPE-HDPE Class 250",null,0,0,0,0,0]
[null,"South Plympton-HDPE Class 250",null,0,0,0,0,0]
[null,"South Plympton A-HDPE Class 250",null,0,0,0,0,0]
[null,null,"Total",{"$f":"SUM(D153:D203)","v":0},{"$f":"SUM(E153:E203)","v":0},{"$f":"SUM(F153:F203)","v":0},{"$f":"SUM(G153:G203)","v":0},{"$f":"SUM(H153:H203)","v":0}]
[]
[null,"B. DIRECT CONTRACTOR EXPENDITURE"]
[null,null,null,"EXPENDITURE"]
[null,null,null,"$0's"]
[null,null,null,{"$f":"dms_y1","v":"2014-15"},{"$f":"dms_y2","v":"2015-16"},{"$f":"dms_y3","v":"2016-17"},{"$f":"dms_y4","v":"2017-18"},{"$f":"dms_y5","v":"2018-19"}]
[null,{"$f":"IF(B8=0,\"\",B8)","v":"Beaumont-CI Block"}]
[null,{"$f":"IF(B9=0,\"\",B9)","v":"Brahma Lodge-CI Block"}]
[null,"Christies Beach-CI Block"]
[null,"Felixstow-CI Block"]
[null,"Fulham-CI Block"]
[null,"Fulham Gardens-CI Block"]
[null,"Largs North BLOCK-CI Block"]
[null,"Mansfield Park-CI Block"]
[null,"Mt Gambier A-CI Block"]
[null,"Mt Gambier B-CI Block"]
[null,"Mt Gambier C-CI Block"]
[null,"Newton CI-CI Block"]
[null,"O'Sullivan's Beach-CI Block"]
[null,"Seacombe  Gardens/Oaklands-CI Block"]
[null,"Unley Road-CI Block"]
[null,"CBD-CI Block"]
[null,"Miscellaneous projects-CI Block"]
[null,"Ascot Park-HDPE Class 250"]
[null,"Ascot Park A-HDPE Class 250"]
[null,"Ascot Park A-HDPE Class 575"]
[null,"Ashford-HDPE Class 250"]
[null,"Broadview-HDPE Class 250"]
[null,"Broadview A-HDPE Class 250"]
[null,"Clarence Park-HDPE Class 250"]
[null,"Collinswood  HDPE-HDPE Class 250"]
[null,"Collinswood  HDPE-HDPE Class 575"]
[null,"Croydon Park-HDPE Class 250"]
[null,"Croydon Park-HDPE Class 575"]
[null,"Enfield-HDPE Class 250"]
[null,"Evandale-HDPE Class 250"]
[null,"Everard Park-HDPE Class 250"]
[null,"Grange-HDPE Class 250"]
[null,"Highbury-HDPE Class 250"]
[null,"Hillcrest-HDPE Class 250"]
[null,"Holden Hill - Gilles Plains-HDPE Class 250"]
[null,"Hove-HDPE Class 250"]
[null,"Ingle Farm-HDPE Class 250"]
[null,"Nailsworth -HDPE Class 250"]
[null,"Newton PE-HDPE Class 250"]
[null,"North Haven-HDPE Class 250"]
[null,"Paradise - Athelstone-HDPE Class 250"]
[null,"Paradise - Athelstone-HDPE Class 575"]
[null,"Prospect Area A -HDPE Class 250"]
[null,"Prospect Area A -HDPE Class 575"]
[null,"Prospect Area B-HDPE Class 250"]
[null,"Prospect Area C-HDPE Class 250"]
[null,"Royal Park-HDPE Class 250"]
[null,"Seaton-HDPE Class 250"]
[null,"Sefton Park  HDPE-HDPE Class 250"]
[null,"South Plympton-HDPE Class 250"]
[null,"South Plympton A-HDPE Class 250"]
[null,"Surrey downs-HDPE Class 250"]
[null,"Trinity Gardens-HDPE Class 250"]
[null,"Trinity Gardens-HDPE Class 575"]
[null,"HDPE_Reallocation-HDPE Class 250"]
[null,"HDPE_Reallocation-HDPE Class 575"]
[null,"Underdale-HDPE Class 250"]
[null,"West Croydon-HDPE Class 250"]
[null,"West Lakes  -HDPE Class 250"]
[null,"West Lakes Shore-HDPE Class 250"]
[null,"Woodville Gardens-HDPE Class 250"]
[null,"Woodville south-HDPE Class 250"]
[null,"Aberfoyle Park-HDPE Class 575"]
[null,"Allenby Gardens-HDPE Class 575"]
[null,"Andrews Farm-HDPE Class 575"]
[null,{"$f":"IF(B73=0,\"\",B73)","v":"Auldana-HDPE Class 575"}]
[null,"Blackwood-HDPE Class 575"]
[null,"Brompton - Hindmarsh-HDPE Class 575"]
[null,"Burnside-HDPE Class 575"]
[null,"Clarence Gardens-HDPE Class 575"]
[null,"Eden Hills-HDPE Class 575"]
[null,"Edwardstown-HDPE Class 575"]
[null,"Elizabeth downs-HDPE Class 575"]
[null,"Elizabeth North-HDPE Class 575"]
[null,"Elizabeth Park-HDPE Class 575"]
[null,"Elizabeth Vale-HDPE Class 575"]
[null,"Evanston Park-HDPE Class 575"]
[null,"Fullarton-HDPE Class 575"]
[null,"Gawler-HDPE Class 575"]
[null,"Gawler East-HDPE Class 575"]
[null,"Glengowrie  HDPE-HDPE Class 575"]
[null,"Glenunga-HDPE Class 575"]
[null,"Glynde-HDPE Class 575"]
[null,"Golden Grove-HDPE Class 575"]
[null,"Gulfview Heights-HDPE Class 575"]
[null,"Hackney-HDPE Class 575"]
[null,"Kensington-HDPE Class 575"]
[null,"Kings Park-HDPE Class 575"]
[null,"Kurralta Park-HDPE Class 575"]
[null,"Kurralta Park A-HDPE Class 575"]
[null,"Malvern-HDPE Class 575"]
[null,"Melrose Park-HDPE Class 575"]
[null,"Morphett Vale-HDPE Class 575"]
[null,"Morphettville-HDPE Class 575"]
[null,"Myrtle Bank-HDPE Class 575"]
[null,"Norwood  HDPE-HDPE Class 575"]
[null,"Norwood A-HDPE Class 575"]
[null,"Nuriootpa-HDPE Class 575"]
[null,"Parafield Gardens-HDPE Class 575"]
[null,"Parkside-HDPE Class 575"]
[null,"Pennington-HDPE Class 575"]
[null,"Peterborough-HDPE Class 575"]
[null,"Salisbury Heights-HDPE Class 575"]
[null,"Salisbury Heights A-HDPE Class 575"]
[null,"Smithfield HDPE-HDPE Class 575"]
[null,"St Peters   HDPE-HDPE Class 575"]
[null,"Torrens Park-HDPE Class 575"]
[null,"Torrens Park A-HDPE Class 575"]
[null,"Unley / Hyde Park -HDPE Class 575"]
[null,"Unley A-HDPE Class 575"]
[null,"Walkerville-HDPE Class 575"]
[null,"Wayville-HDPE Class 575"]
[null,"Westbourne Park-HDPE Class 575"]
[null,"Willaston-HDPE Class 575"]
[null,"Woodcroft-HDPE Class 575"]
[null,"Wynn Vale-HDPE Class 575"]
[null,"Trunk PI 1415 - Sals HW & WLC-Trunk PI"]
[null,"MRP 1314 - West Terrace-Trunk PI"]
[null,"Trunk CL16 - Anzac Hway-Trunk PI"]
[null,"Trunk CL17 Philip HWYElizabeth-Trunk PI"]
[null,"Trunk CL17 Victoria Sq-Trunk PI"]
[null,"Trunk CL15 - Morphett Road-Trunk SIB"]
[null,"Trunk CL17 Feed Works-Trunk SIB"]
[null,"Trunk CL16 Waterloo Cnr Rd (2)-Trunk SIB"]
[null,"Trunk CL17 -Salisbury Highway-Trunk SIB"]
[null,"Trunk CL17 Exeter Tr &Chief St-Trunk SIB"]
[null,"Trunk CL18 - Brooker Tce-Trunk SIB"]
[null,"Trunk CL18 - Hancock Road-Trunk SIB"]
[null,"Trunk CL18 - OG Road-Trunk SIB"]
[null,{"$f":"IF(B137=0,\"\",B137)","v":"Trunk CL19 - Churchill Road-Trunk SIB"}]
[null,"Assorted proactive Trunk-Trunk PI"]
[null,"Assorted proactive Trunk-Trunk SIB"]
[null,"Assorted proactive piecemeal PI-Piecemeal"]
[null,"Assorted reactive piecemeal-Piecemeal"]
[null,""]
[null,""]
[null,""]
[null,""]
[null,""]
[]
[]
[]
[]
[]
[]
[]
[]
[null,null,"Total",{"$f":"SUM(D210:D356)","v":0},{"$f":"SUM(E210:E356)","v":0},{"$f":"SUM(F210:F356)","v":0},{"$f":"SUM(G210:G356)","v":0},{"$f":"SUM(H210:H356)","v":0}]
[]
[null,"C. OTHER INTERNAL DIRECT EXPENDITURE"]
[null,null,null,"EXPENDITURE"]
[null,null,null,"$0's"]
[null,null,null,{"$f":"dms_y1","v":"2014-15"},{"$f":"dms_y2","v":"2015-16"},{"$f":"dms_y3","v":"2016-17"},{"$f":"dms_y4","v":"2017-18"},{"$f":"dms_y5","v":"2018-19"}]
[null,{"$f":"IF(B8=0,\"\",B8)","v":"Beaumont-CI Block"},null,0,0,0,0,0]
[null,"Brahma Lodge-CI Block",null,0,0,0,0,0]
[null,"Christies Beach-CI Block",null,0,0,0,0,0]
[null,"Felixstow-CI Block",null,0,0,0,0,0]
[null,"Fulham-CI Block",null,0,0,0,0,0]
[null,"Fulham Gardens-CI Block",null,0,0,0,0,0]
[null,"Largs North BLOCK-CI Block",null,0,0,0,0,0]
[null,"Mansfield Park-CI Block",null,0,0,0,0,0]
[null,"Mt Gambier A-CI Block",null,0,0,0,0,0]
[null,"Mt Gambier B-CI Block",null,0,0,0,0,0]
[null,"Mt Gambier C-CI Block",null,0,0,0,0,0]
[null,"Newton CI-CI Block",null,0,0,0,0,0]
[null,"O'Sullivan's Beach-CI Block",null,0,0,0,0,0]
[null,"Seacombe  Gardens/Oaklands-CI Block",null,0,0,0,0,0]
[null,"Unley Road-CI Block",null,0,0,0,0,0]
[null,"CBD-CI Block",null,0,0,0,0,0]
[null,"Miscellaneous projects-CI Block",null,0,0,0,0,0]
[null,"Ascot Park-HDPE Class 250",null,0,0,0,0,0]
[null,"Ascot Park A-HDPE Class 250",null,0,0,0,0,0]
[null,"Ascot Park A-HDPE Class 575",null,0,0,0,0,0]
[null,"Ashford-HDPE Class 250",null,0,0,0,0,0]
[null,"Broadview-HDPE Class 250",null,0,0,0,0,0]
[null,"Broadview A-HDPE Class 250",null,0,0,0,0,0]
[null,"Clarence Park-HDPE Class 250",null,0,0,0,0,0]
[null,"Collinswood  HDPE-HDPE Class 250",null,0,0,0,0,0]
[null,"Collinswood  HDPE-HDPE Class 575",null,0,0,0,0,0]
[null,"Croydon Park-HDPE Class 250",null,0,0,0,0,0]
[null,"Croydon Park-HDPE Class 575",null,0,0,0,0,0]
[null,"Enfield-HDPE Class 250",null,0,0,0,0,0]
[null,"Evandale-HDPE Class 250",null,0,0,0,0,0]
[null,"Everard Park-HDPE Class 250",null,0,0,0,0,0]
[null,"Grange-HDPE Class 250",null,0,0,0,0,0]
[null,{"$f":"IF(B40=0,\"\",B40)","v":"Highbury-HDPE Class 250"},null,0,0,0,0,0]
[null,"Hillcrest-HDPE Class 250",null,0,0,0,0,0]
[null,"Holden Hill - Gilles Plains-HDPE Class 250",null,0,0,0,0,0]
[null,"Hove-HDPE Class 250",null,0,0,0,0,0]
[null,"Ingle Farm-HDPE Class 250",null,0,0,0,0,0]
[null,"Nailsworth -HDPE Class 250",null,0,0,0,0,0]
[null,"Newton PE-HDPE Class 250",null,0,0,0,0,0]
[null,"North Haven-HDPE Class 250",null,0,0,0,0,0]
[null,"Paradise - Athelstone-HDPE Class 250",null,0,0,0,0,0]
[null,"Paradise - Athelstone-HDPE Class 575",null,0,0,0,0,0]
[null,"Prospect Area A -HDPE Class 250",null,0,0,0,0,0]
[null,"Prospect Area A -HDPE Class 575",null,0,0,0,0,0]
[null,"Prospect Area B-HDPE Class 250",null,0,0,0,0,0]
[null,"Prospect Area C-HDPE Class 250",null,0,0,0,0,0]
[null,"Royal Park-HDPE Class 250",null,0,0,0,0,0]
[null,"Seaton-HDPE Class 250",null,0,0,0,0,0]
[null,"Sefton Park  HDPE-HDPE Class 250",null,0,0,0,0,0]
[null,"South Plympton-HDPE Class 250",null,0,0,0,0,0]
[null,"South Plympton A-HDPE Class 250",null,0,0,0,0,0]
[null,null,"Total",{"$f":"SUM(D363:D413)","v":0},{"$f":"SUM(E363:E413)","v":0},{"$f":"SUM(F363:F413)","v":0},{"$f":"SUM(G363:G413)","v":0},{"$f":"SUM(H363:H413)","v":0}]
[]
[null,"D. TOTAL OVERHEAD EXPENDITURE"]
[null,null,null,"EXPENDITURE"]
[null,null,null,"$0's"]
[null,null,null,{"$f":"dms_y1","v":"2014-15"},{"$f":"dms_y2","v":"2015-16"},{"$f":"dms_y3","v":"2016-17"},{"$f":"dms_y4","v":"2017-18"},{"$f":"dms_y5","v":"2018-19"}]
[null,{"$f":"IF(B8=0,\"\",B8)","v":"Beaumont-CI Block"},null,0,0,32910.885764775638,-14.287933443744414,0]
[null,{"$f":"IF(B9=0,\"\",B9)","v":"Brahma Lodge-CI Block"},null,0,0,378281.21870316478,40372.988166031108,1589.1293850184447]
[null,"Christies Beach-CI Block",null,0,0,225144.5002196983,2679.1499749071627,0]
[null,"Felixstow-CI Block",null,0,0,151065.09106567031,35404.35098734362,0]
[null,"Fulham-CI Block",null,0,0,0,0,30267.945634458272]
[null,"Fulham Gardens-CI Block",null,0,0,0,0,2528.7576815122729]
[null,"Largs North BLOCK-CI Block",null,0,0,513501.97154739953,7682.6878276610369,0]
[null,"Mansfield Park-CI Block",null,0,0,302365.93321588286,35560.364428538531,-8.944981200216354]
[null,"Mt Gambier A-CI Block",null,0,0,60104.661900265695,-490.43489407512766,0]
[null,"Mt Gambier B-CI Block",null,0,0,52639.715370164478,-3.6394334284186205,0]
[null,"Mt Gambier C-CI Block",null,0,0,5384.1292256384204,136009.60533887753,38436.117401486757]
[null,"Newton CI-CI Block",null,0,0,0,0,103022.18537619093]
[null,"O'Sullivan's Beach-CI Block",null,0,0,82070.247346338394,-323.33782817425686,0]
[null,"Seacombe  Gardens/Oaklands-CI Block",null,0,0,35280.701186785474,0,0]
[null,"Unley Road-CI Block",null,0,0,64.695105211713823,79957.034419336414,0]
[null,"CBD-CI Block",null,0,0,826544.13019758556,209935.66019909398,518499.20222350984]
[null,"Miscellaneous projects-CI Block",null,4793321.9940770045,5099583.9322319794,199782.11304036897,250427.74645546314,81960.710987246945]
[null,"Ascot Park-HDPE Class 250",null,0,0,24491.364669718991,-158.36113335532076,0]
[null,"Ascot Park A-HDPE Class 250",null,0,0,0,55848.596038579504,190763.12834420224]
[null,"Ascot Park A-HDPE Class 575",null,0,0,0,0,24823.026760931025]
[null,"Ashford-HDPE Class 250",null,0,0,0,44131.349021304704,0]
[null,"Broadview-HDPE Class 250",null,0,0,67.921235451313905,24285.874050224542,0]
[null,"Broadview A-HDPE Class 250",null,0,0,0,164172.1768270735,0]
[null,"Clarence Park-HDPE Class 250",null,0,0,0,18353.20755338321,0]
[null,"Collinswood  HDPE-HDPE Class 250",null,0,0,60175.664426743344,4748.3868867813344,0]
[null,"Collinswood  HDPE-HDPE Class 575",null,0,0,16022.809632682527,0,0]
[null,"Croydon Park-HDPE Class 250",null,0,0,0,0,66003.470725579755]
[null,"Croydon Park-HDPE Class 575",null,0,0,0,0,8064.3909239030927]
[null,"Enfield-HDPE Class 250",null,0,0,28857.224170010981,20386.414831891103,0]
[null,"Evandale-HDPE Class 250",null,0,0,0,0,0]
[null,"Everard Park-HDPE Class 250",null,0,0,0,42859.668300341174,0]
[null,"Grange-HDPE Class 250",null,0,0,0,106755.59204764711,87939.303228798628]
[null,"Highbury-HDPE Class 250",null,0,0,0,0,66242.358842915288]
[null,"Hillcrest-HDPE Class 250",null,0,0,59309.25188579697,79585.952338994466,0]
[null,"Holden Hill - Gilles Plains-HDPE Class 250",null,0,0,0,98065.106710208376,0]
[null,"Hove-HDPE Class 250",null,0,0,0,63199.944882929965,0]
[null,"Ingle Farm-HDPE Class 250",null,0,0,0,0,0]
[null,"Nailsworth -HDPE Class 250",null,0,0,64966.807254686268,575.78873017688204,0]
[null,"Newton PE-HDPE Class 250",null,0,0,0,0,0]
[null,"North Haven-HDPE Class 250",null,0,0,0,0,180507.5192747582]
[null,"Paradise - Athelstone-HDPE Class 250",null,0,0,0,120437.44850328361,92305.612687500397]
[null,"Paradise - Athelstone-HDPE Class 575",null,0,0,0,42431.819164130124,0]
[null,"Prospect Area A -HDPE Class 250",null,0,0,142945.37717721425,20932.734575223174,0]
[null,"Prospect Area A -HDPE Class 575",null,0,0,17389.4448702187,0,0]
[null,"Prospect Area B-HDPE Class 250",null,0,0,0,253377.95270737685,10037.397587841246]
[null,"Prospect Area C-HDPE Class 250",null,0,0,34688.358185727775,14122.398858566221,0]
[null,"Royal Park-HDPE Class 250",null,0,0,3628.7211130873529,25.120074028603419,0]
[null,"Seaton-HDPE Class 250",null,0,0,0,29629.864172242575,83791.539965640695]
[null,"Sefton Park  HDPE-HDPE Class 250",null,0,0,117902.62365297074,7960.6707800160621,0]
[null,"South Plympton-HDPE Class 250",null,0,0,0,7136.7176985013512,0]
[null,"South Plympton A-HDPE Class 250",null,0,0,0,33372.763575862489,0]
[null,"Surrey downs-HDPE Class 250",null,0,0,0,2674.2757543968614,0]
[null,"Trinity Gardens-HDPE Class 250",null,0,0,111035.93675216421,22197.234095023778,0]
[null,"Trinity Gardens-HDPE Class 575",null,0,0,16423.933534443531,0,0]
[null,"HDPE_Reallocation-HDPE Class 250",null,0,0,-12510.923220391589,-40923.653083588601,-21229.25115540142]
[null,"HDPE_Reallocation-HDPE Class 575",null,0,0,12510.923220391589,40923.653083588601,21229.25115540142]
[null,"Underdale-HDPE Class 250",null,0,0,0,32836.277294842861,0]
[null,"West Croydon-HDPE Class 250",null,0,0,0,0,0]
[null,"West Lakes  -HDPE Class 250",null,0,0,0,151322.69585311666,138781.64273129546]
[null,"West Lakes Shore-HDPE Class 250",null,0,0,83.014843329383652,543216.30471960804,37099.590173862423]
[null,"Woodville Gardens-HDPE Class 250",null,0,0,0,31714.777983129097,0]
[null,"Woodville south-HDPE Class 250",null,0,0,0,117.50333294779726,56603.042390381379]
[null,"Aberfoyle Park-HDPE Class 575",null,0,0,0,0,0]
[null,"Allenby Gardens-HDPE Class 575",null,0,0,0,0,0]
[null,"Andrews Farm-HDPE Class 575",null,0,0,0,54.453746281477876,0]
[null,{"$f":"IF(B73=0,\"\",B73)","v":"Auldana-HDPE Class 575"},null,0,0,0,0,56110.277906428775]
[null,"Blackwood-HDPE Class 575",null,0,0,0,94301.232252258982,123944.13456093409]
[null,"Brompton - Hindmarsh-HDPE Class 575",null,0,0,0,116291.92216150233,0]
[null,"Burnside-HDPE Class 575",null,0,0,0,4160.5740890088846,0]
[null,"Clarence Gardens-HDPE Class 575",null,0,0,0,114.32040438082035,80546.455607096956]
[null,"Eden Hills-HDPE Class 575",null,0,0,0,0,145112.64088413722]
[null,"Edwardstown-HDPE Class 575",null,0,0,0,0,101640.34740531381]
[null,"Elizabeth downs-HDPE Class 575",null,0,0,0,0,227448.70682379365]
[null,"Elizabeth North-HDPE Class 575",null,0,0,0,0,118782.85429527186]
[null,"Elizabeth Park-HDPE Class 575",null,0,0,0,0,155499.08051927641]
[null,"Elizabeth Vale-HDPE Class 575",null,0,0,0,0,80079.449162863602]
[null,"Evanston Park-HDPE Class 575",null,0,0,0,0,165655.76428617569]
[null,"Fullarton-HDPE Class 575",null,0,0,0,0,104465.55092234383]
[null,"Gawler-HDPE Class 575",null,0,0,1590.883520186127,208765.80533737782,0]
[null,"Gawler East-HDPE Class 575",null,0,0,0,0,0]
[null,"Glengowrie  HDPE-HDPE Class 575",null,0,0,13349.241147724795,61610.190610593112,0]
[null,"Glenunga-HDPE Class 575",null,0,0,0,0,0]
[null,"Glynde-HDPE Class 575",null,0,0,0,0,17859.493530694475]
[null,"Golden Grove-HDPE Class 575",null,0,0,0,54.453746281477876,3783.0374346367348]
[null,"Gulfview Heights-HDPE Class 575",null,0,0,0,0,0]
[null,"Hackney-HDPE Class 575",null,0,0,0,46380.731259015651,27319.525463986902]
[null,"Kensington-HDPE Class 575",null,0,0,764.2589617083629,51950.744695165988,0]
[null,"Kings Park-HDPE Class 575",null,0,0,0,0,0]
[null,"Kurralta Park-HDPE Class 575",null,0,0,0,19197.983082928127,0]
[null,"Kurralta Park A-HDPE Class 575",null,0,0,0,0,0]
[null,"Malvern-HDPE Class 575",null,0,0,0,0,0]
[null,"Melrose Park-HDPE Class 575",null,0,0,0,0,37277.197734088419]
[null,"Morphett Vale-HDPE Class 575",null,0,0,0,50.264996567518033,29651.077042884201]
[null,"Morphettville-HDPE Class 575",null,0,0,0,57.59530856694775,30477.822763591645]
[null,"Myrtle Bank-HDPE Class 575",null,0,0,0,0,44639.387761007383]
[null,"Norwood  HDPE-HDPE Class 575",null,0,0,29947.842167566647,899.89004479856135,0]
[null,"Norwood A-HDPE Class 575",null,0,0,0,0,0]
[null,"Nuriootpa-HDPE Class 575",null,0,0,0,0,0]
[null,"Parafield Gardens-HDPE Class 575",null,0,0,0,0,201440.29879385879]
[null,"Parkside-HDPE Class 575",null,0,0,0,83328.681949986843,0]
[null,"Pennington-HDPE Class 575",null,0,0,0,0,0]
[null,"Peterborough-HDPE Class 575",null,0,0,0,4695.3978412369916,16663.929179391263]
[null,"Salisbury Heights-HDPE Class 575",null,0,0,0,13741.51387599836,10811.5779368039]
[null,"Salisbury Heights A-HDPE Class 575",null,0,0,0,0,0]
[null,"Smithfield HDPE-HDPE Class 575",null,0,0,7638.9029780771634,0,0]
[null,"St Peters   HDPE-HDPE Class 575",null,0,0,157453.1353377442,-83.326425562131178,0]
[null,"Torrens Park-HDPE Class 575",null,0,0,65.765005754446804,93542.948070119339,0]
[null,"Torrens Park A-HDPE Class 575",null,0,0,0,0,0]
[null,"Unley / Hyde Park -HDPE Class 575",null,0,0,92423.518892496679,-183.90705619140661,0]
[null,"Unley A-HDPE Class 575",null,0,0,0,0,0]
[null,"Walkerville-HDPE Class 575",null,0,0,0,97026.134367744089,0]
[null,"Wayville-HDPE Class 575",null,0,0,0,0,59964.980415099955]
[null,"Westbourne Park-HDPE Class 575",null,0,0,0,73034.722714812873,161585.08067044982]
[null,"Willaston-HDPE Class 575",null,0,0,0,78164.106442038959,0]
[null,"Woodcroft-HDPE Class 575",null,0,0,0,50.264996567518033,27972.897480619387]
[null,"Wynn Vale-HDPE Class 575",null,0,0,0,0,283672.72520737111]
[null,"Trunk PI 1415 - Sals HW & WLC-Trunk PI",null,0,0,18074.993460686695,0,0]
[null,"MRP 1314 - West Terrace-Trunk PI",null,0,0,36042.084566144171,0,0]
[null,"Trunk CL16 - Anzac Hway-Trunk PI",null,0,0,28619.544064857968,0,0]
[null,"Trunk CL17 Philip HWYElizabeth-Trunk PI",null,0,0,11130.168948945702,228811.39832121105,8945.5607982228594]
[null,"Trunk CL17 Victoria Sq-Trunk PI",null,0,0,0,29484.41143845491,0]
[null,"Trunk CL15 - Morphett Road-Trunk SIB",null,0,0,70651.15099598447,5350.2528440565166,0]
[null,"Trunk CL17 Feed Works-Trunk SIB",null,0,0,13377.858044044906,7557.0239632011599,0]
[null,"Trunk CL16 Waterloo Cnr Rd (2)-Trunk SIB",null,0,0,154681.08943316882,8518.2385930972923,0]
[null,"Trunk CL17 -Salisbury Highway-Trunk SIB",null,0,0,15627.641628323559,466510.10227698187,0]
[null,"Trunk CL17 Exeter Tr &Chief St-Trunk SIB",null,0,0,6543.2772057999091,176168.3642519727,90198.509010103298]
[null,"Trunk CL18 - Brooker Tce-Trunk SIB",null,0,0,0,135394.53554664238,368241.45385215204]
[null,"Trunk CL18 - Hancock Road-Trunk SIB",null,0,0,0,49.984835246579763,57691.566741953531]
[null,"Trunk CL18 - OG Road-Trunk SIB",null,0,0,0,82.266708009995881,123255.34333577484]
[null,{"$f":"IF(B137=0,\"\",B137)","v":"Trunk CL19 - Churchill Road-Trunk SIB"},null,0,0,0,0,134840.20091702224]
[null,"Assorted proactive Trunk-Trunk PI",null,79839.342126328978,155317.65736142162,0,0,0]
[null,"Assorted proactive Trunk-Trunk SIB",null,-751.44149125533772,106595.37221838818,0,0,0]
[null,"Assorted proactive piecemeal PI-Piecemeal",null,477927.79662016628,521968.29436154343,7860.4706156148968,35203.530302149586,0]
[null,"Assorted reactive piecemeal-Piecemeal",null,0,0,0,0,0]
[null,"",null,0,0,0,0,0]
[null,"",null,0,0,0,0,0]
[null,"",null,0,0,0,0,0]
[null,null,"Total",{"$f":"SUM(D420:D556)","v":5350337.6913322443},{"$f":"SUM(E420:E556)","v":5883465.2561733332},{"$f":"SUM(F420:F556)","v":4228970.2742680255},{"$f":"SUM(G420:G556)","v":4973850.9515291126},{"$f":"SUM(H420:H556)","v":4914834.0557891829}]
[]
[null,"E. RELATED PARTY MARGIN EXPENDITURE"]
[null,null,null,"EXPENDITURE"]
[null,null,null,"$0's"]
[null,null,null,{"$f":"dms_y1","v":"2014-15"},{"$f":"dms_y2","v":"2015-16"},{"$f":"dms_y3","v":"2016-17"},{"$f":"dms_y4","v":"2017-18"},{"$f":"dms_y5","v":"2018-19"}]
[null,{"$f":"IF(B8=0,\"\",B8)","v":"Beaumont-CI Block"},null,0,0,0,0,0]
[null,"Brahma Lodge-CI Block",null,0,0,0,0,0]
[null,"Christies Beach-CI Block",null,0,0,0,0,0]
[null,"Felixstow-CI Block",null,0,0,0,0,0]
[null,"Fulham-CI Block",null,0,0,0,0,0]
[null,"Fulham Gardens-CI Block",null,0,0,0,0,0]
[null,"Largs North BLOCK-CI Block",null,0,0,0,0,0]
[null,"Mansfield Park-CI Block",null,0,0,0,0,0]
[null,"Mt Gambier A-CI Block",null,0,0,0,0,0]
[null,"Mt Gambier B-CI Block",null,0,0,0,0,0]
[null,"Mt Gambier C-CI Block",null,0,0,0,0,0]
[null,"Newton CI-CI Block",null,0,0,0,0,0]
[null,"O'Sullivan's Beach-CI Block",null,0,0,0,0,0]
[null,"Seacombe  Gardens/Oaklands-CI Block",null,0,0,0,0,0]
[null,"Unley Road-CI Block",null,0,0,0,0,0]
[null,"CBD-CI Block",null,0,0,0,0,0]
[null,"Miscellaneous projects-CI Block",null,0,0,0,0,0]
[null,"Ascot Park-HDPE Class 250",null,0,0,0,0,0]
[null,"Ascot Park A-HDPE Class 250",null,0,0,0,0,0]
[null,"Ascot Park A-HDPE Class 575",null,0,0,0,0,0]
[null,"Ashford-HDPE Class 250",null,0,0,0,0,0]
[null,"Broadview-HDPE Class 250",null,0,0,0,0,0]
[null,"Broadview A-HDPE Class 250",null,0,0,0,0,0]
[null,"Clarence Park-HDPE Class 250",null,0,0,0,0,0]
[null,"Collinswood  HDPE-HDPE Class 250",null,0,0,0,0,0]
[null,"Collinswood  HDPE-HDPE Class 575",null,0,0,0,0,0]
[null,"Croydon Park-HDPE Class 250",null,0,0,0,0,0]
[null,"Croydon Park-HDPE Class 575",null,0,0,0,0,0]
[null,"Enfield-HDPE Class 250",null,0,0,0,0,0]
[null,"Evandale-HDPE Class 250",null,0,0,0,0,0]
[null,"Everard Park-HDPE Class 250",null,0,0,0,0,0]
[null,"Grange-HDPE Class 250",null,0,0,0,0,0]
[null,{"$f":"IF(B40=0,\"\",B40)","v":"Highbury-HDPE Class 250"},null,0,0,0,0,0]
[null,"Hillcrest-HDPE Class 250",null,0,0,0,0,0]
[null,"Holden Hill - Gilles Plains-HDPE Class 250",null,0,0,0,0,0]
[null,"Hove-HDPE Class 250",null,0,0,0,0,0]
[null,"Ingle Farm-HDPE Class 250",null,0,0,0,0,0]
[null,"Nailsworth -HDPE Class 250",null,0,0,0,0,0]
[null,"Newton PE-HDPE Class 250",null,0,0,0,0,0]
[null,"North Haven-HDPE Class 250",null,0,0,0,0,0]
[null,"Paradise - Athelstone-HDPE Class 250",null,0,0,0,0,0]
[null,"Paradise - Athelstone-HDPE Class 575",null,0,0,0,0,0]
[null,"Prospect Area A -HDPE Class 250",null,0,0,0,0,0]
[null,"Prospect Area A -HDPE Class 575",null,0,0,0,0,0]
[null,"Prospect Area B-HDPE Class 250",null,0,0,0,0,0]
[null,"Prospect Area C-HDPE Class 250",null,0,0,0,0,0]
[null,"Royal Park-HDPE Class 250",null,0,0,0,0,0]
[null,"Seaton-HDPE Class 250",null,0,0,0,0,0]
[null,"Sefton Park  HDPE-HDPE Class 250",null,0,0,0,0,0]
[null,"South Plympton-HDPE Class 250",null,0,0,0,0,0]
[null,"South Plympton A-HDPE Class 250",null,0,0,0,0,0]
[null,"Surrey downs-HDPE Class 250",null,0,0,0,0,0]
[null,"Trinity Gardens-HDPE Class 250",null,0,0,0,0,0]
[null,"Trinity Gardens-HDPE Class 575",null,0,0,0,0,0]
[null,"HDPE_Reallocation-HDPE Class 250",null,0,0,0,0,0]
[null,"HDPE_Reallocation-HDPE Class 575",null,0,0,0,0,0]
[null,"Underdale-HDPE Class 250",null,0,0,0,0,0]
[null,"West Croydon-HDPE Class 250",null,0,0,0,0,0]
[null,"West Lakes  -HDPE Class 250",null,0,0,0,0,0]
[null,"West Lakes Shore-HDPE Class 250",null,0,0,0,0,0]
[null,"Woodville Gardens-HDPE Class 250",null,0,0,0,0,0]
[null,"Woodville south-HDPE Class 250",null,0,0,0,0,0]
[null,"Aberfoyle Park-HDPE Class 575",null,0,0,0,0,0]
[null,"Allenby Gardens-HDPE Class 575",null,0,0,0,0,0]
[null,{"$f":"IF(B72=0,\"\",B72)","v":"Andrews Farm-HDPE Class 575"},null,0,0,0,0,0]
[null,"Auldana-HDPE Class 575",null,0,0,0,0,0]
[null,"Blackwood-HDPE Class 575",null,0,0,0,0,0]
[null,"Brompton - Hindmarsh-HDPE Class 575",null,0,0,0,0,0]
[null,"Burnside-HDPE Class 575",null,0,0,0,0,0]
[null,"Clarence Gardens-HDPE Class 575",null,0,0,0,0,0]
[null,"Eden Hills-HDPE Class 575",null,0,0,0,0,0]
[null,"Edwardstown-HDPE Class 575",null,0,0,0,0,0]
[null,"Elizabeth downs-HDPE Class 575",null,0,0,0,0,0]
[null,"Elizabeth North-HDPE Class 575",null,0,0,0,0,0]
[null,"Elizabeth Park-HDPE Class 575",null,0,0,0,0,0]
[null,"Elizabeth Vale-HDPE Class 575",null,0,0,0,0,0]
[null,"Evanston Park-HDPE Class 575",null,0,0,0,0,0]
[null,"Fullarton-HDPE Class 575",null,0,0,0,0,0]
[null,"Gawler-HDPE Class 575",null,0,0,0,0,0]
[null,"Gawler East-HDPE Class 575",null,0,0,0,0,0]
[null,"Glengowrie  HDPE-HDPE Class 575",null,0,0,0,0,0]
[null,"Glenunga-HDPE Class 575",null,0,0,0,0,0]
[null,"Glynde-HDPE Class 575",null,0,0,0,0,0]
[null,"Golden Grove-HDPE Class 575",null,0,0,0,0,0]
[null,"Gulfview Heights-HDPE Class 575",null,0,0,0,0,0]
[null,"Hackney-HDPE Class 575",null,0,0,0,0,0]
[null,"Kensington-HDPE Class 575",null,0,0,0,0,0]
[null,"Kings Park-HDPE Class 575",null,0,0,0,0,0]
[null,"Kurralta Park-HDPE Class 575",null,0,0,0,0,0]
[null,"Kurralta Park A-HDPE Class 575",null,0,0,0,0,0]
[null,"Malvern-HDPE Class 575",null,0,0,0,0,0]
[null,"Melrose Park-HDPE Class 575",null,0,0,0,0,0]
[null,"Morphett Vale-HDPE Class 575",null,0,0,0,0,0]
[null,"Morphettville-HDPE Class 575",null,0,0,0,0,0]
[null,"Myrtle Bank-HDPE Class 575",null,0,0,0,0,0]
[null,"Norwood  HDPE-HDPE Class 575",null,0,0,0,0,0]
[null,{"$f":"IF(B104=0,\"\",B104)","v":"Norwood A-HDPE Class 575"},null,0,0,0,0,0]
[null,"Nuriootpa-HDPE Class 575",null,0,0,0,0,0]
[null,"Parafield Gardens-HDPE Class 575",null,0,0,0,0,0]
[null,"Parkside-HDPE Class 575",null,0,0,0,0,0]
[null,"Pennington-HDPE Class 575",null,0,0,0,0,0]
[null,"Peterborough-HDPE Class 575",null,0,0,0,0,0]
[null,"Salisbury Heights-HDPE Class 575",null,0,0,0,0,0]
[null,"Salisbury Heights A-HDPE Class 575",null,0,0,0,0,0]
[null,"Smithfield HDPE-HDPE Class 575",null,0,0,0,0,0]
[null,"St Peters   HDPE-HDPE Class 575",null,0,0,0,0,0]
[null,"Torrens Park-HDPE Class 575",null,0,0,0,0,0]
[null,"Torrens Park A-HDPE Class 575",null,0,0,0,0,0]
[null,"Unley / Hyde Park -HDPE Class 575",null,0,0,0,0,0]
[null,"Unley A-HDPE Class 575",null,0,0,0,0,0]
[null,"Walkerville-HDPE Class 575",null,0,0,0,0,0]
[null,"Wayville-HDPE Class 575",null,0,0,0,0,0]
[null,"Westbourne Park-HDPE Class 575",null,0,0,0,0,0]
[null,"Willaston-HDPE Class 575",null,0,0,0,0,0]
[null,"Woodcroft-HDPE Class 575",null,0,0,0,0,0]
[null,"Wynn Vale-HDPE Class 575",null,0,0,0,0,0]
[null,"Trunk PI 1415 - Sals HW & WLC-Trunk PI",null,0,0,0,0,0]
[null,"MRP 1314 - West Terrace-Trunk PI",null,0,0,0,0,0]
[null,"Trunk CL16 - Anzac Hway-Trunk PI",null,0,0,0,0,0]
[null,"Trunk CL17 Philip HWYElizabeth-Trunk PI",null,0,0,0,0,0]
[null,"Trunk CL17 Victoria Sq-Trunk PI",null,0,0,0,0,0]
[null,"Trunk CL15 - Morphett Road-Trunk SIB",null,0,0,0,0,0]
[null,"Trunk CL17 Feed Works-Trunk SIB",null,0,0,0,0,0]
[null,"Trunk CL16 Waterloo Cnr Rd (2)-Trunk SIB",null,0,0,0,0,0]
[null,"Trunk CL17 -Salisbury Highway-Trunk SIB",null,0,0,0,0,0]
[null,"Trunk CL17 Exeter Tr &Chief St-Trunk SIB",null,0,0,0,0,0]
[null,"Trunk CL18 - Brooker Tce-Trunk SIB",null,0,0,0,0,0]
[null,"Trunk CL18 - Hancock Road-Trunk SIB",null,0,0,0,0,0]
[null,{"$f":"IF(B144=0,\"\",B144)","v":""},null,0,0,0,0,0]
[null,"",null,0,0,0,0,0]
[null,null,null,0,0,0,0,0]
[null,null,"Total",{"$f":"SUM(D563:D693)","v":0},{"$f":"SUM(E563:E693)","v":0},{"$f":"SUM(F563:F693)","v":0},{"$f":"SUM(G563:G693)","v":0},{"$f":"SUM(H563:H693)","v":0}]
[]
[null,"F. CAPITAL CONTRIBUTIONS included in the above"]
[null,null,null,"EXPENDITURE"]
[null,null,null,"$0's"]
[null,null,null,{"$f":"dms_y1","v":"2014-15"},{"$f":"dms_y2","v":"2015-16"},{"$f":"dms_y3","v":"2016-17"},{"$f":"dms_y4","v":"2017-18"},{"$f":"dms_y5","v":"2018-19"}]
[null,{"$f":"IF(ISBLANK(dms_E2_Projects_01),\"\",dms_E2_Projects_01)","v":"Beaumont-CI Block"},null,0,0,0,0,0]
[null,{"$f":"IF(ISBLANK(dms_E2_Projects_02),\"\",dms_E2_Projects_02)","v":"Brahma Lodge-CI Block"},null,0,0,0,0,0]
[null,{"$f":"IF(ISBLANK(dms_E2_Projects_03),\"\",dms_E2_Projects_03)","v":"Christies Beach-CI Block"},null,0,0,0,0,0]
[null,{"$f":"IF(ISBLANK(dms_E2_Projects_04),\"\",dms_E2_Projects_04)","v":"Felixstow-CI Block"},null,0,0,0,0,0]
[null,{"$f":"IF(ISBLANK(dms_E2_Projects_05),\"\",dms_E2_Projects_05)","v":"Fulham-CI Block"},null,0,0,0,0,0]
[null,{"$f":"IF(ISBLANK(dms_E2_Projects_06),\"\",dms_E2_Projects_06)","v":"Fulham Gardens-CI Block"},null,0,0,0,0,0]
[null,{"$f":"IF(ISBLANK(dms_E2_Projects_07),\"\",dms_E2_Projects_07)","v":"Largs North BLOCK-CI Block"},null,0,0,0,0,0]
[null,{"$f":"IF(ISBLANK(dms_E2_Projects_08),\"\",dms_E2_Projects_08)","v":"Mansfield Park-CI Block"},null,0,0,0,0,0]
[null,{"$f":"IF(ISBLANK(dms_E2_Projects_09),\"\",dms_E2_Projects_09)","v":"Mt Gambier A-CI Block"},null,0,0,0,0,0]
[null,{"$f":"IF(ISBLANK(dms_E2_Projects_10),\"\",dms_E2_Projects_10)","v":"Mt Gambier B-CI Block"},null,0,0,0,0,0]
[null,{"$f":"IF(ISBLANK(dms_E2_Projects_11),\"\",dms_E2_Projects_11)","v":"Mt Gambier C-CI Block"},null,0,0,0,0,0]
[null,{"$f":"IF(ISBLANK(dms_E2_Projects_12),\"\",dms_E2_Projects_12)","v":"Newton CI-CI Block"},null,0,0,0,0,0]
[null,{"$f":"IF(ISBLANK(dms_E2_Projects_13),\"\",dms_E2_Projects_13)","v":"O'Sullivan's Beach-CI Block"},null,0,0,0,0,0]
[null,{"$f":"IF(ISBLANK(dms_E2_Projects_14),\"\",dms_E2_Projects_14)","v":"Seacombe  Gardens/Oaklands-CI Block"},null,0,0,0,0,0]
[null,{"$f":"IF(ISBLANK(dms_E2_Projects_15),\"\",dms_E2_Projects_15)","v":"Unley Road-CI Block"},null,0,0,0,0,0]
[null,{"$f":"IF(ISBLANK(dms_E2_Projects_16),\"\",dms_E2_Projects_16)","v":"CBD-CI Block"},null,0,0,0,0,0]
[null,{"$f":"IF(ISBLANK(dms_E2_Projects_17),\"\",dms_E2_Projects_17)","v":"Miscellaneous projects-CI Block"},null,0,0,0,0,0]
[null,{"$f":"IF(ISBLANK(dms_E2_Projects_18),\"\",dms_E2_Projects_18)","v":"Ascot Park-HDPE Class 250"},null,0,0,0,0,0]
[null,{"$f":"IF(ISBLANK(dms_E2_Projects_18),\"\",dms_E2_Projects_18)","v":"Ascot Park-HDPE Class 250"},null,0,0,0,0,0]
[null,{"$f":"IF(ISBLANK(dms_E2_Projects_19),\"\",dms_E2_Projects_19)","v":"Ascot Park A-HDPE Class 250"},null,0,0,0,0,0]
[null,{"$f":"IF(ISBLANK(dms_E2_Projects_20),\"\",dms_E2_Projects_20)","v":"Ascot Park A-HDPE Class 575"},null,0,0,0,0,0]
[null,{"$f":"IF(ISBLANK(dms_E2_Projects_21),\"\",dms_E2_Projects_21)","v":"Ashford-HDPE Class 250"},null,0,0,0,0,0]
[null,{"$f":"IF(ISBLANK(dms_E2_Projects_22),\"\",dms_E2_Projects_22)","v":"Broadview-HDPE Class 250"},null,0,0,0,0,0]
[null,{"$f":"IF(ISBLANK(dms_E2_Projects_23),\"\",dms_E2_Projects_23)","v":"Broadview A-HDPE Class 250"},null,0,0,0,0,0]
[null,{"$f":"IF(ISBLANK(dms_E2_Projects_24),\"\",dms_E2_Projects_24)","v":"Clarence Park-HDPE Class 250"},null,0,0,0,0,0]
[null,{"$f":"IF(ISBLANK(dms_E2_Projects_25),\"\",dms_E2_Projects_26)","v":"Collinswood  HDPE-HDPE Class 575"},null,0,0,0,0,0]
[null,{"$f":"IF(ISBLANK(dms_E2_Projects_27),\"\",dms_E2_Projects_27)","v":"Croydon Park-HDPE Class 250"},null,0,0,0,0,0]
[null,{"$f":"IF(ISBLANK(dms_E2_Projects_28),\"\",dms_E2_Projects_28)","v":"Croydon Park-HDPE Class 575"},null,0,0,0,0,0]
[null,{"$f":"IF(ISBLANK(dms_E2_Projects_29),\"\",dms_E2_Projects_29)","v":"Enfield-HDPE Class 250"},null,0,0,0,0,0]
[null,{"$f":"IF(ISBLANK(dms_E2_Projects_30),\"\",dms_E2_Projects_30)","v":"Evandale-HDPE Class 250"},null,0,0,0,0,0]
[null,{"$f":"IF(ISBLANK(dms_E2_Projects_31),\"\",dms_E2_Projects_31)","v":"Everard Park-HDPE Class 250"},null,0,0,0,0,0]
[null,{"$f":"IF(ISBLANK(dms_E2_Projects_32),\"\",dms_E2_Projects_32)","v":"Grange-HDPE Class 250"},null,0,0,0,0,0]
[null,{"$f":"IF(ISBLANK(dms_E2_Projects_33),\"\",dms_E2_Projects_33)","v":"Highbury-HDPE Class 250"},null,0,0,0,0,0]
[null,{"$f":"IF(ISBLANK(dms_E2_Projects_34),\"\",dms_E2_Projects_34)","v":"Hillcrest-HDPE Class 250"},null,0,0,0,0,0]
[null,{"$f":"IF(ISBLANK(dms_E2_Projects_35),\"\",dms_E2_Projects_35)","v":"Holden Hill - Gilles Plains-HDPE Class 250"},null,0,0,0,0,0]
[null,{"$f":"IF(ISBLANK(dms_E2_Projects_36),\"\",dms_E2_Projects_36)","v":"Hove-HDPE Class 250"},null,0,0,0,0,0]
[null,{"$f":"IF(ISBLANK(dms_E2_Projects_37),\"\",dms_E2_Projects_37)","v":"Ingle Farm-HDPE Class 250"},null,0,0,0,0,0]
[null,{"$f":"IF(ISBLANK(dms_E2_Projects_38),\"\",dms_E2_Projects_38)","v":"Nailsworth -HDPE Class 250"},null,0,0,0,0,0]
[null,{"$f":"IF(ISBLANK(dms_E2_Projects_39),\"\",dms_E2_Projects_39)","v":"Newton PE-HDPE Class 250"},null,0,0,0,0,0]
[null,{"$f":"IF(ISBLANK(dms_E2_Projects_40),\"\",dms_E2_Projects_40)","v":"North Haven-HDPE Class 250"},null,0,0,0,0,0]
[null,{"$f":"IF(ISBLANK(dms_E2_Projects_41),\"\",dms_E2_Projects_41)","v":"Paradise - Athelstone-HDPE Class 250"},null,0,0,0,0,0]
[null,{"$f":"IF(ISBLANK(dms_E2_Projects_42),\"\",dms_E2_Projects_42)","v":"Paradise - Athelstone-HDPE Class 575"},null,0,0,0,0,0]
[null,{"$f":"IF(ISBLANK(dms_E2_Projects_43),\"\",dms_E2_Projects_43)","v":"Prospect Area A -HDPE Class 250"},null,0,0,0,0,0]
[null,{"$f":"IF(ISBLANK(dms_E2_Projects_44),\"\",dms_E2_Projects_44)","v":"Prospect Area A -HDPE Class 575"},null,0,0,0,0,0]
[null,{"$f":"IF(ISBLANK(dms_E2_Projects_45),\"\",dms_E2_Projects_45)","v":"Prospect Area B-HDPE Class 250"},null,0,0,0,0,0]
[null,{"$f":"IF(ISBLANK(dms_E2_Projects_46),\"\",dms_E2_Projects_46)","v":"Prospect Area C-HDPE Class 250"},null,0,0,0,0,0]
[null,{"$f":"IF(ISBLANK(dms_E2_Projects_47),\"\",dms_E2_Projects_47)","v":"Royal Park-HDPE Class 250"},null,0,0,0,0,0]
[null,{"$f":"IF(ISBLANK(dms_E2_Projects_48),\"\",dms_E2_Projects_48)","v":"Seaton-HDPE Class 250"},null,0,0,0,0,0]
[null,{"$f":"IF(ISBLANK(dms_E2_Projects_49),\"\",dms_E2_Projects_49)","v":"Sefton Park  HDPE-HDPE Class 250"},null,0,0,0,0,0]
[null,null,null,0,0,0,0,0]
[null,null,null,0,0,0,0,0]
[null,null,null,0,0,0,0,0]
[null,null,null,0,0,0,0,0]
[null,null,null,0,0,0,0,0]
[null,null,null,0,0,0,0,0]
[null,null,null,0,0,0,0,0]
[null,null,null,0,0,0,0,0]
[null,null,null,0,0,0,0,0]
[null,null,null,0,0,0,0,0]
[null,null,null,0,0,0,0,0]
[null,null,null,0,0,0,0,0]
[null,null,null,0,0,0,0,0]
[null,null,null,0,0,0,0,0]
[null,null,null,0,0,0,0,0]
[null,null,null,0,0,0,0,0]
[null,null,null,0,0,0,0,0]
[null,null,null,0,0,0,0,0]
[null,null,null,0,0,0,0,0]
[null,null,null,0,0,0,0,0]
[null,null,null,0,0,0,0,0]
[null,null,null,0,0,0,0,0]
[null,null,null,0,0,0,0,0]
[null,null,null,0,0,0,0,0]
[null,null,null,0,0,0,0,0]
[null,null,null,0,0,0,0,0]
[null,null,null,0,0,0,0,0]
[null,null,null,0,0,0,0,0]
[null,null,null,0,0,0,0,0]
[null,null,null,0,0,0,0,0]
[null,null,null,0,0,0,0,0]
[null,null,null,0,0,0,0,0]
[null,null,null,0,0,0,0,0]
[null,null,null,0,0,0,0,0]
[null,null,null,0,0,0,0,0]
[null,null,null,0,0,0,0,0]
[null,null,null,0,0,0,0,0]
[null,null,null,0,0,0,0,0]
[null,null,null,0,0,0,0,0]
[null,null,null,0,0,0,0,0]
[null,null,null,0,0,0,0,0]
[null,null,null,0,0,0,0,0]
[null,null,null,0,0,0,0,0]
[null,null,null,0,0,0,0,0]
[null,null,null,0,0,0,0,0]
[null,null,null,0,0,0,0,0]
[null,null,null,0,0,0,0,0]
[null,null,null,0,0,0,0,0]
[null,null,null,0,0,0,0,0]
[null,null,null,0,0,0,0,0]
[null,null,null,0,0,0,0,0]
[null,null,null,0,0,0,0,0]
[null,null,null,0,0,0,0,0]
[null,null,null,0,0,0,0,0]
[null,null,null,0,0,0,0,0]
[null,null,null,0,0,0,0,0]
[null,null,null,0,0,0,0,0]
[null,null,null,0,0,0,0,0]
[null,null,null,0,0,0,0,0]
[null,null,null,0,0,0,0,0]
[null,null,null,0,0,0,0,0]
[null,null,null,0,0,0,0,0]
[null,null,null,0,0,0,0,0]
[null,null,null,0,0,0,0,0]
[null,null,null,0,0,0,0,0]
[null,null,null,0,0,0,0,0]
[null,null,null,0,0,0,0,0]
[null,null,null,0,0,0,0,0]
[null,null,null,0,0,0,0,0]
[null,null,null,0,0,0,0,0]
[null,null,null,0,0,0,0,0]
[null,null,null,0,0,0,0,0]
[null,null,null,0,0,0,0,0]
[null,null,null,0,0,0,0,0]
[null,null,null,0,0,0,0,0]
[null,null,null,0,0,0,0,0]
[null,null,null,0,0,0,0,0]
[null,"Other projects with expenditure of less than $500,000",null,0,0,0,0,0]
[null,null,"Total",{"$f":"SUM(D700:D826)","v":0},{"$f":"SUM(E700:E826)","v":0},{"$f":"SUM(F700:F826)","v":0},{"$f":"SUM(G700:G826)","v":0},{"$f":"SUM(H700:H826)","v":0}]
[]
[]
[]
[null,"E2.1.2 - REACTIVE - BY CONNECTION TYPE"]
[null,null,null,"EXPENDITURE"]
[null,null,null,"$0's"]
[null,null,null,{"$f":"dms_y1","v":"2014-15"},{"$f":"dms_y2","v":"2015-16"},{"$f":"dms_y3","v":"2016-17"},{"$f":"dms_y4","v":"2017-18"},{"$f":"dms_y5","v":"2018-19"}]
[null,"A. DIRECT INTERNAL LABOUR EXPENDITURE"]
[null,"Mains",null,0,0,0,0,0]
[null,"Services",null,0,0,0,0,0]
[null,null,"Total",{"$f":"SUM(D836:D837)","v":0},{"$f":"SUM(E836:E837)","v":0},{"$f":"SUM(F836:F837)","v":0},{"$f":"SUM(G836:G837)","v":0},{"$f":"SUM(H836:H837)","v":0}]
[null,"B. DIRECT CONTRACTOR EXPENDITURE"]
[null,"Mains",null,-0.37000000011175871,-0.4799999997485429,-0.44999999890569597,0,0]
[null,"Services",null,201960.8600000001,662676.74,1008576.15,680149.77000000014,1110725.7599999998]
[null,null,"Total",{"$f":"SUM(D840:D841)","v":201960.49},{"$f":"SUM(E840:E841)","v":662676.26000000024},{"$f":"SUM(F840:F841)","v":1008575.7000000011},{"$f":"SUM(G840:G841)","v":680149.77000000014},{"$f":"SUM(H840:H841)","v":1110725.7599999998}]
[null,"C. OTHER INTERNAL DIRECT EXPENDITURE"]
[null,"Mains",null,0,0,0,0,0]
[null,"Services",null,0,0,0,0,0]
[null,null,"Total",{"$f":"SUM(D844:D845)","v":0},{"$f":"SUM(E844:E845)","v":0},{"$f":"SUM(F844:F845)","v":0},{"$f":"SUM(G844:G845)","v":0},{"$f":"SUM(H844:H845)","v":0}]
[null,"D. TOTAL OVERHEAD EXPENDITURE"]
[null,"Mains",null,-0.275109263980994,-5.4266668856143951E-2,-0.33232588079408742,-0.27368836037931032,0.3450164612440858]
[null,"Services",null,23242.292792674671,129113.05880835808,100706.06776372287,67144.574528625599,101808.63700116402]
[null,null,"Total",{"$f":"SUM(D848:D849)","v":23242.01768341069},{"$f":"SUM(E848:E849)","v":129113.00454168922},{"$f":"SUM(F848:F849)","v":100705.73543784207},{"$f":"SUM(G848:G849)","v":67144.300840265219},{"$f":"SUM(H848:H849)","v":101808.98201762527}]
[null,"E. RELATED PARTY MARGIN EXPENDITURE"]
[null,"Mains",null,0,0,0,0,0]
[null,"Services",null,0,0,0,0,0]
[null,null,"Total",{"$f":"SUM(D852:D853)","v":0},{"$f":"SUM(E852:E853)","v":0},{"$f":"SUM(F852:F853)","v":0},{"$f":"SUM(G852:G853)","v":0},{"$f":"SUM(H852:H853)","v":0}]
[null,"F. CAPITAL CONTRIBUTIONS included in the above"]
[null,"Mains",null,0,0,0,0,0]
[null,"Services",null,0,0,0,0,0]
[null,null,"Total",{"$f":"SUM(D856:D857)","v":0},{"$f":"SUM(E856:E857)","v":0},{"$f":"SUM(F856:F857)","v":0},{"$f":"SUM(G856:G857)","v":0},{"$f":"SUM(H856:H857)","v":0}]
[null,null,"TOTAL",{"$f":"SUM(D858,D854,D850,D846,D842,D838)","v":225202.50768341069},{"$f":"SUM(E858,E854,E850,E846,E842,E838)","v":791789.26454168942},{"$f":"SUM(F858,F854,F850,F846,F842,F838)","v":1109281.4354378432},{"$f":"SUM(G858,G854,G850,G846,G842,G838)","v":747294.07084026537},{"$f":"SUM(H858,H854,H850,H846,H842,H838)","v":1212534.7420176251}]
[]
[]
[]
[null,"E2.2 - VOLUMES"]
[null,"E2.2.1 - PROACTIVE - BY CONNECTION TYPE - BY PROJECT"]
[null,null,null,"LENGTH"]
[null,null,null,"0s, metres"]
[null,null,null,{"$f":"dms_y1","v":"2014-15"},{"$f":"dms_y2","v":"2015-16"},{"$f":"dms_y3","v":"2016-17"},{"$f":"dms_y4","v":"2017-18"},{"$f":"dms_y5","v":"2018-19"}]
[null,"A. LOW PRESSURE TO HIGH PRESSURE"]
[null,"Beaumont-CI Block",null,0,0,305,0,0]
[null,"Brahma Lodge-CI Block",null,0,0,23616,3225,0]
[null,"Christies Beach-CI Block",null,0,0,15757,0,0]
[null,"Felixstow-CI Block",null,0,0,9144.5,74.5,0]
[null,"Fulham-CI Block",null,0,0,0,0,1319]
[null,"Largs North BLOCK-CI Block",null,0,0,33784.5,880,0]
[null,"Mansfield Park-CI Block",null,0,0,17736,2248,0]
[null,"Mt Gambier A-CI Block",null,0,0,3269,0,0]
[null,"Mt Gambier B-CI Block",null,0,0,1917,0,0]
[null,"Mt Gambier C-CI Block",null,0,0,0,4860.5,2777]
[null,"O'Sullivan's Beach-CI Block",null,0,0,7402,0,0]
[null,"Seacombe  Gardens/Oaklands-CI Block",null,0,0,570,0,0]
[null,"Unley Road-CI Block",null,0,0,0,3180,0]
[null,"Miscellaneous projects-CI Block",null,240520.4,199541,0,0,0]
[null,"Assorted proactive piecemeal PI-Piecemeal",null,19103.7,11173.269999999999,103.48000000000002,156,0]
[null,null,null,0,0,0,0,0]
[null,null,null,0,0,0,0,0]
[null,null,null,0,0,0,0,0]
[null,null,null,0,0,0,0,0]
[null,null,null,0,0,0,0,0]
[null,null,null,0,0,0,0,0]
[null,null,null,0,0,0,0,0]
[null,null,null,0,0,0,0,0]
[null,null,null,0,0,0,0,0]
[null,null,null,0,0,0,0,0]
[null,null,null,0,0,0,0,0]
[null,null,null,0,0,0,0,0]
[]
[]
[]
[]
[]
[]
[]
[]
[]
[]
[]
[]
[]
[]
[]
[]
[]
[]
[]
[]
[]
[]
[]
[]
[null,null,"Total",{"$f":"SUM(D869:D919)","v":259624.1},{"$f":"SUM(E869:E919)","v":210714.27},{"$f":"SUM(F869:F919)","v":113604.48},{"$f":"SUM(G869:G919)","v":14624},{"$f":"SUM(H869:H919)","v":4096}]
[]
[null,"B. LOW PRESSURE TO MEDIUM PRESSURE"]
[null,"Fulham Gardens-CI Block",null,0,0,0,0,125]
[null,"Newton CI-CI Block",null,0,0,0,0,4064]
[null,"CBD-CI Block",null,0,0,17355,0,0]
[]
[]
[]
[]
[]
[]
[]
[]
[]
[]
[]
[]
[]
[]
[]
[]
[]
[]
[]
[]
[]
[]
[]
[]
[]
[]
[]
[]
[]
[]
[]
[]
[]
[]
[]
[]
[]
[]
[]
[]
[]
[]
[]
[]
[]
[]
[]
[]
[null,null,"Total",{"$f":"SUM(D923:D973)","v":0},{"$f":"SUM(E923:E973)","v":0},{"$f":"SUM(F923:F973)","v":17355},{"$f":"SUM(G923:G973)","v":0},{"$f":"SUM(H923:H973)","v":4189}]
[]
[null,"C. LOW PRESSURE TO LOW PRESSURE"]
[null,"CBD-CI Block",null,0,0,0,1769,11805]
[]
[]
[]
[]
[]
[]
[]
[]
[]
[]
[]
[]
[]
[]
[]
[]
[]
[]
[]
[]
[]
[]
[]
[]
[]
[]
[]
[]
[]
[]
[]
[]
[]
[]
[]
[]
[]
[]
[]
[]
[]
[]
[]
[]
[]
[]
[]
[]
[]
[]
[null,null,"Total",{"$f":"SUM(D977:D1027)","v":0},{"$f":"SUM(E977:E1027)","v":0},{"$f":"SUM(F977:F1027)","v":0},{"$f":"SUM(G977:G1027)","v":1769},{"$f":"SUM(H977:H1027)","v":11805}]
[]
[null,"D. MEDIUM PRESSURE TO MEDIUM PRESSURE"]
[null,"Trunk PI 1415 - Sals HW & WLC-Trunk PI",null,0,0,0,0,0]
[null,"MRP 1314 - West Terrace-Trunk PI",null,0,0,0,0,0]
[null,"Trunk CL16 - Anzac Hway-Trunk PI",null,0,0,1519,0,0]
[null,"Trunk CL17 Philip HWYElizabeth-Trunk PI",null,0,0,0,4117,0]
[null,"Trunk CL17 Victoria Sq-Trunk PI",null,0,0,0,198,0]
[null,"Trunk CL15 - Morphett Road-Trunk SIB",null,0,0,2848,0,0]
[null,"Trunk CL17 Feed Works-Trunk SIB",null,0,0,0,0,0]
[null,"Trunk CL16 Waterloo Cnr Rd (2)-Trunk SIB",null,0,0,4113,0,0]
[null,"Trunk CL17 -Salisbury Highway-Trunk SIB",null,0,0,0,11249,0]
[null,"Trunk CL17 Exeter Tr &Chief St-Trunk SIB",null,0,0,0,1917,986.3262184276058]
[null,"Trunk CL18 - Brooker Tce-Trunk SIB",null,0,0,0,2224,7295.5852009960872]
[null,"Trunk CL18 - Hancock Road-Trunk SIB",null,0,0,0,0,1158.5297047314123]
[null,"Trunk CL18 - OG Road-Trunk SIB",null,0,0,0,0,1952.6645321949484]
[null,"Trunk CL19 - Churchill Road-Trunk SIB",null,0,0,0,0,1572.8943436499467]
[null,"Assorted proactive Trunk-Trunk PI",null,511,1200,0,0,0]
[null,"Assorted proactive Trunk-Trunk SIB",null,0,1229,0,0,0]
[null,"Ascot Park-HDPE Class 250",null,0,0,1006,0,0]
[null,null,null,0,0,0,0,0]
[null,"Ashford-HDPE Class 250",null,0,0,0,2096,0]
[null,"Broadview-HDPE Class 250",null,0,0,0,1153,0]
[null,"Broadview A-HDPE Class 250",null,0,0,0,8765,0]
[null,"Clarence Park-HDPE Class 250",null,0,0,0,850,0]
[null,"Collinswood  HDPE-HDPE Class 250",null,0,0,3004.5,0,0]
[null,"Collinswood  HDPE-HDPE Class 575",null,0,0,800,0,0]
[null,"Croydon Park-HDPE Class 250",null,0,0,0,0,4346]
[null,"Croydon Park-HDPE Class 575",null,0,0,0,0,531]
[null,"Enfield-HDPE Class 250",null,0,0,1350,1219,0]
[null,"Evandale-HDPE Class 250",null,0,0,0,0,0]
[null,"Everard Park-HDPE Class 250",null,0,0,0,1599,0]
[null,"Grange-HDPE Class 250",null,0,0,0,6212,4906]
[null,"Highbury-HDPE Class 250",null,0,0,0,0,5057]
[null,"Hillcrest-HDPE Class 250",null,0,0,2472,5476,0]
[null,"Holden Hill - Gilles Plains-HDPE Class 250",null,0,0,0,5617,0]
[null,"Hove-HDPE Class 250",null,0,0,0,3428,0]
[null,"Ingle Farm-HDPE Class 250",null,0,0,0,0,0]
[null,"Nailsworth -HDPE Class 250",null,0,0,4579,0,0]
[null,"Newton PE-HDPE Class 250",null,0,0,0,0,0]
[null,"North Haven-HDPE Class 250",null,0,0,0,0,12008]
[null,"Paradise - Athelstone-HDPE Class 250",null,0,0,0,7130,4929.5]
[null,"Prospect Area A -HDPE Class 250",null,0,0,6905,227.5,0]
[null,"Paradise - Athelstone-HDPE Class 575",null,0,0,0,2512,0]
[null,"Prospect Area A -HDPE Class 575",null,0,0,840,0,0]
[null,"Prospect Area B-HDPE Class 250",null,0,0,0,14408,916]
[null,"Prospect Area C-HDPE Class 250",null,0,0,1847,1353,0]
[null,"Royal Park-HDPE Class 250",null,0,0,174,0,0]
[null,"Seaton-HDPE Class 250",null,0,0,0,1241,3274]
[null,"Sefton Park  HDPE-HDPE Class 250",null,0,0,8128.5,0,0]
[null,"South Plympton-HDPE Class 250",null,0,0,0,433,0]
[null,"South Plympton A-HDPE Class 250",null,0,0,0,1472,0]
[null,"Surrey downs-HDPE Class 250",null,0,0,0,0,0]
[null,"Trinity Gardens-HDPE Class 250",null,0,0,7004,291,0]
[null,"Trinity Gardens-HDPE Class 575",null,0,0,1036,0,0]
[null,"HDPE_Reallocation-HDPE Class 250",null,0,0,-700,-2200,-1200]
[null,"Underdale-HDPE Class 250",null,0,0,0,1080,0]
[null,"West Croydon-HDPE Class 250",null,0,0,0,0,0]
[null,"West Lakes  -HDPE Class 250",null,0,0,0,8043,9031.4]
[null,"West Lakes Shore-HDPE Class 250",null,0,0,0,31522.5,532.5]
[null,"Woodville Gardens-HDPE Class 250",null,0,0,0,1661,0]
[null,"Woodville south-HDPE Class 250",null,0,0,0,0,3894]
[]
[]
[]
[]
[]
[]
[]
[]
[]
[]
[null,null,"Total",{"$f":"SUM(D1031:D1099)","v":511},{"$f":"SUM(E1031:E1099)","v":2429},{"$f":"SUM(F1031:F1099)","v":46926},{"$f":"SUM(G1031:G1099)","v":125294},{"$f":"SUM(H1031:H1099)","v":61191.4}]
[]
[null,"E. MEDIUM PRESSURE TO HIGH PRESSURE"]
[null,"Ascot Park A-HDPE Class 250",null,0,0,0,2940,9890.5]
[null,"Ascot Park A-HDPE Class 575",null,0,0,0,0,1287]
[]
[]
[]
[]
[]
[]
[]
[]
[]
[]
[]
[]
[]
[]
[]
[]
[]
[]
[]
[]
[]
[]
[]
[]
[]
[]
[]
[]
[]
[]
[]
[]
[]
[]
[]
[]
[]
[]
[]
[]
[]
[]
[]
[]
[]
[]
[]
[]
[]
[null,null,"Total",0,0,0,2940,11177.5]
[]
[null,"F. HIGH PRESSURE TO HIGH PRESSURE"]
[null,"Aberfoyle Park-HDPE Class 575",null,0,0,0,0,0]
[null,"Allenby Gardens-HDPE Class 575",null,0,0,0,0,0]
[null,"Andrews Farm-HDPE Class 575",null,0,0,0,0,0]
[null,"Auldana-HDPE Class 575",null,0,0,0,0,3001]
[null,"Blackwood-HDPE Class 575",null,0,0,0,6043,8919]
[null,"Brompton - Hindmarsh-HDPE Class 575",null,0,0,0,7269,0]
[null,"Burnside-HDPE Class 575",null,0,0,0,343,0]
[null,"Clarence Gardens-HDPE Class 575",null,0,0,0,0,4116]
[null,null,null,0,0,0,0,0]
[null,"Eden Hills-HDPE Class 575",null,0,0,0,0,8546]
[null,"Edwardstown-HDPE Class 575",null,0,0,0,0,3389]
[null,"Elizabeth downs-HDPE Class 575",null,0,0,0,0,13480]
[null,"Elizabeth North-HDPE Class 575",null,0,0,0,0,6718]
[null,"Elizabeth Park-HDPE Class 575",null,0,0,0,0,8497]
[null,"Elizabeth Vale-HDPE Class 575",null,0,0,0,0,4678]
[null,"Evanston Park-HDPE Class 575",null,0,0,0,0,10048.5]
[null,"Fullarton-HDPE Class 575",null,0,0,0,0,4686]
[null,"Gawler-HDPE Class 575",null,0,0,0,13738,0]
[null,"Gawler East-HDPE Class 575",null,0,0,0,0,0]
[null,"Glengowrie  HDPE-HDPE Class 575",null,0,0,732,3582,0]
[null,"Glenunga-HDPE Class 575",null,0,0,0,0,0]
[null,"Glynde-HDPE Class 575",null,0,0,0,0,897]
[null,"Golden Grove-HDPE Class 575",null,0,0,0,0,256]
[null,"Gulfview Heights-HDPE Class 575",null,0,0,0,0,0]
[null,"Hackney-HDPE Class 575",null,0,0,0,2097,1068]
[null,"Kensington-HDPE Class 575",null,0,0,0,2550,0]
[null,"Kings Park-HDPE Class 575",null,0,0,0,0,0]
[null,"Kurralta Park-HDPE Class 575",null,0,0,0,704,0]
[null,"Kurralta Park A-HDPE Class 575",null,0,0,0,0,0]
[null,"Malvern-HDPE Class 575",null,0,0,0,0,0]
[null,"Melrose Park-HDPE Class 575",null,0,0,0,0,2221]
[null,"Morphett Vale-HDPE Class 575",null,0,0,0,0,1671]
[null,"Morphettville-HDPE Class 575",null,0,0,0,0,1438]
[null,"Myrtle Bank-HDPE Class 575",null,0,0,0,0,2433]
[null,"Norwood  HDPE-HDPE Class 575",null,0,0,1936,0,0]
[null,"Norwood A-HDPE Class 575",null,0,0,0,0,0]
[null,"Nuriootpa-HDPE Class 575",null,0,0,0,0,0]
[null,"Parafield Gardens-HDPE Class 575",null,0,0,0,0,12741]
[null,"Parkside-HDPE Class 575",null,0,0,0,3782,0]
[null,"Pennington-HDPE Class 575",null,0,0,0,0,0]
[null,"Peterborough-HDPE Class 575",null,0,0,0,205,799]
[null,"Salisbury Heights-HDPE Class 575",null,0,0,0,958,711]
[null,"Salisbury Heights A-HDPE Class 575",null,0,0,0,0,0]
[null,"Smithfield HDPE-HDPE Class 575",null,0,0,414,0,0]
[null,"St Peters   HDPE-HDPE Class 575",null,0,0,7723,33,0]
[null,"Torrens Park-HDPE Class 575",null,0,0,0,4565,0]
[null,"Torrens Park A-HDPE Class 575",null,0,0,0,0,0]
[null,"HDPE_Reallocation-HDPE Class 575",null,0,0,700,2200,1200]
[null,"Unley / Hyde Park -HDPE Class 575",null,0,0,3036,0,0]
[null,"Unley A-HDPE Class 575",null,0,0,0,0,0]
[null,"Walkerville-HDPE Class 575",null,0,0,0,4504,0]
[null,"Wayville-HDPE Class 575",null,0,0,0,0,2592]
[null,"Westbourne Park-HDPE Class 575",null,0,0,0,3962,9671]
[null,"Willaston-HDPE Class 575",null,0,0,0,5373,0]
[null,"Woodcroft-HDPE Class 575",null,0,0,0,0,1745]
[null,"Wynn Vale-HDPE Class 575",null,0,0,0,0,16616]
[null,null,null,0,0,0,0,0]
[]
[]
[]
[]
[]
[]
[]
[]
[]
[]
[]
[]
[]
[]
[]
[]
[]
[]
[]
[]
[]
[]
[]
[]
[]
[]
[]
[]
[]
[]
[]
[]
[]
[]
[]
[]
[null,null,"Total",{"$f":"SUM(D1157:D1249)","v":0},{"$f":"SUM(E1157:E1249)","v":0},{"$f":"SUM(F1157:F1249)","v":14541},{"$f":"SUM(G1157:G1249)","v":61908},{"$f":"SUM(H1157:H1249)","v":132137.5}]
[]
[]
[null,"E2.2.2 - REACTIVE - BY CONNECTION TYPE"]
[null,null,null,"VOLUMES"]
[null,null,null,"0s"]
[null,null,null,{"$f":"dms_y1","v":"2014-15"},{"$f":"dms_y2","v":"2015-16"},{"$f":"dms_y3","v":"2016-17"},{"$f":"dms_y4","v":"2017-18"},{"$f":"dms_y5","v":"2018-19"}]
[null,"A. LOW PRESSURE TO HIGH PRESSURE"]
[null,"Mains","Length of mains replaced",0,0,0,0,0]
[null,"Services","Number of services replaced",14635,12812,11010,11108,12004]
[null,null,"Total",{"$f":"SUM(D1258:D1259)","v":14635},{"$f":"SUM(E1258:E1259)","v":12812},{"$f":"SUM(F1258:F1259)","v":11010},{"$f":"SUM(G1258:G1259)","v":11108},{"$f":"SUM(H1258:H1259)","v":12004}]
[null,"B. LOW PRESSURE TO MEDIUM PRESSURE"]
[null,"Mains","Length of mains replaced",0,0,0,0,0]
[null,"Services","Number of services replaced",0,0,0,0,0]
[null,null,"Total",{"$f":"SUM(D1262:D1263)","v":0},{"$f":"SUM(E1262:E1263)","v":0},{"$f":"SUM(F1262:F1263)","v":0},{"$f":"SUM(G1262:G1263)","v":0},{"$f":"SUM(H1262:H1263)","v":0}]
[null,"C. LOW PRESSURE TO LOW PRESSURE"]
[null,"Mains","Length of mains replaced",0,0,0,0,0]
[null,"Services","Number of services replaced",0,0,0,0,0]
[null,null,"Total",{"$f":"SUM(D1266:D1267)","v":0},{"$f":"SUM(E1266:E1267)","v":0},{"$f":"SUM(F1266:F1267)","v":0},{"$f":"SUM(G1266:G1267)","v":0},{"$f":"SUM(H1266:H1267)","v":0}]
[null,"D. MEDIUM PRESSURE TO MEDIUM PRESSURE"]
[null,"Mains","Length of mains replaced",0,0,0,0,0]
[null,"Services","Number of services replaced",0,0,0,0,0]
[null,null,"Total",{"$f":"SUM(D1270:D1271)","v":0},{"$f":"SUM(E1270:E1271)","v":0},{"$f":"SUM(F1270:F1271)","v":0},{"$f":"SUM(G1270:G1271)","v":0},{"$f":"SUM(H1270:H1271)","v":0}]
[null,"E. MEDIUM PRESSURE TO HIGH PRESSURE"]
[null,"Mains","Length of mains replaced",0,0,0,0,0]
[null,"Services","Number of services replaced",0,0,0,0,0]
[null,null,"Total",{"$f":"SUM(D1274:D1275)","v":0},{"$f":"SUM(E1274:E1275)","v":0},{"$f":"SUM(F1274:F1275)","v":0},{"$f":"SUM(G1274:G1275)","v":0},{"$f":"SUM(H1274:H1275)","v":0}]
[null,"F. HIGH PRESSURE TO HIGH PRESSURE"]
[null,"Mains","Length of mains replaced",0,0,0,0,0]
[null,"Services","Number of services replaced",0,0,0,0,0]
[null,null,"Total",{"$f":"SUM(D1278:D1279)","v":0},{"$f":"SUM(E1278:E1279)","v":0},{"$f":"SUM(F1278:F1279)","v":0},{"$f":"SUM(G1278:G1279)","v":0},{"$f":"SUM(H1278:H1279)","v":0}]

{"sheet":"E3. Mains Augex","index":8,"n_rows":746,"n_cols":7,"rows_kept":746,"cut":false,"hidden":false,"merged":[[406,2,406,6],[407,2,407,6],[61,2,61,6],[62,2,62,6],[118,2,118,6],[119,2,119,6],[175,2,175,6],[176,2,176,6],[232,2,232,6],[233,2,233,6],[289,2,289,6],[290,2,290,6],[346,2,346,6],[347,2,347,6],[463,2,463,6],[464,2,464,6],[520,2,520,6],[521,2,521,6],[577,2,577,6],[578,2,578,6],[634,2,634,6],[635,2,635,6],[691,2,691,6],[692,2,692,6]]}
[null,{"$f":"INDEX(dms_Worksheet_List,MATCH(dms_Model,dms_Model_List))","v":"HISTORICAL ANNUAL REPORTING"}]
[null,{"$f":"INDEX(dms_TradingNameFull_List,MATCH(dms_TradingName,dms_TradingName_List))","v":"Australian Gas Networks Limited (reporting data for SA)"}]
[null,{"$f":"dms_Header_Span","v":"2014-15 to 2018-19"}]
[null,"E3. MAINS AUGMENTATION"]
[]
[]
[null,"Please list all projects here:"]
[null,"3015 MAJOR PROJECTS - MURRAY BRIDGE"]
[]
[null,"3065 MAJOR PROJECTS - ADELAIDE CBD HP MAINS EXT EAST"]
[null,"3038 MAJOR PROJECTS - SEAFORD STAGE 2"]
[]
[null,"AUGMENTATION PROJECTS <$500K"]
[]
[]
[]
[]
[]
[]
[]
[]
[]
[]
[]
[]
[]
[]
[]
[]
[]
[]
[]
[]
[]
[]
[]
[]
[]
[]
[]
[]
[]
[]
[]
[]
[]
[]
[]
[]
[]
[]
[]
[]
[]
[]
[]
[]
[]
[]
[null,"E3.1 - CAPEX BY PROJECT"]
[null,"A. DIRECT INTERNAL LABOUR EXPENDITURE"]
[null,null,"EXPENDITURE"]
[null,null,"$0's"]
[null,null,{"$f":"dms_y1","v":"2014-15"},{"$f":"dms_y2","v":"2015-16"},{"$f":"dms_y3","v":"2016-17"},{"$f":"dms_y4","v":"2017-18"},{"$f":"dms_y5","v":"2018-19"}]
[null,{"$f":"IF(ISBLANK(dms_E3_Projects_01),\"\",dms_E3_Projects_01)","v":"3015 MAJOR PROJECTS - MURRAY BRIDGE"},0,0,0,0,0]
[null,{"$f":"IF(ISBLANK(dms_E3_Projects_02),\"\",dms_E3_Projects_02)","v":""},0,0,0,0,0]
[null,{"$f":"IF(ISBLANK(dms_E3_Projects_03),\"\",dms_E3_Projects_03)","v":"3065 MAJOR PROJECTS - ADELAIDE CBD HP MAINS EXT EAST"},0,0,0,0,0]
[null,{"$f":"IF(ISBLANK(dms_E3_Projects_04),\"\",dms_E3_Projects_04)","v":"3038 MAJOR PROJECTS - SEAFORD STAGE 2"},0,0,0,0,0]
[null,{"$f":"IF(ISBLANK(dms_E3_Projects_05),\"\",dms_E3_Projects_05)","v":""},0,0,0,0,0]
[null,{"$f":"IF(ISBLANK(dms_E3_Projects_06),\"\",dms_E3_Projects_06)","v":"AUGMENTATION PROJECTS <$500K"},0,0,0,0,0]
[null,{"$f":"IF(ISBLANK(dms_E3_Projects_07),\"\",dms_E3_Projects_07)","v":""},0,0,0,0,0]
[null,{"$f":"IF(ISBLANK(dms_E3_Projects_08),\"\",dms_E3_Projects_08)","v":""},0,0,0,0,0]
[null,{"$f":"IF(ISBLANK(dms_E3_Projects_09),\"\",dms_E3_Projects_09)","v":""},0,0,0,0,0]
[null,{"$f":"IF(ISBLANK(dms_E3_Projects_10),\"\",dms_E3_Projects_10)","v":""},0,0,0,0,0]
[null,{"$f":"IF(ISBLANK(dms_E3_Projects_11),\"\",dms_E3_Projects_11)","v":""},0,0,0,0,0]
[null,{"$f":"IF(ISBLANK(dms_E3_Projects_12),\"\",dms_E3_Projects_12)","v":""},0,0,0,0,0]
[null,{"$f":"IF(ISBLANK(dms_E3_Projects_13),\"\",dms_E3_Projects_13)","v":""},0,0,0,0,0]
[null,{"$f":"IF(ISBLANK(dms_E3_Projects_14),\"\",dms_E3_Projects_14)","v":""},0,0,0,0,0]
[null,{"$f":"IF(ISBLANK(dms_E3_Projects_15),\"\",dms_E3_Projects_15)","v":""},0,0,0,0,0]
[null,{"$f":"IF(ISBLANK(dms_E3_Projects_16),\"\",dms_E3_Projects_16)","v":""},0,0,0,0,0]
[null,{"$f":"IF(ISBLANK(dms_E3_Projects_17),\"\",dms_E3_Projects_17)","v":""},0,0,0,0,0]
[null,{"$f":"IF(ISBLANK(dms_E3_Projects_18),\"\",dms_E3_Projects_18)","v":""},0,0,0,0,0]
[null,{"$f":"IF(ISBLANK(dms_E3_Projects_18),\"\",dms_E3_Projects_18)","v":""},0,0,0,0,0]
[null,{"$f":"IF(ISBLANK(dms_E3_Projects_19),\"\",dms_E3_Projects_19)","v":""},0,0,0,0,0]
[null,{"$f":"IF(ISBLANK(dms_E3_Projects_20),\"\",dms_E3_Projects_20)","v":""},0,0,0,0,0]
[null,{"$f":"IF(ISBLANK(dms_E3_Projects_21),\"\",dms_E3_Projects_21)","v":""},0,0,0,0,0]
[null,{"$f":"IF(ISBLANK(dms_E3_Projects_22),\"\",dms_E3_Projects_22)","v":""},0,0,0,0,0]
[null,{"$f":"IF(ISBLANK(dms_E3_Projects_23),\"\",dms_E3_Projects_23)","v":""},0,0,0,0,0]
[null,{"$f":"IF(ISBLANK(dms_E3_Projects_24),\"\",dms_E3_Projects_24)","v":""},0,0,0,0,0]
[null,{"$f":"IF(ISBLANK(dms_E3_Projects_25),\"\",dms_E3_Projects_26)","v":""},0,0,0,0,0]
[null,{"$f":"IF(ISBLANK(dms_E3_Projects_27),\"\",dms_E3_Projects_27)","v":""},0,0,0,0,0]
[null,{"$f":"IF(ISBLANK(dms_E3_Projects_28),\"\",dms_E3_Projects_28)","v":""},0,0,0,0,0]
[null,{"$f":"IF(ISBLANK(dms_E3_Projects_29),\"\",dms_E3_Projects_29)","v":""},0,0,0,0,0]
[null,{"$f":"IF(ISBLANK(dms_E3_Projects_30),\"\",dms_E3_Projects_30)","v":""},0,0,0,0,0]
[null,{"$f":"IF(ISBLANK(dms_E3_Projects_31),\"\",dms_E3_Projects_31)","v":""},0,0,0,0,0]
[null,{"$f":"IF(ISBLANK(dms_E3_Projects_32),\"\",dms_E3_Projects_32)","v":""},0,0,0,0,0]
[null,{"$f":"IF(ISBLANK(dms_E3_Projects_33),\"\",dms_E3_Projects_33)","v":""},0,0,0,0,0]
[null,{"$f":"IF(ISBLANK(dms_E3_Projects_34),\"\",dms_E3_Projects_34)","v":""},0,0,0,0,0]
[null,{"$f":"IF(ISBLANK(dms_E3_Projects_35),\"\",dms_E3_Projects_35)","v":""},0,0,0,0,0]
[null,{"$f":"IF(ISBLANK(dms_E3_Projects_36),\"\",dms_E3_Projects_36)","v":""},0,0,0,0,0]
[null,{"$f":"IF(ISBLANK(dms_E3_Projects_37),\"\",dms_E3_Projects_37)","v":""},0,0,0,0,0]
[null,{"$f":"IF(ISBLANK(dms_E3_Projects_38),\"\",dms_E3_Projects_38)","v":""},0,0,0,0,0]
[null,{"$f":"IF(ISBLANK(dms_E3_Projects_39),\"\",dms_E3_Projects_39)","v":""},0,0,0,0,0]
[null,{"$f":"IF(ISBLANK(dms_E3_Projects_40),\"\",dms_E3_Projects_40)","v":""},0,0,0,0,0]
[null,{"$f":"IF(ISBLANK(dms_E3_Projects_41),\"\",dms_E3_Projects_41)","v":""},0,0,0,0,0]
[null,{"$f":"IF(ISBLANK(dms_E3_Projects_42),\"\",dms_E3_Projects_42)","v":""},0,0,0,0,0]
[null,{"$f":"IF(ISBLANK(dms_E3_Projects_43),\"\",dms_E3_Projects_43)","v":""},0,0,0,0,0]
[null,{"$f":"IF(ISBLANK(dms_E3_Projects_44),\"\",dms_E3_Projects_44)","v":""},0,0,0,0,0]
[null,{"$f":"IF(ISBLANK(dms_E3_Projects_45),\"\",dms_E3_Projects_45)","v":""},0,0,0,0,0]
[null,{"$f":"IF(ISBLANK(dms_E3_Projects_46),\"\",dms_E3_Projects_46)","v":""},0,0,0,0,0]
[null,{"$f":"IF(ISBLANK(dms_E3_Projects_47),\"\",dms_E3_Projects_47)","v":""},0,0,0,0,0]
[null,{"$f":"IF(ISBLANK(dms_E3_Projects_48),\"\",dms_E3_Projects_48)","v":""},0,0,0,0,0]
[null,{"$f":"IF(ISBLANK(dms_E3_Projects_49),\"\",dms_E3_Projects_49)","v":""},0,0,0,0,0]
[null,{"$f":"IF(ISBLANK(dms_E3_Projects_50),\"\",dms_E3_Projects_50)","v":""},0,0,0,0,0]
[null,"Aggregate of other projects with total expenditure of less than $500,000",0,0,0,0,0]
[null,"Total",{"$f":"SUM(C65:C115)","v":0},{"$f":"SUM(D65:D115)","v":0},{"$f":"SUM(E65:E115)","v":0},{"$f":"SUM(F65:F115)","v":0},{"$f":"SUM(G65:G115)","v":0}]
[]
[null,"B. DIRECT CONTRACTOR EXPENDITURE"]
[null,null,"EXPENDITURE"]
[null,null,"$0's"]
[null,null,{"$f":"dms_y1","v":"2014-15"},{"$f":"dms_y2","v":"2015-16"},{"$f":"dms_y3","v":"2016-17"},{"$f":"dms_y4","v":"2017-18"},{"$f":"dms_y5","v":"2018-19"}]
[null,{"$f":"IF(ISBLANK(dms_E3_Projects_01),\"\",dms_E3_Projects_01)","v":"3015 MAJOR PROJECTS - MURRAY BRIDGE"}]
[null,{"$f":"IF(ISBLANK(dms_E3_Projects_02),\"\",dms_E3_Projects_02)","v":""}]
[null,{"$f":"IF(ISBLANK(dms_E3_Projects_03),\"\",dms_E3_Projects_03)","v":"3065 MAJOR PROJECTS - ADELAIDE CBD HP MAINS EXT EAST"}]
[null,{"$f":"IF(ISBLANK(dms_E3_Projects_04),\"\",dms_E3_Projects_04)","v":"3038 MAJOR PROJECTS - SEAFORD STAGE 2"}]
[null,{"$f":"IF(ISBLANK(dms_E3_Projects_05),\"\",dms_E3_Projects_05)","v":""}]
[null,{"$f":"IF(ISBLANK(dms_E3_Projects_06),\"\",dms_E3_Projects_06)","v":"AUGMENTATION PROJECTS <$500K"}]
[null,{"$f":"IF(ISBLANK(dms_E3_Projects_07),\"\",dms_E3_Projects_07)","v":""},0,0,0,0,0]
[null,{"$f":"IF(ISBLANK(dms_E3_Projects_08),\"\",dms_E3_Projects_08)","v":""},0,0,0,0,0]
[null,{"$f":"IF(ISBLANK(dms_E3_Projects_09),\"\",dms_E3_Projects_09)","v":""},0,0,0,0,0]
[null,{"$f":"IF(ISBLANK(dms_E3_Projects_10),\"\",dms_E3_Projects_10)","v":""},0,0,0,0,0]
[null,{"$f":"IF(ISBLANK(dms_E3_Projects_11),\"\",dms_E3_Projects_11)","v":""},0,0,0,0,0]
[null,{"$f":"IF(ISBLANK(dms_E3_Projects_12),\"\",dms_E3_Projects_12)","v":""},0,0,0,0,0]
[null,{"$f":"IF(ISBLANK(dms_E3_Projects_13),\"\",dms_E3_Projects_13)","v":""},0,0,0,0,0]
[null,{"$f":"IF(ISBLANK(dms_E3_Projects_14),\"\",dms_E3_Projects_14)","v":""},0,0,0,0,0]
[null,{"$f":"IF(ISBLANK(dms_E3_Projects_15),\"\",dms_E3_Projects_15)","v":""},0,0,0,0,0]
[null,{"$f":"IF(ISBLANK(dms_E3_Projects_16),\"\",dms_E3_Projects_16)","v":""},0,0,0,0,0]
[null,{"$f":"IF(ISBLANK(dms_E3_Projects_17),\"\",dms_E3_Projects_17)","v":""},0,0,0,0,0]
[null,{"$f":"IF(ISBLANK(dms_E3_Projects_18),\"\",dms_E3_Projects_18)","v":""},0,0,0,0,0]
[null,{"$f":"IF(ISBLANK(dms_E3_Projects_18),\"\",dms_E3_Projects_18)","v":""},0,0,0,0,0]
[null,{"$f":"IF(ISBLANK(dms_E3_Projects_19),\"\",dms_E3_Projects_19)","v":""},0,0,0,0,0]
[null,{"$f":"IF(ISBLANK(dms_E3_Projects_20),\"\",dms_E3_Projects_20)","v":""},0,0,0,0,0]
[null,{"$f":"IF(ISBLANK(dms_E3_Projects_21),\"\",dms_E3_Projects_21)","v":""},0,0,0,0,0]
[null,{"$f":"IF(ISBLANK(dms_E3_Projects_22),\"\",dms_E3_Projects_22)","v":""},0,0,0,0,0]
[null,{"$f":"IF(ISBLANK(dms_E3_Projects_23),\"\",dms_E3_Projects_23)","v":""},0,0,0,0,0]
[null,{"$f":"IF(ISBLANK(dms_E3_Projects_24),\"\",dms_E3_Projects_24)","v":""},0,0,0,0,0]
[null,{"$f":"IF(ISBLANK(dms_E3_Projects_25),\"\",dms_E3_Projects_26)","v":""},0,0,0,0,0]
[null,{"$f":"IF(ISBLANK(dms_E3_Projects_27),\"\",dms_E3_Projects_27)","v":""},0,0,0,0,0]
[null,{"$f":"IF(ISBLANK(dms_E3_Projects_28),\"\",dms_E3_Projects_28)","v":""},0,0,0,0,0]
[null,{"$f":"IF(ISBLANK(dms_E3_Projects_29),\"\",dms_E3_Projects_29)","v":""},0,0,0,0,0]
[null,{"$f":"IF(ISBLANK(dms_E3_Projects_30),\"\",dms_E3_Projects_30)","v":""},0,0,0,0,0]
[null,{"$f":"IF(ISBLANK(dms_E3_Projects_31),\"\",dms_E3_Projects_31)","v":""},0,0,0,0,0]
[null,{"$f":"IF(ISBLANK(dms_E3_Projects_32),\"\",dms_E3_Projects_32)","v":""},0,0,0,0,0]
[null,{"$f":"IF(ISBLANK(dms_E3_Projects_33),\"\",dms_E3_Projects_33)","v":""},0,0,0,0,0]
[null,{"$f":"IF(ISBLANK(dms_E3_Projects_34),\"\",dms_E3_Projects_34)","v":""},0,0,0,0,0]
[null,{"$f":"IF(ISBLANK(dms_E3_Projects_35),\"\",dms_E3_Projects_35)","v":""},0,0,0,0,0]
[null,{"$f":"IF(ISBLANK(dms_E3_Projects_36),\"\",dms_E3_Projects_36)","v":""},0,0,0,0,0]
[null,{"$f":"IF(ISBLANK(dms_E3_Projects_37),\"\",dms_E3_Projects_37)","v":""},0,0,0,0,0]
[null,{"$f":"IF(ISBLANK(dms_E3_Projects_38),\"\",dms_E3_Projects_38)","v":""},0,0,0,0,0]
[null,{"$f":"IF(ISBLANK(dms_E3_Projects_39),\"\",dms_E3_Projects_39)","v":""},0,0,0,0,0]
[null,{"$f":"IF(ISBLANK(dms_E3_Projects_40),\"\",dms_E3_Projects_40)","v":""},0,0,0,0,0]
[null,{"$f":"IF(ISBLANK(dms_E3_Projects_41),\"\",dms_E3_Projects_41)","v":""},0,0,0,0,0]
[null,{"$f":"IF(ISBLANK(dms_E3_Projects_42),\"\",dms_E3_Projects_42)","v":""},0,0,0,0,0]
[null,{"$f":"IF(ISBLANK(dms_E3_Projects_43),\"\",dms_E3_Projects_43)","v":""},0,0,0,0,0]
[null,{"$f":"IF(ISBLANK(dms_E3_Projects_44),\"\",dms_E3_Projects_44)","v":""},0,0,0,0,0]
[null,{"$f":"IF(ISBLANK(dms_E3_Projects_45),\"\",dms_E3_Projects_45)","v":""},0,0,0,0,0]
[null,{"$f":"IF(ISBLANK(dms_E3_Projects_46),\"\",dms_E3_Projects_46)","v":""},0,0,0,0,0]
[null,{"$f":"IF(ISBLANK(dms_E3_Projects_47),\"\",dms_E3_Projects_47)","v":""},0,0,0,0,0]
[null,{"$f":"IF(ISBLANK(dms_E3_Projects_48),\"\",dms_E3_Projects_48)","v":""},0,0,0,0,0]
[null,{"$f":"IF(ISBLANK(dms_E3_Projects_49),\"\",dms_E3_Projects_49)","v":""},0,0,0,0,0]
[null,{"$f":"IF(ISBLANK(dms_E3_Projects_50),\"\",dms_E3_Projects_50)","v":""},0,0,0,0,0]
[null,"Aggregate of other projects with total expenditure of less than $500,000",0,0,0,0,0]
[null,"Total",{"$f":"SUM(C122:C172)","v":0},{"$f":"SUM(D122:D172)","v":0},{"$f":"SUM(E122:E172)","v":0},{"$f":"SUM(F122:F172)","v":0},{"$f":"SUM(G122:G172)","v":0}]
[]
[null,"C. OTHER INTERNAL DIRECT EXPENDITURE"]
[null,null,"EXPENDITURE"]
[null,null,"$0's"]
[null,null,{"$f":"dms_y1","v":"2014-15"},{"$f":"dms_y2","v":"2015-16"},{"$f":"dms_y3","v":"2016-17"},{"$f":"dms_y4","v":"2017-18"},{"$f":"dms_y5","v":"2018-19"}]
[null,{"$f":"IF(ISBLANK(dms_E3_Projects_01),\"\",dms_E3_Projects_01)","v":"3015 MAJOR PROJECTS - MURRAY BRIDGE"},0,0,0,0,0]
[null,{"$f":"IF(ISBLANK(dms_E3_Projects_02),\"\",dms_E3_Projects_02)","v":""},0,0,0,0,0]
[null,{"$f":"IF(ISBLANK(dms_E3_Projects_03),\"\",dms_E3_Projects_03)","v":"3065 MAJOR PROJECTS - ADELAIDE CBD HP MAINS EXT EAST"},0,0,0,0,0]
[null,{"$f":"IF(ISBLANK(dms_E3_Projects_04),\"\",dms_E3_Projects_04)","v":"3038 MAJOR PROJECTS - SEAFORD STAGE 2"},0,0,0,0,0]
[null,{"$f":"IF(ISBLANK(dms_E3_Projects_05),\"\",dms_E3_Projects_05)","v":""},0,0,0,0,0]
[null,{"$f":"IF(ISBLANK(dms_E3_Projects_06),\"\",dms_E3_Projects_06)","v":"AUGMENTATION PROJECTS <$500K"},0,0,0,0,0]
[null,{"$f":"IF(ISBLANK(dms_E3_Projects_07),\"\",dms_E3_Projects_07)","v":""},0,0,0,0,0]
[null,{"$f":"IF(ISBLANK(dms_E3_Projects_08),\"\",dms_E3_Projects_08)","v":""},0,0,0,0,0]
[null,{"$f":"IF(ISBLANK(dms_E3_Projects_09),\"\",dms_E3_Projects_09)","v":""},0,0,0,0,0]
[null,{"$f":"IF(ISBLANK(dms_E3_Projects_10),\"\",dms_E3_Projects_10)","v":""},0,0,0,0,0]
[null,{"$f":"IF(ISBLANK(dms_E3_Projects_11),\"\",dms_E3_Projects_11)","v":""},0,0,0,0,0]
[null,{"$f":"IF(ISBLANK(dms_E3_Projects_12),\"\",dms_E3_Projects_12)","v":""},0,0,0,0,0]
[null,{"$f":"IF(ISBLANK(dms_E3_Projects_13),\"\",dms_E3_Projects_13)","v":""},0,0,0,0,0]
[null,{"$f":"IF(ISBLANK(dms_E3_Projects_14),\"\",dms_E3_Projects_14)","v":""},0,0,0,0,0]
[null,{"$f":"IF(ISBLANK(dms_E3_Projects_15),\"\",dms_E3_Projects_15)","v":""},0,0,0,0,0]
[null,{"$f":"IF(ISBLANK(dms_E3_Projects_16),\"\",dms_E3_Projects_16)","v":""},0,0,0,0,0]
[null,{"$f":"IF(ISBLANK(dms_E3_Projects_17),\"\",dms_E3_Projects_17)","v":""},0,0,0,0,0]
[null,{"$f":"IF(ISBLANK(dms_E3_Projects_18),\"\",dms_E3_Projects_18)","v":""},0,0,0,0,0]
[null,{"$f":"IF(ISBLANK(dms_E3_Projects_18),\"\",dms_E3_Projects_18)","v":""},0,0,0,0,0]
[null,{"$f":"IF(ISBLANK(dms_E3_Projects_19),\"\",dms_E3_Projects_19)","v":""},0,0,0,0,0]
[null,{"$f":"IF(ISBLANK(dms_E3_Projects_20),\"\",dms_E3_Projects_20)","v":""},0,0,0,0,0]
[null,{"$f":"IF(ISBLANK(dms_E3_Projects_21),\"\",dms_E3_Projects_21)","v":""},0,0,0,0,0]
[null,{"$f":"IF(ISBLANK(dms_E3_Projects_22),\"\",dms_E3_Projects_22)","v":""},0,0,0,0,0]
[null,{"$f":"IF(ISBLANK(dms_E3_Projects_23),\"\",dms_E3_Projects_23)","v":""},0,0,0,0,0]
[null,{"$f":"IF(ISBLANK(dms_E3_Projects_24),\"\",dms_E3_Projects_24)","v":""},0,0,0,0,0]
[null,{"$f":"IF(ISBLANK(dms_E3_Projects_25),\"\",dms_E3_Projects_26)","v":""},0,0,0,0,0]
[null,{"$f":"IF(ISBLANK(dms_E3_Projects_27),\"\",dms_E3_Projects_27)","v":""},0,0,0,0,0]
[null,{"$f":"IF(ISBLANK(dms_E3_Projects_28),\"\",dms_E3_Projects_28)","v":""},0,0,0,0,0]
[null,{"$f":"IF(ISBLANK(dms_E3_Projects_29),\"\",dms_E3_Projects_29)","v":""},0,0,0,0,0]
[null,{"$f":"IF(ISBLANK(dms_E3_Projects_30),\"\",dms_E3_Projects_30)","v":""},0,0,0,0,0]
[null,{"$f":"IF(ISBLANK(dms_E3_Projects_31),\"\",dms_E3_Projects_31)","v":""},0,0,0,0,0]
[null,{"$f":"IF(ISBLANK(dms_E3_Projects_32),\"\",dms_E3_Projects_32)","v":""},0,0,0,0,0]
[null,{"$f":"IF(ISBLANK(dms_E3_Projects_33),\"\",dms_E3_Projects_33)","v":""},0,0,0,0,0]
[null,{"$f":"IF(ISBLANK(dms_E3_Projects_34),\"\",dms_E3_Projects_34)","v":""},0,0,0,0,0]
[null,{"$f":"IF(ISBLANK(dms_E3_Projects_35),\"\",dms_E3_Projects_35)","v":""},0,0,0,0,0]
[null,{"$f":"IF(ISBLANK(dms_E3_Projects_36),\"\",dms_E3_Projects_36)","v":""},0,0,0,0,0]
[null,{"$f":"IF(ISBLANK(dms_E3_Projects_37),\"\",dms_E3_Projects_37)","v":""},0,0,0,0,0]
[null,{"$f":"IF(ISBLANK(dms_E3_Projects_38),\"\",dms_E3_Projects_38)","v":""},0,0,0,0,0]
[null,{"$f":"IF(ISBLANK(dms_E3_Projects_39),\"\",dms_E3_Projects_39)","v":""},0,0,0,0,0]
[null,{"$f":"IF(ISBLANK(dms_E3_Projects_40),\"\",dms_E3_Projects_40)","v":""},0,0,0,0,0]
[null,{"$f":"IF(ISBLANK(dms_E3_Projects_41),\"\",dms_E3_Projects_41)","v":""},0,0,0,0,0]
[null,{"$f":"IF(ISBLANK(dms_E3_Projects_42),\"\",dms_E3_Projects_42)","v":""},0,0,0,0,0]
[null,{"$f":"IF(ISBLANK(dms_E3_Projects_43),\"\",dms_E3_Projects_43)","v":""},0,0,0,0,0]
[null,{"$f":"IF(ISBLANK(dms_E3_Projects_44),\"\",dms_E3_Projects_44)","v":""},0,0,0,0,0]
[null,{"$f":"IF(ISBLANK(dms_E3_Projects_45),\"\",dms_E3_Projects_45)","v":""},0,0,0,0,0]
[null,{"$f":"IF(ISBLANK(dms_E3_Projects_46),\"\",dms_E3_Projects_46)","v":""},0,0,0,0,0]
[null,{"$f":"IF(ISBLANK(dms_E3_Projects_47),\"\",dms_E3_Projects_47)","v":""},0,0,0,0,0]
[null,{"$f":"IF(ISBLANK(dms_E3_Projects_48),\"\",dms_E3_Projects_48)","v":""},0,0,0,0,0]
[null,{"$f":"IF(ISBLANK(dms_E3_Projects_49),\"\",dms_E3_Projects_49)","v":""},0,0,0,0,0]
[null,{"$f":"IF(ISBLANK(dms_E3_Projects_50),\"\",dms_E3_Projects_50)","v":""},0,0,0,0,0]
[null,"Aggregate of other projects with total expenditure of less than $500,000",0,0,0,0,0]
[null,"Total",{"$f":"SUM(C179:C229)","v":0},{"$f":"SUM(D179:D229)","v":0},{"$f":"SUM(E179:E229)","v":0},{"$f":"SUM(F179:F229)","v":0},{"$f":"SUM(G179:G229)","v":0}]
[]
[null,"D. TOTAL OVERHEAD EXPENDITURE"]
[null,null,"EXPENDITURE"]
[null,null,"$0's"]
[null,null,{"$f":"dms_y1","v":"2014-15"},{"$f":"dms_y2","v":"2015-16"},{"$f":"dms_y3","v":"2016-17"},{"$f":"dms_y4","v":"2017-18"},{"$f":"dms_y5","v":"2018-19"}]
[null,{"$f":"IF(ISBLANK(dms_E3_Projects_01),\"\",dms_E3_Projects_01)","v":"3015 MAJOR PROJECTS - MURRAY BRIDGE"},0,0,0,180180.1164105591,106576.55230725736]
[null,{"$f":"IF(ISBLANK(dms_E3_Projects_02),\"\",dms_E3_Projects_02)","v":""},0,0,0,0,0]
[null,{"$f":"IF(ISBLANK(dms_E3_Projects_03),\"\",dms_E3_Projects_03)","v":"3065 MAJOR PROJECTS - ADELAIDE CBD HP MAINS EXT EAST"},0,0,0,4857.4414120785405,194377.28512644811]
[null,{"$f":"IF(ISBLANK(dms_E3_Projects_04),\"\",dms_E3_Projects_04)","v":"3038 MAJOR PROJECTS - SEAFORD STAGE 2"},0,527659.92672405427,80216.477951501045,75968.186329403106,5414.9005975258897]
[null,{"$f":"IF(ISBLANK(dms_E3_Projects_05),\"\",dms_E3_Projects_05)","v":""},0,0,0,0,0]
[null,{"$f":"IF(ISBLANK(dms_E3_Projects_06),\"\",dms_E3_Projects_06)","v":"AUGMENTATION PROJECTS <$500K"},-46511.429413790902,12981.949664106218,564.70377464980675,44233.45747819441,37971.448518630175]
[null,{"$f":"IF(ISBLANK(dms_E3_Projects_07),\"\",dms_E3_Projects_07)","v":""},0,0,0,0,0]
[null,{"$f":"IF(ISBLANK(dms_E3_Projects_08),\"\",dms_E3_Projects_08)","v":""},0,0,0,0,0]
[null,{"$f":"IF(ISBLANK(dms_E3_Projects_09),\"\",dms_E3_Projects_09)","v":""},0,0,0,0,0]
[null,{"$f":"IF(ISBLANK(dms_E3_Projects_10),\"\",dms_E3_Projects_10)","v":""},0,0,0,0,0]
[null,{"$f":"IF(ISBLANK(dms_E3_Projects_11),\"\",dms_E3_Projects_11)","v":""},0,0,0,0,0]
[null,{"$f":"IF(ISBLANK(dms_E3_Projects_12),\"\",dms_E3_Projects_12)","v":""},0,0,0,0,0]
[null,{"$f":"IF(ISBLANK(dms_E3_Projects_13),\"\",dms_E3_Projects_13)","v":""},0,0,0,0,0]
[null,{"$f":"IF(ISBLANK(dms_E3_Projects_14),\"\",dms_E3_Projects_14)","v":""},0,0,0,0,0]
[null,{"$f":"IF(ISBLANK(dms_E3_Projects_15),\"\",dms_E3_Projects_15)","v":""},0,0,0,0,0]
[null,{"$f":"IF(ISBLANK(dms_E3_Projects_16),\"\",dms_E3_Projects_16)","v":""},0,0,0,0,0]
[null,{"$f":"IF(ISBLANK(dms_E3_Projects_17),\"\",dms_E3_Projects_17)","v":""},0,0,0,0,0]
[null,{"$f":"IF(ISBLANK(dms_E3_Projects_18),\"\",dms_E3_Projects_18)","v":""},0,0,0,0,0]
[null,{"$f":"IF(ISBLANK(dms_E3_Projects_18),\"\",dms_E3_Projects_18)","v":""},0,0,0,0,0]
[null,{"$f":"IF(ISBLANK(dms_E3_Projects_19),\"\",dms_E3_Projects_19)","v":""},0,0,0,0,0]
[null,{"$f":"IF(ISBLANK(dms_E3_Projects_20),\"\",dms_E3_Projects_20)","v":""},0,0,0,0,0]
[null,{"$f":"IF(ISBLANK(dms_E3_Projects_21),\"\",dms_E3_Projects_21)","v":""},0,0,0,0,0]
[null,{"$f":"IF(ISBLANK(dms_E3_Projects_22),\"\",dms_E3_Projects_22)","v":""},0,0,0,0,0]
[null,{"$f":"IF(ISBLANK(dms_E3_Projects_23),\"\",dms_E3_Projects_23)","v":""},0,0,0,0,0]
[null,{"$f":"IF(ISBLANK(dms_E3_Projects_24),\"\",dms_E3_Projects_24)","v":""},0,0,0,0,0]
[null,{"$f":"IF(ISBLANK(dms_E3_Projects_25),\"\",dms_E3_Projects_26)","v":""},0,0,0,0,0]
[null,{"$f":"IF(ISBLANK(dms_E3_Projects_27),\"\",dms_E3_Projects_27)","v":""},0,0,0,0,0]
[null,{"$f":"IF(ISBLANK(dms_E3_Projects_28),\"\",dms_E3_Projects_28)","v":""},0,0,0,0,0]
[null,{"$f":"IF(ISBLANK(dms_E3_Projects_29),\"\",dms_E3_Projects_29)","v":""},0,0,0,0,0]
[null,{"$f":"IF(ISBLANK(dms_E3_Projects_30),\"\",dms_E3_Projects_30)","v":""},0,0,0,0,0]
[null,{"$f":"IF(ISBLANK(dms_E3_Projects_31),\"\",dms_E3_Projects_31)","v":""},0,0,0,0,0]
[null,{"$f":"IF(ISBLANK(dms_E3_Projects_32),\"\",dms_E3_Projects_32)","v":""},0,0,0,0,0]
[null,{"$f":"IF(ISBLANK(dms_E3_Projects_33),\"\",dms_E3_Projects_33)","v":""},0,0,0,0,0]
[null,{"$f":"IF(ISBLANK(dms_E3_Projects_34),\"\",dms_E3_Projects_34)","v":""},0,0,0,0,0]
[null,{"$f":"IF(ISBLANK(dms_E3_Projects_35),\"\",dms_E3_Projects_35)","v":""},0,0,0,0,0]
[null,{"$f":"IF(ISBLANK(dms_E3_Projects_36),\"\",dms_E3_Projects_36)","v":""},0,0,0,0,0]
[null,{"$f":"IF(ISBLANK(dms_E3_Projects_37),\"\",dms_E3_Projects_37)","v":""},0,0,0,0,0]
[null,{"$f":"IF(ISBLANK(dms_E3_Projects_38),\"\",dms_E3_Projects_38)","v":""},0,0,0,0,0]
[null,{"$f":"IF(ISBLANK(dms_E3_Projects_39),\"\",dms_E3_Projects_39)","v":""},0,0,0,0,0]
[null,{"$f":"IF(ISBLANK(dms_E3_Projects_40),\"\",dms_E3_Projects_40)","v":""},0,0,0,0,0]
[null,{"$f":"IF(ISBLANK(dms_E3_Projects_41),\"\",dms_E3_Projects_41)","v":""},0,0,0,0,0]
[null,{"$f":"IF(ISBLANK(dms_E3_Projects_42),\"\",dms_E3_Projects_42)","v":""},0,0,0,0,0]
[null,{"$f":"IF(ISBLANK(dms_E3_Projects_43),\"\",dms_E3_Projects_43)","v":""},0,0,0,0,0]
[null,{"$f":"IF(ISBLANK(dms_E3_Projects_44),\"\",dms_E3_Projects_44)","v":""},0,0,0,0,0]
[null,{"$f":"IF(ISBLANK(dms_E3_Projects_45),\"\",dms_E3_Projects_45)","v":""},0,0,0,0,0]
[null,{"$f":"IF(ISBLANK(dms_E3_Projects_46),\"\",dms_E3_Projects_46)","v":""},0,0,0,0,0]
[null,{"$f":"IF(ISBLANK(dms_E3_Projects_47),\"\",dms_E3_Projects_47)","v":""},0,0,0,0,0]
[null,{"$f":"IF(ISBLANK(dms_E3_Projects_48),\"\",dms_E3_Projects_48)","v":""},0,0,0,0,0]
[null,{"$f":"IF(ISBLANK(dms_E3_Projects_49),\"\",dms_E3_Projects_49)","v":""},0,0,0,0,0]
[null,{"$f":"IF(ISBLANK(dms_E3_Projects_50),\"\",dms_E3_Projects_50)","v":""},0,0,0,0,0]
[null,"Aggregate of other projects with total expenditure of less than $500,000",0,0,0,0,0]
[null,"Total",{"$f":"SUM(C236:C286)","v":-46511.429413790902},{"$f":"SUM(D236:D286)","v":540641.87638816051},{"$f":"SUM(E236:E286)","v":80781.181726150855},{"$f":"SUM(F236:F286)","v":305239.20163023518},{"$f":"SUM(G236:G286)","v":344340.18654986151}]
[]
[null,"E. RELATED PARTY MARGIN EXPENDITURE"]
[null,null,"EXPENDITURE"]
[null,null,"$0's"]
[null,null,{"$f":"dms_y1","v":"2014-15"},{"$f":"dms_y2","v":"2015-16"},{"$f":"dms_y3","v":"2016-17"},{"$f":"dms_y4","v":"2017-18"},{"$f":"dms_y5","v":"2018-19"}]
[null,{"$f":"IF(ISBLANK(dms_E3_Projects_01),\"\",dms_E3_Projects_01)","v":"3015 MAJOR PROJECTS - MURRAY BRIDGE"},0,0,0,0,0]
[null,{"$f":"IF(ISBLANK(dms_E3_Projects_02),\"\",dms_E3_Projects_02)","v":""},0,0,0,0,0]
[null,{"$f":"IF(ISBLANK(dms_E3_Projects_03),\"\",dms_E3_Projects_03)","v":"3065 MAJOR PROJECTS - ADELAIDE CBD HP MAINS EXT EAST"},0,0,0,0,0]
[null,{"$f":"IF(ISBLANK(dms_E3_Projects_04),\"\",dms_E3_Projects_04)","v":"3038 MAJOR PROJECTS - SEAFORD STAGE 2"},0,0,0,0,0]
[null,{"$f":"IF(ISBLANK(dms_E3_Projects_05),\"\",dms_E3_Projects_05)","v":""},0,0,0,0,0]
[null,{"$f":"IF(ISBLANK(dms_E3_Projects_06),\"\",dms_E3_Projects_06)","v":"AUGMENTATION PROJECTS <$500K"},0,0,0,0,0]
[null,{"$f":"IF(ISBLANK(dms_E3_Projects_07),\"\",dms_E3_Projects_07)","v":""},0,0,0,0,0]
[null,{"$f":"IF(ISBLANK(dms_E3_Projects_08),\"\",dms_E3_Projects_08)","v":""},0,0,0,0,0]
[null,{"$f":"IF(ISBLANK(dms_E3_Projects_09),\"\",dms_E3_Projects_09)","v":""},0,0,0,0,0]
[null,{"$f":"IF(ISBLANK(dms_E3_Projects_10),\"\",dms_E3_Projects_10)","v":""},0,0,0,0,0]
[null,{"$f":"IF(ISBLANK(dms_E3_Projects_11),\"\",dms_E3_Projects_11)","v":""},0,0,0,0,0]
[null,{"$f":"IF(ISBLANK(dms_E3_Projects_12),\"\",dms_E3_Projects_12)","v":""},0,0,0,0,0]
[null,{"$f":"IF(ISBLANK(dms_E3_Projects_13),\"\",dms_E3_Projects_13)","v":""},0,0,0,0,0]
[null,{"$f":"IF(ISBLANK(dms_E3_Projects_14),\"\",dms_E3_Projects_14)","v":""},0,0,0,0,0]
[null,{"$f":"IF(ISBLANK(dms_E3_Projects_15),\"\",dms_E3_Projects_15)","v":""},0,0,0,0,0]
[null,{"$f":"IF(ISBLANK(dms_E3_Projects_16),\"\",dms_E3_Projects_16)","v":""},0,0,0,0,0]
[null,{"$f":"IF(ISBLANK(dms_E3_Projects_17),\"\",dms_E3_Projects_17)","v":""},0,0,0,0,0]
[null,{"$f":"IF(ISBLANK(dms_E3_Projects_18),\"\",dms_E3_Projects_18)","v":""},0,0,0,0,0]
[null,{"$f":"IF(ISBLANK(dms_E3_Projects_18),\"\",dms_E3_Projects_18)","v":""},0,0,0,0,0]
[null,{"$f":"IF(ISBLANK(dms_E3_Projects_19),\"\",dms_E3_Projects_19)","v":""},0,0,0,0,0]
[null,{"$f":"IF(ISBLANK(dms_E3_Projects_20),\"\",dms_E3_Projects_20)","v":""},0,0,0,0,0]
[null,{"$f":"IF(ISBLANK(dms_E3_Projects_21),\"\",dms_E3_Projects_21)","v":""},0,0,0,0,0]
[null,{"$f":"IF(ISBLANK(dms_E3_Projects_22),\"\",dms_E3_Projects_22)","v":""},0,0,0,0,0]
[null,{"$f":"IF(ISBLANK(dms_E3_Projects_23),\"\",dms_E3_Projects_23)","v":""},0,0,0,0,0]
[null,{"$f":"IF(ISBLANK(dms_E3_Projects_24),\"\",dms_E3_Projects_24)","v":""},0,0,0,0,0]
[null,{"$f":"IF(ISBLANK(dms_E3_Projects_25),\"\",dms_E3_Projects_26)","v":""},0,0,0,0,0]
[null,{"$f":"IF(ISBLANK(dms_E3_Projects_27),\"\",dms_E3_Projects_27)","v":""},0,0,0,0,0]
[null,{"$f":"IF(ISBLANK(dms_E3_Projects_28),\"\",dms_E3_Projects_28)","v":""},0,0,0,0,0]
[null,{"$f":"IF(ISBLANK(dms_E3_Projects_29),\"\",dms_E3_Projects_29)","v":""},0,0,0,0,0]
[null,{"$f":"IF(ISBLANK(dms_E3_Projects_30),\"\",dms_E3_Projects_30)","v":""},0,0,0,0,0]
[null,{"$f":"IF(ISBLANK(dms_E3_Projects_31),\"\",dms_E3_Projects_31)","v":""},0,0,0,0,0]
[null,{"$f":"IF(ISBLANK(dms_E3_Projects_32),\"\",dms_E3_Projects_32)","v":""},0,0,0,0,0]
[null,{"$f":"IF(ISBLANK(dms_E3_Projects_33),\"\",dms_E3_Projects_33)","v":""},0,0,0,0,0]
[null,{"$f":"IF(ISBLANK(dms_E3_Projects_34),\"\",dms_E3_Projects_34)","v":""},0,0,0,0,0]
[null,{"$f":"IF(ISBLANK(dms_E3_Projects_35),\"\",dms_E3_Projects_35)","v":""},0,0,0,0,0]
[null,{"$f":"IF(ISBLANK(dms_E3_Projects_36),\"\",dms_E3_Projects_36)","v":""},0,0,0,0,0]
[null,{"$f":"IF(ISBLANK(dms_E3_Projects_37),\"\",dms_E3_Projects_37)","v":""},0,0,0,0,0]
[null,{"$f":"IF(ISBLANK(dms_E3_Projects_38),\"\",dms_E3_Projects_38)","v":""},0,0,0,0,0]
[null,{"$f":"IF(ISBLANK(dms_E3_Projects_39),\"\",dms_E3_Projects_39)","v":""},0,0,0,0,0]
[null,{"$f":"IF(ISBLANK(dms_E3_Projects_40),\"\",dms_E3_Projects_40)","v":""},0,0,0,0,0]
[null,{"$f":"IF(ISBLANK(dms_E3_Projects_41),\"\",dms_E3_Projects_41)","v":""},0,0,0,0,0]
[null,{"$f":"IF(ISBLANK(dms_E3_Projects_42),\"\",dms_E3_Projects_42)","v":""},0,0,0,0,0]
[null,{"$f":"IF(ISBLANK(dms_E3_Projects_43),\"\",dms_E3_Projects_43)","v":""},0,0,0,0,0]
[null,{"$f":"IF(ISBLANK(dms_E3_Projects_44),\"\",dms_E3_Projects_44)","v":""},0,0,0,0,0]
[null,{"$f":"IF(ISBLANK(dms_E3_Projects_45),\"\",dms_E3_Projects_45)","v":""},0,0,0,0,0]
[null,{"$f":"IF(ISBLANK(dms_E3_Projects_46),\"\",dms_E3_Projects_46)","v":""},0,0,0,0,0]
[null,{"$f":"IF(ISBLANK(dms_E3_Projects_47),\"\",dms_E3_Projects_47)","v":""},0,0,0,0,0]
[null,{"$f":"IF(ISBLANK(dms_E3_Projects_48),\"\",dms_E3_Projects_48)","v":""},0,0,0,0,0]
[null,{"$f":"IF(ISBLANK(dms_E3_Projects_49),\"\",dms_E3_Projects_49)","v":""},0,0,0,0,0]
[null,{"$f":"IF(ISBLANK(dms_E3_Projects_50),\"\",dms_E3_Projects_50)","v":""},0,0,0,0,0]
[null,"Aggregate of other projects with total expenditure of less than $500,000",0,0,0,0,0]
[null,"Total",{"$f":"SUM(C293:C343)","v":0},{"$f":"SUM(D293:D343)","v":0},{"$f":"SUM(E293:E343)","v":0},{"$f":"SUM(F293:F343)","v":0},{"$f":"SUM(G293:G343)","v":0}]
[]
[null,"F. CAPITAL CONTRIBUTIONS included in the above"]
[null,null,"EXPENDITURE"]
[null,null,"$0's"]
[null,null,{"$f":"dms_y1","v":"2014-15"},{"$f":"dms_y2","v":"2015-16"},{"$f":"dms_y3","v":"2016-17"},{"$f":"dms_y4","v":"2017-18"},{"$f":"dms_y5","v":"2018-19"}]
[null,{"$f":"IF(ISBLANK(dms_E3_Projects_01),\"\",dms_E3_Projects_01)","v":"3015 MAJOR PROJECTS - MURRAY BRIDGE"},0,0,0,0,0]
[null,{"$f":"IF(ISBLANK(dms_E3_Projects_02),\"\",dms_E3_Projects_02)","v":""},0,0,0,0,0]
[null,{"$f":"IF(ISBLANK(dms_E3_Projects_03),\"\",dms_E3_Projects_03)","v":"3065 MAJOR PROJECTS - ADELAIDE CBD HP MAINS EXT EAST"},0,0,0,0,0]
[null,{"$f":"IF(ISBLANK(dms_E3_Projects_04),\"\",dms_E3_Projects_04)","v":"3038 MAJOR PROJECTS - SEAFORD STAGE 2"},0,0,0,0,0]
[null,{"$f":"IF(ISBLANK(dms_E3_Projects_05),\"\",dms_E3_Projects_05)","v":""},0,0,0,0,0]
[null,{"$f":"IF(ISBLANK(dms_E3_Projects_06),\"\",dms_E3_Projects_06)","v":"AUGMENTATION PROJECTS <$500K"},0,0,0,0,0]
[null,{"$f":"IF(ISBLANK(dms_E3_Projects_07),\"\",dms_E3_Projects_07)","v":""},0,0,0,0,0]
[null,{"$f":"IF(ISBLANK(dms_E3_Projects_08),\"\",dms_E3_Projects_08)","v":""},0,0,0,0,0]
[null,{"$f":"IF(ISBLANK(dms_E3_Projects_09),\"\",dms_E3_Projects_09)","v":""},0,0,0,0,0]
[null,{"$f":"IF(ISBLANK(dms_E3_Projects_10),\"\",dms_E3_Projects_10)","v":""},0,0,0,0,0]
[null,{"$f":"IF(ISBLANK(dms_E3_Projects_11),\"\",dms_E3_Projects_11)","v":""},0,0,0,0,0]
[null,{"$f":"IF(ISBLANK(dms_E3_Projects_12),\"\",dms_E3_Projects_12)","v":""},0,0,0,0,0]
[null,{"$f":"IF(ISBLANK(dms_E3_Projects_13),\"\",dms_E3_Projects_13)","v":""},0,0,0,0,0]
[null,{"$f":"IF(ISBLANK(dms_E3_Projects_14),\"\",dms_E3_Projects_14)","v":""},0,0,0,0,0]
[null,{"$f":"IF(ISBLANK(dms_E3_Projects_15),\"\",dms_E3_Projects_15)","v":""},0,0,0,0,0]
[null,{"$f":"IF(ISBLANK(dms_E3_Projects_16),\"\",dms_E3_Projects_16)","v":""},0,0,0,0,0]
[null,{"$f":"IF(ISBLANK(dms_E3_Projects_17),\"\",dms_E3_Projects_17)","v":""},0,0,0,0,0]
[null,{"$f":"IF(ISBLANK(dms_E3_Projects_18),\"\",dms_E3_Projects_18)","v":""},0,0,0,0,0]
[null,{"$f":"IF(ISBLANK(dms_E3_Projects_18),\"\",dms_E3_Projects_18)","v":""},0,0,0,0,0]
[null,{"$f":"IF(ISBLANK(dms_E3_Projects_19),\"\",dms_E3_Projects_19)","v":""},0,0,0,0,0]
[null,{"$f":"IF(ISBLANK(dms_E3_Projects_20),\"\",dms_E3_Projects_20)","v":""},0,0,0,0,0]
[null,{"$f":"IF(ISBLANK(dms_E3_Projects_21),\"\",dms_E3_Projects_21)","v":""},0,0,0,0,0]
[null,{"$f":"IF(ISBLANK(dms_E3_Projects_22),\"\",dms_E3_Projects_22)","v":""},0,0,0,0,0]
[null,{"$f":"IF(ISBLANK(dms_E3_Projects_23),\"\",dms_E3_Projects_23)","v":""},0,0,0,0,0]
[null,{"$f":"IF(ISBLANK(dms_E3_Projects_24),\"\",dms_E3_Projects_24)","v":""},0,0,0,0,0]
[null,{"$f":"IF(ISBLANK(dms_E3_Projects_25),\"\",dms_E3_Projects_26)","v":""},0,0,0,0,0]
[null,{"$f":"IF(ISBLANK(dms_E3_Projects_27),\"\",dms_E3_Projects_27)","v":""},0,0,0,0,0]
[null,{"$f":"IF(ISBLANK(dms_E3_Projects_28),\"\",dms_E3_Projects_28)","v":""},0,0,0,0,0]
[null,{"$f":"IF(ISBLANK(dms_E3_Projects_29),\"\",dms_E3_Projects_29)","v":""},0,0,0,0,0]
[null,{"$f":"IF(ISBLANK(dms_E3_Projects_30),\"\",dms_E3_Projects_30)","v":""},0,0,0,0,0]
[null,{"$f":"IF(ISBLANK(dms_E3_Projects_31),\"\",dms_E3_Projects_31)","v":""},0,0,0,0,0]
[null,{"$f":"IF(ISBLANK(dms_E3_Projects_32),\"\",dms_E3_Projects_32)","v":""},0,0,0,0,0]
[null,{"$f":"IF(ISBLANK(dms_E3_Projects_33),\"\",dms_E3_Projects_33)","v":""},0,0,0,0,0]
[null,{"$f":"IF(ISBLANK(dms_E3_Projects_34),\"\",dms_E3_Projects_34)","v":""},0,0,0,0,0]
[null,{"$f":"IF(ISBLANK(dms_E3_Projects_35),\"\",dms_E3_Projects_35)","v":""},0,0,0,0,0]
[null,{"$f":"IF(ISBLANK(dms_E3_Projects_36),\"\",dms_E3_Projects_36)","v":""},0,0,0,0,0]
[null,{"$f":"IF(ISBLANK(dms_E3_Projects_37),\"\",dms_E3_Projects_37)","v":""},0,0,0,0,0]
[null,{"$f":"IF(ISBLANK(dms_E3_Projects_38),\"\",dms_E3_Projects_38)","v":""},0,0,0,0,0]
[null,{"$f":"IF(ISBLANK(dms_E3_Projects_39),\"\",dms_E3_Projects_39)","v":""},0,0,0,0,0]
[null,{"$f":"IF(ISBLANK(dms_E3_Projects_40),\"\",dms_E3_Projects_40)","v":""},0,0,0,0,0]
[null,{"$f":"IF(ISBLANK(dms_E3_Projects_41),\"\",dms_E3_Projects_41)","v":""},0,0,0,0,0]
[null,{"$f":"IF(ISBLANK(dms_E3_Projects_42),\"\",dms_E3_Projects_42)","v":""},0,0,0,0,0]
[null,{"$f":"IF(ISBLANK(dms_E3_Projects_43),\"\",dms_E3_Projects_43)","v":""},0,0,0,0,0]
[null,{"$f":"IF(ISBLANK(dms_E3_Projects_44),\"\",dms_E3_Projects_44)","v":""},0,0,0,0,0]
[null,{"$f":"IF(ISBLANK(dms_E3_Projects_45),\"\",dms_E3_Projects_45)","v":""},0,0,0,0,0]
[null,{"$f":"IF(ISBLANK(dms_E3_Projects_46),\"\",dms_E3_Projects_46)","v":""},0,0,0,0,0]
[null,{"$f":"IF(ISBLANK(dms_E3_Projects_47),\"\",dms_E3_Projects_47)","v":""},0,0,0,0,0]
[null,{"$f":"IF(ISBLANK(dms_E3_Projects_48),\"\",dms_E3_Projects_48)","v":""},0,0,0,0,0]
[null,{"$f":"IF(ISBLANK(dms_E3_Projects_49),\"\",dms_E3_Projects_49)","v":""},0,0,0,0,0]
[null,{"$f":"IF(ISBLANK(dms_E3_Projects_50),\"\",dms_E3_Projects_50)","v":""},0,0,0,0,0]
[null,"Aggregate of other projects with total expenditure of less than $500,000",0,0,0,0,0]
[null,"Total",{"$f":"SUM(C350:C400)","v":0},{"$f":"SUM(D350:D400)","v":0},{"$f":"SUM(E350:E400)","v":0},{"$f":"SUM(F350:F400)","v":0},{"$f":"SUM(G350:G400)","v":0}]
[]
[]
[]
[null,"E3.2 - VOLUMES - BY PRESSURE TYPE - BY PROJECT"]
[null,"A. LOW PRESSURE TO LOW PRESSURE"]
[null,null,"LENGTH"]
[null,null,"0s, metres"]
[null,null,{"$f":"dms_y1","v":"2014-15"},{"$f":"dms_y2","v":"2015-16"},{"$f":"dms_y3","v":"2016-17"},{"$f":"dms_y4","v":"2017-18"},{"$f":"dms_y5","v":"2018-19"}]
[null,{"$f":"IF(ISBLANK(dms_E3_Projects_01),\"\",dms_E3_Projects_01)","v":"3015 MAJOR PROJECTS - MURRAY BRIDGE"},0,0,0,0,0]
[null,{"$f":"IF(ISBLANK(dms_E3_Projects_02),\"\",dms_E3_Projects_02)","v":""},0,0,0,0,0]
[null,{"$f":"IF(ISBLANK(dms_E3_Projects_03),\"\",dms_E3_Projects_03)","v":"3065 MAJOR PROJECTS - ADELAIDE CBD HP MAINS EXT EAST"},0,0,0,0,0]
[null,{"$f":"IF(ISBLANK(dms_E3_Projects_04),\"\",dms_E3_Projects_04)","v":"3038 MAJOR PROJECTS - SEAFORD STAGE 2"},0,0,0,0,0]
[null,{"$f":"IF(ISBLANK(dms_E3_Projects_05),\"\",dms_E3_Projects_05)","v":""},0,0,0,0,0]
[null,{"$f":"IF(ISBLANK(dms_E3_Projects_06),\"\",dms_E3_Projects_06)","v":"AUGMENTATION PROJECTS <$500K"},0,0,0,0,0]
[null,{"$f":"IF(ISBLANK(dms_E3_Projects_07),\"\",dms_E3_Projects_07)","v":""},0,0,0,0,0]
[null,{"$f":"IF(ISBLANK(dms_E3_Projects_08),\"\",dms_E3_Projects_08)","v":""},0,0,0,0,0]
[null,{"$f":"IF(ISBLANK(dms_E3_Projects_09),\"\",dms_E3_Projects_09)","v":""},0,0,0,0,0]
[null,{"$f":"IF(ISBLANK(dms_E3_Projects_10),\"\",dms_E3_Projects_10)","v":""},0,0,0,0,0]
[null,{"$f":"IF(ISBLANK(dms_E3_Projects_11),\"\",dms_E3_Projects_11)","v":""},0,0,0,0,0]
[null,{"$f":"IF(ISBLANK(dms_E3_Projects_12),\"\",dms_E3_Projects_12)","v":""},0,0,0,0,0]
[null,{"$f":"IF(ISBLANK(dms_E3_Projects_13),\"\",dms_E3_Projects_13)","v":""},0,0,0,0,0]
[null,{"$f":"IF(ISBLANK(dms_E3_Projects_14),\"\",dms_E3_Projects_14)","v":""},0,0,0,0,0]
[null,{"$f":"IF(ISBLANK(dms_E3_Projects_15),\"\",dms_E3_Projects_15)","v":""},0,0,0,0,0]
[null,{"$f":"IF(ISBLANK(dms_E3_Projects_16),\"\",dms_E3_Projects_16)","v":""},0,0,0,0,0]
[null,{"$f":"IF(ISBLANK(dms_E3_Projects_17),\"\",dms_E3_Projects_17)","v":""},0,0,0,0,0]
[null,{"$f":"IF(ISBLANK(dms_E3_Projects_18),\"\",dms_E3_Projects_18)","v":""},0,0,0,0,0]
[null,{"$f":"IF(ISBLANK(dms_E3_Projects_18),\"\",dms_E3_Projects_18)","v":""},0,0,0,0,0]
[null,{"$f":"IF(ISBLANK(dms_E3_Projects_19),\"\",dms_E3_Projects_19)","v":""},0,0,0,0,0]
[null,{"$f":"IF(ISBLANK(dms_E3_Projects_20),\"\",dms_E3_Projects_20)","v":""},0,0,0,0,0]
[null,{"$f":"IF(ISBLANK(dms_E3_Projects_21),\"\",dms_E3_Projects_21)","v":""},0,0,0,0,0]
[null,{"$f":"IF(ISBLANK(dms_E3_Projects_22),\"\",dms_E3_Projects_22)","v":""},0,0,0,0,0]
[null,{"$f":"IF(ISBLANK(dms_E3_Projects_23),\"\",dms_E3_Projects_23)","v":""},0,0,0,0,0]
[null,{"$f":"IF(ISBLANK(dms_E3_Projects_24),\"\",dms_E3_Projects_24)","v":""},0,0,0,0,0]
[null,{"$f":"IF(ISBLANK(dms_E3_Projects_25),\"\",dms_E3_Projects_26)","v":""},0,0,0,0,0]
[null,{"$f":"IF(ISBLANK(dms_E3_Projects_27),\"\",dms_E3_Projects_27)","v":""},0,0,0,0,0]
[null,{"$f":"IF(ISBLANK(dms_E3_Projects_28),\"\",dms_E3_Projects_28)","v":""},0,0,0,0,0]
[null,{"$f":"IF(ISBLANK(dms_E3_Projects_29),\"\",dms_E3_Projects_29)","v":""},0,0,0,0,0]
[null,{"$f":"IF(ISBLANK(dms_E3_Projects_30),\"\",dms_E3_Projects_30)","v":""},0,0,0,0,0]
[null,{"$f":"IF(ISBLANK(dms_E3_Projects_31),\"\",dms_E3_Projects_31)","v":""},0,0,0,0,0]
[null,{"$f":"IF(ISBLANK(dms_E3_Projects_32),\"\",dms_E3_Projects_32)","v":""},0,0,0,0,0]
[null,{"$f":"IF(ISBLANK(dms_E3_Projects_33),\"\",dms_E3_Projects_33)","v":""},0,0,0,0,0]
[null,{"$f":"IF(ISBLANK(dms_E3_Projects_34),\"\",dms_E3_Projects_34)","v":""},0,0,0,0,0]
[null,{"$f":"IF(ISBLANK(dms_E3_Projects_35),\"\",dms_E3_Projects_35)","v":""},0,0,0,0,0]
[null,{"$f":"IF(ISBLANK(dms_E3_Projects_36),\"\",dms_E3_Projects_36)","v":""},0,0,0,0,0]
[null,{"$f":"IF(ISBLANK(dms_E3_Projects_37),\"\",dms_E3_Projects_37)","v":""},0,0,0,0,0]
[null,{"$f":"IF(ISBLANK(dms_E3_Projects_38),\"\",dms_E3_Projects_38)","v":""},0,0,0,0,0]
[null,{"$f":"IF(ISBLANK(dms_E3_Projects_39),\"\",dms_E3_Projects_39)","v":""},0,0,0,0,0]
[null,{"$f":"IF(ISBLANK(dms_E3_Projects_40),\"\",dms_E3_Projects_40)","v":""},0,0,0,0,0]
[null,{"$f":"IF(ISBLANK(dms_E3_Projects_41),\"\",dms_E3_Projects_41)","v":""},0,0,0,0,0]
[null,{"$f":"IF(ISBLANK(dms_E3_Projects_42),\"\",dms_E3_Projects_42)","v":""},0,0,0,0,0]
[null,{"$f":"IF(ISBLANK(dms_E3_Projects_43),\"\",dms_E3_Projects_43)","v":""},0,0,0,0,0]
[null,{"$f":"IF(ISBLANK(dms_E3_Projects_44),\"\",dms_E3_Projects_44)","v":""},0,0,0,0,0]
[null,{"$f":"IF(ISBLANK(dms_E3_Projects_45),\"\",dms_E3_Projects_45)","v":""},0,0,0,0,0]
[null,{"$f":"IF(ISBLANK(dms_E3_Projects_46),\"\",dms_E3_Projects_46)","v":""},0,0,0,0,0]
[null,{"$f":"IF(ISBLANK(dms_E3_Projects_47),\"\",dms_E3_Projects_47)","v":""},0,0,0,0,0]
[null,{"$f":"IF(ISBLANK(dms_E3_Projects_48),\"\",dms_E3_Projects_48)","v":""},0,0,0,0,0]
[null,{"$f":"IF(ISBLANK(dms_E3_Projects_49),\"\",dms_E3_Projects_49)","v":""},0,0,0,0,0]
[null,{"$f":"IF(ISBLANK(dms_E3_Projects_50),\"\",dms_E3_Projects_50)","v":""},0,0,0,0,0]
[null,"Aggregate of other projects with total expenditure of less than $500,000",0,0,0,0,0]
[null,"Total",{"$f":"SUM(C410:C460)","v":0},{"$f":"SUM(D410:D460)","v":0},{"$f":"SUM(E410:E460)","v":0},{"$f":"SUM(F410:F460)","v":0},{"$f":"SUM(G410:G460)","v":0}]
[]
[null,"B. LOW PRESSURE TO MEDIUM PRESSURE"]
[null,null,"LENGTH"]
[null,null,"0s, metres"]
[null,null,{"$f":"dms_y1","v":"2014-15"},{"$f":"dms_y2","v":"2015-16"},{"$f":"dms_y3","v":"2016-17"},{"$f":"dms_y4","v":"2017-18"},{"$f":"dms_y5","v":"2018-19"}]
[null,{"$f":"IF(ISBLANK(dms_E3_Projects_01),\"\",dms_E3_Projects_01)","v":"3015 MAJOR PROJECTS - MURRAY BRIDGE"},0,0,0,0,0]
[null,{"$f":"IF(ISBLANK(dms_E3_Projects_02),\"\",dms_E3_Projects_02)","v":""},0,0,0,0,0]
[null,{"$f":"IF(ISBLANK(dms_E3_Projects_03),\"\",dms_E3_Projects_03)","v":"3065 MAJOR PROJECTS - ADELAIDE CBD HP MAINS EXT EAST"},0,0,0,0,0]
[null,{"$f":"IF(ISBLANK(dms_E3_Projects_04),\"\",dms_E3_Projects_04)","v":"3038 MAJOR PROJECTS - SEAFORD STAGE 2"},0,0,0,0,0]
[null,{"$f":"IF(ISBLANK(dms_E3_Projects_05),\"\",dms_E3_Projects_05)","v":""},0,0,0,0,0]
[null,{"$f":"IF(ISBLANK(dms_E3_Projects_06),\"\",dms_E3_Projects_06)","v":"AUGMENTATION PROJECTS <$500K"},0,0,0,0,0]
[null,{"$f":"IF(ISBLANK(dms_E3_Projects_07),\"\",dms_E3_Projects_07)","v":""},0,0,0,0,0]
[null,{"$f":"IF(ISBLANK(dms_E3_Projects_08),\"\",dms_E3_Projects_08)","v":""},0,0,0,0,0]
[null,{"$f":"IF(ISBLANK(dms_E3_Projects_09),\"\",dms_E3_Projects_09)","v":""},0,0,0,0,0]
[null,{"$f":"IF(ISBLANK(dms_E3_Projects_10),\"\",dms_E3_Projects_10)","v":""},0,0,0,0,0]
[null,{"$f":"IF(ISBLANK(dms_E3_Projects_11),\"\",dms_E3_Projects_11)","v":""},0,0,0,0,0]
[null,{"$f":"IF(ISBLANK(dms_E3_Projects_12),\"\",dms_E3_Projects_12)","v":""},0,0,0,0,0]
[null,{"$f":"IF(ISBLANK(dms_E3_Projects_13),\"\",dms_E3_Projects_13)","v":""},0,0,0,0,0]
[null,{"$f":"IF(ISBLANK(dms_E3_Projects_14),\"\",dms_E3_Projects_14)","v":""},0,0,0,0,0]
[null,{"$f":"IF(ISBLANK(dms_E3_Projects_15),\"\",dms_E3_Projects_15)","v":""},0,0,0,0,0]
[null,{"$f":"IF(ISBLANK(dms_E3_Projects_16),\"\",dms_E3_Projects_16)","v":""},0,0,0,0,0]
[null,{"$f":"IF(ISBLANK(dms_E3_Projects_17),\"\",dms_E3_Projects_17)","v":""},0,0,0,0,0]
[null,{"$f":"IF(ISBLANK(dms_E3_Projects_18),\"\",dms_E3_Projects_18)","v":""},0,0,0,0,0]
[null,{"$f":"IF(ISBLANK(dms_E3_Projects_18),\"\",dms_E3_Projects_18)","v":""},0,0,0,0,0]
[null,{"$f":"IF(ISBLANK(dms_E3_Projects_19),\"\",dms_E3_Projects_19)","v":""},0,0,0,0,0]
[null,{"$f":"IF(ISBLANK(dms_E3_Projects_20),\"\",dms_E3_Projects_20)","v":""},0,0,0,0,0]
[null,{"$f":"IF(ISBLANK(dms_E3_Projects_21),\"\",dms_E3_Projects_21)","v":""},0,0,0,0,0]
[null,{"$f":"IF(ISBLANK(dms_E3_Projects_22),\"\",dms_E3_Projects_22)","v":""},0,0,0,0,0]
[null,{"$f":"IF(ISBLANK(dms_E3_Projects_23),\"\",dms_E3_Projects_23)","v":""},0,0,0,0,0]
[null,{"$f":"IF(ISBLANK(dms_E3_Projects_24),\"\",dms_E3_Projects_24)","v":""},0,0,0,0,0]
[null,{"$f":"IF(ISBLANK(dms_E3_Projects_25),\"\",dms_E3_Projects_26)","v":""},0,0,0,0,0]
[null,{"$f":"IF(ISBLANK(dms_E3_Projects_27),\"\",dms_E3_Projects_27)","v":""},0,0,0,0,0]
[null,{"$f":"IF(ISBLANK(dms_E3_Projects_28),\"\",dms_E3_Projects_28)","v":""},0,0,0,0,0]
[null,{"$f":"IF(ISBLANK(dms_E3_Projects_29),\"\",dms_E3_Projects_29)","v":""},0,0,0,0,0]
[null,{"$f":"IF(ISBLANK(dms_E3_Projects_30),\"\",dms_E3_Projects_30)","v":""},0,0,0,0,0]
[null,{"$f":"IF(ISBLANK(dms_E3_Projects_31),\"\",dms_E3_Projects_31)","v":""},0,0,0,0,0]
[null,{"$f":"IF(ISBLANK(dms_E3_Projects_32),\"\",dms_E3_Projects_32)","v":""},0,0,0,0,0]
[null,{"$f":"IF(ISBLANK(dms_E3_Projects_33),\"\",dms_E3_Projects_33)","v":""},0,0,0,0,0]
[null,{"$f":"IF(ISBLANK(dms_E3_Projects_34),\"\",dms_E3_Projects_34)","v":""},0,0,0,0,0]
[null,{"$f":"IF(ISBLANK(dms_E3_Projects_35),\"\",dms_E3_Projects_35)","v":""},0,0,0,0,0]
[null,{"$f":"IF(ISBLANK(dms_E3_Projects_36),\"\",dms_E3_Projects_36)","v":""},0,0,0,0,0]
[null,{"$f":"IF(ISBLANK(dms_E3_Projects_37),\"\",dms_E3_Projects_37)","v":""},0,0,0,0,0]
[null,{"$f":"IF(ISBLANK(dms_E3_Projects_38),\"\",dms_E3_Projects_38)","v":""},0,0,0,0,0]
[null,{"$f":"IF(ISBLANK(dms_E3_Projects_39),\"\",dms_E3_Projects_39)","v":""},0,0,0,0,0]
[null,{"$f":"IF(ISBLANK(dms_E3_Projects_40),\"\",dms_E3_Projects_40)","v":""},0,0,0,0,0]
[null,{"$f":"IF(ISBLANK(dms_E3_Projects_41),\"\",dms_E3_Projects_41)","v":""},0,0,0,0,0]
[null,{"$f":"IF(ISBLANK(dms_E3_Projects_42),\"\",dms_E3_Projects_42)","v":""},0,0,0,0,0]
[null,{"$f":"IF(ISBLANK(dms_E3_Projects_43),\"\",dms_E3_Projects_43)","v":""},0,0,0,0,0]
[null,{"$f":"IF(ISBLANK(dms_E3_Projects_44),\"\",dms_E3_Projects_44)","v":""},0,0,0,0,0]
[null,{"$f":"IF(ISBLANK(dms_E3_Projects_45),\"\",dms_E3_Projects_45)","v":""},0,0,0,0,0]
[null,{"$f":"IF(ISBLANK(dms_E3_Projects_46),\"\",dms_E3_Projects_46)","v":""},0,0,0,0,0]
[null,{"$f":"IF(ISBLANK(dms_E3_Projects_47),\"\",dms_E3_Projects_47)","v":""},0,0,0,0,0]
[null,{"$f":"IF(ISBLANK(dms_E3_Projects_48),\"\",dms_E3_Projects_48)","v":""},0,0,0,0,0]
[null,{"$f":"IF(ISBLANK(dms_E3_Projects_49),\"\",dms_E3_Projects_49)","v":""},0,0,0,0,0]
[null,{"$f":"IF(ISBLANK(dms_E3_Projects_50),\"\",dms_E3_Projects_50)","v":""},0,0,0,0,0]
[null,"Aggregate of other projects with total expenditure of less than $500,000",0,0,0,0,0]
[null,"Total",{"$f":"SUM(C467:C517)","v":0},{"$f":"SUM(D467:D517)","v":0},{"$f":"SUM(E467:E517)","v":0},{"$f":"SUM(F467:F517)","v":0},{"$f":"SUM(G467:G517)","v":0}]
[]
[null,"C. LOW PRESSURE TO HIGH PRESSURE"]
[null,null,"LENGTH"]
[null,null,"0s, metres"]
[null,null,{"$f":"dms_y1","v":"2014-15"},{"$f":"dms_y2","v":"2015-16"},{"$f":"dms_y3","v":"2016-17"},{"$f":"dms_y4","v":"2017-18"},{"$f":"dms_y5","v":"2018-19"}]
[null,{"$f":"IF(ISBLANK(dms_E3_Projects_01),\"\",dms_E3_Projects_01)","v":"3015 MAJOR PROJECTS - MURRAY BRIDGE"},0,0,0,0,0]
[null,{"$f":"IF(ISBLANK(dms_E3_Projects_02),\"\",dms_E3_Projects_02)","v":""},0,0,0,0,0]
[null,{"$f":"IF(ISBLANK(dms_E3_Projects_03),\"\",dms_E3_Projects_03)","v":"3065 MAJOR PROJECTS - ADELAIDE CBD HP MAINS EXT EAST"},0,0,0,0,0]
[null,{"$f":"IF(ISBLANK(dms_E3_Projects_04),\"\",dms_E3_Projects_04)","v":"3038 MAJOR PROJECTS - SEAFORD STAGE 2"},0,0,0,0,0]
[null,{"$f":"IF(ISBLANK(dms_E3_Projects_05),\"\",dms_E3_Projects_05)","v":""},0,0,0,0,0]
[null,{"$f":"IF(ISBLANK(dms_E3_Projects_06),\"\",dms_E3_Projects_06)","v":"AUGMENTATION PROJECTS <$500K"},0,0,0,0,0]
[null,{"$f":"IF(ISBLANK(dms_E3_Projects_07),\"\",dms_E3_Projects_07)","v":""},0,0,0,0,0]
[null,{"$f":"IF(ISBLANK(dms_E3_Projects_08),\"\",dms_E3_Projects_08)","v":""},0,0,0,0,0]
[null,{"$f":"IF(ISBLANK(dms_E3_Projects_09),\"\",dms_E3_Projects_09)","v":""},0,0,0,0,0]
[null,{"$f":"IF(ISBLANK(dms_E3_Projects_10),\"\",dms_E3_Projects_10)","v":""},0,0,0,0,0]
[null,{"$f":"IF(ISBLANK(dms_E3_Projects_11),\"\",dms_E3_Projects_11)","v":""},0,0,0,0,0]
[null,{"$f":"IF(ISBLANK(dms_E3_Projects_12),\"\",dms_E3_Projects_12)","v":""},0,0,0,0,0]
[null,{"$f":"IF(ISBLANK(dms_E3_Projects_13),\"\",dms_E3_Projects_13)","v":""},0,0,0,0,0]
[null,{"$f":"IF(ISBLANK(dms_E3_Projects_14),\"\",dms_E3_Projects_14)","v":""},0,0,0,0,0]
[null,{"$f":"IF(ISBLANK(dms_E3_Projects_15),\"\",dms_E3_Projects_15)","v":""},0,0,0,0,0]
[null,{"$f":"IF(ISBLANK(dms_E3_Projects_16),\"\",dms_E3_Projects_16)","v":""},0,0,0,0,0]
[null,{"$f":"IF(ISBLANK(dms_E3_Projects_17),\"\",dms_E3_Projects_17)","v":""},0,0,0,0,0]
[null,{"$f":"IF(ISBLANK(dms_E3_Projects_18),\"\",dms_E3_Projects_18)","v":""},0,0,0,0,0]
[null,{"$f":"IF(ISBLANK(dms_E3_Projects_18),\"\",dms_E3_Projects_18)","v":""},0,0,0,0,0]
[null,{"$f":"IF(ISBLANK(dms_E3_Projects_19),\"\",dms_E3_Projects_19)","v":""},0,0,0,0,0]
[null,{"$f":"IF(ISBLANK(dms_E3_Projects_20),\"\",dms_E3_Projects_20)","v":""},0,0,0,0,0]
[null,{"$f":"IF(ISBLANK(dms_E3_Projects_21),\"\",dms_E3_Projects_21)","v":""},0,0,0,0,0]
[null,{"$f":"IF(ISBLANK(dms_E3_Projects_22),\"\",dms_E3_Projects_22)","v":""},0,0,0,0,0]
[null,{"$f":"IF(ISBLANK(dms_E3_Projects_23),\"\",dms_E3_Projects_23)","v":""},0,0,0,0,0]
[null,{"$f":"IF(ISBLANK(dms_E3_Projects_24),\"\",dms_E3_Projects_24)","v":""},0,0,0,0,0]
[null,{"$f":"IF(ISBLANK(dms_E3_Projects_25),\"\",dms_E3_Projects_26)","v":""},0,0,0,0,0]
[null,{"$f":"IF(ISBLANK(dms_E3_Projects_27),\"\",dms_E3_Projects_27)","v":""},0,0,0,0,0]
[null,{"$f":"IF(ISBLANK(dms_E3_Projects_28),\"\",dms_E3_Projects_28)","v":""},0,0,0,0,0]
[null,{"$f":"IF(ISBLANK(dms_E3_Projects_29),\"\",dms_E3_Projects_29)","v":""},0,0,0,0,0]
[null,{"$f":"IF(ISBLANK(dms_E3_Projects_30),\"\",dms_E3_Projects_30)","v":""},0,0,0,0,0]
[null,{"$f":"IF(ISBLANK(dms_E3_Projects_31),\"\",dms_E3_Projects_31)","v":""},0,0,0,0,0]
[null,{"$f":"IF(ISBLANK(dms_E3_Projects_32),\"\",dms_E3_Projects_32)","v":""},0,0,0,0,0]
[null,{"$f":"IF(ISBLANK(dms_E3_Projects_33),\"\",dms_E3_Projects_33)","v":""},0,0,0,0,0]
[null,{"$f":"IF(ISBLANK(dms_E3_Projects_34),\"\",dms_E3_Projects_34)","v":""},0,0,0,0,0]
[null,{"$f":"IF(ISBLANK(dms_E3_Projects_35),\"\",dms_E3_Projects_35)","v":""},0,0,0,0,0]
[null,{"$f":"IF(ISBLANK(dms_E3_Projects_36),\"\",dms_E3_Projects_36)","v":""},0,0,0,0,0]
[null,{"$f":"IF(ISBLANK(dms_E3_Projects_37),\"\",dms_E3_Projects_37)","v":""},0,0,0,0,0]
[null,{"$f":"IF(ISBLANK(dms_E3_Projects_38),\"\",dms_E3_Projects_38)","v":""},0,0,0,0,0]
[null,{"$f":"IF(ISBLANK(dms_E3_Projects_39),\"\",dms_E3_Projects_39)","v":""},0,0,0,0,0]
[null,{"$f":"IF(ISBLANK(dms_E3_Projects_40),\"\",dms_E3_Projects_40)","v":""},0,0,0,0,0]
[null,{"$f":"IF(ISBLANK(dms_E3_Projects_41),\"\",dms_E3_Projects_41)","v":""},0,0,0,0,0]
[null,{"$f":"IF(ISBLANK(dms_E3_Projects_42),\"\",dms_E3_Projects_42)","v":""},0,0,0,0,0]
[null,{"$f":"IF(ISBLANK(dms_E3_Projects_43),\"\",dms_E3_Projects_43)","v":""},0,0,0,0,0]
[null,{"$f":"IF(ISBLANK(dms_E3_Projects_44),\"\",dms_E3_Projects_44)","v":""},0,0,0,0,0]
[null,{"$f":"IF(ISBLANK(dms_E3_Projects_45),\"\",dms_E3_Projects_45)","v":""},0,0,0,0,0]
[null,{"$f":"IF(ISBLANK(dms_E3_Projects_46),\"\",dms_E3_Projects_46)","v":""},0,0,0,0,0]
[null,{"$f":"IF(ISBLANK(dms_E3_Projects_47),\"\",dms_E3_Projects_47)","v":""},0,0,0,0,0]
[null,{"$f":"IF(ISBLANK(dms_E3_Projects_48),\"\",dms_E3_Projects_48)","v":""},0,0,0,0,0]
[null,{"$f":"IF(ISBLANK(dms_E3_Projects_49),\"\",dms_E3_Projects_49)","v":""},0,0,0,0,0]
[null,{"$f":"IF(ISBLANK(dms_E3_Projects_50),\"\",dms_E3_Projects_50)","v":""},0,0,0,0,0]
[null,"Aggregate of other projects with total expenditure of less than $500,000",0,0,0,0,0]
[null,"Total",{"$f":"SUM(C524:C574)","v":0},{"$f":"SUM(D524:D574)","v":0},{"$f":"SUM(E524:E574)","v":0},{"$f":"SUM(F524:F574)","v":0},{"$f":"SUM(G524:G574)","v":0}]
[]
[null,"D. MEDIUM PRESSURE TO MEDIUM PRESSURE"]
[null,null,"LENGTH"]
[null,null,"0s, metres"]
[null,null,{"$f":"dms_y1","v":"2014-15"},{"$f":"dms_y2","v":"2015-16"},{"$f":"dms_y3","v":"2016-17"},{"$f":"dms_y4","v":"2017-18"},{"$f":"dms_y5","v":"2018-19"}]
[null,{"$f":"IF(ISBLANK(dms_E3_Projects_01),\"\",dms_E3_Projects_01)","v":"3015 MAJOR PROJECTS - MURRAY BRIDGE"},0,0,0,0,0]
[null,{"$f":"IF(ISBLANK(dms_E3_Projects_02),\"\",dms_E3_Projects_02)","v":""},0,0,0,0,0]
[null,{"$f":"IF(ISBLANK(dms_E3_Projects_03),\"\",dms_E3_Projects_03)","v":"3065 MAJOR PROJECTS - ADELAIDE CBD HP MAINS EXT EAST"},0,0,0,0,0]
[null,{"$f":"IF(ISBLANK(dms_E3_Projects_04),\"\",dms_E3_Projects_04)","v":"3038 MAJOR PROJECTS - SEAFORD STAGE 2"},0,0,0,0,0]
[null,{"$f":"IF(ISBLANK(dms_E3_Projects_05),\"\",dms_E3_Projects_05)","v":""},0,0,0,0,0]
[null,{"$f":"IF(ISBLANK(dms_E3_Projects_06),\"\",dms_E3_Projects_06)","v":"AUGMENTATION PROJECTS <$500K"},0,0,0,0,0]
[null,{"$f":"IF(ISBLANK(dms_E3_Projects_07),\"\",dms_E3_Projects_07)","v":""},0,0,0,0,0]
[null,{"$f":"IF(ISBLANK(dms_E3_Projects_08),\"\",dms_E3_Projects_08)","v":""},0,0,0,0,0]
[null,{"$f":"IF(ISBLANK(dms_E3_Projects_09),\"\",dms_E3_Projects_09)","v":""},0,0,0,0,0]
[null,{"$f":"IF(ISBLANK(dms_E3_Projects_10),\"\",dms_E3_Projects_10)","v":""},0,0,0,0,0]
[null,{"$f":"IF(ISBLANK(dms_E3_Projects_11),\"\",dms_E3_Projects_11)","v":""},0,0,0,0,0]
[null,{"$f":"IF(ISBLANK(dms_E3_Projects_12),\"\",dms_E3_Projects_12)","v":""},0,0,0,0,0]
[null,{"$f":"IF(ISBLANK(dms_E3_Projects_13),\"\",dms_E3_Projects_13)","v":""},0,0,0,0,0]
[null,{"$f":"IF(ISBLANK(dms_E3_Projects_14),\"\",dms_E3_Projects_14)","v":""},0,0,0,0,0]
[null,{"$f":"IF(ISBLANK(dms_E3_Projects_15),\"\",dms_E3_Projects_15)","v":""},0,0,0,0,0]
[null,{"$f":"IF(ISBLANK(dms_E3_Projects_16),\"\",dms_E3_Projects_16)","v":""},0,0,0,0,0]
[null,{"$f":"IF(ISBLANK(dms_E3_Projects_17),\"\",dms_E3_Projects_17)","v":""},0,0,0,0,0]
[null,{"$f":"IF(ISBLANK(dms_E3_Projects_18),\"\",dms_E3_Projects_18)","v":""},0,0,0,0,0]
[null,{"$f":"IF(ISBLANK(dms_E3_Projects_18),\"\",dms_E3_Projects_18)","v":""},0,0,0,0,0]
[null,{"$f":"IF(ISBLANK(dms_E3_Projects_19),\"\",dms_E3_Projects_19)","v":""},0,0,0,0,0]
[null,{"$f":"IF(ISBLANK(dms_E3_Projects_20),\"\",dms_E3_Projects_20)","v":""},0,0,0,0,0]
[null,{"$f":"IF(ISBLANK(dms_E3_Projects_21),\"\",dms_E3_Projects_21)","v":""},0,0,0,0,0]
[null,{"$f":"IF(ISBLANK(dms_E3_Projects_22),\"\",dms_E3_Projects_22)","v":""},0,0,0,0,0]
[null,{"$f":"IF(ISBLANK(dms_E3_Projects_23),\"\",dms_E3_Projects_23)","v":""},0,0,0,0,0]
[null,{"$f":"IF(ISBLANK(dms_E3_Projects_24),\"\",dms_E3_Projects_24)","v":""},0,0,0,0,0]
[null,{"$f":"IF(ISBLANK(dms_E3_Projects_25),\"\",dms_E3_Projects_26)","v":""},0,0,0,0,0]
[null,{"$f":"IF(ISBLANK(dms_E3_Projects_27),\"\",dms_E3_Projects_27)","v":""},0,0,0,0,0]
[null,{"$f":"IF(ISBLANK(dms_E3_Projects_28),\"\",dms_E3_Projects_28)","v":""},0,0,0,0,0]
[null,{"$f":"IF(ISBLANK(dms_E3_Projects_29),\"\",dms_E3_Projects_29)","v":""},0,0,0,0,0]
[null,{"$f":"IF(ISBLANK(dms_E3_Projects_30),\"\",dms_E3_Projects_30)","v":""},0,0,0,0,0]
[null,{"$f":"IF(ISBLANK(dms_E3_Projects_31),\"\",dms_E3_Projects_31)","v":""},0,0,0,0,0]
[null,{"$f":"IF(ISBLANK(dms_E3_Projects_32),\"\",dms_E3_Projects_32)","v":""},0,0,0,0,0]
[null,{"$f":"IF(ISBLANK(dms_E3_Projects_33),\"\",dms_E3_Projects_33)","v":""},0,0,0,0,0]
[null,{"$f":"IF(ISBLANK(dms_E3_Projects_34),\"\",dms_E3_Projects_34)","v":""},0,0,0,0,0]
[null,{"$f":"IF(ISBLANK(dms_E3_Projects_35),\"\",dms_E3_Projects_35)","v":""},0,0,0,0,0]
[null,{"$f":"IF(ISBLANK(dms_E3_Projects_36),\"\",dms_E3_Projects_36)","v":""},0,0,0,0,0]
[null,{"$f":"IF(ISBLANK(dms_E3_Projects_37),\"\",dms_E3_Projects_37)","v":""},0,0,0,0,0]
[null,{"$f":"IF(ISBLANK(dms_E3_Projects_38),\"\",dms_E3_Projects_38)","v":""},0,0,0,0,0]
[null,{"$f":"IF(ISBLANK(dms_E3_Projects_39),\"\",dms_E3_Projects_39)","v":""},0,0,0,0,0]
[null,{"$f":"IF(ISBLANK(dms_E3_Projects_40),\"\",dms_E3_Projects_40)","v":""},0,0,0,0,0]
[null,{"$f":"IF(ISBLANK(dms_E3_Projects_41),\"\",dms_E3_Projects_41)","v":""},0,0,0,0,0]
[null,{"$f":"IF(ISBLANK(dms_E3_Projects_42),\"\",dms_E3_Projects_42)","v":""},0,0,0,0,0]
[null,{"$f":"IF(ISBLANK(dms_E3_Projects_43),\"\",dms_E3_Projects_43)","v":""},0,0,0,0,0]
[null,{"$f":"IF(ISBLANK(dms_E3_Projects_44),\"\",dms_E3_Projects_44)","v":""},0,0,0,0,0]
[null,{"$f":"IF(ISBLANK(dms_E3_Projects_45),\"\",dms_E3_Projects_45)","v":""},0,0,0,0,0]
[null,{"$f":"IF(ISBLANK(dms_E3_Projects_46),\"\",dms_E3_Projects_46)","v":""},0,0,0,0,0]
[null,{"$f":"IF(ISBLANK(dms_E3_Projects_47),\"\",dms_E3_Projects_47)","v":""},0,0,0,0,0]
[null,{"$f":"IF(ISBLANK(dms_E3_Projects_48),\"\",dms_E3_Projects_48)","v":""},0,0,0,0,0]
[null,{"$f":"IF(ISBLANK(dms_E3_Projects_49),\"\",dms_E3_Projects_49)","v":""},0,0,0,0,0]
[null,{"$f":"IF(ISBLANK(dms_E3_Projects_50),\"\",dms_E3_Projects_50)","v":""},0,0,0,0,0]
[null,"Aggregate of other projects with total expenditure of less than $500,000",0,0,0,0,0]
[null,"Total",{"$f":"SUM(C581:C631)","v":0},{"$f":"SUM(D581:D631)","v":0},{"$f":"SUM(E581:E631)","v":0},{"$f":"SUM(F581:F631)","v":0},{"$f":"SUM(G581:G631)","v":0}]
[]
[null,"E. MEDIUM PRESSURE TO HIGH PRESSURE"]
[null,null,"LENGTH"]
[null,null,"0s, metres"]
[null,null,{"$f":"dms_y1","v":"2014-15"},{"$f":"dms_y2","v":"2015-16"},{"$f":"dms_y3","v":"2016-17"},{"$f":"dms_y4","v":"2017-18"},{"$f":"dms_y5","v":"2018-19"}]
[null,{"$f":"IF(ISBLANK(dms_E3_Projects_01),\"\",dms_E3_Projects_01)","v":"3015 MAJOR PROJECTS - MURRAY BRIDGE"},0,0,0,0,0]
[null,{"$f":"IF(ISBLANK(dms_E3_Projects_02),\"\",dms_E3_Projects_02)","v":""},0,0,0,0,0]
[null,{"$f":"IF(ISBLANK(dms_E3_Projects_03),\"\",dms_E3_Projects_03)","v":"3065 MAJOR PROJECTS - ADELAIDE CBD HP MAINS EXT EAST"},0,0,0,0,0]
[null,{"$f":"IF(ISBLANK(dms_E3_Projects_04),\"\",dms_E3_Projects_04)","v":"3038 MAJOR PROJECTS - SEAFORD STAGE 2"},0,0,0,0,0]
[null,{"$f":"IF(ISBLANK(dms_E3_Projects_05),\"\",dms_E3_Projects_05)","v":""},0,0,0,0,0]
[null,{"$f":"IF(ISBLANK(dms_E3_Projects_06),\"\",dms_E3_Projects_06)","v":"AUGMENTATION PROJECTS <$500K"},0,0,0,0,0]
[null,{"$f":"IF(ISBLANK(dms_E3_Projects_07),\"\",dms_E3_Projects_07)","v":""},0,0,0,0,0]
[null,{"$f":"IF(ISBLANK(dms_E3_Projects_08),\"\",dms_E3_Projects_08)","v":""},0,0,0,0,0]
[null,{"$f":"IF(ISBLANK(dms_E3_Projects_09),\"\",dms_E3_Projects_09)","v":""},0,0,0,0,0]
[null,{"$f":"IF(ISBLANK(dms_E3_Projects_10),\"\",dms_E3_Projects_10)","v":""},0,0,0,0,0]
[null,{"$f":"IF(ISBLANK(dms_E3_Projects_11),\"\",dms_E3_Projects_11)","v":""},0,0,0,0,0]
[null,{"$f":"IF(ISBLANK(dms_E3_Projects_12),\"\",dms_E3_Projects_12)","v":""},0,0,0,0,0]
[null,{"$f":"IF(ISBLANK(dms_E3_Projects_13),\"\",dms_E3_Projects_13)","v":""},0,0,0,0,0]
[null,{"$f":"IF(ISBLANK(dms_E3_Projects_14),\"\",dms_E3_Projects_14)","v":""},0,0,0,0,0]
[null,{"$f":"IF(ISBLANK(dms_E3_Projects_15),\"\",dms_E3_Projects_15)","v":""},0,0,0,0,0]
[null,{"$f":"IF(ISBLANK(dms_E3_Projects_16),\"\",dms_E3_Projects_16)","v":""},0,0,0,0,0]
[null,{"$f":"IF(ISBLANK(dms_E3_Projects_17),\"\",dms_E3_Projects_17)","v":""},0,0,0,0,0]
[null,{"$f":"IF(ISBLANK(dms_E3_Projects_18),\"\",dms_E3_Projects_18)","v":""},0,0,0,0,0]
[null,{"$f":"IF(ISBLANK(dms_E3_Projects_18),\"\",dms_E3_Projects_18)","v":""},0,0,0,0,0]
[null,{"$f":"IF(ISBLANK(dms_E3_Projects_19),\"\",dms_E3_Projects_19)","v":""},0,0,0,0,0]
[null,{"$f":"IF(ISBLANK(dms_E3_Projects_20),\"\",dms_E3_Projects_20)","v":""},0,0,0,0,0]
[null,{"$f":"IF(ISBLANK(dms_E3_Projects_21),\"\",dms_E3_Projects_21)","v":""},0,0,0,0,0]
[null,{"$f":"IF(ISBLANK(dms_E3_Projects_22),\"\",dms_E3_Projects_22)","v":""},0,0,0,0,0]
[null,{"$f":"IF(ISBLANK(dms_E3_Projects_23),\"\",dms_E3_Projects_23)","v":""},0,0,0,0,0]
[null,{"$f":"IF(ISBLANK(dms_E3_Projects_24),\"\",dms_E3_Projects_24)","v":""},0,0,0,0,0]
[null,{"$f":"IF(ISBLANK(dms_E3_Projects_25),\"\",dms_E3_Projects_26)","v":""},0,0,0,0,0]
[null,{"$f":"IF(ISBLANK(dms_E3_Projects_27),\"\",dms_E3_Projects_27)","v":""},0,0,0,0,0]
[null,{"$f":"IF(ISBLANK(dms_E3_Projects_28),\"\",dms_E3_Projects_28)","v":""},0,0,0,0,0]
[null,{"$f":"IF(ISBLANK(dms_E3_Projects_29),\"\",dms_E3_Projects_29)","v":""},0,0,0,0,0]
[null,{"$f":"IF(ISBLANK(dms_E3_Projects_30),\"\",dms_E3_Projects_30)","v":""},0,0,0,0,0]
[null,{"$f":"IF(ISBLANK(dms_E3_Projects_31),\"\",dms_E3_Projects_31)","v":""},0,0,0,0,0]
[null,{"$f":"IF(ISBLANK(dms_E3_Projects_32),\"\",dms_E3_Projects_32)","v":""},0,0,0,0,0]
[null,{"$f":"IF(ISBLANK(dms_E3_Projects_33),\"\",dms_E3_Projects_33)","v":""},0,0,0,0,0]
[null,{"$f":"IF(ISBLANK(dms_E3_Projects_34),\"\",dms_E3_Projects_34)","v":""},0,0,0,0,0]
[null,{"$f":"IF(ISBLANK(dms_E3_Projects_35),\"\",dms_E3_Projects_35)","v":""},0,0,0,0,0]
[null,{"$f":"IF(ISBLANK(dms_E3_Projects_36),\"\",dms_E3_Projects_36)","v":""},0,0,0,0,0]
[null,{"$f":"IF(ISBLANK(dms_E3_Projects_37),\"\",dms_E3_Projects_37)","v":""},0,0,0,0,0]
[null,{"$f":"IF(ISBLANK(dms_E3_Projects_38),\"\",dms_E3_Projects_38)","v":""},0,0,0,0,0]
[null,{"$f":"IF(ISBLANK(dms_E3_Projects_39),\"\",dms_E3_Projects_39)","v":""},0,0,0,0,0]
[null,{"$f":"IF(ISBLANK(dms_E3_Projects_40),\"\",dms_E3_Projects_40)","v":""},0,0,0,0,0]
[null,{"$f":"IF(ISBLANK(dms_E3_Projects_41),\"\",dms_E3_Projects_41)","v":""},0,0,0,0,0]
[null,{"$f":"IF(ISBLANK(dms_E3_Projects_42),\"\",dms_E3_Projects_42)","v":""},0,0,0,0,0]
[null,{"$f":"IF(ISBLANK(dms_E3_Projects_43),\"\",dms_E3_Projects_43)","v":""},0,0,0,0,0]
[null,{"$f":"IF(ISBLANK(dms_E3_Projects_44),\"\",dms_E3_Projects_44)","v":""},0,0,0,0,0]
[null,{"$f":"IF(ISBLANK(dms_E3_Projects_45),\"\",dms_E3_Projects_45)","v":""},0,0,0,0,0]
[null,{"$f":"IF(ISBLANK(dms_E3_Projects_46),\"\",dms_E3_Projects_46)","v":""},0,0,0,0,0]
[null,{"$f":"IF(ISBLANK(dms_E3_Projects_47),\"\",dms_E3_Projects_47)","v":""},0,0,0,0,0]
[null,{"$f":"IF(ISBLANK(dms_E3_Projects_48),\"\",dms_E3_Projects_48)","v":""},0,0,0,0,0]
[null,{"$f":"IF(ISBLANK(dms_E3_Projects_49),\"\",dms_E3_Projects_49)","v":""},0,0,0,0,0]
[null,{"$f":"IF(ISBLANK(dms_E3_Projects_50),\"\",dms_E3_Projects_50)","v":""},0,0,0,0,0]
[null,"Aggregate of other projects with total expenditure of less than $500,000",0,0,0,0,0]
[null,"Total",{"$f":"SUM(C638:C688)","v":0},{"$f":"SUM(D638:D688)","v":0},{"$f":"SUM(E638:E688)","v":0},{"$f":"SUM(F638:F688)","v":0},{"$f":"SUM(G638:G688)","v":0}]
[]
[null,"F. HIGH PRESSURE TO HIGH PRESSURE"]
[null,null,"LENGTH"]
[null,null,"0s, metres"]
[null,null,{"$f":"dms_y1","v":"2014-15"},{"$f":"dms_y2","v":"2015-16"},{"$f":"dms_y3","v":"2016-17"},{"$f":"dms_y4","v":"2017-18"},{"$f":"dms_y5","v":"2018-19"}]
[null,{"$f":"IF(ISBLANK(dms_E3_Projects_01),\"\",dms_E3_Projects_01)","v":"3015 MAJOR PROJECTS - MURRAY BRIDGE"},0,0,0,1230,870]
[null,{"$f":"IF(ISBLANK(dms_E3_Projects_02),\"\",dms_E3_Projects_02)","v":""},0,0,0,0,0]
[null,{"$f":"IF(ISBLANK(dms_E3_Projects_03),\"\",dms_E3_Projects_03)","v":"3065 MAJOR PROJECTS - ADELAIDE CBD HP MAINS EXT EAST"},0,0,0,0,1250]
[null,{"$f":"IF(ISBLANK(dms_E3_Projects_04),\"\",dms_E3_Projects_04)","v":"3038 MAJOR PROJECTS - SEAFORD STAGE 2"},0,2528,810,0,0]
[null,{"$f":"IF(ISBLANK(dms_E3_Projects_05),\"\",dms_E3_Projects_05)","v":""},0,0,0,0,0]
[null,{"$f":"IF(ISBLANK(dms_E3_Projects_06),\"\",dms_E3_Projects_06)","v":"AUGMENTATION PROJECTS <$500K"},0,0,0,0,0]
[null,{"$f":"IF(ISBLANK(dms_E3_Projects_07),\"\",dms_E3_Projects_07)","v":""},0,0,0,0,0]
[null,{"$f":"IF(ISBLANK(dms_E3_Projects_08),\"\",dms_E3_Projects_08)","v":""},0,0,0,0,0]
[null,{"$f":"IF(ISBLANK(dms_E3_Projects_09),\"\",dms_E3_Projects_09)","v":""},0,0,0,0,0]
[null,{"$f":"IF(ISBLANK(dms_E3_Projects_10),\"\",dms_E3_Projects_10)","v":""},0,0,0,0,0]
[null,{"$f":"IF(ISBLANK(dms_E3_Projects_11),\"\",dms_E3_Projects_11)","v":""},0,0,0,0,0]
[null,{"$f":"IF(ISBLANK(dms_E3_Projects_12),\"\",dms_E3_Projects_12)","v":""},0,0,0,0,0]
[null,{"$f":"IF(ISBLANK(dms_E3_Projects_13),\"\",dms_E3_Projects_13)","v":""},0,0,0,0,0]
[null,{"$f":"IF(ISBLANK(dms_E3_Projects_14),\"\",dms_E3_Projects_14)","v":""},0,0,0,0,0]
[null,{"$f":"IF(ISBLANK(dms_E3_Projects_15),\"\",dms_E3_Projects_15)","v":""},0,0,0,0,0]
[null,{"$f":"IF(ISBLANK(dms_E3_Projects_16),\"\",dms_E3_Projects_16)","v":""},0,0,0,0,0]
[null,{"$f":"IF(ISBLANK(dms_E3_Projects_17),\"\",dms_E3_Projects_17)","v":""},0,0,0,0,0]
[null,{"$f":"IF(ISBLANK(dms_E3_Projects_18),\"\",dms_E3_Projects_18)","v":""},0,0,0,0,0]
[null,{"$f":"IF(ISBLANK(dms_E3_Projects_18),\"\",dms_E3_Projects_18)","v":""},0,0,0,0,0]
[null,{"$f":"IF(ISBLANK(dms_E3_Projects_19),\"\",dms_E3_Projects_19)","v":""},0,0,0,0,0]
[null,{"$f":"IF(ISBLANK(dms_E3_Projects_20),\"\",dms_E3_Projects_20)","v":""},0,0,0,0,0]
[null,{"$f":"IF(ISBLANK(dms_E3_Projects_21),\"\",dms_E3_Projects_21)","v":""},0,0,0,0,0]
[null,{"$f":"IF(ISBLANK(dms_E3_Projects_22),\"\",dms_E3_Projects_22)","v":""},0,0,0,0,0]
[null,{"$f":"IF(ISBLANK(dms_E3_Projects_23),\"\",dms_E3_Projects_23)","v":""},0,0,0,0,0]
[null,{"$f":"IF(ISBLANK(dms_E3_Projects_24),\"\",dms_E3_Projects_24)","v":""},0,0,0,0,0]
[null,{"$f":"IF(ISBLANK(dms_E3_Projects_25),\"\",dms_E3_Projects_26)","v":""},0,0,0,0,0]
[null,{"$f":"IF(ISBLANK(dms_E3_Projects_27),\"\",dms_E3_Projects_27)","v":""},0,0,0,0,0]
[null,{"$f":"IF(ISBLANK(dms_E3_Projects_28),\"\",dms_E3_Projects_28)","v":""},0,0,0,0,0]
[null,{"$f":"IF(ISBLANK(dms_E3_Projects_29),\"\",dms_E3_Projects_29)","v":""},0,0,0,0,0]
[null,{"$f":"IF(ISBLANK(dms_E3_Projects_30),\"\",dms_E3_Projects_30)","v":""},0,0,0,0,0]
[null,{"$f":"IF(ISBLANK(dms_E3_Projects_31),\"\",dms_E3_Projects_31)","v":""},0,0,0,0,0]
[null,{"$f":"IF(ISBLANK(dms_E3_Projects_32),\"\",dms_E3_Projects_32)","v":""},0,0,0,0,0]
[null,{"$f":"IF(ISBLANK(dms_E3_Projects_33),\"\",dms_E3_Projects_33)","v":""},0,0,0,0,0]
[null,{"$f":"IF(ISBLANK(dms_E3_Projects_34),\"\",dms_E3_Projects_34)","v":""},0,0,0,0,0]
[null,{"$f":"IF(ISBLANK(dms_E3_Projects_35),\"\",dms_E3_Projects_35)","v":""},0,0,0,0,0]
[null,{"$f":"IF(ISBLANK(dms_E3_Projects_36),\"\",dms_E3_Projects_36)","v":""},0,0,0,0,0]
[null,{"$f":"IF(ISBLANK(dms_E3_Projects_37),\"\",dms_E3_Projects_37)","v":""},0,0,0,0,0]
[null,{"$f":"IF(ISBLANK(dms_E3_Projects_38),\"\",dms_E3_Projects_38)","v":""},0,0,0,0,0]
[null,{"$f":"IF(ISBLANK(dms_E3_Projects_39),\"\",dms_E3_Projects_39)","v":""},0,0,0,0,0]
[null,{"$f":"IF(ISBLANK(dms_E3_Projects_40),\"\",dms_E3_Projects_40)","v":""},0,0,0,0,0]
[null,{"$f":"IF(ISBLANK(dms_E3_Projects_41),\"\",dms_E3_Projects_41)","v":""},0,0,0,0,0]
[null,{"$f":"IF(ISBLANK(dms_E3_Projects_42),\"\",dms_E3_Projects_42)","v":""},0,0,0,0,0]
[null,{"$f":"IF(ISBLANK(dms_E3_Projects_43),\"\",dms_E3_Projects_43)","v":""},0,0,0,0,0]
[null,{"$f":"IF(ISBLANK(dms_E3_Projects_44),\"\",dms_E3_Projects_44)","v":""},0,0,0,0,0]
[null,{"$f":"IF(ISBLANK(dms_E3_Projects_45),\"\",dms_E3_Projects_45)","v":""},0,0,0,0,0]
[null,{"$f":"IF(ISBLANK(dms_E3_Projects_46),\"\",dms_E3_Projects_46)","v":""},0,0,0,0,0]
[null,{"$f":"IF(ISBLANK(dms_E3_Projects_47),\"\",dms_E3_Projects_47)","v":""},0,0,0,0,0]
[null,{"$f":"IF(ISBLANK(dms_E3_Projects_48),\"\",dms_E3_Projects_48)","v":""},0,0,0,0,0]
[null,{"$f":"IF(ISBLANK(dms_E3_Projects_49),\"\",dms_E3_Projects_49)","v":""},0,0,0,0,0]
[null,{"$f":"IF(ISBLANK(dms_E3_Projects_50),\"\",dms_E3_Projects_50)","v":""},0,0,0,0,0]
[null,"Aggregate of other projects with total expenditure of less than $500,000",0,0,0,0,0]
[null,"Total",{"$f":"SUM(C695:C745)","v":0},{"$f":"SUM(D695:D745)","v":2528},{"$f":"SUM(E695:E745)","v":810},{"$f":"SUM(F695:F745)","v":1230},{"$f":"SUM(G695:G745)","v":2120}]

{"sheet":"E4. Meter replacement","index":9,"n_rows":207,"n_cols":7,"rows_kept":207,"cut":false,"hidden":false,"merged":[[191,2,191,6],[200,2,200,6],[201,2,201,6],[163,2,163,6],[164,2,164,6],[180,2,180,6],[181,2,181,6],[190,2,190,6],[115,2,115,6],[116,2,116,6],[153,2,153,6],[154,2,154,6],[7,2,7,6],[8,2,8,6],[43,2,43,6],[44,2,44,6],[79,2,79,6],[80,2,80,6]]}
[null,{"$f":"INDEX(dms_Worksheet_List,MATCH(dms_Model,dms_Model_List))","v":"HISTORICAL ANNUAL REPORTING"}]
[null,{"$f":"INDEX(dms_TradingNameFull_List,MATCH(dms_TradingName,dms_TradingName_List))","v":"Australian Gas Networks Limited (reporting data for SA)"}]
[null,{"$f":"dms_Header_Span","v":"2014-15 to 2018-19"}]
[null,"E4. METER REPLACEMENT"]
[]
[null,"E4.1 - CAPEX"]
[null,"E4.1.1 - NEW METERS ACQUIRED"]
[null,null,"EXPENDITURE"]
[null,null,"$0's"]
[null,null,{"$f":"dms_y1","v":"2014-15"},{"$f":"dms_y2","v":"2015-16"},{"$f":"dms_y3","v":"2016-17"},{"$f":"dms_y4","v":"2017-18"},{"$f":"dms_y5","v":"2018-19"}]
[null,"A. DIRECT INTERNAL LABOUR EXPENDITURE"]
[null,"Residential",0,0,0,0,0]
[null,"Industrial and Commercial",0,0,0,0,0]
[null,"Other",0,0,0,0,0]
[null,"Total",{"$f":"SUM(C12:C14)","v":0},{"$f":"SUM(D12:D14)","v":0},{"$f":"SUM(E12:E14)","v":0},{"$f":"SUM(F12:F14)","v":0},{"$f":"SUM(G12:G14)","v":0}]
[null,"B. DIRECT CONTRACTOR EXPENDITURE"]
[null,"Residential"]
[null,"Industrial and Commercial"]
[null,"Other"]
[null,"Total",{"$f":"SUM(C17:C19)","v":0},{"$f":"SUM(D17:D19)","v":0},{"$f":"SUM(E17:E19)","v":0},{"$f":"SUM(F17:F19)","v":0},{"$f":"SUM(G17:G19)","v":0}]
[null,"C. OTHER INTERNAL DIRECT EXPENDITURE"]
[null,"Residential",0,0,0,0,0]
[null,"Industrial and Commercial",0,0,0,0,0]
[null,"Other",0,0,0,0,0]
[null,"Total",{"$f":"SUM(C22:C24)","v":0},{"$f":"SUM(D22:D24)","v":0},{"$f":"SUM(E22:E24)","v":0},{"$f":"SUM(F22:F24)","v":0},{"$f":"SUM(G22:G24)","v":0}]
[null,"D. TOTAL OVERHEAD EXPENDITURE"]
[null,"Residential"]
[null,"Industrial and Commercial"]
[null,"Other"]
[null,"Total",{"$f":"SUM(C27:C29)","v":0},{"$f":"SUM(D27:D29)","v":0},{"$f":"SUM(E27:E29)","v":0},{"$f":"SUM(F27:F29)","v":0},{"$f":"SUM(G27:G29)","v":0}]
[null,"E. RELATED PARTY MARGIN EXPENDITURE"]
[null,"Residential",0,0,0,0,0]
[null,"Industrial and Commercial",0,0,0,0,0]
[null,"Other",0,0,0,0,0]
[null,"Total",{"$f":"SUM(C32:C34)","v":0},{"$f":"SUM(D32:D34)","v":0},{"$f":"SUM(E32:E34)","v":0},{"$f":"SUM(F32:F34)","v":0},{"$f":"SUM(G32:G34)","v":0}]
[null,"F. CAPITAL CONTRIBUTIONS included in the above"]
[null,"Residential",0,0,0,0,0]
[null,"Industrial and Commercial",0,0,0,0,0]
[null,"Other",0,0,0,0,0]
[null,"Total",{"$f":"SUM(C37:C39)","v":0},{"$f":"SUM(D37:D39)","v":0},{"$f":"SUM(E37:E39)","v":0},{"$f":"SUM(F37:F39)","v":0},{"$f":"SUM(G37:G39)","v":0}]
[null,"TOTAL",{"$f":"SUM(C15,C20,C25,C30,C35,C40)","v":0},{"$f":"SUM(D15,D20,D25,D30,D35,D40)","v":0},{"$f":"SUM(E15,E20,E25,E30,E35,E40)","v":0},{"$f":"SUM(F15,F20,F25,F30,F35,F40)","v":0},{"$f":"SUM(G15,G20,G25,G30,G35,G40)","v":0}]
[]
[null,"E4.1.2 - METER REFURBISHMENT"]
[null,null,"EXPENDITURE"]
[null,null,"$0's"]
[null,null,{"$f":"dms_y1","v":"2014-15"},{"$f":"dms_y2","v":"2015-16"},{"$f":"dms_y3","v":"2016-17"},{"$f":"dms_y4","v":"2017-18"},{"$f":"dms_y5","v":"2018-19"}]
[null,"A. DIRECT INTERNAL LABOUR EXPENDITURE"]
[null,"Residential",0,0,0,0,0]
[null,"Industrial and Commercial",0,0,0,0,0]
[null,"Other",0,0,0,0,0]
[null,"Total",{"$f":"SUM(C48:C50)","v":0},{"$f":"SUM(D48:D50)","v":0},{"$f":"SUM(E48:E50)","v":0},{"$f":"SUM(F48:F50)","v":0},{"$f":"SUM(G48:G50)","v":0}]
[null,"B. DIRECT CONTRACTOR EXPENDITURE"]
[null,"Residential"]
[null,"Industrial and Commercial"]
[null,"Other"]
[null,"Total",{"$f":"SUM(C53:C55)","v":0},{"$f":"SUM(D53:D55)","v":0},{"$f":"SUM(E53:E55)","v":0},{"$f":"SUM(F53:F55)","v":0},{"$f":"SUM(G53:G55)","v":0}]
[null,"C. OTHER INTERNAL DIRECT EXPENDITURE"]
[null,"Residential",0,0,0,0,0]
[null,"Industrial and Commercial",0,0,0,0,0]
[null,"Other",0,0,0,0,0]
[null,"Total",{"$f":"SUM(C58:C60)","v":0},{"$f":"SUM(D58:D60)","v":0},{"$f":"SUM(E58:E60)","v":0},{"$f":"SUM(F58:F60)","v":0},{"$f":"SUM(G58:G60)","v":0}]
[null,"D. TOTAL OVERHEAD EXPENDITURE"]
[null,"Residential"]
[null,"Industrial and Commercial"]
[null,"Other"]
[null,"Total",{"$f":"SUM(C63:C65)","v":0},{"$f":"SUM(D63:D65)","v":0},{"$f":"SUM(E63:E65)","v":0},{"$f":"SUM(F63:F65)","v":0},{"$f":"SUM(G63:G65)","v":0}]
[null,"E. RELATED PARTY MARGIN EXPENDITURE"]
[null,"Residential",0,0,0,0,0]
[null,"Industrial and Commercial",0,0,0,0,0]
[null,"Other",0,0,0,0,0]
[null,"Total",{"$f":"SUM(C68:C70)","v":0},{"$f":"SUM(D68:D70)","v":0},{"$f":"SUM(E68:E70)","v":0},{"$f":"SUM(F68:F70)","v":0},{"$f":"SUM(G68:G70)","v":0}]
[null,"F. CAPITAL CONTRIBUTIONS included in the above"]
[null,"Residential",0,0,0,0,0]
[null,"Industrial and Commercial",0,0,0,0,0]
[null,"Other",0,0,0,0,0]
[null,"Total",{"$f":"SUM(C73:C75)","v":0},{"$f":"SUM(D73:D75)","v":0},{"$f":"SUM(E73:E75)","v":0},{"$f":"SUM(F73:F75)","v":0},{"$f":"SUM(G73:G75)","v":0}]
[null,"TOTAL",{"$f":"SUM(C51,C56,C61,C66,C71,C76)","v":0},{"$f":"SUM(D51,D56,D61,D66,D71,D76)","v":0},{"$f":"SUM(E51,E56,E61,E66,E71,E76)","v":0},{"$f":"SUM(F51,F56,F61,F66,F71,F76)","v":0},{"$f":"SUM(G51,G56,G61,G66,G71,G76)","v":0}]
[]
[null,"E4.1.3 - METER INSTALLATION"]
[null,null,"EXPENDITURE"]
[null,null,"$0's"]
[null,null,{"$f":"dms_y1","v":"2014-15"},{"$f":"dms_y2","v":"2015-16"},{"$f":"dms_y3","v":"2016-17"},{"$f":"dms_y4","v":"2017-18"},{"$f":"dms_y5","v":"2018-19"}]
[null,"A. DIRECT INTERNAL LABOUR EXPENDITURE"]
[null,"Residential",0,0,0,0,0]
[null,"Industrial and Commercial",0,0,0,0,0]
[null,"Other",0,0,0,0,0]
[null,"Total",{"$f":"SUM(C84:C86)","v":0},{"$f":"SUM(D84:D86)","v":0},{"$f":"SUM(E84:E86)","v":0},{"$f":"SUM(F84:F86)","v":0},{"$f":"SUM(G84:G86)","v":0}]
[null,"B. DIRECT CONTRACTOR EXPENDITURE"]
[null,"Residential",0,0,0,0,0]
[null,"Industrial and Commercial",0,0,0,0,0]
[null,"Other",0,0,0,0,0]
[null,"Total",{"$f":"SUM(C89:C91)","v":0},{"$f":"SUM(D89:D91)","v":0},{"$f":"SUM(E89:E91)","v":0},{"$f":"SUM(F89:F91)","v":0},{"$f":"SUM(G89:G91)","v":0}]
[null,"C. OTHER INTERNAL DIRECT EXPENDITURE"]
[null,"Residential",0,0,0,0,0]
[null,"Industrial and Commercial",0,0,0,0,0]
[null,"Other",0,0,0,0,0]
[null,"Total",{"$f":"SUM(C94:C96)","v":0},{"$f":"SUM(D94:D96)","v":0},{"$f":"SUM(E94:E96)","v":0},{"$f":"SUM(F94:F96)","v":0},{"$f":"SUM(G94:G96)","v":0}]
[null,"D. TOTAL OVERHEAD EXPENDITURE"]
[null,"Residential",0,0,0,0,0]
[null,"Industrial and Commercial",0,0,0,0,0]
[null,"Other",0,0,0,0,0]
[null,"Total",{"$f":"SUM(C99:C101)","v":0},{"$f":"SUM(D99:D101)","v":0},{"$f":"SUM(E99:E101)","v":0},{"$f":"SUM(F99:F101)","v":0},{"$f":"SUM(G99:G101)","v":0}]
[null,"E. RELATED PARTY MARGIN EXPENDITURE"]
[null,"Residential",0,0,0,0,0]
[null,"Industrial and Commercial",0,0,0,0,0]
[null,"Other",0,0,0,0,0]
[null,"Total",{"$f":"SUM(C104:C106)","v":0},{"$f":"SUM(D104:D106)","v":0},{"$f":"SUM(E104:E106)","v":0},{"$f":"SUM(F104:F106)","v":0},{"$f":"SUM(G104:G106)","v":0}]
[null,"F. CAPITAL CONTRIBUTIONS included in the above"]
[null,"Residential",0,0,0,0,0]
[null,"Industrial and Commercial",0,0,0,0,0]
[null,"Other",0,0,0,0,0]
[null,"Total",{"$f":"SUM(C109:C111)","v":0},{"$f":"SUM(D109:D111)","v":0},{"$f":"SUM(E109:E111)","v":0},{"$f":"SUM(F109:F111)","v":0},{"$f":"SUM(G109:G111)","v":0}]
[null,"TOTAL",{"$f":"SUM(C87,C92,C97,C102,C107,C112)","v":0},{"$f":"SUM(D87,D92,D97,D102,D107,D112)","v":0},{"$f":"SUM(E87,E92,E97,E102,E107,E112)","v":0},{"$f":"SUM(F87,F92,F97,F102,F107,F112)","v":0},{"$f":"SUM(G87,G92,G97,G102,G107,G112)","v":0}]
[]
[null,"E4.1.4 - OTHER METER REPLACEMENT CAPEX"]
[null,null,"EXPENDITURE"]
[null,null,"$0's"]
[null,null,{"$f":"dms_y1","v":"2014-15"},{"$f":"dms_y2","v":"2015-16"},{"$f":"dms_y3","v":"2016-17"},{"$f":"dms_y4","v":"2017-18"},{"$f":"dms_y5","v":"2018-19"}]
[null,"A. DIRECT INTERNAL LABOUR EXPENDITURE"]
[null,"Residential",0,0,0,0,0]
[null,"Industrial and Commercial",0,0,0,0,0]
[null,"Other",0,0,0,0,0]
[null,"Total",{"$f":"SUM(C120:C122)","v":0},{"$f":"SUM(D120:D122)","v":0},{"$f":"SUM(E120:E122)","v":0},{"$f":"SUM(F120:F122)","v":0},{"$f":"SUM(G120:G122)","v":0}]
[null,"B. DIRECT CONTRACTOR EXPENDITURE"]
[null,"Residential",0,0,0,0,0]
[null,"Industrial and Commercial",0,0,0,0,0]
[null,"Other",0,0,0,0,0]
[null,"Total",{"$f":"SUM(C125:C127)","v":0},{"$f":"SUM(D125:D127)","v":0},{"$f":"SUM(E125:E127)","v":0},{"$f":"SUM(F125:F127)","v":0},{"$f":"SUM(G125:G127)","v":0}]
[null,"C. OTHER INTERNAL DIRECT EXPENDITURE"]
[null,"Residential",0,0,0,0,0]
[null,"Industrial and Commercial",0,0,0,0,0]
[null,"Other",0,0,0,0,0]
[null,"Total",{"$f":"SUM(C130:C132)","v":0},{"$f":"SUM(D130:D132)","v":0},{"$f":"SUM(E130:E132)","v":0},{"$f":"SUM(F130:F132)","v":0},{"$f":"SUM(G130:G132)","v":0}]
[null,"D. TOTAL OVERHEAD EXPENDITURE"]
[null,"Residential",0,0,0,0,0]
[null,"Industrial and Commercial",0,0,0,0,0]
[null,"Other",0,0,0,0,0]
[null,"Total",{"$f":"SUM(C135:C137)","v":0},{"$f":"SUM(D135:D137)","v":0},{"$f":"SUM(E135:E137)","v":0},{"$f":"SUM(F135:F137)","v":0},{"$f":"SUM(G135:G137)","v":0}]
[null,"E. RELATED PARTY MARGIN EXPENDITURE"]
[null,"Residential",0,0,0,0,0]
[null,"Industrial and Commercial",0,0,0,0,0]
[null,"Other",0,0,0,0,0]
[null,"Total",{"$f":"SUM(C140:C142)","v":0},{"$f":"SUM(D140:D142)","v":0},{"$f":"SUM(E140:E142)","v":0},{"$f":"SUM(F140:F142)","v":0},{"$f":"SUM(G140:G142)","v":0}]
[null,"F. CAPITAL CONTRIBUTIONS included in the above"]
[null,"Residential",0,0,0,0,0]
[null,"Industrial and Commercial",0,0,0,0,0]
[null,"Other",0,0,0,0,0]
[null,"Total",{"$f":"SUM(C145:C147)","v":0},{"$f":"SUM(D145:D147)","v":0},{"$f":"SUM(E145:E147)","v":0},{"$f":"SUM(F145:F147)","v":0},{"$f":"SUM(G145:G147)","v":0}]
[null,"TOTAL",{"$f":"SUM(C123,C128,C133,C138,C143,C148)","v":0},{"$f":"SUM(D123,D128,D133,D138,D143,D148)","v":0},{"$f":"SUM(E123,E128,E133,E138,E143,E148)","v":0},{"$f":"SUM(F123,F128,F133,F138,F143,F148)","v":0},{"$f":"SUM(G123,G128,G133,G138,G143,G148)","v":0}]
[]
[]
[null,"E4.2 - VOLUMES"]
[null,"E4.2.1 - NUMBER OF NEW METERS ACQUIRED"]
[null,null,"VOLUMES"]
[null,null,"0s"]
[null,null,{"$f":"dms_y1","v":"2014-15"},{"$f":"dms_y2","v":"2015-16"},{"$f":"dms_y3","v":"2016-17"},{"$f":"dms_y4","v":"2017-18"},{"$f":"dms_y5","v":"2018-19"}]
[null,"Residential"]
[null,"Industrial and commercial"]
[null,"Other"]
[null,"Total",{"$f":"SUM(C157:C159)","v":0},{"$f":"SUM(D157:D159)","v":0},{"$f":"SUM(E157:E159)","v":0},{"$f":"SUM(F157:F159)","v":0},{"$f":"SUM(G157:G159)","v":0}]
[]
[]
[null,"E4.2.2 - NUMBER OF METERS REFURBISHED"]
[null,null,"VOLUMES"]
[null,null,"0s"]
[null,null,{"$f":"dms_y1","v":"2014-15"},{"$f":"dms_y2","v":"2015-16"},{"$f":"dms_y3","v":"2016-17"},{"$f":"dms_y4","v":"2017-18"},{"$f":"dms_y5","v":"2018-19"}]
[null,"A. REFURBISHABLE METERS REMOVED"]
[null,"Residential"]
[null,"Industrial and commercial"]
[null,"Other"]
[null,"Total",{"$f":"SUM(C168:C170)","v":0},{"$f":"SUM(D168:D170)","v":0},{"$f":"SUM(E168:E170)","v":0},{"$f":"SUM(F168:F170)","v":0},{"$f":"SUM(G168:G170)","v":0}]
[null,"B. METERS DECOMMISSIONED"]
[null,"Residential"]
[null,"Industrial and commercial"]
[null,"Other meters"]
[null,"Total",{"$f":"SUM(C173:C175)","v":0},{"$f":"SUM(D173:D175)","v":0},{"$f":"SUM(E173:E175)","v":0},{"$f":"SUM(F173:F175)","v":0},{"$f":"SUM(G173:G175)","v":0}]
[null,"TOTAL",{"$f":"SUM(C171,C176)","v":0},{"$f":"SUM(D171,D176)","v":0},{"$f":"SUM(E171,E176)","v":0},{"$f":"SUM(F171,F176)","v":0},{"$f":"SUM(G171,G176)","v":0}]
[]
[]
[null,"E4.2.3 - NUMBER OF METERS INSTALLED"]
[null,null,"VOLUMES"]
[null,null,"0s"]
[null,null,{"$f":"dms_y1","v":"2014-15"},{"$f":"dms_y2","v":"2015-16"},{"$f":"dms_y3","v":"2016-17"},{"$f":"dms_y4","v":"2017-18"},{"$f":"dms_y5","v":"2018-19"}]
[null,"Residential"]
[null,"Industrial and commercial"]
[null,"Other"]
[null,"Total",{"$f":"SUM(C184:C186)","v":0},{"$f":"SUM(D184:D186)","v":0},{"$f":"SUM(E184:E186)","v":0},{"$f":"SUM(F184:F186)","v":0},{"$f":"SUM(G184:G186)","v":0}]
[]
[]
[null,"E4.2.4 - NUMBER OF METERS REMOVED / DECOMMISSIONED"]
[null,null,"VOLUMES"]
[null,null,"0s"]
[null,null,{"$f":"dms_y1","v":"2014-15"},{"$f":"dms_y2","v":"2015-16"},{"$f":"dms_y3","v":"2016-17"},{"$f":"dms_y4","v":"2017-18"},{"$f":"dms_y5","v":"2018-19"}]
[null,"Residential",7604.25,6794.3445139283685,18539,9028,14189]
[null,"Industrial and commercial",856.26598465473148,233.05626598465474,459.20716112531971,460.1437847866419,408]
[null,"Other",0,0,0,0,0]
[null,"Total",{"$f":"SUM(C194:C196)","v":8460.5159846547322},{"$f":"SUM(D194:D196)","v":7027.4007799130231},{"$f":"SUM(E194:E196)","v":18998.20716112532},{"$f":"SUM(F194:F196)","v":9488.1437847866418},{"$f":"SUM(G194:G196)","v":14597}]
[]
[]
[null,"E4.2.5 - OTHER METER REPLACEMENT VOLUMES"]
[null,null,"VOLUMES"]
[null,null,"0s"]
[null,null,{"$f":"dms_y1","v":"2014-15"},{"$f":"dms_y2","v":"2015-16"},{"$f":"dms_y3","v":"2016-17"},{"$f":"dms_y4","v":"2017-18"},{"$f":"dms_y5","v":"2018-19"}]
[null,"Residential",0,0,0,0,0]
[null,"Industrial and commercial",0,0,0,0,0]
[null,"Other",0,0,0,0,0]
[null,"Total",{"$f":"SUM(C204:C206)","v":0},{"$f":"SUM(D204:D206)","v":0},{"$f":"SUM(E204:E206)","v":0},{"$f":"SUM(F204:F206)","v":0},{"$f":"SUM(G204:G206)","v":0}]

{"sheet":"E5. New Connections","index":10,"n_rows":284,"n_cols":8,"rows_kept":284,"cut":false,"hidden":false,"merged":[[236,3,236,7],[276,3,276,7],[264,3,264,7],[265,3,265,7],[275,3,275,7],[237,3,237,7],[225,3,225,7],[226,3,226,7],[196,3,196,7],[197,3,197,7],[8,3,8,7],[9,3,9,7],[39,3,39,7],[40,3,40,7],[70,3,70,7],[71,3,71,7],[101,3,101,7],[102,3,102,7],[132,3,132,7],[133,3,133,7],[163,3,163,7],[164,3,164,7]]}
[null,{"$f":"INDEX(dms_Worksheet_List,MATCH(dms_Model,dms_Model_List))","v":"HISTORICAL ANNUAL REPORTING"}]
[null,{"$f":"INDEX(dms_TradingNameFull_List,MATCH(dms_TradingName,dms_TradingName_List))","v":"Australian Gas Networks Limited (reporting data for SA)"}]
[null,{"$f":"dms_Header_Span","v":"2014-15 to 2018-19"}]
[null,"E5. NEW CONNECTIONS"]
[]
[null,"E5.1 - EXPENDITURE"]
[null,"E5.1.1 - CAPEX - BY CONNECTION TYPE"]
[null,"A. DIRECT INTERNAL LABOUR EXPENDITURE"]
[null,null,null,"EXPENDITURE"]
[null,null,null,"$0's"]
[null,null,null,{"$f":"dms_y1","v":"2014-15"},{"$f":"dms_y2","v":"2015-16"},{"$f":"dms_y3","v":"2016-17"},{"$f":"dms_y4","v":"2017-18"},{"$f":"dms_y5","v":"2018-19"}]
[null,"(i)  ELECTRICITY TO GAS"]
[null,"Distribution Mains",null,0,0,0,0,0]
[null,"Inlet service pipes",null,0,0,0,0,0]
[null,"Meters",null,0,0,0,0,0]
[null,null,"Total",{"$f":"SUM(D13:D15)","v":0},{"$f":"SUM(E13:E15)","v":0},{"$f":"SUM(F13:F15)","v":0},{"$f":"SUM(G13:G15)","v":0},{"$f":"SUM(H13:H15)","v":0}]
[null,"(ii)  NEW HOMES"]
[null,"Distribution Mains",null,0,0,0,0,0]
[null,"Inlet service pipes",null,0,0,0,0,0]
[null,"Meters",null,0,0,0,0,0]
[null,null,"Total",{"$f":"SUM(D18:D20)","v":0},{"$f":"SUM(E18:E20)","v":0},{"$f":"SUM(F18:F20)","v":0},{"$f":"SUM(G18:G20)","v":0},{"$f":"SUM(H18:H20)","v":0}]
[null,"(iii)  NEW MEDIUM DENSITY / HIGH RISE"]
[null,"Distribution Mains",null,0,0,0,0,0]
[null,"Inlet service pipes",null,0,0,0,0,0]
[null,"Meters",null,0,0,0,0,0]
[null,null,"Total",{"$f":"SUM(D23:D25)","v":0},{"$f":"SUM(E23:E25)","v":0},{"$f":"SUM(F23:F25)","v":0},{"$f":"SUM(G23:G25)","v":0},{"$f":"SUM(H23:H25)","v":0}]
[null,"(iv)  INDUSTRIAL & COMMERCIAL TARIFF"]
[null,"Distribution Mains",null,0,0,0,0,0]
[null,"Inlet service pipes",null,0,0,0,0,0]
[null,"Meters",null,0,0,0,0,0]
[null,null,"Total",{"$f":"SUM(D28:D30)","v":0},{"$f":"SUM(E28:E30)","v":0},{"$f":"SUM(F28:F30)","v":0},{"$f":"SUM(G28:G30)","v":0},{"$f":"SUM(H28:H30)","v":0}]
[null,"(v)  INDUSTRIAL & COMMERCIAL CONTRACT"]
[null,"Distribution Mains",null,0,0,0,0,0]
[null,"Inlet service pipes",null,0,0,0,0,0]
[null,"Meters",null,0,0,0,0,0]
[null,null,"Total",{"$f":"SUM(D33:D35)","v":0},{"$f":"SUM(E33:E35)","v":0},{"$f":"SUM(F33:F35)","v":0},{"$f":"SUM(G33:G35)","v":0},{"$f":"SUM(H33:H35)","v":0}]
[null,null,"TOTAL",{"$f":"SUM(D36,D31,D26,D21,D16)","v":0},{"$f":"SUM(E36,E31,E26,E21,E16)","v":0},{"$f":"SUM(F36,F31,F26,F21,F16)","v":0},{"$f":"SUM(G36,G31,G26,G21,G16)","v":0},{"$f":"SUM(H36,H31,H26,H21,H16)","v":0}]
[]
[null,"B. DIRECT CONTRACTOR EXPENDITURE"]
[null,null,null,"EXPENDITURE"]
[null,null,null,"$0's"]
[null,null,null,{"$f":"dms_y1","v":"2014-15"},{"$f":"dms_y2","v":"2015-16"},{"$f":"dms_y3","v":"2016-17"},{"$f":"dms_y4","v":"2017-18"},{"$f":"dms_y5","v":"2018-19"}]
[null,"(i)  ELECTRICITY TO GAS"]
[null,"Distribution Mains"]
[null,"Inlet service pipes"]
[null,"Meters"]
[null,null,"Total",{"$f":"SUM(D44:D46)","v":0},{"$f":"SUM(E44:E46)","v":0},{"$f":"SUM(F44:F46)","v":0},{"$f":"SUM(G44:G46)","v":0},{"$f":"SUM(H44:H46)","v":0}]
[null,"(ii)  NEW HOMES"]
[null,"Distribution Mains"]
[null,"Inlet service pipes"]
[null,"Meters"]
[null,null,"Total",{"$f":"SUM(D49:D51)","v":0},{"$f":"SUM(E49:E51)","v":0},{"$f":"SUM(F49:F51)","v":0},{"$f":"SUM(G49:G51)","v":0},{"$f":"SUM(H49:H51)","v":0}]
[null,"(iii)  NEW MEDIUM DENSITY / HIGH RISE"]
[null,"Distribution Mains"]
[null,"Inlet service pipes"]
[null,"Meters"]
[null,null,"Total",{"$f":"SUM(D54:D56)","v":0},{"$f":"SUM(E54:E56)","v":0},{"$f":"SUM(F54:F56)","v":0},{"$f":"SUM(G54:G56)","v":0},{"$f":"SUM(H54:H56)","v":0}]
[null,"(iv)  INDUSTRIAL & COMMERCIAL TARIFF"]
[null,"Distribution Mains"]
[null,"Inlet service pipes"]
[null,"Meters"]
[null,null,"Total",{"$f":"SUM(D59:D61)","v":0},{"$f":"SUM(E59:E61)","v":0},{"$f":"SUM(F59:F61)","v":0},{"$f":"SUM(G59:G61)","v":0},{"$f":"SUM(H59:H61)","v":0}]
[null,"(v)  INDUSTRIAL & COMMERCIAL CONTRACT"]
[null,"Distribution Mains"]
[null,"Inlet service pipes"]
[null,"Meters"]
[null,null,"Total",{"$f":"SUM(D64:D66)","v":0},{"$f":"SUM(E64:E66)","v":0},{"$f":"SUM(F64:F66)","v":0},{"$f":"SUM(G64:G66)","v":0},{"$f":"SUM(H64:H66)","v":0}]
[null,null,"TOTAL",{"$f":"SUM(D67,D62,D57,D52,D47)","v":0},{"$f":"SUM(E67,E62,E57,E52,E47)","v":0},{"$f":"SUM(F67,F62,F57,F52,F47)","v":0},{"$f":"SUM(G67,G62,G57,G52,G47)","v":0},{"$f":"SUM(H67,H62,H57,H52,H47)","v":0}]
[]
[null,"C. OTHER INTERNAL DIRECT EXPENDITURE"]
[null,null,null,"EXPENDITURE"]
[null,null,null,"$0's"]
[null,null,null,{"$f":"dms_y1","v":"2014-15"},{"$f":"dms_y2","v":"2015-16"},{"$f":"dms_y3","v":"2016-17"},{"$f":"dms_y4","v":"2017-18"},{"$f":"dms_y5","v":"2018-19"}]
[null,"(i)  ELECTRICITY TO GAS"]
[null,"Distribution Mains",null,0,0,0,0,0]
[null,"Inlet service pipes",null,0,0,0,0,0]
[null,"Meters",null,0,0,0,0,0]
[null,null,"Total",{"$f":"SUM(D75:D77)","v":0},{"$f":"SUM(E75:E77)","v":0},{"$f":"SUM(F75:F77)","v":0},{"$f":"SUM(G75:G77)","v":0},{"$f":"SUM(H75:H77)","v":0}]
[null,"(ii)  NEW HOMES"]
[null,"Distribution Mains",null,0,0,0,0,0]
[null,"Inlet service pipes",null,0,0,0,0,0]
[null,"Meters",null,0,0,0,0,0]
[null,null,"Total",{"$f":"SUM(D80:D82)","v":0},{"$f":"SUM(E80:E82)","v":0},{"$f":"SUM(F80:F82)","v":0},{"$f":"SUM(G80:G82)","v":0},{"$f":"SUM(H80:H82)","v":0}]
[null,"(iii)  NEW MEDIUM DENSITY / HIGH RISE"]
[null,"Distribution Mains",null,0,0,0,0,0]
[null,"Inlet service pipes",null,0,0,0,0,0]
[null,"Meters",null,0,0,0,0,0]
[null,null,"Total",{"$f":"SUM(D85:D87)","v":0},{"$f":"SUM(E85:E87)","v":0},{"$f":"SUM(F85:F87)","v":0},{"$f":"SUM(G85:G87)","v":0},{"$f":"SUM(H85:H87)","v":0}]
[null,"(iv)  INDUSTRIAL & COMMERCIAL TARIFF"]
[null,"Distribution Mains",null,0,0,0,0,0]
[null,"Inlet service pipes",null,0,0,0,0,0]
[null,"Meters",null,0,0,0,0,0]
[null,null,"Total",{"$f":"SUM(D90:D92)","v":0},{"$f":"SUM(E90:E92)","v":0},{"$f":"SUM(F90:F92)","v":0},{"$f":"SUM(G90:G92)","v":0},{"$f":"SUM(H90:H92)","v":0}]
[null,"(v)  INDUSTRIAL & COMMERCIAL CONTRACT"]
[null,"Distribution Mains",null,0,0,0,0,0]
[null,"Inlet service pipes",null,0,0,0,0,0]
[null,"Meters",null,0,0,0,0,0]
[null,null,"Total",{"$f":"SUM(D95:D97)","v":0},{"$f":"SUM(E95:E97)","v":0},{"$f":"SUM(F95:F97)","v":0},{"$f":"SUM(G95:G97)","v":0},{"$f":"SUM(H95:H97)","v":0}]
[null,null,"TOTAL",{"$f":"SUM(D98,D93,D88,D83,D78)","v":0},{"$f":"SUM(E98,E93,E88,E83,E78)","v":0},{"$f":"SUM(F98,F93,F88,F83,F78)","v":0},{"$f":"SUM(G98,G93,G88,G83,G78)","v":0},{"$f":"SUM(H98,H93,H88,H83,H78)","v":0}]
[]
[null,"D. TOTAL OVERHEAD EXPENDITURE"]
[null,null,null,"EXPENDITURE"]
[null,null,null,"$0's"]
[null,null,null,{"$f":"dms_y1","v":"2014-15"},{"$f":"dms_y2","v":"2015-16"},{"$f":"dms_y3","v":"2016-17"},{"$f":"dms_y4","v":"2017-18"},{"$f":"dms_y5","v":"2018-19"}]
[null,"(i)  ELECTRICITY TO GAS"]
[null,"Distribution Mains",null,148532.38671712423,184052.43620451685,131343.79391131701,430097.37532994035,335459.06512915273]
[null,"Inlet service pipes",null,221701.62549666147,287255.7663793987,235467.28197435607,296270.63747007679,196047.23752017957]
[null,"Meters",null,41040.251982641021,33378.983668419409,31892.924277060891,27032.728051134512,19888.491047667078]
[null,null,"Total",{"$f":"SUM(D106:D108)","v":411274.26419642667},{"$f":"SUM(E106:E108)","v":504687.18625233497},{"$f":"SUM(F106:F108)","v":398704.00016273395},{"$f":"SUM(G106:G108)","v":753400.74085115164},{"$f":"SUM(H106:H108)","v":551394.79369699943}]
[null,"(ii)  NEW HOMES"]
[null,"Distribution Mains",null,536050.89118439192,765553.43868512195,760362.59735135431,112033.12600746533,212931.66350528027]
[null,"Inlet service pipes",null,774745.49579056422,1010616.0893084606,682239.77000212832,772519.80384869943,735471.92942774994]
[null,"Meters",null,234714.19500776674,178999.901166836,182964.67085261247,160147.37599974431,155022.85099478532]
[null,null,"Total",{"$f":"SUM(D111:D113)","v":1545510.581982723},{"$f":"SUM(E111:E113)","v":1955169.4291604187},{"$f":"SUM(F111:F113)","v":1625567.0382060951},{"$f":"SUM(G111:G113)","v":1044700.305855909},{"$f":"SUM(H111:H113)","v":1103426.4439278156}]
[null,"(iii)  NEW MEDIUM DENSITY / HIGH RISE"]
[null,"Distribution Mains",null,0,0,0,0,0]
[null,"Inlet service pipes",null,152905.1178377434,144488.28408537581,135971.30272864425,172540.67090182944,162936.5109883495]
[null,"Meters",null,21092.746500909452,34924.547098910567,12710.161404979299,9523.0000422611483,11152.124975082746]
[null,null,"Total",{"$f":"SUM(D116:D118)","v":173997.86433865284},{"$f":"SUM(E116:E118)","v":179412.83118428639},{"$f":"SUM(F116:F118)","v":148681.46413362355},{"$f":"SUM(G116:G118)","v":182063.67094409058},{"$f":"SUM(H116:H118)","v":174088.63596343226}]
[null,"(iv)  INDUSTRIAL & COMMERCIAL TARIFF"]
[null,"Distribution Mains",null,74898.365527788774,104087.84581421466,56343.602888149981,71931.980325869925,138512.84923276963]
[null,"Inlet service pipes",null,140130.82253607441,191685.68560804662,140699.30886114022,170474.66974389579,185865.25656263085]
[null,"Meters",null,90191.246094646514,84501.88102701852,75833.589920788683,114400.13829070832,138263.74120051501]
[null,null,"Total",{"$f":"SUM(D121:D123)","v":305220.43415850971},{"$f":"SUM(E121:E123)","v":380275.4124492798},{"$f":"SUM(F121:F123)","v":272876.50167007884},{"$f":"SUM(G121:G123)","v":356806.78836047405},{"$f":"SUM(H121:H123)","v":462641.84699591546}]
[null,"(v)  INDUSTRIAL & COMMERCIAL CONTRACT"]
[null,"Distribution Mains",null,1844.4075249763428,10303.762291543178,10098.168422801664,19974.027761535101,25616.39492663656]
[null,"Inlet service pipes",null,94.615479144239785,262.24255049379099,3128.2705991911707,5223.2304704799772,4911.4453720993897]
[null,"Meters",null,17559.194678796979,44794.073235665048,37225.690625826843,27589.993240945536,21375.615749492215]
[null,null,"Total",{"$f":"SUM(D126:D128)","v":19498.217682917562},{"$f":"SUM(E126:E128)","v":55360.078077702019},{"$f":"SUM(F126:F128)","v":50452.129647819675},{"$f":"SUM(G126:G128)","v":52787.251472960612},{"$f":"SUM(H126:H128)","v":51903.456048228167}]
[null,null,"TOTAL",{"$f":"SUM(D129,D124,D119,D114,D109)","v":2455501.3623592299},{"$f":"SUM(E129,E124,E119,E114,E109)","v":3074904.9371240223},{"$f":"SUM(F129,F124,F119,F114,F109)","v":2496281.1338203512},{"$f":"SUM(G129,G124,G119,G114,G109)","v":2389758.757484586},{"$f":"SUM(H129,H124,H119,H114,H109)","v":2343455.1766323908}]
[]
[null,"E. RELATED PARTY MARGIN EXPENDITURE"]
[null,null,null,"EXPENDITURE"]
[null,null,null,"$0's"]
[null,null,null,{"$f":"dms_y1","v":"2014-15"},{"$f":"dms_y2","v":"2015-16"},{"$f":"dms_y3","v":"2016-17"},{"$f":"dms_y4","v":"2017-18"},{"$f":"dms_y5","v":"2018-19"}]
[null,"(i)  ELECTRICITY TO GAS"]
[null,"Distribution Mains",null,0,0,0,0,0]
[null,"Inlet service pipes",null,0,0,0,0,0]
[null,"Meters",null,0,0,0,0,0]
[null,null,"Total",{"$f":"SUM(D137:D139)","v":0},{"$f":"SUM(E137:E139)","v":0},{"$f":"SUM(F137:F139)","v":0},{"$f":"SUM(G137:G139)","v":0},{"$f":"SUM(H137:H139)","v":0}]
[null,"(ii)  NEW HOMES"]
[null,"Distribution Mains",null,0,0,0,0,0]
[null,"Inlet service pipes",null,0,0,0,0,0]
[null,"Meters",null,0,0,0,0,0]
[null,null,"Total",{"$f":"SUM(D142:D144)","v":0},{"$f":"SUM(E142:E144)","v":0},{"$f":"SUM(F142:F144)","v":0},{"$f":"SUM(G142:G144)","v":0},{"$f":"SUM(H142:H144)","v":0}]
[null,"(iii)  NEW MEDIUM DENSITY / HIGH RISE"]
[null,"Distribution Mains",null,0,0,0,0,0]
[null,"Inlet service pipes",null,0,0,0,0,0]
[null,"Meters",null,0,0,0,0,0]
[null,null,"Total",{"$f":"SUM(D147:D149)","v":0},{"$f":"SUM(E147:E149)","v":0},{"$f":"SUM(F147:F149)","v":0},{"$f":"SUM(G147:G149)","v":0},{"$f":"SUM(H147:H149)","v":0}]
[null,"(iv)  INDUSTRIAL & COMMERCIAL TARIFF"]
[null,"Distribution Mains",null,0,0,0,0,0]
[null,"Inlet service pipes",null,0,0,0,0,0]
[null,"Meters",null,0,0,0,0,0]
[null,null,"Total",{"$f":"SUM(D152:D154)","v":0},{"$f":"SUM(E152:E154)","v":0},{"$f":"SUM(F152:F154)","v":0},{"$f":"SUM(G152:G154)","v":0},{"$f":"SUM(H152:H154)","v":0}]
[null,"(v)  INDUSTRIAL & COMMERCIAL CONTRACT"]
[null,"Distribution Mains",null,0,0,0,0,0]
[null,"Inlet service pipes",null,0,0,0,0,0]
[null,"Meters",null,0,0,0,0,0]
[null,null,"Total",{"$f":"SUM(D157:D159)","v":0},{"$f":"SUM(E157:E159)","v":0},{"$f":"SUM(F157:F159)","v":0},{"$f":"SUM(G157:G159)","v":0},{"$f":"SUM(H157:H159)","v":0}]
[null,null,"TOTAL",{"$f":"SUM(D160,D155,D150,D145,D140)","v":0},{"$f":"SUM(E160,E155,E150,E145,E140)","v":0},{"$f":"SUM(F160,F155,F150,F145,F140)","v":0},{"$f":"SUM(G160,G155,G150,G145,G140)","v":0},{"$f":"SUM(H160,H155,H150,H145,H140)","v":0}]
[]
[null,"F. CAPITAL CONTRIBUTIONS included in the above"]
[null,null,null,"EXPENDITURE"]
[null,null,null,"$0's"]
[null,null,null,{"$f":"dms_y1","v":"2014-15"},{"$f":"dms_y2","v":"2015-16"},{"$f":"dms_y3","v":"2016-17"},{"$f":"dms_y4","v":"2017-18"},{"$f":"dms_y5","v":"2018-19"}]
[null,"(i)  ELECTRICITY TO GAS"]
[null,"Distribution Mains",null,0,0,0,0,0]
[null,"Inlet service pipes",null,0,0,0,0,0]
[null,"Meters",null,0,0,0,0,0]
[null,null,"Total",{"$f":"SUM(D168:D170)","v":0},{"$f":"SUM(E168:E170)","v":0},{"$f":"SUM(F168:F170)","v":0},{"$f":"SUM(G168:G170)","v":0},{"$f":"SUM(H168:H170)","v":0}]
[null,"(ii)  NEW HOMES"]
[null,"Distribution Mains"]
[null,"Inlet service pipes"]
[null,"Meters"]
[null,null,"Total",{"$f":"SUM(D173:D175)","v":0},{"$f":"SUM(E173:E175)","v":0},{"$f":"SUM(F173:F175)","v":0},{"$f":"SUM(G173:G175)","v":0},{"$f":"SUM(H173:H175)","v":0}]
[null,"(iii)  NEW MEDIUM DENSITY / HIGH RISE"]
[null,"Distribution Mains",null,0,0,0,0,0]
[null,"Inlet service pipes",null,0,0,0,0,0]
[null,"Meters",null,0,0,0,0,0]
[null,null,"Total",{"$f":"SUM(D178:D180)","v":0},{"$f":"SUM(E178:E180)","v":0},{"$f":"SUM(F178:F180)","v":0},{"$f":"SUM(G178:G180)","v":0},{"$f":"SUM(H178:H180)","v":0}]
[null,"(iv)  INDUSTRIAL & COMMERCIAL TARIFF"]
[null,"Distribution Mains",null,0,0,0,0,0]
[null,"Inlet service pipes",null,0,0,0,0,0]
[null,"Meters",null,0,0,0,0,0]
[null,null,"Total",{"$f":"SUM(D183:D185)","v":0},{"$f":"SUM(E183:E185)","v":0},{"$f":"SUM(F183:F185)","v":0},{"$f":"SUM(G183:G185)","v":0},{"$f":"SUM(H183:H185)","v":0}]
[null,"(v)  INDUSTRIAL & COMMERCIAL CONTRACT"]
[null,"Distribution Mains"]
[null,"Inlet service pipes"]
[null,"Meters"]
[null,null,"Total",{"$f":"SUM(D188:D190)","v":0},{"$f":"SUM(E188:E190)","v":0},{"$f":"SUM(F188:F190)","v":0},{"$f":"SUM(G188:G190)","v":0},{"$f":"SUM(H188:H190)","v":0}]
[null,null,"TOTAL",{"$f":"SUM(D191,D186,D181,D176,D171)","v":0},{"$f":"SUM(E191,E186,E181,E176,E171)","v":0},{"$f":"SUM(F191,F186,F181,F176,F171)","v":0},{"$f":"SUM(G191,G186,G181,G176,G171)","v":0},{"$f":"SUM(H191,H186,H181,H176,H171)","v":0}]
[]
[]
[null,"E5.2 - UNIT RATES"]
[null,"E5.2.1 - UNIT RATES - PER CONNECTION - BY CONNECTION TYPE"]
[null,null,null,"RATES PER CONNECTION"]
[null,null,null,"$0's"]
[null,null,"Units",{"$f":"dms_y1","v":"2014-15"},{"$f":"dms_y2","v":"2015-16"},{"$f":"dms_y3","v":"2016-17"},{"$f":"dms_y4","v":"2017-18"},{"$f":"dms_y5","v":"2018-19"}]
[null,"A. ELECTRICITY TO GAS"]
[null,"Distribution mains","per metre per connection"]
[null,"Inlet service pipes","per service per connection"]
[null,"Meters","number per connection"]
[null,"B. NEW HOMES"]
[null,"Distribution mains","per metre per connection"]
[null,"Inlet service pipes","per service per connection"]
[null,"Meters","number per connection"]
[null,"C. NEW MEDIUM DENSITY / HIGH RISE"]
[null,"Distribution mains","per metre per connection"]
[null,"Inlet service pipes","per service per connection"]
[null,"Meters","number per connection"]
[null,"D. INDUSTRIAL & COMMERCIAL TARIFF"]
[null,"Distribution mains","per metre per connection"]
[null,"Inlet service pipes","per service per connection"]
[null,"Meters","number per connection"]
[null,"E. INDUSTRIAL & COMMERCIAL CONTRACT"]
[null,"Distribution mains","per metre per connection"]
[null,"Inlet service pipes","per service per connection"]
[null,"Meters","number per connection"]
[]
[]
[]
[]
[null,"E5.3 - VOLUMES"]
[null,"E5.3.1 - NUMBER OF NEW CONNECTIONS"]
[null,null,null,"VOLUMES"]
[null,null,null,"0s"]
[null,null,null,{"$f":"dms_y1","v":"2014-15"},{"$f":"dms_y2","v":"2015-16"},{"$f":"dms_y3","v":"2016-17"},{"$f":"dms_y4","v":"2017-18"},{"$f":"dms_y5","v":"2018-19"}]
[null,"Electricity to gas",null,1093,1022,1102,1161,852]
[null,"New homes",null,6251,6022,6322,6878,6641]
[null,"New medium density / high rise",null,561,1170,432,196,472]
[null,"Industrial and commericla tariff",null,196,349,335,438,455]
[null,"Industrial and commericla contract",null,1,2,4,1,5]
[null,null,"Total",{"$f":"SUM(D229:D233)","v":8102},{"$f":"SUM(E229:E233)","v":8565},{"$f":"SUM(F229:F233)","v":8195},{"$f":"SUM(G229:G233)","v":8674},{"$f":"SUM(H229:H233)","v":8425}]
[]
[null,"E5.3.2 - VOLUMES - PER CONNECTION - BY CONNECTION TYPE"]
[null,null,null,"VOLUMES"]
[null,null,null,"0s"]
[null,null,"Units",{"$f":"dms_y1","v":"2014-15"},{"$f":"dms_y2","v":"2015-16"},{"$f":"dms_y3","v":"2016-17"},{"$f":"dms_y4","v":"2017-18"},{"$f":"dms_y5","v":"2018-19"}]
[null,"A. ELECTRICITY TO GAS"]
[null,"Distribution mains","metres per connection"]
[null,"Inlet service pipes","number per connection"]
[null,"Meters","number per connection"]
[null,"B. NEW HOMES"]
[null,"Distribution mains","metres per connection"]
[null,"Inlet service pipes","number per connection"]
[null,"Meters","number per connection"]
[null,"C. NEW MEDIUM DENSITY / HIGH RISE"]
[null,"Distribution mains","metres per connection"]
[null,"Inlet service pipes","number per connection"]
[null,"Meters","number per connection"]
[null,"D. INDUSTRIAL & COMMERCIAL TARIFF"]
[null,"Distribution mains","metres per connection"]
[null,"Inlet service pipes","number per connection"]
[null,"Meters","number per connection"]
[null,"E. INDUSTRIAL & COMMERCIAL CONTRACT"]
[null,"Distribution mains","metres per connection"]
[null,"Inlet service pipes","number per connection"]
[null,"Meters","number per connection"]
[]
[]
[]
[null,"E5.4 -  CAPITAL CONTRIBUTIONS"]
[null,"E5.4.1 - VALUE OF CAPITAL CONTRIBUTIONS - BY CONNECTION TYPE"]
[null,null,null,"VALUE"]
[null,null,null,"$0's"]
[null,null,null,{"$f":"dms_y1","v":"2014-15"},{"$f":"dms_y2","v":"2015-16"},{"$f":"dms_y3","v":"2016-17"},{"$f":"dms_y4","v":"2017-18"},{"$f":"dms_y5","v":"2018-19"}]
[null,"Electricity to gas",null,0,0,0,0,0]
[null,"New homes",null,195816.49230770016,121013.53846153847,60869.845384618413,80186.615384615376,103245.15384615384]
[null,"New medium density / high rise",null,0,0,0,0,0]
[null,"Industrial & commercial tariff",null,0,0,0,0,0]
[null,"Industrial & commercial contract",null,191575.57768291756,443421.06807770196,571444.23964781978,607352.73147296091,605356.36604822823]
[null,null,"Total",{"$f":"SUM(D268:D272)","v":387392.06999061769},{"$f":"SUM(E268:E272)","v":564434.60653924046},{"$f":"SUM(F268:F272)","v":632314.08503243816},{"$f":"SUM(G268:G272)","v":687539.34685757628},{"$f":"SUM(H268:H272)","v":708601.5198943821}]
[]
[null,"E5.4.2 - NUMBER OF CAPITAL CONTRIBUTIONS - BY CONNECTION TYPE"]
[null,null,null,"VOLUMES"]
[null,null,null,"0's"]
[null,null,null,{"$f":"dms_y1","v":"2014-15"},{"$f":"dms_y2","v":"2015-16"},{"$f":"dms_y3","v":"2016-17"},{"$f":"dms_y4","v":"2017-18"},{"$f":"dms_y5","v":"2018-19"}]
[null,"Electricity to gas"]
[null,"New homes"]
[null,"New medium density / high rise"]
[null,"Industrial & commercial tariff"]
[null,"Industrial & commercial contract"]
[null,null,"Total",{"$f":"SUM(D279:D283)","v":0},{"$f":"SUM(E279:E283)","v":0},{"$f":"SUM(F279:F283)","v":0},{"$f":"SUM(G279:G283)","v":0},{"$f":"SUM(H279:H283)","v":0}]

{"sheet":"E6. Non-network","index":11,"n_rows":142,"n_cols":7,"rows_kept":142,"cut":false,"hidden":false,"merged":[[27,2,27,6],[28,2,28,6]]}
[null,{"$f":"INDEX(dms_Worksheet_List,MATCH(dms_Model,dms_Model_List))","v":"HISTORICAL ANNUAL REPORTING"}]
[null,{"$f":"INDEX(dms_TradingNameFull_List,MATCH(dms_TradingName,dms_TradingName_List))","v":"Australian Gas Networks Limited (reporting data for SA)"}]
[null,{"$f":"dms_Header_Span","v":"2014-15 to 2018-19"}]
[null,"E6. NON-NETWORK EXPENDITURE"]
[]
[null,"E6.5 - TELEMETRY"]
[]
[null,"Please list all projects here:"]
[null,"SEE BELOW"]
[]
[]
[]
[]
[]
[]
[]
[]
[]
[]
[]
[]
[]
[]
[]
[]
[null,"E6.5.1 - CAPEX - BY PROJECT"]
[null,"A. DIRECT INTERNAL LABOUR EXPENDITURE"]
[null,null,"EXPENDITURE"]
[null,null,"$0's"]
[null,null,{"$f":"dms_y1","v":"2014-15"},{"$f":"dms_y2","v":"2015-16"},{"$f":"dms_y3","v":"2016-17"},{"$f":"dms_y4","v":"2017-18"},{"$f":"dms_y5","v":"2018-19"}]
[null,{"$f":"IF(ISBLANK(dms_E65_Projects_01),\"\",dms_E65_Projects_01)","v":"SEE BELOW"},0,0,0,0,0]
[null,{"$f":"IF(ISBLANK(dms_E65_Projects_02),\"\",dms_E65_Projects_02)","v":""},0,0,0,0,0]
[null,{"$f":"IF(ISBLANK(dms_E65_Projects_03),\"\",dms_E65_Projects_03)","v":""},0,0,0,0,0]
[null,{"$f":"IF(ISBLANK(dms_E65_Projects_04),\"\",dms_E65_Projects_04)","v":""},0,0,0,0,0]
[null,{"$f":"IF(ISBLANK(dms_E65_Projects_05),\"\",dms_E65_Projects_05)","v":""},0,0,0,0,0]
[null,{"$f":"IF(ISBLANK(dms_E65_Projects_06),\"\",dms_E65_Projects_06)","v":""},0,0,0,0,0]
[null,{"$f":"IF(ISBLANK(dms_E65_Projects_07),\"\",dms_E65_Projects_07)","v":""},0,0,0,0,0]
[null,{"$f":"IF(ISBLANK(dms_E65_Projects_08),\"\",dms_E65_Projects_08)","v":""},0,0,0,0,0]
[null,{"$f":"IF(ISBLANK(dms_E65_Projects_09),\"\",dms_E65_Projects_09)","v":""},0,0,0,0,0]
[null,{"$f":"IF(ISBLANK(dms_E65_Projects_10),\"\",dms_E65_Projects_10)","v":""},0,0,0,0,0]
[null,{"$f":"IF(ISBLANK(dms_E65_Projects_11),\"\",dms_E65_Projects_11)","v":""},0,0,0,0,0]
[null,{"$f":"IF(ISBLANK(dms_E65_Projects_12),\"\",dms_E65_Projects_12)","v":""},0,0,0,0,0]
[null,{"$f":"IF(ISBLANK(dms_E65_Projects_13),\"\",dms_E65_Projects_13)","v":""},0,0,0,0,0]
[null,{"$f":"IF(ISBLANK(dms_E65_Projects_14),\"\",dms_E65_Projects_14)","v":""},0,0,0,0,0]
[null,{"$f":"IF(ISBLANK(dms_E65_Projects_15),\"\",dms_E65_Projects_15)","v":""},0,0,0,0,0]
[null,"Aggregate of other projects with total expenditure of less than $500,000",0,0,0,0,0]
[null,"Total",{"$f":"SUM(C31:C46)","v":0},{"$f":"SUM(D31:D46)","v":0},{"$f":"SUM(E31:E46)","v":0},{"$f":"SUM(F31:F46)","v":0},{"$f":"SUM(G31:G46)","v":0}]
[]
[null,"B. DIRECT CONTRACTOR EXPENDITURE"]
[null,{"$f":"IF(ISBLANK(dms_E65_Projects_01),\"\",dms_E65_Projects_01)","v":"SEE BELOW"},0,0,0,0,0]
[null,{"$f":"IF(ISBLANK(dms_E65_Projects_02),\"\",dms_E65_Projects_02)","v":""},0,0,0,0,0]
[null,{"$f":"IF(ISBLANK(dms_E65_Projects_03),\"\",dms_E65_Projects_03)","v":""},0,0,0,0,0]
[null,{"$f":"IF(ISBLANK(dms_E65_Projects_04),\"\",dms_E65_Projects_04)","v":""},0,0,0,0,0]
[null,{"$f":"IF(ISBLANK(dms_E65_Projects_05),\"\",dms_E65_Projects_05)","v":""},0,0,0,0,0]
[null,{"$f":"IF(ISBLANK(dms_E65_Projects_06),\"\",dms_E65_Projects_06)","v":""},0,0,0,0,0]
[null,{"$f":"IF(ISBLANK(dms_E65_Projects_07),\"\",dms_E65_Projects_07)","v":""},0,0,0,0,0]
[null,{"$f":"IF(ISBLANK(dms_E65_Projects_08),\"\",dms_E65_Projects_08)","v":""},0,0,0,0,0]
[null,{"$f":"IF(ISBLANK(dms_E65_Projects_09),\"\",dms_E65_Projects_09)","v":""},0,0,0,0,0]
[null,{"$f":"IF(ISBLANK(dms_E65_Projects_10),\"\",dms_E65_Projects_10)","v":""},0,0,0,0,0]
[null,{"$f":"IF(ISBLANK(dms_E65_Projects_11),\"\",dms_E65_Projects_11)","v":""},0,0,0,0,0]
[null,{"$f":"IF(ISBLANK(dms_E65_Projects_12),\"\",dms_E65_Projects_12)","v":""},0,0,0,0,0]
[null,{"$f":"IF(ISBLANK(dms_E65_Projects_13),\"\",dms_E65_Projects_13)","v":""},0,0,0,0,0]
[null,{"$f":"IF(ISBLANK(dms_E65_Projects_14),\"\",dms_E65_Projects_14)","v":""},0,0,0,0,0]
[null,{"$f":"IF(ISBLANK(dms_E65_Projects_15),\"\",dms_E65_Projects_15)","v":""},0,0,0,0,0]
[null,"Aggregate of other projects with total expenditure of less than $500,000",189543.43000000002,166729.73999999993,181837.75999999998,2767.2299999999996,188599.59]
[null,"Total",{"$f":"SUM(C50:C65)","v":189543.43000000002},{"$f":"SUM(D50:D65)","v":166729.73999999993},{"$f":"SUM(E50:E65)","v":181837.75999999998},{"$f":"SUM(F50:F65)","v":2767.2299999999996},{"$f":"SUM(G50:G65)","v":188599.59}]
[]
[null,"C. OTHER INTERNAL DIRECT EXPENDITURE"]
[null,{"$f":"IF(ISBLANK(dms_E65_Projects_01),\"\",dms_E65_Projects_01)","v":"SEE BELOW"},0,0,0,0,0]
[null,{"$f":"IF(ISBLANK(dms_E65_Projects_02),\"\",dms_E65_Projects_02)","v":""},0,0,0,0,0]
[null,{"$f":"IF(ISBLANK(dms_E65_Projects_03),\"\",dms_E65_Projects_03)","v":""},0,0,0,0,0]
[null,{"$f":"IF(ISBLANK(dms_E65_Projects_04),\"\",dms_E65_Projects_04)","v":""},0,0,0,0,0]
[null,{"$f":"IF(ISBLANK(dms_E65_Projects_05),\"\",dms_E65_Projects_05)","v":""},0,0,0,0,0]
[null,{"$f":"IF(ISBLANK(dms_E65_Projects_06),\"\",dms_E65_Projects_06)","v":""},0,0,0,0,0]
[null,{"$f":"IF(ISBLANK(dms_E65_Projects_07),\"\",dms_E65_Projects_07)","v":""},0,0,0,0,0]
[null,{"$f":"IF(ISBLANK(dms_E65_Projects_08),\"\",dms_E65_Projects_08)","v":""},0,0,0,0,0]
[null,{"$f":"IF(ISBLANK(dms_E65_Projects_09),\"\",dms_E65_Projects_09)","v":""},0,0,0,0,0]
[null,{"$f":"IF(ISBLANK(dms_E65_Projects_10),\"\",dms_E65_Projects_10)","v":""},0,0,0,0,0]
[null,{"$f":"IF(ISBLANK(dms_E65_Projects_11),\"\",dms_E65_Projects_11)","v":""},0,0,0,0,0]
[null,{"$f":"IF(ISBLANK(dms_E65_Projects_12),\"\",dms_E65_Projects_12)","v":""},0,0,0,0,0]
[null,{"$f":"IF(ISBLANK(dms_E65_Projects_13),\"\",dms_E65_Projects_13)","v":""},0,0,0,0,0]
[null,{"$f":"IF(ISBLANK(dms_E65_Projects_14),\"\",dms_E65_Projects_14)","v":""},0,0,0,0,0]
[null,{"$f":"IF(ISBLANK(dms_E65_Projects_15),\"\",dms_E65_Projects_15)","v":""},0,0,0,0,0]
[null,"Aggregate of other projects with total expenditure of less than $500,000",0,0,0,0,0]
[null,"Total",{"$f":"SUM(C69:C84)","v":0},{"$f":"SUM(D69:D84)","v":0},{"$f":"SUM(E69:E84)","v":0},{"$f":"SUM(F69:F84)","v":0},{"$f":"SUM(G69:G84)","v":0}]
[]
[null,"D. TOTAL OVERHEAD EXPENDITURE"]
[null,{"$f":"IF(ISBLANK(dms_E65_Projects_01),\"\",dms_E65_Projects_01)","v":"SEE BELOW"},0,0,0,0,0]
[null,{"$f":"IF(ISBLANK(dms_E65_Projects_02),\"\",dms_E65_Projects_02)","v":""},0,0,0,0,0]
[null,{"$f":"IF(ISBLANK(dms_E65_Projects_03),\"\",dms_E65_Projects_03)","v":""},0,0,0,0,0]
[null,{"$f":"IF(ISBLANK(dms_E65_Projects_04),\"\",dms_E65_Projects_04)","v":""},0,0,0,0,0]
[null,{"$f":"IF(ISBLANK(dms_E65_Projects_05),\"\",dms_E65_Projects_05)","v":""},0,0,0,0,0]
[null,{"$f":"IF(ISBLANK(dms_E65_Projects_06),\"\",dms_E65_Projects_06)","v":""},0,0,0,0,0]
[null,{"$f":"IF(ISBLANK(dms_E65_Projects_07),\"\",dms_E65_Projects_07)","v":""},0,0,0,0,0]
[null,{"$f":"IF(ISBLANK(dms_E65_Projects_08),\"\",dms_E65_Projects_08)","v":""},0,0,0,0,0]
[null,{"$f":"IF(ISBLANK(dms_E65_Projects_09),\"\",dms_E65_Projects_09)","v":""},0,0,0,0,0]
[null,{"$f":"IF(ISBLANK(dms_E65_Projects_10),\"\",dms_E65_Projects_10)","v":""},0,0,0,0,0]
[null,{"$f":"IF(ISBLANK(dms_E65_Projects_11),\"\",dms_E65_Projects_11)","v":""},0,0,0,0,0]
[null,{"$f":"IF(ISBLANK(dms_E65_Projects_12),\"\",dms_E65_Projects_12)","v":""},0,0,0,0,0]
[null,{"$f":"IF(ISBLANK(dms_E65_Projects_13),\"\",dms_E65_Projects_13)","v":""},0,0,0,0,0]
[null,{"$f":"IF(ISBLANK(dms_E65_Projects_14),\"\",dms_E65_Projects_14)","v":""},0,0,0,0,0]
[null,{"$f":"IF(ISBLANK(dms_E65_Projects_15),\"\",dms_E65_Projects_15)","v":""},0,0,0,0,0]
[null,"Aggregate of other projects with total expenditure of less than $500,000",21213.658128909603,15144.546817102071,17584.497819826196,503.08239082501143,16981.547567507201]
[null,"Total",{"$f":"SUM(C88:C103)","v":21213.658128909603},{"$f":"SUM(D88:D103)","v":15144.546817102071},{"$f":"SUM(E88:E103)","v":17584.497819826196},{"$f":"SUM(F88:F103)","v":503.08239082501143},{"$f":"SUM(G88:G103)","v":16981.547567507201}]
[]
[null,"E. RELATED PARTY MARGIN EXPENDITURE"]
[null,{"$f":"IF(ISBLANK(dms_E65_Projects_01),\"\",dms_E65_Projects_01)","v":"SEE BELOW"},0,0,0,0,0]
[null,{"$f":"IF(ISBLANK(dms_E65_Projects_02),\"\",dms_E65_Projects_02)","v":""},0,0,0,0,0]
[null,{"$f":"IF(ISBLANK(dms_E65_Projects_03),\"\",dms_E65_Projects_03)","v":""},0,0,0,0,0]
[null,{"$f":"IF(ISBLANK(dms_E65_Projects_04),\"\",dms_E65_Projects_04)","v":""},0,0,0,0,0]
[null,{"$f":"IF(ISBLANK(dms_E65_Projects_05),\"\",dms_E65_Projects_05)","v":""},0,0,0,0,0]
[null,{"$f":"IF(ISBLANK(dms_E65_Projects_06),\"\",dms_E65_Projects_06)","v":""},0,0,0,0,0]
[null,{"$f":"IF(ISBLANK(dms_E65_Projects_07),\"\",dms_E65_Projects_07)","v":""},0,0,0,0,0]
[null,{"$f":"IF(ISBLANK(dms_E65_Projects_08),\"\",dms_E65_Projects_08)","v":""},0,0,0,0,0]
[null,{"$f":"IF(ISBLANK(dms_E65_Projects_09),\"\",dms_E65_Projects_09)","v":""},0,0,0,0,0]
[null,{"$f":"IF(ISBLANK(dms_E65_Projects_10),\"\",dms_E65_Projects_10)","v":""},0,0,0,0,0]
[null,{"$f":"IF(ISBLANK(dms_E65_Projects_11),\"\",dms_E65_Projects_11)","v":""},0,0,0,0,0]
[null,{"$f":"IF(ISBLANK(dms_E65_Projects_12),\"\",dms_E65_Projects_12)","v":""},0,0,0,0,0]
[null,{"$f":"IF(ISBLANK(dms_E65_Projects_13),\"\",dms_E65_Projects_13)","v":""},0,0,0,0,0]
[null,{"$f":"IF(ISBLANK(dms_E65_Projects_14),\"\",dms_E65_Projects_14)","v":""},0,0,0,0,0]
[null,{"$f":"IF(ISBLANK(dms_E65_Projects_15),\"\",dms_E65_Projects_15)","v":""},0,0,0,0,0]
[null,"Aggregate of other projects with total expenditure of less than $500,000",0,0,0,0,0]
[null,"Total",{"$f":"SUM(C107:C122)","v":0},{"$f":"SUM(D107:D122)","v":0},{"$f":"SUM(E107:E122)","v":0},{"$f":"SUM(F107:F122)","v":0},{"$f":"SUM(G107:G122)","v":0}]
[]
[null,"F. CAPITAL CONTRIBUTIONS included in the above"]
[null,{"$f":"IF(ISBLANK(dms_E65_Projects_01),\"\",dms_E65_Projects_01)","v":"SEE BELOW"},0,0,0,0,0]
[null,{"$f":"IF(ISBLANK(dms_E65_Projects_02),\"\",dms_E65_Projects_02)","v":""},0,0,0,0,0]
[null,{"$f":"IF(ISBLANK(dms_E65_Projects_03),\"\",dms_E65_Projects_03)","v":""},0,0,0,0,0]
[null,{"$f":"IF(ISBLANK(dms_E65_Projects_04),\"\",dms_E65_Projects_04)","v":""},0,0,0,0,0]
[null,{"$f":"IF(ISBLANK(dms_E65_Projects_05),\"\",dms_E65_Projects_05)","v":""},0,0,0,0,0]
[null,{"$f":"IF(ISBLANK(dms_E65_Projects_06),\"\",dms_E65_Projects_06)","v":""},0,0,0,0,0]
[null,{"$f":"IF(ISBLANK(dms_E65_Projects_07),\"\",dms_E65_Projects_07)","v":""},0,0,0,0,0]
[null,{"$f":"IF(ISBLANK(dms_E65_Projects_08),\"\",dms_E65_Projects_08)","v":""},0,0,0,0,0]
[null,{"$f":"IF(ISBLANK(dms_E65_Projects_09),\"\",dms_E65_Projects_09)","v":""},0,0,0,0,0]
[null,{"$f":"IF(ISBLANK(dms_E65_Projects_10),\"\",dms_E65_Projects_10)","v":""},0,0,0,0,0]
[null,{"$f":"IF(ISBLANK(dms_E65_Projects_11),\"\",dms_E65_Projects_11)","v":""},0,0,0,0,0]
[null,{"$f":"IF(ISBLANK(dms_E65_Projects_12),\"\",dms_E65_Projects_12)","v":""},0,0,0,0,0]
[null,{"$f":"IF(ISBLANK(dms_E65_Projects_13),\"\",dms_E65_Projects_13)","v":""},0,0,0,0,0]
[null,{"$f":"IF(ISBLANK(dms_E65_Projects_14),\"\",dms_E65_Projects_14)","v":""},0,0,0,0,0]
[null,{"$f":"IF(ISBLANK(dms_E65_Projects_15),\"\",dms_E65_Projects_15)","v":""},0,0,0,0,0]
[null,"Aggregate of other projects with total expenditure of less than $500,000",0,0,0,0,0]
[null,"Total",{"$f":"SUM(C126:C141)","v":0},{"$f":"SUM(D126:D141)","v":0},{"$f":"SUM(E126:E141)","v":0},{"$f":"SUM(F126:F141)","v":0},{"$f":"SUM(G126:G141)","v":0}]

{"sheet":"E10. Overheads","index":12,"n_rows":32,"n_cols":7,"rows_kept":32,"cut":false,"hidden":false,"merged":[[6,2,6,6],[7,2,7,6],[21,2,21,6],[22,2,22,6]]}
[null,{"$f":"INDEX(dms_Worksheet_List,MATCH(dms_Model,dms_Model_List))","v":"HISTORICAL ANNUAL REPORTING"}]
[null,{"$f":"INDEX(dms_TradingNameFull_List,MATCH(dms_TradingName,dms_TradingName_List))","v":"Australian Gas Networks Limited (reporting data for SA)"}]
[null,{"$f":"dms_Header_Span","v":"2014-15 to 2018-19"}]
[null,"E10. OVERHEADS EXPENDITURE"]
[]
[null,"E10.1 - NETWORK"]
[null,null,"EXPENDITURE"]
[null,null,"$0's"]
[null,null,{"$f":"dms_y1","v":"2014-15"},{"$f":"dms_y2","v":"2015-16"},{"$f":"dms_y3","v":"2016-17"},{"$f":"dms_y4","v":"2017-18"},{"$f":"dms_y5","v":"2018-19"}]
[null,"E10.1.1 - OPEX"]
[null,"Reference services",0,0,0,0,0]
[null,"Non-reference services",0,0,0,0,0]
[null,"Total",{"$f":"SUM(C11:C12)","v":0},{"$f":"SUM(D11:D12)","v":0},{"$f":"SUM(E11:E12)","v":0},{"$f":"SUM(F11:F12)","v":0},{"$f":"SUM(G11:G12)","v":0}]
[null,"E10.1.2 - CAPEX"]
[null,"Reference services",11185753.40214004,10510470.855198147,9010681.8661160246,9208575.8284351714,8878303.4374703951]
[null,"Non-reference services",0,0,0,0,0]
[null,"Total",{"$f":"SUM(C15:C16)","v":11185753.40214004},{"$f":"SUM(D15:D16)","v":10510470.855198147},{"$f":"SUM(E15:E16)","v":9010681.8661160246},{"$f":"SUM(F15:F16)","v":9208575.8284351714},{"$f":"SUM(G15:G16)","v":8878303.4374703951}]
[]
[]
[]
[null,"E10.2 - CORPORATE"]
[null,null,"EXPENDITURE"]
[null,null,"$0's"]
[null,null,{"$f":"dms_y1","v":"2014-15"},{"$f":"dms_y2","v":"2015-16"},{"$f":"dms_y3","v":"2016-17"},{"$f":"dms_y4","v":"2017-18"},{"$f":"dms_y5","v":"2018-19"}]
[null,"E10.2.1 - OPEX"]
[null,"Reference services","NULL","NULL","NULL","NULL","NULL"]
[null,"Non-reference services","NULL","NULL","NULL","NULL","NULL"]
[null,"Total",{"$f":"SUM(C26:C27)","v":0},{"$f":"SUM(D26:D27)","v":0},{"$f":"SUM(E26:E27)","v":0},{"$f":"SUM(F26:F27)","v":0},{"$f":"SUM(G26:G27)","v":0}]
[null,"E10.2.2 - CAPEX"]
[null,"Reference services",0,0,0,0,0]
[null,"Non-reference services",0,0,0,0,0]
[null,"Total",{"$f":"SUM(C30:C31)","v":0},{"$f":"SUM(D30:D31)","v":0},{"$f":"SUM(E30:E31)","v":0},{"$f":"SUM(F30:F31)","v":0},{"$f":"SUM(G30:G31)","v":0}]

{"sheet":"E12. ICT","index":13,"n_rows":139,"n_cols":7,"rows_kept":139,"cut":false,"hidden":false,"merged":[[24,2,24,6],[25,2,25,6]]}
[null,{"$f":"INDEX(dms_Worksheet_List,MATCH(dms_Model,dms_Model_List))","v":"HISTORICAL ANNUAL REPORTING"}]
[null,{"$f":"INDEX(dms_TradingNameFull_List,MATCH(dms_TradingName,dms_TradingName_List))","v":"Australian Gas Networks Limited (reporting data for SA)"}]
[null,{"$f":"dms_Header_Span","v":"2014-15 to 2018-19"}]
[null,"E12. INFORMATION AND COMMUNICATION TECHNOLOGY"]
[]
[null,"Please list all projects here:"]
[null,"3037 MAJOR PROJECTS - EAM"]
[null,"3198 MAJOR PROJECTS - GIS CONSOLIDATION"]
[null,"3209 MAJOR PROJECTS - SA SCADA NIMDS UPGRADE"]
[null,"3210 MAJOR PROJECTS - EAM UPGRADE"]
[null,"3229 MAJOR PROJECTS - APPLICATIONS RENEWAL - CC&B UPGRADE"]
[null,"3007 MAJOR PROJECTS - BILLING OPTIMISATION"]
[null,"3199 MAJOR PROJECTS - MAXIMO LICENSES"]
[null,"3202 MAJOR PROJECTS - MOBILITY INTEGRATION"]
[]
[]
[]
[]
[]
[]
[]
[]
[null,"E12.1 - CAPEX - BY PROJECT"]
[null,"A. DIRECT INTERNAL LABOUR EXPENDITURE"]
[null,null,"EXPENDITURE"]
[null,null,"$0's"]
[null,null,{"$f":"dms_y1","v":"2014-15"},{"$f":"dms_y2","v":"2015-16"},{"$f":"dms_y3","v":"2016-17"},{"$f":"dms_y4","v":"2017-18"},{"$f":"dms_y5","v":"2018-19"}]
[null,{"$f":"IF(ISBLANK(dms_E12_Projects_01),\"\",dms_E12_Projects_01)","v":"3037 MAJOR PROJECTS - EAM"},0,0,0,0,0]
[null,{"$f":"IF(ISBLANK(dms_E12_Projects_02),\"\",dms_E12_Projects_02)","v":"3198 MAJOR PROJECTS - GIS CONSOLIDATION"},0,0,0,0,0]
[null,{"$f":"IF(ISBLANK(dms_E12_Projects_03),\"\",dms_E12_Projects_03)","v":"3209 MAJOR PROJECTS - SA SCADA NIMDS UPGRADE"},0,0,0,0,0]
[null,{"$f":"IF(ISBLANK(dms_E12_Projects_04),\"\",dms_E12_Projects_04)","v":"3210 MAJOR PROJECTS - EAM UPGRADE"},0,0,0,0,0]
[null,{"$f":"IF(ISBLANK(dms_E12_Projects_05),\"\",dms_E12_Projects_05)","v":"3229 MAJOR PROJECTS - APPLICATIONS RENEWAL - CC&B UPGRADE"},0,0,0,0,0]
[null,{"$f":"IF(ISBLANK(dms_E12_Projects_06),\"\",dms_E12_Projects_06)","v":"3007 MAJOR PROJECTS - BILLING OPTIMISATION"},0,0,0,0,0]
[null,{"$f":"IF(ISBLANK(dms_E12_Projects_07),\"\",dms_E12_Projects_07)","v":"3199 MAJOR PROJECTS - MAXIMO LICENSES"},0,0,0,0,0]
[null,{"$f":"IF(ISBLANK(dms_E12_Projects_08),\"\",dms_E12_Projects_08)","v":"3202 MAJOR PROJECTS - MOBILITY INTEGRATION"},0,0,0,0,0]
[null,{"$f":"IF(ISBLANK(dms_E12_Projects_09),\"\",dms_E12_Projects_09)","v":""},0,0,0,0,0]
[null,{"$f":"IF(ISBLANK(dms_E12_Projects_10),\"\",dms_E12_Projects_10)","v":""},0,0,0,0,0]
[null,{"$f":"IF(ISBLANK(dms_E12_Projects_11),\"\",dms_E12_Projects_11)","v":""},0,0,0,0,0]
[null,{"$f":"IF(ISBLANK(dms_E12_Projects_12),\"\",dms_E12_Projects_12)","v":""},0,0,0,0,0]
[null,{"$f":"IF(ISBLANK(dms_E12_Projects_13),\"\",dms_E12_Projects_13)","v":""},0,0,0,0,0]
[null,{"$f":"IF(ISBLANK(dms_E12_Projects_14),\"\",dms_E12_Projects_14)","v":""},0,0,0,0,0]
[null,{"$f":"IF(ISBLANK(dms_E12_Projects_15),\"\",dms_E12_Projects_15)","v":""},0,0,0,0,0]
[null,"Aggregate of other projects with total expenditure of less than $500,000",0,0,0,0,0]
[null,"Total",{"$f":"SUM(C28:C43)","v":0},{"$f":"SUM(D28:D43)","v":0},{"$f":"SUM(E28:E43)","v":0},{"$f":"SUM(F28:F43)","v":0},{"$f":"SUM(G28:G43)","v":0}]
[]
[null,"B. DIRECT CONTRACTOR EXPENDITURE"]
[null,{"$f":"IF(ISBLANK(dms_E12_Projects_01),\"\",dms_E12_Projects_01)","v":"3037 MAJOR PROJECTS - EAM"},7510000,39000.000000000931,0,0,0]
[null,{"$f":"IF(ISBLANK(dms_E12_Projects_02),\"\",dms_E12_Projects_02)","v":"3198 MAJOR PROJECTS - GIS CONSOLIDATION"},0,0,162330.95237000001,539239.88644000003,823879.95848194149]
[null,{"$f":"IF(ISBLANK(dms_E12_Projects_03),\"\",dms_E12_Projects_03)","v":"3209 MAJOR PROJECTS - SA SCADA NIMDS UPGRADE"},0,0,0,920231.36,1931394.1900000004]
[null,{"$f":"IF(ISBLANK(dms_E12_Projects_04),\"\",dms_E12_Projects_04)","v":"3210 MAJOR PROJECTS - EAM UPGRADE"},0,0,0,591286.92990400002,0]
[null,{"$f":"IF(ISBLANK(dms_E12_Projects_05),\"\",dms_E12_Projects_05)","v":"3229 MAJOR PROJECTS - APPLICATIONS RENEWAL - CC&B UPGRADE"},0,0,0,34249.521988,1198185.6866493023]
[null,{"$f":"IF(ISBLANK(dms_E12_Projects_06),\"\",dms_E12_Projects_06)","v":"3007 MAJOR PROJECTS - BILLING OPTIMISATION"},2278860.3100000005,20587.209999999963,-38792.71,0,0]
[null,{"$f":"IF(ISBLANK(dms_E12_Projects_07),\"\",dms_E12_Projects_07)","v":"3199 MAJOR PROJECTS - MAXIMO LICENSES"},0,0,0,465465.17,0]
[null,{"$f":"IF(ISBLANK(dms_E12_Projects_08),\"\",dms_E12_Projects_08)","v":"3202 MAJOR PROJECTS - MOBILITY INTEGRATION"},0,0,0,140184.75916799999,457087.19934234337]
[null,{"$f":"IF(ISBLANK(dms_E12_Projects_09),\"\",dms_E12_Projects_09)","v":""},0,0,0,0,0]
[null,{"$f":"IF(ISBLANK(dms_E12_Projects_10),\"\",dms_E12_Projects_10)","v":""},0,0,0,0,0]
[null,{"$f":"IF(ISBLANK(dms_E12_Projects_11),\"\",dms_E12_Projects_11)","v":""},0,0,0,0,0]
[null,{"$f":"IF(ISBLANK(dms_E12_Projects_12),\"\",dms_E12_Projects_12)","v":""},0,0,0,0,0]
[null,{"$f":"IF(ISBLANK(dms_E12_Projects_13),\"\",dms_E12_Projects_13)","v":""},0,0,0,0,0]
[null,{"$f":"IF(ISBLANK(dms_E12_Projects_14),\"\",dms_E12_Projects_14)","v":""},0,0,0,0,0]
[null,{"$f":"IF(ISBLANK(dms_E12_Projects_15),\"\",dms_E12_Projects_15)","v":""},0,0,0,0,0]
[null,"Aggregate of other projects with total expenditure of less than $500,000",298598.13999999961,261457.76922399999,269031.57826999994,551969.85308400053,624103.61166516633]
[null,"Total",{"$f":"SUM(C47:C62)","v":10087458.449999999},{"$f":"SUM(D47:D62)","v":321044.97922400088},{"$f":"SUM(E47:E62)","v":392569.82063999993},{"$f":"SUM(F47:F62)","v":3242627.4805840002},{"$f":"SUM(G47:G62)","v":5034650.6461387528}]
[]
[null,"C. OTHER INTERNAL DIRECT EXPENDITURE"]
[null,{"$f":"IF(ISBLANK(dms_E12_Projects_01),\"\",dms_E12_Projects_01)","v":"3037 MAJOR PROJECTS - EAM"},0,0,0,0,0]
[null,{"$f":"IF(ISBLANK(dms_E12_Projects_02),\"\",dms_E12_Projects_02)","v":"3198 MAJOR PROJECTS - GIS CONSOLIDATION"},0,0,0,0,0]
[null,{"$f":"IF(ISBLANK(dms_E12_Projects_03),\"\",dms_E12_Projects_03)","v":"3209 MAJOR PROJECTS - SA SCADA NIMDS UPGRADE"},0,0,0,0,0]
[null,{"$f":"IF(ISBLANK(dms_E12_Projects_04),\"\",dms_E12_Projects_04)","v":"3210 MAJOR PROJECTS - EAM UPGRADE"},0,0,0,0,0]
[null,{"$f":"IF(ISBLANK(dms_E12_Projects_05),\"\",dms_E12_Projects_05)","v":"3229 MAJOR PROJECTS - APPLICATIONS RENEWAL - CC&B UPGRADE"},0,0,0,0,0]
[null,{"$f":"IF(ISBLANK(dms_E12_Projects_06),\"\",dms_E12_Projects_06)","v":"3007 MAJOR PROJECTS - BILLING OPTIMISATION"},0,0,0,0,0]
[null,{"$f":"IF(ISBLANK(dms_E12_Projects_07),\"\",dms_E12_Projects_07)","v":"3199 MAJOR PROJECTS - MAXIMO LICENSES"},0,0,0,0,0]
[null,{"$f":"IF(ISBLANK(dms_E12_Projects_08),\"\",dms_E12_Projects_08)","v":"3202 MAJOR PROJECTS - MOBILITY INTEGRATION"},0,0,0,0,0]
[null,{"$f":"IF(ISBLANK(dms_E12_Projects_09),\"\",dms_E12_Projects_09)","v":""},0,0,0,0,0]
[null,{"$f":"IF(ISBLANK(dms_E12_Projects_10),\"\",dms_E12_Projects_10)","v":""},0,0,0,0,0]
[null,{"$f":"IF(ISBLANK(dms_E12_Projects_11),\"\",dms_E12_Projects_11)","v":""},0,0,0,0,0]
[null,{"$f":"IF(ISBLANK(dms_E12_Projects_12),\"\",dms_E12_Projects_12)","v":""},0,0,0,0,0]
[null,{"$f":"IF(ISBLANK(dms_E12_Projects_13),\"\",dms_E12_Projects_13)","v":""},0,0,0,0,0]
[null,{"$f":"IF(ISBLANK(dms_E12_Projects_14),\"\",dms_E12_Projects_14)","v":""},0,0,0,0,0]
[null,{"$f":"IF(ISBLANK(dms_E12_Projects_15),\"\",dms_E12_Projects_15)","v":""},0,0,0,0,0]
[null,"Aggregate of other projects with total expenditure of less than $500,000",0,343834.57999999996,375882.32999999996,143684.37,30184.579999999998]
[null,"Total",{"$f":"SUM(C66:C81)","v":0},{"$f":"SUM(D66:D81)","v":343834.57999999996},{"$f":"SUM(E66:E81)","v":375882.32999999996},{"$f":"SUM(F66:F81)","v":143684.37},{"$f":"SUM(G66:G81)","v":30184.579999999998}]
[]
[null,"D. TOTAL OVERHEAD EXPENDITURE"]
[null,{"$f":"IF(ISBLANK(dms_E12_Projects_01),\"\",dms_E12_Projects_01)","v":"3037 MAJOR PROJECTS - EAM"},917722,0,0,0,0]
[null,{"$f":"IF(ISBLANK(dms_E12_Projects_02),\"\",dms_E12_Projects_02)","v":"3198 MAJOR PROJECTS - GIS CONSOLIDATION"},0,0,0,0,0]
[null,{"$f":"IF(ISBLANK(dms_E12_Projects_03),\"\",dms_E12_Projects_03)","v":"3209 MAJOR PROJECTS - SA SCADA NIMDS UPGRADE"},0,0,0,0,0]
[null,{"$f":"IF(ISBLANK(dms_E12_Projects_04),\"\",dms_E12_Projects_04)","v":"3210 MAJOR PROJECTS - EAM UPGRADE"},0,0,0,0,0]
[null,{"$f":"IF(ISBLANK(dms_E12_Projects_05),\"\",dms_E12_Projects_05)","v":"3229 MAJOR PROJECTS - APPLICATIONS RENEWAL - CC&B UPGRADE"},0,0,0,0,0]
[null,{"$f":"IF(ISBLANK(dms_E12_Projects_06),\"\",dms_E12_Projects_06)","v":"3007 MAJOR PROJECTS - BILLING OPTIMISATION"},850495.17139357817,-259863.69918959751,0,0,0]
[null,{"$f":"IF(ISBLANK(dms_E12_Projects_07),\"\",dms_E12_Projects_07)","v":"3199 MAJOR PROJECTS - MAXIMO LICENSES"},0,0,0,0,0]
[null,{"$f":"IF(ISBLANK(dms_E12_Projects_08),\"\",dms_E12_Projects_08)","v":"3202 MAJOR PROJECTS - MOBILITY INTEGRATION"},0,0,0,0,0]
[null,{"$f":"IF(ISBLANK(dms_E12_Projects_09),\"\",dms_E12_Projects_09)","v":""}]
[null,{"$f":"IF(ISBLANK(dms_E12_Projects_10),\"\",dms_E12_Projects_10)","v":""},0,0,0,0,0]
[null,{"$f":"IF(ISBLANK(dms_E12_Projects_11),\"\",dms_E12_Projects_11)","v":""},0,0,0,0,0]
[null,{"$f":"IF(ISBLANK(dms_E12_Projects_12),\"\",dms_E12_Projects_12)","v":""},0,0,0,0,0]
[null,{"$f":"IF(ISBLANK(dms_E12_Projects_13),\"\",dms_E12_Projects_13)","v":""},0,0,0,0,0]
[null,{"$f":"IF(ISBLANK(dms_E12_Projects_14),\"\",dms_E12_Projects_14)","v":""},0,0,0,0,0]
[null,{"$f":"IF(ISBLANK(dms_E12_Projects_15),\"\",dms_E12_Projects_15)","v":""},0,0,0,0,0]
[null,"Aggregate of other projects with total expenditure of less than $500,000",28424.938526475344,-1792.639502068505,0,0,0]
[null,"Total",{"$f":"SUM(C85:C100)","v":1796642.1099200535},{"$f":"SUM(D85:D100)","v":-261656.33869166602},{"$f":"SUM(E85:E100)","v":0},{"$f":"SUM(F85:F100)","v":0},{"$f":"SUM(G85:G100)","v":0}]
[]
[null,"E. RELATED PARTY MARGIN EXPENDITURE"]
[null,{"$f":"IF(ISBLANK(dms_E12_Projects_01),\"\",dms_E12_Projects_01)","v":"3037 MAJOR PROJECTS - EAM"},0,0,0,0,0]
[null,{"$f":"IF(ISBLANK(dms_E12_Projects_02),\"\",dms_E12_Projects_02)","v":"3198 MAJOR PROJECTS - GIS CONSOLIDATION"},0,0,0,0,0]
[null,{"$f":"IF(ISBLANK(dms_E12_Projects_03),\"\",dms_E12_Projects_03)","v":"3209 MAJOR PROJECTS - SA SCADA NIMDS UPGRADE"},0,0,0,0,0]
[null,{"$f":"IF(ISBLANK(dms_E12_Projects_04),\"\",dms_E12_Projects_04)","v":"3210 MAJOR PROJECTS - EAM UPGRADE"},0,0,0,0,0]
[null,{"$f":"IF(ISBLANK(dms_E12_Projects_05),\"\",dms_E12_Projects_05)","v":"3229 MAJOR PROJECTS - APPLICATIONS RENEWAL - CC&B UPGRADE"},0,0,0,0,0]
[null,{"$f":"IF(ISBLANK(dms_E12_Projects_06),\"\",dms_E12_Projects_06)","v":"3007 MAJOR PROJECTS - BILLING OPTIMISATION"},0,0,0,0,0]
[null,{"$f":"IF(ISBLANK(dms_E12_Projects_07),\"\",dms_E12_Projects_07)","v":"3199 MAJOR PROJECTS - MAXIMO LICENSES"},0,0,0,0,0]
[null,{"$f":"IF(ISBLANK(dms_E12_Projects_08),\"\",dms_E12_Projects_08)","v":"3202 MAJOR PROJECTS - MOBILITY INTEGRATION"},0,0,0,0,0]
[null,{"$f":"IF(ISBLANK(dms_E12_Projects_09),\"\",dms_E12_Projects_09)","v":""},0,0,0,0,0]
[null,{"$f":"IF(ISBLANK(dms_E12_Projects_10),\"\",dms_E12_Projects_10)","v":""},0,0,0,0,0]
[null,{"$f":"IF(ISBLANK(dms_E12_Projects_11),\"\",dms_E12_Projects_11)","v":""},0,0,0,0,0]
[null,{"$f":"IF(ISBLANK(dms_E12_Projects_12),\"\",dms_E12_Projects_12)","v":""},0,0,0,0,0]
[null,{"$f":"IF(ISBLANK(dms_E12_Projects_13),\"\",dms_E12_Projects_13)","v":""},0,0,0,0,0]
[null,{"$f":"IF(ISBLANK(dms_E12_Projects_14),\"\",dms_E12_Projects_14)","v":""},0,0,0,0,0]
[null,{"$f":"IF(ISBLANK(dms_E12_Projects_15),\"\",dms_E12_Projects_15)","v":""},0,0,0,0,0]
[null,"Aggregate of other projects with total expenditure of less than $500,000",0,0,0,0,0]
[null,"Total",{"$f":"SUM(C104:C119)","v":0},{"$f":"SUM(D104:D119)","v":0},{"$f":"SUM(E104:E119)","v":0},{"$f":"SUM(F104:F119)","v":0},{"$f":"SUM(G104:G119)","v":0}]
[]
[null,"F. CAPITAL CONTRIBUTIONS included in the above"]
[null,{"$f":"IF(ISBLANK(dms_E12_Projects_01),\"\",dms_E12_Projects_01)","v":"3037 MAJOR PROJECTS - EAM"},0,0,0,0,0]
[null,{"$f":"IF(ISBLANK(dms_E12_Projects_02),\"\",dms_E12_Projects_02)","v":"3198 MAJOR PROJECTS - GIS CONSOLIDATION"},0,0,0,0,0]
[null,{"$f":"IF(ISBLANK(dms_E12_Projects_03),\"\",dms_E12_Projects_03)","v":"3209 MAJOR PROJECTS - SA SCADA NIMDS UPGRADE"},0,0,0,0,0]
[null,{"$f":"IF(ISBLANK(dms_E12_Projects_04),\"\",dms_E12_Projects_04)","v":"3210 MAJOR PROJECTS - EAM UPGRADE"},0,0,0,0,0]
[null,{"$f":"IF(ISBLANK(dms_E12_Projects_05),\"\",dms_E12_Projects_05)","v":"3229 MAJOR PROJECTS - APPLICATIONS RENEWAL - CC&B UPGRADE"},0,0,0,0,0]
[null,{"$f":"IF(ISBLANK(dms_E12_Projects_06),\"\",dms_E12_Projects_06)","v":"3007 MAJOR PROJECTS - BILLING OPTIMISATION"},0,0,0,0,0]
[null,{"$f":"IF(ISBLANK(dms_E12_Projects_07),\"\",dms_E12_Projects_07)","v":"3199 MAJOR PROJECTS - MAXIMO LICENSES"},0,0,0,0,0]
[null,{"$f":"IF(ISBLANK(dms_E12_Projects_08),\"\",dms_E12_Projects_08)","v":"3202 MAJOR PROJECTS - MOBILITY INTEGRATION"},0,0,0,0,0]
[null,{"$f":"IF(ISBLANK(dms_E12_Projects_09),\"\",dms_E12_Projects_09)","v":""},0,0,0,0,0]
[null,{"$f":"IF(ISBLANK(dms_E12_Projects_10),\"\",dms_E12_Projects_10)","v":""},0,0,0,0,0]
[null,{"$f":"IF(ISBLANK(dms_E12_Projects_11),\"\",dms_E12_Projects_11)","v":""},0,0,0,0,0]
[null,{"$f":"IF(ISBLANK(dms_E12_Projects_12),\"\",dms_E12_Projects_12)","v":""},0,0,0,0,0]
[null,{"$f":"IF(ISBLANK(dms_E12_Projects_13),\"\",dms_E12_Projects_13)","v":""},0,0,0,0,0]
[null,{"$f":"IF(ISBLANK(dms_E12_Projects_14),\"\",dms_E12_Projects_14)","v":""},0,0,0,0,0]
[null,{"$f":"IF(ISBLANK(dms_E12_Projects_15),\"\",dms_E12_Projects_15)","v":""},0,0,0,0,0]
[null,"Aggregate of other projects with total expenditure of less than $500,000",0,0,0,0,0]
[null,"Total",{"$f":"SUM(C123:C138)","v":0},{"$f":"SUM(D123:D138)","v":0},{"$f":"SUM(E123:E138)","v":0},{"$f":"SUM(F123:F138)","v":0},{"$f":"SUM(G123:G138)","v":0}]

{"sheet":"E13. Other capex","index":14,"n_rows":180,"n_cols":7,"rows_kept":180,"cut":false,"hidden":false,"merged":[[28,2,28,6],[29,2,29,6]]}
[null,{"$f":"INDEX(dms_Worksheet_List,MATCH(dms_Model,dms_Model_List))","v":"HISTORICAL ANNUAL REPORTING"}]
[null,{"$f":"INDEX(dms_TradingNameFull_List,MATCH(dms_TradingName,dms_TradingName_List))","v":"Australian Gas Distribution Co. "}]
[null,{"$f":"dms_Header_Span","v":"2014-15 to 2018-19"}]
[null,"E13. OTHER CAPITAL EXPENDITURE"]
[]
[null,"Please list all projects here:"]
[null,"2106 C P - CORROSION PROTECTION - CAPEX <$500K"]
[null,"2130 MAINS ALTERATION CHRG - MA CL16 - Darlington S2 Mains"]
[null,"2130 MAINS ALTERATION CHRG - MA CL17 Darlington Stg3"]
[null,"2130 MAINS ALTERATION CHRG - MA CL18 - Oaklands Rd Rail X2"]
[null,"2130 MAINS ALTERATION CHRG - MA CL16 T2T WP3&4"]
[null,"2130 MAINS ALTERATION CHRG - MA CL15 - T2T"]
[null,"2130 MAINS ALTERATION CHRG - MA CL18 Nth Tce Tram Valve"]
[null,"2130 MAINS ALTERATION CHRG - MA CL18 - Oaklands Rd Rail X"]
[null,"2130 MAINS ALTERATION - CHARGEABLE - CAPEX <$500K"]
[null,"2131 MAINS ALTERATION - NON CHARGEABLE - CAPEX <$500K"]
[null,"2139 NETWORK - REGULATOR STAY IN BUSINESS <$500K"]
[null,"2142 NETWORK - REGULATOR CAPEX <$500K"]
[null,"2152 NETWORK - STOPPLE EQUIPMENT HDPE CAMERA"]
[null,"2152 NETWORK - STOPPLE EQUIPMENT<$500K"]
[null,"2190 OTHER - NON RETIC CAPITAL"]
[null,"3043 MAJOR PROJECTS - BOWDEN"]
[null,"2152 NETWORK - STOPPLE EQUIPMENT - INLETS INSIDE CAVITIES"]
[null,"2990 MAJOR PROJECTS - VIRGINIA"]
[null,"2997 MAJOR PROJECTS - BERRI"]
[]
[]
[null,"E13.1 - CAPEX - BY PROJECT"]
[null,null,"EXPENDITURE"]
[null,null,"$0's"]
[null,null,{"$f":"dms_y1","v":"2014-15"},{"$f":"dms_y2","v":"2015-16"},{"$f":"dms_y3","v":"2016-17"},{"$f":"dms_y4","v":"2017-18"},{"$f":"dms_y5","v":"2018-19"}]
[null,"A. DIRECT INTERNAL LABOUR EXPENDITURE"]
[null,{"$f":"IF(ISBLANK(dms_E13_Projects_01),\"\",dms_E13_Projects_01)","v":"2106 C P - CORROSION PROTECTION - CAPEX <$500K"},0,0,0,0,0]
[null,{"$f":"IF(ISBLANK(dms_E13_Projects_02),\"\",dms_E13_Projects_02)","v":"2130 MAINS ALTERATION CHRG - MA CL16 - Darlington S2 Mains"},0,0,0,0,0]
[null,{"$f":"IF(ISBLANK(dms_E13_Projects_03),\"\",dms_E13_Projects_03)","v":"2130 MAINS ALTERATION CHRG - MA CL17 Darlington Stg3"},0,0,0,0,0]
[null,{"$f":"IF(ISBLANK(dms_E13_Projects_04),\"\",dms_E13_Projects_04)","v":"2130 MAINS ALTERATION CHRG - MA CL18 - Oaklands Rd Rail X2"},0,0,0,0,0]
[null,{"$f":"IF(ISBLANK(dms_E13_Projects_05),\"\",dms_E13_Projects_05)","v":"2130 MAINS ALTERATION CHRG - MA CL16 T2T WP3&4"},0,0,0,0,0]
[null,{"$f":"IF(ISBLANK(dms_E13_Projects_06),\"\",dms_E13_Projects_06)","v":"2130 MAINS ALTERATION CHRG - MA CL15 - T2T"},0,0,0,0,0]
[null,{"$f":"IF(ISBLANK(dms_E13_Projects_07),\"\",dms_E13_Projects_07)","v":"2130 MAINS ALTERATION CHRG - MA CL18 Nth Tce Tram Valve"},0,0,0,0,0]
[null,{"$f":"IF(ISBLANK(dms_E13_Projects_08),\"\",dms_E13_Projects_08)","v":"2130 MAINS ALTERATION CHRG - MA CL18 - Oaklands Rd Rail X"},0,0,0,0,0]
[null,{"$f":"IF(ISBLANK(dms_E13_Projects_09),\"\",dms_E13_Projects_09)","v":"2130 MAINS ALTERATION - CHARGEABLE - CAPEX <$500K"},0,0,0,0,0]
[null,{"$f":"IF(ISBLANK(dms_E13_Projects_10),\"\",dms_E13_Projects_10)","v":"2131 MAINS ALTERATION - NON CHARGEABLE - CAPEX <$500K"},0,0,0,0,0]
[null,{"$f":"IF(ISBLANK(dms_E13_Projects_11),\"\",dms_E13_Projects_11)","v":"2139 NETWORK - REGULATOR STAY IN BUSINESS <$500K"},0,0,0,0,0]
[null,{"$f":"IF(ISBLANK(dms_E13_Projects_12),\"\",dms_E13_Projects_12)","v":"2142 NETWORK - REGULATOR CAPEX <$500K"},0,0,0,0,0]
[null,{"$f":"IF(ISBLANK(dms_E13_Projects_13),\"\",dms_E13_Projects_13)","v":"2152 NETWORK - STOPPLE EQUIPMENT HDPE CAMERA"},0,0,0,0,0]
[null,{"$f":"IF(ISBLANK(dms_E13_Projects_14),\"\",dms_E13_Projects_14)","v":"2152 NETWORK - STOPPLE EQUIPMENT<$500K"},0,0,0,0,0]
[null,{"$f":"IF(ISBLANK(dms_E13_Projects_15),\"\",dms_E13_Projects_15)","v":"2190 OTHER - NON RETIC CAPITAL"},0,0,0,0,0]
[null,"Aggregate of other projects with total expenditure of less than $500,000",0,0,0,0,0]
[null,"Total",{"$f":"SUM(C33:C48)","v":0},{"$f":"SUM(D33:D48)","v":0},{"$f":"SUM(E33:E48)","v":0},{"$f":"SUM(F33:F48)","v":0},{"$f":"SUM(G33:G48)","v":0}]
[]
[null,"B. DIRECT CONTRACTOR EXPENDITURE"]
[null,{"$f":"IF(ISBLANK(dms_E13_Projects_01),\"\",dms_E13_Projects_01)","v":"2106 C P - CORROSION PROTECTION - CAPEX <$500K"}]
[null,{"$f":"IF(ISBLANK(dms_E13_Projects_02),\"\",dms_E13_Projects_02)","v":"2130 MAINS ALTERATION CHRG - MA CL16 - Darlington S2 Mains"}]
[null,{"$f":"IF(ISBLANK(dms_E13_Projects_03),\"\",dms_E13_Projects_03)","v":"2130 MAINS ALTERATION CHRG - MA CL17 Darlington Stg3"}]
[null,{"$f":"IF(ISBLANK(dms_E13_Projects_04),\"\",dms_E13_Projects_04)","v":"2130 MAINS ALTERATION CHRG - MA CL18 - Oaklands Rd Rail X2"}]
[null,{"$f":"IF(ISBLANK(dms_E13_Projects_05),\"\",dms_E13_Projects_05)","v":"2130 MAINS ALTERATION CHRG - MA CL16 T2T WP3&4"}]
[null,{"$f":"IF(ISBLANK(dms_E13_Projects_06),\"\",dms_E13_Projects_06)","v":"2130 MAINS ALTERATION CHRG - MA CL15 - T2T"}]
[null,{"$f":"IF(ISBLANK(dms_E13_Projects_07),\"\",dms_E13_Projects_07)","v":"2130 MAINS ALTERATION CHRG - MA CL18 Nth Tce Tram Valve"}]
[null,{"$f":"IF(ISBLANK(dms_E13_Projects_08),\"\",dms_E13_Projects_08)","v":"2130 MAINS ALTERATION CHRG - MA CL18 - Oaklands Rd Rail X"}]
[null,{"$f":"IF(ISBLANK(dms_E13_Projects_09),\"\",dms_E13_Projects_09)","v":"2130 MAINS ALTERATION - CHARGEABLE - CAPEX <$500K"}]
[null,{"$f":"IF(ISBLANK(dms_E13_Projects_10),\"\",dms_E13_Projects_10)","v":"2131 MAINS ALTERATION - NON CHARGEABLE - CAPEX <$500K"}]
[null,{"$f":"IF(ISBLANK(dms_E13_Projects_11),\"\",dms_E13_Projects_11)","v":"2139 NETWORK - REGULATOR STAY IN BUSINESS <$500K"}]
[null,{"$f":"IF(ISBLANK(dms_E13_Projects_12),\"\",dms_E13_Projects_12)","v":"2142 NETWORK - REGULATOR CAPEX <$500K"}]
[null,{"$f":"IF(ISBLANK(dms_E13_Projects_13),\"\",dms_E13_Projects_13)","v":"2152 NETWORK - STOPPLE EQUIPMENT HDPE CAMERA"}]
[null,{"$f":"IF(ISBLANK(dms_E13_Projects_14),\"\",dms_E13_Projects_14)","v":"2152 NETWORK - STOPPLE EQUIPMENT<$500K"}]
[null,{"$f":"IF(ISBLANK(dms_E13_Projects_15),\"\",dms_E13_Projects_15)","v":"2190 OTHER - NON RETIC CAPITAL"}]
[null,{"$f":"+B22","v":"3043 MAJOR PROJECTS - BOWDEN"}]
[null,{"$f":"+B23","v":"2152 NETWORK - STOPPLE EQUIPMENT - INLETS INSIDE CAVITIES"}]
[null,"2990 MAJOR PROJECTS - VIRGINIA"]
[null,"2997 MAJOR PROJECTS - BERRI"]
[null,null,0,0,0,0,0]
[null,null,0,0,0,0,0]
[null,null,0,0,0,0,0]
[null,null,0,0,0,0,0]
[null,null,0,0,0,0,0]
[null,null,0,0,0,0,0]
[null,null,0,0,0,0,0]
[null,null,0,0,0,0,0]
[null,null,0,0,0,0,0]
[null,null,0,0,0,0,0]
[null,null,0,0,0,0,0]
[null,null,0,0,0,0,0]
[null,null,0,0,0,0,0]
[null,null,0,0,0,0,0]
[null,"Aggregate of other projects with total expenditure of less than $500,000",0,0,0,0,0]
[null,"Total",{"$f":"SUM(C52:C85)","v":0},{"$f":"SUM(D52:D85)","v":0},{"$f":"SUM(E52:E85)","v":0},{"$f":"SUM(F52:F85)","v":0},{"$f":"SUM(G52:G85)","v":0}]
[]
[null,"C. OTHER INTERNAL DIRECT EXPENDITURE"]
[null,{"$f":"IF(ISBLANK(dms_E13_Projects_01),\"\",dms_E13_Projects_01)","v":"2106 C P - CORROSION PROTECTION - CAPEX <$500K"},0,0,0,0,0]
[null,{"$f":"IF(ISBLANK(dms_E13_Projects_02),\"\",dms_E13_Projects_02)","v":"2130 MAINS ALTERATION CHRG - MA CL16 - Darlington S2 Mains"},0,0,0,0,0]
[null,{"$f":"IF(ISBLANK(dms_E13_Projects_03),\"\",dms_E13_Projects_03)","v":"2130 MAINS ALTERATION CHRG - MA CL17 Darlington Stg3"},0,0,0,0,0]
[null,{"$f":"IF(ISBLANK(dms_E13_Projects_04),\"\",dms_E13_Projects_04)","v":"2130 MAINS ALTERATION CHRG - MA CL18 - Oaklands Rd Rail X2"},0,0,0,0,0]
[null,{"$f":"IF(ISBLANK(dms_E13_Projects_05),\"\",dms_E13_Projects_05)","v":"2130 MAINS ALTERATION CHRG - MA CL16 T2T WP3&4"},0,0,0,0,0]
[null,{"$f":"IF(ISBLANK(dms_E13_Projects_06),\"\",dms_E13_Projects_06)","v":"2130 MAINS ALTERATION CHRG - MA CL15 - T2T"},0,0,0,0,0]
[null,{"$f":"IF(ISBLANK(dms_E13_Projects_07),\"\",dms_E13_Projects_07)","v":"2130 MAINS ALTERATION CHRG - MA CL18 Nth Tce Tram Valve"},0,0,0,0,0]
[null,{"$f":"IF(ISBLANK(dms_E13_Projects_08),\"\",dms_E13_Projects_08)","v":"2130 MAINS ALTERATION CHRG - MA CL18 - Oaklands Rd Rail X"},0,0,0,0,0]
[null,{"$f":"IF(ISBLANK(dms_E13_Projects_09),\"\",dms_E13_Projects_09)","v":"2130 MAINS ALTERATION - CHARGEABLE - CAPEX <$500K"},0,0,0,0,0]
[null,{"$f":"IF(ISBLANK(dms_E13_Projects_10),\"\",dms_E13_Projects_10)","v":"2131 MAINS ALTERATION - NON CHARGEABLE - CAPEX <$500K"},0,0,0,0,0]
[null,{"$f":"IF(ISBLANK(dms_E13_Projects_11),\"\",dms_E13_Projects_11)","v":"2139 NETWORK - REGULATOR STAY IN BUSINESS <$500K"},0,0,0,0,0]
[null,{"$f":"IF(ISBLANK(dms_E13_Projects_12),\"\",dms_E13_Projects_12)","v":"2142 NETWORK - REGULATOR CAPEX <$500K"},0,0,0,0,0]
[null,{"$f":"IF(ISBLANK(dms_E13_Projects_13),\"\",dms_E13_Projects_13)","v":"2152 NETWORK - STOPPLE EQUIPMENT HDPE CAMERA"},0,0,0,0,0]
[null,{"$f":"IF(ISBLANK(dms_E13_Projects_14),\"\",dms_E13_Projects_14)","v":"2152 NETWORK - STOPPLE EQUIPMENT<$500K"},0,0,0,0,0]
[null,{"$f":"IF(ISBLANK(dms_E13_Projects_15),\"\",dms_E13_Projects_15)","v":"2190 OTHER - NON RETIC CAPITAL"},0,0,0,0,0]
[null,{"$f":"+B22","v":"3043 MAJOR PROJECTS - BOWDEN"},0,0,0,0,0]
[null,{"$f":"+B23","v":"2152 NETWORK - STOPPLE EQUIPMENT - INLETS INSIDE CAVITIES"},0,0,0,0,0]
[null,{"$f":"+B24","v":"2990 MAJOR PROJECTS - VIRGINIA"},0,0,0,0,0]
[null,"2997 MAJOR PROJECTS - BERRI",0,0,0,0,0]
[null,null,0,0,0,0,0]
[null,"Aggregate of other projects with total expenditure of less than $500,000",0,9912.130000000001,8860,15889.900000000001,14417.27]
[null,"Total",{"$f":"SUM(C89:C109)","v":0},{"$f":"SUM(D89:D109)","v":9912.130000000001},{"$f":"SUM(E89:E109)","v":8860},{"$f":"SUM(F89:F109)","v":15889.900000000001},{"$f":"SUM(G89:G109)","v":14417.27}]
[]
[null,"D. TOTAL OVERHEAD EXPENDITURE"]
[null,{"$f":"IF(ISBLANK(dms_E13_Projects_01),\"\",dms_E13_Projects_01)","v":"2106 C P - CORROSION PROTECTION - CAPEX <$500K"},162076.56199167925,96462.671631773977,88313.1343238884,90081.298029828497,85540.979540312808]
[null,{"$f":"IF(ISBLANK(dms_E13_Projects_02),\"\",dms_E13_Projects_02)","v":"2130 MAINS ALTERATION CHRG - MA CL16 - Darlington S2 Mains"},0,0,257554.6219438861,66362.575421489048,10182.556753876292]
[null,{"$f":"IF(ISBLANK(dms_E13_Projects_03),\"\",dms_E13_Projects_03)","v":"2130 MAINS ALTERATION CHRG - MA CL17 Darlington Stg3"},0,0,98005.743654747363,67984.657304344408,11898.042966140627]
[null,{"$f":"IF(ISBLANK(dms_E13_Projects_04),\"\",dms_E13_Projects_04)","v":"2130 MAINS ALTERATION CHRG - MA CL18 - Oaklands Rd Rail X2"},0,0,0,0,142599.90771291379]
[null,{"$f":"IF(ISBLANK(dms_E13_Projects_05),\"\",dms_E13_Projects_05)","v":"2130 MAINS ALTERATION CHRG - MA CL16 T2T WP3&4"},0,0,90752.439602283644,35650.527130269416,0]
[null,{"$f":"IF(ISBLANK(dms_E13_Projects_06),\"\",dms_E13_Projects_06)","v":"2130 MAINS ALTERATION CHRG - MA CL15 - T2T"},0,116261.0206902739,25630.490597161086,35.322302201251858,0]
[null,{"$f":"IF(ISBLANK(dms_E13_Projects_07),\"\",dms_E13_Projects_07)","v":"2130 MAINS ALTERATION CHRG - MA CL18 Nth Tce Tram Valve"},0,0,0,80393.515001039588,2495.2097409392272]
[null,{"$f":"IF(ISBLANK(dms_E13_Projects_08),\"\",dms_E13_Projects_08)","v":"2130 MAINS ALTERATION CHRG - MA CL18 - Oaklands Rd Rail X"},0,0,0,12663.644926373549,31613.742135641776]
[null,{"$f":"IF(ISBLANK(dms_E13_Projects_09),\"\",dms_E13_Projects_09)","v":"2130 MAINS ALTERATION - CHARGEABLE - CAPEX <$500K"},56778.822050711067,142478.25480540859,105896.88616942825,77800.693933141825,89398.50597941046]
[null,{"$f":"IF(ISBLANK(dms_E13_Projects_10),\"\",dms_E13_Projects_10)","v":"2131 MAINS ALTERATION - NON CHARGEABLE - CAPEX <$500K"},7246.9394977457086,3418.4888194324622,3166.7565964232163,2351.6104687420866,4067.5317830807162]
[null,{"$f":"IF(ISBLANK(dms_E13_Projects_11),\"\",dms_E13_Projects_11)","v":"2139 NETWORK - REGULATOR STAY IN BUSINESS <$500K"},129994.81670279376,36284.983780145034,3316.2398331757904,9232.369601202201,47104.063062752895]
[null,{"$f":"IF(ISBLANK(dms_E13_Projects_12),\"\",dms_E13_Projects_12)","v":"2142 NETWORK - REGULATOR CAPEX <$500K"},237623.51561017038,87944.928634252021,18736.517951308335,52036.263014646509,59719.212185599914]
[null,{"$f":"IF(ISBLANK(dms_E13_Projects_13),\"\",dms_E13_Projects_13)","v":"2152 NETWORK - STOPPLE EQUIPMENT HDPE CAMERA"},0,6757.5774243647584,125523.26257430212,153563.36028262047,93896.473004530824]
[null,{"$f":"IF(ISBLANK(dms_E13_Projects_14),\"\",dms_E13_Projects_14)","v":"2152 NETWORK - STOPPLE EQUIPMENT<$500K"},22892.313886269654,54732.016393073493,31917.976647647687,12506.320764580198,42384.326185157232]
[null,{"$f":"IF(ISBLANK(dms_E13_Projects_15),\"\",dms_E13_Projects_15)","v":"2190 OTHER - NON RETIC CAPITAL"},74861.857401414047,44189.229582697961,67760.053970062305,60746.912434418366,28191.09413333585]
[null,{"$f":"+B22","v":"3043 MAJOR PROJECTS - BOWDEN"},0,51932.353686546347,629207.4314928049,292824.19820767851,-1704.9716956679149]
[null,{"$f":"+B23","v":"2152 NETWORK - STOPPLE EQUIPMENT - INLETS INSIDE CAVITIES"},124947.98063793278,0,0,0,0]
[null,"2990 MAJOR PROJECTS - VIRGINIA",187919.72223328974,86884.376837527874,617.2788860611322,-4.8008520582198688,0]
[null,"2997 MAJOR PROJECTS - BERRI",140000.00000000012,0,0,0,0]
[null,"Aggregate of other projects with total expenditure of less than $500,000",0,0,0,0,0]
[null,"Total",{"$f":"SUM(C113:C132)","v":1144342.5300120064},{"$f":"SUM(D113:D132)","v":727345.90228549636},{"$f":"SUM(E113:E132)","v":1546398.8342431802},{"$f":"SUM(F113:F132)","v":1014228.4679705177},{"$f":"SUM(G113:G132)","v":647386.67348802451}]
[]
[null,"E. RELATED PARTY MARGIN EXPENDITURE"]
[null,{"$f":"IF(ISBLANK(dms_E13_Projects_01),\"\",dms_E13_Projects_01)","v":"2106 C P - CORROSION PROTECTION - CAPEX <$500K"},0,0,0,0,0]
[null,{"$f":"IF(ISBLANK(dms_E13_Projects_02),\"\",dms_E13_Projects_02)","v":"2130 MAINS ALTERATION CHRG - MA CL16 - Darlington S2 Mains"},0,0,0,0,0]
[null,{"$f":"IF(ISBLANK(dms_E13_Projects_03),\"\",dms_E13_Projects_03)","v":"2130 MAINS ALTERATION CHRG - MA CL17 Darlington Stg3"},0,0,0,0,0]
[null,{"$f":"IF(ISBLANK(dms_E13_Projects_04),\"\",dms_E13_Projects_04)","v":"2130 MAINS ALTERATION CHRG - MA CL18 - Oaklands Rd Rail X2"},0,0,0,0,0]
[null,{"$f":"IF(ISBLANK(dms_E13_Projects_05),\"\",dms_E13_Projects_05)","v":"2130 MAINS ALTERATION CHRG - MA CL16 T2T WP3&4"},0,0,0,0,0]
[null,{"$f":"IF(ISBLANK(dms_E13_Projects_06),\"\",dms_E13_Projects_06)","v":"2130 MAINS ALTERATION CHRG - MA CL15 - T2T"},0,0,0,0,0]
[null,{"$f":"IF(ISBLANK(dms_E13_Projects_07),\"\",dms_E13_Projects_07)","v":"2130 MAINS ALTERATION CHRG - MA CL18 Nth Tce Tram Valve"},0,0,0,0,0]
[null,{"$f":"IF(ISBLANK(dms_E13_Projects_08),\"\",dms_E13_Projects_08)","v":"2130 MAINS ALTERATION CHRG - MA CL18 - Oaklands Rd Rail X"},0,0,0,0,0]
[null,{"$f":"IF(ISBLANK(dms_E13_Projects_09),\"\",dms_E13_Projects_09)","v":"2130 MAINS ALTERATION - CHARGEABLE - CAPEX <$500K"},0,0,0,0,0]
[null,{"$f":"IF(ISBLANK(dms_E13_Projects_10),\"\",dms_E13_Projects_10)","v":"2131 MAINS ALTERATION - NON CHARGEABLE - CAPEX <$500K"},0,0,0,0,0]
[null,{"$f":"IF(ISBLANK(dms_E13_Projects_11),\"\",dms_E13_Projects_11)","v":"2139 NETWORK - REGULATOR STAY IN BUSINESS <$500K"},0,0,0,0,0]
[null,{"$f":"IF(ISBLANK(dms_E13_Projects_12),\"\",dms_E13_Projects_12)","v":"2142 NETWORK - REGULATOR CAPEX <$500K"},0,0,0,0,0]
[null,{"$f":"IF(ISBLANK(dms_E13_Projects_13),\"\",dms_E13_Projects_13)","v":"2152 NETWORK - STOPPLE EQUIPMENT HDPE CAMERA"},0,0,0,0,0]
[null,{"$f":"IF(ISBLANK(dms_E13_Projects_14),\"\",dms_E13_Projects_14)","v":"2152 NETWORK - STOPPLE EQUIPMENT<$500K"},0,0,0,0,0]
[null,{"$f":"IF(ISBLANK(dms_E13_Projects_15),\"\",dms_E13_Projects_15)","v":"2190 OTHER - NON RETIC CAPITAL"},0,0,0,0,0]
[null,{"$f":"+B22","v":"3043 MAJOR PROJECTS - BOWDEN"},0,0,0,0,0]
[null,{"$f":"+B23","v":"2152 NETWORK - STOPPLE EQUIPMENT - INLETS INSIDE CAVITIES"},0,0,0,0,0]
[null,"2990 MAJOR PROJECTS - VIRGINIA",0,0,0,0,0]
[null,"2997 MAJOR PROJECTS - BERRI",0,0,0,0,0]
[null,null,0,0,0,0,0]
[null,"Aggregate of other projects with total expenditure of less than $500,000",0,0,0,0,0]
[null,"Total",{"$f":"SUM(C136:C156)","v":0},{"$f":"SUM(D136:D156)","v":0},{"$f":"SUM(E136:E156)","v":0},{"$f":"SUM(F136:F156)","v":0},{"$f":"SUM(G136:G156)","v":0}]
[]
[null,"F. CAPITAL CONTRIBUTIONS included in the above"]
[null,{"$f":"IF(ISBLANK(dms_E13_Projects_01),\"\",dms_E13_Projects_01)","v":"2106 C P - CORROSION PROTECTION - CAPEX <$500K"}]
[null,{"$f":"IF(ISBLANK(dms_E13_Projects_02),\"\",dms_E13_Projects_02)","v":"2130 MAINS ALTERATION CHRG - MA CL16 - Darlington S2 Mains"}]
[null,{"$f":"IF(ISBLANK(dms_E13_Projects_03),\"\",dms_E13_Projects_03)","v":"2130 MAINS ALTERATION CHRG - MA CL17 Darlington Stg3"}]
[null,{"$f":"IF(ISBLANK(dms_E13_Projects_04),\"\",dms_E13_Projects_04)","v":"2130 MAINS ALTERATION CHRG - MA CL18 - Oaklands Rd Rail X2"}]
[null,{"$f":"IF(ISBLANK(dms_E13_Projects_05),\"\",dms_E13_Projects_05)","v":"2130 MAINS ALTERATION CHRG - MA CL16 T2T WP3&4"}]
[null,{"$f":"IF(ISBLANK(dms_E13_Projects_06),\"\",dms_E13_Projects_06)","v":"2130 MAINS ALTERATION CHRG - MA CL15 - T2T"}]
[null,{"$f":"IF(ISBLANK(dms_E13_Projects_07),\"\",dms_E13_Projects_07)","v":"2130 MAINS ALTERATION CHRG - MA CL18 Nth Tce Tram Valve"}]
[null,{"$f":"IF(ISBLANK(dms_E13_Projects_08),\"\",dms_E13_Projects_08)","v":"2130 MAINS ALTERATION CHRG - MA CL18 - Oaklands Rd Rail X"}]
[null,{"$f":"IF(ISBLANK(dms_E13_Projects_09),\"\",dms_E13_Projects_09)","v":"2130 MAINS ALTERATION - CHARGEABLE - CAPEX <$500K"}]
[null,{"$f":"IF(ISBLANK(dms_E13_Projects_10),\"\",dms_E13_Projects_10)","v":"2131 MAINS ALTERATION - NON CHARGEABLE - CAPEX <$500K"}]
[null,{"$f":"IF(ISBLANK(dms_E13_Projects_11),\"\",dms_E13_Projects_11)","v":"2139 NETWORK - REGULATOR STAY IN BUSINESS <$500K"}]
[null,{"$f":"IF(ISBLANK(dms_E13_Projects_12),\"\",dms_E13_Projects_12)","v":"2142 NETWORK - REGULATOR CAPEX <$500K"}]
[null,{"$f":"IF(ISBLANK(dms_E13_Projects_13),\"\",dms_E13_Projects_13)","v":"2152 NETWORK - STOPPLE EQUIPMENT HDPE CAMERA"}]
[null,{"$f":"IF(ISBLANK(dms_E13_Projects_14),\"\",dms_E13_Projects_14)","v":"2152 NETWORK - STOPPLE EQUIPMENT<$500K"}]
[null,{"$f":"IF(ISBLANK(dms_E13_Projects_15),\"\",dms_E13_Projects_15)","v":"2190 OTHER - NON RETIC CAPITAL"}]
[null,{"$f":"+B22","v":"3043 MAJOR PROJECTS - BOWDEN"}]
[null,{"$f":"+B23","v":"2152 NETWORK - STOPPLE EQUIPMENT - INLETS INSIDE CAVITIES"}]
[null,"2990 MAJOR PROJECTS - VIRGINIA"]
[null,{"$f":"+B25","v":"2997 MAJOR PROJECTS - BERRI"}]
[null,"Aggregate of other projects with total expenditure of less than $500,000"]
[null,"Total",{"$f":"SUM(C160:C179)","v":0},{"$f":"SUM(D160:D179)","v":0},{"$f":"SUM(E160:E179)","v":0},{"$f":"SUM(F160:F179)","v":0},{"$f":"SUM(G160:G179)","v":0}]

{"sheet":"N2. Network characteristics","index":15,"n_rows":1429,"n_cols":8,"rows_kept":1429,"cut":false,"hidden":false,"merged":[[7,3,7,7],[8,3,8,7]]}
[null,{"$f":"INDEX(dms_Worksheet_List,MATCH(dms_Model,dms_Model_List))","v":"HISTORICAL ANNUAL REPORTING"}]
[null,{"$f":"INDEX(dms_TradingNameFull_List,MATCH(dms_TradingName,dms_TradingName_List))","v":"Australian Gas Networks Limited (reporting data for SA)"}]
[null,{"$f":"dms_Header_Span","v":"2014-15 to 2018-19"}]
[null,"N2. NETWORK CHARACTERISTICS"]
[]
[]
[null,"N2.5 - NETWORK LENGTH - BY POST CODE"]
[null,null,null,"VOLUMES"]
[null,null,null,"Metres, 0's"]
[null,"Post Code\n","Asset Type\n(drop down)",{"$f":"dms_y1","v":"2014-15"},{"$f":"dms_y2","v":"2015-16"},{"$f":"dms_y3","v":"2016-17"},{"$f":"dms_y4","v":"2017-18"},{"$f":"dms_y5","v":"2018-19"}]
[null,"5000","Cast Iron",45263,35952,26566,24267,13047]
[null,"5000","PVC",0,0,0,0,0]
[null,"5000","Polyamide",0,0,0,0,0]
[null,"5000","High density polyethylene (80)",0,0,0,0,0]
[null,"5000","High density polyethylene (100)",3410,18476,35258,38836,49400]
[null,"5000","High density polyethylene (250)",3213,1621,480,379,168]
[null,"5000","High density polyethylene (575)",4754,3119,2724,2351,2135]
[null,"5000","Medium density polyethylene",25718,24474,24056,24040,23685]
[null,"5000","Unprotected steel",3504,2850,2285,1907,1134]
[null,"5000","Protected steel",31998,30507,28399,27753,27433]
[null,"5000","Other",128,128,137,141,160]
[null,"5006","Cast Iron",23143,22899,22899,22899,22879]
[null,"5006","PVC",0,0,0,0,0]
[null,"5006","Polyamide",0,0,0,0,0]
[null,"5006","High density polyethylene (80)",0,0,0,0,0]
[null,"5006","High density polyethylene (100)",0,98,184,200,269]
[null,"5006","High density polyethylene (250)",7891,8025,8025,8025,8025]
[null,"5006","High density polyethylene (575)",2711,2719,2735,2748,2748]
[null,"5006","Medium density polyethylene",5181,5586,5737,5737,5714]
[null,"5006","Unprotected steel",1732,1769,1705,1692,1692]
[null,"5006","Protected steel",9785,9964,10031,10005,10021]
[null,"5006","Other",0,0,0,0,0]
[null,"5007","Cast Iron",2265,2265,2043,655,445]
[null,"5007","PVC",0,0,0,0,0]
[null,"5007","Polyamide",0,0,0,0,0]
[null,"5007","High density polyethylene (80)",0,0,0,0,0]
[null,"5007","High density polyethylene (100)",0,1003,1612,10372,10981]
[null,"5007","High density polyethylene (250)",1688,1615,1288,187,187]
[null,"5007","High density polyethylene (575)",17347,17058,16914,12022,12132]
[null,"5007","Medium density polyethylene",26779,25750,25704,25482,25477]
[null,"5007","Unprotected steel",762,762,762,276,0]
[null,"5007","Protected steel",7338,7201,7234,7245,7252]
[null,"5007","Other",0,0,0,0,0]
[null,"5008","Cast Iron",5884,5667,5667,5244,5139]
[null,"5008","PVC",0,0,0,0,0]
[null,"5008","Polyamide",0,0,0,0,0]
[null,"5008","High density polyethylene (80)",0,0,0,0,0]
[null,"5008","High density polyethylene (100)",0,999,2616,6053,7328]
[null,"5008","High density polyethylene (250)",13800,13956,13878,13558,12730]
[null,"5008","High density polyethylene (575)",26726,26253,26200,26119,26036]
[null,"5008","Medium density polyethylene",24403,23797,23410,23055,23044]
[null,"5008","Unprotected steel",2530,2530,2530,1213,1193]
[null,"5008","Protected steel",7832,7840,7803,7762,8060]
[null,"5008","Other",0,0,0,0,0]
[null,"5009","Cast Iron",2126,2126,2044,2044,1321]
[null,"5009","PVC",0,0,0,0,0]
[null,"5009","Polyamide",0,0,0,0,0]
[null,"5009","High density polyethylene (80)",0,0,0,0,0]
[null,"5009","High density polyethylene (100)",0,0,455,971,4288]
[null,"5009","High density polyethylene (250)",4377,4377,4341,4341,1649]
[null,"5009","High density polyethylene (575)",12752,12773,12772,12770,12778]
[null,"5009","Medium density polyethylene",15524,15538,15532,15532,15523]
[null,"5009","Unprotected steel",346,346,320,319,181]
[null,"5009","Protected steel",6086,6086,6086,6086,5777]
[null,"5009","Other",16,16,16,16,0]
[null,"5010","Cast Iron",5590,5578,1508,810,810]
[null,"5010","PVC",0,0,0,0,0]
[null,"5010","Polyamide",0,0,0,0,0]
[null,"5010","High density polyethylene (80)",0,0,0,0,0]
[null,"5010","High density polyethylene (100)",0,135,5357,6998,6998]
[null,"5010","High density polyethylene (250)",4879,4879,4512,4512,4527]
[null,"5010","High density polyethylene (575)",3730,3733,3577,3577,3575]
[null,"5010","Medium density polyethylene",14016,14320,14111,14090,13930]
[null,"5010","Unprotected steel",100,100,0,0,0]
[null,"5010","Protected steel",11933,11937,11801,11795,11795]
[null,"5010","Other",0,0,0,0,0]
[null,"5011","Cast Iron",4433,2816,2704,2704,2651]
[null,"5011","PVC",0,0,0,0,0]
[null,"5011","Polyamide",0,0,0,0,0]
[null,"5011","High density polyethylene (80)",0,0,0,0,0]
[null,"5011","High density polyethylene (100)",426,2400,5498,6227,8315]
[null,"5011","High density polyethylene (250)",6897,6465,6522,6465,5227]
[null,"5011","High density polyethylene (575)",10848,10921,10918,10918,10851]
[null,"5011","Medium density polyethylene",45213,48048,48119,48078,48145]
[null,"5011","Unprotected steel",910,612,230,230,73]
[null,"5011","Protected steel",5294,5329,5329,5329,5311]
[null,"5011","Other",102,102,102,102,102]
[null,"5012","Cast Iron",15178,8920,2250,1,0]
[null,"5012","PVC",0,0,0,0,0]
[null,"5012","Polyamide",0,0,0,0,0]
[null,"5012","High density polyethylene (80)",0,0,0,0,0]
[null,"5012","High density polyethylene (100)",0,11534,24644,29722,29817]
[null,"5012","High density polyethylene (250)",5893,4172,1707,104,104]
[null,"5012","High density polyethylene (575)",13753,12826,11729,11373,11373]
[null,"5012","Medium density polyethylene",14237,13094,12694,12541,12541]
[null,"5012","Unprotected steel",3155,2003,181,83,16]
[null,"5012","Protected steel",5339,5263,5244,5435,5435]
[null,"5012","Other",5,5,5,5,5]
[null,"5013","Cast Iron",13114,3490,1431,1431,1431]
[null,"5013","PVC",0,0,0,0,0]
[null,"5013","Polyamide",0,0,0,0,0]
[null,"5013","High density polyethylene (80)",0,0,0,0,0]
[null,"5013","High density polyethylene (100)",5884,22158,22590,22709,23006]
[null,"5013","High density polyethylene (250)",5352,49,0,0,0]
[null,"5013","High density polyethylene (575)",7554,5228,5228,5228,5229]
[null,"5013","Medium density polyethylene",32884,34987,35067,35052,35041]
[null,"5013","Unprotected steel",1335,112,0,0,0]
[null,"5013","Protected steel",20418,20380,19903,19903,19903]
[null,"5013","Other",0,0,0,0,0]
[null,"5014","Cast Iron",12450,10485,10413,10311,10311]
[null,"5014","PVC",0,0,0,0,0]
[null,"5014","Polyamide",0,0,0,0,0]
[null,"5014","High density polyethylene (80)",0,0,0,0,0]
[null,"5014","High density polyethylene (100)",301,1795,2587,3293,3453]
[null,"5014","High density polyethylene (250)",8993,8048,7873,7853,7853]
[null,"5014","High density polyethylene (575)",35599,35472,35562,35569,35566]
[null,"5014","Medium density polyethylene",14834,16252,16239,16247,16223]
[null,"5014","Unprotected steel",796,620,620,620,620]
[null,"5014","Protected steel",9233,9258,9248,9226,9226]
[null,"5014","Other",0,0,0,0,0]
[null,"5015","Cast Iron",11501,11501,11291,11248,11248]
[null,"5015","PVC",0,0,0,0,0]
[null,"5015","Polyamide",0,0,0,0,0]
[null,"5015","High density polyethylene (80)",0,0,0,0,0]
[null,"5015","High density polyethylene (100)",0,56,215,6705,7977]
[null,"5015","High density polyethylene (250)",14815,14815,14732,9731,9289]
[null,"5015","High density polyethylene (575)",6827,6830,6830,6610,6580]
[null,"5015","Medium density polyethylene",8085,8171,8179,8125,8099]
[null,"5015","Unprotected steel",2357,2357,2357,2357,2357]
[null,"5015","Protected steel",5290,5328,5316,5316,5316]
[null,"5015","Other",0,0,0,0,0]
[null,"5016","Cast Iron",29834,29834,15110,14649,14649]
[null,"5016","PVC",0,0,0,0,0]
[null,"5016","Polyamide",0,0,0,0,0]
[null,"5016","High density polyethylene (80)",0,0,0,0,0]
[null,"5016","High density polyethylene (100)",0,2847,26372,27155,28202]
[null,"5016","High density polyethylene (250)",4558,3952,1758,1470,1470]
[null,"5016","High density polyethylene (575)",4885,2719,1106,1100,1067]
[null,"5016","Medium density polyethylene",5661,5953,4758,4758,4758]
[null,"5016","Unprotected steel",6340,6340,3926,3700,3523]
[null,"5016","Protected steel",2779,2788,2789,2772,2772]
[null,"5016","Other",0,0,0,0,0]
[null,"5017","Cast Iron",21564,21564,17149,16582,16581]
[null,"5017","PVC",0,0,0,0,0]
[null,"5017","Polyamide",0,0,0,0,0]
[null,"5017","High density polyethylene (80)",0,0,0,0,0]
[null,"5017","High density polyethylene (100)",0,100,8275,9440,9580]
[null,"5017","High density polyethylene (250)",2819,2819,1231,1263,1263]
[null,"5017","High density polyethylene (575)",1591,1588,1176,1162,1162]
[null,"5017","Medium density polyethylene",2678,2690,2363,2331,2317]
[null,"5017","Unprotected steel",4422,4422,3637,3637,3637]
[null,"5017","Protected steel",2295,2295,2306,2284,2284]
[null,"5017","Other",0,0,0,0,0]
[null,"5018","Cast Iron",639,639,639,639,639]
[null,"5018","PVC",0,0,0,0,0]
[null,"5018","Polyamide",0,0,0,0,0]
[null,"5018","High density polyethylene (80)",0,0,0,0,0]
[null,"5018","High density polyethylene (100)",0,0,0,0,8672]
[null,"5018","High density polyethylene (250)",21853,21853,21853,21853,12855]
[null,"5018","High density polyethylene (575)",6869,6868,6868,6868,6806]
[null,"5018","Medium density polyethylene",1650,1658,1658,1658,1655]
[null,"5018","Unprotected steel",120,120,120,120,120]
[null,"5018","Protected steel",1704,1704,1704,1704,1704]
[null,"5018","Other",0,0,0,0,0]
[null,"5019","Cast Iron",21614,21571,21391,21389,21389]
[null,"5019","PVC",0,0,0,0,0]
[null,"5019","Polyamide",0,0,0,0,0]
[null,"5019","High density polyethylene (80)",0,0,0,0,0]
[null,"5019","High density polyethylene (100)",0,8,213,8495,8993]
[null,"5019","High density polyethylene (250)",10578,10542,10541,2933,2227]
[null,"5019","High density polyethylene (575)",3381,3446,3446,3185,3172]
[null,"5019","Medium density polyethylene",11220,11485,11561,11494,11494]
[null,"5019","Unprotected steel",1350,1350,1350,1350,1350]
[null,"5019","Protected steel",3248,3228,3228,3243,3247]
[null,"5019","Other",0,0,0,0,0]
[null,"5020","Cast Iron",1325,0,0,0,0]
[null,"5020","PVC",0,0,0,0,0]
[null,"5020","Polyamide",0,0,0,0,0]
[null,"5020","High density polyethylene (80)",0,0,0,0,0]
[null,"5020","High density polyethylene (100)",0,0,74,14110,16531]
[null,"5020","High density polyethylene (250)",16769,16734,16719,5822,930]
[null,"5020","High density polyethylene (575)",1375,1375,1375,778,788]
[null,"5020","Medium density polyethylene",1047,1048,1048,1170,1171]
[null,"5020","Unprotected steel",0,0,0,0,0]
[null,"5020","Protected steel",257,257,257,65,47]
[null,"5020","Other",0,0,0,0,0]
[null,"5021","Cast Iron",0,0,0,0,0]
[null,"5021","PVC",0,0,0,0,0]
[null,"5021","Polyamide",0,0,0,0,0]
[null,"5021","High density polyethylene (80)",0,0,0,0,0]
[null,"5021","High density polyethylene (100)",0,0,1282,8102,12712]
[null,"5021","High density polyethylene (250)",25416,25416,25415,20456,15530]
[null,"5021","High density polyethylene (575)",10366,10366,10366,10301,10301]
[null,"5021","Medium density polyethylene",322,322,340,467,355]
[null,"5021","Unprotected steel",21,21,21,21,21]
[null,"5021","Protected steel",1849,1849,1849,1849,1804]
[null,"5021","Other",0,0,0,0,0]
[null,"5022","Cast Iron",9038,8566,8566,8488,8488]
[null,"5022","PVC",0,0,0,0,0]
[null,"5022","Polyamide",0,0,0,0,0]
[null,"5022","High density polyethylene (80)",0,0,0,0,0]
[null,"5022","High density polyethylene (100)",0,76,366,5307,13676]
[null,"5022","High density polyethylene (250)",12592,12810,12739,9500,1845]
[null,"5022","High density polyethylene (575)",6663,6855,6856,6741,6459]
[null,"5022","Medium density polyethylene",52211,52275,52357,52321,52423]
[null,"5022","Unprotected steel",2221,2221,2221,2220,2075]
[null,"5022","Protected steel",6607,6607,6607,6387,6331]
[null,"5022","Other",0,0,0,0,0]
[null,"5023","Cast Iron",31991,31230,31230,31230,31213]
[null,"5023","PVC",0,0,0,0,0]
[null,"5023","Polyamide",0,0,0,0,0]
[null,"5023","High density polyethylene (80)",0,0,0,0,0]
[null,"5023","High density polyethylene (100)",0,1275,2209,4351,9294]
[null,"5023","High density polyethylene (250)",11056,11074,11078,10034,6238]
[null,"5023","High density polyethylene (575)",21268,21211,21231,21211,20926]
[null,"5023","Medium density polyethylene",22992,23146,23194,23197,23193]
[null,"5023","Unprotected steel",4744,4443,4446,4438,4438]
[null,"5023","Protected steel",5245,5243,5243,5243,5242]
[null,"5023","Other",0,0,0,0,0]
[null,"5024","Cast Iron",35861,35843,35843,35843,35788]
[null,"5024","PVC",0,0,0,0,0]
[null,"5024","Polyamide",0,0,0,0,0]
[null,"5024","High density polyethylene (80)",0,0,0,0,0]
[null,"5024","High density polyethylene (100)",0,53,148,692,1620]
[null,"5024","High density polyethylene (250)",6975,7046,7047,7046,7046]
[null,"5024","High density polyethylene (575)",2560,2824,2825,2826,2818]
[null,"5024","Medium density polyethylene",34921,34904,34911,34858,34852]
[null,"5024","Unprotected steel",1972,1972,1972,1971,1950]
[null,"5024","Protected steel",417,417,417,417,417]
[null,"5024","Other",0,0,0,0,0]
[null,"5025","Cast Iron",28165,28165,28148,28147,28147]
[null,"5025","PVC",0,0,0,0,0]
[null,"5025","Polyamide",0,0,0,0,0]
[null,"5025","High density polyethylene (80)",0,0,0,0,0]
[null,"5025","High density polyethylene (100)",0,30,111,435,543]
[null,"5025","High density polyethylene (250)",7984,7984,7984,7984,7984]
[null,"5025","High density polyethylene (575)",7891,7885,7900,7900,7899]
[null,"5025","Medium density polyethylene",5542,5602,5618,5618,5617]
[null,"5025","Unprotected steel",1192,1192,1192,1192,1142]
[null,"5025","Protected steel",160,160,160,160,160]
[null,"5025","Other",0,0,0,0,0]
[null,"5031","Cast Iron",39497,39450,39450,39439,36596]
[null,"5031","PVC",0,0,0,0,0]
[null,"5031","Polyamide",0,0,0,0,0]
[null,"5031","High density polyethylene (80)",0,0,0,0,0]
[null,"5031","High density polyethylene (100)",0,341,484,612,3774]
[null,"5031","High density polyethylene (250)",7726,7510,7490,7471,7470]
[null,"5031","High density polyethylene (575)",12667,12660,12670,12672,12677]
[null,"5031","Medium density polyethylene",6473,6480,6488,6488,6483]
[null,"5031","Unprotected steel",1012,1012,1002,1002,992]
[null,"5031","Protected steel",9630,9695,9702,9704,9707]
[null,"5031","Other",12,12,12,12,12]
[null,"5032","Cast Iron",33420,33398,33398,33398,32398]
[null,"5032","PVC",0,0,0,0,0]
[null,"5032","Polyamide",0,0,0,0,0]
[null,"5032","High density polyethylene (80)",0,0,0,0,0]
[null,"5032","High density polyethylene (100)",0,995,1201,2154,4627]
[null,"5032","High density polyethylene (250)",10122,10125,10125,9407,9096]
[null,"5032","High density polyethylene (575)",4834,4834,4834,4835,4750]
[null,"5032","Medium density polyethylene",14370,14426,14427,14427,14435]
[null,"5032","Unprotected steel",4184,4161,4161,4177,4163]
[null,"5032","Protected steel",2285,2285,2285,2289,2249]
[null,"5032","Other",0,0,0,0,0]
[null,"5033","Cast Iron",8824,8824,8824,8824,6610]
[null,"5033","PVC",0,0,0,0,0]
[null,"5033","Polyamide",0,0,0,0,0]
[null,"5033","High density polyethylene (80)",0,0,0,0,0]
[null,"5033","High density polyethylene (100)",0,246,414,957,2928]
[null,"5033","High density polyethylene (250)",3733,3733,3733,3613,3622]
[null,"5033","High density polyethylene (575)",13786,13832,13832,13832,13845]
[null,"5033","Medium density polyethylene",21158,21228,21274,21273,21221]
[null,"5033","Unprotected steel",998,990,990,990,992]
[null,"5033","Protected steel",2488,2492,2492,2492,2468]
[null,"5033","Other",0,0,0,0,0]
[null,"5034","Cast Iron",466,466,466,466,466]
[null,"5034","PVC",0,0,0,0,0]
[null,"5034","Polyamide",0,0,0,0,0]
[null,"5034","High density polyethylene (80)",0,0,0,0,0]
[null,"5034","High density polyethylene (100)",529,5980,7059,7809,10040]
[null,"5034","High density polyethylene (250)",4105,4105,4105,3431,3274]
[null,"5034","High density polyethylene (575)",16767,13731,13419,13143,11311]
[null,"5034","Medium density polyethylene",25363,23525,23995,23984,23952]
[null,"5034","Unprotected steel",27,32,50,50,32]
[null,"5034","Protected steel",4523,4521,4525,4575,4621]
[null,"5034","Other",6,6,6,6,6]
[null,"5035","Cast Iron",121,121,0,0,0]
[null,"5035","PVC",0,0,0,0,0]
[null,"5035","Polyamide",0,0,0,0,0]
[null,"5035","High density polyethylene (80)",0,0,0,0,0]
[null,"5035","High density polyethylene (100)",0,19,54,3974,4917]
[null,"5035","High density polyethylene (250)",8108,7909,7960,4512,4512]
[null,"5035","High density polyethylene (575)",13441,13520,13520,13567,12869]
[null,"5035","Medium density polyethylene",7813,8096,8078,7992,7929]
[null,"5035","Unprotected steel",0,22,22,22,22]
[null,"5035","Protected steel",3062,3031,3031,3040,3040]
[null,"5035","Other",0,0,0,0,0]
[null,"5037","Cast Iron",2739,2739,2724,2724,1195]
[null,"5037","PVC",0,0,0,0,0]
[null,"5037","Polyamide",0,0,0,0,0]
[null,"5037","High density polyethylene (80)",0,0,0,0,0]
[null,"5037","High density polyethylene (100)",0,204,531,1921,3875]
[null,"5037","High density polyethylene (250)",6873,6872,6878,5982,5981]
[null,"5037","High density polyethylene (575)",15151,15141,15151,15292,15089]
[null,"5037","Medium density polyethylene",23368,23449,23460,23460,23423]
[null,"5037","Unprotected steel",99,94,94,94,23]
[null,"5037","Protected steel",3994,4010,4010,4010,4011]
[null,"5037","Other",0,0,0,0,0]
[null,"5038","Cast Iron",1919,1907,1907,1907,88]
[null,"5038","PVC",0,0,0,0,0]
[null,"5038","Polyamide",0,0,0,0,0]
[null,"5038","High density polyethylene (80)",0,0,0,0,0]
[null,"5038","High density polyethylene (100)",0,392,901,4387,8640]
[null,"5038","High density polyethylene (250)",5979,5975,5975,4040,4056]
[null,"5038","High density polyethylene (575)",14097,14098,14169,14187,12422]
[null,"5038","Medium density polyethylene",55694,55903,56039,56015,55907]
[null,"5038","Unprotected steel",1772,1772,1772,1644,257]
[null,"5038","Protected steel",3691,3669,3641,3645,3628]
[null,"5038","Other",0,0,0,0,0]
[null,"5039","Cast Iron",21,21,21,21,21]
[null,"5039","PVC",0,0,0,0,0]
[null,"5039","Polyamide",0,0,0,0,0]
[null,"5039","High density polyethylene (80)",0,0,0,0,0]
[null,"5039","High density polyethylene (100)",0,89,461,4641,26452]
[null,"5039","High density polyethylene (250)",14563,14562,13894,11498,3988]
[null,"5039","High density polyethylene (575)",25761,25781,26450,24932,11652]
[null,"5039","Medium density polyethylene",11918,12025,12109,12109,12073]
[null,"5039","Unprotected steel",133,118,118,118,91]
[null,"5039","Protected steel",7246,7253,7253,7253,7046]
[null,"5039","Other",0,0,0,0,0]
[null,"5040","Cast Iron",159,159,159,159,159]
[null,"5040","PVC",0,0,0,0,0]
[null,"5040","Polyamide",0,0,0,0,0]
[null,"5040","High density polyethylene (80)",0,0,0,0,0]
[null,"5040","High density polyethylene (100)",0,40,71,79,324]
[null,"5040","High density polyethylene (250)",1616,1244,1225,1225,1225]
[null,"5040","High density polyethylene (575)",3400,3400,3400,3400,3393]
[null,"5040","Medium density polyethylene",7269,7269,7284,7284,7283]
[null,"5040","Unprotected steel",161,161,161,161,161]
[null,"5040","Protected steel",1879,1998,1991,1991,1988]
[null,"5040","Other",0,0,0,0,0]
[null,"5041","Cast Iron",13,13,13,13,13]
[null,"5041","PVC",0,0,0,0,0]
[null,"5041","Polyamide",0,0,0,0,0]
[null,"5041","High density polyethylene (80)",0,0,0,0,0]
[null,"5041","High density polyethylene (100)",0,476,565,2451,8845]
[null,"5041","High density polyethylene (250)",0,0,0,0,0]
[null,"5041","High density polyethylene (575)",29492,29496,29514,27778,22213]
[null,"5041","Medium density polyethylene",34763,34736,34787,34745,34724]
[null,"5041","Unprotected steel",39,39,39,39,39]
[null,"5041","Protected steel",6402,6402,6420,6420,6428]
[null,"5041","Other",0,0,0,0,0]
[null,"5042","Cast Iron",1583,1583,1535,1534,1533]
[null,"5042","PVC",0,0,0,0,0]
[null,"5042","Polyamide",0,0,0,0,0]
[null,"5042","High density polyethylene (80)",0,0,0,0,0]
[null,"5042","High density polyethylene (100)",0,310,787,884,3095]
[null,"5042","High density polyethylene (250)",2996,2996,3073,2937,2937]
[null,"5042","High density polyethylene (575)",3344,3369,3030,3026,2540]
[null,"5042","Medium density polyethylene",59915,60131,58838,58729,58739]
[null,"5042","Unprotected steel",987,987,987,987,987]
[null,"5042","Protected steel",7717,7708,8033,8189,8204]
[null,"5042","Other",0,0,0,0,0]
[null,"5043","Cast Iron",6921,6334,2802,2764,5]
[null,"5043","PVC",0,0,0,0,0]
[null,"5043","Polyamide",0,0,0,0,0]
[null,"5043","High density polyethylene (80)",0,0,0,0,0]
[null,"5043","High density polyethylene (100)",0,380,2476,5035,10008]
[null,"5043","High density polyethylene (250)",4386,4382,3430,3140,609]
[null,"5043","High density polyethylene (575)",3329,3249,3263,2414,2193]
[null,"5043","Medium density polyethylene",93666,94698,94569,94637,94548]
[null,"5043","Unprotected steel",366,174,0,0,8]
[null,"5043","Protected steel",2533,2544,2524,2528,2522]
[null,"5043","Other",0,0,0,0,0]
[null,"5044","Cast Iron",256,66,66,66,1]
[null,"5044","PVC",0,0,0,0,0]
[null,"5044","Polyamide",0,0,0,0,0]
[null,"5044","High density polyethylene (80)",0,0,0,0,0]
[null,"5044","High density polyethylene (100)",0,75,251,4031,4836]
[null,"5044","High density polyethylene (250)",3,1,1,1,1]
[null,"5044","High density polyethylene (575)",4365,4309,4308,757,124]
[null,"5044","Medium density polyethylene",50474,50711,51196,51135,51159]
[null,"5044","Unprotected steel",2,0,76,76,76]
[null,"5044","Protected steel",5198,5223,5223,5150,5043]
[null,"5044","Other",0,0,0,0,0]
[null,"5045","Cast Iron",4279,53,1,1,1]
[null,"5045","PVC",0,0,0,0,0]
[null,"5045","Polyamide",0,0,0,0,0]
[null,"5045","High density polyethylene (80)",0,0,0,0,0]
[null,"5045","High density polyethylene (100)",394,7998,10268,11656,11905]
[null,"5045","High density polyethylene (250)",1818,484,5,0,0]
[null,"5045","High density polyethylene (575)",1642,1185,869,869,869]
[null,"5045","Medium density polyethylene",75323,75759,77439,77427,77346]
[null,"5045","Unprotected steel",3037,1437,249,65,65]
[null,"5045","Protected steel",2878,2840,2840,2840,2840]
[null,"5045","Other",4,4,4,4,4]
[null,"5046","Cast Iron",4066,3837,1447,722,0]
[null,"5046","PVC",0,0,0,0,0]
[null,"5046","Polyamide",0,0,0,0,0]
[null,"5046","High density polyethylene (80)",0,0,0,0,0]
[null,"5046","High density polyethylene (100)",0,956,4930,5283,5330]
[null,"5046","High density polyethylene (250)",40,40,0,0,0]
[null,"5046","High density polyethylene (575)",804,804,43,43,43]
[null,"5046","Medium density polyethylene",51795,52712,52324,52322,52409]
[null,"5046","Unprotected steel",170,118,59,0,0]
[null,"5046","Protected steel",925,741,449,148,108]
[null,"5046","Other",0,0,0,0,0]
[null,"5047","Cast Iron",2810,1826,661,38,0]
[null,"5047","PVC",0,0,0,0,0]
[null,"5047","Polyamide",0,0,0,0,0]
[null,"5047","High density polyethylene (80)",0,0,0,0,0]
[null,"5047","High density polyethylene (100)",0,276,1476,1975,2493]
[null,"5047","High density polyethylene (250)",1,0,0,0,0]
[null,"5047","High density polyethylene (575)",221,166,136,136,136]
[null,"5047","Medium density polyethylene",44692,46458,46368,46249,46280]
[null,"5047","Unprotected steel",105,105,105,0,0]
[null,"5047","Protected steel",441,443,433,433,433]
[null,"5047","Other",0,0,0,0,0]
[null,"5048","Cast Iron",831,229,162,42,32]
[null,"5048","PVC",0,0,0,0,0]
[null,"5048","Polyamide",0,0,0,0,0]
[null,"5048","High density polyethylene (80)",0,0,0,0,0]
[null,"5048","High density polyethylene (100)",0,816,1224,5319,5814]
[null,"5048","High density polyethylene (250)",3274,3258,3257,45,45]
[null,"5048","High density polyethylene (575)",2330,2322,2323,2247,2309]
[null,"5048","Medium density polyethylene",71678,72222,72392,72568,72563]
[null,"5048","Unprotected steel",5,1,1,1,1]
[null,"5048","Protected steel",1174,1164,1165,1145,1155]
[null,"5048","Other",0,0,0,0,0]
[null,"5049","Cast Iron",244,152,46,46,0]
[null,"5049","PVC",0,0,0,0,0]
[null,"5049","Polyamide",0,0,0,0,0]
[null,"5049","High density polyethylene (80)",0,0,0,0,0]
[null,"5049","High density polyethylene (100)",0,168,236,407,670]
[null,"5049","High density polyethylene (250)",0,0,0,0,0]
[null,"5049","High density polyethylene (575)",1273,1273,1273,1273,1274]
[null,"5049","Medium density polyethylene",50630,50567,50889,50916,50914]
[null,"5049","Unprotected steel",107,0,3,0,0]
[null,"5049","Protected steel",13046,13220,13220,13221,13221]
[null,"5049","Other",0,0,0,0,0]
[null,"5050","Cast Iron",15,15,15,15,15]
[null,"5050","PVC",0,0,0,0,0]
[null,"5050","Polyamide",0,0,0,0,0]
[null,"5050","High density polyethylene (80)",0,0,0,0,0]
[null,"5050","High density polyethylene (100)",0,0,23,83,3107]
[null,"5050","High density polyethylene (250)",0,0,0,0,0]
[null,"5050","High density polyethylene (575)",5646,5656,5645,5769,2984]
[null,"5050","Medium density polyethylene",24481,24481,24481,24481,24478]
[null,"5050","Unprotected steel",0,0,0,0,0]
[null,"5050","Protected steel",956,956,956,828,822]
[null,"5050","Other",0,0,0,0,0]
[null,"5051","Cast Iron",0,0,0,0,0]
[null,"5051","PVC",0,0,0,0,0]
[null,"5051","Polyamide",0,0,0,0,0]
[null,"5051","High density polyethylene (80)",0,0,0,0,0]
[null,"5051","High density polyethylene (100)",30,276,1700,7320,16640]
[null,"5051","High density polyethylene (250)",0,0,0,0,0]
[null,"5051","High density polyethylene (575)",35360,35360,35360,32316,23996]
[null,"5051","Medium density polyethylene",25196,25803,25761,25772,25928]
[null,"5051","Unprotected steel",0,0,0,0,0]
[null,"5051","Protected steel",9553,9553,9553,9553,9592]
[null,"5051","Other",0,0,0,0,0]
[null,"5052","Cast Iron",0,0,0,0,0]
[null,"5052","PVC",0,0,0,0,0]
[null,"5052","Polyamide",0,0,0,0,0]
[null,"5052","High density polyethylene (80)",0,0,0,0,0]
[null,"5052","High density polyethylene (100)",0,0,0,942,8542]
[null,"5052","High density polyethylene (250)",0,0,0,0,0]
[null,"5052","High density polyethylene (575)",20484,20484,20477,19822,12297]
[null,"5052","Medium density polyethylene",2429,2429,2429,2429,2413]
[null,"5052","Unprotected steel",0,0,0,0,0]
[null,"5052","Protected steel",11009,11009,11028,11021,11023]
[null,"5052","Other",0,0,0,0,0]
[null,"5061","Cast Iron",3993,3993,3993,236,0]
[null,"5061","PVC",0,0,0,0,0]
[null,"5061","Polyamide",0,0,0,0,0]
[null,"5061","High density polyethylene (80)",0,0,0,0,0]
[null,"5061","High density polyethylene (100)",944,4171,5062,10942,11029]
[null,"5061","High density polyethylene (250)",125,125,125,18,18]
[null,"5061","High density polyethylene (575)",37479,37350,36589,34457,34458]
[null,"5061","Medium density polyethylene",13198,10063,10049,10011,10011]
[null,"5061","Unprotected steel",0,0,0,0,0]
[null,"5061","Protected steel",2435,2435,2435,2435,2435]
[null,"5061","Other",0,0,0,0,0]
[null,"5062","Cast Iron",49,49,49,49,49]
[null,"5062","PVC",0,0,0,0,0]
[null,"5062","Polyamide",0,0,0,0,0]
[null,"5062","High density polyethylene (80)",0,0,0,0,0]
[null,"5062","High density polyethylene (100)",0,68,218,4805,5159]
[null,"5062","High density polyethylene (250)",926,926,927,927,927]
[null,"5062","High density polyethylene (575)",33908,33785,33743,29547,29104]
[null,"5062","Medium density polyethylene",46195,46343,46329,46323,46341]
[null,"5062","Unprotected steel",35,35,21,27,27]
[null,"5062","Protected steel",5262,5224,5224,5251,5251]
[null,"5062","Other",0,0,0,0,0]
[null,"5063","Cast Iron",273,273,273,197,86]
[null,"5063","PVC",0,0,0,0,0]
[null,"5063","Polyamide",0,0,0,0,0]
[null,"5063","High density polyethylene (80)",0,0,0,0,0]
[null,"5063","High density polyethylene (100)",0,109,150,4141,4919]
[null,"5063","High density polyethylene (250)",94,94,94,74,74]
[null,"5063","High density polyethylene (575)",45499,45526,45583,42288,41871]
[null,"5063","Medium density polyethylene",4074,4294,4310,4303,4278]
[null,"5063","Unprotected steel",64,64,64,18,0]
[null,"5063","Protected steel",3867,3867,3867,3861,3758]
[null,"5063","Other",0,0,0,0,0]
[null,"5064","Cast Iron",3682,140,113,113,113]
[null,"5064","PVC",0,0,0,0,0]
[null,"5064","Polyamide",0,0,0,0,0]
[null,"5064","High density polyethylene (80)",0,0,0,0,0]
[null,"5064","High density polyethylene (100)",2482,7301,7567,7816,8844]
[null,"5064","High density polyethylene (250)",1616,1457,1457,1449,1449]
[null,"5064","High density polyethylene (575)",14878,14571,14511,14472,13547]
[null,"5064","Medium density polyethylene",28359,28437,28428,28426,28428]
[null,"5064","Unprotected steel",448,71,0,0,0]
[null,"5064","Protected steel",4389,4374,4308,4347,4347]
[null,"5064","Other",10,10,10,10,10]
[null,"5065","Cast Iron",807,106,48,48,0]
[null,"5065","PVC",0,0,0,0,0]
[null,"5065","Polyamide",0,0,0,0,0]
[null,"5065","High density polyethylene (80)",0,0,0,0,0]
[null,"5065","High density polyethylene (100)",113,1067,1374,1455,2540]
[null,"5065","High density polyethylene (250)",94,0,0,0,0]
[null,"5065","High density polyethylene (575)",8145,8145,8190,8155,8155]
[null,"5065","Medium density polyethylene",40593,40623,40625,40625,40624]
[null,"5065","Unprotected steel",43,43,43,43,43]
[null,"5065","Protected steel",4411,4411,4410,4410,4381]
[null,"5065","Other",0,0,0,0,0]
[null,"5066","Cast Iron",11510,1066,80,80,80]
[null,"5066","PVC",0,0,0,0,0]
[null,"5066","Polyamide",0,0,0,0,0]
[null,"5066","High density polyethylene (80)",0,0,0,0,0]
[null,"5066","High density polyethylene (100)",181,19110,19894,20359,20516]
[null,"5066","High density polyethylene (250)",8535,4738,4643,4573,4573]
[null,"5066","High density polyethylene (575)",3047,1596,1549,1306,1318]
[null,"5066","Medium density polyethylene",47557,46424,46358,46221,46207]
[null,"5066","Unprotected steel",1829,124,0,0,0]
[null,"5066","Protected steel",250,201,201,201,201]
[null,"5066","Other",0,0,0,0,0]
[null,"5067","Cast Iron",1041,1034,683,683,683]
[null,"5067","PVC",0,0,0,0,0]
[null,"5067","Polyamide",0,0,0,0,0]
[null,"5067","High density polyethylene (80)",0,0,0,0,0]
[null,"5067","High density polyethylene (100)",0,3152,5708,6597,7085]
[null,"5067","High density polyethylene (250)",95,86,115,46,46]
[null,"5067","High density polyethylene (575)",17919,14980,12812,12065,11682]
[null,"5067","Medium density polyethylene",41921,41872,41721,41773,41772]
[null,"5067","Unprotected steel",59,0,0,0,0]
[null,"5067","Protected steel",3690,3638,3646,3644,3656]
[null,"5067","Other",0,0,0,0,0]
[null,"5068","Cast Iron",2014,796,256,256,256]
[null,"5068","PVC",0,0,0,0,0]
[null,"5068","Polyamide",0,0,0,0,0]
[null,"5068","High density polyethylene (80)",0,0,0,0,0]
[null,"5068","High density polyethylene (100)",3051,5122,11626,14603,14602]
[null,"5068","High density polyethylene (250)",5706,5666,504,145,145]
[null,"5068","High density polyethylene (575)",5053,4868,4846,2528,2528]
[null,"5068","Medium density polyethylene",44855,44763,44610,44575,44575]
[null,"5068","Unprotected steel",198,142,63,60,60]
[null,"5068","Protected steel",1650,1543,1535,1536,1536]
[null,"5068","Other",0,0,0,0,0]
[null,"5069","Cast Iron",714,679,679,679,679]
[null,"5069","PVC",0,0,0,0,0]
[null,"5069","Polyamide",0,0,0,0,0]
[null,"5069","High density polyethylene (80)",0,0,0,0,0]
[null,"5069","High density polyethylene (100)",0,710,3623,5538,6191]
[null,"5069","High density polyethylene (250)",2055,2049,1673,1637,1637]
[null,"5069","High density polyethylene (575)",8370,7768,5614,4637,4050]
[null,"5069","Medium density polyethylene",33256,33428,33329,33136,33130]
[null,"5069","Unprotected steel",318,318,318,318,318]
[null,"5069","Protected steel",6517,6517,6507,6311,6321]
[null,"5069","Other",4,4,4,4,4]
[null,"5070","Cast Iron",16965,15131,8829,7206,6643]
[null,"5070","PVC",0,0,0,0,0]
[null,"5070","Polyamide",0,0,0,0,0]
[null,"5070","High density polyethylene (80)",0,0,0,0,0]
[null,"5070","High density polyethylene (100)",0,3786,21119,23476,24997]
[null,"5070","High density polyethylene (250)",3192,3118,1167,601,601]
[null,"5070","High density polyethylene (575)",10581,9526,3496,3194,2380]
[null,"5070","Medium density polyethylene",41293,41303,40279,40940,40961]
[null,"5070","Unprotected steel",1223,1153,669,420,420]
[null,"5070","Protected steel",4860,4860,4856,4366,4374]
[null,"5070","Other",0,0,0,0,0]
[null,"5072","Cast Iron",2786,613,613,533,511]
[null,"5072","PVC",0,0,0,0,0]
[null,"5072","Polyamide",0,0,0,0,0]
[null,"5072","High density polyethylene (80)",0,0,0,0,0]
[null,"5072","High density polyethylene (100)",0,3827,3885,4577,10562]
[null,"5072","High density polyethylene (250)",13612,13524,13515,13473,10524]
[null,"5072","High density polyethylene (575)",3629,3572,3572,3572,3466]
[null,"5072","Medium density polyethylene",46680,46009,46054,46061,46080]
[null,"5072","Unprotected steel",484,2,2,2,2]
[null,"5072","Protected steel",1647,1596,1596,1596,1596]
[null,"5072","Other",0,0,0,0,0]
[null,"5073","Cast Iron",24390,19048,19048,18446,18446]
[null,"5073","PVC",0,0,0,0,0]
[null,"5073","Polyamide",0,0,0,0,0]
[null,"5073","High density polyethylene (80)",0,0,0,0,0]
[null,"5073","High density polyethylene (100)",0,8607,8699,10000,11031]
[null,"5073","High density polyethylene (250)",9043,7289,7289,7288,7288]
[null,"5073","High density polyethylene (575)",2536,2313,2308,2308,2402]
[null,"5073","Medium density polyethylene",49367,48597,48582,48685,48678]
[null,"5073","Unprotected steel",564,404,404,404,404]
[null,"5073","Protected steel",1828,1827,1827,1827,1827]
[null,"5073","Other",0,0,0,0,0]
[null,"5074","Cast Iron",7601,7576,7455,6989,5807]
[null,"5074","PVC",0,0,0,0,0]
[null,"5074","Polyamide",0,0,0,0,0]
[null,"5074","High density polyethylene (80)",0,0,0,0,0]
[null,"5074","High density polyethylene (100)",0,31,281,818,5366]
[null,"5074","High density polyethylene (250)",10980,10980,10980,10683,8122]
[null,"5074","High density polyethylene (575)",3738,3738,3738,3750,3159]
[null,"5074","Medium density polyethylene",51969,52108,52109,52620,52647]
[null,"5074","Unprotected steel",246,246,246,246,246]
[null,"5074","Protected steel",2291,2291,2291,2291,2291]
[null,"5074","Other",0,0,0,0,0]
[null,"5075","Cast Iron",1299,1121,1075,7,7]
[null,"5075","PVC",0,0,0,0,0]
[null,"5075","Polyamide",0,0,0,0,0]
[null,"5075","High density polyethylene (80)",0,0,0,0,0]
[null,"5075","High density polyethylene (100)",0,0,253,3729,6595]
[null,"5075","High density polyethylene (250)",7395,7411,7411,6168,4195]
[null,"5075","High density polyethylene (575)",3523,3523,3523,2604,1985]
[null,"5075","Medium density polyethylene",55458,55769,55776,55719,55637]
[null,"5075","Unprotected steel",60,60,60,0,0]
[null,"5075","Protected steel",3815,3844,3844,3807,3822]
[null,"5075","Other",0,0,0,0,0]
[null,"5076","Cast Iron",282,282,282,282,282]
[null,"5076","PVC",0,0,0,0,0]
[null,"5076","Polyamide",0,0,0,0,0]
[null,"5076","High density polyethylene (80)",0,0,0,0,0]
[null,"5076","High density polyethylene (100)",0,184,316,5203,10951]
[null,"5076","High density polyethylene (250)",22449,22250,21641,17694,13488]
[null,"5076","High density polyethylene (575)",9030,9029,9029,8486,7992]
[null,"5076","Medium density polyethylene",22457,22458,23071,22907,22853]
[null,"5076","Unprotected steel",0,0,0,0,3]
[null,"5076","Protected steel",2471,2471,2471,2471,2474]
[null,"5076","Other",0,0,0,0,0]
[null,"5081","Cast Iron",15627,15486,15486,15486,15486]
[null,"5081","PVC",0,0,0,0,0]
[null,"5081","Polyamide",0,0,0,0,0]
[null,"5081","High density polyethylene (80)",0,0,0,0,0]
[null,"5081","High density polyethylene (100)",0,1827,2053,6937,7119]
[null,"5081","High density polyethylene (250)",5072,3399,3402,3420,3358]
[null,"5081","High density polyethylene (575)",9614,9606,9606,4908,4961]
[null,"5081","Medium density polyethylene",19230,19651,19658,19669,19669]
[null,"5081","Unprotected steel",455,455,455,455,455]
[null,"5081","Protected steel",1687,1687,1687,1704,1704]
[null,"5081","Other",0,0,0,0,0]
[null,"5082","Cast Iron",1077,1013,1012,974,937]
[null,"5082","PVC",0,0,0,0,0]
[null,"5082","Polyamide",0,0,0,0,0]
[null,"5082","High density polyethylene (80)",0,0,0,0,0]
[null,"5082","High density polyethylene (100)",0,31,8450,23582,27714]
[null,"5082","High density polyethylene (250)",25196,25196,18655,4597,2484]
[null,"5082","High density polyethylene (575)",14468,14449,13596,13319,13279]
[null,"5082","Medium density polyethylene",31648,31669,32425,32354,32531]
[null,"5082","Unprotected steel",929,929,939,755,116]
[null,"5082","Protected steel",8299,8305,9609,9369,8928]
[null,"5082","Other",0,0,0,0,0]
[null,"5083","Cast Iron",1864,1864,1864,1864,1864]
[null,"5083","PVC",0,0,0,0,0]
[null,"5083","Polyamide",0,0,0,0,0]
[null,"5083","High density polyethylene (80)",0,0,0,0,0]
[null,"5083","High density polyethylene (100)",0,3026,18850,20540,27858]
[null,"5083","High density polyethylene (250)",25717,23282,9024,7866,991]
[null,"5083","High density polyethylene (575)",3856,3530,2416,2407,2030]
[null,"5083","Medium density polyethylene",1884,1983,1949,1988,1964]
[null,"5083","Unprotected steel",40,40,0,0,0]
[null,"5083","Protected steel",1733,1720,1724,1693,1690]
[null,"5083","Other",0,0,0,0,0]
[null,"5084","Cast Iron",12287,12287,12287,12287,12283]
[null,"5084","PVC",0,0,0,0,0]
[null,"5084","Polyamide",0,0,0,0,0]
[null,"5084","High density polyethylene (80)",0,0,0,0,0]
[null,"5084","High density polyethylene (100)",0,406,1071,2167,2392]
[null,"5084","High density polyethylene (250)",2827,2827,2066,1753,1672]
[null,"5084","High density polyethylene (575)",4695,4695,4695,4665,4677]
[null,"5084","Medium density polyethylene",33440,33565,32898,32918,32798]
[null,"5084","Unprotected steel",2678,2678,2676,2676,2676]
[null,"5084","Protected steel",3487,3487,2197,2197,2197]
[null,"5084","Other",0,0,0,0,0]
[null,"5085","Cast Iron",5398,3020,3018,3018,3018]
[null,"5085","PVC",0,0,0,0,0]
[null,"5085","Polyamide",0,0,0,0,0]
[null,"5085","High density polyethylene (80)",0,0,0,0,0]
[null,"5085","High density polyethylene (100)",1569,5054,9648,14774,18494]
[null,"5085","High density polyethylene (250)",5226,5115,4310,1474,954]
[null,"5085","High density polyethylene (575)",4355,4300,4211,4121,4092]
[null,"5085","Medium density polyethylene",91160,93104,93077,93068,93062]
[null,"5085","Unprotected steel",561,386,386,401,401]
[null,"5085","Protected steel",5375,5375,5375,5375,5375]
[null,"5085","Other",0,0,0,0,0]
[null,"5086","Cast Iron",2870,2219,2177,2177,1285]
[null,"5086","PVC",0,0,0,0,0]
[null,"5086","Polyamide",0,0,0,0,0]
[null,"5086","High density polyethylene (80)",0,0,0,0,0]
[null,"5086","High density polyethylene (100)",0,1400,3573,12099,14423]
[null,"5086","High density polyethylene (250)",9951,9845,8071,1972,1980]
[null,"5086","High density polyethylene (575)",28078,27982,27760,26725,26851]
[null,"5086","Medium density polyethylene",43571,43625,43620,43595,43547]
[null,"5086","Unprotected steel",124,124,124,124,123]
[null,"5086","Protected steel",6730,6617,6615,6395,6355]
[null,"5086","Other",0,0,0,0,0]
[null,"5087","Cast Iron",25931,9353,8395,8374,6884]
[null,"5087","PVC",0,0,0,0,0]
[null,"5087","Polyamide",0,0,0,0,0]
[null,"5087","High density polyethylene (80)",0,0,0,0,0]
[null,"5087","High density polyethylene (100)",0,21391,23394,23878,24738]
[null,"5087","High density polyethylene (250)",1835,508,466,466,466]
[null,"5087","High density polyethylene (575)",1237,769,768,764,764]
[null,"5087","Medium density polyethylene",27941,27278,26944,26955,26851]
[null,"5087","Unprotected steel",2580,565,374,374,374]
[null,"5087","Protected steel",1925,1925,1923,1923,1731]
[null,"5087","Other",0,0,0,0,0]
[null,"5088","Cast Iron",0,0,0,0,0]
[null,"5088","PVC",0,0,0,0,0]
[null,"5088","Polyamide",0,0,0,0,0]
[null,"5088","High density polyethylene (80)",0,0,0,0,0]
[null,"5088","High density polyethylene (100)",0,22,40,2572,3239]
[null,"5088","High density polyethylene (250)",2684,2684,2684,492,38]
[null,"5088","High density polyethylene (575)",7122,7122,7122,6998,6835]
[null,"5088","Medium density polyethylene",9925,9925,9883,10118,10200]
[null,"5088","Unprotected steel",0,0,0,0,0]
[null,"5088","Protected steel",4539,4539,4561,4563,4463]
[null,"5088","Other",0,0,0,0,0]
[null,"5089","Cast Iron",264,264,264,264,119]
[null,"5089","PVC",0,0,0,0,0]
[null,"5089","Polyamide",0,0,0,0,0]
[null,"5089","High density polyethylene (80)",0,0,0,0,0]
[null,"5089","High density polyethylene (100)",0,0,76,94,3741]
[null,"5089","High density polyethylene (250)",10513,10513,10513,10513,7386]
[null,"5089","High density polyethylene (575)",4415,4415,4415,4415,4326]
[null,"5089","Medium density polyethylene",24028,24112,24127,24127,23878]
[null,"5089","Unprotected steel",0,0,0,0,102]
[null,"5089","Protected steel",3191,3191,3191,3191,3166]
[null,"5089","Other",0,0,0,0,0]
[null,"5090","Cast Iron",66,66,36,36,11]
[null,"5090","PVC",0,0,0,0,0]
[null,"5090","Polyamide",0,0,0,0,0]
[null,"5090","High density polyethylene (80)",0,0,0,0,0]
[null,"5090","High density polyethylene (100)",0,153,217,239,873]
[null,"5090","High density polyethylene (250)",987,987,987,987,567]
[null,"5090","High density polyethylene (575)",5186,5186,5211,5211,5210]
[null,"5090","Medium density polyethylene",19389,19388,19466,19467,19431]
[null,"5090","Unprotected steel",169,169,169,169,169]
[null,"5090","Protected steel",13184,13185,13160,13160,13161]
[null,"5090","Other",0,0,0,0,0]
[null,"5091","Cast Iron",775,775,649,649,273]
[null,"5091","PVC",0,0,0,0,0]
[null,"5091","Polyamide",0,0,0,0,0]
[null,"5091","High density polyethylene (80)",0,0,0,0,0]
[null,"5091","High density polyethylene (100)",0,151,358,543,1953]
[null,"5091","High density polyethylene (250)",651,651,651,651,651]
[null,"5091","High density polyethylene (575)",6384,6384,6464,6464,6500]
[null,"5091","Medium density polyethylene",31169,31299,31267,31267,31128]
[null,"5091","Unprotected steel",0,0,0,0,0]
[null,"5091","Protected steel",11570,11569,11491,11491,11670]
[null,"5091","Other",0,0,0,0,0]
[null,"5092","Cast Iron",696,696,696,696,668]
[null,"5092","PVC",0,0,0,0,0]
[null,"5092","Polyamide",0,0,0,0,0]
[null,"5092","High density polyethylene (80)",0,0,0,0,0]
[null,"5092","High density polyethylene (100)",0,25,72,742,973]
[null,"5092","High density polyethylene (250)",2284,2284,2292,2078,2054]
[null,"5092","High density polyethylene (575)",13627,13626,13626,13578,13559]
[null,"5092","Medium density polyethylene",36280,36299,36375,36374,36377]
[null,"5092","Unprotected steel",0,0,0,0,0]
[null,"5092","Protected steel",64202,64202,64207,64188,64188]
[null,"5092","Other",0,0,0,0,0]
[null,"5093","Cast Iron",1339,1339,1339,1339,1202]
[null,"5093","PVC",0,0,0,0,0]
[null,"5093","Polyamide",0,0,0,0,0]
[null,"5093","High density polyethylene (80)",0,0,0,0,0]
[null,"5093","High density polyethylene (100)",0,0,43,504,756]
[null,"5093","High density polyethylene (250)",3799,3799,3799,3133,3125]
[null,"5093","High density polyethylene (575)",4841,4841,4841,4841,4514]
[null,"5093","Medium density polyethylene",43852,43852,43833,43799,43816]
[null,"5093","Unprotected steel",0,0,0,0,0]
[null,"5093","Protected steel",4963,4963,4963,4963,4963]
[null,"5093","Other",0,0,0,0,0]
[null,"5094","Cast Iron",6576,6384,6384,6384,6384]
[null,"5094","PVC",0,0,0,0,0]
[null,"5094","Polyamide",0,0,0,0,0]
[null,"5094","High density polyethylene (80)",0,0,0,0,0]
[null,"5094","High density polyethylene (100)",0,505,520,596,596]
[null,"5094","High density polyethylene (250)",21,21,21,21,21]
[null,"5094","High density polyethylene (575)",2028,2028,2029,2029,2029]
[null,"5094","Medium density polyethylene",9910,9930,9930,9934,9933]
[null,"5094","Unprotected steel",447,447,447,447,447]
[null,"5094","Protected steel",10140,10123,10173,10173,10173]
[null,"5094","Other",0,0,0,0,0]
[null,"5095","Cast Iron",19668,79,79,79,79]
[null,"5095","PVC",0,0,0,0,0]
[null,"5095","Polyamide",0,0,0,0,0]
[null,"5095","High density polyethylene (80)",0,0,0,0,0]
[null,"5095","High density polyethylene (100)",0,24924,25017,25169,25259]
[null,"5095","High density polyethylene (250)",6615,4524,4524,4524,4524]
[null,"5095","High density polyethylene (575)",12149,11110,11110,11110,11111]
[null,"5095","Medium density polyethylene",68855,66770,66778,66778,67203]
[null,"5095","Unprotected steel",487,34,34,34,34]
[null,"5095","Protected steel",8366,7968,7982,7983,7983]
[null,"5095","Other",8,8,8,8,8]
[null,"5096","Cast Iron",1653,19,19,19,19]
[null,"5096","PVC",0,0,0,0,0]
[null,"5096","Polyamide",0,0,0,0,0]
[null,"5096","High density polyethylene (80)",0,0,0,0,0]
[null,"5096","High density polyethylene (100)",0,28,82,82,159]
[null,"5096","High density polyethylene (250)",8016,7940,7940,7932,7932]
[null,"5096","High density polyethylene (575)",11289,11222,11222,11222,11221]
[null,"5096","Medium density polyethylene",61891,62442,62441,62449,62448]
[null,"5096","Unprotected steel",0,0,0,0,0]
[null,"5096","Protected steel",11618,11516,11516,11516,11516]
[null,"5096","Other",0,0,0,0,0]
[null,"5097","Cast Iron",648,648,648,648,21]
[null,"5097","PVC",0,0,0,0,0]
[null,"5097","Polyamide",0,0,0,0,0]
[null,"5097","High density polyethylene (80)",0,0,0,0,0]
[null,"5097","High density polyethylene (100)",0,283,542,693,801]
[null,"5097","High density polyethylene (250)",1355,1355,1355,1355,1355]
[null,"5097","High density polyethylene (575)",9590,9612,9612,9612,9614]
[null,"5097","Medium density polyethylene",46382,46425,46423,46423,46419]
[null,"5097","Unprotected steel",11,11,11,11,11]
[null,"5097","Protected steel",29810,29810,29856,29856,29669]
[null,"5097","Other",0,0,0,0,0]
[null,"5098","Cast Iron",1366,211,211,211,211]
[null,"5098","PVC",0,0,0,0,0]
[null,"5098","Polyamide",0,0,0,0,0]
[null,"5098","High density polyethylene (80)",0,0,0,0,0]
[null,"5098","High density polyethylene (100)",0,1089,1296,1536,1914]
[null,"5098","High density polyethylene (250)",24343,24334,24345,24345,24362]
[null,"5098","High density polyethylene (575)",9066,9066,9066,9066,9067]
[null,"5098","Medium density polyethylene",37154,37163,37168,37170,37170]
[null,"5098","Unprotected steel",38,38,38,38,38]
[null,"5098","Protected steel",2940,2940,2940,2940,2940]
[null,"5098","Other",0,0,0,0,0]
[null,"5106","Cast Iron",632,492,401,233,0]
[null,"5106","PVC",0,0,0,0,0]
[null,"5106","Polyamide",0,0,0,0,0]
[null,"5106","High density polyethylene (80)",0,0,0,0,0]
[null,"5106","High density polyethylene (100)",0,213,378,1494,1052]
[null,"5106","High density polyethylene (250)",764,764,764,764,764]
[null,"5106","High density polyethylene (575)",1372,1372,1372,1372,1372]
[null,"5106","Medium density polyethylene",727,727,727,727,727]
[null,"5106","Unprotected steel",138,23,0,0,0]
[null,"5106","Protected steel",6000,5984,5984,6162,6153]
[null,"5106","Other",967,967,967,967,967]
[null,"5107","Cast Iron",2718,2718,2716,421,36]
[null,"5107","PVC",0,0,0,0,0]
[null,"5107","Polyamide",0,0,0,0,0]
[null,"5107","High density polyethylene (80)",0,0,0,0,0]
[null,"5107","High density polyethylene (100)",0,379,730,4818,5295]
[null,"5107","High density polyethylene (250)",911,911,911,903,903]
[null,"5107","High density polyethylene (575)",30175,30176,30176,30159,30178]
[null,"5107","Medium density polyethylene",50122,52950,52950,52950,52526]
[null,"5107","Unprotected steel",18,18,18,18,18]
[null,"5107","Protected steel",16268,16274,16274,16293,16276]
[null,"5107","Other",0,0,0,0,0]
[null,"5108","Cast Iron",17213,9462,3501,142,85]
[null,"5108","PVC",0,0,0,0,0]
[null,"5108","Polyamide",0,0,0,0,0]
[null,"5108","High density polyethylene (80)",0,0,0,0,0]
[null,"5108","High density polyethylene (100)",0,9876,23548,29284,32489]
[null,"5108","High density polyethylene (250)",2371,1500,635,635,635]
[null,"5108","High density polyethylene (575)",61135,60602,60311,60319,60371]
[null,"5108","Medium density polyethylene",83292,84119,83864,83778,83668]
[null,"5108","Unprotected steel",771,514,395,395,395]
[null,"5108","Protected steel",60609,60491,60088,60014,59988]
[null,"5108","Other",0,0,0,0,0]
[null,"5109","Cast Iron",26959,13600,3022,262,1]
[null,"5109","PVC",0,0,0,0,0]
[null,"5109","Polyamide",0,0,0,0,0]
[null,"5109","High density polyethylene (80)",0,0,0,0,0]
[null,"5109","High density polyethylene (100)",0,16687,37394,42195,43944]
[null,"5109","High density polyethylene (250)",8453,6253,859,0,0]
[null,"5109","High density polyethylene (575)",16751,16391,11717,10821,9568]
[null,"5109","Medium density polyethylene",60639,60383,56619,56611,56611]
[null,"5109","Unprotected steel",564,508,0,0,0]
[null,"5109","Protected steel",24339,24136,18050,18009,18011]
[null,"5109","Other",0,0,0,0,0]
[null,"5110","Cast Iron",0,0,0,0,0]
[null,"5110","PVC",0,0,0,0,0]
[null,"5110","Polyamide",0,0,0,0,0]
[null,"5110","High density polyethylene (80)",0,0,0,0,0]
[null,"5110","High density polyethylene (100)",0,417,782,904,1378]
[null,"5110","High density polyethylene (250)",0,0,0,0,0]
[null,"5110","High density polyethylene (575)",11639,11639,11639,11616,11615]
[null,"5110","Medium density polyethylene",23169,23400,23400,23430,23430]
[null,"5110","Unprotected steel",0,0,0,0,0]
[null,"5110","Protected steel",7474,7474,7474,7474,7474]
[null,"5110","Other",0,0,0,0,0]
[null,"5111","Cast Iron",0,0,0,0,0]
[null,"5111","PVC",0,0,0,0,0]
[null,"5111","Polyamide",0,0,0,0,0]
[null,"5111","High density polyethylene (80)",0,0,0,0,0]
[null,"5111","High density polyethylene (100)",0,0,24,107,368]
[null,"5111","High density polyethylene (250)",0,0,0,0,0]
[null,"5111","High density polyethylene (575)",0,0,0,0,0]
[null,"5111","Medium density polyethylene",8471,8471,8472,8452,8451]
[null,"5111","Unprotected steel",0,0,0,0,0]
[null,"5111","Protected steel",0,0,0,36,36]
[null,"5111","Other",0,0,0,0,0]
[null,"5112","Cast Iron",4678,4678,4678,3134,4]
[null,"5112","PVC",0,0,0,0,0]
[null,"5112","Polyamide",0,0,0,0,0]
[null,"5112","High density polyethylene (80)",0,0,0,0,0]
[null,"5112","High density polyethylene (100)",0,66,150,3168,14771]
[null,"5112","High density polyethylene (250)",451,451,451,451,435]
[null,"5112","High density polyethylene (575)",31313,31313,31319,31242,26217]
[null,"5112","Medium density polyethylene",9210,9270,9275,9271,9249]
[null,"5112","Unprotected steel",149,149,149,149,0]
[null,"5112","Protected steel",37286,37306,37306,37307,37229]
[null,"5112","Other",0,0,0,0,0]
[null,"5113","Cast Iron",11,11,11,11,11]
[null,"5113","PVC",0,0,0,0,0]
[null,"5113","Polyamide",0,0,0,0,0]
[null,"5113","High density polyethylene (80)",0,0,0,0,0]
[null,"5113","High density polyethylene (100)",0,231,537,3096,25495]
[null,"5113","High density polyethylene (250)",1657,1657,1623,1623,1623]
[null,"5113","High density polyethylene (575)",22291,22291,22313,22314,8165]
[null,"5113","Medium density polyethylene",47780,47808,47841,47877,47856]
[null,"5113","Unprotected steel",2,2,0,0,0]
[null,"5113","Protected steel",17685,17685,17687,17687,17684]
[null,"5113","Other",0,0,0,0,0]
[null,"5114","Cast Iron",0,0,0,0,0]
[null,"5114","PVC",0,0,0,0,0]
[null,"5114","Polyamide",0,0,0,0,0]
[null,"5114","High density polyethylene (80)",0,0,0,0,0]
[null,"5114","High density polyethylene (100)",0,811,3155,6309,20731]
[null,"5114","High density polyethylene (250)",0,0,0,0,0]
[null,"5114","High density polyethylene (575)",46519,46519,46511,46082,37663]
[null,"5114","Medium density polyethylene",88518,89895,89902,89903,89899]
[null,"5114","Unprotected steel",4,4,0,0,0]
[null,"5114","Protected steel",46843,46843,46847,46842,46858]
[null,"5114","Other",0,0,0,0,0]
[null,"5115","Cast Iron",0,0,0,0,0]
[null,"5115","PVC",0,0,0,0,0]
[null,"5115","Polyamide",0,0,0,0,0]
[null,"5115","High density polyethylene (80)",0,0,0,0,0]
[null,"5115","High density polyethylene (100)",0,582,1218,7312,9154]
[null,"5115","High density polyethylene (250)",0,0,0,0,0]
[null,"5115","High density polyethylene (575)",0,0,0,0,0]
[null,"5115","Medium density polyethylene",57141,59029,59021,59033,59195]
[null,"5115","Unprotected steel",0,0,0,0,0]
[null,"5115","Protected steel",16985,16985,16985,16985,16985]
[null,"5115","Other",0,0,0,0,0]
[null,"5116","Cast Iron",0,0,0,0,0]
[null,"5116","PVC",0,0,0,0,0]
[null,"5116","Polyamide",0,0,0,0,0]
[null,"5116","High density polyethylene (80)",0,0,0,0,0]
[null,"5116","High density polyethylene (100)",0,1367,2623,4479,13004]
[null,"5116","High density polyethylene (250)",0,0,0,0,0]
[null,"5116","High density polyethylene (575)",17720,17720,17720,17433,9805]
[null,"5116","Medium density polyethylene",33795,34892,34892,34847,34840]
[null,"5116","Unprotected steel",0,0,0,0,0]
[null,"5116","Protected steel",8275,8275,8275,8275,8291]
[null,"5116","Other",0,0,0,0,0]
[null,"5117","Cast Iron",0,0,0,0,0]
[null,"5117","PVC",0,0,0,0,0]
[null,"5117","Polyamide",0,0,0,0,0]
[null,"5117","High density polyethylene (80)",0,0,0,0,0]
[null,"5117","High density polyethylene (100)",0,124,238,6468,9599]
[null,"5117","High density polyethylene (250)",0,0,0,0,0]
[null,"5117","High density polyethylene (575)",5924,5924,5924,5924,5923]
[null,"5117","Medium density polyethylene",10919,11054,11054,11048,11048]
[null,"5117","Unprotected steel",0,0,0,0,0]
[null,"5117","Protected steel",2003,2003,2003,2003,2003]
[null,"5117","Other",0,0,0,0,0]
[null,"5118","Cast Iron",0,0,0,0,0]
[null,"5118","PVC",0,0,0,0,0]
[null,"5118","Polyamide",0,0,0,0,0]
[null,"5118","High density polyethylene (80)",0,0,0,0,0]
[null,"5118","High density polyethylene (100)",0,734,2249,20945,29590]
[null,"5118","High density polyethylene (250)",0,0,0,0,0]
[null,"5118","High density polyethylene (575)",36358,36353,36368,22732,17445]
[null,"5118","Medium density polyethylene",33560,36070,36196,36150,36147]
[null,"5118","Unprotected steel",0,0,0,10,10]
[null,"5118","Protected steel",14175,14179,14180,14179,14207]
[null,"5118","Other",0,0,0,0,0]
[null,"5120","Cast Iron",0,0,0,0,0]
[null,"5120","PVC",0,0,0,0,0]
[null,"5120","Polyamide",0,0,0,0,0]
[null,"5120","High density polyethylene (80)",0,0,0,0,0]
[null,"5120","High density polyethylene (100)",0,1177,4829,6406,9019]
[null,"5120","High density polyethylene (250)",0,0,0,0,0]
[null,"5120","High density polyethylene (575)",39,39,39,39,39]
[null,"5120","Medium density polyethylene",13388,13410,13412,13416,13417]
[null,"5120","Unprotected steel",0,0,0,0,0]
[null,"5120","Protected steel",4460,4461,4466,4466,4466]
[null,"5120","Other",0,0,0,0,0]
[null,"5121","Cast Iron",0,0,0,0,0]
[null,"5121","PVC",0,0,0,0,0]
[null,"5121","Polyamide",0,0,0,0,0]
[null,"5121","High density polyethylene (80)",0,0,0,0,0]
[null,"5121","High density polyethylene (100)",0,59,59,1639,2579]
[null,"5121","High density polyethylene (250)",0,0,0,0,0]
[null,"5121","High density polyethylene (575)",0,0,0,0,0]
[null,"5121","Medium density polyethylene",2833,4795,4799,4824,4824]
[null,"5121","Unprotected steel",0,0,0,0,0]
[null,"5121","Protected steel",1857,1857,1857,1857,1857]
[null,"5121","Other",0,0,0,0,0]
[null,"5125","Cast Iron",0,0,0,0,0]
[null,"5125","PVC",0,0,0,0,0]
[null,"5125","Polyamide",0,0,0,0,0]
[null,"5125","High density polyethylene (80)",0,0,0,0,0]
[null,"5125","High density polyethylene (100)",0,267,267,365,3719]
[null,"5125","High density polyethylene (250)",0,0,0,0,0]
[null,"5125","High density polyethylene (575)",76968,76984,78982,78986,75907]
[null,"5125","Medium density polyethylene",30657,30657,33583,33583,33583]
[null,"5125","Unprotected steel",0,0,0,0,0]
[null,"5125","Protected steel",13371,13371,19238,19018,19040]
[null,"5125","Other",0,0,0,0,0]
[null,"5126","Cast Iron",0,0,0,0,0]
[null,"5126","PVC",0,0,0,0,0]
[null,"5126","Polyamide",0,0,0,0,0]
[null,"5126","High density polyethylene (80)",0,0,0,0,0]
[null,"5126","High density polyethylene (100)",0,0,0,24,51]
[null,"5126","High density polyethylene (250)",2104,2104,2104,2104,2104]
[null,"5126","High density polyethylene (575)",6510,6510,6511,6511,6512]
[null,"5126","Medium density polyethylene",16281,16291,16291,16291,16291]
[null,"5126","Unprotected steel",0,0,0,0,0]
[null,"5126","Protected steel",24786,24786,24831,24831,24831]
[null,"5126","Other",0,0,0,0,0]
[null,"5127","Cast Iron",0,0,0,0,0]
[null,"5127","PVC",0,0,0,0,0]
[null,"5127","Polyamide",0,0,0,0,0]
[null,"5127","High density polyethylene (80)",0,0,0,0,0]
[null,"5127","High density polyethylene (100)",0,0,0,19,10285]
[null,"5127","High density polyethylene (250)",0,0,0,0,0]
[null,"5127","High density polyethylene (575)",39100,39100,39100,39114,29555]
[null,"5127","Medium density polyethylene",692,692,692,692,692]
[null,"5127","Unprotected steel",0,0,0,0,0]
[null,"5127","Protected steel",10985,10985,10985,10979,10983]
[null,"5127","Other",0,0,0,0,0]
[null,"5157","Cast Iron",0,0,0,0,0]
[null,"5157","PVC",0,0,0,0,0]
[null,"5157","Polyamide",0,0,0,0,0]
[null,"5157","High density polyethylene (80)",0,0,0,0,0]
[null,"5157","High density polyethylene (100)",0,0,0,0,340]
[null,"5157","High density polyethylene (250)",0,0,0,0,0]
[null,"5157","High density polyethylene (575)",83,83,83,83,0]
[null,"5157","Medium density polyethylene",0,0,0,0,0]
[null,"5157","Unprotected steel",0,0,0,0,0]
[null,"5157","Protected steel",0,0,0,0,0]
[null,"5157","Other",0,0,0,0,0]
[null,"5158","Cast Iron",0,0,0,0,0]
[null,"5158","PVC",0,0,0,0,0]
[null,"5158","Polyamide",0,0,0,0,0]
[null,"5158","High density polyethylene (80)",0,0,0,0,0]
[null,"5158","High density polyethylene (100)",0,40,375,585,585]
[null,"5158","High density polyethylene (250)",0,0,0,0,0]
[null,"5158","High density polyethylene (575)",11895,11895,11895,11895,11896]
[null,"5158","Medium density polyethylene",29167,29167,29167,29164,29164]
[null,"5158","Unprotected steel",0,0,0,0,0]
[null,"5158","Protected steel",118709,118709,118708,118708,118708]
[null,"5158","Other",0,0,0,0,0]
[null,"5159","Cast Iron",0,0,0,0,0]
[null,"5159","PVC",0,0,0,0,0]
[null,"5159","Polyamide",0,0,0,0,0]
[null,"5159","High density polyethylene (80)",0,0,0,0,0]
[null,"5159","High density polyethylene (100)",0,209,582,1229,1538]
[null,"5159","High density polyethylene (250)",0,0,0,0,0]
[null,"5159","High density polyethylene (575)",22077,22077,22077,22077,22077]
[null,"5159","Medium density polyethylene",20298,20592,20592,20594,20594]
[null,"5159","Unprotected steel",0,0,0,0,0]
[null,"5159","Protected steel",173267,173310,173344,173344,173344]
[null,"5159","Other",0,0,0,0,0]
[null,"5160","Cast Iron",26,26,0,0,0]
[null,"5160","PVC",0,0,0,0,0]
[null,"5160","Polyamide",0,0,0,0,0]
[null,"5160","High density polyethylene (80)",0,0,0,0,0]
[null,"5160","High density polyethylene (100)",0,34,262,304,312]
[null,"5160","High density polyethylene (250)",0,0,0,0,0]
[null,"5160","High density polyethylene (575)",501,501,501,501,501]
[null,"5160","Medium density polyethylene",3074,3082,3082,3082,3082]
[null,"5160","Unprotected steel",0,0,0,0,0]
[null,"5160","Protected steel",12927,12931,12936,12936,12936]
[null,"5160","Other",0,0,0,0,0]
[null,"5161","Cast Iron",0,0,0,0,0]
[null,"5161","PVC",0,0,0,0,0]
[null,"5161","Polyamide",0,0,0,0,0]
[null,"5161","High density polyethylene (80)",0,0,0,0,0]
[null,"5161","High density polyethylene (100)",62,115,177,236,262]
[null,"5161","High density polyethylene (250)",0,0,0,0,0]
[null,"5161","High density polyethylene (575)",658,658,658,658,658]
[null,"5161","Medium density polyethylene",9255,9255,9275,9275,9275]
[null,"5161","Unprotected steel",0,0,0,0,0]
[null,"5161","Protected steel",57218,57218,57241,57241,57241]
[null,"5161","Other",0,0,0,0,0]
[null,"5162","Cast Iron",0,0,0,0,0]
[null,"5162","PVC",0,0,0,0,0]
[null,"5162","Polyamide",0,0,0,0,0]
[null,"5162","High density polyethylene (80)",0,0,0,0,0]
[null,"5162","High density polyethylene (100)",0,1360,3049,3461,7014]
[null,"5162","High density polyethylene (250)",0,0,0,0,0]
[null,"5162","High density polyethylene (575)",50658,50785,50785,50785,47630]
[null,"5162","Medium density polyethylene",21945,22040,22040,22040,22039]
[null,"5162","Unprotected steel",0,0,0,0,0]
[null,"5162","Protected steel",139438,139439,139440,139636,139450]
[null,"5162","Other",0,17,17,17,17]
[null,"5163","Cast Iron",0,0,0,0,0]
[null,"5163","PVC",0,0,0,0,0]
[null,"5163","Polyamide",0,0,0,0,0]
[null,"5163","High density polyethylene (80)",0,0,0,0,0]
[null,"5163","High density polyethylene (100)",0,289,311,730,4435]
[null,"5163","High density polyethylene (250)",0,0,0,0,0]
[null,"5163","High density polyethylene (575)",11537,11537,11537,11537,11539]
[null,"5163","Medium density polyethylene",7749,7749,7749,7749,7747]
[null,"5163","Unprotected steel",0,0,0,0,0]
[null,"5163","Protected steel",66065,66065,66065,66065,66066]
[null,"5163","Other",0,0,0,0,0]
[null,"5164","Cast Iron",42,42,0,0,0]
[null,"5164","PVC",0,0,0,0,0]
[null,"5164","Polyamide",0,0,0,0,0]
[null,"5164","High density polyethylene (80)",0,0,0,0,0]
[null,"5164","High density polyethylene (100)",40,40,145,179,203]
[null,"5164","High density polyethylene (250)",0,0,0,0,0]
[null,"5164","High density polyethylene (575)",17,17,25,25,25]
[null,"5164","Medium density polyethylene",3240,3240,3247,3247,3247]
[null,"5164","Unprotected steel",0,0,0,0,0]
[null,"5164","Protected steel",37026,37026,37020,37019,37019]
[null,"5164","Other",0,0,0,0,0]
[null,"5165","Cast Iron",19358,16654,35,2,2]
[null,"5165","PVC",0,0,0,0,0]
[null,"5165","Polyamide",0,0,0,0,0]
[null,"5165","High density polyethylene (80)",0,0,0,0,0]
[null,"5165","High density polyethylene (100)",0,4386,26456,27039,27122]
[null,"5165","High density polyethylene (250)",298,112,0,0,0]
[null,"5165","High density polyethylene (575)",203,203,41,27,27]
[null,"5165","Medium density polyethylene",6332,6087,3595,3471,3471]
[null,"5165","Unprotected steel",305,198,0,0,0]
[null,"5165","Protected steel",9698,9217,7019,7076,7076]
[null,"5165","Other",0,0,8,8,8]
[null,"5166","Cast Iron",9571,3838,0,0,0]
[null,"5166","PVC",0,0,0,0,0]
[null,"5166","Polyamide",0,0,0,0,0]
[null,"5166","High density polyethylene (80)",0,0,0,0,0]
[null,"5166","High density polyethylene (100)",0,9225,13192,13230,13230]
[null,"5166","High density polyethylene (250)",62,0,0,0,0]
[null,"5166","High density polyethylene (575)",1283,1090,1090,1090,1090]
[null,"5166","Medium density polyethylene",565,109,109,109,109]
[null,"5166","Unprotected steel",130,0,0,0,0]
[null,"5166","Protected steel",3244,553,468,468,468]
[null,"5166","Other",0,0,0,0,0]
[null,"5167","Cast Iron",0,0,0,0,0]
[null,"5167","PVC",0,0,0,0,0]
[null,"5167","Polyamide",0,0,0,0,0]
[null,"5167","High density polyethylene (80)",0,0,0,0,0]
[null,"5167","High density polyethylene (100)",0,97,1120,1543,1688]
[null,"5167","High density polyethylene (250)",0,0,0,0,0]
[null,"5167","High density polyethylene (575)",1112,1112,1113,1113,1113]
[null,"5167","Medium density polyethylene",3629,3664,3687,3704,3704]
[null,"5167","Unprotected steel",0,0,0,0,0]
[null,"5167","Protected steel",32755,32804,32741,32741,32742]
[null,"5167","Other",0,0,0,0,0]
[null,"5168","Cast Iron",0,0,0,0,0]
[null,"5168","PVC",0,0,0,0,0]
[null,"5168","Polyamide",0,0,0,0,0]
[null,"5168","High density polyethylene (80)",0,0,0,0,0]
[null,"5168","High density polyethylene (100)",0,297,538,1290,1326]
[null,"5168","High density polyethylene (250)",0,0,0,0,0]
[null,"5168","High density polyethylene (575)",11130,11130,11130,11130,11161]
[null,"5168","Medium density polyethylene",13898,13639,13645,13645,13644]
[null,"5168","Unprotected steel",0,0,0,0,0]
[null,"5168","Protected steel",19580,19622,19711,19712,19712]
[null,"5168","Other",0,0,0,0,0]
[null,"5169","Cast Iron",0,0,0,0,0]
[null,"5169","PVC",0,0,0,0,0]
[null,"5169","Polyamide",0,0,0,0,0]
[null,"5169","High density polyethylene (80)",0,0,0,0,0]
[null,"5169","High density polyethylene (100)",0,3591,6902,9729,12115]
[null,"5169","High density polyethylene (250)",0,0,0,0,0]
[null,"5169","High density polyethylene (575)",32950,32918,32918,32918,32915]
[null,"5169","Medium density polyethylene",57208,60458,60434,60894,60894]
[null,"5169","Unprotected steel",0,0,0,0,0]
[null,"5169","Protected steel",29846,29844,29844,29844,29830]
[null,"5169","Other",0,0,0,0,0]
[null,"5170","Cast Iron",0,0,0,0,0]
[null,"5170","PVC",0,0,0,0,0]
[null,"5170","Polyamide",0,0,0,0,0]
[null,"5170","High density polyethylene (80)",0,0,0,0,0]
[null,"5170","High density polyethylene (100)",0,5909,4112,4115,4115]
[null,"5170","High density polyethylene (250)",0,0,0,0,0]
[null,"5170","High density polyethylene (575)",217,217,217,217,217]
[null,"5170","Medium density polyethylene",738,736,757,754,754]
[null,"5170","Unprotected steel",0,0,0,0,0]
[null,"5170","Protected steel",3316,3313,3314,3314,3314]
[null,"5170","Other",0,0,0,0,0]
[null,"5171","Cast Iron",0,0,0,0,0]
[null,"5171","PVC",0,0,0,0,0]
[null,"5171","Polyamide",0,0,0,0,0]
[null,"5171","High density polyethylene (80)",0,0,0,0,0]
[null,"5171","High density polyethylene (100)",0,0,14373,21879,22033]
[null,"5171","High density polyethylene (250)",0,0,0,0,0]
[null,"5171","High density polyethylene (575)",0,0,0,0,0]
[null,"5171","Medium density polyethylene",0,0,2,2,2]
[null,"5171","Unprotected steel",0,0,0,0,0]
[null,"5171","Protected steel",0,0,0,0,0]
[null,"5171","Other",0,0,0,0,0]
[null,"5173","Cast Iron",0,0,0,0,0]
[null,"5173","PVC",0,0,0,0,0]
[null,"5173","Polyamide",0,0,0,0,0]
[null,"5173","High density polyethylene (80)",0,0,0,0,0]
[null,"5173","High density polyethylene (100)",0,95,653,2491,2618]
[null,"5173","High density polyethylene (250)",0,0,0,0,0]
[null,"5173","High density polyethylene (575)",5542,5542,5565,5565,5565]
[null,"5173","Medium density polyethylene",35174,35189,35190,35190,35190]
[null,"5173","Unprotected steel",0,0,0,0,0]
[null,"5173","Protected steel",5551,5549,5548,5549,5549]
[null,"5173","Other",0,8,8,8,8]
[null,"5211","Cast Iron",0,0,0,0,0]
[null,"5211","PVC",0,0,0,0,0]
[null,"5211","Polyamide",0,0,0,0,0]
[null,"5211","High density polyethylene (80)",0,0,0,0,0]
[null,"5211","High density polyethylene (100)",0,0,0,0,0]
[null,"5211","High density polyethylene (250)",0,0,0,0,0]
[null,"5211","High density polyethylene (575)",0,0,0,0,0]
[null,"5211","Medium density polyethylene",0,0,0,0,0]
[null,"5211","Unprotected steel",0,0,0,0,0]
[null,"5211","Protected steel",0,0,0,0,0]
[null,"5211","Other",0,0,0,0,0]
[null,"5253","Cast Iron",0,0,0,0,0]
[null,"5253","PVC",0,0,0,0,0]
[null,"5253","Polyamide",0,0,0,0,0]
[null,"5253","High density polyethylene (80)",0,0,0,0,0]
[null,"5253","High density polyethylene (100)",0,0,0,25,773]
[null,"5253","High density polyethylene (250)",0,0,0,0,0]
[null,"5253","High density polyethylene (575)",26,26,26,26,26]
[null,"5253","Medium density polyethylene",30812,30819,30813,30944,30942]
[null,"5253","Unprotected steel",0,0,0,0,0]
[null,"5253","Protected steel",0,0,0,0,0]
[null,"5253","Other",0,0,0,0,0]
[null,"5290","Cast Iron",2737,1900,1339,923,0]
[null,"5290","PVC",2749,2535,1192,0,0]
[null,"5290","Polyamide",0,0,0,0,0]
[null,"5290","High density polyethylene (80)",0,0,0,0,0]
[null,"5290","High density polyethylene (100)",2760,9358,19313,27785,30078]
[null,"5290","High density polyethylene (250)",6663,5479,4325,749,18]
[null,"5290","High density polyethylene (575)",32664,32605,32426,32426,32544]
[null,"5290","Medium density polyethylene",109800,108949,108011,107688,107741]
[null,"5290","Unprotected steel",6690,4656,310,220,28]
[null,"5290","Protected steel",43542,44601,43942,44193,44309]
[null,"5290","Other",22,22,22,22,22]
[null,"5291","Cast Iron",0,0,0,0,0]
[null,"5291","PVC",0,0,0,0,0]
[null,"5291","Polyamide",0,0,0,0,0]
[null,"5291","High density polyethylene (80)",0,0,0,0,0]
[null,"5291","High density polyethylene (100)",40,1784,2182,2604,3049]
[null,"5291","High density polyethylene (250)",0,0,0,0,0]
[null,"5291","High density polyethylene (575)",0,0,0,0,0]
[null,"5291","Medium density polyethylene",2654,3801,3801,3801,3800]
[null,"5291","Unprotected steel",0,0,0,0,0]
[null,"5291","Protected steel",0,0,0,0,0]
[null,"5291","Other",0,0,0,0,0]
[null,"5308","Cast Iron",0,0,0,0,0]
[null,"5308","PVC",0,0,0,0,0]
[null,"5308","Polyamide",0,0,0,0,0]
[null,"5308","High density polyethylene (80)",0,0,0,0,0]
[null,"5308","High density polyethylene (100)",0,0,0,0,0]
[null,"5308","High density polyethylene (250)",0,0,0,0,0]
[null,"5308","High density polyethylene (575)",0,0,0,0,0]
[null,"5308","Medium density polyethylene",90,90,90,90,90]
[null,"5308","Unprotected steel",0,0,0,0,0]
[null,"5308","Protected steel",0,0,0,0,0]
[null,"5308","Other",0,0,0,0,0]
[null,"5343","Cast Iron",0,0,0,0,0]
[null,"5343","PVC",0,0,0,0,0]
[null,"5343","Polyamide",0,0,0,0,0]
[null,"5343","High density polyethylene (80)",0,0,0,0,0]
[null,"5343","High density polyethylene (100)",0,0,0,0,0]
[null,"5343","High density polyethylene (250)",0,0,0,0,0]
[null,"5343","High density polyethylene (575)",722,722,722,722,722]
[null,"5343","Medium density polyethylene",6684,6709,6709,6697,6697]
[null,"5343","Unprotected steel",8,8,8,8,8]
[null,"5343","Protected steel",844,844,844,806,806]
[null,"5343","Other",0,0,0,0,0]
[null,"5344","Cast Iron",0,0,0,0,0]
[null,"5344","PVC",0,0,0,0,0]
[null,"5344","Polyamide",0,0,0,0,0]
[null,"5344","High density polyethylene (80)",0,0,0,0,0]
[null,"5344","High density polyethylene (100)",0,0,0,0,0]
[null,"5344","High density polyethylene (250)",516,516,516,516,516]
[null,"5344","High density polyethylene (575)",10,10,10,10,10]
[null,"5344","Medium density polyethylene",0,0,0,0,0]
[null,"5344","Unprotected steel",0,0,0,0,0]
[null,"5344","Protected steel",5,5,5,5,5]
[null,"5344","Other",0,0,0,0,0]
[null,"5352","Cast Iron",0,0,0,0,0]
[null,"5352","PVC",0,0,0,0,0]
[null,"5352","Polyamide",0,0,0,0,0]
[null,"5352","High density polyethylene (80)",0,0,0,0,0]
[null,"5352","High density polyethylene (100)",0,7172,7497,7750,8484]
[null,"5352","High density polyethylene (250)",0,0,0,0,0]
[null,"5352","High density polyethylene (575)",0,0,0,0,0]
[null,"5352","Medium density polyethylene",21552,21947,21949,21950,22104]
[null,"5352","Unprotected steel",0,0,0,0,0]
[null,"5352","Protected steel",130,129,129,129,129]
[null,"5352","Other",0,0,0,0,0]
[null,"5353","Cast Iron",0,0,0,0,0]
[null,"5353","PVC",0,0,0,0,0]
[null,"5353","Polyamide",0,0,0,0,0]
[null,"5353","High density polyethylene (80)",0,0,0,0,0]
[null,"5353","High density polyethylene (100)",0,0,0,68,1001]
[null,"5353","High density polyethylene (250)",0,0,0,0,0]
[null,"5353","High density polyethylene (575)",2027,2027,2027,2027,2027]
[null,"5353","Medium density polyethylene",3679,3679,3679,3679,3685]
[null,"5353","Unprotected steel",0,0,0,0,0]
[null,"5353","Protected steel",7245,7468,7468,7468,7470]
[null,"5353","Other",0,0,0,0,0]
[null,"5355","Cast Iron",0,0,0,0,0]
[null,"5355","PVC",0,0,0,0,0]
[null,"5355","Polyamide",0,0,0,0,0]
[null,"5355","High density polyethylene (80)",0,0,0,0,0]
[null,"5355","High density polyethylene (100)",0,350,655,1458,4068]
[null,"5355","High density polyethylene (250)",0,0,0,0,0]
[null,"5355","High density polyethylene (575)",5585,5585,5585,5586,5586]
[null,"5355","Medium density polyethylene",20831,21797,21797,21797,21949]
[null,"5355","Unprotected steel",0,0,0,0,0]
[null,"5355","Protected steel",4940,4717,4686,4686,4686]
[null,"5355","Other",0,0,0,0,0]
[null,"5372","Cast Iron",0,0,0,0,0]
[null,"5372","PVC",0,0,0,0,0]
[null,"5372","Polyamide",0,0,0,0,0]
[null,"5372","High density polyethylene (80)",0,0,0,0,0]
[null,"5372","High density polyethylene (100)",0,121,676,1765,1814]
[null,"5372","High density polyethylene (250)",0,0,0,0,0]
[null,"5372","High density polyethylene (575)",660,660,660,660,660]
[null,"5372","Medium density polyethylene",5691,6545,6545,6545,6545]
[null,"5372","Unprotected steel",0,0,0,0,0]
[null,"5372","Protected steel",2599,2599,2599,2599,2599]
[null,"5372","Other",0,0,0,0,0]
[null,"5400","Cast Iron",0,0,0,0,0]
[null,"5400","PVC",0,0,0,0,0]
[null,"5400","Polyamide",0,0,0,0,0]
[null,"5400","High density polyethylene (80)",0,0,0,0,0]
[null,"5400","High density polyethylene (100)",0,0,0,0,0]
[null,"5400","High density polyethylene (250)",1200,1200,1200,1200,1200]
[null,"5400","High density polyethylene (575)",0,0,0,0,0]
[null,"5400","Medium density polyethylene",132,132,132,132,132]
[null,"5400","Unprotected steel",0,0,0,0,0]
[null,"5400","Protected steel",0,0,0,0,0]
[null,"5400","Other",0,0,0,0,0]
[null,"5422","Cast Iron",0,0,0,0,0]
[null,"5422","PVC",0,0,0,0,0]
[null,"5422","Polyamide",0,0,0,0,0]
[null,"5422","High density polyethylene (80)",0,0,0,0,0]
[null,"5422","High density polyethylene (100)",0,0,0,0,1010]
[null,"5422","High density polyethylene (250)",0,0,0,0,0]
[null,"5422","High density polyethylene (575)",926,926,926,926,32]
[null,"5422","Medium density polyethylene",1115,1115,1115,1148,1083]
[null,"5422","Unprotected steel",0,0,0,0,0]
[null,"5422","Protected steel",2698,2698,2698,2676,2682]
[null,"5422","Other",0,0,0,0,0]
[null,"5501","Cast Iron",0,0,0,0,0]
[null,"5501","PVC",0,0,0,0,0]
[null,"5501","Polyamide",0,0,0,0,0]
[null,"5501","High density polyethylene (80)",0,0,0,0,0]
[null,"5501","High density polyethylene (100)",0,0,8558,12344,13103]
[null,"5501","High density polyethylene (250)",0,0,0,0,0]
[null,"5501","High density polyethylene (575)",0,0,0,0,0]
[null,"5501","Medium density polyethylene",1756,1756,1756,1756,1756]
[null,"5501","Unprotected steel",0,0,0,0,0]
[null,"5501","Protected steel",23,23,23,23,23]
[null,"5501","Other",0,0,0,0,0]
[null,"5502","Cast Iron",0,0,0,0,0]
[null,"5502","PVC",0,0,0,0,0]
[null,"5502","Polyamide",0,0,0,0,0]
[null,"5502","High density polyethylene (80)",0,0,0,0,0]
[null,"5502","High density polyethylene (100)",0,0,0,0,0]
[null,"5502","High density polyethylene (250)",0,0,0,0,0]
[null,"5502","High density polyethylene (575)",0,0,0,0,0]
[null,"5502","Medium density polyethylene",869,869,869,869,869]
[null,"5502","Unprotected steel",0,0,0,0,0]
[null,"5502","Protected steel",15,15,15,15,15]
[null,"5502","Other",0,0,0,0,0]
[null,"5540","Cast Iron",0,0,0,0,0]
[null,"5540","PVC",0,0,0,0,0]
[null,"5540","Polyamide",0,0,0,0,0]
[null,"5540","High density polyethylene (80)",0,0,0,0,0]
[null,"5540","High density polyethylene (100)",0,420,492,572,652]
[null,"5540","High density polyethylene (250)",319,319,319,0,0]
[null,"5540","High density polyethylene (575)",100145,100204,100188,100484,100469]
[null,"5540","Medium density polyethylene",14266,15540,15540,15540,15540]
[null,"5540","Unprotected steel",0,0,0,0,0]
[null,"5540","Protected steel",9620,9621,9621,9621,9621]
[null,"5540","Other",0,0,0,0,0]
[null,"5600","Cast Iron",0,0,0,0,0]
[null,"5600","PVC",0,0,0,0,0]
[null,"5600","Polyamide",0,0,0,0,0]
[null,"5600","High density polyethylene (80)",0,0,0,0,0]
[null,"5600","High density polyethylene (100)",0,0,0,0,0]
[null,"5600","High density polyethylene (250)",0,0,0,0,0]
[null,"5600","High density polyethylene (575)",9188,9188,9188,9188,9188]
[null,"5600","Medium density polyethylene",3066,3118,3198,3198,3198]
[null,"5600","Unprotected steel",0,0,0,0,0]
[null,"5600","Protected steel",22246,22246,22237,22237,22237]
[null,"5600","Other",0,0,0,0,0]
[null,"5608","Cast Iron",0,0,0,0,0]
[null,"5608","PVC",0,0,0,0,0]
[null,"5608","Polyamide",0,0,0,0,0]
[null,"5608","High density polyethylene (80)",0,0,0,0,0]
[null,"5608","High density polyethylene (100)",0,15,15,15,77]
[null,"5608","High density polyethylene (250)",0,0,0,0,0]
[null,"5608","High density polyethylene (575)",6497,6497,6497,6497,6497]
[null,"5608","Medium density polyethylene",7652,7652,7652,7652,7656]
[null,"5608","Unprotected steel",0,0,0,0,0]
[null,"5608","Protected steel",39175,39237,39237,39237,39237]
[null,"5608","Other",0,0,0,0,0]
[null,"5609","Cast Iron",0,0,0,0,0]
[null,"5609","PVC",0,0,0,0,0]
[null,"5609","Polyamide",0,0,0,0,0]
[null,"5609","High density polyethylene (80)",0,0,0,0,0]
[null,"5609","High density polyethylene (100)",0,0,0,0,0]
[null,"5609","High density polyethylene (250)",0,0,0,0,0]
[null,"5609","High density polyethylene (575)",1178,1178,1178,1178,1178]
[null,"5609","Medium density polyethylene",10051,10051,10051,10051,10051]
[null,"5609","Unprotected steel",0,0,0,0,0]
[null,"5609","Protected steel",6279,6279,6279,6279,6279]
[null,"5609","Other",0,0,0,0,0]
[null,"5950","Cast Iron",0,0,0,0,0]
[null,"5950","PVC",0,0,0,0,0]
[null,"5950","Polyamide",0,0,0,0,0]
[null,"5950","High density polyethylene (80)",0,0,0,0,0]
[null,"5950","High density polyethylene (100)",0,0,0,343,373]
[null,"5950","High density polyethylene (250)",412,412,412,412,412]
[null,"5950","High density polyethylene (575)",0,0,0,0,0]
[null,"5950","Medium density polyethylene",1969,1969,1969,2112,2112]
[null,"5950","Unprotected steel",0,0,0,0,0]
[null,"5950","Protected steel",0,0,0,0,0]
[null,"5950","Other",0,0,0,0,0]

{"sheet":"Additional disclosures","index":16,"n_rows":0,"n_cols":0,"rows_kept":0,"cut":false,"hidden":false,"merged":[]}