{"text_format":"1","workbook":"xlsx","n_sheets":28,"sheets":["AER CF","AER NRs","AER lookups","AER ETL","Instructions","CONTENTS","Business & other details","E1. Expenditure Summary","E2. Mains Repex","E3. Mains Augex","E4. Meter replacement","E5. New Connections","E6. Non-network","E10. Overheads","E12. ICT","E13. Other capex","E17. Step changes","E20. Opex","E21. ARS","E25. Escalators","N1. Demand","N2. Network characteristics","S1.1 Customer numbers","S1.2 Customer numbers","S10. Supply Quality","S11. Network reliability","F3. Revenue","Additional disclosures"],"not_rendered":{"charts":0,"images":5,"macros":1,"external_links":0,"defined_names":757,"comments":3,"pivot_tables":0},"unopened":[],"bounds":{"document_bytes":16777216,"sheet_cells":100000,"rows_first":2000,"rows_last":500,"rows_between":2000,"halvings":0,"cell_chars":16384,"cell_head_chars":4096},"cells_cut":0,"cells_raw":0,"read":"whole","date_system":"1900"}

{"sheet":"AER CF","index":0,"n_rows":76,"n_cols":25,"rows_kept":76,"cut":false,"hidden":true,"merged":[[41,38,41,59],[41,69,41,90],[3,1,3,22],[39,38,39,59],[39,69,39,90],[40,38,40,59],[40,69,40,90]]}
[null,"AER CONDITIONAL FORMATTING"]
[]
[null,"CELLS FLAGED \"Y\" and greyed out will be greyed out in the worksheets."]
[null,"CONDITIONAL FORMATTING MAP"]
[null,null,null,null,null,"=INDEX(dms_CF_3.6.1, MATCH(dms_TradingName,dms_CF_TradingName))=\"Y\"","=INDEX(dms_CF_3.6.5, MATCH(dms_TradingName,dms_CF_TradingName))=\"Y\"","=INDEX(dms_CF_3.6.6.1, MATCH(dms_TradingName,dms_CF_TradingName))=\"Y\"","=INDEX(dms_CF_3.6.6.2, MATCH(dms_TradingName,dms_CF_TradingName))=\"Y\"","=INDEX(dms_CF_3.6.6.3, MATCH(dms_TradingName,dms_CF_TradingName))=\"Y\"","=INDEX(dms_CF_3.6.7.1, MATCH(dms_TradingName,dms_CF_TradingName))=\"Y\"","=INDEX(dms_CF_3.6.7.2, MATCH(dms_TradingName,dms_CF_TradingName))=\"Y\"","=INDEX(dms_CF_3.6.7.3, MATCH(dms_TradingName,dms_CF_TradingName))=\"Y\"","=INDEX(dms_CF_3.6.7.4, MATCH(dms_TradingName,dms_CF_TradingName))=\"Y\"","=INDEX(dms_CF_3.6.8, MATCH(dms_TradingName,dms_CF_TradingName))=\"Y\"","=INDEX(dms_CF_4.1, MATCH(dms_TradingName,dms_CF_TradingName))=\"Y\"","=INDEX(dms_CF_6.8, MATCH(dms_TradingName,dms_CF_TradingName))=\"Y\"","=INDEX(dms_CF_7.12, MATCH(dms_TradingName,dms_CF_TradingName))=\"Y\"","=INDEX(dms_CF_8.1_A, MATCH(dms_TradingName,dms_CF_TradingName))=\"Y\"","=INDEX(dms_CF_8.1_B, MATCH(dms_TradingName,dms_CF_TradingName))=\"Y\"",{"$f":"INDEX(dms_CF_8.1_Neg, MATCH(dms_TradingName,dms_CF_TradingName))=\"Y\"","v":true},"=INDEX(dms_CF_4.4.1_Neg, MATCH(dms_TradingName,dms_CF_TradingName))=\"Y\"",null,null,"=INDEX(dms_CF_F10, MATCH(dms_TradingName,dms_CF_TradingName))=\"Y\""]
[null,"dms_CF_TradingName","JurisdictionList","Sector","Segment","dms_CF_3.6.1","dms_CF_3.6.5","dms_CF_3.6.6.1","dms_CF_3.6.6.2","dms_CF_3.6.6.3","dms_CF_3.6.7.1","dms_CF_3.6.7.2","dms_CF_3.6.7.3","dms_CF_3.6.7.4","dms_CF_3.6.8","dms_CF_4.1","dms_CF_6.8 (set from dms_MAIFI_flag)","dms_CF_7.12","dms_CF_8.1_A  (and 8.4)","dms_CF_8.1_B  (and 8.4)","dms_CF_8.1_Neg  (and 8.4)","dms_CF_4.4.1","dms_CF_MAIFI_flag (set from dms_MAIFI_flag)","9.5 TUOS (set from Jurisdiction)","dms_CF_F10"]
[null,"Amadeus","NT","Gas","Transmission","-","-","-","-","-","-","-","-","-","-","-","-","-","-","-","-","-","-","-","-"]
[null,"APA GasNet","Vic","Gas","Transmission","-","-","-","-","-","-","-","-","-","-","-","-","-","-","-","-","-","-","-","-"]
[null,"Ausgrid","NSW","Electricity","Distribution",null,"Y","N","N","N","N","N","N","Y","N","N",{"$f":"IFERROR(IF(dms_MAIFI_flag=\"Yes\",\"N\",\"Y\"),\"Y\")","v":"Y"},"Y","N","Y","Y","N",{"$f":"IFERROR(LEFT(dms_MAIFI_flag),\"N\")","v":"N"},{"$f":"IF('AER CF'!$C7=\"Vic\",\"Y\",\"N\")","v":"N"}]
[null,"Ausgrid (Tx Assets)","NSW","Electricity","Distribution",null,"Y","N","N","N","N","N","N","Y","N","N",{"$f":"IFERROR(IF(dms_MAIFI_flag=\"Yes\",\"N\",\"Y\"),\"Y\")","v":"Y"},"Y","N","Y","Y","N",{"$f":"IFERROR(LEFT(dms_MAIFI_flag),\"N\")","v":"N"},{"$f":"IF('AER CF'!$C8=\"Vic\",\"Y\",\"N\")","v":"Y"}]
[null,"AusNet (D)","Vic","Electricity","Distribution",null,"N","N",null,null,"N","N","N","N","N","N",{"$f":"IFERROR(IF(dms_MAIFI_flag=\"Yes\",\"N\",\"Y\"),\"Y\")","v":"Y"},"N","N","N","Y","N",{"$f":"IFERROR(LEFT(dms_MAIFI_flag),\"N\")","v":"N"},{"$f":"IF('AER CF'!$C9=\"Vic\",\"Y\",\"N\")","v":"N"}]
[null,"AusNet (T)","Vic","Electricity","Transmission",null,"N",null,null,null,"N","N","N","N","N","Y",{"$f":"IFERROR(IF(dms_MAIFI_flag=\"Yes\",\"N\",\"Y\"),\"Y\")","v":"Y"},"N","N","N","Y","N",{"$f":"IFERROR(LEFT(dms_MAIFI_flag),\"N\")","v":"N"},{"$f":"IF('AER CF'!$C10=\"Vic\",\"Y\",\"N\")","v":"N"}]
[null,"Australian Distribution Co.","NSW","Electricity","Distribution","N","N","N","N",null,"N","N","N","N","N","N",{"$f":"IFERROR(IF(dms_MAIFI_flag=\"Yes\",\"N\",\"Y\"),\"Y\")","v":"Y"},"N","N","N","N","N",{"$f":"IFERROR(LEFT(dms_MAIFI_flag),\"N\")","v":"N"},{"$f":"IF('AER CF'!$C13=\"Vic\",\"Y\",\"N\")","v":"N"}]
[null,"Australian Distribution Co. (Vic)","Vic","Electricity","Distribution","N","N","N","N",null,"N","N","N","N","N","N",{"$f":"IFERROR(IF(dms_MAIFI_flag=\"Yes\",\"N\",\"Y\"),\"Y\")","v":"Y"},"N","N","N","N","N",{"$f":"IFERROR(LEFT(dms_MAIFI_flag),\"N\")","v":"N"},{"$f":"IF('AER CF'!$C14=\"Vic\",\"Y\",\"N\")","v":"Y"}]
[null,"CitiPower","Vic","Electricity","Distribution",null,"N","N",null,null,"N","N","N","N","N","N",{"$f":"IFERROR(IF(dms_MAIFI_flag=\"Yes\",\"N\",\"Y\"),\"Y\")","v":"Y"},"N","N","N","Y","N",{"$f":"IFERROR(LEFT(dms_MAIFI_flag),\"N\")","v":"N"},{"$f":"IF('AER CF'!$C15=\"Vic\",\"Y\",\"N\")","v":"Y"}]
[null,"Directlink","Qld","Electricity","Transmission",null,"N",null,null,null,"N","N","N","N","N","-",{"$f":"IFERROR(IF(dms_MAIFI_flag=\"Yes\",\"N\",\"Y\"),\"Y\")","v":"Y"},"N","N","Y","Y","N",{"$f":"IFERROR(LEFT(dms_MAIFI_flag),\"N\")","v":"N"},{"$f":"IF('AER CF'!$C16=\"Vic\",\"Y\",\"N\")","v":"N"}]
[null,"ElectraNet","SA","Electricity","Transmission",null,"N",null,null,null,"N","N","N","N","N","-",{"$f":"IFERROR(IF(dms_MAIFI_flag=\"Yes\",\"N\",\"Y\"),\"Y\")","v":"Y"},"N","N","Y","Y","N",{"$f":"IFERROR(LEFT(dms_MAIFI_flag),\"N\")","v":"N"},{"$f":"IF('AER CF'!$C17=\"Vic\",\"Y\",\"N\")","v":"N"}]
[null,"Endeavour Energy","NSW","Electricity","Distribution",null,"Y","N","Y","Y","N","N","N","Y","N","N",{"$f":"IFERROR(IF(dms_MAIFI_flag=\"Yes\",\"N\",\"Y\"),\"Y\")","v":"Y"},"Y","N","Y","Y","Y",{"$f":"IFERROR(LEFT(dms_MAIFI_flag),\"N\")","v":"N"},{"$f":"IF('AER CF'!$C18=\"Vic\",\"Y\",\"N\")","v":"N"}]
[null,"Energex","Qld","Electricity","Distribution",null,"Y","N",null,null,"N","N","N","N","N","N",{"$f":"IFERROR(IF(dms_MAIFI_flag=\"Yes\",\"N\",\"Y\"),\"Y\")","v":"Y"},"Y","N","Y","Y","Y",{"$f":"IFERROR(LEFT(dms_MAIFI_flag),\"N\")","v":"N"},{"$f":"IF('AER CF'!$C19=\"Vic\",\"Y\",\"N\")","v":"N"}]
[null,"Ergon Energy","Qld","Electricity","Distribution",null,"Y","N","Y","Y","N","N","N","N","N","N",{"$f":"IFERROR(IF(dms_MAIFI_flag=\"Yes\",\"N\",\"Y\"),\"Y\")","v":"Y"},"Y","N","Y","Y","N",{"$f":"IFERROR(LEFT(dms_MAIFI_flag),\"N\")","v":"N"},{"$f":"IF('AER CF'!$C20=\"Vic\",\"Y\",\"N\")","v":"N"}]
[null,"Essential Energy","NSW","Electricity","Distribution",null,"Y","N","Y","Y","N","N","N","Y","N","N",{"$f":"IFERROR(IF(dms_MAIFI_flag=\"Yes\",\"N\",\"Y\"),\"Y\")","v":"Y"},"Y","N","Y","Y","N",{"$f":"IFERROR(LEFT(dms_MAIFI_flag),\"N\")","v":"N"},{"$f":"IF('AER CF'!$C21=\"Vic\",\"Y\",\"N\")","v":"N"}]
[null,"Evoenergy Distribution","ACT","Electricity","Distribution",null,"Y","N","Y","Y","Y","Y","N","Y","N","Y",{"$f":"IFERROR(IF(dms_MAIFI_flag=\"Yes\",\"N\",\"Y\"),\"Y\")","v":"Y"},"Y","N","Y","Y","N",{"$f":"IFERROR(LEFT(dms_MAIFI_flag),\"N\")","v":"N"},{"$f":"IF('AER CF'!$C22=\"Vic\",\"Y\",\"N\")","v":"N"}]
[null,"Evoenergy Distribution (Tx Assets)","ACT","Electricity","Distribution",null,"Y","N","Y","Y","Y","Y","N","Y","N","Y",{"$f":"IFERROR(IF(dms_MAIFI_flag=\"Yes\",\"N\",\"Y\"),\"Y\")","v":"Y"},"Y","N","Y","Y","N",{"$f":"IFERROR(LEFT(dms_MAIFI_flag),\"N\")","v":"N"},{"$f":"IF('AER CF'!$C23=\"Vic\",\"Y\",\"N\")","v":"N"}]
[null,"Jemena Electricity","Vic","Electricity","Distribution",null,"N","N",null,null,"N","N","N","N","N","N",{"$f":"IFERROR(IF(dms_MAIFI_flag=\"Yes\",\"N\",\"Y\"),\"Y\")","v":"Y"},"N","N","N","Y","N",{"$f":"IFERROR(LEFT(dms_MAIFI_flag),\"N\")","v":"N"},{"$f":"IF('AER CF'!$C25=\"Vic\",\"Y\",\"N\")","v":"Y"}]
[null,"JGN","Vic","Gas","Distribution","-","-","-","-","-","-","-","-","-","-","-","-","-","-","-","-","-","-","-","-"]
[null,"Murraylink","SA","Electricity","Transmission",null,"N",null,null,null,"N","N","N","N","N","-",{"$f":"IFERROR(IF(dms_MAIFI_flag=\"Yes\",\"N\",\"Y\"),\"Y\")","v":"Y"},"N","N","Y","Y","N",{"$f":"IFERROR(LEFT(dms_MAIFI_flag),\"N\")","v":"N"},{"$f":"IF('AER CF'!$C26=\"Vic\",\"Y\",\"N\")","v":"N"}]
[null,"Power and Water","NT","Electricity","Distribution",null,"N","N",null,null,"N","Y","N","N","N","Y",{"$f":"IFERROR(IF(dms_MAIFI_flag=\"Yes\",\"N\",\"Y\"),\"Y\")","v":"Y"},"Y","Y","Y","Y","N",{"$f":"IFERROR(LEFT(dms_MAIFI_flag),\"N\")","v":"N"},{"$f":"IF('AER CF'!$C27=\"Vic\",\"Y\",\"N\")","v":"N"}]
[null,"Powercor Australia","Vic","Electricity","Distribution",null,"N","N",null,null,"N","N","N","N","N","N",{"$f":"IFERROR(IF(dms_MAIFI_flag=\"Yes\",\"N\",\"Y\"),\"Y\")","v":"Y"},"N","N","N","Y","N",{"$f":"IFERROR(LEFT(dms_MAIFI_flag),\"N\")","v":"N"},{"$f":"IF('AER CF'!$C28=\"Vic\",\"Y\",\"N\")","v":"Y"}]
[null,"Powerlink","Qld","Electricity","Transmission",null,"N",null,null,null,"N","N","N","N","N","-",{"$f":"IFERROR(IF(dms_MAIFI_flag=\"Yes\",\"N\",\"Y\"),\"Y\")","v":"Y"},"N","N","Y","Y","N",{"$f":"IFERROR(LEFT(dms_MAIFI_flag),\"N\")","v":"N"},{"$f":"IF('AER CF'!$C29=\"Vic\",\"Y\",\"N\")","v":"N"}]
[null,"Roma to Brisbane Pipeline","Qld","Gas","Transmission","-","-","-","-","-","-","-","-","-","-","-","-","-","-","-","-","-","-","-","-"]
[null,"SA Power Networks","SA","Electricity","Distribution",null,"Y","N",null,null,"N","N","N","N","N","N",{"$f":"IFERROR(IF(dms_MAIFI_flag=\"Yes\",\"N\",\"Y\"),\"Y\")","v":"Y"},"Y","N","Y","N","N",{"$f":"IFERROR(LEFT(dms_MAIFI_flag),\"N\")","v":"N"},{"$f":"IF('AER CF'!$C31=\"Vic\",\"Y\",\"N\")","v":"N"}]
[null,"TasNetworks (D)","Tas","Electricity","Distribution",null,"Y","N",null,null,"N","N","N","N","N","N",{"$f":"IFERROR(IF(dms_MAIFI_flag=\"Yes\",\"N\",\"Y\"),\"Y\")","v":"Y"},"Y","N","Y","Y","N",{"$f":"IFERROR(LEFT(dms_MAIFI_flag),\"N\")","v":"N"},{"$f":"IF('AER CF'!$C32=\"Vic\",\"Y\",\"N\")","v":"N"}]
[null,"TasNetworks (T)","Tas","Electricity","Transmission",null,"N",null,null,null,"N","N","N","N","N","-",{"$f":"IFERROR(IF(dms_MAIFI_flag=\"Yes\",\"N\",\"Y\"),\"Y\")","v":"Y"},"N","N","Y","Y","N",{"$f":"IFERROR(LEFT(dms_MAIFI_flag),\"N\")","v":"N"},{"$f":"IF('AER CF'!$C33=\"Vic\",\"Y\",\"N\")","v":"N"}]
[null,"TransGrid","NSW","Electricity","Transmission",null,"N",null,null,null,"N","N","N","N","N","-",{"$f":"IFERROR(IF(dms_MAIFI_flag=\"Yes\",\"N\",\"Y\"),\"Y\")","v":"Y"},"N","N","Y","Y","N",{"$f":"IFERROR(LEFT(dms_MAIFI_flag),\"N\")","v":"N"},{"$f":"IF('AER CF'!$C34=\"Vic\",\"Y\",\"N\")","v":"N"}]
[null,"United Energy","Vic","Electricity","Distribution",null,"N","N",null,null,"N","N","N","N","N","N",{"$f":"IFERROR(IF(dms_MAIFI_flag=\"Yes\",\"N\",\"Y\"),\"Y\")","v":"Y"},"N","N","N","Y","N",{"$f":"IFERROR(LEFT(dms_MAIFI_flag),\"N\")","v":"N"},{"$f":"IF('AER CF'!$C35=\"Vic\",\"Y\",\"N\")","v":"Y"}]
[]
[]
[null,"Confidential"]
[null,"Amended"]
[]
[null,"Worksheet 6.2 STPIS reliability"]
[null,"Formula",null,null,null,"Applied to:"]
[]
[null,"=INDEX(dms_CBD_flag,MATCH(dms_TradingName,dms_TradingName_List))=\"NO\"",null,null,null,"$D$11,$D$17,$D$23,$D$33,$D$39,$D$45,$D$55,$D$61,$D$67,$D$77,$D$83,$D$89"]
[null,"=INDEX(dms_Urban_flag,MATCH(dms_TradingName,dms_TradingName_List))=\"NO\"",null,null,null,"$D$12,$D$18,$D$24,$D$56,$D$62,$D$78,$D$68,$D$84"]
[null,"=INDEX(dms_ShortRural_flag,MATCH(dms_TradingName,dms_TradingName_List))=\"NO\"",null,null,null,"$D$13,$D$19,$D$25,$D$57,$D$63,$D$69,$D$79,$D$85"]
[null,"=INDEX(dms_LongRural_flag,MATCH(dms_TradingName,dms_TradingName_List))=\"NO\"",null,null,null,"$D$14,$D$20,$D$26,$D$58,$D$64,$D$65,$D$70,$D$71,$D$80,$D$86"]
[null,"=INDEX(dms_FeederType_5_flag,MATCH(dms_TradingName,dms_TradingName_List))=\"NO\"",null,null,null,"$D$87,$D$81,$D$71,$D$65,$D$59,$D$49,$D$43,$D$37,$D$21,$D$15"]
[null,"=dms_MAIFI_Flag=\"No\"",null,null,null,"$D$55:$D$72"]
[]
[]
[null,"Business & other details"]
[null,"=(INDEX(dms_Model_Span,MATCH(dms_Model,dms_Model_List))>1)"]
[null,"=(INDEX(dms_Model_Span,MATCH(dms_Model,dms_Model_List))=1)"]
[]
[]
[null,"STYLES IN USE"]
[null,"HEADING ONE","dms_1"]
[null,"HEADING TWO","dms_2"]
[null,"HEADING THREE","dms_3"]
[null,"HEADING FOUR","dms_4"]
[null,"HEADING FIVE","dms_5"]
[null,5.1109999999999998,"dms_NUM"]
[null,5.45E-2,"dms_NUM%"]
[null,5.5555000000000003,"dms_NUM3d"]
[null,"Text description","dms_Row_Locked"]
[null,"Text description","dms_Row1"]
[null,"Text description","dms_Row2"]
[null,"Total","dms_T1"]
[null,"Total","dms_T2"]
[null,"EXPENSES","dms_BH"]
[null,2019,"dms_BY1"]
[null,2019,"dms_BY2"]
[null,"VOLUMES","dms_GH"]
[null,2019,"dms_GY1"]
[null,2019,"dms_GY2"]

{"sheet":"AER NRs","index":1,"n_rows":232,"n_cols":16,"rows_kept":232,"cut":false,"hidden":true,"merged":[[4,1,28,1],[32,1,55,1],[33,10,35,10],[33,36,33,57],[33,67,33,88],[34,36,34,57],[34,67,34,88],[35,36,35,57],[35,67,35,88],[36,10,40,10],[44,10,45,10],[65,1,78,1],[84,1,97,1],[100,1,107,1],[110,1,115,1],[118,1,132,1],[195,1,196,1],[199,1,200,1],[208,1,213,1],[135,1,150,1],[152,1,158,1],[160,1,174,1],[176,1,177,1],[179,1,184,1],[191,1,192,1]]}
[null,"AER NAMED RANGES"]
[]
[null,"DROP DOWN SELECTORS USED IN WORKBOOKS"]
[]
[null,"COVER SHEET","dms_DataQuality_List","dms_Confid_status_List"]
[null,null,"-- select --","-- select --"]
[null,null,"Actual","Public"]
[null,null,"Estimate","Confidential"]
[null,null,"Consolidated"]
[]
[]
[null,null,"For all files either AER or business needs to be able to specify the type of submission","For PTRM & RFM templates we must provide a choice in case they change their form of control - otherwise it is drawn from the business specific lookup table above."]
[null,null,"dms_SourceList","dms_FormControl_Choices"]
[null,null,"-- select --","Revenue cap"]
[null,null,"After appeal","Revenue yield"]
[null,null,"Draft decision","Tariff cap"]
[null,null,"Final decision","Weighted average price cap"]
[null,null,"PTRM update 1"]
[null,null,"PTRM update 2"]
[null,null,"PTRM update 3"]
[null,null,"PTRM update 4"]
[null,null,"PTRM update 5"]
[null,null,"PTRM update 6"]
[null,null,"PTRM update 7"]
[null,null,"Reallocated"]
[null,null,"Recast"]
[null,null,"Regulatory proposal"]
[null,null,"Reporting"]
[null,null,"Revised regulatory proposal"]
[]
[]
[null,null,null,null,null,null,null,null,null,null,"This is used to create an image to insert on 6.3 STPIS sheet - not for dropdown lists.",null,null,"GAS"]
[null,"CA & RESET RINS \nDNSP","dms_DNSP_020301_SubstationType","dms_DNSP_020301_ProjectType","dms_DNSP_020301_ProjectTrigger","dms_DNSP_020302_ProjectType","dms_DNSP_020302_ProjectTrigger","dms_STPIS_Exclusion_List","dms_Reason_Interruption","dms_Reason_Interruption_Detailed","Reason for interruption",null,null,"dms_N0205_AssetType"]
[null,null,"Subtransmission substation","New substation establishment","Demand growth","New line on new route - single circuit","Demand growth","Weather","Animal","Animal impact","Animal","Animal impact",null,"Cast Iron"]
[null,null,"Zone substation","Substation upgrade - capacity"," Voltage issues","New line on new route - dual circuit"," Voltage issues","Equipment failure","Asset failure","Animal nesting/burrowing, etc and other",null,"Animal nesting/burrowing, etc and other",null,"PVC"]
[null,null,"Switching station","Substation upgrade - voltage"," Reactive power issue","New line on new route - other"," Reactive power issue","Operational error","Other","Other",null,"Other",null,"Polyamide"]
[null,null,"Other","Other"," Fault level issues","Line rebuild over existing route - single circuit"," Fault level issues","Vegetation","Overloads","LV","Asset failure","LV",null,"High density polyethylene (80)"]
[null,null,null,null," Safety","Line rebuild over existing route - dual circuit"," Net market benefit","Animals","Planned","Distribution substation",null,"Distribution substation",null,"High density polyethylene (100)"]
[null,null,null,null," Environment","Reconductor - Single circuit"," Safety","Third party impacts","Network business","HV",null,"HV",null,"High density polyethylene (250)"]
[null,null,null,null," Other","Reconductor - Dual circuit"," Environment","Transmission failure","Third party","Zone substation",null,"Zone substation",null,"High density polyethylene (575)"]
[null,null,null,null,null,"Reconductor - Other"," Other","Load shedding","Unknown","Subtransmission",null,"Subtransmission",null,"Medium density polyethylene"]
[null,null,null,null,null,"Line upgrade - raising/retensoring",null,"Inter-distributor connection failure","Vegetation","insert description of 'other'","Other","insert description of 'other'",null,"Unprotected steel"]
[null,null,null,null,null,"Line upgrade - voltage upgrade",null,"Other","Weather","Network error","Overloads",null,null,"Protected steel"]
[null,null,null,null,null,"Line upgrade - capacity",null,null,"2 - STPIS Exclusion (3.3)(a)","Switching and protection error","Planned",null,null,"Other"]
[null,null,null,null,null,"String spare circuit",null,null,"3 - STPIS Exclusion (3.3)(a)","Fire","Network business","Network error"]
[null,null,null,null,null,"Other",null,null,"4 - STPIS Exclusion (3.3)(a)","Other",null,"Switching and protection error"]
[null,null,null,null,null,null,null,null,"5 - STPIS Exclusion (3.3)(a)","Dig-in","Third party","Fire"]
[null,null,null,null,null,null,null,null,"6 - STPIS Exclusion (3.3)(a)","Unauthorised access",null,"Other"]
[null,null,null,null,null,null,null,null,"7 - STPIS Exclusion (3.3)(a)","Vehicle impact",null,"Dig-in"]
[null,null,null,null,null,null,null,null,null,"Unknown",null,"Unauthorised access"]
[null,null,null,null,null,null,null,null,null,"Blow-in/Fall-in - NSP responsibility",null,"Vehicle impact"]
[null,null,null,null,null,null,null,null,null,"Grow-in - NSP responsibility","Unknown","Unknown"]
[null,null,null,null,null,null,null,null,null,"Blow-in/Fall-in - Other responsible party","Vegetation","Blow-in/Fall-in - NSP responsibility"]
[null,null,null,null,null,null,null,null,null,"Grow-in - Other responsible party",null,"Grow-in - NSP responsibility"]
[null,null,null,null,null,null,null,null,null,null,null,"Blow-in/Fall-in - Other responsible party"]
[null,null,null,null,null,null,null,null,null,null,null,"Grow-in - Other responsible party"]
[null,null,null,null,null,null,null,null,null,null,"Weather"]
[null,null,null,null,null,null,null,null,null,null,"2 - STPIS Exclusion (3.3)(a)"]
[null,null,null,null,null,null,null,null,null,null,"3 - STPIS Exclusion (3.3)(a)"]
[null,null,null,null,null,null,null,null,null,null,"4 - STPIS Exclusion (3.3)(a)"]
[null,null,null,null,null,null,null,null,null,null,"5 - STPIS Exclusion (3.3)(a)"]
[null,null,null,null,null,null,null,null,null,null,"6 - STPIS Exclusion (3.3)(a)"]
[null,null,null,null,null,null,null,null,null,null,"7 - STPIS Exclusion (3.3)(a)"]
[]
[]
[null,"CA & RESET RINS \nTNSP ","dms_TNSP_0203_SubstationType","dms_TNSP_020301_ProjectType","dms_TNSP_020301_ProjectTrigger","dms_TNSP_020302_ProjectType","dms_TNSP_0203_ProjectTrigger"]
[null,null,"Terminal station","New substation establishment","Demand growth","New line on new route - single circuit","Demand growth"]
[null,null,"Switching station","Capacity upgrade"," Voltage issues","New line on new route - dual circuit"," Voltage issues"]
[null,null,"Transmission substation","Voltage upgrade"," Reactive power issue","New line on new route - other"," Reactive power issue"]
[null,null,"Other","Other"," Fault level issues","Line rebuild over existing route - single circuit"," Fault level issues"]
[null,null,null,null,"Net market benefit","Line rebuild over existing route - dual circuit"," Net market benefit"]
[null,null,null,null," Safety","Reconductor - Single circuit"," Safety"]
[null,null,null,null," Environment","Reconductor - Dual circuit"," Environment"]
[null,null,null,null," Other","Reconductor - Other"," Other"]
[null,null,null,null,null,"Line upgrade - raising/retensoring"]
[null,null,null,null,null,"Line upgrade - voltage upgrade"]
[null,null,null,null,null,"Line upgrade - capacity"]
[null,null,null,null,null,"String spare circuit"]
[null,null,null,null,null,"Other"]
[]
[]
[]
[null,"NAMED RANGES USED IN ETL PROCESS"]
[null,null,null,null,null,null,null,null,null,null,null,null,"GAS ARR & RESET"]
[null,"CA & RESET RINS \nDNSP ONLY","dms_020303_01_UOM","dms_020501_01_UOM","dms_020501_02_UOM","dms_020501_03_UOM","dms_020501_04_UOM","dms_020701_01_UOM","dms_020701_02_UOM","dms_020701_01_Rows","dms_040102_01_UOM","dms_040102_04_UOM","dms_S140101_UOM","dms_S140201_UOM","dms_E050201_UOM","dms_E050202_UOM"]
[null,null,"Circuit line length in km","0's","0's","0's","0's","km","km","Route line length within zone","0's","days","number","number per km","per metre per connection","metres per connection"]
[null,null,"Circuit line length in km","0's","0's","0's","0's","0's","0's","Number of maintenance spans","0's","0's","number","number","per service per connection","number per connection"]
[null,null,"Circuit line length in km","MVA added","MVA added","MVA added","MVA added","km","km","Total length of maintenance spans","0's","$0s","number","number","number per connection","number per connection"]
[null,null,"Circuit line length in km","0's","0's","0's","0's","km","km","Length of vegetation corridors","$0s","0's","km"]
[null,null,"Number","total spend $0s","total spend $0s","total spend $0s","total spend $0s","0's","0's","Average number of trees per maintenance span"]
[null,null,"Number","net circuit km added","net circuit km added","net circuit km added","net circuit km added","years","years","Average frequency of cutting cycle"]
[null,null,"Number","total spend $0s","total spend $0s","total spend $0s","total spend $0s"]
[null,null,null,"net circuit km added","net circuit km added","net circuit km added","net circuit km added"]
[null,null,null,"total spend $0s","total spend $0s","total spend $0s","total spend $0s"]
[null,null,null,"0's",null,"$0s"]
[null,null,null,"0's"]
[null,null,null,"0's"]
[null,null,null,"$0s"]
[]
[]
[null,"CA & RESET RINS \nTNSP ONLY","dms_020701_01_UOM"]
[null,null,"km"]
[null,null,"0's"]
[null,null,"km"]
[null,null,"0's"]
[null,null,"km"]
[null,null,"metres"]
[null,null,"years"]
[]
[]
[null,"CA & RESET RINS \nDNSP & TNSP","dms_020603_01_UOM"]
[null,null,"0's"]
[null,null,"0's"]
[null,null,"0's"]
[null,null,"0's"]
[null,null,"(per cent)"]
[]
[]
[null,"EB & RESET RINS \nDNSP ONLY","dms_030601_01_UOM","dms_030601_02_UOM","dms_030701_01_UOM","dms_030702_01_UOM","dms_030703_01_UOM"]
[null,null,"minutes/customer","minutes/customer","Customer / km","%","km"]
[null,null,"minutes/customer","minutes/customer","MWh/customer","Number of spans"]
[null,null,"interruptions/customer","interruptions/customer","kVA / customer","Number of spans"]
[null,null,"interruptions/customer","interruptions/customer",null,"Number of spans"]
[null,null,null,null,null,"Number of spans"]
[null,null,null,null,null,"Years"]
[null,null,null,null,null,"Years"]
[null,null,null,null,null,"Trees"]
[null,null,null,null,null,"Trees"]
[null,null,null,null,null,"Defects"]
[null,null,null,null,null,"Defects"]
[null,null,null,null,null,"Spans"]
[null,null,null,null,null,"km"]
[null,null,null,null,null,"Spans"]
[]
[null,null,"WHEN INSERTING COVER SHEET INTO A TNSP FILE - APPLY THESE NAMED RANGES"]
[null,"EB & RESET RINS \nTNSP ONLY","dms_030601_01_UOM",null,"dms_030701_01_UOM","dms_030702_01_UOM"]
[null,null,"%",null,"Number of spans","km"]
[null,null,"number",null,"Years","%"]
[null,null,"number",null,"Trees","km"]
[null,null,"%",null,"Defects","number"]
[null,null,"number",null,"Number of spans"]
[null,null,"number",null,"km"]
[null,null,"%",null,"km"]
[null,null,"number",null,"Number of spans"]
[null,null,"number"]
[null,null,"%"]
[null,null,"number"]
[null,null,"%"]
[null,null,"number"]
[null,null,"%"]
[null,null,"number"]
[]
[null,"EB & RESET RINS \nDNSP & TNSP","dms_EB_RAB_PIT"]
[null,null,"Beginning of year"]
[null,null,"End of year"]
[null,null,"End of year"]
[null,null,"End of year"]
[null,null,"End of year"]
[null,null,"End of year"]
[]
[null,"ARR \nDNSP ONLY","dms_030605_UOM","dms_03060703_UOM","dms_E020202_UOM","Spare"]
[null,null,"number","number","Length of mains replaced"]
[null,null,"number","number","Number of services replaced"]
[null,null,"number","number"]
[null,null,"number","number"]
[null,null,"number","(per cent)"]
[null,null,"number"]
[null,null,"number"]
[null,null,"number"]
[null,null,"number"]
[null,null,"number"]
[null,null,"number"]
[null,null,"number"]
[null,null,"(per cent)"]
[null,null,"(per cent)",""]
[]
[null,"RFM","dms_Beg","dms_Mid","dms_End"]
[null,null,"Beginning of year","Mid year","End of Year"]
[]
[null,"PTRM","dms_PTRM_RAB_PIT","dms_PTRM_TAB_PIT","DMS_Xfactor"]
[null,null,"Beginning of year","Beginning of year","x factors"]
[null,null,"End of year","End of year"]
[null,null,"End of year","End of year"]
[null,null,"End of year","End of year"]
[null,null,"End of year"]
[]
[]
[null,"STPIS & MIC NAMED RANGES "]
[]
[null,"These \"row descriptions\" are the column headings in the various templates but become row descriptions in the ETL process"]
[]
[null,"Table 6.3 sustained interruptions - row descriptions","dms_060301_CustNo_Affected_Row","dms_060301_Avg_Duration_Sustained_Int_Row","dms_060301_Effect_unplanned_SAIDI_Row","dms_060301_Effect_unplanned_SAIFI_Row"]
[null,null,"Number of customers affected by the interruption","Average duration of sustained customer interruption","Effect on unplanned SAIDI","Effect on unplanned SAIFI"]
[]
[]
[null,"Table 6.1 telephone answering - row descriptions and start date","dms_060101_Rows","dms_060102_Rows","dms_060101_StartDateTxt"]
[null,null,"Total number of calls \n(after removing excluded events)","Number of calls answered within 30 seconds \n(after excluding excluded events) ",{"$f":"dms_060701_StartDateTxt","v":"1-Jul-2016"}]
[]
[]
[null,"Table 6.8.1 - row descriptions","dms_060801_01_Rows","dms_060801_02_Rows","dms_060801_03_Rows","dms_060801_04_Rows"]
[null,null,"Number of interruptions","Duration of interruptions","Total unplanned minutes off supply","Effect on unplanned MAIFI"]
[]
[]
[null,"Table 7.9.4 - market impact component - row descriptions","dms_070904_01_Rows","without exclusions","with exclusions"]
[]
[]
[null,"These headings (Lists) are determined from the INDEX/MATCH function on the NSP selected on the Business & other details sheet"]
[]
[null,"Table 6.7.1 - daily performance data - unplanned - MAIFI  -- row descriptions and header named range values","dms_060701_Feeder_Header_Lvl4",{"$f":"INDEX(dms_FeederName_1,MATCH(dms_TradingName,dms_TradingName_List))","v":"CBD"},{"$f":"INDEX(dms_FeederName_1,MATCH(dms_TradingName,dms_TradingName_List))","v":"CBD"},{"$f":"INDEX(dms_FeederName_2,MATCH(dms_TradingName,dms_TradingName_List))","v":"Urban"},{"$f":"INDEX(dms_FeederName_2,MATCH(dms_TradingName,dms_TradingName_List))","v":"Urban"},{"$f":"INDEX(dms_FeederName_3,MATCH(dms_TradingName,dms_TradingName_List))","v":"Short rural"},{"$f":"INDEX(dms_FeederName_3,MATCH(dms_TradingName,dms_TradingName_List))","v":"Short rural"},{"$f":"INDEX(dms_FeederName_4,MATCH(dms_TradingName,dms_TradingName_List))","v":"Long rural"},{"$f":"INDEX(dms_FeederName_4,MATCH(dms_TradingName,dms_TradingName_List))","v":"Long rural"},{"$f":"IF((INDEX(dms_FeederName_5,MATCH(dms_TradingName,dms_TradingName_List))=0),\"Network\",(INDEX(dms_FeederName_5,MATCH(dms_TradingName,dms_TradingName_List))))","v":"Network"},{"$f":"IF((INDEX(dms_FeederName_5,MATCH(dms_TradingName,dms_TradingName_List))=0),\"Network\",(INDEX(dms_FeederName_5,MATCH(dms_TradingName,dms_TradingName_List))))","v":"Network"},"Network","Network"]
[]
[null,null,"dms_060701_Rows","All events","After removing excluded events","All events","After removing excluded events","All events","After removing excluded events","All events","After removing excluded events","All events","After removing excluded events","All events","After removing excluded events"]
[null,null,null,"the number of column headings changes from 10 to 12 depending on the number of feeder categories for the NSP"]
[]
[null,null,"dms_0603_FeederList",{"$f":"INDEX(dms_FeederName_1,MATCH(dms_TradingName,dms_TradingName_List))","v":"CBD"},{"$f":"INDEX(dms_FeederName_2,MATCH(dms_TradingName,dms_TradingName_List))","v":"Urban"},{"$f":"INDEX(dms_FeederName_3,MATCH(dms_TradingName,dms_TradingName_List))","v":"Short rural"},{"$f":"INDEX(dms_FeederName_4,MATCH(dms_TradingName,dms_TradingName_List))","v":"Long rural"}]
[]
[]
[null,"Use these to add to specific worksheets in existing files","Use these to add to specific worksheets in existing files"]
[]
[]
[null,"ARRs 6.7 STPIS daily performance","dms_060101_Values","dms_060102_Values","dms_060701_Values"]
[null,null,"dms_LeapYear"]
[]
[]
[null,"ARR's  6.8 STPIS exclusions","dms_060801_Event_Date","dms_060801_OutageID","dms_060801_FeederID","dms_060801_FeederClass","dms_060801_CauseID","dms_060801_01_Values","dms_060801_02_Values","dms_060801_03_Values","dms_060801_Excl_Cat","dms_060801_04_Values"]
[null,null,"dms_060801_StartCell"]
[]
[]
[null,"CA 6.3 sustained interruptions","dms_060301_Event_Date","dms_060301_Event_Time","dms_060301_AssetID","dms_060301_FeederClass","dms_060301_Reason","dms_060301_DetailedReason","dms_060301_CustNo_Affected_Values","dms_060301_Avg_Duration_Sustained_Int_Values","dms_060301_Effect_unplanned_SAIDI_Values","dms_060301_Effect_unplanned_SAIFI_Values","dms_060301_MED"]
[]
[]
[]
[null,"PTRM input sheet","DMS_50_01_01a","DMS_50_01_01aa","DMS_50_01_01b","DMS_50_01_01bb","DMS_50_01_01c","DMS_50_01_01d","DMS_50_01_01dd"]

{"sheet":"AER lookups","index":2,"n_rows":101,"n_cols":37,"rows_kept":101,"cut":false,"hidden":true,"merged":[[33,1,33,4],[10,25,10,35],[11,25,11,28],[11,30,11,34],[11,35,13,35]]}
[null,"AER LOOKUP TABLES"]
[]
[null,"Data in these columns used for data validation and database purposes."]
[null,"Date last modified:","2017-01-16","added (Albury and Victora) for AGN"]
[null,null,"2016-10-17","updated TransGrid's correct legal name, corrected TasNetworks (T) to June financial year"]
[null,null,"2017-02-01","inserted Power and Water, added NRs (dms_FeederCat_1 and dms_FeederCat_2)"]
[null,null,"2017-03-03","inserted AEMO as a business"]
[null,null,"2018-03-28","major changes to accommodate STPIS"]
[null,null,"Template Version",5]
[]
[null,null,null,null,null,null,null,null,null,null,null,null,null,null,null,null,null,null,null,null,null,null,null,null,null,"FOR ELECTRICITY BUSINESSES ONLY"]
[null,null,null,null,null,null,null,null,null,null,null,null,null,null,null,null,null,null,null,null,null,null,null,null,null,"Feeder Types",null,null,null,"TasNetworks (D)","Feeder Names"]
[]
[null,null,null,null,null,null,null,null,null,null,null,null,null,null,null,null,null,null,null,null,null,null,null,null,null,"CBD","Urban","Short rural","long rural","EXTRA"]
[null,"dms_TradingName_List","dms_TradingNameFull_List","dms_ABN_List","dms_JurisdictionList","dms_Sector_List","dms_Segment_List","dms_FormControl_List","dms_RPT_List","dms_RPTMonth_List","dms_CRCPlength_List","dms_FRCPlength_List","dms_PRCPlength_List","dms_663_List","dms_DeterminationRef_List","dms_Addr1_List","dms_Addr2_List","dms_Suburb_List","dms_State_List","dms_PostCode_List","dms_PAddr1_List","dms_PAddr2_List","dms_PSuburb_List","dms_PState_List","dms_PPostCode_List","dms_CBD_flag","dms_Urban_flag","dms_ShortRural_flag","dms_LongRural_flag","dms_FeederType_5_flag","dms_FeederName_1","dms_FeederName_2","dms_FeederName_3","dms_FeederName_4","dms_FeederName_5","dms_Public_Lighting_List","Name"]
[null,"AGN (Albury and Victoria)","Australian Gas Networks Limited (reporting data for Albury and Victoria)",19078551685,"Vic","Gas","Distribution","Tariff cap","Financial","June",5,5,5,"x",null,"Level 6","400 King William Street","ADELAIDE","SA",5000,"PO Box 6468","Halifax Street","ADELAIDE","SA",5000,"NO","NO","NO","NO","NO","CBD","Urban","Short rural","Long rural",null,"NO",{"$f":"B16","v":"AGN (Albury and Victoria)"}]
[null,"AGN (Albury)","Australian Gas Networks Limited (reporting data for Albury)",19078551685,"Vic","Gas","Distribution","Tariff cap","Financial","June",5,5,5,"x",null,"Level 6","400 King William Street","ADELAIDE","SA",5000,"PO Box 6468","Halifax Street","ADELAIDE","SA",5000,"NO","NO","NO","NO","NO","CBD","Urban","Short rural","Long rural",null,"NO","AGN (Albury)"]
[null,"AGN (SA)","Australian Gas Networks Limited (reporting data for SA)",19078551685,"SA","Gas","Distribution","Tariff cap","Financial","June",5,5,5,5,"distribution determination","Level 6","400 King William Street","ADELAIDE","SA",5000,"PO Box 6468","Halifax Street","ADELAIDE","SA",5000,"NO","NO","NO","NO","NO","CBD","Urban","Short rural","Long rural",null,"NO","AGN (SA)"]
[null,"AGN (Victoria)","Australian Gas Networks Limited (reporting data for Victoria)",19078551685,"Vic","Gas","Distribution","Tariff cap","Financial","June",5,5,5,"x",null,"Level 6","400 King William Street","ADELAIDE","SA",5000,"PO Box 6468","Halifax Street","ADELAIDE","SA",5000,"NO","NO","NO","NO","NO","CBD","Urban","Short rural","Long rural",null,"NO","AGN (Victoria)"]
[null,"Amadeus","APT Pipelines (NT) Pty Ltd",39009737393,"NT","Gas","Transmission","Tariff cap","Financial","June",5,5,5,"x","n/a","Level 19, HSBC Building","580 George Street","SYDNEY","NSW",2000,"Level 19, HSBC Building","580 George Street","SYDNEY","NSW",2000,"NO","NO","NO","NO","NO","CBD","Urban","Short rural","Long rural",null,"NO","Amadeus"]
[null,"APA GasNet","APA GasNet Australia (Operations) Pty Ltd","065083009","Vic","Gas","Transmission","Weighted average price cap","Financial","June",5,5,5,"x",null,"Level 19, HSBC Building","580 George Street","SYDNEY","NSW",2000,"PO Box R41",null,"ROYAL EXCHANGE","NSW",1225,"Alexandra Curran","02 9275 0020","alexandra.curran@apa.com.au","NO","NO","NO","NO","NO","-","CBD","Urban","APA GasNet"]
[null,"APA VTS","APA VTS Australia (Operations) Pty Ltd",65083009,"Vic","Gas","Transmission","Tariff cap","Financial","June",5,5,5,"x",null,"Level 19, HSBC Building","580 George Street","SYDNEY","NSW",2000,"PO Box R41",null,"ROYAL EXCHANGE","NSW",1225,"NO","NO","NO","NO","NO","CBD","Urban","Short rural","Long rural",null,"NO","APA VTS"]
[null,"AusNet (Gas)","AusNet Gas Services","086015036","Vic","Gas","Distribution","Tariff cap","Financial","June",5,5,5,"-","-","Level 31","2 Southbank Boulevard","SOUTHBANK","Vic",3008,null,null,null,"Vic",null,"NO","NO","NO","NO","NO","CBD","Urban","Short rural","Long rural",null,"NO","AusNet (Gas)"]
[null,"Australian Distribution Co. (Gas)","Australian Gas Distribution Co. ",11222333444,"Vic","Gas","Distribution","Tariff cap","Financial","June",5,5,5,"-","-","123 Straight Street",null,"MELBOURNE","Vic",3000,"PO Box 123",null,"MELBOURNE","Vic",3000,"NO","NO","NO","NO","NO","CBD","Urban","Short rural","Long rural",null,"NO","Australian Distribution Co. (Gas)"]
[null,"Australian Transmission Co. (Gas)","Australian Transmission Co. (Gas)",11222333444,"NSW","Gas","Transmission","Tariff cap","Financial","June",5,5,5,5,"transmission determination","123 Straight Street",null,"SYDNEY","NSW",2000,"PO Box 123",null,"SYDNEY","NSW",2000,"NO","NO","NO","NO","NO","CBD","Urban","Short rural","Long rural",null,"NO","Australian Transmission Co. (Gas)"]
[null,"Evoenergy Gas","Icon Distribution Investments Limited (ABN 83 073 025 224) and Jemena Networks (ACT) Pty Ltd (ABN 24 008 552 663)",76670568688,"ACT","Gas","Distribution","Tariff cap","Financial","June",5,5,5,"x",null,"40 Bunda Street",null,"CANBERRA","ACT",2600,"GPO BOX 366",null,"CANBERRA","ACT",2601,"NO","NO","NO","NO","NO","CBD","Urban","Short rural","Long rural",null,"NO","Evoenergy Gas"]
[null,"JGN","Jemena Gas Networks (NSW) Ltd","003 004 322","NSW","Gas","Distribution","Tariff cap","Financial","June",5,5,5,null,null,null,null,null,null,null,null,null,null,null,null,"NO","NO","NO","NO","NO","CBD","Urban","Short rural","Long rural",null,"NO","JGN"]
[null,"Multinet Gas","Multinet Gas (DB No.1) Pty Ltd (ACN 086 026 986), Multinet Gas (DB No.2) Pty Ltd (ACN 086 230 122)","086026986","Vic","Gas","Distribution","Tariff cap","Financial","June",5,5,5,"x",null,"43-45 Centreway",null,"MT WAVERLEY","Vic",3149,null,null,null,"Vic",null,"NO","NO","NO","NO","NO","CBD","Urban","Short rural","Long rural",null,"NO","Multinet Gas"]
[null,"Roma to Brisbane Pipeline","APT Petroleum Pipelines Limited t/a Roma to Brisbane Pipeline","009 737 393","Qld","Gas","Transmission","Tariff cap","Financial","June",5,5,5,"x","n/a","580 George Street",null,"SYDNEY","NSW",2000,"PO Box R41",null,"ROYAL EXCHANGE","NSW",1225,"NO","NO","NO","NO","NO","CBD","Urban","Short rural","Long rural",null,"NO","Roma to Brisbane Pipeline"]
[]
[]
[]
[]
[null,"The Reg Year Ending (dms_RYE) must be set to the last year of the regulatory period. For forecast data is is usually (FRCP_y5) for actual it is a single year (CRY). For historical actual data the RYE will need to be set manually in the business details sheet by setting the dms_Multiyear_flag to 1 and putting the correct value in 'dms_Specified_FinalYear. See cells C67:C68"]
[null,"dms_Model_List ","dms_Model_Name_Format1","dms_Worksheet_List","dms_Model_Span_List"]
[null,"ARR","Annual Reporting",{"$f":"IF(dms_MultiYear_ResponseFlag=\"yes\",\"NEW HISTORICAL ANNUAL REPORTING\",\"ANNUAL REPORTING\")","v":"ANNUAL REPORTING"},1]
[null,"CA","Category Analysis",{"$f":"IF(dms_MultiYear_ResponseFlag=\"yes\",\"NEW HISTORICAL CATEGORY ANALYSIS\",\"CATEGORY ANALYSIS\")","v":"CATEGORY ANALYSIS"},1]
[null,"CESS","Capitlal Expenditure","CAPITLAL EXPENDITURE SHARING SCHEMING",5]
[null,"CPI","CPI","CPI",5]
[null,"EB","Economic Benchmarking",{"$f":"IF(dms_MultiYear_ResponseFlag=\"yes\",\"NEW HISTORICAL ECONOMIC BENCHMARKING\",\"ECONOMIC BENCHMARKING\")","v":"ECONOMIC BENCHMARKING"},1]
[null,"EBSS","Efficiency Benefit Sharing Scheme","EFFICIENCY BENEFIT SHARING SCHEME",5]
[null,"Pricing","Pricing Proposal","PRICING PROPOSAL",5]
[null,"Profitability","Profitability","PROFITABILITY",5]
[null,"PTRM","Post Tax Revenue Model","POST TAX REVENUE MODEL",5]
[null,"Reset","Regulatory Reporting (Reset)","REGULATORY REPORTING STATEMENT",5]
[null,"RFM","Roll Forward Model","ROLL FORWARD MODEL",5]
[null,"WACC","Weighted Average Cost of Capital","WEIGHTED AVERAGE COST OF CAPITAL",1]
[]
[]
[]
[null,"Financial","Calendar",null,"PREVIOUS",null,"CURRENT",null,"FORTHCOMING"]
[null,"1987-88","1988","PRCP_y1",{"$f":"INDEX(INDIRECT(dms_RPT),dms_PRCP_start_row)","v":"2013-14"},"CRCP_y1",{"$f":"INDEX(INDIRECT(dms_RPT),dms_CRCP_start_row)","v":"2018-19"},{"$f":"FRCP_y1","v":"2023-24"},{"$f":"INDEX(INDIRECT(dms_RPT),dms_FRCP_start_row)","v":"2023-24"}]
[null,"1988-89","1989","PRCP_y2",{"$f":"INDEX(INDIRECT(dms_RPT),dms_PRCP_start_row+1)","v":"2014-15"},"CRCP_y2",{"$f":"INDEX(INDIRECT(dms_RPT),dms_CRCP_start_row+1)","v":"2019-20"},"FRCP_y2",{"$f":"INDEX(INDIRECT(dms_RPT),dms_FRCP_start_row+1)","v":"2024-25"}]
[null,"1989-90","1990","PRCP_y3",{"$f":"INDEX(INDIRECT(dms_RPT),dms_PRCP_start_row+2)","v":"2015-16"},"CRCP_y3",{"$f":"INDEX(INDIRECT(dms_RPT),dms_CRCP_start_row+2)","v":"2020-21"},"FRCP_y3",{"$f":"INDEX(INDIRECT(dms_RPT),dms_FRCP_start_row+2)","v":"2025-26"}]
[null,"1990-91","1991","PRCP_y4",{"$f":"INDEX(INDIRECT(dms_RPT),dms_PRCP_start_row+3)","v":"2016-17"},"CRCP_y4",{"$f":"INDEX(INDIRECT(dms_RPT),dms_CRCP_start_row+3)","v":"2021-22"},"FRCP_y4",{"$f":"INDEX(INDIRECT(dms_RPT),dms_FRCP_start_row+3)","v":"2026-27"}]
[null,"1991-92","1992","PRCP_y5",{"$f":"INDEX(INDIRECT(dms_RPT),dms_PRCP_start_row+4)","v":"2017-18"},"CRCP_y5",{"$f":"INDEX(INDIRECT(dms_RPT),dms_CRCP_start_row+4)","v":"2022-23"},"FRCP_y5",{"$f":"INDEX(INDIRECT(dms_RPT),dms_FRCP_start_row+4)","v":"2027-28"}]
[null,"1992-93","1993","PRCP_y6",{"$f":"INDEX(INDIRECT(dms_RPT),dms_PRCP_start_row+5)","v":"2018-19"},"CRCP_y6",{"$f":"INDEX(INDIRECT(dms_RPT),dms_CRCP_start_row+5)","v":"2023-24"},"FRCP_y6",{"$f":"INDEX(INDIRECT(dms_RPT),dms_FRCP_start_row+5)","v":"2028-29"}]
[null,"1993-94","1994","PRCP_y7",{"$f":"INDEX(INDIRECT(dms_RPT),dms_PRCP_start_row+6)","v":"2019-20"},"CRCP_y7",{"$f":"INDEX(INDIRECT(dms_RPT),dms_CRCP_start_row+6)","v":"2024-25"},"FRCP_y7",{"$f":"INDEX(INDIRECT(dms_RPT),dms_FRCP_start_row+6)","v":"2029-30"}]
[null,"1994-95","1995","PRCP_y8",{"$f":"INDEX(INDIRECT(dms_RPT),dms_PRCP_start_row+7)","v":"2020-21"},"CRCP_y8",{"$f":"INDEX(INDIRECT(dms_RPT),dms_CRCP_start_row+7)","v":"2025-26"},"FRCP_y8",{"$f":"INDEX(INDIRECT(dms_RPT),dms_FRCP_start_row+7)","v":"2030-31"}]
[null,"1995-96","1996","PRCP_y9",{"$f":"INDEX(INDIRECT(dms_RPT),dms_PRCP_start_row+8)","v":"2021-22"},"CRCP_y9",{"$f":"INDEX(INDIRECT(dms_RPT),dms_CRCP_start_row+8)","v":"2026-27"},"FRCP_y9",{"$f":"INDEX(INDIRECT(dms_RPT),dms_FRCP_start_row+8)","v":"2031-32"}]
[null,"1996-97","1997","PRCP_y10",{"$f":"INDEX(INDIRECT(dms_RPT),dms_PRCP_start_row+9)","v":"2022-23"},"CRCP_y10",{"$f":"INDEX(INDIRECT(dms_RPT),dms_CRCP_start_row+9)","v":"2027-28"},"FRCP_y10",{"$f":"INDEX(INDIRECT(dms_RPT),dms_FRCP_start_row+9)","v":"2032-33"}]
[null,"1997-98","1998","PRCP_y11",{"$f":"INDEX(INDIRECT(dms_RPT),dms_PRCP_start_row+10)","v":"2023-24"},"CRCP_y11",{"$f":"INDEX(INDIRECT(dms_RPT),dms_CRCP_start_row+10)","v":"2028-29"},"FRCP_y11",{"$f":"INDEX(INDIRECT(dms_RPT),dms_FRCP_start_row+10)","v":"2033-34"}]
[null,"1998-99","1999","PRCP_y12",{"$f":"INDEX(INDIRECT(dms_RPT),dms_PRCP_start_row+11)","v":"2024-25"},"CRCP_y12",{"$f":"INDEX(INDIRECT(dms_RPT),dms_CRCP_start_row+11)","v":"2029-30"},"FRCP_y12",{"$f":"INDEX(INDIRECT(dms_RPT),dms_FRCP_start_row+11)","v":"2034-35"}]
[null,"1999-00","2000","PRCP_y13",{"$f":"INDEX(INDIRECT(dms_RPT),dms_PRCP_start_row+12)","v":"2025-26"},"CRCP_y13",{"$f":"INDEX(INDIRECT(dms_RPT),dms_CRCP_start_row+12)","v":"2030-31"},"FRCP_y13",{"$f":"INDEX(INDIRECT(dms_RPT),dms_FRCP_start_row+12)","v":"2035-36"}]
[null,"2000-01","2001","PRCP_y14",{"$f":"INDEX(INDIRECT(dms_RPT),dms_PRCP_start_row+13)","v":"2026-27"},"CRCP_y14",{"$f":"INDEX(INDIRECT(dms_RPT),dms_CRCP_start_row+13)","v":"2031-32"},"FRCP_y14",{"$f":"INDEX(INDIRECT(dms_RPT),dms_FRCP_start_row+13)","v":"2036-37"}]
[null,"2001-02","2002","PRCP_y15",{"$f":"INDEX(INDIRECT(dms_RPT),dms_PRCP_start_row+14)","v":"2027-28"},"CRCP_y15",{"$f":"INDEX(INDIRECT(dms_RPT),dms_CRCP_start_row+14)","v":"2032-33"},"FRCP_y15",{"$f":"INDEX(INDIRECT(dms_RPT),dms_FRCP_start_row+14)","v":{"$error":"#REF!"}}]
[null,"2002-03","2003","PRCP_y16",{"$f":"INDEX(INDIRECT(dms_RPT),dms_PRCP_start_row+15)","v":"2028-29"},"CRCP_y16",{"$f":"INDEX(INDIRECT(dms_RPT),dms_CRCP_start_row+15)","v":"2033-34"},"FRCP_y16",{"$f":"INDEX(INDIRECT(dms_RPT),dms_FRCP_start_row+15)","v":{"$error":"#REF!"}}]
[null,"2003-04","2004"]
[null,"2004-05","2005"]
[null,"2005-06","2006",null,"CRY - FRY"]
[null,"2006-07","2007","dms_y1",{"$f":"IFERROR(INDEX(INDIRECT(dms_RPT),dms_CRY_start_row),0)","v":"2021-22"}]
[null,"2007-08","2008","dms_y2",{"$f":"IFERROR(INDEX(INDIRECT(dms_RPT),dms_CRY_start_row+1),0)","v":"2022-23"}]
[null,"2008-09","2009","dms_y3",{"$f":"IFERROR(INDEX(INDIRECT(dms_RPT),dms_CRY_start_row+2),0)","v":"2023-24"}]
[null,"2009-10",2010,"dms_y4",{"$f":"IFERROR(INDEX(INDIRECT(dms_RPT),dms_CRY_start_row+3),0)","v":"2024-25"}]
[null,"2010-11",2011,"dms_y5",{"$f":"IFERROR(INDEX(INDIRECT(dms_RPT),dms_CRY_start_row+4),0)","v":"2025-26"}]
[null,"2011-12",2012,"dms_y6",{"$f":"IFERROR(INDEX(INDIRECT(dms_RPT),dms_CRY_start_row+5),0)","v":"2026-27"}]
[null,"2012-13",2013,"dms_y7",{"$f":"IFERROR(INDEX(INDIRECT(dms_RPT),dms_CRY_start_row+6),0)","v":"2027-28"}]
[null,"2013-14",2014,"dms_y8",{"$f":"IFERROR(INDEX(INDIRECT(dms_RPT),dms_CRY_start_row+7),0)","v":"2028-29"}]
[null,"2014-15",2015,"dms_y9",{"$f":"IFERROR(INDEX(INDIRECT(dms_RPT),dms_CRY_start_row+8),0)","v":"2029-30"}]
[null,"2015-16",2016,"dms_y10",{"$f":"IFERROR(INDEX(INDIRECT(dms_RPT),dms_CRY_start_row+9),0)","v":"2030-31"}]
[null,"2016-17",2017,"dms_y11",{"$f":"IFERROR(INDEX(INDIRECT(dms_RPT),dms_CRY_start_row+10),0)","v":"2031-32"}]
[null,"2017-18",2018,"dms_y12",{"$f":"IFERROR(INDEX(INDIRECT(dms_RPT),dms_CRY_start_row+11),0)","v":"2032-33"}]
[null,"2018-19",2019,"dms_y13",{"$f":"IFERROR(INDEX(INDIRECT(dms_RPT),dms_CRY_start_row+12),0)","v":"2033-34"}]
[null,"2019-20",2020,"dms_y14",{"$f":"IFERROR(INDEX(INDIRECT(dms_RPT),dms_CRY_start_row+13),0)","v":"2034-35"}]
[null,"2020-21",2021,"dms_y15",{"$f":"IFERROR(INDEX(INDIRECT(dms_RPT),dms_CRY_start_row+14),0)","v":"2035-36"}]
[null,"2021-22",2022,"dms_y16",{"$f":"IFERROR(INDEX(INDIRECT(dms_RPT),dms_CRY_start_row+15),0)","v":"2036-37"}]
[null,"2022-23",2023]
[null,"2023-24",2024]
[null,"2024-25",2025]
[null,"2025-26",2026]
[null,"2026-27",2027]
[null,"2027-28",2028]
[null,"2028-29",2029]
[null,"2029-30",2030]
[null,"2030-31",2031]
[null,"2031-32",2032]
[null,"2032-33",2033]
[null,"2033-34",2034]
[null,"2034-35",2035]
[null,"2035-36",2036]
[null,"2036-37","2037"]

{"sheet":"AER ETL","index":3,"n_rows":145,"n_cols":8,"rows_kept":145,"cut":false,"hidden":true,"merged":[[11,0,15,0],[12,4,12,8],[14,2,14,4],[18,0,25,0],[26,0,31,0],[34,0,59,0],[34,37,34,58],[34,68,34,89],[32,37,32,58],[71,1,73,1],[32,68,32,89],[33,37,33,58],[33,68,33,89]]}
[null,"AER ETL INFORMATION"]
[]
[null,"USES NAMED RANGES FLAG","yes","dms_Defined_Names_Used"]
[]
[null,"IF THIS IS AN ABC RIN - make sure the the named range CRY is applied and the named range dms_dollar_nom_UOM is applied"]
[null,"IF THIS IS A RESET RIN - make sure the named ranges CRY and dms_dollar_nom_UOM are NOT present in the workbook"]
[null,"FOR ABC RINS THAT SPAN MULTIPLE YEARS - make sure MultiYear Flag is set and final year entered as required"]
[]
[null,"Full trading name",{"$f":"INDEX(dms_TradingNameFull_List,MATCH(dms_TradingName,dms_TradingName_List))","v":"AusNet Gas Services"},null,"dms_TradingNameFull"]
[null,"Trading name",{"$f":"dms_TradingName","v":"AusNet (Gas)"}]
["Selected here","Model / RIN","Reset","dms_Model"]
["Read from Business & other details","Source","Regulatory proposal","dms_Source"]
[null,"Data quality","Consolidated","For DB purposes this is always Consoldiated"]
[null,"Data status","Public","For DB purposes this is always Public"]
[null,"Amendment reason",{"$f":"dms_Amendment_Text","v":"."},null,null,"dms_AmendmentReason"]
[null,"Submission date",{"$f":"dms_Typed_Submission_Date","v":"2022-07-01"},"dms_SubmissionDate"]
[]
["Redundant","EBSS - First application of scheme in forthcoming period?","No"]
["Pre-populated from lookup table","Data ingestion data quality","Consolidated","dms_DataQuality","Always Consolidated"]
[null,"Sector",{"$f":"INDEX(dms_Sector_List,MATCH(dms_TradingName,dms_TradingName_List))","v":"Gas"},"dms_Sector","=INDEX(dms_Sector_List,MATCH(dms_TradingName,dms_TradingName_List))"]
[null,"Segment",{"$f":"INDEX(dms_Segment_List,MATCH(dms_TradingName,dms_TradingName_List))","v":"Distribution"},"dms_Segment","=INDEX(dms_Segment_List,MATCH(dms_TradingName,dms_TradingName_List))"]
[null,"Regulatory Year Ending",{"$f":"IF(dms_MultiYear_Flag=1,LEFT(dms_Specified_FinalYear,2)&RIGHT(dms_Specified_FinalYear,2),dms_RYE_result)","v":"2028"},"dms_RYE","=IF(dms_MultiYear_Flag=1,LEFT(dms_Specified_FinalYear,2)&RIGHT(dms_Specified_FinalYear,2),dms_RYE_result)"]
[null,"Reporting Period Type",{"$f":"INDEX(dms_RPT_List,MATCH(dms_TradingName,dms_TradingName_List))","v":"Financial"},"dms_RPT","=INDEX(dms_RPT_List,MATCH(dms_TradingName,dms_TradingName_List))"]
[null,"EB/CA Unit of Measure for Monetary Values","$0s","dms_dollar_nom_UOM","If the cover sheet is attached to an ABC RIN apply the NAMED RANGE to the cell"]
[null,"Security Classification","Public","dms_Classification","Always Public"]
[null,"Jurisdiction",{"$f":"INDEX(dms_JurisdictionList,MATCH(dms_TradingName,dms_TradingName_List))","v":"Vic"},"dms_Jurisdiction","=INDEX(dms_JurisdictionList,MATCH(dms_TradingName,dms_TradingName_List))"]
["Relevant for PTRM, RFMs and Reset RINS","$ REAL REFERENCES"]
[null,"Does the named range CRY exist in this file? ",{"$f":"IFERROR(CRY,\"NO\")","v":"NO"}]
[null,"CRY-1  (last full calendar year before CRY)",{"$f":"IFERROR(IF(dms_RPT=\"calendar\",CRY-1,LEFT(CRY,4)),\"CRY not present\")","v":"CRY not present"},"dms_Cal_Year_B4_CRY","'=IF(dms_RPT=\"financial\",VALUE(LEFT(dms_SingleYear_FinalYear_Result,4)),VALUE(LEFT(dms_SingleYear_FinalYear_Result,4)-1))"]
[null,"Dollar $ real month",{"$f":"INDEX(dms_RPTMonth_List,MATCH(dms_TradingName,dms_TradingName_List))","v":"June"},"dms_RPTMonth","=INDEX(dms_RPTMonth_List,MATCH(dms_TradingName,dms_TradingName_List))"]
[null,"Dollar $ real  (the last month before the FRCP_y1)",{"$f":"IF(dms_Model=\"RFM\",dms_DollarReal_Prev, IF(dms_SingleYearModel=\"yes\",CONCATENATE(dms_RPTMonth)&\" \"&VALUE((LEFT(dms_CRY_start_year,2)&RIGHT(dms_CRY_start_year,2))),CONCATENATE(dms_RPTMonth)&\" \"&dms_DollarReal_year))","v":"June 2023"},"dms_DollarReal","=IF(dms_Model=\"RFM\",dms_DollarReal_Prev, IF(dms_SingleYearModel=\"yes\",CONCATENATE(dms_RPTMonth)&\" \"&VALUE((LEFT(dms_CRY_start_year,2)&RIGHT(dms_CRY_start_year,2))),CONCATENATE(dms_RPTMonth)&\" \"&dms_DollarReal_year))"]
[null,"Dollar $ real previous year (PRCP_y5)","December 2017","dms_DollarReal_Prev","=IF(SUM(dms_SingleYear_Model)>0,CONCATENATE(dms_RPTMonth)&\" \"&VALUE(((LEFT(CRY,2))&RIGHT(CRY,2))-1),CONCATENATE(dms_RPTMonth)&\" \"&VALUE(((LEFT(dms_CRCP_FirstYear_Result,2)&RIGHT(dms_CRCP_FirstYear_Result,2))))-1)"]
[null,"PTRM/ RFMs"]
[null,"Form of control",{"$f":"INDEX(dms_FormControl_List,MATCH(dms_TradingName,dms_TradingName_List))","v":"Tariff cap"},"dms_FormControl","=INDEX(dms_FormControl_List,MATCH(dms_TradingName,dms_TradingName_List))"]
["All potential values for Regulatory Years or RYEs as calculated","This block works out the various RYE's for ALL RIN types and MODELS"]
[null,"dms_start_year",{"$f":"FRCP_y1","v":"2023-24"},"=FRCP_y1","FRCP_y1 from cover sheet"]
[null,"dms_CRY_start_year",{"$f":"IFERROR(CRY,CRCP_y4)","v":"2021-22"},"=IFERROR(CRY,CRCP_y4)"]
[null,"dms_CRY_start_row",{"$f":"IFERROR(MATCH(dms_CRY_start_year,INDIRECT(dms_RPT),0),0)","v":35},"=IFERROR(MATCH(dms_CRY_start_year,INDIRECT(dms_RPT),0),0)"]
[null,"dms_FRCP_start_row",{"$f":"MATCH(dms_start_year,INDIRECT(dms_RPT),0)","v":37},"=MATCH(dms_start_year,INDIRECT(dms_RPT),0)","Uses FRCP_y1 as a start reference"]
[null,"dms_CRCP_start_row",{"$f":"dms_FRCP_start_row-dms_CRCPlength_Num","v":32},"=dms_FRCP_start_row-dms_CRCPlength_Num","Uses the value in dms_CRCPlength_Num"]
[null,"dms_PRCP_start_row",{"$f":"dms_FRCP_start_row-dms_CRCPlength_Num-dms_PRCPlength_Num","v":27},"=dms_FRCP_start_row-dms_CRCPlength_Num-dms_PRCPlength_Num","Uses the value in dms_CRCPlength_Num and dms_PRCPlength_Num"]
[null,"dms_RYE_start_row",{"$f":"dms_FRCP_start_row+(dms_FRCPlength_Num-1)","v":41},"=dms_FRCP_start_row+(dms_FRCPlength_Num-1)","Uses the value in dms_FRCPlength_Num-1"]
[null,"FRCP_start_year",{"$f":"INDEX(INDIRECT(dms_RPT),dms_FRCP_start_row)","v":"2023-24"},"=INDEX(INDIRECT(dms_RPT),dms_FRCP_start_row)","Converts the FRCP start row to display the year"]
[null,"CRCP_start_year",{"$f":"INDEX(INDIRECT(dms_RPT),dms_CRCP_start_row)","v":"2018-19"},"=INDEX(INDIRECT(dms_RPT),dms_CRCP_start_row)","Converts the CRCP start row to display the year"]
[null,"PRCP_start_year",{"$f":"INDEX(INDIRECT(dms_RPT),dms_PRCP_start_row)","v":"2013-14"},"=INDEX(INDIRECT(dms_RPT),dms_PRCP_start_row)","Converts the PRCP start row to display the year"]
[null,"FRCP_final_year",{"$f":"INDEX(INDIRECT(dms_RPT),dms_FRCP_start_row+dms_FRCPlength_Num-1)","v":"2027-28"},"=INDEX(INDIRECT(dms_RPT),dms_FRCP_start_row+dms_FRCPlength_Num-1)","Finds the FRCP final year"]
[null,"CRCP_final_year",{"$f":"INDEX(INDIRECT(dms_RPT),dms_CRCP_start_row+dms_CRCPlength_Num-1)","v":"2022-23"},"=INDEX(INDIRECT(dms_RPT),dms_CRCP_start_row+dms_CRCPlength_Num-1)","Finds the CRCP final year"]
[null,"PRCP_final_year",{"$f":"INDEX(INDIRECT(dms_RPT),dms_PRCP_start_row+dms_FRCPlength_Num-1)","v":"2017-18"},"=INDEX(INDIRECT(dms_RPT),dms_PRCP_start_row+dms_FRCPlength_Num-1)","Finds the PRCP final year"]
[null,"dms_Reset_final_year",{"$f":"INDEX(INDIRECT(dms_RPT),dms_RYE_start_row)","v":"2027-28"},"=INDEX(INDIRECT(dms_RPT),dms_RYE_start_row)","For Resets and PTRM/RFMs (same as FRCP_final_year)"]
[null,"dms_SpecifiedYear_final_year",{"$f":"FRY","v":"2027-28"},"=FRY","FRY from cover sheet"]
[null,"dms_DollarReal_year",{"$f":"LEFT(CRCP_final_year,2)&RIGHT(CRCP_final_year,2)","v":"2023"},"=LEFT(CRCP_final_year,2)&RIGHT(CRCP_final_year,2)","Uses the value in CRCP_final_year"]
[null,"dms_Previous_DollarReal_year",{"$f":"LEFT(PRCP_final_year,2)&RIGHT(PRCP_final_year,2)","v":"2018"},"=LEFT(PRCP_final_year,2)&RIGHT(PRCP_final_year,2)","Uses the value in PRCP_final_year"]
[null,"dms_CRY_RYE",{"$f":"IFERROR(LEFT(CRY,2)&RIGHT(CRY,2),0)","v":0},"=IFERROR(LEFT(CRY,2)&RIGHT(CRY,2),0)","For ABC single year RINS"]
[null,"dms_Reset_RYE",{"$f":"IF(dms_Model_Span>1,IF(dms_Model=\"RFM\",(LEFT(dms_DollarReal_year,2)&RIGHT(dms_DollarReal_year,2)),(LEFT(dms_Reset_final_year,2)&RIGHT(dms_Reset_final_year,2))),0)","v":"2028"},"=IF(dms_Model_Span>1,IF(dms_Model=\"RFM\",(LEFT(dms_DollarReal_year,2)&RIGHT(dms_DollarReal_year,2)),(LEFT(dms_Reset_final_year,2)&RIGHT(dms_Reset_final_year,2))),0)","If model span > 1 then uses dms_Reset_RYE otherwise it's a multi year ABC and uses dms_Specified_RYE"]
[null,"dms_Specified_RYE",{"$f":"IF(dms_MultiYear_ResponseFlag=\"Yes\",(LEFT(dms_Specified_FinalYear,2)&RIGHT(dms_Specified_FinalYear,2)),0)","v":0},"=IF(dms_MultiYear_ResponseFlag=\"Yes\",(LEFT(dms_Specified_FinalYear,2)&RIGHT(dms_Specified_FinalYear,2)),0)","If multi year ABC - uses dms_Specified_FinalYear"]
[null,"dms_Model_Span",{"$f":"INDEX(dms_Model_Span_List,MATCH(dms_Model,dms_Model_List))","v":5},"=INDEX(dms_Model_Span_List,MATCH(dms_Model,dms_Model_List))","A result of 5 is used to signify that it is more than 1 year span"]
[null,"dms_RYE_result",{"$f":"IF(dms_MultiYear_ResponseFlag=\"yes\",dms_Specified_RYE,(IF(dms_Model_Span>1,dms_Reset_RYE,dms_CRY_RYE)))","v":"2028"},"=IF(dms_MultiYear_ResponseFlag=\"yes\",dms_Specified_RYE,(IF(dms_Model_Span>1,dms_Reset_RYE,dms_CRY_RYE)))","Nested IF - feeds into dms_RYE"]
[null,"dms_Reset_Span",{"$f":"IF(dms_Reset_RYE>0,CONCATENATE(FRCP_y1,\" to \",FRCP_final_year),0)","v":"2023-24 to 2027-28"},"=IF(dms_Reset_RYE>0,CONCATENATE(FRCP_y1,\" to \",FRCP_final_year),0)","Reset span of years as text"]
[null,"dms_SpecifiedYear_Span",{"$f":"IF(dms_Specified_RYE>0,CONCATENATE(CRY,\" to \",dms_Specified_FinalYear),0)","v":0},"=IF(dms_Specified_RYE>0,CONCATENATE(CRY,\" to \",dms_Specified_FinalYear),0)","Multi year ABC span of years as text"]
[null,"dms_Header_Span",{"$f":"IF(dms_MultiYear_Flag=1,dms_SpecifiedYear_Span,IF(dms_Model_Span>1,dms_y1&\" to \"&FRCP_final_year,CRY))","v":"2021-22 to 2027-28"},"=IF(dms_MultiYear_Flag=1,dms_SpecifiedYear_Span,IF(dms_Model_Span>1,dms_Reset_Span,CRY))","NESTED IF - for Sheet Headers"]
[null,"ABC RINS THAT SPAN MULTIPLE YEARS"]
[null,"This is a multi year ABC RIN?","No"]
[null,null,{"$f":"IF(dms_MultiYear_ResponseFlag=\"No\",0,1)","v":0},"dms_MultiYear_Flag","This is set from the answer provided above"]
[null,null,{"$f":"IF(dms_MultiYear_Flag=1,FRY,\"not a Multiple year submission\")","v":"not a Multiple year submission"},"dms_Specified_FinalYear","The result here is returned to dms_CRCP_FinalYear_Result if response to Q in C73 is \"yes\" and dms_MultiYear_Flag is set to 1"]
[null," Start year for 5.2 in Multi year ABC RINS",{"$f":"IFERROR(IF(dms_MultiYear_Flag=1,FRY,CRY),\"not an ABC\")","v":"not an ABC"},"dms_0502_Inst_Year","=IF(dms_MultiYear_Flag=1,FRY,CRY)",null,"For single year RINS this is CRY - multi year RINS need to start a the end of the span of years (ie. FRY)"]
[null,"WHAT IS THE RYE?"]
[null,"Reg Period Lengths"]
[null,"PRCP length in years",{"$f":"INDEX(dms_PRCPlength_List,MATCH(dms_TradingName,dms_TradingName_List))","v":5},"dms_PRCPlength_Num","=INDEX(dms_PRCPlength_List,MATCH(dms_TradingName,dms_TradingName_List))"]
[null,"CRCP length in years",{"$f":"INDEX(dms_CRCPlength_List,MATCH(dms_TradingName,dms_TradingName_List))","v":5},"dms_CRCPlength_Num","=INDEX(dms_CRCPlength_List,MATCH(dms_TradingName,dms_TradingName_List))"]
[null,"FRCP length in years",{"$f":"INDEX(dms_FRCPlength_List,MATCH(dms_TradingName,dms_TradingName_List))","v":5},"dms_FRCPlength_Num","=INDEX(dms_FRCPlength_List,MATCH(dms_TradingName,dms_TradingName_List))"]
[null,"Single year RIN?"]
[null,"Single Year ABC RIN ?",{"$f":"IF(dms_Model=\"EB\",1,0)","v":0},"dms_EB"]
[null,null,{"$f":"IF(dms_Model=\"CA\",1,0)","v":0},"dms_CA","=dms_SingleYear_Model"]
[null,null,{"$f":"IF(dms_Model=\"ARR\",1,0)","v":0},"dms_ARR"]
[null,"Is this a single Year ABC RIN?",{"$f":"IF(SUM(dms_SingleYear_Model)=1,\"yes\",\"no\")","v":"no"},"dms_SingleYearModel","=IF(SUM(dms_SingleYear_Model)=1,\"yes\",\"no\")"]
[null,"Single Year Final Year Result",{"$f":"IF(AND(dms_SingleYearModel=\"yes\",dms_MultiYear_Flag=0),CRY,0)","v":0},"dms_SingleYear_FinalYear_Result","=IFERROR(IF(SUM(dms_SingleYear_Model)<>0,(INDIRECT(dms_SingleYear_FinalYear_Ref)),\"not a single year RIN\"),\"CRY not present\")"]
[null,"Multi year RIN?"]
[]
[null,"Multi Year Reset/Model?",{"$f":"IF(dms_Model_Span>1,\"yes\",\"no\")","v":"yes"}]
[null,"Final year result for Reset/Model",{"$f":"IF(dms_Model_Span>1,dms_Reset_final_year,0)","v":"2027-28"},"dms_MultiYear_FinalYear_Result","dms_CRCP_FinalYear_Result"]
[]
[null,"Multi Year ABC RIN?",{"$f":"IF(dms_MultiYear_Flag=1,\"yes\",\"no\")","v":"no"},"dms_MultiYear_ABC_RIN"]
[null,"Final year result for ABC multi year",{"$f":"IF(dms_MultiYear_Flag=1,C50,0)","v":0}]
[]
[null,"EB RINS"]
[null,"Calendar Year for table 3.6 data",{"$f":"IFERROR(IF(dms_Segment=\"Transmission\",dms_Cal_Year_B4_CRY,CRY),\"CRY not present\")","v":"CRY not present"},"dms_0306_Year","=IF(dms_Segment=\"Transmission\",dms_Cal_Year_B4_CRY,CRY)"]
[null,"CA RINS"]
[null,"Find how many rows in tables 6.3 sustained interruptions?",null,null,"dms_060301_MaxRows only returns a valid value when cover sheet is attached to a CA file"]
[null,null,{"$f":"IF(dms_Model<>\"CA\",\"not a CA\",\"Is a CA\")","v":"not a CA"},null,"=IF(dms_Model<>\"CA\",\"not a CA\",\"Is a CA\")"]
[null,"dms_060301_Avg_Duration_Sustained_Int_Values present?",{"$f":"IFERROR(IF(INDEX(dms_060301_Avg_Duration_Sustained_Int_Values,1,1)<>\"\",\"yes\",\"no\"),\"no\")","v":"no"},"dms_060301_checkvalue","=IFERROR(IF(INDEX(dms_060301_Avg_Duration_Sustained_Int_Values,1,1)<>\"\",\"yes\",\"no\"),\"no\")"]
[null,null,{"$f":"IF(AND(dms_Model=\"CA\",(dms_060301_checkvalue=\"no\")),\"error - NR not present\",\"no errors\")","v":"no errors"},null,"=IF(AND(dms_Model=\"CA\",(dms_060301_checkvalue=\"no\")),\"error - NR not present\",\"no errors\")"]
[null,"Table 6.3.1 - last row reference",{"$f":"IFERROR(IF(dms_Model=\"CA\",LOOKUP(2,1/(dms_060301_Avg_Duration_Sustained_Int_Values<>\"\"),(ROW(dms_060301_Avg_Duration_Sustained_Int_Values))),\"not a CA\"),\"6.3 not present\")","v":"not a CA"},"dms_060301_LastRow","=IFERROR(IF(dms_Model=\"CA\",LOOKUP(2,1/(dms_060301_Avg_Duration_Sustained_Int_Values<>\"\"),(ROW(dms_060301_Avg_Duration_Sustained_Int_Values))),\"not a CA\"),\"6.3 not present\")"]
[null,"Table 6.3.1 - max number rows",{"$f":"IFERROR(IF(dms_Model=\"CA\",(dms_060301_LastRow-15),\"not a CA\"),\"error\")","v":"not a CA"},"dms_060301_MaxRows","=IFERROR(IF(dms_Model=\"CA\",(dms_060301_LastRow-15),\"not a CA\"),\"error\")"]
[null,"Table 6.6.3 - Public lighting repair - no. business days",{"$f":"INDEX(dms_663_List,MATCH(dms_TradingName,dms_TradingName_List))","v":"-"},"dms_663","=INDEX(dms_663_List,MATCH(dms_TradingName,dms_TradingName_List))"]
[null,"ARR or RESET RINS"]
[null,"How many rows in tables 6.1 or 6.7?  (leap year?)","insert dms_LeapYear NR if required",null,"'dms_LeapYear is used to determine dms_060701_Max_Rows BUT it is only found on worksheet 6.1 or 6.7 and the date value in the cell is used to determine whether it is a leap year"]
[null,"Is dms_LeapYear named range present?",{"$f":"IFERROR(IF(dms_LeapYear,\"yes\"),\"no\")","v":"no"}]
[null,"Table 6.7.1 - includes a leap year?",{"$f":"\nIFERROR(IF(MONTH(DATE(YEAR(dms_LeapYear),2,29))=2,\"is a leap year\",\"not a leap year\"),\n\"dms_LeapYear not present\")","v":"dms_LeapYear not present"},"dms_LeapYear_Result","=IFERROR(IF(MONTH(DATE(YEAR(dms_LeapYear),2,29))=2,\"is a leap year\",\"not a leap year\"),\"dms_LeapYear not present\")"]
[null,"MaxRows if Reset and leap year",{"$f":"IF(dms_LeapYear_Result=\"is a leap year\",1827,1826)","v":1826},"dms_060701_Reset_MaxRows","=IF(dms_LeapYear_Result=\"is a leap year\",1827,1826)",null,null,"number of days present in Reset RIN table"]
[null,"MaxRows if ARR and leap year",{"$f":"IF(dms_LeapYear_Result=\"is a leap year\",366,365)","v":365},"dms_060701_ARR_MaxRows","=IF(dms_LeapYear_Result=\"is a leap year\",366,365)",null,null,"number of days present in ARR RIN table"]
[null,"Table 6.7.1 - Max Rows (leap year/ non leap year)",{"$f":"IF(dms_Model=\"ARR\",dms_060701_ARR_MaxRows,IF(dms_Model=\"Reset\",dms_060701_Reset_MaxRows,\"not a relevant RIN type\"))","v":1826},"dms_060701_MaxRows","=IF(dms_Model=\"ARR\",dms_060701_ARR_MaxRows,IF(dms_Model=\"Reset\",dms_060701_Reset_MaxRows,\"not a relevant RIN type\"))"]
[null,"How many columns in 6.7?   (4 or 5 feeder categories)",{"$f":"IF(dms_FifthFeeder_flag_NSP=\"NO\",\"This NSP has only 4 feeder categories\",\"This NSP has 5 feeder categories\")","v":"This NSP has only 4 feeder categories"}]
[null,"Table 6.7.1 - Last column (# of feeder categories > 4)",{"$f":"IF(dms_FifthFeeder_flag_NSP=\"NO\",10,12)","v":10},"dms_060701_MaxCols","=IF(dms_FifthFeeder_flag_NSP=\"NO\",8,10)"]
[null,"Table 6.7.1 - Number of offset rows",{"$f":"IF(dms_Model=\"ARR\",15,9)","v":9},"dms_060701_OffsetRows","=IF(dms_Model=\"ARR\",15,9)"]
[null,"Start date for telephone answering in 6.1 or 6.7?",null,null,"Using 060101 as naming standard not 060701 for start dates"]
[null,"Table 6.1.1 and 6.7.1 - Start Date as Text",{"$f":"IF(dms_SingleYearModel=\"yes\",(CONCATENATE(IF(LEN(CRY)=4,\"1-Jan-\",\"1-Jul-\"),LEFT(CRY,4))),(CONCATENATE(IF(LEN(PRCP_y4)=4,\"1-Jan-\",\"1-Jul-\"),LEFT(PRCP_y4,4))))","v":"1-Jul-2016"},"dms_060101_StartDateTxt","=IF(SUM(dms_SingleYear_Model)>1,(CONCATENATE(IF(LEN(CRY)=4,\"1-Jan-\",\"1-Jul-\"),LEFT(CRY,4))),(CONCATENATE(IF(LEN(CRCP_y4)=4,\"1-Jan-\",\"1-Jul-\"),LEFT(CRCP_y4,4))))"]
[null,"Table 6.1.1 and 6.7.1 - Start Date as Date Value",{"$f":"DATEVALUE(dms_060701_StartDateTxt)","v":42552},"dms_060101_StartDateVal","=DATEVALUE(dms_060701_StartDateTxt)"]
[null,"ARRs"]
[null,"How many rows in table 6.8?","insert dms_060801_StartCell NR if required",null,"dms_060801_StartCell is only found on worksheet 6.8 and is used to determine the starting date for the date range"]
[null,"Is dms_060801_StartCell named range present?",{"$f":"IFERROR(IF((ROW(dms_060801_StartCell)-1)=1,\"yes\",\"yes\"),\"no\")","v":"no"},"Must be present for ARRs","=IFERROR(IF((ROW(dms_060801_StartCell)-1)=1,\"yes\",\"yes\"),\"no\")"]
[null,"Table 6.8 - Number of offset rows",12,"dms_0608_OffsetRows","=IFERROR(IF(dms_Model=\"ARR\",(ROW(dms_060801_StartCell)-1),\"not an ARR\"),\"6.8 error\")"]
[null,"Table 6.8 - Last row",{"$f":"IFERROR(IF(dms_060801_StartCell<>\"\",IF(dms_Model=\"ARR\",(LOOKUP(2,1/(dms_060801_01_Values<>\"\"),(ROW(dms_060801_01_Values)))),\"not an ARR\"),0),\"0\")","v":"0"},"dms_0608_LastRow","=IFERROR(IF(dms_060801_StartCell<>\"\",IF(dms_Model=\"ARR\",(LOOKUP(2,1/(dms_060801_01_Values<>\"\"),(ROW(dms_060801_01_Values)))),\"not an ARR\"),0),\"0\")"]
[null,"Table 6.8 - MaxRows",{"$f":"IFERROR(IF(dms_Model=\"ARR\",(MAX(0,dms_0608_LastRow-dms_0608_OffsetRows)),\"not an ARR\"),\"0\")","v":"not an ARR"},"dms_060801_MaxRows","=IFERROR(IF(dms_Model=\"ARR\",(MAX(0,dms_0608_LastRow-dms_0608_OffsetRows)),\"not an ARR\"),\"0\")"]
[null,"TNSP RESET RINS"]
[null,"Table 7.9.4 only appears in TNSPs Reset RIN"]
[null,"Table 7.9.4 - first year",{"$f":"LEFT(PRCP_y3,4)","v":"2015"},"dms_070904_Start_Year","=LEFT(PRCP_y3,4)"]
[]
[null,"MISC"]
[null,"Distribution Determination Reference",{"$f":"INDEX(dms_DeterminationRef_List,MATCH(dms_TradingName,dms_TradingName_List))","v":"-"},"dms_DeterminationRef"]
[null,"Public lighting NSP?",{"$f":"INDEX(dms_Public_Lighting_List,MATCH(dms_TradingName,dms_TradingName_List))","v":"NO"},"dms_Public_Lighting","=INDEX(dms_Public_Lighting_List,MATCH(dms_TradingName,dms_TradingName_List))"]
[null,"CBD Feeder for this business",{"$f":"INDEX(dms_CBD_flag,MATCH(dms_TradingName,dms_TradingName_List))","v":"NO"},"dms_CBD_flag_NSP"]
[null,"Urban Feeder for this business",{"$f":"INDEX(dms_Urban_flag,MATCH(dms_TradingName,dms_TradingName_List))","v":"NO"},"dms_Urban_flag_NSP"]
[null,"Short rural Feeder for this business",{"$f":"INDEX(dms_ShortRural_flag,MATCH(dms_TradingName,dms_TradingName_List))","v":"NO"},"dms_ShortRural_flag_NSP"]
[null,"Long rural Feeder for this business",{"$f":"INDEX(dms_LongRural_flag,MATCH(dms_TradingName,dms_TradingName_List))","v":"NO"},"dms_LongRural_flag_NSP"]
[null,"Fifth Feeder Category (eg. TasNetworks (D))",{"$f":"INDEX(dms_FeederType_5_flag,MATCH(dms_TradingName,dms_TradingName_List))","v":"NO"},"dms_FifthFeeder_flag_NSP","=INDEX(dms_FeederType_5_flag,MATCH(dms_TradingName,dms_TradingName_List))"]
[]
[null,"DISCARD FILES"]
[null,"discard this record?","NO","dms_DISCARD","If record is to be discarded from DB set this flag to YES"]
[]
[null,"SUBSET FILES"]
[null,"Is this Submission File a Subset File","NO","dms_Partial"]
[]
[]
[null,"REGULATORY YEARS FOR MULTI RYE SUBMISSIONS"]
[null,"Multiple RYE flag","NO","dms_Multi_RYE_flag"]
[null,null,"Manually specify RYE","Named ranges to apply"]
[null,null,2013,"dms_RYE_01"]
[null,null,2014,"dms_RYE_02"]
[null,null,2015,"dms_RYE_03"]
[null,null,2016,"dms_RYE_04"]
[null,null,2017,"dms_RYE_05"]
[null,null,2018,"dms_RYE_06"]
[null,null,2019,"dms_RYE_07"]
[null,null,2020,"dms_RYE_08"]
[null,null,2021,"dms_RYE_09"]

{"sheet":"Instructions","index":4,"n_rows":27,"n_cols":4,"rows_kept":27,"cut":false,"hidden":false,"merged":[[7,1,8,1],[7,2,7,3],[8,2,8,4],[1,1,1,4],[2,1,2,4],[3,1,3,4],[4,1,4,4],[5,2,5,4],[18,1,24,1],[18,2,18,4],[26,2,26,4],[10,2,10,4],[12,1,14,1],[12,2,12,4],[13,2,13,3],[14,2,14,4],[16,2,16,4]]}
[]
[null,{"$f":"CONCATENATE(dms_Sector,\" \",dms_Segment,\" \", \"Pipeline Service Provider\")","v":"Gas Distribution Pipeline Service Provider"}]
[null,{"$f":"IF(dms_Model=\"Reset\",\"Regulatory Proposal RIN Template\",\"Annual Reporting RIN\")","v":"Regulatory Proposal RIN Template"}]
[]
[null,"INSTRUCTIONS"]
[null,"GENERAL","Complete the Business & other details worksheet before entering data or values in any other worksheets. The Business & other details worksheet is linked to other worksheets within the workbook and automatically generates certain column headings and conditional formatting."]
[]
[null,"CONFIDENTIAL INFORMATION","\nPlease use the macro at the top of each \nworksheet to identify confidential information\nin the confidential workbook. \n\n"]
[null,null,"-Do this by selecting the cell or cells that contain confidential information and then run the Mark selection as CONFIDENTIAL macro. This will format the cells a specific colour that is identified by the AER's database which in turn marks that information as confidential.\n\n-To reverse this, select the cell or cells and run the Return selection to NON-CONFIDENTIAL macro."]
[]
[null,"RESPONSES","\nPlease return two (2) files to the AER: \n\n1. A confidential version which must contain a complete set of all responses with confidential information marked using the Mark selection CONFIDENTIAL macro and which has been completed using the locked template file provided by the AER. \n\n2. A public version with confidential information either removed completely or aggregated in some form together with writtten consent to disclose the public version of the response.\n\nUse the drop down box on the Business and other details worksheet to identify the file as either confidential ('consolidated') or public. "]
[]
[null,"AMENDMENTS","\nIf an NSP wishes to correct data previously submitted to the AER it should resubmit that data using the original completed submission as the starting point. Please make any necessary changes to the data. Data that is not being amended should be left unchanged. \n\nNSPs must identify the reason for the amendments in the Amendment Reason box on the  Business and other details worksheet. NSPs may provide further details regarding any amendments in the Amendments worksheet. \n\n."]
[null,null,"NSP may use Amended Data macro \nto highlight cells that contain amended data.\nNB: if data is also CONFIDENTIAL, re-apply \nthe Confidentiality macro after applying the \nAmended macro"]
[null,null,"Please resubmit two (2) files - a confidential version and a public version of the amended submission to the AER"]
[]
[null,"UNITS OF MEASURE","\nAll amounts are to be unrounded and reported on a one for one basis: that is 1000 is to be entered as '1000'. Applicable units of measure may be identified in the table column headings or row descriptors.\n\n"]
[]
[null,"INPUT / NON-INPUT CELLS"]
[null,null,null,"Yellow = Input cell (mandatory)"]
[null,null,null,"Darker yellow = input cell (mandatory)"]
[null,null,null,"Orange = input cell (if data available)"]
[null,null,null,"Grey = Not applicable/No inputs required"]
[null,null,null," \nPLEASE DO NOT ENTER TEXT into cells that are to contain numeric data."]
[]
[]
[null,"NAVIGATION","\nMany tables in the worksheets have been \"grouped\" to allow for easy navigation. To ungroup or group data use the outline symbols in the left margin (for Row groupings) or above the columns (for column groupings). \n\n\n\n"]

{"sheet":"CONTENTS","index":5,"n_rows":37,"n_cols":4,"rows_kept":37,"cut":false,"hidden":false,"merged":[]}
[null,{"$f":"INDEX(dms_Worksheet_List,MATCH(dms_Model,dms_Model_List))","v":"REGULATORY REPORTING STATEMENT"}]
[null,{"$f":"dms_TradingName","v":"AusNet (Gas)"}]
[null,{"$f":"dms_Header_Span","v":"2021-22 to 2027-28"}]
[]
[]
[]
[null,null,"CONTENTS"]
[]
[null,null,"TEMPLATE DATE","FINAL RIN MARCH 2022"]
[]
[null,null,"SUBMISSION","Business & other details"]
[]
[null,null,"EXPENDITURE","E1. Expenditure Summary"]
[null,null,null,"E2. Mains Repex"]
[null,null,null,"E3. Mains Augex"]
[null,null,null,"E4. Meter replacement"]
[null,null,null,"E5. New Connections"]
[null,null,null,"E6. Non-network"]
[null,null,null,"E10. Overheads"]
[null,null,null,"E12. ICT"]
[null,null,null,"E13. Other capex"]
[null,null,null,"E17. Step changes"]
[null,null,null,"E20. Opex"]
[null,null,null,"E21. ARS"]
[null,null,null,"E25. Escalators"]
[]
[null,null,"NETWORK","N1. Demand"]
[null,null,null,"N2. Network characteristcs"]
[]
[null,null,"SERVICE","S1.1. Customer numbers - by customer type"]
[null,null,null,"S1.2. Customer numbers - by tariff"]
[null,null,null,"S10. Supply Quality"]
[null,null,null,"S11. Network reliability"]
[]
[null,null,"FINANCIAL","F3. Revenue"]
[]
[null,null,"ADMIN","Additional disclosures"]

{"sheet":"Business & other details","index":6,"n_rows":76,"n_cols":79,"rows_kept":76,"cut":false,"hidden":false,"merged":[[0,7,2,15],[3,21,3,57],[6,21,6,75],[8,16,8,93],[15,21,15,35],[15,37,15,58],[16,21,16,35],[16,37,16,48],[22,21,22,35],[22,37,22,58],[22,60,22,66],[22,68,22,89],[23,21,23,35],[23,37,23,58],[23,60,23,66],[23,68,23,89],[24,21,24,35],[24,37,24,51],[24,60,24,66],[24,68,24,82],[25,21,25,35],[25,37,25,40],[25,49,25,51],[25,60,25,66],[25,68,25,71],[25,80,25,82],[31,21,31,35],[31,37,31,58],[31,60,31,66],[31,68,31,89],[32,21,32,35],[32,37,32,58],[32,60,32,66],[32,68,32,89],[33,21,33,35],[33,37,33,58],[33,60,33,66],[33,68,33,89],[41,25,41,34],[41,37,41,44],[41,46,41,53],[41,55,41,62],[41,64,41,71],[41,73,41,80],[42,37,42,44],[42,46,42,53],[42,55,42,62],[42,64,42,71],[42,73,42,80],[43,37,43,44],[43,46,43,53],[43,55,43,62],[43,64,43,71],[43,73,43,80],[47,25,47,34],[47,37,47,44],[47,46,47,53],[47,55,47,62],[47,64,47,71],[47,73,47,80],[45,25,45,34],[48,37,48,44],[48,46,48,53],[48,55,48,62],[48,64,48,71],[48,73,48,80],[49,37,49,44],[49,46,49,53],[49,55,49,62],[49,64,49,71],[49,73,49,80],[51,25,51,34],[51,37,51,44],[51,46,51,53],[51,55,51,62],[51,64,51,71],[51,73,51,80],[52,37,52,44],[52,46,52,53],[52,55,52,62],[52,64,52,71],[52,73,52,80],[53,37,53,44],[53,46,53,53],[53,55,53,62],[53,64,53,71],[53,73,53,80],[55,25,55,34],[55,37,55,44],[57,25,57,34],[57,37,57,44],[63,25,63,34],[63,37,63,52],[71,25,73,34],[71,37,73,81],[75,25,75,34],[75,37,75,52],[65,25,65,34],[65,37,65,52],[67,25,67,34],[67,37,67,52],[69,25,69,34],[69,37,69,52]]}
[null,null,null,null,null,null,null,null,null,null,null,null,null,null,null,null,null,null,null,null,null,{"$f":"INDEX(dms_Worksheet_List,MATCH(dms_Model,dms_Model_List))","v":"REGULATORY REPORTING STATEMENT"}]
[null,null,null,null,null,null,null,null,null,null,null,null,null,null,null,null,null,null,null,null,null,{"$f":"dms_TradingName","v":"AusNet (Gas)"}]
[null,null,null,null,null,null,null,null,null,null,null,null,null,null,null,null,null,null,null,null,null,{"$f":"dms_Header_Span","v":"2021-22 to 2027-28"}]
[null,null,null,null,null,null,null,null,null,null,null,null,null,null,null,null,null,null,null,null,null,"BUSINESS & OTHER DETAILS"]
[]
[null,null,null,null,null,null,null,null,null,null,null,null,null,null,null,null,null,null,null,null,null,"INSTRUCTIONS"]
[null,null,null,null,null,null,null,null,null,null,null,null,null,null,null,null,null,null,null,null,null,"Complete the following business details regulatory template before entering data or values in any other regulatory template. This regulatory template is linked to other cells within the spreadsheet and automatically generates column headings and conditional formatting to distinguish business specific input and non-input cells. "]
[]
[null,null,null,null,null,null,null,null,null,null,null,null,null,null,null,null,"SUBMISSION PARTICULARS INPUT SHEET"]
[]
[]
[null,null,null,null,null,null,null,null,null,null,null,null,null,null,null,null,null,null,null,null,null,"ENTITY DETAILS"]
[]
[null,null,null,null,null,null,null,null,null,null,null,null,null,null,null,null,null,null,null,null,null,"Business Name"]
[]
[null,null,null,null,null,null,null,null,null,null,null,null,null,null,null,null,null,null,null,null,null,"Short name",null,null,null,null,null,null,null,null,null,null,null,null,null,null,null,"AusNet (Gas)"]
[null,null,null,null,null,null,null,null,null,null,null,null,null,null,null,null,null,null,null,null,null,"ACN/ABN",null,null,null,null,null,null,null,null,null,null,null,null,null,null,null,{"$f":"INDEX(dms_ABN_List,MATCH(dms_TradingName,dms_TradingName_List))","v":"086015036"}]
[]
[]
[]
[null,null,null,null,null,null,null,null,null,null,null,null,null,null,null,null,null,null,null,null,null,"Business Address",null,null,null,null,null,null,null,null,null,null,null,null,null,null,null,null,null,null,null,null,null,null,null,null,null,null,null,null,null,null,null,null,null,null,null,null,null,null,null,null,null,null,null,null,null,null,"Postal Address"]
[]
[null,null,null,null,null,null,null,null,null,null,null,null,null,null,null,null,null,null,null,null,null,"Address 1",null,null,null,null,null,null,null,null,null,null,null,null,null,null,null,{"$f":"INDEX(dms_Addr1_List,MATCH(dms_TradingName,dms_TradingName_List))","v":"Level 31"},null,null,null,null,null,null,null,null,null,null,null,null,null,null,null,null,null,null,null,null,null,null,"Address 1"]
[null,null,null,null,null,null,null,null,null,null,null,null,null,null,null,null,null,null,null,null,null,"Address 2",null,null,null,null,null,null,null,null,null,null,null,null,null,null,null,{"$f":"IF(ISBLANK(INDEX(dms_Addr2_List,MATCH(dms_TradingName,dms_TradingName_List))),\"\",(INDEX(dms_Addr2_List,MATCH(dms_TradingName,dms_TradingName_List))))","v":"2 Southbank Boulevard"},null,null,null,null,null,null,null,null,null,null,null,null,null,null,null,null,null,null,null,null,null,null,"Address 2"]
[null,null,null,null,null,null,null,null,null,null,null,null,null,null,null,null,null,null,null,null,null,"Suburb",null,null,null,null,null,null,null,null,null,null,null,null,null,null,null,{"$f":"INDEX(dms_Suburb_List,MATCH(dms_TradingName,dms_TradingName_List))","v":"SOUTHBANK"},null,null,null,null,null,null,null,null,null,null,null,null,null,null,null,null,null,null,null,null,null,null,"Suburb"]
[null,null,null,null,null,null,null,null,null,null,null,null,null,null,null,null,null,null,null,null,null,"State",null,null,null,null,null,null,null,null,null,null,null,null,null,null,null,{"$f":"INDEX(dms_State_List,MATCH(dms_TradingName,dms_TradingName_List))","v":"Vic"},null,null,null,null,null,null,null,null,null,"Post code",null,{"$f":"INDEX(dms_PostCode_List,MATCH(dms_TradingName,dms_TradingName_List))","v":3008},null,null,null,null,null,null,null,null,null,null,"State",null,null,null,null,null,null,null,{"$f":"INDEX(dms_PState_List,MATCH(dms_TradingName,dms_TradingName_List))","v":"Vic"},null,null,null,null,null,null,null,null,null,"Post code"]
[]
[null,null,null,null,null,null,null,null,null,null,null,null,null,null,null,null,null,null,null,null,null,null,null,null,null,null,null,null,null,null,null,null,null,null,null,null,null,null,null,null,null,null,null,null,null,null,null,null,null,null,null,null,"`"]
[]
[null,null,null,null,null,null,null,null,null,null,null,null,null,null,null,null,null,null,null,null,null,"Contact Names"]
[]
[null,null,null,null,null,null,null,null,null,null,null,null,null,null,null,null,null,null,null,null,null,"Name",null,null,null,null,null,null,null,null,null,null,null,null,null,null,null,null,null,null,null,null,null,null,null,null,null,null,null,null,null,null,null,null,null,null,null,null,null,null,"Name"]
[null,null,null,null,null,null,null,null,null,null,null,null,null,null,null,null,null,null,null,null,null,"Phone",null,null,null,null,null,null,null,null,null,null,null,null,null,null,null,null,null,null,null,null,null,null,null,null,null,null,null,null,null,null,null,null,null,null,null,null,null,null,"Phone"]
[null,null,null,null,null,null,null,null,null,null,null,null,null,null,null,null,null,null,null,null,null,"Email",null,null,null,null,null,null,null,null,null,null,null,null,null,null,null,null,null,null,null,null,null,null,null,null,null,null,null,null,null,null,null,null,null,null,null,null,null,null,"Email"]
[]
[]
[]
[]
[null,null,null,null,null,null,null,null,null,null,null,null,null,null,null,null,"REGULATORY CONTROL PERIODS"]
[]
[]
[null,null,null,null,null,null,null,null,null,null,null,null,null,null,null,null,null,null,null,null,null,null,null,null,null,"Forthcoming period",null,null,null,null,null,null,null,null,null,null,null,"2023-24",null,null,null,null,null,null,null,null,{"$f":"FRCP_y2","v":"2024-25"},null,null,null,null,null,null,null,null,{"$f":"FRCP_y3","v":"2025-26"},null,null,null,null,null,null,null,null,{"$f":"FRCP_y4","v":"2026-27"},null,null,null,null,null,null,null,null,{"$f":"FRCP_y5","v":"2027-28"}]
[null,null,null,null,null,null,null,null,null,null,null,null,null,null,null,null,null,null,null,null,null,null,null,null,null,null,null,null,null,null,null,null,null,null,null,null,null,{"$f":"FRCP_y6","v":"2028-29"},null,null,null,null,null,null,null,null,{"$f":"FRCP_y7","v":"2029-30"},null,null,null,null,null,null,null,null,{"$f":"FRCP_y8","v":"2030-31"},null,null,null,null,null,null,null,null,{"$f":"FRCP_y9","v":"2031-32"},null,null,null,null,null,null,null,null,{"$f":"FRCP_y10","v":"2032-33"}]
[null,null,null,null,null,null,null,null,null,null,null,null,null,null,null,null,null,null,null,null,null,null,null,null,null,null,null,null,null,null,null,null,null,null,null,null,null,{"$f":"FRCP_y11","v":"2033-34"},null,null,null,null,null,null,null,null,{"$f":"FRCP_y12","v":"2034-35"},null,null,null,null,null,null,null,null,{"$f":"FRCP_y13","v":"2035-36"},null,null,null,null,null,null,null,null,{"$f":"FRCP_y14","v":"2036-37"},null,null,null,null,null,null,null,null,{"$f":"FRCP_y15","v":{"$error":"#NAME?"}}]
[]
[null,null,null,null,null,null,null,null,null,null,null,null,null,null,null,null,null,null,null,null,null,null,null,null,null,"Transitional period",null,null,null,null,null,null,null,null,null,null,null,"1 January 2023 to 30 June 2023"]
[]
[null,null,null,null,null,null,null,null,null,null,null,null,null,null,null,null,null,null,null,null,null,null,null,"RESETS",null,"Current period",null,null,null,null,null,null,null,null,null,null,null,2018,null,null,null,null,null,null,null,null,2019,null,null,null,null,null,null,null,null,2020,null,null,null,null,null,null,null,null,2021,null,null,null,null,null,null,null,null,2022]
[null,null,null,null,null,null,null,null,null,null,null,null,null,null,null,null,null,null,null,null,null,null,null,null,null,null,null,null,null,null,null,null,null,null,null,null,null,{"$f":"CRCP_y6","v":"2023-24"},null,null,null,null,null,null,null,null,{"$f":"CRCP_y7","v":"2024-25"},null,null,null,null,null,null,null,null,{"$f":"CRCP_y8","v":"2025-26"},null,null,null,null,null,null,null,null,{"$f":"CRCP_y9","v":"2026-27"},null,null,null,null,null,null,null,null,{"$f":"CRCP_y10","v":"2027-28"}]
[null,null,null,null,null,null,null,null,null,null,null,null,null,null,null,null,null,null,null,null,null,null,null,null,null,null,null,null,null,null,null,null,null,null,null,null,null,{"$f":"CRCP_y11","v":"2028-29"},null,null,null,null,null,null,null,null,{"$f":"CRCP_y12","v":"2029-30"},null,null,null,null,null,null,null,null,{"$f":"CRCP_y13","v":"2030-31"},null,null,null,null,null,null,null,null,{"$f":"CRCP_y14","v":"2031-32"},null,null,null,null,null,null,null,null,{"$f":"CRCP_y15","v":"2032-33"}]
[]
[null,null,null,null,null,null,null,null,null,null,null,null,null,null,null,null,null,null,null,null,null,null,null,null,null,"Previous period",null,null,null,null,null,null,null,null,null,null,null,2013,null,null,null,null,null,null,null,null,2014,null,null,null,null,null,null,null,null,2015,null,null,null,null,null,null,null,null,2016,null,null,null,null,null,null,null,null,2017]
[null,null,null,null,null,null,null,null,null,null,null,null,null,null,null,null,null,null,null,null,null,null,null,null,null,null,null,null,null,null,null,null,null,null,null,null,null,{"$f":"PRCP_y6","v":"2018-19"},null,null,null,null,null,null,null,null,{"$f":"PRCP_y7","v":"2019-20"},null,null,null,null,null,null,null,null,{"$f":"PRCP_y8","v":"2020-21"},null,null,null,null,null,null,null,null,{"$f":"PRCP_y9","v":"2021-22"},null,null,null,null,null,null,null,null,{"$f":"PRCP_y10","v":"2022-23"}]
[null,null,null,null,null,null,null,null,null,null,null,null,null,null,null,null,null,null,null,null,null,null,null,null,null,null,null,null,null,null,null,null,null,null,null,null,null,{"$f":"PRCP_y11","v":"2023-24"},null,null,null,null,null,null,null,null,{"$f":"PRCP_y12","v":"2024-25"},null,null,null,null,null,null,null,null,{"$f":"PRCP_y13","v":"2025-26"},null,null,null,null,null,null,null,null,{"$f":"PRCP_y14","v":"2026-27"},null,null,null,null,null,null,null,null,{"$f":"PRCP_y15","v":"2027-28"}]
[]
[null,null,null,null,null,null,null,null,null,null,null,null,null,null,null,null,null,null,null,null,null,null,null,null,null,"Commencing year",null,null,null,null,null,null,null,null,null,null,null,"2023-24"]
[null,null,null,null,null,null,null,null,null,null,null,null,null,null,null,null,null,null,null,null,null,null,null,"ANNUAL RINS"]
[null,null,null,null,null,null,null,null,null,null,null,null,null,null,null,null,null,null,null,null,null,null,null,null,null,"Final year",null,null,null,null,null,null,null,null,null,null,null,"2027-28"]
[]
[]
[]
[null,null,null,null,null,null,null,null,null,null,null,null,null,null,null,null,"SUBMISSION DETAILS"]
[]
[null,null,null,null,null,null,null,null,null,null,null,null,null,null,null,null,null,null,null,null,null,null,null,null,null,"RIN type",null,null,null,null,null,null,null,null,null,null,null,{"$f":"INDIRECT(dms_Model)","v":"Regulatory Reporting (Reset)"}]
[]
[null,null,null,null,null,null,null,null,null,null,null,null,null,null,null,null,null,null,null,null,null,null,null,null,null,"Source",null,null,null,null,null,null,null,null,null,null,null,"Regulatory proposal"]
[]
[null,null,null,null,null,null,null,null,null,null,null,null,null,null,null,null,null,null,null,null,null,null,null,"THIS FILE",null,"Data Quality",null,null,null,null,null,null,null,null,null,null,null,"Consolidated"]
[]
[null,null,null,null,null,null,null,null,null,null,null,null,null,null,null,null,null,null,null,null,null,null,null,null,null,"Confidentiality Status",null,null,null,null,null,null,null,null,null,null,null,"Public"]
[]
[null,null,null,null,null,null,null,null,null,null,null,null,null,null,null,null,null,null,null,null,null,null,null,null,null,"Amended RIN \nAmendment Reason",null,null,null,null,null,null,null,null,null,null,null,"."]
[]
[]
[]
[null,null,null,null,null,null,null,null,null,null,null,null,null,null,null,null,null,null,null,null,null,null,null,null,null,"Submission Date",null,null,null,null,null,null,null,null,null,null,null,"2022-07-01",null,null,null,null,null,null,null,null,null,null,null,null,null,null,null,null,null,"Please enter date this file submitted to AER"]

{"sheet":"E1. Expenditure Summary","index":7,"n_rows":189,"n_cols":9,"rows_kept":189,"cut":false,"hidden":false,"merged":[]}
[null,{"$f":"INDEX(dms_Worksheet_List,MATCH(dms_Model,dms_Model_List))","v":"REGULATORY REPORTING STATEMENT"}]
[null,{"$f":"dms_TradingName","v":"AusNet (Gas)"}]
[null,{"$f":"dms_Header_Span","v":"2021-22 to 2027-28"}]
[null,"E1. EXPENDITURE SUMMARY"]
[]
[]
[null,"E1.1 - CAPEX"]
[null,"E1.1.1 - REFERENCE SERVICES"]
[null,null,"EXPENDITURE"]
[null,null,{"$f":"CONCATENATE(\"$0's, real \",dms_DollarReal)","v":"$0's, real June 2023"}]
[null,null,{"$f":"VLOOKUP(CRCP_y4,'AER lookups'!$B$52:$C$101,2,0)","v":2022},{"$f":"CONCATENATE(\"1 Jan-30 Jun \"&(C11+1))","v":"1 Jan-30 Jun 2023"},{"$f":"FRCP_y1","v":"2023-24"},{"$f":"FRCP_y2","v":"2024-25"},{"$f":"FRCP_y3","v":"2025-26"},{"$f":"FRCP_y4","v":"2026-27"},{"$f":"FRCP_y5","v":"2027-28"}]
[null,"Connections",54015830.250464089,25516504.508651767,45108118.584350072,46439231.230326474,47746135.550108075,46677491.836863972,45566769.680066019]
[null,"Mains replacement",21865280.052848138,21851083.394159939,30246928.976615455,27568524.126511134,24909276.678720266,28217547.90450358,19610811.157200377]
[null,"Mains augmentation",3787318.8622956299,2635396.5545609859,4883348.7065264769,6444869.76837957,3576418.806708164,2092296.236414514,5691374.2655508891]
[null,"Telemetry",1331131.3907223954,147723.02313734809,1218898.9716883393,1166408.2706871133,269261.59459035331,245586.60036605096,269445.50326846837]
[null,"Meter replacement",5078069.9206707124,3044950.4897261253,6222824.8457761928,7301706.7221394423,7857250.0414451556,6352186.787076016,5564315.5067286426]
[null,"ICT",6852633.38595099,3426284.774147653,15911940.863268567,18321777.077766862,19894792.540225342,9779819.1588002276,7165074.3664562125]
[null,"Capitalised network overheads",4152837.802241303,2172011.9291841961,3005299.7328807018,2988093.9945354625,2967752.2450530878,3039681.9188677785,2945211.9539214256]
[null,"Capitalised corporate overheads",0,0,0,0,0,0,0]
[null,"Other capex",10916667.948899388,4703785.7625444159,11215406.288377816,11919560.281464811,12319109.67614387,10390337.166271871,9855683.0929732434]
[null,"Capital contributions included in the above",21315279.4239089,5328950.2410756778,8075961.0021513551,8225991.6237513544,8372526.3446013546,8251065.1124513559,8124900.5215013549]
[null,"Total (less capital contributions)",{"$f":"SUM(C12:C20)-C21","v":86684490.190183744},58168790.195036754,109736805.96733226,113924179.84805952,111167470.78839295,98543882.49671264,88543785.004663944]
[]
[null,"E1.1.2 - NON-REFERENCE SERVICES"]
[]
[]
[]
[]
[]
[]
[]
[]
[]
[]
[]
[]
[]
[]
[]
[]
[]
[]
[]
[]
[]
[]
[]
[]
[]
[null,"Capital contributions included in the above"]
[null,"Total",{"$f":"SUM(C25:C49)-C50","v":0},0,0,0,0,0,0]
[]
[]
[null,"E1.2 - OPEX"]
[null,"E1.2.1 - REFERENCE SERVICES"]
[null,null,"EXPENDITURE"]
[null,null,{"$f":"CONCATENATE(\"$0's, real \",dms_DollarReal)","v":"$0's, real June 2023"}]
[null,null,{"$f":"VLOOKUP(CRCP_y4,'AER lookups'!$B$52:$C$101,2,0)","v":2022},{"$f":"CONCATENATE(\"1 Jan-30 Jun \"&(C58+1))","v":"1 Jan-30 Jun 2023"},{"$f":"FRCP_y1","v":"2023-24"},{"$f":"FRCP_y2","v":"2024-25"},{"$f":"FRCP_y3","v":"2025-26"},{"$f":"FRCP_y4","v":"2026-27"},{"$f":"FRCP_y5","v":"2027-28"}]
[null,{"$f":"'E20. Opex'!B44","v":"repairs and maintenance"},{"$f":"'E20. Opex'!F44","v":0},{"$f":"'E20. Opex'!G44","v":0},{"$f":"'E20. Opex'!H44","v":0},{"$f":"'E20. Opex'!I44","v":0},{"$f":"'E20. Opex'!J44","v":0},{"$f":"'E20. Opex'!K44","v":0},{"$f":"'E20. Opex'!L44","v":0}]
[null,{"$f":"'E20. Opex'!B45","v":"marketing and retail incentives"},{"$f":"'E20. Opex'!F45","v":0},{"$f":"'E20. Opex'!G45","v":0},{"$f":"'E20. Opex'!H45","v":0},{"$f":"'E20. Opex'!I45","v":0},{"$f":"'E20. Opex'!J45","v":0},{"$f":"'E20. Opex'!K45","v":0},{"$f":"'E20. Opex'!L45","v":0}]
[null,{"$f":"'E20. Opex'!B46","v":"debt raising"},{"$f":"'E20. Opex'!F46","v":0},{"$f":"'E20. Opex'!G46","v":0},{"$f":"'E20. Opex'!H46","v":0},{"$f":"'E20. Opex'!I46","v":0},{"$f":"'E20. Opex'!J46","v":0},{"$f":"'E20. Opex'!K46","v":0},{"$f":"'E20. Opex'!L46","v":0}]
[null,{"$f":"'E20. Opex'!B47","v":"equity raising"},{"$f":"'E20. Opex'!F47","v":0},{"$f":"'E20. Opex'!G47","v":0},{"$f":"'E20. Opex'!H47","v":0},{"$f":"'E20. Opex'!I47","v":0},{"$f":"'E20. Opex'!J47","v":0},{"$f":"'E20. Opex'!K47","v":0},{"$f":"'E20. Opex'!L47","v":0}]
[null,{"$f":"'E20. Opex'!B48","v":"unaccounted for gas"},{"$f":"'E20. Opex'!F48","v":0},{"$f":"'E20. Opex'!G48","v":0},{"$f":"'E20. Opex'!H48","v":0},{"$f":"'E20. Opex'!I48","v":0},{"$f":"'E20. Opex'!J48","v":0},{"$f":"'E20. Opex'!K48","v":0},{"$f":"'E20. Opex'!L48","v":0}]
[null,{"$f":"'E20. Opex'!B49","v":"jurisdictional charges"},{"$f":"'E20. Opex'!F49","v":0},{"$f":"'E20. Opex'!G49","v":0},{"$f":"'E20. Opex'!H49","v":0},{"$f":"'E20. Opex'!I49","v":0},{"$f":"'E20. Opex'!J49","v":0},{"$f":"'E20. Opex'!K49","v":0},{"$f":"'E20. Opex'!L49","v":0}]
[null,{"$f":"'E20. Opex'!B50","v":"GSL payments"},{"$f":"'E20. Opex'!F50","v":0},{"$f":"'E20. Opex'!G50","v":0},{"$f":"'E20. Opex'!H50","v":0},{"$f":"'E20. Opex'!I50","v":0},{"$f":"'E20. Opex'!J50","v":0},{"$f":"'E20. Opex'!K50","v":0},{"$f":"'E20. Opex'!L50","v":0}]
[null,{"$f":"'E20. Opex'!B51","v":"other opex"},{"$f":"'E20. Opex'!F51","v":0},{"$f":"'E20. Opex'!G51","v":0},{"$f":"'E20. Opex'!H51","v":0},{"$f":"'E20. Opex'!I51","v":0},{"$f":"'E20. Opex'!J51","v":0},{"$f":"'E20. Opex'!K51","v":0},{"$f":"'E20. Opex'!L51","v":0}]
[null,"Total",{"$f":"SUM(C59:C66)","v":0},0,0,0,0,0,0]
[]
[null,"E1.2.2 - NON-REFERENCE SERVICES"]
[null,{"$f":"IF(ISBLANK('E20. Opex'!B58),\"\",'E20. Opex'!B58)","v":""}]
[null,{"$f":"IF(ISBLANK('E20. Opex'!B59),\"\",'E20. Opex'!B59)","v":""}]
[null,{"$f":"IF(ISBLANK('E20. Opex'!B60),\"\",'E20. Opex'!B60)","v":""}]
[null,{"$f":"IF(ISBLANK('E20. Opex'!B61),\"\",'E20. Opex'!B61)","v":""}]
[null,{"$f":"IF(ISBLANK('E20. Opex'!B62),\"\",'E20. Opex'!B62)","v":""}]
[null,{"$f":"IF(ISBLANK('E20. Opex'!B63),\"\",'E20. Opex'!B63)","v":""}]
[null,{"$f":"IF(ISBLANK('E20. Opex'!B64),\"\",'E20. Opex'!B64)","v":""}]
[null,{"$f":"IF(ISBLANK('E20. Opex'!B65),\"\",'E20. Opex'!B65)","v":""}]
[null,{"$f":"IF(ISBLANK('E20. Opex'!B66),\"\",'E20. Opex'!B66)","v":""}]
[null,{"$f":"IF(ISBLANK('E20. Opex'!B67),\"\",'E20. Opex'!B67)","v":""}]
[null,{"$f":"IF(ISBLANK('E20. Opex'!B68),\"\",'E20. Opex'!B68)","v":""}]
[null,{"$f":"IF(ISBLANK('E20. Opex'!B69),\"\",'E20. Opex'!B69)","v":""}]
[null,{"$f":"IF(ISBLANK('E20. Opex'!B70),\"\",'E20. Opex'!B70)","v":""}]
[null,{"$f":"IF(ISBLANK('E20. Opex'!B71),\"\",'E20. Opex'!B71)","v":""}]
[null,{"$f":"IF(ISBLANK('E20. Opex'!B72),\"\",'E20. Opex'!B72)","v":""}]
[null,{"$f":"IF(ISBLANK('E20. Opex'!B73),\"\",'E20. Opex'!B73)","v":""}]
[null,{"$f":"IF(ISBLANK('E20. Opex'!B74),\"\",'E20. Opex'!B74)","v":""}]
[null,{"$f":"IF(ISBLANK('E20. Opex'!B75),\"\",'E20. Opex'!B75)","v":""}]
[null,{"$f":"IF(ISBLANK('E20. Opex'!B76),\"\",'E20. Opex'!B76)","v":""}]
[null,{"$f":"IF(ISBLANK('E20. Opex'!B77),\"\",'E20. Opex'!B77)","v":""}]
[null,{"$f":"IF(ISBLANK('E20. Opex'!B78),\"\",'E20. Opex'!B78)","v":""}]
[null,{"$f":"IF(ISBLANK('E20. Opex'!B79),\"\",'E20. Opex'!B79)","v":""}]
[null,{"$f":"IF(ISBLANK('E20. Opex'!B80),\"\",'E20. Opex'!B80)","v":""}]
[null,{"$f":"IF(ISBLANK('E20. Opex'!B81),\"\",'E20. Opex'!B81)","v":""}]
[null,{"$f":"IF(ISBLANK('E20. Opex'!B82),\"\",'E20. Opex'!B82)","v":""}]
[null,"Total",{"$f":"SUM(C70:C94)","v":0},{"$f":"SUM(D70:D94)","v":0},0,0,0,0,0]
[]
[]
[null,"E1.3 - CAPCONS"]
[null,"E1.3.1 - REFERENCE SERVICES"]
[null,null,"EXPENDITURE"]
[null,null,{"$f":"CONCATENATE(\"$0's, real \",dms_DollarReal)","v":"$0's, real June 2023"}]
[null,null,{"$f":"VLOOKUP(CRCP_y4,'AER lookups'!$B$52:$C$101,2,0)","v":2022},{"$f":"CONCATENATE(\"1 Jan-30 Jun \"&(C102+1))","v":"1 Jan-30 Jun 2023"},{"$f":"FRCP_y1","v":"2023-24"},{"$f":"FRCP_y2","v":"2024-25"},{"$f":"FRCP_y3","v":"2025-26"},{"$f":"FRCP_y4","v":"2026-27"},{"$f":"FRCP_y5","v":"2027-28"}]
[null,"Connections",{"$f":"'E5. New Connections'!D192","v":5595418.4200948495},{"$f":"'E5. New Connections'!E192","v":3290026.7312500002},{"$f":"'E5. New Connections'!F192","v":6580053.4625000004},{"$f":"'E5. New Connections'!G192","v":6730084.0840999996},{"$f":"'E5. New Connections'!H192","v":6876618.8049499998},{"$f":"'E5. New Connections'!I192","v":6755157.5727999993},{"$f":"'E5. New Connections'!J192","v":6628992.9818500001}]
[null,"Mains replacement"]
[null,"Mains augmentation"]
[null,"Telemetry"]
[null,"Meter replacement"]
[null,"ICT"]
[null,"Capitalised network overheads"]
[null,"Capitalised corporate overheads"]
[null,"Other capex",{"$f":"'E13. Other capex'!C139","v":15719861.003814049},{"$f":"'E13. Other capex'!D139","v":2038923.5098256774},{"$f":"'E13. Other capex'!E139","v":1495907.5396513548},{"$f":"'E13. Other capex'!F139","v":1495907.5396513548},{"$f":"'E13. Other capex'!G139","v":1495907.5396513548},{"$f":"'E13. Other capex'!H139","v":1495907.5396513548},{"$f":"'E13. Other capex'!I139","v":1495907.5396513548}]
[null,"Total",{"$f":"SUM(C103:C111)","v":21315279.423908897},5328950.2410756778,8075961.0021513551,8225991.6237513544,8372526.3446013546,8251065.112451354,8124900.5215013549]
[]
[null,"E1.3.2 - NON-REFERENCE SERVICES"]
[null,null,"EXPENDITURE"]
[null,null,{"$f":"CONCATENATE(\"$0's, real \",dms_DollarReal)","v":"$0's, real June 2023"}]
[null,null,{"$f":"VLOOKUP(CRCP_y4,'AER lookups'!$B$52:$C$101,2,0)","v":2022},{"$f":"CONCATENATE(\"1 Jan-30 Jun \"&(C117+1))","v":"1 Jan-30 Jun 2023"},{"$f":"FRCP_y1","v":"2023-24"},{"$f":"FRCP_y2","v":"2024-25"},{"$f":"FRCP_y3","v":"2025-26"},{"$f":"FRCP_y4","v":"2026-27"},{"$f":"FRCP_y5","v":"2027-28"}]
[]
[]
[]
[]
[]
[]
[]
[]
[]
[]
[]
[]
[]
[]
[]
[]
[]
[]
[]
[]
[]
[]
[]
[]
[null,"Total",{"$f":"SUM(C118:C141)","v":0},0,0,0,0,0,0]
[]
[]
[null,"E1.4 - CAPITALISED OVERHEADS"]
[null,"E1.4.1 - REFERENCE SERVICES"]
[null,null,"EXPENDITURE"]
[null,null,{"$f":"CONCATENATE(\"$0's, real \",dms_DollarReal)","v":"$0's, real June 2023"}]
[null,null,{"$f":"VLOOKUP(CRCP_y4,'AER lookups'!$B$52:$C$101,2,0)","v":2022},{"$f":"CONCATENATE(\"1 Jan-30 Jun \"&(C149+1))","v":"1 Jan-30 Jun 2023"},{"$f":"FRCP_y1","v":"2023-24"},{"$f":"FRCP_y2","v":"2024-25"},{"$f":"FRCP_y3","v":"2025-26"},{"$f":"FRCP_y4","v":"2026-27"},{"$f":"FRCP_y5","v":"2027-28"}]
[null,"Connections",2036991.3733707294,849290.54645024985,1206762.182887353,1210233.6418980435,1283082.1865222082,1332464.0338902324,1363374.9823478535]
[null,"Mains replacement",824561.73750294,727290.78350303322,809185.82248568162,718451.93108178303,669387.14133371785,805503.17139430717,586762.88670450822]
[null,"Mains augmentation",142823.60957756685,87716.457368888892,130642.57011447567,167957.09155174624,96109.124006787781,59727.062735287473,170288.07052401174]
[null,"Telemetry",50198.305703191319,4916.8085307712608,32608.790389765752,30397.284622830339,7235.8684436538606,7010.5590363940864,8061.9113630752545]
[null,"Meter replacement",191499.13226948306,101348.03787315916,166477.12053368241,190286.76582904905,211147.9274097262,181330.66060861107,166486.4244059585]
[null,"ICT",509451.20423647109,253747.50604017219,388069.00561354309,387896.03615599498,398376.19217456505,387476.52909071185,387266.13175542839]
[null,"Other capex",397312.43958092108,147701.78941791877,271554.24085618369,282871.24339600839,302413.80516244285,266169.90211223625,262971.54682059027]
[null,"Capital contributions included in the above",774609.36041489406,171655.24698917023,210424.0401016713,208929.35162507035,219106.88982744937,228999.3253321276,236037.75749601959]
[null,"Total (less capital contributions)",{"$f":"SUM(C150:C156)-C157","v":3378228.4418264087},2000356.6821950229,2794875.6927790144,2779164.642910385,2748645.3552256525,2810682.5935356528,2709174.1964254063]
[]
[]
[]
[null,"E1.4.2 - NON-REFERENCE SERVICES"]
[null,null,"EXPENDITURE"]
[null,null,{"$f":"CONCATENATE(\"$0's, real \",dms_DollarReal)","v":"$0's, real June 2023"}]
[null,null,{"$f":"VLOOKUP(CRCP_y4,'AER lookups'!$B$52:$C$101,2,0)","v":2022},{"$f":"CONCATENATE(\"1 Jan-30 Jun \"&(C165+1))","v":"1 Jan-30 Jun 2023"},{"$f":"FRCP_y1","v":"2023-24"},{"$f":"FRCP_y2","v":"2024-25"},{"$f":"FRCP_y3","v":"2025-26"},{"$f":"FRCP_y4","v":"2026-27"},{"$f":"FRCP_y5","v":"2027-28"}]
[]
[]
[]
[]
[]
[]
[]
[]
[]
[]
[]
[]
[]
[]
[]
[]
[]
[]
[]
[]
[]
[]
[null,"Capital contributions included in the above"]
[null,"Total (less capital contributions)",{"$f":"SUM(C166:C187)-C188","v":0},0,0,0,0,0,0]

{"sheet":"E2. Mains Repex","index":8,"n_rows":796,"n_cols":10,"rows_kept":796,"cut":false,"hidden":false,"merged":[[769,3,769,9],[770,3,770,9]]}
[null,{"$f":"INDEX(dms_Worksheet_List,MATCH(dms_Model,dms_Model_List))","v":"REGULATORY REPORTING STATEMENT"}]
[null,{"$f":"dms_TradingName","v":"AusNet (Gas)"}]
[null,{"$f":"dms_Header_Span","v":"2021-22 to 2027-28"}]
[null,"E2. MAINS REPLACEMENT"]
[]
[]
[]
[null,"Please list all projects here:"]
[null,"LP - Ascot Vale"]
[null,"LP - Geelong West"]
[null,"LP - Geelong"]
[null,"LP - Colac"]
[null,"LP - Warrnambool"]
[null,"LP - Hamilton"]
[null,"LP - Portland"]
[null,"LP - Ballarat"]
[null,"LP - Ararat"]
[null,"LP - Stawell"]
[null,"LP - Horsham"]
[null,"LP - Bendigo"]
[null,"MP - Altona North"]
[null,"MP - Braybrook"]
[null,"MP - Sunshine"]
[null,"MP - Footscray"]
[null,"MP - St Albans"]
[null,"MP - Maidstone"]
[null,"HP - Melton"]
[null,"Exposed Pipework"]
[null,"LP Mains CY22"]
[null,"MP Mains CY22"]
[null,"HP Mains CY22"]
[]
[]
[]
[]
[]
[]
[]
[]
[]
[]
[]
[]
[]
[]
[]
[]
[]
[]
[]
[]
[]
[]
[]
[]
[]
[]
[]
[]
[]
[null,"E2.1 - CAPEX"]
[null,"E2.1.1 - PROACTIVE - BY PROJECT"]
[null,null,null,"EXPENDITURE"]
[null,null,null,{"$f":"CONCATENATE(\"$0's, real \",dms_DollarReal)","v":"$0's, real June 2023"}]
[null,null,null,{"$f":"VLOOKUP(CRCP_y4,'AER lookups'!$B$52:$C$101,2,0)","v":2022},{"$f":"CONCATENATE(\"1 Jan-30 Jun \"&(D65+1))","v":"1 Jan-30 Jun 2023"},{"$f":"FRCP_y1","v":"2023-24"},{"$f":"FRCP_y2","v":"2024-25"},{"$f":"FRCP_y3","v":"2025-26"},{"$f":"FRCP_y4","v":"2026-27"},{"$f":"FRCP_y5","v":"2027-28"}]
[null,"A. DIRECT INTERNAL LABOUR EXPENDITURE"]
[null,{"$f":"IF(ISBLANK(dms_E2_Projects_01),\"\",dms_E2_Projects_01)","v":"LP - Ascot Vale"},null,null,282157.90451659122,115438.69337897863,0,0,0,0]
[null,{"$f":"IF(ISBLANK(dms_E2_Projects_02),\"\",dms_E2_Projects_02)","v":"LP - Geelong West"},null,null,0,0,237849.409983541,0,0,0]
[null,{"$f":"IF(ISBLANK(dms_E2_Projects_03),\"\",dms_E2_Projects_03)","v":"LP - Geelong"},null,null,0,259141.13276160424,0,0,0,0]
[null,{"$f":"IF(ISBLANK(dms_E2_Projects_04),\"\",dms_E2_Projects_04)","v":"LP - Colac"},null,null,86098.610061109619,0,0,0,0,0]
[null,{"$f":"IF(ISBLANK(dms_E2_Projects_05),\"\",dms_E2_Projects_05)","v":"LP - Warrnambool"},null,null,0,143161.98291351146,157442.04531876554,185693.58496083916,268157.18388068862,128198.16692796671]
[null,{"$f":"IF(ISBLANK(dms_E2_Projects_06),\"\",dms_E2_Projects_06)","v":"LP - Hamilton"},null,null,0,0,100837.66658590507,140852.602124167,0,0]
[null,{"$f":"IF(ISBLANK(dms_E2_Projects_07),\"\",dms_E2_Projects_07)","v":"LP - Portland"},null,null,117207.02498956442,107483.0756948239,0,0,0,0]
[null,{"$f":"IF(ISBLANK(dms_E2_Projects_08),\"\",dms_E2_Projects_08)","v":"LP - Ballarat"},null,null,138217.13061777831,0,0,0,0,0]
[null,{"$f":"IF(ISBLANK(dms_E2_Projects_09),\"\",dms_E2_Projects_09)","v":"LP - Ararat"},null,null,0,45781.344330936663,85208.605915797991,115564.393634693,92592.274658310227,84197.26946818686]
[null,{"$f":"IF(ISBLANK(dms_E2_Projects_10),\"\",dms_E2_Projects_10)","v":"LP - Stawell"},null,null,47764.710818947497,58060.983043905515,88754.65018115053,123535.10073184247,95968.041533655531,0]
[null,{"$f":"IF(ISBLANK(dms_E2_Projects_11),\"\",dms_E2_Projects_11)","v":"LP - Horsham"},null,null,62347.300920382928,202452.03825326089,117893.56593114822,0,0,0]
[null,{"$f":"IF(ISBLANK(dms_E2_Projects_12),\"\",dms_E2_Projects_12)","v":"LP - Bendigo"},null,null,0,0,0,0,146100.83650642383,147709.17999373627]
[null,{"$f":"IF(ISBLANK(dms_E2_Projects_13),\"\",dms_E2_Projects_13)","v":"MP - Altona North"},null,null,84838.535949488214,71621.278425870289,0,0,81155.420653546607,0]
[null,{"$f":"IF(ISBLANK(dms_E2_Projects_14),\"\",dms_E2_Projects_14)","v":"MP - Braybrook"},null,null,0,0,0,0,81682.40390454368,85334.320428738356]
[null,{"$f":"IF(ISBLANK(dms_E2_Projects_15),\"\",dms_E2_Projects_15)","v":"MP - Sunshine"},null,null,0,0,85928.255051857297,86874.191794544633,0,88797.419800976437]
[null,{"$f":"IF(ISBLANK(dms_E2_Projects_16),\"\",dms_E2_Projects_16)","v":"MP - Footscray"},null,null,0,0,0,0,109788.17729105333,0]
[null,{"$f":"IF(ISBLANK(dms_E2_Projects_17),\"\",dms_E2_Projects_17)","v":"MP - St Albans"},null,null,0,0,0,118583.27179955343,118571.2314743376,119876.5167313182]
[null,{"$f":"IF(ISBLANK(dms_E2_Projects_18),\"\",dms_E2_Projects_18)","v":"MP - Maidstone"},null,null,0,0,49408.746654817951,64938.458366422114,0,0]
[null,{"$f":"IF(ISBLANK(dms_E2_Projects_19),\"\",dms_E2_Projects_19)","v":"HP - Melton"},null,null,0,86542.378097926587,87217.17887763516,88177.3046714628,89147.999960335306,90129.381097991092]
[null,{"$f":"IF(ISBLANK(dms_E2_Projects_20),\"\",dms_E2_Projects_20)","v":"Exposed Pipework"},null,null,0,8526.342669746462,0,0,0,0]
[null,{"$f":"IF(ISBLANK(dms_E2_Projects_21),\"\",dms_E2_Projects_21)","v":"LP Mains CY22"},null,731783.15541281144]
[null,{"$f":"IF(ISBLANK(dms_E2_Projects_22),\"\",dms_E2_Projects_22)","v":"MP Mains CY22"},null,16749.451659235434]
[null,{"$f":"IF(ISBLANK(dms_E2_Projects_23),\"\",dms_E2_Projects_23)","v":"HP Mains CY22"},null,0]
[null,{"$f":"IF(ISBLANK(dms_E2_Projects_24),\"\",dms_E2_Projects_24)","v":""}]
[null,{"$f":"IF(ISBLANK(dms_E2_Projects_25),\"\",dms_E2_Projects_25)","v":""}]
[null,{"$f":"IF(ISBLANK(dms_E2_Projects_26),\"\",dms_E2_Projects_26)","v":""}]
[null,{"$f":"IF(ISBLANK(dms_E2_Projects_27),\"\",dms_E2_Projects_27)","v":""}]
[null,{"$f":"IF(ISBLANK(dms_E2_Projects_28),\"\",dms_E2_Projects_28)","v":""}]
[null,{"$f":"IF(ISBLANK(dms_E2_Projects_29),\"\",dms_E2_Projects_29)","v":""}]
[null,{"$f":"IF(ISBLANK(dms_E2_Projects_30),\"\",dms_E2_Projects_30)","v":""}]
[null,{"$f":"IF(ISBLANK(dms_E2_Projects_31),\"\",dms_E2_Projects_31)","v":""}]
[null,{"$f":"IF(ISBLANK(dms_E2_Projects_32),\"\",dms_E2_Projects_32)","v":""}]
[null,{"$f":"IF(ISBLANK(dms_E2_Projects_33),\"\",dms_E2_Projects_33)","v":""}]
[null,{"$f":"IF(ISBLANK(dms_E2_Projects_34),\"\",dms_E2_Projects_34)","v":""}]
[null,{"$f":"IF(ISBLANK(dms_E2_Projects_35),\"\",dms_E2_Projects_35)","v":""}]
[null,{"$f":"IF(ISBLANK(dms_E2_Projects_36),\"\",dms_E2_Projects_36)","v":""}]
[null,{"$f":"IF(ISBLANK(dms_E2_Projects_37),\"\",dms_E2_Projects_37)","v":""}]
[null,{"$f":"IF(ISBLANK(dms_E2_Projects_38),\"\",dms_E2_Projects_38)","v":""}]
[null,{"$f":"IF(ISBLANK(dms_E2_Projects_39),\"\",dms_E2_Projects_39)","v":""}]
[null,{"$f":"IF(ISBLANK(dms_E2_Projects_40),\"\",dms_E2_Projects_40)","v":""}]
[null,{"$f":"IF(ISBLANK(dms_E2_Projects_41),\"\",dms_E2_Projects_41)","v":""}]
[null,{"$f":"IF(ISBLANK(dms_E2_Projects_42),\"\",dms_E2_Projects_42)","v":""}]
[null,{"$f":"IF(ISBLANK(dms_E2_Projects_43),\"\",dms_E2_Projects_43)","v":""}]
[null,{"$f":"IF(ISBLANK(dms_E2_Projects_44),\"\",dms_E2_Projects_44)","v":""}]
[null,{"$f":"IF(ISBLANK(dms_E2_Projects_45),\"\",dms_E2_Projects_45)","v":""}]
[null,{"$f":"IF(ISBLANK(dms_E2_Projects_46),\"\",dms_E2_Projects_46)","v":""}]
[null,{"$f":"IF(ISBLANK(dms_E2_Projects_47),\"\",dms_E2_Projects_47)","v":""}]
[null,{"$f":"IF(ISBLANK(dms_E2_Projects_48),\"\",dms_E2_Projects_48)","v":""}]
[null,{"$f":"IF(ISBLANK(dms_E2_Projects_49),\"\",dms_E2_Projects_49)","v":""}]
[null,{"$f":"IF(ISBLANK(dms_E2_Projects_50),\"\",dms_E2_Projects_50)","v":""}]
[null,"Other projects with expenditure of less than $500,000"]
[null,null,"Total",{"$f":"SUM(D67:D117)","v":748532.60707204684},{"$f":"SUM(E67:E117)","v":818631.21787386225},{"$f":"SUM(F67:F117)","v":1098209.2495705644},{"$f":"SUM(G67:G117)","v":1010540.1245006188},{"$f":"SUM(H67:H117)","v":924218.90808352455},{"$f":"SUM(I67:I117)","v":1083163.5698628947},{"$f":"SUM(J67:J117)","v":744242.25444891397}]
[]
[null,"B. DIRECT CONTRACTOR EXPENDITURE"]
[null,null,null,"EXPENDITURE"]
[null,null,null,{"$f":"CONCATENATE(\"$0's, real \",dms_DollarReal)","v":"$0's, real June 2023"}]
[null,null,null,{"$f":"VLOOKUP(CRCP_y4,'AER lookups'!$B$52:$C$101,2,0)","v":2022},{"$f":"CONCATENATE(\"1 Jan-30 Jun \"&(D123+1))","v":"1 Jan-30 Jun 2023"},{"$f":"FRCP_y1","v":"2023-24"},{"$f":"FRCP_y2","v":"2024-25"},{"$f":"FRCP_y3","v":"2025-26"},{"$f":"FRCP_y4","v":"2026-27"},{"$f":"FRCP_y5","v":"2027-28"}]
[null,{"$f":"IF(ISBLANK(dms_E2_Projects_01),\"\",dms_E2_Projects_01)","v":"LP - Ascot Vale"},null,null,5333288.8246939993,2171124.1955988002,0,0,0,0]
[null,{"$f":"IF(ISBLANK(dms_E2_Projects_02),\"\",dms_E2_Projects_02)","v":"LP - Geelong West"},null,null,0,0,4438764.8,0,0,0]
[null,{"$f":"IF(ISBLANK(dms_E2_Projects_03),\"\",dms_E2_Projects_03)","v":"LP - Geelong"},null,null,0,4873821.4799999995,0,0,0,0]
[null,{"$f":"IF(ISBLANK(dms_E2_Projects_04),\"\",dms_E2_Projects_04)","v":"LP - Colac"},null,null,1627417.6534139998,0,0,0,0,0]
[null,{"$f":"IF(ISBLANK(dms_E2_Projects_05),\"\",dms_E2_Projects_05)","v":"LP - Warrnambool"},null,null,0,2692532.5979999998,2938196.0999999996,3427695,4895983.2319999998,2315141.3739999998]
[null,{"$f":"IF(ISBLANK(dms_E2_Projects_06),\"\",dms_E2_Projects_06)","v":"LP - Hamilton"},null,null,0,0,1881840.6359999999,2599980.8239999996,0,0]
[null,{"$f":"IF(ISBLANK(dms_E2_Projects_07),\"\",dms_E2_Projects_07)","v":"LP - Portland"},null,null,2215422.3097999999,2021498.16,0,0,0,0]
[null,{"$f":"IF(ISBLANK(dms_E2_Projects_08),\"\",dms_E2_Projects_08)","v":"LP - Ballarat"},null,null,2612550.8671039995,0,0,0,0,0]
[null,{"$f":"IF(ISBLANK(dms_E2_Projects_09),\"\",dms_E2_Projects_09)","v":"LP - Ararat"},null,null,0,861036.98400000005,1590169.8499999999,2133188.9,1690539.1739999999,1520525.5019999999]
[null,{"$f":"IF(ISBLANK(dms_E2_Projects_10),\"\",dms_E2_Projects_10)","v":"LP - Stawell"},null,null,902838.42609999992,1091987.456,1656346.4129999999,2280319.1999999997,1752173.5399999998,0]
[null,{"$f":"IF(ISBLANK(dms_E2_Projects_11),\"\",dms_E2_Projects_11)","v":"LP - Horsham"},null,null,1178475.449122,3807635.9479999999,2200139.1999999997,0,0,0]
[null,{"$f":"IF(ISBLANK(dms_E2_Projects_12),\"\",dms_E2_Projects_12)","v":"LP - Bendigo"},null,null,0,0,0,0,2667492.3839999996,2667492.3839999996]
[null,{"$f":"IF(ISBLANK(dms_E2_Projects_13),\"\",dms_E2_Projects_13)","v":"MP - Altona North"},null,null,1603600,1347024,0,0,1481726.4,0]
[null,{"$f":"IF(ISBLANK(dms_E2_Projects_14),\"\",dms_E2_Projects_14)","v":"MP - Braybrook"},null,null,0,0,0,0,1491348,1541059.5999999999]
[null,{"$f":"IF(ISBLANK(dms_E2_Projects_15),\"\",dms_E2_Projects_15)","v":"MP - Sunshine"},null,null,0,0,1603600,1603600,0,1603600]
[null,{"$f":"IF(ISBLANK(dms_E2_Projects_16),\"\",dms_E2_Projects_16)","v":"MP - Footscray"},null,null,0,0,0,0,2004499.9999999998,0]
[null,{"$f":"IF(ISBLANK(dms_E2_Projects_17),\"\",dms_E2_Projects_17)","v":"MP - St Albans"},null,null,0,0,0,2188914,2164860,2164860]
[null,{"$f":"IF(ISBLANK(dms_E2_Projects_18),\"\",dms_E2_Projects_18)","v":"MP - Maidstone"},null,null,0,0,922070,1198691,0,0]
[null,{"$f":"IF(ISBLANK(dms_E2_Projects_19),\"\",dms_E2_Projects_19)","v":"HP - Melton"},null,null,0,1627654,1627654,1627654,1627654,1627654]
[null,{"$f":"IF(ISBLANK(dms_E2_Projects_20),\"\",dms_E2_Projects_20)","v":"Exposed Pipework"},null,null,0,160360,0,0,0,0]
[null,{"$f":"IF(ISBLANK(dms_E2_Projects_21),\"\",dms_E2_Projects_21)","v":"LP Mains CY22"},null,13903879.95284342]
[null,{"$f":"IF(ISBLANK(dms_E2_Projects_22),\"\",dms_E2_Projects_22)","v":"MP Mains CY22"},null,318239.58152547327]
[null,{"$f":"IF(ISBLANK(dms_E2_Projects_23),\"\",dms_E2_Projects_23)","v":"HP Mains CY22"},null,0]
[null,{"$f":"IF(ISBLANK(dms_E2_Projects_24),\"\",dms_E2_Projects_24)","v":""}]
[null,{"$f":"IF(ISBLANK(dms_E2_Projects_25),\"\",dms_E2_Projects_25)","v":""}]
[null,{"$f":"IF(ISBLANK(dms_E2_Projects_26),\"\",dms_E2_Projects_26)","v":""}]
[null,{"$f":"IF(ISBLANK(dms_E2_Projects_27),\"\",dms_E2_Projects_27)","v":""}]
[null,{"$f":"IF(ISBLANK(dms_E2_Projects_28),\"\",dms_E2_Projects_28)","v":""}]
[null,{"$f":"IF(ISBLANK(dms_E2_Projects_29),\"\",dms_E2_Projects_29)","v":""}]
[null,{"$f":"IF(ISBLANK(dms_E2_Projects_30),\"\",dms_E2_Projects_30)","v":""}]
[null,{"$f":"IF(ISBLANK(dms_E2_Projects_31),\"\",dms_E2_Projects_31)","v":""}]
[null,{"$f":"IF(ISBLANK(dms_E2_Projects_32),\"\",dms_E2_Projects_32)","v":""}]
[null,{"$f":"IF(ISBLANK(dms_E2_Projects_33),\"\",dms_E2_Projects_33)","v":""}]
[null,{"$f":"IF(ISBLANK(dms_E2_Projects_34),\"\",dms_E2_Projects_34)","v":""}]
[null,{"$f":"IF(ISBLANK(dms_E2_Projects_35),\"\",dms_E2_Projects_35)","v":""}]
[null,{"$f":"IF(ISBLANK(dms_E2_Projects_36),\"\",dms_E2_Projects_36)","v":""}]
[null,{"$f":"IF(ISBLANK(dms_E2_Projects_37),\"\",dms_E2_Projects_37)","v":""}]
[null,{"$f":"IF(ISBLANK(dms_E2_Projects_38),\"\",dms_E2_Projects_38)","v":""}]
[null,{"$f":"IF(ISBLANK(dms_E2_Projects_39),\"\",dms_E2_Projects_39)","v":""}]
[null,{"$f":"IF(ISBLANK(dms_E2_Projects_40),\"\",dms_E2_Projects_40)","v":""}]
[null,{"$f":"IF(ISBLANK(dms_E2_Projects_41),\"\",dms_E2_Projects_41)","v":""}]
[null,{"$f":"IF(ISBLANK(dms_E2_Projects_42),\"\",dms_E2_Projects_42)","v":""}]
[null,{"$f":"IF(ISBLANK(dms_E2_Projects_43),\"\",dms_E2_Projects_43)","v":""}]
[null,{"$f":"IF(ISBLANK(dms_E2_Projects_44),\"\",dms_E2_Projects_44)","v":""}]
[null,{"$f":"IF(ISBLANK(dms_E2_Projects_45),\"\",dms_E2_Projects_45)","v":""}]
[null,{"$f":"IF(ISBLANK(dms_E2_Projects_46),\"\",dms_E2_Projects_46)","v":""}]
[null,{"$f":"IF(ISBLANK(dms_E2_Projects_47),\"\",dms_E2_Projects_47)","v":""}]
[null,{"$f":"IF(ISBLANK(dms_E2_Projects_48),\"\",dms_E2_Projects_48)","v":""}]
[null,{"$f":"IF(ISBLANK(dms_E2_Projects_49),\"\",dms_E2_Projects_49)","v":""}]
[null,{"$f":"IF(ISBLANK(dms_E2_Projects_50),\"\",dms_E2_Projects_50)","v":""}]
[null,"Other projects with expenditure of less than $500,000"]
[null,null,"Total",{"$f":"SUM(D124:D174)","v":14222119.534368893},{"$f":"SUM(E124:E174)","v":15473593.530234},20654674.821598798,18858780.998999998,17060042.923999999,19776276.729999997,13440332.859999999]
[]
[null,"C. DIRECT MATERIAL EXPENDITURE"]
[null,null,null,"EXPENDITURE"]
[null,null,null,{"$f":"CONCATENATE(\"$0's, real \",dms_DollarReal)","v":"$0's, real June 2023"}]
[null,null,null,{"$f":"VLOOKUP(CRCP_y4,'AER lookups'!$B$52:$C$101,2,0)","v":2022},{"$f":"CONCATENATE(\"1 Jan-30 Jun \"&(D180+1))","v":"1 Jan-30 Jun 2023"},{"$f":"FRCP_y1","v":"2023-24"},{"$f":"FRCP_y2","v":"2024-25"},{"$f":"FRCP_y3","v":"2025-26"},{"$f":"FRCP_y4","v":"2026-27"},{"$f":"FRCP_y5","v":"2027-28"}]
[null,{"$f":"IF(ISBLANK(dms_E2_Projects_01),\"\",dms_E2_Projects_01)","v":"LP - Ascot Vale"},null,null,1403497.0591299997,571348.47252599988,0,0,0,0]
[null,{"$f":"IF(ISBLANK(dms_E2_Projects_02),\"\",dms_E2_Projects_02)","v":"LP - Geelong West"},null,null,0,0,1168095.9999999998,0,0,0]
[null,{"$f":"IF(ISBLANK(dms_E2_Projects_03),\"\",dms_E2_Projects_03)","v":"LP - Geelong"},null,null,0,1282584.5999999996,0,0,0,0]
[null,{"$f":"IF(ISBLANK(dms_E2_Projects_04),\"\",dms_E2_Projects_04)","v":"LP - Colac"},null,null,428267.80352999986,0,0,0,0,0]
[null,{"$f":"IF(ISBLANK(dms_E2_Projects_05),\"\",dms_E2_Projects_05)","v":"LP - Warrnambool"},null,null,0,708561.20999999985,773209.49999999988,902024.99999999965,1288416.6399999997,609247.72999999986]
[null,{"$f":"IF(ISBLANK(dms_E2_Projects_06),\"\",dms_E2_Projects_06)","v":"LP - Hamilton"},null,null,0,0,495221.21999999986,684205.47999999986,0,0]
[null,{"$f":"IF(ISBLANK(dms_E2_Projects_07),\"\",dms_E2_Projects_07)","v":"LP - Portland"},null,null,583005.87099999981,531973.19999999984,0,0,0,0]
[null,{"$f":"IF(ISBLANK(dms_E2_Projects_08),\"\",dms_E2_Projects_08)","v":"LP - Ballarat"},null,null,687513.38607999973,0,0,0,0,0]
[null,{"$f":"IF(ISBLANK(dms_E2_Projects_09),\"\",dms_E2_Projects_09)","v":"LP - Ararat"},null,null,0,226588.67999999993,418465.74999999983,561365.49999999988,444878.72999999986,400138.28999999992]
[null,{"$f":"IF(ISBLANK(dms_E2_Projects_10),\"\",dms_E2_Projects_10)","v":"LP - Stawell"},null,null,237589.05949999992,287365.11999999994,435880.63499999983,600083.99999999988,461098.29999999987,0]
[null,{"$f":"IF(ISBLANK(dms_E2_Projects_11),\"\",dms_E2_Projects_11)","v":"LP - Horsham"},null,null,310125.11818999989,1002009.4599999997,578983.99999999988,0,0,0]
[null,{"$f":"IF(ISBLANK(dms_E2_Projects_12),\"\",dms_E2_Projects_12)","v":"LP - Bendigo"},null,null,0,0,0,0,701971.67999999982,701971.67999999982]
[null,{"$f":"IF(ISBLANK(dms_E2_Projects_13),\"\",dms_E2_Projects_13)","v":"MP - Altona North"},null,null,421999.99999999983,354479.99999999994,0,0,389927.99999999994,0]
[null,{"$f":"IF(ISBLANK(dms_E2_Projects_14),\"\",dms_E2_Projects_14)","v":"MP - Braybrook"},null,null,0,0,0,0,392459.99999999994,405541.99999999994]
[null,{"$f":"IF(ISBLANK(dms_E2_Projects_15),\"\",dms_E2_Projects_15)","v":"MP - Sunshine"},null,null,0,0,421999.99999999983,421999.99999999983,0,421999.99999999983]
[null,{"$f":"IF(ISBLANK(dms_E2_Projects_16),\"\",dms_E2_Projects_16)","v":"MP - Footscray"},null,null,0,0,0,0,527499.99999999988,0]
[null,{"$f":"IF(ISBLANK(dms_E2_Projects_17),\"\",dms_E2_Projects_17)","v":"MP - St Albans"},null,null,0,0,0,576029.99999999988,569699.99999999988,569699.99999999988]
[null,{"$f":"IF(ISBLANK(dms_E2_Projects_18),\"\",dms_E2_Projects_18)","v":"MP - Maidstone"},null,null,0,0,242649.99999999991,315444.99999999994,0,0]
[null,{"$f":"IF(ISBLANK(dms_E2_Projects_19),\"\",dms_E2_Projects_19)","v":"HP - Melton"},null,null,0,428329.99999999983,428329.99999999983,428329.99999999983,428329.99999999983,428329.99999999983]
[null,{"$f":"IF(ISBLANK(dms_E2_Projects_20),\"\",dms_E2_Projects_20)","v":"Exposed Pipework"},null,null,0,42199.999999999993,0,0,0,0]
[null,{"$f":"IF(ISBLANK(dms_E2_Projects_21),\"\",dms_E2_Projects_21)","v":"LP Mains CY22"},null,3658915.7770640566]
[null,{"$f":"IF(ISBLANK(dms_E2_Projects_22),\"\",dms_E2_Projects_22)","v":"MP Mains CY22"},null,83747.25829617714]
[null,{"$f":"IF(ISBLANK(dms_E2_Projects_23),\"\",dms_E2_Projects_23)","v":"HP Mains CY22"},null,0]
[null,{"$f":"IF(ISBLANK(dms_E2_Projects_24),\"\",dms_E2_Projects_24)","v":""}]
[null,{"$f":"IF(ISBLANK(dms_E2_Projects_25),\"\",dms_E2_Projects_25)","v":""}]
[null,{"$f":"IF(ISBLANK(dms_E2_Projects_26),\"\",dms_E2_Projects_26)","v":""}]
[null,{"$f":"IF(ISBLANK(dms_E2_Projects_27),\"\",dms_E2_Projects_27)","v":""}]
[null,{"$f":"IF(ISBLANK(dms_E2_Projects_28),\"\",dms_E2_Projects_28)","v":""}]
[null,{"$f":"IF(ISBLANK(dms_E2_Projects_29),\"\",dms_E2_Projects_29)","v":""}]
[null,{"$f":"IF(ISBLANK(dms_E2_Projects_30),\"\",dms_E2_Projects_30)","v":""}]
[null,{"$f":"IF(ISBLANK(dms_E2_Projects_31),\"\",dms_E2_Projects_31)","v":""}]
[null,{"$f":"IF(ISBLANK(dms_E2_Projects_32),\"\",dms_E2_Projects_32)","v":""}]
[null,{"$f":"IF(ISBLANK(dms_E2_Projects_33),\"\",dms_E2_Projects_33)","v":""}]
[null,{"$f":"IF(ISBLANK(dms_E2_Projects_34),\"\",dms_E2_Projects_34)","v":""}]
[null,{"$f":"IF(ISBLANK(dms_E2_Projects_35),\"\",dms_E2_Projects_35)","v":""}]
[null,{"$f":"IF(ISBLANK(dms_E2_Projects_36),\"\",dms_E2_Projects_36)","v":""}]
[null,{"$f":"IF(ISBLANK(dms_E2_Projects_37),\"\",dms_E2_Projects_37)","v":""}]
[null,{"$f":"IF(ISBLANK(dms_E2_Projects_38),\"\",dms_E2_Projects_38)","v":""}]
[null,{"$f":"IF(ISBLANK(dms_E2_Projects_39),\"\",dms_E2_Projects_39)","v":""}]
[null,{"$f":"IF(ISBLANK(dms_E2_Projects_40),\"\",dms_E2_Projects_40)","v":""}]
[null,{"$f":"IF(ISBLANK(dms_E2_Projects_41),\"\",dms_E2_Projects_41)","v":""}]
[null,{"$f":"IF(ISBLANK(dms_E2_Projects_42),\"\",dms_E2_Projects_42)","v":""}]
[null,{"$f":"IF(ISBLANK(dms_E2_Projects_43),\"\",dms_E2_Projects_43)","v":""}]
[null,{"$f":"IF(ISBLANK(dms_E2_Projects_44),\"\",dms_E2_Projects_44)","v":""}]
[null,{"$f":"IF(ISBLANK(dms_E2_Projects_45),\"\",dms_E2_Projects_45)","v":""}]
[null,{"$f":"IF(ISBLANK(dms_E2_Projects_46),\"\",dms_E2_Projects_46)","v":""}]
[null,{"$f":"IF(ISBLANK(dms_E2_Projects_47),\"\",dms_E2_Projects_47)","v":""}]
[null,{"$f":"IF(ISBLANK(dms_E2_Projects_48),\"\",dms_E2_Projects_48)","v":""}]
[null,{"$f":"IF(ISBLANK(dms_E2_Projects_49),\"\",dms_E2_Projects_49)","v":""}]
[null,{"$f":"IF(ISBLANK(dms_E2_Projects_50),\"\",dms_E2_Projects_50)","v":""}]
[null,"Other projects with expenditure of less than $500,000"]
[null,null,"Total",{"$f":"SUM(D181:D231)","v":3742663.0353602339},{"$f":"SUM(E181:E231)","v":4071998.2974299989},5435440.7425259994,4962837.1049999986,4489484.9799999995,5204283.3499999987,3536929.6999999997]
[]
[null,"D. OTHER DIRECT EXPENDITURE"]
[null,null,null,"EXPENDITURE"]
[null,null,null,{"$f":"CONCATENATE(\"$0's, real \",dms_DollarReal)","v":"$0's, real June 2023"}]
[null,null,null,{"$f":"VLOOKUP(CRCP_y4,'AER lookups'!$B$52:$C$101,2,0)","v":2022},{"$f":"CONCATENATE(\"1 Jan-30 Jun \"&(D237+1))","v":"1 Jan-30 Jun 2023"},{"$f":"FRCP_y1","v":"2023-24"},{"$f":"FRCP_y2","v":"2024-25"},{"$f":"FRCP_y3","v":"2025-26"},{"$f":"FRCP_y4","v":"2026-27"},{"$f":"FRCP_y5","v":"2027-28"}]
[null,{"$f":"IF(ISBLANK(dms_E2_Projects_01),\"\",dms_E2_Projects_01)","v":"LP - Ascot Vale"},null,null,0,0,0,0,0,0]
[null,{"$f":"IF(ISBLANK(dms_E2_Projects_02),\"\",dms_E2_Projects_02)","v":"LP - Geelong West"},null,null,0,0,0,0,0,0]
[null,{"$f":"IF(ISBLANK(dms_E2_Projects_03),\"\",dms_E2_Projects_03)","v":"LP - Geelong"},null,null,0,0,0,0,0,0]
[null,{"$f":"IF(ISBLANK(dms_E2_Projects_04),\"\",dms_E2_Projects_04)","v":"LP - Colac"},null,null,0,0,0,0,0,0]
[null,{"$f":"IF(ISBLANK(dms_E2_Projects_05),\"\",dms_E2_Projects_05)","v":"LP - Warrnambool"},null,null,0,0,0,0,0,0]
[null,{"$f":"IF(ISBLANK(dms_E2_Projects_06),\"\",dms_E2_Projects_06)","v":"LP - Hamilton"},null,null,0,0,0,0,0,0]
[null,{"$f":"IF(ISBLANK(dms_E2_Projects_07),\"\",dms_E2_Projects_07)","v":"LP - Portland"},null,null,0,0,0,0,0,0]
[null,{"$f":"IF(ISBLANK(dms_E2_Projects_08),\"\",dms_E2_Projects_08)","v":"LP - Ballarat"},null,null,0,0,0,0,0,0]
[null,{"$f":"IF(ISBLANK(dms_E2_Projects_09),\"\",dms_E2_Projects_09)","v":"LP - Ararat"},null,null,0,0,0,0,0,0]
[null,{"$f":"IF(ISBLANK(dms_E2_Projects_10),\"\",dms_E2_Projects_10)","v":"LP - Stawell"},null,null,0,0,0,0,0,0]
[null,{"$f":"IF(ISBLANK(dms_E2_Projects_11),\"\",dms_E2_Projects_11)","v":"LP - Horsham"},null,null,0,0,0,0,0,0]
[null,{"$f":"IF(ISBLANK(dms_E2_Projects_12),\"\",dms_E2_Projects_12)","v":"LP - Bendigo"},null,null,0,0,0,0,0,0]
[null,{"$f":"IF(ISBLANK(dms_E2_Projects_13),\"\",dms_E2_Projects_13)","v":"MP - Altona North"},null,null,0,0,0,0,0,0]
[null,{"$f":"IF(ISBLANK(dms_E2_Projects_14),\"\",dms_E2_Projects_14)","v":"MP - Braybrook"},null,null,0,0,0,0,0,0]
[null,{"$f":"IF(ISBLANK(dms_E2_Projects_15),\"\",dms_E2_Projects_15)","v":"MP - Sunshine"},null,null,0,0,0,0,0,0]
[null,{"$f":"IF(ISBLANK(dms_E2_Projects_16),\"\",dms_E2_Projects_16)","v":"MP - Footscray"},null,null,0,0,0,0,0,0]
[null,{"$f":"IF(ISBLANK(dms_E2_Projects_17),\"\",dms_E2_Projects_17)","v":"MP - St Albans"},null,null,0,0,0,0,0,0]
[null,{"$f":"IF(ISBLANK(dms_E2_Projects_18),\"\",dms_E2_Projects_18)","v":"MP - Maidstone"},null,null,0,0,0,0,0,0]
[null,{"$f":"IF(ISBLANK(dms_E2_Projects_19),\"\",dms_E2_Projects_19)","v":"HP - Melton"},null,null,0,0,0,0,0,0]
[null,{"$f":"IF(ISBLANK(dms_E2_Projects_20),\"\",dms_E2_Projects_20)","v":"Exposed Pipework"},null,null,0,0,0,0,0,0]
[null,{"$f":"IF(ISBLANK(dms_E2_Projects_21),\"\",dms_E2_Projects_21)","v":"LP Mains CY22"},null,0]
[null,{"$f":"IF(ISBLANK(dms_E2_Projects_22),\"\",dms_E2_Projects_22)","v":"MP Mains CY22"},null,0]
[null,{"$f":"IF(ISBLANK(dms_E2_Projects_23),\"\",dms_E2_Projects_23)","v":"HP Mains CY22"},null,0]
[null,{"$f":"IF(ISBLANK(dms_E2_Projects_24),\"\",dms_E2_Projects_24)","v":""}]
[null,{"$f":"IF(ISBLANK(dms_E2_Projects_25),\"\",dms_E2_Projects_25)","v":""}]
[null,{"$f":"IF(ISBLANK(dms_E2_Projects_26),\"\",dms_E2_Projects_26)","v":""}]
[null,{"$f":"IF(ISBLANK(dms_E2_Projects_27),\"\",dms_E2_Projects_27)","v":""}]
[null,{"$f":"IF(ISBLANK(dms_E2_Projects_28),\"\",dms_E2_Projects_28)","v":""}]
[null,{"$f":"IF(ISBLANK(dms_E2_Projects_29),\"\",dms_E2_Projects_29)","v":""}]
[null,{"$f":"IF(ISBLANK(dms_E2_Projects_30),\"\",dms_E2_Projects_30)","v":""}]
[null,{"$f":"IF(ISBLANK(dms_E2_Projects_31),\"\",dms_E2_Projects_31)","v":""}]
[null,{"$f":"IF(ISBLANK(dms_E2_Projects_32),\"\",dms_E2_Projects_32)","v":""}]
[null,{"$f":"IF(ISBLANK(dms_E2_Projects_33),\"\",dms_E2_Projects_33)","v":""}]
[null,{"$f":"IF(ISBLANK(dms_E2_Projects_34),\"\",dms_E2_Projects_34)","v":""}]
[null,{"$f":"IF(ISBLANK(dms_E2_Projects_35),\"\",dms_E2_Projects_35)","v":""}]
[null,{"$f":"IF(ISBLANK(dms_E2_Projects_36),\"\",dms_E2_Projects_36)","v":""}]
[null,{"$f":"IF(ISBLANK(dms_E2_Projects_37),\"\",dms_E2_Projects_37)","v":""}]
[null,{"$f":"IF(ISBLANK(dms_E2_Projects_38),\"\",dms_E2_Projects_38)","v":""}]
[null,{"$f":"IF(ISBLANK(dms_E2_Projects_39),\"\",dms_E2_Projects_39)","v":""}]
[null,{"$f":"IF(ISBLANK(dms_E2_Projects_40),\"\",dms_E2_Projects_40)","v":""}]
[null,{"$f":"IF(ISBLANK(dms_E2_Projects_41),\"\",dms_E2_Projects_41)","v":""}]
[null,{"$f":"IF(ISBLANK(dms_E2_Projects_42),\"\",dms_E2_Projects_42)","v":""}]
[null,{"$f":"IF(ISBLANK(dms_E2_Projects_43),\"\",dms_E2_Projects_43)","v":""}]
[null,{"$f":"IF(ISBLANK(dms_E2_Projects_44),\"\",dms_E2_Projects_44)","v":""}]
[null,{"$f":"IF(ISBLANK(dms_E2_Projects_45),\"\",dms_E2_Projects_45)","v":""}]
[null,{"$f":"IF(ISBLANK(dms_E2_Projects_46),\"\",dms_E2_Projects_46)","v":""}]
[null,{"$f":"IF(ISBLANK(dms_E2_Projects_47),\"\",dms_E2_Projects_47)","v":""}]
[null,{"$f":"IF(ISBLANK(dms_E2_Projects_48),\"\",dms_E2_Projects_48)","v":""}]
[null,{"$f":"IF(ISBLANK(dms_E2_Projects_49),\"\",dms_E2_Projects_49)","v":""}]
[null,{"$f":"IF(ISBLANK(dms_E2_Projects_50),\"\",dms_E2_Projects_50)","v":""}]
[null,"Other projects with expenditure of less than $500,000"]
[null,null,"Total",{"$f":"SUM(D238:D288)","v":0},{"$f":"SUM(E238:E288)","v":0},0,0,0,0,0]
[]
[null,"E. RELATED PARTY MARGIN EXPENDITURE"]
[null,null,null,"EXPENDITURE"]
[null,null,null,{"$f":"CONCATENATE(\"$0's, real \",dms_DollarReal)","v":"$0's, real June 2023"}]
[null,null,null,{"$f":"VLOOKUP(CRCP_y4,'AER lookups'!$B$52:$C$101,2,0)","v":2022},{"$f":"CONCATENATE(\"1 Jan-30 Jun \"&(D294+1))","v":"1 Jan-30 Jun 2023"},{"$f":"FRCP_y1","v":"2023-24"},{"$f":"FRCP_y2","v":"2024-25"},{"$f":"FRCP_y3","v":"2025-26"},{"$f":"FRCP_y4","v":"2026-27"},{"$f":"FRCP_y5","v":"2027-28"}]
[null,{"$f":"IF(ISBLANK(dms_E2_Projects_01),\"\",dms_E2_Projects_01)","v":"LP - Ascot Vale"},null,null,0,0,0,0,0,0]
[null,{"$f":"IF(ISBLANK(dms_E2_Projects_02),\"\",dms_E2_Projects_02)","v":"LP - Geelong West"},null,null,0,0,0,0,0,0]
[null,{"$f":"IF(ISBLANK(dms_E2_Projects_03),\"\",dms_E2_Projects_03)","v":"LP - Geelong"},null,null,0,0,0,0,0,0]
[null,{"$f":"IF(ISBLANK(dms_E2_Projects_04),\"\",dms_E2_Projects_04)","v":"LP - Colac"},null,null,0,0,0,0,0,0]
[null,{"$f":"IF(ISBLANK(dms_E2_Projects_05),\"\",dms_E2_Projects_05)","v":"LP - Warrnambool"},null,null,0,0,0,0,0,0]
[null,{"$f":"IF(ISBLANK(dms_E2_Projects_06),\"\",dms_E2_Projects_06)","v":"LP - Hamilton"},null,null,0,0,0,0,0,0]
[null,{"$f":"IF(ISBLANK(dms_E2_Projects_07),\"\",dms_E2_Projects_07)","v":"LP - Portland"},null,null,0,0,0,0,0,0]
[null,{"$f":"IF(ISBLANK(dms_E2_Projects_08),\"\",dms_E2_Projects_08)","v":"LP - Ballarat"},null,null,0,0,0,0,0,0]
[null,{"$f":"IF(ISBLANK(dms_E2_Projects_09),\"\",dms_E2_Projects_09)","v":"LP - Ararat"},null,null,0,0,0,0,0,0]
[null,{"$f":"IF(ISBLANK(dms_E2_Projects_10),\"\",dms_E2_Projects_10)","v":"LP - Stawell"},null,null,0,0,0,0,0,0]
[null,{"$f":"IF(ISBLANK(dms_E2_Projects_11),\"\",dms_E2_Projects_11)","v":"LP - Horsham"},null,null,0,0,0,0,0,0]
[null,{"$f":"IF(ISBLANK(dms_E2_Projects_12),\"\",dms_E2_Projects_12)","v":"LP - Bendigo"},null,null,0,0,0,0,0,0]
[null,{"$f":"IF(ISBLANK(dms_E2_Projects_13),\"\",dms_E2_Projects_13)","v":"MP - Altona North"},null,null,0,0,0,0,0,0]
[null,{"$f":"IF(ISBLANK(dms_E2_Projects_14),\"\",dms_E2_Projects_14)","v":"MP - Braybrook"},null,null,0,0,0,0,0,0]
[null,{"$f":"IF(ISBLANK(dms_E2_Projects_15),\"\",dms_E2_Projects_15)","v":"MP - Sunshine"},null,null,0,0,0,0,0,0]
[null,{"$f":"IF(ISBLANK(dms_E2_Projects_16),\"\",dms_E2_Projects_16)","v":"MP - Footscray"},null,null,0,0,0,0,0,0]
[null,{"$f":"IF(ISBLANK(dms_E2_Projects_17),\"\",dms_E2_Projects_17)","v":"MP - St Albans"},null,null,0,0,0,0,0,0]
[null,{"$f":"IF(ISBLANK(dms_E2_Projects_18),\"\",dms_E2_Projects_18)","v":"MP - Maidstone"},null,null,0,0,0,0,0,0]
[null,{"$f":"IF(ISBLANK(dms_E2_Projects_19),\"\",dms_E2_Projects_19)","v":"HP - Melton"},null,null,0,0,0,0,0,0]
[null,{"$f":"IF(ISBLANK(dms_E2_Projects_20),\"\",dms_E2_Projects_20)","v":"Exposed Pipework"},null,null,0,0,0,0,0,0]
[null,{"$f":"IF(ISBLANK(dms_E2_Projects_21),\"\",dms_E2_Projects_21)","v":"LP Mains CY22"},null,0]
[null,{"$f":"IF(ISBLANK(dms_E2_Projects_22),\"\",dms_E2_Projects_22)","v":"MP Mains CY22"},null,0]
[null,{"$f":"IF(ISBLANK(dms_E2_Projects_23),\"\",dms_E2_Projects_23)","v":"HP Mains CY22"},null,0]
[null,{"$f":"IF(ISBLANK(dms_E2_Projects_24),\"\",dms_E2_Projects_24)","v":""}]
[null,{"$f":"IF(ISBLANK(dms_E2_Projects_25),\"\",dms_E2_Projects_25)","v":""}]
[null,{"$f":"IF(ISBLANK(dms_E2_Projects_26),\"\",dms_E2_Projects_26)","v":""}]
[null,{"$f":"IF(ISBLANK(dms_E2_Projects_27),\"\",dms_E2_Projects_27)","v":""}]
[null,{"$f":"IF(ISBLANK(dms_E2_Projects_28),\"\",dms_E2_Projects_28)","v":""}]
[null,{"$f":"IF(ISBLANK(dms_E2_Projects_29),\"\",dms_E2_Projects_29)","v":""}]
[null,{"$f":"IF(ISBLANK(dms_E2_Projects_30),\"\",dms_E2_Projects_30)","v":""}]
[null,{"$f":"IF(ISBLANK(dms_E2_Projects_31),\"\",dms_E2_Projects_31)","v":""}]
[null,{"$f":"IF(ISBLANK(dms_E2_Projects_32),\"\",dms_E2_Projects_32)","v":""}]
[null,{"$f":"IF(ISBLANK(dms_E2_Projects_33),\"\",dms_E2_Projects_33)","v":""}]
[null,{"$f":"IF(ISBLANK(dms_E2_Projects_34),\"\",dms_E2_Projects_34)","v":""}]
[null,{"$f":"IF(ISBLANK(dms_E2_Projects_35),\"\",dms_E2_Projects_35)","v":""}]
[null,{"$f":"IF(ISBLANK(dms_E2_Projects_36),\"\",dms_E2_Projects_36)","v":""}]
[null,{"$f":"IF(ISBLANK(dms_E2_Projects_37),\"\",dms_E2_Projects_37)","v":""}]
[null,{"$f":"IF(ISBLANK(dms_E2_Projects_38),\"\",dms_E2_Projects_38)","v":""}]
[null,{"$f":"IF(ISBLANK(dms_E2_Projects_39),\"\",dms_E2_Projects_39)","v":""}]
[null,{"$f":"IF(ISBLANK(dms_E2_Projects_40),\"\",dms_E2_Projects_40)","v":""}]
[null,{"$f":"IF(ISBLANK(dms_E2_Projects_41),\"\",dms_E2_Projects_41)","v":""}]
[null,{"$f":"IF(ISBLANK(dms_E2_Projects_42),\"\",dms_E2_Projects_42)","v":""}]
[null,{"$f":"IF(ISBLANK(dms_E2_Projects_43),\"\",dms_E2_Projects_43)","v":""}]
[null,{"$f":"IF(ISBLANK(dms_E2_Projects_44),\"\",dms_E2_Projects_44)","v":""}]
[null,{"$f":"IF(ISBLANK(dms_E2_Projects_45),\"\",dms_E2_Projects_45)","v":""}]
[null,{"$f":"IF(ISBLANK(dms_E2_Projects_46),\"\",dms_E2_Projects_46)","v":""}]
[null,{"$f":"IF(ISBLANK(dms_E2_Projects_47),\"\",dms_E2_Projects_47)","v":""}]
[null,{"$f":"IF(ISBLANK(dms_E2_Projects_48),\"\",dms_E2_Projects_48)","v":""}]
[null,{"$f":"IF(ISBLANK(dms_E2_Projects_49),\"\",dms_E2_Projects_49)","v":""}]
[null,{"$f":"IF(ISBLANK(dms_E2_Projects_50),\"\",dms_E2_Projects_50)","v":""}]
[null,"Other projects with expenditure of less than $500,000"]
[null,null,"Total",{"$f":"SUM(D295:D345)","v":0},{"$f":"SUM(E295:E345)","v":0},0,0,0,0,0]
[]
[null,"F. CAPITAL CONTRIBUTIONS included in the above"]
[null,null,null,"EXPENDITURE"]
[null,null,null,{"$f":"CONCATENATE(\"$0's, real \",dms_DollarReal)","v":"$0's, real June 2023"}]
[null,null,null,{"$f":"VLOOKUP(CRCP_y4,'AER lookups'!$B$52:$C$101,2,0)","v":2022},{"$f":"CONCATENATE(\"1 Jan-30 Jun \"&(D351+1))","v":"1 Jan-30 Jun 2023"},{"$f":"FRCP_y1","v":"2023-24"},{"$f":"FRCP_y2","v":"2024-25"},{"$f":"FRCP_y3","v":"2025-26"},{"$f":"FRCP_y4","v":"2026-27"},{"$f":"FRCP_y5","v":"2027-28"}]
[null,{"$f":"IF(ISBLANK(dms_E2_Projects_01),\"\",dms_E2_Projects_01)","v":"LP - Ascot Vale"},null,null,0,0,0,0,0,0]
[null,{"$f":"IF(ISBLANK(dms_E2_Projects_02),\"\",dms_E2_Projects_02)","v":"LP - Geelong West"},null,null,0,0,0,0,0,0]
[null,{"$f":"IF(ISBLANK(dms_E2_Projects_03),\"\",dms_E2_Projects_03)","v":"LP - Geelong"},null,null,0,0,0,0,0,0]
[null,{"$f":"IF(ISBLANK(dms_E2_Projects_04),\"\",dms_E2_Projects_04)","v":"LP - Colac"},null,null,0,0,0,0,0,0]
[null,{"$f":"IF(ISBLANK(dms_E2_Projects_05),\"\",dms_E2_Projects_05)","v":"LP - Warrnambool"},null,null,0,0,0,0,0,0]
[null,{"$f":"IF(ISBLANK(dms_E2_Projects_06),\"\",dms_E2_Projects_06)","v":"LP - Hamilton"},null,null,0,0,0,0,0,0]
[null,{"$f":"IF(ISBLANK(dms_E2_Projects_07),\"\",dms_E2_Projects_07)","v":"LP - Portland"},null,null,0,0,0,0,0,0]
[null,{"$f":"IF(ISBLANK(dms_E2_Projects_08),\"\",dms_E2_Projects_08)","v":"LP - Ballarat"},null,null,0,0,0,0,0,0]
[null,{"$f":"IF(ISBLANK(dms_E2_Projects_09),\"\",dms_E2_Projects_09)","v":"LP - Ararat"},null,null,0,0,0,0,0,0]
[null,{"$f":"IF(ISBLANK(dms_E2_Projects_10),\"\",dms_E2_Projects_10)","v":"LP - Stawell"},null,null,0,0,0,0,0,0]
[null,{"$f":"IF(ISBLANK(dms_E2_Projects_11),\"\",dms_E2_Projects_11)","v":"LP - Horsham"},null,null,0,0,0,0,0,0]
[null,{"$f":"IF(ISBLANK(dms_E2_Projects_12),\"\",dms_E2_Projects_12)","v":"LP - Bendigo"},null,null,0,0,0,0,0,0]
[null,{"$f":"IF(ISBLANK(dms_E2_Projects_13),\"\",dms_E2_Projects_13)","v":"MP - Altona North"},null,null,0,0,0,0,0,0]
[null,{"$f":"IF(ISBLANK(dms_E2_Projects_14),\"\",dms_E2_Projects_14)","v":"MP - Braybrook"},null,null,0,0,0,0,0,0]
[null,{"$f":"IF(ISBLANK(dms_E2_Projects_15),\"\",dms_E2_Projects_15)","v":"MP - Sunshine"},null,null,0,0,0,0,0,0]
[null,{"$f":"IF(ISBLANK(dms_E2_Projects_16),\"\",dms_E2_Projects_16)","v":"MP - Footscray"},null,null,0,0,0,0,0,0]
[null,{"$f":"IF(ISBLANK(dms_E2_Projects_17),\"\",dms_E2_Projects_17)","v":"MP - St Albans"},null,null,0,0,0,0,0,0]
[null,{"$f":"IF(ISBLANK(dms_E2_Projects_18),\"\",dms_E2_Projects_18)","v":"MP - Maidstone"},null,null,0,0,0,0,0,0]
[null,{"$f":"IF(ISBLANK(dms_E2_Projects_19),\"\",dms_E2_Projects_19)","v":"HP - Melton"},null,null,0,0,0,0,0,0]
[null,{"$f":"IF(ISBLANK(dms_E2_Projects_20),\"\",dms_E2_Projects_20)","v":"Exposed Pipework"},null,null,0,0,0,0,0,0]
[null,{"$f":"IF(ISBLANK(dms_E2_Projects_21),\"\",dms_E2_Projects_21)","v":"LP Mains CY22"},null,0]
[null,{"$f":"IF(ISBLANK(dms_E2_Projects_22),\"\",dms_E2_Projects_22)","v":"MP Mains CY22"},null,0]
[null,{"$f":"IF(ISBLANK(dms_E2_Projects_23),\"\",dms_E2_Projects_23)","v":"HP Mains CY22"},null,0]
[null,{"$f":"IF(ISBLANK(dms_E2_Projects_24),\"\",dms_E2_Projects_24)","v":""}]
[null,{"$f":"IF(ISBLANK(dms_E2_Projects_25),\"\",dms_E2_Projects_25)","v":""}]
[null,{"$f":"IF(ISBLANK(dms_E2_Projects_26),\"\",dms_E2_Projects_26)","v":""}]
[null,{"$f":"IF(ISBLANK(dms_E2_Projects_27),\"\",dms_E2_Projects_27)","v":""}]
[null,{"$f":"IF(ISBLANK(dms_E2_Projects_28),\"\",dms_E2_Projects_28)","v":""}]
[null,{"$f":"IF(ISBLANK(dms_E2_Projects_29),\"\",dms_E2_Projects_29)","v":""}]
[null,{"$f":"IF(ISBLANK(dms_E2_Projects_30),\"\",dms_E2_Projects_30)","v":""}]
[null,{"$f":"IF(ISBLANK(dms_E2_Projects_31),\"\",dms_E2_Projects_31)","v":""}]
[null,{"$f":"IF(ISBLANK(dms_E2_Projects_32),\"\",dms_E2_Projects_32)","v":""}]
[null,{"$f":"IF(ISBLANK(dms_E2_Projects_33),\"\",dms_E2_Projects_33)","v":""}]
[null,{"$f":"IF(ISBLANK(dms_E2_Projects_34),\"\",dms_E2_Projects_34)","v":""}]
[null,{"$f":"IF(ISBLANK(dms_E2_Projects_35),\"\",dms_E2_Projects_35)","v":""}]
[null,{"$f":"IF(ISBLANK(dms_E2_Projects_36),\"\",dms_E2_Projects_36)","v":""}]
[null,{"$f":"IF(ISBLANK(dms_E2_Projects_37),\"\",dms_E2_Projects_37)","v":""}]
[null,{"$f":"IF(ISBLANK(dms_E2_Projects_38),\"\",dms_E2_Projects_38)","v":""}]
[null,{"$f":"IF(ISBLANK(dms_E2_Projects_39),\"\",dms_E2_Projects_39)","v":""}]
[null,{"$f":"IF(ISBLANK(dms_E2_Projects_40),\"\",dms_E2_Projects_40)","v":""}]
[null,{"$f":"IF(ISBLANK(dms_E2_Projects_41),\"\",dms_E2_Projects_41)","v":""}]
[null,{"$f":"IF(ISBLANK(dms_E2_Projects_42),\"\",dms_E2_Projects_42)","v":""}]
[null,{"$f":"IF(ISBLANK(dms_E2_Projects_43),\"\",dms_E2_Projects_43)","v":""}]
[null,{"$f":"IF(ISBLANK(dms_E2_Projects_44),\"\",dms_E2_Projects_44)","v":""}]
[null,{"$f":"IF(ISBLANK(dms_E2_Projects_45),\"\",dms_E2_Projects_45)","v":""}]
[null,{"$f":"IF(ISBLANK(dms_E2_Projects_46),\"\",dms_E2_Projects_46)","v":""}]
[null,{"$f":"IF(ISBLANK(dms_E2_Projects_47),\"\",dms_E2_Projects_47)","v":""}]
[null,{"$f":"IF(ISBLANK(dms_E2_Projects_48),\"\",dms_E2_Projects_48)","v":""}]
[null,{"$f":"IF(ISBLANK(dms_E2_Projects_49),\"\",dms_E2_Projects_49)","v":""}]
[null,{"$f":"IF(ISBLANK(dms_E2_Projects_50),\"\",dms_E2_Projects_50)","v":""}]
[null,"Other projects with expenditure of less than $500,000"]
[null,null,"Total",{"$f":"SUM(D352:D402)","v":0},{"$f":"SUM(E352:E402)","v":0},0,0,0,0,0]
[]
[]
[]
[null,"E2.1.2 - REACTIVE - BY CONNECTION TYPE"]
[null,null,null,"EXPENDITURE"]
[null,null,null,{"$f":"CONCATENATE(\"$0's, real \",dms_DollarReal)","v":"$0's, real June 2023"}]
[null,null,null,{"$f":"VLOOKUP(CRCP_y4,'AER lookups'!$B$52:$C$101,2,0)","v":2022},{"$f":"CONCATENATE(\"1 Jan-30 Jun \"&(D410+1))","v":"1 Jan-30 Jun 2023"},{"$f":"FRCP_y1","v":"2023-24"},{"$f":"FRCP_y2","v":"2024-25"},{"$f":"FRCP_y3","v":"2025-26"},{"$f":"FRCP_y4","v":"2026-27"},{"$f":"FRCP_y5","v":"2027-28"}]
[null,"A. DIRECT INTERNAL LABOUR EXPENDITURE"]
[null,"Mains",null,16320.352158272599,8430.1655070390261,20949.095021562614,18575.146084868586,16204.244083926767,13768.606258179172,11266.295006935017]
[null,"Services",null,16320.352158272599,8430.1655070390261,22897.201572656963,21272.380234891942,19695.001556701918,18092.577981451617,16464.706007458961]
[null,null,"Total",{"$f":"SUM(D412:D413)","v":32640.704316545198},{"$f":"SUM(E412:E413)","v":16860.331014078052},{"$f":"SUM(F412:F413)","v":43846.296594219573},{"$f":"SUM(G412:G413)","v":39847.526319760524},{"$f":"SUM(H412:H413)","v":35899.245640628687},{"$f":"SUM(I412:I413)","v":31861.184239630791},{"$f":"SUM(J412:J413)","v":27731.00101439398}]
[null,"B. DIRECT CONTRACTOR EXPENDITURE"]
[null,"Mains",null,310086.69100717938,159345.19915733329,394002.09536238061,346650.8687243663,299112.1445416052,251385.64028942311,203458.9598843538]
[null,"Services",null,310086.69100717938,159345.19915733329,430641.29444617475,396986.86915131746,363547.60653221386,330332.22209050314,297337.49711127137]
[null,null,"Total",{"$f":"SUM(D416:D417)","v":620173.38201435877},{"$f":"SUM(E416:E417)","v":318690.39831466659},{"$f":"SUM(F416:F417)","v":824643.38980855537},{"$f":"SUM(G416:G417)","v":743637.7378756837},{"$f":"SUM(H416:H417)","v":662659.75107381912},{"$f":"SUM(I416:I417)","v":581717.86237992626},{"$f":"SUM(J416:J417)","v":500796.45699562517}]
[null,"C. DIRECT MATERIAL EXPENDITURE"]
[null,"Mains",null,1249575.3948580306,575654.80964666652,1090236.2910107872,969817.15895662014,860007.0846992255,759734.89587884396,668037.00326191867]
[null,"Services",null,1249575.3948580306,575654.80964666652,1099878.1855065227,983063.47485844942,876963.78522306995,780510.3121422861,692741.8814795285]
[null,null,"Total",{"$f":"SUM(D420:D421)","v":2499150.7897160612},{"$f":"SUM(E420:E421)","v":1151309.619293333},{"$f":"SUM(F420:F421)","v":2190114.4765173099},{"$f":"SUM(G420:G421)","v":1952880.6338150697},{"$f":"SUM(H420:H421)","v":1736970.8699222954},{"$f":"SUM(I420:I421)","v":1540245.2080211299},{"$f":"SUM(J420:J421)","v":1360778.8847414472}]
[null,"D. OTHER DIRECT EXPENDITURE"]
[null,"Mains",null,0,0,0,0,0,0,0]
[null,"Services",null,0,0,0,0,0,0,0]
[null,null,"Total",{"$f":"SUM(D424:D425)","v":0},{"$f":"SUM(E424:E425)","v":0},{"$f":"SUM(F424:F425)","v":0},{"$f":"SUM(G424:G425)","v":0},{"$f":"SUM(H424:H425)","v":0},{"$f":"SUM(I424:I425)","v":0},{"$f":"SUM(J424:J425)","v":0}]
[null,"E. RELATED PARTY MARGIN EXPENDITURE"]
[null,"Mains",null,0,0,0,0,0,0,0]
[null,"Services",null,0,0,0,0,0,0,0]
[null,null,"Total",{"$f":"SUM(D428:D429)","v":0},{"$f":"SUM(E428:E429)","v":0},{"$f":"SUM(F428:F429)","v":0},{"$f":"SUM(G428:G429)","v":0},{"$f":"SUM(H428:H429)","v":0},{"$f":"SUM(I428:I429)","v":0},{"$f":"SUM(J428:J429)","v":0}]
[null,"F. CAPITAL CONTRIBUTIONS included in the above"]
[null,"Mains",null,0,0,0,0,0,0,0]
[null,"Services",null,0,0,0,0,0,0,0]
[null,null,"Total",{"$f":"SUM(D432:D433)","v":0},{"$f":"SUM(E432:E433)","v":0},{"$f":"SUM(F432:F433)","v":0},{"$f":"SUM(G432:G433)","v":0},{"$f":"SUM(H432:H433)","v":0},{"$f":"SUM(I432:I433)","v":0},{"$f":"SUM(J432:J433)","v":0}]
[null,null,"TOTAL",{"$f":"SUM(D434,D430,D426,D422,D418,D414)","v":3151964.8760469654},{"$f":"SUM(E434,E430,E426,E422,E418,E414)","v":1486860.3486220776},3058604.1629200852,2736365.8980105137,2435529.8666367433,2153824.2546406868,1889306.3427514664]
[]
[]
[]
[null,"E2.2 - VOLUMES"]
[null,"E2.2.1 - PROACTIVE - BY CONNECTION TYPE - BY PROJECT"]
[null,null,null,"LENGTH"]
[null,null,null,"0s, metres"]
[null,null,null,{"$f":"VLOOKUP(CRCP_y4,'AER lookups'!$B$52:$C$101,2,0)","v":2022},{"$f":"CONCATENATE(\"1 Jan-30 Jun \"&(D443+1))","v":"1 Jan-30 Jun 2023"},{"$f":"FRCP_y1","v":"2023-24"},{"$f":"FRCP_y2","v":"2024-25"},{"$f":"FRCP_y3","v":"2025-26"},{"$f":"FRCP_y4","v":"2026-27"},{"$f":"FRCP_y5","v":"2027-28"}]
[null,"A. LOW PRESSURE TO HIGH PRESSURE"]
[null,{"$f":"IF(ISBLANK(dms_E2_Projects_01),\"\",dms_E2_Projects_01)","v":"LP - Ascot Vale"}]
[null,{"$f":"IF(ISBLANK(dms_E2_Projects_02),\"\",dms_E2_Projects_02)","v":"LP - Geelong West"}]
[null,{"$f":"IF(ISBLANK(dms_E2_Projects_03),\"\",dms_E2_Projects_03)","v":"LP - Geelong"}]
[null,{"$f":"IF(ISBLANK(dms_E2_Projects_04),\"\",dms_E2_Projects_04)","v":"LP - Colac"}]
[null,{"$f":"IF(ISBLANK(dms_E2_Projects_05),\"\",dms_E2_Projects_05)","v":"LP - Warrnambool"}]
[null,{"$f":"IF(ISBLANK(dms_E2_Projects_06),\"\",dms_E2_Projects_06)","v":"LP - Hamilton"}]
[null,{"$f":"IF(ISBLANK(dms_E2_Projects_07),\"\",dms_E2_Projects_07)","v":"LP - Portland"}]
[null,{"$f":"IF(ISBLANK(dms_E2_Projects_08),\"\",dms_E2_Projects_08)","v":"LP - Ballarat"}]
[null,{"$f":"IF(ISBLANK(dms_E2_Projects_09),\"\",dms_E2_Projects_09)","v":"LP - Ararat"}]
[null,{"$f":"IF(ISBLANK(dms_E2_Projects_10),\"\",dms_E2_Projects_10)","v":"LP - Stawell"}]
[null,{"$f":"IF(ISBLANK(dms_E2_Projects_11),\"\",dms_E2_Projects_11)","v":"LP - Horsham"}]
[null,{"$f":"IF(ISBLANK(dms_E2_Projects_12),\"\",dms_E2_Projects_12)","v":"LP - Bendigo"}]
[null,{"$f":"IF(ISBLANK(dms_E2_Projects_13),\"\",dms_E2_Projects_13)","v":"MP - Altona North"}]
[null,{"$f":"IF(ISBLANK(dms_E2_Projects_14),\"\",dms_E2_Projects_14)","v":"MP - Braybrook"}]
[null,{"$f":"IF(ISBLANK(dms_E2_Projects_15),\"\",dms_E2_Projects_15)","v":"MP - Sunshine"}]
[null,{"$f":"IF(ISBLANK(dms_E2_Projects_16),\"\",dms_E2_Projects_16)","v":"MP - Footscray"}]
[null,{"$f":"IF(ISBLANK(dms_E2_Projects_17),\"\",dms_E2_Projects_17)","v":"MP - St Albans"}]
[null,{"$f":"IF(ISBLANK(dms_E2_Projects_18),\"\",dms_E2_Projects_18)","v":"MP - Maidstone"}]
[null,{"$f":"IF(ISBLANK(dms_E2_Projects_19),\"\",dms_E2_Projects_19)","v":"HP - Melton"}]
[null,{"$f":"IF(ISBLANK(dms_E2_Projects_20),\"\",dms_E2_Projects_20)","v":"Exposed Pipework"}]
[null,{"$f":"IF(ISBLANK(dms_E2_Projects_21),\"\",dms_E2_Projects_21)","v":"LP Mains CY22"}]
[null,{"$f":"IF(ISBLANK(dms_E2_Projects_22),\"\",dms_E2_Projects_22)","v":"MP Mains CY22"}]
[null,{"$f":"IF(ISBLANK(dms_E2_Projects_23),\"\",dms_E2_Projects_23)","v":"HP Mains CY22"}]
[null,{"$f":"IF(ISBLANK(dms_E2_Projects_24),\"\",dms_E2_Projects_24)","v":""}]
[null,{"$f":"IF(ISBLANK(dms_E2_Projects_25),\"\",dms_E2_Projects_25)","v":""}]
[null,{"$f":"IF(ISBLANK(dms_E2_Projects_26),\"\",dms_E2_Projects_26)","v":""}]
[null,{"$f":"IF(ISBLANK(dms_E2_Projects_27),\"\",dms_E2_Projects_27)","v":""}]
[null,{"$f":"IF(ISBLANK(dms_E2_Projects_28),\"\",dms_E2_Projects_28)","v":""}]
[null,{"$f":"IF(ISBLANK(dms_E2_Projects_29),\"\",dms_E2_Projects_29)","v":""}]
[null,{"$f":"IF(ISBLANK(dms_E2_Projects_30),\"\",dms_E2_Projects_30)","v":""}]
[null,{"$f":"IF(ISBLANK(dms_E2_Projects_31),\"\",dms_E2_Projects_31)","v":""}]
[null,{"$f":"IF(ISBLANK(dms_E2_Projects_32),\"\",dms_E2_Projects_32)","v":""}]
[null,{"$f":"IF(ISBLANK(dms_E2_Projects_33),\"\",dms_E2_Projects_33)","v":""}]
[null,{"$f":"IF(ISBLANK(dms_E2_Projects_34),\"\",dms_E2_Projects_34)","v":""}]
[null,{"$f":"IF(ISBLANK(dms_E2_Projects_35),\"\",dms_E2_Projects_35)","v":""}]
[null,{"$f":"IF(ISBLANK(dms_E2_Projects_36),\"\",dms_E2_Projects_36)","v":""}]
[null,{"$f":"IF(ISBLANK(dms_E2_Projects_37),\"\",dms_E2_Projects_37)","v":""}]
[null,{"$f":"IF(ISBLANK(dms_E2_Projects_38),\"\",dms_E2_Projects_38)","v":""}]
[null,{"$f":"IF(ISBLANK(dms_E2_Projects_39),\"\",dms_E2_Projects_39)","v":""}]
[null,{"$f":"IF(ISBLANK(dms_E2_Projects_40),\"\",dms_E2_Projects_40)","v":""}]
[null,{"$f":"IF(ISBLANK(dms_E2_Projects_41),\"\",dms_E2_Projects_41)","v":""}]
[null,{"$f":"IF(ISBLANK(dms_E2_Projects_42),\"\",dms_E2_Projects_42)","v":""}]
[null,{"$f":"IF(ISBLANK(dms_E2_Projects_43),\"\",dms_E2_Projects_43)","v":""}]
[null,{"$f":"IF(ISBLANK(dms_E2_Projects_44),\"\",dms_E2_Projects_44)","v":""}]
[null,{"$f":"IF(ISBLANK(dms_E2_Projects_45),\"\",dms_E2_Projects_45)","v":""}]
[null,{"$f":"IF(ISBLANK(dms_E2_Projects_46),\"\",dms_E2_Projects_46)","v":""}]
[null,{"$f":"IF(ISBLANK(dms_E2_Projects_47),\"\",dms_E2_Projects_47)","v":""}]
[null,{"$f":"IF(ISBLANK(dms_E2_Projects_48),\"\",dms_E2_Projects_48)","v":""}]
[null,{"$f":"IF(ISBLANK(dms_E2_Projects_49),\"\",dms_E2_Projects_49)","v":""}]
[null,{"$f":"IF(ISBLANK(dms_E2_Projects_50),\"\",dms_E2_Projects_50)","v":""}]
[null,"Aggregate of other projects with total expenditure of less than $500,000"]
[null,null,"Total",{"$f":"SUM(D445:D495)","v":0},{"$f":"SUM(E445:E495)","v":0},0,0,0,0,0]
[]
[null,"B. LOW PRESSURE TO MEDIUM PRESSURE"]
[null,{"$f":"IF(ISBLANK(dms_E2_Projects_01),\"\",dms_E2_Projects_01)","v":"LP - Ascot Vale"}]
[null,{"$f":"IF(ISBLANK(dms_E2_Projects_02),\"\",dms_E2_Projects_02)","v":"LP - Geelong West"}]
[null,{"$f":"IF(ISBLANK(dms_E2_Projects_03),\"\",dms_E2_Projects_03)","v":"LP - Geelong"}]
[null,{"$f":"IF(ISBLANK(dms_E2_Projects_04),\"\",dms_E2_Projects_04)","v":"LP - Colac"}]
[null,{"$f":"IF(ISBLANK(dms_E2_Projects_05),\"\",dms_E2_Projects_05)","v":"LP - Warrnambool"}]
[null,{"$f":"IF(ISBLANK(dms_E2_Projects_06),\"\",dms_E2_Projects_06)","v":"LP - Hamilton"}]
[null,{"$f":"IF(ISBLANK(dms_E2_Projects_07),\"\",dms_E2_Projects_07)","v":"LP - Portland"}]
[null,{"$f":"IF(ISBLANK(dms_E2_Projects_08),\"\",dms_E2_Projects_08)","v":"LP - Ballarat"}]
[null,{"$f":"IF(ISBLANK(dms_E2_Projects_09),\"\",dms_E2_Projects_09)","v":"LP - Ararat"}]
[null,{"$f":"IF(ISBLANK(dms_E2_Projects_10),\"\",dms_E2_Projects_10)","v":"LP - Stawell"}]
[null,{"$f":"IF(ISBLANK(dms_E2_Projects_11),\"\",dms_E2_Projects_11)","v":"LP - Horsham"}]
[null,{"$f":"IF(ISBLANK(dms_E2_Projects_12),\"\",dms_E2_Projects_12)","v":"LP - Bendigo"}]
[null,{"$f":"IF(ISBLANK(dms_E2_Projects_13),\"\",dms_E2_Projects_13)","v":"MP - Altona North"}]
[null,{"$f":"IF(ISBLANK(dms_E2_Projects_14),\"\",dms_E2_Projects_14)","v":"MP - Braybrook"}]
[null,{"$f":"IF(ISBLANK(dms_E2_Projects_15),\"\",dms_E2_Projects_15)","v":"MP - Sunshine"}]
[null,{"$f":"IF(ISBLANK(dms_E2_Projects_16),\"\",dms_E2_Projects_16)","v":"MP - Footscray"}]
[null,{"$f":"IF(ISBLANK(dms_E2_Projects_17),\"\",dms_E2_Projects_17)","v":"MP - St Albans"}]
[null,{"$f":"IF(ISBLANK(dms_E2_Projects_18),\"\",dms_E2_Projects_18)","v":"MP - Maidstone"}]
[null,{"$f":"IF(ISBLANK(dms_E2_Projects_19),\"\",dms_E2_Projects_19)","v":"HP - Melton"}]
[null,{"$f":"IF(ISBLANK(dms_E2_Projects_20),\"\",dms_E2_Projects_20)","v":"Exposed Pipework"}]
[null,{"$f":"IF(ISBLANK(dms_E2_Projects_21),\"\",dms_E2_Projects_21)","v":"LP Mains CY22"}]
[null,{"$f":"IF(ISBLANK(dms_E2_Projects_22),\"\",dms_E2_Projects_22)","v":"MP Mains CY22"}]
[null,{"$f":"IF(ISBLANK(dms_E2_Projects_23),\"\",dms_E2_Projects_23)","v":"HP Mains CY22"}]
[null,{"$f":"IF(ISBLANK(dms_E2_Projects_24),\"\",dms_E2_Projects_24)","v":""}]
[null,{"$f":"IF(ISBLANK(dms_E2_Projects_25),\"\",dms_E2_Projects_25)","v":""}]
[null,{"$f":"IF(ISBLANK(dms_E2_Projects_26),\"\",dms_E2_Projects_26)","v":""}]
[null,{"$f":"IF(ISBLANK(dms_E2_Projects_27),\"\",dms_E2_Projects_27)","v":""}]
[null,{"$f":"IF(ISBLANK(dms_E2_Projects_28),\"\",dms_E2_Projects_28)","v":""}]
[null,{"$f":"IF(ISBLANK(dms_E2_Projects_29),\"\",dms_E2_Projects_29)","v":""}]
[null,{"$f":"IF(ISBLANK(dms_E2_Projects_30),\"\",dms_E2_Projects_30)","v":""}]
[null,{"$f":"IF(ISBLANK(dms_E2_Projects_31),\"\",dms_E2_Projects_31)","v":""}]
[null,{"$f":"IF(ISBLANK(dms_E2_Projects_32),\"\",dms_E2_Projects_32)","v":""}]
[null,{"$f":"IF(ISBLANK(dms_E2_Projects_33),\"\",dms_E2_Projects_33)","v":""}]
[null,{"$f":"IF(ISBLANK(dms_E2_Projects_34),\"\",dms_E2_Projects_34)","v":""}]
[null,{"$f":"IF(ISBLANK(dms_E2_Projects_35),\"\",dms_E2_Projects_35)","v":""}]
[null,{"$f":"IF(ISBLANK(dms_E2_Projects_36),\"\",dms_E2_Projects_36)","v":""}]
[null,{"$f":"IF(ISBLANK(dms_E2_Projects_37),\"\",dms_E2_Projects_37)","v":""}]
[null,{"$f":"IF(ISBLANK(dms_E2_Projects_38),\"\",dms_E2_Projects_38)","v":""}]
[null,{"$f":"IF(ISBLANK(dms_E2_Projects_39),\"\",dms_E2_Projects_39)","v":""}]
[null,{"$f":"IF(ISBLANK(dms_E2_Projects_40),\"\",dms_E2_Projects_40)","v":""}]
[null,{"$f":"IF(ISBLANK(dms_E2_Projects_41),\"\",dms_E2_Projects_41)","v":""}]
[null,{"$f":"IF(ISBLANK(dms_E2_Projects_42),\"\",dms_E2_Projects_42)","v":""}]
[null,{"$f":"IF(ISBLANK(dms_E2_Projects_43),\"\",dms_E2_Projects_43)","v":""}]
[null,{"$f":"IF(ISBLANK(dms_E2_Projects_44),\"\",dms_E2_Projects_44)","v":""}]
[null,{"$f":"IF(ISBLANK(dms_E2_Projects_45),\"\",dms_E2_Projects_45)","v":""}]
[null,{"$f":"IF(ISBLANK(dms_E2_Projects_46),\"\",dms_E2_Projects_46)","v":""}]
[null,{"$f":"IF(ISBLANK(dms_E2_Projects_47),\"\",dms_E2_Projects_47)","v":""}]
[null,{"$f":"IF(ISBLANK(dms_E2_Projects_48),\"\",dms_E2_Projects_48)","v":""}]
[null,{"$f":"IF(ISBLANK(dms_E2_Projects_49),\"\",dms_E2_Projects_49)","v":""}]
[null,{"$f":"IF(ISBLANK(dms_E2_Projects_50),\"\",dms_E2_Projects_50)","v":""}]
[null,"Aggregate of other projects with total expenditure of less than $500,000"]
[null,null,"Total",{"$f":"SUM(D499:D549)","v":0},{"$f":"SUM(E499:E549)","v":0},0,0,0,0,0]
[]
[null,"C. LOW PRESSURE TO LOW PRESSURE"]
[null,{"$f":"IF(ISBLANK(dms_E2_Projects_01),\"\",dms_E2_Projects_01)","v":"LP - Ascot Vale"}]
[null,{"$f":"IF(ISBLANK(dms_E2_Projects_02),\"\",dms_E2_Projects_02)","v":"LP - Geelong West"}]
[null,{"$f":"IF(ISBLANK(dms_E2_Projects_03),\"\",dms_E2_Projects_03)","v":"LP - Geelong"}]
[null,{"$f":"IF(ISBLANK(dms_E2_Projects_04),\"\",dms_E2_Projects_04)","v":"LP - Colac"}]
[null,{"$f":"IF(ISBLANK(dms_E2_Projects_05),\"\",dms_E2_Projects_05)","v":"LP - Warrnambool"}]
[null,{"$f":"IF(ISBLANK(dms_E2_Projects_06),\"\",dms_E2_Projects_06)","v":"LP - Hamilton"}]
[null,{"$f":"IF(ISBLANK(dms_E2_Projects_07),\"\",dms_E2_Projects_07)","v":"LP - Portland"}]
[null,{"$f":"IF(ISBLANK(dms_E2_Projects_08),\"\",dms_E2_Projects_08)","v":"LP - Ballarat"}]
[null,{"$f":"IF(ISBLANK(dms_E2_Projects_09),\"\",dms_E2_Projects_09)","v":"LP - Ararat"}]
[null,{"$f":"IF(ISBLANK(dms_E2_Projects_10),\"\",dms_E2_Projects_10)","v":"LP - Stawell"}]
[null,{"$f":"IF(ISBLANK(dms_E2_Projects_11),\"\",dms_E2_Projects_11)","v":"LP - Horsham"}]
[null,{"$f":"IF(ISBLANK(dms_E2_Projects_12),\"\",dms_E2_Projects_12)","v":"LP - Bendigo"}]
[null,{"$f":"IF(ISBLANK(dms_E2_Projects_13),\"\",dms_E2_Projects_13)","v":"MP - Altona North"}]
[null,{"$f":"IF(ISBLANK(dms_E2_Projects_14),\"\",dms_E2_Projects_14)","v":"MP - Braybrook"}]
[null,{"$f":"IF(ISBLANK(dms_E2_Projects_15),\"\",dms_E2_Projects_15)","v":"MP - Sunshine"}]
[null,{"$f":"IF(ISBLANK(dms_E2_Projects_16),\"\",dms_E2_Projects_16)","v":"MP - Footscray"}]
[null,{"$f":"IF(ISBLANK(dms_E2_Projects_17),\"\",dms_E2_Projects_17)","v":"MP - St Albans"}]
[null,{"$f":"IF(ISBLANK(dms_E2_Projects_18),\"\",dms_E2_Projects_18)","v":"MP - Maidstone"}]
[null,{"$f":"IF(ISBLANK(dms_E2_Projects_18),\"\",dms_E2_Projects_18)","v":"MP - Maidstone"}]
[null,{"$f":"IF(ISBLANK(dms_E2_Projects_19),\"\",dms_E2_Projects_19)","v":"HP - Melton"}]
[null,{"$f":"IF(ISBLANK(dms_E2_Projects_20),\"\",dms_E2_Projects_20)","v":"Exposed Pipework"}]
[null,{"$f":"IF(ISBLANK(dms_E2_Projects_21),\"\",dms_E2_Projects_21)","v":"LP Mains CY22"}]
[null,{"$f":"IF(ISBLANK(dms_E2_Projects_22),\"\",dms_E2_Projects_22)","v":"MP Mains CY22"}]
[null,{"$f":"IF(ISBLANK(dms_E2_Projects_23),\"\",dms_E2_Projects_23)","v":"HP Mains CY22"}]
[null,{"$f":"IF(ISBLANK(dms_E2_Projects_24),\"\",dms_E2_Projects_24)","v":""}]
[null,{"$f":"IF(ISBLANK(dms_E2_Projects_25),\"\",dms_E2_Projects_26)","v":""}]
[null,{"$f":"IF(ISBLANK(dms_E2_Projects_27),\"\",dms_E2_Projects_27)","v":""}]
[null,{"$f":"IF(ISBLANK(dms_E2_Projects_28),\"\",dms_E2_Projects_28)","v":""}]
[null,{"$f":"IF(ISBLANK(dms_E2_Projects_29),\"\",dms_E2_Projects_29)","v":""}]
[null,{"$f":"IF(ISBLANK(dms_E2_Projects_30),\"\",dms_E2_Projects_30)","v":""}]
[null,{"$f":"IF(ISBLANK(dms_E2_Projects_31),\"\",dms_E2_Projects_31)","v":""}]
[null,{"$f":"IF(ISBLANK(dms_E2_Projects_32),\"\",dms_E2_Projects_32)","v":""}]
[null,{"$f":"IF(ISBLANK(dms_E2_Projects_33),\"\",dms_E2_Projects_33)","v":""}]
[null,{"$f":"IF(ISBLANK(dms_E2_Projects_34),\"\",dms_E2_Projects_34)","v":""}]
[null,{"$f":"IF(ISBLANK(dms_E2_Projects_35),\"\",dms_E2_Projects_35)","v":""}]
[null,{"$f":"IF(ISBLANK(dms_E2_Projects_36),\"\",dms_E2_Projects_36)","v":""}]
[null,{"$f":"IF(ISBLANK(dms_E2_Projects_37),\"\",dms_E2_Projects_37)","v":""}]
[null,{"$f":"IF(ISBLANK(dms_E2_Projects_38),\"\",dms_E2_Projects_38)","v":""}]
[null,{"$f":"IF(ISBLANK(dms_E2_Projects_39),\"\",dms_E2_Projects_39)","v":""}]
[null,{"$f":"IF(ISBLANK(dms_E2_Projects_40),\"\",dms_E2_Projects_40)","v":""}]
[null,{"$f":"IF(ISBLANK(dms_E2_Projects_41),\"\",dms_E2_Projects_41)","v":""}]
[null,{"$f":"IF(ISBLANK(dms_E2_Projects_42),\"\",dms_E2_Projects_42)","v":""}]
[null,{"$f":"IF(ISBLANK(dms_E2_Projects_43),\"\",dms_E2_Projects_43)","v":""}]
[null,{"$f":"IF(ISBLANK(dms_E2_Projects_44),\"\",dms_E2_Projects_44)","v":""}]
[null,{"$f":"IF(ISBLANK(dms_E2_Projects_45),\"\",dms_E2_Projects_45)","v":""}]
[null,{"$f":"IF(ISBLANK(dms_E2_Projects_46),\"\",dms_E2_Projects_46)","v":""}]
[null,{"$f":"IF(ISBLANK(dms_E2_Projects_47),\"\",dms_E2_Projects_47)","v":""}]
[null,{"$f":"IF(ISBLANK(dms_E2_Projects_48),\"\",dms_E2_Projects_48)","v":""}]
[null,{"$f":"IF(ISBLANK(dms_E2_Projects_49),\"\",dms_E2_Projects_49)","v":""}]
[null,{"$f":"IF(ISBLANK(dms_E2_Projects_50),\"\",dms_E2_Projects_50)","v":""}]
[null,"Aggregate of other projects with total expenditure of less than $500,000"]
[null,null,"Total",{"$f":"SUM(D553:D603)","v":0},{"$f":"SUM(E553:E603)","v":0},0,0,0,0,0]
[]
[null,"D. MEDIUM PRESSURE TO MEDIUM PRESSURE"]
[null,{"$f":"IF(ISBLANK(dms_E2_Projects_01),\"\",dms_E2_Projects_01)","v":"LP - Ascot Vale"}]
[null,{"$f":"IF(ISBLANK(dms_E2_Projects_02),\"\",dms_E2_Projects_02)","v":"LP - Geelong West"}]
[null,{"$f":"IF(ISBLANK(dms_E2_Projects_03),\"\",dms_E2_Projects_03)","v":"LP - Geelong"}]
[null,{"$f":"IF(ISBLANK(dms_E2_Projects_04),\"\",dms_E2_Projects_04)","v":"LP - Colac"}]
[null,{"$f":"IF(ISBLANK(dms_E2_Projects_05),\"\",dms_E2_Projects_05)","v":"LP - Warrnambool"}]
[null,{"$f":"IF(ISBLANK(dms_E2_Projects_06),\"\",dms_E2_Projects_06)","v":"LP - Hamilton"}]
[null,{"$f":"IF(ISBLANK(dms_E2_Projects_07),\"\",dms_E2_Projects_07)","v":"LP - Portland"}]
[null,{"$f":"IF(ISBLANK(dms_E2_Projects_08),\"\",dms_E2_Projects_08)","v":"LP - Ballarat"}]
[null,{"$f":"IF(ISBLANK(dms_E2_Projects_09),\"\",dms_E2_Projects_09)","v":"LP - Ararat"}]
[null,{"$f":"IF(ISBLANK(dms_E2_Projects_10),\"\",dms_E2_Projects_10)","v":"LP - Stawell"}]
[null,{"$f":"IF(ISBLANK(dms_E2_Projects_11),\"\",dms_E2_Projects_11)","v":"LP - Horsham"}]
[null,{"$f":"IF(ISBLANK(dms_E2_Projects_12),\"\",dms_E2_Projects_12)","v":"LP - Bendigo"}]
[null,{"$f":"IF(ISBLANK(dms_E2_Projects_13),\"\",dms_E2_Projects_13)","v":"MP - Altona North"}]
[null,{"$f":"IF(ISBLANK(dms_E2_Projects_14),\"\",dms_E2_Projects_14)","v":"MP - Braybrook"}]
[null,{"$f":"IF(ISBLANK(dms_E2_Projects_15),\"\",dms_E2_Projects_15)","v":"MP - Sunshine"}]
[null,{"$f":"IF(ISBLANK(dms_E2_Projects_16),\"\",dms_E2_Projects_16)","v":"MP - Footscray"}]
[null,{"$f":"IF(ISBLANK(dms_E2_Projects_17),\"\",dms_E2_Projects_17)","v":"MP - St Albans"}]
[null,{"$f":"IF(ISBLANK(dms_E2_Projects_18),\"\",dms_E2_Projects_18)","v":"MP - Maidstone"}]
[null,{"$f":"IF(ISBLANK(dms_E2_Projects_19),\"\",dms_E2_Projects_19)","v":"HP - Melton"}]
[null,{"$f":"IF(ISBLANK(dms_E2_Projects_20),\"\",dms_E2_Projects_20)","v":"Exposed Pipework"}]
[null,{"$f":"IF(ISBLANK(dms_E2_Projects_21),\"\",dms_E2_Projects_21)","v":"LP Mains CY22"}]
[null,{"$f":"IF(ISBLANK(dms_E2_Projects_22),\"\",dms_E2_Projects_22)","v":"MP Mains CY22"}]
[null,{"$f":"IF(ISBLANK(dms_E2_Projects_23),\"\",dms_E2_Projects_23)","v":"HP Mains CY22"}]
[null,{"$f":"IF(ISBLANK(dms_E2_Projects_24),\"\",dms_E2_Projects_24)","v":""}]
[null,{"$f":"IF(ISBLANK(dms_E2_Projects_25),\"\",dms_E2_Projects_25)","v":""}]
[null,{"$f":"IF(ISBLANK(dms_E2_Projects_26),\"\",dms_E2_Projects_26)","v":""}]
[null,{"$f":"IF(ISBLANK(dms_E2_Projects_27),\"\",dms_E2_Projects_27)","v":""}]
[null,{"$f":"IF(ISBLANK(dms_E2_Projects_28),\"\",dms_E2_Projects_28)","v":""}]
[null,{"$f":"IF(ISBLANK(dms_E2_Projects_29),\"\",dms_E2_Projects_29)","v":""}]
[null,{"$f":"IF(ISBLANK(dms_E2_Projects_30),\"\",dms_E2_Projects_30)","v":""}]
[null,{"$f":"IF(ISBLANK(dms_E2_Projects_31),\"\",dms_E2_Projects_31)","v":""}]
[null,{"$f":"IF(ISBLANK(dms_E2_Projects_32),\"\",dms_E2_Projects_32)","v":""}]
[null,{"$f":"IF(ISBLANK(dms_E2_Projects_33),\"\",dms_E2_Projects_33)","v":""}]
[null,{"$f":"IF(ISBLANK(dms_E2_Projects_34),\"\",dms_E2_Projects_34)","v":""}]
[null,{"$f":"IF(ISBLANK(dms_E2_Projects_35),\"\",dms_E2_Projects_35)","v":""}]
[null,{"$f":"IF(ISBLANK(dms_E2_Projects_36),\"\",dms_E2_Projects_36)","v":""}]
[null,{"$f":"IF(ISBLANK(dms_E2_Projects_37),\"\",dms_E2_Projects_37)","v":""}]
[null,{"$f":"IF(ISBLANK(dms_E2_Projects_38),\"\",dms_E2_Projects_38)","v":""}]
[null,{"$f":"IF(ISBLANK(dms_E2_Projects_39),\"\",dms_E2_Projects_39)","v":""}]
[null,{"$f":"IF(ISBLANK(dms_E2_Projects_40),\"\",dms_E2_Projects_40)","v":""}]
[null,{"$f":"IF(ISBLANK(dms_E2_Projects_41),\"\",dms_E2_Projects_41)","v":""}]
[null,{"$f":"IF(ISBLANK(dms_E2_Projects_42),\"\",dms_E2_Projects_42)","v":""}]
[null,{"$f":"IF(ISBLANK(dms_E2_Projects_43),\"\",dms_E2_Projects_43)","v":""}]
[null,{"$f":"IF(ISBLANK(dms_E2_Projects_44),\"\",dms_E2_Projects_44)","v":""}]
[null,{"$f":"IF(ISBLANK(dms_E2_Projects_45),\"\",dms_E2_Projects_45)","v":""}]
[null,{"$f":"IF(ISBLANK(dms_E2_Projects_46),\"\",dms_E2_Projects_46)","v":""}]
[null,{"$f":"IF(ISBLANK(dms_E2_Projects_47),\"\",dms_E2_Projects_47)","v":""}]
[null,{"$f":"IF(ISBLANK(dms_E2_Projects_48),\"\",dms_E2_Projects_48)","v":""}]
[null,{"$f":"IF(ISBLANK(dms_E2_Projects_49),\"\",dms_E2_Projects_49)","v":""}]
[null,{"$f":"IF(ISBLANK(dms_E2_Projects_50),\"\",dms_E2_Projects_50)","v":""}]
[null,"Aggregate of other projects with total expenditure of less than $500,000"]
[null,null,"Total",{"$f":"SUM(D607:D657)","v":0},{"$f":"SUM(E607:E657)","v":0},0,0,0,0,0]
[]
[null,"E. MEDIUM PRESSURE TO HIGH PRESSURE"]
[null,{"$f":"IF(ISBLANK(dms_E2_Projects_01),\"\",dms_E2_Projects_01)","v":"LP - Ascot Vale"}]
[null,{"$f":"IF(ISBLANK(dms_E2_Projects_02),\"\",dms_E2_Projects_02)","v":"LP - Geelong West"}]
[null,{"$f":"IF(ISBLANK(dms_E2_Projects_03),\"\",dms_E2_Projects_03)","v":"LP - Geelong"}]
[null,{"$f":"IF(ISBLANK(dms_E2_Projects_04),\"\",dms_E2_Projects_04)","v":"LP - Colac"}]
[null,{"$f":"IF(ISBLANK(dms_E2_Projects_05),\"\",dms_E2_Projects_05)","v":"LP - Warrnambool"}]
[null,{"$f":"IF(ISBLANK(dms_E2_Projects_06),\"\",dms_E2_Projects_06)","v":"LP - Hamilton"}]
[null,{"$f":"IF(ISBLANK(dms_E2_Projects_07),\"\",dms_E2_Projects_07)","v":"LP - Portland"}]
[null,{"$f":"IF(ISBLANK(dms_E2_Projects_08),\"\",dms_E2_Projects_08)","v":"LP - Ballarat"}]
[null,{"$f":"IF(ISBLANK(dms_E2_Projects_09),\"\",dms_E2_Projects_09)","v":"LP - Ararat"}]
[null,{"$f":"IF(ISBLANK(dms_E2_Projects_10),\"\",dms_E2_Projects_10)","v":"LP - Stawell"}]
[null,{"$f":"IF(ISBLANK(dms_E2_Projects_11),\"\",dms_E2_Projects_11)","v":"LP - Horsham"}]
[null,{"$f":"IF(ISBLANK(dms_E2_Projects_12),\"\",dms_E2_Projects_12)","v":"LP - Bendigo"}]
[null,{"$f":"IF(ISBLANK(dms_E2_Projects_13),\"\",dms_E2_Projects_13)","v":"MP - Altona North"}]
[null,{"$f":"IF(ISBLANK(dms_E2_Projects_14),\"\",dms_E2_Projects_14)","v":"MP - Braybrook"}]
[null,{"$f":"IF(ISBLANK(dms_E2_Projects_15),\"\",dms_E2_Projects_15)","v":"MP - Sunshine"}]
[null,{"$f":"IF(ISBLANK(dms_E2_Projects_16),\"\",dms_E2_Projects_16)","v":"MP - Footscray"}]
[null,{"$f":"IF(ISBLANK(dms_E2_Projects_17),\"\",dms_E2_Projects_17)","v":"MP - St Albans"}]
[null,{"$f":"IF(ISBLANK(dms_E2_Projects_18),\"\",dms_E2_Projects_18)","v":"MP - Maidstone"}]
[null,{"$f":"IF(ISBLANK(dms_E2_Projects_19),\"\",dms_E2_Projects_19)","v":"HP - Melton"}]
[null,{"$f":"IF(ISBLANK(dms_E2_Projects_20),\"\",dms_E2_Projects_20)","v":"Exposed Pipework"}]
[null,{"$f":"IF(ISBLANK(dms_E2_Projects_21),\"\",dms_E2_Projects_21)","v":"LP Mains CY22"}]
[null,{"$f":"IF(ISBLANK(dms_E2_Projects_22),\"\",dms_E2_Projects_22)","v":"MP Mains CY22"}]
[null,{"$f":"IF(ISBLANK(dms_E2_Projects_23),\"\",dms_E2_Projects_23)","v":"HP Mains CY22"}]
[null,{"$f":"IF(ISBLANK(dms_E2_Projects_24),\"\",dms_E2_Projects_24)","v":""}]
[null,{"$f":"IF(ISBLANK(dms_E2_Projects_25),\"\",dms_E2_Projects_25)","v":""}]
[null,{"$f":"IF(ISBLANK(dms_E2_Projects_26),\"\",dms_E2_Projects_26)","v":""}]
[null,{"$f":"IF(ISBLANK(dms_E2_Projects_27),\"\",dms_E2_Projects_27)","v":""}]
[null,{"$f":"IF(ISBLANK(dms_E2_Projects_28),\"\",dms_E2_Projects_28)","v":""}]
[null,{"$f":"IF(ISBLANK(dms_E2_Projects_29),\"\",dms_E2_Projects_29)","v":""}]
[null,{"$f":"IF(ISBLANK(dms_E2_Projects_30),\"\",dms_E2_Projects_30)","v":""}]
[null,{"$f":"IF(ISBLANK(dms_E2_Projects_31),\"\",dms_E2_Projects_31)","v":""}]
[null,{"$f":"IF(ISBLANK(dms_E2_Projects_32),\"\",dms_E2_Projects_32)","v":""}]
[null,{"$f":"IF(ISBLANK(dms_E2_Projects_33),\"\",dms_E2_Projects_33)","v":""}]
[null,{"$f":"IF(ISBLANK(dms_E2_Projects_34),\"\",dms_E2_Projects_34)","v":""}]
[null,{"$f":"IF(ISBLANK(dms_E2_Projects_35),\"\",dms_E2_Projects_35)","v":""}]
[null,{"$f":"IF(ISBLANK(dms_E2_Projects_36),\"\",dms_E2_Projects_36)","v":""}]
[null,{"$f":"IF(ISBLANK(dms_E2_Projects_37),\"\",dms_E2_Projects_37)","v":""}]
[null,{"$f":"IF(ISBLANK(dms_E2_Projects_38),\"\",dms_E2_Projects_38)","v":""}]
[null,{"$f":"IF(ISBLANK(dms_E2_Projects_39),\"\",dms_E2_Projects_39)","v":""}]
[null,{"$f":"IF(ISBLANK(dms_E2_Projects_40),\"\",dms_E2_Projects_40)","v":""}]
[null,{"$f":"IF(ISBLANK(dms_E2_Projects_41),\"\",dms_E2_Projects_41)","v":""}]
[null,{"$f":"IF(ISBLANK(dms_E2_Projects_42),\"\",dms_E2_Projects_42)","v":""}]
[null,{"$f":"IF(ISBLANK(dms_E2_Projects_43),\"\",dms_E2_Projects_43)","v":""}]
[null,{"$f":"IF(ISBLANK(dms_E2_Projects_44),\"\",dms_E2_Projects_44)","v":""}]
[null,{"$f":"IF(ISBLANK(dms_E2_Projects_45),\"\",dms_E2_Projects_45)","v":""}]
[null,{"$f":"IF(ISBLANK(dms_E2_Projects_46),\"\",dms_E2_Projects_46)","v":""}]
[null,{"$f":"IF(ISBLANK(dms_E2_Projects_47),\"\",dms_E2_Projects_47)","v":""}]
[null,{"$f":"IF(ISBLANK(dms_E2_Projects_48),\"\",dms_E2_Projects_48)","v":""}]
[null,{"$f":"IF(ISBLANK(dms_E2_Projects_49),\"\",dms_E2_Projects_49)","v":""}]
[null,{"$f":"IF(ISBLANK(dms_E2_Projects_50),\"\",dms_E2_Projects_50)","v":""}]
[null,"Aggregate of other projects with total expenditure of less than $500,000"]
[null,null,"Total",{"$f":"SUM(D661:D711)","v":0},{"$f":"SUM(E661:E711)","v":0},0,0,0,0,0]
[]
[null,"F. HIGH PRESSURE TO HIGH PRESSURE"]
[null,{"$f":"IF(ISBLANK(dms_E2_Projects_01),\"\",dms_E2_Projects_01)","v":"LP - Ascot Vale"}]
[null,{"$f":"IF(ISBLANK(dms_E2_Projects_02),\"\",dms_E2_Projects_02)","v":"LP - Geelong West"}]
[null,{"$f":"IF(ISBLANK(dms_E2_Projects_03),\"\",dms_E2_Projects_03)","v":"LP - Geelong"}]
[null,{"$f":"IF(ISBLANK(dms_E2_Projects_04),\"\",dms_E2_Projects_04)","v":"LP - Colac"}]
[null,{"$f":"IF(ISBLANK(dms_E2_Projects_05),\"\",dms_E2_Projects_05)","v":"LP - Warrnambool"}]
[null,{"$f":"IF(ISBLANK(dms_E2_Projects_06),\"\",dms_E2_Projects_06)","v":"LP - Hamilton"}]
[null,{"$f":"IF(ISBLANK(dms_E2_Projects_07),\"\",dms_E2_Projects_07)","v":"LP - Portland"}]
[null,{"$f":"IF(ISBLANK(dms_E2_Projects_08),\"\",dms_E2_Projects_08)","v":"LP - Ballarat"}]
[null,{"$f":"IF(ISBLANK(dms_E2_Projects_09),\"\",dms_E2_Projects_09)","v":"LP - Ararat"}]
[null,{"$f":"IF(ISBLANK(dms_E2_Projects_10),\"\",dms_E2_Projects_10)","v":"LP - Stawell"}]
[null,{"$f":"IF(ISBLANK(dms_E2_Projects_11),\"\",dms_E2_Projects_11)","v":"LP - Horsham"}]
[null,{"$f":"IF(ISBLANK(dms_E2_Projects_12),\"\",dms_E2_Projects_12)","v":"LP - Bendigo"}]
[null,{"$f":"IF(ISBLANK(dms_E2_Projects_13),\"\",dms_E2_Projects_13)","v":"MP - Altona North"}]
[null,{"$f":"IF(ISBLANK(dms_E2_Projects_14),\"\",dms_E2_Projects_14)","v":"MP - Braybrook"}]
[null,{"$f":"IF(ISBLANK(dms_E2_Projects_15),\"\",dms_E2_Projects_15)","v":"MP - Sunshine"}]
[null,{"$f":"IF(ISBLANK(dms_E2_Projects_16),\"\",dms_E2_Projects_16)","v":"MP - Footscray"}]
[null,{"$f":"IF(ISBLANK(dms_E2_Projects_17),\"\",dms_E2_Projects_17)","v":"MP - St Albans"}]
[null,{"$f":"IF(ISBLANK(dms_E2_Projects_18),\"\",dms_E2_Projects_18)","v":"MP - Maidstone"}]
[null,{"$f":"IF(ISBLANK(dms_E2_Projects_19),\"\",dms_E2_Projects_19)","v":"HP - Melton"}]
[null,{"$f":"IF(ISBLANK(dms_E2_Projects_20),\"\",dms_E2_Projects_20)","v":"Exposed Pipework"}]
[null,{"$f":"IF(ISBLANK(dms_E2_Projects_21),\"\",dms_E2_Projects_21)","v":"LP Mains CY22"}]
[null,{"$f":"IF(ISBLANK(dms_E2_Projects_22),\"\",dms_E2_Projects_22)","v":"MP Mains CY22"}]
[null,{"$f":"IF(ISBLANK(dms_E2_Projects_23),\"\",dms_E2_Projects_23)","v":"HP Mains CY22"}]
[null,{"$f":"IF(ISBLANK(dms_E2_Projects_24),\"\",dms_E2_Projects_24)","v":""}]
[null,{"$f":"IF(ISBLANK(dms_E2_Projects_25),\"\",dms_E2_Projects_25)","v":""}]
[null,{"$f":"IF(ISBLANK(dms_E2_Projects_26),\"\",dms_E2_Projects_26)","v":""}]
[null,{"$f":"IF(ISBLANK(dms_E2_Projects_27),\"\",dms_E2_Projects_27)","v":""}]
[null,{"$f":"IF(ISBLANK(dms_E2_Projects_28),\"\",dms_E2_Projects_28)","v":""}]
[null,{"$f":"IF(ISBLANK(dms_E2_Projects_29),\"\",dms_E2_Projects_29)","v":""}]
[null,{"$f":"IF(ISBLANK(dms_E2_Projects_30),\"\",dms_E2_Projects_30)","v":""}]
[null,{"$f":"IF(ISBLANK(dms_E2_Projects_31),\"\",dms_E2_Projects_31)","v":""}]
[null,{"$f":"IF(ISBLANK(dms_E2_Projects_32),\"\",dms_E2_Projects_32)","v":""}]
[null,{"$f":"IF(ISBLANK(dms_E2_Projects_33),\"\",dms_E2_Projects_33)","v":""}]
[null,{"$f":"IF(ISBLANK(dms_E2_Projects_34),\"\",dms_E2_Projects_34)","v":""}]
[null,{"$f":"IF(ISBLANK(dms_E2_Projects_35),\"\",dms_E2_Projects_35)","v":""}]
[null,{"$f":"IF(ISBLANK(dms_E2_Projects_36),\"\",dms_E2_Projects_36)","v":""}]
[null,{"$f":"IF(ISBLANK(dms_E2_Projects_37),\"\",dms_E2_Projects_37)","v":""}]
[null,{"$f":"IF(ISBLANK(dms_E2_Projects_38),\"\",dms_E2_Projects_38)","v":""}]
[null,{"$f":"IF(ISBLANK(dms_E2_Projects_39),\"\",dms_E2_Projects_39)","v":""}]
[null,{"$f":"IF(ISBLANK(dms_E2_Projects_40),\"\",dms_E2_Projects_40)","v":""}]
[null,{"$f":"IF(ISBLANK(dms_E2_Projects_41),\"\",dms_E2_Projects_41)","v":""}]
[null,{"$f":"IF(ISBLANK(dms_E2_Projects_42),\"\",dms_E2_Projects_42)","v":""}]
[null,{"$f":"IF(ISBLANK(dms_E2_Projects_43),\"\",dms_E2_Projects_43)","v":""}]
[null,{"$f":"IF(ISBLANK(dms_E2_Projects_44),\"\",dms_E2_Projects_44)","v":""}]
[null,{"$f":"IF(ISBLANK(dms_E2_Projects_45),\"\",dms_E2_Projects_45)","v":""}]
[null,{"$f":"IF(ISBLANK(dms_E2_Projects_46),\"\",dms_E2_Projects_46)","v":""}]
[null,{"$f":"IF(ISBLANK(dms_E2_Projects_47),\"\",dms_E2_Projects_47)","v":""}]
[null,{"$f":"IF(ISBLANK(dms_E2_Projects_48),\"\",dms_E2_Projects_48)","v":""}]
[null,{"$f":"IF(ISBLANK(dms_E2_Projects_49),\"\",dms_E2_Projects_49)","v":""}]
[null,{"$f":"IF(ISBLANK(dms_E2_Projects_50),\"\",dms_E2_Projects_50)","v":""}]
[null,"Aggregate of other projects with total expenditure of less than $500,000"]
[null,null,"Total",{"$f":"SUM(D715:D765)","v":0},{"$f":"SUM(E715:E765)","v":0},0,0,0,0,0]
[]
[]
[null,"E2.2.2 - REACTIVE - BY CONNECTION TYPE"]
[null,null,null,"VOLUMES"]
[null,null,null,"0s"]
[null,null,null,{"$f":"VLOOKUP(CRCP_y4,'AER lookups'!$B$52:$C$101,2,0)","v":2022},{"$f":"CONCATENATE(\"1 Jan-30 Jun \"&(D772+1))","v":"1 Jan-30 Jun 2023"},{"$f":"FRCP_y1","v":"2023-24"},{"$f":"FRCP_y2","v":"2024-25"},{"$f":"FRCP_y3","v":"2025-26"},{"$f":"FRCP_y4","v":"2026-27"},{"$f":"FRCP_y5","v":"2027-28"}]
[null,"A. LOW PRESSURE TO HIGH PRESSURE"]
[null,"Mains","Length of mains replaced"]
[null,"Services","Number of services replaced"]
[null,null,"Total",{"$f":"SUM(D774:D775)","v":0},{"$f":"SUM(E774:E775)","v":0},0,0,0,0,0]
[null,"B. LOW PRESSURE TO MEDIUM PRESSURE"]
[null,"Mains","Length of mains replaced"]
[null,"Services","Number of services replaced"]
[null,null,"Total",{"$f":"SUM(D778:D779)","v":0},{"$f":"SUM(E778:E779)","v":0},0,0,0,0,0]
[null,"C. LOW PRESSURE TO LOW PRESSURE"]
[null,"Mains","Length of mains replaced"]
[null,"Services","Number of services replaced"]
[null,null,"Total",{"$f":"SUM(D782:D783)","v":0},{"$f":"SUM(E782:E783)","v":0},0,0,0,0,0]
[null,"D. MEDIUM PRESSURE TO MEDIUM PRESSURE"]
[null,"Mains","Length of mains replaced"]
[null,"Services","Number of services replaced"]
[null,null,"Total",{"$f":"SUM(D786:D787)","v":0},{"$f":"SUM(E786:E787)","v":0},0,0,0,0,0]
[null,"E. MEDIUM PRESSURE TO HIGH PRESSURE"]
[null,"Mains","Length of mains replaced"]
[null,"Services","Number of services replaced"]
[null,null,"Total",{"$f":"SUM(D790:D791)","v":0},{"$f":"SUM(E790:E791)","v":0},0,0,0,0,0]
[null,"F. HIGH PRESSURE TO HIGH PRESSURE"]
[null,"Mains","Length of mains replaced"]
[null,"Services","Number of services replaced"]
[null,null,"Total",{"$f":"SUM(D794:D795)","v":0},{"$f":"SUM(E794:E795)","v":0},0,0,0,0,0]

{"sheet":"E3. Mains Augex","index":9,"n_rows":746,"n_cols":9,"rows_kept":746,"cut":false,"hidden":false,"merged":[]}
[null,{"$f":"INDEX(dms_Worksheet_List,MATCH(dms_Model,dms_Model_List))","v":"REGULATORY REPORTING STATEMENT"}]
[null,{"$f":"dms_TradingName","v":"AusNet (Gas)"}]
[null,{"$f":"dms_Header_Span","v":"2021-22 to 2027-28"}]
[null,"E3. MAINS AUGMENTATION"]
[]
[]
[null,"Please list all projects here:"]
[null,"Macedon"]
[null,"Cragieburn"]
[null,"Ballarat"]
[null,"Bendigo"]
[null,"Point Cook"]
[null,"Tarneit"]
[null,"Geelong Bellerine"]
[null,"Ballan"]
[null,"Bacchus Marsh"]
[null,"Sunbury"]
[null,"Werribee"]
[null,"Werribee 2 "]
[null,"Leopold"]
[null,"City Gate - New"]
[null,"City Gate - Capacity Upgrade"]
[null,"Field Regulator - New"]
[null,"Field Regulator - Capacity Upgrade"]
[null,"Network Reinforcement - Distribution"]
[null,"Network Reinforcement - Transmission"]
[]
[]
[]
[]
[]
[]
[]
[]
[]
[]
[]
[]
[]
[]
[]
[]
[]
[]
[]
[]
[]
[]
[]
[]
[]
[]
[]
[]
[]
[]
[]
[]
[]
[null,"E3.1 - CAPEX BY PROJECT"]
[null,"A. DIRECT INTERNAL LABOUR EXPENDITURE"]
[null,null,"EXPENDITURE"]
[null,null,{"$f":"CONCATENATE(\"$0's, real \",dms_DollarReal)","v":"$0's, real June 2023"}]
[null,null,{"$f":"VLOOKUP(CRCP_y4,'AER lookups'!$B$52:$C$101,2,0)","v":2022},{"$f":"CONCATENATE(\"1 Jan-30 Jun \"&(C64+1))","v":"1 Jan-30 Jun 2023"},{"$f":"FRCP_y1","v":"2023-24"},{"$f":"FRCP_y2","v":"2024-25"},{"$f":"FRCP_y3","v":"2025-26"},{"$f":"FRCP_y4","v":"2026-27"},{"$f":"FRCP_y5","v":"2027-28"}]
[null,{"$f":"IF(ISBLANK(dms_E3_Projects_01),\"\",dms_E3_Projects_01)","v":"Macedon"},null,53024.084968430128,7993.4462528873082,0,0,0,0]
[null,{"$f":"IF(ISBLANK(dms_E3_Projects_02),\"\",dms_E3_Projects_02)","v":"Cragieburn"},null,0,0,147742.89352978716,0,0,0]
[null,{"$f":"IF(ISBLANK(dms_E3_Projects_03),\"\",dms_E3_Projects_03)","v":"Ballarat"},null,0,0,0,133351.88440462603,0,0]
[null,{"$f":"IF(ISBLANK(dms_E3_Projects_04),\"\",dms_E3_Projects_04)","v":"Bendigo"},null,0,0,0,13726.122303538054,0,0]
[null,{"$f":"IF(ISBLANK(dms_E3_Projects_05),\"\",dms_E3_Projects_05)","v":"Point Cook"},null,0,51158.056018478776,0,0,0,0]
[null,{"$f":"IF(ISBLANK(dms_E3_Projects_06),\"\",dms_E3_Projects_06)","v":"Tarneit"},null,0,0,82491.124849783009,0,0,0]
[null,{"$f":"IF(ISBLANK(dms_E3_Projects_07),\"\",dms_E3_Projects_07)","v":"Geelong Bellerine"},null,0,0,0,0,86952.236414514235,0]
[null,{"$f":"IF(ISBLANK(dms_E3_Projects_08),\"\",dms_E3_Projects_08)","v":"Ballan"},null,0,9890.5574969058962,0,0,0,0]
[null,{"$f":"IF(ISBLANK(dms_E3_Projects_09),\"\",dms_E3_Projects_09)","v":"Bacchus Marsh"},null,0,19397.429573673202,0,0,0,0]
[null,{"$f":"IF(ISBLANK(dms_E3_Projects_10),\"\",dms_E3_Projects_10)","v":"Sunbury"},null,31814.450981058078,63947.570023098466,0,0,0,0]
[null,{"$f":"IF(ISBLANK(dms_E3_Projects_11),\"\",dms_E3_Projects_11)","v":"Werribee"},null,0,0,0,0,0,205954.51555088974]
[null,{"$f":"IF(ISBLANK(dms_E3_Projects_12),\"\",dms_E3_Projects_12)","v":"Werribee 2 "},null,0,31654.04716143374,0,0,0,0]
[null,{"$f":"IF(ISBLANK(dms_E3_Projects_13),\"\",dms_E3_Projects_13)","v":"Leopold"},null,18478.893611497901,0,0,0,0,0]
[null,{"$f":"IF(ISBLANK(dms_E3_Projects_14),\"\",dms_E3_Projects_14)","v":"City Gate - New"},6389.429410052282]
[null,{"$f":"IF(ISBLANK(dms_E3_Projects_15),\"\",dms_E3_Projects_15)","v":"City Gate - Capacity Upgrade"},0]
[null,{"$f":"IF(ISBLANK(dms_E3_Projects_16),\"\",dms_E3_Projects_16)","v":"Field Regulator - New"},6389.429410052282]
[null,{"$f":"IF(ISBLANK(dms_E3_Projects_17),\"\",dms_E3_Projects_17)","v":"Field Regulator - Capacity Upgrade"},7906.9153359594075]
[null,{"$f":"IF(ISBLANK(dms_E3_Projects_18),\"\",dms_E3_Projects_18)","v":"Network Reinforcement - Distribution"},96138.405220143017]
[null,{"$f":"IF(ISBLANK(dms_E3_Projects_18),\"\",dms_E3_Projects_18)","v":"Network Reinforcement - Distribution"}]
[null,{"$f":"IF(ISBLANK(dms_E3_Projects_19),\"\",dms_E3_Projects_19)","v":"Network Reinforcement - Transmission"},27773.317063596875]
[null,{"$f":"IF(ISBLANK(dms_E3_Projects_20),\"\",dms_E3_Projects_20)","v":""}]
[null,{"$f":"IF(ISBLANK(dms_E3_Projects_21),\"\",dms_E3_Projects_21)","v":""}]
[null,{"$f":"IF(ISBLANK(dms_E3_Projects_22),\"\",dms_E3_Projects_22)","v":""}]
[null,{"$f":"IF(ISBLANK(dms_E3_Projects_23),\"\",dms_E3_Projects_23)","v":""}]
[null,{"$f":"IF(ISBLANK(dms_E3_Projects_24),\"\",dms_E3_Projects_24)","v":""}]
[null,{"$f":"IF(ISBLANK(dms_E3_Projects_25),\"\",dms_E3_Projects_26)","v":""}]
[null,{"$f":"IF(ISBLANK(dms_E3_Projects_27),\"\",dms_E3_Projects_27)","v":""}]
[null,{"$f":"IF(ISBLANK(dms_E3_Projects_28),\"\",dms_E3_Projects_28)","v":""}]
[null,{"$f":"IF(ISBLANK(dms_E3_Projects_29),\"\",dms_E3_Projects_29)","v":""}]
[null,{"$f":"IF(ISBLANK(dms_E3_Projects_30),\"\",dms_E3_Projects_30)","v":""}]
[null,{"$f":"IF(ISBLANK(dms_E3_Projects_31),\"\",dms_E3_Projects_31)","v":""}]
[null,{"$f":"IF(ISBLANK(dms_E3_Projects_32),\"\",dms_E3_Projects_32)","v":""}]
[null,{"$f":"IF(ISBLANK(dms_E3_Projects_33),\"\",dms_E3_Projects_33)","v":""}]
[null,{"$f":"IF(ISBLANK(dms_E3_Projects_34),\"\",dms_E3_Projects_34)","v":""}]
[null,{"$f":"IF(ISBLANK(dms_E3_Projects_35),\"\",dms_E3_Projects_35)","v":""}]
[null,{"$f":"IF(ISBLANK(dms_E3_Projects_36),\"\",dms_E3_Projects_36)","v":""}]
[null,{"$f":"IF(ISBLANK(dms_E3_Projects_37),\"\",dms_E3_Projects_37)","v":""}]
[null,{"$f":"IF(ISBLANK(dms_E3_Projects_38),\"\",dms_E3_Projects_38)","v":""}]
[null,{"$f":"IF(ISBLANK(dms_E3_Projects_39),\"\",dms_E3_Projects_39)","v":""}]
[null,{"$f":"IF(ISBLANK(dms_E3_Projects_40),\"\",dms_E3_Projects_40)","v":""}]
[null,{"$f":"IF(ISBLANK(dms_E3_Projects_41),\"\",dms_E3_Projects_41)","v":""}]
[null,{"$f":"IF(ISBLANK(dms_E3_Projects_42),\"\",dms_E3_Projects_42)","v":""}]
[null,{"$f":"IF(ISBLANK(dms_E3_Projects_43),\"\",dms_E3_Projects_43)","v":""}]
[null,{"$f":"IF(ISBLANK(dms_E3_Projects_44),\"\",dms_E3_Projects_44)","v":""}]
[null,{"$f":"IF(ISBLANK(dms_E3_Projects_45),\"\",dms_E3_Projects_45)","v":""}]
[null,{"$f":"IF(ISBLANK(dms_E3_Projects_46),\"\",dms_E3_Projects_46)","v":""}]
[null,{"$f":"IF(ISBLANK(dms_E3_Projects_47),\"\",dms_E3_Projects_47)","v":""}]
[null,{"$f":"IF(ISBLANK(dms_E3_Projects_48),\"\",dms_E3_Projects_48)","v":""}]
[null,{"$f":"IF(ISBLANK(dms_E3_Projects_49),\"\",dms_E3_Projects_49)","v":""}]
[null,{"$f":"IF(ISBLANK(dms_E3_Projects_50),\"\",dms_E3_Projects_50)","v":""}]
[null,"Aggregate of other projects with total expenditure of less than $500,000"]
[null,"Total",{"$f":"SUM(C65:C115)","v":144597.49643980386},{"$f":"SUM(D65:D115)","v":103317.4295609861},184041.10652647738,230234.01837957016,147078.00670816409,86952.236414514235,205954.51555088974]
[]
[null,"B. DIRECT CONTRACTOR EXPENDITURE"]
[null,null,"EXPENDITURE"]
[null,null,{"$f":"CONCATENATE(\"$0's, real \",dms_DollarReal)","v":"$0's, real June 2023"}]
[null,null,{"$f":"VLOOKUP(CRCP_y4,'AER lookups'!$B$52:$C$101,2,0)","v":2022},{"$f":"CONCATENATE(\"1 Jan-30 Jun \"&(C121+1))","v":"1 Jan-30 Jun 2023"},{"$f":"FRCP_y1","v":"2023-24"},{"$f":"FRCP_y2","v":"2024-25"},{"$f":"FRCP_y3","v":"2025-26"},{"$f":"FRCP_y4","v":"2026-27"},{"$f":"FRCP_y5","v":"2027-28"}]
[null,{"$f":"IF(ISBLANK(dms_E3_Projects_01),\"\",dms_E3_Projects_01)","v":"Macedon"},null,1002249.9999999999,150337.5,0,0,0,0]
[null,{"$f":"IF(ISBLANK(dms_E3_Projects_02),\"\",dms_E3_Projects_02)","v":"Cragieburn"},null,0,0,2757189.7499999995,0,0,0]
[null,{"$f":"IF(ISBLANK(dms_E3_Projects_03),\"\",dms_E3_Projects_03)","v":"Ballarat"},null,0,0,0,2461526,0,0]
[null,{"$f":"IF(ISBLANK(dms_E3_Projects_04),\"\",dms_E3_Projects_04)","v":"Bendigo"},null,0,0,0,253368.8,0,0]
[null,{"$f":"IF(ISBLANK(dms_E3_Projects_05),\"\",dms_E3_Projects_05)","v":"Point Cook"},null,0,962160,0,0,0,0]
[null,{"$f":"IF(ISBLANK(dms_E3_Projects_06),\"\",dms_E3_Projects_06)","v":"Tarneit"},null,0,0,1539456,0,0,0]
[null,{"$f":"IF(ISBLANK(dms_E3_Projects_07),\"\",dms_E3_Projects_07)","v":"Geelong Bellerine"},null,0,0,0,0,1587564,0]
[null,{"$f":"IF(ISBLANK(dms_E3_Projects_08),\"\",dms_E3_Projects_08)","v":"Ballan"},null,0,186017.59999999998,0,0,0,0]
[null,{"$f":"IF(ISBLANK(dms_E3_Projects_09),\"\",dms_E3_Projects_09)","v":"Bacchus Marsh"},null,0,364819,0,0,0,0]
[null,{"$f":"IF(ISBLANK(dms_E3_Projects_10),\"\",dms_E3_Projects_10)","v":"Sunbury"},null,601350,1202700,0,0,0,0]
[null,{"$f":"IF(ISBLANK(dms_E3_Projects_11),\"\",dms_E3_Projects_11)","v":"Werribee"},null,0,0,0,0,0,3719349.7499999995]
[null,{"$f":"IF(ISBLANK(dms_E3_Projects_12),\"\",dms_E3_Projects_12)","v":"Werribee 2 "},null,0,595336.5,0,0,0,0]
[null,{"$f":"IF(ISBLANK(dms_E3_Projects_13),\"\",dms_E3_Projects_13)","v":"Leopold"},null,349284.125,0,0,0,0,0]
[null,{"$f":"IF(ISBLANK(dms_E3_Projects_14),\"\",dms_E3_Projects_14)","v":"City Gate - New"},121399.15879099336]
[null,{"$f":"IF(ISBLANK(dms_E3_Projects_15),\"\",dms_E3_Projects_15)","v":"City Gate - Capacity Upgrade"},0]
[null,{"$f":"IF(ISBLANK(dms_E3_Projects_16),\"\",dms_E3_Projects_16)","v":"Field Regulator - New"},121399.15879099336]
[null,{"$f":"IF(ISBLANK(dms_E3_Projects_17),\"\",dms_E3_Projects_17)","v":"Field Regulator - Capacity Upgrade"},150231.39138322874]
[null,{"$f":"IF(ISBLANK(dms_E3_Projects_18),\"\",dms_E3_Projects_18)","v":"Network Reinforcement - Distribution"},1826629.6991827174]
[null,{"$f":"IF(ISBLANK(dms_E3_Projects_18),\"\",dms_E3_Projects_18)","v":"Network Reinforcement - Distribution"}]
[null,{"$f":"IF(ISBLANK(dms_E3_Projects_19),\"\",dms_E3_Projects_19)","v":"Network Reinforcement - Transmission"},527693.02420834056]
[null,{"$f":"IF(ISBLANK(dms_E3_Projects_20),\"\",dms_E3_Projects_20)","v":""}]
[null,{"$f":"IF(ISBLANK(dms_E3_Projects_21),\"\",dms_E3_Projects_21)","v":""}]
[null,{"$f":"IF(ISBLANK(dms_E3_Projects_22),\"\",dms_E3_Projects_22)","v":""}]
[null,{"$f":"IF(ISBLANK(dms_E3_Projects_23),\"\",dms_E3_Projects_23)","v":""}]
[null,{"$f":"IF(ISBLANK(dms_E3_Projects_24),\"\",dms_E3_Projects_24)","v":""}]
[null,{"$f":"IF(ISBLANK(dms_E3_Projects_25),\"\",dms_E3_Projects_26)","v":""}]
[null,{"$f":"IF(ISBLANK(dms_E3_Projects_27),\"\",dms_E3_Projects_27)","v":""}]
[null,{"$f":"IF(ISBLANK(dms_E3_Projects_28),\"\",dms_E3_Projects_28)","v":""}]
[null,{"$f":"IF(ISBLANK(dms_E3_Projects_29),\"\",dms_E3_Projects_29)","v":""}]
[null,{"$f":"IF(ISBLANK(dms_E3_Projects_30),\"\",dms_E3_Projects_30)","v":""}]
[null,{"$f":"IF(ISBLANK(dms_E3_Projects_31),\"\",dms_E3_Projects_31)","v":""}]
[null,{"$f":"IF(ISBLANK(dms_E3_Projects_32),\"\",dms_E3_Projects_32)","v":""}]
[null,{"$f":"IF(ISBLANK(dms_E3_Projects_33),\"\",dms_E3_Projects_33)","v":""}]
[null,{"$f":"IF(ISBLANK(dms_E3_Projects_34),\"\",dms_E3_Projects_34)","v":""}]
[null,{"$f":"IF(ISBLANK(dms_E3_Projects_35),\"\",dms_E3_Projects_35)","v":""}]
[null,{"$f":"IF(ISBLANK(dms_E3_Projects_36),\"\",dms_E3_Projects_36)","v":""}]
[null,{"$f":"IF(ISBLANK(dms_E3_Projects_37),\"\",dms_E3_Projects_37)","v":""}]
[null,{"$f":"IF(ISBLANK(dms_E3_Projects_38),\"\",dms_E3_Projects_38)","v":""}]
[null,{"$f":"IF(ISBLANK(dms_E3_Projects_39),\"\",dms_E3_Projects_39)","v":""}]
[null,{"$f":"IF(ISBLANK(dms_E3_Projects_40),\"\",dms_E3_Projects_40)","v":""}]
[null,{"$f":"IF(ISBLANK(dms_E3_Projects_41),\"\",dms_E3_Projects_41)","v":""}]
[null,{"$f":"IF(ISBLANK(dms_E3_Projects_42),\"\",dms_E3_Projects_42)","v":""}]
[null,{"$f":"IF(ISBLANK(dms_E3_Projects_43),\"\",dms_E3_Projects_43)","v":""}]
[null,{"$f":"IF(ISBLANK(dms_E3_Projects_44),\"\",dms_E3_Projects_44)","v":""}]
[null,{"$f":"IF(ISBLANK(dms_E3_Projects_45),\"\",dms_E3_Projects_45)","v":""}]
[null,{"$f":"IF(ISBLANK(dms_E3_Projects_46),\"\",dms_E3_Projects_46)","v":""}]
[null,{"$f":"IF(ISBLANK(dms_E3_Projects_47),\"\",dms_E3_Projects_47)","v":""}]
[null,{"$f":"IF(ISBLANK(dms_E3_Projects_48),\"\",dms_E3_Projects_48)","v":""}]
[null,{"$f":"IF(ISBLANK(dms_E3_Projects_49),\"\",dms_E3_Projects_49)","v":""}]
[null,{"$f":"IF(ISBLANK(dms_E3_Projects_50),\"\",dms_E3_Projects_50)","v":""}]
[null,"Aggregate of other projects with total expenditure of less than $500,000"]
[null,"Total",{"$f":"SUM(C122:C172)","v":2747352.4323562738},{"$f":"SUM(D122:D172)","v":1952884.125},3461370.6,4296645.75,2714894.8,1587564,3719349.7499999995]
[]
[null,"C. DIRECT MATERIAL EXPENDITURE"]
[null,null,"EXPENDITURE"]
[null,null,{"$f":"CONCATENATE(\"$0's, real \",dms_DollarReal)","v":"$0's, real June 2023"}]
[null,null,{"$f":"VLOOKUP(CRCP_y4,'AER lookups'!$B$52:$C$101,2,0)","v":2022},{"$f":"CONCATENATE(\"1 Jan-30 Jun \"&(C178+1))","v":"1 Jan-30 Jun 2023"},{"$f":"FRCP_y1","v":"2023-24"},{"$f":"FRCP_y2","v":"2024-25"},{"$f":"FRCP_y3","v":"2025-26"},{"$f":"FRCP_y4","v":"2026-27"},{"$f":"FRCP_y5","v":"2027-28"}]
[null,{"$f":"IF(ISBLANK(dms_E3_Projects_01),\"\",dms_E3_Projects_01)","v":"Macedon"},null,263749.99999999994,105500,0,0,0,0]
[null,{"$f":"IF(ISBLANK(dms_E3_Projects_02),\"\",dms_E3_Projects_02)","v":"Cragieburn"},null,0,0,1512870,0,0,0]
[null,{"$f":"IF(ISBLANK(dms_E3_Projects_03),\"\",dms_E3_Projects_03)","v":"Ballarat"},null,0,0,0,647769.99999999977,0,0]
[null,{"$f":"IF(ISBLANK(dms_E3_Projects_04),\"\",dms_E3_Projects_04)","v":"Bendigo"},null,0,0,0,66675.999999999985,0,0]
[null,{"$f":"IF(ISBLANK(dms_E3_Projects_05),\"\",dms_E3_Projects_05)","v":"Point Cook"},null,0,253199.99999999991,0,0,0,0]
[null,{"$f":"IF(ISBLANK(dms_E3_Projects_06),\"\",dms_E3_Projects_06)","v":"Tarneit"},null,0,0,405119.99999999994,0,0,0]
[null,{"$f":"IF(ISBLANK(dms_E3_Projects_07),\"\",dms_E3_Projects_07)","v":"Geelong Bellerine"},null,0,0,0,0,417779.99999999983,0]
[null,{"$f":"IF(ISBLANK(dms_E3_Projects_08),\"\",dms_E3_Projects_08)","v":"Ballan"},null,0,48951.999999999993,0,0,0,0]
[null,{"$f":"IF(ISBLANK(dms_E3_Projects_09),\"\",dms_E3_Projects_09)","v":"Bacchus Marsh"},null,0,96004.999999999985,0,0,0,0]
[null,{"$f":"IF(ISBLANK(dms_E3_Projects_10),\"\",dms_E3_Projects_10)","v":"Sunbury"},null,158249.99999999997,316499.99999999994,0,0,0,0]
[null,{"$f":"IF(ISBLANK(dms_E3_Projects_11),\"\",dms_E3_Projects_11)","v":"Werribee"},null,0,0,0,0,0,1766069.9999999998]
[null,{"$f":"IF(ISBLANK(dms_E3_Projects_12),\"\",dms_E3_Projects_12)","v":"Werribee 2 "},null,0,417780,0,0,0,0]
[null,{"$f":"IF(ISBLANK(dms_E3_Projects_13),\"\",dms_E3_Projects_13)","v":"Leopold"},null,157194.99999999997,0,0,0,0,0]
[null,{"$f":"IF(ISBLANK(dms_E3_Projects_14),\"\",dms_E3_Projects_14)","v":"City Gate - New"},85192.392134030422]
[null,{"$f":"IF(ISBLANK(dms_E3_Projects_15),\"\",dms_E3_Projects_15)","v":"City Gate - Capacity Upgrade"},0]
[null,{"$f":"IF(ISBLANK(dms_E3_Projects_16),\"\",dms_E3_Projects_16)","v":"Field Regulator - New"},85192.392134030422]
[null,{"$f":"IF(ISBLANK(dms_E3_Projects_17),\"\",dms_E3_Projects_17)","v":"Field Regulator - Capacity Upgrade"},105425.53781279211]
[null,{"$f":"IF(ISBLANK(dms_E3_Projects_18),\"\",dms_E3_Projects_18)","v":"Network Reinforcement - Distribution"},480692.02610071498]
[null,{"$f":"IF(ISBLANK(dms_E3_Projects_18),\"\",dms_E3_Projects_18)","v":"Network Reinforcement - Distribution"}]
[null,{"$f":"IF(ISBLANK(dms_E3_Projects_19),\"\",dms_E3_Projects_19)","v":"Network Reinforcement - Transmission"},138866.58531798434]
[null,{"$f":"IF(ISBLANK(dms_E3_Projects_20),\"\",dms_E3_Projects_20)","v":""}]
[null,{"$f":"IF(ISBLANK(dms_E3_Projects_21),\"\",dms_E3_Projects_21)","v":""}]
[null,{"$f":"IF(ISBLANK(dms_E3_Projects_22),\"\",dms_E3_Projects_22)","v":""}]
[null,{"$f":"IF(ISBLANK(dms_E3_Projects_23),\"\",dms_E3_Projects_23)","v":""}]
[null,{"$f":"IF(ISBLANK(dms_E3_Projects_24),\"\",dms_E3_Projects_24)","v":""}]
[null,{"$f":"IF(ISBLANK(dms_E3_Projects_25),\"\",dms_E3_Projects_26)","v":""}]
[null,{"$f":"IF(ISBLANK(dms_E3_Projects_27),\"\",dms_E3_Projects_27)","v":""}]
[null,{"$f":"IF(ISBLANK(dms_E3_Projects_28),\"\",dms_E3_Projects_28)","v":""}]
[null,{"$f":"IF(ISBLANK(dms_E3_Projects_29),\"\",dms_E3_Projects_29)","v":""}]
[null,{"$f":"IF(ISBLANK(dms_E3_Projects_30),\"\",dms_E3_Projects_30)","v":""}]
[null,{"$f":"IF(ISBLANK(dms_E3_Projects_31),\"\",dms_E3_Projects_31)","v":""}]
[null,{"$f":"IF(ISBLANK(dms_E3_Projects_32),\"\",dms_E3_Projects_32)","v":""}]
[null,{"$f":"IF(ISBLANK(dms_E3_Projects_33),\"\",dms_E3_Projects_33)","v":""}]
[null,{"$f":"IF(ISBLANK(dms_E3_Projects_34),\"\",dms_E3_Projects_34)","v":""}]
[null,{"$f":"IF(ISBLANK(dms_E3_Projects_35),\"\",dms_E3_Projects_35)","v":""}]
[null,{"$f":"IF(ISBLANK(dms_E3_Projects_36),\"\",dms_E3_Projects_36)","v":""}]
[null,{"$f":"IF(ISBLANK(dms_E3_Projects_37),\"\",dms_E3_Projects_37)","v":""}]
[null,{"$f":"IF(ISBLANK(dms_E3_Projects_38),\"\",dms_E3_Projects_38)","v":""}]
[null,{"$f":"IF(ISBLANK(dms_E3_Projects_39),\"\",dms_E3_Projects_39)","v":""}]
[null,{"$f":"IF(ISBLANK(dms_E3_Projects_40),\"\",dms_E3_Projects_40)","v":""}]
[null,{"$f":"IF(ISBLANK(dms_E3_Projects_41),\"\",dms_E3_Projects_41)","v":""}]
[null,{"$f":"IF(ISBLANK(dms_E3_Projects_42),\"\",dms_E3_Projects_42)","v":""}]
[null,{"$f":"IF(ISBLANK(dms_E3_Projects_43),\"\",dms_E3_Projects_43)","v":""}]
[null,{"$f":"IF(ISBLANK(dms_E3_Projects_44),\"\",dms_E3_Projects_44)","v":""}]
[null,{"$f":"IF(ISBLANK(dms_E3_Projects_45),\"\",dms_E3_Projects_45)","v":""}]
[null,{"$f":"IF(ISBLANK(dms_E3_Projects_46),\"\",dms_E3_Projects_46)","v":""}]
[null,{"$f":"IF(ISBLANK(dms_E3_Projects_47),\"\",dms_E3_Projects_47)","v":""}]
[null,{"$f":"IF(ISBLANK(dms_E3_Projects_48),\"\",dms_E3_Projects_48)","v":""}]
[null,{"$f":"IF(ISBLANK(dms_E3_Projects_49),\"\",dms_E3_Projects_49)","v":""}]
[null,{"$f":"IF(ISBLANK(dms_E3_Projects_50),\"\",dms_E3_Projects_50)","v":""}]
[null,"Aggregate of other projects with total expenditure of less than $500,000"]
[null,"Total",{"$f":"SUM(C179:C229)","v":895368.93349955219},{"$f":"SUM(D179:D229)","v":579194.99999999988},1237936.9999999998,1917990,714445.99999999977,417779.99999999983,1766069.9999999998]
[]
[null,"D. OTHER DIRECT EXPENDITURE"]
[null,null,"EXPENDITURE"]
[null,null,{"$f":"CONCATENATE(\"$0's, real \",dms_DollarReal)","v":"$0's, real June 2023"}]
[null,null,{"$f":"VLOOKUP(CRCP_y4,'AER lookups'!$B$52:$C$101,2,0)","v":2022},{"$f":"CONCATENATE(\"1 Jan-30 Jun \"&(C235+1))","v":"1 Jan-30 Jun 2023"},{"$f":"FRCP_y1","v":"2023-24"},{"$f":"FRCP_y2","v":"2024-25"},{"$f":"FRCP_y3","v":"2025-26"},{"$f":"FRCP_y4","v":"2026-27"},{"$f":"FRCP_y5","v":"2027-28"}]
[null,{"$f":"IF(ISBLANK(dms_E3_Projects_01),\"\",dms_E3_Projects_01)","v":"Macedon"},null,0,0,0,0,0,0]
[null,{"$f":"IF(ISBLANK(dms_E3_Projects_02),\"\",dms_E3_Projects_02)","v":"Cragieburn"},null,0,0,0,0,0,0]
[null,{"$f":"IF(ISBLANK(dms_E3_Projects_03),\"\",dms_E3_Projects_03)","v":"Ballarat"},null,0,0,0,0,0,0]
[null,{"$f":"IF(ISBLANK(dms_E3_Projects_04),\"\",dms_E3_Projects_04)","v":"Bendigo"},null,0,0,0,0,0,0]
[null,{"$f":"IF(ISBLANK(dms_E3_Projects_05),\"\",dms_E3_Projects_05)","v":"Point Cook"},null,0,0,0,0,0,0]
[null,{"$f":"IF(ISBLANK(dms_E3_Projects_06),\"\",dms_E3_Projects_06)","v":"Tarneit"},null,0,0,0,0,0,0]
[null,{"$f":"IF(ISBLANK(dms_E3_Projects_07),\"\",dms_E3_Projects_07)","v":"Geelong Bellerine"},null,0,0,0,0,0,0]
[null,{"$f":"IF(ISBLANK(dms_E3_Projects_08),\"\",dms_E3_Projects_08)","v":"Ballan"},null,0,0,0,0,0,0]
[null,{"$f":"IF(ISBLANK(dms_E3_Projects_09),\"\",dms_E3_Projects_09)","v":"Bacchus Marsh"},null,0,0,0,0,0,0]
[null,{"$f":"IF(ISBLANK(dms_E3_Projects_10),\"\",dms_E3_Projects_10)","v":"Sunbury"},null,0,0,0,0,0,0]
[null,{"$f":"IF(ISBLANK(dms_E3_Projects_11),\"\",dms_E3_Projects_11)","v":"Werribee"},null,0,0,0,0,0,0]
[null,{"$f":"IF(ISBLANK(dms_E3_Projects_12),\"\",dms_E3_Projects_12)","v":"Werribee 2 "},null,0,0,0,0,0,0]
[null,{"$f":"IF(ISBLANK(dms_E3_Projects_13),\"\",dms_E3_Projects_13)","v":"Leopold"},null,0,0,0,0,0,0]
[null,{"$f":"IF(ISBLANK(dms_E3_Projects_14),\"\",dms_E3_Projects_14)","v":"City Gate - New"},0]
[null,{"$f":"IF(ISBLANK(dms_E3_Projects_15),\"\",dms_E3_Projects_15)","v":"City Gate - Capacity Upgrade"},0]
[null,{"$f":"IF(ISBLANK(dms_E3_Projects_16),\"\",dms_E3_Projects_16)","v":"Field Regulator - New"},0]
[null,{"$f":"IF(ISBLANK(dms_E3_Projects_17),\"\",dms_E3_Projects_17)","v":"Field Regulator - Capacity Upgrade"},0]
[null,{"$f":"IF(ISBLANK(dms_E3_Projects_18),\"\",dms_E3_Projects_18)","v":"Network Reinforcement - Distribution"},0]
[null,{"$f":"IF(ISBLANK(dms_E3_Projects_18),\"\",dms_E3_Projects_18)","v":"Network Reinforcement - Distribution"}]
[null,{"$f":"IF(ISBLANK(dms_E3_Projects_19),\"\",dms_E3_Projects_19)","v":"Network Reinforcement - Transmission"},0]
[null,{"$f":"IF(ISBLANK(dms_E3_Projects_20),\"\",dms_E3_Projects_20)","v":""}]
[null,{"$f":"IF(ISBLANK(dms_E3_Projects_21),\"\",dms_E3_Projects_21)","v":""}]
[null,{"$f":"IF(ISBLANK(dms_E3_Projects_22),\"\",dms_E3_Projects_22)","v":""}]
[null,{"$f":"IF(ISBLANK(dms_E3_Projects_23),\"\",dms_E3_Projects_23)","v":""}]
[null,{"$f":"IF(ISBLANK(dms_E3_Projects_24),\"\",dms_E3_Projects_24)","v":""}]
[null,{"$f":"IF(ISBLANK(dms_E3_Projects_25),\"\",dms_E3_Projects_26)","v":""}]
[null,{"$f":"IF(ISBLANK(dms_E3_Projects_27),\"\",dms_E3_Projects_27)","v":""}]
[null,{"$f":"IF(ISBLANK(dms_E3_Projects_28),\"\",dms_E3_Projects_28)","v":""}]
[null,{"$f":"IF(ISBLANK(dms_E3_Projects_29),\"\",dms_E3_Projects_29)","v":""}]
[null,{"$f":"IF(ISBLANK(dms_E3_Projects_30),\"\",dms_E3_Projects_30)","v":""}]
[null,{"$f":"IF(ISBLANK(dms_E3_Projects_31),\"\",dms_E3_Projects_31)","v":""}]
[null,{"$f":"IF(ISBLANK(dms_E3_Projects_32),\"\",dms_E3_Projects_32)","v":""}]
[null,{"$f":"IF(ISBLANK(dms_E3_Projects_33),\"\",dms_E3_Projects_33)","v":""}]
[null,{"$f":"IF(ISBLANK(dms_E3_Projects_34),\"\",dms_E3_Projects_34)","v":""}]
[null,{"$f":"IF(ISBLANK(dms_E3_Projects_35),\"\",dms_E3_Projects_35)","v":""}]
[null,{"$f":"IF(ISBLANK(dms_E3_Projects_36),\"\",dms_E3_Projects_36)","v":""}]
[null,{"$f":"IF(ISBLANK(dms_E3_Projects_37),\"\",dms_E3_Projects_37)","v":""}]
[null,{"$f":"IF(ISBLANK(dms_E3_Projects_38),\"\",dms_E3_Projects_38)","v":""}]
[null,{"$f":"IF(ISBLANK(dms_E3_Projects_39),\"\",dms_E3_Projects_39)","v":""}]
[null,{"$f":"IF(ISBLANK(dms_E3_Projects_40),\"\",dms_E3_Projects_40)","v":""}]
[null,{"$f":"IF(ISBLANK(dms_E3_Projects_41),\"\",dms_E3_Projects_41)","v":""}]
[null,{"$f":"IF(ISBLANK(dms_E3_Projects_42),\"\",dms_E3_Projects_42)","v":""}]
[null,{"$f":"IF(ISBLANK(dms_E3_Projects_43),\"\",dms_E3_Projects_43)","v":""}]
[null,{"$f":"IF(ISBLANK(dms_E3_Projects_44),\"\",dms_E3_Projects_44)","v":""}]
[null,{"$f":"IF(ISBLANK(dms_E3_Projects_45),\"\",dms_E3_Projects_45)","v":""}]
[null,{"$f":"IF(ISBLANK(dms_E3_Projects_46),\"\",dms_E3_Projects_46)","v":""}]
[null,{"$f":"IF(ISBLANK(dms_E3_Projects_47),\"\",dms_E3_Projects_47)","v":""}]
[null,{"$f":"IF(ISBLANK(dms_E3_Projects_48),\"\",dms_E3_Projects_48)","v":""}]
[null,{"$f":"IF(ISBLANK(dms_E3_Projects_49),\"\",dms_E3_Projects_49)","v":""}]
[null,{"$f":"IF(ISBLANK(dms_E3_Projects_50),\"\",dms_E3_Projects_50)","v":""}]
[null,"Aggregate of other projects with total expenditure of less than $500,000"]
[null,"Total",{"$f":"SUM(C236:C286)","v":0},{"$f":"SUM(D236:D286)","v":0},0,0,0,0,0]
[]
[null,"E. RELATED PARTY MARGIN EXPENDITURE"]
[null,null,"EXPENDITURE"]
[null,null,{"$f":"CONCATENATE(\"$0's, real \",dms_DollarReal)","v":"$0's, real June 2023"}]
[null,null,{"$f":"VLOOKUP(CRCP_y4,'AER lookups'!$B$52:$C$101,2,0)","v":2022},{"$f":"CONCATENATE(\"1 Jan-30 Jun \"&(C292+1))","v":"1 Jan-30 Jun 2023"},{"$f":"FRCP_y1","v":"2023-24"},{"$f":"FRCP_y2","v":"2024-25"},{"$f":"FRCP_y3","v":"2025-26"},{"$f":"FRCP_y4","v":"2026-27"},{"$f":"FRCP_y5","v":"2027-28"}]
[null,{"$f":"IF(ISBLANK(dms_E3_Projects_01),\"\",dms_E3_Projects_01)","v":"Macedon"},null,0,0,0,0,0,0]
[null,{"$f":"IF(ISBLANK(dms_E3_Projects_02),\"\",dms_E3_Projects_02)","v":"Cragieburn"},null,0,0,0,0,0,0]
[null,{"$f":"IF(ISBLANK(dms_E3_Projects_03),\"\",dms_E3_Projects_03)","v":"Ballarat"},null,0,0,0,0,0,0]
[null,{"$f":"IF(ISBLANK(dms_E3_Projects_04),\"\",dms_E3_Projects_04)","v":"Bendigo"},null,0,0,0,0,0,0]
[null,{"$f":"IF(ISBLANK(dms_E3_Projects_05),\"\",dms_E3_Projects_05)","v":"Point Cook"},null,0,0,0,0,0,0]
[null,{"$f":"IF(ISBLANK(dms_E3_Projects_06),\"\",dms_E3_Projects_06)","v":"Tarneit"},null,0,0,0,0,0,0]
[null,{"$f":"IF(ISBLANK(dms_E3_Projects_07),\"\",dms_E3_Projects_07)","v":"Geelong Bellerine"},null,0,0,0,0,0,0]
[null,{"$f":"IF(ISBLANK(dms_E3_Projects_08),\"\",dms_E3_Projects_08)","v":"Ballan"},null,0,0,0,0,0,0]
[null,{"$f":"IF(ISBLANK(dms_E3_Projects_09),\"\",dms_E3_Projects_09)","v":"Bacchus Marsh"},null,0,0,0,0,0,0]
[null,{"$f":"IF(ISBLANK(dms_E3_Projects_10),\"\",dms_E3_Projects_10)","v":"Sunbury"},null,0,0,0,0,0,0]
[null,{"$f":"IF(ISBLANK(dms_E3_Projects_11),\"\",dms_E3_Projects_11)","v":"Werribee"},null,0,0,0,0,0,0]
[null,{"$f":"IF(ISBLANK(dms_E3_Projects_12),\"\",dms_E3_Projects_12)","v":"Werribee 2 "},null,0,0,0,0,0,0]
[null,{"$f":"IF(ISBLANK(dms_E3_Projects_13),\"\",dms_E3_Projects_13)","v":"Leopold"},null,0,0,0,0,0,0]
[null,{"$f":"IF(ISBLANK(dms_E3_Projects_14),\"\",dms_E3_Projects_14)","v":"City Gate - New"},0]
[null,{"$f":"IF(ISBLANK(dms_E3_Projects_15),\"\",dms_E3_Projects_15)","v":"City Gate - Capacity Upgrade"},0]
[null,{"$f":"IF(ISBLANK(dms_E3_Projects_16),\"\",dms_E3_Projects_16)","v":"Field Regulator - New"},0]
[null,{"$f":"IF(ISBLANK(dms_E3_Projects_17),\"\",dms_E3_Projects_17)","v":"Field Regulator - Capacity Upgrade"},0]
[null,{"$f":"IF(ISBLANK(dms_E3_Projects_18),\"\",dms_E3_Projects_18)","v":"Network Reinforcement - Distribution"},0]
[null,{"$f":"IF(ISBLANK(dms_E3_Projects_18),\"\",dms_E3_Projects_18)","v":"Network Reinforcement - Distribution"}]
[null,{"$f":"IF(ISBLANK(dms_E3_Projects_19),\"\",dms_E3_Projects_19)","v":"Network Reinforcement - Transmission"},0]
[null,{"$f":"IF(ISBLANK(dms_E3_Projects_20),\"\",dms_E3_Projects_20)","v":""}]
[null,{"$f":"IF(ISBLANK(dms_E3_Projects_21),\"\",dms_E3_Projects_21)","v":""}]
[null,{"$f":"IF(ISBLANK(dms_E3_Projects_22),\"\",dms_E3_Projects_22)","v":""}]
[null,{"$f":"IF(ISBLANK(dms_E3_Projects_23),\"\",dms_E3_Projects_23)","v":""}]
[null,{"$f":"IF(ISBLANK(dms_E3_Projects_24),\"\",dms_E3_Projects_24)","v":""}]
[null,{"$f":"IF(ISBLANK(dms_E3_Projects_25),\"\",dms_E3_Projects_26)","v":""}]
[null,{"$f":"IF(ISBLANK(dms_E3_Projects_27),\"\",dms_E3_Projects_27)","v":""}]
[null,{"$f":"IF(ISBLANK(dms_E3_Projects_28),\"\",dms_E3_Projects_28)","v":""}]
[null,{"$f":"IF(ISBLANK(dms_E3_Projects_29),\"\",dms_E3_Projects_29)","v":""}]
[null,{"$f":"IF(ISBLANK(dms_E3_Projects_30),\"\",dms_E3_Projects_30)","v":""}]
[null,{"$f":"IF(ISBLANK(dms_E3_Projects_31),\"\",dms_E3_Projects_31)","v":""}]
[null,{"$f":"IF(ISBLANK(dms_E3_Projects_32),\"\",dms_E3_Projects_32)","v":""}]
[null,{"$f":"IF(ISBLANK(dms_E3_Projects_33),\"\",dms_E3_Projects_33)","v":""}]
[null,{"$f":"IF(ISBLANK(dms_E3_Projects_34),\"\",dms_E3_Projects_34)","v":""}]
[null,{"$f":"IF(ISBLANK(dms_E3_Projects_35),\"\",dms_E3_Projects_35)","v":""}]
[null,{"$f":"IF(ISBLANK(dms_E3_Projects_36),\"\",dms_E3_Projects_36)","v":""}]
[null,{"$f":"IF(ISBLANK(dms_E3_Projects_37),\"\",dms_E3_Projects_37)","v":""}]
[null,{"$f":"IF(ISBLANK(dms_E3_Projects_38),\"\",dms_E3_Projects_38)","v":""}]
[null,{"$f":"IF(ISBLANK(dms_E3_Projects_39),\"\",dms_E3_Projects_39)","v":""}]
[null,{"$f":"IF(ISBLANK(dms_E3_Projects_40),\"\",dms_E3_Projects_40)","v":""}]
[null,{"$f":"IF(ISBLANK(dms_E3_Projects_41),\"\",dms_E3_Projects_41)","v":""}]
[null,{"$f":"IF(ISBLANK(dms_E3_Projects_42),\"\",dms_E3_Projects_42)","v":""}]
[null,{"$f":"IF(ISBLANK(dms_E3_Projects_43),\"\",dms_E3_Projects_43)","v":""}]
[null,{"$f":"IF(ISBLANK(dms_E3_Projects_44),\"\",dms_E3_Projects_44)","v":""}]
[null,{"$f":"IF(ISBLANK(dms_E3_Projects_45),\"\",dms_E3_Projects_45)","v":""}]
[null,{"$f":"IF(ISBLANK(dms_E3_Projects_46),\"\",dms_E3_Projects_46)","v":""}]
[null,{"$f":"IF(ISBLANK(dms_E3_Projects_47),\"\",dms_E3_Projects_47)","v":""}]
[null,{"$f":"IF(ISBLANK(dms_E3_Projects_48),\"\",dms_E3_Projects_48)","v":""}]
[null,{"$f":"IF(ISBLANK(dms_E3_Projects_49),\"\",dms_E3_Projects_49)","v":""}]
[null,{"$f":"IF(ISBLANK(dms_E3_Projects_50),\"\",dms_E3_Projects_50)","v":""}]
[null,"Aggregate of other projects with total expenditure of less than $500,000"]
[null,"Total",{"$f":"SUM(C293:C343)","v":0},{"$f":"SUM(D293:D343)","v":0},0,0,0,0,0]
[]
[null,"F. CAPITAL CONTRIBUTIONS included in the above"]
[null,null,"EXPENDITURE"]
[null,null,{"$f":"CONCATENATE(\"$0's, real \",dms_DollarReal)","v":"$0's, real June 2023"}]
[null,null,{"$f":"VLOOKUP(CRCP_y4,'AER lookups'!$B$52:$C$101,2,0)","v":2022},{"$f":"CONCATENATE(\"1 Jan-30 Jun \"&(C349+1))","v":"1 Jan-30 Jun 2023"},{"$f":"FRCP_y1","v":"2023-24"},{"$f":"FRCP_y2","v":"2024-25"},{"$f":"FRCP_y3","v":"2025-26"},{"$f":"FRCP_y4","v":"2026-27"},{"$f":"FRCP_y5","v":"2027-28"}]
[null,{"$f":"IF(ISBLANK(dms_E3_Projects_01),\"\",dms_E3_Projects_01)","v":"Macedon"},null,0,0,0,0,0,0]
[null,{"$f":"IF(ISBLANK(dms_E3_Projects_02),\"\",dms_E3_Projects_02)","v":"Cragieburn"},null,0,0,0,0,0,0]
[null,{"$f":"IF(ISBLANK(dms_E3_Projects_03),\"\",dms_E3_Projects_03)","v":"Ballarat"},null,0,0,0,0,0,0]
[null,{"$f":"IF(ISBLANK(dms_E3_Projects_04),\"\",dms_E3_Projects_04)","v":"Bendigo"},null,0,0,0,0,0,0]
[null,{"$f":"IF(ISBLANK(dms_E3_Projects_05),\"\",dms_E3_Projects_05)","v":"Point Cook"},null,0,0,0,0,0,0]
[null,{"$f":"IF(ISBLANK(dms_E3_Projects_06),\"\",dms_E3_Projects_06)","v":"Tarneit"},null,0,0,0,0,0,0]
[null,{"$f":"IF(ISBLANK(dms_E3_Projects_07),\"\",dms_E3_Projects_07)","v":"Geelong Bellerine"},null,0,0,0,0,0,0]
[null,{"$f":"IF(ISBLANK(dms_E3_Projects_08),\"\",dms_E3_Projects_08)","v":"Ballan"},null,0,0,0,0,0,0]
[null,{"$f":"IF(ISBLANK(dms_E3_Projects_09),\"\",dms_E3_Projects_09)","v":"Bacchus Marsh"},null,0,0,0,0,0,0]
[null,{"$f":"IF(ISBLANK(dms_E3_Projects_10),\"\",dms_E3_Projects_10)","v":"Sunbury"},null,0,0,0,0,0,0]
[null,{"$f":"IF(ISBLANK(dms_E3_Projects_11),\"\",dms_E3_Projects_11)","v":"Werribee"},null,0,0,0,0,0,0]
[null,{"$f":"IF(ISBLANK(dms_E3_Projects_12),\"\",dms_E3_Projects_12)","v":"Werribee 2 "},null,0,0,0,0,0,0]
[null,{"$f":"IF(ISBLANK(dms_E3_Projects_13),\"\",dms_E3_Projects_13)","v":"Leopold"},null,0,0,0,0,0,0]
[null,{"$f":"IF(ISBLANK(dms_E3_Projects_14),\"\",dms_E3_Projects_14)","v":"City Gate - New"},0]
[null,{"$f":"IF(ISBLANK(dms_E3_Projects_15),\"\",dms_E3_Projects_15)","v":"City Gate - Capacity Upgrade"},0]
[null,{"$f":"IF(ISBLANK(dms_E3_Projects_16),\"\",dms_E3_Projects_16)","v":"Field Regulator - New"},0]
[null,{"$f":"IF(ISBLANK(dms_E3_Projects_17),\"\",dms_E3_Projects_17)","v":"Field Regulator - Capacity Upgrade"},0]
[null,{"$f":"IF(ISBLANK(dms_E3_Projects_18),\"\",dms_E3_Projects_18)","v":"Network Reinforcement - Distribution"},0]
[null,{"$f":"IF(ISBLANK(dms_E3_Projects_18),\"\",dms_E3_Projects_18)","v":"Network Reinforcement - Distribution"}]
[null,{"$f":"IF(ISBLANK(dms_E3_Projects_19),\"\",dms_E3_Projects_19)","v":"Network Reinforcement - Transmission"},0]
[null,{"$f":"IF(ISBLANK(dms_E3_Projects_20),\"\",dms_E3_Projects_20)","v":""}]
[null,{"$f":"IF(ISBLANK(dms_E3_Projects_21),\"\",dms_E3_Projects_21)","v":""}]
[null,{"$f":"IF(ISBLANK(dms_E3_Projects_22),\"\",dms_E3_Projects_22)","v":""}]
[null,{"$f":"IF(ISBLANK(dms_E3_Projects_23),\"\",dms_E3_Projects_23)","v":""}]
[null,{"$f":"IF(ISBLANK(dms_E3_Projects_24),\"\",dms_E3_Projects_24)","v":""}]
[null,{"$f":"IF(ISBLANK(dms_E3_Projects_25),\"\",dms_E3_Projects_26)","v":""}]
[null,{"$f":"IF(ISBLANK(dms_E3_Projects_27),\"\",dms_E3_Projects_27)","v":""}]
[null,{"$f":"IF(ISBLANK(dms_E3_Projects_28),\"\",dms_E3_Projects_28)","v":""}]
[null,{"$f":"IF(ISBLANK(dms_E3_Projects_29),\"\",dms_E3_Projects_29)","v":""}]
[null,{"$f":"IF(ISBLANK(dms_E3_Projects_30),\"\",dms_E3_Projects_30)","v":""}]
[null,{"$f":"IF(ISBLANK(dms_E3_Projects_31),\"\",dms_E3_Projects_31)","v":""}]
[null,{"$f":"IF(ISBLANK(dms_E3_Projects_32),\"\",dms_E3_Projects_32)","v":""}]
[null,{"$f":"IF(ISBLANK(dms_E3_Projects_33),\"\",dms_E3_Projects_33)","v":""}]
[null,{"$f":"IF(ISBLANK(dms_E3_Projects_34),\"\",dms_E3_Projects_34)","v":""}]
[null,{"$f":"IF(ISBLANK(dms_E3_Projects_35),\"\",dms_E3_Projects_35)","v":""}]
[null,{"$f":"IF(ISBLANK(dms_E3_Projects_36),\"\",dms_E3_Projects_36)","v":""}]
[null,{"$f":"IF(ISBLANK(dms_E3_Projects_37),\"\",dms_E3_Projects_37)","v":""}]
[null,{"$f":"IF(ISBLANK(dms_E3_Projects_38),\"\",dms_E3_Projects_38)","v":""}]
[null,{"$f":"IF(ISBLANK(dms_E3_Projects_39),\"\",dms_E3_Projects_39)","v":""}]
[null,{"$f":"IF(ISBLANK(dms_E3_Projects_40),\"\",dms_E3_Projects_40)","v":""}]
[null,{"$f":"IF(ISBLANK(dms_E3_Projects_41),\"\",dms_E3_Projects_41)","v":""}]
[null,{"$f":"IF(ISBLANK(dms_E3_Projects_42),\"\",dms_E3_Projects_42)","v":""}]
[null,{"$f":"IF(ISBLANK(dms_E3_Projects_43),\"\",dms_E3_Projects_43)","v":""}]
[null,{"$f":"IF(ISBLANK(dms_E3_Projects_44),\"\",dms_E3_Projects_44)","v":""}]
[null,{"$f":"IF(ISBLANK(dms_E3_Projects_45),\"\",dms_E3_Projects_45)","v":""}]
[null,{"$f":"IF(ISBLANK(dms_E3_Projects_46),\"\",dms_E3_Projects_46)","v":""}]
[null,{"$f":"IF(ISBLANK(dms_E3_Projects_47),\"\",dms_E3_Projects_47)","v":""}]
[null,{"$f":"IF(ISBLANK(dms_E3_Projects_48),\"\",dms_E3_Projects_48)","v":""}]
[null,{"$f":"IF(ISBLANK(dms_E3_Projects_49),\"\",dms_E3_Projects_49)","v":""}]
[null,{"$f":"IF(ISBLANK(dms_E3_Projects_50),\"\",dms_E3_Projects_50)","v":""}]
[null,"Aggregate of other projects with total expenditure of less than $500,000"]
[null,"Total",{"$f":"SUM(C350:C400)","v":0},{"$f":"SUM(D350:D400)","v":0},{"$f":"SUM(E350:E400)","v":0},{"$f":"SUM(F350:F400)","v":0},{"$f":"SUM(G350:G400)","v":0},{"$f":"SUM(H350:H400)","v":0},{"$f":"SUM(I350:I400)","v":0}]
[]
[]
[]
[null,"E3.2 - VOLUMES - BY PRESSURE TYPE - BY PROJECT"]
[null,"A. LOW PRESSURE TO LOW PRESSURE"]
[null,null,"LENGTH"]
[null,null,"0s, metres"]
[null,null,{"$f":"VLOOKUP(CRCP_y4,'AER lookups'!$B$52:$C$101,2,0)","v":2022},{"$f":"CONCATENATE(\"1 Jan-30 Jun \"&(C409+1))","v":"1 Jan-30 Jun 2023"},{"$f":"FRCP_y1","v":"2023-24"},{"$f":"FRCP_y2","v":"2024-25"},{"$f":"FRCP_y3","v":"2025-26"},{"$f":"FRCP_y4","v":"2026-27"},{"$f":"FRCP_y5","v":"2027-28"}]
[null,{"$f":"IF(ISBLANK(dms_E3_Projects_01),\"\",dms_E3_Projects_01)","v":"Macedon"}]
[null,{"$f":"IF(ISBLANK(dms_E3_Projects_02),\"\",dms_E3_Projects_02)","v":"Cragieburn"}]
[null,{"$f":"IF(ISBLANK(dms_E3_Projects_03),\"\",dms_E3_Projects_03)","v":"Ballarat"}]
[null,{"$f":"IF(ISBLANK(dms_E3_Projects_04),\"\",dms_E3_Projects_04)","v":"Bendigo"}]
[null,{"$f":"IF(ISBLANK(dms_E3_Projects_05),\"\",dms_E3_Projects_05)","v":"Point Cook"}]
[null,{"$f":"IF(ISBLANK(dms_E3_Projects_06),\"\",dms_E3_Projects_06)","v":"Tarneit"}]
[null,{"$f":"IF(ISBLANK(dms_E3_Projects_07),\"\",dms_E3_Projects_07)","v":"Geelong Bellerine"}]
[null,{"$f":"IF(ISBLANK(dms_E3_Projects_08),\"\",dms_E3_Projects_08)","v":"Ballan"}]
[null,{"$f":"IF(ISBLANK(dms_E3_Projects_09),\"\",dms_E3_Projects_09)","v":"Bacchus Marsh"}]
[null,{"$f":"IF(ISBLANK(dms_E3_Projects_10),\"\",dms_E3_Projects_10)","v":"Sunbury"}]
[null,{"$f":"IF(ISBLANK(dms_E3_Projects_11),\"\",dms_E3_Projects_11)","v":"Werribee"}]
[null,{"$f":"IF(ISBLANK(dms_E3_Projects_12),\"\",dms_E3_Projects_12)","v":"Werribee 2 "}]
[null,{"$f":"IF(ISBLANK(dms_E3_Projects_13),\"\",dms_E3_Projects_13)","v":"Leopold"}]
[null,{"$f":"IF(ISBLANK(dms_E3_Projects_14),\"\",dms_E3_Projects_14)","v":"City Gate - New"}]
[null,{"$f":"IF(ISBLANK(dms_E3_Projects_15),\"\",dms_E3_Projects_15)","v":"City Gate - Capacity Upgrade"}]
[null,{"$f":"IF(ISBLANK(dms_E3_Projects_16),\"\",dms_E3_Projects_16)","v":"Field Regulator - New"}]
[null,{"$f":"IF(ISBLANK(dms_E3_Projects_17),\"\",dms_E3_Projects_17)","v":"Field Regulator - Capacity Upgrade"}]
[null,{"$f":"IF(ISBLANK(dms_E3_Projects_18),\"\",dms_E3_Projects_18)","v":"Network Reinforcement - Distribution"}]
[null,{"$f":"IF(ISBLANK(dms_E3_Projects_18),\"\",dms_E3_Projects_18)","v":"Network Reinforcement - Distribution"}]
[null,{"$f":"IF(ISBLANK(dms_E3_Projects_19),\"\",dms_E3_Projects_19)","v":"Network Reinforcement - Transmission"}]
[null,{"$f":"IF(ISBLANK(dms_E3_Projects_20),\"\",dms_E3_Projects_20)","v":""}]
[null,{"$f":"IF(ISBLANK(dms_E3_Projects_21),\"\",dms_E3_Projects_21)","v":""}]
[null,{"$f":"IF(ISBLANK(dms_E3_Projects_22),\"\",dms_E3_Projects_22)","v":""}]
[null,{"$f":"IF(ISBLANK(dms_E3_Projects_23),\"\",dms_E3_Projects_23)","v":""}]
[null,{"$f":"IF(ISBLANK(dms_E3_Projects_24),\"\",dms_E3_Projects_24)","v":""}]
[null,{"$f":"IF(ISBLANK(dms_E3_Projects_25),\"\",dms_E3_Projects_26)","v":""}]
[null,{"$f":"IF(ISBLANK(dms_E3_Projects_27),\"\",dms_E3_Projects_27)","v":""}]
[null,{"$f":"IF(ISBLANK(dms_E3_Projects_28),\"\",dms_E3_Projects_28)","v":""}]
[null,{"$f":"IF(ISBLANK(dms_E3_Projects_29),\"\",dms_E3_Projects_29)","v":""}]
[null,{"$f":"IF(ISBLANK(dms_E3_Projects_30),\"\",dms_E3_Projects_30)","v":""}]
[null,{"$f":"IF(ISBLANK(dms_E3_Projects_31),\"\",dms_E3_Projects_31)","v":""}]
[null,{"$f":"IF(ISBLANK(dms_E3_Projects_32),\"\",dms_E3_Projects_32)","v":""}]
[null,{"$f":"IF(ISBLANK(dms_E3_Projects_33),\"\",dms_E3_Projects_33)","v":""}]
[null,{"$f":"IF(ISBLANK(dms_E3_Projects_34),\"\",dms_E3_Projects_34)","v":""}]
[null,{"$f":"IF(ISBLANK(dms_E3_Projects_35),\"\",dms_E3_Projects_35)","v":""}]
[null,{"$f":"IF(ISBLANK(dms_E3_Projects_36),\"\",dms_E3_Projects_36)","v":""}]
[null,{"$f":"IF(ISBLANK(dms_E3_Projects_37),\"\",dms_E3_Projects_37)","v":""}]
[null,{"$f":"IF(ISBLANK(dms_E3_Projects_38),\"\",dms_E3_Projects_38)","v":""}]
[null,{"$f":"IF(ISBLANK(dms_E3_Projects_39),\"\",dms_E3_Projects_39)","v":""}]
[null,{"$f":"IF(ISBLANK(dms_E3_Projects_40),\"\",dms_E3_Projects_40)","v":""}]
[null,{"$f":"IF(ISBLANK(dms_E3_Projects_41),\"\",dms_E3_Projects_41)","v":""}]
[null,{"$f":"IF(ISBLANK(dms_E3_Projects_42),\"\",dms_E3_Projects_42)","v":""}]
[null,{"$f":"IF(ISBLANK(dms_E3_Projects_43),\"\",dms_E3_Projects_43)","v":""}]
[null,{"$f":"IF(ISBLANK(dms_E3_Projects_44),\"\",dms_E3_Projects_44)","v":""}]
[null,{"$f":"IF(ISBLANK(dms_E3_Projects_45),\"\",dms_E3_Projects_45)","v":""}]
[null,{"$f":"IF(ISBLANK(dms_E3_Projects_46),\"\",dms_E3_Projects_46)","v":""}]
[null,{"$f":"IF(ISBLANK(dms_E3_Projects_47),\"\",dms_E3_Projects_47)","v":""}]
[null,{"$f":"IF(ISBLANK(dms_E3_Projects_48),\"\",dms_E3_Projects_48)","v":""}]
[null,{"$f":"IF(ISBLANK(dms_E3_Projects_49),\"\",dms_E3_Projects_49)","v":""}]
[null,{"$f":"IF(ISBLANK(dms_E3_Projects_50),\"\",dms_E3_Projects_50)","v":""}]
[null,"Aggregate of other projects with total expenditure of less than $500,000"]
[null,"Total",{"$f":"SUM(C410:C460)","v":0},{"$f":"SUM(D410:D460)","v":0},{"$f":"SUM(E410:E460)","v":0},{"$f":"SUM(F410:F460)","v":0},{"$f":"SUM(G410:G460)","v":0},{"$f":"SUM(H410:H460)","v":0},{"$f":"SUM(I410:I460)","v":0}]
[]
[null,"B. LOW PRESSURE TO MEDIUM PRESSURE"]
[null,null,"LENGTH"]
[null,null,"0s, metres"]
[null,null,{"$f":"VLOOKUP(CRCP_y4,'AER lookups'!$B$52:$C$101,2,0)","v":2022},{"$f":"CONCATENATE(\"1 Jan-30 Jun \"&(C466+1))","v":"1 Jan-30 Jun 2023"},{"$f":"FRCP_y1","v":"2023-24"},{"$f":"FRCP_y2","v":"2024-25"},{"$f":"FRCP_y3","v":"2025-26"},{"$f":"FRCP_y4","v":"2026-27"},{"$f":"FRCP_y5","v":"2027-28"}]
[null,{"$f":"IF(ISBLANK(dms_E3_Projects_01),\"\",dms_E3_Projects_01)","v":"Macedon"}]
[null,{"$f":"IF(ISBLANK(dms_E3_Projects_02),\"\",dms_E3_Projects_02)","v":"Cragieburn"}]
[null,{"$f":"IF(ISBLANK(dms_E3_Projects_03),\"\",dms_E3_Projects_03)","v":"Ballarat"}]
[null,{"$f":"IF(ISBLANK(dms_E3_Projects_04),\"\",dms_E3_Projects_04)","v":"Bendigo"}]
[null,{"$f":"IF(ISBLANK(dms_E3_Projects_05),\"\",dms_E3_Projects_05)","v":"Point Cook"}]
[null,{"$f":"IF(ISBLANK(dms_E3_Projects_06),\"\",dms_E3_Projects_06)","v":"Tarneit"}]
[null,{"$f":"IF(ISBLANK(dms_E3_Projects_07),\"\",dms_E3_Projects_07)","v":"Geelong Bellerine"}]
[null,{"$f":"IF(ISBLANK(dms_E3_Projects_08),\"\",dms_E3_Projects_08)","v":"Ballan"}]
[null,{"$f":"IF(ISBLANK(dms_E3_Projects_09),\"\",dms_E3_Projects_09)","v":"Bacchus Marsh"}]
[null,{"$f":"IF(ISBLANK(dms_E3_Projects_10),\"\",dms_E3_Projects_10)","v":"Sunbury"}]
[null,{"$f":"IF(ISBLANK(dms_E3_Projects_11),\"\",dms_E3_Projects_11)","v":"Werribee"}]
[null,{"$f":"IF(ISBLANK(dms_E3_Projects_12),\"\",dms_E3_Projects_12)","v":"Werribee 2 "}]
[null,{"$f":"IF(ISBLANK(dms_E3_Projects_13),\"\",dms_E3_Projects_13)","v":"Leopold"}]
[null,{"$f":"IF(ISBLANK(dms_E3_Projects_14),\"\",dms_E3_Projects_14)","v":"City Gate - New"}]
[null,{"$f":"IF(ISBLANK(dms_E3_Projects_15),\"\",dms_E3_Projects_15)","v":"City Gate - Capacity Upgrade"}]
[null,{"$f":"IF(ISBLANK(dms_E3_Projects_16),\"\",dms_E3_Projects_16)","v":"Field Regulator - New"}]
[null,{"$f":"IF(ISBLANK(dms_E3_Projects_17),\"\",dms_E3_Projects_17)","v":"Field Regulator - Capacity Upgrade"}]
[null,{"$f":"IF(ISBLANK(dms_E3_Projects_18),\"\",dms_E3_Projects_18)","v":"Network Reinforcement - Distribution"}]
[null,{"$f":"IF(ISBLANK(dms_E3_Projects_18),\"\",dms_E3_Projects_18)","v":"Network Reinforcement - Distribution"}]
[null,{"$f":"IF(ISBLANK(dms_E3_Projects_19),\"\",dms_E3_Projects_19)","v":"Network Reinforcement - Transmission"}]
[null,{"$f":"IF(ISBLANK(dms_E3_Projects_20),\"\",dms_E3_Projects_20)","v":""}]
[null,{"$f":"IF(ISBLANK(dms_E3_Projects_21),\"\",dms_E3_Projects_21)","v":""}]
[null,{"$f":"IF(ISBLANK(dms_E3_Projects_22),\"\",dms_E3_Projects_22)","v":""}]
[null,{"$f":"IF(ISBLANK(dms_E3_Projects_23),\"\",dms_E3_Projects_23)","v":""}]
[null,{"$f":"IF(ISBLANK(dms_E3_Projects_24),\"\",dms_E3_Projects_24)","v":""}]
[null,{"$f":"IF(ISBLANK(dms_E3_Projects_25),\"\",dms_E3_Projects_26)","v":""}]
[null,{"$f":"IF(ISBLANK(dms_E3_Projects_27),\"\",dms_E3_Projects_27)","v":""}]
[null,{"$f":"IF(ISBLANK(dms_E3_Projects_28),\"\",dms_E3_Projects_28)","v":""}]
[null,{"$f":"IF(ISBLANK(dms_E3_Projects_29),\"\",dms_E3_Projects_29)","v":""}]
[null,{"$f":"IF(ISBLANK(dms_E3_Projects_30),\"\",dms_E3_Projects_30)","v":""}]
[null,{"$f":"IF(ISBLANK(dms_E3_Projects_31),\"\",dms_E3_Projects_31)","v":""}]
[null,{"$f":"IF(ISBLANK(dms_E3_Projects_32),\"\",dms_E3_Projects_32)","v":""}]
[null,{"$f":"IF(ISBLANK(dms_E3_Projects_33),\"\",dms_E3_Projects_33)","v":""}]
[null,{"$f":"IF(ISBLANK(dms_E3_Projects_34),\"\",dms_E3_Projects_34)","v":""}]
[null,{"$f":"IF(ISBLANK(dms_E3_Projects_35),\"\",dms_E3_Projects_35)","v":""}]
[null,{"$f":"IF(ISBLANK(dms_E3_Projects_36),\"\",dms_E3_Projects_36)","v":""}]
[null,{"$f":"IF(ISBLANK(dms_E3_Projects_37),\"\",dms_E3_Projects_37)","v":""}]
[null,{"$f":"IF(ISBLANK(dms_E3_Projects_38),\"\",dms_E3_Projects_38)","v":""}]
[null,{"$f":"IF(ISBLANK(dms_E3_Projects_39),\"\",dms_E3_Projects_39)","v":""}]
[null,{"$f":"IF(ISBLANK(dms_E3_Projects_40),\"\",dms_E3_Projects_40)","v":""}]
[null,{"$f":"IF(ISBLANK(dms_E3_Projects_41),\"\",dms_E3_Projects_41)","v":""}]
[null,{"$f":"IF(ISBLANK(dms_E3_Projects_42),\"\",dms_E3_Projects_42)","v":""}]
[null,{"$f":"IF(ISBLANK(dms_E3_Projects_43),\"\",dms_E3_Projects_43)","v":""}]
[null,{"$f":"IF(ISBLANK(dms_E3_Projects_44),\"\",dms_E3_Projects_44)","v":""}]
[null,{"$f":"IF(ISBLANK(dms_E3_Projects_45),\"\",dms_E3_Projects_45)","v":""}]
[null,{"$f":"IF(ISBLANK(dms_E3_Projects_46),\"\",dms_E3_Projects_46)","v":""}]
[null,{"$f":"IF(ISBLANK(dms_E3_Projects_47),\"\",dms_E3_Projects_47)","v":""}]
[null,{"$f":"IF(ISBLANK(dms_E3_Projects_48),\"\",dms_E3_Projects_48)","v":""}]
[null,{"$f":"IF(ISBLANK(dms_E3_Projects_49),\"\",dms_E3_Projects_49)","v":""}]
[null,{"$f":"IF(ISBLANK(dms_E3_Projects_50),\"\",dms_E3_Projects_50)","v":""}]
[null,"Aggregate of other projects with total expenditure of less than $500,000"]
[null,"Total",{"$f":"SUM(C467:C517)","v":0},{"$f":"SUM(D467:D517)","v":0},{"$f":"SUM(E467:E517)","v":0},{"$f":"SUM(F467:F517)","v":0},{"$f":"SUM(G467:G517)","v":0},{"$f":"SUM(H467:H517)","v":0},{"$f":"SUM(I467:I517)","v":0}]
[]
[null,"C. LOW PRESSURE TO HIGH PRESSURE"]
[null,null,"LENGTH"]
[null,null,"0s, metres"]
[null,null,{"$f":"VLOOKUP(CRCP_y4,'AER lookups'!$B$52:$C$101,2,0)","v":2022},{"$f":"CONCATENATE(\"1 Jan-30 Jun \"&(C523+1))","v":"1 Jan-30 Jun 2023"},{"$f":"FRCP_y1","v":"2023-24"},{"$f":"FRCP_y2","v":"2024-25"},{"$f":"FRCP_y3","v":"2025-26"},{"$f":"FRCP_y4","v":"2026-27"},{"$f":"FRCP_y5","v":"2027-28"}]
[null,{"$f":"IF(ISBLANK(dms_E3_Projects_01),\"\",dms_E3_Projects_01)","v":"Macedon"}]
[null,{"$f":"IF(ISBLANK(dms_E3_Projects_02),\"\",dms_E3_Projects_02)","v":"Cragieburn"}]
[null,{"$f":"IF(ISBLANK(dms_E3_Projects_03),\"\",dms_E3_Projects_03)","v":"Ballarat"}]
[null,{"$f":"IF(ISBLANK(dms_E3_Projects_04),\"\",dms_E3_Projects_04)","v":"Bendigo"}]
[null,{"$f":"IF(ISBLANK(dms_E3_Projects_05),\"\",dms_E3_Projects_05)","v":"Point Cook"}]
[null,{"$f":"IF(ISBLANK(dms_E3_Projects_06),\"\",dms_E3_Projects_06)","v":"Tarneit"}]
[null,{"$f":"IF(ISBLANK(dms_E3_Projects_07),\"\",dms_E3_Projects_07)","v":"Geelong Bellerine"}]
[null,{"$f":"IF(ISBLANK(dms_E3_Projects_08),\"\",dms_E3_Projects_08)","v":"Ballan"}]
[null,{"$f":"IF(ISBLANK(dms_E3_Projects_09),\"\",dms_E3_Projects_09)","v":"Bacchus Marsh"}]
[null,{"$f":"IF(ISBLANK(dms_E3_Projects_10),\"\",dms_E3_Projects_10)","v":"Sunbury"}]
[null,{"$f":"IF(ISBLANK(dms_E3_Projects_11),\"\",dms_E3_Projects_11)","v":"Werribee"}]
[null,{"$f":"IF(ISBLANK(dms_E3_Projects_12),\"\",dms_E3_Projects_12)","v":"Werribee 2 "}]
[null,{"$f":"IF(ISBLANK(dms_E3_Projects_13),\"\",dms_E3_Projects_13)","v":"Leopold"}]
[null,{"$f":"IF(ISBLANK(dms_E3_Projects_14),\"\",dms_E3_Projects_14)","v":"City Gate - New"}]
[null,{"$f":"IF(ISBLANK(dms_E3_Projects_15),\"\",dms_E3_Projects_15)","v":"City Gate - Capacity Upgrade"}]
[null,{"$f":"IF(ISBLANK(dms_E3_Projects_16),\"\",dms_E3_Projects_16)","v":"Field Regulator - New"}]
[null,{"$f":"IF(ISBLANK(dms_E3_Projects_17),\"\",dms_E3_Projects_17)","v":"Field Regulator - Capacity Upgrade"}]
[null,{"$f":"IF(ISBLANK(dms_E3_Projects_18),\"\",dms_E3_Projects_18)","v":"Network Reinforcement - Distribution"}]
[null,{"$f":"IF(ISBLANK(dms_E3_Projects_18),\"\",dms_E3_Projects_18)","v":"Network Reinforcement - Distribution"}]
[null,{"$f":"IF(ISBLANK(dms_E3_Projects_19),\"\",dms_E3_Projects_19)","v":"Network Reinforcement - Transmission"}]
[null,{"$f":"IF(ISBLANK(dms_E3_Projects_20),\"\",dms_E3_Projects_20)","v":""}]
[null,{"$f":"IF(ISBLANK(dms_E3_Projects_21),\"\",dms_E3_Projects_21)","v":""}]
[null,{"$f":"IF(ISBLANK(dms_E3_Projects_22),\"\",dms_E3_Projects_22)","v":""}]
[null,{"$f":"IF(ISBLANK(dms_E3_Projects_23),\"\",dms_E3_Projects_23)","v":""}]
[null,{"$f":"IF(ISBLANK(dms_E3_Projects_24),\"\",dms_E3_Projects_24)","v":""}]
[null,{"$f":"IF(ISBLANK(dms_E3_Projects_25),\"\",dms_E3_Projects_26)","v":""}]
[null,{"$f":"IF(ISBLANK(dms_E3_Projects_27),\"\",dms_E3_Projects_27)","v":""}]
[null,{"$f":"IF(ISBLANK(dms_E3_Projects_28),\"\",dms_E3_Projects_28)","v":""}]
[null,{"$f":"IF(ISBLANK(dms_E3_Projects_29),\"\",dms_E3_Projects_29)","v":""}]
[null,{"$f":"IF(ISBLANK(dms_E3_Projects_30),\"\",dms_E3_Projects_30)","v":""}]
[null,{"$f":"IF(ISBLANK(dms_E3_Projects_31),\"\",dms_E3_Projects_31)","v":""}]
[null,{"$f":"IF(ISBLANK(dms_E3_Projects_32),\"\",dms_E3_Projects_32)","v":""}]
[null,{"$f":"IF(ISBLANK(dms_E3_Projects_33),\"\",dms_E3_Projects_33)","v":""}]
[null,{"$f":"IF(ISBLANK(dms_E3_Projects_34),\"\",dms_E3_Projects_34)","v":""}]
[null,{"$f":"IF(ISBLANK(dms_E3_Projects_35),\"\",dms_E3_Projects_35)","v":""}]
[null,{"$f":"IF(ISBLANK(dms_E3_Projects_36),\"\",dms_E3_Projects_36)","v":""}]
[null,{"$f":"IF(ISBLANK(dms_E3_Projects_37),\"\",dms_E3_Projects_37)","v":""}]
[null,{"$f":"IF(ISBLANK(dms_E3_Projects_38),\"\",dms_E3_Projects_38)","v":""}]
[null,{"$f":"IF(ISBLANK(dms_E3_Projects_39),\"\",dms_E3_Projects_39)","v":""}]
[null,{"$f":"IF(ISBLANK(dms_E3_Projects_40),\"\",dms_E3_Projects_40)","v":""}]
[null,{"$f":"IF(ISBLANK(dms_E3_Projects_41),\"\",dms_E3_Projects_41)","v":""}]
[null,{"$f":"IF(ISBLANK(dms_E3_Projects_42),\"\",dms_E3_Projects_42)","v":""}]
[null,{"$f":"IF(ISBLANK(dms_E3_Projects_43),\"\",dms_E3_Projects_43)","v":""}]
[null,{"$f":"IF(ISBLANK(dms_E3_Projects_44),\"\",dms_E3_Projects_44)","v":""}]
[null,{"$f":"IF(ISBLANK(dms_E3_Projects_45),\"\",dms_E3_Projects_45)","v":""}]
[null,{"$f":"IF(ISBLANK(dms_E3_Projects_46),\"\",dms_E3_Projects_46)","v":""}]
[null,{"$f":"IF(ISBLANK(dms_E3_Projects_47),\"\",dms_E3_Projects_47)","v":""}]
[null,{"$f":"IF(ISBLANK(dms_E3_Projects_48),\"\",dms_E3_Projects_48)","v":""}]
[null,{"$f":"IF(ISBLANK(dms_E3_Projects_49),\"\",dms_E3_Projects_49)","v":""}]
[null,{"$f":"IF(ISBLANK(dms_E3_Projects_50),\"\",dms_E3_Projects_50)","v":""}]
[null,"Aggregate of other projects with total expenditure of less than $500,000"]
[null,"Total",{"$f":"SUM(C524:C574)","v":0},{"$f":"SUM(D524:D574)","v":0},{"$f":"SUM(E524:E574)","v":0},{"$f":"SUM(F524:F574)","v":0},{"$f":"SUM(G524:G574)","v":0},{"$f":"SUM(H524:H574)","v":0},{"$f":"SUM(I524:I574)","v":0}]
[]
[null,"D. MEDIUM PRESSURE TO MEDIUM PRESSURE"]
[null,null,"LENGTH"]
[null,null,"0s, metres"]
[null,null,{"$f":"VLOOKUP(CRCP_y4,'AER lookups'!$B$52:$C$101,2,0)","v":2022},{"$f":"CONCATENATE(\"1 Jan-30 Jun \"&(C580+1))","v":"1 Jan-30 Jun 2023"},{"$f":"FRCP_y1","v":"2023-24"},{"$f":"FRCP_y2","v":"2024-25"},{"$f":"FRCP_y3","v":"2025-26"},{"$f":"FRCP_y4","v":"2026-27"},{"$f":"FRCP_y5","v":"2027-28"}]
[null,{"$f":"IF(ISBLANK(dms_E3_Projects_01),\"\",dms_E3_Projects_01)","v":"Macedon"}]
[null,{"$f":"IF(ISBLANK(dms_E3_Projects_02),\"\",dms_E3_Projects_02)","v":"Cragieburn"}]
[null,{"$f":"IF(ISBLANK(dms_E3_Projects_03),\"\",dms_E3_Projects_03)","v":"Ballarat"}]
[null,{"$f":"IF(ISBLANK(dms_E3_Projects_04),\"\",dms_E3_Projects_04)","v":"Bendigo"}]
[null,{"$f":"IF(ISBLANK(dms_E3_Projects_05),\"\",dms_E3_Projects_05)","v":"Point Cook"}]
[null,{"$f":"IF(ISBLANK(dms_E3_Projects_06),\"\",dms_E3_Projects_06)","v":"Tarneit"}]
[null,{"$f":"IF(ISBLANK(dms_E3_Projects_07),\"\",dms_E3_Projects_07)","v":"Geelong Bellerine"}]
[null,{"$f":"IF(ISBLANK(dms_E3_Projects_08),\"\",dms_E3_Projects_08)","v":"Ballan"}]
[null,{"$f":"IF(ISBLANK(dms_E3_Projects_09),\"\",dms_E3_Projects_09)","v":"Bacchus Marsh"}]
[null,{"$f":"IF(ISBLANK(dms_E3_Projects_10),\"\",dms_E3_Projects_10)","v":"Sunbury"}]
[null,{"$f":"IF(ISBLANK(dms_E3_Projects_11),\"\",dms_E3_Projects_11)","v":"Werribee"}]
[null,{"$f":"IF(ISBLANK(dms_E3_Projects_12),\"\",dms_E3_Projects_12)","v":"Werribee 2 "}]
[null,{"$f":"IF(ISBLANK(dms_E3_Projects_13),\"\",dms_E3_Projects_13)","v":"Leopold"}]
[null,{"$f":"IF(ISBLANK(dms_E3_Projects_14),\"\",dms_E3_Projects_14)","v":"City Gate - New"}]
[null,{"$f":"IF(ISBLANK(dms_E3_Projects_15),\"\",dms_E3_Projects_15)","v":"City Gate - Capacity Upgrade"}]
[null,{"$f":"IF(ISBLANK(dms_E3_Projects_16),\"\",dms_E3_Projects_16)","v":"Field Regulator - New"}]
[null,{"$f":"IF(ISBLANK(dms_E3_Projects_17),\"\",dms_E3_Projects_17)","v":"Field Regulator - Capacity Upgrade"}]
[null,{"$f":"IF(ISBLANK(dms_E3_Projects_18),\"\",dms_E3_Projects_18)","v":"Network Reinforcement - Distribution"}]
[null,{"$f":"IF(ISBLANK(dms_E3_Projects_18),\"\",dms_E3_Projects_18)","v":"Network Reinforcement - Distribution"}]
[null,{"$f":"IF(ISBLANK(dms_E3_Projects_19),\"\",dms_E3_Projects_19)","v":"Network Reinforcement - Transmission"}]
[null,{"$f":"IF(ISBLANK(dms_E3_Projects_20),\"\",dms_E3_Projects_20)","v":""}]
[null,{"$f":"IF(ISBLANK(dms_E3_Projects_21),\"\",dms_E3_Projects_21)","v":""}]
[null,{"$f":"IF(ISBLANK(dms_E3_Projects_22),\"\",dms_E3_Projects_22)","v":""}]
[null,{"$f":"IF(ISBLANK(dms_E3_Projects_23),\"\",dms_E3_Projects_23)","v":""}]
[null,{"$f":"IF(ISBLANK(dms_E3_Projects_24),\"\",dms_E3_Projects_24)","v":""}]
[null,{"$f":"IF(ISBLANK(dms_E3_Projects_25),\"\",dms_E3_Projects_26)","v":""}]
[null,{"$f":"IF(ISBLANK(dms_E3_Projects_27),\"\",dms_E3_Projects_27)","v":""}]
[null,{"$f":"IF(ISBLANK(dms_E3_Projects_28),\"\",dms_E3_Projects_28)","v":""}]
[null,{"$f":"IF(ISBLANK(dms_E3_Projects_29),\"\",dms_E3_Projects_29)","v":""}]
[null,{"$f":"IF(ISBLANK(dms_E3_Projects_30),\"\",dms_E3_Projects_30)","v":""}]
[null,{"$f":"IF(ISBLANK(dms_E3_Projects_31),\"\",dms_E3_Projects_31)","v":""}]
[null,{"$f":"IF(ISBLANK(dms_E3_Projects_32),\"\",dms_E3_Projects_32)","v":""}]
[null,{"$f":"IF(ISBLANK(dms_E3_Projects_33),\"\",dms_E3_Projects_33)","v":""}]
[null,{"$f":"IF(ISBLANK(dms_E3_Projects_34),\"\",dms_E3_Projects_34)","v":""}]
[null,{"$f":"IF(ISBLANK(dms_E3_Projects_35),\"\",dms_E3_Projects_35)","v":""}]
[null,{"$f":"IF(ISBLANK(dms_E3_Projects_36),\"\",dms_E3_Projects_36)","v":""}]
[null,{"$f":"IF(ISBLANK(dms_E3_Projects_37),\"\",dms_E3_Projects_37)","v":""}]
[null,{"$f":"IF(ISBLANK(dms_E3_Projects_38),\"\",dms_E3_Projects_38)","v":""}]
[null,{"$f":"IF(ISBLANK(dms_E3_Projects_39),\"\",dms_E3_Projects_39)","v":""}]
[null,{"$f":"IF(ISBLANK(dms_E3_Projects_40),\"\",dms_E3_Projects_40)","v":""}]
[null,{"$f":"IF(ISBLANK(dms_E3_Projects_41),\"\",dms_E3_Projects_41)","v":""}]
[null,{"$f":"IF(ISBLANK(dms_E3_Projects_42),\"\",dms_E3_Projects_42)","v":""}]
[null,{"$f":"IF(ISBLANK(dms_E3_Projects_43),\"\",dms_E3_Projects_43)","v":""}]
[null,{"$f":"IF(ISBLANK(dms_E3_Projects_44),\"\",dms_E3_Projects_44)","v":""}]
[null,{"$f":"IF(ISBLANK(dms_E3_Projects_45),\"\",dms_E3_Projects_45)","v":""}]
[null,{"$f":"IF(ISBLANK(dms_E3_Projects_46),\"\",dms_E3_Projects_46)","v":""}]
[null,{"$f":"IF(ISBLANK(dms_E3_Projects_47),\"\",dms_E3_Projects_47)","v":""}]
[null,{"$f":"IF(ISBLANK(dms_E3_Projects_48),\"\",dms_E3_Projects_48)","v":""}]
[null,{"$f":"IF(ISBLANK(dms_E3_Projects_49),\"\",dms_E3_Projects_49)","v":""}]
[null,{"$f":"IF(ISBLANK(dms_E3_Projects_50),\"\",dms_E3_Projects_50)","v":""}]
[null,"Aggregate of other projects with total expenditure of less than $500,000"]
[null,"Total",{"$f":"SUM(C581:C631)","v":0},{"$f":"SUM(D581:D631)","v":0},{"$f":"SUM(E581:E631)","v":0},{"$f":"SUM(F581:F631)","v":0},{"$f":"SUM(G581:G631)","v":0},{"$f":"SUM(H581:H631)","v":0},{"$f":"SUM(I581:I631)","v":0}]
[]
[null,"E. MEDIUM PRESSURE TO HIGH PRESSURE"]
[null,null,"LENGTH"]
[null,null,"0s, metres"]
[null,null,{"$f":"VLOOKUP(CRCP_y4,'AER lookups'!$B$52:$C$101,2,0)","v":2022},{"$f":"CONCATENATE(\"1 Jan-30 Jun \"&(C637+1))","v":"1 Jan-30 Jun 2023"},{"$f":"FRCP_y1","v":"2023-24"},{"$f":"FRCP_y2","v":"2024-25"},{"$f":"FRCP_y3","v":"2025-26"},{"$f":"FRCP_y4","v":"2026-27"},{"$f":"FRCP_y5","v":"2027-28"}]
[null,{"$f":"IF(ISBLANK(dms_E3_Projects_01),\"\",dms_E3_Projects_01)","v":"Macedon"}]
[null,{"$f":"IF(ISBLANK(dms_E3_Projects_02),\"\",dms_E3_Projects_02)","v":"Cragieburn"}]
[null,{"$f":"IF(ISBLANK(dms_E3_Projects_03),\"\",dms_E3_Projects_03)","v":"Ballarat"}]
[null,{"$f":"IF(ISBLANK(dms_E3_Projects_04),\"\",dms_E3_Projects_04)","v":"Bendigo"}]
[null,{"$f":"IF(ISBLANK(dms_E3_Projects_05),\"\",dms_E3_Projects_05)","v":"Point Cook"}]
[null,{"$f":"IF(ISBLANK(dms_E3_Projects_06),\"\",dms_E3_Projects_06)","v":"Tarneit"}]
[null,{"$f":"IF(ISBLANK(dms_E3_Projects_07),\"\",dms_E3_Projects_07)","v":"Geelong Bellerine"}]
[null,{"$f":"IF(ISBLANK(dms_E3_Projects_08),\"\",dms_E3_Projects_08)","v":"Ballan"}]
[null,{"$f":"IF(ISBLANK(dms_E3_Projects_09),\"\",dms_E3_Projects_09)","v":"Bacchus Marsh"}]
[null,{"$f":"IF(ISBLANK(dms_E3_Projects_10),\"\",dms_E3_Projects_10)","v":"Sunbury"}]
[null,{"$f":"IF(ISBLANK(dms_E3_Projects_11),\"\",dms_E3_Projects_11)","v":"Werribee"}]
[null,{"$f":"IF(ISBLANK(dms_E3_Projects_12),\"\",dms_E3_Projects_12)","v":"Werribee 2 "}]
[null,{"$f":"IF(ISBLANK(dms_E3_Projects_13),\"\",dms_E3_Projects_13)","v":"Leopold"}]
[null,{"$f":"IF(ISBLANK(dms_E3_Projects_14),\"\",dms_E3_Projects_14)","v":"City Gate - New"}]
[null,{"$f":"IF(ISBLANK(dms_E3_Projects_15),\"\",dms_E3_Projects_15)","v":"City Gate - Capacity Upgrade"}]
[null,{"$f":"IF(ISBLANK(dms_E3_Projects_16),\"\",dms_E3_Projects_16)","v":"Field Regulator - New"}]
[null,{"$f":"IF(ISBLANK(dms_E3_Projects_17),\"\",dms_E3_Projects_17)","v":"Field Regulator - Capacity Upgrade"}]
[null,{"$f":"IF(ISBLANK(dms_E3_Projects_18),\"\",dms_E3_Projects_18)","v":"Network Reinforcement - Distribution"}]
[null,{"$f":"IF(ISBLANK(dms_E3_Projects_18),\"\",dms_E3_Projects_18)","v":"Network Reinforcement - Distribution"}]
[null,{"$f":"IF(ISBLANK(dms_E3_Projects_19),\"\",dms_E3_Projects_19)","v":"Network Reinforcement - Transmission"}]
[null,{"$f":"IF(ISBLANK(dms_E3_Projects_20),\"\",dms_E3_Projects_20)","v":""}]
[null,{"$f":"IF(ISBLANK(dms_E3_Projects_21),\"\",dms_E3_Projects_21)","v":""}]
[null,{"$f":"IF(ISBLANK(dms_E3_Projects_22),\"\",dms_E3_Projects_22)","v":""}]
[null,{"$f":"IF(ISBLANK(dms_E3_Projects_23),\"\",dms_E3_Projects_23)","v":""}]
[null,{"$f":"IF(ISBLANK(dms_E3_Projects_24),\"\",dms_E3_Projects_24)","v":""}]
[null,{"$f":"IF(ISBLANK(dms_E3_Projects_25),\"\",dms_E3_Projects_26)","v":""}]
[null,{"$f":"IF(ISBLANK(dms_E3_Projects_27),\"\",dms_E3_Projects_27)","v":""}]
[null,{"$f":"IF(ISBLANK(dms_E3_Projects_28),\"\",dms_E3_Projects_28)","v":""}]
[null,{"$f":"IF(ISBLANK(dms_E3_Projects_29),\"\",dms_E3_Projects_29)","v":""}]
[null,{"$f":"IF(ISBLANK(dms_E3_Projects_30),\"\",dms_E3_Projects_30)","v":""}]
[null,{"$f":"IF(ISBLANK(dms_E3_Projects_31),\"\",dms_E3_Projects_31)","v":""}]
[null,{"$f":"IF(ISBLANK(dms_E3_Projects_32),\"\",dms_E3_Projects_32)","v":""}]
[null,{"$f":"IF(ISBLANK(dms_E3_Projects_33),\"\",dms_E3_Projects_33)","v":""}]
[null,{"$f":"IF(ISBLANK(dms_E3_Projects_34),\"\",dms_E3_Projects_34)","v":""}]
[null,{"$f":"IF(ISBLANK(dms_E3_Projects_35),\"\",dms_E3_Projects_35)","v":""}]
[null,{"$f":"IF(ISBLANK(dms_E3_Projects_36),\"\",dms_E3_Projects_36)","v":""}]
[null,{"$f":"IF(ISBLANK(dms_E3_Projects_37),\"\",dms_E3_Projects_37)","v":""}]
[null,{"$f":"IF(ISBLANK(dms_E3_Projects_38),\"\",dms_E3_Projects_38)","v":""}]
[null,{"$f":"IF(ISBLANK(dms_E3_Projects_39),\"\",dms_E3_Projects_39)","v":""}]
[null,{"$f":"IF(ISBLANK(dms_E3_Projects_40),\"\",dms_E3_Projects_40)","v":""}]
[null,{"$f":"IF(ISBLANK(dms_E3_Projects_41),\"\",dms_E3_Projects_41)","v":""}]
[null,{"$f":"IF(ISBLANK(dms_E3_Projects_42),\"\",dms_E3_Projects_42)","v":""}]
[null,{"$f":"IF(ISBLANK(dms_E3_Projects_43),\"\",dms_E3_Projects_43)","v":""}]
[null,{"$f":"IF(ISBLANK(dms_E3_Projects_44),\"\",dms_E3_Projects_44)","v":""}]
[null,{"$f":"IF(ISBLANK(dms_E3_Projects_45),\"\",dms_E3_Projects_45)","v":""}]
[null,{"$f":"IF(ISBLANK(dms_E3_Projects_46),\"\",dms_E3_Projects_46)","v":""}]
[null,{"$f":"IF(ISBLANK(dms_E3_Projects_47),\"\",dms_E3_Projects_47)","v":""}]
[null,{"$f":"IF(ISBLANK(dms_E3_Projects_48),\"\",dms_E3_Projects_48)","v":""}]
[null,{"$f":"IF(ISBLANK(dms_E3_Projects_49),\"\",dms_E3_Projects_49)","v":""}]
[null,{"$f":"IF(ISBLANK(dms_E3_Projects_50),\"\",dms_E3_Projects_50)","v":""}]
[null,"Aggregate of other projects with total expenditure of less than $500,000"]
[null,"Total",{"$f":"SUM(C638:C688)","v":0},{"$f":"SUM(D638:D688)","v":0},{"$f":"SUM(E638:E688)","v":0},{"$f":"SUM(F638:F688)","v":0},{"$f":"SUM(G638:G688)","v":0},{"$f":"SUM(H638:H688)","v":0},{"$f":"SUM(I638:I688)","v":0}]
[]
[null,"F. HIGH PRESSURE TO HIGH PRESSURE"]
[null,null,"LENGTH"]
[null,null,"0s, metres"]
[null,null,{"$f":"VLOOKUP(CRCP_y4,'AER lookups'!$B$52:$C$101,2,0)","v":2022},{"$f":"CONCATENATE(\"1 Jan-30 Jun \"&(C694+1))","v":"1 Jan-30 Jun 2023"},{"$f":"FRCP_y1","v":"2023-24"},{"$f":"FRCP_y2","v":"2024-25"},{"$f":"FRCP_y3","v":"2025-26"},{"$f":"FRCP_y4","v":"2026-27"},{"$f":"FRCP_y5","v":"2027-28"}]
[null,{"$f":"IF(ISBLANK(dms_E3_Projects_01),\"\",dms_E3_Projects_01)","v":"Macedon"}]
[null,{"$f":"IF(ISBLANK(dms_E3_Projects_02),\"\",dms_E3_Projects_02)","v":"Cragieburn"}]
[null,{"$f":"IF(ISBLANK(dms_E3_Projects_03),\"\",dms_E3_Projects_03)","v":"Ballarat"}]
[null,{"$f":"IF(ISBLANK(dms_E3_Projects_04),\"\",dms_E3_Projects_04)","v":"Bendigo"}]
[null,{"$f":"IF(ISBLANK(dms_E3_Projects_05),\"\",dms_E3_Projects_05)","v":"Point Cook"}]
[null,{"$f":"IF(ISBLANK(dms_E3_Projects_06),\"\",dms_E3_Projects_06)","v":"Tarneit"}]
[null,{"$f":"IF(ISBLANK(dms_E3_Projects_07),\"\",dms_E3_Projects_07)","v":"Geelong Bellerine"}]
[null,{"$f":"IF(ISBLANK(dms_E3_Projects_08),\"\",dms_E3_Projects_08)","v":"Ballan"}]
[null,{"$f":"IF(ISBLANK(dms_E3_Projects_09),\"\",dms_E3_Projects_09)","v":"Bacchus Marsh"}]
[null,{"$f":"IF(ISBLANK(dms_E3_Projects_10),\"\",dms_E3_Projects_10)","v":"Sunbury"}]
[null,{"$f":"IF(ISBLANK(dms_E3_Projects_11),\"\",dms_E3_Projects_11)","v":"Werribee"}]
[null,{"$f":"IF(ISBLANK(dms_E3_Projects_12),\"\",dms_E3_Projects_12)","v":"Werribee 2 "}]
[null,{"$f":"IF(ISBLANK(dms_E3_Projects_13),\"\",dms_E3_Projects_13)","v":"Leopold"}]
[null,{"$f":"IF(ISBLANK(dms_E3_Projects_14),\"\",dms_E3_Projects_14)","v":"City Gate - New"}]
[null,{"$f":"IF(ISBLANK(dms_E3_Projects_15),\"\",dms_E3_Projects_15)","v":"City Gate - Capacity Upgrade"}]
[null,{"$f":"IF(ISBLANK(dms_E3_Projects_16),\"\",dms_E3_Projects_16)","v":"Field Regulator - New"}]
[null,{"$f":"IF(ISBLANK(dms_E3_Projects_17),\"\",dms_E3_Projects_17)","v":"Field Regulator - Capacity Upgrade"}]
[null,{"$f":"IF(ISBLANK(dms_E3_Projects_18),\"\",dms_E3_Projects_18)","v":"Network Reinforcement - Distribution"}]
[null,{"$f":"IF(ISBLANK(dms_E3_Projects_18),\"\",dms_E3_Projects_18)","v":"Network Reinforcement - Distribution"}]
[null,{"$f":"IF(ISBLANK(dms_E3_Projects_19),\"\",dms_E3_Projects_19)","v":"Network Reinforcement - Transmission"}]
[null,{"$f":"IF(ISBLANK(dms_E3_Projects_20),\"\",dms_E3_Projects_20)","v":""}]
[null,{"$f":"IF(ISBLANK(dms_E3_Projects_21),\"\",dms_E3_Projects_21)","v":""}]
[null,{"$f":"IF(ISBLANK(dms_E3_Projects_22),\"\",dms_E3_Projects_22)","v":""}]
[null,{"$f":"IF(ISBLANK(dms_E3_Projects_23),\"\",dms_E3_Projects_23)","v":""}]
[null,{"$f":"IF(ISBLANK(dms_E3_Projects_24),\"\",dms_E3_Projects_24)","v":""}]
[null,{"$f":"IF(ISBLANK(dms_E3_Projects_25),\"\",dms_E3_Projects_26)","v":""}]
[null,{"$f":"IF(ISBLANK(dms_E3_Projects_27),\"\",dms_E3_Projects_27)","v":""}]
[null,{"$f":"IF(ISBLANK(dms_E3_Projects_28),\"\",dms_E3_Projects_28)","v":""}]
[null,{"$f":"IF(ISBLANK(dms_E3_Projects_29),\"\",dms_E3_Projects_29)","v":""}]
[null,{"$f":"IF(ISBLANK(dms_E3_Projects_30),\"\",dms_E3_Projects_30)","v":""}]
[null,{"$f":"IF(ISBLANK(dms_E3_Projects_31),\"\",dms_E3_Projects_31)","v":""}]
[null,{"$f":"IF(ISBLANK(dms_E3_Projects_32),\"\",dms_E3_Projects_32)","v":""}]
[null,{"$f":"IF(ISBLANK(dms_E3_Projects_33),\"\",dms_E3_Projects_33)","v":""}]
[null,{"$f":"IF(ISBLANK(dms_E3_Projects_34),\"\",dms_E3_Projects_34)","v":""}]
[null,{"$f":"IF(ISBLANK(dms_E3_Projects_35),\"\",dms_E3_Projects_35)","v":""}]
[null,{"$f":"IF(ISBLANK(dms_E3_Projects_36),\"\",dms_E3_Projects_36)","v":""}]
[null,{"$f":"IF(ISBLANK(dms_E3_Projects_37),\"\",dms_E3_Projects_37)","v":""}]
[null,{"$f":"IF(ISBLANK(dms_E3_Projects_38),\"\",dms_E3_Projects_38)","v":""}]
[null,{"$f":"IF(ISBLANK(dms_E3_Projects_39),\"\",dms_E3_Projects_39)","v":""}]
[null,{"$f":"IF(ISBLANK(dms_E3_Projects_40),\"\",dms_E3_Projects_40)","v":""}]
[null,{"$f":"IF(ISBLANK(dms_E3_Projects_41),\"\",dms_E3_Projects_41)","v":""}]
[null,{"$f":"IF(ISBLANK(dms_E3_Projects_42),\"\",dms_E3_Projects_42)","v":""}]
[null,{"$f":"IF(ISBLANK(dms_E3_Projects_43),\"\",dms_E3_Projects_43)","v":""}]
[null,{"$f":"IF(ISBLANK(dms_E3_Projects_44),\"\",dms_E3_Projects_44)","v":""}]
[null,{"$f":"IF(ISBLANK(dms_E3_Projects_45),\"\",dms_E3_Projects_45)","v":""}]
[null,{"$f":"IF(ISBLANK(dms_E3_Projects_46),\"\",dms_E3_Projects_46)","v":""}]
[null,{"$f":"IF(ISBLANK(dms_E3_Projects_47),\"\",dms_E3_Projects_47)","v":""}]
[null,{"$f":"IF(ISBLANK(dms_E3_Projects_48),\"\",dms_E3_Projects_48)","v":""}]
[null,{"$f":"IF(ISBLANK(dms_E3_Projects_49),\"\",dms_E3_Projects_49)","v":""}]
[null,{"$f":"IF(ISBLANK(dms_E3_Projects_50),\"\",dms_E3_Projects_50)","v":""}]
[null,"Aggregate of other projects with total expenditure of less than $500,000"]
[null,"Total",{"$f":"SUM(C695:C745)","v":0},{"$f":"SUM(D695:D745)","v":0},0,0,0,0,0]

{"sheet":"E4. Meter replacement","index":10,"n_rows":217,"n_cols":9,"rows_kept":217,"cut":false,"hidden":false,"merged":[]}
[null,{"$f":"INDEX(dms_Worksheet_List,MATCH(dms_Model,dms_Model_List))","v":"REGULATORY REPORTING STATEMENT"}]
[null,{"$f":"dms_TradingName","v":"AusNet (Gas)"}]
[null,{"$f":"dms_Header_Span","v":"2021-22 to 2027-28"}]
[null,"E4. METER REPLACEMENT"]
[]
[null,"E4.1 - CAPEX"]
[null,"E4.1.1 - NEW METERS ACQUIRED"]
[null,null,"EXPENDITURE"]
[null,null,{"$f":"CONCATENATE(\"$0's, real \",dms_DollarReal)","v":"$0's, real June 2023"}]
[null,null,{"$f":"VLOOKUP(CRCP_y4,'AER lookups'!$B$52:$C$101,2,0)","v":2022},{"$f":"CONCATENATE(\"1 Jan-30 Jun \"&(C10+1))","v":"1 Jan-30 Jun 2023"},{"$f":"FRCP_y1","v":"2023-24"},{"$f":"FRCP_y2","v":"2024-25"},{"$f":"FRCP_y3","v":"2025-26"},{"$f":"FRCP_y4","v":"2026-27"},{"$f":"FRCP_y5","v":"2027-28"}]
[null,"A. DIRECT INTERNAL LABOUR EXPENDITURE"]
[null,"Residential",0,0,0,0,0,0,0]
[null,"Industrial and Commercial",0,0,0,0,0,0,0]
[null,"Other",0,0,0,0,0,0,0]
[null,"Total",{"$f":"SUM(C12:C14)","v":0},{"$f":"SUM(D12:D14)","v":0},0,0,0,0,0]
[null,"B. DIRECT CONTRACTOR EXPENDITURE"]
[null,"Residential",0,0,0,0,0,0,0]
[null,"Industrial and Commercial",0,0,0,0,0,0,0]
[null,"Other",0,0,0,0,0,0,0]
[null,"Total",{"$f":"SUM(C17:C19)","v":0},{"$f":"SUM(D17:D19)","v":0},0,0,0,0,0]
[null,"C. DIRECT MATERIAL EXPENDITURE"]
[null,"Residential",0,0,0,0,0,0,0]
[null,"Industrial and Commercial",0,0,0,0,0,0,0]
[null,"Other",0,0,0,0,0,0,0]
[null,"Total",{"$f":"SUM(C22:C24)","v":0},{"$f":"SUM(D22:D24)","v":0},0,0,0,0,0]
[null,"D. OTHER DIRECT EXPENDITURE"]
[null,"Residential",0,0,0,0,0,0,0]
[null,"Industrial and Commercial",0,0,0,0,0,0,0]
[null,"Other",0,0,0,0,0,0,0]
[null,"Total",{"$f":"SUM(C27:C29)","v":0},{"$f":"SUM(D27:D29)","v":0},0,0,0,0,0]
[null,"E. RELATED PARTY MARGIN EXPENDITURE"]
[null,"Residential",0,0,0,0,0,0,0]
[null,"Industrial and Commercial",0,0,0,0,0,0,0]
[null,"Other",0,0,0,0,0,0,0]
[null,"Total",{"$f":"SUM(C32:C34)","v":0},{"$f":"SUM(D32:D34)","v":0},0,0,0,0,0]
[null,"F. CAPITAL CONTRIBUTIONS included in the above"]
[null,"Residential",0,0,0,0,0,0,0]
[null,"Industrial and Commercial",0,0,0,0,0,0,0]
[null,"Other",0,0,0,0,0,0,0]
[null,"Total",{"$f":"SUM(C37:C39)","v":0},{"$f":"SUM(D37:D39)","v":0},0,0,0,0,0]
[null,"TOTAL",{"$f":"SUM(C15,C20,C25,C30,C35,C40)","v":0},{"$f":"SUM(D15,D20,D25,D30,D35,D40)","v":0},0,0,0,0,0]
[]
[null,"E4.1.2 - METER REFURBISHMENT"]
[null,null,"EXPENDITURE"]
[null,null,{"$f":"CONCATENATE(\"$0's, real \",dms_DollarReal)","v":"$0's, real June 2023"}]
[null,null,{"$f":"VLOOKUP(CRCP_y4,'AER lookups'!$B$52:$C$101,2,0)","v":2022},{"$f":"CONCATENATE(\"1 Jan-30 Jun \"&(C46+1))","v":"1 Jan-30 Jun 2023"},{"$f":"FRCP_y1","v":"2023-24"},{"$f":"FRCP_y2","v":"2024-25"},{"$f":"FRCP_y3","v":"2025-26"},{"$f":"FRCP_y4","v":"2026-27"},{"$f":"FRCP_y5","v":"2027-28"}]
[null,"A. DIRECT INTERNAL LABOUR EXPENDITURE"]
[null,"Residential",0,0,0,0,0,0,0]
[null,"Industrial and Commercial",0,0,0,0,0,0,0]
[null,"Other",0,0,0,0,0,0,0]
[null,"Total",{"$f":"SUM(C48:C50)","v":0},{"$f":"SUM(D48:D50)","v":0},0,0,0,0,0]
[null,"B. DIRECT CONTRACTOR EXPENDITURE"]
[null,"Residential",0,0,0,0,0,0,0]
[null,"Industrial and Commercial",0,0,0,0,0,0,0]
[null,"Other",0,0,0,0,0,0,0]
[null,"Total",{"$f":"SUM(C53:C55)","v":0},{"$f":"SUM(D53:D55)","v":0},0,0,0,0,0]
[null,"C. DIRECT MATERIAL EXPENDITURE"]
[null,"Residential",0,0,0,0,0,0,0]
[null,"Industrial and Commercial",0,0,0,0,0,0,0]
[null,"Other",0,0,0,0,0,0,0]
[null,"Total",{"$f":"SUM(C58:C60)","v":0},{"$f":"SUM(D58:D60)","v":0},0,0,0,0,0]
[null,"D. OTHER DIRECT EXPENDITURE"]
[null,"Residential",0,0,0,0,0,0,0]
[null,"Industrial and Commercial",0,0,0,0,0,0,0]
[null,"Other",0,0,0,0,0,0,0]
[null,"Total",{"$f":"SUM(C63:C65)","v":0},{"$f":"SUM(D63:D65)","v":0},0,0,0,0,0]
[null,"E. RELATED PARTY MARGIN EXPENDITURE"]
[null,"Residential",0,0,0,0,0,0,0]
[null,"Industrial and Commercial",0,0,0,0,0,0,0]
[null,"Other",0,0,0,0,0,0,0]
[null,"Total",{"$f":"SUM(C68:C70)","v":0},{"$f":"SUM(D68:D70)","v":0},0,0,0,0,0]
[null,"F. CAPITAL CONTRIBUTIONS included in the above"]
[null,"Residential",0,0,0,0,0,0,0]
[null,"Industrial and Commercial",0,0,0,0,0,0,0]
[null,"Other",0,0,0,0,0,0,0]
[null,"Total",{"$f":"SUM(C73:C75)","v":0},{"$f":"SUM(D73:D75)","v":0},0,0,0,0,0]
[null,"TOTAL",{"$f":"SUM(C51,C56,C61,C66,C71,C76)","v":0},{"$f":"SUM(D51,D56,D61,D66,D71,D76)","v":0},0,0,0,0,0]
[]
[null,"E4.1.3 - METER INSTALLATION"]
[null,null,"EXPENDITURE"]
[null,null,{"$f":"CONCATENATE(\"$0's, real \",dms_DollarReal)","v":"$0's, real June 2023"}]
[null,null,{"$f":"VLOOKUP(CRCP_y4,'AER lookups'!$B$52:$C$101,2,0)","v":2022},{"$f":"CONCATENATE(\"1 Jan-30 Jun \"&(C82+1))","v":"1 Jan-30 Jun 2023"},{"$f":"FRCP_y1","v":"2023-24"},{"$f":"FRCP_y2","v":"2024-25"},{"$f":"FRCP_y3","v":"2025-26"},{"$f":"FRCP_y4","v":"2026-27"},{"$f":"FRCP_y5","v":"2027-28"}]
[null,"A. DIRECT INTERNAL LABOUR EXPENDITURE"]
[null,"Residential",64380.256048976647,47758.901398392132,95996.177750113871,175727.40471947449,187538.00214819208,97020.147108478472,86953.162364782271]
[null,"Industrial and Commercial",8895.7506222006832,5009.6943381832916,11181.051433757033,13174.230056689961,13147.909401501513,15369.400642422763,11119.845589094353]
[null,"Other",8079.0532286884654,5568.7484756394379,11417.092572640629,11356.976354725759,14371.814734051008,11303.516263443622,11312.846781031776]
[null,"Total",{"$f":"SUM(C84:C86)","v":81355.059899865795},{"$f":"SUM(D84:D86)","v":58337.344212214863},118594.32175651153,200258.6111308902,215057.72628374459,123693.06401434485,109385.85473490841]
[null,"B. DIRECT CONTRACTOR EXPENDITURE"]
[null,"Residential",1448555.7611019746,847687.78588019998,1695375.5717604,2034934.7363215003,2206121.4148295503,1663378.6757966999,1474550.9981793]
[null,"Industrial and Commercial",142332.00995521093,79740.782399999996,177085.21039999998,207038.77039999998,204375.2752,236305.48319999999,169106.7096]
[null,"Other",508980.35340737336,290424.14525,586387.0405,582724.87174999993,652912.70299999986,575400.53424999991,572665.44675]
[null,"Total",{"$f":"SUM(C89:C91)","v":2099868.1244645589},{"$f":"SUM(D89:D91)","v":1217852.7135302001},2458847.8226604001,2824698.3784715002,3063409.3930295501,2475084.6932466999,2216323.1545293001]
[null,"C. DIRECT MATERIAL EXPENDITURE"]
[null,"Residential",1706076.7852978813,983752.27065507998,1967504.54131016,2274462.1101011001,2473126.3901500697,1930371.7436191803,1711234.8636112201]
[null,"Industrial and Commercial",738347.30164265668,413655.30869999999,918629.52895000007,1074013.62145,1060196.7400999998,1225834.6941,877241.0560499999]
[null,"Other",290845.91623278474,258032.21649999998,532459.13300000003,521619.11349999998,729375.09400000004,499939.07449999999,491843.21549999999]
[null,"Total",{"$f":"SUM(C94:C96)","v":2735270.0031733229},{"$f":"SUM(D94:D96)","v":1655439.7958550798},3418593.2032601601,3870094.8450511,4262698.2242500689,3656145.5122191804,3080319.1351612201]
[null,"D. OTHER DIRECT EXPENDITURE"]
[null,"Residential",0,0,0,0,0,0,0]
[null,"Industrial and Commercial",0,0,0,0,0,0,0]
[null,"Other",0,0,0,0,0,0,0]
[null,"Total",{"$f":"SUM(C99:C101)","v":0},{"$f":"SUM(D99:D101)","v":0},0,0,0,0,0]
[null,"E. RELATED PARTY MARGIN EXPENDITURE"]
[null,"Residential",0,0,0,0,0,0,0]
[null,"Industrial and Commercial",0,0,0,0,0,0,0]
[null,"Other",0,0,0,0,0,0,0]
[null,"Total",{"$f":"SUM(C104:C106)","v":0},{"$f":"SUM(D104:D106)","v":0},0,0,0,0,0]
[null,"F. CAPITAL CONTRIBUTIONS included in the above"]
[null,"Residential",0,0,0,0,0,0,0]
[null,"Industrial and Commercial",0,0,0,0,0,0,0]
[null,"Other",0,0,0,0,0,0,0]
[null,"Total",{"$f":"SUM(C109:C111)","v":0},{"$f":"SUM(D109:D111)","v":0},0,0,0,0,0]
[null,"TOTAL",{"$f":"SUM(C87,C92,C97,C102,C107,C112)","v":4916493.1875377474},{"$f":"SUM(D87,D92,D97,D102,D107,D112)","v":2931629.8535974948},5996035.3476770716,6895051.8346534912,7541165.343563363,6254923.2694802247,5406028.1444254285]
[]
[null,"E4.1.4 - OTHER METER REPLACEMENT CAPEX"]
[null,null,"EXPENDITURE"]
[null,null,{"$f":"CONCATENATE(\"$0's, real \",dms_DollarReal)","v":"$0's, real June 2023"}]
[null,null,{"$f":"VLOOKUP(CRCP_y4,'AER lookups'!$B$52:$C$101,2,0)","v":2022},{"$f":"CONCATENATE(\"1 Jan-30 Jun \"&(C118+1))","v":"1 Jan-30 Jun 2023"},{"$f":"FRCP_y1","v":"2023-24"},{"$f":"FRCP_y2","v":"2024-25"},{"$f":"FRCP_y3","v":"2025-26"},{"$f":"FRCP_y4","v":"2026-27"},{"$f":"FRCP_y5","v":"2027-28"}]
[null,"A. DIRECT INTERNAL LABOUR EXPENDITURE"]
[null,"Residential",21004.975307285404,14798.231631630142,29744.689105121462,53695.982054950633,42135.021688191242,13089.036083792047,21503.829846214157]
[null,"Industrial and Commercial",0,0,0,0,0,0,0]
[null,"Other",0,0,0,0,0,0,0]
[null,"Total",{"$f":"SUM(C120:C122)","v":21004.975307285404},{"$f":"SUM(D120:D122)","v":14798.231631630142},29744.689105121462,53695.982054950633,42135.021688191242,13089.036083792047,21503.829846214157]
[null,"B. DIRECT CONTRACTOR EXPENDITURE"]
[null,"Residential",64630.693253185869,45297.65724,90595.314480000001,162279.95651999998,125953.874112,38700.911039999999,62888.980439999992]
[null,"Industrial and Commercial",0,0,0,0,0,0,0]
[null,"Other",0,0,0,0,0,0,0]
[null,"Total",{"$f":"SUM(C125:C127)","v":64630.693253185869},{"$f":"SUM(D125:D127)","v":45297.65724},90595.314480000001,162279.95651999998,125953.874112,38700.911039999999,62888.980439999992]
[null,"C. DIRECT MATERIAL EXPENDITURE"]
[null,"Residential",75941.064572493386,53224.747256999988,106449.49451399998,190678.94891099996,147995.80208160001,45473.570471999992,73894.552016999995]
[null,"Industrial and Commercial",0,0,0,0,0,0,0]
[null,"Other",0,0,0,0,0,0,0]
[null,"Total",{"$f":"SUM(C130:C132)","v":75941.064572493386},{"$f":"SUM(D130:D132)","v":53224.747256999988},106449.49451399998,190678.94891099996,147995.80208160001,45473.570471999992,73894.552016999995]
[null,"D. OTHER DIRECT EXPENDITURE"]
[null,"Residential",0,0,0,0,0,0,0]
[null,"Industrial and Commercial",0,0,0,0,0,0,0]
[null,"Other",0,0,0,0,0,0,0]
[null,"Total",{"$f":"SUM(C135:C137)","v":0},{"$f":"SUM(D135:D137)","v":0},0,0,0,0,0]
[null,"E. RELATED PARTY MARGIN EXPENDITURE"]
[null,"Residential",0,0,0,0,0,0,0]
[null,"Industrial and Commercial",0,0,0,0,0,0,0]
[null,"Other",0,0,0,0,0,0,0]
[null,"Total",{"$f":"SUM(C140:C142)","v":0},{"$f":"SUM(D140:D142)","v":0},0,0,0,0,0]
[null,"F. CAPITAL CONTRIBUTIONS included in the above"]
[null,"Residential",0,0,0,0,0,0,0]
[null,"Industrial and Commercial",0,0,0,0,0,0,0]
[null,"Other",0,0,0,0,0,0,0]
[null,"Total",{"$f":"SUM(C145:C147)","v":0},{"$f":"SUM(D145:D147)","v":0},0,0,0,0,0]
[null,"TOTAL",{"$f":"SUM(C123,C128,C133,C138,C143,C148)","v":161576.73313296464},{"$f":"SUM(D123,D128,D133,D138,D143,D148)","v":113320.63612863014},226789.49809912144,406654.8874859506,316084.69788179127,97263.517595792044,158287.36230321415]
[]
[]
[null,"E4.2 - VOLUMES"]
[null,"E4.2.1 - NUMBER OF NEW METERS ACQUIRED"]
[null,null,"VOLUMES"]
[null,null,"0s"]
[null,null,{"$f":"VLOOKUP(CRCP_y4,'AER lookups'!$B$52:$C$101,2,0)","v":2022},{"$f":"CONCATENATE(\"1 Jan-30 Jun \"&(C156+1))","v":"1 Jan-30 Jun 2023"},{"$f":"FRCP_y1","v":"2023-24"},{"$f":"FRCP_y2","v":"2024-25"},{"$f":"FRCP_y3","v":"2025-26"},{"$f":"FRCP_y4","v":"2026-27"},{"$f":"FRCP_y5","v":"2027-28"}]
[null,"Residential"]
[null,"Industrial and commercial"]
[null,"Other meters"]
[null,"Total",{"$f":"SUM(C157:C159)","v":0},{"$f":"SUM(D157:D159)","v":0},0,0,0,0,0]
[]
[]
[null,"E4.2.2 - NUMBER OF METERS REFURBISHED"]
[null,null,"VOLUMES"]
[null,null,"0s"]
[null,null,{"$f":"VLOOKUP(CRCP_y4,'AER lookups'!$B$52:$C$101,2,0)","v":2022},{"$f":"CONCATENATE(\"1 Jan-30 Jun \"&(C166+1))","v":"1 Jan-30 Jun 2023"},{"$f":"FRCP_y1","v":"2023-24"},{"$f":"FRCP_y2","v":"2024-25"},{"$f":"FRCP_y3","v":"2025-26"},{"$f":"FRCP_y4","v":"2026-27"},{"$f":"FRCP_y5","v":"2027-28"}]
[null,"A. REFURBISHABLE METERS REMOVED"]
[null,"Residential"]
[null,"Industrial and commercial"]
[null,"Other meters"]
[null,"Total",{"$f":"SUM(C168:C170)","v":0},0,0,0,0,0,0]
[null,"B. METERS DECOMMISSIONED"]
[null,"Residential"]
[null,"Industrial and commercial"]
[null,"Other meters"]
[null,"Total",{"$f":"SUM(C173:C175)","v":0},0,0,0,0,0,0]
[null,"TOTAL",{"$f":"SUM(C171,C176)","v":0},{"$f":"SUM(D171,D176)","v":0},0,0,0,0,0]
[]
[]
[null,"E4.2.3 - NUMBER OF METERS INSTALLED"]
[null,null,"VOLUMES"]
[null,null,"0s"]
[null,null,{"$f":"VLOOKUP(CRCP_y4,'AER lookups'!$B$52:$C$101,2,0)","v":2022},{"$f":"CONCATENATE(\"1 Jan-30 Jun \"&(C183+1))","v":"1 Jan-30 Jun 2023"},{"$f":"FRCP_y1","v":"2023-24"},{"$f":"FRCP_y2","v":"2024-25"},{"$f":"FRCP_y3","v":"2025-26"},{"$f":"FRCP_y4","v":"2026-27"},{"$f":"FRCP_y5","v":"2027-28"}]
[null,"Residential"]
[null,"Industrial and commercial"]
[null,"Other meters"]
[null,"Total",{"$f":"SUM(C184:C186)","v":0},{"$f":"SUM(D184:D186)","v":0},0,0,0,0,0]
[]
[]
[null,"E4.2.4 - NUMBER OF METERS REMOVED / DECOMMISSIONED"]
[null,null,"VOLUMES"]
[null,null,"0s"]
[null,null,{"$f":"VLOOKUP(CRCP_y4,'AER lookups'!$B$52:$C$101,2,0)","v":2022},{"$f":"CONCATENATE(\"1 Jan-30 Jun \"&(C193+1))","v":"1 Jan-30 Jun 2023"},{"$f":"FRCP_y1","v":"2023-24"},{"$f":"FRCP_y2","v":"2024-25"},{"$f":"FRCP_y3","v":"2025-26"},{"$f":"FRCP_y4","v":"2026-27"},{"$f":"FRCP_y5","v":"2027-28"}]
[null,"Residential"]
[null,"Industrial and commercial"]
[null,"Other meters"]
[null,"Total",{"$f":"SUM(C194:C196)","v":0},{"$f":"SUM(D194:D196)","v":0},0,0,0,0,0]
[]
[]
[null,"E4.2.5 - OTHER METER REPLACEMENT VOLUMES"]
[null,null,"VOLUMES"]
[null,null,"0s"]
[null,null,{"$f":"VLOOKUP(CRCP_y4,'AER lookups'!$B$52:$C$101,2,0)","v":2022},{"$f":"CONCATENATE(\"1 Jan-30 Jun \"&(C203+1))","v":"1 Jan-30 Jun 2023"},{"$f":"FRCP_y1","v":"2023-24"},{"$f":"FRCP_y2","v":"2024-25"},{"$f":"FRCP_y3","v":"2025-26"},{"$f":"FRCP_y4","v":"2026-27"},{"$f":"FRCP_y5","v":"2027-28"}]
[null,"Residential"]
[null,"Industrial and commercial"]
[null,"Other meters"]
[null,"Total",{"$f":"SUM(C204:C206)","v":0},{"$f":"SUM(D204:D206)","v":0},0,0,0,0,0]
[]
[]
[null,"E4.2.2 - NUMBER OF METERS Refurbished - replaced 6 May 2022"]
[null,null,"VOLUMES"]
[null,null,"0s"]
[null,null,{"$f":"VLOOKUP(CRCP_y4,'AER lookups'!$B$52:$C$101,2,0)","v":2022},{"$f":"CONCATENATE(\"1 Jan-30 Jun \"&(C213+1))","v":"1 Jan-30 Jun 2023"},{"$f":"FRCP_y1","v":"2023-24"},{"$f":"FRCP_y2","v":"2024-25"},{"$f":"FRCP_y3","v":"2025-26"},{"$f":"FRCP_y4","v":"2026-27"},{"$f":"FRCP_y5","v":"2027-28"}]
[null,"Residential"]
[null,"Industrial and commercial"]
[null,"Other meters"]
[null,"Total",{"$f":"SUM(C214:C216)","v":0},{"$f":"SUM(D214:D216)","v":0},0,0,0,0,0]

{"sheet":"E5. New Connections","index":11,"n_rows":284,"n_cols":10,"rows_kept":284,"cut":false,"hidden":false,"merged":[]}
[null,{"$f":"INDEX(dms_Worksheet_List,MATCH(dms_Model,dms_Model_List))","v":"REGULATORY REPORTING STATEMENT"}]
[null,{"$f":"dms_TradingName","v":"AusNet (Gas)"}]
[null,{"$f":"dms_Header_Span","v":"2021-22 to 2027-28"}]
[null,"E5. NEW CONNECTIONS"]
[]
[null,"E5.1 - EXPENDITURE"]
[null,"E5.1.1 - CAPEX - BY CONNECTION TYPE"]
[null,"A. DIRECT INTERNAL LABOUR EXPENDITURE"]
[null,null,null,"EXPENDITURE"]
[null,null,null,{"$f":"CONCATENATE(\"$0's, real \",dms_DollarReal)","v":"$0's, real June 2023"}]
[null,null,null,{"$f":"VLOOKUP(CRCP_y4,'AER lookups'!$B$52:$C$101,2,0)","v":2022},{"$f":"CONCATENATE(\"1 Jan-30 Jun \"&(D11+1))","v":"1 Jan-30 Jun 2023"},{"$f":"FRCP_y1","v":"2023-24"},{"$f":"FRCP_y2","v":"2024-25"},{"$f":"FRCP_y3","v":"2025-26"},{"$f":"FRCP_y4","v":"2026-27"},{"$f":"FRCP_y5","v":"2027-28"}]
[null,"(i)  ELECTRICITY TO GAS"]
[null,"Distribution Mains",null,0,0,0,0,0,0,0]
[null,"Inlet service pipes",null,0,0,0,0,0,0,0]
[null,"Meters",null,0,0,0,0,0,0,0]
[null,null,"Total",{"$f":"SUM(D13:D15)","v":0},{"$f":"SUM(E13:E15)","v":0},0,0,0,0,0]
[null,"(ii)  NEW HOMES"]
[null,"Distribution Mains",null,301927.42166933464,125782.96547426896,232328.23997770931,241448.36367563467,251317.95924937772,247860.58072163086,244060.02050003881]
[null,"Inlet service pipes",null,905782.26500800368,377348.89642280684,696984.71993312787,724345.09102690395,753953.87774813315,743581.74216489249,732180.06150011637]
[null,"Meters",null,301927.42166933464,125782.96547426896,232328.23997770931,241448.36367563467,251317.95924937772,247860.58072163086,244060.02050003881]
[null,null,"Total",{"$f":"SUM(D18:D20)","v":1509637.108346673},{"$f":"SUM(E18:E20)","v":628914.82737134479},{"$f":"SUM(F18:F20)","v":1161641.1998885465},{"$f":"SUM(G18:G20)","v":1207241.8183781733},{"$f":"SUM(H18:H20)","v":1256589.7962468886},{"$f":"SUM(I18:I20)","v":1239302.9036081543},{"$f":"SUM(J18:J20)","v":1220300.102500194}]
[null,"(iii)  NEW MEDIUM DENSITY / HIGH RISE"]
[null,"Distribution Mains",null,100642.47388977821,41927.655158089656,77442.746659236422,80482.787891878223,83772.653083125901,82620.193573876953,81353.340166679598]
[null,"Inlet service pipes",null,301927.42166933458,125782.96547426896,232328.23997770928,241448.36367563461,251317.95924937769,247860.58072163083,244060.02050003878]
[null,"Meters",null,100642.47388977821,41927.655158089656,77442.746659236422,80482.787891878223,83772.653083125901,82620.193573876953,81353.340166679598]
[null,null,"Total",{"$f":"SUM(D23:D25)","v":503212.36944889097},{"$f":"SUM(E23:E25)","v":209638.27579044827},{"$f":"SUM(F23:F25)","v":387213.73329618212},{"$f":"SUM(G23:G25)","v":402413.93945939105},{"$f":"SUM(H23:H25)","v":418863.26541562949},{"$f":"SUM(I23:I25)","v":413100.9678693848},{"$f":"SUM(J23:J25)","v":406766.70083339798}]
[null,"(iv)  INDUSTRIAL & COMMERCIAL TARIFF"]
[null,"Distribution Mains",null,34179.271374820833,45527.581533733894,61496.212826492818,63111.103109586285,64929.115915836526,64775.716442899487,64574.221985416996]
[null,"Inlet service pipes",null,51268.907062231257,68291.372300600851,92244.319239739227,94666.654664379443,97393.6738737548,97163.574664349231,96861.332978125502]
[null,"Meters",null,28482.726145684032,37939.651278111582,51246.844022077348,52592.585924655243,54107.596596530442,53979.76370241624,53811.851654514168]
[null,null,"Total",{"$f":"SUM(D28:D30)","v":113930.90458273613},{"$f":"SUM(E28:E30)","v":151758.60511244633},{"$f":"SUM(F28:F30)","v":204987.37608830939},{"$f":"SUM(G28:G30)","v":210370.34369862097},{"$f":"SUM(H28:H30)","v":216430.38638612177},{"$f":"SUM(I28:I30)","v":215919.05480966496},{"$f":"SUM(J28:J30)","v":215247.40661805667}]
[null,"(v)  INDUSTRIAL & COMMERCIAL CONTRACT"]
[null,"Distribution Mains",null,25389.620730197697,26578.91667227359,51146.549932204507,52357.421772642076,53735.087012050761,53635.071752899647,53500.052612502477]
[null,"Inlet service pipes",null,1692.64138201318,1771.927778151573,3409.7699954803011,3490.4947848428051,3582.3391341367178,3575.6714501933102,3566.6701741668317]
[null,"Meters",null,6770.5655280527199,7087.7111126062919,13639.079981921204,13961.97913937122,14329.356536546871,14302.685800773241,14266.680696667327]
[null,null,"Total",{"$f":"SUM(D33:D35)","v":33852.827640263597},{"$f":"SUM(E33:E35)","v":35438.555563031456},{"$f":"SUM(F33:F35)","v":68195.399909606014},{"$f":"SUM(G33:G35)","v":69809.895696856096},{"$f":"SUM(H33:H35)","v":71646.782682734352},{"$f":"SUM(I33:I35)","v":71513.4290038662},{"$f":"SUM(J33:J35)","v":71333.403483336631}]
[null,null,"TOTAL",{"$f":"SUM(D36,D31,D26,D21,D16)","v":2160633.2100185635},{"$f":"SUM(E36,E31,E26,E21,E16)","v":1025750.2638372709},1822037.709182644,1889835.9972330413,1963530.2307313741,1939836.3552910702,1913647.6134349853]
[]
[null,"B. DIRECT CONTRACTOR EXPENDITURE"]
[null,null,null,"EXPENDITURE"]
[null,null,null,{"$f":"CONCATENATE(\"$0's, real \",dms_DollarReal)","v":"$0's, real June 2023"}]
[null,null,null,{"$f":"VLOOKUP(CRCP_y4,'AER lookups'!$B$52:$C$101,2,0)","v":2022},{"$f":"CONCATENATE(\"1 Jan-30 Jun \"&(D42+1))","v":"1 Jan-30 Jun 2023"},{"$f":"FRCP_y1","v":"2023-24"},{"$f":"FRCP_y2","v":"2024-25"},{"$f":"FRCP_y3","v":"2025-26"},{"$f":"FRCP_y4","v":"2026-27"},{"$f":"FRCP_y5","v":"2027-28"}]
[null,"(i)  ELECTRICITY TO GAS"]
[null,"Distribution Mains",null,0,0,0,0,0,0,0]
[null,"Inlet service pipes",null,0,0,0,0,0,0,0]
[null,"Meters",null,0,0,0,0,0,0,0]
[null,null,"Total",{"$f":"SUM(D44:D46)","v":0},{"$f":"SUM(E44:E46)","v":0},{"$f":"SUM(F44:F46)","v":0},{"$f":"SUM(G44:G46)","v":0},{"$f":"SUM(H44:H46)","v":0},{"$f":"SUM(I44:I46)","v":0},{"$f":"SUM(J44:J46)","v":0}]
[null,"(ii)  NEW HOMES"]
[null,"Distribution Mains",null,5736621.0117173577,2377522.9166452214,4369535.4509993326,4505928.762973045,4639047.2374743847,4525410.1699800817,4407500.2376314374]
[null,"Inlet service pipes",null,17209863.035152074,7132568.7499356642,13108606.352997996,13517786.288919134,13917141.712423151,13576230.509940246,13222500.712894311]
[null,"Meters",null,5736621.0117173577,2377522.9166452214,4369535.4509993326,4505928.762973045,4639047.2374743847,4525410.1699800817,4407500.2376314374]
[null,null,"Total",{"$f":"SUM(D49:D51)","v":28683105.058586787},{"$f":"SUM(E49:E51)","v":11887614.583226107},{"$f":"SUM(F49:F51)","v":21847677.254996665},{"$f":"SUM(G49:G51)","v":22529643.814865224},{"$f":"SUM(H49:H51)","v":23195236.187371921},{"$f":"SUM(I49:I51)","v":22627050.84990041},{"$f":"SUM(J49:J51)","v":22037501.188157186}]
[null,"(iii)  NEW MEDIUM DENSITY / HIGH RISE"]
[null,"Distribution Mains",null,1912207.003905786,792507.63888174063,1456511.8169997775,1501976.2543243484,1546349.0791581282,1508470.0566600275,1469166.7458771458]
[null,"Inlet service pipes",null,5736621.0117173577,2377522.9166452214,4369535.4509993317,4505928.762973045,4639047.2374743838,4525410.1699800817,4407500.2376314364]
[null,"Meters",null,1912207.003905786,792507.63888174063,1456511.8169997775,1501976.2543243484,1546349.0791581282,1508470.0566600275,1469166.7458771458]
[null,null,"Total",{"$f":"SUM(D54:D56)","v":9561035.0195289291},{"$f":"SUM(E54:E56)","v":3962538.1944087027},{"$f":"SUM(F54:F56)","v":7282559.0849988861},{"$f":"SUM(G54:G56)","v":7509881.2716217423},{"$f":"SUM(H54:H56)","v":7731745.3957906403},{"$f":"SUM(I54:I56)","v":7542350.2833001362},{"$f":"SUM(J54:J56)","v":7345833.729385728}]
[null,"(iv)  INDUSTRIAL & COMMERCIAL TARIFF"]
[null,"Distribution Mains",null,649406.15612159588,860552.68316939974,1156595.8665780001,1177784.4771251997,1198518.548856,1182667.6315571999,1166151.2531321999]
[null,"Inlet service pipes",null,974109.23418239399,1290829.0247540998,1734893.7998670002,1766676.7156877997,1797777.8232840002,1774001.4473357999,1749226.8796982998]
[null,"Meters",null,541171.79676799662,717127.23597449984,963829.88881500007,981487.06427099986,998765.45738000004,985556.35963099997,971792.71094349993]
[null,null,"Total",{"$f":"SUM(D59:D61)","v":2164687.1870719865},{"$f":"SUM(E59:E61)","v":2868508.9438979994},{"$f":"SUM(F59:F61)","v":3855319.5552600003},{"$f":"SUM(G59:G61)","v":3925948.2570839995},{"$f":"SUM(H59:H61)","v":3995061.8295200001},{"$f":"SUM(I59:I61)","v":3942225.4385239999},{"$f":"SUM(J59:J61)","v":3887170.8437739997}]
[null,"(v)  INDUSTRIAL & COMMERCIAL CONTRACT"]
[null,"Distribution Mains",null,482402.79387375625,502389.04170899995,961943.59818899981,977098.41197099991,991889.34886799986,979263.01339049998,966161.90607449994]
[null,"Inlet service pipes",null,32160.186258250418,33492.602780599998,64129.573212599993,65139.894131399997,66125.956591199996,65284.200892699999,64410.793738299995]
[null,"Meters",null,128640.74503300167,133970.41112239999,256518.29285039997,260559.57652559999,264503.82636479998,261136.8035708,257643.17495319998]
[null,null,"Total",{"$f":"SUM(D64:D66)","v":643203.72516500833},{"$f":"SUM(E64:E66)","v":669852.05561199994},{"$f":"SUM(F64:F66)","v":1282591.4642519997},{"$f":"SUM(G64:G66)","v":1302797.8826279999},{"$f":"SUM(H64:H66)","v":1322519.1318239998},{"$f":"SUM(I64:I66)","v":1305684.017854},{"$f":"SUM(J64:J66)","v":1288215.8747659998}]
[null,null,"TOTAL",{"$f":"SUM(D67,D62,D57,D52,D47)","v":41052030.990352713},{"$f":"SUM(E67,E62,E57,E52,E47)","v":19388513.777144808},{"$f":"SUM(F67,F62,F57,F52,F47)","v":34268147.359507546},{"$f":"SUM(G67,G62,G57,G52,G47)","v":35268271.226198964},{"$f":"SUM(H67,H62,H57,H52,H47)","v":36244562.544506565},{"$f":"SUM(I67,I62,I57,I52,I47)","v":35417310.589578547},{"$f":"SUM(J67,J62,J57,J52,J47)","v":34558721.636082917}]
[]
[null,"C. DIRECT MATERIAL EXPENDITURE"]
[null,null,null,"EXPENDITURE"]
[null,null,null,{"$f":"CONCATENATE(\"$0's, real \",dms_DollarReal)","v":"$0's, real June 2023"}]
[null,null,null,{"$f":"VLOOKUP(CRCP_y4,'AER lookups'!$B$52:$C$101,2,0)","v":2022},{"$f":"CONCATENATE(\"1 Jan-30 Jun \"&(D73+1))","v":"1 Jan-30 Jun 2023"},{"$f":"FRCP_y1","v":"2023-24"},{"$f":"FRCP_y2","v":"2024-25"},{"$f":"FRCP_y3","v":"2025-26"},{"$f":"FRCP_y4","v":"2026-27"},{"$f":"FRCP_y5","v":"2027-28"}]
[null,"(i)  ELECTRICITY TO GAS"]
[null,"Distribution Mains",null,0,0,0,0,0,0,0]
[null,"Inlet service pipes",null,0,0,0,0,0,0,0]
[null,"Meters",null,0,0,0,0,0,0,0]
[null,null,"Total",{"$f":"SUM(D75:D77)","v":0},{"$f":"SUM(E75:E77)","v":0},{"$f":"SUM(F75:F77)","v":0},{"$f":"SUM(G75:G77)","v":0},{"$f":"SUM(H75:H77)","v":0},{"$f":"SUM(I75:I77)","v":0},{"$f":"SUM(J75:J77)","v":0}]
[null,"(ii)  NEW HOMES"]
[null,"Distribution Mains",null,1509637.1083466727,625663.92543295294,1149877.750262982,1185770.7270981695,1220801.9045985218,1190897.413152653,1159868.4835872201]
[null,"Inlet service pipes",null,4528911.3250400182,1876991.7762988585,3449633.2507889462,3557312.1812945087,3662405.7137955655,3572692.2394579588,3479605.4507616595]
[null,"Meters",null,1509637.1083466727,625663.92543295294,1149877.750262982,1185770.7270981695,1220801.9045985218,1190897.413152653,1159868.4835872201]
[null,null,"Total",{"$f":"SUM(D80:D82)","v":7548185.5417333636},{"$f":"SUM(E80:E82)","v":3128319.6271647643},{"$f":"SUM(F80:F82)","v":5749388.7513149101},{"$f":"SUM(G80:G82)","v":5928853.6354908478},{"$f":"SUM(H80:H82)","v":6104009.5229926091},{"$f":"SUM(I80:I82)","v":5954487.0657632649},{"$f":"SUM(J80:J82)","v":5799342.4179360997}]
[null,"(iii)  NEW MEDIUM DENSITY / HIGH RISE"]
[null,"Distribution Mains",null,503212.36944889091,208554.64181098429,383292.58342099399,395256.90903272317,406933.96819950733,396965.80438421766,386622.82786240667]
[null,"Inlet service pipes",null,1509637.1083466727,625663.92543295282,1149877.750262982,1185770.7270981695,1220801.9045985218,1190897.4131526528,1159868.4835872198]
[null,"Meters",null,503212.36944889091,208554.64181098429,383292.58342099399,395256.90903272317,406933.96819950733,396965.80438421766,386622.82786240667]
[null,null,"Total",{"$f":"SUM(D85:D87)","v":2516061.8472444545},{"$f":"SUM(E85:E87)","v":1042773.2090549215},{"$f":"SUM(F85:F87)","v":1916462.91710497},{"$f":"SUM(G85:G87)","v":1976284.5451636158},{"$f":"SUM(H85:H87)","v":2034669.8409975364},{"$f":"SUM(I85:I87)","v":1984829.021921088},{"$f":"SUM(J85:J87)","v":1933114.1393120331}]
[null,"(iv)  INDUSTRIAL & COMMERCIAL TARIFF"]
[null,"Distribution Mains",null,170896.35687410415,226461.23241299993,304367.3333099999,309943.2834539999,315399.61811999988,311228.32409399992,306881.90871899988]
[null,"Inlet service pipes",null,256344.53531115624,339691.84861949994,456550.99996499991,464914.92518099985,473099.42717999982,466842.48614099988,460322.86307849985]
[null,"Meters",null,142413.63072842013,188717.69367749995,253639.44442499994,258286.06954499992,262833.0150999999,259356.93674499993,255734.92393249992]
[null,null,"Total",{"$f":"SUM(D90:D92)","v":569654.52291368053},{"$f":"SUM(E90:E92)","v":754870.77470999979},{"$f":"SUM(F90:F92)","v":1014557.7776999997},{"$f":"SUM(G90:G92)","v":1033144.2781799997},{"$f":"SUM(H90:H92)","v":1051332.0603999996},{"$f":"SUM(I90:I92)","v":1037427.7469799997},{"$f":"SUM(J90:J92)","v":1022939.6957299997}]
[null,"(v)  INDUSTRIAL & COMMERCIAL CONTRACT"]
[null,"Distribution Mains",null,126948.10365098846,132207.64255499997,253143.05215499992,257131.1610449999,261023.51285999993,257700.79299749993,254253.13317749993]
[null,"Inlet service pipes",null,8463.2069100658973,8813.8428369999983,16876.203476999995,17142.077402999996,17401.567523999995,17180.052866499998,16950.208878499994]
[null,"Meters",null,33852.827640263589,35255.371347999993,67504.813907999982,68568.309611999983,69606.270095999978,68720.211465999993,67800.835513999977]
[null,null,"Total",{"$f":"SUM(D95:D97)","v":169264.13820131795},{"$f":"SUM(E95:E97)","v":176276.85673999996},{"$f":"SUM(F95:F97)","v":337524.06953999994},{"$f":"SUM(G95:G97)","v":342841.54805999983},{"$f":"SUM(H95:H97)","v":348031.35047999991},{"$f":"SUM(I95:I97)","v":343601.05732999992},{"$f":"SUM(J95:J97)","v":339004.17756999988}]
[null,null,"TOTAL",{"$f":"SUM(D98,D93,D88,D83,D78)","v":10803166.050092816},{"$f":"SUM(E98,E93,E88,E83,E78)","v":5102240.4676696854},{"$f":"SUM(F98,F93,F88,F83,F78)","v":9017933.5156598799},{"$f":"SUM(G98,G93,G88,G83,G78)","v":9281124.0068944618},{"$f":"SUM(H98,H93,H88,H83,H78)","v":9538042.7748701461},{"$f":"SUM(I98,I93,I88,I83,I78)","v":9320344.8919943534},{"$f":"SUM(J98,J93,J88,J83,J78)","v":9094400.4305481315}]
[]
[null,"D. OTHER DIRECT EXPENDITURE"]
[null,null,null,"EXPENDITURE"]
[null,null,null,{"$f":"CONCATENATE(\"$0's, real \",dms_DollarReal)","v":"$0's, real June 2023"}]
[null,null,null,{"$f":"VLOOKUP(CRCP_y4,'AER lookups'!$B$52:$C$101,2,0)","v":2022},{"$f":"CONCATENATE(\"1 Jan-30 Jun \"&(D104+1))","v":"1 Jan-30 Jun 2023"},{"$f":"FRCP_y1","v":"2023-24"},{"$f":"FRCP_y2","v":"2024-25"},{"$f":"FRCP_y3","v":"2025-26"},{"$f":"FRCP_y4","v":"2026-27"},{"$f":"FRCP_y5","v":"2027-28"}]
[null,"(i)  ELECTRICITY TO GAS"]
[null,"Distribution Mains",null,0,0,0,0,0,0,0]
[null,"Inlet service pipes",null,0,0,0,0,0,0,0]
[null,"Meters",null,0,0,0,0,0,0,0]
[null,null,"Total",{"$f":"SUM(D106:D108)","v":0},{"$f":"SUM(E106:E108)","v":0},{"$f":"SUM(F106:F108)","v":0},{"$f":"SUM(G106:G108)","v":0},{"$f":"SUM(H106:H108)","v":0},{"$f":"SUM(I106:I108)","v":0},{"$f":"SUM(J106:J108)","v":0}]
[null,"(ii)  NEW HOMES"]
[null,"Distribution Mains",null,0,0,0,0,0,0,0]
[null,"Inlet service pipes",null,0,0,0,0,0,0,0]
[null,"Meters",null,0,0,0,0,0,0,0]
[null,null,"Total",{"$f":"SUM(D111:D113)","v":0},{"$f":"SUM(E111:E113)","v":0},{"$f":"SUM(F111:F113)","v":0},{"$f":"SUM(G111:G113)","v":0},{"$f":"SUM(H111:H113)","v":0},{"$f":"SUM(I111:I113)","v":0},{"$f":"SUM(J111:J113)","v":0}]
[null,"(iii)  NEW MEDIUM DENSITY / HIGH RISE"]
[null,"Distribution Mains",null,0,0,0,0,0,0,0]
[null,"Inlet service pipes",null,0,0,0,0,0,0,0]
[null,"Meters",null,0,0,0,0,0,0,0]
[null,null,"Total",{"$f":"SUM(D116:D118)","v":0},{"$f":"SUM(E116:E118)","v":0},{"$f":"SUM(F116:F118)","v":0},{"$f":"SUM(G116:G118)","v":0},{"$f":"SUM(H116:H118)","v":0},{"$f":"SUM(I116:I118)","v":0},{"$f":"SUM(J116:J118)","v":0}]
[null,"(iv)  INDUSTRIAL & COMMERCIAL TARIFF"]
[null,"Distribution Mains",null,0,0,0,0,0,0,0]
[null,"Inlet service pipes",null,0,0,0,0,0,0,0]
[null,"Meters",null,0,0,0,0,0,0,0]
[null,null,"Total",{"$f":"SUM(D121:D123)","v":0},{"$f":"SUM(E121:E123)","v":0},{"$f":"SUM(F121:F123)","v":0},{"$f":"SUM(G121:G123)","v":0},{"$f":"SUM(H121:H123)","v":0},{"$f":"SUM(I121:I123)","v":0},{"$f":"SUM(J121:J123)","v":0}]
[null,"(v)  INDUSTRIAL & COMMERCIAL CONTRACT"]
[null,"Distribution Mains",null,0,0,0,0,0,0,0]
[null,"Inlet service pipes",null,0,0,0,0,0,0,0]
[null,"Meters",null,0,0,0,0,0,0,0]
[null,null,"Total",{"$f":"SUM(D126:D128)","v":0},{"$f":"SUM(E126:E128)","v":0},{"$f":"SUM(F126:F128)","v":0},{"$f":"SUM(G126:G128)","v":0},{"$f":"SUM(H126:H128)","v":0},{"$f":"SUM(I126:I128)","v":0},{"$f":"SUM(J126:J128)","v":0}]
[null,null,"TOTAL",{"$f":"SUM(D129,D124,D119,D114,D109)","v":0},{"$f":"SUM(E129,E124,E119,E114,E109)","v":0},{"$f":"SUM(F129,F124,F119,F114,F109)","v":0},{"$f":"SUM(G129,G124,G119,G114,G109)","v":0},{"$f":"SUM(H129,H124,H119,H114,H109)","v":0},{"$f":"SUM(I129,I124,I119,I114,I109)","v":0},{"$f":"SUM(J129,J124,J119,J114,J109)","v":0}]
[]
[null,"E. RELATED PARTY MARGIN EXPENDITURE"]
[null,null,null,"EXPENDITURE"]
[null,null,null,{"$f":"CONCATENATE(\"$0's, real \",dms_DollarReal)","v":"$0's, real June 2023"}]
[null,null,null,{"$f":"VLOOKUP(CRCP_y4,'AER lookups'!$B$52:$C$101,2,0)","v":2022},{"$f":"CONCATENATE(\"1 Jan-30 Jun \"&(D135+1))","v":"1 Jan-30 Jun 2023"},{"$f":"FRCP_y1","v":"2023-24"},{"$f":"FRCP_y2","v":"2024-25"},{"$f":"FRCP_y3","v":"2025-26"},{"$f":"FRCP_y4","v":"2026-27"},{"$f":"FRCP_y5","v":"2027-28"}]
[null,"(i)  ELECTRICITY TO GAS"]
[null,"Distribution Mains",null,0,0,0,0,0,0,0]
[null,"Inlet service pipes",null,0,0,0,0,0,0,0]
[null,"Meters",null,0,0,0,0,0,0,0]
[null,null,"Total",{"$f":"SUM(D137:D139)","v":0},{"$f":"SUM(E137:E139)","v":0},{"$f":"SUM(F137:F139)","v":0},{"$f":"SUM(G137:G139)","v":0},{"$f":"SUM(H137:H139)","v":0},{"$f":"SUM(I137:I139)","v":0},{"$f":"SUM(J137:J139)","v":0}]
[null,"(ii)  NEW HOMES"]
[null,"Distribution Mains",null,0,0,0,0,0,0,0]
[null,"Inlet service pipes",null,0,0,0,0,0,0,0]
[null,"Meters",null,0,0,0,0,0,0,0]
[null,null,"Total",{"$f":"SUM(D142:D144)","v":0},{"$f":"SUM(E142:E144)","v":0},{"$f":"SUM(F142:F144)","v":0},{"$f":"SUM(G142:G144)","v":0},{"$f":"SUM(H142:H144)","v":0},{"$f":"SUM(I142:I144)","v":0},{"$f":"SUM(J142:J144)","v":0}]
[null,"(iii)  NEW MEDIUM DENSITY / HIGH RISE"]
[null,"Distribution Mains",null,0,0,0,0,0,0,0]
[null,"Inlet service pipes",null,0,0,0,0,0,0,0]
[null,"Meters",null,0,0,0,0,0,0,0]
[null,null,"Total",{"$f":"SUM(D147:D149)","v":0},{"$f":"SUM(E147:E149)","v":0},{"$f":"SUM(F147:F149)","v":0},{"$f":"SUM(G147:G149)","v":0},{"$f":"SUM(H147:H149)","v":0},{"$f":"SUM(I147:I149)","v":0},{"$f":"SUM(J147:J149)","v":0}]
[null,"(iv)  INDUSTRIAL & COMMERCIAL TARIFF"]
[null,"Distribution Mains",null,0,0,0,0,0,0,0]
[null,"Inlet service pipes",null,0,0,0,0,0,0,0]
[null,"Meters",null,0,0,0,0,0,0,0]
[null,null,"Total",{"$f":"SUM(D152:D154)","v":0},{"$f":"SUM(E152:E154)","v":0},{"$f":"SUM(F152:F154)","v":0},{"$f":"SUM(G152:G154)","v":0},{"$f":"SUM(H152:H154)","v":0},{"$f":"SUM(I152:I154)","v":0},{"$f":"SUM(J152:J154)","v":0}]
[null,"(v)  INDUSTRIAL & COMMERCIAL CONTRACT"]
[null,"Distribution Mains",null,0,0,0,0,0,0,0]
[null,"Inlet service pipes",null,0,0,0,0,0,0,0]
[null,"Meters",null,0,0,0,0,0,0,0]
[null,null,"Total",{"$f":"SUM(D157:D159)","v":0},{"$f":"SUM(E157:E159)","v":0},{"$f":"SUM(F157:F159)","v":0},{"$f":"SUM(G157:G159)","v":0},{"$f":"SUM(H157:H159)","v":0},{"$f":"SUM(I157:I159)","v":0},{"$f":"SUM(J157:J159)","v":0}]
[null,null,"TOTAL",{"$f":"SUM(D160,D155,D150,D145,D140)","v":0},{"$f":"SUM(E160,E155,E150,E145,E140)","v":0},{"$f":"SUM(F160,F155,F150,F145,F140)","v":0},{"$f":"SUM(G160,G155,G150,G145,G140)","v":0},{"$f":"SUM(H160,H155,H150,H145,H140)","v":0},{"$f":"SUM(I160,I155,I150,I145,I140)","v":0},{"$f":"SUM(J160,J155,J150,J145,J140)","v":0}]
[]
[null,"F. CAPITAL CONTRIBUTIONS included in the above"]
[null,null,null,"EXPENDITURE"]
[null,null,null,{"$f":"CONCATENATE(\"$0's, real \",dms_DollarReal)","v":"$0's, real June 2023"}]
[null,null,null,{"$f":"VLOOKUP(CRCP_y4,'AER lookups'!$B$52:$C$101,2,0)","v":2022},{"$f":"CONCATENATE(\"1 Jan-30 Jun \"&(D166+1))","v":"1 Jan-30 Jun 2023"},{"$f":"FRCP_y1","v":"2023-24"},{"$f":"FRCP_y2","v":"2024-25"},{"$f":"FRCP_y3","v":"2025-26"},{"$f":"FRCP_y4","v":"2026-27"},{"$f":"FRCP_y5","v":"2027-28"}]
[null,"(i)  ELECTRICITY TO GAS"]
[null,"Distribution Mains",null,0," $-   "," $-   "," $-   "," $-   "," $-   "," $-   "]
[null,"Inlet service pipes",null,0," $-   "," $-   "," $-   "," $-   "," $-   "," $-   "]
[null,"Meters",null,0," $-   "," $-   "," $-   "," $-   "," $-   "," $-   "]
[null,null,"Total",{"$f":"SUM(D168:D170)","v":0},{"$f":"SUM(E168:E170)","v":0},{"$f":"SUM(F168:F170)","v":0},{"$f":"SUM(G168:G170)","v":0},{"$f":"SUM(H168:H170)","v":0},{"$f":"SUM(I168:I170)","v":0},{"$f":"SUM(J168:J170)","v":0}]
[null,"(ii)  NEW HOMES"]
[null,"Distribution Mains",null,460749.36123716249,303439.96219875,606879.9243975,625823.44004250003,644312.11670250003,628529.19062999997,612152.81123250001]
[null,"Inlet service pipes",null,1382248.0837114872,910319.88659624988,1820639.7731924998,1877470.3201275,1932936.3501074999,1885587.5718899996,1836458.4336974998]
[null,"Meters",null,460749.36123716249,303439.96219875,606879.9243975,625823.44004250003,644312.11670250003,628529.19062999997,612152.81123250001]
[null,null,"Total",{"$f":"SUM(D173:D175)","v":2303746.8061858122},{"$f":"SUM(E173:E175)","v":1517199.8109937501},{"$f":"SUM(F173:F175)","v":3034399.6219875002},{"$f":"SUM(G173:G175)","v":3129117.2002125001},{"$f":"SUM(H173:H175)","v":3221560.5835124999},{"$f":"SUM(I173:I175)","v":3142645.9531499995},{"$f":"SUM(J173:J175)","v":3060764.0561624998}]
[null,"(iii)  NEW MEDIUM DENSITY / HIGH RISE"]
[null,"Distribution Mains",null,153583.12041238751,101146.65406625,202293.30813250001,208607.81334750002,214770.7055675,209509.73020999998,204050.93707750001]
[null,"Inlet service pipes",null,460749.36123716243,303439.96219875,606879.9243975,625823.44004250003,644312.11670249992,628529.19062999985,612152.81123250001]
[null,"Meters",null,153583.12041238751,101146.65406625,202293.30813250001,208607.81334750002,214770.7055675,209509.73020999998,204050.93707750001]
[null,null,"Total",{"$f":"SUM(D178:D180)","v":767915.60206193745},{"$f":"SUM(E178:E180)","v":505733.27033125004},{"$f":"SUM(F178:F180)","v":1011466.5406625001},{"$f":"SUM(G178:G180)","v":1043039.0667375001},{"$f":"SUM(H178:H180)","v":1073853.5278375},{"$f":"SUM(I178:I180)","v":1047548.6510499998},{"$f":"SUM(J178:J180)","v":1020254.6853875001}]
[null,"(iv)  INDUSTRIAL & COMMERCIAL TARIFF"]
[null,"Distribution Mains",null,615013.60692833993,254749.2374325,509498.474865,516620.6300549999,523603.69298999995,518731.17548999999,513634.55699999997]
[null,"Inlet service pipes",null,922520.41039250989,382123.85614875,764247.71229749999,774930.94508249988,785405.53948499996,778096.76323500008,770451.83550000004]
[null,"Meters",null,512511.33910694992,212291.03119375001,424582.06238750002,430517.19171249995,436336.41082499997,432275.979575,428028.79749999999]
[null,null,"Total",{"$f":"SUM(D183:D185)","v":2050045.3564277999},{"$f":"SUM(E183:E185)","v":849164.12477499992},{"$f":"SUM(F183:F185)","v":1698328.2495499998},{"$f":"SUM(G183:G185)","v":1722068.7668499998},{"$f":"SUM(H183:H185)","v":1745345.6432999999},{"$f":"SUM(I183:I185)","v":1729103.9183},{"$f":"SUM(J183:J185)","v":1712115.19}]
[null,"(v)  INDUSTRIAL & COMMERCIAL CONTRACT"]
[null,"Distribution Mains",null,355282.99156447494,313447.14386249997,626894.28772499994,626894.28772499994,626894.28772499994,626894.28772499994,626894.28772499994]
[null,"Inlet service pipes",null,23685.532770964997,20896.476257499999,41792.952514999997,41792.952514999997,41792.952514999997,41792.952514999997,41792.952514999997]
[null,"Meters",null,94742.131083859989,83585.905029999994,167171.81005999999,167171.81005999999,167171.81005999999,167171.81005999999,167171.81005999999]
[null,null,"Total",{"$f":"SUM(D188:D190)","v":473710.65541929996},{"$f":"SUM(E188:E190)","v":417929.52515},{"$f":"SUM(F188:F190)","v":835859.0503},{"$f":"SUM(G188:G190)","v":835859.0503},{"$f":"SUM(H188:H190)","v":835859.0503},{"$f":"SUM(I188:I190)","v":835859.0503},{"$f":"SUM(J188:J190)","v":835859.0503}]
[null,null,"TOTAL",{"$f":"SUM(D191,D186,D181,D176,D171)","v":5595418.4200948495},{"$f":"SUM(E191,E186,E181,E176,E171)","v":3290026.7312500002},{"$f":"SUM(F191,F186,F181,F176,F171)","v":6580053.4625000004},{"$f":"SUM(G191,G186,G181,G176,G171)","v":6730084.0840999996},{"$f":"SUM(H191,H186,H181,H176,H171)","v":6876618.8049499998},{"$f":"SUM(I191,I186,I181,I176,I171)","v":6755157.5727999993},{"$f":"SUM(J191,J186,J181,J176,J171)","v":6628992.9818500001}]
[]
[]
[null,"E5.2 - UNIT RATES"]
[null,"E5.2.1 - UNIT RATES - PER CONNECTION - BY CONNECTION TYPE"]
[null,null,null,"RATES PER CONNECTION"]
[null,null,null,{"$f":"CONCATENATE(\"$0's, real \",dms_DollarReal)","v":"$0's, real June 2023"}]
[null,null,"Units",{"$f":"VLOOKUP(CRCP_y4,'AER lookups'!$B$52:$C$101,2,0)","v":2022},{"$f":"CONCATENATE(\"1 Jan-30 Jun \"&(D199+1))","v":"1 Jan-30 Jun 2023"},{"$f":"FRCP_y1","v":"2023-24"},{"$f":"FRCP_y2","v":"2024-25"},{"$f":"FRCP_y3","v":"2025-26"},{"$f":"FRCP_y4","v":"2026-27"},{"$f":"FRCP_y5","v":"2027-28"}]
[null,"A. ELECTRICITY TO GAS"]
[null,"Distribution mains","per metre per connection",0," $-   "," $-   "," $-   "," $-   "," $-   "," $-   "]
[null,"Inlet service pipes","per service per connection",0," $-   "," $-   "," $-   "," $-   "," $-   "," $-   "]
[null,"Meters","number per connection",0," $-   "," $-   "," $-   "," $-   "," $-   "," $-   "]
[null,"B. NEW HOMES"]
[null,"Distribution mains","per metre per connection",{"$f":"(D18+D49+D80)/D245","v":754818.5541733366},{"$f":"(E18+E49+E80)/E245","v":312896.98075524432},575174.14412400243,593314.78537468496,611116.71013222844,596416.81638543657,581142.8741718696]
[null,"Inlet service pipes","per service per connection",{"$f":"(D19+D50+D81)/D246","v":22644556.625200093},9386909.4226573296,17255224.323720071,17799443.561240546,18333501.30396685,17892504.491563097,17434286.225156087]
[null,"Meters","number per connection",{"$f":"(D20+D51+D82)/D247","v":7548185.5417333655},3128969.8075524434,5751741.4412400238,5933147.8537468491,6111167.1013222849,5964168.1638543652,5811428.7417186964]
[null,"C. NEW MEDIUM DENSITY / HIGH RISE"]
[null,"Distribution mains","per metre per connection",{"$f":"(D23+D54+D85)/D249","v":754818.55417333648},{"$f":"(E23+E54+E85)/E249","v":312896.98075524438},575174.14412400231,593314.78537468496,611116.71013222844,596416.81638543657,581142.8741718696]
[null,"Inlet service pipes","per service per connection",{"$f":"(D24+D55+D86)/D250","v":22644556.625200097},9386909.4226573296,17255224.323720071,17799443.56124055,18333501.30396685,17892504.491563097,17434286.225156084]
[null,"Meters","number per connection",{"$f":"(D25+D56+D87)/D251","v":2516061.847244455},1042989.9358508147,1917247.1470800079,1977715.9512489499,2037055.7004407614,1988056.0546181221,1937142.913906232]
[null,"D. INDUSTRIAL & COMMERCIAL TARIFF"]
[null,"Distribution mains","per metre per connection",{"$f":"(D28+D59+D90)/D253","v":34179.271374820833},{"$f":"(E28+E59+E90)/E253","v":45301.659884645342},60898.376508579713,62033.554547551445,63153.891315673456,62346.866883763971,61504.295353464673]
[null,"Inlet service pipes","per service per connection",{"$f":"(D29+D60+D91)/D254","v":1281722.6765557814},1698812.2456742006,2283689.1190717393,2326258.2955331793,2368270.9243377545,2338007.5081411488,2306411.0757549251]
[null,"Meters","number per connection",{"$f":"(D30+D61+D92)/D255","v":712068.15364210075},943784.58093011146,1268716.1772620773,1292365.719740655,1315706.0690765304,1298893.060078416,1281339.486530514]
[null,"E. INDUSTRIAL & COMMERCIAL CONTRACT"]
[null,"Distribution mains","per metre per connection",{"$f":"(D33+D64+D95)/D257","v":25389.620730197694},{"$f":"(E33+E64+E95)/E257","v":26447.024037450945},50649.328011048172,51463.479791545673,52265.91794960203,51623.955125635985,50956.603674580088]
[null,"Inlet service pipes","per service per connection",{"$f":"(D34+D65+D96)/D258","v":42316.034550329496},44078.373395751565,84415.546685080277,85772.466319242783,87109.863249336719,86039.925209393317,84927.672790966826]
[null,"Meters","number per connection",{"$f":"(D35+D66+D97)/D259","v":169264.13820131798},176313.49358300626,337662.18674032111,343089.86527697113,348439.45299734687,344159.70083757327,339710.6911638673]
[]
[]
[]
[]
[null,"E5.3 - VOLUMES"]
[null,"E5.3.1 - NUMBER OF NEW CONNECTIONS"]
[null,null,null,"VOLUMES"]
[null,null,null,"0s"]
[null,null,null,{"$f":"VLOOKUP(CRCP_y4,'AER lookups'!$B$52:$C$101,2,0)","v":2022},{"$f":"CONCATENATE(\"1 Jan-30 Jun \"&(D228+1))","v":"1 Jan-30 Jun 2023"},{"$f":"FRCP_y1","v":"2023-24"},{"$f":"FRCP_y2","v":"2024-25"},{"$f":"FRCP_y3","v":"2025-26"},{"$f":"FRCP_y4","v":"2026-27"},{"$f":"FRCP_y5","v":"2027-28"}]
[null,"Electricity to gas"]
[null,"New homes"]
[null,"New medium density / high rise"]
[null,"Industrial and commericla tariff"]
[null,"Industrial and commericla contract"]
[null,null,"Total",{"$f":"SUM(D229:D233)","v":0},{"$f":"SUM(E229:E233)","v":0},0,0,0,0,0]
[]
[null,"E5.3.2 - VOLUMES - PER CONNECTION - BY CONNECTION TYPE"]
[null,null,null,"VOLUMES"]
[null,null,null,"0s"]
[null,null,"Units",{"$f":"VLOOKUP(CRCP_y4,'AER lookups'!$B$52:$C$101,2,0)","v":2022},{"$f":"CONCATENATE(\"1 Jan-30 Jun \"&(D239+1))","v":"1 Jan-30 Jun 2023"},{"$f":"FRCP_y1","v":"2023-24"},{"$f":"FRCP_y2","v":"2024-25"},{"$f":"FRCP_y3","v":"2025-26"},{"$f":"FRCP_y4","v":"2026-27"},{"$f":"FRCP_y5","v":"2027-28"}]
[null,"A. ELECTRICITY TO GAS"]
[null,"Distribution mains","metres per connection",10,10,10,10,10,10,10]
[null,"Inlet service pipes","number per connection",1,1,1,1,1,1,1]
[null,"Meters","number per connection",1,1,1,1,1,1,1]
[null,"B. NEW HOMES"]
[null,"Distribution mains","metres per connection",10,10,10,10,10,10,10]
[null,"Inlet service pipes","number per connection",1,1,1,1,1,1,1]
[null,"Meters","number per connection",1,1,1,1,1,1,1]
[null,"C. NEW MEDIUM DENSITY / HIGH RISE"]
[null,"Distribution mains","metres per connection",{"$f":"10/3","v":3.3333333333333335},{"$f":"10/3","v":3.3333333333333335},3.3333333333333335,3.3333333333333335,3.3333333333333335,3.3333333333333335,3.3333333333333335]
[null,"Inlet service pipes","number per connection",{"$f":"1/3","v":0.33333333333333331},{"$f":"1/3","v":0.33333333333333331},0.33333333333333331,0.33333333333333331,0.33333333333333331,0.33333333333333331,0.33333333333333331]
[null,"Meters","number per connection",1,1,1,1,1,1,1]
[null,"D. INDUSTRIAL & COMMERCIAL TARIFF"]
[null,"Distribution mains","metres per connection",25,25,25,25,25,25,25]
[null,"Inlet service pipes","number per connection",1,1,1,1,1,1,1]
[null,"Meters","number per connection",1,1,1,1,1,1,1]
[null,"E. INDUSTRIAL & COMMERCIAL CONTRACT"]
[null,"Distribution mains","metres per connection",25,25,25,25,25,25,25]
[null,"Inlet service pipes","number per connection",1,1,1,1,1,1,1]
[null,"Meters","number per connection",1,1,1,1,1,1,1]
[]
[]
[]
[null,"E5.4 -  CAPITAL CONTRIBUTIONS"]
[null,"E5.4.1 - VALUE OF CAPITAL CONTRIBUTIONS - BY CONNECTION TYPE"]
[null,null,null,"VALUE"]
[null,null,null,{"$f":"CONCATENATE(\"$0's, real \",dms_DollarReal)","v":"$0's, real June 2023"}]
[null,null,null,{"$f":"VLOOKUP(CRCP_y4,'AER lookups'!$B$52:$C$101,2,0)","v":2022},{"$f":"CONCATENATE(\"1 Jan-30 Jun \"&(D267+1))","v":"1 Jan-30 Jun 2023"},{"$f":"FRCP_y1","v":"2023-24"},{"$f":"FRCP_y2","v":"2024-25"},{"$f":"FRCP_y3","v":"2025-26"},{"$f":"FRCP_y4","v":"2026-27"},{"$f":"FRCP_y5","v":"2027-28"}]
[null,"Electricity to gas",null,0,0,0,0,0,0,0]
[null,"New homes",null,2303746.8061858122,1517199.8109937499,3034399.6219874998,3129117.2002125001,3221560.5835124999,3142645.9531499995,3060764.0561624998]
[null,"New medium density / high rise",null,767915.60206193745,505733.27033124998,1011466.5406625,1043039.0667375,1073853.5278375,1047548.6510499999,1020254.6853875]
[null,"Industrial & commercial tariff",null,2050045.3564277997,849164.12477500003,1698328.2495500001,1722068.7668499998,1745345.6432999999,1729103.9183,1712115.19]
[null,"Industrial & commercial contract",null,473710.6554192999,417929.52514999994,835859.05029999989,835859.05029999989,835859.05029999989,835859.05029999989,835859.05029999989]
[null,null,"Total",{"$f":"SUM(D268:D272)","v":5595418.4200948495},3290026.7312500002,6580053.4625000004,6730084.0841000006,6876618.8049499998,6755157.5727999993,6628992.9818500001]
[]
[null,"E5.4.2 - NUMBER OF CAPITAL CONTRIBUTIONS - BY CONNECTION TYPE"]
[null,null,null,"VOLUMES"]
[null,null,null,"0's"]
[null,null,null,{"$f":"VLOOKUP(CRCP_y4,'AER lookups'!$B$52:$C$101,2,0)","v":2022},{"$f":"CONCATENATE(\"1 Jan-30 Jun \"&(D278+1))","v":"1 Jan-30 Jun 2023"},{"$f":"FRCP_y1","v":"2023-24"},{"$f":"FRCP_y2","v":"2024-25"},{"$f":"FRCP_y3","v":"2025-26"},{"$f":"FRCP_y4","v":"2026-27"},{"$f":"FRCP_y5","v":"2027-28"}]
[null,"Electricity to gas"]
[null,"New homes"]
[null,"New medium density / high rise"]
[null,"Industrial & commercial tariff"]
[null,"Industrial & commercial contract"]
[null,null,"Total",{"$f":"SUM(D279:D283)","v":0},{"$f":"SUM(E279:E283)","v":0},0,0,0,0,0]

{"sheet":"E6. Non-network","index":12,"n_rows":142,"n_cols":9,"rows_kept":142,"cut":false,"hidden":false,"merged":[]}
[null,{"$f":"INDEX(dms_Worksheet_List,MATCH(dms_Model,dms_Model_List))","v":"REGULATORY REPORTING STATEMENT"}]
[null,{"$f":"dms_TradingName","v":"AusNet (Gas)"}]
[null,{"$f":"dms_Header_Span","v":"2021-22 to 2027-28"}]
[null,"E6. NON-NETWORK EXPENDITURE"]
[]
[null,"E6.5 - TELEMETRY"]
[]
[null,"Please list all projects here:"]
[null,"Fringe RTU Installation"]
[null,"Fringe RTU Relocation"]
[null,"Kingfisher PC-1 Replacement"]
[null,"Moore Temperature Transmitter Replacement"]
[null,"Dossier Replacement"]
[null,"Slamshut Switch Replacement"]
[null,"Cabinet Replacement"]
[null,"Remote Pressure Monitoring Unit"]
[null,"6 month extension program"]
[null,"Communications Assets"]
[null,"SCADA Category 2"]
[]
[]
[]
[]
[]
[]
[null,"E6.5.1 - CAPEX - BY PROJECT"]
[null,"A. DIRECT INTERNAL LABOUR EXPENDITURE"]
[null,null,"EXPENDITURE"]
[null,null,{"$f":"CONCATENATE(\"$0's, real \",dms_DollarReal)","v":"$0's, real June 2023"}]
[null,null,{"$f":"VLOOKUP(CRCP_y4,'AER lookups'!$B$52:$C$101,2,0)","v":2022},{"$f":"CONCATENATE(\"1 Jan-30 Jun \"&(C30+1))","v":"1 Jan-30 Jun 2023"},{"$f":"FRCP_y1","v":"2023-24"},{"$f":"FRCP_y2","v":"2024-25"},{"$f":"FRCP_y3","v":"2025-26"},{"$f":"FRCP_y4","v":"2026-27"},{"$f":"FRCP_y5","v":"2027-28"}]
[null,{"$f":"IF(ISBLANK(dms_E65_Projects_01),\"\",dms_E65_Projects_01)","v":"Fringe RTU Installation"},null,0,1278.9514004619693,1288.9238257778595,1303.1128769181694,1317.4581274926397,1331.9612970146468]
[null,{"$f":"IF(ISBLANK(dms_E65_Projects_02),\"\",dms_E65_Projects_02)","v":"Fringe RTU Relocation"},null,0,799.34462528873087,0,814.445548073856,0,832.47581063415419]
[null,{"$f":"IF(ISBLANK(dms_E65_Projects_03),\"\",dms_E65_Projects_03)","v":"Kingfisher PC-1 Replacement"},null,0,1918.4271006929539,1933.3857386667894,1954.6693153772542,1976.1871912389599,1997.9419455219702]
[null,{"$f":"IF(ISBLANK(dms_E65_Projects_04),\"\",dms_E65_Projects_04)","v":"Moore Temperature Transmitter Replacement"},null,0,239.80338758661924,241.67321733334867,244.33366442215677,329.36453187315993,249.74274319024627]
[null,{"$f":"IF(ISBLANK(dms_E65_Projects_05),\"\",dms_E65_Projects_05)","v":"Dossier Replacement"},null,0,1278.9514004619693,1288.9238257778595,1303.1128769181694,1317.4581274926397,1331.9612970146468]
[null,{"$f":"IF(ISBLANK(dms_E65_Projects_06),\"\",dms_E65_Projects_06)","v":"Slamshut Switch Replacement"},null,0,783.35773278295619,789.46584328893891,798.1566371123788,806.94310308924196,815.82629442147118]
[null,{"$f":"IF(ISBLANK(dms_E65_Projects_07),\"\",dms_E65_Projects_07)","v":"Cabinet Replacement"},null,0,895.26598032337847,902.24667804450166,912.17901384271875,922.2206892448479,932.37290791025271]
[null,{"$f":"IF(ISBLANK(dms_E65_Projects_08),\"\",dms_E65_Projects_08)","v":"Remote Pressure Monitoring Unit"},null,0,959.21355034647695,966.6928693333947,977.33465768862709,988.09359561947997,998.97097276098509]
[null,{"$f":"IF(ISBLANK(dms_E65_Projects_09),\"\",dms_E65_Projects_09)","v":"6 month extension program"},null,4454.0231373481311,0,0,0,0,0]
[null,{"$f":"IF(ISBLANK(dms_E65_Projects_10),\"\",dms_E65_Projects_10)","v":"Communications Assets"},null,0,28776.40651039431,28195.208688890678,0,0,0]
[null,{"$f":"IF(ISBLANK(dms_E65_Projects_11),\"\",dms_E65_Projects_11)","v":"SCADA Category 2"},39933.941721671872]
[null,{"$f":"IF(ISBLANK(dms_E65_Projects_12),\"\",dms_E65_Projects_12)","v":""}]
[null,{"$f":"IF(ISBLANK(dms_E65_Projects_13),\"\",dms_E65_Projects_13)","v":""}]
[null,{"$f":"IF(ISBLANK(dms_E65_Projects_14),\"\",dms_E65_Projects_14)","v":""}]
[null,{"$f":"IF(ISBLANK(dms_E65_Projects_15),\"\",dms_E65_Projects_15)","v":""}]
[null,"Aggregate of other projects with total expenditure of less than $500,000"]
[null,"Total",{"$f":"SUM(C31:C46)","v":39933.941721671872},{"$f":"SUM(D31:D46)","v":4454.0231373481311},36929.721688339363,35606.520687113371,8307.344590353332,7657.7253660509687,8491.253268468372]
[]
[null,"B. DIRECT CONTRACTOR EXPENDITURE"]
[null,{"$f":"IF(ISBLANK(dms_E65_Projects_01),\"\",dms_E65_Projects_01)","v":"Fringe RTU Installation"},null,0,24053.999999999996,24053.999999999996,24053.999999999996,24053.999999999996,24053.999999999996]
[null,{"$f":"IF(ISBLANK(dms_E65_Projects_02),\"\",dms_E65_Projects_02)","v":"Fringe RTU Relocation"},null,0,15033.749999999996,0,15033.749999999996,0,15033.749999999996]
[null,{"$f":"IF(ISBLANK(dms_E65_Projects_03),\"\",dms_E65_Projects_03)","v":"Kingfisher PC-1 Replacement"},null,0,36081,36081,36081,36081,36081]
[null,{"$f":"IF(ISBLANK(dms_E65_Projects_04),\"\",dms_E65_Projects_04)","v":"Moore Temperature Transmitter Replacement"},null,0,4510.125,4510.125,4510.125,6013.4999999999991,4510.125]
[null,{"$f":"IF(ISBLANK(dms_E65_Projects_05),\"\",dms_E65_Projects_05)","v":"Dossier Replacement"},null,0,24053.999999999996,24053.999999999996,24053.999999999996,24053.999999999996,24053.999999999996]
[null,{"$f":"IF(ISBLANK(dms_E65_Projects_06),\"\",dms_E65_Projects_06)","v":"Slamshut Switch Replacement"},null,0,14733.074999999997,14733.074999999997,14733.074999999997,14733.074999999997,14733.074999999997]
[null,{"$f":"IF(ISBLANK(dms_E65_Projects_07),\"\",dms_E65_Projects_07)","v":"Cabinet Replacement"},null,0,16837.799999999996,16837.799999999996,16837.799999999996,16837.799999999996,16837.799999999996]
[null,{"$f":"IF(ISBLANK(dms_E65_Projects_08),\"\",dms_E65_Projects_08)","v":"Remote Pressure Monitoring Unit"},null,0,18040.5,18040.5,18040.5,18040.5,18040.5]
[null,{"$f":"IF(ISBLANK(dms_E65_Projects_09),\"\",dms_E65_Projects_09)","v":"6 month extension program"},null,84189,0,0,0,0,0]
[null,{"$f":"IF(ISBLANK(dms_E65_Projects_10),\"\",dms_E65_Projects_10)","v":"Communications Assets"},null,0,541214.99999999988,526181.24999999988,0,0,0]
[null,{"$f":"IF(ISBLANK(dms_E65_Projects_11),\"\",dms_E65_Projects_11)","v":"SCADA Category 2"},758744.89271176537]
[null,{"$f":"IF(ISBLANK(dms_E65_Projects_12),\"\",dms_E65_Projects_12)","v":""}]
[null,{"$f":"IF(ISBLANK(dms_E65_Projects_13),\"\",dms_E65_Projects_13)","v":""}]
[null,{"$f":"IF(ISBLANK(dms_E65_Projects_14),\"\",dms_E65_Projects_14)","v":""}]
[null,{"$f":"IF(ISBLANK(dms_E65_Projects_15),\"\",dms_E65_Projects_15)","v":""}]
[null,"Aggregate of other projects with total expenditure of less than $500,000"]
[null,"Total",{"$f":"SUM(C50:C65)","v":758744.89271176537},{"$f":"SUM(D50:D65)","v":84189},{"$f":"SUM(E50:E65)","v":694559.24999999988},{"$f":"SUM(F50:F65)","v":664491.74999999988},{"$f":"SUM(G50:G65)","v":153344.25},{"$f":"SUM(H50:H65)","v":139813.875},{"$f":"SUM(I50:I65)","v":153344.25}]
[]
[null,"C. DIRECT MATERIAL EXPENDITURE"]
[null,{"$f":"IF(ISBLANK(dms_E65_Projects_01),\"\",dms_E65_Projects_01)","v":"Fringe RTU Installation"},null,0,16880,16880,16880,16880,16880]
[null,{"$f":"IF(ISBLANK(dms_E65_Projects_02),\"\",dms_E65_Projects_02)","v":"Fringe RTU Relocation"},null,0,10550,0,10550,0,10550]
[null,{"$f":"IF(ISBLANK(dms_E65_Projects_03),\"\",dms_E65_Projects_03)","v":"Kingfisher PC-1 Replacement"},null,0,25320,25320,25320,25320,25320]
[null,{"$f":"IF(ISBLANK(dms_E65_Projects_04),\"\",dms_E65_Projects_04)","v":"Moore Temperature Transmitter Replacement"},null,0,3165,3165,3165,4220,3165]
[null,{"$f":"IF(ISBLANK(dms_E65_Projects_05),\"\",dms_E65_Projects_05)","v":"Dossier Replacement"},null,0,16880,16880,16880,16880,16880]
[null,{"$f":"IF(ISBLANK(dms_E65_Projects_06),\"\",dms_E65_Projects_06)","v":"Slamshut Switch Replacement"},null,0,10339,10339,10339,10339,10339]
[null,{"$f":"IF(ISBLANK(dms_E65_Projects_07),\"\",dms_E65_Projects_07)","v":"Cabinet Replacement"},null,0,11816,11816,11816,11816,11816]
[null,{"$f":"IF(ISBLANK(dms_E65_Projects_08),\"\",dms_E65_Projects_08)","v":"Remote Pressure Monitoring Unit"},null,0,12660,12660,12660,12660,12660]
[null,{"$f":"IF(ISBLANK(dms_E65_Projects_09),\"\",dms_E65_Projects_09)","v":"6 month extension program"},null,59080,0,0,0,0,0]
[null,{"$f":"IF(ISBLANK(dms_E65_Projects_10),\"\",dms_E65_Projects_10)","v":"Communications Assets"},null,0,379800,369250,0,0,0]
[null,{"$f":"IF(ISBLANK(dms_E65_Projects_11),\"\",dms_E65_Projects_11)","v":"SCADA Category 2"},532452.55628895829]
[null,{"$f":"IF(ISBLANK(dms_E65_Projects_12),\"\",dms_E65_Projects_12)","v":""}]
[null,{"$f":"IF(ISBLANK(dms_E65_Projects_13),\"\",dms_E65_Projects_13)","v":""}]
[null,{"$f":"IF(ISBLANK(dms_E65_Projects_14),\"\",dms_E65_Projects_14)","v":""}]
[null,{"$f":"IF(ISBLANK(dms_E65_Projects_15),\"\",dms_E65_Projects_15)","v":""}]
[null,"Aggregate of other projects with total expenditure of less than $500,000"]
[null,"Total",{"$f":"SUM(C69:C84)","v":532452.55628895829},{"$f":"SUM(D69:D84)","v":59080},487410,466310,107610,98115,107610]
[]
[null,"D. OTHER DIRECT EXPENDITURE"]
[null,{"$f":"IF(ISBLANK(dms_E65_Projects_01),\"\",dms_E65_Projects_01)","v":"Fringe RTU Installation"},null,0,0,0,0,0,0]
[null,{"$f":"IF(ISBLANK(dms_E65_Projects_02),\"\",dms_E65_Projects_02)","v":"Fringe RTU Relocation"},null,0,0,0,0,0,0]
[null,{"$f":"IF(ISBLANK(dms_E65_Projects_03),\"\",dms_E65_Projects_03)","v":"Kingfisher PC-1 Replacement"},null,0,0,0,0,0,0]
[null,{"$f":"IF(ISBLANK(dms_E65_Projects_04),\"\",dms_E65_Projects_04)","v":"Moore Temperature Transmitter Replacement"},null,0,0,0,0,0,0]
[null,{"$f":"IF(ISBLANK(dms_E65_Projects_05),\"\",dms_E65_Projects_05)","v":"Dossier Replacement"},null,0,0,0,0,0,0]
[null,{"$f":"IF(ISBLANK(dms_E65_Projects_06),\"\",dms_E65_Projects_06)","v":"Slamshut Switch Replacement"},null,0,0,0,0,0,0]
[null,{"$f":"IF(ISBLANK(dms_E65_Projects_07),\"\",dms_E65_Projects_07)","v":"Cabinet Replacement"},null,0,0,0,0,0,0]
[null,{"$f":"IF(ISBLANK(dms_E65_Projects_08),\"\",dms_E65_Projects_08)","v":"Remote Pressure Monitoring Unit"},null,0,0,0,0,0,0]
[null,{"$f":"IF(ISBLANK(dms_E65_Projects_09),\"\",dms_E65_Projects_09)","v":"6 month extension program"},null,0,0,0,0,0,0]
[null,{"$f":"IF(ISBLANK(dms_E65_Projects_10),\"\",dms_E65_Projects_10)","v":"Communications Assets"},null,0,0,0,0,0,0]
[null,{"$f":"IF(ISBLANK(dms_E65_Projects_11),\"\",dms_E65_Projects_11)","v":"SCADA Category 2"},0]
[null,{"$f":"IF(ISBLANK(dms_E65_Projects_12),\"\",dms_E65_Projects_12)","v":""}]
[null,{"$f":"IF(ISBLANK(dms_E65_Projects_13),\"\",dms_E65_Projects_13)","v":""}]
[null,{"$f":"IF(ISBLANK(dms_E65_Projects_14),\"\",dms_E65_Projects_14)","v":""}]
[null,{"$f":"IF(ISBLANK(dms_E65_Projects_15),\"\",dms_E65_Projects_15)","v":""}]
[null,"Aggregate of other projects with total expenditure of less than $500,000"]
[null,"Total",{"$f":"SUM(C88:C103)","v":0},{"$f":"SUM(D88:D103)","v":0},{"$f":"SUM(E88:E103)","v":0},{"$f":"SUM(F88:F103)","v":0},{"$f":"SUM(G88:G103)","v":0},{"$f":"SUM(H88:H103)","v":0},{"$f":"SUM(I88:I103)","v":0}]
[]
[null,"E. RELATED PARTY MARGIN EXPENDITURE"]
[null,{"$f":"IF(ISBLANK(dms_E65_Projects_01),\"\",dms_E65_Projects_01)","v":"Fringe RTU Installation"},null,0,0,0,0,0,0]
[null,{"$f":"IF(ISBLANK(dms_E65_Projects_02),\"\",dms_E65_Projects_02)","v":"Fringe RTU Relocation"},null,0,0,0,0,0,0]
[null,{"$f":"IF(ISBLANK(dms_E65_Projects_03),\"\",dms_E65_Projects_03)","v":"Kingfisher PC-1 Replacement"},null,0,0,0,0,0,0]
[null,{"$f":"IF(ISBLANK(dms_E65_Projects_04),\"\",dms_E65_Projects_04)","v":"Moore Temperature Transmitter Replacement"},null,0,0,0,0,0,0]
[null,{"$f":"IF(ISBLANK(dms_E65_Projects_05),\"\",dms_E65_Projects_05)","v":"Dossier Replacement"},null,0,0,0,0,0,0]
[null,{"$f":"IF(ISBLANK(dms_E65_Projects_06),\"\",dms_E65_Projects_06)","v":"Slamshut Switch Replacement"},null,0,0,0,0,0,0]
[null,{"$f":"IF(ISBLANK(dms_E65_Projects_07),\"\",dms_E65_Projects_07)","v":"Cabinet Replacement"},null,0,0,0,0,0,0]
[null,{"$f":"IF(ISBLANK(dms_E65_Projects_08),\"\",dms_E65_Projects_08)","v":"Remote Pressure Monitoring Unit"},null,0,0,0,0,0,0]
[null,{"$f":"IF(ISBLANK(dms_E65_Projects_09),\"\",dms_E65_Projects_09)","v":"6 month extension program"},null,0,0,0,0,0,0]
[null,{"$f":"IF(ISBLANK(dms_E65_Projects_10),\"\",dms_E65_Projects_10)","v":"Communications Assets"},null,0,0,0,0,0,0]
[null,{"$f":"IF(ISBLANK(dms_E65_Projects_11),\"\",dms_E65_Projects_11)","v":"SCADA Category 2"},0]
[null,{"$f":"IF(ISBLANK(dms_E65_Projects_12),\"\",dms_E65_Projects_12)","v":""}]
[null,{"$f":"IF(ISBLANK(dms_E65_Projects_13),\"\",dms_E65_Projects_13)","v":""}]
[null,{"$f":"IF(ISBLANK(dms_E65_Projects_14),\"\",dms_E65_Projects_14)","v":""}]
[null,{"$f":"IF(ISBLANK(dms_E65_Projects_15),\"\",dms_E65_Projects_15)","v":""}]
[null,"Aggregate of other projects with total expenditure of less than $500,000"]
[null,"Total",{"$f":"SUM(C107:C122)","v":0},{"$f":"SUM(D107:D122)","v":0},{"$f":"SUM(E107:E122)","v":0},{"$f":"SUM(F107:F122)","v":0},{"$f":"SUM(G107:G122)","v":0},{"$f":"SUM(H107:H122)","v":0},{"$f":"SUM(I107:I122)","v":0}]
[]
[null,"F. CAPITAL CONTRIBUTIONS included in the above"]
[null,{"$f":"IF(ISBLANK(dms_E65_Projects_01),\"\",dms_E65_Projects_01)","v":"Fringe RTU Installation"},null,0,0,0,0,0,0]
[null,{"$f":"IF(ISBLANK(dms_E65_Projects_02),\"\",dms_E65_Projects_02)","v":"Fringe RTU Relocation"},null,0,0,0,0,0,0]
[null,{"$f":"IF(ISBLANK(dms_E65_Projects_03),\"\",dms_E65_Projects_03)","v":"Kingfisher PC-1 Replacement"},null,0,0,0,0,0,0]
[null,{"$f":"IF(ISBLANK(dms_E65_Projects_04),\"\",dms_E65_Projects_04)","v":"Moore Temperature Transmitter Replacement"},null,0,0,0,0,0,0]
[null,{"$f":"IF(ISBLANK(dms_E65_Projects_05),\"\",dms_E65_Projects_05)","v":"Dossier Replacement"},null,0,0,0,0,0,0]
[null,{"$f":"IF(ISBLANK(dms_E65_Projects_06),\"\",dms_E65_Projects_06)","v":"Slamshut Switch Replacement"},null,0,0,0,0,0,0]
[null,{"$f":"IF(ISBLANK(dms_E65_Projects_07),\"\",dms_E65_Projects_07)","v":"Cabinet Replacement"},null,0,0,0,0,0,0]
[null,{"$f":"IF(ISBLANK(dms_E65_Projects_08),\"\",dms_E65_Projects_08)","v":"Remote Pressure Monitoring Unit"},null,0,0,0,0,0,0]
[null,{"$f":"IF(ISBLANK(dms_E65_Projects_09),\"\",dms_E65_Projects_09)","v":"6 month extension program"},null,0,0,0,0,0,0]
[null,{"$f":"IF(ISBLANK(dms_E65_Projects_10),\"\",dms_E65_Projects_10)","v":"Communications Assets"},null,0,0,0,0,0,0]
[null,{"$f":"IF(ISBLANK(dms_E65_Projects_11),\"\",dms_E65_Projects_11)","v":"SCADA Category 2"},0]
[null,{"$f":"IF(ISBLANK(dms_E65_Projects_12),\"\",dms_E65_Projects_12)","v":""}]
[null,{"$f":"IF(ISBLANK(dms_E65_Projects_13),\"\",dms_E65_Projects_13)","v":""}]
[null,{"$f":"IF(ISBLANK(dms_E65_Projects_14),\"\",dms_E65_Projects_14)","v":""}]
[null,{"$f":"IF(ISBLANK(dms_E65_Projects_15),\"\",dms_E65_Projects_15)","v":""}]
[null,"Aggregate of other projects with total expenditure of less than $500,000"]
[null,"Total",{"$f":"SUM(C126:C141)","v":0},{"$f":"SUM(D126:D141)","v":0},{"$f":"SUM(E126:E141)","v":0},{"$f":"SUM(F126:F141)","v":0},{"$f":"SUM(G126:G141)","v":0},{"$f":"SUM(H126:H141)","v":0},{"$f":"SUM(I126:I141)","v":0}]

{"sheet":"E10. Overheads","index":13,"n_rows":32,"n_cols":9,"rows_kept":32,"cut":false,"hidden":false,"merged":[]}
[null,{"$f":"INDEX(dms_Worksheet_List,MATCH(dms_Model,dms_Model_List))","v":"REGULATORY REPORTING STATEMENT"}]
[null,{"$f":"dms_TradingName","v":"AusNet (Gas)"}]
[null,{"$f":"dms_Header_Span","v":"2021-22 to 2027-28"}]
[null,"E10. OVERHEADS EXPENDITURE"]
[]
[null,"E10.1 - NETWORK"]
[null,null,"EXPENDITURE"]
[null,null,{"$f":"CONCATENATE(\"$0's, real \",dms_DollarReal)","v":"$0's, real June 2023"}]
[null,null,{"$f":"VLOOKUP(CRCP_y4,'AER lookups'!$B$52:$C$101,2,0)","v":2022},{"$f":"CONCATENATE(\"1 Jan-30 Jun \"&(C9+1))","v":"1 Jan-30 Jun 2023"},{"$f":"FRCP_y1","v":"2023-24"},{"$f":"FRCP_y2","v":"2024-25"},{"$f":"FRCP_y3","v":"2025-26"},{"$f":"FRCP_y4","v":"2026-27"},{"$f":"FRCP_y5","v":"2027-28"}]
[null,"E10.1.1 - OPEX"]
[null,"Reference services",5221253.0703448076,2793211.1670937105,5552639.2706310535,5708785.5834732531,5508947.0295970012,5491294.408963237,5549986.4849275332]
[null,"Non-reference services",0,0,0,0,0,0,0]
[null,"Total",{"$f":"SUM(C11:C12)","v":5221253.0703448076},{"$f":"SUM(D11:D12)","v":2793211.1670937105},5552639.2706310535,5708785.5834732531,5508947.0295970012,5491294.408963237,5549986.4849275332]
[null,"E10.1.2 - CAPEX"]
[null,"Reference services",4152837.802241303,2172011.9291841961,3005299.7328807018,2988093.9945354625,2967752.2450530878,3039681.9188677785,2945211.9539214256]
[null,"Non-reference services"]
[null,"Total",{"$f":"SUM(C15:C16)","v":4152837.802241303},{"$f":"SUM(D15:D16)","v":2172011.9291841961},3005299.7328807018,2988093.9945354625,2967752.2450530878,3039681.9188677785,2945211.9539214256]
[]
[]
[]
[null,"E10.2 - CORPORATE"]
[null,null,"EXPENDITURE"]
[null,null,{"$f":"CONCATENATE(\"$0's, real \",dms_DollarReal)","v":"$0's, real June 2023"}]
[null,null,{"$f":"VLOOKUP(CRCP_y4,'AER lookups'!$B$52:$C$101,2,0)","v":2022},{"$f":"CONCATENATE(\"1 Jan-30 Jun \"&(C24+1))","v":"1 Jan-30 Jun 2023"},{"$f":"FRCP_y1","v":"2023-24"},{"$f":"FRCP_y2","v":"2024-25"},{"$f":"FRCP_y3","v":"2025-26"},{"$f":"FRCP_y4","v":"2026-27"},{"$f":"FRCP_y5","v":"2027-28"}]
[null,"E10.2.1 - OPEX"]
[null,"Reference services",11267247.918464629,6027634.034254997,12888208.09819896,13223774.73422798,12801206.687140945,12772324.552976789,12897359.225663507]
[null,"Non-reference services",0,0,0,0,0,0,0]
[null,"Total",{"$f":"SUM(C26:C27)","v":11267247.918464629},6027634.034254997,12888208.09819896,13223774.73422798,12801206.687140945,12772324.552976789,12897359.225663507]
[null,"E10.2.2 - CAPEX"]
[null,"Reference services"]
[null,"Non-reference services"]
[null,"Total",{"$f":"SUM(C30:C31)","v":0},0,0,0,0,0,0]

{"sheet":"E12. ICT","index":14,"n_rows":139,"n_cols":9,"rows_kept":139,"cut":false,"hidden":false,"merged":[]}
[null,{"$f":"INDEX(dms_Worksheet_List,MATCH(dms_Model,dms_Model_List))","v":"REGULATORY REPORTING STATEMENT"}]
[null,{"$f":"dms_TradingName","v":"AusNet (Gas)"}]
[null,{"$f":"dms_Header_Span","v":"2021-22 to 2027-28"}]
[null,"E12. INFORMATION AND COMMUNICATION TECHNOLOGY"]
[]
[null,"Please list all projects here:"]
[null,"Corporate Enablement"]
[null,"Workforce Collab"]
[null,"Information Management"]
[null,"CIS"]
[null,"Intelligent Networks"]
[null,"TAM Apps"]
[null,"TAM Infra"]
[null,"Cyber Sec"]
[null,"Corporate Comms"]
[null,"Digital Metering"]
[null,"Corporate"]
[null,"Network Management"]
[null,"Works & Asset Management"]
[null,"Metering & Customer Services"]
[null,"Information Technology"]
[]
[null,"E12.1 - CAPEX - BY PROJECT"]
[null,"A. DIRECT INTERNAL LABOUR EXPENDITURE"]
[null,null,"EXPENDITURE"]
[null,null,{"$f":"CONCATENATE(\"$0's, real \",dms_DollarReal)","v":"$0's, real June 2023"}]
[null,null,{"$f":"VLOOKUP(CRCP_y4,'AER lookups'!$B$52:$C$101,2,0)","v":2022},{"$f":"CONCATENATE(\"1 Jan-30 Jun \"&(C27+1))","v":"1 Jan-30 Jun 2023"},{"$f":"FRCP_y1","v":"2023-24"},{"$f":"FRCP_y2","v":"2024-25"},{"$f":"FRCP_y3","v":"2025-26"},{"$f":"FRCP_y4","v":"2026-27"},{"$f":"FRCP_y5","v":"2027-28"}]
[null,{"$f":"IF(ISBLANK(dms_E12_Projects_01),\"\",dms_E12_Projects_01)","v":"Corporate Enablement"},null,428292.81235790317,376235.52823089983,631948.610747003,511124.30742320337,645938.74109191226,391829.71454928373]
[null,{"$f":"IF(ISBLANK(dms_E12_Projects_02),\"\",dms_E12_Projects_02)","v":"Workforce Collab"},null,138215.94653451504,570414.63460542599,1173782.2920196208,581190.69674454466,281499.26612321532,284598.13620622543]
[null,{"$f":"IF(ISBLANK(dms_E12_Projects_03),\"\",dms_E12_Projects_03)","v":"Information Management"},398278.93677479465,98138.698037787792,983826.83967906563,1718001.3065753365,1781436.8582216722,1013317.5414928806,341710.59340151219]
[null,{"$f":"IF(ISBLANK(dms_E12_Projects_04),\"\",dms_E12_Projects_04)","v":"CIS"},null,678810.5446176324,355042.23773241125,357810.62455187459,270477.36651532754,212687.14645709307,87035.346001800819]
[null,{"$f":"IF(ISBLANK(dms_E12_Projects_05),\"\",dms_E12_Projects_05)","v":"Intelligent Networks"},null,220610.81189749195,1467362.2576066917,1774564.5448544414,2392132.9955778634,302308.3334615528,0]
[null,{"$f":"IF(ISBLANK(dms_E12_Projects_06),\"\",dms_E12_Projects_06)","v":"TAM Apps"},null,0,189637.38859045081,191116.05673541367,241524.93492724738,293020.49958824681,296246.20057279302]
[null,{"$f":"IF(ISBLANK(dms_E12_Projects_07),\"\",dms_E12_Projects_07)","v":"TAM Infra"},null,0,938031.62915518624,211437.53789823319,1278013.932688145,304072.55356663436,356848.87083709962]
[null,{"$f":"IF(ISBLANK(dms_E12_Projects_08),\"\",dms_E12_Projects_08)","v":"Cyber Sec"},71497.196404882648,0,692262.98067788535,697660.7939734275,705340.956669081,713105.66603776149,720955.85280713718]
[null,{"$f":"IF(ISBLANK(dms_E12_Projects_09),\"\",dms_E12_Projects_09)","v":"Corporate Comms"},null,0,773992.07825665653,309010.76014183811,312412.48908102699,315851.66577695549,319328.70247131301]
[null,{"$f":"IF(ISBLANK(dms_E12_Projects_10),\"\",dms_E12_Projects_10)","v":"Digital Metering"},null,0,216302.65560313052,526256.85703321849,222615.11647352061,22506.576344665933,227543.38824000215]
[null,{"$f":"IF(ISBLANK(dms_E12_Projects_11),\"\",dms_E12_Projects_11)","v":"Corporate"},419097.83997545176]
[null,{"$f":"IF(ISBLANK(dms_E12_Projects_12),\"\",dms_E12_Projects_12)","v":"Network Management"},3431.4288963391264]
[null,{"$f":"IF(ISBLANK(dms_E12_Projects_13),\"\",dms_E12_Projects_13)","v":"Works & Asset Management"},23976.152330827914]
[null,{"$f":"IF(ISBLANK(dms_E12_Projects_14),\"\",dms_E12_Projects_14)","v":"Metering & Customer Services"},296629.24369371874]
[null,{"$f":"IF(ISBLANK(dms_E12_Projects_15),\"\",dms_E12_Projects_15)","v":"Information Technology"},809172.72285582451]
[null,"Aggregate of other projects with total expenditure of less than $500,000"]
[null,"Total",{"$f":"SUM(C28:C43)","v":2022083.5209318392},{"$f":"SUM(D28:D43)","v":1564068.8134453306},6563108.2301378036,7591589.3845304074,8296269.6543216314,4104307.9899409185,3026096.8050871668]
[]
[null,"B. DIRECT CONTRACTOR EXPENDITURE"]
[null,{"$f":"IF(ISBLANK(dms_E12_Projects_01),\"\",dms_E12_Projects_01)","v":"Corporate Enablement"},null,0,36334.199999999997,60557,48445.599999999999,60557,36334.199999999997]
[null,{"$f":"IF(ISBLANK(dms_E12_Projects_02),\"\",dms_E12_Projects_02)","v":"Workforce Collab"},null,0,55086.662107999997,112478.66210799999,55086.662107999997,26390.662108,26390.662108]
[null,{"$f":"IF(ISBLANK(dms_E12_Projects_03),\"\",dms_E12_Projects_03)","v":"Information Management"},0,70085.746946019586,95011.125946428583,164628.90075714284,168848.90075714287,94998.900757142852,31686.675567857139]
[null,{"$f":"IF(ISBLANK(dms_E12_Projects_04),\"\",dms_E12_Projects_04)","v":"CIS"},null,14425.565412223701,34287.5,34287.5,25636.5,19939.500000000004,8070.7499999999991]
[null,{"$f":"IF(ISBLANK(dms_E12_Projects_05),\"\",dms_E12_Projects_05)","v":"Intelligent Networks"},null,146954.31975339481,141707.6,170049.12,226732.15999999997,28341.519999999997,0]
[null,{"$f":"IF(ISBLANK(dms_E12_Projects_06),\"\",dms_E12_Projects_06)","v":"TAM Apps"},null,0,18313.854720000003,18313.854720000003,22892.3184,27470.782080000001,27470.782080000001]
[null,{"$f":"IF(ISBLANK(dms_E12_Projects_07),\"\",dms_E12_Projects_07)","v":"TAM Infra"},null,0,90588.544309758785,20261.177514684536,121133.2563883971,28506.916298606935,33090.44148855262]
[null,{"$f":"IF(ISBLANK(dms_E12_Projects_08),\"\",dms_E12_Projects_08)","v":"Cyber Sec"},51325.02211193143,0,66853.924484000003,66853.924484000003,66853.924484000003,66853.924484000003,66853.924484000003]
[null,{"$f":"IF(ISBLANK(dms_E12_Projects_09),\"\",dms_E12_Projects_09)","v":"Corporate Comms"},null,0,74746.75,29611.212499999998,29611.212499999998,29611.212499999998,29611.212499999998]
[null,{"$f":"IF(ISBLANK(dms_E12_Projects_10),\"\",dms_E12_Projects_10)","v":"Digital Metering"},null,0,20888.999999999996,50429,21100,2110,21100]
[null,{"$f":"IF(ISBLANK(dms_E12_Projects_11),\"\",dms_E12_Projects_11)","v":"Corporate"},0]
[null,{"$f":"IF(ISBLANK(dms_E12_Projects_12),\"\",dms_E12_Projects_12)","v":"Network Management"},255.2379770699647]
[null,{"$f":"IF(ISBLANK(dms_E12_Projects_13),\"\",dms_E12_Projects_13)","v":"Works & Asset Management"},512.17039615230772]
[null,{"$f":"IF(ISBLANK(dms_E12_Projects_14),\"\",dms_E12_Projects_14)","v":"Metering & Customer Services"},1901.8101299278781]
[null,{"$f":"IF(ISBLANK(dms_E12_Projects_15),\"\",dms_E12_Projects_15)","v":"Information Technology"},541810.62437060743]
[null,"Aggregate of other projects with total expenditure of less than $500,000"]
[null,"Total",{"$f":"SUM(C47:C62)","v":595804.86498568906},{"$f":"SUM(D47:D62)","v":231465.63211163809},{"$f":"SUM(E47:E62)","v":633819.16156818729},{"$f":"SUM(F47:F62)","v":727470.35208382725},{"$f":"SUM(G47:G62)","v":786340.53463753988},{"$f":"SUM(H47:H62)","v":384780.41822774982},{"$f":"SUM(I47:I62)","v":280608.64822840982}]
[]
[null,"C. DIRECT MATERIAL EXPENDITURE"]
[null,{"$f":"IF(ISBLANK(dms_E12_Projects_01),\"\",dms_E12_Projects_01)","v":"Corporate Enablement"},null,27571.061243571748,499595.25000000006,832658.75000000012,666127,832658.75000000012,499595.25000000006]
[null,{"$f":"IF(ISBLANK(dms_E12_Projects_02),\"\",dms_E12_Projects_02)","v":"Workforce Collab"},null,89323.500746659338,757441.60398499994,1546581.6039849999,757441.60398499994,362871.60398499999,362871.60398499999]
[null,{"$f":"IF(ISBLANK(dms_E12_Projects_03),\"\",dms_E12_Projects_03)","v":"Information Management"},258729.31640429172,496932.84037471365,1306402.9817633929,2263647.3854107144,2321672.3854107144,1306234.8854107144,435691.78905803571]
[null,{"$f":"IF(ISBLANK(dms_E12_Projects_04),\"\",dms_E12_Projects_04)","v":"CIS"},null,138447.70613929292,471453.12500000006,471453.12500000006,352501.875,274168.12500000006,110972.81250000001]
[null,{"$f":"IF(ISBLANK(dms_E12_Projects_05),\"\",dms_E12_Projects_05)","v":"Intelligent Networks"},null,878475.22008644673,1948479.5000000002,2338175.4,3117567.2,389695.9,0]
[null,{"$f":"IF(ISBLANK(dms_E12_Projects_06),\"\",dms_E12_Projects_06)","v":"TAM Apps"},null,0,251815.50240000003,251815.50240000003,314769.37800000003,377723.2536,377723.2536]
[null,{"$f":"IF(ISBLANK(dms_E12_Projects_07),\"\",dms_E12_Projects_07)","v":"TAM Infra"},null,0,1245592.4842591835,278591.19082691235,1665582.2753404602,391970.09910584538,454993.57046759856]
[null,{"$f":"IF(ISBLANK(dms_E12_Projects_08),\"\",dms_E12_Projects_08)","v":"Cyber Sec"},363912.63747279777,0,919241.46165499999,919241.46165499999,919241.46165499999,919241.46165499999,919241.46165499999]
[null,{"$f":"IF(ISBLANK(dms_E12_Projects_09),\"\",dms_E12_Projects_09)","v":"Corporate Comms"},null,0,1027767.8125000001,407154.17187500006,407154.17187500006,407154.17187500006,407154.17187500006]
[null,{"$f":"IF(ISBLANK(dms_E12_Projects_10),\"\",dms_E12_Projects_10)","v":"Digital Metering"},null,0,287223.75,693398.75,290125,29012.500000000004,290125]
[null,{"$f":"IF(ISBLANK(dms_E12_Projects_11),\"\",dms_E12_Projects_11)","v":"Corporate"},27119.322646495126]
[null,{"$f":"IF(ISBLANK(dms_E12_Projects_12),\"\",dms_E12_Projects_12)","v":"Network Management"},5892.6243785466859]
[null,{"$f":"IF(ISBLANK(dms_E12_Projects_13),\"\",dms_E12_Projects_13)","v":"Works & Asset Management"},4915.4965142409164]
[null,{"$f":"IF(ISBLANK(dms_E12_Projects_14),\"\",dms_E12_Projects_14)","v":"Metering & Customer Services"},335296.9613640203]
[null,{"$f":"IF(ISBLANK(dms_E12_Projects_15),\"\",dms_E12_Projects_15)","v":"Information Technology"},3238878.6412530695]
[null,"Aggregate of other projects with total expenditure of less than $500,000"]
[null,"Total",{"$f":"SUM(C66:C81)","v":4234745.0000334624},{"$f":"SUM(D66:D81)","v":1630750.3285906843},{"$f":"SUM(E66:E81)","v":8715013.4715625774},{"$f":"SUM(F66:F81)","v":10002717.341152625},{"$f":"SUM(G66:G81)","v":10812182.351266176},{"$f":"SUM(H66:H81)","v":5290730.7506315596},{"$f":"SUM(I66:I81)","v":3858368.9131406341}]
[]
[null,"D. OTHER DIRECT EXPENDITURE"]
[null,{"$f":"IF(ISBLANK(dms_E12_Projects_01),\"\",dms_E12_Projects_01)","v":"Corporate Enablement"},null,0,0,0,0,0,0]
[null,{"$f":"IF(ISBLANK(dms_E12_Projects_02),\"\",dms_E12_Projects_02)","v":"Workforce Collab"},null,0,0,0,0,0,0]
[null,{"$f":"IF(ISBLANK(dms_E12_Projects_03),\"\",dms_E12_Projects_03)","v":"Information Management"},0,0,0,0,0,0,0]
[null,{"$f":"IF(ISBLANK(dms_E12_Projects_04),\"\",dms_E12_Projects_04)","v":"CIS"},null,0,0,0,0,0,0]
[null,{"$f":"IF(ISBLANK(dms_E12_Projects_05),\"\",dms_E12_Projects_05)","v":"Intelligent Networks"},null,0,0,0,0,0,0]
[null,{"$f":"IF(ISBLANK(dms_E12_Projects_06),\"\",dms_E12_Projects_06)","v":"TAM Apps"},null,0,0,0,0,0,0]
[null,{"$f":"IF(ISBLANK(dms_E12_Projects_07),\"\",dms_E12_Projects_07)","v":"TAM Infra"},null,0,0,0,0,0,0]
[null,{"$f":"IF(ISBLANK(dms_E12_Projects_08),\"\",dms_E12_Projects_08)","v":"Cyber Sec"},0,0,0,0,0,0,0]
[null,{"$f":"IF(ISBLANK(dms_E12_Projects_09),\"\",dms_E12_Projects_09)","v":"Corporate Comms"},null,0,0,0,0,0,0]
[null,{"$f":"IF(ISBLANK(dms_E12_Projects_10),\"\",dms_E12_Projects_10)","v":"Digital Metering"},null,0,0,0,0,0,0]
[null,{"$f":"IF(ISBLANK(dms_E12_Projects_11),\"\",dms_E12_Projects_11)","v":"Corporate"},0]
[null,{"$f":"IF(ISBLANK(dms_E12_Projects_12),\"\",dms_E12_Projects_12)","v":"Network Management"},0]
[null,{"$f":"IF(ISBLANK(dms_E12_Projects_13),\"\",dms_E12_Projects_13)","v":"Works & Asset Management"},0]
[null,{"$f":"IF(ISBLANK(dms_E12_Projects_14),\"\",dms_E12_Projects_14)","v":"Metering & Customer Services"},0]
[null,{"$f":"IF(ISBLANK(dms_E12_Projects_15),\"\",dms_E12_Projects_15)","v":"Information Technology"},0]
[null,"Aggregate of other projects with total expenditure of less than $500,000"]
[null,"Total",{"$f":"SUM(C85:C100)","v":0},{"$f":"SUM(D85:D100)","v":0},{"$f":"SUM(E85:E100)","v":0},{"$f":"SUM(F85:F100)","v":0},{"$f":"SUM(G85:G100)","v":0},{"$f":"SUM(H85:H100)","v":0},{"$f":"SUM(I85:I100)","v":0}]
[]
[null,"E. RELATED PARTY MARGIN EXPENDITURE"]
[null,{"$f":"IF(ISBLANK(dms_E12_Projects_01),\"\",dms_E12_Projects_01)","v":"Corporate Enablement"},null,0,0,0,0,0,0]
[null,{"$f":"IF(ISBLANK(dms_E12_Projects_02),\"\",dms_E12_Projects_02)","v":"Workforce Collab"},null,0,0,0,0,0,0]
[null,{"$f":"IF(ISBLANK(dms_E12_Projects_03),\"\",dms_E12_Projects_03)","v":"Information Management"},0,0,0,0,0,0,0]
[null,{"$f":"IF(ISBLANK(dms_E12_Projects_04),\"\",dms_E12_Projects_04)","v":"CIS"},null,0,0,0,0,0,0]
[null,{"$f":"IF(ISBLANK(dms_E12_Projects_05),\"\",dms_E12_Projects_05)","v":"Intelligent Networks"},null,0,0,0,0,0,0]
[null,{"$f":"IF(ISBLANK(dms_E12_Projects_06),\"\",dms_E12_Projects_06)","v":"TAM Apps"},null,0,0,0,0,0,0]
[null,{"$f":"IF(ISBLANK(dms_E12_Projects_07),\"\",dms_E12_Projects_07)","v":"TAM Infra"},null,0,0,0,0,0,0]
[null,{"$f":"IF(ISBLANK(dms_E12_Projects_08),\"\",dms_E12_Projects_08)","v":"Cyber Sec"},0,0,0,0,0,0,0]
[null,{"$f":"IF(ISBLANK(dms_E12_Projects_09),\"\",dms_E12_Projects_09)","v":"Corporate Comms"},null,0,0,0,0,0,0]
[null,{"$f":"IF(ISBLANK(dms_E12_Projects_10),\"\",dms_E12_Projects_10)","v":"Digital Metering"},null,0,0,0,0,0,0]
[null,{"$f":"IF(ISBLANK(dms_E12_Projects_11),\"\",dms_E12_Projects_11)","v":"Corporate"},0]
[null,{"$f":"IF(ISBLANK(dms_E12_Projects_12),\"\",dms_E12_Projects_12)","v":"Network Management"},0]
[null,{"$f":"IF(ISBLANK(dms_E12_Projects_13),\"\",dms_E12_Projects_13)","v":"Works & Asset Management"},0]
[null,{"$f":"IF(ISBLANK(dms_E12_Projects_14),\"\",dms_E12_Projects_14)","v":"Metering & Customer Services"},0]
[null,{"$f":"IF(ISBLANK(dms_E12_Projects_15),\"\",dms_E12_Projects_15)","v":"Information Technology"},0]
[null,"Aggregate of other projects with total expenditure of less than $500,000"]
[null,"Total",{"$f":"SUM(C104:C119)","v":0},{"$f":"SUM(D104:D119)","v":0},{"$f":"SUM(E104:E119)","v":0},{"$f":"SUM(F104:F119)","v":0},{"$f":"SUM(G104:G119)","v":0},{"$f":"SUM(H104:H119)","v":0},{"$f":"SUM(I104:I119)","v":0}]
[]
[null,"F. CAPITAL CONTRIBUTIONS included in the above"]
[null,{"$f":"IF(ISBLANK(dms_E12_Projects_01),\"\",dms_E12_Projects_01)","v":"Corporate Enablement"},null,0,0,0,0,0,0]
[null,{"$f":"IF(ISBLANK(dms_E12_Projects_02),\"\",dms_E12_Projects_02)","v":"Workforce Collab"},null,0,0,0,0,0,0]
[null,{"$f":"IF(ISBLANK(dms_E12_Projects_03),\"\",dms_E12_Projects_03)","v":"Information Management"},0,0,0,0,0,0,0]
[null,{"$f":"IF(ISBLANK(dms_E12_Projects_04),\"\",dms_E12_Projects_04)","v":"CIS"},null,0,0,0,0,0,0]
[null,{"$f":"IF(ISBLANK(dms_E12_Projects_05),\"\",dms_E12_Projects_05)","v":"Intelligent Networks"},null,0,0,0,0,0,0]
[null,{"$f":"IF(ISBLANK(dms_E12_Projects_06),\"\",dms_E12_Projects_06)","v":"TAM Apps"},null,0,0,0,0,0,0]
[null,{"$f":"IF(ISBLANK(dms_E12_Projects_07),\"\",dms_E12_Projects_07)","v":"TAM Infra"},null,0,0,0,0,0,0]
[null,{"$f":"IF(ISBLANK(dms_E12_Projects_08),\"\",dms_E12_Projects_08)","v":"Cyber Sec"},0,0,0,0,0,0,0]
[null,{"$f":"IF(ISBLANK(dms_E12_Projects_09),\"\",dms_E12_Projects_09)","v":"Corporate Comms"},null,0,0,0,0,0,0]
[null,{"$f":"IF(ISBLANK(dms_E12_Projects_10),\"\",dms_E12_Projects_10)","v":"Digital Metering"},null,0,0,0,0,0,0]
[null,{"$f":"IF(ISBLANK(dms_E12_Projects_11),\"\",dms_E12_Projects_11)","v":"Corporate"},0]
[null,{"$f":"IF(ISBLANK(dms_E12_Projects_12),\"\",dms_E12_Projects_12)","v":"Network Management"},0]
[null,{"$f":"IF(ISBLANK(dms_E12_Projects_13),\"\",dms_E12_Projects_13)","v":"Works & Asset Management"},0]
[null,{"$f":"IF(ISBLANK(dms_E12_Projects_14),\"\",dms_E12_Projects_14)","v":"Metering & Customer Services"},0]
[null,{"$f":"IF(ISBLANK(dms_E12_Projects_15),\"\",dms_E12_Projects_15)","v":"Information Technology"},0]
[null,"Aggregate of other projects with total expenditure of less than $500,000"]
[null,"Total",{"$f":"SUM(C123:C138)","v":0},{"$f":"SUM(D123:D138)","v":0},{"$f":"SUM(E123:E138)","v":0},{"$f":"SUM(F123:F138)","v":0},{"$f":"SUM(G123:G138)","v":0},{"$f":"SUM(H123:H138)","v":0},{"$f":"SUM(I123:I138)","v":0}]

{"sheet":"E13. Other capex","index":15,"n_rows":139,"n_cols":9,"rows_kept":139,"cut":false,"hidden":false,"merged":[]}
[null,{"$f":"INDEX(dms_Worksheet_List,MATCH(dms_Model,dms_Model_List))","v":"REGULATORY REPORTING STATEMENT"}]
[null,{"$f":"dms_TradingName","v":"AusNet (Gas)"}]
[null,{"$f":"dms_Header_Span","v":"2021-22 to 2027-28"}]
[null,"E13. OTHER CAPITAL EXPENDITURE"]
[]
[null,"Please list all projects here:"]
[null,"Network Regulators - planned"]
[null,"Network Regulators - ad hoc"]
[null,"Customer Regulators - planned"]
[null,"Customer Regulators - ad hoc"]
[null,"Cathodic Protection"]
[null,"Other Non-demand"]
[null,"Major Alterations"]
[null,"City Gate Security Fence Upgrades "]
[null,"Other non-IT"]
[null,"Extensions"]
[]
[]
[]
[]
[]
[]
[null,"E13.1 - CAPEX - BY PROJECT"]
[null,null,"EXPENDITURE"]
[null,null,{"$f":"CONCATENATE(\"$0's, real \",dms_DollarReal)","v":"$0's, real June 2023"}]
[null,null,{"$f":"VLOOKUP(CRCP_y4,'AER lookups'!$B$52:$C$101,2,0)","v":2022},{"$f":"CONCATENATE(\"1 Jan-30 Jun \"&(C26+1))","v":"1 Jan-30 Jun 2023"},{"$f":"FRCP_y1","v":"2023-24"},{"$f":"FRCP_y2","v":"2024-25"},{"$f":"FRCP_y3","v":"2025-26"},{"$f":"FRCP_y4","v":"2026-27"},{"$f":"FRCP_y5","v":"2027-28"}]
[null,"A. DIRECT INTERNAL LABOUR EXPENDITURE"]
[null,{"$f":"IF(ISBLANK(dms_E13_Projects_01),\"\",dms_E13_Projects_01)","v":"Network Regulators - planned"},10616.042846572489,11453.202353180908,46255.408983374553,37808.43222281721,32795.007402440599,35571.369442301278,42178.77440546381]
[null,{"$f":"IF(ISBLANK(dms_E13_Projects_02),\"\",dms_E13_Projects_02)","v":"Network Regulators - ad hoc"},2123.2085693144977,1060.4816993686027,2131.5856674366155,2148.2063762964326,2171.854794863616,2195.7635458210666,2219.935495024411]
[null,{"$f":"IF(ISBLANK(dms_E13_Projects_03),\"\",dms_E13_Projects_03)","v":"Customer Regulators - planned"},0,11750.137229004118,24512.702279104218,21601.289216848778,15512.472872313378,14416.285560088212,15467.955545456341]
[null,{"$f":"IF(ISBLANK(dms_E13_Projects_04),\"\",dms_E13_Projects_04)","v":"Customer Regulators - ad hoc"},0,18571.15551934297,37328.328208150015,37619.390061703125,38033.521167651641,38452.211214418516,38875.510388867486]
[null,{"$f":"IF(ISBLANK(dms_E13_Projects_05),\"\",dms_E13_Projects_05)","v":"Cathodic Protection"},8545.6360195682701,8144.4994511508685,16370.577925913209,17357.507520475174,16983.904495833474,17170.870928320743,17359.895571090896]
[null,{"$f":"IF(ISBLANK(dms_E13_Projects_06),\"\",dms_E13_Projects_06)","v":"Other Non-demand"},0,0,23195.915233045249,72149.874174929617,110564.78389691695,31418.390102277142,5.3278451880585873]
[null,{"$f":"IF(ISBLANK(dms_E13_Projects_07),\"\",dms_E13_Projects_07)","v":"Major Alterations"},60368.231991412271,99953.0284633345,189519.68157726066,195057.75464366353,201211.49550600245,199968.74428101786,198542.80093011618]
[null,{"$f":"IF(ISBLANK(dms_E13_Projects_08),\"\",dms_E13_Projects_08)","v":"City Gate Security Fence Upgrades "},0,0,17745.450681409824,17883.8180826678,18080.691167239602,18279.73151896038,16483.021050556254]
[null,{"$f":"IF(ISBLANK(dms_E13_Projects_09),\"\",dms_E13_Projects_09)","v":"Other non-IT"},15238.103709311194,10699.505168382713,43012.362927465001,43347.745160753286,43824.936566949735,44307.381110011869,44795.136618824625]
[null,{"$f":"IF(ISBLANK(dms_E13_Projects_10),\"\",dms_E13_Projects_10)","v":"Extensions"},260369.24055078544,13457.512764987567,0,0,0,0,0]
[null,{"$f":"IF(ISBLANK(dms_E13_Projects_11),\"\",dms_E13_Projects_11)","v":""}]
[null,{"$f":"IF(ISBLANK(dms_E13_Projects_12),\"\",dms_E13_Projects_12)","v":""}]
[null,{"$f":"IF(ISBLANK(dms_E13_Projects_13),\"\",dms_E13_Projects_13)","v":""}]
[null,{"$f":"IF(ISBLANK(dms_E13_Projects_14),\"\",dms_E13_Projects_14)","v":""}]
[null,{"$f":"IF(ISBLANK(dms_E13_Projects_15),\"\",dms_E13_Projects_15)","v":""}]
[null,"Aggregate of other projects with total expenditure of less than $500,000"]
[null,"Total",{"$f":"SUM(C28:C43)","v":357260.46368696418},{"$f":"SUM(D28:D43)","v":175089.52264875226},400072.0134831593,444974.01746015495,479178.66787021153,401780.74770321709,375928.35785058804]
[]
[null,"B. DIRECT CONTRACTOR EXPENDITURE"]
[null,{"$f":"IF(ISBLANK(dms_E13_Projects_01),\"\",dms_E13_Projects_01)","v":"Network Regulators - planned"},201704.81408487729,216486,869953,705584,605359,649458,761710]
[null,{"$f":"IF(ISBLANK(dms_E13_Projects_02),\"\",dms_E13_Projects_02)","v":"Network Regulators - ad hoc"},40340.962816975458,20045,40090,40090,40090,40090,40090]
[null,{"$f":"IF(ISBLANK(dms_E13_Projects_03),\"\",dms_E13_Projects_03)","v":"Customer Regulators - planned"},0,222098.59999999998,461024.97749999998,403124.995,286342.82500000001,263210.89499999996,279337.09749999997]
[null,{"$f":"IF(ISBLANK(dms_E13_Projects_04),\"\",dms_E13_Projects_04)","v":"Customer Regulators - ad hoc"},0,351028.04,702056.08,702056.08,702056.08,702056.08,702056.08]
[null,{"$f":"IF(ISBLANK(dms_E13_Projects_05),\"\",dms_E13_Projects_05)","v":"Cathodic Protection"},162367.08437179713,153945.59999999998,307891.19999999995,323927.19999999995,313503.8,313503.8,313503.8]
[null,{"$f":"IF(ISBLANK(dms_E13_Projects_06),\"\",dms_E13_Projects_06)","v":"Other Non-demand"},0,0,436259.37999999995,1346466.7490000001,2040901.72,573633.37759999989,96.215999999999994]
[null,{"$f":"IF(ISBLANK(dms_E13_Projects_07),\"\",dms_E13_Projects_07)","v":"Major Alterations"},543314.08792271046,894927.28240799985,1688404.4625239999,1724297.4425340001,1759328.620263,1729424.127258,1698395.2002719999]
[null,{"$f":"IF(ISBLANK(dms_E13_Projects_08),\"\",dms_E13_Projects_08)","v":"City Gate Security Fence Upgrades "},0,0,333749.25,333749.25,333749.25,333749.25,297668.25]
[null,{"$f":"IF(ISBLANK(dms_E13_Projects_09),\"\",dms_E13_Projects_09)","v":"Other non-IT"},15238.103709311194,10644.198725319335,42576.794901277339,42576.794901277339,42576.794901277339,42576.794901277339,42576.794901277339]
[null,{"$f":"IF(ISBLANK(dms_E13_Projects_10),\"\",dms_E13_Projects_10)","v":"Extensions"},4947015.570464923,254371.04999999996,0,0,0,0,0]
[null,{"$f":"IF(ISBLANK(dms_E13_Projects_11),\"\",dms_E13_Projects_11)","v":""}]
[null,{"$f":"IF(ISBLANK(dms_E13_Projects_12),\"\",dms_E13_Projects_12)","v":""}]
[null,{"$f":"IF(ISBLANK(dms_E13_Projects_13),\"\",dms_E13_Projects_13)","v":""}]
[null,{"$f":"IF(ISBLANK(dms_E13_Projects_14),\"\",dms_E13_Projects_14)","v":""}]
[null,{"$f":"IF(ISBLANK(dms_E13_Projects_15),\"\",dms_E13_Projects_15)","v":""}]
[null,"Aggregate of other projects with total expenditure of less than $500,000"]
[null,"Total",{"$f":"SUM(C47:C62)","v":5909980.6233705943},{"$f":"SUM(D47:D62)","v":2123545.771133319},4882005.1449252767,5621872.5114352768,6123908.0901642768,4647702.3247592775,4135433.4386732769]
[]
[null,"C. DIRECT MATERIAL EXPENDITURE"]
[null,{"$f":"IF(ISBLANK(dms_E13_Projects_01),\"\",dms_E13_Projects_01)","v":"Network Regulators - planned"},318481.28539717465,341820,1373610,1114080,955830,1025459.9999999999,1202700]
[null,{"$f":"IF(ISBLANK(dms_E13_Projects_02),\"\",dms_E13_Projects_02)","v":"Network Regulators - ad hoc"},63696.257079434923,31649.999999999996,63299.999999999993,63299.999999999993,63299.999999999993,63299.999999999993,63299.999999999993]
[null,{"$f":"IF(ISBLANK(dms_E13_Projects_03),\"\",dms_E13_Projects_03)","v":"Customer Regulators - planned"},0,350682,727934.17499999993,636513.14999999991,452120.25,415596.14999999997,441058.57499999995]
[null,{"$f":"IF(ISBLANK(dms_E13_Projects_04),\"\",dms_E13_Projects_04)","v":"Customer Regulators - ad hoc"},0,554254.79999999993,1108509.5999999999,1108509.5999999999,1108509.5999999999,1108509.5999999999,1108509.5999999999]
[null,{"$f":"IF(ISBLANK(dms_E13_Projects_05),\"\",dms_E13_Projects_05)","v":"Cathodic Protection"},42728.180097841338,40511.999999999993,81023.999999999985,85243.999999999985,82500.999999999985,82500.999999999985,82500.999999999985]
[null,{"$f":"IF(ISBLANK(dms_E13_Projects_06),\"\",dms_E13_Projects_06)","v":"Other Non-demand"},0,0,114805.09999999996,354333.35499999992,537079.39999999979,150956.15199999994,25.31999999999999]
[null,{"$f":"IF(ISBLANK(dms_E13_Projects_07),\"\",dms_E13_Projects_07)","v":"Major Alterations"},402454.8799427484,662909.09807999979,1250669.9722399996,1277257.3648399997,1303206.3853799996,1281054.9090799999,1258070.5187199996]
[null,{"$f":"IF(ISBLANK(dms_E13_Projects_08),\"\",dms_E13_Projects_08)","v":"City Gate Security Fence Upgrades "},0,0,234210,234210,234210,234210,208890]
[null,{"$f":"IF(ISBLANK(dms_E13_Projects_09),\"\",dms_E13_Projects_09)","v":"Other non-IT"},350476.38531415747,244816.57068234473,979266.2827293789,979266.2827293789,979266.2827293789,979266.2827293789,979266.2827293789]
[null,{"$f":"IF(ISBLANK(dms_E13_Projects_10),\"\",dms_E13_Projects_10)","v":"Extensions"},3471589.874010473,178506,0,0,0,0,0]
[null,{"$f":"IF(ISBLANK(dms_E13_Projects_11),\"\",dms_E13_Projects_11)","v":""}]
[null,{"$f":"IF(ISBLANK(dms_E13_Projects_12),\"\",dms_E13_Projects_12)","v":""}]
[null,{"$f":"IF(ISBLANK(dms_E13_Projects_13),\"\",dms_E13_Projects_13)","v":""}]
[null,{"$f":"IF(ISBLANK(dms_E13_Projects_14),\"\",dms_E13_Projects_14)","v":""}]
[null,{"$f":"IF(ISBLANK(dms_E13_Projects_15),\"\",dms_E13_Projects_15)","v":""}]
[null,"Aggregate of other projects with total expenditure of less than $500,000"]
[null,"Total",{"$f":"SUM(C66:C81)","v":4649426.8618418295},{"$f":"SUM(D66:D81)","v":2405150.4687623447},5933329.129969378,5852713.7525693784,5716022.9181093778,5340854.0938093783,5344321.2964493781]
[]
[null,"D. OTHER DIRECT EXPENDITURE"]
[null,{"$f":"IF(ISBLANK(dms_E13_Projects_01),\"\",dms_E13_Projects_01)","v":"Network Regulators - planned"},0,null,0,0,0,0,0]
[null,{"$f":"IF(ISBLANK(dms_E13_Projects_02),\"\",dms_E13_Projects_02)","v":"Network Regulators - ad hoc"},0,null,0,0,0,0,0]
[null,{"$f":"IF(ISBLANK(dms_E13_Projects_03),\"\",dms_E13_Projects_03)","v":"Customer Regulators - planned"},0,null,0,0,0,0,0]
[null,{"$f":"IF(ISBLANK(dms_E13_Projects_04),\"\",dms_E13_Projects_04)","v":"Customer Regulators - ad hoc"},0,null,0,0,0,0,0]
[null,{"$f":"IF(ISBLANK(dms_E13_Projects_05),\"\",dms_E13_Projects_05)","v":"Cathodic Protection"},0,null,0,0,0,0,0]
[null,{"$f":"IF(ISBLANK(dms_E13_Projects_06),\"\",dms_E13_Projects_06)","v":"Other Non-demand"},0,null,0,0,0,0,0]
[null,{"$f":"IF(ISBLANK(dms_E13_Projects_07),\"\",dms_E13_Projects_07)","v":"Major Alterations"},0,null,0,0,0,0,0]
[null,{"$f":"IF(ISBLANK(dms_E13_Projects_08),\"\",dms_E13_Projects_08)","v":"City Gate Security Fence Upgrades "},0,null,0,0,0,0,0]
[null,{"$f":"IF(ISBLANK(dms_E13_Projects_09),\"\",dms_E13_Projects_09)","v":"Other non-IT"},0,null,0,0,0,0,0]
[null,{"$f":"IF(ISBLANK(dms_E13_Projects_10),\"\",dms_E13_Projects_10)","v":"Extensions"},0]
[null,{"$f":"IF(ISBLANK(dms_E13_Projects_11),\"\",dms_E13_Projects_11)","v":""}]
[null,{"$f":"IF(ISBLANK(dms_E13_Projects_12),\"\",dms_E13_Projects_12)","v":""}]
[null,{"$f":"IF(ISBLANK(dms_E13_Projects_13),\"\",dms_E13_Projects_13)","v":""}]
[null,{"$f":"IF(ISBLANK(dms_E13_Projects_14),\"\",dms_E13_Projects_14)","v":""}]
[null,{"$f":"IF(ISBLANK(dms_E13_Projects_15),\"\",dms_E13_Projects_15)","v":""}]
[null,"Aggregate of other projects with total expenditure of less than $500,000"]
[null,"Total",{"$f":"SUM(C85:C100)","v":0},{"$f":"SUM(D85:D100)","v":0},0,0,0,0,0]
[]
[null,"E. RELATED PARTY MARGIN EXPENDITURE"]
[null,{"$f":"IF(ISBLANK(dms_E13_Projects_01),\"\",dms_E13_Projects_01)","v":"Network Regulators - planned"},0,null,0,0,0,0,0]
[null,{"$f":"IF(ISBLANK(dms_E13_Projects_02),\"\",dms_E13_Projects_02)","v":"Network Regulators - ad hoc"},0,null,0,0,0,0,0]
[null,{"$f":"IF(ISBLANK(dms_E13_Projects_03),\"\",dms_E13_Projects_03)","v":"Customer Regulators - planned"},0,null,0,0,0,0,0]
[null,{"$f":"IF(ISBLANK(dms_E13_Projects_04),\"\",dms_E13_Projects_04)","v":"Customer Regulators - ad hoc"},0,null,0,0,0,0,0]
[null,{"$f":"IF(ISBLANK(dms_E13_Projects_05),\"\",dms_E13_Projects_05)","v":"Cathodic Protection"},0,null,0,0,0,0,0]
[null,{"$f":"IF(ISBLANK(dms_E13_Projects_06),\"\",dms_E13_Projects_06)","v":"Other Non-demand"},0,null,0,0,0,0,0]
[null,{"$f":"IF(ISBLANK(dms_E13_Projects_07),\"\",dms_E13_Projects_07)","v":"Major Alterations"},0,null,0,0,0,0,0]
[null,{"$f":"IF(ISBLANK(dms_E13_Projects_08),\"\",dms_E13_Projects_08)","v":"City Gate Security Fence Upgrades "},0,null,0,0,0,0,0]
[null,{"$f":"IF(ISBLANK(dms_E13_Projects_09),\"\",dms_E13_Projects_09)","v":"Other non-IT"},0,null,0,0,0,0,0]
[null,{"$f":"IF(ISBLANK(dms_E13_Projects_10),\"\",dms_E13_Projects_10)","v":"Extensions"},0]
[null,{"$f":"IF(ISBLANK(dms_E13_Projects_11),\"\",dms_E13_Projects_11)","v":""}]
[null,{"$f":"IF(ISBLANK(dms_E13_Projects_12),\"\",dms_E13_Projects_12)","v":""}]
[null,{"$f":"IF(ISBLANK(dms_E13_Projects_13),\"\",dms_E13_Projects_13)","v":""}]
[null,{"$f":"IF(ISBLANK(dms_E13_Projects_14),\"\",dms_E13_Projects_14)","v":""}]
[null,{"$f":"IF(ISBLANK(dms_E13_Projects_15),\"\",dms_E13_Projects_15)","v":""}]
[null,"Aggregate of other projects with total expenditure of less than $500,000"]
[null,"Total",{"$f":"SUM(C104:C119)","v":0},{"$f":"SUM(D104:D119)","v":0},0,0,0,0,0]
[]
[null,"F. CAPITAL CONTRIBUTIONS included in the above"]
[null,{"$f":"IF(ISBLANK(dms_E13_Projects_01),\"\",dms_E13_Projects_01)","v":"Network Regulators - planned"},0,null,0,0,0,0,0]
[null,{"$f":"IF(ISBLANK(dms_E13_Projects_02),\"\",dms_E13_Projects_02)","v":"Network Regulators - ad hoc"},0,null,0,0,0,0,0]
[null,{"$f":"IF(ISBLANK(dms_E13_Projects_03),\"\",dms_E13_Projects_03)","v":"Customer Regulators - planned"},0,null,0,0,0,0,0]
[null,{"$f":"IF(ISBLANK(dms_E13_Projects_04),\"\",dms_E13_Projects_04)","v":"Customer Regulators - ad hoc"},0,null,0,0,0,0,0]
[null,{"$f":"IF(ISBLANK(dms_E13_Projects_05),\"\",dms_E13_Projects_05)","v":"Cathodic Protection"},0,null,0,0,0,0,0]
[null,{"$f":"IF(ISBLANK(dms_E13_Projects_06),\"\",dms_E13_Projects_06)","v":"Other Non-demand"},0,null,0,0,0,0,0]
[null,{"$f":"IF(ISBLANK(dms_E13_Projects_07),\"\",dms_E13_Projects_07)","v":"Major Alterations"},0,747953.76982567739,1495907.5396513548,1495907.5396513548,1495907.5396513548,1495907.5396513548,1495907.5396513548]
[null,{"$f":"IF(ISBLANK(dms_E13_Projects_08),\"\",dms_E13_Projects_08)","v":"City Gate Security Fence Upgrades "},0,null,0,0,0,0,0]
[null,{"$f":"IF(ISBLANK(dms_E13_Projects_09),\"\",dms_E13_Projects_09)","v":"Other non-IT"},0,null,0,0,0,0,0]
[null,{"$f":"IF(ISBLANK(dms_E13_Projects_10),\"\",dms_E13_Projects_10)","v":"Extensions"},15719861.003814049,1290969.74]
[null,{"$f":"IF(ISBLANK(dms_E13_Projects_11),\"\",dms_E13_Projects_11)","v":""}]
[null,{"$f":"IF(ISBLANK(dms_E13_Projects_12),\"\",dms_E13_Projects_12)","v":""}]
[null,{"$f":"IF(ISBLANK(dms_E13_Projects_13),\"\",dms_E13_Projects_13)","v":""}]
[null,{"$f":"IF(ISBLANK(dms_E13_Projects_14),\"\",dms_E13_Projects_14)","v":""}]
[null,{"$f":"IF(ISBLANK(dms_E13_Projects_15),\"\",dms_E13_Projects_15)","v":""}]
[null,"Aggregate of other projects with total expenditure of less than $500,000"]
[null,"Total",{"$f":"SUM(C123:C138)","v":15719861.003814049},{"$f":"SUM(D123:D138)","v":2038923.5098256774},1495907.5396513548,1495907.5396513548,1495907.5396513548,1495907.5396513548,1495907.5396513548]

{"sheet":"E17. Step changes","index":16,"n_rows":70,"n_cols":10,"rows_kept":70,"cut":false,"hidden":false,"merged":[[69,1,69,2],[36,1,36,2],[20,1,20,2]]}
[null,{"$f":"INDEX(dms_Worksheet_List,MATCH(dms_Model,dms_Model_List))","v":"REGULATORY REPORTING STATEMENT"}]
[null,{"$f":"dms_TradingName","v":"AusNet (Gas)"}]
[null,{"$f":"dms_Header_Span","v":"2021-22 to 2027-28"}]
[null,"E17. STEP CHANGES"]
[]
[null,"E17.1 - STEP CHANGES FOR REFERENCE SERVICES"]
[null,"E17.1.1 - FORECAST OPEX"]
[null,null,null,"EXPENDITURE"]
[null,null,null,{"$f":"CONCATENATE(\"$0's, real \",dms_DollarReal)","v":"$0's, real June 2023"}]
[null,"Step change","Description",{"$f":"VLOOKUP(CRCP_y4,'AER lookups'!$B$52:$C$101,2,0)","v":2022},{"$f":"CONCATENATE(\"1 Jan-30 Jun \"&(D10+1))","v":"1 Jan-30 Jun 2023"},{"$f":"FRCP_y1","v":"2023-24"},{"$f":"FRCP_y2","v":"2024-25"},{"$f":"FRCP_y3","v":"2025-26"},{"$f":"FRCP_y4","v":"2026-27"},{"$f":"FRCP_y5","v":"2027-28"}]
[null,"SaaS and IT cloud",null,0,0,4309582.8146509947,5074810.0413504941,1848597.8047442106,362051.13159281766,-50235.641891100968]
[null,"EPA",null,0,0,-1288.1639265823248,352941.42816294543,340388.33498644124,429617.76335641206,306817.30516639113]
[]
[]
[]
[]
[]
[]
[]
[]
[null,"Total",null,{"$f":"SUM(D11:D20)","v":0},0,4308294.6507244119,5427751.4695134396,2188986.1397306519,791668.89494922967,256581.66327529016]
[]
[null,"E17.1.2 - FORECAST CAPEX"]
[null,null,null,"EXPENDITURE"]
[null,null,null,{"$f":"CONCATENATE(\"$0's, real \", dms_DollarReal)","v":"$0's, real June 2023"}]
[null,"Step change","Description",{"$f":"VLOOKUP(CRCP_y4,'AER lookups'!$B$52:$C$101,2,0)","v":2022},{"$f":"CONCATENATE(\"1 Jan-30 Jun \"&(D26+1))","v":"1 Jan-30 Jun 2023"},{"$f":"FRCP_y1","v":"2023-24"},{"$f":"FRCP_y2","v":"2024-25"},{"$f":"FRCP_y3","v":"2025-26"},{"$f":"FRCP_y4","v":"2026-27"},{"$f":"FRCP_y5","v":"2027-28"}]
[null,"SaaS and IT cloud",null,0,0,-5706093.0898392154,-6533296.9548205687,-3572848.1518843556,-2253321.3311182144,-1956003.2084151283]
[]
[]
[]
[]
[]
[]
[]
[]
[]
[null,"Total",null,{"$f":"SUM(D27:D36)","v":0},0,-5706093.0898392154,-6533296.9548205687,-3572848.1518843556,-2253321.3311182144,-1956003.2084151283]
[]
[]
[]
[null,"E17.2 - CATEGORY SPECIFIC FORECASTS"]
[null,null,null,"EXPENDITURE"]
[null,null,null,{"$f":"CONCATENATE(\"$0's, real \",dms_DollarReal)","v":"$0's, real June 2023"}]
[null,"Category desription",null,{"$f":"VLOOKUP(CRCP_y4,'AER lookups'!$B$52:$C$101,2,0)","v":2022},{"$f":"CONCATENATE(\"1 Jan-30 Jun \"&(D44+1))","v":"1 Jan-30 Jun 2023"},{"$f":"FRCP_y1","v":"2023-24"},{"$f":"FRCP_y2","v":"2024-25"},{"$f":"FRCP_y3","v":"2025-26"},{"$f":"FRCP_y4","v":"2026-27"},{"$f":"FRCP_y5","v":"2027-28"}]
[null,"Priority Services Program",null,0,0,1613728.557,895779.50699999998,619645.25699999998,619645.25699999998,619645.25699999998]
[null,"Debt raising cost",null,906108.31269827008,452802.95057543082,904602.19173077296,906591.0196789921,910625.11351076083,910278.8500786589,900598.46613184817]
[]
[]
[]
[]
[]
[]
[]
[]
[]
[]
[]
[]
[]
[]
[]
[]
[]
[]
[]
[]
[]
[]
[]
[null,"Total",null,{"$f":"SUM(D45:D69)","v":906108.31269827008},452802.95057543082,{"$f":"SUM(F45:F69)","v":2518330.7487307731},1802370.526678992,1530270.3705107607,1529924.1070786589,1520243.723131848]

{"sheet":"E20. Opex","index":17,"n_rows":131,"n_cols":12,"rows_kept":131,"cut":false,"hidden":false,"merged":[[6,1,6,3],[7,1,7,2],[7,3,8,3],[8,1,8,2],[9,1,9,2]]}
[null,{"$f":"INDEX(dms_Worksheet_List,MATCH(dms_Model,dms_Model_List))","v":"REGULATORY REPORTING STATEMENT"}]
[null,{"$f":"dms_TradingName","v":"AusNet (Gas)"}]
[null,{"$f":"dms_Header_Span","v":"2021-22 to 2027-28"}]
[null,"E20. OPERATING EXPENDITURE"]
[]
[]
[null,"IMPORTANT!"]
[null,{"$f":"CONCATENATE(\"Has \",dms_TradingName,\" used a base-step-trend model to derive its opex forecast? \")","v":"Has AusNet (Gas) used a base-step-trend model to derive its opex forecast? "},null,"Yes"]
[null,"Yes /  No"]
[null,"Please nominate the base year",null,2021]
[null,null,null,null,"2015-16","2016-17","2017-18","2018-19","2019-20"]
[null,"E20.1 - OPEX - BY DRIVER"]
[null,"E20.1.1 - REFERENCE SERVICES  "]
[null,null,"EXPENDITURE"]
[null,null,{"$f":"CONCATENATE(\"$0's, real \",dms_DollarReal)","v":"$0's, real June 2023"}]
[null,null,{"$f":"VLOOKUP(CRCP_y1,'AER lookups'!$B$52:$C$101,2,0)","v":2019},{"$f":"VLOOKUP(CRCP_y2,'AER lookups'!$B$52:$C$101,2,0)","v":2020},{"$f":"VLOOKUP(CRCP_y3,'AER lookups'!$B$52:$C$101,2,0)","v":2021},{"$f":"VLOOKUP(CRCP_y4,'AER lookups'!$B$52:$C$101,2,0)","v":2022},{"$f":"CONCATENATE(\"1 Jan-30 Jun \"&(F16+1))","v":"1 Jan-30 Jun 2023"},{"$f":"FRCP_y1","v":"2023-24"},{"$f":"FRCP_y2","v":"2024-25"},{"$f":"FRCP_y3","v":"2025-26"},{"$f":"FRCP_y4","v":"2026-27"},{"$f":"FRCP_y5","v":"2027-28"}]
[null,"Base year total opex, excluding category specific",null,null,57922749.546187744,51895265.461380012,30191112.947084561,52937458.870673276,52937458.870673276,52937458.870673276,52937458.870673276,52937458.870673276]
[null,"Increment from base year to final year",null,null,null,null,22746345.923588715]
[null,"Price growth",null,null,null,null,null,203349.46740029473,578457.31611369539,967208.62822317577,839190.64448456198,909521.5620471685]
[null,"Output growth",null,null,null,null,null,1165806.4040327989,2276715.1615310642,3453215.4135055775,5106472.6349576004,6486869.5938039497]
[null,"Productivity growth",null,null,null,null,null,-211564.64403186867,-411343.02158448915,-621699.38447966042,-940424.08851512789,-1221676.9306334725]
[null,"Step changes",null,null,null,null,null,4308294.6507244119,5427751.4695134396,2188986.1397306519,791668.89494922967,256581.66327529014]
[null,"Category specific",null,null,null,{"$f":"IF(ISBLANK('E17. Step changes'!D70),\"\",'E17. Step changes'!D70)","v":906108.31269827008},{"$f":"IF(ISBLANK('E17. Step changes'!E70),\"\",'E17. Step changes'!E70)","v":452802.95057543082},{"$f":"IF(ISBLANK('E17. Step changes'!F70),\"\",'E17. Step changes'!F70)","v":2518330.7487307731},{"$f":"IF(ISBLANK('E17. Step changes'!G70),\"\",'E17. Step changes'!G70)","v":1802370.526678992},{"$f":"IF(ISBLANK('E17. Step changes'!H70),\"\",'E17. Step changes'!H70)","v":1530270.3705107607},{"$f":"IF(ISBLANK('E17. Step changes'!I70),\"\",'E17. Step changes'!I70)","v":1529924.1070786589},{"$f":"IF(ISBLANK('E17. Step changes'!J70),\"\",'E17. Step changes'!J70)","v":1520243.723131848}]
[]
[null,"E20.1.2 - NON-REFERENCE SERVICES  "]
[null,null,"EXPENDITURE"]
[null,null,{"$f":"CONCATENATE(\"$0's, real \",dms_DollarReal)","v":"$0's, real June 2023"}]
[null,null,{"$f":"VLOOKUP(CRCP_y1,'AER lookups'!$B$52:$C$101,2,0)","v":2019},{"$f":"VLOOKUP(CRCP_y2,'AER lookups'!$B$52:$C$101,2,0)","v":2020},{"$f":"VLOOKUP(CRCP_y3,'AER lookups'!$B$52:$C$101,2,0)","v":2021},{"$f":"VLOOKUP(CRCP_y4,'AER lookups'!$B$52:$C$101,2,0)","v":2022},{"$f":"CONCATENATE(\"1 Jan-30 Jun \"&(F28+1))","v":"1 Jan-30 Jun 2023"},{"$f":"FRCP_y1","v":"2023-24"},{"$f":"FRCP_y2","v":"2024-25"},{"$f":"FRCP_y3","v":"2025-26"},{"$f":"FRCP_y4","v":"2026-27"},{"$f":"FRCP_y5","v":"2027-28"}]
[null,"Base year total opex, excluding category specific",null,null,0,0,0,0,0,0,0,0]
[null,"Increment from base year to final year",null,null,null,null,0]
[null,"Price growth",null,null,null,null,null,0,0,0,0,0]
[null,"Output growth",null,null,null,null,null,0,0,0,0,0]
[null,"Productivity growth",null,null,null,null,null,0,0,0,0,0]
[null,"Step changes",null,null,null,null,null,0,0,0,0,0]
[null,"Category specific"]
[]
[]
[]
[null,"E20.2 - OPEX - BY CATEGORY"]
[null,"E20.2.1 - REFERENCE SERVICES"]
[null,null,"EXPENDITURE"]
[null,null,{"$f":"CONCATENATE(\"$0's, real \",dms_DollarReal)","v":"$0's, real June 2023"}]
[null,null,null,null,null,{"$f":"VLOOKUP(CRCP_y4,'AER lookups'!$B$52:$C$101,2,0)","v":2022},{"$f":"CONCATENATE(\"1 Jan-30 Jun \"&(F43+1))","v":"1 Jan-30 Jun 2023"},{"$f":"FRCP_y1","v":"2023-24"},{"$f":"FRCP_y2","v":"2024-25"},{"$f":"FRCP_y3","v":"2025-26"},{"$f":"FRCP_y4","v":"2026-27"},{"$f":"FRCP_y5","v":"2027-28"}]
[null,"repairs and maintenance"]
[null,"marketing and retail incentives"]
[null,"debt raising"]
[null,"equity raising"]
[null,"unaccounted for gas"]
[null,"jurisdictional charges"]
[null,"GSL payments"]
[null,"other opex"]
[null,"TOTAL",null,null,null,{"$f":"SUM(F44:F51)","v":0},0,0,0,0,0,0]
[]
[null,"E20.2.2 - NON-REFERENCE SERVICES"]
[null,null,"EXPENDITURE"]
[null,null,{"$f":"CONCATENATE(\"$0's, real \",dms_DollarReal)","v":"$0's, real June 2023"}]
[null,null,null,null,null,{"$f":"VLOOKUP(CRCP_y4,'AER lookups'!$B$52:$C$101,2,0)","v":2022},{"$f":"CONCATENATE(\"1 Jan-30 Jun \"&(F57+1))","v":"1 Jan-30 Jun 2023"},{"$f":"FRCP_y1","v":"2023-24"},{"$f":"FRCP_y2","v":"2024-25"},{"$f":"FRCP_y3","v":"2025-26"},{"$f":"FRCP_y4","v":"2026-27"},{"$f":"FRCP_y5","v":"2027-28"}]
[]
[]
[]
[]
[]
[]
[]
[]
[]
[]
[]
[]
[]
[]
[]
[]
[]
[]
[]
[]
[]
[]
[]
[]
[]
[null,"TOTAL",null,null,null,{"$f":"SUM(F58:F82)","v":0},{"$f":"SUM(G58:G82)","v":0},0,0,0,0,0]
[]
[]
[]
[null,"E20.3 - OPEX - BY CATEGORY - RELATED PARTY MARGIN EXPENDITURE"]
[null,"20.3.1 - REFERENCE SERVICES"]
[null,null,"EXPENDITURE"]
[null,null,{"$f":"CONCATENATE(\"$0's, real \",dms_DollarReal)","v":"$0's, real June 2023"}]
[null,null,null,null,null,{"$f":"VLOOKUP(CRCP_y4,'AER lookups'!$B$52:$C$101,2,0)","v":2022},{"$f":"CONCATENATE(\"1 Jan-30 Jun \"&(F91+1))","v":"1 Jan-30 Jun 2023"},{"$f":"FRCP_y1","v":"2023-24"},{"$f":"FRCP_y2","v":"2024-25"},{"$f":"FRCP_y3","v":"2025-26"},{"$f":"FRCP_y4","v":"2026-27"},{"$f":"FRCP_y5","v":"2027-28"}]
[null,"repairs and maintenance"]
[null,"marketing and retail incentives"]
[null,"debt raising"]
[null,"equity raising"]
[null,"unaccounted for gas"]
[null,"jurisdictional charges"]
[null,"GSL payments"]
[null,"other opex"]
[null,"TOTAL",null,null,null,{"$f":"SUM(F92:F99)","v":0},0,0,0,0,0,0]
[]
[null,"20.3.2 - NON-REFERENCE SERVICES"]
[null,null,"EXPENDITURE"]
[null,null,{"$f":"CONCATENATE(\"$0's, real \",dms_DollarReal)","v":"$0's, real June 2023"}]
[null,null,null,null,null,{"$f":"VLOOKUP(CRCP_y4,'AER lookups'!$B$52:$C$101,2,0)","v":2022},{"$f":"CONCATENATE(\"1 Jan-30 Jun \"&(F105+1))","v":"1 Jan-30 Jun 2023"},{"$f":"FRCP_y1","v":"2023-24"},{"$f":"FRCP_y2","v":"2024-25"},{"$f":"FRCP_y3","v":"2025-26"},{"$f":"FRCP_y4","v":"2026-27"},{"$f":"FRCP_y5","v":"2027-28"}]
[null,{"$f":"IF(ISBLANK(B58),\"\",B58)","v":""}]
[null,""]
[null,""]
[null,""]
[null,""]
[null,""]
[null,""]
[null,""]
[null,""]
[null,""]
[null,""]
[null,""]
[null,""]
[null,""]
[null,""]
[null,""]
[null,""]
[null,""]
[null,""]
[null,""]
[null,""]
[null,""]
[null,""]
[null,""]
[null,""]
[null,"TOTAL",null,null,null,{"$f":"SUM(F106:F130)","v":0},{"$f":"SUM(G106:G130)","v":0},0,0,0,0,0]

{"sheet":"E21. ARS","index":18,"n_rows":32,"n_cols":9,"rows_kept":32,"cut":false,"hidden":false,"merged":[]}
[null,{"$f":"INDEX(dms_Worksheet_List,MATCH(dms_Model,dms_Model_List))","v":"REGULATORY REPORTING STATEMENT"}]
[null,{"$f":"dms_TradingName","v":"AusNet (Gas)"}]
[null,{"$f":"dms_Header_Span","v":"2021-22 to 2027-28"}]
[null,"E21. ANCILLARY REFERENCE SERVICES"]
[]
[null,"E21.1 - VOLUMES"]
[null,null,"VOLUME"]
[null,null,"0's"]
[null,"Description",{"$f":"VLOOKUP(CRCP_y4,'AER lookups'!$B$52:$C$101,2,0)","v":2022},{"$f":"CONCATENATE(\"1 Jan-30 Jun \"&(C9+1))","v":"1 Jan-30 Jun 2023"},{"$f":"FRCP_y1","v":"2023-24"},{"$f":"FRCP_y2","v":"2024-25"},{"$f":"FRCP_y3","v":"2025-26"},{"$f":"FRCP_y4","v":"2026-27"},{"$f":"FRCP_y5","v":"2027-28"}]
[null,"Meter and Gas installation test",154.25,77.125,154.25,154.25,154.25,154.25,154.25]
[null,"Disconnection - locks and plugs at the meter installation",6682,3341,6682,6682,6682,6682,6682]
[null,"Reconnection - following insertion of locks and plugs at the meter installation",2267.25,1133.625,2267.25,2267.25,2267.25,2267.25,2267.25]
[null,"Special read",250585.8,126601.48890517511,258714.67831031009,264403.76936609141,270265.15083913069,275950.89027664508,281455.46364998718]
[null,"Meter Fix or Meter Reinstallation (New)",0,0,19793.25,19793.25,19793.25,19793.25,19793.25]
[null,"Meter and Service Removal (New)",0,0,2136.75,2136.75,2136.75,2136.75,2136.75]
[null,"Minor Meter Alter Position (New)",0,0,294,294,294,294,294]
[null,"Total",{"$f":"SUM(C10:C16)","v":259689.3},{"$f":"SUM(D10:D16)","v":131153.23890517512},{"$f":"SUM(E10:E16)","v":290042.17831031012},295731.26936609141,301592.65083913069,307278.39027664508,312782.96364998718]
[]
[null,"E21.2 - omitted"]
[]
[null,"E21.3 - EXPENDITURE"]
[null,null,"EXPENDITURE"]
[null,null,{"$f":"CONCATENATE(\"$0's, real \",dms_DollarReal)","v":"$0's, real June 2023"}]
[null,null,{"$f":"VLOOKUP(CRCP_y4,'AER lookups'!$B$52:$C$101,2,0)","v":2022},{"$f":"CONCATENATE(\"1 Jan-30 Jun \"&(C24+1))","v":"1 Jan-30 Jun 2023"},{"$f":"FRCP_y1","v":"2023-24"},{"$f":"FRCP_y2","v":"2024-25"},{"$f":"FRCP_y3","v":"2025-26"},{"$f":"FRCP_y4","v":"2026-27"},{"$f":"FRCP_y5","v":"2027-28"}]
[null,{"$f":"IF(ISBLANK(B10),\"\",B10)","v":"Meter and Gas installation test"},30603.709025,15301.8545125,30603.709025,30603.709025,30603.709025,30603.709025,30603.709025]
[null,"Disconnection - locks and plugs at the meter installation",441863.28679999994,220931.64339999997,441863.28679999994,441863.28679999994,441863.28679999994,441863.28679999994,441863.28679999994]
[null,"Reconnection - following insertion of locks and plugs at the meter installation",149927.34764999998,74963.673824999991,149927.34764999998,149927.34764999998,149927.34764999998,149927.34764999998,149927.34764999998]
[null,"Special read",2569657.1446799999,1298247.6281270087,1733424.9047525236,1763493.0183456535,1794395.9971034061,1823820.8724881259,1851749.3700880243]
[null,"Meter Fix or Meter Reinstallation (New)",0,0,2679688.0486687892,2693541.5697740684,2707466.7111737728,2721463.8431323678,2735533.3378285202]
[null,"Meter and Service Removal (New)",0,0,1686967.9962936745,1695689.3274024185,1704455.7462760019,1713267.4860103261,1722124.7809063583]
[null,"Minor Meter Alter Position (New)",0,0,282677.84806315386,284139.24336850783,285608.19383339467,287084.7385166749,288568.9166791368]
[null,"Total",5358329.3507664893,2692583.7311702529,{"$f":"SUM(E25:E31)","v":7005153.1412531408},7059257.5023656487,7114320.9918615753,7168031.2836224949,7220370.748977039]

{"sheet":"E25. Escalators","index":19,"n_rows":19,"n_cols":9,"rows_kept":19,"cut":false,"hidden":false,"merged":[[6,1,7,1]]}
[null,{"$f":"INDEX(dms_Worksheet_List,MATCH(dms_Model,dms_Model_List))","v":"REGULATORY REPORTING STATEMENT"}]
[null,{"$f":"dms_TradingName","v":"AusNet (Gas)"}]
[null,{"$f":"dms_Header_Span","v":"2021-22 to 2027-28"}]
[null,"E25. ESCALATORS"]
[]
[null,"E25.1 - FORECAST CAPEX AND OPEX PRICE CHANGES"]
[null,null,"Price changes (% YoY real)"]
[null,null,{"$f":"VLOOKUP(CRCP_y4,'AER lookups'!$B$52:$C$101,2,0)","v":2022},{"$f":"CONCATENATE(\"1 Jan-30 Jun \"&(C8+1))","v":"1 Jan-30 Jun 2023"},{"$f":"FRCP_y1","v":"2023-24"},{"$f":"FRCP_y2","v":"2024-25"},{"$f":"FRCP_y3","v":"2025-26"},{"$f":"FRCP_y4","v":"2026-27"},{"$f":"FRCP_y5","v":"2027-28"}]
[null,"E25.1.1 - OPEX"]
[null,"Labour (real)",1.4324488734929966E-2,1.0724243795141808E-2,6.201093068963907E-3,9.0726777622941717E-3,1.0037094810989189E-2,5.7571187896426233E-3,4.8031364907766159E-3]
[null,"Materials (real)",0,0,0,0,0,0,0]
[]
[]
[]
[]
[null,"E25.1.2 - CAPEX"]
[null,"Labour - Internal",0,5.1959235721351802E-3,5.0082281974948998E-3,7.7973450064545502E-3,1.10084481771037E-2,1.10084481771037E-2,1.10084481771037E-2]
[null,"Labout - External",0,0,0,0,0,0,0]
[null,"Materials",0,0,0,0,0,0,0]

{"sheet":"N1. Demand","index":20,"n_rows":96,"n_cols":9,"rows_kept":96,"cut":false,"hidden":false,"merged":[]}
[null,{"$f":"INDEX(dms_Worksheet_List,MATCH(dms_Model,dms_Model_List))","v":"REGULATORY REPORTING STATEMENT"}]
[null,{"$f":"dms_TradingName","v":"AusNet (Gas)"}]
[null,{"$f":"dms_Header_Span","v":"2021-22 to 2027-28"}]
[null,"N1. DEMAND"]
[]
[null,"N1.1 - DEMAND - BY CUSTOMER TYPE"]
[null,null,"VOLUME"]
[null,null,"GJ"]
[null,null,{"$f":"VLOOKUP(CRCP_y4,'AER lookups'!$B$52:$C$101,2,0)","v":2022},{"$f":"CONCATENATE(\"1 Jan-30 Jun \"&(C9+1))","v":"1 Jan-30 Jun 2023"},{"$f":"FRCP_y1","v":"2023-24"},{"$f":"FRCP_y2","v":"2024-25"},{"$f":"FRCP_y3","v":"2025-26"},{"$f":"FRCP_y4","v":"2026-27"},{"$f":"FRCP_y5","v":"2027-28"}]
[null,"Residential",{"$f":"SUM(C21,C23,C25,C27)","v":31708822.429773424},{"$f":"SUM(D21,D23,D25,D27)","v":12539510.834329322},31255312.316056099,31135197.114078853,31298330.504176348,31746711.929648921,32283972.952542555]
[null,"Commercial",{"$f":"SUM(C22,C24,C26,C28)","v":6104918.2925856737},2942804.8786398186,6261663.6148024118,6180197.9367408892,6156615.8166677495,6188099.3859273056,6237212.1026167329]
[null,"Industrial","n/a","n/a","n/a","n/a","n/a","n/a","n/a"]
[null,"Total",{"$f":"SUM(C10:C12)","v":37813740.722359098},15482315.712969141,37516975.930858508,37315395.05081974,37454946.320844099,37934811.315576226,38521185.055159286]
[]
[]
[]
[null,"N1.2 - DEMAND - BY TARIFF"]
[null,null,"VOLUMES"]
[null,null,"GJ"]
[null,"Tariff",{"$f":"VLOOKUP(CRCP_y4,'AER lookups'!$B$52:$C$101,2,0)","v":2022},{"$f":"CONCATENATE(\"1 Jan-30 Jun \"&(C20+1))","v":"1 Jan-30 Jun 2023"},{"$f":"FRCP_y1","v":"2023-24"},{"$f":"FRCP_y2","v":"2024-25"},{"$f":"FRCP_y3","v":"2025-26"},{"$f":"FRCP_y4","v":"2026-27"},{"$f":"FRCP_y5","v":"2027-28"}]
[null,"Tariff V Central Domestic",24263459.713744033,9620704.1049700882,23965943.752913348,23906012.706082243,24062694.881623454,24435483.586057324,24875370.22373566]
[null,"Tariff V Central Non-Domestic",4413144.5667557949,2146111.8181104735,4531957.2885527965,4476913.0107401032,4463803.0782414898,4490325.5691430019,4529526.5178495506]
[null,"Tariff V West Domestic",6777210.6864883862,2652853.3840769697,6613543.8226422053,6543081.1685763914,6533438.9546061354,6586822.5931727206,6660053.3021604242]
[null,"Tariff V West Non-Domestic",1591429.1454643658,747691.73303692485,1626667.5358995157,1601360.926025714,1591049.5183351464,1595268.1153769554,1604147.3726281933]
[null,"Tariff V Adjoining Central Domestic",73681.303675118514,30588.66683054197,77663.241221359771,80918.207298715439,84809.654076548919,89363.698874312977,94133.489548182508]
[null,"Tariff V Adjoining Central Non-Domestic",3607.5854702299657,1911.6385164516394,3788.1830389322845,3822.2625716247685,3891.1577841367944,3991.2881217305403,4101.749099155496]
[null,"Tariff V Adjoining West Domestic",594470.72586588538,235364.67845172295,598161.49927918392,605185.03212150314,617387.01387020771,635042.05154456256,654415.9370982874]
[null,"Tariff V Adjoining West Non-Domestic",96736.994895283206,47089.688975968209,99250.60731116723,98101.737403447623,97872.062306976397,98514.413285617949,99436.463039832801]
[null,"Tariff D West & Central","n/a","n/a","n/a","n/a","n/a","n/a","n/a"]
[null,"Tariff D Adjoining West & Central","n/a","n/a","n/a","n/a","n/a","n/a","n/a"]
[null,"Tariff M West & Central","n/a","n/a","n/a","n/a","n/a","n/a","n/a"]
[null,"Tariff M Adjoining West & Central","n/a","n/a","n/a","n/a","n/a","n/a","n/a"]
[]
[]
[]
[]
[]
[]
[]
[]
[]
[]
[]
[]
[]
[]
[]
[]
[]
[]
[]
[]
[]
[]
[]
[]
[]
[]
[]
[]
[]
[]
[]
[]
[]
[]
[]
[]
[]
[]
[]
[]
[]
[]
[]
[]
[]
[]
[]
[]
[]
[]
[]
[]
[]
[]
[]
[]
[]
[]
[]
[]
[]
[]
[]
[null,"Total",{"$f":"SUM(C21:C95)","v":37813740.722359098},15482315.712969139,37516975.930858515,37315395.05081974,37454946.320844099,37934811.315576226,38521185.055159293]

{"sheet":"N2. Network characteristics","index":21,"n_rows":63,"n_cols":10,"rows_kept":63,"cut":false,"hidden":false,"merged":[]}
[null,{"$f":"INDEX(dms_Worksheet_List,MATCH(dms_Model,dms_Model_List))","v":"REGULATORY REPORTING STATEMENT"}]
[null,{"$f":"dms_TradingName","v":"AusNet (Gas)"}]
[null,{"$f":"dms_Header_Span","v":"2021-22 to 2027-28"}]
[null,"N2. NETWORK CHARACTERISTICS"]
[]
[null,"N2.1 - NETWORK LENGTH - BY PRESSURE AND ASSET TYPE"]
[null,null,null,"LENGTH"]
[null,null,null,"KM"]
[null,null,null,{"$f":"VLOOKUP(CRCP_y4,'AER lookups'!$B$52:$C$101,2,0)","v":2022},{"$f":"CONCATENATE(\"1 Jan-30 Jun \"&(D9+1))","v":"1 Jan-30 Jun 2023"},{"$f":"FRCP_y1","v":"2023-24"},{"$f":"FRCP_y2","v":"2024-25"},{"$f":"FRCP_y3","v":"2025-26"},{"$f":"FRCP_y4","v":"2026-27"},{"$f":"FRCP_y5","v":"2027-28"}]
[null,"N2.1.1 - LOW PRESSURE"]
[null,null,"Cast Iron",63.621734569229488,56.588626398806696,41.777387061482756,25.883080117163914,14.270119550495821,6.3994556579970663,0]
[null,null,"PVC",197.5622283991863,175.72257671208394,129.72978087513067,80.373775100666876,44.312476498908069,19.871993885359302,0]
[null,null,"Polyamide",0,0,0,0,0,0,0]
[null,null,"High density polyethylene (80)",3.9345020062549816,3.4995597904525191,2.5836015682759075,1.6006641651404001,0.88249423535961036,0.39575581042876617,0]
[null,null,"High density polyethylene (100)",1.2222070061983559,1.087097296608655,0.80256559354953716,0.49722759172446462,0.27413650715426185,0.12293691132468054,0]
[null,null,"High density polyethylene (250)",0,0,0,0,0,0,0]
[null,null,"High density polyethylene (575)",2.9517136327776732,2.6254144300288473,1.9382508786682657,1.2008386906989466,0.66205844125063518,0.29690106118549542,0]
[null,null,"Medium density polyethylene",0,0,0,0,0,0,0]
[null,null,"Other polyethylene",3.3485123457489205E-3,2.9783487578319313E-3,2.1988098453411976E-3,1.3622673745875744E-3,7.5105892371030636E-4,3.3681345568405607E-4,0]
[null,null,"Unprotected steel",8.9288081699394972,7.9417669627588445,5.8631264526023044,3.632485954337767,2.0026986200735326,0.89811307958153641,0]
[null,null,"Protected steel",5.5216968581399701,4.9112971016648546,3.625837434967635,2.2463789006949106,1.2384961651982955,0.55540538842300879,0]
[null,null,"Other",21.238776680998964,18.890921583738482,13.946501146537882,8.6405213901653362,4.7637789883635477,2.136323546040046,0]
[null,"N2.1.2 - MEDIUM PRESSURE"]
[null,null,"Cast Iron",0.46200000000000002,0.46200000000000002,0.42777777777777781,0.36422222222222222,0.24884444444444448,0.11342222222222226,0]
[null,null,"PVC",0,0,0,0,0,0,0]
[null,null,"Polyamide",0,0,0,0,0,0,0]
[null,null,"High density polyethylene (80)",16.600999999999999,16.600999999999999,16.600999999999999,16.600999999999999,16.600999999999999,16.600999999999999,16.600999999999999]
[null,null,"High density polyethylene (100)",7.9859999999999998,7.9859999999999998,7.9859999999999998,7.9859999999999998,7.9859999999999998,7.9859999999999998,7.9859999999999998]
[null,null,"High density polyethylene (250)",24.739000000000001,24.739000000000001,22.906481481481482,19.503232804232805,13.325027513227514,6.0734899470899499,0]
[null,null,"High density polyethylene (575)",171.27799999999999,171.27799999999999,171.27799999999999,171.27799999999999,171.27799999999999,171.27799999999999,171.27799999999999]
[null,null,"Medium density polyethylene",0,0,0,0,0,0,0]
[null,null,"Other polyethylene",0,0,0,0,0,0,0]
[null,null,"Unprotected steel",196.22235711233574,186.22235711233574,182.02976451974314,174.24352113349977,160.10849467847331,143.51780684778549,129.62235711233575]
[null,null,"Protected steel",196.00299999999999,196.00299999999999,195.35855555555554,194.16173015873014,191.98903174603174,189.43887301587301,187.303]
[null,null,"Other",0.315,0.315,0.315,0.315,0.315,0.315,0.315]
[null,"N2.1.3 - HIGH PRESSURE"]
[null,null,"Cast Iron",0.17799999999999999,0.17799999999999999,0.17799999999999999,0.17799999999999999,0.17799999999999999,0.17799999999999999,0.17799999999999999]
[null,null,"PVC",0.17199999999999999,0.17199999999999999,0.17199999999999999,0.17199999999999999,0.17199999999999999,0.17199999999999999,0.17199999999999999]
[null,null,"Polyamide",0,0,0,0,0,0,0]
[null,null,"High density polyethylene (80)",3966.0320000000002,3966.0320000000002,3966.0320000000002,3966.0320000000002,3966.0320000000002,3966.0320000000002,3966.0320000000002]
[null,null,"High density polyethylene (100)",2535.314452312909,2672.8006512382872,2924.1366387529492,3192.5807664232279,3453.2597793696277,3696.4623171925159,3924.4634828389962]
[null,null,"High density polyethylene (250)",5.2999999999999999E-2,5.2999999999999999E-2,5.2999999999999999E-2,5.2999999999999999E-2,5.2999999999999999E-2,5.2999999999999999E-2,5.2999999999999999E-2]
[null,null,"High density polyethylene (575)",2752.951,2752.951,2745.951,2738.951,2731.951,2724.951,2717.951]
[null,null,"Medium density polyethylene",0,0,0,0,0,0,0]
[null,null,"Other polyethylene",51.372999999999998,51.372999999999998,51.372999999999998,51.372999999999998,51.372999999999998,51.372999999999998,51.372999999999998]
[null,null,"Unprotected steel",0.66400000000000003,0.66400000000000003,0.66400000000000003,0.66400000000000003,0.66400000000000003,0.66400000000000003,0.66400000000000003]
[null,null,"Protected steel",2293.4679999999998,2293.4679999999998,2293.4679999999998,2293.4679999999998,2293.4679999999998,2293.4679999999998,2293.4679999999998]
[null,null,"Other",0,0,0,0,0,0,0]
[null,"N2.1.4 - TRANSMISSION"]
[null,null,"Protected steel",206.08600000000001,206.08600000000001,206.08600000000001,206.08600000000001,206.08600000000001,206.08600000000001,206.08600000000001]
[null,null,"Other",0,0,0,0,0,0,0]
[null,null,"Total",{"$f":"SUM(D11:D51)","v":12724.882825260316},12818.654246975522,12985.285467908569,13158.08680691988,13333.495187817531,13505.440131379284,13673.545839951334]
[]
[]
[]
[null,"N2.2 - CITY GATES / REGULATORS"]
[null,null,null,"VOLUMES"]
[null,null,null," 0's"]
[null,null,null,{"$f":"VLOOKUP(CRCP_y4,'AER lookups'!$B$52:$C$101,2,0)","v":2022},{"$f":"CONCATENATE(\"1 Jan-30 Jun \"&(D59+1))","v":"1 Jan-30 Jun 2023"},{"$f":"FRCP_y1","v":"2023-24"},{"$f":"FRCP_y2","v":"2024-25"},{"$f":"FRCP_y3","v":"2025-26"},{"$f":"FRCP_y4","v":"2026-27"},{"$f":"FRCP_y5","v":"2027-28"}]
[null,null,"City Gate",42,42,42,43,43,43,44]
[null,null,"Field Regulator",108,108,108,108,108,108,108]
[null,null,"District Regulator",39,35,28,21,14,7,0]
[null,null,"Total",{"$f":"SUM(D60:D62)","v":189},{"$f":"SUM(E60:E62)","v":185},{"$f":"SUM(F60:F62)","v":178},{"$f":"SUM(G60:G62)","v":172},165,158,152]

{"sheet":"S1.1 Customer numbers","index":22,"n_rows":34,"n_cols":9,"rows_kept":34,"cut":false,"hidden":false,"merged":[]}
[null,{"$f":"INDEX(dms_Worksheet_List,MATCH(dms_Model,dms_Model_List))","v":"REGULATORY REPORTING STATEMENT"}]
[null,{"$f":"dms_TradingName","v":"AusNet (Gas)"}]
[null,{"$f":"dms_Header_Span","v":"2021-22 to 2027-28"}]
[null,"S1. CUSTOMER NUMBERS"]
[]
[null,"S1.1 - CUSTOMER NUMBERS - BY CUSTOMER TYPE "]
[null,"A. RESIDENTIAL"]
[null,null,"VOLUMES"]
[null,null,"0's"]
[null,null,{"$f":"VLOOKUP(CRCP_y4,'AER lookups'!$B$52:$C$101,2,0)","v":2022},{"$f":"CONCATENATE(\"1 Jan-30 Jun \"&(C10+1))","v":"1 Jan-30 Jun 2023"},{"$f":"FRCP_y1","v":"2023-24"},{"$f":"FRCP_y2","v":"2024-25"},{"$f":"FRCP_y3","v":"2025-26"},{"$f":"FRCP_y4","v":"2026-27"},{"$f":"FRCP_y5","v":"2027-28"}]
[null,"Customer numbers - Beginning of year",{"$f":"SUM('S1.2 Customer numbers'!C11,'S1.2 Customer numbers'!C13,'S1.2 Customer numbers'!C15,'S1.2 Customer numbers'!C17)","v":759407},{"$f":"C12","v":775187.34928235516},{"$f":"D12","v":783516.8247746058},783516.8247746058,800434.9179784318,817897.50919278793,835888.94360849645]
[null,"Customer numbers - End of year",{"$f":"+SUM('S1.2 Customer numbers'!C92,'S1.2 Customer numbers'!C94,'S1.2 Customer numbers'!C96,'S1.2 Customer numbers'!C98)","v":775187.34928235516},{"$f":"+SUM('S1.2 Customer numbers'!D92,'S1.2 Customer numbers'!D94,'S1.2 Customer numbers'!D96,'S1.2 Customer numbers'!D98)","v":783516.8247746058},{"$f":"+SUM('S1.2 Customer numbers'!E92,'S1.2 Customer numbers'!E94,'S1.2 Customer numbers'!E96,'S1.2 Customer numbers'!E98)","v":783516.8247746058},{"$f":"+SUM('S1.2 Customer numbers'!F92,'S1.2 Customer numbers'!F94,'S1.2 Customer numbers'!F96,'S1.2 Customer numbers'!F98)","v":800434.9179784318},{"$f":"+SUM('S1.2 Customer numbers'!G92,'S1.2 Customer numbers'!G94,'S1.2 Customer numbers'!G96,'S1.2 Customer numbers'!G98)","v":817897.50919278793},{"$f":"+SUM('S1.2 Customer numbers'!H92,'S1.2 Customer numbers'!H94,'S1.2 Customer numbers'!H96,'S1.2 Customer numbers'!H98)","v":835888.94360849645},{"$f":"+SUM('S1.2 Customer numbers'!I92,'S1.2 Customer numbers'!I94,'S1.2 Customer numbers'!I96,'S1.2 Customer numbers'!I98)","v":853341.24707404908}]
[null,"Total customer connections",{"$f":"+SUM('S1.2 Customer numbers'!C173,'S1.2 Customer numbers'!C175,'S1.2 Customer numbers'!C177,'S1.2 Customer numbers'!C179)","v":17733.303972092825},{"$f":"+SUM('S1.2 Customer numbers'!D173,'S1.2 Customer numbers'!D175,'S1.2 Customer numbers'!D177,'S1.2 Customer numbers'!D179)","v":9317.036865384076},{"$f":"+SUM('S1.2 Customer numbers'!E173,'S1.2 Customer numbers'!E175,'S1.2 Customer numbers'!E177,'S1.2 Customer numbers'!E179)","v":18938.327364280736},{"$f":"+SUM('S1.2 Customer numbers'!F173,'S1.2 Customer numbers'!F175,'S1.2 Customer numbers'!F177,'S1.2 Customer numbers'!F179)","v":19529.479723936241},{"$f":"+SUM('S1.2 Customer numbers'!G173,'S1.2 Customer numbers'!G175,'S1.2 Customer numbers'!G177,'S1.2 Customer numbers'!G179)","v":20106.438367849623},{"$f":"+SUM('S1.2 Customer numbers'!H173,'S1.2 Customer numbers'!H175,'S1.2 Customer numbers'!H177,'S1.2 Customer numbers'!H179)","v":19613.915533544259},{"$f":"+SUM('S1.2 Customer numbers'!I173,'S1.2 Customer numbers'!I175,'S1.2 Customer numbers'!I177,'S1.2 Customer numbers'!I179)","v":19102.873359070509}]
[null,"Total customer disconnections",{"$f":"+SUM('S1.2 Customer numbers'!C254,'S1.2 Customer numbers'!C256,'S1.2 Customer numbers'!C258,'S1.2 Customer numbers'!C260)","v":1952.9546897377322},{"$f":"+SUM('S1.2 Customer numbers'!D254,'S1.2 Customer numbers'!D256,'S1.2 Customer numbers'!D258,'S1.2 Customer numbers'!D260)","v":987.56137313325223},{"$f":"+SUM('S1.2 Customer numbers'!E254,'S1.2 Customer numbers'!E256,'S1.2 Customer numbers'!E258,'S1.2 Customer numbers'!E260)","v":18938.327364280736},{"$f":"+SUM('S1.2 Customer numbers'!F254,'S1.2 Customer numbers'!F256,'S1.2 Customer numbers'!F258,'S1.2 Customer numbers'!F260)","v":2611.386520110374},{"$f":"+SUM('S1.2 Customer numbers'!G254,'S1.2 Customer numbers'!G256,'S1.2 Customer numbers'!G258,'S1.2 Customer numbers'!G260)","v":2643.847153493457},{"$f":"+SUM('S1.2 Customer numbers'!H254,'S1.2 Customer numbers'!H256,'S1.2 Customer numbers'!H258,'S1.2 Customer numbers'!H260)","v":1622.4811178357204},{"$f":"+SUM('S1.2 Customer numbers'!I254,'S1.2 Customer numbers'!I256,'S1.2 Customer numbers'!I258,'S1.2 Customer numbers'!I260)","v":1650.5698935179657}]
[]
[]
[null,"B. COMMERCIAL"]
[null,null,"VOLUMES"]
[null,null,"0's"]
[null,null,{"$f":"VLOOKUP(CRCP_y4,'AER lookups'!$B$52:$C$101,2,0)","v":2022},{"$f":"CONCATENATE(\"1 Jan-30 Jun \"&(C20+1))","v":"1 Jan-30 Jun 2023"},{"$f":"FRCP_y1","v":"2023-24"},{"$f":"FRCP_y2","v":"2024-25"},{"$f":"FRCP_y3","v":"2025-26"},{"$f":"FRCP_y4","v":"2026-27"},{"$f":"FRCP_y5","v":"2027-28"}]
[null,"Customer numbers - Beginning of year",{"$f":"SUM('S1.2 Customer numbers'!C12,'S1.2 Customer numbers'!C14,'S1.2 Customer numbers'!C16,'S1.2 Customer numbers'!C18)","v":19019},{"$f":"C22","v":19067.919082775297},{"$f":"D22","v":19093.740456801279},19093.740456801279,19146.186545733137,19200.320578497642,19256.094025186339]
[null,"Customer numbers - End of year",{"$f":"+SUM('S1.2 Customer numbers'!C93,'S1.2 Customer numbers'!C95,'S1.2 Customer numbers'!C97,'S1.2 Customer numbers'!C99)","v":19067.919082775297},{"$f":"+SUM('S1.2 Customer numbers'!D93,'S1.2 Customer numbers'!D95,'S1.2 Customer numbers'!D97,'S1.2 Customer numbers'!D99)","v":19093.740456801279},{"$f":"+SUM('S1.2 Customer numbers'!E93,'S1.2 Customer numbers'!E95,'S1.2 Customer numbers'!E97,'S1.2 Customer numbers'!E99)","v":19093.740456801279},{"$f":"+SUM('S1.2 Customer numbers'!F93,'S1.2 Customer numbers'!F95,'S1.2 Customer numbers'!F97,'S1.2 Customer numbers'!F99)","v":19146.186545733137},{"$f":"+SUM('S1.2 Customer numbers'!G93,'S1.2 Customer numbers'!G95,'S1.2 Customer numbers'!G97,'S1.2 Customer numbers'!G99)","v":19200.320578497642},{"$f":"+SUM('S1.2 Customer numbers'!H93,'S1.2 Customer numbers'!H95,'S1.2 Customer numbers'!H97,'S1.2 Customer numbers'!H99)","v":19256.094025186339},{"$f":"+SUM('S1.2 Customer numbers'!I93,'S1.2 Customer numbers'!I95,'S1.2 Customer numbers'!I97,'S1.2 Customer numbers'!I99)","v":19310.196165929552}]
[null,"Total customer connections",{"$f":"SUM('S1.2 Customer numbers'!C174,'S1.2 Customer numbers'!C176,'S1.2 Customer numbers'!C178,'S1.2 Customer numbers'!C180)","v":138.73335456229722},{"$f":"SUM('S1.2 Customer numbers'!D174,'S1.2 Customer numbers'!D176,'S1.2 Customer numbers'!D178,'S1.2 Customer numbers'!D180)","v":70.801625767669137},{"$f":"SUM('S1.2 Customer numbers'!E174,'S1.2 Customer numbers'!E176,'S1.2 Customer numbers'!E178,'S1.2 Customer numbers'!E180)","v":142.70371249290565},{"$f":"SUM('S1.2 Customer numbers'!F174,'S1.2 Customer numbers'!F176,'S1.2 Customer numbers'!F178,'S1.2 Customer numbers'!F180)","v":144.69853216573296},{"$f":"SUM('S1.2 Customer numbers'!G174,'S1.2 Customer numbers'!G176,'S1.2 Customer numbers'!G178,'S1.2 Customer numbers'!G180)","v":146.65439523945562},{"$f":"SUM('S1.2 Customer numbers'!H174,'S1.2 Customer numbers'!H176,'S1.2 Customer numbers'!H178,'S1.2 Customer numbers'!H180)","v":145.2896684007676},{"$f":"SUM('S1.2 Customer numbers'!I174,'S1.2 Customer numbers'!I176,'S1.2 Customer numbers'!I178,'S1.2 Customer numbers'!I180)","v":143.86217283570332}]
[null,"Total customer disconnections",{"$f":"SUM('S1.2 Customer numbers'!C255,'S1.2 Customer numbers'!C257,'S1.2 Customer numbers'!C259,'S1.2 Customer numbers'!C261)","v":89.814271786996954},{"$f":"SUM('S1.2 Customer numbers'!D255,'S1.2 Customer numbers'!D257,'S1.2 Customer numbers'!D259,'S1.2 Customer numbers'!D261)","v":44.980251741690722},{"$f":"SUM('S1.2 Customer numbers'!E255,'S1.2 Customer numbers'!E257,'S1.2 Customer numbers'!E259,'S1.2 Customer numbers'!E261)","v":142.70371249290565},{"$f":"SUM('S1.2 Customer numbers'!F255,'S1.2 Customer numbers'!F257,'S1.2 Customer numbers'!F259,'S1.2 Customer numbers'!F261)","v":92.252443233874075},{"$f":"SUM('S1.2 Customer numbers'!G255,'S1.2 Customer numbers'!G257,'S1.2 Customer numbers'!G259,'S1.2 Customer numbers'!G261)","v":92.520362474951582},{"$f":"SUM('S1.2 Customer numbers'!H255,'S1.2 Customer numbers'!H257,'S1.2 Customer numbers'!H259,'S1.2 Customer numbers'!H261)","v":89.516221712071641},{"$f":"SUM('S1.2 Customer numbers'!I255,'S1.2 Customer numbers'!I257,'S1.2 Customer numbers'!I259,'S1.2 Customer numbers'!I261)","v":89.760032092490391}]
[]
[]
[null,"C. INDUSTRIAL"]
[null,null,"VOLUMES"]
[null,null,"0's"]
[null,null,{"$f":"VLOOKUP(CRCP_y4,'AER lookups'!$B$52:$C$101,2,0)","v":2022},{"$f":"CONCATENATE(\"1 Jan-30 Jun \"&(C30+1))","v":"1 Jan-30 Jun 2023"},{"$f":"FRCP_y1","v":"2023-24"},{"$f":"FRCP_y2","v":"2024-25"},{"$f":"FRCP_y3","v":"2025-26"},{"$f":"FRCP_y4","v":"2026-27"},{"$f":"FRCP_y5","v":"2027-28"}]
[null,"Customer numbers - Beginning of year","n/a","n/a","n/a","n/a","n/a","n/a","n/a"]
[null,"Customer numbers - End of year","n/a","n/a","n/a","n/a","n/a","n/a","n/a"]
[null,"Total customer connections","n/a","n/a","n/a","n/a","n/a","n/a","n/a"]
[null,"Total customer disconnections","n/a","n/a","n/a","n/a","n/a","n/a","n/a"]

{"sheet":"S1.2 Customer numbers","index":23,"n_rows":329,"n_cols":9,"rows_kept":329,"cut":false,"hidden":false,"merged":[]}
[null,{"$f":"INDEX(dms_Worksheet_List,MATCH(dms_Model,dms_Model_List))","v":"REGULATORY REPORTING STATEMENT"}]
[null,{"$f":"dms_TradingName","v":"AusNet (Gas)"}]
[null,{"$f":"dms_Header_Span","v":"2021-22 to 2027-28"}]
[null,"S1. CUSTOMER NUMBERS"]
[]
[null,"S1.2 - CUSTOMER NUMBERS - BY TARIFF"]
[null,"S1.2.1 - CUSTOMER NUMBERS - BEGINNING OF YEAR"]
[null,null,"VOLUMES"]
[null,null,"0's"]
[null,null,{"$f":"VLOOKUP(CRCP_y4,'AER lookups'!$B$52:$C$101,2,0)","v":2022},{"$f":"CONCATENATE(\"1 Jan-30 Jun \"&(C10+1))","v":"1 Jan-30 Jun 2023"},{"$f":"FRCP_y1","v":"2023-24"},{"$f":"FRCP_y2","v":"2024-25"},{"$f":"FRCP_y3","v":"2025-26"},{"$f":"FRCP_y4","v":"2026-27"},{"$f":"FRCP_y5","v":"2027-28"}]
[null,{"$f":"IF(ISBLANK('N1. Demand'!B21),\"\",'N1. Demand'!B21)","v":"Tariff V Central Domestic"},589629,{"$f":"C92","v":602504.93497561489},609288.95267938077,609288.95267938077,623125.3987129028,637468.61405461445,652277.52657522564]
[null,{"$f":"IF(ISBLANK('N1. Demand'!B22),\"\",'N1. Demand'!B22)","v":"Tariff V Central Non-Domestic"},11966,{"$f":"C93","v":12005.915398424406},12026.945853306081,12026.945853306081,12069.838836009998,12114.302803569304,12160.210432383197]
[null,{"$f":"IF(ISBLANK('N1. Demand'!B23),\"\",'N1. Demand'!B23)","v":"Tariff V West Domestic"},155189,{"$f":"C94","v":157403.56244044524},158609.17047845284,158609.17047845284,160983.40271076921,163360.09864168023,165784.68032720688]
[null,{"$f":"IF(ISBLANK('N1. Demand'!B24),\"\",'N1. Demand'!B24)","v":"Tariff V West Non-Domestic"},6713,{"$f":"C95","v":6719.8651435653801},6723.602528483204,6723.602528483204,6730.9626484033843,6738.3304057892083,6745.846609014342]
[null,{"$f":"IF(ISBLANK('N1. Demand'!B25),\"\",'N1. Demand'!B25)","v":"Tariff V Adjoining Central Domestic"},2306,{"$f":"C96","v":2491.9529760157025},2587.2865381141232,2587.2865381141232,2780.2148955663411,2977.7334051717808,3179.9653933447203]
[null,{"$f":"IF(ISBLANK('N1. Demand'!B26),\"\",'N1. Demand'!B26)","v":"Tariff V Adjoining Central Non-Domestic"},25,{"$f":"C97","v":25.576454225648678},25.871988268153785,25.871988268153785,26.470066176255656,27.082373556032522,27.709292719368634]
[null,{"$f":"IF(ISBLANK('N1. Demand'!B27),\"\",'N1. Demand'!B27)","v":"Tariff V Adjoining West Domestic"},12283,{"$f":"C98","v":12786.898890279261},13031.415078658176,13031.415078658176,13545.901659193436,14091.063091321486,14646.771312719246]
[null,{"$f":"IF(ISBLANK('N1. Demand'!B28),\"\",'N1. Demand'!B28)","v":"Tariff V Adjoining West Non-Domestic"},315,{"$f":"C99","v":316.56208655986569},317.32008674384031,317.32008674384031,318.91499514349965,320.60499558309664,322.32769106942965]
[null,{"$f":"IF(ISBLANK('N1. Demand'!B29),\"\",'N1. Demand'!B29)","v":"Tariff D West & Central"},null,{"$f":"C100","v":0},0,0,0,0,0]
[null,{"$f":"IF(ISBLANK('N1. Demand'!B30),\"\",'N1. Demand'!B30)","v":"Tariff D Adjoining West & Central"},null,{"$f":"C101","v":0},0,0,0,0,0]
[null,{"$f":"IF(ISBLANK('N1. Demand'!B31),\"\",'N1. Demand'!B31)","v":"Tariff M West & Central"},null,{"$f":"C102","v":0},0,0,0,0,0]
[null,{"$f":"IF(ISBLANK('N1. Demand'!B32),\"\",'N1. Demand'!B32)","v":"Tariff M Adjoining West & Central"},null,{"$f":"C103","v":0},0,0,0,0,0]
[null,{"$f":"IF(ISBLANK('N1. Demand'!B33),\"\",'N1. Demand'!B33)","v":""},null,{"$f":"C104","v":0},0,0,0,0,0]
[null,{"$f":"IF(ISBLANK('N1. Demand'!B34),\"\",'N1. Demand'!B34)","v":""},null,{"$f":"C105","v":0},0,0,0,0,0]
[null,{"$f":"IF(ISBLANK('N1. Demand'!B35),\"\",'N1. Demand'!B35)","v":""},null,{"$f":"C106","v":0},0,0,0,0,0]
[null,{"$f":"IF(ISBLANK('N1. Demand'!B36),\"\",'N1. Demand'!B36)","v":""},null,{"$f":"C107","v":0},0,0,0,0,0]
[null,{"$f":"IF(ISBLANK('N1. Demand'!B37),\"\",'N1. Demand'!B37)","v":""},null,{"$f":"C108","v":0},0,0,0,0,0]
[null,{"$f":"IF(ISBLANK('N1. Demand'!B38),\"\",'N1. Demand'!B38)","v":""},null,{"$f":"C109","v":0},0,0,0,0,0]
[null,{"$f":"IF(ISBLANK('N1. Demand'!B39),\"\",'N1. Demand'!B39)","v":""},null,{"$f":"C110","v":0},0,0,0,0,0]
[null,{"$f":"IF(ISBLANK('N1. Demand'!B40),\"\",'N1. Demand'!B40)","v":""},null,{"$f":"C111","v":0},0,0,0,0,0]
[null,{"$f":"IF(ISBLANK('N1. Demand'!B41),\"\",'N1. Demand'!B41)","v":""},null,{"$f":"C112","v":0},0,0,0,0,0]
[null,{"$f":"IF(ISBLANK('N1. Demand'!B42),\"\",'N1. Demand'!B42)","v":""},null,{"$f":"C113","v":0},0,0,0,0,0]
[null,{"$f":"IF(ISBLANK('N1. Demand'!B43),\"\",'N1. Demand'!B43)","v":""},null,{"$f":"C114","v":0},0,0,0,0,0]
[null,{"$f":"IF(ISBLANK('N1. Demand'!B44),\"\",'N1. Demand'!B44)","v":""},null,{"$f":"C115","v":0},0,0,0,0,0]
[null,{"$f":"IF(ISBLANK('N1. Demand'!B45),\"\",'N1. Demand'!B45)","v":""},null,{"$f":"C116","v":0},0,0,0,0,0]
[null,{"$f":"IF(ISBLANK('N1. Demand'!B46),\"\",'N1. Demand'!B46)","v":""},null,{"$f":"C117","v":0},0,0,0,0,0]
[null,{"$f":"IF(ISBLANK('N1. Demand'!B47),\"\",'N1. Demand'!B47)","v":""},null,{"$f":"C118","v":0},0,0,0,0,0]
[null,{"$f":"IF(ISBLANK('N1. Demand'!B48),\"\",'N1. Demand'!B48)","v":""},null,{"$f":"C119","v":0},0,0,0,0,0]
[null,{"$f":"IF(ISBLANK('N1. Demand'!B49),\"\",'N1. Demand'!B49)","v":""},null,{"$f":"C120","v":0},0,0,0,0,0]
[null,{"$f":"IF(ISBLANK('N1. Demand'!B50),\"\",'N1. Demand'!B50)","v":""},null,{"$f":"C121","v":0},0,0,0,0,0]
[null,{"$f":"IF(ISBLANK('N1. Demand'!B51),\"\",'N1. Demand'!B51)","v":""},null,{"$f":"C122","v":0},0,0,0,0,0]
[null,{"$f":"IF(ISBLANK('N1. Demand'!B52),\"\",'N1. Demand'!B52)","v":""},null,{"$f":"C123","v":0},0,0,0,0,0]
[null,{"$f":"IF(ISBLANK('N1. Demand'!B53),\"\",'N1. Demand'!B53)","v":""},null,{"$f":"C124","v":0},0,0,0,0,0]
[null,{"$f":"IF(ISBLANK('N1. Demand'!B54),\"\",'N1. Demand'!B54)","v":""},null,{"$f":"C125","v":0},0,0,0,0,0]
[null,{"$f":"IF(ISBLANK('N1. Demand'!B55),\"\",'N1. Demand'!B55)","v":""},null,{"$f":"C126","v":0},0,0,0,0,0]
[null,{"$f":"IF(ISBLANK('N1. Demand'!B56),\"\",'N1. Demand'!B56)","v":""},null,{"$f":"C127","v":0},0,0,0,0,0]
[null,{"$f":"IF(ISBLANK('N1. Demand'!B57),\"\",'N1. Demand'!B57)","v":""},null,{"$f":"C128","v":0},0,0,0,0,0]
[null,{"$f":"IF(ISBLANK('N1. Demand'!B58),\"\",'N1. Demand'!B58)","v":""},null,{"$f":"C129","v":0},0,0,0,0,0]
[null,{"$f":"IF(ISBLANK('N1. Demand'!B59),\"\",'N1. Demand'!B59)","v":""},null,{"$f":"C130","v":0},0,0,0,0,0]
[null,{"$f":"IF(ISBLANK('N1. Demand'!B60),\"\",'N1. Demand'!B60)","v":""},null,{"$f":"C131","v":0},{"$f":"D131","v":0},{"$f":"E131","v":0},{"$f":"F131","v":0},{"$f":"G131","v":0},{"$f":"H131","v":0}]
[null,{"$f":"IF(ISBLANK('N1. Demand'!B61),\"\",'N1. Demand'!B61)","v":""},null,0,0,0,0,0,0]
[null,{"$f":"IF(ISBLANK('N1. Demand'!B62),\"\",'N1. Demand'!B62)","v":""},null,0,0,0,0,0,0]
[null,{"$f":"IF(ISBLANK('N1. Demand'!B63),\"\",'N1. Demand'!B63)","v":""},null,{"$f":"C134","v":0},0,0,0,0,0]
[null,{"$f":"IF(ISBLANK('N1. Demand'!B64),\"\",'N1. Demand'!B64)","v":""},null,{"$f":"C135","v":0},0,0,0,0,0]
[null,{"$f":"IF(ISBLANK('N1. Demand'!B65),\"\",'N1. Demand'!B65)","v":""},null,{"$f":"C136","v":0},0,0,0,0,0]
[null,{"$f":"IF(ISBLANK('N1. Demand'!B66),\"\",'N1. Demand'!B66)","v":""},null,{"$f":"C137","v":0},0,0,0,0,0]
[null,{"$f":"IF(ISBLANK('N1. Demand'!B67),\"\",'N1. Demand'!B67)","v":""},null,{"$f":"C138","v":0},0,0,0,0,0]
[null,{"$f":"IF(ISBLANK('N1. Demand'!B68),\"\",'N1. Demand'!B68)","v":""},null,{"$f":"C139","v":0},{"$f":"D139","v":0},{"$f":"E139","v":0},{"$f":"F139","v":0},{"$f":"G139","v":0},{"$f":"H139","v":0}]
[null,{"$f":"IF(ISBLANK('N1. Demand'!B69),\"\",'N1. Demand'!B69)","v":""},null,0,0,0,0,0,0]
[null,{"$f":"IF(ISBLANK('N1. Demand'!B70),\"\",'N1. Demand'!B70)","v":""},null,0,0,0,0,0,0]
[null,{"$f":"IF(ISBLANK('N1. Demand'!B71),\"\",'N1. Demand'!B71)","v":""},null,0,0,0,0,0,0]
[null,{"$f":"IF(ISBLANK('N1. Demand'!B72),\"\",'N1. Demand'!B72)","v":""},null,0,0,0,0,0,0]
[null,{"$f":"IF(ISBLANK('N1. Demand'!B73),\"\",'N1. Demand'!B73)","v":""},null,0,0,0,0,0,0]
[null,{"$f":"IF(ISBLANK('N1. Demand'!B74),\"\",'N1. Demand'!B74)","v":""},null,0,0,0,0,0,0]
[null,{"$f":"IF(ISBLANK('N1. Demand'!B75),\"\",'N1. Demand'!B75)","v":""},null,0,0,0,0,0,0]
[null,{"$f":"IF(ISBLANK('N1. Demand'!B76),\"\",'N1. Demand'!B76)","v":""},null,0,0,0,0,0,0]
[null,{"$f":"IF(ISBLANK('N1. Demand'!B77),\"\",'N1. Demand'!B77)","v":""},null,0,0,0,0,0,0]
[null,{"$f":"IF(ISBLANK('N1. Demand'!B78),\"\",'N1. Demand'!B78)","v":""},null,0,0,0,0,0,0]
[null,{"$f":"IF(ISBLANK('N1. Demand'!B79),\"\",'N1. Demand'!B79)","v":""},null,0,0,0,0,0,0]
[null,{"$f":"IF(ISBLANK('N1. Demand'!B80),\"\",'N1. Demand'!B80)","v":""},null,0,0,0,0,0,0]
[null,{"$f":"IF(ISBLANK('N1. Demand'!B81),\"\",'N1. Demand'!B81)","v":""},null,0,0,0,0,0,0]
[null,{"$f":"IF(ISBLANK('N1. Demand'!B82),\"\",'N1. Demand'!B82)","v":""},null,0,0,0,0,0,0]
[null,{"$f":"IF(ISBLANK('N1. Demand'!B83),\"\",'N1. Demand'!B83)","v":""},null,0,0,0,0,0,0]
[null,{"$f":"IF(ISBLANK('N1. Demand'!B84),\"\",'N1. Demand'!B84)","v":""},null,0,0,0,0,0,0]
[null,{"$f":"IF(ISBLANK('N1. Demand'!B85),\"\",'N1. Demand'!B85)","v":""},null,0,0,0,0,0,0]
[null,{"$f":"IF(ISBLANK('N1. Demand'!B86),\"\",'N1. Demand'!B86)","v":""},null,0,0,0,0,0,0]
[null,{"$f":"IF(ISBLANK('N1. Demand'!B87),\"\",'N1. Demand'!B87)","v":""},null,0,0,0,0,0,0]
[null,{"$f":"IF(ISBLANK('N1. Demand'!B88),\"\",'N1. Demand'!B88)","v":""},null,0,0,0,0,0,0]
[null,{"$f":"IF(ISBLANK('N1. Demand'!B89),\"\",'N1. Demand'!B89)","v":""},null,0,0,0,0,0,0]
[null,{"$f":"IF(ISBLANK('N1. Demand'!B90),\"\",'N1. Demand'!B90)","v":""},null,0,0,0,0,0,0]
[null,{"$f":"IF(ISBLANK('N1. Demand'!B91),\"\",'N1. Demand'!B91)","v":""},null,0,0,0,0,0,0]
[null,{"$f":"IF(ISBLANK('N1. Demand'!B92),\"\",'N1. Demand'!B92)","v":""},null,0,0,0,0,0,0]
[null,{"$f":"IF(ISBLANK('N1. Demand'!B93),\"\",'N1. Demand'!B93)","v":""},null,0,0,0,0,0,0]
[null,{"$f":"IF(ISBLANK('N1. Demand'!B94),\"\",'N1. Demand'!B94)","v":""},null,0,0,0,0,0,0]
[null,{"$f":"IF(ISBLANK('N1. Demand'!B95),\"\",'N1. Demand'!B95)","v":""},null,0,0,0,0,0,0]
[null,"Total",{"$f":"SUM(C11:C85)","v":778426},{"$f":"SUM(D11:D85)","v":794255.26836513029},802610.56523140706,802610.56523140706,819581.10452416493,837097.82977128553,855145.03763368283]
[]
[null,"S1.2.2 - CUSTOMER NUMBERS - END OF YEAR"]
[null,null,"VOLUMES"]
[null,null,"0's"]
[null,null,{"$f":"VLOOKUP(CRCP_y4,'AER lookups'!$B$52:$C$101,2,0)","v":2022},{"$f":"CONCATENATE(\"1 Jan-30 Jun \"&(C91+1))","v":"1 Jan-30 Jun 2023"},{"$f":"FRCP_y1","v":"2023-24"},{"$f":"FRCP_y2","v":"2024-25"},{"$f":"FRCP_y3","v":"2025-26"},{"$f":"FRCP_y4","v":"2026-27"},{"$f":"FRCP_y5","v":"2027-28"}]
[null,{"$f":"IF(ISBLANK(B11),\"\",B11)","v":"Tariff V Central Domestic"},602504.93497561489,609288.95267938077,609288.95267938077,623125.3987129028,637468.61405461445,652277.52657522564,666598.90207706788]
[null,"Tariff V Central Non-Domestic",12005.915398424406,12026.945853306081,12026.945853306081,12069.838836009998,12114.302803569304,12160.210432383197,12204.606696438908]
[null,"Tariff V West Domestic",157403.56244044524,158609.17047845284,158609.17047845284,160983.40271076921,163360.09864168023,165784.68032720688,168170.54884460615]
[null,"Tariff V West Non-Domestic",6719.8651435653801,6723.602528483204,6723.602528483204,6730.9626484033843,6738.3304057892083,6745.846609014342,6753.2428014182797]
[null,"Tariff V Adjoining Central Domestic",2491.9529760157025,2587.2865381141232,2587.2865381141232,2780.2148955663411,2977.7334051717808,3179.9653933447203,3378.7373839668962]
[null,"Tariff V Adjoining Central Non-Domestic",25.576454225648678,25.871988268153785,25.871988268153785,26.470066176255656,27.082373556032522,27.709292719368634,28.325485890297376]
[null,"Tariff V Adjoining West Domestic",12786.898890279261,13031.415078658176,13031.415078658176,13545.901659193436,14091.063091321486,14646.771312719246,15193.058768408106]
[null,"Tariff V Adjoining West Non-Domestic",316.56208655986569,317.32008674384031,317.32008674384031,318.91499514349965,320.60499558309664,322.32769106942965,324.0211821820651]
[null,"Tariff D West & Central"]
[null,"Tariff D Adjoining West & Central"]
[null,"Tariff M West & Central"]
[null,"Tariff M Adjoining West & Central"]
[null,""]
[null,""]
[null,""]
[null,""]
[null,""]
[null,""]
[null,""]
[null,""]
[null,""]
[null,""]
[null,""]
[null,""]
[null,""]
[null,""]
[null,""]
[null,""]
[null,""]
[null,""]
[null,""]
[null,""]
[null,{"$f":"IF(ISBLANK(B43),\"\",B43)","v":""}]
[null,""]
[null,""]
[null,""]
[null,""]
[null,""]
[null,""]
[null,""]
[null,""]
[null,""]
[null,""]
[null,""]
[null,""]
[null,""]
[null,""]
[null,""]
[null,""]
[null,{"$f":"IF(ISBLANK(B60),\"\",B60)","v":""}]
[null,""]
[null,""]
[null,""]
[null,""]
[null,""]
[null,""]
[null,""]
[null,""]
[null,""]
[null,""]
[null,""]
[null,""]
[null,""]
[null,""]
[null,""]
[null,""]
[null,""]
[null,""]
[null,""]
[null,""]
[null,""]
[null,""]
[null,""]
[null,""]
[null,""]
[null,"Total",{"$f":"SUM(C92:C166)","v":794255.26836513029},{"$f":"SUM(D92:D166)","v":802610.56523140706},{"$f":"SUM(E92:E166)","v":802610.56523140706},{"$f":"SUM(F92:F166)","v":819581.10452416493},{"$f":"SUM(G92:G166)","v":837097.82977128553},{"$f":"SUM(H92:H166)","v":855145.03763368283},{"$f":"SUM(I92:I166)","v":872651.44323997851}]
[]
[null,"S1.2.3 - TOTAL CUSTOMER CONNECTIONS"]
[null,null,"VOLUMES"]
[null,null,"0's"]
[null,null,{"$f":"VLOOKUP(CRCP_y4,'AER lookups'!$B$52:$C$101,2,0)","v":2022},{"$f":"CONCATENATE(\"1 Jan-30 Jun \"&(C172+1))","v":"1 Jan-30 Jun 2023"},{"$f":"FRCP_y1","v":"2023-24"},{"$f":"FRCP_y2","v":"2024-25"},{"$f":"FRCP_y3","v":"2025-26"},{"$f":"FRCP_y4","v":"2026-27"},{"$f":"FRCP_y5","v":"2027-28"}]
[null,{"$f":"IF(ISBLANK(B11),\"\",B11)","v":"Tariff V Central Domestic"},14597.884170169827,7654.9577960248953,15618.976770420772,16167.885485300805,16677.090258033502,16231.628481967142,15764.001392457896]
[null,"Tariff V Central Non-Domestic",103.73654143362378,53.006105741948105,107.10975159505978,108.9559265379021,110.68371278361197,109.44711909195263,108.13669094771082]
[null,"Tariff V West Domestic",2422.8255231683415,1310.5580737599589,2587.3560642861048,2593.0468685847291,2644.2247487454547,2608.7511409679246,2577.8316050279896]
[null,"Tariff V West Non-Domestic",32.858272343159058,16.741985799241309,33.400974590084644,33.440297808456997,33.621067806174537,33.532865025250757,33.458468668669582]
[null,"Tariff V Adjoining Central Domestic",194.07390912299059,99.552787917666876,202.00937743010141,207.257385910886,212.64441954581173,209.84645317397036,206.77385885413784]
[null,"Tariff V Adjoining Central Non-Domestic",0.57645422564867843,0.29553404250510695,0.598077908101871,0.61230737977686545,0.62691916333611175,0.61619317092874226,0.60465426343680306]
[null,"Tariff V Adjoining West Domestic",518.52036963166245,251.96820768155578,529.98515214376084,561.28998413982072,572.47894152485253,563.68945743522102,554.26650273048699]
[null,"Tariff V Adjoining West Non-Domestic",1.5620865598656906,0.75800018397461599,1.5949083996593458,1.6900004395969859,1.7226954863330093,1.6934911126354564,1.662358955886134]
[null,"Tariff D West & Central"]
[null,"Tariff D Adjoining West & Central"]
[null,"Tariff M West & Central"]
[null,"Tariff M Adjoining West & Central"]
[null,""]
[null,""]
[null,""]
[null,""]
[null,""]
[null,""]
[null,""]
[null,""]
[null,""]
[null,""]
[null,""]
[null,""]
[null,""]
[null,""]
[null,""]
[null,""]
[null,""]
[null,""]
[null,""]
[null,""]
[null,{"$f":"IF(ISBLANK(B43),\"\",B43)","v":""}]
[null,""]
[null,""]
[null,""]
[null,""]
[null,""]
[null,""]
[null,""]
[null,""]
[null,""]
[null,""]
[null,""]
[null,""]
[null,""]
[null,""]
[null,""]
[null,""]
[null,{"$f":"IF(ISBLANK(B60),\"\",B60)","v":""}]
[null,""]
[null,""]
[null,""]
[null,""]
[null,""]
[null,""]
[null,""]
[null,""]
[null,""]
[null,""]
[null,""]
[null,""]
[null,""]
[null,""]
[null,""]
[null,""]
[null,""]
[null,""]
[null,""]
[null,""]
[null,""]
[null,""]
[null,""]
[null,""]
[null,""]
[null,"Total",{"$f":"SUM(C173:C247)","v":17872.037326655118},{"$f":"SUM(D173:D247)","v":9387.8384911517442},{"$f":"SUM(E173:E247)","v":19081.031076773641},{"$f":"SUM(F173:F247)","v":19674.178256101975},{"$f":"SUM(G173:G247)","v":20253.09276308908},{"$f":"SUM(H173:H247)","v":19759.205201945028},{"$f":"SUM(I173:I247)","v":19246.735531906212}]
[]
[null,"S1.2.4 - TOTAL CUSTOMER DISCONNECTIONS"]
[null,null,"VOLUMES"]
[null,null,"0's"]
[null,null,{"$f":"VLOOKUP(CRCP_y4,'AER lookups'!$B$52:$C$101,2,0)","v":2022},{"$f":"CONCATENATE(\"1 Jan-30 Jun \"&(C253+1))","v":"1 Jan-30 Jun 2023"},{"$f":"FRCP_y1","v":"2023-24"},{"$f":"FRCP_y2","v":"2024-25"},{"$f":"FRCP_y3","v":"2025-26"},{"$f":"FRCP_y4","v":"2026-27"},{"$f":"FRCP_y5","v":"2027-28"}]
[null,{"$f":"IF(ISBLANK(B11),\"\",B11)","v":"Tariff V Central Domestic"},{"$f":"+C173-(C92-C11)","v":1721.9491945549398},{"$f":"+D173-(D92-D11)","v":870.94009225900845},{"$f":"+E173-(E92-E11)","v":15618.976770420772},2331.4394517787841,2333.8749163218527,1422.7159613559488,1442.6258906156581]
[null,"Tariff V Central Non-Domestic",{"$f":"+C174-(C93-C12)","v":63.821143009217991},31.975650860273291,107.10975159505978,66.062943833984733,66.219745224305782,63.539490278059532,63.740426891999746]
[null,"Tariff V West Domestic",208.26308272310234,104.95003575235705,2587.3560642861048,218.81463626836103,267.52881783443036,184.16945544127884,191.96308762871877]
[null,"Tariff V West Non-Domestic",25.993128777778963,13.004600881417435,33.400974590084644,26.080177888276701,26.25331042035053,26.016661800117035,26.062276264731906]
[null,"Tariff V Adjoining Central Domestic",8.1209331072881241,4.2192258192461054,202.00937743010141,14.329028458668176,15.125909940372026,7.614465001030851,8.001868231961879]
[null,"Tariff V Adjoining Central Non-Domestic",0,0,0.598077908101871,1.4229471674994443E-2,1.4611783559246305E-2,-1.0725992407369489E-2,-1.1538907491939199E-2]
[null,"Tariff V Adjoining West Domestic",14.621479352401707,7.4520193026406787,529.98515214376084,46.803403604560572,27.317509396802166,7.9812360374618265,7.9790470416269272]
[null,"Tariff V Adjoining West Non-Domestic",0,0,1.5949083996593458,9.5092039937640038E-2,3.2695046736023414E-2,-2.920437369755291E-2,-3.1132156749322348E-2]
[null,"Tariff D West & Central"]
[null,"Tariff D Adjoining West & Central"]
[null,"Tariff M West & Central"]
[null,"Tariff M Adjoining West & Central"]
[null,""]
[null,""]
[null,""]
[null,""]
[null,""]
[null,""]
[null,""]
[null,""]
[null,""]
[null,""]
[null,""]
[null,""]
[null,""]
[null,""]
[null,""]
[null,""]
[null,""]
[null,""]
[null,""]
[null,""]
[null,{"$f":"IF(ISBLANK(B43),\"\",B43)","v":""}]
[null,""]
[null,""]
[null,""]
[null,""]
[null,""]
[null,""]
[null,""]
[null,""]
[null,""]
[null,""]
[null,""]
[null,""]
[null,""]
[null,""]
[null,""]
[null,""]
[null,{"$f":"IF(ISBLANK(B60),\"\",B60)","v":""}]
[null,""]
[null,""]
[null,""]
[null,""]
[null,""]
[null,""]
[null,""]
[null,""]
[null,""]
[null,""]
[null,""]
[null,""]
[null,""]
[null,""]
[null,""]
[null,""]
[null,""]
[null,""]
[null,""]
[null,""]
[null,""]
[null,""]
[null,""]
[null,""]
[null,""]
[null,"Total",{"$f":"SUM(C254:C328)","v":2042.7689615247291},{"$f":"SUM(D254:D328)","v":1032.541624874943},{"$f":"SUM(E254:E328)","v":19081.031076773641},{"$f":"SUM(F254:F328)","v":2703.6389633442486},{"$f":"SUM(G254:G328)","v":2736.3675159684085},{"$f":"SUM(H254:H328)","v":1711.9973395477919},{"$f":"SUM(I254:I328)","v":1740.329925610456}]

{"sheet":"S10. Supply Quality","index":24,"n_rows":14,"n_cols":9,"rows_kept":14,"cut":false,"hidden":false,"merged":[]}
[null,{"$f":"INDEX(dms_Worksheet_List,MATCH(dms_Model,dms_Model_List))","v":"REGULATORY REPORTING STATEMENT"}]
[null,{"$f":"dms_TradingName","v":"AusNet (Gas)"}]
[null,{"$f":"dms_Header_Span","v":"2021-22 to 2027-28"}]
[null,"S10. SUPPLY QUALITY"]
[]
[null,"S10.1 - PRESSURE FAULTS"]
[null,null,"VOLUMES"]
[null,null,"0's"]
[null,null,{"$f":"VLOOKUP(CRCP_y4,'AER lookups'!$B$52:$C$101,2,0)","v":2022},{"$f":"CONCATENATE(\"1 Jan-30 Jun \"&(C9+1))","v":"1 Jan-30 Jun 2023"},{"$f":"FRCP_y1","v":"2023-24"},{"$f":"FRCP_y2","v":"2024-25"},{"$f":"FRCP_y3","v":"2025-26"},{"$f":"FRCP_y4","v":"2026-27"},{"$f":"FRCP_y5","v":"2027-28"}]
[null,"Poor Pressure events - mains",14.428571428571429,7.2142857142857144,14.428571428571429,14.428571428571429,14.428571428571429,14.428571428571429,14.428571428571429]
[null,"Poor Pressure events - services",14.428571428571429,7.2142857142857144,14.428571428571429,14.428571428571429,14.428571428571429,14.428571428571429,14.428571428571429]
[null,"Poor Pressure event - meters",0,0,0,0,0,0,0]
[null,"Pressure events impacting 5+ customers",20.857142857142858,10.428571428571429,20.857142857142858,20.857142857142858,20.857142857142858,20.857142857142858,20.857142857142858]
[null,"Pressure events with >12 hr resolution",24.142857142857142,12.071428571428571,24.142857142857142,24.142857142857142,24.142857142857142,24.142857142857142,24.142857142857142]

{"sheet":"S11. Network reliability","index":25,"n_rows":39,"n_cols":9,"rows_kept":39,"cut":false,"hidden":false,"merged":[]}
[null,{"$f":"INDEX(dms_Worksheet_List,MATCH(dms_Model,dms_Model_List))","v":"REGULATORY REPORTING STATEMENT"}]
[null,{"$f":"dms_TradingName","v":"AusNet (Gas)"}]
[null,{"$f":"dms_Header_Span","v":"2021-22 to 2027-28"}]
[null,"S11. NETWORK RELIABILITY"]
[]
[null,"S11.1 - NETWORK OUTAGES"]
[null,"S11.1.1 - PLANNED"]
[null,null,"VOLUMES"]
[null,null,"0's"]
[null,null,{"$f":"VLOOKUP(CRCP_y4,'AER lookups'!$B$52:$C$101,2,0)","v":2022},{"$f":"CONCATENATE(\"1 Jan-30 Jun \"&(C10+1))","v":"1 Jan-30 Jun 2023"},{"$f":"FRCP_y1","v":"2023-24"},{"$f":"FRCP_y2","v":"2024-25"},{"$f":"FRCP_y3","v":"2025-26"},{"$f":"FRCP_y4","v":"2026-27"},{"$f":"FRCP_y5","v":"2027-28"}]
[null,"Count of outage events",291,145.5,291,291,291,291,291]
[null,"Outages affecting 5+ customers",274,137,274,274,274,274,274]
[null,"Outages with >12 hr supply interruption",5.2222222222222223,2.6111111111111112,5.2222222222222223,5.2222222222222223,5.2222222222222223,5.2222222222222223,5.2222222222222223]
[]
[null,"S11.1.2 - UNPLANNED"]
[null,null,"VOLUMES"]
[null,null,"0's"]
[null,null,{"$f":"VLOOKUP(CRCP_y4,'AER lookups'!$B$52:$C$101,2,0)","v":2022},{"$f":"CONCATENATE(\"1 Jan-30 Jun \"&(C18+1))","v":"1 Jan-30 Jun 2023"},{"$f":"FRCP_y1","v":"2023-24"},{"$f":"FRCP_y2","v":"2024-25"},{"$f":"FRCP_y3","v":"2025-26"},{"$f":"FRCP_y4","v":"2026-27"},{"$f":"FRCP_y5","v":"2027-28"}]
[null,"Count of outage events",18464,9232,18464,18464,18464,18464,18464]
[null,"Outages affecting 5+ customers",20.857142857142858,10.428571428571429,20.857142857142858,20.857142857142858,20.857142857142858,20.857142857142858,20.857142857142858]
[null,"Outages with >12 hr supply interruption",24.142857142857142,12.071428571428571,24.142857142857142,24.142857142857142,24.142857142857142,24.142857142857142,24.142857142857142]
[]
[]
[]
[null,"S11.3 - UNACCOUNTED FOR GAS - TRANSMISSION AND DISTRIBUTION"]
[null,null,"VOLUMES"]
[null,null,"GJ"]
[null,"Place of loss",{"$f":"VLOOKUP(CRCP_y4,'AER lookups'!$B$52:$C$101,2,0)","v":2022},{"$f":"CONCATENATE(\"1 Jan-30 Jun \"&(C28+1))","v":"1 Jan-30 Jun 2023"},{"$f":"FRCP_y1","v":"2023-24"},{"$f":"FRCP_y2","v":"2024-25"},{"$f":"FRCP_y3","v":"2025-26"},{"$f":"FRCP_y4","v":"2026-27"},{"$f":"FRCP_y5","v":"2027-28"}]
[null,"DTS Netowrk",2265412.9415568132,1132706.4707784066,2265412.9415568132,2265412.9415568132,2265412.9415568132,2265412.9415568132,2265412.9415568132]
[null,"Non-DTS Network",93267.004732524409,46633.502366262204,93267.004732524409,93267.004732524409,93267.004732524409,93267.004732524409,93267.004732524409]
[]
[]
[]
[]
[]
[]
[]
[]
[null,"Total",{"$f":"SUM(C29:C38)","v":2358679.9462893377},1179339.9731446689,2358679.9462893377,2358679.9462893377,2358679.9462893377,2358679.9462893377,2358679.9462893377]

{"sheet":"F3. Revenue","index":26,"n_rows":185,"n_cols":9,"rows_kept":185,"cut":false,"hidden":false,"merged":[]}
[null,{"$f":"INDEX(dms_Worksheet_List,MATCH(dms_Model,dms_Model_List))","v":"REGULATORY REPORTING STATEMENT"}]
[null,{"$f":"dms_TradingName","v":"AusNet (Gas)"}]
[null,{"$f":"dms_Header_Span","v":"2021-22 to 2027-28"}]
[null,"F3. REVENUE"]
[]
[null,"F3.1 - REFERENCE SERVICES"]
[null,"F3.1.1 -  REVENUE - BY TARIFF"]
[null,null,"REVENUE"]
[null,null,{"$f":"CONCATENATE(\"$0's, real \",dms_DollarReal)","v":"$0's, real June 2023"}]
[null,"Tariff",{"$f":"VLOOKUP(CRCP_y4,'AER lookups'!$B$52:$C$101,2,0)","v":2022},{"$f":"CONCATENATE(\"1 Jan-30 Jun \"&(C10+1))","v":"1 Jan-30 Jun 2023"},{"$f":"FRCP_y1","v":"2023-24"},{"$f":"FRCP_y2","v":"2024-25"},{"$f":"FRCP_y3","v":"2025-26"},{"$f":"FRCP_y4","v":"2026-27"},{"$f":"FRCP_y5","v":"2027-28"}]
[null,{"$f":"IF(ISBLANK('N1. Demand'!B21),\"\",'N1. Demand'!B21)","v":"Tariff V Central Domestic"},173646079.73335502,75142150.521392077,154554511.86212957,160335234.93104008,166961782.46814048,174374503.69049466,182171336.32832685]
[null,{"$f":"IF(ISBLANK('N1. Demand'!B22),\"\",'N1. Demand'!B22)","v":"Tariff V Central Non-Domestic"},5028277.674549344,2383447.527461593,4551621.2313162377,4627184.7033329755,4732092.1735961996,4867155.7604337092,5015009.6883041132]
[null,{"$f":"IF(ISBLANK('N1. Demand'!B23),\"\",'N1. Demand'!B23)","v":"Tariff V West Domestic"},37792678.724429198,16801114.742468379,33442834.864679266,34501813.48668237,35691840.469818711,37019475.146991417,38420410.679408617]
[null,{"$f":"IF(ISBLANK('N1. Demand'!B24),\"\",'N1. Demand'!B24)","v":"Tariff V West Non-Domestic"},1814135.8840847046,847762.14008393197,1648862.8019431764,1675912.8387427686,1709962.2148307005,1751728.4324688374,1796900.343556301]
[null,{"$f":"IF(ISBLANK('N1. Demand'!B25),\"\",'N1. Demand'!B25)","v":"Tariff V Adjoining Central Domestic"},669757.86431589804,374418.37711136532,814042.9452197525,882110.54757891642,957098.04782214505,1038471.2010429412,1123905.9199277363]
[null,{"$f":"IF(ISBLANK('N1. Demand'!B26),\"\",'N1. Demand'!B26)","v":"Tariff V Adjoining Central Non-Domestic"},25307.131463107617,9019.0565454608386,16199.039368401989,16793.331706516143,17530.169734681353,18402.706098389637,19342.650017659718]
[null,{"$f":"IF(ISBLANK('N1. Demand'!B27),\"\",'N1. Demand'!B27)","v":"Tariff V Adjoining West Domestic"},4706695.6443712739,2121589.6198635069,4502541.0992776975,4726458.4266600246,4982383.6739978706,5271201.3643245501,5577527.676880301]
[null,{"$f":"IF(ISBLANK('N1. Demand'!B28),\"\",'N1. Demand'!B28)","v":"Tariff V Adjoining West Non-Domestic"},457701.25496294472,191887.57461912956,369919.77458106203,374926.8092567572,383074.42050715606,394478.16278022301,407225.66815576644]
[null,{"$f":"IF(ISBLANK('N1. Demand'!B29),\"\",'N1. Demand'!B29)","v":"Tariff D West & Central"},1960719.9064613315,1660026.892768597,1470058.3409129926,1479772.0559404769,1489093.6331510108,1509945.5258554271,1538619.5090834287]
[null,{"$f":"IF(ISBLANK('N1. Demand'!B30),\"\",'N1. Demand'!B30)","v":"Tariff D Adjoining West & Central"},15196.359329629991,11500.106320597435,10184.068277222246,10251.3616181137,10315.938360492861,10460.393238983739,10659.036921922559]
[null,{"$f":"IF(ISBLANK('N1. Demand'!B31),\"\",'N1. Demand'!B31)","v":"Tariff M West & Central"},232689.34939293488,136127.7473361727,120549.69185919849,121346.24892144682,122110.64937352257,123820.57419095348,126171.93654597718]
[null,{"$f":"IF(ISBLANK('N1. Demand'!B32),\"\",'N1. Demand'!B32)","v":"Tariff M Adjoining West & Central"},0,0,0,0,0,0,0]
[null,{"$f":"IF(ISBLANK('N1. Demand'!B33),\"\",'N1. Demand'!B33)","v":""}]
[null,{"$f":"IF(ISBLANK('N1. Demand'!B34),\"\",'N1. Demand'!B34)","v":""}]
[null,{"$f":"IF(ISBLANK('N1. Demand'!B35),\"\",'N1. Demand'!B35)","v":""}]
[null,{"$f":"IF(ISBLANK('N1. Demand'!B36),\"\",'N1. Demand'!B36)","v":""}]
[null,{"$f":"IF(ISBLANK('N1. Demand'!B37),\"\",'N1. Demand'!B37)","v":""}]
[null,{"$f":"IF(ISBLANK('N1. Demand'!B38),\"\",'N1. Demand'!B38)","v":""}]
[null,{"$f":"IF(ISBLANK('N1. Demand'!B39),\"\",'N1. Demand'!B39)","v":""}]
[null,{"$f":"IF(ISBLANK('N1. Demand'!B40),\"\",'N1. Demand'!B40)","v":""}]
[null,{"$f":"IF(ISBLANK('N1. Demand'!B41),\"\",'N1. Demand'!B41)","v":""}]
[null,{"$f":"IF(ISBLANK('N1. Demand'!B42),\"\",'N1. Demand'!B42)","v":""}]
[null,{"$f":"IF(ISBLANK('N1. Demand'!B43),\"\",'N1. Demand'!B43)","v":""}]
[null,{"$f":"IF(ISBLANK('N1. Demand'!B44),\"\",'N1. Demand'!B44)","v":""}]
[null,{"$f":"IF(ISBLANK('N1. Demand'!B45),\"\",'N1. Demand'!B45)","v":""}]
[null,{"$f":"IF(ISBLANK('N1. Demand'!B46),\"\",'N1. Demand'!B46)","v":""}]
[null,{"$f":"IF(ISBLANK('N1. Demand'!B47),\"\",'N1. Demand'!B47)","v":""}]
[null,{"$f":"IF(ISBLANK('N1. Demand'!B48),\"\",'N1. Demand'!B48)","v":""}]
[null,{"$f":"IF(ISBLANK('N1. Demand'!B49),\"\",'N1. Demand'!B49)","v":""}]
[null,{"$f":"IF(ISBLANK('N1. Demand'!B50),\"\",'N1. Demand'!B50)","v":""}]
[null,{"$f":"IF(ISBLANK('N1. Demand'!B51),\"\",'N1. Demand'!B51)","v":""}]
[null,{"$f":"IF(ISBLANK('N1. Demand'!B52),\"\",'N1. Demand'!B52)","v":""}]
[null,{"$f":"IF(ISBLANK('N1. Demand'!B53),\"\",'N1. Demand'!B53)","v":""}]
[null,{"$f":"IF(ISBLANK('N1. Demand'!B54),\"\",'N1. Demand'!B54)","v":""}]
[null,{"$f":"IF(ISBLANK('N1. Demand'!B55),\"\",'N1. Demand'!B55)","v":""}]
[null,{"$f":"IF(ISBLANK('N1. Demand'!B56),\"\",'N1. Demand'!B56)","v":""}]
[null,{"$f":"IF(ISBLANK('N1. Demand'!B57),\"\",'N1. Demand'!B57)","v":""}]
[null,{"$f":"IF(ISBLANK('N1. Demand'!B58),\"\",'N1. Demand'!B58)","v":""}]
[null,{"$f":"IF(ISBLANK('N1. Demand'!B59),\"\",'N1. Demand'!B59)","v":""}]
[null,{"$f":"IF(ISBLANK('N1. Demand'!B60),\"\",'N1. Demand'!B60)","v":""}]
[null,{"$f":"IF(ISBLANK('N1. Demand'!B61),\"\",'N1. Demand'!B61)","v":""}]
[null,{"$f":"IF(ISBLANK('N1. Demand'!B62),\"\",'N1. Demand'!B62)","v":""}]
[null,{"$f":"IF(ISBLANK('N1. Demand'!B63),\"\",'N1. Demand'!B63)","v":""}]
[null,{"$f":"IF(ISBLANK('N1. Demand'!B64),\"\",'N1. Demand'!B64)","v":""}]
[null,{"$f":"IF(ISBLANK('N1. Demand'!B65),\"\",'N1. Demand'!B65)","v":""}]
[null,{"$f":"IF(ISBLANK('N1. Demand'!B66),\"\",'N1. Demand'!B66)","v":""}]
[null,{"$f":"IF(ISBLANK('N1. Demand'!B67),\"\",'N1. Demand'!B67)","v":""}]
[null,{"$f":"IF(ISBLANK('N1. Demand'!B68),\"\",'N1. Demand'!B68)","v":""}]
[null,{"$f":"IF(ISBLANK('N1. Demand'!B69),\"\",'N1. Demand'!B69)","v":""}]
[null,{"$f":"IF(ISBLANK('N1. Demand'!B70),\"\",'N1. Demand'!B70)","v":""}]
[null,{"$f":"IF(ISBLANK('N1. Demand'!B71),\"\",'N1. Demand'!B71)","v":""}]
[null,{"$f":"IF(ISBLANK('N1. Demand'!B72),\"\",'N1. Demand'!B72)","v":""}]
[null,{"$f":"IF(ISBLANK('N1. Demand'!B73),\"\",'N1. Demand'!B73)","v":""}]
[null,{"$f":"IF(ISBLANK('N1. Demand'!B74),\"\",'N1. Demand'!B74)","v":""}]
[null,{"$f":"IF(ISBLANK('N1. Demand'!B75),\"\",'N1. Demand'!B75)","v":""}]
[null,{"$f":"IF(ISBLANK('N1. Demand'!B76),\"\",'N1. Demand'!B76)","v":""}]
[null,{"$f":"IF(ISBLANK('N1. Demand'!B77),\"\",'N1. Demand'!B77)","v":""}]
[null,{"$f":"IF(ISBLANK('N1. Demand'!B78),\"\",'N1. Demand'!B78)","v":""}]
[null,{"$f":"IF(ISBLANK('N1. Demand'!B79),\"\",'N1. Demand'!B79)","v":""}]
[null,{"$f":"IF(ISBLANK('N1. Demand'!B80),\"\",'N1. Demand'!B80)","v":""}]
[null,{"$f":"IF(ISBLANK('N1. Demand'!B81),\"\",'N1. Demand'!B81)","v":""}]
[null,{"$f":"IF(ISBLANK('N1. Demand'!B82),\"\",'N1. Demand'!B82)","v":""}]
[null,{"$f":"IF(ISBLANK('N1. Demand'!B83),\"\",'N1. Demand'!B83)","v":""}]
[null,{"$f":"IF(ISBLANK('N1. Demand'!B84),\"\",'N1. Demand'!B84)","v":""}]
[null,{"$f":"IF(ISBLANK('N1. Demand'!B85),\"\",'N1. Demand'!B85)","v":""}]
[null,{"$f":"IF(ISBLANK('N1. Demand'!B86),\"\",'N1. Demand'!B86)","v":""}]
[null,{"$f":"IF(ISBLANK('N1. Demand'!B87),\"\",'N1. Demand'!B87)","v":""}]
[null,{"$f":"IF(ISBLANK('N1. Demand'!B88),\"\",'N1. Demand'!B88)","v":""}]
[null,{"$f":"IF(ISBLANK('N1. Demand'!B89),\"\",'N1. Demand'!B89)","v":""}]
[null,{"$f":"IF(ISBLANK('N1. Demand'!B90),\"\",'N1. Demand'!B90)","v":""}]
[null,{"$f":"IF(ISBLANK('N1. Demand'!B91),\"\",'N1. Demand'!B91)","v":""}]
[null,{"$f":"IF(ISBLANK('N1. Demand'!B92),\"\",'N1. Demand'!B92)","v":""}]
[null,{"$f":"IF(ISBLANK('N1. Demand'!B93),\"\",'N1. Demand'!B93)","v":""}]
[null,{"$f":"IF(ISBLANK('N1. Demand'!B94),\"\",'N1. Demand'!B94)","v":""}]
[null,{"$f":"IF(ISBLANK('N1. Demand'!B95),\"\",'N1. Demand'!B95)","v":""}]
[null,"Total",{"$f":"SUM(C11:C85)","v":226349239.52671537},99679044.305970833,201501325.71956459,208751804.74148047,217057283.85933301,226379642.95792004,236207109.43712866]
[]
[null,"F3.1.2 - STAND ALONE COST PER UNIT - BY TARIFF CLASS"]
[null,null,"STAND ALONE COST PER UNIT"]
[null,null,{"$f":"CONCATENATE(\"$0's, real \",dms_DollarReal)","v":"$0's, real June 2023"}]
[null,"Tariff Class",{"$f":"VLOOKUP(CRCP_y4,'AER lookups'!$B$52:$C$101,2,0)","v":2022},{"$f":"CONCATENATE(\"1 Jan-30 Jun \"&(C91+1))","v":"1 Jan-30 Jun 2023"},{"$f":"FRCP_y1","v":"2023-24"},{"$f":"FRCP_y2","v":"2024-25"},{"$f":"FRCP_y3","v":"2025-26"},{"$f":"FRCP_y4","v":"2026-27"},{"$f":"FRCP_y5","v":"2027-28"}]
[null,"Tariff V Central Domestic",1848,1848,2201,2201,2201,2201,2201]
[null,"Tariff V Central Non-Domestic",12739,12739,22024,22024,22024,22024,22024]
[null,"Tariff V Adjoining Central Domestic",1648,1648,1653,1653,1653,1653,1653]
[null,"Tariff V Adjoining Central Non-Domestic",6425,6425,8486,8486,8486,8486,8486]
[null,"Tariff V West Domestic",1969,1969,2331,2331,2331,2331,2331]
[null,"Tariff V West Non-Domestic",7936,7936,13640,13640,13640,13640,13640]
[null,"Tariff V Adjoining West Domestic",2186,2186,2440,2440,2440,2440,2440]
[null,"Tariff V Adjoining West Non-Domestic",10256,10256,16723,16723,16723,16723,16723]
[null,"Tariff D West & Central","484 per MHQ","484 per MHQ","483 per MHQ","483 per MHQ","483 per MHQ","483 per MHQ","483 per MHQ"]
[null,"Tariff D Adjoining West & Central","484 per MHQ","484 per MHQ","483 per MHQ","483 per MHQ","483 per MHQ","483 per MHQ","483 per MHQ"]
[null,"Tariff M West & Central","484 per MHQ","484 per MHQ","483 per MHQ","483 per MHQ","483 per MHQ","483 per MHQ","483 per MHQ"]
[null,"Tariff M Adjoining West & Central","484 per MHQ","484 per MHQ","483 per MHQ","483 per MHQ","483 per MHQ","483 per MHQ","483 per MHQ"]
[]
[]
[]
[]
[]
[]
[]
[]
[]
[null,"F3.1.3 -  AVOIDABLE COST PER UNIT - BY TARIFF CLASS"]
[null,null,"AVOIDABLE COST PER UNIT"]
[null,null,{"$f":"CONCATENATE(\"$0's, real \",dms_DollarReal)","v":"$0's, real June 2023"}]
[null,"Tariff Class",{"$f":"VLOOKUP(CRCP_y4,'AER lookups'!$B$52:$C$101,2,0)","v":2022},{"$f":"CONCATENATE(\"1 Jan-30 Jun \"&(C116+1))","v":"1 Jan-30 Jun 2023"},{"$f":"FRCP_y1","v":"2023-24"},{"$f":"FRCP_y2","v":"2024-25"},{"$f":"FRCP_y3","v":"2025-26"},{"$f":"FRCP_y4","v":"2026-27"},{"$f":"FRCP_y5","v":"2027-28"}]
[null,{"$f":"IF(ISBLANK(B92),\"\",B92)","v":"Tariff V Central Domestic"},632,632,604,604,604,604,604]
[null,{"$f":"IF(ISBLANK(B93),\"\",B93)","v":"Tariff V Central Non-Domestic"},1049,1049,1037,1037,1037,1037,1037]
[null,"Tariff V Adjoining Central Domestic",869,869,706,706,706,706,706]
[null,"Tariff V Adjoining Central Non-Domestic",2169,2169,1669,1669,1669,1669,1669]
[null,"Tariff V West Domestic",516,516,508,508,508,508,508]
[null,"Tariff V West Non-Domestic",592,592,645,645,645,645,645]
[null,"Tariff V Adjoining West Domestic",944,944,791,791,791,791,791]
[null,"Tariff V Adjoining West Non-Domestic",3170,3170,2899,2899,2899,2899,2899]
[null,"Tariff D West & Central","241 per MHQ","241 per MHQ","162 per MHQ","162 per MHQ","162 per MHQ","162 per MHQ","162 per MHQ"]
[null,"Tariff D Adjoining West & Central","241 per MHQ","241 per MHQ","162 per MHQ","162 per MHQ","162 per MHQ","162 per MHQ","162 per MHQ"]
[null,"Tariff M West & Central","241 per MHQ","241 per MHQ","162 per MHQ","162 per MHQ","162 per MHQ","162 per MHQ","162 per MHQ"]
[null,"Tariff M Adjoining West & Central","241 per MHQ","241 per MHQ","162 per MHQ","162 per MHQ","162 per MHQ","162 per MHQ","162 per MHQ"]
[null,""]
[null,""]
[null,""]
[null,""]
[null,""]
[null,""]
[null,""]
[null,""]
[]
[]
[null,"F3.2 - ANCILLARY REFERENCE SERVICES"]
[null,null,"REVENUE"]
[null,null,{"$f":"CONCATENATE(\"$0's, real \",dms_DollarReal)","v":"$0's, real June 2023"}]
[null,"Service Name",{"$f":"VLOOKUP(CRCP_y4,'AER lookups'!$B$52:$C$101,2,0)","v":2022},{"$f":"CONCATENATE(\"1 Jan-30 Jun \"&(C142+1))","v":"1 Jan-30 Jun 2023"},{"$f":"FRCP_y1","v":"2023-24"},{"$f":"FRCP_y2","v":"2024-25"},{"$f":"FRCP_y3","v":"2025-26"},{"$f":"FRCP_y4","v":"2026-27"},{"$f":"FRCP_y5","v":"2027-28"}]
[null,"Reconnections",30603.709025,15301.8545125,30603.709025,30603.709025,30603.709025,30603.709025,30603.709025]
[null,"Disconnections",441863.28679999994,220931.64339999997,441863.28679999994,441863.28679999994,441863.28679999994,441863.28679999994,441863.28679999994]
[null,"Meter and Gas Installation test",149927.34764999998,74963.673824999991,149927.34764999998,149927.34764999998,149927.34764999998,149927.34764999998,149927.34764999998]
[null,"Special Meter Reads",2569657.1446799999,1298247.6281270087,1813162.4503711399,1844613.6971895536,1876938.212970163,1907716.6326225798,1936929.8411120735]
[null,"ARS - Other Non-Reference Services",0,0,0,0,0,0,0]
[null,"Meter Fix or Meter Reinstallation (New)",0,0,2802953.6989075537,2817444.4819836756,2832010.1798877665,2846651.1799164568,2861367.8713686322]
[null,"Meter and Service Removal (New)",0,0,1764568.5241231835,1773691.0364629298,1782860.7106046982,1792077.7903668012,1801342.5208280508]
[null,"Minor Meter Alter Position (New)",0,0,295681.02907405893,297209.64856345922,298746.17074973084,300290.63648844196,301843.08684637712]
[]
[null,"Total",{"$f":"SUM(C143:C151)","v":3192051.4881549999},1609444.7998645087,{"$f":"SUM(E143:E151)","v":7298760.0459509362},{"$f":"SUM(F143:F151)","v":7355353.2076746188},7412949.6176873576,7469130.5828692801,7523877.6636301335]
[]
[]
[null,"F3.3 - REBATEABLE SERVICES"]
[null,null,"REVENUE"]
[null,null,{"$f":"CONCATENATE(\"$0's, real \",dms_DollarReal)","v":"$0's, real June 2023"}]
[null,"Service Name",{"$f":"VLOOKUP(CRCP_y4,'AER lookups'!$B$52:$C$101,2,0)","v":2022},{"$f":"CONCATENATE(\"1 Jan-30 Jun \"&(C158+1))","v":"1 Jan-30 Jun 2023"},{"$f":"FRCP_y1","v":"2023-24"},{"$f":"FRCP_y2","v":"2024-25"},{"$f":"FRCP_y3","v":"2025-26"},{"$f":"FRCP_y4","v":"2026-27"},{"$f":"FRCP_y5","v":"2027-28"}]
[]
[]
[]
[]
[]
[]
[null,"Total",{"$f":"SUM(C159:C164)","v":0},{"$f":"SUM(D159:D164)","v":0},0,0,0,0,0]
[]
[]
[null,"F3.4 - NON-REFERENCE SERVICES"]
[null,null,"REVENUE"]
[null,null,{"$f":"CONCATENATE(\"$0's, real \",dms_DollarReal)","v":"$0's, real June 2023"}]
[null,"Service Name",{"$f":"VLOOKUP(CRCP_y4,'AER lookups'!$B$52:$C$101,2,0)","v":2022},{"$f":"CONCATENATE(\"1 Jan-30 Jun \"&(C171+1))","v":"1 Jan-30 Jun 2023"},{"$f":"FRCP_y1","v":"2023-24"},{"$f":"FRCP_y2","v":"2024-25"},{"$f":"FRCP_y3","v":"2025-26"},{"$f":"FRCP_y4","v":"2026-27"},{"$f":"FRCP_y5","v":"2027-28"}]
[]
[]
[]
[]
[]
[]
[null,"Total",{"$f":"SUM(C172:C177)","v":0},{"$f":"SUM(D172:D177)","v":0},0,0,0,0,0]
[]
[]
[null,"F3.5 - TOTAL REVENUE"]
[null,null,"REVENUE"]
[null,null,{"$f":"CONCATENATE(\"$0's, real \",dms_DollarReal)","v":"$0's, real June 2023"}]
[null,null,{"$f":"VLOOKUP(CRCP_y4,'AER lookups'!$B$52:$C$101,2,0)","v":2022},{"$f":"CONCATENATE(\"1 Jan-30 Jun \"&(C184+1))","v":"1 Jan-30 Jun 2023"},{"$f":"FRCP_y1","v":"2023-24"},{"$f":"FRCP_y2","v":"2024-25"},{"$f":"FRCP_y3","v":"2025-26"},{"$f":"FRCP_y4","v":"2026-27"},{"$f":"FRCP_y5","v":"2027-28"}]
[null,"Total",{"$f":"SUM(C178,C165,C152,C86)","v":229541291.01487038},101288489.10583535,208800085.76551554,216107157.94915509,224470233.47702035,233848773.54078934,243730987.10075879]

{"sheet":"Additional disclosures","index":27,"n_rows":0,"n_cols":0,"rows_kept":0,"cut":false,"hidden":false,"merged":[]}