{"text_format":"1","workbook":"xlsx","n_sheets":17,"sheets":["NOTES","Formulae","6 month formulae","Model update","Metering","Unmetered supply","Metering exit fees","Public lighting","ANS","Prop2021DistTar","2021DistRevCapForm","2021DistTarRebalCont","Est2020DistRev","Prop2021TransTar","2021TransRevCont","Prop2021JSTar","2021JSRevCont"],"not_rendered":{"charts":0,"images":53,"macros":1,"external_links":2,"defined_names":78,"comments":6,"pivot_tables":0},"unopened":[],"bounds":{"document_bytes":16777216,"sheet_cells":100000,"rows_first":2000,"rows_last":500,"rows_between":2000,"halvings":0,"cell_chars":16384,"cell_head_chars":4096},"cells_cut":0,"cells_raw":0,"read":"whole","date_system":"1900"}

{"sheet":"NOTES","index":0,"n_rows":82,"n_cols":4,"rows_kept":82,"cut":false,"hidden":false,"merged":[]}
[]
["The following changes have been made for the tariff approval model to apply to the 2021 6-month extension period"]
[]
["Issue","Location","Item","Comment"]
[]
[1,"'6 month formulae'","Price control formulae","Added formulae to apply to the 6-month extension"]
[]
[{"$f":"A6+1","v":2},"'Prop2020TSSComp'","Comparison to previous year indicative prices","Removed worksheet as no indicative prices for 2021 to compare to"]
[]
[{"$f":"A8+1","v":3},"'Indicative prices for 2021'","Indicative prices for next year","Removed worksheet as no indicative prices required for 2021/22 year"]
[]
[{"$f":"A10+1","v":4},"'JS cost audit template'","t-2 jurisdictional scheme costs","Removed worksheet as no true-up to occur in 6-month extension"]
[null,"'TUOS cost audit template'","t-2 designated pricing proposal charges","Removed worksheet as no true-up to occur in 6-month extension"]
[]
[{"$f":"A12+1","v":5},"'Est2019TransRev'","Calculating t-1 estimates for unders/overs account","Removed worksheet as t-1 estimates not needed in 6-month extension"]
[null,"'Est2019JSRev'","Calculating t-1 estimates for unders/overs account","Removed worksheet as t-1 estimates not needed in 6-month extension"]
[]
[{"$f":"A15+1","v":6},"'Prop2021DistTar'","Proposed 2021 distribution tariffs","Renamed for relevant year"]
[null,"'2021DistRevCapForm'","2021 distribution revenue cap","Renamed for relevant year"]
[null,"'2021DistTarRebalCont'","2021 distribution side constraints","Renamed for relevant year"]
[null,"'Est2020DistRev'","Estimated 2020 distribution revenue","Renamed for relevant year"]
[null,"'Prop2021TransTar'","Proposed 2021 transmission tariffs","Renamed for relevant year"]
[null,"'2021TransRevCont'","2021 transmission revenue cap","Renamed for relevant year"]
[null,"'Prop2021JSTar'","Proposed 2021 jurisdictional scheme tariffs","Renamed for relevant year"]
[null,"'2021JSRevCont'","2021 jurisdictional scheme revenue cap","Renamed for relevant year"]
[]
[{"$f":"A18+1","v":7},"'Model update'!A34:N299","Inputs for control formulae","Removed all 2016–20 inputs for control formulae as not used in 6-month extension"]
[]
[{"$f":"A27+1","v":8},"'Model update'!C5","Regulatory year","Changed to 2021"]
[]
[{"$f":"A29+1","v":9},"'Model update'!A26:F26","CPI data","Expanded CPI data to include 2021"]
[]
[{"$f":"A31+1","v":10},"'Model update'!C3","Business name","Updated for relevant business name"]
[]
[{"$f":"A33+1","v":11},"'Model update'!A34:D36","X-factor for ANS","Added 2021 X-factor for use in escalating ANS price caps"]
[]
[{"$f":"A35+1","v":12},"Metering!H26:I28","Side constraint factors","Removed side constraint factors not applied for 6-month extension. "]
[null,"Metering!I25","CPI","Updated CPI reference to 'Model update' sheet"]
[]
[{"$f":"A37+1","v":13},"Metering!B29:D39","Table 2 - Total annual revenue calculations","Removed calculations for factors not applied in 6-month extension"]
[null,null,"Table 3 - Adjusted annual revenue calculations","Removed calculations for escalations not applied in 6-month extension"]
[]
[{"$f":"A40+1","v":14},"Metering!B44:F89","Table 4 - Metering service recovery arrangements","Removed table as unders/overs not applied in 6-month extension"]
[null,null,"Table 5 - Metering services unders/overs account","Removed table as unders/overs not applied in 6-month extension"]
[null,null,"Calculation of estimated metering revenue for t-1","Removed table as unders/overs not applied in 6-month extension"]
[]
[{"$f":"A43+1","v":15},"Metering!E22:E33","t-1 data for calculating revenue cap","Removed t-1 data as not used for calculating revenue cap for 6-month extension"]
[]
[{"$f":"A47+1","v":16},"Metering!D26","Revenue cap","Formula replaced with revenue directly from 6-month extension PTRM"]
[]
[{"$f":"A49+1","v":17},"'2021DistRevCapForm'!B13:C38","Table 2 - Total annual revenue calculations","Removed calculations for factors not applied in 6-month extension"]
[null,null,"Table 3 - Adjusted annual revenue calculations","Removed calculations for escalations not applied in 6-month extension"]
[null,null,"Table 4 - B factor calculations","Removed calculations for factors not applied in 6-month extension"]
[null,null,"Table 5 - License fee calculations","Removed calculations for factors not applied in 6-month extension"]
[]
[{"$f":"A51+1","v":18},"'2021DistRevCapForm'!B42:E77","Table 6 - DUoS recovery arrangements","Removed table as unders/overs not applied in 6-month extension"]
[null,null,"Table 7 - DUoS unders and overs account","Removed table as unders/overs not applied in 6-month extension"]
[]
[{"$f":"A56+1","v":19},"'2021DistRevCapForm'!H6:H38","t-1 data for calculating revenue cap","Removed t-1 data as not used for calculating revenue cap for 6-month extension"]
[]
[{"$f":"A59+1","v":20},"'2021DistRevCapForm'!C10","Revenue cap","Formula replaced with revenue directly from 6-month extension PTRM"]
[]
[{"$f":"A61+1","v":21},"'2021DistTarRebalCont'!B9:C13","Side constraint factors","Removed side constraint factors not applied for 6-month extension. "]
[null,"'2021DistTarRebalCont'!C8","CPI","Updated CPI reference to 'Model update' sheet"]
[]
[{"$f":"A63+1","v":22},"Est2020DistRev!D6:P54","t-1 prices","Updated t-1 prices for approved 2020 prices"]
[]
[{"$f":"A66+1","v":23},"'2021TransRevCont'!B13:C17","Table 2 - Total DPPC related payments for year t","Removed calculations for factors not applied in 6-month extension"]
[null,"'2021TransRevCont'!C10","Revenue cap","Updated formula to source total costs from Table 3"]
[]
[{"$f":"A68+1","v":24},"'2021TransRevCont'!B29:E66","Table 4 - DPPC recovery arrangements","Removed table as unders/overs not applied in 6-month extension"]
[null,null,"Table 5 - DPPC unders and overs account","Removed table as unders/overs not applied in 6-month extension"]
[]
[{"$f":"A71+1","v":25},"'2021JSRevCont'!B13:C17","Table 2 - Total JSA related payments for year t","Removed calculations for factors not applied in 6-month extension"]
[null,"'2021JSRevCont'!C10","Revenue cap","Updated formula to source total costs from Table 3"]
[]
[{"$f":"A74+1","v":26},"'2021JSRevCont'!B27:E62","Table 4 - JSA recovery arrangements","Removed table as unders/overs not applied in 6-month extension"]
[null,null,"Table 5 - JSA unders and overs account","Removed table as unders/overs not applied in 6-month extension"]
[]
[{"$f":"A77+1","v":27},"'Meteing exit fees'","Worksheet","Added worksheet for calculating ACS price caps"]
[null,"'Public lighting'","Worksheet","Added worksheet for calculating ACS price caps"]
[null,"'ANS'","Worksheet","Added worksheet for calculating ACS price caps"]

{"sheet":"Formulae","index":1,"n_rows":239,"n_cols":11,"rows_kept":239,"cut":false,"hidden":false,"merged":[[83,7,84,7],[113,7,114,7],[139,7,140,7],[220,7,221,7]]}
[]
[null,"DUoS"]
[null,"Figure 14.1 Revenue cap formulae"]
[null,"(1)   ",null,null,null,null,null,"i=1,..,n and j=1,..,m and t=1,..,5"]
[null,"(2)   ",null,null,null,null,null,"t = 1,2,…,5"]
[null,"(3)   ",null,null,null,null,null,"t = 1"]
[null,"(4)   ",null,null,null,null,null,"t = 2,…,5"]
[]
[null,"where;"]
[null,null," is the total annual revenue in year t."]
[null,null,null,"is the price of component 'j' of tariff 'i' in year t."]
[null,null,null,"is the forecast quantity of component 'j' of tariff 'i' in year t."]
[null," ","is the adjusted annual smoothed revenue requirement for year t."]
[null," ",null,"is the annual adjustment f–factor scheme amount in year t. This amount will be calculated as per the method set out in the relevant f–factor scheme."]
[null,null,null,"is the sum of:"]
[null,"·        the final carryover amount from the application of the DMIS from the 2011–15 regulatory control period. This amount will be calculated using the method set out in the DMIS and will be deducted from/added to allowed revenue in the 2017 pricing proposal."]
[null,null,null,"is the sum of:"]
[null,"·        the recovery of license fee charges by the Victorian Essential Services Commission indexed by one and a half years of interest, calculated using the following method:"]
[]
[null,"where:"]
[null,null," are the licence fees paid by DNSP to the Victorian Essential Services Commission in the financial year ending in June of regulatory year t–1,"]
[null,null,"is the approved nominal weighted average cost of capital  (WACC) for the relevant regulatory year using the following method:"]
[]
[]
[null,"·        any under or over recovery of actual revenue collected through DUoS charges in regulatory year t–2 as calculated using the method in appendix A,"]
[null,"·        the AER approved pass through amounts (positive or negative) with respect to regulatory year t."]
[null,null,"is the annual smoothed revenue requirement as stated in the Post Tax Revenue Model (PTRM) for year t (when year t is the first year of the 2016–20 regulatory control period).[43]"]
[null," ","is the s‑factor determined in accordance with the service target performance incentive scheme (STPIS) for regulatory year t.[44]"]
[null,null," is the annual percentage change in the ABS CPI All Groups, Weighted Average of Eight Capital Cities[45] from the June quarter in year t–2 to the June quarter in year t–1, calculated using the following method :"]
[null,"The ABS CPI All Groups, Weighted Average of Eight Capital Cities for the June quarter in regulatory year t–1"]
[null,"divided by"]
[null,"The ABS CPI All Groups, Weighted Average of Eight Capital Cities for the June quarter in regulatory year t–2"]
[null,"minus one."]
[null,"For example, for the 2017 regulatory year, t–2 is June quarter 2015 and t–1 is June quarter 2016 and for the 2018 regulatory year, t–2 is June quarter 2016 and t–1 is June quarter 2017 and so on."]
[null," ","is the X factor for each year of the 2016–20 regulatory control period as determined in the PTRM, and annually revised for the return on debt update in accordance with the formula specified in attachment 3—rate of return—calculated for the relevant year."]
[]
[]
[null,"[43] ","Our final F&A stated that if necessary an adjustment for inflation may be required to the annual smoothed revenue requirement for year t. However, as the annual smoothed revenue requirement for year t as stated in our preliminary decision PTRM is in nominal dollars there is no need to adjust it for inflation. This approach is consistent with past regulatory practice."]
[null,"[44] ","For the first two regulatory years of the 2016–20 regulatory control period, the value of St is to be adjusted to account for the change in revenue requirements between the regulatory control periods, as explained in attachment 11. In the formulas in the STPIS, the AR(t+1) is equivalent to ARt in this formula. Calculations of the S factor adjustment are to be made accordingly."]
[null,"[45] ","If the ABS does not or ceases to publish the index, then CPI will mean an index which the AER considers is the best available alternative index"]
[]
[]
[]
[null,"Figure 14.2 Side constraints [46]"]
[]
[]
[]
[]
[]
[null,null,"where each tariff class has \"n\" tariffs, with each up to \"m\" components, and where:"]
[null,null,null,"is the proposed price for component ‘j’ of tariff 'i' for year t."]
[null,null,"is the price charged for component ‘j’ of tariff 'i' in year t–1."]
[null,null,null,"is the forecast quantity of component ‘j’ of tariff 'i' in year t."]
[null,null," is the annual percentage change in the ABS CPI All Groups, Weighted Average of Eight Capital Cities[4] from the June quarter in year t–2 to the June quarter in year t–1, calculated using the following method :"]
[null,null,"The ABS CPI All Groups, Weighted Average of Eight Capital Cities[47] for the June quarter in regulatory year t–1"]
[null,null,"divided by"]
[null,null,"The ABS CPI All Groups, Weighted Average of Eight Capital Cities for the June quarter in regulatory year t–2"]
[null,null,"minus one."]
[null,"For example, for the 2017 regulatory year, t–2 is June quarter 2015 and t–1 is June quarter 2016 and for the 2018 regulatory year, t–2 is June quarter 2016 and t–1 is June quarter 2017 and so on."]
[null,null,null,"is the X factor for each year of the 2016–20 regulatory control period as determined in the PTRM, and annually revised for the return on debt update in accordance with the formula specified in attachment 3—rate of return—calculated for the relevant year. If X>0, then X will be set equal to zero for the purposes of the side constraint formula."]
[null," ","is the s‑factor determined in accordance with the STPIS for regulatory year t.[5]"]
[null,null,null,"is the annual percentage change from the f–factor scheme amount in year t. This amount will be calculated as per the method set out in attachment 19—f–factor scheme."]
[null,null,null,"is the annual percentage change from the final carryover amount from the application of the DMIS from the 2011–15 regulatory control period. This amount will be calculated using the method set out in the DMIS and will be deducted from/added to allowed revenue in the 2017 pricing proposal."]
[null,null,null,"is annual percentage change from the sum of:"]
[null,"·        the recovery of license fee charges by the Victorian Essential Services Commission indexed by one and a half years of interest, calculated using the following method:"]
[]
[null,"where:"]
[null," are the licence fees paid byDNSP to the Victorian Essential Services Commission in the financial year ending in June of regulatory year t–1,"]
[null," ","is the approved nominal weighted average cost of capital (WACC) for the relevant regulatory year using the following method:"]
[]
[]
[null,"where the "]
[null," is as set out in our final decision PTRM and updated annually"]
[null,"·        the AER approved pass through amounts (positive or negative) with respect to regulatory year t."]
[null,"With the exception of the CPI, X factor and S factor, the percentage for each of the other factors above can be calculated by dividing the incremental revenues (as used in the total annual revenue formula) for each factor by the expected revenues for regulatory year t–1 (based on the prices in year t–1 multiplied by the forecast quantities for year t)."]
[]
[null,"[46] ","All parameters are in nominal terms unless otherwise specified."]
[null,"[47] ","If the ABS does not or ceases to publish the index, then CPI will mean an index which the AER considers is the best available alternative index."]
[]
[]
[]
[]
[null,null,null,null,null,null,null,"Table 14.1","Example calculation of DUoS unders and overs account ($'000, nominal)"]
[null,null,null,null,null,null,null,null,"Year t–2","Year t–1","Year t"]
[null,null,null,null,null,null,null,null,"(actual)","(estimate)","(forecast)"]
[null,null,null,null,null,null,null,"(A) Revenue from DUoS charges","46 779","40 269","39 510"]
[null,null,null,null,null,null,null,"(B) Less TAR for regulatory year =","43 039","41 427","44 429"]
[null,null,null,null,null,null,null,"+ Adjusted annual smoothed revenues (AARt)","40 189","41 393","44 393"]
[null,null,null,null,null,null,null,"+ f–factor scheme amount (It)  ","–12",10,14]
[null,null,null,null,null,null,null,"+ DMIS carryover amount (Tt) ",1013,0,0]
[null,null,null,null,null,null,null,"+ Annual adjustments (Bt)a =","1849",24,22]
[null,null,null,null,null,null,null,"+ License fee recovery",25,24,22]
[null,null,null,null,null,null,null,"+ Approved pass through amounts",1824,0,0]
[]
[null,null,null,null,null,null,null,"(A minus B) Under/over recovery of revenue for regulatory year",3740,"–1158","–4919b"]
[]
[null,null,null,null,null,null,null,"DUoS unders and overs account"]
[null,null,null,null,null,null,null,"Nominal WACC (per cent)",0.05,5.5E-2,0.06]
[null,null,null,null,null,null,null,"Opening balance",1737,"5656c",4778]
[null,null,null,null,null,null,null,"Interest on opening balance",87,311,287]
[null,null,null,null,null,null,null,"Under/over recovery of revenue for regulatory year",3740,"–1158","–4919b"]
[null,null,null,null,null,null,null,"Interest on under/over recovery for regulatory year",92,"–31","–145"]
[null,null,null,null,null,null,null,"Closing balance",5656,4778,"0d"]
[null,null,null,null,null,null,"Notes:","(a) Bt parameter calculations in the DUoS unders and overs account exclude approved DUoS revenue under/over recovery for regulatory year."]
[null,null,null,null,null,null,null,"(b) Approved DUoS revenue under/over recovery for regulatory year t."]
[null,null,null,null,null,null,null,"(c) Opening balance is the previous year's closing balance."]
[null,null,null,null,null,null,null,"(d) The DNSP is expected to achieve a closing balance as close to zero as practicable in its DUoS unders and overs account in each forecast year in its annual pricing proposals in the 2016–20 regulatory control period."]
[]
[]
[]
[]
[]
[null,null,null,null,null,null,null,"Table 14.2","Example calculation of designated pricing proposal charges unders and overs account ($'000, nominal)"]
[null,null,null,null,null,null,null,null,"Year t–2","Year t–1","Year t"]
[null,null,null,null,null,null,null,null,"(actual)","(estimate)","(forecast)"]
[null,null,null,null,null,null,null,"(A) Revenue from designated pricing proposal charges (DPPC)","40 077","34 944","36 609"]
[null,null,null,null,null,null,null,"(B) Less DPPC related payments for regulatory year =","34 365","38 734","39 200"]
[null,null,null,null,null,null,null,"+ DPPC charges to be paid to TNSP","33 672","37 933","38 000"]
[null,null,null,null,null,null,null,"+ Avoided TUoS/DPPC payments",572,734,800]
[null,null,null,null,null,null,null,"+ Inter–distributor payments",121,67,400]
[]
[null,null,null,null,null,null,null,"(A minus B) Under/over recovery of revenue for regulatory year",5712,"–3790","–2540a"]
[]
[null,null,null,null,null,null,null,"DPPC unders and overs account"]
[null,null,null,null,null,null,null,"Nominal WACC (per cent)",0.05,5.5E-2,0.06]
[null,null,null,null,null,null,null,"Opening balance",167,"6028b",2467]
[null,null,null,null,null,null,null,"Interest on opening balance",8,332,148]
[null,null,null,null,null,null,null,"Under/over recovery of revenue for regulatory year",5712,"–3790","–2540a"]
[null,null,null,null,null,null,null,"Interest on under/over recovery for regulatory year",141,"–103","–75"]
[null,null,null,null,null,null,null,"Closing balance",6028,2467,"0c"]
[null,null,null,null,null,null,"Notes:","(a) Approved DPPC revenue under/over recovery for regulatory year t."]
[null,null,null,null,null,null,null,"(b) Opening balance is the previous year's closing balance."]
[null,null,null,null,null,null,null,"(c)The DNSP is expected to achieve a closing balance as close to zero as practicable in its DPPC unders and overs account in each forecast year in its annual pricing proposals in the 2016–20 regulatory control period."]
[]
[]
[]
[]
[]
[null,null,null,null,null,null,null,"Table 14.3 Example calculation of jurisdictional scheme amounts unders and overs account ($'000, nominal)"]
[null,null,null,null,null,null,null,null,"Year t–2","Year t–1","Year t"]
[null,null,null,null,null,null,null,null,"(actual)","(estimate)","(forecast)"]
[null,null,null,null,null,null,null,"(A) Revenue from jurisdictional schemes","19 777","23 121","26 965"]
[null,null,null,null,null,null,null,"(B) Less jurisdictional scheme payments for regulatory year =","20 272","20 959","28 641"]
[null,null,null,null,null,null,null,"+ Jurisdictional scheme 1 payments","14 159","13 954","13 961"]
[null,null,null,null,null,null,null,"+ Jurisdictional scheme 2 payments","6113",7005,"14 680"]
[]
[null,null,null,null,null,null,null,"(A minus B) Under/over recovery of revenue for regulatory year","–495",2162,"–1676a"]
[]
[null,null,null,null,null,null,null,"Jurisdictional scheme amount unders and overs account"]
[null,null,null,null,null,null,null,"Nominal WACC (per cent)",0.05,5.5E-2,0.06]
[null,null,null,null,null,null,null,"Opening balance","–52","–562b",1628]
[null,null,null,null,null,null,null,"Interest on opening balance","–3","–31",98]
[null,null,null,null,null,null,null,"Under/over recovery of revenue for regulatory year","–495",2162,"–1676a"]
[null,null,null,null,null,null,null,"Interest on under/over recovery for regulatory year","–12",59,"–50"]
[null,null,null,null,null,null,null,"Closing balance","–562",1628,"0c"]
[null,null,null,null,null,null,"Notes:","(a) Approved jurisdictional scheme amounts revenue under/over recovery for regulatory year t."]
[null,null,null,null,null,null,null,"(b) Opening balance is the previous year's closing balance."]
[null,null,null,null,null,null,null,"(c) The DNSP is expected to achieve a closing balance as close to zero as practicable in its jurisdictional scheme amount unders and overs account in each forecast year in its annual pricing proposals in the 2016–20 regulatory control period."]
[]
[]
[]
[]
[]
[]
[]
[null,"Metering"]
[null,"Figure 16.3","Annual metering charges revenue cap formula"]
["(1)   ",null,null,null,null,null,null,"i=1,..,n and j=1,..,m and t=1,..,5"]
[]
["(2)   ",null,null,null,null,null,null,"t = 1,2,…,5"]
[]
["(3)   ",null,null,null,null,null,null,"t = 1,2,…,5"]
[]
[]
[null,"where;"]
[null," ","is the total annual revenue for annual metering charges in year t."]
[null,null,null,null,"is the price of component 'j' of metering service 'i' in year t."]
[null,null,null,null,"is the forecast quantity of component 'j' of metering service 'i' in year t."]
[null,null,null,"is the annual revenue requirement for year t. When year t is the first year of the 2016–20 regulatory control period,"]
[null,null,null," is the annual revenue requirement in the annual metering charges Post Tax Revenue Model (PTRM) for year t."]
[null,null,null,null,"is equal to zero for all years except 2017 and is a once off adjustment to 2017 charges for the unders and overs recoveries relating to Advanced Metering Infrastructure actual revenues and actual costs incurred in 2014 and 2015."]
[null,null,null,null,"is the sum of annual adjustment factors in year t as calculated in the unders and overs account in appendix C."]
[]
[null,null,null,"is the annual revenue requirement for year t–1."]
[null," ","is the annual percentage change in the ABS CPI All Groups, Weighted Average of Eight Capital Cities[39] from the June quarter in year t–2 to the June quarter in year t–1, calculated using the following method:"]
[null,"The ABS CPI All Groups, Weighted Average of Eight Capital Cities for the June quarter in regulatory year t–1"]
[null,"divided by"]
[null,"The ABS CPI All Groups, Weighted Average of Eight Capital Cities for the June quarter in regulatory year t–2"]
[null,"minus one."]
[null,"For example, for the 2017 regulatory year, t–2 is June quarter 2015 and t–1 is June quarter 2016 and for the 2018 regulatory year, t–2 is June quarter 2016 and t–1 is June quarter 2017 and so on."]
[null," ",null,"is the X factor for each year of the 2016–20 regulatory control period as determined in the annual metering charges PTRM."]
[]
[]
[null,"[39] ","If the ABS does not or ceases to publish the index, then CPI will mean an index which the AER considers is the best available alternative index"]
[]
[]
[]
[]
[null,"Figure 16.4 Side constraints"]
[]
[null,"where:"]
[null,null,null,null,"is the price of annual metering charges service 'i' in year t."]
[null,null,null,"is the price of annual metering charges service 'i' in year t–1."]
[null," ","is the annual percentage change in the ABS CPI All Groups, Weighted Average of Eight Capital Cities from the June quarter in year t–2 to the June quarter in year t–1, calculated using the following method:"]
[null,"The ABS CPI All Groups, Weighted Average of Eight Capital Cities[40] for the June quarter in regulatory year t–1"]
[null,"divided by"]
[null,"The ABS CPI All Groups, Weighted Average of Eight Capital Cities for the June quarter in regulatory year t–2"]
[null,"minus one."]
[null,"For example, for the 2017 regulatory year, t–2 is June quarter 2015 and t–1 is June quarter 2016 and for the 2018 regulatory year, t–2 is June quarter 2016 and t–1 is June quarter 2017 and so on."]
[null," ",null,"is the X factor for each year of the 2016–20 regulatory control period as determined in the annual metering charges PTRM."]
[null,null,null,null,"is the annual percentage change for the unders and overs recoveries relating to Advanced Metering Infrastructure actual revenues and actual costs incurred in 2014 and 2015. It is equal to zero for all years except 2017 and is a once off adjustment to 2017 charges."]
[null,null,null,null,"is the annual percentage change from the sum of annual adjustment factors in year t as calculated in the unders and overs account in appendix C."]
[null,"With the exception of the CPI and the X factor, the percentage for each of the other factors above can be calculated by dividing the incremental revenues (as used in the total annual revenue formula) for each factor by the expected revenues for regulatory year t–1 (based on the prices in year t–1 multiplied by the forecast quantities for year t)."]
[]
[null,"[40] ","If the ABS does not or ceases to publish the index, then CPI will mean an index which the AER considers is the best available alternative index."]
[]
[]
[]
[]
[null,null,null,null,null,null,null,"Table 16.xx","Example calculation of annual metering charges unders and overs account ($'000, nominal)"]
[null,null,null,null,null,null,null,null,"Year t–2","Year t–1","Year t"]
[null,null,null,null,null,null,null,null,"(actual)","(estimate)","(forecast)"]
[null,null,null,null,null,null,null,"(A) Revenue from annual metering charges","8 449","7 389","6 460"]
[null,null,null,null,null,null,null,"(B) Less TARM for regulatory year =","7 366","7 422","7 573"]
[null,null,null,null,null,null,null,"+ Annual revenue requirement (ARt)","7 349","7 412","7 559"]
[null,null,null,null,null,null,null,"+ T factor (Tt) – true‑ups relating to the AMI–Order in Council  ","17",10,14]
[]
[null,null,null,null,null,null,null,"(A minus B) Under/over recovery of revenue for regulatory year","1 083","–33","–1 113a"]
[]
[null,null,null,null,null,null,null,"Annual metering charges unders and overs account"]
[null,null,null,null,null,null,null,"Nominal WACC (per cent)",0.05,5.5E-2,0.06]
[null,null,null,null,null,null,null,"Opening balance","–50","1 057b","1 081"]
[null,null,null,null,null,null,null,"Interest on opening balance","–3",58,65]
[null,null,null,null,null,null,null,"Under/over recovery of revenue for regulatory year","1 083","–33","–1 113b"]
[null,null,null,null,null,null,null,"Interest on under/over recovery for regulatory year",27,"–1","–33"]
[null,null,null,null,null,null,null,"Closing balance","1 057","1 081","0c"]
[null,null,null,null,null,null,"Notes:","(a) Approved annual metering charges revenue under/over recovery for regulatory year t. This is the Bt parameter in the annual metering charges revenue cap formula."]
[null,null,null,null,null,null,null,"(b) Opening balance is the previous year's closing balance."]
[null,null,null,null,null,null,null,"(c) The DNSP is expected to achieve a closing balance as close to zero as practicable in its annual metering charges unders and overs account in each forecast year in its annual pricing proposals in the 2016–20 regulatory control period."]

{"sheet":"6 month formulae","index":2,"n_rows":39,"n_cols":8,"rows_kept":39,"cut":false,"hidden":false,"merged":[]}
[]
[]
[]
[null,null,null,null,null,null,null,"The revenue cap to be applies to standard control services will be as set in the amended PTRM, with no other factors applied.*"]
[]
[]
[]
[]
[]
[null,null,null,null,null,null,null,"The revenue cap to be applied to revenue-capped type 5 and 6 (inc. smart metering) services will be as set in the amended metering PTRM, with no other factors applied."]
[]
[]
[]
[]
[]
[null,null,null,null,null,null,null,"The side constraint mechanism to apply to standard control services and metering services will be just CPI and the 2% allowance as there is no X-factor to apply, and no other adjustments need to be discounted from the permissable percentage.*"]
[]
[]
[]
[]
[]
[]
[]
[]
[null,null,null,null,null,null,null,"The price cap to be applied to type 7 metering services will be escalated for CPI"]
[]
[]
[]
[null,null,null,null,null,null,null,"The price cap to apply to ancillary network services will be escalated for CPI and x-factor."]
[null,null,null,null,null,null,null,"X-factor to apply will reflect updated labour escalation forecast for the extended period in line with the calculation of the 2021–26 draft decision, being half of the forecast yearly change in the State utilities sector real wages for Vic in 21/22."]
[]
[]
[null,null,null,null,null,null,null,"The price cap to apply to metering exit fees and public lighting services will not be escalated."]
[]
[]
[]
[]
[]
[null,null,null,null,null,null,null,"CPI definition to remain as per the 2015–20 determination."]

{"sheet":"Model update","index":3,"n_rows":35,"n_cols":6,"rows_kept":35,"cut":false,"hidden":false,"merged":[]}
[]
[]
["Tariff Approval Template for ",null,"Jemena"]
[]
["calendar year commencing",null,2021]
[]
["t","=",{"$f":"C5","v":2021}]
["t-1","=",{"$f":"C7-1","v":2020}]
["t-2","=",2019]
["t-3","=",2018]
["t-4","=",2017]
[]
["Please fill in yellow highlighted cells where appropriate"]
[]
["CPI","The ABS changed the index reference base in September 2012 from 1989-90 to 2011-12."]
["CPI Index Sept 2011",null,99.8]
["CPI Index Sept 2012",null,101.8,null,"CPI 2013",{"$f":"C17/C16-1","v":2.0040080160320661E-2}]
["CPI Index Sept 2013",null,104,null,"CPI 2014",{"$f":"C18/C17-1","v":2.16110019646365E-2}]
["CPI Index Sept 2014",null,106.4,null,"CPI 2015",{"$f":"C19/C18-1","v":2.3076923076923217E-2}]
["CPI Index Sept 2015",null,108,null,"CPI 2016",{"$f":"C20/C19-1","v":1.5037593984962294E-2}]
["CPI Index June 2015",null,107.5]
["CPI Index June 2016",null,108.6,null,"CPI 2017",{"$f":"IF(OR(C21=\"\",C22=\"\"),0,C22/C21-1)","v":1.0232558139534831E-2}]
["CPI Index June 2017",null,110.7,null,"CPI 2018",{"$f":"IF(OR(C22=\"\",C23=\"\"),0,C23/C22-1)","v":1.9337016574585641E-2}]
["CPI Index June 2018",null,113,null,"CPI 2019",2.0776874435411097E-2]
["CPI Index June 2019",null,114.8,null,"CPI 2020",1.5929203539823078E-2]
["CPI Index June 2020",null,114.4,null,"CPI 2021",{"$f":"IF(OR(C25=\"\",C26=\"\"),0,C26/C25-1)","v":-3.4843205574912606E-3}]
[]
[{"$f":"\"CPI \" &$C$9","v":"CPI 2019"},null,{"$f":"VLOOKUP(A28,E$17:F$25,2,FALSE)","v":2.0776874435411097E-2},"(t-2)"]
[{"$f":"\"CPI \" &$C$8","v":"CPI 2020"},null,{"$f":"VLOOKUP(A29,E$17:F$25,2,FALSE)","v":1.5929203539823078E-2},"(t-1)"]
[{"$f":"\"CPI \" &$C$5","v":"CPI 2021"},null,{"$f":"VLOOKUP(A30,E$17:F$26,2,FALSE)","v":-3.4843205574912606E-3},"(t)"]
[]
[]
[]
[]
["2021 X-factor for ANS",null,-1.1926767169156999E-3]

{"sheet":"Metering","index":4,"n_rows":30,"n_cols":12,"rows_kept":30,"cut":false,"hidden":false,"merged":[[23,7,23,8]]}
[null,{"$f":"\"Tariff Approval - \"&'Model update'!C3","v":"Tariff Approval - Jemena"}]
[]
[null,{"$f":"\"PROPOSED \"&'Model update'!$C$5&\" METERING TARIFFS AND REVENUE\"","v":"PROPOSED 2021 METERING TARIFFS AND REVENUE"}]
[]
[null,null,null,{"$f":"\"Proposed Metering Tariffs P(t) for \" &'Model update'!$C$5","v":"Proposed Metering Tariffs P(t) for 2021"},{"$f":"\"Current Metering Tariffs P(t-1) for\" &'Model update'!$C$8","v":"Current Metering Tariffs P(t-1) for2020"},{"$f":"\"Forecast Quantities   (Qt) for \"&'Model update'!$C$5","v":"Forecast Quantities   (Qt) for 2021"},null,{"$f":"\"Forecast Revenue (Pt \"&'Model update'!$C$5&\")*(Qt \" &'Model update'!$C$5&\")\"","v":"Forecast Revenue (Pt 2021)*(Qt 2021)"},{"$f":"\"Revenue                    (Pt-1 \"&'Model update'!$C$8&\")*(Qt \" &'Model update'!$C$5&\")\"","v":"Revenue                    (Pt-1 2020)*(Qt 2021)"},null,"Movement","Side Constraint"]
[null,"Proposed tariff","Existing tariff","PropTar\n$/Cust/year","ExistTar\n$/Cust/year","FcastVol\nCust #",null,"PropRev\nFixed","ExistRev\nFixed"]
[]
[null,"Single phase single element meter","Single phase single element meter",66.28,79.638004800000004,138549.0532807628,null,{"$f":"D8*F8","v":9183031.2514489591},{"$f":"E8*F8","v":11033770.170208845},null,{"$f":"IFERROR(H8/I8,\"\")","v":0.83226595350364674},{"$f":"IF(B8=\"\",\"\",IF(K8<$I$30,\"COMPLIANT\",\"BREACHED\"))","v":"COMPLIANT"}]
[null,"Single phase single element meter with contactor","Single phase single element meter with contactor",66.28,79.552576000000002,18322.516884338209,null,1214416.4190939364,1457603.4169525986,null,{"$f":"IFERROR(H9/I9,\"\")","v":0.83315969554524538},"COMPLIANT"]
[null,"Three phase direct connected meter","Three phase direct connected meter",81.14,96.600710000000007,23268.642018271676,null,1888017.6133625638,2247767.3397008772,null,0.83995241856918013,"COMPLIANT"]
[null,"Three phase Current transformer connected meter","Three phase Current transformer connected meter",90.1,107.671825,935.30760506133072,null,84271.215216025899,100706.27677333272,null,0.83680201389732178,"COMPLIANT"]
[null,null,null,null,null,null,null,0,0,null,"",""]
[null,null,null,null,null,null,null,0,0,null,"",""]
[null,null,null,null,null,null,null,0,0,null,"",""]
[null,null,null,null,null,null,null,0,0,null,"",""]
[null,null,null,null,null,null,null,0,0,null,"",""]
[null,null,null,null,null,null,null,{"$f":"SUM(H7:H16)","v":12369736.499121485},{"$f":"SUM(I7:I16)","v":14839847.203635655}]
[]
[]
[]
[]
[null,"Year (t)",null,{"$f":"'Model update'!C5","v":2021}]
[]
[null,"Table 1- Compliance with AER Final Determination Total Metering Annual Revenue",null,null,null,null,null,"Metering tariff rebalancing control"]
[null,"Revenue from  Metering charges for year t",null,{"$f":"H17","v":12369736.499121485},null,null,null,{"$f":"\"CPI \"&'Model update'!$C$5","v":"CPI 2021"},{"$f":"'Model update'!C30","v":-3.4843205574912606E-3}]
[null,"Total Annual Metering Revenue for year t",null,12369741.240501184]
[null,null,null,{"$f":"IF(D25=\"\",\"\",IF(D26>=D25,\"METERING REVENUE CAP FORMULA COMPLIANT\",\"METERING REVENUE CAP FORMULA BREACHED\"))","v":"METERING REVENUE CAP FORMULA COMPLIANT"}]
[]
[]
[null,null,null,null,null,null,null,null,{"$f":"(1+I25)*(1-I26)*(1+0.02)+SUM(I27:I28)","v":1.016445993031359}]

{"sheet":"Unmetered supply","index":5,"n_rows":14,"n_cols":23,"rows_kept":14,"cut":false,"hidden":false,"merged":[[3,19,3,21]]}
[null,{"$f":"\"Tariff Approval - \" &'[1]Model update'!C3","v":"Tariff Approval - AusNet Services"}]
[]
[null,{"$f":"\"PROPOSED \"&'[1]Model update'!C5&\" UNMETERED SUPPLY TARIFF\"","v":"PROPOSED 2021 UNMETERED SUPPLY TARIFF"}]
[null,null,{"$f":"\"P t-1 (\"&'[1]Model update'!$C$8&\")\"","v":"P t-1 (2020)"},null,null,null,{"$f":"\"Pt (\"&'[1]Model update'!$C$7&\")\"","v":"Pt (2021)"},null,null,null,{"$f":"\"Qt-2 (\"&'[1]Model update'!$C$9&\")\"","v":"Qt-2 (2019)"},null,null,null,"P t-1 * Qt-2",null,null,null,null,"Pt * Qt-2"]
[null,null,"($) per NMI","($) per meter","($) per light",null,"($) per NMI","($) per meter","($) per light",null,"NMIs","Meters","Lights",null,"$ Comp1","$ Comp2","$ Comp3","Total $",null,"NMIs","Meters","Lights"]
[null,"Proposed tariff","ExistTarComp1","ExistTarComp2","ExistTarComp3",null,"PropTarComp1","PropTarComp2","PropTarComp3",null,"ActVolComp1","ActVolComp2","ActVolComp3",null,"$Comp1","ExistRevComp2","ExistRevComp3","Exist Rev Total",null,"$PropRevComp1","$PropRevComp2","$ PropRevComp3","Total $"]
[null,"metering data services - unmetered supplies",null,0,0.66,null,{"$f":"ROUNDDOWN(C7*(1+$C$14),1)","v":0},null,{"$f":"ROUNDDOWN(E7*(1+$C$14),4)","v":0.65769999999999995},null,null,0,75871,null,{"$f":"IF($B7=\"\",\"\",C7*K7)","v":0},{"$f":"IF($B7=\"\",\"\",D7*L7)","v":0},{"$f":"IF($B7=\"\",\"\",E7*M7)","v":50074.86},{"$f":"SUM(O7:Q7)","v":50074.86},null,{"$f":"IF($B7=\"\",\"\",G7*K7)","v":0},{"$f":"IF($B7=\"\",\"\",H7*L7)","v":0},{"$f":"IF($B7=\"\",\"\",I7*M7)","v":49900.356699999997},{"$f":"SUM(T7:V7)","v":49900.356699999997}]
[]
[]
[null,"UNMETERED SUPPLY TARIFF CONTROL"]
[]
[null,"CPI"]
[]
[null,{"$f":"\"CPI \"&'[1]Model update'!C5","v":"CPI 2021"},{"$f":"'[1]Model update'!C30","v":-3.4843205574912606E-3}]

{"sheet":"Metering exit fees","index":6,"n_rows":10,"n_cols":6,"rows_kept":10,"cut":false,"hidden":false,"merged":[]}
[null,{"$f":"\"Tariff Approval - \"&'Model update'!C3","v":"Tariff Approval - Jemena"}]
[]
[null,"Proposed metering exit fees"]
[]
[null,"Metering type","2020 price cap","2021 price cap","Proposed 2021 price"]
[null,"Single Phase",535.30516298778662,{"$f":"IF(C6=\"\",\"\",C6)","v":535.30516298778662},{"$f":"D6","v":535.30516298778662},{"$f":"IF(E6=\"\",\"\",IF(E6<=D6,\"COMPLIANT\",\"BREACHED\"))","v":"COMPLIANT"}]
[null,"Single Phase, Two Element",537.6458772791965,{"$f":"IF(C7=\"\",\"\",C7)","v":537.6458772791965},{"$f":"D7","v":537.6458772791965},{"$f":"IF(E7=\"\",\"\",IF(E7<=D7,\"COMPLIANT\",\"BREACHED\"))","v":"COMPLIANT"}]
[null,"Three Phase DC",565.09513107812541,565.09513107812541,565.09513107812541,"COMPLIANT"]
[null,"Three Phase CT",566.17303079466956,566.17303079466956,566.17303079466956,"COMPLIANT"]
[null,null,null,"","",""]

{"sheet":"Public lighting","index":7,"n_rows":50,"n_cols":6,"rows_kept":50,"cut":false,"hidden":false,"merged":[]}
[null,{"$f":"\"Tariff Approval - \"&'Model update'!C3","v":"Tariff Approval - Jemena"}]
[]
[null,"Proposed public lighting prices"]
[]
[null,"Public lighting tariff","2020 price cap","2021 price cap","Proposed 2021 price"]
[null,"Existing Lights",null,{"$f":"IF(C6=\"\",\"\",C6/2)","v":""},{"$f":"D6","v":""},{"$f":"IF(E6=\"\",\"\",IF(E6<=D6,\"COMPLIANT\",\"BREACHED\"))","v":""}]
[null,"Mercury Vapour 80 watt",55.403899859809357,{"$f":"IF(C7=\"\",\"\",C7/2)","v":27.701949929904679},{"$f":"D7","v":27.701949929904679},{"$f":"IF(E7=\"\",\"\",IF(E7<=D7,\"COMPLIANT\",\"BREACHED\"))","v":"COMPLIANT"}]
[null,"Sodium High Pressure 150 watt",102.06945636876387,51.034728184381933,51.034728184381933,"COMPLIANT"]
[null,"Sodium High Pressure 250 watt",103.30984995146756,51.654924975733778,51.654924975733778,"COMPLIANT"]
[null,"55W Ind",69.2548748247617,34.62743741238085,34.62743741238085,"COMPLIANT"]
[null,"Fluorescent 20 watt",69.2548748247617,34.62743741238085,34.62743741238085,"COMPLIANT"]
[null,"Fluorescent 40 watt",69.2548748247617,34.62743741238085,34.62743741238085,"COMPLIANT"]
[null,"Fluorescent 80 watt",69.2548748247617,34.62743741238085,34.62743741238085,"COMPLIANT"]
[null,"Mercury Vapour 50 watt",69.2548748247617,34.62743741238085,34.62743741238085,"COMPLIANT"]
[null,"Mercury Vapour 125 watt",81.44373279391975,40.721866396959875,40.721866396959875,"COMPLIANT"]
[null,"Mercury Vapour 250 watt",99.177455953408852,49.588727976704426,49.588727976704426,"COMPLIANT"]
[null,"Mercury Vapour 400 watt",111.57463794758496,55.78731897379248,55.78731897379248,"COMPLIANT"]
[null,"Sodium High Pressure 50 watt",127.58682046095484,63.79341023047742,63.79341023047742,"COMPLIANT"]
[null,"Sodium Low Pressure 90 watt",108.1936237508897,54.09681187544485,54.09681187544485,"COMPLIANT"]
[null,"Sodium High Pressure 100 watt",139.83515522520651,69.917577612603253,69.917577612603253,"COMPLIANT"]
[null,"Sodium High Pressure 400 watt",137.40210043545184,68.701050217725921,68.701050217725921,"COMPLIANT"]
[null,"Metal Halide 70 watt",142.38802263971004,71.194011319855022,71.194011319855022,"COMPLIANT"]
[null,"Metal Halide 150 watt",226.59419313865581,113.29709656932791,113.29709656932791,"COMPLIANT"]
[null,"Metal Halide 250 watt",222.11617739565523,111.05808869782761,111.05808869782761,"COMPLIANT"]
[null,"Incandescent 100 watt",86.430083781302599,43.2150418906513,43.2150418906513,"COMPLIANT"]
[null,"Incandescent 150 watt",108.03760472662825,54.018802363314123,54.018802363314123,"COMPLIANT"]
[null,"Sodium High Pressure 250 watt (24 hrs)",161.16336592428939,80.581682962144697,80.581682962144697,"COMPLIANT"]
[null,"Metal Halide 100 watt",226.59419313865581,113.29709656932791,113.29709656932791,"COMPLIANT"]
[null,null,null,"","",""]
[null,"Energy Efficient Lights",null,"","",""]
[null,"T5 2X14W",38.35484103638926,19.17742051819463,19.17742051819463,"COMPLIANT"]
[null,"T5 (2x24W)",43.19698043633209,21.598490218166045,21.598490218166045,"COMPLIANT"]
[null,"LED 18W",25.134949579037436,12.567474789518718,12.567474789518718,"COMPLIANT"]
[null,"Compact Fluoro 32W",33.082464657935752,16.541232328967876,16.541232328967876,"COMPLIANT"]
[null,"Compact Fluoro 42W",37.309958323770019,18.654979161885009,18.654979161885009,"COMPLIANT"]
[null,null,null,"","",""]
[null,null,null,"","",""]
[null,null,null,"","",""]
[null,null,null,"","",""]
[null,null,null,"","",""]
[null,null,null,"","",""]
[null,null,null,"","",""]
[null,null,null,"","",""]
[null,null,null,"","",""]
[null,null,null,"","",""]
[null,null,null,"","",""]
[null,null,null,"","",""]
[null,null,null,"","",""]
[null,null,null,"","",""]
[null,null,null,"","",""]

{"sheet":"ANS","index":8,"n_rows":67,"n_cols":10,"rows_kept":67,"cut":false,"hidden":false,"merged":[[4,8,4,9]]}
[null,{"$f":"\"Tariff Approval - \"&'Model update'!C3","v":"Tariff Approval - Jemena"}]
[]
[null,"Proposed ancillary network service prices"]
[]
[null,"Ancillary network service","2020 price cap","2021 price cap","Proposed 2021 price",null,null,null,"Escalators"]
[null,"NORMAL HOURS",null,{"$f":"IF(C6=\"\",\"\",C6*(1+J6)*(1-J7))","v":""},{"$f":"D6","v":""},{"$f":"IF(E6=\"\",\"\",IF(E6<=D6,\"COMPLIANT\",\"BREACHED\"))","v":""},null,null,"CPI",{"$f":"'Model update'!C30","v":-3.4843205574912606E-3}]
[null,"Alternative Control Services - New Connection Services",null,{"$f":"IF(C7=\"\",\"\",C7*(1+J7)*(1-J8))","v":""},{"$f":"D7","v":""},{"$f":"IF(E7=\"\",\"\",IF(E7<=D7,\"COMPLIANT\",\"BREACHED\"))","v":""},null,null,"X-factor",{"$f":"'Model update'!C35","v":-1.1926767169156999E-3}]
[null,"Connection - single phase service connection to new premises - JEN is the responsible person for metering",631.01,{"$f":"IF(C8=\"\",\"\",C8*(1+$J$6)*(1-$J$7))","v":629.56132755209171},{"$f":"D8","v":629.56132755209171},"COMPLIANT"]
[null,"Connection - three phase service connection to new premises (less than 100amps) - JEN is the responsible person for metering",817.64,{"$f":"IF(C9=\"\",\"\",C9*(1+$J$6)*(1-$J$7))","v":815.76286248980568},{"$f":"D9","v":815.76286248980568},"COMPLIANT"]
[null,"Connection - single phase service connection to new premises - JEN is not the responsible person for metering",631.01,629.56132755209171,629.56132755209171,"COMPLIANT"]
[null,"Connection - three phase service connection to new premises (less than 100amps) - JEN is not the responsible person for metering",817.64,815.76286248980568,815.76286248980568,"COMPLIANT"]
[null,"Alternative Control Services - Network Services",null,{"$f":"IF(C12=\"\",\"\",C12*(1+$J$8)*(1-$J$9))","v":""},"",""]
[null,"Manual energisation of new premises ",38.54,{"$f":"IF(C13=\"\",\"\",C13*(1+$J$6)*(1-$J$7))","v":38.45151988693938},38.45151988693938,{"$f":"IF(E13=\"\",\"\",IF(E13<=D13,\"COMPLIANT\",\"BREACHED\"))","v":"COMPLIANT"}]
[null,"Manual re-energisation existing premises ",38.54,{"$f":"IF(C14=\"\",\"\",C14*(1+$J$6)*(1-$J$7))","v":38.45151988693938},38.45151988693938,"COMPLIANT"]
[null,"Manual de-energisation existing premises",59.46,59.323491761219906,59.323491761219906,"COMPLIANT"]
[null,"Temporary single-phase connection",614.59,613.17902458002254,613.17902458002254,"COMPLIANT"]
[null,"Temporary three-phase connection",786.48,784.67439960249305,784.67439960249305,"COMPLIANT"]
[null,"Reconnection after temporary disconnection for non-payment ",72.930000000000007,{"$f":"IF(C18=\"\",\"\",C18*(1+$J$6)*(1-$J$7))","v":72.762567341839357},72.762567341839357,"COMPLIANT"]
[null,"Special meter reads (including a special meter read)",34.42,34.340978580914722,34.340978580914722,"COMPLIANT"]
[null,"Service vehicle visit",478.95,477.85042682536618,477.85042682536618,"COMPLIANT"]
[null,"Wasted service truck visit - not JEN's fault ",444.19,443.17022881628441,443.17022881628441,"COMPLIANT"]
[null,"Fault response - not JEN's fault ",478.95,477.85042682536618,477.85042682536618,"COMPLIANT"]
[null,"Re-test types 5, 6 and AMI smart metering installations",405.68,404.74864005535977,404.74864005535977,"COMPLIANT"]
[null,"PV installation",0,0,0,"COMPLIANT"]
[null,"Remote meter re-configuration",54.49,54.364901884777545,54.364901884777545,"COMPLIANT"]
[null,"Remote de-energisation",10.42,10.396077769120609,10.396077769120609,"COMPLIANT"]
[null,"Remote re-energisation",10.42,10.396077769120609,10.396077769120609,"COMPLIANT"]
[null,null,null,null,null,""]
[null,null,null,"",{"$f":"D29","v":""},""]
[null,"AFTER HOURS",null,"","",""]
[null,"Alternative Control Services - New Connection Services",null,"","",""]
[null,"Connection - single phase service connection to new premises - JEN is the responsible person for metering",631.01,{"$f":"IF(C32=\"\",\"\",C32*(1+$J$6)*(1-$J$7))","v":629.56132755209171},629.56132755209171,"COMPLIANT"]
[null,"Connection - three phase service connection to new premises (less than 100amps) - JEN is the responsible person for metering",817.64,{"$f":"IF(C33=\"\",\"\",C33*(1+$J$6)*(1-$J$7))","v":815.76286248980568},815.76286248980568,"COMPLIANT"]
[null,"Connection - single phase service connection to new premises - JEN is not the responsible person for metering",631.01,629.56132755209171,629.56132755209171,"COMPLIANT"]
[null,"Connection - three phase service connection to new premises (less than 100amps) - JEN is not the responsible person for metering",817.64,815.76286248980568,815.76286248980568,"COMPLIANT"]
[null,"Alternative Control Services - Network Services",null,"","",""]
[null,"Manual energisation of new premises ",61.24,{"$f":"IF(C37=\"\",\"\",C37*(1+$J$6)*(1-$J$7))","v":61.09940523809464},61.09940523809464,"COMPLIANT"]
[null,"Manual re-energisation existing premises ",61.24,{"$f":"IF(C38=\"\",\"\",C38*(1+$J$6)*(1-$J$7))","v":61.09940523809464},61.09940523809464,"COMPLIANT"]
[null,"Manual de-energisation existing premises",78.08,77.900743974370158,77.900743974370158,"COMPLIANT"]
[null,"Temporary single-phase connection",614.59,613.17902458002254,613.17902458002254,"COMPLIANT"]
[null,"Temporary three-phase connection",786.48,{"$f":"IF(C41=\"\",\"\",C41*(1+$J$6)*(1-$J$7))","v":784.67439960249305},784.67439960249305,"COMPLIANT"]
[null,"Reconnection after temporary disconnection for non-payment ",81.430000000000007,81.243053046016442,81.243053046016442,"COMPLIANT"]
[null,"Service vehicle visit",629.54999999999995,628.10467941937418,628.10467941937418,"COMPLIANT"]
[null,"Wasted service truck visit - not JEN's fault ",629.54,628.09470237736923,628.09470237736923,"COMPLIANT"]
[null,"Fault response - not JEN's fault ",629.54999999999995,628.10467941937418,628.10467941937418,"COMPLIANT"]
[null,"Re-test types 5, 6 and AMI smart metering installations",667.67,666.13716354210715,666.13716354210715,"COMPLIANT"]
[null,null,null,"","",""]
[null,"QUOTED SERVICES",null,"","",""]
[null,"Back office/administration",92.08,{"$f":"IF(C49=\"\",\"\",C49*(1+$J$6)*(1-$J$7))","v":91.868602781250061},91.868602781250061,"COMPLIANT"]
[null,"Linesperson/field worker – Business hours",114.205,{"$f":"IF(C50=\"\",\"\",C50*(1+$J$6)*(1-$J$7))","v":113.94280821712276},113.94280821712276,"COMPLIANT"]
[null,"Linesperson/field worker – After hours",141.363,141.03845889406878,141.03845889406878,"COMPLIANT"]
[null,"Technical officer – Business hours",158.023,157.66021087425585,157.66021087425585,"COMPLIANT"]
[null,"Technical officer – After hours",184.93,184.50543779687854,184.50543779687854,"COMPLIANT"]
[null,"Engineer – Business hours",205.589,205.11700887483079,205.11700887483079,"COMPLIANT"]
[null,"Engineer – After hours",225.07,224.55328440460417,224.55328440460417,"COMPLIANT"]
[null,"Reserve feeder charge - per kW",16.483000000000001,16.445158336700096,16.445158336700096,"COMPLIANT"]
[null,null,null,"","",""]
[null,null,null,"","",""]
[null,null,null,"","",""]
[null,null,null,"","",""]
[null,null,null,"","",""]
[null,null,null,"","",""]
[null,null,null,"","",""]
[null,null,null,"","",""]
[null,null,null,"","",""]
[null,null,null,"","",""]
[null,null,null,"","",""]

{"sheet":"Prop2021DistTar","index":9,"n_rows":66,"n_cols":74,"rows_kept":66,"cut":false,"hidden":false,"merged":[]}
[null,{"$f":"\"Tariff Approval - \"&'Model update'!$C$3","v":"Tariff Approval - Jemena"},{"$f":"\"Prop\"&'Model update'!$C$5&\"DistTar\"","v":"Prop2021DistTar"}]
[]
[null,{"$f":"\"PROPOSED \"&'Model update'!$C$5&\" DISTRIBUTION TARIFFS\"","v":"PROPOSED 2021 DISTRIBUTION TARIFFS"}]
[null,null,null,{"$f":"\"Proposed Distribution Tariffs (Pt) for \"&'Model update'!$C$5","v":"Proposed Distribution Tariffs (Pt) for 2021"},null,null,null,null,null,null,null,null,null,null,null,null,null,{"$f":"\"Current Distribution Tariffs (Pt-1) for \"&'Model update'!$C$8","v":"Current Distribution Tariffs (Pt-1) for 2020"},null,null,null,null,null,null,null,null,null,null,null,null,null,{"$f":"\"Forecast Quantities (Qt) for \"&'Model update'!$C$5","v":"Forecast Quantities (Qt) for 2021"},null,null,null,null,null,null,null,null,null,null,null,null,null,{"$f":"\"Forecast Revenue (Pt \"&'Model update'!$C$5&\")*(Qt \" &'Model update'!$C$5&\")\"","v":"Forecast Revenue (Pt 2021)*(Qt 2021)"},null,null,null,null,null,null,null,null,null,null,null,null,null,null,{"$f":"\"Revenue (Pt-1 \"&'Model update'!$C$8&\")*(Qt \" &'Model update'!$C$5&\")\"","v":"Revenue (Pt-1 2020)*(Qt 2021)"}]
[null,"Proposed tariff","Existing tariff","PropTar\nFixed","PropTar\nPkBlk1","PropTar\nShoulder\n summer","PropTar\npeak\n non-summer","PropTar\nShoulder\n non-summer","PropTar\nOPkBlk1","PropTar\noff peak\n non-summer","PropTar\nOPkBlk3","PropTar\nOPkBlk4","PropTar\nDemBlk1","PropTar\nDemBlk2","PropTar\nDemBlk3","PropTar\nDemBlk4",null,"ExistTar\nFixed","ExistTar\nPkBlk1","ExistTar\nShoulder\n summer","ExistTar\npeak\n non-summer","ExistTar\nShoulder\n non-summer","ExistTar\nOPkBlk1","ExistTar\noff peak\n non-summer","ExistTar\nOPkBlk3","ExistTar\nOPkBlk4","ExistTar\nDemBlk1","ExistTar\nDemBlk2","ExistTar\nDemBlk3","ExistTar\nDemBlk4",null,"FcastVol\nFixed","FcastVol\nPkBlk1","FcastVol\nShoulder\n summer","FcastVol\npeak\n non-summer","FcastVol\nShoulder\n non-summer","FcastVol\nOPkBlk1","FcastVol\noff peak\n non-summer","FcastVol\nOPkBlk3","FcastVol\nOPkBlk4","FcastVol\nDemBlk1","FcastVol\nDemBlk2","FcastVol\nDemBlk3","FcastVol\nDemBlk4",null,"PropRev\nFixed","PropRev\nPkBlk1","PropRev\nShoulder\n summer","PropRev\npeak\n non-summer","PropRev\nShoulder\n non-summer","PropRev\nOPkBlk1","PropRev\noff peak\n non-summer","PropRev\nOPkBlk3","PropRev\nOPkBlk4","PropRev\nDemBlk1","PropRev\nDemBlk2","PropRev\nDemBlk3","PropRev\nDemBlk4","PropRev\nTotal",null,"ExistRev\nFixed","ExistRev\nPkBlk1","ExistRev\nShoulder\n summer","ExistRev\npeak\n non-summer","ExistRev\nShoulder\n non-summer","ExistRev\nOPkBlk1","ExistRev\noff peak\n non-summer","ExistRev\nOPkBlk3","ExistRev\nOPkBlk4","ExistRev\nDemBlk1","ExistRev\nDemBlk2","ExistRev\nDemBlk3","ExistRev\nDemBlk4","ExistRev\nTotal"]
[null,"Residential - General Purpose","Residential - General Purpose",67.457999999999998,6.3140000000000001,0,0,0,0,0,0,0,0,0,0,0,null,{"$f":"Est2020DistRev!D6","v":58.658999999999999},{"$f":"Est2020DistRev!E6","v":7.8209999999999997},{"$f":"Est2020DistRev!F6","v":0},{"$f":"Est2020DistRev!G6","v":0},{"$f":"Est2020DistRev!H6","v":0},{"$f":"Est2020DistRev!I6","v":0},{"$f":"Est2020DistRev!J6","v":0},{"$f":"Est2020DistRev!K6","v":0},{"$f":"Est2020DistRev!L6","v":0},{"$f":"Est2020DistRev!M6","v":0},{"$f":"Est2020DistRev!N6","v":0},{"$f":"Est2020DistRev!O6","v":0},{"$f":"Est2020DistRev!P6","v":0},null,158878.44437637989,639147331.87384105,{"$f":"Est2020DistRev!T6/2","v":0},{"$f":"Est2020DistRev!U6/2","v":0},{"$f":"Est2020DistRev!V6/2","v":0},{"$f":"Est2020DistRev!W6/2","v":0},{"$f":"Est2020DistRev!X6/2","v":0},{"$f":"Est2020DistRev!Y6/2","v":0},{"$f":"Est2020DistRev!Z6/2","v":0},{"$f":"Est2020DistRev!AA6/2","v":0},{"$f":"Est2020DistRev!AB6/2","v":0},{"$f":"Est2020DistRev!AC6/2","v":0},{"$f":"Est2020DistRev!AD6/2","v":0},null,{"$f":"D6*AF6","v":10717622.100741835},{"$f":"E6/100*AG6","v":40355762.534514323},0,0,0,0,0,0,0,{"$f":"M6*AO6","v":0},0,0,0,{"$f":"SUM(AT6:BF6)","v":51073384.635256156},null,{"$f":"R6*AF6","v":9319650.6686740685},{"$f":"S6/100*AG6","v":49987712.825853109},0,0,0,0,0,0,0,{"$f":"AA6*AO6","v":0},0,0,0,{"$f":"SUM(BI6:BU6)","v":59307363.494527176}]
[null,"Residential - General Purpose Demand","Residential - General Purpose Demand",67.457999999999998,1.825,0,0,0,0,0,0,0,60.030999999999999,0,0,0,null,{"$f":"Est2020DistRev!D7","v":58.658999999999999},{"$f":"Est2020DistRev!E7","v":3.4430000000000001},{"$f":"Est2020DistRev!F7","v":0},{"$f":"Est2020DistRev!G7","v":0},{"$f":"Est2020DistRev!H7","v":0},{"$f":"Est2020DistRev!I7","v":0},{"$f":"Est2020DistRev!J7","v":0},{"$f":"Est2020DistRev!K7","v":0},{"$f":"Est2020DistRev!L7","v":0},{"$f":"Est2020DistRev!M7","v":60.030999999999999},{"$f":"Est2020DistRev!N7","v":0},{"$f":"Est2020DistRev!O7","v":0},{"$f":"Est2020DistRev!P7","v":0},null,2.7105349653743454,30970.703999999998,{"$f":"Est2020DistRev!T7/2","v":0},{"$f":"Est2020DistRev!U7/2","v":0},{"$f":"Est2020DistRev!V7/2","v":0},{"$f":"Est2020DistRev!W7/2","v":0},{"$f":"Est2020DistRev!X7/2","v":0},{"$f":"Est2020DistRev!Y7/2","v":0},{"$f":"Est2020DistRev!Z7/2","v":0},5,{"$f":"Est2020DistRev!AB7/2","v":0},{"$f":"Est2020DistRev!AC7/2","v":0},{"$f":"Est2020DistRev!AD7/2","v":0},null,{"$f":"D7*AF7","v":182.84726769422258},{"$f":"E7/100*AG7","v":565.21534799999995},0,0,0,0,0,0,0,{"$f":"M7*AO7","v":300.15499999999997},{"$f":"N7*AP7","v":0},{"$f":"O7*AQ7","v":0},{"$f":"P7*AR7","v":0},{"$f":"SUM(AT7:BF7)","v":1048.2176156942226},null,{"$f":"R7*AF7","v":158.99727053389373},{"$f":"S7/100*AG7","v":1066.3213387200001},{"$f":"T7/100*AH7","v":0},{"$f":"U7/100*AI7","v":0},{"$f":"V7/100*AJ7","v":0},{"$f":"W7/100*AK7","v":0},{"$f":"X7/100*AL7","v":0},{"$f":"Y7/100*AM7","v":0},{"$f":"Z7/100*AN7","v":0},{"$f":"AA7*AO7","v":300.15499999999997},{"$f":"AB7*AP7","v":0},{"$f":"AC7*AQ7","v":0},{"$f":"AD7*AR7","v":0},{"$f":"SUM(BI7:BU7)","v":1525.4736092538938}]
[null,"Residential - Flexible","Residential - Flexible",67.457999999999998,12.063000000000001,7.4870000000000001,12.063000000000001,7.4870000000000001,3.64,3.64,0,0,0,0,0,0,null,{"$f":"Est2020DistRev!D8","v":58.658999999999999},{"$f":"Est2020DistRev!E8","v":12.601000000000001},{"$f":"Est2020DistRev!F8","v":7.8209999999999997},{"$f":"Est2020DistRev!G8","v":12.601000000000001},{"$f":"Est2020DistRev!H8","v":7.8209999999999997},{"$f":"Est2020DistRev!I8","v":3.8021235600000005},{"$f":"Est2020DistRev!J8","v":3.802},{"$f":"Est2020DistRev!K8","v":0},{"$f":"Est2020DistRev!L8","v":0},{"$f":"Est2020DistRev!M8","v":0},{"$f":"Est2020DistRev!N8","v":0},{"$f":"Est2020DistRev!O8","v":0},{"$f":"Est2020DistRev!P8","v":0},null,415.0488379731334,309609.74663146213,580688.3796264258,407370.3282449813,757351.41782394319,614725.70757555286,495167.14113703655,{"$f":"Est2020DistRev!Y8/2","v":0},{"$f":"Est2020DistRev!Z8/2","v":0},{"$f":"Est2020DistRev!AA8/2","v":0},{"$f":"Est2020DistRev!AB8/2","v":0},{"$f":"Est2020DistRev!AC8/2","v":0},{"$f":"Est2020DistRev!AD8/2","v":0},null,27998.364511991633,37348.223736153275,43476.138982630502,49141.082696192098,56702.900652478631,22376.015755750126,18024.083937388132,0,0,0,0,0,0,255066.81027258438,null,24346.349786666033,39013.924173030544,45415.638170582766,51332.735062150095,59232.454388010599,23372.630957106805,18826.254706030129,0,0,0,0,0,0,261539.98724357699]
[null,"Residential - Time of Use Interval Meter","Residential - Time of Use Interval Meter",67.457999999999998,12.129,0,0,0,1.7649999999999999,0,0,0,0,0,0,0,null,{"$f":"Est2020DistRev!D9","v":58.658999999999999},{"$f":"Est2020DistRev!E9","v":12.67},{"$f":"Est2020DistRev!F9","v":0},{"$f":"Est2020DistRev!G9","v":0},{"$f":"Est2020DistRev!H9","v":0},{"$f":"Est2020DistRev!I9","v":1.8440000000000001},{"$f":"Est2020DistRev!J9","v":0},{"$f":"Est2020DistRev!K9","v":0},{"$f":"Est2020DistRev!L9","v":0},{"$f":"Est2020DistRev!M9","v":0},{"$f":"Est2020DistRev!N9","v":0},{"$f":"Est2020DistRev!O9","v":0},{"$f":"Est2020DistRev!P9","v":0},null,7444.4842589952177,16938462.590739086,{"$f":"Est2020DistRev!T9/2","v":0},{"$f":"Est2020DistRev!U9/2","v":0},{"$f":"Est2020DistRev!V9/2","v":0},17531385.138661444,{"$f":"Est2020DistRev!X9/2","v":0},{"$f":"Est2020DistRev!Y9/2","v":0},{"$f":"Est2020DistRev!Z9/2","v":0},{"$f":"Est2020DistRev!AA9/2","v":0},{"$f":"Est2020DistRev!AB9/2","v":0},{"$f":"Est2020DistRev!AC9/2","v":0},{"$f":"Est2020DistRev!AD9/2","v":0},null,502190.01914329937,2054466.1276307437,0,0,0,309428.94769737445,0,0,0,0,0,0,0,2866085.0944714174,null,436686.00214840047,2146103.2102466421,0,0,0,323278.74195691705,0,0,0,0,0,0,0,2906067.9543519598]
[null,"Residential - TOU","Residential - TOU",99.122,8.7390000000000008,0,0,0,1.4750000000000001,0,0,0,0,0,0,0,null,{"$f":"Est2020DistRev!D10","v":99.122},{"$f":"Est2020DistRev!E10","v":8.7390000000000008},{"$f":"Est2020DistRev!F10","v":0},{"$f":"Est2020DistRev!G10","v":0},{"$f":"Est2020DistRev!H10","v":0},{"$f":"Est2020DistRev!I10","v":1.4750000000000001},{"$f":"Est2020DistRev!J10","v":0},{"$f":"Est2020DistRev!K10","v":0},{"$f":"Est2020DistRev!L10","v":0},{"$f":"Est2020DistRev!M10","v":0},{"$f":"Est2020DistRev!N10","v":0},{"$f":"Est2020DistRev!O10","v":0},{"$f":"Est2020DistRev!P10","v":0},null,678.12900963762252,3116768.9030617047,{"$f":"Est2020DistRev!T10/2","v":0},{"$f":"Est2020DistRev!U10/2","v":0},{"$f":"Est2020DistRev!V10/2","v":0},3413336.9183364362,{"$f":"Est2020DistRev!X10/2","v":0},{"$f":"Est2020DistRev!Y10/2","v":0},{"$f":"Est2020DistRev!Z10/2","v":0},{"$f":"Est2020DistRev!AA10/2","v":0},{"$f":"Est2020DistRev!AB10/2","v":0},{"$f":"Est2020DistRev!AC10/2","v":0},{"$f":"Est2020DistRev!AD10/2","v":0},null,67217.503693300416,272374.43443856243,0,0,0,50346.719545462438,0,0,0,0,0,0,0,389938.6576773253,null,67217.503693300416,272374.43443856243,0,0,0,50346.719545462438,0,0,0,0,0,0,0,389938.6576773253]
[null,"Residential - Off Peak Only","Residential - Off Peak Only",0,0,0,0,0,1.627,0,0,0,0,0,0,0,null,{"$f":"Est2020DistRev!D11","v":0},{"$f":"Est2020DistRev!E11","v":0},{"$f":"Est2020DistRev!F11","v":0},{"$f":"Est2020DistRev!G11","v":0},{"$f":"Est2020DistRev!H11","v":0},{"$f":"Est2020DistRev!I11","v":1.7},{"$f":"Est2020DistRev!J11","v":0},{"$f":"Est2020DistRev!K11","v":0},{"$f":"Est2020DistRev!L11","v":0},{"$f":"Est2020DistRev!M11","v":0},{"$f":"Est2020DistRev!N11","v":0},{"$f":"Est2020DistRev!O11","v":0},{"$f":"Est2020DistRev!P11","v":0},null,0,0,{"$f":"Est2020DistRev!T11/2","v":0},{"$f":"Est2020DistRev!U11/2","v":0},{"$f":"Est2020DistRev!V11/2","v":0},15302727.75693658,{"$f":"Est2020DistRev!X11/2","v":0},{"$f":"Est2020DistRev!Y11/2","v":0},{"$f":"Est2020DistRev!Z11/2","v":0},{"$f":"Est2020DistRev!AA11/2","v":0},{"$f":"Est2020DistRev!AB11/2","v":0},{"$f":"Est2020DistRev!AC11/2","v":0},{"$f":"Est2020DistRev!AD11/2","v":0},null,0,0,0,0,0,248975.38060535816,0,0,0,0,0,0,0,248975.38060535816,null,0,0,0,0,0,260146.37186792187,0,0,0,0,0,0,0,260146.37186792187]
[null,"Small Business - General Purpose","Small Business - General Purpose",116.705,7.6390000000000002,0,0,0,0,0,0,0,0,0,0,0,null,{"$f":"Est2020DistRev!D12","v":101.483},{"$f":"Est2020DistRev!E12","v":9.3460000000000001},{"$f":"Est2020DistRev!F12","v":0},{"$f":"Est2020DistRev!G12","v":0},{"$f":"Est2020DistRev!H12","v":0},{"$f":"Est2020DistRev!I12","v":0},{"$f":"Est2020DistRev!J12","v":0},{"$f":"Est2020DistRev!K12","v":0},{"$f":"Est2020DistRev!L12","v":0},{"$f":"Est2020DistRev!M12","v":0},{"$f":"Est2020DistRev!N12","v":0},{"$f":"Est2020DistRev!O12","v":0},{"$f":"Est2020DistRev!P12","v":0},null,9576.2728656799682,101667470.01587997,{"$f":"Est2020DistRev!T12/2","v":0},{"$f":"Est2020DistRev!U12/2","v":0},{"$f":"Est2020DistRev!V12/2","v":0},{"$f":"Est2020DistRev!W12/2","v":0},{"$f":"Est2020DistRev!X12/2","v":0},{"$f":"Est2020DistRev!Y12/2","v":0},{"$f":"Est2020DistRev!Z12/2","v":0},{"$f":"Est2020DistRev!AA12/2","v":0},{"$f":"Est2020DistRev!AB12/2","v":0},{"$f":"Est2020DistRev!AC12/2","v":0},{"$f":"Est2020DistRev!AD12/2","v":0},null,1117598.9247891807,7766378.0345130712,0,0,0,0,0,0,0,0,0,0,0,8883976.9593022522,null,971828.8992278002,9501841.7476841416,0,0,0,0,0,0,0,0,0,0,0,10473670.646911941]
[null,"Small Business - General Purpose Demand","Small Business - General Purpose Demand",116.705,6.024,0,0,0,0,0,0,0,58.183,0,0,0,null,{"$f":"Est2020DistRev!D13","v":101.483},{"$f":"Est2020DistRev!E13","v":7.3710000000000004},{"$f":"Est2020DistRev!F13","v":0},{"$f":"Est2020DistRev!G13","v":0},{"$f":"Est2020DistRev!H13","v":0},{"$f":"Est2020DistRev!I13","v":0},{"$f":"Est2020DistRev!J13","v":0},{"$f":"Est2020DistRev!K13","v":0},{"$f":"Est2020DistRev!L13","v":0},{"$f":"Est2020DistRev!M13","v":58.183},{"$f":"Est2020DistRev!N13","v":0},{"$f":"Est2020DistRev!O13","v":0},{"$f":"Est2020DistRev!P13","v":0},null,0.50591858632470232,null,{"$f":"Est2020DistRev!T13/2","v":0},{"$f":"Est2020DistRev!U13/2","v":0},{"$f":"Est2020DistRev!V13/2","v":0},null,{"$f":"Est2020DistRev!X13/2","v":0},{"$f":"Est2020DistRev!Y13/2","v":0},{"$f":"Est2020DistRev!Z13/2","v":0},null,{"$f":"Est2020DistRev!AB13/2","v":0},{"$f":"Est2020DistRev!AC13/2","v":0},{"$f":"Est2020DistRev!AD13/2","v":0},null,59.043228617024383,null,0,0,0,null,0,0,0,null,0,0,0,null,null,51.34213589598977,null,0,0,0,null,0,0,0,null,0,0,0]
[null,"Small Business - TOU Weekdays","Small Business - TOU Weekdays",179.43100000000001,9.0359999999999996,0,0,0,1.486,0,0,0,0,0,0,0,null,{"$f":"Est2020DistRev!D14","v":156.02699999999999},{"$f":"Est2020DistRev!E14","v":11.055999999999999},{"$f":"Est2020DistRev!F14","v":0},{"$f":"Est2020DistRev!G14","v":0},{"$f":"Est2020DistRev!H14","v":0},{"$f":"Est2020DistRev!I14","v":1.8180000000000001},{"$f":"Est2020DistRev!J14","v":0},{"$f":"Est2020DistRev!K14","v":0},{"$f":"Est2020DistRev!L14","v":0},{"$f":"Est2020DistRev!M14","v":0},{"$f":"Est2020DistRev!N14","v":0},{"$f":"Est2020DistRev!O14","v":0},{"$f":"Est2020DistRev!P14","v":0},null,3714.3530770786992,76073895.725184858,{"$f":"Est2020DistRev!T14/2","v":0},{"$f":"Est2020DistRev!U14/2","v":0},{"$f":"Est2020DistRev!V14/2","v":0},49617354.310763627,{"$f":"Est2020DistRev!X14/2","v":0},{"$f":"Est2020DistRev!Y14/2","v":0},{"$f":"Est2020DistRev!Z14/2","v":0},{"$f":"Est2020DistRev!AA14/2","v":0},{"$f":"Est2020DistRev!AB14/2","v":0},{"$f":"Est2020DistRev!AC14/2","v":0},{"$f":"Est2020DistRev!AD14/2","v":0},null,666470.08697330812,6874037.217727703,0,0,0,737313.88505794748,0,0,0,0,0,0,0,8277821.1897589592,null,579539.36755735811,8410729.9113764372,0,0,0,902043.50136968284,0,0,0,0,0,0,0,9892312.7803034782]
[null,"Small Business - TOU Weekdays Demand","Small Business - TOU Weekdays Demand",259.76100000000002,5.5650000000000004,0,0,0,1.734,0,0,0,58.183,0,0,0,null,{"$f":"Est2020DistRev!D15","v":225.87899999999999},{"$f":"Est2020DistRev!E15","v":6.8090000000000002},{"$f":"Est2020DistRev!F15","v":0},{"$f":"Est2020DistRev!G15","v":0},{"$f":"Est2020DistRev!H15","v":0},{"$f":"Est2020DistRev!I15","v":2.121},{"$f":"Est2020DistRev!J15","v":0},{"$f":"Est2020DistRev!K15","v":0},{"$f":"Est2020DistRev!L15","v":0},{"$f":"Est2020DistRev!M15","v":66.547394999999995},{"$f":"Est2020DistRev!N15","v":0},{"$f":"Est2020DistRev!O15","v":0},{"$f":"Est2020DistRev!P15","v":0},null,345.77848980005649,34833063.036605179,{"$f":"Est2020DistRev!T15/2","v":0},{"$f":"Est2020DistRev!U15/2","v":0},{"$f":"Est2020DistRev!V15/2","v":0},24232702.154806152,{"$f":"Est2020DistRev!X15/2","v":0},{"$f":"Est2020DistRev!Y15/2","v":0},{"$f":"Est2020DistRev!Z15/2","v":0},24819.492014977292,{"$f":"Est2020DistRev!AB15/2","v":0},{"$f":"Est2020DistRev!AC15/2","v":0},{"$f":"Est2020DistRev!AD15/2","v":0},null,89819.76628895248,1938459.9579870785,0,0,0,420195.05536433868,0,0,0,1444072.5039074237,0,0,0,3892547.2835477935,null,78104.099497546951,2371783.2621624465,0,0,0,513975.6127034385,0,0,0,1651672.5388200397,0,0,0,4615535.5131834717]
[null,"Small Business - TOU Opt out","Small Business - TOU Opt out",259.76100000000002,9.9209999999999994,0,0,0,1.631,0,0,0,0,0,0,0,null,{"$f":"Est2020DistRev!D16","v":225.87899999999999},{"$f":"Est2020DistRev!E16","v":11.055999999999999},{"$f":"Est2020DistRev!F16","v":0},{"$f":"Est2020DistRev!G16","v":0},{"$f":"Est2020DistRev!H16","v":0},{"$f":"Est2020DistRev!I16","v":1.8180000000000001},{"$f":"Est2020DistRev!J16","v":0},{"$f":"Est2020DistRev!K16","v":0},{"$f":"Est2020DistRev!L16","v":0},{"$f":"Est2020DistRev!M16","v":0},{"$f":"Est2020DistRev!N16","v":0},{"$f":"Est2020DistRev!O16","v":0},{"$f":"Est2020DistRev!P16","v":0},null,15.71720408182075,1276940.7568686081,{"$f":"Est2020DistRev!T16/2","v":0},{"$f":"Est2020DistRev!U16/2","v":0},{"$f":"Est2020DistRev!V16/2","v":0},390747.40380256937,{"$f":"Est2020DistRev!X16/2","v":0},{"$f":"Est2020DistRev!Y16/2","v":0},{"$f":"Est2020DistRev!Z16/2","v":0},{"$f":"Est2020DistRev!AA16/2","v":0},{"$f":"Est2020DistRev!AB16/2","v":0},{"$f":"Est2020DistRev!AC16/2","v":0},{"$f":"Est2020DistRev!AD16/2","v":0},null,4082.7166494978401,126685.2924889346,0,0,0,6373.0901560199072,0,0,0,0,0,0,0,137141.09929445235,null,3550.1863407975889,141178.57007939331,0,0,0,7103.7878011307121,0,0,0,0,0,0,0,151832.54422132159]
[null,"Small Business - TOU Extended","Small Business - TOU Extended",179.43100000000001,8.7870000000000008,0,0,0,1.768,0,0,0,0,0,0,0,null,{"$f":"Est2020DistRev!D17","v":156.02699999999999},{"$f":"Est2020DistRev!E17","v":9.7929999999999993},{"$f":"Est2020DistRev!F17","v":0},{"$f":"Est2020DistRev!G17","v":0},{"$f":"Est2020DistRev!H17","v":0},{"$f":"Est2020DistRev!I17","v":1.97},{"$f":"Est2020DistRev!J17","v":0},{"$f":"Est2020DistRev!K17","v":0},{"$f":"Est2020DistRev!L17","v":0},{"$f":"Est2020DistRev!M17","v":0},{"$f":"Est2020DistRev!N17","v":0},{"$f":"Est2020DistRev!O17","v":0},{"$f":"Est2020DistRev!P17","v":0},null,941.07344895285144,18814347.707058504,{"$f":"Est2020DistRev!T17/2","v":0},{"$f":"Est2020DistRev!U17/2","v":0},{"$f":"Est2020DistRev!V17/2","v":0},5757242.4415366901,{"$f":"Est2020DistRev!X17/2","v":0},{"$f":"Est2020DistRev!Y17/2","v":0},{"$f":"Est2020DistRev!Z17/2","v":0},{"$f":"Est2020DistRev!AA17/2","v":0},{"$f":"Est2020DistRev!AB17/2","v":0},{"$f":"Est2020DistRev!AC17/2","v":0},{"$f":"Est2020DistRev!AD17/2","v":0},null,168857.75001905911,1653216.7330192309,0,0,0,101788.04636636868,0,0,0,0,0,0,0,1923862.5294046586,null,146832.86701976653,1842489.0709522392,0,0,0,113417.67609827279,0,0,0,0,0,0,0,2102739.6140702786]
[null,"Small Business - TOU Extended Demand","Small Business - TOU Extended Demand",259.76100000000002,4.6399999999999997,0,0,0,2.0289999999999999,0,0,0,58.183,0,0,0,null,{"$f":"Est2020DistRev!D18","v":225.87899999999999},{"$f":"Est2020DistRev!E18","v":5.1710000000000003},{"$f":"Est2020DistRev!F18","v":0},{"$f":"Est2020DistRev!G18","v":0},{"$f":"Est2020DistRev!H18","v":0},{"$f":"Est2020DistRev!I18","v":2.2610000000000001},{"$f":"Est2020DistRev!J18","v":0},{"$f":"Est2020DistRev!K18","v":0},{"$f":"Est2020DistRev!L18","v":0},{"$f":"Est2020DistRev!M18","v":66.547394999999995},{"$f":"Est2020DistRev!N18","v":0},{"$f":"Est2020DistRev!O18","v":0},{"$f":"Est2020DistRev!P18","v":0},null,52.374579582041683,7861230.0296896184,{"$f":"Est2020DistRev!T18/2","v":0},{"$f":"Est2020DistRev!U18/2","v":0},{"$f":"Est2020DistRev!V18/2","v":0},2311605.6132966289,{"$f":"Est2020DistRev!X18/2","v":0},{"$f":"Est2020DistRev!Y18/2","v":0},{"$f":"Est2020DistRev!Z18/2","v":0},5262.5171647996431,{"$f":"Est2020DistRev!AB18/2","v":0},{"$f":"Est2020DistRev!AC18/2","v":0},{"$f":"Est2020DistRev!AD18/2","v":0},null,13604.87316681073,364761.07337759825,0,0,0,46902.4778937886,0,0,0,306189.03619953763,0,0,0,731457.4606377352,null,11830.317661411993,406504.20483525022,0,0,0,52265.402916636784,0,0,0,350206.80846020189,0,0,0,820806.73387350095]
[null,"Small Business - Unmetered Supply","Small Business - Unmetered Supply",0,8.57,0,0,0,1.5429999999999999,0,0,0,0,0,0,0,null,{"$f":"Est2020DistRev!D19","v":0},{"$f":"Est2020DistRev!E19","v":10.484999999999999},{"$f":"Est2020DistRev!F19","v":0},{"$f":"Est2020DistRev!G19","v":0},{"$f":"Est2020DistRev!H19","v":0},{"$f":"Est2020DistRev!I19","v":1.8879999999999999},{"$f":"Est2020DistRev!J19","v":0},{"$f":"Est2020DistRev!K19","v":0},{"$f":"Est2020DistRev!L19","v":0},{"$f":"Est2020DistRev!M19","v":0},{"$f":"Est2020DistRev!N19","v":0},{"$f":"Est2020DistRev!O19","v":0},{"$f":"Est2020DistRev!P19","v":0},null,0,6906799.9431120688,{"$f":"Est2020DistRev!T19/2","v":0},{"$f":"Est2020DistRev!U19/2","v":0},{"$f":"Est2020DistRev!V19/2","v":0},15374842.669164764,{"$f":"Est2020DistRev!X19/2","v":0},{"$f":"Est2020DistRev!Y19/2","v":0},{"$f":"Est2020DistRev!Z19/2","v":0},{"$f":"Est2020DistRev!AA19/2","v":0},{"$f":"Est2020DistRev!AB19/2","v":0},{"$f":"Est2020DistRev!AC19/2","v":0},{"$f":"Est2020DistRev!AD19/2","v":0},null,0,591912.75512470433,0,0,0,237233.82238521229,0,0,0,0,0,0,0,829146.57750991662,null,0,724177.97403530043,0,0,0,290277.0295938307,0,0,0,0,0,0,0,1014455.0036291311]
[null,"Large Business - LV 0.4 - 0.8  GWh","Large Business - LV 0.4 - 0.8  GWh",2465.4369999999999,1.1910000000000001,0,0,0,0.377,0,0,0,93.42,0,0,0,null,{"$f":"Est2020DistRev!D20","v":2465.4369999999999},{"$f":"Est2020DistRev!E20","v":2.0179999999999998},{"$f":"Est2020DistRev!F20","v":0},{"$f":"Est2020DistRev!G20","v":0},{"$f":"Est2020DistRev!H20","v":0},{"$f":"Est2020DistRev!I20","v":0.63900000000000001},{"$f":"Est2020DistRev!J20","v":0},{"$f":"Est2020DistRev!K20","v":0},{"$f":"Est2020DistRev!L20","v":0},{"$f":"Est2020DistRev!M20","v":100.021},{"$f":"Est2020DistRev!N20","v":0},{"$f":"Est2020DistRev!O20","v":0},{"$f":"Est2020DistRev!P20","v":0},null,388.55975348473487,87157927.195755512,{"$f":"Est2020DistRev!T20/2","v":0},{"$f":"Est2020DistRev!U20/2","v":0},{"$f":"Est2020DistRev!V20/2","v":0},55986708.410393946,{"$f":"Est2020DistRev!X20/2","v":0},{"$f":"Est2020DistRev!Y20/2","v":0},{"$f":"Est2020DistRev!Z20/2","v":0},72443.429716937651,{"$f":"Est2020DistRev!AB20/2","v":0},{"$f":"Est2020DistRev!AC20/2","v":0},{"$f":"Est2020DistRev!AD20/2","v":0},null,957969.59295214422,1038050.9129014482,0,0,0,211069.89070718517,0,0,0,6767665.2041563159,0,0,0,8974755.6007170938,null,957969.59295214422,1758846.9708103458,0,0,0,357755.06674241729,0,0,0,7245864.2837178214,0,0,0,10320435.914222728]
[null,"Large Business – LVEN Annual Consumption <= 0.8 GWh","Large Business – LVEN Annual Consumption <= 0.8 GWh",2465.4369999999999,1.1910000000000001,0,0,0,0.377,0,0,0,105.401,0,0,0,null,{"$f":"Est2020DistRev!D21","v":2465.4369999999999},{"$f":"Est2020DistRev!E21","v":2.036},{"$f":"Est2020DistRev!F21","v":0},{"$f":"Est2020DistRev!G21","v":0},{"$f":"Est2020DistRev!H21","v":0},{"$f":"Est2020DistRev!I21","v":0.63900000000000001},{"$f":"Est2020DistRev!J21","v":0},{"$f":"Est2020DistRev!K21","v":0},{"$f":"Est2020DistRev!L21","v":0},{"$f":"Est2020DistRev!M21","v":112.849},{"$f":"Est2020DistRev!N21","v":0},{"$f":"Est2020DistRev!O21","v":0},{"$f":"Est2020DistRev!P21","v":0},null,37.270949581273641,8221991.1611032225,{"$f":"Est2020DistRev!T21/2","v":0},{"$f":"Est2020DistRev!U21/2","v":0},{"$f":"Est2020DistRev!V21/2","v":0},5679598.8500206638,{"$f":"Est2020DistRev!X21/2","v":0},{"$f":"Est2020DistRev!Y21/2","v":0},{"$f":"Est2020DistRev!Z21/2","v":0},8689.7712447539852,{"$f":"Est2020DistRev!AB21/2","v":0},{"$f":"Est2020DistRev!AC21/2","v":0},{"$f":"Est2020DistRev!AD21/2","v":0},null,91889.178122806537,97923.914728739386,0,0,0,21412.087664577903,0,0,0,915910.5789683148,0,0,0,1127135.7594844387,null,91889.178122806537,167399.74004006162,0,0,0,36292.636651632041,0,0,0,980631.99519924249,0,0,0,1276213.5500137426]
[null,"Large Business - LV  0.8+ - 2.2  GWh","Large Business - LV  0.8+ - 2.2  GWh",4315.5290000000005,0.81200000000000006,0,0,0,0.371,0,0,0,86.350999999999999,0,0,0,null,{"$f":"Est2020DistRev!D22","v":4315.5290000000005},{"$f":"Est2020DistRev!E22","v":1.377},{"$f":"Est2020DistRev!F22","v":0},{"$f":"Est2020DistRev!G22","v":0},{"$f":"Est2020DistRev!H22","v":0},{"$f":"Est2020DistRev!I22","v":0.628},{"$f":"Est2020DistRev!J22","v":0},{"$f":"Est2020DistRev!K22","v":0},{"$f":"Est2020DistRev!L22","v":0},{"$f":"Est2020DistRev!M22","v":92.453000000000003},{"$f":"Est2020DistRev!N22","v":0},{"$f":"Est2020DistRev!O22","v":0},{"$f":"Est2020DistRev!P22","v":0},null,194.08658091709918,131452092.67548704,{"$f":"Est2020DistRev!T22/2","v":0},{"$f":"Est2020DistRev!U22/2","v":0},{"$f":"Est2020DistRev!V22/2","v":0},90838121.028442249,{"$f":"Est2020DistRev!X22/2","v":0},{"$f":"Est2020DistRev!Y22/2","v":0},{"$f":"Est2020DistRev!Z22/2","v":0},89510.481294754005,{"$f":"Est2020DistRev!AB22/2","v":0},{"$f":"Est2020DistRev!AC22/2","v":0},{"$f":"Est2020DistRev!AD22/2","v":0},null,837586.26845858817,1067390.992524955,0,0,0,337009.42901552073,0,0,0,7729319.570283303,0,0,0,9971306.2602823675,null,837586.26845858817,1810095.3161414564,0,0,0,570463.40005861735,0,0,0,8275512.5271438919,0,0,0,11493657.511802554]
[null,"Large Business - LVEN 0.8+ - 2.2 GWh","Large Business - LVEN 0.8+ - 2.2 GWh",4315.5290000000005,0.81200000000000006,0,0,0,0.371,0,0,0,94.994,0,0,0,null,{"$f":"Est2020DistRev!D23","v":4315.5290000000005},{"$f":"Est2020DistRev!E23","v":1.3759999999999999},{"$f":"Est2020DistRev!F23","v":0},{"$f":"Est2020DistRev!G23","v":0},{"$f":"Est2020DistRev!H23","v":0},{"$f":"Est2020DistRev!I23","v":0.628},{"$f":"Est2020DistRev!J23","v":0},{"$f":"Est2020DistRev!K23","v":0},{"$f":"Est2020DistRev!L23","v":0},{"$f":"Est2020DistRev!M23","v":101.70699999999999},{"$f":"Est2020DistRev!N23","v":0},{"$f":"Est2020DistRev!O23","v":0},{"$f":"Est2020DistRev!P23","v":0},null,20.559646869443732,14920570.347691048,{"$f":"Est2020DistRev!T23/2","v":0},{"$f":"Est2020DistRev!U23/2","v":0},{"$f":"Est2020DistRev!V23/2","v":0},9815052.4332260936,{"$f":"Est2020DistRev!X23/2","v":0},{"$f":"Est2020DistRev!Y23/2","v":0},{"$f":"Est2020DistRev!Z23/2","v":0},9299.5212644307703,{"$f":"Est2020DistRev!AB23/2","v":0},{"$f":"Est2020DistRev!AC23/2","v":0},{"$f":"Est2020DistRev!AD23/2","v":0},null,88725.752294843653,121155.03122325131,0,0,0,36413.844527268804,0,0,0,883398.72299333662,0,0,0,1129693.3510387004,null,88725.752294843653,205307.04798422882,0,0,0,61638.529280659866,0,0,0,945826.40924146026,0,0,0,1301497.7388011925]
[null,"Large Business - LV  2.2+ - 6.0  GWh","Large Business - LV  2.2+ - 6.0  GWh",6619.21,0.74299999999999999,0,0,0,0.30099999999999999,0,0,0,85.418999999999997,0,0,0,null,{"$f":"Est2020DistRev!D24","v":6619.21},{"$f":"Est2020DistRev!E24","v":1.26},{"$f":"Est2020DistRev!F24","v":0},{"$f":"Est2020DistRev!G24","v":0},{"$f":"Est2020DistRev!H24","v":0},{"$f":"Est2020DistRev!I24","v":0.51100000000000001},{"$f":"Est2020DistRev!J24","v":0},{"$f":"Est2020DistRev!K24","v":0},{"$f":"Est2020DistRev!L24","v":0},{"$f":"Est2020DistRev!M24","v":91.454999999999998},{"$f":"Est2020DistRev!N24","v":0},{"$f":"Est2020DistRev!O24","v":0},{"$f":"Est2020DistRev!P24","v":0},null,37.253377233521974,60763995.953942209,{"$f":"Est2020DistRev!T24/2","v":0},{"$f":"Est2020DistRev!U24/2","v":0},{"$f":"Est2020DistRev!V24/2","v":0},45943073.607626066,{"$f":"Est2020DistRev!X24/2","v":0},{"$f":"Est2020DistRev!Y24/2","v":0},{"$f":"Est2020DistRev!Z24/2","v":0},35969.743893851693,{"$f":"Est2020DistRev!AB24/2","v":0},{"$f":"Est2020DistRev!AC24/2","v":0},{"$f":"Est2020DistRev!AD24/2","v":0},null,246587.92711790098,451476.48993779061,0,0,0,138288.65155895447,0,0,0,3072499.5536689176,0,0,0,3908852.6222835639,null,246587.92711790098,765626.34901967179,0,0,0,234769.10613496919,0,0,0,3289612.9278122066,0,0,0,4536596.310084749]
[null,"Large Business - LVEN 2.2+  GWh","Large Business - LVEN 2.2+  GWh",6619.21,0.74299999999999999,0,0,0,0.30099999999999999,0,0,0,90.209000000000003,0,0,0,null,{"$f":"Est2020DistRev!D25","v":6619.21},{"$f":"Est2020DistRev!E25","v":1.26},{"$f":"Est2020DistRev!F25","v":0},{"$f":"Est2020DistRev!G25","v":0},{"$f":"Est2020DistRev!H25","v":0},{"$f":"Est2020DistRev!I25","v":0.51100000000000001},{"$f":"Est2020DistRev!J25","v":0},{"$f":"Est2020DistRev!K25","v":0},{"$f":"Est2020DistRev!L25","v":0},{"$f":"Est2020DistRev!M25","v":96.582999999999998},{"$f":"Est2020DistRev!N25","v":0},{"$f":"Est2020DistRev!O25","v":0},{"$f":"Est2020DistRev!P25","v":0},null,8.4171545730457673,10324851.161380298,{"$f":"Est2020DistRev!T25/2","v":0},{"$f":"Est2020DistRev!U25/2","v":0},{"$f":"Est2020DistRev!V25/2","v":0},7433408.8864938915,{"$f":"Est2020DistRev!X25/2","v":0},{"$f":"Est2020DistRev!Y25/2","v":0},{"$f":"Est2020DistRev!Z25/2","v":0},7906.6060482373114,{"$f":"Est2020DistRev!AB25/2","v":0},{"$f":"Est2020DistRev!AC25/2","v":0},{"$f":"Est2020DistRev!AD25/2","v":0},null,55714.913721450277,76713.64412905561,0,0,0,22374.560748346616,0,0,0,713247.02500543965,0,0,0,868050.14360429219,null,55714.913721450277,130093.12463339177,0,0,0,37984.719409983787,0,0,0,763643.73195690429,0,0,0,987436.48972173012]
[null,"Large Business - LVMS 2.2+ - 6.0  GWh","Large Business - LVMS 2.2+ - 6.0  GWh",3901.2840000000001,0.73599999999999999,0,0,0,0.30099999999999999,0,0,0,57.99,0,0,0,null,{"$f":"Est2020DistRev!D26","v":3901.2840000000001},{"$f":"Est2020DistRev!E26","v":1.2470000000000001},{"$f":"Est2020DistRev!F26","v":0},{"$f":"Est2020DistRev!G26","v":0},{"$f":"Est2020DistRev!H26","v":0},{"$f":"Est2020DistRev!I26","v":0.51100000000000001},{"$f":"Est2020DistRev!J26","v":0},{"$f":"Est2020DistRev!K26","v":0},{"$f":"Est2020DistRev!L26","v":0},{"$f":"Est2020DistRev!M26","v":62.088000000000001},{"$f":"Est2020DistRev!N26","v":0},{"$f":"Est2020DistRev!O26","v":0},{"$f":"Est2020DistRev!P26","v":0},null,5.2940165498851339,5811372.0693029007,{"$f":"Est2020DistRev!T26/2","v":0},{"$f":"Est2020DistRev!U26/2","v":0},{"$f":"Est2020DistRev!V26/2","v":0},4687995.7061018618,{"$f":"Est2020DistRev!X26/2","v":0},{"$f":"Est2020DistRev!Y26/2","v":0},{"$f":"Est2020DistRev!Z26/2","v":0},3940.7965694710319,{"$f":"Est2020DistRev!AB26/2","v":0},{"$f":"Est2020DistRev!AC26/2","v":0},{"$f":"Est2020DistRev!AD26/2","v":0},null,20653.462061802074,42771.698430069351,0,0,0,14110.867075366605,0,0,0,228526.79306362514,0,0,0,306062.82063086319,null,20653.462061802074,72467.809704207189,0,0,0,23955.658058180514,0,0,0,244676.17740531743,0,0,0,361753.10722950718]
[null,"Large Business - LV 6.0+ GWh","Large Business - LV 6.0+ GWh",9072.5110000000004,0.72299999999999998,0,0,0,0.26800000000000002,0,0,0,82.036000000000001,0,0,0,null,{"$f":"Est2020DistRev!D27","v":9072.5110000000004},{"$f":"Est2020DistRev!E27","v":1.2250000000000001},{"$f":"Est2020DistRev!F27","v":0},{"$f":"Est2020DistRev!G27","v":0},{"$f":"Est2020DistRev!H27","v":0},{"$f":"Est2020DistRev!I27","v":0.45500000000000002},{"$f":"Est2020DistRev!J27","v":0},{"$f":"Est2020DistRev!K27","v":0},{"$f":"Est2020DistRev!L27","v":0},{"$f":"Est2020DistRev!M27","v":87.832999999999998},{"$f":"Est2020DistRev!N27","v":0},{"$f":"Est2020DistRev!O27","v":0},{"$f":"Est2020DistRev!P27","v":0},null,11.316591952069883,25847888.304707155,{"$f":"Est2020DistRev!T27/2","v":0},{"$f":"Est2020DistRev!U27/2","v":0},{"$f":"Est2020DistRev!V27/2","v":0},21661553.605152186,{"$f":"Est2020DistRev!X27/2","v":0},{"$f":"Est2020DistRev!Y27/2","v":0},{"$f":"Est2020DistRev!Z27/2","v":0},13828.373147580272,{"$f":"Est2020DistRev!AB27/2","v":0},{"$f":"Est2020DistRev!AC27/2","v":0},{"$f":"Est2020DistRev!AD27/2","v":0},null,102669.9049676655,186880.23244303273,0,0,0,58052.963661807858,0,0,0,1134424.4195348953,0,0,0,1482027.5206074014,null,102669.9049676655,316636.63173266267,0,0,0,98560.068903442458,0,0,0,1214587.4986714181,0,0,0,1732454.1042751886]
[null,"Large Business - LVMS 6.0+ GWh","Large Business - LVMS 6.0+ GWh",5268.9719999999998,0.72299999999999998,0,0,0,0.26800000000000002,0,0,0,58.088000000000001,0,0,0,null,{"$f":"Est2020DistRev!D28","v":5268.9719999999998},{"$f":"Est2020DistRev!E28","v":1.2250000000000001},{"$f":"Est2020DistRev!F28","v":0},{"$f":"Est2020DistRev!G28","v":0},{"$f":"Est2020DistRev!H28","v":0},{"$f":"Est2020DistRev!I28","v":0.45500000000000002},{"$f":"Est2020DistRev!J28","v":0},{"$f":"Est2020DistRev!K28","v":0},{"$f":"Est2020DistRev!L28","v":0},{"$f":"Est2020DistRev!M28","v":62.192999999999998},{"$f":"Est2020DistRev!N28","v":0},{"$f":"Est2020DistRev!O28","v":0},{"$f":"Est2020DistRev!P28","v":0},null,14.438226954232185,26286303.386349238,{"$f":"Est2020DistRev!T28/2","v":0},{"$f":"Est2020DistRev!U28/2","v":0},{"$f":"Est2020DistRev!V28/2","v":0},20462464.546255786,{"$f":"Est2020DistRev!X28/2","v":0},{"$f":"Est2020DistRev!Y28/2","v":0},{"$f":"Est2020DistRev!Z28/2","v":0},14512.002707429958,{"$f":"Est2020DistRev!AB28/2","v":0},{"$f":"Est2020DistRev!AC28/2","v":0},{"$f":"Est2020DistRev!AD28/2","v":0},null,76074.613551494665,190049.97348330499,0,0,0,54839.404983965505,0,0,0,842973.21326919144,0,0,0,1163937.2052879566,null,76074.613551494665,322007.2164827782,0,0,0,93104.213685463837,0,0,0,902544.98438319133,0,0,0,1393731.0281029281]
[null,"Large Business - HV","Large Business - HV",6494.2150000000001,0.45900000000000002,0,0,0,0.13300000000000001,0,0,0,68.846000000000004,0,0,0,null,{"$f":"Est2020DistRev!D29","v":6494.2150000000001},{"$f":"Est2020DistRev!E29","v":0.81899999999999995},{"$f":"Est2020DistRev!F29","v":0},{"$f":"Est2020DistRev!G29","v":0},{"$f":"Est2020DistRev!H29","v":0},{"$f":"Est2020DistRev!I29","v":0.23699999999999999},{"$f":"Est2020DistRev!J29","v":0},{"$f":"Est2020DistRev!K29","v":0},{"$f":"Est2020DistRev!L29","v":0},{"$f":"Est2020DistRev!M29","v":73.632000000000005},{"$f":"Est2020DistRev!N29","v":0},{"$f":"Est2020DistRev!O29","v":0},{"$f":"Est2020DistRev!P29","v":0},null,44.37266666666666,123977469.73907256,{"$f":"Est2020DistRev!T29/2","v":0},{"$f":"Est2020DistRev!U29/2","v":0},{"$f":"Est2020DistRev!V29/2","v":0},98362237.170290887,{"$f":"Est2020DistRev!X29/2","v":0},{"$f":"Est2020DistRev!Y29/2","v":0},{"$f":"Est2020DistRev!Z29/2","v":0},92928.263601917453,{"$f":"Est2020DistRev!AB29/2","v":0},{"$f":"Est2020DistRev!AC29/2","v":0},{"$f":"Est2020DistRev!AD29/2","v":0},null,288165.63745666662,569056.58610234305,0,0,0,130821.77543648689,0,0,0,6397739.2359376093,0,0,0,7385783.2349331062,null,288165.63745666662,1015375.4771630042,0,0,0,233118.50209358937,0,0,0,6842493.9055363862,0,0,0,8379153.5222496465]
[null,"Large Business – HVEN","Large Business – HVEN",6494.2150000000001,0.45900000000000002,0,0,0,0.13300000000000001,0,0,0,70.932000000000002,0,0,0,null,{"$f":"Est2020DistRev!D30","v":6494.2150000000001},{"$f":"Est2020DistRev!E30","v":0.82199999999999995},{"$f":"Est2020DistRev!F30","v":0},{"$f":"Est2020DistRev!G30","v":0},{"$f":"Est2020DistRev!H30","v":0},{"$f":"Est2020DistRev!I30","v":0.23699999999999999},{"$f":"Est2020DistRev!J30","v":0},{"$f":"Est2020DistRev!K30","v":0},{"$f":"Est2020DistRev!L30","v":0},{"$f":"Est2020DistRev!M30","v":75.863},{"$f":"Est2020DistRev!N30","v":0},{"$f":"Est2020DistRev!O30","v":0},{"$f":"Est2020DistRev!P30","v":0},null,1,null,{"$f":"Est2020DistRev!T30/2","v":0},{"$f":"Est2020DistRev!U30/2","v":0},{"$f":"Est2020DistRev!V30/2","v":0},null,{"$f":"Est2020DistRev!X30/2","v":0},{"$f":"Est2020DistRev!Y30/2","v":0},{"$f":"Est2020DistRev!Z30/2","v":0},null,{"$f":"Est2020DistRev!AB30/2","v":0},{"$f":"Est2020DistRev!AC30/2","v":0},{"$f":"Est2020DistRev!AD30/2","v":0},null,6494.2150000000001,null,0,0,0,null,0,0,0,null,0,0,0,null,null,6494.2150000000001,null,0,0,0,null,0,0,0,null,0,0,0]
[null,"Large Business - HVRF","Large Business - HVRF",6494.2150000000001,0.45400000000000001,0,0,0,0.13300000000000001,0,0,0,63.26,0,0,0,null,{"$f":"Est2020DistRev!D31","v":6494.2150000000001},{"$f":"Est2020DistRev!E31","v":0.81100000000000005},{"$f":"Est2020DistRev!F31","v":0},{"$f":"Est2020DistRev!G31","v":0},{"$f":"Est2020DistRev!H31","v":0},{"$f":"Est2020DistRev!I31","v":0.23699999999999999},{"$f":"Est2020DistRev!J31","v":0},{"$f":"Est2020DistRev!K31","v":0},{"$f":"Est2020DistRev!L31","v":0},{"$f":"Est2020DistRev!M31","v":67.658000000000001},{"$f":"Est2020DistRev!N31","v":0},{"$f":"Est2020DistRev!O31","v":0},{"$f":"Est2020DistRev!P31","v":0},null,0.98333333333333328,null,{"$f":"Est2020DistRev!T31/2","v":0},{"$f":"Est2020DistRev!U31/2","v":0},{"$f":"Est2020DistRev!V31/2","v":0},null,{"$f":"Est2020DistRev!X31/2","v":0},{"$f":"Est2020DistRev!Y31/2","v":0},{"$f":"Est2020DistRev!Z31/2","v":0},null,{"$f":"Est2020DistRev!AB31/2","v":0},{"$f":"Est2020DistRev!AC31/2","v":0},{"$f":"Est2020DistRev!AD31/2","v":0},null,6385.9780833333334,null,0,0,0,null,0,0,0,null,0,0,0,null,null,6385.9780833333334,null,0,0,0,null,0,0,0,null,0,0,0]
[null,"Large Business - HV Ann Cons >= 55GWh","Large Business - HV Ann Cons >= 55GWh",6066.2610000000004,0.438,0,0,0,0.10299999999999999,0,0,0,61.082000000000001,0,0,0,null,{"$f":"Est2020DistRev!D32","v":6066.2610000000004},{"$f":"Est2020DistRev!E32","v":0.78200000000000003},{"$f":"Est2020DistRev!F32","v":0},{"$f":"Est2020DistRev!G32","v":0},{"$f":"Est2020DistRev!H32","v":0},{"$f":"Est2020DistRev!I32","v":0.184},{"$f":"Est2020DistRev!J32","v":0},{"$f":"Est2020DistRev!K32","v":0},{"$f":"Est2020DistRev!L32","v":0},{"$f":"Est2020DistRev!M32","v":65.328000000000003},{"$f":"Est2020DistRev!N32","v":0},{"$f":"Est2020DistRev!O32","v":0},{"$f":"Est2020DistRev!P32","v":0},null,0.5,null,{"$f":"Est2020DistRev!T32/2","v":0},{"$f":"Est2020DistRev!U32/2","v":0},{"$f":"Est2020DistRev!V32/2","v":0},null,{"$f":"Est2020DistRev!X32/2","v":0},{"$f":"Est2020DistRev!Y32/2","v":0},{"$f":"Est2020DistRev!Z32/2","v":0},null,{"$f":"Est2020DistRev!AB32/2","v":0},{"$f":"Est2020DistRev!AC32/2","v":0},{"$f":"Est2020DistRev!AD32/2","v":0},null,3033.1305000000002,null,0,0,0,null,0,0,0,null,0,0,0,null,null,3033.1305000000002,null,0,0,0,null,0,0,0,null,0,0,0]
[null,"Large Business - Subtransmission","Large Business - Subtransmission",40563.08,7.5999999999999998E-2,0,0,0,2.1999999999999999E-2,0,0,0,18.593,0,0,0,null,{"$f":"Est2020DistRev!D33","v":40563.08},{"$f":"Est2020DistRev!E33","v":0.153},{"$f":"Est2020DistRev!F33","v":0},{"$f":"Est2020DistRev!G33","v":0},{"$f":"Est2020DistRev!H33","v":0},{"$f":"Est2020DistRev!I33","v":4.4999999999999998E-2},{"$f":"Est2020DistRev!J33","v":0},{"$f":"Est2020DistRev!K33","v":0},{"$f":"Est2020DistRev!L33","v":0},{"$f":"Est2020DistRev!M33","v":20.196999999999999},{"$f":"Est2020DistRev!N33","v":0},{"$f":"Est2020DistRev!O33","v":0},{"$f":"Est2020DistRev!P33","v":0},{"$f":"Est2020DistRev!Q33","v":0},1.5,null,{"$f":"Est2020DistRev!T33/2","v":0},{"$f":"Est2020DistRev!U33/2","v":0},{"$f":"Est2020DistRev!V33/2","v":0},null,{"$f":"Est2020DistRev!X33/2","v":0},{"$f":"Est2020DistRev!Y33/2","v":0},{"$f":"Est2020DistRev!Z33/2","v":0},null,{"$f":"Est2020DistRev!AB33/2","v":0},{"$f":"Est2020DistRev!AC33/2","v":0},{"$f":"Est2020DistRev!AD33/2","v":0},null,60844.62,null,0,0,0,null,0,0,0,null,0,0,0,null,null,60844.62,null,0,0,0,null,0,0,0,null,0,0,0]
[null,"Large Business - Subtransmission MA","Large Business - Subtransmission MA",40563.08,7.5999999999999998E-2,0,0,0,2.1999999999999999E-2,0,0,0,18.670999999999999,0,0,0,null,{"$f":"Est2020DistRev!D34","v":40563.08},{"$f":"Est2020DistRev!E34","v":0.153},{"$f":"Est2020DistRev!F34","v":0},{"$f":"Est2020DistRev!G34","v":0},{"$f":"Est2020DistRev!H34","v":0},{"$f":"Est2020DistRev!I34","v":4.4999999999999998E-2},{"$f":"Est2020DistRev!J34","v":0},{"$f":"Est2020DistRev!K34","v":0},{"$f":"Est2020DistRev!L34","v":0},{"$f":"Est2020DistRev!M34","v":20.280999999999999},{"$f":"Est2020DistRev!N34","v":0},{"$f":"Est2020DistRev!O34","v":0},{"$f":"Est2020DistRev!P34","v":0},{"$f":"Est2020DistRev!Q34","v":0},0.5,null,{"$f":"Est2020DistRev!T34/2","v":0},{"$f":"Est2020DistRev!U34/2","v":0},{"$f":"Est2020DistRev!V34/2","v":0},null,{"$f":"Est2020DistRev!X34/2","v":0},{"$f":"Est2020DistRev!Y34/2","v":0},{"$f":"Est2020DistRev!Z34/2","v":0},null,{"$f":"Est2020DistRev!AB34/2","v":0},{"$f":"Est2020DistRev!AC34/2","v":0},{"$f":"Est2020DistRev!AD34/2","v":0},null,20281.54,null,0,0,0,null,0,0,0,null,0,0,0,null,null,20281.54,null,0,0,0,null,0,0,0,null,0,0,0]
[null,"Large Business - Subtransmission EG","Large Business - Subtransmission EG",31516.883999999998,7.2999999999999995E-2,0,0,0,1.0999999999999999E-2,0,0,0,3.202,0,0,0,null,{"$f":"Est2020DistRev!D35","v":31516.883999999998},{"$f":"Est2020DistRev!E35","v":0.14599999999999999},{"$f":"Est2020DistRev!F35","v":0},{"$f":"Est2020DistRev!G35","v":0},{"$f":"Est2020DistRev!H35","v":0},{"$f":"Est2020DistRev!I35","v":2.3E-2},{"$f":"Est2020DistRev!J35","v":0},{"$f":"Est2020DistRev!K35","v":0},{"$f":"Est2020DistRev!L35","v":0},{"$f":"Est2020DistRev!M35","v":3.4780000000000002},{"$f":"Est2020DistRev!N35","v":0},{"$f":"Est2020DistRev!O35","v":0},{"$f":"Est2020DistRev!P35","v":0},{"$f":"Est2020DistRev!Q35","v":0},0.5,null,{"$f":"Est2020DistRev!T35/2","v":0},{"$f":"Est2020DistRev!U35/2","v":0},{"$f":"Est2020DistRev!V35/2","v":0},null,{"$f":"Est2020DistRev!X35/2","v":0},{"$f":"Est2020DistRev!Y35/2","v":0},{"$f":"Est2020DistRev!Z35/2","v":0},null,{"$f":"Est2020DistRev!AB35/2","v":0},{"$f":"Est2020DistRev!AC35/2","v":0},{"$f":"Est2020DistRev!AD35/2","v":0},null,15758.441999999999,null,{"$f":"F35/100*AH35","v":0},0,0,null,0,0,0,null,{"$f":"N35*AP35","v":0},{"$f":"O35*AQ35","v":0},{"$f":"P35*AR35","v":0},null,null,{"$f":"R35*AF35","v":15758.441999999999},null,{"$f":"T35/100*AH35","v":0},{"$f":"U35/100*AI35","v":0},{"$f":"V35/100*AJ35","v":0},null,{"$f":"X35/100*AL35","v":0},{"$f":"Y35/100*AM35","v":0},{"$f":"Z35/100*AN35","v":0},null,{"$f":"AB35*AP35","v":0},{"$f":"AC35*AQ35","v":0},{"$f":"AD35*AR35","v":0}]
[null,null,null,null,null,null,null,null,null,null,null,null,null,null,null,null,null,{"$f":"Est2020DistRev!D36","v":0},{"$f":"Est2020DistRev!E36","v":0},{"$f":"Est2020DistRev!F36","v":0},{"$f":"Est2020DistRev!G36","v":0},{"$f":"Est2020DistRev!H36","v":0},{"$f":"Est2020DistRev!I36","v":0},{"$f":"Est2020DistRev!J36","v":0},{"$f":"Est2020DistRev!K36","v":0},{"$f":"Est2020DistRev!L36","v":0},{"$f":"Est2020DistRev!M36","v":0},{"$f":"Est2020DistRev!N36","v":0},{"$f":"Est2020DistRev!O36","v":0},{"$f":"Est2020DistRev!P36","v":0},null,{"$f":"Est2020DistRev!R36/2","v":0},{"$f":"Est2020DistRev!S36/2","v":0},{"$f":"Est2020DistRev!T36/2","v":0},{"$f":"Est2020DistRev!U36/2","v":0},{"$f":"Est2020DistRev!V36/2","v":0},{"$f":"Est2020DistRev!W36/2","v":0},{"$f":"Est2020DistRev!X36/2","v":0},{"$f":"Est2020DistRev!Y36/2","v":0},{"$f":"Est2020DistRev!Z36/2","v":0},{"$f":"Est2020DistRev!AA36/2","v":0},{"$f":"Est2020DistRev!AB36/2","v":0},{"$f":"Est2020DistRev!AC36/2","v":0},{"$f":"Est2020DistRev!AD36/2","v":0},null,0,0,0,0,0,0,0,0,0,0,0,0,0,0,null,0,0,0,0,0,0,0,0,0,0,0,0,0,0]
[null,null,null,null,null,null,null,null,null,null,null,null,null,null,null,null,null,{"$f":"Est2020DistRev!D37","v":0},{"$f":"Est2020DistRev!E37","v":0},{"$f":"Est2020DistRev!F37","v":0},{"$f":"Est2020DistRev!G37","v":0},{"$f":"Est2020DistRev!H37","v":0},{"$f":"Est2020DistRev!I37","v":0},{"$f":"Est2020DistRev!J37","v":0},{"$f":"Est2020DistRev!K37","v":0},{"$f":"Est2020DistRev!L37","v":0},{"$f":"Est2020DistRev!M37","v":0},{"$f":"Est2020DistRev!N37","v":0},{"$f":"Est2020DistRev!O37","v":0},{"$f":"Est2020DistRev!P37","v":0},null,{"$f":"Est2020DistRev!R37/2","v":0},{"$f":"Est2020DistRev!S37/2","v":0},{"$f":"Est2020DistRev!T37/2","v":0},{"$f":"Est2020DistRev!U37/2","v":0},{"$f":"Est2020DistRev!V37/2","v":0},{"$f":"Est2020DistRev!W37/2","v":0},{"$f":"Est2020DistRev!X37/2","v":0},{"$f":"Est2020DistRev!Y37/2","v":0},{"$f":"Est2020DistRev!Z37/2","v":0},{"$f":"Est2020DistRev!AA37/2","v":0},{"$f":"Est2020DistRev!AB37/2","v":0},{"$f":"Est2020DistRev!AC37/2","v":0},{"$f":"Est2020DistRev!AD37/2","v":0},null,0,0,0,0,0,0,0,0,0,0,0,0,0,0,null,0,0,0,0,0,0,0,0,0,0,0,0,0,0]
[null,null,null,null,null,null,null,null,null,null,null,null,null,null,null,null,null,{"$f":"Est2020DistRev!D38","v":0},{"$f":"Est2020DistRev!E38","v":0},{"$f":"Est2020DistRev!F38","v":0},{"$f":"Est2020DistRev!G38","v":0},{"$f":"Est2020DistRev!H38","v":0},{"$f":"Est2020DistRev!I38","v":0},{"$f":"Est2020DistRev!J38","v":0},{"$f":"Est2020DistRev!K38","v":0},{"$f":"Est2020DistRev!L38","v":0},{"$f":"Est2020DistRev!M38","v":0},{"$f":"Est2020DistRev!N38","v":0},{"$f":"Est2020DistRev!O38","v":0},{"$f":"Est2020DistRev!P38","v":0},null,{"$f":"Est2020DistRev!R38/2","v":0},{"$f":"Est2020DistRev!S38/2","v":0},{"$f":"Est2020DistRev!T38/2","v":0},{"$f":"Est2020DistRev!U38/2","v":0},{"$f":"Est2020DistRev!V38/2","v":0},{"$f":"Est2020DistRev!W38/2","v":0},{"$f":"Est2020DistRev!X38/2","v":0},{"$f":"Est2020DistRev!Y38/2","v":0},{"$f":"Est2020DistRev!Z38/2","v":0},{"$f":"Est2020DistRev!AA38/2","v":0},{"$f":"Est2020DistRev!AB38/2","v":0},{"$f":"Est2020DistRev!AC38/2","v":0},{"$f":"Est2020DistRev!AD38/2","v":0},null,0,0,0,0,0,0,0,0,{"$f":"L38/100*AN38","v":0},0,0,0,0,0,null,0,0,0,0,0,0,0,0,0,0,0,0,0,0]
[null,null,null,null,null,null,null,null,null,null,null,null,null,null,null,null,null,{"$f":"Est2020DistRev!D39","v":0},{"$f":"Est2020DistRev!E39","v":0},{"$f":"Est2020DistRev!F39","v":0},{"$f":"Est2020DistRev!G39","v":0},{"$f":"Est2020DistRev!H39","v":0},{"$f":"Est2020DistRev!I39","v":0},{"$f":"Est2020DistRev!J39","v":0},{"$f":"Est2020DistRev!K39","v":0},{"$f":"Est2020DistRev!L39","v":0},{"$f":"Est2020DistRev!M39","v":0},{"$f":"Est2020DistRev!N39","v":0},{"$f":"Est2020DistRev!O39","v":0},{"$f":"Est2020DistRev!P39","v":0},null,{"$f":"Est2020DistRev!R39/2","v":0},{"$f":"Est2020DistRev!S39/2","v":0},{"$f":"Est2020DistRev!T39/2","v":0},{"$f":"Est2020DistRev!U39/2","v":0},{"$f":"Est2020DistRev!V39/2","v":0},{"$f":"Est2020DistRev!W39/2","v":0},{"$f":"Est2020DistRev!X39/2","v":0},{"$f":"Est2020DistRev!Y39/2","v":0},{"$f":"Est2020DistRev!Z39/2","v":0},{"$f":"Est2020DistRev!AA39/2","v":0},{"$f":"Est2020DistRev!AB39/2","v":0},{"$f":"Est2020DistRev!AC39/2","v":0},{"$f":"Est2020DistRev!AD39/2","v":0},null,0,0,0,0,0,0,0,0,0,0,0,0,0,0,null,0,0,0,0,0,0,0,0,0,0,0,0,0,0]
[null,null,null,null,null,null,null,null,null,null,null,null,null,null,null,null,null,{"$f":"Est2020DistRev!D40","v":0},{"$f":"Est2020DistRev!E40","v":0},{"$f":"Est2020DistRev!F40","v":0},{"$f":"Est2020DistRev!G40","v":0},{"$f":"Est2020DistRev!H40","v":0},{"$f":"Est2020DistRev!I40","v":0},{"$f":"Est2020DistRev!J40","v":0},{"$f":"Est2020DistRev!K40","v":0},{"$f":"Est2020DistRev!L40","v":0},{"$f":"Est2020DistRev!M40","v":0},{"$f":"Est2020DistRev!N40","v":0},{"$f":"Est2020DistRev!O40","v":0},{"$f":"Est2020DistRev!P40","v":0},null,{"$f":"Est2020DistRev!R40/2","v":0},{"$f":"Est2020DistRev!S40/2","v":0},{"$f":"Est2020DistRev!T40/2","v":0},{"$f":"Est2020DistRev!U40/2","v":0},{"$f":"Est2020DistRev!V40/2","v":0},{"$f":"Est2020DistRev!W40/2","v":0},{"$f":"Est2020DistRev!X40/2","v":0},{"$f":"Est2020DistRev!Y40/2","v":0},{"$f":"Est2020DistRev!Z40/2","v":0},{"$f":"Est2020DistRev!AA40/2","v":0},{"$f":"Est2020DistRev!AB40/2","v":0},{"$f":"Est2020DistRev!AC40/2","v":0},{"$f":"Est2020DistRev!AD40/2","v":0},null,0,0,0,0,0,0,0,0,0,0,0,0,0,0,null,0,0,0,0,0,0,0,0,0,0,0,0,0,0]
[null,null,null,null,null,null,null,null,null,null,null,null,null,null,null,null,null,{"$f":"Est2020DistRev!D41","v":0},{"$f":"Est2020DistRev!E41","v":0},{"$f":"Est2020DistRev!F41","v":0},{"$f":"Est2020DistRev!G41","v":0},{"$f":"Est2020DistRev!H41","v":0},{"$f":"Est2020DistRev!I41","v":0},{"$f":"Est2020DistRev!J41","v":0},{"$f":"Est2020DistRev!K41","v":0},{"$f":"Est2020DistRev!L41","v":0},{"$f":"Est2020DistRev!M41","v":0},{"$f":"Est2020DistRev!N41","v":0},{"$f":"Est2020DistRev!O41","v":0},{"$f":"Est2020DistRev!P41","v":0},null,{"$f":"Est2020DistRev!R41/2","v":0},{"$f":"Est2020DistRev!S41/2","v":0},{"$f":"Est2020DistRev!T41/2","v":0},{"$f":"Est2020DistRev!U41/2","v":0},{"$f":"Est2020DistRev!V41/2","v":0},{"$f":"Est2020DistRev!W41/2","v":0},{"$f":"Est2020DistRev!X41/2","v":0},{"$f":"Est2020DistRev!Y41/2","v":0},{"$f":"Est2020DistRev!Z41/2","v":0},{"$f":"Est2020DistRev!AA41/2","v":0},{"$f":"Est2020DistRev!AB41/2","v":0},{"$f":"Est2020DistRev!AC41/2","v":0},{"$f":"Est2020DistRev!AD41/2","v":0},null,0,0,0,0,0,0,0,0,0,0,0,0,0,0,null,0,0,0,0,0,0,0,0,0,0,0,0,0,0]
[null,null,null,null,null,null,null,null,null,null,null,null,null,null,null,null,null,{"$f":"Est2020DistRev!D42","v":0},{"$f":"Est2020DistRev!E42","v":0},{"$f":"Est2020DistRev!F42","v":0},{"$f":"Est2020DistRev!G42","v":0},{"$f":"Est2020DistRev!H42","v":0},{"$f":"Est2020DistRev!I42","v":0},{"$f":"Est2020DistRev!J42","v":0},{"$f":"Est2020DistRev!K42","v":0},{"$f":"Est2020DistRev!L42","v":0},{"$f":"Est2020DistRev!M42","v":0},{"$f":"Est2020DistRev!N42","v":0},{"$f":"Est2020DistRev!O42","v":0},{"$f":"Est2020DistRev!P42","v":0},null,{"$f":"Est2020DistRev!R42/2","v":0},{"$f":"Est2020DistRev!S42/2","v":0},{"$f":"Est2020DistRev!T42/2","v":0},{"$f":"Est2020DistRev!U42/2","v":0},{"$f":"Est2020DistRev!V42/2","v":0},{"$f":"Est2020DistRev!W42/2","v":0},{"$f":"Est2020DistRev!X42/2","v":0},{"$f":"Est2020DistRev!Y42/2","v":0},{"$f":"Est2020DistRev!Z42/2","v":0},{"$f":"Est2020DistRev!AA42/2","v":0},{"$f":"Est2020DistRev!AB42/2","v":0},{"$f":"Est2020DistRev!AC42/2","v":0},{"$f":"Est2020DistRev!AD42/2","v":0},null,0,0,0,0,0,0,0,0,0,0,0,0,0,0,null,0,0,0,0,0,0,0,0,0,0,0,0,0,0]
[null,null,null,null,null,null,null,null,null,null,null,null,null,null,null,null,null,{"$f":"Est2020DistRev!D43","v":0},{"$f":"Est2020DistRev!E43","v":0},{"$f":"Est2020DistRev!F43","v":0},{"$f":"Est2020DistRev!G43","v":0},{"$f":"Est2020DistRev!H43","v":0},{"$f":"Est2020DistRev!I43","v":0},{"$f":"Est2020DistRev!J43","v":0},{"$f":"Est2020DistRev!K43","v":0},{"$f":"Est2020DistRev!L43","v":0},{"$f":"Est2020DistRev!M43","v":0},{"$f":"Est2020DistRev!N43","v":0},{"$f":"Est2020DistRev!O43","v":0},{"$f":"Est2020DistRev!P43","v":0},null,{"$f":"Est2020DistRev!R43/2","v":0},{"$f":"Est2020DistRev!S43/2","v":0},{"$f":"Est2020DistRev!T43/2","v":0},{"$f":"Est2020DistRev!U43/2","v":0},{"$f":"Est2020DistRev!V43/2","v":0},{"$f":"Est2020DistRev!W43/2","v":0},{"$f":"Est2020DistRev!X43/2","v":0},{"$f":"Est2020DistRev!Y43/2","v":0},{"$f":"Est2020DistRev!Z43/2","v":0},{"$f":"Est2020DistRev!AA43/2","v":0},{"$f":"Est2020DistRev!AB43/2","v":0},{"$f":"Est2020DistRev!AC43/2","v":0},{"$f":"Est2020DistRev!AD43/2","v":0},null,0,0,0,0,0,0,0,0,0,0,0,0,0,0,null,0,0,0,0,0,0,0,0,0,0,0,0,0,0]
[null,null,null,null,null,null,null,null,null,null,null,null,null,null,null,null,null,{"$f":"Est2020DistRev!D44","v":0},{"$f":"Est2020DistRev!E44","v":0},{"$f":"Est2020DistRev!F44","v":0},{"$f":"Est2020DistRev!G44","v":0},{"$f":"Est2020DistRev!H44","v":0},{"$f":"Est2020DistRev!I44","v":0},{"$f":"Est2020DistRev!J44","v":0},{"$f":"Est2020DistRev!K44","v":0},{"$f":"Est2020DistRev!L44","v":0},{"$f":"Est2020DistRev!M44","v":0},{"$f":"Est2020DistRev!N44","v":0},{"$f":"Est2020DistRev!O44","v":0},{"$f":"Est2020DistRev!P44","v":0},null,{"$f":"Est2020DistRev!R44/2","v":0},{"$f":"Est2020DistRev!S44/2","v":0},{"$f":"Est2020DistRev!T44/2","v":0},{"$f":"Est2020DistRev!U44/2","v":0},{"$f":"Est2020DistRev!V44/2","v":0},{"$f":"Est2020DistRev!W44/2","v":0},{"$f":"Est2020DistRev!X44/2","v":0},{"$f":"Est2020DistRev!Y44/2","v":0},{"$f":"Est2020DistRev!Z44/2","v":0},{"$f":"Est2020DistRev!AA44/2","v":0},{"$f":"Est2020DistRev!AB44/2","v":0},{"$f":"Est2020DistRev!AC44/2","v":0},{"$f":"Est2020DistRev!AD44/2","v":0},null,0,0,0,0,0,0,0,0,0,0,0,0,0,0,null,0,0,0,0,0,0,0,0,0,0,0,0,0,0]
[null,null,null,null,null,null,null,null,null,null,null,null,null,null,null,null,null,{"$f":"Est2020DistRev!D45","v":0},{"$f":"Est2020DistRev!E45","v":0},{"$f":"Est2020DistRev!F45","v":0},{"$f":"Est2020DistRev!G45","v":0},{"$f":"Est2020DistRev!H45","v":0},{"$f":"Est2020DistRev!I45","v":0},{"$f":"Est2020DistRev!J45","v":0},{"$f":"Est2020DistRev!K45","v":0},{"$f":"Est2020DistRev!L45","v":0},{"$f":"Est2020DistRev!M45","v":0},{"$f":"Est2020DistRev!N45","v":0},{"$f":"Est2020DistRev!O45","v":0},{"$f":"Est2020DistRev!P45","v":0},null,{"$f":"Est2020DistRev!R45/2","v":0},{"$f":"Est2020DistRev!S45/2","v":0},{"$f":"Est2020DistRev!T45/2","v":0},{"$f":"Est2020DistRev!U45/2","v":0},{"$f":"Est2020DistRev!V45/2","v":0},{"$f":"Est2020DistRev!W45/2","v":0},{"$f":"Est2020DistRev!X45/2","v":0},{"$f":"Est2020DistRev!Y45/2","v":0},{"$f":"Est2020DistRev!Z45/2","v":0},{"$f":"Est2020DistRev!AA45/2","v":0},{"$f":"Est2020DistRev!AB45/2","v":0},{"$f":"Est2020DistRev!AC45/2","v":0},{"$f":"Est2020DistRev!AD45/2","v":0},null,0,0,0,0,0,0,0,0,0,0,0,0,0,0,null,0,0,0,0,0,0,0,0,0,0,0,0,0,0]
[null,null,null,null,null,null,null,null,null,null,null,null,null,null,null,null,null,{"$f":"Est2020DistRev!D46","v":0},{"$f":"Est2020DistRev!E46","v":0},{"$f":"Est2020DistRev!F46","v":0},{"$f":"Est2020DistRev!G46","v":0},{"$f":"Est2020DistRev!H46","v":0},{"$f":"Est2020DistRev!I46","v":0},{"$f":"Est2020DistRev!J46","v":0},{"$f":"Est2020DistRev!K46","v":0},{"$f":"Est2020DistRev!L46","v":0},{"$f":"Est2020DistRev!M46","v":0},{"$f":"Est2020DistRev!N46","v":0},{"$f":"Est2020DistRev!O46","v":0},{"$f":"Est2020DistRev!P46","v":0},null,{"$f":"Est2020DistRev!R46/2","v":0},{"$f":"Est2020DistRev!S46/2","v":0},{"$f":"Est2020DistRev!T46/2","v":0},{"$f":"Est2020DistRev!U46/2","v":0},{"$f":"Est2020DistRev!V46/2","v":0},{"$f":"Est2020DistRev!W46/2","v":0},{"$f":"Est2020DistRev!X46/2","v":0},{"$f":"Est2020DistRev!Y46/2","v":0},{"$f":"Est2020DistRev!Z46/2","v":0},{"$f":"Est2020DistRev!AA46/2","v":0},{"$f":"Est2020DistRev!AB46/2","v":0},{"$f":"Est2020DistRev!AC46/2","v":0},{"$f":"Est2020DistRev!AD46/2","v":0},null,0,0,0,0,0,0,0,0,0,0,0,0,0,0,null,0,0,0,0,0,0,0,0,0,0,0,0,0,0]
[null,null,null,null,null,null,null,null,null,null,null,null,null,null,null,null,null,{"$f":"Est2020DistRev!D47","v":0},{"$f":"Est2020DistRev!E47","v":0},{"$f":"Est2020DistRev!F47","v":0},{"$f":"Est2020DistRev!G47","v":0},{"$f":"Est2020DistRev!H47","v":0},{"$f":"Est2020DistRev!I47","v":0},{"$f":"Est2020DistRev!J47","v":0},{"$f":"Est2020DistRev!K47","v":0},{"$f":"Est2020DistRev!L47","v":0},{"$f":"Est2020DistRev!M47","v":0},{"$f":"Est2020DistRev!N47","v":0},{"$f":"Est2020DistRev!O47","v":0},{"$f":"Est2020DistRev!P47","v":0},null,{"$f":"Est2020DistRev!R47/2","v":0},{"$f":"Est2020DistRev!S47/2","v":0},{"$f":"Est2020DistRev!T47/2","v":0},{"$f":"Est2020DistRev!U47/2","v":0},{"$f":"Est2020DistRev!V47/2","v":0},{"$f":"Est2020DistRev!W47/2","v":0},{"$f":"Est2020DistRev!X47/2","v":0},{"$f":"Est2020DistRev!Y47/2","v":0},{"$f":"Est2020DistRev!Z47/2","v":0},{"$f":"Est2020DistRev!AA47/2","v":0},{"$f":"Est2020DistRev!AB47/2","v":0},{"$f":"Est2020DistRev!AC47/2","v":0},{"$f":"Est2020DistRev!AD47/2","v":0},null,0,0,0,0,0,0,0,0,0,0,0,0,0,0,null,0,0,0,0,0,0,0,0,0,0,0,0,0,0]
[null,null,null,null,null,null,null,null,null,null,null,null,null,null,null,null,null,{"$f":"Est2020DistRev!D48","v":0},{"$f":"Est2020DistRev!E48","v":0},{"$f":"Est2020DistRev!F48","v":0},{"$f":"Est2020DistRev!G48","v":0},{"$f":"Est2020DistRev!H48","v":0},{"$f":"Est2020DistRev!I48","v":0},{"$f":"Est2020DistRev!J48","v":0},{"$f":"Est2020DistRev!K48","v":0},{"$f":"Est2020DistRev!L48","v":0},{"$f":"Est2020DistRev!M48","v":0},{"$f":"Est2020DistRev!N48","v":0},{"$f":"Est2020DistRev!O48","v":0},{"$f":"Est2020DistRev!P48","v":0},null,{"$f":"Est2020DistRev!R48/2","v":0},{"$f":"Est2020DistRev!S48/2","v":0},{"$f":"Est2020DistRev!T48/2","v":0},{"$f":"Est2020DistRev!U48/2","v":0},{"$f":"Est2020DistRev!V48/2","v":0},{"$f":"Est2020DistRev!W48/2","v":0},{"$f":"Est2020DistRev!X48/2","v":0},{"$f":"Est2020DistRev!Y48/2","v":0},{"$f":"Est2020DistRev!Z48/2","v":0},{"$f":"Est2020DistRev!AA48/2","v":0},{"$f":"Est2020DistRev!AB48/2","v":0},{"$f":"Est2020DistRev!AC48/2","v":0},{"$f":"Est2020DistRev!AD48/2","v":0},null,0,0,0,0,0,0,0,0,0,0,0,0,0,0,null,0,0,0,0,0,0,0,0,0,0,0,0,0,0]
[null,null,null,null,null,null,null,null,null,null,null,null,null,null,null,null,null,{"$f":"Est2020DistRev!D49","v":0},{"$f":"Est2020DistRev!E49","v":0},{"$f":"Est2020DistRev!F49","v":0},{"$f":"Est2020DistRev!G49","v":0},{"$f":"Est2020DistRev!H49","v":0},{"$f":"Est2020DistRev!I49","v":0},{"$f":"Est2020DistRev!J49","v":0},{"$f":"Est2020DistRev!K49","v":0},{"$f":"Est2020DistRev!L49","v":0},{"$f":"Est2020DistRev!M49","v":0},{"$f":"Est2020DistRev!N49","v":0},{"$f":"Est2020DistRev!O49","v":0},{"$f":"Est2020DistRev!P49","v":0},null,{"$f":"Est2020DistRev!R49/2","v":0},{"$f":"Est2020DistRev!S49/2","v":0},{"$f":"Est2020DistRev!T49/2","v":0},{"$f":"Est2020DistRev!U49/2","v":0},{"$f":"Est2020DistRev!V49/2","v":0},{"$f":"Est2020DistRev!W49/2","v":0},{"$f":"Est2020DistRev!X49/2","v":0},{"$f":"Est2020DistRev!Y49/2","v":0},{"$f":"Est2020DistRev!Z49/2","v":0},{"$f":"Est2020DistRev!AA49/2","v":0},{"$f":"Est2020DistRev!AB49/2","v":0},{"$f":"Est2020DistRev!AC49/2","v":0},{"$f":"Est2020DistRev!AD49/2","v":0},null,0,0,0,0,0,0,0,0,0,0,0,0,0,0,null,0,0,0,0,0,0,0,0,0,0,0,0,0,0]
[null,null,null,null,null,null,null,null,null,null,null,null,null,null,null,null,null,{"$f":"Est2020DistRev!D50","v":0},{"$f":"Est2020DistRev!E50","v":0},{"$f":"Est2020DistRev!F50","v":0},{"$f":"Est2020DistRev!G50","v":0},{"$f":"Est2020DistRev!H50","v":0},{"$f":"Est2020DistRev!I50","v":0},{"$f":"Est2020DistRev!J50","v":0},{"$f":"Est2020DistRev!K50","v":0},{"$f":"Est2020DistRev!L50","v":0},{"$f":"Est2020DistRev!M50","v":0},{"$f":"Est2020DistRev!N50","v":0},{"$f":"Est2020DistRev!O50","v":0},{"$f":"Est2020DistRev!P50","v":0},null,{"$f":"Est2020DistRev!R50/2","v":0},{"$f":"Est2020DistRev!S50/2","v":0},{"$f":"Est2020DistRev!T50/2","v":0},{"$f":"Est2020DistRev!U50/2","v":0},{"$f":"Est2020DistRev!V50/2","v":0},{"$f":"Est2020DistRev!W50/2","v":0},{"$f":"Est2020DistRev!X50/2","v":0},{"$f":"Est2020DistRev!Y50/2","v":0},{"$f":"Est2020DistRev!Z50/2","v":0},{"$f":"Est2020DistRev!AA50/2","v":0},{"$f":"Est2020DistRev!AB50/2","v":0},{"$f":"Est2020DistRev!AC50/2","v":0},{"$f":"Est2020DistRev!AD50/2","v":0},null,0,0,0,0,0,0,0,0,0,0,0,0,0,0,null,0,0,0,0,0,0,0,0,0,0,0,0,0,0]
[null,null,null,null,null,null,null,null,null,null,null,null,null,null,null,null,null,{"$f":"Est2020DistRev!D51","v":0},{"$f":"Est2020DistRev!E51","v":0},{"$f":"Est2020DistRev!F51","v":0},{"$f":"Est2020DistRev!G51","v":0},{"$f":"Est2020DistRev!H51","v":0},{"$f":"Est2020DistRev!I51","v":0},{"$f":"Est2020DistRev!J51","v":0},{"$f":"Est2020DistRev!K51","v":0},{"$f":"Est2020DistRev!L51","v":0},{"$f":"Est2020DistRev!M51","v":0},{"$f":"Est2020DistRev!N51","v":0},{"$f":"Est2020DistRev!O51","v":0},{"$f":"Est2020DistRev!P51","v":0},null,{"$f":"Est2020DistRev!R51/2","v":0},{"$f":"Est2020DistRev!S51/2","v":0},{"$f":"Est2020DistRev!T51/2","v":0},{"$f":"Est2020DistRev!U51/2","v":0},{"$f":"Est2020DistRev!V51/2","v":0},{"$f":"Est2020DistRev!W51/2","v":0},{"$f":"Est2020DistRev!X51/2","v":0},{"$f":"Est2020DistRev!Y51/2","v":0},{"$f":"Est2020DistRev!Z51/2","v":0},{"$f":"Est2020DistRev!AA51/2","v":0},{"$f":"Est2020DistRev!AB51/2","v":0},{"$f":"Est2020DistRev!AC51/2","v":0},{"$f":"Est2020DistRev!AD51/2","v":0},null,0,0,0,0,0,0,0,0,0,0,0,0,0,0,null,0,0,0,0,0,0,0,0,0,0,0,0,0,0]
[null,null,null,null,null,null,null,null,null,null,null,null,null,null,null,null,null,{"$f":"Est2020DistRev!D52","v":0},{"$f":"Est2020DistRev!E52","v":0},{"$f":"Est2020DistRev!F52","v":0},{"$f":"Est2020DistRev!G52","v":0},{"$f":"Est2020DistRev!H52","v":0},{"$f":"Est2020DistRev!I52","v":0},{"$f":"Est2020DistRev!J52","v":0},{"$f":"Est2020DistRev!K52","v":0},{"$f":"Est2020DistRev!L52","v":0},{"$f":"Est2020DistRev!M52","v":0},{"$f":"Est2020DistRev!N52","v":0},{"$f":"Est2020DistRev!O52","v":0},{"$f":"Est2020DistRev!P52","v":0},null,{"$f":"Est2020DistRev!R52/2","v":0},{"$f":"Est2020DistRev!S52/2","v":0},{"$f":"Est2020DistRev!T52/2","v":0},{"$f":"Est2020DistRev!U52/2","v":0},{"$f":"Est2020DistRev!V52/2","v":0},{"$f":"Est2020DistRev!W52/2","v":0},{"$f":"Est2020DistRev!X52/2","v":0},{"$f":"Est2020DistRev!Y52/2","v":0},{"$f":"Est2020DistRev!Z52/2","v":0},{"$f":"Est2020DistRev!AA52/2","v":0},{"$f":"Est2020DistRev!AB52/2","v":0},{"$f":"Est2020DistRev!AC52/2","v":0},{"$f":"Est2020DistRev!AD52/2","v":0},null,0,0,0,0,0,0,0,0,0,0,0,0,0,0,null,0,0,0,0,0,0,0,0,0,0,0,0,0,0]
[null,null,null,null,null,null,null,null,null,null,null,null,null,null,null,null,null,{"$f":"Est2020DistRev!D53","v":0},{"$f":"Est2020DistRev!E53","v":0},{"$f":"Est2020DistRev!F53","v":0},{"$f":"Est2020DistRev!G53","v":0},{"$f":"Est2020DistRev!H53","v":0},{"$f":"Est2020DistRev!I53","v":0},{"$f":"Est2020DistRev!J53","v":0},{"$f":"Est2020DistRev!K53","v":0},{"$f":"Est2020DistRev!L53","v":0},{"$f":"Est2020DistRev!M53","v":0},{"$f":"Est2020DistRev!N53","v":0},{"$f":"Est2020DistRev!O53","v":0},{"$f":"Est2020DistRev!P53","v":0},null,{"$f":"Est2020DistRev!R53/2","v":0},{"$f":"Est2020DistRev!S53/2","v":0},{"$f":"Est2020DistRev!T53/2","v":0},{"$f":"Est2020DistRev!U53/2","v":0},{"$f":"Est2020DistRev!V53/2","v":0},{"$f":"Est2020DistRev!W53/2","v":0},{"$f":"Est2020DistRev!X53/2","v":0},{"$f":"Est2020DistRev!Y53/2","v":0},{"$f":"Est2020DistRev!Z53/2","v":0},{"$f":"Est2020DistRev!AA53/2","v":0},{"$f":"Est2020DistRev!AB53/2","v":0},{"$f":"Est2020DistRev!AC53/2","v":0},{"$f":"Est2020DistRev!AD53/2","v":0},null,0,0,0,0,0,0,0,0,0,0,0,0,0,0,null,0,0,0,0,0,0,0,0,0,0,0,0,0,0]
[null,null,null,null,null,null,null,null,null,null,null,null,null,null,null,null,null,{"$f":"Est2020DistRev!D54","v":0},{"$f":"Est2020DistRev!E54","v":0},{"$f":"Est2020DistRev!F54","v":0},{"$f":"Est2020DistRev!G54","v":0},{"$f":"Est2020DistRev!H54","v":0},{"$f":"Est2020DistRev!I54","v":0},{"$f":"Est2020DistRev!J54","v":0},{"$f":"Est2020DistRev!K54","v":0},{"$f":"Est2020DistRev!L54","v":0},{"$f":"Est2020DistRev!M54","v":0},{"$f":"Est2020DistRev!N54","v":0},{"$f":"Est2020DistRev!O54","v":0},{"$f":"Est2020DistRev!P54","v":0},null,{"$f":"Est2020DistRev!R54/2","v":0},{"$f":"Est2020DistRev!S54/2","v":0},{"$f":"Est2020DistRev!T54/2","v":0},{"$f":"Est2020DistRev!U54/2","v":0},{"$f":"Est2020DistRev!V54/2","v":0},{"$f":"Est2020DistRev!W54/2","v":0},{"$f":"Est2020DistRev!X54/2","v":0},{"$f":"Est2020DistRev!Y54/2","v":0},{"$f":"Est2020DistRev!Z54/2","v":0},{"$f":"Est2020DistRev!AA54/2","v":0},{"$f":"Est2020DistRev!AB54/2","v":0},{"$f":"Est2020DistRev!AC54/2","v":0},{"$f":"Est2020DistRev!AD54/2","v":0},null,0,0,0,0,0,0,0,0,0,0,0,0,0,0,null,0,0,0,0,0,0,0,0,0,0,0,0,0,0]
[null,null,null,null,null,null,null,null,null,null,null,null,null,null,null,null,null,null,null,null,null,null,null,null,null,null,null,null,null,null,null,null,null,null,null,null,null,null,null,null,null,null,null,null,null,0,0,0,0,0,0,0,0,0,0,0,0,0,0,null,0,0,0,0,0,0,0,0,0,0,0,0,0,0]
[null,null,null,null,null,null,null,null,null,null,null,null,null,null,null,null,null,null,null,null,null,null,null,null,null,null,null,null,null,null,null,null,null,null,null,null,null,null,null,null,null,null,null,null,null,0,0,0,0,0,0,0,0,0,0,0,0,0,0,null,0,0,0,0,0,0,0,0,0,0,0,0,0,0]
[null,null,null,null,null,null,null,null,null,null,null,null,null,null,null,null,null,null,null,null,null,null,null,null,null,null,null,null,null,null,null,null,null,null,null,null,null,null,null,null,null,null,null,null,null,0,0,0,0,0,0,0,0,0,0,0,0,0,0,null,0,0,0,0,0,0,0,0,0,0,0,0,0,0]
[null,null,null,null,null,null,null,null,null,null,null,null,null,null,null,null,null,null,null,null,null,null,null,null,null,null,null,null,null,null,null,null,null,null,null,null,null,null,null,null,null,null,null,null,null,0,0,0,0,0,0,0,0,0,0,0,0,0,0,null,0,0,0,0,0,0,0,0,0,0,0,0,0,0]
[null,null,null,null,null,null,null,null,null,null,null,null,null,null,null,null,null,null,null,null,null,null,null,null,null,null,null,null,null,null,null,null,null,null,null,null,null,null,null,null,null,null,null,null,null,0,0,0,0,0,0,0,0,0,0,0,0,0,0,null,0,0,0,0,0,0,0,0,0,0,0,0,0,0]
[null,null,null,null,null,null,null,null,null,null,null,null,null,null,null,null,null,null,null,null,null,null,null,null,null,null,null,null,null,null,null,null,null,null,null,null,null,null,null,null,null,null,null,null,null,0,0,0,0,0,0,0,0,0,0,0,0,0,0,null,0,0,0,0,0,0,0,0,0,0,0,0,0,0]
[null,null,null,null,null,null,null,null,null,null,null,null,null,null,null,null,null,null,null,null,null,null,null,null,null,null,null,null,null,null,null,null,null,null,null,null,null,null,null,null,null,null,null,null,null,0,0,0,0,0,0,0,0,0,0,0,0,0,0,null,0,0,0,0,0,0,0,0,0,0,0,0,0,0]
[null,null,null,null,null,null,null,null,null,null,null,null,null,null,null,null,null,null,null,null,null,null,null,null,null,null,null,null,null,null,null,null,null,null,null,null,null,null,null,null,null,null,null,null,null,0,0,0,0,0,0,0,0,0,0,0,0,0,0,null,0,0,0,0,0,0,0,0,0,0,0,0,0,0]
[null,null,null,null,null,null,null,null,null,null,null,null,null,null,null,null,null,null,null,null,null,null,null,null,null,null,null,null,null,null,null,null,null,null,null,null,null,null,null,null,null,null,null,null,null,0,0,0,0,0,0,0,0,0,0,0,0,0,0,null,0,0,0,0,0,0,0,0,0,0,0,0,0,0]
[null,null,null,null,null,null,null,null,null,null,null,null,null,null,null,null,null,null,null,null,null,null,null,null,null,null,null,null,null,null,null,null,null,null,null,null,null,null,null,null,null,null,null,null,null,0,0,0,0,0,0,0,0,0,0,0,0,0,0,null,0,0,0,0,0,0,0,0,0,0,0,0,0,0]
[null,null,null,null,null,null,null,null,null,null,null,null,null,null,null,null,null,null,null,null,null,null,null,null,null,null,null,null,null,null,null,null,null,null,null,null,null,null,null,null,null,null,null,null,null,0,0,0,0,0,0,0,0,0,0,0,0,0,0,null,0,0,0,0,0,0,0,0,0,0,0,0,0,0]
[null,null,null,null,null,null,null,null,null,null,null,null,null,null,null,null,null,null,null,null,null,null,null,null,null,null,null,null,null,null,null,{"$f":"SUM(AF6:AF65)","v":182831.44489982832},1517656395.2083504,580688.3796264258,407370.3282449813,757351.41782394319,609112587.36011171,495167.14113703655,0,0,443886.28658918006,0,0,0,null,{"$f":"SUM(AT6:AT65)","v":16254539.172762239},66130603.070826113,43476.138982630502,49141.082696192098,56702.900652478631,3268730.2399942665,18024.083937388132,0,0,31825035.912400179,0,0,0,117646252.60225148,null,{"$f":"SUM(BI6:BI65)","v":14518631.777302241},82872750.311526552,45415.638170582766,51332.735062150095,59232.454388010599,4401258.2458321722,18826.254706030129,0,0,34206407.084382795,0,0,0,136173854.50137055]

{"sheet":"2021DistRevCapForm","index":10,"n_rows":11,"n_cols":3,"rows_kept":11,"cut":false,"hidden":false,"merged":[]}
[]
[null,{"$f":"\"Tariff Approval - \"&'Model update'!$C$3","v":"Tariff Approval - Jemena"},{"$f":"'Model update'!$C$5&\"DistRevCapForm\"","v":"2021DistRevCapForm"}]
[]
[null," DUoS"]
[]
[null,"Year (t)",{"$f":"'Model update'!C5","v":2021}]
[]
[null,"Table 1- Compliance with AER Final Determination Total Annual Revenue"]
[null,"Revenue from DUoS charges for year t",{"$f":"Prop2021DistTar!BG66","v":117646252.60225148}]
[null,"Total Annual Revenue for year t",117654758.41350099]
[null,null,{"$f":"IF(C9=\"\",\"\",IF(C10>=C9,\"DUoS REVENUE CAP FORMULA COMPLIANT\",\"DUoS REVENUE CAP FORMULA BREACHED\"))","v":"DUoS REVENUE CAP FORMULA COMPLIANT"}]

{"sheet":"2021DistTarRebalCont","index":11,"n_rows":104,"n_cols":62,"rows_kept":104,"cut":false,"hidden":false,"merged":[]}
[null,{"$f":"\"Tariff Approval - \"&'Model update'!C3","v":"Tariff Approval - Jemena"},{"$f":"'Model update'!$C$5&\"DistTarRebalCont\"","v":"2021DistTarRebalCont"}]
[]
[null,{"$f":"'Model update'!C5&\" DISTRIBUTION TARIFF REBALANCING CONTROL\"","v":"2021 DISTRIBUTION TARIFF REBALANCING CONTROL"}]
[]
[]
[null,"Distribution tariff rebalancing control"]
[]
[null,{"$f":"\"CPI \"&'Model update'!$C$5","v":"CPI 2021"},{"$f":"'Model update'!C30","v":-3.4843205574912606E-3}]
[]
[]
[]
[]
[]
[]
[]
[null,null,{"$f":"(1+C8)*(1-C9)*(1+0.02)*(1+C10)+SUM(C11:C13)","v":1.016445993031359}]
[]
[]
[]
[null,"Rebalancing control summary",{"$f":"\"Pt-1*(Qt \" &'Model update'!$C$5&\")\"","v":"Pt-1*(Qt 2021)"},{"$f":"\"Pt*(Qt \" &'Model update'!$C$5&\")\"","v":"Pt*(Qt 2021)"}]
[null,"Tariff Class (Input Class Name)","Existing ($)","Proposed ($)","Movement"]
[null,"Residential",{"$f":"IF(B22=\"\",\"\",SUMIF($B$44:$B$103,$B22,$I$44:$I$103))","v":63126581.939277217},{"$f":"IF(B22=\"\",\"\",SUMIF($B$44:$B$103,$B22,$F$44:$F$103))","v":54834498.795898527},{"$f":"IF(B22=\"\",\"\",D22/C22)","v":0.86864355888372002},{"$f":"IF(B22=\"\",\"\",IF(E22<$C$16,\"COMPLIANT\",\"BREACHED\"))","v":"COMPLIANT"}]
[null,"Small Business",29074134.048329636,24678468.803763069,0.84881182575344472,"COMPLIANT"]
[null,"Large Business - LV",{"$f":"IF(B24=\"\",\"\",SUMIF($B$44:$B$103,$B24,$I$44:$I$103))","v":33403775.754254322},{"$f":"IF(B24=\"\",\"\",SUMIF($B$44:$B$103,$B24,$F$44:$F$103))","v":28931821.283936676},0.86612428178128642,"COMPLIANT"]
[null,"Large Business - HV",9445476.784547383,8220247.9035533983,0.87028406199690889,"COMPLIANT"]
[null,"Large Business - Subtransmission",1123885.9749620128,981215.81509981363,0.87305637489868892,"COMPLIANT"]
[null,null,{"$f":"IF(B27=\"\",\"\",SUMIF($B$44:$B$103,$B27,$I$44:$I$103))","v":""},{"$f":"IF(B27=\"\",\"\",SUMIF($B$44:$B$103,$B27,$F$44:$F$103))","v":""},{"$f":"IF(B27=\"\",\"\",D27/C27)","v":""},{"$f":"IF(B27=\"\",\"\",IF(E27<$C$16,\"COMPLIANT\",\"BREACHED\"))","v":""}]
[null,null,"","","",""]
[null,null,"","","",""]
[null,null,"","","",""]
[null,null,"","","",""]
[null,null,{"$f":"IF(B32=\"\",\"\",SUMIF($B$44:$B$103,$B32,$I$44:$I$103))","v":""},{"$f":"IF(B32=\"\",\"\",SUMIF($B$44:$B$103,$B32,$F$44:$F$103))","v":""},"",""]
[null,null,"","","",""]
[null,null,"","","",""]
[null,null,"","","",""]
[null,null,"","","",""]
[null,null,"","","",""]
[null,null,"","","",""]
[null,"Check Total",{"$f":"IF(ABS(SUM(C22:C38)-I104)<0.01,\"Ok\",\"Error\")","v":"Ok"},{"$f":"IF(ABS(SUM(D22:D38)-F104)<0.01,\"Ok\",\"Error\")","v":"Ok"}]
[null,null,{"$f":"IF(ABS(SUM(C22:C38)-Prop2021DistTar!BV66)<0.01,\"Ok\",\"Error\")","v":"Ok"},{"$f":"IF(ABS(SUM(D22:D38)-Prop2021DistTar!BG66)<0.01,\"Ok\",\"Error\")","v":"Ok"}]
[]
[null,null,null,null,null,{"$f":"\"Revenue (Pt \"&'Model update'!$C$5&\")*(Qt \" &'Model update'!$C$5&\")\"","v":"Revenue (Pt 2021)*(Qt 2021)"},null,null,{"$f":"\"Revenue (Pt-1 \"&'Model update'!$C$8&\")*(Qt \" &'Model update'!$C$5&\")\"","v":"Revenue (Pt-1 2020)*(Qt 2021)"}]
["New Tariff Test","Destination tariff class","Source tariff class","Proposed tariff","Existing tariff","PropRev\nTotal",null,null,"ExistRev\nTotal"]
[{"$f":"OR(EXACT(D44,Prop2021DistTar!C$6:C$65))","v":true},"Residential","Residential",{"$f":"IF(Prop2021DistTar!B6=\"\",\"\",Prop2021DistTar!B6)","v":"Residential - General Purpose"},{"$f":"IF(Prop2021DistTar!C6=\"\",\"\",Prop2021DistTar!C6)","v":"Residential - General Purpose"},{"$f":"Prop2021DistTar!BG6","v":51073384.635256156},null,null,{"$f":"Prop2021DistTar!BV6","v":59307363.494527176}]
[{"$f":"OR(EXACT(D45,Prop2021DistTar!C$6:C$65))","v":true},"Residential","Residential",{"$f":"IF(Prop2021DistTar!B7=\"\",\"\",Prop2021DistTar!B7)","v":"Residential - General Purpose Demand"},{"$f":"IF(Prop2021DistTar!C7=\"\",\"\",Prop2021DistTar!C7)","v":"Residential - General Purpose Demand"},{"$f":"Prop2021DistTar!BG7","v":1048.2176156942226},null,null,{"$f":"Prop2021DistTar!BV7","v":1525.4736092538938}]
[{"$f":"OR(EXACT(D46,Prop2021DistTar!C$6:C$65))","v":true},"Residential","Residential",{"$f":"IF(Prop2021DistTar!B8=\"\",\"\",Prop2021DistTar!B8)","v":"Residential - Flexible"},{"$f":"IF(Prop2021DistTar!C8=\"\",\"\",Prop2021DistTar!C8)","v":"Residential - Flexible"},{"$f":"Prop2021DistTar!BG8","v":255066.81027258438},null,null,{"$f":"Prop2021DistTar!BV8","v":261539.98724357699}]
[{"$f":"OR(EXACT(D47,Prop2021DistTar!C$6:C$65))","v":true},"Residential","Residential",{"$f":"IF(Prop2021DistTar!B9=\"\",\"\",Prop2021DistTar!B9)","v":"Residential - Time of Use Interval Meter"},{"$f":"IF(Prop2021DistTar!C9=\"\",\"\",Prop2021DistTar!C9)","v":"Residential - Time of Use Interval Meter"},{"$f":"Prop2021DistTar!BG9","v":2866085.0944714174},null,null,{"$f":"Prop2021DistTar!BV9","v":2906067.9543519598}]
[{"$f":"OR(EXACT(D48,Prop2021DistTar!C$6:C$65))","v":true},"Residential","Residential",{"$f":"IF(Prop2021DistTar!B10=\"\",\"\",Prop2021DistTar!B10)","v":"Residential - TOU"},{"$f":"IF(Prop2021DistTar!C10=\"\",\"\",Prop2021DistTar!C10)","v":"Residential - TOU"},{"$f":"Prop2021DistTar!BG10","v":389938.6576773253},null,null,{"$f":"Prop2021DistTar!BV10","v":389938.6576773253}]
[{"$f":"OR(EXACT(D49,Prop2021DistTar!C$6:C$65))","v":true},"Residential","Residential",{"$f":"IF(Prop2021DistTar!B11=\"\",\"\",Prop2021DistTar!B11)","v":"Residential - Off Peak Only"},{"$f":"IF(Prop2021DistTar!C11=\"\",\"\",Prop2021DistTar!C11)","v":"Residential - Off Peak Only"},{"$f":"Prop2021DistTar!BG11","v":248975.38060535816},null,null,{"$f":"Prop2021DistTar!BV11","v":260146.37186792187}]
[{"$f":"OR(EXACT(D50,Prop2021DistTar!C$6:C$65))","v":true},"Small Business","Small Business",{"$f":"IF(Prop2021DistTar!B12=\"\",\"\",Prop2021DistTar!B12)","v":"Small Business - General Purpose"},{"$f":"IF(Prop2021DistTar!C12=\"\",\"\",Prop2021DistTar!C12)","v":"Small Business - General Purpose"},{"$f":"Prop2021DistTar!BG12","v":8883976.9593022522},null,null,{"$f":"Prop2021DistTar!BV12","v":10473670.646911941}]
[{"$f":"OR(EXACT(D51,Prop2021DistTar!C$6:C$65))","v":true},"Small Business","Small Business",{"$f":"IF(Prop2021DistTar!B13=\"\",\"\",Prop2021DistTar!B13)","v":"Small Business - General Purpose Demand"},{"$f":"IF(Prop2021DistTar!C13=\"\",\"\",Prop2021DistTar!C13)","v":"Small Business - General Purpose Demand"}]
[{"$f":"OR(EXACT(D52,Prop2021DistTar!C$6:C$65))","v":true},"Small Business","Small Business",{"$f":"IF(Prop2021DistTar!B14=\"\",\"\",Prop2021DistTar!B14)","v":"Small Business - TOU Weekdays"},{"$f":"IF(Prop2021DistTar!C14=\"\",\"\",Prop2021DistTar!C14)","v":"Small Business - TOU Weekdays"},{"$f":"Prop2021DistTar!BG14","v":8277821.1897589592},null,null,{"$f":"Prop2021DistTar!BV14","v":9892312.7803034782}]
[{"$f":"OR(EXACT(D53,Prop2021DistTar!C$6:C$65))","v":true},"Small Business","Small Business",{"$f":"IF(Prop2021DistTar!B15=\"\",\"\",Prop2021DistTar!B15)","v":"Small Business - TOU Weekdays Demand"},{"$f":"IF(Prop2021DistTar!C15=\"\",\"\",Prop2021DistTar!C15)","v":"Small Business - TOU Weekdays Demand"},{"$f":"Prop2021DistTar!BG15","v":3892547.2835477935},null,null,{"$f":"Prop2021DistTar!BV15","v":4615535.5131834717}]
[{"$f":"OR(EXACT(D54,Prop2021DistTar!C$6:C$65))","v":true},"Small Business","Small Business",{"$f":"IF(Prop2021DistTar!B16=\"\",\"\",Prop2021DistTar!B16)","v":"Small Business - TOU Opt out"},{"$f":"IF(Prop2021DistTar!C16=\"\",\"\",Prop2021DistTar!C16)","v":"Small Business - TOU Opt out"},{"$f":"Prop2021DistTar!BG16","v":137141.09929445235},null,null,{"$f":"Prop2021DistTar!BV16","v":151832.54422132159}]
[{"$f":"OR(EXACT(D55,Prop2021DistTar!C$6:C$65))","v":true},"Small Business","Small Business",{"$f":"IF(Prop2021DistTar!B17=\"\",\"\",Prop2021DistTar!B17)","v":"Small Business - TOU Extended"},{"$f":"IF(Prop2021DistTar!C17=\"\",\"\",Prop2021DistTar!C17)","v":"Small Business - TOU Extended"},{"$f":"Prop2021DistTar!BG17","v":1923862.5294046586},null,null,{"$f":"Prop2021DistTar!BV17","v":2102739.6140702786}]
[{"$f":"OR(EXACT(D56,Prop2021DistTar!C$6:C$65))","v":true},"Small Business","Small Business",{"$f":"IF(Prop2021DistTar!B18=\"\",\"\",Prop2021DistTar!B18)","v":"Small Business - TOU Extended Demand"},{"$f":"IF(Prop2021DistTar!C18=\"\",\"\",Prop2021DistTar!C18)","v":"Small Business - TOU Extended Demand"},{"$f":"Prop2021DistTar!BG18","v":731457.4606377352},null,null,{"$f":"Prop2021DistTar!BV18","v":820806.73387350095}]
[{"$f":"OR(EXACT(D57,Prop2021DistTar!C$6:C$65))","v":true},"Small Business","Small Business",{"$f":"IF(Prop2021DistTar!B19=\"\",\"\",Prop2021DistTar!B19)","v":"Small Business - Unmetered Supply"},{"$f":"IF(Prop2021DistTar!C19=\"\",\"\",Prop2021DistTar!C19)","v":"Small Business - Unmetered Supply"},{"$f":"Prop2021DistTar!BG19","v":829146.57750991662},null,null,{"$f":"Prop2021DistTar!BV19","v":1014455.0036291311}]
[{"$f":"OR(EXACT(D58,Prop2021DistTar!C$6:C$65))","v":true},"Large Business - LV","Large Business - LV",{"$f":"IF(Prop2021DistTar!B20=\"\",\"\",Prop2021DistTar!B20)","v":"Large Business - LV 0.4 - 0.8  GWh"},{"$f":"IF(Prop2021DistTar!C20=\"\",\"\",Prop2021DistTar!C20)","v":"Large Business - LV 0.4 - 0.8  GWh"},{"$f":"Prop2021DistTar!BG20","v":8974755.6007170938},null,null,{"$f":"Prop2021DistTar!BV20","v":10320435.914222728}]
[{"$f":"OR(EXACT(D59,Prop2021DistTar!C$6:C$65))","v":true},"Large Business - LV","Large Business - LV",{"$f":"IF(Prop2021DistTar!B21=\"\",\"\",Prop2021DistTar!B21)","v":"Large Business – LVEN Annual Consumption <= 0.8 GWh"},{"$f":"IF(Prop2021DistTar!C21=\"\",\"\",Prop2021DistTar!C21)","v":"Large Business – LVEN Annual Consumption <= 0.8 GWh"},{"$f":"Prop2021DistTar!BG21","v":1127135.7594844387},null,null,{"$f":"Prop2021DistTar!BV21","v":1276213.5500137426}]
[{"$f":"OR(EXACT(D60,Prop2021DistTar!C$6:C$65))","v":true},"Large Business - LV","Large Business - LV",{"$f":"IF(Prop2021DistTar!B22=\"\",\"\",Prop2021DistTar!B22)","v":"Large Business - LV  0.8+ - 2.2  GWh"},{"$f":"IF(Prop2021DistTar!C22=\"\",\"\",Prop2021DistTar!C22)","v":"Large Business - LV  0.8+ - 2.2  GWh"},{"$f":"Prop2021DistTar!BG22","v":9971306.2602823675},null,null,{"$f":"Prop2021DistTar!BV22","v":11493657.511802554}]
[{"$f":"OR(EXACT(D61,Prop2021DistTar!C$6:C$65))","v":true},"Large Business - LV","Large Business - LV",{"$f":"IF(Prop2021DistTar!B23=\"\",\"\",Prop2021DistTar!B23)","v":"Large Business - LVEN 0.8+ - 2.2 GWh"},{"$f":"IF(Prop2021DistTar!C23=\"\",\"\",Prop2021DistTar!C23)","v":"Large Business - LVEN 0.8+ - 2.2 GWh"},{"$f":"Prop2021DistTar!BG23","v":1129693.3510387004},null,null,{"$f":"Prop2021DistTar!BV23","v":1301497.7388011925}]
[{"$f":"OR(EXACT(D62,Prop2021DistTar!C$6:C$65))","v":true},"Large Business - LV","Large Business - LV",{"$f":"IF(Prop2021DistTar!B24=\"\",\"\",Prop2021DistTar!B24)","v":"Large Business - LV  2.2+ - 6.0  GWh"},{"$f":"IF(Prop2021DistTar!C24=\"\",\"\",Prop2021DistTar!C24)","v":"Large Business - LV  2.2+ - 6.0  GWh"},{"$f":"Prop2021DistTar!BG24","v":3908852.6222835639},null,null,{"$f":"Prop2021DistTar!BV24","v":4536596.310084749}]
[{"$f":"OR(EXACT(D63,Prop2021DistTar!C$6:C$65))","v":true},"Large Business - LV","Large Business - LV",{"$f":"IF(Prop2021DistTar!B25=\"\",\"\",Prop2021DistTar!B25)","v":"Large Business - LVEN 2.2+  GWh"},{"$f":"IF(Prop2021DistTar!C25=\"\",\"\",Prop2021DistTar!C25)","v":"Large Business - LVEN 2.2+  GWh"},{"$f":"Prop2021DistTar!BG25","v":868050.14360429219},null,null,{"$f":"Prop2021DistTar!BV25","v":987436.48972173012}]
[{"$f":"OR(EXACT(D64,Prop2021DistTar!C$6:C$65))","v":true},"Large Business - LV","Large Business - LV",{"$f":"IF(Prop2021DistTar!B26=\"\",\"\",Prop2021DistTar!B26)","v":"Large Business - LVMS 2.2+ - 6.0  GWh"},{"$f":"IF(Prop2021DistTar!C26=\"\",\"\",Prop2021DistTar!C26)","v":"Large Business - LVMS 2.2+ - 6.0  GWh"},{"$f":"Prop2021DistTar!BG26","v":306062.82063086319},null,null,{"$f":"Prop2021DistTar!BV26","v":361753.10722950718}]
[{"$f":"OR(EXACT(D65,Prop2021DistTar!C$6:C$65))","v":true},"Large Business - LV","Large Business - LV",{"$f":"IF(Prop2021DistTar!B27=\"\",\"\",Prop2021DistTar!B27)","v":"Large Business - LV 6.0+ GWh"},{"$f":"IF(Prop2021DistTar!C27=\"\",\"\",Prop2021DistTar!C27)","v":"Large Business - LV 6.0+ GWh"},{"$f":"Prop2021DistTar!BG27","v":1482027.5206074014},null,null,{"$f":"Prop2021DistTar!BV27","v":1732454.1042751886}]
[{"$f":"OR(EXACT(D66,Prop2021DistTar!C$6:C$65))","v":true},"Large Business - LV","Large Business - LV",{"$f":"IF(Prop2021DistTar!B28=\"\",\"\",Prop2021DistTar!B28)","v":"Large Business - LVMS 6.0+ GWh"},{"$f":"IF(Prop2021DistTar!C28=\"\",\"\",Prop2021DistTar!C28)","v":"Large Business - LVMS 6.0+ GWh"},{"$f":"Prop2021DistTar!BG28","v":1163937.2052879566},null,null,{"$f":"Prop2021DistTar!BV28","v":1393731.0281029281}]
[{"$f":"OR(EXACT(D67,Prop2021DistTar!C$6:C$65))","v":true},"Large Business - HV","Large Business - HV",{"$f":"IF(Prop2021DistTar!B29=\"\",\"\",Prop2021DistTar!B29)","v":"Large Business - HV"},{"$f":"IF(Prop2021DistTar!C29=\"\",\"\",Prop2021DistTar!C29)","v":"Large Business - HV"},{"$f":"Prop2021DistTar!BG29","v":7385783.2349331062},null,null,{"$f":"Prop2021DistTar!BV29","v":8379153.5222496465}]
[{"$f":"OR(EXACT(D68,Prop2021DistTar!C$6:C$65))","v":true},"Large Business - HV","Large Business - HV",{"$f":"IF(Prop2021DistTar!B30=\"\",\"\",Prop2021DistTar!B30)","v":"Large Business – HVEN"},{"$f":"IF(Prop2021DistTar!C30=\"\",\"\",Prop2021DistTar!C30)","v":"Large Business – HVEN"}]
[{"$f":"OR(EXACT(D69,Prop2021DistTar!C$6:C$65))","v":true},"Large Business - HV","Large Business - HV",{"$f":"IF(Prop2021DistTar!B31=\"\",\"\",Prop2021DistTar!B31)","v":"Large Business - HVRF"},{"$f":"IF(Prop2021DistTar!C31=\"\",\"\",Prop2021DistTar!C31)","v":"Large Business - HVRF"}]
[{"$f":"OR(EXACT(D70,Prop2021DistTar!C$6:C$65))","v":true},"Large Business - HV","Large Business - HV",{"$f":"IF(Prop2021DistTar!B32=\"\",\"\",Prop2021DistTar!B32)","v":"Large Business - HV Ann Cons >= 55GWh"},{"$f":"IF(Prop2021DistTar!C32=\"\",\"\",Prop2021DistTar!C32)","v":"Large Business - HV Ann Cons >= 55GWh"}]
[{"$f":"OR(EXACT(D71,Prop2021DistTar!C$6:C$65))","v":true},"Large Business - Subtransmission","Large Business - Subtransmission",{"$f":"IF(Prop2021DistTar!B33=\"\",\"\",Prop2021DistTar!B33)","v":"Large Business - Subtransmission"},{"$f":"IF(Prop2021DistTar!C33=\"\",\"\",Prop2021DistTar!C33)","v":"Large Business - Subtransmission"}]
[{"$f":"OR(EXACT(D72,Prop2021DistTar!C$6:C$65))","v":true},"Large Business - Subtransmission","Large Business - Subtransmission",{"$f":"IF(Prop2021DistTar!B34=\"\",\"\",Prop2021DistTar!B34)","v":"Large Business - Subtransmission MA"},{"$f":"IF(Prop2021DistTar!C34=\"\",\"\",Prop2021DistTar!C34)","v":"Large Business - Subtransmission MA"}]
[{"$f":"OR(EXACT(D73,Prop2021DistTar!C$6:C$65))","v":true},"Large Business - Subtransmission","Large Business - Subtransmission",{"$f":"IF(Prop2021DistTar!B35=\"\",\"\",Prop2021DistTar!B35)","v":"Large Business - Subtransmission EG"},{"$f":"IF(Prop2021DistTar!C35=\"\",\"\",Prop2021DistTar!C35)","v":"Large Business - Subtransmission EG"}]
[{"$f":"OR(EXACT(D74,Prop2021DistTar!C$6:C$65))","v":true},null,null,{"$f":"IF(Prop2021DistTar!B36=\"\",\"\",Prop2021DistTar!B36)","v":""},{"$f":"IF(Prop2021DistTar!C36=\"\",\"\",Prop2021DistTar!C36)","v":""},{"$f":"Prop2021DistTar!BG36","v":0},null,null,{"$f":"Prop2021DistTar!BV36","v":0}]
[{"$f":"OR(EXACT(D75,Prop2021DistTar!C$6:C$65))","v":true},null,null,{"$f":"IF(Prop2021DistTar!B37=\"\",\"\",Prop2021DistTar!B37)","v":""},{"$f":"IF(Prop2021DistTar!C37=\"\",\"\",Prop2021DistTar!C37)","v":""},{"$f":"Prop2021DistTar!BG37","v":0},null,null,{"$f":"Prop2021DistTar!BV37","v":0}]
[{"$f":"OR(EXACT(D76,Prop2021DistTar!C$6:C$65))","v":true},null,null,{"$f":"IF(Prop2021DistTar!B38=\"\",\"\",Prop2021DistTar!B38)","v":""},{"$f":"IF(Prop2021DistTar!C38=\"\",\"\",Prop2021DistTar!C38)","v":""},{"$f":"Prop2021DistTar!BG38","v":0},null,null,{"$f":"Prop2021DistTar!BV38","v":0}]
[{"$f":"OR(EXACT(D77,Prop2021DistTar!C$6:C$65))","v":true},null,null,{"$f":"IF(Prop2021DistTar!B39=\"\",\"\",Prop2021DistTar!B39)","v":""},{"$f":"IF(Prop2021DistTar!C39=\"\",\"\",Prop2021DistTar!C39)","v":""},{"$f":"Prop2021DistTar!BG39","v":0},null,null,{"$f":"Prop2021DistTar!BV39","v":0}]
[{"$f":"OR(EXACT(D78,Prop2021DistTar!C$6:C$65))","v":true},null,null,{"$f":"IF(Prop2021DistTar!B40=\"\",\"\",Prop2021DistTar!B40)","v":""},{"$f":"IF(Prop2021DistTar!C40=\"\",\"\",Prop2021DistTar!C40)","v":""},{"$f":"Prop2021DistTar!BG40","v":0},null,null,{"$f":"Prop2021DistTar!BV40","v":0}]
[{"$f":"OR(EXACT(D79,Prop2021DistTar!C$6:C$65))","v":true},null,null,{"$f":"IF(Prop2021DistTar!B41=\"\",\"\",Prop2021DistTar!B41)","v":""},{"$f":"IF(Prop2021DistTar!C41=\"\",\"\",Prop2021DistTar!C41)","v":""},{"$f":"Prop2021DistTar!BG41","v":0},null,null,{"$f":"Prop2021DistTar!BV41","v":0}]
[{"$f":"OR(EXACT(D80,Prop2021DistTar!C$6:C$65))","v":true},null,null,{"$f":"IF(Prop2021DistTar!B42=\"\",\"\",Prop2021DistTar!B42)","v":""},{"$f":"IF(Prop2021DistTar!C42=\"\",\"\",Prop2021DistTar!C42)","v":""},{"$f":"Prop2021DistTar!BG42","v":0},null,null,{"$f":"Prop2021DistTar!BV42","v":0}]
[{"$f":"OR(EXACT(D81,Prop2021DistTar!C$6:C$65))","v":true},null,null,{"$f":"IF(Prop2021DistTar!B43=\"\",\"\",Prop2021DistTar!B43)","v":""},{"$f":"IF(Prop2021DistTar!C43=\"\",\"\",Prop2021DistTar!C43)","v":""},{"$f":"Prop2021DistTar!BG43","v":0},null,null,{"$f":"Prop2021DistTar!BV43","v":0}]
[{"$f":"OR(EXACT(D82,Prop2021DistTar!C$6:C$65))","v":true},null,null,{"$f":"IF(Prop2021DistTar!B44=\"\",\"\",Prop2021DistTar!B44)","v":""},{"$f":"IF(Prop2021DistTar!C44=\"\",\"\",Prop2021DistTar!C44)","v":""},{"$f":"Prop2021DistTar!BG44","v":0},null,null,{"$f":"Prop2021DistTar!BV44","v":0}]
[{"$f":"OR(EXACT(D83,Prop2021DistTar!C$6:C$65))","v":true},null,null,{"$f":"IF(Prop2021DistTar!B45=\"\",\"\",Prop2021DistTar!B45)","v":""},{"$f":"IF(Prop2021DistTar!C45=\"\",\"\",Prop2021DistTar!C45)","v":""},{"$f":"Prop2021DistTar!BG45","v":0},null,null,{"$f":"Prop2021DistTar!BV45","v":0}]
[{"$f":"OR(EXACT(D84,Prop2021DistTar!C$6:C$65))","v":true},null,null,{"$f":"IF(Prop2021DistTar!B46=\"\",\"\",Prop2021DistTar!B46)","v":""},{"$f":"IF(Prop2021DistTar!C46=\"\",\"\",Prop2021DistTar!C46)","v":""},{"$f":"Prop2021DistTar!BG46","v":0},null,null,{"$f":"Prop2021DistTar!BV46","v":0}]
[{"$f":"OR(EXACT(D85,Prop2021DistTar!C$6:C$65))","v":true},null,null,{"$f":"IF(Prop2021DistTar!B47=\"\",\"\",Prop2021DistTar!B47)","v":""},{"$f":"IF(Prop2021DistTar!C47=\"\",\"\",Prop2021DistTar!C47)","v":""},{"$f":"Prop2021DistTar!BG47","v":0},null,null,{"$f":"Prop2021DistTar!BV47","v":0}]
[{"$f":"OR(EXACT(D86,Prop2021DistTar!C$6:C$65))","v":true},null,null,{"$f":"IF(Prop2021DistTar!B48=\"\",\"\",Prop2021DistTar!B48)","v":""},{"$f":"IF(Prop2021DistTar!C48=\"\",\"\",Prop2021DistTar!C48)","v":""},{"$f":"Prop2021DistTar!BG48","v":0},null,null,{"$f":"Prop2021DistTar!BV48","v":0}]
[{"$f":"OR(EXACT(D87,Prop2021DistTar!C$6:C$65))","v":true},null,null,{"$f":"IF(Prop2021DistTar!B49=\"\",\"\",Prop2021DistTar!B49)","v":""},{"$f":"IF(Prop2021DistTar!C49=\"\",\"\",Prop2021DistTar!C49)","v":""},{"$f":"Prop2021DistTar!BG49","v":0},null,null,{"$f":"Prop2021DistTar!BV49","v":0}]
[{"$f":"OR(EXACT(D88,Prop2021DistTar!C$6:C$65))","v":true},null,null,{"$f":"IF(Prop2021DistTar!B50=\"\",\"\",Prop2021DistTar!B50)","v":""},{"$f":"IF(Prop2021DistTar!C50=\"\",\"\",Prop2021DistTar!C50)","v":""},{"$f":"Prop2021DistTar!BG50","v":0},null,null,{"$f":"Prop2021DistTar!BV50","v":0}]
[{"$f":"OR(EXACT(D89,Prop2021DistTar!C$6:C$65))","v":true},null,null,{"$f":"IF(Prop2021DistTar!B51=\"\",\"\",Prop2021DistTar!B51)","v":""},{"$f":"IF(Prop2021DistTar!C51=\"\",\"\",Prop2021DistTar!C51)","v":""},{"$f":"Prop2021DistTar!BG51","v":0},null,null,{"$f":"Prop2021DistTar!BV51","v":0}]
[{"$f":"OR(EXACT(D90,Prop2021DistTar!C$6:C$65))","v":true},null,null,{"$f":"IF(Prop2021DistTar!B52=\"\",\"\",Prop2021DistTar!B52)","v":""},{"$f":"IF(Prop2021DistTar!C52=\"\",\"\",Prop2021DistTar!C52)","v":""},{"$f":"Prop2021DistTar!BG52","v":0},null,null,{"$f":"Prop2021DistTar!BV52","v":0}]
[{"$f":"OR(EXACT(D91,Prop2021DistTar!C$6:C$65))","v":true},null,null,{"$f":"IF(Prop2021DistTar!B53=\"\",\"\",Prop2021DistTar!B53)","v":""},{"$f":"IF(Prop2021DistTar!C53=\"\",\"\",Prop2021DistTar!C53)","v":""},{"$f":"Prop2021DistTar!BG53","v":0},null,null,{"$f":"Prop2021DistTar!BV53","v":0}]
[{"$f":"OR(EXACT(D92,Prop2021DistTar!C$6:C$65))","v":true},null,null,{"$f":"IF(Prop2021DistTar!B54=\"\",\"\",Prop2021DistTar!B54)","v":""},{"$f":"IF(Prop2021DistTar!C54=\"\",\"\",Prop2021DistTar!C54)","v":""},{"$f":"Prop2021DistTar!BG54","v":0},null,null,{"$f":"Prop2021DistTar!BV54","v":0}]
[{"$f":"OR(EXACT(D93,Prop2021DistTar!C$6:C$65))","v":true},null,null,{"$f":"IF(Prop2021DistTar!B55=\"\",\"\",Prop2021DistTar!B55)","v":""},{"$f":"IF(Prop2021DistTar!C55=\"\",\"\",Prop2021DistTar!C55)","v":""},{"$f":"Prop2021DistTar!BG55","v":0},null,null,{"$f":"Prop2021DistTar!BV55","v":0}]
[{"$f":"OR(EXACT(D94,Prop2021DistTar!C$6:C$65))","v":true},null,null,{"$f":"IF(Prop2021DistTar!B56=\"\",\"\",Prop2021DistTar!B56)","v":""},{"$f":"IF(Prop2021DistTar!C56=\"\",\"\",Prop2021DistTar!C56)","v":""},{"$f":"Prop2021DistTar!BG56","v":0},null,null,{"$f":"Prop2021DistTar!BV56","v":0}]
[{"$f":"OR(EXACT(D95,Prop2021DistTar!C$6:C$65))","v":true},null,null,{"$f":"IF(Prop2021DistTar!B57=\"\",\"\",Prop2021DistTar!B57)","v":""},{"$f":"IF(Prop2021DistTar!C57=\"\",\"\",Prop2021DistTar!C57)","v":""},{"$f":"Prop2021DistTar!BG57","v":0},null,null,{"$f":"Prop2021DistTar!BV57","v":0}]
[{"$f":"OR(EXACT(D96,Prop2021DistTar!C$6:C$65))","v":true},null,null,{"$f":"IF(Prop2021DistTar!B58=\"\",\"\",Prop2021DistTar!B58)","v":""},{"$f":"IF(Prop2021DistTar!C58=\"\",\"\",Prop2021DistTar!C58)","v":""},{"$f":"Prop2021DistTar!BG58","v":0},null,null,{"$f":"Prop2021DistTar!BV58","v":0}]
[{"$f":"OR(EXACT(D97,Prop2021DistTar!C$6:C$65))","v":true},null,null,{"$f":"IF(Prop2021DistTar!B59=\"\",\"\",Prop2021DistTar!B59)","v":""},{"$f":"IF(Prop2021DistTar!C59=\"\",\"\",Prop2021DistTar!C59)","v":""},{"$f":"Prop2021DistTar!BG59","v":0},null,null,{"$f":"Prop2021DistTar!BV59","v":0}]
[{"$f":"OR(EXACT(D98,Prop2021DistTar!C$6:C$65))","v":true},null,null,{"$f":"IF(Prop2021DistTar!B60=\"\",\"\",Prop2021DistTar!B60)","v":""},{"$f":"IF(Prop2021DistTar!C60=\"\",\"\",Prop2021DistTar!C60)","v":""},{"$f":"Prop2021DistTar!BG60","v":0},null,null,{"$f":"Prop2021DistTar!BV60","v":0}]
[{"$f":"OR(EXACT(D99,Prop2021DistTar!C$6:C$65))","v":true},null,null,{"$f":"IF(Prop2021DistTar!B61=\"\",\"\",Prop2021DistTar!B61)","v":""},{"$f":"IF(Prop2021DistTar!C61=\"\",\"\",Prop2021DistTar!C61)","v":""},{"$f":"Prop2021DistTar!BG61","v":0},null,null,{"$f":"Prop2021DistTar!BV61","v":0}]
[{"$f":"OR(EXACT(D100,Prop2021DistTar!C$6:C$65))","v":true},null,null,{"$f":"IF(Prop2021DistTar!B62=\"\",\"\",Prop2021DistTar!B62)","v":""},{"$f":"IF(Prop2021DistTar!C62=\"\",\"\",Prop2021DistTar!C62)","v":""},{"$f":"Prop2021DistTar!BG62","v":0},null,null,{"$f":"Prop2021DistTar!BV62","v":0}]
[{"$f":"OR(EXACT(D101,Prop2021DistTar!C$6:C$65))","v":true},null,null,{"$f":"IF(Prop2021DistTar!B63=\"\",\"\",Prop2021DistTar!B63)","v":""},{"$f":"IF(Prop2021DistTar!C63=\"\",\"\",Prop2021DistTar!C63)","v":""},{"$f":"Prop2021DistTar!BG63","v":0},null,null,{"$f":"Prop2021DistTar!BV63","v":0}]
[{"$f":"OR(EXACT(D102,Prop2021DistTar!C$6:C$65))","v":true},null,null,{"$f":"IF(Prop2021DistTar!B64=\"\",\"\",Prop2021DistTar!B64)","v":""},{"$f":"IF(Prop2021DistTar!C64=\"\",\"\",Prop2021DistTar!C64)","v":""},{"$f":"Prop2021DistTar!BG64","v":0},null,null,{"$f":"Prop2021DistTar!BV64","v":0}]
[{"$f":"OR(EXACT(D103,Prop2021DistTar!C$6:C$65))","v":true},null,null,{"$f":"IF(Prop2021DistTar!B65=\"\",\"\",Prop2021DistTar!B65)","v":""},{"$f":"IF(Prop2021DistTar!C65=\"\",\"\",Prop2021DistTar!C65)","v":""},{"$f":"Prop2021DistTar!BG65","v":0},null,null,{"$f":"Prop2021DistTar!BV65","v":0}]
[null,null,null,null,null,117646252.60225148,null,null,136173854.50137055,null,null,null,null,null,null,null,null,null,null,null,null,null,null,null,null,null,null,null,null,null,null,null,null,null,null,null,null,null,null,null,null,null,null,null,null,null,null,null,null,null,null,null,null,null,null,null,null,null,null,null,null,{"$f":"SUM(BJ44:BJ103)","v":0}]

{"sheet":"Est2020DistRev","index":12,"n_rows":66,"n_cols":45,"rows_kept":66,"cut":false,"hidden":false,"merged":[]}
[null,{"$f":"\"Tariff Approval - \"&'Model update'!C3","v":"Tariff Approval - Jemena"},null,{"$f":"\"Est\"&'Model update'!$C$5-1&\"DistRev\"","v":"Est2020DistRev"}]
[]
[null,{"$f":"\"ESTIMATED \"&'Model update'!$C$8&\" Distribution Revenue\"","v":"ESTIMATED 2020 Distribution Revenue"}]
[null,null,null,{"$f":"\"Current Distribution Tariffs (Pt-1) for \"&'Model update'!$C$8","v":"Current Distribution Tariffs (Pt-1) for 2020"},null,null,null,null,null,null,null,null,null,null,null,null,null,{"$f":"\" Estimated Distribution Quantities for \"&'Model update'!$C$8&\" (Qt-1)\"","v":" Estimated Distribution Quantities for 2020 (Qt-1)"},null,null,null,null,null,null,null,null,null,null,null,null,null,{"$f":"\"Estimated Revenue (Pt-1 \"&'Model update'!$C$8&\")*(Qt-1 \" &'Model update'!$C$8&\")\"","v":"Estimated Revenue (Pt-1 2020)*(Qt-1 2020)"}]
[null,{"$f":"\"Tariffs \"&'[2]Model update'!C8","v":"Tariffs 2019"},null,"CurrentTar\nFixed","CurrentTar\nPkBlk1","CurrentTar\nShoulder\n summer","CurrentTar\npeak\n non-summer","CurrentTar\nShoulder\n non-summer","CurrentTar\nOPkBlk1","CurrentTar\noff peak\n non-summer","CurrentTar\nOPkBlk3","CurrentTar\nOPkBlk4","CurrentTar\nDemBlk1","CurrentTar\nDemBlk2","CurrentTar\nDemBlk3","CurrentTar\nDemBlk4",null,"EstVol\nFixed","EstVol\nPkBlk1","EstVol\nShoulder\n summer","EstVol\npeak\n non-summer","EstVol\nShoulder\n non-summer","EstVol\nOPkBlk1","EstVol\noff peak\n non-summer","EstVol\nOPkBlk3","EstVol\nOPkBlk4","EstVol\nDemBlk1","EstVol\nDemBlk2","EstVol\nDemBlk3","EstVol\nDemBlk4",null,"EstRev\nFixed","EstRev\nPkBlk1","EstRev\nShoulder\n summer","EstRev\npeak\n non-summer","EstRev\nShoulder\n non-summer","EstRev\nOPkBlk1","EstRev\noff peak\n non-summer","EstRev\nOPkBlk3","EstRev\nOPkBlk4","EstRev\nDemBlk1","EstRev\nDemBlk2","EstRev\nDemBlk3","EstRev\nDemBlk4","EstRev\nTotal"]
[null,{"$f":"Prop2021DistTar!C6","v":"Residential - General Purpose"},null,58.658999999999999,7.8209999999999997,0,0,0,0,0,0,0,0,0,0,0,null,306575.30807278171,1266807386.9769201,0,0,0,0,0,0,0,0,0,0,0,null,{"$f":"D6*R6","v":17983400.996241301},{"$f":"E6/100*S6","v":99077005.735464931},0,0,0,0,0,0,0,{"$f":"M6*AA6","v":0},0,0,0,{"$f":"SUM(AF6:AR6)","v":117060406.73170623}]
[null,{"$f":"Prop2021DistTar!C7","v":"Residential - General Purpose Demand"},null,58.658999999999999,3.4430000000000001,0,0,0,0,0,0,0,60.030999999999999,0,0,0,null,5.1347640165386892,21217.484954757827,0,0,0,0,0,0,0,18.720113423909069,0,0,0,null,{"$f":"D7*R7","v":301.20012244614298},{"$f":"E7/100*S7","v":730.51800699231205},0,0,0,0,0,0,0,{"$f":"M7*AA7","v":1123.7871289506852},{"$f":"N7*AB7","v":0},{"$f":"O7*AC7","v":0},{"$f":"P7*AD7","v":0},{"$f":"SUM(AF7:AR7)","v":2155.5052583891402}]
[null,{"$f":"Prop2021DistTar!C8","v":"Residential - Flexible"},null,58.658999999999999,12.601000000000001,7.8209999999999997,12.601000000000001,7.8209999999999997,3.8021235600000005,3.802,0,0,0,0,0,0,null,1066.2492584462116,513894.55721864023,963834.63691581169,676158.92824800813,1257062.401155025,1020330.2665451433,821885.29757990199,0,0,0,0,0,0,null,62545.115251196323,64755.853155120858,75381.506953185628,85202.786548531512,98314.850394334513,38794.217454123704,31248.079013987874,0,0,0,0,0,0,456242.40877048043]
[null,{"$f":"Prop2021DistTar!C9","v":"Residential - Time of Use Interval Meter"},null,58.658999999999999,12.67,0,0,0,1.8440000000000001,0,0,0,0,0,0,0,null,14984.050894672075,31652210.499869257,0,0,0,32760180.553020246,0,0,0,0,0,0,0,null,878949.44143056916,4010335.0703334352,0,0,0,604097.72939769342,0,0,0,0,0,0,0,5493382.2411616985]
[null,{"$f":"Prop2021DistTar!C10","v":"Residential - TOU"},null,99.122,8.7390000000000008,0,0,0,1.4750000000000001,0,0,0,0,0,0,0,null,1371.2863289598004,5320045.4643695848,0,0,0,5826260.5138682965,0,0,0,0,0,0,0,null,135924.64349915332,464918.77313125809,0,0,0,85937.342579557386,0,0,0,0,0,0,0,686780.75920996885]
[null,{"$f":"Prop2021DistTar!C11","v":"Residential - Off Peak Only"},null,0,0,0,0,0,1.7,0,0,0,0,0,0,0,null,0,0,0,0,0,35918450.399999999,0,0,0,0,0,0,0,null,0,0,0,0,0,610613.6568,0,0,0,0,0,0,0,610613.6568]
[null,{"$f":"Prop2021DistTar!C12","v":"Small Business - General Purpose"},null,101.483,9.3460000000000001,0,0,0,0,0,0,0,0,0,0,0,null,16418.559051838351,206322791.89761865,0,0,0,0,0,0,0,0,0,0,0,null,1666204.6282577114,19282928.130751438,0,0,0,0,0,0,0,0,0,0,0,20949132.759009149]
[null,{"$f":"Prop2021DistTar!C13","v":"Small Business - General Purpose Demand"},null,101.483,7.3710000000000004,0,0,0,0,0,0,0,58.183,0,0,0,null,1.3441028832820421,null,0,0,0,null,0,0,0,null,0,0,0,null,136.40359290411149,null,0,0,0,null,0,0,0,null,0,0,0]
[null,{"$f":"Prop2021DistTar!C14","v":"Small Business - TOU Weekdays"},null,156.02699999999999,11.055999999999999,0,0,0,1.8180000000000001,0,0,0,0,0,0,0,null,7696.4637088728678,170924694.64658788,0,0,0,111481488.5433978,0,0,0,0,0,0,0,null,1200856.1431043069,18897434.240126755,0,0,0,2026733.4617189721,0,0,0,0,0,0,0,22125023.844950035]
[null,{"$f":"Prop2021DistTar!C15","v":"Small Business - TOU Weekdays Demand"},null,225.87899999999999,6.8090000000000002,0,0,0,2.121,0,0,0,66.547394999999995,0,0,0,null,667.28378135925652,69784438.34049274,0,0,0,48547711.912917271,0,0,0,52693.968920385516,0,0,0,null,150725.39324964749,4751622.4066041503,0,0,0,1029696.9696729754,0,0,0,3506646.3638626183,0,0,0,9438691.133389391]
[null,{"$f":"Prop2021DistTar!C16","v":"Small Business - TOU Opt out"},null,225.87899999999999,11.055999999999999,0,0,0,1.8180000000000001,0,0,0,0,0,0,0,null,51,5349072.5168804051,0,0,0,0,0,0,0,0,0,0,0,null,11519.829,591393.45746629755,0,0,0,0,0,0,0,0,0,0,0,602913.28646629758]
[null,{"$f":"Prop2021DistTar!C17","v":"Small Business - TOU Extended"},null,156.02699999999999,9.7929999999999993,0,0,0,1.97,0,0,0,0,0,0,0,null,2331.8302291643386,41771214.934357092,0,0,0,12782107.315068349,0,0,0,0,0,0,0,null,363828.47516582423,4090655.0785215897,0,0,0,251807.51410684647,0,0,0,0,0,0,0,4706291.0677942606]
[null,{"$f":"Prop2021DistTar!C18","v":"Small Business - TOU Extended Demand"},null,225.87899999999999,5.1710000000000003,0,0,0,2.2610000000000001,0,0,0,66.547394999999995,0,0,0,null,115.42492610588147,18810985.691259697,0,0,0,5531396.4801097829,0,0,0,11957.522916120826,0,0,0,null,26072.0668838704,972716.07009503909,0,0,0,125064.8744152822,0,0,0,795742.00072064437,0,0,0,1919595.0121148361]
[null,{"$f":"Prop2021DistTar!C19","v":"Small Business - Unmetered Supply"},null,0,10.484999999999999,0,0,0,1.8879999999999999,0,0,0,0,0,0,0,null,0,11872124.141451633,0,0,0,26427874.316186763,0,0,0,0,0,0,0,null,0,1244792.2162312036,0,0,0,498958.26708960603,0,0,0,0,0,0,0,1743750.4833208097]
[null,{"$f":"Prop2021DistTar!C20","v":"Large Business - LV 0.4 - 0.8  GWh"},null,2465.4369999999999,2.0179999999999998,0,0,0,0.63900000000000001,0,0,0,100.021,0,0,0,null,749.25602440853856,175307653.61086828,0,0,0,112610508.31071167,0,0,0,158812.03524374045,0,0,0,null,1847243.5250497139,3537708.4498673212,0,0,0,719581.14810544753,0,0,0,15884538.577114163,0,0,0,21989071.700136647]
[null,{"$f":"Prop2021DistTar!C21","v":"Large Business – LVEN Annual Consumption <= 0.8 GWh"},null,2465.4369999999999,2.036,0,0,0,0.63900000000000001,0,0,0,112.849,0,0,0,null,70.7,20519791.039106935,0,0,0,14174690.692897588,0,0,0,17202.081248756916,0,0,0,null,174306.3959,417782.94555621722,0,0,0,90576.273527615587,0,0,0,1941237.6668409694,0,0,0,2623903.281824802]
[null,{"$f":"Prop2021DistTar!C22","v":"Large Business - LV  0.8+ - 2.2  GWh"},null,4315.5290000000005,1.377,0,0,0,0.628,0,0,0,92.453000000000003,0,0,0,null,374.98824601779569,269437471.12732029,0,0,0,186190977.36452416,0,0,0,177693.86175211633,0,0,0,null,1618272.650348932,3710153.9774232004,0,0,0,1169279.3378492116,0,0,0,16428330.600568412,0,0,0,22926036.566189755]
[null,{"$f":"Prop2021DistTar!C23","v":"Large Business - LVEN 0.8+ - 2.2 GWh"},null,4315.5290000000005,1.3759999999999999,0,0,0,0.628,0,0,0,101.70699999999999,0,0,0,null,44,28725458.954160832,0,0,0,18896186.890550263,0,0,0,19831.315594159551,0,0,0,null,189883.27600000001,395262.31520925305,0,0,0,118668.05367265565,0,0,0,2016983.6151351852,0,0,0,2720797.2600170937]
[null,{"$f":"Prop2021DistTar!C24","v":"Large Business - LV  2.2+ - 6.0  GWh"},null,6619.21,1.26,0,0,0,0.51100000000000001,0,0,0,91.454999999999998,0,0,0,null,72.658405644771136,123632421.38602075,0,0,0,93477286.12733683,0,0,0,71075.884111762309,0,0,0,null,480941.24522792554,1557768.5094638614,0,0,0,477668.93211069121,0,0,0,6500244.9814412221,0,0,0,9016623.6682437006]
[null,{"$f":"Prop2021DistTar!C25","v":"Large Business - LVEN 2.2+  GWh"},null,6619.21,1.26,0,0,0,0.51100000000000001,0,0,0,96.582999999999998,0,0,0,null,17.356738088970275,31188816.298056275,0,0,0,22454485.842506148,0,0,0,16630.356489875488,0,0,0,null,114887.89432589294,392979.08535550907,0,0,0,114742.42265520642,0,0,0,1606209.7208616443,0,0,0,2228819.1231982526]
[null,{"$f":"Prop2021DistTar!C26","v":"Large Business - LVMS 2.2+ - 6.0  GWh"},null,3901.2840000000001,1.2470000000000001,0,0,0,0.51100000000000001,0,0,0,62.088000000000001,0,0,0,null,11,10947685.647079621,0,0,0,8831426.1577504948,0,0,0,7857.6586842206161,0,0,0,null,42914.124000000003,136517.6400190829,0,0,0,45128.587666105028,0,0,0,487866.31238588964,0,0,0,712426.6640710776]
[null,{"$f":"Prop2021DistTar!C27","v":"Large Business - LV 6.0+ GWh"},null,9072.5110000000004,1.2250000000000001,0,0,0,0.45500000000000002,0,0,0,87.832999999999998,0,0,0,null,19,54016087.341418602,0,0,0,45267619.454763725,0,0,0,24539.682295465598,0,0,0,null,172377.709,661697.0699323779,0,0,0,205967.66851917497,0,0,0,2155393.9150576298,0,0,0,3195436.3625091827]
[null,{"$f":"Prop2021DistTar!C28","v":"Large Business - LVMS 6.0+ GWh"},null,5268.9719999999998,1.2250000000000001,0,0,0,0.45500000000000002,0,0,0,62.192999999999998,0,0,0,null,31,51574099.296529979,0,0,0,40147645.062499203,0,0,0,29061.411443311492,0,0,0,null,163338.13199999998,631782.71638249222,0,0,0,182671.78503437139,0,0,0,1807416.3618938716,0,0,0,2785208.995310735]
[null,{"$f":"Prop2021DistTar!C29","v":"Large Business - HV"},null,6494.2150000000001,0.81899999999999995,0,0,0,0.23699999999999999,0,0,0,73.632000000000005,0,0,0,null,79.966666666666669,261382203.45185706,0,0,0,207377504.4944478,0,0,0,179403.34860269385,0,0,0,null,519320.72616666672,2140720.2462707092,0,0,0,491484.68565184122,0,0,0,13209827.364313554,0,0,0,16361353.022402771]
[null,{"$f":"Prop2021DistTar!C30","v":"Large Business – HVEN"},null,6494.2150000000001,0.82199999999999995,0,0,0,0.23699999999999999,0,0,0,75.863,0,0,0,null,2,null,0,0,0,null,0,0,0,null,0,0,0,null,12988.43,null,0,0,0,null,0,0,0,null,0,0,0]
[null,{"$f":"Prop2021DistTar!C31","v":"Large Business - HVRF"},null,6494.2150000000001,0.81100000000000005,0,0,0,0.23699999999999999,0,0,0,67.658000000000001,0,0,0,null,1.9666666666666666,null,0,0,0,null,0,0,0,null,0,0,0,null,12771.956166666667,null,0,0,0,null,0,0,0,null,0,0,0]
[null,{"$f":"Prop2021DistTar!C32","v":"Large Business - HV Ann Cons >= 55GWh"},null,6066.2610000000004,0.78200000000000003,0,0,0,0.184,0,0,0,65.328000000000003,0,0,0,null,1,null,0,0,0,null,0,0,0,null,0,0,0,null,6066.2610000000004,null,0,0,0,null,0,0,0,null,0,0,0]
[null,{"$f":"Prop2021DistTar!C33","v":"Large Business - Subtransmission"},null,40563.08,0.153,0,0,0,4.4999999999999998E-2,0,0,0,20.196999999999999,0,0,0,null,3,null,0,0,0,null,0,0,0,null,0,0,0,null,121689.24,null,0,0,0,null,0,0,0,null,0,0,0]
[null,{"$f":"Prop2021DistTar!C34","v":"Large Business - Subtransmission MA"},null,40563.08,0.153,0,0,0,4.4999999999999998E-2,0,0,0,20.280999999999999,0,0,0,null,1,null,0,0,0,null,0,0,0,null,0,0,0,null,40563.08,null,0,0,0,null,0,0,0,null,0,0,0]
[null,{"$f":"Prop2021DistTar!C35","v":"Large Business - Subtransmission EG"},null,31516.883999999998,0.14599999999999999,0,0,0,2.3E-2,0,0,0,3.4780000000000002,0,0,0,null,1,null,0,0,0,null,0,0,0,null,0,0,0,null,31516.883999999998,null,0,0,0,null,0,0,0,null,0,0,0]
[null,null,null,null,null,null,null,null,null,null,null,null,null,null,null,null,null,null,null,null,null,null,null,null,null,null,null,null,null,null,null,0,0,0,0,0,0,0,0,0,0,0,0,0,0]
[null,null,null,null,null,null,null,null,null,null,null,null,null,null,null,null,null,null,null,null,null,null,null,null,null,null,null,null,null,null,null,0,0,0,0,0,0,0,0,0,0,0,0,0,0]
[null,null,null,null,null,null,null,null,null,null,null,null,null,null,null,null,null,null,null,null,null,null,null,null,null,null,null,null,null,null,null,0,0,0,0,0,0,0,0,{"$f":"L38/100*Z38","v":0},0,0,0,0,0]
[null,null,null,null,null,null,null,null,null,null,null,null,null,null,null,null,null,null,null,null,null,null,null,null,null,null,null,null,null,null,null,0,0,0,0,0,0,0,0,0,0,0,0,0,0]
[null,null,null,null,null,null,null,null,null,null,null,null,null,null,null,null,null,null,null,null,null,null,null,null,null,null,null,null,null,null,null,0,0,0,0,0,0,0,0,0,0,0,0,0,0]
[null,null,null,null,null,null,null,null,null,null,null,null,null,null,null,null,null,null,null,null,null,null,null,null,null,null,null,null,null,null,null,0,0,0,0,0,0,0,0,0,0,0,0,0,0]
[null,null,null,null,null,null,null,null,null,null,null,null,null,null,null,null,null,null,null,null,null,null,null,null,null,null,null,null,null,null,null,0,0,0,0,0,0,0,0,0,0,0,0,0,0]
[null,null,null,null,null,null,null,null,null,null,null,null,null,null,null,null,null,null,null,null,null,null,null,null,null,null,null,null,null,null,null,0,0,0,0,0,0,0,0,0,0,0,0,0,0]
[null,null,null,null,null,null,null,null,null,null,null,null,null,null,null,null,null,null,null,null,null,null,null,null,null,null,null,null,null,null,null,0,0,0,0,0,0,0,0,0,0,0,0,0,0]
[null,null,null,null,null,null,null,null,null,null,null,null,null,null,null,null,null,null,null,null,null,null,null,null,null,null,null,null,null,null,null,0,0,0,0,0,0,0,0,0,0,0,0,0,0]
[null,null,null,null,null,null,null,null,null,null,null,null,null,null,null,null,null,null,null,null,null,null,null,null,null,null,null,null,null,null,null,0,0,0,0,0,0,0,0,0,0,0,0,0,0]
[null,null,null,null,null,null,null,null,null,null,null,null,null,null,null,null,null,null,null,null,null,null,null,null,null,null,null,null,null,null,null,0,0,0,0,0,0,0,0,0,0,0,0,0,0]
[null,null,null,null,null,null,null,null,null,null,null,null,null,null,null,null,null,null,null,null,null,null,null,null,null,null,null,null,null,null,null,0,0,0,0,0,0,0,0,0,0,0,0,0,0]
[null,null,null,null,null,null,null,null,null,null,null,null,null,null,null,null,null,null,null,null,null,null,null,null,null,null,null,null,null,null,null,0,0,0,0,0,0,0,0,0,0,0,0,0,0]
[null,null,null,null,null,null,null,null,null,null,null,null,null,null,null,null,null,null,null,null,null,null,null,null,null,null,null,null,null,null,null,0,0,0,0,0,0,0,0,0,0,0,0,0,0]
[null,null,null,null,null,null,null,null,null,null,null,null,null,null,null,null,null,null,null,null,null,null,null,null,null,null,null,null,null,null,null,0,0,0,0,0,0,0,0,0,0,0,0,0,0]
[null,null,null,null,null,null,null,null,null,null,null,null,null,null,null,null,null,null,null,null,null,null,null,null,null,null,null,null,null,null,null,0,0,0,0,0,0,0,0,0,0,0,0,0,0]
[null,null,null,null,null,null,null,null,null,null,null,null,null,null,null,null,null,null,null,null,null,null,null,null,null,null,null,null,null,null,null,0,0,0,0,0,0,0,0,0,0,0,0,0,0]
[null,null,null,null,null,null,null,null,null,null,null,null,null,null,null,null,null,null,null,null,null,null,null,null,null,null,null,null,null,null,null,0,0,0,0,0,0,0,0,0,0,0,0,0,0]
[null,null,null,null,null,null,null,null,null,null,null,null,null,null,null,null,null,null,null,null,null,null,null,null,null,null,null,null,null,null,null,0,0,0,0,0,0,0,0,0,0,0,0,0,0]
[null,null,null,null,null,null,null,null,null,null,null,null,null,null,null,null,null,null,null,null,null,null,null,null,null,null,null,null,null,null,null,0,0,0,0,0,0,0,0,0,0,0,0,0,0]
[null,null,null,null,null,null,null,null,null,null,null,null,null,null,null,null,null,null,null,null,null,null,null,null,null,null,null,null,null,null,null,0,0,0,0,0,0,0,0,0,0,0,0,0,0]
[null,null,null,null,null,null,null,null,null,null,null,null,null,null,null,null,null,null,null,null,null,null,null,null,null,null,null,null,null,null,null,0,0,0,0,0,0,0,0,0,0,0,0,0,0]
[null,null,null,null,null,null,null,null,null,null,null,null,null,null,null,null,null,null,null,null,null,null,null,null,null,null,null,null,null,null,null,0,0,0,0,0,0,0,0,0,0,0,0,0,0]
[null,null,null,null,null,null,null,null,null,null,null,null,null,null,null,null,null,null,null,null,null,null,null,null,null,null,null,null,null,null,null,0,0,0,0,0,0,0,0,0,0,0,0,0,0]
[null,null,null,null,null,null,null,null,null,null,null,null,null,null,null,null,null,null,null,null,null,null,null,null,null,null,null,null,null,null,null,0,0,0,0,0,0,0,0,0,0,0,0,0,0]
[null,null,null,null,null,null,null,null,null,null,null,null,null,null,null,null,null,null,null,null,null,null,null,null,null,null,null,null,null,null,null,0,0,0,0,0,0,0,0,0,0,0,0,0,0]
[null,null,null,null,null,null,null,null,null,null,null,null,null,null,null,null,null,null,null,null,null,null,null,null,null,null,null,null,null,null,null,0,0,0,0,0,0,0,0,0,0,0,0,0,0]
[null,null,null,null,null,null,null,null,null,null,null,null,null,null,null,null,null,null,null,null,null,null,null,null,null,null,null,null,null,null,null,0,0,0,0,0,0,0,0,0,0,0,0,0,0]
[null,null,null,null,null,null,null,null,null,null,null,null,null,null,null,null,null,null,null,null,null,null,null,null,null,null,null,null,null,null,null,0,0,0,0,0,0,0,0,0,0,0,0,0,0]
[null,null,null,null,null,null,null,null,null,null,null,null,null,null,null,null,null,{"$f":"SUM(R6:R65)","v":352763.82786659373},3118566390.8501525,963834.63691581169,676158.92824800813,1257062.401155025,1294294326.2574909,821885.29757990199,0,0,930066.14668347081,{"$f":"SUM(AB6:AB65)","v":0},0,0,null,28029545.864984717,167830515.75640932,75381.506953185628,85202.786548531512,98314.850394334513,9093656.1421164218,31248.079013987874,{"$f":"SUM(AM6:AM65)","v":0},0,70330873.25167805,0,0,0,275574738.23809862]

{"sheet":"Prop2021TransTar","index":13,"n_rows":66,"n_cols":45,"rows_kept":66,"cut":false,"hidden":false,"merged":[]}
[null,{"$f":"\"Tariff Approval - \"&'Model update'!C3","v":"Tariff Approval - Jemena"},null,{"$f":"\"Prop\"&'Model update'!$C$5&\"TransTar\"","v":"Prop2021TransTar"}]
[]
[null,{"$f":"\"PROPOSED \"&'Model update'!$C$5&\" TRANSMISSION TARIFFS\"","v":"PROPOSED 2021 TRANSMISSION TARIFFS"}]
[null,null,null,{"$f":"\"Proposed Transmission Tariffs (Pt) for \"&'Model update'!$C$5","v":"Proposed Transmission Tariffs (Pt) for 2021"},null,null,null,null,null,null,null,null,null,null,null,null,null,{"$f":"\"Forecast Quantities (Qt) for \"&'Model update'!$C$5","v":"Forecast Quantities (Qt) for 2021"},null,null,null,null,null,null,null,null,null,null,null,null,null,{"$f":"\"Forecast Revenue (Pt \"&'Model update'!$C$5&\")*(Qt \" &'Model update'!$C$5&\")\"","v":"Forecast Revenue (Pt 2021)*(Qt 2021)"}]
[null,"Proposed tariff",null,{"$f":"[2]Prop2020DistTar!D5","v":"PropTar\nFixed"},{"$f":"[2]Prop2020DistTar!E5","v":"PropTar\nPkBlk1"},{"$f":"[2]Prop2020DistTar!F5","v":"PropTar\nShoulder\n summer"},{"$f":"[2]Prop2020DistTar!G5","v":"PropTar\npeak\n non-summer"},{"$f":"[2]Prop2020DistTar!H5","v":"PropTar\nShoulder\n non-summer"},{"$f":"[2]Prop2020DistTar!I5","v":"PropTar\nOPkBlk1"},{"$f":"[2]Prop2020DistTar!J5","v":"PropTar\noff peak\n non-summer"},{"$f":"[2]Prop2020DistTar!K5","v":"PropTar\nOPkBlk3"},{"$f":"[2]Prop2020DistTar!L5","v":"PropTar\nOPkBlk4"},{"$f":"[2]Prop2020DistTar!M5","v":"PropTar\nDemBlk1"},{"$f":"[2]Prop2020DistTar!N5","v":"PropTar\nDemBlk2"},{"$f":"[2]Prop2020DistTar!O5","v":"PropTar\nDemBlk3"},{"$f":"[2]Prop2020DistTar!P5","v":"PropTar\nDemBlk4"},null,{"$f":"[2]Prop2020DistTar!AF5","v":"FcastVol\nFixed"},{"$f":"[2]Prop2020DistTar!AG5","v":"FcastVol\nPkBlk1"},{"$f":"[2]Prop2020DistTar!AH5","v":"FcastVol\nShoulder\n summer"},{"$f":"[2]Prop2020DistTar!AI5","v":"FcastVol\npeak\n non-summer"},{"$f":"[2]Prop2020DistTar!AJ5","v":"FcastVol\nShoulder\n non-summer"},{"$f":"[2]Prop2020DistTar!AK5","v":"FcastVol\nOPkBlk1"},{"$f":"[2]Prop2020DistTar!AL5","v":"FcastVol\noff peak\n non-summer"},{"$f":"[2]Prop2020DistTar!AM5","v":"FcastVol\nOPkBlk3"},{"$f":"[2]Prop2020DistTar!AN5","v":"FcastVol\nOPkBlk4"},{"$f":"[2]Prop2020DistTar!AO5","v":"FcastVol\nDemBlk1"},{"$f":"[2]Prop2020DistTar!AP5","v":"FcastVol\nDemBlk2"},{"$f":"[2]Prop2020DistTar!AQ5","v":"FcastVol\nDemBlk3"},{"$f":"[2]Prop2020DistTar!AR5","v":"FcastVol\nDemBlk4"},null,"PropRev\nFixed","PropRev\nPkBlk1","PropRev\nPkBlk2","PropRev\nPkBlk3","PropRev\nPkBlk4","PropRev\nOPkBlk1","PropRev\nOPkBlk2","PropRev\nOPkBlk3","PropRev\nOPkBlk4","PropRev\nDemBlk1","PropRev\nDemBlk2","PropRev\nDemBlk3","PropRev\nDemBlk4","PropRev\nTotal"]
[null,{"$f":"Prop2021DistTar!B6","v":"Residential - General Purpose"},null,1.5720000000000001,0.94899999999999995,0,0,0,0,0,0,0,0,0,0,0,null,{"$f":"Prop2021DistTar!AF6","v":158878.44437637989},{"$f":"Prop2021DistTar!AG6","v":639147331.87384105},{"$f":"Prop2021DistTar!AH6","v":0},{"$f":"Prop2021DistTar!AI6","v":0},{"$f":"Prop2021DistTar!AJ6","v":0},{"$f":"Prop2021DistTar!AK6","v":0},{"$f":"Prop2021DistTar!AL6","v":0},{"$f":"Prop2021DistTar!AM6","v":0},{"$f":"Prop2021DistTar!AN6","v":0},{"$f":"Prop2021DistTar!AO6","v":0},{"$f":"Prop2021DistTar!AP6","v":0},{"$f":"Prop2021DistTar!AQ6","v":0},{"$f":"Prop2021DistTar!AR6","v":0},null,{"$f":"D6*R6","v":249756.91455966921},{"$f":"E6/100*S6","v":6065508.1794827515},0,0,0,0,0,0,0,{"$f":"M6*AA6","v":0},0,0,0,{"$f":"SUM(AF6:AR6)","v":6315265.0940424204}]
[null,{"$f":"Prop2021DistTar!B7","v":"Residential - General Purpose Demand"},null,1.5720000000000001,0.94899999999999995,0,0,0,0,0,0,0,0,0,0,0,null,{"$f":"Prop2021DistTar!AF7","v":2.7105349653743454},{"$f":"Prop2021DistTar!AG7","v":30970.703999999998},{"$f":"Prop2021DistTar!AH7","v":0},{"$f":"Prop2021DistTar!AI7","v":0},{"$f":"Prop2021DistTar!AJ7","v":0},{"$f":"Prop2021DistTar!AK7","v":0},{"$f":"Prop2021DistTar!AL7","v":0},{"$f":"Prop2021DistTar!AM7","v":0},{"$f":"Prop2021DistTar!AN7","v":0},{"$f":"Prop2021DistTar!AO7","v":5},{"$f":"Prop2021DistTar!AP7","v":0},{"$f":"Prop2021DistTar!AQ7","v":0},{"$f":"Prop2021DistTar!AR7","v":0},null,{"$f":"D7*R7","v":4.2609609655684713},{"$f":"E7/100*S7","v":293.91198095999999},0,0,0,0,0,0,0,{"$f":"M7*AA7","v":0},{"$f":"N7*AB7","v":0},{"$f":"O7*AC7","v":0},{"$f":"P7*AD7","v":0},{"$f":"SUM(AF7:AR7)","v":298.17294192556847}]
[null,{"$f":"Prop2021DistTar!B8","v":"Residential - Flexible"},null,1.5720000000000001,0.42799999999999999,0.94899999999999995,0.42799999999999999,0.94899999999999995,5.0999999999999997E-2,5.0999999999999997E-2,0,0,0,0,0,0,null,{"$f":"Prop2021DistTar!AF8","v":415.0488379731334},{"$f":"Prop2021DistTar!AG8","v":309609.74663146213},{"$f":"Prop2021DistTar!AH8","v":580688.3796264258},{"$f":"Prop2021DistTar!AI8","v":407370.3282449813},{"$f":"Prop2021DistTar!AJ8","v":757351.41782394319},{"$f":"Prop2021DistTar!AK8","v":614725.70757555286},{"$f":"Prop2021DistTar!AL8","v":495167.14113703655},{"$f":"Prop2021DistTar!AM8","v":0},{"$f":"Prop2021DistTar!AN8","v":0},{"$f":"Prop2021DistTar!AO8","v":0},{"$f":"Prop2021DistTar!AP8","v":0},{"$f":"Prop2021DistTar!AQ8","v":0},{"$f":"Prop2021DistTar!AR8","v":0},null,652.45677329376576,1325.1297155826578,5510.7327226547814,1743.54500488852,7187.2649551492214,313.51011086353191,252.53524197988861,0,0,0,0,0,0,16985.174524412363]
[null,{"$f":"Prop2021DistTar!B9","v":"Residential - Time of Use Interval Meter"},null,1.5720000000000001,0.42799999999999999,0,0,0,0.58599999999999997,0,0,0,0,0,0,0,null,{"$f":"Prop2021DistTar!AF9","v":7444.4842589952177},{"$f":"Prop2021DistTar!AG9","v":16938462.590739086},{"$f":"Prop2021DistTar!AH9","v":0},{"$f":"Prop2021DistTar!AI9","v":0},{"$f":"Prop2021DistTar!AJ9","v":0},{"$f":"Prop2021DistTar!AK9","v":17531385.138661444},{"$f":"Prop2021DistTar!AL9","v":0},{"$f":"Prop2021DistTar!AM9","v":0},{"$f":"Prop2021DistTar!AN9","v":0},{"$f":"Prop2021DistTar!AO9","v":0},{"$f":"Prop2021DistTar!AP9","v":0},{"$f":"Prop2021DistTar!AQ9","v":0},{"$f":"Prop2021DistTar!AR9","v":0},null,11702.729255140483,72496.61988836329,0,0,0,102733.91691255606,0,0,0,0,0,0,0,186933.26605605983]
[null,{"$f":"Prop2021DistTar!B10","v":"Residential - TOU"},null,0.52100000000000002,3.1219999999999999,0,0,0,1.0129999999999999,0,0,0,0,0,0,0,null,{"$f":"Prop2021DistTar!AF10","v":678.12900963762252},{"$f":"Prop2021DistTar!AG10","v":3116768.9030617047},{"$f":"Prop2021DistTar!AH10","v":0},{"$f":"Prop2021DistTar!AI10","v":0},{"$f":"Prop2021DistTar!AJ10","v":0},{"$f":"Prop2021DistTar!AK10","v":3413336.9183364362},{"$f":"Prop2021DistTar!AL10","v":0},{"$f":"Prop2021DistTar!AM10","v":0},{"$f":"Prop2021DistTar!AN10","v":0},{"$f":"Prop2021DistTar!AO10","v":0},{"$f":"Prop2021DistTar!AP10","v":0},{"$f":"Prop2021DistTar!AQ10","v":0},{"$f":"Prop2021DistTar!AR10","v":0},null,353.30521402120132,97305.525153586408,0,0,0,34577.102982748096,0,0,0,0,0,0,0,132235.93335035571]
[null,{"$f":"Prop2021DistTar!B11","v":"Residential - Off Peak Only"},null,0,0,0,0,0,1.177,0,0,0,0,0,0,0,null,{"$f":"Prop2021DistTar!AF11","v":0},{"$f":"Prop2021DistTar!AG11","v":0},{"$f":"Prop2021DistTar!AH11","v":0},{"$f":"Prop2021DistTar!AI11","v":0},{"$f":"Prop2021DistTar!AJ11","v":0},{"$f":"Prop2021DistTar!AK11","v":15302727.75693658},{"$f":"Prop2021DistTar!AL11","v":0},{"$f":"Prop2021DistTar!AM11","v":0},{"$f":"Prop2021DistTar!AN11","v":0},{"$f":"Prop2021DistTar!AO11","v":0},{"$f":"Prop2021DistTar!AP11","v":0},{"$f":"Prop2021DistTar!AQ11","v":0},{"$f":"Prop2021DistTar!AR11","v":0},null,0,0,0,0,0,180113.10569914355,0,0,0,0,0,0,0,180113.10569914355]
[null,{"$f":"Prop2021DistTar!B12","v":"Small Business - General Purpose"},null,2.036,1.5209999999999999,0,0,0,0,0,0,0,0,0,0,0,null,{"$f":"Prop2021DistTar!AF12","v":9576.2728656799682},{"$f":"Prop2021DistTar!AG12","v":101667470.01587997},{"$f":"Prop2021DistTar!AH12","v":0},{"$f":"Prop2021DistTar!AI12","v":0},{"$f":"Prop2021DistTar!AJ12","v":0},{"$f":"Prop2021DistTar!AK12","v":0},{"$f":"Prop2021DistTar!AL12","v":0},{"$f":"Prop2021DistTar!AM12","v":0},{"$f":"Prop2021DistTar!AN12","v":0},{"$f":"Prop2021DistTar!AO12","v":0},{"$f":"Prop2021DistTar!AP12","v":0},{"$f":"Prop2021DistTar!AQ12","v":0},{"$f":"Prop2021DistTar!AR12","v":0},null,19497.291554524414,1546362.2189415344,0,0,0,0,0,0,0,0,0,0,0,1565859.5104960587]
[null,{"$f":"Prop2021DistTar!B13","v":"Small Business - General Purpose Demand"},null,2.036,1.5209999999999999,0,0,0,0,0,0,0,0,0,0,0,null,{"$f":"Prop2021DistTar!AF13","v":0.50591858632470232},null,{"$f":"Prop2021DistTar!AH13","v":0},{"$f":"Prop2021DistTar!AI13","v":0},{"$f":"Prop2021DistTar!AJ13","v":0},null,{"$f":"Prop2021DistTar!AL13","v":0},{"$f":"Prop2021DistTar!AM13","v":0},{"$f":"Prop2021DistTar!AN13","v":0},null,{"$f":"Prop2021DistTar!AP13","v":0},{"$f":"Prop2021DistTar!AQ13","v":0},{"$f":"Prop2021DistTar!AR13","v":0},null,1.030050241757094,null,0,0,0,null,0,0,0,null,0,0,0]
[null,{"$f":"Prop2021DistTar!B14","v":"Small Business - TOU Weekdays"},null,29.25,2.7839999999999998,0,0,0,0.87,0,0,0,0,0,0,0,null,{"$f":"Prop2021DistTar!AF14","v":3714.3530770786992},{"$f":"Prop2021DistTar!AG14","v":76073895.725184858},{"$f":"Prop2021DistTar!AH14","v":0},{"$f":"Prop2021DistTar!AI14","v":0},{"$f":"Prop2021DistTar!AJ14","v":0},{"$f":"Prop2021DistTar!AK14","v":49617354.310763627},{"$f":"Prop2021DistTar!AL14","v":0},{"$f":"Prop2021DistTar!AM14","v":0},{"$f":"Prop2021DistTar!AN14","v":0},{"$f":"Prop2021DistTar!AO14","v":0},{"$f":"Prop2021DistTar!AP14","v":0},{"$f":"Prop2021DistTar!AQ14","v":0},{"$f":"Prop2021DistTar!AR14","v":0},null,108644.82750455195,2117897.2569891461,0,0,0,431670.98250364355,0,0,0,0,0,0,0,2658213.0669973418]
[null,{"$f":"Prop2021DistTar!B15","v":"Small Business - TOU Weekdays Demand"},null,257.17200000000003,1.3520000000000001,0,0,0,0.60199999999999998,0,0,0,0.751,0,0,0,null,{"$f":"Prop2021DistTar!AF15","v":345.77848980005649},{"$f":"Prop2021DistTar!AG15","v":34833063.036605179},{"$f":"Prop2021DistTar!AH15","v":0},{"$f":"Prop2021DistTar!AI15","v":0},{"$f":"Prop2021DistTar!AJ15","v":0},{"$f":"Prop2021DistTar!AK15","v":24232702.154806152},{"$f":"Prop2021DistTar!AL15","v":0},{"$f":"Prop2021DistTar!AM15","v":0},{"$f":"Prop2021DistTar!AN15","v":0},{"$f":"Prop2021DistTar!AO15","v":24819.492014977292},{"$f":"Prop2021DistTar!AP15","v":0},{"$f":"Prop2021DistTar!AQ15","v":0},{"$f":"Prop2021DistTar!AR15","v":0},null,88924.545778860134,470943.01225490205,0,0,0,145880.86697193305,0,0,0,18639.438503247948,0,0,0,724387.86350894312]
[null,{"$f":"Prop2021DistTar!B16","v":"Small Business - TOU Opt out"},null,128.58600000000001,2.7839999999999998,0,0,0,0.87,0,0,0,0,0,0,0,null,{"$f":"Prop2021DistTar!AF16","v":15.71720408182075},{"$f":"Prop2021DistTar!AG16","v":1276940.7568686081},{"$f":"Prop2021DistTar!AH16","v":0},{"$f":"Prop2021DistTar!AI16","v":0},{"$f":"Prop2021DistTar!AJ16","v":0},{"$f":"Prop2021DistTar!AK16","v":390747.40380256937},{"$f":"Prop2021DistTar!AL16","v":0},{"$f":"Prop2021DistTar!AM16","v":0},{"$f":"Prop2021DistTar!AN16","v":0},{"$f":"Prop2021DistTar!AO16","v":0},{"$f":"Prop2021DistTar!AP16","v":0},{"$f":"Prop2021DistTar!AQ16","v":0},{"$f":"Prop2021DistTar!AR16","v":0},null,2021.0124040650032,35550.030671222041,0,0,0,3399.5024130823535,0,0,0,0,0,0,0,40970.545488369396]
[null,{"$f":"Prop2021DistTar!B17","v":"Small Business - TOU Extended"},null,29.25,2.4940000000000002,0,0,0,0.90900000000000003,0,0,0,0,0,0,0,null,{"$f":"Prop2021DistTar!AF17","v":941.07344895285144},{"$f":"Prop2021DistTar!AG17","v":18814347.707058504},{"$f":"Prop2021DistTar!AH17","v":0},{"$f":"Prop2021DistTar!AI17","v":0},{"$f":"Prop2021DistTar!AJ17","v":0},{"$f":"Prop2021DistTar!AK17","v":5757242.4415366901},{"$f":"Prop2021DistTar!AL17","v":0},{"$f":"Prop2021DistTar!AM17","v":0},{"$f":"Prop2021DistTar!AN17","v":0},{"$f":"Prop2021DistTar!AO17","v":0},{"$f":"Prop2021DistTar!AP17","v":0},{"$f":"Prop2021DistTar!AQ17","v":0},{"$f":"Prop2021DistTar!AR17","v":0},null,27526.398381870906,469229.83181403915,0,0,0,52333.333793568519,0,0,0,0,0,0,0,549089.56398947851]
[null,{"$f":"Prop2021DistTar!B18","v":"Small Business - TOU Extended Demand"},null,257.17200000000003,2.2309999999999999,0,0,0,0.58599999999999997,0,0,0,0.749,0,0,0,null,{"$f":"Prop2021DistTar!AF18","v":52.374579582041683},{"$f":"Prop2021DistTar!AG18","v":7861230.0296896184},{"$f":"Prop2021DistTar!AH18","v":0},{"$f":"Prop2021DistTar!AI18","v":0},{"$f":"Prop2021DistTar!AJ18","v":0},{"$f":"Prop2021DistTar!AK18","v":2311605.6132966289},{"$f":"Prop2021DistTar!AL18","v":0},{"$f":"Prop2021DistTar!AM18","v":0},{"$f":"Prop2021DistTar!AN18","v":0},{"$f":"Prop2021DistTar!AO18","v":5262.5171647996431},{"$f":"Prop2021DistTar!AP18","v":0},{"$f":"Prop2021DistTar!AQ18","v":0},{"$f":"Prop2021DistTar!AR18","v":0},null,13469.275380272826,175384.0419623754,0,0,0,13546.008893918244,0,0,0,3941.6253564349327,0,0,0,206340.9515930014]
[null,{"$f":"Prop2021DistTar!B19","v":"Small Business - Unmetered Supply"},null,0,1.6890000000000001,0,0,0,1.038,0,0,0,0,0,0,0,null,{"$f":"Prop2021DistTar!AF19","v":0},{"$f":"Prop2021DistTar!AG19","v":6906799.9431120688},{"$f":"Prop2021DistTar!AH19","v":0},{"$f":"Prop2021DistTar!AI19","v":0},{"$f":"Prop2021DistTar!AJ19","v":0},{"$f":"Prop2021DistTar!AK19","v":15374842.669164764},{"$f":"Prop2021DistTar!AL19","v":0},{"$f":"Prop2021DistTar!AM19","v":0},{"$f":"Prop2021DistTar!AN19","v":0},{"$f":"Prop2021DistTar!AO19","v":0},{"$f":"Prop2021DistTar!AP19","v":0},{"$f":"Prop2021DistTar!AQ19","v":0},{"$f":"Prop2021DistTar!AR19","v":0},null,0,116655.85103916285,0,0,0,159590.86690593025,0,0,0,0,0,0,0,276246.71794509311]
[null,{"$f":"Prop2021DistTar!B20","v":"Large Business - LV 0.4 - 0.8  GWh"},null,95.063999999999993,2.9369999999999998,0,0,0,1.0209999999999999,0,0,0,1.4119999999999999,0,0,0,null,{"$f":"Prop2021DistTar!AF20","v":388.55975348473487},{"$f":"Prop2021DistTar!AG20","v":87157927.195755512},{"$f":"Prop2021DistTar!AH20","v":0},{"$f":"Prop2021DistTar!AI20","v":0},{"$f":"Prop2021DistTar!AJ20","v":0},{"$f":"Prop2021DistTar!AK20","v":55986708.410393946},{"$f":"Prop2021DistTar!AL20","v":0},{"$f":"Prop2021DistTar!AM20","v":0},{"$f":"Prop2021DistTar!AN20","v":0},{"$f":"Prop2021DistTar!AO20","v":72443.429716937651},{"$f":"Prop2021DistTar!AP20","v":0},{"$f":"Prop2021DistTar!AQ20","v":0},{"$f":"Prop2021DistTar!AR20","v":0},null,36938.044405272834,2559828.3217393393,0,0,0,571624.29287012212,0,0,0,102290.12276031596,0,0,0,3270680.7817750499]
[null,{"$f":"Prop2021DistTar!B21","v":"Large Business – LVEN Annual Consumption <= 0.8 GWh"},null,95.063999999999993,2.9369999999999998,0,0,0,1.0209999999999999,0,0,0,1.9119999999999999,0,0,0,null,{"$f":"Prop2021DistTar!AF21","v":37.270949581273641},{"$f":"Prop2021DistTar!AG21","v":8221991.1611032225},{"$f":"Prop2021DistTar!AH21","v":0},{"$f":"Prop2021DistTar!AI21","v":0},{"$f":"Prop2021DistTar!AJ21","v":0},{"$f":"Prop2021DistTar!AK21","v":5679598.8500206638},{"$f":"Prop2021DistTar!AL21","v":0},{"$f":"Prop2021DistTar!AM21","v":0},{"$f":"Prop2021DistTar!AN21","v":0},{"$f":"Prop2021DistTar!AO21","v":8689.7712447539852},{"$f":"Prop2021DistTar!AP21","v":0},{"$f":"Prop2021DistTar!AQ21","v":0},{"$f":"Prop2021DistTar!AR21","v":0},null,3543.1255509941971,241479.88040160161,0,0,0,57988.704258710968,0,0,0,16614.842619969619,0,0,0,319626.55283127638]
[null,{"$f":"Prop2021DistTar!B22","v":"Large Business - LV  0.8+ - 2.2  GWh"},null,201.26300000000001,3.0129999999999999,0,0,0,1.0269999999999999,0,0,0,2.4489999999999998,0,0,0,null,{"$f":"Prop2021DistTar!AF22","v":194.08658091709918},{"$f":"Prop2021DistTar!AG22","v":131452092.67548704},{"$f":"Prop2021DistTar!AH22","v":0},{"$f":"Prop2021DistTar!AI22","v":0},{"$f":"Prop2021DistTar!AJ22","v":0},{"$f":"Prop2021DistTar!AK22","v":90838121.028442249},{"$f":"Prop2021DistTar!AL22","v":0},{"$f":"Prop2021DistTar!AM22","v":0},{"$f":"Prop2021DistTar!AN22","v":0},{"$f":"Prop2021DistTar!AO22","v":89510.481294754005},{"$f":"Prop2021DistTar!AP22","v":0},{"$f":"Prop2021DistTar!AQ22","v":0},{"$f":"Prop2021DistTar!AR22","v":0},null,39062.447535118132,3960651.5523124244,0,0,0,932907.50296210183,0,0,0,219211.16869085253,0,0,0,5151832.6715004975]
[null,{"$f":"Prop2021DistTar!B23","v":"Large Business - LVEN 0.8+ - 2.2 GWh"},null,201.26300000000001,3.0129999999999999,0,0,0,1.0269999999999999,0,0,0,3.1669999999999998,0,0,0,null,{"$f":"Prop2021DistTar!AF23","v":20.559646869443732},{"$f":"Prop2021DistTar!AG23","v":14920570.347691048},{"$f":"Prop2021DistTar!AH23","v":0},{"$f":"Prop2021DistTar!AI23","v":0},{"$f":"Prop2021DistTar!AJ23","v":0},{"$f":"Prop2021DistTar!AK23","v":9815052.4332260936},{"$f":"Prop2021DistTar!AL23","v":0},{"$f":"Prop2021DistTar!AM23","v":0},{"$f":"Prop2021DistTar!AN23","v":0},{"$f":"Prop2021DistTar!AO23","v":9299.5212644307703},{"$f":"Prop2021DistTar!AP23","v":0},{"$f":"Prop2021DistTar!AQ23","v":0},{"$f":"Prop2021DistTar!AR23","v":0},null,4137.8962078848535,449556.78457593126,0,0,0,100800.58848923197,0,0,0,29451.583844452249,0,0,0,583946.85311750032]
[null,{"$f":"Prop2021DistTar!B24","v":"Large Business - LV  2.2+ - 6.0  GWh"},null,1337.7629999999999,3.081,0,0,0,1.026,0,0,0,2.5249999999999999,0,0,0,null,{"$f":"Prop2021DistTar!AF24","v":37.253377233521974},{"$f":"Prop2021DistTar!AG24","v":60763995.953942209},{"$f":"Prop2021DistTar!AH24","v":0},{"$f":"Prop2021DistTar!AI24","v":0},{"$f":"Prop2021DistTar!AJ24","v":0},{"$f":"Prop2021DistTar!AK24","v":45943073.607626066},{"$f":"Prop2021DistTar!AL24","v":0},{"$f":"Prop2021DistTar!AM24","v":0},{"$f":"Prop2021DistTar!AN24","v":0},{"$f":"Prop2021DistTar!AO24","v":35969.743893851693},{"$f":"Prop2021DistTar!AP24","v":0},{"$f":"Prop2021DistTar!AQ24","v":0},{"$f":"Prop2021DistTar!AR24","v":0},null,49836.189688048056,1872138.7153409596,0,0,0,471375.93521424342,0,0,0,90823.603331975522,0,0,0,2484174.4435752267]
[null,{"$f":"Prop2021DistTar!B25","v":"Large Business - LVEN 2.2+  GWh"},null,1337.7629999999999,3.081,0,0,0,1.026,0,0,0,4.3659999999999997,0,0,0,null,{"$f":"Prop2021DistTar!AF25","v":8.4171545730457673},{"$f":"Prop2021DistTar!AG25","v":10324851.161380298},{"$f":"Prop2021DistTar!AH25","v":0},{"$f":"Prop2021DistTar!AI25","v":0},{"$f":"Prop2021DistTar!AJ25","v":0},{"$f":"Prop2021DistTar!AK25","v":7433408.8864938915},{"$f":"Prop2021DistTar!AL25","v":0},{"$f":"Prop2021DistTar!AM25","v":0},{"$f":"Prop2021DistTar!AN25","v":0},{"$f":"Prop2021DistTar!AO25","v":7906.6060482373114},{"$f":"Prop2021DistTar!AP25","v":0},{"$f":"Prop2021DistTar!AQ25","v":0},{"$f":"Prop2021DistTar!AR25","v":0},null,11260.157953101425,318108.66428212699,0,0,0,76266.775175427319,0,0,0,34520.242006604101,0,0,0,440155.83941725985]
[null,{"$f":"Prop2021DistTar!B26","v":"Large Business - LVMS 2.2+ - 6.0  GWh"},null,1787.2639999999999,3.3090000000000002,0,0,0,1.0189999999999999,0,0,0,3.375,0,0,0,null,{"$f":"Prop2021DistTar!AF26","v":5.2940165498851339},{"$f":"Prop2021DistTar!AG26","v":5811372.0693029007},{"$f":"Prop2021DistTar!AH26","v":0},{"$f":"Prop2021DistTar!AI26","v":0},{"$f":"Prop2021DistTar!AJ26","v":0},{"$f":"Prop2021DistTar!AK26","v":4687995.7061018618},{"$f":"Prop2021DistTar!AL26","v":0},{"$f":"Prop2021DistTar!AM26","v":0},{"$f":"Prop2021DistTar!AN26","v":0},{"$f":"Prop2021DistTar!AO26","v":3940.7965694710319},{"$f":"Prop2021DistTar!AP26","v":0},{"$f":"Prop2021DistTar!AQ26","v":0},{"$f":"Prop2021DistTar!AR26","v":0},null,9461.8051950139034,192298.30177323299,0,0,0,47770.676245177972,0,0,0,13300.188421964733,0,0,0,262830.97163538961]
[null,{"$f":"Prop2021DistTar!B27","v":"Large Business - LV 6.0+ GWh"},null,3447.1770000000001,2.6909999999999998,0,0,0,1.018,0,0,0,2.7570000000000001,0,0,0,null,{"$f":"Prop2021DistTar!AF27","v":11.316591952069883},{"$f":"Prop2021DistTar!AG27","v":25847888.304707155},{"$f":"Prop2021DistTar!AH27","v":0},{"$f":"Prop2021DistTar!AI27","v":0},{"$f":"Prop2021DistTar!AJ27","v":0},{"$f":"Prop2021DistTar!AK27","v":21661553.605152186},{"$f":"Prop2021DistTar!AL27","v":0},{"$f":"Prop2021DistTar!AM27","v":0},{"$f":"Prop2021DistTar!AN27","v":0},{"$f":"Prop2021DistTar!AO27","v":13828.373147580272},{"$f":"Prop2021DistTar!AP27","v":0},{"$f":"Prop2021DistTar!AQ27","v":0},{"$f":"Prop2021DistTar!AR27","v":0},null,39010.295495560407,695566.67427966953,0,0,0,220514.61570044924,0,0,0,38124.82476787881,0,0,0,993216.410243558]
[null,{"$f":"Prop2021DistTar!B28","v":"Large Business - LVMS 6.0+ GWh"},null,4284.1189999999997,2.8260000000000001,0,0,0,1.018,0,0,0,3.4249999999999998,0,0,0,null,{"$f":"Prop2021DistTar!AF28","v":14.438226954232185},{"$f":"Prop2021DistTar!AG28","v":26286303.386349238},{"$f":"Prop2021DistTar!AH28","v":0},{"$f":"Prop2021DistTar!AI28","v":0},{"$f":"Prop2021DistTar!AJ28","v":0},{"$f":"Prop2021DistTar!AK28","v":20462464.546255786},{"$f":"Prop2021DistTar!AL28","v":0},{"$f":"Prop2021DistTar!AM28","v":0},{"$f":"Prop2021DistTar!AN28","v":0},{"$f":"Prop2021DistTar!AO28","v":14512.002707429958},{"$f":"Prop2021DistTar!AP28","v":0},{"$f":"Prop2021DistTar!AQ28","v":0},{"$f":"Prop2021DistTar!AR28","v":0},null,61855.082420938226,742850.93369822949,0,0,0,208307.88908088391,0,0,0,49703.6092729476,0,0,0,1062717.5144729991]
[null,{"$f":"Prop2021DistTar!B29","v":"Large Business - HV"},null,9162.0040000000008,2.9820000000000002,0,0,0,0.75700000000000001,0,0,0,2.9009999999999998,0,0,0,null,{"$f":"Prop2021DistTar!AF29","v":44.37266666666666},{"$f":"Prop2021DistTar!AG29","v":123977469.73907256},{"$f":"Prop2021DistTar!AH29","v":0},{"$f":"Prop2021DistTar!AI29","v":0},{"$f":"Prop2021DistTar!AJ29","v":0},{"$f":"Prop2021DistTar!AK29","v":98362237.170290887},{"$f":"Prop2021DistTar!AL29","v":0},{"$f":"Prop2021DistTar!AM29","v":0},{"$f":"Prop2021DistTar!AN29","v":0},{"$f":"Prop2021DistTar!AO29","v":92928.263601917453},{"$f":"Prop2021DistTar!AP29","v":0},{"$f":"Prop2021DistTar!AQ29","v":0},{"$f":"Prop2021DistTar!AR29","v":0},null,406542.54949066666,3697008.1476191441,0,0,0,744602.13537910208,0,0,0,269584.89270916249,0,0,0,5117737.7251980752]
[null,{"$f":"Prop2021DistTar!B30","v":"Large Business – HVEN"},null,9162.0040000000008,2.9820000000000002,0,0,0,0.75700000000000001,0,0,0,2.8109999999999999,0,0,0,null,{"$f":"Prop2021DistTar!AF30","v":1},null,{"$f":"Prop2021DistTar!AH30","v":0},{"$f":"Prop2021DistTar!AI30","v":0},{"$f":"Prop2021DistTar!AJ30","v":0},null,{"$f":"Prop2021DistTar!AL30","v":0},{"$f":"Prop2021DistTar!AM30","v":0},{"$f":"Prop2021DistTar!AN30","v":0},null,{"$f":"Prop2021DistTar!AP30","v":0},{"$f":"Prop2021DistTar!AQ30","v":0},{"$f":"Prop2021DistTar!AR30","v":0},null,9162.0040000000008,null,0,0,0,null,0,0,0,null,0,0,0]
[null,{"$f":"Prop2021DistTar!B31","v":"Large Business - HVRF"},null,9162.0040000000008,2.9740000000000002,0,0,0,0.75700000000000001,0,0,0,7.0339999999999998,0,0,0,null,{"$f":"Prop2021DistTar!AF31","v":0.98333333333333328},null,{"$f":"Prop2021DistTar!AH31","v":0},{"$f":"Prop2021DistTar!AI31","v":0},{"$f":"Prop2021DistTar!AJ31","v":0},null,{"$f":"Prop2021DistTar!AL31","v":0},{"$f":"Prop2021DistTar!AM31","v":0},{"$f":"Prop2021DistTar!AN31","v":0},null,{"$f":"Prop2021DistTar!AP31","v":0},{"$f":"Prop2021DistTar!AQ31","v":0},{"$f":"Prop2021DistTar!AR31","v":0},null,9009.3039333333345,null,0,0,0,null,0,0,0,null,0,0,0]
[null,{"$f":"Prop2021DistTar!B32","v":"Large Business - HV Ann Cons >= 55GWh"},null,10148.746999999999,2.7450000000000001,0,0,0,0.72599999999999998,0,0,0,6.7160000000000002,0,0,0,null,{"$f":"Prop2021DistTar!AF32","v":0.5},null,{"$f":"Prop2021DistTar!AH32","v":0},{"$f":"Prop2021DistTar!AI32","v":0},{"$f":"Prop2021DistTar!AJ32","v":0},null,{"$f":"Prop2021DistTar!AL32","v":0},{"$f":"Prop2021DistTar!AM32","v":0},{"$f":"Prop2021DistTar!AN32","v":0},null,{"$f":"Prop2021DistTar!AP32","v":0},{"$f":"Prop2021DistTar!AQ32","v":0},{"$f":"Prop2021DistTar!AR32","v":0},null,5074.3734999999997,null,0,0,0,null,0,0,0,null,0,0,0]
[null,{"$f":"Prop2021DistTar!B33","v":"Large Business - Subtransmission"},null,15847.543,2.2679999999999998,0,0,0,0.499,0,0,0,4.2380000000000004,0,0,0,null,{"$f":"Prop2021DistTar!AF33","v":1.5},null,{"$f":"Prop2021DistTar!AH33","v":0},{"$f":"Prop2021DistTar!AI33","v":0},{"$f":"Prop2021DistTar!AJ33","v":0},null,{"$f":"Prop2021DistTar!AL33","v":0},{"$f":"Prop2021DistTar!AM33","v":0},{"$f":"Prop2021DistTar!AN33","v":0},null,{"$f":"Prop2021DistTar!AP33","v":0},{"$f":"Prop2021DistTar!AQ33","v":0},{"$f":"Prop2021DistTar!AR33","v":0},null,23771.3145,null,0,0,0,null,0,0,0,null,0,0,0]
[null,{"$f":"Prop2021DistTar!B34","v":"Large Business - Subtransmission MA"},null,15847.543,2.2679999999999998,0,0,0,0.499,0,0,0,4.2590000000000003,0,0,0,null,{"$f":"Prop2021DistTar!AF34","v":0.5},null,{"$f":"Prop2021DistTar!AH34","v":0},{"$f":"Prop2021DistTar!AI34","v":0},{"$f":"Prop2021DistTar!AJ34","v":0},null,{"$f":"Prop2021DistTar!AL34","v":0},{"$f":"Prop2021DistTar!AM34","v":0},{"$f":"Prop2021DistTar!AN34","v":0},null,{"$f":"Prop2021DistTar!AP34","v":0},{"$f":"Prop2021DistTar!AQ34","v":0},{"$f":"Prop2021DistTar!AR34","v":0},null,7923.7714999999998,null,0,0,0,null,0,0,0,null,0,0,0]
[null,{"$f":"Prop2021DistTar!B35","v":"Large Business - Subtransmission EG"},null,5058.7150000000001,2.3039999999999998,0,0,0,0.50800000000000001,0,0,0,4.8929999999999998,0,0,0,null,{"$f":"Prop2021DistTar!AF35","v":0.5},null,{"$f":"Prop2021DistTar!AH35","v":0},{"$f":"Prop2021DistTar!AI35","v":0},{"$f":"Prop2021DistTar!AJ35","v":0},null,{"$f":"Prop2021DistTar!AL35","v":0},{"$f":"Prop2021DistTar!AM35","v":0},{"$f":"Prop2021DistTar!AN35","v":0},null,{"$f":"Prop2021DistTar!AP35","v":0},{"$f":"Prop2021DistTar!AQ35","v":0},{"$f":"Prop2021DistTar!AR35","v":0},null,{"$f":"D35*R35","v":2529.3575000000001},null,{"$f":"F35/100*T35","v":0},0,0,null,0,0,0,null,{"$f":"N35*AB35","v":0},{"$f":"O35*AC35","v":0},{"$f":"P35*AD35","v":0}]
[null,null,null,null,null,null,null,null,null,null,null,null,null,null,null,null,null,{"$f":"Prop2021DistTar!AF36","v":0},{"$f":"Prop2021DistTar!AG36","v":0},{"$f":"Prop2021DistTar!AH36","v":0},{"$f":"Prop2021DistTar!AI36","v":0},{"$f":"Prop2021DistTar!AJ36","v":0},{"$f":"Prop2021DistTar!AK36","v":0},{"$f":"Prop2021DistTar!AL36","v":0},{"$f":"Prop2021DistTar!AM36","v":0},{"$f":"Prop2021DistTar!AN36","v":0},{"$f":"Prop2021DistTar!AO36","v":0},{"$f":"Prop2021DistTar!AP36","v":0},{"$f":"Prop2021DistTar!AQ36","v":0},{"$f":"Prop2021DistTar!AR36","v":0},null,0,0,0,0,0,0,0,0,0,{"$f":"M36*AA36","v":0},0,0,0,{"$f":"SUM(AF36:AR36)","v":0}]
[null,null,null,null,null,null,null,null,null,null,null,null,null,null,null,null,null,{"$f":"Prop2021DistTar!AF37","v":0},{"$f":"Prop2021DistTar!AG37","v":0},{"$f":"Prop2021DistTar!AH37","v":0},{"$f":"Prop2021DistTar!AI37","v":0},{"$f":"Prop2021DistTar!AJ37","v":0},{"$f":"Prop2021DistTar!AK37","v":0},{"$f":"Prop2021DistTar!AL37","v":0},{"$f":"Prop2021DistTar!AM37","v":0},{"$f":"Prop2021DistTar!AN37","v":0},{"$f":"Prop2021DistTar!AO37","v":0},{"$f":"Prop2021DistTar!AP37","v":0},{"$f":"Prop2021DistTar!AQ37","v":0},{"$f":"Prop2021DistTar!AR37","v":0},null,0,0,0,0,0,0,0,0,0,0,0,0,0,0]
[null,null,null,null,null,null,null,null,null,null,null,null,null,null,null,null,null,{"$f":"Prop2021DistTar!AF38","v":0},{"$f":"Prop2021DistTar!AG38","v":0},{"$f":"Prop2021DistTar!AH38","v":0},{"$f":"Prop2021DistTar!AI38","v":0},{"$f":"Prop2021DistTar!AJ38","v":0},{"$f":"Prop2021DistTar!AK38","v":0},{"$f":"Prop2021DistTar!AL38","v":0},{"$f":"Prop2021DistTar!AM38","v":0},{"$f":"Prop2021DistTar!AN38","v":0},{"$f":"Prop2021DistTar!AO38","v":0},{"$f":"Prop2021DistTar!AP38","v":0},{"$f":"Prop2021DistTar!AQ38","v":0},{"$f":"Prop2021DistTar!AR38","v":0},null,0,0,0,0,0,0,0,0,0,0,0,0,0,0]
[null,null,null,null,null,null,null,null,null,null,null,null,null,null,null,null,null,{"$f":"Prop2021DistTar!AF39","v":0},{"$f":"Prop2021DistTar!AG39","v":0},{"$f":"Prop2021DistTar!AH39","v":0},{"$f":"Prop2021DistTar!AI39","v":0},{"$f":"Prop2021DistTar!AJ39","v":0},{"$f":"Prop2021DistTar!AK39","v":0},{"$f":"Prop2021DistTar!AL39","v":0},{"$f":"Prop2021DistTar!AM39","v":0},{"$f":"Prop2021DistTar!AN39","v":0},{"$f":"Prop2021DistTar!AO39","v":0},{"$f":"Prop2021DistTar!AP39","v":0},{"$f":"Prop2021DistTar!AQ39","v":0},{"$f":"Prop2021DistTar!AR39","v":0},null,0,0,0,0,0,0,0,0,0,0,0,0,0,0]
[null,null,null,null,null,null,null,null,null,null,null,null,null,null,null,null,null,{"$f":"Prop2021DistTar!AF40","v":0},{"$f":"Prop2021DistTar!AG40","v":0},{"$f":"Prop2021DistTar!AH40","v":0},{"$f":"Prop2021DistTar!AI40","v":0},{"$f":"Prop2021DistTar!AJ40","v":0},{"$f":"Prop2021DistTar!AK40","v":0},{"$f":"Prop2021DistTar!AL40","v":0},{"$f":"Prop2021DistTar!AM40","v":0},{"$f":"Prop2021DistTar!AN40","v":0},{"$f":"Prop2021DistTar!AO40","v":0},{"$f":"Prop2021DistTar!AP40","v":0},{"$f":"Prop2021DistTar!AQ40","v":0},{"$f":"Prop2021DistTar!AR40","v":0},null,0,0,0,0,0,0,0,0,0,0,0,0,0,0]
[null,null,null,null,null,null,null,null,null,null,null,null,null,null,null,null,null,{"$f":"Prop2021DistTar!AF41","v":0},{"$f":"Prop2021DistTar!AG41","v":0},{"$f":"Prop2021DistTar!AH41","v":0},{"$f":"Prop2021DistTar!AI41","v":0},{"$f":"Prop2021DistTar!AJ41","v":0},{"$f":"Prop2021DistTar!AK41","v":0},{"$f":"Prop2021DistTar!AL41","v":0},{"$f":"Prop2021DistTar!AM41","v":0},{"$f":"Prop2021DistTar!AN41","v":0},{"$f":"Prop2021DistTar!AO41","v":0},{"$f":"Prop2021DistTar!AP41","v":0},{"$f":"Prop2021DistTar!AQ41","v":0},{"$f":"Prop2021DistTar!AR41","v":0},null,0,0,0,0,0,0,0,0,0,0,0,0,0,0]
[null,null,null,null,null,null,null,null,null,null,null,null,null,null,null,null,null,{"$f":"Prop2021DistTar!AF42","v":0},{"$f":"Prop2021DistTar!AG42","v":0},{"$f":"Prop2021DistTar!AH42","v":0},{"$f":"Prop2021DistTar!AI42","v":0},{"$f":"Prop2021DistTar!AJ42","v":0},{"$f":"Prop2021DistTar!AK42","v":0},{"$f":"Prop2021DistTar!AL42","v":0},{"$f":"Prop2021DistTar!AM42","v":0},{"$f":"Prop2021DistTar!AN42","v":0},{"$f":"Prop2021DistTar!AO42","v":0},{"$f":"Prop2021DistTar!AP42","v":0},{"$f":"Prop2021DistTar!AQ42","v":0},{"$f":"Prop2021DistTar!AR42","v":0},null,0,0,0,0,0,0,0,0,0,0,0,0,0,0]
[null,null,null,null,null,null,null,null,null,null,null,null,null,null,null,null,null,{"$f":"Prop2021DistTar!AF43","v":0},{"$f":"Prop2021DistTar!AG43","v":0},{"$f":"Prop2021DistTar!AH43","v":0},{"$f":"Prop2021DistTar!AI43","v":0},{"$f":"Prop2021DistTar!AJ43","v":0},{"$f":"Prop2021DistTar!AK43","v":0},{"$f":"Prop2021DistTar!AL43","v":0},{"$f":"Prop2021DistTar!AM43","v":0},{"$f":"Prop2021DistTar!AN43","v":0},{"$f":"Prop2021DistTar!AO43","v":0},{"$f":"Prop2021DistTar!AP43","v":0},{"$f":"Prop2021DistTar!AQ43","v":0},{"$f":"Prop2021DistTar!AR43","v":0},null,0,0,0,0,0,0,0,0,0,0,0,0,0,0]
[null,null,null,null,null,null,null,null,null,null,null,null,null,null,null,null,null,{"$f":"Prop2021DistTar!AF44","v":0},{"$f":"Prop2021DistTar!AG44","v":0},{"$f":"Prop2021DistTar!AH44","v":0},{"$f":"Prop2021DistTar!AI44","v":0},{"$f":"Prop2021DistTar!AJ44","v":0},{"$f":"Prop2021DistTar!AK44","v":0},{"$f":"Prop2021DistTar!AL44","v":0},{"$f":"Prop2021DistTar!AM44","v":0},{"$f":"Prop2021DistTar!AN44","v":0},{"$f":"Prop2021DistTar!AO44","v":0},{"$f":"Prop2021DistTar!AP44","v":0},{"$f":"Prop2021DistTar!AQ44","v":0},{"$f":"Prop2021DistTar!AR44","v":0},null,0,0,0,0,0,0,0,0,0,0,0,0,0,0]
[null,null,null,null,null,null,null,null,null,null,null,null,null,null,null,null,null,{"$f":"Prop2021DistTar!AF45","v":0},{"$f":"Prop2021DistTar!AG45","v":0},{"$f":"Prop2021DistTar!AH45","v":0},{"$f":"Prop2021DistTar!AI45","v":0},{"$f":"Prop2021DistTar!AJ45","v":0},{"$f":"Prop2021DistTar!AK45","v":0},{"$f":"Prop2021DistTar!AL45","v":0},{"$f":"Prop2021DistTar!AM45","v":0},{"$f":"Prop2021DistTar!AN45","v":0},{"$f":"Prop2021DistTar!AO45","v":0},{"$f":"Prop2021DistTar!AP45","v":0},{"$f":"Prop2021DistTar!AQ45","v":0},{"$f":"Prop2021DistTar!AR45","v":0},null,0,0,0,0,0,0,0,0,0,0,0,0,0,0]
[null,null,null,null,null,null,null,null,null,null,null,null,null,null,null,null,null,{"$f":"Prop2021DistTar!AF46","v":0},{"$f":"Prop2021DistTar!AG46","v":0},{"$f":"Prop2021DistTar!AH46","v":0},{"$f":"Prop2021DistTar!AI46","v":0},{"$f":"Prop2021DistTar!AJ46","v":0},{"$f":"Prop2021DistTar!AK46","v":0},{"$f":"Prop2021DistTar!AL46","v":0},{"$f":"Prop2021DistTar!AM46","v":0},{"$f":"Prop2021DistTar!AN46","v":0},{"$f":"Prop2021DistTar!AO46","v":0},{"$f":"Prop2021DistTar!AP46","v":0},{"$f":"Prop2021DistTar!AQ46","v":0},{"$f":"Prop2021DistTar!AR46","v":0},null,0,0,0,0,0,0,0,0,0,0,0,0,0,0]
[null,null,null,null,null,null,null,null,null,null,null,null,null,null,null,null,null,{"$f":"Prop2021DistTar!AF47","v":0},{"$f":"Prop2021DistTar!AG47","v":0},{"$f":"Prop2021DistTar!AH47","v":0},{"$f":"Prop2021DistTar!AI47","v":0},{"$f":"Prop2021DistTar!AJ47","v":0},{"$f":"Prop2021DistTar!AK47","v":0},{"$f":"Prop2021DistTar!AL47","v":0},{"$f":"Prop2021DistTar!AM47","v":0},{"$f":"Prop2021DistTar!AN47","v":0},{"$f":"Prop2021DistTar!AO47","v":0},{"$f":"Prop2021DistTar!AP47","v":0},{"$f":"Prop2021DistTar!AQ47","v":0},{"$f":"Prop2021DistTar!AR47","v":0},null,0,0,0,0,0,0,0,0,0,0,0,0,0,0]
[null,null,null,null,null,null,null,null,null,null,null,null,null,null,null,null,null,{"$f":"Prop2021DistTar!AF48","v":0},{"$f":"Prop2021DistTar!AG48","v":0},{"$f":"Prop2021DistTar!AH48","v":0},{"$f":"Prop2021DistTar!AI48","v":0},{"$f":"Prop2021DistTar!AJ48","v":0},{"$f":"Prop2021DistTar!AK48","v":0},{"$f":"Prop2021DistTar!AL48","v":0},{"$f":"Prop2021DistTar!AM48","v":0},{"$f":"Prop2021DistTar!AN48","v":0},{"$f":"Prop2021DistTar!AO48","v":0},{"$f":"Prop2021DistTar!AP48","v":0},{"$f":"Prop2021DistTar!AQ48","v":0},{"$f":"Prop2021DistTar!AR48","v":0},null,0,0,0,0,0,0,0,0,0,0,0,0,0,0]
[null,null,null,null,null,null,null,null,null,null,null,null,null,null,null,null,null,{"$f":"Prop2021DistTar!AF49","v":0},{"$f":"Prop2021DistTar!AG49","v":0},{"$f":"Prop2021DistTar!AH49","v":0},{"$f":"Prop2021DistTar!AI49","v":0},{"$f":"Prop2021DistTar!AJ49","v":0},{"$f":"Prop2021DistTar!AK49","v":0},{"$f":"Prop2021DistTar!AL49","v":0},{"$f":"Prop2021DistTar!AM49","v":0},{"$f":"Prop2021DistTar!AN49","v":0},{"$f":"Prop2021DistTar!AO49","v":0},{"$f":"Prop2021DistTar!AP49","v":0},{"$f":"Prop2021DistTar!AQ49","v":0},{"$f":"Prop2021DistTar!AR49","v":0},null,0,0,0,0,0,0,0,0,0,0,0,0,0,0]
[null,null,null,null,null,null,null,null,null,null,null,null,null,null,null,null,null,{"$f":"Prop2021DistTar!AF50","v":0},{"$f":"Prop2021DistTar!AG50","v":0},{"$f":"Prop2021DistTar!AH50","v":0},{"$f":"Prop2021DistTar!AI50","v":0},{"$f":"Prop2021DistTar!AJ50","v":0},{"$f":"Prop2021DistTar!AK50","v":0},{"$f":"Prop2021DistTar!AL50","v":0},{"$f":"Prop2021DistTar!AM50","v":0},{"$f":"Prop2021DistTar!AN50","v":0},{"$f":"Prop2021DistTar!AO50","v":0},{"$f":"Prop2021DistTar!AP50","v":0},{"$f":"Prop2021DistTar!AQ50","v":0},{"$f":"Prop2021DistTar!AR50","v":0},null,0,0,0,0,0,0,0,0,0,0,0,0,0,0]
[null,null,null,null,null,null,null,null,null,null,null,null,null,null,null,null,null,{"$f":"Prop2021DistTar!AF51","v":0},{"$f":"Prop2021DistTar!AG51","v":0},{"$f":"Prop2021DistTar!AH51","v":0},{"$f":"Prop2021DistTar!AI51","v":0},{"$f":"Prop2021DistTar!AJ51","v":0},{"$f":"Prop2021DistTar!AK51","v":0},{"$f":"Prop2021DistTar!AL51","v":0},{"$f":"Prop2021DistTar!AM51","v":0},{"$f":"Prop2021DistTar!AN51","v":0},{"$f":"Prop2021DistTar!AO51","v":0},{"$f":"Prop2021DistTar!AP51","v":0},{"$f":"Prop2021DistTar!AQ51","v":0},{"$f":"Prop2021DistTar!AR51","v":0},null,0,0,0,0,0,0,0,0,0,0,0,0,0,0]
[null,null,null,null,null,null,null,null,null,null,null,null,null,null,null,null,null,{"$f":"Prop2021DistTar!AF52","v":0},{"$f":"Prop2021DistTar!AG52","v":0},{"$f":"Prop2021DistTar!AH52","v":0},{"$f":"Prop2021DistTar!AI52","v":0},{"$f":"Prop2021DistTar!AJ52","v":0},{"$f":"Prop2021DistTar!AK52","v":0},{"$f":"Prop2021DistTar!AL52","v":0},{"$f":"Prop2021DistTar!AM52","v":0},{"$f":"Prop2021DistTar!AN52","v":0},{"$f":"Prop2021DistTar!AO52","v":0},{"$f":"Prop2021DistTar!AP52","v":0},{"$f":"Prop2021DistTar!AQ52","v":0},{"$f":"Prop2021DistTar!AR52","v":0},null,0,0,0,0,0,0,0,0,0,0,0,0,0,0]
[null,null,null,null,null,null,null,null,null,null,null,null,null,null,null,null,null,{"$f":"Prop2021DistTar!AF53","v":0},{"$f":"Prop2021DistTar!AG53","v":0},{"$f":"Prop2021DistTar!AH53","v":0},{"$f":"Prop2021DistTar!AI53","v":0},{"$f":"Prop2021DistTar!AJ53","v":0},{"$f":"Prop2021DistTar!AK53","v":0},{"$f":"Prop2021DistTar!AL53","v":0},{"$f":"Prop2021DistTar!AM53","v":0},{"$f":"Prop2021DistTar!AN53","v":0},{"$f":"Prop2021DistTar!AO53","v":0},{"$f":"Prop2021DistTar!AP53","v":0},{"$f":"Prop2021DistTar!AQ53","v":0},{"$f":"Prop2021DistTar!AR53","v":0},null,0,0,0,0,0,0,0,0,0,0,0,0,0,0]
[null,null,null,null,null,null,null,null,null,null,null,null,null,null,null,null,null,{"$f":"Prop2021DistTar!AF54","v":0},{"$f":"Prop2021DistTar!AG54","v":0},{"$f":"Prop2021DistTar!AH54","v":0},{"$f":"Prop2021DistTar!AI54","v":0},{"$f":"Prop2021DistTar!AJ54","v":0},{"$f":"Prop2021DistTar!AK54","v":0},{"$f":"Prop2021DistTar!AL54","v":0},{"$f":"Prop2021DistTar!AM54","v":0},{"$f":"Prop2021DistTar!AN54","v":0},{"$f":"Prop2021DistTar!AO54","v":0},{"$f":"Prop2021DistTar!AP54","v":0},{"$f":"Prop2021DistTar!AQ54","v":0},{"$f":"Prop2021DistTar!AR54","v":0},null,0,0,0,0,0,0,0,0,0,0,0,0,0,0]
[null,null,null,null,null,null,null,null,null,null,null,null,null,null,null,null,null,null,null,null,null,null,null,null,null,null,null,null,null,null,null,0,{"$f":"E55/100*S55","v":0},0,0,0,0,0,0,0,0,0,0,0,0]
[null,null,null,null,null,null,null,null,null,null,null,null,null,null,null,null,null,null,null,null,null,null,null,null,null,null,null,null,null,null,null,0,0,0,0,0,0,0,0,0,0,0,0,0,0]
[null,null,null,null,null,null,null,null,null,null,null,null,null,null,null,null,null,null,null,null,null,null,null,null,null,null,null,null,null,null,null,0,0,0,0,0,0,0,0,0,0,0,0,0,0]
[null,null,null,null,null,null,null,null,null,null,null,null,null,null,null,null,null,null,null,null,null,null,null,null,null,null,null,null,null,null,null,0,0,0,0,0,0,0,0,0,0,0,0,0,0]
[null,null,null,null,null,null,null,null,null,null,null,null,null,null,null,null,null,null,null,null,null,null,null,null,null,null,null,null,null,null,null,0,0,0,0,0,0,0,0,0,0,0,0,0,0]
[null,null,null,null,null,null,null,null,null,null,null,null,null,null,null,null,null,null,null,null,null,null,null,null,null,null,null,null,null,null,null,0,0,0,0,0,0,0,0,0,0,0,0,0,0]
[null,null,null,null,null,null,null,null,null,null,null,null,null,null,null,null,null,null,null,null,null,null,null,null,null,null,null,null,null,null,null,0,0,0,0,0,0,0,0,0,0,0,0,0,0]
[null,null,null,null,null,null,null,null,null,null,null,null,null,null,null,null,null,null,null,null,null,null,null,null,null,null,null,null,null,null,null,0,0,0,0,0,0,0,0,0,0,0,0,0,0]
[null,null,null,null,null,null,null,null,null,null,null,null,null,null,null,null,null,null,null,null,null,null,null,null,null,null,null,null,null,null,null,0,0,0,0,0,0,0,0,0,0,0,0,0,0]
[null,null,null,null,null,null,null,null,null,null,null,null,null,null,null,null,null,null,null,null,null,null,null,null,null,null,null,null,null,null,null,0,0,0,0,0,0,0,0,0,0,0,0,0,0]
[null,null,null,null,null,null,null,null,null,null,null,null,null,null,null,null,null,null,null,null,null,null,null,null,null,null,null,null,null,null,null,0,0,0,0,0,0,0,0,0,0,0,0,0,0]
[null,null,null,null,null,null,null,null,null,null,null,null,null,null,null,null,null,{"$f":"SUM(R6:R65)","v":182831.44489982832},1517656395.2083504,580688.3796264258,407370.3282449813,757351.41782394319,609112587.36011171,495167.14113703655,{"$f":"SUM(Y6:Y65)","v":0},0,443886.28658918006,0,0,0,null,{"$f":"SUM(AF6:AF65)","v":1241671.7666934091},28800011.577485874,5510.7327226547814,1743.54500488852,7187.2649551492214,5218828.4949352322,252.53524197988861,{"$f":"SUM(AM6:AM65)","v":0},0,1186702.482551886,0,0,0,36461908.399591066]

{"sheet":"2021TransRevCont","index":14,"n_rows":19,"n_cols":3,"rows_kept":19,"cut":false,"hidden":false,"merged":[]}
[]
[null,{"$f":"\"Tariff Approval - \"&'Model update'!$C$3","v":"Tariff Approval - Jemena"},{"$f":"'Model update'!$C$5&\"TransRevCont\"","v":"2021TransRevCont"}]
[]
[null," Designated pricing proposal charges (DPPC)"]
[]
[null,"Year (t)",{"$f":"'Model update'!C5","v":2021}]
[]
[null,"Table 1- Compliance with DPPC Revenue Formula"]
[null,"Revenue from designated pricing proposal charges for year t",{"$f":"Prop2021TransTar!AS66","v":36461908.399591066}]
[null,"Total DPPC related payments for year t",{"$f":"C19","v":36461912}]
[null,null,{"$f":"IF(C9=\"\",\"\",IF(C10>=C9,\"DPPC REVENUE FORMULA COMPLIANT\",\"DPPC REVENUE FORMULA BREACHED\"))","v":"DPPC REVENUE FORMULA COMPLIANT"}]
[]
[]
[null,"Table 3 - Transmission charges for year t"]
[null,"AEMO (TCt)",34006820]
[null,"Transmission connection (TCt)",4571285]
[null,"Embedded generators (Gt)",758057]
[null,"Inter-network (Dt)",2874250]
[null,"TC + G - D",{"$f":"C15+C16+C17-C18","v":36461912}]

{"sheet":"Prop2021JSTar","index":15,"n_rows":66,"n_cols":45,"rows_kept":66,"cut":false,"hidden":false,"merged":[]}
[null,{"$f":"\"Tariff Approval - \"&'Model update'!C3","v":"Tariff Approval - Jemena"},null,{"$f":"\"Prop\"&'Model update'!$C$5&\"JSTar\"","v":"Prop2021JSTar"}]
[]
[null,{"$f":"\"PROPOSED \"&'Model update'!$C$5&\" JURISDICTIONAL SCHEME TARIFFS\"","v":"PROPOSED 2021 JURISDICTIONAL SCHEME TARIFFS"}]
[null,null,null,{"$f":"\"Proposed Jurisdictional scheme Tariffs (Pt) for \"&'Model update'!$C$5","v":"Proposed Jurisdictional scheme Tariffs (Pt) for 2021"},null,null,null,null,null,null,null,null,null,null,null,null,null,{"$f":"\"Forecast Quantities (Qt) for \"&'Model update'!$C$5","v":"Forecast Quantities (Qt) for 2021"},null,null,null,null,null,null,null,null,null,null,null,null,null,{"$f":"\"Forecast Revenue (Pt \"&'Model update'!$C$5&\")*(Qt \" &'Model update'!$C$5&\")\"","v":"Forecast Revenue (Pt 2021)*(Qt 2021)"}]
[null,"Proposed tariff",null,{"$f":"Prop2021DistTar!D5","v":"PropTar\nFixed"},{"$f":"Prop2021DistTar!E5","v":"PropTar\nPkBlk1"},{"$f":"Prop2021DistTar!F5","v":"PropTar\nShoulder\n summer"},{"$f":"Prop2021DistTar!G5","v":"PropTar\npeak\n non-summer"},{"$f":"Prop2021DistTar!H5","v":"PropTar\nShoulder\n non-summer"},{"$f":"Prop2021DistTar!I5","v":"PropTar\nOPkBlk1"},{"$f":"Prop2021DistTar!J5","v":"PropTar\noff peak\n non-summer"},{"$f":"Prop2021DistTar!K5","v":"PropTar\nOPkBlk3"},{"$f":"Prop2021DistTar!L5","v":"PropTar\nOPkBlk4"},{"$f":"Prop2021DistTar!M5","v":"PropTar\nDemBlk1"},{"$f":"Prop2021DistTar!N5","v":"PropTar\nDemBlk2"},{"$f":"Prop2021DistTar!O5","v":"PropTar\nDemBlk3"},{"$f":"Prop2021DistTar!P5","v":"PropTar\nDemBlk4"},null,{"$f":"Prop2021DistTar!AF5","v":"FcastVol\nFixed"},{"$f":"Prop2021DistTar!AG5","v":"FcastVol\nPkBlk1"},{"$f":"Prop2021DistTar!AH5","v":"FcastVol\nShoulder\n summer"},{"$f":"Prop2021DistTar!AI5","v":"FcastVol\npeak\n non-summer"},{"$f":"Prop2021DistTar!AJ5","v":"FcastVol\nShoulder\n non-summer"},{"$f":"Prop2021DistTar!AK5","v":"FcastVol\nOPkBlk1"},{"$f":"Prop2021DistTar!AL5","v":"FcastVol\noff peak\n non-summer"},{"$f":"Prop2021DistTar!AM5","v":"FcastVol\nOPkBlk3"},{"$f":"Prop2021DistTar!AN5","v":"FcastVol\nOPkBlk4"},{"$f":"Prop2021DistTar!AO5","v":"FcastVol\nDemBlk1"},{"$f":"Prop2021DistTar!AP5","v":"FcastVol\nDemBlk2"},{"$f":"Prop2021DistTar!AQ5","v":"FcastVol\nDemBlk3"},{"$f":"Prop2021DistTar!AR5","v":"FcastVol\nDemBlk4"},null,"PropRev\nFixed","PropRev\nPkBlk1","PropRev\nPkBlk2","PropRev\nPkBlk3","PropRev\nPkBlk4","PropRev\nOPkBlk1","PropRev\nOPkBlk2","PropRev\nOPkBlk3","PropRev\nOPkBlk4","PropRev\nDemBlk1","PropRev\nDemBlk2","PropRev\nDemBlk3","PropRev\nDemBlk4","PropRev\nTotal"]
[null,{"$f":"Prop2021DistTar!B6","v":"Residential - General Purpose"},null,0,0.151,0,0,0,0,0,0,0,0,0,0,0,null,{"$f":"Prop2021DistTar!AF6","v":158878.44437637989},{"$f":"Prop2021DistTar!AG6","v":639147331.87384105},{"$f":"Prop2021DistTar!AH6","v":0},{"$f":"Prop2021DistTar!AI6","v":0},{"$f":"Prop2021DistTar!AJ6","v":0},{"$f":"Prop2021DistTar!AK6","v":0},{"$f":"Prop2021DistTar!AL6","v":0},{"$f":"Prop2021DistTar!AM6","v":0},{"$f":"Prop2021DistTar!AN6","v":0},{"$f":"Prop2021DistTar!AO6","v":0},{"$f":"Prop2021DistTar!AP6","v":0},{"$f":"Prop2021DistTar!AQ6","v":0},{"$f":"Prop2021DistTar!AR6","v":0},null,{"$f":"D6*R6","v":0},{"$f":"E6/100*S6","v":965112.47112950007},0,0,0,0,0,0,0,{"$f":"M6*AA6","v":0},0,0,0,{"$f":"SUM(AF6:AR6)","v":965112.47112950007}]
[null,{"$f":"Prop2021DistTar!B7","v":"Residential - General Purpose Demand"},null,0,0.151,0,0,0,0,0,0,0,0,0,0,0,null,{"$f":"Prop2021DistTar!AF7","v":2.7105349653743454},{"$f":"Prop2021DistTar!AG7","v":30970.703999999998},{"$f":"Prop2021DistTar!AH7","v":0},{"$f":"Prop2021DistTar!AI7","v":0},{"$f":"Prop2021DistTar!AJ7","v":0},{"$f":"Prop2021DistTar!AK7","v":0},{"$f":"Prop2021DistTar!AL7","v":0},{"$f":"Prop2021DistTar!AM7","v":0},{"$f":"Prop2021DistTar!AN7","v":0},{"$f":"Prop2021DistTar!AO7","v":5},{"$f":"Prop2021DistTar!AP7","v":0},{"$f":"Prop2021DistTar!AQ7","v":0},{"$f":"Prop2021DistTar!AR7","v":0},null,{"$f":"D7*R7","v":0},{"$f":"E7/100*S7","v":46.765763039999996},0,0,0,0,0,0,0,{"$f":"M7*AA7","v":0},{"$f":"N7*AB7","v":0},{"$f":"O7*AC7","v":0},{"$f":"P7*AD7","v":0},{"$f":"SUM(AF7:AR7)","v":46.765763039999996}]
[null,{"$f":"Prop2021DistTar!B8","v":"Residential - Flexible"},null,0,0.151,0.151,0.151,0.151,0.14499999999999999,0.14499999999999999,0,0,0,0,0,0,null,{"$f":"Prop2021DistTar!AF8","v":415.0488379731334},{"$f":"Prop2021DistTar!AG8","v":309609.74663146213},{"$f":"Prop2021DistTar!AH8","v":580688.3796264258},{"$f":"Prop2021DistTar!AI8","v":407370.3282449813},{"$f":"Prop2021DistTar!AJ8","v":757351.41782394319},{"$f":"Prop2021DistTar!AK8","v":614725.70757555286},{"$f":"Prop2021DistTar!AL8","v":495167.14113703655},{"$f":"Prop2021DistTar!AM8","v":0},{"$f":"Prop2021DistTar!AN8","v":0},{"$f":"Prop2021DistTar!AO8","v":0},{"$f":"Prop2021DistTar!AP8","v":0},{"$f":"Prop2021DistTar!AQ8","v":0},{"$f":"Prop2021DistTar!AR8","v":0},null,0,467.51071741350785,876.83945323590297,615.12919564992183,1143.6006409141542,891.35227598455162,717.99235464870299,0,0,0,0,0,0,4712.4246378467415]
[null,{"$f":"Prop2021DistTar!B9","v":"Residential - Time of Use Interval Meter"},null,0,0.151,0,0,0,0.112,0,0,0,0,0,0,0,null,{"$f":"Prop2021DistTar!AF9","v":7444.4842589952177},{"$f":"Prop2021DistTar!AG9","v":16938462.590739086},{"$f":"Prop2021DistTar!AH9","v":0},{"$f":"Prop2021DistTar!AI9","v":0},{"$f":"Prop2021DistTar!AJ9","v":0},{"$f":"Prop2021DistTar!AK9","v":17531385.138661444},{"$f":"Prop2021DistTar!AL9","v":0},{"$f":"Prop2021DistTar!AM9","v":0},{"$f":"Prop2021DistTar!AN9","v":0},{"$f":"Prop2021DistTar!AO9","v":0},{"$f":"Prop2021DistTar!AP9","v":0},{"$f":"Prop2021DistTar!AQ9","v":0},{"$f":"Prop2021DistTar!AR9","v":0},null,0,25577.078512016022,0,0,0,19635.151355300819,0,0,0,0,0,0,0,45212.229867316841]
[null,{"$f":"Prop2021DistTar!B10","v":"Residential - TOU"},null,0,0.151,0,0,0,0.112,0,0,0,0,0,0,0,null,{"$f":"Prop2021DistTar!AF10","v":678.12900963762252},{"$f":"Prop2021DistTar!AG10","v":3116768.9030617047},{"$f":"Prop2021DistTar!AH10","v":0},{"$f":"Prop2021DistTar!AI10","v":0},{"$f":"Prop2021DistTar!AJ10","v":0},{"$f":"Prop2021DistTar!AK10","v":3413336.9183364362},{"$f":"Prop2021DistTar!AL10","v":0},{"$f":"Prop2021DistTar!AM10","v":0},{"$f":"Prop2021DistTar!AN10","v":0},{"$f":"Prop2021DistTar!AO10","v":0},{"$f":"Prop2021DistTar!AP10","v":0},{"$f":"Prop2021DistTar!AQ10","v":0},{"$f":"Prop2021DistTar!AR10","v":0},null,0,4706.3210436231739,0,0,0,3822.9373485368087,0,0,0,0,0,0,0,8529.2583921599835]
[null,{"$f":"Prop2021DistTar!B11","v":"Residential - Off Peak Only"},null,0,0,0,0,0,0.112,0,0,0,0,0,0,0,null,{"$f":"Prop2021DistTar!AF11","v":0},{"$f":"Prop2021DistTar!AG11","v":0},{"$f":"Prop2021DistTar!AH11","v":0},{"$f":"Prop2021DistTar!AI11","v":0},{"$f":"Prop2021DistTar!AJ11","v":0},{"$f":"Prop2021DistTar!AK11","v":15302727.75693658},{"$f":"Prop2021DistTar!AL11","v":0},{"$f":"Prop2021DistTar!AM11","v":0},{"$f":"Prop2021DistTar!AN11","v":0},{"$f":"Prop2021DistTar!AO11","v":0},{"$f":"Prop2021DistTar!AP11","v":0},{"$f":"Prop2021DistTar!AQ11","v":0},{"$f":"Prop2021DistTar!AR11","v":0},null,0,0,0,0,0,17139.055087768971,0,0,0,0,0,0,0,17139.055087768971]
[null,{"$f":"Prop2021DistTar!B12","v":"Small Business - General Purpose"},null,0,0.16600000000000001,0,0,0,0,0,0,0,0,0,0,0,null,{"$f":"Prop2021DistTar!AF12","v":9576.2728656799682},{"$f":"Prop2021DistTar!AG12","v":101667470.01587997},{"$f":"Prop2021DistTar!AH12","v":0},{"$f":"Prop2021DistTar!AI12","v":0},{"$f":"Prop2021DistTar!AJ12","v":0},{"$f":"Prop2021DistTar!AK12","v":0},{"$f":"Prop2021DistTar!AL12","v":0},{"$f":"Prop2021DistTar!AM12","v":0},{"$f":"Prop2021DistTar!AN12","v":0},{"$f":"Prop2021DistTar!AO12","v":0},{"$f":"Prop2021DistTar!AP12","v":0},{"$f":"Prop2021DistTar!AQ12","v":0},{"$f":"Prop2021DistTar!AR12","v":0},null,0,168768.00022636075,0,0,0,0,0,0,0,0,0,0,0,168768.00022636075]
[null,{"$f":"Prop2021DistTar!B13","v":"Small Business - General Purpose Demand"},null,0,0.16600000000000001,0,0,0,0,0,0,0,0,0,0,0,null,{"$f":"Prop2021DistTar!AF13","v":0.50591858632470232},null,{"$f":"Prop2021DistTar!AH13","v":0},{"$f":"Prop2021DistTar!AI13","v":0},{"$f":"Prop2021DistTar!AJ13","v":0},null,{"$f":"Prop2021DistTar!AL13","v":0},{"$f":"Prop2021DistTar!AM13","v":0},{"$f":"Prop2021DistTar!AN13","v":0},null,{"$f":"Prop2021DistTar!AP13","v":0},{"$f":"Prop2021DistTar!AQ13","v":0},{"$f":"Prop2021DistTar!AR13","v":0},null,0,null,0,0,0,null,0,0,0,0,0,0,0]
[null,{"$f":"Prop2021DistTar!B14","v":"Small Business - TOU Weekdays"},null,0,0.16600000000000001,0,0,0,0.112,0,0,0,0,0,0,0,null,{"$f":"Prop2021DistTar!AF14","v":3714.3530770786992},{"$f":"Prop2021DistTar!AG14","v":76073895.725184858},{"$f":"Prop2021DistTar!AH14","v":0},{"$f":"Prop2021DistTar!AI14","v":0},{"$f":"Prop2021DistTar!AJ14","v":0},{"$f":"Prop2021DistTar!AK14","v":49617354.310763627},{"$f":"Prop2021DistTar!AL14","v":0},{"$f":"Prop2021DistTar!AM14","v":0},{"$f":"Prop2021DistTar!AN14","v":0},{"$f":"Prop2021DistTar!AO14","v":0},{"$f":"Prop2021DistTar!AP14","v":0},{"$f":"Prop2021DistTar!AQ14","v":0},{"$f":"Prop2021DistTar!AR14","v":0},null,0,126282.66690380686,0,0,0,55571.436828055266,0,0,0,0,0,0,0,181854.10373186212]
[null,{"$f":"Prop2021DistTar!B15","v":"Small Business - TOU Weekdays Demand"},null,0,0.16600000000000001,0,0,0,0.112,0,0,0,0,0,0,0,null,{"$f":"Prop2021DistTar!AF15","v":345.77848980005649},{"$f":"Prop2021DistTar!AG15","v":34833063.036605179},{"$f":"Prop2021DistTar!AH15","v":0},{"$f":"Prop2021DistTar!AI15","v":0},{"$f":"Prop2021DistTar!AJ15","v":0},{"$f":"Prop2021DistTar!AK15","v":24232702.154806152},{"$f":"Prop2021DistTar!AL15","v":0},{"$f":"Prop2021DistTar!AM15","v":0},{"$f":"Prop2021DistTar!AN15","v":0},{"$f":"Prop2021DistTar!AO15","v":24819.492014977292},{"$f":"Prop2021DistTar!AP15","v":0},{"$f":"Prop2021DistTar!AQ15","v":0},{"$f":"Prop2021DistTar!AR15","v":0},null,0,57822.884640764598,0,0,0,27140.626413382892,0,0,0,0,0,0,0,84963.511054147486]
[null,{"$f":"Prop2021DistTar!B16","v":"Small Business - TOU Opt out"},null,0,0.16600000000000001,0,0,0,0.112,0,0,0,0,0,0,0,null,{"$f":"Prop2021DistTar!AF16","v":15.71720408182075},{"$f":"Prop2021DistTar!AG16","v":1276940.7568686081},{"$f":"Prop2021DistTar!AH16","v":0},{"$f":"Prop2021DistTar!AI16","v":0},{"$f":"Prop2021DistTar!AJ16","v":0},{"$f":"Prop2021DistTar!AK16","v":390747.40380256937},{"$f":"Prop2021DistTar!AL16","v":0},{"$f":"Prop2021DistTar!AM16","v":0},{"$f":"Prop2021DistTar!AN16","v":0},{"$f":"Prop2021DistTar!AO16","v":0},{"$f":"Prop2021DistTar!AP16","v":0},{"$f":"Prop2021DistTar!AQ16","v":0},{"$f":"Prop2021DistTar!AR16","v":0},null,0,2119.7216564018895,0,0,0,437.63709225887777,0,0,0,0,0,0,0,2557.3587486607671]
[null,{"$f":"Prop2021DistTar!B17","v":"Small Business - TOU Extended"},null,0,0.16600000000000001,0,0,0,0.112,0,0,0,0,0,0,0,null,{"$f":"Prop2021DistTar!AF17","v":941.07344895285144},{"$f":"Prop2021DistTar!AG17","v":18814347.707058504},{"$f":"Prop2021DistTar!AH17","v":0},{"$f":"Prop2021DistTar!AI17","v":0},{"$f":"Prop2021DistTar!AJ17","v":0},{"$f":"Prop2021DistTar!AK17","v":5757242.4415366901},{"$f":"Prop2021DistTar!AL17","v":0},{"$f":"Prop2021DistTar!AM17","v":0},{"$f":"Prop2021DistTar!AN17","v":0},{"$f":"Prop2021DistTar!AO17","v":0},{"$f":"Prop2021DistTar!AP17","v":0},{"$f":"Prop2021DistTar!AQ17","v":0},{"$f":"Prop2021DistTar!AR17","v":0},null,0,31231.817193717117,0,0,0,6448.1115345210937,0,0,0,0,0,0,0,37679.928728238214]
[null,{"$f":"Prop2021DistTar!B18","v":"Small Business - TOU Extended Demand"},null,0,0.16600000000000001,0,0,0,0.112,0,0,0,0,0,0,0,null,{"$f":"Prop2021DistTar!AF18","v":52.374579582041683},{"$f":"Prop2021DistTar!AG18","v":7861230.0296896184},{"$f":"Prop2021DistTar!AH18","v":0},{"$f":"Prop2021DistTar!AI18","v":0},{"$f":"Prop2021DistTar!AJ18","v":0},{"$f":"Prop2021DistTar!AK18","v":2311605.6132966289},{"$f":"Prop2021DistTar!AL18","v":0},{"$f":"Prop2021DistTar!AM18","v":0},{"$f":"Prop2021DistTar!AN18","v":0},{"$f":"Prop2021DistTar!AO18","v":5262.5171647996431},{"$f":"Prop2021DistTar!AP18","v":0},{"$f":"Prop2021DistTar!AQ18","v":0},{"$f":"Prop2021DistTar!AR18","v":0},null,0,13049.641849284766,0,0,0,2588.9982868922248,0,0,0,0,0,0,0,15638.640136176991]
[null,{"$f":"Prop2021DistTar!B19","v":"Small Business - Unmetered Supply"},null,0,0.16600000000000001,0,0,0,0.111,0,0,0,0,0,0,0,null,{"$f":"Prop2021DistTar!AF19","v":0},{"$f":"Prop2021DistTar!AG19","v":6906799.9431120688},{"$f":"Prop2021DistTar!AH19","v":0},{"$f":"Prop2021DistTar!AI19","v":0},{"$f":"Prop2021DistTar!AJ19","v":0},{"$f":"Prop2021DistTar!AK19","v":15374842.669164764},{"$f":"Prop2021DistTar!AL19","v":0},{"$f":"Prop2021DistTar!AM19","v":0},{"$f":"Prop2021DistTar!AN19","v":0},{"$f":"Prop2021DistTar!AO19","v":0},{"$f":"Prop2021DistTar!AP19","v":0},{"$f":"Prop2021DistTar!AQ19","v":0},{"$f":"Prop2021DistTar!AR19","v":0},null,0,11465.287905566034,0,0,0,17066.075362772888,0,0,0,0,0,0,0,28531.363268338922]
[null,{"$f":"Prop2021DistTar!B20","v":"Large Business - LV 0.4 - 0.8  GWh"},null,0,0.14799999999999999,0,0,0,0.121,0,0,0,0,0,0,0,null,{"$f":"Prop2021DistTar!AF20","v":388.55975348473487},{"$f":"Prop2021DistTar!AG20","v":87157927.195755512},{"$f":"Prop2021DistTar!AH20","v":0},{"$f":"Prop2021DistTar!AI20","v":0},{"$f":"Prop2021DistTar!AJ20","v":0},{"$f":"Prop2021DistTar!AK20","v":55986708.410393946},{"$f":"Prop2021DistTar!AL20","v":0},{"$f":"Prop2021DistTar!AM20","v":0},{"$f":"Prop2021DistTar!AN20","v":0},{"$f":"Prop2021DistTar!AO20","v":72443.429716937651},{"$f":"Prop2021DistTar!AP20","v":0},{"$f":"Prop2021DistTar!AQ20","v":0},{"$f":"Prop2021DistTar!AR20","v":0},null,0,128993.73224971816,0,0,0,67743.917176576666,0,0,0,0,0,0,0,196737.64942629484]
[null,{"$f":"Prop2021DistTar!B21","v":"Large Business – LVEN Annual Consumption <= 0.8 GWh"},null,0,0.14799999999999999,0,0,0,0.121,0,0,0,0,0,0,0,null,{"$f":"Prop2021DistTar!AF21","v":37.270949581273641},{"$f":"Prop2021DistTar!AG21","v":8221991.1611032225},{"$f":"Prop2021DistTar!AH21","v":0},{"$f":"Prop2021DistTar!AI21","v":0},{"$f":"Prop2021DistTar!AJ21","v":0},{"$f":"Prop2021DistTar!AK21","v":5679598.8500206638},{"$f":"Prop2021DistTar!AL21","v":0},{"$f":"Prop2021DistTar!AM21","v":0},{"$f":"Prop2021DistTar!AN21","v":0},{"$f":"Prop2021DistTar!AO21","v":8689.7712447539852},{"$f":"Prop2021DistTar!AP21","v":0},{"$f":"Prop2021DistTar!AQ21","v":0},{"$f":"Prop2021DistTar!AR21","v":0},null,0,12168.546918432769,0,0,0,6872.3146085250028,0,0,0,0,0,0,0,19040.861526957771]
[null,{"$f":"Prop2021DistTar!B22","v":"Large Business - LV  0.8+ - 2.2  GWh"},null,0,0.14799999999999999,0,0,0,0.121,0,0,0,0,0,0,0,null,{"$f":"Prop2021DistTar!AF22","v":194.08658091709918},{"$f":"Prop2021DistTar!AG22","v":131452092.67548704},{"$f":"Prop2021DistTar!AH22","v":0},{"$f":"Prop2021DistTar!AI22","v":0},{"$f":"Prop2021DistTar!AJ22","v":0},{"$f":"Prop2021DistTar!AK22","v":90838121.028442249},{"$f":"Prop2021DistTar!AL22","v":0},{"$f":"Prop2021DistTar!AM22","v":0},{"$f":"Prop2021DistTar!AN22","v":0},{"$f":"Prop2021DistTar!AO22","v":89510.481294754005},{"$f":"Prop2021DistTar!AP22","v":0},{"$f":"Prop2021DistTar!AQ22","v":0},{"$f":"Prop2021DistTar!AR22","v":0},null,0,194549.09715972081,0,0,0,109914.12644441512,0,0,0,0,0,0,0,304463.22360413591]
[null,{"$f":"Prop2021DistTar!B23","v":"Large Business - LVEN 0.8+ - 2.2 GWh"},null,0,0.14799999999999999,0,0,0,0.121,0,0,0,0,0,0,0,null,{"$f":"Prop2021DistTar!AF23","v":20.559646869443732},{"$f":"Prop2021DistTar!AG23","v":14920570.347691048},{"$f":"Prop2021DistTar!AH23","v":0},{"$f":"Prop2021DistTar!AI23","v":0},{"$f":"Prop2021DistTar!AJ23","v":0},{"$f":"Prop2021DistTar!AK23","v":9815052.4332260936},{"$f":"Prop2021DistTar!AL23","v":0},{"$f":"Prop2021DistTar!AM23","v":0},{"$f":"Prop2021DistTar!AN23","v":0},{"$f":"Prop2021DistTar!AO23","v":9299.5212644307703},{"$f":"Prop2021DistTar!AP23","v":0},{"$f":"Prop2021DistTar!AQ23","v":0},{"$f":"Prop2021DistTar!AR23","v":0},null,0,22082.444114582751,0,0,0,11876.213444203573,0,0,0,0,0,0,0,33958.657558786326]
[null,{"$f":"Prop2021DistTar!B24","v":"Large Business - LV  2.2+ - 6.0  GWh"},null,0,0.14799999999999999,0,0,0,0.121,0,0,0,0,0,0,0,null,{"$f":"Prop2021DistTar!AF24","v":37.253377233521974},{"$f":"Prop2021DistTar!AG24","v":60763995.953942209},{"$f":"Prop2021DistTar!AH24","v":0},{"$f":"Prop2021DistTar!AI24","v":0},{"$f":"Prop2021DistTar!AJ24","v":0},{"$f":"Prop2021DistTar!AK24","v":45943073.607626066},{"$f":"Prop2021DistTar!AL24","v":0},{"$f":"Prop2021DistTar!AM24","v":0},{"$f":"Prop2021DistTar!AN24","v":0},{"$f":"Prop2021DistTar!AO24","v":35969.743893851693},{"$f":"Prop2021DistTar!AP24","v":0},{"$f":"Prop2021DistTar!AQ24","v":0},{"$f":"Prop2021DistTar!AR24","v":0},null,0,89930.714011834469,0,0,0,55591.119065227533,0,0,0,0,0,0,0,145521.83307706201]
[null,{"$f":"Prop2021DistTar!B25","v":"Large Business - LVEN 2.2+  GWh"},null,0,0.14799999999999999,0,0,0,0.121,0,0,0,0,0,0,0,null,{"$f":"Prop2021DistTar!AF25","v":8.4171545730457673},{"$f":"Prop2021DistTar!AG25","v":10324851.161380298},{"$f":"Prop2021DistTar!AH25","v":0},{"$f":"Prop2021DistTar!AI25","v":0},{"$f":"Prop2021DistTar!AJ25","v":0},{"$f":"Prop2021DistTar!AK25","v":7433408.8864938915},{"$f":"Prop2021DistTar!AL25","v":0},{"$f":"Prop2021DistTar!AM25","v":0},{"$f":"Prop2021DistTar!AN25","v":0},{"$f":"Prop2021DistTar!AO25","v":7906.6060482373114},{"$f":"Prop2021DistTar!AP25","v":0},{"$f":"Prop2021DistTar!AQ25","v":0},{"$f":"Prop2021DistTar!AR25","v":0},null,0,15280.779718842841,0,0,0,8994.4247526576073,0,0,0,0,0,0,0,24275.204471500449]
[null,{"$f":"Prop2021DistTar!B26","v":"Large Business - LVMS 2.2+ - 6.0  GWh"},null,0,0.14799999999999999,0,0,0,0.121,0,0,0,0,0,0,0,null,{"$f":"Prop2021DistTar!AF26","v":5.2940165498851339},{"$f":"Prop2021DistTar!AG26","v":5811372.0693029007},{"$f":"Prop2021DistTar!AH26","v":0},{"$f":"Prop2021DistTar!AI26","v":0},{"$f":"Prop2021DistTar!AJ26","v":0},{"$f":"Prop2021DistTar!AK26","v":4687995.7061018618},{"$f":"Prop2021DistTar!AL26","v":0},{"$f":"Prop2021DistTar!AM26","v":0},{"$f":"Prop2021DistTar!AN26","v":0},{"$f":"Prop2021DistTar!AO26","v":3940.7965694710319},{"$f":"Prop2021DistTar!AP26","v":0},{"$f":"Prop2021DistTar!AQ26","v":0},{"$f":"Prop2021DistTar!AR26","v":0},null,0,8600.8306625682926,0,0,0,5672.4748043832524,0,0,0,0,0,0,0,14273.305466951544]
[null,{"$f":"Prop2021DistTar!B27","v":"Large Business - LV 6.0+ GWh"},null,0,0.14799999999999999,0,0,0,0.121,0,0,0,0,0,0,0,null,{"$f":"Prop2021DistTar!AF27","v":11.316591952069883},{"$f":"Prop2021DistTar!AG27","v":25847888.304707155},{"$f":"Prop2021DistTar!AH27","v":0},{"$f":"Prop2021DistTar!AI27","v":0},{"$f":"Prop2021DistTar!AJ27","v":0},{"$f":"Prop2021DistTar!AK27","v":21661553.605152186},{"$f":"Prop2021DistTar!AL27","v":0},{"$f":"Prop2021DistTar!AM27","v":0},{"$f":"Prop2021DistTar!AN27","v":0},{"$f":"Prop2021DistTar!AO27","v":13828.373147580272},{"$f":"Prop2021DistTar!AP27","v":0},{"$f":"Prop2021DistTar!AQ27","v":0},{"$f":"Prop2021DistTar!AR27","v":0},null,0,38254.874690966586,0,0,0,26210.479862234144,0,0,0,0,0,0,0,64465.354553200727]
[null,{"$f":"Prop2021DistTar!B28","v":"Large Business - LVMS 6.0+ GWh"},null,0,0.14799999999999999,0,0,0,0.121,0,0,0,0,0,0,0,null,{"$f":"Prop2021DistTar!AF28","v":14.438226954232185},{"$f":"Prop2021DistTar!AG28","v":26286303.386349238},{"$f":"Prop2021DistTar!AH28","v":0},{"$f":"Prop2021DistTar!AI28","v":0},{"$f":"Prop2021DistTar!AJ28","v":0},{"$f":"Prop2021DistTar!AK28","v":20462464.546255786},{"$f":"Prop2021DistTar!AL28","v":0},{"$f":"Prop2021DistTar!AM28","v":0},{"$f":"Prop2021DistTar!AN28","v":0},{"$f":"Prop2021DistTar!AO28","v":14512.002707429958},{"$f":"Prop2021DistTar!AP28","v":0},{"$f":"Prop2021DistTar!AQ28","v":0},{"$f":"Prop2021DistTar!AR28","v":0},null,0,38903.729011796873,0,0,0,24759.582100969499,0,0,0,0,0,0,0,63663.311112766372]
[null,{"$f":"Prop2021DistTar!B29","v":"Large Business - HV"},null,0,0.156,0,0,0,0.13200000000000001,0,0,0,0,0,0,0,null,{"$f":"Prop2021DistTar!AF29","v":44.37266666666666},{"$f":"Prop2021DistTar!AG29","v":123977469.73907256},{"$f":"Prop2021DistTar!AH29","v":0},{"$f":"Prop2021DistTar!AI29","v":0},{"$f":"Prop2021DistTar!AJ29","v":0},{"$f":"Prop2021DistTar!AK29","v":98362237.170290887},{"$f":"Prop2021DistTar!AL29","v":0},{"$f":"Prop2021DistTar!AM29","v":0},{"$f":"Prop2021DistTar!AN29","v":0},{"$f":"Prop2021DistTar!AO29","v":92928.263601917453},{"$f":"Prop2021DistTar!AP29","v":0},{"$f":"Prop2021DistTar!AQ29","v":0},{"$f":"Prop2021DistTar!AR29","v":0},null,0,193404.8527929532,0,0,0,129838.15306478397,0,0,0,0,0,0,0,323243.00585773715]
[null,{"$f":"Prop2021DistTar!B30","v":"Large Business – HVEN"},null,0,0.156,0,0,0,0.13200000000000001,0,0,0,0,0,0,0,null,{"$f":"Prop2021DistTar!AF30","v":1},null,{"$f":"Prop2021DistTar!AH30","v":0},{"$f":"Prop2021DistTar!AI30","v":0},{"$f":"Prop2021DistTar!AJ30","v":0},null,{"$f":"Prop2021DistTar!AL30","v":0},{"$f":"Prop2021DistTar!AM30","v":0},{"$f":"Prop2021DistTar!AN30","v":0},null,{"$f":"Prop2021DistTar!AP30","v":0},{"$f":"Prop2021DistTar!AQ30","v":0},{"$f":"Prop2021DistTar!AR30","v":0},null,0,null,0,0,0,null,0,0,0,0,0,0,0]
[null,{"$f":"Prop2021DistTar!B31","v":"Large Business - HVRF"},null,0,0.156,0,0,0,0.13200000000000001,0,0,0,0,0,0,0,null,{"$f":"Prop2021DistTar!AF31","v":0.98333333333333328},null,{"$f":"Prop2021DistTar!AH31","v":0},{"$f":"Prop2021DistTar!AI31","v":0},{"$f":"Prop2021DistTar!AJ31","v":0},null,{"$f":"Prop2021DistTar!AL31","v":0},{"$f":"Prop2021DistTar!AM31","v":0},{"$f":"Prop2021DistTar!AN31","v":0},null,{"$f":"Prop2021DistTar!AP31","v":0},{"$f":"Prop2021DistTar!AQ31","v":0},{"$f":"Prop2021DistTar!AR31","v":0},null,0,null,0,0,0,null,0,0,0,0,0,0,0]
[null,{"$f":"Prop2021DistTar!B32","v":"Large Business - HV Ann Cons >= 55GWh"},null,0,0.156,0,0,0,0.13200000000000001,0,0,0,0,0,0,0,null,{"$f":"Prop2021DistTar!AF32","v":0.5},null,{"$f":"Prop2021DistTar!AH32","v":0},{"$f":"Prop2021DistTar!AI32","v":0},{"$f":"Prop2021DistTar!AJ32","v":0},null,{"$f":"Prop2021DistTar!AL32","v":0},{"$f":"Prop2021DistTar!AM32","v":0},{"$f":"Prop2021DistTar!AN32","v":0},null,{"$f":"Prop2021DistTar!AP32","v":0},{"$f":"Prop2021DistTar!AQ32","v":0},{"$f":"Prop2021DistTar!AR32","v":0},null,0,null,0,0,0,null,0,0,0,0,0,0,0]
[null,{"$f":"Prop2021DistTar!B33","v":"Large Business - Subtransmission"},null,0,0.13300000000000001,0,0,0,0.112,0,0,0,0,0,0,0,null,{"$f":"Prop2021DistTar!AF33","v":1.5},null,{"$f":"Prop2021DistTar!AH33","v":0},{"$f":"Prop2021DistTar!AI33","v":0},{"$f":"Prop2021DistTar!AJ33","v":0},null,{"$f":"Prop2021DistTar!AL33","v":0},{"$f":"Prop2021DistTar!AM33","v":0},{"$f":"Prop2021DistTar!AN33","v":0},null,{"$f":"Prop2021DistTar!AP33","v":0},{"$f":"Prop2021DistTar!AQ33","v":0},{"$f":"Prop2021DistTar!AR33","v":0},null,{"$f":"D33*R33","v":0},null,{"$f":"F33/100*T33","v":0},0,0,null,0,0,0,{"$f":"M33*AA33","v":0},{"$f":"N33*AB33","v":0},{"$f":"O33*AC33","v":0},{"$f":"P33*AD33","v":0}]
[null,{"$f":"Prop2021DistTar!B34","v":"Large Business - Subtransmission MA"},null,0,0.13300000000000001,0,0,0,0.112,0,0,0,0,0,0,0,null,{"$f":"Prop2021DistTar!AF34","v":0.5},null,{"$f":"Prop2021DistTar!AH34","v":0},{"$f":"Prop2021DistTar!AI34","v":0},{"$f":"Prop2021DistTar!AJ34","v":0},null,{"$f":"Prop2021DistTar!AL34","v":0},{"$f":"Prop2021DistTar!AM34","v":0},{"$f":"Prop2021DistTar!AN34","v":0},null,{"$f":"Prop2021DistTar!AP34","v":0},{"$f":"Prop2021DistTar!AQ34","v":0},{"$f":"Prop2021DistTar!AR34","v":0},null,0,null,0,0,0,null,0,0,0,0,0,0,0]
[null,{"$f":"Prop2021DistTar!B35","v":"Large Business - Subtransmission EG"},null,0,0.13300000000000001,0,0,0,0.112,0,0,0,0,0,0,0,null,{"$f":"Prop2021DistTar!AF35","v":0.5},null,{"$f":"Prop2021DistTar!AH35","v":0},{"$f":"Prop2021DistTar!AI35","v":0},{"$f":"Prop2021DistTar!AJ35","v":0},null,{"$f":"Prop2021DistTar!AL35","v":0},{"$f":"Prop2021DistTar!AM35","v":0},{"$f":"Prop2021DistTar!AN35","v":0},null,{"$f":"Prop2021DistTar!AP35","v":0},{"$f":"Prop2021DistTar!AQ35","v":0},{"$f":"Prop2021DistTar!AR35","v":0},null,{"$f":"D35*R35","v":0},null,{"$f":"F35/100*T35","v":0},{"$f":"G35/100*U35","v":0},{"$f":"H35/100*V35","v":0},null,{"$f":"J35/100*X35","v":0},{"$f":"K35/100*Y35","v":0},{"$f":"L35/100*Z35","v":0},{"$f":"M35*AA35","v":0},{"$f":"N35*AB35","v":0},{"$f":"O35*AC35","v":0},{"$f":"P35*AD35","v":0}]
[null,null,null,null,null,null,null,null,null,null,null,null,null,null,null,null,null,{"$f":"Prop2021DistTar!AF36","v":0},{"$f":"Prop2021DistTar!AG36","v":0},{"$f":"Prop2021DistTar!AH36","v":0},{"$f":"Prop2021DistTar!AI36","v":0},{"$f":"Prop2021DistTar!AJ36","v":0},{"$f":"Prop2021DistTar!AK36","v":0},{"$f":"Prop2021DistTar!AL36","v":0},{"$f":"Prop2021DistTar!AM36","v":0},{"$f":"Prop2021DistTar!AN36","v":0},{"$f":"Prop2021DistTar!AO36","v":0},{"$f":"Prop2021DistTar!AP36","v":0},{"$f":"Prop2021DistTar!AQ36","v":0},{"$f":"Prop2021DistTar!AR36","v":0},null,0,0,0,0,0,0,0,0,0,0,0,0,0,0]
[null,null,null,null,null,null,null,null,null,null,null,null,null,null,null,null,null,{"$f":"Prop2021DistTar!AF37","v":0},{"$f":"Prop2021DistTar!AG37","v":0},{"$f":"Prop2021DistTar!AH37","v":0},{"$f":"Prop2021DistTar!AI37","v":0},{"$f":"Prop2021DistTar!AJ37","v":0},{"$f":"Prop2021DistTar!AK37","v":0},{"$f":"Prop2021DistTar!AL37","v":0},{"$f":"Prop2021DistTar!AM37","v":0},{"$f":"Prop2021DistTar!AN37","v":0},{"$f":"Prop2021DistTar!AO37","v":0},{"$f":"Prop2021DistTar!AP37","v":0},{"$f":"Prop2021DistTar!AQ37","v":0},{"$f":"Prop2021DistTar!AR37","v":0},null,0,0,0,0,0,0,0,0,0,0,0,0,0,0]
[null,null,null,null,null,null,null,null,null,null,null,null,null,null,null,null,null,{"$f":"Prop2021DistTar!AF38","v":0},{"$f":"Prop2021DistTar!AG38","v":0},{"$f":"Prop2021DistTar!AH38","v":0},{"$f":"Prop2021DistTar!AI38","v":0},{"$f":"Prop2021DistTar!AJ38","v":0},{"$f":"Prop2021DistTar!AK38","v":0},{"$f":"Prop2021DistTar!AL38","v":0},{"$f":"Prop2021DistTar!AM38","v":0},{"$f":"Prop2021DistTar!AN38","v":0},{"$f":"Prop2021DistTar!AO38","v":0},{"$f":"Prop2021DistTar!AP38","v":0},{"$f":"Prop2021DistTar!AQ38","v":0},{"$f":"Prop2021DistTar!AR38","v":0},null,0,0,0,0,0,0,0,0,{"$f":"L38/100*Z38","v":0},0,0,0,0,0]
[null,null,null,null,null,null,null,null,null,null,null,null,null,null,null,null,null,{"$f":"Prop2021DistTar!AF39","v":0},{"$f":"Prop2021DistTar!AG39","v":0},{"$f":"Prop2021DistTar!AH39","v":0},{"$f":"Prop2021DistTar!AI39","v":0},{"$f":"Prop2021DistTar!AJ39","v":0},{"$f":"Prop2021DistTar!AK39","v":0},{"$f":"Prop2021DistTar!AL39","v":0},{"$f":"Prop2021DistTar!AM39","v":0},{"$f":"Prop2021DistTar!AN39","v":0},{"$f":"Prop2021DistTar!AO39","v":0},{"$f":"Prop2021DistTar!AP39","v":0},{"$f":"Prop2021DistTar!AQ39","v":0},{"$f":"Prop2021DistTar!AR39","v":0},null,0,0,0,0,0,0,0,0,0,0,0,0,0,0]
[null,null,null,null,null,null,null,null,null,null,null,null,null,null,null,null,null,{"$f":"Prop2021DistTar!AF40","v":0},{"$f":"Prop2021DistTar!AG40","v":0},{"$f":"Prop2021DistTar!AH40","v":0},{"$f":"Prop2021DistTar!AI40","v":0},{"$f":"Prop2021DistTar!AJ40","v":0},{"$f":"Prop2021DistTar!AK40","v":0},{"$f":"Prop2021DistTar!AL40","v":0},{"$f":"Prop2021DistTar!AM40","v":0},{"$f":"Prop2021DistTar!AN40","v":0},{"$f":"Prop2021DistTar!AO40","v":0},{"$f":"Prop2021DistTar!AP40","v":0},{"$f":"Prop2021DistTar!AQ40","v":0},{"$f":"Prop2021DistTar!AR40","v":0},null,0,0,0,0,0,0,0,0,0,0,0,0,0,0]
[null,null,null,null,null,null,null,null,null,null,null,null,null,null,null,null,null,{"$f":"Prop2021DistTar!AF41","v":0},{"$f":"Prop2021DistTar!AG41","v":0},{"$f":"Prop2021DistTar!AH41","v":0},{"$f":"Prop2021DistTar!AI41","v":0},{"$f":"Prop2021DistTar!AJ41","v":0},{"$f":"Prop2021DistTar!AK41","v":0},{"$f":"Prop2021DistTar!AL41","v":0},{"$f":"Prop2021DistTar!AM41","v":0},{"$f":"Prop2021DistTar!AN41","v":0},{"$f":"Prop2021DistTar!AO41","v":0},{"$f":"Prop2021DistTar!AP41","v":0},{"$f":"Prop2021DistTar!AQ41","v":0},{"$f":"Prop2021DistTar!AR41","v":0},null,0,0,0,0,0,0,0,0,0,0,0,0,0,0]
[null,null,null,null,null,null,null,null,null,null,null,null,null,null,null,null,null,{"$f":"Prop2021DistTar!AF42","v":0},{"$f":"Prop2021DistTar!AG42","v":0},{"$f":"Prop2021DistTar!AH42","v":0},{"$f":"Prop2021DistTar!AI42","v":0},{"$f":"Prop2021DistTar!AJ42","v":0},{"$f":"Prop2021DistTar!AK42","v":0},{"$f":"Prop2021DistTar!AL42","v":0},{"$f":"Prop2021DistTar!AM42","v":0},{"$f":"Prop2021DistTar!AN42","v":0},{"$f":"Prop2021DistTar!AO42","v":0},{"$f":"Prop2021DistTar!AP42","v":0},{"$f":"Prop2021DistTar!AQ42","v":0},{"$f":"Prop2021DistTar!AR42","v":0},null,0,0,0,0,0,0,0,0,0,0,0,0,0,0]
[null,null,null,null,null,null,null,null,null,null,null,null,null,null,null,null,null,{"$f":"Prop2021DistTar!AF43","v":0},{"$f":"Prop2021DistTar!AG43","v":0},{"$f":"Prop2021DistTar!AH43","v":0},{"$f":"Prop2021DistTar!AI43","v":0},{"$f":"Prop2021DistTar!AJ43","v":0},{"$f":"Prop2021DistTar!AK43","v":0},{"$f":"Prop2021DistTar!AL43","v":0},{"$f":"Prop2021DistTar!AM43","v":0},{"$f":"Prop2021DistTar!AN43","v":0},{"$f":"Prop2021DistTar!AO43","v":0},{"$f":"Prop2021DistTar!AP43","v":0},{"$f":"Prop2021DistTar!AQ43","v":0},{"$f":"Prop2021DistTar!AR43","v":0},null,0,0,0,0,0,0,0,0,0,0,0,0,0,0]
[null,null,null,null,null,null,null,null,null,null,null,null,null,null,null,null,null,{"$f":"Prop2021DistTar!AF44","v":0},{"$f":"Prop2021DistTar!AG44","v":0},{"$f":"Prop2021DistTar!AH44","v":0},{"$f":"Prop2021DistTar!AI44","v":0},{"$f":"Prop2021DistTar!AJ44","v":0},{"$f":"Prop2021DistTar!AK44","v":0},{"$f":"Prop2021DistTar!AL44","v":0},{"$f":"Prop2021DistTar!AM44","v":0},{"$f":"Prop2021DistTar!AN44","v":0},{"$f":"Prop2021DistTar!AO44","v":0},{"$f":"Prop2021DistTar!AP44","v":0},{"$f":"Prop2021DistTar!AQ44","v":0},{"$f":"Prop2021DistTar!AR44","v":0},null,0,0,0,0,0,0,0,0,0,0,0,0,0,0]
[null,null,null,null,null,null,null,null,null,null,null,null,null,null,null,null,null,{"$f":"Prop2021DistTar!AF45","v":0},{"$f":"Prop2021DistTar!AG45","v":0},{"$f":"Prop2021DistTar!AH45","v":0},{"$f":"Prop2021DistTar!AI45","v":0},{"$f":"Prop2021DistTar!AJ45","v":0},{"$f":"Prop2021DistTar!AK45","v":0},{"$f":"Prop2021DistTar!AL45","v":0},{"$f":"Prop2021DistTar!AM45","v":0},{"$f":"Prop2021DistTar!AN45","v":0},{"$f":"Prop2021DistTar!AO45","v":0},{"$f":"Prop2021DistTar!AP45","v":0},{"$f":"Prop2021DistTar!AQ45","v":0},{"$f":"Prop2021DistTar!AR45","v":0},null,0,0,0,0,0,0,0,0,0,0,0,0,0,0]
[null,null,null,null,null,null,null,null,null,null,null,null,null,null,null,null,null,{"$f":"Prop2021DistTar!AF46","v":0},{"$f":"Prop2021DistTar!AG46","v":0},{"$f":"Prop2021DistTar!AH46","v":0},{"$f":"Prop2021DistTar!AI46","v":0},{"$f":"Prop2021DistTar!AJ46","v":0},{"$f":"Prop2021DistTar!AK46","v":0},{"$f":"Prop2021DistTar!AL46","v":0},{"$f":"Prop2021DistTar!AM46","v":0},{"$f":"Prop2021DistTar!AN46","v":0},{"$f":"Prop2021DistTar!AO46","v":0},{"$f":"Prop2021DistTar!AP46","v":0},{"$f":"Prop2021DistTar!AQ46","v":0},{"$f":"Prop2021DistTar!AR46","v":0},null,0,0,0,0,0,0,0,0,0,0,0,0,0,0]
[null,null,null,null,null,null,null,null,null,null,null,null,null,null,null,null,null,{"$f":"Prop2021DistTar!AF47","v":0},{"$f":"Prop2021DistTar!AG47","v":0},{"$f":"Prop2021DistTar!AH47","v":0},{"$f":"Prop2021DistTar!AI47","v":0},{"$f":"Prop2021DistTar!AJ47","v":0},{"$f":"Prop2021DistTar!AK47","v":0},{"$f":"Prop2021DistTar!AL47","v":0},{"$f":"Prop2021DistTar!AM47","v":0},{"$f":"Prop2021DistTar!AN47","v":0},{"$f":"Prop2021DistTar!AO47","v":0},{"$f":"Prop2021DistTar!AP47","v":0},{"$f":"Prop2021DistTar!AQ47","v":0},{"$f":"Prop2021DistTar!AR47","v":0},null,0,0,0,0,0,0,0,0,0,0,0,0,0,0]
[null,null,null,null,null,null,null,null,null,null,null,null,null,null,null,null,null,{"$f":"Prop2021DistTar!AF48","v":0},{"$f":"Prop2021DistTar!AG48","v":0},{"$f":"Prop2021DistTar!AH48","v":0},{"$f":"Prop2021DistTar!AI48","v":0},{"$f":"Prop2021DistTar!AJ48","v":0},{"$f":"Prop2021DistTar!AK48","v":0},{"$f":"Prop2021DistTar!AL48","v":0},{"$f":"Prop2021DistTar!AM48","v":0},{"$f":"Prop2021DistTar!AN48","v":0},{"$f":"Prop2021DistTar!AO48","v":0},{"$f":"Prop2021DistTar!AP48","v":0},{"$f":"Prop2021DistTar!AQ48","v":0},{"$f":"Prop2021DistTar!AR48","v":0},null,0,0,0,0,0,0,0,0,0,0,0,0,0,0]
[null,null,null,null,null,null,null,null,null,null,null,null,null,null,null,null,null,{"$f":"Prop2021DistTar!AF49","v":0},{"$f":"Prop2021DistTar!AG49","v":0},{"$f":"Prop2021DistTar!AH49","v":0},{"$f":"Prop2021DistTar!AI49","v":0},{"$f":"Prop2021DistTar!AJ49","v":0},{"$f":"Prop2021DistTar!AK49","v":0},{"$f":"Prop2021DistTar!AL49","v":0},{"$f":"Prop2021DistTar!AM49","v":0},{"$f":"Prop2021DistTar!AN49","v":0},{"$f":"Prop2021DistTar!AO49","v":0},{"$f":"Prop2021DistTar!AP49","v":0},{"$f":"Prop2021DistTar!AQ49","v":0},{"$f":"Prop2021DistTar!AR49","v":0},null,0,0,0,0,0,0,0,0,0,0,0,0,0,0]
[null,null,null,null,null,null,null,null,null,null,null,null,null,null,null,null,null,{"$f":"Prop2021DistTar!AF50","v":0},{"$f":"Prop2021DistTar!AG50","v":0},{"$f":"Prop2021DistTar!AH50","v":0},{"$f":"Prop2021DistTar!AI50","v":0},{"$f":"Prop2021DistTar!AJ50","v":0},{"$f":"Prop2021DistTar!AK50","v":0},{"$f":"Prop2021DistTar!AL50","v":0},{"$f":"Prop2021DistTar!AM50","v":0},{"$f":"Prop2021DistTar!AN50","v":0},{"$f":"Prop2021DistTar!AO50","v":0},{"$f":"Prop2021DistTar!AP50","v":0},{"$f":"Prop2021DistTar!AQ50","v":0},{"$f":"Prop2021DistTar!AR50","v":0},null,0,0,0,0,0,0,0,0,0,0,0,0,0,0]
[null,null,null,null,null,null,null,null,null,null,null,null,null,null,null,null,null,{"$f":"Prop2021DistTar!AF51","v":0},{"$f":"Prop2021DistTar!AG51","v":0},{"$f":"Prop2021DistTar!AH51","v":0},{"$f":"Prop2021DistTar!AI51","v":0},{"$f":"Prop2021DistTar!AJ51","v":0},{"$f":"Prop2021DistTar!AK51","v":0},{"$f":"Prop2021DistTar!AL51","v":0},{"$f":"Prop2021DistTar!AM51","v":0},{"$f":"Prop2021DistTar!AN51","v":0},{"$f":"Prop2021DistTar!AO51","v":0},{"$f":"Prop2021DistTar!AP51","v":0},{"$f":"Prop2021DistTar!AQ51","v":0},{"$f":"Prop2021DistTar!AR51","v":0},null,0,0,0,0,0,0,0,0,0,0,0,0,0,0]
[null,null,null,null,null,null,null,null,null,null,null,null,null,null,null,null,null,{"$f":"Prop2021DistTar!AF52","v":0},{"$f":"Prop2021DistTar!AG52","v":0},{"$f":"Prop2021DistTar!AH52","v":0},{"$f":"Prop2021DistTar!AI52","v":0},{"$f":"Prop2021DistTar!AJ52","v":0},{"$f":"Prop2021DistTar!AK52","v":0},{"$f":"Prop2021DistTar!AL52","v":0},{"$f":"Prop2021DistTar!AM52","v":0},{"$f":"Prop2021DistTar!AN52","v":0},{"$f":"Prop2021DistTar!AO52","v":0},{"$f":"Prop2021DistTar!AP52","v":0},{"$f":"Prop2021DistTar!AQ52","v":0},{"$f":"Prop2021DistTar!AR52","v":0},null,0,0,0,0,0,0,0,0,0,0,0,0,0,0]
[null,null,null,null,null,null,null,null,null,null,null,null,null,null,null,null,null,{"$f":"Prop2021DistTar!AF53","v":0},{"$f":"Prop2021DistTar!AG53","v":0},{"$f":"Prop2021DistTar!AH53","v":0},{"$f":"Prop2021DistTar!AI53","v":0},{"$f":"Prop2021DistTar!AJ53","v":0},{"$f":"Prop2021DistTar!AK53","v":0},{"$f":"Prop2021DistTar!AL53","v":0},{"$f":"Prop2021DistTar!AM53","v":0},{"$f":"Prop2021DistTar!AN53","v":0},{"$f":"Prop2021DistTar!AO53","v":0},{"$f":"Prop2021DistTar!AP53","v":0},{"$f":"Prop2021DistTar!AQ53","v":0},{"$f":"Prop2021DistTar!AR53","v":0},null,0,0,0,0,0,0,0,0,0,0,0,0,0,0]
[null,null,null,null,null,null,null,null,null,null,null,null,null,null,null,null,null,{"$f":"Prop2021DistTar!AF54","v":0},{"$f":"Prop2021DistTar!AG54","v":0},{"$f":"Prop2021DistTar!AH54","v":0},{"$f":"Prop2021DistTar!AI54","v":0},{"$f":"Prop2021DistTar!AJ54","v":0},{"$f":"Prop2021DistTar!AK54","v":0},{"$f":"Prop2021DistTar!AL54","v":0},{"$f":"Prop2021DistTar!AM54","v":0},{"$f":"Prop2021DistTar!AN54","v":0},{"$f":"Prop2021DistTar!AO54","v":0},{"$f":"Prop2021DistTar!AP54","v":0},{"$f":"Prop2021DistTar!AQ54","v":0},{"$f":"Prop2021DistTar!AR54","v":0},null,0,0,0,0,0,0,0,0,0,0,0,0,0,0]
[null,null,null,null,null,null,null,null,null,null,null,null,null,null,null,null,null,null,null,null,null,null,null,null,null,null,null,null,null,null,null,0,0,0,0,0,0,0,0,0,0,0,0,0,0]
[null,null,null,null,null,null,null,null,null,null,null,null,null,null,null,null,null,null,null,null,null,null,null,null,null,null,null,null,null,null,null,0,0,0,0,0,0,0,0,0,0,0,0,0,0]
[null,null,null,null,null,null,null,null,null,null,null,null,null,null,null,null,null,null,null,null,null,null,null,null,null,null,null,null,null,null,null,0,0,0,0,0,0,0,0,0,0,0,0,0,0]
[null,null,null,null,null,null,null,null,null,null,null,null,null,null,null,null,null,null,null,null,null,null,null,null,null,null,null,null,null,null,null,0,0,0,0,0,0,0,0,0,0,0,0,0,0]
[null,null,null,null,null,null,null,null,null,null,null,null,null,null,null,null,null,null,null,null,null,null,null,null,null,null,null,null,null,null,null,0,0,0,0,0,0,0,0,0,0,0,0,0,0]
[null,null,null,null,null,null,null,null,null,null,null,null,null,null,null,null,null,null,null,null,null,null,null,null,null,null,null,null,null,null,null,0,0,0,0,0,0,0,0,0,0,0,0,0,0]
[null,null,null,null,null,null,null,null,null,null,null,null,null,null,null,null,null,null,null,null,null,null,null,null,null,null,null,null,null,null,null,0,0,0,0,0,0,0,0,0,0,0,0,0,0]
[null,null,null,null,null,null,null,null,null,null,null,null,null,null,null,null,null,null,null,null,null,null,null,null,null,null,null,null,null,null,null,0,0,0,0,0,0,0,0,0,0,0,0,0,0]
[null,null,null,null,null,null,null,null,null,null,null,null,null,null,null,null,null,null,null,null,null,null,null,null,null,null,null,null,null,null,null,0,0,0,0,0,0,0,0,0,0,0,0,0,0]
[null,null,null,null,null,null,null,null,null,null,null,null,null,null,null,null,null,null,null,null,null,null,null,null,null,null,null,null,null,null,null,0,0,0,0,0,0,0,0,0,0,0,0,0,0]
[null,null,null,null,null,null,null,null,null,null,null,null,null,null,null,null,null,null,null,null,null,null,null,null,null,null,null,null,null,null,null,0,0,0,0,0,0,0,0,0,0,0,0,0,0]
[null,null,null,null,null,null,null,null,null,null,null,null,null,null,null,null,null,{"$f":"SUM(R6:R65)","v":182831.44489982832},1517656395.2083504,580688.3796264258,407370.3282449813,757351.41782394319,609112587.36011171,495167.14113703655,{"$f":"SUM(Y6:Y65)","v":0},0,443886.28658918006,0,0,0,null,{"$f":"SUM(AF6:AF65)","v":0},2313120.1848948868,876.83945323590297,615.12919564992183,1143.6006409141542,733286.11712925124,717.99235464870299,{"$f":"SUM(AM6:AM65)","v":0},0,0,0,0,0,3049759.8636685866]

{"sheet":"2021JSRevCont","index":16,"n_rows":17,"n_cols":3,"rows_kept":17,"cut":false,"hidden":false,"merged":[]}
[]
[null,{"$f":"\"Tariff Approval - \"&'Model update'!$C$3","v":"Tariff Approval - Jemena"},{"$f":"'Model update'!$C$5&\"JSRevCont\"","v":"2021JSRevCont"}]
[]
[null," Jurisdictional Scheme Amounts (JSA)"]
[]
[null,"Year (t)",{"$f":"'Model update'!C5","v":2021}]
[]
[null,"Table 1- Compliance with JSA Revenue Formula"]
[null,"Revenue from  Jurisdictional Scheme Amounts charges for year t",{"$f":"Prop2021JSTar!AS66","v":3049759.8636685866}]
[null,"Total JSA related payments for year t",{"$f":"C17","v":3050000}]
[null,null,{"$f":"IF(C9=\"\",\"\",IF(C10>=C9,\"JSA REVENUE FORMULA COMPLIANT\",\"JSA REVENUE FORMULA BREACHED\"))","v":"JSA REVENUE FORMULA COMPLIANT"}]
[]
[]
[null,"Table 3 - PFIT & TFIT charges for year t"]
[null,"PFIT",3050000]
[null,"TFIT",0]
[null,"PFIT & TFIT charges",{"$f":"SUM(C15:C16)","v":3050000}]