{"text_format":"1","workbook":"xlsx","n_sheets":6,"sheets":["NOTES","Model update","Prop2021DistTar","2021TarContForm","2021RebalContForm","ARS"],"not_rendered":{"charts":0,"images":0,"macros":1,"external_links":0,"defined_names":22,"comments":1,"pivot_tables":0},"unopened":[],"bounds":{"document_bytes":16777216,"sheet_cells":100000,"rows_first":2000,"rows_last":500,"rows_between":2000,"halvings":0,"cell_chars":16384,"cell_head_chars":4096},"cells_cut":0,"cells_raw":0,"read":"whole","date_system":"1900"}

{"sheet":"NOTES","index":0,"n_rows":22,"n_cols":5,"rows_kept":22,"cut":false,"hidden":false,"merged":[]}
[]
["The model has actual and test data to illustrate the workings of the model.",null,null,{"$f":"'Model update'!B5","v":2021}]
[]
["Issue","Location","Item","Comment"]
[]
[1,"'Model update'!B21","CPI",{"$f":"\"Updated June \"&D2-1&\" CPI for \"&D2","v":"Updated June 2020 CPI for 2021"},"NOTE: This worksheet is programmed to update for each year - use as checklist and note any placeholders or changes"]
[null,null,null,null,"NOTE: Worksheet names in this file are programmed to update each year once each worksheet is accessed and a cell is selected"]
[{"$f":"A6+1","v":2},"'Model update'!B36",{"$f":"\"Xt for \"&D2","v":"Xt for 2021"},{"$f":"\"Updated \"&$D$2&\" value\"","v":"Updated 2021 value"}]
[]
[{"$f":"A8+1","v":3},"'Model update'!B46",{"$f":"\"Pass Through Amount for \"&D2","v":"Pass Through Amount for 2021"},"NIL for 2020"]
[]
[{"$f":"A10+1","v":4},"'Model update'!B58","Real Pre-tax WACC (rptw)",{"$f":"\"Updated \"&$D$2&\" value\"","v":"Updated 2021 value"}]
[]
[{"$f":"A12+1","v":5},{"$f":"\"Prop\"&D2&\"DistTar!E8:E96\"","v":"Prop2021DistTar!E8:E96"},{"$f":"D2-1&\" tariffs\"","v":"2020 tariffs"},{"$f":"\"Updated from \"&D2-1&\" model\"","v":"Updated from 2020 model"}]
[]
[{"$f":"A14+1","v":6},"ARS!B6:B12",{"$f":"D2-1&\" ARS tariffs\"","v":"2020 ARS tariffs"},{"$f":"\"Updated from \"&D2-1&\" model\"","v":"Updated from 2020 model"}]
[]
[{"$f":"A16+1","v":7},"The following is test data to illustrate the workings of the model.",null,"Input data required from DNSPs"]
[null,{"$f":"\"Prop\"&D2&\"DistTar!D8:D96\"","v":"Prop2021DistTar!D8:D96"},{"$f":"\"Proposed \"&D2&\" Tariffs\"","v":"Proposed 2021 Tariffs"}]
[null,{"$f":"\"Prop\"&D2&\"DistTar!F8:F96\"","v":"Prop2021DistTar!F8:F96"},{"$f":"\"Actual \"&D2-2&\" Volumes\"","v":"Actual 2019 Volumes"}]
[]
[null,"ARS!C6:C12",{"$f":"\"Proposed \"&D2&\" Ancillary Reference Services Charges\"","v":"Proposed 2021 Ancillary Reference Services Charges"},"Calculated using formula"]

{"sheet":"Model update","index":1,"n_rows":58,"n_cols":2,"rows_kept":58,"cut":false,"hidden":false,"merged":[[54,0,55,1]]}
[]
[]
["Tariff Approval Template for ","Aust. Gas Networks (Vic & Albury)"]
[]
["Calendar year commencing",2021]
[]
["t",{"$f":"B5","v":2021}]
["t-1",{"$f":"B7-1","v":2020}]
["t-2",2019]
["t-3",2018]
[]
[]
["Please fill in yellow highlighted cells where appropriate"]
[]
["CPI"]
[]
["CPI Index June 2016",108.6]
["CPI Index June 2017",110.7]
["CPI Index June 2018",113]
["CPI Index June 2019",114.8]
["CPI Index June 2020",114.4]
["CPI Index June 2021"]
[]
[]
[{"$f":"\"CPI Index June \" &$B$10","v":"CPI Index June 2018"},{"$f":"VLOOKUP(A25,A$17:B$22,2,FALSE)","v":113}]
[{"$f":"\"CPI Index June \" &$B$9","v":"CPI Index June 2019"},{"$f":"VLOOKUP(A26,A$17:B$22,2,FALSE)","v":114.8}]
[{"$f":"\"CPI Index June \" &$B$8","v":"CPI Index June 2020"},{"$f":"VLOOKUP(A27,A$17:B$22,2,FALSE)","v":114.4}]
[]
[{"$f":"\"CPI \" &$B$8","v":"CPI 2020"},{"$f":"B26/B25-1","v":1.5929203539823078E-2}]
[{"$f":"\"CPI \" &$B$5","v":"CPI 2021"},{"$f":"B27/B26-1","v":-3.4843205574912606E-3}]
[]
[]
[{"$f":"\"Xt for \"&B$5","v":"Xt for 2021"}]
[2019,-1.2932003198752063E-2]
[2020,-5.9643805428307873E-3]
[2021,-2.9121585433830224E-3]
[2022,-1.35E-2]
[]
[]
[{"$f":"\"Xt for \"&B$5","v":"Xt for 2021"},{"$f":"VLOOKUP(B5,A34:B38,2,FALSE)","v":-2.9121585433830224E-3}]
[]
[]
["Pass Through Amounts :  PT (t)"]
[2019,0]
[2020,0]
[2021,0]
[2022,0]
[]
[]
[{"$f":"\"Pass Through Amount for \"&B$5","v":"Pass Through Amount for 2021"},{"$f":"VLOOKUP(B5,A44:B48,2,FALSE)","v":0}]
["The Pass Through Amount is to include an amount that reflects the time value of money between incurring the costs and recovering the costs"]
["and excludes any amounts already passed through in reference tariffs."]
[]
[]
["Pre-tax WACC for distribution tariffs "]
[]
[]
[" Pretax WACCD",3.605542631615144E-2]

{"sheet":"Prop2021DistTar","index":2,"n_rows":101,"n_cols":8,"rows_kept":101,"cut":false,"hidden":false,"merged":[]}
[null,{"$f":"\"Tariff Approval - \"&'Model update'!B3","v":"Tariff Approval - Aust. Gas Networks (Vic & Albury)"},null,{"$f":"\"Prop\"&'Model update'!B5&\"DistTar\"","v":"Prop2021DistTar"}]
[]
[null,{"$f":"\"PROPOSED \"&'Model update'!$B$5&\" DISTRIBUTION TARIFFS\"","v":"PROPOSED 2021 DISTRIBUTION TARIFFS"}]
[]
[null,"Proposed tariff name","Existing tariff name",{"$f":"\"Prop\n\"&'Model update'!$B$5&\" Tariff\"","v":"Prop\n2021 Tariff"},{"$f":"\"Exist\n\"&'Model update'!$B$8&\" Tariff\"","v":"Exist\n2020 Tariff"},{"$f":"\"Actual \"&'Model update'!$B$9&\" Volumes\"","v":"Actual 2019 Volumes"},"Prop Tar\nRevenue","Exist Tar\nRevenue"]
[null,"Tariff V - AGN Central - Residential","Tariff V - AGN Central - Residential"]
[]
[null,"Fixed Charge","Fixed Charge",0.193,0.19309999999999999,205059578,{"$f":"D8*$F8","v":39576498.553999998},{"$f":"E8*$F8","v":39597004.511799999}]
[null,"GJ 0 - 0.0274","GJ 0 - 0.0274",11.8856,11.8925,4898091.6888095047,{"$f":"D9*$F9","v":58216758.576514252},58250555.409167036]
[null,"GJ 0.0274 - 0.0493","GJ 0.0274 - 0.0493",6.8338000000000001,6.8377999999999997,3062512.152785081,20928595.549702685,20940845.598313827]
[null,"GJ > 0.0493","GJ > 0.0493",3.7513999999999998,3.7538,18240946.651288182,68429087.267642483,68472865.539605573]
[null,"Tariff V - AGN Central - Non Residential","Tariff V - AGN Central - Non Residential"]
[]
[null,"Fixed Charge","Fixed Charge",0.193,0.19309999999999999,7304213,{"$f":"D14*$F14","v":1409713.1089999999},{"$f":"E14*$F14","v":1410443.5303}]
[null,"GJ 0 - 0.05","GJ 0 - 0.05",8.39,8.3948999999999998,266313.64792238764,{"$f":"D15*$F15","v":2234371.5060688322},2235676.4429436522]
[null,"GJ 0.05 - 0.55","GJ 0.05 - 0.55",3.9599000000000002,3.9622000000000002,1443576.7831511109,5716419.7036000844,5719739.9302013321]
[null,"GJ 0.55 - 1.37","GJ 0.55 - 1.37",2.9535999999999998,2.9552999999999998,1167065.0089756171,3447043.2105103824,3449027.2210256411]
[null,"GJ > 1.37","GJ > 1.37",1.1929000000000001,1.1936,4103544.0663897018,4895117.7167962752,4897990.1976427482]
[null,"Tariff V - AGN North - Residential","Tariff V - AGN North - Residential"]
[]
[null,"Fixed Charge","Fixed Charge",0.193,0.19309999999999999,28977377,{"$f":"D21*$F21","v":5592633.7609999999},{"$f":"E21*$F21","v":5595531.4986999994}]
[null,"GJ 0 - 0.0274","GJ 0 - 0.0274",10.4575,10.4636,664129.75276136328,{"$f":"D22*$F22","v":6945136.8895019563},6949188.0809938004]
[null,"GJ 0.0274 - 0.0493","GJ 0.0274 - 0.0493",6.1215000000000002,6.1250999999999998,397382.03996837436,2432574.1576664038,2434004.7330102897]
[null,"GJ > 0.0493","GJ > 0.0493",3.3609,3.3628999999999998,2557176.0828654249,8594413.0969024058,8599527.4490681365]
[null,"Tariff V - AGN North - Non Residential","Tariff V - AGN North - Non Residential"]
[]
[null,"Fixed Charge","Fixed Charge",0.193,0.19309999999999999,1197219,{"$f":"D27*$F27","v":231063.26699999999},{"$f":"E27*$F27","v":231182.9889}]
[null,"GJ 0 - 0.05","GJ 0 - 0.05",7.5259,7.5303000000000004,37630.697013927864,{"$f":"D28*$F28","v":283204.86265711969},283370.43772398098]
[null,"GJ 0.05 - 0.55","GJ 0.05 - 0.55",3.5788000000000002,3.5809000000000002,184739.00299572418,661143.94392109767,661531.89582738874]
[null,"GJ 0.55 - 1.37","GJ 0.55 - 1.37",2.6690999999999998,2.6707000000000001,127263.14566871065,339678.0621043556,339881.68313742557]
[null,"GJ > 1.37","GJ > 1.37",1.0785,1.0790999999999999,496073.4155062486,535015.1786234891,535312.82267279283]
[null,"Tariff V - Murray Valley - Residential","Tariff V - Murray Valley - Residential"]
[]
[null,"Fixed Charge","Fixed Charge",0.2457,0.24579999999999999,2990930,{"$f":"D34*$F34","v":734871.50100000005},{"$f":"E34*$F34","v":735170.59399999992}]
[null,"GJ 0 - 0.0274","GJ 0 - 0.0274",9.1044999999999998,9.1097999999999999,57802.152626636329,{"$f":"D35*$F35","v":526259.6985892104},526566.04999813158]
[null,"GJ 0.0274 - 0.0493","GJ 0.0274 - 0.0493",5.5079000000000002,5.5110999999999999,30628.05682436829,168696.27418293813,168794.28396477608]
[null,"GJ > 0.0493","GJ > 0.0493",3.4455,3.4474999999999998,192707.46998040809,663973.58781749604,664359.00275745685]
[null,"Tariff V - Murray Valley - Non Residential","Tariff V - Murray Valley - Non Residential"]
[]
[null,"Fixed Charge","Fixed Charge",0.2457,0.24579999999999999,130312,{"$f":"D40*$F40","v":32017.6584},{"$f":"E40*$F40","v":32030.689599999998}]
[null,"GJ 0 - 0.05","GJ 0 - 0.05",6.7290999999999999,6.7329999999999997,4406.9050896670024,{"$f":"D41*$F41","v":29654.505038878226},29671.691968727926]
[null,"GJ 0.05 - 0.55","GJ 0.05 - 0.55",3.9744000000000002,3.9767000000000001,20671.549759732974,82157.00736508274,82204.55192953012]
[null,"GJ 0.55 - 1.37","GJ 0.55 - 1.37",2.9661,2.9678,12808.446194453998,37991.132257370002,38012.906615900574]
[null,"GJ > 1.37","GJ > 1.37",1.3427,1.3434999999999999,28696.127148841006,38530.289922748816,38553.246824467889]
[null,"Tariff V - Bairnsdale - Residential","Tariff V - Bairnsdale - Residential"]
[]
[null,"Fixed Charge","Fixed Charge",0.31759999999999999,0.31780000000000003,1657399,{"$f":"D47*$F47","v":526389.92240000004},{"$f":"E47*$F47","v":526721.40220000001}]
[null,"GJ 0 - 0.0274","GJ 0 - 0.0274",19.4053,19.416599999999999,32506.662790609971,{"$f":"D48*$F48","v":630801.54345062363},{"$f":"E48*$F48","v":631168.86874015757}]
[null,"GJ 0.0274 - 0.0493","GJ 0.0274 - 0.0493",11.286799999999999,11.2934,16112.610177241058,181859.80854848438,181966.15177565417]
[null,"GJ > 0.0493","GJ > 0.0493",6.2016999999999998,6.1999000000000004,69682.996465973032,432153.03918302496,432027.60978938622]
[null,"Tariff V - Bairnsdale - Non Residential","Tariff V - Bairnsdale - Non Residential"]
[]
[null,"Fixed Charge","Fixed Charge",0.31759999999999999,0.31780000000000003,43459,{"$f":"D53*$F53","v":13802.5784},{"$f":"E53*$F53","v":13811.270200000001}]
[null,"GJ 0 - 0.05","GJ 0 - 0.05",13.7965,13.804500000000001,1792.2717191360005,{"$f":"D54*$F54","v":24727.076773059831},{"$f":"E54*$F54","v":24741.414946812918}]
[null,"GJ 0.05 - 0.55","GJ 0.05 - 0.55",6.7260999999999997,6.73,13124.727761945993,88278.231399624943,88329.417837896544]
[null,"GJ 0.55 - 1.37","GJ 0.55 - 1.37",5.0148999999999999,5.0178000000000003,10214.248610588005,51223.435357237788,51253.056678208493]
[null,"GJ > 1.37","GJ > 1.37",2.0256000000000003,2.0266999999999999,41020.008440777019,83090.129097637939,83135.251106922777]
[]
[null,"Tariff D -  AGN Central","Tariff D -  AGN Central"]
[null,"0 - 10","0 - 10",1460.155,1461.0057999999999,1429.1395999999995,{"$f":"D60*$F60","v":2086765.3326379992},2087981.2446096791]
[null,"10 - 50","10 - 50",892.64530000000002,893.16539999999998,1224.1337999999998,1092717.2831411399,1093353.9551305198]
[null,"> 50","> 50",163.0154,163.1104,1251.7936999999999,204061.65072298,204180.57112447999]
[]
[null,"Tariff D - AGN North","Tariff D - AGN North"]
[null,"0 - 10","0 - 10",1460.155,1461.0057999999999,429.69869999999997,{"$f":"D65*$F65","v":627426.7052984999},627792.29295245989]
[null,"10 - 50","10 - 50",892.64530000000002,893.16539999999998,600.40189999999996,535945.93414606992,536258.20317425998]
[null,"> 50","> 50",163.0154,163.1104,438.6123,71500.559529420003,71542.227697919996]
[]
[null,"Tariff D - Murray Valley","Tariff D - Murray Valley"]
[null,"0 - 10","0 - 10",1701.9860000000001,1702.9776999999999,68.440300000000008,{"$f":"D70*$F70","v":116484.43243580002},116552.30468131001]
[null,"10 - 50","10 - 50",1050.2328,1050.8447000000001,160.83710000000002,168916.39787688002,169014.81409837003]
[null,"> 50","> 50",178.8732,178.97739999999999,78.773099999999999,14090.396470919999,14098.60462794]
[]
[null,"Tariff D - Bairnsdale","Tariff D - Bairnsdale"]
[null,"0 - 10","0 - 10",2415.2923000000001,2416.6995999999999,16.009700000000002,{"$f":"D75*$F75","v":38668.105135310005},38690.635586120006]
[null,"10 - 50","10 - 50",1496.2836,1497.1554000000001,2.7294,4083.95645784,4086.3359487600005]
[null,"> 50","> 50",272.88810000000001,273.0471,0,0,0]
[]
[null,"Tariff V - Albury - Residential","Tariff V - Albury - Residential"]
[]
{"$rows_left_out":22}
{"sheet":"2021TarContForm","index":3,"n_rows":44,"n_cols":6,"rows_kept":44,"cut":false,"hidden":false,"merged":[[43,1,43,3]]}
[null,{"$f":"\"Tariff Approval - \"&'Model update'!B3","v":"Tariff Approval - Aust. Gas Networks (Vic & Albury)"},null,null,null,{"$f":"'Model update'!B5&\"TarContForm\"","v":"2021TarContForm"}]
[]
[null,{"$f":"'Model update'!$B$5&\"  TARIFF CONTROL FORMULA\"","v":"2021  TARIFF CONTROL FORMULA"}]
[]
[]
[null,"CPI"]
[]
[null,{"$f":"\"CPI June\"&'Model update'!$B$9","v":"CPI June2019"},{"$f":"'Model update'!B26","v":114.8}]
[null,{"$f":"\"CPI June\"&'Model update'!$B$8","v":"CPI June2020"},{"$f":"'Model update'!B27","v":114.4}]
[]
[null,{"$f":"\"CPI \"&'Model update'!$B$5","v":"CPI 2021"},{"$f":"(C9/C8-1)","v":-3.4843205574912606E-3}]
[]
[]
[]
[null,"X factor"]
[]
[null,{"$f":"\"X \"&'Model update'!$B$5","v":"X 2021"},{"$f":"'Model update'!B40","v":-2.9121585433830224E-3}]
[]
[]
[null,"Pass Through Factor (PT)"]
[]
[null,"pass through"]
[null,{"$f":"\"AP (t) \"&'Model update'!$B$7","v":"AP (t) 2021"},{"$f":"'Model update'!B50","v":0}]
[]
[null,"Revenue"]
[null,"∑∑p(t-1)q(t-2)",{"$f":"C41","v":246922563.18761748}]
[]
[null,"PT' (t-1)",0]
[null,{"$f":"\"PT' \"&'Model update'!$B$5","v":"PT' 2021"},{"$f":"IF(C26=\"\",0,(C23)/((1+C11)*(1-C17)*C26))","v":0}]
[]
[null,{"$f":"\"PTt \"&'Model update'!$B$5","v":"PTt 2021"},{"$f":"((1+C29)/(1+C28))-1","v":0}]
[]
[]
[]
[]
[null,{"$f":"'Model update'!$B$5&\"  Distribution price control\"","v":"2021  Distribution price control"}]
[]
[null,"Average price movement allowed",{"$f":"(1+C11)*(1-C17)*(1+C31)","v":0.99941769109201251}]
[]
[null,"Proposed distribution tariff revenue",{"$f":"IF(Prop2021DistTar!G101=0,\"\",Prop2021DistTar!G101)","v":246778775.78864592}]
[null,"Existing distribution tariff revenue",{"$f":"IF(Prop2021DistTar!H101=0,\"\",Prop2021DistTar!H101)","v":246922563.18761748}]
[null,"Average price movement",{"$f":"IF(C40=\"\",\"\",C40/C41)","v":0.99941768221941585}]
[]
[null,{"$f":"IF(C40=\"\",\"\",IF(C38>=C42,\"DISTRIBUTION PRICE CONTROL FORMULA COMPLIANT\",\"DISTRIBUTION PRICE CONTROL FORMULA BREACHED\"))","v":"DISTRIBUTION PRICE CONTROL FORMULA COMPLIANT"}]

{"sheet":"2021RebalContForm","index":4,"n_rows":454,"n_cols":7,"rows_kept":454,"cut":false,"hidden":false,"merged":[[63,1,63,2],[93,1,93,2],[123,1,123,2],[183,1,183,2],[213,1,213,2],[399,1,399,2],[429,1,429,2],[453,1,453,2],[243,1,243,2],[153,1,153,2],[273,1,273,2],[369,1,369,2],[297,1,297,2],[321,1,321,2],[345,1,345,2]]}
[null,{"$f":"\"Tariff Approval - \"&'Model update'!B3","v":"Tariff Approval - Aust. Gas Networks (Vic & Albury)"},{"$f":"'Model update'!B7&\"RebalContForm\"","v":"2021RebalContForm"}]
[]
[null,{"$f":"'Model update'!$B$5&\"  REBALANCING CONTROL FORMULA\"","v":"2021  REBALANCING CONTROL FORMULA"}]
[]
[]
[null,"Rebalancing control"]
[]
[null,{"$f":"\"CPI \"&'Model update'!$B$5","v":"CPI 2021"},{"$f":"'2021TarContForm'!C11","v":-3.4843205574912606E-3}]
[null,{"$f":"\"Y  \"&'Model update'!$B$5","v":"Y  2021"},0.02]
[null,{"$f":"\"PTt \"&'Model update'!$B$5","v":"PTt 2021"},{"$f":"'2021TarContForm'!C29","v":0}]
[null,{"$f":"\"Xt \"&'Model update'!$B$5","v":"Xt 2021"},{"$f":"'2021TarContForm'!C17","v":-2.9121585433830224E-3}]
[]
[null,"Rebalancing control",{"$f":"(1+C8)*(1+C9)*(1+C10)*(1-C11)","v":1.0194060449138527}]
[]
[]
[]
[null,"Rebalancing control summary"]
[null,null,"Existing","Proposed","Movement","Assessment"]
[null,{"$f":"B38","v":"Tariff V - AGN Central - Residential"},{"$f":"C59","v":187261271.05888644},{"$f":"C60","v":187150939.94785941},{"$f":"IF(C19=0,0,D19/C19)","v":0.99941081724799175},{"$f":"IF(E19=0,\"\",IF($C$13<=E19,\"Breached\",\"Compliant\"))","v":"Compliant"}]
[null,{"$f":"B68","v":"Tariff V - AGN North - Residential"},{"$f":"C89","v":23578251.761772227},{"$f":"C90","v":23564757.905070767},{"$f":"IF(C20=0,0,D20/C20)","v":0.99942769901527062},{"$f":"IF(E20=0,\"\",IF($C$13<=E20,\"Breached\",\"Compliant\"))","v":"Compliant"}]
[null,{"$f":"B98","v":"Tariff V - Murray Valley - Residential"},{"$f":"C119","v":2094889.9307203644},{"$f":"C120","v":2093801.0615896448},0.99948022608980447,"Compliant"]
[null,{"$f":"B128","v":"Tariff V - Bairnsdale - Residential"},{"$f":"C149","v":1771884.0325051979},{"$f":"C150","v":1771204.3135821333},0.99961638633759586,"Compliant"]
[null,{"$f":"B158","v":"Tariff V - AGN Central - Non Residential"},{"$f":"C179","v":17712877.322113372},{"$f":"C180","v":17702665.245975576},0.99942346599301246,"Compliant"]
[null,{"$f":"B188","v":"Tariff V - AGN North - Non Residential"},{"$f":"C209","v":2051279.8282615882},{"$f":"C210","v":2050105.3143060619},0.99942742382616723,{"$f":"IF(E24=0,\"\",IF($C$13<=E24,\"Breached\",\"Compliant\"))","v":"Compliant"}]
[null,{"$f":"B218","v":"Tariff V - Murray Valley - Non Residential"},{"$f":"C239","v":220473.08693862654},{"$f":"C240","v":220350.59298407979},0.99944440404836876,"Compliant"]
[null,{"$f":"B248","v":"Tariff V - Bairnsdale - Non Residential"},{"$f":"C269","v":261270.41076984073},{"$f":"C270","v":261121.45102756051},{"$f":"IF(C26=0,0,D26/C26)","v":0.99942986371154197},{"$f":"IF(E26=0,\"\",IF($C$13<=E26,\"Breached\",\"Compliant\"))","v":"Compliant"}]
[null,{"$f":"B278","v":"Tariff D -  AGN Central"},{"$f":"C293","v":3385515.770864679},{"$f":"C294","v":3383544.2665021191},{"$f":"IF(C27=0,0,D27/C27)","v":0.99941766498932705},{"$f":"IF(E27=0,\"\",IF($C$13<=E27,\"Breached\",\"Compliant\"))","v":"Compliant"}]
[null,{"$f":"B302","v":"Tariff D - AGN North"},{"$f":"C317","v":1235592.7238246398},{"$f":"C318","v":1234873.1989739898},0.99941766826821155,"Compliant"]
[null,{"$f":"B326","v":"Tariff D - Murray Valley"},{"$f":"C341","v":299665.72340762004},{"$f":"C342","v":299491.22678360005},0.99941769575099981,"Compliant"]
[null,{"$f":"B350","v":"Tariff D - Bairnsdale"},{"$f":"C365","v":42776.971534880009},{"$f":"C366","v":42752.061593150007},0.9994176786986968,"Compliant"]
[null,{"$f":"B374","v":"Tariff V - Albury - Residential"},{"$f":"C395","v":6248463.2859997731},{"$f":"C396","v":6245239.8500614315},0.99948412340910064,"Compliant"]
[null,{"$f":"B404","v":"Tariff V - Albury - Non Residential"},{"$f":"C425","v":577842.03694751184},{"$f":"C426","v":577525.21315459849},0.99945171210701977,"Compliant"]
[null,{"$f":"B434","v":"Tariff D - Albury"},{"$f":"C449","v":180509.24307072},{"$f":"C450","v":180404.13918177999},0.99941773680310197,"Compliant"]
[null,null,{"$f":"SUM(C19:C33)","v":246922563.18761745},{"$f":"SUM(D19:D33)","v":246778775.78864589},0.99941768221941585]
[]
[]
[]
[null,{"$f":"Prop2021DistTar!B6","v":"Tariff V - AGN Central - Residential"},1,2,3,4,5]
[null,null,1,2,3,4,5]
[null,"Distribution tariff","Fixed","Blk1","Blk2","Blk3"]
[]
[null,{"$f":"\"Existing : \"&Prop2021DistTar!C6","v":"Existing : Tariff V - AGN Central - Residential"},{"$f":"INDEX(Prop2021DistTar!$E$8:$E$11,C$39)","v":0.19309999999999999},{"$f":"INDEX(Prop2021DistTar!$E$8:$E$11,D$39)","v":11.8925},{"$f":"INDEX(Prop2021DistTar!$E$8:$E$11,E$39)","v":6.8377999999999997},{"$f":"INDEX(Prop2021DistTar!$E$8:$E$11,F$39)","v":3.7538}]
[]
[null,{"$f":"\"Proposed : \"&B38","v":"Proposed : Tariff V - AGN Central - Residential"},{"$f":"INDEX(Prop2021DistTar!$D$8:$D$11,C$38)","v":0.193},{"$f":"INDEX(Prop2021DistTar!$D$8:$D$11,D$38)","v":11.8856},{"$f":"INDEX(Prop2021DistTar!$D$8:$D$11,E$38)","v":6.8338000000000001},{"$f":"INDEX(Prop2021DistTar!$D$8:$D$11,F$38)","v":3.7513999999999998}]
[]
[null,"Distribution volumes (actual)",{"$f":"C$40","v":"Fixed"},{"$f":"D$40","v":"Blk1"},"Blk2","Blk3"]
[]
[null,{"$f":"B42","v":"Existing : Tariff V - AGN Central - Residential"},{"$f":"INDEX(Prop2021DistTar!$F$8:$F$11,C$13)","v":205059578},{"$f":"INDEX(Prop2021DistTar!$F$8:$F$11,D$38)","v":4898091.6888095047},{"$f":"INDEX(Prop2021DistTar!$F$8:$F$11,E$38)","v":3062512.152785081},{"$f":"INDEX(Prop2021DistTar!$F$8:$F$11,F$38)","v":18240946.651288182}]
[]
[null,{"$f":"B44","v":"Proposed : Tariff V - AGN Central - Residential"},{"$f":"INDEX(Prop2021DistTar!$F$8:$F$11,C$38)","v":205059578},{"$f":"INDEX(Prop2021DistTar!$F$8:$F$11,D$38)","v":4898091.6888095047},{"$f":"INDEX(Prop2021DistTar!$F$8:$F$11,E$38)","v":3062512.152785081},{"$f":"INDEX(Prop2021DistTar!$F$8:$F$11,F$38)","v":18240946.651288182}]
[]
[null,"Distribution revenue",{"$f":"C$40","v":"Fixed"},"Blk1","Blk2","Blk3"]
[]
[null,{"$f":"B48","v":"Existing : Tariff V - AGN Central - Residential"},{"$f":"INDEX(Prop2021DistTar!$H$8:$H$11,C$39)","v":39597004.511799999},{"$f":"INDEX(Prop2021DistTar!$H$8:$H$11,D$39)","v":58250555.409167036},{"$f":"INDEX(Prop2021DistTar!$H$8:$H$11,E$39)","v":20940845.598313827},{"$f":"INDEX(Prop2021DistTar!$H$8:$H$11,F$39)","v":68472865.539605573}]
[]
[null,{"$f":"B50","v":"Proposed : Tariff V - AGN Central - Residential"},{"$f":"INDEX(Prop2021DistTar!$G$8:$G$11,C$38)","v":39576498.553999998},{"$f":"INDEX(Prop2021DistTar!$G$8:$G$11,D$38)","v":58216758.576514252},{"$f":"INDEX(Prop2021DistTar!$G$8:$G$11,E$38)","v":20928595.549702685},{"$f":"INDEX(Prop2021DistTar!$G$8:$G$11,F$38)","v":68429087.267642483}]
[]
[null,"Revenue","Total"]
[null,{"$f":"B54","v":"Existing : Tariff V - AGN Central - Residential"},{"$f":"SUM(C54:F54)","v":187261271.05888644}]
[null,{"$f":"B56","v":"Proposed : Tariff V - AGN Central - Residential"},{"$f":"SUM(C56:F56)","v":187150939.94785941}]
[]
[null,"Average price movement",{"$f":"IF(C60=0,\"\",C60/C59)","v":0.99941081724799175}]
[]
[null,{"$f":"IF(C62=\"\",\"\",IF(C62<=$C$13,\"REBALANCING CONTROL COMPLIANT\",\"REBALANCING CONTROL BREACHED\"))","v":"REBALANCING CONTROL COMPLIANT"}]
[]
[]
[]
[null,{"$f":"Prop2021DistTar!B19","v":"Tariff V - AGN North - Residential"},1,2,3,4]
[null,null,1,2,3,4]
[null,"Distribution tariff","Fixed","Blk1","Blk2","Blk3"]
[]
[null,{"$f":"\"Existing : \"&Prop2021DistTar!C19","v":"Existing : Tariff V - AGN North - Residential"},{"$f":"INDEX(Prop2021DistTar!$E$21:$E$24,C$39)","v":0.19309999999999999},{"$f":"INDEX(Prop2021DistTar!$E$21:$E$24,D$39)","v":10.4636},{"$f":"INDEX(Prop2021DistTar!$E$21:$E$24,E$39)","v":6.1250999999999998},{"$f":"INDEX(Prop2021DistTar!$E$21:$E$24,F$39)","v":3.3628999999999998}]
[]
[null,{"$f":"\"Proposed : \"&B68","v":"Proposed : Tariff V - AGN North - Residential"},{"$f":"INDEX(Prop2021DistTar!$D$21:$D$24,C$38)","v":0.193},{"$f":"INDEX(Prop2021DistTar!$D$21:$D$24,D$38)","v":10.4575},{"$f":"INDEX(Prop2021DistTar!$D$21:$D$24,E$38)","v":6.1215000000000002},{"$f":"INDEX(Prop2021DistTar!$D$21:$D$24,F$38)","v":3.3609}]
[]
[null,"Distribution volumes (actual)","Fixed","PkBlk1","PkBlk2","PkBlk3"]
[]
[null,{"$f":"B72","v":"Existing : Tariff V - AGN North - Residential"},{"$f":"INDEX(Prop2021DistTar!$F$21:$F$24,C$38)","v":28977377},{"$f":"INDEX(Prop2021DistTar!$F$21:$F$24,D$38)","v":664129.75276136328},{"$f":"INDEX(Prop2021DistTar!$F$21:$F$24,E$38)","v":397382.03996837436},{"$f":"INDEX(Prop2021DistTar!$F$21:$F$24,F$38)","v":2557176.0828654249}]
[]
[null,{"$f":"B74","v":"Proposed : Tariff V - AGN North - Residential"},{"$f":"INDEX(Prop2021DistTar!$F$21:$F$24,C$38)","v":28977377},{"$f":"INDEX(Prop2021DistTar!$F$21:$F$24,D$38)","v":664129.75276136328},{"$f":"INDEX(Prop2021DistTar!$F$21:$F$24,E$38)","v":397382.03996837436},{"$f":"INDEX(Prop2021DistTar!$F$21:$F$24,F$38)","v":2557176.0828654249}]
{"$rows_left_out":375}
{"sheet":"ARS","index":5,"n_rows":14,"n_cols":3,"rows_kept":14,"cut":false,"hidden":false,"merged":[]}
[{"$f":"\"Tariff Approval - \"&'Model update'!B3","v":"Tariff Approval - Aust. Gas Networks (Vic & Albury)"}]
[]
["Ancillary Reference Services (Exc GST)"]
[]
[null,{"$f":"'Model update'!$B$8","v":2020},{"$f":"'Model update'!$B$5","v":2021}]
["Meter and Gas Installation Test ",221,{"$f":"ROUND(B6*(1+'Model update'!$B$30),0)","v":220}]
["Disconnection",73,{"$f":"ROUND(B7*(1+'Model update'!$B$30),0)","v":73}]
["Reconnection",85,{"$f":"ROUND(B8*(1+'Model update'!$B$30),0)","v":85}]
["Meter Removal",104,{"$f":"ROUND(B9*(1+'Model update'!$B$30),0)","v":104}]
["Meter Reinstallation",104,{"$f":"ROUND(B10*(1+'Model update'!$B$30),0)","v":104}]
["Special Meter Read - Metropolitan",9.3000000000000007,{"$f":"ROUND(B11*(1+'Model update'!$B$30),1)","v":9.3000000000000007}]
["Special Meter Read - Non Metropolitan",12.8,{"$f":"ROUND(B12*(1+'Model update'!$B$30),1)","v":12.8}]
[]
[{"$f":"\"Note: \"&'Model update'!$B$5&\" formula is as per AA2018-22, Section 4.4.2, p9 : ART = ARTt-1 * (1+CPI)\"","v":"Note: 2021 formula is as per AA2018-22, Section 4.4.2, p9 : ART = ARTt-1 * (1+CPI)"}]