{"text_format":"1","workbook":"xlsx","n_sheets":17,"sheets":["NOTES","Formulae","6 month formulae","Model update","Metering","Unmetered supply","Metering exit fees","Public lighting","ANS","Prop2021DistTar","2021DistRevCapForm","2021DistTarRebalCont","Est2020DistRev","Prop2021TransTar","2021TransRevCont","Prop2021JSTar","2021JSRevCont"],"not_rendered":{"charts":0,"images":53,"macros":1,"external_links":0,"defined_names":78,"comments":7,"pivot_tables":0},"unopened":[],"bounds":{"document_bytes":16777216,"sheet_cells":100000,"rows_first":2000,"rows_last":500,"rows_between":2000,"halvings":0,"cell_chars":16384,"cell_head_chars":4096},"cells_cut":0,"cells_raw":0,"read":"whole","date_system":"1900"}

{"sheet":"NOTES","index":0,"n_rows":88,"n_cols":4,"rows_kept":88,"cut":false,"hidden":false,"merged":[]}
[]
["The following changes have been made for the tariff approval model to apply to the 2021 6-month extension period"]
[]
["Issue","Location","Item","Comment"]
[]
[1,"'6 month formulae'","Price control formulae","Added formulae to apply to the 6-month extension"]
[]
[{"$f":"A6+1","v":2},"'Prop2020TSSComp'","Comparison to previous year indicative prices","Removed worksheet as no indicative prices for 2021 to compare to"]
[]
[{"$f":"A8+1","v":3},"'Indicative prices for 2021'","Indicative prices for next year","Removed worksheet as no indicative prices required for 2021/22 year"]
[]
[{"$f":"A10+1","v":4},"'JS cost audit template'","t-2 jurisdictional scheme costs","Removed worksheet as no true-up to occur in 6-month extension"]
[null,"'TUOS cost audit template'","t-2 designated pricing proposal charges","Removed worksheet as no true-up to occur in 6-month extension"]
[]
[{"$f":"A12+1","v":5},"'Est2019TransRev'","Calculating t-1 estimates for unders/overs account","Removed worksheet as t-1 estimates not needed in 6-month extension"]
[null,"'Est2019JSRev'","Calculating t-1 estimates for unders/overs account","Removed worksheet as t-1 estimates not needed in 6-month extension"]
[]
[{"$f":"A15+1","v":6},"'Unmetered supply'","Type 7 metering fees","Renamed for relevant year"]
[null,"'Prop2021DistTar'","Proposed 2021 distribution tariffs","Renamed for relevant year"]
[null,"'2021DistRevCapForm'","2021 distribution revenue cap","Renamed for relevant year"]
[null,"'2021DistTarRebalCont'","2021 distribution side constraints","Renamed for relevant year"]
[null,"'Est2020DistRev'","Estimated 2020 distribution revenue","Renamed for relevant year"]
[null,"'Prop2021TransTar'","Proposed 2021 transmission tariffs","Renamed for relevant year"]
[null,"'2021TransRevCont'","2021 transmission revenue cap","Renamed for relevant year"]
[null,"'Prop2021JSTar'","Proposed 2021 jurisdictional scheme tariffs","Renamed for relevant year"]
[null,"'2021JSRevCont'","2021 jurisdictional scheme revenue cap","Renamed for relevant year"]
[]
[{"$f":"A18+1","v":7},"'Model update'!A34:N299","Inputs for control formulae","Removed all 2016–20 inputs for control formulae as not used in 6-month extension"]
[]
[{"$f":"A28+1","v":8},"'Model update'!C5","Regulatory year","Changed to 2021"]
[]
[{"$f":"A30+1","v":9},"'Model update'!A26:F26","CPI data","Expanded CPI data to include 2021"]
[]
[{"$f":"A32+1","v":10},"'Model update'!C3","Business name","Updated for relevant business name"]
[]
[{"$f":"A34+1","v":11},"'Model update'!A34:D36","X-factor for ANS","Added 2021 X-factor for use in escalating ANS price caps"]
[]
[{"$f":"A36+1","v":12},"Metering!H26:I28","Side constraint factors","Removed side constraint factors not applied for 6-month extension. "]
[null,"Metering!I25","CPI","Updated CPI reference to 'Model update' sheet"]
[]
[{"$f":"A38+1","v":13},"Metering!B29:D39","Table 2 - Total annual revenue calculations","Removed calculations for factors not applied in 6-month extension"]
[null,null,"Table 3 - Adjusted annual revenue calculations","Removed calculations for escalations not applied in 6-month extension"]
[]
[{"$f":"A41+1","v":14},"Metering!B44:F89","Table 4 - Metering service recovery arrangements","Removed table as unders/overs not applied in 6-month extension"]
[null,null,"Table 5 - Metering services unders/overs account","Removed table as unders/overs not applied in 6-month extension"]
[null,null,"Calculation of estimated metering revenue for t-1","Removed table as unders/overs not applied in 6-month extension"]
[]
[{"$f":"A44+1","v":15},"Metering!E22:E33","t-1 data for calculating revenue cap","Removed t-1 data as not used for calculating revenue cap for 6-month extension"]
[]
[{"$f":"A48+1","v":16},"Metering!D26","Revenue cap","Formula replaced with revenue directly from 6-month extension PTRM"]
[]
[{"$f":"A50+1","v":17},"'Unmetered supply'!B19:H27","Revenue constraint on unmetered supply","Removed demonstration of revenue constraint as not relevant for 6-month extension"]
[]
[{"$f":"A52+1","v":18},"'Unmetered supply'!C7:E7","t-1 type 7 prices","Updated for 2020 prices"]
[null,"'Unmetered supply'!K7:M7","t-2 type 7 quantities","Updated for 2019 quantities"]
[]
[{"$f":"A54+1","v":19},"'2021DistRevCapForm'!B13:C38","Table 2 - Total annual revenue calculations","Removed calculations for factors not applied in 6-month extension"]
[null,null,"Table 3 - Adjusted annual revenue calculations","Removed calculations for escalations not applied in 6-month extension"]
[null,null,"Table 4 - B factor calculations","Removed calculations for factors not applied in 6-month extension"]
[null,null,"Table 5 - License fee calculations","Removed calculations for factors not applied in 6-month extension"]
[]
[{"$f":"A57+1","v":20},"'2021DistRevCapForm'!B42:E77","Table 6 - DUoS recovery arrangements","Removed table as unders/overs not applied in 6-month extension"]
[null,null,"Table 7 - DUoS unders and overs account","Removed table as unders/overs not applied in 6-month extension"]
[]
[{"$f":"A62+1","v":21},"'2021DistRevCapForm'!H6:H38","t-1 data for calculating revenue cap","Removed t-1 data as not used for calculating revenue cap for 6-month extension"]
[]
[{"$f":"A65+1","v":22},"'2021DistRevCapForm'!C10","Revenue cap","Formula replaced with revenue directly from 6-month extension PTRM"]
[]
[{"$f":"A67+1","v":23},"'2021DistTarRebalCont'!B9:C13","Side constraint factors","Removed side constraint factors not applied for 6-month extension. "]
[null,"'2021DistTarRebalCont'!C8","CPI","Updated CPI reference to 'Model update' sheet"]
[]
[{"$f":"A69+1","v":24},"Est2020DistRev!D6:P54","t-1 prices","Updated t-1 prices for approved 2020 prices"]
[]
[{"$f":"A72+1","v":25},"'2021TransRevCont'!B13:C17","Table 2 - Total DPPC related payments for year t","Removed calculations for factors not applied in 6-month extension"]
[null,"'2021TransRevCont'!C10","Revenue cap","Updated formula to source total costs from Table 3"]
[]
[{"$f":"A74+1","v":26},"'2021TransRevCont'!B29:E66","Table 4 - DPPC recovery arrangements","Removed table as unders/overs not applied in 6-month extension"]
[null,null,"Table 5 - DPPC unders and overs account","Removed table as unders/overs not applied in 6-month extension"]
[]
[{"$f":"A77+1","v":27},"'2021JSRevCont'!B13:C17","Table 2 - Total JSA related payments for year t","Removed calculations for factors not applied in 6-month extension"]
[null,"'2021JSRevCont'!C10","Revenue cap","Updated formula to source total costs from Table 3"]
[]
[{"$f":"A80+1","v":28},"'2021JSRevCont'!B27:E62","Table 4 - JSA recovery arrangements","Removed table as unders/overs not applied in 6-month extension"]
[null,null,"Table 5 - JSA unders and overs account","Removed table as unders/overs not applied in 6-month extension"]
[]
[{"$f":"A83+1","v":29},"'Meteing exit fees'","Worksheet","Added worksheet for calculating ACS price caps"]
[null,"'Public lighting'","Worksheet","Added worksheet for calculating ACS price caps"]
[null,"'ANS'","Worksheet","Added worksheet for calculating ACS price caps"]

{"sheet":"Formulae","index":1,"n_rows":239,"n_cols":11,"rows_kept":239,"cut":false,"hidden":false,"merged":[[83,7,84,7],[113,7,114,7],[139,7,140,7],[220,7,221,7]]}
[]
[null,"DUoS"]
[null,"Figure 14.1 Revenue cap formulae"]
[null,"(1)   ",null,null,null,null,null,"i=1,..,n and j=1,..,m and t=1,..,5"]
[null,"(2)   ",null,null,null,null,null,"t = 1,2,…,5"]
[null,"(3)   ",null,null,null,null,null,"t = 1"]
[null,"(4)   ",null,null,null,null,null,"t = 2,…,5"]
[]
[null,"where;"]
[null,null," is the total annual revenue in year t."]
[null,null,null,"is the price of component 'j' of tariff 'i' in year t."]
[null,null,null,"is the forecast quantity of component 'j' of tariff 'i' in year t."]
[null," ","is the adjusted annual smoothed revenue requirement for year t."]
[null," ",null,"is the annual adjustment f–factor scheme amount in year t. This amount will be calculated as per the method set out in the relevant f–factor scheme."]
[null,null,null,"is the sum of:"]
[null,"·        the final carryover amount from the application of the DMIS from the 2011–15 regulatory control period. This amount will be calculated using the method set out in the DMIS and will be deducted from/added to allowed revenue in the 2017 pricing proposal."]
[null,null,null,"is the sum of:"]
[null,"·        the recovery of license fee charges by the Victorian Essential Services Commission indexed by one and a half years of interest, calculated using the following method:"]
[]
[null,"where:"]
[null,null," are the licence fees paid by DNSP to the Victorian Essential Services Commission in the financial year ending in June of regulatory year t–1,"]
[null,null,"is the approved nominal weighted average cost of capital  (WACC) for the relevant regulatory year using the following method:"]
[]
[]
[null,"·        any under or over recovery of actual revenue collected through DUoS charges in regulatory year t–2 as calculated using the method in appendix A,"]
[null,"·        the AER approved pass through amounts (positive or negative) with respect to regulatory year t."]
[null,null,"is the annual smoothed revenue requirement as stated in the Post Tax Revenue Model (PTRM) for year t (when year t is the first year of the 2016–20 regulatory control period).[43]"]
[null," ","is the s‑factor determined in accordance with the service target performance incentive scheme (STPIS) for regulatory year t.[44]"]
[null,null," is the annual percentage change in the ABS CPI All Groups, Weighted Average of Eight Capital Cities[45] from the June quarter in year t–2 to the June quarter in year t–1, calculated using the following method :"]
[null,"The ABS CPI All Groups, Weighted Average of Eight Capital Cities for the June quarter in regulatory year t–1"]
[null,"divided by"]
[null,"The ABS CPI All Groups, Weighted Average of Eight Capital Cities for the June quarter in regulatory year t–2"]
[null,"minus one."]
[null,"For example, for the 2017 regulatory year, t–2 is June quarter 2015 and t–1 is June quarter 2016 and for the 2018 regulatory year, t–2 is June quarter 2016 and t–1 is June quarter 2017 and so on."]
[null," ","is the X factor for each year of the 2016–20 regulatory control period as determined in the PTRM, and annually revised for the return on debt update in accordance with the formula specified in attachment 3—rate of return—calculated for the relevant year."]
[]
[]
[null,"[43] ","Our final F&A stated that if necessary an adjustment for inflation may be required to the annual smoothed revenue requirement for year t. However, as the annual smoothed revenue requirement for year t as stated in our preliminary decision PTRM is in nominal dollars there is no need to adjust it for inflation. This approach is consistent with past regulatory practice."]
[null,"[44] ","For the first two regulatory years of the 2016–20 regulatory control period, the value of St is to be adjusted to account for the change in revenue requirements between the regulatory control periods, as explained in attachment 11. In the formulas in the STPIS, the AR(t+1) is equivalent to ARt in this formula. Calculations of the S factor adjustment are to be made accordingly."]
[null,"[45] ","If the ABS does not or ceases to publish the index, then CPI will mean an index which the AER considers is the best available alternative index"]
[]
[]
[]
[null,"Figure 14.2 Side constraints [46]"]
[]
[]
[]
[]
[]
[null,null,"where each tariff class has \"n\" tariffs, with each up to \"m\" components, and where:"]
[null,null,null,"is the proposed price for component ‘j’ of tariff 'i' for year t."]
[null,null,"is the price charged for component ‘j’ of tariff 'i' in year t–1."]
[null,null,null,"is the forecast quantity of component ‘j’ of tariff 'i' in year t."]
[null,null," is the annual percentage change in the ABS CPI All Groups, Weighted Average of Eight Capital Cities[4] from the June quarter in year t–2 to the June quarter in year t–1, calculated using the following method :"]
[null,null,"The ABS CPI All Groups, Weighted Average of Eight Capital Cities[47] for the June quarter in regulatory year t–1"]
[null,null,"divided by"]
[null,null,"The ABS CPI All Groups, Weighted Average of Eight Capital Cities for the June quarter in regulatory year t–2"]
[null,null,"minus one."]
[null,"For example, for the 2017 regulatory year, t–2 is June quarter 2015 and t–1 is June quarter 2016 and for the 2018 regulatory year, t–2 is June quarter 2016 and t–1 is June quarter 2017 and so on."]
[null,null,null,"is the X factor for each year of the 2016–20 regulatory control period as determined in the PTRM, and annually revised for the return on debt update in accordance with the formula specified in attachment 3—rate of return—calculated for the relevant year. If X>0, then X will be set equal to zero for the purposes of the side constraint formula."]
[null," ","is the s‑factor determined in accordance with the STPIS for regulatory year t.[5]"]
[null,null,null,"is the annual percentage change from the f–factor scheme amount in year t. This amount will be calculated as per the method set out in attachment 19—f–factor scheme."]
[null,null,null,"is the annual percentage change from the final carryover amount from the application of the DMIS from the 2011–15 regulatory control period. This amount will be calculated using the method set out in the DMIS and will be deducted from/added to allowed revenue in the 2017 pricing proposal."]
[null,null,null,"is annual percentage change from the sum of:"]
[null,"·        the recovery of license fee charges by the Victorian Essential Services Commission indexed by one and a half years of interest, calculated using the following method:"]
[]
[null,"where:"]
[null," are the licence fees paid byDNSP to the Victorian Essential Services Commission in the financial year ending in June of regulatory year t–1,"]
[null," ","is the approved nominal weighted average cost of capital (WACC) for the relevant regulatory year using the following method:"]
[]
[]
[null,"where the "]
[null," is as set out in our final decision PTRM and updated annually"]
[null,"·        the AER approved pass through amounts (positive or negative) with respect to regulatory year t."]
[null,"With the exception of the CPI, X factor and S factor, the percentage for each of the other factors above can be calculated by dividing the incremental revenues (as used in the total annual revenue formula) for each factor by the expected revenues for regulatory year t–1 (based on the prices in year t–1 multiplied by the forecast quantities for year t)."]
[]
[null,"[46] ","All parameters are in nominal terms unless otherwise specified."]
[null,"[47] ","If the ABS does not or ceases to publish the index, then CPI will mean an index which the AER considers is the best available alternative index."]
[]
[]
[]
[]
[null,null,null,null,null,null,null,"Table 14.1","Example calculation of DUoS unders and overs account ($'000, nominal)"]
[null,null,null,null,null,null,null,null,"Year t–2","Year t–1","Year t"]
[null,null,null,null,null,null,null,null,"(actual)","(estimate)","(forecast)"]
[null,null,null,null,null,null,null,"(A) Revenue from DUoS charges","46 779","40 269","39 510"]
[null,null,null,null,null,null,null,"(B) Less TAR for regulatory year =","43 039","41 427","44 429"]
[null,null,null,null,null,null,null,"+ Adjusted annual smoothed revenues (AARt)","40 189","41 393","44 393"]
[null,null,null,null,null,null,null,"+ f–factor scheme amount (It)  ","–12",10,14]
[null,null,null,null,null,null,null,"+ DMIS carryover amount (Tt) ",1013,0,0]
[null,null,null,null,null,null,null,"+ Annual adjustments (Bt)a =","1849",24,22]
[null,null,null,null,null,null,null,"+ License fee recovery",25,24,22]
[null,null,null,null,null,null,null,"+ Approved pass through amounts",1824,0,0]
[]
[null,null,null,null,null,null,null,"(A minus B) Under/over recovery of revenue for regulatory year",3740,"–1158","–4919b"]
[]
[null,null,null,null,null,null,null,"DUoS unders and overs account"]
[null,null,null,null,null,null,null,"Nominal WACC (per cent)",0.05,5.5E-2,0.06]
[null,null,null,null,null,null,null,"Opening balance",1737,"5656c",4778]
[null,null,null,null,null,null,null,"Interest on opening balance",87,311,287]
[null,null,null,null,null,null,null,"Under/over recovery of revenue for regulatory year",3740,"–1158","–4919b"]
[null,null,null,null,null,null,null,"Interest on under/over recovery for regulatory year",92,"–31","–145"]
[null,null,null,null,null,null,null,"Closing balance",5656,4778,"0d"]
[null,null,null,null,null,null,"Notes:","(a) Bt parameter calculations in the DUoS unders and overs account exclude approved DUoS revenue under/over recovery for regulatory year."]
[null,null,null,null,null,null,null,"(b) Approved DUoS revenue under/over recovery for regulatory year t."]
[null,null,null,null,null,null,null,"(c) Opening balance is the previous year's closing balance."]
[null,null,null,null,null,null,null,"(d) The DNSP is expected to achieve a closing balance as close to zero as practicable in its DUoS unders and overs account in each forecast year in its annual pricing proposals in the 2016–20 regulatory control period."]
[]
[]
[]
[]
[]
[null,null,null,null,null,null,null,"Table 14.2","Example calculation of designated pricing proposal charges unders and overs account ($'000, nominal)"]
[null,null,null,null,null,null,null,null,"Year t–2","Year t–1","Year t"]
[null,null,null,null,null,null,null,null,"(actual)","(estimate)","(forecast)"]
[null,null,null,null,null,null,null,"(A) Revenue from designated pricing proposal charges (DPPC)","40 077","34 944","36 609"]
[null,null,null,null,null,null,null,"(B) Less DPPC related payments for regulatory year =","34 365","38 734","39 200"]
[null,null,null,null,null,null,null,"+ DPPC charges to be paid to TNSP","33 672","37 933","38 000"]
[null,null,null,null,null,null,null,"+ Avoided TUoS/DPPC payments",572,734,800]
[null,null,null,null,null,null,null,"+ Inter–distributor payments",121,67,400]
[]
[null,null,null,null,null,null,null,"(A minus B) Under/over recovery of revenue for regulatory year",5712,"–3790","–2540a"]
[]
[null,null,null,null,null,null,null,"DPPC unders and overs account"]
[null,null,null,null,null,null,null,"Nominal WACC (per cent)",0.05,5.5E-2,0.06]
[null,null,null,null,null,null,null,"Opening balance",167,"6028b",2467]
[null,null,null,null,null,null,null,"Interest on opening balance",8,332,148]
[null,null,null,null,null,null,null,"Under/over recovery of revenue for regulatory year",5712,"–3790","–2540a"]
[null,null,null,null,null,null,null,"Interest on under/over recovery for regulatory year",141,"–103","–75"]
[null,null,null,null,null,null,null,"Closing balance",6028,2467,"0c"]
[null,null,null,null,null,null,"Notes:","(a) Approved DPPC revenue under/over recovery for regulatory year t."]
[null,null,null,null,null,null,null,"(b) Opening balance is the previous year's closing balance."]
[null,null,null,null,null,null,null,"(c)The DNSP is expected to achieve a closing balance as close to zero as practicable in its DPPC unders and overs account in each forecast year in its annual pricing proposals in the 2016–20 regulatory control period."]
[]
[]
[]
[]
[]
[null,null,null,null,null,null,null,"Table 14.3 Example calculation of jurisdictional scheme amounts unders and overs account ($'000, nominal)"]
[null,null,null,null,null,null,null,null,"Year t–2","Year t–1","Year t"]
[null,null,null,null,null,null,null,null,"(actual)","(estimate)","(forecast)"]
[null,null,null,null,null,null,null,"(A) Revenue from jurisdictional schemes","19 777","23 121","26 965"]
[null,null,null,null,null,null,null,"(B) Less jurisdictional scheme payments for regulatory year =","20 272","20 959","28 641"]
[null,null,null,null,null,null,null,"+ Jurisdictional scheme 1 payments","14 159","13 954","13 961"]
[null,null,null,null,null,null,null,"+ Jurisdictional scheme 2 payments","6113",7005,"14 680"]
[]
[null,null,null,null,null,null,null,"(A minus B) Under/over recovery of revenue for regulatory year","–495",2162,"–1676a"]
[]
[null,null,null,null,null,null,null,"Jurisdictional scheme amount unders and overs account"]
[null,null,null,null,null,null,null,"Nominal WACC (per cent)",0.05,5.5E-2,0.06]
[null,null,null,null,null,null,null,"Opening balance","–52","–562b",1628]
[null,null,null,null,null,null,null,"Interest on opening balance","–3","–31",98]
[null,null,null,null,null,null,null,"Under/over recovery of revenue for regulatory year","–495",2162,"–1676a"]
[null,null,null,null,null,null,null,"Interest on under/over recovery for regulatory year","–12",59,"–50"]
[null,null,null,null,null,null,null,"Closing balance","–562",1628,"0c"]
[null,null,null,null,null,null,"Notes:","(a) Approved jurisdictional scheme amounts revenue under/over recovery for regulatory year t."]
[null,null,null,null,null,null,null,"(b) Opening balance is the previous year's closing balance."]
[null,null,null,null,null,null,null,"(c) The DNSP is expected to achieve a closing balance as close to zero as practicable in its jurisdictional scheme amount unders and overs account in each forecast year in its annual pricing proposals in the 2016–20 regulatory control period."]
[]
[]
[]
[]
[]
[]
[]
[null,"Metering"]
[null,"Figure 16.3","Annual metering charges revenue cap formula"]
["(1)   ",null,null,null,null,null,null,"i=1,..,n and j=1,..,m and t=1,..,5"]
[]
["(2)   ",null,null,null,null,null,null,"t = 1,2,…,5"]
[]
["(3)   ",null,null,null,null,null,null,"t = 1,2,…,5"]
[]
[]
[null,"where;"]
[null," ","is the total annual revenue for annual metering charges in year t."]
[null,null,null,null,"is the price of component 'j' of metering service 'i' in year t."]
[null,null,null,null,"is the forecast quantity of component 'j' of metering service 'i' in year t."]
[null,null,null,"is the annual revenue requirement for year t. When year t is the first year of the 2016–20 regulatory control period,"]
[null,null,null," is the annual revenue requirement in the annual metering charges Post Tax Revenue Model (PTRM) for year t."]
[null,null,null,null,"is equal to zero for all years except 2017 and is a once off adjustment to 2017 charges for the unders and overs recoveries relating to Advanced Metering Infrastructure actual revenues and actual costs incurred in 2014 and 2015."]
[null,null,null,null,"is the sum of annual adjustment factors in year t as calculated in the unders and overs account in appendix C."]
[]
[null,null,null,"is the annual revenue requirement for year t–1."]
[null," ","is the annual percentage change in the ABS CPI All Groups, Weighted Average of Eight Capital Cities[39] from the June quarter in year t–2 to the June quarter in year t–1, calculated using the following method:"]
[null,"The ABS CPI All Groups, Weighted Average of Eight Capital Cities for the June quarter in regulatory year t–1"]
[null,"divided by"]
[null,"The ABS CPI All Groups, Weighted Average of Eight Capital Cities for the June quarter in regulatory year t–2"]
[null,"minus one."]
[null,"For example, for the 2017 regulatory year, t–2 is June quarter 2015 and t–1 is June quarter 2016 and for the 2018 regulatory year, t–2 is June quarter 2016 and t–1 is June quarter 2017 and so on."]
[null," ",null,"is the X factor for each year of the 2016–20 regulatory control period as determined in the annual metering charges PTRM."]
[]
[]
[null,"[39] ","If the ABS does not or ceases to publish the index, then CPI will mean an index which the AER considers is the best available alternative index"]
[]
[]
[]
[]
[null,"Figure 16.4 Side constraints"]
[]
[null,"where:"]
[null,null,null,null,"is the price of annual metering charges service 'i' in year t."]
[null,null,null,"is the price of annual metering charges service 'i' in year t–1."]
[null," ","is the annual percentage change in the ABS CPI All Groups, Weighted Average of Eight Capital Cities from the June quarter in year t–2 to the June quarter in year t–1, calculated using the following method:"]
[null,"The ABS CPI All Groups, Weighted Average of Eight Capital Cities[40] for the June quarter in regulatory year t–1"]
[null,"divided by"]
[null,"The ABS CPI All Groups, Weighted Average of Eight Capital Cities for the June quarter in regulatory year t–2"]
[null,"minus one."]
[null,"For example, for the 2017 regulatory year, t–2 is June quarter 2015 and t–1 is June quarter 2016 and for the 2018 regulatory year, t–2 is June quarter 2016 and t–1 is June quarter 2017 and so on."]
[null," ",null,"is the X factor for each year of the 2016–20 regulatory control period as determined in the annual metering charges PTRM."]
[null,null,null,null,"is the annual percentage change for the unders and overs recoveries relating to Advanced Metering Infrastructure actual revenues and actual costs incurred in 2014 and 2015. It is equal to zero for all years except 2017 and is a once off adjustment to 2017 charges."]
[null,null,null,null,"is the annual percentage change from the sum of annual adjustment factors in year t as calculated in the unders and overs account in appendix C."]
[null,"With the exception of the CPI and the X factor, the percentage for each of the other factors above can be calculated by dividing the incremental revenues (as used in the total annual revenue formula) for each factor by the expected revenues for regulatory year t–1 (based on the prices in year t–1 multiplied by the forecast quantities for year t)."]
[]
[null,"[40] ","If the ABS does not or ceases to publish the index, then CPI will mean an index which the AER considers is the best available alternative index."]
[]
[]
[]
[]
[null,null,null,null,null,null,null,"Table 16.xx","Example calculation of annual metering charges unders and overs account ($'000, nominal)"]
[null,null,null,null,null,null,null,null,"Year t–2","Year t–1","Year t"]
[null,null,null,null,null,null,null,null,"(actual)","(estimate)","(forecast)"]
[null,null,null,null,null,null,null,"(A) Revenue from annual metering charges","8 449","7 389","6 460"]
[null,null,null,null,null,null,null,"(B) Less TARM for regulatory year =","7 366","7 422","7 573"]
[null,null,null,null,null,null,null,"+ Annual revenue requirement (ARt)","7 349","7 412","7 559"]
[null,null,null,null,null,null,null,"+ T factor (Tt) – true‑ups relating to the AMI–Order in Council  ","17",10,14]
[]
[null,null,null,null,null,null,null,"(A minus B) Under/over recovery of revenue for regulatory year","1 083","–33","–1 113a"]
[]
[null,null,null,null,null,null,null,"Annual metering charges unders and overs account"]
[null,null,null,null,null,null,null,"Nominal WACC (per cent)",0.05,5.5E-2,0.06]
[null,null,null,null,null,null,null,"Opening balance","–50","1 057b","1 081"]
[null,null,null,null,null,null,null,"Interest on opening balance","–3",58,65]
[null,null,null,null,null,null,null,"Under/over recovery of revenue for regulatory year","1 083","–33","–1 113b"]
[null,null,null,null,null,null,null,"Interest on under/over recovery for regulatory year",27,"–1","–33"]
[null,null,null,null,null,null,null,"Closing balance","1 057","1 081","0c"]
[null,null,null,null,null,null,"Notes:","(a) Approved annual metering charges revenue under/over recovery for regulatory year t. This is the Bt parameter in the annual metering charges revenue cap formula."]
[null,null,null,null,null,null,null,"(b) Opening balance is the previous year's closing balance."]
[null,null,null,null,null,null,null,"(c) The DNSP is expected to achieve a closing balance as close to zero as practicable in its annual metering charges unders and overs account in each forecast year in its annual pricing proposals in the 2016–20 regulatory control period."]

{"sheet":"6 month formulae","index":2,"n_rows":39,"n_cols":9,"rows_kept":39,"cut":false,"hidden":false,"merged":[]}
[]
[]
[]
[null,null,null,null,null,null,null,"The revenue cap to be applies to standard control services will be as set in the amended PTRM, with no other factors applied.*"]
[null,null,null,null,null,null,null,null,"* AER currently considering AusNet's proposal to apply a cost pass-through for the 2019/20 bushfire season. "]
[null,null,null,null,null,null,null,null,"If required, the AER would amend the standard control services revenue cap control mechanism formula (i.e. TAR=AR+C). "]
[]
[]
[]
[null,null,null,null,null,null,null,"The revenue cap to be applied to revenue-capped type 5 and 6 (inc. smart metering) services will be as set in the amended metering PTRM, with no other factors applied."]
[]
[]
[]
[]
[]
[null,null,null,null,null,null,null,"The side constraint mechanism to apply to standard control services and metering services will be just CPI and the 2% allowance as there is no X-factor to apply, and no other adjustments need to be discounted from the permissable percentage.*"]
[null,null,null,null,null,null,null,null,"* AER currently considering AusNet's proposal to apply a cost pass-through for the 2019/20 bushfire season."]
[null,null,null,null,null,null,null,null,"If required, the AER would amend the side constraints formula to remove the CPI movement from the price movements. (i.e. permissable percentage = (1+change in CPI)x(1+2%)+change in C)"]
[]
[null,null,null,null,null,null,null,null,"NB - no adjustment to be made to make 12 month and 6 month period comparable"]
[]
[]
[]
[]
[null,null,null,null,null,null,null,"The price cap to be applied to type 7 metering services will be escalated for CPI"]
[]
[]
[]
[null,null,null,null,null,null,null,"The price cap to apply to ancillary network services will be escalated for CPI and x-factor."]
[null,null,null,null,null,null,null,"X-factor to apply will reflect updated labour escalation forecast for the extended period in line with the calculation of the 2021–26 draft decision, being half of the forecast yearly change in the State utilities sector real wages for Vic in 21/22."]
[]
[]
[null,null,null,null,null,null,null,"The price cap to apply to metering exit fees and public lighting services will not be escalated."]
[]
[]
[]
[]
[]
[null,null,null,null,null,null,null,"CPI definition to remain as per the 2015–20 determination."]

{"sheet":"Model update","index":3,"n_rows":35,"n_cols":6,"rows_kept":35,"cut":false,"hidden":false,"merged":[]}
[]
[]
["Tariff Approval Template for ",null,"AusNet Services"]
[]
["calendar year commencing",null,2021]
[]
["t","=",{"$f":"C5","v":2021}]
["t-1","=",{"$f":"C7-1","v":2020}]
["t-2","=",2019]
["t-3","=",2018]
["t-4","=",2017]
[]
["Please fill in yellow highlighted cells where appropriate"]
[]
["CPI","The ABS changed the index reference base in September 2012 from 1989-90 to 2011-12."]
["CPI Index Sept 2011",null,99.8]
["CPI Index Sept 2012",null,101.8,null,"CPI 2013",{"$f":"C17/C16-1","v":2.0040080160320661E-2}]
["CPI Index Sept 2013",null,104,null,"CPI 2014",{"$f":"C18/C17-1","v":2.16110019646365E-2}]
["CPI Index Sept 2014",null,106.4,null,"CPI 2015",{"$f":"C19/C18-1","v":2.3076923076923217E-2}]
["CPI Index Sept 2015",null,108,null,"CPI 2016",{"$f":"C20/C19-1","v":1.5037593984962294E-2}]
["CPI Index June 2015",null,107.5]
["CPI Index June 2016",null,108.6,null,"CPI 2017",{"$f":"IF(OR(C21=\"\",C22=\"\"),0,C22/C21-1)","v":1.0232558139534831E-2}]
["CPI Index June 2017",null,110.7,null,"CPI 2018",{"$f":"IF(OR(C22=\"\",C23=\"\"),0,C23/C22-1)","v":1.9337016574585641E-2}]
["CPI Index June 2018",null,113,null,"CPI 2019",2.0776874435411097E-2]
["CPI Index June 2019",null,114.8,null,"CPI 2020",1.5929203539823078E-2]
["CPI Index June 2020",null,114.4,null,"CPI 2021",{"$f":"IF(OR(C25=\"\",C26=\"\"),0,C26/C25-1)","v":-3.4843205574912606E-3}]
[]
[{"$f":"\"CPI \" &$C$9","v":"CPI 2019"},null,{"$f":"VLOOKUP(A28,E$17:F$25,2,FALSE)","v":2.0776874435411097E-2},"(t-2)"]
[{"$f":"\"CPI \" &$C$8","v":"CPI 2020"},null,{"$f":"VLOOKUP(A29,E$17:F$25,2,FALSE)","v":1.5929203539823078E-2},"(t-1)"]
[{"$f":"\"CPI \" &$C$5","v":"CPI 2021"},null,{"$f":"VLOOKUP(A30,E$17:F$26,2,FALSE)","v":-3.4843205574912606E-3},"(t)"]
[]
[]
[]
[]
["2021 X-factor for ANS",null,-1.1926767169156999E-3]

{"sheet":"Metering","index":4,"n_rows":30,"n_cols":12,"rows_kept":30,"cut":false,"hidden":false,"merged":[[23,7,23,8]]}
[null,{"$f":"\"Tariff Approval - \"&'Model update'!C3","v":"Tariff Approval - AusNet Services"}]
[]
[null,{"$f":"\"PROPOSED \"&'Model update'!$C$5&\" METERING TARIFFS AND REVENUE\"","v":"PROPOSED 2021 METERING TARIFFS AND REVENUE"}]
[]
[null,null,null,{"$f":"\"Proposed Metering Tariffs P(t) for \" &'Model update'!$C$5","v":"Proposed Metering Tariffs P(t) for 2021"},{"$f":"\"Current Metering Tariffs P(t-1) for\" &'Model update'!$C$8","v":"Current Metering Tariffs P(t-1) for2020"},{"$f":"\"Forecast Quantities   (Qt) for \"&'Model update'!$C$5","v":"Forecast Quantities   (Qt) for 2021"},null,{"$f":"\"Forecast Revenue (Pt \"&'Model update'!$C$5&\")*(Qt \" &'Model update'!$C$5&\")\"","v":"Forecast Revenue (Pt 2021)*(Qt 2021)"},{"$f":"\"Revenue                    (Pt-1 \"&'Model update'!$C$8&\")*(Qt \" &'Model update'!$C$5&\")\"","v":"Revenue                    (Pt-1 2020)*(Qt 2021)"},null,"Movement","Side Constraint"]
[null,"Proposed tariff","Existing tariff","PropTar\n$/Cust/year","ExistTar\n$/Cust/year","FcastVol\nCust #",null,"PropRev\nFixed","ExistRev\nFixed"]
[]
[null,"Single phase single element ","Single phase single element ",29.799999999999997,51.4,415727,null,{"$f":"D8*F8","v":12388664.6},{"$f":"E8*F8","v":21368367.800000001},null,{"$f":"IFERROR(H8/I8,\"\")","v":0.57976653696498048},{"$f":"IF(B8=\"\",\"\",IF(K8<$I$30,\"COMPLIANT\",\"BREACHED\"))","v":"COMPLIANT"}]
[null,"Single phase, two element with contactor","Single phase, two element with contactor",35.049999999999997,60.6,224372.25,null,7864247.3624999998,13596958.35,null,{"$f":"IFERROR(H9/I9,\"\")","v":0.57838283828382842},"COMPLIANT"]
[null,"Multiphase ","Multiphase ",42.22,73,68612,null,2896798.64,5008676,null,0.57835616438356163,"COMPLIANT"]
[null,"Multiphase, direct connected with contactor","Multiphase, direct connected with contactor",46.824999999999996,80.849999999999994,67887.25,null,3178820.4812499997,5488684.1624999996,null,0.57915893630179338,"COMPLIANT"]
[null,"Multiphase Current Transformer connected","Multiphase Current Transformer connected",60.174999999999997,103.95,4581.5,null,275691.76250000001,476246.92499999999,null,0.57888407888407889,"COMPLIANT"]
[null,null,null,null,null,null,null,0,0,null,"",""]
[null,null,null,null,null,null,null,0,0,null,"",""]
[null,null,null,null,null,null,null,0,0,null,"",""]
[null,null,null,null,null,null,null,0,0,null,"",""]
[null,null,null,null,null,null,null,{"$f":"SUM(H7:H16)","v":26604222.846249998},{"$f":"SUM(I7:I16)","v":45938933.237499997}]
[]
[]
[]
[]
[null,"Year (t)",null,{"$f":"'Model update'!C5","v":2021}]
[]
[null,"Table 1- Compliance with AER Final Determination Total Metering Annual Revenue",null,null,null,null,null,"Metering tariff rebalancing control"]
[null,"Revenue from  Metering charges for year t",null,{"$f":"H17","v":26604222.846249998},null,null,null,{"$f":"\"CPI \"&'Model update'!$C$5","v":"CPI 2021"},{"$f":"'Model update'!C30","v":-3.4843205574912606E-3}]
[null,"Total Annual Metering Revenue for year t",null,26605535.858153801]
[null,null,null,{"$f":"IF(D25=\"\",\"\",IF(D26>=D25,\"METERING REVENUE CAP FORMULA COMPLIANT\",\"METERING REVENUE CAP FORMULA BREACHED\"))","v":"METERING REVENUE CAP FORMULA COMPLIANT"}]
[]
[]
[null,null,null,null,null,null,null,null,{"$f":"(1+I25)*(1-I26)*(1+0.02)+SUM(I27:I28)","v":1.016445993031359}]

{"sheet":"Unmetered supply","index":5,"n_rows":14,"n_cols":23,"rows_kept":14,"cut":false,"hidden":false,"merged":[[3,19,3,21]]}
[null,{"$f":"\"Tariff Approval - \" &'Model update'!C3","v":"Tariff Approval - AusNet Services"}]
[]
[null,{"$f":"\"PROPOSED \"&'Model update'!C5&\" UNMETERED SUPPLY TARIFF\"","v":"PROPOSED 2021 UNMETERED SUPPLY TARIFF"}]
[null,null,{"$f":"\"P t-1 (\"&'Model update'!$C$8&\")\"","v":"P t-1 (2020)"},null,null,null,{"$f":"\"Pt (\"&'Model update'!$C$7&\")\"","v":"Pt (2021)"},null,null,null,{"$f":"\"Qt-2 (\"&'Model update'!$C$9&\")\"","v":"Qt-2 (2019)"},null,null,null,"P t-1 * Qt-2",null,null,null,null,"Pt * Qt-2"]
[null,null,"($) per NMI","($) per meter","($) per light",null,"($) per NMI","($) per meter","($) per light",null,"NMIs","Meters","Lights",null,"$ Comp1","$ Comp2","$ Comp3","Total $",null,"NMIs","Meters","Lights"]
[null,"Proposed tariff","ExistTarComp1","ExistTarComp2","ExistTarComp3",null,"PropTarComp1","PropTarComp2","PropTarComp3",null,"ActVolComp1","ActVolComp2","ActVolComp3",null,"$Comp1","ExistRevComp2","ExistRevComp3","Exist Rev Total",null,"$PropRevComp1","$PropRevComp2","$ PropRevComp3","Total $"]
[null,"metering data services - unmetered supplies",327.79999999999995,0,1.7197,null,{"$f":"ROUNDDOWN(C7*(1+$C$14),1)","v":326.60000000000002},null,{"$f":"ROUNDDOWN(E7*(1+$C$14),4)","v":1.7137},null,88,0,178359,null,{"$f":"IF($B7=\"\",\"\",C7*K7)","v":28846.399999999994},{"$f":"IF($B7=\"\",\"\",D7*L7)","v":0},{"$f":"IF($B7=\"\",\"\",E7*M7)","v":306723.97230000002},{"$f":"SUM(O7:Q7)","v":335570.37230000005},null,{"$f":"IF($B7=\"\",\"\",G7*K7)","v":28740.800000000003},{"$f":"IF($B7=\"\",\"\",H7*L7)","v":0},{"$f":"IF($B7=\"\",\"\",I7*M7)","v":305653.81829999998},{"$f":"SUM(T7:V7)","v":334394.61829999997}]
[]
[]
[null,"UNMETERED SUPPLY TARIFF CONTROL"]
[]
[null,"CPI"]
[]
[null,{"$f":"\"CPI \"&'Model update'!C5","v":"CPI 2021"},{"$f":"'Model update'!C30","v":-3.4843205574912606E-3}]

{"sheet":"Metering exit fees","index":6,"n_rows":10,"n_cols":6,"rows_kept":10,"cut":false,"hidden":false,"merged":[]}
[null,{"$f":"\"Tariff Approval - \"&'Model update'!C3","v":"Tariff Approval - AusNet Services"}]
[]
[null,"Proposed metering exit fees"]
[]
[null,"Metering type","2020 price cap","2021 price cap","Proposed 2021 price"]
[null,"Single Phase Single Element",364.17,{"$f":"IF(C6=\"\",\"\",C6)","v":364.17},{"$f":"D6","v":364.17},{"$f":"IF(E6=\"\",\"\",IF(E6<=D6,\"COMPLIANT\",\"BREACHED\"))","v":"COMPLIANT"}]
[null,"Single Phase Two Element with Contactor",359.43,{"$f":"IF(C7=\"\",\"\",C7)","v":359.43},{"$f":"D7","v":359.43},{"$f":"IF(E7=\"\",\"\",IF(E7<=D7,\"COMPLIANT\",\"BREACHED\"))","v":"COMPLIANT"}]
[null,"Multiphase",363.24,363.24,363.24,"COMPLIANT"]
[null,"Multiphase with Contactor",458.84,458.84,458.84,"COMPLIANT"]
[null,"Multiphase CT Connected",545.23,545.23,545.23,"COMPLIANT"]

{"sheet":"Public lighting","index":7,"n_rows":50,"n_cols":6,"rows_kept":50,"cut":false,"hidden":false,"merged":[]}
[null,{"$f":"\"Tariff Approval - \"&'Model update'!C3","v":"Tariff Approval - AusNet Services"}]
[]
[null,"Proposed public lighting prices"]
[]
[null,"Public lighting tariff","2020 price cap","2021 price cap","Proposed 2021 price"]
[null,"CENTRAL"]
[null,"Existing Lights"]
[null,"Mercury Vapour 80W",43.96935101818675,{"$f":"IF(C8=\"\",\"\",C8/2)","v":21.984675509093375},{"$f":"D8","v":21.984675509093375},{"$f":"IF(E8=\"\",\"\",IF(E8<=D8,\"COMPLIANT\",\"BREACHED\"))","v":"COMPLIANT"}]
[null,"HP Sodium 150W",104.07269928239174,{"$f":"IF(C9=\"\",\"\",C9/2)","v":52.036349641195869},52.036349641195869,"COMPLIANT"]
[null,"HP Sodium 250W",105.1157129651145,52.557856482557249,52.557856482557249,"COMPLIANT"]
[null,"Mercury Vapour 50W",67.273107057825726,33.636553528912863,33.636553528912863,"COMPLIANT"]
[null,"Mercury Vapour 125W",64.634945996734515,32.317472998367258,32.317472998367258,"COMPLIANT"]
[null,"Mercury Vapour 250W",110.37149861337022,55.185749306685111,55.185749306685111,"COMPLIANT"]
[null,"Mercury Vapour 400W",114.57612713197481,57.288063565987407,57.288063565987407,"COMPLIANT"]
[null,"HP Sodium 100W",111.35778823215917,55.678894116079583,55.678894116079583,"COMPLIANT"]
[null,"HP Sodium 400W",149.26431241046257,74.632156205231283,74.632156205231283,"COMPLIANT"]
[null,"Metal Halide 70W",191.93086376898509,95.965431884492546,95.965431884492546,"COMPLIANT"]
[null,"Metal Halide 100W",248.49324839598376,124.24662419799188,124.24662419799188,"COMPLIANT"]
[null,"Metal Halide 150W",282.30623175145593,141.15311587572796,141.15311587572796,"COMPLIANT"]
[null,"HP Sodium 50W",46.140117843777524,23.070058921888762,23.070058921888762,"COMPLIANT"]
[null,"Energy Efficient Lights",null,""]
[null,"T5 2X14W",35.59721943958418,17.79860971979209,17.79860971979209,"COMPLIANT"]
[null,"T5 2X24W",42.078697462460738,21.039348731230369,21.039348731230369,"COMPLIANT"]
[null,"LED 18W",16.274342400881643,8.1371712004408217,8.1371712004408217,"COMPLIANT"]
[null,"Compact Fluorescent 32W",31.594465400888279,15.797232700444139,15.797232700444139,"COMPLIANT"]
[null,"Compact Fluorescent 42W",31.594465400888279,15.797232700444139,15.797232700444139,"COMPLIANT"]
[null,null,null,""]
[null,"NORTH & EAST",null,""]
[null,"Existing Lights",null,""]
[null,"Mercury Vapour 80W",49.953864979092039,24.976932489546019,24.976932489546019,"COMPLIANT"]
[null,"HP Sodium 150W",118.40137291964557,59.200686459822784,59.200686459822784,"COMPLIANT"]
[null,"HP Sodium 250W",117.12120562613501,58.560602813067504,58.560602813067504,"COMPLIANT"]
[null,"Mercury Vapour 50W",73.93172016905622,36.96586008452811,36.96586008452811,"COMPLIANT"]
[null,"Mercury Vapour 125W",73.93172016905622,36.96586008452811,36.96586008452811,"COMPLIANT"]
[null,"Mercury Vapour 250W",121.80605385118041,60.903026925590204,60.903026925590204,"COMPLIANT"]
[null,"Mercury Vapour 400W",125.31969001996447,62.659845009982234,62.659845009982234,"COMPLIANT"]
[null,"HP Sodium 100W",126.68946902402077,63.344734512010383,63.344734512010383,"COMPLIANT"]
[null,"HP Sodium 400W",166.31211198911171,83.156055994555857,83.156055994555857,"COMPLIANT"]
[null,"Metal Halide 70W",190.04658382890756,95.023291914453779,95.023291914453779,"COMPLIANT"]
[null,"Metal Halide 100W",250.7799225091573,125.38996125457865,125.38996125457865,"COMPLIANT"]
[null,"Metal Halide 150W",284.90861121842318,142.45430560921159,142.45430560921159,"COMPLIANT"]
[null,"HP Sodium 50W",53.840604055688971,26.920302027844485,26.920302027844485,"COMPLIANT"]
[null,"Energy Efficient Lights",null,""]
[null,"T5 2X14W",40.602104487884766,20.301052243942383,20.301052243942383,"COMPLIANT"]
[null,"T5 2X24W",47.912616560528271,23.956308280264135,23.956308280264135,"COMPLIANT"]
[null,"LED 18W",16.737416365905293,8.3687081829526466,8.3687081829526466,"COMPLIANT"]
[null,"Compact Fluorescent 32W",36.129521926980956,18.064760963490478,18.064760963490478,"COMPLIANT"]
[null,"Compact Fluorescent 42W",36.129521926980956,18.064760963490478,18.064760963490478,"COMPLIANT"]
[null,null,null,{"$f":"IF(C49=\"\",\"\",ROUND(C49,2))","v":""},"",""]
[null,null,null,"","",""]

{"sheet":"ANS","index":8,"n_rows":99,"n_cols":13,"rows_kept":99,"cut":false,"hidden":false,"merged":[[4,11,4,12]]}
[null,{"$f":"\"Tariff Approval - \"&'Model update'!C3","v":"Tariff Approval - AusNet Services"}]
[]
[null,"Proposed ancillary network service prices"]
[]
[null,"Ancillary network service","B2B Code","Code","AH/NH","2020 price cap","2021 price cap","Proposed 2021 price",null,null,null,"Escalators"]
[null,"Field officer visits",null,null,null,null,null,null,null,null,null,"CPI",{"$f":"'Model update'!C30","v":-3.4843205574912606E-3}]
[null,"Field officer visits—BH",20600,"020600",0,20.04,{"$f":"IF(F7=\"\",\"\",F7*(1+$M$6)*(1-$M$7))","v":19.993992177848082},{"$f":"G7","v":19.993992177848082},{"$f":"IF(H7=\"\",\"\",IF(H7<=G7,\"COMPLIANT\",\"BREACHED\"))","v":"COMPLIANT"},null,null,"X-factor",{"$f":"'Model update'!C35","v":-1.1926767169156999E-3}]
[null,"Field officer visits—AH","020600AH","020600",1,360.98,{"$f":"IF(F8=\"\",\"\",F8*(1+$M$6)*(1-$M$7))","v":360.15126229339324},360.15126229339324,"COMPLIANT"]
[null,"Remote Re-energisation - Any Time","020710","020710",0,6.85,6.8342737733662355,6.8342737733662355,"COMPLIANT"]
[null,"Remote De-energisation - Any Time","020720","020720",0,6.85,6.8342737733662355,6.8342737733662355,"COMPLIANT"]
[null,"Remote Meter Re-configuration","020800","020800",0,30.56,30.48984036701783,30.48984036701783,"COMPLIANT"]
[null,"Remote Special Read","020900","020900",0,1.46,1.456648132717475,1.456648132717475,"COMPLIANT"]
[null,"Routine new connections — AusNet Services responsible for metering, customers<100amps",null,null,null,null,""]
[null,"Single Ø Overhead—BH","010107","010107",0,432.93,431.936079518751,431.936079518751,"COMPLIANT"]
[null,"Single Ø Overhead—AH","010107AH","010107",1,522.07000000000005,520.87143195055637,520.87143195055637,"COMPLIANT"]
[null,"Install 95mm overhead service from LVABC - BH","010125","010125",0,713.48,711.84199296661927,711.84199296661927,"COMPLIANT"]
[null,"Install 95mm overhead service from LVABC - AH","010125AH","010125",1,893.79,891.73803735722731,891.73803735722731,{"$f":"IF(H17=\"\",\"\",IF(H17<=G17,\"COMPLIANT\",\"BREACHED\"))","v":"COMPLIANT"}]
[null,"Single Ø Underground—BH","010109","010109",0,224.85,224.33378948049605,224.33378948049605,{"$f":"IF(H18=\"\",\"\",IF(H18<=G18,\"COMPLIANT\",\"BREACHED\"))","v":"COMPLIANT"}]
[null,"Single Ø Underground—AH","010109AH","010109",1,287.60000000000002,286.9397280613328,286.9397280613328,"COMPLIANT"]
[null,"Multi Ø Overhead—Direct Connected Meter—BH","010111","010111",0,462.7,461.63773356738056,461.63773356738056,"COMPLIANT"]
[null,"Multi Ø Overhead—Direct Connected Meter—AH","010111AH","010111",1,557.97,556.68901274819837,556.68901274819837,"COMPLIANT"]
[null,"Multi Ø Overhead—CT Connected Meter—BH","010112","010112",0,621.20000000000005,619.77384934527095,619.77384934527095,"COMPLIANT"]
[null,"Multi Ø Overhead—CT ConnectedMeter—AH","010112AH","010112",1,749.12,747.40017067213341,747.40017067213341,"COMPLIANT"]
[null,"Multi Ø Underground—Direct Connected Meter—BH","010113","010113",0,336.47,335.69753233934853,335.69753233934853,"COMPLIANT"]
[null,"Multi Ø Underground—Direct Connected Meter—aH","010113AH","010113",1,416.72,415.76329442878506,415.76329442878506,"COMPLIANT"]
[null,"Multi Ø Underground—CT Connected Meter—BH","010114","010114",0,485.45,484.33550412856044,484.33550412856044,"COMPLIANT"]
[null,"Multi Ø Underground—CT ConnectedMeter—AH","010114AH","010114",1,601.23,599.84969646145714,599.84969646145714,"COMPLIANT"]
[null,"Temporary Overhead Supply—Coincident Disconnection (Truck visit)—BH","010115","010115",0,364.27,363.43370911301002,363.43370911301002,"COMPLIANT"]
[null,"Temporary Overhead Supply—Coincident Disconnection (Truck visit)—AH","010115AH","010115",1,462.65,461.58784835735605,461.58784835735605,"COMPLIANT"]
[null,"Routine new connections — AusNet Services not responsible for metering, customers<100amps",null,null,null,null,""]
[null,"Single Ø Overhead—BH","010116","010116",0,432.93,431.936079518751,431.936079518751,"COMPLIANT"]
[null,"Single Ø Overhead—AH","010116AH","010116",1,522.07000000000005,520.87143195055637,520.87143195055637,"COMPLIANT"]
[null,"Install 95mm overhead service from LVABC - BH","010126","010126",0,713.48,711.84199296661927,711.84199296661927,"COMPLIANT"]
[null,"Install 95mm overhead service from LVABC - AH","010126AH","010126",1,893.79,891.73803735722731,891.73803735722731,"COMPLIANT"]
[null,"Single Ø Underground—BH","010118","010118",0,224.85,224.33378948049605,224.33378948049605,"COMPLIANT"]
[null,"Single Ø Underground—AH","010118AH","010118",1,287.60000000000002,286.9397280613328,286.9397280613328,"COMPLIANT"]
[null,"Multi Ø Overhead—Direct Connected Meter—BH","010120","010120",0,462.7,461.63773356738056,461.63773356738056,"COMPLIANT"]
[null,"Multi Ø Overhead—Direct Connected Meter—AH","010120AH","010120",1,557.97,556.68901274819837,556.68901274819837,"COMPLIANT"]
[null,"Multi Ø Overhead—CT Connected Meter—BH","010121","010121",0,621.20000000000005,619.77384934527095,619.77384934527095,"COMPLIANT"]
[null,"Multi Ø Overhead—CT ConnectedMeter—AH","010121AH","010121",1,749.12,747.40017067213341,747.40017067213341,"COMPLIANT"]
[null,"Multi Ø Underground—Direct Connected Meter—BH","010122","010122",0,336.47,335.69753233934853,335.69753233934853,"COMPLIANT"]
[null,"Multi Ø Underground—Direct Connected Meter—AH","010122AH","010122",1,416.72,415.76329442878506,415.76329442878506,"COMPLIANT"]
[null,"Multi Ø Underground—CT Connected Meter—BH","010123","010123",0,485.45,484.33550412856044,484.33550412856044,"COMPLIANT"]
[null,"Multi Ø Underground—CT ConnectedMeter—AH","010123AH","010123",1,601.23,599.84969646145714,599.84969646145714,"COMPLIANT"]
[null,"Temporary Overhead Supply—Coincident Disconnection (Truck visit)—BH","010124","010124",0,364.27,363.43370911301002,363.43370911301002,"COMPLIANT"]
[null,"Temporary Overhead Supply—Coincident Disconnection (Truck visit)—AH","010124AH","010124",1,462.65,461.58784835735605,461.58784835735605,"COMPLIANT"]
[null,"Service truck visits",null,null,null,null,""]
[null,"Service Truck Visit—BH ","030000","030000",0,364.27,363.43370911301002,363.43370911301002,"COMPLIANT"]
[null,"Wasted Truck Visit—BH ","030001","030001",0,207.28,206.80412667786177,206.80412667786177,"COMPLIANT"]
[null,"Wasted Truck Visit—AH ","030001AH","030001",1,299.67,298.98201776126422,298.98201776126422,"COMPLIANT"]
[null,"Service Truck Visit—AH ","030000AH","030000",1,462.65,461.58784835735605,461.58784835735605,"COMPLIANT"]
[null,"Truck Appointment—AH ","030100AH","030100",1,0,0,0,"COMPLIANT"]
[null,"Meter equipment tests","",null,null,null,""]
[null,"Single phase ","060100","060100",0,171.52,171.1262244682886,171.1262244682886,"COMPLIANT"]
[null,"Single phase (each additional meter) ","060200","060200",0,63.89,63.743321369396902,63.743321369396902,"COMPLIANT"]
[null,"Multi Phase ","060300","060300",0,203.49,203.02282775799932,203.02282775799932,"COMPLIANT"]
[null,"Multi Phase (each additional meter) ","060400","060400",0,95.84,95.61997057509781,95.61997057509781,"COMPLIANT"]
[null,"Small Generator Installations (including PV)",null,null,null,null,""]
[null,"Pre Approval of PV and small generator installation < 4.6kW - BH",100100,100100,0,0,0,0,"COMPLIANT"]
[null,"Pre Approval of PV and small generator installation 4.6kW to 15kW - BH",100101,100101,0,159.75,159.38324602850454,159.38324602850454,"COMPLIANT"]
[null,"Pre Approval of PV and small generator installation 15kW to 30kW - BH",100102,100102,0,211.79,211.3037726220781,211.3037726220781,"COMPLIANT"]
[null,"Meter Exchange for PV and small generator installation",100103,100103,0,0,0,0,"COMPLIANT"]
[null,"Meter Reconfiguration for PV and small generator installation",100104,100104,0,30.25,30.180552064865495,30.180552064865495,"COMPLIANT"]
[null,null,null,null,null,null,{"$f":"IF(F64=\"\",\"\",ROUND(F64*(1+M64)*(1-M96),2))","v":""},"",""]
[null,"QUOTED SERVICES",null,null,null,null,{"$f":"IF(F65=\"\",\"\",ROUND(F65*(1+M65)*(1-M97),2))","v":""},{"$f":"G65","v":""},{"$f":"IF(H65=\"\",\"\",IF(H65<=G65,\"COMPLIANT\",\"BREACHED\"))","v":""}]
[null,"Business Hours",null,null,null,null,{"$f":"IF(F66=\"\",\"\",ROUND(F66*(1+M66)*(1-M98),2))","v":""},"",""]
[null,"Construction Overhead Install ",null,null,null,111.8279066240619,{"$f":"IF(F67=\"\",\"\",ROUND(F67*(1+$M$6)*(1-$M$7),2))","v":111.57},{"$f":"G67","v":111.57},{"$f":"IF(H67=\"\",\"\",IF(H67<=G67,\"COMPLIANT\",\"BREACHED\"))","v":"COMPLIANT"}]
[null,"Construction Underground Install ",null,null,null,109.22205581464034,{"$f":"IF(F68=\"\",\"\",ROUND(F68*(1+$M$6)*(1-$M$7),2))","v":108.97},108.97,"COMPLIANT"]
[null,"Construction Substation Install ",null,null,null,109.22205581464034,108.97,108.97,"COMPLIANT"]
[null,"Electrical Tester Including Vehicle & Equipment",null,null,null,195.27105207081917,194.82,194.82,"COMPLIANT"]
[null,"Planner Including Vehicle ",null,null,null,150.12161122260054,149.78,149.78,"COMPLIANT"]
[null,"Supervisor Including Vehicle ",null,null,null,150.12161122260054,149.78,149.78,"COMPLIANT"]
[null,"Design ",null,null,null,128.17878166000338,127.88,127.88,"COMPLIANT"]
[null,"Drafting ",null,null,null,98.496687032514572,98.27,98.27,"COMPLIANT"]
[null,"Survey ",null,null,null,116.02187251905373,115.76,115.76,"COMPLIANT"]
[null,"Tech Officer ",null,null,null,116.02187251905373,115.76,115.76,"COMPLIANT"]
[null,"Line Inspector ",null,null,null,111.8279066240619,111.57,111.57,"COMPLIANT"]
[null,"Contract Supervision ",null,null,null,116.02187251905373,115.76,115.76,"COMPLIANT"]
[null,"Protection Engineer ",null,null,null,128.17878166000338,127.88,127.88,"COMPLIANT"]
[null,"Maintenance Planner ",null,null,null,116.02187251905373,115.76,115.76,"COMPLIANT"]
[null,null,null,null,null,null,"","",""]
[null,"After Hours",null,null,null,null,"","",""]
[null,"Construction Overhead Install ",null,null,null,135.81739154341514,135.51,135.51,"COMPLIANT"]
[null,"Construction Underground Install ",null,null,null,132.65234528132794,132.35,132.35,"COMPLIANT"]
[null,"Construction Substation Install ",null,null,null,132.65234528132794,132.35,132.35,"COMPLIANT"]
[null,"Electrical Tester Including Vehicle & Equipment",null,null,null,220.1552497144373,219.65,219.65,"COMPLIANT"]
[null,"Planner Including Vehicle ",null,null,null,null,"","",""]
[null,"Supervisor Including Vehicle ",null,null,null,null,"","",""]
[null,"Design ",null,null,null,155.6688301130431,155.31,155.31,"COMPLIANT"]
[null,"Drafting ",null,null,null,119.62309123422004,119.35,119.35,"COMPLIANT"]
[null,"Survey ",null,null,null,140.91725407172521,140.59,140.59,"COMPLIANT"]
[null,"Tech Officer ",null,null,null,140.91725407172521,140.59,140.59,"COMPLIANT"]
[null,"Line Inspector ",null,null,null,135.81739154341514,135.51,135.51,"COMPLIANT"]
[null,"Contract Supervision ",null,null,null,140.91725407172521,140.59,{"$f":"G94","v":140.59},{"$f":"IF(H94=\"\",\"\",IF(H94<=G94,\"COMPLIANT\",\"BREACHED\"))","v":"COMPLIANT"}]
[null,"Protection Engineer ",null,null,null,155.6688301130431,155.31,155.31,"COMPLIANT"]
[null,"Maintenance Planner ",null,null,null,140.91725407172521,140.59,140.59,"COMPLIANT"]
[null,null,null,null,null,null,"","",""]
[null,null,null,null,null,null,"","",""]
[null,null,null,null,null,null,"","",""]

{"sheet":"Prop2021DistTar","index":9,"n_rows":66,"n_cols":74,"rows_kept":66,"cut":false,"hidden":false,"merged":[]}
[null,{"$f":"\"Tariff Approval - \"&'Model update'!$C$3","v":"Tariff Approval - AusNet Services"},{"$f":"\"Prop\"&'Model update'!$C$5&\"DistTar\"","v":"Prop2021DistTar"}]
[]
[null,{"$f":"\"PROPOSED \"&'Model update'!$C$5&\" DISTRIBUTION TARIFFS\"","v":"PROPOSED 2021 DISTRIBUTION TARIFFS"}]
[null,null,null,{"$f":"\"Proposed Distribution Tariffs (Pt) for \"&'Model update'!$C$5","v":"Proposed Distribution Tariffs (Pt) for 2021"},null,null,null,null,null,null,null,null,null,null,null,null,null,{"$f":"\"Current Distribution Tariffs (Pt-1) for \"&'Model update'!$C$8","v":"Current Distribution Tariffs (Pt-1) for 2020"},null,null,null,null,null,null,null,null,null,null,null,null,null,{"$f":"\"Forecast Quantities (Qt) for \"&'Model update'!$C$5","v":"Forecast Quantities (Qt) for 2021"},null,null,null,null,null,null,null,null,null,null,null,null,null,{"$f":"\"Forecast Revenue (Pt \"&'Model update'!$C$5&\")*(Qt \" &'Model update'!$C$5&\")\"","v":"Forecast Revenue (Pt 2021)*(Qt 2021)"},null,null,null,null,null,null,null,null,null,null,null,null,null,null,{"$f":"\"Revenue (Pt-1 \"&'Model update'!$C$8&\")*(Qt \" &'Model update'!$C$5&\")\"","v":"Revenue (Pt-1 2020)*(Qt 2021)"}]
[null,"Proposed tariff","Existing tariff","PropTar\nFixed","PropTar\nPkBlk1","PropTar\nPkBlk2","PropTar\nPkBlk3","PropTar\nPkBlk4","PropTar\nOPkBlk1","PropTar\nOPkBlk2","PropTar\nOPkBlk3","PropTar\nOPkBlk4","PropTar\nDemBlk1","PropTar\nDemBlk2","PropTar\nDemBlk3","PropTar\nDemBlk4",null,"ExistTar\nFixed","ExistTar\nPkBlk1","ExistTar\nPkBlk2","ExistTar\nPkBlk3","ExistTar\nPkBlk4","ExistTar\nOPkBlk1","ExistTar\nOPkBlk2","ExistTar\nOPkBlk3","ExistTar\nOPkBlk4","ExistTar\nDemBlk1","ExistTar\nDemBlk2","ExistTar\nDemBlk3","ExistTar\nDemBlk4",null,"FcastVol\nFixed","FcastVol\nPkBlk1","FcastVol\nPkBlk2","FcastVol\nPkBlk3","FcastVol\nPkBlk4","FcastVol\nOPkBlk1","FcastVol\nOPkBlk2","FcastVol\nOPkBlk3","FcastVol\nOPkBlk4","FcastVol\nDemBlk1","FcastVol\nDemBlk2","FcastVol\nDemBlk3","FcastVol\nDemBlk4",null,"PropRev\nFixed","PropRev\nPkBlk1","PropRev\nPkBlk2","PropRev\nPkBlk3","PropRev\nPkBlk4","PropRev\nOPkBlk1","PropRev\nOPkBlk2","PropRev\nOPkBlk3","PropRev\nOPkBlk4","PropRev\nDemBlk1","PropRev\nDemBlk2","PropRev\nDemBlk3","PropRev\nDemBlk4","PropRev\nTotal",null,"ExistRev\nFixed","ExistRev\nPkBlk1","ExistRev\nPkBlk2","ExistRev\nPkBlk3","ExistRev\nPkBlk4","ExistRev\nOPkBlk1","ExistRev\nOPkBlk2","ExistRev\nOPkBlk3","ExistRev\nOPkBlk4","ExistRev\nDemBlk1","ExistRev\nDemBlk2","ExistRev\nDemBlk3","ExistRev\nDemBlk4","ExistRev\nTotal"]
["NEE11","NEE11  Small Single Rate < 160MWh","NEE11  Small Single Rate < 160MWh",106,7.8390000000000004,9.3777000000000008,0,0,0,0,0,0,0,0,0,0,null,{"$f":"Est2020DistRev!D6","v":118},{"$f":"Est2020DistRev!E6","v":8.7594999999999992},{"$f":"Est2020DistRev!F6","v":10.478899999999999},{"$f":"Est2020DistRev!G6","v":0},{"$f":"Est2020DistRev!H6","v":0},{"$f":"Est2020DistRev!I6","v":0},{"$f":"Est2020DistRev!J6","v":0},{"$f":"Est2020DistRev!K6","v":0},{"$f":"Est2020DistRev!L6","v":0},{"$f":"Est2020DistRev!M6","v":0},{"$f":"Est2020DistRev!N6","v":0},{"$f":"Est2020DistRev!O6","v":0},{"$f":"Est2020DistRev!P6","v":0},null,239028.33445953517,686112016.75810897,283669233.43365067,0,0,0,0,0,0,0,0,0,0,null,{"$f":"D6*AF6","v":25337003.452710729},{"$f":"E6/100*AG6","v":53784320.993668161},26601649.703707464,0,0,0,0,0,0,{"$f":"M6*AO6","v":0},0,0,0,{"$f":"SUM(AT6:BF6)","v":105722974.15008634},null,{"$f":"R6*AF6","v":28205343.466225151},{"$f":"S6/100*AG6","v":60099982.107926548},29725415.302278817,0,0,0,0,0,0,{"$f":"AA6*AO6","v":0},0,0,0,{"$f":"SUM(BI6:BU6)","v":118030740.87643051}]
["NGT11","NGT11  Small Interval Single Rate < 160MWh","NGT11  Small Interval Single Rate < 160MWh",106,10.456799999999999,0,0,0,0,0,0,0,0,0,0,0,null,{"$f":"Est2020DistRev!D7","v":118},{"$f":"Est2020DistRev!E7","v":11.684699999999999},{"$f":"Est2020DistRev!F7","v":0},{"$f":"Est2020DistRev!G7","v":0},{"$f":"Est2020DistRev!H7","v":0},{"$f":"Est2020DistRev!I7","v":0},{"$f":"Est2020DistRev!J7","v":0},{"$f":"Est2020DistRev!K7","v":0},{"$f":"Est2020DistRev!L7","v":0},{"$f":"Est2020DistRev!M7","v":0},{"$f":"Est2020DistRev!N7","v":0},{"$f":"Est2020DistRev!O7","v":0},{"$f":"Est2020DistRev!P7","v":0},null,4,15851.690337581815,0,0,0,0,0,0,0,0,0,0,0,null,{"$f":"D7*AF7","v":424},{"$f":"E7/100*AG7","v":1657.5795552202551},0,0,0,0,0,0,0,{"$f":"M7*AO7","v":0},{"$f":"N7*AP7","v":0},{"$f":"O7*AQ7","v":0},{"$f":"P7*AR7","v":0},{"$f":"SUM(AT7:BF7)","v":2081.5795552202553},null,{"$f":"R7*AF7","v":472},{"$f":"S7/100*AG7","v":1852.2224608754223},{"$f":"T7/100*AH7","v":0},{"$f":"U7/100*AI7","v":0},{"$f":"V7/100*AJ7","v":0},{"$f":"W7/100*AK7","v":0},{"$f":"X7/100*AL7","v":0},{"$f":"Y7/100*AM7","v":0},{"$f":"Z7/100*AN7","v":0},{"$f":"AA7*AO7","v":0},{"$f":"AB7*AP7","v":0},{"$f":"AC7*AQ7","v":0},{"$f":"AD7*AR7","v":0},{"$f":"SUM(BI7:BU7)","v":2324.2224608754223}]
["NSP11","NSP11  Small Single Rate < 160MWh","NSP11  Small Single Rate < 160MWh",106,34.814100000000003,30.463699999999999,26.6615,0,2.9693000000000001,0,0,0,0,0,0,0,null,{"$f":"Est2020DistRev!D8","v":118},{"$f":"Est2020DistRev!E8","v":38.902200000000001},{"$f":"Est2020DistRev!F8","v":34.040900000000001},{"$f":"Est2020DistRev!G8","v":29.792300000000001},{"$f":"Est2020DistRev!H8","v":0},{"$f":"Est2020DistRev!I8","v":3.3180000000000001},{"$f":"Est2020DistRev!J8","v":0},{"$f":"Est2020DistRev!K8","v":0},{"$f":"Est2020DistRev!L8","v":0},{"$f":"Est2020DistRev!M8","v":0},{"$f":"Est2020DistRev!N8","v":0},{"$f":"Est2020DistRev!O8","v":0},{"$f":"Est2020DistRev!P8","v":0},null,0,0,0,0,0,0,0,0,0,0,0,0,0,null,0,0,0,0,0,0,0,0,0,0,0,0,0,0,null,0,0,0,0,0,0,0,0,0,0,0,0,0,0]
["NEN11","NEN11  Small Single Rate < 160MWh Embedded Network","NEN11  Small Single Rate < 160MWh Embedded Network",106,4.8059000000000003,5.2817999999999996,0,0,0,0,0,0,0,0,0,0,null,{"$f":"Est2020DistRev!D9","v":118},{"$f":"Est2020DistRev!E9","v":5.3701999999999996},{"$f":"Est2020DistRev!F9","v":5.9020000000000001},{"$f":"Est2020DistRev!G9","v":0},{"$f":"Est2020DistRev!H9","v":0},{"$f":"Est2020DistRev!I9","v":0},{"$f":"Est2020DistRev!J9","v":0},{"$f":"Est2020DistRev!K9","v":0},{"$f":"Est2020DistRev!L9","v":0},{"$f":"Est2020DistRev!M9","v":0},{"$f":"Est2020DistRev!N9","v":0},{"$f":"Est2020DistRev!O9","v":0},{"$f":"Est2020DistRev!P9","v":0},null,0,0,0,0,0,0,0,0,0,0,0,0,0,null,0,0,0,0,0,0,0,0,0,0,0,0,0,0,null,0,0,0,0,0,0,0,0,0,0,0,0,0,0]
["NEE12","NEE12  Small Business Single Rate - new in 2001","NEE12  Small Business Single Rate - new in 2001",106,11.264200000000001,14.238899999999999,0,0,0,0,0,0,0,0,0,0,null,{"$f":"Est2020DistRev!D10","v":118},{"$f":"Est2020DistRev!E10","v":12.5869},{"$f":"Est2020DistRev!F10","v":15.9109},{"$f":"Est2020DistRev!G10","v":0},{"$f":"Est2020DistRev!H10","v":0},{"$f":"Est2020DistRev!I10","v":0},{"$f":"Est2020DistRev!J10","v":0},{"$f":"Est2020DistRev!K10","v":0},{"$f":"Est2020DistRev!L10","v":0},{"$f":"Est2020DistRev!M10","v":0},{"$f":"Est2020DistRev!N10","v":0},{"$f":"Est2020DistRev!O10","v":0},{"$f":"Est2020DistRev!P10","v":0},null,14834.626022568389,29916679.022633694,46008597.658686936,0,0,0,0,0,0,0,0,0,0,null,1572470.3583922493,3369874.5584675046,6551118.2120227739,0,0,0,0,0,0,0,0,0,0,11493463.128882527,null,1750485.8706630699,3765582.4718998806,7320381.9648760194,0,0,0,0,0,0,0,0,0,0,12836450.30743897]
["NSP12","NSP12  Small Business Single Rate - new in 2001","NSP12  Small Business Single Rate - new in 2001",106,34.814100000000003,30.463699999999999,26.6615,0,2.9693000000000001,0,0,0,0,0,0,0,null,{"$f":"Est2020DistRev!D11","v":118},{"$f":"Est2020DistRev!E11","v":38.902200000000001},{"$f":"Est2020DistRev!F11","v":34.040900000000001},{"$f":"Est2020DistRev!G11","v":29.792300000000001},{"$f":"Est2020DistRev!H11","v":0},{"$f":"Est2020DistRev!I11","v":3.3180000000000001},{"$f":"Est2020DistRev!J11","v":0},{"$f":"Est2020DistRev!K11","v":0},{"$f":"Est2020DistRev!L11","v":0},{"$f":"Est2020DistRev!M11","v":0},{"$f":"Est2020DistRev!N11","v":0},{"$f":"Est2020DistRev!O11","v":0},{"$f":"Est2020DistRev!P11","v":0},null,0,0,0,0,0,0,0,0,0,0,0,0,0,null,0,0,0,0,0,0,0,0,0,0,0,0,0,0,null,0,0,0,0,0,0,0,0,0,0,0,0,0,0]
["NEN12","NEN12  Small Business Single Rate - Embedded Network","NEN12  Small Business Single Rate - Embedded Network",106,16.3826,19.070799999999998,0,0,0,0,0,0,0,0,0,0,null,{"$f":"Est2020DistRev!D12","v":118},{"$f":"Est2020DistRev!E12","v":18.3063},{"$f":"Est2020DistRev!F12","v":21.310199999999998},{"$f":"Est2020DistRev!G12","v":0},{"$f":"Est2020DistRev!H12","v":0},{"$f":"Est2020DistRev!I12","v":0},{"$f":"Est2020DistRev!J12","v":0},{"$f":"Est2020DistRev!K12","v":0},{"$f":"Est2020DistRev!L12","v":0},{"$f":"Est2020DistRev!M12","v":0},{"$f":"Est2020DistRev!N12","v":0},{"$f":"Est2020DistRev!O12","v":0},{"$f":"Est2020DistRev!P12","v":0},null,0,0,0,0,0,0,0,0,0,0,0,0,0,null,0,0,0,0,0,0,0,0,0,0,0,0,0,0,null,0,0,0,0,0,0,0,0,0,0,0,0,0,0]
["NEE20","NEE20  Small Two Rate","NEE20  Small Two Rate",106,15.600300000000001,0,0,0,2.8691,0,0,0,0,0,0,0,null,{"$f":"Est2020DistRev!D13","v":118},{"$f":"Est2020DistRev!E13","v":16.979600000000001},{"$f":"Est2020DistRev!F13","v":0},{"$f":"Est2020DistRev!G13","v":0},{"$f":"Est2020DistRev!H13","v":0},{"$f":"Est2020DistRev!I13","v":3.1227999999999998},{"$f":"Est2020DistRev!J13","v":0},{"$f":"Est2020DistRev!K13","v":0},{"$f":"Est2020DistRev!L13","v":0},{"$f":"Est2020DistRev!M13","v":0},{"$f":"Est2020DistRev!N13","v":0},{"$f":"Est2020DistRev!O13","v":0},{"$f":"Est2020DistRev!P13","v":0},null,25675.158160203395,68100453.350972682,0,0,0,90999048.342038363,0,0,0,0,0,0,0,null,2721566.7649815599,10623875.024111792,0,0,0,2610853.6959814229,0,0,0,0,0,0,0,15956295.485074775,null,3029668.6629040004,11563184.577181758,0,0,0,2841718.281625174,0,0,0,0,0,0,0,17434571.521710932]
["NSP20","NSP20  Small Two Rate","NSP20  Small Two Rate",106,34.814100000000003,30.463699999999999,26.6615,0,2.9693000000000001,0,0,0,0,0,0,0,null,{"$f":"Est2020DistRev!D14","v":118},{"$f":"Est2020DistRev!E14","v":38.902200000000001},{"$f":"Est2020DistRev!F14","v":34.040900000000001},{"$f":"Est2020DistRev!G14","v":29.792300000000001},{"$f":"Est2020DistRev!H14","v":0},{"$f":"Est2020DistRev!I14","v":3.3180000000000001},{"$f":"Est2020DistRev!J14","v":0},{"$f":"Est2020DistRev!K14","v":0},{"$f":"Est2020DistRev!L14","v":0},{"$f":"Est2020DistRev!M14","v":0},{"$f":"Est2020DistRev!N14","v":0},{"$f":"Est2020DistRev!O14","v":0},{"$f":"Est2020DistRev!P14","v":0},null,7,1224.099089443961,935.22469487542367,295.53170387454105,0,40249.817884885495,0,0,0,0,0,0,0,null,742,426.15908109811005,284.90404537276441,78.793185228510765,0,1195.137842455905,0,0,0,0,0,0,0,2726.9941541552903,null,826,476.20147597366855,318.35890315784809,88.045691813414891,0,1335.4889574205008,0,0,0,0,0,0,0,3044.095028365432]
["NGT26","NGT26  Small Interval Multi Rate","NGT26  Small Interval Multi Rate",106,11.2356,11.2356,8.2332999999999998,8.2332999999999998,3.05,3.05,0,0,0,0,0,0,null,{"$f":"Est2020DistRev!D15","v":118},{"$f":"Est2020DistRev!E15","v":12.228999999999999},{"$f":"Est2020DistRev!F15","v":12.228999999999999},{"$f":"Est2020DistRev!G15","v":8.9611999999999998},{"$f":"Est2020DistRev!H15","v":8.9611999999999998},{"$f":"Est2020DistRev!I15","v":3.3197000000000001},{"$f":"Est2020DistRev!J15","v":3.3197000000000001},{"$f":"Est2020DistRev!K15","v":0},{"$f":"Est2020DistRev!L15","v":0},{"$f":"Est2020DistRev!M15","v":0},{"$f":"Est2020DistRev!N15","v":0},{"$f":"Est2020DistRev!O15","v":0},{"$f":"Est2020DistRev!P15","v":0},null,778.33859346884094,1323806.2915151073,0,1378430.2281436233,0,1366870.1749827666,0,0,0,0,0,0,0,null,82503.890907697147,148737.5796894714,0,113490.29597374894,0,41689.54033697438,0,0,0,0,0,0,0,386421.30690789188,null,91843.954029323228,161888.27138938245,0,123523.88960440637,0,45375.989198902913,0,0,0,0,0,0,0,422632.10422201495]
["NEN20","NEN20  Small Two Rate - Embedded Network","NEN20  Small Two Rate - Embedded Network",106,9.0124999999999993,0,0,0,2.9460999999999999,0,0,0,0,0,0,0,null,{"$f":"Est2020DistRev!D16","v":118},{"$f":"Est2020DistRev!E16","v":10.0708},{"$f":"Est2020DistRev!F16","v":0},{"$f":"Est2020DistRev!G16","v":0},{"$f":"Est2020DistRev!H16","v":0},{"$f":"Est2020DistRev!I16","v":3.2919999999999998},{"$f":"Est2020DistRev!J16","v":0},{"$f":"Est2020DistRev!K16","v":0},{"$f":"Est2020DistRev!L16","v":0},{"$f":"Est2020DistRev!M16","v":0},{"$f":"Est2020DistRev!N16","v":0},{"$f":"Est2020DistRev!O16","v":0},{"$f":"Est2020DistRev!P16","v":0},null,0,0,0,0,0,0,0,0,0,0,0,0,0,null,0,0,0,0,0,0,0,0,0,0,0,0,0,0,null,0,0,0,0,0,0,0,0,0,0,0,0,0,0]
["NEE21","NEE21  Small Business Two Rate","NEE21  Small Business Two Rate",106,14.5435,0,0,0,3.0125999999999999,0,0,0,0,0,0,0,null,{"$f":"Est2020DistRev!D17","v":118},{"$f":"Est2020DistRev!E17","v":16.251300000000001},{"$f":"Est2020DistRev!F17","v":0},{"$f":"Est2020DistRev!G17","v":0},{"$f":"Est2020DistRev!H17","v":0},{"$f":"Est2020DistRev!I17","v":3.3664000000000001},{"$f":"Est2020DistRev!J17","v":0},{"$f":"Est2020DistRev!K17","v":0.59750000000000003},{"$f":"Est2020DistRev!L17","v":0},{"$f":"Est2020DistRev!M17","v":0},{"$f":"Est2020DistRev!N17","v":0},{"$f":"Est2020DistRev!O17","v":0},{"$f":"Est2020DistRev!P17","v":0},null,14772.518182372723,95606928.017334342,0,0,0,71167541.716303572,0,-6826817.5715023922,0,0,0,0,0,null,1565886.9273315086,13904593.576201022,0,0,0,2143993.3617453612,0,0,0,0,0,0,0,17614473.865277894,null,1743157.1455199814,15537368.692881057,0,0,0,2395784.1243376434,0,-40790.234989726792,0,0,0,0,0,19635519.727748957]
["NSP21","NSP21  Small Business Two Rate","NSP21  Small Business Two Rate",106,34.814100000000003,30.463699999999999,26.6615,0,2.9693000000000001,0,0,0,0,0,0,0,null,{"$f":"Est2020DistRev!D18","v":118},{"$f":"Est2020DistRev!E18","v":38.902200000000001},{"$f":"Est2020DistRev!F18","v":34.040900000000001},{"$f":"Est2020DistRev!G18","v":29.792300000000001},{"$f":"Est2020DistRev!H18","v":0},{"$f":"Est2020DistRev!I18","v":3.3180000000000001},{"$f":"Est2020DistRev!J18","v":0},{"$f":"Est2020DistRev!K18","v":0.59750000000000003},{"$f":"Est2020DistRev!L18","v":0},{"$f":"Est2020DistRev!M18","v":0},{"$f":"Est2020DistRev!N18","v":0},{"$f":"Est2020DistRev!O18","v":0},{"$f":"Est2020DistRev!P18","v":0},null,12.387570584899215,3155.7072542765309,11732.089977530526,5294.7282030256811,0,229094.7831057219,0,-1050,0,0,0,0,0,null,1313.0824819993168,1098.6310792110858,3574.0286944849668,1411.653959849692,0,6802.5113947582004,0,0,0,0,0,0,0,14199.907610303262,null,1461.7333290181075,1227.6395474731646,3993.709017161189,1577.42131043002,0,7601.3649034478531,0,-6.2737500000000006,0,0,0,0,0,15855.594357530334]
["NSP27","NSP27  Small Business Two Rate","NSP27  Small Business Two Rate",106,19.672699999999999,17.245200000000001,15.1249,0,5.4006999999999996,0,0,0,0,0,0,0,null,{"$f":"Est2020DistRev!D19","v":118},{"$f":"Est2020DistRev!E19","v":21.982800000000001},{"$f":"Est2020DistRev!F19","v":19.270199999999999},{"$f":"Est2020DistRev!G19","v":16.9009},{"$f":"Est2020DistRev!H19","v":0},{"$f":"Est2020DistRev!I19","v":6.0349000000000004},{"$f":"Est2020DistRev!J19","v":0},{"$f":"Est2020DistRev!K19","v":0.59750000000000003},{"$f":"Est2020DistRev!L19","v":0},{"$f":"Est2020DistRev!M19","v":0},{"$f":"Est2020DistRev!N19","v":0},{"$f":"Est2020DistRev!O19","v":0},{"$f":"Est2020DistRev!P19","v":0},null,111.83135587734887,26116.112755164144,26228.725674894009,65430.578916311686,0,7355360.3860684065,0,-13316.4,0,0,0,0,0,null,11854.12372299898,5137.7445139851761,4523.1962000868216,9896.3096305132258,0,397240.94837039645,0,0,0,0,0,0,0,428652.32243798068,null,13196.099993527167,5741.0528347422241,5054.3278950034246,11058.356712066921,0,443888.64393884229,0,-79.565489999999997,0,0,0,0,0,478858.91588418203]
["NEN21","NEN21  Small Business Two Rate - Embedded Network","NEN21  Small Business Two Rate - Embedded Network",106,10.099299999999999,0,0,0,4.6013000000000002,0,0,0,0,0,0,0,null,{"$f":"Est2020DistRev!D20","v":118},{"$f":"Est2020DistRev!E20","v":11.2852},{"$f":"Est2020DistRev!F20","v":0},{"$f":"Est2020DistRev!G20","v":0},{"$f":"Est2020DistRev!H20","v":0},{"$f":"Est2020DistRev!I20","v":5.1416000000000004},{"$f":"Est2020DistRev!J20","v":0},{"$f":"Est2020DistRev!K20","v":0},{"$f":"Est2020DistRev!L20","v":0},{"$f":"Est2020DistRev!M20","v":0},{"$f":"Est2020DistRev!N20","v":0},{"$f":"Est2020DistRev!O20","v":0},{"$f":"Est2020DistRev!P20","v":0},null,0,0,0,0,0,0,0,0,0,0,0,0,0,null,0,0,0,0,0,0,0,0,0,0,0,0,0,0,null,0,0,0,0,0,0,0,0,0,0,0,0,0,0]
["NEE23","NEE23  Photovoltaic","NEE23  Photovoltaic",116,15.600300000000001,0,0,0,2.8691,0,0,0,0,0,0,0,null,{"$f":"Est2020DistRev!D21","v":130},{"$f":"Est2020DistRev!E21","v":16.979600000000001},{"$f":"Est2020DistRev!F21","v":0},{"$f":"Est2020DistRev!G21","v":0},{"$f":"Est2020DistRev!H21","v":0},{"$f":"Est2020DistRev!I21","v":3.1227999999999998},{"$f":"Est2020DistRev!J21","v":0},{"$f":"Est2020DistRev!K21","v":0.59750000000000003},{"$f":"Est2020DistRev!L21","v":0},{"$f":"Est2020DistRev!M21","v":0},{"$f":"Est2020DistRev!N21","v":0},{"$f":"Est2020DistRev!O21","v":0},{"$f":"Est2020DistRev!P21","v":0},null,78747.110531012135,148727012.02353171,0,0,0,186285788.86616242,0,-137295086.92091542,0,0,0,0,0,null,9134664.8215974085,23201860.056707017,0,0,0,5344725.5683590658,0,0,0,0,0,0,0,37681250.446663491,null,10237124.369031578,25253251.733547591,0,0,0,5817332.6147125196,0,-820338.14435246971,0,0,0,0,0,40487370.572939217]
["NSP23","NSP23  Photovoltaic","NSP23  Photovoltaic",116,34.814100000000003,30.463699999999999,26.6615,0,2.9693000000000001,0,0,0,0,0,0,0,null,{"$f":"Est2020DistRev!D22","v":130},{"$f":"Est2020DistRev!E22","v":38.902200000000001},{"$f":"Est2020DistRev!F22","v":34.040900000000001},{"$f":"Est2020DistRev!G22","v":29.792300000000001},{"$f":"Est2020DistRev!H22","v":0},{"$f":"Est2020DistRev!I22","v":3.3180000000000001},{"$f":"Est2020DistRev!J22","v":0},{"$f":"Est2020DistRev!K22","v":0.59750000000000003},{"$f":"Est2020DistRev!L22","v":0},{"$f":"Est2020DistRev!M22","v":0},{"$f":"Est2020DistRev!N22","v":0},{"$f":"Est2020DistRev!O22","v":0},{"$f":"Est2020DistRev!P22","v":0},null,153.58869603924799,1470.6086589900185,1503.7327154391771,36097.961621763301,0,613592.27738774172,0,-354454.31721366808,0,0,0,0,0,null,17816.288740552765,511.97916914944409,458.09262323324458,9624.2580377864215,0,18219.395492474214,0,0,0,0,0,0,0,46630.014063196089,null,19966.530485102237,572.09912173761495,511.88414992993489,10754.413020240589,0,20358.991763725269,0,-2117.8645453516669,0,0,0,0,0,50046.053995383976]
["NEE24","NEE24  Small rate 5 day 8 to 8","NEE24  Small rate 5 day 8 to 8",106,6.5594999999999999,0,0,0,2.7625000000000002,0,0,0,0,0,0,0,null,{"$f":"Est2020DistRev!D23","v":118},{"$f":"Est2020DistRev!E23","v":7.3297999999999996},{"$f":"Est2020DistRev!F23","v":0},{"$f":"Est2020DistRev!G23","v":0},{"$f":"Est2020DistRev!H23","v":0},{"$f":"Est2020DistRev!I23","v":3.0869},{"$f":"Est2020DistRev!J23","v":0},{"$f":"Est2020DistRev!K23","v":0},{"$f":"Est2020DistRev!L23","v":0},{"$f":"Est2020DistRev!M23","v":0},{"$f":"Est2020DistRev!N23","v":0},{"$f":"Est2020DistRev!O23","v":0},{"$f":"Est2020DistRev!P23","v":0},null,1100.1692967344206,1290491.0935496474,0,0,0,3209655.8945374847,0,0,0,0,0,0,0,null,116617.94545384859,84649.763281389125,0,0,0,88666.744086598017,0,0,0,0,0,0,0,289934.45282183576,null,129819.97701466164,94590.416175002058,0,0,0,99078.867808477618,0,0,0,0,0,0,0,323489.26099814131]
["NEE25","NEE25  Small business rate 5 day 8 to 8","NEE25  Small business rate 5 day 8 to 8",106,13.7666,0,0,0,2.8698999999999999,0,0,0,0,0,0,0,null,{"$f":"Est2020DistRev!D24","v":118},{"$f":"Est2020DistRev!E24","v":15.3832},{"$f":"Est2020DistRev!F24","v":0},{"$f":"Est2020DistRev!G24","v":0},{"$f":"Est2020DistRev!H24","v":0},{"$f":"Est2020DistRev!I24","v":3.2069000000000001},{"$f":"Est2020DistRev!J24","v":0},{"$f":"Est2020DistRev!K24","v":0},{"$f":"Est2020DistRev!L24","v":0},{"$f":"Est2020DistRev!M24","v":0},{"$f":"Est2020DistRev!N24","v":0},{"$f":"Est2020DistRev!O24","v":0},{"$f":"Est2020DistRev!P24","v":0},null,3.5,93117.103044688978,0,0,0,100928.99758533001,0,0,0,0,0,0,0,null,371,12819.059107750154,0,0,0,2896.5613017013861,0,0,0,0,0,0,0,16086.62040945154,null,413,14324.390195570595,0,0,0,3236.6920235639482,0,0,0,0,0,0,0,17974.082219134543]
["NEE30","NEE30  Small Dedicated","NEE30  Small Dedicated",0,0,0,0,0,2.7869000000000002,0,0,0,0,0,0,0,null,{"$f":"Est2020DistRev!D25","v":0},{"$f":"Est2020DistRev!E25","v":0},{"$f":"Est2020DistRev!F25","v":0},{"$f":"Est2020DistRev!G25","v":0},{"$f":"Est2020DistRev!H25","v":0},{"$f":"Est2020DistRev!I25","v":3.1141000000000001},{"$f":"Est2020DistRev!J25","v":0},{"$f":"Est2020DistRev!K25","v":0},{"$f":"Est2020DistRev!L25","v":0},{"$f":"Est2020DistRev!M25","v":0},{"$f":"Est2020DistRev!N25","v":0},{"$f":"Est2020DistRev!O25","v":0},{"$f":"Est2020DistRev!P25","v":0},null,42479.558530348069,0,0,0,0,54981945.82309705,0,0,0,0,0,0,0,null,0,0,0,0,0,1532291.8481438917,0,0,0,0,0,0,0,1532291.8481438917,null,0,0,0,0,0,1712192.7748770653,0,0,0,0,0,0,0,1712192.7748770653]
["NSP30","NSP30  Small Dedicated","NSP30  Small Dedicated",0,0,0,0,0,2.7869000000000002,0,0,0,0,0,0,0,null,{"$f":"Est2020DistRev!D26","v":0},{"$f":"Est2020DistRev!E26","v":0},{"$f":"Est2020DistRev!F26","v":0},{"$f":"Est2020DistRev!G26","v":0},{"$f":"Est2020DistRev!H26","v":0},{"$f":"Est2020DistRev!I26","v":3.1141000000000001},{"$f":"Est2020DistRev!J26","v":0},{"$f":"Est2020DistRev!K26","v":0},{"$f":"Est2020DistRev!L26","v":0},{"$f":"Est2020DistRev!M26","v":0},{"$f":"Est2020DistRev!N26","v":0},{"$f":"Est2020DistRev!O26","v":0},{"$f":"Est2020DistRev!P26","v":0},null,0,0,0,0,0,0,0,0,0,0,0,0,0,null,0,0,0,0,0,0,0,0,0,0,0,0,0,0,null,0,0,0,0,0,0,0,0,0,0,0,0,0,0]
["NEE31","NEE31  Small Dedicated-afternoon boost","NEE31  Small Dedicated-afternoon boost",0,0,0,0,0,2.7869000000000002,0,0,0,0,0,0,0,null,{"$f":"Est2020DistRev!D27","v":0},{"$f":"Est2020DistRev!E27","v":0},{"$f":"Est2020DistRev!F27","v":0},{"$f":"Est2020DistRev!G27","v":0},{"$f":"Est2020DistRev!H27","v":0},{"$f":"Est2020DistRev!I27","v":3.1141000000000001},{"$f":"Est2020DistRev!J27","v":0},{"$f":"Est2020DistRev!K27","v":0},{"$f":"Est2020DistRev!L27","v":0},{"$f":"Est2020DistRev!M27","v":0},{"$f":"Est2020DistRev!N27","v":0},{"$f":"Est2020DistRev!O27","v":0},{"$f":"Est2020DistRev!P27","v":0},null,6284.0026251727604,0,0,0,0,15874112.376413189,0,0,0,0,0,0,0,null,0,0,0,0,0,442395.63781825919,0,0,0,0,0,0,0,442395.63781825919,null,0,0,0,0,0,494335.73351388314,0,0,0,0,0,0,0,494335.73351388314]
["NSP31","NSP31  Small Dedicated-afternoon boost","NSP31  Small Dedicated-afternoon boost",0,0,0,0,0,2.7869000000000002,0,0,0,0,0,0,0,null,{"$f":"Est2020DistRev!D28","v":0},{"$f":"Est2020DistRev!E28","v":0},{"$f":"Est2020DistRev!F28","v":0},{"$f":"Est2020DistRev!G28","v":0},{"$f":"Est2020DistRev!H28","v":0},{"$f":"Est2020DistRev!I28","v":3.1141000000000001},{"$f":"Est2020DistRev!J28","v":0},{"$f":"Est2020DistRev!K28","v":0},{"$f":"Est2020DistRev!L28","v":0},{"$f":"Est2020DistRev!M28","v":0},{"$f":"Est2020DistRev!N28","v":0},{"$f":"Est2020DistRev!O28","v":0},{"$f":"Est2020DistRev!P28","v":0},null,0,0,0,0,0,0,0,0,0,0,0,0,0,null,0,0,0,0,0,0,0,0,0,0,0,0,0,0,null,0,0,0,0,0,0,0,0,0,0,0,0,0,0]
["NEE32","NEE32  Dedicated Circuit 8 to 8","NEE32  Dedicated Circuit 8 to 8",0,0,0,0,0,2.7869000000000002,0,0,0,0,0,0,0,null,{"$f":"Est2020DistRev!D29","v":0},{"$f":"Est2020DistRev!E29","v":0},{"$f":"Est2020DistRev!F29","v":0},{"$f":"Est2020DistRev!G29","v":0},{"$f":"Est2020DistRev!H29","v":0},{"$f":"Est2020DistRev!I29","v":3.1141000000000001},{"$f":"Est2020DistRev!J29","v":0},{"$f":"Est2020DistRev!K29","v":0},{"$f":"Est2020DistRev!L29","v":0},{"$f":"Est2020DistRev!M29","v":0},{"$f":"Est2020DistRev!N29","v":0},{"$f":"Est2020DistRev!O29","v":0},{"$f":"Est2020DistRev!P29","v":0},null,1823.9308862433866,0,0,0,0,2310467.8003431028,0,0,0,0,0,0,0,null,0,0,0,0,0,64390.427127761934,0,0,0,0,0,0,0,64390.427127761934,null,0,0,0,0,0,71950.277770484565,0,0,0,0,0,0,0,71950.277770484565]
["NSP32","NSP32  Dedicated Circuit 8 to 8","NSP32  Dedicated Circuit 8 to 8",0,0,0,0,0,2.7869000000000002,0,0,0,0,0,0,0,null,{"$f":"Est2020DistRev!D30","v":0},{"$f":"Est2020DistRev!E30","v":0},{"$f":"Est2020DistRev!F30","v":0},{"$f":"Est2020DistRev!G30","v":0},{"$f":"Est2020DistRev!H30","v":0},{"$f":"Est2020DistRev!I30","v":3.1141000000000001},{"$f":"Est2020DistRev!J30","v":0},{"$f":"Est2020DistRev!K30","v":0},{"$f":"Est2020DistRev!L30","v":0},{"$f":"Est2020DistRev!M30","v":0},{"$f":"Est2020DistRev!N30","v":0},{"$f":"Est2020DistRev!O30","v":0},{"$f":"Est2020DistRev!P30","v":0},null,0,0,0,0,0,0,0,0,0,0,0,0,0,null,0,0,0,0,0,0,0,0,0,0,0,0,0,0,null,0,0,0,0,0,0,0,0,0,0,0,0,0,0]
["NEE40","NEE40  Medium Single Rate - closed to new customers","NEE40  Medium Single Rate - closed to new customers",106,20.3491,0,0,0,0,0,0,0,0,0,0,0,null,{"$f":"Est2020DistRev!D31","v":118},{"$f":"Est2020DistRev!E31","v":22.738600000000002},{"$f":"Est2020DistRev!F31","v":0},{"$f":"Est2020DistRev!G31","v":0},{"$f":"Est2020DistRev!H31","v":0},{"$f":"Est2020DistRev!I31","v":0},{"$f":"Est2020DistRev!J31","v":0},{"$f":"Est2020DistRev!K31","v":0},{"$f":"Est2020DistRev!L31","v":0},{"$f":"Est2020DistRev!M31","v":0},{"$f":"Est2020DistRev!N31","v":0},{"$f":"Est2020DistRev!O31","v":0},{"$f":"Est2020DistRev!P31","v":0},null,118.2170397004956,2580392.5635897103,0,0,0,0,0,0,0,0,0,0,0,null,12531.006208252535,525086.66315743374,0,0,0,0,0,0,0,0,0,0,0,537617.66936568625,null,13949.610684658481,586745.14346440986,0,0,0,0,0,0,0,0,0,0,0,600694.75414906838]
["NEE51","NEE51  Medium Two Rate 5Day - closed to new customers - <160MWh to NEE21","NEE51  Medium Two Rate 5Day - closed to new customers - <160MWh to NEE21",106,17.582799999999999,0,0,0,3.7239,0,0,0,0,0,0,0,null,{"$f":"Est2020DistRev!D32","v":118},{"$f":"Est2020DistRev!E32","v":19.647500000000001},{"$f":"Est2020DistRev!F32","v":0},{"$f":"Est2020DistRev!G32","v":0},{"$f":"Est2020DistRev!H32","v":0},{"$f":"Est2020DistRev!I32","v":4.1612},{"$f":"Est2020DistRev!J32","v":0},{"$f":"Est2020DistRev!K32","v":0},{"$f":"Est2020DistRev!L32","v":0},{"$f":"Est2020DistRev!M32","v":0},{"$f":"Est2020DistRev!N32","v":0},{"$f":"Est2020DistRev!O32","v":0},{"$f":"Est2020DistRev!P32","v":0},null,189.93512024048087,21635948.947650295,0,0,0,18217897.32381659,0,0,0,0,0,0,0,null,20133.122745490971,3804205.6315674558,0,0,0,678416.27844160597,0,0,0,0,0,0,0,4502755.0327545526,null,22412.344188376741,4250923.0694895918,0,0,0,758083.143438656,0,0,0,0,0,0,0,5031418.557116624]
["NEE55","NEE55  Snowfields Tariff","NEE55  Snowfields Tariff",106,13.107699999999999,0,0,0,3.6657000000000002,0,0,0,0,0,0,0,null,{"$f":"Est2020DistRev!D33","v":118},{"$f":"Est2020DistRev!E33","v":14.6469},{"$f":"Est2020DistRev!F33","v":0},{"$f":"Est2020DistRev!G33","v":0},{"$f":"Est2020DistRev!H33","v":0},{"$f":"Est2020DistRev!I33","v":4.0961999999999996},{"$f":"Est2020DistRev!J33","v":0},{"$f":"Est2020DistRev!K33","v":0},{"$f":"Est2020DistRev!L33","v":0},{"$f":"Est2020DistRev!M33","v":0},{"$f":"Est2020DistRev!N33","v":0},{"$f":"Est2020DistRev!O33","v":0},{"$f":"Est2020DistRev!P33","v":0},{"$f":"Est2020DistRev!Q33","v":0},0.5,36029.745230023167,0,0,0,37046.365479643602,0,0,0,0,0,0,0,null,53,4722.6709155157469,0,0,0,1358.0086193872955,0,0,0,0,0,0,0,6133.6795349030426,null,59,5277.240754096264,0,0,0,1517.4932227771612,0,0,0,0,0,0,0,6853.7339768734255]
["NSP55","NSP55  Snowfields Tariff","NSP55  Snowfields Tariff",106,34.984400000000001,30.6126,26.791799999999999,0,2.1198999999999999,0,0,0,0,0,0,0,null,{"$f":"Est2020DistRev!D34","v":118},{"$f":"Est2020DistRev!E34","v":39.092500000000001},{"$f":"Est2020DistRev!F34","v":34.207299999999996},{"$f":"Est2020DistRev!G34","v":29.937899999999999},{"$f":"Est2020DistRev!H34","v":0},{"$f":"Est2020DistRev!I34","v":2.3687999999999998},{"$f":"Est2020DistRev!J34","v":0},{"$f":"Est2020DistRev!K34","v":0},{"$f":"Est2020DistRev!L34","v":0},{"$f":"Est2020DistRev!M34","v":0},{"$f":"Est2020DistRev!N34","v":0},{"$f":"Est2020DistRev!O34","v":0},{"$f":"Est2020DistRev!P34","v":0},{"$f":"Est2020DistRev!Q34","v":0},3.5,9550.2269132999972,54117.952508699993,25329.330215198261,0,535690.87712180172,0,0,0,0,0,0,0,null,371,3341.0895842565242,16566.912329678293,6786.1834925954872,0,11356.110904105075,0,0,0,0,0,0,0,38421.296310635378,null,413,3733.4224560818016,18512.290368508529,7583.0695504958403,0,12689.445497261238,0,0,0,0,0,0,0,42931.227872347408]
["NSP56","NSP56  Medium Demand Multi-rate","NSP56  Medium Demand Multi-rate",2282,9.9768000000000008,7.2641,0,0,3.4093,0,0,0,17.350000000000001,28.92,0,0,null,{"$f":"Est2020DistRev!D35","v":2550},{"$f":"Est2020DistRev!E35","v":11.148300000000001},{"$f":"Est2020DistRev!F35","v":8.1171000000000006},{"$f":"Est2020DistRev!G35","v":0},{"$f":"Est2020DistRev!H35","v":0},{"$f":"Est2020DistRev!I35","v":3.8096000000000001},{"$f":"Est2020DistRev!J35","v":0},{"$f":"Est2020DistRev!K35","v":0},{"$f":"Est2020DistRev!L35","v":0},{"$f":"Est2020DistRev!M35","v":19.39},{"$f":"Est2020DistRev!N35","v":32.32},{"$f":"Est2020DistRev!O35","v":0},{"$f":"Est2020DistRev!P35","v":0},{"$f":"Est2020DistRev!Q35","v":0},635.90625,42307312.421974368,32269925.84647819,0,0,53760873.801854886,0,0,0,106189.73274366086,37696.837154329616,0,0,null,1451138.0625,{"$f":"E35/100*AG35","v":4220915.9457155392},2344119.683414022,0,0,1832869.4705266384,0,0,0,{"$f":"M35*AO35","v":1842391.8631025162},{"$f":"N35*AP35","v":1090192.5305032125},{"$f":"O35*AQ35","v":0},{"$f":"P35*AR35","v":0},{"$f":"SUM(AT35:BF35)","v":12781627.555761926},null,{"$f":"R35*AF35","v":1621560.9375},{"$f":"S35/100*AG35","v":4716546.1107389694},{"$f":"T35/100*AH35","v":2619382.1508844816},{"$f":"U35/100*AI35","v":0},{"$f":"V35/100*AJ35","v":0},{"$f":"W35/100*AK35","v":2048074.2483554636},{"$f":"X35/100*AL35","v":0},{"$f":"Y35/100*AM35","v":0},{"$f":"Z35/100*AN35","v":0},{"$f":"AA35*AO35","v":2059018.9178995842},{"$f":"AB35*AP35","v":1218361.7768279333},{"$f":"AC35*AQ35","v":0},{"$f":"AD35*AR35","v":0},{"$f":"SUM(BI35:BU35)","v":14282944.142206432}]
["NEN56","NEN56  Medium Demand Multi-rate  - Embedded Network","NEN56  Medium Demand Multi-rate  - Embedded Network",2282,8.0351999999999997,5.6001000000000003,0,0,3.4832000000000001,0,0,0,17.350000000000001,28.92,0,0,null,{"$f":"Est2020DistRev!D36","v":2550},{"$f":"Est2020DistRev!E36","v":8.9786999999999999},{"$f":"Est2020DistRev!F36","v":6.2576999999999998},{"$f":"Est2020DistRev!G36","v":0},{"$f":"Est2020DistRev!H36","v":0},{"$f":"Est2020DistRev!I36","v":3.8921999999999999},{"$f":"Est2020DistRev!J36","v":0},{"$f":"Est2020DistRev!K36","v":0},{"$f":"Est2020DistRev!L36","v":0},{"$f":"Est2020DistRev!M36","v":19.39},{"$f":"Est2020DistRev!N36","v":32.32},{"$f":"Est2020DistRev!O36","v":0},{"$f":"Est2020DistRev!P36","v":0},null,1,48857.900635350845,52671.607825623178,0,0,48862.91000570199,0,0,0,260,73.394999999999996,0,0,null,2282,3925.8300318517108,2949.6627098427239,0,0,1701.9928813186118,0,0,0,4511,2122.5834,0,0,17493.069023013046,null,2550,4386.8043243462462,3296.0312029040215,0,0,1901.8421832419328,0,0,0,5041.4000000000005,2372.1264000000001,0,0,19548.204110492203]
["NEE60","NEE60  Medium Two Rate 7Day - closed to new customers","NEE60  Medium Two Rate 7Day - closed to new customers",106,9.1031999999999993,0,0,0,3.5400999999999998,0,0,0,0,0,0,0,null,{"$f":"Est2020DistRev!D37","v":118},{"$f":"Est2020DistRev!E37","v":10.1722},{"$f":"Est2020DistRev!F37","v":0},{"$f":"Est2020DistRev!G37","v":0},{"$f":"Est2020DistRev!H37","v":0},{"$f":"Est2020DistRev!I37","v":3.9558},{"$f":"Est2020DistRev!J37","v":0},{"$f":"Est2020DistRev!K37","v":0},{"$f":"Est2020DistRev!L37","v":0},{"$f":"Est2020DistRev!M37","v":0},{"$f":"Est2020DistRev!N37","v":0},{"$f":"Est2020DistRev!O37","v":0},{"$f":"Est2020DistRev!P37","v":0},null,151.6656605113636,11912095.648898043,0,0,0,3866727.1285819211,0,0,0,0,0,0,0,null,16076.56001420454,1084381.8911104866,0,0,0,136886.00707892858,0,0,0,0,0,0,0,1237344.4582036198,null,17896.547940340904,1211722.1935972068,0,0,0,152959.99175244366,0,0,0,0,0,0,0,1382578.7332899913]
["NEE52","NEE52  Unmetered","NEE52  Unmetered",0,15.1205,0,0,0,7.6657999999999999,0,0,0,0,0,0,0,null,{"$f":"Est2020DistRev!D38","v":0},{"$f":"Est2020DistRev!E38","v":16.896000000000001},{"$f":"Est2020DistRev!F38","v":0},{"$f":"Est2020DistRev!G38","v":0},{"$f":"Est2020DistRev!H38","v":0},{"$f":"Est2020DistRev!I38","v":8.5660000000000007},{"$f":"Est2020DistRev!J38","v":0},{"$f":"Est2020DistRev!K38","v":0},{"$f":"Est2020DistRev!L38","v":0},{"$f":"Est2020DistRev!M38","v":0},{"$f":"Est2020DistRev!N38","v":0},{"$f":"Est2020DistRev!O38","v":0},{"$f":"Est2020DistRev!P38","v":0},null,44.5,7313424.2443653559,0,0,0,18444180.326888889,0,0,0,0,0,0,0,null,0,1105826.3128692636,0,0,0,1413893.9754986486,0,0,{"$f":"L38/100*AN38","v":0},0,0,0,0,2519720.2883679122,null,0,1235676.1603279705,0,0,0,1579928.4868013025,0,0,0,0,0,0,0,2815604.647129273]
["NEE74","NEE74  LV Large Two Rate 5Day","NEE74  LV Large Two Rate 5Day",127,22.533300000000001,0,0,0,6.4017999999999997,0,0,0,0,0,0,0,null,{"$f":"Est2020DistRev!D39","v":142},{"$f":"Est2020DistRev!E39","v":25.179300000000001},{"$f":"Est2020DistRev!F39","v":0},{"$f":"Est2020DistRev!G39","v":0},{"$f":"Est2020DistRev!H39","v":0},{"$f":"Est2020DistRev!I39","v":7.1535000000000002},{"$f":"Est2020DistRev!J39","v":0},{"$f":"Est2020DistRev!K39","v":0},{"$f":"Est2020DistRev!L39","v":0},{"$f":"Est2020DistRev!M39","v":0},{"$f":"Est2020DistRev!N39","v":0},{"$f":"Est2020DistRev!O39","v":0},{"$f":"Est2020DistRev!P39","v":0},null,3.5,941231.65833174856,0,0,0,1062334.4272307118,0,0,0,0,0,0,0,null,444.5,212090.55326686791,0,0,0,68008.525362455694,0,0,0,0,0,0,0,280543.57862932363,null,497,236995.54294632596,0,0,0,75994.093251948972,0,0,0,0,0,0,0,313486.63619827491]
["NSP75","NSP75  Large Multi-rate <750 kVA","NSP75  Large Multi-rate <750 kVA",5102,2.9014000000000002,1.9659,0,0,1.1213,0,0,0,42.16,70.709999999999994,0,0,null,{"$f":"Est2020DistRev!D40","v":5701},{"$f":"Est2020DistRev!E40","v":3.2421000000000002},{"$f":"Est2020DistRev!F40","v":2.1968000000000001},{"$f":"Est2020DistRev!G40","v":0},{"$f":"Est2020DistRev!H40","v":0},{"$f":"Est2020DistRev!I40","v":1.2529999999999999},{"$f":"Est2020DistRev!J40","v":0},{"$f":"Est2020DistRev!K40","v":0},{"$f":"Est2020DistRev!L40","v":0},{"$f":"Est2020DistRev!M40","v":47.11},{"$f":"Est2020DistRev!N40","v":79.010000000000005},{"$f":"Est2020DistRev!O40","v":0},{"$f":"Est2020DistRev!P40","v":0},null,399.73750000000018,65066965.823548958,46895776.109417975,0,0,87211176.761339754,0,0,0,106150.66325231486,47175.123367353335,0,0,null,2039460.725000001,1887852.9464044496,921924.062535048,0,0,977898.92502490256,0,0,0,4475311.9627175936,3335752.9733055541,0,0,13638201.594987549,null,2278903.4875000012,2109536.0989652812,1030206.4095716941,0,0,1092756.0448195871,0,0,0,5000757.745816553,3727306.4972545872,0,0,15239466.283927705]
["NSP76","NSP76  Large Multi-rate >750 kVA","NSP76  Large Multi-rate >750 kVA",5102,2.6821000000000002,1.7577,0,0,0.99670000000000003,0,0,0,43.96,74.34,0,0,null,{"$f":"Est2020DistRev!D41","v":5701},{"$f":"Est2020DistRev!E41","v":2.9969999999999999},{"$f":"Est2020DistRev!F41","v":1.9641},{"$f":"Est2020DistRev!G41","v":0},{"$f":"Est2020DistRev!H41","v":0},{"$f":"Est2020DistRev!I41","v":1.1136999999999999},{"$f":"Est2020DistRev!J41","v":0},{"$f":"Est2020DistRev!K41","v":0},{"$f":"Est2020DistRev!L41","v":0},{"$f":"Est2020DistRev!M41","v":49.12},{"$f":"Est2020DistRev!N41","v":83.07},{"$f":"Est2020DistRev!O41","v":0},{"$f":"Est2020DistRev!P41","v":0},null,276.04374999999987,96539748.775621518,70796917.756179661,0,0,125406478.88905282,0,0,0,145281.41982565779,64874.075578297932,0,0,null,1408375.2124999994,2589292.601910945,1244397.4234003697,0,0,1249926.3750871895,0,0,0,6386571.2155359164,4822738.7784906682,0,0,17701301.606925085,null,1573725.4187499993,2893296.270805377,1390522.2616491246,0,0,1396651.9553873811,0,0,0,7136223.3418363109,5389089.4582892088,0,0,19779508.706717402]
["NSP77","NSP77  Large Multi-rate >2 GWh","NSP77  Large Multi-rate >2 GWh",5102,2.6291000000000002,1.7343,0,0,0.93889999999999996,0,0,0,48.19,80,0,0,null,{"$f":"Est2020DistRev!D42","v":5701},{"$f":"Est2020DistRev!E42","v":2.9378000000000002},{"$f":"Est2020DistRev!F42","v":1.9379},{"$f":"Est2020DistRev!G42","v":0},{"$f":"Est2020DistRev!H42","v":0},{"$f":"Est2020DistRev!I42","v":1.0491999999999999},{"$f":"Est2020DistRev!J42","v":0},{"$f":"Est2020DistRev!K42","v":0},{"$f":"Est2020DistRev!L42","v":0},{"$f":"Est2020DistRev!M42","v":53.85},{"$f":"Est2020DistRev!N42","v":89.39},{"$f":"Est2020DistRev!O42","v":0},{"$f":"Est2020DistRev!P42","v":0},null,42.237499999999997,32246242.093563192,22577275.465703305,0,0,41375655.650008813,0,0,0,39295.959821428572,19178.786775914636,0,0,null,215495.72499999998,847785.95088186988,391557.68840169243,0,0,388476.03089793271,0,0,0,1893672.3037946429,1534302.9420731708,0,0,5271290.6410493087,null,240795.98749999999,947330.10022469948,437525.02124986437,0,0,434113.37907989242,0,0,0,2116087.4363839286,1714391.7498990092,0,0,5890243.6743373945]
["NSP78","NSP78  Large Multi-rate >4 GWh","NSP78  Large Multi-rate >4 GWh",5102,2.3494999999999999,1.5507,0,0,0.81100000000000005,0,0,0,53.01,87.71,0,0,null,{"$f":"Est2020DistRev!D43","v":5701},{"$f":"Est2020DistRev!E43","v":2.6254},{"$f":"Est2020DistRev!F43","v":1.7327999999999999},{"$f":"Est2020DistRev!G43","v":0},{"$f":"Est2020DistRev!H43","v":0},{"$f":"Est2020DistRev!I43","v":0.90620000000000001},{"$f":"Est2020DistRev!J43","v":0},{"$f":"Est2020DistRev!K43","v":0},{"$f":"Est2020DistRev!L43","v":0},{"$f":"Est2020DistRev!M43","v":59.24},{"$f":"Est2020DistRev!N43","v":98.01},{"$f":"Est2020DistRev!O43","v":0},{"$f":"Est2020DistRev!P43","v":0},null,17.737499999999997,25893028.545737665,17970261.114019543,0,0,33397961.120601483,0,0,0,25171.599264705874,16125.000503906245,0,0,null,90496.724999999991,608356.70568210643,278664.83909510105,0,0,270857.46468807803,0,0,0,1334346.4770220583,1414323.7941976166,0,0,3997046.0056849602,null,101121.48749999999,679795.57143979659,311388.68458373065,0,0,302652.32367489068,0,0,0,1491165.5404411759,1580411.2993878513,0,0,4466534.9070274457]
["NSP81","NSP81  HV Kva","NSP81  HV Kva",5102,0.51190000000000002,0,0,0,0.20710000000000001,0,0,0,34.700000000000003,56.86,0,0,null,{"$f":"Est2020DistRev!D44","v":5701},{"$f":"Est2020DistRev!E44","v":0.57199999999999995},{"$f":"Est2020DistRev!F44","v":0},{"$f":"Est2020DistRev!G44","v":0},{"$f":"Est2020DistRev!H44","v":0},{"$f":"Est2020DistRev!I44","v":0.23139999999999999},{"$f":"Est2020DistRev!J44","v":0},{"$f":"Est2020DistRev!K44","v":0},{"$f":"Est2020DistRev!L44","v":0},{"$f":"Est2020DistRev!M44","v":38.770000000000003},{"$f":"Est2020DistRev!N44","v":63.54},{"$f":"Est2020DistRev!O44","v":0},{"$f":"Est2020DistRev!P44","v":0},null,30.237499999999997,124298431.5797957,0,0,0,105890467.84826557,0,0,0,97969.5,42579.599664215682,0,0,null,154271.72499999998,636283.67125697422,0,0,0,219299.158913758,0,0,0,3399541.6500000004,2421076.0369073036,0,0,6830472.2420780361,null,172383.98749999999,710987.02863643132,0,0,0,245030.54260088655,0,0,0,3798277.5150000001,2705507.7626642645,0,0,7632186.8364015818]
["NSP82","NSP82  Traction","NSP82  Traction",5102,0.46010000000000001,0.46010000000000001,0,0,0.39200000000000002,0,0,0,31.81,52.05,0,0,null,{"$f":"Est2020DistRev!D45","v":5701},{"$f":"Est2020DistRev!E45","v":0.5141},{"$f":"Est2020DistRev!F45","v":0.5141},{"$f":"Est2020DistRev!G45","v":0},{"$f":"Est2020DistRev!H45","v":0},{"$f":"Est2020DistRev!I45","v":0.438},{"$f":"Est2020DistRev!J45","v":0},{"$f":"Est2020DistRev!K45","v":0},{"$f":"Est2020DistRev!L45","v":0},{"$f":"Est2020DistRev!M45","v":35.54},{"$f":"Est2020DistRev!N45","v":58.16},{"$f":"Est2020DistRev!O45","v":0},{"$f":"Est2020DistRev!P45","v":0}]
["NSP83","NSP83  Small HV","NSP83  Small HV",5102,8.6372,3.0223,0,0,0.94120000000000004,0,0,0,3.7,6.12,0,0,null,{"$f":"Est2020DistRev!D46","v":5701},{"$f":"Est2020DistRev!E46","v":9.6514000000000006},{"$f":"Est2020DistRev!F46","v":3.3772000000000002},{"$f":"Est2020DistRev!G46","v":0},{"$f":"Est2020DistRev!H46","v":0},{"$f":"Est2020DistRev!I46","v":1.0517000000000001},{"$f":"Est2020DistRev!J46","v":0},{"$f":"Est2020DistRev!K46","v":0},{"$f":"Est2020DistRev!L46","v":0},{"$f":"Est2020DistRev!M46","v":4.1399999999999997},{"$f":"Est2020DistRev!N46","v":6.84},{"$f":"Est2020DistRev!O46","v":0},{"$f":"Est2020DistRev!P46","v":0},null,10.237499999999997,2797789.0999321593,1951495.4974704923,0,0,2416770.4731495506,0,0,0,12870.812499999998,3028.0285546874989,0,0,null,52231.724999999984,241650.64013934048,58980.048420050691,0,0,22746.643693283571,0,0,0,47622.006249999999,18531.534754687495,0,0,441762.5982573622,null,58363.987499999981,270025.81719085242,65905.905940573473,0,0,25417.175066113825,0,0,0,53285.163749999985,20711.715314062491,0,0,493709.76476160222]
["NSP91","NSP91  ST kVA","NSP91  ST kVA",18184,0.46450000000000002,0,0,0,4.3700000000000003E-2,0,0,0,2.3199999999999998,3.82,0,0,null,{"$f":"Est2020DistRev!D47","v":20319},{"$f":"Est2020DistRev!E47","v":0.51900000000000002},{"$f":"Est2020DistRev!F47","v":0},{"$f":"Est2020DistRev!G47","v":0},{"$f":"Est2020DistRev!H47","v":0},{"$f":"Est2020DistRev!I47","v":4.8800000000000003E-2},{"$f":"Est2020DistRev!J47","v":0},{"$f":"Est2020DistRev!K47","v":0},{"$f":"Est2020DistRev!L47","v":0},{"$f":"Est2020DistRev!M47","v":2.59},{"$f":"Est2020DistRev!N47","v":4.2699999999999996},{"$f":"Est2020DistRev!O47","v":0},{"$f":"Est2020DistRev!P47","v":0}]
["NEE93","NEE93  Latrobe Generators kVA (non published)","NEE93  Latrobe Generators kVA (non published)",0,0.91249999999999998,0,0,0,0.91249999999999998,0,0,0,0,0,0,0,null,{"$f":"Est2020DistRev!D48","v":0},{"$f":"Est2020DistRev!E48","v":1.0197000000000001},{"$f":"Est2020DistRev!F48","v":0},{"$f":"Est2020DistRev!G48","v":0},{"$f":"Est2020DistRev!H48","v":0},{"$f":"Est2020DistRev!I48","v":1.0196000000000001},{"$f":"Est2020DistRev!J48","v":0},{"$f":"Est2020DistRev!K48","v":0},{"$f":"Est2020DistRev!L48","v":0},{"$f":"Est2020DistRev!M48","v":0},{"$f":"Est2020DistRev!N48","v":0},{"$f":"Est2020DistRev!O48","v":0},{"$f":"Est2020DistRev!P48","v":0}]
["NSP94","NSP94  - ST kVA >25MVA <20kM","NSP94  - ST kVA >25MVA <20kM",18184,0.432,0,0,0,2.7699999999999999E-2,0,0,0,1.73,2.87,0,0,null,{"$f":"Est2020DistRev!D49","v":20319},{"$f":"Est2020DistRev!E49","v":0.48270000000000002},{"$f":"Est2020DistRev!F49","v":0},{"$f":"Est2020DistRev!G49","v":0},{"$f":"Est2020DistRev!H49","v":0},{"$f":"Est2020DistRev!I49","v":3.1E-2},{"$f":"Est2020DistRev!J49","v":0},{"$f":"Est2020DistRev!K49","v":0},{"$f":"Est2020DistRev!L49","v":0},{"$f":"Est2020DistRev!M49","v":1.93},{"$f":"Est2020DistRev!N49","v":3.21},{"$f":"Est2020DistRev!O49","v":0},{"$f":"Est2020DistRev!P49","v":0}]
["NSP95","NSP95  - ST kVA <25MVA >20kM","NSP95  - ST kVA <25MVA >20kM",18184,0.50119999999999998,0,0,0,6.3100000000000003E-2,0,0,0,3.59,5.96,0,0,null,{"$f":"Est2020DistRev!D50","v":20319},{"$f":"Est2020DistRev!E50","v":0.56010000000000004},{"$f":"Est2020DistRev!F50","v":0},{"$f":"Est2020DistRev!G50","v":0},{"$f":"Est2020DistRev!H50","v":0},{"$f":"Est2020DistRev!I50","v":7.0499999999999993E-2},{"$f":"Est2020DistRev!J50","v":0},{"$f":"Est2020DistRev!K50","v":0},{"$f":"Est2020DistRev!L50","v":0},{"$f":"Est2020DistRev!M50","v":4.01},{"$f":"Est2020DistRev!N50","v":6.66},{"$f":"Est2020DistRev!O50","v":0},{"$f":"Est2020DistRev!P50","v":0}]
["NASN19","NASN19 - Business >40MWh Single Rate","NASN19 - Business >40MWh Single Rate",106,12.548400000000001,12.548400000000001,0,0,0,0,0,0,1.73,6.91,0,0,null,{"$f":"Est2020DistRev!D51","v":118},{"$f":"Est2020DistRev!E51","v":14.0219},{"$f":"Est2020DistRev!F51","v":14.0219},{"$f":"Est2020DistRev!G51","v":0},{"$f":"Est2020DistRev!H51","v":0},{"$f":"Est2020DistRev!I51","v":0},{"$f":"Est2020DistRev!J51","v":0},{"$f":"Est2020DistRev!K51","v":0},{"$f":"Est2020DistRev!L51","v":0},{"$f":"Est2020DistRev!M51","v":1.45},{"$f":"Est2020DistRev!N51","v":5.8},{"$f":"Est2020DistRev!O51","v":0},{"$f":"Est2020DistRev!P51","v":0},null,538.88757058489909,25110693.908453003,0,0,0,0,0,0,0,46042.525159725694,57855.168031556212,0,0,null,57122.082481999307,3150990.3144083167,0,0,0,0,0,0,0,79653.568526325456,399779.21109805343,0,0,3687545.1765146949,null,63588.73332901809,3520996.389149372,0,0,0,0,0,0,0,66761.661481602248,335559.97458302602,0,0,3986906.7585430183]
["NASN21","NASN21 - Business >40MWh Two Rate","NASN21 - Business >40MWh Two Rate",106,12.890599999999999,0,0,0,2.7866,0,null,0,1.73,6.91,0,0,null,{"$f":"Est2020DistRev!D52","v":118},{"$f":"Est2020DistRev!E52","v":14.404299999999999},{"$f":"Est2020DistRev!F52","v":0},{"$f":"Est2020DistRev!G52","v":0},{"$f":"Est2020DistRev!H52","v":0},{"$f":"Est2020DistRev!I52","v":3.1137999999999999},{"$f":"Est2020DistRev!J52","v":0},{"$f":"Est2020DistRev!K52","v":0.59750000000000003},{"$f":"Est2020DistRev!L52","v":0},{"$f":"Est2020DistRev!M52","v":1.45},{"$f":"Est2020DistRev!N52","v":5.8},{"$f":"Est2020DistRev!O52","v":0},{"$f":"Est2020DistRev!P52","v":0},null,4310.6126922669546,142345744.55856839,0,0,0,121263382.52617116,0,-3978461.3033247795,0,494986.76394302316,641947.97495058272,0,0,null,456924.9453802972,18349220.548066817,0,0,0,3379125.4174742852,0,0,0,856327.10162143002,4435860.5069085266,0,0,27477458.519451357,null,508652.29768750066,20503908.083449867,0,0,0,3775899.2050999175,0,-23771.306287365558,0,717730.80771738361,3723298.2547133798,0,0,29205717.34238068]
["NASN11","NASN11 - Residential Single Rate","NASN11 - Residential Single Rate",106,4.9493999999999998,4.9493999999999998,0,0,0,0,null,0,2.16,8.64,0,0,null,{"$f":"Est2020DistRev!D53","v":118},{"$f":"Est2020DistRev!E53","v":5.5305999999999997},{"$f":"Est2020DistRev!F53","v":5.5305999999999997},{"$f":"Est2020DistRev!G53","v":0},{"$f":"Est2020DistRev!H53","v":0},{"$f":"Est2020DistRev!I53","v":0},{"$f":"Est2020DistRev!J53","v":0},{"$f":"Est2020DistRev!K53","v":0.59750000000000003},{"$f":"Est2020DistRev!L53","v":0},{"$f":"Est2020DistRev!M53","v":2.41},{"$f":"Est2020DistRev!N53","v":9.66},{"$f":"Est2020DistRev!O53","v":0},{"$f":"Est2020DistRev!P53","v":0},null,19.966929673442056,80493.510867320554,0,0,0,0,0,-17314.276666666665,0,253.94151057393117,378.09607402309706,0,0,null,2116.4945453848582,3983.9458268671633,0,0,0,0,0,0,0,548.51366283969139,3266.7500795595588,0,0,9915.7041146512711,null,2356.0977014661626,4451.7741120280298,0,0,0,0,0,-103.45280308333332,0,611.9990404831741,3652.4080750631178,0,0,10968.82612595715]
["NASN12","NASN12 - Business Single Rate","NASN12 - Business Single Rate",106,10.1744,10.1744,0,0,0,0,null,0,2.16,8.64,0,0,null,{"$f":"Est2020DistRev!D54","v":118},{"$f":"Est2020DistRev!E54","v":11.3691},{"$f":"Est2020DistRev!F54","v":11.3691},{"$f":"Est2020DistRev!G54","v":0},{"$f":"Est2020DistRev!H54","v":0},{"$f":"Est2020DistRev!I54","v":0},{"$f":"Est2020DistRev!J54","v":0},{"$f":"Est2020DistRev!K54","v":0.59750000000000003},{"$f":"Est2020DistRev!L54","v":0},{"$f":"Est2020DistRev!M54","v":2.41},{"$f":"Est2020DistRev!N54","v":9.66},{"$f":"Est2020DistRev!O54","v":0},{"$f":"Est2020DistRev!P54","v":0},null,3.4437852924496077,64170.787285383543,0,0,0,0,0,0,0,301.88300295419225,587.75571651416521,0,0,null,365.04124099965844,6528.9925815640636,0,0,0,0,0,0,0,652.06728638105528,5078.2093906823875,0,0,12624.310499627165,null,406.36666450905369,7295.6409772625402,0,0,0,0,0,0,0,727.53803711960336,5677.7202215268362,0,0,14107.265900418035]
[null,null,null,null,null,null,null,null,null,null,null,null,null,null,null,null,null,null,null,null,null,null,null,null,null,null,null,null,null,null,null,null,null,null,null,null,null,null,null,null,null,null,null,null,null,0,0,0,0,0,0,0,0,0,0,0,0,0,0,null,0,0,0,0,0,0,0,0,0,0,0,0,0,0]
[null,null,null,null,null,null,null,null,null,null,null,null,null,null,null,null,null,null,null,null,null,null,null,null,null,null,null,null,null,null,null,null,null,null,null,null,null,null,null,null,null,null,null,null,null,0,0,0,0,0,0,0,0,0,0,0,0,0,0,null,0,0,0,0,0,0,0,0,0,0,0,0,0,0]
[null,null,null,null,null,null,null,null,null,null,null,null,null,null,null,null,null,null,null,null,null,null,null,null,null,null,null,null,null,null,null,null,null,null,null,null,null,null,null,null,null,null,null,null,null,0,0,0,0,0,0,0,0,0,0,0,0,0,0,null,0,0,0,0,0,0,0,0,0,0,0,0,0,0]
[null,null,null,null,null,null,null,null,null,null,null,null,null,null,null,null,null,null,null,null,null,null,null,null,null,null,null,null,null,null,null,null,null,null,null,null,null,null,null,null,null,null,null,null,null,0,0,0,0,0,0,0,0,0,0,0,0,0,0,null,0,0,0,0,0,0,0,0,0,0,0,0,0,0]
[null,null,null,null,null,null,null,null,null,null,null,null,null,null,null,null,null,null,null,null,null,null,null,null,null,null,null,null,null,null,null,null,null,null,null,null,null,null,null,null,null,null,null,null,null,0,0,0,0,0,0,0,0,0,0,0,0,0,0,null,0,0,0,0,0,0,0,0,0,0,0,0,0,0]
[null,null,null,null,null,null,null,null,null,null,null,null,null,null,null,null,null,null,null,null,null,null,null,null,null,null,null,null,null,null,null,null,null,null,null,null,null,null,null,null,null,null,null,null,null,0,0,0,0,0,0,0,0,0,0,0,0,0,0,null,0,0,0,0,0,0,0,0,0,0,0,0,0,0]
[null,null,null,null,null,null,null,null,null,null,null,null,null,null,null,null,null,null,null,null,null,null,null,null,null,null,null,null,null,null,null,null,null,null,null,null,null,null,null,null,null,null,null,null,null,0,0,0,0,0,0,0,0,0,0,0,0,0,0,null,0,0,0,0,0,0,0,0,0,0,0,0,0,0]
[null,null,null,null,null,null,null,null,null,null,null,null,null,null,null,null,null,null,null,null,null,null,null,null,null,null,null,null,null,null,null,null,null,null,null,null,null,null,null,null,null,null,null,null,null,0,0,0,0,0,0,0,0,0,0,0,0,0,0,null,0,0,0,0,0,0,0,0,0,0,0,0,0,0]
[null,null,null,null,null,null,null,null,null,null,null,null,null,null,null,null,null,null,null,null,null,null,null,null,null,null,null,null,null,null,null,null,null,null,null,null,null,null,null,null,null,null,null,null,null,0,0,0,0,0,0,0,0,0,0,0,0,0,0,null,0,0,0,0,0,0,0,0,0,0,0,0,0,0]
[null,null,null,null,null,null,null,null,null,null,null,null,null,null,null,null,null,null,null,null,null,null,null,null,null,null,null,null,null,null,null,null,null,null,null,null,null,null,null,null,null,null,null,null,null,0,0,0,0,0,0,0,0,0,0,0,0,0,0,null,0,0,0,0,0,0,0,0,0,0,0,0,0,0]
[null,null,null,null,null,null,null,null,null,null,null,null,null,null,null,null,null,null,null,null,null,null,null,null,null,null,null,null,null,null,null,null,null,null,null,null,null,null,null,null,null,null,null,null,null,0,0,0,0,0,0,0,0,0,0,0,0,0,0,null,0,0,0,0,0,0,0,0,0,0,0,0,0,0]
[null,null,null,null,null,null,null,null,null,null,null,null,null,null,null,null,null,null,null,null,null,null,null,null,null,null,null,null,null,null,null,382047.16666666657,1786652651.8820281,531414916.41767955,1510878.3588037968,0,1214863393.8000841,0,-148486500.78962293,0,1175008.638524045,968350.26590888109,0,0,null,46691051.033937193,145347709.00843957,38462767.509175725,141287.49427972225,0,23904204.504533064,0,0,0,21444267.250394706,20065755.574775912,0,0,296057042.37553585,null,52068709.588641278,161429613.79257086,42979342.606016912,154585.19588945314,0,26479169.012620986,0,-887206.84221799707,0,23700379.202154145,21077537.446480915,0,0,327002130.00215673]

{"sheet":"2021DistRevCapForm","index":10,"n_rows":11,"n_cols":3,"rows_kept":11,"cut":false,"hidden":false,"merged":[]}
[]
[null,{"$f":"\"Tariff Approval - \"&'Model update'!$C$3","v":"Tariff Approval - AusNet Services"},{"$f":"'Model update'!$C$5&\"DistRevCapForm\"","v":"2021DistRevCapForm"}]
[]
[null," DUoS"]
[]
[null,"Year (t)",{"$f":"'Model update'!C5","v":2021}]
[]
[null,"Table 1- Compliance with AER Final Determination Total Annual Revenue"]
[null,"Revenue from DUoS charges for year t",{"$f":"Prop2021DistTar!BG66","v":296057042.37553585}]
[null,"Total Annual Revenue for year t",296082545.54450083]
[null,null,{"$f":"IF(C9=\"\",\"\",IF(C10>=C9,\"DUoS REVENUE CAP FORMULA COMPLIANT\",\"DUoS REVENUE CAP FORMULA BREACHED\"))","v":"DUoS REVENUE CAP FORMULA COMPLIANT"}]

{"sheet":"2021DistTarRebalCont","index":11,"n_rows":104,"n_cols":62,"rows_kept":104,"cut":false,"hidden":false,"merged":[]}
[null,{"$f":"\"Tariff Approval - \"&'Model update'!C3","v":"Tariff Approval - AusNet Services"},{"$f":"'Model update'!$C$5&\"DistTarRebalCont\"","v":"2021DistTarRebalCont"}]
[]
[null,{"$f":"'Model update'!C5&\" DISTRIBUTION TARIFF REBALANCING CONTROL\"","v":"2021 DISTRIBUTION TARIFF REBALANCING CONTROL"}]
[]
[]
[null,"Distribution tariff rebalancing control"]
[]
[null,{"$f":"\"CPI \"&'Model update'!$C$5","v":"CPI 2021"},{"$f":"'Model update'!C30","v":-3.4843205574912606E-3}]
[]
[]
[]
[]
[]
[]
[]
[null,null,{"$f":"(1+C8)*(1-C9)*(1+0.02)*(1+C10)+SUM(C11:C13)","v":1.016445993031359}]
[]
[]
[]
[null,"Rebalancing control summary",{"$f":"\"Pt-1*(Qt \" &'Model update'!$C$5&\")\"","v":"Pt-1*(Qt 2021)"},{"$f":"\"Pt*(Qt \" &'Model update'!$C$5&\")\"","v":"Pt*(Qt 2021)"}]
[null,"Tariff Class (Input Class Name)","Existing ($)","Proposed ($)","Movement"]
[null,"Small Residential",{"$f":"IF(B22=\"\",\"\",SUMIF($B$44:$B$103,$B22,$I$44:$I$103))","v":179043666.32007283},{"$f":"IF(B22=\"\",\"\",SUMIF($B$44:$B$103,$B22,$F$44:$F$103))","v":162137308.04653144},{"$f":"IF(B22=\"\",\"\",D22/C22)","v":0.90557410590934717},{"$f":"IF(B22=\"\",\"\",IF(E22<$C$16,\"COMPLIANT\",\"BREACHED\"))","v":"COMPLIANT"}]
[null,"Small Industrial Commercial",{"$f":"IF(B23=\"\",\"\",SUMIF($B$44:$B$103,$B23,$I$44:$I$103))","v":66191389.994472891},{"$f":"IF(B23=\"\",\"\",SUMIF($B$44:$B$103,$B23,$F$44:$F$103))","v":60744503.851083837},0.91771005044849674,"COMPLIANT"]
[null,"Medium Industrial Commercial",{"$f":"IF(B24=\"\",\"\",SUMIF($B$44:$B$103,$B24,$I$44:$I$103))","v":24182573.9998511},{"$f":"IF(B24=\"\",\"\",SUMIF($B$44:$B$103,$B24,$F$44:$F$103))","v":21641113.049322248},0.89490527556973454,"COMPLIANT"]
[null,"Large-1 Industrial Commercial",{"$f":"IF(B25=\"\",\"\",SUMIF($B$44:$B$103,$B25,$I$44:$I$103))","v":15552952.92012598},{"$f":"IF(B25=\"\",\"\",SUMIF($B$44:$B$103,$B25,$F$44:$F$103))","v":13918745.173616873},0.89492620758888852,"COMPLIANT"]
[null,"Large-2 Industrial Commercial",{"$f":"IF(B26=\"\",\"\",SUMIF($B$44:$B$103,$B26,$I$44:$I$103))","v":19779508.706717402},{"$f":"IF(B26=\"\",\"\",SUMIF($B$44:$B$103,$B26,$F$44:$F$103))","v":17701301.606925085},0.89493130842595059,"COMPLIANT"]
[null,"Large-3 Industrial Commercial",{"$f":"IF(B27=\"\",\"\",SUMIF($B$44:$B$103,$B27,$I$44:$I$103))","v":5890243.6743373945},{"$f":"IF(B27=\"\",\"\",SUMIF($B$44:$B$103,$B27,$F$44:$F$103))","v":5271290.6410493087},{"$f":"IF(B27=\"\",\"\",D27/C27)","v":0.89491894266026051},{"$f":"IF(B27=\"\",\"\",IF(E27<$C$16,\"COMPLIANT\",\"BREACHED\"))","v":"COMPLIANT"}]
[null,"Large-4 Industrial Commercial",4466534.9070274457,3997046.0056849602,0.89488744382053009,"COMPLIANT"]
[null,"High Voltage-1 Industrial Commercial",7632186.8364015818,6830472.2420780361,0.89495611002343622,"COMPLIANT"]
[null,"High Voltage-2 Industrial Commercial"]
[null,"High Voltage-3 Industrial Commercial",493709.76476160222,441762.5982573622,0.89478197473099652,"COMPLIANT"]
[null,"Extra High Voltage-1 Industrial Commercial"]
[null,"Extra High Voltage-2 Industrial Commercial"]
[null,"Extra High Voltage-3 Industrial Commercial"]
[null,"Extra High Voltage-4 Industrial Commercial"]
[null,null,{"$f":"IF(B36=\"\",\"\",SUMIF($B$44:$B$103,$B36,$I$44:$I$103))","v":""},{"$f":"IF(B36=\"\",\"\",SUMIF($B$44:$B$103,$B36,$F$44:$F$103))","v":""},"",""]
[null,null,"","","",""]
[null,null,"","","",""]
[null,"Check Total","Ok","Ok"]
[null,null,"Ok","Ok"]
[]
[null,null,null,null,null,{"$f":"\"Revenue (Pt \"&'Model update'!$C$5&\")*(Qt \" &'Model update'!$C$5&\")\"","v":"Revenue (Pt 2021)*(Qt 2021)"},null,null,{"$f":"\"Revenue (Pt-1 \"&'Model update'!$C$8&\")*(Qt \" &'Model update'!$C$5&\")\"","v":"Revenue (Pt-1 2020)*(Qt 2021)"}]
["New Tariff Test","Destination tariff class","Source tariff class","Proposed tariff","Existing tariff","PropRev\nTotal",null,null,"ExistRev\nTotal"]
[{"$f":"OR(EXACT(D44,Prop2021DistTar!C$6:C$65))","v":true},"Small Residential","Small Residential",{"$f":"IF(Prop2021DistTar!B6=\"\",\"\",Prop2021DistTar!B6)","v":"NEE11  Small Single Rate < 160MWh"},{"$f":"IF(Prop2021DistTar!C6=\"\",\"\",Prop2021DistTar!C6)","v":"NEE11  Small Single Rate < 160MWh"},{"$f":"Prop2021DistTar!BG6","v":105722974.15008634},null,null,{"$f":"Prop2021DistTar!BV6","v":118030740.87643051}]
[{"$f":"OR(EXACT(D45,Prop2021DistTar!C$6:C$65))","v":true},"Small Residential","Small Residential",{"$f":"IF(Prop2021DistTar!B7=\"\",\"\",Prop2021DistTar!B7)","v":"NGT11  Small Interval Single Rate < 160MWh"},{"$f":"IF(Prop2021DistTar!C7=\"\",\"\",Prop2021DistTar!C7)","v":"NGT11  Small Interval Single Rate < 160MWh"},{"$f":"Prop2021DistTar!BG7","v":2081.5795552202553},null,null,{"$f":"Prop2021DistTar!BV7","v":2324.2224608754223}]
[{"$f":"OR(EXACT(D46,Prop2021DistTar!C$6:C$65))","v":true},"Small Residential","Small Residential",{"$f":"IF(Prop2021DistTar!B8=\"\",\"\",Prop2021DistTar!B8)","v":"NSP11  Small Single Rate < 160MWh"},{"$f":"IF(Prop2021DistTar!C8=\"\",\"\",Prop2021DistTar!C8)","v":"NSP11  Small Single Rate < 160MWh"},{"$f":"Prop2021DistTar!BG8","v":0},null,null,{"$f":"Prop2021DistTar!BV8","v":0}]
[{"$f":"OR(EXACT(D47,Prop2021DistTar!C$6:C$65))","v":true},"Small Residential","Small Residential",{"$f":"IF(Prop2021DistTar!B9=\"\",\"\",Prop2021DistTar!B9)","v":"NEN11  Small Single Rate < 160MWh Embedded Network"},{"$f":"IF(Prop2021DistTar!C9=\"\",\"\",Prop2021DistTar!C9)","v":"NEN11  Small Single Rate < 160MWh Embedded Network"},{"$f":"Prop2021DistTar!BG9","v":0},null,null,{"$f":"Prop2021DistTar!BV9","v":0}]
[{"$f":"OR(EXACT(D48,Prop2021DistTar!C$6:C$65))","v":true},"Small Industrial Commercial","Small Industrial Commercial",{"$f":"IF(Prop2021DistTar!B10=\"\",\"\",Prop2021DistTar!B10)","v":"NEE12  Small Business Single Rate - new in 2001"},{"$f":"IF(Prop2021DistTar!C10=\"\",\"\",Prop2021DistTar!C10)","v":"NEE12  Small Business Single Rate - new in 2001"},{"$f":"Prop2021DistTar!BG10","v":11493463.128882527},null,null,{"$f":"Prop2021DistTar!BV10","v":12836450.30743897}]
[{"$f":"OR(EXACT(D49,Prop2021DistTar!C$6:C$65))","v":true},"Small Industrial Commercial","Small Industrial Commercial",{"$f":"IF(Prop2021DistTar!B11=\"\",\"\",Prop2021DistTar!B11)","v":"NSP12  Small Business Single Rate - new in 2001"},{"$f":"IF(Prop2021DistTar!C11=\"\",\"\",Prop2021DistTar!C11)","v":"NSP12  Small Business Single Rate - new in 2001"},{"$f":"Prop2021DistTar!BG11","v":0},null,null,{"$f":"Prop2021DistTar!BV11","v":0}]
[{"$f":"OR(EXACT(D50,Prop2021DistTar!C$6:C$65))","v":true},"Small Industrial Commercial","Small Industrial Commercial",{"$f":"IF(Prop2021DistTar!B12=\"\",\"\",Prop2021DistTar!B12)","v":"NEN12  Small Business Single Rate - Embedded Network"},{"$f":"IF(Prop2021DistTar!C12=\"\",\"\",Prop2021DistTar!C12)","v":"NEN12  Small Business Single Rate - Embedded Network"},{"$f":"Prop2021DistTar!BG12","v":0},null,null,{"$f":"Prop2021DistTar!BV12","v":0}]
[{"$f":"OR(EXACT(D51,Prop2021DistTar!C$6:C$65))","v":true},"Small Residential","Small Residential",{"$f":"IF(Prop2021DistTar!B13=\"\",\"\",Prop2021DistTar!B13)","v":"NEE20  Small Two Rate"},{"$f":"IF(Prop2021DistTar!C13=\"\",\"\",Prop2021DistTar!C13)","v":"NEE20  Small Two Rate"},{"$f":"Prop2021DistTar!BG13","v":15956295.485074775},null,null,{"$f":"Prop2021DistTar!BV13","v":17434571.521710932}]
[{"$f":"OR(EXACT(D52,Prop2021DistTar!C$6:C$65))","v":true},"Small Residential","Small Residential",{"$f":"IF(Prop2021DistTar!B14=\"\",\"\",Prop2021DistTar!B14)","v":"NSP20  Small Two Rate"},{"$f":"IF(Prop2021DistTar!C14=\"\",\"\",Prop2021DistTar!C14)","v":"NSP20  Small Two Rate"},{"$f":"Prop2021DistTar!BG14","v":2726.9941541552903},null,null,{"$f":"Prop2021DistTar!BV14","v":3044.095028365432}]
[{"$f":"OR(EXACT(D53,Prop2021DistTar!C$6:C$65))","v":true},"Small Residential","Small Residential",{"$f":"IF(Prop2021DistTar!B15=\"\",\"\",Prop2021DistTar!B15)","v":"NGT26  Small Interval Multi Rate"},{"$f":"IF(Prop2021DistTar!C15=\"\",\"\",Prop2021DistTar!C15)","v":"NGT26  Small Interval Multi Rate"},{"$f":"Prop2021DistTar!BG15","v":386421.30690789188},null,null,{"$f":"Prop2021DistTar!BV15","v":422632.10422201495}]
[{"$f":"OR(EXACT(D54,Prop2021DistTar!C$6:C$65))","v":true},"Small Residential","Small Residential",{"$f":"IF(Prop2021DistTar!B16=\"\",\"\",Prop2021DistTar!B16)","v":"NEN20  Small Two Rate - Embedded Network"},{"$f":"IF(Prop2021DistTar!C16=\"\",\"\",Prop2021DistTar!C16)","v":"NEN20  Small Two Rate - Embedded Network"},{"$f":"Prop2021DistTar!BG16","v":0},null,null,{"$f":"Prop2021DistTar!BV16","v":0}]
[{"$f":"OR(EXACT(D55,Prop2021DistTar!C$6:C$65))","v":true},"Small Industrial Commercial","Small Industrial Commercial",{"$f":"IF(Prop2021DistTar!B17=\"\",\"\",Prop2021DistTar!B17)","v":"NEE21  Small Business Two Rate"},{"$f":"IF(Prop2021DistTar!C17=\"\",\"\",Prop2021DistTar!C17)","v":"NEE21  Small Business Two Rate"},{"$f":"Prop2021DistTar!BG17","v":17614473.865277894},null,null,{"$f":"Prop2021DistTar!BV17","v":19635519.727748957}]
[{"$f":"OR(EXACT(D56,Prop2021DistTar!C$6:C$65))","v":true},"Small Industrial Commercial","Small Industrial Commercial",{"$f":"IF(Prop2021DistTar!B18=\"\",\"\",Prop2021DistTar!B18)","v":"NSP21  Small Business Two Rate"},{"$f":"IF(Prop2021DistTar!C18=\"\",\"\",Prop2021DistTar!C18)","v":"NSP21  Small Business Two Rate"},{"$f":"Prop2021DistTar!BG18","v":14199.907610303262},null,null,{"$f":"Prop2021DistTar!BV18","v":15855.594357530334}]
[{"$f":"OR(EXACT(D57,Prop2021DistTar!C$6:C$65))","v":true},"Small Industrial Commercial","Small Industrial Commercial",{"$f":"IF(Prop2021DistTar!B19=\"\",\"\",Prop2021DistTar!B19)","v":"NSP27  Small Business Two Rate"},{"$f":"IF(Prop2021DistTar!C19=\"\",\"\",Prop2021DistTar!C19)","v":"NSP27  Small Business Two Rate"},{"$f":"Prop2021DistTar!BG19","v":428652.32243798068},null,null,{"$f":"Prop2021DistTar!BV19","v":478858.91588418203}]
[{"$f":"OR(EXACT(D58,Prop2021DistTar!C$6:C$65))","v":true},"Small Industrial Commercial","Small Industrial Commercial",{"$f":"IF(Prop2021DistTar!B20=\"\",\"\",Prop2021DistTar!B20)","v":"NEN21  Small Business Two Rate - Embedded Network"},{"$f":"IF(Prop2021DistTar!C20=\"\",\"\",Prop2021DistTar!C20)","v":"NEN21  Small Business Two Rate - Embedded Network"},{"$f":"Prop2021DistTar!BG20","v":0},null,null,{"$f":"Prop2021DistTar!BV20","v":0}]
[{"$f":"OR(EXACT(D59,Prop2021DistTar!C$6:C$65))","v":true},"Small Residential","Small Residential",{"$f":"IF(Prop2021DistTar!B21=\"\",\"\",Prop2021DistTar!B21)","v":"NEE23  Photovoltaic"},{"$f":"IF(Prop2021DistTar!C21=\"\",\"\",Prop2021DistTar!C21)","v":"NEE23  Photovoltaic"},{"$f":"Prop2021DistTar!BG21","v":37681250.446663491},null,null,{"$f":"Prop2021DistTar!BV21","v":40487370.572939217}]
[{"$f":"OR(EXACT(D60,Prop2021DistTar!C$6:C$65))","v":true},"Small Residential","Small Residential",{"$f":"IF(Prop2021DistTar!B22=\"\",\"\",Prop2021DistTar!B22)","v":"NSP23  Photovoltaic"},{"$f":"IF(Prop2021DistTar!C22=\"\",\"\",Prop2021DistTar!C22)","v":"NSP23  Photovoltaic"},{"$f":"Prop2021DistTar!BG22","v":46630.014063196089},null,null,{"$f":"Prop2021DistTar!BV22","v":50046.053995383976}]
[{"$f":"OR(EXACT(D61,Prop2021DistTar!C$6:C$65))","v":true},"Small Residential","Small Residential",{"$f":"IF(Prop2021DistTar!B23=\"\",\"\",Prop2021DistTar!B23)","v":"NEE24  Small rate 5 day 8 to 8"},{"$f":"IF(Prop2021DistTar!C23=\"\",\"\",Prop2021DistTar!C23)","v":"NEE24  Small rate 5 day 8 to 8"},{"$f":"Prop2021DistTar!BG23","v":289934.45282183576},null,null,{"$f":"Prop2021DistTar!BV23","v":323489.26099814131}]
[{"$f":"OR(EXACT(D62,Prop2021DistTar!C$6:C$65))","v":true},"Small Industrial Commercial","Small Industrial Commercial",{"$f":"IF(Prop2021DistTar!B24=\"\",\"\",Prop2021DistTar!B24)","v":"NEE25  Small business rate 5 day 8 to 8"},{"$f":"IF(Prop2021DistTar!C24=\"\",\"\",Prop2021DistTar!C24)","v":"NEE25  Small business rate 5 day 8 to 8"},{"$f":"Prop2021DistTar!BG24","v":16086.62040945154},null,null,{"$f":"Prop2021DistTar!BV24","v":17974.082219134543}]
[{"$f":"OR(EXACT(D63,Prop2021DistTar!C$6:C$65))","v":true},"Small Residential","Small Residential",{"$f":"IF(Prop2021DistTar!B25=\"\",\"\",Prop2021DistTar!B25)","v":"NEE30  Small Dedicated"},{"$f":"IF(Prop2021DistTar!C25=\"\",\"\",Prop2021DistTar!C25)","v":"NEE30  Small Dedicated"},{"$f":"Prop2021DistTar!BG25","v":1532291.8481438917},null,null,{"$f":"Prop2021DistTar!BV25","v":1712192.7748770653}]
[{"$f":"OR(EXACT(D64,Prop2021DistTar!C$6:C$65))","v":true},"Small Residential","Small Residential",{"$f":"IF(Prop2021DistTar!B26=\"\",\"\",Prop2021DistTar!B26)","v":"NSP30  Small Dedicated"},{"$f":"IF(Prop2021DistTar!C26=\"\",\"\",Prop2021DistTar!C26)","v":"NSP30  Small Dedicated"},{"$f":"Prop2021DistTar!BG26","v":0},null,null,{"$f":"Prop2021DistTar!BV26","v":0}]
[{"$f":"OR(EXACT(D65,Prop2021DistTar!C$6:C$65))","v":true},"Small Residential","Small Residential",{"$f":"IF(Prop2021DistTar!B27=\"\",\"\",Prop2021DistTar!B27)","v":"NEE31  Small Dedicated-afternoon boost"},{"$f":"IF(Prop2021DistTar!C27=\"\",\"\",Prop2021DistTar!C27)","v":"NEE31  Small Dedicated-afternoon boost"},{"$f":"Prop2021DistTar!BG27","v":442395.63781825919},null,null,{"$f":"Prop2021DistTar!BV27","v":494335.73351388314}]
[{"$f":"OR(EXACT(D66,Prop2021DistTar!C$6:C$65))","v":true},"Small Residential","Small Residential",{"$f":"IF(Prop2021DistTar!B28=\"\",\"\",Prop2021DistTar!B28)","v":"NSP31  Small Dedicated-afternoon boost"},{"$f":"IF(Prop2021DistTar!C28=\"\",\"\",Prop2021DistTar!C28)","v":"NSP31  Small Dedicated-afternoon boost"},{"$f":"Prop2021DistTar!BG28","v":0},null,null,{"$f":"Prop2021DistTar!BV28","v":0}]
[{"$f":"OR(EXACT(D67,Prop2021DistTar!C$6:C$65))","v":true},"Small Residential","Small Residential",{"$f":"IF(Prop2021DistTar!B29=\"\",\"\",Prop2021DistTar!B29)","v":"NEE32  Dedicated Circuit 8 to 8"},{"$f":"IF(Prop2021DistTar!C29=\"\",\"\",Prop2021DistTar!C29)","v":"NEE32  Dedicated Circuit 8 to 8"},{"$f":"Prop2021DistTar!BG29","v":64390.427127761934},null,null,{"$f":"Prop2021DistTar!BV29","v":71950.277770484565}]
[{"$f":"OR(EXACT(D68,Prop2021DistTar!C$6:C$65))","v":true},"Small Residential","Small Residential",{"$f":"IF(Prop2021DistTar!B30=\"\",\"\",Prop2021DistTar!B30)","v":"NSP32  Dedicated Circuit 8 to 8"},{"$f":"IF(Prop2021DistTar!C30=\"\",\"\",Prop2021DistTar!C30)","v":"NSP32  Dedicated Circuit 8 to 8"},{"$f":"Prop2021DistTar!BG30","v":0},null,null,{"$f":"Prop2021DistTar!BV30","v":0}]
[{"$f":"OR(EXACT(D69,Prop2021DistTar!C$6:C$65))","v":true},"Medium Industrial Commercial","Medium Industrial Commercial",{"$f":"IF(Prop2021DistTar!B31=\"\",\"\",Prop2021DistTar!B31)","v":"NEE40  Medium Single Rate - closed to new customers"},{"$f":"IF(Prop2021DistTar!C31=\"\",\"\",Prop2021DistTar!C31)","v":"NEE40  Medium Single Rate - closed to new customers"},{"$f":"Prop2021DistTar!BG31","v":537617.66936568625},null,null,{"$f":"Prop2021DistTar!BV31","v":600694.75414906838}]
[{"$f":"OR(EXACT(D70,Prop2021DistTar!C$6:C$65))","v":true},"Medium Industrial Commercial","Medium Industrial Commercial",{"$f":"IF(Prop2021DistTar!B32=\"\",\"\",Prop2021DistTar!B32)","v":"NEE51  Medium Two Rate 5Day - closed to new customers - <160MWh to NEE21"},{"$f":"IF(Prop2021DistTar!C32=\"\",\"\",Prop2021DistTar!C32)","v":"NEE51  Medium Two Rate 5Day - closed to new customers - <160MWh to NEE21"},{"$f":"Prop2021DistTar!BG32","v":4502755.0327545526},null,null,{"$f":"Prop2021DistTar!BV32","v":5031418.557116624}]
[{"$f":"OR(EXACT(D71,Prop2021DistTar!C$6:C$65))","v":true},"Medium Industrial Commercial","Medium Industrial Commercial",{"$f":"IF(Prop2021DistTar!B33=\"\",\"\",Prop2021DistTar!B33)","v":"NEE55  Snowfields Tariff"},{"$f":"IF(Prop2021DistTar!C33=\"\",\"\",Prop2021DistTar!C33)","v":"NEE55  Snowfields Tariff"},{"$f":"Prop2021DistTar!BG33","v":6133.6795349030426},null,null,{"$f":"Prop2021DistTar!BV33","v":6853.7339768734255}]
[{"$f":"OR(EXACT(D72,Prop2021DistTar!C$6:C$65))","v":true},"Medium Industrial Commercial","Medium Industrial Commercial",{"$f":"IF(Prop2021DistTar!B34=\"\",\"\",Prop2021DistTar!B34)","v":"NSP55  Snowfields Tariff"},{"$f":"IF(Prop2021DistTar!C34=\"\",\"\",Prop2021DistTar!C34)","v":"NSP55  Snowfields Tariff"},{"$f":"Prop2021DistTar!BG34","v":38421.296310635378},null,null,{"$f":"Prop2021DistTar!BV34","v":42931.227872347408}]
[{"$f":"OR(EXACT(D73,Prop2021DistTar!C$6:C$65))","v":true},"Medium Industrial Commercial","Medium Industrial Commercial",{"$f":"IF(Prop2021DistTar!B35=\"\",\"\",Prop2021DistTar!B35)","v":"NSP56  Medium Demand Multi-rate"},{"$f":"IF(Prop2021DistTar!C35=\"\",\"\",Prop2021DistTar!C35)","v":"NSP56  Medium Demand Multi-rate"},{"$f":"Prop2021DistTar!BG35","v":12781627.555761926},null,null,{"$f":"Prop2021DistTar!BV35","v":14282944.142206432}]
[{"$f":"OR(EXACT(D74,Prop2021DistTar!C$6:C$65))","v":true},"Medium Industrial Commercial","Medium Industrial Commercial",{"$f":"IF(Prop2021DistTar!B36=\"\",\"\",Prop2021DistTar!B36)","v":"NEN56  Medium Demand Multi-rate  - Embedded Network"},{"$f":"IF(Prop2021DistTar!C36=\"\",\"\",Prop2021DistTar!C36)","v":"NEN56  Medium Demand Multi-rate  - Embedded Network"},{"$f":"Prop2021DistTar!BG36","v":17493.069023013046},null,null,{"$f":"Prop2021DistTar!BV36","v":19548.204110492203}]
[{"$f":"OR(EXACT(D75,Prop2021DistTar!C$6:C$65))","v":true},"Medium Industrial Commercial","Medium Industrial Commercial",{"$f":"IF(Prop2021DistTar!B37=\"\",\"\",Prop2021DistTar!B37)","v":"NEE60  Medium Two Rate 7Day - closed to new customers"},{"$f":"IF(Prop2021DistTar!C37=\"\",\"\",Prop2021DistTar!C37)","v":"NEE60  Medium Two Rate 7Day - closed to new customers"},{"$f":"Prop2021DistTar!BG37","v":1237344.4582036198},null,null,{"$f":"Prop2021DistTar!BV37","v":1382578.7332899913}]
[{"$f":"OR(EXACT(D76,Prop2021DistTar!C$6:C$65))","v":true},"Medium Industrial Commercial","Medium Industrial Commercial",{"$f":"IF(Prop2021DistTar!B38=\"\",\"\",Prop2021DistTar!B38)","v":"NEE52  Unmetered"},{"$f":"IF(Prop2021DistTar!C38=\"\",\"\",Prop2021DistTar!C38)","v":"NEE52  Unmetered"},{"$f":"Prop2021DistTar!BG38","v":2519720.2883679122},null,null,{"$f":"Prop2021DistTar!BV38","v":2815604.647129273}]
[{"$f":"OR(EXACT(D77,Prop2021DistTar!C$6:C$65))","v":true},"Large-1 Industrial Commercial","Large-1 Industrial Commercial",{"$f":"IF(Prop2021DistTar!B39=\"\",\"\",Prop2021DistTar!B39)","v":"NEE74  LV Large Two Rate 5Day"},{"$f":"IF(Prop2021DistTar!C39=\"\",\"\",Prop2021DistTar!C39)","v":"NEE74  LV Large Two Rate 5Day"},{"$f":"Prop2021DistTar!BG39","v":280543.57862932363},null,null,{"$f":"Prop2021DistTar!BV39","v":313486.63619827491}]
[{"$f":"OR(EXACT(D78,Prop2021DistTar!C$6:C$65))","v":true},"Large-1 Industrial Commercial","Large-1 Industrial Commercial",{"$f":"IF(Prop2021DistTar!B40=\"\",\"\",Prop2021DistTar!B40)","v":"NSP75  Large Multi-rate <750 kVA"},{"$f":"IF(Prop2021DistTar!C40=\"\",\"\",Prop2021DistTar!C40)","v":"NSP75  Large Multi-rate <750 kVA"},{"$f":"Prop2021DistTar!BG40","v":13638201.594987549},null,null,{"$f":"Prop2021DistTar!BV40","v":15239466.283927705}]
[{"$f":"OR(EXACT(D79,Prop2021DistTar!C$6:C$65))","v":true},"Large-2 Industrial Commercial","Large-2 Industrial Commercial",{"$f":"IF(Prop2021DistTar!B41=\"\",\"\",Prop2021DistTar!B41)","v":"NSP76  Large Multi-rate >750 kVA"},{"$f":"IF(Prop2021DistTar!C41=\"\",\"\",Prop2021DistTar!C41)","v":"NSP76  Large Multi-rate >750 kVA"},{"$f":"Prop2021DistTar!BG41","v":17701301.606925085},null,null,{"$f":"Prop2021DistTar!BV41","v":19779508.706717402}]
[{"$f":"OR(EXACT(D80,Prop2021DistTar!C$6:C$65))","v":true},"Large-3 Industrial Commercial","Large-3 Industrial Commercial",{"$f":"IF(Prop2021DistTar!B42=\"\",\"\",Prop2021DistTar!B42)","v":"NSP77  Large Multi-rate >2 GWh"},{"$f":"IF(Prop2021DistTar!C42=\"\",\"\",Prop2021DistTar!C42)","v":"NSP77  Large Multi-rate >2 GWh"},{"$f":"Prop2021DistTar!BG42","v":5271290.6410493087},null,null,{"$f":"Prop2021DistTar!BV42","v":5890243.6743373945}]
[{"$f":"OR(EXACT(D81,Prop2021DistTar!C$6:C$65))","v":true},"Large-4 Industrial Commercial","Large-4 Industrial Commercial",{"$f":"IF(Prop2021DistTar!B43=\"\",\"\",Prop2021DistTar!B43)","v":"NSP78  Large Multi-rate >4 GWh"},{"$f":"IF(Prop2021DistTar!C43=\"\",\"\",Prop2021DistTar!C43)","v":"NSP78  Large Multi-rate >4 GWh"},{"$f":"Prop2021DistTar!BG43","v":3997046.0056849602},null,null,{"$f":"Prop2021DistTar!BV43","v":4466534.9070274457}]
[{"$f":"OR(EXACT(D82,Prop2021DistTar!C$6:C$65))","v":true},"High Voltage-1 Industrial Commercial","High Voltage-1 Industrial Commercial",{"$f":"IF(Prop2021DistTar!B44=\"\",\"\",Prop2021DistTar!B44)","v":"NSP81  HV Kva"},{"$f":"IF(Prop2021DistTar!C44=\"\",\"\",Prop2021DistTar!C44)","v":"NSP81  HV Kva"},{"$f":"Prop2021DistTar!BG44","v":6830472.2420780361},null,null,{"$f":"Prop2021DistTar!BV44","v":7632186.8364015818}]
[{"$f":"OR(EXACT(D83,Prop2021DistTar!C$6:C$65))","v":true},"High Voltage-2 Industrial Commercial","High Voltage-2 Industrial Commercial",{"$f":"IF(Prop2021DistTar!B45=\"\",\"\",Prop2021DistTar!B45)","v":"NSP82  Traction"},{"$f":"IF(Prop2021DistTar!C45=\"\",\"\",Prop2021DistTar!C45)","v":"NSP82  Traction"}]
[{"$f":"OR(EXACT(D84,Prop2021DistTar!C$6:C$65))","v":true},"High Voltage-3 Industrial Commercial","High Voltage-3 Industrial Commercial",{"$f":"IF(Prop2021DistTar!B46=\"\",\"\",Prop2021DistTar!B46)","v":"NSP83  Small HV"},{"$f":"IF(Prop2021DistTar!C46=\"\",\"\",Prop2021DistTar!C46)","v":"NSP83  Small HV"},{"$f":"Prop2021DistTar!BG46","v":441762.5982573622},null,null,{"$f":"Prop2021DistTar!BV46","v":493709.76476160222}]
[{"$f":"OR(EXACT(D85,Prop2021DistTar!C$6:C$65))","v":true},"Extra High Voltage-1 Industrial Commercial","Extra High Voltage-1 Industrial Commercial",{"$f":"IF(Prop2021DistTar!B47=\"\",\"\",Prop2021DistTar!B47)","v":"NSP91  ST kVA"},{"$f":"IF(Prop2021DistTar!C47=\"\",\"\",Prop2021DistTar!C47)","v":"NSP91  ST kVA"}]
[{"$f":"OR(EXACT(D86,Prop2021DistTar!C$6:C$65))","v":true},"Extra High Voltage-2 Industrial Commercial","Extra High Voltage-2 Industrial Commercial",{"$f":"IF(Prop2021DistTar!B48=\"\",\"\",Prop2021DistTar!B48)","v":"NEE93  Latrobe Generators kVA (non published)"},{"$f":"IF(Prop2021DistTar!C48=\"\",\"\",Prop2021DistTar!C48)","v":"NEE93  Latrobe Generators kVA (non published)"}]
[{"$f":"OR(EXACT(D87,Prop2021DistTar!C$6:C$65))","v":true},"Extra High Voltage-3 Industrial Commercial","Extra High Voltage-3 Industrial Commercial",{"$f":"IF(Prop2021DistTar!B49=\"\",\"\",Prop2021DistTar!B49)","v":"NSP94  - ST kVA >25MVA <20kM"},{"$f":"IF(Prop2021DistTar!C49=\"\",\"\",Prop2021DistTar!C49)","v":"NSP94  - ST kVA >25MVA <20kM"}]
[{"$f":"OR(EXACT(D88,Prop2021DistTar!C$6:C$65))","v":true},"Extra High Voltage-4 Industrial Commercial","Extra High Voltage-4 Industrial Commercial",{"$f":"IF(Prop2021DistTar!B50=\"\",\"\",Prop2021DistTar!B50)","v":"NSP95  - ST kVA <25MVA >20kM"},{"$f":"IF(Prop2021DistTar!C50=\"\",\"\",Prop2021DistTar!C50)","v":"NSP95  - ST kVA <25MVA >20kM"}]
[{"$f":"OR(EXACT(D89,Prop2021DistTar!C$6:C$65))","v":true},"Small Industrial Commercial","Small Industrial Commercial",{"$f":"IF(Prop2021DistTar!B51=\"\",\"\",Prop2021DistTar!B51)","v":"NASN19 - Business >40MWh Single Rate"},{"$f":"IF(Prop2021DistTar!C51=\"\",\"\",Prop2021DistTar!C51)","v":"NASN19 - Business >40MWh Single Rate"},{"$f":"Prop2021DistTar!BG51","v":3687545.1765146949},null,null,{"$f":"Prop2021DistTar!BV51","v":3986906.7585430183}]
[{"$f":"OR(EXACT(D90,Prop2021DistTar!C$6:C$65))","v":true},"Small Industrial Commercial","Small Industrial Commercial",{"$f":"IF(Prop2021DistTar!B52=\"\",\"\",Prop2021DistTar!B52)","v":"NASN21 - Business >40MWh Two Rate"},{"$f":"IF(Prop2021DistTar!C52=\"\",\"\",Prop2021DistTar!C52)","v":"NASN21 - Business >40MWh Two Rate"},{"$f":"Prop2021DistTar!BG52","v":27477458.519451357},null,null,{"$f":"Prop2021DistTar!BV52","v":29205717.34238068}]
[{"$f":"OR(EXACT(D91,Prop2021DistTar!C$6:C$65))","v":true},"Small Residential","Small Residential",{"$f":"IF(Prop2021DistTar!B53=\"\",\"\",Prop2021DistTar!B53)","v":"NASN11 - Residential Single Rate"},{"$f":"IF(Prop2021DistTar!C53=\"\",\"\",Prop2021DistTar!C53)","v":"NASN11 - Residential Single Rate"},{"$f":"Prop2021DistTar!BG53","v":9915.7041146512711},null,null,{"$f":"Prop2021DistTar!BV53","v":10968.82612595715}]
[{"$f":"OR(EXACT(D92,Prop2021DistTar!C$6:C$65))","v":true},"Small Industrial Commercial","Small Industrial Commercial",{"$f":"IF(Prop2021DistTar!B54=\"\",\"\",Prop2021DistTar!B54)","v":"NASN12 - Business Single Rate"},{"$f":"IF(Prop2021DistTar!C54=\"\",\"\",Prop2021DistTar!C54)","v":"NASN12 - Business Single Rate"},{"$f":"Prop2021DistTar!BG54","v":12624.310499627165},null,null,{"$f":"Prop2021DistTar!BV54","v":14107.265900418035}]
[{"$f":"OR(EXACT(D93,Prop2021DistTar!C$6:C$65))","v":true},null,null,{"$f":"IF(Prop2021DistTar!B55=\"\",\"\",Prop2021DistTar!B55)","v":""},{"$f":"IF(Prop2021DistTar!C55=\"\",\"\",Prop2021DistTar!C55)","v":""},{"$f":"Prop2021DistTar!BG55","v":0},null,null,{"$f":"Prop2021DistTar!BV55","v":0}]
[{"$f":"OR(EXACT(D94,Prop2021DistTar!C$6:C$65))","v":true},null,null,{"$f":"IF(Prop2021DistTar!B56=\"\",\"\",Prop2021DistTar!B56)","v":""},{"$f":"IF(Prop2021DistTar!C56=\"\",\"\",Prop2021DistTar!C56)","v":""},{"$f":"Prop2021DistTar!BG56","v":0},null,null,{"$f":"Prop2021DistTar!BV56","v":0}]
[{"$f":"OR(EXACT(D95,Prop2021DistTar!C$6:C$65))","v":true},null,null,{"$f":"IF(Prop2021DistTar!B57=\"\",\"\",Prop2021DistTar!B57)","v":""},{"$f":"IF(Prop2021DistTar!C57=\"\",\"\",Prop2021DistTar!C57)","v":""},{"$f":"Prop2021DistTar!BG57","v":0},null,null,{"$f":"Prop2021DistTar!BV57","v":0}]
[{"$f":"OR(EXACT(D96,Prop2021DistTar!C$6:C$65))","v":true},null,null,{"$f":"IF(Prop2021DistTar!B58=\"\",\"\",Prop2021DistTar!B58)","v":""},{"$f":"IF(Prop2021DistTar!C58=\"\",\"\",Prop2021DistTar!C58)","v":""},{"$f":"Prop2021DistTar!BG58","v":0},null,null,{"$f":"Prop2021DistTar!BV58","v":0}]
[{"$f":"OR(EXACT(D97,Prop2021DistTar!C$6:C$65))","v":true},null,null,{"$f":"IF(Prop2021DistTar!B59=\"\",\"\",Prop2021DistTar!B59)","v":""},{"$f":"IF(Prop2021DistTar!C59=\"\",\"\",Prop2021DistTar!C59)","v":""},{"$f":"Prop2021DistTar!BG59","v":0},null,null,{"$f":"Prop2021DistTar!BV59","v":0}]
[{"$f":"OR(EXACT(D98,Prop2021DistTar!C$6:C$65))","v":true},null,null,{"$f":"IF(Prop2021DistTar!B60=\"\",\"\",Prop2021DistTar!B60)","v":""},{"$f":"IF(Prop2021DistTar!C60=\"\",\"\",Prop2021DistTar!C60)","v":""},{"$f":"Prop2021DistTar!BG60","v":0},null,null,{"$f":"Prop2021DistTar!BV60","v":0}]
[{"$f":"OR(EXACT(D99,Prop2021DistTar!C$6:C$65))","v":true},null,null,{"$f":"IF(Prop2021DistTar!B61=\"\",\"\",Prop2021DistTar!B61)","v":""},{"$f":"IF(Prop2021DistTar!C61=\"\",\"\",Prop2021DistTar!C61)","v":""},{"$f":"Prop2021DistTar!BG61","v":0},null,null,{"$f":"Prop2021DistTar!BV61","v":0}]
[{"$f":"OR(EXACT(D100,Prop2021DistTar!C$6:C$65))","v":true},null,null,{"$f":"IF(Prop2021DistTar!B62=\"\",\"\",Prop2021DistTar!B62)","v":""},{"$f":"IF(Prop2021DistTar!C62=\"\",\"\",Prop2021DistTar!C62)","v":""},{"$f":"Prop2021DistTar!BG62","v":0},null,null,{"$f":"Prop2021DistTar!BV62","v":0}]
[{"$f":"OR(EXACT(D101,Prop2021DistTar!C$6:C$65))","v":true},null,null,{"$f":"IF(Prop2021DistTar!B63=\"\",\"\",Prop2021DistTar!B63)","v":""},{"$f":"IF(Prop2021DistTar!C63=\"\",\"\",Prop2021DistTar!C63)","v":""},{"$f":"Prop2021DistTar!BG63","v":0},null,null,{"$f":"Prop2021DistTar!BV63","v":0}]
[{"$f":"OR(EXACT(D102,Prop2021DistTar!C$6:C$65))","v":true},null,null,{"$f":"IF(Prop2021DistTar!B64=\"\",\"\",Prop2021DistTar!B64)","v":""},{"$f":"IF(Prop2021DistTar!C64=\"\",\"\",Prop2021DistTar!C64)","v":""},{"$f":"Prop2021DistTar!BG64","v":0},null,null,{"$f":"Prop2021DistTar!BV64","v":0}]
[{"$f":"OR(EXACT(D103,Prop2021DistTar!C$6:C$65))","v":true},null,null,{"$f":"IF(Prop2021DistTar!B65=\"\",\"\",Prop2021DistTar!B65)","v":""},{"$f":"IF(Prop2021DistTar!C65=\"\",\"\",Prop2021DistTar!C65)","v":""},{"$f":"Prop2021DistTar!BG65","v":0},null,null,{"$f":"Prop2021DistTar!BV65","v":0}]
[null,null,null,null,null,296057042.37553585,null,null,327002130.00215673,null,null,null,null,null,null,null,null,null,null,null,null,null,null,null,null,null,null,null,null,null,null,null,null,null,null,null,null,null,null,null,null,null,null,null,null,null,null,null,null,null,null,null,null,null,null,null,null,null,null,null,null,{"$f":"SUM(BJ44:BJ103)","v":0}]

{"sheet":"Est2020DistRev","index":12,"n_rows":66,"n_cols":45,"rows_kept":66,"cut":false,"hidden":false,"merged":[]}
[null,{"$f":"\"Tariff Approval - \"&'Model update'!C3","v":"Tariff Approval - AusNet Services"},null,{"$f":"\"Est\"&'Model update'!$C$5-1&\"DistRev\"","v":"Est2020DistRev"}]
[]
[null,{"$f":"\"ESTIMATED \"&'Model update'!$C$8&\" Distribution Revenue\"","v":"ESTIMATED 2020 Distribution Revenue"}]
[null,null,null,{"$f":"\"Current Distribution Tariffs (Pt-1) for \"&'Model update'!$C$8","v":"Current Distribution Tariffs (Pt-1) for 2020"},null,null,null,null,null,null,null,null,null,null,null,null,null,{"$f":"\" Estimated Distribution Quantities for \"&'Model update'!$C$8&\" (Qt-1)\"","v":" Estimated Distribution Quantities for 2020 (Qt-1)"},null,null,null,null,null,null,null,null,null,null,null,null,null,{"$f":"\"Estimated Revenue (Pt-1 \"&'Model update'!$C$8&\")*(Qt-1 \" &'Model update'!$C$8&\")\"","v":"Estimated Revenue (Pt-1 2020)*(Qt-1 2020)"}]
[null,{"$f":"\"Tariffs \"&'Model update'!C8","v":"Tariffs 2020"},null,"Current\nFixed","\nCurrentPkBlk1","\nCurrentPkBlk2","\nCurrent PkBlk3","\nCurrent PkBlk4","\nCurrent OPkBlk1","\nCurrent OPkBlk2","\nCurrent OPkBlk3","\nCurrent OPkBlk4","\nCurrent DemBlk1","\nCurrent DemBlk2","\nCurrent DemBlk3","\nCurrent DemBlk4",null,"EstVol\nFixed","EstVol\nPkBlk1","EstVol\nPkBlk2","EstVol\nPkBlk3","EstVol\nPkBlk4","EstVol\nOPkBlk1","EstVol\nOPkBlk2","EstVol\nOPkBlk3","EstVol\nOPkBlk4","EstVol\nDemBlk1","EstVol\nDemBlk2","EstVol\nDemBlk3","EstVol\nDemBlk4",null,"EstRev\nFixed","EstRev\nPkBlk1","EstRev\nPkBlk2","EstRev\nPkBlk3","EstRev\nPkBlk4","EstRev\nOPkBlk1","EstRev\nOPkBlk2","EstRev\nOPkBlk3","EstRev\nOPkBlk4","EstRev\nDemBlk1","EstRev\nDemBlk2","EstRev\nDemBlk3","EstRev\nDemBlk4","EstRev\nTotal"]
[null,{"$f":"Prop2021DistTar!C6","v":"NEE11  Small Single Rate < 160MWh"},null,118,8.7594999999999992,10.478899999999999,0,0,0,0,0,0,0,0,0,0,null,486334.66978911357,1414071268.0212922,766008897.58906519,0,0,0,0,0,0,0,0,0,0,null,{"$f":"D6*R6","v":57387491.035115398},{"$f":"E6/100*S6","v":123865572.72232509},80269306.369460553,0,0,0,0,0,0,{"$f":"M6*AA6","v":0},0,0,0,{"$f":"SUM(AF6:AR6)","v":261522370.12690103}]
[null,{"$f":"Prop2021DistTar!C7","v":"NGT11  Small Interval Single Rate < 160MWh"},null,118,11.684699999999999,0,0,0,0,0,0,0,0,0,0,0,null,5,26915.600265082227,0,0,0,0,0,0,0,0,0,0,0,null,{"$f":"D7*R7","v":590},{"$f":"E7/100*S7","v":3145.0071441740629},0,0,0,0,0,0,0,{"$f":"M7*AA7","v":0},{"$f":"N7*AB7","v":0},{"$f":"O7*AC7","v":0},{"$f":"P7*AD7","v":0},{"$f":"SUM(AF7:AR7)","v":3735.0071441740629}]
[null,{"$f":"Prop2021DistTar!C8","v":"NSP11  Small Single Rate < 160MWh"},null,118,38.902200000000001,34.040900000000001,29.792300000000001,0,3.3180000000000001,0,0,0,0,0,0,0,null,0,0,0,0,0,0,0,0,0,0,0,0,0,null,0,0,0,0,0,0,0,0,0,0,0,0,0,0]
[null,{"$f":"Prop2021DistTar!C9","v":"NEN11  Small Single Rate < 160MWh Embedded Network"},null,118,5.3701999999999996,5.9020000000000001,0,0,0,0,0,0,0,0,0,0,null,0,0,0,0,0,0,0,0,0,0,0,0,0,null,0,0,0,0,0,0,0,0,0,0,0,0,0,0]
[null,{"$f":"Prop2021DistTar!C10","v":"NEE12  Small Business Single Rate - new in 2001"},null,118,12.5869,15.9109,0,0,0,0,0,0,0,0,0,0,null,29650.267212036473,55694218.275071174,97730592.91760394,0,0,0,0,0,0,0,0,0,0,null,3498731.5310203037,7010175.5600649342,15549816.908527045,0,0,0,0,0,0,0,0,0,0,26058723.999612283]
[null,{"$f":"Prop2021DistTar!C11","v":"NSP12  Small Business Single Rate - new in 2001"},null,118,38.902200000000001,34.040900000000001,29.792300000000001,0,3.3180000000000001,0,0,0,0,0,0,0,null,0,0,0,0,0,0,0,0,0,0,0,0,0,null,0,0,0,0,0,0,0,0,0,0,0,0,0,0]
[null,{"$f":"Prop2021DistTar!C12","v":"NEN12  Small Business Single Rate - Embedded Network"},null,118,18.3063,21.310199999999998,0,0,0,0,0,0,0,0,0,0,null,0,0,0,0,0,0,0,0,0,0,0,0,0,null,0,0,0,0,0,0,0,0,0,0,0,0,0,0]
[null,{"$f":"Prop2021DistTar!C13","v":"NEE20  Small Two Rate"},null,118,16.979600000000001,0,0,0,3.1227999999999998,0,0,0,0,0,0,0,null,52457.137385858034,157398623.26416236,0,0,0,204159796.32146344,0,0,0,0,0,0,0,null,6189942.2115312479,26725656.635761712,0,0,0,6375502.1195266601,0,0,0,0,0,0,0,39291100.966819622]
[null,{"$f":"Prop2021DistTar!C14","v":"NSP20  Small Two Rate"},null,118,38.902200000000001,34.040900000000001,29.792300000000001,0,3.3180000000000001,0,0,0,0,0,0,0,null,13.5,2490.472947861364,2269.9813118919583,3678.6099999999997,0,76639.07175735537,0,0,0,0,0,0,0,null,1593,968.8487671229235,772.72206839982971,1095.9425270299998,0,2542.8844009090512,0,0,0,0,0,0,0,6973.3977634618041]
[null,{"$f":"Prop2021DistTar!C15","v":"NGT26  Small Interval Multi Rate"},null,118,12.228999999999999,12.228999999999999,8.9611999999999998,8.9611999999999998,3.3197000000000001,3.3197000000000001,0,0,0,0,0,0,null,1591.9805831833819,2874155.9145290013,0,3484486.270565764,0,2719019.309408607,0,0,0,0,0,0,0,null,187853.70881563905,351480.52678775159,0,312251.78367793921,0,90263.284014437537,0,0,0,0,0,0,0,941849.3032957674]
[null,{"$f":"Prop2021DistTar!C16","v":"NEN20  Small Two Rate - Embedded Network"},null,118,10.0708,0,0,0,3.2919999999999998,0,0,0,0,0,0,0,null,0,0,0,0,0,0,0,0,0,0,0,0,0,null,0,0,0,0,0,0,0,0,0,0,0,0,0,0]
[null,{"$f":"Prop2021DistTar!C17","v":"NEE21  Small Business Two Rate"},null,118,16.251300000000001,0,0,0,3.3664000000000001,0,0.59750000000000003,0,0,0,0,0,null,29598.543030598783,192216126.27192965,0,0,0,140384316.2571556,0,-12355885.189663645,0,0,0,0,0,null,3492628.0776106566,31237619.328830108,0,0,0,4725897.6224808861,0,-73826.414008240288,0,0,0,0,0,39382318.614913411]
[null,{"$f":"Prop2021DistTar!C18","v":"NSP21  Small Business Two Rate"},null,118,38.902200000000001,34.040900000000001,29.792300000000001,0,3.3180000000000001,0,0.59750000000000003,0,0,0,0,0,null,20.440037645279581,24188.21013789346,28816.302879287188,37605.93,0,735430.05813629576,0,-7008.71,0,0,0,0,0,null,2411.9244421429908,9409.7458842635897,9809.328846835273,11203.671483390001,0,24401.569328962294,0,-41.877042250000002,0,0,0,0,0,57194.362943344146]
[null,{"$f":"Prop2021DistTar!C19","v":"NSP27  Small Business Two Rate"},null,118,21.982800000000001,19.270199999999999,16.9009,0,6.0349000000000004,0,0.59750000000000003,0,0,0,0,0,null,173.91005646791939,392649.66275425052,378077.93969901436,515261.03,0,12533889.681311149,0,-7825.92,0,0,0,0,0,null,20521.386663214489,86315.390063941391,72856.375135879454,87083.751419270004,0,756407.70837744663,0,-46.759872000000001,0,0,0,0,0,1023137.851787752]
[null,{"$f":"Prop2021DistTar!C20","v":"NEN21  Small Business Two Rate - Embedded Network"},null,118,11.2852,0,0,0,5.1416000000000004,0,0,0,0,0,0,0,null,0,0,0,0,0,0,0,0,0,0,0,0,0,null,0,0,0,0,0,0,0,0,0,0,0,0,0,0]
[null,{"$f":"Prop2021DistTar!C21","v":"NEE23  Photovoltaic"},null,130,16.979600000000001,0,0,0,3.1227999999999998,0,0.59750000000000003,0,0,0,0,0,null,140653.89228320646,330746139.13042313,0,0,0,390954214.6241253,0,-230432166.05100268,0,0,0,0,0,null,18285005.99681684,56159371.439789325,0,0,0,12208718.214282185,0,-1376832.1921547411,0,0,0,0,0,85276263.458733618]
[null,{"$f":"Prop2021DistTar!C22","v":"NSP23  Photovoltaic"},null,130,38.902200000000001,34.040900000000001,29.792300000000001,0,3.3180000000000001,0,0.59750000000000003,0,0,0,0,0,null,215.84730455426558,18445.783873086701,21256.810328696542,65182.33,0,1045973.4980487353,0,-403054.47427120979,0,0,0,0,0,null,28060.149592054524,7175.8157338759338,7236.009547181261,19419.315300589999,0,34705.400665257039,0,-2408.2504837704787,0,0,0,0,0,94188.440355188286]
[null,{"$f":"Prop2021DistTar!C23","v":"NEE24  Small rate 5 day 8 to 8"},null,118,7.3297999999999996,0,0,0,3.0869,0,0,0,0,0,0,0,null,2262.9902915916909,3110890.2088335436,0,0,0,7359649.475549683,0,0,0,0,0,0,0,null,267032.85440781951,228022.03052708108,0,0,0,227185.01966074316,0,0,0,0,0,0,0,722239.90459564375]
[null,{"$f":"Prop2021DistTar!C24","v":"NEE25  Small business rate 5 day 8 to 8"},null,118,15.3832,0,0,0,3.2069000000000001,0,0,0,0,0,0,0,null,6.5,165241.81140904612,0,0,0,191330.49747325986,0,0,0,0,0,0,0,null,767,25419.478332676383,0,0,0,6135.7777234699706,0,0,0,0,0,0,0,32322.256056146354]
[null,{"$f":"Prop2021DistTar!C25","v":"NEE30  Small Dedicated"},null,0,0,0,0,0,3.1141000000000001,0,0,0,0,0,0,0,null,87360.497882852302,0,0,0,0,123271097.5246284,0,0,0,0,0,0,0,null,0,0,0,0,0,3838785.2480144533,0,0,0,0,0,0,0,3838785.2480144533]
[null,{"$f":"Prop2021DistTar!C26","v":"NSP30  Small Dedicated"},null,0,0,0,0,0,3.1141000000000001,0,0,0,0,0,0,0,null,0,0,0,0,0,0,0,0,0,0,0,0,0,null,0,0,0,0,0,0,0,0,0,0,0,0,0,0]
[null,{"$f":"Prop2021DistTar!C27","v":"NEE31  Small Dedicated-afternoon boost"},null,0,0,0,0,0,3.1141000000000001,0,0,0,0,0,0,0,null,12927.434733425473,0,0,0,0,40137760.801247783,0,0,0,0,0,0,0,null,0,0,0,0,0,1249930.0091116573,0,0,0,0,0,0,0,1249930.0091116573]
[null,{"$f":"Prop2021DistTar!C28","v":"NSP31  Small Dedicated-afternoon boost"},null,0,0,0,0,0,3.1141000000000001,0,0,0,0,0,0,0,null,0,0,0,0,0,0,0,0,0,0,0,0,0,null,0,0,0,0,0,0,0,0,0,0,0,0,0,0]
[null,{"$f":"Prop2021DistTar!C29","v":"NEE32  Dedicated Circuit 8 to 8"},null,0,0,0,0,0,3.1141000000000001,0,0,0,0,0,0,0,null,3712.6298059964729,0,0,0,0,5099926.7318411674,0,0,0,0,0,0,0,null,0,0,0,0,0,158816.81835626581,0,0,0,0,0,0,0,158816.81835626581]
[null,{"$f":"Prop2021DistTar!C30","v":"NSP32  Dedicated Circuit 8 to 8"},null,0,0,0,0,0,3.1141000000000001,0,0,0,0,0,0,0,null,0,0,0,0,0,0,0,0,0,0,0,0,0,null,0,0,0,0,0,0,0,0,0,0,0,0,0,0]
[null,{"$f":"Prop2021DistTar!C31","v":"NEE40  Medium Single Rate - closed to new customers"},null,118,22.738600000000002,0,0,0,0,0,0,0,0,0,0,0,null,245.98242117359763,4322929.8755737636,0,0,0,0,0,0,0,0,0,0,0,null,29025.92569848452,982973.73268721579,0,0,0,0,0,0,0,0,0,0,0,1011999.6583857003]
[null,{"$f":"Prop2021DistTar!C32","v":"NEE51  Medium Two Rate 5Day - closed to new customers - <160MWh to NEE21"},null,118,19.647500000000001,0,0,0,4.1612,0,0,0,0,0,0,0,null,444.53206412825648,42205412.376581848,0,0,0,34986342.977144569,0,0,0,0,0,0,0,null,52454.783567134262,8292308.3966889186,0,0,0,1455851.7039649398,0,0,0,0,0,0,0,9800614.8842209931]
[null,{"$f":"Prop2021DistTar!C33","v":"NEE55  Snowfields Tariff"},null,118,14.6469,0,0,0,4.0961999999999996,0,0,0,0,0,0,0,null,1,51898.690313338222,0,0,0,83673.91375974071,0,0,0,0,0,0,0,null,118,7601.5492715043365,0,0,0,3427.4508554264989,0,0,0,0,0,0,0,11147.000126930836]
[null,{"$f":"Prop2021DistTar!C34","v":"NSP55  Snowfields Tariff"},null,118,39.092500000000001,34.207299999999996,29.937899999999999,0,2.3687999999999998,0,0,0,0,0,0,0,null,3.5,31178.950701450001,19019.490641549997,0,0,630826.00627612672,0,0,0,0,0,0,0,null,413,12188.631302964342,6506.0542222269314,0,0,14943.006436668888,0,0,0,0,0,0,0,34050.691961860161]
[null,{"$f":"Prop2021DistTar!C35","v":"NSP56  Medium Demand Multi-rate"},null,2550,11.148300000000001,8.1171000000000006,0,0,3.8096000000000001,0,0,0,19.39,32.32,0,0,null,1247.25,83039491.011019096,61863926.598555744,0,0,103971088.27314587,0,0,0,206380.02464738511,74980.922810920456,0,0,null,3180487.5,9257491.5763814431,5021556.7859313684,0,0,3960882.578853765,0,0,0,4001708.6779127973,2423383.4252489493,0,0,27845510.544328324]
[null,{"$f":"Prop2021DistTar!C36","v":"NEN56  Medium Demand Multi-rate  - Embedded Network"},null,2550,8.9786999999999999,6.2576999999999998,0,0,3.8921999999999999,0,0,0,19.39,32.32,0,0,null,2,98759.714887872979,107662.39311898941,0,0,103135.65683552493,0,0,0,519.97333333333336,151.63,0,0,null,5100,8867.3385206374514,6737.1895742069992,0,0,4014.2460353523011,0,0,0,10082.282933333334,4900.6815999999999,0,0,39701.738663530079]
[null,{"$f":"Prop2021DistTar!C37","v":"NEE60  Medium Two Rate 7Day - closed to new customers"},null,118,10.1722,0,0,0,3.9558,0,0,0,0,0,0,0,null,326.78835227272725,15184989.102481149,0,0,0,4800537.3194904663,0,0,0,0,0,0,0,null,38561.025568181816,1544647.4614825875,0,0,0,189899.65528440388,0,0,0,0,0,0,0,1773108.1423351732]
[null,{"$f":"Prop2021DistTar!C38","v":"NEE52  Unmetered"},null,0,16.896000000000001,0,0,0,8.5660000000000007,0,0,0,0,0,0,0,null,89.5,16629661.72558593,0,0,0,40260562.97408773,0,0,0,0,0,0,0,null,0,2809747.6451549986,0,0,0,3448719.8243603557,0,0,{"$f":"L38/100*Z38","v":0},0,0,0,0,6258467.4695153544]
[null,{"$f":"Prop2021DistTar!C39","v":"NEE74  LV Large Two Rate 5Day"},null,142,25.179300000000001,0,0,0,7.1535000000000002,0,0,0,0,0,0,0,null,7,1842568.0997515656,0,0,0,2249990.8264669576,0,0,0,0,0,0,0,null,994,463945.74954074592,0,0,0,160953.09377131381,0,0,0,0,0,0,0,625892.84331205976]
[null,{"$f":"Prop2021DistTar!C40","v":"NSP75  Large Multi-rate <750 kVA"},null,5701,3.2421000000000002,2.1968000000000001,0,0,1.2529999999999999,0,0,0,47.11,79.010000000000005,0,0,null,802.62666666666678,131395544.41885962,93404404.346461415,0,0,173257112.5522047,0,0,0,213575.83845936216,96376.315078998494,0,0,null,4575774.6266666669,4259974.9456038484,2051907.9546830645,0,0,2170911.6202791249,0,0,0,10061557.749820551,7614692.6543916715,0,0,30734819.551444929]
[null,{"$f":"Prop2021DistTar!C41","v":"NSP76  Large Multi-rate >750 kVA"},null,5701,2.9969999999999999,1.9641,0,0,1.1136999999999999,0,0,0,49.12,83.07,0,0,null,547.32333333333327,190757095.18034065,138250071.62197357,0,0,244895539.81684679,0,0,0,286003.86061461479,131113.93817689113,0,0,null,3120290.3233333328,5716990.1425548093,2715369.6567271827,0,0,2727401.6269402225,0,0,0,14048509.633389877,10891634.844354345,0,0,39220196.227299772]
[null,{"$f":"Prop2021DistTar!C42","v":"NSP77  Large Multi-rate >2 GWh"},null,5701,2.9378000000000002,1.9379,0,0,1.0491999999999999,0,0,0,53.85,89.39,0,0,null,91.126666666666665,69605861.512646362,48262983.049247444,0,0,87724318.731370986,0,0,0,80293.262182539678,40148.868226626015,0,0,null,519513.12666666665,2044880.9995185249,935288.34851136617,0,0,920403.55212954432,0,0,0,4323792.168529762,3588907.3307780996,0,0,12332785.526133964]
[null,{"$f":"Prop2021DistTar!C43","v":"NSP78  Large Multi-rate >4 GWh"},null,5701,2.6254,1.7327999999999999,0,0,0.90620000000000001,0,0,0,59.24,98.01,0,0,null,37.126666666666665,51302006.015167095,35337894.743066102,0,0,65090403.4407565,0,0,0,48887.9204248366,30756.770736979168,0,0,null,211659.12666666665,1346882.8659221968,612335.0401078494,0,0,589849.23598013539,0,0,0,2896120.4059673203,3014471.0999313286,0,0,8671317.774575498]
[null,{"$f":"Prop2021DistTar!C44","v":"NSP81  HV Kva"},null,5701,0.57199999999999995,0,0,0,0.23139999999999999,0,0,0,38.770000000000003,63.54,0,0,null,59.626666666666665,249936973.16629881,0,0,0,207395236.34291041,0,0,0,175314.33000000002,77448.789402505441,0,0,null,339931.62666666665,1429639.4865112291,0,0,0,479912.57689749473,0,0,0,6796936.5741000008,4921096.0786351953,0,0,13967516.342810586]
[null,{"$f":"Prop2021DistTar!C45","v":"NSP82  Traction"},null,5701,0.5141,0.5141,0,0,0.438,0,0,0,35.54,58.16,0,0]
[null,{"$f":"Prop2021DistTar!C46","v":"NSP83  Small HV"},null,5701,9.6514000000000006,3.3772000000000002,0,0,1.0517000000000001,0,0,0,4.1399999999999997,6.84,0,0,null,20.626666666666665,7631961.1216984587,5084435.5919861346,0,0,10465746.720762642,0,0,0,23283.644876543207,5606.1146788194446,0,0,null,117592.62666666666,736591.09569960507,171711.55881255577,0,0,110068.25826226072,0,0,0,96394.289788888869,38345.824403125,0,0,1270703.6536331021]
[null,{"$f":"Prop2021DistTar!C47","v":"NSP91  ST kVA"},null,20319,0.51900000000000002,0,0,0,4.8800000000000003E-2,0,0,0,2.59,4.2699999999999996,0,0]
[null,{"$f":"Prop2021DistTar!C48","v":"NEE93  Latrobe Generators kVA (non published)"},null,0,1.0197000000000001,0,0,0,1.0196000000000001,0,0,0,0,0,0,0]
[null,{"$f":"Prop2021DistTar!C49","v":"NSP94  - ST kVA >25MVA <20kM"},null,20319,0.48270000000000002,0,0,0,3.1E-2,0,0,0,1.93,3.21,0,0]
[null,{"$f":"Prop2021DistTar!C50","v":"NSP95  - ST kVA <25MVA >20kM"},null,20319,0.56010000000000004,0,0,0,7.0499999999999993E-2,0,0,0,4.01,6.66,0,0]
[null,{"$f":"Prop2021DistTar!C51","v":"NASN19 - Business >40MWh Single Rate"},null,118,14.0219,14.0219,0,0,0,0,0,0,1.45,5.8,0,0,null,1049.9400376452795,50441999.38648431,0,0,0,0,0,0,0,135724.25944881159,81936.727309274298,0,0,null,123892.92444214298,7072926.7119734436,0,0,0,0,0,0,0,196800.1762007768,475233.01839379093,0,0,7868852.8310101544]
[null,{"$f":"Prop2021DistTar!C52","v":"NASN21 - Business >40MWh Two Rate"},null,118,14.404299999999999,0,0,0,3.1137999999999999,0,0.59750000000000003,0,1.45,5.8,0,0,null,8412.6267692090423,281574949.00525457,0,0,0,235093715.0593009,0,-7157764.3917191196,0,1471838.1977319638,902817.43504192343,0,0,null,992689.95876666694,40558900.379563883,0,0,0,7320348.099516511,0,-42767.642240521738,0,2134165.3867113474,5236341.1232431559,0,0,56199677.305561036]
[null,{"$f":"Prop2021DistTar!C53","v":"NASN11 - Residential Single Rate"},null,118,5.5305999999999997,5.5305999999999997,0,0,0,0,0.59750000000000003,0,2.41,9.66,0,0,null,27.1490291591691,74897.964001289554,0,0,0,0,0,-12690.803333333333,0,678.13163992590864,286.46681174116725,0,0,null,3203.5854407819538,4142.3067970553193,0,0,0,0,0,-75.827549916666669,0,1634.29725222144,2767.2694014196754,0,0,11671.631341561722]
[null,{"$f":"Prop2021DistTar!C54","v":"NASN12 - Business Single Rate"},null,118,11.3691,11.3691,0,0,0,0,0.59750000000000003,0,2.41,9.66,0,0,null,4.9700188226397906,174756.36516008311,0,0,0,0,0,0,0,928.18498659318607,648.9216375696617,0,0,null,586.46222107149526,19868.225911415007,0,0,0,0,0,0,0,2236.9258176895787,6268.5830189229318,0,0,28960.196969099012]
[null,null,null,null,null,null,null,null,null,null,null,null,null,null,null,null,null,null,null,null,null,null,null,null,null,null,null,null,null,null,null,0,0,0,0,0,0,0,0,0,0,0,0,0,0]
[null,null,null,null,null,null,null,null,null,null,null,null,null,null,null,null,null,null,null,null,null,null,null,null,null,null,null,null,null,null,null,0,0,0,0,0,0,0,0,0,0,0,0,0,0]
[null,null,null,null,null,null,null,null,null,null,null,null,null,null,null,null,null,null,null,null,null,null,null,null,null,null,null,null,null,null,null,0,0,0,0,0,0,0,0,0,0,0,0,0,0]
[null,null,null,null,null,null,null,null,null,null,null,null,null,null,null,null,null,null,null,null,null,null,null,null,null,null,null,null,null,null,null,0,0,0,0,0,0,0,0,0,0,0,0,0,0]
[null,null,null,null,null,null,null,null,null,null,null,null,null,null,null,null,null,null,null,null,null,null,null,null,null,null,null,null,null,null,null,0,0,0,0,0,0,0,0,0,0,0,0,0,0]
[null,null,null,null,null,null,null,null,null,null,null,null,null,null,null,null,null,null,null,null,null,null,null,null,null,null,null,null,null,null,null,0,0,0,0,0,0,0,0,0,0,0,0,0,0]
[null,null,null,null,null,null,null,null,null,null,null,null,null,null,null,null,null,null,null,null,null,null,null,null,null,null,null,null,null,null,null,0,0,0,0,0,0,0,0,0,0,0,0,0,0]
[null,null,null,null,null,null,null,null,null,null,null,null,null,null,null,null,null,null,null,null,null,null,null,null,null,null,null,null,null,null,null,0,0,0,0,0,0,0,0,0,0,0,0,0,0]
[null,null,null,null,null,null,null,null,null,null,null,null,null,null,null,null,null,null,null,null,null,null,null,null,null,null,null,null,null,null,null,0,0,0,0,0,0,0,0,0,0,0,0,0,0]
[null,null,null,null,null,null,null,null,null,null,null,null,null,null,null,null,null,null,null,null,null,null,null,null,null,null,null,null,null,null,null,0,0,0,0,0,0,0,0,0,0,0,0,0,0]
[null,null,null,null,null,null,null,null,null,null,null,null,null,null,null,null,null,null,null,null,null,null,null,null,null,null,null,null,null,null,null,0,0,0,0,0,0,0,0,0,0,0,0,0,0]
[null,null,null,null,null,null,null,null,null,null,null,null,null,null,null,null,null,756442.00000000012,3656103300.4666877,1264121195.5277448,4106214.1705657644,0,2464617832.7597661,0,-250376395.53999001,0,2836903.4292718349,1516779.1663279892,0,0,null,102993361.12505312,334310951.72961736,107521799.27786215,431054.46440821921,0,54488114.243660778,0,-1495998.9633514402,0,47111866.770398639,39604146.698206142,0,0,684965295.34585536]

{"sheet":"Prop2021TransTar","index":13,"n_rows":66,"n_cols":45,"rows_kept":66,"cut":false,"hidden":false,"merged":[]}
[null,{"$f":"\"Tariff Approval - \"&'Model update'!C3","v":"Tariff Approval - AusNet Services"},null,{"$f":"\"Prop\"&'Model update'!$C$5&\"TransTar\"","v":"Prop2021TransTar"}]
[]
[null,{"$f":"\"PROPOSED \"&'Model update'!$C$5&\" TRANSMISSION TARIFFS\"","v":"PROPOSED 2021 TRANSMISSION TARIFFS"}]
[null,null,null,{"$f":"\"Proposed Transmission Tariffs (Pt) for \"&'Model update'!$C$5","v":"Proposed Transmission Tariffs (Pt) for 2021"},null,null,null,null,null,null,null,null,null,null,null,null,null,{"$f":"\"Forecast Quantities (Qt) for \"&'Model update'!$C$5","v":"Forecast Quantities (Qt) for 2021"},null,null,null,null,null,null,null,null,null,null,null,null,null,{"$f":"\"Forecast Revenue (Pt \"&'Model update'!$C$5&\")*(Qt \" &'Model update'!$C$5&\")\"","v":"Forecast Revenue (Pt 2021)*(Qt 2021)"}]
[null,"Proposed tariff",null,{"$f":"Prop2021DistTar!D5","v":"PropTar\nFixed"},{"$f":"Prop2021DistTar!E5","v":"PropTar\nPkBlk1"},{"$f":"Prop2021DistTar!F5","v":"PropTar\nPkBlk2"},{"$f":"Prop2021DistTar!G5","v":"PropTar\nPkBlk3"},{"$f":"Prop2021DistTar!H5","v":"PropTar\nPkBlk4"},{"$f":"Prop2021DistTar!I5","v":"PropTar\nOPkBlk1"},{"$f":"Prop2021DistTar!J5","v":"PropTar\nOPkBlk2"},{"$f":"Prop2021DistTar!K5","v":"PropTar\nOPkBlk3"},{"$f":"Prop2021DistTar!L5","v":"PropTar\nOPkBlk4"},{"$f":"Prop2021DistTar!M5","v":"PropTar\nDemBlk1"},{"$f":"Prop2021DistTar!N5","v":"PropTar\nDemBlk2"},{"$f":"Prop2021DistTar!O5","v":"PropTar\nDemBlk3"},{"$f":"Prop2021DistTar!P5","v":"PropTar\nDemBlk4"},null,{"$f":"Prop2021DistTar!AF5","v":"FcastVol\nFixed"},{"$f":"Prop2021DistTar!AG5","v":"FcastVol\nPkBlk1"},{"$f":"Prop2021DistTar!AH5","v":"FcastVol\nPkBlk2"},{"$f":"Prop2021DistTar!AI5","v":"FcastVol\nPkBlk3"},{"$f":"Prop2021DistTar!AJ5","v":"FcastVol\nPkBlk4"},{"$f":"Prop2021DistTar!AK5","v":"FcastVol\nOPkBlk1"},{"$f":"Prop2021DistTar!AL5","v":"FcastVol\nOPkBlk2"},{"$f":"Prop2021DistTar!AM5","v":"FcastVol\nOPkBlk3"},{"$f":"Prop2021DistTar!AN5","v":"FcastVol\nOPkBlk4"},{"$f":"Prop2021DistTar!AO5","v":"FcastVol\nDemBlk1"},{"$f":"Prop2021DistTar!AP5","v":"FcastVol\nDemBlk2"},{"$f":"Prop2021DistTar!AQ5","v":"FcastVol\nDemBlk3"},{"$f":"Prop2021DistTar!AR5","v":"FcastVol\nDemBlk4"},null,"PropRev\nFixed","PropRev\nPkBlk1","PropRev\nPkBlk2","PropRev\nPkBlk3","PropRev\nPkBlk4","PropRev\nOPkBlk1","PropRev\nOPkBlk2","PropRev\nOPkBlk3","PropRev\nOPkBlk4","PropRev\nDemBlk1","PropRev\nDemBlk2","PropRev\nDemBlk3","PropRev\nDemBlk4","PropRev\nTotal"]
[null,{"$f":"Prop2021DistTar!B6","v":"NEE11  Small Single Rate < 160MWh"},null,0,2.1208999999999998,2.1208999999999998,0,0,0,0,0,0,0,0,0,0,null,{"$f":"Prop2021DistTar!AF6","v":239028.33445953517},{"$f":"Prop2021DistTar!AG6","v":686112016.75810897},{"$f":"Prop2021DistTar!AH6","v":283669233.43365067},{"$f":"Prop2021DistTar!AI6","v":0},{"$f":"Prop2021DistTar!AJ6","v":0},{"$f":"Prop2021DistTar!AK6","v":0},{"$f":"Prop2021DistTar!AL6","v":0},{"$f":"Prop2021DistTar!AM6","v":0},{"$f":"Prop2021DistTar!AN6","v":0},{"$f":"Prop2021DistTar!AO6","v":0},{"$f":"Prop2021DistTar!AP6","v":0},{"$f":"Prop2021DistTar!AQ6","v":0},{"$f":"Prop2021DistTar!AR6","v":0},null,{"$f":"D6*R6","v":0},{"$f":"E6/100*S6","v":14551749.763422733},6016340.7718942966,0,0,0,0,0,0,{"$f":"M6*AA6","v":0},0,0,0,{"$f":"SUM(AF6:AR6)","v":20568090.53531703}]
[null,{"$f":"Prop2021DistTar!B7","v":"NGT11  Small Interval Single Rate < 160MWh"},null,0,2.1208999999999998,0,0,0,0,0,0,0,0,0,0,0,null,{"$f":"Prop2021DistTar!AF7","v":4},{"$f":"Prop2021DistTar!AG7","v":15851.690337581815},{"$f":"Prop2021DistTar!AH7","v":0},{"$f":"Prop2021DistTar!AI7","v":0},{"$f":"Prop2021DistTar!AJ7","v":0},{"$f":"Prop2021DistTar!AK7","v":0},{"$f":"Prop2021DistTar!AL7","v":0},{"$f":"Prop2021DistTar!AM7","v":0},{"$f":"Prop2021DistTar!AN7","v":0},{"$f":"Prop2021DistTar!AO7","v":0},{"$f":"Prop2021DistTar!AP7","v":0},{"$f":"Prop2021DistTar!AQ7","v":0},{"$f":"Prop2021DistTar!AR7","v":0},null,{"$f":"D7*R7","v":0},{"$f":"E7/100*S7","v":336.19850036977266},0,0,0,0,0,0,0,{"$f":"M7*AA7","v":0},{"$f":"N7*AB7","v":0},{"$f":"O7*AC7","v":0},{"$f":"P7*AD7","v":0},{"$f":"SUM(AF7:AR7)","v":336.19850036977266}]
[null,{"$f":"Prop2021DistTar!B8","v":"NSP11  Small Single Rate < 160MWh"},null,0,2.1208999999999998,2.1208999999999998,2.1208999999999998,0,0.59150000000000003,0,0,0,0,0,0,0,null,{"$f":"Prop2021DistTar!AF8","v":0},{"$f":"Prop2021DistTar!AG8","v":0},{"$f":"Prop2021DistTar!AH8","v":0},{"$f":"Prop2021DistTar!AI8","v":0},{"$f":"Prop2021DistTar!AJ8","v":0},{"$f":"Prop2021DistTar!AK8","v":0},{"$f":"Prop2021DistTar!AL8","v":0},{"$f":"Prop2021DistTar!AM8","v":0},{"$f":"Prop2021DistTar!AN8","v":0},{"$f":"Prop2021DistTar!AO8","v":0},{"$f":"Prop2021DistTar!AP8","v":0},{"$f":"Prop2021DistTar!AQ8","v":0},{"$f":"Prop2021DistTar!AR8","v":0},null,0,0,0,0,0,0,0,0,0,0,0,0,0,0]
[null,{"$f":"Prop2021DistTar!B9","v":"NEN11  Small Single Rate < 160MWh Embedded Network"},null,0,2.1208999999999998,2.1208999999999998,0,0,0,0,0,0,0,0,0,0,null,{"$f":"Prop2021DistTar!AF9","v":0},{"$f":"Prop2021DistTar!AG9","v":0},{"$f":"Prop2021DistTar!AH9","v":0},{"$f":"Prop2021DistTar!AI9","v":0},{"$f":"Prop2021DistTar!AJ9","v":0},{"$f":"Prop2021DistTar!AK9","v":0},{"$f":"Prop2021DistTar!AL9","v":0},{"$f":"Prop2021DistTar!AM9","v":0},{"$f":"Prop2021DistTar!AN9","v":0},{"$f":"Prop2021DistTar!AO9","v":0},{"$f":"Prop2021DistTar!AP9","v":0},{"$f":"Prop2021DistTar!AQ9","v":0},{"$f":"Prop2021DistTar!AR9","v":0},null,0,0,0,0,0,0,0,0,0,0,0,0,0,0]
[null,{"$f":"Prop2021DistTar!B10","v":"NEE12  Small Business Single Rate - new in 2001"},null,0,2.1208999999999998,2.1208999999999998,0,0,0,0,0,0,0,0,0,0,null,{"$f":"Prop2021DistTar!AF10","v":14834.626022568389},{"$f":"Prop2021DistTar!AG10","v":29916679.022633694},{"$f":"Prop2021DistTar!AH10","v":46008597.658686936},{"$f":"Prop2021DistTar!AI10","v":0},{"$f":"Prop2021DistTar!AJ10","v":0},{"$f":"Prop2021DistTar!AK10","v":0},{"$f":"Prop2021DistTar!AL10","v":0},{"$f":"Prop2021DistTar!AM10","v":0},{"$f":"Prop2021DistTar!AN10","v":0},{"$f":"Prop2021DistTar!AO10","v":0},{"$f":"Prop2021DistTar!AP10","v":0},{"$f":"Prop2021DistTar!AQ10","v":0},{"$f":"Prop2021DistTar!AR10","v":0},null,0,634502.84539103799,975796.34774309117,0,0,0,0,0,0,0,0,0,0,1610299.193134129]
[null,{"$f":"Prop2021DistTar!B11","v":"NSP12  Small Business Single Rate - new in 2001"},null,0,2.1208999999999998,2.1208999999999998,2.1208999999999998,0,0.59150000000000003,0,0,0,0,0,0,0,null,{"$f":"Prop2021DistTar!AF11","v":0},{"$f":"Prop2021DistTar!AG11","v":0},{"$f":"Prop2021DistTar!AH11","v":0},{"$f":"Prop2021DistTar!AI11","v":0},{"$f":"Prop2021DistTar!AJ11","v":0},{"$f":"Prop2021DistTar!AK11","v":0},{"$f":"Prop2021DistTar!AL11","v":0},{"$f":"Prop2021DistTar!AM11","v":0},{"$f":"Prop2021DistTar!AN11","v":0},{"$f":"Prop2021DistTar!AO11","v":0},{"$f":"Prop2021DistTar!AP11","v":0},{"$f":"Prop2021DistTar!AQ11","v":0},{"$f":"Prop2021DistTar!AR11","v":0},null,0,0,0,0,0,0,0,0,0,0,0,0,0,0]
[null,{"$f":"Prop2021DistTar!B12","v":"NEN12  Small Business Single Rate - Embedded Network"},null,0,2.1208999999999998,2.1208999999999998,0,0,0,0,0,0,0,0,0,0,null,{"$f":"Prop2021DistTar!AF12","v":0},{"$f":"Prop2021DistTar!AG12","v":0},{"$f":"Prop2021DistTar!AH12","v":0},{"$f":"Prop2021DistTar!AI12","v":0},{"$f":"Prop2021DistTar!AJ12","v":0},{"$f":"Prop2021DistTar!AK12","v":0},{"$f":"Prop2021DistTar!AL12","v":0},{"$f":"Prop2021DistTar!AM12","v":0},{"$f":"Prop2021DistTar!AN12","v":0},{"$f":"Prop2021DistTar!AO12","v":0},{"$f":"Prop2021DistTar!AP12","v":0},{"$f":"Prop2021DistTar!AQ12","v":0},{"$f":"Prop2021DistTar!AR12","v":0},null,0,0,0,0,0,0,0,0,0,0,0,0,0,0]
[null,{"$f":"Prop2021DistTar!B13","v":"NEE20  Small Two Rate"},null,0,2.1208999999999998,0,0,0,0.59150000000000003,0,0,0,0,0,0,0,null,{"$f":"Prop2021DistTar!AF13","v":25675.158160203395},{"$f":"Prop2021DistTar!AG13","v":68100453.350972682},{"$f":"Prop2021DistTar!AH13","v":0},{"$f":"Prop2021DistTar!AI13","v":0},{"$f":"Prop2021DistTar!AJ13","v":0},{"$f":"Prop2021DistTar!AK13","v":90999048.342038363},{"$f":"Prop2021DistTar!AL13","v":0},{"$f":"Prop2021DistTar!AM13","v":0},{"$f":"Prop2021DistTar!AN13","v":0},{"$f":"Prop2021DistTar!AO13","v":0},{"$f":"Prop2021DistTar!AP13","v":0},{"$f":"Prop2021DistTar!AQ13","v":0},{"$f":"Prop2021DistTar!AR13","v":0},null,0,1444342.5151207796,0,0,0,538259.37094315689,0,0,0,0,0,0,0,1982601.8860639366]
[null,{"$f":"Prop2021DistTar!B14","v":"NSP20  Small Two Rate"},null,0,2.1208999999999998,2.1208999999999998,2.1208999999999998,0,0.59150000000000003,0,0,0,0,0,0,0,null,{"$f":"Prop2021DistTar!AF14","v":7},{"$f":"Prop2021DistTar!AG14","v":1224.099089443961},{"$f":"Prop2021DistTar!AH14","v":935.22469487542367},{"$f":"Prop2021DistTar!AI14","v":295.53170387454105},{"$f":"Prop2021DistTar!AJ14","v":0},{"$f":"Prop2021DistTar!AK14","v":40249.817884885495},{"$f":"Prop2021DistTar!AL14","v":0},{"$f":"Prop2021DistTar!AM14","v":0},{"$f":"Prop2021DistTar!AN14","v":0},{"$f":"Prop2021DistTar!AO14","v":0},{"$f":"Prop2021DistTar!AP14","v":0},{"$f":"Prop2021DistTar!AQ14","v":0},{"$f":"Prop2021DistTar!AR14","v":0},null,0,25.961917588016966,19.835180553612858,6.2679319074751412,0,238.0776727890977,0,0,0,0,0,0,0,290.14270283820269]
[null,{"$f":"Prop2021DistTar!B15","v":"NGT26  Small Interval Multi Rate"},null,0,2.1208999999999998,2.1208999999999998,2.1208999999999998,2.1208999999999998,0.59150000000000003,0.59150000000000003,0,0,0,0,0,0,null,{"$f":"Prop2021DistTar!AF15","v":778.33859346884094},{"$f":"Prop2021DistTar!AG15","v":1323806.2915151073},{"$f":"Prop2021DistTar!AH15","v":0},{"$f":"Prop2021DistTar!AI15","v":1378430.2281436233},{"$f":"Prop2021DistTar!AJ15","v":0},{"$f":"Prop2021DistTar!AK15","v":1366870.1749827666},{"$f":"Prop2021DistTar!AL15","v":0},{"$f":"Prop2021DistTar!AM15","v":0},{"$f":"Prop2021DistTar!AN15","v":0},{"$f":"Prop2021DistTar!AO15","v":0},{"$f":"Prop2021DistTar!AP15","v":0},{"$f":"Prop2021DistTar!AQ15","v":0},{"$f":"Prop2021DistTar!AR15","v":0},null,0,28076.607636743909,0,29235.126708698106,0,8085.0370850230647,0,0,0,0,0,0,0,65396.771430465087]
[null,{"$f":"Prop2021DistTar!B16","v":"NEN20  Small Two Rate - Embedded Network"},null,0,2.1208999999999998,0,0,0,0.59150000000000003,0,0,0,0,0,0,0,null,{"$f":"Prop2021DistTar!AF16","v":0},{"$f":"Prop2021DistTar!AG16","v":0},{"$f":"Prop2021DistTar!AH16","v":0},{"$f":"Prop2021DistTar!AI16","v":0},{"$f":"Prop2021DistTar!AJ16","v":0},{"$f":"Prop2021DistTar!AK16","v":0},{"$f":"Prop2021DistTar!AL16","v":0},{"$f":"Prop2021DistTar!AM16","v":0},{"$f":"Prop2021DistTar!AN16","v":0},{"$f":"Prop2021DistTar!AO16","v":0},{"$f":"Prop2021DistTar!AP16","v":0},{"$f":"Prop2021DistTar!AQ16","v":0},{"$f":"Prop2021DistTar!AR16","v":0},null,0,0,0,0,0,0,0,0,0,0,0,0,0,0]
[null,{"$f":"Prop2021DistTar!B17","v":"NEE21  Small Business Two Rate"},null,0,2.1208999999999998,0,0,0,0.59150000000000003,0,0,0,0,0,0,0,null,{"$f":"Prop2021DistTar!AF17","v":14772.518182372723},{"$f":"Prop2021DistTar!AG17","v":95606928.017334342},{"$f":"Prop2021DistTar!AH17","v":0},{"$f":"Prop2021DistTar!AI17","v":0},{"$f":"Prop2021DistTar!AJ17","v":0},{"$f":"Prop2021DistTar!AK17","v":71167541.716303572},{"$f":"Prop2021DistTar!AL17","v":0},{"$f":"Prop2021DistTar!AM17","v":-6826817.5715023922},{"$f":"Prop2021DistTar!AN17","v":0},{"$f":"Prop2021DistTar!AO17","v":0},{"$f":"Prop2021DistTar!AP17","v":0},{"$f":"Prop2021DistTar!AQ17","v":0},{"$f":"Prop2021DistTar!AR17","v":0},null,0,2027727.336319644,0,0,0,420956.00925193564,0,0,0,0,0,0,0,2448683.3455715794]
[null,{"$f":"Prop2021DistTar!B18","v":"NSP21  Small Business Two Rate"},null,0,2.1208999999999998,2.1208999999999998,2.1208999999999998,0,0.59150000000000003,0,0,0,0,0,0,0,null,{"$f":"Prop2021DistTar!AF18","v":12.387570584899215},{"$f":"Prop2021DistTar!AG18","v":3155.7072542765309},{"$f":"Prop2021DistTar!AH18","v":11732.089977530526},{"$f":"Prop2021DistTar!AI18","v":5294.7282030256811},{"$f":"Prop2021DistTar!AJ18","v":0},{"$f":"Prop2021DistTar!AK18","v":229094.7831057219},{"$f":"Prop2021DistTar!AL18","v":0},{"$f":"Prop2021DistTar!AM18","v":-1050},{"$f":"Prop2021DistTar!AN18","v":0},{"$f":"Prop2021DistTar!AO18","v":0},{"$f":"Prop2021DistTar!AP18","v":0},{"$f":"Prop2021DistTar!AQ18","v":0},{"$f":"Prop2021DistTar!AR18","v":0},null,0,66.929395155950942,248.82589633344492,112.29589045797167,0,1355.0956420703451,0,0,0,0,0,0,0,1783.1468240177126]
[null,{"$f":"Prop2021DistTar!B19","v":"NSP27  Small Business Two Rate"},null,0,2.1208999999999998,2.1208999999999998,2.1208999999999998,0,0.59150000000000003,0,0,0,0,0,0,0,null,{"$f":"Prop2021DistTar!AF19","v":111.83135587734887},{"$f":"Prop2021DistTar!AG19","v":26116.112755164144},{"$f":"Prop2021DistTar!AH19","v":26228.725674894009},{"$f":"Prop2021DistTar!AI19","v":65430.578916311686},{"$f":"Prop2021DistTar!AJ19","v":0},{"$f":"Prop2021DistTar!AK19","v":7355360.3860684065},{"$f":"Prop2021DistTar!AL19","v":0},{"$f":"Prop2021DistTar!AM19","v":-13316.4},{"$f":"Prop2021DistTar!AN19","v":0},{"$f":"Prop2021DistTar!AO19","v":0},{"$f":"Prop2021DistTar!AP19","v":0},{"$f":"Prop2021DistTar!AQ19","v":0},{"$f":"Prop2021DistTar!AR19","v":0},null,0,553.89663542427627,556.28504283882705,1387.7171482360545,0,43506.956683594624,0,0,0,0,0,0,0,46004.855510093781]
[null,{"$f":"Prop2021DistTar!B20","v":"NEN21  Small Business Two Rate - Embedded Network"},null,0,2.1208999999999998,0,0,0,0.59150000000000003,0,0,0,0,0,0,0,null,{"$f":"Prop2021DistTar!AF20","v":0},{"$f":"Prop2021DistTar!AG20","v":0},{"$f":"Prop2021DistTar!AH20","v":0},{"$f":"Prop2021DistTar!AI20","v":0},{"$f":"Prop2021DistTar!AJ20","v":0},{"$f":"Prop2021DistTar!AK20","v":0},{"$f":"Prop2021DistTar!AL20","v":0},{"$f":"Prop2021DistTar!AM20","v":0},{"$f":"Prop2021DistTar!AN20","v":0},{"$f":"Prop2021DistTar!AO20","v":0},{"$f":"Prop2021DistTar!AP20","v":0},{"$f":"Prop2021DistTar!AQ20","v":0},{"$f":"Prop2021DistTar!AR20","v":0},null,0,0,0,0,0,0,0,0,0,0,0,0,0,0]
[null,{"$f":"Prop2021DistTar!B21","v":"NEE23  Photovoltaic"},null,0,2.1208999999999998,0,0,0,0.59150000000000003,0,0,0,0,0,0,0,null,{"$f":"Prop2021DistTar!AF21","v":78747.110531012135},{"$f":"Prop2021DistTar!AG21","v":148727012.02353171},{"$f":"Prop2021DistTar!AH21","v":0},{"$f":"Prop2021DistTar!AI21","v":0},{"$f":"Prop2021DistTar!AJ21","v":0},{"$f":"Prop2021DistTar!AK21","v":186285788.86616242},{"$f":"Prop2021DistTar!AL21","v":0},{"$f":"Prop2021DistTar!AM21","v":-137295086.92091542},{"$f":"Prop2021DistTar!AN21","v":0},{"$f":"Prop2021DistTar!AO21","v":0},{"$f":"Prop2021DistTar!AP21","v":0},{"$f":"Prop2021DistTar!AQ21","v":0},{"$f":"Prop2021DistTar!AR21","v":0},null,0,3154351.198007084,0,0,0,1101880.4411433507,0,0,0,0,0,0,0,4256231.6391504351]
[null,{"$f":"Prop2021DistTar!B22","v":"NSP23  Photovoltaic"},null,0,2.1208999999999998,2.1208999999999998,2.1208999999999998,0,0.59150000000000003,0,0,0,0,0,0,0,null,{"$f":"Prop2021DistTar!AF22","v":153.58869603924799},{"$f":"Prop2021DistTar!AG22","v":1470.6086589900185},{"$f":"Prop2021DistTar!AH22","v":1503.7327154391771},{"$f":"Prop2021DistTar!AI22","v":36097.961621763301},{"$f":"Prop2021DistTar!AJ22","v":0},{"$f":"Prop2021DistTar!AK22","v":613592.27738774172},{"$f":"Prop2021DistTar!AL22","v":0},{"$f":"Prop2021DistTar!AM22","v":-354454.31721366808},{"$f":"Prop2021DistTar!AN22","v":0},{"$f":"Prop2021DistTar!AO22","v":0},{"$f":"Prop2021DistTar!AP22","v":0},{"$f":"Prop2021DistTar!AQ22","v":0},{"$f":"Prop2021DistTar!AR22","v":0},null,0,31.190139048519299,31.892667161749507,765.60166803597781,0,3629.3983207484926,0,0,0,0,0,0,0,4458.0827949947388]
[null,{"$f":"Prop2021DistTar!B23","v":"NEE24  Small rate 5 day 8 to 8"},null,0,2.1208999999999998,0,0,0,0.59150000000000003,0,0,0,0,0,0,0,null,{"$f":"Prop2021DistTar!AF23","v":1100.1692967344206},{"$f":"Prop2021DistTar!AG23","v":1290491.0935496474},{"$f":"Prop2021DistTar!AH23","v":0},{"$f":"Prop2021DistTar!AI23","v":0},{"$f":"Prop2021DistTar!AJ23","v":0},{"$f":"Prop2021DistTar!AK23","v":3209655.8945374847},{"$f":"Prop2021DistTar!AL23","v":0},{"$f":"Prop2021DistTar!AM23","v":0},{"$f":"Prop2021DistTar!AN23","v":0},{"$f":"Prop2021DistTar!AO23","v":0},{"$f":"Prop2021DistTar!AP23","v":0},{"$f":"Prop2021DistTar!AQ23","v":0},{"$f":"Prop2021DistTar!AR23","v":0},null,0,27370.025603094469,0,0,0,18985.114616189221,0,0,0,0,0,0,0,46355.14021928369]
[null,{"$f":"Prop2021DistTar!B24","v":"NEE25  Small business rate 5 day 8 to 8"},null,0,2.1208999999999998,0,0,0,0.59150000000000003,0,0,0,0,0,0,0,null,{"$f":"Prop2021DistTar!AF24","v":3.5},{"$f":"Prop2021DistTar!AG24","v":93117.103044688978},{"$f":"Prop2021DistTar!AH24","v":0},{"$f":"Prop2021DistTar!AI24","v":0},{"$f":"Prop2021DistTar!AJ24","v":0},{"$f":"Prop2021DistTar!AK24","v":100928.99758533001},{"$f":"Prop2021DistTar!AL24","v":0},{"$f":"Prop2021DistTar!AM24","v":0},{"$f":"Prop2021DistTar!AN24","v":0},{"$f":"Prop2021DistTar!AO24","v":0},{"$f":"Prop2021DistTar!AP24","v":0},{"$f":"Prop2021DistTar!AQ24","v":0},{"$f":"Prop2021DistTar!AR24","v":0},null,0,1974.9206384748084,0,0,0,596.99502071722702,0,0,0,0,0,0,0,2571.9156591920355]
[null,{"$f":"Prop2021DistTar!B25","v":"NEE30  Small Dedicated"},null,0,0,0,0,0,0.59150000000000003,0,0,0,0,0,0,0,null,{"$f":"Prop2021DistTar!AF25","v":42479.558530348069},{"$f":"Prop2021DistTar!AG25","v":0},{"$f":"Prop2021DistTar!AH25","v":0},{"$f":"Prop2021DistTar!AI25","v":0},{"$f":"Prop2021DistTar!AJ25","v":0},{"$f":"Prop2021DistTar!AK25","v":54981945.82309705},{"$f":"Prop2021DistTar!AL25","v":0},{"$f":"Prop2021DistTar!AM25","v":0},{"$f":"Prop2021DistTar!AN25","v":0},{"$f":"Prop2021DistTar!AO25","v":0},{"$f":"Prop2021DistTar!AP25","v":0},{"$f":"Prop2021DistTar!AQ25","v":0},{"$f":"Prop2021DistTar!AR25","v":0},null,0,0,0,0,0,325218.20954361907,0,0,0,0,0,0,0,325218.20954361907]
[null,{"$f":"Prop2021DistTar!B26","v":"NSP30  Small Dedicated"},null,0,0,0,0,0,0.59150000000000003,0,0,0,0,0,0,0,null,{"$f":"Prop2021DistTar!AF26","v":0},{"$f":"Prop2021DistTar!AG26","v":0},{"$f":"Prop2021DistTar!AH26","v":0},{"$f":"Prop2021DistTar!AI26","v":0},{"$f":"Prop2021DistTar!AJ26","v":0},{"$f":"Prop2021DistTar!AK26","v":0},{"$f":"Prop2021DistTar!AL26","v":0},{"$f":"Prop2021DistTar!AM26","v":0},{"$f":"Prop2021DistTar!AN26","v":0},{"$f":"Prop2021DistTar!AO26","v":0},{"$f":"Prop2021DistTar!AP26","v":0},{"$f":"Prop2021DistTar!AQ26","v":0},{"$f":"Prop2021DistTar!AR26","v":0},null,0,0,0,0,0,0,0,0,0,0,0,0,0,0]
[null,{"$f":"Prop2021DistTar!B27","v":"NEE31  Small Dedicated-afternoon boost"},null,0,0,0,0,0,0.59150000000000003,0,0,0,0,0,0,0,null,{"$f":"Prop2021DistTar!AF27","v":6284.0026251727604},{"$f":"Prop2021DistTar!AG27","v":0},{"$f":"Prop2021DistTar!AH27","v":0},{"$f":"Prop2021DistTar!AI27","v":0},{"$f":"Prop2021DistTar!AJ27","v":0},{"$f":"Prop2021DistTar!AK27","v":15874112.376413189},{"$f":"Prop2021DistTar!AL27","v":0},{"$f":"Prop2021DistTar!AM27","v":0},{"$f":"Prop2021DistTar!AN27","v":0},{"$f":"Prop2021DistTar!AO27","v":0},{"$f":"Prop2021DistTar!AP27","v":0},{"$f":"Prop2021DistTar!AQ27","v":0},{"$f":"Prop2021DistTar!AR27","v":0},null,0,0,0,0,0,93895.374706484014,0,0,0,0,0,0,0,93895.374706484014]
[null,{"$f":"Prop2021DistTar!B28","v":"NSP31  Small Dedicated-afternoon boost"},null,0,0,0,0,0,0.59150000000000003,0,0,0,0,0,0,0,null,{"$f":"Prop2021DistTar!AF28","v":0},{"$f":"Prop2021DistTar!AG28","v":0},{"$f":"Prop2021DistTar!AH28","v":0},{"$f":"Prop2021DistTar!AI28","v":0},{"$f":"Prop2021DistTar!AJ28","v":0},{"$f":"Prop2021DistTar!AK28","v":0},{"$f":"Prop2021DistTar!AL28","v":0},{"$f":"Prop2021DistTar!AM28","v":0},{"$f":"Prop2021DistTar!AN28","v":0},{"$f":"Prop2021DistTar!AO28","v":0},{"$f":"Prop2021DistTar!AP28","v":0},{"$f":"Prop2021DistTar!AQ28","v":0},{"$f":"Prop2021DistTar!AR28","v":0},null,0,0,0,0,0,0,0,0,0,0,0,0,0,0]
[null,{"$f":"Prop2021DistTar!B29","v":"NEE32  Dedicated Circuit 8 to 8"},null,0,0,0,0,0,0.59150000000000003,0,0,0,0,0,0,0,null,{"$f":"Prop2021DistTar!AF29","v":1823.9308862433866},{"$f":"Prop2021DistTar!AG29","v":0},{"$f":"Prop2021DistTar!AH29","v":0},{"$f":"Prop2021DistTar!AI29","v":0},{"$f":"Prop2021DistTar!AJ29","v":0},{"$f":"Prop2021DistTar!AK29","v":2310467.8003431028},{"$f":"Prop2021DistTar!AL29","v":0},{"$f":"Prop2021DistTar!AM29","v":0},{"$f":"Prop2021DistTar!AN29","v":0},{"$f":"Prop2021DistTar!AO29","v":0},{"$f":"Prop2021DistTar!AP29","v":0},{"$f":"Prop2021DistTar!AQ29","v":0},{"$f":"Prop2021DistTar!AR29","v":0},null,0,0,0,0,0,13666.417039029453,0,0,0,0,0,0,0,13666.417039029453]
[null,{"$f":"Prop2021DistTar!B30","v":"NSP32  Dedicated Circuit 8 to 8"},null,0,0,0,0,0,0.59150000000000003,0,0,0,0,0,0,0,null,{"$f":"Prop2021DistTar!AF30","v":0},{"$f":"Prop2021DistTar!AG30","v":0},{"$f":"Prop2021DistTar!AH30","v":0},{"$f":"Prop2021DistTar!AI30","v":0},{"$f":"Prop2021DistTar!AJ30","v":0},{"$f":"Prop2021DistTar!AK30","v":0},{"$f":"Prop2021DistTar!AL30","v":0},{"$f":"Prop2021DistTar!AM30","v":0},{"$f":"Prop2021DistTar!AN30","v":0},{"$f":"Prop2021DistTar!AO30","v":0},{"$f":"Prop2021DistTar!AP30","v":0},{"$f":"Prop2021DistTar!AQ30","v":0},{"$f":"Prop2021DistTar!AR30","v":0},null,0,0,0,0,0,0,0,0,0,0,0,0,0,0]
[null,{"$f":"Prop2021DistTar!B31","v":"NEE40  Medium Single Rate - closed to new customers"},null,0,2.1208999999999998,0,0,0,0,0,0,0,0,0,0,0,null,{"$f":"Prop2021DistTar!AF31","v":118.2170397004956},{"$f":"Prop2021DistTar!AG31","v":2580392.5635897103},{"$f":"Prop2021DistTar!AH31","v":0},{"$f":"Prop2021DistTar!AI31","v":0},{"$f":"Prop2021DistTar!AJ31","v":0},{"$f":"Prop2021DistTar!AK31","v":0},{"$f":"Prop2021DistTar!AL31","v":0},{"$f":"Prop2021DistTar!AM31","v":0},{"$f":"Prop2021DistTar!AN31","v":0},{"$f":"Prop2021DistTar!AO31","v":0},{"$f":"Prop2021DistTar!AP31","v":0},{"$f":"Prop2021DistTar!AQ31","v":0},{"$f":"Prop2021DistTar!AR31","v":0},null,0,54727.545881174163,0,0,0,0,0,0,0,0,0,0,0,54727.545881174163]
[null,{"$f":"Prop2021DistTar!B32","v":"NEE51  Medium Two Rate 5Day - closed to new customers - <160MWh to NEE21"},null,0,2.1208999999999998,0,0,0,0.59150000000000003,0,0,0,0,0,0,0,null,{"$f":"Prop2021DistTar!AF32","v":189.93512024048087},{"$f":"Prop2021DistTar!AG32","v":21635948.947650295},{"$f":"Prop2021DistTar!AH32","v":0},{"$f":"Prop2021DistTar!AI32","v":0},{"$f":"Prop2021DistTar!AJ32","v":0},{"$f":"Prop2021DistTar!AK32","v":18217897.32381659},{"$f":"Prop2021DistTar!AL32","v":0},{"$f":"Prop2021DistTar!AM32","v":0},{"$f":"Prop2021DistTar!AN32","v":0},{"$f":"Prop2021DistTar!AO32","v":0},{"$f":"Prop2021DistTar!AP32","v":0},{"$f":"Prop2021DistTar!AQ32","v":0},{"$f":"Prop2021DistTar!AR32","v":0},null,0,458876.8412307151,0,0,0,107758.86267037514,0,0,0,0,0,0,0,566635.70390109019]
[null,{"$f":"Prop2021DistTar!B33","v":"NEE55  Snowfields Tariff"},null,0,2.1208999999999998,0,0,0,0.59150000000000003,0,0,0,0,0,0,0,null,{"$f":"Prop2021DistTar!AF33","v":0.5},{"$f":"Prop2021DistTar!AG33","v":36029.745230023167},{"$f":"Prop2021DistTar!AH33","v":0},{"$f":"Prop2021DistTar!AI33","v":0},{"$f":"Prop2021DistTar!AJ33","v":0},{"$f":"Prop2021DistTar!AK33","v":37046.365479643602},{"$f":"Prop2021DistTar!AL33","v":0},{"$f":"Prop2021DistTar!AM33","v":0},{"$f":"Prop2021DistTar!AN33","v":0},{"$f":"Prop2021DistTar!AO33","v":0},{"$f":"Prop2021DistTar!AP33","v":0},{"$f":"Prop2021DistTar!AQ33","v":0},{"$f":"Prop2021DistTar!AR33","v":0},null,0,764.15486658356133,0,0,0,219.12925181209192,0,0,0,0,0,0,0,983.28411839565319]
[null,{"$f":"Prop2021DistTar!B34","v":"NSP55  Snowfields Tariff"},null,0,2.1208999999999998,2.1208999999999998,2.1208999999999998,0,0.59150000000000003,0,0,0,0,0,0,0,null,{"$f":"Prop2021DistTar!AF34","v":3.5},{"$f":"Prop2021DistTar!AG34","v":9550.2269132999972},{"$f":"Prop2021DistTar!AH34","v":54117.952508699993},{"$f":"Prop2021DistTar!AI34","v":25329.330215198261},{"$f":"Prop2021DistTar!AJ34","v":0},{"$f":"Prop2021DistTar!AK34","v":535690.87712180172},{"$f":"Prop2021DistTar!AL34","v":0},{"$f":"Prop2021DistTar!AM34","v":0},{"$f":"Prop2021DistTar!AN34","v":0},{"$f":"Prop2021DistTar!AO34","v":0},{"$f":"Prop2021DistTar!AP34","v":0},{"$f":"Prop2021DistTar!AQ34","v":0},{"$f":"Prop2021DistTar!AR34","v":0},null,0,202.55076260417962,1147.7876547570181,537.20976453413982,0,3168.6115381754571,0,0,0,0,0,0,0,5056.1597200707947]
[null,{"$f":"Prop2021DistTar!B35","v":"NSP56  Medium Demand Multi-rate"},null,0,2.1208999999999998,2.1208999999999998,0,0,0.59150000000000003,0,0,0,0,0,0,0,null,{"$f":"Prop2021DistTar!AF35","v":635.90625},{"$f":"Prop2021DistTar!AG35","v":42307312.421974368},{"$f":"Prop2021DistTar!AH35","v":32269925.84647819},{"$f":"Prop2021DistTar!AI35","v":0},{"$f":"Prop2021DistTar!AJ35","v":0},{"$f":"Prop2021DistTar!AK35","v":53760873.801854886},{"$f":"Prop2021DistTar!AL35","v":0},{"$f":"Prop2021DistTar!AM35","v":0},{"$f":"Prop2021DistTar!AN35","v":0},{"$f":"Prop2021DistTar!AO35","v":106189.73274366086},{"$f":"Prop2021DistTar!AP35","v":37696.837154329616},{"$f":"Prop2021DistTar!AQ35","v":0},{"$f":"Prop2021DistTar!AR35","v":0},null,{"$f":"D35*R35","v":0},{"$f":"E35/100*S35","v":897295.78915765428},684412.85727795586,0,0,317995.56853797165,0,0,0,{"$f":"M35*AA35","v":0},{"$f":"N35*AB35","v":0},{"$f":"O35*AC35","v":0},{"$f":"P35*AD35","v":0},{"$f":"SUM(AF35:AR35)","v":1899704.2149735817}]
[null,{"$f":"Prop2021DistTar!B36","v":"NEN56  Medium Demand Multi-rate  - Embedded Network"},null,0,2.1208999999999998,2.1208999999999998,0,0,0.59150000000000003,0,0,0,0,0,0,0,null,{"$f":"Prop2021DistTar!AF36","v":1},{"$f":"Prop2021DistTar!AG36","v":48857.900635350845},{"$f":"Prop2021DistTar!AH36","v":52671.607825623178},{"$f":"Prop2021DistTar!AI36","v":0},{"$f":"Prop2021DistTar!AJ36","v":0},{"$f":"Prop2021DistTar!AK36","v":48862.91000570199},{"$f":"Prop2021DistTar!AL36","v":0},{"$f":"Prop2021DistTar!AM36","v":0},{"$f":"Prop2021DistTar!AN36","v":0},{"$f":"Prop2021DistTar!AO36","v":260},{"$f":"Prop2021DistTar!AP36","v":73.394999999999996},{"$f":"Prop2021DistTar!AQ36","v":0},{"$f":"Prop2021DistTar!AR36","v":0},null,0,1036.227214575156,1117.112130373642,0,0,289.02411268372725,0,0,0,0,0,0,0,2442.3634576325253]
[null,{"$f":"Prop2021DistTar!B37","v":"NEE60  Medium Two Rate 7Day - closed to new customers"},null,0,2.1208999999999998,0,0,0,0.59150000000000003,0,0,0,0,0,0,0,null,{"$f":"Prop2021DistTar!AF37","v":151.6656605113636},{"$f":"Prop2021DistTar!AG37","v":11912095.648898043},{"$f":"Prop2021DistTar!AH37","v":0},{"$f":"Prop2021DistTar!AI37","v":0},{"$f":"Prop2021DistTar!AJ37","v":0},{"$f":"Prop2021DistTar!AK37","v":3866727.1285819211},{"$f":"Prop2021DistTar!AL37","v":0},{"$f":"Prop2021DistTar!AM37","v":0},{"$f":"Prop2021DistTar!AN37","v":0},{"$f":"Prop2021DistTar!AO37","v":0},{"$f":"Prop2021DistTar!AP37","v":0},{"$f":"Prop2021DistTar!AQ37","v":0},{"$f":"Prop2021DistTar!AR37","v":0},null,0,252643.63661747857,0,0,0,22871.690965562062,0,0,0,0,0,0,0,275515.32758304063]
[null,{"$f":"Prop2021DistTar!B38","v":"NEE52  Unmetered"},null,0,2.1208999999999998,0,0,0,0.59150000000000003,0,0,0,0,0,0,0,null,{"$f":"Prop2021DistTar!AF38","v":44.5},{"$f":"Prop2021DistTar!AG38","v":7313424.2443653559},{"$f":"Prop2021DistTar!AH38","v":0},{"$f":"Prop2021DistTar!AI38","v":0},{"$f":"Prop2021DistTar!AJ38","v":0},{"$f":"Prop2021DistTar!AK38","v":18444180.326888889},{"$f":"Prop2021DistTar!AL38","v":0},{"$f":"Prop2021DistTar!AM38","v":0},{"$f":"Prop2021DistTar!AN38","v":0},{"$f":"Prop2021DistTar!AO38","v":0},{"$f":"Prop2021DistTar!AP38","v":0},{"$f":"Prop2021DistTar!AQ38","v":0},{"$f":"Prop2021DistTar!AR38","v":0},null,0,155110.41479874484,0,0,0,109097.32663354778,0,0,0,0,0,0,0,264207.74143229262]
[null,{"$f":"Prop2021DistTar!B39","v":"NEE74  LV Large Two Rate 5Day"},null,0,2.1208999999999998,0,0,0,0.59150000000000003,0,0,0,0,0,0,0,null,{"$f":"Prop2021DistTar!AF39","v":3.5},{"$f":"Prop2021DistTar!AG39","v":941231.65833174856},{"$f":"Prop2021DistTar!AH39","v":0},{"$f":"Prop2021DistTar!AI39","v":0},{"$f":"Prop2021DistTar!AJ39","v":0},{"$f":"Prop2021DistTar!AK39","v":1062334.4272307118},{"$f":"Prop2021DistTar!AL39","v":0},{"$f":"Prop2021DistTar!AM39","v":0},{"$f":"Prop2021DistTar!AN39","v":0},{"$f":"Prop2021DistTar!AO39","v":0},{"$f":"Prop2021DistTar!AP39","v":0},{"$f":"Prop2021DistTar!AQ39","v":0},{"$f":"Prop2021DistTar!AR39","v":0},null,0,19962.582241558055,0,0,0,6283.7081370696606,0,0,0,0,0,0,0,26246.290378627717]
[null,{"$f":"Prop2021DistTar!B40","v":"NSP75  Large Multi-rate <750 kVA"},null,0,2.1208999999999998,2.1208999999999998,0,0,0.59150000000000003,0,0,0,0,0,0,0,null,{"$f":"Prop2021DistTar!AF40","v":399.73750000000018},{"$f":"Prop2021DistTar!AG40","v":65066965.823548958},{"$f":"Prop2021DistTar!AH40","v":46895776.109417975},{"$f":"Prop2021DistTar!AI40","v":0},{"$f":"Prop2021DistTar!AJ40","v":0},{"$f":"Prop2021DistTar!AK40","v":87211176.761339754},{"$f":"Prop2021DistTar!AL40","v":0},{"$f":"Prop2021DistTar!AM40","v":0},{"$f":"Prop2021DistTar!AN40","v":0},{"$f":"Prop2021DistTar!AO40","v":106150.66325231486},{"$f":"Prop2021DistTar!AP40","v":47175.123367353335},{"$f":"Prop2021DistTar!AQ40","v":0},{"$f":"Prop2021DistTar!AR40","v":0},null,0,1380005.2781516497,994612.51550464577,0,0,515854.11054332467,0,0,0,0,0,0,0,2890471.9041996202]
[null,{"$f":"Prop2021DistTar!B41","v":"NSP76  Large Multi-rate >750 kVA"},null,0,2.1208999999999998,2.1208999999999998,0,0,0.59150000000000003,0,0,0,0,0,0,0,null,{"$f":"Prop2021DistTar!AF41","v":276.04374999999987},{"$f":"Prop2021DistTar!AG41","v":96539748.775621518},{"$f":"Prop2021DistTar!AH41","v":70796917.756179661},{"$f":"Prop2021DistTar!AI41","v":0},{"$f":"Prop2021DistTar!AJ41","v":0},{"$f":"Prop2021DistTar!AK41","v":125406478.88905282},{"$f":"Prop2021DistTar!AL41","v":0},{"$f":"Prop2021DistTar!AM41","v":0},{"$f":"Prop2021DistTar!AN41","v":0},{"$f":"Prop2021DistTar!AO41","v":145281.41982565779},{"$f":"Prop2021DistTar!AP41","v":64874.075578297932},{"$f":"Prop2021DistTar!AQ41","v":0},{"$f":"Prop2021DistTar!AR41","v":0},null,0,2047511.5317821566,1501531.8286908143,0,0,741779.32262874744,0,0,0,0,0,0,0,4290822.6831017183]
[null,{"$f":"Prop2021DistTar!B42","v":"NSP77  Large Multi-rate >2 GWh"},null,0,2.1208999999999998,2.1208999999999998,0,0,0.59150000000000003,0,0,0,0,0,0,0,null,{"$f":"Prop2021DistTar!AF42","v":42.237499999999997},{"$f":"Prop2021DistTar!AG42","v":32246242.093563192},{"$f":"Prop2021DistTar!AH42","v":22577275.465703305},{"$f":"Prop2021DistTar!AI42","v":0},{"$f":"Prop2021DistTar!AJ42","v":0},{"$f":"Prop2021DistTar!AK42","v":41375655.650008813},{"$f":"Prop2021DistTar!AL42","v":0},{"$f":"Prop2021DistTar!AM42","v":0},{"$f":"Prop2021DistTar!AN42","v":0},{"$f":"Prop2021DistTar!AO42","v":39295.959821428572},{"$f":"Prop2021DistTar!AP42","v":19178.786775914636},{"$f":"Prop2021DistTar!AQ42","v":0},{"$f":"Prop2021DistTar!AR42","v":0},null,0,683910.54856238165,478841.43535210134,0,0,244737.00316980213,0,0,0,0,0,0,0,1407488.9870842849]
[null,{"$f":"Prop2021DistTar!B43","v":"NSP78  Large Multi-rate >4 GWh"},null,0,2.1208999999999998,2.1208999999999998,0,0,0.59150000000000003,0,0,0,0,0,0,0,null,{"$f":"Prop2021DistTar!AF43","v":17.737499999999997},{"$f":"Prop2021DistTar!AG43","v":25893028.545737665},{"$f":"Prop2021DistTar!AH43","v":17970261.114019543},{"$f":"Prop2021DistTar!AI43","v":0},{"$f":"Prop2021DistTar!AJ43","v":0},{"$f":"Prop2021DistTar!AK43","v":33397961.120601483},{"$f":"Prop2021DistTar!AL43","v":0},{"$f":"Prop2021DistTar!AM43","v":0},{"$f":"Prop2021DistTar!AN43","v":0},{"$f":"Prop2021DistTar!AO43","v":25171.599264705874},{"$f":"Prop2021DistTar!AP43","v":16125.000503906245},{"$f":"Prop2021DistTar!AQ43","v":0},{"$f":"Prop2021DistTar!AR43","v":0},null,0,549165.24242655013,381131.26796724048,0,0,197548.94002835779,0,0,0,0,0,0,0,1127845.4504221485]
[null,{"$f":"Prop2021DistTar!B44","v":"NSP81  HV Kva"},null,0,2.1208999999999998,0,0,0,0.59150000000000003,0,0,0,0,0,0,0,null,{"$f":"Prop2021DistTar!AF44","v":30.237499999999997},{"$f":"Prop2021DistTar!AG44","v":124298431.5797957},{"$f":"Prop2021DistTar!AH44","v":0},{"$f":"Prop2021DistTar!AI44","v":0},{"$f":"Prop2021DistTar!AJ44","v":0},{"$f":"Prop2021DistTar!AK44","v":105890467.84826557},{"$f":"Prop2021DistTar!AL44","v":0},{"$f":"Prop2021DistTar!AM44","v":0},{"$f":"Prop2021DistTar!AN44","v":0},{"$f":"Prop2021DistTar!AO44","v":97969.5},{"$f":"Prop2021DistTar!AP44","v":42579.599664215682},{"$f":"Prop2021DistTar!AQ44","v":0},{"$f":"Prop2021DistTar!AR44","v":0},null,0,2636245.435375887,0,0,0,626342.1173224909,0,0,0,0,0,0,0,3262587.552698378]
[null,{"$f":"Prop2021DistTar!B45","v":"NSP82  Traction"},null,0,2.1208999999999998,2.1208999999999998,0,0,0.59150000000000003,0,0,0,0,0,0,0]
[null,{"$f":"Prop2021DistTar!B46","v":"NSP83  Small HV"},null,0,2.1208999999999998,2.1208999999999998,0,0,0.59150000000000003,0,0,0,0,0,0,0,null,{"$f":"Prop2021DistTar!AF46","v":10.237499999999997},{"$f":"Prop2021DistTar!AG46","v":2797789.0999321593},{"$f":"Prop2021DistTar!AH46","v":1951495.4974704923},{"$f":"Prop2021DistTar!AI46","v":0},{"$f":"Prop2021DistTar!AJ46","v":0},{"$f":"Prop2021DistTar!AK46","v":2416770.4731495506},{"$f":"Prop2021DistTar!AL46","v":0},{"$f":"Prop2021DistTar!AM46","v":0},{"$f":"Prop2021DistTar!AN46","v":0},{"$f":"Prop2021DistTar!AO46","v":12870.812499999998},{"$f":"Prop2021DistTar!AP46","v":3028.0285546874989},{"$f":"Prop2021DistTar!AQ46","v":0},{"$f":"Prop2021DistTar!AR46","v":0},null,0,59338.309020461165,41389.268005851671,0,0,14295.197348679592,0,0,0,0,0,0,0,115022.77437499243]
[null,{"$f":"Prop2021DistTar!B47","v":"NSP91  ST kVA"},null,0,2.1208999999999998,0,0,0,0.59150000000000003,0,0,0,0,0,0,0]
[null,{"$f":"Prop2021DistTar!B48","v":"NEE93  Latrobe Generators kVA (non published)"},null,0,1.3638999999999999,0,0,0,1.3638999999999999,0,0,0,0,0,0,0]
[null,{"$f":"Prop2021DistTar!B49","v":"NSP94  - ST kVA >25MVA <20kM"},null,0,2.1208999999999998,0,0,0,0.59150000000000003,0,0,0,0,0,0,0]
[null,{"$f":"Prop2021DistTar!B50","v":"NSP95  - ST kVA <25MVA >20kM"},null,0,2.1208999999999998,0,0,0,0.59150000000000003,0,0,0,0,0,0,0]
[null,{"$f":"Prop2021DistTar!B51","v":"NASN19 - Business >40MWh Single Rate"},null,0,2.1208999999999998,2.1208999999999998,0,0,0,0,0,0,0,0,0,0,null,{"$f":"Prop2021DistTar!AF51","v":538.88757058489909},{"$f":"Prop2021DistTar!AG51","v":25110693.908453003},{"$f":"Prop2021DistTar!AH51","v":0},{"$f":"Prop2021DistTar!AI51","v":0},{"$f":"Prop2021DistTar!AJ51","v":0},{"$f":"Prop2021DistTar!AK51","v":0},{"$f":"Prop2021DistTar!AL51","v":0},{"$f":"Prop2021DistTar!AM51","v":0},{"$f":"Prop2021DistTar!AN51","v":0},{"$f":"Prop2021DistTar!AO51","v":46042.525159725694},{"$f":"Prop2021DistTar!AP51","v":57855.168031556212},{"$f":"Prop2021DistTar!AQ51","v":0},{"$f":"Prop2021DistTar!AR51","v":0},null,0,532572.70710437966,0,0,0,0,0,0,0,0,0,0,0,532572.70710437966]
[null,{"$f":"Prop2021DistTar!B52","v":"NASN21 - Business >40MWh Two Rate"},null,0,2.1208999999999998,0,0,0,0.59150000000000003,0,0,0,0,0,0,0,null,{"$f":"Prop2021DistTar!AF52","v":4310.6126922669546},{"$f":"Prop2021DistTar!AG52","v":142345744.55856839},{"$f":"Prop2021DistTar!AH52","v":0},{"$f":"Prop2021DistTar!AI52","v":0},{"$f":"Prop2021DistTar!AJ52","v":0},{"$f":"Prop2021DistTar!AK52","v":121263382.52617116},{"$f":"Prop2021DistTar!AL52","v":0},{"$f":"Prop2021DistTar!AM52","v":-3978461.3033247795},{"$f":"Prop2021DistTar!AN52","v":0},{"$f":"Prop2021DistTar!AO52","v":494986.76394302316},{"$f":"Prop2021DistTar!AP52","v":641947.97495058272},{"$f":"Prop2021DistTar!AQ52","v":0},{"$f":"Prop2021DistTar!AR52","v":0},null,0,3019010.8963426766,0,0,0,717272.90764230245,0,0,0,0,0,0,0,3736283.8039849792]
[null,{"$f":"Prop2021DistTar!B53","v":"NASN11 - Residential Single Rate"},null,0,2.1208999999999998,2.1208999999999998,0,0,0,0,0,0,0,0,0,0,null,{"$f":"Prop2021DistTar!AF53","v":19.966929673442056},{"$f":"Prop2021DistTar!AG53","v":80493.510867320554},{"$f":"Prop2021DistTar!AH53","v":0},{"$f":"Prop2021DistTar!AI53","v":0},{"$f":"Prop2021DistTar!AJ53","v":0},{"$f":"Prop2021DistTar!AK53","v":0},{"$f":"Prop2021DistTar!AL53","v":0},{"$f":"Prop2021DistTar!AM53","v":-17314.276666666665},{"$f":"Prop2021DistTar!AN53","v":0},{"$f":"Prop2021DistTar!AO53","v":253.94151057393117},{"$f":"Prop2021DistTar!AP53","v":378.09607402309706},{"$f":"Prop2021DistTar!AQ53","v":0},{"$f":"Prop2021DistTar!AR53","v":0},null,0,1707.1868719850015,0,0,0,0,0,0,0,0,0,0,0,1707.1868719850015]
[null,{"$f":"Prop2021DistTar!B54","v":"NASN12 - Business Single Rate"},null,0,2.1208999999999998,2.1208999999999998,0,0,0,0,0,0,0,0,0,0,null,{"$f":"Prop2021DistTar!AF54","v":3.4437852924496077},{"$f":"Prop2021DistTar!AG54","v":64170.787285383543},{"$f":"Prop2021DistTar!AH54","v":0},{"$f":"Prop2021DistTar!AI54","v":0},{"$f":"Prop2021DistTar!AJ54","v":0},{"$f":"Prop2021DistTar!AK54","v":0},{"$f":"Prop2021DistTar!AL54","v":0},{"$f":"Prop2021DistTar!AM54","v":0},{"$f":"Prop2021DistTar!AN54","v":0},{"$f":"Prop2021DistTar!AO54","v":301.88300295419225},{"$f":"Prop2021DistTar!AP54","v":587.75571651416521},{"$f":"Prop2021DistTar!AQ54","v":0},{"$f":"Prop2021DistTar!AR54","v":0},null,0,1360.9982275356995,0,0,0,0,0,0,0,0,0,0,0,1360.9982275356995]
[null,null,null,null,null,null,null,null,null,null,null,null,null,null,null,null,null,null,null,null,null,null,null,null,null,null,null,null,null,null,null,0,{"$f":"E55/100*S55","v":0},0,0,0,0,0,0,0,0,0,0,0,0]
[null,null,null,null,null,null,null,null,null,null,null,null,null,null,null,null,null,null,null,null,null,null,null,null,null,null,null,null,null,null,null,0,0,0,0,0,0,0,0,0,0,0,0,0,0]
[null,null,null,null,null,null,null,null,null,null,null,null,null,null,null,null,null,null,null,null,null,null,null,null,null,null,null,null,null,null,null,0,0,0,0,0,0,0,0,0,0,0,0,0,0]
[null,null,null,null,null,null,null,null,null,null,null,null,null,null,null,null,null,null,null,null,null,null,null,null,null,null,null,null,null,null,null,0,0,0,0,0,0,0,0,0,0,0,0,0,0]
[null,null,null,null,null,null,null,null,null,null,null,null,null,null,null,null,null,null,null,null,null,null,null,null,null,null,null,null,null,null,null,0,0,0,0,0,0,0,0,0,0,0,0,0,0]
[null,null,null,null,null,null,null,null,null,null,null,null,null,null,null,null,null,null,null,null,null,null,null,null,null,null,null,null,null,null,null,0,0,0,0,0,0,0,0,0,0,0,0,0,0]
[null,null,null,null,null,null,null,null,null,null,null,null,null,null,null,null,null,null,null,null,null,null,null,null,null,null,null,null,null,null,null,0,0,0,0,0,0,0,0,0,0,0,0,0,0]
[null,null,null,null,null,null,null,null,null,null,null,null,null,null,null,null,null,null,null,null,null,null,null,null,null,null,null,null,null,null,null,0,0,0,0,0,0,0,0,0,0,0,0,0,0]
[null,null,null,null,null,null,null,null,null,null,null,null,null,null,null,null,null,null,null,null,null,null,null,null,null,null,null,null,null,null,null,0,0,0,0,0,0,0,0,0,0,0,0,0,0]
[null,null,null,null,null,null,null,null,null,null,null,null,null,null,null,null,null,null,null,null,null,null,null,null,null,null,null,null,null,null,null,0,0,0,0,0,0,0,0,0,0,0,0,0,0]
[null,null,null,null,null,null,null,null,null,null,null,null,null,null,null,null,null,null,null,null,null,null,null,null,null,null,null,null,null,null,null,0,0,0,0,0,0,0,0,0,0,0,0,0,0]
[null,null,null,null,null,null,null,null,null,null,null,null,null,null,null,null,null,432634.65870843077,1786652651.8820281,531414916.41767955,1510878.3588037968,0,1214863393.8000841,0,-148486500.78962293,0,1175008.638524045,968350.26590888109,0,0,null,0,37525076.666820586,11270778.962302567,32044.219111869723,0,7561443.5970125534,0,0,0,0,0,0,0,56389343.445247576]

{"sheet":"2021TransRevCont","index":14,"n_rows":19,"n_cols":3,"rows_kept":19,"cut":false,"hidden":false,"merged":[]}
[]
[null,{"$f":"\"Tariff Approval - \"&'Model update'!$C$3","v":"Tariff Approval - AusNet Services"},{"$f":"'Model update'!$C$5&\"TransRevCont\"","v":"2021TransRevCont"}]
[]
[null," Designated pricing proposal charges (DPPC)"]
[]
[null,"Year (t)",{"$f":"'Model update'!C5","v":2021}]
[]
[null,"Table 1- Compliance with DPPC Revenue Formula"]
[null,"Revenue from designated pricing proposal charges for year t",{"$f":"Prop2021TransTar!AS66","v":56389343.445247576}]
[null,"Total DPPC related payments for year t",{"$f":"C19","v":56389370.438989662}]
[null,null,{"$f":"IF(C9=\"\",\"\",IF(C10>=C9,\"DPPC REVENUE FORMULA COMPLIANT\",\"DPPC REVENUE FORMULA BREACHED\"))","v":"DPPC REVENUE FORMULA COMPLIANT"}]
[]
[]
[null,"Table 3 - Transmission charges for year t"]
[null,"AEMO (TCt)",54313840.992434382]
[null,"Transmission connection (TCt)",4551670.352026646]
[null,"Embedded generators (Gt)",407717.79499999998]
[null,"Inter-network (Dt)",2883858.7004713686]
[null,"TC + G - D",{"$f":"C15+C16+C17-C18","v":56389370.438989662}]

{"sheet":"Prop2021JSTar","index":15,"n_rows":66,"n_cols":45,"rows_kept":66,"cut":false,"hidden":false,"merged":[]}
[null,{"$f":"\"Tariff Approval - \"&'Model update'!C3","v":"Tariff Approval - AusNet Services"},null,{"$f":"\"Prop\"&'Model update'!$C$5&\"JSTar\"","v":"Prop2021JSTar"}]
[]
[null,{"$f":"\"PROPOSED \"&'Model update'!$C$5&\" JURISDICTIONAL SCHEME TARIFFS\"","v":"PROPOSED 2021 JURISDICTIONAL SCHEME TARIFFS"}]
[null,null,null,{"$f":"\"Proposed Jurisdictional scheme Tariffs (Pt) for \"&'Model update'!$C$5","v":"Proposed Jurisdictional scheme Tariffs (Pt) for 2021"},null,null,null,null,null,null,null,null,null,null,null,null,null,{"$f":"\"Forecast Quantities (Qt) for \"&'Model update'!$C$5","v":"Forecast Quantities (Qt) for 2021"},null,null,null,null,null,null,null,null,null,null,null,null,null,{"$f":"\"Forecast Revenue (Pt \"&'Model update'!$C$5&\")*(Qt \" &'Model update'!$C$5&\")\"","v":"Forecast Revenue (Pt 2021)*(Qt 2021)"}]
[null,"Proposed tariff",null,{"$f":"Prop2021DistTar!D5","v":"PropTar\nFixed"},{"$f":"Prop2021DistTar!E5","v":"PropTar\nPkBlk1"},{"$f":"Prop2021DistTar!F5","v":"PropTar\nPkBlk2"},{"$f":"Prop2021DistTar!G5","v":"PropTar\nPkBlk3"},{"$f":"Prop2021DistTar!H5","v":"PropTar\nPkBlk4"},{"$f":"Prop2021DistTar!I5","v":"PropTar\nOPkBlk1"},{"$f":"Prop2021DistTar!J5","v":"PropTar\nOPkBlk2"},{"$f":"Prop2021DistTar!K5","v":"PropTar\nOPkBlk3"},{"$f":"Prop2021DistTar!L5","v":"PropTar\nOPkBlk4"},{"$f":"Prop2021DistTar!M5","v":"PropTar\nDemBlk1"},{"$f":"Prop2021DistTar!N5","v":"PropTar\nDemBlk2"},{"$f":"Prop2021DistTar!O5","v":"PropTar\nDemBlk3"},{"$f":"Prop2021DistTar!P5","v":"PropTar\nDemBlk4"},null,{"$f":"Prop2021DistTar!AF5","v":"FcastVol\nFixed"},{"$f":"Prop2021DistTar!AG5","v":"FcastVol\nPkBlk1"},{"$f":"Prop2021DistTar!AH5","v":"FcastVol\nPkBlk2"},{"$f":"Prop2021DistTar!AI5","v":"FcastVol\nPkBlk3"},{"$f":"Prop2021DistTar!AJ5","v":"FcastVol\nPkBlk4"},{"$f":"Prop2021DistTar!AK5","v":"FcastVol\nOPkBlk1"},{"$f":"Prop2021DistTar!AL5","v":"FcastVol\nOPkBlk2"},{"$f":"Prop2021DistTar!AM5","v":"FcastVol\nOPkBlk3"},{"$f":"Prop2021DistTar!AN5","v":"FcastVol\nOPkBlk4"},{"$f":"Prop2021DistTar!AO5","v":"FcastVol\nDemBlk1"},{"$f":"Prop2021DistTar!AP5","v":"FcastVol\nDemBlk2"},{"$f":"Prop2021DistTar!AQ5","v":"FcastVol\nDemBlk3"},{"$f":"Prop2021DistTar!AR5","v":"FcastVol\nDemBlk4"},null,"PropRev\nFixed","PropRev\nPkBlk1","PropRev\nPkBlk2","PropRev\nPkBlk3","PropRev\nPkBlk4","PropRev\nOPkBlk1","PropRev\nOPkBlk2","PropRev\nOPkBlk3","PropRev\nOPkBlk4","PropRev\nDemBlk1","PropRev\nDemBlk2","PropRev\nDemBlk3","PropRev\nDemBlk4","PropRev\nTotal"]
[null,{"$f":"Prop2021DistTar!B6","v":"NEE11  Small Single Rate < 160MWh"},null,0,0.57509999999999994,0.57509999999999994,0,0,0,0,0,0,0,0,0,0,null,{"$f":"Prop2021DistTar!AF6","v":239028.33445953517},{"$f":"Prop2021DistTar!AG6","v":686112016.75810897},{"$f":"Prop2021DistTar!AH6","v":283669233.43365067},{"$f":"Prop2021DistTar!AI6","v":0},{"$f":"Prop2021DistTar!AJ6","v":0},{"$f":"Prop2021DistTar!AK6","v":0},{"$f":"Prop2021DistTar!AL6","v":0},{"$f":"Prop2021DistTar!AM6","v":0},{"$f":"Prop2021DistTar!AN6","v":0},{"$f":"Prop2021DistTar!AO6","v":0},{"$f":"Prop2021DistTar!AP6","v":0},{"$f":"Prop2021DistTar!AQ6","v":0},{"$f":"Prop2021DistTar!AR6","v":0},null,{"$f":"D6*R6","v":0},{"$f":"E6/100*S6","v":3945830.2083758842},1631381.7614769249,0,0,0,0,0,0,{"$f":"M6*AA6","v":0},0,0,0,{"$f":"SUM(AF6:AR6)","v":5577211.9698528089}]
[null,{"$f":"Prop2021DistTar!B7","v":"NGT11  Small Interval Single Rate < 160MWh"},null,0,0.57509999999999994,0,0,0,0,0,0,0,0,0,0,0,null,{"$f":"Prop2021DistTar!AF7","v":4},{"$f":"Prop2021DistTar!AG7","v":15851.690337581815},{"$f":"Prop2021DistTar!AH7","v":0},{"$f":"Prop2021DistTar!AI7","v":0},{"$f":"Prop2021DistTar!AJ7","v":0},{"$f":"Prop2021DistTar!AK7","v":0},{"$f":"Prop2021DistTar!AL7","v":0},{"$f":"Prop2021DistTar!AM7","v":0},{"$f":"Prop2021DistTar!AN7","v":0},{"$f":"Prop2021DistTar!AO7","v":0},{"$f":"Prop2021DistTar!AP7","v":0},{"$f":"Prop2021DistTar!AQ7","v":0},{"$f":"Prop2021DistTar!AR7","v":0},null,{"$f":"D7*R7","v":0},{"$f":"E7/100*S7","v":91.163071131433},0,0,0,0,0,0,0,{"$f":"M7*AA7","v":0},{"$f":"N7*AB7","v":0},{"$f":"O7*AC7","v":0},{"$f":"P7*AD7","v":0},{"$f":"SUM(AF7:AR7)","v":91.163071131433}]
[null,{"$f":"Prop2021DistTar!B8","v":"NSP11  Small Single Rate < 160MWh"},null,0,0.57509999999999994,0.57509999999999994,0.57509999999999994,0,0.48280000000000001,0,0,0,0,0,0,0,null,{"$f":"Prop2021DistTar!AF8","v":0},{"$f":"Prop2021DistTar!AG8","v":0},{"$f":"Prop2021DistTar!AH8","v":0},{"$f":"Prop2021DistTar!AI8","v":0},{"$f":"Prop2021DistTar!AJ8","v":0},{"$f":"Prop2021DistTar!AK8","v":0},{"$f":"Prop2021DistTar!AL8","v":0},{"$f":"Prop2021DistTar!AM8","v":0},{"$f":"Prop2021DistTar!AN8","v":0},{"$f":"Prop2021DistTar!AO8","v":0},{"$f":"Prop2021DistTar!AP8","v":0},{"$f":"Prop2021DistTar!AQ8","v":0},{"$f":"Prop2021DistTar!AR8","v":0},null,0,0,0,0,0,0,0,0,0,0,0,0,0,0]
[null,{"$f":"Prop2021DistTar!B9","v":"NEN11  Small Single Rate < 160MWh Embedded Network"},null,0,0.57509999999999994,0.57509999999999994,0,0,0,0,0,0,0,0,0,0,null,{"$f":"Prop2021DistTar!AF9","v":0},{"$f":"Prop2021DistTar!AG9","v":0},{"$f":"Prop2021DistTar!AH9","v":0},{"$f":"Prop2021DistTar!AI9","v":0},{"$f":"Prop2021DistTar!AJ9","v":0},{"$f":"Prop2021DistTar!AK9","v":0},{"$f":"Prop2021DistTar!AL9","v":0},{"$f":"Prop2021DistTar!AM9","v":0},{"$f":"Prop2021DistTar!AN9","v":0},{"$f":"Prop2021DistTar!AO9","v":0},{"$f":"Prop2021DistTar!AP9","v":0},{"$f":"Prop2021DistTar!AQ9","v":0},{"$f":"Prop2021DistTar!AR9","v":0},null,0,0,0,0,0,0,0,0,0,0,0,0,0,0]
[null,{"$f":"Prop2021DistTar!B10","v":"NEE12  Small Business Single Rate - new in 2001"},null,0,0.57509999999999994,0.57509999999999994,0,0,0,0,0,0,0,0,0,0,null,{"$f":"Prop2021DistTar!AF10","v":14834.626022568389},{"$f":"Prop2021DistTar!AG10","v":29916679.022633694},{"$f":"Prop2021DistTar!AH10","v":46008597.658686936},{"$f":"Prop2021DistTar!AI10","v":0},{"$f":"Prop2021DistTar!AJ10","v":0},{"$f":"Prop2021DistTar!AK10","v":0},{"$f":"Prop2021DistTar!AL10","v":0},{"$f":"Prop2021DistTar!AM10","v":0},{"$f":"Prop2021DistTar!AN10","v":0},{"$f":"Prop2021DistTar!AO10","v":0},{"$f":"Prop2021DistTar!AP10","v":0},{"$f":"Prop2021DistTar!AQ10","v":0},{"$f":"Prop2021DistTar!AR10","v":0},null,0,172050.82105916634,264595.44513510854,0,0,0,0,0,0,0,0,0,0,436646.26619427488]
[null,{"$f":"Prop2021DistTar!B11","v":"NSP12  Small Business Single Rate - new in 2001"},null,0,0.57509999999999994,0.57509999999999994,0.57509999999999994,0,0.48280000000000001,0,0,0,0,0,0,0,null,{"$f":"Prop2021DistTar!AF11","v":0},{"$f":"Prop2021DistTar!AG11","v":0},{"$f":"Prop2021DistTar!AH11","v":0},{"$f":"Prop2021DistTar!AI11","v":0},{"$f":"Prop2021DistTar!AJ11","v":0},{"$f":"Prop2021DistTar!AK11","v":0},{"$f":"Prop2021DistTar!AL11","v":0},{"$f":"Prop2021DistTar!AM11","v":0},{"$f":"Prop2021DistTar!AN11","v":0},{"$f":"Prop2021DistTar!AO11","v":0},{"$f":"Prop2021DistTar!AP11","v":0},{"$f":"Prop2021DistTar!AQ11","v":0},{"$f":"Prop2021DistTar!AR11","v":0},null,0,0,0,0,0,0,0,0,0,0,0,0,0,0]
[null,{"$f":"Prop2021DistTar!B12","v":"NEN12  Small Business Single Rate - Embedded Network"},null,0,0.57509999999999994,0.57509999999999994,0,0,0,0,0,0,0,0,0,0,null,{"$f":"Prop2021DistTar!AF12","v":0},{"$f":"Prop2021DistTar!AG12","v":0},{"$f":"Prop2021DistTar!AH12","v":0},{"$f":"Prop2021DistTar!AI12","v":0},{"$f":"Prop2021DistTar!AJ12","v":0},{"$f":"Prop2021DistTar!AK12","v":0},{"$f":"Prop2021DistTar!AL12","v":0},{"$f":"Prop2021DistTar!AM12","v":0},{"$f":"Prop2021DistTar!AN12","v":0},{"$f":"Prop2021DistTar!AO12","v":0},{"$f":"Prop2021DistTar!AP12","v":0},{"$f":"Prop2021DistTar!AQ12","v":0},{"$f":"Prop2021DistTar!AR12","v":0},null,0,0,0,0,0,0,0,0,0,0,0,0,0,0]
[null,{"$f":"Prop2021DistTar!B13","v":"NEE20  Small Two Rate"},null,0,0.57509999999999994,0,0,0,0.48280000000000001,0,0,0,0,0,0,0,null,{"$f":"Prop2021DistTar!AF13","v":25675.158160203395},{"$f":"Prop2021DistTar!AG13","v":68100453.350972682},{"$f":"Prop2021DistTar!AH13","v":0},{"$f":"Prop2021DistTar!AI13","v":0},{"$f":"Prop2021DistTar!AJ13","v":0},{"$f":"Prop2021DistTar!AK13","v":90999048.342038363},{"$f":"Prop2021DistTar!AL13","v":0},{"$f":"Prop2021DistTar!AM13","v":0},{"$f":"Prop2021DistTar!AN13","v":0},{"$f":"Prop2021DistTar!AO13","v":0},{"$f":"Prop2021DistTar!AP13","v":0},{"$f":"Prop2021DistTar!AQ13","v":0},{"$f":"Prop2021DistTar!AR13","v":0},null,0,391645.70722144382,0,0,0,439343.40539536119,0,0,0,0,0,0,0,830989.11261680501]
[null,{"$f":"Prop2021DistTar!B14","v":"NSP20  Small Two Rate"},null,0,0.57509999999999994,0.57509999999999994,0.57509999999999994,0,0.48280000000000001,0,0,0,0,0,0,0,null,{"$f":"Prop2021DistTar!AF14","v":7},{"$f":"Prop2021DistTar!AG14","v":1224.099089443961},{"$f":"Prop2021DistTar!AH14","v":935.22469487542367},{"$f":"Prop2021DistTar!AI14","v":295.53170387454105},{"$f":"Prop2021DistTar!AJ14","v":0},{"$f":"Prop2021DistTar!AK14","v":40249.817884885495},{"$f":"Prop2021DistTar!AL14","v":0},{"$f":"Prop2021DistTar!AM14","v":0},{"$f":"Prop2021DistTar!AN14","v":0},{"$f":"Prop2021DistTar!AO14","v":0},{"$f":"Prop2021DistTar!AP14","v":0},{"$f":"Prop2021DistTar!AQ14","v":0},{"$f":"Prop2021DistTar!AR14","v":0},null,0,7.0397938633922186,5.3784772202285609,1.6996028289824854,0,194.32612074822717,0,0,0,0,0,0,0,208.44399466083044]
[null,{"$f":"Prop2021DistTar!B15","v":"NGT26  Small Interval Multi Rate"},null,0,0.57509999999999994,0.57509999999999994,0.57509999999999994,0.57509999999999994,0.48280000000000001,0.48280000000000001,0,0,0,0,0,0,null,{"$f":"Prop2021DistTar!AF15","v":778.33859346884094},{"$f":"Prop2021DistTar!AG15","v":1323806.2915151073},{"$f":"Prop2021DistTar!AH15","v":0},{"$f":"Prop2021DistTar!AI15","v":1378430.2281436233},{"$f":"Prop2021DistTar!AJ15","v":0},{"$f":"Prop2021DistTar!AK15","v":1366870.1749827666},{"$f":"Prop2021DistTar!AL15","v":0},{"$f":"Prop2021DistTar!AM15","v":0},{"$f":"Prop2021DistTar!AN15","v":0},{"$f":"Prop2021DistTar!AO15","v":0},{"$f":"Prop2021DistTar!AP15","v":0},{"$f":"Prop2021DistTar!AQ15","v":0},{"$f":"Prop2021DistTar!AR15","v":0},null,0,7613.2099825033811,0,7927.3522420539766,0,6599.2492048167969,0,0,0,0,0,0,0,22139.811429374153]
[null,{"$f":"Prop2021DistTar!B16","v":"NEN20  Small Two Rate - Embedded Network"},null,0,0.57509999999999994,0,0,0,0.48280000000000001,0,0,0,0,0,0,0,null,{"$f":"Prop2021DistTar!AF16","v":0},{"$f":"Prop2021DistTar!AG16","v":0},{"$f":"Prop2021DistTar!AH16","v":0},{"$f":"Prop2021DistTar!AI16","v":0},{"$f":"Prop2021DistTar!AJ16","v":0},{"$f":"Prop2021DistTar!AK16","v":0},{"$f":"Prop2021DistTar!AL16","v":0},{"$f":"Prop2021DistTar!AM16","v":0},{"$f":"Prop2021DistTar!AN16","v":0},{"$f":"Prop2021DistTar!AO16","v":0},{"$f":"Prop2021DistTar!AP16","v":0},{"$f":"Prop2021DistTar!AQ16","v":0},{"$f":"Prop2021DistTar!AR16","v":0},null,0,0,0,0,0,0,0,0,0,0,0,0,0,0]
[null,{"$f":"Prop2021DistTar!B17","v":"NEE21  Small Business Two Rate"},null,0,0.57509999999999994,0,0,0,0.48280000000000001,0,0,0,0,0,0,0,null,{"$f":"Prop2021DistTar!AF17","v":14772.518182372723},{"$f":"Prop2021DistTar!AG17","v":95606928.017334342},{"$f":"Prop2021DistTar!AH17","v":0},{"$f":"Prop2021DistTar!AI17","v":0},{"$f":"Prop2021DistTar!AJ17","v":0},{"$f":"Prop2021DistTar!AK17","v":71167541.716303572},{"$f":"Prop2021DistTar!AL17","v":0},{"$f":"Prop2021DistTar!AM17","v":-6826817.5715023922},{"$f":"Prop2021DistTar!AN17","v":0},{"$f":"Prop2021DistTar!AO17","v":0},{"$f":"Prop2021DistTar!AP17","v":0},{"$f":"Prop2021DistTar!AQ17","v":0},{"$f":"Prop2021DistTar!AR17","v":0},null,0,549835.4430276897,0,0,0,343596.89140631363,0,0,0,0,0,0,0,893432.33443400334]
[null,{"$f":"Prop2021DistTar!B18","v":"NSP21  Small Business Two Rate"},null,0,0.57509999999999994,0.57509999999999994,0.57509999999999994,0,0.48280000000000001,0,0,0,0,0,0,0,null,{"$f":"Prop2021DistTar!AF18","v":12.387570584899215},{"$f":"Prop2021DistTar!AG18","v":3155.7072542765309},{"$f":"Prop2021DistTar!AH18","v":11732.089977530526},{"$f":"Prop2021DistTar!AI18","v":5294.7282030256811},{"$f":"Prop2021DistTar!AJ18","v":0},{"$f":"Prop2021DistTar!AK18","v":229094.7831057219},{"$f":"Prop2021DistTar!AL18","v":0},{"$f":"Prop2021DistTar!AM18","v":-1050},{"$f":"Prop2021DistTar!AN18","v":0},{"$f":"Prop2021DistTar!AO18","v":0},{"$f":"Prop2021DistTar!AP18","v":0},{"$f":"Prop2021DistTar!AQ18","v":0},{"$f":"Prop2021DistTar!AR18","v":0},null,0,18.148472419344326,67.47124946077804,30.449981895600686,0,1106.0696128344252,0,0,0,0,0,0,0,1222.1393166101484]
[null,{"$f":"Prop2021DistTar!B19","v":"NSP27  Small Business Two Rate"},null,0,0.57509999999999994,0.57509999999999994,0.57509999999999994,0,0.48280000000000001,0,0,0,0,0,0,0,null,{"$f":"Prop2021DistTar!AF19","v":111.83135587734887},{"$f":"Prop2021DistTar!AG19","v":26116.112755164144},{"$f":"Prop2021DistTar!AH19","v":26228.725674894009},{"$f":"Prop2021DistTar!AI19","v":65430.578916311686},{"$f":"Prop2021DistTar!AJ19","v":0},{"$f":"Prop2021DistTar!AK19","v":7355360.3860684065},{"$f":"Prop2021DistTar!AL19","v":0},{"$f":"Prop2021DistTar!AM19","v":-13316.4},{"$f":"Prop2021DistTar!AN19","v":0},{"$f":"Prop2021DistTar!AO19","v":0},{"$f":"Prop2021DistTar!AP19","v":0},{"$f":"Prop2021DistTar!AQ19","v":0},{"$f":"Prop2021DistTar!AR19","v":0},null,0,150.19376445494896,150.84140135631543,376.29125934770843,0,35511.679943938267,0,0,0,0,0,0,0,36189.006369097238]
[null,{"$f":"Prop2021DistTar!B20","v":"NEN21  Small Business Two Rate - Embedded Network"},null,0,0.57509999999999994,0,0,0,0.48280000000000001,0,0,0,0,0,0,0,null,{"$f":"Prop2021DistTar!AF20","v":0},{"$f":"Prop2021DistTar!AG20","v":0},{"$f":"Prop2021DistTar!AH20","v":0},{"$f":"Prop2021DistTar!AI20","v":0},{"$f":"Prop2021DistTar!AJ20","v":0},{"$f":"Prop2021DistTar!AK20","v":0},{"$f":"Prop2021DistTar!AL20","v":0},{"$f":"Prop2021DistTar!AM20","v":0},{"$f":"Prop2021DistTar!AN20","v":0},{"$f":"Prop2021DistTar!AO20","v":0},{"$f":"Prop2021DistTar!AP20","v":0},{"$f":"Prop2021DistTar!AQ20","v":0},{"$f":"Prop2021DistTar!AR20","v":0},null,0,0,0,0,0,0,0,0,0,0,0,0,0,0]
[null,{"$f":"Prop2021DistTar!B21","v":"NEE23  Photovoltaic"},null,0,0.57509999999999994,0,0,0,0.48280000000000001,0,0,0,0,0,0,0,null,{"$f":"Prop2021DistTar!AF21","v":78747.110531012135},{"$f":"Prop2021DistTar!AG21","v":148727012.02353171},{"$f":"Prop2021DistTar!AH21","v":0},{"$f":"Prop2021DistTar!AI21","v":0},{"$f":"Prop2021DistTar!AJ21","v":0},{"$f":"Prop2021DistTar!AK21","v":186285788.86616242},{"$f":"Prop2021DistTar!AL21","v":0},{"$f":"Prop2021DistTar!AM21","v":-137295086.92091542},{"$f":"Prop2021DistTar!AN21","v":0},{"$f":"Prop2021DistTar!AO21","v":0},{"$f":"Prop2021DistTar!AP21","v":0},{"$f":"Prop2021DistTar!AQ21","v":0},{"$f":"Prop2021DistTar!AR21","v":0},null,0,855329.04614733066,0,0,0,899387.7886458321,0,0,0,0,0,0,0,1754716.8347931628]
[null,{"$f":"Prop2021DistTar!B22","v":"NSP23  Photovoltaic"},null,0,0.57509999999999994,0.57509999999999994,0.57509999999999994,0,0.48280000000000001,0,0,0,0,0,0,0,null,{"$f":"Prop2021DistTar!AF22","v":153.58869603924799},{"$f":"Prop2021DistTar!AG22","v":1470.6086589900185},{"$f":"Prop2021DistTar!AH22","v":1503.7327154391771},{"$f":"Prop2021DistTar!AI22","v":36097.961621763301},{"$f":"Prop2021DistTar!AJ22","v":0},{"$f":"Prop2021DistTar!AK22","v":613592.27738774172},{"$f":"Prop2021DistTar!AL22","v":0},{"$f":"Prop2021DistTar!AM22","v":-354454.31721366808},{"$f":"Prop2021DistTar!AN22","v":0},{"$f":"Prop2021DistTar!AO22","v":0},{"$f":"Prop2021DistTar!AP22","v":0},{"$f":"Prop2021DistTar!AQ22","v":0},{"$f":"Prop2021DistTar!AR22","v":0},null,0,8.4574703978515959,8.6479668464907071,207.59937728676073,0,2962.4235152280171,0,0,0,0,0,0,0,3187.1283297591203]
[null,{"$f":"Prop2021DistTar!B23","v":"NEE24  Small rate 5 day 8 to 8"},null,0,0.57509999999999994,0,0,0,0.48280000000000001,0,0,0,0,0,0,0,null,{"$f":"Prop2021DistTar!AF23","v":1100.1692967344206},{"$f":"Prop2021DistTar!AG23","v":1290491.0935496474},{"$f":"Prop2021DistTar!AH23","v":0},{"$f":"Prop2021DistTar!AI23","v":0},{"$f":"Prop2021DistTar!AJ23","v":0},{"$f":"Prop2021DistTar!AK23","v":3209655.8945374847},{"$f":"Prop2021DistTar!AL23","v":0},{"$f":"Prop2021DistTar!AM23","v":0},{"$f":"Prop2021DistTar!AN23","v":0},{"$f":"Prop2021DistTar!AO23","v":0},{"$f":"Prop2021DistTar!AP23","v":0},{"$f":"Prop2021DistTar!AQ23","v":0},{"$f":"Prop2021DistTar!AR23","v":0},null,0,7421.6142790040212,0,0,0,15496.218658826976,0,0,0,0,0,0,0,22917.832937830997]
[null,{"$f":"Prop2021DistTar!B24","v":"NEE25  Small business rate 5 day 8 to 8"},null,0,0.57509999999999994,0,0,0,0.48280000000000001,0,0,0,0,0,0,0,null,{"$f":"Prop2021DistTar!AF24","v":3.5},{"$f":"Prop2021DistTar!AG24","v":93117.103044688978},{"$f":"Prop2021DistTar!AH24","v":0},{"$f":"Prop2021DistTar!AI24","v":0},{"$f":"Prop2021DistTar!AJ24","v":0},{"$f":"Prop2021DistTar!AK24","v":100928.99758533001},{"$f":"Prop2021DistTar!AL24","v":0},{"$f":"Prop2021DistTar!AM24","v":0},{"$f":"Prop2021DistTar!AN24","v":0},{"$f":"Prop2021DistTar!AO24","v":0},{"$f":"Prop2021DistTar!AP24","v":0},{"$f":"Prop2021DistTar!AQ24","v":0},{"$f":"Prop2021DistTar!AR24","v":0},null,0,535.51645961000622,0,0,0,487.28520034197328,0,0,0,0,0,0,0,1022.8016599519794]
[null,{"$f":"Prop2021DistTar!B25","v":"NEE30  Small Dedicated"},null,0,0,0,0,0,0.48280000000000001,0,0,0,0,0,0,0,null,{"$f":"Prop2021DistTar!AF25","v":42479.558530348069},{"$f":"Prop2021DistTar!AG25","v":0},{"$f":"Prop2021DistTar!AH25","v":0},{"$f":"Prop2021DistTar!AI25","v":0},{"$f":"Prop2021DistTar!AJ25","v":0},{"$f":"Prop2021DistTar!AK25","v":54981945.82309705},{"$f":"Prop2021DistTar!AL25","v":0},{"$f":"Prop2021DistTar!AM25","v":0},{"$f":"Prop2021DistTar!AN25","v":0},{"$f":"Prop2021DistTar!AO25","v":0},{"$f":"Prop2021DistTar!AP25","v":0},{"$f":"Prop2021DistTar!AQ25","v":0},{"$f":"Prop2021DistTar!AR25","v":0},null,0,0,0,0,0,265452.83443391253,0,0,0,0,0,0,0,265452.83443391253]
[null,{"$f":"Prop2021DistTar!B26","v":"NSP30  Small Dedicated"},null,0,0,0,0,0,0.48280000000000001,0,0,0,0,0,0,0,null,{"$f":"Prop2021DistTar!AF26","v":0},{"$f":"Prop2021DistTar!AG26","v":0},{"$f":"Prop2021DistTar!AH26","v":0},{"$f":"Prop2021DistTar!AI26","v":0},{"$f":"Prop2021DistTar!AJ26","v":0},{"$f":"Prop2021DistTar!AK26","v":0},{"$f":"Prop2021DistTar!AL26","v":0},{"$f":"Prop2021DistTar!AM26","v":0},{"$f":"Prop2021DistTar!AN26","v":0},{"$f":"Prop2021DistTar!AO26","v":0},{"$f":"Prop2021DistTar!AP26","v":0},{"$f":"Prop2021DistTar!AQ26","v":0},{"$f":"Prop2021DistTar!AR26","v":0},null,0,0,0,0,0,0,0,0,0,0,0,0,0,0]
[null,{"$f":"Prop2021DistTar!B27","v":"NEE31  Small Dedicated-afternoon boost"},null,0,0,0,0,0,0.48280000000000001,0,0,0,0,0,0,0,null,{"$f":"Prop2021DistTar!AF27","v":6284.0026251727604},{"$f":"Prop2021DistTar!AG27","v":0},{"$f":"Prop2021DistTar!AH27","v":0},{"$f":"Prop2021DistTar!AI27","v":0},{"$f":"Prop2021DistTar!AJ27","v":0},{"$f":"Prop2021DistTar!AK27","v":15874112.376413189},{"$f":"Prop2021DistTar!AL27","v":0},{"$f":"Prop2021DistTar!AM27","v":0},{"$f":"Prop2021DistTar!AN27","v":0},{"$f":"Prop2021DistTar!AO27","v":0},{"$f":"Prop2021DistTar!AP27","v":0},{"$f":"Prop2021DistTar!AQ27","v":0},{"$f":"Prop2021DistTar!AR27","v":0},null,0,0,0,0,0,76640.214553322876,0,0,0,0,0,0,0,76640.214553322876]
[null,{"$f":"Prop2021DistTar!B28","v":"NSP31  Small Dedicated-afternoon boost"},null,0,0,0,0,0,0.48280000000000001,0,0,0,0,0,0,0,null,{"$f":"Prop2021DistTar!AF28","v":0},{"$f":"Prop2021DistTar!AG28","v":0},{"$f":"Prop2021DistTar!AH28","v":0},{"$f":"Prop2021DistTar!AI28","v":0},{"$f":"Prop2021DistTar!AJ28","v":0},{"$f":"Prop2021DistTar!AK28","v":0},{"$f":"Prop2021DistTar!AL28","v":0},{"$f":"Prop2021DistTar!AM28","v":0},{"$f":"Prop2021DistTar!AN28","v":0},{"$f":"Prop2021DistTar!AO28","v":0},{"$f":"Prop2021DistTar!AP28","v":0},{"$f":"Prop2021DistTar!AQ28","v":0},{"$f":"Prop2021DistTar!AR28","v":0},null,0,0,0,0,0,0,0,0,0,0,0,0,0,0]
[null,{"$f":"Prop2021DistTar!B29","v":"NEE32  Dedicated Circuit 8 to 8"},null,0,0,0,0,0,0.48280000000000001,0,0,0,0,0,0,0,null,{"$f":"Prop2021DistTar!AF29","v":1823.9308862433866},{"$f":"Prop2021DistTar!AG29","v":0},{"$f":"Prop2021DistTar!AH29","v":0},{"$f":"Prop2021DistTar!AI29","v":0},{"$f":"Prop2021DistTar!AJ29","v":0},{"$f":"Prop2021DistTar!AK29","v":2310467.8003431028},{"$f":"Prop2021DistTar!AL29","v":0},{"$f":"Prop2021DistTar!AM29","v":0},{"$f":"Prop2021DistTar!AN29","v":0},{"$f":"Prop2021DistTar!AO29","v":0},{"$f":"Prop2021DistTar!AP29","v":0},{"$f":"Prop2021DistTar!AQ29","v":0},{"$f":"Prop2021DistTar!AR29","v":0},null,0,0,0,0,0,11154.938540056501,0,0,0,0,0,0,0,11154.938540056501]
[null,{"$f":"Prop2021DistTar!B30","v":"NSP32  Dedicated Circuit 8 to 8"},null,0,0,0,0,0,0.48280000000000001,0,0,0,0,0,0,0,null,{"$f":"Prop2021DistTar!AF30","v":0},{"$f":"Prop2021DistTar!AG30","v":0},{"$f":"Prop2021DistTar!AH30","v":0},{"$f":"Prop2021DistTar!AI30","v":0},{"$f":"Prop2021DistTar!AJ30","v":0},{"$f":"Prop2021DistTar!AK30","v":0},{"$f":"Prop2021DistTar!AL30","v":0},{"$f":"Prop2021DistTar!AM30","v":0},{"$f":"Prop2021DistTar!AN30","v":0},{"$f":"Prop2021DistTar!AO30","v":0},{"$f":"Prop2021DistTar!AP30","v":0},{"$f":"Prop2021DistTar!AQ30","v":0},{"$f":"Prop2021DistTar!AR30","v":0},null,0,0,0,0,0,0,0,0,0,0,0,0,0,0]
[null,{"$f":"Prop2021DistTar!B31","v":"NEE40  Medium Single Rate - closed to new customers"},null,0,0.57509999999999994,0,0,0,0,0,0,0,0,0,0,0,null,{"$f":"Prop2021DistTar!AF31","v":118.2170397004956},{"$f":"Prop2021DistTar!AG31","v":2580392.5635897103},{"$f":"Prop2021DistTar!AH31","v":0},{"$f":"Prop2021DistTar!AI31","v":0},{"$f":"Prop2021DistTar!AJ31","v":0},{"$f":"Prop2021DistTar!AK31","v":0},{"$f":"Prop2021DistTar!AL31","v":0},{"$f":"Prop2021DistTar!AM31","v":0},{"$f":"Prop2021DistTar!AN31","v":0},{"$f":"Prop2021DistTar!AO31","v":0},{"$f":"Prop2021DistTar!AP31","v":0},{"$f":"Prop2021DistTar!AQ31","v":0},{"$f":"Prop2021DistTar!AR31","v":0},null,0,14839.837633204421,0,0,0,0,0,0,0,0,0,0,0,14839.837633204421]
[null,{"$f":"Prop2021DistTar!B32","v":"NEE51  Medium Two Rate 5Day - closed to new customers - <160MWh to NEE21"},null,0,0.57509999999999994,0,0,0,0.48280000000000001,0,0,0,0,0,0,0,null,{"$f":"Prop2021DistTar!AF32","v":189.93512024048087},{"$f":"Prop2021DistTar!AG32","v":21635948.947650295},{"$f":"Prop2021DistTar!AH32","v":0},{"$f":"Prop2021DistTar!AI32","v":0},{"$f":"Prop2021DistTar!AJ32","v":0},{"$f":"Prop2021DistTar!AK32","v":18217897.32381659},{"$f":"Prop2021DistTar!AL32","v":0},{"$f":"Prop2021DistTar!AM32","v":0},{"$f":"Prop2021DistTar!AN32","v":0},{"$f":"Prop2021DistTar!AO32","v":0},{"$f":"Prop2021DistTar!AP32","v":0},{"$f":"Prop2021DistTar!AQ32","v":0},{"$f":"Prop2021DistTar!AR32","v":0},null,0,124428.34239793682,0,0,0,87956.0082793865,0,0,0,0,0,0,0,212384.35067732332]
[null,{"$f":"Prop2021DistTar!B33","v":"NEE55  Snowfields Tariff"},null,232,0,0,0,0,0,0,0,0,0,0,0,0,null,{"$f":"Prop2021DistTar!AF33","v":0.5},{"$f":"Prop2021DistTar!AG33","v":36029.745230023167},{"$f":"Prop2021DistTar!AH33","v":0},{"$f":"Prop2021DistTar!AI33","v":0},{"$f":"Prop2021DistTar!AJ33","v":0},{"$f":"Prop2021DistTar!AK33","v":37046.365479643602},{"$f":"Prop2021DistTar!AL33","v":0},{"$f":"Prop2021DistTar!AM33","v":0},{"$f":"Prop2021DistTar!AN33","v":0},{"$f":"Prop2021DistTar!AO33","v":0},{"$f":"Prop2021DistTar!AP33","v":0},{"$f":"Prop2021DistTar!AQ33","v":0},{"$f":"Prop2021DistTar!AR33","v":0},null,{"$f":"D33*R33","v":116},{"$f":"E33/100*S33","v":0},0,0,0,0,0,0,0,{"$f":"M33*AA33","v":0},{"$f":"N33*AB33","v":0},{"$f":"O33*AC33","v":0},{"$f":"P33*AD33","v":0},{"$f":"SUM(AF33:AR33)","v":116}]
[null,{"$f":"Prop2021DistTar!B34","v":"NSP55  Snowfields Tariff"},null,232,0,0,0,0,0,0,0,0,0,0,0,0,null,{"$f":"Prop2021DistTar!AF34","v":3.5},{"$f":"Prop2021DistTar!AG34","v":9550.2269132999972},{"$f":"Prop2021DistTar!AH34","v":54117.952508699993},{"$f":"Prop2021DistTar!AI34","v":25329.330215198261},{"$f":"Prop2021DistTar!AJ34","v":0},{"$f":"Prop2021DistTar!AK34","v":535690.87712180172},{"$f":"Prop2021DistTar!AL34","v":0},{"$f":"Prop2021DistTar!AM34","v":0},{"$f":"Prop2021DistTar!AN34","v":0},{"$f":"Prop2021DistTar!AO34","v":0},{"$f":"Prop2021DistTar!AP34","v":0},{"$f":"Prop2021DistTar!AQ34","v":0},{"$f":"Prop2021DistTar!AR34","v":0},null,812,0,0,0,0,0,0,0,0,0,0,0,0,812]
[null,{"$f":"Prop2021DistTar!B35","v":"NSP56  Medium Demand Multi-rate"},null,270,0,0,0,0,0,0,0,0,0,0,0,0,null,{"$f":"Prop2021DistTar!AF35","v":635.90625},{"$f":"Prop2021DistTar!AG35","v":42307312.421974368},{"$f":"Prop2021DistTar!AH35","v":32269925.84647819},{"$f":"Prop2021DistTar!AI35","v":0},{"$f":"Prop2021DistTar!AJ35","v":0},{"$f":"Prop2021DistTar!AK35","v":53760873.801854886},{"$f":"Prop2021DistTar!AL35","v":0},{"$f":"Prop2021DistTar!AM35","v":0},{"$f":"Prop2021DistTar!AN35","v":0},{"$f":"Prop2021DistTar!AO35","v":106189.73274366086},{"$f":"Prop2021DistTar!AP35","v":37696.837154329616},{"$f":"Prop2021DistTar!AQ35","v":0},{"$f":"Prop2021DistTar!AR35","v":0},null,{"$f":"D35*R35","v":171694.6875},{"$f":"E35/100*S35","v":0},{"$f":"F35/100*T35","v":0},{"$f":"G35/100*U35","v":0},{"$f":"H35/100*V35","v":0},{"$f":"I35/100*W35","v":0},{"$f":"J35/100*X35","v":0},{"$f":"K35/100*Y35","v":0},{"$f":"L35/100*Z35","v":0},{"$f":"M35*AA35","v":0},{"$f":"N35*AB35","v":0},{"$f":"O35*AC35","v":0},{"$f":"P35*AD35","v":0},{"$f":"SUM(AF35:AR35)","v":171694.6875}]
[null,{"$f":"Prop2021DistTar!B36","v":"NEN56  Medium Demand Multi-rate  - Embedded Network"},null,270,0,0,0,0,0,0,0,0,0,0,0,0,null,{"$f":"Prop2021DistTar!AF36","v":1},{"$f":"Prop2021DistTar!AG36","v":48857.900635350845},{"$f":"Prop2021DistTar!AH36","v":52671.607825623178},{"$f":"Prop2021DistTar!AI36","v":0},{"$f":"Prop2021DistTar!AJ36","v":0},{"$f":"Prop2021DistTar!AK36","v":48862.91000570199},{"$f":"Prop2021DistTar!AL36","v":0},{"$f":"Prop2021DistTar!AM36","v":0},{"$f":"Prop2021DistTar!AN36","v":0},{"$f":"Prop2021DistTar!AO36","v":260},{"$f":"Prop2021DistTar!AP36","v":73.394999999999996},{"$f":"Prop2021DistTar!AQ36","v":0},{"$f":"Prop2021DistTar!AR36","v":0},null,270,0,0,0,0,0,0,0,0,0,0,0,0,270]
[null,{"$f":"Prop2021DistTar!B37","v":"NEE60  Medium Two Rate 7Day - closed to new customers"},null,232,0,0,0,0,0,0,0,0,0,0,0,0,null,{"$f":"Prop2021DistTar!AF37","v":151.6656605113636},{"$f":"Prop2021DistTar!AG37","v":11912095.648898043},{"$f":"Prop2021DistTar!AH37","v":0},{"$f":"Prop2021DistTar!AI37","v":0},{"$f":"Prop2021DistTar!AJ37","v":0},{"$f":"Prop2021DistTar!AK37","v":3866727.1285819211},{"$f":"Prop2021DistTar!AL37","v":0},{"$f":"Prop2021DistTar!AM37","v":0},{"$f":"Prop2021DistTar!AN37","v":0},{"$f":"Prop2021DistTar!AO37","v":0},{"$f":"Prop2021DistTar!AP37","v":0},{"$f":"Prop2021DistTar!AQ37","v":0},{"$f":"Prop2021DistTar!AR37","v":0},null,35186.433238636353,0,0,0,0,0,0,0,0,0,0,0,0,35186.433238636353]
[null,{"$f":"Prop2021DistTar!B38","v":"NEE52  Unmetered"},null,0,0.57509999999999994,0,0,0,0.48280000000000001,0,0,0,0,0,0,0,null,{"$f":"Prop2021DistTar!AF38","v":44.5},{"$f":"Prop2021DistTar!AG38","v":7313424.2443653559},{"$f":"Prop2021DistTar!AH38","v":0},{"$f":"Prop2021DistTar!AI38","v":0},{"$f":"Prop2021DistTar!AJ38","v":0},{"$f":"Prop2021DistTar!AK38","v":18444180.326888889},{"$f":"Prop2021DistTar!AL38","v":0},{"$f":"Prop2021DistTar!AM38","v":0},{"$f":"Prop2021DistTar!AN38","v":0},{"$f":"Prop2021DistTar!AO38","v":0},{"$f":"Prop2021DistTar!AP38","v":0},{"$f":"Prop2021DistTar!AQ38","v":0},{"$f":"Prop2021DistTar!AR38","v":0},null,0,42059.502829345154,0,0,0,89048.502618219558,0,0,{"$f":"L38/100*Z38","v":0},0,0,0,0,131108.0054475647]
[null,{"$f":"Prop2021DistTar!B39","v":"NEE74  LV Large Two Rate 5Day"},null,270,0,0,0,0,0,0,0,0,0,0,0,0,null,{"$f":"Prop2021DistTar!AF39","v":3.5},{"$f":"Prop2021DistTar!AG39","v":941231.65833174856},{"$f":"Prop2021DistTar!AH39","v":0},{"$f":"Prop2021DistTar!AI39","v":0},{"$f":"Prop2021DistTar!AJ39","v":0},{"$f":"Prop2021DistTar!AK39","v":1062334.4272307118},{"$f":"Prop2021DistTar!AL39","v":0},{"$f":"Prop2021DistTar!AM39","v":0},{"$f":"Prop2021DistTar!AN39","v":0},{"$f":"Prop2021DistTar!AO39","v":0},{"$f":"Prop2021DistTar!AP39","v":0},{"$f":"Prop2021DistTar!AQ39","v":0},{"$f":"Prop2021DistTar!AR39","v":0},null,945,0,0,0,0,0,0,0,0,0,0,0,0,945]
[null,{"$f":"Prop2021DistTar!B40","v":"NSP75  Large Multi-rate <750 kVA"},null,270,0,0,0,0,0,0,0,0,0,0,0,0,null,{"$f":"Prop2021DistTar!AF40","v":399.73750000000018},{"$f":"Prop2021DistTar!AG40","v":65066965.823548958},{"$f":"Prop2021DistTar!AH40","v":46895776.109417975},{"$f":"Prop2021DistTar!AI40","v":0},{"$f":"Prop2021DistTar!AJ40","v":0},{"$f":"Prop2021DistTar!AK40","v":87211176.761339754},{"$f":"Prop2021DistTar!AL40","v":0},{"$f":"Prop2021DistTar!AM40","v":0},{"$f":"Prop2021DistTar!AN40","v":0},{"$f":"Prop2021DistTar!AO40","v":106150.66325231486},{"$f":"Prop2021DistTar!AP40","v":47175.123367353335},{"$f":"Prop2021DistTar!AQ40","v":0},{"$f":"Prop2021DistTar!AR40","v":0},null,107929.12500000004,0,0,0,0,0,0,0,0,0,0,0,0,107929.12500000004]
[null,{"$f":"Prop2021DistTar!B41","v":"NSP76  Large Multi-rate >750 kVA"},null,270,0,0,0,0,0,0,0,0,0,0,0,0,null,{"$f":"Prop2021DistTar!AF41","v":276.04374999999987},{"$f":"Prop2021DistTar!AG41","v":96539748.775621518},{"$f":"Prop2021DistTar!AH41","v":70796917.756179661},{"$f":"Prop2021DistTar!AI41","v":0},{"$f":"Prop2021DistTar!AJ41","v":0},{"$f":"Prop2021DistTar!AK41","v":125406478.88905282},{"$f":"Prop2021DistTar!AL41","v":0},{"$f":"Prop2021DistTar!AM41","v":0},{"$f":"Prop2021DistTar!AN41","v":0},{"$f":"Prop2021DistTar!AO41","v":145281.41982565779},{"$f":"Prop2021DistTar!AP41","v":64874.075578297932},{"$f":"Prop2021DistTar!AQ41","v":0},{"$f":"Prop2021DistTar!AR41","v":0},null,74531.812499999971,0,0,0,0,0,0,0,0,0,0,0,0,74531.812499999971]
[null,{"$f":"Prop2021DistTar!B42","v":"NSP77  Large Multi-rate >2 GWh"},null,270,0,0,0,0,0,0,0,0,0,0,0,0,null,{"$f":"Prop2021DistTar!AF42","v":42.237499999999997},{"$f":"Prop2021DistTar!AG42","v":32246242.093563192},{"$f":"Prop2021DistTar!AH42","v":22577275.465703305},{"$f":"Prop2021DistTar!AI42","v":0},{"$f":"Prop2021DistTar!AJ42","v":0},{"$f":"Prop2021DistTar!AK42","v":41375655.650008813},{"$f":"Prop2021DistTar!AL42","v":0},{"$f":"Prop2021DistTar!AM42","v":0},{"$f":"Prop2021DistTar!AN42","v":0},{"$f":"Prop2021DistTar!AO42","v":39295.959821428572},{"$f":"Prop2021DistTar!AP42","v":19178.786775914636},{"$f":"Prop2021DistTar!AQ42","v":0},{"$f":"Prop2021DistTar!AR42","v":0},null,11404.125,0,0,0,0,0,0,0,0,0,0,0,0,11404.125]
[null,{"$f":"Prop2021DistTar!B43","v":"NSP78  Large Multi-rate >4 GWh"},null,270,0,0,0,0,0,0,0,0,0,0,0,0,null,{"$f":"Prop2021DistTar!AF43","v":17.737499999999997},{"$f":"Prop2021DistTar!AG43","v":25893028.545737665},{"$f":"Prop2021DistTar!AH43","v":17970261.114019543},{"$f":"Prop2021DistTar!AI43","v":0},{"$f":"Prop2021DistTar!AJ43","v":0},{"$f":"Prop2021DistTar!AK43","v":33397961.120601483},{"$f":"Prop2021DistTar!AL43","v":0},{"$f":"Prop2021DistTar!AM43","v":0},{"$f":"Prop2021DistTar!AN43","v":0},{"$f":"Prop2021DistTar!AO43","v":25171.599264705874},{"$f":"Prop2021DistTar!AP43","v":16125.000503906245},{"$f":"Prop2021DistTar!AQ43","v":0},{"$f":"Prop2021DistTar!AR43","v":0},null,4789.1249999999991,0,0,0,0,0,0,0,0,0,0,0,0,4789.1249999999991]
[null,{"$f":"Prop2021DistTar!B44","v":"NSP81  HV Kva"},null,270,0,0,0,0,0,0,0,0,0,0,0,0,null,{"$f":"Prop2021DistTar!AF44","v":30.237499999999997},{"$f":"Prop2021DistTar!AG44","v":124298431.5797957},{"$f":"Prop2021DistTar!AH44","v":0},{"$f":"Prop2021DistTar!AI44","v":0},{"$f":"Prop2021DistTar!AJ44","v":0},{"$f":"Prop2021DistTar!AK44","v":105890467.84826557},{"$f":"Prop2021DistTar!AL44","v":0},{"$f":"Prop2021DistTar!AM44","v":0},{"$f":"Prop2021DistTar!AN44","v":0},{"$f":"Prop2021DistTar!AO44","v":97969.5},{"$f":"Prop2021DistTar!AP44","v":42579.599664215682},{"$f":"Prop2021DistTar!AQ44","v":0},{"$f":"Prop2021DistTar!AR44","v":0},null,8164.1249999999991,0,0,0,0,0,0,0,0,0,0,0,0,8164.1249999999991]
[null,{"$f":"Prop2021DistTar!B45","v":"NSP82  Traction"},null,270,0,0,0,0,0,0,0,0,0,0,0,0]
[null,{"$f":"Prop2021DistTar!B46","v":"NSP83  Small HV"},null,270,0,0,0,0,0,0,0,0,0,0,0,0,null,{"$f":"Prop2021DistTar!AF46","v":10.237499999999997},{"$f":"Prop2021DistTar!AG46","v":2797789.0999321593},{"$f":"Prop2021DistTar!AH46","v":1951495.4974704923},{"$f":"Prop2021DistTar!AI46","v":0},{"$f":"Prop2021DistTar!AJ46","v":0},{"$f":"Prop2021DistTar!AK46","v":2416770.4731495506},{"$f":"Prop2021DistTar!AL46","v":0},{"$f":"Prop2021DistTar!AM46","v":0},{"$f":"Prop2021DistTar!AN46","v":0},{"$f":"Prop2021DistTar!AO46","v":12870.812499999998},{"$f":"Prop2021DistTar!AP46","v":3028.0285546874989},{"$f":"Prop2021DistTar!AQ46","v":0},{"$f":"Prop2021DistTar!AR46","v":0},null,2764.1249999999991,0,0,0,0,0,0,0,0,0,0,0,0,2764.1249999999991]
[null,{"$f":"Prop2021DistTar!B47","v":"NSP91  ST kVA"},null,270,0,0,0,0,0,0,0,0,0,0,0,0]
[null,{"$f":"Prop2021DistTar!B48","v":"NEE93  Latrobe Generators kVA (non published)"},null,0,0,0,0,0,0,0,0,0,0,0,0,0]
[null,{"$f":"Prop2021DistTar!B49","v":"NSP94  - ST kVA >25MVA <20kM"},null,270,0,0,0,0,0,0,0,0,0,0,0,0]
[null,{"$f":"Prop2021DistTar!B50","v":"NSP95  - ST kVA <25MVA >20kM"},null,270,0,0,0,0,0,0,0,0,0,0,0,0]
[null,{"$f":"Prop2021DistTar!B51","v":"NASN19 - Business >40MWh Single Rate"},null,0,0.57509999999999994,0.57509999999999994,0,0,0,0,0,0,0,0,0,0,null,{"$f":"Prop2021DistTar!AF51","v":538.88757058489909},{"$f":"Prop2021DistTar!AG51","v":25110693.908453003},{"$f":"Prop2021DistTar!AH51","v":0},{"$f":"Prop2021DistTar!AI51","v":0},{"$f":"Prop2021DistTar!AJ51","v":0},{"$f":"Prop2021DistTar!AK51","v":0},{"$f":"Prop2021DistTar!AL51","v":0},{"$f":"Prop2021DistTar!AM51","v":0},{"$f":"Prop2021DistTar!AN51","v":0},{"$f":"Prop2021DistTar!AO51","v":46042.525159725694},{"$f":"Prop2021DistTar!AP51","v":57855.168031556212},{"$f":"Prop2021DistTar!AQ51","v":0},{"$f":"Prop2021DistTar!AR51","v":0},null,0,144411.60066751321,0,0,0,0,0,0,0,0,0,0,0,144411.60066751321]
[null,{"$f":"Prop2021DistTar!B52","v":"NASN21 - Business >40MWh Two Rate"},null,0,0.57509999999999994,0,0,0,0.48280000000000001,0,0,0,0,0,0,0,null,{"$f":"Prop2021DistTar!AF52","v":4310.6126922669546},{"$f":"Prop2021DistTar!AG52","v":142345744.55856839},{"$f":"Prop2021DistTar!AH52","v":0},{"$f":"Prop2021DistTar!AI52","v":0},{"$f":"Prop2021DistTar!AJ52","v":0},{"$f":"Prop2021DistTar!AK52","v":121263382.52617116},{"$f":"Prop2021DistTar!AL52","v":0},{"$f":"Prop2021DistTar!AM52","v":-3978461.3033247795},{"$f":"Prop2021DistTar!AN52","v":0},{"$f":"Prop2021DistTar!AO52","v":494986.76394302316},{"$f":"Prop2021DistTar!AP52","v":641947.97495058272},{"$f":"Prop2021DistTar!AQ52","v":0},{"$f":"Prop2021DistTar!AR52","v":0},null,0,818630.37695632665,0,0,0,585459.61083635432,0,0,0,0,0,0,0,1404089.987792681]
[null,{"$f":"Prop2021DistTar!B53","v":"NASN11 - Residential Single Rate"},null,0,0.57509999999999994,0.57509999999999994,0,0,0,0,0,0,0,0,0,0,null,{"$f":"Prop2021DistTar!AF53","v":19.966929673442056},{"$f":"Prop2021DistTar!AG53","v":80493.510867320554},{"$f":"Prop2021DistTar!AH53","v":0},{"$f":"Prop2021DistTar!AI53","v":0},{"$f":"Prop2021DistTar!AJ53","v":0},{"$f":"Prop2021DistTar!AK53","v":0},{"$f":"Prop2021DistTar!AL53","v":0},{"$f":"Prop2021DistTar!AM53","v":-17314.276666666665},{"$f":"Prop2021DistTar!AN53","v":0},{"$f":"Prop2021DistTar!AO53","v":253.94151057393117},{"$f":"Prop2021DistTar!AP53","v":378.09607402309706},{"$f":"Prop2021DistTar!AQ53","v":0},{"$f":"Prop2021DistTar!AR53","v":0},null,0,462.91818099796046,0,0,0,0,0,0,0,0,0,0,0,462.91818099796046]
[null,{"$f":"Prop2021DistTar!B54","v":"NASN12 - Business Single Rate"},null,0,0.57509999999999994,0.57509999999999994,0,0,0,0,0,0,0,0,0,0,null,{"$f":"Prop2021DistTar!AF54","v":3.4437852924496077},{"$f":"Prop2021DistTar!AG54","v":64170.787285383543},{"$f":"Prop2021DistTar!AH54","v":0},{"$f":"Prop2021DistTar!AI54","v":0},{"$f":"Prop2021DistTar!AJ54","v":0},{"$f":"Prop2021DistTar!AK54","v":0},{"$f":"Prop2021DistTar!AL54","v":0},{"$f":"Prop2021DistTar!AM54","v":0},{"$f":"Prop2021DistTar!AN54","v":0},{"$f":"Prop2021DistTar!AO54","v":301.88300295419225},{"$f":"Prop2021DistTar!AP54","v":587.75571651416521},{"$f":"Prop2021DistTar!AQ54","v":0},{"$f":"Prop2021DistTar!AR54","v":0},null,0,369.04619767824073,0,0,0,0,0,0,0,0,0,0,0,369.04619767824073]
[null,null,null,null,null,null,null,null,null,null,null,null,null,null,null,null,null,null,null,null,null,null,null,null,null,null,null,null,null,null,null,0,0,0,0,0,0,0,0,0,0,0,0,0,0]
[null,null,null,null,null,null,null,null,null,null,null,null,null,null,null,null,null,null,null,null,null,null,null,null,null,null,null,null,null,null,null,0,0,0,0,0,0,0,0,0,0,0,0,0,0]
[null,null,null,null,null,null,null,null,null,null,null,null,null,null,null,null,null,null,null,null,null,null,null,null,null,null,null,null,null,null,null,0,0,0,0,0,0,0,0,0,0,0,0,0,0]
[null,null,null,null,null,null,null,null,null,null,null,null,null,null,null,null,null,null,null,null,null,null,null,null,null,null,null,null,null,null,null,0,0,0,0,0,0,0,0,0,0,0,0,0,0]
[null,null,null,null,null,null,null,null,null,null,null,null,null,null,null,null,null,null,null,null,null,null,null,null,null,null,null,null,null,null,null,0,0,0,0,0,0,0,0,0,0,0,0,0,0]
[null,null,null,null,null,null,null,null,null,null,null,null,null,null,null,null,null,null,null,null,null,null,null,null,null,null,null,null,null,null,null,0,0,0,0,0,0,0,0,0,0,0,0,0,0]
[null,null,null,null,null,null,null,null,null,null,null,null,null,null,null,null,null,null,null,null,null,null,null,null,null,null,null,null,null,null,null,0,0,0,0,0,0,0,0,0,0,0,0,0,0]
[null,null,null,null,null,null,null,null,null,null,null,null,null,null,null,null,null,null,null,null,null,null,null,null,null,null,null,null,null,null,null,0,0,0,0,0,0,0,0,0,0,0,0,0,0]
[null,null,null,null,null,null,null,null,null,null,null,null,null,null,null,null,null,null,null,null,null,null,null,null,null,null,null,null,null,null,null,0,0,0,0,0,0,0,0,0,0,0,0,0,0]
[null,null,null,null,null,null,null,null,null,null,null,null,null,null,null,null,null,null,null,null,null,null,null,null,null,null,null,null,null,null,null,0,0,0,0,0,0,0,0,0,0,0,0,0,0]
[null,null,null,null,null,null,null,null,null,null,null,null,null,null,null,null,null,null,null,null,null,null,null,null,null,null,null,null,null,null,null,0,0,0,0,0,0,0,0,0,0,0,0,0,0]
[null,null,null,null,null,null,null,null,null,null,null,null,null,null,null,null,null,432634.65870843077,1786652651.8820281,531414916.41767955,1510878.3588037968,0,1214863393.8000841,0,-148486500.78962293,0,1175008.638524045,968350.26590888109,0,0,null,423665.68323863635,7075738.1939879004,1896209.5457069171,8543.392463413029,0,2860397.4469654942,0,0,0,0,0,0,0,12264554.262362365]

{"sheet":"2021JSRevCont","index":16,"n_rows":17,"n_cols":3,"rows_kept":17,"cut":false,"hidden":false,"merged":[]}
[]
[null,{"$f":"\"Tariff Approval - \"&'Model update'!$C$3","v":"Tariff Approval - AusNet Services"},{"$f":"'Model update'!$C$5&\"JSRevCont\"","v":"2021JSRevCont"}]
[]
[null," Jurisdictional Scheme Amounts (JSA)"]
[]
[null,"Year (t)",{"$f":"'Model update'!C5","v":2021}]
[]
[null,"Table 1- Compliance with JSA Revenue Formula"]
[null,"Revenue from  Jurisdictional Scheme Amounts charges for year t",{"$f":"Prop2021JSTar!AS66","v":12264554.262362365}]
[null,"Total JSA related payments for year t",{"$f":"C17","v":12265341.5}]
[null,null,{"$f":"IF(C9=\"\",\"\",IF(C10>=C9,\"JSA REVENUE FORMULA COMPLIANT\",\"JSA REVENUE FORMULA BREACHED\"))","v":"JSA REVENUE FORMULA COMPLIANT"}]
[]
[]
[null,"Table 3 - PFIT & TFIT charges for year t"]
[null,"PFIT",12265341.5]
[null,"TFIT",0]
[null,"PFIT & TFIT charges",{"$f":"SUM(C15:C16)","v":12265341.5}]