{"text_format":"1","workbook":"xlsx","n_sheets":17,"sheets":["NOTES","Formulae","6 month formulae","Model update","Metering","Unmetered supply","Metering exit fees","Public lighting","ANS","Prop2021DistTar","2021DistRevCapForm","2021DistTarRebalCont","Est2020DistRev","Prop2021TransTar","2021TransRevCont","Prop2021JSTar","2021JSRevCont"],"not_rendered":{"charts":0,"images":53,"macros":1,"external_links":0,"defined_names":78,"comments":7,"pivot_tables":0},"unopened":[],"bounds":{"document_bytes":16777216,"sheet_cells":100000,"rows_first":2000,"rows_last":500,"rows_between":2000,"halvings":0,"cell_chars":16384,"cell_head_chars":4096},"cells_cut":0,"cells_raw":0,"read":"whole","date_system":"1900"}

{"sheet":"NOTES","index":0,"n_rows":88,"n_cols":4,"rows_kept":88,"cut":false,"hidden":false,"merged":[]}
[]
["The following changes have been made for the tariff approval model to apply to the 2021 6-month extension period"]
[]
["Issue","Location","Item","Comment"]
[]
[1,"'6 month formulae'","Price control formulae","Added formulae to apply to the 6-month extension"]
[]
[{"$f":"A6+1","v":2},"'Prop2020TSSComp'","Comparison to previous year indicative prices","Removed worksheet as no indicative prices for 2021 to compare to"]
[]
[{"$f":"A8+1","v":3},"'Indicative prices for 2021'","Indicative prices for next year","Removed worksheet as no indicative prices required for 2021/22 year"]
[]
[{"$f":"A10+1","v":4},"'JS cost audit template'","t-2 jurisdictional scheme costs","Removed worksheet as no true-up to occur in 6-month extension"]
[null,"'TUOS cost audit template'","t-2 designated pricing proposal charges","Removed worksheet as no true-up to occur in 6-month extension"]
[]
[{"$f":"A12+1","v":5},"'Est2019TransRev'","Calculating t-1 estimates for unders/overs account","Removed worksheet as t-1 estimates not needed in 6-month extension"]
[null,"'Est2019JSRev'","Calculating t-1 estimates for unders/overs account","Removed worksheet as t-1 estimates not needed in 6-month extension"]
[]
[{"$f":"A15+1","v":6},"'Unmetered supply'","Type 7 metering fees","Renamed for relevant year"]
[null,"'Prop2021DistTar'","Proposed 2021 distribution tariffs","Renamed for relevant year"]
[null,"'2021DistRevCapForm'","2021 distribution revenue cap","Renamed for relevant year"]
[null,"'2021DistTarRebalCont'","2021 distribution side constraints","Renamed for relevant year"]
[null,"'Est2020DistRev'","Estimated 2020 distribution revenue","Renamed for relevant year"]
[null,"'Prop2021TransTar'","Proposed 2021 transmission tariffs","Renamed for relevant year"]
[null,"'2021TransRevCont'","2021 transmission revenue cap","Renamed for relevant year"]
[null,"'Prop2021JSTar'","Proposed 2021 jurisdictional scheme tariffs","Renamed for relevant year"]
[null,"'2021JSRevCont'","2021 jurisdictional scheme revenue cap","Renamed for relevant year"]
[]
[{"$f":"A18+1","v":7},"'Model update'!A34:N299","Inputs for control formulae","Removed all 2016–20 inputs for control formulae as not used in 6-month extension"]
[]
[{"$f":"A28+1","v":8},"'Model update'!C5","Regulatory year","Changed to 2021"]
[]
[{"$f":"A30+1","v":9},"'Model update'!A26:F26","CPI data","Expanded CPI data to include 2021"]
[]
[{"$f":"A32+1","v":10},"'Model update'!C3","Business name","Updated for relevant business name"]
[]
[{"$f":"A34+1","v":11},"'Model update'!A34:D36","X-factor for ANS","Added 2021 X-factor for use in escalating ANS price caps"]
[]
[{"$f":"A36+1","v":12},"Metering!H26:I28","Side constraint factors","Removed side constraint factors not applied for 6-month extension. "]
[null,"Metering!I25","CPI","Updated CPI reference to 'Model update' sheet"]
[]
[{"$f":"A38+1","v":13},"Metering!B29:D39","Table 2 - Total annual revenue calculations","Removed calculations for factors not applied in 6-month extension"]
[null,null,"Table 3 - Adjusted annual revenue calculations","Removed calculations for escalations not applied in 6-month extension"]
[]
[{"$f":"A41+1","v":14},"Metering!B44:F89","Table 4 - Metering service recovery arrangements","Removed table as unders/overs not applied in 6-month extension"]
[null,null,"Table 5 - Metering services unders/overs account","Removed table as unders/overs not applied in 6-month extension"]
[null,null,"Calculation of estimated metering revenue for t-1","Removed table as unders/overs not applied in 6-month extension"]
[]
[{"$f":"A44+1","v":15},"Metering!E22:E33","t-1 data for calculating revenue cap","Removed t-1 data as not used for calculating revenue cap for 6-month extension"]
[]
[{"$f":"A48+1","v":16},"Metering!D26","Revenue cap","Formula replaced with revenue directly from 6-month extension PTRM"]
[]
[{"$f":"A50+1","v":17},"'Unmetered supply'!B19:H27","Revenue constraint on unmetered supply","Removed demonstration of revenue constraint as not relevant for 6-month extension"]
[]
[{"$f":"A52+1","v":18},"'Unmetered supply'!C7:E7","t-1 type 7 prices","Updated for 2020 prices"]
[null,"'Unmetered supply'!K7:M7","t-2 type 7 quantities","Updated for 2019 quantities"]
[]
[{"$f":"A54+1","v":19},"'2021DistRevCapForm'!B13:C38","Table 2 - Total annual revenue calculations","Removed calculations for factors not applied in 6-month extension"]
[null,null,"Table 3 - Adjusted annual revenue calculations","Removed calculations for escalations not applied in 6-month extension"]
[null,null,"Table 4 - B factor calculations","Removed calculations for factors not applied in 6-month extension"]
[null,null,"Table 5 - License fee calculations","Removed calculations for factors not applied in 6-month extension"]
[]
[{"$f":"A57+1","v":20},"'2021DistRevCapForm'!B42:E77","Table 6 - DUoS recovery arrangements","Removed table as unders/overs not applied in 6-month extension"]
[null,null,"Table 7 - DUoS unders and overs account","Removed table as unders/overs not applied in 6-month extension"]
[]
[{"$f":"A62+1","v":21},"'2021DistRevCapForm'!H6:H38","t-1 data for calculating revenue cap","Removed t-1 data as not used for calculating revenue cap for 6-month extension"]
[]
[{"$f":"A65+1","v":22},"'2021DistRevCapForm'!C10","Revenue cap","Formula replaced with revenue directly from 6-month extension PTRM"]
[]
[{"$f":"A67+1","v":23},"'2021DistTarRebalCont'!B9:C13","Side constraint factors","Removed side constraint factors not applied for 6-month extension. "]
[null,"'2021DistTarRebalCont'!C8","CPI","Updated CPI reference to 'Model update' sheet"]
[]
[{"$f":"A69+1","v":24},"Est2020DistRev!D6:P54","t-1 prices","Updated t-1 prices for approved 2020 prices"]
[]
[{"$f":"A72+1","v":25},"'2021TransRevCont'!B13:C17","Table 2 - Total DPPC related payments for year t","Removed calculations for factors not applied in 6-month extension"]
[null,"'2021TransRevCont'!C10","Revenue cap","Updated formula to source total costs from Table 3"]
[]
[{"$f":"A74+1","v":26},"'2021TransRevCont'!B29:E66","Table 4 - DPPC recovery arrangements","Removed table as unders/overs not applied in 6-month extension"]
[null,null,"Table 5 - DPPC unders and overs account","Removed table as unders/overs not applied in 6-month extension"]
[]
[{"$f":"A77+1","v":27},"'2021JSRevCont'!B13:C17","Table 2 - Total JSA related payments for year t","Removed calculations for factors not applied in 6-month extension"]
[null,"'2021JSRevCont'!C10","Revenue cap","Updated formula to source total costs from Table 3"]
[]
[{"$f":"A80+1","v":28},"'2021JSRevCont'!B27:E62","Table 4 - JSA recovery arrangements","Removed table as unders/overs not applied in 6-month extension"]
[null,null,"Table 5 - JSA unders and overs account","Removed table as unders/overs not applied in 6-month extension"]
[]
[{"$f":"A83+1","v":29},"'Meteing exit fees'","Worksheet","Added worksheet for calculating ACS price caps"]
[null,"'Public lighting'","Worksheet","Added worksheet for calculating ACS price caps"]
[null,"'ANS'","Worksheet","Added worksheet for calculating ACS price caps"]

{"sheet":"Formulae","index":1,"n_rows":239,"n_cols":11,"rows_kept":239,"cut":false,"hidden":false,"merged":[[83,7,84,7],[113,7,114,7],[139,7,140,7],[220,7,221,7]]}
[]
[null,"DUoS"]
[null,"Figure 14.1 Revenue cap formulae"]
[null,"(1)   ",null,null,null,null,null,"i=1,..,n and j=1,..,m and t=1,..,5"]
[null,"(2)   ",null,null,null,null,null,"t = 1,2,…,5"]
[null,"(3)   ",null,null,null,null,null,"t = 1"]
[null,"(4)   ",null,null,null,null,null,"t = 2,…,5"]
[]
[null,"where;"]
[null,null," is the total annual revenue in year t."]
[null,null,null,"is the price of component 'j' of tariff 'i' in year t."]
[null,null,null,"is the forecast quantity of component 'j' of tariff 'i' in year t."]
[null," ","is the adjusted annual smoothed revenue requirement for year t."]
[null," ",null,"is the annual adjustment f–factor scheme amount in year t. This amount will be calculated as per the method set out in the relevant f–factor scheme."]
[null,null,null,"is the sum of:"]
[null,"·        the final carryover amount from the application of the DMIS from the 2011–15 regulatory control period. This amount will be calculated using the method set out in the DMIS and will be deducted from/added to allowed revenue in the 2017 pricing proposal."]
[null,null,null,"is the sum of:"]
[null,"·        the recovery of license fee charges by the Victorian Essential Services Commission indexed by one and a half years of interest, calculated using the following method:"]
[]
[null,"where:"]
[null,null," are the licence fees paid by DNSP to the Victorian Essential Services Commission in the financial year ending in June of regulatory year t–1,"]
[null,null,"is the approved nominal weighted average cost of capital  (WACC) for the relevant regulatory year using the following method:"]
[]
[]
[null,"·        any under or over recovery of actual revenue collected through DUoS charges in regulatory year t–2 as calculated using the method in appendix A,"]
[null,"·        the AER approved pass through amounts (positive or negative) with respect to regulatory year t."]
[null,null,"is the annual smoothed revenue requirement as stated in the Post Tax Revenue Model (PTRM) for year t (when year t is the first year of the 2016–20 regulatory control period).[43]"]
[null," ","is the s‑factor determined in accordance with the service target performance incentive scheme (STPIS) for regulatory year t.[44]"]
[null,null," is the annual percentage change in the ABS CPI All Groups, Weighted Average of Eight Capital Cities[45] from the June quarter in year t–2 to the June quarter in year t–1, calculated using the following method :"]
[null,"The ABS CPI All Groups, Weighted Average of Eight Capital Cities for the June quarter in regulatory year t–1"]
[null,"divided by"]
[null,"The ABS CPI All Groups, Weighted Average of Eight Capital Cities for the June quarter in regulatory year t–2"]
[null,"minus one."]
[null,"For example, for the 2017 regulatory year, t–2 is June quarter 2015 and t–1 is June quarter 2016 and for the 2018 regulatory year, t–2 is June quarter 2016 and t–1 is June quarter 2017 and so on."]
[null," ","is the X factor for each year of the 2016–20 regulatory control period as determined in the PTRM, and annually revised for the return on debt update in accordance with the formula specified in attachment 3—rate of return—calculated for the relevant year."]
[]
[]
[null,"[43] ","Our final F&A stated that if necessary an adjustment for inflation may be required to the annual smoothed revenue requirement for year t. However, as the annual smoothed revenue requirement for year t as stated in our preliminary decision PTRM is in nominal dollars there is no need to adjust it for inflation. This approach is consistent with past regulatory practice."]
[null,"[44] ","For the first two regulatory years of the 2016–20 regulatory control period, the value of St is to be adjusted to account for the change in revenue requirements between the regulatory control periods, as explained in attachment 11. In the formulas in the STPIS, the AR(t+1) is equivalent to ARt in this formula. Calculations of the S factor adjustment are to be made accordingly."]
[null,"[45] ","If the ABS does not or ceases to publish the index, then CPI will mean an index which the AER considers is the best available alternative index"]
[]
[]
[]
[null,"Figure 14.2 Side constraints [46]"]
[]
[]
[]
[]
[]
[null,null,"where each tariff class has \"n\" tariffs, with each up to \"m\" components, and where:"]
[null,null,null,"is the proposed price for component ‘j’ of tariff 'i' for year t."]
[null,null,"is the price charged for component ‘j’ of tariff 'i' in year t–1."]
[null,null,null,"is the forecast quantity of component ‘j’ of tariff 'i' in year t."]
[null,null," is the annual percentage change in the ABS CPI All Groups, Weighted Average of Eight Capital Cities[4] from the June quarter in year t–2 to the June quarter in year t–1, calculated using the following method :"]
[null,null,"The ABS CPI All Groups, Weighted Average of Eight Capital Cities[47] for the June quarter in regulatory year t–1"]
[null,null,"divided by"]
[null,null,"The ABS CPI All Groups, Weighted Average of Eight Capital Cities for the June quarter in regulatory year t–2"]
[null,null,"minus one."]
[null,"For example, for the 2017 regulatory year, t–2 is June quarter 2015 and t–1 is June quarter 2016 and for the 2018 regulatory year, t–2 is June quarter 2016 and t–1 is June quarter 2017 and so on."]
[null,null,null,"is the X factor for each year of the 2016–20 regulatory control period as determined in the PTRM, and annually revised for the return on debt update in accordance with the formula specified in attachment 3—rate of return—calculated for the relevant year. If X>0, then X will be set equal to zero for the purposes of the side constraint formula."]
[null," ","is the s‑factor determined in accordance with the STPIS for regulatory year t.[5]"]
[null,null,null,"is the annual percentage change from the f–factor scheme amount in year t. This amount will be calculated as per the method set out in attachment 19—f–factor scheme."]
[null,null,null,"is the annual percentage change from the final carryover amount from the application of the DMIS from the 2011–15 regulatory control period. This amount will be calculated using the method set out in the DMIS and will be deducted from/added to allowed revenue in the 2017 pricing proposal."]
[null,null,null,"is annual percentage change from the sum of:"]
[null,"·        the recovery of license fee charges by the Victorian Essential Services Commission indexed by one and a half years of interest, calculated using the following method:"]
[]
[null,"where:"]
[null," are the licence fees paid byDNSP to the Victorian Essential Services Commission in the financial year ending in June of regulatory year t–1,"]
[null," ","is the approved nominal weighted average cost of capital (WACC) for the relevant regulatory year using the following method:"]
[]
[]
[null,"where the "]
[null," is as set out in our final decision PTRM and updated annually"]
[null,"·        the AER approved pass through amounts (positive or negative) with respect to regulatory year t."]
[null,"With the exception of the CPI, X factor and S factor, the percentage for each of the other factors above can be calculated by dividing the incremental revenues (as used in the total annual revenue formula) for each factor by the expected revenues for regulatory year t–1 (based on the prices in year t–1 multiplied by the forecast quantities for year t)."]
[]
[null,"[46] ","All parameters are in nominal terms unless otherwise specified."]
[null,"[47] ","If the ABS does not or ceases to publish the index, then CPI will mean an index which the AER considers is the best available alternative index."]
[]
[]
[]
[]
[null,null,null,null,null,null,null,"Table 14.1","Example calculation of DUoS unders and overs account ($'000, nominal)"]
[null,null,null,null,null,null,null,null,"Year t–2","Year t–1","Year t"]
[null,null,null,null,null,null,null,null,"(actual)","(estimate)","(forecast)"]
[null,null,null,null,null,null,null,"(A) Revenue from DUoS charges","46 779","40 269","39 510"]
[null,null,null,null,null,null,null,"(B) Less TAR for regulatory year =","43 039","41 427","44 429"]
[null,null,null,null,null,null,null,"+ Adjusted annual smoothed revenues (AARt)","40 189","41 393","44 393"]
[null,null,null,null,null,null,null,"+ f–factor scheme amount (It)  ","–12",10,14]
[null,null,null,null,null,null,null,"+ DMIS carryover amount (Tt) ",1013,0,0]
[null,null,null,null,null,null,null,"+ Annual adjustments (Bt)a =","1849",24,22]
[null,null,null,null,null,null,null,"+ License fee recovery",25,24,22]
[null,null,null,null,null,null,null,"+ Approved pass through amounts",1824,0,0]
[]
[null,null,null,null,null,null,null,"(A minus B) Under/over recovery of revenue for regulatory year",3740,"–1158","–4919b"]
[]
[null,null,null,null,null,null,null,"DUoS unders and overs account"]
[null,null,null,null,null,null,null,"Nominal WACC (per cent)",0.05,5.5E-2,0.06]
[null,null,null,null,null,null,null,"Opening balance",1737,"5656c",4778]
[null,null,null,null,null,null,null,"Interest on opening balance",87,311,287]
[null,null,null,null,null,null,null,"Under/over recovery of revenue for regulatory year",3740,"–1158","–4919b"]
[null,null,null,null,null,null,null,"Interest on under/over recovery for regulatory year",92,"–31","–145"]
[null,null,null,null,null,null,null,"Closing balance",5656,4778,"0d"]
[null,null,null,null,null,null,"Notes:","(a) Bt parameter calculations in the DUoS unders and overs account exclude approved DUoS revenue under/over recovery for regulatory year."]
[null,null,null,null,null,null,null,"(b) Approved DUoS revenue under/over recovery for regulatory year t."]
[null,null,null,null,null,null,null,"(c) Opening balance is the previous year's closing balance."]
[null,null,null,null,null,null,null,"(d) The DNSP is expected to achieve a closing balance as close to zero as practicable in its DUoS unders and overs account in each forecast year in its annual pricing proposals in the 2016–20 regulatory control period."]
[]
[]
[]
[]
[]
[null,null,null,null,null,null,null,"Table 14.2","Example calculation of designated pricing proposal charges unders and overs account ($'000, nominal)"]
[null,null,null,null,null,null,null,null,"Year t–2","Year t–1","Year t"]
[null,null,null,null,null,null,null,null,"(actual)","(estimate)","(forecast)"]
[null,null,null,null,null,null,null,"(A) Revenue from designated pricing proposal charges (DPPC)","40 077","34 944","36 609"]
[null,null,null,null,null,null,null,"(B) Less DPPC related payments for regulatory year =","34 365","38 734","39 200"]
[null,null,null,null,null,null,null,"+ DPPC charges to be paid to TNSP","33 672","37 933","38 000"]
[null,null,null,null,null,null,null,"+ Avoided TUoS/DPPC payments",572,734,800]
[null,null,null,null,null,null,null,"+ Inter–distributor payments",121,67,400]
[]
[null,null,null,null,null,null,null,"(A minus B) Under/over recovery of revenue for regulatory year",5712,"–3790","–2540a"]
[]
[null,null,null,null,null,null,null,"DPPC unders and overs account"]
[null,null,null,null,null,null,null,"Nominal WACC (per cent)",0.05,5.5E-2,0.06]
[null,null,null,null,null,null,null,"Opening balance",167,"6028b",2467]
[null,null,null,null,null,null,null,"Interest on opening balance",8,332,148]
[null,null,null,null,null,null,null,"Under/over recovery of revenue for regulatory year",5712,"–3790","–2540a"]
[null,null,null,null,null,null,null,"Interest on under/over recovery for regulatory year",141,"–103","–75"]
[null,null,null,null,null,null,null,"Closing balance",6028,2467,"0c"]
[null,null,null,null,null,null,"Notes:","(a) Approved DPPC revenue under/over recovery for regulatory year t."]
[null,null,null,null,null,null,null,"(b) Opening balance is the previous year's closing balance."]
[null,null,null,null,null,null,null,"(c)The DNSP is expected to achieve a closing balance as close to zero as practicable in its DPPC unders and overs account in each forecast year in its annual pricing proposals in the 2016–20 regulatory control period."]
[]
[]
[]
[]
[]
[null,null,null,null,null,null,null,"Table 14.3 Example calculation of jurisdictional scheme amounts unders and overs account ($'000, nominal)"]
[null,null,null,null,null,null,null,null,"Year t–2","Year t–1","Year t"]
[null,null,null,null,null,null,null,null,"(actual)","(estimate)","(forecast)"]
[null,null,null,null,null,null,null,"(A) Revenue from jurisdictional schemes","19 777","23 121","26 965"]
[null,null,null,null,null,null,null,"(B) Less jurisdictional scheme payments for regulatory year =","20 272","20 959","28 641"]
[null,null,null,null,null,null,null,"+ Jurisdictional scheme 1 payments","14 159","13 954","13 961"]
[null,null,null,null,null,null,null,"+ Jurisdictional scheme 2 payments","6113",7005,"14 680"]
[]
[null,null,null,null,null,null,null,"(A minus B) Under/over recovery of revenue for regulatory year","–495",2162,"–1676a"]
[]
[null,null,null,null,null,null,null,"Jurisdictional scheme amount unders and overs account"]
[null,null,null,null,null,null,null,"Nominal WACC (per cent)",0.05,5.5E-2,0.06]
[null,null,null,null,null,null,null,"Opening balance","–52","–562b",1628]
[null,null,null,null,null,null,null,"Interest on opening balance","–3","–31",98]
[null,null,null,null,null,null,null,"Under/over recovery of revenue for regulatory year","–495",2162,"–1676a"]
[null,null,null,null,null,null,null,"Interest on under/over recovery for regulatory year","–12",59,"–50"]
[null,null,null,null,null,null,null,"Closing balance","–562",1628,"0c"]
[null,null,null,null,null,null,"Notes:","(a) Approved jurisdictional scheme amounts revenue under/over recovery for regulatory year t."]
[null,null,null,null,null,null,null,"(b) Opening balance is the previous year's closing balance."]
[null,null,null,null,null,null,null,"(c) The DNSP is expected to achieve a closing balance as close to zero as practicable in its jurisdictional scheme amount unders and overs account in each forecast year in its annual pricing proposals in the 2016–20 regulatory control period."]
[]
[]
[]
[]
[]
[]
[]
[null,"Metering"]
[null,"Figure 16.3","Annual metering charges revenue cap formula"]
["(1)   ",null,null,null,null,null,null,"i=1,..,n and j=1,..,m and t=1,..,5"]
[]
["(2)   ",null,null,null,null,null,null,"t = 1,2,…,5"]
[]
["(3)   ",null,null,null,null,null,null,"t = 1,2,…,5"]
[]
[]
[null,"where;"]
[null," ","is the total annual revenue for annual metering charges in year t."]
[null,null,null,null,"is the price of component 'j' of metering service 'i' in year t."]
[null,null,null,null,"is the forecast quantity of component 'j' of metering service 'i' in year t."]
[null,null,null,"is the annual revenue requirement for year t. When year t is the first year of the 2016–20 regulatory control period,"]
[null,null,null," is the annual revenue requirement in the annual metering charges Post Tax Revenue Model (PTRM) for year t."]
[null,null,null,null,"is equal to zero for all years except 2017 and is a once off adjustment to 2017 charges for the unders and overs recoveries relating to Advanced Metering Infrastructure actual revenues and actual costs incurred in 2014 and 2015."]
[null,null,null,null,"is the sum of annual adjustment factors in year t as calculated in the unders and overs account in appendix C."]
[]
[null,null,null,"is the annual revenue requirement for year t–1."]
[null," ","is the annual percentage change in the ABS CPI All Groups, Weighted Average of Eight Capital Cities[39] from the June quarter in year t–2 to the June quarter in year t–1, calculated using the following method:"]
[null,"The ABS CPI All Groups, Weighted Average of Eight Capital Cities for the June quarter in regulatory year t–1"]
[null,"divided by"]
[null,"The ABS CPI All Groups, Weighted Average of Eight Capital Cities for the June quarter in regulatory year t–2"]
[null,"minus one."]
[null,"For example, for the 2017 regulatory year, t–2 is June quarter 2015 and t–1 is June quarter 2016 and for the 2018 regulatory year, t–2 is June quarter 2016 and t–1 is June quarter 2017 and so on."]
[null," ",null,"is the X factor for each year of the 2016–20 regulatory control period as determined in the annual metering charges PTRM."]
[]
[]
[null,"[39] ","If the ABS does not or ceases to publish the index, then CPI will mean an index which the AER considers is the best available alternative index"]
[]
[]
[]
[]
[null,"Figure 16.4 Side constraints"]
[]
[null,"where:"]
[null,null,null,null,"is the price of annual metering charges service 'i' in year t."]
[null,null,null,"is the price of annual metering charges service 'i' in year t–1."]
[null," ","is the annual percentage change in the ABS CPI All Groups, Weighted Average of Eight Capital Cities from the June quarter in year t–2 to the June quarter in year t–1, calculated using the following method:"]
[null,"The ABS CPI All Groups, Weighted Average of Eight Capital Cities[40] for the June quarter in regulatory year t–1"]
[null,"divided by"]
[null,"The ABS CPI All Groups, Weighted Average of Eight Capital Cities for the June quarter in regulatory year t–2"]
[null,"minus one."]
[null,"For example, for the 2017 regulatory year, t–2 is June quarter 2015 and t–1 is June quarter 2016 and for the 2018 regulatory year, t–2 is June quarter 2016 and t–1 is June quarter 2017 and so on."]
[null," ",null,"is the X factor for each year of the 2016–20 regulatory control period as determined in the annual metering charges PTRM."]
[null,null,null,null,"is the annual percentage change for the unders and overs recoveries relating to Advanced Metering Infrastructure actual revenues and actual costs incurred in 2014 and 2015. It is equal to zero for all years except 2017 and is a once off adjustment to 2017 charges."]
[null,null,null,null,"is the annual percentage change from the sum of annual adjustment factors in year t as calculated in the unders and overs account in appendix C."]
[null,"With the exception of the CPI and the X factor, the percentage for each of the other factors above can be calculated by dividing the incremental revenues (as used in the total annual revenue formula) for each factor by the expected revenues for regulatory year t–1 (based on the prices in year t–1 multiplied by the forecast quantities for year t)."]
[]
[null,"[40] ","If the ABS does not or ceases to publish the index, then CPI will mean an index which the AER considers is the best available alternative index."]
[]
[]
[]
[]
[null,null,null,null,null,null,null,"Table 16.xx","Example calculation of annual metering charges unders and overs account ($'000, nominal)"]
[null,null,null,null,null,null,null,null,"Year t–2","Year t–1","Year t"]
[null,null,null,null,null,null,null,null,"(actual)","(estimate)","(forecast)"]
[null,null,null,null,null,null,null,"(A) Revenue from annual metering charges","8 449","7 389","6 460"]
[null,null,null,null,null,null,null,"(B) Less TARM for regulatory year =","7 366","7 422","7 573"]
[null,null,null,null,null,null,null,"+ Annual revenue requirement (ARt)","7 349","7 412","7 559"]
[null,null,null,null,null,null,null,"+ T factor (Tt) – true‑ups relating to the AMI–Order in Council  ","17",10,14]
[]
[null,null,null,null,null,null,null,"(A minus B) Under/over recovery of revenue for regulatory year","1 083","–33","–1 113a"]
[]
[null,null,null,null,null,null,null,"Annual metering charges unders and overs account"]
[null,null,null,null,null,null,null,"Nominal WACC (per cent)",0.05,5.5E-2,0.06]
[null,null,null,null,null,null,null,"Opening balance","–50","1 057b","1 081"]
[null,null,null,null,null,null,null,"Interest on opening balance","–3",58,65]
[null,null,null,null,null,null,null,"Under/over recovery of revenue for regulatory year","1 083","–33","–1 113b"]
[null,null,null,null,null,null,null,"Interest on under/over recovery for regulatory year",27,"–1","–33"]
[null,null,null,null,null,null,null,"Closing balance","1 057","1 081","0c"]
[null,null,null,null,null,null,"Notes:","(a) Approved annual metering charges revenue under/over recovery for regulatory year t. This is the Bt parameter in the annual metering charges revenue cap formula."]
[null,null,null,null,null,null,null,"(b) Opening balance is the previous year's closing balance."]
[null,null,null,null,null,null,null,"(c) The DNSP is expected to achieve a closing balance as close to zero as practicable in its annual metering charges unders and overs account in each forecast year in its annual pricing proposals in the 2016–20 regulatory control period."]

{"sheet":"6 month formulae","index":2,"n_rows":39,"n_cols":9,"rows_kept":39,"cut":false,"hidden":false,"merged":[]}
[]
[]
[]
[null,null,null,null,null,null,null,"The revenue cap to be applies to standard control services will be as set in the amended PTRM, with no other factors applied.*"]
[]
[]
[]
[]
[]
[null,null,null,null,null,null,null,"The revenue cap to be applied to revenue-capped type 5 and 6 (inc. smart metering) services will be as set in the amended metering PTRM, with no other factors applied."]
[]
[]
[]
[]
[]
[null,null,null,null,null,null,null,"The side constraint mechanism to apply to standard control services and metering services will be just CPI and the 2% allowance as there is no X-factor to apply, and no other adjustments need to be discounted from the permissable percentage.*"]
[]
[]
[]
[null,null,null,null,null,null,null,null,"NB - no adjustment to be made to make 12 month and 6 month period comparable"]
[]
[]
[]
[]
[null,null,null,null,null,null,null,"The price cap to be applied to type 7 metering services will be escalated for CPI"]
[]
[]
[]
[null,null,null,null,null,null,null,"The price cap to apply to ancillary network services will be escalated for CPI and x-factor."]
[null,null,null,null,null,null,null,"X-factor to apply will reflect updated labour escalation forecast for the extended period in line with the calculation of the 2021–26 draft decision, being half of the forecast yearly change in the State utilities sector real wages for Vic in 21/22."]
[]
[]
[null,null,null,null,null,null,null,"The price cap to apply to metering exit fees and public lighting services will not be escalated."]
[]
[]
[]
[]
[]
[null,null,null,null,null,null,null,"CPI definition to remain as per the 2015–20 determination."]

{"sheet":"Model update","index":3,"n_rows":35,"n_cols":6,"rows_kept":35,"cut":false,"hidden":false,"merged":[]}
[]
[]
["Tariff Approval Template for ",null,"United Energy"]
[]
["calendar year commencing",null,2021]
[]
["t","=",{"$f":"C5","v":2021}]
["t-1","=",{"$f":"C7-1","v":2020}]
["t-2","=",2019]
["t-3","=",2018]
["t-4","=",2017]
[]
["Please fill in yellow highlighted cells where appropriate"]
[]
["CPI","The ABS changed the index reference base in September 2012 from 1989-90 to 2011-12."]
["CPI Index Sept 2011",null,99.8]
["CPI Index Sept 2012",null,101.8,null,"CPI 2013",{"$f":"C17/C16-1","v":2.0040080160320661E-2}]
["CPI Index Sept 2013",null,104,null,"CPI 2014",{"$f":"C18/C17-1","v":2.16110019646365E-2}]
["CPI Index Sept 2014",null,106.4,null,"CPI 2015",{"$f":"C19/C18-1","v":2.3076923076923217E-2}]
["CPI Index Sept 2015",null,108,null,"CPI 2016",{"$f":"C20/C19-1","v":1.5037593984962294E-2}]
["CPI Index June 2015",null,107.5]
["CPI Index June 2016",null,108.6,null,"CPI 2017",{"$f":"IF(OR(C21=\"\",C22=\"\"),0,C22/C21-1)","v":1.0232558139534831E-2}]
["CPI Index June 2017",null,110.7,null,"CPI 2018",{"$f":"IF(OR(C22=\"\",C23=\"\"),0,C23/C22-1)","v":1.9337016574585641E-2}]
["CPI Index June 2018",null,113,null,"CPI 2019",2.0776874435411097E-2]
["CPI Index June 2019",null,114.8,null,"CPI 2020",1.5929203539823078E-2]
["CPI Index June 2020",null,114.4,null,"CPI 2021",{"$f":"IF(OR(C25=\"\",C26=\"\"),0,C26/C25-1)","v":-3.4843205574912606E-3}]
[]
[{"$f":"\"CPI \" &$C$9","v":"CPI 2019"},null,{"$f":"VLOOKUP(A28,E$17:F$25,2,FALSE)","v":2.0776874435411097E-2},"(t-2)"]
[{"$f":"\"CPI \" &$C$8","v":"CPI 2020"},null,{"$f":"VLOOKUP(A29,E$17:F$25,2,FALSE)","v":1.5929203539823078E-2},"(t-1)"]
[{"$f":"\"CPI \" &$C$5","v":"CPI 2021"},null,{"$f":"VLOOKUP(A30,E$17:F$26,2,FALSE)","v":-3.4843205574912606E-3},"(t)"]
[]
[]
[]
[]
["2021 X-factor for ANS",null,-1.1926767169156999E-3]

{"sheet":"Metering","index":4,"n_rows":30,"n_cols":12,"rows_kept":30,"cut":false,"hidden":false,"merged":[[23,7,23,8]]}
[null,{"$f":"\"Tariff Approval - \"&'Model update'!C3","v":"Tariff Approval - United Energy"}]
[]
[null,{"$f":"\"PROPOSED \"&'Model update'!$C$5&\" METERING TARIFFS AND REVENUE\"","v":"PROPOSED 2021 METERING TARIFFS AND REVENUE"}]
[]
[null,null,null,{"$f":"\"Proposed Metering Tariffs P(t) for \" &'Model update'!$C$5","v":"Proposed Metering Tariffs P(t) for 2021"},{"$f":"\"Current Metering Tariffs P(t-1) for\" &'Model update'!$C$8","v":"Current Metering Tariffs P(t-1) for2020"},{"$f":"\"Forecast Quantities   (Qt) for \"&'Model update'!$C$5","v":"Forecast Quantities   (Qt) for 2021"},null,{"$f":"\"Forecast Revenue (Pt \"&'Model update'!$C$5&\")*(Qt \" &'Model update'!$C$5&\")\"","v":"Forecast Revenue (Pt 2021)*(Qt 2021)"},{"$f":"\"Revenue                    (Pt-1 \"&'Model update'!$C$8&\")*(Qt \" &'Model update'!$C$5&\")\"","v":"Revenue                    (Pt-1 2020)*(Qt 2021)"},null,"Movement","Side Constraint"]
[null,"Proposed tariff","Existing tariff","PropTar\n$/Cust/year","ExistTar\n$/Cust/year","FcastVol\nCust #",null,"PropRev\nFixed","ExistRev\nFixed"]
[]
[null,"single phase single element meter","single phase single element meter",24.412163437250324,54.23,545454,null,{"$f":"D8*F8","v":13315712.195501938},{"$f":"E8*F8","v":29579970.419999998},null,{"$f":"IFERROR(H8/I8,\"\")","v":0.4501597535911917},{"$f":"IF(B8=\"\",\"\",IF(K8<$I$30,\"COMPLIANT\",\"BREACHED\"))","v":"COMPLIANT"}]
[null,"single phase single element meter with contactor","single phase single element meter with contactor",24.412163437250324,54.23,55062,null,1344182.5431818774,2986012.26,null,{"$f":"IFERROR(H9/I9,\"\")","v":0.4501597535911917},"COMPLIANT"]
[null,"three phase direct connected meter","three phase direct connected meter",27.531770529637281,61.16,102706,null,2827678.0240169265,6281498.96,null,0.45015975359119165,"COMPLIANT"]
[null,"three phase Current transformer connected meter","three phase Current transformer connected meter",29.188358422852872,64.84,3188,null,93052.486652054955,206709.92,null,0.4501597535911917,"COMPLIANT"]
[null,null,null,null,null,null,null,0,0,null,"",""]
[null,null,null,null,null,null,null,0,0,null,"",""]
[null,null,null,null,null,null,null,0,0,null,"",""]
[null,null,null,null,null,null,null,0,0,null,"",""]
[null,null,null,null,null,null,null,0,0,null,"",""]
[null,null,null,null,null,null,null,{"$f":"SUM(H7:H16)","v":17580625.249352798},{"$f":"SUM(I7:I16)","v":39054191.560000002}]
[]
[]
[]
[]
[null,"Year (t)",null,{"$f":"'Model update'!C5","v":2021}]
[]
[null,"Table 1- Compliance with AER Final Determination Total Metering Annual Revenue",null,null,null,null,null,"Metering tariff rebalancing control"]
[null,"Revenue from  Metering charges for year t",null,{"$f":"H17","v":17580625.249352798},null,null,null,{"$f":"\"CPI \"&'Model update'!$C$5","v":"CPI 2021"},{"$f":"'Model update'!C30","v":-3.4843205574912606E-3}]
[null,"Total Annual Metering Revenue for year t",null,17580625.249352798]
[null,null,null,{"$f":"IF(D25=\"\",\"\",IF(D26>=D25,\"METERING REVENUE CAP FORMULA COMPLIANT\",\"METERING REVENUE CAP FORMULA BREACHED\"))","v":"METERING REVENUE CAP FORMULA COMPLIANT"}]
[]
[]
[null,null,null,null,null,null,null,null,{"$f":"(1+I25)*(1-I26)*(1+0.02)+SUM(I27:I28)","v":1.016445993031359}]

{"sheet":"Unmetered supply","index":5,"n_rows":14,"n_cols":23,"rows_kept":14,"cut":false,"hidden":false,"merged":[[3,19,3,21]]}
[null,{"$f":"\"Tariff Approval - \" &'Model update'!C3","v":"Tariff Approval - United Energy"}]
[]
[null,{"$f":"\"PROPOSED \"&'Model update'!C5&\" UNMETERED SUPPLY TARIFF\"","v":"PROPOSED 2021 UNMETERED SUPPLY TARIFF"}]
[null,null,{"$f":"\"P t-1 (\"&'Model update'!$C$8&\")\"","v":"P t-1 (2020)"},null,null,null,{"$f":"\"Pt (\"&'Model update'!$C$7&\")\"","v":"Pt (2021)"},null,null,null,{"$f":"\"Qt-2 (\"&'Model update'!$C$9&\")\"","v":"Qt-2 (2019)"},null,null,null,"P t-1 * Qt-2",null,null,null,null,"Pt * Qt-2"]
[null,null,"($) per NMI","($) per meter","($) per light",null,"($) per NMI","($) per meter","($) per light",null,"NMIs","Meters","Lights",null,"$ Comp1","$ Comp2","$ Comp3","Total $",null,"NMIs","Meters","Lights"]
[null,"Proposed tariff","ExistTarComp1","ExistTarComp2","ExistTarComp3",null,"PropTarComp1","PropTarComp2","PropTarComp3",null,"ActVolComp1","ActVolComp2","ActVolComp3",null,"$Comp1","ExistRevComp2","ExistRevComp3","Exist Rev Total",null,"$PropRevComp1","$PropRevComp2","$ PropRevComp3","Total $"]
[null,"metering data services - unmetered supplies",null,null,1.395,null,{"$f":"ROUNDDOWN(C7*(1+$C$14),1)","v":0},null,{"$f":"ROUNDDOWN(E7*(1+$C$14),4)","v":1.3900999999999999},null,null,0,121620,null,{"$f":"IF($B7=\"\",\"\",C7*K7)","v":0},{"$f":"IF($B7=\"\",\"\",D7*L7)","v":0},{"$f":"IF($B7=\"\",\"\",E7*M7)","v":169659.9},{"$f":"SUM(O7:Q7)","v":169659.9},null,{"$f":"IF($B7=\"\",\"\",G7*K7)","v":0},{"$f":"IF($B7=\"\",\"\",H7*L7)","v":0},{"$f":"IF($B7=\"\",\"\",I7*M7)","v":169063.962},{"$f":"SUM(T7:V7)","v":169063.962}]
[]
[]
[null,"UNMETERED SUPPLY TARIFF CONTROL"]
[]
[null,"CPI"]
[]
[null,{"$f":"\"CPI \"&'Model update'!C5","v":"CPI 2021"},{"$f":"'Model update'!C30","v":-3.4843205574912606E-3}]

{"sheet":"Metering exit fees","index":6,"n_rows":10,"n_cols":6,"rows_kept":10,"cut":false,"hidden":false,"merged":[]}
[null,{"$f":"\"Tariff Approval - \"&'Model update'!C3","v":"Tariff Approval - United Energy"}]
[]
[null,"Proposed metering exit fees"]
[]
[null,"Metering type","2020 price cap","2021 price cap","Proposed 2021 price"]
[null,"single phase single element meter",341.74,{"$f":"IF(C6=\"\",\"\",C6)","v":341.74},{"$f":"D6","v":341.74},{"$f":"IF(E6=\"\",\"\",IF(E6<=D6,\"COMPLIANT\",\"BREACHED\"))","v":"COMPLIANT"}]
[null,"single phase single element meter with contactor",351.67,{"$f":"IF(C7=\"\",\"\",C7)","v":351.67},{"$f":"D7","v":351.67},{"$f":"IF(E7=\"\",\"\",IF(E7<=D7,\"COMPLIANT\",\"BREACHED\"))","v":"COMPLIANT"}]
[null,"three phase direct connected meter",387.89,387.89,387.89,"COMPLIANT"]
[null,"three phase Current transformer connected meter",505.76,505.76,505.76,"COMPLIANT"]
[null,null,null,"","",""]

{"sheet":"Public lighting","index":7,"n_rows":50,"n_cols":6,"rows_kept":50,"cut":false,"hidden":false,"merged":[]}
[null,{"$f":"\"Tariff Approval - \"&'Model update'!C3","v":"Tariff Approval - United Energy"}]
[]
[null,"Proposed public lighting prices"]
[]
[null,"Public lighting tariff","2020 price cap","2021 price cap","Proposed 2021 price"]
[null,"Existing Lights",null,{"$f":"IF(C6=\"\",\"\",C6/2)","v":""},{"$f":"D6","v":""},{"$f":"IF(E6=\"\",\"\",IF(E6<=D6,\"COMPLIANT\",\"BREACHED\"))","v":""}]
[null,"Mercury Vapour 80 watt",62.708055721362008,{"$f":"IF(C7=\"\",\"\",C7/2)","v":31.354027860681004},{"$f":"D7","v":31.354027860681004},{"$f":"IF(E7=\"\",\"\",IF(E7<=D7,\"COMPLIANT\",\"BREACHED\"))","v":"COMPLIANT"}]
[null,"Sodium High Pressure 150 watt",81.219645635866527,40.609822817933264,40.609822817933264,"COMPLIANT"]
[null,"Sodium High Pressure 250 watt",83.05719417758155,41.528597088790775,41.528597088790775,"COMPLIANT"]
[null,"Fluorescent 2x20 watt",80.89339188055699,40.446695940278495,40.446695940278495,"COMPLIANT"]
[null,"Fluorescent 3x20 watt",80.89339188055699,40.446695940278495,40.446695940278495,"COMPLIANT"]
[null,"Mercury Vapour 50 watt",92.807922467615768,46.403961233807884,46.403961233807884,"COMPLIANT"]
[null,"Mercury Vapour 125 watt",92.807922467615768,46.403961233807884,46.403961233807884,"COMPLIANT"]
[null,"Mercury Vapour 250 watt",75.582046701599211,37.791023350799605,37.791023350799605,"COMPLIANT"]
[null,"Mercury Vapour 400 watt",104.65206466375275,52.326032331876377,52.326032331876377,"COMPLIANT"]
[null,"Mercury Vapour 700 watt",104.65206466375275,52.326032331876377,52.326032331876377,"COMPLIANT"]
[null,"Sodium High Pressure 70 watt",137.33064202978281,68.665321014891404,68.665321014891404,"COMPLIANT"]
[null,"Sodium High Pressure 100 watt",89.341610199453186,44.670805099726593,44.670805099726593,"COMPLIANT"]
[null,"Sodium High Pressure 400 watt",104.65206466375275,52.326032331876377,52.326032331876377,"COMPLIANT"]
[null,"Metal Halide 70 watt",109.64652160841982,54.823260804209909,54.823260804209909,"COMPLIANT"]
[null,"Metal Halide 100 watt",109.64652160841982,54.823260804209909,54.823260804209909,"COMPLIANT"]
[null,"Metal Halide 150 watt",109.64652160841982,54.823260804209909,54.823260804209909,"COMPLIANT"]
[null,"Metal Halide 250 watt",112.12721213973511,56.063606069867554,56.063606069867554,"COMPLIANT"]
[null,"Metal Halide 400 watt",112.12721213973511,56.063606069867554,56.063606069867554,"COMPLIANT"]
[null,null,null,"","",""]
[null,"Energy Efficient Lights",null,"","",""]
[null,"T5 2X14W",30.590710080887806,15.295355040443903,15.295355040443903,"COMPLIANT"]
[null,"Twin 24w Fluorescent",30.590710080887806,15.295355040443903,15.295355040443903,"COMPLIANT"]
[null,"32W Compact Fluorescent",30.590710080887806,15.295355040443903,15.295355040443903,"COMPLIANT"]
[null,"42w Compact Fluorescent",30.590710080887806,15.295355040443903,15.295355040443903,"COMPLIANT"]
[null,null,null,"","",""]
[null,null,null,"","",""]
[null,null,null,"","",""]
[null,null,null,"","",""]
[null,null,null,"","",""]
[null,null,null,"","",""]
[null,null,null,"","",""]
[null,null,null,"","",""]
[null,null,null,"","",""]
[null,null,null,"","",""]
[null,null,null,"","",""]
[null,null,null,"","",""]
[null,null,null,"","",""]
[null,null,null,"","",""]
[null,null,null,"","",""]
[null,null,null,"","",""]
[null,null,null,"","",""]
[null,null,null,"","",""]
[null,null,null,"","",""]
[null,null,null,"","",""]

{"sheet":"ANS","index":8,"n_rows":103,"n_cols":11,"rows_kept":103,"cut":false,"hidden":false,"merged":[[4,9,4,10]]}
[null,{"$f":"\"Tariff Approval - \"&'Model update'!C3","v":"Tariff Approval - United Energy"}]
[]
[null,"Proposed ancillary network service prices"]
[]
[null,"Ancillary network service",null,"2020 price cap","2021 price cap","Proposed 2021 price",null,null,null,"Escalators"]
[null,"Field Officer Visits – Existing Premises ",null,null,{"$f":"IF(D6=\"\",\"\",D6*(1+$K$6)*(1-$K$7))","v":""},{"$f":"E6","v":""},{"$f":"IF(F6=\"\",\"\",IF(F6<=E6,\"COMPLIANT\",\"BREACHED\"))","v":""},null,null,"CPI",{"$f":"'Model update'!C30","v":-3.4843205574912606E-3}]
[null,"Special read (basic meter)","SPRDB",23.27,{"$f":"IF(D7=\"\",\"\",D7*(1+$K$6)*(1-$K$7))","v":23.216576745435372},{"$f":"E7","v":23.216576745435372},{"$f":"IF(F7=\"\",\"\",IF(F7<=E7,\"COMPLIANT\",\"BREACHED\"))","v":"COMPLIANT"},null,null,"X-factor",{"$f":"'Model update'!C35","v":-1.1926767169156999E-3}]
[null,"Special read (interval meter)","SPRDI",23.27,23.216576745435372,23.216576745435372,"COMPLIANT"]
[null,"Re-energise (fuse insert)—BH (unit rate)","RECFIB",49.56,49.446220176354835,49.446220176354835,"COMPLIANT"]
[null,"De-energise (fuse removal)—BH (unit rate)","DEENBH",49.56,49.446220176354835,49.446220176354835,"COMPLIANT"]
[null,"Express move in re-energise (fuse insert) AH (unit rate)","EXREAH",138.30000000000001,137.98249092796357,137.98249092796357,"COMPLIANT"]
[null,"Re-energise (fuse insert)—AH (unit rate)","RECFAG",87.94,87.738107391215593,87.738107391215593,"COMPLIANT"]
[null,"De-energise (fuse removal)—AH (unit rate)","DEENAH",null,"",{"$f":"E13","v":""},{"$f":"IF(F13=\"\",\"\",IF(F13<=E13,\"COMPLIANT\",\"BREACHED\"))","v":""}]
[null,"Express move in re-energise (fuse insert) BH (unit rate)","SPRER",74.709999999999994,74.538480818714078,74.538480818714078,"COMPLIANT"]
[null,"De-energisation point of attachment (pole/pit/premise)","DEENPS",383.07,382.19054808224871,382.19054808224871,"COMPLIANT"]
[null,null,null,null,"","",""]
[null,"Temporary Supplies (exc inspection) – Coincident Disconnection ",null,null,"","",""]
[null,"Standard single phase—BH (unit rate)","TSCSPB",500.51,499.36092938796122,499.36092938796122,"COMPLIANT"]
[null,"Multi phase to 100A—BH (unit rate)","TSCMPB",500.3,499.15141150585811,499.15141150585811,"COMPLIANT"]
[null,"Standard single phase—AH (unit rate)","TSCSPA",764.38,762.62513677163258,762.62513677163258,"COMPLIANT"]
[null,"Multi phase to 100A—AH (unit rate)","TSCMPA",764.17,762.41561888952936,762.41561888952936,"COMPLIANT"]
[null,null,null,null,"","",""]
[null,"Temporary Supplies (exc inspection) Where United Energy is not the Responsible Person ",null,null,"","",""]
[null,"Single Phase Servicing and Energisation only BH","TSSNRD",464.47,463.40367000225046,463.40367000225046,"COMPLIANT"]
[null,"Multi Phase Servicing and Energisation only BH","TSMNRD",464.47,463.40367000225046,463.40367000225046,"COMPLIANT"]
[null,"Single Phase Servicing and Energisation only AH","TSSNRA",764.38,762.62513677163258,762.62513677163258,"COMPLIANT"]
[null,"Multi Phase Servicing and Energisation only AH","TSMNRA",764.38,762.62513677163258,762.62513677163258,"COMPLIANT"]
[null,null,null,null,"","",""]
[null,"New Connection where United Energy is the Responsible Person ",null,null,"","",""]
[null,"Single phase single element—BH (unit rate)","SPHCBG",500.51,499.36092938796122,499.36092938796122,"COMPLIANT"]
[null,"Single phase two element (off-peak)—BH (unit rate)","SPH2EB",500.51,499.36092938796122,499.36092938796122,"COMPLIANT"]
[null,"Three phase direct connected—BH (unit rate)","MPHCBG",500.3,499.15141150585811,499.15141150585811,"COMPLIANT"]
[null,"Single phase single element—AH (unit rate)","SPHCAG",764.38,762.62513677163258,762.62513677163258,"COMPLIANT"]
[null,"Single phase two element (off-peak)—AH (unit rate)","SPH2EA",764.38,762.62513677163258,762.62513677163258,"COMPLIANT"]
[null,"Three phase direct connected—AH (unit rate)","MPHCAG",764.17,762.41561888952936,762.41561888952936,"COMPLIANT"]
[null,null,null,null,"","",""]
[null,"New Connections – where United Energy is Not the Responsible Person",null,null,"","",""]
[null,"Single phase single element—BH (unit rate)","SPNRPB",464.47,463.40367000225046,463.40367000225046,"COMPLIANT"]
[null,"Single phase two element (off-peak)—BH (unit rate)","SP2NRB",464.47,463.40367000225046,463.40367000225046,"COMPLIANT"]
[null,"Three phase direct connected—BH (unit rate)","MPNRPB",464.47,463.40367000225046,463.40367000225046,"COMPLIANT"]
[null,"Single phase single element—AH (unit rate)","SPNRPA",764.38,762.62513677163258,762.62513677163258,"COMPLIANT"]
[null,"Single phase two element (off-peak)—AH (unit rate)","SP2NRA",764.38,762.62513677163258,762.62513677163258,"COMPLIANT"]
[null,"Three phase direct connected—AH (unit rate)","MPNRPA",764.38,762.62513677163258,762.62513677163258,"COMPLIANT"]
[null,null,null,null,"","",""]
[null,"Service Vehicle Visits (without inspection)",null,null,"","",""]
[null,"Service truck – first 30 minutes—BH (unit rate)","TVMINB",355.59,354.77363665274447,354.77363665274447,"COMPLIANT"]
[null,"Each additional 15 minutes—BH (unit rate)","TVADDB",73.53,73.361189862134196,73.361189862134196,"COMPLIANT"]
[null,"Wasted service truck visit—BH (unit rate)","WTVBH",308.43,307.72190655756907,307.72190655756907,"COMPLIANT"]
[null,"Service truck – first 30 minutes (2 hr min)—AH (unit rate)","TVMINA",786.98,785.17325170273875,785.17325170273875,"COMPLIANT"]
[null,"Each additional 15 minutes—AH (unit rate)","TVADDA",101.97,101.73589732411021,101.73589732411021,"COMPLIANT"]
[null,"Wasted service truck visit—AH (unit rate)","WTVAH",786.98,785.17325170273875,785.17325170273875,"COMPLIANT"]
[null,"Truck Visit + 1x additional 15 mins BH","TVAD1B",429.13,428.14480355688363,428.14480355688363,"COMPLIANT"]
[null,"Truck Visit + 2x additional 15 mins BH","TVAD2B",502.66,501.50599341901784,501.50599341901784,"COMPLIANT"]
[null,"Truck Visit + 3x additional 15 mins BH","TVAD3B",576.17999999999995,574.8572062391471,574.8572062391471,"COMPLIANT"]
[null,"Truck Visit + 4x additional 15 mins BH","TVAD4B",649.71,648.21839610128131,648.21839610128131,"COMPLIANT"]
[null,"Truck Visit + 5x additional 15 mins BH","TVAD5B",723.24,721.57958596341552,721.57958596341552,"COMPLIANT"]
[null,"Truck Visit + 6x additional 15 mins BH","TVAD6B",796.75,794.92082174153995,794.92082174153995,"COMPLIANT"]
[null,"Truck Visit + 1x additional 15 mins AH","TVAD1A",888.95,886.90914902684904,886.90914902684904,"COMPLIANT"]
[null,"Truck Visit + 2x additional 15 mins AH","TVAD2A",990.94,988.6650004349691,988.6650004349691,"COMPLIANT"]
[null,"Truck Visit + 3x additional 15 mins AH","TVAD3A",1092.92,1090.4108748010842,1090.4108748010842,"COMPLIANT"]
[null,"Truck Visit + 4x additional 15 mins AH","TVAD4A",1194.8800000000001,1192.1367950831896,1192.1367950831896,"COMPLIANT"]
[null,"Truck Visit + 5x additional 15 mins AH","TVAD5A",1296.8499999999999,1293.8726924072996,1293.8726924072996,"COMPLIANT"]
[null,"Truck Visit + 6x additional 15 mins AH","TVAD6A",1398.84,1395.6285438154198,1395.6285438154198,"COMPLIANT"]
[null,null,null,null,{"$f":"IF(D64=\"\",\"\",D64*(1+$K$6)*(1-$K$7))","v":""},{"$f":"E64","v":""},{"$f":"IF(F64=\"\",\"\",IF(F64<=E64,\"COMPLIANT\",\"BREACHED\"))","v":""}]
[null,"Meter Equipment Test ",null,null,"","",""]
[null,"Single phase","MTSPFM",277.05,276.41394874614832,276.41394874614832,"COMPLIANT"]
[null,"Single phase (each additional meter)","MTSPAD",132.94,132.63479641332955,132.63479641332955,"COMPLIANT"]
[null,"Multi phase","MTMPFM",276.70999999999998,276.07472931798117,276.07472931798117,"COMPLIANT"]
[null,"Multi phase (each additional meter)","MTMPAM",132.94,132.63479641332955,132.63479641332955,"COMPLIANT"]
[null,null,null,null,"","",""]
[null,"Remote AMI Services",null,null,"","",""]
[null,"Remote Meter Configuration","MECFRM",66.08,65.928293568473109,65.928293568473109,"COMPLIANT"]
[null,"Remote Special Meter Reading","SPRDRM",0.89,0.887956738437365,0.887956738437365,"COMPLIANT"]
[null,"Remote Re-Energise","REENRM",11.16,11.134378877484261,11.134378877484261,"COMPLIANT"]
[null,"Remote de-Energise","DEENRM",11.16,11.134378877484261,11.134378877484261,"COMPLIANT"]
[null,null,null,null,"","",""]
[null,"QUOTED SERVICES",null,null,"","",""]
[null,"Field worker - one person - BH",null,135.80000000000001,135.48823042673502,135.48823042673502,"COMPLIANT"]
[null,"Field worker - one person - AH",null,192.86,192.41723210677551,192.41723210677551,"COMPLIANT"]
[null,"Field worker - one person plus vehicle - BH",null,159.19,158.82453167622936,158.82453167622936,"COMPLIANT"]
[null,"Field worker - one person plus vehicle - AH",null,216.25,215.75353335626986,215.75353335626986,"COMPLIANT"]
[null,"Administration - BH",null,104.92,104.67912471555992,104.67912471555992,"COMPLIANT"]
[null,"Senior engineer - BH",null,199.99,199.53086305627934,199.53086305627934,"COMPLIANT"]
[null,"Project planner - BH",null,199.99,199.53086305627934,199.53086305627934,"COMPLIANT"]
[null,null,null,null,"","",""]
[null,null,null,null,"","",""]
[null,null,null,null,"","",""]
[null,null,null,null,"","",""]
[null,null,null,null,"","",""]
[null,null,null,null,"","",""]
[null,null,null,null,"","",""]
[null,null,null,null,"","",""]
[null,null,null,null,"","",""]
[null,null,null,null,"","",""]
[null,null,null,null,"","",""]
[null,null,null,null,"","",""]
[null,null,null,null,"","",""]
[null,null,null,null,"","",""]
[null,null,null,null,"","",""]
[null,null,null,null,"","",""]
[null,null,null,null,"","",""]
[null,null,null,null,"","",""]
[null,null,null,null,"","",""]

{"sheet":"Prop2021DistTar","index":9,"n_rows":63,"n_cols":74,"rows_kept":63,"cut":false,"hidden":false,"merged":[]}
[null,{"$f":"\"Tariff Approval - \"&'Model update'!$C$3","v":"Tariff Approval - United Energy"},{"$f":"\"Prop\"&'Model update'!$C$5&\"DistTar\"","v":"Prop2021DistTar"}]
[]
[null,{"$f":"\"PROPOSED \"&'Model update'!$C$5&\" DISTRIBUTION TARIFFS\"","v":"PROPOSED 2021 DISTRIBUTION TARIFFS"}]
[null,null,null,{"$f":"\"Proposed Distribution Tariffs (Pt) for \"&'Model update'!$C$5","v":"Proposed Distribution Tariffs (Pt) for 2021"},null,null,null,null,null,null,null,null,null,null,null,null,null,{"$f":"\"Current Distribution Tariffs (Pt-1) for \"&'Model update'!$C$8","v":"Current Distribution Tariffs (Pt-1) for 2020"},null,null,null,null,null,null,null,null,null,null,null,null,null,{"$f":"\"Forecast Quantities (Qt) for \"&'Model update'!$C$5","v":"Forecast Quantities (Qt) for 2021"},null,null,null,null,null,null,null,null,null,null,null,null,null,{"$f":"\"Forecast Revenue (Pt \"&'Model update'!$C$5&\")*(Qt \" &'Model update'!$C$5&\")\"","v":"Forecast Revenue (Pt 2021)*(Qt 2021)"},null,null,null,null,null,null,null,null,null,null,null,null,null,null,{"$f":"\"Revenue (Pt-1 \"&'Model update'!$C$8&\")*(Qt \" &'Model update'!$C$5&\")\"","v":"Revenue (Pt-1 2020)*(Qt 2021)"}]
[null,"Proposed tariff","Existing tariff","PropTar\nFixed","PropTar\nPkBlk1","PropTar\nPkBlk2","PropTar\nPkBlk3","PropTar\nPkBlk4","PropTar\nOPkBlk1","PropTar\nOPkBlk2","PropTar\nOPkBlk3","PropTar\nOPkBlk4","PropTar\nDemBlk1","PropTar\nDemBlk2","PropTar\nDemBlk3","PropTar\nDemBlk4",null,"ExistTar\nFixed","ExistTar\nPkBlk1","ExistTar\nPkBlk2","ExistTar\nPkBlk3","ExistTar\nPkBlk4","ExistTar\nOPkBlk1","ExistTar\nOPkBlk2","ExistTar\nOPkBlk3","ExistTar\nOPkBlk4","ExistTar\nDemBlk1","ExistTar\nDemBlk2","ExistTar\nDemBlk3","ExistTar\nDemBlk4",null,"FcastVol\nFixed","FcastVol\nPkBlk1","FcastVol\nPkBlk2","FcastVol\nPkBlk3","FcastVol\nPkBlk4","FcastVol\nOPkBlk1","FcastVol\nOPkBlk2","FcastVol\nOPkBlk3","FcastVol\nOPkBlk4","FcastVol\nDemBlk1","FcastVol\nDemBlk2","FcastVol\nDemBlk3","FcastVol\nDemBlk4",null,"PropRev\nFixed","PropRev\nPkBlk1","PropRev\nPkBlk2","PropRev\nPkBlk3","PropRev\nPkBlk4","PropRev\nOPkBlk1","PropRev\nOPkBlk2","PropRev\nOPkBlk3","PropRev\nOPkBlk4","PropRev\nDemBlk1","PropRev\nDemBlk2","PropRev\nDemBlk3","PropRev\nDemBlk4","PropRev\nTotal",null,"ExistRev\nFixed","ExistRev\nPkBlk1","ExistRev\nPkBlk2","ExistRev\nPkBlk3","ExistRev\nPkBlk4","ExistRev\nOPkBlk1","ExistRev\nOPkBlk2","ExistRev\nOPkBlk3","ExistRev\nOPkBlk4","ExistRev\nDemBlk1","ExistRev\nDemBlk2","ExistRev\nDemBlk3","ExistRev\nDemBlk4","ExistRev\nTotal"]
[null,"Low voltage small 1 rate","Low voltage small 1 rate",10.95,5.54,0,0,5.54,0,0,0,0,0,0,0,0,null,{"$f":"Est2020DistRev!D6","v":7.85},{"$f":"Est2020DistRev!E6","v":7.44},{"$f":"Est2020DistRev!F6","v":0},{"$f":"Est2020DistRev!G6","v":0},{"$f":"Est2020DistRev!H6","v":7.44},{"$f":"Est2020DistRev!I6","v":0},{"$f":"Est2020DistRev!J6","v":0},{"$f":"Est2020DistRev!K6","v":0},{"$f":"Est2020DistRev!L6","v":0},{"$f":"Est2020DistRev!M6","v":0},{"$f":"Est2020DistRev!N6","v":0},{"$f":"Est2020DistRev!O6","v":0},{"$f":"Est2020DistRev!P6","v":0},null,105535115.09653191,575188203.86129987,null,null,643558420.98122382,null,null,0,null,0,0,null,null,null,{"$f":"D6/100*AF6","v":11556095.103070242},{"$f":"E6/100*AG6","v":31865426.493916012},0,0,35653136.522359796,0,0,0,0,{"$f":"M6/100*AO6","v":0},{"$f":"N6/100*AP6","v":0},0,0,{"$f":"SUM(AT6:BF6)","v":79074658.119346052},null,{"$f":"R6/100*AF6","v":8284506.5350777553},{"$f":"S6/100*AG6","v":42794002.367280714},0,0,47880746.52100306,0,0,0,0,{"$f":"AA6/100*AO6","v":0},{"$f":"AB6/100*AP6","v":0},0,0,{"$f":"SUM(BI6:BU6)","v":98959255.42336154}]
[null,"Winter economy tariff","Winter economy tariff",10.95,5.57,0,0,5.57,1.86,0,0,0,0,0,0,0,null,{"$f":"Est2020DistRev!D7","v":10.49},{"$f":"Est2020DistRev!E7","v":7.16},{"$f":"Est2020DistRev!F7","v":0},{"$f":"Est2020DistRev!G7","v":0},{"$f":"Est2020DistRev!H7","v":7.16},{"$f":"Est2020DistRev!I7","v":2.39},{"$f":"Est2020DistRev!J7","v":0},{"$f":"Est2020DistRev!K7","v":0},{"$f":"Est2020DistRev!L7","v":0},{"$f":"Est2020DistRev!M7","v":0},{"$f":"Est2020DistRev!N7","v":0},{"$f":"Est2020DistRev!O7","v":0},{"$f":"Est2020DistRev!P7","v":0},null,20303.023296754887,181305.44113008108,null,null,215568.44953139639,null,null,0,null,0,0,null,null,null,{"$f":"D7/100*AF7","v":2223.1810509946599},{"$f":"E7/100*AG7","v":10098.713070945516},0,0,12007.162638898779,0,0,0,0,{"$f":"M7/100*AO7","v":0},{"$f":"N7/100*AP7","v":0},{"$f":"O7/100*AQ7","v":0},{"$f":"P7/100*AR7","v":0},{"$f":"SUM(AT7:BF7)","v":24329.056760838954},null,{"$f":"R7/100*AF7","v":2129.7871438295879},{"$f":"S7/100*AG7","v":12981.469584913804},{"$f":"T7/100*AH7","v":0},{"$f":"U7/100*AI7","v":0},{"$f":"V7/100*AJ7","v":15434.700986447981},{"$f":"W7/100*AK7","v":0},{"$f":"X7/100*AL7","v":0},{"$f":"Y7/100*AM7","v":0},{"$f":"Z7/100*AN7","v":0},{"$f":"AA7/100*AO7","v":0},{"$f":"AB7/100*AP7","v":0},{"$f":"AC7/100*AQ7","v":0},{"$f":"AD7/100*AR7","v":0},{"$f":"SUM(BI7:BU7)","v":30545.957715191373}]
[null,"Low voltage small 2 rate","Low voltage small 2 rate",15.92,0,0,8.85,0,0,8.85,1.8,0,0,0,0,0,null,{"$f":"Est2020DistRev!D8","v":15.93},{"$f":"Est2020DistRev!E8","v":0},{"$f":"Est2020DistRev!F8","v":0},{"$f":"Est2020DistRev!G8","v":11.24},{"$f":"Est2020DistRev!H8","v":0},{"$f":"Est2020DistRev!I8","v":0},{"$f":"Est2020DistRev!J8","v":11.24},{"$f":"Est2020DistRev!K8","v":2.29},{"$f":"Est2020DistRev!L8","v":0},{"$f":"Est2020DistRev!M8","v":0},{"$f":"Est2020DistRev!N8","v":0},{"$f":"Est2020DistRev!O8","v":0},{"$f":"Est2020DistRev!P8","v":0},null,742249.26611019217,null,null,2499563.8889361224,null,null,2827981.9731418081,6999544.0116869658,null,0,0,null,null,null,118166.08316474259,0,0,221211.40417084683,0,0,250276.40462305001,125991.7922103654,0,0,0,0,0,715645.6841690049,null,118240.30809135361,0,0,280950.98111642018,0,0,317865.17378113925,160289.55786763152,0,0,0,0,0,877346.02085654461]
[null,"Dedicated circuit","Dedicated circuit",0,0,0,0,0,0,0,1.73,0,0,0,0,0,null,{"$f":"Est2020DistRev!D9","v":0},{"$f":"Est2020DistRev!E9","v":0},{"$f":"Est2020DistRev!F9","v":0},{"$f":"Est2020DistRev!G9","v":0},{"$f":"Est2020DistRev!H9","v":0},{"$f":"Est2020DistRev!I9","v":0},{"$f":"Est2020DistRev!J9","v":0},{"$f":"Est2020DistRev!K9","v":2.23},{"$f":"Est2020DistRev!L9","v":0},{"$f":"Est2020DistRev!M9","v":0},{"$f":"Est2020DistRev!N9","v":0},{"$f":"Est2020DistRev!O9","v":0},{"$f":"Est2020DistRev!P9","v":0},null,10497943.41526081,null,null,null,null,null,null,39206702.567553177,null,0,0,null,null,null,0,0,0,0,0,0,0,678275.95441866992,0,0,0,0,0,678275.95441866992,null,0,0,0,0,0,0,0,874309.46725643589,0,0,0,0,0,874309.46725643589]
[null,"Low voltage medium 1 rate","Low voltage medium 1 rate",16.43,6.81,0,0,6.81,0,0,0,0,0,0,0,0,null,{"$f":"Est2020DistRev!D10","v":13.23},{"$f":"Est2020DistRev!E10","v":8.8800000000000008},{"$f":"Est2020DistRev!F10","v":0},{"$f":"Est2020DistRev!G10","v":0},{"$f":"Est2020DistRev!H10","v":8.8800000000000008},{"$f":"Est2020DistRev!I10","v":0},{"$f":"Est2020DistRev!J10","v":0},{"$f":"Est2020DistRev!K10","v":0},{"$f":"Est2020DistRev!L10","v":0},{"$f":"Est2020DistRev!M10","v":0},{"$f":"Est2020DistRev!N10","v":0},{"$f":"Est2020DistRev!O10","v":0},{"$f":"Est2020DistRev!P10","v":0},null,6562937.8381345402,93520651.506448358,null,null,97984486.300557613,null,null,0,null,0,0,null,null,null,1078290.6868055051,6368756.3675891329,0,0,6672743.5170679726,0,0,0,0,0,0,0,0,14119790.571462611,null,868276.67598519963,8304633.8537726142,0,0,8701022.3834895156,0,0,0,0,0,0,0,0,17873932.913247332]
[null,"Low voltage medium 2 rate 5 day","Low voltage medium 2 rate 5 day",25.33,0,0,9.34,0,0,9.34,1.74,0,0,0,0,0,null,{"$f":"Est2020DistRev!D11","v":25.34},{"$f":"Est2020DistRev!E11","v":0},{"$f":"Est2020DistRev!F11","v":0},{"$f":"Est2020DistRev!G11","v":13.8},{"$f":"Est2020DistRev!H11","v":0},{"$f":"Est2020DistRev!I11","v":0},{"$f":"Est2020DistRev!J11","v":10.34},{"$f":"Est2020DistRev!K11","v":2.58},{"$f":"Est2020DistRev!L11","v":0},{"$f":"Est2020DistRev!M11","v":0},{"$f":"Est2020DistRev!N11","v":0},{"$f":"Est2020DistRev!O11","v":0},{"$f":"Est2020DistRev!P11","v":0},null,1691005.1507493043,null,null,25877867.250615567,null,null,25255618.886176422,32072694.77859287,null,0,0,null,null,null,428331.60468479875,0,0,2416992.801207494,0,0,2358874.8039688775,558064.88914751587,0,0,0,0,0,5762264.0990086868,null,428500.70519987372,0,0,3571145.6805849485,0,0,2611430.992830642,827475.52528769604,0,0,0,0,0,7438552.9039031602]
[null,"Low voltage medium 2 rate 7 day","Low voltage medium 2 rate 7 day",26.95,0,0,7.72,0,0,7.72,1.41,0,0,0,0,0,null,{"$f":"Est2020DistRev!D12","v":26.96},{"$f":"Est2020DistRev!E12","v":0},{"$f":"Est2020DistRev!F12","v":0},{"$f":"Est2020DistRev!G12","v":11.38},{"$f":"Est2020DistRev!H12","v":0},{"$f":"Est2020DistRev!I12","v":0},{"$f":"Est2020DistRev!J12","v":8.81},{"$f":"Est2020DistRev!K12","v":2.08},{"$f":"Est2020DistRev!L12","v":0},{"$f":"Est2020DistRev!M12","v":0},{"$f":"Est2020DistRev!N12","v":0},{"$f":"Est2020DistRev!O12","v":0},{"$f":"Est2020DistRev!P12","v":0},null,867755.01395936578,null,null,11704182.595948623,null,null,12021985.872137187,6431319.9337531235,null,0,0,null,null,null,233859.97626204908,0,0,903562.89640723367,0,0,928097.30932899076,90681.611065919045,0,0,0,0,0,2156201.7930641929,null,233946.75176344503,0,0,1331935.9794189534,0,0,1059136.9553352862,133771.45462206495,0,0,0,0,0,2758791.1411397494]
[null,"Unmetered supplies","Unmetered supplies",0,0,0,6.39,0,0,6.39,1.38,0,0,0,0,0,null,{"$f":"Est2020DistRev!D13","v":0},{"$f":"Est2020DistRev!E13","v":0},{"$f":"Est2020DistRev!F13","v":0},{"$f":"Est2020DistRev!G13","v":8.1300000000000008},{"$f":"Est2020DistRev!H13","v":0},{"$f":"Est2020DistRev!I13","v":0},{"$f":"Est2020DistRev!J13","v":8.1300000000000008},{"$f":"Est2020DistRev!K13","v":1.76},{"$f":"Est2020DistRev!L13","v":0},{"$f":"Est2020DistRev!M13","v":0},{"$f":"Est2020DistRev!N13","v":0},{"$f":"Est2020DistRev!O13","v":0},{"$f":"Est2020DistRev!P13","v":0},null,1822729.9999999998,null,null,7902465.9846767429,null,null,9120125.6545493584,31525884.811143644,null,0,0,null,null,null,0,0,0,504967.57642084383,0,0,582776.02932570397,435057.2103937823,0,0,0,0,0,1522800.8161403299,null,0,0,0,642470.48455421929,0,0,741466.21571486292,554855.57267612813,0,0,0,0,0,1938792.2729452103]
[null,"Low voltage large 1 rate","Low voltage large 1 rate",16.43,5.4,0,0,5.4,0,0,0,0,0,0,0,0,null,{"$f":"Est2020DistRev!D14","v":15.49},{"$f":"Est2020DistRev!E14","v":6.91},{"$f":"Est2020DistRev!F14","v":0},{"$f":"Est2020DistRev!G14","v":0},{"$f":"Est2020DistRev!H14","v":6.91},{"$f":"Est2020DistRev!I14","v":0},{"$f":"Est2020DistRev!J14","v":0},{"$f":"Est2020DistRev!K14","v":0},{"$f":"Est2020DistRev!L14","v":0},{"$f":"Est2020DistRev!M14","v":0},{"$f":"Est2020DistRev!N14","v":0},{"$f":"Est2020DistRev!O14","v":0},{"$f":"Est2020DistRev!P14","v":0},null,1081.0901336703062,352696.68309867498,null,null,338387.62591484992,null,null,0,null,0,0,null,null,null,177.6231089620313,19045.620887328452,0,0,18272.931799401897,0,0,0,0,0,0,0,0,37496.175795692383,null,167.46086170553045,24371.34080211844,0,0,23382.584950716129,0,0,0,0,0,0,0,0,47921.386614540097]
[null,"Low voltage large 2 rate","Low voltage large 2 rate",22.34,0,0,8.91,0,0,8.91,1.68,0,0,0,0,0,null,{"$f":"Est2020DistRev!D15","v":22.35},{"$f":"Est2020DistRev!E15","v":0},{"$f":"Est2020DistRev!F15","v":0},{"$f":"Est2020DistRev!G15","v":12.56},{"$f":"Est2020DistRev!H15","v":0},{"$f":"Est2020DistRev!I15","v":0},{"$f":"Est2020DistRev!J15","v":9.98},{"$f":"Est2020DistRev!K15","v":2.38},{"$f":"Est2020DistRev!L15","v":0},{"$f":"Est2020DistRev!M15","v":0},{"$f":"Est2020DistRev!N15","v":0},{"$f":"Est2020DistRev!O15","v":0},{"$f":"Est2020DistRev!P15","v":0},null,2882.9070231208161,null,null,355464.96118598658,null,null,291682.21993439464,434712.68038526608,null,0,0,null,null,null,644.04142896519033,0,0,31671.928041671403,0,0,25988.885796154562,7303.1730304724697,0,0,0,0,0,65608.028297263634,null,644.32971966750245,0,0,44646.39912495992,0,0,29109.885549452585,10346.161793169333,0,0,0,0,0,84746.776187249343]
[null,"Low voltage KW time of use","Low voltage KW time of use",0,0,0,7.26,0,0,7.26,1.69,0,0,34.79,null,null,null,{"$f":"Est2020DistRev!D16","v":0},{"$f":"Est2020DistRev!E16","v":0},{"$f":"Est2020DistRev!F16","v":0},{"$f":"Est2020DistRev!G16","v":11.56},{"$f":"Est2020DistRev!H16","v":0},{"$f":"Est2020DistRev!I16","v":0},{"$f":"Est2020DistRev!J16","v":6.78},{"$f":"Est2020DistRev!K16","v":2.69},{"$f":"Est2020DistRev!L16","v":0},{"$f":"Est2020DistRev!M16","v":0},{"$f":"Est2020DistRev!N16","v":55.35},{"$f":"Est2020DistRev!O16","v":0},{"$f":"Est2020DistRev!P16","v":0},null,33320.530094659756,null,null,1475141.7634062562,null,null,1370460.8178543835,2593202.4501544498,null,0,392057.72600000002,null,null,null,0,0,0,107095.2920232942,0,0,99495.455376228245,43825.121407610197,0,0,136396.88287540001,0,0,386812.75168253266,null,0,0,0,170526.38784976324,0,0,92917.243450527196,69757.1459091547,0,0,217003.95134100001,0,0,550204.72855044517]
[null,"Low voltage KW time of use - HOT","Low voltage KW time of use - HOT",0,0,0,5.91,0,0,5.91,1.34,0,0,52.1,null,null,null,{"$f":"Est2020DistRev!D17","v":0},{"$f":"Est2020DistRev!E17","v":0},{"$f":"Est2020DistRev!F17","v":0},{"$f":"Est2020DistRev!G17","v":8.07},{"$f":"Est2020DistRev!H17","v":0},{"$f":"Est2020DistRev!I17","v":0},{"$f":"Est2020DistRev!J17","v":6.2},{"$f":"Est2020DistRev!K17","v":1.83},{"$f":"Est2020DistRev!L17","v":0},{"$f":"Est2020DistRev!M17","v":0},{"$f":"Est2020DistRev!N17","v":71.040000000000006},{"$f":"Est2020DistRev!O17","v":0},{"$f":"Est2020DistRev!P17","v":0},null,2716.3475620646541,null,null,19807.75144821703,null,null,30069.462307987305,52684.780336454045,null,0,7608.503999999999,null,null,null,0,0,0,1170.6381105896264,0,0,1777.1052224020498,705.97605650848425,0,0,3964.0305839999996,0,0,7617.7499735001602,null,0,0,0,1598.4855418711145,0,0,1864.306663095213,964.13148015710908,0,0,5405.0812415999999,0,0,9832.0049267234353]
[null,"Low voltage large KVA time of use","Low voltage large KVA time of use",0,0,0,1.24,0,0,1.24,1.04,0,12.47,18.64,0,0,null,{"$f":"Est2020DistRev!D18","v":0},{"$f":"Est2020DistRev!E18","v":0},{"$f":"Est2020DistRev!F18","v":0},{"$f":"Est2020DistRev!G18","v":1.63},{"$f":"Est2020DistRev!H18","v":0},{"$f":"Est2020DistRev!I18","v":0},{"$f":"Est2020DistRev!J18","v":1.38},{"$f":"Est2020DistRev!K18","v":1.37},{"$f":"Est2020DistRev!L18","v":0},{"$f":"Est2020DistRev!M18","v":16.48},{"$f":"Est2020DistRev!N18","v":24.64},{"$f":"Est2020DistRev!O18","v":0},{"$f":"Est2020DistRev!P18","v":0},null,541277.52420075017,null,null,266174636.98008817,null,null,250479794.64188558,611889749.45024109,null,159541608.1137,56665442.457500003,null,null,null,0,0,0,3300565.4985530931,0,0,3105949.453559381,6363653.3942825068,0,19894838.531778391,10562438.474078001,0,0,43227445.352251373,null,0,0,0,4338646.5827754373,0,0,3456621.1660580211,8382889.5674683033,0,26292457.017137762,13962365.021528002,0,0,56432979.354967535]
[null,"High voltage KVA time of use","High voltage KVA time of use",0,0,0,0.74,0,0,0.74,0.64,0,7.49,10.29,0,0,null,{"$f":"Est2020DistRev!D19","v":0},{"$f":"Est2020DistRev!E19","v":0},{"$f":"Est2020DistRev!F19","v":0},{"$f":"Est2020DistRev!G19","v":0.98},{"$f":"Est2020DistRev!H19","v":0},{"$f":"Est2020DistRev!I19","v":0},{"$f":"Est2020DistRev!J19","v":0.85},{"$f":"Est2020DistRev!K19","v":0.85},{"$f":"Est2020DistRev!L19","v":0},{"$f":"Est2020DistRev!M19","v":9.9700000000000006},{"$f":"Est2020DistRev!N19","v":13.7},{"$f":"Est2020DistRev!O19","v":0},{"$f":"Est2020DistRev!P19","v":0},null,18018,null,null,105000326.05011946,null,null,105357041.06071436,326268953.17554247,null,51478074.622400001,19753789.0211,null,null,null,0,0,0,777002.412770884,0,0,779642.10384928633,2088121.3003234719,0,3855707.7892177603,2032664.8902711899,0,0,9533138.4964325931,null,0,0,0,1029003.1952911706,0,0,895534.84901607211,2773286.1019921112,0,5132364.0398532804,2706269.0958906994,0,0,12536457.282043332]
[null,"Subtransmission KVA time of use","Subtransmission KVA time of use",0,0,0,0.43,0,0,0.43,0.29000000000000004,0,0.76,1.1000000000000001,0,0,null,{"$f":"Est2020DistRev!D20","v":0},{"$f":"Est2020DistRev!E20","v":0},{"$f":"Est2020DistRev!F20","v":0},{"$f":"Est2020DistRev!G20","v":0.56000000000000005},{"$f":"Est2020DistRev!H20","v":0},{"$f":"Est2020DistRev!I20","v":0},{"$f":"Est2020DistRev!J20","v":0.43},{"$f":"Est2020DistRev!K20","v":0.37},{"$f":"Est2020DistRev!L20","v":0},{"$f":"Est2020DistRev!M20","v":0.98},{"$f":"Est2020DistRev!N20","v":1.43},{"$f":"Est2020DistRev!O20","v":0},{"$f":"Est2020DistRev!P20","v":0},null,182,null,null,3670916.3505270658,null,null,3584660.5425760043,5707425.9826134173,null,2018875.2197,704348.9277,null,null,null,0,0,0,15784.940307266383,0,0,15414.040333076819,16551.535349578913,0,15343.45166972,7747.8382047000005,0,0,70841.805864342125,null,0,0,0,20557.13156295157,0,0,15414.040333076819,21117.476135669644,0,19784.977153060001,10072.18966611,0,0,86945.814850868031]
[null,"TOD","TOD",10.95,0,3.37,10.62,0,0,10.62,2.79,3.37,0,0,0,0,null,{"$f":"Est2020DistRev!D21","v":7.47},{"$f":"Est2020DistRev!E21","v":0},{"$f":"Est2020DistRev!F21","v":4.5},{"$f":"Est2020DistRev!G21","v":14.17},{"$f":"Est2020DistRev!H21","v":0},{"$f":"Est2020DistRev!I21","v":0},{"$f":"Est2020DistRev!J21","v":14.17},{"$f":"Est2020DistRev!K21","v":3.73},{"$f":"Est2020DistRev!L21","v":4.5},{"$f":"Est2020DistRev!M21","v":0},{"$f":"Est2020DistRev!N21","v":0},{"$f":"Est2020DistRev!O21","v":0},{"$f":"Est2020DistRev!P21","v":0},null,7805872.2721829861,null,7967927.95541621,13923627.86509141,null,null,18072449.615387656,54011897.043529466,10342130.507116426,0,0,null,null,null,854743.01380403689,0,268519.17209752626,1478689.2792727076,0,0,1919294.1491541688,1506931.927514472,348529.79808982357,0,0,0,0,6376707.3399327351,null,583098.65873206907,0,358556.75799372944,1972978.0684834525,0,0,2560866.1105004307,2014643.7597236491,465395.87282023916,0,0,0,0,7955539.2282535704]
[null,"TOD9","TOD9",10.95,0,3.86,10.69,0,0,10.69,3.42,3.86,0,0,0,0,null,{"$f":"Est2020DistRev!D22","v":8.16},{"$f":"Est2020DistRev!E22","v":0},{"$f":"Est2020DistRev!F22","v":5.13},{"$f":"Est2020DistRev!G22","v":14.2},{"$f":"Est2020DistRev!H22","v":0},{"$f":"Est2020DistRev!I22","v":0},{"$f":"Est2020DistRev!J22","v":14.2},{"$f":"Est2020DistRev!K22","v":4.55},{"$f":"Est2020DistRev!L22","v":5.13},{"$f":"Est2020DistRev!M22","v":0},{"$f":"Est2020DistRev!N22","v":0},{"$f":"Est2020DistRev!O22","v":0},{"$f":"Est2020DistRev!P22","v":0},null,647318.9139388788,null,493655.1561192635,732234.77661798592,null,null,1128201.9245410122,5034512.0861314908,760606.72748394939,null,null,null,null,null,70881.421076307219,0,19055.089026203568,78275.897620462696,0,0,120604.7857334342,172180.31334569698,29359.419680880445,0,0,0,0,490356.92648298509,null,52821.223377412512,0,25324.509508918218,103977.338279754,0,0,160204.67328482372,229070.29991898281,39019.125119926604,0,0,0,0,610417.16948981793]
[null,"TOU","TOU",0,0,0,6.92,0,0,6.92,2.0299999999999998,0,0,30.08,null,0,null,{"$f":"Est2020DistRev!D23","v":0},{"$f":"Est2020DistRev!E23","v":0},{"$f":"Est2020DistRev!F23","v":0},{"$f":"Est2020DistRev!G23","v":11.15},{"$f":"Est2020DistRev!H23","v":0},{"$f":"Est2020DistRev!I23","v":0},{"$f":"Est2020DistRev!J23","v":6.78},{"$f":"Est2020DistRev!K23","v":3.27},{"$f":"Est2020DistRev!L23","v":0},{"$f":"Est2020DistRev!M23","v":0},{"$f":"Est2020DistRev!N23","v":48.43},{"$f":"Est2020DistRev!O23","v":0},{"$f":"Est2020DistRev!P23","v":0},null,145958.40900160742,null,null,2992497.1553457095,null,null,3490165.6408265438,5333993.1667220592,null,0,729616.78200000001,null,null,null,0,0,0,207080.8031499231,0,0,241519.46234519684,108280.0612844578,0,0,219468.72802559996,0,0,776349.05480517773,null,0,0,0,333663.43282104662,0,0,236633.23044803966,174421.57655181133,0,0,353353.40752260003,0,0,1098071.6473434977]
[null,"TODFLEX","TODFLEX",10.95,0,4.05,10.99,0,0,10.99,3.43,4.05,0,0,0,0,null,{"$f":"Est2020DistRev!D24","v":8.2799999999999994},{"$f":"Est2020DistRev!E24","v":0},{"$f":"Est2020DistRev!F24","v":5.37},{"$f":"Est2020DistRev!G24","v":14.56},{"$f":"Est2020DistRev!H24","v":0},{"$f":"Est2020DistRev!I24","v":0},{"$f":"Est2020DistRev!J24","v":14.56},{"$f":"Est2020DistRev!K24","v":4.55},{"$f":"Est2020DistRev!L24","v":5.37},{"$f":"Est2020DistRev!M24","v":0},{"$f":"Est2020DistRev!N24","v":0},{"$f":"Est2020DistRev!O24","v":0},{"$f":"Est2020DistRev!P24","v":0},null,344785.57580525189,null,967908.70972557599,472439.17656686797,null,null,562268.62769869901,1658072.4170597466,1151946.5974642553,null,null,null,null,null,37754.020550675079,0,39200.302743885826,51921.065504698789,0,0,61793.322184087017,56871.883905149312,46653.837197302339,0,0,0,0,294194.43208579835,null,28548.245676674855,0,51976.697712263427,68787.144108135981,0,0,81866.312192930578,75442.294976218473,61859.532283830507,0,0,0,0,368480.22695005382]
[null,"Low Voltage KW 1 rate","Low Voltage KW 1 rate",0,2.63,0,2.63,0,0,2.63,0,0,0,0,25.42,10.029999999999999,null,{"$f":"Est2020DistRev!D25","v":0},{"$f":"Est2020DistRev!E25","v":0},{"$f":"Est2020DistRev!F25","v":0},{"$f":"Est2020DistRev!G25","v":3.08},{"$f":"Est2020DistRev!H25","v":0},{"$f":"Est2020DistRev!I25","v":0},{"$f":"Est2020DistRev!J25","v":3.08},{"$f":"Est2020DistRev!K25","v":0},{"$f":"Est2020DistRev!L25","v":0},{"$f":"Est2020DistRev!M25","v":0},{"$f":"Est2020DistRev!N25","v":0},{"$f":"Est2020DistRev!O25","v":29.68},{"$f":"Est2020DistRev!P25","v":11.72},null,232295.85213404242,null,0,1080042.5065605589,null,null,1337152.6557526211,0,0,null,null,184376.2935,168329.12365077398,null,0,0,0,28405.1179225427,0,0,35167.114846293938,0,0,0,0,46868.453807700003,16883.411102172631,127324.09767870927,null,0,0,0,33265.309202065218,0,0,41184.301797180735,0,0,0,0,54722.883910800003,19728.173291870713,148900.66820191668]
[null,"Low voltage medium KW time of use (opt-in)","Low voltage medium KW time of use (opt-in)",0,2.88,0,2.88,0,0,2.88,0,0,0,0,32.619999999999997,21.74,null,{"$f":"Est2020DistRev!D26","v":0},{"$f":"Est2020DistRev!E26","v":0},{"$f":"Est2020DistRev!F26","v":0},{"$f":"Est2020DistRev!G26","v":3.85},{"$f":"Est2020DistRev!H26","v":0},{"$f":"Est2020DistRev!I26","v":0},{"$f":"Est2020DistRev!J26","v":3.85},{"$f":"Est2020DistRev!K26","v":0},{"$f":"Est2020DistRev!L26","v":0},{"$f":"Est2020DistRev!M26","v":0},{"$f":"Est2020DistRev!N26","v":0},{"$f":"Est2020DistRev!O26","v":43.59},{"$f":"Est2020DistRev!P26","v":29.05},null,0,null,0,0,null,null,0,0,0,null,null,0,0,null,0,0,0,0,0,0,0,0,0,0,0,0,0,0,null,0,0,0,0,0,0,0,0,0,0,0,0,0,0]
[null,"Low voltage medium KW 1 rate (mandatory)","Low voltage medium KW 1 rate (mandatory)",0,2.88,0,2.88,0,0,2.88,0,0,0,0,32.619999999999997,21.74,null,{"$f":"Est2020DistRev!D27","v":0},{"$f":"Est2020DistRev!E27","v":0},{"$f":"Est2020DistRev!F27","v":0},{"$f":"Est2020DistRev!G27","v":3.85},{"$f":"Est2020DistRev!H27","v":0},{"$f":"Est2020DistRev!I27","v":0},{"$f":"Est2020DistRev!J27","v":3.85},{"$f":"Est2020DistRev!K27","v":0},{"$f":"Est2020DistRev!L27","v":0},{"$f":"Est2020DistRev!M27","v":0},{"$f":"Est2020DistRev!N27","v":0},{"$f":"Est2020DistRev!O27","v":43.59},{"$f":"Est2020DistRev!P27","v":29.05},null,1304571.1891409182,null,0,152577673.09952593,null,null,146200098.8108809,0,0,null,null,20233521.012785185,18174103.867105875,null,0,0,0,4394236.9852663465,0,0,4210562.8457533699,0,0,0,0,6600174.5543705272,3951050.1807088167,19156024.566099063,null,0,0,0,5874240.4143317482,0,0,5628703.8042189144,0,0,0,0,8819791.8094730619,5279577.1733942563,25602313.201417983]
[null,null,null,null,null,null,null,null,null,null,null,null,null,null,null,null,null,{"$f":"Est2020DistRev!D28","v":0},{"$f":"Est2020DistRev!E28","v":0},{"$f":"Est2020DistRev!F28","v":0},{"$f":"Est2020DistRev!G28","v":0},{"$f":"Est2020DistRev!H28","v":0},{"$f":"Est2020DistRev!I28","v":0},{"$f":"Est2020DistRev!J28","v":0},{"$f":"Est2020DistRev!K28","v":0},{"$f":"Est2020DistRev!L28","v":0},{"$f":"Est2020DistRev!M28","v":0},{"$f":"Est2020DistRev!N28","v":0},{"$f":"Est2020DistRev!O28","v":0},{"$f":"Est2020DistRev!P28","v":0},null,{"$f":"Est2020DistRev!R28/2","v":0},{"$f":"Est2020DistRev!S28/2","v":0},{"$f":"Est2020DistRev!T28/2","v":0},{"$f":"Est2020DistRev!U28/2","v":0},{"$f":"Est2020DistRev!V28/2","v":0},{"$f":"Est2020DistRev!W28/2","v":0},{"$f":"Est2020DistRev!X28/2","v":0},{"$f":"Est2020DistRev!Y28/2","v":0},{"$f":"Est2020DistRev!Z28/2","v":0},{"$f":"Est2020DistRev!AA28/2","v":0},{"$f":"Est2020DistRev!AB28/2","v":0},{"$f":"Est2020DistRev!AC28/2","v":0},{"$f":"Est2020DistRev!AD28/2","v":0},null,0,0,0,0,0,0,0,0,0,0,0,0,0,0,null,0,0,0,0,0,0,0,0,0,0,0,0,0,0]
[null,null,null,null,null,null,null,null,null,null,null,null,null,null,null,null,null,{"$f":"Est2020DistRev!D29","v":0},{"$f":"Est2020DistRev!E29","v":0},{"$f":"Est2020DistRev!F29","v":0},{"$f":"Est2020DistRev!G29","v":0},{"$f":"Est2020DistRev!H29","v":0},{"$f":"Est2020DistRev!I29","v":0},{"$f":"Est2020DistRev!J29","v":0},{"$f":"Est2020DistRev!K29","v":0},{"$f":"Est2020DistRev!L29","v":0},{"$f":"Est2020DistRev!M29","v":0},{"$f":"Est2020DistRev!N29","v":0},{"$f":"Est2020DistRev!O29","v":0},{"$f":"Est2020DistRev!P29","v":0},null,{"$f":"Est2020DistRev!R29/2","v":0},{"$f":"Est2020DistRev!S29/2","v":0},{"$f":"Est2020DistRev!T29/2","v":0},{"$f":"Est2020DistRev!U29/2","v":0},{"$f":"Est2020DistRev!V29/2","v":0},{"$f":"Est2020DistRev!W29/2","v":0},{"$f":"Est2020DistRev!X29/2","v":0},{"$f":"Est2020DistRev!Y29/2","v":0},{"$f":"Est2020DistRev!Z29/2","v":0},{"$f":"Est2020DistRev!AA29/2","v":0},{"$f":"Est2020DistRev!AB29/2","v":0},{"$f":"Est2020DistRev!AC29/2","v":0},{"$f":"Est2020DistRev!AD29/2","v":0},null,0,0,0,0,0,0,0,0,0,0,0,0,0,0,null,0,0,0,0,0,0,0,0,0,0,0,0,0,0]
[null,null,null,null,null,null,null,null,null,null,null,null,null,null,null,null,null,{"$f":"Est2020DistRev!D30","v":0},{"$f":"Est2020DistRev!E30","v":0},{"$f":"Est2020DistRev!F30","v":0},{"$f":"Est2020DistRev!G30","v":0},{"$f":"Est2020DistRev!H30","v":0},{"$f":"Est2020DistRev!I30","v":0},{"$f":"Est2020DistRev!J30","v":0},{"$f":"Est2020DistRev!K30","v":0},{"$f":"Est2020DistRev!L30","v":0},{"$f":"Est2020DistRev!M30","v":0},{"$f":"Est2020DistRev!N30","v":0},{"$f":"Est2020DistRev!O30","v":0},{"$f":"Est2020DistRev!P30","v":0},{"$f":"Est2020DistRev!Q30","v":0},{"$f":"Est2020DistRev!R30/2","v":0},{"$f":"Est2020DistRev!S30/2","v":0},{"$f":"Est2020DistRev!T30/2","v":0},{"$f":"Est2020DistRev!U30/2","v":0},{"$f":"Est2020DistRev!V30/2","v":0},{"$f":"Est2020DistRev!W30/2","v":0},{"$f":"Est2020DistRev!X30/2","v":0},{"$f":"Est2020DistRev!Y30/2","v":0},{"$f":"Est2020DistRev!Z30/2","v":0},{"$f":"Est2020DistRev!AA30/2","v":0},{"$f":"Est2020DistRev!AB30/2","v":0},{"$f":"Est2020DistRev!AC30/2","v":0},{"$f":"Est2020DistRev!AD30/2","v":0},null,0,0,0,0,0,0,0,0,0,0,0,0,0,0,null,0,0,0,0,0,0,0,0,0,0,0,0,0,0]
[null,null,null,null,null,null,null,null,null,null,null,null,null,null,null,null,null,{"$f":"Est2020DistRev!D31","v":0},{"$f":"Est2020DistRev!E31","v":0},{"$f":"Est2020DistRev!F31","v":0},{"$f":"Est2020DistRev!G31","v":0},{"$f":"Est2020DistRev!H31","v":0},{"$f":"Est2020DistRev!I31","v":0},{"$f":"Est2020DistRev!J31","v":0},{"$f":"Est2020DistRev!K31","v":0},{"$f":"Est2020DistRev!L31","v":0},{"$f":"Est2020DistRev!M31","v":0},{"$f":"Est2020DistRev!N31","v":0},{"$f":"Est2020DistRev!O31","v":0},{"$f":"Est2020DistRev!P31","v":0},{"$f":"Est2020DistRev!Q31","v":0},{"$f":"Est2020DistRev!R31/2","v":0},{"$f":"Est2020DistRev!S31/2","v":0},{"$f":"Est2020DistRev!T31/2","v":0},{"$f":"Est2020DistRev!U31/2","v":0},{"$f":"Est2020DistRev!V31/2","v":0},{"$f":"Est2020DistRev!W31/2","v":0},{"$f":"Est2020DistRev!X31/2","v":0},{"$f":"Est2020DistRev!Y31/2","v":0},{"$f":"Est2020DistRev!Z31/2","v":0},{"$f":"Est2020DistRev!AA31/2","v":0},{"$f":"Est2020DistRev!AB31/2","v":0},{"$f":"Est2020DistRev!AC31/2","v":0},{"$f":"Est2020DistRev!AD31/2","v":0},null,0,0,0,0,0,0,0,0,0,0,0,0,0,0,null,0,0,0,0,0,0,0,0,0,0,0,0,0,0]
[null,null,null,null,null,null,null,null,null,null,null,null,null,null,null,null,null,{"$f":"Est2020DistRev!D32","v":0},{"$f":"Est2020DistRev!E32","v":0},{"$f":"Est2020DistRev!F32","v":0},{"$f":"Est2020DistRev!G32","v":0},{"$f":"Est2020DistRev!H32","v":0},{"$f":"Est2020DistRev!I32","v":0},{"$f":"Est2020DistRev!J32","v":0},{"$f":"Est2020DistRev!K32","v":0},{"$f":"Est2020DistRev!L32","v":0},{"$f":"Est2020DistRev!M32","v":0},{"$f":"Est2020DistRev!N32","v":0},{"$f":"Est2020DistRev!O32","v":0},{"$f":"Est2020DistRev!P32","v":0},{"$f":"Est2020DistRev!Q32","v":0},{"$f":"Est2020DistRev!R32/2","v":0},{"$f":"Est2020DistRev!S32/2","v":0},{"$f":"Est2020DistRev!T32/2","v":0},{"$f":"Est2020DistRev!U32/2","v":0},{"$f":"Est2020DistRev!V32/2","v":0},{"$f":"Est2020DistRev!W32/2","v":0},{"$f":"Est2020DistRev!X32/2","v":0},{"$f":"Est2020DistRev!Y32/2","v":0},{"$f":"Est2020DistRev!Z32/2","v":0},{"$f":"Est2020DistRev!AA32/2","v":0},{"$f":"Est2020DistRev!AB32/2","v":0},{"$f":"Est2020DistRev!AC32/2","v":0},{"$f":"Est2020DistRev!AD32/2","v":0},null,0,{"$f":"E32/100*AG32","v":0},0,0,0,0,0,0,0,0,0,0,0,{"$f":"SUM(AT32:BF32)","v":0},null,0,{"$f":"S32/100*AG32","v":0},{"$f":"T32/100*AH32","v":0},{"$f":"U32/100*AI32","v":0},{"$f":"V32/100*AJ32","v":0},{"$f":"W32/100*AK32","v":0},{"$f":"X32/100*AL32","v":0},{"$f":"Y32/100*AM32","v":0},{"$f":"Z32/100*AN32","v":0},0,0,0,0,{"$f":"SUM(BI32:BU32)","v":0}]
[null,null,null,null,null,null,null,null,null,null,null,null,null,null,null,null,null,{"$f":"Est2020DistRev!D33","v":0},{"$f":"Est2020DistRev!E33","v":0},{"$f":"Est2020DistRev!F33","v":0},{"$f":"Est2020DistRev!G33","v":0},{"$f":"Est2020DistRev!H33","v":0},{"$f":"Est2020DistRev!I33","v":0},{"$f":"Est2020DistRev!J33","v":0},{"$f":"Est2020DistRev!K33","v":0},{"$f":"Est2020DistRev!L33","v":0},{"$f":"Est2020DistRev!M33","v":0},{"$f":"Est2020DistRev!N33","v":0},{"$f":"Est2020DistRev!O33","v":0},{"$f":"Est2020DistRev!P33","v":0},null,{"$f":"Est2020DistRev!R33/2","v":0},{"$f":"Est2020DistRev!S33/2","v":0},{"$f":"Est2020DistRev!T33/2","v":0},{"$f":"Est2020DistRev!U33/2","v":0},{"$f":"Est2020DistRev!V33/2","v":0},{"$f":"Est2020DistRev!W33/2","v":0},{"$f":"Est2020DistRev!X33/2","v":0},{"$f":"Est2020DistRev!Y33/2","v":0},{"$f":"Est2020DistRev!Z33/2","v":0},{"$f":"Est2020DistRev!AA33/2","v":0},{"$f":"Est2020DistRev!AB33/2","v":0},{"$f":"Est2020DistRev!AC33/2","v":0},{"$f":"Est2020DistRev!AD33/2","v":0},null,0,0,0,0,0,0,0,0,0,0,0,0,0,0,null,0,0,0,0,0,0,0,0,0,0,0,0,0,0]
[null,null,null,null,null,null,null,null,null,null,null,null,null,null,null,null,null,{"$f":"Est2020DistRev!D34","v":0},{"$f":"Est2020DistRev!E34","v":0},{"$f":"Est2020DistRev!F34","v":0},{"$f":"Est2020DistRev!G34","v":0},{"$f":"Est2020DistRev!H34","v":0},{"$f":"Est2020DistRev!I34","v":0},{"$f":"Est2020DistRev!J34","v":0},{"$f":"Est2020DistRev!K34","v":0},{"$f":"Est2020DistRev!L34","v":0},{"$f":"Est2020DistRev!M34","v":0},{"$f":"Est2020DistRev!N34","v":0},{"$f":"Est2020DistRev!O34","v":0},{"$f":"Est2020DistRev!P34","v":0},null,{"$f":"Est2020DistRev!R34/2","v":0},{"$f":"Est2020DistRev!S34/2","v":0},{"$f":"Est2020DistRev!T34/2","v":0},{"$f":"Est2020DistRev!U34/2","v":0},{"$f":"Est2020DistRev!V34/2","v":0},{"$f":"Est2020DistRev!W34/2","v":0},{"$f":"Est2020DistRev!X34/2","v":0},{"$f":"Est2020DistRev!Y34/2","v":0},{"$f":"Est2020DistRev!Z34/2","v":0},{"$f":"Est2020DistRev!AA34/2","v":0},{"$f":"Est2020DistRev!AB34/2","v":0},{"$f":"Est2020DistRev!AC34/2","v":0},{"$f":"Est2020DistRev!AD34/2","v":0},null,0,0,0,0,0,0,0,0,0,0,0,0,0,0,null,0,0,0,0,0,0,0,0,0,0,0,0,0,0]
[null,null,null,null,null,null,null,null,null,null,null,null,null,null,null,null,null,{"$f":"Est2020DistRev!D35","v":0},{"$f":"Est2020DistRev!E35","v":0},{"$f":"Est2020DistRev!F35","v":0},{"$f":"Est2020DistRev!G35","v":0},{"$f":"Est2020DistRev!H35","v":0},{"$f":"Est2020DistRev!I35","v":0},{"$f":"Est2020DistRev!J35","v":0},{"$f":"Est2020DistRev!K35","v":0},{"$f":"Est2020DistRev!L35","v":0},{"$f":"Est2020DistRev!M35","v":0},{"$f":"Est2020DistRev!N35","v":0},{"$f":"Est2020DistRev!O35","v":0},{"$f":"Est2020DistRev!P35","v":0},null,{"$f":"Est2020DistRev!R35/2","v":0},{"$f":"Est2020DistRev!S35/2","v":0},{"$f":"Est2020DistRev!T35/2","v":0},{"$f":"Est2020DistRev!U35/2","v":0},{"$f":"Est2020DistRev!V35/2","v":0},{"$f":"Est2020DistRev!W35/2","v":0},{"$f":"Est2020DistRev!X35/2","v":0},{"$f":"Est2020DistRev!Y35/2","v":0},{"$f":"Est2020DistRev!Z35/2","v":0},{"$f":"Est2020DistRev!AA35/2","v":0},{"$f":"Est2020DistRev!AB35/2","v":0},{"$f":"Est2020DistRev!AC35/2","v":0},{"$f":"Est2020DistRev!AD35/2","v":0},null,0,0,0,0,0,0,0,0,{"$f":"L35/100*AN35","v":0},0,0,0,0,0,null,0,0,0,0,0,0,0,0,0,0,0,0,0,0]
[null,null,null,null,null,null,null,null,null,null,null,null,null,null,null,null,null,{"$f":"Est2020DistRev!D36","v":0},{"$f":"Est2020DistRev!E36","v":0},{"$f":"Est2020DistRev!F36","v":0},{"$f":"Est2020DistRev!G36","v":0},{"$f":"Est2020DistRev!H36","v":0},{"$f":"Est2020DistRev!I36","v":0},{"$f":"Est2020DistRev!J36","v":0},{"$f":"Est2020DistRev!K36","v":0},{"$f":"Est2020DistRev!L36","v":0},{"$f":"Est2020DistRev!M36","v":0},{"$f":"Est2020DistRev!N36","v":0},{"$f":"Est2020DistRev!O36","v":0},{"$f":"Est2020DistRev!P36","v":0},null,{"$f":"Est2020DistRev!R36/2","v":0},{"$f":"Est2020DistRev!S36/2","v":0},{"$f":"Est2020DistRev!T36/2","v":0},{"$f":"Est2020DistRev!U36/2","v":0},{"$f":"Est2020DistRev!V36/2","v":0},{"$f":"Est2020DistRev!W36/2","v":0},{"$f":"Est2020DistRev!X36/2","v":0},{"$f":"Est2020DistRev!Y36/2","v":0},{"$f":"Est2020DistRev!Z36/2","v":0},{"$f":"Est2020DistRev!AA36/2","v":0},{"$f":"Est2020DistRev!AB36/2","v":0},{"$f":"Est2020DistRev!AC36/2","v":0},{"$f":"Est2020DistRev!AD36/2","v":0},null,0,0,0,0,0,0,0,0,0,0,0,0,0,0,null,0,0,0,0,0,0,0,0,0,0,0,0,0,0]
[null,null,null,null,null,null,null,null,null,null,null,null,null,null,null,null,null,{"$f":"Est2020DistRev!D37","v":0},{"$f":"Est2020DistRev!E37","v":0},{"$f":"Est2020DistRev!F37","v":0},{"$f":"Est2020DistRev!G37","v":0},{"$f":"Est2020DistRev!H37","v":0},{"$f":"Est2020DistRev!I37","v":0},{"$f":"Est2020DistRev!J37","v":0},{"$f":"Est2020DistRev!K37","v":0},{"$f":"Est2020DistRev!L37","v":0},{"$f":"Est2020DistRev!M37","v":0},{"$f":"Est2020DistRev!N37","v":0},{"$f":"Est2020DistRev!O37","v":0},{"$f":"Est2020DistRev!P37","v":0},null,{"$f":"Est2020DistRev!R37/2","v":0},{"$f":"Est2020DistRev!S37/2","v":0},{"$f":"Est2020DistRev!T37/2","v":0},{"$f":"Est2020DistRev!U37/2","v":0},{"$f":"Est2020DistRev!V37/2","v":0},{"$f":"Est2020DistRev!W37/2","v":0},{"$f":"Est2020DistRev!X37/2","v":0},{"$f":"Est2020DistRev!Y37/2","v":0},{"$f":"Est2020DistRev!Z37/2","v":0},{"$f":"Est2020DistRev!AA37/2","v":0},{"$f":"Est2020DistRev!AB37/2","v":0},{"$f":"Est2020DistRev!AC37/2","v":0},{"$f":"Est2020DistRev!AD37/2","v":0},null,0,0,0,0,0,0,0,0,0,0,0,0,0,0,null,0,0,0,0,0,0,0,0,0,0,0,0,0,0]
[null,null,null,null,null,null,null,null,null,null,null,null,null,null,null,null,null,{"$f":"Est2020DistRev!D38","v":0},{"$f":"Est2020DistRev!E38","v":0},{"$f":"Est2020DistRev!F38","v":0},{"$f":"Est2020DistRev!G38","v":0},{"$f":"Est2020DistRev!H38","v":0},{"$f":"Est2020DistRev!I38","v":0},{"$f":"Est2020DistRev!J38","v":0},{"$f":"Est2020DistRev!K38","v":0},{"$f":"Est2020DistRev!L38","v":0},{"$f":"Est2020DistRev!M38","v":0},{"$f":"Est2020DistRev!N38","v":0},{"$f":"Est2020DistRev!O38","v":0},{"$f":"Est2020DistRev!P38","v":0},null,{"$f":"Est2020DistRev!R38/2","v":0},{"$f":"Est2020DistRev!S38/2","v":0},{"$f":"Est2020DistRev!T38/2","v":0},{"$f":"Est2020DistRev!U38/2","v":0},{"$f":"Est2020DistRev!V38/2","v":0},{"$f":"Est2020DistRev!W38/2","v":0},{"$f":"Est2020DistRev!X38/2","v":0},{"$f":"Est2020DistRev!Y38/2","v":0},{"$f":"Est2020DistRev!Z38/2","v":0},{"$f":"Est2020DistRev!AA38/2","v":0},{"$f":"Est2020DistRev!AB38/2","v":0},{"$f":"Est2020DistRev!AC38/2","v":0},{"$f":"Est2020DistRev!AD38/2","v":0},null,0,0,0,0,0,0,0,0,0,0,0,0,0,0,null,0,0,0,0,0,0,0,0,0,0,0,0,0,0]
[null,null,null,null,null,null,null,null,null,null,null,null,null,null,null,null,null,{"$f":"Est2020DistRev!D39","v":0},{"$f":"Est2020DistRev!E39","v":0},{"$f":"Est2020DistRev!F39","v":0},{"$f":"Est2020DistRev!G39","v":0},{"$f":"Est2020DistRev!H39","v":0},{"$f":"Est2020DistRev!I39","v":0},{"$f":"Est2020DistRev!J39","v":0},{"$f":"Est2020DistRev!K39","v":0},{"$f":"Est2020DistRev!L39","v":0},{"$f":"Est2020DistRev!M39","v":0},{"$f":"Est2020DistRev!N39","v":0},{"$f":"Est2020DistRev!O39","v":0},{"$f":"Est2020DistRev!P39","v":0},null,{"$f":"Est2020DistRev!R39/2","v":0},{"$f":"Est2020DistRev!S39/2","v":0},{"$f":"Est2020DistRev!T39/2","v":0},{"$f":"Est2020DistRev!U39/2","v":0},{"$f":"Est2020DistRev!V39/2","v":0},{"$f":"Est2020DistRev!W39/2","v":0},{"$f":"Est2020DistRev!X39/2","v":0},{"$f":"Est2020DistRev!Y39/2","v":0},{"$f":"Est2020DistRev!Z39/2","v":0},{"$f":"Est2020DistRev!AA39/2","v":0},{"$f":"Est2020DistRev!AB39/2","v":0},{"$f":"Est2020DistRev!AC39/2","v":0},{"$f":"Est2020DistRev!AD39/2","v":0},null,0,0,0,0,0,0,0,0,0,0,0,0,0,0,null,0,0,0,0,0,0,0,0,0,0,0,0,0,0]
[null,null,null,null,null,null,null,null,null,null,null,null,null,null,null,null,null,{"$f":"Est2020DistRev!D40","v":0},{"$f":"Est2020DistRev!E40","v":0},{"$f":"Est2020DistRev!F40","v":0},{"$f":"Est2020DistRev!G40","v":0},{"$f":"Est2020DistRev!H40","v":0},{"$f":"Est2020DistRev!I40","v":0},{"$f":"Est2020DistRev!J40","v":0},{"$f":"Est2020DistRev!K40","v":0},{"$f":"Est2020DistRev!L40","v":0},{"$f":"Est2020DistRev!M40","v":0},{"$f":"Est2020DistRev!N40","v":0},{"$f":"Est2020DistRev!O40","v":0},{"$f":"Est2020DistRev!P40","v":0},null,{"$f":"Est2020DistRev!R40/2","v":0},{"$f":"Est2020DistRev!S40/2","v":0},{"$f":"Est2020DistRev!T40/2","v":0},{"$f":"Est2020DistRev!U40/2","v":0},{"$f":"Est2020DistRev!V40/2","v":0},{"$f":"Est2020DistRev!W40/2","v":0},{"$f":"Est2020DistRev!X40/2","v":0},{"$f":"Est2020DistRev!Y40/2","v":0},{"$f":"Est2020DistRev!Z40/2","v":0},{"$f":"Est2020DistRev!AA40/2","v":0},{"$f":"Est2020DistRev!AB40/2","v":0},{"$f":"Est2020DistRev!AC40/2","v":0},{"$f":"Est2020DistRev!AD40/2","v":0},null,0,0,0,0,0,0,0,0,0,0,0,0,0,0,null,0,0,0,0,0,0,0,0,0,0,0,0,0,0]
[null,null,null,null,null,null,null,null,null,null,null,null,null,null,null,null,null,{"$f":"Est2020DistRev!D41","v":0},{"$f":"Est2020DistRev!E41","v":0},{"$f":"Est2020DistRev!F41","v":0},{"$f":"Est2020DistRev!G41","v":0},{"$f":"Est2020DistRev!H41","v":0},{"$f":"Est2020DistRev!I41","v":0},{"$f":"Est2020DistRev!J41","v":0},{"$f":"Est2020DistRev!K41","v":0},{"$f":"Est2020DistRev!L41","v":0},{"$f":"Est2020DistRev!M41","v":0},{"$f":"Est2020DistRev!N41","v":0},{"$f":"Est2020DistRev!O41","v":0},{"$f":"Est2020DistRev!P41","v":0},null,{"$f":"Est2020DistRev!R41/2","v":0},{"$f":"Est2020DistRev!S41/2","v":0},{"$f":"Est2020DistRev!T41/2","v":0},{"$f":"Est2020DistRev!U41/2","v":0},{"$f":"Est2020DistRev!V41/2","v":0},{"$f":"Est2020DistRev!W41/2","v":0},{"$f":"Est2020DistRev!X41/2","v":0},{"$f":"Est2020DistRev!Y41/2","v":0},{"$f":"Est2020DistRev!Z41/2","v":0},{"$f":"Est2020DistRev!AA41/2","v":0},{"$f":"Est2020DistRev!AB41/2","v":0},{"$f":"Est2020DistRev!AC41/2","v":0},{"$f":"Est2020DistRev!AD41/2","v":0},null,0,0,0,0,0,0,0,0,0,0,0,0,0,0,null,0,0,0,0,0,0,0,0,0,0,0,0,0,0]
[null,null,null,null,null,null,null,null,null,null,null,null,null,null,null,null,null,{"$f":"Est2020DistRev!D42","v":0},{"$f":"Est2020DistRev!E42","v":0},{"$f":"Est2020DistRev!F42","v":0},{"$f":"Est2020DistRev!G42","v":0},{"$f":"Est2020DistRev!H42","v":0},{"$f":"Est2020DistRev!I42","v":0},{"$f":"Est2020DistRev!J42","v":0},{"$f":"Est2020DistRev!K42","v":0},{"$f":"Est2020DistRev!L42","v":0},{"$f":"Est2020DistRev!M42","v":0},{"$f":"Est2020DistRev!N42","v":0},{"$f":"Est2020DistRev!O42","v":0},{"$f":"Est2020DistRev!P42","v":0},null,{"$f":"Est2020DistRev!R42/2","v":0},{"$f":"Est2020DistRev!S42/2","v":0},{"$f":"Est2020DistRev!T42/2","v":0},{"$f":"Est2020DistRev!U42/2","v":0},{"$f":"Est2020DistRev!V42/2","v":0},{"$f":"Est2020DistRev!W42/2","v":0},{"$f":"Est2020DistRev!X42/2","v":0},{"$f":"Est2020DistRev!Y42/2","v":0},{"$f":"Est2020DistRev!Z42/2","v":0},{"$f":"Est2020DistRev!AA42/2","v":0},{"$f":"Est2020DistRev!AB42/2","v":0},{"$f":"Est2020DistRev!AC42/2","v":0},{"$f":"Est2020DistRev!AD42/2","v":0},null,0,0,0,0,0,0,0,0,0,0,0,0,0,0,null,0,0,0,0,0,0,0,0,0,0,0,0,0,0]
[null,null,null,null,null,null,null,null,null,null,null,null,null,null,null,null,null,{"$f":"Est2020DistRev!D43","v":0},{"$f":"Est2020DistRev!E43","v":0},{"$f":"Est2020DistRev!F43","v":0},{"$f":"Est2020DistRev!G43","v":0},{"$f":"Est2020DistRev!H43","v":0},{"$f":"Est2020DistRev!I43","v":0},{"$f":"Est2020DistRev!J43","v":0},{"$f":"Est2020DistRev!K43","v":0},{"$f":"Est2020DistRev!L43","v":0},{"$f":"Est2020DistRev!M43","v":0},{"$f":"Est2020DistRev!N43","v":0},{"$f":"Est2020DistRev!O43","v":0},{"$f":"Est2020DistRev!P43","v":0},null,{"$f":"Est2020DistRev!R43/2","v":0},{"$f":"Est2020DistRev!S43/2","v":0},{"$f":"Est2020DistRev!T43/2","v":0},{"$f":"Est2020DistRev!U43/2","v":0},{"$f":"Est2020DistRev!V43/2","v":0},{"$f":"Est2020DistRev!W43/2","v":0},{"$f":"Est2020DistRev!X43/2","v":0},{"$f":"Est2020DistRev!Y43/2","v":0},{"$f":"Est2020DistRev!Z43/2","v":0},{"$f":"Est2020DistRev!AA43/2","v":0},{"$f":"Est2020DistRev!AB43/2","v":0},{"$f":"Est2020DistRev!AC43/2","v":0},{"$f":"Est2020DistRev!AD43/2","v":0},null,0,0,0,0,0,0,0,0,0,0,0,0,0,0,null,0,0,0,0,0,0,0,0,0,0,0,0,0,0]
[null,null,null,null,null,null,null,null,null,null,null,null,null,null,null,null,null,{"$f":"Est2020DistRev!D44","v":0},{"$f":"Est2020DistRev!E44","v":0},{"$f":"Est2020DistRev!F44","v":0},{"$f":"Est2020DistRev!G44","v":0},{"$f":"Est2020DistRev!H44","v":0},{"$f":"Est2020DistRev!I44","v":0},{"$f":"Est2020DistRev!J44","v":0},{"$f":"Est2020DistRev!K44","v":0},{"$f":"Est2020DistRev!L44","v":0},{"$f":"Est2020DistRev!M44","v":0},{"$f":"Est2020DistRev!N44","v":0},{"$f":"Est2020DistRev!O44","v":0},{"$f":"Est2020DistRev!P44","v":0},null,{"$f":"Est2020DistRev!R44/2","v":0},{"$f":"Est2020DistRev!S44/2","v":0},{"$f":"Est2020DistRev!T44/2","v":0},{"$f":"Est2020DistRev!U44/2","v":0},{"$f":"Est2020DistRev!V44/2","v":0},{"$f":"Est2020DistRev!W44/2","v":0},{"$f":"Est2020DistRev!X44/2","v":0},{"$f":"Est2020DistRev!Y44/2","v":0},{"$f":"Est2020DistRev!Z44/2","v":0},{"$f":"Est2020DistRev!AA44/2","v":0},{"$f":"Est2020DistRev!AB44/2","v":0},{"$f":"Est2020DistRev!AC44/2","v":0},{"$f":"Est2020DistRev!AD44/2","v":0},null,0,0,0,0,0,0,0,0,0,0,0,0,0,0,null,0,0,0,0,0,0,0,0,0,0,0,0,0,0]
[null,null,null,null,null,null,null,null,null,null,null,null,null,null,null,null,null,{"$f":"Est2020DistRev!D45","v":0},{"$f":"Est2020DistRev!E45","v":0},{"$f":"Est2020DistRev!F45","v":0},{"$f":"Est2020DistRev!G45","v":0},{"$f":"Est2020DistRev!H45","v":0},{"$f":"Est2020DistRev!I45","v":0},{"$f":"Est2020DistRev!J45","v":0},{"$f":"Est2020DistRev!K45","v":0},{"$f":"Est2020DistRev!L45","v":0},{"$f":"Est2020DistRev!M45","v":0},{"$f":"Est2020DistRev!N45","v":0},{"$f":"Est2020DistRev!O45","v":0},{"$f":"Est2020DistRev!P45","v":0},null,{"$f":"Est2020DistRev!R45/2","v":0},{"$f":"Est2020DistRev!S45/2","v":0},{"$f":"Est2020DistRev!T45/2","v":0},{"$f":"Est2020DistRev!U45/2","v":0},{"$f":"Est2020DistRev!V45/2","v":0},{"$f":"Est2020DistRev!W45/2","v":0},{"$f":"Est2020DistRev!X45/2","v":0},{"$f":"Est2020DistRev!Y45/2","v":0},{"$f":"Est2020DistRev!Z45/2","v":0},{"$f":"Est2020DistRev!AA45/2","v":0},{"$f":"Est2020DistRev!AB45/2","v":0},{"$f":"Est2020DistRev!AC45/2","v":0},{"$f":"Est2020DistRev!AD45/2","v":0},null,0,0,0,0,0,0,0,0,0,0,0,0,0,0,null,0,0,0,0,0,0,0,0,0,0,0,0,0,0]
[null,null,null,null,null,null,null,null,null,null,null,null,null,null,null,null,null,{"$f":"Est2020DistRev!D46","v":0},{"$f":"Est2020DistRev!E46","v":0},{"$f":"Est2020DistRev!F46","v":0},{"$f":"Est2020DistRev!G46","v":0},{"$f":"Est2020DistRev!H46","v":0},{"$f":"Est2020DistRev!I46","v":0},{"$f":"Est2020DistRev!J46","v":0},{"$f":"Est2020DistRev!K46","v":0},{"$f":"Est2020DistRev!L46","v":0},{"$f":"Est2020DistRev!M46","v":0},{"$f":"Est2020DistRev!N46","v":0},{"$f":"Est2020DistRev!O46","v":0},{"$f":"Est2020DistRev!P46","v":0},null,{"$f":"Est2020DistRev!R46/2","v":0},{"$f":"Est2020DistRev!S46/2","v":0},{"$f":"Est2020DistRev!T46/2","v":0},{"$f":"Est2020DistRev!U46/2","v":0},{"$f":"Est2020DistRev!V46/2","v":0},{"$f":"Est2020DistRev!W46/2","v":0},{"$f":"Est2020DistRev!X46/2","v":0},{"$f":"Est2020DistRev!Y46/2","v":0},{"$f":"Est2020DistRev!Z46/2","v":0},{"$f":"Est2020DistRev!AA46/2","v":0},{"$f":"Est2020DistRev!AB46/2","v":0},{"$f":"Est2020DistRev!AC46/2","v":0},{"$f":"Est2020DistRev!AD46/2","v":0},null,0,0,0,0,0,0,0,0,0,0,0,0,0,0,null,0,0,0,0,0,0,0,0,0,0,0,0,0,0]
[null,null,null,null,null,null,null,null,null,null,null,null,null,null,null,null,null,{"$f":"Est2020DistRev!D47","v":0},{"$f":"Est2020DistRev!E47","v":0},{"$f":"Est2020DistRev!F47","v":0},{"$f":"Est2020DistRev!G47","v":0},{"$f":"Est2020DistRev!H47","v":0},{"$f":"Est2020DistRev!I47","v":0},{"$f":"Est2020DistRev!J47","v":0},{"$f":"Est2020DistRev!K47","v":0},{"$f":"Est2020DistRev!L47","v":0},{"$f":"Est2020DistRev!M47","v":0},{"$f":"Est2020DistRev!N47","v":0},{"$f":"Est2020DistRev!O47","v":0},{"$f":"Est2020DistRev!P47","v":0},null,{"$f":"Est2020DistRev!R47/2","v":0},{"$f":"Est2020DistRev!S47/2","v":0},{"$f":"Est2020DistRev!T47/2","v":0},{"$f":"Est2020DistRev!U47/2","v":0},{"$f":"Est2020DistRev!V47/2","v":0},{"$f":"Est2020DistRev!W47/2","v":0},{"$f":"Est2020DistRev!X47/2","v":0},{"$f":"Est2020DistRev!Y47/2","v":0},{"$f":"Est2020DistRev!Z47/2","v":0},{"$f":"Est2020DistRev!AA47/2","v":0},{"$f":"Est2020DistRev!AB47/2","v":0},{"$f":"Est2020DistRev!AC47/2","v":0},{"$f":"Est2020DistRev!AD47/2","v":0},null,0,0,0,0,0,0,0,0,0,0,0,0,0,0,null,0,0,0,0,0,0,0,0,0,0,0,0,0,0]
[null,null,null,null,null,null,null,null,null,null,null,null,null,null,null,null,null,{"$f":"Est2020DistRev!D48","v":0},{"$f":"Est2020DistRev!E48","v":0},{"$f":"Est2020DistRev!F48","v":0},{"$f":"Est2020DistRev!G48","v":0},{"$f":"Est2020DistRev!H48","v":0},{"$f":"Est2020DistRev!I48","v":0},{"$f":"Est2020DistRev!J48","v":0},{"$f":"Est2020DistRev!K48","v":0},{"$f":"Est2020DistRev!L48","v":0},{"$f":"Est2020DistRev!M48","v":0},{"$f":"Est2020DistRev!N48","v":0},{"$f":"Est2020DistRev!O48","v":0},{"$f":"Est2020DistRev!P48","v":0},null,{"$f":"Est2020DistRev!R48/2","v":0},{"$f":"Est2020DistRev!S48/2","v":0},{"$f":"Est2020DistRev!T48/2","v":0},{"$f":"Est2020DistRev!U48/2","v":0},{"$f":"Est2020DistRev!V48/2","v":0},{"$f":"Est2020DistRev!W48/2","v":0},{"$f":"Est2020DistRev!X48/2","v":0},{"$f":"Est2020DistRev!Y48/2","v":0},{"$f":"Est2020DistRev!Z48/2","v":0},{"$f":"Est2020DistRev!AA48/2","v":0},{"$f":"Est2020DistRev!AB48/2","v":0},{"$f":"Est2020DistRev!AC48/2","v":0},{"$f":"Est2020DistRev!AD48/2","v":0},null,0,0,0,0,0,0,0,0,0,0,0,0,0,0,null,0,0,0,0,0,0,0,0,0,0,0,0,0,0]
[null,null,null,null,null,null,null,null,null,null,null,null,null,null,null,null,null,{"$f":"Est2020DistRev!D49","v":0},{"$f":"Est2020DistRev!E49","v":0},{"$f":"Est2020DistRev!F49","v":0},{"$f":"Est2020DistRev!G49","v":0},{"$f":"Est2020DistRev!H49","v":0},{"$f":"Est2020DistRev!I49","v":0},{"$f":"Est2020DistRev!J49","v":0},{"$f":"Est2020DistRev!K49","v":0},{"$f":"Est2020DistRev!L49","v":0},{"$f":"Est2020DistRev!M49","v":0},{"$f":"Est2020DistRev!N49","v":0},{"$f":"Est2020DistRev!O49","v":0},{"$f":"Est2020DistRev!P49","v":0},null,{"$f":"Est2020DistRev!R49/2","v":0},{"$f":"Est2020DistRev!S49/2","v":0},{"$f":"Est2020DistRev!T49/2","v":0},{"$f":"Est2020DistRev!U49/2","v":0},{"$f":"Est2020DistRev!V49/2","v":0},{"$f":"Est2020DistRev!W49/2","v":0},{"$f":"Est2020DistRev!X49/2","v":0},{"$f":"Est2020DistRev!Y49/2","v":0},{"$f":"Est2020DistRev!Z49/2","v":0},{"$f":"Est2020DistRev!AA49/2","v":0},{"$f":"Est2020DistRev!AB49/2","v":0},{"$f":"Est2020DistRev!AC49/2","v":0},{"$f":"Est2020DistRev!AD49/2","v":0},null,0,0,0,0,0,0,0,0,0,0,0,0,0,0,null,0,0,0,0,0,0,0,0,0,0,0,0,0,0]
[null,null,null,null,null,null,null,null,null,null,null,null,null,null,null,null,null,{"$f":"Est2020DistRev!D50","v":0},{"$f":"Est2020DistRev!E50","v":0},{"$f":"Est2020DistRev!F50","v":0},{"$f":"Est2020DistRev!G50","v":0},{"$f":"Est2020DistRev!H50","v":0},{"$f":"Est2020DistRev!I50","v":0},{"$f":"Est2020DistRev!J50","v":0},{"$f":"Est2020DistRev!K50","v":0},{"$f":"Est2020DistRev!L50","v":0},{"$f":"Est2020DistRev!M50","v":0},{"$f":"Est2020DistRev!N50","v":0},{"$f":"Est2020DistRev!O50","v":0},{"$f":"Est2020DistRev!P50","v":0},null,{"$f":"Est2020DistRev!R50/2","v":0},{"$f":"Est2020DistRev!S50/2","v":0},{"$f":"Est2020DistRev!T50/2","v":0},{"$f":"Est2020DistRev!U50/2","v":0},{"$f":"Est2020DistRev!V50/2","v":0},{"$f":"Est2020DistRev!W50/2","v":0},{"$f":"Est2020DistRev!X50/2","v":0},{"$f":"Est2020DistRev!Y50/2","v":0},{"$f":"Est2020DistRev!Z50/2","v":0},{"$f":"Est2020DistRev!AA50/2","v":0},{"$f":"Est2020DistRev!AB50/2","v":0},{"$f":"Est2020DistRev!AC50/2","v":0},{"$f":"Est2020DistRev!AD50/2","v":0},null,0,0,0,0,0,0,0,0,0,0,0,0,0,0,null,0,0,0,0,0,0,0,0,0,0,0,0,0,0]
[null,null,null,null,null,null,null,null,null,null,null,null,null,null,null,null,null,{"$f":"Est2020DistRev!D51","v":0},{"$f":"Est2020DistRev!E51","v":0},{"$f":"Est2020DistRev!F51","v":0},{"$f":"Est2020DistRev!G51","v":0},{"$f":"Est2020DistRev!H51","v":0},{"$f":"Est2020DistRev!I51","v":0},{"$f":"Est2020DistRev!J51","v":0},{"$f":"Est2020DistRev!K51","v":0},{"$f":"Est2020DistRev!L51","v":0},{"$f":"Est2020DistRev!M51","v":0},{"$f":"Est2020DistRev!N51","v":0},{"$f":"Est2020DistRev!O51","v":0},{"$f":"Est2020DistRev!P51","v":0},null,{"$f":"Est2020DistRev!R51/2","v":0},{"$f":"Est2020DistRev!S51/2","v":0},{"$f":"Est2020DistRev!T51/2","v":0},{"$f":"Est2020DistRev!U51/2","v":0},{"$f":"Est2020DistRev!V51/2","v":0},{"$f":"Est2020DistRev!W51/2","v":0},{"$f":"Est2020DistRev!X51/2","v":0},{"$f":"Est2020DistRev!Y51/2","v":0},{"$f":"Est2020DistRev!Z51/2","v":0},{"$f":"Est2020DistRev!AA51/2","v":0},{"$f":"Est2020DistRev!AB51/2","v":0},{"$f":"Est2020DistRev!AC51/2","v":0},{"$f":"Est2020DistRev!AD51/2","v":0},null,0,0,0,0,0,0,0,0,0,0,0,0,0,0,null,0,0,0,0,0,0,0,0,0,0,0,0,0,0]
[null,null,null,null,null,null,null,null,null,null,null,null,null,null,null,null,null,null,null,null,null,null,null,null,null,null,null,null,null,null,null,null,null,null,null,null,null,null,null,null,null,null,null,null,null,0,0,0,0,0,0,0,0,0,0,0,0,0,0,null,0,0,0,0,0,0,0,0,0,0,0,0,0,0]
[null,null,null,null,null,null,null,null,null,null,null,null,null,null,null,null,null,null,null,null,null,null,null,null,null,null,null,null,null,null,null,null,null,null,null,null,null,null,null,null,null,null,null,null,null,0,0,0,0,0,0,0,0,0,0,0,0,0,0,null,0,0,0,0,0,0,0,0,0,0,0,0,0,0]
[null,null,null,null,null,null,null,null,null,null,null,null,null,null,null,null,null,null,null,null,null,null,null,null,null,null,null,null,null,null,null,null,null,null,null,null,null,null,null,null,null,null,null,null,null,0,0,0,0,0,0,0,0,0,0,0,0,0,0,null,0,0,0,0,0,0,0,0,0,0,0,0,0,0]
[null,null,null,null,null,null,null,null,null,null,null,null,null,null,null,null,null,null,null,null,null,null,null,null,null,null,null,null,null,null,null,null,null,null,null,null,null,null,null,null,null,null,null,null,null,0,0,0,0,0,0,0,0,0,0,0,0,0,0,null,0,0,0,0,0,0,0,0,0,0,0,0,0,0]
[null,null,null,null,null,null,null,null,null,null,null,null,null,null,null,null,null,null,null,null,null,null,null,null,null,null,null,null,null,null,null,null,null,null,null,null,null,null,null,null,null,null,null,null,null,0,0,0,0,0,0,0,0,0,0,0,0,0,0,null,0,0,0,0,0,0,0,0,0,0,0,0,0,0]
[null,null,null,null,null,null,null,null,null,null,null,null,null,null,null,null,null,null,null,null,null,null,null,null,null,null,null,null,null,null,null,null,null,null,null,null,null,null,null,null,null,null,null,null,null,0,0,0,0,0,0,0,0,0,0,0,0,0,0,null,0,0,0,0,0,0,0,0,0,0,0,0,0,0]
[null,null,null,null,null,null,null,null,null,null,null,null,null,null,null,null,null,null,null,null,null,null,null,null,null,null,null,null,null,null,null,null,null,null,null,null,null,null,null,null,null,null,null,null,null,0,0,0,0,0,0,0,0,0,0,0,0,0,0,null,0,0,0,0,0,0,0,0,0,0,0,0,0,0]
[null,null,null,null,null,null,null,null,null,null,null,null,null,null,null,null,null,null,null,null,null,null,null,null,null,null,null,null,null,null,null,null,null,null,null,null,null,null,null,null,null,null,null,null,null,0,0,0,0,0,0,0,0,0,0,0,0,0,0,null,0,0,0,0,0,0,0,0,0,0,0,0,0,0]
[null,null,null,null,null,null,null,null,null,null,null,null,null,null,null,null,null,null,null,null,null,null,null,null,null,null,null,null,null,null,null,null,null,null,null,null,null,null,null,null,null,null,null,null,null,0,0,0,0,0,0,0,0,0,0,0,0,0,0,null,0,0,0,0,0,0,0,0,0,0,0,0,0,0]
[null,null,null,null,null,null,null,null,null,null,null,null,null,null,null,null,null,null,null,null,null,null,null,null,null,null,null,null,null,null,null,null,null,null,null,null,null,null,null,null,null,null,null,null,null,0,0,0,0,0,0,0,0,0,0,0,0,0,0,null,0,0,0,0,0,0,0,0,0,0,0,0,0,0]
[null,null,null,null,null,null,null,null,null,null,null,null,null,null,null,null,null,null,null,null,null,null,null,null,null,null,null,null,null,null,null,null,null,null,null,null,null,null,null,null,null,null,null,null,null,0,0,0,0,0,0,0,0,0,0,0,0,0,0,null,0,0,0,0,0,0,0,0,0,0,0,0,0,0]
[null,null,null,null,null,null,null,null,null,null,null,null,null,null,null,null,null,null,null,null,null,null,null,null,null,null,null,null,null,null,null,{"$f":"SUM(AF6:AF62)","v":138820319.41526082},669242857.49197698,9429491.8212610483,596458888.15666056,742096863.35722768,0,581129758.40636492,1129221349.3354456,12254683.83206463,213038557.95580003,78252863.418300003,20417897.306285184,18342432.99075665,null,{"$f":"SUM(AT6:AT62)","v":14381166.75500728},38263327.195463419,326774.56386761565,14518634.536749898,42356160.133866064,0,14737233.271399701,12252496.143736178,424543.05496800633,23765889.772665869,12962680.844038893,6647043.0081782276,3967933.5918109892,184603882.8717522,null,{"$f":"SUM(BI6:BI62)","v":10600880.681628985},51135989.031440362,435857.96521491109,19818393.015046898,56620586.190429732,0,17930819.261174493,16302640.093659183,566274.53022399626,31444606.0341441,17254468.747190014,8874514.6933838613,5299305.3466861267,236284335.59022275]

{"sheet":"2021DistRevCapForm","index":10,"n_rows":11,"n_cols":3,"rows_kept":11,"cut":false,"hidden":false,"merged":[]}
[]
[null,{"$f":"\"Tariff Approval - \"&'Model update'!$C$3","v":"Tariff Approval - United Energy"},{"$f":"'Model update'!$C$5&\"DistRevCapForm\"","v":"2021DistRevCapForm"}]
[]
[null," DUoS"]
[]
[null,"Year (t)",{"$f":"'Model update'!C5","v":2021}]
[]
[null,"Table 1- Compliance with AER Final Determination Total Annual Revenue"]
[null,"Revenue from DUoS charges for year t",{"$f":"Prop2021DistTar!BG63","v":184603882.8717522}]
[null,"Total Annual Revenue for year t",184626512.11703053]
[null,null,{"$f":"IF(C9=\"\",\"\",IF(C10>=C9,\"DUoS REVENUE CAP FORMULA COMPLIANT\",\"DUoS REVENUE CAP FORMULA BREACHED\"))","v":"DUoS REVENUE CAP FORMULA COMPLIANT"}]

{"sheet":"2021DistTarRebalCont","index":11,"n_rows":101,"n_cols":62,"rows_kept":101,"cut":false,"hidden":false,"merged":[]}
[null,{"$f":"\"Tariff Approval - \"&'Model update'!C3","v":"Tariff Approval - United Energy"},{"$f":"'Model update'!$C$5&\"DistTarRebalCont\"","v":"2021DistTarRebalCont"}]
[]
[null,{"$f":"'Model update'!C5&\" DISTRIBUTION TARIFF REBALANCING CONTROL\"","v":"2021 DISTRIBUTION TARIFF REBALANCING CONTROL"}]
[]
[]
[null,"Distribution tariff rebalancing control"]
[]
[null,{"$f":"\"CPI \"&'Model update'!$C$5","v":"CPI 2021"},{"$f":"'Model update'!C30","v":-3.4843205574912606E-3}]
[]
[]
[]
[]
[]
[]
[]
[null,null,{"$f":"(1+C8)*(1-C9)*(1+0.02)*(1+C10)+SUM(C11:C13)","v":1.016445993031359}]
[]
[]
[]
[null,"Rebalancing control summary",{"$f":"\"Pt-1*(Qt \" &'Model update'!$C$5&\")\"","v":"Pt-1*(Qt 2021)"},{"$f":"\"Pt*(Qt \" &'Model update'!$C$5&\")\"","v":"Pt*(Qt 2021)"}]
[null,"Tariff Class (Input Class Name)","Existing ($)","Proposed ($)","Movement"]
[null,"Low Voltage Small",{"$f":"IF(B22=\"\",\"\",SUMIF($B$44:$B$100,$B22,$I$44:$I$100))","v":111763586.4350303},{"$f":"IF(B22=\"\",\"\",SUMIF($B$44:$B$100,$B22,$F$44:$F$100))","v":89304292.427015126},{"$f":"IF(B22=\"\",\"\",D22/C22)","v":0.79904640926075632},{"$f":"IF(B22=\"\",\"\",IF(E22<$C$16,\"COMPLIANT\",\"BREACHED\"))","v":"COMPLIANT"}]
[null,"Low Voltage Medium",55331698.540528893,42365060.586095765,0.76565624594127657,"COMPLIANT"]
[null,"Low Voltage Large",56565647.517769322,43330549.55634433,0.76602233789921048,"COMPLIANT"]
[null,"High Voltage Large",12536457.282043332,9533138.4964325931,0.76043321346353887,"COMPLIANT"]
[null,"Subtransmission Large",86945.814850868031,70841.805864342125,0.81478109079605532,"COMPLIANT"]
[null,null,"","",{"$f":"IF(B27=\"\",\"\",D27/C27)","v":""},{"$f":"IF(B27=\"\",\"\",IF(E27<$C$16,\"COMPLIANT\",\"BREACHED\"))","v":""}]
[null,null,"","","",""]
[null,null,"","","",""]
[null,null,"","","",""]
[null,null,"","","",""]
[null,null,"","","",""]
[null,null,"","","",""]
[null,null,"","","",""]
[null,null,"","","",""]
[null,null,"","","",""]
[null,null,"","","",""]
[null,null,"","","",""]
[null,"Check Total",{"$f":"IF(ABS(SUM(C22:C38)-I101)<0.01,\"Ok\",\"Error\")","v":"Ok"},{"$f":"IF(ABS(SUM(D22:D38)-F101)<0.01,\"Ok\",\"Error\")","v":"Ok"}]
[null,null,{"$f":"IF(ABS(SUM(C22:C38)-Prop2021DistTar!BV63)<0.01,\"Ok\",\"Error\")","v":"Ok"},{"$f":"IF(ABS(SUM(D22:D38)-Prop2021DistTar!BG63)<0.01,\"Ok\",\"Error\")","v":"Ok"}]
[]
[null,null,null,null,null,{"$f":"\"Revenue (Pt \"&'Model update'!$C$5&\")*(Qt \" &'Model update'!$C$5&\")\"","v":"Revenue (Pt 2021)*(Qt 2021)"},null,null,{"$f":"\"Revenue (Pt-1 \"&'Model update'!$C$8&\")*(Qt \" &'Model update'!$C$5&\")\"","v":"Revenue (Pt-1 2020)*(Qt 2021)"}]
["New Tariff Test","Destination tariff class","Source tariff class","Proposed tariff","Existing tariff","PropRev\nTotal",null,null,"ExistRev\nTotal"]
[{"$f":"OR(EXACT(D44,Prop2021DistTar!C$6:C$62))","v":true},"Low Voltage Small","Low Voltage Small",{"$f":"IF(Prop2021DistTar!B6=\"\",\"\",Prop2021DistTar!B6)","v":"Low voltage small 1 rate"},{"$f":"IF(Prop2021DistTar!C6=\"\",\"\",Prop2021DistTar!C6)","v":"Low voltage small 1 rate"},{"$f":"Prop2021DistTar!BG6","v":79074658.119346052},null,null,{"$f":"Prop2021DistTar!BV6","v":98959255.42336154}]
[{"$f":"OR(EXACT(D45,Prop2021DistTar!C$6:C$62))","v":true},"Low Voltage Small","Low Voltage Small",{"$f":"IF(Prop2021DistTar!B7=\"\",\"\",Prop2021DistTar!B7)","v":"Winter economy tariff"},{"$f":"IF(Prop2021DistTar!C7=\"\",\"\",Prop2021DistTar!C7)","v":"Winter economy tariff"},{"$f":"Prop2021DistTar!BG7","v":24329.056760838954},null,null,{"$f":"Prop2021DistTar!BV7","v":30545.957715191373}]
[{"$f":"OR(EXACT(D46,Prop2021DistTar!C$6:C$62))","v":true},"Low Voltage Small","Low Voltage Small",{"$f":"IF(Prop2021DistTar!B8=\"\",\"\",Prop2021DistTar!B8)","v":"Low voltage small 2 rate"},{"$f":"IF(Prop2021DistTar!C8=\"\",\"\",Prop2021DistTar!C8)","v":"Low voltage small 2 rate"},{"$f":"Prop2021DistTar!BG8","v":715645.6841690049},null,null,{"$f":"Prop2021DistTar!BV8","v":877346.02085654461}]
[{"$f":"OR(EXACT(D47,Prop2021DistTar!C$6:C$62))","v":true},"Low Voltage Small","Low Voltage Small",{"$f":"IF(Prop2021DistTar!B9=\"\",\"\",Prop2021DistTar!B9)","v":"Dedicated circuit"},{"$f":"IF(Prop2021DistTar!C9=\"\",\"\",Prop2021DistTar!C9)","v":"Dedicated circuit"},{"$f":"Prop2021DistTar!BG9","v":678275.95441866992},null,null,{"$f":"Prop2021DistTar!BV9","v":874309.46725643589}]
[{"$f":"OR(EXACT(D48,Prop2021DistTar!C$6:C$62))","v":true},"Low Voltage Medium","Low Voltage Medium",{"$f":"IF(Prop2021DistTar!B10=\"\",\"\",Prop2021DistTar!B10)","v":"Low voltage medium 1 rate"},{"$f":"IF(Prop2021DistTar!C10=\"\",\"\",Prop2021DistTar!C10)","v":"Low voltage medium 1 rate"},{"$f":"Prop2021DistTar!BG10","v":14119790.571462611},null,null,{"$f":"Prop2021DistTar!BV10","v":17873932.913247332}]
[{"$f":"OR(EXACT(D49,Prop2021DistTar!C$6:C$62))","v":true},"Low Voltage Medium","Low Voltage Medium",{"$f":"IF(Prop2021DistTar!B11=\"\",\"\",Prop2021DistTar!B11)","v":"Low voltage medium 2 rate 5 day"},{"$f":"IF(Prop2021DistTar!C11=\"\",\"\",Prop2021DistTar!C11)","v":"Low voltage medium 2 rate 5 day"},{"$f":"Prop2021DistTar!BG11","v":5762264.0990086868},null,null,{"$f":"Prop2021DistTar!BV11","v":7438552.9039031602}]
[{"$f":"OR(EXACT(D50,Prop2021DistTar!C$6:C$62))","v":true},"Low Voltage Medium","Low Voltage Medium",{"$f":"IF(Prop2021DistTar!B12=\"\",\"\",Prop2021DistTar!B12)","v":"Low voltage medium 2 rate 7 day"},{"$f":"IF(Prop2021DistTar!C12=\"\",\"\",Prop2021DistTar!C12)","v":"Low voltage medium 2 rate 7 day"},{"$f":"Prop2021DistTar!BG12","v":2156201.7930641929},null,null,{"$f":"Prop2021DistTar!BV12","v":2758791.1411397494}]
[{"$f":"OR(EXACT(D51,Prop2021DistTar!C$6:C$62))","v":true},"Low Voltage Small","Low Voltage Small",{"$f":"IF(Prop2021DistTar!B13=\"\",\"\",Prop2021DistTar!B13)","v":"Unmetered supplies"},{"$f":"IF(Prop2021DistTar!C13=\"\",\"\",Prop2021DistTar!C13)","v":"Unmetered supplies"},{"$f":"Prop2021DistTar!BG13","v":1522800.8161403299},null,null,{"$f":"Prop2021DistTar!BV13","v":1938792.2729452103}]
[{"$f":"OR(EXACT(D52,Prop2021DistTar!C$6:C$62))","v":true},"Low Voltage Large","Low Voltage Large",{"$f":"IF(Prop2021DistTar!B14=\"\",\"\",Prop2021DistTar!B14)","v":"Low voltage large 1 rate"},{"$f":"IF(Prop2021DistTar!C14=\"\",\"\",Prop2021DistTar!C14)","v":"Low voltage large 1 rate"},{"$f":"Prop2021DistTar!BG14","v":37496.175795692383},null,null,{"$f":"Prop2021DistTar!BV14","v":47921.386614540097}]
[{"$f":"OR(EXACT(D53,Prop2021DistTar!C$6:C$62))","v":true},"Low Voltage Large","Low Voltage Large",{"$f":"IF(Prop2021DistTar!B15=\"\",\"\",Prop2021DistTar!B15)","v":"Low voltage large 2 rate"},{"$f":"IF(Prop2021DistTar!C15=\"\",\"\",Prop2021DistTar!C15)","v":"Low voltage large 2 rate"},{"$f":"Prop2021DistTar!BG15","v":65608.028297263634},null,null,{"$f":"Prop2021DistTar!BV15","v":84746.776187249343}]
[{"$f":"OR(EXACT(D54,Prop2021DistTar!C$6:C$62))","v":true},"Low Voltage Medium","Low Voltage Medium",{"$f":"IF(Prop2021DistTar!B16=\"\",\"\",Prop2021DistTar!B16)","v":"Low voltage KW time of use"},{"$f":"IF(Prop2021DistTar!C16=\"\",\"\",Prop2021DistTar!C16)","v":"Low voltage KW time of use"},{"$f":"Prop2021DistTar!BG16","v":386812.75168253266},null,null,{"$f":"Prop2021DistTar!BV16","v":550204.72855044517}]
[{"$f":"OR(EXACT(D55,Prop2021DistTar!C$6:C$62))","v":true},"Low Voltage Medium","Low Voltage Medium",{"$f":"IF(Prop2021DistTar!B17=\"\",\"\",Prop2021DistTar!B17)","v":"Low voltage KW time of use - HOT"},{"$f":"IF(Prop2021DistTar!C17=\"\",\"\",Prop2021DistTar!C17)","v":"Low voltage KW time of use - HOT"},{"$f":"Prop2021DistTar!BG17","v":7617.7499735001602},null,null,{"$f":"Prop2021DistTar!BV17","v":9832.0049267234353}]
[{"$f":"OR(EXACT(D56,Prop2021DistTar!C$6:C$62))","v":true},"Low Voltage Large","Low Voltage Large",{"$f":"IF(Prop2021DistTar!B18=\"\",\"\",Prop2021DistTar!B18)","v":"Low voltage large KVA time of use"},{"$f":"IF(Prop2021DistTar!C18=\"\",\"\",Prop2021DistTar!C18)","v":"Low voltage large KVA time of use"},{"$f":"Prop2021DistTar!BG18","v":43227445.352251373},null,null,{"$f":"Prop2021DistTar!BV18","v":56432979.354967535}]
[{"$f":"OR(EXACT(D57,Prop2021DistTar!C$6:C$62))","v":true},"High Voltage Large","High Voltage Large",{"$f":"IF(Prop2021DistTar!B19=\"\",\"\",Prop2021DistTar!B19)","v":"High voltage KVA time of use"},{"$f":"IF(Prop2021DistTar!C19=\"\",\"\",Prop2021DistTar!C19)","v":"High voltage KVA time of use"},{"$f":"Prop2021DistTar!BG19","v":9533138.4964325931},null,null,{"$f":"Prop2021DistTar!BV19","v":12536457.282043332}]
[{"$f":"OR(EXACT(D58,Prop2021DistTar!C$6:C$62))","v":true},"Subtransmission Large","Subtransmission Large",{"$f":"IF(Prop2021DistTar!B20=\"\",\"\",Prop2021DistTar!B20)","v":"Subtransmission KVA time of use"},{"$f":"IF(Prop2021DistTar!C20=\"\",\"\",Prop2021DistTar!C20)","v":"Subtransmission KVA time of use"},{"$f":"Prop2021DistTar!BG20","v":70841.805864342125},null,null,{"$f":"Prop2021DistTar!BV20","v":86945.814850868031}]
[{"$f":"OR(EXACT(D59,Prop2021DistTar!C$6:C$62))","v":true},"Low Voltage Small","Low Voltage Small",{"$f":"IF(Prop2021DistTar!B21=\"\",\"\",Prop2021DistTar!B21)","v":"TOD"},{"$f":"IF(Prop2021DistTar!C21=\"\",\"\",Prop2021DistTar!C21)","v":"TOD"},{"$f":"Prop2021DistTar!BG21","v":6376707.3399327351},null,null,{"$f":"Prop2021DistTar!BV21","v":7955539.2282535704}]
[{"$f":"OR(EXACT(D60,Prop2021DistTar!C$6:C$62))","v":true},"Low Voltage Small","Low Voltage Small",{"$f":"IF(Prop2021DistTar!B22=\"\",\"\",Prop2021DistTar!B22)","v":"TOD9"},{"$f":"IF(Prop2021DistTar!C22=\"\",\"\",Prop2021DistTar!C22)","v":"TOD9"},{"$f":"Prop2021DistTar!BG22","v":490356.92648298509},null,null,{"$f":"Prop2021DistTar!BV22","v":610417.16948981793}]
[{"$f":"OR(EXACT(D61,Prop2021DistTar!C$6:C$62))","v":true},"Low Voltage Medium","Low Voltage Medium",{"$f":"IF(Prop2021DistTar!B23=\"\",\"\",Prop2021DistTar!B23)","v":"TOU"},{"$f":"IF(Prop2021DistTar!C23=\"\",\"\",Prop2021DistTar!C23)","v":"TOU"},{"$f":"Prop2021DistTar!BG23","v":776349.05480517773},null,null,{"$f":"Prop2021DistTar!BV23","v":1098071.6473434977}]
[{"$f":"OR(EXACT(D62,Prop2021DistTar!C$6:C$62))","v":true},"Low Voltage Small","Low Voltage Small",{"$f":"IF(Prop2021DistTar!B24=\"\",\"\",Prop2021DistTar!B24)","v":"TODFLEX"},{"$f":"IF(Prop2021DistTar!C24=\"\",\"\",Prop2021DistTar!C24)","v":"TODFLEX"},{"$f":"Prop2021DistTar!BG24","v":294194.43208579835},null,null,{"$f":"Prop2021DistTar!BV24","v":368480.22695005382}]
[{"$f":"OR(EXACT(D63,Prop2021DistTar!C$6:C$62))","v":true},"Low Voltage Small","Low Voltage Small",{"$f":"IF(Prop2021DistTar!B25=\"\",\"\",Prop2021DistTar!B25)","v":"Low Voltage KW 1 rate"},{"$f":"IF(Prop2021DistTar!C25=\"\",\"\",Prop2021DistTar!C25)","v":"Low Voltage KW 1 rate"},{"$f":"Prop2021DistTar!BG25","v":127324.09767870927},null,null,{"$f":"Prop2021DistTar!BV25","v":148900.66820191668}]
[{"$f":"OR(EXACT(D64,Prop2021DistTar!C$6:C$62))","v":true},"Low Voltage Medium","Low Voltage Medium",{"$f":"IF(Prop2021DistTar!B26=\"\",\"\",Prop2021DistTar!B26)","v":"Low voltage medium KW time of use (opt-in)"},{"$f":"IF(Prop2021DistTar!C26=\"\",\"\",Prop2021DistTar!C26)","v":"Low voltage medium KW time of use (opt-in)"},{"$f":"Prop2021DistTar!BG26","v":0},null,null,{"$f":"Prop2021DistTar!BV26","v":0}]
[{"$f":"OR(EXACT(D65,Prop2021DistTar!C$6:C$62))","v":true},"Low Voltage Medium","Low Voltage Medium",{"$f":"IF(Prop2021DistTar!B27=\"\",\"\",Prop2021DistTar!B27)","v":"Low voltage medium KW 1 rate (mandatory)"},{"$f":"IF(Prop2021DistTar!C27=\"\",\"\",Prop2021DistTar!C27)","v":"Low voltage medium KW 1 rate (mandatory)"},{"$f":"Prop2021DistTar!BG27","v":19156024.566099063},null,null,{"$f":"Prop2021DistTar!BV27","v":25602313.201417983}]
[{"$f":"OR(EXACT(D66,Prop2021DistTar!C$6:C$62))","v":true},null,null,{"$f":"IF(Prop2021DistTar!B28=\"\",\"\",Prop2021DistTar!B28)","v":""},{"$f":"IF(Prop2021DistTar!C28=\"\",\"\",Prop2021DistTar!C28)","v":""},{"$f":"Prop2021DistTar!BG28","v":0},null,null,{"$f":"Prop2021DistTar!BV28","v":0}]
[{"$f":"OR(EXACT(D67,Prop2021DistTar!C$6:C$62))","v":true},null,null,{"$f":"IF(Prop2021DistTar!B29=\"\",\"\",Prop2021DistTar!B29)","v":""},{"$f":"IF(Prop2021DistTar!C29=\"\",\"\",Prop2021DistTar!C29)","v":""},{"$f":"Prop2021DistTar!BG29","v":0},null,null,{"$f":"Prop2021DistTar!BV29","v":0}]
[{"$f":"OR(EXACT(D68,Prop2021DistTar!C$6:C$62))","v":true},null,null,{"$f":"IF(Prop2021DistTar!B30=\"\",\"\",Prop2021DistTar!B30)","v":""},{"$f":"IF(Prop2021DistTar!C30=\"\",\"\",Prop2021DistTar!C30)","v":""},{"$f":"Prop2021DistTar!BG30","v":0},null,null,{"$f":"Prop2021DistTar!BV30","v":0}]
[{"$f":"OR(EXACT(D69,Prop2021DistTar!C$6:C$62))","v":true},null,null,{"$f":"IF(Prop2021DistTar!B31=\"\",\"\",Prop2021DistTar!B31)","v":""},{"$f":"IF(Prop2021DistTar!C31=\"\",\"\",Prop2021DistTar!C31)","v":""},{"$f":"Prop2021DistTar!BG31","v":0},null,null,{"$f":"Prop2021DistTar!BV31","v":0}]
[{"$f":"OR(EXACT(D70,Prop2021DistTar!C$6:C$62))","v":true},null,null,{"$f":"IF(Prop2021DistTar!B32=\"\",\"\",Prop2021DistTar!B32)","v":""},{"$f":"IF(Prop2021DistTar!C32=\"\",\"\",Prop2021DistTar!C32)","v":""},{"$f":"Prop2021DistTar!BG32","v":0},null,null,{"$f":"Prop2021DistTar!BV32","v":0}]
[{"$f":"OR(EXACT(D71,Prop2021DistTar!C$6:C$62))","v":true},null,null,{"$f":"IF(Prop2021DistTar!B33=\"\",\"\",Prop2021DistTar!B33)","v":""},{"$f":"IF(Prop2021DistTar!C33=\"\",\"\",Prop2021DistTar!C33)","v":""},{"$f":"Prop2021DistTar!BG33","v":0},null,null,{"$f":"Prop2021DistTar!BV33","v":0}]
[{"$f":"OR(EXACT(D72,Prop2021DistTar!C$6:C$62))","v":true},null,null,{"$f":"IF(Prop2021DistTar!B34=\"\",\"\",Prop2021DistTar!B34)","v":""},{"$f":"IF(Prop2021DistTar!C34=\"\",\"\",Prop2021DistTar!C34)","v":""},{"$f":"Prop2021DistTar!BG34","v":0},null,null,{"$f":"Prop2021DistTar!BV34","v":0}]
[{"$f":"OR(EXACT(D73,Prop2021DistTar!C$6:C$62))","v":true},null,null,{"$f":"IF(Prop2021DistTar!B35=\"\",\"\",Prop2021DistTar!B35)","v":""},{"$f":"IF(Prop2021DistTar!C35=\"\",\"\",Prop2021DistTar!C35)","v":""},{"$f":"Prop2021DistTar!BG35","v":0},null,null,{"$f":"Prop2021DistTar!BV35","v":0}]
[{"$f":"OR(EXACT(D74,Prop2021DistTar!C$6:C$62))","v":true},null,null,{"$f":"IF(Prop2021DistTar!B36=\"\",\"\",Prop2021DistTar!B36)","v":""},{"$f":"IF(Prop2021DistTar!C36=\"\",\"\",Prop2021DistTar!C36)","v":""},{"$f":"Prop2021DistTar!BG36","v":0},null,null,{"$f":"Prop2021DistTar!BV36","v":0}]
[{"$f":"OR(EXACT(D75,Prop2021DistTar!C$6:C$62))","v":true},null,null,{"$f":"IF(Prop2021DistTar!B37=\"\",\"\",Prop2021DistTar!B37)","v":""},{"$f":"IF(Prop2021DistTar!C37=\"\",\"\",Prop2021DistTar!C37)","v":""},{"$f":"Prop2021DistTar!BG37","v":0},null,null,{"$f":"Prop2021DistTar!BV37","v":0}]
[{"$f":"OR(EXACT(D76,Prop2021DistTar!C$6:C$62))","v":true},null,null,{"$f":"IF(Prop2021DistTar!B38=\"\",\"\",Prop2021DistTar!B38)","v":""},{"$f":"IF(Prop2021DistTar!C38=\"\",\"\",Prop2021DistTar!C38)","v":""},{"$f":"Prop2021DistTar!BG38","v":0},null,null,{"$f":"Prop2021DistTar!BV38","v":0}]
[{"$f":"OR(EXACT(D77,Prop2021DistTar!C$6:C$62))","v":true},null,null,{"$f":"IF(Prop2021DistTar!B39=\"\",\"\",Prop2021DistTar!B39)","v":""},{"$f":"IF(Prop2021DistTar!C39=\"\",\"\",Prop2021DistTar!C39)","v":""},{"$f":"Prop2021DistTar!BG39","v":0},null,null,{"$f":"Prop2021DistTar!BV39","v":0}]
[{"$f":"OR(EXACT(D78,Prop2021DistTar!C$6:C$62))","v":true},null,null,{"$f":"IF(Prop2021DistTar!B40=\"\",\"\",Prop2021DistTar!B40)","v":""},{"$f":"IF(Prop2021DistTar!C40=\"\",\"\",Prop2021DistTar!C40)","v":""},{"$f":"Prop2021DistTar!BG40","v":0},null,null,{"$f":"Prop2021DistTar!BV40","v":0}]
[{"$f":"OR(EXACT(D79,Prop2021DistTar!C$6:C$62))","v":true},null,null,{"$f":"IF(Prop2021DistTar!B41=\"\",\"\",Prop2021DistTar!B41)","v":""},{"$f":"IF(Prop2021DistTar!C41=\"\",\"\",Prop2021DistTar!C41)","v":""},{"$f":"Prop2021DistTar!BG41","v":0},null,null,{"$f":"Prop2021DistTar!BV41","v":0}]
[{"$f":"OR(EXACT(D80,Prop2021DistTar!C$6:C$62))","v":true},null,null,{"$f":"IF(Prop2021DistTar!B42=\"\",\"\",Prop2021DistTar!B42)","v":""},{"$f":"IF(Prop2021DistTar!C42=\"\",\"\",Prop2021DistTar!C42)","v":""},{"$f":"Prop2021DistTar!BG42","v":0},null,null,{"$f":"Prop2021DistTar!BV42","v":0}]
[{"$f":"OR(EXACT(D81,Prop2021DistTar!C$6:C$62))","v":true},null,null,{"$f":"IF(Prop2021DistTar!B43=\"\",\"\",Prop2021DistTar!B43)","v":""},{"$f":"IF(Prop2021DistTar!C43=\"\",\"\",Prop2021DistTar!C43)","v":""},{"$f":"Prop2021DistTar!BG43","v":0},null,null,{"$f":"Prop2021DistTar!BV43","v":0}]
[{"$f":"OR(EXACT(D82,Prop2021DistTar!C$6:C$62))","v":true},null,null,{"$f":"IF(Prop2021DistTar!B44=\"\",\"\",Prop2021DistTar!B44)","v":""},{"$f":"IF(Prop2021DistTar!C44=\"\",\"\",Prop2021DistTar!C44)","v":""},{"$f":"Prop2021DistTar!BG44","v":0},null,null,{"$f":"Prop2021DistTar!BV44","v":0}]
[{"$f":"OR(EXACT(D83,Prop2021DistTar!C$6:C$62))","v":true},null,null,{"$f":"IF(Prop2021DistTar!B45=\"\",\"\",Prop2021DistTar!B45)","v":""},{"$f":"IF(Prop2021DistTar!C45=\"\",\"\",Prop2021DistTar!C45)","v":""},{"$f":"Prop2021DistTar!BG45","v":0},null,null,{"$f":"Prop2021DistTar!BV45","v":0}]
[{"$f":"OR(EXACT(D84,Prop2021DistTar!C$6:C$62))","v":true},null,null,{"$f":"IF(Prop2021DistTar!B46=\"\",\"\",Prop2021DistTar!B46)","v":""},{"$f":"IF(Prop2021DistTar!C46=\"\",\"\",Prop2021DistTar!C46)","v":""},{"$f":"Prop2021DistTar!BG46","v":0},null,null,{"$f":"Prop2021DistTar!BV46","v":0}]
[{"$f":"OR(EXACT(D85,Prop2021DistTar!C$6:C$62))","v":true},null,null,{"$f":"IF(Prop2021DistTar!B47=\"\",\"\",Prop2021DistTar!B47)","v":""},{"$f":"IF(Prop2021DistTar!C47=\"\",\"\",Prop2021DistTar!C47)","v":""},{"$f":"Prop2021DistTar!BG47","v":0},null,null,{"$f":"Prop2021DistTar!BV47","v":0}]
[{"$f":"OR(EXACT(D86,Prop2021DistTar!C$6:C$62))","v":true},null,null,{"$f":"IF(Prop2021DistTar!B48=\"\",\"\",Prop2021DistTar!B48)","v":""},{"$f":"IF(Prop2021DistTar!C48=\"\",\"\",Prop2021DistTar!C48)","v":""},{"$f":"Prop2021DistTar!BG48","v":0},null,null,{"$f":"Prop2021DistTar!BV48","v":0}]
[{"$f":"OR(EXACT(D87,Prop2021DistTar!C$6:C$62))","v":true},null,null,{"$f":"IF(Prop2021DistTar!B49=\"\",\"\",Prop2021DistTar!B49)","v":""},{"$f":"IF(Prop2021DistTar!C49=\"\",\"\",Prop2021DistTar!C49)","v":""},{"$f":"Prop2021DistTar!BG49","v":0},null,null,{"$f":"Prop2021DistTar!BV49","v":0}]
[{"$f":"OR(EXACT(D88,Prop2021DistTar!C$6:C$62))","v":true},null,null,{"$f":"IF(Prop2021DistTar!B50=\"\",\"\",Prop2021DistTar!B50)","v":""},{"$f":"IF(Prop2021DistTar!C50=\"\",\"\",Prop2021DistTar!C50)","v":""},{"$f":"Prop2021DistTar!BG50","v":0},null,null,{"$f":"Prop2021DistTar!BV50","v":0}]
[{"$f":"OR(EXACT(D89,Prop2021DistTar!C$6:C$62))","v":true},null,null,{"$f":"IF(Prop2021DistTar!B51=\"\",\"\",Prop2021DistTar!B51)","v":""},{"$f":"IF(Prop2021DistTar!C51=\"\",\"\",Prop2021DistTar!C51)","v":""},{"$f":"Prop2021DistTar!BG51","v":0},null,null,{"$f":"Prop2021DistTar!BV51","v":0}]
[{"$f":"OR(EXACT(D90,Prop2021DistTar!C$6:C$62))","v":true},null,null,{"$f":"IF(Prop2021DistTar!B52=\"\",\"\",Prop2021DistTar!B52)","v":""},{"$f":"IF(Prop2021DistTar!C52=\"\",\"\",Prop2021DistTar!C52)","v":""},{"$f":"Prop2021DistTar!BG52","v":0},null,null,{"$f":"Prop2021DistTar!BV52","v":0}]
[{"$f":"OR(EXACT(D91,Prop2021DistTar!C$6:C$62))","v":true},null,null,{"$f":"IF(Prop2021DistTar!B53=\"\",\"\",Prop2021DistTar!B53)","v":""},{"$f":"IF(Prop2021DistTar!C53=\"\",\"\",Prop2021DistTar!C53)","v":""},{"$f":"Prop2021DistTar!BG53","v":0},null,null,{"$f":"Prop2021DistTar!BV53","v":0}]
[{"$f":"OR(EXACT(D92,Prop2021DistTar!C$6:C$62))","v":true},null,null,{"$f":"IF(Prop2021DistTar!B54=\"\",\"\",Prop2021DistTar!B54)","v":""},{"$f":"IF(Prop2021DistTar!C54=\"\",\"\",Prop2021DistTar!C54)","v":""},{"$f":"Prop2021DistTar!BG54","v":0},null,null,{"$f":"Prop2021DistTar!BV54","v":0}]
[{"$f":"OR(EXACT(D93,Prop2021DistTar!C$6:C$62))","v":true},null,null,{"$f":"IF(Prop2021DistTar!B55=\"\",\"\",Prop2021DistTar!B55)","v":""},{"$f":"IF(Prop2021DistTar!C55=\"\",\"\",Prop2021DistTar!C55)","v":""},{"$f":"Prop2021DistTar!BG55","v":0},null,null,{"$f":"Prop2021DistTar!BV55","v":0}]
[{"$f":"OR(EXACT(D94,Prop2021DistTar!C$6:C$62))","v":true},null,null,{"$f":"IF(Prop2021DistTar!B56=\"\",\"\",Prop2021DistTar!B56)","v":""},{"$f":"IF(Prop2021DistTar!C56=\"\",\"\",Prop2021DistTar!C56)","v":""},{"$f":"Prop2021DistTar!BG56","v":0},null,null,{"$f":"Prop2021DistTar!BV56","v":0}]
[{"$f":"OR(EXACT(D95,Prop2021DistTar!C$6:C$62))","v":true},null,null,{"$f":"IF(Prop2021DistTar!B57=\"\",\"\",Prop2021DistTar!B57)","v":""},{"$f":"IF(Prop2021DistTar!C57=\"\",\"\",Prop2021DistTar!C57)","v":""},{"$f":"Prop2021DistTar!BG57","v":0},null,null,{"$f":"Prop2021DistTar!BV57","v":0}]
[{"$f":"OR(EXACT(D96,Prop2021DistTar!C$6:C$62))","v":true},null,null,{"$f":"IF(Prop2021DistTar!B58=\"\",\"\",Prop2021DistTar!B58)","v":""},{"$f":"IF(Prop2021DistTar!C58=\"\",\"\",Prop2021DistTar!C58)","v":""},{"$f":"Prop2021DistTar!BG58","v":0},null,null,{"$f":"Prop2021DistTar!BV58","v":0}]
[{"$f":"OR(EXACT(D97,Prop2021DistTar!C$6:C$62))","v":true},null,null,{"$f":"IF(Prop2021DistTar!B59=\"\",\"\",Prop2021DistTar!B59)","v":""},{"$f":"IF(Prop2021DistTar!C59=\"\",\"\",Prop2021DistTar!C59)","v":""},{"$f":"Prop2021DistTar!BG59","v":0},null,null,{"$f":"Prop2021DistTar!BV59","v":0}]
[{"$f":"OR(EXACT(D98,Prop2021DistTar!C$6:C$62))","v":true},null,null,{"$f":"IF(Prop2021DistTar!B60=\"\",\"\",Prop2021DistTar!B60)","v":""},{"$f":"IF(Prop2021DistTar!C60=\"\",\"\",Prop2021DistTar!C60)","v":""},{"$f":"Prop2021DistTar!BG60","v":0},null,null,{"$f":"Prop2021DistTar!BV60","v":0}]
[{"$f":"OR(EXACT(D99,Prop2021DistTar!C$6:C$62))","v":true},null,null,{"$f":"IF(Prop2021DistTar!B61=\"\",\"\",Prop2021DistTar!B61)","v":""},{"$f":"IF(Prop2021DistTar!C61=\"\",\"\",Prop2021DistTar!C61)","v":""},{"$f":"Prop2021DistTar!BG61","v":0},null,null,{"$f":"Prop2021DistTar!BV61","v":0}]
[{"$f":"OR(EXACT(D100,Prop2021DistTar!C$6:C$62))","v":true},null,null,{"$f":"IF(Prop2021DistTar!B62=\"\",\"\",Prop2021DistTar!B62)","v":""},{"$f":"IF(Prop2021DistTar!C62=\"\",\"\",Prop2021DistTar!C62)","v":""},{"$f":"Prop2021DistTar!BG62","v":0},null,null,{"$f":"Prop2021DistTar!BV62","v":0}]
[null,null,null,null,null,{"$f":"SUM(F44:F100)","v":184603882.8717522},null,null,{"$f":"SUM(I44:I100)","v":236284335.59022275},null,null,null,null,null,null,null,null,null,null,null,null,null,null,null,null,null,null,null,null,null,null,null,null,null,null,null,null,null,null,null,null,null,null,null,null,null,null,null,null,null,null,null,null,null,null,null,null,null,null,null,null,{"$f":"SUM(BJ44:BJ100)","v":0}]

{"sheet":"Est2020DistRev","index":12,"n_rows":63,"n_cols":45,"rows_kept":63,"cut":false,"hidden":false,"merged":[]}
[null,{"$f":"\"Tariff Approval - \"&'Model update'!C3","v":"Tariff Approval - United Energy"},null,{"$f":"\"Est\"&'Model update'!$C$5-1&\"DistRev\"","v":"Est2020DistRev"}]
[]
[null,{"$f":"\"ESTIMATED \"&'Model update'!$C$8&\" Distribution Revenue\"","v":"ESTIMATED 2020 Distribution Revenue"}]
[null,null,null,{"$f":"\"Current Distribution Tariffs (Pt-1) for \"&'Model update'!$C$8","v":"Current Distribution Tariffs (Pt-1) for 2020"},null,null,null,null,null,null,null,null,null,null,null,null,null,{"$f":"\" Estimated Distribution Quantities for \"&'Model update'!$C$8&\" (Qt-1)\"","v":" Estimated Distribution Quantities for 2020 (Qt-1)"},null,null,null,null,null,null,null,null,null,null,null,null,null,{"$f":"\"Estimated Revenue (Pt-1 \"&'Model update'!$C$8&\")*(Qt-1 \" &'Model update'!$C$8&\")\"","v":"Estimated Revenue (Pt-1 2020)*(Qt-1 2020)"}]
[null,{"$f":"\"Tariffs \"&'Model update'!C8","v":"Tariffs 2020"},null,"Current\nFixed","\nCurrentPkBlk1","\nCurrentPkBlk2","\nCurrent PkBlk3","\nCurrent PkBlk4","\nCurrent OPkBlk1","\nCurrent OPkBlk2","\nCurrent OPkBlk3","\nCurrent OPkBlk4","\nCurrent DemBlk1","\nCurrent DemBlk2","\nCurrent DemBlk3","\nCurrent DemBlk4",null,"EstVol\nFixed","EstVol\nPkBlk1","EstVol\nPkBlk2","EstVol\nPkBlk3","EstVol\nPkBlk4","EstVol\nOPkBlk1","EstVol\nOPkBlk2","EstVol\nOPkBlk3","EstVol\nOPkBlk4","EstVol\nDemBlk1","EstVol\nDemBlk2","EstVol\nDemBlk3","EstVol\nDemBlk4",null,"EstRev\nFixed","EstRev\nPkBlk1","EstRev\nPkBlk2","EstRev\nPkBlk3","EstRev\nPkBlk4","EstRev\nOPkBlk1","EstRev\nOPkBlk2","EstRev\nOPkBlk3","EstRev\nOPkBlk4","EstRev\nDemBlk1","EstRev\nDemBlk2","EstRev\nDemBlk3","EstRev\nDemBlk4","EstRev\nTotal"]
[null,{"$f":"Prop2021DistTar!C6","v":"Low voltage small 1 rate"},null,7.85,7.44,0,0,7.44,0,0,0,0,0,0,0,0,null,212162195.04745215,919851752.96868646,0,0,1513854586.4322367,0,0,0,0,0,0,0,0,null,{"$f":"D6/100*R6","v":16654732.311224993},{"$f":"E6/100*S6","v":68436970.420870274},0,0,112630781.23055843,0,0,0,0,{"$f":"M6/100*AA6","v":0},{"$f":"N6/100*AB6","v":0},0,0,{"$f":"SUM(AF6:AR6)","v":197722483.9626537}]
[null,{"$f":"Prop2021DistTar!C7","v":"Winter economy tariff"},null,10.49,7.16,0,0,7.16,2.39,0,0,0,0,0,0,0,null,47078.073401955109,293507.53266063327,0,0,549771.85918476363,0,0,0,0,0,0,0,0,null,{"$f":"D7/100*R7","v":4938.4898998650915},{"$f":"E7/100*S7","v":21015.13933850134},0,0,39363.665117629076,0,0,0,0,{"$f":"M7/100*AA7","v":0},{"$f":"N7/100*AB7","v":0},{"$f":"O7/100*AC7","v":0},{"$f":"P7/100*AD7","v":0},{"$f":"SUM(AF7:AR7)","v":65317.294355995509}]
[null,{"$f":"Prop2021DistTar!C8","v":"Low voltage small 2 rate"},null,15.93,0,0,11.24,0,0,11.24,2.29,0,0,0,0,0,null,1540872.8151560545,0,0,4165253.263991043,0,0,6996037.3264832553,14790881.873934381,0,0,0,0,0,null,245461.03945435947,0,0,468174.46687259321,0,0,786354.59549671784,338711.19491309731,0,0,0,0,0,1838701.296736768]
[null,{"$f":"Prop2021DistTar!C9","v":"Dedicated circuit"},null,0,0,0,0,0,0,0,2.23,0,0,0,0,0,null,21169813.975249004,0,0,0,0,0,0,92477650.134704784,0,0,0,0,0,null,0,0,0,0,0,0,0,2062251.5980039167,0,0,0,0,0,2062251.5980039167]
[null,{"$f":"Prop2021DistTar!C10","v":"Low voltage medium 1 rate"},null,13.23,8.8800000000000008,0,0,8.8800000000000008,0,0,0,0,0,0,0,0,null,12102335.339341246,161788893.0990074,0,0,250038882.95496148,0,0,0,0,0,0,0,0,null,1601138.9653948469,14366853.707191858,0,0,22203452.806400578,0,0,0,0,0,0,0,0,38171445.478987284]
[null,{"$f":"Prop2021DistTar!C11","v":"Low voltage medium 2 rate 5 day"},null,25.34,0,0,13.8,0,0,10.34,2.58,0,0,0,0,0,null,3296334.5163083877,0,0,44442947.947234251,0,0,63255909.479309671,66483501.712788329,0,0,0,0,0,null,835291.16643254552,0,0,6133126.8167183269,0,0,6540661.0401606197,1715274.3441899389,0,0,0,0,0,15224353.36750143]
[null,{"$f":"Prop2021DistTar!C12","v":"Low voltage medium 2 rate 7 day"},null,26.96,0,0,11.38,0,0,8.81,2.08,0,0,0,0,0,null,1640279.5350489484,0,0,19851193.851817146,0,0,30063800.980999004,13681650.148481317,0,0,0,0,0,null,442219.36264919647,0,0,2259065.8603367913,0,0,2648620.8664260125,284578.32308841136,0,0,0,0,0,5634484.4125004113]
[null,{"$f":"Prop2021DistTar!C13","v":"Unmetered supplies"},null,0,0,0,8.1300000000000008,0,0,8.1300000000000008,1.76,0,0,0,0,0,null,3541416,0,0,11643754.468346793,0,0,19080770.290165257,56302898.461384363,0,0,0,0,0,null,0,0,0,946637.23827659443,0,0,1551266.6245904355,990931.01292036485,0,0,0,0,0,3488834.8757873946]
[null,{"$f":"Prop2021DistTar!C14","v":"Low voltage large 1 rate"},null,15.49,6.91,0,0,6.91,0,0,0,0,0,0,0,0,null,2568.0958947310755,626916.04061509541,0,0,845401.29683546792,0,null,0,0,0,0,0,0,null,397.79805409384363,43319.898406503089,0,0,58417.229611330826,0,0,0,0,0,0,0,0,102134.92607192777]
[null,{"$f":"Prop2021DistTar!C15","v":"Low voltage large 2 rate"},null,22.35,0,0,12.56,0,0,9.98,2.38,0,0,0,0,0,null,6236.8043157754701,0,0,563898.22189565003,0,0,810564.92064550507,1029686.5130864918,0,0,0,0,0,null,1393.9257645758175,0,0,70825.616670093659,0,0,80894.379080421408,24506.539011458503,0,0,0,0,0,177620.46052654937]
[null,{"$f":"Prop2021DistTar!C16","v":"Low voltage KW time of use"},null,0,0,0,11.56,0,0,6.78,2.69,0,0,55.35,0,0,null,64782,0,0,2537287.134824161,0,0,4053676.6297783824,6266721.1159880599,0,0,632644.76199999999,0,0,null,0,0,0,293310.39278567303,0,0,274839.27549897431,168574.7980200788,0,0,350168.87576699996,0,0,1086893.3420717262]
[null,{"$f":"Prop2021DistTar!C17","v":"Low voltage KW time of use - HOT"},null,0,0,0,8.07,0,0,6.2,1.83,0,0,71.040000000000006,0,0,null,5856,0,0,18479.708302155541,0,0,32475.323880067692,54198.357159054474,0,0,12598.044,0,0,null,0,0,0,1491.3124599839523,0,0,2013.4700805641969,991.82993601069688,0,0,8949.6504576000007,0,0,13446.262934158847]
[null,{"$f":"Prop2021DistTar!C18","v":"Low voltage large KVA time of use"},null,0,0,0,1.63,0,0,1.38,1.37,0,16.48,24.64,0,0,null,1110078,0,0,442552227.67290831,0,0,608901701.15677881,1242320710.1750302,0,320914609.700302,92279113.547560006,0,0,null,0,0,0,7213601.3110684045,0,0,8402843.4759635478,17019793.729397915,0,52886727.678609774,22737573.578118786,0,0,108260539.77315843]
[null,{"$f":"Prop2021DistTar!C19","v":"High voltage KVA time of use"},null,0,0,0,0.98,0,0,0.85,0.85,0,9.9700000000000006,13.7,0,0,null,36234,0,0,173815273.99329373,0,0,244289927.63391289,638852125.62428415,0,106134752.07471605,33089430.440099999,0,0,null,0,0,0,1703389.6851342786,0,0,2076464.3848882597,5430243.0678064153,0,10581634.781849191,4533251.9702936998,0,0,24324983.889971845]
[null,{"$f":"Prop2021DistTar!C20","v":"Subtransmission KVA time of use"},null,0,0,0,0.56000000000000005,0,0,0.43,0.37,0,0.98,1.43,0,0,null,366,0,0,6227527.5285161007,0,0,11306632.751313305,14340438.674432196,0,4117758.9950392661,1226831.12304,0,0,null,0,0,0,34874.154159690166,0,0,48618.520830647212,53059.623095399125,0,40354.038151384804,17543.685059472002,0,0,194450.0212965933]
[null,{"$f":"Prop2021DistTar!C21","v":"TOD"},null,7.47,0,4.5,14.17,0,0,14.17,3.73,4.5,0,0,0,0,null,15598161.351677936,0,12690970.049510198,22175656.597337086,0,0,41706694.090057462,107857002.42471175,23868443.454547491,0,0,0,0,null,1165182.6529703417,0,571093.6522279589,3142290.5398426647,0,0,5909838.5525611425,4023066.1904417481,1074079.9554546371,0,0,0,0,15885551.543498492]
[null,{"$f":"Prop2021DistTar!C22","v":"TOD9"},null,8.16,0,5.13,14.2,0,0,14.2,4.55,5.13,0,0,0,0,null,1010310.4006260842,0,668818.7140256631,945228.32800503634,0,0,1597730.386088202,6831899.483077053,1130512.0154815589,0,0,0,0,null,82441.328691088478,0,34310.400029516517,134222.42257671515,0,0,226877.71482452468,310851.4264800059,57995.266394203965,0,0,0,0,846698.55899605481]
[null,{"$f":"Prop2021DistTar!C23","v":"TOU"},null,0,0,0,11.15,0,0,6.78,3.27,0,0,48.43,0,0,null,225090,0,0,4508745.3041537777,0,0,6758791.941944059,9460029.8552226312,0,0,1192130.2820000001,0,0,null,0,0,0,502725.10141314624,0,0,458246.0936638072,309342.97626578005,0,0,577348.69557260012,0,0,1847662.8669153336]
[null,{"$f":"Prop2021DistTar!C24","v":"TODFLEX"},null,8.2799999999999994,0,5.37,14.56,0,0,14.56,4.55,5.37,0,0,0,0,null,707292.00753889699,0,1584333.5598280472,771828.7197704392,0,0,1383098.0056736674,3446686.1349774413,2839086.6144133345,0,0,0,0,null,58563.778224220667,0,85078.712162766125,112378.26159857595,0,0,201379.06962608598,156824.21914147359,152458.95119399606,0,0,0,0,766682.99194711843]
[null,{"$f":"Prop2021DistTar!C25","v":"Low Voltage KW 1 rate"},null,0,0,0,3.08,0,0,3.08,0,0,0,0,29.68,11.72,null,4392,0,0,20741.326714633327,0,0,49249.22386420345,0,0,0,0,6369.862000000001,9838.8260000000009,null,0,0,0,638.8328628107065,0,0,1516.8760950174662,0,0,0,0,1890.5750416000003,1153.1104072000003,5199.3944066281729]
[null,{"$f":"Prop2021DistTar!C26","v":"Low voltage medium KW time of use (opt-in)"},null,0,0,0,3.85,0,0,3.85,0,0,0,0,43.59,29.05,null,208620,0,0,28957081.840651866,0,0,58125647.508941278,0,0,0,0,3030279.0759999999,4671498.0599999996,null,0,0,0,1114847.6508650968,0,0,2237837.4290942391,0,0,0,0,1320898.6492284001,1357070.1864299998,6030653.9156177361]
[null,{"$f":"Prop2021DistTar!C27","v":"Low voltage medium KW 1 rate (mandatory)"},null,0,0,0,3.85,0,0,3.85,0,0,0,0,43.59,29.05,null,2445612,0,0,183561587.45583752,0,0,356050859.9525587,0,0,0,0,24585704.744000003,44978171.618000001,null,0,0,0,7067121.1170497444,0,0,13707958.10817351,0,0,0,0,10716908.697909601,13066158.855029,44558146.778161854]
[null,null,null,null,null,null,null,null,null,null,null,null,null,null,null,null,null,null,null,null,null,null,null,null,null,null,null,null,null,null,null,0,0,0,0,0,0,0,0,0,0,0,0,0,0]
[null,null,null,null,null,null,null,null,null,null,null,null,null,null,null,null,null,null,null,null,null,null,null,null,null,null,null,null,null,null,null,0,0,0,0,0,0,0,0,0,0,0,0,0,0]
[null,null,null,null,null,null,null,null,null,null,null,null,null,null,null,null,null,null,null,null,null,null,null,null,null,null,null,null,null,null,null,0,0,0,0,0,0,0,0,0,0,0,0,0,0]
[null,null,null,null,null,null,null,null,null,null,null,null,null,null,null,null,null,null,null,null,null,null,null,null,null,null,null,null,null,null,null,0,0,0,0,0,0,0,0,0,0,0,0,0,0]
[null,null,null,null,null,null,null,null,null,null,null,null,null,null,null,null,null,null,null,null,null,null,null,null,null,null,null,null,null,null,null,0,0,0,0,0,0,0,0,0,0,0,0,0,0]
[null,null,null,null,null,null,null,null,null,null,null,null,null,null,null,null,null,null,null,null,null,null,null,null,null,null,null,null,null,null,null,0,0,0,0,0,0,0,0,0,0,0,0,0,0]
[null,null,null,null,null,null,null,null,null,null,null,null,null,null,null,null,null,null,null,null,null,null,null,null,null,null,null,null,null,null,null,0,0,0,0,0,0,0,0,0,0,0,0,0,0]
[null,null,null,null,null,null,null,null,null,null,null,null,null,null,null,null,null,null,null,null,null,null,null,null,null,null,null,null,null,null,null,0,0,0,0,0,0,0,0,{"$f":"L35/100*Z35","v":0},0,0,0,0,0]
[null,null,null,null,null,null,null,null,null,null,null,null,null,null,null,null,null,null,null,null,null,null,null,null,null,null,null,null,null,null,null,0,0,0,0,0,0,0,0,0,0,0,0,0,0]
[null,null,null,null,null,null,null,null,null,null,null,null,null,null,null,null,null,null,null,null,null,null,null,null,null,null,null,null,null,null,null,0,0,0,0,0,0,0,0,0,0,0,0,0,0]
[null,null,null,null,null,null,null,null,null,null,null,null,null,null,null,null,null,null,null,null,null,null,null,null,null,null,null,null,null,null,null,0,0,0,0,0,0,0,0,0,0,0,0,0,0]
[null,null,null,null,null,null,null,null,null,null,null,null,null,null,null,null,null,null,null,null,null,null,null,null,null,null,null,null,null,null,null,0,0,0,0,0,0,0,0,0,0,0,0,0,0]
[null,null,null,null,null,null,null,null,null,null,null,null,null,null,null,null,null,null,null,null,null,null,null,null,null,null,null,null,null,null,null,0,0,0,0,0,0,0,0,0,0,0,0,0,0]
[null,null,null,null,null,null,null,null,null,null,null,null,null,null,null,null,null,null,null,null,null,null,null,null,null,null,null,null,null,null,null,0,0,0,0,0,0,0,0,0,0,0,0,0,0]
[null,null,null,null,null,null,null,null,null,null,null,null,null,null,null,null,null,null,null,null,null,null,null,null,null,null,null,null,null,null,null,0,0,0,0,0,0,0,0,0,0,0,0,0,0]
[null,null,null,null,null,null,null,null,null,null,null,null,null,null,null,null,null,null,null,null,null,null,null,null,null,null,null,null,null,null,null,0,0,0,0,0,0,0,0,0,0,0,0,0,0]
[null,null,null,null,null,null,null,null,null,null,null,null,null,null,null,null,null,null,null,null,null,null,null,null,null,null,null,null,null,null,null,0,0,0,0,0,0,0,0,0,0,0,0,0,0]
[null,null,null,null,null,null,null,null,null,null,null,null,null,null,null,null,null,null,null,null,null,null,null,null,null,null,null,null,null,null,null,0,0,0,0,0,0,0,0,0,0,0,0,0,0]
[null,null,null,null,null,null,null,null,null,null,null,null,null,null,null,null,null,null,null,null,null,null,null,null,null,null,null,null,null,null,null,0,0,0,0,0,0,0,0,0,0,0,0,0,0]
[null,null,null,null,null,null,null,null,null,null,null,null,null,null,null,null,null,null,null,null,null,null,null,null,null,null,null,null,null,null,null,0,0,0,0,0,0,0,0,0,0,0,0,0,0]
[null,null,null,null,null,null,null,null,null,null,null,null,null,null,null,null,null,null,null,null,null,null,null,null,null,null,null,null,null,null,null,0,0,0,0,0,0,0,0,0,0,0,0,0,0]
[null,null,null,null,null,null,null,null,null,null,null,null,null,null,null,null,null,null,null,null,null,null,null,null,null,null,null,null,null,null,null,0,0,0,0,0,0,0,0,0,0,0,0,0,0]
[null,null,null,null,null,null,null,null,null,null,null,null,null,null,null,null,null,null,null,null,null,null,null,null,null,null,null,null,null,null,null,0,0,0,0,0,0,0,0,0,0,0,0,0,0]
[null,null,null,null,null,null,null,null,null,null,null,null,null,null,null,null,null,null,null,null,null,null,null,null,null,null,null,null,null,null,null,0,0,0,0,0,0,0,0,0,0,0,0,0,0]
[null,null,null,null,null,null,null,null,null,null,null,null,null,null,null,null,null,null,null,null,null,null,null,null,null,null,null,null,null,null,null,0,0,0,0,0,0,0,0,0,0,0,0,0,0]
[null,null,null,null,null,null,null,null,null,null,null,null,null,null,null,null,null,null,null,null,null,null,null,null,null,null,null,null,null,null,null,0,0,0,0,0,0,0,0,0,0,0,0,0,0]
[null,null,null,null,null,null,null,null,null,null,null,null,null,null,null,null,null,null,null,null,null,null,null,null,null,null,null,null,null,null,null,0,0,0,0,0,0,0,0,0,0,0,0,0,0]
[null,null,null,null,null,null,null,null,null,null,null,null,null,null,null,null,null,null,null,null,null,null,null,null,null,null,null,null,null,null,null,0,0,0,0,0,0,0,0,0,0,0,0,0,0]
[null,null,null,null,null,null,null,null,null,null,null,null,null,null,null,null,null,null,null,null,null,null,null,null,null,null,null,null,null,null,null,0,0,0,0,0,0,0,0,0,0,0,0,0,0]
[null,null,null,null,null,null,null,null,null,null,null,null,null,null,null,null,null,null,null,null,null,null,null,null,null,null,null,null,null,null,null,0,0,0,0,0,0,0,0,0,0,0,0,0,0]
[null,null,null,null,null,null,null,null,null,null,null,null,null,null,null,null,null,null,null,null,null,null,null,null,null,null,null,null,null,null,null,0,0,0,0,0,0,0,0,0,0,0,0,0,0]
[null,null,null,null,null,null,null,null,null,null,null,null,null,null,null,null,null,null,null,null,null,null,null,null,null,null,null,null,null,null,null,0,0,0,0,0,0,0,0,0,0,0,0,0,0]
[null,null,null,null,null,null,null,null,null,null,null,null,null,null,null,null,null,null,null,null,null,null,null,null,null,null,null,null,null,null,null,0,0,0,0,0,0,0,0,0,0,0,0,0,0]
[null,null,null,null,null,null,null,null,null,null,null,null,null,null,null,null,null,null,null,null,null,null,null,null,null,null,null,null,null,null,null,0,0,0,0,0,0,0,0,0,0,0,0,0,0]
[null,null,null,null,null,null,null,null,null,null,null,null,null,null,null,null,null,null,null,null,null,null,null,null,null,null,null,null,null,null,null,0,0,0,0,0,0,0,0,0,0,0,0,0,0]
[null,null,null,null,null,null,null,null,null,null,null,null,null,null,null,null,null,{"$f":"SUM(R6:R62)","v":276925923.96201116},1082561069.6409695,14944122.323363908,946758713.36359966,1765288642.5432184,0,1454463567.6023939,2274196080.6892624,27838042.084442385,431167120.77005732,128432748.19870001,27622353.682000004,49659508.504000001,null,{"$f":"SUM(AF6:AF62)","v":21091760.818760123},82868159.165807143,690482.76442024158,31198720.780691184,134932014.93168798,0,45156230.477054529,{"$f":"SUM(AM6:AM62)","v":32889000.872712016},1284534.1730428371,63508716.498610348,28224836.455269158,12039697.922179602,14424382.151866199,468308537.01210141]

{"sheet":"Prop2021TransTar","index":13,"n_rows":63,"n_cols":45,"rows_kept":63,"cut":false,"hidden":false,"merged":[]}
[null,{"$f":"\"Tariff Approval - \"&'Model update'!C3","v":"Tariff Approval - United Energy"},null,{"$f":"\"Prop\"&'Model update'!$C$5&\"TransTar\"","v":"Prop2021TransTar"}]
[]
[null,{"$f":"\"PROPOSED \"&'Model update'!$C$5&\" TRANSMISSION TARIFFS\"","v":"PROPOSED 2021 TRANSMISSION TARIFFS"}]
[null,null,null,{"$f":"\"Proposed Transmission Tariffs (Pt) for \"&'Model update'!$C$5","v":"Proposed Transmission Tariffs (Pt) for 2021"},null,null,null,null,null,null,null,null,null,null,null,null,null,{"$f":"\"Forecast Quantities (Qt) for \"&'Model update'!$C$5","v":"Forecast Quantities (Qt) for 2021"},null,null,null,null,null,null,null,null,null,null,null,null,null,{"$f":"\"Forecast Revenue (Pt \"&'Model update'!$C$5&\")*(Qt \" &'Model update'!$C$5&\")\"","v":"Forecast Revenue (Pt 2021)*(Qt 2021)"}]
[null,"Proposed tariff",null,{"$f":"Prop2021DistTar!D5","v":"PropTar\nFixed"},{"$f":"Prop2021DistTar!E5","v":"PropTar\nPkBlk1"},{"$f":"Prop2021DistTar!F5","v":"PropTar\nPkBlk2"},{"$f":"Prop2021DistTar!G5","v":"PropTar\nPkBlk3"},{"$f":"Prop2021DistTar!H5","v":"PropTar\nPkBlk4"},{"$f":"Prop2021DistTar!I5","v":"PropTar\nOPkBlk1"},{"$f":"Prop2021DistTar!J5","v":"PropTar\nOPkBlk2"},{"$f":"Prop2021DistTar!K5","v":"PropTar\nOPkBlk3"},{"$f":"Prop2021DistTar!L5","v":"PropTar\nOPkBlk4"},{"$f":"Prop2021DistTar!M5","v":"PropTar\nDemBlk1"},{"$f":"Prop2021DistTar!N5","v":"PropTar\nDemBlk2"},{"$f":"Prop2021DistTar!O5","v":"PropTar\nDemBlk3"},{"$f":"Prop2021DistTar!P5","v":"PropTar\nDemBlk4"},null,{"$f":"Prop2021DistTar!AF5","v":"FcastVol\nFixed"},{"$f":"Prop2021DistTar!AG5","v":"FcastVol\nPkBlk1"},{"$f":"Prop2021DistTar!AH5","v":"FcastVol\nPkBlk2"},{"$f":"Prop2021DistTar!AI5","v":"FcastVol\nPkBlk3"},{"$f":"Prop2021DistTar!AJ5","v":"FcastVol\nPkBlk4"},{"$f":"Prop2021DistTar!AK5","v":"FcastVol\nOPkBlk1"},{"$f":"Prop2021DistTar!AL5","v":"FcastVol\nOPkBlk2"},{"$f":"Prop2021DistTar!AM5","v":"FcastVol\nOPkBlk3"},{"$f":"Prop2021DistTar!AN5","v":"FcastVol\nOPkBlk4"},{"$f":"Prop2021DistTar!AO5","v":"FcastVol\nDemBlk1"},{"$f":"Prop2021DistTar!AP5","v":"FcastVol\nDemBlk2"},{"$f":"Prop2021DistTar!AQ5","v":"FcastVol\nDemBlk3"},{"$f":"Prop2021DistTar!AR5","v":"FcastVol\nDemBlk4"},null,"PropRev\nFixed","PropRev\nPkBlk1","PropRev\nPkBlk2","PropRev\nPkBlk3","PropRev\nPkBlk4","PropRev\nOPkBlk1","PropRev\nOPkBlk2","PropRev\nOPkBlk3","PropRev\nOPkBlk4","PropRev\nDemBlk1","PropRev\nDemBlk2","PropRev\nDemBlk3","PropRev\nDemBlk4","PropRev\nTotal"]
[null,{"$f":"Prop2021DistTar!B6","v":"Low voltage small 1 rate"},null,0,2.13,0,0,2.13,0,0,0,0,0,0,0,0,null,{"$f":"Prop2021DistTar!AF6","v":105535115.09653191},{"$f":"Prop2021DistTar!AG6","v":575188203.86129987},{"$f":"Prop2021DistTar!AH6","v":0},{"$f":"Prop2021DistTar!AI6","v":0},{"$f":"Prop2021DistTar!AJ6","v":643558420.98122382},{"$f":"Prop2021DistTar!AK6","v":0},{"$f":"Prop2021DistTar!AL6","v":0},{"$f":"Prop2021DistTar!AM6","v":0},{"$f":"Prop2021DistTar!AN6","v":0},{"$f":"Prop2021DistTar!AO6","v":0},{"$f":"Prop2021DistTar!AP6","v":0},{"$f":"Prop2021DistTar!AQ6","v":0},{"$f":"Prop2021DistTar!AR6","v":0},null,{"$f":"D6/100*R6","v":0},{"$f":"E6/100*S6","v":12251508.742245687},0,0,13707794.366900068,0,0,0,0,{"$f":"M6/100*AA6","v":0},{"$f":"N6/100*AB6","v":0},0,0,{"$f":"SUM(AF6:AR6)","v":25959303.109145753}]
[null,{"$f":"Prop2021DistTar!B7","v":"Winter economy tariff"},null,0,2.12,0,0,2.12,0,0,0,0,0,0,0,0,null,{"$f":"Prop2021DistTar!AF7","v":20303.023296754887},{"$f":"Prop2021DistTar!AG7","v":181305.44113008108},{"$f":"Prop2021DistTar!AH7","v":0},{"$f":"Prop2021DistTar!AI7","v":0},{"$f":"Prop2021DistTar!AJ7","v":215568.44953139639},{"$f":"Prop2021DistTar!AK7","v":0},{"$f":"Prop2021DistTar!AL7","v":0},{"$f":"Prop2021DistTar!AM7","v":0},{"$f":"Prop2021DistTar!AN7","v":0},{"$f":"Prop2021DistTar!AO7","v":0},{"$f":"Prop2021DistTar!AP7","v":0},{"$f":"Prop2021DistTar!AQ7","v":0},{"$f":"Prop2021DistTar!AR7","v":0},null,{"$f":"D7/100*R7","v":0},{"$f":"E7/100*S7","v":3843.6753519577187},0,0,4570.0511300656035,0,0,0,0,{"$f":"M7/100*AA7","v":0},{"$f":"N7/100*AB7","v":0},{"$f":"O7/100*AC7","v":0},{"$f":"P7/100*AD7","v":0},{"$f":"SUM(AF7:AR7)","v":8413.7264820233213}]
[null,{"$f":"Prop2021DistTar!B8","v":"Low voltage small 2 rate"},null,0,0,0,3.8,0,0,3.8,0,0,0,0,0,0,null,{"$f":"Prop2021DistTar!AF8","v":742249.26611019217},{"$f":"Prop2021DistTar!AG8","v":0},{"$f":"Prop2021DistTar!AH8","v":0},{"$f":"Prop2021DistTar!AI8","v":2499563.8889361224},{"$f":"Prop2021DistTar!AJ8","v":0},{"$f":"Prop2021DistTar!AK8","v":0},{"$f":"Prop2021DistTar!AL8","v":2827981.9731418081},{"$f":"Prop2021DistTar!AM8","v":6999544.0116869658},{"$f":"Prop2021DistTar!AN8","v":0},{"$f":"Prop2021DistTar!AO8","v":0},{"$f":"Prop2021DistTar!AP8","v":0},{"$f":"Prop2021DistTar!AQ8","v":0},{"$f":"Prop2021DistTar!AR8","v":0},null,0,0,0,94983.427779572652,0,0,107463.3149793887,0,0,0,0,0,0,202446.74275896134]
[null,{"$f":"Prop2021DistTar!B9","v":"Dedicated circuit"},null,0,0,0,0,0,0,0,0,0,0,0,0,0,null,{"$f":"Prop2021DistTar!AF9","v":10497943.41526081},{"$f":"Prop2021DistTar!AG9","v":0},{"$f":"Prop2021DistTar!AH9","v":0},{"$f":"Prop2021DistTar!AI9","v":0},{"$f":"Prop2021DistTar!AJ9","v":0},{"$f":"Prop2021DistTar!AK9","v":0},{"$f":"Prop2021DistTar!AL9","v":0},{"$f":"Prop2021DistTar!AM9","v":39206702.567553177},{"$f":"Prop2021DistTar!AN9","v":0},{"$f":"Prop2021DistTar!AO9","v":0},{"$f":"Prop2021DistTar!AP9","v":0},{"$f":"Prop2021DistTar!AQ9","v":0},{"$f":"Prop2021DistTar!AR9","v":0},null,0,0,0,0,0,0,0,0,0,0,0,0,0,0]
[null,{"$f":"Prop2021DistTar!B10","v":"Low voltage medium 1 rate"},null,0,2.46,0,0,2.46,0,0,0,0,0,0,0,0,null,{"$f":"Prop2021DistTar!AF10","v":6562937.8381345402},{"$f":"Prop2021DistTar!AG10","v":93520651.506448358},{"$f":"Prop2021DistTar!AH10","v":0},{"$f":"Prop2021DistTar!AI10","v":0},{"$f":"Prop2021DistTar!AJ10","v":97984486.300557613},{"$f":"Prop2021DistTar!AK10","v":0},{"$f":"Prop2021DistTar!AL10","v":0},{"$f":"Prop2021DistTar!AM10","v":0},{"$f":"Prop2021DistTar!AN10","v":0},{"$f":"Prop2021DistTar!AO10","v":0},{"$f":"Prop2021DistTar!AP10","v":0},{"$f":"Prop2021DistTar!AQ10","v":0},{"$f":"Prop2021DistTar!AR10","v":0},null,0,2300608.0270586298,0,0,2410418.3629937172,0,0,0,0,0,0,0,0,4711026.3900523465]
[null,{"$f":"Prop2021DistTar!B11","v":"Low voltage medium 2 rate 5 day"},null,0,0,0,2.4,0,0,2.4,0,0,0,0,0,0,null,{"$f":"Prop2021DistTar!AF11","v":1691005.1507493043},{"$f":"Prop2021DistTar!AG11","v":0},{"$f":"Prop2021DistTar!AH11","v":0},{"$f":"Prop2021DistTar!AI11","v":25877867.250615567},{"$f":"Prop2021DistTar!AJ11","v":0},{"$f":"Prop2021DistTar!AK11","v":0},{"$f":"Prop2021DistTar!AL11","v":25255618.886176422},{"$f":"Prop2021DistTar!AM11","v":32072694.77859287},{"$f":"Prop2021DistTar!AN11","v":0},{"$f":"Prop2021DistTar!AO11","v":0},{"$f":"Prop2021DistTar!AP11","v":0},{"$f":"Prop2021DistTar!AQ11","v":0},{"$f":"Prop2021DistTar!AR11","v":0},null,0,0,0,621068.81401477358,0,0,606134.85326823418,0,0,0,0,0,0,1227203.6672830079]
[null,{"$f":"Prop2021DistTar!B12","v":"Low voltage medium 2 rate 7 day"},null,0,0,0,2.2999999999999998,0,0,2.2999999999999998,0,0,0,0,0,0,null,{"$f":"Prop2021DistTar!AF12","v":867755.01395936578},{"$f":"Prop2021DistTar!AG12","v":0},{"$f":"Prop2021DistTar!AH12","v":0},{"$f":"Prop2021DistTar!AI12","v":11704182.595948623},{"$f":"Prop2021DistTar!AJ12","v":0},{"$f":"Prop2021DistTar!AK12","v":0},{"$f":"Prop2021DistTar!AL12","v":12021985.872137187},{"$f":"Prop2021DistTar!AM12","v":6431319.9337531235},{"$f":"Prop2021DistTar!AN12","v":0},{"$f":"Prop2021DistTar!AO12","v":0},{"$f":"Prop2021DistTar!AP12","v":0},{"$f":"Prop2021DistTar!AQ12","v":0},{"$f":"Prop2021DistTar!AR12","v":0},null,0,0,0,269196.19970681833,0,0,276505.67505915527,0,0,0,0,0,0,545701.87476597354]
[null,{"$f":"Prop2021DistTar!B13","v":"Unmetered supplies"},null,0,0,0,3.38,0,0,3.38,0,0,0,0,0,0,null,{"$f":"Prop2021DistTar!AF13","v":1822729.9999999998},{"$f":"Prop2021DistTar!AG13","v":0},{"$f":"Prop2021DistTar!AH13","v":0},{"$f":"Prop2021DistTar!AI13","v":7902465.9846767429},{"$f":"Prop2021DistTar!AJ13","v":0},{"$f":"Prop2021DistTar!AK13","v":0},{"$f":"Prop2021DistTar!AL13","v":9120125.6545493584},{"$f":"Prop2021DistTar!AM13","v":31525884.811143644},{"$f":"Prop2021DistTar!AN13","v":0},{"$f":"Prop2021DistTar!AO13","v":0},{"$f":"Prop2021DistTar!AP13","v":0},{"$f":"Prop2021DistTar!AQ13","v":0},{"$f":"Prop2021DistTar!AR13","v":0},null,0,0,0,267103.35028207389,0,0,308260.24712376826,0,0,0,0,0,0,575363.59740584216]
[null,{"$f":"Prop2021DistTar!B14","v":"Low voltage large 1 rate"},null,0,2.46,0,0,2.46,0,0,0,0,0,0,0,0,null,{"$f":"Prop2021DistTar!AF14","v":1081.0901336703062},{"$f":"Prop2021DistTar!AG14","v":352696.68309867498},{"$f":"Prop2021DistTar!AH14","v":0},{"$f":"Prop2021DistTar!AI14","v":0},{"$f":"Prop2021DistTar!AJ14","v":338387.62591484992},{"$f":"Prop2021DistTar!AK14","v":0},{"$f":"Prop2021DistTar!AL14","v":0},{"$f":"Prop2021DistTar!AM14","v":0},{"$f":"Prop2021DistTar!AN14","v":0},{"$f":"Prop2021DistTar!AO14","v":0},{"$f":"Prop2021DistTar!AP14","v":0},{"$f":"Prop2021DistTar!AQ14","v":0},{"$f":"Prop2021DistTar!AR14","v":0},null,0,8676.3384042274047,0,0,8324.3355975053091,0,0,0,0,0,0,0,0,17000.674001732714]
[null,{"$f":"Prop2021DistTar!B15","v":"Low voltage large 2 rate"},null,0,0,0,2.68,0,0,2.68,0,0,0,0,0,0,null,{"$f":"Prop2021DistTar!AF15","v":2882.9070231208161},{"$f":"Prop2021DistTar!AG15","v":0},{"$f":"Prop2021DistTar!AH15","v":0},{"$f":"Prop2021DistTar!AI15","v":355464.96118598658},{"$f":"Prop2021DistTar!AJ15","v":0},{"$f":"Prop2021DistTar!AK15","v":0},{"$f":"Prop2021DistTar!AL15","v":291682.21993439464},{"$f":"Prop2021DistTar!AM15","v":434712.68038526608},{"$f":"Prop2021DistTar!AN15","v":0},{"$f":"Prop2021DistTar!AO15","v":0},{"$f":"Prop2021DistTar!AP15","v":0},{"$f":"Prop2021DistTar!AQ15","v":0},{"$f":"Prop2021DistTar!AR15","v":0},null,0,0,0,9526.460959784441,0,0,7817.0834942417769,0,0,0,0,0,0,17343.544454026218]
[null,{"$f":"Prop2021DistTar!B16","v":"Low voltage KW time of use"},null,0,0,0,2.0299999999999998,0,0,2.0299999999999998,0,0,0,10.75,null,null,null,{"$f":"Prop2021DistTar!AF16","v":33320.530094659756},{"$f":"Prop2021DistTar!AG16","v":0},{"$f":"Prop2021DistTar!AH16","v":0},{"$f":"Prop2021DistTar!AI16","v":1475141.7634062562},{"$f":"Prop2021DistTar!AJ16","v":0},{"$f":"Prop2021DistTar!AK16","v":0},{"$f":"Prop2021DistTar!AL16","v":1370460.8178543835},{"$f":"Prop2021DistTar!AM16","v":2593202.4501544498},{"$f":"Prop2021DistTar!AN16","v":0},{"$f":"Prop2021DistTar!AO16","v":0},{"$f":"Prop2021DistTar!AP16","v":392057.72600000002},{"$f":"Prop2021DistTar!AQ16","v":0},{"$f":"Prop2021DistTar!AR16","v":0},null,0,0,0,29945.377797147001,0,0,27820.354602443982,0,0,0,42146.205545000004,0,0,99911.937944590987]
[null,{"$f":"Prop2021DistTar!B17","v":"Low voltage KW time of use - HOT"},null,0,0,0,1.32,0,0,1.32,0,0,0,12.16,null,null,null,{"$f":"Prop2021DistTar!AF17","v":2716.3475620646541},{"$f":"Prop2021DistTar!AG17","v":0},{"$f":"Prop2021DistTar!AH17","v":0},{"$f":"Prop2021DistTar!AI17","v":19807.75144821703},{"$f":"Prop2021DistTar!AJ17","v":0},{"$f":"Prop2021DistTar!AK17","v":0},{"$f":"Prop2021DistTar!AL17","v":30069.462307987305},{"$f":"Prop2021DistTar!AM17","v":52684.780336454045},{"$f":"Prop2021DistTar!AN17","v":0},{"$f":"Prop2021DistTar!AO17","v":0},{"$f":"Prop2021DistTar!AP17","v":7608.503999999999},{"$f":"Prop2021DistTar!AQ17","v":0},{"$f":"Prop2021DistTar!AR17","v":0},null,0,0,0,261.46231911646481,0,0,396.91690246543243,0,0,0,925.19408639999983,0,0,1583.573307981897]
[null,{"$f":"Prop2021DistTar!B18","v":"Low voltage large KVA time of use"},null,0,0,0,1.05,0,0,1.05,0,0,4.99,6.8,0,0,null,{"$f":"Prop2021DistTar!AF18","v":541277.52420075017},{"$f":"Prop2021DistTar!AG18","v":0},{"$f":"Prop2021DistTar!AH18","v":0},{"$f":"Prop2021DistTar!AI18","v":266174636.98008817},{"$f":"Prop2021DistTar!AJ18","v":0},{"$f":"Prop2021DistTar!AK18","v":0},{"$f":"Prop2021DistTar!AL18","v":250479794.64188558},{"$f":"Prop2021DistTar!AM18","v":611889749.45024109},{"$f":"Prop2021DistTar!AN18","v":0},{"$f":"Prop2021DistTar!AO18","v":159541608.1137},{"$f":"Prop2021DistTar!AP18","v":56665442.457500003},{"$f":"Prop2021DistTar!AQ18","v":0},{"$f":"Prop2021DistTar!AR18","v":0},null,0,0,0,2794833.6882909262,0,0,2630037.8437397988,0,0,7961126.2448736299,3853250.0871100007,0,0,17239247.864014357]
[null,{"$f":"Prop2021DistTar!B19","v":"High voltage KVA time of use"},null,0,0,0,0.64,0,0,0.64,0,0,5.68,5.96,0,0,null,{"$f":"Prop2021DistTar!AF19","v":18018},{"$f":"Prop2021DistTar!AG19","v":0},{"$f":"Prop2021DistTar!AH19","v":0},{"$f":"Prop2021DistTar!AI19","v":105000326.05011946},{"$f":"Prop2021DistTar!AJ19","v":0},{"$f":"Prop2021DistTar!AK19","v":0},{"$f":"Prop2021DistTar!AL19","v":105357041.06071436},{"$f":"Prop2021DistTar!AM19","v":326268953.17554247},{"$f":"Prop2021DistTar!AN19","v":0},{"$f":"Prop2021DistTar!AO19","v":51478074.622400001},{"$f":"Prop2021DistTar!AP19","v":19753789.0211},{"$f":"Prop2021DistTar!AQ19","v":0},{"$f":"Prop2021DistTar!AR19","v":0},null,0,0,0,672002.08672076452,0,0,674285.06278857193,0,0,2923954.6385523197,1177325.82565756,0,0,5447567.6137192156]
[null,{"$f":"Prop2021DistTar!B20","v":"Subtransmission KVA time of use"},null,0,0,0,0.39,0,0,0.39,0,0,4.5999999999999996,5.59,0,0,null,{"$f":"Prop2021DistTar!AF20","v":182},{"$f":"Prop2021DistTar!AG20","v":0},{"$f":"Prop2021DistTar!AH20","v":0},{"$f":"Prop2021DistTar!AI20","v":3670916.3505270658},{"$f":"Prop2021DistTar!AJ20","v":0},{"$f":"Prop2021DistTar!AK20","v":0},{"$f":"Prop2021DistTar!AL20","v":3584660.5425760043},{"$f":"Prop2021DistTar!AM20","v":5707425.9826134173},{"$f":"Prop2021DistTar!AN20","v":0},{"$f":"Prop2021DistTar!AO20","v":2018875.2197},{"$f":"Prop2021DistTar!AP20","v":704348.9277},{"$f":"Prop2021DistTar!AQ20","v":0},{"$f":"Prop2021DistTar!AR20","v":0},null,0,0,0,14316.573767055557,0,0,13980.176116046418,0,0,92868.260106200003,39373.105058429996,0,0,160538.11504773196]
[null,{"$f":"Prop2021DistTar!B21","v":"TOD"},null,0,0,3.56,4.0999999999999996,0,0,4.0999999999999996,0,3.56,0,0,0,0,null,{"$f":"Prop2021DistTar!AF21","v":7805872.2721829861},{"$f":"Prop2021DistTar!AG21","v":0},{"$f":"Prop2021DistTar!AH21","v":7967927.95541621},{"$f":"Prop2021DistTar!AI21","v":13923627.86509141},{"$f":"Prop2021DistTar!AJ21","v":0},{"$f":"Prop2021DistTar!AK21","v":0},{"$f":"Prop2021DistTar!AL21","v":18072449.615387656},{"$f":"Prop2021DistTar!AM21","v":54011897.043529466},{"$f":"Prop2021DistTar!AN21","v":10342130.507116426},{"$f":"Prop2021DistTar!AO21","v":0},{"$f":"Prop2021DistTar!AP21","v":0},{"$f":"Prop2021DistTar!AQ21","v":0},{"$f":"Prop2021DistTar!AR21","v":0},null,0,0,283658.23521281709,570868.74246874778,0,0,740970.43423089385,0,368179.84605334478,0,0,0,0,1963677.2579658036]
[null,{"$f":"Prop2021DistTar!B22","v":"TOD9"},null,0,0,5.0199999999999996,5.32,0,0,5.32,0,5.0199999999999996,0,0,0,0,null,{"$f":"Prop2021DistTar!AF22","v":647318.9139388788},{"$f":"Prop2021DistTar!AG22","v":0},{"$f":"Prop2021DistTar!AH22","v":493655.1561192635},{"$f":"Prop2021DistTar!AI22","v":732234.77661798592},{"$f":"Prop2021DistTar!AJ22","v":0},{"$f":"Prop2021DistTar!AK22","v":0},{"$f":"Prop2021DistTar!AL22","v":1128201.9245410122},{"$f":"Prop2021DistTar!AM22","v":5034512.0861314908},{"$f":"Prop2021DistTar!AN22","v":760606.72748394939},{"$f":"Prop2021DistTar!AO22","v":0},{"$f":"Prop2021DistTar!AP22","v":0},{"$f":"Prop2021DistTar!AQ22","v":0},{"$f":"Prop2021DistTar!AR22","v":0},null,0,0,24781.488837187026,38954.890116076851,0,0,60020.342385581855,0,38182.457719694256,0,0,0,0,161939.17905853997]
[null,{"$f":"Prop2021DistTar!B23","v":"TOU"},null,0,0,0,1.79,0,0,1.79,0,0,0,7.04,null,0,null,{"$f":"Prop2021DistTar!AF23","v":145958.40900160742},{"$f":"Prop2021DistTar!AG23","v":0},{"$f":"Prop2021DistTar!AH23","v":0},{"$f":"Prop2021DistTar!AI23","v":2992497.1553457095},{"$f":"Prop2021DistTar!AJ23","v":0},{"$f":"Prop2021DistTar!AK23","v":0},{"$f":"Prop2021DistTar!AL23","v":3490165.6408265438},{"$f":"Prop2021DistTar!AM23","v":5333993.1667220592},{"$f":"Prop2021DistTar!AN23","v":0},{"$f":"Prop2021DistTar!AO23","v":0},{"$f":"Prop2021DistTar!AP23","v":729616.78200000001},{"$f":"Prop2021DistTar!AQ23","v":0},{"$f":"Prop2021DistTar!AR23","v":0},null,0,0,0,53565.699080688195,0,0,62473.964970795132,0,0,0,51365.021452800007,0,0,167404.68550428335]
[null,{"$f":"Prop2021DistTar!B24","v":"TODFLEX"},null,0,0,2.1,4.34,0,0,4.34,0,2.1,0,0,0,0,null,{"$f":"Prop2021DistTar!AF24","v":344785.57580525189},{"$f":"Prop2021DistTar!AG24","v":0},{"$f":"Prop2021DistTar!AH24","v":967908.70972557599},{"$f":"Prop2021DistTar!AI24","v":472439.17656686797},{"$f":"Prop2021DistTar!AJ24","v":0},{"$f":"Prop2021DistTar!AK24","v":0},{"$f":"Prop2021DistTar!AL24","v":562268.62769869901},{"$f":"Prop2021DistTar!AM24","v":1658072.4170597466},{"$f":"Prop2021DistTar!AN24","v":1151946.5974642553},{"$f":"Prop2021DistTar!AO24","v":0},{"$f":"Prop2021DistTar!AP24","v":0},{"$f":"Prop2021DistTar!AQ24","v":0},{"$f":"Prop2021DistTar!AR24","v":0},null,0,0,20326.082904237097,20503.860263002072,0,0,24402.458442123538,0,24190.878546749362,0,0,0,0,89423.280156112058]
[null,{"$f":"Prop2021DistTar!B25","v":"Low Voltage KW 1 rate"},null,0,0.48,0,0.48,0,0,0.48,0,0,0,0,3.59,2.33,null,{"$f":"Prop2021DistTar!AF25","v":232295.85213404242},{"$f":"Prop2021DistTar!AG25","v":0},{"$f":"Prop2021DistTar!AH25","v":0},{"$f":"Prop2021DistTar!AI25","v":1080042.5065605589},{"$f":"Prop2021DistTar!AJ25","v":0},{"$f":"Prop2021DistTar!AK25","v":0},{"$f":"Prop2021DistTar!AL25","v":1337152.6557526211},{"$f":"Prop2021DistTar!AM25","v":0},{"$f":"Prop2021DistTar!AN25","v":0},{"$f":"Prop2021DistTar!AO25","v":0},{"$f":"Prop2021DistTar!AP25","v":0},{"$f":"Prop2021DistTar!AQ25","v":184376.2935},{"$f":"Prop2021DistTar!AR25","v":168329.12365077398},null,0,0,0,5184.2040314906826,0,0,6418.3327476125805,0,0,0,0,6619.10893665,3922.0685810630339,22143.714296816299]
[null,{"$f":"Prop2021DistTar!B26","v":"Low voltage medium KW time of use (opt-in)"},null,0,1,0,1,0,0,1,0,0,0,0,11.31,7.53,null,{"$f":"Prop2021DistTar!AF26","v":0},{"$f":"Prop2021DistTar!AG26","v":0},{"$f":"Prop2021DistTar!AH26","v":0},{"$f":"Prop2021DistTar!AI26","v":0},{"$f":"Prop2021DistTar!AJ26","v":0},{"$f":"Prop2021DistTar!AK26","v":0},{"$f":"Prop2021DistTar!AL26","v":0},{"$f":"Prop2021DistTar!AM26","v":0},{"$f":"Prop2021DistTar!AN26","v":0},{"$f":"Prop2021DistTar!AO26","v":0},{"$f":"Prop2021DistTar!AP26","v":0},{"$f":"Prop2021DistTar!AQ26","v":0},{"$f":"Prop2021DistTar!AR26","v":0},null,0,0,0,0,0,0,0,0,0,0,0,0,0,0]
[null,{"$f":"Prop2021DistTar!B27","v":"Low voltage medium KW 1 rate (mandatory)"},null,0,0.97,0,0.97,0,0,0.97,0,0,0,0,10.9,7.26,null,{"$f":"Prop2021DistTar!AF27","v":1304571.1891409182},{"$f":"Prop2021DistTar!AG27","v":0},{"$f":"Prop2021DistTar!AH27","v":0},{"$f":"Prop2021DistTar!AI27","v":152577673.09952593},{"$f":"Prop2021DistTar!AJ27","v":0},{"$f":"Prop2021DistTar!AK27","v":0},{"$f":"Prop2021DistTar!AL27","v":146200098.8108809},{"$f":"Prop2021DistTar!AM27","v":0},{"$f":"Prop2021DistTar!AN27","v":0},{"$f":"Prop2021DistTar!AO27","v":0},{"$f":"Prop2021DistTar!AP27","v":0},{"$f":"Prop2021DistTar!AQ27","v":20233521.012785185},{"$f":"Prop2021DistTar!AR27","v":18174103.867105875},null,0,0,0,1480003.4290654017,0,0,1418140.9584655447,0,0,0,0,2205453.7903935853,1319439.9407518865,6423038.1186764184]
[null,null,null,null,null,null,null,null,null,null,null,null,null,null,null,null,null,{"$f":"Prop2021DistTar!AF28","v":0},{"$f":"Prop2021DistTar!AG28","v":0},{"$f":"Prop2021DistTar!AH28","v":0},{"$f":"Prop2021DistTar!AI28","v":0},{"$f":"Prop2021DistTar!AJ28","v":0},{"$f":"Prop2021DistTar!AK28","v":0},{"$f":"Prop2021DistTar!AL28","v":0},{"$f":"Prop2021DistTar!AM28","v":0},{"$f":"Prop2021DistTar!AN28","v":0},{"$f":"Prop2021DistTar!AO28","v":0},{"$f":"Prop2021DistTar!AP28","v":0},{"$f":"Prop2021DistTar!AQ28","v":0},{"$f":"Prop2021DistTar!AR28","v":0},null,0,0,0,0,0,0,0,0,0,0,0,0,0,0]
[null,null,null,null,null,null,null,null,null,null,null,null,null,null,null,null,null,{"$f":"Prop2021DistTar!AF29","v":0},{"$f":"Prop2021DistTar!AG29","v":0},{"$f":"Prop2021DistTar!AH29","v":0},{"$f":"Prop2021DistTar!AI29","v":0},{"$f":"Prop2021DistTar!AJ29","v":0},{"$f":"Prop2021DistTar!AK29","v":0},{"$f":"Prop2021DistTar!AL29","v":0},{"$f":"Prop2021DistTar!AM29","v":0},{"$f":"Prop2021DistTar!AN29","v":0},{"$f":"Prop2021DistTar!AO29","v":0},{"$f":"Prop2021DistTar!AP29","v":0},{"$f":"Prop2021DistTar!AQ29","v":0},{"$f":"Prop2021DistTar!AR29","v":0},null,0,0,0,0,0,0,0,0,0,0,0,0,0,0]
[null,null,null,null,null,null,null,null,null,null,null,null,null,null,null,null,null,{"$f":"Prop2021DistTar!AF30","v":0},{"$f":"Prop2021DistTar!AG30","v":0},{"$f":"Prop2021DistTar!AH30","v":0},{"$f":"Prop2021DistTar!AI30","v":0},{"$f":"Prop2021DistTar!AJ30","v":0},{"$f":"Prop2021DistTar!AK30","v":0},{"$f":"Prop2021DistTar!AL30","v":0},{"$f":"Prop2021DistTar!AM30","v":0},{"$f":"Prop2021DistTar!AN30","v":0},{"$f":"Prop2021DistTar!AO30","v":0},{"$f":"Prop2021DistTar!AP30","v":0},{"$f":"Prop2021DistTar!AQ30","v":0},{"$f":"Prop2021DistTar!AR30","v":0},null,0,0,0,0,0,0,0,0,0,0,0,0,0,0]
[null,null,null,null,null,null,null,null,null,null,null,null,null,null,null,null,null,{"$f":"Prop2021DistTar!AF31","v":0},{"$f":"Prop2021DistTar!AG31","v":0},{"$f":"Prop2021DistTar!AH31","v":0},{"$f":"Prop2021DistTar!AI31","v":0},{"$f":"Prop2021DistTar!AJ31","v":0},{"$f":"Prop2021DistTar!AK31","v":0},{"$f":"Prop2021DistTar!AL31","v":0},{"$f":"Prop2021DistTar!AM31","v":0},{"$f":"Prop2021DistTar!AN31","v":0},{"$f":"Prop2021DistTar!AO31","v":0},{"$f":"Prop2021DistTar!AP31","v":0},{"$f":"Prop2021DistTar!AQ31","v":0},{"$f":"Prop2021DistTar!AR31","v":0},null,0,0,0,0,0,0,0,0,0,0,0,0,0,0]
[null,null,null,null,null,null,null,null,null,null,null,null,null,null,null,null,null,{"$f":"Prop2021DistTar!AF32","v":0},{"$f":"Prop2021DistTar!AG32","v":0},{"$f":"Prop2021DistTar!AH32","v":0},{"$f":"Prop2021DistTar!AI32","v":0},{"$f":"Prop2021DistTar!AJ32","v":0},{"$f":"Prop2021DistTar!AK32","v":0},{"$f":"Prop2021DistTar!AL32","v":0},{"$f":"Prop2021DistTar!AM32","v":0},{"$f":"Prop2021DistTar!AN32","v":0},{"$f":"Prop2021DistTar!AO32","v":0},{"$f":"Prop2021DistTar!AP32","v":0},{"$f":"Prop2021DistTar!AQ32","v":0},{"$f":"Prop2021DistTar!AR32","v":0},null,0,{"$f":"E32/100*S32","v":0},0,0,0,0,0,0,0,0,0,0,0,{"$f":"SUM(AF32:AR32)","v":0}]
[null,null,null,null,null,null,null,null,null,null,null,null,null,null,null,null,null,{"$f":"Prop2021DistTar!AF33","v":0},{"$f":"Prop2021DistTar!AG33","v":0},{"$f":"Prop2021DistTar!AH33","v":0},{"$f":"Prop2021DistTar!AI33","v":0},{"$f":"Prop2021DistTar!AJ33","v":0},{"$f":"Prop2021DistTar!AK33","v":0},{"$f":"Prop2021DistTar!AL33","v":0},{"$f":"Prop2021DistTar!AM33","v":0},{"$f":"Prop2021DistTar!AN33","v":0},{"$f":"Prop2021DistTar!AO33","v":0},{"$f":"Prop2021DistTar!AP33","v":0},{"$f":"Prop2021DistTar!AQ33","v":0},{"$f":"Prop2021DistTar!AR33","v":0},null,0,0,0,0,0,0,0,0,0,0,0,0,0,0]
[null,null,null,null,null,null,null,null,null,null,null,null,null,null,null,null,null,{"$f":"Prop2021DistTar!AF34","v":0},{"$f":"Prop2021DistTar!AG34","v":0},{"$f":"Prop2021DistTar!AH34","v":0},{"$f":"Prop2021DistTar!AI34","v":0},{"$f":"Prop2021DistTar!AJ34","v":0},{"$f":"Prop2021DistTar!AK34","v":0},{"$f":"Prop2021DistTar!AL34","v":0},{"$f":"Prop2021DistTar!AM34","v":0},{"$f":"Prop2021DistTar!AN34","v":0},{"$f":"Prop2021DistTar!AO34","v":0},{"$f":"Prop2021DistTar!AP34","v":0},{"$f":"Prop2021DistTar!AQ34","v":0},{"$f":"Prop2021DistTar!AR34","v":0},null,0,0,0,0,0,0,0,0,0,0,0,0,0,0]
[null,null,null,null,null,null,null,null,null,null,null,null,null,null,null,null,null,{"$f":"Prop2021DistTar!AF35","v":0},{"$f":"Prop2021DistTar!AG35","v":0},{"$f":"Prop2021DistTar!AH35","v":0},{"$f":"Prop2021DistTar!AI35","v":0},{"$f":"Prop2021DistTar!AJ35","v":0},{"$f":"Prop2021DistTar!AK35","v":0},{"$f":"Prop2021DistTar!AL35","v":0},{"$f":"Prop2021DistTar!AM35","v":0},{"$f":"Prop2021DistTar!AN35","v":0},{"$f":"Prop2021DistTar!AO35","v":0},{"$f":"Prop2021DistTar!AP35","v":0},{"$f":"Prop2021DistTar!AQ35","v":0},{"$f":"Prop2021DistTar!AR35","v":0},null,0,0,0,0,0,0,0,0,0,0,0,0,0,0]
[null,null,null,null,null,null,null,null,null,null,null,null,null,null,null,null,null,{"$f":"Prop2021DistTar!AF36","v":0},{"$f":"Prop2021DistTar!AG36","v":0},{"$f":"Prop2021DistTar!AH36","v":0},{"$f":"Prop2021DistTar!AI36","v":0},{"$f":"Prop2021DistTar!AJ36","v":0},{"$f":"Prop2021DistTar!AK36","v":0},{"$f":"Prop2021DistTar!AL36","v":0},{"$f":"Prop2021DistTar!AM36","v":0},{"$f":"Prop2021DistTar!AN36","v":0},{"$f":"Prop2021DistTar!AO36","v":0},{"$f":"Prop2021DistTar!AP36","v":0},{"$f":"Prop2021DistTar!AQ36","v":0},{"$f":"Prop2021DistTar!AR36","v":0},null,0,0,0,0,0,0,0,0,0,0,0,0,0,0]
[null,null,null,null,null,null,null,null,null,null,null,null,null,null,null,null,null,{"$f":"Prop2021DistTar!AF37","v":0},{"$f":"Prop2021DistTar!AG37","v":0},{"$f":"Prop2021DistTar!AH37","v":0},{"$f":"Prop2021DistTar!AI37","v":0},{"$f":"Prop2021DistTar!AJ37","v":0},{"$f":"Prop2021DistTar!AK37","v":0},{"$f":"Prop2021DistTar!AL37","v":0},{"$f":"Prop2021DistTar!AM37","v":0},{"$f":"Prop2021DistTar!AN37","v":0},{"$f":"Prop2021DistTar!AO37","v":0},{"$f":"Prop2021DistTar!AP37","v":0},{"$f":"Prop2021DistTar!AQ37","v":0},{"$f":"Prop2021DistTar!AR37","v":0},null,0,0,0,0,0,0,0,0,0,0,0,0,0,0]
[null,null,null,null,null,null,null,null,null,null,null,null,null,null,null,null,null,{"$f":"Prop2021DistTar!AF38","v":0},{"$f":"Prop2021DistTar!AG38","v":0},{"$f":"Prop2021DistTar!AH38","v":0},{"$f":"Prop2021DistTar!AI38","v":0},{"$f":"Prop2021DistTar!AJ38","v":0},{"$f":"Prop2021DistTar!AK38","v":0},{"$f":"Prop2021DistTar!AL38","v":0},{"$f":"Prop2021DistTar!AM38","v":0},{"$f":"Prop2021DistTar!AN38","v":0},{"$f":"Prop2021DistTar!AO38","v":0},{"$f":"Prop2021DistTar!AP38","v":0},{"$f":"Prop2021DistTar!AQ38","v":0},{"$f":"Prop2021DistTar!AR38","v":0},null,0,0,0,0,0,0,0,0,0,0,0,0,0,0]
[null,null,null,null,null,null,null,null,null,null,null,null,null,null,null,null,null,{"$f":"Prop2021DistTar!AF39","v":0},{"$f":"Prop2021DistTar!AG39","v":0},{"$f":"Prop2021DistTar!AH39","v":0},{"$f":"Prop2021DistTar!AI39","v":0},{"$f":"Prop2021DistTar!AJ39","v":0},{"$f":"Prop2021DistTar!AK39","v":0},{"$f":"Prop2021DistTar!AL39","v":0},{"$f":"Prop2021DistTar!AM39","v":0},{"$f":"Prop2021DistTar!AN39","v":0},{"$f":"Prop2021DistTar!AO39","v":0},{"$f":"Prop2021DistTar!AP39","v":0},{"$f":"Prop2021DistTar!AQ39","v":0},{"$f":"Prop2021DistTar!AR39","v":0},null,0,0,0,0,0,0,0,0,0,0,0,0,0,0]
[null,null,null,null,null,null,null,null,null,null,null,null,null,null,null,null,null,{"$f":"Prop2021DistTar!AF40","v":0},{"$f":"Prop2021DistTar!AG40","v":0},{"$f":"Prop2021DistTar!AH40","v":0},{"$f":"Prop2021DistTar!AI40","v":0},{"$f":"Prop2021DistTar!AJ40","v":0},{"$f":"Prop2021DistTar!AK40","v":0},{"$f":"Prop2021DistTar!AL40","v":0},{"$f":"Prop2021DistTar!AM40","v":0},{"$f":"Prop2021DistTar!AN40","v":0},{"$f":"Prop2021DistTar!AO40","v":0},{"$f":"Prop2021DistTar!AP40","v":0},{"$f":"Prop2021DistTar!AQ40","v":0},{"$f":"Prop2021DistTar!AR40","v":0},null,0,0,0,0,0,0,0,0,0,0,0,0,0,0]
[null,null,null,null,null,null,null,null,null,null,null,null,null,null,null,null,null,{"$f":"Prop2021DistTar!AF41","v":0},{"$f":"Prop2021DistTar!AG41","v":0},{"$f":"Prop2021DistTar!AH41","v":0},{"$f":"Prop2021DistTar!AI41","v":0},{"$f":"Prop2021DistTar!AJ41","v":0},{"$f":"Prop2021DistTar!AK41","v":0},{"$f":"Prop2021DistTar!AL41","v":0},{"$f":"Prop2021DistTar!AM41","v":0},{"$f":"Prop2021DistTar!AN41","v":0},{"$f":"Prop2021DistTar!AO41","v":0},{"$f":"Prop2021DistTar!AP41","v":0},{"$f":"Prop2021DistTar!AQ41","v":0},{"$f":"Prop2021DistTar!AR41","v":0},null,0,0,0,0,0,0,0,0,0,0,0,0,0,0]
[null,null,null,null,null,null,null,null,null,null,null,null,null,null,null,null,null,{"$f":"Prop2021DistTar!AF42","v":0},{"$f":"Prop2021DistTar!AG42","v":0},{"$f":"Prop2021DistTar!AH42","v":0},{"$f":"Prop2021DistTar!AI42","v":0},{"$f":"Prop2021DistTar!AJ42","v":0},{"$f":"Prop2021DistTar!AK42","v":0},{"$f":"Prop2021DistTar!AL42","v":0},{"$f":"Prop2021DistTar!AM42","v":0},{"$f":"Prop2021DistTar!AN42","v":0},{"$f":"Prop2021DistTar!AO42","v":0},{"$f":"Prop2021DistTar!AP42","v":0},{"$f":"Prop2021DistTar!AQ42","v":0},{"$f":"Prop2021DistTar!AR42","v":0},null,0,0,0,0,0,0,0,0,0,0,0,0,0,0]
[null,null,null,null,null,null,null,null,null,null,null,null,null,null,null,null,null,{"$f":"Prop2021DistTar!AF43","v":0},{"$f":"Prop2021DistTar!AG43","v":0},{"$f":"Prop2021DistTar!AH43","v":0},{"$f":"Prop2021DistTar!AI43","v":0},{"$f":"Prop2021DistTar!AJ43","v":0},{"$f":"Prop2021DistTar!AK43","v":0},{"$f":"Prop2021DistTar!AL43","v":0},{"$f":"Prop2021DistTar!AM43","v":0},{"$f":"Prop2021DistTar!AN43","v":0},{"$f":"Prop2021DistTar!AO43","v":0},{"$f":"Prop2021DistTar!AP43","v":0},{"$f":"Prop2021DistTar!AQ43","v":0},{"$f":"Prop2021DistTar!AR43","v":0},null,0,0,0,0,0,0,0,0,0,0,0,0,0,0]
[null,null,null,null,null,null,null,null,null,null,null,null,null,null,null,null,null,{"$f":"Prop2021DistTar!AF44","v":0},{"$f":"Prop2021DistTar!AG44","v":0},{"$f":"Prop2021DistTar!AH44","v":0},{"$f":"Prop2021DistTar!AI44","v":0},{"$f":"Prop2021DistTar!AJ44","v":0},{"$f":"Prop2021DistTar!AK44","v":0},{"$f":"Prop2021DistTar!AL44","v":0},{"$f":"Prop2021DistTar!AM44","v":0},{"$f":"Prop2021DistTar!AN44","v":0},{"$f":"Prop2021DistTar!AO44","v":0},{"$f":"Prop2021DistTar!AP44","v":0},{"$f":"Prop2021DistTar!AQ44","v":0},{"$f":"Prop2021DistTar!AR44","v":0},null,0,0,0,0,0,0,0,0,0,0,0,0,0,0]
[null,null,null,null,null,null,null,null,null,null,null,null,null,null,null,null,null,{"$f":"Prop2021DistTar!AF45","v":0},{"$f":"Prop2021DistTar!AG45","v":0},{"$f":"Prop2021DistTar!AH45","v":0},{"$f":"Prop2021DistTar!AI45","v":0},{"$f":"Prop2021DistTar!AJ45","v":0},{"$f":"Prop2021DistTar!AK45","v":0},{"$f":"Prop2021DistTar!AL45","v":0},{"$f":"Prop2021DistTar!AM45","v":0},{"$f":"Prop2021DistTar!AN45","v":0},{"$f":"Prop2021DistTar!AO45","v":0},{"$f":"Prop2021DistTar!AP45","v":0},{"$f":"Prop2021DistTar!AQ45","v":0},{"$f":"Prop2021DistTar!AR45","v":0},null,0,0,0,0,0,0,0,0,0,0,0,0,0,0]
[null,null,null,null,null,null,null,null,null,null,null,null,null,null,null,null,null,{"$f":"Prop2021DistTar!AF46","v":0},{"$f":"Prop2021DistTar!AG46","v":0},{"$f":"Prop2021DistTar!AH46","v":0},{"$f":"Prop2021DistTar!AI46","v":0},{"$f":"Prop2021DistTar!AJ46","v":0},{"$f":"Prop2021DistTar!AK46","v":0},{"$f":"Prop2021DistTar!AL46","v":0},{"$f":"Prop2021DistTar!AM46","v":0},{"$f":"Prop2021DistTar!AN46","v":0},{"$f":"Prop2021DistTar!AO46","v":0},{"$f":"Prop2021DistTar!AP46","v":0},{"$f":"Prop2021DistTar!AQ46","v":0},{"$f":"Prop2021DistTar!AR46","v":0},null,0,0,0,0,0,0,0,0,0,0,0,0,0,0]
[null,null,null,null,null,null,null,null,null,null,null,null,null,null,null,null,null,{"$f":"Prop2021DistTar!AF47","v":0},{"$f":"Prop2021DistTar!AG47","v":0},{"$f":"Prop2021DistTar!AH47","v":0},{"$f":"Prop2021DistTar!AI47","v":0},{"$f":"Prop2021DistTar!AJ47","v":0},{"$f":"Prop2021DistTar!AK47","v":0},{"$f":"Prop2021DistTar!AL47","v":0},{"$f":"Prop2021DistTar!AM47","v":0},{"$f":"Prop2021DistTar!AN47","v":0},{"$f":"Prop2021DistTar!AO47","v":0},{"$f":"Prop2021DistTar!AP47","v":0},{"$f":"Prop2021DistTar!AQ47","v":0},{"$f":"Prop2021DistTar!AR47","v":0},null,0,0,0,0,0,0,0,0,0,0,0,0,0,0]
[null,null,null,null,null,null,null,null,null,null,null,null,null,null,null,null,null,{"$f":"Prop2021DistTar!AF48","v":0},{"$f":"Prop2021DistTar!AG48","v":0},{"$f":"Prop2021DistTar!AH48","v":0},{"$f":"Prop2021DistTar!AI48","v":0},{"$f":"Prop2021DistTar!AJ48","v":0},{"$f":"Prop2021DistTar!AK48","v":0},{"$f":"Prop2021DistTar!AL48","v":0},{"$f":"Prop2021DistTar!AM48","v":0},{"$f":"Prop2021DistTar!AN48","v":0},{"$f":"Prop2021DistTar!AO48","v":0},{"$f":"Prop2021DistTar!AP48","v":0},{"$f":"Prop2021DistTar!AQ48","v":0},{"$f":"Prop2021DistTar!AR48","v":0},null,0,0,0,0,0,0,0,0,0,0,0,0,0,0]
[null,null,null,null,null,null,null,null,null,null,null,null,null,null,null,null,null,{"$f":"Prop2021DistTar!AF49","v":0},{"$f":"Prop2021DistTar!AG49","v":0},{"$f":"Prop2021DistTar!AH49","v":0},{"$f":"Prop2021DistTar!AI49","v":0},{"$f":"Prop2021DistTar!AJ49","v":0},{"$f":"Prop2021DistTar!AK49","v":0},{"$f":"Prop2021DistTar!AL49","v":0},{"$f":"Prop2021DistTar!AM49","v":0},{"$f":"Prop2021DistTar!AN49","v":0},{"$f":"Prop2021DistTar!AO49","v":0},{"$f":"Prop2021DistTar!AP49","v":0},{"$f":"Prop2021DistTar!AQ49","v":0},{"$f":"Prop2021DistTar!AR49","v":0},null,0,0,0,0,0,0,0,0,0,0,0,0,0,0]
[null,null,null,null,null,null,null,null,null,null,null,null,null,null,null,null,null,{"$f":"Prop2021DistTar!AF50","v":0},{"$f":"Prop2021DistTar!AG50","v":0},{"$f":"Prop2021DistTar!AH50","v":0},{"$f":"Prop2021DistTar!AI50","v":0},{"$f":"Prop2021DistTar!AJ50","v":0},{"$f":"Prop2021DistTar!AK50","v":0},{"$f":"Prop2021DistTar!AL50","v":0},{"$f":"Prop2021DistTar!AM50","v":0},{"$f":"Prop2021DistTar!AN50","v":0},{"$f":"Prop2021DistTar!AO50","v":0},{"$f":"Prop2021DistTar!AP50","v":0},{"$f":"Prop2021DistTar!AQ50","v":0},{"$f":"Prop2021DistTar!AR50","v":0},null,0,0,0,0,0,0,0,0,0,0,0,0,0,0]
[null,null,null,null,null,null,null,null,null,null,null,null,null,null,null,null,null,{"$f":"Prop2021DistTar!AF51","v":0},{"$f":"Prop2021DistTar!AG51","v":0},{"$f":"Prop2021DistTar!AH51","v":0},{"$f":"Prop2021DistTar!AI51","v":0},{"$f":"Prop2021DistTar!AJ51","v":0},{"$f":"Prop2021DistTar!AK51","v":0},{"$f":"Prop2021DistTar!AL51","v":0},{"$f":"Prop2021DistTar!AM51","v":0},{"$f":"Prop2021DistTar!AN51","v":0},{"$f":"Prop2021DistTar!AO51","v":0},{"$f":"Prop2021DistTar!AP51","v":0},{"$f":"Prop2021DistTar!AQ51","v":0},{"$f":"Prop2021DistTar!AR51","v":0},null,0,0,0,0,0,0,0,0,0,0,0,0,0,0]
[null,null,null,null,null,null,null,null,null,null,null,null,null,null,null,null,null,null,null,null,null,null,null,null,null,null,null,null,null,null,null,0,{"$f":"E52/100*S52","v":0},0,0,0,0,0,0,0,0,0,0,0,0]
[null,null,null,null,null,null,null,null,null,null,null,null,null,null,null,null,null,null,null,null,null,null,null,null,null,null,null,null,null,null,null,0,0,0,0,0,0,0,0,0,0,0,0,0,0]
[null,null,null,null,null,null,null,null,null,null,null,null,null,null,null,null,null,null,null,null,null,null,null,null,null,null,null,null,null,null,null,0,0,0,0,0,0,0,0,0,0,0,0,0,0]
[null,null,null,null,null,null,null,null,null,null,null,null,null,null,null,null,null,null,null,null,null,null,null,null,null,null,null,null,null,null,null,0,0,0,0,0,0,0,0,0,0,0,0,0,0]
[null,null,null,null,null,null,null,null,null,null,null,null,null,null,null,null,null,null,null,null,null,null,null,null,null,null,null,null,null,null,null,0,0,0,0,0,0,0,0,0,0,0,0,0,0]
[null,null,null,null,null,null,null,null,null,null,null,null,null,null,null,null,null,null,null,null,null,null,null,null,null,null,null,null,null,null,null,0,0,0,0,0,0,0,0,0,0,0,0,0,0]
[null,null,null,null,null,null,null,null,null,null,null,null,null,null,null,null,null,null,null,null,null,null,null,null,null,null,null,null,null,null,null,0,0,0,0,0,0,0,0,0,0,0,0,0,0]
[null,null,null,null,null,null,null,null,null,null,null,null,null,null,null,null,null,null,null,null,null,null,null,null,null,null,null,null,null,null,null,0,0,0,0,0,0,0,0,0,0,0,0,0,0]
[null,null,null,null,null,null,null,null,null,null,null,null,null,null,null,null,null,null,null,null,null,null,null,null,null,null,null,null,null,null,null,0,0,0,0,0,0,0,0,0,0,0,0,0,0]
[null,null,null,null,null,null,null,null,null,null,null,null,null,null,null,null,null,null,null,null,null,null,null,null,null,null,null,null,null,null,null,0,0,0,0,0,0,0,0,0,0,0,0,0,0]
[null,null,null,null,null,null,null,null,null,null,null,null,null,null,null,null,null,null,null,null,null,null,null,null,null,null,null,null,null,null,null,0,0,0,0,0,0,0,0,0,0,0,0,0,0]
[null,null,null,null,null,null,null,null,null,null,null,null,null,null,null,null,null,{"$f":"SUM(R6:R62)","v":138820319.41526082},669242857.49197698,9429491.8212610483,596458888.15666056,742096863.35722768,0,581129758.40636492,1129221349.3354456,12254683.83206463,213038557.95580003,78252863.418300003,20417897.306285184,18342432.99075665,null,{"$f":"SUM(AF6:AF62)","v":0},14564636.7830605,328765.80695424118,6942318.2666634396,16131107.116621356,0,6965128.0193166668,{"$f":"SUM(AM6:AM62)","v":0},430553.18231978838,10977949.143532149,5164385.4389101909,2212072.8993302356,1323362.0093329495,65040278.666041508]

{"sheet":"2021TransRevCont","index":14,"n_rows":19,"n_cols":3,"rows_kept":19,"cut":false,"hidden":false,"merged":[]}
[]
[null,{"$f":"\"Tariff Approval - \"&'Model update'!$C$3","v":"Tariff Approval - United Energy"},{"$f":"'Model update'!$C$5&\"TransRevCont\"","v":"2021TransRevCont"}]
[]
[null," Designated pricing proposal charges (DPPC)"]
[]
[null,"Year (t)",{"$f":"'Model update'!C5","v":2021}]
[]
[null,"Table 1- Compliance with DPPC Revenue Formula"]
[null,"Revenue from designated pricing proposal charges for year t",{"$f":"Prop2021TransTar!AS63","v":65040278.666041508}]
[null,"Total DPPC related payments for year t",{"$f":"C19","v":65045020.024856217}]
[null,null,{"$f":"IF(C9=\"\",\"\",IF(C10>=C9,\"DPPC REVENUE FORMULA COMPLIANT\",\"DPPC REVENUE FORMULA BREACHED\"))","v":"DPPC REVENUE FORMULA COMPLIANT"}]
[]
[]
[null,"Table 3 - Transmission charges for year t"]
[null,"AEMO (TCt)",59371787.712043718]
[null,"Transmission connection (TCt)",4744570.0819999995]
[null,"Embedded generators (Gt)",57638.489312499987]
[null,"Inter-network (Dt)",-871023.74149999989]
[null,"TC + G - D",{"$f":"C15+C16+C17-C18","v":65045020.024856217}]

{"sheet":"Prop2021JSTar","index":15,"n_rows":63,"n_cols":45,"rows_kept":63,"cut":false,"hidden":false,"merged":[]}
[null,{"$f":"\"Tariff Approval - \"&'Model update'!C3","v":"Tariff Approval - United Energy"},null,{"$f":"\"Prop\"&'Model update'!$C$5&\"JSTar\"","v":"Prop2021JSTar"}]
[]
[null,{"$f":"\"PROPOSED \"&'Model update'!$C$5&\" JURISDICTIONAL SCHEME TARIFFS\"","v":"PROPOSED 2021 JURISDICTIONAL SCHEME TARIFFS"}]
[null,null,null,{"$f":"\"Proposed Jurisdictional scheme Tariffs (Pt) for \"&'Model update'!$C$5","v":"Proposed Jurisdictional scheme Tariffs (Pt) for 2021"},null,null,null,null,null,null,null,null,null,null,null,null,null,{"$f":"\"Forecast Quantities (Qt) for \"&'Model update'!$C$5","v":"Forecast Quantities (Qt) for 2021"},null,null,null,null,null,null,null,null,null,null,null,null,null,{"$f":"\"Forecast Revenue (Pt \"&'Model update'!$C$5&\")*(Qt \" &'Model update'!$C$5&\")\"","v":"Forecast Revenue (Pt 2021)*(Qt 2021)"}]
[null,"Proposed tariff",null,{"$f":"Prop2021DistTar!D5","v":"PropTar\nFixed"},{"$f":"Prop2021DistTar!E5","v":"PropTar\nPkBlk1"},{"$f":"Prop2021DistTar!F5","v":"PropTar\nPkBlk2"},{"$f":"Prop2021DistTar!G5","v":"PropTar\nPkBlk3"},{"$f":"Prop2021DistTar!H5","v":"PropTar\nPkBlk4"},{"$f":"Prop2021DistTar!I5","v":"PropTar\nOPkBlk1"},{"$f":"Prop2021DistTar!J5","v":"PropTar\nOPkBlk2"},{"$f":"Prop2021DistTar!K5","v":"PropTar\nOPkBlk3"},{"$f":"Prop2021DistTar!L5","v":"PropTar\nOPkBlk4"},{"$f":"Prop2021DistTar!M5","v":"PropTar\nDemBlk1"},{"$f":"Prop2021DistTar!N5","v":"PropTar\nDemBlk2"},{"$f":"Prop2021DistTar!O5","v":"PropTar\nDemBlk3"},{"$f":"Prop2021DistTar!P5","v":"PropTar\nDemBlk4"},null,{"$f":"Prop2021DistTar!AF5","v":"FcastVol\nFixed"},{"$f":"Prop2021DistTar!AG5","v":"FcastVol\nPkBlk1"},{"$f":"Prop2021DistTar!AH5","v":"FcastVol\nPkBlk2"},{"$f":"Prop2021DistTar!AI5","v":"FcastVol\nPkBlk3"},{"$f":"Prop2021DistTar!AJ5","v":"FcastVol\nPkBlk4"},{"$f":"Prop2021DistTar!AK5","v":"FcastVol\nOPkBlk1"},{"$f":"Prop2021DistTar!AL5","v":"FcastVol\nOPkBlk2"},{"$f":"Prop2021DistTar!AM5","v":"FcastVol\nOPkBlk3"},{"$f":"Prop2021DistTar!AN5","v":"FcastVol\nOPkBlk4"},{"$f":"Prop2021DistTar!AO5","v":"FcastVol\nDemBlk1"},{"$f":"Prop2021DistTar!AP5","v":"FcastVol\nDemBlk2"},{"$f":"Prop2021DistTar!AQ5","v":"FcastVol\nDemBlk3"},{"$f":"Prop2021DistTar!AR5","v":"FcastVol\nDemBlk4"},null,"PropRev\nFixed","PropRev\nPkBlk1","PropRev\nPkBlk2","PropRev\nPkBlk3","PropRev\nPkBlk4","PropRev\nOPkBlk1","PropRev\nOPkBlk2","PropRev\nOPkBlk3","PropRev\nOPkBlk4","PropRev\nDemBlk1","PropRev\nDemBlk2","PropRev\nDemBlk3","PropRev\nDemBlk4","PropRev\nTotal"]
[null,{"$f":"Prop2021DistTar!B6","v":"Low voltage small 1 rate"},null,5.45,0,0,0,0,0,0,0,0,0,0,0,0,null,{"$f":"Prop2021DistTar!AF6","v":105535115.09653191},{"$f":"Prop2021DistTar!AG6","v":575188203.86129987},{"$f":"Prop2021DistTar!AH6","v":0},{"$f":"Prop2021DistTar!AI6","v":0},{"$f":"Prop2021DistTar!AJ6","v":643558420.98122382},{"$f":"Prop2021DistTar!AK6","v":0},{"$f":"Prop2021DistTar!AL6","v":0},{"$f":"Prop2021DistTar!AM6","v":0},{"$f":"Prop2021DistTar!AN6","v":0},{"$f":"Prop2021DistTar!AO6","v":0},{"$f":"Prop2021DistTar!AP6","v":0},{"$f":"Prop2021DistTar!AQ6","v":0},{"$f":"Prop2021DistTar!AR6","v":0},null,{"$f":"D6/100*R6","v":5751663.7727609891},{"$f":"E6/100*S6","v":0},0,0,0,0,0,0,0,{"$f":"M6/100*AA6","v":0},{"$f":"N6/100*AB6","v":0},0,0,{"$f":"SUM(AF6:AR6)","v":5751663.7727609891}]
[null,{"$f":"Prop2021DistTar!B7","v":"Winter economy tariff"},null,5.45,0,0,0,0,0,0,0,0,0,0,0,0,null,{"$f":"Prop2021DistTar!AF7","v":20303.023296754887},{"$f":"Prop2021DistTar!AG7","v":181305.44113008108},{"$f":"Prop2021DistTar!AH7","v":0},{"$f":"Prop2021DistTar!AI7","v":0},{"$f":"Prop2021DistTar!AJ7","v":215568.44953139639},{"$f":"Prop2021DistTar!AK7","v":0},{"$f":"Prop2021DistTar!AL7","v":0},{"$f":"Prop2021DistTar!AM7","v":0},{"$f":"Prop2021DistTar!AN7","v":0},{"$f":"Prop2021DistTar!AO7","v":0},{"$f":"Prop2021DistTar!AP7","v":0},{"$f":"Prop2021DistTar!AQ7","v":0},{"$f":"Prop2021DistTar!AR7","v":0},null,{"$f":"D7/100*R7","v":1106.5147696731412},{"$f":"E7/100*S7","v":0},0,0,0,0,0,0,0,{"$f":"M7/100*AA7","v":0},{"$f":"N7/100*AB7","v":0},{"$f":"O7/100*AC7","v":0},{"$f":"P7/100*AD7","v":0},{"$f":"SUM(AF7:AR7)","v":1106.5147696731412}]
[null,{"$f":"Prop2021DistTar!B8","v":"Low voltage small 2 rate"},null,5.45,0,0,0,0,0,0,0,0,0,0,0,0,null,{"$f":"Prop2021DistTar!AF8","v":742249.26611019217},{"$f":"Prop2021DistTar!AG8","v":0},{"$f":"Prop2021DistTar!AH8","v":0},{"$f":"Prop2021DistTar!AI8","v":2499563.8889361224},{"$f":"Prop2021DistTar!AJ8","v":0},{"$f":"Prop2021DistTar!AK8","v":0},{"$f":"Prop2021DistTar!AL8","v":2827981.9731418081},{"$f":"Prop2021DistTar!AM8","v":6999544.0116869658},{"$f":"Prop2021DistTar!AN8","v":0},{"$f":"Prop2021DistTar!AO8","v":0},{"$f":"Prop2021DistTar!AP8","v":0},{"$f":"Prop2021DistTar!AQ8","v":0},{"$f":"Prop2021DistTar!AR8","v":0},null,40452.585003005472,0,0,0,0,0,0,0,0,0,0,0,0,40452.585003005472]
[null,{"$f":"Prop2021DistTar!B9","v":"Dedicated circuit"},null,0,0,0,0,0,0,0,0,0,0,0,0,0,null,{"$f":"Prop2021DistTar!AF9","v":10497943.41526081},{"$f":"Prop2021DistTar!AG9","v":0},{"$f":"Prop2021DistTar!AH9","v":0},{"$f":"Prop2021DistTar!AI9","v":0},{"$f":"Prop2021DistTar!AJ9","v":0},{"$f":"Prop2021DistTar!AK9","v":0},{"$f":"Prop2021DistTar!AL9","v":0},{"$f":"Prop2021DistTar!AM9","v":39206702.567553177},{"$f":"Prop2021DistTar!AN9","v":0},{"$f":"Prop2021DistTar!AO9","v":0},{"$f":"Prop2021DistTar!AP9","v":0},{"$f":"Prop2021DistTar!AQ9","v":0},{"$f":"Prop2021DistTar!AR9","v":0},null,0,0,0,0,0,0,0,0,0,0,0,0,0,0]
[null,{"$f":"Prop2021DistTar!B10","v":"Low voltage medium 1 rate"},null,5.45,0,0,0,0,0,0,0,0,0,0,0,0,null,{"$f":"Prop2021DistTar!AF10","v":6562937.8381345402},{"$f":"Prop2021DistTar!AG10","v":93520651.506448358},{"$f":"Prop2021DistTar!AH10","v":0},{"$f":"Prop2021DistTar!AI10","v":0},{"$f":"Prop2021DistTar!AJ10","v":97984486.300557613},{"$f":"Prop2021DistTar!AK10","v":0},{"$f":"Prop2021DistTar!AL10","v":0},{"$f":"Prop2021DistTar!AM10","v":0},{"$f":"Prop2021DistTar!AN10","v":0},{"$f":"Prop2021DistTar!AO10","v":0},{"$f":"Prop2021DistTar!AP10","v":0},{"$f":"Prop2021DistTar!AQ10","v":0},{"$f":"Prop2021DistTar!AR10","v":0},null,357680.11217833246,0,0,0,0,0,0,0,0,0,0,0,0,357680.11217833246]
[null,{"$f":"Prop2021DistTar!B11","v":"Low voltage medium 2 rate 5 day"},null,5.45,0,0,0,0,0,0,0,0,0,0,0,0,null,{"$f":"Prop2021DistTar!AF11","v":1691005.1507493043},{"$f":"Prop2021DistTar!AG11","v":0},{"$f":"Prop2021DistTar!AH11","v":0},{"$f":"Prop2021DistTar!AI11","v":25877867.250615567},{"$f":"Prop2021DistTar!AJ11","v":0},{"$f":"Prop2021DistTar!AK11","v":0},{"$f":"Prop2021DistTar!AL11","v":25255618.886176422},{"$f":"Prop2021DistTar!AM11","v":32072694.77859287},{"$f":"Prop2021DistTar!AN11","v":0},{"$f":"Prop2021DistTar!AO11","v":0},{"$f":"Prop2021DistTar!AP11","v":0},{"$f":"Prop2021DistTar!AQ11","v":0},{"$f":"Prop2021DistTar!AR11","v":0},null,92159.780715837085,0,0,0,0,0,0,0,0,0,0,0,0,92159.780715837085]
[null,{"$f":"Prop2021DistTar!B12","v":"Low voltage medium 2 rate 7 day"},null,5.45,0,0,0,0,0,0,0,0,0,0,0,0,null,{"$f":"Prop2021DistTar!AF12","v":867755.01395936578},{"$f":"Prop2021DistTar!AG12","v":0},{"$f":"Prop2021DistTar!AH12","v":0},{"$f":"Prop2021DistTar!AI12","v":11704182.595948623},{"$f":"Prop2021DistTar!AJ12","v":0},{"$f":"Prop2021DistTar!AK12","v":0},{"$f":"Prop2021DistTar!AL12","v":12021985.872137187},{"$f":"Prop2021DistTar!AM12","v":6431319.9337531235},{"$f":"Prop2021DistTar!AN12","v":0},{"$f":"Prop2021DistTar!AO12","v":0},{"$f":"Prop2021DistTar!AP12","v":0},{"$f":"Prop2021DistTar!AQ12","v":0},{"$f":"Prop2021DistTar!AR12","v":0},null,47292.648260785434,0,0,0,0,0,0,0,0,0,0,0,0,47292.648260785434]
[null,{"$f":"Prop2021DistTar!B13","v":"Unmetered supplies"},null,0,0,0,0,0,0,0,0,0,0,0,0,0,null,{"$f":"Prop2021DistTar!AF13","v":1822729.9999999998},{"$f":"Prop2021DistTar!AG13","v":0},{"$f":"Prop2021DistTar!AH13","v":0},{"$f":"Prop2021DistTar!AI13","v":7902465.9846767429},{"$f":"Prop2021DistTar!AJ13","v":0},{"$f":"Prop2021DistTar!AK13","v":0},{"$f":"Prop2021DistTar!AL13","v":9120125.6545493584},{"$f":"Prop2021DistTar!AM13","v":31525884.811143644},{"$f":"Prop2021DistTar!AN13","v":0},{"$f":"Prop2021DistTar!AO13","v":0},{"$f":"Prop2021DistTar!AP13","v":0},{"$f":"Prop2021DistTar!AQ13","v":0},{"$f":"Prop2021DistTar!AR13","v":0},null,0,0,0,0,0,0,0,0,0,0,0,0,0,0]
[null,{"$f":"Prop2021DistTar!B14","v":"Low voltage large 1 rate"},null,5.45,0,0,0,0,0,0,0,0,0,0,0,0,null,{"$f":"Prop2021DistTar!AF14","v":1081.0901336703062},{"$f":"Prop2021DistTar!AG14","v":352696.68309867498},{"$f":"Prop2021DistTar!AH14","v":0},{"$f":"Prop2021DistTar!AI14","v":0},{"$f":"Prop2021DistTar!AJ14","v":338387.62591484992},{"$f":"Prop2021DistTar!AK14","v":0},{"$f":"Prop2021DistTar!AL14","v":0},{"$f":"Prop2021DistTar!AM14","v":0},{"$f":"Prop2021DistTar!AN14","v":0},{"$f":"Prop2021DistTar!AO14","v":0},{"$f":"Prop2021DistTar!AP14","v":0},{"$f":"Prop2021DistTar!AQ14","v":0},{"$f":"Prop2021DistTar!AR14","v":0},null,58.919412285031683,0,0,0,0,0,0,0,0,0,0,0,0,58.919412285031683]
[null,{"$f":"Prop2021DistTar!B15","v":"Low voltage large 2 rate"},null,5.45,0,0,0,0,0,0,0,0,0,0,0,0,null,{"$f":"Prop2021DistTar!AF15","v":2882.9070231208161},{"$f":"Prop2021DistTar!AG15","v":0},{"$f":"Prop2021DistTar!AH15","v":0},{"$f":"Prop2021DistTar!AI15","v":355464.96118598658},{"$f":"Prop2021DistTar!AJ15","v":0},{"$f":"Prop2021DistTar!AK15","v":0},{"$f":"Prop2021DistTar!AL15","v":291682.21993439464},{"$f":"Prop2021DistTar!AM15","v":434712.68038526608},{"$f":"Prop2021DistTar!AN15","v":0},{"$f":"Prop2021DistTar!AO15","v":0},{"$f":"Prop2021DistTar!AP15","v":0},{"$f":"Prop2021DistTar!AQ15","v":0},{"$f":"Prop2021DistTar!AR15","v":0},null,157.11843276008449,0,0,0,0,0,0,0,0,0,0,0,0,157.11843276008449]
[null,{"$f":"Prop2021DistTar!B16","v":"Low voltage KW time of use"},null,5.45,0,0,0,0,0,0,0,0,0,0,0,0,null,{"$f":"Prop2021DistTar!AF16","v":33320.530094659756},{"$f":"Prop2021DistTar!AG16","v":0},{"$f":"Prop2021DistTar!AH16","v":0},{"$f":"Prop2021DistTar!AI16","v":1475141.7634062562},{"$f":"Prop2021DistTar!AJ16","v":0},{"$f":"Prop2021DistTar!AK16","v":0},{"$f":"Prop2021DistTar!AL16","v":1370460.8178543835},{"$f":"Prop2021DistTar!AM16","v":2593202.4501544498},{"$f":"Prop2021DistTar!AN16","v":0},{"$f":"Prop2021DistTar!AO16","v":0},{"$f":"Prop2021DistTar!AP16","v":392057.72600000002},{"$f":"Prop2021DistTar!AQ16","v":0},{"$f":"Prop2021DistTar!AR16","v":0},null,1815.9688901589568,0,0,0,0,0,0,0,0,0,0,0,0,1815.9688901589568]
[null,{"$f":"Prop2021DistTar!B17","v":"Low voltage KW time of use - HOT"},null,5.45,0,0,0,0,0,0,0,0,0,0,0,0,null,{"$f":"Prop2021DistTar!AF17","v":2716.3475620646541},{"$f":"Prop2021DistTar!AG17","v":0},{"$f":"Prop2021DistTar!AH17","v":0},{"$f":"Prop2021DistTar!AI17","v":19807.75144821703},{"$f":"Prop2021DistTar!AJ17","v":0},{"$f":"Prop2021DistTar!AK17","v":0},{"$f":"Prop2021DistTar!AL17","v":30069.462307987305},{"$f":"Prop2021DistTar!AM17","v":52684.780336454045},{"$f":"Prop2021DistTar!AN17","v":0},{"$f":"Prop2021DistTar!AO17","v":0},{"$f":"Prop2021DistTar!AP17","v":7608.503999999999},{"$f":"Prop2021DistTar!AQ17","v":0},{"$f":"Prop2021DistTar!AR17","v":0},null,148.04094213252364,0,0,0,0,0,0,0,0,0,0,0,0,148.04094213252364]
[null,{"$f":"Prop2021DistTar!B18","v":"Low voltage large KVA time of use"},null,5.45,0,0,0,0,0,0,0,0,0,0,0,0,null,{"$f":"Prop2021DistTar!AF18","v":541277.52420075017},{"$f":"Prop2021DistTar!AG18","v":0},{"$f":"Prop2021DistTar!AH18","v":0},{"$f":"Prop2021DistTar!AI18","v":266174636.98008817},{"$f":"Prop2021DistTar!AJ18","v":0},{"$f":"Prop2021DistTar!AK18","v":0},{"$f":"Prop2021DistTar!AL18","v":250479794.64188558},{"$f":"Prop2021DistTar!AM18","v":611889749.45024109},{"$f":"Prop2021DistTar!AN18","v":0},{"$f":"Prop2021DistTar!AO18","v":159541608.1137},{"$f":"Prop2021DistTar!AP18","v":56665442.457500003},{"$f":"Prop2021DistTar!AQ18","v":0},{"$f":"Prop2021DistTar!AR18","v":0},null,29499.625068940884,0,0,0,0,0,0,0,0,0,0,0,0,29499.625068940884]
[null,{"$f":"Prop2021DistTar!B19","v":"High voltage KVA time of use"},null,5.45,0,0,0,0,0,0,0,0,0,0,0,0,null,{"$f":"Prop2021DistTar!AF19","v":18018},{"$f":"Prop2021DistTar!AG19","v":0},{"$f":"Prop2021DistTar!AH19","v":0},{"$f":"Prop2021DistTar!AI19","v":105000326.05011946},{"$f":"Prop2021DistTar!AJ19","v":0},{"$f":"Prop2021DistTar!AK19","v":0},{"$f":"Prop2021DistTar!AL19","v":105357041.06071436},{"$f":"Prop2021DistTar!AM19","v":326268953.17554247},{"$f":"Prop2021DistTar!AN19","v":0},{"$f":"Prop2021DistTar!AO19","v":51478074.622400001},{"$f":"Prop2021DistTar!AP19","v":19753789.0211},{"$f":"Prop2021DistTar!AQ19","v":0},{"$f":"Prop2021DistTar!AR19","v":0},null,981.98099999999999,0,0,0,0,0,0,0,0,0,0,0,0,981.98099999999999]
[null,{"$f":"Prop2021DistTar!B20","v":"Subtransmission KVA time of use"},null,5.45,0,0,0,0,0,0,0,0,0,0,0,0,null,{"$f":"Prop2021DistTar!AF20","v":182},{"$f":"Prop2021DistTar!AG20","v":0},{"$f":"Prop2021DistTar!AH20","v":0},{"$f":"Prop2021DistTar!AI20","v":3670916.3505270658},{"$f":"Prop2021DistTar!AJ20","v":0},{"$f":"Prop2021DistTar!AK20","v":0},{"$f":"Prop2021DistTar!AL20","v":3584660.5425760043},{"$f":"Prop2021DistTar!AM20","v":5707425.9826134173},{"$f":"Prop2021DistTar!AN20","v":0},{"$f":"Prop2021DistTar!AO20","v":2018875.2197},{"$f":"Prop2021DistTar!AP20","v":704348.9277},{"$f":"Prop2021DistTar!AQ20","v":0},{"$f":"Prop2021DistTar!AR20","v":0},null,9.9190000000000005,0,0,0,0,0,0,0,0,0,0,0,0,9.9190000000000005]
[null,{"$f":"Prop2021DistTar!B21","v":"TOD"},null,5.45,0,0,0,0,0,0,0,0,0,0,0,0,null,{"$f":"Prop2021DistTar!AF21","v":7805872.2721829861},{"$f":"Prop2021DistTar!AG21","v":0},{"$f":"Prop2021DistTar!AH21","v":7967927.95541621},{"$f":"Prop2021DistTar!AI21","v":13923627.86509141},{"$f":"Prop2021DistTar!AJ21","v":0},{"$f":"Prop2021DistTar!AK21","v":0},{"$f":"Prop2021DistTar!AL21","v":18072449.615387656},{"$f":"Prop2021DistTar!AM21","v":54011897.043529466},{"$f":"Prop2021DistTar!AN21","v":10342130.507116426},{"$f":"Prop2021DistTar!AO21","v":0},{"$f":"Prop2021DistTar!AP21","v":0},{"$f":"Prop2021DistTar!AQ21","v":0},{"$f":"Prop2021DistTar!AR21","v":0},null,425420.03883397277,0,0,0,0,0,0,0,0,0,0,0,0,425420.03883397277]
[null,{"$f":"Prop2021DistTar!B22","v":"TOD9"},null,5.45,0,0,0,0,0,0,0,0,0,0,0,0,null,{"$f":"Prop2021DistTar!AF22","v":647318.9139388788},{"$f":"Prop2021DistTar!AG22","v":0},{"$f":"Prop2021DistTar!AH22","v":493655.1561192635},{"$f":"Prop2021DistTar!AI22","v":732234.77661798592},{"$f":"Prop2021DistTar!AJ22","v":0},{"$f":"Prop2021DistTar!AK22","v":0},{"$f":"Prop2021DistTar!AL22","v":1128201.9245410122},{"$f":"Prop2021DistTar!AM22","v":5034512.0861314908},{"$f":"Prop2021DistTar!AN22","v":760606.72748394939},{"$f":"Prop2021DistTar!AO22","v":0},{"$f":"Prop2021DistTar!AP22","v":0},{"$f":"Prop2021DistTar!AQ22","v":0},{"$f":"Prop2021DistTar!AR22","v":0},null,35278.880809668895,0,0,0,0,0,0,0,0,0,0,0,0,35278.880809668895]
[null,{"$f":"Prop2021DistTar!B23","v":"TOU"},null,5.45,0,0,0,0,0,0,0,0,0,0,0,0,null,{"$f":"Prop2021DistTar!AF23","v":145958.40900160742},{"$f":"Prop2021DistTar!AG23","v":0},{"$f":"Prop2021DistTar!AH23","v":0},{"$f":"Prop2021DistTar!AI23","v":2992497.1553457095},{"$f":"Prop2021DistTar!AJ23","v":0},{"$f":"Prop2021DistTar!AK23","v":0},{"$f":"Prop2021DistTar!AL23","v":3490165.6408265438},{"$f":"Prop2021DistTar!AM23","v":5333993.1667220592},{"$f":"Prop2021DistTar!AN23","v":0},{"$f":"Prop2021DistTar!AO23","v":0},{"$f":"Prop2021DistTar!AP23","v":729616.78200000001},{"$f":"Prop2021DistTar!AQ23","v":0},{"$f":"Prop2021DistTar!AR23","v":0},null,7954.7332905876046,0,0,0,0,0,0,0,0,0,0,0,0,7954.7332905876046]
[null,{"$f":"Prop2021DistTar!B24","v":"TODFLEX"},null,5.45,0,0,0,0,0,0,0,0,0,0,0,0,null,{"$f":"Prop2021DistTar!AF24","v":344785.57580525189},{"$f":"Prop2021DistTar!AG24","v":0},{"$f":"Prop2021DistTar!AH24","v":967908.70972557599},{"$f":"Prop2021DistTar!AI24","v":472439.17656686797},{"$f":"Prop2021DistTar!AJ24","v":0},{"$f":"Prop2021DistTar!AK24","v":0},{"$f":"Prop2021DistTar!AL24","v":562268.62769869901},{"$f":"Prop2021DistTar!AM24","v":1658072.4170597466},{"$f":"Prop2021DistTar!AN24","v":1151946.5974642553},{"$f":"Prop2021DistTar!AO24","v":0},{"$f":"Prop2021DistTar!AP24","v":0},{"$f":"Prop2021DistTar!AQ24","v":0},{"$f":"Prop2021DistTar!AR24","v":0},null,18790.813881386228,0,0,0,0,0,0,0,0,0,0,0,0,18790.813881386228]
[null,{"$f":"Prop2021DistTar!B25","v":"Low Voltage KW 1 rate"},null,5.45,0,0,0,0,0,0,0,0,0,0,0,0,null,{"$f":"Prop2021DistTar!AF25","v":232295.85213404242},{"$f":"Prop2021DistTar!AG25","v":0},{"$f":"Prop2021DistTar!AH25","v":0},{"$f":"Prop2021DistTar!AI25","v":1080042.5065605589},{"$f":"Prop2021DistTar!AJ25","v":0},{"$f":"Prop2021DistTar!AK25","v":0},{"$f":"Prop2021DistTar!AL25","v":1337152.6557526211},{"$f":"Prop2021DistTar!AM25","v":0},{"$f":"Prop2021DistTar!AN25","v":0},{"$f":"Prop2021DistTar!AO25","v":0},{"$f":"Prop2021DistTar!AP25","v":0},{"$f":"Prop2021DistTar!AQ25","v":184376.2935},{"$f":"Prop2021DistTar!AR25","v":168329.12365077398},null,12660.123941305312,0,0,0,0,0,0,0,0,0,0,0,0,12660.123941305312]
[null,{"$f":"Prop2021DistTar!B26","v":"Low voltage medium KW time of use (opt-in)"},null,5.45,0,0,0,0,0,0,0,0,0,0,0,0,null,{"$f":"Prop2021DistTar!AF26","v":0},{"$f":"Prop2021DistTar!AG26","v":0},{"$f":"Prop2021DistTar!AH26","v":0},{"$f":"Prop2021DistTar!AI26","v":0},{"$f":"Prop2021DistTar!AJ26","v":0},{"$f":"Prop2021DistTar!AK26","v":0},{"$f":"Prop2021DistTar!AL26","v":0},{"$f":"Prop2021DistTar!AM26","v":0},{"$f":"Prop2021DistTar!AN26","v":0},{"$f":"Prop2021DistTar!AO26","v":0},{"$f":"Prop2021DistTar!AP26","v":0},{"$f":"Prop2021DistTar!AQ26","v":0},{"$f":"Prop2021DistTar!AR26","v":0},null,0,0,0,0,0,0,0,0,0,0,0,0,0,0]
[null,{"$f":"Prop2021DistTar!B27","v":"Low voltage medium KW 1 rate (mandatory)"},null,5.45,0,0,0,0,0,0,0,0,0,0,0,0,null,{"$f":"Prop2021DistTar!AF27","v":1304571.1891409182},{"$f":"Prop2021DistTar!AG27","v":0},{"$f":"Prop2021DistTar!AH27","v":0},{"$f":"Prop2021DistTar!AI27","v":152577673.09952593},{"$f":"Prop2021DistTar!AJ27","v":0},{"$f":"Prop2021DistTar!AK27","v":0},{"$f":"Prop2021DistTar!AL27","v":146200098.8108809},{"$f":"Prop2021DistTar!AM27","v":0},{"$f":"Prop2021DistTar!AN27","v":0},{"$f":"Prop2021DistTar!AO27","v":0},{"$f":"Prop2021DistTar!AP27","v":0},{"$f":"Prop2021DistTar!AQ27","v":20233521.012785185},{"$f":"Prop2021DistTar!AR27","v":18174103.867105875},null,71099.129808180049,0,0,0,0,0,0,0,0,0,0,0,0,71099.129808180049]
[null,null,null,null,null,null,null,null,null,null,null,null,null,null,null,null,null,{"$f":"Prop2021DistTar!AF28","v":0},{"$f":"Prop2021DistTar!AG28","v":0},{"$f":"Prop2021DistTar!AH28","v":0},{"$f":"Prop2021DistTar!AI28","v":0},{"$f":"Prop2021DistTar!AJ28","v":0},{"$f":"Prop2021DistTar!AK28","v":0},{"$f":"Prop2021DistTar!AL28","v":0},{"$f":"Prop2021DistTar!AM28","v":0},{"$f":"Prop2021DistTar!AN28","v":0},{"$f":"Prop2021DistTar!AO28","v":0},{"$f":"Prop2021DistTar!AP28","v":0},{"$f":"Prop2021DistTar!AQ28","v":0},{"$f":"Prop2021DistTar!AR28","v":0},null,0,0,0,0,0,0,0,0,0,0,0,0,0,0]
[null,null,null,null,null,null,null,null,null,null,null,null,null,null,null,null,null,{"$f":"Prop2021DistTar!AF29","v":0},{"$f":"Prop2021DistTar!AG29","v":0},{"$f":"Prop2021DistTar!AH29","v":0},{"$f":"Prop2021DistTar!AI29","v":0},{"$f":"Prop2021DistTar!AJ29","v":0},{"$f":"Prop2021DistTar!AK29","v":0},{"$f":"Prop2021DistTar!AL29","v":0},{"$f":"Prop2021DistTar!AM29","v":0},{"$f":"Prop2021DistTar!AN29","v":0},{"$f":"Prop2021DistTar!AO29","v":0},{"$f":"Prop2021DistTar!AP29","v":0},{"$f":"Prop2021DistTar!AQ29","v":0},{"$f":"Prop2021DistTar!AR29","v":0},null,0,0,0,0,0,0,0,0,0,0,0,0,0,0]
[null,null,null,null,null,null,null,null,null,null,null,null,null,null,null,null,null,{"$f":"Prop2021DistTar!AF30","v":0},{"$f":"Prop2021DistTar!AG30","v":0},{"$f":"Prop2021DistTar!AH30","v":0},{"$f":"Prop2021DistTar!AI30","v":0},{"$f":"Prop2021DistTar!AJ30","v":0},{"$f":"Prop2021DistTar!AK30","v":0},{"$f":"Prop2021DistTar!AL30","v":0},{"$f":"Prop2021DistTar!AM30","v":0},{"$f":"Prop2021DistTar!AN30","v":0},{"$f":"Prop2021DistTar!AO30","v":0},{"$f":"Prop2021DistTar!AP30","v":0},{"$f":"Prop2021DistTar!AQ30","v":0},{"$f":"Prop2021DistTar!AR30","v":0},null,0,{"$f":"E30/100*S30","v":0},0,0,0,0,0,0,0,0,0,0,0,{"$f":"SUM(AF30:AR30)","v":0}]
[null,null,null,null,null,null,null,null,null,null,null,null,null,null,null,null,null,{"$f":"Prop2021DistTar!AF31","v":0},{"$f":"Prop2021DistTar!AG31","v":0},{"$f":"Prop2021DistTar!AH31","v":0},{"$f":"Prop2021DistTar!AI31","v":0},{"$f":"Prop2021DistTar!AJ31","v":0},{"$f":"Prop2021DistTar!AK31","v":0},{"$f":"Prop2021DistTar!AL31","v":0},{"$f":"Prop2021DistTar!AM31","v":0},{"$f":"Prop2021DistTar!AN31","v":0},{"$f":"Prop2021DistTar!AO31","v":0},{"$f":"Prop2021DistTar!AP31","v":0},{"$f":"Prop2021DistTar!AQ31","v":0},{"$f":"Prop2021DistTar!AR31","v":0},null,0,0,0,0,0,0,0,0,0,0,0,0,0,0]
[null,null,null,null,null,null,null,null,null,null,null,null,null,null,null,null,null,{"$f":"Prop2021DistTar!AF32","v":0},{"$f":"Prop2021DistTar!AG32","v":0},{"$f":"Prop2021DistTar!AH32","v":0},{"$f":"Prop2021DistTar!AI32","v":0},{"$f":"Prop2021DistTar!AJ32","v":0},{"$f":"Prop2021DistTar!AK32","v":0},{"$f":"Prop2021DistTar!AL32","v":0},{"$f":"Prop2021DistTar!AM32","v":0},{"$f":"Prop2021DistTar!AN32","v":0},{"$f":"Prop2021DistTar!AO32","v":0},{"$f":"Prop2021DistTar!AP32","v":0},{"$f":"Prop2021DistTar!AQ32","v":0},{"$f":"Prop2021DistTar!AR32","v":0},null,0,{"$f":"E32/100*S32","v":0},{"$f":"F32/100*T32","v":0},{"$f":"G32/100*U32","v":0},{"$f":"H32/100*V32","v":0},{"$f":"I32/100*W32","v":0},{"$f":"J32/100*X32","v":0},{"$f":"K32/100*Y32","v":0},{"$f":"L32/100*Z32","v":0},0,0,0,0,{"$f":"SUM(AF32:AR32)","v":0}]
[null,null,null,null,null,null,null,null,null,null,null,null,null,null,null,null,null,{"$f":"Prop2021DistTar!AF33","v":0},{"$f":"Prop2021DistTar!AG33","v":0},{"$f":"Prop2021DistTar!AH33","v":0},{"$f":"Prop2021DistTar!AI33","v":0},{"$f":"Prop2021DistTar!AJ33","v":0},{"$f":"Prop2021DistTar!AK33","v":0},{"$f":"Prop2021DistTar!AL33","v":0},{"$f":"Prop2021DistTar!AM33","v":0},{"$f":"Prop2021DistTar!AN33","v":0},{"$f":"Prop2021DistTar!AO33","v":0},{"$f":"Prop2021DistTar!AP33","v":0},{"$f":"Prop2021DistTar!AQ33","v":0},{"$f":"Prop2021DistTar!AR33","v":0},null,0,0,0,0,0,0,0,0,0,0,0,0,0,0]
[null,null,null,null,null,null,null,null,null,null,null,null,null,null,null,null,null,{"$f":"Prop2021DistTar!AF34","v":0},{"$f":"Prop2021DistTar!AG34","v":0},{"$f":"Prop2021DistTar!AH34","v":0},{"$f":"Prop2021DistTar!AI34","v":0},{"$f":"Prop2021DistTar!AJ34","v":0},{"$f":"Prop2021DistTar!AK34","v":0},{"$f":"Prop2021DistTar!AL34","v":0},{"$f":"Prop2021DistTar!AM34","v":0},{"$f":"Prop2021DistTar!AN34","v":0},{"$f":"Prop2021DistTar!AO34","v":0},{"$f":"Prop2021DistTar!AP34","v":0},{"$f":"Prop2021DistTar!AQ34","v":0},{"$f":"Prop2021DistTar!AR34","v":0},null,0,0,0,0,0,0,0,0,0,0,0,0,0,0]
[null,null,null,null,null,null,null,null,null,null,null,null,null,null,null,null,null,{"$f":"Prop2021DistTar!AF35","v":0},{"$f":"Prop2021DistTar!AG35","v":0},{"$f":"Prop2021DistTar!AH35","v":0},{"$f":"Prop2021DistTar!AI35","v":0},{"$f":"Prop2021DistTar!AJ35","v":0},{"$f":"Prop2021DistTar!AK35","v":0},{"$f":"Prop2021DistTar!AL35","v":0},{"$f":"Prop2021DistTar!AM35","v":0},{"$f":"Prop2021DistTar!AN35","v":0},{"$f":"Prop2021DistTar!AO35","v":0},{"$f":"Prop2021DistTar!AP35","v":0},{"$f":"Prop2021DistTar!AQ35","v":0},{"$f":"Prop2021DistTar!AR35","v":0},null,0,0,0,0,0,0,0,0,{"$f":"L35/100*Z35","v":0},0,0,0,0,0]
[null,null,null,null,null,null,null,null,null,null,null,null,null,null,null,null,null,{"$f":"Prop2021DistTar!AF36","v":0},{"$f":"Prop2021DistTar!AG36","v":0},{"$f":"Prop2021DistTar!AH36","v":0},{"$f":"Prop2021DistTar!AI36","v":0},{"$f":"Prop2021DistTar!AJ36","v":0},{"$f":"Prop2021DistTar!AK36","v":0},{"$f":"Prop2021DistTar!AL36","v":0},{"$f":"Prop2021DistTar!AM36","v":0},{"$f":"Prop2021DistTar!AN36","v":0},{"$f":"Prop2021DistTar!AO36","v":0},{"$f":"Prop2021DistTar!AP36","v":0},{"$f":"Prop2021DistTar!AQ36","v":0},{"$f":"Prop2021DistTar!AR36","v":0},null,0,0,0,0,0,0,0,0,0,0,0,0,0,0]
[null,null,null,null,null,null,null,null,null,null,null,null,null,null,null,null,null,{"$f":"Prop2021DistTar!AF37","v":0},{"$f":"Prop2021DistTar!AG37","v":0},{"$f":"Prop2021DistTar!AH37","v":0},{"$f":"Prop2021DistTar!AI37","v":0},{"$f":"Prop2021DistTar!AJ37","v":0},{"$f":"Prop2021DistTar!AK37","v":0},{"$f":"Prop2021DistTar!AL37","v":0},{"$f":"Prop2021DistTar!AM37","v":0},{"$f":"Prop2021DistTar!AN37","v":0},{"$f":"Prop2021DistTar!AO37","v":0},{"$f":"Prop2021DistTar!AP37","v":0},{"$f":"Prop2021DistTar!AQ37","v":0},{"$f":"Prop2021DistTar!AR37","v":0},null,0,0,0,0,0,0,0,0,0,0,0,0,0,0]
[null,null,null,null,null,null,null,null,null,null,null,null,null,null,null,null,null,{"$f":"Prop2021DistTar!AF38","v":0},{"$f":"Prop2021DistTar!AG38","v":0},{"$f":"Prop2021DistTar!AH38","v":0},{"$f":"Prop2021DistTar!AI38","v":0},{"$f":"Prop2021DistTar!AJ38","v":0},{"$f":"Prop2021DistTar!AK38","v":0},{"$f":"Prop2021DistTar!AL38","v":0},{"$f":"Prop2021DistTar!AM38","v":0},{"$f":"Prop2021DistTar!AN38","v":0},{"$f":"Prop2021DistTar!AO38","v":0},{"$f":"Prop2021DistTar!AP38","v":0},{"$f":"Prop2021DistTar!AQ38","v":0},{"$f":"Prop2021DistTar!AR38","v":0},null,0,0,0,0,0,0,0,0,0,0,0,0,0,0]
[null,null,null,null,null,null,null,null,null,null,null,null,null,null,null,null,null,{"$f":"Prop2021DistTar!AF39","v":0},{"$f":"Prop2021DistTar!AG39","v":0},{"$f":"Prop2021DistTar!AH39","v":0},{"$f":"Prop2021DistTar!AI39","v":0},{"$f":"Prop2021DistTar!AJ39","v":0},{"$f":"Prop2021DistTar!AK39","v":0},{"$f":"Prop2021DistTar!AL39","v":0},{"$f":"Prop2021DistTar!AM39","v":0},{"$f":"Prop2021DistTar!AN39","v":0},{"$f":"Prop2021DistTar!AO39","v":0},{"$f":"Prop2021DistTar!AP39","v":0},{"$f":"Prop2021DistTar!AQ39","v":0},{"$f":"Prop2021DistTar!AR39","v":0},null,0,0,0,0,0,0,0,0,0,0,0,0,0,0]
[null,null,null,null,null,null,null,null,null,null,null,null,null,null,null,null,null,{"$f":"Prop2021DistTar!AF40","v":0},{"$f":"Prop2021DistTar!AG40","v":0},{"$f":"Prop2021DistTar!AH40","v":0},{"$f":"Prop2021DistTar!AI40","v":0},{"$f":"Prop2021DistTar!AJ40","v":0},{"$f":"Prop2021DistTar!AK40","v":0},{"$f":"Prop2021DistTar!AL40","v":0},{"$f":"Prop2021DistTar!AM40","v":0},{"$f":"Prop2021DistTar!AN40","v":0},{"$f":"Prop2021DistTar!AO40","v":0},{"$f":"Prop2021DistTar!AP40","v":0},{"$f":"Prop2021DistTar!AQ40","v":0},{"$f":"Prop2021DistTar!AR40","v":0},null,0,0,0,0,0,0,0,0,0,0,0,0,0,0]
[null,null,null,null,null,null,null,null,null,null,null,null,null,null,null,null,null,{"$f":"Prop2021DistTar!AF41","v":0},{"$f":"Prop2021DistTar!AG41","v":0},{"$f":"Prop2021DistTar!AH41","v":0},{"$f":"Prop2021DistTar!AI41","v":0},{"$f":"Prop2021DistTar!AJ41","v":0},{"$f":"Prop2021DistTar!AK41","v":0},{"$f":"Prop2021DistTar!AL41","v":0},{"$f":"Prop2021DistTar!AM41","v":0},{"$f":"Prop2021DistTar!AN41","v":0},{"$f":"Prop2021DistTar!AO41","v":0},{"$f":"Prop2021DistTar!AP41","v":0},{"$f":"Prop2021DistTar!AQ41","v":0},{"$f":"Prop2021DistTar!AR41","v":0},null,0,0,0,0,0,0,0,0,0,0,0,0,0,0]
[null,null,null,null,null,null,null,null,null,null,null,null,null,null,null,null,null,{"$f":"Prop2021DistTar!AF42","v":0},{"$f":"Prop2021DistTar!AG42","v":0},{"$f":"Prop2021DistTar!AH42","v":0},{"$f":"Prop2021DistTar!AI42","v":0},{"$f":"Prop2021DistTar!AJ42","v":0},{"$f":"Prop2021DistTar!AK42","v":0},{"$f":"Prop2021DistTar!AL42","v":0},{"$f":"Prop2021DistTar!AM42","v":0},{"$f":"Prop2021DistTar!AN42","v":0},{"$f":"Prop2021DistTar!AO42","v":0},{"$f":"Prop2021DistTar!AP42","v":0},{"$f":"Prop2021DistTar!AQ42","v":0},{"$f":"Prop2021DistTar!AR42","v":0},null,0,0,0,0,0,0,0,0,0,0,0,0,0,0]
[null,null,null,null,null,null,null,null,null,null,null,null,null,null,null,null,null,{"$f":"Prop2021DistTar!AF43","v":0},{"$f":"Prop2021DistTar!AG43","v":0},{"$f":"Prop2021DistTar!AH43","v":0},{"$f":"Prop2021DistTar!AI43","v":0},{"$f":"Prop2021DistTar!AJ43","v":0},{"$f":"Prop2021DistTar!AK43","v":0},{"$f":"Prop2021DistTar!AL43","v":0},{"$f":"Prop2021DistTar!AM43","v":0},{"$f":"Prop2021DistTar!AN43","v":0},{"$f":"Prop2021DistTar!AO43","v":0},{"$f":"Prop2021DistTar!AP43","v":0},{"$f":"Prop2021DistTar!AQ43","v":0},{"$f":"Prop2021DistTar!AR43","v":0},null,0,0,0,0,0,0,0,0,0,0,0,0,0,0]
[null,null,null,null,null,null,null,null,null,null,null,null,null,null,null,null,null,{"$f":"Prop2021DistTar!AF44","v":0},{"$f":"Prop2021DistTar!AG44","v":0},{"$f":"Prop2021DistTar!AH44","v":0},{"$f":"Prop2021DistTar!AI44","v":0},{"$f":"Prop2021DistTar!AJ44","v":0},{"$f":"Prop2021DistTar!AK44","v":0},{"$f":"Prop2021DistTar!AL44","v":0},{"$f":"Prop2021DistTar!AM44","v":0},{"$f":"Prop2021DistTar!AN44","v":0},{"$f":"Prop2021DistTar!AO44","v":0},{"$f":"Prop2021DistTar!AP44","v":0},{"$f":"Prop2021DistTar!AQ44","v":0},{"$f":"Prop2021DistTar!AR44","v":0},null,0,0,0,0,0,0,0,0,0,0,0,0,0,0]
[null,null,null,null,null,null,null,null,null,null,null,null,null,null,null,null,null,{"$f":"Prop2021DistTar!AF45","v":0},{"$f":"Prop2021DistTar!AG45","v":0},{"$f":"Prop2021DistTar!AH45","v":0},{"$f":"Prop2021DistTar!AI45","v":0},{"$f":"Prop2021DistTar!AJ45","v":0},{"$f":"Prop2021DistTar!AK45","v":0},{"$f":"Prop2021DistTar!AL45","v":0},{"$f":"Prop2021DistTar!AM45","v":0},{"$f":"Prop2021DistTar!AN45","v":0},{"$f":"Prop2021DistTar!AO45","v":0},{"$f":"Prop2021DistTar!AP45","v":0},{"$f":"Prop2021DistTar!AQ45","v":0},{"$f":"Prop2021DistTar!AR45","v":0},null,0,0,0,0,0,0,0,0,0,0,0,0,0,0]
[null,null,null,null,null,null,null,null,null,null,null,null,null,null,null,null,null,{"$f":"Prop2021DistTar!AF46","v":0},{"$f":"Prop2021DistTar!AG46","v":0},{"$f":"Prop2021DistTar!AH46","v":0},{"$f":"Prop2021DistTar!AI46","v":0},{"$f":"Prop2021DistTar!AJ46","v":0},{"$f":"Prop2021DistTar!AK46","v":0},{"$f":"Prop2021DistTar!AL46","v":0},{"$f":"Prop2021DistTar!AM46","v":0},{"$f":"Prop2021DistTar!AN46","v":0},{"$f":"Prop2021DistTar!AO46","v":0},{"$f":"Prop2021DistTar!AP46","v":0},{"$f":"Prop2021DistTar!AQ46","v":0},{"$f":"Prop2021DistTar!AR46","v":0},null,0,0,0,0,0,0,0,0,0,0,0,0,0,0]
[null,null,null,null,null,null,null,null,null,null,null,null,null,null,null,null,null,{"$f":"Prop2021DistTar!AF47","v":0},{"$f":"Prop2021DistTar!AG47","v":0},{"$f":"Prop2021DistTar!AH47","v":0},{"$f":"Prop2021DistTar!AI47","v":0},{"$f":"Prop2021DistTar!AJ47","v":0},{"$f":"Prop2021DistTar!AK47","v":0},{"$f":"Prop2021DistTar!AL47","v":0},{"$f":"Prop2021DistTar!AM47","v":0},{"$f":"Prop2021DistTar!AN47","v":0},{"$f":"Prop2021DistTar!AO47","v":0},{"$f":"Prop2021DistTar!AP47","v":0},{"$f":"Prop2021DistTar!AQ47","v":0},{"$f":"Prop2021DistTar!AR47","v":0},null,0,0,0,0,0,0,0,0,0,0,0,0,0,0]
[null,null,null,null,null,null,null,null,null,null,null,null,null,null,null,null,null,{"$f":"Prop2021DistTar!AF48","v":0},{"$f":"Prop2021DistTar!AG48","v":0},{"$f":"Prop2021DistTar!AH48","v":0},{"$f":"Prop2021DistTar!AI48","v":0},{"$f":"Prop2021DistTar!AJ48","v":0},{"$f":"Prop2021DistTar!AK48","v":0},{"$f":"Prop2021DistTar!AL48","v":0},{"$f":"Prop2021DistTar!AM48","v":0},{"$f":"Prop2021DistTar!AN48","v":0},{"$f":"Prop2021DistTar!AO48","v":0},{"$f":"Prop2021DistTar!AP48","v":0},{"$f":"Prop2021DistTar!AQ48","v":0},{"$f":"Prop2021DistTar!AR48","v":0},null,0,0,0,0,0,0,0,0,0,0,0,0,0,0]
[null,null,null,null,null,null,null,null,null,null,null,null,null,null,null,null,null,{"$f":"Prop2021DistTar!AF49","v":0},{"$f":"Prop2021DistTar!AG49","v":0},{"$f":"Prop2021DistTar!AH49","v":0},{"$f":"Prop2021DistTar!AI49","v":0},{"$f":"Prop2021DistTar!AJ49","v":0},{"$f":"Prop2021DistTar!AK49","v":0},{"$f":"Prop2021DistTar!AL49","v":0},{"$f":"Prop2021DistTar!AM49","v":0},{"$f":"Prop2021DistTar!AN49","v":0},{"$f":"Prop2021DistTar!AO49","v":0},{"$f":"Prop2021DistTar!AP49","v":0},{"$f":"Prop2021DistTar!AQ49","v":0},{"$f":"Prop2021DistTar!AR49","v":0},null,0,0,0,0,0,0,0,0,0,0,0,0,0,0]
[null,null,null,null,null,null,null,null,null,null,null,null,null,null,null,null,null,{"$f":"Prop2021DistTar!AF50","v":0},{"$f":"Prop2021DistTar!AG50","v":0},{"$f":"Prop2021DistTar!AH50","v":0},{"$f":"Prop2021DistTar!AI50","v":0},{"$f":"Prop2021DistTar!AJ50","v":0},{"$f":"Prop2021DistTar!AK50","v":0},{"$f":"Prop2021DistTar!AL50","v":0},{"$f":"Prop2021DistTar!AM50","v":0},{"$f":"Prop2021DistTar!AN50","v":0},{"$f":"Prop2021DistTar!AO50","v":0},{"$f":"Prop2021DistTar!AP50","v":0},{"$f":"Prop2021DistTar!AQ50","v":0},{"$f":"Prop2021DistTar!AR50","v":0},null,0,0,0,0,0,0,0,0,0,0,0,0,0,0]
[null,null,null,null,null,null,null,null,null,null,null,null,null,null,null,null,null,{"$f":"Prop2021DistTar!AF51","v":0},{"$f":"Prop2021DistTar!AG51","v":0},{"$f":"Prop2021DistTar!AH51","v":0},{"$f":"Prop2021DistTar!AI51","v":0},{"$f":"Prop2021DistTar!AJ51","v":0},{"$f":"Prop2021DistTar!AK51","v":0},{"$f":"Prop2021DistTar!AL51","v":0},{"$f":"Prop2021DistTar!AM51","v":0},{"$f":"Prop2021DistTar!AN51","v":0},{"$f":"Prop2021DistTar!AO51","v":0},{"$f":"Prop2021DistTar!AP51","v":0},{"$f":"Prop2021DistTar!AQ51","v":0},{"$f":"Prop2021DistTar!AR51","v":0},null,0,0,0,0,0,0,0,0,0,0,0,0,0,0]
[null,null,null,null,null,null,null,null,null,null,null,null,null,null,null,null,null,null,null,null,null,null,null,null,null,null,null,null,null,null,null,0,0,0,0,0,0,0,0,0,0,0,0,0,0]
[null,null,null,null,null,null,null,null,null,null,null,null,null,null,null,null,null,null,null,null,null,null,null,null,null,null,null,null,null,null,null,0,0,0,0,0,0,0,0,0,0,0,0,0,0]
[null,null,null,null,null,null,null,null,null,null,null,null,null,null,null,null,null,null,null,null,null,null,null,null,null,null,null,null,null,null,null,0,0,0,0,0,0,0,0,0,0,0,0,0,0]
[null,null,null,null,null,null,null,null,null,null,null,null,null,null,null,null,null,null,null,null,null,null,null,null,null,null,null,null,null,null,null,0,0,0,0,0,0,0,0,0,0,0,0,0,0]
[null,null,null,null,null,null,null,null,null,null,null,null,null,null,null,null,null,null,null,null,null,null,null,null,null,null,null,null,null,null,null,0,0,0,0,0,0,0,0,0,0,0,0,0,0]
[null,null,null,null,null,null,null,null,null,null,null,null,null,null,null,null,null,null,null,null,null,null,null,null,null,null,null,null,null,null,null,0,0,0,0,0,0,0,0,0,0,0,0,0,0]
[null,null,null,null,null,null,null,null,null,null,null,null,null,null,null,null,null,null,null,null,null,null,null,null,null,null,null,null,null,null,null,0,0,0,0,0,0,0,0,0,0,0,0,0,0]
[null,null,null,null,null,null,null,null,null,null,null,null,null,null,null,null,null,null,null,null,null,null,null,null,null,null,null,null,null,null,null,0,0,0,0,0,0,0,0,0,0,0,0,0,0]
[null,null,null,null,null,null,null,null,null,null,null,null,null,null,null,null,null,null,null,null,null,null,null,null,null,null,null,null,null,null,null,0,0,0,0,0,0,0,0,0,0,0,0,0,0]
[null,null,null,null,null,null,null,null,null,null,null,null,null,null,null,null,null,null,null,null,null,null,null,null,null,null,null,null,null,null,null,0,0,0,0,0,0,0,0,0,0,0,0,0,0]
[null,null,null,null,null,null,null,null,null,null,null,null,null,null,null,null,null,null,null,null,null,null,null,null,null,null,null,null,null,null,null,0,0,0,0,0,0,0,0,0,0,0,0,0,0]
[null,null,null,null,null,null,null,null,null,null,null,null,null,null,null,null,null,{"$f":"SUM(R6:R62)","v":138820319.41526082},669242857.49197698,9429491.8212610483,596458888.15666056,742096863.35722768,0,581129758.40636492,1129221349.3354456,12254683.83206463,213038557.95580003,78252863.418300003,20417897.306285184,18342432.99075665,null,{"$f":"SUM(AF6:AF62)","v":6894230.7070000004},0,0,0,0,0,0,{"$f":"SUM(AM6:AM62)","v":0},0,0,0,0,0,6894230.7070000004]

{"sheet":"2021JSRevCont","index":16,"n_rows":17,"n_cols":3,"rows_kept":17,"cut":false,"hidden":false,"merged":[]}
[]
[null,{"$f":"\"Tariff Approval - \"&'Model update'!$C$3","v":"Tariff Approval - United Energy"},{"$f":"'Model update'!$C$5&\"JSRevCont\"","v":"2021JSRevCont"}]
[]
[null," Jurisdictional Scheme Amounts (JSA)"]
[]
[null,"Year (t)",{"$f":"'Model update'!C5","v":2021}]
[]
[null,"Table 1- Compliance with JSA Revenue Formula"]
[null,"Revenue from  Jurisdictional Scheme Amounts charges for year t",{"$f":"Prop2021JSTar!AS63","v":6894230.7070000004}]
[null,"Total JSA related payments for year t",{"$f":"C17","v":6903480.6679605003}]
[null,null,{"$f":"IF(C9=\"\",\"\",IF(C10>=C9,\"JSA REVENUE FORMULA COMPLIANT\",\"JSA REVENUE FORMULA BREACHED\"))","v":"JSA REVENUE FORMULA COMPLIANT"}]
[]
[]
[null,"Table 3 - PFIT & TFIT charges for year t"]
[null,"PFIT",6903480.6679605003]
[null,"TFIT",0]
[null,"PFIT & TFIT charges",{"$f":"SUM(C15:C16)","v":6903480.6679605003}]