{"text_format":"1","workbook":"xlsx","n_sheets":6,"sheets":["NOTES","Model update","Prop2021DistTar","2021TarContForm","2021RebalContForm","ARS"],"not_rendered":{"charts":0,"images":0,"macros":1,"external_links":0,"defined_names":31,"comments":1,"pivot_tables":0},"unopened":[],"bounds":{"document_bytes":16777216,"sheet_cells":100000,"rows_first":2000,"rows_last":500,"rows_between":2000,"halvings":0,"cell_chars":16384,"cell_head_chars":4096},"cells_cut":0,"cells_raw":0,"read":"whole","date_system":"1900"}

{"sheet":"NOTES","index":0,"n_rows":22,"n_cols":5,"rows_kept":22,"cut":false,"hidden":false,"merged":[]}
[]
["The model has actual and test data to illustrate the workings of the model.",null,null,{"$f":"'Model update'!B5","v":2021}]
[]
["Issue","Location","Item","Comment"]
[]
[1,"'Model update'!B21","CPI",{"$f":"\"Updated June \"&D2-1&\" CPI for \"&D2","v":"Updated June 2020 CPI for 2021"},"NOTE: This worksheet is programmed to update for each year - use as checklist and note any placeholders or changes"]
[null,null,null,null,"NOTE: Worksheet names in this file are programmed to update each year once each worksheet is accessed and a cell is selected"]
[{"$f":"A6+1","v":2},"'Model update'!B36",{"$f":"\"Xt for \"&D2","v":"Xt for 2021"},{"$f":"\"Updated for \"&D2&\" annual update \"","v":"Updated for 2021 annual update "}]
[]
[{"$f":"A8+1","v":3},"'Model update'!B46",{"$f":"\"Pass Through Amount for \"&D2","v":"Pass Through Amount for 2021"},"NIL for 2020"]
[]
[{"$f":"A10+1","v":4},"'Model update'!B57","Real Pre-tax WACC (rptw)",{"$f":"\"Updated for \"&$D$2&\" annual update\"","v":"Updated for 2021 annual update"}]
[]
[{"$f":"A12+1","v":5},{"$f":"\"Prop\"&D2&\"DistTar!E8:E134\"","v":"Prop2021DistTar!E8:E134"},{"$f":"D2-1&\" tariffs\"","v":"2020 tariffs"},{"$f":"\"Updated from \"&D2-1&\" model\"","v":"Updated from 2020 model"}]
[]
[{"$f":"A14+1","v":6},"ARS!B6:B9",{"$f":"D2-1&\" ARS tariffs\"","v":"2020 ARS tariffs"},{"$f":"\"Updated from \"&D2-1&\" model\"","v":"Updated from 2020 model"}]
[]
[{"$f":"A16+1","v":7},"The following is test data to illustrate the workings of the model.",null,"Input data required from DNSPs"]
[null,{"$f":"\"Prop\"&D2&\"DistTar!D8:D134\"","v":"Prop2021DistTar!D8:D134"},{"$f":"\"Proposed \"&D2&\" Tariffs\"","v":"Proposed 2021 Tariffs"}]
[null,{"$f":"\"Prop\"&D2&\"DistTar!F8:F134\"","v":"Prop2021DistTar!F8:F134"},{"$f":"\"Actual \"&D2-2&\" Volumes\"","v":"Actual 2019 Volumes"}]
[]
[null,"ARS!C6:C9",{"$f":"\"Proposed \"&D2&\" Ancillary Reference Services Charges\"","v":"Proposed 2021 Ancillary Reference Services Charges"},"Calculated using formula"]

{"sheet":"Model update","index":1,"n_rows":57,"n_cols":2,"rows_kept":57,"cut":false,"hidden":false,"merged":[]}
[]
[]
["Tariff Approval Template for ","AusNet Services"]
[]
["Calendar year commencing",2021]
[]
["t",{"$f":"B5","v":2021}]
["t-1",{"$f":"B7-1","v":2020}]
["t-2",2019]
["t-3",2018]
[]
[]
["Please fill in yellow highlighted cells where appropriate"]
[]
["CPI"]
[]
["CPI Index June 2016",108.6]
["CPI Index June 2017",110.7]
["CPI Index June 2018",113]
["CPI Index June 2019",114.8]
["CPI Index June 2020",114.4]
["CPI Index June 2021"]
[]
[]
[{"$f":"\"CPI Index June \" &$B$10","v":"CPI Index June 2018"},{"$f":"VLOOKUP(A25,A$17:D$22,2,FALSE)","v":113}]
[{"$f":"\"CPI Index June \" &$B$9","v":"CPI Index June 2019"},{"$f":"VLOOKUP(A26,A$17:D$22,2,FALSE)","v":114.8}]
[{"$f":"\"CPI Index June \" &$B$8","v":"CPI Index June 2020"},{"$f":"VLOOKUP(A27,A$17:D$22,2,FALSE)","v":114.4}]
[]
[{"$f":"\"CPI \" &$B$8","v":"CPI 2020"},{"$f":"B26/B25-1","v":1.5929203539823078E-2}]
[{"$f":"\"CPI \" &$B$5","v":"CPI 2021"},{"$f":"B27/B26-1","v":-3.4843205574912606E-3}]
[]
[]
[{"$f":"\"Xt for \"&B$5","v":"Xt for 2021"}]
[2019,7.3928927184635802E-3]
[2020,1.2784150606043319E-2]
[2021,1.6623218055427314E-2]
[2022,5.0000000000000001E-3]
[]
[]
[{"$f":"\"Xt for \"&B$5","v":"Xt for 2021"},{"$f":"VLOOKUP(B5,A34:B38,2,FALSE)","v":1.6623218055427314E-2}]
[]
[]
["Pass Through Amounts :  PT (t)"]
[2019,0]
[2020,0]
[2021,0]
[2022,0]
[]
[]
[{"$f":"\"Pass Through Amount for \"&B$5","v":"Pass Through Amount for 2021"},{"$f":"VLOOKUP(B5,A44:B48,2,FALSE)","v":0}]
["The Pass Through Amount is to include an amount that reflects the time value of money between incurring the costs and recovering the costs"]
["and excludes any amounts already passed through in reference tariffs."]
[]
[]
["Pre-tax WACC for distribution tariffs"]
[]
["Real Pre-tax WACCD",3.8300756031182548E-2]

{"sheet":"Prop2021DistTar","index":2,"n_rows":137,"n_cols":8,"rows_kept":137,"cut":false,"hidden":false,"merged":[]}
[null,{"$f":"\"Tariff Approval - \"&'Model update'!B3","v":"Tariff Approval - AusNet Services"},{"$f":"\"Prop\"&'Model update'!B5&\"DistTar\"","v":"Prop2021DistTar"}]
[]
[null,{"$f":"\"PROPOSED \"&'Model update'!$B$5&\" DISTRIBUTION TARIFFS\"","v":"PROPOSED 2021 DISTRIBUTION TARIFFS"}]
[]
[null,"Proposed tariff name","Existing name",{"$f":"\"Prop\n\"&'Model update'!$B$5&\" Tariff\"","v":"Prop\n2021 Tariff"},{"$f":"\"Exist\n\"&'Model update'!$B$8&\" Tariff\"","v":"Exist\n2020 Tariff"},{"$f":"\"Actual \"&'Model update'!$B$9&\" Volumes\"","v":"Actual 2019 Volumes"},"Prop Tar\nRevenue","Exist Tar\nRevenue"]
[null,"Tariff V - SP AusNet Central - Residential","Tariff V - SP AusNet Central - Residential"]
[]
[null,"Fixed Charge","Fixed Charge",0.38579999999999998,0.35720000000000002,542431.3816522432,{"$f":"D8*$F8*365","v":76383559.870123923},{"$f":"E8*$F8*365","v":70721118.677056164}]
[null,"Peak 0 - 0.1","Peak 0 - 0.1",6.54,7.3345000000000002,5416825.5140000004,{"$f":"D9*$F9","v":35426038.861560002},39729706.732433006]
[null,"Peak 0.1 - 0.2","Peak 0.1 - 0.2",3.9236,4.4001999999999999,3862435.585,15154652.261305999,16995489.061117001]
[null,"Peak 0.2 - 1.4","Peak 0.2 - 1.4",0.68610000000000004,0.76939999999999997,5818211.0760000004,3991874.6192436004,4476531.6018743999]
[null,"Peak > 1.4","Peak > 1.4",0.61339999999999995,0.68789999999999996,79110.494999999995,48526.377632999996,54420.109510499991]
[null,"Off Peak 0 - 0.1","Off Peak 0 - 0.1",2.2311000000000001,2.5021,7294065.8899999997,16273790.407179,18250482.263368998]
[null,"Off Peak 0.1 - 0.2","Off Peak 0.1 - 0.2",1.7844,2.0011999999999999,1682755.4269999999,3002708.7839388,3367530.1605123994]
[null,"Off Peak 0.2 - 1.4","Off Peak 0.2 - 1.4",0.68279999999999996,0.76570000000000005,590107.72199999995,402925.55258159997,451845.48273539997]
[null,"Off Peak > 1.4","Off Peak > 1.4",0.23760000000000001,0.26650000000000001,79800.216,18960.5313216,21266.757564]
[null,"Tariff V - SP AusNet Central - Non Residential","Tariff V - SP AusNet Central - Non Residential",null,null,{"$f":"SUM(F9:F16)","v":24823311.924999997}]
[]
[null,"Fixed Charge","Fixed Charge",0.40279999999999999,0.373,10219.748128115862,{"$f":"D19*$F19*365","v":1502527.8092918501},{"$f":"E19*$F19*365","v":1391367.608902334}]
[null,"Peak 0 - 0.1","Peak 0 - 0.1",1.1125,1.2476,94487.953999999998,{"$f":"D20*$F20","v":105117.84882500001},117883.1714104]
[null,"Peak 0.1 - 0.2","Peak 0.1 - 0.2",1.0592999999999999,1.1879999999999999,78714.222999999998,83381.976423899992,93512.496923999992]
[null,"Peak 0.2 - 1.4","Peak 0.2 - 1.4",0.94740000000000002,1.0625,479726.81099999999,454493.18074139999,509709.73668749997]
[null,"Peak > 1.4","Peak > 1.4",0.71099999999999997,0.7974,1262355.5449999999,897534.79249499994,1006602.3115829999]
[null,"Off Peak 0 - 0.1","Off Peak 0 - 0.1",1.056,1.1842999999999999,161888.78400000001,170954.55590400004,191724.8868912]
[null,"Off Peak 0.1 - 0.2","Off Peak 0.1 - 0.2",0.73860000000000003,0.82830000000000004,114613.47500000001,84653.512635000006,94934.341342500004]
[null,"Off Peak 0.2 - 1.4","Off Peak 0.2 - 1.4",0.61040000000000005,0.6845,690621.18,421555.1682720001,472730.19771000004]
[null,"Off Peak > 1.4","Off Peak > 1.4",0.58099999999999996,0.65159999999999996,1479380.2609999999,859519.93164099986,963964.17806759989]
[null,"Tariff V - SP AusNet West - Residential","Tariff V - SP AusNet West - Residential",null,null,{"$f":"SUM(F20:F27)","v":4361788.233}]
[]
[null,"Fixed Charge","Fixed Charge",0.38579999999999998,0.35720000000000002,145788.04402326143,{"$f":"D30*$F30*365","v":20529434.995223604},{"$f":"E30*$F30*365","v":19007553.603664782}]
[null,"Peak 0 - 0.1","Peak 0 - 0.1",3.7231000000000001,4.1753999999999998,1490194.007,{"$f":"D31*$F31","v":5548141.3074617004},6222156.0568277994]
[null,"Peak 0.1 - 0.2","Peak 0.1 - 0.2",2.6686999999999999,2.9929000000000001,1127296.4539999999,3008416.0467897998,3373885.5571765997]
[null,"Peak 0.2 - 1.4","Peak 0.2 - 1.4",0.86050000000000004,0.96499999999999997,1736232.76,1494028.2899800001,1675464.6133999999]
[null,"Peak > 1.4","Peak > 1.4",0.82410000000000005,0.92420000000000002,18296.895,15078.471169500001,16909.990358999999]
[null,"Off Peak 0 - 0.1","Off Peak 0 - 0.1",1.1676,1.3093999999999999,1945311.1839999999,2271345.3384383996,2547190.4643295999]
[null,"Off Peak 0.1 - 0.2","Off Peak 0.1 - 0.2",1.0991,1.2325999999999999,545685.51500000001,599762.94953650003,672611.96578899992]
[null,"Off Peak 0.2 - 1.4","Off Peak 0.2 - 1.4",0.62180000000000002,0.69730000000000003,265994.98100000003,165395.67918580002,185478.30025130004]
[null,"Off Peak > 1.4","Off Peak > 1.4",0.1206,0.1353,11826.136,1426.2320016000001,1600.0762008000002]
[null,"Tariff V - SP AusNet West - Non Residential","Tariff V - SP AusNet West - Non Residential",null,null,{"$f":"SUM(F31:F38)","v":7140837.9319999982}]
[]
[null,"Fixed Charge","Fixed Charge",0.40279999999999999,0.373,6075.2722108130229,{"$f":"D41*$F41*365","v":893198.67097815231},{"$f":"E41*$F41*365","v":827117.93514113897}]
[null,"Peak 0 - 0.1","Peak 0 - 0.1",1.8216000000000001,2.0428999999999999,50926.353999999999,{"$f":"D42*$F42","v":92767.446446400005},104037.44858659999]
[null,"Peak 0.1 - 0.2","Peak 0.1 - 0.2",1.5341,1.7203999999999999,40136.322,61573.131580200003,69050.528368799991]
[null,"Peak 0.2 - 1.4","Peak 0.2 - 1.4",0.94059999999999999,1.0548999999999999,217624.77600000001,204697.8643056,229572.37620239999]
[null,"Peak > 1.4","Peak > 1.4",0.3458,0.38779999999999998,500556.94300000003,173092.59088940002,194115.98249540001]
[null,"Off Peak 0 - 0.1","Off Peak 0 - 0.1",0.84650000000000003,0.94930000000000003,77537.567999999999,65635.551311999996,73606.413302400004]
[null,"Off Peak 0.1 - 0.2","Off Peak 0.1 - 0.2",0.71299999999999997,0.79959999999999998,49031.339,34959.344706999997,39205.458664400001]
[null,"Off Peak 0.2 - 1.4","Off Peak 0.2 - 1.4",0.3458,0.38779999999999998,260756.022,90169.432407600005,101121.18533159999]
[null,"Off Peak > 1.4","Off Peak > 1.4",0.25530000000000003,0.2863,513975.78499999997,131218.0179105,147151.2672455]
[null,"Tariff V - Adjoining Central - Residential","Tariff V - Adjoining Central - Residential",null,null,{"$f":"SUM(F42:F49)","v":1710545.1089999999}]
[]
[null,"Fixed Charge","Fixed Charge",0.38579999999999998,0.35720000000000002,1764.9033232729714,{"$f":"D52*$F52*365","v":248528.39127332999},{"$f":"E52*$F52*365","v":230104.56548168347}]
[null,"Peak 0 - 0.1","Peak 0 - 0.1",9.9795999999999996,11.1919,15308.242,{"$f":"D53*$F53","v":152770.13186319999},171328.31363980001]
[null,"Peak 0.1 - 0.2","Peak 0.1 - 0.2",7.1813000000000002,8.0535999999999994,9827.4570000000003,70573.916954100001,79146.407695200003]
[null,"Peak 0.2 - 1.4","Peak 0.2 - 1.4",2.5834999999999999,2.8973,12230.718999999999,31598.062536499998,35436.062158699999]
[null,"Peak > 1.4","Peak > 1.4",2.4601999999999999,2.7591000000000001,551.20399999999995,1356.0720807999999,1520.8269564]
[null,"Off Peak 0 - 0.1","Off Peak 0 - 0.1",4.6380999999999997,5.2015000000000002,17812.036,82614.004171599998,92649.305254000006]
[null,"Off Peak 0.1 - 0.2","Off Peak 0.1 - 0.2",2.6200999999999999,2.9384000000000001,4596.0709999999999,12042.165627099999,13505.0950264]
[null,"Off Peak 0.2 - 1.4","Off Peak 0.2 - 1.4",2.3005,2.5798999999999999,2927.5819999999999,6734.9023909999996,7552.8688017999993]
[null,"Off Peak > 1.4","Off Peak > 1.4",2.1901999999999999,2.4563000000000001,432.37,946.97677399999998,1062.0304310000001]
{"$rows_left_out":78}
{"sheet":"2021TarContForm","index":3,"n_rows":44,"n_cols":3,"rows_kept":44,"cut":false,"hidden":false,"merged":[[43,1,43,3]]}
[null,{"$f":"\"Tariff Approval - \"&'Model update'!B3","v":"Tariff Approval - AusNet Services"},{"$f":"'Model update'!B5&\"TarContForm\"","v":"2021TarContForm"}]
[]
[null,{"$f":"'Model update'!$B$5&\"  TARIFF CONTROL FORMULA\"","v":"2021  TARIFF CONTROL FORMULA"}]
[]
[]
[null,"CPI"]
[]
[null,{"$f":"\"CPI Sept\"&'Model update'!$B$9","v":"CPI Sept2019"},{"$f":"'Model update'!B26","v":114.8}]
[null,{"$f":"\"CPI Sept\"&'Model update'!$B$8","v":"CPI Sept2020"},{"$f":"'Model update'!B27","v":114.4}]
[]
[null,{"$f":"\"CPI \"&'Model update'!$B$5","v":"CPI 2021"},{"$f":"(C9/C8-1)","v":-3.4843205574912606E-3}]
[]
[]
[]
[null,"X factor"]
[]
[null,{"$f":"\"X \"&'Model update'!$B$5","v":"X 2021"},{"$f":"'Model update'!B40","v":1.6623218055427314E-2}]
[]
[]
[null,"Pass Through Factor (PT)"]
[]
[null,"Pass Through"]
[null,{"$f":"\"AP (t) \"&'Model update'!$B$7","v":"AP (t) 2021"},{"$f":"'Model update'!B50","v":0}]
[]
[null,"Revenue"]
[null,"∑∑p(t-1)q(t-2)",{"$f":"C41","v":201881913.55685005}]
[]
[null,"PT' (t-1)",0]
[null,{"$f":"\"PT' \"&'Model update'!$B$5","v":"PT' 2021"},{"$f":"IF(C26=\"\",0,(C23)/((1+C11)*(1-C17)*C26))","v":0}]
[]
[null,{"$f":"\"PTt \"&'Model update'!$B$5","v":"PTt 2021"},{"$f":"((1+C29)/(1+C28))-1","v":0}]
[]
[]
[]
[]
[null,{"$f":"'Model update'!$B$5&\"  Distribution price control\"","v":"2021  Distribution price control"}]
[]
[null,"Average price movement allowed",{"$f":"(1+C11)*(1-C17)*(1+C31)","v":0.97995038200748363}]
[]
[null,"Proposed distribution tariff revenue",{"$f":"IF(Prop2021DistTar!G137=0,\"\",Prop2021DistTar!G137)","v":197834028.60067135}]
[null,"Existing distribution tariff revenue",{"$f":"IF(Prop2021DistTar!H137=0,\"\",Prop2021DistTar!H137)","v":201881913.55685005}]
[null,"Average price movement",{"$f":"IF(C40=\"\",\"\",C40/C41)","v":0.97994924416525897}]
[]
[null,{"$f":"IF(C40=\"\",\"\",IF(C38>=C42,\"DISTRIBUTION PRICE CONTROL FORMULA COMPLIANT\",\"DISTRIBUTION PRICE CONTROL FORMULA BREACHED\"))","v":"DISTRIBUTION PRICE CONTROL FORMULA COMPLIANT"}]

{"sheet":"2021RebalContForm","index":4,"n_rows":467,"n_cols":11,"rows_kept":467,"cut":false,"hidden":false,"merged":[[466,1,466,2],[346,1,346,2],[370,1,370,2],[394,1,394,2],[418,1,418,2],[442,1,442,2],[322,1,322,2],[64,1,64,2],[94,1,94,2],[124,1,124,2],[184,1,184,2],[214,1,214,2],[244,1,244,2],[298,1,298,2],[154,1,154,2],[274,1,274,2]]}
[null,{"$f":"\"Tariff Approval - \"&'Model update'!B3","v":"Tariff Approval - AusNet Services"},{"$f":"'Model update'!B5&\"RebalContForm\"","v":"2021RebalContForm"}]
[]
[null,{"$f":"'Model update'!$B$5&\"  REBALANCING CONTROL FORMULA\"","v":"2021  REBALANCING CONTROL FORMULA"}]
[]
[]
[null,"Rebalancing control"]
[]
[null,{"$f":"\"CPI \"&'Model update'!$B$5","v":"CPI 2021"},{"$f":"'2021TarContForm'!C11","v":-3.4843205574912606E-3}]
[null,{"$f":"\"Y  \"&'Model update'!$B$5","v":"Y  2021"},0.02]
[null,{"$f":"\"PTt \"&'Model update'!$B$5","v":"PTt 2021"},{"$f":"'2021TarContForm'!C31","v":0}]
[null,{"$f":"\"Xt \"&'Model update'!$B$5","v":"Xt 2021"},{"$f":"'2021TarContForm'!C17","v":1.6623218055427314E-2}]
[]
[null,"Rebalancing control",{"$f":"(1+C8)*(1+C9)*(1+C10)*(1-C11)","v":0.99954938964763329}]
[]
[]
[]
[null,"Rebalancing control summary"]
[null,null,"Existing","Proposed","Movement","Assessment"]
[null,{"$f":"B39","v":"Tariff V - SP AusNet Central - Residential"},{"$f":"C60","v":154068390.84617186},{"$f":"C61","v":150703037.26488754},{"$f":"IF(C19=0,0,D19/C19)","v":0.9781567551734579},{"$f":"IF(E19=0,\"\",IF($C$13<=E19,\"Breached\",\"Compliant\"))","v":"Compliant"}]
[null,{"$f":"B69","v":"Tariff V - SP AusNet West - Residential"},{"$f":"C90","v":33702850.627998881},{"$f":"C91","v":33633029.309786908},0.99792832603441661,{"$f":"IF(E20=0,\"\",IF($C$13<=E20,\"Breached\",\"Compliant\"))","v":"Compliant"}]
[null,{"$f":"B99","v":"Tariff V - Adjoining Central - Residential"},{"$f":"C120","v":632305.47544498357},{"$f":"C121","v":607164.62367162993},0.96023938942540266,"Compliant"]
[null,{"$f":"B129","v":"Tariff V - Adjoining West - Residential"},{"$f":"C150","v":4374020.8121033413},{"$f":"C151","v":4169525.0825517327},0.95324765511271714,"Compliant"]
[null,{"$f":"B159","v":"Tariff V - SP AusNet Central - Non Residential"},{"$f":"C180","v":4842428.9295185339},{"$f":"C181","v":4579738.7762291506},0.94575239882446727,"Compliant"]
[null,{"$f":"B189","v":"Tariff V - SP AusNet West - Non Residential"},{"$f":"C210","v":1784978.5953382389},{"$f":"C211","v":1747312.0505368528},0.97889804118673562,"Compliant"]
[null,{"$f":"B219","v":"Tariff V - Adjoining Central - Non Residential"},{"$f":"C240","v":17342.609355847828},{"$f":"C241","v":15863.416303425964},0.91470758395863372,"Compliant"]
[null,{"$f":"B249","v":"Tariff V - Adjoining West - Non Residential"},{"$f":"C270","v":441982.20814131544},{"$f":"C271","v":401197.10238013498},{"$f":"IF(C26=0,0,D26/C26)","v":0.90772229060374265},{"$f":"IF(E26=0,\"\",IF($C$13<=E26,\"Breached\",\"Compliant\"))","v":"Compliant"}]
[null,{"$f":"B279","v":"Tariff M - SP AusNet Central"},{"$f":"C294","v":147060.54672599997},{"$f":"C295","v":144112.044284},0.9799504183301212,"Compliant"]
[null,{"$f":"B303","v":"Tariff M - SP AusNet West"},{"$f":"C318","v":36150.581042000005},{"$f":"C319","v":35425.777252},0.97995042488645134,"Compliant"]
[null,{"$f":"B327","v":"Tariff M - Adjoining Central"},{"$f":"C342","v":0},{"$f":"C343","v":0},{"$f":"IF(C29=0,0,D29/C29)","v":0},{"$f":"IF(E29=0,\"\",IF($C$13<=E29,\"Breached\",\"Compliant\"))","v":""}]
[null,{"$f":"B351","v":"Tariff M - Adjoining West"},{"$f":"C366","v":0},{"$f":"C367","v":0},0,""]
[null,{"$f":"B375","v":"Tariff D - SP AusNet Central"},{"$f":"C390","v":1394958.7275240002},{"$f":"C391","v":1366990.2434760001},{"$f":"IF(C31=0,0,D31/C31)","v":0.97995031430238577},{"$f":"IF(E31=0,\"\",IF($C$13<=E31,\"Breached\",\"Compliant\"))","v":"Compliant"}]
[null,{"$f":"B399","v":"Tariff D - SP AusNet West"},{"$f":"C414","v":425005.23963799997},{"$f":"C415","v":416484.03502799995},0.97995035398326391,"Compliant"]
[null,{"$f":"B423","v":"Tariff D - Adjoining Central"},{"$f":"C438","v":9189.9048619999994},{"$f":"C439","v":9005.6507639999982},0.97995038025236947,"Compliant"]
[null,{"$f":"B447","v":"Tariff D - Adjoining West"},{"$f":"C462","v":5248.4529849999999},{"$f":"C463","v":5143.2235199999996},0.97995038437026216,"Compliant"]
[null,null,{"$f":"SUM(C19:C34)","v":201881913.55684993},{"$f":"SUM(D19:D34)","v":197834028.60067132},0.97994924416525941]
[]
[]
[]
[null,{"$f":"Prop2021DistTar!B6","v":"Tariff V - SP AusNet Central - Residential"},1,2,3,4,5,6,7,8,9]
[null,null,1,2,3,4,5,6,7,8,9]
[null,"Distribution tariff","Fixed","PkBlk1","PkBlk2","PkBlk3","PkBlk4","OPkBlk1","OPkBlk2","OPkBlk3","OPkBlk4"]
[]
[null,{"$f":"\"Existing : \"&Prop2021DistTar!C6","v":"Existing : Tariff V - SP AusNet Central - Residential"},{"$f":"INDEX(Prop2021DistTar!$E$8:$E$16,C$40)","v":0.35720000000000002},{"$f":"INDEX(Prop2021DistTar!$E$8:$E$16,D$40)","v":7.3345000000000002},{"$f":"INDEX(Prop2021DistTar!$E$8:$E$16,E$40)","v":4.4001999999999999},{"$f":"INDEX(Prop2021DistTar!$E$8:$E$16,F$40)","v":0.76939999999999997},{"$f":"INDEX(Prop2021DistTar!$E$8:$E$16,G$40)","v":0.68789999999999996},{"$f":"INDEX(Prop2021DistTar!$E$8:$E$16,H$40)","v":2.5021},{"$f":"INDEX(Prop2021DistTar!$E$8:$E$16,I$40)","v":2.0011999999999999},{"$f":"INDEX(Prop2021DistTar!$E$8:$E$16,J$40)","v":0.76570000000000005},{"$f":"INDEX(Prop2021DistTar!$E$8:$E$16,K$40)","v":0.26650000000000001}]
[]
[null,{"$f":"\"Proposed : \"&B39","v":"Proposed : Tariff V - SP AusNet Central - Residential"},{"$f":"INDEX(Prop2021DistTar!$D$8:$D$16,C$39)","v":0.38579999999999998},{"$f":"INDEX(Prop2021DistTar!$D$8:$D$16,D$39)","v":6.54},{"$f":"INDEX(Prop2021DistTar!$D$8:$D$16,E$39)","v":3.9236},{"$f":"INDEX(Prop2021DistTar!$D$8:$D$16,F$39)","v":0.68610000000000004},{"$f":"INDEX(Prop2021DistTar!$D$8:$D$16,G$39)","v":0.61339999999999995},{"$f":"INDEX(Prop2021DistTar!$D$8:$D$16,H$39)","v":2.2311000000000001},{"$f":"INDEX(Prop2021DistTar!$D$8:$D$16,I$39)","v":1.7844},{"$f":"INDEX(Prop2021DistTar!$D$8:$D$16,J$39)","v":0.68279999999999996},{"$f":"INDEX(Prop2021DistTar!$D$8:$D$16,K$39)","v":0.23760000000000001}]
[]
[null,"Distribution volumes (actual)",{"$f":"C$41","v":"Fixed"},{"$f":"D$41","v":"PkBlk1"},"PkBlk2","PkBlk3","PkBlk4","OPkBlk1","OPkBlk2","OPkBlk3","OPkBlk4"]
[]
[null,{"$f":"B43","v":"Existing : Tariff V - SP AusNet Central - Residential"},{"$f":"INDEX(Prop2021DistTar!$F$8:$F$16,C$39)","v":542431.3816522432},{"$f":"INDEX(Prop2021DistTar!$F$8:$F$16,D$39)","v":5416825.5140000004},{"$f":"INDEX(Prop2021DistTar!$F$8:$F$16,E$39)","v":3862435.585},{"$f":"INDEX(Prop2021DistTar!$F$8:$F$16,F$39)","v":5818211.0760000004},{"$f":"INDEX(Prop2021DistTar!$F$8:$F$16,G$39)","v":79110.494999999995},{"$f":"INDEX(Prop2021DistTar!$F$8:$F$16,H$39)","v":7294065.8899999997},{"$f":"INDEX(Prop2021DistTar!$F$8:$F$16,I$39)","v":1682755.4269999999},{"$f":"INDEX(Prop2021DistTar!$F$8:$F$16,J$39)","v":590107.72199999995},{"$f":"INDEX(Prop2021DistTar!$F$8:$F$16,K$39)","v":79800.216}]
[]
[null,{"$f":"B45","v":"Proposed : Tariff V - SP AusNet Central - Residential"},{"$f":"INDEX(Prop2021DistTar!$F$8:$F$16,C$39)","v":542431.3816522432},{"$f":"INDEX(Prop2021DistTar!$F$8:$F$16,D$39)","v":5416825.5140000004},{"$f":"INDEX(Prop2021DistTar!$F$8:$F$16,E$39)","v":3862435.585},{"$f":"INDEX(Prop2021DistTar!$F$8:$F$16,F$39)","v":5818211.0760000004},{"$f":"INDEX(Prop2021DistTar!$F$8:$F$16,G$39)","v":79110.494999999995},{"$f":"INDEX(Prop2021DistTar!$F$8:$F$16,H$39)","v":7294065.8899999997},{"$f":"INDEX(Prop2021DistTar!$F$8:$F$16,I$39)","v":1682755.4269999999},{"$f":"INDEX(Prop2021DistTar!$F$8:$F$16,J$39)","v":590107.72199999995},{"$f":"INDEX(Prop2021DistTar!$F$8:$F$16,K$39)","v":79800.216}]
[]
[null,"Distribution revenue",{"$f":"C$41","v":"Fixed"},"PkBlk1","PkBlk2","PkBlk3","PkBlk4","OPkBlk1","OPkBlk2","OPkBlk3","OPkBlk4"]
[]
[null,{"$f":"B49","v":"Existing : Tariff V - SP AusNet Central - Residential"},{"$f":"INDEX(Prop2021DistTar!$H$8:$H$16,C$40)","v":70721118.677056164},{"$f":"INDEX(Prop2021DistTar!$H$8:$H$16,D$40)","v":39729706.732433006},{"$f":"INDEX(Prop2021DistTar!$H$8:$H$16,E$40)","v":16995489.061117001},{"$f":"INDEX(Prop2021DistTar!$H$8:$H$16,F$40)","v":4476531.6018743999},{"$f":"INDEX(Prop2021DistTar!$H$8:$H$16,G$40)","v":54420.109510499991},{"$f":"INDEX(Prop2021DistTar!$H$8:$H$16,H$40)","v":18250482.263368998},{"$f":"INDEX(Prop2021DistTar!$H$8:$H$16,I$40)","v":3367530.1605123994},{"$f":"INDEX(Prop2021DistTar!$H$8:$H$16,J$40)","v":451845.48273539997},{"$f":"INDEX(Prop2021DistTar!$H$8:$H$16,K$40)","v":21266.757564}]
[]
[null,{"$f":"B51","v":"Proposed : Tariff V - SP AusNet Central - Residential"},{"$f":"INDEX(Prop2021DistTar!$G$8:$G$16,C$39)","v":76383559.870123923},{"$f":"INDEX(Prop2021DistTar!$G$8:$G$16,D$39)","v":35426038.861560002},{"$f":"INDEX(Prop2021DistTar!$G$8:$G$16,E$39)","v":15154652.261305999},{"$f":"INDEX(Prop2021DistTar!$G$8:$G$16,F$39)","v":3991874.6192436004},{"$f":"INDEX(Prop2021DistTar!$G$8:$G$16,G$39)","v":48526.377632999996},{"$f":"INDEX(Prop2021DistTar!$G$8:$G$16,H$39)","v":16273790.407179},{"$f":"INDEX(Prop2021DistTar!$G$8:$G$16,I$39)","v":3002708.7839388},{"$f":"INDEX(Prop2021DistTar!$G$8:$G$16,J$39)","v":402925.55258159997},{"$f":"INDEX(Prop2021DistTar!$G$8:$G$16,K$39)","v":18960.5313216}]
[]
[null,"Revenue","Total"]
[null,{"$f":"B55","v":"Existing : Tariff V - SP AusNet Central - Residential"},{"$f":"SUM(C55:K55)","v":154068390.84617186}]
{"$rows_left_out":408}
{"sheet":"ARS","index":5,"n_rows":11,"n_cols":3,"rows_kept":11,"cut":false,"hidden":false,"merged":[]}
[{"$f":"\"Tariff Approval - \"&'Model update'!B3","v":"Tariff Approval - AusNet Services"}]
[]
["Ancillary Reference Services (Exc GST)"]
[]
[null,{"$f":"'Model update'!$B$8","v":2020},{"$f":"'Model update'!$B$5","v":2021}]
["Disconnection",60.57,{"$f":"ROUND(B6*(1+'Model update'!$B$30),2)","v":60.36}]
["Reconnection of Meter ",60.57,{"$f":"ROUND(B7*(1+'Model update'!$B$30),2)","v":60.36}]
["Special Meter Reads",9.39,{"$f":"ROUND(B8*(1+'Model update'!$B$30),2)","v":9.36}]
["Meter and gas installation test",181.72,{"$f":"ROUND(B9*(1+'Model update'!$B$30),2)","v":181.09}]
[]
["Note: Formula is as per AA2018-22, Part B, section 2, p9 : ART = ARTt-1  * (1+CPIt)"]