{"text_format":"1","workbook":"xlsx","n_sheets":20,"sheets":["Cover","Instructions","Contents","Inputs >>","Explanation","Input - Cost escalators - FY","Input - Cost escalators - CY","Input - Weightings","Sources","Calculations & Analysis >>","Equipment Analysis - FY","Project Analysis - FY","Equipment Analysis - CY","Project Analysis - CY","Final values >>","Final values - FY","Final values - CY","GAC Input","GAC Input - raw","ESCALATORS"],"not_rendered":{"charts":0,"images":1,"macros":0,"external_links":5,"defined_names":12,"comments":4,"pivot_tables":0},"unopened":[],"bounds":{"document_bytes":16777216,"sheet_cells":100000,"rows_first":2000,"rows_last":500,"rows_between":2000,"halvings":0,"cell_chars":16384,"cell_head_chars":4096},"cells_cut":0,"cells_raw":0,"read":"whole","date_system":"1900"}

{"sheet":"Cover","index":0,"n_rows":20,"n_cols":4,"rows_kept":20,"cut":false,"hidden":false,"merged":[[11,1,14,5],[15,1,18,5],[19,1,23,5]]}
[]
[null,null,null,"Ausgrid cost escalation spreadsheet"]
[]
[]
[null,null,"Version"]
[]
[null,null,"Date","April 2012"]
[]
{"$rows_left_out":13}
{"sheet":"Instructions","index":1,"n_rows":17,"n_cols":5,"rows_kept":17,"cut":false,"hidden":false,"merged":[[3,1,4,7],[6,1,7,7],[9,1,11,7],[13,1,14,7]]}
[]
[null,null,null,null,"Instructions"]
[]
[null,"For the capex and opex forecasts in our 2014-2019 regulatory proposal, we will need to apply a consistent approach to inflation, as well as the real increase in the costs of labour and materials over time."]
[]
[]
[null,"The capex and opex forecasts for the regulatory proposal should be represented using the purchasing power of the dollars as at 30 June 2014. In other words capex and opex should be represented in real 30 June 2014 dollars."]
[]
{"$rows_left_out":10}
{"sheet":"Contents","index":2,"n_rows":27,"n_cols":1,"rows_kept":27,"cut":false,"hidden":false,"merged":[]}
[]
["Contents"]
[]
["1.  Introduction"]
["Cover page"]
["Instructions"]
["Contents"]
[]
{"$rows_left_out":20}
{"sheet":"Inputs >>","index":3,"n_rows":0,"n_cols":0,"rows_kept":0,"cut":false,"hidden":false,"merged":[]}

{"sheet":"Explanation","index":4,"n_rows":77,"n_cols":6,"rows_kept":77,"cut":false,"hidden":false,"merged":[]}
["Inputs"]
[]
["All inputs to the cost escalation spreadsheet are entered here. "]
[]
["There are 5 categories of inputs"]
["Category",null,null,null,null,"No. escalators"]
["1. Default cost escalators",null,null,null,null,15]
["2. EGW industry indices",null,null,null,null,8]
{"$rows_left_out":70}
{"sheet":"Input - Cost escalators - FY","index":5,"n_rows":66,"n_cols":24,"rows_kept":66,"cut":false,"hidden":false,"merged":[]}
["Raw escalators"]
[]
["Financial Year"]
[null,"Source","Denom","2002-03","2003-04","2004-05","2005-06","06/07","07/08","08/09","09/10","10/11","11/12","12/13","13/14","14/15","15/16","16/17","17/18","18/19","19/20"]
[]
["1. DEFAULT"]
[]
["Aluminium","CEG","Real",null,null,null,null,null,null,null,null,null,null,-4.9398959388328834E-2,-1.0588095599750713E-2,7.1583940044118277E-2,2.9291784423515876E-2,5.0286432490387778E-2,4.5775154518936434E-2,4.0762770141929527E-2,null,null,"Codes"]
{"$rows_left_out":59}
{"sheet":"Input - Cost escalators - CY","index":6,"n_rows":66,"n_cols":23,"rows_kept":66,"cut":false,"hidden":false,"merged":[]}
["Raw escalators"]
[]
["Calendar Year"]
[null,"Source","Denom","2002-03","2003-04","2004-05","2005-06",2007,2008,2009,2010,2011,2012,2013,2014,2015,2016,2017,2018,2019]
[]
["1. DEFAULT"]
[]
["Aluminium","CEG","Real",null,null,null,null,-0.19825167890896067,-0.17339354705111054,-0.14064755059062739,9.1275049429044408E-2,0.10546007054356177,null,-7.004357420185614E-2,5.5503890220600649E-2,3.7629799549149467E-2,4.4351137316538836E-2,4.8072954465923301E-2,4.3322971280230105E-2,3.9022960799293793E-2,null,"Codes"]
{"$rows_left_out":59}
{"sheet":"Input - Weightings","index":7,"n_rows":53,"n_cols":19,"rows_kept":53,"cut":false,"hidden":false,"merged":[[7,16,22,16],[7,17,22,17]]}
["Weightings"]
[]
["1. Materials & Equipment weightings"]
["The 12 categories of Materials & Equipment (listed on the horizontal axis) are estimated as the weighted average of 15 cost escalators (along the vertical axis).  Assumed weightings are entered here."]
[]
[null,null,null,null,null,null,null,"Transformers","Distribution Transformers","Switchgear","Distribution Substations","Cable (Cu)","Cable (Al)","Secondary Protection","Transport","Coact Cable Laying","Poles (Timber)","Poles (Concrete)","Streetlighting"]
[]
["Aluminium",null,null,null,null,null,null,0,0.15,0,0.03,0,0.2,0,0,0,"Historic Trends","Historic Trends",0]
{"$rows_left_out":46}
{"sheet":"Sources","index":8,"n_rows":66,"n_cols":4,"rows_kept":66,"cut":false,"hidden":false,"merged":[[37,2,48,2],[22,2,30,2],[33,2,34,2],[31,2,32,2]]}
["Data sources"]
[]
[]
[{"$f":"'Final values - FY'!A5","v":"Cost escalators"},"Source","Derivation","Comments (if any)"]
[{"$f":"'Final values - FY'!A9","v":"Aluminium"},"CEG","Direct from source"]
[{"$f":"'Final values - FY'!A10","v":"Construction costs"},"CEG","Direct from source"]
[{"$f":"'Final values - FY'!A11","v":"Copper"},"CEG","Direct from source"]
[{"$f":"'Final values - FY'!A12","v":"Current transformer"},"Ausgrid","Calculated by macro in spreadsheet from previous determination","Needs further consideration"]
{"$rows_left_out":59}
{"sheet":"Calculations & Analysis >>","index":9,"n_rows":0,"n_cols":0,"rows_kept":0,"cut":false,"hidden":false,"merged":[]}

{"sheet":"Equipment Analysis - FY","index":10,"n_rows":220,"n_cols":21,"rows_kept":220,"cut":false,"hidden":false,"merged":[[168,2,183,2],[186,2,201,2]]}
["Materials & Equipment Escalator Analysis"]
[]
["Financial Year",null,null,null,null,null,null,null,null,null,null,null,null,{"$f":"(N94*0.1)+(N112*0.9)","v":0},{"$f":"(O94*0.1)+(O112*0.9)","v":-1.8568737680875538E-2},-1.0908410083193147E-2,1.997859422446498E-2,2.1768542752803348E-3,6.7771973592569571E-3,5.4032697129210794E-3,3.8126753627788987E-3]
[]
[null,"Financial year","Weight",null,"02/03","03/04","04/05","05/06","06/07","07/08","08/09","09/10","10/11","11/12","12/13","13/14","14/15","15/16","16/17","17/18","18/19"]
[1,"Transformers"]
[{"$f":"A6","v":1},"Aluminium",{"$f":"VLOOKUP(B7,'Input - Weightings'!$A$8:$S$23,A7+7,FALSE)","v":0},null,null,null,null,null,{"$f":"'Input - Cost escalators - FY'!H8","v":0},{"$f":"'Input - Cost escalators - FY'!I8","v":0},{"$f":"'Input - Cost escalators - FY'!J8","v":0},{"$f":"'Input - Cost escalators - FY'!K8","v":0},{"$f":"'Input - Cost escalators - FY'!L8","v":0},{"$f":"'Input - Cost escalators - FY'!M8","v":0},{"$f":"'Input - Cost escalators - FY'!N8","v":-4.9398959388328834E-2},{"$f":"'Input - Cost escalators - FY'!O8","v":-1.0588095599750713E-2},{"$f":"'Input - Cost escalators - FY'!P8","v":7.1583940044118277E-2},{"$f":"'Input - Cost escalators - FY'!Q8","v":2.9291784423515876E-2},{"$f":"'Input - Cost escalators - FY'!R8","v":5.0286432490387778E-2},{"$f":"'Input - Cost escalators - FY'!S8","v":4.5775154518936434E-2},{"$f":"'Input - Cost escalators - FY'!T8","v":4.0762770141929527E-2}]
[{"$f":"A7","v":1},"Construction costs",{"$f":"VLOOKUP(B8,'Input - Weightings'!$A$8:$S$23,A8+7,FALSE)","v":0},null,null,null,null,null,{"$f":"'Input - Cost escalators - FY'!H9","v":0},{"$f":"'Input - Cost escalators - FY'!I9","v":0},{"$f":"'Input - Cost escalators - FY'!J9","v":0},{"$f":"'Input - Cost escalators - FY'!K9","v":0},{"$f":"'Input - Cost escalators - FY'!L9","v":0},{"$f":"'Input - Cost escalators - FY'!M9","v":0},{"$f":"'Input - Cost escalators - FY'!N9","v":-1.582759056573102E-2},{"$f":"'Input - Cost escalators - FY'!O9","v":8.6043290792177096E-3},{"$f":"'Input - Cost escalators - FY'!P9","v":4.4585631242564094E-3},{"$f":"'Input - Cost escalators - FY'!Q9","v":4.0031713242774103E-3},{"$f":"'Input - Cost escalators - FY'!R9","v":4.2316019860397791E-3},{"$f":"'Input - Cost escalators - FY'!S9","v":4.049718610257047E-3},{"$f":"'Input - Cost escalators - FY'!T9","v":6.094203839117629E-4}]
{"$rows_left_out":213}
{"sheet":"Project Analysis - FY","index":11,"n_rows":304,"n_cols":24,"rows_kept":304,"cut":false,"hidden":false,"merged":[]}
["Project Escalator Analysis"]
[]
["Financial Year"]
[]
[null,"Financial year","Weight",null,"02/03","03/04","04/05","05/06","06/07","07/08","08/09","09/10","10/11","11/12","12/13","13/14","14/15","15/16","16/17","17/18","18/19",null,"Source"]
[1,"Substations"]
[{"$f":"A6","v":1},"Civil Construction",{"$f":"VLOOKUP(B7,'Input - Weightings'!$A$31:$S$53,A7+7,FALSE)","v":0.25152529029718557},null,null,null,null,null,{"$f":"'Equipment Analysis - FY'!I8","v":0},{"$f":"'Equipment Analysis - FY'!J8","v":0},{"$f":"'Equipment Analysis - FY'!K8","v":0},{"$f":"'Equipment Analysis - FY'!L8","v":0},{"$f":"'Equipment Analysis - FY'!M8","v":0},{"$f":"'Equipment Analysis - FY'!N8","v":0},{"$f":"'Equipment Analysis - FY'!O8","v":-1.582759056573102E-2},{"$f":"'Equipment Analysis - FY'!P8","v":8.6043290792177096E-3},{"$f":"'Equipment Analysis - FY'!Q8","v":4.4585631242564094E-3},{"$f":"'Equipment Analysis - FY'!R8","v":4.0031713242774103E-3},{"$f":"'Equipment Analysis - FY'!S8","v":4.2316019860397791E-3},{"$f":"'Equipment Analysis - FY'!T8","v":4.049718610257047E-3},{"$f":"'Equipment Analysis - FY'!U8","v":6.094203839117629E-4},null,"Construction costs","Equipment"]
[{"$f":"A7","v":1},"Contracted Services (CCL)",{"$f":"VLOOKUP(B8,'Input - Weightings'!$A$31:$S$53,A8+7,FALSE)","v":0},null,null,null,null,null,{"$f":"'Equipment Analysis - FY'!I166","v":0},{"$f":"'Equipment Analysis - FY'!J166","v":0},{"$f":"'Equipment Analysis - FY'!K166","v":0},{"$f":"'Equipment Analysis - FY'!L166","v":0},{"$f":"'Equipment Analysis - FY'!M166","v":0},{"$f":"'Equipment Analysis - FY'!N166","v":0},{"$f":"'Equipment Analysis - FY'!O166","v":3.1635853943653204E-3},{"$f":"'Equipment Analysis - FY'!P166","v":1.0705704459316668E-2},{"$f":"'Equipment Analysis - FY'!Q166","v":1.3500565126076247E-2},{"$f":"'Equipment Analysis - FY'!R166","v":2.0207188896978544E-2},{"$f":"'Equipment Analysis - FY'!S166","v":2.1193556281651694E-2},{"$f":"'Equipment Analysis - FY'!T166","v":1.9672835042994132E-2},{"$f":"'Equipment Analysis - FY'!U166","v":1.884860253632701E-2},null,"Contract cable laying","Equipment"]
{"$rows_left_out":297}
{"sheet":"Equipment Analysis - CY","index":12,"n_rows":220,"n_cols":21,"rows_kept":220,"cut":false,"hidden":false,"merged":[[168,2,183,2],[186,2,201,2]]}
["Materials & Equipment Escalator Analysis"]
[]
["Calendar Year"]
[]
[null,"Calendar year","Weight",null,"02/03","03/04","04/05","05/06",2007,2008,2009,2010,2011,2012,2013,2014,2015,2016,2017,2018,2019]
[1,"Transformers"]
[{"$f":"A6","v":1},"Aluminium",{"$f":"VLOOKUP(B7,'Input - Weightings'!$A$8:$S$23,A7+7,FALSE)","v":0},null,null,null,null,null,{"$f":"'Input - Cost escalators - CY'!H8","v":-0.19825167890896067},{"$f":"'Input - Cost escalators - CY'!I8","v":-0.17339354705111054},{"$f":"'Input - Cost escalators - CY'!J8","v":-0.14064755059062739},{"$f":"'Input - Cost escalators - CY'!K8","v":9.1275049429044408E-2},{"$f":"'Input - Cost escalators - CY'!L8","v":0.10546007054356177},{"$f":"'Input - Cost escalators - CY'!M8","v":0},{"$f":"'Input - Cost escalators - CY'!N8","v":-7.004357420185614E-2},{"$f":"'Input - Cost escalators - CY'!O8","v":5.5503890220600649E-2},{"$f":"'Input - Cost escalators - CY'!P8","v":3.7629799549149467E-2},{"$f":"'Input - Cost escalators - CY'!Q8","v":4.4351137316538836E-2},{"$f":"'Input - Cost escalators - CY'!R8","v":4.8072954465923301E-2},{"$f":"'Input - Cost escalators - CY'!S8","v":4.3322971280230105E-2},{"$f":"'Input - Cost escalators - CY'!T8","v":3.9022960799293793E-2}]
[{"$f":"A7","v":1},"Construction costs",{"$f":"VLOOKUP(B8,'Input - Weightings'!$A$8:$S$23,A8+7,FALSE)","v":0},null,null,null,null,null,{"$f":"'Input - Cost escalators - CY'!H9","v":1.923326712730189E-2},{"$f":"'Input - Cost escalators - CY'!I9","v":1.5806871629520547E-2},{"$f":"'Input - Cost escalators - CY'!J9","v":-3.3610400429327725E-2},{"$f":"'Input - Cost escalators - CY'!K9","v":7.7205152624983953E-3},{"$f":"'Input - Cost escalators - CY'!L9","v":6.6400177263208349E-3},{"$f":"'Input - Cost escalators - CY'!M9","v":0},{"$f":"'Input - Cost escalators - CY'!N9","v":-1.3948620276826751E-2},{"$f":"'Input - Cost escalators - CY'!O9","v":9.2103142029775764E-3},{"$f":"'Input - Cost escalators - CY'!P9","v":3.9599207407332582E-3},{"$f":"'Input - Cost escalators - CY'!Q9","v":4.1007126883809697E-3},{"$f":"'Input - Cost escalators - CY'!R9","v":4.3710503026850311E-3},{"$f":"'Input - Cost escalators - CY'!S9","v":2.2715929507823862E-3},{"$f":"'Input - Cost escalators - CY'!T9","v":5.7335244109912864E-4}]
{"$rows_left_out":213}
{"sheet":"Project Analysis - CY","index":13,"n_rows":303,"n_cols":24,"rows_kept":303,"cut":false,"hidden":false,"merged":[]}
["Project Escalator Analysis"]
["Calendar Year"]
[]
[null,"Calendar year","Weight",null,"02/03","03/04","04/05","05/06",2007,2008,2009,2010,2011,2012,2013,2014,2015,2016,2017,2018,2019,null,"Source"]
[1,"Substations"]
[{"$f":"A5","v":1},"Civil Construction",{"$f":"VLOOKUP(B6,'Input - Weightings'!$A$31:$S$53,A6+7,FALSE)","v":0.25152529029718557},null,null,null,null,null,{"$f":"'Equipment Analysis - CY'!I8","v":1.923326712730189E-2},{"$f":"'Equipment Analysis - CY'!J8","v":1.5806871629520547E-2},{"$f":"'Equipment Analysis - CY'!K8","v":-3.3610400429327725E-2},{"$f":"'Equipment Analysis - CY'!L8","v":7.7205152624983953E-3},{"$f":"'Equipment Analysis - CY'!M8","v":6.6400177263208349E-3},{"$f":"'Equipment Analysis - CY'!N8","v":0},{"$f":"'Equipment Analysis - CY'!O8","v":-1.3948620276826751E-2},{"$f":"'Equipment Analysis - CY'!P8","v":9.2103142029775764E-3},{"$f":"'Equipment Analysis - CY'!Q8","v":3.9599207407332582E-3},{"$f":"'Equipment Analysis - CY'!R8","v":4.1007126883809697E-3},{"$f":"'Equipment Analysis - CY'!S8","v":4.3710503026850311E-3},{"$f":"'Equipment Analysis - CY'!T8","v":2.2715929507823862E-3},{"$f":"'Equipment Analysis - CY'!U8","v":5.7335244109912864E-4},null,"Construction costs","Equipment"]
[{"$f":"A6","v":1},"Contracted Services (CCL)",{"$f":"VLOOKUP(B7,'Input - Weightings'!$A$31:$S$53,A7+7,FALSE)","v":0},null,null,null,null,null,{"$f":"'Equipment Analysis - CY'!I166","v":0},{"$f":"'Equipment Analysis - CY'!J166","v":0},{"$f":"'Equipment Analysis - CY'!K166","v":0},{"$f":"'Equipment Analysis - CY'!L166","v":0},{"$f":"'Equipment Analysis - CY'!M166","v":0},{"$f":"'Equipment Analysis - CY'!N166","v":0},{"$f":"'Equipment Analysis - CY'!O166","v":5.1301716701797062E-3},{"$f":"'Equipment Analysis - CY'!P166","v":1.2299448342315111E-2},{"$f":"'Equipment Analysis - CY'!Q166","v":1.7052225959656588E-2},{"$f":"'Equipment Analysis - CY'!R166","v":2.1246195182816608E-2},{"$f":"'Equipment Analysis - CY'!S166","v":2.3465312588390019E-2},{"$f":"'Equipment Analysis - CY'!T166","v":1.9005171806926291E-2},{"$f":"'Equipment Analysis - CY'!U166","v":1.9005171806926291E-2},null,"Contract cable laying","Equipment"]
[1,"Labour (EGW)",{"$f":"VLOOKUP(B8,'Input - Weightings'!$A$31:$S$53,A8+7,FALSE)","v":0.29356425900413302},null,null,null,null,null,{"$f":"'Input - Cost escalators - CY'!H12","v":0},{"$f":"'Input - Cost escalators - CY'!I12","v":0},{"$f":"'Input - Cost escalators - CY'!J12","v":0},{"$f":"'Input - Cost escalators - CY'!K12","v":0},{"$f":"'Input - Cost escalators - CY'!L12","v":0},{"$f":"'Input - Cost escalators - CY'!M12","v":0},{"$f":"'Input - Cost escalators - CY'!N12","v":6.1715209561863382E-3},{"$f":"'Input - Cost escalators - CY'!O12","v":2.7400949156246579E-3},{"$f":"'Input - Cost escalators - CY'!P12","v":1.8500440601293411E-2},{"$f":"'Input - Cost escalators - CY'!Q12","v":2.7750988165532453E-2},{"$f":"'Input - Cost escalators - CY'!R12","v":2.9202273858200289E-2},{"$f":"'Input - Cost escalators - CY'!S12","v":2.340450064273969E-2},{"$f":"'Input - Cost escalators - CY'!T12","v":2.3404500642740134E-2},null,"EGW wages","Input cost"]
{"$rows_left_out":296}
{"sheet":"Final values >>","index":14,"n_rows":0,"n_cols":0,"rows_kept":0,"cut":false,"hidden":false,"merged":[]}

{"sheet":"Final values - FY","index":15,"n_rows":78,"n_cols":14,"rows_kept":78,"cut":false,"hidden":false,"merged":[]}
["Cost Escalation Rates - 21 August 2012"]
[]
["Financial Year"]
[]
["Cost escalators"]
[]
[null,"06/07","07/08","08/09","09/10","10/11","11/12","12/13","13/14","14/15","15/16","16/17","17/18","18/19"]
[]
{"$rows_left_out":71}
{"sheet":"Final values - CY","index":16,"n_rows":78,"n_cols":14,"rows_kept":78,"cut":false,"hidden":false,"merged":[]}
["Cost Escalation Rates - 21 August 2012"]
[]
["Calendar Year"]
[]
["Cost escalators"]
[]
[null,2007,2008,2009,2010,2011,2012,2013,2014,2015,2016,2017,2018,2019]
[]
{"$rows_left_out":71}
{"sheet":"GAC Input","index":17,"n_rows":207,"n_cols":50,"rows_kept":207,"cut":false,"hidden":false,"merged":[]}
[]
["HTTP://BPCP - EA_Planning - GACMODEL - t44397"]
[null,null,null,"2004.INP","2005.INP","2006.INP","2007.INP","2008.INP","2009.INP","2010.INP","2011.INP","2012.INP","2013.INP","2014.INP","2015.INP","2016.INP","2017.INP","2018.INP","2019.INP","2020.INP","2021.INP","2022.INP","2023.INP","2024.INP","2025.INP","2026.INP","2027.INP","2028.INP","2029.INP","2030.INP","2031.INP","2032.INP","2033.INP","2034.INP","2035.INP","2036.INP","2037.INP","2038.INP","2039.INP","2040.INP","2041.INP","2042.INP","2043.INP","2044.INP","2045.INP","2046.INP","2047.INP","2048.INP","2049.INP","2050.INP"]
["Version:",null,null,"FY2003/04 Input","FY2004/05 Input","FY2005/06 Input","FY2006/07 Input","FY2007/08 Input","FY2008/09 Input","FY2009/10 Input","FY2010/11 Input","FY2011/12 Input","FY2012/13 Input","FY2013/14 Input","FY2014/15 Input","FY2015/16 Input","FY2016/17 Input","FY2017/18 Input","FY2018/19 Input","FY2019/20 Input","FY2020/21 Input","FY2021/22 Input","FY2022/23 Input","FY2023/24 Input","FY2024/25 Input","FY2025/26 Input","FY2026/27 Input","FY2027/28 Input","FY2028/29 Input","FY2029/30 Input","FY2030/31 Input","FY2031/32 Input","FY2032/33 Input","FY2033/34 Input","FY2034/35 Input","FY2035/36 Input","FY2036/37 Input","FY2037/38 Input","FY2038/39 Input","FY2039/40 Input","FY2040/41 Input","FY2041/42 Input","FY2042/43 Input","FY2043/44 Input","FY2044/45 Input","FY2045/46 Input","FY2046/47 Input","FY2047/48 Input","FY2048/49 Input","FY2049/50 Input"]
["Inflation"]
[null,"Annualised CPI %",null,null,null,null,null,null,null,null,null,null,2.2403100775193918E-2,2.0517372737300699E-2,2.4999999999999911E-2,2.4999999999999911E-2,2.4999999999999911E-2,2.4999999999999911E-2,2.4999999999999911E-2,2.5000000000000133E-2,2.4999999999999911E-2,2.4999999999999911E-2,2.4999999999999911E-2]
[]
[]
{"$rows_left_out":200}
{"sheet":"GAC Input - raw","index":18,"n_rows":109,"n_cols":50,"rows_kept":109,"cut":false,"hidden":false,"merged":[]}
[]
["HTTP://BPCP - EA_Planning - GACMODEL - t44397"]
[null,null,null,"2004.INP","2005.INP","2006.INP","2007.INP","2008.INP","2009.INP","2010.INP","2011.INP","2012.INP","2013.INP","2014.INP","2015.INP","2016.INP","2017.INP","2018.INP","2019.INP","2020.INP","2021.INP","2022.INP","2023.INP","2024.INP","2025.INP","2026.INP","2027.INP","2028.INP","2029.INP","2030.INP","2031.INP","2032.INP","2033.INP","2034.INP","2035.INP","2036.INP","2037.INP","2038.INP","2039.INP","2040.INP","2041.INP","2042.INP","2043.INP","2044.INP","2045.INP","2046.INP","2047.INP","2048.INP","2049.INP","2050.INP"]
["Version:",null,null,"FY2003/04 Input","FY2004/05 Input","FY2005/06 Input","FY2006/07 Input","FY2007/08 Input","FY2008/09 Input","FY2009/10 Input","FY2010/11 Input","FY2011/12 Input","FY2012/13 Input","FY2013/14 Input","FY2014/15 Input","FY2015/16 Input","FY2016/17 Input","FY2017/18 Input","FY2018/19 Input","FY2019/20 Input","FY2020/21 Input","FY2021/22 Input","FY2022/23 Input","FY2023/24 Input","FY2024/25 Input","FY2025/26 Input","FY2026/27 Input","FY2027/28 Input","FY2028/29 Input","FY2029/30 Input","FY2030/31 Input","FY2031/32 Input","FY2032/33 Input","FY2033/34 Input","FY2034/35 Input","FY2035/36 Input","FY2036/37 Input","FY2037/38 Input","FY2038/39 Input","FY2039/40 Input","FY2040/41 Input","FY2041/42 Input","FY2042/43 Input","FY2043/44 Input","FY2044/45 Input","FY2045/46 Input","FY2046/47 Input","FY2047/48 Input","FY2048/49 Input","FY2049/50 Input"]
["Inflation"]
[null,"Annualised CPI %",null,null,null,null,null,null,null,null,null,{"$f":"'[3]AU Inflation'!$N$13","v":2.3023791250959436E-2},{"$f":"'[3]AU Inflation'!$N$14","v":2.7099274818704666E-2},{"$f":"'[3]AU Inflation'!$N$15","v":2.4787424799810998E-2},2.4999999999999911E-2,2.4999999999999689E-2,2.5000000000000133E-2,2.4999999999999911E-2,2.4999999999999911E-2,2.4999999999999911E-2,2.4999999999999689E-2,2.4999999999999911E-2]
[]
[]
{"$rows_left_out":102}
{"sheet":"ESCALATORS","index":19,"n_rows":66,"n_cols":12,"rows_kept":66,"cut":false,"hidden":false,"merged":[]}
[null,"RAW ESCALATORS - FINANCIAL YEARS"]
[null,null,null,null,"FY 2011/12","FY 2012/13","FY 2013/14","FY 2014/15","FY 2015/16","FY 2016/17","FY 2017/18","FY 2018/19"]
["CONTRACTED SERVICES","General labour"]
[null,"CS - sub-transmission sub-stations"]
[null,"CS - zone sub-stations"]
[]
["LABOUR","EGW labour"]
[]
{"$rows_left_out":58}