{"text_format":"1","workbook":"xlsx","n_sheets":15,"sheets":["Instructions","DNSP Inputs General","DNSP Inputs O & M","DNSP Inputs Capex","Total RAB","PL Tariffs","Cashflow Summary","Charges Summary","O & M 2016-2020","Capex 2016-2020","WACC","Depn & WACC Post 2004","RAB 2001 to 2004","Inputs PL Final Decision 2004","RAB RIN Reconciliation (AER)"],"not_rendered":{"charts":0,"images":0,"macros":0,"external_links":1,"defined_names":4,"comments":1,"pivot_tables":0},"unopened":[],"bounds":{"document_bytes":16777216,"sheet_cells":100000,"rows_first":2000,"rows_last":500,"rows_between":2000,"halvings":0,"cell_chars":16384,"cell_head_chars":4096},"cells_cut":0,"cells_raw":0,"read":"whole","date_system":"1900"}

{"sheet":"Instructions","index":0,"n_rows":70,"n_cols":12,"rows_kept":70,"cut":false,"hidden":false,"merged":[]}
[{"$f":"'DNSP Inputs O & M'!$A$3","v":"CitiPower"}]
[]
["Instructions"]
[]
["This model is to be used for the setting of Public Lighting Tariffs for the Regulatory Period 2016 to 2020 based on forecast inflation rates and Real Pre Tax WACC."]
[]
["Distributor data input fields are shaded",null,"      and located in tabs \"DNSP Inputs General\" , \"DNSP Inputs O & M\" and  \"DNSP Inputs Capex\""]
["NOTE : All Distributor data input fields have been populated with test data in this model."]
{"$rows_left_out":63}
{"sheet":"DNSP Inputs General","index":1,"n_rows":76,"n_cols":17,"rows_kept":76,"cut":false,"hidden":false,"merged":[[38,9,38,14],[2,9,2,14],[17,9,17,14],[17,5,17,8],[38,5,38,8],[2,3,2,8]]}
[{"$f":"'DNSP Inputs O & M'!$A$3","v":"CitiPower"}]
[null,null,null,2009,2010,2011,2012,2013,2014,2015,2016,2017,2018,2019,2020]
["Capital Expenditue",null,null,"Nominal $ - Actual",null,null,null,null,null,"Real 2015 $ - Forecast"]
["(Net of customer contributions)"]
[]
["Poles and Brackets",null,null,{"$f":"'[1]ACS - General'!D$6","v":105950.20474964984},{"$f":"'[1]ACS - General'!E$6","v":11736.161669563049},{"$f":"'[1]ACS - General'!F$6","v":10313.314043396824},{"$f":"'[1]ACS - General'!G$6","v":12803.864361983717},{"$f":"'[1]ACS - General'!H$6","v":-44327.217146933341},{"$f":"'[1]ACS - General'!I$6","v":17361.838317597219},{"$f":"'[1]ACS - General'!J$6","v":11317.446403399023},{"$f":"'Capex 2016-2020'!B22","v":3553.9386858212938},{"$f":"'Capex 2016-2020'!C22","v":3602.6301178725116},{"$f":"'Capex 2016-2020'!D22","v":3649.4351993363407},{"$f":"'Capex 2016-2020'!E22","v":3696.9032834973923},{"$f":"'Capex 2016-2020'!F22","v":3745.37461367588}]
[]
["Existing Lights"]
{"$rows_left_out":69}
{"sheet":"DNSP Inputs O & M","index":2,"n_rows":173,"n_cols":8,"rows_kept":173,"cut":false,"hidden":false,"merged":[[4,2,4,7],[2,2,2,7]]}
["Public Lighting Cost Build-up Model"]
[]
["CitiPower",null,"O & M Data Inputs"]
[]
[null,null,"Real 2015 $ "]
[]
["Input parameters",null,2015,2016,2017,2018,2019,2020]
[]
{"$rows_left_out":166}
{"sheet":"DNSP Inputs Capex","index":3,"n_rows":116,"n_cols":8,"rows_kept":116,"cut":false,"hidden":false,"merged":[[4,2,4,7],[2,2,2,7]]}
["Public Lighting Cost Build-up Model"]
[]
[{"$f":"'DNSP Inputs O & M'!$A$3","v":"CitiPower"},null,"Capex Data Inputs"]
[]
[null,null,"Real 2015 $ "]
[]
["Input parameters",null,2015,2016,2017,2018,2019,2020]
[]
{"$rows_left_out":109}
{"sheet":"Total RAB","index":4,"n_rows":153,"n_cols":18,"rows_kept":153,"cut":false,"hidden":false,"merged":[]}
[{"$f":"'DNSP Inputs O & M'!$A$3","v":"CitiPower"},null,null,null,"Check",{"$f":"SUM(B144)","v":6.9849193096160889E-9}]
[]
["Total Public Lighting RAB"]
["Historical cost ($)"]
[]
[null,"Life (years)",2005,2006,2007,2008,2009,2010,2011,2012,2013,2014,2015,2016,2017,2018,2019,2020]
[]
["Capital Expenditue (Nominal $)"]
{"$rows_left_out":146}
{"sheet":"PL Tariffs","index":5,"n_rows":36,"n_cols":20,"rows_kept":36,"cut":false,"hidden":false,"merged":[[2,2,2,7],[2,9,2,13],[2,15,2,19]]}
[{"$f":"'DNSP Inputs O & M'!$A$3","v":"CitiPower"},null,null,null,"Global Check",{"$f":"IF(SUM('Total RAB'!F1,'Depn & WACC Post 2004'!F1,'Cashflow Summary'!F1)<1,\"Ok\",\"Error\")","v":"Ok"}]
[]
["Public Lighting Tariffs",null,"Nominal Prices",null,null,null,null,null,null,"Nominal Price Movement",null,null,null,null,null,"Real Price Movement (Implied X Factor)"]
[null,null,"Actual"]
[{"$f":"'DNSP Inputs General'!A$40","v":"Existing Lights"},null,{"$f":"'DNSP Inputs General'!J$2","v":2015},{"$f":"'DNSP Inputs General'!K$2","v":2016},{"$f":"'DNSP Inputs General'!L$2","v":2017},{"$f":"'DNSP Inputs General'!M$2","v":2018},{"$f":"'DNSP Inputs General'!N$2","v":2019},{"$f":"'DNSP Inputs General'!O$2","v":2020},null,{"$f":"D5","v":2016},{"$f":"E5","v":2017},2018,2019,2020,null,{"$f":"J5","v":2016},{"$f":"K5","v":2017},2018,2019,2020]
[{"$f":"'DNSP Inputs General'!A41","v":"Mercury vapour 80 watt"},null,{"$f":"'DNSP Inputs General'!E41","v":69.065546198296715},{"$f":"'Charges Summary'!D$31","v":70.599373121303586},{"$f":"'Charges Summary'!E$31","v":72.781524421187171},{"$f":"'Charges Summary'!F$31","v":73.244301282800805},{"$f":"'Charges Summary'!G$31","v":74.674567632304885},{"$f":"'Charges Summary'!H$31","v":76.000359544635216},null,{"$f":"IF(C6=0,\"\",D6/C6-1)","v":2.2208279054263036E-2},{"$f":"IF(D6=0,\"\",E6/D6-1)","v":3.0908933088318324E-2},{"$f":"IF(E6=0,\"\",F6/E6-1)","v":6.3584387012223242E-3},{"$f":"IF(F6=0,\"\",G6/F6-1)","v":1.9527339662668508E-2},{"$f":"IF(G6=0,\"\",H6/G6-1)","v":1.7754262988953329E-2},null,{"$f":"IF(C6=0,\"\",(D6/'Charges Summary'!D$4)/C6-1)","v":-3.6956344500360672E-3},{"$f":"IF(D6=0,\"\",(E6/'Charges Summary'!E$4)/(D6/'Charges Summary'!D$4)-1)","v":4.784535173799398E-3},{"$f":"IF(E6=0,\"\",(F6/'Charges Summary'!F$4)/(E6/'Charges Summary'!E$4)-1)","v":-1.9143821928633176E-2},{"$f":"IF(F6=0,\"\",(G6/'Charges Summary'!G$4)/(F6/'Charges Summary'!F$4)-1)","v":-6.3086358063660919E-3},{"$f":"IF(G6=0,\"\",(H6/'Charges Summary'!H$4)/(G6/'Charges Summary'!G$4)-1)","v":-8.0367807125210078E-3}]
[{"$f":"'DNSP Inputs General'!A42","v":"Sodium high pressure 150 watt"},null,{"$f":"'DNSP Inputs General'!E42","v":117.65487627651783},{"$f":"'Charges Summary'!D$55","v":114.41755626756137},{"$f":"'Charges Summary'!E$55","v":118.22496638066858},{"$f":"'Charges Summary'!F$55","v":120.27791110105552},{"$f":"'Charges Summary'!G$55","v":123.34040409034967},{"$f":"'Charges Summary'!H$55","v":126.40833605142427},null,-2.751539172373918E-2,3.3276450199685392E-2,1.7364730845232268E-2,2.5461807253379209E-2,2.4873697988108345E-2,null,{"$f":"IF(C7=0,\"\",(D7/'Charges Summary'!D$4)/C7-1)","v":-5.215925119272824E-2},{"$f":"IF(D7=0,\"\",(E7/'Charges Summary'!E$4)/(D7/'Charges Summary'!D$4)-1)","v":7.0920567248395905E-3},{"$f":"IF(E7=0,\"\",(F7/'Charges Summary'!F$4)/(E7/'Charges Summary'!E$4)-1)","v":-8.4164416713136125E-3},{"$f":"IF(F7=0,\"\",(G7/'Charges Summary'!G$4)/(F7/'Charges Summary'!F$4)-1)","v":-5.245543339386094E-4},{"$f":"IF(G7=0,\"\",(H7/'Charges Summary'!H$4)/(G7/'Charges Summary'!G$4)-1)","v":-1.0977602455085611E-3}]
[{"$f":"'DNSP Inputs General'!A43","v":"Sodium high pressure 250 watt"},null,{"$f":"'DNSP Inputs General'!E43","v":119.37232613108132},{"$f":"'Charges Summary'!D$71","v":115.11547917486871},{"$f":"'Charges Summary'!E$71","v":118.9097067580567},{"$f":"'Charges Summary'!F$71","v":120.89531680540041},{"$f":"'Charges Summary'!G$71","v":123.90770621722756},{"$f":"'Charges Summary'!H$71","v":126.92641370762222},null,-3.5660249692531121E-2,3.2960185809801423E-2,1.6698468960013368E-2,2.4917337506762616E-2,2.4362548404394113E-2,null,{"$f":"IF(C8=0,\"\",(D8/'Charges Summary'!D$4)/C8-1)","v":-6.0097709251979659E-2},{"$f":"IF(D8=0,\"\",(E8/'Charges Summary'!E$4)/(D8/'Charges Summary'!D$4)-1)","v":6.7838068321650624E-3},{"$f":"IF(E8=0,\"\",(F8/'Charges Summary'!F$4)/(E8/'Charges Summary'!E$4)-1)","v":-9.0658197270825358E-3},{"$f":"IF(F8=0,\"\",(G8/'Charges Summary'!G$4)/(F8/'Charges Summary'!F$4)-1)","v":-1.055226601596071E-3},{"$f":"IF(G8=0,\"\",(H8/'Charges Summary'!H$4)/(G8/'Charges Summary'!G$4)-1)","v":-1.595956720863434E-3}]
{"$rows_left_out":29}
{"sheet":"Cashflow Summary","index":6,"n_rows":162,"n_cols":15,"rows_kept":162,"cut":false,"hidden":false,"merged":[[3,2,3,7],[3,9,3,14],[41,3,41,7],[41,10,41,14],[141,3,141,7],[153,3,153,7],[87,3,87,7],[87,10,87,14],[134,3,134,7],[134,10,134,14]]}
[{"$f":"'DNSP Inputs O & M'!$A$3","v":"CitiPower"},null,null,null,"Check",{"$f":"SUM(C133,C139,C162)","v":9.9607859738171101E-9}]
[null,null,{"$f":"'DNSP Inputs General'!J$2","v":2015},{"$f":"'DNSP Inputs General'!K$2","v":2016},{"$f":"'DNSP Inputs General'!L$2","v":2017},{"$f":"'DNSP Inputs General'!M$2","v":2018},{"$f":"'DNSP Inputs General'!N$2","v":2019},{"$f":"'DNSP Inputs General'!O$2","v":2020},null,{"$f":"C2","v":2015},{"$f":"D2","v":2016},2017,2018,2019,2020]
[]
["Public Lighting - Revenue",null,"Revenue - Nominal ",null,null,null,null,null,null,"Revenue - Real 2015 $ "]
[null,null,{"$f":"C$2","v":2015},{"$f":"D$2","v":2016},2017,2018,2019,2020,null,{"$f":"J$2","v":2015},2016,2017,2018,2019,2020]
[{"$f":"'DNSP Inputs General'!A$40","v":"Existing Lights"}]
[{"$f":"'DNSP Inputs General'!A$41","v":"Mercury vapour 80 watt"},null,{"$f":"IF('PL Tariffs'!C6=0,\"\",'DNSP Inputs General'!J41*'PL Tariffs'!C6)","v":355026.83131102618},{"$f":"IF('PL Tariffs'!D6=0,\"\",'DNSP Inputs General'!K41*'PL Tariffs'!D6)","v":300811.18915855879},{"$f":"IF('PL Tariffs'!E6=0,\"\",'DNSP Inputs General'!L41*'PL Tariffs'!E6)","v":172258.45830645549},{"$f":"IF('PL Tariffs'!F6=0,\"\",'DNSP Inputs General'!M41*'PL Tariffs'!F6)","v":155317.46612740381},{"$f":"IF('PL Tariffs'!G6=0,\"\",'DNSP Inputs General'!N41*'PL Tariffs'!G6)","v":141875.11324978166},{"$f":"IF('PL Tariffs'!H6=0,\"\",'DNSP Inputs General'!O41*'PL Tariffs'!H6)","v":129370.78085272679},null,{"$f":"C7","v":355026.83131102618},{"$f":"D7/'Charges Summary'!D$4","v":293188.29352686042},{"$f":"E7/'Charges Summary'!E$4","v":163638.62984095345},{"$f":"F7/'Charges Summary'!F$4","v":143806.40000640473},{"$f":"G7/'Charges Summary'!G$4","v":128031.48362270658},{"$f":"H7/'Charges Summary'!H$4","v":113788.76807171518}]
[{"$f":"'DNSP Inputs General'!A$42","v":"Sodium high pressure 150 watt"},null,{"$f":"IF('PL Tariffs'!C7=0,\"\",'DNSP Inputs General'!J42*'PL Tariffs'!C7)","v":1269782.6687832887},{"$f":"IF('PL Tariffs'!D7=0,\"\",'DNSP Inputs General'!K42*'PL Tariffs'!D7)","v":1240990.9605842761},{"$f":"IF('PL Tariffs'!E7=0,\"\",'DNSP Inputs General'!L42*'PL Tariffs'!E7)","v":1288669.7557707375},{"$f":"IF('PL Tariffs'!F7=0,\"\",'DNSP Inputs General'!M42*'PL Tariffs'!F7)","v":1317573.3453784268},{"$f":"IF('PL Tariffs'!G7=0,\"\",'DNSP Inputs General'!N42*'PL Tariffs'!G7)","v":1357846.8120716098},{"$f":"IF('PL Tariffs'!H7=0,\"\",'DNSP Inputs General'!O42*'PL Tariffs'!H7)","v":1398548.7560284727},null,1269782.6687832887,{"$f":"D8/'Charges Summary'!D$4","v":1209542.8465733684},{"$f":"E8/'Charges Summary'!E$4","v":1224184.6073917688},{"$f":"F8/'Charges Summary'!F$4","v":1219923.8390088335},{"$f":"G8/'Charges Summary'!G$4","v":1225353.3258917641},{"$f":"H8/'Charges Summary'!H$4","v":1230101.1015607193}]
{"$rows_left_out":155}
{"sheet":"Charges Summary","index":7,"n_rows":107,"n_cols":8,"rows_kept":107,"cut":false,"hidden":false,"merged":[]}
[{"$f":"'DNSP Inputs O & M'!$A$3","v":"CitiPower"},null,null,{"$f":"'DNSP Inputs General'!K$2","v":2016},{"$f":"'DNSP Inputs General'!L$2","v":2017},{"$f":"'DNSP Inputs General'!M$2","v":2018},{"$f":"'DNSP Inputs General'!N$2","v":2019},{"$f":"'DNSP Inputs General'!O$2","v":2020}]
["Nominal $"]
[]
[{"$f":"'Total RAB'!A20","v":"CPI Index"},null,null,{"$f":"(1+WACC!E6)","v":1.026},{"$f":"D4*(1+WACC!F6)","v":1.0526759999999999},{"$f":"E4*(1+WACC!G6)","v":1.0800455760000001},{"$f":"F4*(1+WACC!H6)","v":1.1081267609760002},{"$f":"G4*(1+WACC!I6)","v":1.1369380567613763}]
[]
[{"$f":"'DNSP Inputs General'!$A$6","v":"Poles and Brackets"},null,null,{"$f":"'DNSP Inputs General'!K$2","v":2016},{"$f":"'DNSP Inputs General'!L$2","v":2017},{"$f":"'DNSP Inputs General'!M$2","v":2018},{"$f":"'DNSP Inputs General'!N$2","v":2019},{"$f":"'DNSP Inputs General'!O$2","v":2020}]
["O & M"]
[{"$f":"'O & M 2016-2020'!A$10","v":"Dedicated poles - inspection"},null,null,{"$f":"'O & M 2016-2020'!$B$10*D$4","v":0},{"$f":"'O & M 2016-2020'!$J$10*E$4","v":0},{"$f":"'O & M 2016-2020'!$R$10*F$4","v":0},{"$f":"'O & M 2016-2020'!$Z$10*G$4","v":0},{"$f":"'O & M 2016-2020'!$AH$10*H$4","v":0}]
{"$rows_left_out":100}
{"sheet":"O & M 2016-2020","index":8,"n_rows":229,"n_cols":40,"rows_kept":229,"cut":false,"hidden":false,"merged":[[59,1,59,6],[166,1,166,6],[100,1,100,6],[132,1,132,6],[166,17,166,22],[166,9,166,14],[59,17,59,22],[100,17,100,22],[132,17,132,22],[59,9,59,14],[100,9,100,14],[132,9,132,14],[166,33,166,38],[100,25,100,30],[59,33,59,38],[100,33,100,38],[132,33,132,38],[166,25,166,30],[132,25,132,30],[59,25,59,30],[203,25,203,30],[203,33,203,38],[203,1,203,6],[203,9,203,14],[203,17,203,22]]}
[{"$f":"'DNSP Inputs O & M'!$A$3","v":"CitiPower"}]
[]
["Public Lighting O & M Costs","Year",2016,null,null,null,null,null,null,"Year",{"$f":"C3+1","v":2017},null,null,null,null,null,null,"Year",{"$f":"K3+1","v":2018},null,null,null,null,null,null,"Year",{"$f":"S3+1","v":2019},null,null,null,null,null,null,"Year",{"$f":"AA3+1","v":2020}]
[{"$f":"'DNSP Inputs O & M'!C5","v":"Real 2015 $ "}]
[]
["Summary"]
[]
[{"$f":"$A$64","v":"MV80"},null,null,"Avoided Costs - MV 80 O & M",null,null,null,null,null,null,null,"Avoided Costs - MV 80 O & M",null,null,null,null,null,null,null,"Avoided Costs - MV 80 O & M",null,null,null,null,null,null,null,"Avoided Costs - MV 80 O & M",null,null,null,null,null,null,null,"Avoided Costs - MV 80 O & M"]
{"$rows_left_out":222}
{"sheet":"Capex 2016-2020","index":9,"n_rows":129,"n_cols":34,"rows_kept":129,"cut":false,"hidden":false,"merged":[[39,1,39,5],[39,8,39,12],[39,29,39,33],[39,15,39,19],[39,22,39,26]]}
[{"$f":"'DNSP Inputs O & M'!$A$3","v":"CitiPower"}]
[]
["Public Lighting Capex Costs"]
[{"$f":"'DNSP Inputs Capex'!$C$5","v":"Real 2015 $ "}]
[]
["Summary",{"$f":"'DNSP Inputs General'!K$2","v":2016},{"$f":"'DNSP Inputs General'!L$2","v":2017},{"$f":"'DNSP Inputs General'!M$2","v":2018},{"$f":"'DNSP Inputs General'!N$2","v":2019},{"$f":"'DNSP Inputs General'!O$2","v":2020}]
[]
["NEE Luminaires - Real 2015 $ "]
{"$rows_left_out":122}
{"sheet":"WACC","index":10,"n_rows":18,"n_cols":9,"rows_kept":18,"cut":false,"hidden":false,"merged":[]}
[{"$f":"'DNSP Inputs O & M'!$A$3","v":"CitiPower"}]
[]
["WACC"]
[null,null,null,null,2016,2017,2018,2019,2020]
[]
["CPI for Nominal pre tax WACC calculation",null,null,null,{"$f":"$C$14","v":2.5999999999999999E-2},{"$f":"$C$15","v":2.5999999999999999E-2},{"$f":"$C$16","v":2.5999999999999999E-2},{"$f":"$C$17","v":2.5999999999999999E-2},{"$f":"$C$18","v":2.5999999999999999E-2}]
["Real Pre Tax WACC",null,null,null,{"$f":"'DNSP Inputs General'!K$26","v":5.7054700522451096E-2},{"$f":"'DNSP Inputs General'!L$26","v":5.7054700522451096E-2},{"$f":"'DNSP Inputs General'!M$26","v":5.7054700522451096E-2},{"$f":"'DNSP Inputs General'!N$26","v":5.7054700522451096E-2},{"$f":"'DNSP Inputs General'!O$26","v":5.7054700522451096E-2}]
["Nominal Pre Tax WACC",null,null,null,{"$f":"(1+E6)*(1+E7)-1","v":8.4538122736034893E-2},8.4538122736034893E-2,8.4538122736034893E-2,8.4538122736034893E-2,8.4538122736034893E-2]
{"$rows_left_out":11}
{"sheet":"Depn & WACC Post 2004","index":11,"n_rows":281,"n_cols":9,"rows_kept":281,"cut":false,"hidden":false,"merged":[[38,3,38,4],[38,6,38,7],[67,3,67,4],[67,6,67,7],[79,6,79,7],[88,3,88,4],[88,6,88,7],[79,3,79,5],[117,3,117,4],[117,6,117,7],[129,6,129,7],[129,3,129,5],[138,3,138,4],[138,6,138,7],[167,3,167,4],[167,6,167,7],[6,3,6,4],[6,6,6,7],[279,6,279,7],[238,3,238,4],[238,6,238,7],[267,3,267,4],[267,6,267,7],[279,3,279,5],[217,3,217,4],[217,6,217,7],[229,6,229,7],[229,3,229,5],[179,6,179,7],[188,3,188,4],[188,6,188,7],[179,3,179,5]]}
[{"$f":"'DNSP Inputs O & M'!$A$3","v":"CitiPower"},null,null,null,"Check",{"$f":"SUM(E33,E65,E77,E115,E127,E165,E177,E215,E227,E265,E277)","v":4.220055416226387E-9}]
[]
[]
["RAB WDV",null,null,"Year",2015]
[]
[]
[{"$f":"'DNSP Inputs General'!B$40","v":"Reference Light"},{"$f":"'DNSP Inputs General'!D$40","v":"Price Factor"},{"$f":"'DNSP Inputs General'!A$40","v":"Existing Lights"},"RAB for Return",null,"Volumes","Unitisation - Luminaires",null,"RAB WDV"]
[{"$f":"'DNSP Inputs General'!B41","v":"Mercury vapour 80 watt"},{"$f":"'DNSP Inputs General'!D$41","v":1},{"$f":"'DNSP Inputs General'!A41","v":"Mercury vapour 80 watt"},{"$f":"'RAB 2001 to 2004'!$P$141","v":18.018515624999999},{"$f":"F8*D8","v":92622.977148477643},{"$f":"'DNSP Inputs General'!J41","v":5140.4332674311318},null,null,{"$f":"IF(F8=0,0,E8/E$32*I$32/F8)","v":145.92476843391555}]
{"$rows_left_out":274}
{"sheet":"RAB 2001 to 2004","index":12,"n_rows":226,"n_cols":41,"rows_kept":226,"cut":false,"hidden":false,"merged":[[80,5,80,20],[87,5,87,20],[45,5,45,20],[52,5,52,20],[205,1,205,5],[205,7,205,11],[205,13,205,17],[205,19,205,23]]}
[{"$f":"'Inputs PL Final Decision 2004'!$A$124","v":"Citipower"}]
[]
["Public Lighting RAB - Assets constructed between 1 January 2001 and 31 December 2004."]
["Historical cost ($)"]
[]
["Summary"]
[]
["Cost Per Unit",null,2016,2017,2018,2019,2020]
{"$rows_left_out":219}
{"sheet":"Inputs PL Final Decision 2004","index":13,"n_rows":128,"n_cols":8,"rows_kept":128,"cut":false,"hidden":false,"merged":[[88,5,88,6],[88,7,89,7],[88,1,89,1],[88,2,89,2],[88,3,89,3],[88,4,89,4],[116,0,116,1],[107,5,107,6],[107,7,108,7],[113,0,113,1],[114,0,114,1],[107,1,108,1],[107,2,108,2],[107,3,108,3],[107,4,108,4]]}
[{"$f":"'Inputs PL Final Decision 2004'!$A$125","v":"Powercor"}]
[]
["Final Decision - Cost Build-up Model 2004"]
[]
[]
[]
["Input parameters"]
[]
{"$rows_left_out":121}
{"sheet":"RAB RIN Reconciliation (AER)","index":14,"n_rows":85,"n_cols":21,"rows_kept":85,"cut":false,"hidden":false,"merged":[]}
[]
[null,"CP",null,"RAB RIN"]
[null,null,null,null,null,null,null,null,null,null,null,null,null,"($000's)",2014,"2015","2016","2017","2018","2019","2020"]
[null,null,null,"Opening value",null,null,null,null,null,null,null,null,null,null,{"$f":"N56 / 1000","v":10326.108076872108},{"$f":"O56 / 1000","v":11590.595801650627},{"$f":"P10","v":5635.3824386494252},{"$f":"Q10","v":5251.6089916677911},4744.4801867150118,4468.4043467523134,4194.8155272138911]
[null,null,null,"Adjustment for Dedicated Assets",null,null,null,null,null,null,null,null,null,null,0,{"$f":"-P83 / 1000","v":-6475.5425547500772}]
[null,null,null,"Straight line depreciation",null,null,null,null,null,null,null,null,null,null,{"$f":"-1 * O55 / 1000","v":-672.83093335408523},{"$f":"-1 * P55 / 1000","v":-742.52671547944351},{"$f":"-1 * Q64 / 1000","v":-467.88032671712904},{"$f":"-1 * R64 / 1000","v":-468.94879770774463},-472.83029506191446,-482.89570507271884,-493.57118026994948]
[null,null,null,"Regulatory depreciation",null,null,null,null,null,null,null,null,null,null,{"$f":"SUM(O6+O5)","v":-672.83093335408523},-7218.069270229521,-467.88032671712904,-468.94879770774463,-472.83029506191446,-482.89570507271884,-493.57118026994948]
[null,null,null,"Actual additions (recognised in RAB)",null,null,null,null,null,null,null,null,null,null,{"$f":"O54 / 1000","v":1937.3186581326029},{"$f":"P54 / 1000","v":1262.8559072283199},{"$f":"Q63 / 1000","v":84.106879735494772},{"$f":"R63 / 1000","v":-38.180007245034794},196.7544550992163,209.30688553429704,221.29279223905911]
{"$rows_left_out":77}