{"text_format":"1","workbook":"xlsx","n_sheets":16,"sheets":["AER CF","AER NRs","AER lookups","AER ETL","Instructions","Contents","Business & other details","3.1 Revenue","3.2 Operating expenditure","3.2.3 Provisions","3.3 Assets (RAB)","3.4 Operational data","3.5 Physical assets","3.6 Quality of service","3.7 Operating environment","NSP Amendments"],"not_rendered":{"charts":0,"images":5,"macros":1,"external_links":2,"defined_names":659,"comments":1,"pivot_tables":0},"unopened":[],"bounds":{"document_bytes":16777216,"sheet_cells":100000,"rows_first":2000,"rows_last":500,"rows_between":2000,"halvings":0,"cell_chars":16384,"cell_head_chars":4096},"cells_cut":0,"cells_raw":0,"read":"whole","date_system":"1900"}

{"sheet":"AER CF","index":0,"n_rows":127,"n_cols":24,"rows_kept":127,"cut":false,"hidden":true,"merged":[[3,1,3,21]]}
[null,"AER CONDITIONAL FORMATTING"]
[]
[]
[null,"CONDITIONAL FORMATTING MAP"]
[null,null,null,null,null,"=INDEX(dms_CF_3.6.1, MATCH(dms_TradingName,dms_CF_TradingName))=\"Y\"","=INDEX(dms_CF_3.6.5, MATCH(dms_TradingName,dms_CF_TradingName))=\"Y\"","=INDEX(dms_CF_3.6.6, MATCH(dms_TradingName,dms_CF_TradingName))=\"Y\"","=INDEX(dms_CF_3.6.7.1, MATCH(dms_TradingName,dms_CF_TradingName))=\"Y\"","=INDEX(dms_CF_3.6.7.2, MATCH(dms_TradingName,dms_CF_TradingName))=\"Y\"","=INDEX(dms_CF_3.6.7.3, MATCH(dms_TradingName,dms_CF_TradingName))=\"Y\"","=INDEX(dms_CF_3.6.7.4, MATCH(dms_TradingName,dms_CF_TradingName))=\"Y\"","=INDEX(dms_CF_3.6.8, MATCH(dms_TradingName,dms_CF_TradingName))=\"Y\"","=INDEX(dms_CF_4.1, MATCH(dms_TradingName,dms_CF_TradingName))=\"Y\"","=INDEX(dms_CF_6.6.1, MATCH(dms_TradingName,dms_CF_TradingName))=\"Y\"","=INDEX(dms_CF_6.8, MATCH(dms_TradingName,dms_CF_TradingName))=\"Y\"","=INDEX(dms_CF_7.12, MATCH(dms_TradingName,dms_CF_TradingName))=\"Y\"","=INDEX(dms_CF_8.1_A, MATCH(dms_TradingName,dms_CF_TradingName))=\"Y\"","=INDEX(dms_CF_8.1_B, MATCH(dms_TradingName,dms_CF_TradingName))=\"Y\"","=INDEX(dms_CF_8.1_Neg, MATCH(dms_TradingName,dms_CF_TradingName))=\"Y\"","=INDEX(dms_CF_4.4.1_Neg, MATCH(dms_TradingName,dms_CF_TradingName))=\"Y\""]
[null,"dms_CF_TradingName","JurisdictionList","Sector","Segment","dms_CF_3.6.1","dms_CF_3.6.5","dms_CF_3.6.6","dms_CF_3.6.7.1","dms_CF_3.6.7.2","dms_CF_3.6.7.3","dms_CF_3.6.7.4","dms_CF_3.6.8","dms_CF_4.1","dms_CF_6.6.1","dms_CF_6.8","dms_CF_7.12","dms_CF_8.1_A","dms_CF_8.1_B","dms_CF_8.1_Neg","dms_CF_4.4.1","dms_CF_MAIFI_flag","Spare1","Spare2"]
[null,"ActewAGL Distribution","ACT","Electricity","Distribution",null,"Y",null,"Y","Y","N","Y","N","Y","N","Y","Y","N","Y","Y","N","N","N","N"]
[null,"Ausgrid","NSW","Electricity","Distribution",null,"Y",null,"N","N","N","Y","N","Y","N","Y","Y","N","Y","Y","N","N","N","N"]
[null,"AusNet (D)","Vic","Electricity","Distribution",null,"N",null,"N","N","N","N","N","Y","N","Y","N","N","N","Y","N","N","N","N"]
[null,"AusNet (T)","Vic","Electricity","Transmission",null,"N",null,"N","N","N","N","N","Y","N","Y","N","N","N","Y","N","N","N","N"]
[null,"CitiPower","Vic","Electricity","Distribution",null,"N",null,"N","N","N","N","N","Y","N","Y","N","N","N","Y","N","N","N","N"]
[null,"Directlink","Qld","Electricity","Transmission",null,"N",null,"N","N","N","N","N","Y","N","Y","N","N","Y","Y","N","N","N","N"]
[null,"ElectraNet","SA","Electricity","Transmission",null,"N",null,"N","N","N","N","N","Y","N","Y","N","N","Y","Y","N","N","N","N"]
[null,"Endeavour Energy","NSW","Electricity","Distribution",null,"Y",null,"N","N","N","Y","N","Y","N","Y","Y","N","Y","Y","Y","N","N","N"]
[null,"Energex","Qld","Electricity","Distribution",null,"Y",null,"N","N","N","N","N","Y","N","Y","Y","N","Y","Y","Y","N","N","N"]
[null,"Ergon Energy","Qld","Electricity","Distribution",null,"Y",null,"N","N","N","N","N","Y","N","Y","Y","N","Y","Y","N","N","N","N"]
[null,"Essential Energy","NSW","Electricity","Distribution",null,"Y",null,"N","N","N","Y","N","Y","N","Y","Y","N","Y","Y","N","N","N","N"]
[null,"Jemena Electricity","Vic","Electricity","Distribution",null,"N",null,"N","N","N","N","N","Y","N","Y","N","N","N","Y","N","N","N","N"]
[null,"Murraylink","SA","Electricity","Transmission",null,"N",null,"N","N","N","N","N","Y","N","Y","N","N","Y","Y","N","N","N","N"]
[null,"Power and Water","NT","Electricity","Distribution",null,"N",null,"N","Y","N","N","Y","Y","Y","Y","Y","N","Y","Y","N","N","N","N"]
[null,"Powercor Australia","Vic","Electricity","Distribution",null,"N",null,"N","N","N","N","N","Y","N","Y","N","N","N","Y","N","N","N","N"]
[null,"Powerlink","Qld","Electricity","Transmission",null,"N",null,"N","N","N","N","N","Y","N","Y","N","N","Y","Y","N","N","N","N"]
[null,"SA Power Networks","SA","Electricity","Distribution",null,"Y",null,"N","N","N","N","N","Y","N","Y","Y","Y","Y","N","N","N","N","N"]
[null,"TasNetworks (D)","Tas","Electricity","Distribution",null,"Y",null,"N","N","N","N","N","Y","N","Y","Y","N","Y","Y","N","N","N","N"]
[null,"TasNetworks (T)","Tas","Electricity","Transmission",null,"N",null,"N","N","N","N","N","Y","N","Y","N","N","Y","Y","N","N","N","N"]
[null,"TransGrid","NSW","Electricity","Transmission",null,"N",null,"N","N","N","N","N","Y","N","Y","N","N","Y","Y","N","N","N","N"]
[null,"United Energy","Vic","Electricity","Distribution",null,"N",null,"N","N","N","N","N","Y","N","Y","N","N","N","Y","N","N","N","N"]
[]
[]
[null,"Confidential"]
[null,"Amended"]
[]
[null,"Worksheet 6.2 STPIS reliability"]
[null,"Formula",null,null,null,"Applied to:"]
[]
[null,"=INDEX(dms_CBD_flag,MATCH(dms_TradingName,dms_TradingName_List))=\"NO\"",null,null,null,"$D$11,$D$17,$D$23,$D$33,$D$39,$D$45,$D$55,$D$61,$D$67,$D$77,$D$83,$D$89"]
[null,"=INDEX(dms_Urban_flag,MATCH(dms_TradingName,dms_TradingName_List))=\"NO\"",null,null,null,"$D$12,$D$18,$D$24,$D$56,$D$62,$D$78,$D$68,$D$84"]
[null,"=INDEX(dms_ShortRural_flag,MATCH(dms_TradingName,dms_TradingName_List))=\"NO\"",null,null,null,"$D$13,$D$19,$D$25,$D$57,$D$63,$D$69,$D$79,$D$85"]
[null,"=INDEX(dms_LongRural_flag,MATCH(dms_TradingName,dms_TradingName_List))=\"NO\"",null,null,null,"$D$14,$D$20,$D$26,$D$58,$D$64,$D$65,$D$70,$D$71,$D$80,$D$86"]
[null,"=INDEX(dms_FeederType_5_flag,MATCH(dms_TradingName,dms_TradingName_List))=\"NO\"",null,null,null,"$D$87,$D$81,$D$71,$D$65,$D$59,$D$49,$D$43,$D$37,$D$21,$D$15"]
[null,"=dms_MAIFI_Flag=\"No\"",null,null,null,"$D$55:$D$72"]
[]
[]
[null,"Business & other details"]
[null,"=(INDEX(dms_Model_Span,MATCH(dms_Model,dms_Model_List))>1)"]
[null,"=(INDEX(dms_Model_Span,MATCH(dms_Model,dms_Model_List))=1)"]
[]
[]
[null,"STYLES IN USE"]
[null,null,"dms_1"]
[null,null,"dms_2"]
[null,null,"dms_3"]
[null,null,"dms_4"]
[null,null,"dms_5"]
[null,null,"dms_NUM"]
[null,null,"dms_NUM%"]
[null,null,"dms_Row_Locked"]
[null,null,"dms_Row1"]
[null,null,"dms_Row2"]
[null,null,"dms_T1"]
[null,null,"dms_T2"]
[null,null,"dms_BH"]
[null,null,"dms_BY1"]
[null,null,"dms_BY2"]
[null,null,"dms_GH"]
[null,null,"dms_GY1"]
[null,null,"dms_GY2"]
[]
[]
[]
[]
[]
[]
[]
[]
[]
[]
[]
[]
[]
[]
[]
[]
[]
[]
[]
[]
[]
[]
[]
[]
[]
[]
[]
[]
[]
[]
[]
[]
[]
[]
[]
[]
[]
[]
[]
[]
[]
[]
[]
[]
[]
[]
[]
[]
[]
[]
[]
[]
[]
[]
[]
[]
[]
[]
[null,null,"0"]
[null,null,{"$f":"IFERROR(IF(dms_Model=\"ARR\",(MAX(0,dms_0608_LastRow-dms_0608_OffsetRows)),\"not an ARR\"),\"0\")","v":"not an ARR"}]

{"sheet":"AER NRs","index":1,"n_rows":226,"n_cols":15,"rows_kept":226,"cut":false,"hidden":true,"merged":[[133,1,148,1],[4,1,26,1],[30,1,53,1],[30,11,30,12],[31,11,33,11],[34,11,38,11],[42,11,43,11],[63,1,76,1],[82,1,95,1],[98,1,105,1],[108,1,113,1],[116,1,130,1],[197,1,198,1],[206,1,211,1],[150,1,156,1],[158,1,172,1],[174,1,175,1],[177,1,182,1],[189,1,190,1],[193,1,194,1]]}
[null,"AER NAMED RANGES"]
[]
[null,"DROP DOWN SELECTORS USED IN WORKBOOKS"]
[]
[null,"COVER SHEET","dms_DataQuality_List","dms_Confid_status_List"]
[null,null,"-- select --","-- select --"]
[null,null,"Actual","Public"]
[null,null,"Estimate","Confidential"]
[null,null,"Consolidated"]
[]
[]
[null,null,"For all files either AER or business needs to be able to specify the type of submission","For PTRM & RFM templates we must provide a choice in case they change their form of control - otherwise it is drawn from the business specific lookup table above."]
[null,null,"dms_SourceList","dms_FormControl_Choices"]
[null,null,"-- select --","Revenue cap"]
[null,null,"After appeal","Revenue yield"]
[null,null,"Draft decision","Weighted average price cap"]
[null,null,"Final decision"]
[null,null,"PTRM update 1"]
[null,null,"PTRM update 2"]
[null,null,"PTRM update 3"]
[null,null,"PTRM update 4"]
[null,null,"PTRM update 5"]
[null,null,"PTRM update 6"]
[null,null,"PTRM update 7"]
[null,null,"Regulatory proposal"]
[null,null,"Reporting"]
[null,null,"Revised regulatory proposal"]
[]
[]
[null,null,null,null,null,null,null,null,null,null,null,"This is used to create an image to insert on 6.3 STPIS sheet - not for dropdown lists."]
[null,"CA & RESET RINS \nDNSP","dms_DNSP_020301_SubstationType","dms_DNSP_020301_ProjectType","dms_DNSP_020301_ProjectTrigger","dms_DNSP_020302_ProjectType","dms_DNSP_020302_ProjectTrigger","dms_STPIS_Exclusion_List","dms_Reason_Interruption","dms_Reason_Interruption_Detailed",null,"Reason for interruption"]
[null,null,"Subtransmission substation","New substation establishment","Demand growth","New line on new route - single circuit","Demand growth","Weather","Animal","Animal impact",null,"Animal","Animal impact"]
[null,null,"Zone substation","Substation upgrade - capacity"," Voltage issues","New line on new route - dual circuit"," Voltage issues","Equipment failure","Asset failure","Animal nesting/burrowing, etc and other",null,null,"Animal nesting/burrowing, etc and other"]
[null,null,"Switching station","Substation upgrade - voltage"," Reactive power issue","New line on new route - other"," Reactive power issue","Operational error","Other","Other",null,null,"Other"]
[null,null,"Other","Other"," Fault level issues","Line rebuild over existing route - single circuit"," Fault level issues","Vegetation","Overloads","LV",null,"Asset failure","LV"]
[null,null,null,null," Safety","Line rebuild over existing route - dual circuit"," Net market benefit","Animals","Planned","Distribution substation",null,null,"Distribution substation"]
[null,null,null,null," Environment","Reconductor - Single circuit"," Safety","Third party impacts","Network business","HV",null,null,"HV"]
[null,null,null,null," Other","Reconductor - Dual circuit"," Environment","Transmission failure","Third party","Zone substation",null,null,"Zone substation"]
[null,null,null,null,null,"Reconductor - Other"," Other","Load shedding","Unknown","Subtransmission",null,null,"Subtransmission"]
[null,null,null,null,null,"Line upgrade - raising/retensoring",null,"Inter-distributor connection failure","Vegetation","insert description of 'other'",null,"Other","insert description of 'other'"]
[null,null,null,null,null,"Line upgrade - voltage upgrade",null,"Other","Weather","Network error",null,"Overloads"]
[null,null,null,null,null,"Line upgrade - capacity",null,null,"2 - STPIS Exclusion (3.3)(a)","Switching and protection error",null,"Planned"]
[null,null,null,null,null,"String spare circuit",null,null,"3 - STPIS Exclusion (3.3)(a)","Fire",null,"Network business","Network error"]
[null,null,null,null,null,"Other",null,null,"4 - STPIS Exclusion (3.3)(a)","Other",null,null,"Switching and protection error"]
[null,null,null,null,null,null,null,null,"5 - STPIS Exclusion (3.3)(a)","Dig-in",null,"Third party","Fire"]
[null,null,null,null,null,null,null,null,"6 - STPIS Exclusion (3.3)(a)","Unauthorised access",null,null,"Other"]
[null,null,null,null,null,null,null,null,"7 - STPIS Exclusion (3.3)(a)","Vehicle impact",null,null,"Dig-in"]
[null,null,null,null,null,null,null,null,null,"Unknown",null,null,"Unauthorised access"]
[null,null,null,null,null,null,null,null,null,"Blow-in/Fall-in - NSP responsibility",null,null,"Vehicle impact"]
[null,null,null,null,null,null,null,null,null,"Grow-in - NSP responsibility",null,"Unknown","Unknown"]
[null,null,null,null,null,null,null,null,null,"Blow-in/Fall-in - Other responsible party",null,"Vegetation","Blow-in/Fall-in - NSP responsibility"]
[null,null,null,null,null,null,null,null,null,"Grow-in - Other responsible party",null,null,"Grow-in - NSP responsibility"]
[null,null,null,null,null,null,null,null,null,null,null,null,"Blow-in/Fall-in - Other responsible party"]
[null,null,null,null,null,null,null,null,null,null,null,null,"Grow-in - Other responsible party"]
[null,null,null,null,null,null,null,null,null,null,null,"Weather"]
[null,null,null,null,null,null,null,null,null,null,null,"2 - STPIS Exclusion (3.3)(a)"]
[null,null,null,null,null,null,null,null,null,null,null,"3 - STPIS Exclusion (3.3)(a)"]
[null,null,null,null,null,null,null,null,null,null,null,"4 - STPIS Exclusion (3.3)(a)"]
[null,null,null,null,null,null,null,null,null,null,null,"5 - STPIS Exclusion (3.3)(a)"]
[null,null,null,null,null,null,null,null,null,null,null,"6 - STPIS Exclusion (3.3)(a)"]
[null,null,null,null,null,null,null,null,null,null,null,"7 - STPIS Exclusion (3.3)(a)"]
[]
[]
[null,"CA & RESET RINS \nTNSP ","dms_TNSP_0203_SubstationType","dms_TNSP_020301_ProjectType","dms_TNSP_020301_ProjectTrigger","dms_TNSP_020302_ProjectType","dms_TNSP_0203_ProjectTrigger"]
[null,null,"Terminal station","New substation establishment","Demand growth","New line on new route - single circuit","Demand growth"]
[null,null,"Switching station","Capacity upgrade"," Voltage issues","New line on new route - dual circuit"," Voltage issues"]
[null,null,"Transmission substation","Voltage upgrade"," Reactive power issue","New line on new route - other"," Reactive power issue"]
[null,null,"Other","Other"," Fault level issues","Line rebuild over existing route - single circuit"," Fault level issues"]
[null,null,null,null,"Net market benefit","Line rebuild over existing route - dual circuit"," Net market benefit"]
[null,null,null,null," Safety","Reconductor - Single circuit"," Safety"]
[null,null,null,null," Environment","Reconductor - Dual circuit"," Environment"]
[null,null,null,null," Other","Reconductor - Other"," Other"]
[null,null,null,null,null,"Line upgrade - raising/retensoring"]
[null,null,null,null,null,"Line upgrade - voltage upgrade"]
[null,null,null,null,null,"Line upgrade - capacity"]
[null,null,null,null,null,"String spare circuit"]
[null,null,null,null,null,"Other"]
[]
[]
[]
[null,"NAMED RANGES USED IN ETL PROCESS"]
[]
[null,"CA & RESET RINS \nDNSP ONLY","dms_020303_01_UOM","dms_020501_01_UOM","dms_020501_02_UOM","dms_020501_03_UOM","dms_020501_04_UOM","dms_020701_01_UOM","dms_020701_02_UOM","dms_020701_01_Rows","dms_040102_01_UOM","dms_040102_04_UOM"]
[null,null,"Circuit line length in km","0's","0's","0's","0's","km","km","Route line length within zone","0's","days"]
[null,null,"Circuit line length in km","0's","0's","0's","0's","0's","0's","Number of maintenance spans","0's","0's"]
[null,null,"Circuit line length in km","MVA added","MVA added","MVA added","MVA added","km","km","Total length of maintenance spans","0's","$0s"]
[null,null,"Circuit line length in km","0's","0's","0's","0's","km","km","Length of vegetation corridors","$0s","0's"]
[null,null,"Number","total spend $0s","total spend $0s","total spend $0s","total spend $0s","0's","0's","Average number of trees per maintenance span"]
[null,null,"Number","net circuit km added","net circuit km added","net circuit km added","net circuit km added","years","years","Average frequency of cutting cycle"]
[null,null,"Number","total spend $0s","total spend $0s","total spend $0s","total spend $0s"]
[null,null,null,"net circuit km added","net circuit km added","net circuit km added","net circuit km added"]
[null,null,null,"total spend $0s","total spend $0s","total spend $0s","total spend $0s"]
[null,null,null,"0's",null,"$0s"]
[null,null,null,"0's"]
[null,null,null,"0's"]
[null,null,null,"$0s"]
[]
[]
[null,"CA & RESET RINS \nTNSP ONLY","dms_020701_01_UOM"]
[null,null,"km"]
[null,null,"0's"]
[null,null,"km"]
[null,null,"0's"]
[null,null,"km"]
[null,null,"metres"]
[null,null,"years"]
[]
[]
[null,"CA & RESET RINS \nDNSP & TNSP","dms_020603_01_UOM"]
[null,null,"0's"]
[null,null,"0's"]
[null,null,"0's"]
[null,null,"0's"]
[null,null,"(per cent)"]
[]
[]
[null,"EB & RESET RINS \nDNSP ONLY","dms_030601_01_UOM","dms_030601_02_UOM","dms_030701_01_UOM","dms_030702_01_UOM","dms_030703_01_UOM"]
[null,null,"minutes/customer","minutes/customer","Customer / km","%","km"]
[null,null,"minutes/customer","minutes/customer","MWh/customer","Number of spans"]
[null,null,"interruptions/customer","interruptions/customer","kVA / customer","Number of spans"]
[null,null,"interruptions/customer","interruptions/customer",null,"Number of spans"]
[null,null,null,null,null,"Number of spans"]
[null,null,null,null,null,"Years"]
[null,null,null,null,null,"Years"]
[null,null,null,null,null,"Trees"]
[null,null,null,null,null,"Trees"]
[null,null,null,null,null,"Defects"]
[null,null,null,null,null,"Defects"]
[null,null,null,null,null,"Spans"]
[null,null,null,null,null,"km"]
[null,null,null,null,null,"Spans"]
[]
[null,null,"WHEN INSERTING COVER SHEET INTO A TNSP FILE - APPLY THESE NAMED RANGES"]
[null,"EB & RESET RINS \nTNSP ONLY","dms_030601_01_UOM",null,"dms_030701_01_UOM","dms_030702_01_UOM"]
[null,null,"%",null,"Number of spans","km"]
[null,null,"number",null,"Years","%"]
[null,null,"number",null,"Trees","km"]
[null,null,"%",null,"Defects","number"]
[null,null,"number",null,"Number of spans"]
[null,null,"number",null,"km"]
[null,null,"%",null,"km"]
[null,null,"number",null,"Number of spans"]
[null,null,"number"]
[null,null,"%"]
[null,null,"number"]
[null,null,"%"]
[null,null,"number"]
[null,null,"%"]
[null,null,"number"]
[]
[null,"EB & RESET RINS \nDNSP & TNSP","dms_EB_RAB_PIT"]
[null,null,"Beginning of year"]
[null,null,"End of year"]
[null,null,"End of year"]
[null,null,"End of year"]
[null,null,"End of year"]
[null,null,"End of year"]
[]
[null,"ARR \nDNSP ONLY","dms_030605_UOM","dms_03060703_UOM","Spare","Spare"]
[null,null,"number","number"]
[null,null,"number","number"]
[null,null,"number","number"]
[null,null,"number","number"]
[null,null,"number","(per cent)"]
[null,null,"number"]
[null,null,"number"]
[null,null,"number"]
[null,null,"number"]
[null,null,"number"]
[null,null,"number"]
[null,null,"number"]
[null,null,"(per cent)"]
[null,null,"(per cent)",""]
[]
[null,"RFM","dms_Beg","dms_Mid","dms_End"]
[null,null,"Beginning of year","Mid year","End of Year"]
[]
[null,"PTRM","dms_PTRM_RAB_PIT","dms_PTRM_TAB_PIT","DMS_Xfactor"]
[null,null,"Beginning of year","Beginning of year","x factors"]
[null,null,"End of year","End of year"]
[null,null,"End of year","End of year"]
[null,null,"End of year","End of year"]
[null,null,"End of year"]
[]
[]
[null,"STPIS & MIC NAMED RANGES "]
[]
[null,"These \"row descriptions\" are the column headings in the various templates but become row descriptions in the ETL process"]
[]
[null,"Table 6.3 sustained interruptions - row descriptions","dms_060301_CustNo_Affected_Row","dms_060301_Avg_Duration_Sustained_Int_Row","dms_060301_Effect_unplanned_SAIDI_Row","dms_060301_Effect_unplanned_SAIFI_Row"]
[null,null,"Number of customers affected by the interruption","Average duration of sustained customer interruption","Effect on unplanned SAIDI","Effect on unplanned SAIFI"]
[]
[]
[null,"Table 6.1 telephone answering - row descriptions and start date","dms_060101_Rows","dms_060102_Rows","dms_060101_StartDateTxt"]
[null,null,"Total number of calls \n(after removing excluded events)","Number of calls answered within 30 seconds \n(after excluding excluded events) ",{"$f":"dms_060701_StartDateTxt","v":"1-Jul-2006"}]
[]
[]
[null,"Table 6.8.1 - row descriptions","dms_060801_01_Rows","dms_060801_02_Rows","dms_060801_03_Rows","dms_060801_04_Rows"]
[null,null,"Number of interruptions","Duration of interruptions","Total unplanned minutes off supply","Effect on unplanned MAIFI"]
[]
[]
[null,"Table 7.9.4 - market impact component - row descriptions","dms_070904_01_Rows","without exclusions","with exclusions"]
[]
[]
[null,"These headings (Lists) are determined from the INDEX/MATCH function on the NSP selected on the Business & other details sheet"]
[]
[null,"Table 6.7.1 - daily performance data - unplanned - MAIFI  -- row descriptions and header named range values","dms_060701_Feeder_Header_Lvl4",{"$f":"INDEX(dms_FeederName_1,MATCH(dms_TradingName,dms_TradingName_List))","v":"CBD"},{"$f":"INDEX(dms_FeederName_1,MATCH(dms_TradingName,dms_TradingName_List))","v":"CBD"},{"$f":"INDEX(dms_FeederName_2,MATCH(dms_TradingName,dms_TradingName_List))","v":"Urban"},{"$f":"INDEX(dms_FeederName_2,MATCH(dms_TradingName,dms_TradingName_List))","v":"Urban"},{"$f":"INDEX(dms_FeederName_3,MATCH(dms_TradingName,dms_TradingName_List))","v":"Short rural"},{"$f":"INDEX(dms_FeederName_3,MATCH(dms_TradingName,dms_TradingName_List))","v":"Short rural"},{"$f":"INDEX(dms_FeederName_4,MATCH(dms_TradingName,dms_TradingName_List))","v":"Long rural"},{"$f":"INDEX(dms_FeederName_4,MATCH(dms_TradingName,dms_TradingName_List))","v":"Long rural"},{"$f":"IF((INDEX(dms_FeederName_5,MATCH(dms_TradingName,dms_TradingName_List))=0),\"Network\",(INDEX(dms_FeederName_5,MATCH(dms_TradingName,dms_TradingName_List))))","v":"Network"},{"$f":"IF((INDEX(dms_FeederName_5,MATCH(dms_TradingName,dms_TradingName_List))=0),\"Network\",(INDEX(dms_FeederName_5,MATCH(dms_TradingName,dms_TradingName_List))))","v":"Network"},"Network","Network"]
[]
[null,null,"dms_060701_Rows","All events","After removing excluded events","All events","After removing excluded events","All events","After removing excluded events","All events","After removing excluded events","All events","After removing excluded events","All events","After removing excluded events"]
[null,null,null,"the number of column headings changes from 10 to 12 depending on the number of feeder categories for the NSP"]
[]
[null,null,"dms_0603_FeederList",{"$f":"INDEX(dms_FeederName_1,MATCH(dms_TradingName,dms_TradingName_List))","v":"CBD"},{"$f":"INDEX(dms_FeederName_2,MATCH(dms_TradingName,dms_TradingName_List))","v":"Urban"},{"$f":"INDEX(dms_FeederName_3,MATCH(dms_TradingName,dms_TradingName_List))","v":"Short rural"},{"$f":"INDEX(dms_FeederName_4,MATCH(dms_TradingName,dms_TradingName_List))","v":"Long rural"}]
[]
[]
[null,"Use these to add to specific worksheets in existing files","Use these to add to specific worksheets in existing files"]
[]
[]
[null,"ARRs 6.7 STPIS daily performance","dms_060101_Values","dms_060102_Values","dms_060701_Values"]
[null,null,"dms_LeapYear"]
[]
[]
[null,"ARR's  6.8 STPIS exclusions","dms_060801_Event_Date","dms_060801_OutageID","dms_060801_FeederID","dms_060801_FeederClass","dms_060801_CauseID","dms_060801_01_Values","dms_060801_02_Values","dms_060801_03_Values","dms_060801_Excl_Cat","dms_060801_04_Values"]
[null,null,"dms_060801_StartCell"]
[]
[]
[null,"CA 6.3 sustained interruptions","dms_060301_Event_Date","dms_060301_Event_Time","dms_060301_AssetID","dms_060301_FeederClass","dms_060301_Reason","dms_060301_DetailedReason","dms_060301_CustNo_Affected_Values","dms_060301_Avg_Duration_Sustained_Int_Values","dms_060301_Effect_unplanned_SAIDI_Values","dms_060301_Effect_unplanned_SAIFI_Values","dms_060301_MED"]

{"sheet":"AER lookups","index":2,"n_rows":88,"n_cols":41,"rows_kept":88,"cut":false,"hidden":true,"merged":[[6,27,6,38],[8,27,8,30],[8,33,8,37],[22,1,22,4]]}
[null,"AER LOOKUP TABLES"]
[]
[null,"Data in these columns used for data validation and database purposes."]
[null,"Date last modified:","2017-01-16","added (Albury and Victora) for AGN"]
[null,null,"2016-10-17","updated TransGrid's correct legal name, corrected TasNetworks (T) to June financial year"]
[null,null,"2017-02-01","inserted Power and Water, added NRs (dms_FeederCat_1 and dms_FeederCat_2)"]
[null,null,"2017-03-03","inserted AEMO as a business",null,null,null,null,null,null,null,null,null,null,null,null,null,null,null,null,null,null,null,null,null,null,null,"FOR ELECTRICITY BUSINESSES ONLY"]
[null,null,"2018-03-28","major changes to accommodate STPIS"]
[null,null,"Template Version",5,null,null,null,null,null,null,null,null,null,null,null,null,null,null,null,null,null,null,null,null,null,null,null,"Feeder Types",null,null,null,"TasNetworks (D)","MAIFI flag","Feeder Names"]
[]
[null,null,null,null,null,null,null,null,null,null,null,null,null,null,null,null,null,null,null,null,null,null,null,null,null,null,null,"CBD","Urban","Short rural","long rural","EXTRA"]
[null,"dms_TradingName_List","dms_TradingNameFull_List","dms_ABN_List","dms_JurisdictionList","dms_Sector_List","dms_Segment_List","dms_FormControl_List","dms_RPT_List","dms_RPTMonth_List","dms_CRCPlength_List","dms_FRCPlength_List","dms_PRCPlength_List","dms_663_List","dms_DeterminationRef_List","dms_Addr1_List","dms_Addr2_List","dms_Suburb_List","dms_State_List","dms_PostCode_List","dms_PAddr1_List","dms_PAddr2_List","dms_PSuburb_List","dms_PState_List","dms_PPostCode_List","dms_ContactName1_List","dms_ContactPh1_List","dms_ContactEmail_List","dms_CBD_flag","dms_Urban_flag","dms_ShortRural_flag","dms_LongRural_flag","dms_FeederType_5_flag","dms_MAIFI_flag_List","dms_FeederName_1","dms_FeederName_2","dms_FeederName_3","dms_FeederName_4","dms_FeederName_5","dms_Public_Lighting_List","Column1"]
[null,"AusNet (D)","AusNet Electricity Services Pty Ltd",91064651118,"Vic","Electricity","Distribution","Revenue cap","Financial","June",5,5,5,2,"2016-20 Distribution Determination","Level 32","2 Southbank Boulevard","SOUTHBANK","Vic",3006,"Locked Bag 14051",null,"MELBOURNE CITY MAIL CENTRE","Vic",8001,"Thomas Hall",null,"thomas. hall@ausnetservices.com.au","NO","YES","YES","YES","NO","YES","CBD","Urban","Short rural","Long rural",null,"YES","AusNet (D)"]
[null,"Australian Distribution Co. (Vic)","Australian Distribution Co.",11222333444,"Vic","Electricity","Distribution","Revenue cap","Financial","June",5,5,5,2,"distribution determination","123 Straight Street",null,"MELBOURNE","Vic",3000,"PO Box 123",null,"MELBOURNE","Vic",3000,"Bob Smith","02 1234 5678","bob@auselec.net.au","YES","YES","YES","YES","NO","NO","CBD","Urban","Short rural","Long rural",null,"YES","Australian Distribution Co."]
[null,"CitiPower","CitiPower",76064651056,"Vic","Electricity","Distribution","Revenue cap","Financial","June",5,5,5,2,"2016-20 Distribution Determination","40 Market Street",null,"MELBOURNE","Vic",3000,"Locked Bag 14090",null,"MELBOURNE","Vic",8001,"Hannah Williams","03 9683 4088","hwilliams@powercor.com.au","YES","YES","NO","NO","NO","YES","CBD","Urban","Short rural","Long rural",null,"YES","CitiPower"]
[null,"Jemena Electricity","Jemena Electricity",82064651083,"Vic","Electricity","Distribution","Revenue cap","Financial","June",5,5,5,2,"2016-20 Distribution Determination","Level 16","567 Collins Street","MELBOURNE","Vic",3000,"PO Box 16182",null,"MELBOURNE","Vic",8001,"Matthew Serpell","03 9173 8231","matthew.serpell@jemena.com.au","NO","YES","YES","NO","NO","YES","CBD","Urban","Short rural","Long rural",null,"YES","Jemena Electricity"]
[null,"Powercor Australia","Powercor Australia",89064651109,"Vic","Electricity","Distribution","Revenue cap","Financial","June",5,5,5,2,"2016-20 Distribution Determination","40 Market Street",null,"MELBOURNE","Vic",3000,"Locked bag 14090",null,"MELBOURNE","Vic",8001,"Hannah Williams","03 9683 4088","hwilliams@powercor.com.au","NO","NO","YES","YES","NO","YES","CBD","Urban","Short rural","Long rural",null,"YES","Powercor Australia"]
[null,"United Energy","United Energy",70064651029,"Vic","Electricity","Distribution","Revenue cap","Financial","June",5,5,5,2,"2016-20 Distribution Determination","43-45 Centreway",null,"MOUNT WAVERLEY","Vic",3149,"PO Box 449",null,"MOUNT WAVERLEY","Vic",3170,"Mathew Abraham","03 8846 9758","mathew.abraham@ue.com.au","NO","NO","YES","NO","NO","YES","CBD","Urban","Short rural","Long rural",null,"YES","United Energy"]
[]
[]
[]
[]
[null,"The Reg Year Ending (dms_RYE) must be set to the last year of the regulatory period. For forecast data is is usually (FRCP_y5) for actual it is a single year (CRY). For historical actual data the RYE will need to be set manually in the business details sheet by setting the dms_Multiyear_flag to 1 and putting the correct value in 'dms_Specified_FinalYear. See cells C67:C68"]
[null,"dms_Model_List ","dms_Model_Name_Format1","dms_Worksheet_List","dms_Model_Span_List"]
[null,"ARR","Annual Reporting",{"$f":"IF(dms_MultiYear_ResponseFlag=\"yes\",\"RECAST HISTORICAL ANNUAL REPORTING\",\"ANNUAL REPORTING\")","v":"RECAST HISTORICAL ANNUAL REPORTING"},1]
[null,"CA","Category Analysis",{"$f":"IF(dms_MultiYear_ResponseFlag=\"yes\",\"RECAST HISTORICAL CATEGORY ANALYSIS\",\"CATEGORY ANALYSIS\")","v":"RECAST HISTORICAL CATEGORY ANALYSIS"},1]
[null,"CESS","Capitlal Expenditure","CAPITLAL EXPENDITURE SHARING SCHEMING",5]
[null,"CPI","CPI","CPI",5]
[null,"EB","Economic Benchmarking","HISTORICAL ECONOMIC BENCHMARKING - FINANCIAL YEARS",1]
[null,"Pricing","Pricing Proposal","PRICING PROPOSAL",5]
[null,"PTRM","Post Tax Revenue Model","POST TAX REVENUE MODEL",5]
[null,"Reset","Regulatory Reporting (Reset)","REGULATORY REPORTING STATEMENT",5]
[null,"RFM","Roll Forward Model","ROLL FORWARD MODEL",5]
[null,"WACC","Weighted Average Cost of Capital","WEIGHTED AVERAGE COST OF CAPITAL",1]
[]
[]
[]
[null,"Financial","Calendar",null,"PREVIOUS",null,"CURRENT",null,"FORTHCOMING"]
[null,"1987-88","1988","PRCP_y1",{"$f":"INDEX(INDIRECT(dms_RPT),dms_PRCP_start_row)","v":"2011-12"},"CRCP_y1",{"$f":"INDEX(INDIRECT(dms_RPT),dms_CRCP_start_row)","v":"2016-17"},{"$f":"FRCP_y1","v":"2021-22"},{"$f":"INDEX(INDIRECT(dms_RPT),dms_FRCP_start_row)","v":"2021-22"}]
[null,"1988-89","1989","PRCP_y2",{"$f":"INDEX(INDIRECT(dms_RPT),dms_PRCP_start_row+1)","v":"2012-13"},"CRCP_y2",{"$f":"INDEX(INDIRECT(dms_RPT),dms_CRCP_start_row+1)","v":"2017-18"},"FRCP_y2",{"$f":"INDEX(INDIRECT(dms_RPT),dms_FRCP_start_row+1)","v":"2022-23"}]
[null,"1989-90","1990","PRCP_y3",{"$f":"INDEX(INDIRECT(dms_RPT),dms_PRCP_start_row+2)","v":"2013-14"},"CRCP_y3",{"$f":"INDEX(INDIRECT(dms_RPT),dms_CRCP_start_row+2)","v":"2018-19"},"FRCP_y3",{"$f":"INDEX(INDIRECT(dms_RPT),dms_FRCP_start_row+2)","v":"2023-24"}]
[null,"1990-91","1991","PRCP_y4",{"$f":"INDEX(INDIRECT(dms_RPT),dms_PRCP_start_row+3)","v":"2014-15"},"CRCP_y4",{"$f":"INDEX(INDIRECT(dms_RPT),dms_CRCP_start_row+3)","v":"2019-20"},"FRCP_y4",{"$f":"INDEX(INDIRECT(dms_RPT),dms_FRCP_start_row+3)","v":"2024-25"}]
[null,"1991-92","1992","PRCP_y5",{"$f":"INDEX(INDIRECT(dms_RPT),dms_PRCP_start_row+4)","v":"2015-16"},"CRCP_y5",{"$f":"INDEX(INDIRECT(dms_RPT),dms_CRCP_start_row+4)","v":"2020-21"},"FRCP_y5",{"$f":"INDEX(INDIRECT(dms_RPT),dms_FRCP_start_row+4)","v":"2025-26"}]
[null,"1992-93","1993","PRCP_y6",{"$f":"INDEX(INDIRECT(dms_RPT),dms_PRCP_start_row+5)","v":"2016-17"},"CRCP_y6",{"$f":"INDEX(INDIRECT(dms_RPT),dms_CRCP_start_row+5)","v":"2021-22"},"FRCP_y6",{"$f":"INDEX(INDIRECT(dms_RPT),dms_FRCP_start_row+5)","v":"2026-27"}]
[null,"1993-94","1994","PRCP_y7",{"$f":"INDEX(INDIRECT(dms_RPT),dms_PRCP_start_row+6)","v":"2017-18"},"CRCP_y7",{"$f":"INDEX(INDIRECT(dms_RPT),dms_CRCP_start_row+6)","v":"2022-23"},"FRCP_y7",{"$f":"INDEX(INDIRECT(dms_RPT),dms_FRCP_start_row+6)","v":"2027-28"}]
[null,"1994-95","1995","PRCP_y8",{"$f":"INDEX(INDIRECT(dms_RPT),dms_PRCP_start_row+7)","v":"2018-19"},"CRCP_y8",{"$f":"INDEX(INDIRECT(dms_RPT),dms_CRCP_start_row+7)","v":"2023-24"},"FRCP_y8",{"$f":"INDEX(INDIRECT(dms_RPT),dms_FRCP_start_row+7)","v":"2028-29"}]
[null,"1995-96","1996","PRCP_y9",{"$f":"INDEX(INDIRECT(dms_RPT),dms_PRCP_start_row+8)","v":"2019-20"},"CRCP_y9",{"$f":"INDEX(INDIRECT(dms_RPT),dms_CRCP_start_row+8)","v":"2024-25"},"FRCP_y9",{"$f":"INDEX(INDIRECT(dms_RPT),dms_FRCP_start_row+8)","v":"2029-30"}]
[null,"1996-97","1997","PRCP_y10",{"$f":"INDEX(INDIRECT(dms_RPT),dms_PRCP_start_row+9)","v":"2020-21"},"CRCP_y10",{"$f":"INDEX(INDIRECT(dms_RPT),dms_CRCP_start_row+9)","v":"2025-26"},"FRCP_y10",{"$f":"INDEX(INDIRECT(dms_RPT),dms_FRCP_start_row+9)","v":"2030-31"}]
[null,"1997-98","1998","PRCP_y11",{"$f":"INDEX(INDIRECT(dms_RPT),dms_PRCP_start_row+10)","v":"2021-22"},"CRCP_y11",{"$f":"INDEX(INDIRECT(dms_RPT),dms_CRCP_start_row+10)","v":"2026-27"},"FRCP_y11",{"$f":"INDEX(INDIRECT(dms_RPT),dms_FRCP_start_row+10)","v":"2031-32"}]
[null,"1998-99","1999","PRCP_y12",{"$f":"INDEX(INDIRECT(dms_RPT),dms_PRCP_start_row+11)","v":"2022-23"},"CRCP_y12",{"$f":"INDEX(INDIRECT(dms_RPT),dms_CRCP_start_row+11)","v":"2027-28"},"FRCP_y12",{"$f":"INDEX(INDIRECT(dms_RPT),dms_FRCP_start_row+11)","v":"2032-33"}]
[null,"1999-00","2000","PRCP_y13",{"$f":"INDEX(INDIRECT(dms_RPT),dms_PRCP_start_row+12)","v":"2023-24"},"CRCP_y13",{"$f":"INDEX(INDIRECT(dms_RPT),dms_CRCP_start_row+12)","v":"2028-29"},"FRCP_y13",{"$f":"INDEX(INDIRECT(dms_RPT),dms_FRCP_start_row+12)","v":"2033-34"}]
[null,"2000-01","2001","PRCP_y14",{"$f":"INDEX(INDIRECT(dms_RPT),dms_PRCP_start_row+13)","v":"2024-25"},"CRCP_y14",{"$f":"INDEX(INDIRECT(dms_RPT),dms_CRCP_start_row+13)","v":"2029-30"},"FRCP_y14",{"$f":"INDEX(INDIRECT(dms_RPT),dms_FRCP_start_row+13)","v":"2034-35"}]
[null,"2001-02","2002","PRCP_y15",{"$f":"INDEX(INDIRECT(dms_RPT),dms_PRCP_start_row+14)","v":"2025-26"},"CRCP_y15",{"$f":"INDEX(INDIRECT(dms_RPT),dms_CRCP_start_row+14)","v":"2030-31"},"FRCP_y15",{"$f":"INDEX(INDIRECT(dms_RPT),dms_FRCP_start_row+14)","v":"2035-36"}]
[null,"2002-03","2003","PRCP_y16",{"$f":"INDEX(INDIRECT(dms_RPT),dms_PRCP_start_row+15)","v":"2026-27"},"CRCP_y16",{"$f":"INDEX(INDIRECT(dms_RPT),dms_CRCP_start_row+15)","v":"2031-32"},"FRCP_y16",{"$f":"INDEX(INDIRECT(dms_RPT),dms_FRCP_start_row+15)","v":"2036-37"}]
[null,"2003-04","2004"]
[null,"2004-05","2005"]
[null,"2005-06","2006",null,"CRY - FRY"]
[null,"2006-07","2007","dms_y1",{"$f":"IFERROR(INDEX(INDIRECT(dms_RPT),dms_CRY_start_row),0)","v":"2006-07"}]
[null,"2007-08","2008","dms_y2",{"$f":"IFERROR(INDEX(INDIRECT(dms_RPT),dms_CRY_start_row+1),0)","v":"2007-08"}]
[null,"2008-09","2009","dms_y3",{"$f":"IFERROR(INDEX(INDIRECT(dms_RPT),dms_CRY_start_row+2),0)","v":"2008-09"}]
[null,"2009-10",2010,"dms_y4",{"$f":"IFERROR(INDEX(INDIRECT(dms_RPT),dms_CRY_start_row+3),0)","v":"2009-10"}]
[null,"2010-11",2011,"dms_y5",{"$f":"IFERROR(INDEX(INDIRECT(dms_RPT),dms_CRY_start_row+4),0)","v":"2010-11"}]
[null,"2011-12",2012,"dms_y6",{"$f":"IFERROR(INDEX(INDIRECT(dms_RPT),dms_CRY_start_row+5),0)","v":"2011-12"}]
[null,"2012-13",2013,"dms_y7",{"$f":"IFERROR(INDEX(INDIRECT(dms_RPT),dms_CRY_start_row+6),0)","v":"2012-13"}]
[null,"2013-14",2014,"dms_y8",{"$f":"IFERROR(INDEX(INDIRECT(dms_RPT),dms_CRY_start_row+7),0)","v":"2013-14"}]
[null,"2014-15",2015,"dms_y9",{"$f":"IFERROR(INDEX(INDIRECT(dms_RPT),dms_CRY_start_row+8),0)","v":"2014-15"}]
[null,"2015-16",2016,"dms_y10",{"$f":"IFERROR(INDEX(INDIRECT(dms_RPT),dms_CRY_start_row+9),0)","v":"2015-16"}]
[null,"2016-17",2017,"dms_y11",{"$f":"IFERROR(INDEX(INDIRECT(dms_RPT),dms_CRY_start_row+10),0)","v":"2016-17"}]
[null,"2017-18",2018,"dms_y12",{"$f":"IFERROR(INDEX(INDIRECT(dms_RPT),dms_CRY_start_row+11),0)","v":"2017-18"}]
[null,"2018-19",2019,"dms_y13",{"$f":"IFERROR(INDEX(INDIRECT(dms_RPT),dms_CRY_start_row+12),0)","v":"2018-19"}]
[null,"2019-20",2020,"dms_y14",{"$f":"IFERROR(INDEX(INDIRECT(dms_RPT),dms_CRY_start_row+13),0)","v":"2019-20"}]
[null,"2020-21",2021,"dms_y15",{"$f":"IFERROR(INDEX(INDIRECT(dms_RPT),dms_CRY_start_row+14),0)","v":"2020-21"}]
[null,"2021-22",2022,"dms_y16",{"$f":"IFERROR(INDEX(INDIRECT(dms_RPT),dms_CRY_start_row+15),0)","v":"2021-22"}]
[null,"2022-23",2023]
[null,"2023-24",2024]
[null,"2024-25",2025]
[null,"2025-26",2026]
[null,"2026-27",2027]
[null,"2027-28",2028]
[null,"2028-29",2029]
[null,"2029-30",2030]
[null,"2030-31",2031]
[null,"2031-32",2032]
[null,"2032-33",2033]
[null,"2033-34",2034]
[null,"2034-35",2035]
[null,"2035-36",2036]
[null,"2036-37","2037"]

{"sheet":"AER ETL","index":3,"n_rows":144,"n_cols":8,"rows_kept":144,"cut":false,"hidden":true,"merged":[[9,4,9,8],[70,1,72,1],[10,0,14,0],[11,4,11,8],[13,2,13,4],[17,0,24,0],[25,0,30,0],[33,0,58,0]]}
[null,"AER ETL INFORMATION"]
[]
[null,"USES NAMED RANGES FLAG","yes","dms_Defined_Names_Used"]
[]
[null,"IF THIS IS AN ABC RIN - make sure the the named range CRY is applied and the named range dms_dollar_nom_UOM is applied"]
[null,"IF THIS IS A RESET RIN - make sure the named ranges CRY and dms_dollar_nom_UOM are NOT present in the workbook"]
[null,"FOR ABC RINS THAT SPAN MULTIPLE YEARS - make sure MultiYear Flag is set and final year entered as required"]
[]
[null,"Full trading name",{"$f":"INDEX(dms_TradingNameFull_List,MATCH(dms_TradingName,dms_TradingName_List))","v":"CitiPower"},null,"dms_TradingNameFull"]
["Selected here","Model / RIN","EB","dms_Model"]
["Read from Business & other details","Source",{"$f":"dms_Selected_Source","v":"Regulatory proposal"},"dms_Source"]
[null,"Data quality",{"$f":"dms_Selected_Quality","v":"Consolidated"},"dms_DQ_1"]
[null,"Data status",{"$f":"dms_Selected_Status","v":"Public"},"dms_DQ_2"]
[null,"Amendment reason",{"$f":"dms_Amendment_Text","v":"."},null,null,"dms_AmendmentReason"]
[null,"Submission date",{"$f":"dms_Typed_Submission_Date","v":"2020-01-31"},"dms_SubmissionDate"]
[]
["Redundant","EBSS - First application of scheme in forthcoming period?","No"]
["Pre-populated from lookup table","Data ingestion data quality","Consolidated","dms_DataQuality","=IF(dms_DQ_2=\"Confidential\",\"Consolidated\",\"Public\")"]
[null,"Sector",{"$f":"INDEX(dms_Sector_List,MATCH(dms_TradingName,dms_TradingName_List))","v":"Electricity"},"dms_Sector","=INDEX(dms_Sector_List,MATCH(dms_TradingName,dms_TradingName_List))"]
[null,"Segment",{"$f":"INDEX(dms_Segment_List,MATCH(dms_TradingName,dms_TradingName_List))","v":"Distribution"},"dms_Segment","=INDEX(dms_Segment_List,MATCH(dms_TradingName,dms_TradingName_List))"]
[null,"Regulatory Year Ending",{"$f":"dms_RYE_result","v":"2019"},"dms_RYE","=IF(dms_MultiYear_Flag=1,LEFT(dms_Specified_FinalYear,2)&RIGHT(dms_Specified_FinalYear,2),INDEX(dms_RYE_Formula_Result,MATCH(dms_Model,dms_Model_List)))"]
[null,"Reporting Period Type",{"$f":"INDEX(dms_RPT_List,MATCH(dms_TradingName,dms_TradingName_List))","v":"Financial"},"dms_RPT","=INDEX(dms_RPT_List,MATCH(dms_TradingName,dms_TradingName_List))"]
[null,"EB/CA Unit of Measure for Monetary Values","$0s","dms_dollar_nom_UOM","If the cover sheet is attached to an ABC RIN apply the NAMED RANGE to the cell"]
[null,"Security Classification","Public","dms_Classification","Always Public"]
[null,"Jurisdiction",{"$f":"INDEX(dms_JurisdictionList,MATCH(dms_TradingName,dms_TradingName_List))","v":"Vic"},"dms_Jurisdiction","=INDEX(dms_JurisdictionList,MATCH(dms_TradingName,dms_TradingName_List))"]
["Relevant for PTRM, RFMs and Reset RINS","$ REAL REFERENCES"]
[null,"Does the named range CRY exist in this file? ",{"$f":"IFERROR(CRY,\"NO\")","v":"2006-07"}]
[null,"CRY-1  (last full calendar year before CRY)",{"$f":"IFERROR(IF(dms_RPT=\"calendar\",CRY-1,LEFT(CRY,4)),\"CRY not present\")","v":"2006"},"dms_Cal_Year_B4_CRY","'=IF(dms_RPT=\"financial\",VALUE(LEFT(dms_SingleYear_FinalYear_Result,4)),VALUE(LEFT(dms_SingleYear_FinalYear_Result,4)-1))"]
[null,"Dollar $ real month",{"$f":"INDEX(dms_RPTMonth_List,MATCH(dms_TradingName,dms_TradingName_List))","v":"June"},"dms_RPTMonth","=INDEX(dms_RPTMonth_List,MATCH(dms_TradingName,dms_TradingName_List))"]
[null,"Dollar $ real  (the last month before the FRCP_y1)",{"$f":"IF(dms_SingleYearModel=\"yes\",CONCATENATE(dms_RPTMonth)&\" \"&VALUE((LEFT(CRY,2))&RIGHT(CRY,2)),CONCATENATE(dms_RPTMonth)&\" \"&dms_DollarReal_year)","v":"June 2007"},"dms_DollarReal","=IF(SUM(dms_SingleYear_Model)>0,CONCATENATE(dms_RPTMonth)&\" \"&VALUE((LEFT(CRY,2))&RIGHT(CRY,2)),CONCATENATE(dms_RPTMonth)&\" \"&VALUE((LEFT(dms_RYE,2)&RIGHT(dms_RYE,2))))"]
[null,"Dollar $ real previous year (PRCP_y5)",{"$f":"IF(dms_SingleYearModel=\"yes\",CONCATENATE(dms_RPTMonth)&\" \"&VALUE((LEFT(CRY,2))&RIGHT(CRY,2)),CONCATENATE(dms_RPTMonth)&\" \"&dms_Previous_DollarReal_year)","v":"June 2007"},"dms_DollarReal_Prev","=IF(SUM(dms_SingleYear_Model)>0,CONCATENATE(dms_RPTMonth)&\" \"&VALUE(((LEFT(CRY,2))&RIGHT(CRY,2))-1),CONCATENATE(dms_RPTMonth)&\" \"&VALUE(((LEFT(dms_CRCP_FirstYear_Result,2)&RIGHT(dms_CRCP_FirstYear_Result,2))))-1)"]
[null,"PTRM/ RFMs"]
[null,"Form of control",{"$f":"INDEX(dms_FormControl_List,MATCH(dms_TradingName,dms_TradingName_List))","v":"Revenue cap"},"dms_FormControl","=INDEX(dms_FormControl_List,MATCH(dms_TradingName,dms_TradingName_List))"]
["All potential values for Regulatory Years or RYEs as calculated","This block works out the various RYE's for ALL RIN types and MODELS"]
[null,"dms_start_year",{"$f":"FRCP_y1","v":"2021-22"},"FRCP_y1 from cover sheet"]
[null,"dms_CRY_start_year",{"$f":"IFERROR(CRY,CRCP_y4)","v":"2006-07"},"If this has a year in it then named range CRY exists"]
[null,"dms_CRY_start_row",{"$f":"IFERROR(MATCH(dms_CRY_start_year,INDIRECT(dms_RPT),0),0)","v":20}]
[null,"dms_FRCP_start_row",{"$f":"MATCH(dms_start_year,INDIRECT(dms_RPT),0)","v":35},"Uses FRCP_y1 as a start reference"]
[null,"dms_CRCP_start_row",{"$f":"dms_FRCP_start_row-dms_CRCPlength_Num","v":30},"Uses the value in dms_CRCPlength_Num"]
[null,"dms_PRCP_start_row",{"$f":"dms_FRCP_start_row-SUM(dms_CRCPlength_Num+dms_PRCPlength_Num)","v":25},"Uses the value in dms_CRCPlength_Num and dms_PRCPlength_Num"]
[null,"dms_RYE_start_row",{"$f":"dms_FRCP_start_row+(dms_FRCPlength_Num-1)","v":39},"Uses the value in dms_FRCPlength_Num-1"]
[null,"FRCP_start_year",{"$f":"INDEX(INDIRECT(dms_RPT),dms_FRCP_start_row)","v":"2021-22"},"Converts the FRCP start row to display the year"]
[null,"CRCP_start_year",{"$f":"INDEX(INDIRECT(dms_RPT),dms_CRCP_start_row)","v":"2016-17"},"Converts the CRCP start row to display the year"]
[null,"PRCP_start_year",{"$f":"INDEX(INDIRECT(dms_RPT),dms_PRCP_start_row)","v":"2011-12"},"Converts the PRCP start row to display the year"]
[null,"FRCP_final_year",{"$f":"INDEX(INDIRECT(dms_RPT),dms_FRCP_start_row+dms_FRCPlength_Num-1)","v":"2025-26"},"Finds the FRCP final year"]
[null,"CRCP_final_year",{"$f":"INDEX(INDIRECT(dms_RPT),dms_CRCP_start_row+dms_CRCPlength_Num-1)","v":"2020-21"},"Finds the CRCP final year"]
[null,"PRCP_final_year",{"$f":"INDEX(INDIRECT(dms_RPT),dms_PRCP_start_row+dms_FRCPlength_Num-1)","v":"2015-16"},"Finds the PRCP final year"]
[null,"dms_Reset_final_year",{"$f":"INDEX(INDIRECT(dms_RPT),dms_RYE_start_row)","v":"2025-26"},"For Resets and PTRM/RFMs (same as FRCP_final_year)"]
[null,"dms_SpecifiedYear_final_year",{"$f":"FRY","v":"2018-19"},"FRY from cover sheet"]
[null,"dms_DollarReal_year",{"$f":"LEFT(CRCP_final_year,2)&RIGHT(CRCP_final_year,2)","v":"2021"},"Uses the value in CRCP_final_year"]
[null,"dms_Previous_DollarReal_year",{"$f":"LEFT(PRCP_final_year,2)&RIGHT(PRCP_final_year,2)","v":"2016"},"Uses the value in PRCP_final_year"]
[null,"dms_CRY_RYE",{"$f":"IFERROR(LEFT(CRY,2)&RIGHT(CRY,2),0)","v":"2007"},"For ABC single year RINS"]
[null,"dms_Reset_RYE",{"$f":"IF(dms_Model_Span>1,(LEFT(dms_Reset_final_year,2)&RIGHT(dms_Reset_final_year,2)),0)","v":0},"If model span > 1 then uses dms_Reset_final_year otherwise it's a multi year ABC"]
[null,"dms_Specified_RYE",{"$f":"IF(dms_MultiYear_ResponseFlag=\"Yes\",(LEFT(dms_Specified_FinalYear,2)&RIGHT(dms_Specified_FinalYear,2)),0)","v":"2019"},"If multi year ABC then it uses dms_Specified_FinalYear"]
[null,"dms_Model_Span",{"$f":"INDEX(dms_Model_Span_List,MATCH(dms_Model,dms_Model_List))","v":1},"Only single year RINS are set as 1. Otherwise the result of 5 is used to signify that it is more than 1 year span"]
[null,"dms_RYE_result",{"$f":"IF(dms_MultiYear_ResponseFlag=\"yes\",dms_Specified_RYE,(IF(dms_Model_Span>1,dms_Reset_RYE,dms_CRY_RYE)))","v":"2019"},"Nested IF - feeds into dms_RYE"]
[null,"dms_Reset_Span",{"$f":"IF(dms_Reset_RYE>0,CONCATENATE(FRCP_y1,\" to \",FRCP_final_year),0)","v":0},"Reset span of years as text"]
[null,"dms_SpecifiedYear_Span",{"$f":"IF(dms_Specified_RYE>0,CONCATENATE(CRY,\" to \",dms_Specified_FinalYear),0)","v":"2006-07 to 2018-19"},"Multi year ABC span of years as text"]
[null,"dms_Header_Span",{"$f":"IF(dms_MultiYear_Flag=1,dms_SpecifiedYear_Span,IF(dms_Model_Span>1,dms_Reset_Span,CRY))","v":"2006-07 to 2018-19"},"NESTED IF - for Sheet Headers"]
[null,"ABC RINS THAT SPAN MULTIPLE YEARS"]
[null,"This is a multi year ABC RIN?","Yes"]
[null,null,{"$f":"IF(dms_MultiYear_ResponseFlag=\"No\",0,1)","v":1},"dms_MultiYear_Flag","This is set from the answer provided above"]
[null,null,{"$f":"IF(dms_MultiYear_Flag=1,FRY,\"not a Multiple year submission\")","v":"2018-19"},"dms_Specified_FinalYear","The result here is returned to dms_CRCP_FinalYear_Result if response to Q in C73 is \"yes\" and dms_MultiYear_Flag is set to 1"]
[null," Start year for 5.2 in Multi year ABC RINS",{"$f":"IFERROR(IF(dms_MultiYear_Flag=1,FRY,CRY),\"not an ABC\")","v":"2018-19"},"dms_0502_Inst_Year","=IF(dms_MultiYear_Flag=1,FRY,CRY)",null,"For single year RINS this is CRY - multi year RINS need to start a the end of the span of years (ie. FRY)"]
[null,"WHAT IS THE RYE?"]
[null,"Reg Period Lengths"]
[null,"PRCP length in years",{"$f":"INDEX(dms_PRCPlength_List,MATCH(dms_TradingName,dms_TradingName_List))","v":5},"dms_PRCPlength_Num","=INDEX(dms_PRCPlength_List,MATCH(dms_TradingName,dms_TradingName_List))"]
[null,"CRCP length in years",{"$f":"INDEX(dms_CRCPlength_List,MATCH(dms_TradingName,dms_TradingName_List))","v":5},"dms_CRCPlength_Num","=INDEX(dms_CRCPlength_List,MATCH(dms_TradingName,dms_TradingName_List))"]
[null,"FRCP length in years",{"$f":"INDEX(dms_FRCPlength_List,MATCH(dms_TradingName,dms_TradingName_List))","v":5},"dms_FRCPlength_Num","=INDEX(dms_FRCPlength_List,MATCH(dms_TradingName,dms_TradingName_List))"]
[null,"Single year RIN?"]
[null,"Single Year ABC RIN ?",{"$f":"IF(dms_Model=\"EB\",1,0)","v":1},"dms_EB"]
[null,null,{"$f":"IF(dms_Model=\"CA\",1,0)","v":0},"dms_CA","=dms_SingleYear_Model"]
[null,null,{"$f":"IF(dms_Model=\"ARR\",1,0)","v":0},"dms_ARR"]
[null,"Is this a single Year ABC RIN?",{"$f":"IF(SUM(dms_SingleYear_Model)=1,\"yes\",\"no\")","v":"yes"},"dms_SingleYearModel","=IF(SUM(dms_SingleYear_Model)=1,\"yes\",\"no\")"]
[null,"Single Year Final Year Result",{"$f":"IF(AND(dms_SingleYearModel=\"yes\",dms_MultiYear_Flag=0),CRY,0)","v":0},"dms_SingleYear_FinalYear_Result","=IFERROR(IF(SUM(dms_SingleYear_Model)<>0,(INDIRECT(dms_SingleYear_FinalYear_Ref)),\"not a single year RIN\"),\"CRY not present\")"]
[null,"Multi year RIN?"]
[]
[null,"Multi Year Reset/Model?",{"$f":"IF(dms_Model_Span>1,\"yes\",\"no\")","v":"no"}]
[null,"Final year result for Reset/Model",{"$f":"IF(dms_Model_Span>1,dms_Reset_final_year,0)","v":0}]
[]
[null,"Multi Year ABC RIN?",{"$f":"IF(dms_MultiYear_Flag=1,\"yes\",\"no\")","v":"yes"}]
[null,"Final year result for ABC multi year",{"$f":"IF(dms_MultiYear_Flag=1,dms_SpecifiedYear_final_year,0)","v":"2018-19"}]
[]
[null,"EB RINS"]
[null,"Calendar Year for table 3.6 data",{"$f":"IFERROR(IF(dms_Segment=\"Transmission\",dms_Cal_Year_B4_CRY,CRY),\"CRY not present\")","v":"2006-07"},"dms_0306_Year","=IF(dms_Segment=\"Transmission\",dms_Cal_Year_B4_CRY,CRY)"]
[null,"CA RINS"]
[null,"Find how many rows in tables 6.3 sustained interruptions?",null,null,"dms_060301_MaxRows only returns a valid value when cover sheet is attached to a CA file"]
[null,null,{"$f":"IF(dms_Model<>\"CA\",\"not a CA\",\"Is a CA\")","v":"not a CA"},null,"=IF(dms_Model<>\"CA\",\"not a CA\",\"Is a CA\")"]
[null,"dms_060301_Avg_Duration_Sustained_Int_Values present?",{"$f":"IFERROR(IF(INDEX(dms_060301_Avg_Duration_Sustained_Int_Values,1,1)<>\"\",\"yes\",\"no\"),\"no\")","v":"no"},"dms_060301_checkvalue","=IFERROR(IF(INDEX(dms_060301_Avg_Duration_Sustained_Int_Values,1,1)<>\"\",\"yes\",\"no\"),\"no\")"]
[null,null,{"$f":"IF(AND(dms_Model=\"CA\",(dms_060301_checkvalue=\"no\")),\"error - NR not present\",\"no errors\")","v":"no errors"},null,"=IF(AND(dms_Model=\"CA\",(dms_060301_checkvalue=\"no\")),\"error - NR not present\",\"no errors\")"]
[null,"Table 6.3.1 - last row reference",{"$f":"IFERROR(IF(dms_Model=\"CA\",LOOKUP(2,1/(dms_060301_Avg_Duration_Sustained_Int_Values<>\"\"),(ROW(dms_060301_Avg_Duration_Sustained_Int_Values))),\"not a CA\"),\"6.3 not present\")","v":"not a CA"},"dms_060301_LastRow","=IFERROR(IF(dms_Model=\"CA\",LOOKUP(2,1/(dms_060301_Avg_Duration_Sustained_Int_Values<>\"\"),(ROW(dms_060301_Avg_Duration_Sustained_Int_Values))),\"not a CA\"),\"6.3 not present\")"]
[null,"Table 6.3.1 - max number rows",{"$f":"IFERROR(IF(dms_Model=\"CA\",(dms_060301_LastRow-15),\"not a CA\"),\"error\")","v":"not a CA"},"dms_060301_MaxRows","=IFERROR(IF(dms_Model=\"CA\",(dms_060301_LastRow-15),\"not a CA\"),\"error\")"]
[null,"Table 6.6.3 - Public lighting repair - no. business days",{"$f":"INDEX(dms_663_List,MATCH(dms_TradingName,dms_TradingName_List))","v":2},"dms_663","=INDEX(dms_663_List,MATCH(dms_TradingName,dms_TradingName_List))"]
[null,"ARR or RESET RINS"]
[null,"How many rows in tables 6.1 or 6.7?  (leap year?)","insert dms_LeapYear NR if required",null,"'dms_LeapYear is used to determine dms_060701_Max_Rows BUT it is only found on worksheet 6.1 or 6.7 and the date value in the cell is used to determine whether it is a leap year"]
[null,"Is dms_LeapYear named range present?",{"$f":"IFERROR(IF(dms_LeapYear,\"yes\"),\"no\")","v":"no"}]
[null,"Table 6.7.1 - includes a leap year?",{"$f":"IFERROR(IF(MONTH(DATE(YEAR(dms_LeapYear),2,29))=2,\"is a leap year\",\"not a leap year\"),\n\"dms_LeapYear not present\")","v":"dms_LeapYear not present"},"dms_LeapYear_Result","=IFERROR(IF(MONTH(DATE(YEAR(dms_LeapYear),2,29))=2,\"is a leap year\",\"not a leap year\"),\"dms_LeapYear not present\")"]
[null,"MaxRows if Reset and leap year",{"$f":"IF(dms_LeapYear_Result=\"is a leap year\",1827,1826)","v":1826},"dms_060701_Reset_MaxRows","=IF(dms_LeapYear_Result=\"is a leap year\",1827,1826)",null,null,"number of days present in Reset RIN table"]
[null,"MaxRows if ARR and leap year",{"$f":"IF(dms_LeapYear_Result=\"is a leap year\",366,365)","v":365},"dms_060701_ARR_MaxRows","=IF(dms_LeapYear_Result=\"is a leap year\",366,365)",null,null,"number of days present in ARR RIN table"]
[null,"Table 6.7.1 - Max Rows (leap year/ non leap year)",{"$f":"IF(dms_Model=\"ARR\",dms_060701_ARR_MaxRows,IF(dms_Model=\"Reset\",dms_060701_Reset_MaxRows,\"not a relevant RIN type\"))","v":"not a relevant RIN type"},"dms_060701_MaxRows","=IF(dms_Model=\"ARR\",dms_060701_ARR_MaxRows,IF(dms_Model=\"Reset\",dms_060701_Reset_MaxRows,\"not a relevant RIN type\"))"]
[null,"How many columns in 6.7?   (4 or 5 feeder categories)",{"$f":"IF(dms_FifthFeeder_flag_NSP=\"NO\",\"This NSP has only 4 feeder categories\",\"This NSP has 5 feeder categories\")","v":"This NSP has only 4 feeder categories"}]
[null,"Table 6.7.1 - Last column (# of feeder categories > 4)",{"$f":"IF(dms_FifthFeeder_flag_NSP=\"NO\",10,12)","v":10},"dms_060701_MaxCols","=IF(dms_FifthFeeder_flag_NSP=\"NO\",8,10)"]
[null,"Table 6.7.1 - Number of offset rows",{"$f":"IF(dms_Model=\"ARR\",15,9)","v":9},"dms_060701_OffsetRows","=IF(dms_Model=\"ARR\",15,9)"]
[null,"Start date for telephone answering in 6.1 or 6.7?",null,null,"Using 060101 as naming standard not 060701 for start dates"]
[null,"Table 6.1.1 and 6.7.1 - Start Date as Text",{"$f":"IF(dms_SingleYearModel=\"yes\",(CONCATENATE(IF(LEN(CRY)=4,\"1-Jan-\",\"1-Jul-\"),LEFT(CRY,4))),(CONCATENATE(IF(LEN(PRCP_y4)=4,\"1-Jan-\",\"1-Jul-\"),LEFT(PRCP_y4,4))))","v":"1-Jul-2006"},"dms_060101_StartDateTxt","=IF(SUM(dms_SingleYear_Model)>1,(CONCATENATE(IF(LEN(CRY)=4,\"1-Jan-\",\"1-Jul-\"),LEFT(CRY,4))),(CONCATENATE(IF(LEN(CRCP_y4)=4,\"1-Jan-\",\"1-Jul-\"),LEFT(CRCP_y4,4))))"]
[null,"Table 6.1.1 and 6.7.1 - Start Date as Date Value",{"$f":"DATEVALUE(dms_060701_StartDateTxt)","v":38899},"dms_060101_StartDateVal","=DATEVALUE(dms_060701_StartDateTxt)"]
[null,"ARRs"]
[null,"How many rows in table 6.8?","insert dms_060801_StartCell NR if required",null,"dms_060801_StartCell is only found on worksheet 6.8 and is used to determine the starting date for the date range"]
[null,"Is dms_060801_StartCell named range present?","yes",null,"=IFERROR(IF((ROW(dms_060801_StartCell)-1)=1,\"yes\",\"yes\"),\"no\")"]
[null,"Table 6.8 - Number of offset rows",12,"dms_0608_OffsetRows","=IFERROR(IF(dms_Model=\"ARR\",(ROW(dms_060801_StartCell)-1),\"not an ARR\"),\"6.8 error\")"]
[null,"Table 6.8 - Last row","0","dms_0608_LastRow","=IFERROR(IF(dms_060801_StartCell<>\"\",IF(dms_Model=\"ARR\",(LOOKUP(2,1/(dms_060801_01_Values<>\"\"),(ROW(dms_060801_01_Values)))),\"not an ARR\"),0),\"0\")"]
[null,"Table 6.8 - MaxRows",{"$f":"IFERROR(IF(dms_Model=\"ARR\",(MAX(0,dms_0608_LastRow-dms_0608_OffsetRows)),\"not an ARR\"),\"0\")","v":"not an ARR"},"dms_060801_MaxRows","=IFERROR(IF(dms_Model=\"ARR\",(MAX(0,dms_0608_LastRow-dms_0608_OffsetRows)),\"not an ARR\"),\"0\")"]
[null,"TNSP RESET RINS"]
[null,"Table 7.9.4 only appears in TNSPs Reset RIN"]
[null,"Table 7.9.4 - first year",{"$f":"LEFT(PRCP_y3,4)","v":"2013"},"dms_070904_Start_Year","=LEFT(PRCP_y3,4)"]
[]
[null,"MISC"]
[null,"Distribution Determination Reference",{"$f":"INDEX(dms_DeterminationRef_List,MATCH(dms_TradingName,dms_TradingName_List))","v":"2016-20 Distribution Determination"},"dms_DeterminationRef"]
[null,"Public lighting NSP?",{"$f":"INDEX(dms_Public_Lighting_List,MATCH(dms_TradingName,dms_TradingName_List))","v":"YES"},"dms_Public_Lighting","=INDEX(dms_Public_Lighting_List,MATCH(dms_TradingName,dms_TradingName_List))"]
[null,"CBD Feeder for this business",{"$f":"INDEX(dms_CBD_flag,MATCH(dms_TradingName,dms_TradingName_List))","v":"YES"},"dms_CBD_flag_NSP"]
[null,"Urban Feeder for this business",{"$f":"INDEX(dms_Urban_flag,MATCH(dms_TradingName,dms_TradingName_List))","v":"YES"},"dms_Urban_flag_NSP"]
[null,"Short rural Feeder for this business",{"$f":"INDEX(dms_ShortRural_flag,MATCH(dms_TradingName,dms_TradingName_List))","v":"NO"},"dms_ShortRural_flag_NSP"]
[null,"Long rural Feeder for this business",{"$f":"INDEX(dms_LongRural_flag,MATCH(dms_TradingName,dms_TradingName_List))","v":"NO"},"dms_LongRural_flag_NSP"]
[null,"Fifth Feeder Category (eg. TasNetworks (D))",{"$f":"INDEX(dms_FeederType_5_flag,MATCH(dms_TradingName,dms_TradingName_List))","v":"NO"},"dms_FifthFeeder_flag_NSP","=INDEX(dms_FeederType_5_flag,MATCH(dms_TradingName,dms_TradingName_List))"]
[]
[null,"DISCARD FILES"]
[null,"discard this record?","NO","dms_DISCARD","If record is to be discarded from DB set this flag to YES"]
[]
[null,"SUBSET FILES"]
[null,"Is this Submission File a Subset File","YES","dms_Partial"]
[]
[]
[null,"REGULATORY YEARS FOR MULTI RYE SUBMISSIONS"]
[null,"Multiple RYE flag","YES","dms_Multi_RYE_flag"]
[null,null,"Manually specify RYE","Named ranges to apply"]
[null,null,2013,"dms_RYE_01"]
[null,null,2014,"dms_RYE_02"]
[null,null,2015,"dms_RYE_03"]
[null,null,2016,"dms_RYE_04"]
[null,null,2017,"dms_RYE_05"]
[null,null,2018,"dms_RYE_06"]
[null,null,2019,"dms_RYE_07"]
[null,null,2020,"dms_RYE_08"]
[null,null,2021,"dms_RYE_09"]

{"sheet":"Instructions","index":4,"n_rows":27,"n_cols":4,"rows_kept":27,"cut":false,"hidden":false,"merged":[[7,1,8,1],[7,2,7,3],[8,2,8,4],[1,1,1,4],[2,1,2,4],[3,1,3,4],[4,1,4,4],[5,2,5,4],[18,1,24,1],[18,2,18,4],[26,2,26,4],[10,2,10,4],[12,1,14,1],[12,2,12,4],[13,2,13,3],[14,2,14,4],[16,2,16,4]]}
[]
[null,{"$f":"CONCATENATE(dms_Sector,\" \",dms_Segment,\" \", \"Network Service Provider\")","v":"Electricity Distribution Network Service Provider"}]
[null,{"$f":"INDEX(dms_Worksheet_List,MATCH(dms_Model,dms_Model_List))","v":"HISTORICAL ECONOMIC BENCHMARKING - FINANCIAL YEARS"}]
[null,{"$f":"CONCATENATE(\"This template is to be used by \",dms_TradingNameFull,\" to fulfil its reporting obligations to the AER.\")","v":"This template is to be used by CitiPower to fulfil its reporting obligations to the AER."}]
[null,"INSTRUCTIONS"]
[null,"GENERAL","Complete the Business & other details worksheet before entering data or values in any other worksheets. The Business & other details worksheet is linked to other worksheets within the workbook and automatically generates certain column headings and conditional formatting."]
[]
[null,"CONFIDENTIAL INFORMATION","\nPlease use the macro at the top of each \nworksheet to identify confidential information\nin the confidential workbook. \n\n"]
[null,null,"-Do this by selecting the cell or cells that contain confidential information and then run the Mark selection as CONFIDENTIAL macro. This will format the cells a specific colour that is identified by the AER's database which in turn marks that information as confidential.\n\n-To reverse this, select the cell or cells and run the Return selection to NON-CONFIDENTIAL macro."]
[]
[null,"RESPONSES","\nPlease return two (2) files to the AER: \n\n1. A confidential version which must contain a complete set of all responses with confidential information marked using the Mark selection CONFIDENTIAL macro and which has been completed using the locked template file provided by the AER. \n\n2. A public version with confidential information either removed completely or aggregated in some form together with writtten consent to disclose the public version of the response.\n\nUse the drop down box on the Business and other details worksheet to identify the file as either confidential ('consolidated') or public. "]
[]
[null,"AMENDMENTS","\nIf an NSP wishes to correct data previously submitted to the AER it should resubmit that data using the original completed submission as the starting point. Please make any necessary changes to the data. Data that is not being amended should be left unchanged. \n\nNSPs must identify the reason for the amendments in the Amendment Reason box on the  Business and other details worksheet. NSPs may provide further details regarding any amendments in the Amendments worksheet. \n\n."]
[null,null,"NSP may use Amended Data macro \nto highlight cells that contain amended data.\nNB: if data is also CONFIDENTIAL, re-apply \nthe Confidentiality macro after applying the \nAmended macro"]
[null,null,"Please resubmit two (2) files - a confidential version and a public version of the amended submission to the AER"]
[]
[null,"UNITS OF MEASURE","\nAll amounts are to be unrounded and reported on a one for one basis: that is 1000 is to be entered as '1000'. Applicable units of measure may be identified in the table column headings or row descriptors.\n\n"]
[]
[null,"INPUT / NON-INPUT CELLS"]
[null,null,null,"Yellow = Input cell (mandatory)"]
[null,null,null,"Darker yellow = input cell (mandatory)"]
[null,null,null,"Orange = input cell (if data available)"]
[null,null,null,"Grey = Not applicable/No inputs required"]
[null,null,null," \nPLEASE DO NOT ENTER TEXT into cells that are to contain numeric data."]
[]
[]
[null,"NAVIGATION","\nMany tables in the worksheets have been \"grouped\" to allow for easy navigation. To ungroup or group data use the outline symbols in the left margin (for Row groupings) or above the columns (for column groupings). \n\n\n\n"]

{"sheet":"Contents","index":5,"n_rows":18,"n_cols":4,"rows_kept":18,"cut":false,"hidden":false,"merged":[[6,2,6,3]]}
[null,{"$f":"INDEX(dms_Worksheet_List,MATCH(dms_Model,dms_Model_List))","v":"HISTORICAL ECONOMIC BENCHMARKING - FINANCIAL YEARS"}]
[null,{"$f":"INDEX(dms_TradingNameFull_List,MATCH(dms_TradingName,dms_TradingName_List))","v":"CitiPower"}]
[null,{"$f":"dms_Header_Span","v":"2006-07 to 2018-19"}]
[]
[]
[]
[null,null,"CONTENTS"]
[]
[null,null,"SUBMISSION","Business & other details"]
[]
[null,null,"ECONOMIC BENCHMARKING","3.1 Revenue"]
[null,null,null,"3.2 Operating expenditure"]
[null,null,null,"3.2.3 Provisions"]
[null,null,null,"3.3 Assets (RAB)"]
[null,null,null,"3.4 Operational data"]
[null,null,null,"3.5 Physical assets"]
[null,null,null,"3.6 Quality of service"]
[null,null,null,"3.7 Operating environment"]

{"sheet":"Business & other details","index":6,"n_rows":74,"n_cols":81,"rows_kept":74,"cut":false,"hidden":false,"merged":[[0,7,2,15],[3,21,3,57],[6,21,6,75],[8,16,8,93],[15,21,15,35],[15,37,15,58],[23,21,23,35],[23,37,23,58],[23,60,23,66],[23,68,23,89],[24,21,24,35],[24,37,24,51],[24,60,24,66],[24,68,24,82],[16,21,16,35],[16,37,16,48],[22,21,22,35],[22,37,22,58],[22,60,22,66],[22,68,22,89],[31,21,31,35],[31,37,31,58],[31,60,31,66],[31,68,31,89],[32,21,32,35],[32,37,32,58],[32,60,32,66],[32,68,32,89],[25,21,25,35],[25,37,25,40],[25,49,25,51],[25,60,25,66],[25,68,25,71],[25,80,25,82],[41,79,41,86],[42,43,42,50],[42,52,42,59],[42,61,42,68],[42,70,42,77],[42,79,42,86],[33,21,33,35],[33,37,33,58],[33,60,33,66],[33,68,33,89],[41,21,49,27],[41,31,41,40],[41,43,41,50],[41,52,41,59],[41,61,41,68],[41,70,41,77],[43,43,43,50],[43,52,43,59],[43,61,43,68],[43,70,43,77],[43,79,43,86],[45,31,45,40],[45,43,45,50],[45,52,45,59],[45,61,45,68],[45,70,45,77],[49,31,49,40],[49,43,49,50],[49,52,49,59],[49,61,49,68],[49,70,49,77],[45,79,45,86],[46,43,46,50],[46,52,46,59],[46,61,46,68],[46,70,46,77],[46,79,46,86],[49,79,49,86],[50,43,50,50],[50,52,50,59],[50,61,50,68],[50,70,50,77],[50,79,50,86],[47,43,47,50],[47,52,47,59],[47,61,47,68],[47,70,47,77],[47,79,47,86],[51,43,51,50],[51,52,51,59],[51,61,51,68],[51,70,51,77],[51,79,51,86],[53,21,55,27],[53,31,53,40],[53,43,53,50],[55,31,55,40],[55,43,55,50],[69,43,71,87],[73,31,73,40],[73,43,73,58],[61,31,61,40],[61,43,61,58],[63,21,73,27],[63,31,63,40],[63,43,63,58],[65,31,65,40],[65,43,65,58],[67,31,67,40],[67,43,67,58],[69,31,71,40]]}
[null,null,null,null,null,null,null,null,null,null,null,null,null,null,null,null,null,null,null,null,null,{"$f":"INDEX(dms_Worksheet_List,MATCH(dms_Model,dms_Model_List))","v":"HISTORICAL ECONOMIC BENCHMARKING - FINANCIAL YEARS"}]
[null,null,null,null,null,null,null,null,null,null,null,null,null,null,null,null,null,null,null,null,null,{"$f":"INDEX(dms_TradingNameFull_List,MATCH(dms_TradingName,dms_TradingName_List))","v":"CitiPower"}]
[null,null,null,null,null,null,null,null,null,null,null,null,null,null,null,null,null,null,null,null,null,{"$f":"dms_Header_Span","v":"2006-07 to 2018-19"}]
[null,null,null,null,null,null,null,null,null,null,null,null,null,null,null,null,null,null,null,null,null,"BUSINESS & OTHER DETAILS"]
[]
[null,null,null,null,null,null,null,null,null,null,null,null,null,null,null,null,null,null,null,null,null,"INSTRUCTIONS"]
[null,null,null,null,null,null,null,null,null,null,null,null,null,null,null,null,null,null,null,null,null,"Complete the following business details regulatory template before entering data or values in any other regulatory template. This regulatory template is linked to other cells within the spreadsheet and automatically generates column headings and conditional formatting to distinguish business specific input and non-input cells. "]
[]
[null,null,null,null,null,null,null,null,null,null,null,null,null,null,null,null,"SUBMISSION PARTICULARS INPUT SHEET"]
[]
[]
[null,null,null,null,null,null,null,null,null,null,null,null,null,null,null,null,null,null,null,null,null,"ENTITY DETAILS"]
[]
[null,null,null,null,null,null,null,null,null,null,null,null,null,null,null,null,null,null,null,null,null,"Business Name"]
[]
[null,null,null,null,null,null,null,null,null,null,null,null,null,null,null,null,null,null,null,null,null,"Short name",null,null,null,null,null,null,null,null,null,null,null,null,null,null,null,"CitiPower"]
[null,null,null,null,null,null,null,null,null,null,null,null,null,null,null,null,null,null,null,null,null,"ACN/ABN",null,null,null,null,null,null,null,null,null,null,null,null,null,null,null,{"$f":"INDEX(dms_ABN_List,MATCH(dms_TradingName,dms_TradingName_List))","v":76064651056}]
[]
[]
[]
[null,null,null,null,null,null,null,null,null,null,null,null,null,null,null,null,null,null,null,null,null,"Business Address",null,null,null,null,null,null,null,null,null,null,null,null,null,null,null,null,null,null,null,null,null,null,null,null,null,null,null,null,null,null,null,null,null,null,null,null,null,null,null,null,null,null,null,null,null,null,"Postal Address"]
[]
[null,null,null,null,null,null,null,null,null,null,null,null,null,null,null,null,null,null,null,null,null,"Address 1",null,null,null,null,null,null,null,null,null,null,null,null,null,null,null,{"$f":"INDEX(dms_Addr1_List,MATCH(dms_TradingName,dms_TradingName_List))","v":"40 Market Street"},null,null,null,null,null,null,null,null,null,null,null,null,null,null,null,null,null,null,null,null,null,null,"Address 1",null,null,null,null,null,null,null,{"$f":"INDEX(dms_PAddr1_List,MATCH(dms_TradingName,dms_TradingName_List))","v":"Locked Bag 14090"}]
[null,null,null,null,null,null,null,null,null,null,null,null,null,null,null,null,null,null,null,null,null,"Address 2",null,null,null,null,null,null,null,null,null,null,null,null,null,null,null,{"$f":"IF(ISBLANK(INDEX(dms_Addr2_List,MATCH(dms_TradingName,dms_TradingName_List))),\"\",(INDEX(dms_Addr2_List,MATCH(dms_TradingName,dms_TradingName_List))))","v":""},null,null,null,null,null,null,null,null,null,null,null,null,null,null,null,null,null,null,null,null,null,null,"Address 2",null,null,null,null,null,null,null,{"$f":"IF(ISBLANK(INDEX(dms_PAddr2_List,MATCH(dms_TradingName,dms_TradingName_List))),\"\",(INDEX(dms_PAddr2_List,MATCH(dms_TradingName,dms_TradingName_List))))","v":""}]
[null,null,null,null,null,null,null,null,null,null,null,null,null,null,null,null,null,null,null,null,null,"Suburb",null,null,null,null,null,null,null,null,null,null,null,null,null,null,null,{"$f":"INDEX(dms_Suburb_List,MATCH(dms_TradingName,dms_TradingName_List))","v":"MELBOURNE"},null,null,null,null,null,null,null,null,null,null,null,null,null,null,null,null,null,null,null,null,null,null,"Suburb",null,null,null,null,null,null,null,{"$f":"INDEX(dms_PSuburb_List,MATCH(dms_TradingName,dms_TradingName_List))","v":"MELBOURNE"}]
[null,null,null,null,null,null,null,null,null,null,null,null,null,null,null,null,null,null,null,null,null,"State",null,null,null,null,null,null,null,null,null,null,null,null,null,null,null,{"$f":"INDEX(dms_State_List,MATCH(dms_TradingName,dms_TradingName_List))","v":"Vic"},null,null,null,null,null,null,null,null,null,"Post code",null,{"$f":"INDEX(dms_PostCode_List,MATCH(dms_TradingName,dms_TradingName_List))","v":3000},null,null,null,null,null,null,null,null,null,null,"State",null,null,null,null,null,null,null,{"$f":"INDEX(dms_PState_List,MATCH(dms_TradingName,dms_TradingName_List))","v":"Vic"},null,null,null,null,null,null,null,null,null,"Post code",null,{"$f":"INDEX(dms_PPostCode_List,MATCH(dms_TradingName,dms_TradingName_List))","v":8001}]
[]
[null,null,null,null,null,null,null,null,null,null,null,null,null,null,null,null,null,null,null,null,null,null,null,null,null,null,null,null,null,null,null,null,null,null,null,null,null,null,null,null,null,null,null,null,null,null,null,null,null,null,null,null,"`"]
[]
[null,null,null,null,null,null,null,null,null,null,null,null,null,null,null,null,null,null,null,null,null,"Contact Names"]
[]
[null,null,null,null,null,null,null,null,null,null,null,null,null,null,null,null,null,null,null,null,null,"Name",null,null,null,null,null,null,null,null,null,null,null,null,null,null,null,"Brent Cleeve",null,null,null,null,null,null,null,null,null,null,null,null,null,null,null,null,null,null,null,null,null,null,"Name"]
[null,null,null,null,null,null,null,null,null,null,null,null,null,null,null,null,null,null,null,null,null,"Phone",null,null,null,null,null,null,null,null,null,null,null,null,null,null,null,"(03) 9683 4465",null,null,null,null,null,null,null,null,null,null,null,null,null,null,null,null,null,null,null,null,null,null,"Phone"]
[null,null,null,null,null,null,null,null,null,null,null,null,null,null,null,null,null,null,null,null,null,"Email",null,null,null,null,null,null,null,null,null,null,null,null,null,null,null,"bcleeve@powercor.com.au",null,null,null,null,null,null,null,null,null,null,null,null,null,null,null,null,null,null,null,null,null,null,"Email"]
[]
[]
[]
[]
[null,null,null,null,null,null,null,null,null,null,null,null,null,null,null,null,null,null,null,null,null,"REGULATORY CONTROL PERIODS"]
[]
[]
[null,null,null,null,null,null,null,null,null,null,null,null,null,null,null,null,null,null,null,null,null,"RESETS",null,null,null,null,null,null,null,null,null,"Forthcoming period",null,null,null,null,null,null,null,null,null,null,null,"2021-22",null,null,null,null,null,null,null,null,{"$f":"FRCP_y2","v":"2022-23"},null,null,null,null,null,null,null,null,{"$f":"FRCP_y3","v":"2023-24"},null,null,null,null,null,null,null,null,{"$f":"FRCP_y4","v":"2024-25"},null,null,null,null,null,null,null,null,{"$f":"FRCP_y5","v":"2025-26"}]
[null,null,null,null,null,null,null,null,null,null,null,null,null,null,null,null,null,null,null,null,null,null,null,null,null,null,null,null,null,null,null,null,null,null,null,null,null,null,null,null,null,null,null,{"$f":"FRCP_y6","v":"2026-27"},null,null,null,null,null,null,null,null,{"$f":"FRCP_y7","v":"2027-28"},null,null,null,null,null,null,null,null,{"$f":"FRCP_y8","v":"2028-29"},null,null,null,null,null,null,null,null,{"$f":"FRCP_y9","v":"2029-30"},null,null,null,null,null,null,null,null,{"$f":"FRCP_y10","v":"2030-31"}]
[null,null,null,null,null,null,null,null,null,null,null,null,null,null,null,null,null,null,null,null,null,null,null,null,null,null,null,null,null,null,null,null,null,null,null,null,null,null,null,null,null,null,null,{"$f":"FRCP_y11","v":"2031-32"},null,null,null,null,null,null,null,null,{"$f":"FRCP_y12","v":"2032-33"},null,null,null,null,null,null,null,null,{"$f":"FRCP_y13","v":"2033-34"},null,null,null,null,null,null,null,null,{"$f":"FRCP_y14","v":"2034-35"},null,null,null,null,null,null,null,null,{"$f":"FRCP_y15","v":"2035-36"}]
[]
[null,null,null,null,null,null,null,null,null,null,null,null,null,null,null,null,null,null,null,null,null,null,null,null,null,null,null,null,null,null,null,"Current period",null,null,null,null,null,null,null,null,null,null,null,{"$f":"CRCP_y1","v":"2016-17"},null,null,null,null,null,null,null,null,{"$f":"CRCP_y2","v":"2017-18"},null,null,null,null,null,null,null,null,{"$f":"CRCP_y3","v":"2018-19"},null,null,null,null,null,null,null,null,{"$f":"CRCP_y4","v":"2019-20"},null,null,null,null,null,null,null,null,{"$f":"CRCP_y5","v":"2020-21"}]
[null,null,null,null,null,null,null,null,null,null,null,null,null,null,null,null,null,null,null,null,null,null,null,null,null,null,null,null,null,null,null,null,null,null,null,null,null,null,null,null,null,null,null,{"$f":"CRCP_y6","v":"2021-22"},null,null,null,null,null,null,null,null,{"$f":"CRCP_y7","v":"2022-23"},null,null,null,null,null,null,null,null,{"$f":"CRCP_y8","v":"2023-24"},null,null,null,null,null,null,null,null,{"$f":"CRCP_y9","v":"2024-25"},null,null,null,null,null,null,null,null,{"$f":"CRCP_y10","v":"2025-26"}]
[null,null,null,null,null,null,null,null,null,null,null,null,null,null,null,null,null,null,null,null,null,null,null,null,null,null,null,null,null,null,null,null,null,null,null,null,null,null,null,null,null,null,null,{"$f":"CRCP_y11","v":"2026-27"},null,null,null,null,null,null,null,null,{"$f":"CRCP_y12","v":"2027-28"},null,null,null,null,null,null,null,null,{"$f":"CRCP_y13","v":"2028-29"},null,null,null,null,null,null,null,null,{"$f":"CRCP_y14","v":"2029-30"},null,null,null,null,null,null,null,null,{"$f":"CRCP_y15","v":"2030-31"}]
[]
[null,null,null,null,null,null,null,null,null,null,null,null,null,null,null,null,null,null,null,null,null,null,null,null,null,null,null,null,null,null,null,"Previous period",null,null,null,null,null,null,null,null,null,null,null,{"$f":"PRCP_y1","v":"2011-12"},null,null,null,null,null,null,null,null,{"$f":"PRCP_y2","v":"2012-13"},null,null,null,null,null,null,null,null,{"$f":"PRCP_y3","v":"2013-14"},null,null,null,null,null,null,null,null,{"$f":"PRCP_y4","v":"2014-15"},null,null,null,null,null,null,null,null,{"$f":"PRCP_y5","v":"2015-16"}]
[null,null,null,null,null,null,null,null,null,null,null,null,null,null,null,null,null,null,null,null,null,null,null,null,null,null,null,null,null,null,null,null,null,null,null,null,null,null,null,null,null,null,null,{"$f":"PRCP_y6","v":"2016-17"},null,null,null,null,null,null,null,null,{"$f":"PRCP_y7","v":"2017-18"},null,null,null,null,null,null,null,null,{"$f":"PRCP_y8","v":"2018-19"},null,null,null,null,null,null,null,null,{"$f":"PRCP_y9","v":"2019-20"},null,null,null,null,null,null,null,null,{"$f":"PRCP_y10","v":"2020-21"}]
[null,null,null,null,null,null,null,null,null,null,null,null,null,null,null,null,null,null,null,null,null,null,null,null,null,null,null,null,null,null,null,null,null,null,null,null,null,null,null,null,null,null,null,{"$f":"PRCP_y11","v":"2021-22"},null,null,null,null,null,null,null,null,{"$f":"PRCP_y12","v":"2022-23"},null,null,null,null,null,null,null,null,{"$f":"PRCP_y13","v":"2023-24"},null,null,null,null,null,null,null,null,{"$f":"PRCP_y14","v":"2024-25"},null,null,null,null,null,null,null,null,{"$f":"PRCP_y15","v":"2025-26"}]
[]
[null,null,null,null,null,null,null,null,null,null,null,null,null,null,null,null,null,null,null,null,null,"ANNUAL RINS",null,null,null,null,null,null,null,null,null,"Commencing year",null,null,null,null,null,null,null,null,null,null,null,"2006-07"]
[]
[null,null,null,null,null,null,null,null,null,null,null,null,null,null,null,null,null,null,null,null,null,null,null,null,null,null,null,null,null,null,null,"Final year",null,null,null,null,null,null,null,null,null,null,null,"2018-19"]
[]
[]
[]
[null,null,null,null,null,null,null,null,null,null,null,null,null,null,null,null,null,null,null,null,null,"SUBMISSION DETAILS"]
[]
[null,null,null,null,null,null,null,null,null,null,null,null,null,null,null,null,null,null,null,null,null,null,null,null,null,null,null,null,null,null,null,"RIN type",null,null,null,null,null,null,null,null,null,null,null,{"$f":"INDIRECT(dms_Model)","v":"Economic Benchmarking"}]
[]
[null,null,null,null,null,null,null,null,null,null,null,null,null,null,null,null,null,null,null,null,null,"THIS FILE",null,null,null,null,null,null,null,null,null,"Source",null,null,null,null,null,null,null,null,null,null,null,"Regulatory proposal"]
[]
[null,null,null,null,null,null,null,null,null,null,null,null,null,null,null,null,null,null,null,null,null,null,null,null,null,null,null,null,null,null,null,"Data Quality",null,null,null,null,null,null,null,null,null,null,null,"Consolidated"]
[]
[null,null,null,null,null,null,null,null,null,null,null,null,null,null,null,null,null,null,null,null,null,null,null,null,null,null,null,null,null,null,null,"Confidentiality Status",null,null,null,null,null,null,null,null,null,null,null,"Public"]
[]
[null,null,null,null,null,null,null,null,null,null,null,null,null,null,null,null,null,null,null,null,null,null,null,null,null,null,null,null,null,null,null,"Amended RIN \nAmendment Reason",null,null,null,null,null,null,null,null,null,null,null,"."]
[]
[]
[]
[null,null,null,null,null,null,null,null,null,null,null,null,null,null,null,null,null,null,null,null,null,null,null,null,null,null,null,null,null,null,null,"Submission Date",null,null,null,null,null,null,null,null,null,null,null,"2020-01-31"]

{"sheet":"3.1 Revenue","index":7,"n_rows":48,"n_cols":27,"rows_kept":48,"cut":false,"hidden":false,"merged":[[40,15,40,26],[8,2,8,13],[28,2,28,13],[40,2,40,13],[9,2,9,13],[27,2,27,13],[39,2,39,13],[8,15,8,26],[9,15,9,26],[27,15,27,26],[39,15,39,26],[28,15,28,26]]}
[null,{"$f":"INDEX(dms_Worksheet_List,MATCH(dms_Model,dms_Model_List))","v":"HISTORICAL ECONOMIC BENCHMARKING - FINANCIAL YEARS"}]
[null,{"$f":"INDEX(dms_TradingNameFull_List,MATCH(dms_TradingName,dms_TradingName_List))","v":"CitiPower"}]
[null,{"$f":"dms_Header_Span","v":"2006-07 to 2018-19"}]
[null,"3.1 REVENUE"]
[]
[null,"There are THREE (x TWO) tables on this worksheet. Both ROWS and COLUMNS have been grouped for ease of navigation. see the Instructions sheet on how to group or ungroup tables. "]
[]
[null,"3.1.1 - REVENUE GROUPING BY CHARGEABLE QUANTITY"]
[null,null,"STANDARD CONTROL SERVICES",null,null,null,null,null,null,null,null,null,null,null,null,"ALTERNATIVE CONTROL SERVICES"]
[null,null,"REVENUE\n($0's)",null,null,null,null,null,null,null,null,null,null,null,null,"REVENUE\n($0's)"]
[null,null,{"$f":"dms_y1","v":"2006-07"},{"$f":"dms_y2","v":"2007-08"},{"$f":"dms_y3","v":"2008-09"},{"$f":"dms_y4","v":"2009-10"},{"$f":"dms_y5","v":"2010-11"},{"$f":"dms_y6","v":"2011-12"},{"$f":"dms_y7","v":"2012-13"},{"$f":"dms_y8","v":"2013-14"},{"$f":"dms_y9","v":"2014-15"},{"$f":"dms_y10","v":"2015-16"},{"$f":"dms_y11","v":"2016-17"},{"$f":"dms_y12","v":"2017-18"},null,{"$f":"dms_y1","v":"2006-07"},{"$f":"dms_y2","v":"2007-08"},{"$f":"dms_y3","v":"2008-09"},{"$f":"dms_y4","v":"2009-10"},{"$f":"dms_y5","v":"2010-11"},{"$f":"dms_y6","v":"2011-12"},{"$f":"dms_y7","v":"2012-13"},{"$f":"dms_y8","v":"2013-14"},{"$f":"dms_y9","v":"2014-15"},{"$f":"dms_y10","v":"2015-16"},{"$f":"dms_y11","v":"2016-17"},{"$f":"dms_y12","v":"2017-18"}]
["DREV0101","Revenue from Fixed Customer Charges ",7269943.7869410953,7041478.6650585188,7115344.9304357562,7272686.5213216655,7422004.2268249998,7945906.5257185008,8930505.0384921674,14743652.853108663,23806256.979559682,30534134.326046348,40615217.5,48832645.184064627,null,0,0,0,0,0,0,0,0,0,0,0,0]
["DREV0102","Revenue from Energy Delivery charges where time of use is not a determinant",73131109.797680587,72263632.812975347,71580872.631097943,71586276.368335843,67101089.890353799,63941046.609018028,67359339.191095859,70410480.061613917,76776895.084974617,78061472.008220941,66247889.5,59458293.668001734,null,0,0,0,0,0,0,0,0,0,0,0,0]
["DREV0103","Revenue from On–Peak Energy Delivery charges ",60585341.360468559,62629617.036197364,65192602.457845971,70649352.562182933,70897453.053547591,72449196.129604608,78607172.011911631,80652101.802310988,79041740.636353016,85948829.390464306,92533440.5,89535539.710009605,null,0,0,0,0,0,0,0,0,0,0,0,0]
["DREV0104","Revenue from Shoulder period Energy Delivery Charges",0,0,0,0,0,0,472.83421557719117,20738.725088655337,88111.095062015636,156645.2041889375,167595.5,161256.82654612616,null,0,0,0,0,0,0,0,0,0,0,0,0]
["DREV0105","Revenue from Off–Peak Energy Delivery charges ",16365877.909632046,16661152.697579134,17082200.439306334,17287452.046198767,16850390.02963509,17391782.708122823,18980272.123719722,20706917.812176086,23492207.137989245,25248688.600848898,27584989,30741244.662338007,null,0,0,0,0,0,0,0,0,0,0,0,0]
["DREV0106","Revenue from controlled load customer charges",562540.63048200007,525866.67048670002,501532.79890632944,463752.62769225065,421176.97518774786,411049.54562844592,420842.55655493191,452160.23031150654,886570.38565539382,1168393.1645499,980909,980142.51670750091,null,0,0,0,0,0,0,0,0,0,0,0,0]
["DREV0107","Revenue from unmetered supplies",1946363.5111305956,1732153.0905672973,1277998.5491907289,1159879.4459111984,1161693.5006100456,1183004.8099926719,1269996.0044931676,1338167.1593377986,1252846.3660326386,1325022.0890476101,1829313,2196380.4404241526,null,0,0,0,0,0,0,0,0,0,0,0,0]
["DREV0108","Revenue from Contracted Maximum Demand charges",43453326.623418704,44352160.010016814,44021749.923396371,44586410.549519174,44386973.991323367,44541276.93300201,49550634.805924967,56251584.404110476,65728619.914931446,49642501.304488249,13615881,0,null,0,0,0,0,0,0,0,0,0,0,0,0]
["DREV0109","Revenue from Measured Maximum Demand charges",0,0,0,0,0,0,0,0,0,11397108.5,35343525,52660313.202118888,null,0,0,0,0,0,0,0,0,0,0,0,0]
["DREV0110","Revenue from metering charges",0,0,0,0,0,0,0,0,0,0,0,0,null,0,0,0,0,0,0,0,0,0,15569451,30234837.5,27166311.605000004]
["DREV0111","Revenue from connection charges",0,0,0,0,0,0,0,0,0,0,0,0,null,3352326.7949999999,4331858.7100000009,5191124.9050000003,5242502.2799999993,5054697.09,5001111.1300000008,5165755.7846538275,4682889.6609304603,4173899.4565556226,4736759.5402789898,6743308,9054292.4849999994]
["DREV0112","Revenue from public lighting charges",0,0,0,0,0,0,0,0,0,0,0,0,null,2350295,2716190.92,3097878.3499999996,3263260.7949999999,3981484.36,4706722.144999994,4627689.144999994,4464682.8600000096,4433526.6250000093,4163425.335,3829917.5,3499417.2178637614]
["DREV0113","Revenue from other Sources",0,0,0,0,0,0,0,0,0,0,0,0,null,2262501.5750000002,2350656.2599999998,2232023.7599999998,2248656.8250000002,2813920.8549999828,3368521.4949999796,4207409.9549999945,5007445.1150000012,5481455.0000000037,5198327.0950000007,5298240.5,6590718.9249999998]
["DREV01","Total revenue by chargeable quantity",{"$f":"SUM(C12:C24)","v":203314503.6197536},{"$f":"SUM(D12:D24)","v":205206060.98288119},206772301.73017943,213005810.12116185,208240781.66748267,207863263.26108706,225119234.56640804,244575803.04805809,{"$f":"SUM(K12:K24)","v":271073247.60055804},283482794.58785516,{"$f":"SUM(M12:M24)","v":278918760},284565816.21021068,null,{"$f":"SUM(P12:P24)","v":7965123.3700000001},{"$f":"SUM(Q12:Q24)","v":9398705.8900000006},{"$f":"SUM(R12:R24)","v":10521027.015000001},{"$f":"SUM(S12:S24)","v":10754419.899999999},{"$f":"SUM(T12:T24)","v":11850102.304999981},{"$f":"SUM(U12:U24)","v":13076354.769999973},{"$f":"SUM(V12:V24)","v":14000854.884653816},{"$f":"SUM(W12:W24)","v":14155017.635930471},14088881.081555635,29667962.970278993,46106303.5,46310740.232863761]
[]
[null,"3.1.2 - REVENUE GROUPING BY CUSTOMER TYPE OR CLASS"]
[null,null,"STANDARD CONTROL SERVICES",null,null,null,null,null,null,null,null,null,null,null,null,"ALTERNATIVE CONTROL SERVICES"]
[null,null,"REVENUE\n($0's)",null,null,null,null,null,null,null,null,null,null,null,null,"REVENUE\n($0's)"]
[null,null,{"$f":"dms_y1","v":"2006-07"},{"$f":"dms_y2","v":"2007-08"},{"$f":"dms_y3","v":"2008-09"},{"$f":"dms_y4","v":"2009-10"},{"$f":"dms_y5","v":"2010-11"},{"$f":"dms_y6","v":"2011-12"},{"$f":"dms_y7","v":"2012-13"},{"$f":"dms_y8","v":"2013-14"},{"$f":"dms_y9","v":"2014-15"},{"$f":"dms_y10","v":"2015-16"},{"$f":"dms_y11","v":"2016-17"},{"$f":"dms_y12","v":"2017-18"},null,{"$f":"dms_y1","v":"2006-07"},{"$f":"dms_y2","v":"2007-08"},{"$f":"dms_y3","v":"2008-09"},{"$f":"dms_y4","v":"2009-10"},{"$f":"dms_y5","v":"2010-11"},{"$f":"dms_y6","v":"2011-12"},{"$f":"dms_y7","v":"2012-13"},{"$f":"dms_y8","v":"2013-14"},{"$f":"dms_y9","v":"2014-15"},{"$f":"dms_y10","v":"2015-16"},{"$f":"dms_y11","v":"2016-17"},{"$f":"dms_y12","v":"2017-18"}]
["DREV0201","Revenue from residential Customers ",57126498.784800306,56633247.305223644,57429772.472359568,59910585.879268043,58143271.016094193,57148604.144720256,62871514.466816723,68448758.606492072,74336214.562361151,80507995.720144361,81231096.5,80030017.50224787,null,0,0,0,0,0,0,0,0,0,0,0,0]
["DREV0202","Revenue from Non residential customers not on demand tariffs ",82897808,84575925,86335779,89626885,87184497.5,87122908.5,91804340,95413480.080970287,103996559.2467033,103550464.66573301,68931383.5,42837603.248958059,null,0,0,0,0,0,0,0,0,0,0,0,0]
["DREV0203","Revenue from Non-residential low voltage demand tariff customers ",51135686,51905920,51246754,52029370.5,52137851,52852373,58733879,67691650.301478729,77943164.396715879,83683162.095237151,112314503.5,143907807.39736506,null,0,0,0,0,0,0,0,0,0,0,0,0]
["DREV0204","Revenue from Non-residential high voltage demand tariff customers ",10095032.114531085,10297237.253484335,10482362.849554796,10279089.565573957,9613469.1999569256,9556373.0952833015,10439505.196726702,11683443.601647409,13544159.568499157,14416149.5176933,14612463,15594007.621215448,null,0,0,0,0,0,0,0,0,0,0,0,0]
["DREV0205","Revenue from unmetered supplies",2059478.8361305953,1793731.5805672971,1277633.5591907287,1159879.4459111984,1161693.5006100456,1183004.8099926719,1269996.0044931676,1338167.1593377986,1252846.3660326386,1325022.0890476101,1829313,2196380.4404241526,null,2350295,2716190.92,3097878.3499999996,3263260.7949999999,3981484.36,4706722.144999994,4627689.144999994,4464682.8600000096,4433526.6250000093,4163425.335,3829917.5,3499417.2178637614]
["DREV0206","Revenue from Other Customers",0,0,0,0,0,0,0,0,0,0,0,0,null,5614828.3700000001,6682514.9700000007,7423148.6649999991,7491159.1049999995,7868617.9449999835,8369632.6249999795,9373165.739653822,9690334.7759304605,9655354.4565556273,25504537.635278992,42276385.5,42811322.515000001]
["DREV02","Total revenue by customer class",{"$f":"SUM(C31:C36)","v":203314503.73546198},{"$f":"SUM(D31:D36)","v":205206061.13927528},206772301.8811051,213005810.39075321,208240782.21666119,207863263.54999623,225119234.66803661,244575499.74992627,{"$f":"SUM(K31:K36)","v":271072944.14031214},283482794.0878554,278918759.5,284565816.21021056,null,{"$f":"SUM(P31:P36)","v":7965123.3700000001},{"$f":"SUM(Q31:Q36)","v":9398705.8900000006},{"$f":"SUM(R31:R36)","v":10521027.014999999},{"$f":"SUM(S31:S36)","v":10754419.899999999},{"$f":"SUM(T31:T36)","v":11850102.304999983},{"$f":"SUM(U31:U36)","v":13076354.769999973},{"$f":"SUM(V31:V36)","v":14000854.884653816},{"$f":"SUM(W31:W36)","v":14155017.635930471},14088881.081555637,29667962.970278993,46106303,46310739.732863761]
[]
[null,"3.1.3 - REVENUE (penalties) ALLOWED (deducted) THROUGH INCENTIVE SCHEMES"]
[null,null,"STANDARD CONTROL SERVICES",null,null,null,null,null,null,null,null,null,null,null,null,"ALTERNATIVE CONTROL SERVICES"]
[null,null,"REVENUE\n($0's)",null,null,null,null,null,null,null,null,null,null,null,null,"REVENUE\n($0's)"]
[null,null,{"$f":"dms_y1","v":"2006-07"},{"$f":"dms_y2","v":"2007-08"},{"$f":"dms_y3","v":"2008-09"},{"$f":"dms_y4","v":"2009-10"},{"$f":"dms_y5","v":"2010-11"},{"$f":"dms_y6","v":"2011-12"},{"$f":"dms_y7","v":"2012-13"},{"$f":"dms_y8","v":"2013-14"},{"$f":"dms_y9","v":"2014-15"},{"$f":"dms_y10","v":"2015-16"},{"$f":"dms_y11","v":"2016-17"},{"$f":"dms_y12","v":"2017-18"},null,{"$f":"dms_y1","v":"2006-07"},{"$f":"dms_y2","v":"2007-08"},{"$f":"dms_y3","v":"2008-09"},{"$f":"dms_y4","v":"2009-10"},{"$f":"dms_y5","v":"2010-11"},{"$f":"dms_y6","v":"2011-12"},{"$f":"dms_y7","v":"2012-13"},{"$f":"dms_y8","v":"2013-14"},{"$f":"dms_y9","v":"2014-15"},{"$f":"dms_y10","v":"2015-16"},{"$f":"dms_y11","v":"2016-17"},{"$f":"dms_y12","v":"2017-18"}]
["DREV0301","EBSS",3525485.0355130411,3627037.4686145624,3751670.0001482479,3867070.4923090674,521166.48949338892,-2899112.2019666675,-2978804.4183921162,-3040678.0247634789,-3108646.7763736169,-1898155.2763736169,-655376,-665103.89211711334,null,0,0,0,0,0,0,0,0,0,0,0,0]
["DREV0302","STPIS",2676111.441114828,1489702.3919795305,-1117968.991162464,-652712.27449586987,-948408.64695418114,-2922354.0966084991,-1856129.005808373,-713680.67881215899,-147925.40575627598,-1598508.9057562761,-3033718.5,169011.9875139643,null,0,0,0,0,0,0,0,0,0,0,0,0]
["DREV0303","F-Factor ",0,0,0,0,0,0,0,5000,-27500,-40000,197500,275000,null,0,0,0,0,0,0,0,0,0,0,0,0]
["DREV0304","S-Factor True up",6201596.4766278695,5116739.8605940938,2633701.0089857839,3214358.2178131975,-427242.15746079246,-5821466.2985751666,-4834933.4242004883,-3422858.7035756381,-3133750.520965904,-1416766.0209659038,337699.5,342711.88939902134,null,0,0,0,0,0,0,0,0,0,0,0,0]
["DREV0305","Other",0,0,0,0,0,0,0,0,0,-146442.5,-294394,-298763.69981638563,null,0,0,0,0,0,0,0,0,0,0,0,0]
["DREV03","Total revenue of incentive schemes",{"$f":"SUM(C43:C47)","v":12403192.953255739},{"$f":"SUM(D43:D47)","v":10233479.721188188},5267402.0179715678,6428716.435626395,-854484.31492158468,-11642932.597150333,-9669866.8484009765,-7172217.4071512762,{"$f":"SUM(K43:K47)","v":-6417822.7030957974},-5099872.7030957965,-3448289,-177143.71502051334,null,{"$f":"SUM(P43:P47)","v":0},{"$f":"SUM(Q43:Q47)","v":0},{"$f":"SUM(R43:R47)","v":0},{"$f":"SUM(S43:S47)","v":0},{"$f":"SUM(T43:T47)","v":0},{"$f":"SUM(U43:U47)","v":0},{"$f":"SUM(V43:V47)","v":0},{"$f":"SUM(W43:W47)","v":0},0,0,0,0]

{"sheet":"3.2 Operating expenditure","index":8,"n_rows":196,"n_cols":28,"rows_kept":196,"cut":false,"hidden":false,"merged":[[61,3,61,14],[61,16,61,27],[181,3,181,14],[181,16,181,27],[108,3,108,14],[108,16,108,27],[159,3,159,14],[159,16,159,27],[170,3,170,14],[170,16,170,27],[8,1,8,3],[194,3,194,14],[13,3,13,14],[13,16,13,27],[182,3,182,14],[182,16,182,27],[109,3,109,14],[109,16,109,27],[160,3,160,14],[160,16,160,27],[171,3,171,14],[171,16,171,27],[12,3,12,14],[12,16,12,27],[60,3,60,14],[60,16,60,27]]}
[null,{"$f":"INDEX(dms_Worksheet_List,MATCH(dms_Model,dms_Model_List))","v":"HISTORICAL ECONOMIC BENCHMARKING - FINANCIAL YEARS"}]
[null,{"$f":"INDEX(dms_TradingNameFull_List,MATCH(dms_TradingName,dms_TradingName_List))","v":"CitiPower"}]
[null,{"$f":"dms_Header_Span","v":"2006-07 to 2018-19"}]
[null,"3.2 OPERATING EXPENDITURE"]
[]
[null,"There are THREE tables on this worksheet. Each has been grouped for ease of navigation. see the Instructions sheet on how to group or ungroup tables. "]
[]
[null,"Instructions"]
[null,"Please list current opex categories in tables 3.2.1 and 3.2.2 and provide opex data as required. Where opex categories have changed at any time during the regulatory period, list previous opex categories in the 'Historical' sub-table and provide opex data as required."]
[]
[null,"3.2.1 - OPEX CATEGORIES"]
[null,"CURRENT OPEX CATEGORIES AND COST ALLOCATIONS"]
[null,null,null,"STANDARD CONTROL SERVICES",null,null,null,null,null,null,null,null,null,null,null,null,"ALTERNATIVE CONTROL SERVICES"]
[null,null,null,"EXPENDITURE\n($0's)",null,null,null,null,null,null,null,null,null,null,null,null,"EXPENDITURE\n($0's)"]
[null,null,null,{"$f":"dms_y1","v":"2006-07"},{"$f":"dms_y2","v":"2007-08"},{"$f":"dms_y3","v":"2008-09"},{"$f":"dms_y4","v":"2009-10"},{"$f":"dms_y5","v":"2010-11"},{"$f":"dms_y6","v":"2011-12"},{"$f":"dms_y7","v":"2012-13"},{"$f":"dms_y8","v":"2013-14"},{"$f":"dms_y9","v":"2014-15"},{"$f":"dms_y10","v":"2015-16"},{"$f":"dms_y11","v":"2016-17"},{"$f":"dms_y12","v":"2017-18"},null,{"$f":"dms_y1","v":"2006-07"},{"$f":"dms_y2","v":"2007-08"},{"$f":"dms_y3","v":"2008-09"},{"$f":"dms_y4","v":"2009-10"},{"$f":"dms_y5","v":"2010-11"},{"$f":"dms_y6","v":"2011-12"},{"$f":"dms_y7","v":"2012-13"},{"$f":"dms_y8","v":"2013-14"},{"$f":"dms_y9","v":"2014-15"},{"$f":"dms_y10","v":"2015-16"},{"$f":"dms_y11","v":"2016-17"},{"$f":"dms_y12","v":"2017-18"}]
["DOPEX0101","Maintenance",null,7425186.1074960623,8477369.6646623053,9955087.3099570572,13560220.789269876,14802871.278550081,16879130.158406295,19191647.716619417,18465732.046543811,17161774.913488161,16502581.716923017,20467185.243673149,21660237.93252233,null,0,0,0,0,0,0,0,0,0,0,0,0]
["DOPEX0102","Vegetation Management",null,1446061.6827171533,1650975.3782361238,1938762.2207205822,2640865.2131630252,2882872.5152754565,3287225.8023304772,3737590.6798069715,3596217.9491867195,3342271.1229766817,3213892.6541732727,1727689,-100751.45588981043,null,0,0,0,0,0,0,0,0,0,0,0,0]
["DOPEX0103","Emergency",null,2563268.0946754338,3380328.9041353343,3697361.8958418826,3556770.1169323158,4044386.03215465,4769477.5477892887,4978736.2334372252,5387390.3602022361,5148094.5774293551,4805255.1328750551,5493573.4627919998,6326234.3777920008,null,0,0,0,0,0,0,0,0,0,0,0,0]
["DOPEX0104","Overheads",null,18533716.297514193,18892192.335913431,20040893.416856535,21868688.945535742,21326412.40025555,23412872.489693411,26789322.041109625,28310600.837443899,30845990.52666039,40917304.264938504,47127209.5,44607683.363949388,null,0,0,0,0,0,0,0,0,0,0,0,0]
["DOPEX0105","Public Lighting",null,0,0,0,0,0,0,0,0,0,0,0,0,null,2863086.2314151265,2959979.7503465861,3243271.1561534777,3970996.289525684,3556288.5432503717,3066064.2392269094,3695519.4156470061,3368137.2173153572,2742033.8178963987,2399572.5909339599,2773292.5,2285089.1168989772]
["DOPEX0106","Connection Services",null,0,0,0,0,0,0,0,0,0,0,0,0,null,3567891.471138082,3756008.9385029618,3563150.6607501698,3512512.6060727667,2560787.4702615524,1350555.9517938388,2637099.0620780261,4316703.77701566,4781716.4377763569,5746642.0224262904,6437211.5,7926393.9188743588]
["DOPEX0107","Metering Services",null,0,0,0,0,0,0,0,0,0,0,0,0,null,3162872.1038886923,3329634.8808945687,3158669.4601011639,3113779.7284963904,3210509.5163375335,3234066.2514168643,3248160.3437316297,3149965.961099749,3121258.606016512,4467376.5214367649,6648383,7234884.9249519948]
["DOPEX0108","Ancillary Network Services",null,0,0,0,0,0,0,0,0,0,0,0,0,null,3054205.0132535864,3215238.3060412491,3050146.7600890002,3006799.3091622489,4279389.5164792379,5302628.4454703834,5494246.2885448746,5428337.1135783121,4874512.5884372583,5144978.7366244756,5303807.5,5824018.4472761499]
["DOPEX0109"]
["DOPEX0110"]
["DOPEX0111"]
["DOPEX0112"]
["DOPEX0113"]
["DOPEX0114"]
["DOPEX0115"]
["DOPEX0116"]
["DOPEX0117"]
["DOPEX0118"]
["DOPEX0119"]
["DOPEX0120"]
["DOPEX0121"]
["DOPEX0122"]
["DOPEX0123"]
["DOPEX0124"]
["DOPEX0125"]
["DOPEX0126"]
["DOPEX0127"]
["DOPEX0128"]
["DOPEX0129"]
["DOPEX0130"]
["DOPEX0131"]
["DOPEX0132"]
["DOPEX0133"]
["DOPEX0134"]
["DOPEX0135"]
["DOPEX0136"]
["DOPEX0137"]
["DOPEX0138"]
["DOPEX0139"]
["DOPEX0140"]
["DOPEX0141"]
["DOPEX0142"]
["DOPEX01","Total opex ",null,{"$f":"SUM(D16:D57)","v":29968232.182402842},32400866.282947194,35632104.843376055,41626545.064900957,43056542.226235732,48348705.998219475,54697296.670973241,55759941.19337666,{"$f":"SUM(L16:L57)","v":56498131.140554592},65439033.768909849,74815657.206465155,72493404.21837391,null,{"$f":"SUM(Q16:Q57)","v":12648054.819695488},{"$f":"SUM(R16:R57)","v":13260861.875785366},{"$f":"SUM(S16:S57)","v":13015238.037093813},{"$f":"SUM(T16:T57)","v":13604087.933257088},{"$f":"SUM(U16:U57)","v":13606975.046328697},{"$f":"SUM(V16:V57)","v":12953314.887907995},{"$f":"SUM(W16:W57)","v":15075025.110001538},{"$f":"SUM(X16:X57)","v":16263144.069009079},{"$f":"SUM(Y16:Y57)","v":15519521.450126525},17758569.87142149,21162694.5,23270386.408001479]
[]
[null,"A: HISTORICAL OPEX CATEGORIES AND COST ALLOCATIONS"]
[null,null,null,"STANDARD CONTROL SERVICES",null,null,null,null,null,null,null,null,null,null,null,null,"ALTERNATIVE CONTROL SERVICES"]
[null,null,null,"EXPENDITURE\n($0's)",null,null,null,null,null,null,null,null,null,null,null,null,"EXPENDITURE\n($0's)"]
[null,null,null,{"$f":"dms_y1","v":"2006-07"},{"$f":"dms_y2","v":"2007-08"},{"$f":"dms_y3","v":"2008-09"},{"$f":"dms_y4","v":"2009-10"},{"$f":"dms_y5","v":"2010-11"},{"$f":"dms_y6","v":"2011-12"},{"$f":"dms_y7","v":"2012-13"},{"$f":"dms_y8","v":"2013-14"},{"$f":"dms_y9","v":"2014-15"},{"$f":"dms_y10","v":"2015-16"},{"$f":"dms_y11","v":"2016-17"},{"$f":"dms_y12","v":"2017-18"},null,{"$f":"dms_y1","v":"2006-07"},{"$f":"dms_y2","v":"2007-08"},{"$f":"dms_y3","v":"2008-09"},{"$f":"dms_y4","v":"2009-10"},{"$f":"dms_y5","v":"2010-11"},{"$f":"dms_y6","v":"2011-12"},{"$f":"dms_y7","v":"2012-13"},{"$f":"dms_y8","v":"2013-14"},{"$f":"dms_y9","v":"2014-15"},{"$f":"dms_y10","v":"2015-16"},{"$f":"dms_y11","v":"2016-17"},{"$f":"dms_y12","v":"2017-18"}]
["DOPEX0101"]
["DOPEX0102"]
["DOPEX0103"]
["DOPEX0104"]
["DOPEX0105"]
["DOPEX0106"]
["DOPEX0107"]
["DOPEX0108"]
["DOPEX0109"]
["DOPEX0110"]
["DOPEX0111"]
["DOPEX0112"]
["DOPEX0113"]
["DOPEX0114"]
["DOPEX0115"]
["DOPEX0116"]
["DOPEX0117"]
["DOPEX0118"]
["DOPEX0119"]
["DOPEX0120"]
["DOPEX0121"]
["DOPEX0122"]
["DOPEX0123"]
["DOPEX0124"]
["DOPEX0125"]
["DOPEX0126"]
["DOPEX0127"]
["DOPEX0128"]
["DOPEX0129"]
["DOPEX0130"]
["DOPEX0131"]
["DOPEX0132"]
["DOPEX0133"]
["DOPEX0134"]
["DOPEX0135"]
["DOPEX0136"]
["DOPEX0137"]
["DOPEX0138"]
["DOPEX0139"]
["DOPEX0140"]
["DOPEX0141"]
["DOPEX0142"]
["DOPEX01","Total opex ",null,{"$f":"SUM(D64:D105)","v":0},0,0,0,0,0,0,0,{"$f":"SUM(L64:L105)","v":0},0,0,0,null,{"$f":"SUM(Q64:Q105)","v":0},0,0,0,0,0,0,0,0,0,0,0]
[]
[null,"B: HISTORICAL OPEX CATEGORIES AND COST ALLOCATIONS"]
[null,null,null,"STANDARD CONTROL SERVICES",null,null,null,null,null,null,null,null,null,null,null,null,"ALTERNATIVE CONTROL SERVICES"]
[null,null,null,"EXPENDITURE\n($0's)",null,null,null,null,null,null,null,null,null,null,null,null,"EXPENDITURE\n($0's)"]
[null,null,null,{"$f":"dms_y1","v":"2006-07"},{"$f":"dms_y2","v":"2007-08"},{"$f":"dms_y3","v":"2008-09"},{"$f":"dms_y4","v":"2009-10"},{"$f":"dms_y5","v":"2010-11"},{"$f":"dms_y6","v":"2011-12"},{"$f":"dms_y7","v":"2012-13"},{"$f":"dms_y8","v":"2013-14"},{"$f":"dms_y9","v":"2014-15"},{"$f":"dms_y10","v":"2015-16"},{"$f":"dms_y11","v":"2016-17"},{"$f":"dms_y12","v":"2017-18"},null,{"$f":"dms_y1","v":"2006-07"},{"$f":"dms_y2","v":"2007-08"},{"$f":"dms_y3","v":"2008-09"},{"$f":"dms_y4","v":"2009-10"},{"$f":"dms_y5","v":"2010-11"},{"$f":"dms_y6","v":"2011-12"},{"$f":"dms_y7","v":"2012-13"},{"$f":"dms_y8","v":"2013-14"},{"$f":"dms_y9","v":"2014-15"},{"$f":"dms_y10","v":"2015-16"},{"$f":"dms_y11","v":"2016-17"},{"$f":"dms_y12","v":"2017-18"}]
["DOPEX0101"]
["DOPEX0102"]
["DOPEX0103"]
["DOPEX0104"]
["DOPEX0105"]
["DOPEX0106"]
["DOPEX0107"]
["DOPEX0108"]
["DOPEX0109"]
["DOPEX0110"]
["DOPEX0111"]
["DOPEX0112"]
["DOPEX0113"]
["DOPEX0114"]
["DOPEX0115"]
["DOPEX0116"]
["DOPEX0117"]
["DOPEX0118"]
["DOPEX0119"]
["DOPEX0120"]
["DOPEX0121"]
["DOPEX0122"]
["DOPEX0123"]
["DOPEX0124"]
["DOPEX0125"]
["DOPEX0126"]
["DOPEX0127"]
["DOPEX0128"]
["DOPEX0129"]
["DOPEX0130"]
["DOPEX0131"]
["DOPEX0132"]
["DOPEX0133"]
["DOPEX0134"]
["DOPEX0135"]
["DOPEX0136"]
["DOPEX0137"]
["DOPEX0138"]
["DOPEX0139"]
["DOPEX0140"]
["DOPEX0141"]
["DOPEX0142"]
["DOPEX01","Total opex ",null,{"$f":"SUM(D112:D153)","v":0},0,0,0,0,0,0,0,{"$f":"SUM(L112:L153)","v":0},0,0,0,null,{"$f":"SUM(Q112:Q153)","v":0},0,0,0,0,0,0,0,0,0,0,0]
[]
[]
[]
[null,"3.2.2 - OPEX CONSISTENCY"]
[null," OPEX CONSISTENCY - CURRENT COST ALLOCATION APPROACH"]
[null,null,null,"STANDARD CONTROL SERVICES",null,null,null,null,null,null,null,null,null,null,null,null,"ALTERNATIVE CONTROL SERVICES"]
[null,null,null,"EXPENDITURE\n($0's)",null,null,null,null,null,null,null,null,null,null,null,null,"EXPENDITURE\n($0's)"]
[null,null,null,{"$f":"dms_y1","v":"2006-07"},{"$f":"dms_y2","v":"2007-08"},{"$f":"dms_y3","v":"2008-09"},{"$f":"dms_y4","v":"2009-10"},{"$f":"dms_y5","v":"2010-11"},{"$f":"dms_y6","v":"2011-12"},{"$f":"dms_y7","v":"2012-13"},{"$f":"dms_y8","v":"2013-14"},{"$f":"dms_y9","v":"2014-15"},{"$f":"dms_y10","v":"2015-16"},{"$f":"dms_y11","v":"2016-17"},{"$f":"dms_y12","v":"2017-18"},null,{"$f":"dms_y1","v":"2006-07"},{"$f":"dms_y2","v":"2007-08"},{"$f":"dms_y3","v":"2008-09"},{"$f":"dms_y4","v":"2009-10"},{"$f":"dms_y5","v":"2010-11"},{"$f":"dms_y6","v":"2011-12"},{"$f":"dms_y7","v":"2012-13"},{"$f":"dms_y8","v":"2013-14"},{"$f":"dms_y9","v":"2014-15"},{"$f":"dms_y10","v":"2015-16"},{"$f":"dms_y11","v":"2016-17"},{"$f":"dms_y12","v":"2017-18"}]
["DOPEX0201","Opex for network services",null,26797848.5,28873787.5,31721165,36819464,37796733.5,42438380,48302207,49485402.639046311,53232110.139046267,65255098.999999955,74632113.006465137,71143891.229810625,null,0,0,0,0,0,0,0,0,0,0,0,0]
["DOPEX0202","Opex for metering",null,0,0,0,0,0,0,0,0,0,0,0,0,null,{"$f":"Q22","v":3162872.1038886923},{"$f":"R22","v":3329634.8808945687},3158669.4601011639,3113779.7284963904,3210509.5163375335,3234066.2514168643,3248160.3437316297,3149965.961099749,3121258.606016512,4467376.5214367649,6648383,7234884.9249519948]
["DOPEX0203","Opex for connection services",null,3005745.2842774913,3359803.2602374563,3756610.7836907143,4657299.5112196077,5064208.1835144181,5708748.5288624335,6238128.3509667963,6112541.2221207554,3093243.7325984258,0,0,1173834.4875632764,null,{"$f":"Q21","v":3567891.471138082},{"$f":"R21","v":3756008.9385029618},3563150.6607501698,3512512.6060727667,2560787.4702615524,1350555.9517938388,2637099.0620780261,4316703.77701566,4781716.4377763569,5746642.0224262904,6437211.5,7926393.9188743588]
["DOPEX0204","Opex for public lighting",null,0,0,0,0,0,0,0,0,0,0,0,0,null,{"$f":"Q20","v":2863086.2314151265},{"$f":"R20","v":2959979.7503465861},3243271.1561534777,3970996.289525684,3556288.5432503717,3066064.2392269094,3695519.4156470061,3368137.2173153572,2742033.8178963987,2399572.5909339599,2773292.5,2285089.1168989772]
["DOPEX0205","Opex for amounts payable for easement levy or similar direct charges on DNSP",null,0,0,0,0,0,0,0,0,0,0,0,0,null,0,0,0,0,0,0,0,0,0,0,0,0]
["DOPEX0206","Opex for transmission connection point planning",null,164638.25416666665,167275.56249999997,154329.27499999997,149781.58749999997,195600.44999999998,201577.57499999998,156961.65416666665,161997.45416666666,172777.5,183935,183544.2,175678.50099999999,null,0,0,0,0,0,0,0,0,0,0,0,0]
[]
[null,"OPEX CONSISTENCY - A: HISTORICAL COST ALLOCATION APPROACH"]
[null,null,null,"STANDARD CONTROL SERVICES",null,null,null,null,null,null,null,null,null,null,null,null,"ALTERNATIVE CONTROL SERVICES"]
[null,null,null,"EXPENDITURE\n($0's)",null,null,null,null,null,null,null,null,null,null,null,null,"EXPENDITURE\n($0's)"]
[null,null,null,{"$f":"dms_y1","v":"2006-07"},{"$f":"dms_y2","v":"2007-08"},{"$f":"dms_y3","v":"2008-09"},{"$f":"dms_y4","v":"2009-10"},{"$f":"dms_y5","v":"2010-11"},{"$f":"dms_y6","v":"2011-12"},{"$f":"dms_y7","v":"2012-13"},{"$f":"dms_y8","v":"2013-14"},{"$f":"dms_y9","v":"2014-15"},{"$f":"dms_y10","v":"2015-16"},{"$f":"dms_y11","v":"2016-17"},{"$f":"dms_y12","v":"2017-18"},null,{"$f":"dms_y1","v":"2006-07"},{"$f":"dms_y2","v":"2007-08"},{"$f":"dms_y3","v":"2008-09"},{"$f":"dms_y4","v":"2009-10"},{"$f":"dms_y5","v":"2010-11"},{"$f":"dms_y6","v":"2011-12"},{"$f":"dms_y7","v":"2012-13"},{"$f":"dms_y8","v":"2013-14"},{"$f":"dms_y9","v":"2014-15"},{"$f":"dms_y10","v":"2015-16"},{"$f":"dms_y11","v":"2016-17"},{"$f":"dms_y12","v":"2017-18"}]
["DOPEX0201","Opex for network services"]
["DOPEX0202","Opex for metering"]
["DOPEX0203","Opex for connection services"]
["DOPEX0204","Opex for public lighting"]
["DOPEX0205","Opex for amounts payable for easement levy or similar direct charges on DNSP"]
["DOPEX0206","Opex for transmission connection point planning"]
[]
[null,"OPEX CONSISTENCY - B: HISTORICAL COST ALLOCATION APPROACH"]
[null,null,null,"STANDARD CONTROL SERVICES",null,null,null,null,null,null,null,null,null,null,null,null,"ALTERNATIVE CONTROL SERVICES"]
[null,null,null,"EXPENDITURE\n($0's)",null,null,null,null,null,null,null,null,null,null,null,null,"EXPENDITURE\n($0's)"]
[null,null,null,{"$f":"dms_y1","v":"2006-07"},{"$f":"dms_y2","v":"2007-08"},{"$f":"dms_y3","v":"2008-09"},{"$f":"dms_y4","v":"2009-10"},{"$f":"dms_y5","v":"2010-11"},{"$f":"dms_y6","v":"2011-12"},{"$f":"dms_y7","v":"2012-13"},{"$f":"dms_y8","v":"2013-14"},{"$f":"dms_y9","v":"2014-15"},{"$f":"dms_y10","v":"2015-16"},{"$f":"dms_y11","v":"2016-17"},{"$f":"dms_y12","v":"2017-18"},null,{"$f":"dms_y1","v":"2006-07"},{"$f":"dms_y2","v":"2007-08"},{"$f":"dms_y3","v":"2008-09"},{"$f":"dms_y4","v":"2009-10"},{"$f":"dms_y5","v":"2010-11"},{"$f":"dms_y6","v":"2011-12"},{"$f":"dms_y7","v":"2012-13"},{"$f":"dms_y8","v":"2013-14"},{"$f":"dms_y9","v":"2014-15"},{"$f":"dms_y10","v":"2015-16"},{"$f":"dms_y11","v":"2016-17"},{"$f":"dms_y12","v":"2017-18"}]
["DOPEX0201","Opex for network services"]
["DOPEX0202","Opex for metering"]
["DOPEX0203","Opex for connection services"]
["DOPEX0204","Opex for public lighting"]
["DOPEX0205","Opex for amounts payable for easement levy or similar direct charges on DNSP"]
["DOPEX0206","Opex for transmission connection point planning"]
[]
[]
[]
[null,"3.2.4 - OPEX FOR HIGH VOLTAGE CUSTOMERS"]
[null,null,null,"End user costs (not standard control services)"]
["DOPEX0401","Opex for high voltage customers",null,126222.81860659289,131756.33177562046,141414.43530558213,140747.73473269623,132488.90415967911,128656.75575475037,132639.35836608952,138768.5793169862,104538.94578547083,62472,67365.89,76075.682532578998]

{"sheet":"3.2.3 Provisions","index":9,"n_rows":371,"n_cols":14,"rows_kept":371,"cut":false,"hidden":false,"merged":[[9,2,9,13]]}
[null,{"$f":"INDEX(dms_Worksheet_List,MATCH(dms_Model,dms_Model_List))","v":"HISTORICAL ECONOMIC BENCHMARKING - FINANCIAL YEARS"}]
[null,{"$f":"INDEX(dms_TradingNameFull_List,MATCH(dms_TradingName,dms_TradingName_List))","v":"CitiPower"}]
[null,{"$f":"dms_Header_Span","v":"2006-07 to 2018-19"}]
[null,"3.2 OPERATING EXPENDITURE"]
[]
[null,"There is ONE table on this worksheet. Each Provision has been grouped for ease of navigation. see the Instructions sheet on how to group or ungroup tables. "]
[]
[null,"3.2.3 - PROVISIONS"]
[null,"For each provision report:"]
[null,null,"$0's"]
[null,null,{"$f":"dms_y1","v":"2006-07"},{"$f":"dms_y2","v":"2007-08"},{"$f":"dms_y3","v":"2008-09"},{"$f":"dms_y4","v":"2009-10"},{"$f":"dms_y5","v":"2010-11"},{"$f":"dms_y6","v":"2011-12"},{"$f":"dms_y7","v":"2012-13"},{"$f":"dms_y8","v":"2013-14"},{"$f":"dms_y9","v":"2014-15"},{"$f":"dms_y10","v":"2015-16"},{"$f":"dms_y11","v":"2016-17"},{"$f":"dms_y12","v":"2017-18"}]
["DOPEX03A","Provision for Accident Compensation"]
[null,"<Brief description of provision>"]
["DOPEX0301A","Opening balance (the carrying amount at the beginning of the period)",-54500,0,0,0,0,0,0,0,0,0,0,0]
[null,"Additional provisions made in the period, including increases to existing provisions"]
["DOPEX0302A","Opex component",0,0,0,0,0,0,0,0,0,0,0,0]
["DOPEX0303A","Capex component",0,0,0,0,0,0,0,0,0,0,0,0]
["DOPEX0304A","Other component",0,0,0,0,0,0,0,0,0,0,0,0]
[null,"Amounts used (that is, incurred and charged against the provision) during the period"]
["DOPEX0305A","Opex component",31500,0,0,0,0,0,0,0,0,0,0,0]
["DOPEX0306A","Capex component",0,0,0,0,0,0,0,0,0,0,0,0]
["DOPEX0307A","Other component",0,0,0,0,0,0,0,0,0,0,0,0]
[null,"Unused amounts reversed during the period"]
["DOPEX0308A","Opex component",23000,0,0,0,0,0,0,0,0,0,0,0]
["DOPEX0309A","Capex component",0,0,0,0,0,0,0,0,0,0,0,0]
["DOPEX0310A","Other component",0,0,0,0,0,0,0,0,0,0,0,0]
[null,"The increase during the period in the discounted amount arising from the passage of time and the effect of any change in the discount rate"]
["DOPEX0311A","Opex component",0,0,0,0,0,0,0,0,0,0,0,0]
["DOPEX0312A","Capex component",0,0,0,0,0,0,0,0,0,0,0,0]
["DOPEX0313A","Other component",0,0,0,0,0,0,0,0,0,0,0,0]
["DOPEX0314A","Closing balance (carrying amount at the end of the period)",0,0,0,0,0,0,0,0,0,0,0,0]
["DOPEX03B","Provision for Customer Refunds"]
[null,"<Brief description of provision>"]
["DOPEX0301B","Opening balance (the carrying amount at the beginning of the period)",0,-727009.81499999994,-790031.04,-63042.450000000143,-42.450000000144428,-42.450000000144428,-42.450000000144428,-42.450000000144428,-41.225000000072214,-41,-105042,-295021]
[null,"Additional provisions made in the period, including increases to existing provisions"]
["DOPEX0302B","Opex component",-727009.81499999994,-727009.81499999994,0,0,0,0,0,0,0,-105000,-535000,-430000]
["DOPEX0303B","Capex component",0,0,0,0,0,0,0,0,0,0,0,0]
["DOPEX0304B","Other component",0,0,0,0,0,0,0,0,0,0,0,0]
[null,"Amounts used (that is, incurred and charged against the provision) during the period"]
["DOPEX0305B","Opex component",0,663988.58999999985,726988.58999999985,63000,0,0,0,0,0,0,0,0]
["DOPEX0306B","Capex component",0,0,0,0,0,0,0,0,0,0,0,0]
["DOPEX0307B","Other component",0,0,0,0,0,0,0,0,0,0,0,0]
[null,"Unused amounts reversed during the period"]
["DOPEX0308B","Opex component",0,0,0,0,0,0,0,0,0,0,345000,535000]
["DOPEX0309B","Capex component",0,0,0,0,0,0,0,0,0,0,0,0]
["DOPEX0310B","Other component",0,0,0,0,0,0,0,0,0,0,0,0]
[null,"The increase during the period in the discounted amount arising from the passage of time and the effect of any change in the discount rate"]
["DOPEX0311B","Opex component",0,0,0,0,0,0,0,0,0,0,0,0]
["DOPEX0312B","Capex component",0,0,0,0,0,0,0,0,0,0,0,0]
["DOPEX0313B","Other component",0,0,0,0,0,0,0,0,0,0,0,0]
["DOPEX0314B","Closing balance (carrying amount at the end of the period)",-727009.81499999994,-790031.04,-63042.450000000143,-42.450000000144428,-42.450000000144428,-42.450000000144428,-42.450000000144428,-42.450000000144428,-41.225000000072214,-41,-190042,-190021]
["DOPEX03C","Provision for Uninsured Losses"]
[null,"<Brief description of provision>"]
["DOPEX0301C","Opening balance (the carrying amount at the beginning of the period)",-345950.40500000003,-329444.71000000002,-326829.53000000003,-292670.45000000007,-283170.45000000007,-170110.69500000007,-151798.60000000006,-205485.53500000009,-431687.40500000003,-641610,-494187,-380455.40500000014]
[null,"Additional provisions made in the period, including increases to existing provisions"]
["DOPEX0302C","Opex component",-128382.375,-464202.07999999996,-417778.47499999998,-98000,-99456.434999999998,-86704.095000000001,-76256.900000000009,-248772.51500000001,-584266.27500000002,-403445,-67626.5,-20684.5]
["DOPEX0303C","Capex component",0,0,0,0,0,0,0,0,0,0,0,0]
["DOPEX0304C","Other component",0,0,0,0,0,0,0,0,0,0,0,0]
[null,"Amounts used (that is, incurred and charged against the provision) during the period"]
["DOPEX0305C","Opex component",0,185000,185000,0,0,0,0,0,0,0,0,0]
["DOPEX0306C","Capex component",0,0,0,0,0,0,0,0,0,0,0,0]
["DOPEX0307C","Other component",0,0,0,0,0,0,0,0,0,0,0,0]
[null,"Unused amounts reversed during the period"]
["DOPEX0308C","Opex component",144888.07,281817.26,266937.55499999999,107500,212516.19,105016.19,22569.965,22569.965,374343.5,550868.5,181358,4833]
["DOPEX0309C","Capex component",0,0,0,0,0,0,0,0,0,0,0,0]
["DOPEX0310C","Other component",0,0,0,0,0,0,0,0,0,0,0,0]
[null,"The increase during the period in the discounted amount arising from the passage of time and the effect of any change in the discount rate"]
["DOPEX0311C","Opex component",0,0,0,0,0,0,0,0,0,0,0,0]
["DOPEX0312C","Capex component",0,0,0,0,0,0,0,0,0,0,0,0]
["DOPEX0313C","Other component",0,0,0,0,0,0,0,0,0,0,0,0]
["DOPEX0314C","Closing balance (carrying amount at the end of the period)",-329444.71000000002,-326829.53000000003,-292670.45000000007,-283170.45000000007,-170110.69500000007,-151798.60000000006,-205485.53500000009,-431688.08500000008,-641610.68000000005,-494187,-380455.5,-396306.90500000014]
["DOPEX03D","Provision for Employee Entitlements"]
[null,"<Brief description of provision>"]
["DOPEX0301D","Opening balance (the carrying amount at the beginning of the period)",-10632091.145,-10611288.885,-11844722.699999999,-12906740.385000002,-12744124.965000002,-12807144.445,-13021188.865,-13113860.595000003,-12217568.135000002,-11252717,-10809577,-10038260.415000003]
[null,"Additional provisions made in the period, including increases to existing provisions"]
["DOPEX0302D","Opex component",-876155.80205547262,-2174782.7389366925,-2331838.6755117895,-1765126.64011476,-1836152.8060681601,-1563091.8355370066,-1749604.5086283176,-1623223.214131631,-1276198.19415565,-1288958.5768008847,-895764.57680088456,-792351.50943174516]
["DOPEX0303D","Capex component",-388616.68794452725,-459983.44956330897,-836041.79798821104,-1505643.4998852403,-1681751.2739318395,-1403181.3644629922,-1458113.9013716825,-1430840.5458683693,-1329448.52584435,-1711911.3931991153,-1509457.3931991153,-1116838.4905682555]
["DOPEX0304D","Other component",0,0,0,0,0,0,0,0,0,0,0,0]
[null,"Amounts used (that is, incurred and charged against the provision) during the period"]
["DOPEX0305D","Opex component",905643.68626227183,1867165.0385985374,1715207.363453269,1346168.8831274034,1508643.916280088,1606583.6834427044,1806014.4242442921,1965846.7970192139,1810094.2915745075,1491495.460710597,1494991.960710597,1344183.8751953433]
["DOPEX0306D","Capex component",379931.06373772817,464972.50640146289,664553.09654673119,1144657.3518725967,1390118.9137199121,1434848.1915572952,1504903.5907557076,1762288.5129807857,1868077.3584254922,1946809.4692894029,1979438.4692894029,1618357.5498046568]
["DOPEX0307D","Other component",0,0,0,0,0,0,0,0,0,0,0,0]
[null,"Unused amounts reversed during the period"]
["DOPEX0308D","Opex component",0,0,0,0,0,0,0,0,0,0,0,0]
["DOPEX0309D","Capex component",0,0,0,0,0,0,0,0,0,0,0,0]
["DOPEX0310D","Other component",0,0,0,0,0,0,0,0,0,0,0,0]
[null,"The increase during the period in the discounted amount arising from the passage of time and the effect of any change in the discount rate"]
["DOPEX0311D","Opex component",0,-930805.17149999994,-273897.67149999994,942559.32499999995,556121.77,-289203.09500000003,-195871.33500000002,222221.04,-107673.66500000001,5705,-297891.5,-170436.10499999998]
["DOPEX0312D","Capex component",0,0,0,0,0,0,0,0,0,0,0,0]
["DOPEX0313D","Other component",0,0,0,0,0,0,0,0,0,0,0,0]
["DOPEX0314D","Closing balance (carrying amount at the end of the period)",-10611288.885,-11844722.699999999,-12906740.385000002,-12744124.965000002,-12807144.445,-13021188.865,-13113860.595000003,-12217568.005000003,-11252716.870000001,-10809577,-10038260.5,-9155345.5950000025]
["DOPEX03E","Provision for Doubtful Debt"]
[null,"<Brief description of provision>"]
["DOPEX0301E","Opening balance (the carrying amount at the beginning of the period)",-670304.5199999999,-821804.5199999999,-1007304.52,-1229304.52,-1201158.02,-1032066.02,-980980.64500000002,-631590.77,-541090.88500000001,-1075267.5,-1506083,-2071855.1749999998]
[null,"Additional provisions made in the period, including increases to existing provisions"]
["DOPEX0302E","Opex component",-151500,-185500,-222000,-79000,0,-10860.124999999996,-10860.124999999996,-298000,-675563,-917605.5,-1214450,-1175952.8149999999]
["DOPEX0303E","Capex component",0,0,0,0,0,0,0,0,0,0,0,0]
["DOPEX0304E","Other component",0,0,0,0,0,0,0,0,0,0,0,0]
[null,"Amounts used (that is, incurred and charged against the provision) during the period"]
["DOPEX0305E","Opex component",0,0,0,107146.5,169091.99999999997,61945.499999999978,360250,388500,28250,0,0,0]
["DOPEX0306E","Capex component",0,0,0,0,0,0,0,0,0,0,0,0]
["DOPEX0307E","Other component",{"$error":"#DIV/0!"},{"$error":"#DIV/0!"},{"$error":"#DIV/0!"},{"$error":"#DIV/0!"},{"$error":"#DIV/0!"},{"$error":"#DIV/0!"},{"$error":"#DIV/0!"},0,0,0,0,0]
[null,"Unused amounts reversed during the period"]
["DOPEX0308E","Opex component",0,0,0,0,0,0,0,0,113136,486789.5,648678,644751.02025000006]
["DOPEX0309E","Capex component",0,0,0,0,0,0,0,0,0,0,0,0]
["DOPEX0310E","Other component",0,0,0,0,0,0,0,0,0,0,0,0]
[null,"The increase during the period in the discounted amount arising from the passage of time and the effect of any change in the discount rate"]
["DOPEX0311E","Opex component",0,0,0,0,0,0,0,0,0,0,0,0]
["DOPEX0312E","Capex component",0,0,0,0,0,0,0,0,0,0,0,0]
["DOPEX0313E","Other component",0,0,0,0,0,0,0,0,0,0,0,0]
["DOPEX0314E","Closing balance (carrying amount at the end of the period)",-821804.5199999999,-1007304.52,-1229304.52,-1201158.02,-1032066.02,-980980.64500000002,-631590.77,-541090.77,-1075267.385,-1506083,-2071855,-2603056.9697500002]
["DOPEX03F","Provision for Environment"]
[null,"<Brief description of provision>"]
["DOPEX0301F","Opening balance (the carrying amount at the beginning of the period)",-444431.77500000002,-571949.43500000006,-713364.69500000007,-556065.07000000007,-1885013.1950000001,-2057312.8200000003,-900035.32000000041,-900035.32000000041,-900035.16000000015,-900035,-1063035,-7967914.6600000001]
[null,"Additional provisions made in the period, including increases to existing provisions"]
["DOPEX0302F","Opex component",-510072.05499999999,-510072.05499999999,0,-1329577.125,-1329577.125,0,0,0,0,-163000,-326000,0]
["DOPEX0303F","Capex component",0,0,0,0,0,0,0,0,0,0,-6741879.5,-8689719]
["DOPEX0304F","Other component",0,0,0,0,0,0,0,0,0,0,0,0]
[null,"Amounts used (that is, incurred and charged against the provision) during the period"]
["DOPEX0305F","Opex component",75000,150000,150000,0,0,0,0,0,0,0,0,0]
["DOPEX0306F","Capex component",0,0,0,0,0,0,0,0,0,0,0,0]
["DOPEX0307F","Other component",0,0,0,0,0,0,0,0,0,0,0,0]
[null,"Unused amounts reversed during the period"]
["DOPEX0308F","Opex component",307554.39500000002,218656.79500000001,7299.625,629,1157277.5,1157277.5,0,0,0,0,0,0]
["DOPEX0309F","Capex component",0,0,0,0,0,0,0,0,0,0,0,4880164]
["DOPEX0310F","Other component",0,0,0,0,0,0,0,0,0,0,0,0]
[null,"The increase during the period in the discounted amount arising from the passage of time and the effect of any change in the discount rate"]
["DOPEX0311F","Opex component",0,0,0,0,0,0,0,0,0,0,0,0]
["DOPEX0312F","Capex component",0,0,0,0,0,0,0,0,0,0,0,0]
["DOPEX0313F","Other component",0,0,0,0,0,0,0,0,0,0,0,0]
["DOPEX0314F","Closing balance (carrying amount at the end of the period)",-571949.43500000006,-713364.69500000007,-556065.07000000007,-1885013.1950000001,-2057312.8200000003,-900035.32000000041,-900035.32000000041,-900035.32000000041,-900035.16000000015,-900035,-7804914.5,-14217551.66]
["DOPEX03G","Provision for Vegetation Management"]
[null,"<Brief description of provision>"]
["DOPEX0301G","Opening balance (the carrying amount at the beginning of the period)",0,0,0,0,0,0,0,0,0,0,-800000,-800000]
[null,"Additional provisions made in the period, including increases to existing provisions"]
["DOPEX0302G","Opex component",0,0,0,0,0,0,0,0,0,0,800000,800000]
["DOPEX0303G","Capex component",0,0,0,0,0,0,0,0,0,0,0,0]
["DOPEX0304G","Other component",0,0,0,0,0,0,0,0,0,0,0,0]
[null,"Amounts used (that is, incurred and charged against the provision) during the period"]
["DOPEX0305G","Opex component",0,0,0,0,0,0,0,0,0,0,0,0]
["DOPEX0306G","Capex component",0,0,0,0,0,0,0,0,0,0,0,0]
["DOPEX0307G","Other component",0,0,0,0,0,0,0,0,0,0,0,0]
[null,"Unused amounts reversed during the period"]
["DOPEX0308G","Opex component",0,0,0,0,0,0,0,0,0,0,0,0]
["DOPEX0309G","Capex component",0,0,0,0,0,0,0,0,0,0,0,0]
["DOPEX0310G","Other component",0,0,0,0,0,0,0,0,0,0,0,0]
[null,"The increase during the period in the discounted amount arising from the passage of time and the effect of any change in the discount rate"]
["DOPEX0311G","Opex component",0,0,0,0,0,0,0,0,0,0,0,0]
["DOPEX0312G","Capex component",0,0,0,0,0,0,0,0,0,0,0,0]
["DOPEX0313G","Other component",0,0,0,0,0,0,0,0,0,0,0,0]
["DOPEX0314G","Closing balance (carrying amount at the end of the period)",0,0,0,0,0,0,0,0,0,0,0,0]
["DOPEX03H","Provision for Redundancies"]
[null,"<Brief description of provision>"]
["DOPEX0301H","Opening balance (the carrying amount at the beginning of the period)",0,0,0,0,0,0,0,0,0,0,0,-1000000]
[null,"Additional provisions made in the period, including increases to existing provisions"]
["DOPEX0302H","Opex component",0,0,0,0,0,0,0,0,0,0,-500000,-500000]
["DOPEX0303H","Capex component",0,0,0,0,0,0,0,0,0,0,0,0]
["DOPEX0304H","Other component",0,0,0,0,0,0,0,0,0,0,0,0]
[null,"Amounts used (that is, incurred and charged against the provision) during the period"]
["DOPEX0305H","Opex component",0,0,0,0,0,0,0,0,0,0,0,141987]
["DOPEX0306H","Capex component",0,0,0,0,0,0,0,0,0,0,0,0]
["DOPEX0307H","Other component",0,0,0,0,0,0,0,0,0,0,0,0]
[null,"Unused amounts reversed during the period"]
["DOPEX0308H","Opex component",0,0,0,0,0,0,0,0,0,0,0,0]
["DOPEX0309H","Capex component",0,0,0,0,0,0,0,0,0,0,0,0]
["DOPEX0310H","Other component",0,0,0,0,0,0,0,0,0,0,0,0]
[null,"The increase during the period in the discounted amount arising from the passage of time and the effect of any change in the discount rate"]
["DOPEX0311H","Opex component",0,0,0,0,0,0,0,0,0,0,0,0]
["DOPEX0312H","Capex component",0,0,0,0,0,0,0,0,0,0,0,0]
["DOPEX0313H","Other component",0,0,0,0,0,0,0,0,0,0,0,0]
["DOPEX0314H","Closing balance (carrying amount at the end of the period)",0,0,0,0,0,0,0,0,0,0,-500000,-929006.5]
["DOPEX03I","<Provision name>"]
[null,"<Brief description of provision>"]
["DOPEX0301I","Opening balance (the carrying amount at the beginning of the period)"]
[null,"Additional provisions made in the period, including increases to existing provisions"]
["DOPEX0302I","Opex component"]
["DOPEX0303I","Capex component"]
["DOPEX0304I","Other component"]
[null,"Amounts used (that is, incurred and charged against the provision) during the period"]
["DOPEX0305I","Opex component"]
["DOPEX0306I","Capex component"]
["DOPEX0307I","Other component"]
[null,"Unused amounts reversed during the period"]
["DOPEX0308I","Opex component"]
["DOPEX0309I","Capex component"]
["DOPEX0310I","Other component"]
[null,"The increase during the period in the discounted amount arising from the passage of time and the effect of any change in the discount rate"]
["DOPEX0311I","Opex component"]
["DOPEX0312I","Capex component"]
["DOPEX0313I","Other component"]
["DOPEX0314I","Closing balance (carrying amount at the end of the period)"]
["DOPEX03J","<Provision name>"]
[null,"<Brief description of provision>"]
["DOPEX0301J","Opening balance (the carrying amount at the beginning of the period)"]
[null,"Additional provisions made in the period, including increases to existing provisions"]
["DOPEX0302J","Opex component"]
["DOPEX0303J","Capex component"]
["DOPEX0304J","Other component"]
[null,"Amounts used (that is, incurred and charged against the provision) during the period"]
["DOPEX0305J","Opex component"]
["DOPEX0306J","Capex component"]
["DOPEX0307J","Other component"]
[null,"Unused amounts reversed during the period"]
["DOPEX0308J","Opex component"]
["DOPEX0309J","Capex component"]
["DOPEX0310J","Other component"]
[null,"The increase during the period in the discounted amount arising from the passage of time and the effect of any change in the discount rate"]
["DOPEX0311J","Opex component"]
["DOPEX0312J","Capex component"]
["DOPEX0313J","Other component"]
["DOPEX0314J","Closing balance (carrying amount at the end of the period)"]
["DOPEX03K","<Provision name>"]
[null,"<Brief description of provision>"]
["DOPEX0301K","Opening balance (the carrying amount at the beginning of the period)"]
[null,"Additional provisions made in the period, including increases to existing provisions"]
["DOPEX0302K","Opex component"]
["DOPEX0303K","Capex component"]
["DOPEX0304K","Other component"]
[null,"Amounts used (that is, incurred and charged against the provision) during the period"]
["DOPEX0305K","Opex component"]
["DOPEX0306K","Capex component"]
["DOPEX0307K","Other component"]
[null,"Unused amounts reversed during the period"]
["DOPEX0308K","Opex component"]
["DOPEX0309K","Capex component"]
["DOPEX0310K","Other component"]
[null,"The increase during the period in the discounted amount arising from the passage of time and the effect of any change in the discount rate"]
["DOPEX0311K","Opex component"]
["DOPEX0312K","Capex component"]
["DOPEX0313K","Other component"]
["DOPEX0314K","Closing balance (carrying amount at the end of the period)"]
["DOPEX03L","<Provision name>"]
[null,"<Brief description of provision>"]
["DOPEX0301L","Opening balance (the carrying amount at the beginning of the period)"]
[null,"Additional provisions made in the period, including increases to existing provisions"]
["DOPEX0302L","Opex component"]
["DOPEX0303L","Capex component"]
["DOPEX0304L","Other component"]
[null,"Amounts used (that is, incurred and charged against the provision) during the period"]
["DOPEX0305L","Opex component"]
["DOPEX0306L","Capex component"]
["DOPEX0307L","Other component"]
[null,"Unused amounts reversed during the period"]
["DOPEX0308L","Opex component"]
["DOPEX0309L","Capex component"]
["DOPEX0310L","Other component"]
[null,"The increase during the period in the discounted amount arising from the passage of time and the effect of any change in the discount rate"]
["DOPEX0311L","Opex component"]
["DOPEX0312L","Capex component"]
["DOPEX0313L","Other component"]
["DOPEX0314L","Closing balance (carrying amount at the end of the period)"]
["DOPEX03M","<Provision name>"]
[null,"<Brief description of provision>"]
["DOPEX0301M","Opening balance (the carrying amount at the beginning of the period)"]
[null,"Additional provisions made in the period, including increases to existing provisions"]
["DOPEX0302M","Opex component"]
["DOPEX0303M","Capex component"]
["DOPEX0304M","Other component"]
[null,"Amounts used (that is, incurred and charged against the provision) during the period"]
["DOPEX0305M","Opex component"]
["DOPEX0306M","Capex component"]
["DOPEX0307M","Other component"]
[null,"Unused amounts reversed during the period"]
["DOPEX0308M","Opex component"]
["DOPEX0309M","Capex component"]
["DOPEX0310M","Other component"]
[null,"The increase during the period in the discounted amount arising from the passage of time and the effect of any change in the discount rate"]
["DOPEX0311M","Opex component"]
["DOPEX0312M","Capex component"]
["DOPEX0313M","Other component"]
["DOPEX0314M","Closing balance (carrying amount at the end of the period)"]
["DOPEX03N","<Provision name>"]
[null,"<Brief description of provision>"]
["DOPEX0301N","Opening balance (the carrying amount at the beginning of the period)"]
[null,"Additional provisions made in the period, including increases to existing provisions"]
["DOPEX0302N","Opex component"]
["DOPEX0303N","Capex component"]
["DOPEX0304N","Other component"]
[null,"Amounts used (that is, incurred and charged against the provision) during the period"]
["DOPEX0305N","Opex component"]
["DOPEX0306N","Capex component"]
["DOPEX0307N","Other component"]
[null,"Unused amounts reversed during the period"]
["DOPEX0308N","Opex component"]
["DOPEX0309N","Capex component"]
["DOPEX0310N","Other component"]
[null,"The increase during the period in the discounted amount arising from the passage of time and the effect of any change in the discount rate"]
["DOPEX0311N","Opex component"]
["DOPEX0312N","Capex component"]
["DOPEX0313N","Other component"]
["DOPEX0314N","Closing balance (carrying amount at the end of the period)"]
["DOPEX03O","<Provision name>"]
[null,"<Brief description of provision>"]
["DOPEX0301O","Opening balance (the carrying amount at the beginning of the period)"]
[null,"Additional provisions made in the period, including increases to existing provisions"]
["DOPEX0302O","Opex component"]
["DOPEX0303O","Capex component"]
["DOPEX0304O","Other component"]
[null,"Amounts used (that is, incurred and charged against the provision) during the period"]
["DOPEX0305O","Opex component"]
["DOPEX0306O","Capex component"]
["DOPEX0307O","Other component"]
[null,"Unused amounts reversed during the period"]
["DOPEX0308O","Opex component"]
["DOPEX0309O","Capex component"]
["DOPEX0310O","Other component"]
[null,"The increase during the period in the discounted amount arising from the passage of time and the effect of any change in the discount rate"]
["DOPEX0311O","Opex component"]
["DOPEX0312O","Capex component"]
["DOPEX0313O","Other component"]
["DOPEX0314O","Closing balance (carrying amount at the end of the period)"]
["DOPEX03P","<Provision name>"]
[null,"<Brief description of provision>"]
["DOPEX0301P","Opening balance (the carrying amount at the beginning of the period)"]
[null,"Additional provisions made in the period, including increases to existing provisions"]
["DOPEX0302P","Opex component"]
["DOPEX0303P","Capex component"]
["DOPEX0304P","Other component"]
[null,"Amounts used (that is, incurred and charged against the provision) during the period"]
["DOPEX0305P","Opex component"]
["DOPEX0306P","Capex component"]
["DOPEX0307P","Other component"]
[null,"Unused amounts reversed during the period"]
["DOPEX0308P","Opex component"]
["DOPEX0309P","Capex component"]
["DOPEX0310P","Other component"]
[null,"The increase during the period in the discounted amount arising from the passage of time and the effect of any change in the discount rate"]
["DOPEX0311P","Opex component"]
["DOPEX0312P","Capex component"]
["DOPEX0313P","Other component"]
["DOPEX0314P","Closing balance (carrying amount at the end of the period)"]
["DOPEX03Q","<Provision name>"]
[null,"<Brief description of provision>"]
["DOPEX0301Q","Opening balance (the carrying amount at the beginning of the period)"]
[null,"Additional provisions made in the period, including increases to existing provisions"]
["DOPEX0302Q","Opex component"]
["DOPEX0303Q","Capex component"]
["DOPEX0304Q","Other component"]
[null,"Amounts used (that is, incurred and charged against the provision) during the period"]
["DOPEX0305Q","Opex component"]
["DOPEX0306Q","Capex component"]
["DOPEX0307Q","Other component"]
[null,"Unused amounts reversed during the period"]
["DOPEX0308Q","Opex component"]
["DOPEX0309Q","Capex component"]
["DOPEX0310Q","Other component"]
[null,"The increase during the period in the discounted amount arising from the passage of time and the effect of any change in the discount rate"]
["DOPEX0311Q","Opex component"]
["DOPEX0312Q","Capex component"]
["DOPEX0313Q","Other component"]
["DOPEX0314Q","Closing balance (carrying amount at the end of the period)"]
["DOPEX03R","<Provision name>"]
[null,"<Brief description of provision>"]
["DOPEX0301R","Opening balance (the carrying amount at the beginning of the period)"]
[null,"Additional provisions made in the period, including increases to existing provisions"]
["DOPEX0302R","Opex component"]
["DOPEX0303R","Capex component"]
["DOPEX0304R","Other component"]
[null,"Amounts used (that is, incurred and charged against the provision) during the period"]
["DOPEX0305R","Opex component"]
["DOPEX0306R","Capex component"]
["DOPEX0307R","Other component"]
[null,"Unused amounts reversed during the period"]
["DOPEX0308R","Opex component"]
["DOPEX0309R","Capex component"]
["DOPEX0310R","Other component"]
[null,"The increase during the period in the discounted amount arising from the passage of time and the effect of any change in the discount rate"]
["DOPEX0311R","Opex component"]
["DOPEX0312R","Capex component"]
["DOPEX0313R","Other component"]
["DOPEX0314R","Closing balance (carrying amount at the end of the period)"]

{"sheet":"3.3 Assets (RAB)","index":10,"n_rows":139,"n_cols":40,"rows_kept":139,"cut":false,"hidden":false,"merged":[[8,2,8,13],[9,2,9,13],[116,2,116,13],[8,28,8,39],[9,28,9,39],[116,28,116,39],[8,15,8,26],[9,15,9,26],[116,15,116,26],[98,2,98,13],[98,15,98,26],[98,28,98,39],[99,2,99,13],[99,15,99,26],[99,28,99,39],[21,2,21,13],[115,2,115,13],[115,15,115,26],[115,28,115,39],[21,15,21,26],[21,28,21,39],[22,2,22,13],[22,15,22,26],[22,28,22,39]]}
[null,{"$f":"INDEX(dms_Worksheet_List,MATCH(dms_Model,dms_Model_List))","v":"HISTORICAL ECONOMIC BENCHMARKING - FINANCIAL YEARS"}]
[null,{"$f":"INDEX(dms_TradingNameFull_List,MATCH(dms_TradingName,dms_TradingName_List))","v":"CitiPower"}]
[null,{"$f":"dms_Header_Span","v":"2006-07 to 2018-19"}]
[null,"3.3 ASSETS"]
[]
[null,"There are FOUR tables on this worksheet. Both ROWS and COLUMNS in each have been  grouped (and sub-grouped) for ease of navigation. see the Instructions sheet on how to group or ungroup tables. "]
[]
[null,"3.3.1 - REGULATORY ASSET BASE VALUES"]
[null,null,"Network services",null,null,null,null,null,null,null,null,null,null,null,null,"Standard control services",null,null,null,null,null,null,null,null,null,null,null,null,"Alternative control services"]
[null,null,"$0's, Nominal",null,null,null,null,null,null,null,null,null,null,null,null,"$0's, Nominal",null,null,null,null,null,null,null,null,null,null,null,null,"$0's, Nominal"]
[null,null,{"$f":"dms_y1","v":"2006-07"},{"$f":"dms_y2","v":"2007-08"},{"$f":"dms_y3","v":"2008-09"},{"$f":"dms_y4","v":"2009-10"},{"$f":"dms_y5","v":"2010-11"},{"$f":"dms_y6","v":"2011-12"},{"$f":"dms_y7","v":"2012-13"},{"$f":"dms_y8","v":"2013-14"},{"$f":"dms_y9","v":"2014-15"},{"$f":"dms_y10","v":"2015-16"},{"$f":"dms_y11","v":"2016-17"},{"$f":"dms_y12","v":"2017-18"},null,{"$f":"dms_y1","v":"2006-07"},{"$f":"dms_y2","v":"2007-08"},{"$f":"dms_y3","v":"2008-09"},{"$f":"dms_y4","v":"2009-10"},{"$f":"dms_y5","v":"2010-11"},{"$f":"dms_y6","v":"2011-12"},{"$f":"dms_y7","v":"2012-13"},{"$f":"dms_y8","v":"2013-14"},{"$f":"dms_y9","v":"2014-15"},{"$f":"dms_y10","v":"2015-16"},{"$f":"dms_y11","v":"2016-17"},{"$f":"dms_y12","v":"2017-18"},null,{"$f":"dms_y1","v":"2006-07"},{"$f":"dms_y2","v":"2007-08"},{"$f":"dms_y3","v":"2008-09"},{"$f":"dms_y4","v":"2009-10"},{"$f":"dms_y5","v":"2010-11"},{"$f":"dms_y6","v":"2011-12"},{"$f":"dms_y7","v":"2012-13"},{"$f":"dms_y8","v":"2013-14"},{"$f":"dms_y9","v":"2014-15"},{"$f":"dms_y10","v":"2015-16"},{"$f":"dms_y11","v":"2016-17"},{"$f":"dms_y12","v":"2017-18"}]
[null,"For total asset base:"]
["DRAB0101","Opening value",791923868.26824582,{"$f":"C18","v":834106824.28063118},{"$f":"D18","v":870476552.0353725},919908275.88797832,983522417.42237818,1060153272.3502848,1148295233.0698037,1229453289.2642384,1315905172.9503124,1396580879.866859,1453113957.4999926,1483802357.7158425,null,1036891081.8630229,{"$f":"P18","v":1082382041.9841881},{"$f":"Q18","v":1119365589.5387082},1175244414.8980372,1251672209.0099838,1341423500.7920582,1443286551.542079,1536131228.0002069,1634512004.4254229,1725332483.0438492,0,0,null,6340519.9520409722,{"$f":"AC18","v":7303123.8301609773},{"$f":"AD18","v":8022901.9939952679},9463750.7785888929,10567611.705449417,10760971.903303219,11000894.263414163,11429468.921867965,12413834.19388058,13223290.44952501,8430757.2051694393,-1785918.0325869936]
["DRAB0102","Inflation addition",27674173.026250891,23975629.326279826,30025431.776554421,28077967.252468113,20346082.307955422,34081848.29317984,31819862.87414135,25944766.231864367,29541070.9187745,26434558.056948289,18811883.601958148,22537321.496061977,null,36213237.172853075,31161856.871237349,38528750.564502642,35911773.839082986,25873598.813506726,43108869.672315456,40033577.87324366,32431491.436059013,36677267.861779384,32626691.149876099,22532768.302880466,27007149.079616666,null,0,0,0,0,0,0,0,0,0,948651,1541916.6353582931,1579345.9689668543]
["DRAB0103","Straight line depreciation",-50026136.108951643,-50814901.581352763,-52984974.609727658,-56620824.288494229,-54446639.710352287,-52766547.303482942,-57593475.477078542,-62541745.80962801,-67860832.799838364,-74882092.719673932,-84967449.377852783,-91766177.01095663,null,-68838448.309689641,-70514321.928968027,-70398023.591160655,-71231964.290770277,-70395240.192344487,-70714499.056092009,-76580710.990623102,-82538453.172064841,-88713555.297629803,-97090855.514358565,-102494149.44427525,-106359719.3568179,null,-341396.12187999499,-396721.8361657093,-465822.90331797441,-547141.16105107614,-603082.76214619842,-641432.42488905555,-687078.31654619845,-692704.97798738489,-661324.31889795,-8332600.8188979505,-16281273.576146532,-16665455.717214927]
["DRAB0105","Actual additions (recognised in RAB)",64925937.640194282,63418814.587961227,72499245.074848145,92285186.703811258,111265069.01030347,107527755.19982208,107128139.16737153,123154134.6338374,127265779.1242466,113177981.25249557,97079640.651982635,88604746.527144372,null,78598086.87800169,76594601.172250897,87881177.680987209,111899222.85863405,134806589.84091198,130169775.60379741,129588279.94550741,148593009.53122154,151896267.93105367,134208769.43180941,112112847.22592488,103078336.24701665,null,1304000,1116500,1906671.6879115994,1651002.0879115993,796442.9600000002,881354.78500000015,1115652.9750000001,1677070.25,1470780.5745423799,2591416.5745423799,4522681.7030318063,4392247.9384219367]
["DRAB0106","Disposals ",-391018.54510806146,-209814.57814708032,-107978.38906924524,-128188.13338529083,-533656.68000000005,-701095.47,-196470.37,-105271.37000000001,-8270310.326636292,-8197368.9566362919,-235674.66023804655,-203344.66023804655,null,-481915.62,-258588.55999999997,-133079.29500000004,-151238.29500000001,-533656.68000000005,-701095.47,-196470.37,-105271.37000000001,-9039501.8767768703,-8966560.5067768712,-235674.66023804655,-203344.66023804655,null,0,0,0,0,0,0,0,0,0,0,0,0]
["DRAB0107","Closing value",{"$f":"SUM(C13:C17)","v":834106824.28063118},870476552.0353725,919908275.88797832,983522417.42237818,1060153272.3502848,1148295233.0698037,1229453289.2642384,{"$f":"SUM(J13:J17)","v":1315905172.9503124},1396580879.866859,1453113957.4999926,1483802357.7158425,{"$f":"SUM(N13:N17)","v":1502974904.0678544},null,{"$f":"SUM(P13:P17)","v":1082382041.9841881},1119365589.5387082,1175244414.8980372,1251672209.0099838,1341423500.7920582,1443286551.542079,1536131228.0002069,1634512004.4254229,1725332483.0438492,null,null,null,null,{"$f":"SUM(AC13:AC17)","v":7303123.8301609773},8022901.9939952679,9463750.7785888929,10567611.705449417,10760971.903303219,11000894.263414163,11429468.921867965,12413834.19388058,13223290.44952501,8430757.2051694393,-1785918.0325869936,-12479779.842413129]
[]
[]
[null,"3.3.2 - ASSET VALUE ROLL FORWARD"]
[null,null,"Network services",null,null,null,null,null,null,null,null,null,null,null,null,"Standard control services",null,null,null,null,null,null,null,null,null,null,null,null,"Alternative control services"]
[null,null,"$0's, Nominal",null,null,null,null,null,null,null,null,null,null,null,null,"$0's, Nominal",null,null,null,null,null,null,null,null,null,null,null,null,"$0's, Nominal"]
[null,null,{"$f":"dms_y1","v":"2006-07"},{"$f":"dms_y2","v":"2007-08"},{"$f":"dms_y3","v":"2008-09"},{"$f":"dms_y4","v":"2009-10"},{"$f":"dms_y5","v":"2010-11"},{"$f":"dms_y6","v":"2011-12"},{"$f":"dms_y7","v":"2012-13"},{"$f":"dms_y8","v":"2013-14"},{"$f":"dms_y9","v":"2014-15"},{"$f":"dms_y10","v":"2015-16"},{"$f":"dms_y11","v":"2016-17"},{"$f":"dms_y12","v":"2017-18"},null,{"$f":"dms_y1","v":"2006-07"},{"$f":"dms_y2","v":"2007-08"},{"$f":"dms_y3","v":"2008-09"},{"$f":"dms_y4","v":"2009-10"},{"$f":"dms_y5","v":"2010-11"},{"$f":"dms_y6","v":"2011-12"},{"$f":"dms_y7","v":"2012-13"},{"$f":"dms_y8","v":"2013-14"},{"$f":"dms_y9","v":"2014-15"},{"$f":"dms_y10","v":"2015-16"},{"$f":"dms_y11","v":"2016-17"},{"$f":"dms_y12","v":"2017-18"},null,{"$f":"dms_y1","v":"2006-07"},{"$f":"dms_y2","v":"2007-08"},{"$f":"dms_y3","v":"2008-09"},{"$f":"dms_y4","v":"2009-10"},{"$f":"dms_y5","v":"2010-11"},{"$f":"dms_y6","v":"2011-12"},{"$f":"dms_y7","v":"2012-13"},{"$f":"dms_y8","v":"2013-14"},{"$f":"dms_y9","v":"2014-15"},{"$f":"dms_y10","v":"2015-16"},{"$f":"dms_y11","v":"2016-17"},{"$f":"dms_y12","v":"2017-18"}]
[null,"For overhead network assets less than 33kV"]
["DRAB0201","Opening value",79935533.135621428,{"$f":"C31","v":85344589.819444448},{"$f":"D31","v":89928876.846151188},95901483.359212115,103317824.82576644,111493088.6554465,120352137.61217964,128498858.33289737,137013876.670434,175815253.3679167,204062201.54441401,206631303.44205576,null,98517531.950914472,{"$f":"P31","v":105183990.45527856},{"$f":"Q31","v":110833951.44145834},118194963.87109223,127335325.21891145,137411029.77674782,148329473.73294061,158369999.98472372,168868405.92385584,178167993.46624538,183728782.40090287,186857683.81723928,null,0,{"$f":"AC31","v":0},{"$f":"AD31","v":0},0,0,0,0,0,0,0,0,0]
["DRAB0202","Inflation addition",2796363.2744618752,2448274.9948223541,3107819.4812736181,2918683.7296340759,2132073.8672737917,3566383.1944074184,3321682.0345131243,2700278.3272276171,17107197.474577505,16771816.556948287,1913986.7890113231,2245535.5317322528,null,3446412.3454428492,3017406.6596617457,3830270.3820662755,3597167.6963858651,2627700.6870584451,4395432.8759917375,4093847.9188061683,3329274.879316085,3774407.7346502002,3357726.8868916947,2302619.7137858281,2727201.3380640442,null,0,0,0,0,0,0,0,0,0,0,0,0]
["DRAB0203","Straight line depreciation",-3682981.6717363494,-3949097.4365987354,-4253969.1403133292,-4583867.3575297501,-4869630.4672958292,-5203185.5725196917,-5586501.2011821382,-5954343.4539471576,-38466912.106349781,-38911171.719673932,-7381041.4766790606,-7725416.8133999426,null,-4539136.1048948541,-4867113.7556223646,-5242856.6403376441,-5649443.7597358041,-6001636.0225810092,-6412730.1186262481,-6885152.1844172757,-7341229.5478143832,-7779888.0120704463,-8318192.4015887342,-8829843.8595373966,-9298007.7489246521,null,0,0,0,0,0,0,0,0,0,0,0,0]
["DRAB0205","Actual additions (recognised in RAB)",6337810.9933445528,6107718.9553311635,7130391.8553267168,9092210.1422167495,10912820.429702092,10495851.334845416,10411539.887386741,11769083.464256179,68326130.28589125,66716381.252495572,8036156.5853094663,7574443.5822022147,null,7811113.1876273938,7527533.4225662705,8787939.2289516255,11205806.329839818,13449639.893358923,12935741.198827283,12831830.517394217,14510360.607630398,14091230.784351952,12093580.378438801,9656125.5620879866,9134108.4982689973,null,0,0,0,0,0,0,0,0,0,0,0,0]
["DRAB0206","Disposals ",-42135.912247062181,-22609.486848038196,-11635.683226081994,-10685.047766747508,0,0,0,0,-8165038.9566362919,-16330077.913272584,0,0,null,-51930.923811290922,-27865.340425843486,-14340.541046387565,-13168.918670644347,0,0,0,0,-786162.96454214002,-1572325.92908428,0,0,null,0,0,0,0,0,0,0,0,0,0,0,0]
["DRAB0207","Closing value",{"$f":"SUM(C26:C30)","v":85344589.819444448},89928876.846151188,95901483.359212115,103317824.82576644,111493088.6554465,120352137.61217964,128498858.33289737,{"$f":"SUM(J26:J30)","v":137013876.670434},175815253.3679167,204062201.54441401,206631303.44205576,{"$f":"SUM(N26:N30)","v":208725865.74259031},null,{"$f":"SUM(P26:P30)","v":105183990.45527856},110833951.44145834,118194963.87109223,127335325.21891145,137411029.77674782,148329473.73294061,158369999.98472372,168868405.92385584,178167993.46624538,183728782.40090287,186857683.81723928,189420985.90464768,null,{"$f":"SUM(AC26:AC30)","v":0},0,0,0,0,0,0,0,0,0,0,0]
[null,"For underground network assets less than 33kV"]
["DRAB0301","Opening value",404075404.40083325,{"$f":"C38","v":431418272.85001892},{"$f":"D38","v":454591917.43012297},484783539.32119751,522273264.60004437,563599354.61881948,608381989.44187415,649563793.5862155,692607348.10136461,730757354.07763565,753599607.92121077,766586459.97830129,null,498007706.98679477,{"$f":"P38","v":531706761.84268701},{"$f":"Q38","v":560267405.41112494},597477441.51931453,643682114.99942327,694614963.43521786,749807873.07079983,800562894.60425198,853632505.3144418,900642069.76654243,928751945.3213948,944568590.39568341,null,0,{"$f":"AC38","v":0},{"$f":"AD38","v":0},0,0,0,0,0,0,0,0,0]
["DRAB0302","Inflation addition",14135661.284234162,12376069.4375908,15710077.414130736,14753993.150568774,10777667.657128442,18028124.352201585,16791156.057089567,13649950.332076715,15488012.054143406,13792656.269908901,9675234.1155645736,11351218.194062481,null,17421669.78299991,15253039.148133893,19362078.325943634,18183740.504346516,13283069.194847554,22218983.813740365,20694467.009314861,16829538.009569995,19079691.745657086,16973362.776711501,11639779.063250471,13786046.584452488,null,0,0,0,0,0,0,0,0,0,0,0,0]
["DRAB0303","Straight line depreciation",-18617531.528598003,-19962750.995912567,-21503882.356853582,-23171523.145671129,-24616060.257166438,-26302186.67362031,-28239853.33560589,-30099301.833804518,-31923202.322206974,-34168941.659627996,-37311283.116554402,-39052106.123359136,null,-22945405.944862127,-24603338.239218671,-26502724.558872849,-28558028.980452646,-30338366.528143346,-32416453.789092012,-34804554.922520481,-37110033.322721794,-39327458.907879099,-42048597.097864553,-44635003.438985839,-47001578.570751369,null,0,0,0,0,0,0,0,0,0,0,0,0]
["DRAB0305","Actual additions (recognised in RAB)",32037736.406996179,30874617.457730792,36044245.399466835,45961268.36209698,55164482.61881312,53056697.144473433,52630501.422857597,59492906.016876914,57814546.420957357,49677239.586539805,40622901.058080271,38288934.013824075,null,39485302.672044098,38051802.403114215,44423174.006531507,56645531.05169256,67988145.769090429,65390379.610933706,64865109.446657777,73350106.023341686,71231398.032111496,61133242.7115831,48811869.450024024,46173065.225161836,null,0,0,0,0,0,0,0,0,0,0,0,0]
["DRAB0306","Disposals ",-212997.71344669242,-114291.31930497049,-58818.565669437856,-54013.088147737602,0,0,0,0,-3229350.17662276,-6458700.35324552,0,0,null,-262511.65428963915,-140859.74359157647,-72491.665412606701,-66569.09547765326,0,0,0,0,-3974066.4177888799,-7948132.8355777599,0,0,null,0,0,0,0,0,0,0,0,0,0,0,0]
["DRAB0307","Closing value",{"$f":"SUM(C33:C37)","v":431418272.85001892},454591917.43012297,484783539.32119751,522273264.60004437,563599354.61881948,608381989.44187415,649563793.5862155,{"$f":"SUM(J33:J37)","v":692607348.10136461},730757354.07763565,753599607.92121077,766586459.97830129,{"$f":"SUM(N33:N37)","v":777174506.06282878},null,{"$f":"SUM(P33:P37)","v":531706761.84268701},560267405.41112494,597477441.51931453,643682114.99942327,694614963.43521786,749807873.07079983,800562894.60425198,853632505.3144418,900642069.76654243,928751945.3213948,944568590.39568341,957526123.63454628,null,{"$f":"SUM(AC33:AC37)","v":0},0,0,0,0,0,0,0,0,0,0,0]
[null,"For distribution substations and transformers"]
["DRAB0401","Opening value",14404865.981123451,{"$f":"C45","v":15379610.672981257},{"$f":"D45","v":16205726.889991714},17282026.665620387,18618496.20182414,20091728.132698555,21688182.274380941,23156270.564584445,24690728.310314599,26050736.163507536,26865038.778860953,27328006.617639821,null,17753454.42603381,{"$f":"P45","v":18954790.522224706},{"$f":"Q45","v":19972947.624728952},21299446.534223404,22946594.868256383,24762297.699371293,26729867.261264622,28539230.749107994,30431106.92277471,32106948.77899361,33109036.346718058,33672883.092014425,null,0,{"$f":"AC45","v":0},{"$f":"AD45","v":0},0,0,0,0,0,0,0,0,0]
["DRAB0402","Inflation addition",503921.55557174166,441193.94469436235,560047.84562225407,525964.44056152576,384212.59126184986,642683.79702438635,598587.16971194535,486606.46760748804,552131.44755687122,491694.0104481625,344912.21260776871,404659.06864689896,null,621064.32526776241,543754.90896185092,690237.8624474823,648231.35025759961,473527.53838974779,792083.55813754955,737736.12690430437,599955.44621566928,680171.07590320543,605082.58307481743,414945.8963209372,491458.1568086982,null,0,0,0,0,0,0,0,0,0,0,0,0]
["DRAB0403","Straight line depreciation",-663695.54703894677,-711651.21553749836,-766590.93835131265,-826040.59008943825,-877536.82883404579,-937645.47388326633,-1006721.2658715983,-1073008.6620447701,-1138028.8088099509,-1218087.319484215,-1330108.5092447586,-1392166.780905012,null,-817979.74813220464,-877083.30218641716,-944794.43996667396,-1018063.8951743424,-1081531.0686185514,-1155612.708245771,-1240746.0185184292,-1322933.9146773631,-1401982.8199792551,-1498988.3807296501,-1591191.0644634571,-1675557.1678926011,null,0,0,0,0,0,0,0,0,0,0,0,0]
["DRAB0405","Actual additions (recognised in RAB)",1142111.8292652704,1100647.8539730427,1284939.688769076,1638471.1958902171,1966556.1684466102,1891415.8185412665,1876222.3863631613,2120859.9401674392,2061028.1741553419,1770941.8438081299,1448164.1354158581,1364960.4925770082,null,1407609.7852535318,1356506.9984148759,1583639.739144919,2019353.9976508296,2423706.3613437135,2331098.7120015491,2312373.379457498,2614854.6421284098,2539324.9159079734,2179335.9966053348,1740091.9134388878,1646021.5327690372,null,0,0,0,0,0,0,0,0,0,0,0,0]
["DRAB0406","Disposals ",-7593.1459402605833,-4074.3661194501851,-2096.8204113450215,-1925.5101585518905,0,0,0,0,-115122.9597093295,-230245.919418659,0,0,null,-9358.2661981924502,-5021.5026860662038,-2584.2521312709932,-2373.1187011050583,0,0,0,0,-141671.31561302752,-283342.63122605503,0,0,null,0,0,0,0,0,0,0,0,0,0,0,0]
["DRAB0407","Closing value",{"$f":"SUM(C40:C44)","v":15379610.672981257},16205726.889991714,17282026.665620387,18618496.20182414,20091728.132698555,21688182.274380941,23156270.564584445,{"$f":"SUM(J40:J44)","v":24690728.310314599},26050736.163507536,26865038.778860953,27328006.617639821,{"$f":"SUM(N40:N44)","v":27705459.397958718},null,{"$f":"SUM(P40:P44)","v":18954790.522224706},19972947.624728952,21299446.534223404,22946594.868256383,24762297.699371293,26729867.261264622,28539230.749107994,30431106.92277471,32106948.77899361,33109036.346718058,33672883.092014425,34134805.613699555,null,{"$f":"SUM(AC40:AC44)","v":0},0,0,0,0,0,0,0,0,0,0,0]
[null,"For overhead network assets 33kV and above"]
["DRAB0501","Opening value",6482827.0561197,{"$f":"C52","v":6921505.2964771986},{"$f":"D52","v":7293294.1468665553},7777676.6683759252,8379147.0937401811,9042166.6479607914,9760641.6491940729,10421346.337524783,11111920.217457268,11643584.715240935,12415904.723941887,12624260.6821968,null,7989840.0195809267,{"$f":"P52","v":8530494.4177603517},{"$f":"Q52","v":8988710.1637551077},9585693.3659350462,10326982.996765662,11144129.609226326,12029622.970105538,12843916.597600384,13695344.584611636,14449547.570013266,14900531.029516635,15154286.728313597,null,0,{"$f":"AC52","v":0},{"$f":"AD52","v":0},0,0,0,0,0,0,0,0,0]
["DRAB0502","Inflation addition",226786.99676230035,198556.79639150121,252046.31067579956,236707.27032777239,172912.66612255704,289236.14515672775,269390.71174559207,218994.44104669325,248483.58127362875,221283.979054689,155225.67544863326,182114.48563048124,null,279506.42628072301,244713.76827352244,310637.57869712438,291732.78957137681,213108.34420213048,356472.64807118929,332013.89933370129,270006.49671368673,306107.0793323305,272313.71720491152,186743.79528656276,221177.91585740689,null,0,0,0,0,0,0,0,0,0,0,0,0]
["DRAB0503","Straight line depreciation",-298692.36235925625,-320274.53505313024,-344999.84120869194,-371754.81492867344,-394930.40089104313,-421981.95075915172,-453069.11351454799,-482901.37477642245,-512163.31773337652,-548193.11642300896,-598607.60835858178,-626536.64988684561,null,-368127.07938403601,-394726.2938326525,-425199.30181326979,-458173.79857220309,-486736.83482111583,-520076.85050514876,-558390.6069771531,-595378.79677377467,-630954.30179543153,-674611.04697321053,-716106.33429762255,-754074.86305834306,null,0,0,0,0,0,0,0,0,0,0,0,0]
["DRAB0505","Actual additions (recognised in RAB)",514000.85759755207,495340.2340810973,578279.71400428982,737384.53473355272,885037.28898909723,851220.80683570541,844383.09009966557,954480.8136622156,360907.59252462012,230355.86263167998,651737.89116486255,614292.61635675211,null,633486.68514226214,610488.1699464327,712707.9530992161,908798.64824908855,1090775.1030796482,1049097.5633131727,1040670.3351382983,1176800.2870713393,1142808.5683476231,980797.51023745001,783118.2378080209,740782.5204048513,null,0,0,0,0,0,0,0,0,0,0,0,0]
["DRAB0506","Disposals ",-3417.25164309704,-1833.6450301114901,-943.66196202759704,-866.56476839501875,0,0,0,0,434436.64171879552,868873.28343759105,0,0,null,-4211.6338595245224,-2259.8983925478251,-1163.0278031321184,-1068.0084176463581,0,0,0,0,-63758.360482891498,-127516.720965783,0,0,null,0,0,0,0,0,0,0,0,0,0,0,0]
["DRAB0507","Closing value",{"$f":"SUM(C47:C51)","v":6921505.2964771986},7293294.1468665553,7777676.6683759252,8379147.0937401811,9042166.6479607914,9760641.6491940729,10421346.337524783,{"$f":"SUM(J47:J51)","v":11111920.217457268},11643584.715240935,12415904.723941887,12624260.6821968,{"$f":"SUM(N47:N51)","v":12794131.134297188},null,{"$f":"SUM(P47:P51)","v":8530494.4177603517},8988710.1637551077,9585693.3659350462,10326982.996765662,11144129.609226326,12029622.970105538,12843916.597600384,13695344.584611636,14449547.570013266,14900531.029516635,15154286.728313597,15362172.301517511,null,{"$f":"SUM(AC47:AC51)","v":0},0,0,0,0,0,0,0,0,0,0,0]
[null,"For underground network assets 33kV and above"]
["DRAB0601","Opening value",79436972.941984624,{"$f":"C59","v":84812293.185430065},{"$f":"D59","v":89367987.883568197},95303343.079938516,102673428.61383559,110797703.09049486,119601497.90692204,127697407.29880139,137768668.05694652,145892741.24079612,155356322.9527702,157909401.48029736,null,97903075.302170604,{"$f":"P59","v":104527954.91524029},{"$f":"Q59","v":110142676.9340571},117457778.51981065,126541131.17393984,136553993.2758829,147404338.58658621,157382241.79057139,167815168.87327287,177056754.62366822,182582861.04067457,185692247.69097766,null,0,{"$f":"AC59","v":0},{"$f":"AD59","v":0},0,0,0,0,0,0,0,0,0]
["DRAB0602","Inflation addition",2778922.2771868692,2433005.0340475403,3088435.9227785096,2900479.8162012086,2118776.0619246671,3544139.5609913496,3300964.6091909334,1250897.5330538442,1612241.1280643218,2711491.1550098201,1902049.2817773491,2231530.0627549044,null,3424916.9736238979,2998587.0085064881,3806380.8767554848,3574732.0591554046,2611311.6431380566,4368018.4361323817,4068314.4729022454,3308510.0972049078,3750866.6462601498,3336784.7965283948,2288258.3568698019,2710191.7057534065,null,0,0,0,0,0,0,0,0,0,0,0,0]
["DRAB0603","Straight line depreciation",-3660010.8103009686,-3924466.8035692321,-4227437.0137968129,-4555277.6464497223,-4839258.4435727187,-5170733.1561185606,-5551658.0343030468,-2875316.1308703776,-3233875.7763428236,-6717254.3414943703,-7335005.6091283783,-7677233.169013923,null,-4510825.3839097247,-4836757.4287015386,-5210156.7943582367,-5614208.0183288455,-5964203.6480138823,-6372733.7384900395,-6842209.2944204332,-7295442.0903306035,-7731364.6292690895,-8266311.5368594099,-8774771.8101128154,-9240015.8101472445,null,0,0,0,0,0,0,0,0,0,0,0,0]
["DRAB0605","Actual additions (recognised in RAB)",6298281.8859235235,6069624.938495338,7085919.3985274788,9035501.7689655311,10844756.858307315,10430388.4115544,10346602.816991452,11695679.35596166,4422361.7896564966,2822652.8135154499,7986034.8548781984,7527201.5621530497,null,7762395.0525180027,7480583.9825169407,8733128.6020403001,11135915.397052987,13365754.106818892,12855060.61306099,12751798.025503378,14419859.075827189,14003343.377177117,12018152.44488295,9595900.1035460904,9077138.8037794363,null,0,0,0,0,0,0,0,0,0,0,0,0]
["DRAB0606","Disposals ",-41873.109363977419,-22468.470835523938,-11563.111138867042,-10618.404819929727,0,0,0,0,5323346.0424716007,10646692.084943201,0,0,null,-51607.029162497274,-27691.54350508119,-14251.098684017714,-13086.783750354462,0,0,0,0,-781259.64377279999,-1562519.2875456,0,0,null,0,0,0,0,0,0,0,0,0,0,0,0]
["DRAB0607","Closing value",{"$f":"SUM(C54:C58)","v":84812293.185430065},89367987.883568197,95303343.079938516,102673428.61383559,110797703.09049486,119601497.90692204,127697407.29880139,{"$f":"SUM(J54:J58)","v":137768668.05694652},145892741.24079612,155356322.9527702,157909401.48029736,{"$f":"SUM(N54:N58)","v":159990899.93619138},null,{"$f":"SUM(P54:P58)","v":104527954.91524029},110142676.9340571,117457778.51981065,126541131.17393984,136553993.2758829,147404338.58658621,157382241.79057139,167815168.87327287,177056754.62366822,182582861.04067457,185692247.69097766,188239562.39036325,null,{"$f":"SUM(AC54:AC58)","v":0},0,0,0,0,0,0,0,0,0,0,0]
[null,"Zone substations and transformers"]
["DRAB0701","Opening value",157460982.87024984,{"$f":"C66","v":168116011.3466424},{"$f":"D66","v":177146367.59334272},188911504.50996554,203520582.23568398,219624622.92133215,237075617.50788397,253123432.56001124,269896738.54787397,282810304.44335896,301569136.73904204,306629881.31497133,null,194064726.94218352,{"$f":"P66","v":207196647.96884307},{"$f":"Q66","v":218326221.70363045},232826309.54471299,250831447.24955544,270679070.45981669,292186763.58846509,311965090.82446343,332645372.20748639,350964161.57776767,0,0,null,0,{"$f":"AC66","v":0},{"$f":"AD66","v":0},0,0,0,0,0,0,0,0,0]
["DRAB0702","Inflation addition",5508415.2489729188,4822733.669234653,6121937.1524599465,5749368.1561596729,4199864.9852414709,7025238.7274450334,6543214.230516078,5319142.3482108386,6035402.2397574773,5374752.5267508347,3770266.5019799047,4423367.4065415468,null,6788914.1912504891,5943837.4864337761,7545056.8146670349,7085879.5682394914,5176175.3083081748,8658341.9618858509,8064264.9361312054,6558170.9932792298,7435015.7975771111,6614216.9593392499,4535814.4517982667,5372176.6319872122,null,0,0,0,0,0,0,0,0,0,0,0,0]
["DRAB0703","Straight line depreciation",-7254920.1985154552,-7779128.2477869336,-8379679.6700784434,-9029529.5615141727,-9592439.926488949,-10249493.33752742,-11004567.498805761,-11729161.43581393,-12439902.94701089,-13315027.67996655,-14539542.13675528,-15217909.693007663,null,-8941415.7186633572,-9587482.3828514721,-10327639.377030643,-11128554.876451863,-11822320.686117683,-12632114.251960482,-13562714.6982331,-14461118.538031578,-15325209.765257481,-16385588.56461985,-17393465.015745796,-18315677.414659593,null,0,0,0,0,0,0,0,0,0,0,0,0]
["DRAB0705","Actual additions (recognised in RAB)",12484534.838402059,12031288.115261585,14045799.98090283,17910287.068796858,21496615.626895636,20675249.196634196,20509168.32041695,23183325.075465836,8766062.0516811069,5595098.3467842843,15830020.210704714,14920515.124672718,null,15386718.666751254,14828109.162603959,17310919.113368731,22073753.803037394,26493768.58807078,25481465.418723047,25276776.998100296,28583228.927775331,27757606.187364168,23822535.086928248,19021115.542590607,17992820.531273942,null,0,0,0,0,0,0,0,0,0,0,0,0]
["DRAB0706","Disposals ",-83001.412466971829,-44537.29000898599,-22920.546661485736,-21047.937723929095,0,0,0,0,10552004.551057251,21104009.102114502,0,0,null,-102296.11267885564,-54890.53139888477,-28248.709922584949,-25940.789982596547,0,0,0,0,-1548622.8494025099,-3097245.6988050197,0,0,null,0,0,0,0,0,0,0,0,0,0,0,0]
["DRAB0707","Closing value",{"$f":"SUM(C61:C65)","v":168116011.3466424},177146367.59334272,188911504.50996554,203520582.23568398,219624622.92133215,237075617.50788397,253123432.56001124,{"$f":"SUM(J61:J65)","v":269896738.54787397},282810304.44335896,301569136.73904204,306629881.31497133,{"$f":"SUM(N61:N65)","v":310755854.15317792},null,{"$f":"SUM(P61:P65)","v":207196647.96884307},218326221.70363045,232826309.54471299,250831447.24955544,270679070.45981669,292186763.58846509,311965090.82446343,332645372.20748639,350964161.57776767,null,null,null,null,{"$f":"SUM(AC61:AC65)","v":0},0,0,0,0,0,0,0,0,0,0,0]
[null,"For easements"]
["DRAB0801","Opening value",null,{"$f":"C72","v":0},{"$f":"D72","v":0},0,0,0,0,0,0,0,0,0,null,null,{"$f":"P72","v":0},0,0,0,0,0,0,0,0,0,0,null,null,{"$f":"AC72","v":0},0,0,0,0,0,0,0,0,0,0]
["DRAB0802","Inflation addition"]
["DRAB0805","Actual additions (recognised in RAB)"]
["DRAB0806","Disposals "]
["DRAB0807","Closing value",{"$f":"SUM(C68:C71)","v":0},0,0,0,0,0,0,{"$f":"SUM(J68:J71)","v":0},0,0,0,{"$f":"SUM(N68:N71)","v":0},null,{"$f":"SUM(P68:P71)","v":0},0,0,0,0,0,0,0,0,0,0,0,null,{"$f":"SUM(AC68:AC71)","v":0},0,0,0,0,0,0,0,0,0,0,0]
[null,"For meters"]
["DRAB0901","Opening value",0,{"$f":"C79","v":0},{"$f":"D79","v":0},0,0,0,0,0,0,0,0,-440257.28052261961,null,43631632.079451732,{"$f":"P79","v":41806286.979883805},{"$f":"Q79","v":39591276.083083563},37370254.831759684,34901346.69428397,30865535.99229541,25956281.198292047,20624328.476508498,14804453.772784535,9113209.8850806206,3179691.913524095,-594877.22673721518,null,0,{"$f":"AC79","v":0},{"$f":"AD79","v":0},0,0,0,0,0,0,0,-5107068,-15685933.899997324]
["DRAB0902","Inflation addition",0,0,0,0,0,0,0,0,0,0,4504.9582193012066,2252.4791096506078,null,1515016.1635306,1221570.2652025935,1333647.9684251596,1182537.63516455,717868.87243812182,1017737.9039518937,782262.91018140886,462411.48276588647,358732.17317733273,205281.80345387649,59012.979109650601,2252.4791096506087,null,0,0,0,0,0,0,0,0,0,948651,1541916.6353582931,1579345.9689668543]
["DRAB0903","Straight line depreciation",0,0,0,0,0,0,0,0,0,0,-444762.2387419208,-222381.1193709604,null,-3340361.2630985309,-3436581.1620028419,-3554669.2197490418,-3651445.7726402683,-4753679.5744266836,-5926992.6979552601,-6114215.6319649611,-6282286.1864898503,-6400048.1196456123,-6838943.8925391305,-3833582.1193709606,-222381.1193709604,null,0,0,0,0,0,0,0,0,0,-7663046,-15567287.948387422,-15903430.695115235]
["DRAB0905","Actual additions (recognised in RAB)",0,0,0,0,0,0,0,0,0,0,0,0,null,0,0,0,0,0,0,0,0,0,0,0,0,null,0,0,0,0,0,0,0,0,0,1607327,3446505.4130318058,3386255.9235503124]
["DRAB0906","Disposals ",0,0,0,0,0,0,0,0,0,0,0,0,null,0,0,0,0,0,0,0,0,350072.05876436451,700144.11752872902,0,0,null,0,0,0,0,0,0,0,0,0,0,0,0]
["DRAB0907","Closing value",{"$f":"SUM(C74:C78)","v":0},0,0,0,0,0,0,{"$f":"SUM(J74:J78)","v":0},0,0,-440257.28052261961,{"$f":"SUM(N74:N78)","v":-660385.92078392941},null,{"$f":"SUM(P74:P78)","v":41806286.979883805},39591276.083083563,37370254.831759684,34901346.69428397,30865535.99229541,25956281.198292047,20624328.476508498,14804453.772784535,9113209.8850806206,3179691.913524095,-594877.22673721518,-815005.86699852499,null,{"$f":"SUM(AC74:AC78)","v":0},0,0,0,0,0,0,0,0,-5107068,-15685933.899997324,-26623762.702595394]
[null,"For “other” asset items with long lives"]
["DRAB1001","Opening value",27191498.590118885,{"$f":"C86","v":24207855.924139295},{"$f":"D86","v":22551559.707523171},22699308.870382145,23685853.564047132,25401719.455265023,26656587.168725599,27514780.432795193,29726036.584173169,27654000.778546374,23982116.744101744,29374761.886554588,null,56087330.863698587,{"$f":"P86","v":46568429.696772672},{"$f":"Q86","v":37851578.639064014},33783133.297903061,34053445.521412171,35289591.715232961,36063751.624982178,36366124.821571708,40591303.501455925,41339236.401351251,37735889.397612244,42715466.540065087,null,6340519.9520409722,{"$f":"AC86","v":7303123.8301609773},{"$f":"AD86","v":8022901.9939952679},9463750.7785888929,10567611.705449417,10760971.903303219,11000894.263414163,11429468.921867965,12413834.19388058,13223290.449524999,13537825.205169417,13900015.867410306]
["DRAB1002","Inflation addition",940262.78064995946,718022.17141827871,769666.45322210982,703342.20777073188,535221.50552481599,918590.79256111733,834010.91731803445,649248.49611554702,736166.71101102815,602242.42192184413,542934.46510702372,1077731.5452273432,null,1931897.3560457863,1401174.3479831447,1235039.5591089935,1058323.7547178306,745484.25164666574,1234346.7510122689,1099813.455613683,399661.69782064331,483217.58280001581,749991.79238150257,600570.96510702372,1077731.5452273432,null,0,0,0,0,0,0,0,0,0,0,0,0]
["DRAB1003","Straight line depreciation",-6058834.2549670963,-5040477.3628198914,-4251773.2884126613,-3863297.2913359972,-3897665.0258925445,-4148562.3846050519,-4556465.3433090523,-5077270.8225225955,-5782494.9806533176,-6138356.4792409595,-6445590.7731140945,-6361869.0028919876,null,-13585727.33130924,-12784184.380477291,-8933340.898319466,-4934511.3084389642,-4587647.4694114933,-4945026.1467675548,-5378087.9490847616,-2813761.4957214519,-3534810.3928219266,-7042802.06489674,-6916295.2731140945,-6361869.0028919876,null,-341396.12187999499,-396721.8361657093,-465822.90331797441,-547141.16105107614,-603082.76214619842,-641432.42488905555,-687078.31654619845,-692704.97798738489,-661324.3188979621,-669554.8188979621,-713985.62775910995,-762025.02209969331]
["DRAB1005","Actual additions (recognised in RAB)",2134928.8083375455,2666158.9747854886,3629855.9980495228,4175531.3572302484,5611966.0915856156,5185934.7755045099,4777118.0600606119,6744549.8477850258,1343137.2538218908,160133.44268088415,11530976.110697962,9796041.160617698,null,2134928.8083375455,2666158.9747854886,3629855.9980495228,4175531.3572302484,5611966.0915856156,5185934.7755045099,4777118.0600606119,6744549.8477850258,5784854.8913346101,4601851.0801936034,11530976.110697962,9796041.160617698,null,1304000,1116500,1906671.6879115994,1651002.0879115993,796442.9600000002,881354.78500000015,1115652.9750000001,1677070.25,1470780.5745423799,984089.57454237994,1076176.29,1005992.0148716241]
["DRAB1006","Disposals ",0,0,0,-29031.579999999994,-533656.68000000005,-701095.47,-196470.37,-105271.37000000001,1631155.2101936028,1704096.5801936029,-235674.66023804655,-203344.66023804655,null,0,0,0,-29031.579999999994,-533656.68000000005,-701095.47,-196470.37,-105271.37000000001,-1985329.1814173679,-1912387.8114173678,-235674.66023804655,-203344.66023804655,null,0,0,0,0,0,0,0,0,0,0,0,0]
["DRAB1007","Closing value",{"$f":"SUM(C81:C85)","v":24207855.924139295},22551559.707523171,22699308.870382145,23685853.564047132,25401719.455265023,26656587.168725599,27514780.432795193,{"$f":"SUM(J81:J85)","v":29726036.584173169},27654000.778546374,23982116.744101744,29374761.886554588,{"$f":"SUM(N81:N85)","v":33683320.929269589},null,{"$f":"SUM(P81:P85)","v":46568429.696772672},37851578.639064014,33783133.297903061,34053445.521412171,35289591.715232961,36063751.624982178,36366124.821571708,40591303.501455925,41339236.401351251,37735889.397612244,42715466.540065087,47024025.582780086,null,{"$f":"SUM(AC81:AC85)","v":7303123.8301609773},8022901.9939952679,9463750.7785888929,10567611.705449417,10760971.903303219,11000894.263414163,11429468.921867965,12413834.19388058,13223290.449524999,13537825.205169417,13900015.867410306,14143982.860182237]
[null,"For “other” asset items with short lives"]
["DRAB1101","Opening value",22935783.292194612,{"$f":"C93","v":17906685.185497716},{"$f":"D93","v":13390821.537806001},7249393.4132860331,1053820.2874361682,102888.82826725021,4778579.5086431224,9477400.1514080241,14699207.293905381,25037710.421043769,45805854.978929237,47480637.837365195,null,22935783.292194612,{"$f":"P93","v":17906685.185497716},{"$f":"Q93","v":13390821.537806001},7249393.4132860331,1053820.2874361682,102888.82826725021,4778579.5086431224,9477400.1514080241,14699207.293905381,26834288.912519276,32571899.418480545,28218612.456456661,null,0,{"$f":"AC93","v":0},{"$f":"AD93","v":0},0,0,0,0,0,0,0,0,0]
["DRAB1102","Inflation addition",783839.60841106228,537773.27808033535,415401.19639145245,289428.48124435812,25352.973477828637,67451.723392218453,160857.14405607653,237109.20507817663,372204.89832722902,511929.33429015882,505022.58135192504,618912.72235642036,null,783839.60841106228,537773.27808033535,415401.19639145245,289428.48124435812,25352.973477828637,67451.723392218453,160857.14405607653,237109.20507817663,372204.89832722902,625819.47529465414,618912.72235642036,222646.58135192501,null,0,0,0,0,0,0,0,0,0,0,0,0]
["DRAB1103","Straight line depreciation",-9789469.7354355641,-9127054.9840747714,-9256642.3607128207,-10219533.880975341,-5359118.3602107214,-332758.75444948947,-1194639.6844865065,-2208552.1822429532,-3474121.2516503627,-6016819.5282872897,-9803889.5286472701,-13490557.659121169,null,-9789469.7354355641,-9127054.9840747714,-9256642.3607128207,-10219533.880975341,-5359118.3602107214,-332758.75444948947,-1194639.6844865065,-2208552.1822429532,-3474121.2516503627,-9703487.6587611884,-13490557.659121169,-5921905.0286472701,null,0,0,0,0,0,0,0,0,0,0,0,0]
["DRAB1105","Actual additions (recognised in RAB)",3976532.0203276058,4073418.0583027182,2699813.0398014011,3734532.2738811183,4382833.9275639746,4940997.7114331434,5732603.183195333,7193250.1196621321,2641376.7575216535,4674949.3060028693,10973649.8057313,8518357.9747408628,null,3976532.0203276058,4073418.0583027182,2699813.0398014011,3734532.2738811183,4382833.9275639746,4940997.7114331434,5732603.183195333,7193250.1196621321,15345701.174458649,14923981.891949426,8518357.9747408628,4393418.8057313012,null,0,0,0,0,0,0,0,0,0,0,0,0]
["DRAB1106","Disposals ",0,0,0,0,0,0,0,0,10799042.722939866,21598085.445879731,0,0,null,0,0,0,0,0,0,0,0,-108703.20252162189,-108703.20252162189,0,0,null,0,0,0,0,0,0,0,0,0,0,0,0]
["DRAB1107","Closing value",{"$f":"SUM(C88:C92)","v":17906685.185497716},13390821.537806001,7249393.4132860331,1053820.2874361682,102888.82826725021,4778579.5086431224,9477400.1514080241,{"$f":"SUM(J88:J92)","v":14699207.293905381},25037710.421043769,45805854.978929237,47480637.837365195,{"$f":"SUM(N88:N92)","v":43127350.875341311},null,{"$f":"SUM(P88:P92)","v":17906685.185497716},13390821.537806001,7249393.4132860331,1053820.2874361682,102888.82826725021,4778579.5086431224,9477400.1514080241,14699207.293905381,26834288.912519276,32571899.418480545,28218612.456456661,26912772.814892616,null,{"$f":"SUM(AC88:AC92)","v":0},0,0,0,0,0,0,0,0,0,0,0]
[]
[]
[]
[]
[null,"3.3.3 - TOTAL DISAGGREGATED RAB ASSET VALUES"]
[null,null,"Network services",null,null,null,null,null,null,null,null,null,null,null,null,"Standard control services",null,null,null,null,null,null,null,null,null,null,null,null,"Alternative control services"]
[null,null,"$0's, Nominal",null,null,null,null,null,null,null,null,null,null,null,null,"$0's, Nominal",null,null,null,null,null,null,null,null,null,null,null,null,"$0's, Nominal"]
[null,null,{"$f":"dms_y1","v":"2006-07"},{"$f":"dms_y2","v":"2007-08"},{"$f":"dms_y3","v":"2008-09"},{"$f":"dms_y4","v":"2009-10"},{"$f":"dms_y5","v":"2010-11"},{"$f":"dms_y6","v":"2011-12"},{"$f":"dms_y7","v":"2012-13"},{"$f":"dms_y8","v":"2013-14"},{"$f":"dms_y9","v":"2014-15"},{"$f":"dms_y10","v":"2015-16"},{"$f":"dms_y11","v":"2016-17"},{"$f":"dms_y12","v":"2017-18"},null,{"$f":"dms_y1","v":"2006-07"},{"$f":"dms_y2","v":"2007-08"},{"$f":"dms_y3","v":"2008-09"},{"$f":"dms_y4","v":"2009-10"},{"$f":"dms_y5","v":"2010-11"},{"$f":"dms_y6","v":"2011-12"},{"$f":"dms_y7","v":"2012-13"},{"$f":"dms_y8","v":"2013-14"},{"$f":"dms_y9","v":"2014-15"},{"$f":"dms_y10","v":"2015-16"},{"$f":"dms_y11","v":"2016-17"},{"$f":"dms_y12","v":"2017-18"},null,{"$f":"dms_y1","v":"2006-07"},{"$f":"dms_y2","v":"2007-08"},{"$f":"dms_y3","v":"2008-09"},{"$f":"dms_y4","v":"2009-10"},{"$f":"dms_y5","v":"2010-11"},{"$f":"dms_y6","v":"2011-12"},{"$f":"dms_y7","v":"2012-13"},{"$f":"dms_y8","v":"2013-14"},{"$f":"dms_y9","v":"2014-15"},{"$f":"dms_y10","v":"2015-16"},{"$f":"dms_y11","v":"2016-17"},{"$f":"dms_y12","v":"2017-18"}]
["DRAB1201","Overhead network assets less than 33kV (wires and poles)",82640061.477532923,87636733.332797796,92915180.102681637,100127656.00159442,108441460.55881679,116958616.95202339,125461501.79074883,133767341.38711685,140783503.04961735,146473387.23805434,153746185.67038238,154278180.17396826,null,101850761.20309652,108008970.94836846,114514457.6562753,123403562.3753342,133650013.15849435,144147087.41550893,154626572.51949686,164924586.30420563,173438682.11308426,180251424.13157284,184030025.89632913,185551054.76596713,null,0,0,0,0,0,0,0,0,0,0,0,0]
["DRAB1202","Underground network assets less than 33kV (cables)",417746838.62542611,443005095.14007092,469687728.3756603,506146909.93437725,548173325.55694449,591227687.9778595,634209907.46155739,676196060.07902515,711662870.01831007,740425325.70614898,777189438.64053953,779878679.71372104,null,514857234.41474092,545987083.62690592,578872423.46521974,623806990.64976573,675602963.99811435,728665843.03380275,781639808.61831987,833696433.76800811,876735324.88596761,911173846.3104825,930274738.94571543,937963563.26730657,null,0,0,0,0,0,0,0,0,0,0,0,0]
["DRAB1203","Distribution substations including transformers",14892238.327052353,15792668.781486485,16743876.777806051,18043608.507119104,19541806.314055026,21076649.350333422,22608920.566276371,24105683.039148062,25370037.757077344,26395389.073618345,27705991.287875988,27801860.099526729,null,18354122.47412926,19463869.073476829,20636197.079476181,22238067.451103877,24084539.783541799,25976175.980045918,27864642.504914269,29720406.801735934,31254698.302228689,32482395.624910735,33163322.490376223,33437421.028080519,null,0,0,0,0,0,0,0,0,0,0,0,0]
["DRAB1204","Overhead network assets 33kV and above (wires and towers / poles etc) ",6702166.1762984497,7107399.7216718774,7535485.4076212421,8120422.1943660453,8794677.497466471,9485424.7751934174,10175014.619975412,10848623.959238451,11417639.525552336,11879093.048384266,12468922.034334829,12512067.179233128,null,8260167.2186706383,8759602.2907577269,9287201.7648450769,10008114.309202857,10839108.558701001,11690428.545370938,12540322.039557967,13375498.08416551,14065997.146385398,14618515.488872584,14924962.70694897,15048318.950816095,null,0,0,0,0,0,0,0,0,0,0,0,0]
["DRAB1205","Underground network assets 33kV and above(cables, ducts etc)",82124633.063707352,87090140.534499139,92335665.481753379,99503156.963352501,107765108.08509611,116229142.73163936,124678994.83579263,132933030.67436925,139905432.33703196,145559828.42852888,152787266.21018672,153315942.77635226,null,101215515.10870546,107335315.9246487,113800227.72693388,122633890.84704238,132816434.22524565,143248037.93156886,153662162.18891317,163895946.96875781,172356940.11992452,179127191.04661959,182882225.56470078,184393767.56007981,null,0,0,0,0,0,0,0,0,0,0,0,0]
["DRAB1206","Zone substations and transformers",162788497.10844612,172631189.46999255,183028936.0516541,197236429.25801027,213613374.34887904,230390891.98497903,247140296.80431855,263501552.11974639,277322335.7940042,288530551.83944893,302856871.36781979,303904820.95628893,null,200630687.45551327,212761434.83623672,225576265.62417167,243086465.54395992,263270433.1483376,283948091.31779242,304591101.50011587,324876640.46562779,341648129.21072602,355068207.30415571,362511484.71051669,365507682.37812412,null,0,0,0,0,0,0,0,0,0,0,0,0]
["DRAB1207","Easements ",0,0,0,0,0,0,0,0,0,0,0,0,null,0,0,0,0,0,0,0,0,0,0,0,0,null,0,0,0,0,0,0,0,0,0,0,0,0]
["DRAB1208","Meters",0,0,0,0,0,0,0,0,0,0,220128.64026131033,110064.3201306554,null,42718959.529667765,40698781.53148368,38480765.457421616,36979556.942414358,34570953.702074766,30098420.954078805,24977817.196185347,19401903.483431589,13317331.450292304,7068697.3845075015,2107413.3201306551,110064.32013065544,null,0,0,0,0,0,0,0,0,0,60531766.5,115774100.09638028,103503758.25455119]
["DRAB1209","“Other” assets with long lives",25699677.257129088,23379707.815831222,22625434.288952649,24996644.642712608,28151913.360652022,29637280.162991256,30693810.651756339,32257162.428704035,32162897.337829396,29405048.051020931,49211357.683958441,73227261.313168898,null,51327880.280235633,42210004.167918339,35817355.968483537,35798872.566362977,38432684.93173328,39437837.983518288,39976104.536687672,40933075.559565261,40193634.076736197,36888371.084662154,52837665.183958441,73227261.313168898,null,6821821.8911009748,7663012.9120781217,8743326.3862920795,10015681.242019154,10664291.804376315,10880933.08335869,11215181.592641063,11962507.119809147,11454065.752228867,10569853.5933537,10908216.133301321,11211294.762988608]
["DRAB1210","“Other” assets with short lives",20421234.238846168,15648753.36165186,10320107.475546019,5062234.7377605811,2399610.3326506671,4261989.9432541439,8949245.6048245318,13925216.776915234,22615728.87959579,34608172.065784045,41374055.356792577,40074620.131366551,null,20421234.238846168,15648753.36165186,10320107.475546019,5062234.7377605811,2399610.3326506671,4261989.9432541439,8949245.6048245318,13925216.776915234,22615728.87959579,34608172.065784045,41374055.356792577,40074620.131366551,null,0,0,0,0,0,0,0,0,0,0,0,0]
["DRAB13","Value of Capital Contributions or Contributed Assets (included in the above)",0,0,0,0,0,0,0,0,0,0,0,0,null,0,0,0,0,0,0,0,0,0,0,0,0,null,0,0,0,0,0,0,0,0,0,0,0,0]
[]
[]
[null,"3.3.4 - ASSET LIVES"]
[null,null,"Network services",null,null,null,null,null,null,null,null,null,null,null,null,"Standard control services",null,null,null,null,null,null,null,null,null,null,null,null,"Alternative control services"]
[null,null,"Service Life (Years)",null,null,null,null,null,null,null,null,null,null,null,null,"Service Life (Years)",null,null,null,null,null,null,null,null,null,null,null,null,"Service Life (Years)"]
[null,null,{"$f":"dms_y1","v":"2006-07"},{"$f":"dms_y2","v":"2007-08"},{"$f":"dms_y3","v":"2008-09"},{"$f":"dms_y4","v":"2009-10"},{"$f":"dms_y5","v":"2010-11"},{"$f":"dms_y6","v":"2011-12"},{"$f":"dms_y7","v":"2012-13"},{"$f":"dms_y8","v":"2013-14"},{"$f":"dms_y9","v":"2014-15"},{"$f":"dms_y10","v":"2015-16"},{"$f":"dms_y11","v":"2016-17"},{"$f":"dms_y12","v":"2017-18"},null,{"$f":"dms_y1","v":"2006-07"},{"$f":"dms_y2","v":"2007-08"},{"$f":"dms_y3","v":"2008-09"},{"$f":"dms_y4","v":"2009-10"},{"$f":"dms_y5","v":"2010-11"},{"$f":"dms_y6","v":"2011-12"},{"$f":"dms_y7","v":"2012-13"},{"$f":"dms_y8","v":"2013-14"},{"$f":"dms_y9","v":"2014-15"},{"$f":"dms_y10","v":"2015-16"},{"$f":"dms_y11","v":"2016-17"},{"$f":"dms_y12","v":"2017-18"},null,{"$f":"dms_y1","v":"2006-07"},{"$f":"dms_y2","v":"2007-08"},{"$f":"dms_y3","v":"2008-09"},{"$f":"dms_y4","v":"2009-10"},{"$f":"dms_y5","v":"2010-11"},{"$f":"dms_y6","v":"2011-12"},{"$f":"dms_y7","v":"2012-13"},{"$f":"dms_y8","v":"2013-14"},{"$f":"dms_y9","v":"2014-15"},{"$f":"dms_y10","v":"2015-16"},{"$f":"dms_y11","v":"2016-17"},{"$f":"dms_y12","v":"2017-18"}]
[null,"ESTIMATED SERVICE LIFE OF NEW ASSETS"]
["DRAB1401","Overhead network assets less than 33kV (wires and poles)",49.1,49.1,49.1,49.1,49.1,49.1,49.1,49.1,49.1,49.05,49,49.15,null,49.1,49.1,49.1,49.1,49.1,49.1,49.1,49.1,49.1,49.05,49,49.15,null,0,0,0,0,0,0,0,0,0,0,0,0]
["DRAB1402","Underground network assets less than 33kV (cables)",49.1,49.1,49.1,49.1,49.1,49.1,49.1,49.1,49.1,49.05,49,49.15,null,49.1,49.1,49.1,49.1,49.1,49.1,49.1,49.1,49.1,49.05,49,49.15,null,0,0,0,0,0,0,0,0,0,0,0,0]
["DRAB1403","Distribution substations including transformers",49.1,49.1,49.1,49.1,49.1,49.1,49.1,49.1,49.1,49.05,49,49.15,null,49.1,49.1,49.1,49.1,49.1,49.1,49.1,49.1,49.1,49.05,49,49.15,null,0,0,0,0,0,0,0,0,0,0,0,0]
["DRAB1404","Overhead network assets 33kV and above (wires and towers / poles etc) ",49.1,49.1,49.1,49.1,49.1,49.1,49.1,49.1,49.1,49.05,49,49.15,null,49.1,49.1,49.1,49.1,49.1,49.1,49.1,49.1,49.1,49.05,49,49.15,null,0,0,0,0,0,0,0,0,0,0,0,0]
["DRAB1405","Underground network assets 33kV and above(cables, ducts etc)",49.1,49.1,49.1,49.1,49.1,49.1,49.1,49.1,49.1,49.05,49,49.15,null,49.1,49.1,49.1,49.1,49.1,49.1,49.1,49.1,49.1,49.05,49,49.15,null,0,0,0,0,0,0,0,0,0,0,0,0]
["DRAB1406","Zone substations and transformers",49.1,49.1,49.1,49.1,49.1,49.1,49.1,49.1,49.1,49.05,49,49.15,null,49.1,49.1,49.1,49.1,49.1,49.1,49.1,49.1,49.1,49.05,49,49.15,null,0,0,0,0,0,0,0,0,0,0,0,0]
["DRAB1407","Meters",0,0,0,0,0,0,0,0,0,0,0,0,null,0,0,0,0,0,0,0,0,0,0,0,0,null,0,0,0,0,0,0,0,0,0,7,14,14.5]
["DRAB1408","“Other” assets with long lives",11.7,11.7,11.7,11.7,11.7,11.7,11.7,11.7,11.7,11.85,12,11.9,null,11.7,11.7,11.7,11.7,11.7,11.7,11.7,11.7,11.7,11.85,12,11.9,null,23,23,23,23,23,23,23,23,23.75,23.75,25,24.5]
["DRAB1409","“Other” assets with short lives",6,6,6,6,6,6,6,6,6,6,6,6,null,6,6,6,6,6,6,6,6,6,6,6,6,null,0,0,0,0,0,0,0,0,0,0,0,0]
[]
[null,"ESTIMATED RESIDUAL SERVICE LIFE"]
["DRAB1501","Overhead network assets less than 33kV (wires and poles)",22.566276784502875,22.408361666292162,22.241571658293182,22.062479028134355,21.87381006973693,22.22301077259014,22.759055458512542,22.794752641495503,22.667625558022088,22.7978381084035,22,20.5,null,22.566276784502875,22.408361666292162,22.241571658293182,22.062479028134355,21.87381006973693,22.22301077259014,22.759055458512542,22.794752641495503,22.667625558022088,22.7978381084035,22,20.5,null,0,0,0,0,0,0,0,0,0,0,0,0]
["DRAB1502","Underground network assets less than 33kV (cables)",22.566276784502875,22.408361666292162,22.241571658293182,22.062479028134355,21.87381006973693,22.22301077259014,22.759055458512542,22.794752641495503,22.667625558022088,22.7978381084035,22,20.5,null,22.566276784502875,22.408361666292162,22.241571658293182,22.062479028134355,21.87381006973693,22.22301077259014,22.759055458512542,22.794752641495503,22.667625558022088,22.7978381084035,22,20.5,null,0,0,0,0,0,0,0,0,0,0,0,0]
["DRAB1503","Distribution substations including transformers",22.566276784502875,22.408361666292162,22.241571658293182,22.062479028134355,21.87381006973693,22.22301077259014,22.759055458512542,22.794752641495503,22.667625558022088,22.7978381084035,22,20.5,null,22.566276784502875,22.408361666292162,22.241571658293182,22.062479028134355,21.87381006973693,22.22301077259014,22.759055458512542,22.794752641495503,22.667625558022088,22.7978381084035,22,20.5,null,0,0,0,0,0,0,0,0,0,0,0,0]
["DRAB1504","Overhead network assets 33kV and above (wires and towers / poles etc) ",22.566276784502875,22.408361666292162,22.241571658293182,22.062479028134355,21.87381006973693,22.22301077259014,22.759055458512542,22.794752641495503,22.667625558022088,22.7978381084035,22,20.5,null,22.566276784502875,22.408361666292162,22.241571658293182,22.062479028134355,21.87381006973693,22.22301077259014,22.759055458512542,22.794752641495503,22.667625558022088,22.7978381084035,22,20.5,null,0,0,0,0,0,0,0,0,0,0,0,0]
["DRAB1505","Underground network assets 33kV and above (cables, ducts etc)",22.566276784502875,22.408361666292162,22.241571658293182,22.062479028134355,21.87381006973693,22.22301077259014,22.759055458512542,22.794752641495503,22.667625558022088,22.7978381084035,22,20.5,null,22.566276784502875,22.408361666292162,22.241571658293182,22.062479028134355,21.87381006973693,22.22301077259014,22.759055458512542,22.794752641495503,22.667625558022088,22.7978381084035,22,20.5,null,0,0,0,0,0,0,0,0,0,0,0,0]
["DRAB1506","Zone substations and transformers",22.566276784502875,22.408361666292162,22.241571658293182,22.062479028134355,21.87381006973693,22.22301077259014,22.759055458512542,22.794752641495503,22.667625558022088,22.7978381084035,22,20.5,null,22.566276784502875,22.408361666292162,22.241571658293182,22.062479028134355,21.87381006973693,22.22301077259014,22.759055458512542,22.794752641495503,22.667625558022088,22.7978381084035,22,20.5,null,0,0,0,0,0,0,0,0,0,0,0,0]
["DRAB1507","Meters",13.228735201782079,11.635895642545389,10.043056083308695,8.4502165240720046,6.8573769648353116,5.6066383081112079,4.6706716232564061,3.6583527112042815,2.5823559263091007,1.5185151228585001,0.5,0,null,13.228735201782079,11.635895642545389,10.043056083308695,8.4502165240720046,6.8573769648353116,5.6066383081112079,4.6706716232564061,3.6583527112042815,2.5823559263091007,1.5185151228585001,0.5,0,null,0,0,0,0,0,0,0,0,0,4,7.5,6.5]
["DRAB1508","“Other” assets with long lives",6.9803979377815839,7.244419430250236,7.2526174721432533,7.1797772958845183,7.1792817382106531,6.8446969662462074,6.3074499198382883,5.8584425793881518,5.8212587148840047,5.5179896430175006,7.5,11.5,null,6.13700632093345,7.165574269484118,7.8431754865947614,8.3004922329980886,8.6803503733292757,8.4605992643533092,7.8017337021179101,7.1124940926019704,6.379985028805379,5.5179896430175006,7.5,11.5,null,18.557857809983268,18.427708368890201,17.300821344300417,17.243371548132391,17.537139070075749,16.785022510449245,16.029071378869006,15.175156829069625,15.302440867578643,15.4,15,14.5]
["DRAB1509","“Other” assets with short lives",2.9217524305937905,3.4225991115095953,3.9234457924254,4.4242924733412048,4.9251391542570087,5.5674094283696594,5.7862173748841172,5.320300939284774,4.8938213039458613,4.8801095585330003,4.5,3.5,null,2.9217524305937905,3.4225991115095953,3.9234457924254,4.4242924733412048,4.9251391542570087,5.5674094283696594,5.7862173748841172,5.320300939284774,4.8938213039458613,4.8801095585330003,4.5,3.5,null,0,0,0,0,0,0,0,0,0,0,0,0]

{"sheet":"3.4 Operational data","index":11,"n_rows":126,"n_cols":15,"rows_kept":126,"cut":false,"hidden":false,"merged":[[47,3,47,14],[68,3,68,14],[69,3,69,14],[8,3,8,14],[9,3,9,14],[46,3,46,14]]}
[null,{"$f":"INDEX(dms_Worksheet_List,MATCH(dms_Model,dms_Model_List))","v":"HISTORICAL ECONOMIC BENCHMARKING - FINANCIAL YEARS"}]
[null,{"$f":"INDEX(dms_TradingNameFull_List,MATCH(dms_TradingName,dms_TradingName_List))","v":"CitiPower"}]
[null,{"$f":"dms_Header_Span","v":"2006-07 to 2018-19"}]
[null,"3.4 OPERATIONAL DATA"]
[]
[null,"There are THREE tables on this worksheet. Each table has been grouped for ease of navigation. See the Instructions sheet on how to group or ungroup tables. "]
[]
[null," 3.4.1 - ENERGY DELIVERY"]
[null,null,null,"Standard control services"]
[null,null,null,"VOLUMES (0's) \n(GWh)"]
[null,null,"Units",{"$f":"dms_y1","v":"2006-07"},{"$f":"dms_y2","v":"2007-08"},{"$f":"dms_y3","v":"2008-09"},{"$f":"dms_y4","v":"2009-10"},{"$f":"dms_y5","v":"2010-11"},{"$f":"dms_y6","v":"2011-12"},{"$f":"dms_y7","v":"2012-13"},{"$f":"dms_y8","v":"2013-14"},{"$f":"dms_y9","v":"2014-15"},{"$f":"dms_y10","v":"2015-16"},{"$f":"dms_y11","v":"2016-17"},{"$f":"dms_y12","v":"2017-18"}]
["DOPED01","Total energy delivered","GWh",6027.1454399278336,6089.4475364404752,6098.0343994982095,6153.0915090475964,6157.380816624518,6095.0903486056286,6033.2425361128699,5950.3785106866699,5931.7875671930051,5910.5865311111502,5897.16,5870.5444858887222]
[]
[null," 3.4.1.1 - Energy grouping - delivery by chargeable quantity"]
["DOPED0201","Energy Delivery where time of use is not a determinant","GWh",1602.9878153325051,1590.3884010399997,1597.6124407826073,1604.2693450175277,1543.8342503390379,1466.9820688789778,1427.8091297172725,1359.5696435889331,1354.5171355416555,1388.8648149626401,1327.875,1260.068983522418]
["DOPED0202","Energy Delivery at On-peak times","GWh",2556.3756960226815,2585.90358223167,2569.2362175231865,2620.0966712808131,2661.7311613182201,2644.1722064710871,2620.7386796142519,2605.9872947455387,2600.673160815963,2557.7556325019,2567.17,2577.145790740502]
["DOPED0203","Energy Delivery at Shoulder times ","GWh",0,0,0,0,0,0,1.1835104842429858E-2,0.63955300395329828,1.7213103730006232,2.5935924738897551,2.6850000000000001,2.3234368666067153]
["DOPED0204","Energy Delivery at Off-peak times","GWh",1747.1730450526447,1801.8516077688037,1828.8489110370683,1830.9538749966305,1858.1086755121623,1892.8635688380946,1897.0706493968737,1895.6280947908494,1877.096166661649,1856.2497662494,1895.845,1931.6934717495333]
["DOPED0205","Controlled load energy deliveries","GWh",67.107240815000011,62.94056028,60.543544070364703,56.333377877901789,53.175812539992108,51.225721404537836,48.251408071270767,50.508608817651208,61.784041967963759,67.661103579500491,64.055000000000007,61.291852161359927]
["DOPED0206","Energy Delivery to unmetered supplies","GWh",53.501642704999995,48.363385119999997,41.793286084982,41.438239874723578,40.530916915106033,39.846783012931297,39.360834208357844,38.044523992620327,35.994960085648614,36.961621343819303,39.03,38.020950848303414]
[]
[null," 3.4.1.2 - Energy - received from TNSP and other DNSPs by time of receipt"]
["DOPED0301","Energy into DNSP network at On-peak times","GWh",0,0,0,3584.8805589999997,3567.8322749999998,3473.450151,3464.528139,3439.1920479999999,3401.4426129999997,3480.7042769999998,3578.08554,3564.8739989999999]
["DOPED0302","Energy into DNSP network at Shoulder times ","GWh",0,0,0,0,0,0,0,0,0,0,0,0]
["DOPED0303","Energy into DNSP network at Off-peak times","GWh",0,0,0,2651.8506179999999,2651.914002,2631.5782469999999,2649.4604079999999,2605.804893,2585.6542020000002,2627.3398859999998,2730.5140289999999,2762.2339689999999]
["DOPED0304","Energy received from TNSP and other DNSPs not included in the above categories","GWh",0,0,0,0,0,0,0,0,0,0,0,0]
[]
[null," 3.4.1.3 - Energy - received into DNSP system from embedded generation by time of receipt"]
["DOPED0401","Energy into DNSP network at On-peak times from non-residential embedded generation","GWh",0,0,0,0,0,0,32.720887820000002,25.236098010000003,25.844429609999999,21.116625190000001,12.45232184,20.185168619999999]
["DOPED0402","Energy into DNSP network at Shoulder times from non-residential embedded generation","GWh",0,0,0,0,0,0,0,0,0,0,0,0]
["DOPED0403","Energy into DNSP network at Off-peak times from non-residential embedded generation","GWh",0,0,0,0,0,0,7.9848366619999993,1.5196902569999999,4.0013303630000001,2.5534420820000001,2.7500115580000002,8.9384540140000013]
["DOPED0404","Energy received from embedded generation not included in above categories from non-residential embedded generation","GWh",0,0,0,0,0,0,0,0,0,0,0,0]
["DOPED0405","Energy into DNSP network at On-peak times from residential embedded generation","GWh",0,0,0,0,0,0,0,0,9.9409223000000004,10.22485779,11.382556269999998,13.494899050000001]
["DOPED0406","Energy into DNSP network at Shoulder times from residential embedded generation","GWh",0,0,0,0,0,0,0,0,0,0,0,0]
["DOPED0407","Energy into DNSP network at Off-peak times from residential embedded generation","GWh",0,0,0,0,0,0,0,0,4.6326565610000001,4.793772057,4.6677409750000001,5.5568651449999997]
["DOPED0408","Energy received from embedded generation not included in above categories from residential embedded generation","GWh",0,0,0,0,0,0,0,0,0,0,0,0]
[]
[null," 3.4.1.4 - Energy grouping  - customer type or class"]
["DOPED0501","Residential customers energy deliveries","GWh",1283.3550498525055,1277.0886636450002,1308.0827625027339,1347.5238169035008,1318.7654505963703,1275.2377274136857,1278.2068268011208,1235.1526473221502,1225.0878787534514,1239.2248107268451,1247.1300000000001,1249.5717964448468]
["DOPED0502","Non residential customers not on demand tariffs energy deliveries","GWh",2028.0951129083633,2053.8888618592155,2097.4333552351877,2169.8831268180274,2157.61676514172,2106.4995440618104,2019.5767330638894,1918.3034822381164,1870.2049307233297,1831.6990071653199,1253.425,694.16936755369829]
["DOPED0503","Non-residential low voltage demand tariff customers energy deliveries","GWh",2008.6679050591547,2050.3421527350224,2043.9003561563945,2038.6597467064096,2047.4514380310732,2050.466527411952,2070.854631768309,2125.2724606555976,2137.7267427815696,2112.8162601826052,2644.67,3162.8342175139478]
["DOPED0504","Non-residential high voltage demand tariff customers energy deliveries","GWh",707.02737210780901,708.12785820123599,648.61792560389301,597.02481861965828,633.54716285535437,662.88654971818096,664.60434447955026,671.64992047080591,698.7680149346545,726.84645303638001,751.94,763.97410437623057]
["DOPED0505","Other Customer Class Energy Deliveries","GWh",0,0,0,0,0,0,0,0,0,0,0,0]
[]
[]
[null," 3.4.2 -  CUSTOMER NUMBERS"]
[null,null,null,"Standard control services"]
[null,null,null,"VOLUMES (0's)"]
[null,null,null,{"$f":"dms_y1","v":"2006-07"},{"$f":"dms_y2","v":"2007-08"},{"$f":"dms_y3","v":"2008-09"},{"$f":"dms_y4","v":"2009-10"},{"$f":"dms_y5","v":"2010-11"},{"$f":"dms_y6","v":"2011-12"},{"$f":"dms_y7","v":"2012-13"},{"$f":"dms_y8","v":"2013-14"},{"$f":"dms_y9","v":"2014-15"},{"$f":"dms_y10","v":"2015-16"},{"$f":"dms_y11","v":"2016-17"},{"$f":"dms_y12","v":"2017-18"}]
[null," 3.4.2.1 - Distribution customer numbers by customer type or class"]
["DOPCN0101","Residential customer numbers",null,247405.26069188101,250350.70858167839,252542.8282146077,255211.76981856202,258435.49000150262,262093.14340675165,266046.22460463049,269673.85588577797,272425.8867570397,276120.73340500752,279940.5,282310.5]
["DOPCN0102","Non residential customers not on demand tariff customer numbers",null,44465.54094876162,45910.639493751725,47557.819731223863,48847.509633805814,50186.143167276052,51384.505263767503,51814.401897961485,51715.505489156298,51465.093409721652,51322.713034824948,49905,47068.5]
["DOPCN0103","Low voltage demand tariff customer numbers",null,1256.8926241516617,1297.510792053793,1336.3629526558314,1374.4582529864015,1419.6175825173425,1482.4369850492099,1579.8196733114623,1688.3029788885829,1773.2235093646848,1842.5956309619401,3615.5,7103]
["DOPCN0104","High voltage demand tariff customer numbers",null,76.695174175452649,76.190600661140479,77.452034446920948,81.488622561418453,84.516063647291588,83.506916618667219,82.497769590042822,84.01149013297939,86.959813226594932,92.323351267215003,97.5,100]
["DOPCN0105","Unmetered Customer Numbers",null,4257.0867402519343,3916.4996180912076,3053.9311953745209,2564.7471732488539,2181.5235891287471,1497.8264772357318,1166.5739650897799,1164.8079577896872,1160.9997742211506,2610.2219387048849,4176.5,4452.5]
["DOPCN0106","Other Customer Numbers",null,0,0,0,0,0,0,0,0,0,0,0,0]
["DOPCN01",null,"Total customer numbers",{"$f":"SUM(D51:D56)","v":297461.47617922164},301551.54908623628,304568.39412830881,308079.97350116458,312307.29040407203,316541.41904942278,320689.51791058335,324326.48380174546,326912.16326357378,331988.58736076648,337735,341034.5]
[]
[null," 3.4.2.2 - Distribution customer numbers by location on the network"]
["DOPCN0201","Customers on CBD network",null,49704.500382157843,50804.149794899946,51880.332289254235,52464.841630138391,53389.747670006764,54644.039999594941,57098.71992331458,58989.992118834751,59460.287388240809,60383.632323625949,61849.5,63127.747575011643]
["DOPCN0202","Customers on Urban network",null,247756.97579706379,250747.3992913363,252688.06183905463,255615.13187102618,258917.54273406533,261897.37904982781,263590.79798726871,265336.49168291077,267451.87587533292,271604.95503714052,275885.5,277906.75242498837]
["DOPCN0203","Customers on Short rural network",null,0,0,0,0,0,0,0,0,0,0,0,0]
["DOPCN0204","Customers on Long rural network",null,0,0,0,0,0,0,0,0,0,0,0,0]
["DOPCN02",null,"Total customer numbers",{"$f":"SUM(D60:D63)","v":297461.47617922164},301551.54908623628,304568.39412830886,308079.97350116458,312307.29040407209,316541.41904942272,320689.51791058329,324326.48380174552,326912.16326357372,331988.58736076648,337735,341034.5]
[]
[]
[]
[null," 3.4.3 - SYSTEM DEMAND"]
[null,null,null,"Standard control services"]
[null,null,null,"VOLUMES (0's)"]
[null,null,"Units",{"$f":"dms_y1","v":"2006-07"},{"$f":"dms_y2","v":"2007-08"},{"$f":"dms_y3","v":"2008-09"},{"$f":"dms_y4","v":"2009-10"},{"$f":"dms_y5","v":"2010-11"},{"$f":"dms_y6","v":"2011-12"},{"$f":"dms_y7","v":"2012-13"},{"$f":"dms_y8","v":"2013-14"},{"$f":"dms_y9","v":"2014-15"},{"$f":"dms_y10","v":"2015-16"},{"$f":"dms_y11","v":"2016-17"},{"$f":"dms_y12","v":"2017-18"}]
[null,"3.4.3.1 - Annual system maximum demand characteristics at the zone substation level – MW measure"]
["DOPSD0101","Non-coincident Summated Raw System Annual Maximum Demand","MW ",1418.2,1488.26,1534.1,1459.7,1484.1,1027.1599999999999,1344.7892929687498,1418.0972763671875,1249.0101513671877,1276.7421389160158,1341.1100878906248,1358.4300000000003]
["DOPSD0102","Non–coincident Summated Weather Adjusted System Annual Maximum Demand 10% POE","MW ",1478.41230096922,1554.1293891866439,1501.746794551985,1524.9248000000002,1518.9477887560611,1444.400648326013,1488.5620560794875,1408.831462943459,1500.8851901365408,1504.8618948095841,1566.4623936185803,1453.7973055742939]
["DOPSD0103","Non–coincident Summated Weather Adjusted System Annual Maximum Demand 50% POE","MW ",1393.414044268822,1453.8160796881609,1416.7422590113065,1433.2,1421.3544524460685,1349.897514729266,1371.571218199173,1289.4752763301431,1358.2569286978378,1352.4771572534112,1407.4079216213268,1328.960205257963]
["DOPSD0104","Coincident Raw System Annual Maximum Demand","MW ",1304.1521919648087,1378.4410439805647,1411.3349453344522,1298.2929422035638,1424.3230395099552,896.59300000000019,1273.2818056640624,1257.1305,1159.0518857421876,1247.3416444091797,1241.0400000000002,1282.3900000000001]
["DOPSD0105","Coincident Weather Adjusted System Annual Maximum Demand 10% POE","MW ",1322.1333418643055,1445.8914031005463,1388.1070687941358,1436.5047909773887,1439.3138661695884,1059.793112244834,1536.2557858499999,1432.97,1489.0650000000001,1484.3979999999999,1595,1280.4779347459378]
["DOPSD0106","Coincident Weather Adjusted System Annual Maximum Demand 50% POE","MW ",1246.1200206072626,1352.5644556600059,1309.5349705605054,1350.0984877607036,1345.9339249576706,963.58720825255489,1413.1331637000001,1311.8340000000001,1349.4290000000001,1336.5129999999999,1434,1172.7619779875365]
[]
[null,"3.4.3.2 - Annual system maximum demand characteristics at the transmission connection point  – MW measure"]
["DOPSD0107","Non-coincident Summated Raw System Annual Maximum Demand","MW ",1348.64,1410.96,1448.8,1389.2,1432.5,1362.1080599999998,1743.6999519999999,1490.3099519999998,1491.5100000000002,1474.935528,1477.8630938346189,1462.4230503148344]
["DOPSD0108","Non–coincident Summated Weather Adjusted System Annual Maximum Demand 10% POE","MW ",1444.3934400000001,1494.2066399999999,1470.5319999999999,1536.4552000000001,1446.7,1560.1331413276171,1871.6697066847357,1517.2917169528221,1826.7035323723071,1824.8574175458073,1667.2699676491306,1519.6896128523226]
["DOPSD0109","Non–coincident Summated Weather Adjusted System Annual Maximum Demand 50% POE","MW ",1360.7777599999999,1398.26136,1386.5015999999998,1443.3788,1353.7,1420.09908625963,1752.1935013066534,1390.3453761539818,1669.2905153995016,1656.3680036398564,1546.5987127726278,1447.1584408523227]
["DOPSD0110","Coincident Raw System Annual Maximum Demand","MW ",1317.83,1372.69,1437.31,1322.03,1420.35,1308.8868200000002,1429.5515839999998,1422,1231,1346,1414,1444]
["DOPSD0111","Coincident Weather Adjusted System Annual Maximum Demand 10% POE","MW ",1411.3959299999999,1453.6787099999999,1458.8696499999999,1462.1651800000002,1499.8896,1499.1745266736882,1533,1431,1507,1540,1669,1567]
["DOPSD0112","Coincident Weather Adjusted System Annual Maximum Demand 50% POE","MW ",1329.6904699999998,1360.3357900000001,1375.5056699999998,1373.58917,1404.72615,1364.6119802706942,1431,1306,1373,1394,1487,1419]
[]
[null,"3.4.3.3 - Annual system maximum demand characteristics at the zone substation level – MVA measure"]
["DOPSD0201","Non–coincident Summated Raw System Annual Maximum Demand"," MVA",1575.6070928639392,1643.9390563440256,1701.0379686366589,1540.974935327263,1642.0099460176064,1082.17,1381.6732470703123,1454.5939003906253,1288.0838500976561,1301.7384888916015,1360.9415527343747,1378.2768600999998]
["DOPSD0202","Non–coincident Summated Weather Adjusted System Annual Maximum Demand 10% POE"," MVA",1550.6399077285357,1636.2302953763647,1614.9138342870945,1613.5301963200691,1692.2728739208899,1505.7756744153423,1518.9034837989707,1442.6833246183294,1550.9845084604515,1537.1651995496575,1593.7191729861627,1480.1178844838382]
["DOPSD0203","Non–coincident Summated Weather Adjusted System Annual Maximum Demand 50% POE"," MVA",1461.4890742022014,1530.6176757496396,1523.5036172519758,1516.4757484211175,1572.6604409088668,1396.4260006407169,1393.5971254636017,1316.1237212861104,1400.3996382734013,1378.6153246736085,1429.7590654843086,1352.8478818904764]
["DOPSD0204","Coincident Raw System Annual Maximum Demand"," MVA",1449.4654542263204,1523.4894456487932,1564.8151129768044,1439.2353743396036,1491.2622661221722,942.7399999999999,1312.6264277343751,1290.5793310546876,1184.2098720703127,1268.9922449951171,1234.3100001000003,1303.5640000999997]
["DOPSD0205","Coincident Weather Adjusted System Annual Maximum Demand 10% POE"," MVA",1469.4501276157962,1598.0373638736962,1539.0612461340659,1592.4514748373415,1517.380250278243,1147.8659340421575,1532.7807299999999,1431.162,1507.066,1540,1669,1566.6737689251745]
["DOPSD0206","Coincident Weather Adjusted System Annual Maximum Demand 50% POE"," MVA",1384.967132531382,1494.8899568509787,1451.9445718245904,1496.6649199599074,1409.1890809220156,1043.9111029155431,1430.87841,1305.502,1373,1394,1487,1418.8895574179151]
[]
[null,"3.4.3.4 - Annual system maximum demand characteristics at the transmission connection point – MVA measure"]
["DOPSD0207","Non–coincident Summated Raw System Annual Maximum Demand"," MVA",1479.1678022201547,1519.3388941261474,1567.85,1491.81,1526.1,1392.4605124059606,1795.3394610513972,1532.5829768273625,1520.1,1498.6670635303217,1508.7155260749857,1558.0256731202894]
["DOPSD0208","Non–coincident Summated Weather Adjusted System Annual Maximum Demand 10% POE"," MVA",1584.1887161777856,1608.9798888795899,1591.3677499999997,1649.9418600000001,1543.1,1594.8982736322514,1927.0990279098201,1560.3300864779142,1861.7186874772169,1854.2191542591286,1702.0765298522799,1619.0359085822831]
["DOPSD0209","Non–coincident Summated Weather Adjusted System Annual Maximum Demand 50% POE"," MVA",1492.480312440136,1505.664844079012,1500.4324499999998,1549.9905899999999,1433.3,1451.7437781847655,1804.0845460169214,1429.7828800946158,1701.2883000843319,1683.0187659162041,1578.8860959462925,1541.7631740933298]
["DOPSD0210","Coincident Raw System Annual Maximum Demand"," MVA",1440.23,1479.33,1547.24,1411.19,1512.02,1350.5889808926472,1466.067802056793,1484,1269,1377,1452,1494]
["DOPSD0211","Coincident Weather Adjusted System Annual Maximum Demand 10% POE"," MVA",1542.48633,1566.6104699999999,1570.4485999999999,1560.7761400000002,1596.6931200000001,1546.9394031795914,1606,1493,1553,1576,1714,1620]
["DOPSD0212","Coincident Weather Adjusted System Annual Maximum Demand 50% POE"," MVA",1453.1920699999998,1466.01603,1480.70868,1466.22641,1495.38778,1408.0895884853464,1500,1362,1415,1427,1527,1468]
[]
[null," 3.4.3.5 - Power factor conversion between MVA and MW"]
["DOPSD0301","Average overall network power factor conversion between MVA and MW","Factor",0.91501357422078411,0.92791331210750816,0.92895090612962428,0.93681928018197402,0.93937249507281639,0.96912298154166432,0.95399999999999996,0.95888399412628489,0.97031802120141342,0.97687456201822009,0.97380484610347084,0.96662125340599458]
["DOPSD0302","Average power factor conversion for  low voltage distribution lines","Factor",0.85,0.85,0.85,0.85,0.85,0.85,0.85,0.85,0.85,0.85,0.85,0.85]
["DOPSD0303","Average power factor conversion for 3.3 kV lines","Factor",0,0,0,0,0,"                                   -  ","                                   -  ","                                   -  ","                                   -  ","                                   -  ","                                   -  ","                                   -  "]
["DOPSD0304","Average power factor conversion for 6.6 kV lines","Factor",0,0,0,0,0,"                                   -  ","                                   -  ","                                   -  ","                                   -  ","                                   -  ","                                   -  ","                                   -  "]
["DOPSD0305","Average power factor conversion for 7.6 kV lines","Factor",0,0,0,0,0,"                                   -  ","                                   -  ","                                   -  ","                                   -  ","                                   -  ","                                   -  ","                                   -  "]
["DOPSD0306","Average power factor conversion for 11 kV lines","Factor",0.9,0.9,0.9,0.9,0.9,0.9,0.9,0.9,0.9,0.9,0.9,0.9]
["DOPSD0307","Average power factor conversion for SWER lines","Factor",0,0,0,0,0,"                                   -  ","                                   -  ","                                   -  ","                                   -  ","                                   -  ","                                   -  ","                                   -  "]
["DOPSD0308","Average power factor conversion for 22 kV lines","Factor",0.9,0.9,0.9,0.9,0.9,0.95,0.95,0.95,0.95,0.95,0.95,0.95]
["DOPSD0309","Average power factor conversion for 33 kV lines","Factor",0,0,0,0,0,"                                   -  ","                                   -  ","                                   -  ","                                   -  ","                                   -  ","                                   -  ","                                   -  "]
["DOPSD0310","Average power factor conversion for 44 kV lines","Factor",0,0,0,0,0,"                                   -  ","                                   -  ","                                   -  ","                                   -  ","                                   -  ","                                   -  ","                                   -  "]
["DOPSD0311","Average power factor conversion for 66 kV lines","Factor",0.95,0.95,0.95,0.95,0.95,0.9,0.9,0.9,0.9,0.9,0.9,0.9]
["DOPSD0312","Average power factor conversion for 110 kV lines","Factor",0,0,0,0,0,"                                   -  ","                                   -  ","                                   -  ","                                   -  ","                                   -  ","                                   -  ","                                   -  "]
["DOPSD0313","Average power factor conversion for 132 kV lines","Factor",0.9,0.9,0.9,0.9,0.9,"                                   -  ","                                   -  ","                                   -  ","                                   -  ","                                   -  ","                                   -  ","                                   -  "]
["DOPSD0314","Average power factor conversion for 220 kV lines","Factor",0,0,0,0,0,"                                   -  ","                                   -  ","                                   -  ","                                   -  ","                                   -  ","                                   -  ","                                   -  "]
[]
[null," 3.4.3.6 - Demand supplied (for customers charged on this basis) – MW measure"]
["DOPSD0401","Summated Chargeable Contracted Maximum Demand","MW ",1062.3674999999998,1057.6650599999998,1017.18156,1116.0398989318878,1133.3272467059787,1037.3999567740909,1038.0359779999999,1052.1487053875517,1059.6184889009817,1053.4826525134299,525.5,0]
["DOPSD0402","Summated Chargeable Measured Maximum Demand ","MW ",0,0,0,0,0,0,0,0,0,515,680.5,332.51565012578351]
[]
[null," 3.4.3.7 - Demand supplied (for customers charged on this basis) – MVA measure"]
["DOPSD0403","Summated Chargeable Contracted Maximum Demand"," MVA",0,0,0,0,0,0,0,0,0,0,0,0]
["DOPSD0404","Summated Chargeable Measured Maximum Demand "," MVA",0,0,0,0,0,0,0,0,0,0,920,923.65661868410689]

{"sheet":"3.5 Physical assets","index":12,"n_rows":98,"n_cols":15,"rows_kept":98,"cut":false,"hidden":false,"merged":[[8,3,8,14],[75,3,75,14],[93,3,93,14]]}
[null,{"$f":"INDEX(dms_Worksheet_List,MATCH(dms_Model,dms_Model_List))","v":"HISTORICAL ECONOMIC BENCHMARKING - FINANCIAL YEARS"}]
[null,{"$f":"INDEX(dms_TradingNameFull_List,MATCH(dms_TradingName,dms_TradingName_List))","v":"CitiPower"}]
[null,{"$f":"dms_Header_Span","v":"2006-07 to 2018-19"}]
[null,"3.5 PHYSICAL ASSETS"]
[]
[null,"There are THREE tables on this worksheet. Each table has been grouped (and sub-grouped) for ease of navigation. See the Instructions sheet on how to group or ungroup tables. "]
[]
[null,"3.5.1 - NETWORK CAPACITIES"]
[null,null,null,"VOLUMES (0's)"]
[null,null,null,{"$f":"dms_y1","v":"2006-07"},{"$f":"dms_y2","v":"2007-08"},{"$f":"dms_y3","v":"2008-09"},{"$f":"dms_y4","v":"2009-10"},{"$f":"dms_y5","v":"2010-11"},{"$f":"dms_y6","v":"2011-12"},{"$f":"dms_y7","v":"2012-13"},{"$f":"dms_y8","v":"2013-14"},{"$f":"dms_y9","v":"2014-15"},{"$f":"dms_y10","v":"2015-16"},{"$f":"dms_y11","v":"2016-17"},{"$f":"dms_y12","v":"2017-18"}]
[null,"Circuit length"]
[null,"3.5.1.1 - Overhead network length of circuit at each voltage"]
["DPA0101","Overhead low voltage distribution","km",1653.8447826847623,1629.2003881958731,1592.8097203088871,1590.0005004392128,1601.2822206278495,1617.5,1621.5,1628.016175,1633.799395000045,1635.783220000045,1637.97,1638.01926]
["DPA0102","Overhead 2.2 kV","km",0,0,0,0,0,0,0,0,0,0,0,0]
["DPA0103","Overhead 6.6kv","km",0,0,0,0,0,0,0,47.490489999999994,94.277005000000003,93.086514999999991,92.449999999999989,92.222999999999985]
["DPA0104","Overhead 7.6 kV","km",0,0,0,0,0,0,0,0,0,0,0,0]
["DPA0105","Overhead 11 kV","km",459.08890721821228,452.24789755792699,442.14625311820112,441.36644494417715,444.34511101199655,449,450,413.51170000000002,377.69059500000003,378.67889500000001,378.745,378.50822500000004]
["DPA0106","Overhead SWER","km",0,0,0,0,0,0,0,0,0,0,0,0]
["DPA0107","Overhead 22 kV","km",7.157288085807318,7.0506353739543179,6.8931487123104844,6.8809913465684627,6.9352244478484986,7,7,6.9246749999999997,6.8573899999999997,6.8827150000000001,6.8800000000000008,6.8547150000000006]
["DPA0108","Overhead 33 kV","km",0,0,0,0,0,0,0,0,0,0,0,0]
["DPA0109","Overhead 44 kV","km",0,0,0,0,0,0,0,0,0,0,0,0]
["DPA0110","Overhead 66 kV","km",0,0,0,0,0,0,0,72.020065000000073,144.24946000000006,144.47939500000001,144.29500000000002,143.47305499999999]
["DPA0111","Overhead 110kV","km",0,0,0,0,0,0,0,0,0,0,0,0]
["DPA0112","Overhead 132 kV","km",0,0,0,0,0,0,0,0,0,0,0,0]
["DPA0113","Overhead 220kV","km",0,0,0,0,0,0,0,0,0,0,0,0]
["DPA0114","Other ","km",0,0,0,0,0,0,0,7.2060899999999988,14.412179999999999,14.406089999999999,14.405000000000001,12.386395]
["DPA01","Total overhead circuit km","km",{"$f":"SUM(D13:D26)","v":2120.090977988782},{"$f":"SUM(E13:E26)","v":2088.4989211277543},2041.8491221393988,2038.2479367299584,2052.5625560876947,2073.5,2078.5,2175.1691950000004,2271.2860250000449,2273.3168300000448,2274.7450000000003,2271.4646499999999]
[null,"3.5.1.2 - Underground network circuit length at each voltage"]
["DPA0201","Underground low voltage distribution","km",514.51960300834151,537.20247804557812,551.09460576863989,561.34346912044634,588.77084890454842,612,620,633.15281000000004,641.43659000000002,645.88378,650.15499999999997,652.21496000000002]
["DPA0202","Underground 5 kV","km",0,0,0,0,0,0,0,0,0,0,0,0]
["DPA0203","Underground 6.6 Kv","km",0,0,0,0,0,0,0,71.386073500000009,138.5345835,134.54851000000002,135.31,135.53275000000002]
["DPA0204","Underground 7.6 kV","km",0,0,0,0,0,0,0,0,0,0,0,0]
["DPA0205","Underground 11 kV","km",1052.5793185726202,1098.9828472435684,1127.402690232577,1148.3693191810437,1205.0018020073439,1252,1266,1244.1814465,1222.008931500005,1245.9774850000049,1258.46,1265.4805445]
["DPA0206","Underground SWER","km",0,0,0,0,0,0,0,0,0,0,0,0]
["DPA0207","Underground 22 kV","km",40.774837820105496,42.5724186032852,43.673347025782732,44.485552699904652,47.448751914821237,48.5,47,50.460330499999998,54.360180499999998,54.849850000000004,55.05,52.866558499999996]
["DPA0208","Underground 33 kV","km",0,0,0,0,0,0,0,0,0,0,0,0]
["DPA0209","Underground 66 kV","km",43.296992736813053,45.205764083900775,46.374791171707443,47.237236372063705,46.837334507490596,51.5,57.5,60.170240000000021,62.924070000000022,66.353830000000002,69.17,69.750532499999991]
["DPA0210","Underground 110 kV","km",0,0,0,0,0,0,0,0,0,0,0,0]
["DPA0211","Underground 132 kV","km",0,0,0,0,0,0,0,0,0,0,0,0]
["DPA0212","Other ","km",0,0,0,0,0,0,0,51.717385000000014,102.92616000000001,102.40877500000001,102.485,95.460423999999989]
["DPA02","Total underground circuit km","km",{"$f":"SUM(D29:D40)","v":1651.1707521378803},{"$f":"SUM(E29:E40)","v":1723.9635079763325},1768.545434198707,1801.4355773734585,1888.0587373342044,1964,1990.5,2111.0682855,2222.1905155000049,2250.0222300000046,2270.63,2271.3057694999998]
[]
[null,"Circuit Capacity MVA"]
[null,"3.5.1.3 - Estimated overhead network weighted average MVA capacity by voltage class"]
["DPA0301","Overhead low voltage distribution","MVA",0.2,0.2,0.2,0.2,0.2,0.2,0.2,0.2,0.2,0.1,0.1,0.2]
["DPA0302","Overhead 6.6 kV","MVA",0,0,0,0,0,0,0,1.1499999999999999,2.2999999999999998,2.15,2.15,2.2999999999999998]
["DPA0303","Overhead 7.6 kV","MVA",0,0,0,0,0,0,0,0,0,0,0,0]
["DPA0304","Overhead 11 kV","MVA",4,4,4,4,4,4,4,4,4,4,4,4]
["DPA0305","Overhead SWER","MVA",0,0,0,0,0,0,0,0,0,0,0,0]
["DPA0306","Overhead 22 kV","MVA",8,8,8,8,8,8,8,8,8,8,8,8]
["DPA0307","Overhead 33 kV","MVA",0,0,0,0,0,0,0,0,0,0,0,0]
["DPA0308","Overhead 44 kV","MVA",0,0,0,0,0,0,0,0,0,0,0,0]
["DPA0309","Overhead 66 kV","MVA",50,50,50,50,50,50,50,50,50,50,50,50]
["DPA0310","Overhead 110 kV","MVA",0,0,0,0,0,0,0,0,0,0,0,0]
["DPA0311","Overhead 132 kV","MVA",0,0,0,0,0,0,0,0,0,0,0,0]
["DPA0312","Overhead 220 kV","MVA",0,0,0,0,0,0,0,0,0,0,0,0]
["DPA0313","Other ","MVA",15,15,15,15,15,15,15,15,15,15,15,15]
[null,"3.5.1.4 - Estimated underground network weighted average MVA capacity by voltage class"]
["DPA0401","Underground low voltage distribution","MVA",0.2,0.2,0.2,0.2,0.2,0.2,0.2,0.2,0.2,0.1,0.1,0.2]
["DPA0402","Underground 5 kV","MVA",0,0,0,0,0,0,0,0,0,0,0,0]
["DPA0403","Underground 6.6 kV","MVA",0,0,0,0,0,0,0,1.1499999999999999,2.2999999999999998,2.15,2.15,2.2999999999999998]
["DPA0404","Underground 7.6 kV","MVA",0,0,0,0,0,0,0,0,0,0,0,0]
["DPA0405","Underground 11 kV","MVA",4,4,4,4,4,4,4,4,4,4,4,4]
["DPA0406","Underground SWER","MVA",0,0,0,0,0,0,0,0,0,0,0,0]
["DPA0407","Underground 12.7 kV","MVA",0,0,0,0,0,0,0,0,0,0,0,0]
["DPA0408","Underground 22 kV","MVA",8,8,8,8,8,8,8,8,8,8,8,8]
["DPA0409","Underground 33 kV","MVA",0,0,0,0,0,0,0,0,0,0,0,0]
["DPA0410","Underground 66 kV","MVA",0,0,0,0,0,0,0,30,60,60,60,60]
["DPA0411","Underground 110 kV","MVA",0,0,0,0,0,0,0,0,0,0,0,0]
["DPA0412","Underground 132 kV","MVA",0,0,0,0,0,0,0,0,0,0,0,0]
["DPA0413","Other","MVA",15,15,15,15,15,15,15,15,15,15,15,15]
[]
[]
[]
[null,"3.5.2 - TRANSFORMER CAPACITIES"]
[null,null,null,"VOLUMES (0's)"]
[null,null,null,{"$f":"dms_y1","v":"2006-07"},{"$f":"dms_y2","v":"2007-08"},{"$f":"dms_y3","v":"2008-09"},{"$f":"dms_y4","v":"2009-10"},{"$f":"dms_y5","v":"2010-11"},{"$f":"dms_y6","v":"2011-12"},{"$f":"dms_y7","v":"2012-13"},{"$f":"dms_y8","v":"2013-14"},{"$f":"dms_y9","v":"2014-15"},{"$f":"dms_y10","v":"2015-16"},{"$f":"dms_y11","v":"2016-17"},{"$f":"dms_y12","v":"2017-18"}]
[null,"Distribution transformer total installed capacity"]
["DPA0501","Distribution transformer capacity owned by utility","MVA",3433.6350000000002,3579.4849999999997,3733.6750000000002,3824.3649999999998,3896.39,3943.7,4024.21,4125.75,4211.7950000000001,4298.8,4376.5200000000004,4436.4750000000004]
["DPA0502","Distribution transformer capacity owned by High Voltage Customers","MVA",188.4025869691522,188.35258696915218,195.77446923267513,183.57446923267514,171.8,171.5,172.14999999999998,170.35,173.6,176.85,193.345,208.91137600000002]
["DPA0503","Cold spare capacity included in DPA0501","MVA",118.63499999999999,113.485,108.175,94.365000000000009,89.89,89.699999999999989,84.210000000000008,86.32,90.47999999999999,89.914999999999992,90.52000000000001,90.974999999999994]
[null,"Zone substation transformer capacity"]
["DPA0601","Total installed capacity for first step transformation where there are two steps to reach distribution voltage","MVA",0,0,0,0,0,0,0,0,0,0,0,0]
["DPA0602","Total installed capacity for second step transformation where there are two steps to reach distribution voltage","MVA",0,0,0,0,0,0,0,0,0,0,0,0]
["DPA0603","Total zone substation transformer capacity where there is only a single step transformation to reach distribution voltage","MVA",2518.65,2525.4,2522.6999999999998,2575,2657.5,2712.5,2740,2743.45,2741.95,2737,2739.5,2702]
["DPA0604","Total zone substation transformer  capacity ","MVA",2518.65,2525.4,2522.6999999999998,2575,2657.5,2712.5,2740,2783.45,2801.95,2777,2739.5,2702]
["DPA0605","Cold spare capacity of zone substation transformers included in DPA0604","MVA",0,0,0,0,0,0,0,40,60,40,40,40]
[null,"Distribution - other transformer capacity"]
[null,"Distribution other - transformer capacity owned by utility ","MVA"]
[]
[]
[]
[null,"3.5.3 - PUBLIC LIGHTING"]
[null,null,null,"VOLUMES (0's)"]
[null,null,null,{"$f":"dms_y1","v":"2006-07"},{"$f":"dms_y2","v":"2007-08"},{"$f":"dms_y3","v":"2008-09"},{"$f":"dms_y4","v":"2009-10"},{"$f":"dms_y5","v":"2010-11"},{"$f":"dms_y6","v":"2011-12"},{"$f":"dms_y7","v":"2012-13"},{"$f":"dms_y8","v":"2013-14"},{"$f":"dms_y9","v":"2014-15"},{"$f":"dms_y10","v":"2015-16"},{"$f":"dms_y11","v":"2016-17"},{"$f":"dms_y12","v":"2017-18"}]
["DPA0701","Public lighting luminaires","Number",51868,51887.5,52034.5,52230,52352,52361,52236,52389.5,52628.5,52659,52720.5,52758.199999999968]
["DPA0702","Public lighting poles","Number",7119,7279.5,7535,7864,8098,8250.5,8880.5,9250.5,9099.5,9086,9067,9088.5]
["DPA0703","Public lighting columns ","Number"]

{"sheet":"3.6 Quality of service","index":13,"n_rows":38,"n_cols":15,"rows_kept":38,"cut":false,"hidden":false,"merged":[[8,3,8,14],[23,3,23,14],[30,3,30,14],[35,3,35,14]]}
[null,{"$f":"INDEX(dms_Worksheet_List,MATCH(dms_Model,dms_Model_List))","v":"HISTORICAL ECONOMIC BENCHMARKING - FINANCIAL YEARS"}]
[null,{"$f":"INDEX(dms_TradingNameFull_List,MATCH(dms_TradingName,dms_TradingName_List))","v":"CitiPower"}]
[null,{"$f":"dms_Header_Span","v":"2006-07 to 2018-19"}]
[null,"3.6 QUALITY OF SERVICE DATA"]
[]
[null,"There are THREE tables on this worksheet. Each table has been grouped (and sub-grouped) for ease of navigation. See the Instructions sheet on how to group or ungroup tables. "]
[]
[null,"3.6.1 - RELIABILITY"]
[null,null,null,"(0's)"]
[null,null,"Units",{"$f":"dms_y1","v":"2006-07"},{"$f":"dms_y2","v":"2007-08"},{"$f":"dms_y3","v":"2008-09"},{"$f":"dms_y4","v":"2009-10"},{"$f":"dms_y5","v":"2010-11"},{"$f":"dms_y6","v":"2011-12"},{"$f":"dms_y7","v":"2012-13"},{"$f":"dms_y8","v":"2013-14"},{"$f":"dms_y9","v":"2014-15"},{"$f":"dms_y10","v":"2015-16"},{"$f":"dms_y11","v":"2016-17"},{"$f":"dms_y12","v":"2017-18"}]
[null,"INCLUSIVE OF MEDs"]
["DQS0101","Whole of network unplanned SAIDI","minutes/customer",57.528656228687225,66.375089325588732,53.69447166926804,53.582309309396408,38.795804177766243,35.187335919248731,61.645722445498492,65.729074893957446,35.890852715213491,27.890368672808648,25.959085608784349,27.1056227303696]
["DQS0102","Whole of network unplanned SAIDI excluding excluded outages","minutes/customer",31.384170438704484,40.230603535605994,38.628015018191292,38.515852658319659,38.764561600044956,35.156093341527445,61.294429254481287,65.37778170294024,35.890852715213491,27.540368672808651,25.589614711884145,23.749181024925583]
["DQS0103","Whole of network unplanned SAIFI","interruptions/customer",0.70175566634631781,0.69348744628802761,0.75886788301786745,0.80472874182723197,0.57218952756003283,0.58641681658825073,0.67812280906158895,0.60539826013583009,0.4480406792828947,0.39518895058215497,0.39059584831406002,0.45492341144236004]
["DQS0104","Whole of network unplanned SAIFI excluding excluded outages","interruptions/customer",0.5549207567028166,0.54665253664452651,0.55915683210903877,0.60501769091840329,0.56698350115116403,0.58121079017938193,0.65963369374489389,0.58690914481913503,0.4480406792828947,0.39518895058215497,0.38920506996404503,0.36064028886219501]
[null,"EXCLUSIVE OF MEDs"]
["DQS0105","Whole of network unplanned SAIDI","minutes/customer",49.460380021949106,45.398151294552939,38.176377420019911,44.886420101080404,26.397101860773454,25.959070761052637,28.385764253136237,31.066780627872269,30.443953282615311,25.74036867280865,22.770385227383127,26.066922348968376]
["DQS0106","Whole of network unplanned SAIDI excluding excluded outages","minutes/customer",23.315894231966364,19.253665504570197,23.109920768943162,29.819963450003662,26.365859283052163,25.927828183331346,28.034471062119032,30.715487436855064,30.443953282615311,25.440368672808653,22.45091433048292,22.71048064352436]
["DQS0107","Whole of network unplanned SAIFI","interruptions/customer",0.64656999739546928,0.53460398241602614,0.62632420594959848,0.69053878044892325,0.42452716705376703,0.44116776361941068,0.45022645836734065,0.42367247173510186,0.40310871482065591,0.39518895058215497,0.36837224273637076,0.43269980586467077]
["DQS0108","Whole of network unplanned SAIFI excluding excluded outages","interruptions/customer",0.49973508775196807,0.38776907277252493,0.42661315504076991,0.49082772954009468,0.41932114064489817,0.43596173721054188,0.43173734305064559,0.4051833564184068,0.40310871482065591,0.39518895058215497,0.36698146438635576,0.3384166832845058]
[]
[]
[null,"3.6.2 - ENERGY NOT SUPPLIED"]
[null,null,null,"(0's)"]
[null,null,"Unit",{"$f":"dms_y1","v":"2006-07"},{"$f":"dms_y2","v":"2007-08"},{"$f":"dms_y3","v":"2008-09"},{"$f":"dms_y4","v":"2009-10"},{"$f":"dms_y5","v":"2010-11"},{"$f":"dms_y6","v":"2011-12"},{"$f":"dms_y7","v":"2012-13"},{"$f":"dms_y8","v":"2013-14"},{"$f":"dms_y9","v":"2014-15"},{"$f":"dms_y10","v":"2015-16"},{"$f":"dms_y11","v":"2016-17"},{"$f":"dms_y12","v":"2017-18"}]
["DQS0201","Energy Not Supplied (planned)","GWh",9.0248999999999996E-2,5.1463499999999995E-2,5.7916499999999996E-2,6.425249999999999E-2,6.3833000000000001E-2,9.3270500000000006E-2,0.13677500000000001,0.1925385,0.19412000000000001,0.178753,0.153805,0.14957800000000002]
["DQS0202","Energy Not Supplied (unplanned)","GWh",1.0317645,0.32265949999999999,0.30360750000000003,0.31496449999999998,0.27866849999999999,0.23432750000000002,0.36743700000000001,0.410105,0.27522799999999997,0.21253549999999999,0.18679499999999999,0.18930250000000001]
["DQS02","Total",null,{"$f":"SUM(D26:D27)","v":1.1220135},{"$f":"SUM(E26:E27)","v":0.37412299999999998},0.36152400000000001,0.37921699999999997,0.34250150000000001,0.32759800000000006,0.50421199999999999,0.6026435,0.46934799999999999,0.39128849999999998,0.34060000000000001,0.33888050000000003]
[]
[null,"3.6.3 - SYSTEM LOSSES"]
[null,null,null,"(0's)"]
[null,null,"Unit",{"$f":"dms_y1","v":"2006-07"},{"$f":"dms_y2","v":"2007-08"},{"$f":"dms_y3","v":"2008-09"},{"$f":"dms_y4","v":"2009-10"},{"$f":"dms_y5","v":"2010-11"},{"$f":"dms_y6","v":"2011-12"},{"$f":"dms_y7","v":"2012-13"},{"$f":"dms_y8","v":"2013-14"},{"$f":"dms_y9","v":"2014-15"},{"$f":"dms_y10","v":"2015-16"},{"$f":"dms_y11","v":"2016-17"},{"$f":"dms_y12","v":"2017-18"}]
["DQS03","System losses","%",3.940193602279185E-2,3.6862253685087457E-2,3.4560096309312116E-2,3.2844999999999999E-2,2.3564999999999999E-2,2.7575000000000002E-2,3.798E-2,3.3050000000000003E-2,3.7179999999999998E-2,4.1800000000000004E-2,4.4882400000000003E-2,4.5962679436169093E-2]
[]
[null,"3.6.4 - CAPACITY UTILISATION"]
[null,null,null,"(0's)"]
[null,null,"Unit",{"$f":"dms_y1","v":"2006-07"},{"$f":"dms_y2","v":"2007-08"},{"$f":"dms_y3","v":"2008-09"},{"$f":"dms_y4","v":"2009-10"},{"$f":"dms_y5","v":"2010-11"},{"$f":"dms_y6","v":"2011-12"},{"$f":"dms_y7","v":"2012-13"},{"$f":"dms_y8","v":"2013-14"},{"$f":"dms_y9","v":"2014-15"},{"$f":"dms_y10","v":"2015-16"},{"$f":"dms_y11","v":"2016-17"},{"$f":"dms_y12","v":"2017-18"}]
["DQS04","Overall utilisation","%",0.6167782356211472,0.63743291146114767,0.66298845852974753,0.63046854778042705,0.59873567838364139,0.57611310771796242,0.55167484933298749,0.55578898624317774,0.51325258056528367,0.49380000000000002,0.52,0.52270517019533225]

{"sheet":"3.7 Operating environment","index":14,"n_rows":36,"n_cols":15,"rows_kept":36,"cut":false,"hidden":false,"merged":[[8,3,8,14],[15,3,15,14],[33,3,33,14]]}
[null,{"$f":"INDEX(dms_Worksheet_List,MATCH(dms_Model,dms_Model_List))","v":"HISTORICAL ECONOMIC BENCHMARKING - FINANCIAL YEARS"}]
[null,{"$f":"INDEX(dms_TradingNameFull_List,MATCH(dms_TradingName,dms_TradingName_List))","v":"CitiPower"}]
[null,{"$f":"dms_Header_Span","v":"2006-07 to 2018-19"}]
[null,"3.7 OPERATING ENVIRONMENT FACTORS"]
[]
[null,"There are THREE tables on this worksheet. Each table has been grouped for ease of navigation. See the Instructions sheet on how to group or ungroup tables. "]
[]
[null,"3.7.1 - DENSITY FACTORS"]
[null,null,null,"(0's)"]
[null,null,"Units",{"$f":"dms_y1","v":"2006-07"},{"$f":"dms_y2","v":"2007-08"},{"$f":"dms_y3","v":"2008-09"},{"$f":"dms_y4","v":"2009-10"},{"$f":"dms_y5","v":"2010-11"},{"$f":"dms_y6","v":"2011-12"},{"$f":"dms_y7","v":"2012-13"},{"$f":"dms_y8","v":"2013-14"},{"$f":"dms_y9","v":"2014-15"},{"$f":"dms_y10","v":"2015-16"},{"$f":"dms_y11","v":"2016-17"},{"$f":"dms_y12","v":"2017-18"}]
["DOEF0101","Customer density","Customer / km",102.96610424881128,103.4228730031122,104.65293867758514,105.11282999203513,103.97605833544276,102.91617400828147,103.52250793742202,102.98598113974344,102.34133678607009,103.29303170132432,104.6,105.80797591823401]
["DOEF0102","Energy density","MWh/customer",20.261888199162691,20.194110049391924,20.022345412697913,19.97205772408897,19.717839983549279,19.25632745910341,18.815143511072307,18.347792253249516,18.144954121700437,17.813804516126012,17.45,17.197996608972506]
["DOEF0103","Demand density","kVA / customer",5.2222573009741549,5.3378505244660204,5.4910224969022394,5.2636516644841622,5.0950514161267897,4.9356391610678587,4.7131516874832569,4.7690365385708411,4.390440169799124,4.0599261125391459,4.1500000000000004,4.0990136253936011]
[]
[null,"3.7.2 - TERRAIN FACTORS"]
[null,null,null,"(0's)"]
[null,null,"Units",{"$f":"dms_y1","v":"2006-07"},{"$f":"dms_y2","v":"2007-08"},{"$f":"dms_y3","v":"2008-09"},{"$f":"dms_y4","v":"2009-10"},{"$f":"dms_y5","v":"2010-11"},{"$f":"dms_y6","v":"2011-12"},{"$f":"dms_y7","v":"2012-13"},{"$f":"dms_y8","v":"2013-14"},{"$f":"dms_y9","v":"2014-15"},{"$f":"dms_y10","v":"2015-16"},{"$f":"dms_y11","v":"2016-17"},{"$f":"dms_y12","v":"2017-18"}]
["DOEF0201","Rural proportion","%",0,0,0,0,0,0,0,0,0,0,0,0]
["DOEF0202","Urban and CBD vegetation maintenance spans","Number of spans",2816,2816,2816,2982,3312.5,3860,3837.5,3920,4033,4875,5893.5,3088.5]
["DOEF0203","Rural vegetation maintenance spans","Number of spans",0,0,0,0,0,0,0,0,0,0,0,0]
["DOEF0204","Total vegetation maintenance spans","Number of spans",2816,2816,2816,2982,3312.5,3860,3837.5,3920,4033,4875,5893.5,3088.5]
["DOEF0205","Total number of spans","Number of spans",59338,59338,59338,59177.5,58940,58996.5,59117.5,59106.5,59160,59424,59735,60121.5]
["DOEF0206","Average urban and CBD vegetation maintenance span cycle","Years",1.63,1.63,1.63,1.71,2.04,1.925,1.78,1.9950000000000001,1.9924271550000001,2.2974271550000003,2.6799999999999997,2.6849792531120329]
["DOEF0207","Average rural vegetation maintenance span cycle","Years",0,0,0,0,0,0,0,0,0,0,0,0]
["DOEF0208","Average number of trees per urban and CBD vegetation maintenance span","Trees",0,0,0,0,0,0,1.0029999999999999,2.0149999999999997,2.0194999999999999,2.9575,3.45,62.567427385892117]
["DOEF0209","Average number of trees per rural vegetation maintenance span","Trees",0,0,0,0,0,0,0,0,0,0,0,0]
["DOEF0210","Average number of defects per urban and CBD vegetation maintenance span","Defects",0,0,0,0,0,0,0.64500000000000002,1.3250000000000002,1.3425,1.1125,0.96500000000000008,1.0150000000000001]
["DOEF0211","Average number of defects per rural vegetation maintenance span","Defects",0,0,0,0,0,0,0,0,0,0,0,0]
["DOEF0212","Tropical proportion","Spans",0,0,0,0,0,0,0,0,0,0,0,0]
["DOEF0213","Standard vehicle access","km",0,0,0,0,0,0,0,0,0,0,0,0]
["DOEF0214","Bushfire risk","Spans",0,0,0,0,0,0,0,0,0,0,0,0]
[]
[null,"3.7.3 - SERVICE AREA FACTORS"]
[null,null,null,"(0's)"]
[null,null,"Units",{"$f":"dms_y1","v":"2006-07"},{"$f":"dms_y2","v":"2007-08"},{"$f":"dms_y3","v":"2008-09"},{"$f":"dms_y4","v":"2009-10"},{"$f":"dms_y5","v":"2010-11"},{"$f":"dms_y6","v":"2011-12"},{"$f":"dms_y7","v":"2012-13"},{"$f":"dms_y8","v":"2013-14"},{"$f":"dms_y9","v":"2014-15"},{"$f":"dms_y10","v":"2015-16"},{"$f":"dms_y11","v":"2016-17"},{"$f":"dms_y12","v":"2017-18"}]
["DOEF0301","Route Line length","km",2889.2179909551005,2915.90123282897,2910.2618950043525,2930.9116899521773,3004.581189061093,3075.6905485975158,3097.7533497620407,3149.4732080941803,3194.327191533815,3214.6271915338148,3229.2200000000003,3222.9471389935948]

{"sheet":"NSP Amendments","index":15,"n_rows":2,"n_cols":3,"rows_kept":2,"cut":false,"hidden":false,"merged":[[0,1,0,2]]}
[null,{"$f":"CONCATENATE(dms_TradingName,\" data amendments\")","v":"CitiPower data amendments"}]
[null,"Amended Table","Comments"]