{"text_format":"1","workbook":"xlsx","n_sheets":12,"sheets":["Energy Throughput","Index","Assumptions","Input|General","Input|Inflation","Input|Reported opex","Input|Rate of change","Input|Step changes","Calc|Opex forecast","Output|Models","Lookup|Tables","Check|List"],"not_rendered":{"charts":0,"images":0,"macros":1,"external_links":1,"defined_names":33,"comments":0,"pivot_tables":0},"unopened":[],"bounds":{"document_bytes":16777216,"sheet_cells":100000,"rows_first":2000,"rows_last":500,"rows_between":2000,"halvings":0,"cell_chars":16384,"cell_head_chars":4096},"cells_cut":0,"cells_raw":0,"read":"whole","date_system":"1900"}

{"sheet":"Energy Throughput","index":0,"n_rows":40,"n_cols":11,"rows_kept":40,"cut":false,"hidden":false,"merged":[]}
[]
[null,"Maximum Demand"]
[]
[null,null,null,"Central",null,"Fast",null,"High DER",null,"Slow"]
[null,null,null,"MWs","YoY Change","MWs","YoY Change","MWs","YoY Change","MWs","YoY Change"]
[null,2021,"SA",2901.65,null,2862.32,null,2861.91,null,2621.0100000000002]
[null,2022,"SA",2910.77,{"$f":"(D7/D6)-1","v":3.1430393052227501E-3},2872.87,{"$f":"(F7/F6)-1","v":3.685821291819158E-3},2867.96,{"$f":"(H7/H6)-1","v":2.1139728363226418E-3},2671.59,{"$f":"(J7/J6)-1","v":1.9297904243020803E-2}]
[null,2023,"SA",2941.44,{"$f":"(D8/D7)-1","v":1.0536730830673635E-2},2902.2,{"$f":"(F8/F7)-1","v":1.0209302892229655E-2},2902.28,{"$f":"(H8/H7)-1","v":1.1966694096152031E-2},2738.48,{"$f":"(J8/J7)-1","v":2.5037524470446382E-2}]
[null,2024,"SA",2961.1,6.6838011314185319E-3,2924.55,7.7010543725450908E-3,2922.9,7.1047590170485453E-3,2762.36,8.7201659314657398E-3]
[null,2025,"SA",2949.63,-3.873560501165052E-3,2926.87,7.9328443692183725E-4,2929.91,2.3983030551848472E-3,2757.93,-1.6037011830465353E-3]
{"$rows_left_out":31}
{"sheet":"Index","index":1,"n_rows":18,"n_cols":4,"rows_kept":18,"cut":false,"hidden":false,"merged":[]}
[null,"AER opex model"]
[null,"Index"]
[]
[null,"Model index"]
[]
[null,null,"Sheet Name","Sheet Description"]
[null,null,"Input | General","Inputs NSP name, regulatory years for the prior and forecast regulatory control period etc."]
[null,null,"Input | Inflation","Inputs inflation data."]
[null,null,"Input | Reported opex","Inputs the reported operating expenditure (opex) from the prior regulatory control period."]
[null,null,"Input | Rate of change","Inputs the cost escalation weights, cost escalation forecast, and inflation actuals and forecast"]
{"$rows_left_out":9}
{"sheet":"Assumptions","index":2,"n_rows":169,"n_cols":46,"rows_kept":169,"cut":false,"hidden":false,"merged":[]}
[]
[null,"Assumptions"]
[]
[null,"Scenario",null,null,null,null,null,null,null,null,null,null,null,null,null,null,null,null,null,null,null,null,null,null,5.1831493832604378,5.1831493832604378,5.1831493832604378,5.1831493832604378,5.1831493832604378]
[null,null,null,null,null,null,null,null,null,null,null,null,null,null,null,null,null,null,null,null,null,null,null,null,1.5,1.5,1.5,1.5,1.5]
[null,null,3,null,null,null,null,null,null,null,null,null,null,null,null,null,null,null,null,null,null,null,null,null,0.78815733177282676,0.78815733177282676,0.78815733177282676,0.78815733177282676,0.78815733177282676]
[null,null,null,null,null,null,null,null,null,null,null,null,null,null,null,null,null,null,null,null,null,null,null,null,7.2169652832931099,7.2169652832931099,7.2169652832931099,7.2169652832931099,7.2169652832931099]
[null,"Scenario","Description",null,null,null,null,null,null,null,null,null,null,null,null,null,null,null,null,null,null,null,null,null,1.37204310144316,1.37204310144316,1.37204310144316,1.37204310144316,1.37204310144316]
[null,"Scenario 1","TBA",null,null,null,null,null,null,null,null,null,null,null,null,null,null,null,null,null,null,null,null,null,9.3501387187220324,9.3501387187220324,9.3501387187220324,9.3501387187220324,9.3501387187220324]
[null,"Scenario 2","TBA"]
{"$rows_left_out":160}
{"sheet":"Input|General","index":3,"n_rows":16,"n_cols":22,"rows_kept":16,"cut":false,"hidden":false,"merged":[]}
[null,{"$f":"Index!$B$1","v":"AER opex model"},null,null,null,null,null,null,null,"Back to Index",null,"Key:","Input","External Link","Internal Link",null,null,"Worksheet check:",{"$f":"IF(COUNTA($S$5:$S$15)=COUNTIF($S5:$S16,\"OK\"),\"OK\",\"Check\")","v":"OK"},null,"Overall Check:",{"$f":"'Check|List'!$S$1","v":"Ok"}]
[null,{"$f":"Index!$C$7","v":"Input | General"}]
[]
[null,"Input | General inputs"]
[]
[null,null,"Inputs","Source",null,null,"Value"]
[null,null,"NSP name","NSP",null,null,"ElectraNet",null,null,null,null,null,null,null,null,null,null,null,{"$f":"IF(COUNTBLANK($G7),\"Check\",\"Ok\")","v":"Ok"}]
[null,null,"Decision stage","AER",null,null,"draft",null,null,null,null,null,null,null,null,null,null,null,{"$f":"IF(COUNTBLANK($G8),\"Check\",\"Ok\")","v":"Ok"}]
[null,null,"Year ending","NSP",null,null,"2000-06-01",null,null,null,null,null,null,null,null,null,null,null,{"$f":"IF(COUNTBLANK($G9),\"Check\",\"Ok\")","v":"Ok"}]
[null,null,"Previous regulatory control period, first year","NSP",null,null,2019,null,null,null,null,null,null,null,null,null,null,null,{"$f":"IF(COUNTBLANK($G10),\"Check\",\"Ok\")","v":"Ok"}]
{"$rows_left_out":7}
{"sheet":"Input|Inflation","index":4,"n_rows":108,"n_cols":23,"rows_kept":108,"cut":false,"hidden":false,"merged":[]}
[null,{"$f":"Index!$B$1","v":"AER opex model"},null,null,null,null,null,null,null,null,"Back to Index",null,"Key:","Input","External Link","Internal Link",null,null,"Worksheet check:",{"$f":"IF(COUNTA($T$5:$T$107)=COUNTIF($T5:$T108,\"OK\"),\"OK\",\"Check\")","v":"OK"},null,"Overall Check:",{"$f":"'Check|List'!$S$1","v":"Ok"}]
[null,{"$f":"Index!$C$7","v":"Input | General"}]
[]
[null,"Input | General inputs"]
[]
[null,null,null,"Index value, new base","Percentage Change from Corresponding Quarter of Previous Year","Index value, new base","Percentage Change from Corresponding Quarter of Previous Year"]
[null,null,"Source","ABS","Calculated","ABS","Calculated"]
[null,null,"Unit","index","Percent","index","Percent"]
[null,null,"2007-03-31",155.6,null,null,null,null,null,null,null,null,null,null,null,null,null,null,null,{"$f":"IF(C9>EOMONTH(DATE('Input|General'!$G$12,MONTH('Input|General'!$G$9),1),0),\"Ok\",IF(ISBLANK($D9),\"Check\",\"Ok\"))","v":"Ok"}]
[null,null,"2007-06-30",157.5,null,null,null,null,null,null,null,null,null,null,null,null,null,null,null,{"$f":"IF(C10>EOMONTH(DATE('Input|General'!$G$12,MONTH('Input|General'!$G$9),1),0),\"Ok\",IF(ISBLANK($D10),\"Check\",\"Ok\"))","v":"Ok"}]
{"$rows_left_out":99}
{"sheet":"Input|Reported opex","index":5,"n_rows":76,"n_cols":22,"rows_kept":76,"cut":false,"hidden":false,"merged":[]}
[null,null,{"$f":"Index!$B$1","v":"AER opex model"},null,null,null,null,null,null,"Back to Index",null,"Key:","Input","External Link","Internal Link",null,null,"Worksheet check:",{"$f":"IF(COUNTA($W$37:$W$269)=COUNTIF($W$37:$W$269,\"OK\"),\"OK\",\"Check\")","v":"OK"},null,"Overall Check:",{"$f":"'Check|List'!$S$1","v":"Ok"}]
[null,null,{"$f":"Index!$C$9","v":"Input | Reported opex"}]
[null,null,null,null,null,null,null,null,null,"Year ending"]
[null,null,null,"Source","Unit","Basis",null,null,null,{"$f":"DATE(PPFirstYear,MONTH('Input|General'!$G$9),1)","v":"2019-06-01"},{"$f":"DATE(PPFirstYear+1,MONTH('Input|General'!$G$9),1)","v":"2020-06-01"},{"$f":"DATE(PPFirstYear+2,MONTH('Input|General'!$G$9),1)","v":"2021-06-01"},{"$f":"DATE(PPFirstYear+3,MONTH('Input|General'!$G$9),1)","v":"2022-06-01"},{"$f":"DATE(PPFirstYear+4,MONTH('Input|General'!$G$9),1)","v":"2023-06-01"},{"$f":"DATE(PPFirstYear+5,MONTH('Input|General'!$G$9),1)","v":"2024-06-01"},{"$f":"DATE(PPFirstYear+6,MONTH('Input|General'!$G$9),1)","v":"2025-06-01"},{"$f":"DATE(PPFirstYear+7,MONTH('Input|General'!$G$9),1)","v":"2026-06-01"},{"$f":"DATE(PPFirstYear+8,MONTH('Input|General'!$G$9),1)","v":"2027-06-01"},{"$f":"DATE(PPFirstYear+9,MONTH('Input|General'!$G$9),1)","v":"2028-06-01"}]
[]
[]
[]
[null,"Input | Opex allowances"]
[null,null,null,null,null,null,null,null,null,{"$f":"2.28%/2","v":1.1399999999999999E-2}]
[null,null,"Cost category","Source","Unit","Basis",null,null,null,{"$f":"IF(YEAR(J$4)<=PPLastYear,J$4,\"\")","v":"2019-06-01"},"2020-06-01","2021-06-01","2022-06-01","2023-06-01","","","","","","Notes"]
{"$rows_left_out":67}
{"sheet":"Input|Rate of change","index":6,"n_rows":101,"n_cols":23,"rows_kept":101,"cut":false,"hidden":false,"merged":[[2,10,2,12],[2,14,2,19]]}
[null,{"$f":"Index!$B$1","v":"AER opex model"},null,null,null,null,null,null,null,null,"Back to Index",null,"Key:","Input","External Link","Internal Link",null,null,"Worksheet check:",{"$f":"IF(COUNTIF(W5:W100,\"Check\")=0,\"Ok\",\"Check\")","v":"Ok"},null,"Overall Check:",{"$f":"'Check|List'!$S$1","v":"Ok"}]
[null,{"$f":"Index!$C$10","v":"Input | Rate of change"}]
[null,null,null,null,null,null,null,null,null,"Year ending"]
[null,null,null,"Source","Unit","Basis",null,null,null,{"$f":"DATE(PPFirstYear-1,MONTH('Input|General'!$G$9),1)","v":"2018-06-01"},{"$f":"DATE(PPFirstYear,MONTH('Input|General'!$G$9),1)","v":"2019-06-01"},{"$f":"DATE(PPFirstYear+1,MONTH('Input|General'!$G$9),1)","v":"2020-06-01"},{"$f":"DATE(PPFirstYear+2,MONTH('Input|General'!$G$9),1)","v":"2021-06-01"},{"$f":"DATE(PPFirstYear+3,MONTH('Input|General'!$G$9),1)","v":"2022-06-01"},{"$f":"DATE(PPFirstYear+4,MONTH('Input|General'!$G$9),1)","v":"2023-06-01"},{"$f":"DATE(PPFirstYear+5,MONTH('Input|General'!$G$9),1)","v":"2024-06-01"},{"$f":"DATE(PPFirstYear+6,MONTH('Input|General'!$G$9),1)","v":"2025-06-01"},{"$f":"DATE(PPFirstYear+7,MONTH('Input|General'!$G$9),1)","v":"2026-06-01"},{"$f":"DATE(PPFirstYear+8,MONTH('Input|General'!$G$9),1)","v":"2027-06-01"},{"$f":"DATE(PPFirstYear+9,MONTH('Input|General'!$G$9),1)","v":"2028-06-01"}]
[]
[]
[]
[null,"Input | Inflation"]
[]
[null,null,"Inflation",null,null,null,null,null,null,{"$f":"IF(YEAR(J$4)<=PPLastYear,J$4,\"\")","v":"2018-06-01"},"2019-06-01","2020-06-01","2021-06-01","2022-06-01","2023-06-01","","","","",""]
{"$rows_left_out":92}
{"sheet":"Input|Step changes","index":7,"n_rows":42,"n_cols":23,"rows_kept":42,"cut":false,"hidden":false,"merged":[[2,13,2,18]]}
[null,{"$f":"Index!$B$1","v":"AER opex model"},null,null,null,null,null,null,null,"Back to Index",null,"Key:","Input","External Link","Internal Link",null,null,"Worksheet check:",{"$f":"IF(COUNTA($W$8:$W$235)=COUNTIF($W$8:$W$235,\"OK\"),\"OK\",\"Check\")","v":"OK"},null,"Overall Check:",{"$f":"'Check|List'!$S$1","v":"Ok"}]
[null,{"$f":"Index!$C$11","v":"Input | Step changes"}]
[null,null,null,null,null,null,null,null,null,"Year ending"]
[null,null,null,"Source","Unit","Basis",null,null,null,{"$f":"DATE(PPFirstYear,MONTH('Input|General'!$G$9),1)","v":"2019-06-01"},{"$f":"DATE(PPFirstYear+1,MONTH('Input|General'!$G$9),1)","v":"2020-06-01"},{"$f":"DATE(PPFirstYear+2,MONTH('Input|General'!$G$9),1)","v":"2021-06-01"},{"$f":"DATE(PPFirstYear+3,MONTH('Input|General'!$G$9),1)","v":"2022-06-01"},{"$f":"DATE(PPFirstYear+4,MONTH('Input|General'!$G$9),1)","v":"2023-06-01"},{"$f":"DATE(PPFirstYear+5,MONTH('Input|General'!$G$9),1)","v":"2024-06-01"},{"$f":"DATE(PPFirstYear+6,MONTH('Input|General'!$G$9),1)","v":"2025-06-01"},{"$f":"DATE(PPFirstYear+7,MONTH('Input|General'!$G$9),1)","v":"2026-06-01"},{"$f":"DATE(PPFirstYear+8,MONTH('Input|General'!$G$9),1)","v":"2027-06-01"},{"$f":"DATE(PPFirstYear+9,MONTH('Input|General'!$G$9),1)","v":"2028-06-01"}]
[]
[]
[]
[null,"Input |Step changes"]
[]
[null,null,"Step change","Source","Unit","Basis",null,null,null,{"$f":"IF(YEAR(J$4)>=FPFirstYear,IF(YEAR(J$4)<=FPLastYear,J$4,\"\"),\"\")","v":""},"","","","","2024-06-01","2025-06-01","2026-06-01","2027-06-01","2028-06-01"]
{"$rows_left_out":33}
{"sheet":"Calc|Opex forecast","index":8,"n_rows":104,"n_cols":22,"rows_kept":104,"cut":false,"hidden":false,"merged":[[2,13,2,18]]}
[null,{"$f":"Index!$B$1","v":"AER opex model"},null,null,null,null,null,null,null,"Back to Index",null,"Key:","Input","External Link","Internal Link",null,null,"Worksheet check:","n/a",null,"Overall Check:",{"$f":"'Check|List'!$S$1","v":"Ok"}]
[null,{"$f":"Index!$C$13","v":"Calc | Opex Forecast"}]
[null,null,null,null,null,null,null,null,null,"Year ending"]
[null,null,null,"Source","Unit","Basis",null,null,null,{"$f":"DATE(PPFirstYear,MONTH('Input|General'!$G$9),1)","v":"2019-06-01"},{"$f":"DATE(PPFirstYear+1,MONTH('Input|General'!$G$9),1)","v":"2020-06-01"},{"$f":"DATE(PPFirstYear+2,MONTH('Input|General'!$G$9),1)","v":"2021-06-01"},{"$f":"DATE(PPFirstYear+3,MONTH('Input|General'!$G$9),1)","v":"2022-06-01"},{"$f":"DATE(PPFirstYear+4,MONTH('Input|General'!$G$9),1)","v":"2023-06-01"},{"$f":"DATE(PPFirstYear+5,MONTH('Input|General'!$G$9),1)","v":"2024-06-01"},{"$f":"DATE(PPFirstYear+6,MONTH('Input|General'!$G$9),1)","v":"2025-06-01"},{"$f":"DATE(PPFirstYear+7,MONTH('Input|General'!$G$9),1)","v":"2026-06-01"},{"$f":"DATE(PPFirstYear+8,MONTH('Input|General'!$G$9),1)","v":"2027-06-01"},{"$f":"DATE(PPFirstYear+9,MONTH('Input|General'!$G$9),1)","v":"2028-06-01"}]
[]
[]
[]
[null,"Calc | Estimated final year expenditure",null,null,"$millions",{"$f":"DATE(PPLastYear,MONTH('Input|General'!$G$9),1)","v":"2023-06-01"}]
[]
[null,null,null,"Source","Unit","Basis",null,null,null,{"$f":"IF(YEAR(J$4)<=PPLastYear,J$4,\"\")","v":"2019-06-01"},"2020-06-01","2021-06-01","2022-06-01","2023-06-01","","","","",""]
{"$rows_left_out":95}
{"sheet":"Output|Models","index":9,"n_rows":18,"n_cols":22,"rows_kept":18,"cut":false,"hidden":false,"merged":[[2,13,2,18]]}
[null,{"$f":"Index!$B$1","v":"AER opex model"},null,null,null,null,null,null,null,"Back to Index",null,"Key:","Input","External Link","Internal Link",null,null,"Worksheet check:","n/a",null,"Overall Check:",{"$f":"'Check|List'!$S$1","v":"Ok"}]
[null,{"$f":"Index!$C$14","v":"Output | Models"}]
[null,null,null,null,null,null,null,null,null,"Year ending"]
[null,null,null,"Source","Unit","Basis",null,null,null,{"$f":"DATE(PPFirstYear,MONTH('Input|General'!$G$9),1)","v":"2019-06-01"},{"$f":"DATE(PPFirstYear+1,MONTH('Input|General'!$G$9),1)","v":"2020-06-01"},{"$f":"DATE(PPFirstYear+2,MONTH('Input|General'!$G$9),1)","v":"2021-06-01"},{"$f":"DATE(PPFirstYear+3,MONTH('Input|General'!$G$9),1)","v":"2022-06-01"},{"$f":"DATE(PPFirstYear+4,MONTH('Input|General'!$G$9),1)","v":"2023-06-01"},{"$f":"DATE(PPFirstYear+5,MONTH('Input|General'!$G$9),1)","v":"2024-06-01"},{"$f":"DATE(PPFirstYear+6,MONTH('Input|General'!$G$9),1)","v":"2025-06-01"},{"$f":"DATE(PPFirstYear+7,MONTH('Input|General'!$G$9),1)","v":"2026-06-01"},{"$f":"DATE(PPFirstYear+8,MONTH('Input|General'!$G$9),1)","v":"2027-06-01"},{"$f":"DATE(PPFirstYear+9,MONTH('Input|General'!$G$9),1)","v":"2028-06-01"}]
[]
[]
[]
[null,"Inputs for Post Tax Revenue Model",null,null,"$millions",{"$f":"DATE(PPLastYear,MONTH('Input|General'!$G$9),1)","v":"2023-06-01"},null,null,null,"Note. The dollar base should be consistent with the post tax revenue model"]
[]
[]
{"$rows_left_out":9}
{"sheet":"Lookup|Tables","index":10,"n_rows":76,"n_cols":22,"rows_kept":76,"cut":false,"hidden":false,"merged":[]}
[null,{"$f":"Index!$B$1","v":"AER opex model"},null,null,null,null,null,null,null,"Back to Index",null,"Key:","Input","External Link","Internal Link",null,null,null,null,null,"Overall Check:",{"$f":"'Check|List'!$S$1","v":"Ok"}]
[null,{"$f":"Index!$C$15","v":"Lookup | Tables"}]
[]
[]
[]
[]
[null,"Unit Denominations"]
[]
[null,null,{"$f":"B7","v":"Unit Denominations"},"Source",null,null,"Ref"]
[null,null,"Dollars","AER",null,null,"$dollars"]
{"$rows_left_out":67}
{"sheet":"Check|List","index":11,"n_rows":18,"n_cols":19,"rows_kept":18,"cut":false,"hidden":false,"merged":[]}
[null,{"$f":"Index!$B$1","v":"AER opex model"},null,null,null,null,null,null,null,"Back to Index",null,"Key:","Input","External Link","Internal Link",null,null,"Overall Check:",{"$f":"IF(COUNTIF(G10:G16,\"Check\")=0,\"Ok\",\"Check\")","v":"Ok"}]
[null,{"$f":"Index!$C$16","v":"Check | List"}]
[]
[]
[]
[]
[null,"Check List"]
[]
[null,null,"Sheet","Source","Unit",null,"Status"]
[null,null,{"$f":"Index!C7","v":"Input | General"},{"$f":"C10","v":"Input | General"},"Ok/Check",null,{"$f":"'Input|General'!S1","v":"OK"}]
{"$rows_left_out":8}