{"text_format":"1","workbook":"xlsx","n_sheets":32,"sheets":["AER CF","AER NRs","AER lookups","AER ETL","Instructions","CONTENTS","Business & other details","CPI series","2.1 Expenditure summary","2.2 Repex","2.3 Augex (a)","2.3 Augex (b)","2.5 Connections","2.6 Non-network","2.11 Labour","2.10 Overheads","2.14 Forecast price changes","2.16 Opex Summary","2.17 Step Changes","3.1 Revenue","3.2 Operating expenditure","3.3 Assets (RAB)","3.4 Operational data","3.5 Physical assets","3.7 Operating environment","5.4 MD & Utilisation - Spatial","7.1  Policies and Procedures","7.2 Contingent projects","7.3 Obligations","7.4 Shared Assets","7.9 STPIS","8.2 Capex"],"not_rendered":{"charts":0,"images":5,"macros":1,"external_links":1,"defined_names":589,"comments":1,"pivot_tables":0},"unopened":[],"bounds":{"document_bytes":16777216,"sheet_cells":100000,"rows_first":2000,"rows_last":500,"rows_between":2000,"halvings":0,"cell_chars":16384,"cell_head_chars":4096},"cells_cut":0,"cells_raw":0,"read":"whole","date_system":"1900"}

{"sheet":"AER CF","index":0,"n_rows":75,"n_cols":25,"rows_kept":75,"cut":false,"hidden":true,"merged":[[3,1,3,22],[38,38,38,59],[39,38,39,59],[40,38,40,59],[38,69,38,90],[39,69,39,90],[40,69,40,90]]}
[null,"AER CONDITIONAL FORMATTING"]
[]
[null,"CELLS FLAGED \"Y\" and greyed out will be greyed out in the worksheets."]
[null,"CONDITIONAL FORMATTING MAP"]
[null,null,null,null,null,"=INDEX(dms_CF_3.6.1, MATCH(dms_TradingName,dms_CF_TradingName))=\"Y\"","=INDEX(dms_CF_3.6.5, MATCH(dms_TradingName,dms_CF_TradingName))=\"Y\"","=INDEX(dms_CF_3.6.6.1, MATCH(dms_TradingName,dms_CF_TradingName))=\"Y\"","=INDEX(dms_CF_3.6.6.2, MATCH(dms_TradingName,dms_CF_TradingName))=\"Y\"","=INDEX(dms_CF_3.6.6.3, MATCH(dms_TradingName,dms_CF_TradingName))=\"Y\"","=INDEX(dms_CF_3.6.7.1, MATCH(dms_TradingName,dms_CF_TradingName))=\"Y\"","=INDEX(dms_CF_3.6.7.2, MATCH(dms_TradingName,dms_CF_TradingName))=\"Y\"","=INDEX(dms_CF_3.6.7.3, MATCH(dms_TradingName,dms_CF_TradingName))=\"Y\"","=INDEX(dms_CF_3.6.7.4, MATCH(dms_TradingName,dms_CF_TradingName))=\"Y\"","=INDEX(dms_CF_3.6.8, MATCH(dms_TradingName,dms_CF_TradingName))=\"Y\"","=INDEX(dms_CF_4.1, MATCH(dms_TradingName,dms_CF_TradingName))=\"Y\"","=INDEX(dms_CF_6.8, MATCH(dms_TradingName,dms_CF_TradingName))=\"Y\"","=INDEX(dms_CF_7.12, MATCH(dms_TradingName,dms_CF_TradingName))=\"Y\"","=INDEX(dms_CF_8.1_A, MATCH(dms_TradingName,dms_CF_TradingName))=\"Y\"","=INDEX(dms_CF_8.1_B, MATCH(dms_TradingName,dms_CF_TradingName))=\"Y\"",{"$f":"INDEX(dms_CF_8.1_Neg, MATCH(dms_TradingName,dms_CF_TradingName))=\"Y\"","v":true},"=INDEX(dms_CF_4.4.1_Neg, MATCH(dms_TradingName,dms_CF_TradingName))=\"Y\"",null,null,"=INDEX(dms_CF_F10, MATCH(dms_TradingName,dms_CF_TradingName))=\"Y\""]
[null,"dms_CF_TradingName","JurisdictionList","Sector","Segment","dms_CF_3.6.1","dms_CF_3.6.5","dms_CF_3.6.6.1","dms_CF_3.6.6.2","dms_CF_3.6.6.3","dms_CF_3.6.7.1","dms_CF_3.6.7.2","dms_CF_3.6.7.3","dms_CF_3.6.7.4","dms_CF_3.6.8","dms_CF_4.1","dms_CF_6.8 (set from dms_MAIFI_flag)","dms_CF_7.12","dms_CF_8.1_A  (and 8.4)","dms_CF_8.1_B  (and 8.4)","dms_CF_8.1_Neg  (and 8.4)","dms_CF_4.4.1","dms_CF_MAIFI_flag (set from dms_MAIFI_flag)","9.5 TUOS (set from Jurisdiction)","dms_CF_F10"]
[null,"Ausgrid","NSW","Electricity","Distribution",null,"Y","N","Y","Y","N","N","N","Y","N","N",{"$f":"IFERROR(IF(dms_MAIFI_flag=\"Yes\",\"N\",\"Y\"),\"Y\")","v":"Y"},"Y","N","Y","Y","N",{"$f":"IFERROR(LEFT(dms_MAIFI_flag),\"N\")","v":"N"},{"$f":"IF('AER CF'!$C7=\"Vic\",\"Y\",\"N\")","v":"N"}]
[null,"Ausgrid (Tx Assets)","NSW","Electricity","Distribution",null,"Y","N","Y","Y","N","N","N","Y","N","N","Y","Y","N","Y","Y","N",{"$f":"IFERROR(LEFT(dms_MAIFI_flag),\"N\")","v":"N"},{"$f":"IF('AER CF'!$C8=\"Vic\",\"Y\",\"N\")","v":"N"}]
[null,"AusNet (D)","Vic","Electricity","Distribution",null,"N","N",null,null,"N","N","N","N","N","N","Y","N","N","N","Y","N",{"$f":"IFERROR(LEFT(dms_MAIFI_flag),\"N\")","v":"N"},{"$f":"IF('AER CF'!$C9=\"Vic\",\"Y\",\"N\")","v":"Y"}]
[null,"AusNet (T)","Vic","Electricity","Transmission",null,"N",null,null,null,"N","N","N","N","N","Y","Y","N","N","N","Y","N","N",{"$f":"IF('AER CF'!$C10=\"Vic\",\"Y\",\"N\")","v":"Y"}]
[null,"Amadeus","NT","Gas","Transmission",null,"N",null,null,null,"N","N","N","N","N","Y","Y","N","N","N","Y","N","N",{"$f":"IF('AER CF'!$C11=\"Vic\",\"Y\",\"N\")","v":"N"},"N"]
[null,"APA GasNet","Vic","Gas","Transmission",null,"N",null,null,null,"N","N","N","N","N","Y","Y","N","N","N","Y","N","N",{"$f":"IF('AER CF'!$C12=\"Vic\",\"Y\",\"N\")","v":"Y"},"Y"]
[null,"Australian Distribution Co.","NSW","Electricity","Distribution","N","N","N","N",null,"N","N","N","N","N","N","Y","N","N","N","N","N","N",{"$f":"IF('AER CF'!$C13=\"Vic\",\"Y\",\"N\")","v":"N"}]
[null,"Australian Distribution Co. (Vic)","Vic","Electricity","Distribution","N","N","N","N",null,"N","N","N","N","N","N","Y","N","N","N","N","N","N",{"$f":"IF('AER CF'!$C14=\"Vic\",\"Y\",\"N\")","v":"Y"}]
[null,"CitiPower","Vic","Electricity","Distribution",null,"N","N",null,null,"N","N","N","N","N","N","Y","N","N","N","Y","N","N",{"$f":"IF('AER CF'!$C15=\"Vic\",\"Y\",\"N\")","v":"Y"}]
[null,"Directlink","Qld","Electricity","Transmission",null,"N",null,null,null,"N","N","N","N","N","Y","Y","N","N","Y","Y","N","N",{"$f":"IF('AER CF'!$C16=\"Vic\",\"Y\",\"N\")","v":"N"}]
[null,"ElectraNet","SA","Electricity","Transmission",null,"N",null,null,null,"N","N","N","N","N","Y","Y","N","N","Y","Y","N","N",{"$f":"IF('AER CF'!$C17=\"Vic\",\"Y\",\"N\")","v":"N"}]
[null,"Endeavour Energy","NSW","Electricity","Distribution",null,"Y","N","Y","Y","N","N","N","Y","N","N","Y","Y","N","Y","Y","Y","N",{"$f":"IF('AER CF'!$C18=\"Vic\",\"Y\",\"N\")","v":"N"}]
[null,"Energex","Qld","Electricity","Distribution",null,"Y","N",null,null,"N","N","N","N","N","N","Y","Y","N","Y","Y","Y","N",{"$f":"IF('AER CF'!$C19=\"Vic\",\"Y\",\"N\")","v":"N"}]
[null,"Ergon Energy","Qld","Electricity","Distribution",null,"Y","N","Y","Y","N","N","N","N","N","N","Y","Y","N","Y","Y","N","N",{"$f":"IF('AER CF'!$C20=\"Vic\",\"Y\",\"N\")","v":"N"}]
[null,"Essential Energy","NSW","Electricity","Distribution",null,"Y","N","Y","Y","N","N","N","Y","N","N","Y","Y","N","Y","Y","N","N",{"$f":"IF('AER CF'!$C21=\"Vic\",\"Y\",\"N\")","v":"N"}]
[null,"Evoenergy Distribution","ACT","Electricity","Distribution",null,"Y","N","Y","Y","Y","Y","N","Y","N","Y","Y","Y","N","Y","Y","N","N",{"$f":"IF('AER CF'!$C22=\"Vic\",\"Y\",\"N\")","v":"N"}]
[null,"Evoenergy Distribution (Tx Assets)","ACT","Electricity","Distribution",null,"Y","N","Y","Y","Y","Y","N","Y","N","Y","Y","Y","N","Y","Y","N","N",{"$f":"IF('AER CF'!$C23=\"Vic\",\"Y\",\"N\")","v":"N"}]
[null,"Jemena Electricity","Vic","Electricity","Distribution",null,"N","N",null,null,"N","N","N","N","N","N","Y","N","N","N","Y","N","N",{"$f":"IF('AER CF'!$C24=\"Vic\",\"Y\",\"N\")","v":"Y"}]
[null,"Murraylink","SA","Electricity","Transmission",null,"N",null,null,null,"N","N","N","N","N","Y","Y","N","N","Y","Y","N","N",{"$f":"IF('AER CF'!$C25=\"Vic\",\"Y\",\"N\")","v":"N"}]
[null,"Power and Water","NT","Electricity","Distribution",null,"N","N",null,null,"N","Y","N","N","N","Y","Y","Y","N","Y","Y","N","N",{"$f":"IF('AER CF'!$C26=\"Vic\",\"Y\",\"N\")","v":"N"}]
[null,"Powercor Australia","Vic","Electricity","Distribution",null,"N","N",null,null,"N","N","N","N","N","N","Y","N","N","N","Y","N","N",{"$f":"IF('AER CF'!$C27=\"Vic\",\"Y\",\"N\")","v":"Y"}]
[null,"Powerlink","Qld","Electricity","Transmission",null,"N",null,null,null,"N","N","N","N","N","Y","Y","N","N","Y","Y","N","N",{"$f":"IF('AER CF'!$C28=\"Vic\",\"Y\",\"N\")","v":"N"}]
[null,"Roma to Brisbane Pipeline","Qld","Gas","Transmission",null,"N",null,null,null,"N","N","N","N","N","Y","Y","N","N","N","Y","N","N",{"$f":"IF('AER CF'!$C29=\"Vic\",\"Y\",\"N\")","v":"N"},"Y"]
[null,"SA Power Networks","SA","Electricity","Distribution",null,"Y","N",null,null,"N","N","N","N","N","N","Y","Y","N","Y","N","N","N",{"$f":"IF('AER CF'!$C30=\"Vic\",\"Y\",\"N\")","v":"N"}]
[null,"TasNetworks (D)","Tas","Electricity","Distribution",null,"Y","N",null,null,"N","N","N","N","N","N","Y","Y","N","Y","Y","N","N",{"$f":"IF('AER CF'!$C31=\"Vic\",\"Y\",\"N\")","v":"N"}]
[null,"TasNetworks (T)","Tas","Electricity","Transmission",null,"N",null,null,null,"N","N","N","N","N","Y","Y","N","N","Y","Y","N","N",{"$f":"IF('AER CF'!$C32=\"Vic\",\"Y\",\"N\")","v":"N"}]
[null,"TransGrid","NSW","Electricity","Transmission",null,"N",null,null,null,"N","N","N","N","N","Y","Y","N","N","Y","Y","N","N",{"$f":"IF('AER CF'!$C33=\"Vic\",\"Y\",\"N\")","v":"N"}]
[null,"United Energy","Vic","Electricity","Distribution",null,"N","N",null,null,"N","N","N","N","N","N","Y","N","N","N","Y","N","N",{"$f":"IF('AER CF'!$C34=\"Vic\",\"Y\",\"N\")","v":"Y"}]
[]
[]
[null,"Confidential"]
[null,"Amended"]
[]
[null,"Worksheet 6.2 STPIS reliability"]
[null,"Formula",null,null,null,"Applied to:"]
[]
[null,"=INDEX(dms_CBD_flag,MATCH(dms_TradingName,dms_TradingName_List))=\"NO\"",null,null,null,"$D$11,$D$17,$D$23,$D$33,$D$39,$D$45,$D$55,$D$61,$D$67,$D$77,$D$83,$D$89"]
[null,"=INDEX(dms_Urban_flag,MATCH(dms_TradingName,dms_TradingName_List))=\"NO\"",null,null,null,"$D$12,$D$18,$D$24,$D$56,$D$62,$D$78,$D$68,$D$84"]
[null,"=INDEX(dms_ShortRural_flag,MATCH(dms_TradingName,dms_TradingName_List))=\"NO\"",null,null,null,"$D$13,$D$19,$D$25,$D$57,$D$63,$D$69,$D$79,$D$85"]
[null,"=INDEX(dms_LongRural_flag,MATCH(dms_TradingName,dms_TradingName_List))=\"NO\"",null,null,null,"$D$14,$D$20,$D$26,$D$58,$D$64,$D$65,$D$70,$D$71,$D$80,$D$86"]
[null,"=INDEX(dms_FeederType_5_flag,MATCH(dms_TradingName,dms_TradingName_List))=\"NO\"",null,null,null,"$D$87,$D$81,$D$71,$D$65,$D$59,$D$49,$D$43,$D$37,$D$21,$D$15"]
[null,"=dms_MAIFI_Flag=\"No\"",null,null,null,"$D$55:$D$72"]
[]
[]
[null,"Business & other details"]
[null,"=(INDEX(dms_Model_Span,MATCH(dms_Model,dms_Model_List))>1)"]
[null,"=(INDEX(dms_Model_Span,MATCH(dms_Model,dms_Model_List))=1)"]
[]
[]
[null,"STYLES IN USE"]
[null,"HEADING ONE","dms_1"]
[null,"HEADING TWO","dms_2"]
[null,"HEADING THREE","dms_3"]
[null,"HEADING FOUR","dms_4"]
[null,"HEADING FIVE","dms_5"]
[null,5.1109999999999998,"dms_NUM"]
[null,5.45E-2,"dms_NUM%"]
[null,5.5555000000000003,"dms_NUM3d"]
[null,"Text description","dms_Row_Locked"]
[null,"Text description","dms_Row1"]
[null,"Text description","dms_Row2"]
[null,"Total","dms_T1"]
[null,"Total","dms_T2"]
[null,"EXPENSES","dms_BH"]
[null,2019,"dms_BY1"]
[null,2019,"dms_BY2"]
[null,"VOLUMES","dms_GH"]
[null,2019,"dms_GY1"]
[null,2019,"dms_GY2"]

{"sheet":"AER NRs","index":1,"n_rows":227,"n_cols":15,"rows_kept":227,"cut":false,"hidden":true,"merged":[[32,67,32,88],[33,67,33,88],[34,67,34,88],[35,10,39,10],[43,10,44,10],[32,10,34,10],[32,36,32,57],[33,36,33,57],[34,36,34,57],[207,1,212,1],[198,1,199,1],[31,1,54,1],[99,1,106,1],[109,1,114,1],[190,1,191,1],[194,1,195,1],[159,1,173,1],[4,1,27,1],[175,1,176,1],[178,1,183,1],[64,1,77,1],[134,1,149,1],[83,1,96,1],[151,1,157,1],[117,1,131,1]]}
[null,"AER NAMED RANGES"]
[]
[null,"DROP DOWN SELECTORS USED IN WORKBOOKS"]
[]
[null,"COVER SHEET","dms_DataQuality_List","dms_Confid_status_List"]
[null,null,"-- select --","-- select --"]
[null,null,"Actual","Public"]
[null,null,"Estimate","Confidential"]
[null,null,"Consolidated"]
[]
[]
[null,null,"For all files either AER or business needs to be able to specify the type of submission","For PTRM & RFM templates we must provide a choice in case they change their form of control - otherwise it is drawn from the business specific lookup table above."]
[null,null,"dms_SourceList","dms_FormControl_Choices"]
[null,null,"-- select --","Revenue cap"]
[null,null,"After appeal","Revenue yield"]
[null,null,"Draft decision","Weighted average price cap"]
[null,null,"Final decision"]
[null,null,"PTRM update 1"]
[null,null,"PTRM update 2"]
[null,null,"PTRM update 3"]
[null,null,"PTRM update 4"]
[null,null,"PTRM update 5"]
[null,null,"PTRM update 6"]
[null,null,"PTRM update 7"]
[null,null,"Recast"]
[null,null,"Regulatory proposal"]
[null,null,"Reporting"]
[null,null,"Revised regulatory proposal"]
[]
[]
[null,null,null,null,null,null,null,null,null,null,"This is used to create an image to insert on 6.3 STPIS sheet - not for dropdown lists.",null,null,"GAS"]
[null,"CA & RESET RINS \nDNSP","dms_DNSP_020301_SubstationType","dms_DNSP_020301_ProjectType","dms_DNSP_020301_ProjectTrigger","dms_DNSP_020302_ProjectType","dms_DNSP_020302_ProjectTrigger","dms_STPIS_Exclusion_List","dms_Reason_Interruption","dms_Reason_Interruption_Detailed","Reason for interruption",null,null,"dms_N0205_AssetType"]
[null,null,"Subtransmission substation","New substation establishment","Demand growth","New line on new route - single circuit","Demand growth","Weather","Animal","Animal impact","Animal","Animal impact",null,"Cast Iron"]
[null,null,"Zone substation","Substation upgrade - capacity"," Voltage issues","New line on new route - dual circuit"," Voltage issues","Equipment failure","Asset failure","Animal nesting/burrowing, etc and other",null,"Animal nesting/burrowing, etc and other",null,"PVC"]
[null,null,"Switching station","Substation upgrade - voltage"," Reactive power issue","New line on new route - other"," Reactive power issue","Operational error","Other","Other",null,"Other",null,"Polyamide"]
[null,null,"Other","Other"," Fault level issues","Line rebuild over existing route - single circuit"," Fault level issues","Vegetation","Overloads","LV","Asset failure","LV",null,"High density polyethylene (80)"]
[null,null,null,null," Safety","Line rebuild over existing route - dual circuit"," Net market benefit","Animals","Planned","Distribution substation",null,"Distribution substation",null,"High density polyethylene (100)"]
[null,null,null,null," Environment","Reconductor - Single circuit"," Safety","Third party impacts","Network business","HV",null,"HV",null,"High density polyethylene (250)"]
[null,null,null,null," Other","Reconductor - Dual circuit"," Environment","Transmission failure","Third party","Zone substation",null,"Zone substation",null,"High density polyethylene (575)"]
[null,null,null,null,null,"Reconductor - Other"," Other","Load shedding","Unknown","Subtransmission",null,"Subtransmission",null,"Medium density polyethylene"]
[null,null,null,null,null,"Line upgrade - raising/retensoring",null,"Inter-distributor connection failure","Vegetation","insert description of 'other'","Other","insert description of 'other'",null,"Unprotected steel"]
[null,null,null,null,null,"Line upgrade - voltage upgrade",null,"Other","Weather","Network error","Overloads",null,null,"Protected steel"]
[null,null,null,null,null,"Line upgrade - capacity",null,null,"2 - STPIS Exclusion (3.3)(a)","Switching and protection error","Planned",null,null,"Other"]
[null,null,null,null,null,"String spare circuit",null,null,"3 - STPIS Exclusion (3.3)(a)","Fire","Network business","Network error"]
[null,null,null,null,null,"Other",null,null,"4 - STPIS Exclusion (3.3)(a)","Other",null,"Switching and protection error"]
[null,null,null,null,null,null,null,null,"5 - STPIS Exclusion (3.3)(a)","Dig-in","Third party","Fire"]
[null,null,null,null,null,null,null,null,"6 - STPIS Exclusion (3.3)(a)","Unauthorised access",null,"Other"]
[null,null,null,null,null,null,null,null,"7 - STPIS Exclusion (3.3)(a)","Vehicle impact",null,"Dig-in"]
[null,null,null,null,null,null,null,null,null,"Unknown",null,"Unauthorised access"]
[null,null,null,null,null,null,null,null,null,"Blow-in/Fall-in - NSP responsibility",null,"Vehicle impact"]
[null,null,null,null,null,null,null,null,null,"Grow-in - NSP responsibility","Unknown","Unknown"]
[null,null,null,null,null,null,null,null,null,"Blow-in/Fall-in - Other responsible party","Vegetation","Blow-in/Fall-in - NSP responsibility"]
[null,null,null,null,null,null,null,null,null,"Grow-in - Other responsible party",null,"Grow-in - NSP responsibility"]
[null,null,null,null,null,null,null,null,null,null,null,"Blow-in/Fall-in - Other responsible party"]
[null,null,null,null,null,null,null,null,null,null,null,"Grow-in - Other responsible party"]
[null,null,null,null,null,null,null,null,null,null,"Weather"]
[null,null,null,null,null,null,null,null,null,null,"2 - STPIS Exclusion (3.3)(a)"]
[null,null,null,null,null,null,null,null,null,null,"3 - STPIS Exclusion (3.3)(a)"]
[null,null,null,null,null,null,null,null,null,null,"4 - STPIS Exclusion (3.3)(a)"]
[null,null,null,null,null,null,null,null,null,null,"5 - STPIS Exclusion (3.3)(a)"]
[null,null,null,null,null,null,null,null,null,null,"6 - STPIS Exclusion (3.3)(a)"]
[null,null,null,null,null,null,null,null,null,null,"7 - STPIS Exclusion (3.3)(a)"]
[]
[]
[null,"CA & RESET RINS \nTNSP ","dms_TNSP_0203_SubstationType","dms_TNSP_020301_ProjectType","dms_TNSP_020301_ProjectTrigger","dms_TNSP_020302_ProjectType","dms_TNSP_0203_ProjectTrigger"]
[null,null,"Terminal station","New substation establishment","Demand growth","New line on new route - single circuit","Demand growth"]
[null,null,"Switching station","Capacity upgrade"," Voltage issues","New line on new route - dual circuit"," Voltage issues"]
[null,null,"Transmission substation","Voltage upgrade"," Reactive power issue","New line on new route - other"," Reactive power issue"]
[null,null,"Other","Other"," Fault level issues","Line rebuild over existing route - single circuit"," Fault level issues"]
[null,null,null,null,"Net market benefit","Line rebuild over existing route - dual circuit"," Net market benefit"]
[null,null,null,null," Safety","Reconductor - Single circuit"," Safety"]
[null,null,null,null," Environment","Reconductor - Dual circuit"," Environment"]
[null,null,null,null," Other","Reconductor - Other"," Other"]
[null,null,null,null,null,"Line upgrade - raising/retensoring"]
[null,null,null,null,null,"Line upgrade - voltage upgrade"]
[null,null,null,null,null,"Line upgrade - capacity"]
[null,null,null,null,null,"String spare circuit"]
[null,null,null,null,null,"Other"]
[]
[]
[]
[null,"NAMED RANGES USED IN ETL PROCESS"]
[null,null,null,null,null,null,null,null,null,null,null,null,"GAS ARR & RESET"]
[null,"CA & RESET RINS \nDNSP ONLY","dms_020303_01_UOM","dms_020501_01_UOM","dms_020501_02_UOM","dms_020501_03_UOM","dms_020501_04_UOM","dms_020701_01_UOM","dms_020701_02_UOM","dms_020701_01_Rows","dms_040102_01_UOM","dms_040102_04_UOM","dms_S140101_UOM","dms_E050201_UOM","dms_E050302_UOM"]
[null,null,"Circuit line length in km","0's","0's","0's","0's","km","km","Route line length within zone","0's","days","number","per metre per connection","metres per connection"]
[null,null,"Circuit line length in km","0's","0's","0's","0's","0's","0's","Number of maintenance spans","0's","0's","number","per service per connection","number per connection"]
[null,null,"Circuit line length in km","MVA added","MVA added","MVA added","MVA added","km","km","Total length of maintenance spans","0's","$0s","number","number per connection","number per connection"]
[null,null,"Circuit line length in km","0's","0's","0's","0's","km","km","Length of vegetation corridors","$0s","0's","km"]
[null,null,"Number","total spend $0s","total spend $0s","total spend $0s","total spend $0s","0's","0's","Average number of trees per maintenance span"]
[null,null,"Number","net circuit km added","net circuit km added","net circuit km added","net circuit km added","years","years","Average frequency of cutting cycle"]
[null,null,"Number","total spend $0s","total spend $0s","total spend $0s","total spend $0s"]
[null,null,null,"net circuit km added","net circuit km added","net circuit km added","net circuit km added"]
[null,null,null,"total spend $0s","total spend $0s","total spend $0s","total spend $0s"]
[null,null,null,"0's",null,"$0s"]
[null,null,null,"0's"]
[null,null,null,"0's"]
[null,null,null,"$0s"]
[]
[]
[null,"CA & RESET RINS \nTNSP ONLY","dms_020701_01_UOM"]
[null,null,"km"]
[null,null,"0's"]
[null,null,"km"]
[null,null,"0's"]
[null,null,"km"]
[null,null,"metres"]
[null,null,"years"]
[]
[]
[null,"CA & RESET RINS \nDNSP & TNSP","dms_020603_01_UOM"]
[null,null,"0's"]
[null,null,"0's"]
[null,null,"0's"]
[null,null,"0's"]
[null,null,"(per cent)"]
[]
[]
[null,"EB & RESET RINS \nDNSP ONLY","dms_030601_01_UOM","dms_030601_02_UOM","dms_030701_01_UOM","dms_030702_01_UOM","dms_030703_01_UOM"]
[null,null,"minutes/customer","minutes/customer","Customer / km","%","km"]
[null,null,"minutes/customer","minutes/customer","MWh/customer","Number of spans"]
[null,null,"interruptions/customer","interruptions/customer","kVA / customer","Number of spans"]
[null,null,"interruptions/customer","interruptions/customer",null,"Number of spans"]
[null,null,null,null,null,"Number of spans"]
[null,null,null,null,null,"Years"]
[null,null,null,null,null,"Years"]
[null,null,null,null,null,"Trees"]
[null,null,null,null,null,"Trees"]
[null,null,null,null,null,"Defects"]
[null,null,null,null,null,"Defects"]
[null,null,null,null,null,"Spans"]
[null,null,null,null,null,"km"]
[null,null,null,null,null,"Spans"]
[]
[null,null,"WHEN INSERTING COVER SHEET INTO A TNSP FILE - APPLY THESE NAMED RANGES"]
[null,"EB & RESET RINS \nTNSP ONLY","dms_030601_01_UOM",null,"dms_030701_01_UOM","dms_030702_01_UOM"]
[null,null,"%",null,"Number of spans","km"]
[null,null,"number",null,"Years","%"]
[null,null,"number",null,"Trees","km"]
[null,null,"%",null,"Defects","number"]
[null,null,"number",null,"Number of spans"]
[null,null,"number",null,"km"]
[null,null,"%",null,"km"]
[null,null,"number",null,"Number of spans"]
[null,null,"number"]
[null,null,"%"]
[null,null,"number"]
[null,null,"%"]
[null,null,"number"]
[null,null,"%"]
[null,null,"number"]
[]
[null,"EB & RESET RINS \nDNSP & TNSP","dms_EB_RAB_PIT"]
[null,null,"Beginning of year"]
[null,null,"End of year"]
[null,null,"End of year"]
[null,null,"End of year"]
[null,null,"End of year"]
[null,null,"End of year"]
[]
[null,"ARR \nDNSP ONLY","dms_030605_UOM","dms_03060703_UOM","dms_E020202_UOM","Spare"]
[null,null,"number","number","Length of mains replaced"]
[null,null,"number","number","Number of services replaced"]
[null,null,"number","number"]
[null,null,"number","number"]
[null,null,"number","(per cent)"]
[null,null,"number"]
[null,null,"number"]
[null,null,"number"]
[null,null,"number"]
[null,null,"number"]
[null,null,"number"]
[null,null,"number"]
[null,null,"(per cent)"]
[null,null,"(per cent)",""]
[]
[null,"RFM","dms_Beg","dms_Mid","dms_End"]
[null,null,"Beginning of year","Mid year","End of Year"]
[]
[null,"PTRM","dms_PTRM_RAB_PIT","dms_PTRM_TAB_PIT","DMS_Xfactor"]
[null,null,"Beginning of year","Beginning of year","x factors"]
[null,null,"End of year","End of year"]
[null,null,"End of year","End of year"]
[null,null,"End of year","End of year"]
[null,null,"End of year"]
[]
[]
[null,"STPIS & MIC NAMED RANGES "]
[]
[null,"These \"row descriptions\" are the column headings in the various templates but become row descriptions in the ETL process"]
[]
[null,"Table 6.3 sustained interruptions - row descriptions","dms_060301_CustNo_Affected_Row","dms_060301_Avg_Duration_Sustained_Int_Row","dms_060301_Effect_unplanned_SAIDI_Row","dms_060301_Effect_unplanned_SAIFI_Row"]
[null,null,"Number of customers affected by the interruption","Average duration of sustained customer interruption","Effect on unplanned SAIDI","Effect on unplanned SAIFI"]
[]
[]
[null,"Table 6.1 telephone answering - row descriptions and start date","dms_060101_Rows","dms_060102_Rows","dms_060101_StartDateTxt"]
[null,null,"Total number of calls \n(after removing excluded events)","Number of calls answered within 30 seconds \n(after excluding excluded events) ",{"$f":"dms_060701_StartDateTxt","v":"1-Jul-2016"}]
[]
[]
[null,"Table 6.8.1 - row descriptions","dms_060801_01_Rows","dms_060801_02_Rows","dms_060801_03_Rows","dms_060801_04_Rows"]
[null,null,"Number of interruptions","Duration of interruptions","Total unplanned minutes off supply","Effect on unplanned MAIFI"]
[]
[]
[null,"Table 7.9.4 - market impact component - row descriptions","dms_070904_01_Rows","without exclusions","with exclusions"]
[]
[]
[null,"These headings (Lists) are determined from the INDEX/MATCH function on the NSP selected on the Business & other details sheet"]
[]
[null,"Table 6.7.1 - daily performance data - unplanned - MAIFI  -- row descriptions and header named range values","dms_060701_Feeder_Header_Lvl4",{"$f":"INDEX(dms_FeederName_1,MATCH(dms_TradingName,dms_TradingName_List))","v":"-"},{"$f":"INDEX(dms_FeederName_1,MATCH(dms_TradingName,dms_TradingName_List))","v":"-"},{"$f":"INDEX(dms_FeederName_2,MATCH(dms_TradingName,dms_TradingName_List))","v":"CBD"},{"$f":"INDEX(dms_FeederName_2,MATCH(dms_TradingName,dms_TradingName_List))","v":"CBD"},{"$f":"INDEX(dms_FeederName_3,MATCH(dms_TradingName,dms_TradingName_List))","v":"Urban"},{"$f":"INDEX(dms_FeederName_3,MATCH(dms_TradingName,dms_TradingName_List))","v":"Urban"},{"$f":"INDEX(dms_FeederName_4,MATCH(dms_TradingName,dms_TradingName_List))","v":"Short rural"},{"$f":"INDEX(dms_FeederName_4,MATCH(dms_TradingName,dms_TradingName_List))","v":"Short rural"},{"$f":"IF((INDEX(dms_FeederName_5,MATCH(dms_TradingName,dms_TradingName_List))=0),\"Network\",(INDEX(dms_FeederName_5,MATCH(dms_TradingName,dms_TradingName_List))))","v":"Long rural"},{"$f":"IF((INDEX(dms_FeederName_5,MATCH(dms_TradingName,dms_TradingName_List))=0),\"Network\",(INDEX(dms_FeederName_5,MATCH(dms_TradingName,dms_TradingName_List))))","v":"Long rural"},"Network","Network"]
[]
[null,null,"dms_060701_Rows","All events","After removing excluded events","All events","After removing excluded events","All events","After removing excluded events","All events","After removing excluded events","All events","After removing excluded events","All events","After removing excluded events"]
[null,null,null,"the number of column headings changes from 10 to 12 depending on the number of feeder categories for the NSP"]
[]
[null,null,"dms_0603_FeederList",{"$f":"INDEX(dms_FeederName_1,MATCH(dms_TradingName,dms_TradingName_List))","v":"-"},{"$f":"INDEX(dms_FeederName_2,MATCH(dms_TradingName,dms_TradingName_List))","v":"CBD"},{"$f":"INDEX(dms_FeederName_3,MATCH(dms_TradingName,dms_TradingName_List))","v":"Urban"},{"$f":"INDEX(dms_FeederName_4,MATCH(dms_TradingName,dms_TradingName_List))","v":"Short rural"}]
[]
[]
[null,"Use these to add to specific worksheets in existing files","Use these to add to specific worksheets in existing files"]
[]
[]
[null,"ARRs 6.7 STPIS daily performance","dms_060101_Values","dms_060102_Values","dms_060701_Values"]
[null,null,"dms_LeapYear"]
[]
[]
[null,"ARR's  6.8 STPIS exclusions","dms_060801_Event_Date","dms_060801_OutageID","dms_060801_FeederID","dms_060801_FeederClass","dms_060801_CauseID","dms_060801_01_Values","dms_060801_02_Values","dms_060801_03_Values","dms_060801_Excl_Cat","dms_060801_04_Values"]
[null,null,"dms_060801_StartCell"]
[]
[]
[null,"CA 6.3 sustained interruptions","dms_060301_Event_Date","dms_060301_Event_Time","dms_060301_AssetID","dms_060301_FeederClass","dms_060301_Reason","dms_060301_DetailedReason","dms_060301_CustNo_Affected_Values","dms_060301_Avg_Duration_Sustained_Int_Values","dms_060301_Effect_unplanned_SAIDI_Values","dms_060301_Effect_unplanned_SAIFI_Values","dms_060301_MED"]

{"sheet":"AER lookups","index":2,"n_rows":94,"n_cols":38,"rows_kept":94,"cut":false,"hidden":true,"merged":[[10,25,10,35],[28,1,28,4],[11,25,11,28],[11,30,11,34],[11,35,13,35]]}
[null,"AER LOOKUP TABLES"]
[]
[null,"Data in these columns used for data validation and database purposes."]
[null,"Date last modified:","2017-01-16","added (Albury and Victora) for AGN"]
[null,null,"2016-10-17","updated TransGrid's correct legal name, corrected TasNetworks (T) to June financial year"]
[null,null,"2017-02-01","inserted Power and Water, added NRs (dms_FeederCat_1 and dms_FeederCat_2)"]
[null,null,"2017-03-03","inserted AEMO as a business"]
[null,null,"2018-03-28","major changes to accommodate STPIS"]
[null,null,"Template Version",5]
[]
[null,null,null,null,null,null,null,null,null,null,null,null,null,null,null,null,null,null,null,null,null,null,null,null,null,"FOR ELECTRICITY BUSINESSES ONLY"]
[null,null,null,null,null,null,null,null,null,null,null,null,null,null,null,null,null,null,null,null,null,null,null,null,null,"Feeder Types",null,null,null,"TasNetworks (D)","Feeder Names"]
[]
[null,null,null,null,null,null,null,null,null,null,null,null,null,null,null,null,null,null,null,null,null,null,null,null,null,"CBD","Urban","Short rural","long rural","EXTRA"]
[null,"dms_TradingName_List","dms_TradingNameFull_List","dms_ABN_List","dms_JurisdictionList","dms_Sector_List","dms_Segment_List","dms_FormControl_List","dms_RPT_List","dms_RPTMonth_List","dms_CRCPlength_List","dms_FRCPlength_List","dms_PRCPlength_List","dms_663_List","dms_DeterminationRef_List","dms_Addr1_List","dms_Addr2_List","dms_Suburb_List","dms_State_List","dms_PostCode_List","dms_PAddr1_List","dms_PAddr2_List","dms_PSuburb_List","dms_PState_List","dms_PPostCode_List","dms_CBD_flag","dms_Urban_flag","dms_ShortRural_flag","dms_LongRural_flag","dms_FeederType_5_flag","dms_FeederName_1","dms_FeederName_2","dms_FeederName_3","dms_FeederName_4","dms_FeederName_5","dms_Public_Lighting_List","Name"]
[null,"AEMO","Australian Energy Market Operator Ltd",94072010327,"Vic","Electricity","Transmission","-","Financial","March",5,5,5,"x","-","Level 22","530 Collins Street","MELBOURNE","Vic",3000,"GPO Box 2008",null,"MELBOURNE","Vic",3001,"NO","NO","NO","NO","NO","-","CBD","Urban","Short rural","Long rural",null,"NO"]
[null,"AusNet (T)","AusNet Transmission Group Pty Ltd",78079798173,"Vic","Electricity","Transmission","Revenue cap","Financial","March",5,5,5,2,"transmission determination","Level 32","2 Southbank Boulevard","SOUTHBANK","Vic",3006,"Locked Bag 14051",null,"MELBOURNE CITY MAIL CENTRE","Vic",8001,"NO","NO","NO","NO","NO","CBD","Urban","Short rural","Long rural",null,"NO",{"$f":"B17","v":"AusNet (T)"},"AEMO"]
[null,"Australian Transmission Co.","Australian Transmission Co.",11222333444,"NSW","Electricity","Transmission","Revenue cap","Financial","June",5,5,5,5,"transmission determination","123 Straight Street",null,"SYDNEY","NSW",2000,"PO Box 123",null,"SYDNEY","NSW",2000,"NO","NO","NO","NO","NO","CBD","Urban","Short rural","Long rural",null,"NO","Australian Transmission Co."]
[null,"Directlink","Directlink",16779340889,"Qld","Electricity","Transmission","Revenue cap","Financial","June",5,5,5,5,"transmission determination","Level 25","580 George Street","SYDNEY","NSW",2000,"PO Box R41",null,"ROYAL EXCHANGE","NSW",1225,"NO","NO","NO","NO","NO","-","CBD","Urban","Short rural","Long rural",null,"NO","Directlink"]
[null,"ElectraNet","ElectraNet",41094482416,"SA","Electricity","Transmission","Revenue cap","Financial","June",5,5,5,5,"transmission determination","52-55 East Terrace","Rymill Park","ADELAIDE","SA",5000,"PO Box 7096","Hutt Street Post Office","ADELAIDE","SA",5000,"NO","NO","NO","NO","NO","-","CBD","Urban","Short rural","Long rural",null,"NO","ElectraNet"]
[null,"Murraylink","Murraylink",79181207909,"SA","Electricity","Transmission","Revenue cap","Financial","June",5,5,5,5,"transmission determination","Level 19","580 George Street","SYDNEY","NSW",2000,"PO Box R41",null,"ROYAL EXCHANGE","NSW",1225,"NO","NO","NO","NO","NO","-","CBD","Urban","Short rural","Long rural",null,"NO","Murraylink"]
[null,"Powerlink","Queensland Electricity Transmission Corporation Limited trading as Powerlink Queensland",82078849233,"Qld","Electricity","Transmission","Revenue cap","Financial","June",5,5,5,5,"transmission determination","33 Harold St",null,"VIRGINIA","Qld",4014,"PO Box 1193",null,"VIRGINIA","QLD",4014,"NO","NO","NO","NO","NO","CBD","Urban","Short rural","Long rural",null,"NO",{"$f":"B22","v":"Powerlink"},"TasNetworks (T)"]
[null,"TasNetworks (T)","TasNetworks (T)",24167357299,"Tas","Electricity","Transmission","Revenue cap","Financial","June",5,5,5,5,"transmission determination","1-7 Maria Street",null,"LENAH VALLEY","Tas",7008,"PO Box 606",null,"MOONAH","Tas",7009,"NO","NO","NO","NO","NO","-","CBD","Urban","Short rural","Long rural",null,"NO","TransGrid"]
[null,"TransGrid","NSW Electricity Networks Operations Pty Ltd trading as TransGrid","70 250 995 390","NSW","Electricity","Transmission","Revenue cap","Financial","June",5,5,4,5,"transmission determination","180 Thomas Street",null,"SYDNEY","NSW",2000,"PO Box A1000",null,"SYDNEY SOUTH","NSW",1235,"NO","NO","NO","NO","NO","-","CBD","Urban","Short rural","Long rural",null,"NO"]
[]
[]
[]
[]
[null,"The Reg Year Ending (dms_RYE) must be set to the last year of the regulatory period. For forecast data is is usually (FRCP_y5) for actual it is a single year (CRY). For historical actual data the RYE will need to be set manually in the business details sheet by setting the dms_Multiyear_flag to 1 and putting the correct value in 'dms_Specified_FinalYear. See cells C67:C68"]
[null,"dms_Model_List ","dms_Model_Name_Format1","dms_Worksheet_List","dms_Model_Span_List"]
[null,"ARR","Annual Reporting",{"$f":"IF(dms_MultiYear_ResponseFlag=\"yes\",\"NEW HISTORICAL ANNUAL REPORTING\",\"ANNUAL REPORTING\")","v":"ANNUAL REPORTING"},1]
[null,"CA","Category Analysis",{"$f":"IF(dms_MultiYear_ResponseFlag=\"yes\",\"NEW HISTORICAL CATEGORY ANALYSIS\",\"CATEGORY ANALYSIS\")","v":"CATEGORY ANALYSIS"},1]
[null,"CESS","Capitlal Expenditure","CAPITLAL EXPENDITURE SHARING SCHEMING",5]
[null,"CPI","CPI","CPI",5]
[null,"EB","Economic Benchmarking",{"$f":"IF(dms_MultiYear_ResponseFlag=\"yes\",\"NEW HISTORICAL ECONOMIC BENCHMARKING\",\"ECONOMIC BENCHMARKING\")","v":"ECONOMIC BENCHMARKING"},1]
[null,"Pricing","Pricing Proposal","PRICING PROPOSAL",5]
[null,"PTRM","Post Tax Revenue Model","POST TAX REVENUE MODEL",5]
[null,"Reset","Regulatory Reporting (Reset)","REGULATORY REPORTING STATEMENT",5]
[null,"RFM","Roll Forward Model","ROLL FORWARD MODEL",5]
[null,"WACC","Weighted Average Cost of Capital","WEIGHTED AVERAGE COST OF CAPITAL",1]
[]
[]
[]
[null,"Financial","Calendar",null,"PREVIOUS",null,"CURRENT",null,"FORTHCOMING"]
[null,"1987-88","1988","PRCP_y1",{"$f":"INDEX(INDIRECT(dms_RPT),dms_PRCP_start_row)","v":"2013-14"},"CRCP_y1",{"$f":"INDEX(INDIRECT(dms_RPT),dms_CRCP_start_row)","v":"2018-19"},{"$f":"FRCP_y1","v":"2023-24"},{"$f":"INDEX(INDIRECT(dms_RPT),dms_FRCP_start_row)","v":"2023-24"}]
[null,"1988-89","1989","PRCP_y2",{"$f":"INDEX(INDIRECT(dms_RPT),dms_PRCP_start_row+1)","v":"2014-15"},"CRCP_y2",{"$f":"INDEX(INDIRECT(dms_RPT),dms_CRCP_start_row+1)","v":"2019-20"},"FRCP_y2",{"$f":"INDEX(INDIRECT(dms_RPT),dms_FRCP_start_row+1)","v":"2024-25"}]
[null,"1989-90","1990","PRCP_y3",{"$f":"INDEX(INDIRECT(dms_RPT),dms_PRCP_start_row+2)","v":"2015-16"},"CRCP_y3",{"$f":"INDEX(INDIRECT(dms_RPT),dms_CRCP_start_row+2)","v":"2020-21"},"FRCP_y3",{"$f":"INDEX(INDIRECT(dms_RPT),dms_FRCP_start_row+2)","v":"2025-26"}]
[null,"1990-91","1991","PRCP_y4",{"$f":"INDEX(INDIRECT(dms_RPT),dms_PRCP_start_row+3)","v":"2016-17"},"CRCP_y4",{"$f":"INDEX(INDIRECT(dms_RPT),dms_CRCP_start_row+3)","v":"2021-22"},"FRCP_y4",{"$f":"INDEX(INDIRECT(dms_RPT),dms_FRCP_start_row+3)","v":"2026-27"}]
[null,"1991-92","1992","PRCP_y5",{"$f":"INDEX(INDIRECT(dms_RPT),dms_PRCP_start_row+4)","v":"2017-18"},"CRCP_y5",{"$f":"INDEX(INDIRECT(dms_RPT),dms_CRCP_start_row+4)","v":"2022-23"},"FRCP_y5",{"$f":"INDEX(INDIRECT(dms_RPT),dms_FRCP_start_row+4)","v":"2027-28"}]
[null,"1992-93","1993","PRCP_y6",{"$f":"INDEX(INDIRECT(dms_RPT),dms_PRCP_start_row+5)","v":"2018-19"},"CRCP_y6",{"$f":"INDEX(INDIRECT(dms_RPT),dms_CRCP_start_row+5)","v":"2023-24"},"FRCP_y6",{"$f":"INDEX(INDIRECT(dms_RPT),dms_FRCP_start_row+5)","v":"2028-29"}]
[null,"1993-94","1994","PRCP_y7",{"$f":"INDEX(INDIRECT(dms_RPT),dms_PRCP_start_row+6)","v":"2019-20"},"CRCP_y7",{"$f":"INDEX(INDIRECT(dms_RPT),dms_CRCP_start_row+6)","v":"2024-25"},"FRCP_y7",{"$f":"INDEX(INDIRECT(dms_RPT),dms_FRCP_start_row+6)","v":"2029-30"}]
[null,"1994-95","1995","PRCP_y8",{"$f":"INDEX(INDIRECT(dms_RPT),dms_PRCP_start_row+7)","v":"2020-21"},"CRCP_y8",{"$f":"INDEX(INDIRECT(dms_RPT),dms_CRCP_start_row+7)","v":"2025-26"},"FRCP_y8",{"$f":"INDEX(INDIRECT(dms_RPT),dms_FRCP_start_row+7)","v":"2030-31"}]
[null,"1995-96","1996","PRCP_y9",{"$f":"INDEX(INDIRECT(dms_RPT),dms_PRCP_start_row+8)","v":"2021-22"},"CRCP_y9",{"$f":"INDEX(INDIRECT(dms_RPT),dms_CRCP_start_row+8)","v":"2026-27"},"FRCP_y9",{"$f":"INDEX(INDIRECT(dms_RPT),dms_FRCP_start_row+8)","v":"2031-32"}]
[null,"1996-97","1997","PRCP_y10",{"$f":"INDEX(INDIRECT(dms_RPT),dms_PRCP_start_row+9)","v":"2022-23"},"CRCP_y10",{"$f":"INDEX(INDIRECT(dms_RPT),dms_CRCP_start_row+9)","v":"2027-28"},"FRCP_y10",{"$f":"INDEX(INDIRECT(dms_RPT),dms_FRCP_start_row+9)","v":"2032-33"}]
[null,"1997-98","1998","PRCP_y11",{"$f":"INDEX(INDIRECT(dms_RPT),dms_PRCP_start_row+10)","v":"2023-24"},"CRCP_y11",{"$f":"INDEX(INDIRECT(dms_RPT),dms_CRCP_start_row+10)","v":"2028-29"},"FRCP_y11",{"$f":"INDEX(INDIRECT(dms_RPT),dms_FRCP_start_row+10)","v":"2033-34"}]
[null,"1998-99","1999","PRCP_y12",{"$f":"INDEX(INDIRECT(dms_RPT),dms_PRCP_start_row+11)","v":"2024-25"},"CRCP_y12",{"$f":"INDEX(INDIRECT(dms_RPT),dms_CRCP_start_row+11)","v":"2029-30"},"FRCP_y12",{"$f":"INDEX(INDIRECT(dms_RPT),dms_FRCP_start_row+11)","v":"2034-35"}]
[null,"1999-00","2000","PRCP_y13",{"$f":"INDEX(INDIRECT(dms_RPT),dms_PRCP_start_row+12)","v":"2025-26"},"CRCP_y13",{"$f":"INDEX(INDIRECT(dms_RPT),dms_CRCP_start_row+12)","v":"2030-31"},"FRCP_y13",{"$f":"INDEX(INDIRECT(dms_RPT),dms_FRCP_start_row+12)","v":"2035-36"}]
[null,"2000-01","2001","PRCP_y14",{"$f":"INDEX(INDIRECT(dms_RPT),dms_PRCP_start_row+13)","v":"2026-27"},"CRCP_y14",{"$f":"INDEX(INDIRECT(dms_RPT),dms_CRCP_start_row+13)","v":"2031-32"},"FRCP_y14",{"$f":"INDEX(INDIRECT(dms_RPT),dms_FRCP_start_row+13)","v":"2036-37"}]
[null,"2001-02","2002","PRCP_y15",{"$f":"INDEX(INDIRECT(dms_RPT),dms_PRCP_start_row+14)","v":"2027-28"},"CRCP_y15",{"$f":"INDEX(INDIRECT(dms_RPT),dms_CRCP_start_row+14)","v":"2032-33"},"FRCP_y15",{"$f":"INDEX(INDIRECT(dms_RPT),dms_FRCP_start_row+14)","v":{"$error":"#REF!"}}]
[null,"2002-03","2003","PRCP_y16",{"$f":"INDEX(INDIRECT(dms_RPT),dms_PRCP_start_row+15)","v":"2028-29"},"CRCP_y16",{"$f":"INDEX(INDIRECT(dms_RPT),dms_CRCP_start_row+15)","v":"2033-34"},"FRCP_y16",{"$f":"INDEX(INDIRECT(dms_RPT),dms_FRCP_start_row+15)","v":{"$error":"#REF!"}}]
[null,"2003-04","2004"]
[null,"2004-05","2005"]
[null,"2005-06","2006",null,"CRY - FRY"]
[null,"2006-07","2007","dms_y1",{"$f":"IFERROR(INDEX(INDIRECT(dms_RPT),dms_CRY_start_row),0)","v":"2021-22"}]
[null,"2007-08","2008","dms_y2",{"$f":"IFERROR(INDEX(INDIRECT(dms_RPT),dms_CRY_start_row+1),0)","v":"2022-23"}]
[null,"2008-09","2009","dms_y3",{"$f":"IFERROR(INDEX(INDIRECT(dms_RPT),dms_CRY_start_row+2),0)","v":"2023-24"}]
[null,"2009-10",2010,"dms_y4",{"$f":"IFERROR(INDEX(INDIRECT(dms_RPT),dms_CRY_start_row+3),0)","v":"2024-25"}]
[null,"2010-11",2011,"dms_y5",{"$f":"IFERROR(INDEX(INDIRECT(dms_RPT),dms_CRY_start_row+4),0)","v":"2025-26"}]
[null,"2011-12",2012,"dms_y6",{"$f":"IFERROR(INDEX(INDIRECT(dms_RPT),dms_CRY_start_row+5),0)","v":"2026-27"}]
[null,"2012-13",2013,"dms_y7",{"$f":"IFERROR(INDEX(INDIRECT(dms_RPT),dms_CRY_start_row+6),0)","v":"2027-28"}]
[null,"2013-14",2014,"dms_y8",{"$f":"IFERROR(INDEX(INDIRECT(dms_RPT),dms_CRY_start_row+7),0)","v":"2028-29"}]
[null,"2014-15",2015,"dms_y9",{"$f":"IFERROR(INDEX(INDIRECT(dms_RPT),dms_CRY_start_row+8),0)","v":"2029-30"}]
[null,"2015-16",2016,"dms_y10",{"$f":"IFERROR(INDEX(INDIRECT(dms_RPT),dms_CRY_start_row+9),0)","v":"2030-31"}]
[null,"2016-17",2017,"dms_y11",{"$f":"IFERROR(INDEX(INDIRECT(dms_RPT),dms_CRY_start_row+10),0)","v":"2031-32"}]
[null,"2017-18",2018,"dms_y12",{"$f":"IFERROR(INDEX(INDIRECT(dms_RPT),dms_CRY_start_row+11),0)","v":"2032-33"}]
[null,"2018-19",2019,"dms_y13",{"$f":"IFERROR(INDEX(INDIRECT(dms_RPT),dms_CRY_start_row+12),0)","v":"2033-34"}]
[null,"2019-20",2020,"dms_y14",{"$f":"IFERROR(INDEX(INDIRECT(dms_RPT),dms_CRY_start_row+13),0)","v":"2034-35"}]
[null,"2020-21",2021,"dms_y15",{"$f":"IFERROR(INDEX(INDIRECT(dms_RPT),dms_CRY_start_row+14),0)","v":"2035-36"}]
[null,"2021-22",2022,"dms_y16",{"$f":"IFERROR(INDEX(INDIRECT(dms_RPT),dms_CRY_start_row+15),0)","v":"2036-37"}]
[null,"2022-23",2023]
[null,"2023-24",2024]
[null,"2024-25",2025]
[null,"2025-26",2026]
[null,"2026-27",2027]
[null,"2027-28",2028]
[null,"2028-29",2029]
[null,"2029-30",2030]
[null,"2030-31",2031]
[null,"2031-32",2032]
[null,"2032-33",2033]
[null,"2033-34",2034]
[null,"2034-35",2035]
[null,"2035-36",2036]
[null,"2036-37","2037"]

{"sheet":"AER ETL","index":3,"n_rows":145,"n_cols":8,"rows_kept":145,"cut":false,"hidden":true,"merged":[[32,37,32,58],[33,37,33,58],[34,37,34,58],[32,68,32,89],[33,68,33,89],[34,68,34,89],[12,4,12,8],[71,1,73,1],[11,0,15,0],[18,0,25,0],[26,0,31,0],[34,0,59,0],[14,2,14,4]]}
["DRAFT RIN - 20200429  (WIP)","AER ETL INFORMATION"]
[]
[null,"USES NAMED RANGES FLAG","yes","dms_Defined_Names_Used"]
[]
[null,"IF THIS IS AN ABC RIN - make sure the the named range CRY is applied and the named range dms_dollar_nom_UOM is applied"]
[null,"IF THIS IS A RESET RIN - make sure the named ranges CRY and dms_dollar_nom_UOM are NOT present in the workbook"]
[null,"FOR ABC RINS THAT SPAN MULTIPLE YEARS - make sure MultiYear Flag is set and final year entered as required"]
[]
[null,"Full trading name",{"$f":"INDEX(dms_TradingNameFull_List,MATCH(dms_TradingName,dms_TradingName_List))","v":"ElectraNet"},null,"dms_TradingNameFull"]
[null,"Trading name",{"$f":"dms_TradingName","v":"ElectraNet"}]
["Selected here","Model / RIN","Reset","dms_Model"]
["Read from Business & other details","Source","Regulatory proposal","dms_Source"]
[null,"Data quality","Consolidated","For DB purposes this is always Consoldiated"]
[null,"Data status","Public","For DB purposes this is always Public"]
[null,"Amendment reason",{"$f":"dms_Amendment_Text","v":"."},null,null,"dms_AmendmentReason"]
[null,"Submission date",{"$f":"dms_Typed_Submission_Date","v":"2022-01-31"},"dms_SubmissionDate"]
[]
["Redundant","EBSS - First application of scheme in forthcoming period?","No"]
["Pre-populated from lookup table","Data ingestion data quality","Consolidated","dms_DataQuality","Always Consolidated"]
[null,"Sector",{"$f":"INDEX(dms_Sector_List,MATCH(dms_TradingName,dms_TradingName_List))","v":"Electricity"},"dms_Sector","=INDEX(dms_Sector_List,MATCH(dms_TradingName,dms_TradingName_List))"]
[null,"Segment",{"$f":"INDEX(dms_Segment_List,MATCH(dms_TradingName,dms_TradingName_List))","v":"Transmission"},"dms_Segment","=INDEX(dms_Segment_List,MATCH(dms_TradingName,dms_TradingName_List))"]
[null,"Regulatory Year Ending",{"$f":"dms_RYE_result","v":"2028"},"dms_RYE","=IF(dms_MultiYear_Flag=1,LEFT(dms_Specified_FinalYear,2)&RIGHT(dms_Specified_FinalYear,2),INDEX(dms_RYE_Formula_Result,MATCH(dms_Model,dms_Model_List)))"]
[null,"Reporting Period Type",{"$f":"INDEX(dms_RPT_List,MATCH(dms_TradingName,dms_TradingName_List))","v":"Financial"},"dms_RPT","=INDEX(dms_RPT_List,MATCH(dms_TradingName,dms_TradingName_List))"]
[null,"EB/CA Unit of Measure for Monetary Values","$0s","dms_dollar_nom_UOM","If the cover sheet is attached to an ABC RIN apply the NAMED RANGE to the cell"]
[null,"Security Classification","Public","dms_Classification","Always Public"]
[null,"Jurisdiction",{"$f":"INDEX(dms_JurisdictionList,MATCH(dms_TradingName,dms_TradingName_List))","v":"SA"},"dms_Jurisdiction","=INDEX(dms_JurisdictionList,MATCH(dms_TradingName,dms_TradingName_List))"]
["Relevant for PTRM, RFMs and Reset RINS","$ REAL REFERENCES"]
[null,"Does the named range CRY exist in this file? ",{"$f":"IFERROR(CRY,\"NO\")","v":"NO"}]
[null,"CRY-1  (last full calendar year before CRY)",{"$f":"IFERROR(IF(dms_RPT=\"calendar\",CRY-1,LEFT(CRY,4)),\"CRY not present\")","v":"CRY not present"},"dms_Cal_Year_B4_CRY","'=IF(dms_RPT=\"financial\",VALUE(LEFT(dms_SingleYear_FinalYear_Result,4)),VALUE(LEFT(dms_SingleYear_FinalYear_Result,4)-1))"]
[null,"Dollar $ real month",{"$f":"INDEX(dms_RPTMonth_List,MATCH(dms_TradingName,dms_TradingName_List))","v":"June"},"dms_RPTMonth","=INDEX(dms_RPTMonth_List,MATCH(dms_TradingName,dms_TradingName_List))"]
[null,"Dollar $ real  (the last month before the FRCP_y1)",{"$f":"IF(dms_SingleYearModel=\"yes\",CONCATENATE(dms_RPTMonth)&\" \"&VALUE((LEFT(dms_CRY_start_year,2)&RIGHT(dms_CRY_start_year,2))),CONCATENATE(dms_RPTMonth)&\" \"&dms_DollarReal_year)","v":"June 2023"},"dms_DollarReal","=IF(SUM(dms_SingleYear_Model)>0,CONCATENATE(dms_RPTMonth)&\" \"&VALUE((LEFT(CRY,2))&RIGHT(CRY,2)),CONCATENATE(dms_RPTMonth)&\" \"&VALUE((LEFT(dms_RYE,2)&RIGHT(dms_RYE,2))))"]
[null,"Dollar $ real previous year (PRCP_y5)",{"$f":"CONCATENATE(dms_RPTMonth)&\" \"&dms_Previous_DollarReal_year","v":"June 2018"},"dms_DollarReal_Prev","=IF(SUM(dms_SingleYear_Model)>0,CONCATENATE(dms_RPTMonth)&\" \"&VALUE(((LEFT(CRY,2))&RIGHT(CRY,2))-1),CONCATENATE(dms_RPTMonth)&\" \"&VALUE(((LEFT(dms_CRCP_FirstYear_Result,2)&RIGHT(dms_CRCP_FirstYear_Result,2))))-1)"]
[null,"PTRM/ RFMs"]
[null,"Form of control",{"$f":"INDEX(dms_FormControl_List,MATCH(dms_TradingName,dms_TradingName_List))","v":"Revenue cap"},"dms_FormControl","=INDEX(dms_FormControl_List,MATCH(dms_TradingName,dms_TradingName_List))"]
["All potential values for Regulatory Years or RYEs as calculated","This block works out the various RYE's for ALL RIN types and MODELS"]
[null,"dms_start_year",{"$f":"FRCP_y1","v":"2023-24"},"=FRCP_y1","FRCP_y1 from cover sheet"]
[null,"dms_CRY_start_year",{"$f":"IFERROR(CRY,CRCP_y4)","v":"2021-22"},"=IFERROR(CRY,CRCP_y4)"]
[null,"dms_CRY_start_row",{"$f":"IFERROR(MATCH(dms_CRY_start_year,INDIRECT(dms_RPT),0),0)","v":35},"=IFERROR(MATCH(dms_CRY_start_year,INDIRECT(dms_RPT),0),0)"]
[null,"dms_FRCP_start_row",{"$f":"MATCH(dms_start_year,INDIRECT(dms_RPT),0)","v":37},"=MATCH(dms_start_year,INDIRECT(dms_RPT),0)","Uses FRCP_y1 as a start reference"]
[null,"dms_CRCP_start_row",{"$f":"dms_FRCP_start_row-dms_CRCPlength_Num","v":32},"=dms_FRCP_start_row-dms_CRCPlength_Num","Uses the value in dms_CRCPlength_Num"]
[null,"dms_PRCP_start_row",{"$f":"dms_FRCP_start_row-dms_CRCPlength_Num-dms_PRCPlength_Num","v":27},"=dms_FRCP_start_row-dms_CRCPlength_Num-dms_PRCPlength_Num","Uses the value in dms_CRCPlength_Num and dms_PRCPlength_Num"]
[null,"dms_RYE_start_row",{"$f":"dms_FRCP_start_row+(dms_FRCPlength_Num-1)","v":41},"=dms_FRCP_start_row+(dms_FRCPlength_Num-1)","Uses the value in dms_FRCPlength_Num-1"]
[null,"FRCP_start_year",{"$f":"INDEX(INDIRECT(dms_RPT),dms_FRCP_start_row)","v":"2023-24"},"=INDEX(INDIRECT(dms_RPT),dms_FRCP_start_row)","Converts the FRCP start row to display the year"]
[null,"CRCP_start_year",{"$f":"INDEX(INDIRECT(dms_RPT),dms_CRCP_start_row)","v":"2018-19"},"=INDEX(INDIRECT(dms_RPT),dms_CRCP_start_row)","Converts the CRCP start row to display the year"]
[null,"PRCP_start_year",{"$f":"INDEX(INDIRECT(dms_RPT),dms_PRCP_start_row)","v":"2013-14"},"=INDEX(INDIRECT(dms_RPT),dms_PRCP_start_row)","Converts the PRCP start row to display the year"]
[null,"FRCP_final_year",{"$f":"INDEX(INDIRECT(dms_RPT),dms_FRCP_start_row+dms_FRCPlength_Num-1)","v":"2027-28"},"=INDEX(INDIRECT(dms_RPT),dms_FRCP_start_row+dms_FRCPlength_Num-1)","Finds the FRCP final year"]
[null,"CRCP_final_year",{"$f":"INDEX(INDIRECT(dms_RPT),dms_CRCP_start_row+dms_CRCPlength_Num-1)","v":"2022-23"},"=INDEX(INDIRECT(dms_RPT),dms_CRCP_start_row+dms_CRCPlength_Num-1)","Finds the CRCP final year"]
[null,"PRCP_final_year",{"$f":"INDEX(INDIRECT(dms_RPT),dms_PRCP_start_row+dms_FRCPlength_Num-1)","v":"2017-18"},"=INDEX(INDIRECT(dms_RPT),dms_PRCP_start_row+dms_FRCPlength_Num-1)","Finds the PRCP final year"]
[null,"dms_Reset_final_year",{"$f":"INDEX(INDIRECT(dms_RPT),dms_RYE_start_row)","v":"2027-28"},"=INDEX(INDIRECT(dms_RPT),dms_RYE_start_row)","For Resets and PTRM/RFMs (same as FRCP_final_year)"]
[null,"dms_SpecifiedYear_final_year",{"$f":"FRY","v":{"$error":"#NAME?"}},"=FRY","FRY from cover sheet"]
[null,"dms_DollarReal_year",{"$f":"LEFT(CRCP_final_year,2)&RIGHT(CRCP_final_year,2)","v":"2023"},"=LEFT(CRCP_final_year,2)&RIGHT(CRCP_final_year,2)","Uses the value in CRCP_final_year"]
[null,"dms_Previous_DollarReal_year",{"$f":"LEFT(PRCP_final_year,2)&RIGHT(PRCP_final_year,2)","v":"2018"},"=LEFT(PRCP_final_year,2)&RIGHT(PRCP_final_year,2)","Uses the value in PRCP_final_year"]
[null,"dms_CRY_RYE",{"$f":"IFERROR(LEFT(CRY,2)&RIGHT(CRY,2),0)","v":0},"=IFERROR(LEFT(CRY,2)&RIGHT(CRY,2),0)","For ABC single year RINS"]
[null,"dms_Reset_RYE",{"$f":"IF(dms_Model_Span>1,IF(dms_Model=\"RFM\",(LEFT(dms_DollarReal_year,2)&RIGHT(dms_DollarReal_year,2)),(LEFT(dms_Reset_final_year,2)&RIGHT(dms_Reset_final_year,2))),0)","v":"2028"},"=IF(dms_Model_Span>1,IF(dms_Model=\"RFM\",(LEFT(dms_DollarReal_year,2)&RIGHT(dms_DollarReal_year,2)),(LEFT(dms_Reset_final_year,2)&RIGHT(dms_Reset_final_year,2))),0)","If model span > 1 then uses dms_Reset_RYE otherwise it's a multi year ABC and uses dms_Specified_RYE"]
[null,"dms_Specified_RYE",{"$f":"IF(dms_MultiYear_ResponseFlag=\"Yes\",(LEFT(dms_Specified_FinalYear,2)&RIGHT(dms_Specified_FinalYear,2)),0)","v":0},"=IF(dms_MultiYear_ResponseFlag=\"Yes\",(LEFT(dms_Specified_FinalYear,2)&RIGHT(dms_Specified_FinalYear,2)),0)","If multi year ABC - uses dms_Specified_FinalYear"]
[null,"dms_Model_Span",{"$f":"INDEX(dms_Model_Span_List,MATCH(dms_Model,dms_Model_List))","v":5},"=INDEX(dms_Model_Span_List,MATCH(dms_Model,dms_Model_List))","A result of 5 is used to signify that it is more than 1 year span"]
[null,"dms_RYE_result",{"$f":"IF(dms_MultiYear_ResponseFlag=\"yes\",dms_Specified_RYE,(IF(dms_Model_Span>1,dms_Reset_RYE,dms_CRY_RYE)))","v":"2028"},"=IF(dms_MultiYear_ResponseFlag=\"yes\",dms_Specified_RYE,(IF(dms_Model_Span>1,dms_Reset_RYE,dms_CRY_RYE)))","Nested IF - feeds into dms_RYE"]
[null,"dms_Reset_Span",{"$f":"IF(dms_Reset_RYE>0,CONCATENATE(FRCP_y1,\" to \",FRCP_final_year),0)","v":"2023-24 to 2027-28"},"=IF(dms_Reset_RYE>0,CONCATENATE(FRCP_y1,\" to \",FRCP_final_year),0)","Reset span of years as text"]
[null,"dms_SpecifiedYear_Span",{"$f":"IF(dms_Specified_RYE>0,CONCATENATE(CRY,\" to \",dms_Specified_FinalYear),0)","v":0},"=IF(dms_Specified_RYE>0,CONCATENATE(CRY,\" to \",dms_Specified_FinalYear),0)","Multi year ABC span of years as text"]
[null,"dms_Header_Span",{"$f":"IF(dms_MultiYear_Flag=1,dms_SpecifiedYear_Span,IF(dms_Model_Span>1,dms_y1&\" to \"&FRCP_final_year,CRY))","v":"2021-22 to 2027-28"},"=IF(dms_MultiYear_Flag=1,dms_SpecifiedYear_Span,IF(dms_Model_Span>1,dms_Reset_Span,CRY))","NESTED IF - for Sheet Headers"]
[null,"ABC RINS THAT SPAN MULTIPLE YEARS"]
[null,"This is a multi year ABC RIN?","No"]
[null,null,{"$f":"IF(dms_MultiYear_ResponseFlag=\"No\",0,1)","v":0},"dms_MultiYear_Flag","This is set from the answer provided above"]
[null,null,{"$f":"IF(dms_MultiYear_Flag=1,FRY,\"not a Multiple year submission\")","v":"not a Multiple year submission"},"dms_Specified_FinalYear","The result here is returned to dms_CRCP_FinalYear_Result if response to Q in C73 is \"yes\" and dms_MultiYear_Flag is set to 1"]
[null," Start year for 5.2 in Multi year ABC RINS",{"$f":"IFERROR(IF(dms_MultiYear_Flag=1,FRY,CRY),\"not an ABC\")","v":"not an ABC"},"dms_0502_Inst_Year","=IF(dms_MultiYear_Flag=1,FRY,CRY)",null,"For single year RINS this is CRY - multi year RINS need to start a the end of the span of years (ie. FRY)"]
[null,"WHAT IS THE RYE?"]
[null,"Reg Period Lengths"]
[null,"PRCP length in years",{"$f":"INDEX(dms_PRCPlength_List,MATCH(dms_TradingName,dms_TradingName_List))","v":5},"dms_PRCPlength_Num","=INDEX(dms_PRCPlength_List,MATCH(dms_TradingName,dms_TradingName_List))"]
[null,"CRCP length in years",{"$f":"INDEX(dms_CRCPlength_List,MATCH(dms_TradingName,dms_TradingName_List))","v":5},"dms_CRCPlength_Num","=INDEX(dms_CRCPlength_List,MATCH(dms_TradingName,dms_TradingName_List))"]
[null,"FRCP length in years",{"$f":"INDEX(dms_FRCPlength_List,MATCH(dms_TradingName,dms_TradingName_List))","v":5},"dms_FRCPlength_Num","=INDEX(dms_FRCPlength_List,MATCH(dms_TradingName,dms_TradingName_List))"]
[null,"Single year RIN?"]
[null,"Single Year ABC RIN ?",{"$f":"IF(dms_Model=\"EB\",1,0)","v":0},"dms_EB"]
[null,null,{"$f":"IF(dms_Model=\"CA\",1,0)","v":0},"dms_CA","=dms_SingleYear_Model"]
[null,null,{"$f":"IF(dms_Model=\"ARR\",1,0)","v":0},"dms_ARR"]
[null,"Is this a single Year ABC RIN?",{"$f":"IF(SUM(dms_SingleYear_Model)=1,\"yes\",\"no\")","v":"no"},"dms_SingleYearModel","=IF(SUM(dms_SingleYear_Model)=1,\"yes\",\"no\")"]
[null,"Single Year Final Year Result",{"$f":"IF(AND(dms_SingleYearModel=\"yes\",dms_MultiYear_Flag=0),CRY,0)","v":0},"dms_SingleYear_FinalYear_Result","=IFERROR(IF(SUM(dms_SingleYear_Model)<>0,(INDIRECT(dms_SingleYear_FinalYear_Ref)),\"not a single year RIN\"),\"CRY not present\")"]
[null,"Multi year RIN?"]
[]
[null,"Multi Year Reset/Model?",{"$f":"IF(dms_Model_Span>1,\"yes\",\"no\")","v":"yes"}]
[null,"Final year result for Reset/Model",{"$f":"IF(dms_Model_Span>1,dms_Reset_final_year,0)","v":"2027-28"},"dms_MultiYear_FinalYear_Result","dms_CRCP_FinalYear_Result"]
[]
[null,"Multi Year ABC RIN?",{"$f":"IF(dms_MultiYear_Flag=1,\"yes\",\"no\")","v":"no"},"dms_MultiYear_ABC_RIN"]
[null,"Final year result for ABC multi year",{"$f":"IF(dms_MultiYear_Flag=1,C50,0)","v":0}]
[]
[null,"EB RINS"]
[null,"Calendar Year for table 3.6 data",{"$f":"IFERROR(IF(dms_Segment=\"Transmission\",dms_Cal_Year_B4_CRY,CRY),\"CRY not present\")","v":"CRY not present"},"dms_0306_Year","=IF(dms_Segment=\"Transmission\",dms_Cal_Year_B4_CRY,CRY)"]
[null,"CA RINS"]
[null,"Find how many rows in tables 6.3 sustained interruptions?",null,null,"dms_060301_MaxRows only returns a valid value when cover sheet is attached to a CA file"]
[null,null,{"$f":"IF(dms_Model<>\"CA\",\"not a CA\",\"Is a CA\")","v":"not a CA"},null,"=IF(dms_Model<>\"CA\",\"not a CA\",\"Is a CA\")"]
[null,"dms_060301_Avg_Duration_Sustained_Int_Values present?",{"$f":"IFERROR(IF(INDEX(dms_060301_Avg_Duration_Sustained_Int_Values,1,1)<>\"\",\"yes\",\"no\"),\"no\")","v":"no"},"dms_060301_checkvalue","=IFERROR(IF(INDEX(dms_060301_Avg_Duration_Sustained_Int_Values,1,1)<>\"\",\"yes\",\"no\"),\"no\")"]
[null,null,{"$f":"IF(AND(dms_Model=\"CA\",(dms_060301_checkvalue=\"no\")),\"error - NR not present\",\"no errors\")","v":"no errors"},null,"=IF(AND(dms_Model=\"CA\",(dms_060301_checkvalue=\"no\")),\"error - NR not present\",\"no errors\")"]
[null,"Table 6.3.1 - last row reference",{"$f":"IFERROR(IF(dms_Model=\"CA\",LOOKUP(2,1/(dms_060301_Avg_Duration_Sustained_Int_Values<>\"\"),(ROW(dms_060301_Avg_Duration_Sustained_Int_Values))),\"not a CA\"),\"6.3 not present\")","v":"not a CA"},"dms_060301_LastRow","=IFERROR(IF(dms_Model=\"CA\",LOOKUP(2,1/(dms_060301_Avg_Duration_Sustained_Int_Values<>\"\"),(ROW(dms_060301_Avg_Duration_Sustained_Int_Values))),\"not a CA\"),\"6.3 not present\")"]
[null,"Table 6.3.1 - max number rows",{"$f":"IFERROR(IF(dms_Model=\"CA\",(dms_060301_LastRow-15),\"not a CA\"),\"error\")","v":"not a CA"},"dms_060301_MaxRows","=IFERROR(IF(dms_Model=\"CA\",(dms_060301_LastRow-15),\"not a CA\"),\"error\")"]
[null,"Table 6.6.3 - Public lighting repair - no. business days",{"$f":"INDEX(dms_663_List,MATCH(dms_TradingName,dms_TradingName_List))","v":5},"dms_663","=INDEX(dms_663_List,MATCH(dms_TradingName,dms_TradingName_List))"]
[null,"ARR or RESET RINS"]
[null,"How many rows in tables 6.1 or 6.7?  (leap year?)","insert dms_LeapYear NR if required",null,"'dms_LeapYear is used to determine dms_060701_Max_Rows BUT it is only found on worksheet 6.1 or 6.7 and the date value in the cell is used to determine whether it is a leap year"]
[null,"Is dms_LeapYear named range present?",{"$f":"IFERROR(IF(dms_LeapYear,\"yes\"),\"no\")","v":"no"}]
[null,"Table 6.7.1 - includes a leap year?",{"$f":"\nIFERROR(IF(MONTH(DATE(YEAR(dms_LeapYear),2,29))=2,\"is a leap year\",\"not a leap year\"),\n\"dms_LeapYear not present\")","v":"dms_LeapYear not present"},"dms_LeapYear_Result","=IFERROR(IF(MONTH(DATE(YEAR(dms_LeapYear),2,29))=2,\"is a leap year\",\"not a leap year\"),\"dms_LeapYear not present\")"]
[null,"MaxRows if Reset and leap year",{"$f":"IF(dms_LeapYear_Result=\"is a leap year\",1827,1826)","v":1826},"dms_060701_Reset_MaxRows","=IF(dms_LeapYear_Result=\"is a leap year\",1827,1826)",null,null,"number of days present in Reset RIN table"]
[null,"MaxRows if ARR and leap year",{"$f":"IF(dms_LeapYear_Result=\"is a leap year\",366,365)","v":365},"dms_060701_ARR_MaxRows","=IF(dms_LeapYear_Result=\"is a leap year\",366,365)",null,null,"number of days present in ARR RIN table"]
[null,"Table 6.7.1 - Max Rows (leap year/ non leap year)",{"$f":"IF(dms_Model=\"ARR\",dms_060701_ARR_MaxRows,IF(dms_Model=\"Reset\",dms_060701_Reset_MaxRows,\"not a relevant RIN type\"))","v":1826},"dms_060701_MaxRows","=IF(dms_Model=\"ARR\",dms_060701_ARR_MaxRows,IF(dms_Model=\"Reset\",dms_060701_Reset_MaxRows,\"not a relevant RIN type\"))"]
[null,"How many columns in 6.7?   (4 or 5 feeder categories)",{"$f":"IF(dms_FifthFeeder_flag_NSP=\"NO\",\"This NSP has only 4 feeder categories\",\"This NSP has 5 feeder categories\")","v":"This NSP has only 4 feeder categories"}]
[null,"Table 6.7.1 - Last column (# of feeder categories > 4)",{"$f":"IF(dms_FifthFeeder_flag_NSP=\"NO\",10,12)","v":10},"dms_060701_MaxCols","=IF(dms_FifthFeeder_flag_NSP=\"NO\",8,10)"]
[null,"Table 6.7.1 - Number of offset rows",{"$f":"IF(dms_Model=\"ARR\",15,9)","v":9},"dms_060701_OffsetRows","=IF(dms_Model=\"ARR\",15,9)"]
[null,"Start date for telephone answering in 6.1 or 6.7?",null,null,"Using 060101 as naming standard not 060701 for start dates"]
[null,"Table 6.1.1 and 6.7.1 - Start Date as Text",{"$f":"IF(dms_SingleYearModel=\"yes\",(CONCATENATE(IF(LEN(CRY)=4,\"1-Jan-\",\"1-Jul-\"),LEFT(CRY,4))),(CONCATENATE(IF(LEN(PRCP_y4)=4,\"1-Jan-\",\"1-Jul-\"),LEFT(PRCP_y4,4))))","v":"1-Jul-2016"},"dms_060101_StartDateTxt","=IF(SUM(dms_SingleYear_Model)>1,(CONCATENATE(IF(LEN(CRY)=4,\"1-Jan-\",\"1-Jul-\"),LEFT(CRY,4))),(CONCATENATE(IF(LEN(CRCP_y4)=4,\"1-Jan-\",\"1-Jul-\"),LEFT(CRCP_y4,4))))"]
[null,"Table 6.1.1 and 6.7.1 - Start Date as Date Value",{"$f":"DATEVALUE(dms_060701_StartDateTxt)","v":42552},"dms_060101_StartDateVal","=DATEVALUE(dms_060701_StartDateTxt)"]
[null,"ARRs"]
[null,"How many rows in table 6.8?","insert dms_060801_StartCell NR if required",null,"dms_060801_StartCell is only found on worksheet 6.8 and is used to determine the starting date for the date range"]
[null,"Is dms_060801_StartCell named range present?","yes",null,"=IFERROR(IF((ROW(dms_060801_StartCell)-1)=1,\"yes\",\"yes\"),\"no\")"]
[null,"Table 6.8 - Number of offset rows",12,"dms_0608_OffsetRows","=IFERROR(IF(dms_Model=\"ARR\",(ROW(dms_060801_StartCell)-1),\"not an ARR\"),\"6.8 error\")"]
[null,"Table 6.8 - Last row","0","dms_0608_LastRow","=IFERROR(IF(dms_060801_StartCell<>\"\",IF(dms_Model=\"ARR\",(LOOKUP(2,1/(dms_060801_01_Values<>\"\"),(ROW(dms_060801_01_Values)))),\"not an ARR\"),0),\"0\")"]
[null,"Table 6.8 - MaxRows",{"$f":"IFERROR(IF(dms_Model=\"ARR\",(MAX(0,dms_0608_LastRow-dms_0608_OffsetRows)),\"not an ARR\"),\"0\")","v":"not an ARR"},"dms_060801_MaxRows","=IFERROR(IF(dms_Model=\"ARR\",(MAX(0,dms_0608_LastRow-dms_0608_OffsetRows)),\"not an ARR\"),\"0\")"]
[null,"TNSP RESET RINS"]
[null,"Table 7.9.4 only appears in TNSPs Reset RIN"]
[null,"Table 7.9.4 - first year",{"$f":"LEFT(PRCP_y3,4)","v":"2015"},"dms_070904_Start_Year","=LEFT(PRCP_y3,4)"]
[]
[null,"MISC"]
[null,"Distribution Determination Reference",{"$f":"INDEX(dms_DeterminationRef_List,MATCH(dms_TradingName,dms_TradingName_List))","v":"transmission determination"},"dms_DeterminationRef"]
[null,"Public lighting NSP?",{"$f":"INDEX(dms_Public_Lighting_List,MATCH(dms_TradingName,dms_TradingName_List))","v":0},"dms_Public_Lighting","=INDEX(dms_Public_Lighting_List,MATCH(dms_TradingName,dms_TradingName_List))"]
[null,"CBD Feeder for this business",{"$f":"INDEX(dms_CBD_flag,MATCH(dms_TradingName,dms_TradingName_List))","v":"NO"},"dms_CBD_flag_NSP"]
[null,"Urban Feeder for this business",{"$f":"INDEX(dms_Urban_flag,MATCH(dms_TradingName,dms_TradingName_List))","v":"NO"},"dms_Urban_flag_NSP"]
[null,"Short rural Feeder for this business",{"$f":"INDEX(dms_ShortRural_flag,MATCH(dms_TradingName,dms_TradingName_List))","v":"NO"},"dms_ShortRural_flag_NSP"]
[null,"Long rural Feeder for this business",{"$f":"INDEX(dms_LongRural_flag,MATCH(dms_TradingName,dms_TradingName_List))","v":"NO"},"dms_LongRural_flag_NSP"]
[null,"Fifth Feeder Category (eg. TasNetworks (D))",{"$f":"INDEX(dms_FeederType_5_flag,MATCH(dms_TradingName,dms_TradingName_List))","v":"NO"},"dms_FifthFeeder_flag_NSP","=INDEX(dms_FeederType_5_flag,MATCH(dms_TradingName,dms_TradingName_List))"]
[]
[null,"DISCARD FILES"]
[null,"discard this record?","NO","dms_DISCARD","If record is to be discarded from DB set this flag to YES"]
[]
[null,"SUBSET FILES"]
[null,"Is this Submission File a Subset File","NO","dms_Partial"]
[]
[]
[null,"REGULATORY YEARS FOR MULTI RYE SUBMISSIONS"]
[null,"Multiple RYE flag","NO","dms_Multi_RYE_flag"]
[null,null,"Manually specify RYE","Named ranges to apply"]
[null,null,2013,"dms_RYE_01"]
[null,null,2014,"dms_RYE_02"]
[null,null,2015,"dms_RYE_03"]
[null,null,2016,"dms_RYE_04"]
[null,null,2017,"dms_RYE_05"]
[null,null,2018,"dms_RYE_06"]
[null,null,2019,"dms_RYE_07"]
[null,null,2020,"dms_RYE_08"]
[null,null,2021,"dms_RYE_09"]

{"sheet":"Instructions","index":4,"n_rows":25,"n_cols":4,"rows_kept":25,"cut":false,"hidden":false,"merged":[[24,2,24,4],[10,1,12,1],[10,2,10,4],[11,2,11,3],[12,2,12,4],[14,2,14,4],[7,1,8,1],[7,2,7,3],[8,2,8,4],[16,1,22,1],[16,2,16,4],[1,1,1,4],[2,1,2,4],[3,1,3,4],[4,1,4,4],[5,2,5,4]]}
[]
[null,{"$f":"CONCATENATE(dms_Sector,\" \",dms_Segment,\" \", \"Network Service Provider\")","v":"Electricity Transmission Network Service Provider"}]
[null,{"$f":"IF(dms_Model=\"Reset\",\"Regulatory Proposal RIN Template\",\"Annual Reporting RIN\")","v":"Regulatory Proposal RIN Template"}]
[null,{"$f":"CONCATENATE(\"This template is to be used by \",dms_TradingNameFull,\" to fulfil its reporting obligations to the AER.\")","v":"This template is to be used by ElectraNet to fulfil its reporting obligations to the AER."}]
[null,"INSTRUCTIONS"]
[null,"GENERAL","Complete the Business & other details worksheet before entering data or values in any other worksheets. The Business & other details worksheet is linked to other worksheets within the workbook and automatically generates certain column headings and conditional formatting."]
[]
[null,"CONFIDENTIAL INFORMATION","\nPlease use the macro at the top of each \nworksheet to identify confidential information\nin the confidential workbook. \n\n"]
[null,null,"-Do this by selecting the cell or cells that contain confidential information and then run the Mark selection as CONFIDENTIAL macro. This will format the cells a specific colour that is identified by the AER's database which in turn marks that information as confidential.\n\n-To reverse this, select the cell or cells and run the Return selection to NON-CONFIDENTIAL macro."]
[]
[null,"AMENDMENTS","\nIf an NSP wishes to correct data previously submitted to the AER it should resubmit that data using the original completed submission as the starting point. Please make any necessary changes to the data. Data that is not being amended should be left unchanged. \n\nNSPs must identify the reason for the amendments in the Amendment Reason box on the  Business and other details worksheet. NSPs may provide further details regarding any amendments in the Amendments worksheet. \n\n."]
[null,null,"NSP may use Amended Data macro \nto highlight cells that contain amended data.\nNB: if data is also CONFIDENTIAL, re-apply \nthe Confidentiality macro after applying the \nAmended macro"]
[null,null,"Please resubmit two (2) files - a confidential version and a public version of the amended submission to the AER"]
[]
[null,"UNITS OF MEASURE","\nAll amounts are to be unrounded and reported on a one for one basis: that is 1000 is to be entered as '1000'. Applicable units of measure may be identified in the table column headings or row descriptors.\n\n"]
[]
[null,"INPUT / NON-INPUT CELLS"]
[null,null,null,"Yellow = Input cell (mandatory)"]
[null,null,null,"Darker yellow = input cell (mandatory)"]
[null,null,null,"Orange = input cell (if data available)"]
[null,null,null,"Grey = Not applicable/No inputs required"]
[null,null,null," \nPLEASE DO NOT ENTER TEXT into cells that are to contain numeric data."]
[]
[]
[null,"NAVIGATION","\nMany tables in the worksheets have been \"grouped\" to allow for easy navigation. To ungroup or group data use the outline symbols in the left margin (for Row groupings) or above the columns (for column groupings). \n\n\n\n"]

{"sheet":"CONTENTS","index":5,"n_rows":39,"n_cols":6,"rows_kept":39,"cut":false,"hidden":false,"merged":[[4,4,4,5]]}
[null,null,null,{"$f":"INDEX(dms_Worksheet_List,MATCH(dms_Model,dms_Model_List))","v":"REGULATORY REPORTING STATEMENT"}]
[null,null,null,{"$f":"INDEX(dms_TradingNameFull_List,MATCH(dms_TradingName,dms_TradingName_List))","v":"ElectraNet"}]
[]
[]
[null,null,null,null,"CONTENTS"]
[]
[null,null,null,null,"TEMPLATE DATE","SEPTEMBER 2021"]
[]
[null,null,null,null,"SUBMISSION","Business & other details"]
[null,null,null,null,null,"CPI series"]
[]
[null,null,null,null,"EXPENDITURE","2.1 Expenditure summary"]
[null,null,null,null,null,"2.2 Repex"]
[null,null,null,null,null,"2.3 Augex (a)"]
[null,null,null,null,null,"2.3 Augex (b)"]
[null,null,null,null,null,"2.5 Connections"]
[null,null,null,null,null,"2.6 Non-network"]
[null,null,null,null,null,"2.10 Overheads"]
[null,null,null,null,null,"2.11 Labour"]
[null,null,null,null,null,"2.14 Forecast price changes"]
[null,null,null,null,null,"2.16 Opex Summary"]
[null,null,null,null,null,"2.17 Step Changes"]
[]
[null,null,null,null,"ECONOMIC BENCHMARKING","3.1 Revenue"]
[null,null,null,null,null,"3.2 Operating expenditure"]
[null,null,null,null,null,"3.3 Assets (RAB)"]
[null,null,null,null,null,"3.4 Operational data"]
[null,null,null,null,null,"3.5 Physical assets"]
[null,null,null,null,null,"3.7 Operating environment"]
[]
[null,null,null,null,"NETWORK","5.4 MD & Utilisation - Spatial"]
[]
[null,null,null,null,"OTHER","7.1  Policies and Procedures"]
[null,null,null,null,null,"7.2 Contingent projects"]
[null,null,null,null,null,"7.3 Obligations"]
[null,null,null,null,null,"7.4 Shared Assets"]
[null,null,null,null,null,"7.9 STPIS"]
[]
[null,null,null,null,"CAPEX","8.2 Capex"]

{"sheet":"Business & other details","index":6,"n_rows":74,"n_cols":81,"rows_kept":74,"cut":false,"hidden":false,"merged":[[73,25,73,34],[73,37,73,52],[55,25,55,34],[63,25,63,34],[65,25,65,34],[55,37,55,44],[61,25,61,34],[61,37,61,52],[31,37,31,58],[32,37,32,58],[33,37,33,58],[43,37,43,44],[43,46,43,53],[43,55,43,62],[63,37,63,52],[65,37,65,52],[67,37,67,52],[69,37,71,81],[67,25,67,34],[69,25,71,34],[49,73,49,80],[41,25,41,34],[45,25,45,34],[41,37,41,44],[49,25,49,34],[53,25,53,34],[45,46,45,53],[45,37,45,44],[49,37,49,44],[41,46,41,53],[49,55,49,62],[49,64,49,71],[41,55,41,62],[41,64,41,71],[47,46,47,53],[47,55,47,62],[47,64,47,71],[51,55,51,62],[53,37,53,44],[49,46,49,53],[51,46,51,53],[51,37,51,44],[47,37,47,44],[50,73,50,80],[50,64,50,71],[46,64,46,71],[46,55,46,62],[50,55,50,62],[47,73,47,80],[51,73,51,80],[51,64,51,71],[22,60,22,66],[23,60,23,66],[31,60,31,66],[25,21,25,35],[23,21,23,35],[45,73,45,80],[45,64,45,71],[46,73,46,80],[45,55,45,62],[50,46,50,53],[46,46,46,53],[46,37,46,44],[50,37,50,44],[31,68,31,89],[32,68,32,89],[33,68,33,89],[43,64,43,71],[43,73,43,80],[41,73,41,80],[25,49,25,51],[24,60,24,66],[25,60,25,66],[42,73,42,80],[32,21,32,35],[33,21,33,35],[33,60,33,66],[32,60,32,66],[0,7,2,15],[6,21,6,75],[24,21,24,35],[42,37,42,44],[42,46,42,53],[42,55,42,62],[42,64,42,71],[3,21,3,57],[8,16,8,93],[22,68,22,89],[23,68,23,89],[25,68,25,71],[25,80,25,82],[24,68,24,82],[25,37,25,40],[22,37,22,58],[23,37,23,58],[31,21,31,35],[22,21,22,35],[16,21,16,35],[16,37,16,48],[15,21,15,35],[15,37,15,58],[24,37,24,51]]}
[null,null,null,null,null,null,null,null,null,null,null,null,null,null,null,null,null,null,null,null,null,{"$f":"INDEX(dms_Worksheet_List,MATCH(dms_Model,dms_Model_List))","v":"REGULATORY REPORTING STATEMENT"}]
[null,null,null,null,null,null,null,null,null,null,null,null,null,null,null,null,null,null,null,null,null,{"$f":"INDEX(dms_TradingNameFull_List,MATCH(dms_TradingName,dms_TradingName_List))","v":"ElectraNet"}]
[null,null,null,null,null,null,null,null,null,null,null,null,null,null,null,null,null,null,null,null,null,{"$f":"CONCATENATE( \"DATA SPAN \", dms_Header_Span)","v":"DATA SPAN 2021-22 to 2027-28"}]
[null,null,null,null,null,null,null,null,null,null,null,null,null,null,null,null,null,null,null,null,null,"BUSINESS & OTHER DETAILS"]
[]
[null,null,null,null,null,null,null,null,null,null,null,null,null,null,null,null,null,null,null,null,null,"INSTRUCTIONS"]
[null,null,null,null,null,null,null,null,null,null,null,null,null,null,null,null,null,null,null,null,null,"Complete the following business details regulatory template before entering data or values in any other regulatory template. This regulatory template is linked to other cells within the spreadsheet and automatically generates column headings and conditional formatting to distinguish business specific input and non-input cells. "]
[]
[null,null,null,null,null,null,null,null,null,null,null,null,null,null,null,null,"SUBMISSION PARTICULARS INPUT SHEET"]
[]
[]
[null,null,null,null,null,null,null,null,null,null,null,null,null,null,null,null,null,null,null,null,null,"ENTITY DETAILS"]
[]
[null,null,null,null,null,null,null,null,null,null,null,null,null,null,null,null,null,null,null,null,null,"Business Name"]
[]
[null,null,null,null,null,null,null,null,null,null,null,null,null,null,null,null,null,null,null,null,null,"Short name",null,null,null,null,null,null,null,null,null,null,null,null,null,null,null,"ElectraNet"]
[null,null,null,null,null,null,null,null,null,null,null,null,null,null,null,null,null,null,null,null,null,"ACN/ABN",null,null,null,null,null,null,null,null,null,null,null,null,null,null,null,{"$f":"INDEX(dms_ABN_List,MATCH(dms_TradingName,dms_TradingName_List))","v":41094482416}]
[]
[]
[]
[null,null,null,null,null,null,null,null,null,null,null,null,null,null,null,null,null,null,null,null,null,"Business Address",null,null,null,null,null,null,null,null,null,null,null,null,null,null,null,null,null,null,null,null,null,null,null,null,null,null,null,null,null,null,null,null,null,null,null,null,null,null,null,null,null,null,null,null,null,null,"Postal Address"]
[]
[null,null,null,null,null,null,null,null,null,null,null,null,null,null,null,null,null,null,null,null,null,"Address 1",null,null,null,null,null,null,null,null,null,null,null,null,null,null,null,{"$f":"INDEX(dms_Addr1_List,MATCH(dms_TradingName,dms_TradingName_List))","v":"52-55 East Terrace"},null,null,null,null,null,null,null,null,null,null,null,null,null,null,null,null,null,null,null,null,null,null,"Address 1",null,null,null,null,null,null,null,{"$f":"INDEX(dms_PAddr1_List,MATCH(dms_TradingName,dms_TradingName_List))","v":"PO Box 7096"}]
[null,null,null,null,null,null,null,null,null,null,null,null,null,null,null,null,null,null,null,null,null,"Address 2",null,null,null,null,null,null,null,null,null,null,null,null,null,null,null,{"$f":"IF(ISBLANK(INDEX(dms_Addr2_List,MATCH(dms_TradingName,dms_TradingName_List))),\"\",(INDEX(dms_Addr2_List,MATCH(dms_TradingName,dms_TradingName_List))))","v":"Rymill Park"},null,null,null,null,null,null,null,null,null,null,null,null,null,null,null,null,null,null,null,null,null,null,"Address 2",null,null,null,null,null,null,null,{"$f":"IF(ISBLANK(INDEX(dms_PAddr2_List,MATCH(dms_TradingName,dms_TradingName_List))),\"\",(INDEX(dms_PAddr2_List,MATCH(dms_TradingName,dms_TradingName_List))))","v":"Hutt Street Post Office"}]
[null,null,null,null,null,null,null,null,null,null,null,null,null,null,null,null,null,null,null,null,null,"Suburb",null,null,null,null,null,null,null,null,null,null,null,null,null,null,null,{"$f":"INDEX(dms_Suburb_List,MATCH(dms_TradingName,dms_TradingName_List))","v":"ADELAIDE"},null,null,null,null,null,null,null,null,null,null,null,null,null,null,null,null,null,null,null,null,null,null,"Suburb",null,null,null,null,null,null,null,{"$f":"INDEX(dms_PSuburb_List,MATCH(dms_TradingName,dms_TradingName_List))","v":"ADELAIDE"}]
[null,null,null,null,null,null,null,null,null,null,null,null,null,null,null,null,null,null,null,null,null,"State",null,null,null,null,null,null,null,null,null,null,null,null,null,null,null,{"$f":"INDEX(dms_State_List,MATCH(dms_TradingName,dms_TradingName_List))","v":"SA"},null,null,null,null,null,null,null,null,null,"Post code",null,5000,null,null,null,null,null,null,null,null,null,null,"State",null,null,null,null,null,null,null,{"$f":"INDEX(dms_PState_List,MATCH(dms_TradingName,dms_TradingName_List))","v":"SA"},null,null,null,null,null,null,null,null,null,"Post code",null,5000]
[]
[null,null,null,null,null,null,null,null,null,null,null,null,null,null,null,null,null,null,null,null,null,null,null,null,null,null,null,null,null,null,null,null,null,null,null,null,null,null,null,null,null,null,null,null,null,null,null,null,null,null,null,null,"`"]
[]
[null,null,null,null,null,null,null,null,null,null,null,null,null,null,null,null,null,null,null,null,null,"Contact Names"]
[]
[null,null,null,null,null,null,null,null,null,null,null,null,null,null,null,null,null,null,null,null,null,"Name",null,null,null,null,null,null,null,null,null,null,null,null,null,null,null,null,null,null,null,null,null,null,null,null,null,null,null,null,null,null,null,null,null,null,null,null,null,null,"Name"]
[null,null,null,null,null,null,null,null,null,null,null,null,null,null,null,null,null,null,null,null,null,"Phone",null,null,null,null,null,null,null,null,null,null,null,null,null,null,null,null,null,null,null,null,null,null,null,null,null,null,null,null,null,null,null,null,null,null,null,null,null,null,"Phone"]
[null,null,null,null,null,null,null,null,null,null,null,null,null,null,null,null,null,null,null,null,null,"Email",null,null,null,null,null,null,null,null,null,null,null,null,null,null,null,null,null,null,null,null,null,null,null,null,null,null,null,null,null,null,null,null,null,null,null,null,null,null,"Email"]
[]
[]
[]
[]
[null,null,null,null,null,null,null,null,null,null,null,null,null,null,null,null,"REGULATORY CONTROL PERIODS"]
[]
[]
[null,null,null,null,null,null,null,null,null,null,null,null,null,null,null,null,null,null,null,null,null,null,null,null,null,"Forthcoming period",null,null,null,null,null,null,null,null,null,null,null,"2023-24",null,null,null,null,null,null,null,null,{"$f":"FRCP_y2","v":"2024-25"},null,null,null,null,null,null,null,null,{"$f":"FRCP_y3","v":"2025-26"},null,null,null,null,null,null,null,null,{"$f":"FRCP_y4","v":"2026-27"},null,null,null,null,null,null,null,null,{"$f":"FRCP_y5","v":"2027-28"}]
[null,null,null,null,null,null,null,null,null,null,null,null,null,null,null,null,null,null,null,null,null,null,null,null,null,null,null,null,null,null,null,null,null,null,null,null,null,{"$f":"FRCP_y6","v":"2028-29"},null,null,null,null,null,null,null,null,{"$f":"FRCP_y7","v":"2029-30"},null,null,null,null,null,null,null,null,{"$f":"FRCP_y8","v":"2030-31"},null,null,null,null,null,null,null,null,{"$f":"FRCP_y9","v":"2031-32"},null,null,null,null,null,null,null,null,{"$f":"FRCP_y10","v":"2032-33"}]
[null,null,null,null,null,null,null,null,null,null,null,null,null,null,null,null,null,null,null,null,null,null,null,null,null,null,null,null,null,null,null,null,null,null,null,null,null,{"$f":"FRCP_y11","v":"2033-34"},null,null,null,null,null,null,null,null,{"$f":"FRCP_y12","v":"2034-35"},null,null,null,null,null,null,null,null,{"$f":"FRCP_y13","v":"2035-36"},null,null,null,null,null,null,null,null,{"$f":"FRCP_y14","v":"2036-37"},null,null,null,null,null,null,null,null,{"$f":"FRCP_y15","v":{"$error":"#REF!"}}]
[]
[null,null,null,null,null,null,null,null,null,null,null,null,null,null,null,null,null,null,null,null,null,null,null,"RESETS",null,"Current period",null,null,null,null,null,null,null,null,null,null,null,{"$f":"CRCP_y1","v":"2018-19"},null,null,null,null,null,null,null,null,{"$f":"CRCP_y2","v":"2019-20"},null,null,null,null,null,null,null,null,{"$f":"CRCP_y3","v":"2020-21"},null,null,null,null,null,null,null,null,{"$f":"CRCP_y4","v":"2021-22"},null,null,null,null,null,null,null,null,{"$f":"CRCP_y5","v":"2022-23"}]
[null,null,null,null,null,null,null,null,null,null,null,null,null,null,null,null,null,null,null,null,null,null,null,null,null,null,null,null,null,null,null,null,null,null,null,null,null,{"$f":"CRCP_y6","v":"2023-24"},null,null,null,null,null,null,null,null,{"$f":"CRCP_y7","v":"2024-25"},null,null,null,null,null,null,null,null,{"$f":"CRCP_y8","v":"2025-26"},null,null,null,null,null,null,null,null,{"$f":"CRCP_y9","v":"2026-27"},null,null,null,null,null,null,null,null,{"$f":"CRCP_y10","v":"2027-28"}]
[null,null,null,null,null,null,null,null,null,null,null,null,null,null,null,null,null,null,null,null,null,null,null,null,null,null,null,null,null,null,null,null,null,null,null,null,null,{"$f":"CRCP_y11","v":"2028-29"},null,null,null,null,null,null,null,null,{"$f":"CRCP_y12","v":"2029-30"},null,null,null,null,null,null,null,null,{"$f":"CRCP_y13","v":"2030-31"},null,null,null,null,null,null,null,null,{"$f":"CRCP_y14","v":"2031-32"},null,null,null,null,null,null,null,null,{"$f":"CRCP_y15","v":"2032-33"}]
[]
[null,null,null,null,null,null,null,null,null,null,null,null,null,null,null,null,null,null,null,null,null,null,null,null,null,"Previous period",null,null,null,null,null,null,null,null,null,null,null,{"$f":"PRCP_y1","v":"2013-14"},null,null,null,null,null,null,null,null,{"$f":"PRCP_y2","v":"2014-15"},null,null,null,null,null,null,null,null,{"$f":"PRCP_y3","v":"2015-16"},null,null,null,null,null,null,null,null,{"$f":"PRCP_y4","v":"2016-17"},null,null,null,null,null,null,null,null,{"$f":"PRCP_y5","v":"2017-18"}]
[null,null,null,null,null,null,null,null,null,null,null,null,null,null,null,null,null,null,null,null,null,null,null,null,null,null,null,null,null,null,null,null,null,null,null,null,null,{"$f":"PRCP_y6","v":"2018-19"},null,null,null,null,null,null,null,null,{"$f":"PRCP_y7","v":"2019-20"},null,null,null,null,null,null,null,null,{"$f":"PRCP_y8","v":"2020-21"},null,null,null,null,null,null,null,null,{"$f":"PRCP_y9","v":"2021-22"},null,null,null,null,null,null,null,null,{"$f":"PRCP_y10","v":"2022-23"}]
[null,null,null,null,null,null,null,null,null,null,null,null,null,null,null,null,null,null,null,null,null,null,null,null,null,null,null,null,null,null,null,null,null,null,null,null,null,{"$f":"PRCP_y11","v":"2023-24"},null,null,null,null,null,null,null,null,{"$f":"PRCP_y12","v":"2024-25"},null,null,null,null,null,null,null,null,{"$f":"PRCP_y13","v":"2025-26"},null,null,null,null,null,null,null,null,{"$f":"PRCP_y14","v":"2026-27"},null,null,null,null,null,null,null,null,{"$f":"PRCP_y15","v":"2027-28"}]
[]
[null,null,null,null,null,null,null,null,null,null,null,null,null,null,null,null,null,null,null,null,null,null,null,null,null,"Commencing year",null,null,null,null,null,null,null,null,null,null,null,"2021-22"]
[null,null,null,null,null,null,null,null,null,null,null,null,null,null,null,null,null,null,null,null,null,null,null,"ANNUAL RINS"]
[null,null,null,null,null,null,null,null,null,null,null,null,null,null,null,null,null,null,null,null,null,null,null,null,null,"Final year",null,null,null,null,null,null,null,null,null,null,null,"2027-28"]
[]
[]
[]
[null,null,null,null,null,null,null,null,null,null,null,null,null,null,null,null,"SUBMISSION DETAILS"]
[]
[null,null,null,null,null,null,null,null,null,null,null,null,null,null,null,null,null,null,null,null,null,null,null,null,null,"RIN type",null,null,null,null,null,null,null,null,null,null,null,{"$f":"INDIRECT(dms_Model)","v":"Regulatory Reporting (Reset)"}]
[]
[null,null,null,null,null,null,null,null,null,null,null,null,null,null,null,null,null,null,null,null,null,null,null,null,null,"Source",null,null,null,null,null,null,null,null,null,null,null,"Regulatory proposal"]
[]
[null,null,null,null,null,null,null,null,null,null,null,null,null,null,null,null,null,null,null,null,null,null,null,"THIS FILE",null,"Data Quality",null,null,null,null,null,null,null,null,null,null,null,"Consolidated"]
[]
[null,null,null,null,null,null,null,null,null,null,null,null,null,null,null,null,null,null,null,null,null,null,null,null,null,"Confidentiality Status",null,null,null,null,null,null,null,null,null,null,null,"Public"]
[]
[null,null,null,null,null,null,null,null,null,null,null,null,null,null,null,null,null,null,null,null,null,null,null,null,null,"Amended RIN \nAmendment Reason",null,null,null,null,null,null,null,null,null,null,null,"."]
[]
[]
[]
[null,null,null,null,null,null,null,null,null,null,null,null,null,null,null,null,null,null,null,null,null,null,null,null,null,"Submission Date",null,null,null,null,null,null,null,null,null,null,null,"2022-01-31",null,null,null,null,null,null,null,null,null,null,null,null,null,null,null,null,null,"Please enter date this file submitted to AER"]

{"sheet":"CPI series","index":7,"n_rows":12,"n_cols":12,"rows_kept":12,"cut":false,"hidden":false,"merged":[[8,2,8,8]]}
[null,{"$f":"(LOOKUP(dms_Model,dms_Model_List,dms_Worksheet_List))","v":"REGULATORY REPORTING STATEMENT"}]
[null,{"$f":"INDEX(dms_TradingNameFull_List,MATCH(dms_TradingName,dms_TradingName_List))","v":"ElectraNet"}]
[null,{"$f":"IF(SUM(dms_SingleYear_Model)>0,CRY,CONCATENATE(FRCP_y1,\" to \",dms_MultiYear_FinalYear_Result))","v":"2023-24 to 2027-28"}]
[null,"CPI SERIES"]
[]
[]
[null,"NOMINATED CPI SERIES"]
[]
[null,"Name of CPI series","ABS, CPI All Groups Australia, A2325846C, Dec Quarter"]
[]
[null,null,{"$f":"CRCP_y1","v":"2018-19"},{"$f":"CRCP_y2","v":"2019-20"},{"$f":"CRCP_y3","v":"2020-21"},{"$f":"CRCP_y4","v":"2021-22"},{"$f":"CRCP_y5","v":"2022-23"},{"$f":"FRCP_y1","v":"2023-24"},{"$f":"FRCP_y2","v":"2024-25"},{"$f":"FRCP_y3","v":"2025-26"},{"$f":"FRCP_y4","v":"2026-27"},{"$f":"FRCP_y5","v":"2027-28"}]
[null,"Series data",1.78E-2,1.84E-2,8.6E-3,2.4500000000000001E-2,2.4500000000000001E-2,2.4E-2,2.4E-2,2.4E-2,2.4E-2,2.4E-2]

{"sheet":"2.1 Expenditure summary","index":8,"n_rows":37,"n_cols":9,"rows_kept":37,"cut":false,"hidden":false,"merged":[[8,2,8,8],[19,2,19,8],[30,2,30,8]]}
[null,{"$f":"(LOOKUP(dms_Model,dms_Model_List,dms_Worksheet_List))","v":"REGULATORY REPORTING STATEMENT"}]
[null,{"$f":"INDEX(dms_TradingNameFull_List,MATCH(dms_TradingName,dms_TradingName_List))","v":"ElectraNet"}]
[null,{"$f":"IF(SUM(dms_SingleYear_Model)>0,CRY,CONCATENATE(FRCP_y1,\" to \",dms_MultiYear_FinalYear_Result))","v":"2023-24 to 2027-28"}]
[null,"2.1 - EXPENDITURE SUMMARY AND RECONCILIATION"]
[]
[null,"There are three tables on this worksheet. Each has been grouped for ease of navigation. See the Instructions sheet on how to group or ungroup tables. "]
[]
[null,"2.1.1 - PRESCRIBED TRANSMISSION SERVICES CAPEX (as incurred)"]
[null,null,{"$f":"CONCATENATE(\"Forecast \n($0's. real \",dms_DollarReal,\")\")","v":"Forecast \n($0's. real June 2023)"}]
[null,null,{"$f":"dms_y1","v":"2021-22"},{"$f":"dms_y2","v":"2022-23"},{"$f":"dms_y3","v":"2023-24"},{"$f":"dms_y4","v":"2024-25"},{"$f":"dms_y5","v":"2025-26"},{"$f":"dms_y6","v":"2026-27"},{"$f":"dms_y7","v":"2027-28"}]
[null,"Replacement expenditure",241407134.84235632,113413715.32711367,63632302.691207685,74651261.543457463,73796347.67949225,78621737.250053629,71669220.180866227]
[null,"Connections",0,0,0,0,0,0,0]
[null,"Augmentation Expenditure",121681114.65656541,252836551.43710235,39505322.115478039,18845144.238961548,0,0,0]
[null,"Non-network",20001378.956081815,11611095.707390977,18022980.12106384,14632774.799673118,16367888.870199604,13959488.203046517,14483201.436888417]
[null,"Capitalised network overheads",9107632.7219226938,7322514.9049573038,4089908.8459162177,4635643.5600560065,4589519.7453903342,4925634.8143059555,4325817.4088517521]
[null,"Capitalised corporate overheads",2793954.2767986702,1963464.6376843378,2887732.4270330784,2945878.1497543869,3852736.668419661,3765191.813506024,3397053.9936208548]
[null,"Total",{"$f":"SUM(C11:C16)","v":394991215.45372492},387147342.01424861,128138246.20069885,115710702.29190253,98606492.963501856,101272052.08091213,93875293.020227253]
[]
[null,"2.1.2 - PRESCRIBED TRANSMISSION SERVICES OPEX"]
[null,null,{"$f":"CONCATENATE(\"Forecast \n($0's. real \",dms_DollarReal,\")\")","v":"Forecast \n($0's. real June 2023)"}]
[null,null,{"$f":"dms_y1","v":"2021-22"},{"$f":"dms_y2","v":"2022-23"},{"$f":"dms_y3","v":"2023-24"},{"$f":"dms_y4","v":"2024-25"},{"$f":"dms_y5","v":"2025-26"},{"$f":"dms_y6","v":"2026-27"},{"$f":"dms_y7","v":"2027-28"}]
[null,"Vegetation management"]
[null,"Maintenance"]
[null,"Non-network"]
[null,"Network overheads"]
[null,"Corporate overheads"]
[null,"Total",{"$f":"SUM(C22:C26)","v":0},0,0,0,0,0,0]
[]
[]
[null,"2.1.8 - PRESCRIBED TRANSMISSION SERVICES CAPITALISED OVERHEADS"]
[null,null,{"$f":"CONCATENATE(\"Forecast \n($0's. real \",dms_DollarReal,\")\")","v":"Forecast \n($0's. real June 2023)"}]
[null,null,{"$f":"dms_y1","v":"2021-22"},{"$f":"dms_y2","v":"2022-23"},{"$f":"dms_y3","v":"2023-24"},{"$f":"dms_y4","v":"2024-25"},{"$f":"dms_y5","v":"2025-26"},{"$f":"dms_y6","v":"2026-27"},{"$f":"dms_y7","v":"2027-28"}]
[null,"Replacement expenditure",7307720.9350439208,4126266.4825733574,3619275.2020739815,4411138.1408623708,4589519.7453903342,4925634.8143059555,4325817.4088517521]
[null,"Connections",0,0,0,0,0,0,0]
[null,"Augmentation Expenditure",1799911.7868787725,3196248.4223839459,470633.64384223614,224505.41919363552,0,0,0]
[null,"Non-network",2793954.2767986702,1963464.6376843378,2887732.4270330784,2945878.1497543869,3852736.668419661,3765191.813506024,3397053.9936208548]
[null,"Total",{"$f":"SUM(C33:C36)","v":11901586.998721365},9285979.5426416416,6977641.272949296,7581521.7098103929,8442256.4138099961,8690826.6278119795,7722871.4024726069]

{"sheet":"2.2 Repex","index":9,"n_rows":68,"n_cols":10,"rows_kept":68,"cut":false,"hidden":false,"merged":[[56,3,56,9],[57,3,57,9],[40,3,40,9],[5,1,5,2],[9,3,9,9],[10,3,10,9],[24,3,24,9],[25,3,25,9],[39,3,39,9]]}
[null,{"$f":"(LOOKUP(dms_Model,dms_Model_List,dms_Worksheet_List))","v":"REGULATORY REPORTING STATEMENT"}]
[null,{"$f":"INDEX(dms_TradingNameFull_List,MATCH(dms_TradingName,dms_TradingName_List))","v":"ElectraNet"}]
[null,{"$f":"IF(SUM(dms_SingleYear_Model)>0,CRY,CONCATENATE(FRCP_y1,\" to \",dms_MultiYear_FinalYear_Result))","v":"2023-24 to 2027-28"}]
[null,"2.2 REPEX"]
[]
[null,"There is ONE table (with three sub-tables) on this worksheet. See the Instructions sheet on how to group or ungroup tables. "]
[]
[null,"2.2.1 - REPLACEMENT EXPENDITURE, VOLUMES AND ASSET FAILURES BY ASSET CATEGORY"]
[null,"EXPENDITURE"]
[null,null,null,"EXPENDITURE"]
[null,null,null,{"$f":"CONCATENATE(\"($0's. real \",dms_DollarReal,\")\")","v":"($0's. real June 2023)"}]
[null,"ASSET GROUP",null,{"$f":"dms_y1","v":"2021-22"},{"$f":"dms_y2","v":"2022-23"},{"$f":"dms_y3","v":"2023-24"},{"$f":"dms_y4","v":"2024-25"},{"$f":"dms_y5","v":"2025-26"},{"$f":"dms_y6","v":"2026-27"},{"$f":"dms_y7","v":"2027-28"}]
[null,"TRANSMISSION TOWERS","Total",26135522.397929356,83138718.063431099,0,2243177.4978230116,0,0,22868651.302886859]
[null,"TRANSMISSION TOWER SUPPORT STRUCTURES","Total",65106190.139235124,115184470.69748798,0,785031.72621907818,0,0,36466139.253187537]
[null,"CONDUCTORS","Total",407521.8872683302,86797607.238315552,0,0,26227102.728288185,0,2359364.4009774649]
[null,"TRANSMISSION CABLES","Total",596318.41168541159,0,0,0,0,220697.52788620148,1425139.7813502618]
[null,"SUBSTATION SWITCHBAYS","Total",59829666.100782901,31580765.205335919,16148812.719713185,210435.79276545765,6789267.2521499665,0,59417051.078507386]
[null,"SUBSTATION POWER TRANSFORMERS","Total",306816.86316863925,13723012.772041157,0,0,4815145.6223588306,8498967.2315663304,1822118.9286754539]
[null,"SUBSTATION REACTIVE PLANT","Total",0,7716789.3283307813,0,0,0,0,0]
[null,"SCADA, NETWORK CONTROL AND PROTECTION SYSTEMS","Total",31783592.183627252,5056429.6127494853,30142505.552465055,4435205.3073621625,16372126.906334454,12045755.11943502,23666005.544729222]
[null,"OTHER","Total",40092255.685404584,123075453.47229718,0,26842471.378303807,8628419.9732543882,15703982.756353993,101783248.24212039]
[]
[]
[null,"ASSET REPLACEMENTS"]
[null,null,null,"VOLUMES "]
[null,null,null,"(0's)"]
[null,"ASSET GROUP",null,{"$f":"dms_y1","v":"2021-22"},{"$f":"dms_y2","v":"2022-23"},{"$f":"dms_y3","v":"2023-24"},{"$f":"dms_y4","v":"2024-25"},{"$f":"dms_y5","v":"2025-26"},{"$f":"dms_y6","v":"2026-27"},{"$f":"dms_y7","v":"2027-28"}]
[null,"TRANSMISSION TOWERS","Total",221,262,0,56,0,0,57]
[null,"TRANSMISSION TOWER SUPPORT STRUCTURES","Total",1445,1511,0,168,0,0,2776]
[null,"CONDUCTORS","Total",1,0,0,0,244,0,0]
[null,"TRANSMISSION CABLES","Total",1,0,0,0,0,8,1.17]
[null,"SUBSTATION SWITCHBAYS","Total",1,81,159,6,23,0,242]
[null,"SUBSTATION POWER TRANSFORMERS","Total",1,103,0,0,2,83,1]
[null,"SUBSTATION REACTIVE PLANT","Total",0,1,0,0,0,0,0]
[null,"SCADA, NETWORK CONTROL AND PROTECTION SYSTEMS","Total",5,1,78,1,35,28,146]
[null,"OTHER","Total",376,37,0,5,3,1000.1950000000001,396.26400000000001]
[]
[]
[null,"ASSET FAILURES"]
[null,null,null,"VOLUMES"]
[null,null,null,"(0's)"]
[null,"ASSET GROUP",null,{"$f":"dms_y1","v":"2021-22"},{"$f":"dms_y2","v":"2022-23"},{"$f":"dms_y3","v":"2023-24"},{"$f":"dms_y4","v":"2024-25"},{"$f":"dms_y5","v":"2025-26"},{"$f":"dms_y6","v":"2026-27"},{"$f":"dms_y7","v":"2027-28"}]
[null,"TRANSMISSION TOWERS","Total"]
[null,"TRANSMISSION TOWER SUPPORT STRUCTURES","Total"]
[null,"CONDUCTORS","Total"]
[null,"TRANSMISSION CABLES","Total"]
[null,"SUBSTATION SWITCHBAYS","Total"]
[null,"SUBSTATION POWER TRANSFORMERS","Total"]
[null,"SUBSTATION REACTIVE PLANT","Total"]
[null,"SCADA, NETWORK CONTROL AND PROTECTION SYSTEMS","Total"]
[null,"OTHER","Total"]
[]
[]
[]
[null,"2.2.1(a) - REPLACEMENT EXPENDITURE - as incurred"]
[null,"EXPENDITURE"]
[null,null,null,"EXPENDITURE"]
[null,null,null,{"$f":"CONCATENATE(\"($0's. real \",dms_DollarReal,\")\")","v":"($0's. real June 2023)"}]
[null,"ASSET GROUP",null,{"$f":"dms_y1","v":"2021-22"},{"$f":"dms_y2","v":"2022-23"},{"$f":"dms_y3","v":"2023-24"},{"$f":"dms_y4","v":"2024-25"},{"$f":"dms_y5","v":"2025-26"},{"$f":"dms_y6","v":"2026-27"},{"$f":"dms_y7","v":"2027-28"}]
[null,"TRANSMISSION TOWERS","Total",43859033.564134382,15336647.378900325,2799941.1536465138,2692690.748817889,3937268.6483080531,7967102.7058006134,7665611.5491869152]
[null,"TRANSMISSION TOWER SUPPORT STRUCTURES","Total",43654079.218426943,21632385.033902302,4041114.7652091384,4006747.9296634593,7291471.1610715678,10579662.144247716,11314951.844867516]
[null,"CONDUCTORS","Total",45581264.485124983,16353721.103229554,8144735.7576382523,14244888.243226852,4394727.1853365712,684431.54840459942,731906.24371081369]
[null,"TRANSMISSION CABLES","Total",50931.955685323999,0,164127.75855997525,164323.28087173923,351141.8088454174,395614.28428206139,570630.17667727009]
[null,"SUBSTATION SWITCHBAYS","Total",18744439.400214892,11251965.178741891,10854042.856273338,14708359.801830711,12743576.266699515,12332367.393972388,19402949.40835062]
[null,"SUBSTATION POWER TRANSFORMERS","Total",3197647.2018075068,2367112.5534368581,2190494.1226786384,2919632.7786828005,4579362.7272503544,4618043.7244234793,729581.79948632547]
[null,"SUBSTATION REACTIVE PLANT","Total",5020622.0377939604,441618.75643536943,0,0,0,0,0]
[null,"SCADA, NETWORK CONTROL AND PROTECTION SYSTEMS","Total",9834226.3630964532,12949171.449487027,15570258.66231971,12498028.077430941,12197039.042121135,11048106.691576442,6927679.4228943111]
[null,"OTHER","Total",71464890.616071865,33081093.872980341,19867587.614882112,23416590.682933066,28301760.839859646,30996408.757346317,24325909.73569246]

{"sheet":"2.3 Augex (a)","index":10,"n_rows":183,"n_cols":34,"rows_kept":183,"cut":false,"hidden":false,"merged":[[52,8188,58,8188],[52,8189,58,8189],[52,8190,58,8190],[52,8179,58,8179],[52,8180,58,8180],[52,8181,58,8181],[52,8182,58,8182],[52,8183,58,8183],[52,8184,58,8184],[52,8185,58,8185],[52,8186,58,8186],[52,8187,58,8187],[52,8170,58,8170],[52,8171,58,8171],[52,8172,58,8172],[52,8173,58,8173],[52,8174,58,8174],[52,8175,58,8175],[52,8176,58,8176],[52,8177,58,8177],[52,8178,58,8178],[52,8161,58,8161],[52,8162,58,8162],[52,8163,58,8163],[52,8164,58,8164],[52,8165,58,8165],[52,8166,58,8166],[52,8167,58,8167],[52,8168,58,8168],[52,8169,58,8169],[52,8152,58,8152],[52,8153,58,8153],[52,8154,58,8154],[52,8155,58,8155],[52,8156,58,8156],[52,8157,58,8157],[52,8158,58,8158],[52,8159,58,8159],[52,8160,58,8160],[52,8143,58,8143],[52,8144,58,8144],[52,8145,58,8145],[52,8146,58,8146],[52,8147,58,8147],[52,8148,58,8148],[52,8149,58,8149],[52,8150,58,8150],[52,8151,58,8151],[52,8134,58,8134],[52,8135,58,8135],[52,8136,58,8136],[52,8137,58,8137],[52,8138,58,8138],[52,8139,58,8139],[52,8140,58,8140],[52,8141,58,8141],[52,8142,58,8142],[52,8125,58,8125],[52,8126,58,8126],[52,8127,58,8127],[52,8128,58,8128],[52,8129,58,8129],[52,8130,58,8130],[52,8131,58,8131],[52,8132,58,8132],[52,8133,58,8133],[52,8116,58,8116],[52,8117,58,8117],[52,8118,58,8118],[52,8119,58,8119],[52,8120,58,8120],[52,8121,58,8121],[52,8122,58,8122],[52,8123,58,8123],[52,8124,58,8124],[52,8107,58,8107],[52,8108,58,8108],[52,8109,58,8109],[52,8110,58,8110],[52,8111,58,8111],[52,8112,58,8112],[52,8113,58,8113],[52,8114,58,8114],[52,8115,58,8115],[52,8098,58,8098],[52,8099,58,8099],[52,8100,58,8100],[52,8101,58,8101],[52,8102,58,8102],[52,8103,58,8103],[52,8104,58,8104],[52,8105,58,8105],[52,8106,58,8106],[52,8089,58,8089],[52,8090,58,8090],[52,8091,58,8091],[52,8092,58,8092],[52,8093,58,8093],[52,8094,58,8094],[52,8095,58,8095],[52,8096,58,8096],[52,8097,58,8097],[52,8080,58,8080],[52,8081,58,8081],[52,8082,58,8082],[52,8083,58,8083],[52,8084,58,8084],[52,8085,58,8085],[52,8086,58,8086],[52,8087,58,8087],[52,8088,58,8088],[52,8071,58,8071],[52,8072,58,8072],[52,8073,58,8073],[52,8074,58,8074],[52,8075,58,8075],[52,8076,58,8076],[52,8077,58,8077],[52,8078,58,8078],[52,8079,58,8079],[52,8062,58,8062],[52,8063,58,8063],[52,8064,58,8064],[52,8065,58,8065],[52,8066,58,8066],[52,8067,58,8067],[52,8068,58,8068],[52,8069,58,8069],[52,8070,58,8070],[52,8053,58,8053],[52,8054,58,8054],[52,8055,58,8055],[52,8056,58,8056],[52,8057,58,8057],[52,8058,58,8058],[52,8059,58,8059],[52,8060,58,8060],[52,8061,58,8061],[52,8044,58,8044],[52,8045,58,8045],[52,8046,58,8046],[52,8047,58,8047],[52,8048,58,8048],[52,8049,58,8049],[52,8050,58,8050],[52,8051,58,8051],[52,8052,58,8052],[52,8035,58,8035],[52,8036,58,8036],[52,8037,58,8037],[52,8038,58,8038],[52,8039,58,8039],[52,8040,58,8040],[52,8041,58,8041],[52,8042,58,8042],[52,8043,58,8043],[52,8026,58,8026],[52,8027,58,8027],[52,8028,58,8028],[52,8029,58,8029],[52,8030,58,8030],[52,8031,58,8031],[52,8032,58,8032],[52,8033,58,8033],[52,8034,58,8034],[52,8017,58,8017],[52,8018,58,8018],[52,8019,58,8019],[52,8020,58,8020],[52,8021,58,8021],[52,8022,58,8022],[52,8023,58,8023],[52,8024,58,8024],[52,8025,58,8025],[52,8008,58,8008],[52,8009,58,8009],[52,8010,58,8010],[52,8011,58,8011],[52,8012,58,8012],[52,8013,58,8013],[52,8014,58,8014],[52,8015,58,8015],[52,8016,58,8016],[52,7999,58,7999],[52,8000,58,8000],[52,8001,58,8001],[52,8002,58,8002],[52,8003,58,8003],[52,8004,58,8004],[52,8005,58,8005],[52,8006,58,8006],[52,8007,58,8007],[52,7990,58,7990],[52,7991,58,7991],[52,7992,58,7992],[52,7993,58,7993],[52,7994,58,7994],[52,7995,58,7995],[52,7996,58,7996],[52,7997,58,7997],[52,7998,58,7998],[52,7981,58,7981],[52,7982,58,7982],[52,7983,58,7983],[52,7984,58,7984],[52,7985,58,7985],[52,7986,58,7986],[52,7987,58,7987],[52,7988,58,7988],[52,7989,58,7989],[52,7972,58,7972],[52,7973,58,7973],[52,7974,58,7974],[52,7975,58,7975],[52,7976,58,7976],[52,7977,58,7977],[52,7978,58,7978],[52,7979,58,7979],[52,7980,58,7980],[52,7963,58,7963],[52,7964,58,7964],[52,7965,58,7965],[52,7966,58,7966],[52,7967,58,7967],[52,7968,58,7968],[52,7969,58,7969],[52,7970,58,7970],[52,7971,58,7971],[52,7954,58,7954],[52,7955,58,7955],[52,7956,58,7956],[52,7957,58,7957],[52,7958,58,7958],[52,7959,58,7959],[52,7960,58,7960],[52,7961,58,7961],[52,7962,58,7962],[52,7945,58,7945],[52,7946,58,7946],[52,7947,58,7947],[52,7948,58,7948],[52,7949,58,7949],[52,7950,58,7950],[52,7951,58,7951],[52,7952,58,7952],[52,7953,58,7953],[52,7936,58,7936],[52,7937,58,7937],[52,7938,58,7938],[52,7939,58,7939],[52,7940,58,7940],[52,7941,58,7941],[52,7942,58,7942],[52,7943,58,7943],[52,7944,58,7944],[52,7927,58,7927],[52,7928,58,7928],[52,7929,58,7929],[52,7930,58,7930],[52,7931,58,7931],[52,7932,58,7932],[52,7933,58,7933],[52,7934,58,7934],[52,7935,58,7935],[52,7918,58,7918],[52,7919,58,7919],[52,7920,58,7920],[52,7921,58,7921],[52,7922,58,7922],[52,7923,58,7923],[52,7924,58,7924],[52,7925,58,7925],[52,7926,58,7926],[52,7909,58,7909],[52,7910,58,7910],[52,7911,58,7911],[52,7912,58,7912],[52,7913,58,7913],[52,7914,58,7914],[52,7915,58,7915],[52,7916,58,7916],[52,7917,58,7917],[52,7900,58,7900],[52,7901,58,7901],[52,7902,58,7902],[52,7903,58,7903],[52,7904,58,7904],[52,7905,58,7905],[52,7906,58,7906],[52,7907,58,7907],[52,7908,58,7908],[52,7891,58,7891],[52,7892,58,7892],[52,7893,58,7893],[52,7894,58,7894],[52,7895,58,7895],[52,7896,58,7896],[52,7897,58,7897],[52,7898,58,7898],[52,7899,58,7899],[52,7882,58,7882],[52,7883,58,7883],[52,7884,58,7884],[52,7885,58,7885],[52,7886,58,7886],[52,7887,58,7887],[52,7888,58,7888],[52,7889,58,7889],[52,7890,58,7890],[52,7873,58,7873],[52,7874,58,7874],[52,7875,58,7875],[52,7876,58,7876],[52,7877,58,7877],[52,7878,58,7878],[52,7879,58,7879],[52,7880,58,7880],[52,7881,58,7881],[52,7864,58,7864],[52,7865,58,7865],[52,7866,58,7866],[52,7867,58,7867],[52,7868,58,7868],[52,7869,58,7869],[52,7870,58,7870],[52,7871,58,7871],[52,7872,58,7872],[52,7855,58,7855],[52,7856,58,7856],[52,7857,58,7857],[52,7858,58,7858],[52,7859,58,7859],[52,7860,58,7860],[52,7861,58,7861],[52,7862,58,7862],[52,7863,58,7863],[52,7846,58,7846],[52,7847,58,7847],[52,7848,58,7848],[52,7849,58,7849],[52,7850,58,7850],[52,7851,58,7851],[52,7852,58,7852],[52,7853,58,7853],[52,7854,58,7854],[52,7837,58,7837],[52,7838,58,7838],[52,7839,58,7839],[52,7840,58,7840],[52,7841,58,7841],[52,7842,58,7842],[52,7843,58,7843],[52,7844,58,7844],[52,7845,58,7845],[52,7828,58,7828],[52,7829,58,7829],[52,7830,58,7830],[52,7831,58,7831],[52,7832,58,7832],[52,7833,58,7833],[52,7834,58,7834],[52,7835,58,7835],[52,7836,58,7836],[52,7819,58,7819],[52,7820,58,7820],[52,7821,58,7821],[52,7822,58,7822],[52,7823,58,7823],[52,7824,58,7824],[52,7825,58,7825],[52,7826,58,7826],[52,7827,58,7827],[52,7810,58,7810],[52,7811,58,7811],[52,7812,58,7812],[52,7813,58,7813],[52,7814,58,7814],[52,7815,58,7815],[52,7816,58,7816],[52,7817,58,7817],[52,7818,58,7818],[52,7801,58,7801],[52,7802,58,7802],[52,7803,58,7803],[52,7804,58,7804],[52,7805,58,7805],[52,7806,58,7806],[52,7807,58,7807],[52,7808,58,7808],[52,7809,58,7809],[52,7792,58,7792],[52,7793,58,7793],[52,7794,58,7794],[52,7795,58,7795],[52,7796,58,7796],[52,7797,58,7797],[52,7798,58,7798],[52,7799,58,7799],[52,7800,58,7800],[52,7783,58,7783],[52,7784,58,7784],[52,7785,58,7785],[52,7786,58,7786],[52,7787,58,7787],[52,7788,58,7788],[52,7789,58,7789],[52,7790,58,7790],[52,7791,58,7791],[52,7774,58,7774],[52,7775,58,7775],[52,7776,58,7776],[52,7777,58,7777],[52,7778,58,7778],[52,7779,58,7779],[52,7780,58,7780],[52,7781,58,7781],[52,7782,58,7782],[52,7765,58,7765],[52,7766,58,7766],[52,7767,58,7767],[52,7768,58,7768],[52,7769,58,7769],[52,7770,58,7770],[52,7771,58,7771],[52,7772,58,7772],[52,7773,58,7773],[52,7756,58,7756],[52,7757,58,7757],[52,7758,58,7758],[52,7759,58,7759],[52,7760,58,7760],[52,7761,58,7761],[52,7762,58,7762],[52,7763,58,7763],[52,7764,58,7764],[52,7747,58,7747],[52,7748,58,7748],[52,7749,58,7749],[52,7750,58,7750],[52,7751,58,7751],[52,7752,58,7752],[52,7753,58,7753],[52,7754,58,7754],[52,7755,58,7755],[52,7738,58,7738],[52,7739,58,7739],[52,7740,58,7740],[52,7741,58,7741],[52,7742,58,7742],[52,7743,58,7743],[52,7744,58,7744],[52,7745,58,7745],[52,7746,58,7746],[52,7729,58,7729],[52,7730,58,7730],[52,7731,58,7731],[52,7732,58,7732],[52,7733,58,7733],[52,7734,58,7734],[52,7735,58,7735],[52,7736,58,7736],[52,7737,58,7737],[52,7720,58,7720],[52,7721,58,7721],[52,7722,58,7722],[52,7723,58,7723],[52,7724,58,7724],[52,7725,58,7725],[52,7726,58,7726],[52,7727,58,7727],[52,7728,58,7728],[52,7711,58,7711],[52,7712,58,7712],[52,7713,58,7713],[52,7714,58,7714],[52,7715,58,7715],[52,7716,58,7716],[52,7717,58,7717],[52,7718,58,7718],[52,7719,58,7719],[52,7702,58,7702],[52,7703,58,7703],[52,7704,58,7704],[52,7705,58,7705],[52,7706,58,7706],[52,7707,58,7707],[52,7708,58,7708],[52,7709,58,7709],[52,7710,58,7710],[52,7693,58,7693],[52,7694,58,7694],[52,7695,58,7695],[52,7696,58,7696],[52,7697,58,7697],[52,7698,58,7698],[52,7699,58,7699],[52,7700,58,7700],[52,7701,58,7701],[52,7684,58,7684],[52,7685,58,7685],[52,7686,58,7686],[52,7687,58,7687],[52,7688,58,7688],[52,7689,58,7689],[52,7690,58,7690],[52,7691,58,7691],[52,7692,58,7692],[52,7675,58,7675],[52,7676,58,7676],[52,7677,58,7677],[52,7678,58,7678],[52,7679,58,7679],[52,7680,58,7680],[52,7681,58,7681],[52,7682,58,7682],[52,7683,58,7683],[52,7666,58,7666],[52,7667,58,7667],[52,7668,58,7668],[52,7669,58,7669],[52,7670,58,7670],[52,7671,58,7671],[52,7672,58,7672],[52,7673,58,7673],[52,7674,58,7674],[52,7657,58,7657],[52,7658,58,7658],[52,7659,58,7659],[52,7660,58,7660],[52,7661,58,7661],[52,7662,58,7662],[52,7663,58,7663],[52,7664,58,7664],[52,7665,58,7665],[52,7648,58,7648],[52,7649,58,7649],[52,7650,58,7650],[52,7651,58,7651],[52,7652,58,7652],[52,7653,58,7653],[52,7654,58,7654],[52,7655,58,7655],[52,7656,58,7656],[52,7639,58,7639],[52,7640,58,7640],[52,7641,58,7641],[52,7642,58,7642],[52,7643,58,7643],[52,7644,58,7644],[52,7645,58,7645],[52,7646,58,7646],[52,7647,58,7647],[52,7630,58,7630],[52,7631,58,7631],[52,7632,58,7632],[52,7633,58,7633],[52,7634,58,7634],[52,7635,58,7635],[52,7636,58,7636],[52,7637,58,7637],[52,7638,58,7638],[52,7621,58,7621],[52,7622,58,7622],[52,7623,58,7623],[52,7624,58,7624],[52,7625,58,7625],[52,7626,58,7626],[52,7627,58,7627],[52,7628,58,7628],[52,7629,58,7629],[52,7612,58,7612],[52,7613,58,7613],[52,7614,58,7614],[52,7615,58,7615],[52,7616,58,7616],[52,7617,58,7617],[52,7618,58,7618],[52,7619,58,7619],[52,7620,58,7620],[52,7603,58,7603],[52,7604,58,7604],[52,7605,58,7605],[52,7606,58,7606],[52,7607,58,7607],[52,7608,58,7608],[52,7609,58,7609],[52,7610,58,7610],[52,7611,58,7611],[52,7594,58,7594],[52,7595,58,7595],[52,7596,58,7596],[52,7597,58,7597],[52,7598,58,7598],[52,7599,58,7599],[52,7600,58,7600],[52,7601,58,7601],[52,7602,58,7602],[52,7585,58,7585],[52,7586,58,7586],[52,7587,58,7587],[52,7588,58,7588],[52,7589,58,7589],[52,7590,58,7590],[52,7591,58,7591],[52,7592,58,7592],[52,7593,58,7593],[52,7576,58,7576],[52,7577,58,7577],[52,7578,58,7578],[52,7579,58,7579],[52,7580,58,7580],[52,7581,58,7581],[52,7582,58,7582],[52,7583,58,7583],[52,7584,58,7584],[52,7567,58,7567],[52,7568,58,7568],[52,7569,58,7569],[52,7570,58,7570],[52,7571,58,7571],[52,7572,58,7572],[52,7573,58,7573],[52,7574,58,7574],[52,7575,58,7575],[52,7558,58,7558],[52,7559,58,7559],[52,7560,58,7560],[52,7561,58,7561],[52,7562,58,7562],[52,7563,58,7563],[52,7564,58,7564],[52,7565,58,7565],[52,7566,58,7566],[52,7549,58,7549],[52,7550,58,7550],[52,7551,58,7551],[52,7552,58,7552],[52,7553,58,7553],[52,7554,58,7554],[52,7555,58,7555],[52,7556,58,7556],[52,7557,58,7557],[52,7540,58,7540],[52,7541,58,7541],[52,7542,58,7542],[52,7543,58,7543],[52,7544,58,7544],[52,7545,58,7545],[52,7546,58,7546],[52,7547,58,7547],[52,7548,58,7548],[52,7531,58,7531],[52,7532,58,7532],[52,7533,58,7533],[52,7534,58,7534],[52,7535,58,7535],[52,7536,58,7536],[52,7537,58,7537],[52,7538,58,7538],[52,7539,58,7539],[52,7522,58,7522],[52,7523,58,7523],[52,7524,58,7524],[52,7525,58,7525],[52,7526,58,7526],[52,7527,58,7527],[52,7528,58,7528],[52,7529,58,7529],[52,7530,58,7530],[52,7513,58,7513],[52,7514,58,7514],[52,7515,58,7515],[52,7516,58,7516],[52,7517,58,7517],[52,7518,58,7518],[52,7519,58,7519],[52,7520,58,7520],[52,7521,58,7521],[52,7504,58,7504],[52,7505,58,7505],[52,7506,58,7506],[52,7507,58,7507],[52,7508,58,7508],[52,7509,58,7509],[52,7510,58,7510],[52,7511,58,7511],[52,7512,58,7512],[52,7495,58,7495],[52,7496,58,7496],[52,7497,58,7497],[52,7498,58,7498],[52,7499,58,7499],[52,7500,58,7500],[52,7501,58,7501],[52,7502,58,7502],[52,7503,58,7503],[52,7486,58,7486],[52,7487,58,7487],[52,7488,58,7488],[52,7489,58,7489],[52,7490,58,7490],[52,7491,58,7491],[52,7492,58,7492],[52,7493,58,7493],[52,7494,58,7494],[52,7477,58,7477],[52,7478,58,7478],[52,7479,58,7479],[52,7480,58,7480],[52,7481,58,7481],[52,7482,58,7482],[52,7483,58,7483],[52,7484,58,7484],[52,7485,58,7485],[52,7468,58,7468],[52,7469,58,7469],[52,7470,58,7470],[52,7471,58,7471],[52,7472,58,7472],[52,7473,58,7473],[52,7474,58,7474],[52,7475,58,7475],[52,7476,58,7476],[52,7459,58,7459],[52,7460,58,7460],[52,7461,58,7461],[52,7462,58,7462],[52,7463,58,7463],[52,7464,58,7464],[52,7465,58,7465],[52,7466,58,7466],[52,7467,58,7467],[52,7450,58,7450],[52,7451,58,7451],[52,7452,58,7452],[52,7453,58,7453],[52,7454,58,7454],[52,7455,58,7455],[52,7456,58,7456],[52,7457,58,7457],[52,7458,58,7458],[52,7441,58,7441],[52,7442,58,7442],[52,7443,58,7443],[52,7444,58,7444],[52,7445,58,7445],[52,7446,58,7446],[52,7447,58,7447],[52,7448,58,7448],[52,7449,58,7449],[52,7432,58,7432],[52,7433,58,7433],[52,7434,58,7434],[52,7435,58,7435],[52,7436,58,7436],[52,7437,58,7437],[52,7438,58,7438],[52,7439,58,7439],[52,7440,58,7440],[52,7423,58,7423],[52,7424,58,7424],[52,7425,58,7425],[52,7426,58,7426],[52,7427,58,7427],[52,7428,58,7428],[52,7429,58,7429],[52,7430,58,7430],[52,7431,58,7431],[52,7414,58,7414],[52,7415,58,7415],[52,7416,58,7416],[52,7417,58,7417],[52,7418,58,7418],[52,7419,58,7419],[52,7420,58,7420],[52,7421,58,7421],[52,7422,58,7422],[52,7405,58,7405],[52,7406,58,7406],[52,7407,58,7407],[52,7408,58,7408],[52,7409,58,7409],[52,7410,58,7410],[52,7411,58,7411],[52,7412,58,7412],[52,7413,58,7413],[52,7396,58,7396],[52,7397,58,7397],[52,7398,58,7398],[52,7399,58,7399],[52,7400,58,7400],[52,7401,58,7401],[52,7402,58,7402],[52,7403,58,7403],[52,7404,58,7404],[52,7387,58,7387],[52,7388,58,7388],[52,7389,58,7389],[52,7390,58,7390],[52,7391,58,7391],[52,7392,58,7392],[52,7393,58,7393],[52,7394,58,7394],[52,7395,58,7395],[52,7378,58,7378],[52,7379,58,7379],[52,7380,58,7380],[52,7381,58,7381],[52,7382,58,7382],[52,7383,58,7383],[52,7384,58,7384],[52,7385,58,7385],[52,7386,58,7386],[52,7369,58,7369],[52,7370,58,7370],[52,7371,58,7371],[52,7372,58,7372],[52,7373,58,7373],[52,7374,58,7374],[52,7375,58,7375],[52,7376,58,7376],[52,7377,58,7377],[52,7360,58,7360],[52,7361,58,7361],[52,7362,58,7362],[52,7363,58,7363],[52,7364,58,7364],[52,7365,58,7365],[52,7366,58,7366],[52,7367,58,7367],[52,7368,58,7368],[52,7351,58,7351],[52,7352,58,7352],[52,7353,58,7353],[52,7354,58,7354],[52,7355,58,7355],[52,7356,58,7356],[52,7357,58,7357],[52,7358,58,7358],[52,7359,58,7359],[52,7342,58,7342],[52,7343,58,7343],[52,7344,58,7344],[52,7345,58,7345],[52,7346,58,7346],[52,7347,58,7347],[52,7348,58,7348],[52,7349,58,7349],[52,7350,58,7350],[52,7333,58,7333],[52,7334,58,7334],[52,7335,58,7335],[52,7336,58,7336],[52,7337,58,7337],[52,7338,58,7338],[52,7339,58,7339],[52,7340,58,7340],[52,7341,58,7341],[52,7324,58,7324],[52,7325,58,7325],[52,7326,58,7326],[52,7327,58,7327],[52,7328,58,7328],[52,7329,58,7329],[52,7330,58,7330],[52,7331,58,7331],[52,7332,58,7332],[52,7315,58,7315],[52,7316,58,7316],[52,7317,58,7317],[52,7318,58,7318],[52,7319,58,7319],[52,7320,58,7320],[52,7321,58,7321],[52,7322,58,7322],[52,7323,58,7323],[52,7306,58,7306],[52,7307,58,7307],[52,7308,58,7308],[52,7309,58,7309],[52,7310,58,7310],[52,7311,58,7311],[52,7312,58,7312],[52,7313,58,7313],[52,7314,58,7314],[52,7297,58,7297],[52,7298,58,7298],[52,7299,58,7299],[52,7300,58,7300],[52,7301,58,7301],[52,7302,58,7302],[52,7303,58,7303],[52,7304,58,7304],[52,7305,58,7305],[52,7288,58,7288],[52,7289,58,7289],[52,7290,58,7290],[52,7291,58,7291],[52,7292,58,7292],[52,7293,58,7293],[52,7294,58,7294],[52,7295,58,7295],[52,7296,58,7296],[52,7279,58,7279],[52,7280,58,7280],[52,7281,58,7281],[52,7282,58,7282],[52,7283,58,7283],[52,7284,58,7284],[52,7285,58,7285],[52,7286,58,7286],[52,7287,58,7287],[52,7270,58,7270],[52,7271,58,7271],[52,7272,58,7272],[52,7273,58,7273],[52,7274,58,7274],[52,7275,58,7275],[52,7276,58,7276],[52,7277,58,7277],[52,7278,58,7278],[52,7261,58,7261],[52,7262,58,7262],[52,7263,58,7263],[52,7264,58,7264],[52,7265,58,7265],[52,7266,58,7266],[52,7267,58,7267],[52,7268,58,7268],[52,7269,58,7269],[52,7252,58,7252],[52,7253,58,7253],[52,7254,58,7254],[52,7255,58,7255],[52,7256,58,7256],[52,7257,58,7257],[52,7258,58,7258],[52,7259,58,7259],[52,7260,58,7260],[52,7243,58,7243],[52,7244,58,7244],[52,7245,58,7245],[52,7246,58,7246],[52,7247,58,7247],[52,7248,58,7248],[52,7249,58,7249],[52,7250,58,7250],[52,7251,58,7251],[52,7234,58,7234],[52,7235,58,7235],[52,7236,58,7236],[52,7237,58,7237],[52,7238,58,7238],[52,7239,58,7239],[52,7240,58,7240],[52,7241,58,7241],[52,7242,58,7242],[52,7225,58,7225],[52,7226,58,7226],[52,7227,58,7227],[52,7228,58,7228],[52,7229,58,7229],[52,7230,58,7230],[52,7231,58,7231],[52,7232,58,7232],[52,7233,58,7233],[52,7216,58,7216],[52,7217,58,7217],[52,7218,58,7218],[52,7219,58,7219],[52,7220,58,7220],[52,7221,58,7221],[52,7222,58,7222],[52,7223,58,7223],[52,7224,58,7224],[52,7207,58,7207],[52,7208,58,7208],[52,7209,58,7209],[52,7210,58,7210],[52,7211,58,7211],[52,7212,58,7212],[52,7213,58,7213],[52,7214,58,7214],[52,7215,58,7215],[52,7198,58,7198],[52,7199,58,7199],[52,7200,58,7200],[52,7201,58,7201],[52,7202,58,7202],[52,7203,58,7203],[52,7204,58,7204],[52,7205,58,7205],[52,7206,58,7206],[52,7189,58,7189],[52,7190,58,7190],[52,7191,58,7191],[52,7192,58,7192],[52,7193,58,7193],[52,7194,58,7194],[52,7195,58,7195]],"merged_total":8629,"flags":["merged_cut"]}
[null,{"$f":"(LOOKUP(dms_Model,dms_Model_List,dms_Worksheet_List))","v":"REGULATORY REPORTING STATEMENT"}]
[null,{"$f":"INDEX(dms_TradingNameFull_List,MATCH(dms_TradingName,dms_TradingName_List))","v":"ElectraNet"}]
[null,{"$f":"IF(SUM(dms_SingleYear_Model)>0,CRY,CONCATENATE(FRCP_y1,\" to \",dms_MultiYear_FinalYear_Result))","v":"2023-24 to 2027-28"}]
[null,"2.3 AUGEX PROJECTS"]
[]
[null,"There are TWO tables on this worksheet - each has been 'grouped' for easy navigation. Both ROWS and COLUMNS have been grouped.  See the Instructions sheet on how to group or ungroup tables. "]
[]
[null,"NOTE: TNSP MUST PROVIDE EXPENDITURE INFORMATION ON A PROJECT CLOSE BASIS."]
[null,"2.3.1 - AUGEX ASSET DATA - SUBSTATIONS"]
[null,"SUBSTATION AND PROJECT SUMMARY",null,null,null,null,null,null,null,null,null,"PLANT AND EQUIPMENT EXPENDITURE AND VOLUME",null,null,null,null,null,null,null,null,null,null,null,null,"OTHER EXPENDITURE",null,"TOTAL DIRECT EXPENDITURE ($0's)","YEARS INCURRED","RELATED PARTY CONTRACTS",null,"ALL NON RELATED PARTYCONTRACTS","LAND AND EASEMENTS",null,"Comments"]
[null,"SUBSTATION ID","SUBSTATION TYPE","PROJECT ID","PROJECT TYPE\n(drop down)","PROJECT TRIGGER\n(drop down)","VOLTAGE (KV)","SUBSTATION RATING\nNORMAL CYCLIC\n(MVA)",null,"SUBSTATION RATING\nN-1 EMERGENCY\n(MVA)",null,"TRANSFORMERS",null,null,null,"SWITCHGEAR",null,null,"REACTIVE PLANT",null,null,"OTHER PLANT ITEM","INSTALLATION (LABOUR)",null,"CIVIL WORKS","OTHER DIRECT",null,null,"RELATED PARTY MARGINS","TOTAL",null,"LAND PURCHASES","EASEMENTS"]
[null,null,null,null,null,null,null,"PRE","POST","PRE","POST","Units Added","MVA Added","OLTC INCLUDED?","Expenditure ($0's)","Insulation","Units Added","Expenditure\n($0's)","Plant Type","Units Added","Expenditure\n($0's)","Expenditure\n($0's)","Volume","Expenditure\n($0's)","Expenditure ($0's)",null,null,null,"Expenditure ($0's)",null,null,"Expenditure\n($0's)"]
["AUG231_1","City West H578","Terminal station",10161,"New Substation","Demand growth",275,0,600,0,300,2,600,"Yes",10094651.74798722,"Gas","6 275kV Circuit Breakers",3457332.7401838046,"Reactor",2,3301562.8035381609,4922984.7383051608,1,1820763.2504712392,11470014.171855314,57996164.315015607,null,"2004, 2005, 2006, 2007, 2008, 2009, 2010, 2011, 2012, 2013, 2014, 2015, 2016, 2017, 2018, 2019, 2020, 2021, 2022",null,null,null,7802446.2327363743]
["AUG231_2",null,null,null,null,null,null,null,null,null,null,null,null,null,null,"Gas","11 275kV Disconnectors with ES",1221717.5437565262,null,null,null,339708.90337916644,1]
["AUG231_3",null,null,null,null,null,null,null,null,null,null,null,null,null,null,"Gas","2  66kV Circuit Breaker",353331.80751328997,null,null,null,222970.10045237408,12]
["AUG231_4",null,null,null,null,null,null,null,null,null,null,null,null,null,null,"Gas","2 66kV Disconnector with ES",112619.13135030227,null,null,null,29225.226243670939,6]
["AUG231_5"]
["AUG231_6"]
[null,"Project Totals",null,null,null,null,null,null,null,null,null,{"$f":"SUM(L13:L18)","v":2},{"$f":"SUM(M13:M18)","v":600},null,{"$f":"SUM(O13:O18)","v":10094651.74798722},null,{"$f":"SUM(Q13:Q18)","v":0},{"$f":"SUM(R13:R18)","v":5145001.2228039233},null,{"$f":"SUM(T13:T18)","v":2},3301562.8035381609,5514888.968380372,20,1820763.2504712392,11470014.171855314,57996164.315015607,{"$f":"O19+R19+U19+V19+SUM(X19:Z19)","v":95343046.480051845},null,{"$f":"SUM(AC13:AC18)","v":0},{"$f":"SUM(AD13:AD18)","v":0},{"$f":"SUM(AE13:AE18)","v":0},{"$f":"SUM(AF13:AF18)","v":7802446.2327363743},{"$f":"SUM(AG13:AG18)","v":0}]
["AUG231_1","Torrens Island B Substation H254","Switching station",10161,"New Substation","Demand growth",275,0,0,0,0,0,0,"No",0,"Air","1 275kV Circuit Breaker",120216.39842296258,null,null,null,null,null,223168.92874549088,null,762015.44941394811,null,"2004, 2005, 2006, 2007, 2008, 2009, 2010, 2011"]
["AUG231_2",null,null,null,null,null,null,null,null,null,null,null,null,null,null,"Air","4 275kV Disconnectors with ES",147317.83455480632]
["AUG231_3"]
["AUG231_4"]
["AUG231_5"]
["AUG231_6"]
[null,"Project Totals",null,null,null,null,null,null,null,null,null,{"$f":"SUM(L20:L25)","v":0},0,null,{"$f":"SUM(O20:O25)","v":0},null,{"$f":"SUM(Q20:Q25)","v":0},267534.23297776887,null,{"$f":"SUM(T20:T25)","v":0},0,0,0,223168.92874549088,0,762015.44941394811,{"$f":"O26+R26+U26+V26+SUM(X26:Z26)","v":1252718.6111372078},null,{"$f":"SUM(AC20:AC25)","v":0},0,0,0,0]
["AUG231_1","Black Range H576","Switching station",10344,"New Substation Establishment","Net market benefit",275,0,0,0,0,0,0,"No",null,"Air","2 275kV Circuit Breakers",325388.20058576041,"Capacitor",2,2315891.1699564988,37022.588031697196,null,2027930.8125221641,1637534.6250429549,34011516.570276387,null,"2012, 2013, 2014, 2015, 2016, 2017, 2018, 2019, 2020, 2021, 2022",null,null,null,237357.30444246763]
["AUG231_2",null,null,null,null,null,null,null,null,null,null,null,null,null,null,"Air","6 275kV Disconnectors with ES",179876.28415824421,null,null,null,57467.708822000255]
["AUG231_3"]
["AUG231_4"]
["AUG231_5"]
["AUG231_6"]
[null,"Project Totals",null,null,null,null,null,null,null,null,null,{"$f":"SUM(L27:L32)","v":0},0,null,{"$f":"SUM(O27:O32)","v":0},null,{"$f":"SUM(Q27:Q32)","v":0},505264.48474400461,null,{"$f":"SUM(T27:T32)","v":2},2315891.1699564988,94490.296853697451,0,2027930.8125221641,1637534.6250429549,34011516.570276387,{"$f":"O33+R33+U33+V33+SUM(X33:Z33)","v":40592627.959395707},null,{"$f":"SUM(AC27:AC32)","v":0},0,0,237357.30444246763,0]
["AUG231_1","Project Energy Connect (Robertstown)","Terminal station",14171,"Capacity upgrade","Other",275,320,320,160,160,0,0,null,0,"Air","6 x 275kV Circuit Breakers",895395.71442905092,null,0,0,564790.56626916002,null,406148.48877725098,1509960.7596257909,5629208.5906735566,null,"2017, 2018, 2019, 2020, 2021, 2022, 2023, 2024, 2025"]
["AUG231_2",null,null,null,null,null,null,null,null,null,null,null,null,null,null,"Air","14 x 275kV Disconnectors with ES",500715.74995784101,null,null,null,94243.291567424996]
["AUG231_3",null,null,null,null,null,null,null,null,null,null,null,null,null,null,null,null,null,null,null,null,23120.808425450999]
["AUG231_4"]
["AUG231_5"]
["AUG231_6"]
[null,"Project Totals",null,null,null,null,null,null,null,null,null,{"$f":"SUM(L34:L39)","v":0},0,null,{"$f":"SUM(O34:O39)","v":0},null,{"$f":"SUM(Q34:Q39)","v":0},1396111.464386892,null,{"$f":"SUM(T34:T39)","v":0},0,682154.66626203607,0,406148.48877725098,1509960.7596257909,5629208.5906735566,{"$f":"O40+R40+U40+V40+SUM(X40:Z40)","v":9623583.9697255269},null,{"$f":"SUM(AC34:AC39)","v":0},0,0,0,0]
["AUG231_1","Project Energy Connect (Tungkillo)","Switching station",14171,"Capacity upgrade","Other",275,0,0,0,0,0,0,null,0,"Air","3 x 275kV Circuit Breakers",518138.94197339995,null,0,0,277041.81805145997,null,191329.018167078,679849.70212902594,2895994.1408844357,null,"2017, 2018, 2019, 2020, 2021, 2022, 2023, 2024, 2025"]
["AUG231_2",null,null,null,null,null,null,null,null,null,null,null,null,null,null,"Air","8 x 275kV Disconnectors with ES",271216.73818720802,null,null,null,94243.291567424996]
["AUG231_3",null,null,null,null,null,null,null,null,null,null,null,null,null,null,null,null,null,null,null,null,23120.808425450999]
["AUG231_4"]
["AUG231_5"]
["AUG231_6"]
[null,"Project Totals",null,null,null,null,null,null,null,null,null,{"$f":"SUM(L41:L46)","v":0},0,null,{"$f":"SUM(O41:O46)","v":0},null,{"$f":"SUM(Q41:Q46)","v":0},789355.68016060791,null,{"$f":"SUM(T41:T46)","v":0},0,394405.91804433597,0,191329.018167078,679849.70212902594,2895994.1408844357,{"$f":"O47+R47+U47+V47+SUM(X47:Z47)","v":4950934.4593854835},null,{"$f":"SUM(AC41:AC46)","v":0},0,0,0,0]
["AUG231_1","Project Energy Connect (Bundey)","Transmission substation",14171,"New substation establishment","Other",330,0,400,0,520,3,1200,null,12109984.140107699,"Air","10 x 330kV Circuit Breakers",1567588.0495374,"Reactor",3,5680727.5021893,1131875.4747168,null,987097.17227744695,23360568.245297611,72221487.056610644,null,"2017, 2018, 2019, 2020, 2021, 2022, 2023, 2024, 2025",null,null,null,553510.05055829999]
["AUG231_2",null,null,null,null,null,null,null,null,null,null,null,null,null,null,"Air","23 x 330kV Disconnectors with ES",1137630.449681154,"Capacitor",1,1185965.653769919,256775.12880821998]
["AUG231_3",null,null,null,null,null,null,null,null,null,null,null,null,null,null,"Air","9 x 275kV Circuit Breakers",1583096.1031511999,null,null,null,142651.29853253861]
["AUG231_4",null,null,null,null,null,null,null,null,null,null,null,null,null,null,"Air","2 x 33kV Disconnectors with ES",18931.509558818998,null,null,null,847185.84940373991]
["AUG231_5",null,null,null,null,null,null,null,null,null,null,null,null,null,null,"Air","23 x 275kV Disconnectors with ES",791817.84922066191,null,null,null,358012.97743365]
["AUG231_6",null,null,null,null,null,null,null,null,null,null,null,null,null,null,null,null,null,null,null,null,87035.233223367002]
[null,"Project Totals",null,null,null,null,null,null,null,null,null,{"$f":"SUM(L48:L53)","v":3},1200,null,{"$f":"SUM(O48:O53)","v":12109984.140107699},null,{"$f":"SUM(Q48:Q53)","v":0},5099063.9611492343,null,{"$f":"SUM(T48:T53)","v":4},6866693.1559592187,2823535.962118315,0,987097.17227744695,{"$f":"SUM(Y48:Y53)","v":23360568.245297611},72221487.056610644,{"$f":"O54+R54+U54+V54+SUM(X54:Z54)","v":123468429.69352017},null,{"$f":"SUM(AC48:AC53)","v":0},0,0,553510.05055829999,0]
["AUG231_1","<Enter substation ID>",null,null,null,null,""]
["AUG231_2"]
["AUG231_3"]
["AUG231_4"]
["AUG231_5"]
["AUG231_6"]
[null,"Project Totals",null,null,null,null,null,null,null,null,null,{"$f":"SUM(L55:L60)","v":0},0,null,{"$f":"SUM(O55:O60)","v":0},null,{"$f":"SUM(Q55:Q60)","v":0},0,null,{"$f":"SUM(T55:T60)","v":0},0,0,0,0,0,0,{"$f":"O61+R61+U61+V61+SUM(X61:Z61)","v":0},null,{"$f":"SUM(AC55:AC60)","v":0},0,0,0,0]
["AUG231_1","<Enter substation ID>",null,null,null,null,""]
["AUG231_2"]
["AUG231_3"]
["AUG231_4"]
["AUG231_5"]
["AUG231_6"]
[null,"Project Totals",null,null,null,null,null,null,null,null,null,{"$f":"SUM(L62:L67)","v":0},0,null,{"$f":"SUM(O62:O67)","v":0},null,{"$f":"SUM(Q62:Q67)","v":0},0,null,{"$f":"SUM(T62:T67)","v":0},0,0,0,0,0,0,{"$f":"O68+R68+U68+V68+SUM(X68:Z68)","v":0},null,{"$f":"SUM(AC62:AC67)","v":0},0,0,0,0]
["AUG231_1","<Enter substation ID>",null,null,null,null,""]
["AUG231_2"]
["AUG231_3"]
["AUG231_4"]
["AUG231_5"]
["AUG231_6"]
[null,"Project Totals",null,null,null,null,null,null,null,null,null,{"$f":"SUM(L69:L74)","v":0},0,null,{"$f":"SUM(O69:O74)","v":0},null,{"$f":"SUM(Q69:Q74)","v":0},0,null,{"$f":"SUM(T69:T74)","v":0},0,0,0,0,0,0,{"$f":"O75+R75+U75+V75+SUM(X75:Z75)","v":0},null,{"$f":"SUM(AC69:AC74)","v":0},0,0,0,0]
["AUG231_1","<Enter substation ID>",null,null,null,null,""]
["AUG231_2"]
["AUG231_3"]
["AUG231_4"]
["AUG231_5"]
["AUG231_6"]
[null,"Project Totals",null,null,null,null,null,null,null,null,null,{"$f":"SUM(L76:L81)","v":0},0,null,{"$f":"SUM(O76:O81)","v":0},null,{"$f":"SUM(Q76:Q81)","v":0},0,null,{"$f":"SUM(T76:T81)","v":0},0,0,0,0,0,0,{"$f":"O82+R82+U82+V82+SUM(X82:Z82)","v":0},null,{"$f":"SUM(AC76:AC81)","v":0},0,0,0,0]
["AUG231_1","<Enter substation ID>",null,null,null,null,""]
["AUG231_2"]
["AUG231_3"]
["AUG231_4"]
["AUG231_5"]
["AUG231_6"]
[null,"Project Totals",null,null,null,null,null,null,null,null,null,{"$f":"SUM(L83:L88)","v":0},0,null,{"$f":"SUM(O83:O88)","v":0},null,{"$f":"SUM(Q83:Q88)","v":0},0,null,{"$f":"SUM(T83:T88)","v":0},0,0,0,0,0,0,{"$f":"O89+R89+U89+V89+SUM(X89:Z89)","v":0},null,{"$f":"SUM(AC83:AC88)","v":0},0,0,0,0]
["AUG231_1","<Enter substation ID>",null,null,null,null,""]
["AUG231_2"]
["AUG231_3"]
["AUG231_4"]
["AUG231_5"]
["AUG231_6"]
[null,"Project Totals",null,null,null,null,null,null,null,null,null,{"$f":"SUM(L90:L95)","v":0},0,null,{"$f":"SUM(O90:O95)","v":0},null,{"$f":"SUM(Q90:Q95)","v":0},0,null,{"$f":"SUM(T90:T95)","v":0},0,0,0,0,0,0,{"$f":"O96+R96+U96+V96+SUM(X96:Z96)","v":0},null,{"$f":"SUM(AC90:AC95)","v":0},0,0,0,0]
["AUG231_1","<Enter substation ID>",null,null,null,null,""]
["AUG231_2"]
["AUG231_3"]
["AUG231_4"]
["AUG231_5"]
["AUG231_6"]
[null,"Project Totals",null,null,null,null,null,null,null,null,null,{"$f":"SUM(L97:L102)","v":0},0,null,{"$f":"SUM(O97:O102)","v":0},null,{"$f":"SUM(Q97:Q102)","v":0},0,null,{"$f":"SUM(T97:T102)","v":0},0,0,0,0,0,0,{"$f":"O103+R103+U103+V103+SUM(X103:Z103)","v":0},null,{"$f":"SUM(AC97:AC102)","v":0},0,0,0,0]
["AUG231_1","<Enter substation ID>",null,null,null,null,""]
["AUG231_2"]
["AUG231_3"]
["AUG231_4"]
["AUG231_5"]
["AUG231_6"]
[null,"Project Totals",null,null,null,null,null,null,null,null,null,{"$f":"SUM(L104:L109)","v":0},0,null,{"$f":"SUM(O104:O109)","v":0},null,{"$f":"SUM(Q104:Q109)","v":0},0,null,{"$f":"SUM(T104:T109)","v":0},0,0,0,0,0,0,{"$f":"O110+R110+U110+V110+SUM(X110:Z110)","v":0},null,{"$f":"SUM(AC104:AC109)","v":0},0,0,0,0]
["AUG231_1","<Enter substation ID>",null,null,null,null,""]
["AUG231_2"]
["AUG231_3"]
["AUG231_4"]
["AUG231_5"]
["AUG231_6"]
[null,"Project Totals",null,null,null,null,null,null,null,null,null,{"$f":"SUM(L111:L116)","v":0},0,null,{"$f":"SUM(O111:O116)","v":0},null,{"$f":"SUM(Q111:Q116)","v":0},0,null,{"$f":"SUM(T111:T116)","v":0},0,0,0,0,0,0,{"$f":"O117+R117+U117+V117+SUM(X117:Z117)","v":0},null,{"$f":"SUM(AC111:AC116)","v":0},0,0,0,0]
["AUG231_1000",null,null,"Non material projects",null,null,null,null,null,null,null,null,null,null,null,null,null,null,null,null,null,null,null,null,null,null,41506640.927414373]
[]
[]
[null,"NOTE: TNSP MUST PROVIDE EXPENDITURE INFORMATION ON A PROJECT CLOSE BASIS."]
[null,"2.3.2 - AUGEX ASSET DATA - LINES"]
[null,"LINE AND PROJECT SUMMARY",null,null,null,null,null,"PLANT AND EQUIPMENT EXPENDITURE AND VOLUME",null,null,null,null,null,null,null,null,null,null,null,null,null,"OTHER EXPENDITURE",null,"TOTAL DIRECT EXPENDITURE ($0's)","YEARS INCURRED","ALL RELATED PARTY CONTRACTS",null,"ALL NON RELATED PARTYCONTRACTS","LAND AND EASEMENTS",null,"Comments"]
[null,"LINE ID","PROJECT ID","PROJECT TYPE\n(drop down)","PROJECT TRIGGER\n(drop down)","VOLTAGE (KV)","ROUTE LINE LENGTH ADDED","TOWERS/POLES (INCLUDING STRUCTURES, AND CIVIL WORKS)",null,null,null,"LINES AND CABLES",null,null,null,null,null,null,"OTHER PLANT ITEM\n\nExpenditure ($0's)","INSTALLATION (LABOUR)",null,"CIVIL WORKS","OTHER DIRECT",null,null,"RELATED PARTY MARGINS","TOTAL",null,"LAND PURCHASES","EASEMENTS"]
[null,null,null,null,null,null,null,null,null,null,null,"Type","Rating (MVA)",null,"N-1 Emergency Rating (MVA)",null,"Circuit KM Added","Expenditure\n($0's)"]
["AUG232_1",null,null,null,null,null,"KM ADDED","Configuration","Towers/Poles Added","Towers/Poles Upgraded","Expenditure\n($0's)",null,"PRE","POST","PRE","POST",null,null,null,"Volume","Expenditure\n($0's)","Expenditure ($0's)",null,null,null,"Expenditure ($0's)",null,null,"Expenditure\n($0's)"]
["AUG232_2","F1949 TIPS - CITY WEST CABLE",10161,"New line on new route - single circuit","Demand growth",275,18.399999999999999,"Other",0,0,0,"Underground cable",0,750,0,0,18.399999999999999,88409521.033928439,0,null,21999269.007459093,null,4996678.2562926672,null,"2004, 2005, 2006, 2007, 2008, 2009, 2010, 2011, 2012, 2013, 2014, 2015, 2016, 2017, 2018, 2019, 2020, 2021, 2022",null,null,null,379926.67474547308,407746.37492014555]
["AUG232_3"]
["AUG232_4"]
["AUG232_5"]
["AUG232_6"]
["AUG232_7"]
[]
["AUG232_8","Project Totals",null,null,null,null,null,null,{"$f":"SUM(I127:I133)","v":0},{"$f":"SUM(J127:J133)","v":0},{"$f":"SUM(K127:K133)","v":0},null,null,null,null,null,{"$f":"SUM(Q127:Q133)","v":18.399999999999999},{"$f":"SUM(R127:R133)","v":88409521.033928439},{"$f":"SUM(S127:S132)","v":0},{"$f":"SUM(T127:T132)","v":0},{"$f":"SUM(U127:U133)","v":21999269.007459093},{"$f":"SUM(V127:V133)","v":0},{"$f":"SUM(W127:W133)","v":4996678.2562926672},{"$f":"K134+R134+S134+SUM(U134:W134)","v":115405468.2976802},null,{"$f":"SUM(Z127:Z133)","v":0},{"$f":"SUM(AA127:AA133)","v":0},{"$f":"SUM(AB127:AB133)","v":0},{"$f":"SUM(AC127:AC133)","v":379926.67474547308},{"$f":"SUM(AD127:AD133)","v":407746.37492014555}]
["AUG232_2","F1923 TAILEM BEND - SOUTH EAST No 1\nF1923 TAILEM BEND - SOUTH EAST No 2",10344,null,null,null,null,"Multiple circuit steel tower",0,0,0,"Overhead line",450,650,450,650,0,null,null,null,null,null,1630432.7259007385,null,"2012, 2013, 2014, 2015, 2016, 2017, 2018, 2019, 2020, 2021, 2022"]
["AUG232_3"]
["AUG232_4"]
["AUG232_5"]
["AUG232_6"]
["AUG232_7"]
[]
["AUG232_8","Project Totals",null,null,null,null,null,null,{"$f":"SUM(I135:I141)","v":0},0,0,null,null,null,null,null,{"$f":"SUM(Q135:Q141)","v":0},0,{"$f":"SUM(S135:S140)","v":0},0,{"$f":"SUM(U135:U141)","v":0},0,1630432.7259007385,{"$f":"K142+R142+S142+SUM(U142:W142)","v":1630432.7259007385},null,{"$f":"SUM(Z135:Z141)","v":0},0,0,0,0]
["AUG232_2","F1601/2 PROJECT ENERGY CONNECT",14171,"New line on new route - multiple circuit","Other",330,192.85,"Multiple circuit steel tower",358,0,55019500.228121415,"Overhead line",0,800,0,400,2314.1999999999998,15049619.616044275,null,null,32706524.372735959,7923842.118362016,172360592.67265293,null,"2017, 2018, 2019, 2020, 2021, 2022, 2023, 2024, 2025",null,null,null,null,1749087.5109824159]
["AUG232_3"]
["AUG232_4"]
["AUG232_5"]
["AUG232_6"]
["AUG232_7"]
[]
["AUG232_8","Project Totals",null,null,null,null,null,null,{"$f":"SUM(I143:I149)","v":358},0,55019500.228121415,null,null,null,null,null,{"$f":"SUM(Q143:Q149)","v":2314.1999999999998},15049619.616044275,{"$f":"SUM(S143:S148)","v":0},0,{"$f":"SUM(U143:U149)","v":32706524.372735959},7923842.118362016,172360592.67265293,{"$f":"K150+R150+S150+SUM(U150:W150)","v":283060079.00791657},null,{"$f":"SUM(Z143:Z149)","v":0},0,0,0,1749087.5109824159]
["AUG232_2","F1985/6 PROJECT ENERGY CONNECT",14171,"New line on new route - multiple circuit","Other",275,11.84,"Multiple circuit steel tower",26,0,3837717.4826662648,"Overhead line",0,800,0,400,142.07999999999998,1336942.9288729799,null,null,3007319.6323971897,439863.63465092401,13424326.847114667,null,"2017, 2018, 2019, 2020, 2021, 2022, 2023, 2024, 2025",null,null,null,null,615832.24437216902]
["AUG232_3"]
["AUG232_4"]
["AUG232_5"]
["AUG232_6"]
["AUG232_7"]
[]
["AUG232_8","Project Totals",null,null,null,null,null,null,{"$f":"SUM(I151:I157)","v":26},0,3837717.4826662648,null,null,null,null,null,{"$f":"SUM(Q151:Q157)","v":142.07999999999998},1336942.9288729799,{"$f":"SUM(S151:S156)","v":0},0,{"$f":"SUM(U151:U157)","v":3007319.6323971897},439863.63465092401,13424326.847114667,{"$f":"K158+R158+S158+SUM(U158:W158)","v":22046170.525702026},null,{"$f":"SUM(Z151:Z157)","v":0},0,0,0,615832.24437216902]
["AUG232_2","<Enter line ID>"]
["AUG232_3"]
["AUG232_4"]
["AUG232_5"]
["AUG232_6"]
["AUG232_7"]
[]
["AUG232_8","Project Totals",null,null,null,null,null,null,{"$f":"SUM(I159:I165)","v":0},0,0,null,null,null,null,null,{"$f":"SUM(Q159:Q165)","v":0},0,{"$f":"SUM(S159:S164)","v":0},0,{"$f":"SUM(U159:U165)","v":0},0,0,{"$f":"K166+R166+S166+SUM(U166:W166)","v":0},null,{"$f":"SUM(Z159:Z165)","v":0},0,0,0,0]
["AUG232_2","<Enter line ID>"]
["AUG232_3"]
["AUG232_4"]
["AUG232_5"]
["AUG232_6"]
["AUG232_7"]
[]
["AUG232_8","Project Totals",null,null,null,null,null,null,{"$f":"SUM(I167:I173)","v":0},0,0,null,null,null,null,null,{"$f":"SUM(Q167:Q173)","v":0},0,{"$f":"SUM(S167:S172)","v":0},0,{"$f":"SUM(U167:U173)","v":0},0,0,{"$f":"K174+R174+S174+SUM(U174:W174)","v":0},null,{"$f":"SUM(Z167:Z173)","v":0},0,0,0,0]
["AUG232_2","<Enter line ID>"]
["AUG232_3"]
["AUG232_4"]
["AUG232_5"]
["AUG232_6"]
["AUG232_7"]
[]
["AUG232_8","Project Totals",null,null,null,null,null,null,{"$f":"SUM(I175:I181)","v":0},0,0,null,null,null,null,null,{"$f":"SUM(Q175:Q181)","v":0},0,{"$f":"SUM(S175:S180)","v":0},0,{"$f":"SUM(U175:U181)","v":0},0,0,{"$f":"K182+R182+S182+SUM(U182:W182)","v":0},null,{"$f":"SUM(Z175:Z181)","v":0},0,0,0,0]
[null,null,"Non material projects",null,null,null,null,null,null,null,null,null,null,null,null,null,null,null,null,null,null,null,null,29867.045724806481]

{"sheet":"2.3 Augex (b)","index":11,"n_rows":14,"n_cols":9,"rows_kept":14,"cut":false,"hidden":false,"merged":[[5,1,5,3],[8,2,8,8]]}
[null,{"$f":"(LOOKUP(dms_Model,dms_Model_List,dms_Worksheet_List))","v":"REGULATORY REPORTING STATEMENT"}]
[null,{"$f":"INDEX(dms_TradingNameFull_List,MATCH(dms_TradingName,dms_TradingName_List))","v":"ElectraNet"}]
[null,{"$f":"IF(SUM(dms_SingleYear_Model)>0,CRY,CONCATENATE(FRCP_y1,\" to \",dms_MultiYear_FinalYear_Result))","v":"2023-24 to 2027-28"}]
[null,"2.3 AUGEX PROJECTS"]
[]
[null,"There is ONE table on this worksheet."]
[]
[null,"2.3.4 - AUGEX - TOTAL EXPENDITURE"]
[null,null,{"$f":"CONCATENATE(\"EXPENDITURE\nForecast ($0's. real \",dms_DollarReal,\")\")","v":"EXPENDITURE\nForecast ($0's. real June 2023)"}]
[null,"As incurred",{"$f":"dms_y1","v":"2021-22"},{"$f":"dms_y2","v":"2022-23"},{"$f":"dms_y3","v":"2023-24"},{"$f":"dms_y4","v":"2024-25"},{"$f":"dms_y5","v":"2025-26"},{"$f":"dms_y6","v":"2026-27"},{"$f":"dms_y7","v":"2027-28"}]
[null,"Substations",43136138.476853438,80672302.700699821,12274591.086887754,5855323.4632668039,0,0,0]
[null,"Lines",78506358.6782787,171954013.98821408,27230731.028590284,12989820.775694743,0,0,0]
[null,"Other assets",38617.501433286132,210234.74818846089,0,0,0,0,0]
[null,"Total ",{"$f":"SUM(C11:C13)","v":121681114.65656543},252836551.43710235,39505322.115478039,18845144.238961548,0,0,0]

{"sheet":"2.5 Connections","index":12,"n_rows":92,"n_cols":9,"rows_kept":92,"cut":false,"hidden":false,"merged":[[8,2,8,8]]}
[null,{"$f":"(LOOKUP(dms_Model,dms_Model_List,dms_Worksheet_List))","v":"REGULATORY REPORTING STATEMENT"}]
[null,{"$f":"INDEX(dms_TradingNameFull_List,MATCH(dms_TradingName,dms_TradingName_List))","v":"ElectraNet"}]
[null,{"$f":"IF(SUM(dms_SingleYear_Model)>0,CRY,CONCATENATE(FRCP_y1,\" to \",dms_MultiYear_FinalYear_Result))","v":"2023-24 to 2027-28"}]
[null,"2.5 CONNECTIONS EXPENDITURE"]
[]
[null,"There are TWO tables on this worksheet. Each has been grouped (or sub-grouped).  See the Instructions sheet on how to group or ungroup data."]
[]
[null,"2.5.1 - EXPENDITURE ON CONNECTION PROJECTS"]
[null,null,{"$f":"CONCATENATE(\"EXPENDITURE\nForecast \n($0's. real \",dms_DollarReal,\")\")","v":"EXPENDITURE\nForecast \n($0's. real June 2023)"}]
[null,null,{"$f":"dms_y1","v":"2021-22"},{"$f":"dms_y2","v":"2022-23"},{"$f":"dms_y3","v":"2023-24"},{"$f":"dms_y4","v":"2024-25"},{"$f":"dms_y5","v":"2025-26"},{"$f":"dms_y6","v":"2026-27"},{"$f":"dms_y7","v":"2027-28"}]
[null,"DIRECT MATERIALS EXPENDITURE"]
[null,"<Enter project description here…>"]
[]
[]
[]
[]
[]
[]
[]
[]
[]
[]
[]
[]
[]
[]
[]
[]
[]
[]
[]
[]
[]
[]
[]
[]
[null,"DIRECT LABOUR EXPENDITURE"]
[null,{"$f":"IF(ISBLANK(B12),\"\",B12)","v":"<Enter project description here…>"}]
[null,""]
[null,""]
[null,""]
[null,""]
[null,""]
[null,""]
[null,""]
[null,""]
[null,""]
[null,""]
[null,""]
[null,""]
[null,""]
[null,""]
[null,""]
[null,""]
[null,""]
[null,""]
[null,""]
[null,""]
[null,""]
[null,""]
[null,""]
[null,""]
[]
[]
[]
[null,"2.5.2 - DESCRIPTION OF CONNECTION PROJECTS"]
[null,null,"CONNECTION RATING \n(MVA)","CONNECTION \nVOLTAGE \n(KV)","UNDERGROUND / OVERHEAD\n(drop down)","YEAR CONNECTION PROJECT COMPLETED "]
[null,{"$f":"IF(ISBLANK(B12),\"\",B12)","v":"<Enter project description here…>"}]
[null,""]
[null,""]
[null,""]
[null,""]
[null,""]
[null,""]
[null,""]
[null,""]
[null,""]
[null,""]
[null,""]
[null,""]
[null,""]
[null,""]
[null,""]
[null,""]
[null,""]
[null,""]
[null,""]
[null,""]
[null,""]
[null,""]
[null,""]
[null,""]

{"sheet":"2.6 Non-network","index":13,"n_rows":110,"n_cols":11,"rows_kept":110,"cut":false,"hidden":false,"merged":[[107,1,107,3],[108,1,108,3],[109,1,109,3],[101,1,101,3],[103,1,103,3],[104,1,104,3],[105,1,105,3],[102,1,102,3],[96,1,96,3],[97,1,97,3],[98,1,98,3],[99,1,99,3],[100,1,100,3],[57,1,57,3],[58,1,58,3],[59,1,59,3],[62,4,62,10],[93,4,93,10],[5,1,5,2],[8,4,8,10],[19,1,29,1],[39,1,49,1],[55,4,55,10]]}
[null,{"$f":"(LOOKUP(dms_Model,dms_Model_List,dms_Worksheet_List))","v":"REGULATORY REPORTING STATEMENT"}]
[null,{"$f":"INDEX(dms_TradingNameFull_List,MATCH(dms_TradingName,dms_TradingName_List))","v":"ElectraNet"}]
[null,{"$f":"IF(SUM(dms_SingleYear_Model)>0,CRY,CONCATENATE(FRCP_y1,\" to \",dms_MultiYear_FinalYear_Result))","v":"2023-24 to 2027-28"}]
[null,"2.6 NON NETWORK EXPENDITURE"]
[]
[null,"There are THREE tables on this worksheet - each has been 'grouped' for easy navigation. See the Instructions sheet on how to group or ungroup tables. "]
[]
[null,"2.6.1 - NON-NETWORK EXPENDITURE"]
[null,null,null,null,{"$f":"CONCATENATE(\"EXPENDITURE\nForecast \n($0's. real \",dms_DollarReal,\")\")","v":"EXPENDITURE\nForecast \n($0's. real June 2023)"}]
[null,"SERVICE SUBCATEGORY","ASSET CATEGORY",null,{"$f":"dms_y1","v":"2021-22"},{"$f":"dms_y2","v":"2022-23"},{"$f":"dms_y3","v":"2023-24"},{"$f":"dms_y4","v":"2024-25"},{"$f":"dms_y5","v":"2025-26"},{"$f":"dms_y6","v":"2026-27"},{"$f":"dms_y7","v":"2027-28"}]
[null,"OPEX"]
[null,"IT & COMMUNICATIONS","Total IT and communications",null,9686258,9863742,16496326,16831416,16850599,16853332,16849821]
[null,"MOTOR VEHICLES","Car",null,184897,188285,202367,222722,251008,289675,342322]
[null,null,"Light commercial vehicle"]
[null,null,"Elevated work platform (LCV)  "]
[null,null,"Elevated work platform (HCV)"]
[null,null,"Heavy commercial vehicle"]
[null,"BUILDINGS AND PROPERTY","Total buildings and property expenditure",null,3361225,3422814,3678808,3753536,3757814,3758424,3757640]
[null,"OTHER","Other expenditure"]
[null,"OTHER - TNSP nominated"]
[]
[]
[]
[]
[]
[]
[]
[]
[]
[]
[null,"CAPEX"]
[null,"IT & COMMUNICATIONS","Total IT and communications",null,15713584,9077542,13203447,13313215,14012340,11663728,12549211]
[null,"MOTOR VEHICLES","Car",null,631539,144060,2064028,99893,100149,100307,100811]
[null,null,"Light commercial vehicle"]
[null,null,"Elevated work platform (LCV)  "]
[null,null,"Elevated work platform (HCV)"]
[null,null,"Heavy commercial vehicle"]
[null,"BUILDINGS AND PROPERTY","Total buildings and property expenditure",null,3656256,2389494,2755505,1219666,2255399,2195453,1833179]
[null,"OTHER","Other expenditure"]
[null,"OTHER - TNSP nominated"]
[]
[]
[]
[]
[]
[]
[]
[]
[]
[]
[]
[]
[]
[null,"2.6.3 - ANNUAL DESCRIPTOR METRICS"]
[null,"IT & COMMUNICATIONS"]
[null,null,null,null,"VOLUMES  (0's)"]
[null,null,null,null,{"$f":"dms_y1","v":"2021-22"},{"$f":"dms_y2","v":"2022-23"},{"$f":"dms_y3","v":"2023-24"},{"$f":"dms_y4","v":"2024-25"},{"$f":"dms_y5","v":"2025-26"},{"$f":"dms_y6","v":"2026-27"},{"$f":"dms_y7","v":"2027-28"}]
[null,"Employee numbers"]
[null,"User numbers"]
[null,"Number of devices"]
[]
[null,"MOTOR VEHICLES"]
[null,null,null,null,"VOLUMES  (0's or %)"]
[null,null,null,"Units",{"$f":"dms_y1","v":"2021-22"},{"$f":"dms_y2","v":"2022-23"},{"$f":"dms_y3","v":"2023-24"},{"$f":"dms_y4","v":"2024-25"},{"$f":"dms_y5","v":"2025-26"},{"$f":"dms_y6","v":"2026-27"},{"$f":"dms_y7","v":"2027-28"}]
[null,"CAR","Average kilometres travelled ","0's",23464,23464,23464,23464,23464,23464,23464]
[null,null,"Number purchased","0's",16,25,25,25,25,25,25]
[null,null,"Number leased","0's",17,18,18,12,9,9,9]
[null,null,"Number in fleet","0's",33,43,43,37,34,34,34]
[null,null,"Proportion of total fleet expenditure allocated as regulatory expenditure","%",0.82120000000000004,0.82120000000000004,0.82120000000000004,0.82120000000000004,0.82120000000000004,0.82120000000000004,0.82120000000000004]
[null,"LIGHT COMMERCIAL VEHICLE","Average kilometres travelled ","0's"]
[null,null,"Number purchased","0's"]
[null,null,"Number leased","0's"]
[null,null,"Number in fleet","0's"]
[null,null,"Proportion of total fleet expenditure allocated as regulatory expenditure","%"]
[null,"ELEVATED WORK PLATFORM (LCV) ","Average kilometres travelled ","0's"]
[null,null,"Number purchased","0's"]
[null,null,"Number leased","0's"]
[null,null,"Number in fleet","0's"]
[null,null,"Proportion of total fleet expenditure allocated as regulatory expenditure","%"]
[null,"ELEVATED WORK PLATFORM (HCV)","Average kilometres travelled ","0's"]
[null,null,"Number purchased","0's"]
[null,null,"Number leased","0's"]
[null,null,"Number in fleet","0's"]
[null,null,"Proportion of total fleet expenditure allocated as regulatory expenditure","%"]
[null,"HEAVY COMMERCIAL VEHICLE ","Average kilometres travelled ","0's"]
[null,null,"Number purchased","0's"]
[null,null,"Number leased","0's"]
[null,null,"Number in fleet","0's"]
[null,null,"Proportion of total fleet expenditure allocated as regulatory expenditure","%"]
[]
[]
[]
[null,"2.6.4 -  INFORMATION & COMMUNICATIONS TECHNOLOGY - CAPEX BY PURPOSE"]
[null,null,null,null,{"$f":"CONCATENATE(\"EXPENDITURE\nForecast \n($0's. real \",dms_DollarReal,\")\")","v":"EXPENDITURE\nForecast \n($0's. real June 2023)"}]
[null,null,null,null,{"$f":"dms_y1","v":"2021-22"},{"$f":"dms_y2","v":"2022-23"},{"$f":"dms_y3","v":"2023-24"},{"$f":"dms_y4","v":"2024-25"},{"$f":"dms_y5","v":"2025-26"},{"$f":"dms_y6","v":"2026-27"},{"$f":"dms_y7","v":"2027-28"}]
[null,"RECURRENT"]
[null,"Recurrent IT and Communications ",null,null,14385274,8344841,12600643,11112994,7965432,3563388,7339852]
[]
[]
[]
[]
[]
[]
[]
[]
[]
[null,"NON-RECURRENT"]
[null,"Maintaining existing services, functionalities, capability and/or market benefits",null,null,1241413,732701,602804,2200221,6046909,8100340,5209359]
[null,"Complying with new / altered regulatory obligations / requirements",null,null,86897,0,0,0,0,0,0]
[null,"New or expanded ICT capability, functions and services"]

{"sheet":"2.11 Labour","index":14,"n_rows":31,"n_cols":14,"rows_kept":31,"cut":false,"hidden":true,"merged":[[23,2,23,6],[23,7,23,13],[22,2,22,13],[5,1,5,2],[7,1,7,2],[11,2,11,13],[12,2,12,6],[12,7,12,13]]}
[null,{"$f":"(LOOKUP(dms_Model,dms_Model_List,dms_Worksheet_List))","v":"REGULATORY REPORTING STATEMENT"}]
[null,{"$f":"INDEX(dms_TradingNameFull_List,MATCH(dms_TradingName,dms_TradingName_List))","v":"ElectraNet"}]
[null,{"$f":"IF(SUM(dms_SingleYear_Model)>0,CRY,CONCATENATE(FRCP_y1,\" to \",dms_MultiYear_FinalYear_Result))","v":"2023-24 to 2027-28"}]
[null,"2.11 LABOUR"]
[]
[null,"There is ONE table on this worksheet. The table has been 'grouped' (and sub-grouped) for easy navigation.  See the Instructions sheet on how to group or ungroup data."]
[]
[null,"Table numbering in this template starts at 2.11.3.\n\nTables 2.11.1 & 2.11.2 appear in the Category Analysis RIN and are not required for this RIN."]
[]
[null,"2.11.3 - LABOUR / NON-LABOUR EXPENDITURE SPLIT"]
[null,"OPEX"]
[null,null,"EXPENDITURE"]
[null,null,"($0's, nominal)",null,null,null,null,{"$f":"CONCATENATE(\"($0's, real \", dms_DollarReal,\")\")","v":"($0's, real June 2023)"}]
[null,null,{"$f":"PRCP_y4","v":"2016-17"},{"$f":"PRCP_y5","v":"2017-18"},{"$f":"CRCP_y1","v":"2018-19"},{"$f":"CRCP_y2","v":"2019-20"},{"$f":"CRCP_y3","v":"2020-21"},{"$f":"dms_y1","v":"2021-22"},{"$f":"dms_y2","v":"2022-23"},{"$f":"dms_y3","v":"2023-24"},{"$f":"dms_y4","v":"2024-25"},{"$f":"dms_y5","v":"2025-26"},{"$f":"dms_y6","v":"2026-27"},{"$f":"dms_y7","v":"2027-28"}]
[null,"In-house labour expenditure"]
[null,"Labour expenditure outsourced to related parties"]
[null,"Labour expenditure outsourced to unrelated parties"]
[null,"Controllable non-labour expenditure"]
[null,"Uncontrollable non-labour expenditure"]
[null,"Total",{"$f":"SUM(C15:C19)","v":0},0,0,0,0,0,0,0,0,0,0,0]
[]
[null,"CAPEX"]
[null,null,"EXPENDITURE"]
[null,null,"($0's, nominal)",null,null,null,null,{"$f":"CONCATENATE(\"($0's, real \", dms_DollarReal,\")\")","v":"($0's, real June 2023)"}]
[null,null,{"$f":"PRCP_y4","v":"2016-17"},{"$f":"PRCP_y5","v":"2017-18"},{"$f":"CRCP_y1","v":"2018-19"},{"$f":"CRCP_y2","v":"2019-20"},{"$f":"CRCP_y3","v":"2020-21"},{"$f":"dms_y1","v":"2021-22"},{"$f":"dms_y2","v":"2022-23"},{"$f":"dms_y3","v":"2023-24"},{"$f":"dms_y4","v":"2024-25"},{"$f":"dms_y5","v":"2025-26"},{"$f":"dms_y6","v":"2026-27"},{"$f":"dms_y7","v":"2027-28"}]
[null,"In-house labour expenditure"]
[null,"Labour expenditure outsourced to related parties"]
[null,"Labour expenditure outsourced to unrelated parties"]
[null,"Controllable non-labour expenditure"]
[null,"Uncontrollable non-labour expenditure"]
[null,"Total",{"$f":"SUM(C26:C30)","v":0},0,0,0,0,0,0,0,0,0,0,0]

{"sheet":"2.10 Overheads","index":15,"n_rows":30,"n_cols":10,"rows_kept":30,"cut":false,"hidden":false,"merged":[[5,1,5,2],[8,3,8,9],[21,3,21,9]]}
[null,{"$f":"(LOOKUP(dms_Model,dms_Model_List,dms_Worksheet_List))","v":"REGULATORY REPORTING STATEMENT"}]
[null,{"$f":"INDEX(dms_TradingNameFull_List,MATCH(dms_TradingName,dms_TradingName_List))","v":"ElectraNet"}]
[null,{"$f":"IF(SUM(dms_SingleYear_Model)>0,CRY,CONCATENATE(FRCP_y1,\" to \",dms_MultiYear_FinalYear_Result))","v":"2023-24 to 2027-28"}]
[null,"2.10 OVERHEADS"]
[]
[null,"There are TWO tables on this worksheet. Each has been grouped (and sub-grouped)  for ease of navigation. See the Instructions sheet on how to group or ungroup tables. "]
[]
[null,"2.10.1 - NETWORK OVERHEADS EXPENDITURE"]
[null,null,null,{"$f":"CONCATENATE(\"EXPENDITURE\nForecast \n($0's. real \",dms_DollarReal,\")\")","v":"EXPENDITURE\nForecast \n($0's. real June 2023)"}]
[null,null,null,{"$f":"dms_y1","v":"2021-22"},{"$f":"dms_y2","v":"2022-23"},{"$f":"dms_y3","v":"2023-24"},{"$f":"dms_y4","v":"2024-25"},{"$f":"dms_y5","v":"2025-26"},{"$f":"dms_y6","v":"2026-27"},{"$f":"dms_y7","v":"2027-28"}]
[null,"OPEX"]
[null,"Prescribed Transmission Services","Total  ",29678112.701238506,34292070.619314298,31789472.256293304,39833262.292913079,40913213.432317466,40975037.113398463,40983845.690520033]
[null,"CAPEX"]
[null,"Prescribed Transmission Services","Total  ",9107632.7219226938,7322514.9049573038,4089908.8459162177,4635643.5600560065,4589519.7453903342,4925634.8143059555,4325817.4088517521]
[null,"OTHER TRANSMISSION SERVICES"]
[null,"Negotiated Services","Total  "]
[null,"Unregulated Services","Total  ",5278567.16,5973705.5594399143,5500791.3139306894,7885662.1113895774,8072534.8533845041,8083232.7084839465,8084756.9283303078]
[]
[]
[]
[null,"2.10.2 - CORPORATE OVERHEADS EXPENDITURE"]
[null,null,null,{"$f":"CONCATENATE(\"EXPENDITURE\nForecast \n($0's. real \",dms_DollarReal,\")\")","v":"EXPENDITURE\nForecast \n($0's. real June 2023)"}]
[null,null,null,{"$f":"dms_y1","v":"2021-22"},{"$f":"dms_y2","v":"2022-23"},{"$f":"dms_y3","v":"2023-24"},{"$f":"dms_y4","v":"2024-25"},{"$f":"dms_y5","v":"2025-26"},{"$f":"dms_y6","v":"2026-27"},{"$f":"dms_y7","v":"2027-28"}]
[null,"OPEX"]
[null,"Prescribed Transmission Services","Total",31269015.987655219,36130306.372224033,33493555.5447121,41968535.129445225,43106377.342791662,43171515.099076837,43180795.86236579]
[null,"CAPEX"]
[null,"Prescribed Transmission Services","Total",2793954.2767986702,1963464.6376843378,2887732.4270330784,2945878.1497543869,3852736.668419661,3765191.813506024,3397053.9936208548]
[null,"OTHER TRANSMISSION SERVICES"]
[null,"Negotiated Services","Total"]
[null,"Unregulated Services","Total",1264439.8700000001,1461018.1500559878,1354394.6197575664,1697101.3454378131,1743112.8048611695,1745746.810872802,1746122.10145218]

{"sheet":"2.14 Forecast price changes","index":16,"n_rows":16,"n_cols":9,"rows_kept":16,"cut":false,"hidden":false,"merged":[[6,2,6,3],[6,4,6,8],[7,2,7,8]]}
[null,{"$f":"(LOOKUP(dms_Model,dms_Model_List,dms_Worksheet_List))","v":"REGULATORY REPORTING STATEMENT"}]
[null,{"$f":"INDEX(dms_TradingNameFull_List,MATCH(dms_TradingName,dms_TradingName_List))","v":"ElectraNet"}]
[null,{"$f":"IF(SUM(dms_SingleYear_Model)>0,CRY,CONCATENATE(FRCP_y1,\" to \",dms_MultiYear_FinalYear_Result))","v":"2023-24 to 2027-28"}]
[null,"2.14 FORECAST PRICE CHANGES"]
[]
[null,"2.14.2 - FORECAST CAPEX AND OPEX PRICE CHANGES"]
[null,null,"Price changes\n(% YoY real)\nCurrent regulatory period",null,"Price changes\n(%YoY real)\nForthcoming regulatory period "]
[null,null,"Forecast"]
[null,null,{"$f":"CRCP_y4","v":"2021-22"},{"$f":"CRCP_y5","v":"2022-23"},{"$f":"FRCP_y1","v":"2023-24"},{"$f":"FRCP_y2","v":"2024-25"},{"$f":"FRCP_y3","v":"2025-26"},{"$f":"FRCP_y4","v":"2026-27"},{"$f":"FRCP_y5","v":"2027-28"}]
[null,"OPEX"]
[null,"Real Labour Escalation",8.0000000000000002E-3,8.9999999999999993E-3,5.0000000000000001E-3,6.0000000000000001E-3,7.0000000000000001E-3,4.0000000000000001E-3,3.0000000000000001E-3]
[null,"Materials",0,0,0,0,0,0,0]
[]
[null,"CAPEX"]
[null,"Real Labour Escalation",8.0000000000000002E-3,8.9999999999999993E-3,5.0000000000000001E-3,6.0000000000000001E-3,7.0000000000000001E-3,4.0000000000000001E-3,3.0000000000000001E-3]
[null,"Materials",0,0,0,0,0,0,0]

{"sheet":"2.16 Opex Summary","index":17,"n_rows":58,"n_cols":13,"rows_kept":58,"cut":false,"hidden":false,"merged":[[8,10,8,11],[11,2,11,11],[22,1,22,8],[25,2,25,11],[5,10,5,12],[6,1,6,8],[6,10,6,11],[6,12,7,12],[7,1,7,8],[7,10,7,11]]}
[null,{"$f":"(LOOKUP(dms_Model,dms_Model_List,dms_Worksheet_List))","v":"REGULATORY REPORTING STATEMENT"}]
[null,{"$f":"INDEX(dms_TradingNameFull_List,MATCH(dms_TradingName,dms_TradingName_List))","v":"ElectraNet"}]
[null,{"$f":"IF(SUM(dms_SingleYear_Model)>0,CRY,CONCATENATE(FRCP_y1,\" to \",dms_MultiYear_FinalYear_Result))","v":"2023-24 to 2027-28"}]
[null,"2.16 OPEX SUMMARY"]
[]
[null,"Instructions",null,null,null,null,null,null,null,null,"IMPORTANT!"]
[null,{"$f":"CONCATENATE(\"Complete the tables below in accordance with the regulatory information notice.\n\n\",dms_TradingName, \"'s total forecast opex must reconcile to Table 2.16.1. If \",dms_TradingName,\" did not forecast its total opex using a Base Year approach, total forecast opex must reconcile to Table 2.16.2\")","v":"Complete the tables below in accordance with the regulatory information notice.\n\nElectraNet's total forecast opex must reconcile to Table 2.16.1. If ElectraNet did not forecast its total opex using a Base Year approach, total forecast opex must reconcile to Table 2.16.2"},null,null,null,null,null,null,null,null,{"$f":"CONCATENATE(\"Has \",dms_TradingName,\" used a base-step-trend model to derive its opex forecast? \")","v":"Has ElectraNet used a base-step-trend model to derive its opex forecast? "},null,"Yes"]
[null,"The total step changes and category specific forecasts in Table 2.16.1 must reconcile (in each year) to the total step changes and category secific forecasts for each year in Tables 2.17.1 and 2.17.5 of worksheet 2.17 Step Changes.\")",null,null,null,null,null,null,null,null,"Yes /  No"]
[null,null,null,null,null,null,null,null,null,null,"Please nominate the base year.",null,"2020-21"]
[]
[null,"2.16.1 - PRESCRIBED TRANSMISSION SERVICES - OPEX BY DRIVER"]
[null,null,{"$f":"CONCATENATE(\"Forecast ($0's, real \", dms_DollarReal, \")\")","v":"Forecast ($0's, real June 2023)"}]
[null,null,{"$f":"CRCP_y1","v":"2018-19"},{"$f":"CRCP_y2","v":"2019-20"},{"$f":"CRCP_y3","v":"2020-21"},{"$f":"CRCP_y4","v":"2021-22"},{"$f":"CRCP_y5","v":"2022-23"},{"$f":"FRCP_y1","v":"2023-24"},{"$f":"FRCP_y2","v":"2024-25"},{"$f":"FRCP_y3","v":"2025-26"},{"$f":"FRCP_y4","v":"2026-27"},{"$f":"FRCP_y5","v":"2027-28"}]
[null,"Base year total opex, excluding category specific",null,null,93226012,95300650,93226012,95194089,95194089,95194089,95194089,95194089]
[null,"Increment from base year to final year",null,null,null,null,3413164]
[null,"Price growth",null,null,null,null,null,301575,704949,1143783,1415070,1619109]
[null,"Output growth",null,null,null,null,null,2453722,5647892,5704259,5767121,5836207]
[null,"Productivity growth",null,null,null,null,null,-293848,-608368,-915627,-1222998,-1530530]
[null,"Step changes",null,null,null,null,null,23164825,23164825,23164825,23164825,23164825]
[null,"Category specific",null,null,12523823.878584098,13118385.544836253,11233040.126686808,1746549,1751858,1752646,1746719,1735266]
[null,"Total opex",{"$f":"SUM(C14:C20)","v":0},0,105749835.8785841,108419035.54483625,107872216.12668681,122566912,125855245,126043975,126064826,126018966]
[]
[]
[]
[null,"2.16.2 - PRESCRIBED TRANSMISSION SERVICES - OPEX BY CATEGORY"]
[null,null,{"$f":"CONCATENATE(\"Forecast ($0's, real \", dms_DollarReal, \")\")","v":"Forecast ($0's, real June 2023)"}]
[null,null,{"$f":"CRCP_y1","v":"2018-19"},{"$f":"CRCP_y2","v":"2019-20"},{"$f":"CRCP_y3","v":"2020-21"},{"$f":"CRCP_y4","v":"2021-22"},{"$f":"CRCP_y5","v":"2022-23"},{"$f":"FRCP_y1","v":"2023-24"},{"$f":"FRCP_y2","v":"2024-25"},{"$f":"FRCP_y3","v":"2025-26"},{"$f":"FRCP_y4","v":"2026-27"},{"$f":"FRCP_y5","v":"2027-28"}]
[]
[]
[]
[]
[]
[]
[]
[]
[]
[]
[]
[]
[]
[]
[]
[]
[]
[]
[]
[]
[]
[]
[]
[]
[]
[]
[]
[]
[]
[]
[null,"Total opex",{"$f":"SUM(C28:C57)","v":0},0,0,0,0,0,0,0,0,0]

{"sheet":"2.17 Step Changes","index":18,"n_rows":69,"n_cols":12,"rows_kept":69,"cut":false,"hidden":false,"merged":[[68,1,68,2],[29,5,29,11],[46,1,46,2],[50,5,50,11],[51,5,51,11],[67,1,67,2],[6,5,6,11],[7,5,7,11],[23,1,23,2],[24,1,24,2],[28,5,28,11]]}
[null,{"$f":"(LOOKUP(dms_Model,dms_Model_List,dms_Worksheet_List))","v":"REGULATORY REPORTING STATEMENT"}]
[null,{"$f":"INDEX(dms_TradingNameFull_List,MATCH(dms_TradingName,dms_TradingName_List))","v":"ElectraNet"}]
[null,{"$f":"IF(SUM(dms_SingleYear_Model)>0,CRY,CONCATENATE(FRCP_y1,\" to \",dms_MultiYear_FinalYear_Result))","v":"2023-24 to 2027-28"}]
[null,"2.17 STEP CHANGES"]
[]
[null,"2.17.1 - STEP CHANGES FOR PRESCRIBED TRANSMISSION SERVICES - FORECAST OPEX "]
[null,null,null,null,null,"EXPENDITURE"]
[null,null,null,null,null,{"$f":"CONCATENATE(\"Forecast ($0's, real \", dms_DollarReal, \")\")","v":"Forecast ($0's, real June 2023)"}]
[null,"Step change","Description",{"$f":"CRCP_y1","v":"2018-19"},{"$f":"CRCP_y2","v":"2019-20"},{"$f":"CRCP_y4","v":"2021-22"},{"$f":"CRCP_y5","v":"2022-23"},{"$f":"FRCP_y1","v":"2023-24"},{"$f":"FRCP_y2","v":"2024-25"},{"$f":"FRCP_y3","v":"2025-26"},{"$f":"FRCP_y4","v":"2026-27"},{"$f":"FRCP_y5","v":"2027-28"}]
[null,"Insurance","Since 2018 the global insurance market has experienced significant volatility, with ongoing premium increases and a contraction in available insurance cover capacity. This ongoing market volatility continues to drive substantial ongoing increases in ElectraNet's insurance premiums.",null,null,0,0,6046446.1445799433,6046446.1445799433,6046446.1445799433,6046446.1445799433,6046446.1445799433]
[null,"Cyber","New critical infrastructure legislation to implement the Australian Energy Saector Security Framework and is expected to require additional expenditure during the coming regulatory period.",null,null,0,0,5183149.3832604382,5183149.3832604382,5183149.3832604382,5183149.3832604382,5183149.3832604382]
[null,"Cloud","ElectraNet hae identified a requirement to mitigate part of our IT infrastructure to the Cloud in order to maintain and enhance operational capabilities moving forward. This avoids capital expenditure andunlocks significant benefits, while requiring new licence fees to be paid",null,null,0,0,1796932.9896791205,1796932.9896791205,1796932.9896791205,1796932.9896791205,1796932.9896791205]
[null,"Rule Changes","Recent rule changes will give us additional responsibilities in planning and managing an increasingly complex electricity network, requiring additional specialist resources.",null,null,0,0,788157.33177282673,788157.33177282673,788157.33177282673,788157.33177282673,788157.33177282673]
[null,"IFRS Implementation","To reflect the IFRS accounting treatment for Cloud computing services.",null,null,0,0,9350138.7187220324,9350138.7187220324,9350138.7187220324,9350138.7187220324,9350138.7187220324]
[]
[]
[]
[]
[]
[]
[]
[]
[]
[null,"Total",null,{"$f":"SUM(D17:D23)","v":0},0,{"$f":"SUM(F10:F23)","v":0},{"$f":"SUM(G10:G23)","v":0},23164824.568014361,23164824.568014361,23164824.568014361,23164824.568014361,23164824.568014361]
[null,"Check",null,null,null,null,null,{"$f":"IF(ROUND(H$24,0)-ROUND('2.16 Opex Summary'!C$19,0)=0,\"OK\",\"Error\")","v":"Error"},{"$f":"IF(ROUND(I$24,0)-ROUND('2.16 Opex Summary'!D$19,0)=0,\"OK\",\"Error\")","v":"Error"},{"$f":"IF(ROUND(J$24,0)-ROUND('2.16 Opex Summary'!E$19,0)=0,\"OK\",\"Error\")","v":"Error"},{"$f":"IF(ROUND(K$24,0)-ROUND('2.16 Opex Summary'!F$19,0)=0,\"OK\",\"Error\")","v":"Error"},{"$f":"IF(ROUND(L$24,0)-ROUND('2.16 Opex Summary'!G$19,0)=0,\"OK\",\"Error\")","v":"Error"}]
[]
[]
[null,"2.17.2 - STEP CHANGES FOR PRESCRIBED TRANSMISSION SERVICES - FORECAST CAPEX"]
[null,null,null,null,null,"EXPENDITURE"]
[null,null,null,null,null,{"$f":"CONCATENATE(\"Forecast ($0's, real \", dms_DollarReal, \")\")","v":"Forecast ($0's, real June 2023)"}]
[null,"Step change","Description",{"$f":"CRCP_y1","v":"2018-19"},{"$f":"CRCP_y2","v":"2019-20"},{"$f":"CRCP_y4","v":"2021-22"},{"$f":"CRCP_y5","v":"2022-23"},{"$f":"FRCP_y1","v":"2023-24"},{"$f":"FRCP_y2","v":"2024-25"},{"$f":"FRCP_y3","v":"2025-26"},{"$f":"FRCP_y4","v":"2026-27"},{"$f":"FRCP_y5","v":"2027-28"}]
[]
[]
[]
[]
[]
[]
[]
[]
[]
[]
[]
[]
[]
[]
[]
[null,"Total",null,{"$f":"SUM(D32:D46)","v":0},0,0,0,0,0,0,0,0]
[]
[]
[null,"2.17.5 - CATEGORY SPECIFIC OPEX FOR PRESCRIBED TRANSMISSION SERVICES"]
[null,null,null,null,null,"EXPENDITURE"]
[null,null,null,null,null,{"$f":"CONCATENATE(\"Forecast ($0's, real \", dms_DollarReal, \")\")","v":"Forecast ($0's, real June 2023)"}]
[null,"Category","Description",{"$f":"CRCP_y1","v":"2018-19"},{"$f":"CRCP_y2","v":"2019-20"},{"$f":"CRCP_y4","v":"2021-22"},{"$f":"CRCP_y5","v":"2022-23"},{"$f":"FRCP_y1","v":"2023-24"},{"$f":"FRCP_y2","v":"2024-25"},{"$f":"FRCP_y3","v":"2025-26"},{"$f":"FRCP_y4","v":"2026-27"},{"$f":"FRCP_y5","v":"2027-28"}]
[null,"Debt Raising Costs","Forecast costs associated with debt issuance",null,null,1503864.6945664634,1666372.0207431219,1746549.4557730267,1751858.3890614139,1752646.2624013594,1746718.7244371935,1735266.4539504731]
[null,"Network Support","Network support payments fund non-network solutions contracted by us as cost effective alternatives to network augmentation, such as local generation or demand management arrangements.",null,null,11614520.850269789,9566668.1059436854]
[]
[]
[]
[]
[]
[]
[]
[]
[]
[]
[]
[]
[null,"Total",null,{"$f":"SUM(D61:D67)","v":0},0,{"$f":"SUM(F54:F67)","v":13118385.544836253},{"$f":"SUM(G54:G67)","v":11233040.126686808},1746549.4557730267,1751858.3890614139,1752646.2624013594,1746718.7244371935,1735266.4539504731]
[null,"Check",null,null,null,null,null,{"$f":"IF(ROUND(H$68,0)-ROUND('2.16 Opex Summary'!C$20,0)=0,\"OK\",\"Error\")","v":"Error"},{"$f":"IF(ROUND(I$68,0)-ROUND('2.16 Opex Summary'!D$20,0)=0,\"OK\",\"Error\")","v":"Error"},{"$f":"IF(ROUND(J$68,0)-ROUND('2.16 Opex Summary'!E$20,0)=0,\"OK\",\"Error\")","v":"Error"},{"$f":"IF(ROUND(K$68,0)-ROUND('2.16 Opex Summary'!F$20,0)=0,\"OK\",\"Error\")","v":"Error"},{"$f":"IF(ROUND(L$68,0)-ROUND('2.16 Opex Summary'!G$20,0)=0,\"OK\",\"Error\")","v":"Error"}]

{"sheet":"3.1 Revenue","index":19,"n_rows":42,"n_cols":9,"rows_kept":42,"cut":false,"hidden":false,"merged":[[7,2,7,8],[8,2,8,8],[24,2,24,8],[25,2,25,8],[36,2,36,8]]}
[null,{"$f":"(LOOKUP(dms_Model,dms_Model_List,dms_Worksheet_List))","v":"REGULATORY REPORTING STATEMENT"}]
[null,{"$f":"INDEX(dms_TradingNameFull_List,MATCH(dms_TradingName,dms_TradingName_List))","v":"ElectraNet"}]
[null,{"$f":"IF(SUM(dms_SingleYear_Model)>0,CRY,CONCATENATE(FRCP_y1,\" to \",dms_MultiYear_FinalYear_Result))","v":"2023-24 to 2027-28"}]
[null,"3.1 REVENUE"]
[]
[]
[null,"3.1.1 - REVENUE GROUPING BY CHARGEABLE QUANTITY"]
[null,null,"REVENUE"]
[null,null,{"$f":"CONCATENATE(\"Forecast ($0's, real \",dms_DollarReal,\")\")","v":"Forecast ($0's, real June 2023)"}]
[null,null,{"$f":"dms_y1","v":"2021-22"},{"$f":"dms_y2","v":"2022-23"},{"$f":"dms_y3","v":"2023-24"},{"$f":"dms_y4","v":"2024-25"},{"$f":"dms_y5","v":"2025-26"},{"$f":"dms_y6","v":"2026-27"},{"$f":"dms_y7","v":"2027-28"}]
["TREV0101","From Fixed Customer (Exit Point) Charges",31918693.110291868,32541765.828592055,31979025.212168984,31979025.212168984,31979025.212168984,31979025.21216898,31979025.212168973]
["TREV0102","From Variable Customer (Exit Point) Charges",0,0,0,0,0,0,0]
["TREV0103","From Fixed Generator (Entry Point) Charges",2256067.9584702374,2300107.8065522616,2260332.3348794407,2260332.3348794407,2260332.3348794407,2260332.3348794403,2260332.3348794398]
["TREV0104","From Variable Generator (Entry Point) Charges",0,0,0,0,0,0,0]
["TREV0105","From Fixed Energy Usage Charges (Charge per day basis)",110335373.29497795,112489188.32512406,110543927.10259408,110543927.10259408,110543927.10259408,110543927.10259406,110543927.10259403]
["TREV0106","From Variable Energy Usage charges (Charge per kWh basis)",0,0,0,0,0,0,0]
["TREV0107","From Energy based Common Service and General Charges",73589266.229129583,75025774.421638116,73728363.249545082,73728363.249545082,73728363.249545082,73728363.249545068,73728363.249545053]
["TREV0108","From Fixed Demand based Usage Charges",95483537.873669684,97347435.850015193,95664019.026662886,95664019.026662886,95664019.026662886,95664019.026662871,95664019.026662856]
["TREV0109","From Variable Demand based Usage Charges",0,0,0,0,0,0,0]
["TREV0110","Revenue from other Sources",27535757.26625007,28073272.3540719,27587804.826809976,27587804.826809976,27587804.826809976,27587804.826809973,27587804.826809965]
["TREV01","Total",{"$f":"SUM(C11:C20)","v":341118695.7327894},347777544.58599359,341763471.75266045,341763471.75266045,341763471.75266045,341763471.75266039,341763471.75266033]
[]
[]
[null,"3.1.2 - REVENUE GROUPING BY TYPE OF CONNECTED EQUIPMENT"]
[null,null,"REVENUE"]
[null,null,{"$f":"CONCATENATE(\"Forecast ($0's, real \",dms_DollarReal,\")\")","v":"Forecast ($0's, real June 2023)"}]
[null,null,{"$f":"dms_y1","v":"2021-22"},{"$f":"dms_y2","v":"2022-23"},{"$f":"dms_y3","v":"2023-24"},{"$f":"dms_y4","v":"2024-25"},{"$f":"dms_y5","v":"2025-26"},{"$f":"dms_y6","v":"2026-27"},{"$f":"dms_y7","v":"2027-28"}]
["TREV0201","From Other connected transmission networks",0,0,0,0,0,0,0]
["TREV0202","From Distribution networks",274439259.00350827,279796483.82862085,274957998.83023196,274957998.83023196,274957998.83023196,274957998.8302319,274957998.83023185]
["TREV0203","From Directly connected end–users",36887611.883406781,37607680.982989863,36957336.140301108,36957336.140301108,36957336.140301108,36957336.140301101,36957336.140301093]
["TREV0204","From Generators",2256067.5461166715,2300107.3861492979,2260331.9217464519,2260331.9217464519,2260331.9217464519,2260331.9217464514,2260331.9217464509]
["TREV0205","Other revenue",27535757.299757652,28073272.388233569,27587804.860380892,27587804.860380892,27587804.860380892,27587804.860380888,27587804.860380884]
["TREV02","Total",{"$f":"SUM(C28:C32)","v":341118695.73278934},347777544.58599353,341763471.75266039,341763471.75266039,341763471.75266039,341763471.75266033,341763471.75266027]
[]
[]
[null,"3.1.3 - REVENUE (penalties) ALLOWED (deducted) THROUGH INCENTIVE SCHEMES"]
[null,null,{"$f":"CONCATENATE(\"Forecast ($0's, real \",dms_DollarReal,\")\")","v":"Forecast ($0's, real June 2023)"}]
[null,null,{"$f":"dms_y1","v":"2021-22"},{"$f":"dms_y2","v":"2022-23"},{"$f":"dms_y3","v":"2023-24"},{"$f":"dms_y4","v":"2024-25"},{"$f":"dms_y5","v":"2025-26"},{"$f":"dms_y6","v":"2026-27"},{"$f":"dms_y7","v":"2027-28"}]
["TREV0301","EBSS",0,329503.8111675675,-2857352.8631347641,1010090.8833127562,3395957.2134682359,0,-1415174.1677754472]
["TREV0302","STPIS",7556734.5389999999,0,0,0,0,0,0]
["TREV0303","Other",0,0,-2220598.0810123063,-2220598.0810123063,-2220598.0810123063,-2220598.0810123063,-2220598.0810123063]
["TREV03","Total",{"$f":"SUM(C39:C41)","v":7556734.5389999999},329503.8111675675,-5077950.9441470709,-1210507.1976995501,1175359.1324559296,-2220598.0810123063,-3635772.2487877533]

{"sheet":"3.2 Operating expenditure","index":20,"n_rows":91,"n_cols":9,"rows_kept":91,"cut":false,"hidden":false,"merged":[[53,2,53,8],[7,2,7,8],[8,2,8,8],[49,1,49,3],[52,2,52,8]]}
[null,{"$f":"(LOOKUP(dms_Model,dms_Model_List,dms_Worksheet_List))","v":"REGULATORY REPORTING STATEMENT"}]
[null,{"$f":"INDEX(dms_TradingNameFull_List,MATCH(dms_TradingName,dms_TradingName_List))","v":"ElectraNet"}]
[null,{"$f":"IF(SUM(dms_SingleYear_Model)>0,CRY,CONCATENATE(FRCP_y1,\" to \",dms_MultiYear_FinalYear_Result))","v":"2023-24 to 2027-28"}]
[null,"3.2 OPERATING EXPENDITURE"]
[]
[]
[null,"3.2.1 - OPEX CATEGORIES"]
[null,null,"EXPENDITURE"]
[null,null,{"$f":"CONCATENATE(\"Forecast ($0's, real \",dms_DollarReal,\")\")","v":"Forecast ($0's, real June 2023)"}]
[null,null,{"$f":"dms_y1","v":"2021-22"},{"$f":"dms_y2","v":"2022-23"},{"$f":"dms_y3","v":"2023-24"},{"$f":"dms_y4","v":"2024-25"},{"$f":"dms_y5","v":"2025-26"},{"$f":"dms_y6","v":"2026-27"},{"$f":"dms_y7","v":"2027-28"}]
[null,"OPEX CATEGORIES AND COST ALLOCATIONS - approved CAM"]
[null,"Maintenance Lines",20716788.552129775,22239612.974263668,22473508.758269053,23229032.322102796,23272283.58241944,23278445.979343124,23270527.760863025]
[null,"Maintenance Comms",2611647.3436074709,3286107.0435744794,3320667.2935290057,3432302.8380671972,3438693.6089558126,3439604.1596906506,3438434.1701971232]
[null,"Maintenance Subs",17383359.955715273,14752639.110192997,14907793.792732673,15408970.071716687,15437660.779385513,15441748.603124807,15436496.055800008]
[null,"Maintenance Sec Sys",2913339.3960268036,4802700.9654279184,4853211.3546578093,5016368.5891666524,5025708.8087972319,5027039.5940806353,5025329.6346679954]
[null,"Maintenance Easements",2149931.5514115845,2017874.494419988,2145726.7692377907,2214277.9500140771,2218202.2815726106,2218761.4164636354,2218042.9700081721]
[null,"Maintenance Support",14547070.875039659,13936777.96655293,14667071.443182262,15140531.308236333,15167635.341589082,15171497.097536299,15166535.030391719]
[null,"Network Operations",11976094.390785238,10638877.391398484,10750767.313731125,11112190.984693445,11132881.311277127,11135829.248607876,11132041.369939953]
[null,"Asset Manager Support",11445048.828267941,10575622.214167029,16747413.866819941,17106688.634517256,17127255.943396449,17130186.353285957,17126420.996067215]
[null,"Corporate Support",3339430.7036371082,7231801.726748798,17675321.197259817,17920999.780779012,17935064.078543723,17937067.94582168,17934493.126460239]
[null,"Insurance",6582769.2206419325,5508000.8383213943,11612375.067165773,11799492.730939128,11810204.607011711,11811730.824552502,11809769.749327099]
[null,"Self Insurance",1635169.6711970607,1649161.00152188,1666505.3593507891,1722530.6147654096,1725737.8779432098,1726194.8456383853,1725607.6763772105]
[null,"Network Support",11614520.850269789,9566668.1059436854,0,0,0,0,0]
[null,"Debt Raising Costs",1503864.6945664634,1666372.0207431219,1746549.4557730267,1751858.3890614139,1752646.2624013594,1746718.7244371935,1735266.4539504731]
[]
[]
[]
[]
[]
[]
[]
[]
[]
[]
[]
[]
[]
[]
[]
[]
[]
[]
[]
[]
[]
[null,"Total ",{"$f":"SUM(C12:C45)","v":108419036.03329609},107872215.85327636,122566911.67170906,125855244.21405938,126043974.48329325,126064824.79258275,126018964.99405022]
[]
[]
[]
[null,"Instructions\nTable 3.2.3 must be completed if there are any proposed changes to the CAM reported in response to Schedule 1, paragraph 1.3."]
[]
[null,"3.2.3 - OPEX CATEGORIES - Revised CAM"]
[null,null,"EXPENDITURE"]
[null,null,{"$f":"CONCATENATE(\"Forecast ($0's, real \",dms_DollarReal,\")\")","v":"Forecast ($0's, real June 2023)"}]
[null,null,{"$f":"dms_y1","v":"2021-22"},{"$f":"dms_y2","v":"2022-23"},{"$f":"dms_y3","v":"2023-24"},{"$f":"dms_y4","v":"2024-25"},{"$f":"dms_y5","v":"2025-26"},{"$f":"dms_y6","v":"2026-27"},{"$f":"dms_y7","v":"2027-28"}]
[null,"OPEX CATEGORIES AND COST ALLOCATIONS - revised CAM"]
[]
[]
[]
[]
[]
[]
[]
[]
[]
[]
[]
[]
[]
[]
[]
[]
[]
[]
[]
[]
[]
[]
[]
[]
[]
[]
[]
[]
[]
[]
[]
[]
[]
[]
[null,"Total",{"$f":"SUM(C57:C90)","v":0},0,0,0,0,0,0]

{"sheet":"3.3 Assets (RAB)","index":21,"n_rows":93,"n_cols":9,"rows_kept":93,"cut":false,"hidden":false,"merged":[[8,2,8,8],[20,2,20,8],[68,2,68,8],[79,2,79,8]]}
[null,{"$f":"(LOOKUP(dms_Model,dms_Model_List,dms_Worksheet_List))","v":"REGULATORY REPORTING STATEMENT"}]
[null,{"$f":"INDEX(dms_TradingNameFull_List,MATCH(dms_TradingName,dms_TradingName_List))","v":"ElectraNet"}]
[null,{"$f":"IF(SUM(dms_SingleYear_Model)>0,CRY,CONCATENATE(FRCP_y1,\" to \",dms_MultiYear_FinalYear_Result))","v":"2023-24 to 2027-28"}]
[null,"3.3 ASSETS"]
[]
[null,"There are FOUR tables on this worksheet. Each table has been grouped (and sub-grouped) for ease of navigation. See the Instructions sheet on how to group or ungroup tables. "]
[]
[null,"3.3.1 - REGULATORY ASSET BASE VALUES"]
[null,null,{"$f":"CONCATENATE(\"Forecast ($0's, real \",dms_DollarReal,\")\")","v":"Forecast ($0's, real June 2023)"}]
[null,null,{"$f":"dms_y1","v":"2021-22"},{"$f":"dms_y2","v":"2022-23"},{"$f":"dms_y3","v":"2023-24"},{"$f":"dms_y4","v":"2024-25"},{"$f":"dms_y5","v":"2025-26"},{"$f":"dms_y6","v":"2026-27"},{"$f":"dms_y7","v":"2027-28"}]
[null,"For total asset base:"]
["TRAB0101","Opening value",2872756145.6671443,3237423888.0085568,3593723160.0268044,3604646891.0728688,3606268029.6324282,3594071449.4592476,3570507106.89398]
["TRAB0102","Inflation addition",70382525.568845019,79316885.256209642,0,0,0,0,0]
["TRAB0103","Straight line depreciation",-140644791.74180478,-137578979.43041158,-142736325.06930026,-155444734.77007312,-153711093.820995,-157455340.31967601,-152426038.34550676]
["TRAB0105","Actual additions (recognised in RAB)",434930008.51437283,428284803.67520767,153660056.11536461,157065873.32963201,141514513.6478138,133890997.75440872,116199130.46206447]
["TRAB0106","Disposals ",0,-13723437.482757686,0,0,0,0,0]
["TRAB0107","Closing value ",{"$f":"SUM(C12:C16)","v":3237423888.0085573},3593723160.0268054,3604646891.0728688,3606268029.6324277,3594071449.4592471,3570507106.8939805,3534280199.0105376]
[]
[]
[null,"3.3.2 - ASSET VALUE ROLL FORWARD"]
[null,null,{"$f":"CONCATENATE(\"Forecast ($0's, real \",dms_DollarReal,\")\")","v":"Forecast ($0's, real June 2023)"}]
[null,null,{"$f":"dms_y1","v":"2021-22"},{"$f":"dms_y2","v":"2022-23"},{"$f":"dms_y3","v":"2023-24"},{"$f":"dms_y4","v":"2024-25"},{"$f":"dms_y5","v":"2025-26"},{"$f":"dms_y6","v":"2026-27"},{"$f":"dms_y7","v":"2027-28"}]
[null,"For overhead assets:"]
["TRAB0201","Opening value",653379554.07390094,907975078.45648527,1158791698.237675,1179594815.7616129,1189275053.6629441,1176099277.7365291,1166958377.6948092]
["TRAB0202","Inflation addition",16007799.074810574,22245389.422183886,0,0,0,0,0]
["TRAB0203","Straight line depreciation",-22435790.586603776,-23767794.669774458,-29330307.623168468,-36336590.786791205,-36816334.455073468,-37386205.142831244,-37473827.066964425]
["TRAB0205","Actual additions (recognised in RAB)",261023515.89437729,254798941.64669776,50133425.147106394,46016828.688122347,23640558.528658327,28245305.101111583,28628268.056239102]
["TRAB0206","Disposals ",0,0,0,0,0,0,0]
["TRAB0207","Closing value ",{"$f":"SUM(C24:C28)","v":907975078.45648503},1161251614.8555925,1179594815.7616129,1189275053.6629438,1176099277.7365291,1166958377.6948094,1158112818.6840839]
[null,"For underground assets:"]
["TRAB0301","Opening value",109524469.75092493,109314473.50023542,107534621.08573574,103796310.40907969,100088636.76883382,96397583.720840499,92792773.930341899]
["TRAB0302","Inflation addition",2683349.5088976612,2678204.6007557679,0,0,0,0,0]
["TRAB0303","Straight line depreciation",-3609035.6917227264,-3697812.517986618,-3908856.8460061736,-3908856.8460061736,-3913682.1792407804,-3916286.3273356478,-3931860.1541774999]
["TRAB0305","Actual additions (recognised in RAB)",715689.93213554705,-760244.49726883066,170546.16935012056,201183.20576032184,222629.13124746276,311476.5368370465,0]
["TRAB0306","Disposals ",0,0,0,0,0,0,0]
["TRAB0307","Closing value ",{"$f":"SUM(C31:C35)","v":109314473.50023542},107534621.08573574,103796310.40907969,100088636.76883383,96397583.720840499,92792773.930341899,88860913.776164398]
[null,"For switchyards, substations"]
["TRAB0401","Opening value",1212254324.297868,1305467181.2687755,1391528108.3983946,1383491163.9608293,1377711220.8174736,1369002318.8375707,1360723455.4287159]
["TRAB0402","Inflation addition",29700230.945297763,31983945.941085003,0,0,0,0,0]
["TRAB0403","Straight line depreciation",-45392380.993368708,-46640903.825915918,-45920661.193326324,-48446101.282749139,-49088515.968548588,-49991188.48134394,-50011558.736379072]
["TRAB0405","Actual additions (recognised in RAB)",108905007.01897883,107754336.0654127,37883716.755760908,42666158.13939333,40379613.988645308,41712325.072489068,44809729.453560412]
["TRAB0406","Disposals ",0,-12257116.512051696,0,0,0,0,0]
["TRAB0407","Closing value ",{"$f":"SUM(C38:C42)","v":1305467181.2687759},1386307442.9373059,1383491163.9608293,1377711220.8174734,1369002318.8375704,1360723455.4287157,1355521626.1458972]
[null,"For easements:"]
["TRAB0501","Opening value",206781949.98059857,216087826.16227916,230967955.58125189,232521253.32724911,233480192.56688836,236225271.02924243,239334930.22487783]
["TRAB0502","Inflation addition",5066157.7745246654,5294151.7409758391,0,0,0,0,0]
["TRAB0503","Straight line depreciation",0,0,0,0,0,0,0]
["TRAB0505","Actual additions (recognised in RAB)",4239718.4071559161,9585977.6779968962,1553297.7459972056,958939.23963930062,2745078.462354036,3109659.1956354319,3848011.7731212825]
["TRAB0506","Disposals ",0,0,0,0,0,0,0]
["TRAB0507","Closing value ",{"$f":"SUM(C45:C49)","v":216087826.16227913},230967955.58125189,232521253.32724911,233480192.56688842,236225271.0292424,239334930.22487786,243182941.99799913]
[null,"For “other” assets with long lives:"]
["TRAB0601","Opening value",620960592.42820811,631169114.08275342,616513263.94583213,613827256.35327339,607510368.38037658,610645828.5132941,604651695.91494226]
["TRAB0602","Inflation addition",15213534.514491096,15463643.295027457,0,0,0,0,0]
["TRAB0603","Straight line depreciation",-46157697.365151621,-46824304.974922739,-44415693.652346887,-46541274.310397111,-41880558.699138328,-45885596.473527871,-43213074.317088395]
["TRAB0605","Actual additions (recognised in RAB)",41152684.505205818,37650245.389991105,41729686.059788182,40224386.337500289,45016018.832055777,39891463.875176109,18967389.241555624]
["TRAB0606","Disposals ",0,-1466320.9707059904,0,0,0,0,0]
["TRAB0607","Closing value ",{"$f":"SUM(C52:C56)","v":631169114.08275342},635992376.82214332,613827256.35327351,607510368.38037658,610645828.5132941,604651695.91494226,580406010.83940947]
[null,"For “other” assets with short lives:"]
["TRAB0701","Opening value",69855255.135643378,67410214.538028151,88387512.777915746,91416091.260825098,98202557.435911983,105701169.62177105,106045873.70029321]
["TRAB0702","Inflation addition",1711453.7508232626,1651550.2561816894,0,0,0,0,0]
["TRAB0703","Straight line depreciation",-23049887.104957942,-16648163.441811835,-19160805.754452422,-20211911.544129498,-22012002.51899384,-20276063.89463732,-17795718.070897356]
["TRAB0705","Actual additions (recognised in RAB)",18893392.756519463,19255547.392378122,22189384.237361792,26998377.719216388,29510614.704852894,20620767.973159488,19945731.937588051]
["TRAB0706","Disposals ",0,0,0,0,0,0,0]
["TRAB0707","Closing value ",{"$f":"SUM(C59:C63)","v":67410214.538028166},71669148.74477613,91416091.260825112,98202557.435911998,105701169.62177104,106045873.70029323,108195887.56698391]
[]
[]
[]
[null,"3.3.3 - TOTAL DISAGGREGATED RAB ASSET VALUES"]
[null,null,{"$f":"CONCATENATE(\"Forecast ($0's, real \",dms_DollarReal,\")\")","v":"Forecast ($0's, real June 2023)"}]
[null,null,{"$f":"dms_y1","v":"2021-22"},{"$f":"dms_y2","v":"2022-23"},{"$f":"dms_y3","v":"2023-24"},{"$f":"dms_y4","v":"2024-25"},{"$f":"dms_y5","v":"2025-26"},{"$f":"dms_y6","v":"2026-27"},{"$f":"dms_y7","v":"2027-28"}]
["TRAB0801","Overhead transmission assets (wires and towers/poles etc)",780677316.26519299,1034613346.6560389,1169193256.9996438,1184434934.7122784,1182687165.6997366,1171528827.7156692,1162535598.1894464]
["TRAB0802","Underground transmission assets (cables, ducts etc)",109419471.62558018,108424547.29298559,105665465.7474077,101942473.58895676,98243110.244837165,94595178.825591207,90826843.853253156]
["TRAB0803","Substations, switchyards, transformers etc with transmission function",1258860752.7833219,1345887312.1030407,1387509636.1796119,1380601192.3891513,1373356769.827522,1364862887.1331432,1358122540.7873065]
["TRAB0804","Easements",211434888.07143885,223527890.87176552,231744604.45425051,233000722.94706875,234852731.79806536,237780100.62706015,241258936.11143848]
["TRAB0805","Other assets with long lives (please specify)",626064853.25548077,633580745.45244837,615170260.14955282,610668812.36682498,609078098.44683528,607648762.21411824,592528853.37717581]
["TRAB0806","Other assets with short lives (please specify)",68632734.836835772,69539681.64140214,89901802.019370437,94809324.348368555,101951863.52884151,105873521.66103214,107120880.63363856]
[]
[]
[null,"3.3.4 - ASSET LIVES"]
[null,null,"Asset Life"]
[null,null,{"$f":"dms_y1","v":"2021-22"},{"$f":"dms_y2","v":"2022-23"},{"$f":"dms_y3","v":"2023-24"},{"$f":"dms_y4","v":"2024-25"},{"$f":"dms_y5","v":"2025-26"},{"$f":"dms_y6","v":"2026-27"},{"$f":"dms_y7","v":"2027-28"}]
[null,"ESTIMATED SERVICE LIFE OF NEW ASSETS"]
["TRAB0901","Overhead transmission assets (wires and towers/poles etc)",51.291667895648764,52.231025160680367,52.742756106645551,52.794119377549357,52.803238464566263,52.798874105281065,52.796942771589173]
["TRAB0902","Underground transmission assets (cables, ducts etc)",40,40,40,40,40,40,40]
["TRAB0903","Substations, switchyards, transformers etc with transmission function",45.036304284133919,45.245538154211559,45.071863624792307,45.203654278719405,45.333822007286841,45.489341814575312,45.666818798324343]
["TRAB0904","Other assets with long lives",23.365715493411106,23.460988350256979,24.132162759728804,24.044914257221819,24.006064091850334,23.844713196354707,23.831825778401566]
["TRAB0905","Other assets with short lives",5.7052906903917036,5.7539718892300833,12.691719459129571,12.166595890294779,11.407560704937133,10.701227642172356,10.490172350482068]
[null,"ESTIMATED RESIDUAL SERVICE LIFE"]
["TRAB1001","Overhead transmission assets (wires and towers/poles etc)",26.076910597194079,36.7694923587948,39.86845788257574,39.651202063318451,39.366280429227288,38.822253562655838,38.371906279805842]
["TRAB1002","Underground transmission assets (cables, ducts etc)",28.838483073745827,27.864316426950197,26.886867875561681,25.921621827123619,24.965702432210502,24.019379594307157,23.098097909219778]
["TRAB1003","Substations, switchyards, transformers etc with transmission function",35.587549140197268,35.456069408388196,35.22475531381636,34.644718415867153,34.13474735148948,33.652107156132693,33.226460928952129]
["TRAB1004","Other assets with long lives",13.076747165924434,13.171807747601074,13.080237608206124,13.11357947019571,13.270901985303693,13.56088952794107,14.001549710647426]
["TRAB1005","Other assets with short lives",5.0158529860937033,4.5563921165905619,4.2111590100913219,4.2240477579182345,4.6512155617126911,4.3917603539089338,4.1075189709854332]

{"sheet":"3.4 Operational data","index":22,"n_rows":90,"n_cols":10,"rows_kept":90,"cut":false,"hidden":false,"merged":[[8,3,8,9],[28,3,28,9],[59,3,59,9]]}
[null,{"$f":"(LOOKUP(dms_Model,dms_Model_List,dms_Worksheet_List))","v":"REGULATORY REPORTING STATEMENT"}]
[null,{"$f":"INDEX(dms_TradingNameFull_List,MATCH(dms_TradingName,dms_TradingName_List))","v":"ElectraNet"}]
[null,{"$f":"IF(SUM(dms_SingleYear_Model)>0,CRY,CONCATENATE(FRCP_y1,\" to \",dms_MultiYear_FinalYear_Result))","v":"2023-24 to 2027-28"}]
[null,"3.4 OPERATIONAL DATA"]
[]
[null,"There are THREE tables on this worksheet. Each table has been grouped for ease of navigation. See the Instructions sheet on how to group or ungroup tables. "]
[]
[null,"3.4.1 - ENERGY DELIVERY"]
[null,null,null,"Forecast (0's)"]
[null,null,"Units",{"$f":"dms_y1","v":"2021-22"},{"$f":"dms_y2","v":"2022-23"},{"$f":"dms_y3","v":"2023-24"},{"$f":"dms_y4","v":"2024-25"},{"$f":"dms_y5","v":"2025-26"},{"$f":"dms_y6","v":"2026-27"},{"$f":"dms_y7","v":"2027-28"}]
[null,"Energy grouping by downstream connection type"]
["TOPED0101","To Other connected transmission networks","GWh",2532,2410.3000000000002,2922.5,3341.5,2793.4,3138.6,3853.1]
["TOPED0102","To Distribution networks","GWh",9246.1938513058594,8853.2438513058605,8574.8838513058599,8285.6438513058602,8259.0438513058598,8243.4938513058605,8234.7238513058601]
["TOPED0103","To Directly connected end–users (330 kV)","GWh"]
["TOPED0104","To Directly connected end–users (275 kV)","GWh",1104.3905051839899,1104.3905051839899,1104.3905051839899,1104.3905051839899,1104.3905051839899,1104.3905051839899,1104.3905051839899]
["TOPED0105","To Directly connected end–users (220 kV)","GWh"]
["TOPED0106","To Directly connected end–users (132 kV)","GWh",1005.96564351015,1005.96564351015,1005.96564351015,1005.96564351015,1005.96564351015,1005.96564351015,1005.96564351015]
["TOPED0107","To Directly connected end–users (110 kV)","GWh"]
["TOPED0108","To Directly connected end–users (44 kV) ","GWh"]
["TOPED0109","To Directly connected end–users (33 kV)","GWh",2.6,2.6,2.6,2.6,2.6,2.6,2.6]
["TOPED0110","To Directly connected end–users (22 kV)","GWh"]
["TOPED0111","To Directly connected end–users (11 kV)","GWh"]
["TOPED0112","To Directly connected end–users (6.6 kV)","GWh"]
["TOPED0113","Pumping and Power Station Auxillaries","GWh"]
["TOPED01","Total energy transported","GWh",{"$f":"SUM(D12:D24)","v":13891.15},13376.500000000002,13610.34,13740.1,13165.4,13495.050000000001,14200.78]
[]
[]
[null,"3.4.2 -  CONNECTION POINTS"]
[null,null,null,"Forecast (0's)"]
[null,null,"Units",{"$f":"dms_y1","v":"2021-22"},{"$f":"dms_y2","v":"2022-23"},{"$f":"dms_y3","v":"2023-24"},{"$f":"dms_y4","v":"2024-25"},{"$f":"dms_y5","v":"2025-26"},{"$f":"dms_y6","v":"2026-27"},{"$f":"dms_y7","v":"2027-28"}]
[null,"Number of entry points at each transmission voltage level"]
["TOPCP0101","500kV","number"]
["TOPCP0102","330kV","number",null,null,1,1,1,1,1]
["TOPCP0103","275kV","number",11,11,11,11,11,11,11]
["TOPCP0104","220kV","number"]
["TOPCP0105","132 kV","number",18,18,18,18,18,18,18]
["TOPCP0106","110kV","number"]
["TOPCP0107","66 kV","number",3,3,3,3,3,3,3]
["TOPCP0108","33 kV","number"]
["TOPCP0109","22 kV","number"]
["TOPCP0110","11 kV","number"]
["TOPCP0111","6.6 kV","number"]
[null,"Number of exit points at each transmission voltage level "]
["TOPCP0201","500kV","number"]
["TOPCP0202","330kV","number",null,null,1,1,1,1,1]
["TOPCP0203","275kV","number",14,14,14,14,14,14,14]
["TOPCP0204","220kV","number"]
["TOPCP0205","132 kV","number",58,58,58,58,58,58,58]
["TOPCP0206","110kV","number"]
["TOPCP0207","66 kV","number",3,3,3,3,3,3,3]
["TOPCP0208","44 kV","number"]
["TOPCP0209","33kV","number"]
["TOPCP0210","22kV","number"]
["TOPCP0211","11kV","number"]
["TOPCP0212","6.6kV","number"]
[]
[]
[]
[null,"3.4.3 - SYSTEM DEMAND"]
[null,null,null,"Forecast (0's)"]
[null,null,"Units",{"$f":"dms_y1","v":"2021-22"},{"$f":"dms_y2","v":"2022-23"},{"$f":"dms_y3","v":"2023-24"},{"$f":"dms_y4","v":"2024-25"},{"$f":"dms_y5","v":"2025-26"},{"$f":"dms_y6","v":"2026-27"},{"$f":"dms_y7","v":"2027-28"}]
[null,"Annual system maximum demand characteristics – MW measure"]
["TOPSD0101","Transmission System coincident maximum demand","MW"]
["TOPSD0102","Transmission System coincident weather adjusted maximum demand 10% POE","MW",3277.32,3258.59,3260.26,3262.77,3268.58,3262.27,3300.24]
["TOPSD0103","Transmission System coincident weather adjusted maximum demand 50% POE","MW",2885.75,2880.21,2871.51,2861.92,2871.38,2882.47,2911.13]
["TOPSD0104","Transmission System non-coincident summated maximum demand","MW"]
["TOPSD0105","Transmission System non-coincident weather adjusted summated maximum demand 10% POE","MW",3590.2407289908101,3630.4025216081363,3648.6719422637771,3650.0177489542825,3636.5658914988476,3668.5405778172867,3680.730226083695]
["TOPSD0106","Transmission System non-coincident weather adjusted summated maximum demand 50% POE","MW",3255.0275433478105,3290.5146916091348,3307.5143445307785,3310.5329955772822,3301.9542876008454,3334.0898855552873,3346.4299236006955]
[null,"Annual system maximum demand characteristics – MVA measure"]
["TOPSD0201","Transmission System coincident maximum demand","MVA"]
["TOPSD0202","Transmission System coincident weather adjusted maximum demand 10% POE","MVA",3338.0459446219579,3319.0573998178152,3320.5306001271829,3323.0038572585636,3329.2216772021156,3323.6881951956352,3362.4571109261306]
["TOPSD0203","Transmission System coincident weather adjusted maximum demand 50% POE","MVA",2940.8538937336098,2935.3068605226981,2926.2272640360316,2916.3756137900145,2926.299530777158,2938.4588350169693,2967.7530311432374]
["TOPSD0204","Transmission System non-coincident summated maximum demand","MVA"]
["TOPSD0205","Transmission System non-coincident weather adjusted summated maximum demand 10% POE","MVA",3656.7648278545748,3697.7693891102408,3716.1228963678827,3717.400570324387,3704.034778574121,3737.6075591804142,3750.1204524809909]
["TOPSD0206","Transmission System non-coincident weather adjusted summated maximum demand 50% POE","MVA",3317.1828554325753,3353.4604591092398,3370.5397686778829,3373.5246606993878,3365.1092096671214,3398.8509441384131,3411.5197704239918]
[null,"Power factor"]
[null,"Power factor conversion between MVA and MW"]
["TOPSD0301","Average overall network power factor conversion between MVA and MW","Factor",0.9818079362509089,0.98178175531970791,0.98184910564447914,0.98187367218157373,0.9817850287298745,0.98152107189705262,0.98149653397095848]
["TOPSD0302","Average power factor conversion for 500 kV lines","Factor"]
["TOPSD0303","Average power factor conversion for 330 kV lines","Factor"]
["TOPSD0304","Average power factor conversion for  275 kV lines","Factor",0.98835092055336404,0.98814951037349497,0.98816712499821202,0.98817453539447597,0.98805988440151304,0.98752549418410895,0.987431996932573]
["TOPSD0305","Average power factor conversion for  220 kV lines","Factor"]
["TOPSD0306","Average power factor conversion for  132 kV lines","Factor",0.96333495702779204,0.96366642546717596,0.96385851942793599,0.96382489905818702,0.96349169798592904,0.96349606088917195,0.96350822957117499]
["TOPSD0307","Average power factor conversion for  110 kV lines","Factor"]
["TOPSD0308","Average power factor conversion for  88 kV lines","Factor"]
["TOPSD0309","Average power factor conversion for  66 kV lines","Factor",0.996433247123369,0.99643324691864599,0.99643324719904502,0.99643324703303104,0.99643324715034398,0.99643324700968505,0.99643324713055303]
["TOPSD0310","Average power factor conversion for  33 kV lines","Factor"]
["TOPSD0311","Average power factor conversion for  22 kV lines","Factor"]
["TOPSD0311","Average power factor conversion for  11 kV lines","Factor"]
["TOPSD0312","Average power factor conversion for  6.6 kV lines","Factor"]

{"sheet":"3.5 Physical assets","index":23,"n_rows":74,"n_cols":10,"rows_kept":74,"cut":false,"hidden":false,"merged":[[36,1,36,2],[5,1,5,2],[8,3,8,9],[22,1,22,2]]}
[null,{"$f":"(LOOKUP(dms_Model,dms_Model_List,dms_Worksheet_List))","v":"REGULATORY REPORTING STATEMENT"}]
[null,{"$f":"INDEX(dms_TradingNameFull_List,MATCH(dms_TradingName,dms_TradingName_List))","v":"ElectraNet"}]
[null,{"$f":"IF(SUM(dms_SingleYear_Model)>0,CRY,CONCATENATE(FRCP_y1,\" to \",dms_MultiYear_FinalYear_Result))","v":"2023-24 to 2027-28"}]
[null,"3.5 PHYSICAL ASSETS"]
[]
[null,"There is ONE table on this worksheet. It has been sub-grouped for ease of navigation. See the Instructions sheet on how to group or ungroup tables. "]
[]
[null,"3.5.1 - TRANSMISSION SYSTEM CAPACITIES "]
[null,null,null,"Forecast (0's)"]
[null,null,"Units",{"$f":"dms_y1","v":"2021-22"},{"$f":"dms_y2","v":"2022-23"},{"$f":"dms_y3","v":"2023-24"},{"$f":"dms_y4","v":"2024-25"},{"$f":"dms_y5","v":"2025-26"},{"$f":"dms_y6","v":"2026-27"},{"$f":"dms_y7","v":"2027-28"}]
[null,"Overhead network length of circuit at each voltage"]
["TPA0101","500 kV","km",0,0,0,0,0,0,0]
["TPA0102","330 kV","km",0,0,419.9,419.9,419.9,419.9,419.9]
["TPA0103","275 kV","km",2610.3000000000002,2652.3,2652.3,2652.3,2652.3,2652.3,2652.3]
["TPA0104","220 kV","km",0,0,0,0,0,0,0]
["TPA0105","132 kV","km",2862.8,3180.1,3180.1,3180.1,3180.1,3180.1,3180.1]
["TPA0106","110 kV","km",0,0,0,0,0,0,0]
["TPA0107","88 kV","km",0,0,0,0,0,0,0]
["TPA0108","66 kV","km",15.64,15.64,15.64,15.64,15.64,15.64,15.64]
["TPA0109","33 kV","km",0,0,0,0,0,0,0]
["TPA0109","22 kV","km",0,0,0,0,0,0,0]
["TPA0109","11 kV","km",0,0,0,0,0,0,0]
["TPA01","Total",null,{"$f":"SUM(D12:D22)","v":5488.7400000000007},5848.04,6267.9400000000005,6267.9400000000005,6267.9400000000005,6267.9400000000005,6267.9400000000005]
[]
[null,"Underground cable circuit length at each voltage"]
["TPA0201","500 kV","km",0,0,0,0,0,0,0]
["TPA0202","330 kV","km",0,0,0,0,0,0,0]
["TPA0203","275 kV","km",26.28,26.28,26.28,26.28,26.28,26.28,26.28]
["TPA0204","220 kV","km",0,0,0,0,0,0,0]
["TPA0205","132 kV","km",0,0,0,0,0,0,0]
["TPA0206","110 kV","km",0,0,0,0,0,0,0]
["TPA0207","88 kV","km",0,0,0,0,0,0,0]
["TPA0208","66 kV","km",0.91900000000000004,0.91900000000000004,0.91900000000000004,0.91900000000000004,0.91900000000000004,0.91900000000000004,0.91900000000000004]
["TPA0209","33 kV","km",0,0,0,0,0,0,0]
["TPA0210","22 kV","km",0,0,0,0,0,0,0]
["TPA0211","11 kV","km",0,0,0,0,0,0,0]
["TPA02","Total",null,{"$f":"SUM(D26:D36)","v":27.199000000000002},27.199000000000002,27.199000000000002,27.199000000000002,27.199000000000002,27.199000000000002,27.199000000000002]
[]
[null,"Estimated overhead network weighted average MVA capacity by voltage class"]
["TPA0301","500 kV","MVA",0,0,0,0,0,0,0]
["TPA0302","330 kV","MVA",0,0,814,814,814,814,814]
["TPA0303","275 kV","MVA",572.54753154047808,572.54753154047808,574.55709442511488,574.55709442511488,574.55709442511488,574.55709442511488,574.55709442511488]
["TPA0304","220 kV","MVA",0,0,0,0,0,0,0]
["TPA0305","132 kV","MVA",119.45027556664166,119.45027556664166,153.79223926815868,153.79223926815868,153.79223926815868,153.79223926815868,153.79223926815868]
["TPA0306","110 kV","MVA",0,0,0,0,0,0,0]
["TPA0307","88 kV","MVA",0,0,0,0,0,0,0]
["TPA0308","66 kV","MVA",139.40937795519241,139.40937795519241,139,139,139,139,139]
["TPA0309","33 kV","MVA",0,0,0,0,0,0,0]
["TPA0310","22 kV","MVA",0,0,0,0,0,0,0]
["TPA0311","11 kV","MVA",0,0,0,0,0,0,0]
[]
[null,"Estimated underground network weighted average MVA capacity by voltage class"]
["TPA0401","500 kV","MVA",0,0,0,0,0,0,0]
["TPA0402","330 kV","MVA",0,0,0,0,0,0,0]
["TPA0403","275 kV","MVA",660,660,660,660,660,660,660]
["TPA0404","220 kV","MVA",0,0,0,0,0,0,0]
["TPA0405","132 kV","MVA",0,0,0,0,0,0,0]
["TPA0406","110 kV","MVA",0,0,0,0,0,0,0]
["TPA0407","88 kV","MVA",0,0,0,0,0,0,0]
["TPA0408","66 kV","MVA",0,0,0,0,0,0,0]
["TPA0409","33 kV","MVA",0,0,0,0,0,0,0]
["TPA0410","22 kV","MVA",0,0,0,0,0,0,0]
["TPA0411","11 kV","MVA",0,0,0,0,0,0,0]
[]
[null,"Installed transmission system transformer capacity"]
["TPA0501","Transmission substations (eg 500 kV to 330 kV)","MVA",4358,4358,5558,5558,5558,5558,5558]
["TPA0502","Terminal points to DNSP systems","MVA",7481.5,7476.5,7476.5,7476.5,7481.5,7481.5,7481.5]
["TPA0503","Transformer capacity for directly connected end–users owned by the TNSP","MVA",365,365,365,365,365,365,365]
["TPA0504","Transformer capacity for directly connected end–users owned by the end–user","MVA",440,440,440,440,440,440,440]
["TPA0505","Interconnector capacity","MVA",870,970,1520,1520,1520,1520,1520]
["TPA0506","Other","MVA",0,0,0,0,0,0,0]
[]
[null,"Cold spare capacity"]
["TPA06","Cold spare capacity included in 3.5.1.5","MVA",876.5,876.5,876.5,876.5,876.5,876.5,876.5]

{"sheet":"3.7 Operating environment","index":24,"n_rows":25,"n_cols":10,"rows_kept":25,"cut":false,"hidden":false,"merged":[[7,3,7,9],[19,3,19,9]]}
[null,{"$f":"(LOOKUP(dms_Model,dms_Model_List,dms_Worksheet_List))","v":"REGULATORY REPORTING STATEMENT"}]
[null,{"$f":"INDEX(dms_TradingNameFull_List,MATCH(dms_TradingName,dms_TradingName_List))","v":"ElectraNet"}]
[null,{"$f":"IF(SUM(dms_SingleYear_Model)>0,CRY,CONCATENATE(FRCP_y1,\" to \",dms_MultiYear_FinalYear_Result))","v":"2023-24 to 2027-28"}]
[null,"3.7 OPERATING ENVIRONMENT FACTORS"]
[]
[]
["TEF01","3.7.1 - TERRAIN FACTORS"]
[null,null,null,"Forecast (0's)"]
[null,null,"Units",{"$f":"dms_y1","v":"2021-22"},{"$f":"dms_y2","v":"2022-23"},{"$f":"dms_y3","v":"2023-24"},{"$f":"dms_y4","v":"2024-25"},{"$f":"dms_y5","v":"2025-26"},{"$f":"dms_y6","v":"2026-27"},{"$f":"dms_y7","v":"2027-28"}]
["TEF0101","Total number of vegetation maintenance spans","Number of spans",1622]
["TEF0102","Average vegetation maintenance span cycle","Years",1.3672062350119905]
["TEF0103","Average number of trees per vegetation maintenance span","Trees",14.2]
["TEF0104","Average number of defects per vegetation maintenance span","Defects",1.79]
["TEF0105","Tropical proportion","Number of spans",0]
["TEF0106","Standard vehicle access","km",3415.37]
["TEF0107","Altitude","km",10.199999999999999]
["TEF0108","Bushfire risk","Number of spans",1352]
[]
["TEF02","3.7.2 - NETWORK CHARACTERISTICS"]
[null,null,null,"Forecast (0's)"]
[null,null,"Units",{"$f":"dms_y1","v":"2021-22"},{"$f":"dms_y2","v":"2022-23"},{"$f":"dms_y3","v":"2023-24"},{"$f":"dms_y4","v":"2024-25"},{"$f":"dms_y5","v":"2025-26"},{"$f":"dms_y6","v":"2026-27"},{"$f":"dms_y7","v":"2027-28"}]
["TEF0201","Route line length","km",4527.7,4580.8999999999996,4811.1000000000004,4811.1000000000004,4811.1000000000004,4811.1000000000004,4811.1000000000004]
["TEF0202","Variability of dispatch","%",0.60990896272932504,0.60450512498480735,0.74357268403126031,0.98617451921211574,0.94917027772306473,0.9428286724065007,0.91061536773981222]
["TEF0203","Concentrated load distance","km",45,45,288,288,288,124,124]
["TEF0204","Total number of spans","number",13344,13317,13700,13700,13700,13700,13700]

{"sheet":"5.4 MD & Utilisation - Spatial","index":25,"n_rows":4881,"n_cols":23,"rows_kept":4881,"cut":false,"hidden":false,"merged":[[4853,1,4866,1],[4853,2,4854,2],[4853,3,4854,3],[4855,2,4856,2],[4855,3,4856,3],[4857,2,4858,2],[4857,3,4858,3],[4859,2,4860,2],[4859,3,4860,3],[4861,2,4862,2],[4861,3,4862,3],[4863,2,4864,2],[4863,3,4864,3],[4865,2,4866,2],[4865,3,4866,3],[4867,1,4880,1],[4867,2,4868,2],[4867,3,4868,3],[4869,2,4870,2],[4869,3,4870,3],[4871,2,4872,2],[4879,2,4880,2],[4879,3,4880,3],[4871,3,4872,3],[4873,2,4874,2],[4873,3,4874,3],[4875,2,4876,2],[4875,3,4876,3],[4877,2,4878,2],[4877,3,4878,3],[4825,1,4838,1],[4825,2,4826,2],[4825,3,4826,3],[4827,2,4828,2],[4827,3,4828,3],[4829,2,4830,2],[4829,3,4830,3],[4831,2,4832,2],[4831,3,4832,3],[4833,2,4834,2],[4833,3,4834,3],[4835,2,4836,2],[4835,3,4836,3],[4837,2,4838,2],[4837,3,4838,3],[4839,1,4852,1],[4839,2,4840,2],[4839,3,4840,3],[4841,2,4842,2],[4841,3,4842,3],[4843,2,4844,2],[4843,3,4844,3],[4845,2,4846,2],[4845,3,4846,3],[4847,2,4848,2],[4847,3,4848,3],[4849,2,4850,2],[4849,3,4850,3],[4851,2,4852,2],[4851,3,4852,3],[4797,1,4810,1],[4797,2,4798,2],[4797,3,4798,3],[4799,2,4800,2],[4799,3,4800,3],[4801,2,4802,2],[4801,3,4802,3],[4803,2,4804,2],[4803,3,4804,3],[4805,2,4806,2],[4805,3,4806,3],[4807,2,4808,2],[4807,3,4808,3],[4809,2,4810,2],[4809,3,4810,3],[4811,1,4824,1],[4811,2,4812,2],[4811,3,4812,3],[4813,2,4814,2],[4813,3,4814,3],[4815,2,4816,2],[4815,3,4816,3],[4817,2,4818,2],[4817,3,4818,3],[4819,2,4820,2],[4819,3,4820,3],[4821,2,4822,2],[4821,3,4822,3],[4823,2,4824,2],[4823,3,4824,3],[4769,1,4782,1],[4769,2,4770,2],[4769,3,4770,3],[4771,2,4772,2],[4771,3,4772,3],[4773,2,4774,2],[4773,3,4774,3],[4775,2,4776,2],[4775,3,4776,3],[4777,2,4778,2],[4777,3,4778,3],[4779,2,4780,2],[4779,3,4780,3],[4781,2,4782,2],[4781,3,4782,3],[4783,1,4796,1],[4783,2,4784,2],[4783,3,4784,3],[4785,2,4786,2],[4785,3,4786,3],[4787,2,4788,2],[4787,3,4788,3],[4789,2,4790,2],[4789,3,4790,3],[4791,2,4792,2],[4791,3,4792,3],[4793,2,4794,2],[4793,3,4794,3],[4795,2,4796,2],[4795,3,4796,3],[4741,1,4754,1],[4741,2,4742,2],[4741,3,4742,3],[4743,2,4744,2],[4743,3,4744,3],[4745,2,4746,2],[4745,3,4746,3],[4747,2,4748,2],[4747,3,4748,3],[4749,2,4750,2],[4749,3,4750,3],[4751,2,4752,2],[4751,3,4752,3],[4753,2,4754,2],[4753,3,4754,3],[4755,1,4768,1],[4755,2,4756,2],[4755,3,4756,3],[4757,2,4758,2],[4757,3,4758,3],[4759,2,4760,2],[4759,3,4760,3],[4761,2,4762,2],[4761,3,4762,3],[4763,2,4764,2],[4763,3,4764,3],[4765,2,4766,2],[4765,3,4766,3],[4767,2,4768,2],[4767,3,4768,3],[4713,1,4726,1],[4713,2,4714,2],[4713,3,4714,3],[4715,2,4716,2],[4715,3,4716,3],[4717,2,4718,2],[4717,3,4718,3],[4719,2,4720,2],[4719,3,4720,3],[4721,2,4722,2],[4721,3,4722,3],[4723,2,4724,2],[4723,3,4724,3],[4725,2,4726,2],[4725,3,4726,3],[4727,1,4740,1],[4727,2,4728,2],[4727,3,4728,3],[4729,2,4730,2],[4729,3,4730,3],[4731,2,4732,2],[4731,3,4732,3],[4733,2,4734,2],[4733,3,4734,3],[4735,2,4736,2],[4735,3,4736,3],[4737,2,4738,2],[4737,3,4738,3],[4739,2,4740,2],[4739,3,4740,3],[4685,1,4698,1],[4685,2,4686,2],[4685,3,4686,3],[4687,2,4688,2],[4687,3,4688,3],[4689,2,4690,2],[4689,3,4690,3],[4691,2,4692,2],[4691,3,4692,3],[4693,2,4694,2],[4693,3,4694,3],[4695,2,4696,2],[4695,3,4696,3],[4697,2,4698,2],[4697,3,4698,3],[4699,1,4712,1],[4699,2,4700,2],[4699,3,4700,3],[4701,2,4702,2],[4701,3,4702,3],[4703,2,4704,2],[4703,3,4704,3],[4705,2,4706,2],[4705,3,4706,3],[4707,2,4708,2],[4707,3,4708,3],[4709,2,4710,2],[4709,3,4710,3],[4711,2,4712,2],[4711,3,4712,3],[4657,1,4670,1],[4657,2,4658,2],[4657,3,4658,3],[4659,2,4660,2],[4659,3,4660,3],[4661,2,4662,2],[4661,3,4662,3],[4663,2,4664,2],[4663,3,4664,3],[4665,2,4666,2],[4665,3,4666,3],[4667,2,4668,2],[4667,3,4668,3],[4669,2,4670,2],[4669,3,4670,3],[4671,1,4684,1],[4671,2,4672,2],[4671,3,4672,3],[4673,2,4674,2],[4673,3,4674,3],[4675,2,4676,2],[4675,3,4676,3],[4677,2,4678,2],[4677,3,4678,3],[4679,2,4680,2],[4679,3,4680,3],[4681,2,4682,2],[4681,3,4682,3],[4683,2,4684,2],[4683,3,4684,3],[4629,1,4642,1],[4629,2,4630,2],[4629,3,4630,3],[4631,2,4632,2],[4631,3,4632,3],[4633,2,4634,2],[4633,3,4634,3],[4635,2,4636,2],[4635,3,4636,3],[4637,2,4638,2],[4637,3,4638,3],[4639,2,4640,2],[4639,3,4640,3],[4641,2,4642,2],[4641,3,4642,3],[4643,1,4656,1],[4643,2,4644,2],[4643,3,4644,3],[4645,2,4646,2],[4645,3,4646,3],[4647,2,4648,2],[4647,3,4648,3],[4649,2,4650,2],[4649,3,4650,3],[4651,2,4652,2],[4651,3,4652,3],[4653,2,4654,2],[4653,3,4654,3],[4655,2,4656,2],[4655,3,4656,3],[4601,1,4614,1],[4601,2,4602,2],[4601,3,4602,3],[4603,2,4604,2],[4603,3,4604,3],[4605,2,4606,2],[4605,3,4606,3],[4607,2,4608,2],[4607,3,4608,3],[4609,2,4610,2],[4609,3,4610,3],[4611,2,4612,2],[4611,3,4612,3],[4613,2,4614,2],[4613,3,4614,3],[4615,1,4628,1],[4615,2,4616,2],[4615,3,4616,3],[4617,2,4618,2],[4617,3,4618,3],[4619,2,4620,2],[4619,3,4620,3],[4621,2,4622,2],[4621,3,4622,3],[4623,2,4624,2],[4623,3,4624,3],[4625,2,4626,2],[4625,3,4626,3],[4627,2,4628,2],[4627,3,4628,3],[4573,1,4586,1],[4573,2,4574,2],[4573,3,4574,3],[4575,2,4576,2],[4575,3,4576,3],[4577,2,4578,2],[4577,3,4578,3],[4579,2,4580,2],[4579,3,4580,3],[4581,2,4582,2],[4581,3,4582,3],[4583,2,4584,2],[4583,3,4584,3],[4585,2,4586,2],[4585,3,4586,3],[4587,1,4600,1],[4587,2,4588,2],[4587,3,4588,3],[4589,2,4590,2],[4589,3,4590,3],[4591,2,4592,2],[4591,3,4592,3],[4593,2,4594,2],[4593,3,4594,3],[4595,2,4596,2],[4595,3,4596,3],[4597,2,4598,2],[4597,3,4598,3],[4599,2,4600,2],[4599,3,4600,3],[4545,1,4558,1],[4545,2,4546,2],[4545,3,4546,3],[4547,2,4548,2],[4547,3,4548,3],[4549,2,4550,2],[4549,3,4550,3],[4551,2,4552,2],[4551,3,4552,3],[4553,2,4554,2],[4553,3,4554,3],[4555,2,4556,2],[4555,3,4556,3],[4557,2,4558,2],[4557,3,4558,3],[4559,1,4572,1],[4559,2,4560,2],[4559,3,4560,3],[4561,2,4562,2],[4561,3,4562,3],[4563,2,4564,2],[4563,3,4564,3],[4565,2,4566,2],[4565,3,4566,3],[4567,2,4568,2],[4567,3,4568,3],[4569,2,4570,2],[4569,3,4570,3],[4571,2,4572,2],[4571,3,4572,3],[4517,1,4530,1],[4517,2,4518,2],[4517,3,4518,3],[4519,2,4520,2],[4519,3,4520,3],[4521,2,4522,2],[4521,3,4522,3],[4523,2,4524,2],[4523,3,4524,3],[4525,2,4526,2],[4525,3,4526,3],[4527,2,4528,2],[4527,3,4528,3],[4529,2,4530,2],[4529,3,4530,3],[4531,1,4544,1],[4531,2,4532,2],[4531,3,4532,3],[4533,2,4534,2],[4533,3,4534,3],[4535,2,4536,2],[4535,3,4536,3],[4537,2,4538,2],[4537,3,4538,3],[4539,2,4540,2],[4539,3,4540,3],[4541,2,4542,2],[4541,3,4542,3],[4543,2,4544,2],[4543,3,4544,3],[4489,1,4502,1],[4489,2,4490,2],[4489,3,4490,3],[4491,2,4492,2],[4491,3,4492,3],[4493,2,4494,2],[4493,3,4494,3],[4495,2,4496,2],[4495,3,4496,3],[4497,2,4498,2],[4497,3,4498,3],[4499,2,4500,2],[4499,3,4500,3],[4501,2,4502,2],[4501,3,4502,3],[4503,1,4516,1],[4503,2,4504,2],[4503,3,4504,3],[4505,2,4506,2],[4505,3,4506,3],[4507,2,4508,2],[4507,3,4508,3],[4509,2,4510,2],[4509,3,4510,3],[4511,2,4512,2],[4511,3,4512,3],[4513,2,4514,2],[4513,3,4514,3],[4515,2,4516,2],[4515,3,4516,3],[4461,1,4474,1],[4461,2,4462,2],[4461,3,4462,3],[4463,2,4464,2],[4463,3,4464,3],[4465,2,4466,2],[4465,3,4466,3],[4467,2,4468,2],[4467,3,4468,3],[4469,2,4470,2],[4469,3,4470,3],[4471,2,4472,2],[4471,3,4472,3],[4473,2,4474,2],[4473,3,4474,3],[4475,1,4488,1],[4475,2,4476,2],[4475,3,4476,3],[4477,2,4478,2],[4477,3,4478,3],[4479,2,4480,2],[4479,3,4480,3],[4481,2,4482,2],[4481,3,4482,3],[4483,2,4484,2],[4483,3,4484,3],[4485,2,4486,2],[4485,3,4486,3],[4487,2,4488,2],[4487,3,4488,3],[4433,1,4446,1],[4433,2,4434,2],[4433,3,4434,3],[4435,2,4436,2],[4435,3,4436,3],[4437,2,4438,2],[4437,3,4438,3],[4439,2,4440,2],[4439,3,4440,3],[4441,2,4442,2],[4441,3,4442,3],[4443,2,4444,2],[4443,3,4444,3],[4445,2,4446,2],[4445,3,4446,3],[4447,1,4460,1],[4447,2,4448,2],[4447,3,4448,3],[4449,2,4450,2],[4449,3,4450,3],[4451,2,4452,2],[4451,3,4452,3],[4453,2,4454,2],[4453,3,4454,3],[4455,2,4456,2],[4455,3,4456,3],[4457,2,4458,2],[4457,3,4458,3],[4459,2,4460,2],[4459,3,4460,3],[4405,1,4418,1],[4405,2,4406,2],[4405,3,4406,3],[4407,2,4408,2],[4407,3,4408,3],[4409,2,4410,2],[4409,3,4410,3],[4411,2,4412,2],[4411,3,4412,3],[4413,2,4414,2],[4413,3,4414,3],[4415,2,4416,2],[4415,3,4416,3],[4417,2,4418,2],[4417,3,4418,3],[4419,1,4432,1],[4419,2,4420,2],[4419,3,4420,3],[4421,2,4422,2],[4421,3,4422,3],[4423,2,4424,2],[4423,3,4424,3],[4425,2,4426,2],[4425,3,4426,3],[4427,2,4428,2],[4427,3,4428,3],[4429,2,4430,2],[4429,3,4430,3],[4431,2,4432,2],[4431,3,4432,3],[4377,1,4390,1],[4377,2,4378,2],[4377,3,4378,3],[4379,2,4380,2],[4379,3,4380,3],[4381,2,4382,2],[4381,3,4382,3],[4383,2,4384,2],[4383,3,4384,3],[4385,2,4386,2],[4385,3,4386,3],[4387,2,4388,2],[4387,3,4388,3],[4389,2,4390,2],[4389,3,4390,3],[4391,1,4404,1],[4391,2,4392,2],[4391,3,4392,3],[4393,2,4394,2],[4393,3,4394,3],[4395,2,4396,2],[4395,3,4396,3],[4397,2,4398,2],[4397,3,4398,3],[4399,2,4400,2],[4399,3,4400,3],[4401,2,4402,2],[4401,3,4402,3],[4403,2,4404,2],[4403,3,4404,3],[4349,1,4362,1],[4349,2,4350,2],[4349,3,4350,3],[4351,2,4352,2],[4351,3,4352,3],[4353,2,4354,2],[4353,3,4354,3],[4355,2,4356,2],[4355,3,4356,3],[4357,2,4358,2],[4357,3,4358,3],[4359,2,4360,2],[4359,3,4360,3],[4361,2,4362,2],[4361,3,4362,3],[4363,1,4376,1],[4363,2,4364,2],[4363,3,4364,3],[4365,2,4366,2],[4365,3,4366,3],[4367,2,4368,2],[4367,3,4368,3],[4369,2,4370,2],[4369,3,4370,3],[4371,2,4372,2],[4371,3,4372,3],[4373,2,4374,2],[4373,3,4374,3],[4375,2,4376,2],[4375,3,4376,3],[4321,1,4334,1],[4321,2,4322,2],[4321,3,4322,3],[4323,2,4324,2],[4323,3,4324,3],[4325,2,4326,2],[4325,3,4326,3],[4327,2,4328,2],[4327,3,4328,3],[4329,2,4330,2],[4329,3,4330,3],[4331,2,4332,2],[4331,3,4332,3],[4333,2,4334,2],[4333,3,4334,3],[4335,1,4348,1],[4335,2,4336,2],[4335,3,4336,3],[4337,2,4338,2],[4337,3,4338,3],[4339,2,4340,2],[4339,3,4340,3],[4341,2,4342,2],[4341,3,4342,3],[4343,2,4344,2],[4343,3,4344,3],[4345,2,4346,2],[4345,3,4346,3],[4347,2,4348,2],[4347,3,4348,3],[4293,1,4306,1],[4293,2,4294,2],[4293,3,4294,3],[4295,2,4296,2],[4295,3,4296,3],[4297,2,4298,2],[4297,3,4298,3],[4299,2,4300,2],[4299,3,4300,3],[4301,2,4302,2],[4301,3,4302,3],[4303,2,4304,2],[4303,3,4304,3],[4305,2,4306,2],[4305,3,4306,3],[4307,1,4320,1],[4307,2,4308,2],[4307,3,4308,3],[4309,2,4310,2],[4309,3,4310,3],[4311,2,4312,2],[4311,3,4312,3],[4313,2,4314,2],[4313,3,4314,3],[4315,2,4316,2],[4315,3,4316,3],[4317,2,4318,2],[4317,3,4318,3],[4319,2,4320,2],[4319,3,4320,3],[4265,1,4278,1],[4265,2,4266,2],[4265,3,4266,3],[4267,2,4268,2],[4267,3,4268,3],[4269,2,4270,2],[4269,3,4270,3],[4271,2,4272,2],[4271,3,4272,3],[4273,2,4274,2],[4273,3,4274,3],[4275,2,4276,2],[4275,3,4276,3],[4277,2,4278,2],[4277,3,4278,3],[4279,1,4292,1],[4279,2,4280,2],[4279,3,4280,3],[4281,2,4282,2],[4281,3,4282,3],[4283,2,4284,2],[4283,3,4284,3],[4285,2,4286,2],[4285,3,4286,3],[4287,2,4288,2],[4287,3,4288,3],[4289,2,4290,2],[4289,3,4290,3],[4291,2,4292,2],[4291,3,4292,3],[4237,1,4250,1],[4237,2,4238,2],[4237,3,4238,3],[4239,2,4240,2],[4239,3,4240,3],[4241,2,4242,2],[4241,3,4242,3],[4243,2,4244,2],[4243,3,4244,3],[4245,2,4246,2],[4245,3,4246,3],[4247,2,4248,2],[4247,3,4248,3],[4249,2,4250,2],[4249,3,4250,3],[4251,1,4264,1],[4251,2,4252,2],[4251,3,4252,3],[4253,2,4254,2],[4253,3,4254,3],[4255,2,4256,2],[4255,3,4256,3],[4257,2,4258,2],[4257,3,4258,3],[4259,2,4260,2],[4259,3,4260,3],[4261,2,4262,2],[4261,3,4262,3],[4263,2,4264,2],[4263,3,4264,3],[4209,1,4222,1],[4209,2,4210,2],[4209,3,4210,3],[4211,2,4212,2],[4211,3,4212,3],[4213,2,4214,2],[4213,3,4214,3],[4215,2,4216,2],[4215,3,4216,3],[4217,2,4218,2],[4217,3,4218,3],[4219,2,4220,2],[4219,3,4220,3],[4221,2,4222,2],[4221,3,4222,3],[4223,1,4236,1],[4223,2,4224,2],[4223,3,4224,3],[4225,2,4226,2],[4225,3,4226,3],[4227,2,4228,2],[4227,3,4228,3],[4229,2,4230,2],[4229,3,4230,3],[4231,2,4232,2],[4231,3,4232,3],[4233,2,4234,2],[4233,3,4234,3],[4235,2,4236,2],[4235,3,4236,3],[4181,1,4194,1],[4181,2,4182,2],[4181,3,4182,3],[4183,2,4184,2],[4183,3,4184,3],[4185,2,4186,2],[4185,3,4186,3],[4187,2,4188,2],[4187,3,4188,3],[4189,2,4190,2],[4189,3,4190,3],[4191,2,4192,2],[4191,3,4192,3],[4193,2,4194,2],[4193,3,4194,3],[4195,1,4208,1],[4195,2,4196,2],[4195,3,4196,3],[4197,2,4198,2],[4197,3,4198,3],[4199,2,4200,2],[4199,3,4200,3],[4201,2,4202,2],[4201,3,4202,3],[4203,2,4204,2],[4203,3,4204,3],[4205,2,4206,2],[4205,3,4206,3],[4207,2,4208,2],[4207,3,4208,3],[4153,1,4166,1],[4153,2,4154,2],[4153,3,4154,3],[4155,2,4156,2],[4155,3,4156,3],[4157,2,4158,2],[4157,3,4158,3],[4159,2,4160,2],[4159,3,4160,3],[4161,2,4162,2],[4161,3,4162,3],[4163,2,4164,2],[4163,3,4164,3],[4165,2,4166,2],[4165,3,4166,3],[4167,1,4180,1],[4167,2,4168,2],[4167,3,4168,3],[4169,2,4170,2],[4169,3,4170,3],[4171,2,4172,2],[4171,3,4172,3],[4173,2,4174,2],[4173,3,4174,3],[4175,2,4176,2],[4175,3,4176,3],[4177,2,4178,2],[4177,3,4178,3],[4179,2,4180,2],[4179,3,4180,3],[4125,1,4138,1],[4125,2,4126,2],[4125,3,4126,3],[4127,2,4128,2],[4127,3,4128,3],[4129,2,4130,2],[4129,3,4130,3],[4131,2,4132,2],[4131,3,4132,3],[4133,2,4134,2],[4133,3,4134,3],[4135,2,4136,2],[4135,3,4136,3],[4137,2,4138,2],[4137,3,4138,3],[4139,1,4152,1],[4139,2,4140,2],[4139,3,4140,3],[4141,2,4142,2],[4141,3,4142,3],[4143,2,4144,2],[4143,3,4144,3],[4145,2,4146,2],[4145,3,4146,3],[4147,2,4148,2],[4147,3,4148,3],[4149,2,4150,2],[4149,3,4150,3],[4151,2,4152,2],[4151,3,4152,3],[4097,1,4110,1],[4097,2,4098,2],[4097,3,4098,3],[4099,2,4100,2],[4099,3,4100,3],[4101,2,4102,2],[4101,3,4102,3],[4103,2,4104,2],[4103,3,4104,3],[4105,2,4106,2],[4105,3,4106,3],[4107,2,4108,2],[4107,3,4108,3],[4109,2,4110,2],[4109,3,4110,3],[4111,1,4124,1],[4111,2,4112,2],[4111,3,4112,3],[4113,2,4114,2],[4113,3,4114,3],[4115,2,4116,2],[4115,3,4116,3],[4117,2,4118,2],[4117,3,4118,3],[4119,2,4120,2],[4119,3,4120,3],[4121,2,4122,2],[4121,3,4122,3],[4123,2,4124,2],[4123,3,4124,3],[4069,1,4082,1],[4069,2,4070,2],[4069,3,4070,3],[4071,2,4072,2],[4071,3,4072,3],[4073,2,4074,2],[4073,3,4074,3],[4075,2,4076,2],[4075,3,4076,3],[4077,2,4078,2],[4077,3,4078,3],[4079,2,4080,2],[4079,3,4080,3],[4081,2,4082,2],[4081,3,4082,3],[4083,1,4096,1],[4083,2,4084,2],[4083,3,4084,3],[4085,2,4086,2],[4085,3,4086,3],[4087,2,4088,2],[4087,3,4088,3],[4089,2,4090,2],[4089,3,4090,3],[4091,2,4092,2],[4091,3,4092,3],[4093,2,4094,2],[4093,3,4094,3],[4095,2,4096,2],[4095,3,4096,3],[4041,1,4054,1],[4041,2,4042,2],[4041,3,4042,3],[4043,2,4044,2],[4043,3,4044,3],[4045,2,4046,2],[4045,3,4046,3],[4047,2,4048,2],[4047,3,4048,3],[4049,2,4050,2],[4049,3,4050,3],[4051,2,4052,2],[4051,3,4052,3],[4053,2,4054,2],[4053,3,4054,3],[4055,1,4068,1],[4055,2,4056,2],[4055,3,4056,3],[4057,2,4058,2],[4057,3,4058,3],[4059,2,4060,2],[4059,3,4060,3],[4061,2,4062,2],[4061,3,4062,3],[4063,2,4064,2],[4063,3,4064,3],[4065,2,4066,2],[4065,3,4066,3],[4067,2,4068,2],[4067,3,4068,3],[4013,1,4026,1],[4013,2,4014,2],[4013,3,4014,3],[4015,2,4016,2],[4015,3,4016,3],[4017,2,4018,2],[4017,3,4018,3],[4019,2,4020,2],[4019,3,4020,3],[4021,2,4022,2],[4021,3,4022,3],[4023,2,4024,2],[4023,3,4024,3],[4025,2,4026,2],[4025,3,4026,3],[4027,1,4040,1],[4027,2,4028,2],[4027,3,4028,3],[4029,2,4030,2],[4029,3,4030,3],[4031,2,4032,2],[4031,3,4032,3],[4033,2,4034,2],[4033,3,4034,3],[4035,2,4036,2],[4035,3,4036,3],[4037,2,4038,2],[4037,3,4038,3],[4039,2,4040,2],[4039,3,4040,3],[3985,1,3998,1],[3985,2,3986,2],[3985,3,3986,3],[3987,2,3988,2],[3987,3,3988,3],[3989,2,3990,2],[3989,3,3990,3],[3991,2,3992,2],[3991,3,3992,3],[3993,2,3994,2],[3993,3,3994,3],[3995,2,3996,2],[3995,3,3996,3],[3997,2,3998,2],[3997,3,3998,3],[3999,1,4012,1],[3999,2,4000,2],[3999,3,4000,3],[4001,2,4002,2],[4001,3,4002,3],[4003,2,4004,2],[4003,3,4004,3],[4005,2,4006,2],[4005,3,4006,3],[4007,2,4008,2],[4007,3,4008,3],[4009,2,4010,2],[4009,3,4010,3],[4011,2,4012,2],[4011,3,4012,3],[3957,1,3970,1],[3957,2,3958,2],[3957,3,3958,3],[3959,2,3960,2],[3959,3,3960,3],[3961,2,3962,2],[3961,3,3962,3],[3963,2,3964,2],[3963,3,3964,3],[3965,2,3966,2],[3965,3,3966,3],[3967,2,3968,2],[3967,3,3968,3],[3969,2,3970,2],[3969,3,3970,3],[3971,1,3984,1],[3971,2,3972,2],[3971,3,3972,3],[3973,2,3974,2],[3973,3,3974,3],[3975,2,3976,2],[3975,3,3976,3],[3977,2,3978,2],[3977,3,3978,3],[3979,2,3980,2],[3979,3,3980,3],[3981,2,3982,2],[3981,3,3982,3],[3983,2,3984,2],[3983,3,3984,3],[3929,1,3942,1],[3929,2,3930,2],[3929,3,3930,3],[3931,2,3932,2],[3931,3,3932,3],[3933,2,3934,2],[3933,3,3934,3],[3935,2,3936,2],[3935,3,3936,3],[3937,2,3938,2]],"merged_total":5221,"flags":["merged_cut"]}
[null,{"$f":"(LOOKUP(dms_Model,dms_Model_List,dms_Worksheet_List))","v":"REGULATORY REPORTING STATEMENT"}]
[null,{"$f":"INDEX(dms_TradingNameFull_List,MATCH(dms_TradingName,dms_TradingName_List))","v":"ElectraNet"}]
[null,{"$f":"IF(SUM(dms_SingleYear_Model)>0,CRY,CONCATENATE(FRCP_y1,\" to \",dms_MultiYear_FinalYear_Result))","v":"2023-24 to 2027-28"}]
[null,"5.4 MAXIMUM DEMAND AND UTILISATION AT SPATIAL LEVEL"]
[]
[null,"There is ONE table on this worksheet. It has been sub-grouped into blocks of approximately 500 rows for ease of navigation. See the Instructions sheet on how to group or ungroup data."]
[]
[null,"5.4.1 - NON-COINCIDENT & COINCIDENT MAXIMUM DEMAND"]
[null,"CONNECTION POINT","FORECASTING ELEMENTS","UNIT","MAX DEMAND",null,"TNSP NAME","SERVICE","SERVICE SUBCATEGORY","DATA TYPE","DATA TYPE SUBCATEGORY","LOCATION","LOCATION SUBCATEGORY","MEASUREMENT","DENOMINATION",null,{"$f":"dms_y1","v":"2021-22"},{"$f":"dms_y2","v":"2022-23"},{"$f":"dms_y3","v":"2023-24"},{"$f":"dms_y4","v":"2024-25"},{"$f":"dms_y5","v":"2025-26"},{"$f":"dms_y6","v":"2026-27"},{"$f":"dms_y7","v":"2027-28"}]
[null,"ACR","CONNECTION POINT RATING","MVA","Non-coincident",null,"TNSP NAME","DEMAND FORECASTING","NON-COINCIDENT MAXIMUM DEMAND","DESCRIPTOR METRIC","CONNECTION POINT RATING","CONNECTION POINT",{"$f":"B10","v":"ACR"},"RATING","MVA",null,600,600,600,600,600,600,600]
[null,null,null,null,"Coincident",null,"TNSP NAME","DEMAND FORECASTING","COINCIDENT MAXIMUM DEMAND","DESCRIPTOR METRIC","CONNECTION POINT RATING","CONNECTION POINT",{"$f":"M10","v":"ACR"},"RATING","MVA",null,600,600,600,600,600,600,600]
[null,null,"WINTER/SUMMER PEAKING",null,"Non-coincident",null,"TNSP NAME","DEMAND FORECASTING","NON-COINCIDENT MAXIMUM DEMAND","DESCRIPTOR METRIC","WINTER/SUMMER PEAKING","CONNECTION POINT",{"$f":"#REF!","v":{"$error":"#REF!"}},"WINTER/SUMMER","WINTER/SUMMER",null,"Summer","Summer","Summer","Summer","Summer","Summer","Summer"]
[null,null,null,null,"Coincident",null,"TNSP NAME","DEMAND FORECASTING","COINCIDENT MAXIMUM DEMAND","DESCRIPTOR METRIC","WINTER/SUMMER PEAKING","CONNECTION POINT",{"$f":"M12","v":{"$error":"#REF!"}},"WINTER/SUMMER","WINTER/SUMMER",null,"Summer","Summer","Summer","Summer","Summer","Summer","Summer"]
[null,null,"ADJUSTMENTS - EMBEDDED GENERATION","MW","Non-coincident",null,"TNSP NAME","DEMAND FORECASTING","NON-COINCIDENT MAXIMUM DEMAND","DESCRIPTOR METRIC","ADJUSTMENTS - EMBEDDED GENERATION","CONNECTION POINT",{"$error":"#REF!"},"GENERATED LOAD","MW",null,3.1920777214103624,3.1920777214103624,3.1920777214103624,3.1920777214103624,3.1920777214103624,3.1920777214103624,3.1920777214103624]
[null,null,null,null,"Coincident",null,"TNSP NAME","DEMAND FORECASTING","COINCIDENT MAXIMUM DEMAND","DESCRIPTOR METRIC","ADJUSTMENTS - EMBEDDED GENERATION","CONNECTION POINT",{"$error":"#REF!"},"GENERATED LOAD","MW",null,1.4884080604699237,1.4884080604699237,1.4884080604699237,1.4884080604699237,1.4884080604699237,1.4884080604699237,1.4884080604699237]
[null,null,"WEATHER CORRECTED MD 10% POE","MW","Non-coincident",null,"TNSP NAME","DEMAND FORECASTING","NON-COINCIDENT MAXIMUM DEMAND","DESCRIPTOR METRIC","WEATHER CORRECTED MD 10% POE","CONNECTION POINT",{"$error":"#REF!"},"MAXIMUM DEMAND","MW",null,346.53886143726436,349.44096673119111,351.59667312362137,352.62162672597731,352.30972843859934,353.85090647716089,355.40201333969912]
[null,null,null,null,"Coincident",null,"TNSP NAME","DEMAND FORECASTING","COINCIDENT MAXIMUM DEMAND","DESCRIPTOR METRIC","WEATHER CORRECTED MD 10% POE","CONNECTION POINT",{"$error":"#REF!"},"MAXIMUM DEMAND","MW",null,346.53886143726436,349.44096673119111,351.59667312362137,352.62162672597731,352.30972843859934,353.85090647716089,355.40201333969912]
[null,null,"WEATHER CORRECTED MD 10% POE","MVA","Non-coincident",null,"TNSP NAME","DEMAND FORECASTING","NON-COINCIDENT MAXIMUM DEMAND","DESCRIPTOR METRIC","WEATHER CORRECTED MD 10% POE","CONNECTION POINT",{"$error":"#REF!"},"MAXIMUM DEMAND","MVA",null,349.39842185936197,352.32284963252971,354.49523341776705,355.52778131069022,355.2124374540773,356.76586811542757,358.32934198811279]
[null,null,null,null,"Coincident",null,"TNSP NAME","DEMAND FORECASTING","COINCIDENT MAXIMUM DEMAND","DESCRIPTOR METRIC","WEATHER CORRECTED MD 10% POE","CONNECTION POINT",{"$error":"#REF!"},"MAXIMUM DEMAND","MVA",null,349.39842185936197,352.32284963252971,354.49523341776705,355.52778131069022,355.2124374540773,356.76586811542757,358.32934198811279]
[null,null,"WEATHER CORRECTED MD 50% POE","MW","Non-coincident",null,"TNSP NAME","DEMAND FORECASTING","NON-COINCIDENT MAXIMUM DEMAND","DESCRIPTOR METRIC","WEATHER CORRECTED MD 50% POE","CONNECTION POINT",{"$error":"#REF!"},"MAXIMUM DEMAND","MW",null,306.14204445581834,308.46049951446776,310.45060676625769,311.62891206520237,311.83794689695628,313.37865612802494,314.95042225765155]
[null,null,null,null,"Coincident",null,"TNSP NAME","DEMAND FORECASTING","COINCIDENT MAXIMUM DEMAND","DESCRIPTOR METRIC","WEATHER CORRECTED MD 50% POE","CONNECTION POINT",{"$error":"#REF!"},"MAXIMUM DEMAND","MW",null,306.14204445581834,308.46049951446776,310.45060676625769,311.62891206520237,311.83794689695628,313.37865612802494,314.95042225765155]
[null,null,"WEATHER CORRECTED MD 50% POE","MVA","Non-coincident",null,"TNSP NAME","DEMAND FORECASTING","NON-COINCIDENT MAXIMUM DEMAND","DESCRIPTOR METRIC","WEATHER CORRECTED MD 50% POE","CONNECTION POINT",{"$error":"#REF!"},"MAXIMUM DEMAND","MVA",null,308.67166369438661,311.00782385387424,313.01366807522953,314.20106680570581,314.41119635777818,315.96375846261805,317.54760505373804]
[null,null,null,null,"Coincident",null,"TNSP NAME","DEMAND FORECASTING","COINCIDENT MAXIMUM DEMAND","DESCRIPTOR METRIC","WEATHER CORRECTED MD 50% POE","CONNECTION POINT",{"$error":"#REF!"},"MAXIMUM DEMAND","MVA",null,308.67166369438661,311.00782385387424,313.01366807522953,314.20106680570581,314.41119635777818,315.96375846261805,317.54760505373804]
[null,"Angas Creek","CONNECTION POINT RATING","MVA","Non-coincident",null,"TNSP NAME","DEMAND FORECASTING","NON-COINCIDENT MAXIMUM DEMAND","DESCRIPTOR METRIC","CONNECTION POINT RATING","CONNECTION POINT",{"$f":"B24","v":"Angas Creek"},"RATING","MVA",null,56.6,56.6,56.6,56.6,56.6,56.6,56.6]
[null,null,null,null,"Coincident",null,"TNSP NAME","DEMAND FORECASTING","COINCIDENT MAXIMUM DEMAND","DESCRIPTOR METRIC","CONNECTION POINT RATING","CONNECTION POINT",{"$f":"M24","v":"Angas Creek"},"RATING","MVA",null,56.6,56.6,56.6,56.6,56.6,56.6,56.6]
[null,null,"WINTER/SUMMER PEAKING",null,"Non-coincident",null,"TNSP NAME","DEMAND FORECASTING","NON-COINCIDENT MAXIMUM DEMAND","DESCRIPTOR METRIC","WINTER/SUMMER PEAKING","CONNECTION POINT",{"$f":"#REF!","v":{"$error":"#REF!"}},"WINTER/SUMMER","WINTER/SUMMER",null,"Summer","Summer","Summer","Summer","Summer","Summer","Summer"]
[null,null,null,null,"Coincident",null,"TNSP NAME","DEMAND FORECASTING","COINCIDENT MAXIMUM DEMAND","DESCRIPTOR METRIC","WINTER/SUMMER PEAKING","CONNECTION POINT",{"$f":"M26","v":{"$error":"#REF!"}},"WINTER/SUMMER","WINTER/SUMMER",null,"Summer","Summer","Summer","Summer","Summer","Summer","Summer"]
[null,null,"ADJUSTMENTS - EMBEDDED GENERATION","MW","Non-coincident",null,"TNSP NAME","DEMAND FORECASTING","NON-COINCIDENT MAXIMUM DEMAND","DESCRIPTOR METRIC","ADJUSTMENTS - EMBEDDED GENERATION","CONNECTION POINT",{"$error":"#REF!"},"GENERATED LOAD","MW",null,0,0,0,0,0,0,0]
[null,null,null,null,"Coincident",null,"TNSP NAME","DEMAND FORECASTING","COINCIDENT MAXIMUM DEMAND","DESCRIPTOR METRIC","ADJUSTMENTS - EMBEDDED GENERATION","CONNECTION POINT",{"$error":"#REF!"},"GENERATED LOAD","MW",null,0,0,0,0,0,0,0]
[null,null,"WEATHER CORRECTED MD 10% POE","MW","Non-coincident",null,"TNSP NAME","DEMAND FORECASTING","NON-COINCIDENT MAXIMUM DEMAND","DESCRIPTOR METRIC","WEATHER CORRECTED MD 10% POE","CONNECTION POINT",{"$error":"#REF!"},"MAXIMUM DEMAND","MW",null,20.288215099999999,20.536844389999999,20.71979228,20.82579703,20.8535994,20.982194360000001,21.108311350000001]
[null,null,null,null,"Coincident",null,"TNSP NAME","DEMAND FORECASTING","COINCIDENT MAXIMUM DEMAND","DESCRIPTOR METRIC","WEATHER CORRECTED MD 10% POE","CONNECTION POINT",{"$error":"#REF!"},"MAXIMUM DEMAND","MW",null,20.288215099999999,20.536844389999999,20.71979228,20.82579703,20.8535994,20.982194360000001,21.108311350000001]
[null,null,"WEATHER CORRECTED MD 10% POE","MVA","Non-coincident",null,"TNSP NAME","DEMAND FORECASTING","NON-COINCIDENT MAXIMUM DEMAND","DESCRIPTOR METRIC","WEATHER CORRECTED MD 10% POE","CONNECTION POINT",{"$error":"#REF!"},"MAXIMUM DEMAND","MVA",null,20.76846321,21.022977879999999,21.210256380000001,21.318770390000001,21.347230889999999,21.47886986,21.607972190000002]
[null,null,null,null,"Coincident",null,"TNSP NAME","DEMAND FORECASTING","COINCIDENT MAXIMUM DEMAND","DESCRIPTOR METRIC","WEATHER CORRECTED MD 10% POE","CONNECTION POINT",{"$error":"#REF!"},"MAXIMUM DEMAND","MVA",null,20.76846321,21.022977879999999,21.210256380000001,21.318770390000001,21.347230889999999,21.47886986,21.607972190000002]
[null,null,"WEATHER CORRECTED MD 50% POE","MW","Non-coincident",null,"TNSP NAME","DEMAND FORECASTING","NON-COINCIDENT MAXIMUM DEMAND","DESCRIPTOR METRIC","WEATHER CORRECTED MD 50% POE","CONNECTION POINT",{"$error":"#REF!"},"MAXIMUM DEMAND","MW",null,18.27582919,18.511411020000001,18.700329350000001,18.832954869999998,18.907151219999999,19.05486222,19.199544970000002]
[null,null,null,null,"Coincident",null,"TNSP NAME","DEMAND FORECASTING","COINCIDENT MAXIMUM DEMAND","DESCRIPTOR METRIC","WEATHER CORRECTED MD 50% POE","CONNECTION POINT",{"$error":"#REF!"},"MAXIMUM DEMAND","MW",null,18.27582919,18.511411020000001,18.700329350000001,18.832954869999998,18.907151219999999,19.05486222,19.199544970000002]
[null,null,"WEATHER CORRECTED MD 50% POE","MVA","Non-coincident",null,"TNSP NAME","DEMAND FORECASTING","NON-COINCIDENT MAXIMUM DEMAND","DESCRIPTOR METRIC","WEATHER CORRECTED MD 50% POE","CONNECTION POINT",{"$error":"#REF!"},"MAXIMUM DEMAND","MVA",null,18.708441539999999,18.949599899999999,19.14299016,19.278755100000001,19.354707779999998,19.50591528,19.654022869999999]
[null,null,null,null,"Coincident",null,"TNSP NAME","DEMAND FORECASTING","COINCIDENT MAXIMUM DEMAND","DESCRIPTOR METRIC","WEATHER CORRECTED MD 50% POE","CONNECTION POINT",{"$error":"#REF!"},"MAXIMUM DEMAND","MVA",null,18.708441539999999,18.949599899999999,19.14299016,19.278755100000001,19.354707779999998,19.50591528,19.654022869999999]
[null,"Ardrossan West","CONNECTION POINT RATING","MVA","Non-coincident",null,null,null,null,null,null,null,null,null,null,null,50,50,50,50,50,50,50]
[null,null,null,null,"Coincident",null,null,null,null,null,null,null,null,null,null,null,50,50,50,50,50,50,50]
[null,null,"WINTER/SUMMER PEAKING",null,"Non-coincident",null,null,null,null,null,null,null,null,null,null,null,"Summer","Summer","Summer","Summer","Summer","Summer","Summer"]
[null,null,null,null,"Coincident",null,null,null,null,null,null,null,null,null,null,null,"Summer","Summer","Summer","Summer","Summer","Summer","Summer"]
[null,null,"ADJUSTMENTS - EMBEDDED GENERATION","MW","Non-coincident",null,null,null,null,null,null,null,null,null,null,null,0,0,0,0,0,0,0]
[null,null,null,null,"Coincident",null,null,null,null,null,null,null,null,null,null,null,0,0,0,0,0,0,0]
[null,null,"WEATHER CORRECTED MD 10% POE","MW","Non-coincident",null,null,null,null,null,null,null,null,null,null,null,10.551521620000001,10.58294929,10.581604130000001,10.542470379999999,10.46563952,10.44117063,10.416849389999999]
[null,null,null,null,"Coincident",null,null,null,null,null,null,null,null,null,null,null,10.551521620000001,10.58294929,10.581604130000001,10.542470379999999,10.46563952,10.44117063,10.416849389999999]
[null,null,"WEATHER CORRECTED MD 10% POE","MVA","Non-coincident",null,null,null,null,null,null,null,null,null,null,null,10.62632054,10.657971,10.6566163,10.617205139999999,10.53982963,10.515187279999999,10.490693630000001]
[null,null,null,null,"Coincident",null,null,null,null,null,null,null,null,null,null,null,10.62632054,10.657971,10.6566163,10.617205139999999,10.53982963,10.515187279999999,10.490693630000001]
[null,null,"WEATHER CORRECTED MD 50% POE","MW","Non-coincident",null,null,null,null,null,null,null,null,null,null,null,9.4055338939999995,9.4498374799999993,9.4711896590000002,9.4650761800000005,9.4307841450000005,9.4343039710000003,9.4372524880000004]
[null,null,null,null,"Coincident",null,null,null,null,null,null,null,null,null,null,null,9.4055338939999995,9.4498374799999993,9.4711896590000002,9.4650761800000005,9.4307841450000005,9.4343039710000003,9.4372524880000004]
[null,null,"WEATHER CORRECTED MD 50% POE","MVA","Non-coincident",null,null,null,null,null,null,null,null,null,null,null,9.4722089950000008,9.5168266460000002,9.5383301889999998,9.5321733720000008,9.4976382439999991,9.5011830219999993,9.5041524400000004]
[null,null,null,null,"Coincident",null,null,null,null,null,null,null,null,null,null,null,9.4722089950000008,9.5168266460000002,9.5383301889999998,9.5321733720000008,9.4976382439999991,9.5011830219999993,9.5041524400000004]
[null,"Baroota","CONNECTION POINT RATING","MVA","Non-coincident",null,null,null,null,null,null,null,null,null,null,null,11.8,11.8,11.8,11.8,11.8,11.8,11.8]
[null,null,null,null,"Coincident",null,null,null,null,null,null,null,null,null,null,null,11.8,11.8,11.8,11.8,11.8,11.8,11.8]
[null,null,"WINTER/SUMMER PEAKING",null,"Non-coincident",null,null,null,null,null,null,null,null,null,null,null,"Summer","Summer","Summer","Summer","Summer","Summer","Summer"]
[null,null,null,null,"Coincident",null,null,null,null,null,null,null,null,null,null,null,"Summer","Summer","Summer","Summer","Summer","Summer","Summer"]
[null,null,"ADJUSTMENTS - EMBEDDED GENERATION","MW","Non-coincident",null,null,null,null,null,null,null,null,null,null,null,0,0,0,0,0,0,0]
[null,null,null,null,"Coincident",null,null,null,null,null,null,null,null,null,null,null,-8.8800000000000003E-16,-8.8800000000000003E-16,-8.8800000000000003E-16,-8.8800000000000003E-16,-8.8800000000000003E-16,-8.8800000000000003E-16,-8.8800000000000003E-16]
[null,null,"WEATHER CORRECTED MD 10% POE","MW","Non-coincident",null,null,null,null,null,null,null,null,null,null,null,6.8212866329999997,6.8899211960000004,6.9342149280000003,6.9519202099999999,6.9440776389999996,6.9700572080000001,6.9950600940000003]
[null,null,null,null,"Coincident",null,null,null,null,null,null,null,null,null,null,null,6.8212866329999997,6.8899211960000004,6.9342149280000003,6.9519202099999999,6.9440776389999996,6.9700572080000001,6.9950600940000003]
[null,null,"WEATHER CORRECTED MD 10% POE","MVA","Non-coincident",null,null,null,null,null,null,null,null,null,null,null,6.8226480499999997,6.8912963109999996,6.935598884,6.9533076989999998,6.9454635629999997,6.9714483170000001,6.9964561940000003]
[null,null,null,null,"Coincident",null,null,null,null,null,null,null,null,null,null,null,6.8226480499999997,6.8912963109999996,6.935598884,6.9533076989999998,6.9454635629999997,6.9714483170000001,6.9964561940000003]
[null,null,"WEATHER CORRECTED MD 50% POE","MW","Non-coincident",null,null,null,null,null,null,null,null,null,null,null,6.1045408490000002,6.158671579,6.1950174909999998,6.2119419560000004,6.2102349859999997,6.2330141289999998,6.2547130150000001]
[null,null,null,null,"Coincident",null,null,null,null,null,null,null,null,null,null,null,6.1045408490000002,6.158671579,6.1950174909999998,6.2119419560000004,6.2102349859999997,6.2330141289999998,6.2547130150000001]
[null,null,"WEATHER CORRECTED MD 50% POE","MVA","Non-coincident",null,null,null,null,null,null,null,null,null,null,null,6.105759215,6.1599007490000002,6.1962539149999998,6.2131817580000002,6.2114744469999996,6.2342581360000002,6.255961353]
[null,null,null,null,"Coincident",null,null,null,null,null,null,null,null,null,null,null,6.105759215,6.1599007490000002,6.1962539149999998,6.2131817580000002,6.2114744469999996,6.2342581360000002,6.255961353]
[null,"Berri","CONNECTION POINT RATING","MVA","Non-coincident",null,null,null,null,null,null,null,null,null,null,null,200,200,200,200,200,200,200]
[null,null,null,null,"Coincident",null,null,null,null,null,null,null,null,null,null,null,200,200,200,200,200,200,200]
[null,null,"WINTER/SUMMER PEAKING",null,"Non-coincident",null,null,null,null,null,null,null,null,null,null,null,"Summer","Summer","Summer","Summer","Summer","Summer","Summer"]
[null,null,null,null,"Coincident",null,null,null,null,null,null,null,null,null,null,null,"Summer","Summer","Summer","Summer","Summer","Summer","Summer"]
[null,null,"ADJUSTMENTS - EMBEDDED GENERATION","MW","Non-coincident",null,null,null,null,null,null,null,null,null,null,null,0,0,0,0,0,0,0]
[null,null,null,null,"Coincident",null,null,null,null,null,null,null,null,null,null,null,0,0,0,0,0,0,0]
[null,null,"WEATHER CORRECTED MD 10% POE","MW","Non-coincident",null,null,null,null,null,null,null,null,null,null,null,93.334955089999994,93.511805749999994,93.386603710000003,92.923611059999999,92.131836719999995,91.802861640000003,91.474678999999995]
[null,null,null,null,"Coincident",null,null,null,null,null,null,null,null,null,null,null,93.334955089999994,93.511805749999994,93.386603710000003,92.923611059999999,92.131836719999995,91.802861640000003,91.474678999999995]
[null,null,"WEATHER CORRECTED MD 10% POE","MVA","Non-coincident",null,null,null,null,null,null,null,null,null,null,null,95.031729220000003,95.211794929999996,95.084316779999995,94.612907210000003,93.806738879999997,93.471783220000006,93.137634419999998]
[null,null,null,null,"Coincident",null,null,null,null,null,null,null,null,null,null,null,95.031729220000003,95.211794929999996,95.084316779999995,94.612907210000003,93.806738879999997,93.471783220000006,93.137634419999998]
[null,null,"WEATHER CORRECTED MD 50% POE","MW","Non-coincident",null,null,null,null,null,null,null,null,null,null,null,85.26703139,85.444587110000001,85.401770690000006,85.107675810000003,84.565342119999997,84.365353650000003,84.16073136]
[null,null,null,null,"Coincident",null,null,null,null,null,null,null,null,null,null,null,85.26703139,85.444587110000001,85.401770690000006,85.107675810000003,84.565342119999997,84.365353650000003,84.16073136]
[null,null,"WEATHER CORRECTED MD 50% POE","MVA","Non-coincident",null,null,null,null,null,null,null,null,null,null,null,86.817135460000003,86.997919030000006,86.954324229999997,86.654882880000002,86.10268988,85.899065750000005,85.690723550000001]
[null,null,null,null,"Coincident",null,null,null,null,null,null,null,null,null,null,null,86.817135460000003,86.997919030000006,86.954324229999997,86.654882880000002,86.10268988,85.899065750000005,85.690723550000001]
[null,"Blanche","CONNECTION POINT RATING","MVA","Non-coincident",null,null,null,null,null,null,null,null,null,null,null,134.80000000000001,134.80000000000001,134.80000000000001,134.80000000000001,134.80000000000001,134.80000000000001,134.80000000000001]
[null,null,null,null,"Coincident",null,null,null,null,null,null,null,null,null,null,null,134.80000000000001,134.80000000000001,134.80000000000001,134.80000000000001,134.80000000000001,134.80000000000001,134.80000000000001]
[null,null,"WINTER/SUMMER PEAKING",null,"Non-coincident",null,null,null,null,null,null,null,null,null,null,null,"Summer","Summer","Summer","Summer","Summer","Summer","Summer"]
[null,null,null,null,"Coincident",null,null,null,null,null,null,null,null,null,null,null,"Summer","Summer","Summer","Summer","Summer","Summer","Summer"]
[null,null,"ADJUSTMENTS - EMBEDDED GENERATION","MW","Non-coincident",null,null,null,null,null,null,null,null,null,null,null,0,0,0,0,0,0,0]
[null,null,null,null,"Coincident",null,null,null,null,null,null,null,null,null,null,null,0,0,0,0,0,0,0]
[null,null,"WEATHER CORRECTED MD 10% POE","MW","Non-coincident",null,null,null,null,null,null,null,null,null,null,null,35.149937170000001,35.148720089999998,35.07050563,34.8819765,34.567475729999998,34.45424775,34.344611329999999]
[null,null,null,null,"Coincident",null,null,null,null,null,null,null,null,null,null,null,35.149937170000001,35.148720089999998,35.07050563,34.8819765,34.567475729999998,34.45424775,34.344611329999999]
[null,null,"WEATHER CORRECTED MD 10% POE","MVA","Non-coincident",null,null,null,null,null,null,null,null,null,null,null,36.733996070000003,36.732724140000002,36.650984880000003,36.45395955,36.125285560000002,36.006954870000001,35.892377600000003]
[null,null,null,null,"Coincident",null,null,null,null,null,null,null,null,null,null,null,36.733996070000003,36.732724140000002,36.650984880000003,36.45395955,36.125285560000002,36.006954870000001,35.892377600000003]
[null,null,"WEATHER CORRECTED MD 50% POE","MW","Non-coincident",null,null,null,null,null,null,null,null,null,null,null,32.791396169999999,32.74086226,32.645121660000001,32.495708120000003,32.250829090000003,32.137617859999999,32.02585466]
[null,null,null,null,"Coincident",null,null,null,null,null,null,null,null,null,null,null,32.791396169999999,32.74086226,32.645121660000001,32.495708120000003,32.250829090000003,32.137617859999999,32.02585466]
[null,null,"WEATHER CORRECTED MD 50% POE","MVA","Non-coincident",null,null,null,null,null,null,null,null,null,null,null,34.269165610000002,34.216354350000003,34.116299130000002,33.960152149999999,33.704237460000002,33.58592428,33.469124379999997]
[null,null,null,null,"Coincident",null,null,null,null,null,null,null,null,null,null,null,34.269165610000002,34.216354350000003,34.116299130000002,33.960152149999999,33.704237460000002,33.58592428,33.469124379999997]
[null,"Brinkworth","CONNECTION POINT RATING","MVA","Non-coincident",null,null,null,null,null,null,null,null,null,null,null,24.6,24.6,24.6,24.6,24.6,24.6,24.6]
[null,null,null,null,"Coincident",null,null,null,null,null,null,null,null,null,null,null,24.6,24.6,24.6,24.6,24.6,24.6,24.6]
[null,null,"WINTER/SUMMER PEAKING",null,"Non-coincident",null,null,null,null,null,null,null,null,null,null,null,"Summer","Summer","Summer","Summer","Summer","Summer","Summer"]
[null,null,null,null,"Coincident",null,null,null,null,null,null,null,null,null,null,null,"Summer","Summer","Summer","Summer","Summer","Summer","Summer"]
[null,null,"ADJUSTMENTS - EMBEDDED GENERATION","MW","Non-coincident",null,null,null,null,null,null,null,null,null,null,null,0,0,0,0,0,0,0]
[null,null,null,null,"Coincident",null,null,null,null,null,null,null,null,null,null,null,0,0,0,0,0,0,0]
[null,null,"WEATHER CORRECTED MD 10% POE","MW","Non-coincident",null,null,null,null,null,null,null,null,null,null,null,5.1457865419999997,5.152774923,5.1482179989999999,5.1321042180000003,5.0990662000000002,5.0914418320000001,5.0837563389999998]
[null,null,null,null,"Coincident",null,null,null,null,null,null,null,null,null,null,null,5.1457865419999997,5.152774923,5.1482179989999999,5.1321042180000003,5.0990662000000002,5.0914418320000001,5.0837563389999998]
[null,null,"WEATHER CORRECTED MD 10% POE","MVA","Non-coincident",null,null,null,null,null,null,null,null,null,null,null,5.2053105049999999,5.2123797239999998,5.2077700880000002,5.1914699100000004,5.1580497249999997,5.1503371619999996,5.1425627670000003]
[null,null,null,null,"Coincident",null,null,null,null,null,null,null,null,null,null,null,5.2053105049999999,5.2123797239999998,5.2077700880000002,5.1914699100000004,5.1580497249999997,5.1503371619999996,5.1425627670000003]
[null,null,"WEATHER CORRECTED MD 50% POE","MW","Non-coincident",null,null,null,null,null,null,null,null,null,null,null,4.5920822560000003,4.6078873649999998,4.614952196,4.6084822870000002,4.5883848460000003,4.5867251600000003,4.5847577929999996]
[null,null,null,null,"Coincident",null,null,null,null,null,null,null,null,null,null,null,4.5920822560000003,4.6078873649999998,4.614952196,4.6084822870000002,4.5883848460000003,4.5867251600000003,4.5847577929999996]
[null,null,"WEATHER CORRECTED MD 50% POE","MVA","Non-coincident",null,null,null,null,null,null,null,null,null,null,null,4.6452012370000002,4.6611891710000002,4.6683357250000004,4.6617909749999997,4.6414610559999998,4.6397821720000003,4.6377920469999996]
[null,null,null,null,"Coincident",null,null,null,null,null,null,null,null,null,null,null,4.6452012370000002,4.6611891710000002,4.6683357250000004,4.6617909749999997,4.6414610559999998,4.6397821720000003,4.6377920469999996]
[null,"Bungama Industrial","CONNECTION POINT RATING","MVA","Non-coincident",null,null,null,null,null,null,null,null,null,null,null,64,64,64,64,64,64,64]
[null,null,null,null,"Coincident",null,null,null,null,null,null,null,null,null,null,null,64,64,64,64,64,64,64]
[null,null,"WINTER/SUMMER PEAKING",null,"Non-coincident",null,null,null,null,null,null,null,null,null,null,null,"Summer","Summer","Summer","Summer","Summer","Summer","Summer"]
[null,null,null,null,"Coincident",null,null,null,null,null,null,null,null,null,null,null,"Summer","Summer","Summer","Summer","Summer","Summer","Summer"]
[null,null,"ADJUSTMENTS - EMBEDDED GENERATION","MW","Non-coincident",null,null,null,null,null,null,null,null,null,null,null,0,0,0,0,0,0,0]
[null,null,null,null,"Coincident",null,null,null,null,null,null,null,null,null,null,null,0,0,0,0,0,0,0]
[null,null,"WEATHER CORRECTED MD 10% POE","MW","Non-coincident",null,null,null,null,null,null,null,null,null,null,null,19.099799282319296,19.145792087832842,19.128350994010297,19.04092580633769,18.88609643629146,18.825944380387565,18.765592479068729]
[null,null,null,null,"Coincident",null,null,null,null,null,null,null,null,null,null,null,19.099799282319296,19.145792087832842,19.128350994010297,19.04092580633769,18.88609643629146,18.825944380387565,18.765592479068729]
[null,null,"WEATHER CORRECTED MD 10% POE","MVA","Non-coincident",null,null,null,null,null,null,null,null,null,null,null,19.35717163548227,19.4037842009134,19.386108087100542,19.297504831872196,19.140589114311446,19.079626501445649,19.018461351824204]
[null,null,null,null,"Coincident",null,null,null,null,null,null,null,null,null,null,null,19.35717163548227,19.4037842009134,19.386108087100542,19.297504831872196,19.140589114311446,19.079626501445649,19.018461351824204]
[null,null,"WEATHER CORRECTED MD 50% POE","MW","Non-coincident",null,null,null,null,null,null,null,null,null,null,null,17.778135816581649,17.802265230701948,17.77893292575175,17.702728531593749,17.575271085720015,17.519147141031915,17.461966432207166]
[null,null,null,null,"Coincident",null,null,null,null,null,null,null,null,null,null,null,17.778135816581649,17.802265230701948,17.77893292575175,17.702728531593749,17.575271085720015,17.519147141031915,17.461966432207166]
[null,null,"WEATHER CORRECTED MD 50% POE","MVA","Non-coincident",null,null,null,null,null,null,null,null,null,null,null,18.017698579097431,18.042153140445343,18.018506426895176,17.94127517040576,17.812100218428821,17.755219995120282,17.697268769710416]
[null,null,null,null,"Coincident",null,null,null,null,null,null,null,null,null,null,null,18.017698579097431,18.042153140445343,18.018506426895176,17.94127517040576,17.812100218428821,17.755219995120282,17.697268769710416]
[null,"Bungama Rural","CONNECTION POINT RATING","MVA","Non-coincident",null,null,null,null,null,null,null,null,null,null,null,64,64,64,64,64,64,64]
[null,null,null,null,"Coincident",null,null,null,null,null,null,null,null,null,null,null,64,64,64,64,64,64,64]
[null,null,"WINTER/SUMMER PEAKING",null,"Non-coincident",null,null,null,null,null,null,null,null,null,null,null,"Summer","Summer","Summer","Summer","Summer","Summer","Summer"]
[null,null,null,null,"Coincident",null,null,null,null,null,null,null,null,null,null,null,"Summer","Summer","Summer","Summer","Summer","Summer","Summer"]
[null,null,"ADJUSTMENTS - EMBEDDED GENERATION","MW","Non-coincident",null,null,null,null,null,null,null,null,null,null,null,0,0,0,0,0,0,0]
[null,null,null,null,"Coincident",null,null,null,null,null,null,null,null,null,null,null,0,0,0,0,0,0,0]
[null,null,"WEATHER CORRECTED MD 10% POE","MW","Non-coincident",null,null,null,null,null,null,null,null,null,null,null,19.234428273321072,19.280745268890655,19.263181237814759,19.175139815142479,19.019219097404129,18.958643046961161,18.897865742450414]
[null,null,null,null,"Coincident",null,null,null,null,null,null,null,null,null,null,null,19.234428273321072,19.280745268890655,19.263181237814759,19.175139815142479,19.019219097404129,18.958643046961161,18.897865742450414]
[null,null,"WEATHER CORRECTED MD 10% POE","MVA","Non-coincident",null,null,null,null,null,null,null,null,null,null,null,19.493614770167227,19.540555894163777,19.522755186509261,19.433527392421919,19.275505621105562,19.21411330031783,19.152517015151126]
[null,null,null,null,"Coincident",null,null,null,null,null,null,null,null,null,null,null,19.493614770167227,19.540555894163777,19.522755186509261,19.433527392421919,19.275505621105562,19.21411330031783,19.152517015151126]
[null,null,"WEATHER CORRECTED MD 50% POE","MW","Non-coincident",null,null,null,null,null,null,null,null,null,null,null,17.903448781995611,17.927748277415116,17.904251509758961,17.827509972747063,17.699154116001047,17.642634569771133,17.585050810578156]
[null,null,null,null,"Coincident",null,null,null,null,null,null,null,null,null,null,null,17.903448781995611,17.927748277415116,17.904251509758961,17.827509972747063,17.699154116001047,17.642634569771133,17.585050810578156]
[null,null,"WEATHER CORRECTED MD 50% POE","MVA","Non-coincident",null,null,null,null,null,null,null,null,null,null,null,18.14470015351311,18.169327088029505,18.1455136955976,18.06773805819709,17.937652589141397,17.880371433500596,17.822011726572736]
[null,null,null,null,"Coincident",null,null,null,null,null,null,null,null,null,null,null,18.14470015351311,18.169327088029505,18.1455136955976,18.06773805819709,17.937652589141397,17.880371433500596,17.822011726572736]
[null,"Clare North","CONNECTION POINT RATING","MVA","Non-coincident",null,null,null,null,null,null,null,null,null,null,null,50,50,50,50,50,50,50]
[null,null,null,null,"Coincident",null,null,null,null,null,null,null,null,null,null,null,50,50,50,50,50,50,50]
[null,null,"WINTER/SUMMER PEAKING",null,"Non-coincident",null,null,null,null,null,null,null,null,null,null,null,"Summer","Summer","Summer","Summer","Summer","Summer","Summer"]
[null,null,null,null,"Coincident",null,null,null,null,null,null,null,null,null,null,null,"Summer","Summer","Summer","Summer","Summer","Summer","Summer"]
[null,null,"ADJUSTMENTS - EMBEDDED GENERATION","MW","Non-coincident",null,null,null,null,null,null,null,null,null,null,null,0,0,0,0,0,0,0]
[null,null,null,null,"Coincident",null,null,null,null,null,null,null,null,null,null,null,0,0,0,0,0,0,0]
[null,null,"WEATHER CORRECTED MD 10% POE","MW","Non-coincident",null,null,null,null,null,null,null,null,null,null,null,12.165857190000001,12.103700310000001,12.00314668,11.860403209999999,11.67742108,11.55470687,11.4333122]
[null,null,null,null,"Coincident",null,null,null,null,null,null,null,null,null,null,null,12.165857190000001,12.103700310000001,12.00314668,11.860403209999999,11.67742108,11.55470687,11.4333122]
[null,null,"WEATHER CORRECTED MD 10% POE","MVA","Non-coincident",null,null,null,null,null,null,null,null,null,null,null,12.53270857,12.46867741,12.36509167,12.21804388,12.029544080000001,11.903129529999999,11.778074289999999]
[null,null,null,null,"Coincident",null,null,null,null,null,null,null,null,null,null,null,12.53270857,12.46867741,12.36509167,12.21804388,12.029544080000001,11.903129529999999,11.778074289999999]
[null,null,"WEATHER CORRECTED MD 50% POE","MW","Non-coincident",null,null,null,null,null,null,null,null,null,null,null,10.954898890000001,10.889569829999999,10.79679994,10.673320609999999,10.52015368,10.410936749999999,10.302202960000001]
[null,null,null,null,"Coincident",null,null,null,null,null,null,null,null,null,null,null,10.954898890000001,10.889569829999999,10.79679994,10.673320609999999,10.52015368,10.410936749999999,10.302202960000001]
[null,null,"WEATHER CORRECTED MD 50% POE","MVA","Non-coincident",null,null,null,null,null,null,null,null,null,null,null,11.28523483,11.217935819999999,11.122368529999999,10.995165780000001,10.83738024,10.724869959999999,10.612857399999999]
[null,null,null,null,"Coincident",null,null,null,null,null,null,null,null,null,null,null,11.28523483,11.217935819999999,11.122368529999999,10.995165780000001,10.83738024,10.724869959999999,10.612857399999999]
[null,"Dalrymple","CONNECTION POINT RATING","MVA","Non-coincident",null,null,null,null,null,null,null,null,null,null,null,63,63,63,63,63,63,63]
[null,null,null,null,"Coincident",null,null,null,null,null,null,null,null,null,null,null,63,63,63,63,63,63,63]
[null,null,"WINTER/SUMMER PEAKING",null,"Non-coincident",null,null,null,null,null,null,null,null,null,null,null,"Summer","Summer","Summer","Summer","Summer","Summer","Summer"]
[null,null,null,null,"Coincident",null,null,null,null,null,null,null,null,null,null,null,"Summer","Summer","Summer","Summer","Summer","Summer","Summer"]
[null,null,"ADJUSTMENTS - EMBEDDED GENERATION","MW","Non-coincident",null,null,null,null,null,null,null,null,null,null,null,0,0,0,0,0,0,0]
[null,null,null,null,"Coincident",null,null,null,null,null,null,null,null,null,null,null,0,0,0,0,0,0,0]
[null,null,"WEATHER CORRECTED MD 10% POE","MW","Non-coincident",null,null,null,null,null,null,null,null,null,null,null,7.4011511219999999,7.3875980300000004,7.3514445640000003,7.2895452369999996,7.2022995679999999,7.1517581999999997,7.1018256040000001]
[null,null,null,null,"Coincident",null,null,null,null,null,null,null,null,null,null,null,7.4011511219999999,7.3875980300000004,7.3514445640000003,7.2895452369999996,7.2022995679999999,7.1517581999999997,7.1018256040000001]
[null,null,"WEATHER CORRECTED MD 10% POE","MVA","Non-coincident",null,null,null,null,null,null,null,null,null,null,null,7.5296924000000001,7.5159039209999996,7.4791225509999997,7.4161481729999998,7.3273872439999996,7.2759680859999998,7.2251682739999996]
[null,null,null,null,"Coincident",null,null,null,null,null,null,null,null,null,null,null,7.5296924000000001,7.5159039209999996,7.4791225509999997,7.4161481729999998,7.3273872439999996,7.2759680859999998,7.2251682739999996]
[null,null,"WEATHER CORRECTED MD 50% POE","MW","Non-coincident",null,null,null,null,null,null,null,null,null,null,null,6.5003257919999999,6.4797057469999997,6.4437078169999999,6.3896331860000002,6.3173685290000003,6.2712161569999996,6.2252924649999999]
[null,null,null,null,"Coincident",null,null,null,null,null,null,null,null,null,null,null,6.5003257919999999,6.4797057469999997,6.4437078169999999,6.3896331860000002,6.3173685290000003,6.2712161569999996,6.2252924649999999]
[null,null,"WEATHER CORRECTED MD 50% POE","MVA","Non-coincident",null,null,null,null,null,null,null,null,null,null,null,6.6132217689999999,6.5922435999999998,6.5556204669999998,6.5006066819999999,6.4270869509999997,6.3801330170000004,6.3334117340000002]
[null,null,null,null,"Coincident",null,null,null,null,null,null,null,null,null,null,null,6.6132217689999999,6.5922435999999998,6.5556204669999998,6.5006066819999999,6.4270869509999997,6.3801330170000004,6.3334117340000002]
[null,"Playford (Davenport West)","CONNECTION POINT RATING","MVA","Non-coincident",null,null,null,null,null,null,null,null,null,null,null,46,46,46,46,46,46,46]
[null,null,null,null,"Coincident",null,null,null,null,null,null,null,null,null,null,null,46,46,46,46,46,46,46]
[null,null,"WINTER/SUMMER PEAKING",null,"Non-coincident",null,null,null,null,null,null,null,null,null,null,null,"Summer","Summer","Summer","Summer","Summer","Summer","Summer"]
[null,null,null,null,"Coincident",null,null,null,null,null,null,null,null,null,null,null,"Summer","Summer","Summer","Summer","Summer","Summer","Summer"]
[null,null,"ADJUSTMENTS - EMBEDDED GENERATION","MW","Non-coincident",null,null,null,null,null,null,null,null,null,null,null,0,0,0,0,0,0,0]
[null,null,null,null,"Coincident",null,null,null,null,null,null,null,null,null,null,null,0,0,0,0,0,0,0]
[null,null,"WEATHER CORRECTED MD 10% POE","MW","Non-coincident",null,null,null,null,null,null,null,null,null,null,null,32.27222149,32.174019440000002,31.987675880000001,31.687229070000001,31.277693899999999,31.027982120000001,30.780435229999998]
[null,null,null,null,"Coincident",null,null,null,null,null,null,null,null,null,null,null,32.27222149,32.174019440000002,31.987675880000001,31.687229070000001,31.277693899999999,31.027982120000001,30.780435229999998]
[null,null,"WEATHER CORRECTED MD 10% POE","MVA","Non-coincident",null,null,null,null,null,null,null,null,null,null,null,33.089985839999997,32.989295390000002,32.798229970000001,32.490169960000003,32.070257339999998,31.814217970000001,31.56039835]
[null,null,null,null,"Coincident",null,null,null,null,null,null,null,null,null,null,null,33.089985839999997,32.989295390000002,32.798229970000001,32.490169960000003,32.070257339999998,31.814217970000001,31.56039835]
[null,null,"WEATHER CORRECTED MD 50% POE","MW","Non-coincident",null,null,null,null,null,null,null,null,null,null,null,28.966928419999999,28.836730450000001,28.632452780000001,28.34573718,27.979579059999999,27.72962265,27.480256839999999]
[null,null,null,null,"Coincident",null,null,null,null,null,null,null,null,null,null,null,28.966928419999999,28.836730450000001,28.632452780000001,28.34573718,27.979579059999999,27.72962265,27.480256839999999]
[null,null,"WEATHER CORRECTED MD 50% POE","MVA","Non-coincident",null,null,null,null,null,null,null,null,null,null,null,29.700938050000001,29.567440919999999,29.35798694,29.064006089999999,28.688569680000001,28.432279479999998,28.17659484]
[null,null,null,null,"Coincident",null,null,null,null,null,null,null,null,null,null,null,29.700938050000001,29.567440919999999,29.35798694,29.064006089999999,28.688569680000001,28.432279479999998,28.17659484]
[null,"Dorrien","CONNECTION POINT RATING","MVA","Non-coincident",null,null,null,null,null,null,null,null,null,null,null,216,216,216,216,216,216,216]
[null,null,null,null,"Coincident",null,null,null,null,null,null,null,null,null,null,null,216,216,216,216,216,216,216]
[null,null,"WINTER/SUMMER PEAKING",null,"Non-coincident",null,null,null,null,null,null,null,null,null,null,null,"Summer","Summer","Summer","Summer","Summer","Summer","Summer"]
[null,null,null,null,"Coincident",null,null,null,null,null,null,null,null,null,null,null,"Summer","Summer","Summer","Summer","Summer","Summer","Summer"]
[null,null,"ADJUSTMENTS - EMBEDDED GENERATION","MW","Non-coincident",null,null,null,null,null,null,null,null,null,null,null,25.80696,25.80696,25.80696,25.80696,25.80696,25.80696,25.80696]
[null,null,null,null,"Coincident",null,null,null,null,null,null,null,null,null,null,null,0,0,0,0,0,0,0]
[null,null,"WEATHER CORRECTED MD 10% POE","MW","Non-coincident",null,null,null,null,null,null,null,null,null,null,null,61.953914939999997,62.005200199999997,61.857642290000001,61.487677869999999,60.901399069999997,60.622294580000002,60.344791600000001]
[null,null,null,null,"Coincident",null,null,null,null,null,null,null,null,null,null,null,61.953914939999997,62.005200199999997,61.857642290000001,61.487677869999999,60.901399069999997,60.622294580000002,60.344791600000001]
[null,null,"WEATHER CORRECTED MD 10% POE","MVA","Non-coincident",null,null,null,null,null,null,null,null,null,null,null,64.675229239999993,64.728767189999999,64.574727820000007,64.188512779999996,63.576481800000003,63.285117700000001,62.995425439999998]
[null,null,null,null,"Coincident",null,null,null,null,null,null,null,null,null,null,null,64.675229239999993,64.728767189999999,64.574727820000007,64.188512779999996,63.576481800000003,63.285117700000001,62.995425439999998]
[null,null,"WEATHER CORRECTED MD 50% POE","MW","Non-coincident",null,null,null,null,null,null,null,null,null,null,null,55.838195259999999,55.798607160000003,55.617155070000003,55.274326709999997,54.772735480000001,54.49529613,54.21686665]
[null,null,null,null,"Coincident",null,null,null,null,null,null,null,null,null,null,null,55.838195259999999,55.798607160000003,55.617155070000003,55.274326709999997,54.772735480000001,54.49529613,54.21686665]
[null,null,"WEATHER CORRECTED MD 50% POE","MVA","Non-coincident",null,null,null,null,null,null,null,null,null,null,null,58.290877690000002,58.2495507,58.06012836,57.702241319999999,57.178617799999998,56.888991969999999,56.59833253]
[null,null,null,null,"Coincident",null,null,null,null,null,null,null,null,null,null,null,58.290877690000002,58.2495507,58.06012836,57.702241319999999,57.178617799999998,56.888991969999999,56.59833253]
[null,"East Terrace (Eastern Suburbs)","CONNECTION POINT RATING","MVA","Non-coincident",null,null,null,null,null,null,null,null,null,null,null,250,250,250,250,250,250,250]
[null,null,null,null,"Coincident",null,null,null,null,null,null,null,null,null,null,null,250,250,250,250,250,250,250]
[null,null,"WINTER/SUMMER PEAKING",null,"Non-coincident",null,null,null,null,null,null,null,null,null,null,null,"Summer","Summer","Summer","Summer","Summer","Summer","Summer"]
[null,null,null,null,"Coincident",null,null,null,null,null,null,null,null,null,null,null,"Summer","Summer","Summer","Summer","Summer","Summer","Summer"]
[null,null,"ADJUSTMENTS - EMBEDDED GENERATION","MW","Non-coincident",null,null,null,null,null,null,null,null,null,null,null,4.641,4.641,4.641,4.641,4.641,4.641,4.641]
[null,null,null,null,"Coincident",null,null,null,null,null,null,null,null,null,null,null,0,0,0,0,0,0,0]
[null,null,"WEATHER CORRECTED MD 10% POE","MW","Non-coincident",null,null,null,null,null,null,null,null,null,null,null,92.454607905209897,93.059143485276508,93.518231672294107,93.701501821240598,93.527228819707901,93.889855765411298,94.258519472029505]
[null,null,null,null,"Coincident",null,null,null,null,null,null,null,null,null,null,null,92.454607905209897,93.059143485276508,93.518231672294107,93.701501821240598,93.527228819707901,93.889855765411298,94.258519472029505]
[null,null,"WEATHER CORRECTED MD 10% POE","MVA","Non-coincident",null,null,null,null,null,null,null,null,null,null,null,93.513237979936605,94.124695646862307,94.589040514054105,94.774409164369899,94.598140688975008,94.964919794637908,95.337804815195597]
[null,null,null,null,"Coincident",null,null,null,null,null,null,null,null,null,null,null,93.513237979936605,94.124695646862307,94.589040514054105,94.774409164369899,94.598140688975008,94.964919794637908,95.337804815195597]
[null,null,"WEATHER CORRECTED MD 50% POE","MW","Non-coincident",null,null,null,null,null,null,null,null,null,null,null,82.032530846179199,82.502111754659097,82.961520303450598,83.210116998066098,83.200064179378302,83.521217313271507,83.847658449322608]
[null,null,null,null,"Coincident",null,null,null,null,null,null,null,null,null,null,null,82.032530846179199,82.502111754659097,82.961520303450598,83.210116998066098,83.200064179378302,83.521217313271507,83.847658449322608]
[null,null,"WEATHER CORRECTED MD 50% POE","MVA","Non-coincident",null,null,null,null,null,null,null,null,null,null,null,82.971825343395807,83.446783069205495,83.911451970485999,84.162895162149312,84.152727237854094,84.477557658480009,84.807736638688695]
[null,null,null,null,"Coincident",null,null,null,null,null,null,null,null,null,null,null,82.971825343395807,83.446783069205495,83.911451970485999,84.162895162149312,84.152727237854094,84.477557658480009,84.807736638688695]
[null,"Happy Valley (Southern Suburbs)","CONNECTION POINT RATING","MVA","Non-coincident",null,null,null,null,null,null,null,null,null,null,null,540,540,540,540,540,540,540]
[null,null,null,null,"Coincident",null,null,null,null,null,null,null,null,null,null,null,540,540,540,540,540,540,540]
[null,null,"WINTER/SUMMER PEAKING",null,"Non-coincident",null,null,null,null,null,null,null,null,null,null,null,"Summer","Summer","Summer","Summer","Summer","Summer","Summer"]
[null,null,null,null,"Coincident",null,null,null,null,null,null,null,null,null,null,null,"Summer","Summer","Summer","Summer","Summer","Summer","Summer"]
[null,null,"ADJUSTMENTS - EMBEDDED GENERATION","MW","Non-coincident",null,null,null,null,null,null,null,null,null,null,null,8.7296700000000005,8.7296700000000005,8.7296700000000005,8.7296700000000005,8.7296700000000005,8.7296700000000005,8.7296700000000005]
[null,null,null,null,"Coincident",null,null,null,null,null,null,null,null,null,null,null,5.7210000000000001,5.7210000000000001,5.7210000000000001,5.7210000000000001,5.7210000000000001,5.7210000000000001,5.7210000000000001]
[null,null,"WEATHER CORRECTED MD 10% POE","MW","Non-coincident",null,null,null,null,null,null,null,null,null,null,null,252.219578366625,254.70157984639502,256.52336854892252,257.46582720386999,257.43720609824999,258.66468730482001,259.89201419685753]
[null,null,null,null,"Coincident",null,null,null,null,null,null,null,null,null,null,null,252.219578366625,254.70157984639502,256.52336854892252,257.46582720386999,257.43720609824999,258.66468730482001,259.89201419685753]
[null,null,"WEATHER CORRECTED MD 10% POE","MVA","Non-coincident",null,null,null,null,null,null,null,null,null,null,null,253.65658427619752,256.15272680460004,257.98489504111501,258.93272330368501,258.90393909669751,260.13841384060504,261.37273335042755]
[null,null,null,null,"Coincident",null,null,null,null,null,null,null,null,null,null,null,253.65658427619752,256.15272680460004,257.98489504111501,258.93272330368501,258.90393909669751,260.13841384060504,261.37273335042755]
[null,null,"WEATHER CORRECTED MD 50% POE","MW","Non-coincident",null,null,null,null,null,null,null,null,null,null,null,222.04313000046002,224.05510831614751,225.65941828872002,226.66030295954999,226.9558453961175,228.27306876228002,229.61942719579503]
[null,null,null,null,"Coincident",null,null,null,null,null,null,null,null,null,null,null,222.04313000046002,224.05510831614751,225.65941828872002,226.66030295954999,226.9558453961175,228.27306876228002,229.61942719579503]
[null,null,"WEATHER CORRECTED MD 50% POE","MVA","Non-coincident",null,null,null,null,null,null,null,null,null,null,null,223.3082073834525,225.331648840605,226.94509926720002,227.95168642365749,228.24891269708252,229.57364087177251,230.92767011007001]
[null,null,null,null,"Coincident",null,null,null,null,null,null,null,null,null,null,null,223.3082073834525,225.331648840605,226.94509926720002,227.95168642365749,228.24891269708252,229.57364087177251,230.92767011007001]
[null,"Hummocks","CONNECTION POINT RATING","MVA","Non-coincident",null,null,null,null,null,null,null,null,null,null,null,50,50,50,50,50,50,50]
[null,null,null,null,"Coincident",null,null,null,null,null,null,null,null,null,null,null,50,50,50,50,50,50,50]
[null,null,"WINTER/SUMMER PEAKING",null,"Non-coincident",null,null,null,null,null,null,null,null,null,null,null,"Summer","Summer","Summer","Summer","Summer","Summer","Summer"]
[null,null,null,null,"Coincident",null,null,null,null,null,null,null,null,null,null,null,"Summer","Summer","Summer","Summer","Summer","Summer","Summer"]
[null,null,"ADJUSTMENTS - EMBEDDED GENERATION","MW","Non-coincident",null,null,null,null,null,null,null,null,null,null,null,0,0,0,0,0,0,0]
[null,null,null,null,"Coincident",null,null,null,null,null,null,null,null,null,null,null,0,0,0,0,0,0,0]
[null,null,"WEATHER CORRECTED MD 10% POE","MW","Non-coincident",null,null,null,null,null,null,null,null,null,null,null,14.542540649999999,14.55371587,14.517809229999999,14.42953657,14.290563669999999,14.22368404,14.15713135]
[null,null,null,null,"Coincident",null,null,null,null,null,null,null,null,null,null,null,14.542540649999999,14.55371587,14.517809229999999,14.42953657,14.290563669999999,14.22368404,14.15713135]
[null,null,"WEATHER CORRECTED MD 10% POE","MVA","Non-coincident",null,null,null,null,null,null,null,null,null,null,null,14.84634185,14.85775052,14.82109378,14.73097705,14.58910094,14.52082416,14.452881140000001]
[null,null,null,null,"Coincident",null,null,null,null,null,null,null,null,null,null,null,14.84634185,14.85775052,14.82109378,14.73097705,14.58910094,14.52082416,14.452881140000001]
[null,null,"WEATHER CORRECTED MD 50% POE","MW","Non-coincident",null,null,null,null,null,null,null,null,null,null,null,13.364959689999999,13.35710821,13.31479571,13.233616550000001,13.11445091,13.048924939999999,12.983068060000001]
[null,null,null,null,"Coincident",null,null,null,null,null,null,null,null,null,null,null,13.364959689999999,13.35710821,13.31479571,13.233616550000001,13.11445091,13.048924939999999,12.983068060000001]
[null,null,"WEATHER CORRECTED MD 50% POE","MVA","Non-coincident",null,null,null,null,null,null,null,null,null,null,null,13.644160619999999,13.636145109999999,13.592948679999999,13.510073650000001,13.388418570000001,13.321523729999999,13.25429106]
[null,null,null,null,"Coincident",null,null,null,null,null,null,null,null,null,null,null,13.644160619999999,13.636145109999999,13.592948679999999,13.510073650000001,13.388418570000001,13.321523729999999,13.25429106]
[null,"Kadina East","CONNECTION POINT RATING","MVA","Non-coincident",null,null,null,null,null,null,null,null,null,null,null,120,120,120,120,120,120,120]
[null,null,null,null,"Coincident",null,null,null,null,null,null,null,null,null,null,null,120,120,120,120,120,120,120]
[null,null,"WINTER/SUMMER PEAKING",null,"Non-coincident",null,null,null,null,null,null,null,null,null,null,null,"Summer","Summer","Summer","Summer","Summer","Summer","Summer"]
[null,null,null,null,"Coincident",null,null,null,null,null,null,null,null,null,null,null,"Summer","Summer","Summer","Summer","Summer","Summer","Summer"]
[null,null,"ADJUSTMENTS - EMBEDDED GENERATION","MW","Non-coincident",null,null,null,null,null,null,null,null,null,null,null,0,0,0,0,0,0,0]
[null,null,null,null,"Coincident",null,null,null,null,null,null,null,null,null,null,null,0,0,0,0,0,0,0]
[null,null,"WEATHER CORRECTED MD 10% POE","MW","Non-coincident",null,null,null,null,null,null,null,null,null,null,null,29.101714080000001,29.117281890000001,29.043056329999999,28.86604986,28.587281999999998,28.45287956,28.3198674]
[null,null,null,null,"Coincident",null,null,null,null,null,null,null,null,null,null,null,29.101714080000001,29.117281890000001,29.043056329999999,28.86604986,28.587281999999998,28.45287956,28.3198674]
[null,null,"WEATHER CORRECTED MD 10% POE","MVA","Non-coincident",null,null,null,null,null,null,null,null,null,null,null,30.13734663,30.153468440000001,30.076601440000001,29.893295899999998,29.60460763,29.46542225,29.32767664]
[null,null,null,null,"Coincident",null,null,null,null,null,null,null,null,null,null,null,30.13734663,30.153468440000001,30.076601440000001,29.893295899999998,29.60460763,29.46542225,29.32767664]
[null,null,"WEATHER CORRECTED MD 50% POE","MW","Non-coincident",null,null,null,null,null,null,null,null,null,null,null,25.967574290000002,25.9784842,25.926792460000001,25.801114739999999,25.60046449,25.504157469999999,25.407585210000001]
[null,null,null,null,"Coincident",null,null,null,null,null,null,null,null,null,null,null,25.967574290000002,25.9784842,25.926792460000001,25.801114739999999,25.60046449,25.504157469999999,25.407585210000001]
[null,null,"WEATHER CORRECTED MD 50% POE","MVA","Non-coincident",null,null,null,null,null,null,null,null,null,null,null,26.891673300000001,26.902971449999999,26.849440170000001,26.719290010000002,26.51149929,26.411765030000002,26.311756079999999]
[null,null,null,null,"Coincident",null,null,null,null,null,null,null,null,null,null,null,26.891673300000001,26.902971449999999,26.849440170000001,26.719290010000002,26.51149929,26.411765030000002,26.311756079999999]
[null,"Kanmantoo","CONNECTION POINT RATING","MVA","Non-coincident",null,null,null,null,null,null,null,null,null,null,null,3,3,3,3,3,3,3]
[null,null,null,null,"Coincident",null,null,null,null,null,null,null,null,null,null,null,3,3,3,3,3,3,3]
[null,null,"WINTER/SUMMER PEAKING",null,"Non-coincident",null,null,null,null,null,null,null,null,null,null,null,"Summer","Summer","Summer","Summer","Summer","Summer","Summer"]
[null,null,null,null,"Coincident",null,null,null,null,null,null,null,null,null,null,null,"Summer","Summer","Summer","Summer","Summer","Summer","Summer"]
[null,null,"ADJUSTMENTS - EMBEDDED GENERATION","MW","Non-coincident",null,null,null,null,null,null,null,null,null,null,null,0,0,0,0,0,0,0]
[null,null,null,null,"Coincident",null,null,null,null,null,null,null,null,null,null,null,0,0,0,0,0,0,0]
[null,null,"WEATHER CORRECTED MD 10% POE","MW","Non-coincident",null,null,null,null,null,null,null,null,null,null,null,1.7448605210000001,1.7828253540000001,1.8150004319999999,1.8402209869999999,1.858200879,1.884861372,1.911079236]
[null,null,null,null,"Coincident",null,null,null,null,null,null,null,null,null,null,null,1.7448605210000001,1.7828253540000001,1.8150004319999999,1.8402209869999999,1.858200879,1.884861372,1.911079236]
[null,null,"WEATHER CORRECTED MD 10% POE","MVA","Non-coincident",null,null,null,null,null,null,null,null,null,null,null,1.7691332870000001,1.8076262489999999,1.8402489150000001,1.865820313,1.8840503230000001,1.9110816909999999,1.937664271]
[null,null,null,null,"Coincident",null,null,null,null,null,null,null,null,null,null,null,1.7691332870000001,1.8076262489999999,1.8402489150000001,1.865820313,1.8840503230000001,1.9110816909999999,1.937664271]
[null,null,"WEATHER CORRECTED MD 50% POE","MW","Non-coincident",null,null,null,null,null,null,null,null,null,null,null,1.5546115819999999,1.5886132390000001,1.6185654039999999,1.6435048480000001,1.6631182790000001,1.6889919090000001,1.7144458819999999]
[null,null,null,null,"Coincident",null,null,null,null,null,null,null,null,null,null,null,1.5546115819999999,1.5886132390000001,1.6185654039999999,1.6435048480000001,1.6631182790000001,1.6889919090000001,1.7144458819999999]
[null,null,"WEATHER CORRECTED MD 50% POE","MVA","Non-coincident",null,null,null,null,null,null,null,null,null,null,null,1.576237793,1.6107124479999999,1.6410812770000001,1.6663676540000001,1.686253928,1.7124874859999999,1.7382955490000001]
[null,null,null,null,"Coincident",null,null,null,null,null,null,null,null,null,null,null,1.576237793,1.6107124479999999,1.6410812770000001,1.6663676540000001,1.686253928,1.7124874859999999,1.7382955490000001]
[null,"Keith","CONNECTION POINT RATING","MVA","Non-coincident",null,null,null,null,null,null,null,null,null,null,null,67.099999999999994,67.099999999999994,67.099999999999994,67.099999999999994,67.099999999999994,67.099999999999994,67.099999999999994]
[null,null,null,null,"Coincident",null,null,null,null,null,null,null,null,null,null,null,67.099999999999994,67.099999999999994,67.099999999999994,67.099999999999994,67.099999999999994,67.099999999999994,67.099999999999994]
[null,null,"WINTER/SUMMER PEAKING",null,"Non-coincident",null,null,null,null,null,null,null,null,null,null,null,"Summer","Summer","Summer","Summer","Summer","Summer","Summer"]
[null,null,null,null,"Coincident",null,null,null,null,null,null,null,null,null,null,null,"Summer","Summer","Summer","Summer","Summer","Summer","Summer"]
[null,null,"ADJUSTMENTS - EMBEDDED GENERATION","MW","Non-coincident",null,null,null,null,null,null,null,null,null,null,null,0,0,0,0,0,0,0]
[null,null,null,null,"Coincident",null,null,null,null,null,null,null,null,null,null,null,0,0,0,0,0,0,0]
[null,null,"WEATHER CORRECTED MD 10% POE","MW","Non-coincident",null,null,null,null,null,null,null,null,null,null,null,24.1609771,24.150982299999999,24.05953186,23.880169980000002,23.617870979999999,23.475246200000001,23.333048789999999]
[null,null,null,null,"Coincident",null,null,null,null,null,null,null,null,null,null,null,24.1609771,24.150982299999999,24.05953186,23.880169980000002,23.617870979999999,23.475246200000001,23.333048789999999]
[null,null,"WEATHER CORRECTED MD 10% POE","MVA","Non-coincident",null,null,null,null,null,null,null,null,null,null,null,24.398870850000002,24.38877763,24.296426759999999,24.115298840000001,23.850417190000002,23.706388109999999,23.562790589999999]
[null,null,null,null,"Coincident",null,null,null,null,null,null,null,null,null,null,null,24.398870850000002,24.38877763,24.296426759999999,24.115298840000001,23.850417190000002,23.706388109999999,23.562790589999999]
[null,null,"WEATHER CORRECTED MD 50% POE","MW","Non-coincident",null,null,null,null,null,null,null,null,null,null,null,21.686194619999998,21.6580847,21.570791029999999,21.419225879999999,21.20678698,21.08129469,20.954936350000001]
[null,null,null,null,"Coincident",null,null,null,null,null,null,null,null,null,null,null,21.686194619999998,21.6580847,21.570791029999999,21.419225879999999,21.20678698,21.08129469,20.954936350000001]
[null,null,"WEATHER CORRECTED MD 50% POE","MVA","Non-coincident",null,null,null,null,null,null,null,null,null,null,null,21.899721169999999,21.871334470000001,21.783181290000002,21.630123810000001,21.415593189999999,21.288865269999999,21.161262789999999]
[null,null,null,null,"Coincident",null,null,null,null,null,null,null,null,null,null,null,21.899721169999999,21.871334470000001,21.783181290000002,21.630123810000001,21.415593189999999,21.288865269999999,21.161262789999999]
[null,"Kilburn (Western Suburbs)","CONNECTION POINT RATING","MVA","Non-coincident",null,null,null,null,null,null,null,null,null,null,null,353,353,353,353,353,353,353]
[null,null,null,null,"Coincident",null,null,null,null,null,null,null,null,null,null,null,353,353,353,353,353,353,353]
[null,null,"WINTER/SUMMER PEAKING",null,"Non-coincident",null,null,null,null,null,null,null,null,null,null,null,"Summer","Summer","Summer","Summer","Summer","Summer","Summer"]
[null,null,null,null,"Coincident",null,null,null,null,null,null,null,null,null,null,null,"Summer","Summer","Summer","Summer","Summer","Summer","Summer"]
[null,null,"ADJUSTMENTS - EMBEDDED GENERATION","MW","Non-coincident",null,null,null,null,null,null,null,null,null,null,null,2.3589000000000002,2.3589000000000002,2.3589000000000002,2.3589000000000002,2.3589000000000002,2.3589000000000002,2.3589000000000002]
[null,null,null,null,"Coincident",null,null,null,null,null,null,null,null,null,null,null,8.7296700000000005,8.7296700000000005,8.7296700000000005,8.7296700000000005,8.7296700000000005,8.7296700000000005,8.7296700000000005]
[null,null,"WEATHER CORRECTED MD 10% POE","MW","Non-coincident",null,null,null,null,null,null,null,null,null,null,null,90.679159386197156,91.368204939748992,91.751540554585972,91.792811413659962,91.499517364214,91.656048009916589,91.805034279836036]
[null,null,null,null,"Coincident",null,null,null,null,null,null,null,null,null,null,null,90.679159386197156,91.368204939748992,91.751540554585972,91.792811413659962,91.499517364214,91.656048009916589,91.805034279836036]
[null,null,"WEATHER CORRECTED MD 10% POE","MVA","Non-coincident",null,null,null,null,null,null,null,null,null,null,null,91.003747264914409,91.695259255492203,92.079967047229346,92.121385627653439,91.827041727667535,91.984132667703122,92.133652249167014]
[null,null,null,null,"Coincident",null,null,null,null,null,null,null,null,null,null,null,91.003747264914409,91.695259255492203,92.079967047229346,92.121385627653439,91.827041727667535,91.984132667703122,92.133652249167014]
[null,null,"WEATHER CORRECTED MD 50% POE","MW","Non-coincident",null,null,null,null,null,null,null,null,null,null,null,82.071721588015862,82.57248830101851,82.851620609351571,82.880290327741406,82.662463509764947,82.774124950222316,82.876343544752572]
[null,null,null,null,"Coincident",null,null,null,null,null,null,null,null,null,null,null,82.071721588015862,82.57248830101851,82.851620609351571,82.880290327741406,82.662463509764947,82.774124950222316,82.876343544752572]
[null,null,"WEATHER CORRECTED MD 50% POE","MVA","Non-coincident",null,null,null,null,null,null,null,null,null,null,null,82.365498968396466,82.868058202959702,83.148189647671728,83.176962003751711,82.958355460506439,83.070416607062242,83.173001085033121]
[null,null,null,null,"Coincident",null,null,null,null,null,null,null,null,null,null,null,82.365498968396466,82.868058202959702,83.148189647671728,83.176962003751711,82.958355460506439,83.070416607062242,83.173001085033121]
[null,"Kincraig","CONNECTION POINT RATING","MVA","Non-coincident",null,null,null,null,null,null,null,null,null,null,null,56.1,56.1,56.1,56.1,56.1,56.1,56.1]
[null,null,null,null,"Coincident",null,null,null,null,null,null,null,null,null,null,null,56.1,56.1,56.1,56.1,56.1,56.1,56.1]
[null,null,"WINTER/SUMMER PEAKING",null,"Non-coincident",null,null,null,null,null,null,null,null,null,null,null,"Summer","Summer","Summer","Summer","Summer","Summer","Summer"]
[null,null,null,null,"Coincident",null,null,null,null,null,null,null,null,null,null,null,"Summer","Summer","Summer","Summer","Summer","Summer","Summer"]
[null,null,"ADJUSTMENTS - EMBEDDED GENERATION","MW","Non-coincident",null,null,null,null,null,null,null,null,null,null,null,0,0,0,0,0,0,0]
[null,null,null,null,"Coincident",null,null,null,null,null,null,null,null,null,null,null,0,0,0,0,0,0,0]
[null,null,"WEATHER CORRECTED MD 10% POE","MW","Non-coincident",null,null,null,null,null,null,null,null,null,null,null,22.38915819,22.268676169999999,22.076594249999999,21.806568840000001,21.4627968,21.22991004,20.999390569999999]
[null,null,null,null,"Coincident",null,null,null,null,null,null,null,null,null,null,null,22.38915819,22.268676169999999,22.076594249999999,21.806568840000001,21.4627968,21.22991004,20.999390569999999]
[null,null,"WEATHER CORRECTED MD 10% POE","MVA","Non-coincident",null,null,null,null,null,null,null,null,null,null,null,22.988531030000001,22.86482363,22.667599540000001,22.390345360000001,22.037370320000001,21.79824902,21.561558389999998]
[null,null,null,null,"Coincident",null,null,null,null,null,null,null,null,null,null,null,22.988531030000001,22.86482363,22.667599540000001,22.390345360000001,22.037370320000001,21.79824902,21.561558389999998]
[null,null,"WEATHER CORRECTED MD 50% POE","MW","Non-coincident",null,null,null,null,null,null,null,null,null,null,null,20.089729519999999,19.961993320000001,19.783018949999999,19.547439050000001,19.25772503,19.04858158,18.840270830000001]
[null,null,null,null,"Coincident",null,null,null,null,null,null,null,null,null,null,null,20.089729519999999,19.961993320000001,19.783018949999999,19.547439050000001,19.25772503,19.04858158,18.840270830000001]
[null,null,"WEATHER CORRECTED MD 50% POE","MVA","Non-coincident",null,null,null,null,null,null,null,null,null,null,null,20.627545099999999,20.496389319999999,20.312623680000002,20.070737149999999,19.773267300000001,19.558524930000001,19.344637559999999]
[null,null,null,null,"Coincident",null,null,null,null,null,null,null,null,null,null,null,20.627545099999999,20.496389319999999,20.312623680000002,20.070737149999999,19.773267300000001,19.558524930000001,19.344637559999999]
[null,"Le Fevre (Western Suburbs)","CONNECTION POINT RATING","MVA","Non-coincident",null,null,null,null,null,null,null,null,null,null,null,360,360,360,360,360,360,360]
[null,null,null,null,"Coincident",null,null,null,null,null,null,null,null,null,null,null,360,360,360,360,360,360,360]
[null,null,"WINTER/SUMMER PEAKING",null,"Non-coincident",null,null,null,null,null,null,null,null,null,null,null,"Summer","Summer","Summer","Summer","Summer","Summer","Summer"]
[null,null,null,null,"Coincident",null,null,null,null,null,null,null,null,null,null,null,"Summer","Summer","Summer","Summer","Summer","Summer","Summer"]
[null,null,"ADJUSTMENTS - EMBEDDED GENERATION","MW","Non-coincident",null,null,null,null,null,null,null,null,null,null,null,2.3589000000000002,2.3589000000000002,2.3589000000000002,2.3589000000000002,2.3589000000000002,2.3589000000000002,2.3589000000000002]
[null,null,null,null,"Coincident",null,null,null,null,null,null,null,null,null,null,null,8.7296700000000005,8.7296700000000005,8.7296700000000005,8.7296700000000005,8.7296700000000005,8.7296700000000005,8.7296700000000005]
[null,null,"WEATHER CORRECTED MD 10% POE","MW","Non-coincident",null,null,null,null,null,null,null,null,null,null,null,53.797465043515786,54.206256923938057,54.433679459377508,54.458164331241981,54.284160993767919,54.377026344499271,54.465415823429268]
[null,null,null,null,"Coincident",null,null,null,null,null,null,null,null,null,null,null,53.797465043515786,54.206256923938057,54.433679459377508,54.458164331241981,54.284160993767919,54.377026344499271,54.465415823429268]
[null,null,"WEATHER CORRECTED MD 10% POE","MVA","Non-coincident",null,null,null,null,null,null,null,null,null,null,null,53.990034153960117,54.400289304008894,54.628525914471972,54.653098425373045,54.478472240288724,54.571669998322903,54.66037587640529]
[null,null,null,null,"Coincident",null,null,null,null,null,null,null,null,null,null,null,53.990034153960117,54.400289304008894,54.628525914471972,54.653098425373045,54.478472240288724,54.571669998322903,54.66037587640529]
[null,null,"WEATHER CORRECTED MD 50% POE","MW","Non-coincident",null,null,null,null,null,null,null,null,null,null,null,48.690907625071297,48.987998819123732,49.153600382941818,49.170609342699763,49.041378649506854,49.107624328010886,49.168267824303335]
[null,null,null,null,"Coincident",null,null,null,null,null,null,null,null,null,null,null,48.690907625071297,48.987998819123732,49.153600382941818,49.170609342699763,49.041378649506854,49.107624328010886,49.168267824303335]
[null,null,"WEATHER CORRECTED MD 50% POE","MVA","Non-coincident",null,null,null,null,null,null,null,null,null,null,null,48.865197709569003,49.163352357634992,49.329546681738734,49.346616533630957,49.216923250762783,49.283406063962417,49.344266628892683]
[null,null,null,null,"Coincident",null,null,null,null,null,null,null,null,null,null,null,48.865197709569003,49.163352357634992,49.329546681738734,49.346616533630957,49.216923250762783,49.283406063962417,49.344266628892683]
[null,"Leigh Creek South","CONNECTION POINT RATING","MVA","Non-coincident",null,null,null,null,null,null,null,null,null,null,null,10,10,10,10,10,10,10]
[null,null,null,null,"Coincident",null,null,null,null,null,null,null,null,null,null,null,10,10,10,10,10,10,10]
[null,null,"WINTER/SUMMER PEAKING",null,"Non-coincident",null,null,null,null,null,null,null,null,null,null,null,"Summer","Summer","Summer","Summer","Summer","Summer","Summer"]
[null,null,null,null,"Coincident",null,null,null,null,null,null,null,null,null,null,null,"Summer","Summer","Summer","Summer","Summer","Summer","Summer"]
[null,null,"ADJUSTMENTS - EMBEDDED GENERATION","MW","Non-coincident",null,null,null,null,null,null,null,null,null,null,null,0,0,0,0,0,0,0]
[null,null,null,null,"Coincident",null,null,null,null,null,null,null,null,null,null,null,0,0,0,0,0,0,0]
[null,null,"WEATHER CORRECTED MD 10% POE","MW","Non-coincident",null,null,null,null,null,null,null,null,null,null,null,0.90927279500000002,0.90604980899999998,0.90030238299999998,0.89152608099999997,0.87965610100000002,0.87229986299999995,0.86507510399999998]
[null,null,null,null,"Coincident",null,null,null,null,null,null,null,null,null,null,null,0.90927279500000002,0.90604980899999998,0.90030238299999998,0.89152608099999997,0.87965610100000002,0.87229986299999995,0.86507510399999998]
[null,null,"WEATHER CORRECTED MD 10% POE","MVA","Non-coincident",null,null,null,null,null,null,null,null,null,null,null,0.91001599399999999,0.90679037299999998,0.90103824899999996,0.89225477399999997,0.88037509199999997,0.87301284099999998,0.86578217700000004]
[null,null,null,null,"Coincident",null,null,null,null,null,null,null,null,null,null,null,0.91001599399999999,0.90679037299999998,0.90103824899999996,0.89225477399999997,0.88037509199999997,0.87301284099999998,0.86578217700000004]
[null,null,"WEATHER CORRECTED MD 50% POE","MW","Non-coincident",null,null,null,null,null,null,null,null,null,null,null,0.90927279500000002,0.90639027100000003,0.90154360300000003,0.89424926100000002,0.884389702,0.87818735800000003,0.87204525899999996]
[null,null,null,null,"Coincident",null,null,null,null,null,null,null,null,null,null,null,0.90927279500000002,0.90639027100000003,0.90154360300000003,0.89424926100000002,0.884389702,0.87818735800000003,0.87204525899999996]
[null,null,"WEATHER CORRECTED MD 50% POE","MVA","Non-coincident",null,null,null,null,null,null,null,null,null,null,null,0.91001599399999999,0.90713111300000004,0.90228048400000005,0.89498018000000001,0.88511256199999999,0.87890514900000005,0.87275802899999999]
[null,null,null,null,"Coincident",null,null,null,null,null,null,null,null,null,null,null,0.91001599399999999,0.90713111300000004,0.90228048400000005,0.89498018000000001,0.88511256199999999,0.87890514900000005,0.87275802899999999]
[null,"Magill (Eastern Suburbs & Southern Suburbs)","CONNECTION POINT RATING","MVA","Non-coincident",null,null,null,null,null,null,null,null,null,null,null,630,630,630,630,630,630,630]
[null,null,null,null,"Coincident",null,null,null,null,null,null,null,null,null,null,null,630,630,630,630,630,630,630]
[null,null,"WINTER/SUMMER PEAKING",null,"Non-coincident",null,null,null,null,null,null,null,null,null,null,null,"Summer","Summer","Summer","Summer","Summer","Summer","Summer"]
[null,null,null,null,"Coincident",null,null,null,null,null,null,null,null,null,null,null,"Summer","Summer","Summer","Summer","Summer","Summer","Summer"]
[null,null,"ADJUSTMENTS - EMBEDDED GENERATION","MW","Non-coincident",null,null,null,null,null,null,null,null,null,null,null,4.641,4.641,4.641,4.641,4.641,4.641,4.641]
[null,null,null,null,"Coincident",null,null,null,null,null,null,null,null,null,null,null,0,0,0,0,0,0,0]
[null,null,"WEATHER CORRECTED MD 10% POE","MW","Non-coincident",null,null,null,null,null,null,null,null,null,null,null,249.95029811857052,251.76420008836578,253.11537167736526,253.73842014957211,253.38365632463825,254.37181759507411,255.45559088621459]
[null,null,null,null,"Coincident",null,null,null,null,null,null,null,null,null,null,null,249.95029811857052,251.76420008836578,253.11537167736526,253.73842014957211,253.38365632463825,254.37181759507411,255.45559088621459]
[null,null,"WEATHER CORRECTED MD 10% POE","MVA","Non-coincident",null,null,null,null,null,null,null,null,null,null,null,252.43862120040242,254.26661431448892,255.62848681498156,256.25580716158004,255.896981193149,256.97691804239952,257.98596145659695]
[null,null,null,null,"Coincident",null,null,null,null,null,null,null,null,null,null,null,252.43862120040242,254.26661431448892,255.62848681498156,256.25580716158004,255.896981193149,256.97691804239952,257.98596145659695]
[null,null,"WEATHER CORRECTED MD 50% POE","MW","Non-coincident",null,null,null,null,null,null,null,null,null,null,null,221.31854129245977,222.77439580582472,224.12621954844104,224.88225187361095,224.86178756544112,225.84884459900596,226.84666630555688]
[null,null,null,null,"Coincident",null,null,null,null,null,null,null,null,null,null,null,221.31854129245977,222.77439580582472,224.12621954844104,224.88225187361095,224.86178756544112,225.84884459900596,226.84666630555688]
[null,null,"WEATHER CORRECTED MD 50% POE","MVA","Non-coincident",null,null,null,null,null,null,null,null,null,null,null,223.56393548940508,225.03073547490351,226.30994448914728,227.07177136752659,227.13439585685009,228.12893866443159,229.13436942045479]
[null,null,null,null,"Coincident",null,null,null,null,null,null,null,null,null,null,null,223.56393548940508,225.03073547490351,226.30994448914728,227.07177136752659,227.13439585685009,228.12893866443159,229.13436942045479]
[null,"Mannum","CONNECTION POINT RATING","MVA","Non-coincident",null,null,null,null,null,null,null,null,null,null,null,40,40,40,40,40,40,40]
[null,null,null,null,"Coincident",null,null,null,null,null,null,null,null,null,null,null,40,40,40,40,40,40,40]
[null,null,"WINTER/SUMMER PEAKING",null,"Non-coincident",null,null,null,null,null,null,null,null,null,null,null,"Summer","Summer","Summer","Summer","Summer","Summer","Summer"]
[null,null,null,null,"Coincident",null,null,null,null,null,null,null,null,null,null,null,"Summer","Summer","Summer","Summer","Summer","Summer","Summer"]
[null,null,"ADJUSTMENTS - EMBEDDED GENERATION","MW","Non-coincident",null,null,null,null,null,null,null,null,null,null,null,0,0,0,0,0,0,0]
[null,null,null,null,"Coincident",null,null,null,null,null,null,null,null,null,null,null,0,0,0,0,0,0,0]
[null,null,"WEATHER CORRECTED MD 10% POE","MW","Non-coincident",null,null,null,null,null,null,null,null,null,null,null,13.66393633,13.72131832,13.7307427,13.688586770000001,13.597728760000001,13.574565399999999,13.55057193]
[null,null,null,null,"Coincident",null,null,null,null,null,null,null,null,null,null,null,13.66393633,13.72131832,13.7307427,13.688586770000001,13.597728760000001,13.574565399999999,13.55057193]
[null,null,"WEATHER CORRECTED MD 10% POE","MVA","Non-coincident",null,null,null,null,null,null,null,null,null,null,null,13.93787178,13.996404160000001,14.006017480000001,13.96301641,13.870336869999999,13.846709130000001,13.822234630000001]
[null,null,null,null,"Coincident",null,null,null,null,null,null,null,null,null,null,null,13.93787178,13.996404160000001,14.006017480000001,13.96301641,13.870336869999999,13.846709130000001,13.822234630000001]
[null,null,"WEATHER CORRECTED MD 50% POE","MW","Non-coincident",null,null,null,null,null,null,null,null,null,null,null,12.250361270000001,12.270305759999999,12.25526943,12.20276986,12.11511919,12.076568290000001,12.03690924]
[null,null,null,null,"Coincident",null,null,null,null,null,null,null,null,null,null,null,12.250361270000001,12.270305759999999,12.25526943,12.20276986,12.11511919,12.076568290000001,12.03690924]
[null,null,"WEATHER CORRECTED MD 50% POE","MVA","Non-coincident",null,null,null,null,null,null,null,null,null,null,null,12.495957280000001,12.516301609999999,12.50096383,12.447411750000001,12.358003849999999,12.31868008,12.27822594]
[null,null,null,null,"Coincident",null,null,null,null,null,null,null,null,null,null,null,12.495957280000001,12.516301609999999,12.50096383,12.447411750000001,12.358003849999999,12.31868008,12.27822594]
[null,"Mobilong","CONNECTION POINT RATING","MVA","Non-coincident",null,null,null,null,null,null,null,null,null,null,null,151.19999999999999,151.19999999999999,151.19999999999999,151.19999999999999,151.19999999999999,151.19999999999999,151.19999999999999]
[null,null,null,null,"Coincident",null,null,null,null,null,null,null,null,null,null,null,151.19999999999999,151.19999999999999,151.19999999999999,151.19999999999999,151.19999999999999,151.19999999999999,151.19999999999999]
[null,null,"WINTER/SUMMER PEAKING",null,"Non-coincident",null,null,null,null,null,null,null,null,null,null,null,"Summer","Summer","Summer","Summer","Summer","Summer","Summer"]
[null,null,null,null,"Coincident",null,null,null,null,null,null,null,null,null,null,null,"Summer","Summer","Summer","Summer","Summer","Summer","Summer"]
[null,null,"ADJUSTMENTS - EMBEDDED GENERATION","MW","Non-coincident",null,null,null,null,null,null,null,null,null,null,null,0,0,0,0,0,0,0]
[null,null,null,null,"Coincident",null,null,null,null,null,null,null,null,null,null,null,11.75225,11.75225,11.75225,11.75225,11.75225,11.75225,11.75225]
[null,null,"WEATHER CORRECTED MD 10% POE","MW","Non-coincident",null,null,null,null,null,null,null,null,null,null,null,44.87681465,45.015522949999998,45.015896959999999,44.855535869999997,44.53545158,44.437748069999998,44.33890057]
[null,null,null,null,"Coincident",null,null,null,null,null,null,null,null,null,null,null,44.87681465,45.015522949999998,45.015896959999999,44.855535869999997,44.53545158,44.437748069999998,44.33890057]
[null,null,"WEATHER CORRECTED MD 10% POE","MVA","Non-coincident",null,null,null,null,null,null,null,null,null,null,null,47.54240918,47.689356480000001,47.68975271,47.519866489999998,47.180769820000002,47.077262910000002,46.972544069999998]
[null,null,null,null,"Coincident",null,null,null,null,null,null,null,null,null,null,null,47.54240918,47.689356480000001,47.68975271,47.519866489999998,47.180769820000002,47.077262910000002,46.972544069999998]
[null,null,"WEATHER CORRECTED MD 50% POE","MW","Non-coincident",null,null,null,null,null,null,null,null,null,null,null,41.206280509999999,41.294690000000003,41.27279996,41.127795050000003,40.863179469999999,40.763914270000001,40.661806630000001]
[null,null,null,null,"Coincident",null,null,null,null,null,null,null,null,null,null,null,41.206280509999999,41.294690000000003,41.27279996,41.127795050000003,40.863179469999999,40.763914270000001,40.661806630000001]
[null,null,"WEATHER CORRECTED MD 50% POE","MVA","Non-coincident",null,null,null,null,null,null,null,null,null,null,null,43.653852540000003,43.747513380000001,43.72432311,43.570705189999998,43.290371960000002,43.185210609999999,43.07703798]
[null,null,null,null,"Coincident",null,null,null,null,null,null,null,null,null,null,null,43.653852540000003,43.747513380000001,43.72432311,43.570705189999998,43.290371960000002,43.185210609999999,43.07703798]
[null,"Morphett Vale East (Southern Suburbs)","CONNECTION POINT RATING","MVA","Non-coincident",null,null,null,null,null,null,null,null,null,null,null,517.6,517.6,517.6,517.6,517.6,517.6,517.6]
[null,null,null,null,"Coincident",null,null,null,null,null,null,null,null,null,null,null,517.6,517.6,517.6,517.6,517.6,517.6,517.6]
[null,null,"WINTER/SUMMER PEAKING",null,"Non-coincident",null,null,null,null,null,null,null,null,null,null,null,"Summer","Summer","Summer","Summer","Summer","Summer","Summer"]
[null,null,null,null,"Coincident",null,null,null,null,null,null,null,null,null,null,null,"Summer","Summer","Summer","Summer","Summer","Summer","Summer"]
[null,null,"ADJUSTMENTS - EMBEDDED GENERATION","MW","Non-coincident",null,null,null,null,null,null,null,null,null,null,null,8.7296700000000005,8.7296700000000005,8.7296700000000005,8.7296700000000005,8.7296700000000005,8.7296700000000005,8.7296700000000005]
[null,null,null,null,"Coincident",null,null,null,null,null,null,null,null,null,null,null,5.7210000000000001,5.7210000000000001,5.7210000000000001,5.7210000000000001,5.7210000000000001,5.7210000000000001,5.7210000000000001]
[null,null,"WEATHER CORRECTED MD 10% POE","MW","Non-coincident",null,null,null,null,null,null,null,null,null,null,null,233.97294008690255,236.27538301097127,237.965375761367,238.83965294411558,238.81310241114818,239.95178240047534,241.09031923904033]
[null,null,null,null,"Coincident",null,null,null,null,null,null,null,null,null,null,null,233.97294008690255,236.27538301097127,237.965375761367,238.83965294411558,238.81310241114818,239.95178240047534,241.09031923904033]
[null,null,"WEATHER CORRECTED MD 10% POE","MVA","Non-coincident",null,null,null,null,null,null,null,null,null,null,null,235.30598687003612,237.621547819065,239.32116920376228,240.20042753385354,240.17372569896608,241.31889328336041,242.46391686396447]
[null,null,null,null,"Coincident",null,null,null,null,null,null,null,null,null,null,null,235.30598687003612,237.621547819065,239.32116920376228,240.20042753385354,240.17372569896608,241.31889328336041,242.46391686396447]
[null,null,"WEATHER CORRECTED MD 50% POE","MW","Non-coincident",null,null,null,null,null,null,null,null,null,null,null,205.97958449041843,207.84600772750835,209.33425508532409,210.26273149718139,210.53689313543308,211.75882295439513,213.00778008587682]
[null,null,null,null,"Coincident",null,null,null,null,null,null,null,null,null,null,null,205.97958449041843,207.84600772750835,209.33425508532409,210.26273149718139,210.53689313543308,211.75882295439513,213.00778008587682]
[null,null,"WEATHER CORRECTED MD 50% POE","MVA","Non-coincident",null,null,null,null,null,null,null,null,null,null,null,207.15314078867669,209.03019787476666,210.52692442723978,211.46069078263241,211.73641444181339,212.96530613949764,214.22137913708067]
[null,null,null,null,"Coincident",null,null,null,null,null,null,null,null,null,null,null,207.15314078867669,209.03019787476666,210.52692442723978,211.46069078263241,211.73641444181339,212.96530613949764,214.22137913708067]
[null,"Mount Barker (Mount Barker & Mount Barker South)","CONNECTION POINT RATING","MVA","Non-coincident",null,null,null,null,null,null,null,null,null,null,null,142.80000000000001,142.80000000000001,142.80000000000001,142.80000000000001,142.80000000000001,142.80000000000001,142.80000000000001]
[null,null,null,null,"Coincident",null,null,null,null,null,null,null,null,null,null,null,142.80000000000001,142.80000000000001,142.80000000000001,142.80000000000001,142.80000000000001,142.80000000000001,142.80000000000001]
[null,null,"WINTER/SUMMER PEAKING",null,"Non-coincident",null,null,null,null,null,null,null,null,null,null,null,"Summer","Summer","Summer","Summer","Summer","Summer","Summer"]
[null,null,null,null,"Coincident",null,null,null,null,null,null,null,null,null,null,null,"Summer","Summer","Summer","Summer","Summer","Summer","Summer"]
[null,null,"ADJUSTMENTS - EMBEDDED GENERATION","MW","Non-coincident",null,null,null,null,null,null,null,null,null,null,null,0,0,0,0,0,0,0]
[null,null,null,null,"Coincident",null,null,null,null,null,null,null,null,null,null,null,0,0,0,0,0,0,0]
[null,null,"WEATHER CORRECTED MD 10% POE","MW","Non-coincident",null,null,null,null,null,null,null,null,null,null,null,37.382806176260381,38.202711717522043,38.936729936226726,39.538007952152803,39.979457643889333,40.607777113718875,41.232141030186682]
[null,null,null,null,"Coincident",null,null,null,null,null,null,null,null,null,null,null,37.382806176260381,38.202711717522043,38.936729936226726,39.538007952152803,39.979457643889333,40.607777113718875,41.232141030186682]
[null,null,"WEATHER CORRECTED MD 10% POE","MVA","Non-coincident",null,null,null,null,null,null,null,null,null,null,null,38.278386639701324,39.117934643555706,39.869537747085069,40.485220630610883,40.937246140242081,41.580618247919887,42.219940064741429]
[null,null,null,null,"Coincident",null,null,null,null,null,null,null,null,null,null,null,38.278386639701324,39.117934643555706,39.869537747085069,40.485220630610883,40.937246140242081,41.580618247919887,42.219940064741429]
[null,null,"WEATHER CORRECTED MD 50% POE","MW","Non-coincident",null,null,null,null,null,null,null,null,null,null,null,31.703773177702796,32.346995493550793,32.926710554481069,33.40475779616208,33.77504213357075,34.272902214568091,34.762568484023909]
[null,null,null,null,"Coincident",null,null,null,null,null,null,null,null,null,null,null,31.703773177702796,32.346995493550793,32.926710554481069,33.40475779616208,33.77504213357075,34.272902214568091,34.762568484023909]
[null,null,"WEATHER CORRECTED MD 50% POE","MVA","Non-coincident",null,null,null,null,null,null,null,null,null,null,null,32.463300946426799,33.121932953889008,33.715536254528303,34.205036081215688,34.584191326262093,35.093978636930785,35.595375845018197]
[null,null,null,null,"Coincident",null,null,null,null,null,null,null,null,null,null,null,32.463300946426799,33.121932953889008,33.715536254528303,34.205036081215688,34.584191326262093,35.093978636930785,35.595375845018197]
[null,"Mount Barker South (Mount Barker & Mount Barker South)","CONNECTION POINT RATING","MVA","Non-coincident",null,null,null,null,null,null,null,null,null,null,null,225,225,225,225,225,225,225]
[null,null,null,null,"Coincident",null,null,null,null,null,null,null,null,null,null,null,225,225,225,225,225,225,225]
[null,null,"WINTER/SUMMER PEAKING",null,"Non-coincident",null,null,null,null,null,null,null,null,null,null,null,"Summer","Summer","Summer","Summer","Summer","Summer","Summer"]
[null,null,null,null,"Coincident",null,null,null,null,null,null,null,null,null,null,null,"Summer","Summer","Summer","Summer","Summer","Summer","Summer"]
[null,null,"ADJUSTMENTS - EMBEDDED GENERATION","MW","Non-coincident",null,null,null,null,null,null,null,null,null,null,null,0,0,0,0,0,0,0]
[null,null,null,null,"Coincident",null,null,null,null,null,null,null,null,null,null,null,0,0,0,0,0,0,0]
[null,null,"WEATHER CORRECTED MD 10% POE","MW","Non-coincident",null,null,null,null,null,null,null,null,null,null,null,69.236376423739515,70.754916482477853,72.114385363773167,73.228007247847088,74.045612456110547,75.209317586281017,76.365696669813204]
[null,null,null,null,"Coincident",null,null,null,null,null,null,null,null,null,null,null,69.236376423739515,70.754916482477853,72.114385363773167,73.228007247847088,74.045612456110547,75.209317586281017,76.365696669813204]
[null,null,"WEATHER CORRECTED MD 10% POE","MVA","Non-coincident",null,null,null,null,null,null,null,null,null,null,null,70.895073360298568,72.449993056444185,73.842030752914823,74.982331769389006,75.819524359757807,77.011108352080001,78.195190835258444]
[null,null,null,null,"Coincident",null,null,null,null,null,null,null,null,null,null,null,70.895073360298568,72.449993056444185,73.842030752914823,74.982331769389006,75.819524359757807,77.011108352080001,78.195190835258444]
[null,null,"WEATHER CORRECTED MD 50% POE","MW","Non-coincident",null,null,null,null,null,null,null,null,null,null,null,58.718287852297109,59.909594416449117,60.983279735518835,61.868666953837824,62.554467416429155,63.476549825431803,64.383456545975989]
[null,null,null,null,"Coincident",null,null,null,null,null,null,null,null,null,null,null,58.718287852297109,59.909594416449117,60.983279735518835,61.868666953837824,62.554467416429155,63.476549825431803,64.383456545975989]
[null,null,"WEATHER CORRECTED MD 50% POE","MVA","Non-coincident",null,null,null,null,null,null,null,null,null,null,null,60.125002753573106,61.344849476110895,62.444257085471591,63.350855538784209,64.053085733737802,64.997258463069116,65.925891954981708]
[null,null,null,null,"Coincident",null,null,null,null,null,null,null,null,null,null,null,60.125002753573106,61.344849476110895,62.444257085471591,63.350855538784209,64.053085733737802,64.997258463069116,65.925891954981708]
[null,"Mount Gunson","CONNECTION POINT RATING","MVA","Non-coincident",null,null,null,null,null,null,null,null,null,null,null,3.4,3.4,3.4,3.4,3.4,3.4,3.4]
[null,null,null,null,"Coincident",null,null,null,null,null,null,null,null,null,null,null,3.4,3.4,3.4,3.4,3.4,3.4,3.4]
[null,null,"WINTER/SUMMER PEAKING",null,"Non-coincident",null,null,null,null,null,null,null,null,null,null,null,"Summer","Summer","Summer","Summer","Summer","Summer","Summer"]
[null,null,null,null,"Coincident",null,null,null,null,null,null,null,null,null,null,null,"Summer","Summer","Summer","Summer","Summer","Summer","Summer"]
[null,null,"ADJUSTMENTS - EMBEDDED GENERATION","MW","Non-coincident",null,null,null,null,null,null,null,null,null,null,null,0,0,0,0,0,0,0]
[null,null,null,null,"Coincident",null,null,null,null,null,null,null,null,null,null,null,-3.5500000000000001E-15,-3.5500000000000001E-15,-3.5500000000000001E-15,-3.5500000000000001E-15,-3.5500000000000001E-15,-3.5500000000000001E-15,-3.5500000000000001E-15]
[null,null,"WEATHER CORRECTED MD 10% POE","MW","Non-coincident",null,null,null,null,null,null,null,null,null,null,null,0.18,0.17972366200000001,0.178825873,0.17727024599999999,0.17510492599999999,0.173830657,0.17255996600000001]
[null,null,null,null,"Coincident",null,null,null,null,null,null,null,null,null,null,null,0.18,0.17972366200000001,0.178825873,0.17727024599999999,0.17510492599999999,0.173830657,0.17255996600000001]
[null,null,"WEATHER CORRECTED MD 10% POE","MVA","Non-coincident",null,null,null,null,null,null,null,null,null,null,null,0.58395369600000002,0.58305720299999997,0.58014460800000001,0.57509786399999996,0.56807315999999997,0.56393919199999998,0.55981683400000004]
[null,null,null,null,"Coincident",null,null,null,null,null,null,null,null,null,null,null,0.58395369600000002,0.58305720299999997,0.58014460800000001,0.57509786399999996,0.56807315999999997,0.56393919199999998,0.55981683400000004]
[null,null,"WEATHER CORRECTED MD 50% POE","MW","Non-coincident",null,null,null,null,null,null,null,null,null,null,null,0.18,0.17979119499999999,0.17907241500000001,0.17781172100000001,0.17604719999999999,0.17500390800000001,0.17395033100000001]
[null,null,null,null,"Coincident",null,null,null,null,null,null,null,null,null,null,null,0.18,0.17979119499999999,0.17907241500000001,0.17781172100000001,0.17604719999999999,0.17500390800000001,0.17395033100000001]
[null,null,"WEATHER CORRECTED MD 50% POE","MVA","Non-coincident",null,null,null,null,null,null,null,null,null,null,null,0.58395369600000002,0.583276295,0.58094443600000001,0.57685450999999999,0.57113007299999996,0.56774544000000005,0.56432743600000002]
[null,null,null,null,"Coincident",null,null,null,null,null,null,null,null,null,null,null,0.58395369600000002,0.583276295,0.58094443600000001,0.57685450999999999,0.57113007299999996,0.56774544000000005,0.56432743600000002]
[null,"Mt Gambier","CONNECTION POINT RATING","MVA","Non-coincident",null,null,null,null,null,null,null,null,null,null,null,57.7,57.7,57.7,57.7,57.7,57.7,57.7]
[null,null,null,null,"Coincident",null,null,null,null,null,null,null,null,null,null,null,57.7,57.7,57.7,57.7,57.7,57.7,57.7]
[null,null,"WINTER/SUMMER PEAKING",null,"Non-coincident",null,null,null,null,null,null,null,null,null,null,null,"Summer","Summer","Summer","Summer","Summer","Summer","Summer"]
[null,null,null,null,"Coincident",null,null,null,null,null,null,null,null,null,null,null,"Summer","Summer","Summer","Summer","Summer","Summer","Summer"]
[null,null,"ADJUSTMENTS - EMBEDDED GENERATION","MW","Non-coincident",null,null,null,null,null,null,null,null,null,null,null,0,0,0,0,0,0,0]
[null,null,null,null,"Coincident",null,null,null,null,null,null,null,null,null,null,null,0,0,0,0,0,0,0]
[null,null,"WEATHER CORRECTED MD 10% POE","MW","Non-coincident",null,null,null,null,null,null,null,null,null,null,null,22.727237209999998,22.580938759999999,22.402969089999999,22.201892470000001,21.931083019999999,21.772342210000001,21.616639840000001]
[null,null,null,null,"Coincident",null,null,null,null,null,null,null,null,null,null,null,22.727237209999998,22.580938759999999,22.402969089999999,22.201892470000001,21.931083019999999,21.772342210000001,21.616639840000001]
[null,null,"WEATHER CORRECTED MD 10% POE","MVA","Non-coincident",null,null,null,null,null,null,null,null,null,null,null,23.945438639999999,23.791298449999999,23.60378944,23.391934930000001,23.106609840000001,22.939360369999999,22.775312209999999]
[null,null,null,null,"Coincident",null,null,null,null,null,null,null,null,null,null,null,23.945438639999999,23.791298449999999,23.60378944,23.391934930000001,23.106609840000001,22.939360369999999,22.775312209999999]
[null,null,"WEATHER CORRECTED MD 50% POE","MW","Non-coincident",null,null,null,null,null,null,null,null,null,null,null,21.065580019999999,20.979671010000001,20.903554799999998,20.77107736,20.578253700000001,20.470002220000001,20.36300713]
[null,null,null,null,"Coincident",null,null,null,null,null,null,null,null,null,null,null,21.065580019999999,20.979671010000001,20.903554799999998,20.77107736,20.578253700000001,20.470002220000001,20.36300713]
[null,null,"WEATHER CORRECTED MD 50% POE","MVA","Non-coincident",null,null,null,null,null,null,null,null,null,null,null,22.194715049999999,22.104201239999998,22.024005129999999,21.884426779999998,21.68126758,21.567213720000002,21.454483589999999]
[null,null,null,null,"Coincident",null,null,null,null,null,null,null,null,null,null,null,22.194715049999999,22.104201239999998,22.024005129999999,21.884426779999998,21.68126758,21.567213720000002,21.454483589999999]
[null,"Munno Para (Northern Suburbs)","CONNECTION POINT RATING","MVA","Non-coincident",null,null,null,null,null,null,null,null,null,null,null,292.5,292.5,292.5,292.5,292.5,292.5,292.5]
[null,null,null,null,"Coincident",null,null,null,null,null,null,null,null,null,null,null,292.5,292.5,292.5,292.5,292.5,292.5,292.5]
[null,null,"WINTER/SUMMER PEAKING",null,"Non-coincident",null,null,null,null,null,null,null,null,null,null,null,"Summer","Summer","Summer","Summer","Summer","Summer","Summer"]
[null,null,null,null,"Coincident",null,null,null,null,null,null,null,null,null,null,null,"Summer","Summer","Summer","Summer","Summer","Summer","Summer"]
[null,null,"ADJUSTMENTS - EMBEDDED GENERATION","MW","Non-coincident",null,null,null,null,null,null,null,null,null,null,null,35.588366375628638,35.588366375628638,35.588366375628638,35.588366375628638,35.588366375628638,35.588366375628638,35.588366375628638]
[null,null,null,null,"Coincident",null,null,null,null,null,null,null,null,null,null,null,1.1339355880011235,1.1339355880011235,1.1339355880011235,1.1339355880011235,1.1339355880011235,1.1339355880011235,1.1339355880011235]
[null,null,"WEATHER CORRECTED MD 10% POE","MW","Non-coincident",null,null,null,null,null,null,null,null,null,null,null,86.213650091764634,86.894178711019251,87.289242867975872,87.360889631391217,87.113021463231163,87.292970346493775,87.46618952409537]
[null,null,null,null,"Coincident",null,null,null,null,null,null,null,null,null,null,null,86.213650091764634,86.894178711019251,87.289242867975872,87.360889631391217,87.113021463231163,87.292970346493775,87.46618952409537]
[null,null,"WEATHER CORRECTED MD 10% POE","MVA","Non-coincident",null,null,null,null,null,null,null,null,null,null,null,86.742276305280598,87.42697765169855,87.824464141430681,87.896550237940843,87.647162235804188,87.828214503148516,88.002495777696637]
[null,null,null,null,"Coincident",null,null,null,null,null,null,null,null,null,null,null,86.742276305280598,87.42697765169855,87.824464141430681,87.896550237940843,87.647162235804188,87.828214503148516,88.002495777696637]
[null,null,"WEATHER CORRECTED MD 50% POE","MW","Non-coincident",null,null,null,null,null,null,null,null,null,null,null,78.643096818774197,79.274036107495405,79.696727078695545,79.879154553324142,79.820978959300561,80.078723005329792,80.32642030414911]
[null,null,null,null,"Coincident",null,null,null,null,null,null,null,null,null,null,null,78.643096818774197,79.274036107495405,79.696727078695545,79.879154553324142,79.820978959300561,80.078723005329792,80.32642030414911]
[null,null,"WEATHER CORRECTED MD 50% POE","MVA","Non-coincident",null,null,null,null,null,null,null,null,null,null,null,79.125303560511242,79.760111497618851,80.185394234649308,80.368940283909367,80.310407979749002,80.569732378515525,80.818948464526741]
[null,null,null,null,"Coincident",null,null,null,null,null,null,null,null,null,null,null,79.125303560511242,79.760111497618851,80.185394234649308,80.368940283909367,80.310407979749002,80.569732378515525,80.818948464526741]
[null,"Neuroodla","CONNECTION POINT RATING","MVA","Non-coincident",null,null,null,null,null,null,null,null,null,null,null,3.4,3.4,3.4,3.4,3.4,3.4,3.4]
[null,null,null,null,"Coincident",null,null,null,null,null,null,null,null,null,null,null,3.4,3.4,3.4,3.4,3.4,3.4,3.4]
[null,null,"WINTER/SUMMER PEAKING",null,"Non-coincident",null,null,null,null,null,null,null,null,null,null,null,"Summer","Summer","Summer","Summer","Summer","Summer","Summer"]
[null,null,null,null,"Coincident",null,null,null,null,null,null,null,null,null,null,null,"Summer","Summer","Summer","Summer","Summer","Summer","Summer"]
[null,null,"ADJUSTMENTS - EMBEDDED GENERATION","MW","Non-coincident",null,null,null,null,null,null,null,null,null,null,null,0,0,0,0,0,0,0]
[null,null,null,null,"Coincident",null,null,null,null,null,null,null,null,null,null,null,0,0,0,0,0,0,0]
[null,null,"WEATHER CORRECTED MD 10% POE","MW","Non-coincident",null,null,null,null,null,null,null,null,null,null,null,0.97006368499999995,0.96802362500000005,0.96281977200000002,0.95415936300000004,0.94220900799999996,0.93506453499999997,0.92797353599999999]
[null,null,null,null,"Coincident",null,null,null,null,null,null,null,null,null,null,null,0.97006368499999995,0.96802362500000005,0.96281977200000002,0.95415936300000004,0.94220900799999996,0.93506453499999997,0.92797353599999999]
[null,null,"WEATHER CORRECTED MD 10% POE","MVA","Non-coincident",null,null,null,null,null,null,null,null,null,null,null,0.99051395399999997,0.98843088700000004,0.98311733000000001,0.97427434800000001,0.96207206199999995,0.95477697399999994,0.94753648700000004]
[null,null,null,null,"Coincident",null,null,null,null,null,null,null,null,null,null,null,0.99051395399999997,0.98843088700000004,0.98311733000000001,0.97427434800000001,0.96207206199999995,0.95477697399999994,0.94753648700000004]
[null,null,"WEATHER CORRECTED MD 50% POE","MW","Non-coincident",null,null,null,null,null,null,null,null,null,null,null,0.97006368499999995,0.96838737500000005,0.96414718300000002,0.957073858,0.94727921800000003,0.94137565400000001,0.93545048099999994]
[null,null,null,null,"Coincident",null,null,null,null,null,null,null,null,null,null,null,0.97006368499999995,0.96838737500000005,0.96414718300000002,0.957073858,0.94727921800000003,0.94137565400000001,0.93545048099999994]
[null,null,"WEATHER CORRECTED MD 50% POE","MVA","Non-coincident",null,null,null,null,null,null,null,null,null,null,null,0.99051395399999997,0.98880230499999999,0.98447272399999997,0.97725028400000002,0.96724916000000005,0.96122114000000003,0.95517105700000005]
[null,null,null,null,"Coincident",null,null,null,null,null,null,null,null,null,null,null,0.99051395399999997,0.98880230499999999,0.98447272399999997,0.97725028400000002,0.96724916000000005,0.96122114000000003,0.95517105700000005]
[null,"New Osborne (Western Suburbs)","CONNECTION POINT RATING","MVA","Non-coincident",null,null,null,null,null,null,null,null,null,null,null,315,315,315,315,315,315,315]
[null,null,null,null,"Coincident",null,null,null,null,null,null,null,null,null,null,null,315,315,315,315,315,315,315]
[null,null,"WINTER/SUMMER PEAKING",null,"Non-coincident",null,null,null,null,null,null,null,null,null,null,null,"Summer","Summer","Summer","Summer","Summer","Summer","Summer"]
[null,null,null,null,"Coincident",null,null,null,null,null,null,null,null,null,null,null,"Summer","Summer","Summer","Summer","Summer","Summer","Summer"]
[null,null,"ADJUSTMENTS - EMBEDDED GENERATION","MW","Non-coincident",null,null,null,null,null,null,null,null,null,null,null,2.3589000000000002,2.3589000000000002,2.3589000000000002,2.3589000000000002,2.3589000000000002,2.3589000000000002,2.3589000000000002]
[null,null,null,null,"Coincident",null,null,null,null,null,null,null,null,null,null,null,8.7296700000000005,8.7296700000000005,8.7296700000000005,8.7296700000000005,8.7296700000000005,8.7296700000000005,8.7296700000000005]
[null,null,"WEATHER CORRECTED MD 10% POE","MW","Non-coincident",null,null,null,null,null,null,null,null,null,null,null,286.17486473741377,288.34942744201277,289.55919844637106,289.68944538065057,288.76383705458505,289.25783299217875,289.72801959217082]
[null,null,null,null,"Coincident",null,null,null,null,null,null,null,null,null,null,null,286.17486473741377,288.34942744201277,289.55919844637106,289.68944538065057,288.76383705458505,289.25783299217875,289.72801959217082]
[null,null,"WEATHER CORRECTED MD 10% POE","MVA","Non-coincident",null,null,null,null,null,null,null,null,null,null,null,287.19923343377212,289.38157998073433,290.59568144582312,290.72639457473514,289.79747301949658,290.29323719310008,290.76510687396899]
[null,null,null,null,"Coincident",null,null,null,null,null,null,null,null,null,null,null,287.19923343377212,289.38157998073433,290.59568144582312,290.72639457473514,289.79747301949658,290.29323719310008,290.76510687396899]
[null,null,"WEATHER CORRECTED MD 50% POE","MW","Non-coincident",null,null,null,null,null,null,null,null,null,null,null,259.01060379472597,260.59097625658569,261.47189146490655,261.56237038903646,260.87492951957381,261.22732248214174,261.54991471459465]
[null,null,null,null,"Coincident",null,null,null,null,null,null,null,null,null,null,null,259.01060379472597,260.59097625658569,261.47189146490655,261.56237038903646,260.87492951957381,261.22732248214174,261.54991471459465]
[null,null,"WEATHER CORRECTED MD 50% POE","MVA","Non-coincident",null,null,null,null,null,null,null,null,null,null,null,259.93773746758319,261.52376695823114,262.4078353466216,262.49863818561022,261.80873657682389,262.16239097409664,262.48613790013997]
[null,null,null,null,"Coincident",null,null,null,null,null,null,null,null,null,null,null,259.93773746758319,261.52376695823114,262.4078353466216,262.49863818561022,261.80873657682389,262.16239097409664,262.48613790013997]
[null,"North West Bend","CONNECTION POINT RATING","MVA","Non-coincident",null,null,null,null,null,null,null,null,null,null,null,73.8,73.8,73.8,73.8,73.8,73.8,73.8]
[null,null,null,null,"Coincident",null,null,null,null,null,null,null,null,null,null,null,73.8,73.8,73.8,73.8,73.8,73.8,73.8]
[null,null,"WINTER/SUMMER PEAKING",null,"Non-coincident",null,null,null,null,null,null,null,null,null,null,null,"Summer","Summer","Summer","Summer","Summer","Summer","Summer"]
[null,null,null,null,"Coincident",null,null,null,null,null,null,null,null,null,null,null,"Summer","Summer","Summer","Summer","Summer","Summer","Summer"]
[null,null,"ADJUSTMENTS - EMBEDDED GENERATION","MW","Non-coincident",null,null,null,null,null,null,null,null,null,null,null,0,0,0,0,0,0,0]
[null,null,null,null,"Coincident",null,null,null,null,null,null,null,null,null,null,null,0,0,0,0,0,0,0]
[null,null,"WEATHER CORRECTED MD 10% POE","MW","Non-coincident",null,null,null,null,null,null,null,null,null,null,null,24.52598115,24.675048839999999,24.737575100000001,24.7065515,24.58668776,24.588363990000001,24.587902419999999]
[null,null,null,null,"Coincident",null,null,null,null,null,null,null,null,null,null,null,24.52598115,24.675048839999999,24.737575100000001,24.7065515,24.58668776,24.588363990000001,24.587902419999999]
[null,null,"WEATHER CORRECTED MD 10% POE","MVA","Non-coincident",null,null,null,null,null,null,null,null,null,null,null,25.804061489999999,25.960897289999998,26.026681870000001,25.994041599999999,25.867931599999999,25.869695180000001,25.869209560000002]
[null,null,null,null,"Coincident",null,null,null,null,null,null,null,null,null,null,null,25.804061489999999,25.960897289999998,26.026681870000001,25.994041599999999,25.867931599999999,25.869695180000001,25.869209560000002]
[null,null,"WEATHER CORRECTED MD 50% POE","MW","Non-coincident",null,null,null,null,null,null,null,null,null,null,null,22.575018350000001,22.724988310000001,22.809590239999999,22.823225770000001,22.769227879999999,22.805759819999999,22.83889684]
[null,null,null,null,"Coincident",null,null,null,null,null,null,null,null,null,null,null,22.575018350000001,22.724988310000001,22.809590239999999,22.823225770000001,22.769227879999999,22.805759819999999,22.83889684]
[null,null,"WEATHER CORRECTED MD 50% POE","MVA","Non-coincident",null,null,null,null,null,null,null,null,null,null,null,23.751431520000001,23.909216610000001,23.998227249999999,24.01257335,23.955761559999999,23.994197230000001,24.02906106]
[null,null,null,null,"Coincident",null,null,null,null,null,null,null,null,null,null,null,23.751431520000001,23.909216610000001,23.998227249999999,24.01257335,23.955761559999999,23.994197230000001,24.02906106]
[null,"Northfield (Eastern Suburbs)","CONNECTION POINT RATING","MVA","Non-coincident",null,null,null,null,null,null,null,null,null,null,null,650,650,650,650,650,650,650]
[null,null,null,null,"Coincident",null,null,null,null,null,null,null,null,null,null,null,650,650,650,650,650,650,650]
[null,null,"WINTER/SUMMER PEAKING",null,"Non-coincident",null,null,null,null,null,null,null,null,null,null,null,"Summer","Summer","Summer","Summer","Summer","Summer","Summer"]
[null,null,null,null,"Coincident",null,null,null,null,null,null,null,null,null,null,null,"Summer","Summer","Summer","Summer","Summer","Summer","Summer"]
[null,null,"ADJUSTMENTS - EMBEDDED GENERATION","MW","Non-coincident",null,null,null,null,null,null,null,null,null,null,null,4.641,4.641,4.641,4.641,4.641,4.641,4.641]
[null,null,null,null,"Coincident",null,null,null,null,null,null,null,null,null,null,null,0,0,0,0,0,0,0]
[null,null,"WEATHER CORRECTED MD 10% POE","MW","Non-coincident",null,null,null,null,null,null,null,null,null,null,null,340.89342257983145,343.1224321189934,344.8151562231165,345.4908995932592,344.84832999827859,346.18538764679778,347.5447037001295]
[null,null,null,null,"Coincident",null,null,null,null,null,null,null,null,null,null,null,340.89342257983145,343.1224321189934,344.8151562231165,345.4908995932592,344.84832999827859,346.18538764679778,347.5447037001295]
[null,null,"WEATHER CORRECTED MD 10% POE","MVA","Non-coincident",null,null,null,null,null,null,null,null,null,null,null,344.79674376193549,347.05127602986414,348.7633822690326,349.44686311522196,348.7969359214157,350.14930318025893,351.52418382457449]
[null,null,null,null,"Coincident",null,null,null,null,null,null,null,null,null,null,null,344.79674376193549,347.05127602986414,348.7633822690326,349.44686311522196,348.7969359214157,350.14930318025893,351.52418382457449]
[null,null,"WEATHER CORRECTED MD 50% POE","MW","Non-coincident",null,null,null,null,null,null,null,null,null,null,null,302.46572709183283,304.1971393675085,305.89104469151931,306.8076564212061,306.77059023438534,307.95472798009223,309.15836334949864]
[null,null,null,null,"Coincident",null,null,null,null,null,null,null,null,null,null,null,302.46572709183283,304.1971393675085,305.89104469151931,306.8076564212061,306.77059023438534,307.95472798009223,309.15836334949864]
[null,null,"WEATHER CORRECTED MD 50% POE","MVA","Non-coincident",null,null,null,null,null,null,null,null,null,null,null,305.9290408543535,307.68027822802776,309.39357922743631,310.32068640070321,310.28319580297034,311.48089223318766,312.69830957103045]
[null,null,null,null,"Coincident",null,null,null,null,null,null,null,null,null,null,null,305.9290408543535,307.68027822802776,309.39357922743631,310.32068640070321,310.28319580297034,311.48089223318766,312.69830957103045]
[null,"Para (Northern Suburbs)","CONNECTION POINT RATING","MVA","Non-coincident",null,null,null,null,null,null,null,null,null,null,null,288,288,288,288,288,288,288]
[null,null,null,null,"Coincident",null,null,null,null,null,null,null,null,null,null,null,288,288,288,288,288,288,288]
[null,null,"WINTER/SUMMER PEAKING",null,"Non-coincident",null,null,null,null,null,null,null,null,null,null,null,"Summer","Summer","Summer","Summer","Summer","Summer","Summer"]
[null,null,null,null,"Coincident",null,null,null,null,null,null,null,null,null,null,null,"Summer","Summer","Summer","Summer","Summer","Summer","Summer"]
[null,null,"ADJUSTMENTS - EMBEDDED GENERATION","MW","Non-coincident",null,null,null,null,null,null,null,null,null,null,null,46.798100304467425,46.798100304467425,46.798100304467425,46.798100304467425,46.798100304467425,46.798100304467425,46.798100304467425]
[null,null,null,null,"Coincident",null,null,null,null,null,null,null,null,null,null,null,1.491106133560042,1.491106133560042,1.491106133560042,1.491106133560042,1.491106133560042,1.491106133560042,1.491106133560042]
[null,null,"WEATHER CORRECTED MD 10% POE","MW","Non-coincident",null,null,null,null,null,null,null,null,null,null,null,113.36949277254904,114.26437640524505,114.78387909465809,114.87809337764629,114.55215092573924,114.78878066591095,115.01656095687729]
[null,null,null,null,"Coincident",null,null,null,null,null,null,null,null,null,null,null,113.36949277254904,114.26437640524505,114.78387909465809,114.87809337764629,114.55215092573924,114.78878066591095,115.01656095687729]
[null,null,"WEATHER CORRECTED MD 10% POE","MVA","Non-coincident",null,null,null,null,null,null,null,null,null,null,null,114.06462730900341,114.96499800739588,115.48768602346884,115.58247802205156,115.25453701415202,115.49261768574286,115.72179461624337]
[null,null,null,null,"Coincident",null,null,null,null,null,null,null,null,null,null,null,114.06462730900341,114.96499800739588,115.48768602346884,115.58247802205156,115.25453701415202,115.49261768574286,115.72179461624337]
[null,null,"WEATHER CORRECTED MD 50% POE","MW","Non-coincident",null,null,null,null,null,null,null,null,null,null,null,103.41434316859474,104.24401766974927,104.79984915297136,105.03973819889863,104.96323827598415,105.30216734037683,105.62788510198867]
[null,null,null,null,"Coincident",null,null,null,null,null,null,null,null,null,null,null,103.41434316859474,104.24401766974927,104.79984915297136,105.03973819889863,104.96323827598415,105.30216734037683,105.62788510198867]
[null,null,"WEATHER CORRECTED MD 50% POE","MVA","Non-coincident",null,null,null,null,null,null,null,null,null,null,null,104.04843688419598,104.88319859259455,105.44243820408003,105.68379815674263,105.60682916602705,105.94783636755969,106.27555130865984]
[null,null,null,null,"Coincident",null,null,null,null,null,null,null,null,null,null,null,104.04843688419598,104.88319859259455,105.44243820408003,105.68379815674263,105.60682916602705,105.94783636755969,106.27555130865984]
[null,"Parafield Gardens West (Northern Suburbs)","CONNECTION POINT RATING","MVA","Non-coincident",null,null,null,null,null,null,null,null,null,null,null,405,405,405,405,405,405,405]
[null,null,null,null,"Coincident",null,null,null,null,null,null,null,null,null,null,null,405,405,405,405,405,405,405]
[null,null,"WINTER/SUMMER PEAKING",null,"Non-coincident",null,null,null,null,null,null,null,null,null,null,null,"Summer","Summer","Summer","Summer","Summer","Summer","Summer"]
[null,null,null,null,"Coincident",null,null,null,null,null,null,null,null,null,null,null,"Summer","Summer","Summer","Summer","Summer","Summer","Summer"]
[null,null,"ADJUSTMENTS - EMBEDDED GENERATION","MW","Non-coincident",null,null,null,null,null,null,null,null,null,null,null,63.80403331990378,63.80403331990378,63.80403331990378,63.80403331990378,63.80403331990378,63.80403331990378,63.80403331990378]
[null,null,null,null,"Coincident",null,null,null,null,null,null,null,null,null,null,null,2.0329582784388305,2.0329582784388305,2.0329582784388305,2.0329582784388305,2.0329582784388305,2.0329582784388305,2.0329582784388305]
[null,null,"WEATHER CORRECTED MD 10% POE","MW","Non-coincident",null,null,null,null,null,null,null,null,null,null,null,154.56676333568595,155.78683818373534,156.49512263736571,156.62357339096215,156.17918691102926,156.50180538759494,156.81235861902698]
[null,null,null,null,"Coincident",null,null,null,null,null,null,null,null,null,null,null,154.56676333568595,155.78683818373534,156.49512263736571,156.62357339096215,156.17918691102926,156.50180538759494,156.81235861902698]
[null,null,"WEATHER CORRECTED MD 10% POE","MVA","Non-coincident",null,null,null,null,null,null,null,null,null,null,null,155.51450238571567,156.74205824090524,157.45468553510011,157.58392394000722,157.13681265004345,157.46140931110827,157.77386670605966]
[null,null,null,null,"Coincident",null,null,null,null,null,null,null,null,null,null,null,155.51450238571567,156.74205824090524,157.45468553510011,157.58392394000722,157.13681265004345,157.46140931110827,157.77386670605966]
[null,null,"WEATHER CORRECTED MD 50% POE","MW","Non-coincident",null,null,null,null,null,null,null,null,null,null,null,140.99401801263079,142.125187422755,142.88300216833278,143.21006434777689,143.105765164715,143.56785745429303,144.01193759386192]
[null,null,null,null,"Coincident",null,null,null,null,null,null,null,null,null,null,null,140.99401801263079,142.125187422755,142.88300216833278,143.21006434777689,143.105765164715,143.56785745429303,144.01193759386192]
[null,null,"WEATHER CORRECTED MD 50% POE","MVA","Non-coincident",null,null,null,null,null,null,null,null,null,null,null,141.85853465529246,142.99663990978627,143.7591012612703,144.08816885934766,143.98323015422363,144.44815575392448,144.89495882681308]
[null,null,null,null,"Coincident",null,null,null,null,null,null,null,null,null,null,null,141.85853465529246,142.99663990978627,143.7591012612703,144.08816885934766,143.98323015422363,144.44815575392448,144.89495882681308]
[null,"Penola West","CONNECTION POINT RATING","MVA","Non-coincident",null,null,null,null,null,null,null,null,null,null,null,50,50,50,50,50,50,50]
[null,null,null,null,"Coincident",null,null,null,null,null,null,null,null,null,null,null,50,50,50,50,50,50,50]
[null,null,"WINTER/SUMMER PEAKING",null,"Non-coincident",null,null,null,null,null,null,null,null,null,null,null,"Summer","Summer","Summer","Summer","Summer","Summer","Summer"]
[null,null,null,null,"Coincident",null,null,null,null,null,null,null,null,null,null,null,"Summer","Summer","Summer","Summer","Summer","Summer","Summer"]
[null,null,"ADJUSTMENTS - EMBEDDED GENERATION","MW","Non-coincident",null,null,null,null,null,null,null,null,null,null,null,0,0,0,0,0,0,0]
[null,null,null,null,"Coincident",null,null,null,null,null,null,null,null,null,null,null,0,0,0,0,0,0,0]
[null,null,"WEATHER CORRECTED MD 10% POE","MW","Non-coincident",null,null,null,null,null,null,null,null,null,null,null,8.0313837699999997,8.0132634389999993,7.9686964509999996,7.8954238979999998,7.7949823069999997,7.7343227289999996,7.6740841900000003]
[null,null,null,null,"Coincident",null,null,null,null,null,null,null,null,null,null,null,8.0313837699999997,8.0132634389999993,7.9686964509999996,7.8954238979999998,7.7949823069999997,7.7343227289999996,7.6740841900000003]
[null,null,"WEATHER CORRECTED MD 10% POE","MVA","Non-coincident",null,null,null,null,null,null,null,null,null,null,null,8.3293929539999993,8.3106002579999991,8.2643795860000004,8.1883882109999995,8.084219676,8.0213092899999996,7.9588355650000002]
[null,null,null,null,"Coincident",null,null,null,null,null,null,null,null,null,null,null,8.3293929539999993,8.3106002579999991,8.2643795860000004,8.1883882109999995,8.084219676,8.0213092899999996,7.9588355650000002]
[null,null,"WEATHER CORRECTED MD 50% POE","MW","Non-coincident",null,null,null,null,null,null,null,null,null,null,null,7.248318201,7.2073694450000003,7.1473704759999999,7.0666345899999996,6.9662955609999999,6.8950155119999996,6.8238954649999997]
[null,null,null,null,"Coincident",null,null,null,null,null,null,null,null,null,null,null,7.248318201,7.2073694450000003,7.1473704759999999,7.0666345899999996,6.9662955609999999,6.8950155119999996,6.8238954649999997]
[null,null,"WEATHER CORRECTED MD 50% POE","MVA","Non-coincident",null,null,null,null,null,null,null,null,null,null,null,7.5172712800000001,7.4748030959999996,7.41257783,7.3288461920000003,7.2247840249999999,7.1508590879999998,7.0771000900000001]
[null,null,null,null,"Coincident",null,null,null,null,null,null,null,null,null,null,null,7.5172712800000001,7.4748030959999996,7.41257783,7.3288461920000003,7.2247840249999999,7.1508590879999998,7.0771000900000001]
[null,"Port Lincoln","CONNECTION POINT RATING","MVA","Non-coincident",null,null,null,null,null,null,null,null,null,null,null,101.4,101.4,101.4,101.4,101.4,101.4,101.4]
[null,null,null,null,"Coincident",null,null,null,null,null,null,null,null,null,null,null,101.4,101.4,101.4,101.4,101.4,101.4,101.4]
[null,null,"WINTER/SUMMER PEAKING",null,"Non-coincident",null,null,null,null,null,null,null,null,null,null,null,"Summer","Summer","Summer","Summer","Summer","Summer","Summer"]
[null,null,null,null,"Coincident",null,null,null,null,null,null,null,null,null,null,null,"Summer","Summer","Summer","Summer","Summer","Summer","Summer"]
[null,null,"ADJUSTMENTS - EMBEDDED GENERATION","MW","Non-coincident",null,null,null,null,null,null,null,null,null,null,null,0,0,0,0,0,0,0]
[null,null,null,null,"Coincident",null,null,null,null,null,null,null,null,null,null,null,0,0,0,0,0,0,0]
[null,null,"WEATHER CORRECTED MD 10% POE","MW","Non-coincident",null,null,null,null,null,null,null,null,null,null,null,31.59533248,31.56353953,31.428161620000001,31.179393009999998,30.822422199999998,30.6220003,30.422804500000002]
[null,null,null,null,"Coincident",null,null,null,null,null,null,null,null,null,null,null,31.59533248,31.56353953,31.428161620000001,31.179393009999998,30.822422199999998,30.6220003,30.422804500000002]
[null,null,"WEATHER CORRECTED MD 10% POE","MVA","Non-coincident",null,null,null,null,null,null,null,null,null,null,null,32.274263820000002,32.241787690000002,32.10350073,31.849386490000001,31.484744970000001,31.28001634,31.07654015]
[null,null,null,null,"Coincident",null,null,null,null,null,null,null,null,null,null,null,32.274263820000002,32.241787690000002,32.10350073,31.849386490000001,31.484744970000001,31.28001634,31.07654015]
[null,null,"WEATHER CORRECTED MD 50% POE","MW","Non-coincident",null,null,null,null,null,null,null,null,null,null,null,28.301980619999998,28.244125520000001,28.11195807,27.897466489999999,27.603758880000001,27.423581339999998,27.2429436]
[null,null,null,null,"Coincident",null,null,null,null,null,null,null,null,null,null,null,28.301980619999998,28.244125520000001,28.11195807,27.897466489999999,27.603758880000001,27.423581339999998,27.2429436]
[null,null,"WEATHER CORRECTED MD 50% POE","MVA","Non-coincident",null,null,null,null,null,null,null,null,null,null,null,28.91014328,28.85104497,28.716037459999999,28.496936810000001,28.19691791,28.012868659999999,27.82834931]
[null,null,null,null,"Coincident",null,null,null,null,null,null,null,null,null,null,null,28.91014328,28.85104497,28.716037459999999,28.496936810000001,28.19691791,28.012868659999999,27.82834931]
[null,"Port Pirie (Bungama & Port Pirie)","CONNECTION POINT RATING","MVA","Non-coincident",null,null,null,null,null,null,null,null,null,null,null,64,64,64,64,64,64,64]
[null,null,null,null,"Coincident",null,null,null,null,null,null,null,null,null,null,null,64,64,64,64,64,64,64]
[null,null,"WINTER/SUMMER PEAKING",null,"Non-coincident",null,null,null,null,null,null,null,null,null,null,null,"Summer","Summer","Summer","Summer","Summer","Summer","Summer"]
[null,null,null,null,"Coincident",null,null,null,null,null,null,null,null,null,null,null,"Summer","Summer","Summer","Summer","Summer","Summer","Summer"]
[null,null,"ADJUSTMENTS - EMBEDDED GENERATION","MW","Non-coincident",null,null,null,null,null,null,null,null,null,null,null,0,0,0,0,0,0,0]
[null,null,null,null,"Coincident",null,null,null,null,null,null,null,null,null,null,null,0,0,0,0,0,0,0]
[null,null,"WEATHER CORRECTED MD 10% POE","MW","Non-coincident",null,null,null,null,null,null,null,null,null,null,null,25.9624187843595,26.02493695327637,26.001229218174807,25.882391878519694,25.671931816304284,25.590166932651144,25.508130398480734]
[null,null,null,null,"Coincident",null,null,null,null,null,null,null,null,null,null,null,25.9624187843595,26.02493695327637,26.001229218174807,25.882391878519694,25.671931816304284,25.590166932651144,25.508130398480734]
[null,null,"WEATHER CORRECTED MD 10% POE","MVA","Non-coincident",null,null,null,null,null,null,null,null,null,null,null,26.312265854350375,26.375626464922689,26.351599266390071,26.231160575705751,26.017864534582866,25.934997858236386,25.851855873024537]
[null,null,null,null,"Coincident",null,null,null,null,null,null,null,null,null,null,null,26.312265854350375,26.375626464922689,26.351599266390071,26.231160575705751,26.017864534582866,25.934997858236386,25.851855873024537]
[null,null,"WEATHER CORRECTED MD 50% POE","MW","Non-coincident",null,null,null,null,null,null,null,null,null,null,null,24.165877371422617,24.19867656188282,24.166960884489175,24.06337600565907,23.890122688278822,23.813833229196831,23.736107307214557]
[null,null,null,null,"Coincident",null,null,null,null,null,null,null,null,null,null,null,24.165877371422617,24.19867656188282,24.166960884489175,24.06337600565907,23.890122688278822,23.813833229196831,23.736107307214557]
[null,null,"WEATHER CORRECTED MD 50% POE","MVA","Non-coincident",null,null,null,null,null,null,null,null,null,null,null,24.491515807389341,24.524756971525029,24.4926139175071,24.387633221397028,24.212045292429664,24.134727821379002,24.055954533716733]
[null,null,null,null,"Coincident",null,null,null,null,null,null,null,null,null,null,null,24.491515807389341,24.524756971525029,24.4926139175071,24.387633221397028,24.212045292429664,24.134727821379002,24.055954533716733]
[null,"Snuggery Rural","CONNECTION POINT RATING","MVA","Non-coincident",null,null,null,null,null,null,null,null,null,null,null,28.8,28.8,28.8,28.8,28.8,28.8,28.8]
[null,null,null,null,"Coincident",null,null,null,null,null,null,null,null,null,null,null,28.8,28.8,28.8,28.8,28.8,28.8,28.8]
[null,null,"WINTER/SUMMER PEAKING",null,"Non-coincident",null,null,null,null,null,null,null,null,null,null,null,"Summer","Summer","Summer","Summer","Summer","Summer","Summer"]
[null,null,null,null,"Coincident",null,null,null,null,null,null,null,null,null,null,null,"Summer","Summer","Summer","Summer","Summer","Summer","Summer"]
[null,null,"ADJUSTMENTS - EMBEDDED GENERATION","MW","Non-coincident",null,null,null,null,null,null,null,null,null,null,null,0,0,0,0,0,0,0]
[null,null,null,null,"Coincident",null,null,null,null,null,null,null,null,null,null,null,22.187999999999999,22.187999999999999,22.187999999999999,22.187999999999999,22.187999999999999,22.187999999999999,22.187999999999999]
[null,null,"WEATHER CORRECTED MD 10% POE","MW","Non-coincident",null,null,null,null,null,null,null,null,null,null,null,14.71492215,14.71918868,14.67635782,14.58089041,14.434283629999999,14.36063077,14.28747716]
[null,null,null,null,"Coincident",null,null,null,null,null,null,null,null,null,null,null,14.71492215,14.71918868,14.67635782,14.58089041,14.434283629999999,14.36063077,14.28747716]
[null,null,"WEATHER CORRECTED MD 10% POE","MVA","Non-coincident",null,null,null,null,null,null,null,null,null,null,null,14.80421158,14.80850399,14.765413240000001,14.66936653,14.521870160000001,14.44777038,14.374172870000001]
[null,null,null,null,"Coincident",null,null,null,null,null,null,null,null,null,null,null,14.80421158,14.80850399,14.765413240000001,14.66936653,14.521870160000001,14.44777038,14.374172870000001]
[null,null,"WEATHER CORRECTED MD 50% POE","MW","Non-coincident",null,null,null,null,null,null,null,null,null,null,null,12.95524636,12.9365437,12.885145319999999,12.796529290000001,12.671302389999999,12.5980813,12.524765779999999]
[null,null,null,null,"Coincident",null,null,null,null,null,null,null,null,null,null,null,12.95524636,12.9365437,12.885145319999999,12.796529290000001,12.671302389999999,12.5980813,12.524765779999999]
[null,null,"WEATHER CORRECTED MD 50% POE","MVA","Non-coincident",null,null,null,null,null,null,null,null,null,null,null,13.033858159999999,13.015042019999999,12.96333175,12.874178000000001,12.74819123,12.674525839999999,12.600765450000001]
[null,null,null,null,"Coincident",null,null,null,null,null,null,null,null,null,null,null,13.033858159999999,13.015042019999999,12.96333175,12.874178000000001,12.74819123,12.674525839999999,12.600765450000001]
[null,"Stony Point","CONNECTION POINT RATING","MVA","Non-coincident",null,null,null,null,null,null,null,null,null,null,null,34.799999999999997,34.799999999999997,34.799999999999997,34.799999999999997,34.799999999999997,34.799999999999997,34.799999999999997]
[null,null,null,null,"Coincident",null,null,null,null,null,null,null,null,null,null,null,34.799999999999997,34.799999999999997,34.799999999999997,34.799999999999997,34.799999999999997,34.799999999999997,34.799999999999997]
[null,null,"WINTER/SUMMER PEAKING",null,"Non-coincident",null,null,null,null,null,null,null,null,null,null,null,"Summer","Summer","Summer","Summer","Summer","Summer","Summer"]
[null,null,null,null,"Coincident",null,null,null,null,null,null,null,null,null,null,null,"Summer","Summer","Summer","Summer","Summer","Summer","Summer"]
[null,null,"ADJUSTMENTS - EMBEDDED GENERATION","MW","Non-coincident",null,null,null,null,null,null,null,null,null,null,null,0,0,0,0,0,0,0]
[null,null,null,null,"Coincident"]
[null,null,"WEATHER CORRECTED MD 10% POE","MW","Non-coincident",null,null,null,null,null,null,null,null,null,null,null,9.6692199999999993,9.6692199999999993,9.6692199999999993,9.6692199999999993,9.6692199999999993,9.6692199999999993,9.6692199999999993]
[null,null,null,null,"Coincident",null,null,null,null,null,null,null,null,null,null,null,7.3191254389999996,7.3191254389999996,7.3191254389999996,7.3191254389999996,7.3191254389999996,7.3191254389999996,7.3191254389999996]
[null,null,"WEATHER CORRECTED MD 10% POE","MVA","Non-coincident",null,null,null,null,null,null,null,null,null,null,null,11.034129460000001,11.034129460000001,11.034129460000001,11.034129460000001,11.034129460000001,11.034129460000001,11.034129460000001]
[null,null,null,null,"Coincident",null,null,null,null,null,null,null,null,null,null,null,8.3522949719999993,8.3522949719999993,8.3522949719999993,8.3522949719999993,8.3522949719999993,8.3522949719999993,8.3522949719999993]
[null,null,"WEATHER CORRECTED MD 50% POE","MW","Non-coincident",null,null,null,null,null,null,null,null,null,null,null,9.6692199999999993,9.6692199999999993,9.6692199999999993,9.6692199999999993,9.6692199999999993,9.6692199999999993,9.6692199999999993]
[null,null,null,null,"Coincident",null,null,null,null,null,null,null,null,null,null,null,6.8667412829999996,6.8667412829999996,6.8667412829999996,6.8667412829999996,6.8667412829999996,6.8667412829999996,6.8667412829999996]
[null,null,"WEATHER CORRECTED MD 50% POE","MVA","Non-coincident",null,null,null,null,null,null,null,null,null,null,null,11.034129460000001,11.034129460000001,11.034129460000001,11.034129460000001,11.034129460000001,11.034129460000001,11.034129460000001]
[null,null,null,null,"Coincident",null,null,null,null,null,null,null,null,null,null,null,7.8360521589999896,7.8360521589999896,7.8360521589999896,7.8360521589999896,7.8360521589999896,7.8360521589999896,7.8360521589999896]
[null,"Tailem Bend","CONNECTION POINT RATING","MVA","Non-coincident",null,null,null,null,null,null,null,null,null,null,null,60,60,60,60,60,60,60]
[null,null,null,null,"Coincident",null,null,null,null,null,null,null,null,null,null,null,60,60,60,60,60,60,60]
[null,null,"WINTER/SUMMER PEAKING",null,"Non-coincident",null,null,null,null,null,null,null,null,null,null,null,"Summer","Summer","Summer","Summer","Summer","Summer","Summer"]
[null,null,null,null,"Coincident",null,null,null,null,null,null,null,null,null,null,null,"Summer","Summer","Summer","Summer","Summer","Summer","Summer"]
[null,null,"ADJUSTMENTS - EMBEDDED GENERATION","MW","Non-coincident",null,null,null,null,null,null,null,null,null,null,null,0,0,0,0,0,0,0]
[null,null,null,null,"Coincident",null,null,null,null,null,null,null,null,null,null,null,0,0,0,0,0,0,0]
[null,null,"WEATHER CORRECTED MD 10% POE","MW","Non-coincident",null,null,null,null,null,null,null,null,null,null,null,27.079952850000002,27.197729549999998,27.225061629999999,27.152074630000001,26.98189562,26.945988239999998,26.90906103]
[null,null,null,null,"Coincident",null,null,null,null,null,null,null,null,null,null,null,27.079952850000002,27.197729549999998,27.225061629999999,27.152074630000001,26.98189562,26.945988239999998,26.90906103]
[null,null,"WEATHER CORRECTED MD 10% POE","MVA","Non-coincident",null,null,null,null,null,null,null,null,null,null,null,27.583942759999999,27.703911420000001,27.731752190000002,27.657406810000001,27.48406057,27.447484920000001,27.409870439999999]
[null,null,null,null,"Coincident",null,null,null,null,null,null,null,null,null,null,null,27.583942759999999,27.703911420000001,27.731752190000002,27.657406810000001,27.48406057,27.447484920000001,27.409870439999999]
[null,null,"WEATHER CORRECTED MD 50% POE","MW","Non-coincident",null,null,null,null,null,null,null,null,null,null,null,24.843603819999998,24.925955590000001,24.941678939999999,24.882725560000001,24.750913369999999,24.718807309999999,24.684656189999998]
[null,null,null,null,"Coincident",null,null,null,null,null,null,null,null,null,null,null,24.843603819999998,24.925955590000001,24.941678939999999,24.882725560000001,24.750913369999999,24.718807309999999,24.684656189999998]
[null,null,"WEATHER CORRECTED MD 50% POE","MVA","Non-coincident",null,null,null,null,null,null,null,null,null,null,null,25.30597264,25.389857070000001,25.40587305,25.345822479999999,25.211557110000001,25.17885351,25.144066800000001]
[null,null,null,null,"Coincident",null,null,null,null,null,null,null,null,null,null,null,25.30597264,25.389857070000001,25.40587305,25.345822479999999,25.211557110000001,25.17885351,25.144066800000001]
[null,"Templers","CONNECTION POINT RATING","MVA","Non-coincident",null,null,null,null,null,null,null,null,null,null,null,147.6,147.6,147.6,147.6,147.6,147.6,147.6]
[null,null,null,null,"Coincident",null,null,null,null,null,null,null,null,null,null,null,147.6,147.6,147.6,147.6,147.6,147.6,147.6]
[null,null,"WINTER/SUMMER PEAKING",null,"Non-coincident",null,null,null,null,null,null,null,null,null,null,null,"Summer","Summer","Summer","Summer","Summer","Summer","Summer"]
[null,null,null,null,"Coincident",null,null,null,null,null,null,null,null,null,null,null,"Summer","Summer","Summer","Summer","Summer","Summer","Summer"]
[null,null,"ADJUSTMENTS - EMBEDDED GENERATION","MW","Non-coincident",null,null,null,null,null,null,null,null,null,null,null,0,0,0,0,0,0,0]
[null,null,null,null,"Coincident",null,null,null,null,null,null,null,null,null,null,null,0,0,0,0,0,0,0]
[null,null,"WEATHER CORRECTED MD 10% POE","MW","Non-coincident",null,null,null,null,null,null,null,null,null,null,null,34.487105960000001,34.841353460000001,35.081980479999999,35.192110530000001,35.171731919999999,35.322577440000003,35.469782039999998]
[null,null,null,null,"Coincident",null,null,null,null,null,null,null,null,null,null,null,34.487105960000001,34.841353460000001,35.081980479999999,35.192110530000001,35.171731919999999,35.322577440000003,35.469782039999998]
[null,null,"WEATHER CORRECTED MD 10% POE","MVA","Non-coincident",null,null,null,null,null,null,null,null,null,null,null,35.556891710000002,35.922127920000001,36.170219160000002,36.283765430000003,36.26275468,36.418279409999997,36.570050279999997]
[null,null,null,null,"Coincident",null,null,null,null,null,null,null,null,null,null,null,35.556891710000002,35.922127920000001,36.170219160000002,36.283765430000003,36.26275468,36.418279409999997,36.570050279999997]
[null,null,"WEATHER CORRECTED MD 50% POE","MW","Non-coincident",null,null,null,null,null,null,null,null,null,null,null,31.08105845,31.422003109999999,31.681402080000002,31.84492955,31.91089045,32.101783959999999,32.287837850000003]
[null,null,null,null,"Coincident",null,null,null,null,null,null,null,null,null,null,null,31.08105845,31.422003109999999,31.681402080000002,31.84492955,31.91089045,32.101783959999999,32.287837850000003]
[null,null,"WEATHER CORRECTED MD 50% POE","MVA","Non-coincident",null,null,null,null,null,null,null,null,null,null,null,32.045189020000002,32.396709739999999,32.664155239999999,32.832755310000003,32.900762309999998,33.097577319999999,33.28940257]
[null,null,null,null,"Coincident",null,null,null,null,null,null,null,null,null,null,null,32.045189020000002,32.396709739999999,32.664155239999999,32.832755310000003,32.900762309999998,33.097577319999999,33.28940257]
[null,"Torrens Island 66 kV (Western Suburbs)","CONNECTION POINT RATING","MVA","Non-coincident",null,null,null,null,null,null,null,null,null,null,null,183,183,183,183,183,183,183]
[null,null,null,null,"Coincident",null,null,null,null,null,null,null,null,null,null,null,183,183,183,183,183,183,183]
[null,null,"WINTER/SUMMER PEAKING",null,"Non-coincident",null,null,null,null,null,null,null,null,null,null,null,"Summer","Summer","Summer","Summer","Summer","Summer","Summer"]
[null,null,null,null,"Coincident",null,null,null,null,null,null,null,null,null,null,null,"Summer","Summer","Summer","Summer","Summer","Summer","Summer"]
[null,null,"ADJUSTMENTS - EMBEDDED GENERATION","MW","Non-coincident",null,null,null,null,null,null,null,null,null,null,null,0.13785834822775256,0.13785834822775256,0.13785834822775256,0.13785834822775256,0.13785834822775256,0.13785834822775256,0.13785834822775256]
[null,null,null,null,"Coincident",null,null,null,null,null,null,null,null,null,null,null,0.51017757716451084,0.51017757716451084,0.51017757716451084,0.51017757716451084,0.51017757716451084,0.51017757716451084,0.51017757716451084]
[null,null,"WEATHER CORRECTED MD 10% POE","MW","Non-coincident",null,null,null,null,null,null,null,null,null,null,null,26.7302069328729,26.933322294299817,27.046321139665075,27.058486874447055,26.972030287432595,27.018172053404932,27.062089904563464]
[null,null,null,null,"Coincident",null,null,null,null,null,null,null,null,null,null,null,26.7302069328729,26.933322294299817,27.046321139665075,27.058486874447055,26.972030287432595,27.018172053404932,27.062089904563464]
[null,null,"WEATHER CORRECTED MD 10% POE","MVA","Non-coincident",null,null,null,null,null,null,null,null,null,null,null,26.825888247352918,27.029730659764176,27.143133992475128,27.155343272237932,27.06857721254671,27.114884140873507,27.158959200458309]
[null,null,null,null,"Coincident",null,null,null,null,null,null,null,null,null,null,null,26.825888247352918,27.029730659764176,27.143133992475128,27.155343272237932,27.06857721254671,27.114884140873507,27.158959200458309]
[null,null,"WEATHER CORRECTED MD 50% POE","MW","Non-coincident",null,null,null,null,null,null,null,null,null,null,null,24.192924992186541,24.34053992327172,24.422821942799672,24.431273140521998,24.367062621154016,24.399977939624673,24.430109716349076]
[null,null,null,null,"Coincident",null,null,null,null,null,null,null,null,null,null,null,24.192924992186541,24.34053992327172,24.422821942799672,24.431273140521998,24.367062621154016,24.399977939624673,24.430109716349076]
[null,null,"WEATHER CORRECTED MD 50% POE","MVA","Non-coincident",null,null,null,null,null,null,null,null,null,null,null,24.279524054450967,24.427667381173801,24.510243923967565,24.518725377006724,24.454285011906521,24.48731815487837,24.517557785933882]
[null,null,null,null,"Coincident",null,null,null,null,null,null,null,null,null,null,null,24.279524054450967,24.427667381173801,24.510243923967565,24.518725377006724,24.454285011906521,24.48731815487837,24.517557785933882]
[null,"Waterloo","CONNECTION POINT RATING","MVA","Non-coincident",null,null,null,null,null,null,null,null,null,null,null,54.8,54.8,54.8,54.8,54.8,54.8,54.8]
[null,null,null,null,"Coincident",null,null,null,null,null,null,null,null,null,null,null,54.8,54.8,54.8,54.8,54.8,54.8,54.8]
[null,null,"WINTER/SUMMER PEAKING",null,"Non-coincident",null,null,null,null,null,null,null,null,null,null,null,"Summer","Summer","Summer","Summer","Summer","Summer","Summer"]
[null,null,null,null,"Coincident",null,null,null,null,null,null,null,null,null,null,null,"Summer","Summer","Summer","Summer","Summer","Summer","Summer"]
[null,null,"ADJUSTMENTS - EMBEDDED GENERATION","MW","Non-coincident",null,null,null,null,null,null,null,null,null,null,null,0,0,0,0,0,0,0]
[null,null,null,null,"Coincident",null,null,null,null,null,null,null,null,null,null,null,0,0,0,0,0,0,0]
[null,null,"WEATHER CORRECTED MD 10% POE","MW","Non-coincident",null,null,null,null,null,null,null,null,null,null,null,9.7065994389999997,9.7351889069999995,9.732494462,9.6945557400000002,9.6220824930000006,9.5977516260000009,9.5733937020000006]
[null,null,null,null,"Coincident",null,null,null,null,null,null,null,null,null,null,null,9.7065994389999997,9.7351889069999995,9.732494462,9.6945557400000002,9.6220824930000006,9.5977516260000009,9.5733937020000006]
[null,null,"WEATHER CORRECTED MD 10% POE","MVA","Non-coincident",null,null,null,null,null,null,null,null,null,null,null,9.8302552149999993,9.859208894,9.8564801240000008,9.8180580880000008,9.7446615780000005,9.7200207509999998,9.6953525240000005]
[null,null,null,null,"Coincident",null,null,null,null,null,null,null,null,null,null,null,9.8302552149999993,9.859208894,9.8564801240000008,9.8180580880000008,9.7446615780000005,9.7200207509999998,9.6953525240000005]
[null,null,"WEATHER CORRECTED MD 50% POE","MW","Non-coincident",null,null,null,null,null,null,null,null,null,null,null,8.7157631670000004,8.7345995769999991,8.7311773450000008,8.7021764810000004,8.6477537459999994,8.628331609,8.6084688529999998]
[null,null,null,null,"Coincident",null,null,null,null,null,null,null,null,null,null,null,8.7157631670000004,8.7345995769999991,8.7311773450000008,8.7021764810000004,8.6477537459999994,8.628331609,8.6084688529999998]
[null,null,"WEATHER CORRECTED MD 50% POE","MVA","Non-coincident",null,null,null,null,null,null,null,null,null,null,null,8.8267963320000007,8.8458727059999998,8.8424068760000001,8.8130365610000005,8.7579205150000003,8.7382509529999997,8.7181351580000008]
[null,null,null,null,"Coincident",null,null,null,null,null,null,null,null,null,null,null,8.8267963320000007,8.8458727059999998,8.8424068760000001,8.8130365610000005,8.7579205150000003,8.7382509529999997,8.7181351580000008]
[null,"Whyalla Central","CONNECTION POINT RATING","MVA","Non-coincident",null,null,null,null,null,null,null,null,null,null,null,240,240,240,240,240,240,240]
[null,null,null,null,"Coincident",null,null,null,null,null,null,null,null,null,null,null,240,240,240,240,240,240,240]
[null,null,"WINTER/SUMMER PEAKING",null,"Non-coincident",null,null,null,null,null,null,null,null,null,null,null,"Summer","Summer","Summer","Summer","Summer","Summer","Summer"]
[null,null,null,null,"Coincident",null,null,null,null,null,null,null,null,null,null,null,"Summer","Summer","Summer","Summer","Summer","Summer","Summer"]
[null,null,"ADJUSTMENTS - EMBEDDED GENERATION","MW","Non-coincident",null,null,null,null,null,null,null,null,null,null,null,0,0,0,0,0,0,0]
[null,null,null,null,"Coincident",null,null,null,null,null,null,null,null,null,null,null,0,0,0,0,0,0,0]
[null,null,"WEATHER CORRECTED MD 10% POE","MW","Non-coincident",null,null,null,null,null,null,null,null,null,null,null,74.10684388,73.904992669999999,73.491664580000005,72.828005860000005,71.91093343,71.3964201,70.900720500000006]
[null,null,null,null,"Coincident",null,null,null,null,null,null,null,null,null,null,null,74.10684388,73.904992669999999,73.491664580000005,72.828005860000005,71.91093343,71.3964201,70.900720500000006]
[null,null,"WEATHER CORRECTED MD 10% POE","MVA","Non-coincident",null,null,null,null,null,null,null,null,null,null,null,79.416551769999998,79.200238049999996,78.757295260000006,78.046085829999996,77.063305740000004,76.51192786,75.980711709999994]
[null,null,null,null,"Coincident",null,null,null,null,null,null,null,null,null,null,null,79.416551769999998,79.200238049999996,78.757295260000006,78.046085829999996,77.063305740000004,76.51192786,75.980711709999994]
[null,null,"WEATHER CORRECTED MD 50% POE","MW","Non-coincident",null,null,null,null,null,null,null,null,null,null,null,69.971237479999999,69.732849569999999,69.384859489999997,68.856332399999999,68.132517399999998,67.688807850000003,67.243427460000007]
[null,null,null,null,"Coincident",null,null,null,null,null,null,null,null,null,null,null,69.971237479999999,69.732849569999999,69.384859489999997,68.856332399999999,68.132517399999998,67.688807850000003,67.243427460000007]
[null,null,"WEATHER CORRECTED MD 50% POE","MVA","Non-coincident",null,null,null,null,null,null,null,null,null,null,null,74.984631829999998,74.729163569999997,74.356240220000004,73.789844500000001,73.014168620000007,72.538667570000001,72.061375960000007]
[null,null,null,null,"Coincident",null,null,null,null,null,null,null,null,null,null,null,74.984631829999998,74.729163569999997,74.356240220000004,73.789844500000001,73.014168620000007,72.538667570000001,72.061375960000007]
[null,"Wudinna","CONNECTION POINT RATING","MVA","Non-coincident",null,null,null,null,null,null,null,null,null,null,null,58.3,58.3,58.3,58.3,58.3,58.3,58.3]
[null,null,null,null,"Coincident",null,null,null,null,null,null,null,null,null,null,null,58.3,58.3,58.3,58.3,58.3,58.3,58.3]
[null,null,"WINTER/SUMMER PEAKING",null,"Non-coincident",null,null,null,null,null,null,null,null,null,null,null,"Summer","Summer","Summer","Summer","Summer","Summer","Summer"]
[null,null,null,null,"Coincident",null,null,null,null,null,null,null,null,null,null,null,"Summer","Summer","Summer","Summer","Summer","Summer","Summer"]
[null,null,"ADJUSTMENTS - EMBEDDED GENERATION","MW","Non-coincident",null,null,null,null,null,null,null,null,null,null,null,0,0,0,0,0,0,0]
[null,null,null,null,"Coincident",null,null,null,null,null,null,null,null,null,null,null,0,0,0,0,0,0,0]
[null,null,"WEATHER CORRECTED MD 10% POE","MW","Non-coincident",null,null,null,null,null,null,null,null,null,null,null,15.133944959999999,15.163496759999999,15.142737739999999,15.0666203,14.937320980000001,14.88303282,14.82866598]
[null,null,null,null,"Coincident",null,null,null,null,null,null,null,null,null,null,null,15.133944959999999,15.163496759999999,15.142737739999999,15.0666203,14.937320980000001,14.88303282,14.82866598]
[null,null,"WEATHER CORRECTED MD 10% POE","MVA","Non-coincident",null,null,null,null,null,null,null,null,null,null,null,15.33301408,15.3629546,15.34192251,15.264803840000001,15.133803739999999,15.078801479999999,15.023719509999999]
[null,null,null,null,"Coincident",null,null,null,null,null,null,null,null,null,null,null,15.33301408,15.3629546,15.34192251,15.264803840000001,15.133803739999999,15.078801479999999,15.023719509999999]
[null,null,"WEATHER CORRECTED MD 50% POE","MW","Non-coincident",null,null,null,null,null,null,null,null,null,null,null,13.496503280000001,13.525172599999999,13.517719100000001,13.46994688,13.383005020000001,13.35022114,13.31650997]
[null,null,null,null,"Coincident",null,null,null,null,null,null,null,null,null,null,null,13.496503280000001,13.525172599999999,13.517719100000001,13.46994688,13.383005020000001,13.35022114,13.31650997]
[null,null,"WEATHER CORRECTED MD 50% POE","MVA","Non-coincident",null,null,null,null,null,null,null,null,null,null,null,13.674033789999999,13.70308022,13.695528680000001,13.647128070000001,13.559042590000001,13.52582748,13.491672879999999]
[null,null,null,null,"Coincident",null,null,null,null,null,null,null,null,null,null,null,13.674033789999999,13.70308022,13.695528680000001,13.647128070000001,13.559042590000001,13.52582748,13.491672879999999]
[null,"Yadnarie","CONNECTION POINT RATING","MVA","Non-coincident",null,null,null,null,null,null,null,null,null,null,null,46.4,46.4,46.4,46.4,46.4,46.4,46.4]
[null,null,null,null,"Coincident",null,null,null,null,null,null,null,null,null,null,null,46.4,46.4,46.4,46.4,46.4,46.4,46.4]
[null,null,"WINTER/SUMMER PEAKING",null,"Non-coincident",null,null,null,null,null,null,null,null,null,null,null,"Summer","Summer","Summer","Summer","Summer","Summer","Summer"]
[null,null,null,null,"Coincident",null,null,null,null,null,null,null,null,null,null,null,"Summer","Summer","Summer","Summer","Summer","Summer","Summer"]
[null,null,"ADJUSTMENTS - EMBEDDED GENERATION","MW","Non-coincident",null,null,null,null,null,null,null,null,null,null,null,0,0,0,0,0,0,0]
[null,null,null,null,"Coincident",null,null,null,null,null,null,null,null,null,null,null,0,0,0,0,0,0,0]
[null,null,"WEATHER CORRECTED MD 10% POE","MW","Non-coincident",null,null,null,null,null,null,null,null,null,null,null,7.6973585580000004,7.6089329110000001,7.497140817,7.361173269,7.2020095919999996,7.0808974129999998,6.9611698039999998]
[null,null,null,null,"Coincident",null,null,null,null,null,null,null,null,null,null,null,7.6973585580000004,7.6089329110000001,7.497140817,7.361173269,7.2020095919999996,7.0808974129999998,6.9611698039999998]
[null,null,"WEATHER CORRECTED MD 10% POE","MVA","Non-coincident",null,null,null,null,null,null,null,null,null,null,null,8.2840983109999993,8.1889323199999993,8.0686187490000005,7.9222869229999997,7.7509908169999999,7.6206467269999996,7.4917927479999999]
[null,null,null,null,"Coincident",null,null,null,null,null,null,null,null,null,null,null,8.2840983109999993,8.1889323199999993,8.0686187490000005,7.9222869229999997,7.7509908169999999,7.6206467269999996,7.4917927479999999]
[null,null,"WEATHER CORRECTED MD 50% POE","MW","Non-coincident",null,null,null,null,null,null,null,null,null,null,null,6.8339262009999997,6.7510129939999999,6.6526147790000003,6.5354986740000003,6.4009488929999998,6.2937769760000002,6.1872995800000004]
[null,null,null,null,"Coincident",null,null,null,null,null,null,null,null,null,null,null,6.8339262009999997,6.7510129939999999,6.6526147790000003,6.5354986740000003,6.4009488929999998,6.2937769760000002,6.1872995800000004]
[null,null,"WEATHER CORRECTED MD 50% POE","MVA","Non-coincident",null,null,null,null,null,null,null,null,null,null,null,7.3548498589999998,7.2656165000000001,7.1597177710000004,7.03367436,6.8888683720000001,6.7735271560000001,6.6589334009999996]
[null,null,null,null,"Coincident",null,null,null,null,null,null,null,null,null,null,null,7.3548498589999998,7.2656165000000001,7.1597177710000004,7.03367436,6.8888683720000001,6.7735271560000001,6.6589334009999996]
[null,"Back Callington","CONNECTION POINT RATING","MVA","Non-coincident"]
[null,null,null,null,"Coincident"]
[null,null,"WINTER/SUMMER PEAKING",null,"Non-coincident"]
[null,null,null,null,"Coincident"]
[null,null,"ADJUSTMENTS - EMBEDDED GENERATION","MW","Non-coincident"]
[null,null,null,null,"Coincident"]
[null,null,"WEATHER CORRECTED MD 10% POE","MW","Non-coincident"]
[null,null,null,null,"Coincident"]
[null,null,"WEATHER CORRECTED MD 10% POE","MVA","Non-coincident"]
[null,null,null,null,"Coincident"]
[null,null,"WEATHER CORRECTED MD 50% POE","MW","Non-coincident"]
[null,null,null,null,"Coincident"]
[null,null,"WEATHER CORRECTED MD 50% POE","MVA","Non-coincident"]
[null,null,null,null,"Coincident"]
[null,"Mannum Adelaide #1","CONNECTION POINT RATING","MVA","Non-coincident"]
[null,null,null,null,"Coincident"]
[null,null,"WINTER/SUMMER PEAKING",null,"Non-coincident"]
[null,null,null,null,"Coincident"]
[null,null,"ADJUSTMENTS - EMBEDDED GENERATION","MW","Non-coincident"]
[null,null,null,null,"Coincident"]
[null,null,"WEATHER CORRECTED MD 10% POE","MW","Non-coincident"]
[null,null,null,null,"Coincident"]
[null,null,"WEATHER CORRECTED MD 10% POE","MVA","Non-coincident"]
[null,null,null,null,"Coincident"]
[null,null,"WEATHER CORRECTED MD 50% POE","MW","Non-coincident"]
[null,null,null,null,"Coincident"]
[null,null,"WEATHER CORRECTED MD 50% POE","MVA","Non-coincident"]
[null,null,null,null,"Coincident"]
[null,"Mannum Adelaide #2","CONNECTION POINT RATING","MVA","Non-coincident"]
[null,null,null,null,"Coincident"]
[null,null,"WINTER/SUMMER PEAKING",null,"Non-coincident"]
[null,null,null,null,"Coincident"]
[null,null,"ADJUSTMENTS - EMBEDDED GENERATION","MW","Non-coincident"]
[null,null,null,null,"Coincident"]
[null,null,"WEATHER CORRECTED MD 10% POE","MW","Non-coincident"]
[null,null,null,null,"Coincident"]
[null,null,"WEATHER CORRECTED MD 10% POE","MVA","Non-coincident"]
[null,null,null,null,"Coincident"]
[null,null,"WEATHER CORRECTED MD 50% POE","MW","Non-coincident"]
[null,null,null,null,"Coincident"]
[null,null,"WEATHER CORRECTED MD 50% POE","MVA","Non-coincident"]
[null,null,null,null,"Coincident"]
[null,"Mannum Adelaide #3","CONNECTION POINT RATING","MVA","Non-coincident"]
[null,null,null,null,"Coincident"]
[null,null,"WINTER/SUMMER PEAKING",null,"Non-coincident"]
[null,null,null,null,"Coincident"]
[null,null,"ADJUSTMENTS - EMBEDDED GENERATION","MW","Non-coincident"]
[null,null,null,null,"Coincident"]
[null,null,"WEATHER CORRECTED MD 10% POE","MW","Non-coincident"]
[null,null,null,null,"Coincident"]
[null,null,"WEATHER CORRECTED MD 10% POE","MVA","Non-coincident"]
[null,null,null,null,"Coincident"]
[null,null,"WEATHER CORRECTED MD 50% POE","MW","Non-coincident"]
[null,null,null,null,"Coincident"]
[null,null,"WEATHER CORRECTED MD 50% POE","MVA","Non-coincident"]
[null,null,null,null,"Coincident"]
[null,"Middleback","CONNECTION POINT RATING","MVA","Non-coincident"]
[null,null,null,null,"Coincident"]
[null,null,"WINTER/SUMMER PEAKING",null,"Non-coincident"]
[null,null,null,null,"Coincident"]
[null,null,"ADJUSTMENTS - EMBEDDED GENERATION","MW","Non-coincident"]
[null,null,null,null,"Coincident"]
[null,null,"WEATHER CORRECTED MD 10% POE","MW","Non-coincident"]
[null,null,null,null,"Coincident"]
[null,null,"WEATHER CORRECTED MD 10% POE","MVA","Non-coincident"]
[null,null,null,null,"Coincident"]
[null,null,"WEATHER CORRECTED MD 50% POE","MW","Non-coincident"]
[null,null,null,null,"Coincident"]
[null,null,"WEATHER CORRECTED MD 50% POE","MVA","Non-coincident"]
[null,null,null,null,"Coincident"]
[null,"Middleback 132kV","CONNECTION POINT RATING","MVA","Non-coincident"]
[null,null,null,null,"Coincident"]
[null,null,"WINTER/SUMMER PEAKING",null,"Non-coincident"]
[null,null,null,null,"Coincident"]
[null,null,"ADJUSTMENTS - EMBEDDED GENERATION","MW","Non-coincident"]
[null,null,null,null,"Coincident"]
[null,null,"WEATHER CORRECTED MD 10% POE","MW","Non-coincident"]
[null,null,null,null,"Coincident"]
[null,null,"WEATHER CORRECTED MD 10% POE","MVA","Non-coincident"]
[null,null,null,null,"Coincident"]
[null,null,"WEATHER CORRECTED MD 50% POE","MW","Non-coincident"]
[null,null,null,null,"Coincident"]
[null,null,"WEATHER CORRECTED MD 50% POE","MVA","Non-coincident"]
[null,null,null,null,"Coincident"]
[null,"Millbrook ","CONNECTION POINT RATING","MVA","Non-coincident"]
[null,null,null,null,"Coincident"]
[null,null,"WINTER/SUMMER PEAKING",null,"Non-coincident"]
[null,null,null,null,"Coincident"]
[null,null,"ADJUSTMENTS - EMBEDDED GENERATION","MW","Non-coincident"]
[null,null,null,null,"Coincident"]
[null,null,"WEATHER CORRECTED MD 10% POE","MW","Non-coincident"]
[null,null,null,null,"Coincident"]
[null,null,"WEATHER CORRECTED MD 10% POE","MVA","Non-coincident"]
[null,null,null,null,"Coincident"]
[null,null,"WEATHER CORRECTED MD 50% POE","MW","Non-coincident"]
[null,null,null,null,"Coincident"]
[null,null,"WEATHER CORRECTED MD 50% POE","MVA","Non-coincident"]
[null,null,null,null,"Coincident"]
[null,"Morgan Whyalla #1","CONNECTION POINT RATING","MVA","Non-coincident"]
[null,null,null,null,"Coincident"]
[null,null,"WINTER/SUMMER PEAKING",null,"Non-coincident"]
[null,null,null,null,"Coincident"]
[null,null,"ADJUSTMENTS - EMBEDDED GENERATION","MW","Non-coincident"]
[null,null,null,null,"Coincident"]
[null,null,"WEATHER CORRECTED MD 10% POE","MW","Non-coincident"]
[null,null,null,null,"Coincident"]
[null,null,"WEATHER CORRECTED MD 10% POE","MVA","Non-coincident"]
[null,null,null,null,"Coincident"]
[null,null,"WEATHER CORRECTED MD 50% POE","MW","Non-coincident"]
[null,null,null,null,"Coincident"]
[null,null,"WEATHER CORRECTED MD 50% POE","MVA","Non-coincident"]
[null,null,null,null,"Coincident"]
[null,"Morgan Whyalla #2","CONNECTION POINT RATING","MVA","Non-coincident"]
[null,null,null,null,"Coincident"]
[null,null,"WINTER/SUMMER PEAKING",null,"Non-coincident"]
[null,null,null,null,"Coincident"]
[null,null,"ADJUSTMENTS - EMBEDDED GENERATION","MW","Non-coincident"]
[null,null,null,null,"Coincident"]
[null,null,"WEATHER CORRECTED MD 10% POE","MW","Non-coincident"]
[null,null,null,null,"Coincident"]
[null,null,"WEATHER CORRECTED MD 10% POE","MVA","Non-coincident"]
[null,null,null,null,"Coincident"]
[null,null,"WEATHER CORRECTED MD 50% POE","MW","Non-coincident"]
[null,null,null,null,"Coincident"]
[null,null,"WEATHER CORRECTED MD 50% POE","MVA","Non-coincident"]
[null,null,null,null,"Coincident"]
[null,"Morgan Whyalla #3","CONNECTION POINT RATING","MVA","Non-coincident"]
[null,null,null,null,"Coincident"]
[null,null,"WINTER/SUMMER PEAKING",null,"Non-coincident"]
[null,null,null,null,"Coincident"]
[null,null,"ADJUSTMENTS - EMBEDDED GENERATION","MW","Non-coincident"]
[null,null,null,null,"Coincident"]
[null,null,"WEATHER CORRECTED MD 10% POE","MW","Non-coincident"]
[null,null,null,null,"Coincident"]
[null,null,"WEATHER CORRECTED MD 10% POE","MVA","Non-coincident"]
[null,null,null,null,"Coincident"]
[null,null,"WEATHER CORRECTED MD 50% POE","MW","Non-coincident"]
[null,null,null,null,"Coincident"]
[null,null,"WEATHER CORRECTED MD 50% POE","MVA","Non-coincident"]
[null,null,null,null,"Coincident"]
[null,"Morgan Whyalla #4 ","CONNECTION POINT RATING","MVA","Non-coincident"]
[null,null,null,null,"Coincident"]
[null,null,"WINTER/SUMMER PEAKING",null,"Non-coincident"]
[null,null,null,null,"Coincident"]
[null,null,"ADJUSTMENTS - EMBEDDED GENERATION","MW","Non-coincident"]
[null,null,null,null,"Coincident"]
[null,null,"WEATHER CORRECTED MD 10% POE","MW","Non-coincident"]
[null,null,null,null,"Coincident"]
[null,null,"WEATHER CORRECTED MD 10% POE","MVA","Non-coincident"]
[null,null,null,null,"Coincident"]
[null,null,"WEATHER CORRECTED MD 50% POE","MW","Non-coincident"]
[null,null,null,null,"Coincident"]
[null,null,"WEATHER CORRECTED MD 50% POE","MVA","Non-coincident"]
[null,null,null,null,"Coincident"]
[null,"Pernatty","CONNECTION POINT RATING","MVA","Non-coincident"]
[null,null,null,null,"Coincident"]
[null,null,"WINTER/SUMMER PEAKING",null,"Non-coincident"]
[null,null,null,null,"Coincident"]
[null,null,"ADJUSTMENTS - EMBEDDED GENERATION","MW","Non-coincident"]
[null,null,null,null,"Coincident"]
[null,null,"WEATHER CORRECTED MD 10% POE","MW","Non-coincident"]
[null,null,null,null,"Coincident"]
[null,null,"WEATHER CORRECTED MD 10% POE","MVA","Non-coincident"]
[null,null,null,null,"Coincident"]
[null,null,"WEATHER CORRECTED MD 50% POE","MW","Non-coincident"]
[null,null,null,null,"Coincident"]
[null,null,"WEATHER CORRECTED MD 50% POE","MVA","Non-coincident"]
[null,null,null,null,"Coincident"]
[null,"Murray Bridge Hahndorf #1","CONNECTION POINT RATING","MVA","Non-coincident"]
[null,null,null,null,"Coincident"]
[null,null,"WINTER/SUMMER PEAKING",null,"Non-coincident"]
[null,null,null,null,"Coincident"]
[null,null,"ADJUSTMENTS - EMBEDDED GENERATION","MW","Non-coincident"]
[null,null,null,null,"Coincident"]
[null,null,"WEATHER CORRECTED MD 10% POE","MW","Non-coincident"]
[null,null,null,null,"Coincident"]
[null,null,"WEATHER CORRECTED MD 10% POE","MVA","Non-coincident"]
[null,null,null,null,"Coincident"]
[null,null,"WEATHER CORRECTED MD 50% POE","MW","Non-coincident"]
[null,null,null,null,"Coincident"]
[null,null,"WEATHER CORRECTED MD 50% POE","MVA","Non-coincident"]
[null,null,null,null,"Coincident"]
[null,"Murray Bridge Hahndorf #2 ","CONNECTION POINT RATING","MVA","Non-coincident"]
[null,null,null,null,"Coincident"]
[null,null,"WINTER/SUMMER PEAKING",null,"Non-coincident"]
[null,null,null,null,"Coincident"]
[null,null,"ADJUSTMENTS - EMBEDDED GENERATION","MW","Non-coincident"]
[null,null,null,null,"Coincident"]
[null,null,"WEATHER CORRECTED MD 10% POE","MW","Non-coincident"]
[null,null,null,null,"Coincident"]
[null,null,"WEATHER CORRECTED MD 10% POE","MVA","Non-coincident"]
[null,null,null,null,"Coincident"]
[null,null,"WEATHER CORRECTED MD 50% POE","MW","Non-coincident"]
[null,null,null,null,"Coincident"]
[null,null,"WEATHER CORRECTED MD 50% POE","MVA","Non-coincident"]
[null,null,null,null,"Coincident"]
[null,"Murray Bridge Hahndorf #3","CONNECTION POINT RATING","MVA","Non-coincident"]
[null,null,null,null,"Coincident"]
[null,null,"WINTER/SUMMER PEAKING",null,"Non-coincident"]
[null,null,null,null,"Coincident"]
[null,null,"ADJUSTMENTS - EMBEDDED GENERATION","MW","Non-coincident"]
[null,null,null,null,"Coincident"]
[null,null,"WEATHER CORRECTED MD 10% POE","MW","Non-coincident"]
[null,null,null,null,"Coincident"]
[null,null,"WEATHER CORRECTED MD 10% POE","MVA","Non-coincident"]
[null,null,null,null,"Coincident"]
[null,null,"WEATHER CORRECTED MD 50% POE","MW","Non-coincident"]
[null,null,null,null,"Coincident"]
[null,null,"WEATHER CORRECTED MD 50% POE","MVA","Non-coincident"]
[null,null,null,null,"Coincident"]
[null,"Davenport - Olympic Dam West 275 kV","CONNECTION POINT RATING","MVA","Non-coincident"]
[null,null,null,null,"Coincident"]
[null,null,"WINTER/SUMMER PEAKING",null,"Non-coincident"]
[null,null,null,null,"Coincident"]
[null,null,"ADJUSTMENTS - EMBEDDED GENERATION","MW","Non-coincident"]
[null,null,null,null,"Coincident"]
[null,null,"WEATHER CORRECTED MD 10% POE","MW","Non-coincident"]
[null,null,null,null,"Coincident"]
[null,null,"WEATHER CORRECTED MD 10% POE","MVA","Non-coincident"]
[null,null,null,null,"Coincident"]
[null,null,"WEATHER CORRECTED MD 50% POE","MW","Non-coincident"]
[null,null,null,null,"Coincident"]
[null,null,"WEATHER CORRECTED MD 50% POE","MVA","Non-coincident"]
[null,null,null,null,"Coincident"]
[null,"Pimba - Olympic Dam North","CONNECTION POINT RATING","MVA","Non-coincident"]
[null,null,null,null,"Coincident"]
[null,null,"WINTER/SUMMER PEAKING",null,"Non-coincident"]
[null,null,null,null,"Coincident"]
[null,null,"ADJUSTMENTS - EMBEDDED GENERATION","MW","Non-coincident"]
[null,null,null,null,"Coincident"]
[null,null,"WEATHER CORRECTED MD 10% POE","MW","Non-coincident"]
[null,null,null,null,"Coincident"]
[null,null,"WEATHER CORRECTED MD 10% POE","MVA","Non-coincident"]
[null,null,null,null,"Coincident"]
[null,null,"WEATHER CORRECTED MD 50% POE","MW","Non-coincident"]
[null,null,null,null,"Coincident"]
[null,null,"WEATHER CORRECTED MD 50% POE","MVA","Non-coincident"]
[null,null,null,null,"Coincident"]
[null,"Prominent Hill","CONNECTION POINT RATING","MVA","Non-coincident"]
[null,null,null,null,"Coincident"]
[null,null,"WINTER/SUMMER PEAKING",null,"Non-coincident"]
[null,null,null,null,"Coincident"]
[null,null,"ADJUSTMENTS - EMBEDDED GENERATION","MW","Non-coincident"]
[null,null,null,null,"Coincident"]
[null,null,"WEATHER CORRECTED MD 10% POE","MW","Non-coincident"]
[null,null,null,null,"Coincident"]
[null,null,"WEATHER CORRECTED MD 10% POE","MVA","Non-coincident"]
[null,null,null,null,"Coincident"]
[null,null,"WEATHER CORRECTED MD 50% POE","MW","Non-coincident"]
[null,null,null,null,"Coincident"]
[null,null,"WEATHER CORRECTED MD 50% POE","MVA","Non-coincident"]
[null,null,null,null,"Coincident"]
[null,"Snuggery Industrial","CONNECTION POINT RATING","MVA","Non-coincident"]
[null,null,null,null,"Coincident"]
[null,null,"WINTER/SUMMER PEAKING",null,"Non-coincident"]
[null,null,null,null,"Coincident"]
[null,null,"ADJUSTMENTS - EMBEDDED GENERATION","MW","Non-coincident"]
[null,null,null,null,"Coincident"]
[null,null,"WEATHER CORRECTED MD 10% POE","MW","Non-coincident"]
[null,null,null,null,"Coincident"]
[null,null,"WEATHER CORRECTED MD 10% POE","MVA","Non-coincident"]
[null,null,null,null,"Coincident"]
[null,null,"WEATHER CORRECTED MD 50% POE","MW","Non-coincident"]
[null,null,null,null,"Coincident"]
[null,null,"WEATHER CORRECTED MD 50% POE","MVA","Non-coincident"]
[null,null,null,null,"Coincident"]
[null,"Stony Point (Whyalla Refiners)","CONNECTION POINT RATING","MVA","Non-coincident"]
[null,null,null,null,"Coincident"]
[null,null,"WINTER/SUMMER PEAKING",null,"Non-coincident"]
[null,null,null,null,"Coincident"]
[null,null,"ADJUSTMENTS - EMBEDDED GENERATION","MW","Non-coincident"]
[null,null,null,null,"Coincident"]
[null,null,"WEATHER CORRECTED MD 10% POE","MW","Non-coincident"]
[null,null,null,null,"Coincident"]
[null,null,"WEATHER CORRECTED MD 10% POE","MVA","Non-coincident"]
[null,null,null,null,"Coincident"]
[null,null,"WEATHER CORRECTED MD 50% POE","MW","Non-coincident"]
[null,null,null,null,"Coincident"]
[null,null,"WEATHER CORRECTED MD 50% POE","MVA","Non-coincident"]
[null,null,null,null,"Coincident"]
[null,"Whyalla LMF ","CONNECTION POINT RATING","MVA","Non-coincident"]
[null,null,null,null,"Coincident"]
[null,null,"WINTER/SUMMER PEAKING",null,"Non-coincident"]
[null,null,null,null,"Coincident"]
[null,null,"ADJUSTMENTS - EMBEDDED GENERATION","MW","Non-coincident"]
[null,null,null,null,"Coincident"]
[null,null,"WEATHER CORRECTED MD 10% POE","MW","Non-coincident"]
[null,null,null,null,"Coincident"]
[null,null,"WEATHER CORRECTED MD 10% POE","MVA","Non-coincident"]
[null,null,null,null,"Coincident"]
[null,null,"WEATHER CORRECTED MD 50% POE","MW","Non-coincident"]
[null,null,null,null,"Coincident"]
[null,null,"WEATHER CORRECTED MD 50% POE","MVA","Non-coincident"]
[null,null,null,null,"Coincident"]
[null,"Woomera ","CONNECTION POINT RATING","MVA","Non-coincident"]
[null,null,null,null,"Coincident"]
[null,null,"WINTER/SUMMER PEAKING",null,"Non-coincident"]
[null,null,null,null,"Coincident"]
[null,null,"ADJUSTMENTS - EMBEDDED GENERATION","MW","Non-coincident"]
[null,null,null,null,"Coincident"]
[null,null,"WEATHER CORRECTED MD 10% POE","MW","Non-coincident"]
[null,null,null,null,"Coincident"]
[null,null,"WEATHER CORRECTED MD 10% POE","MVA","Non-coincident"]
[null,null,null,null,"Coincident"]
[null,null,"WEATHER CORRECTED MD 50% POE","MW","Non-coincident"]
[null,null,null,null,"Coincident"]
[null,null,"WEATHER CORRECTED MD 50% POE","MVA","Non-coincident"]
[null,null,null,null,"Coincident"]
[null,"Roseworthy ","CONNECTION POINT RATING","MVA","Non-coincident"]
[null,null,null,null,"Coincident"]
[null,null,"WINTER/SUMMER PEAKING",null,"Non-coincident"]
[null,null,null,null,"Coincident"]
[null,null,"ADJUSTMENTS - EMBEDDED GENERATION","MW","Non-coincident"]
[null,null,null,null,"Coincident"]
[null,null,"WEATHER CORRECTED MD 10% POE","MW","Non-coincident"]
[null,null,null,null,"Coincident"]
[null,null,"WEATHER CORRECTED MD 10% POE","MVA","Non-coincident"]
[null,null,null,null,"Coincident"]
[null,null,"WEATHER CORRECTED MD 50% POE","MW","Non-coincident"]
[null,null,null,null,"Coincident"]
[null,null,"WEATHER CORRECTED MD 50% POE","MVA","Non-coincident"]
[null,null,null,null,"Coincident"]
[null,"Torrens Island House Supplies ","CONNECTION POINT RATING","MVA","Non-coincident"]
[null,null,null,null,"Coincident"]
[null,null,"WINTER/SUMMER PEAKING",null,"Non-coincident"]
[null,null,null,null,"Coincident"]
[null,null,"ADJUSTMENTS - EMBEDDED GENERATION","MW","Non-coincident"]
[null,null,null,null,"Coincident"]
[null,null,"WEATHER CORRECTED MD 10% POE","MW","Non-coincident"]
[null,null,null,null,"Coincident"]
[null,null,"WEATHER CORRECTED MD 10% POE","MVA","Non-coincident"]
[null,null,null,null,"Coincident"]
[null,null,"WEATHER CORRECTED MD 50% POE","MW","Non-coincident"]
[null,null,null,null,"Coincident"]
[null,null,"WEATHER CORRECTED MD 50% POE","MVA","Non-coincident"]
[null,null,null,null,"Coincident"]
[null,"NSP to enter name","CONNECTION POINT RATING","MVA","Non-coincident"]
[null,null,null,null,"Coincident"]
[null,null,"WINTER/SUMMER PEAKING",null,"Non-coincident"]
[null,null,null,null,"Coincident"]
[null,null,"ADJUSTMENTS - EMBEDDED GENERATION","MW","Non-coincident"]
[null,null,null,null,"Coincident"]
[null,null,"WEATHER CORRECTED MD 10% POE","MW","Non-coincident"]
[null,null,null,null,"Coincident"]
[null,null,"WEATHER CORRECTED MD 10% POE","MVA","Non-coincident"]
[null,null,null,null,"Coincident"]
[null,null,"WEATHER CORRECTED MD 50% POE","MW","Non-coincident"]
[null,null,null,null,"Coincident"]
[null,null,"WEATHER CORRECTED MD 50% POE","MVA","Non-coincident"]
[null,null,null,null,"Coincident"]
[null,"NSP to enter name","CONNECTION POINT RATING","MVA","Non-coincident"]
[null,null,null,null,"Coincident"]
[null,null,"WINTER/SUMMER PEAKING",null,"Non-coincident"]
[null,null,null,null,"Coincident"]
[null,null,"ADJUSTMENTS - EMBEDDED GENERATION","MW","Non-coincident"]
[null,null,null,null,"Coincident"]
[null,null,"WEATHER CORRECTED MD 10% POE","MW","Non-coincident"]
[null,null,null,null,"Coincident"]
[null,null,"WEATHER CORRECTED MD 10% POE","MVA","Non-coincident"]
[null,null,null,null,"Coincident"]
[null,null,"WEATHER CORRECTED MD 50% POE","MW","Non-coincident"]
[null,null,null,null,"Coincident"]
[null,null,"WEATHER CORRECTED MD 50% POE","MVA","Non-coincident"]
[null,null,null,null,"Coincident"]
[null,"NSP to enter name","CONNECTION POINT RATING","MVA","Non-coincident"]
[null,null,null,null,"Coincident"]
[null,null,"WINTER/SUMMER PEAKING",null,"Non-coincident"]
[null,null,null,null,"Coincident"]
[null,null,"ADJUSTMENTS - EMBEDDED GENERATION","MW","Non-coincident"]
[null,null,null,null,"Coincident"]
[null,null,"WEATHER CORRECTED MD 10% POE","MW","Non-coincident"]
[null,null,null,null,"Coincident"]
[null,null,"WEATHER CORRECTED MD 10% POE","MVA","Non-coincident"]
[null,null,null,null,"Coincident"]
[null,null,"WEATHER CORRECTED MD 50% POE","MW","Non-coincident"]
[null,null,null,null,"Coincident"]
[null,null,"WEATHER CORRECTED MD 50% POE","MVA","Non-coincident"]
[null,null,null,null,"Coincident"]
[null,"NSP to enter name","CONNECTION POINT RATING","MVA","Non-coincident"]
[null,null,null,null,"Coincident"]
[null,null,"WINTER/SUMMER PEAKING",null,"Non-coincident"]
[null,null,null,null,"Coincident"]
[null,null,"ADJUSTMENTS - EMBEDDED GENERATION","MW","Non-coincident"]
[null,null,null,null,"Coincident"]
[null,null,"WEATHER CORRECTED MD 10% POE","MW","Non-coincident"]
[null,null,null,null,"Coincident"]
[null,null,"WEATHER CORRECTED MD 10% POE","MVA","Non-coincident"]
[null,null,null,null,"Coincident"]
[null,null,"WEATHER CORRECTED MD 50% POE","MW","Non-coincident"]
[null,null,null,null,"Coincident"]
[null,null,"WEATHER CORRECTED MD 50% POE","MVA","Non-coincident"]
[null,null,null,null,"Coincident"]
[null,"NSP to enter name","CONNECTION POINT RATING","MVA","Non-coincident"]
[null,null,null,null,"Coincident"]
[null,null,"WINTER/SUMMER PEAKING",null,"Non-coincident"]
[null,null,null,null,"Coincident"]
[null,null,"ADJUSTMENTS - EMBEDDED GENERATION","MW","Non-coincident"]
[null,null,null,null,"Coincident"]
[null,null,"WEATHER CORRECTED MD 10% POE","MW","Non-coincident"]
[null,null,null,null,"Coincident"]
[null,null,"WEATHER CORRECTED MD 10% POE","MVA","Non-coincident"]
[null,null,null,null,"Coincident"]
[null,null,"WEATHER CORRECTED MD 50% POE","MW","Non-coincident"]
[null,null,null,null,"Coincident"]
[null,null,"WEATHER CORRECTED MD 50% POE","MVA","Non-coincident"]
[null,null,null,null,"Coincident"]
[null,"NSP to enter name","CONNECTION POINT RATING","MVA","Non-coincident"]
[null,null,null,null,"Coincident"]
[null,null,"WINTER/SUMMER PEAKING",null,"Non-coincident"]
[null,null,null,null,"Coincident"]
[null,null,"ADJUSTMENTS - EMBEDDED GENERATION","MW","Non-coincident"]
[null,null,null,null,"Coincident"]
[null,null,"WEATHER CORRECTED MD 10% POE","MW","Non-coincident"]
[null,null,null,null,"Coincident"]
[null,null,"WEATHER CORRECTED MD 10% POE","MVA","Non-coincident"]
[null,null,null,null,"Coincident"]
[null,null,"WEATHER CORRECTED MD 50% POE","MW","Non-coincident"]
[null,null,null,null,"Coincident"]
[null,null,"WEATHER CORRECTED MD 50% POE","MVA","Non-coincident"]
[null,null,null,null,"Coincident"]
[null,"NSP to enter name","CONNECTION POINT RATING","MVA","Non-coincident"]
[null,null,null,null,"Coincident"]
[null,null,"WINTER/SUMMER PEAKING",null,"Non-coincident"]
[null,null,null,null,"Coincident"]
[null,null,"ADJUSTMENTS - EMBEDDED GENERATION","MW","Non-coincident"]
[null,null,null,null,"Coincident"]
[null,null,"WEATHER CORRECTED MD 10% POE","MW","Non-coincident"]
[null,null,null,null,"Coincident"]
[null,null,"WEATHER CORRECTED MD 10% POE","MVA","Non-coincident"]
[null,null,null,null,"Coincident"]
[null,null,"WEATHER CORRECTED MD 50% POE","MW","Non-coincident"]
[null,null,null,null,"Coincident"]
[null,null,"WEATHER CORRECTED MD 50% POE","MVA","Non-coincident"]
[null,null,null,null,"Coincident"]
[null,"NSP to enter name","CONNECTION POINT RATING","MVA","Non-coincident"]
[null,null,null,null,"Coincident"]
[null,null,"WINTER/SUMMER PEAKING",null,"Non-coincident"]
[null,null,null,null,"Coincident"]
[null,null,"ADJUSTMENTS - EMBEDDED GENERATION","MW","Non-coincident"]
[null,null,null,null,"Coincident"]
[null,null,"WEATHER CORRECTED MD 10% POE","MW","Non-coincident"]
[null,null,null,null,"Coincident"]
[null,null,"WEATHER CORRECTED MD 10% POE","MVA","Non-coincident"]
[null,null,null,null,"Coincident"]
[null,null,"WEATHER CORRECTED MD 50% POE","MW","Non-coincident"]
[null,null,null,null,"Coincident"]
[null,null,"WEATHER CORRECTED MD 50% POE","MVA","Non-coincident"]
[null,null,null,null,"Coincident"]
[null,"NSP to enter name","CONNECTION POINT RATING","MVA","Non-coincident"]
[null,null,null,null,"Coincident"]
[null,null,"WINTER/SUMMER PEAKING",null,"Non-coincident"]
[null,null,null,null,"Coincident"]
[null,null,"ADJUSTMENTS - EMBEDDED GENERATION","MW","Non-coincident"]
[null,null,null,null,"Coincident"]
[null,null,"WEATHER CORRECTED MD 10% POE","MW","Non-coincident"]
[null,null,null,null,"Coincident"]
[null,null,"WEATHER CORRECTED MD 10% POE","MVA","Non-coincident"]
[null,null,null,null,"Coincident"]
[null,null,"WEATHER CORRECTED MD 50% POE","MW","Non-coincident"]
[null,null,null,null,"Coincident"]
[null,null,"WEATHER CORRECTED MD 50% POE","MVA","Non-coincident"]
[null,null,null,null,"Coincident"]
[null,"NSP to enter name","CONNECTION POINT RATING","MVA","Non-coincident"]
[null,null,null,null,"Coincident"]
[null,null,"WINTER/SUMMER PEAKING",null,"Non-coincident"]
[null,null,null,null,"Coincident"]
[null,null,"ADJUSTMENTS - EMBEDDED GENERATION","MW","Non-coincident"]
[null,null,null,null,"Coincident"]
[null,null,"WEATHER CORRECTED MD 10% POE","MW","Non-coincident"]
[null,null,null,null,"Coincident"]
[null,null,"WEATHER CORRECTED MD 10% POE","MVA","Non-coincident"]
[null,null,null,null,"Coincident"]
[null,null,"WEATHER CORRECTED MD 50% POE","MW","Non-coincident"]
[null,null,null,null,"Coincident"]
[null,null,"WEATHER CORRECTED MD 50% POE","MVA","Non-coincident"]
[null,null,null,null,"Coincident"]
[null,"NSP to enter name","CONNECTION POINT RATING","MVA","Non-coincident"]
[null,null,null,null,"Coincident"]
[null,null,"WINTER/SUMMER PEAKING",null,"Non-coincident"]
[null,null,null,null,"Coincident"]
[null,null,"ADJUSTMENTS - EMBEDDED GENERATION","MW","Non-coincident"]
[null,null,null,null,"Coincident"]
[null,null,"WEATHER CORRECTED MD 10% POE","MW","Non-coincident"]
[null,null,null,null,"Coincident"]
[null,null,"WEATHER CORRECTED MD 10% POE","MVA","Non-coincident"]
[null,null,null,null,"Coincident"]
[null,null,"WEATHER CORRECTED MD 50% POE","MW","Non-coincident"]
[null,null,null,null,"Coincident"]
[null,null,"WEATHER CORRECTED MD 50% POE","MVA","Non-coincident"]
[null,null,null,null,"Coincident"]
[null,"NSP to enter name","CONNECTION POINT RATING","MVA","Non-coincident"]
[null,null,null,null,"Coincident"]
[null,null,"WINTER/SUMMER PEAKING",null,"Non-coincident"]
[null,null,null,null,"Coincident"]
[null,null,"ADJUSTMENTS - EMBEDDED GENERATION","MW","Non-coincident"]
[null,null,null,null,"Coincident"]
[null,null,"WEATHER CORRECTED MD 10% POE","MW","Non-coincident"]
[null,null,null,null,"Coincident"]
[null,null,"WEATHER CORRECTED MD 10% POE","MVA","Non-coincident"]
[null,null,null,null,"Coincident"]
[null,null,"WEATHER CORRECTED MD 50% POE","MW","Non-coincident"]
[null,null,null,null,"Coincident"]
[null,null,"WEATHER CORRECTED MD 50% POE","MVA","Non-coincident"]
[null,null,null,null,"Coincident"]
[null,"NSP to enter name","CONNECTION POINT RATING","MVA","Non-coincident"]
[null,null,null,null,"Coincident"]
[null,null,"WINTER/SUMMER PEAKING",null,"Non-coincident"]
[null,null,null,null,"Coincident"]
[null,null,"ADJUSTMENTS - EMBEDDED GENERATION","MW","Non-coincident"]
[null,null,null,null,"Coincident"]
[null,null,"WEATHER CORRECTED MD 10% POE","MW","Non-coincident"]
[null,null,null,null,"Coincident"]
[null,null,"WEATHER CORRECTED MD 10% POE","MVA","Non-coincident"]
[null,null,null,null,"Coincident"]
[null,null,"WEATHER CORRECTED MD 50% POE","MW","Non-coincident"]
[null,null,null,null,"Coincident"]
[null,null,"WEATHER CORRECTED MD 50% POE","MVA","Non-coincident"]
[null,null,null,null,"Coincident"]
[null,"NSP to enter name","CONNECTION POINT RATING","MVA","Non-coincident"]
[null,null,null,null,"Coincident"]
[null,null,"WINTER/SUMMER PEAKING",null,"Non-coincident"]
[null,null,null,null,"Coincident"]
[null,null,"ADJUSTMENTS - EMBEDDED GENERATION","MW","Non-coincident"]
[null,null,null,null,"Coincident"]
[null,null,"WEATHER CORRECTED MD 10% POE","MW","Non-coincident"]
[null,null,null,null,"Coincident"]
[null,null,"WEATHER CORRECTED MD 10% POE","MVA","Non-coincident"]
[null,null,null,null,"Coincident"]
[null,null,"WEATHER CORRECTED MD 50% POE","MW","Non-coincident"]
[null,null,null,null,"Coincident"]
[null,null,"WEATHER CORRECTED MD 50% POE","MVA","Non-coincident"]
[null,null,null,null,"Coincident"]
[null,"NSP to enter name","CONNECTION POINT RATING","MVA","Non-coincident"]
[null,null,null,null,"Coincident"]
[null,null,"WINTER/SUMMER PEAKING",null,"Non-coincident"]
[null,null,null,null,"Coincident"]
[null,null,"ADJUSTMENTS - EMBEDDED GENERATION","MW","Non-coincident"]
[null,null,null,null,"Coincident"]
[null,null,"WEATHER CORRECTED MD 10% POE","MW","Non-coincident"]
[null,null,null,null,"Coincident"]
[null,null,"WEATHER CORRECTED MD 10% POE","MVA","Non-coincident"]
[null,null,null,null,"Coincident"]
[null,null,"WEATHER CORRECTED MD 50% POE","MW","Non-coincident"]
[null,null,null,null,"Coincident"]
[null,null,"WEATHER CORRECTED MD 50% POE","MVA","Non-coincident"]
[null,null,null,null,"Coincident"]
[null,"NSP to enter name","CONNECTION POINT RATING","MVA","Non-coincident"]
[null,null,null,null,"Coincident"]
[null,null,"WINTER/SUMMER PEAKING",null,"Non-coincident"]
[null,null,null,null,"Coincident"]
[null,null,"ADJUSTMENTS - EMBEDDED GENERATION","MW","Non-coincident"]
[null,null,null,null,"Coincident"]
[null,null,"WEATHER CORRECTED MD 10% POE","MW","Non-coincident"]
[null,null,null,null,"Coincident"]
[null,null,"WEATHER CORRECTED MD 10% POE","MVA","Non-coincident"]
[null,null,null,null,"Coincident"]
[null,null,"WEATHER CORRECTED MD 50% POE","MW","Non-coincident"]
[null,null,null,null,"Coincident"]
[null,null,"WEATHER CORRECTED MD 50% POE","MVA","Non-coincident"]
[null,null,null,null,"Coincident"]
[null,"NSP to enter name","CONNECTION POINT RATING","MVA","Non-coincident"]
[null,null,null,null,"Coincident"]
[null,null,"WINTER/SUMMER PEAKING",null,"Non-coincident"]
[null,null,null,null,"Coincident"]
[null,null,"ADJUSTMENTS - EMBEDDED GENERATION","MW","Non-coincident"]
[null,null,null,null,"Coincident"]
[null,null,"WEATHER CORRECTED MD 10% POE","MW","Non-coincident"]
[null,null,null,null,"Coincident"]
[null,null,"WEATHER CORRECTED MD 10% POE","MVA","Non-coincident"]
[null,null,null,null,"Coincident"]
[null,null,"WEATHER CORRECTED MD 50% POE","MW","Non-coincident"]
[null,null,null,null,"Coincident"]
[null,null,"WEATHER CORRECTED MD 50% POE","MVA","Non-coincident"]
[null,null,null,null,"Coincident"]
[null,"NSP to enter name","CONNECTION POINT RATING","MVA","Non-coincident"]
[null,null,null,null,"Coincident"]
[null,null,"WINTER/SUMMER PEAKING",null,"Non-coincident"]
[null,null,null,null,"Coincident"]
[null,null,"ADJUSTMENTS - EMBEDDED GENERATION","MW","Non-coincident"]
[null,null,null,null,"Coincident"]
[null,null,"WEATHER CORRECTED MD 10% POE","MW","Non-coincident"]
[null,null,null,null,"Coincident"]
[null,null,"WEATHER CORRECTED MD 10% POE","MVA","Non-coincident"]
[null,null,null,null,"Coincident"]
[null,null,"WEATHER CORRECTED MD 50% POE","MW","Non-coincident"]
[null,null,null,null,"Coincident"]
[null,null,"WEATHER CORRECTED MD 50% POE","MVA","Non-coincident"]
[null,null,null,null,"Coincident"]
[null,"NSP to enter name","CONNECTION POINT RATING","MVA","Non-coincident"]
[null,null,null,null,"Coincident"]
[null,null,"WINTER/SUMMER PEAKING",null,"Non-coincident"]
[null,null,null,null,"Coincident"]
[null,null,"ADJUSTMENTS - EMBEDDED GENERATION","MW","Non-coincident"]
[null,null,null,null,"Coincident"]
[null,null,"WEATHER CORRECTED MD 10% POE","MW","Non-coincident"]
[null,null,null,null,"Coincident"]
[null,null,"WEATHER CORRECTED MD 10% POE","MVA","Non-coincident"]
[null,null,null,null,"Coincident"]
[null,null,"WEATHER CORRECTED MD 50% POE","MW","Non-coincident"]
[null,null,null,null,"Coincident"]
[null,null,"WEATHER CORRECTED MD 50% POE","MVA","Non-coincident"]
[null,null,null,null,"Coincident"]
[null,"NSP to enter name","CONNECTION POINT RATING","MVA","Non-coincident"]
[null,null,null,null,"Coincident"]
[null,null,"WINTER/SUMMER PEAKING",null,"Non-coincident"]
[null,null,null,null,"Coincident"]
[null,null,"ADJUSTMENTS - EMBEDDED GENERATION","MW","Non-coincident"]
[null,null,null,null,"Coincident"]
[null,null,"WEATHER CORRECTED MD 10% POE","MW","Non-coincident"]
[null,null,null,null,"Coincident"]
[null,null,"WEATHER CORRECTED MD 10% POE","MVA","Non-coincident"]
[null,null,null,null,"Coincident"]
[null,null,"WEATHER CORRECTED MD 50% POE","MW","Non-coincident"]
[null,null,null,null,"Coincident"]
[null,null,"WEATHER CORRECTED MD 50% POE","MVA","Non-coincident"]
[null,null,null,null,"Coincident"]
[null,"NSP to enter name","CONNECTION POINT RATING","MVA","Non-coincident"]
[null,null,null,null,"Coincident"]
[null,null,"WINTER/SUMMER PEAKING",null,"Non-coincident"]
[null,null,null,null,"Coincident"]
[null,null,"ADJUSTMENTS - EMBEDDED GENERATION","MW","Non-coincident"]
[null,null,null,null,"Coincident"]
[null,null,"WEATHER CORRECTED MD 10% POE","MW","Non-coincident"]
[null,null,null,null,"Coincident"]
[null,null,"WEATHER CORRECTED MD 10% POE","MVA","Non-coincident"]
[null,null,null,null,"Coincident"]
[null,null,"WEATHER CORRECTED MD 50% POE","MW","Non-coincident"]
[null,null,null,null,"Coincident"]
[null,null,"WEATHER CORRECTED MD 50% POE","MVA","Non-coincident"]
[null,null,null,null,"Coincident"]
[null,"NSP to enter name","CONNECTION POINT RATING","MVA","Non-coincident"]
[null,null,null,null,"Coincident"]
[null,null,"WINTER/SUMMER PEAKING",null,"Non-coincident"]
[null,null,null,null,"Coincident"]
[null,null,"ADJUSTMENTS - EMBEDDED GENERATION","MW","Non-coincident"]
[null,null,null,null,"Coincident"]
[null,null,"WEATHER CORRECTED MD 10% POE","MW","Non-coincident"]
[null,null,null,null,"Coincident"]
[null,null,"WEATHER CORRECTED MD 10% POE","MVA","Non-coincident"]
[null,null,null,null,"Coincident"]
[null,null,"WEATHER CORRECTED MD 50% POE","MW","Non-coincident"]
[null,null,null,null,"Coincident"]
[null,null,"WEATHER CORRECTED MD 50% POE","MVA","Non-coincident"]
[null,null,null,null,"Coincident"]
[null,"NSP to enter name","CONNECTION POINT RATING","MVA","Non-coincident"]
[null,null,null,null,"Coincident"]
[null,null,"WINTER/SUMMER PEAKING",null,"Non-coincident"]
[null,null,null,null,"Coincident"]
[null,null,"ADJUSTMENTS - EMBEDDED GENERATION","MW","Non-coincident"]
[null,null,null,null,"Coincident"]
[null,null,"WEATHER CORRECTED MD 10% POE","MW","Non-coincident"]
[null,null,null,null,"Coincident"]
[null,null,"WEATHER CORRECTED MD 10% POE","MVA","Non-coincident"]
[null,null,null,null,"Coincident"]
[null,null,"WEATHER CORRECTED MD 50% POE","MW","Non-coincident"]
[null,null,null,null,"Coincident"]
[null,null,"WEATHER CORRECTED MD 50% POE","MVA","Non-coincident"]
[null,null,null,null,"Coincident"]
[null,"NSP to enter name","CONNECTION POINT RATING","MVA","Non-coincident"]
[null,null,null,null,"Coincident"]
[null,null,"WINTER/SUMMER PEAKING",null,"Non-coincident"]
[null,null,null,null,"Coincident"]
[null,null,"ADJUSTMENTS - EMBEDDED GENERATION","MW","Non-coincident"]
[null,null,null,null,"Coincident"]
[null,null,"WEATHER CORRECTED MD 10% POE","MW","Non-coincident"]
[null,null,null,null,"Coincident"]
[null,null,"WEATHER CORRECTED MD 10% POE","MVA","Non-coincident"]
[null,null,null,null,"Coincident"]
[null,null,"WEATHER CORRECTED MD 50% POE","MW","Non-coincident"]
[null,null,null,null,"Coincident"]
[null,null,"WEATHER CORRECTED MD 50% POE","MVA","Non-coincident"]
[null,null,null,null,"Coincident"]
[null,"NSP to enter name","CONNECTION POINT RATING","MVA","Non-coincident"]
[null,null,null,null,"Coincident"]
[null,null,"WINTER/SUMMER PEAKING",null,"Non-coincident"]
[null,null,null,null,"Coincident"]
[null,null,"ADJUSTMENTS - EMBEDDED GENERATION","MW","Non-coincident"]
[null,null,null,null,"Coincident"]
[null,null,"WEATHER CORRECTED MD 10% POE","MW","Non-coincident"]
[null,null,null,null,"Coincident"]
[null,null,"WEATHER CORRECTED MD 10% POE","MVA","Non-coincident"]
[null,null,null,null,"Coincident"]
[null,null,"WEATHER CORRECTED MD 50% POE","MW","Non-coincident"]
[null,null,null,null,"Coincident"]
[null,null,"WEATHER CORRECTED MD 50% POE","MVA","Non-coincident"]
[null,null,null,null,"Coincident"]
[null,"NSP to enter name","CONNECTION POINT RATING","MVA","Non-coincident"]
[null,null,null,null,"Coincident"]
[null,null,"WINTER/SUMMER PEAKING",null,"Non-coincident"]
[null,null,null,null,"Coincident"]
[null,null,"ADJUSTMENTS - EMBEDDED GENERATION","MW","Non-coincident"]
[null,null,null,null,"Coincident"]
[null,null,"WEATHER CORRECTED MD 10% POE","MW","Non-coincident"]
[null,null,null,null,"Coincident"]
[null,null,"WEATHER CORRECTED MD 10% POE","MVA","Non-coincident"]
[null,null,null,null,"Coincident"]
[null,null,"WEATHER CORRECTED MD 50% POE","MW","Non-coincident"]
[null,null,null,null,"Coincident"]
[null,null,"WEATHER CORRECTED MD 50% POE","MVA","Non-coincident"]
[null,null,null,null,"Coincident"]
[null,"NSP to enter name","CONNECTION POINT RATING","MVA","Non-coincident"]
[null,null,null,null,"Coincident"]
[null,null,"WINTER/SUMMER PEAKING",null,"Non-coincident"]
[null,null,null,null,"Coincident"]
[null,null,"ADJUSTMENTS - EMBEDDED GENERATION","MW","Non-coincident"]
[null,null,null,null,"Coincident"]
[null,null,"WEATHER CORRECTED MD 10% POE","MW","Non-coincident"]
[null,null,null,null,"Coincident"]
[null,null,"WEATHER CORRECTED MD 10% POE","MVA","Non-coincident"]
[null,null,null,null,"Coincident"]
[null,null,"WEATHER CORRECTED MD 50% POE","MW","Non-coincident"]
[null,null,null,null,"Coincident"]
[null,null,"WEATHER CORRECTED MD 50% POE","MVA","Non-coincident"]
[null,null,null,null,"Coincident"]
[null,"NSP to enter name","CONNECTION POINT RATING","MVA","Non-coincident"]
[null,null,null,null,"Coincident"]
[null,null,"WINTER/SUMMER PEAKING",null,"Non-coincident"]
[null,null,null,null,"Coincident"]
[null,null,"ADJUSTMENTS - EMBEDDED GENERATION","MW","Non-coincident"]
[null,null,null,null,"Coincident"]
[null,null,"WEATHER CORRECTED MD 10% POE","MW","Non-coincident"]
[null,null,null,null,"Coincident"]
[null,null,"WEATHER CORRECTED MD 10% POE","MVA","Non-coincident"]
[null,null,null,null,"Coincident"]
[null,null,"WEATHER CORRECTED MD 50% POE","MW","Non-coincident"]
[null,null,null,null,"Coincident"]
[null,null,"WEATHER CORRECTED MD 50% POE","MVA","Non-coincident"]
[null,null,null,null,"Coincident"]
[null,"NSP to enter name","CONNECTION POINT RATING","MVA","Non-coincident"]
[null,null,null,null,"Coincident"]
[null,null,"WINTER/SUMMER PEAKING",null,"Non-coincident"]
[null,null,null,null,"Coincident"]
[null,null,"ADJUSTMENTS - EMBEDDED GENERATION","MW","Non-coincident"]
[null,null,null,null,"Coincident"]
[null,null,"WEATHER CORRECTED MD 10% POE","MW","Non-coincident"]
[null,null,null,null,"Coincident"]
[null,null,"WEATHER CORRECTED MD 10% POE","MVA","Non-coincident"]
[null,null,null,null,"Coincident"]
[null,null,"WEATHER CORRECTED MD 50% POE","MW","Non-coincident"]
[null,null,null,null,"Coincident"]
[null,null,"WEATHER CORRECTED MD 50% POE","MVA","Non-coincident"]
[null,null,null,null,"Coincident"]
[null,"NSP to enter name","CONNECTION POINT RATING","MVA","Non-coincident"]
[null,null,null,null,"Coincident"]
[null,null,"WINTER/SUMMER PEAKING",null,"Non-coincident"]
[null,null,null,null,"Coincident"]
[null,null,"ADJUSTMENTS - EMBEDDED GENERATION","MW","Non-coincident"]
[null,null,null,null,"Coincident"]
[null,null,"WEATHER CORRECTED MD 10% POE","MW","Non-coincident"]
[null,null,null,null,"Coincident"]
[null,null,"WEATHER CORRECTED MD 10% POE","MVA","Non-coincident"]
[null,null,null,null,"Coincident"]
[null,null,"WEATHER CORRECTED MD 50% POE","MW","Non-coincident"]
[null,null,null,null,"Coincident"]
[null,null,"WEATHER CORRECTED MD 50% POE","MVA","Non-coincident"]
[null,null,null,null,"Coincident"]
[null,"NSP to enter name","CONNECTION POINT RATING","MVA","Non-coincident"]
[null,null,null,null,"Coincident"]
[null,null,"WINTER/SUMMER PEAKING",null,"Non-coincident"]
[null,null,null,null,"Coincident"]
[null,null,"ADJUSTMENTS - EMBEDDED GENERATION","MW","Non-coincident"]
[null,null,null,null,"Coincident"]
[null,null,"WEATHER CORRECTED MD 10% POE","MW","Non-coincident"]
[null,null,null,null,"Coincident"]
[null,null,"WEATHER CORRECTED MD 10% POE","MVA","Non-coincident"]
[null,null,null,null,"Coincident"]
[null,null,"WEATHER CORRECTED MD 50% POE","MW","Non-coincident"]
[null,null,null,null,"Coincident"]
[null,null,"WEATHER CORRECTED MD 50% POE","MVA","Non-coincident"]
[null,null,null,null,"Coincident"]
[null,"NSP to enter name","CONNECTION POINT RATING","MVA","Non-coincident"]
[null,null,null,null,"Coincident"]
[null,null,"WINTER/SUMMER PEAKING",null,"Non-coincident"]
[null,null,null,null,"Coincident"]
[null,null,"ADJUSTMENTS - EMBEDDED GENERATION","MW","Non-coincident"]
[null,null,null,null,"Coincident"]
[null,null,"WEATHER CORRECTED MD 10% POE","MW","Non-coincident"]
[null,null,null,null,"Coincident"]
[null,null,"WEATHER CORRECTED MD 10% POE","MVA","Non-coincident"]
[null,null,null,null,"Coincident"]
[null,null,"WEATHER CORRECTED MD 50% POE","MW","Non-coincident"]
[null,null,null,null,"Coincident"]
[null,null,"WEATHER CORRECTED MD 50% POE","MVA","Non-coincident"]
[null,null,null,null,"Coincident"]
[null,"NSP to enter name","CONNECTION POINT RATING","MVA","Non-coincident"]
[null,null,null,null,"Coincident"]
[null,null,"WINTER/SUMMER PEAKING",null,"Non-coincident"]
[null,null,null,null,"Coincident"]
[null,null,"ADJUSTMENTS - EMBEDDED GENERATION","MW","Non-coincident"]
[null,null,null,null,"Coincident"]
[null,null,"WEATHER CORRECTED MD 10% POE","MW","Non-coincident"]
[null,null,null,null,"Coincident"]
[null,null,"WEATHER CORRECTED MD 10% POE","MVA","Non-coincident"]
[null,null,null,null,"Coincident"]
[null,null,"WEATHER CORRECTED MD 50% POE","MW","Non-coincident"]
[null,null,null,null,"Coincident"]
[null,null,"WEATHER CORRECTED MD 50% POE","MVA","Non-coincident"]
[null,null,null,null,"Coincident"]
[null,"NSP to enter name","CONNECTION POINT RATING","MVA","Non-coincident"]
[null,null,null,null,"Coincident"]
[null,null,"WINTER/SUMMER PEAKING",null,"Non-coincident"]
[null,null,null,null,"Coincident"]
[null,null,"ADJUSTMENTS - EMBEDDED GENERATION","MW","Non-coincident"]
[null,null,null,null,"Coincident"]
[null,null,"WEATHER CORRECTED MD 10% POE","MW","Non-coincident"]
[null,null,null,null,"Coincident"]
[null,null,"WEATHER CORRECTED MD 10% POE","MVA","Non-coincident"]
[null,null,null,null,"Coincident"]
[null,null,"WEATHER CORRECTED MD 50% POE","MW","Non-coincident"]
[null,null,null,null,"Coincident"]
[null,null,"WEATHER CORRECTED MD 50% POE","MVA","Non-coincident"]
[null,null,null,null,"Coincident"]
[null,"NSP to enter name","CONNECTION POINT RATING","MVA","Non-coincident"]
[null,null,null,null,"Coincident"]
[null,null,"WINTER/SUMMER PEAKING",null,"Non-coincident"]
[null,null,null,null,"Coincident"]
[null,null,"ADJUSTMENTS - EMBEDDED GENERATION","MW","Non-coincident"]
[null,null,null,null,"Coincident"]
[null,null,"WEATHER CORRECTED MD 10% POE","MW","Non-coincident"]
[null,null,null,null,"Coincident"]
[null,null,"WEATHER CORRECTED MD 10% POE","MVA","Non-coincident"]
[null,null,null,null,"Coincident"]
[null,null,"WEATHER CORRECTED MD 50% POE","MW","Non-coincident"]
[null,null,null,null,"Coincident"]
[null,null,"WEATHER CORRECTED MD 50% POE","MVA","Non-coincident"]
[null,null,null,null,"Coincident"]
[null,"NSP to enter name","CONNECTION POINT RATING","MVA","Non-coincident"]
[null,null,null,null,"Coincident"]
[null,null,"WINTER/SUMMER PEAKING",null,"Non-coincident"]
[null,null,null,null,"Coincident"]
[null,null,"ADJUSTMENTS - EMBEDDED GENERATION","MW","Non-coincident"]
[null,null,null,null,"Coincident"]
[null,null,"WEATHER CORRECTED MD 10% POE","MW","Non-coincident"]
[null,null,null,null,"Coincident"]
[null,null,"WEATHER CORRECTED MD 10% POE","MVA","Non-coincident"]
[null,null,null,null,"Coincident"]
[null,null,"WEATHER CORRECTED MD 50% POE","MW","Non-coincident"]
[null,null,null,null,"Coincident"]
[null,null,"WEATHER CORRECTED MD 50% POE","MVA","Non-coincident"]
[null,null,null,null,"Coincident"]
[null,"NSP to enter name","CONNECTION POINT RATING","MVA","Non-coincident"]
[null,null,null,null,"Coincident"]
[null,null,"WINTER/SUMMER PEAKING",null,"Non-coincident"]
[null,null,null,null,"Coincident"]
[null,null,"ADJUSTMENTS - EMBEDDED GENERATION","MW","Non-coincident"]
[null,null,null,null,"Coincident"]
[null,null,"WEATHER CORRECTED MD 10% POE","MW","Non-coincident"]
[null,null,null,null,"Coincident"]
[null,null,"WEATHER CORRECTED MD 10% POE","MVA","Non-coincident"]
[null,null,null,null,"Coincident"]
[null,null,"WEATHER CORRECTED MD 50% POE","MW","Non-coincident"]
[null,null,null,null,"Coincident"]
[null,null,"WEATHER CORRECTED MD 50% POE","MVA","Non-coincident"]
[null,null,null,null,"Coincident"]
[null,"NSP to enter name","CONNECTION POINT RATING","MVA","Non-coincident"]
[null,null,null,null,"Coincident"]
[null,null,"WINTER/SUMMER PEAKING",null,"Non-coincident"]
[null,null,null,null,"Coincident"]
[null,null,"ADJUSTMENTS - EMBEDDED GENERATION","MW","Non-coincident"]
[null,null,null,null,"Coincident"]
[null,null,"WEATHER CORRECTED MD 10% POE","MW","Non-coincident"]
[null,null,null,null,"Coincident"]
[null,null,"WEATHER CORRECTED MD 10% POE","MVA","Non-coincident"]
[null,null,null,null,"Coincident"]
[null,null,"WEATHER CORRECTED MD 50% POE","MW","Non-coincident"]
[null,null,null,null,"Coincident"]
[null,null,"WEATHER CORRECTED MD 50% POE","MVA","Non-coincident"]
[null,null,null,null,"Coincident"]
[null,"NSP to enter name","CONNECTION POINT RATING","MVA","Non-coincident"]
[null,null,null,null,"Coincident"]
[null,null,"WINTER/SUMMER PEAKING",null,"Non-coincident"]
[null,null,null,null,"Coincident"]
[null,null,"ADJUSTMENTS - EMBEDDED GENERATION","MW","Non-coincident"]
[null,null,null,null,"Coincident"]
[null,null,"WEATHER CORRECTED MD 10% POE","MW","Non-coincident"]
[null,null,null,null,"Coincident"]
[null,null,"WEATHER CORRECTED MD 10% POE","MVA","Non-coincident"]
[null,null,null,null,"Coincident"]
[null,null,"WEATHER CORRECTED MD 50% POE","MW","Non-coincident"]
[null,null,null,null,"Coincident"]
[null,null,"WEATHER CORRECTED MD 50% POE","MVA","Non-coincident"]
[null,null,null,null,"Coincident"]
[null,"NSP to enter name","CONNECTION POINT RATING","MVA","Non-coincident"]
[null,null,null,null,"Coincident"]
[null,null,"WINTER/SUMMER PEAKING",null,"Non-coincident"]
[null,null,null,null,"Coincident"]
[null,null,"ADJUSTMENTS - EMBEDDED GENERATION","MW","Non-coincident"]
[null,null,null,null,"Coincident"]
[null,null,"WEATHER CORRECTED MD 10% POE","MW","Non-coincident"]
[null,null,null,null,"Coincident"]
[null,null,"WEATHER CORRECTED MD 10% POE","MVA","Non-coincident"]
[null,null,null,null,"Coincident"]
[null,null,"WEATHER CORRECTED MD 50% POE","MW","Non-coincident"]
[null,null,null,null,"Coincident"]
[null,null,"WEATHER CORRECTED MD 50% POE","MVA","Non-coincident"]
[null,null,null,null,"Coincident"]
[null,"NSP to enter name","CONNECTION POINT RATING","MVA","Non-coincident"]
[null,null,null,null,"Coincident"]
[null,null,"WINTER/SUMMER PEAKING",null,"Non-coincident"]
[null,null,null,null,"Coincident"]
[null,null,"ADJUSTMENTS - EMBEDDED GENERATION","MW","Non-coincident"]
[null,null,null,null,"Coincident"]
[null,null,"WEATHER CORRECTED MD 10% POE","MW","Non-coincident"]
[null,null,null,null,"Coincident"]
[null,null,"WEATHER CORRECTED MD 10% POE","MVA","Non-coincident"]
[null,null,null,null,"Coincident"]
[null,null,"WEATHER CORRECTED MD 50% POE","MW","Non-coincident"]
[null,null,null,null,"Coincident"]
[null,null,"WEATHER CORRECTED MD 50% POE","MVA","Non-coincident"]
[null,null,null,null,"Coincident"]
[null,"NSP to enter name","CONNECTION POINT RATING","MVA","Non-coincident"]
[null,null,null,null,"Coincident"]
[null,null,"WINTER/SUMMER PEAKING",null,"Non-coincident"]
[null,null,null,null,"Coincident"]
[null,null,"ADJUSTMENTS - EMBEDDED GENERATION","MW","Non-coincident"]
[null,null,null,null,"Coincident"]
[null,null,"WEATHER CORRECTED MD 10% POE","MW","Non-coincident"]
[null,null,null,null,"Coincident"]
[null,null,"WEATHER CORRECTED MD 10% POE","MVA","Non-coincident"]
[null,null,null,null,"Coincident"]
[null,null,"WEATHER CORRECTED MD 50% POE","MW","Non-coincident"]
[null,null,null,null,"Coincident"]
[null,null,"WEATHER CORRECTED MD 50% POE","MVA","Non-coincident"]
[null,null,null,null,"Coincident"]
[null,"NSP to enter name","CONNECTION POINT RATING","MVA","Non-coincident"]
[null,null,null,null,"Coincident"]
[null,null,"WINTER/SUMMER PEAKING",null,"Non-coincident"]
[null,null,null,null,"Coincident"]
[null,null,"ADJUSTMENTS - EMBEDDED GENERATION","MW","Non-coincident"]
[null,null,null,null,"Coincident"]
[null,null,"WEATHER CORRECTED MD 10% POE","MW","Non-coincident"]
[null,null,null,null,"Coincident"]
[null,null,"WEATHER CORRECTED MD 10% POE","MVA","Non-coincident"]
[null,null,null,null,"Coincident"]
[null,null,"WEATHER CORRECTED MD 50% POE","MW","Non-coincident"]
[null,null,null,null,"Coincident"]
[null,null,"WEATHER CORRECTED MD 50% POE","MVA","Non-coincident"]
[null,null,null,null,"Coincident"]
[null,"NSP to enter name","CONNECTION POINT RATING","MVA","Non-coincident"]
[null,null,null,null,"Coincident"]
[null,null,"WINTER/SUMMER PEAKING",null,"Non-coincident"]
[null,null,null,null,"Coincident"]
[null,null,"ADJUSTMENTS - EMBEDDED GENERATION","MW","Non-coincident"]
[null,null,null,null,"Coincident"]
[null,null,"WEATHER CORRECTED MD 10% POE","MW","Non-coincident"]
[null,null,null,null,"Coincident"]
[null,null,"WEATHER CORRECTED MD 10% POE","MVA","Non-coincident"]
[null,null,null,null,"Coincident"]
[null,null,"WEATHER CORRECTED MD 50% POE","MW","Non-coincident"]
[null,null,null,null,"Coincident"]
[null,null,"WEATHER CORRECTED MD 50% POE","MVA","Non-coincident"]
[null,null,null,null,"Coincident"]
[null,"NSP to enter name","CONNECTION POINT RATING","MVA","Non-coincident"]
[null,null,null,null,"Coincident"]
[null,null,"WINTER/SUMMER PEAKING",null,"Non-coincident"]
[null,null,null,null,"Coincident"]
[null,null,"ADJUSTMENTS - EMBEDDED GENERATION","MW","Non-coincident"]
[null,null,null,null,"Coincident"]
[null,null,"WEATHER CORRECTED MD 10% POE","MW","Non-coincident"]
[null,null,null,null,"Coincident"]
[null,null,"WEATHER CORRECTED MD 10% POE","MVA","Non-coincident"]
[null,null,null,null,"Coincident"]
[null,null,"WEATHER CORRECTED MD 50% POE","MW","Non-coincident"]
[null,null,null,null,"Coincident"]
[null,null,"WEATHER CORRECTED MD 50% POE","MVA","Non-coincident"]
[null,null,null,null,"Coincident"]
[null,"NSP to enter name","CONNECTION POINT RATING","MVA","Non-coincident"]
[null,null,null,null,"Coincident"]
[null,null,"WINTER/SUMMER PEAKING",null,"Non-coincident"]
[null,null,null,null,"Coincident"]
[null,null,"ADJUSTMENTS - EMBEDDED GENERATION","MW","Non-coincident"]
[null,null,null,null,"Coincident"]
[null,null,"WEATHER CORRECTED MD 10% POE","MW","Non-coincident"]
[null,null,null,null,"Coincident"]
[null,null,"WEATHER CORRECTED MD 10% POE","MVA","Non-coincident"]
[null,null,null,null,"Coincident"]
[null,null,"WEATHER CORRECTED MD 50% POE","MW","Non-coincident"]
[null,null,null,null,"Coincident"]
[null,null,"WEATHER CORRECTED MD 50% POE","MVA","Non-coincident"]
[null,null,null,null,"Coincident"]
[null,"NSP to enter name","CONNECTION POINT RATING","MVA","Non-coincident"]
[null,null,null,null,"Coincident"]
[null,null,"WINTER/SUMMER PEAKING",null,"Non-coincident"]
[null,null,null,null,"Coincident"]
[null,null,"ADJUSTMENTS - EMBEDDED GENERATION","MW","Non-coincident"]
[null,null,null,null,"Coincident"]
[null,null,"WEATHER CORRECTED MD 10% POE","MW","Non-coincident"]
[null,null,null,null,"Coincident"]
[null,null,"WEATHER CORRECTED MD 10% POE","MVA","Non-coincident"]
[null,null,null,null,"Coincident"]
[null,null,"WEATHER CORRECTED MD 50% POE","MW","Non-coincident"]
[null,null,null,null,"Coincident"]
[null,null,"WEATHER CORRECTED MD 50% POE","MVA","Non-coincident"]
[null,null,null,null,"Coincident"]
[null,"NSP to enter name","CONNECTION POINT RATING","MVA","Non-coincident"]
[null,null,null,null,"Coincident"]
[null,null,"WINTER/SUMMER PEAKING",null,"Non-coincident"]
[null,null,null,null,"Coincident"]
[null,null,"ADJUSTMENTS - EMBEDDED GENERATION","MW","Non-coincident"]
[null,null,null,null,"Coincident"]
[null,null,"WEATHER CORRECTED MD 10% POE","MW","Non-coincident"]
[null,null,null,null,"Coincident"]
[null,null,"WEATHER CORRECTED MD 10% POE","MVA","Non-coincident"]
[null,null,null,null,"Coincident"]
[null,null,"WEATHER CORRECTED MD 50% POE","MW","Non-coincident"]
[null,null,null,null,"Coincident"]
[null,null,"WEATHER CORRECTED MD 50% POE","MVA","Non-coincident"]
[null,null,null,null,"Coincident"]
[null,"NSP to enter name","CONNECTION POINT RATING","MVA","Non-coincident"]
[null,null,null,null,"Coincident"]
[null,null,"WINTER/SUMMER PEAKING",null,"Non-coincident"]
[null,null,null,null,"Coincident"]
[null,null,"ADJUSTMENTS - EMBEDDED GENERATION","MW","Non-coincident"]
[null,null,null,null,"Coincident"]
[null,null,"WEATHER CORRECTED MD 10% POE","MW","Non-coincident"]
[null,null,null,null,"Coincident"]
[null,null,"WEATHER CORRECTED MD 10% POE","MVA","Non-coincident"]
[null,null,null,null,"Coincident"]
[null,null,"WEATHER CORRECTED MD 50% POE","MW","Non-coincident"]
[null,null,null,null,"Coincident"]
[null,null,"WEATHER CORRECTED MD 50% POE","MVA","Non-coincident"]
[null,null,null,null,"Coincident"]
[null,"NSP to enter name","CONNECTION POINT RATING","MVA","Non-coincident"]
[null,null,null,null,"Coincident"]
[null,null,"WINTER/SUMMER PEAKING",null,"Non-coincident"]
[null,null,null,null,"Coincident"]
[null,null,"ADJUSTMENTS - EMBEDDED GENERATION","MW","Non-coincident"]
[null,null,null,null,"Coincident"]
[null,null,"WEATHER CORRECTED MD 10% POE","MW","Non-coincident"]
[null,null,null,null,"Coincident"]
[null,null,"WEATHER CORRECTED MD 10% POE","MVA","Non-coincident"]
[null,null,null,null,"Coincident"]
[null,null,"WEATHER CORRECTED MD 50% POE","MW","Non-coincident"]
[null,null,null,null,"Coincident"]
[null,null,"WEATHER CORRECTED MD 50% POE","MVA","Non-coincident"]
[null,null,null,null,"Coincident"]
[null,"NSP to enter name","CONNECTION POINT RATING","MVA","Non-coincident"]
[null,null,null,null,"Coincident"]
[null,null,"WINTER/SUMMER PEAKING",null,"Non-coincident"]
[null,null,null,null,"Coincident"]
[null,null,"ADJUSTMENTS - EMBEDDED GENERATION","MW","Non-coincident"]
[null,null,null,null,"Coincident"]
[null,null,"WEATHER CORRECTED MD 10% POE","MW","Non-coincident"]
[null,null,null,null,"Coincident"]
[null,null,"WEATHER CORRECTED MD 10% POE","MVA","Non-coincident"]
[null,null,null,null,"Coincident"]
[null,null,"WEATHER CORRECTED MD 50% POE","MW","Non-coincident"]
[null,null,null,null,"Coincident"]
[null,null,"WEATHER CORRECTED MD 50% POE","MVA","Non-coincident"]
[null,null,null,null,"Coincident"]
[null,"NSP to enter name","CONNECTION POINT RATING","MVA","Non-coincident"]
[null,null,null,null,"Coincident"]
[null,null,"WINTER/SUMMER PEAKING",null,"Non-coincident"]
[null,null,null,null,"Coincident"]
[null,null,"ADJUSTMENTS - EMBEDDED GENERATION","MW","Non-coincident"]
[null,null,null,null,"Coincident"]
[null,null,"WEATHER CORRECTED MD 10% POE","MW","Non-coincident"]
[null,null,null,null,"Coincident"]
[null,null,"WEATHER CORRECTED MD 10% POE","MVA","Non-coincident"]
[null,null,null,null,"Coincident"]
[null,null,"WEATHER CORRECTED MD 50% POE","MW","Non-coincident"]
[null,null,null,null,"Coincident"]
[null,null,"WEATHER CORRECTED MD 50% POE","MVA","Non-coincident"]
[null,null,null,null,"Coincident"]
[null,"NSP to enter name","CONNECTION POINT RATING","MVA","Non-coincident"]
[null,null,null,null,"Coincident"]
[null,null,"WINTER/SUMMER PEAKING",null,"Non-coincident"]
[null,null,null,null,"Coincident"]
[null,null,"ADJUSTMENTS - EMBEDDED GENERATION","MW","Non-coincident"]
[null,null,null,null,"Coincident"]
[null,null,"WEATHER CORRECTED MD 10% POE","MW","Non-coincident"]
[null,null,null,null,"Coincident"]
[null,null,"WEATHER CORRECTED MD 10% POE","MVA","Non-coincident"]
[null,null,null,null,"Coincident"]
[null,null,"WEATHER CORRECTED MD 50% POE","MW","Non-coincident"]
[null,null,null,null,"Coincident"]
[null,null,"WEATHER CORRECTED MD 50% POE","MVA","Non-coincident"]
[null,null,null,null,"Coincident"]
[null,"NSP to enter name","CONNECTION POINT RATING","MVA","Non-coincident"]
[null,null,null,null,"Coincident"]
[null,null,"WINTER/SUMMER PEAKING",null,"Non-coincident"]
[null,null,null,null,"Coincident"]
[null,null,"ADJUSTMENTS - EMBEDDED GENERATION","MW","Non-coincident"]
[null,null,null,null,"Coincident"]
[null,null,"WEATHER CORRECTED MD 10% POE","MW","Non-coincident"]
[null,null,null,null,"Coincident"]
[null,null,"WEATHER CORRECTED MD 10% POE","MVA","Non-coincident"]
[null,null,null,null,"Coincident"]
[null,null,"WEATHER CORRECTED MD 50% POE","MW","Non-coincident"]
[null,null,null,null,"Coincident"]
[null,null,"WEATHER CORRECTED MD 50% POE","MVA","Non-coincident"]
[null,null,null,null,"Coincident"]
[null,"NSP to enter name","CONNECTION POINT RATING","MVA","Non-coincident"]
[null,null,null,null,"Coincident"]
[null,null,"WINTER/SUMMER PEAKING",null,"Non-coincident"]
[null,null,null,null,"Coincident"]
[null,null,"ADJUSTMENTS - EMBEDDED GENERATION","MW","Non-coincident"]
[null,null,null,null,"Coincident"]
[null,null,"WEATHER CORRECTED MD 10% POE","MW","Non-coincident"]
[null,null,null,null,"Coincident"]
[null,null,"WEATHER CORRECTED MD 10% POE","MVA","Non-coincident"]
[null,null,null,null,"Coincident"]
[null,null,"WEATHER CORRECTED MD 50% POE","MW","Non-coincident"]
[null,null,null,null,"Coincident"]
[null,null,"WEATHER CORRECTED MD 50% POE","MVA","Non-coincident"]
[null,null,null,null,"Coincident"]
[null,"NSP to enter name","CONNECTION POINT RATING","MVA","Non-coincident"]
[null,null,null,null,"Coincident"]
[null,null,"WINTER/SUMMER PEAKING",null,"Non-coincident"]
[null,null,null,null,"Coincident"]
[null,null,"ADJUSTMENTS - EMBEDDED GENERATION","MW","Non-coincident"]
[null,null,null,null,"Coincident"]
[null,null,"WEATHER CORRECTED MD 10% POE","MW","Non-coincident"]
[null,null,null,null,"Coincident"]
[null,null,"WEATHER CORRECTED MD 10% POE","MVA","Non-coincident"]
[null,null,null,null,"Coincident"]
[null,null,"WEATHER CORRECTED MD 50% POE","MW","Non-coincident"]
[null,null,null,null,"Coincident"]
[null,null,"WEATHER CORRECTED MD 50% POE","MVA","Non-coincident"]
[null,null,null,null,"Coincident"]
[null,"NSP to enter name","CONNECTION POINT RATING","MVA","Non-coincident"]
[null,null,null,null,"Coincident"]
[null,null,"WINTER/SUMMER PEAKING",null,"Non-coincident"]
[null,null,null,null,"Coincident"]
[null,null,"ADJUSTMENTS - EMBEDDED GENERATION","MW","Non-coincident"]
[null,null,null,null,"Coincident"]
[null,null,"WEATHER CORRECTED MD 10% POE","MW","Non-coincident"]
[null,null,null,null,"Coincident"]
[null,null,"WEATHER CORRECTED MD 10% POE","MVA","Non-coincident"]
[null,null,null,null,"Coincident"]
[null,null,"WEATHER CORRECTED MD 50% POE","MW","Non-coincident"]
[null,null,null,null,"Coincident"]
[null,null,"WEATHER CORRECTED MD 50% POE","MVA","Non-coincident"]
[null,null,null,null,"Coincident"]
[null,"NSP to enter name","CONNECTION POINT RATING","MVA","Non-coincident"]
[null,null,null,null,"Coincident"]
[null,null,"WINTER/SUMMER PEAKING",null,"Non-coincident"]
[null,null,null,null,"Coincident"]
[null,null,"ADJUSTMENTS - EMBEDDED GENERATION","MW","Non-coincident"]
[null,null,null,null,"Coincident"]
[null,null,"WEATHER CORRECTED MD 10% POE","MW","Non-coincident"]
[null,null,null,null,"Coincident"]
[null,null,"WEATHER CORRECTED MD 10% POE","MVA","Non-coincident"]
[null,null,null,null,"Coincident"]
[null,null,"WEATHER CORRECTED MD 50% POE","MW","Non-coincident"]
[null,null,null,null,"Coincident"]
[null,null,"WEATHER CORRECTED MD 50% POE","MVA","Non-coincident"]
[null,null,null,null,"Coincident"]
[null,"NSP to enter name","CONNECTION POINT RATING","MVA","Non-coincident"]
[null,null,null,null,"Coincident"]
[null,null,"WINTER/SUMMER PEAKING",null,"Non-coincident"]
[null,null,null,null,"Coincident"]
[null,null,"ADJUSTMENTS - EMBEDDED GENERATION","MW","Non-coincident"]
[null,null,null,null,"Coincident"]
[null,null,"WEATHER CORRECTED MD 10% POE","MW","Non-coincident"]
[null,null,null,null,"Coincident"]
[null,null,"WEATHER CORRECTED MD 10% POE","MVA","Non-coincident"]
[null,null,null,null,"Coincident"]
[null,null,"WEATHER CORRECTED MD 50% POE","MW","Non-coincident"]
[null,null,null,null,"Coincident"]
[null,null,"WEATHER CORRECTED MD 50% POE","MVA","Non-coincident"]
[null,null,null,null,"Coincident"]
[null,"NSP to enter name","CONNECTION POINT RATING","MVA","Non-coincident"]
[null,null,null,null,"Coincident"]
[null,null,"WINTER/SUMMER PEAKING",null,"Non-coincident"]
[null,null,null,null,"Coincident"]
[null,null,"ADJUSTMENTS - EMBEDDED GENERATION","MW","Non-coincident"]
[null,null,null,null,"Coincident"]
[null,null,"WEATHER CORRECTED MD 10% POE","MW","Non-coincident"]
[null,null,null,null,"Coincident"]
[null,null,"WEATHER CORRECTED MD 10% POE","MVA","Non-coincident"]
[null,null,null,null,"Coincident"]
[null,null,"WEATHER CORRECTED MD 50% POE","MW","Non-coincident"]
[null,null,null,null,"Coincident"]
[null,null,"WEATHER CORRECTED MD 50% POE","MVA","Non-coincident"]
[null,null,null,null,"Coincident"]
[null,"NSP to enter name","CONNECTION POINT RATING","MVA","Non-coincident"]
[null,null,null,null,"Coincident"]
[null,null,"WINTER/SUMMER PEAKING",null,"Non-coincident"]
[null,null,null,null,"Coincident"]
[null,null,"ADJUSTMENTS - EMBEDDED GENERATION","MW","Non-coincident"]
[null,null,null,null,"Coincident"]
[null,null,"WEATHER CORRECTED MD 10% POE","MW","Non-coincident"]
[null,null,null,null,"Coincident"]
[null,null,"WEATHER CORRECTED MD 10% POE","MVA","Non-coincident"]
[null,null,null,null,"Coincident"]
[null,null,"WEATHER CORRECTED MD 50% POE","MW","Non-coincident"]
[null,null,null,null,"Coincident"]
[null,null,"WEATHER CORRECTED MD 50% POE","MVA","Non-coincident"]
[null,null,null,null,"Coincident"]
[null,"NSP to enter name","CONNECTION POINT RATING","MVA","Non-coincident"]
[null,null,null,null,"Coincident"]
[null,null,"WINTER/SUMMER PEAKING",null,"Non-coincident"]
[null,null,null,null,"Coincident"]
[null,null,"ADJUSTMENTS - EMBEDDED GENERATION","MW","Non-coincident"]
[null,null,null,null,"Coincident"]
[null,null,"WEATHER CORRECTED MD 10% POE","MW","Non-coincident"]
[null,null,null,null,"Coincident"]
[null,null,"WEATHER CORRECTED MD 10% POE","MVA","Non-coincident"]
[null,null,null,null,"Coincident"]
[null,null,"WEATHER CORRECTED MD 50% POE","MW","Non-coincident"]
[null,null,null,null,"Coincident"]
[null,null,"WEATHER CORRECTED MD 50% POE","MVA","Non-coincident"]
[null,null,null,null,"Coincident"]
[null,"NSP to enter name","CONNECTION POINT RATING","MVA","Non-coincident"]
[null,null,null,null,"Coincident"]
[null,null,"WINTER/SUMMER PEAKING",null,"Non-coincident"]
[null,null,null,null,"Coincident"]
[null,null,"ADJUSTMENTS - EMBEDDED GENERATION","MW","Non-coincident"]
[null,null,null,null,"Coincident"]
[null,null,"WEATHER CORRECTED MD 10% POE","MW","Non-coincident"]
[null,null,null,null,"Coincident"]
[null,null,"WEATHER CORRECTED MD 10% POE","MVA","Non-coincident"]
[null,null,null,null,"Coincident"]
[null,null,"WEATHER CORRECTED MD 50% POE","MW","Non-coincident"]
[null,null,null,null,"Coincident"]
[null,null,"WEATHER CORRECTED MD 50% POE","MVA","Non-coincident"]
[null,null,null,null,"Coincident"]
[null,"NSP to enter name","CONNECTION POINT RATING","MVA","Non-coincident"]
[null,null,null,null,"Coincident"]
[null,null,"WINTER/SUMMER PEAKING",null,"Non-coincident"]
[null,null,null,null,"Coincident"]
[null,null,"ADJUSTMENTS - EMBEDDED GENERATION","MW","Non-coincident"]
[null,null,null,null,"Coincident"]
[null,null,"WEATHER CORRECTED MD 10% POE","MW","Non-coincident"]
[null,null,null,null,"Coincident"]
[null,null,"WEATHER CORRECTED MD 10% POE","MVA","Non-coincident"]
[null,null,null,null,"Coincident"]
[null,null,"WEATHER CORRECTED MD 50% POE","MW","Non-coincident"]
[null,null,null,null,"Coincident"]
[null,null,"WEATHER CORRECTED MD 50% POE","MVA","Non-coincident"]
[null,null,null,null,"Coincident"]
[null,"NSP to enter name","CONNECTION POINT RATING","MVA","Non-coincident"]
[null,null,null,null,"Coincident"]
[null,null,"WINTER/SUMMER PEAKING",null,"Non-coincident"]
[null,null,null,null,"Coincident"]
[null,null,"ADJUSTMENTS - EMBEDDED GENERATION","MW","Non-coincident"]
[null,null,null,null,"Coincident"]
[null,null,"WEATHER CORRECTED MD 10% POE","MW","Non-coincident"]
[null,null,null,null,"Coincident"]
[null,null,"WEATHER CORRECTED MD 10% POE","MVA","Non-coincident"]
[null,null,null,null,"Coincident"]
[null,null,"WEATHER CORRECTED MD 50% POE","MW","Non-coincident"]
[null,null,null,null,"Coincident"]
[null,null,"WEATHER CORRECTED MD 50% POE","MVA","Non-coincident"]
[null,null,null,null,"Coincident"]
[null,"NSP to enter name","CONNECTION POINT RATING","MVA","Non-coincident"]
[null,null,null,null,"Coincident"]
[null,null,"WINTER/SUMMER PEAKING",null,"Non-coincident"]
[null,null,null,null,"Coincident"]
[null,null,"ADJUSTMENTS - EMBEDDED GENERATION","MW","Non-coincident"]
[null,null,null,null,"Coincident"]
[null,null,"WEATHER CORRECTED MD 10% POE","MW","Non-coincident"]
[null,null,null,null,"Coincident"]
[null,null,"WEATHER CORRECTED MD 10% POE","MVA","Non-coincident"]
[null,null,null,null,"Coincident"]
[null,null,"WEATHER CORRECTED MD 50% POE","MW","Non-coincident"]
[null,null,null,null,"Coincident"]
[null,null,"WEATHER CORRECTED MD 50% POE","MVA","Non-coincident"]
[null,null,null,null,"Coincident"]
[null,"NSP to enter name","CONNECTION POINT RATING","MVA","Non-coincident"]
[null,null,null,null,"Coincident"]
[null,null,"WINTER/SUMMER PEAKING",null,"Non-coincident"]
[null,null,null,null,"Coincident"]
[null,null,"ADJUSTMENTS - EMBEDDED GENERATION","MW","Non-coincident"]
[null,null,null,null,"Coincident"]
[null,null,"WEATHER CORRECTED MD 10% POE","MW","Non-coincident"]
[null,null,null,null,"Coincident"]
[null,null,"WEATHER CORRECTED MD 10% POE","MVA","Non-coincident"]
[null,null,null,null,"Coincident"]
[null,null,"WEATHER CORRECTED MD 50% POE","MW","Non-coincident"]
[null,null,null,null,"Coincident"]
[null,null,"WEATHER CORRECTED MD 50% POE","MVA","Non-coincident"]
[null,null,null,null,"Coincident"]
[null,"NSP to enter name","CONNECTION POINT RATING","MVA","Non-coincident"]
[null,null,null,null,"Coincident"]
[null,null,"WINTER/SUMMER PEAKING",null,"Non-coincident"]
[null,null,null,null,"Coincident"]
[null,null,"ADJUSTMENTS - EMBEDDED GENERATION","MW","Non-coincident"]
[null,null,null,null,"Coincident"]
[null,null,"WEATHER CORRECTED MD 10% POE","MW","Non-coincident"]
[null,null,null,null,"Coincident"]
[null,null,"WEATHER CORRECTED MD 10% POE","MVA","Non-coincident"]
[null,null,null,null,"Coincident"]
[null,null,"WEATHER CORRECTED MD 50% POE","MW","Non-coincident"]
[null,null,null,null,"Coincident"]
[null,null,"WEATHER CORRECTED MD 50% POE","MVA","Non-coincident"]
[null,null,null,null,"Coincident"]
[null,"NSP to enter name","CONNECTION POINT RATING","MVA","Non-coincident"]
[null,null,null,null,"Coincident"]
[null,null,"WINTER/SUMMER PEAKING",null,"Non-coincident"]
[null,null,null,null,"Coincident"]
[null,null,"ADJUSTMENTS - EMBEDDED GENERATION","MW","Non-coincident"]
[null,null,null,null,"Coincident"]
[null,null,"WEATHER CORRECTED MD 10% POE","MW","Non-coincident"]
[null,null,null,null,"Coincident"]
[null,null,"WEATHER CORRECTED MD 10% POE","MVA","Non-coincident"]
[null,null,null,null,"Coincident"]
[null,null,"WEATHER CORRECTED MD 50% POE","MW","Non-coincident"]
[null,null,null,null,"Coincident"]
[null,null,"WEATHER CORRECTED MD 50% POE","MVA","Non-coincident"]
[null,null,null,null,"Coincident"]
[null,"NSP to enter name","CONNECTION POINT RATING","MVA","Non-coincident"]
[null,null,null,null,"Coincident"]
[null,null,"WINTER/SUMMER PEAKING",null,"Non-coincident"]
[null,null,null,null,"Coincident"]
[null,null,"ADJUSTMENTS - EMBEDDED GENERATION","MW","Non-coincident"]
[null,null,null,null,"Coincident"]
[null,null,"WEATHER CORRECTED MD 10% POE","MW","Non-coincident"]
[null,null,null,null,"Coincident"]
[null,null,"WEATHER CORRECTED MD 10% POE","MVA","Non-coincident"]
[null,null,null,null,"Coincident"]
[null,null,"WEATHER CORRECTED MD 50% POE","MW","Non-coincident"]
[null,null,null,null,"Coincident"]
[null,null,"WEATHER CORRECTED MD 50% POE","MVA","Non-coincident"]
[null,null,null,null,"Coincident"]
[null,"NSP to enter name","CONNECTION POINT RATING","MVA","Non-coincident"]
[null,null,null,null,"Coincident"]
[null,null,"WINTER/SUMMER PEAKING",null,"Non-coincident"]
[null,null,null,null,"Coincident"]
[null,null,"ADJUSTMENTS - EMBEDDED GENERATION","MW","Non-coincident"]
[null,null,null,null,"Coincident"]
[null,null,"WEATHER CORRECTED MD 10% POE","MW","Non-coincident"]
[null,null,null,null,"Coincident"]
[null,null,"WEATHER CORRECTED MD 10% POE","MVA","Non-coincident"]
[null,null,null,null,"Coincident"]
[null,null,"WEATHER CORRECTED MD 50% POE","MW","Non-coincident"]
[null,null,null,null,"Coincident"]
[null,null,"WEATHER CORRECTED MD 50% POE","MVA","Non-coincident"]
[null,null,null,null,"Coincident"]
[null,"NSP to enter name","CONNECTION POINT RATING","MVA","Non-coincident"]
[null,null,null,null,"Coincident"]
[null,null,"WINTER/SUMMER PEAKING",null,"Non-coincident"]
[null,null,null,null,"Coincident"]
[null,null,"ADJUSTMENTS - EMBEDDED GENERATION","MW","Non-coincident"]
[null,null,null,null,"Coincident"]
[null,null,"WEATHER CORRECTED MD 10% POE","MW","Non-coincident"]
[null,null,null,null,"Coincident"]
[null,null,"WEATHER CORRECTED MD 10% POE","MVA","Non-coincident"]
[null,null,null,null,"Coincident"]
[null,null,"WEATHER CORRECTED MD 50% POE","MW","Non-coincident"]
[null,null,null,null,"Coincident"]
[null,null,"WEATHER CORRECTED MD 50% POE","MVA","Non-coincident"]
[null,null,null,null,"Coincident"]
[null,"NSP to enter name","CONNECTION POINT RATING","MVA","Non-coincident"]
[null,null,null,null,"Coincident"]
[null,null,"WINTER/SUMMER PEAKING",null,"Non-coincident"]
[null,null,null,null,"Coincident"]
[null,null,"ADJUSTMENTS - EMBEDDED GENERATION","MW","Non-coincident"]
[null,null,null,null,"Coincident"]
[null,null,"WEATHER CORRECTED MD 10% POE","MW","Non-coincident"]
[null,null,null,null,"Coincident"]
[null,null,"WEATHER CORRECTED MD 10% POE","MVA","Non-coincident"]
[null,null,null,null,"Coincident"]
[null,null,"WEATHER CORRECTED MD 50% POE","MW","Non-coincident"]
[null,null,null,null,"Coincident"]
[null,null,"WEATHER CORRECTED MD 50% POE","MVA","Non-coincident"]
[null,null,null,null,"Coincident"]
[null,"NSP to enter name","CONNECTION POINT RATING","MVA","Non-coincident"]
[null,null,null,null,"Coincident"]
[null,null,"WINTER/SUMMER PEAKING",null,"Non-coincident"]
[null,null,null,null,"Coincident"]
[null,null,"ADJUSTMENTS - EMBEDDED GENERATION","MW","Non-coincident"]
[null,null,null,null,"Coincident"]
[null,null,"WEATHER CORRECTED MD 10% POE","MW","Non-coincident"]
[null,null,null,null,"Coincident"]
[null,null,"WEATHER CORRECTED MD 10% POE","MVA","Non-coincident"]
[null,null,null,null,"Coincident"]
[null,null,"WEATHER CORRECTED MD 50% POE","MW","Non-coincident"]
[null,null,null,null,"Coincident"]
[null,null,"WEATHER CORRECTED MD 50% POE","MVA","Non-coincident"]
[null,null,null,null,"Coincident"]
[null,"NSP to enter name","CONNECTION POINT RATING","MVA","Non-coincident"]
[null,null,null,null,"Coincident"]
[null,null,"WINTER/SUMMER PEAKING",null,"Non-coincident"]
[null,null,null,null,"Coincident"]
[null,null,"ADJUSTMENTS - EMBEDDED GENERATION","MW","Non-coincident"]
[null,null,null,null,"Coincident"]
[null,null,"WEATHER CORRECTED MD 10% POE","MW","Non-coincident"]
[null,null,null,null,"Coincident"]
[null,null,"WEATHER CORRECTED MD 10% POE","MVA","Non-coincident"]
[null,null,null,null,"Coincident"]
[null,null,"WEATHER CORRECTED MD 50% POE","MW","Non-coincident"]
[null,null,null,null,"Coincident"]
[null,null,"WEATHER CORRECTED MD 50% POE","MVA","Non-coincident"]
[null,null,null,null,"Coincident"]
[null,"NSP to enter name","CONNECTION POINT RATING","MVA","Non-coincident"]
[null,null,null,null,"Coincident"]
[null,null,"WINTER/SUMMER PEAKING",null,"Non-coincident"]
[null,null,null,null,"Coincident"]
[null,null,"ADJUSTMENTS - EMBEDDED GENERATION","MW","Non-coincident"]
[null,null,null,null,"Coincident"]
[null,null,"WEATHER CORRECTED MD 10% POE","MW","Non-coincident"]
[null,null,null,null,"Coincident"]
[null,null,"WEATHER CORRECTED MD 10% POE","MVA","Non-coincident"]
[null,null,null,null,"Coincident"]
[null,null,"WEATHER CORRECTED MD 50% POE","MW","Non-coincident"]
[null,null,null,null,"Coincident"]
[null,null,"WEATHER CORRECTED MD 50% POE","MVA","Non-coincident"]
[null,null,null,null,"Coincident"]
[null,"NSP to enter name","CONNECTION POINT RATING","MVA","Non-coincident"]
[null,null,null,null,"Coincident"]
[null,null,"WINTER/SUMMER PEAKING",null,"Non-coincident"]
[null,null,null,null,"Coincident"]
[null,null,"ADJUSTMENTS - EMBEDDED GENERATION","MW","Non-coincident"]
[null,null,null,null,"Coincident"]
[null,null,"WEATHER CORRECTED MD 10% POE","MW","Non-coincident"]
[null,null,null,null,"Coincident"]
[null,null,"WEATHER CORRECTED MD 10% POE","MVA","Non-coincident"]
[null,null,null,null,"Coincident"]
[null,null,"WEATHER CORRECTED MD 50% POE","MW","Non-coincident"]
[null,null,null,null,"Coincident"]
[null,null,"WEATHER CORRECTED MD 50% POE","MVA","Non-coincident"]
[null,null,null,null,"Coincident"]
[null,"NSP to enter name","CONNECTION POINT RATING","MVA","Non-coincident"]
[null,null,null,null,"Coincident"]
[null,null,"WINTER/SUMMER PEAKING",null,"Non-coincident"]
[null,null,null,null,"Coincident"]
[null,null,"ADJUSTMENTS - EMBEDDED GENERATION","MW","Non-coincident"]
[null,null,null,null,"Coincident"]
[null,null,"WEATHER CORRECTED MD 10% POE","MW","Non-coincident"]
[null,null,null,null,"Coincident"]
[null,null,"WEATHER CORRECTED MD 10% POE","MVA","Non-coincident"]
[null,null,null,null,"Coincident"]
[null,null,"WEATHER CORRECTED MD 50% POE","MW","Non-coincident"]
[null,null,null,null,"Coincident"]
[null,null,"WEATHER CORRECTED MD 50% POE","MVA","Non-coincident"]
[null,null,null,null,"Coincident"]
[null,"NSP to enter name","CONNECTION POINT RATING","MVA","Non-coincident"]
[null,null,null,null,"Coincident"]
[null,null,"WINTER/SUMMER PEAKING",null,"Non-coincident"]
[null,null,null,null,"Coincident"]
[null,null,"ADJUSTMENTS - EMBEDDED GENERATION","MW","Non-coincident"]
[null,null,null,null,"Coincident"]
[null,null,"WEATHER CORRECTED MD 10% POE","MW","Non-coincident"]
[null,null,null,null,"Coincident"]
[null,null,"WEATHER CORRECTED MD 10% POE","MVA","Non-coincident"]
[null,null,null,null,"Coincident"]
[null,null,"WEATHER CORRECTED MD 50% POE","MW","Non-coincident"]
[null,null,null,null,"Coincident"]
[null,null,"WEATHER CORRECTED MD 50% POE","MVA","Non-coincident"]
[null,null,null,null,"Coincident"]
[null,"NSP to enter name","CONNECTION POINT RATING","MVA","Non-coincident"]
[null,null,null,null,"Coincident"]
[null,null,"WINTER/SUMMER PEAKING",null,"Non-coincident"]
[null,null,null,null,"Coincident"]
[null,null,"ADJUSTMENTS - EMBEDDED GENERATION","MW","Non-coincident"]
[null,null,null,null,"Coincident"]
[null,null,"WEATHER CORRECTED MD 10% POE","MW","Non-coincident"]
[null,null,null,null,"Coincident"]
[null,null,"WEATHER CORRECTED MD 10% POE","MVA","Non-coincident"]
[null,null,null,null,"Coincident"]
[null,null,"WEATHER CORRECTED MD 50% POE","MW","Non-coincident"]
[null,null,null,null,"Coincident"]
[null,null,"WEATHER CORRECTED MD 50% POE","MVA","Non-coincident"]
[null,null,null,null,"Coincident"]
[null,"NSP to enter name","CONNECTION POINT RATING","MVA","Non-coincident"]
[null,null,null,null,"Coincident"]
[null,null,"WINTER/SUMMER PEAKING",null,"Non-coincident"]
[null,null,null,null,"Coincident"]
[null,null,"ADJUSTMENTS - EMBEDDED GENERATION","MW","Non-coincident"]
[null,null,null,null,"Coincident"]
[null,null,"WEATHER CORRECTED MD 10% POE","MW","Non-coincident"]
[null,null,null,null,"Coincident"]
[null,null,"WEATHER CORRECTED MD 10% POE","MVA","Non-coincident"]
[null,null,null,null,"Coincident"]
[null,null,"WEATHER CORRECTED MD 50% POE","MW","Non-coincident"]
[null,null,null,null,"Coincident"]
[null,null,"WEATHER CORRECTED MD 50% POE","MVA","Non-coincident"]
[null,null,null,null,"Coincident"]
[null,"NSP to enter name","CONNECTION POINT RATING","MVA","Non-coincident"]
[null,null,null,null,"Coincident"]
[null,null,"WINTER/SUMMER PEAKING",null,"Non-coincident"]
[null,null,null,null,"Coincident"]
[null,null,"ADJUSTMENTS - EMBEDDED GENERATION","MW","Non-coincident"]
[null,null,null,null,"Coincident"]
[null,null,"WEATHER CORRECTED MD 10% POE","MW","Non-coincident"]
[null,null,null,null,"Coincident"]
[null,null,"WEATHER CORRECTED MD 10% POE","MVA","Non-coincident"]
[null,null,null,null,"Coincident"]
[null,null,"WEATHER CORRECTED MD 50% POE","MW","Non-coincident"]
[null,null,null,null,"Coincident"]
[null,null,"WEATHER CORRECTED MD 50% POE","MVA","Non-coincident"]
[null,null,null,null,"Coincident"]
[null,"NSP to enter name","CONNECTION POINT RATING","MVA","Non-coincident"]
[null,null,null,null,"Coincident"]
[null,null,"WINTER/SUMMER PEAKING",null,"Non-coincident"]
[null,null,null,null,"Coincident"]
[null,null,"ADJUSTMENTS - EMBEDDED GENERATION","MW","Non-coincident"]
[null,null,null,null,"Coincident"]
[null,null,"WEATHER CORRECTED MD 10% POE","MW","Non-coincident"]
[null,null,null,null,"Coincident"]
[null,null,"WEATHER CORRECTED MD 10% POE","MVA","Non-coincident"]
[null,null,null,null,"Coincident"]
[null,null,"WEATHER CORRECTED MD 50% POE","MW","Non-coincident"]
[null,null,null,null,"Coincident"]
[null,null,"WEATHER CORRECTED MD 50% POE","MVA","Non-coincident"]
[null,null,null,null,"Coincident"]
[null,"NSP to enter name","CONNECTION POINT RATING","MVA","Non-coincident"]
[null,null,null,null,"Coincident"]
[null,null,"WINTER/SUMMER PEAKING",null,"Non-coincident"]
[null,null,null,null,"Coincident"]
[null,null,"ADJUSTMENTS - EMBEDDED GENERATION","MW","Non-coincident"]
[null,null,null,null,"Coincident"]
[null,null,"WEATHER CORRECTED MD 10% POE","MW","Non-coincident"]
[null,null,null,null,"Coincident"]
[null,null,"WEATHER CORRECTED MD 10% POE","MVA","Non-coincident"]
[null,null,null,null,"Coincident"]
[null,null,"WEATHER CORRECTED MD 50% POE","MW","Non-coincident"]
[null,null,null,null,"Coincident"]
[null,null,"WEATHER CORRECTED MD 50% POE","MVA","Non-coincident"]
[null,null,null,null,"Coincident"]
[null,"NSP to enter name","CONNECTION POINT RATING","MVA","Non-coincident"]
[null,null,null,null,"Coincident"]
[null,null,"WINTER/SUMMER PEAKING",null,"Non-coincident"]
[null,null,null,null,"Coincident"]
[null,null,"ADJUSTMENTS - EMBEDDED GENERATION","MW","Non-coincident"]
[null,null,null,null,"Coincident"]
[null,null,"WEATHER CORRECTED MD 10% POE","MW","Non-coincident"]
[null,null,null,null,"Coincident"]
[null,null,"WEATHER CORRECTED MD 10% POE","MVA","Non-coincident"]
[null,null,null,null,"Coincident"]
[null,null,"WEATHER CORRECTED MD 50% POE","MW","Non-coincident"]
[null,null,null,null,"Coincident"]
[null,null,"WEATHER CORRECTED MD 50% POE","MVA","Non-coincident"]
[null,null,null,null,"Coincident"]
[null,"NSP to enter name","CONNECTION POINT RATING","MVA","Non-coincident"]
[null,null,null,null,"Coincident"]
[null,null,"WINTER/SUMMER PEAKING",null,"Non-coincident"]
[null,null,null,null,"Coincident"]
[null,null,"ADJUSTMENTS - EMBEDDED GENERATION","MW","Non-coincident"]
[null,null,null,null,"Coincident"]
[null,null,"WEATHER CORRECTED MD 10% POE","MW","Non-coincident"]
[null,null,null,null,"Coincident"]
[null,null,"WEATHER CORRECTED MD 10% POE","MVA","Non-coincident"]
[null,null,null,null,"Coincident"]
[null,null,"WEATHER CORRECTED MD 50% POE","MW","Non-coincident"]
[null,null,null,null,"Coincident"]
[null,null,"WEATHER CORRECTED MD 50% POE","MVA","Non-coincident"]
[null,null,null,null,"Coincident"]
[null,"NSP to enter name","CONNECTION POINT RATING","MVA","Non-coincident"]
[null,null,null,null,"Coincident"]
[null,null,"WINTER/SUMMER PEAKING",null,"Non-coincident"]
[null,null,null,null,"Coincident"]
[null,null,"ADJUSTMENTS - EMBEDDED GENERATION","MW","Non-coincident"]
[null,null,null,null,"Coincident"]
[null,null,"WEATHER CORRECTED MD 10% POE","MW","Non-coincident"]
[null,null,null,null,"Coincident"]
[null,null,"WEATHER CORRECTED MD 10% POE","MVA","Non-coincident"]
[null,null,null,null,"Coincident"]
[null,null,"WEATHER CORRECTED MD 50% POE","MW","Non-coincident"]
[null,null,null,null,"Coincident"]
[null,null,"WEATHER CORRECTED MD 50% POE","MVA","Non-coincident"]
[null,null,null,null,"Coincident"]
[null,"NSP to enter name","CONNECTION POINT RATING","MVA","Non-coincident"]
[null,null,null,null,"Coincident"]
[null,null,"WINTER/SUMMER PEAKING",null,"Non-coincident"]
[null,null,null,null,"Coincident"]
[null,null,"ADJUSTMENTS - EMBEDDED GENERATION","MW","Non-coincident"]
[null,null,null,null,"Coincident"]
[null,null,"WEATHER CORRECTED MD 10% POE","MW","Non-coincident"]
[null,null,null,null,"Coincident"]
[null,null,"WEATHER CORRECTED MD 10% POE","MVA","Non-coincident"]
[null,null,null,null,"Coincident"]
[null,null,"WEATHER CORRECTED MD 50% POE","MW","Non-coincident"]
[null,null,null,null,"Coincident"]
[null,null,"WEATHER CORRECTED MD 50% POE","MVA","Non-coincident"]
[null,null,null,null,"Coincident"]
[null,"NSP to enter name","CONNECTION POINT RATING","MVA","Non-coincident"]
[null,null,null,null,"Coincident"]
[null,null,"WINTER/SUMMER PEAKING",null,"Non-coincident"]
[null,null,null,null,"Coincident"]
[null,null,"ADJUSTMENTS - EMBEDDED GENERATION","MW","Non-coincident"]
[null,null,null,null,"Coincident"]
[null,null,"WEATHER CORRECTED MD 10% POE","MW","Non-coincident"]
[null,null,null,null,"Coincident"]
[null,null,"WEATHER CORRECTED MD 10% POE","MVA","Non-coincident"]
[null,null,null,null,"Coincident"]
[null,null,"WEATHER CORRECTED MD 50% POE","MW","Non-coincident"]
[null,null,null,null,"Coincident"]
[null,null,"WEATHER CORRECTED MD 50% POE","MVA","Non-coincident"]
[null,null,null,null,"Coincident"]
[null,"NSP to enter name","CONNECTION POINT RATING","MVA","Non-coincident"]
[null,null,null,null,"Coincident"]
[null,null,"WINTER/SUMMER PEAKING",null,"Non-coincident"]
[null,null,null,null,"Coincident"]
[null,null,"ADJUSTMENTS - EMBEDDED GENERATION","MW","Non-coincident"]
[null,null,null,null,"Coincident"]
[null,null,"WEATHER CORRECTED MD 10% POE","MW","Non-coincident"]
[null,null,null,null,"Coincident"]
[null,null,"WEATHER CORRECTED MD 10% POE","MVA","Non-coincident"]
[null,null,null,null,"Coincident"]
[null,null,"WEATHER CORRECTED MD 50% POE","MW","Non-coincident"]
[null,null,null,null,"Coincident"]
[null,null,"WEATHER CORRECTED MD 50% POE","MVA","Non-coincident"]
[null,null,null,null,"Coincident"]
[null,"NSP to enter name","CONNECTION POINT RATING","MVA","Non-coincident"]
[null,null,null,null,"Coincident"]
[null,null,"WINTER/SUMMER PEAKING",null,"Non-coincident"]
[null,null,null,null,"Coincident"]
[null,null,"ADJUSTMENTS - EMBEDDED GENERATION","MW","Non-coincident"]
[null,null,null,null,"Coincident"]
[null,null,"WEATHER CORRECTED MD 10% POE","MW","Non-coincident"]
[null,null,null,null,"Coincident"]
[null,null,"WEATHER CORRECTED MD 10% POE","MVA","Non-coincident"]
[null,null,null,null,"Coincident"]
[null,null,"WEATHER CORRECTED MD 50% POE","MW","Non-coincident"]
[null,null,null,null,"Coincident"]
[null,null,"WEATHER CORRECTED MD 50% POE","MVA","Non-coincident"]
[null,null,null,null,"Coincident"]
[null,"NSP to enter name","CONNECTION POINT RATING","MVA","Non-coincident"]
[null,null,null,null,"Coincident"]
[null,null,"WINTER/SUMMER PEAKING",null,"Non-coincident"]
[null,null,null,null,"Coincident"]
[null,null,"ADJUSTMENTS - EMBEDDED GENERATION","MW","Non-coincident"]
[null,null,null,null,"Coincident"]
[null,null,"WEATHER CORRECTED MD 10% POE","MW","Non-coincident"]
[null,null,null,null,"Coincident"]
[null,null,"WEATHER CORRECTED MD 10% POE","MVA","Non-coincident"]
[null,null,null,null,"Coincident"]
[null,null,"WEATHER CORRECTED MD 50% POE","MW","Non-coincident"]
[null,null,null,null,"Coincident"]
[null,null,"WEATHER CORRECTED MD 50% POE","MVA","Non-coincident"]
[null,null,null,null,"Coincident"]
[null,"NSP to enter name","CONNECTION POINT RATING","MVA","Non-coincident"]
[null,null,null,null,"Coincident"]
[null,null,"WINTER/SUMMER PEAKING",null,"Non-coincident"]
[null,null,null,null,"Coincident"]
[null,null,"ADJUSTMENTS - EMBEDDED GENERATION","MW","Non-coincident"]
[null,null,null,null,"Coincident"]
[null,null,"WEATHER CORRECTED MD 10% POE","MW","Non-coincident"]
[null,null,null,null,"Coincident"]
[null,null,"WEATHER CORRECTED MD 10% POE","MVA","Non-coincident"]
[null,null,null,null,"Coincident"]
[null,null,"WEATHER CORRECTED MD 50% POE","MW","Non-coincident"]
[null,null,null,null,"Coincident"]
[null,null,"WEATHER CORRECTED MD 50% POE","MVA","Non-coincident"]
[null,null,null,null,"Coincident"]
[null,"NSP to enter name","CONNECTION POINT RATING","MVA","Non-coincident"]
[null,null,null,null,"Coincident"]
[null,null,"WINTER/SUMMER PEAKING",null,"Non-coincident"]
[null,null,null,null,"Coincident"]
[null,null,"ADJUSTMENTS - EMBEDDED GENERATION","MW","Non-coincident"]
[null,null,null,null,"Coincident"]
[null,null,"WEATHER CORRECTED MD 10% POE","MW","Non-coincident"]
[null,null,null,null,"Coincident"]
[null,null,"WEATHER CORRECTED MD 10% POE","MVA","Non-coincident"]
[null,null,null,null,"Coincident"]
[null,null,"WEATHER CORRECTED MD 50% POE","MW","Non-coincident"]
[null,null,null,null,"Coincident"]
[null,null,"WEATHER CORRECTED MD 50% POE","MVA","Non-coincident"]
[null,null,null,null,"Coincident"]
[null,"NSP to enter name","CONNECTION POINT RATING","MVA","Non-coincident"]
[null,null,null,null,"Coincident"]
[null,null,"WINTER/SUMMER PEAKING",null,"Non-coincident"]
[null,null,null,null,"Coincident"]
[null,null,"ADJUSTMENTS - EMBEDDED GENERATION","MW","Non-coincident"]
[null,null,null,null,"Coincident"]
[null,null,"WEATHER CORRECTED MD 10% POE","MW","Non-coincident"]
[null,null,null,null,"Coincident"]
[null,null,"WEATHER CORRECTED MD 10% POE","MVA","Non-coincident"]
[null,null,null,null,"Coincident"]
[null,null,"WEATHER CORRECTED MD 50% POE","MW","Non-coincident"]
[null,null,null,null,"Coincident"]
[null,null,"WEATHER CORRECTED MD 50% POE","MVA","Non-coincident"]
[null,null,null,null,"Coincident"]
[null,"NSP to enter name","CONNECTION POINT RATING","MVA","Non-coincident"]
[null,null,null,null,"Coincident"]
[null,null,"WINTER/SUMMER PEAKING",null,"Non-coincident"]
[null,null,null,null,"Coincident"]
[null,null,"ADJUSTMENTS - EMBEDDED GENERATION","MW","Non-coincident"]
[null,null,null,null,"Coincident"]
[null,null,"WEATHER CORRECTED MD 10% POE","MW","Non-coincident"]
[null,null,null,null,"Coincident"]
[null,null,"WEATHER CORRECTED MD 10% POE","MVA","Non-coincident"]
[null,null,null,null,"Coincident"]
[null,null,"WEATHER CORRECTED MD 50% POE","MW","Non-coincident"]
[null,null,null,null,"Coincident"]
[null,null,"WEATHER CORRECTED MD 50% POE","MVA","Non-coincident"]
[null,null,null,null,"Coincident"]
[null,"NSP to enter name","CONNECTION POINT RATING","MVA","Non-coincident"]
[null,null,null,null,"Coincident"]
[null,null,"WINTER/SUMMER PEAKING",null,"Non-coincident"]
[null,null,null,null,"Coincident"]
[null,null,"ADJUSTMENTS - EMBEDDED GENERATION","MW","Non-coincident"]
[null,null,null,null,"Coincident"]
[null,null,"WEATHER CORRECTED MD 10% POE","MW","Non-coincident"]
[null,null,null,null,"Coincident"]
[null,null,"WEATHER CORRECTED MD 10% POE","MVA","Non-coincident"]
[null,null,null,null,"Coincident"]
[null,null,"WEATHER CORRECTED MD 50% POE","MW","Non-coincident"]
[null,null,null,null,"Coincident"]
[null,null,"WEATHER CORRECTED MD 50% POE","MVA","Non-coincident"]
[null,null,null,null,"Coincident"]
[null,"NSP to enter name","CONNECTION POINT RATING","MVA","Non-coincident"]
[null,null,null,null,"Coincident"]
[null,null,"WINTER/SUMMER PEAKING",null,"Non-coincident"]
[null,null,null,null,"Coincident"]
[null,null,"ADJUSTMENTS - EMBEDDED GENERATION","MW","Non-coincident"]
[null,null,null,null,"Coincident"]
[null,null,"WEATHER CORRECTED MD 10% POE","MW","Non-coincident"]
[null,null,null,null,"Coincident"]
[null,null,"WEATHER CORRECTED MD 10% POE","MVA","Non-coincident"]
[null,null,null,null,"Coincident"]
[null,null,"WEATHER CORRECTED MD 50% POE","MW","Non-coincident"]
[null,null,null,null,"Coincident"]
[null,null,"WEATHER CORRECTED MD 50% POE","MVA","Non-coincident"]
[null,null,null,null,"Coincident"]
[null,"NSP to enter name","CONNECTION POINT RATING","MVA","Non-coincident"]
[null,null,null,null,"Coincident"]
[null,null,"WINTER/SUMMER PEAKING",null,"Non-coincident"]
[null,null,null,null,"Coincident"]
[null,null,"ADJUSTMENTS - EMBEDDED GENERATION","MW","Non-coincident"]
[null,null,null,null,"Coincident"]
[null,null,"WEATHER CORRECTED MD 10% POE","MW","Non-coincident"]
[null,null,null,null,"Coincident"]
[null,null,"WEATHER CORRECTED MD 10% POE","MVA","Non-coincident"]
[null,null,null,null,"Coincident"]
[null,null,"WEATHER CORRECTED MD 50% POE","MW","Non-coincident"]
[null,null,null,null,"Coincident"]
[null,null,"WEATHER CORRECTED MD 50% POE","MVA","Non-coincident"]
[null,null,null,null,"Coincident"]
[null,"NSP to enter name","CONNECTION POINT RATING","MVA","Non-coincident"]
[null,null,null,null,"Coincident"]
[null,null,"WINTER/SUMMER PEAKING",null,"Non-coincident"]
[null,null,null,null,"Coincident"]
[null,null,"ADJUSTMENTS - EMBEDDED GENERATION","MW","Non-coincident"]
[null,null,null,null,"Coincident"]
[null,null,"WEATHER CORRECTED MD 10% POE","MW","Non-coincident"]
[null,null,null,null,"Coincident"]
[null,null,"WEATHER CORRECTED MD 10% POE","MVA","Non-coincident"]
[null,null,null,null,"Coincident"]
[null,null,"WEATHER CORRECTED MD 50% POE","MW","Non-coincident"]
[null,null,null,null,"Coincident"]
[null,null,"WEATHER CORRECTED MD 50% POE","MVA","Non-coincident"]
[null,null,null,null,"Coincident"]
[null,"NSP to enter name","CONNECTION POINT RATING","MVA","Non-coincident"]
[null,null,null,null,"Coincident"]
[null,null,"WINTER/SUMMER PEAKING",null,"Non-coincident"]
[null,null,null,null,"Coincident"]
[null,null,"ADJUSTMENTS - EMBEDDED GENERATION","MW","Non-coincident"]
[null,null,null,null,"Coincident"]
[null,null,"WEATHER CORRECTED MD 10% POE","MW","Non-coincident"]
[null,null,null,null,"Coincident"]
[null,null,"WEATHER CORRECTED MD 10% POE","MVA","Non-coincident"]
[null,null,null,null,"Coincident"]
[null,null,"WEATHER CORRECTED MD 50% POE","MW","Non-coincident"]
[null,null,null,null,"Coincident"]
[null,null,"WEATHER CORRECTED MD 50% POE","MVA","Non-coincident"]
[null,null,null,null,"Coincident"]
[null,"NSP to enter name","CONNECTION POINT RATING","MVA","Non-coincident"]
[null,null,null,null,"Coincident"]
[null,null,"WINTER/SUMMER PEAKING",null,"Non-coincident"]
[null,null,null,null,"Coincident"]
[null,null,"ADJUSTMENTS - EMBEDDED GENERATION","MW","Non-coincident"]
[null,null,null,null,"Coincident"]
[null,null,"WEATHER CORRECTED MD 10% POE","MW","Non-coincident"]
[null,null,null,null,"Coincident"]
[null,null,"WEATHER CORRECTED MD 10% POE","MVA","Non-coincident"]
[null,null,null,null,"Coincident"]
[null,null,"WEATHER CORRECTED MD 50% POE","MW","Non-coincident"]
[null,null,null,null,"Coincident"]
[null,null,"WEATHER CORRECTED MD 50% POE","MVA","Non-coincident"]
[null,null,null,null,"Coincident"]
[null,"NSP to enter name","CONNECTION POINT RATING","MVA","Non-coincident"]
[null,null,null,null,"Coincident"]
[null,null,"WINTER/SUMMER PEAKING",null,"Non-coincident"]
[null,null,null,null,"Coincident"]
[null,null,"ADJUSTMENTS - EMBEDDED GENERATION","MW","Non-coincident"]
[null,null,null,null,"Coincident"]
[null,null,"WEATHER CORRECTED MD 10% POE","MW","Non-coincident"]
[null,null,null,null,"Coincident"]
[null,null,"WEATHER CORRECTED MD 10% POE","MVA","Non-coincident"]
[null,null,null,null,"Coincident"]
[null,null,"WEATHER CORRECTED MD 50% POE","MW","Non-coincident"]
[null,null,null,null,"Coincident"]
[null,null,"WEATHER CORRECTED MD 50% POE","MVA","Non-coincident"]
[null,null,null,null,"Coincident"]
[null,"NSP to enter name","CONNECTION POINT RATING","MVA","Non-coincident"]
[null,null,null,null,"Coincident"]
[null,null,"WINTER/SUMMER PEAKING",null,"Non-coincident"]
[null,null,null,null,"Coincident"]
[null,null,"ADJUSTMENTS - EMBEDDED GENERATION","MW","Non-coincident"]
[null,null,null,null,"Coincident"]
[null,null,"WEATHER CORRECTED MD 10% POE","MW","Non-coincident"]
[null,null,null,null,"Coincident"]
[null,null,"WEATHER CORRECTED MD 10% POE","MVA","Non-coincident"]
[null,null,null,null,"Coincident"]
[null,null,"WEATHER CORRECTED MD 50% POE","MW","Non-coincident"]
[null,null,null,null,"Coincident"]
[null,null,"WEATHER CORRECTED MD 50% POE","MVA","Non-coincident"]
[null,null,null,null,"Coincident"]
[null,"NSP to enter name","CONNECTION POINT RATING","MVA","Non-coincident"]
[null,null,null,null,"Coincident"]
[null,null,"WINTER/SUMMER PEAKING",null,"Non-coincident"]
[null,null,null,null,"Coincident"]
[null,null,"ADJUSTMENTS - EMBEDDED GENERATION","MW","Non-coincident"]
[null,null,null,null,"Coincident"]
[null,null,"WEATHER CORRECTED MD 10% POE","MW","Non-coincident"]
[null,null,null,null,"Coincident"]
[null,null,"WEATHER CORRECTED MD 10% POE","MVA","Non-coincident"]
[null,null,null,null,"Coincident"]
[null,null,"WEATHER CORRECTED MD 50% POE","MW","Non-coincident"]
[null,null,null,null,"Coincident"]
[null,null,"WEATHER CORRECTED MD 50% POE","MVA","Non-coincident"]
[null,null,null,null,"Coincident"]
[null,"NSP to enter name","CONNECTION POINT RATING","MVA","Non-coincident"]
[null,null,null,null,"Coincident"]
[null,null,"WINTER/SUMMER PEAKING",null,"Non-coincident"]
[null,null,null,null,"Coincident"]
[null,null,"ADJUSTMENTS - EMBEDDED GENERATION","MW","Non-coincident"]
[null,null,null,null,"Coincident"]
[null,null,"WEATHER CORRECTED MD 10% POE","MW","Non-coincident"]
[null,null,null,null,"Coincident"]
[null,null,"WEATHER CORRECTED MD 10% POE","MVA","Non-coincident"]
[null,null,null,null,"Coincident"]
[null,null,"WEATHER CORRECTED MD 50% POE","MW","Non-coincident"]
[null,null,null,null,"Coincident"]
[null,null,"WEATHER CORRECTED MD 50% POE","MVA","Non-coincident"]
[null,null,null,null,"Coincident"]
[null,"NSP to enter name","CONNECTION POINT RATING","MVA","Non-coincident"]
[null,null,null,null,"Coincident"]
[null,null,"WINTER/SUMMER PEAKING",null,"Non-coincident"]
[null,null,null,null,"Coincident"]
[null,null,"ADJUSTMENTS - EMBEDDED GENERATION","MW","Non-coincident"]
[null,null,null,null,"Coincident"]
[null,null,"WEATHER CORRECTED MD 10% POE","MW","Non-coincident"]
[null,null,null,null,"Coincident"]
[null,null,"WEATHER CORRECTED MD 10% POE","MVA","Non-coincident"]
[null,null,null,null,"Coincident"]
[null,null,"WEATHER CORRECTED MD 50% POE","MW","Non-coincident"]
[null,null,null,null,"Coincident"]
[null,null,"WEATHER CORRECTED MD 50% POE","MVA","Non-coincident"]
[null,null,null,null,"Coincident"]
[null,"NSP to enter name","CONNECTION POINT RATING","MVA","Non-coincident"]
[null,null,null,null,"Coincident"]
[null,null,"WINTER/SUMMER PEAKING",null,"Non-coincident"]
[null,null,null,null,"Coincident"]
[null,null,"ADJUSTMENTS - EMBEDDED GENERATION","MW","Non-coincident"]
[null,null,null,null,"Coincident"]
[null,null,"WEATHER CORRECTED MD 10% POE","MW","Non-coincident"]
[null,null,null,null,"Coincident"]
[null,null,"WEATHER CORRECTED MD 10% POE","MVA","Non-coincident"]
[null,null,null,null,"Coincident"]
[null,null,"WEATHER CORRECTED MD 50% POE","MW","Non-coincident"]
[null,null,null,null,"Coincident"]
[null,null,"WEATHER CORRECTED MD 50% POE","MVA","Non-coincident"]
[null,null,null,null,"Coincident"]
[null,"NSP to enter name","CONNECTION POINT RATING","MVA","Non-coincident"]
[null,null,null,null,"Coincident"]
[null,null,"WINTER/SUMMER PEAKING",null,"Non-coincident"]
[null,null,null,null,"Coincident"]
[null,null,"ADJUSTMENTS - EMBEDDED GENERATION","MW","Non-coincident"]
[null,null,null,null,"Coincident"]
[null,null,"WEATHER CORRECTED MD 10% POE","MW","Non-coincident"]
[null,null,null,null,"Coincident"]
[null,null,"WEATHER CORRECTED MD 10% POE","MVA","Non-coincident"]
[null,null,null,null,"Coincident"]
[null,null,"WEATHER CORRECTED MD 50% POE","MW","Non-coincident"]
[null,null,null,null,"Coincident"]
[null,null,"WEATHER CORRECTED MD 50% POE","MVA","Non-coincident"]
[null,null,null,null,"Coincident"]
[null,"NSP to enter name","CONNECTION POINT RATING","MVA","Non-coincident"]
[null,null,null,null,"Coincident"]
[null,null,"WINTER/SUMMER PEAKING",null,"Non-coincident"]
[null,null,null,null,"Coincident"]
[null,null,"ADJUSTMENTS - EMBEDDED GENERATION","MW","Non-coincident"]
[null,null,null,null,"Coincident"]
[null,null,"WEATHER CORRECTED MD 10% POE","MW","Non-coincident"]
[null,null,null,null,"Coincident"]
[null,null,"WEATHER CORRECTED MD 10% POE","MVA","Non-coincident"]
[null,null,null,null,"Coincident"]
[null,null,"WEATHER CORRECTED MD 50% POE","MW","Non-coincident"]
[null,null,null,null,"Coincident"]
[null,null,"WEATHER CORRECTED MD 50% POE","MVA","Non-coincident"]
[null,null,null,null,"Coincident"]
[null,"NSP to enter name","CONNECTION POINT RATING","MVA","Non-coincident"]
[null,null,null,null,"Coincident"]
[null,null,"WINTER/SUMMER PEAKING",null,"Non-coincident"]
[null,null,null,null,"Coincident"]
[null,null,"ADJUSTMENTS - EMBEDDED GENERATION","MW","Non-coincident"]
[null,null,null,null,"Coincident"]
[null,null,"WEATHER CORRECTED MD 10% POE","MW","Non-coincident"]
[null,null,null,null,"Coincident"]
[null,null,"WEATHER CORRECTED MD 10% POE","MVA","Non-coincident"]
[null,null,null,null,"Coincident"]
[null,null,"WEATHER CORRECTED MD 50% POE","MW","Non-coincident"]
[null,null,null,null,"Coincident"]
[null,null,"WEATHER CORRECTED MD 50% POE","MVA","Non-coincident"]
[null,null,null,null,"Coincident"]
[null,"NSP to enter name","CONNECTION POINT RATING","MVA","Non-coincident"]
[null,null,null,null,"Coincident"]
[null,null,"WINTER/SUMMER PEAKING",null,"Non-coincident"]
[null,null,null,null,"Coincident"]
[null,null,"ADJUSTMENTS - EMBEDDED GENERATION","MW","Non-coincident"]
[null,null,null,null,"Coincident"]
[null,null,"WEATHER CORRECTED MD 10% POE","MW","Non-coincident"]
[null,null,null,null,"Coincident"]
[null,null,"WEATHER CORRECTED MD 10% POE","MVA","Non-coincident"]
[null,null,null,null,"Coincident"]
[null,null,"WEATHER CORRECTED MD 50% POE","MW","Non-coincident"]
[null,null,null,null,"Coincident"]
[null,null,"WEATHER CORRECTED MD 50% POE","MVA","Non-coincident"]
[null,null,null,null,"Coincident"]
[null,"NSP to enter name","CONNECTION POINT RATING","MVA","Non-coincident"]
[null,null,null,null,"Coincident"]
[null,null,"WINTER/SUMMER PEAKING",null,"Non-coincident"]
[null,null,null,null,"Coincident"]
[null,null,"ADJUSTMENTS - EMBEDDED GENERATION","MW","Non-coincident"]
[null,null,null,null,"Coincident"]
[null,null,"WEATHER CORRECTED MD 10% POE","MW","Non-coincident"]
[null,null,null,null,"Coincident"]
[null,null,"WEATHER CORRECTED MD 10% POE","MVA","Non-coincident"]
[null,null,null,null,"Coincident"]
[null,null,"WEATHER CORRECTED MD 50% POE","MW","Non-coincident"]
[null,null,null,null,"Coincident"]
[null,null,"WEATHER CORRECTED MD 50% POE","MVA","Non-coincident"]
[null,null,null,null,"Coincident"]
[null,"NSP to enter name","CONNECTION POINT RATING","MVA","Non-coincident"]
[null,null,null,null,"Coincident"]
[null,null,"WINTER/SUMMER PEAKING",null,"Non-coincident"]
[null,null,null,null,"Coincident"]
[null,null,"ADJUSTMENTS - EMBEDDED GENERATION","MW","Non-coincident"]
[null,null,null,null,"Coincident"]
[null,null,"WEATHER CORRECTED MD 10% POE","MW","Non-coincident"]
[null,null,null,null,"Coincident"]
[null,null,"WEATHER CORRECTED MD 10% POE","MVA","Non-coincident"]
[null,null,null,null,"Coincident"]
[null,null,"WEATHER CORRECTED MD 50% POE","MW","Non-coincident"]
[null,null,null,null,"Coincident"]
[null,null,"WEATHER CORRECTED MD 50% POE","MVA","Non-coincident"]
[null,null,null,null,"Coincident"]
[null,"NSP to enter name","CONNECTION POINT RATING","MVA","Non-coincident"]
[null,null,null,null,"Coincident"]
[null,null,"WINTER/SUMMER PEAKING",null,"Non-coincident"]
[null,null,null,null,"Coincident"]
[null,null,"ADJUSTMENTS - EMBEDDED GENERATION","MW","Non-coincident"]
[null,null,null,null,"Coincident"]
[null,null,"WEATHER CORRECTED MD 10% POE","MW","Non-coincident"]
[null,null,null,null,"Coincident"]
[null,null,"WEATHER CORRECTED MD 10% POE","MVA","Non-coincident"]
[null,null,null,null,"Coincident"]
[null,null,"WEATHER CORRECTED MD 50% POE","MW","Non-coincident"]
[null,null,null,null,"Coincident"]
[null,null,"WEATHER CORRECTED MD 50% POE","MVA","Non-coincident"]
[null,null,null,null,"Coincident"]
[null,"NSP to enter name","CONNECTION POINT RATING","MVA","Non-coincident"]
[null,null,null,null,"Coincident"]
[null,null,"WINTER/SUMMER PEAKING",null,"Non-coincident"]
[null,null,null,null,"Coincident"]
[null,null,"ADJUSTMENTS - EMBEDDED GENERATION","MW","Non-coincident"]
[null,null,null,null,"Coincident"]
[null,null,"WEATHER CORRECTED MD 10% POE","MW","Non-coincident"]
[null,null,null,null,"Coincident"]
[null,null,"WEATHER CORRECTED MD 10% POE","MVA","Non-coincident"]
[null,null,null,null,"Coincident"]
[null,null,"WEATHER CORRECTED MD 50% POE","MW","Non-coincident"]
[null,null,null,null,"Coincident"]
[null,null,"WEATHER CORRECTED MD 50% POE","MVA","Non-coincident"]
[null,null,null,null,"Coincident"]
[null,"NSP to enter name","CONNECTION POINT RATING","MVA","Non-coincident"]
[null,null,null,null,"Coincident"]
[null,null,"WINTER/SUMMER PEAKING",null,"Non-coincident"]
[null,null,null,null,"Coincident"]
[null,null,"ADJUSTMENTS - EMBEDDED GENERATION","MW","Non-coincident"]
[null,null,null,null,"Coincident"]
[null,null,"WEATHER CORRECTED MD 10% POE","MW","Non-coincident"]
[null,null,null,null,"Coincident"]
[null,null,"WEATHER CORRECTED MD 10% POE","MVA","Non-coincident"]
[null,null,null,null,"Coincident"]
[null,null,"WEATHER CORRECTED MD 50% POE","MW","Non-coincident"]
[null,null,null,null,"Coincident"]
[null,null,"WEATHER CORRECTED MD 50% POE","MVA","Non-coincident"]
[null,null,null,null,"Coincident"]
[null,"NSP to enter name","CONNECTION POINT RATING","MVA","Non-coincident"]
[null,null,null,null,"Coincident"]
[null,null,"WINTER/SUMMER PEAKING",null,"Non-coincident"]
[null,null,null,null,"Coincident"]
[null,null,"ADJUSTMENTS - EMBEDDED GENERATION","MW","Non-coincident"]
[null,null,null,null,"Coincident"]
[null,null,"WEATHER CORRECTED MD 10% POE","MW","Non-coincident"]
[null,null,null,null,"Coincident"]
[null,null,"WEATHER CORRECTED MD 10% POE","MVA","Non-coincident"]
[null,null,null,null,"Coincident"]
[null,null,"WEATHER CORRECTED MD 50% POE","MW","Non-coincident"]
[null,null,null,null,"Coincident"]
[null,null,"WEATHER CORRECTED MD 50% POE","MVA","Non-coincident"]
[null,null,null,null,"Coincident"]
[null,"NSP to enter name","CONNECTION POINT RATING","MVA","Non-coincident"]
[null,null,null,null,"Coincident"]
[null,null,"WINTER/SUMMER PEAKING",null,"Non-coincident"]
[null,null,null,null,"Coincident"]
[null,null,"ADJUSTMENTS - EMBEDDED GENERATION","MW","Non-coincident"]
[null,null,null,null,"Coincident"]
[null,null,"WEATHER CORRECTED MD 10% POE","MW","Non-coincident"]
[null,null,null,null,"Coincident"]
[null,null,"WEATHER CORRECTED MD 10% POE","MVA","Non-coincident"]
[null,null,null,null,"Coincident"]
[null,null,"WEATHER CORRECTED MD 50% POE","MW","Non-coincident"]
[null,null,null,null,"Coincident"]
[null,null,"WEATHER CORRECTED MD 50% POE","MVA","Non-coincident"]
[null,null,null,null,"Coincident"]
[null,"NSP to enter name","CONNECTION POINT RATING","MVA","Non-coincident"]
[null,null,null,null,"Coincident"]
[null,null,"WINTER/SUMMER PEAKING",null,"Non-coincident"]
[null,null,null,null,"Coincident"]
[null,null,"ADJUSTMENTS - EMBEDDED GENERATION","MW","Non-coincident"]
[null,null,null,null,"Coincident"]
[null,null,"WEATHER CORRECTED MD 10% POE","MW","Non-coincident"]
[null,null,null,null,"Coincident"]
[null,null,"WEATHER CORRECTED MD 10% POE","MVA","Non-coincident"]
[null,null,null,null,"Coincident"]
[null,null,"WEATHER CORRECTED MD 50% POE","MW","Non-coincident"]
[null,null,null,null,"Coincident"]
[null,null,"WEATHER CORRECTED MD 50% POE","MVA","Non-coincident"]
[null,null,null,null,"Coincident"]
[null,"NSP to enter name","CONNECTION POINT RATING","MVA","Non-coincident"]
[null,null,null,null,"Coincident"]
[null,null,"WINTER/SUMMER PEAKING",null,"Non-coincident"]
[null,null,null,null,"Coincident"]
[null,null,"ADJUSTMENTS - EMBEDDED GENERATION","MW","Non-coincident"]
[null,null,null,null,"Coincident"]
[null,null,"WEATHER CORRECTED MD 10% POE","MW","Non-coincident"]
[null,null,null,null,"Coincident"]
[null,null,"WEATHER CORRECTED MD 10% POE","MVA","Non-coincident"]
[null,null,null,null,"Coincident"]
[null,null,"WEATHER CORRECTED MD 50% POE","MW","Non-coincident"]
[null,null,null,null,"Coincident"]
[null,null,"WEATHER CORRECTED MD 50% POE","MVA","Non-coincident"]
[null,null,null,null,"Coincident"]
[null,"NSP to enter name","CONNECTION POINT RATING","MVA","Non-coincident"]
[null,null,null,null,"Coincident"]
[null,null,"WINTER/SUMMER PEAKING",null,"Non-coincident"]
[null,null,null,null,"Coincident"]
[null,null,"ADJUSTMENTS - EMBEDDED GENERATION","MW","Non-coincident"]
[null,null,null,null,"Coincident"]
[null,null,"WEATHER CORRECTED MD 10% POE","MW","Non-coincident"]
[null,null,null,null,"Coincident"]
[null,null,"WEATHER CORRECTED MD 10% POE","MVA","Non-coincident"]
[null,null,null,null,"Coincident"]
[null,null,"WEATHER CORRECTED MD 50% POE","MW","Non-coincident"]
[null,null,null,null,"Coincident"]
[null,null,"WEATHER CORRECTED MD 50% POE","MVA","Non-coincident"]
[null,null,null,null,"Coincident"]
[null,"NSP to enter name","CONNECTION POINT RATING","MVA","Non-coincident"]
[null,null,null,null,"Coincident"]
[null,null,"WINTER/SUMMER PEAKING",null,"Non-coincident"]
[null,null,null,null,"Coincident"]
[null,null,"ADJUSTMENTS - EMBEDDED GENERATION","MW","Non-coincident"]
[null,null,null,null,"Coincident"]
[null,null,"WEATHER CORRECTED MD 10% POE","MW","Non-coincident"]
[null,null,null,null,"Coincident"]
[null,null,"WEATHER CORRECTED MD 10% POE","MVA","Non-coincident"]
[null,null,null,null,"Coincident"]
[null,null,"WEATHER CORRECTED MD 50% POE","MW","Non-coincident"]
[null,null,null,null,"Coincident"]
[null,null,"WEATHER CORRECTED MD 50% POE","MVA","Non-coincident"]
[null,null,null,null,"Coincident"]
[null,"NSP to enter name","CONNECTION POINT RATING","MVA","Non-coincident"]
[null,null,null,null,"Coincident"]
[null,null,"WINTER/SUMMER PEAKING",null,"Non-coincident"]
[null,null,null,null,"Coincident"]
[null,null,"ADJUSTMENTS - EMBEDDED GENERATION","MW","Non-coincident"]
[null,null,null,null,"Coincident"]
[null,null,"WEATHER CORRECTED MD 10% POE","MW","Non-coincident"]
[null,null,null,null,"Coincident"]
[null,null,"WEATHER CORRECTED MD 10% POE","MVA","Non-coincident"]
[null,null,null,null,"Coincident"]
[null,null,"WEATHER CORRECTED MD 50% POE","MW","Non-coincident"]
[null,null,null,null,"Coincident"]
[null,null,"WEATHER CORRECTED MD 50% POE","MVA","Non-coincident"]
[null,null,null,null,"Coincident"]
[null,"NSP to enter name","CONNECTION POINT RATING","MVA","Non-coincident"]
[null,null,null,null,"Coincident"]
[null,null,"WINTER/SUMMER PEAKING",null,"Non-coincident"]
[null,null,null,null,"Coincident"]
[null,null,"ADJUSTMENTS - EMBEDDED GENERATION","MW","Non-coincident"]
[null,null,null,null,"Coincident"]
[null,null,"WEATHER CORRECTED MD 10% POE","MW","Non-coincident"]
[null,null,null,null,"Coincident"]
[null,null,"WEATHER CORRECTED MD 10% POE","MVA","Non-coincident"]
[null,null,null,null,"Coincident"]
[null,null,"WEATHER CORRECTED MD 50% POE","MW","Non-coincident"]
[null,null,null,null,"Coincident"]
[null,null,"WEATHER CORRECTED MD 50% POE","MVA","Non-coincident"]
[null,null,null,null,"Coincident"]
[null,"NSP to enter name","CONNECTION POINT RATING","MVA","Non-coincident"]
[null,null,null,null,"Coincident"]
[null,null,"WINTER/SUMMER PEAKING",null,"Non-coincident"]
[null,null,null,null,"Coincident"]
[null,null,"ADJUSTMENTS - EMBEDDED GENERATION","MW","Non-coincident"]
[null,null,null,null,"Coincident"]
[null,null,"WEATHER CORRECTED MD 10% POE","MW","Non-coincident"]
[null,null,null,null,"Coincident"]
[null,null,"WEATHER CORRECTED MD 10% POE","MVA","Non-coincident"]
[null,null,null,null,"Coincident"]
[null,null,"WEATHER CORRECTED MD 50% POE","MW","Non-coincident"]
[null,null,null,null,"Coincident"]
[null,null,"WEATHER CORRECTED MD 50% POE","MVA","Non-coincident"]
[null,null,null,null,"Coincident"]
[null,"NSP to enter name","CONNECTION POINT RATING","MVA","Non-coincident"]
[null,null,null,null,"Coincident"]
[null,null,"WINTER/SUMMER PEAKING",null,"Non-coincident"]
[null,null,null,null,"Coincident"]
[null,null,"ADJUSTMENTS - EMBEDDED GENERATION","MW","Non-coincident"]
[null,null,null,null,"Coincident"]
[null,null,"WEATHER CORRECTED MD 10% POE","MW","Non-coincident"]
[null,null,null,null,"Coincident"]
[null,null,"WEATHER CORRECTED MD 10% POE","MVA","Non-coincident"]
[null,null,null,null,"Coincident"]
[null,null,"WEATHER CORRECTED MD 50% POE","MW","Non-coincident"]
[null,null,null,null,"Coincident"]
[null,null,"WEATHER CORRECTED MD 50% POE","MVA","Non-coincident"]
[null,null,null,null,"Coincident"]
[null,"NSP to enter name","CONNECTION POINT RATING","MVA","Non-coincident"]
[null,null,null,null,"Coincident"]
[null,null,"WINTER/SUMMER PEAKING",null,"Non-coincident"]
[null,null,null,null,"Coincident"]
[null,null,"ADJUSTMENTS - EMBEDDED GENERATION","MW","Non-coincident"]
[null,null,null,null,"Coincident"]
[null,null,"WEATHER CORRECTED MD 10% POE","MW","Non-coincident"]
[null,null,null,null,"Coincident"]
[null,null,"WEATHER CORRECTED MD 10% POE","MVA","Non-coincident"]
[null,null,null,null,"Coincident"]
[null,null,"WEATHER CORRECTED MD 50% POE","MW","Non-coincident"]
[null,null,null,null,"Coincident"]
[null,null,"WEATHER CORRECTED MD 50% POE","MVA","Non-coincident"]
[null,null,null,null,"Coincident"]
[null,"NSP to enter name","CONNECTION POINT RATING","MVA","Non-coincident"]
[null,null,null,null,"Coincident"]
[null,null,"WINTER/SUMMER PEAKING",null,"Non-coincident"]
[null,null,null,null,"Coincident"]
[null,null,"ADJUSTMENTS - EMBEDDED GENERATION","MW","Non-coincident"]
[null,null,null,null,"Coincident"]
[null,null,"WEATHER CORRECTED MD 10% POE","MW","Non-coincident"]
[null,null,null,null,"Coincident"]
[null,null,"WEATHER CORRECTED MD 10% POE","MVA","Non-coincident"]
[null,null,null,null,"Coincident"]
[null,null,"WEATHER CORRECTED MD 50% POE","MW","Non-coincident"]
[null,null,null,null,"Coincident"]
[null,null,"WEATHER CORRECTED MD 50% POE","MVA","Non-coincident"]
[null,null,null,null,"Coincident"]
[null,"NSP to enter name","CONNECTION POINT RATING","MVA","Non-coincident"]
[null,null,null,null,"Coincident"]
[null,null,"WINTER/SUMMER PEAKING",null,"Non-coincident"]
[null,null,null,null,"Coincident"]
[null,null,"ADJUSTMENTS - EMBEDDED GENERATION","MW","Non-coincident"]
[null,null,null,null,"Coincident"]
[null,null,"WEATHER CORRECTED MD 10% POE","MW","Non-coincident"]
[null,null,null,null,"Coincident"]
[null,null,"WEATHER CORRECTED MD 10% POE","MVA","Non-coincident"]
[null,null,null,null,"Coincident"]
[null,null,"WEATHER CORRECTED MD 50% POE","MW","Non-coincident"]
[null,null,null,null,"Coincident"]
[null,null,"WEATHER CORRECTED MD 50% POE","MVA","Non-coincident"]
[null,null,null,null,"Coincident"]
[null,"NSP to enter name","CONNECTION POINT RATING","MVA","Non-coincident"]
[null,null,null,null,"Coincident"]
[null,null,"WINTER/SUMMER PEAKING",null,"Non-coincident"]
[null,null,null,null,"Coincident"]
[null,null,"ADJUSTMENTS - EMBEDDED GENERATION","MW","Non-coincident"]
[null,null,null,null,"Coincident"]
[null,null,"WEATHER CORRECTED MD 10% POE","MW","Non-coincident"]
[null,null,null,null,"Coincident"]
[null,null,"WEATHER CORRECTED MD 10% POE","MVA","Non-coincident"]
[null,null,null,null,"Coincident"]
[null,null,"WEATHER CORRECTED MD 50% POE","MW","Non-coincident"]
[null,null,null,null,"Coincident"]
[null,null,"WEATHER CORRECTED MD 50% POE","MVA","Non-coincident"]
[null,null,null,null,"Coincident"]
[null,"NSP to enter name","CONNECTION POINT RATING","MVA","Non-coincident"]
[null,null,null,null,"Coincident"]
[null,null,"WINTER/SUMMER PEAKING",null,"Non-coincident"]
[null,null,null,null,"Coincident"]
[null,null,"ADJUSTMENTS - EMBEDDED GENERATION","MW","Non-coincident"]
[null,null,null,null,"Coincident"]
[null,null,"WEATHER CORRECTED MD 10% POE","MW","Non-coincident"]
[null,null,null,null,"Coincident"]
[null,null,"WEATHER CORRECTED MD 10% POE","MVA","Non-coincident"]
[null,null,null,null,"Coincident"]
[null,null,"WEATHER CORRECTED MD 50% POE","MW","Non-coincident"]
[null,null,null,null,"Coincident"]
[null,null,"WEATHER CORRECTED MD 50% POE","MVA","Non-coincident"]
[null,null,null,null,"Coincident"]
[null,"NSP to enter name","CONNECTION POINT RATING","MVA","Non-coincident"]
[null,null,null,null,"Coincident"]
[null,null,"WINTER/SUMMER PEAKING",null,"Non-coincident"]
[null,null,null,null,"Coincident"]
[null,null,"ADJUSTMENTS - EMBEDDED GENERATION","MW","Non-coincident"]
[null,null,null,null,"Coincident"]
[null,null,"WEATHER CORRECTED MD 10% POE","MW","Non-coincident"]
[null,null,null,null,"Coincident"]
[null,null,"WEATHER CORRECTED MD 10% POE","MVA","Non-coincident"]
[null,null,null,null,"Coincident"]
[null,null,"WEATHER CORRECTED MD 50% POE","MW","Non-coincident"]
[null,null,null,null,"Coincident"]
[null,null,"WEATHER CORRECTED MD 50% POE","MVA","Non-coincident"]
[null,null,null,null,"Coincident"]
[null,"NSP to enter name","CONNECTION POINT RATING","MVA","Non-coincident"]
[null,null,null,null,"Coincident"]
[null,null,"WINTER/SUMMER PEAKING",null,"Non-coincident"]
[null,null,null,null,"Coincident"]
[null,null,"ADJUSTMENTS - EMBEDDED GENERATION","MW","Non-coincident"]
[null,null,null,null,"Coincident"]
[null,null,"WEATHER CORRECTED MD 10% POE","MW","Non-coincident"]
[null,null,null,null,"Coincident"]
[null,null,"WEATHER CORRECTED MD 10% POE","MVA","Non-coincident"]
[null,null,null,null,"Coincident"]
[null,null,"WEATHER CORRECTED MD 50% POE","MW","Non-coincident"]
[null,null,null,null,"Coincident"]
[null,null,"WEATHER CORRECTED MD 50% POE","MVA","Non-coincident"]
[null,null,null,null,"Coincident"]
[null,"NSP to enter name","CONNECTION POINT RATING","MVA","Non-coincident"]
[null,null,null,null,"Coincident"]
[null,null,"WINTER/SUMMER PEAKING",null,"Non-coincident"]
[null,null,null,null,"Coincident"]
[null,null,"ADJUSTMENTS - EMBEDDED GENERATION","MW","Non-coincident"]
[null,null,null,null,"Coincident"]
[null,null,"WEATHER CORRECTED MD 10% POE","MW","Non-coincident"]
[null,null,null,null,"Coincident"]
[null,null,"WEATHER CORRECTED MD 10% POE","MVA","Non-coincident"]
[null,null,null,null,"Coincident"]
[null,null,"WEATHER CORRECTED MD 50% POE","MW","Non-coincident"]
[null,null,null,null,"Coincident"]
[null,null,"WEATHER CORRECTED MD 50% POE","MVA","Non-coincident"]
[null,null,null,null,"Coincident"]
[null,"NSP to enter name","CONNECTION POINT RATING","MVA","Non-coincident"]
[null,null,null,null,"Coincident"]
[null,null,"WINTER/SUMMER PEAKING",null,"Non-coincident"]
[null,null,null,null,"Coincident"]
[null,null,"ADJUSTMENTS - EMBEDDED GENERATION","MW","Non-coincident"]
[null,null,null,null,"Coincident"]
[null,null,"WEATHER CORRECTED MD 10% POE","MW","Non-coincident"]
[null,null,null,null,"Coincident"]
[null,null,"WEATHER CORRECTED MD 10% POE","MVA","Non-coincident"]
[null,null,null,null,"Coincident"]
[null,null,"WEATHER CORRECTED MD 50% POE","MW","Non-coincident"]
[null,null,null,null,"Coincident"]
[null,null,"WEATHER CORRECTED MD 50% POE","MVA","Non-coincident"]
[null,null,null,null,"Coincident"]
[null,"NSP to enter name","CONNECTION POINT RATING","MVA","Non-coincident"]
[null,null,null,null,"Coincident"]
[null,null,"WINTER/SUMMER PEAKING",null,"Non-coincident"]
[null,null,null,null,"Coincident"]
[null,null,"ADJUSTMENTS - EMBEDDED GENERATION","MW","Non-coincident"]
[null,null,null,null,"Coincident"]
[null,null,"WEATHER CORRECTED MD 10% POE","MW","Non-coincident"]
[null,null,null,null,"Coincident"]
[null,null,"WEATHER CORRECTED MD 10% POE","MVA","Non-coincident"]
[null,null,null,null,"Coincident"]
[null,null,"WEATHER CORRECTED MD 50% POE","MW","Non-coincident"]
[null,null,null,null,"Coincident"]
[null,null,"WEATHER CORRECTED MD 50% POE","MVA","Non-coincident"]
[null,null,null,null,"Coincident"]
[null,"NSP to enter name","CONNECTION POINT RATING","MVA","Non-coincident"]
[null,null,null,null,"Coincident"]
[null,null,"WINTER/SUMMER PEAKING",null,"Non-coincident"]
[null,null,null,null,"Coincident"]
[null,null,"ADJUSTMENTS - EMBEDDED GENERATION","MW","Non-coincident"]
[null,null,null,null,"Coincident"]
[null,null,"WEATHER CORRECTED MD 10% POE","MW","Non-coincident"]
[null,null,null,null,"Coincident"]
[null,null,"WEATHER CORRECTED MD 10% POE","MVA","Non-coincident"]
[null,null,null,null,"Coincident"]
[null,null,"WEATHER CORRECTED MD 50% POE","MW","Non-coincident"]
[null,null,null,null,"Coincident"]
[null,null,"WEATHER CORRECTED MD 50% POE","MVA","Non-coincident"]
[null,null,null,null,"Coincident"]
[null,"NSP to enter name","CONNECTION POINT RATING","MVA","Non-coincident"]
[null,null,null,null,"Coincident"]
[null,null,"WINTER/SUMMER PEAKING",null,"Non-coincident"]
[null,null,null,null,"Coincident"]
[null,null,"ADJUSTMENTS - EMBEDDED GENERATION","MW","Non-coincident"]
[null,null,null,null,"Coincident"]
[null,null,"WEATHER CORRECTED MD 10% POE","MW","Non-coincident"]
[null,null,null,null,"Coincident"]
[null,null,"WEATHER CORRECTED MD 10% POE","MVA","Non-coincident"]
[null,null,null,null,"Coincident"]
[null,null,"WEATHER CORRECTED MD 50% POE","MW","Non-coincident"]
[null,null,null,null,"Coincident"]
[null,null,"WEATHER CORRECTED MD 50% POE","MVA","Non-coincident"]
[null,null,null,null,"Coincident"]
[null,"NSP to enter name","CONNECTION POINT RATING","MVA","Non-coincident"]
[null,null,null,null,"Coincident"]
[null,null,"WINTER/SUMMER PEAKING",null,"Non-coincident"]
[null,null,null,null,"Coincident"]
[null,null,"ADJUSTMENTS - EMBEDDED GENERATION","MW","Non-coincident"]
[null,null,null,null,"Coincident"]
[null,null,"WEATHER CORRECTED MD 10% POE","MW","Non-coincident"]
[null,null,null,null,"Coincident"]
[null,null,"WEATHER CORRECTED MD 10% POE","MVA","Non-coincident"]
[null,null,null,null,"Coincident"]
[null,null,"WEATHER CORRECTED MD 50% POE","MW","Non-coincident"]
[null,null,null,null,"Coincident"]
[null,null,"WEATHER CORRECTED MD 50% POE","MVA","Non-coincident"]
[null,null,null,null,"Coincident"]
[null,"NSP to enter name","CONNECTION POINT RATING","MVA","Non-coincident"]
[null,null,null,null,"Coincident"]
[null,null,"WINTER/SUMMER PEAKING",null,"Non-coincident"]
[null,null,null,null,"Coincident"]
[null,null,"ADJUSTMENTS - EMBEDDED GENERATION","MW","Non-coincident"]
[null,null,null,null,"Coincident"]
[null,null,"WEATHER CORRECTED MD 10% POE","MW","Non-coincident"]
[null,null,null,null,"Coincident"]
[null,null,"WEATHER CORRECTED MD 10% POE","MVA","Non-coincident"]
[null,null,null,null,"Coincident"]
[null,null,"WEATHER CORRECTED MD 50% POE","MW","Non-coincident"]
[null,null,null,null,"Coincident"]
[null,null,"WEATHER CORRECTED MD 50% POE","MVA","Non-coincident"]
[null,null,null,null,"Coincident"]
[null,"NSP to enter name","CONNECTION POINT RATING","MVA","Non-coincident"]
[null,null,null,null,"Coincident"]
[null,null,"WINTER/SUMMER PEAKING",null,"Non-coincident"]
[null,null,null,null,"Coincident"]
[null,null,"ADJUSTMENTS - EMBEDDED GENERATION","MW","Non-coincident"]
[null,null,null,null,"Coincident"]
[null,null,"WEATHER CORRECTED MD 10% POE","MW","Non-coincident"]
[null,null,null,null,"Coincident"]
[null,null,"WEATHER CORRECTED MD 10% POE","MVA","Non-coincident"]
[null,null,null,null,"Coincident"]
[null,null,"WEATHER CORRECTED MD 50% POE","MW","Non-coincident"]
[null,null,null,null,"Coincident"]
[null,null,"WEATHER CORRECTED MD 50% POE","MVA","Non-coincident"]
[null,null,null,null,"Coincident"]
[null,"NSP to enter name","CONNECTION POINT RATING","MVA","Non-coincident"]
[null,null,null,null,"Coincident"]
[null,null,"WINTER/SUMMER PEAKING",null,"Non-coincident"]
[null,null,null,null,"Coincident"]
[null,null,"ADJUSTMENTS - EMBEDDED GENERATION","MW","Non-coincident"]
[null,null,null,null,"Coincident"]
[null,null,"WEATHER CORRECTED MD 10% POE","MW","Non-coincident"]
[null,null,null,null,"Coincident"]
[null,null,"WEATHER CORRECTED MD 10% POE","MVA","Non-coincident"]
[null,null,null,null,"Coincident"]
[null,null,"WEATHER CORRECTED MD 50% POE","MW","Non-coincident"]
[null,null,null,null,"Coincident"]
[null,null,"WEATHER CORRECTED MD 50% POE","MVA","Non-coincident"]
[null,null,null,null,"Coincident"]
[null,"NSP to enter name","CONNECTION POINT RATING","MVA","Non-coincident"]
[null,null,null,null,"Coincident"]
[null,null,"WINTER/SUMMER PEAKING",null,"Non-coincident"]
[null,null,null,null,"Coincident"]
[null,null,"ADJUSTMENTS - EMBEDDED GENERATION","MW","Non-coincident"]
[null,null,null,null,"Coincident"]
[null,null,"WEATHER CORRECTED MD 10% POE","MW","Non-coincident"]
[null,null,null,null,"Coincident"]
[null,null,"WEATHER CORRECTED MD 10% POE","MVA","Non-coincident"]
[null,null,null,null,"Coincident"]
[null,null,"WEATHER CORRECTED MD 50% POE","MW","Non-coincident"]
[null,null,null,null,"Coincident"]
[null,null,"WEATHER CORRECTED MD 50% POE","MVA","Non-coincident"]
[null,null,null,null,"Coincident"]
[null,"NSP to enter name","CONNECTION POINT RATING","MVA","Non-coincident"]
[null,null,null,null,"Coincident"]
[null,null,"WINTER/SUMMER PEAKING",null,"Non-coincident"]
[null,null,null,null,"Coincident"]
[null,null,"ADJUSTMENTS - EMBEDDED GENERATION","MW","Non-coincident"]
[null,null,null,null,"Coincident"]
[null,null,"WEATHER CORRECTED MD 10% POE","MW","Non-coincident"]
[null,null,null,null,"Coincident"]
[null,null,"WEATHER CORRECTED MD 10% POE","MVA","Non-coincident"]
[null,null,null,null,"Coincident"]
[null,null,"WEATHER CORRECTED MD 50% POE","MW","Non-coincident"]
[null,null,null,null,"Coincident"]
[null,null,"WEATHER CORRECTED MD 50% POE","MVA","Non-coincident"]
[null,null,null,null,"Coincident"]
[null,"NSP to enter name","CONNECTION POINT RATING","MVA","Non-coincident"]
[null,null,null,null,"Coincident"]
[null,null,"WINTER/SUMMER PEAKING",null,"Non-coincident"]
[null,null,null,null,"Coincident"]
[null,null,"ADJUSTMENTS - EMBEDDED GENERATION","MW","Non-coincident"]
[null,null,null,null,"Coincident"]
[null,null,"WEATHER CORRECTED MD 10% POE","MW","Non-coincident"]
[null,null,null,null,"Coincident"]
[null,null,"WEATHER CORRECTED MD 10% POE","MVA","Non-coincident"]
[null,null,null,null,"Coincident"]
[null,null,"WEATHER CORRECTED MD 50% POE","MW","Non-coincident"]
[null,null,null,null,"Coincident"]
[null,null,"WEATHER CORRECTED MD 50% POE","MVA","Non-coincident"]
[null,null,null,null,"Coincident"]
[null,"NSP to enter name","CONNECTION POINT RATING","MVA","Non-coincident"]
[null,null,null,null,"Coincident"]
[null,null,"WINTER/SUMMER PEAKING",null,"Non-coincident"]
[null,null,null,null,"Coincident"]
[null,null,"ADJUSTMENTS - EMBEDDED GENERATION","MW","Non-coincident"]
[null,null,null,null,"Coincident"]
[null,null,"WEATHER CORRECTED MD 10% POE","MW","Non-coincident"]
[null,null,null,null,"Coincident"]
[null,null,"WEATHER CORRECTED MD 10% POE","MVA","Non-coincident"]
[null,null,null,null,"Coincident"]
[null,null,"WEATHER CORRECTED MD 50% POE","MW","Non-coincident"]
[null,null,null,null,"Coincident"]
[null,null,"WEATHER CORRECTED MD 50% POE","MVA","Non-coincident"]
[null,null,null,null,"Coincident"]
[null,"NSP to enter name","CONNECTION POINT RATING","MVA","Non-coincident"]
[null,null,null,null,"Coincident"]
[null,null,"WINTER/SUMMER PEAKING",null,"Non-coincident"]
[null,null,null,null,"Coincident"]
[null,null,"ADJUSTMENTS - EMBEDDED GENERATION","MW","Non-coincident"]
[null,null,null,null,"Coincident"]
[null,null,"WEATHER CORRECTED MD 10% POE","MW","Non-coincident"]
[null,null,null,null,"Coincident"]
[null,null,"WEATHER CORRECTED MD 10% POE","MVA","Non-coincident"]
[null,null,null,null,"Coincident"]
[null,null,"WEATHER CORRECTED MD 50% POE","MW","Non-coincident"]
[null,null,null,null,"Coincident"]
[null,null,"WEATHER CORRECTED MD 50% POE","MVA","Non-coincident"]
[null,null,null,null,"Coincident"]
[null,"NSP to enter name","CONNECTION POINT RATING","MVA","Non-coincident"]
[null,null,null,null,"Coincident"]
[null,null,"WINTER/SUMMER PEAKING",null,"Non-coincident"]
[null,null,null,null,"Coincident"]
[null,null,"ADJUSTMENTS - EMBEDDED GENERATION","MW","Non-coincident"]
[null,null,null,null,"Coincident"]
[null,null,"WEATHER CORRECTED MD 10% POE","MW","Non-coincident"]
[null,null,null,null,"Coincident"]
[null,null,"WEATHER CORRECTED MD 10% POE","MVA","Non-coincident"]
[null,null,null,null,"Coincident"]
[null,null,"WEATHER CORRECTED MD 50% POE","MW","Non-coincident"]
[null,null,null,null,"Coincident"]
[null,null,"WEATHER CORRECTED MD 50% POE","MVA","Non-coincident"]
[null,null,null,null,"Coincident"]
[null,"NSP to enter name","CONNECTION POINT RATING","MVA","Non-coincident"]
[null,null,null,null,"Coincident"]
[null,null,"WINTER/SUMMER PEAKING",null,"Non-coincident"]
[null,null,null,null,"Coincident"]
[null,null,"ADJUSTMENTS - EMBEDDED GENERATION","MW","Non-coincident"]
[null,null,null,null,"Coincident"]
[null,null,"WEATHER CORRECTED MD 10% POE","MW","Non-coincident"]
[null,null,null,null,"Coincident"]
[null,null,"WEATHER CORRECTED MD 10% POE","MVA","Non-coincident"]
[null,null,null,null,"Coincident"]
[null,null,"WEATHER CORRECTED MD 50% POE","MW","Non-coincident"]
[null,null,null,null,"Coincident"]
[null,null,"WEATHER CORRECTED MD 50% POE","MVA","Non-coincident"]
[null,null,null,null,"Coincident"]
[null,"NSP to enter name","CONNECTION POINT RATING","MVA","Non-coincident"]
[null,null,null,null,"Coincident"]
[null,null,"WINTER/SUMMER PEAKING",null,"Non-coincident"]
[null,null,null,null,"Coincident"]
[null,null,"ADJUSTMENTS - EMBEDDED GENERATION","MW","Non-coincident"]
[null,null,null,null,"Coincident"]
[null,null,"WEATHER CORRECTED MD 10% POE","MW","Non-coincident"]
[null,null,null,null,"Coincident"]
[null,null,"WEATHER CORRECTED MD 10% POE","MVA","Non-coincident"]
[null,null,null,null,"Coincident"]
[null,null,"WEATHER CORRECTED MD 50% POE","MW","Non-coincident"]
[null,null,null,null,"Coincident"]
[null,null,"WEATHER CORRECTED MD 50% POE","MVA","Non-coincident"]
[null,null,null,null,"Coincident"]
[null,"NSP to enter name","CONNECTION POINT RATING","MVA","Non-coincident"]
[null,null,null,null,"Coincident"]
[null,null,"WINTER/SUMMER PEAKING",null,"Non-coincident"]
[null,null,null,null,"Coincident"]
[null,null,"ADJUSTMENTS - EMBEDDED GENERATION","MW","Non-coincident"]
[null,null,null,null,"Coincident"]
[null,null,"WEATHER CORRECTED MD 10% POE","MW","Non-coincident"]
[null,null,null,null,"Coincident"]
[null,null,"WEATHER CORRECTED MD 10% POE","MVA","Non-coincident"]
[null,null,null,null,"Coincident"]
[null,null,"WEATHER CORRECTED MD 50% POE","MW","Non-coincident"]
[null,null,null,null,"Coincident"]
[null,null,"WEATHER CORRECTED MD 50% POE","MVA","Non-coincident"]
[null,null,null,null,"Coincident"]
[null,"NSP to enter name","CONNECTION POINT RATING","MVA","Non-coincident"]
[null,null,null,null,"Coincident"]
[null,null,"WINTER/SUMMER PEAKING",null,"Non-coincident"]
[null,null,null,null,"Coincident"]
[null,null,"ADJUSTMENTS - EMBEDDED GENERATION","MW","Non-coincident"]
[null,null,null,null,"Coincident"]
[null,null,"WEATHER CORRECTED MD 10% POE","MW","Non-coincident"]
[null,null,null,null,"Coincident"]
[null,null,"WEATHER CORRECTED MD 10% POE","MVA","Non-coincident"]
[null,null,null,null,"Coincident"]
[null,null,"WEATHER CORRECTED MD 50% POE","MW","Non-coincident"]
[null,null,null,null,"Coincident"]
[null,null,"WEATHER CORRECTED MD 50% POE","MVA","Non-coincident"]
[null,null,null,null,"Coincident"]
[null,"NSP to enter name","CONNECTION POINT RATING","MVA","Non-coincident"]
[null,null,null,null,"Coincident"]
[null,null,"WINTER/SUMMER PEAKING",null,"Non-coincident"]
[null,null,null,null,"Coincident"]
[null,null,"ADJUSTMENTS - EMBEDDED GENERATION","MW","Non-coincident"]
[null,null,null,null,"Coincident"]
[null,null,"WEATHER CORRECTED MD 10% POE","MW","Non-coincident"]
[null,null,null,null,"Coincident"]
[null,null,"WEATHER CORRECTED MD 10% POE","MVA","Non-coincident"]
[null,null,null,null,"Coincident"]
[null,null,"WEATHER CORRECTED MD 50% POE","MW","Non-coincident"]
[null,null,null,null,"Coincident"]
[null,null,"WEATHER CORRECTED MD 50% POE","MVA","Non-coincident"]
[null,null,null,null,"Coincident"]
[null,"NSP to enter name","CONNECTION POINT RATING","MVA","Non-coincident"]
[null,null,null,null,"Coincident"]
[null,null,"WINTER/SUMMER PEAKING",null,"Non-coincident"]
[null,null,null,null,"Coincident"]
[null,null,"ADJUSTMENTS - EMBEDDED GENERATION","MW","Non-coincident"]
[null,null,null,null,"Coincident"]
[null,null,"WEATHER CORRECTED MD 10% POE","MW","Non-coincident"]
[null,null,null,null,"Coincident"]
[null,null,"WEATHER CORRECTED MD 10% POE","MVA","Non-coincident"]
[null,null,null,null,"Coincident"]
[null,null,"WEATHER CORRECTED MD 50% POE","MW","Non-coincident"]
[null,null,null,null,"Coincident"]
[null,null,"WEATHER CORRECTED MD 50% POE","MVA","Non-coincident"]
[null,null,null,null,"Coincident"]
[null,"NSP to enter name","CONNECTION POINT RATING","MVA","Non-coincident"]
[null,null,null,null,"Coincident"]
[null,null,"WINTER/SUMMER PEAKING",null,"Non-coincident"]
[null,null,null,null,"Coincident"]
[null,null,"ADJUSTMENTS - EMBEDDED GENERATION","MW","Non-coincident"]
[null,null,null,null,"Coincident"]
[null,null,"WEATHER CORRECTED MD 10% POE","MW","Non-coincident"]
[null,null,null,null,"Coincident"]
[null,null,"WEATHER CORRECTED MD 10% POE","MVA","Non-coincident"]
[null,null,null,null,"Coincident"]
[null,null,"WEATHER CORRECTED MD 50% POE","MW","Non-coincident"]
[null,null,null,null,"Coincident"]
[null,null,"WEATHER CORRECTED MD 50% POE","MVA","Non-coincident"]
[null,null,null,null,"Coincident"]
[null,"NSP to enter name","CONNECTION POINT RATING","MVA","Non-coincident"]
[null,null,null,null,"Coincident"]
[null,null,"WINTER/SUMMER PEAKING",null,"Non-coincident"]
[null,null,null,null,"Coincident"]
[null,null,"ADJUSTMENTS - EMBEDDED GENERATION","MW","Non-coincident"]
[null,null,null,null,"Coincident"]
[null,null,"WEATHER CORRECTED MD 10% POE","MW","Non-coincident"]
[null,null,null,null,"Coincident"]
[null,null,"WEATHER CORRECTED MD 10% POE","MVA","Non-coincident"]
[null,null,null,null,"Coincident"]
[null,null,"WEATHER CORRECTED MD 50% POE","MW","Non-coincident"]
[null,null,null,null,"Coincident"]
[null,null,"WEATHER CORRECTED MD 50% POE","MVA","Non-coincident"]
[null,null,null,null,"Coincident"]
[null,"NSP to enter name","CONNECTION POINT RATING","MVA","Non-coincident"]
[null,null,null,null,"Coincident"]
[null,null,"WINTER/SUMMER PEAKING",null,"Non-coincident"]
[null,null,null,null,"Coincident"]
[null,null,"ADJUSTMENTS - EMBEDDED GENERATION","MW","Non-coincident"]
[null,null,null,null,"Coincident"]
[null,null,"WEATHER CORRECTED MD 10% POE","MW","Non-coincident"]
[null,null,null,null,"Coincident"]
[null,null,"WEATHER CORRECTED MD 10% POE","MVA","Non-coincident"]
[null,null,null,null,"Coincident"]
[null,null,"WEATHER CORRECTED MD 50% POE","MW","Non-coincident"]
[null,null,null,null,"Coincident"]
[null,null,"WEATHER CORRECTED MD 50% POE","MVA","Non-coincident"]
[null,null,null,null,"Coincident"]
[null,"NSP to enter name","CONNECTION POINT RATING","MVA","Non-coincident"]
[null,null,null,null,"Coincident"]
[null,null,"WINTER/SUMMER PEAKING",null,"Non-coincident"]
[null,null,null,null,"Coincident"]
[null,null,"ADJUSTMENTS - EMBEDDED GENERATION","MW","Non-coincident"]
[null,null,null,null,"Coincident"]
[null,null,"WEATHER CORRECTED MD 10% POE","MW","Non-coincident"]
[null,null,null,null,"Coincident"]
[null,null,"WEATHER CORRECTED MD 10% POE","MVA","Non-coincident"]
[null,null,null,null,"Coincident"]
[null,null,"WEATHER CORRECTED MD 50% POE","MW","Non-coincident"]
[null,null,null,null,"Coincident"]
[null,null,"WEATHER CORRECTED MD 50% POE","MVA","Non-coincident"]
[null,null,null,null,"Coincident"]
[null,"NSP to enter name","CONNECTION POINT RATING","MVA","Non-coincident"]
[null,null,null,null,"Coincident"]
[null,null,"WINTER/SUMMER PEAKING",null,"Non-coincident"]
[null,null,null,null,"Coincident"]
[null,null,"ADJUSTMENTS - EMBEDDED GENERATION","MW","Non-coincident"]
[null,null,null,null,"Coincident"]
[null,null,"WEATHER CORRECTED MD 10% POE","MW","Non-coincident"]
[null,null,null,null,"Coincident"]
[null,null,"WEATHER CORRECTED MD 10% POE","MVA","Non-coincident"]
[null,null,null,null,"Coincident"]
[null,null,"WEATHER CORRECTED MD 50% POE","MW","Non-coincident"]
[null,null,null,null,"Coincident"]
[null,null,"WEATHER CORRECTED MD 50% POE","MVA","Non-coincident"]
[null,null,null,null,"Coincident"]
[null,"NSP to enter name","CONNECTION POINT RATING","MVA","Non-coincident"]
[null,null,null,null,"Coincident"]
[null,null,"WINTER/SUMMER PEAKING",null,"Non-coincident"]
[null,null,null,null,"Coincident"]
[null,null,"ADJUSTMENTS - EMBEDDED GENERATION","MW","Non-coincident"]
[null,null,null,null,"Coincident"]
[null,null,"WEATHER CORRECTED MD 10% POE","MW","Non-coincident"]
[null,null,null,null,"Coincident"]
[null,null,"WEATHER CORRECTED MD 10% POE","MVA","Non-coincident"]
[null,null,null,null,"Coincident"]
[null,null,"WEATHER CORRECTED MD 50% POE","MW","Non-coincident"]
[null,null,null,null,"Coincident"]
[null,null,"WEATHER CORRECTED MD 50% POE","MVA","Non-coincident"]
[null,null,null,null,"Coincident"]
[null,"NSP to enter name","CONNECTION POINT RATING","MVA","Non-coincident"]
[null,null,null,null,"Coincident"]
[null,null,"WINTER/SUMMER PEAKING",null,"Non-coincident"]
[null,null,null,null,"Coincident"]
[null,null,"ADJUSTMENTS - EMBEDDED GENERATION","MW","Non-coincident"]
[null,null,null,null,"Coincident"]
[null,null,"WEATHER CORRECTED MD 10% POE","MW","Non-coincident"]
[null,null,null,null,"Coincident"]
[null,null,"WEATHER CORRECTED MD 10% POE","MVA","Non-coincident"]
[null,null,null,null,"Coincident"]
[null,null,"WEATHER CORRECTED MD 50% POE","MW","Non-coincident"]
[null,null,null,null,"Coincident"]
[null,null,"WEATHER CORRECTED MD 50% POE","MVA","Non-coincident"]
[null,null,null,null,"Coincident"]
[null,"NSP to enter name","CONNECTION POINT RATING","MVA","Non-coincident"]
[null,null,null,null,"Coincident"]
[null,null,"WINTER/SUMMER PEAKING",null,"Non-coincident"]
[null,null,null,null,"Coincident"]
[null,null,"ADJUSTMENTS - EMBEDDED GENERATION","MW","Non-coincident"]
[null,null,null,null,"Coincident"]
[null,null,"WEATHER CORRECTED MD 10% POE","MW","Non-coincident"]
[null,null,null,null,"Coincident"]
[null,null,"WEATHER CORRECTED MD 10% POE","MVA","Non-coincident"]
[null,null,null,null,"Coincident"]
[null,null,"WEATHER CORRECTED MD 50% POE","MW","Non-coincident"]
[null,null,null,null,"Coincident"]
[null,null,"WEATHER CORRECTED MD 50% POE","MVA","Non-coincident"]
[null,null,null,null,"Coincident"]
[null,"NSP to enter name","CONNECTION POINT RATING","MVA","Non-coincident"]
[null,null,null,null,"Coincident"]
[null,null,"WINTER/SUMMER PEAKING",null,"Non-coincident"]
[null,null,null,null,"Coincident"]
[null,null,"ADJUSTMENTS - EMBEDDED GENERATION","MW","Non-coincident"]
[null,null,null,null,"Coincident"]
[null,null,"WEATHER CORRECTED MD 10% POE","MW","Non-coincident"]
[null,null,null,null,"Coincident"]
[null,null,"WEATHER CORRECTED MD 10% POE","MVA","Non-coincident"]
[null,null,null,null,"Coincident"]
[null,null,"WEATHER CORRECTED MD 50% POE","MW","Non-coincident"]
[null,null,null,null,"Coincident"]
[null,null,"WEATHER CORRECTED MD 50% POE","MVA","Non-coincident"]
[null,null,null,null,"Coincident"]
[null,"NSP to enter name","CONNECTION POINT RATING","MVA","Non-coincident"]
[null,null,null,null,"Coincident"]
[null,null,"WINTER/SUMMER PEAKING",null,"Non-coincident"]
[null,null,null,null,"Coincident"]
[null,null,"ADJUSTMENTS - EMBEDDED GENERATION","MW","Non-coincident"]
[null,null,null,null,"Coincident"]
[null,null,"WEATHER CORRECTED MD 10% POE","MW","Non-coincident"]
[null,null,null,null,"Coincident"]
[null,null,"WEATHER CORRECTED MD 10% POE","MVA","Non-coincident"]
[null,null,null,null,"Coincident"]
[null,null,"WEATHER CORRECTED MD 50% POE","MW","Non-coincident"]
[null,null,null,null,"Coincident"]
[null,null,"WEATHER CORRECTED MD 50% POE","MVA","Non-coincident"]
[null,null,null,null,"Coincident"]
[null,"NSP to enter name","CONNECTION POINT RATING","MVA","Non-coincident"]
[null,null,null,null,"Coincident"]
[null,null,"WINTER/SUMMER PEAKING",null,"Non-coincident"]
[null,null,null,null,"Coincident"]
[null,null,"ADJUSTMENTS - EMBEDDED GENERATION","MW","Non-coincident"]
[null,null,null,null,"Coincident"]
[null,null,"WEATHER CORRECTED MD 10% POE","MW","Non-coincident"]
[null,null,null,null,"Coincident"]
[null,null,"WEATHER CORRECTED MD 10% POE","MVA","Non-coincident"]
[null,null,null,null,"Coincident"]
[null,null,"WEATHER CORRECTED MD 50% POE","MW","Non-coincident"]
[null,null,null,null,"Coincident"]
[null,null,"WEATHER CORRECTED MD 50% POE","MVA","Non-coincident"]
[null,null,null,null,"Coincident"]
[null,"NSP to enter name","CONNECTION POINT RATING","MVA","Non-coincident"]
[null,null,null,null,"Coincident"]
[null,null,"WINTER/SUMMER PEAKING",null,"Non-coincident"]
[null,null,null,null,"Coincident"]
[null,null,"ADJUSTMENTS - EMBEDDED GENERATION","MW","Non-coincident"]
[null,null,null,null,"Coincident"]
[null,null,"WEATHER CORRECTED MD 10% POE","MW","Non-coincident"]
[null,null,null,null,"Coincident"]
[null,null,"WEATHER CORRECTED MD 10% POE","MVA","Non-coincident"]
[null,null,null,null,"Coincident"]
[null,null,"WEATHER CORRECTED MD 50% POE","MW","Non-coincident"]
[null,null,null,null,"Coincident"]
[null,null,"WEATHER CORRECTED MD 50% POE","MVA","Non-coincident"]
[null,null,null,null,"Coincident"]
[null,"NSP to enter name","CONNECTION POINT RATING","MVA","Non-coincident"]
[null,null,null,null,"Coincident"]
[null,null,"WINTER/SUMMER PEAKING",null,"Non-coincident"]
[null,null,null,null,"Coincident"]
[null,null,"ADJUSTMENTS - EMBEDDED GENERATION","MW","Non-coincident"]
[null,null,null,null,"Coincident"]
[null,null,"WEATHER CORRECTED MD 10% POE","MW","Non-coincident"]
[null,null,null,null,"Coincident"]
[null,null,"WEATHER CORRECTED MD 10% POE","MVA","Non-coincident"]
[null,null,null,null,"Coincident"]
[null,null,"WEATHER CORRECTED MD 50% POE","MW","Non-coincident"]
[null,null,null,null,"Coincident"]
[null,null,"WEATHER CORRECTED MD 50% POE","MVA","Non-coincident"]
[null,null,null,null,"Coincident"]
[null,"NSP to enter name","CONNECTION POINT RATING","MVA","Non-coincident"]
[null,null,null,null,"Coincident"]
[null,null,"WINTER/SUMMER PEAKING",null,"Non-coincident"]
[null,null,null,null,"Coincident"]
[null,null,"ADJUSTMENTS - EMBEDDED GENERATION","MW","Non-coincident"]
[null,null,null,null,"Coincident"]
[null,null,"WEATHER CORRECTED MD 10% POE","MW","Non-coincident"]
[null,null,null,null,"Coincident"]
[null,null,"WEATHER CORRECTED MD 10% POE","MVA","Non-coincident"]
[null,null,null,null,"Coincident"]
[null,null,"WEATHER CORRECTED MD 50% POE","MW","Non-coincident"]
[null,null,null,null,"Coincident"]
[null,null,"WEATHER CORRECTED MD 50% POE","MVA","Non-coincident"]
[null,null,null,null,"Coincident"]
[null,"NSP to enter name","CONNECTION POINT RATING","MVA","Non-coincident"]
[null,null,null,null,"Coincident"]
[null,null,"WINTER/SUMMER PEAKING",null,"Non-coincident"]
[null,null,null,null,"Coincident"]
[null,null,"ADJUSTMENTS - EMBEDDED GENERATION","MW","Non-coincident"]
[null,null,null,null,"Coincident"]
[null,null,"WEATHER CORRECTED MD 10% POE","MW","Non-coincident"]
[null,null,null,null,"Coincident"]
[null,null,"WEATHER CORRECTED MD 10% POE","MVA","Non-coincident"]
[null,null,null,null,"Coincident"]
[null,null,"WEATHER CORRECTED MD 50% POE","MW","Non-coincident"]
[null,null,null,null,"Coincident"]
[null,null,"WEATHER CORRECTED MD 50% POE","MVA","Non-coincident"]
[null,null,null,null,"Coincident"]
[null,"NSP to enter name","CONNECTION POINT RATING","MVA","Non-coincident"]
[null,null,null,null,"Coincident"]
[null,null,"WINTER/SUMMER PEAKING",null,"Non-coincident"]
[null,null,null,null,"Coincident"]
[null,null,"ADJUSTMENTS - EMBEDDED GENERATION","MW","Non-coincident"]
[null,null,null,null,"Coincident"]
[null,null,"WEATHER CORRECTED MD 10% POE","MW","Non-coincident"]
[null,null,null,null,"Coincident"]
[null,null,"WEATHER CORRECTED MD 10% POE","MVA","Non-coincident"]
[null,null,null,null,"Coincident"]
[null,null,"WEATHER CORRECTED MD 50% POE","MW","Non-coincident"]
[null,null,null,null,"Coincident"]
[null,null,"WEATHER CORRECTED MD 50% POE","MVA","Non-coincident"]
[null,null,null,null,"Coincident"]
[null,"NSP to enter name","CONNECTION POINT RATING","MVA","Non-coincident"]
[null,null,null,null,"Coincident"]
[null,null,"WINTER/SUMMER PEAKING",null,"Non-coincident"]
[null,null,null,null,"Coincident"]
[null,null,"ADJUSTMENTS - EMBEDDED GENERATION","MW","Non-coincident"]
[null,null,null,null,"Coincident"]
[null,null,"WEATHER CORRECTED MD 10% POE","MW","Non-coincident"]
[null,null,null,null,"Coincident"]
[null,null,"WEATHER CORRECTED MD 10% POE","MVA","Non-coincident"]
[null,null,null,null,"Coincident"]
[null,null,"WEATHER CORRECTED MD 50% POE","MW","Non-coincident"]
[null,null,null,null,"Coincident"]
[null,null,"WEATHER CORRECTED MD 50% POE","MVA","Non-coincident"]
[null,null,null,null,"Coincident"]
[null,"NSP to enter name","CONNECTION POINT RATING","MVA","Non-coincident"]
[null,null,null,null,"Coincident"]
[null,null,"WINTER/SUMMER PEAKING",null,"Non-coincident"]
[null,null,null,null,"Coincident"]
[null,null,"ADJUSTMENTS - EMBEDDED GENERATION","MW","Non-coincident"]
[null,null,null,null,"Coincident"]
[null,null,"WEATHER CORRECTED MD 10% POE","MW","Non-coincident"]
[null,null,null,null,"Coincident"]
[null,null,"WEATHER CORRECTED MD 10% POE","MVA","Non-coincident"]
[null,null,null,null,"Coincident"]
[null,null,"WEATHER CORRECTED MD 50% POE","MW","Non-coincident"]
[null,null,null,null,"Coincident"]
[null,null,"WEATHER CORRECTED MD 50% POE","MVA","Non-coincident"]
[null,null,null,null,"Coincident"]
[null,"NSP to enter name","CONNECTION POINT RATING","MVA","Non-coincident"]
[null,null,null,null,"Coincident"]
[null,null,"WINTER/SUMMER PEAKING",null,"Non-coincident"]
[null,null,null,null,"Coincident"]
[null,null,"ADJUSTMENTS - EMBEDDED GENERATION","MW","Non-coincident"]
[null,null,null,null,"Coincident"]
[null,null,"WEATHER CORRECTED MD 10% POE","MW","Non-coincident"]
[null,null,null,null,"Coincident"]
[null,null,"WEATHER CORRECTED MD 10% POE","MVA","Non-coincident"]
[null,null,null,null,"Coincident"]
[null,null,"WEATHER CORRECTED MD 50% POE","MW","Non-coincident"]
[null,null,null,null,"Coincident"]
[null,null,"WEATHER CORRECTED MD 50% POE","MVA","Non-coincident"]
[null,null,null,null,"Coincident"]
[null,"NSP to enter name","CONNECTION POINT RATING","MVA","Non-coincident"]
[null,null,null,null,"Coincident"]
[null,null,"WINTER/SUMMER PEAKING",null,"Non-coincident"]
[null,null,null,null,"Coincident"]
[null,null,"ADJUSTMENTS - EMBEDDED GENERATION","MW","Non-coincident"]
[null,null,null,null,"Coincident"]
[null,null,"WEATHER CORRECTED MD 10% POE","MW","Non-coincident"]
[null,null,null,null,"Coincident"]
[null,null,"WEATHER CORRECTED MD 10% POE","MVA","Non-coincident"]
[null,null,null,null,"Coincident"]
[null,null,"WEATHER CORRECTED MD 50% POE","MW","Non-coincident"]
[null,null,null,null,"Coincident"]
[null,null,"WEATHER CORRECTED MD 50% POE","MVA","Non-coincident"]
[null,null,null,null,"Coincident"]
[null,"NSP to enter name","CONNECTION POINT RATING","MVA","Non-coincident"]
[null,null,null,null,"Coincident"]
[null,null,"WINTER/SUMMER PEAKING",null,"Non-coincident"]
[null,null,null,null,"Coincident"]
[null,null,"ADJUSTMENTS - EMBEDDED GENERATION","MW","Non-coincident"]
[null,null,null,null,"Coincident"]
[null,null,"WEATHER CORRECTED MD 10% POE","MW","Non-coincident"]
[null,null,null,null,"Coincident"]
[null,null,"WEATHER CORRECTED MD 10% POE","MVA","Non-coincident"]
[null,null,null,null,"Coincident"]
[null,null,"WEATHER CORRECTED MD 50% POE","MW","Non-coincident"]
[null,null,null,null,"Coincident"]
[null,null,"WEATHER CORRECTED MD 50% POE","MVA","Non-coincident"]
[null,null,null,null,"Coincident"]
[null,"NSP to enter name","CONNECTION POINT RATING","MVA","Non-coincident"]
[null,null,null,null,"Coincident"]
[null,null,"WINTER/SUMMER PEAKING",null,"Non-coincident"]
[null,null,null,null,"Coincident"]
[null,null,"ADJUSTMENTS - EMBEDDED GENERATION","MW","Non-coincident"]
[null,null,null,null,"Coincident"]
[null,null,"WEATHER CORRECTED MD 10% POE","MW","Non-coincident"]
[null,null,null,null,"Coincident"]
[null,null,"WEATHER CORRECTED MD 10% POE","MVA","Non-coincident"]
[null,null,null,null,"Coincident"]
[null,null,"WEATHER CORRECTED MD 50% POE","MW","Non-coincident"]
[null,null,null,null,"Coincident"]
[null,null,"WEATHER CORRECTED MD 50% POE","MVA","Non-coincident"]
[null,null,null,null,"Coincident"]
[null,"NSP to enter name","CONNECTION POINT RATING","MVA","Non-coincident"]
[null,null,null,null,"Coincident"]
[null,null,"WINTER/SUMMER PEAKING",null,"Non-coincident"]
[null,null,null,null,"Coincident"]
[null,null,"ADJUSTMENTS - EMBEDDED GENERATION","MW","Non-coincident"]
[null,null,null,null,"Coincident"]
[null,null,"WEATHER CORRECTED MD 10% POE","MW","Non-coincident"]
[null,null,null,null,"Coincident"]
[null,null,"WEATHER CORRECTED MD 10% POE","MVA","Non-coincident"]
[null,null,null,null,"Coincident"]
[null,null,"WEATHER CORRECTED MD 50% POE","MW","Non-coincident"]
[null,null,null,null,"Coincident"]
[null,null,"WEATHER CORRECTED MD 50% POE","MVA","Non-coincident"]
[null,null,null,null,"Coincident"]
[null,"NSP to enter name","CONNECTION POINT RATING","MVA","Non-coincident"]
[null,null,null,null,"Coincident"]
[null,null,"WINTER/SUMMER PEAKING",null,"Non-coincident"]
[null,null,null,null,"Coincident"]
[null,null,"ADJUSTMENTS - EMBEDDED GENERATION","MW","Non-coincident"]
[null,null,null,null,"Coincident"]
[null,null,"WEATHER CORRECTED MD 10% POE","MW","Non-coincident"]
[null,null,null,null,"Coincident"]
[null,null,"WEATHER CORRECTED MD 10% POE","MVA","Non-coincident"]
[null,null,null,null,"Coincident"]
[null,null,"WEATHER CORRECTED MD 50% POE","MW","Non-coincident"]
[null,null,null,null,"Coincident"]
[null,null,"WEATHER CORRECTED MD 50% POE","MVA","Non-coincident"]
[null,null,null,null,"Coincident"]
[null,"NSP to enter name","CONNECTION POINT RATING","MVA","Non-coincident"]
[null,null,null,null,"Coincident"]
[null,null,"WINTER/SUMMER PEAKING",null,"Non-coincident"]
[null,null,null,null,"Coincident"]
[null,null,"ADJUSTMENTS - EMBEDDED GENERATION","MW","Non-coincident"]
[null,null,null,null,"Coincident"]
[null,null,"WEATHER CORRECTED MD 10% POE","MW","Non-coincident"]
[null,null,null,null,"Coincident"]
[null,null,"WEATHER CORRECTED MD 10% POE","MVA","Non-coincident"]
[null,null,null,null,"Coincident"]
[null,null,"WEATHER CORRECTED MD 50% POE","MW","Non-coincident"]
[null,null,null,null,"Coincident"]
[null,null,"WEATHER CORRECTED MD 50% POE","MVA","Non-coincident"]
[null,null,null,null,"Coincident"]
[null,"NSP to enter name","CONNECTION POINT RATING","MVA","Non-coincident"]
[null,null,null,null,"Coincident"]
[null,null,"WINTER/SUMMER PEAKING",null,"Non-coincident"]
[null,null,null,null,"Coincident"]
[null,null,"ADJUSTMENTS - EMBEDDED GENERATION","MW","Non-coincident"]
[null,null,null,null,"Coincident"]
[null,null,"WEATHER CORRECTED MD 10% POE","MW","Non-coincident"]
[null,null,null,null,"Coincident"]
[null,null,"WEATHER CORRECTED MD 10% POE","MVA","Non-coincident"]
[null,null,null,null,"Coincident"]
[null,null,"WEATHER CORRECTED MD 50% POE","MW","Non-coincident"]
[null,null,null,null,"Coincident"]
[null,null,"WEATHER CORRECTED MD 50% POE","MVA","Non-coincident"]
[null,null,null,null,"Coincident"]
[null,"NSP to enter name","CONNECTION POINT RATING","MVA","Non-coincident"]
[null,null,null,null,"Coincident"]
[null,null,"WINTER/SUMMER PEAKING",null,"Non-coincident"]
[null,null,null,null,"Coincident"]
[null,null,"ADJUSTMENTS - EMBEDDED GENERATION","MW","Non-coincident"]
[null,null,null,null,"Coincident"]
[null,null,"WEATHER CORRECTED MD 10% POE","MW","Non-coincident"]
[null,null,null,null,"Coincident"]
[null,null,"WEATHER CORRECTED MD 10% POE","MVA","Non-coincident"]
[null,null,null,null,"Coincident"]
[null,null,"WEATHER CORRECTED MD 50% POE","MW","Non-coincident"]
[null,null,null,null,"Coincident"]
[null,null,"WEATHER CORRECTED MD 50% POE","MVA","Non-coincident"]
[null,null,null,null,"Coincident"]
[null,"NSP to enter name","CONNECTION POINT RATING","MVA","Non-coincident"]
[null,null,null,null,"Coincident"]
[null,null,"WINTER/SUMMER PEAKING",null,"Non-coincident"]
[null,null,null,null,"Coincident"]
[null,null,"ADJUSTMENTS - EMBEDDED GENERATION","MW","Non-coincident"]
[null,null,null,null,"Coincident"]
[null,null,"WEATHER CORRECTED MD 10% POE","MW","Non-coincident"]
[null,null,null,null,"Coincident"]
[null,null,"WEATHER CORRECTED MD 10% POE","MVA","Non-coincident"]
[null,null,null,null,"Coincident"]
[null,null,"WEATHER CORRECTED MD 50% POE","MW","Non-coincident"]
[null,null,null,null,"Coincident"]
[null,null,"WEATHER CORRECTED MD 50% POE","MVA","Non-coincident"]
[null,null,null,null,"Coincident"]
[null,"NSP to enter name","CONNECTION POINT RATING","MVA","Non-coincident"]
[null,null,null,null,"Coincident"]
[null,null,"WINTER/SUMMER PEAKING",null,"Non-coincident"]
[null,null,null,null,"Coincident"]
[null,null,"ADJUSTMENTS - EMBEDDED GENERATION","MW","Non-coincident"]
[null,null,null,null,"Coincident"]
[null,null,"WEATHER CORRECTED MD 10% POE","MW","Non-coincident"]
[null,null,null,null,"Coincident"]
[null,null,"WEATHER CORRECTED MD 10% POE","MVA","Non-coincident"]
[null,null,null,null,"Coincident"]
[null,null,"WEATHER CORRECTED MD 50% POE","MW","Non-coincident"]
[null,null,null,null,"Coincident"]
[null,null,"WEATHER CORRECTED MD 50% POE","MVA","Non-coincident"]
[null,null,null,null,"Coincident"]
[null,"NSP to enter name","CONNECTION POINT RATING","MVA","Non-coincident"]
[null,null,null,null,"Coincident"]
[null,null,"WINTER/SUMMER PEAKING",null,"Non-coincident"]
[null,null,null,null,"Coincident"]
[null,null,"ADJUSTMENTS - EMBEDDED GENERATION","MW","Non-coincident"]
[null,null,null,null,"Coincident"]
[null,null,"WEATHER CORRECTED MD 10% POE","MW","Non-coincident"]
[null,null,null,null,"Coincident"]
[null,null,"WEATHER CORRECTED MD 10% POE","MVA","Non-coincident"]
[null,null,null,null,"Coincident"]
[null,null,"WEATHER CORRECTED MD 50% POE","MW","Non-coincident"]
[null,null,null,null,"Coincident"]
[null,null,"WEATHER CORRECTED MD 50% POE","MVA","Non-coincident"]
[null,null,null,null,"Coincident"]
[null,"NSP to enter name","CONNECTION POINT RATING","MVA","Non-coincident"]
[null,null,null,null,"Coincident"]
[null,null,"WINTER/SUMMER PEAKING",null,"Non-coincident"]
[null,null,null,null,"Coincident"]
[null,null,"ADJUSTMENTS - EMBEDDED GENERATION","MW","Non-coincident"]
[null,null,null,null,"Coincident"]
[null,null,"WEATHER CORRECTED MD 10% POE","MW","Non-coincident"]
[null,null,null,null,"Coincident"]
[null,null,"WEATHER CORRECTED MD 10% POE","MVA","Non-coincident"]
[null,null,null,null,"Coincident"]
[null,null,"WEATHER CORRECTED MD 50% POE","MW","Non-coincident"]
[null,null,null,null,"Coincident"]
[null,null,"WEATHER CORRECTED MD 50% POE","MVA","Non-coincident"]
[null,null,null,null,"Coincident"]
[null,"NSP to enter name","CONNECTION POINT RATING","MVA","Non-coincident"]
[null,null,null,null,"Coincident"]
[null,null,"WINTER/SUMMER PEAKING",null,"Non-coincident"]
[null,null,null,null,"Coincident"]
[null,null,"ADJUSTMENTS - EMBEDDED GENERATION","MW","Non-coincident"]
[null,null,null,null,"Coincident"]
[null,null,"WEATHER CORRECTED MD 10% POE","MW","Non-coincident"]
[null,null,null,null,"Coincident"]
[null,null,"WEATHER CORRECTED MD 10% POE","MVA","Non-coincident"]
[null,null,null,null,"Coincident"]
[null,null,"WEATHER CORRECTED MD 50% POE","MW","Non-coincident"]
[null,null,null,null,"Coincident"]
[null,null,"WEATHER CORRECTED MD 50% POE","MVA","Non-coincident"]
[null,null,null,null,"Coincident"]
[null,"NSP to enter name","CONNECTION POINT RATING","MVA","Non-coincident"]
[null,null,null,null,"Coincident"]
[null,null,"WINTER/SUMMER PEAKING",null,"Non-coincident"]
[null,null,null,null,"Coincident"]
[null,null,"ADJUSTMENTS - EMBEDDED GENERATION","MW","Non-coincident"]
[null,null,null,null,"Coincident"]
[null,null,"WEATHER CORRECTED MD 10% POE","MW","Non-coincident"]
[null,null,null,null,"Coincident"]
[null,null,"WEATHER CORRECTED MD 10% POE","MVA","Non-coincident"]
[null,null,null,null,"Coincident"]
[null,null,"WEATHER CORRECTED MD 50% POE","MW","Non-coincident"]
[null,null,null,null,"Coincident"]
[null,null,"WEATHER CORRECTED MD 50% POE","MVA","Non-coincident"]
[null,null,null,null,"Coincident"]
[null,"NSP to enter name","CONNECTION POINT RATING","MVA","Non-coincident"]
[null,null,null,null,"Coincident"]
[null,null,"WINTER/SUMMER PEAKING",null,"Non-coincident"]
[null,null,null,null,"Coincident"]
[null,null,"ADJUSTMENTS - EMBEDDED GENERATION","MW","Non-coincident"]
[null,null,null,null,"Coincident"]
[null,null,"WEATHER CORRECTED MD 10% POE","MW","Non-coincident"]
[null,null,null,null,"Coincident"]
[null,null,"WEATHER CORRECTED MD 10% POE","MVA","Non-coincident"]
[null,null,null,null,"Coincident"]
[null,null,"WEATHER CORRECTED MD 50% POE","MW","Non-coincident"]
[null,null,null,null,"Coincident"]
[null,null,"WEATHER CORRECTED MD 50% POE","MVA","Non-coincident"]
[null,null,null,null,"Coincident"]
[null,"NSP to enter name","CONNECTION POINT RATING","MVA","Non-coincident"]
[null,null,null,null,"Coincident"]
[null,null,"WINTER/SUMMER PEAKING",null,"Non-coincident"]
[null,null,null,null,"Coincident"]
[null,null,"ADJUSTMENTS - EMBEDDED GENERATION","MW","Non-coincident"]
[null,null,null,null,"Coincident"]
[null,null,"WEATHER CORRECTED MD 10% POE","MW","Non-coincident"]
[null,null,null,null,"Coincident"]
[null,null,"WEATHER CORRECTED MD 10% POE","MVA","Non-coincident"]
[null,null,null,null,"Coincident"]
[null,null,"WEATHER CORRECTED MD 50% POE","MW","Non-coincident"]
[null,null,null,null,"Coincident"]
[null,null,"WEATHER CORRECTED MD 50% POE","MVA","Non-coincident"]
[null,null,null,null,"Coincident"]
[null,"NSP to enter name","CONNECTION POINT RATING","MVA","Non-coincident"]
[null,null,null,null,"Coincident"]
[null,null,"WINTER/SUMMER PEAKING",null,"Non-coincident"]
[null,null,null,null,"Coincident"]
[null,null,"ADJUSTMENTS - EMBEDDED GENERATION","MW","Non-coincident"]
[null,null,null,null,"Coincident"]
[null,null,"WEATHER CORRECTED MD 10% POE","MW","Non-coincident"]
[null,null,null,null,"Coincident"]
[null,null,"WEATHER CORRECTED MD 10% POE","MVA","Non-coincident"]
[null,null,null,null,"Coincident"]
[null,null,"WEATHER CORRECTED MD 50% POE","MW","Non-coincident"]
[null,null,null,null,"Coincident"]
[null,null,"WEATHER CORRECTED MD 50% POE","MVA","Non-coincident"]
[null,null,null,null,"Coincident"]
[null,"NSP to enter name","CONNECTION POINT RATING","MVA","Non-coincident"]
[null,null,null,null,"Coincident"]
[null,null,"WINTER/SUMMER PEAKING",null,"Non-coincident"]
[null,null,null,null,"Coincident"]
[null,null,"ADJUSTMENTS - EMBEDDED GENERATION","MW","Non-coincident"]
[null,null,null,null,"Coincident"]
[null,null,"WEATHER CORRECTED MD 10% POE","MW","Non-coincident"]
[null,null,null,null,"Coincident"]
[null,null,"WEATHER CORRECTED MD 10% POE","MVA","Non-coincident"]
[null,null,null,null,"Coincident"]
[null,null,"WEATHER CORRECTED MD 50% POE","MW","Non-coincident"]
[null,null,null,null,"Coincident"]
[null,null,"WEATHER CORRECTED MD 50% POE","MVA","Non-coincident"]
[null,null,null,null,"Coincident"]
[null,"NSP to enter name","CONNECTION POINT RATING","MVA","Non-coincident"]
[null,null,null,null,"Coincident"]
[null,null,"WINTER/SUMMER PEAKING",null,"Non-coincident"]
[null,null,null,null,"Coincident"]
[null,null,"ADJUSTMENTS - EMBEDDED GENERATION","MW","Non-coincident"]
[null,null,null,null,"Coincident"]
[null,null,"WEATHER CORRECTED MD 10% POE","MW","Non-coincident"]
[null,null,null,null,"Coincident"]
[null,null,"WEATHER CORRECTED MD 10% POE","MVA","Non-coincident"]
[null,null,null,null,"Coincident"]
[null,null,"WEATHER CORRECTED MD 50% POE","MW","Non-coincident"]
[null,null,null,null,"Coincident"]
[null,null,"WEATHER CORRECTED MD 50% POE","MVA","Non-coincident"]
[null,null,null,null,"Coincident"]
[null,"NSP to enter name","CONNECTION POINT RATING","MVA","Non-coincident"]
[null,null,null,null,"Coincident"]
[null,null,"WINTER/SUMMER PEAKING",null,"Non-coincident"]
[null,null,null,null,"Coincident"]
[null,null,"ADJUSTMENTS - EMBEDDED GENERATION","MW","Non-coincident"]
[null,null,null,null,"Coincident"]
[null,null,"WEATHER CORRECTED MD 10% POE","MW","Non-coincident"]
[null,null,null,null,"Coincident"]
[null,null,"WEATHER CORRECTED MD 10% POE","MVA","Non-coincident"]
[null,null,null,null,"Coincident"]
[null,null,"WEATHER CORRECTED MD 50% POE","MW","Non-coincident"]
[null,null,null,null,"Coincident"]
[null,null,"WEATHER CORRECTED MD 50% POE","MVA","Non-coincident"]
[null,null,null,null,"Coincident"]
[null,"NSP to enter name","CONNECTION POINT RATING","MVA","Non-coincident"]
[null,null,null,null,"Coincident"]
[null,null,"WINTER/SUMMER PEAKING",null,"Non-coincident"]
[null,null,null,null,"Coincident"]
[null,null,"ADJUSTMENTS - EMBEDDED GENERATION","MW","Non-coincident"]
[null,null,null,null,"Coincident"]
[null,null,"WEATHER CORRECTED MD 10% POE","MW","Non-coincident"]
[null,null,null,null,"Coincident"]
[null,null,"WEATHER CORRECTED MD 10% POE","MVA","Non-coincident"]
[null,null,null,null,"Coincident"]
[null,null,"WEATHER CORRECTED MD 50% POE","MW","Non-coincident"]
[null,null,null,null,"Coincident"]
[null,null,"WEATHER CORRECTED MD 50% POE","MVA","Non-coincident"]
[null,null,null,null,"Coincident"]
[null,"NSP to enter name","CONNECTION POINT RATING","MVA","Non-coincident"]
[null,null,null,null,"Coincident"]
[null,null,"WINTER/SUMMER PEAKING",null,"Non-coincident"]
[null,null,null,null,"Coincident"]
[null,null,"ADJUSTMENTS - EMBEDDED GENERATION","MW","Non-coincident"]
[null,null,null,null,"Coincident"]
[null,null,"WEATHER CORRECTED MD 10% POE","MW","Non-coincident"]
[null,null,null,null,"Coincident"]
[null,null,"WEATHER CORRECTED MD 10% POE","MVA","Non-coincident"]
[null,null,null,null,"Coincident"]
[null,null,"WEATHER CORRECTED MD 50% POE","MW","Non-coincident"]
[null,null,null,null,"Coincident"]
[null,null,"WEATHER CORRECTED MD 50% POE","MVA","Non-coincident"]
[null,null,null,null,"Coincident"]
[null,"NSP to enter name","CONNECTION POINT RATING","MVA","Non-coincident"]
[null,null,null,null,"Coincident"]
[null,null,"WINTER/SUMMER PEAKING",null,"Non-coincident"]
[null,null,null,null,"Coincident"]
[null,null,"ADJUSTMENTS - EMBEDDED GENERATION","MW","Non-coincident"]
[null,null,null,null,"Coincident"]
[null,null,"WEATHER CORRECTED MD 10% POE","MW","Non-coincident"]
[null,null,null,null,"Coincident"]
[null,null,"WEATHER CORRECTED MD 10% POE","MVA","Non-coincident"]
[null,null,null,null,"Coincident"]
[null,null,"WEATHER CORRECTED MD 50% POE","MW","Non-coincident"]
[null,null,null,null,"Coincident"]
[null,null,"WEATHER CORRECTED MD 50% POE","MVA","Non-coincident"]
[null,null,null,null,"Coincident"]
[null,"NSP to enter name","CONNECTION POINT RATING","MVA","Non-coincident"]
[null,null,null,null,"Coincident"]
[null,null,"WINTER/SUMMER PEAKING",null,"Non-coincident"]
[null,null,null,null,"Coincident"]
[null,null,"ADJUSTMENTS - EMBEDDED GENERATION","MW","Non-coincident"]
[null,null,null,null,"Coincident"]
[null,null,"WEATHER CORRECTED MD 10% POE","MW","Non-coincident"]
[null,null,null,null,"Coincident"]
[null,null,"WEATHER CORRECTED MD 10% POE","MVA","Non-coincident"]
[null,null,null,null,"Coincident"]
[null,null,"WEATHER CORRECTED MD 50% POE","MW","Non-coincident"]
[null,null,null,null,"Coincident"]
[null,null,"WEATHER CORRECTED MD 50% POE","MVA","Non-coincident"]
[null,null,null,null,"Coincident"]
[null,"NSP to enter name","CONNECTION POINT RATING","MVA","Non-coincident"]
[null,null,null,null,"Coincident"]
[null,null,"WINTER/SUMMER PEAKING",null,"Non-coincident"]
[null,null,null,null,"Coincident"]
[null,null,"ADJUSTMENTS - EMBEDDED GENERATION","MW","Non-coincident"]
[null,null,null,null,"Coincident"]
[null,null,"WEATHER CORRECTED MD 10% POE","MW","Non-coincident"]
[null,null,null,null,"Coincident"]
[null,null,"WEATHER CORRECTED MD 10% POE","MVA","Non-coincident"]
[null,null,null,null,"Coincident"]
[null,null,"WEATHER CORRECTED MD 50% POE","MW","Non-coincident"]
[null,null,null,null,"Coincident"]
[null,null,"WEATHER CORRECTED MD 50% POE","MVA","Non-coincident"]
[null,null,null,null,"Coincident"]
[null,"NSP to enter name","CONNECTION POINT RATING","MVA","Non-coincident"]
[null,null,null,null,"Coincident"]
[null,null,"WINTER/SUMMER PEAKING",null,"Non-coincident"]
[null,null,null,null,"Coincident"]
[null,null,"ADJUSTMENTS - EMBEDDED GENERATION","MW","Non-coincident"]
[null,null,null,null,"Coincident"]
[null,null,"WEATHER CORRECTED MD 10% POE","MW","Non-coincident"]
[null,null,null,null,"Coincident"]
[null,null,"WEATHER CORRECTED MD 10% POE","MVA","Non-coincident"]
[null,null,null,null,"Coincident"]
[null,null,"WEATHER CORRECTED MD 50% POE","MW","Non-coincident"]
[null,null,null,null,"Coincident"]
[null,null,"WEATHER CORRECTED MD 50% POE","MVA","Non-coincident"]
[null,null,null,null,"Coincident"]
[null,"NSP to enter name","CONNECTION POINT RATING","MVA","Non-coincident"]
[null,null,null,null,"Coincident"]
[null,null,"WINTER/SUMMER PEAKING",null,"Non-coincident"]
[null,null,null,null,"Coincident"]
[null,null,"ADJUSTMENTS - EMBEDDED GENERATION","MW","Non-coincident"]
[null,null,null,null,"Coincident"]
[null,null,"WEATHER CORRECTED MD 10% POE","MW","Non-coincident"]
[null,null,null,null,"Coincident"]
[null,null,"WEATHER CORRECTED MD 10% POE","MVA","Non-coincident"]
[null,null,null,null,"Coincident"]
[null,null,"WEATHER CORRECTED MD 50% POE","MW","Non-coincident"]
[null,null,null,null,"Coincident"]
[null,null,"WEATHER CORRECTED MD 50% POE","MVA","Non-coincident"]
[null,null,null,null,"Coincident"]
[null,"NSP to enter name","CONNECTION POINT RATING","MVA","Non-coincident"]
[null,null,null,null,"Coincident"]
[null,null,"WINTER/SUMMER PEAKING",null,"Non-coincident"]
[null,null,null,null,"Coincident"]
[null,null,"ADJUSTMENTS - EMBEDDED GENERATION","MW","Non-coincident"]
[null,null,null,null,"Coincident"]
[null,null,"WEATHER CORRECTED MD 10% POE","MW","Non-coincident"]
[null,null,null,null,"Coincident"]
[null,null,"WEATHER CORRECTED MD 10% POE","MVA","Non-coincident"]
[null,null,null,null,"Coincident"]
[null,null,"WEATHER CORRECTED MD 50% POE","MW","Non-coincident"]
[null,null,null,null,"Coincident"]
[null,null,"WEATHER CORRECTED MD 50% POE","MVA","Non-coincident"]
[null,null,null,null,"Coincident"]
[null,"NSP to enter name","CONNECTION POINT RATING","MVA","Non-coincident"]
[null,null,null,null,"Coincident"]
[null,null,"WINTER/SUMMER PEAKING",null,"Non-coincident"]
[null,null,null,null,"Coincident"]
[null,null,"ADJUSTMENTS - EMBEDDED GENERATION","MW","Non-coincident"]
[null,null,null,null,"Coincident"]
[null,null,"WEATHER CORRECTED MD 10% POE","MW","Non-coincident"]
[null,null,null,null,"Coincident"]
[null,null,"WEATHER CORRECTED MD 10% POE","MVA","Non-coincident"]
[null,null,null,null,"Coincident"]
[null,null,"WEATHER CORRECTED MD 50% POE","MW","Non-coincident"]
[null,null,null,null,"Coincident"]
[null,null,"WEATHER CORRECTED MD 50% POE","MVA","Non-coincident"]
[null,null,null,null,"Coincident"]
[null,"NSP to enter name","CONNECTION POINT RATING","MVA","Non-coincident"]
[null,null,null,null,"Coincident"]
[null,null,"WINTER/SUMMER PEAKING",null,"Non-coincident"]
[null,null,null,null,"Coincident"]
[null,null,"ADJUSTMENTS - EMBEDDED GENERATION","MW","Non-coincident"]
[null,null,null,null,"Coincident"]
[null,null,"WEATHER CORRECTED MD 10% POE","MW","Non-coincident"]
[null,null,null,null,"Coincident"]
[null,null,"WEATHER CORRECTED MD 10% POE","MVA","Non-coincident"]
[null,null,null,null,"Coincident"]
[null,null,"WEATHER CORRECTED MD 50% POE","MW","Non-coincident"]
[null,null,null,null,"Coincident"]
[null,null,"WEATHER CORRECTED MD 50% POE","MVA","Non-coincident"]
[null,null,null,null,"Coincident"]
[null,"NSP to enter name","CONNECTION POINT RATING","MVA","Non-coincident"]
[null,null,null,null,"Coincident"]
[null,null,"WINTER/SUMMER PEAKING",null,"Non-coincident"]
[null,null,null,null,"Coincident"]
[null,null,"ADJUSTMENTS - EMBEDDED GENERATION","MW","Non-coincident"]
[null,null,null,null,"Coincident"]
[null,null,"WEATHER CORRECTED MD 10% POE","MW","Non-coincident"]
[null,null,null,null,"Coincident"]
[null,null,"WEATHER CORRECTED MD 10% POE","MVA","Non-coincident"]
[null,null,null,null,"Coincident"]
[null,null,"WEATHER CORRECTED MD 50% POE","MW","Non-coincident"]
[null,null,null,null,"Coincident"]
[null,null,"WEATHER CORRECTED MD 50% POE","MVA","Non-coincident"]
[null,null,null,null,"Coincident"]
[null,"NSP to enter name","CONNECTION POINT RATING","MVA","Non-coincident"]
[null,null,null,null,"Coincident"]
[null,null,"WINTER/SUMMER PEAKING",null,"Non-coincident"]
[null,null,null,null,"Coincident"]
[null,null,"ADJUSTMENTS - EMBEDDED GENERATION","MW","Non-coincident"]
[null,null,null,null,"Coincident"]
[null,null,"WEATHER CORRECTED MD 10% POE","MW","Non-coincident"]
[null,null,null,null,"Coincident"]
[null,null,"WEATHER CORRECTED MD 10% POE","MVA","Non-coincident"]
[null,null,null,null,"Coincident"]
[null,null,"WEATHER CORRECTED MD 50% POE","MW","Non-coincident"]
[null,null,null,null,"Coincident"]
[null,null,"WEATHER CORRECTED MD 50% POE","MVA","Non-coincident"]
[null,null,null,null,"Coincident"]
[null,"NSP to enter name","CONNECTION POINT RATING","MVA","Non-coincident"]
[null,null,null,null,"Coincident"]
[null,null,"WINTER/SUMMER PEAKING",null,"Non-coincident"]
[null,null,null,null,"Coincident"]
[null,null,"ADJUSTMENTS - EMBEDDED GENERATION","MW","Non-coincident"]
[null,null,null,null,"Coincident"]
[null,null,"WEATHER CORRECTED MD 10% POE","MW","Non-coincident"]
[null,null,null,null,"Coincident"]
[null,null,"WEATHER CORRECTED MD 10% POE","MVA","Non-coincident"]
[null,null,null,null,"Coincident"]
[null,null,"WEATHER CORRECTED MD 50% POE","MW","Non-coincident"]
[null,null,null,null,"Coincident"]
[null,null,"WEATHER CORRECTED MD 50% POE","MVA","Non-coincident"]
[null,null,null,null,"Coincident"]
[null,"NSP to enter name","CONNECTION POINT RATING","MVA","Non-coincident"]
[null,null,null,null,"Coincident"]
[null,null,"WINTER/SUMMER PEAKING",null,"Non-coincident"]
[null,null,null,null,"Coincident"]
[null,null,"ADJUSTMENTS - EMBEDDED GENERATION","MW","Non-coincident"]
[null,null,null,null,"Coincident"]
[null,null,"WEATHER CORRECTED MD 10% POE","MW","Non-coincident"]
[null,null,null,null,"Coincident"]
[null,null,"WEATHER CORRECTED MD 10% POE","MVA","Non-coincident"]
[null,null,null,null,"Coincident"]
[null,null,"WEATHER CORRECTED MD 50% POE","MW","Non-coincident"]
[null,null,null,null,"Coincident"]
[null,null,"WEATHER CORRECTED MD 50% POE","MVA","Non-coincident"]
[null,null,null,null,"Coincident"]
[null,"NSP to enter name","CONNECTION POINT RATING","MVA","Non-coincident"]
[null,null,null,null,"Coincident"]
[null,null,"WINTER/SUMMER PEAKING",null,"Non-coincident"]
[null,null,null,null,"Coincident"]
[null,null,"ADJUSTMENTS - EMBEDDED GENERATION","MW","Non-coincident"]
[null,null,null,null,"Coincident"]
[null,null,"WEATHER CORRECTED MD 10% POE","MW","Non-coincident"]
[null,null,null,null,"Coincident"]
[null,null,"WEATHER CORRECTED MD 10% POE","MVA","Non-coincident"]
[null,null,null,null,"Coincident"]
[null,null,"WEATHER CORRECTED MD 50% POE","MW","Non-coincident"]
[null,null,null,null,"Coincident"]
[null,null,"WEATHER CORRECTED MD 50% POE","MVA","Non-coincident"]
[null,null,null,null,"Coincident"]
[null,"NSP to enter name","CONNECTION POINT RATING","MVA","Non-coincident"]
[null,null,null,null,"Coincident"]
[null,null,"WINTER/SUMMER PEAKING",null,"Non-coincident"]
[null,null,null,null,"Coincident"]
[null,null,"ADJUSTMENTS - EMBEDDED GENERATION","MW","Non-coincident"]
[null,null,null,null,"Coincident"]
[null,null,"WEATHER CORRECTED MD 10% POE","MW","Non-coincident"]
[null,null,null,null,"Coincident"]
[null,null,"WEATHER CORRECTED MD 10% POE","MVA","Non-coincident"]
[null,null,null,null,"Coincident"]
[null,null,"WEATHER CORRECTED MD 50% POE","MW","Non-coincident"]
[null,null,null,null,"Coincident"]
[null,null,"WEATHER CORRECTED MD 50% POE","MVA","Non-coincident"]
[null,null,null,null,"Coincident"]
[null,"NSP to enter name","CONNECTION POINT RATING","MVA","Non-coincident"]
[null,null,null,null,"Coincident"]
[null,null,"WINTER/SUMMER PEAKING",null,"Non-coincident"]
[null,null,null,null,"Coincident"]
[null,null,"ADJUSTMENTS - EMBEDDED GENERATION","MW","Non-coincident"]
[null,null,null,null,"Coincident"]
[null,null,"WEATHER CORRECTED MD 10% POE","MW","Non-coincident"]
[null,null,null,null,"Coincident"]
[null,null,"WEATHER CORRECTED MD 10% POE","MVA","Non-coincident"]
[null,null,null,null,"Coincident"]
[null,null,"WEATHER CORRECTED MD 50% POE","MW","Non-coincident"]
[null,null,null,null,"Coincident"]
[null,null,"WEATHER CORRECTED MD 50% POE","MVA","Non-coincident"]
[null,null,null,null,"Coincident"]
[null,"NSP to enter name","CONNECTION POINT RATING","MVA","Non-coincident"]
[null,null,null,null,"Coincident"]
[null,null,"WINTER/SUMMER PEAKING",null,"Non-coincident"]
[null,null,null,null,"Coincident"]
[null,null,"ADJUSTMENTS - EMBEDDED GENERATION","MW","Non-coincident"]
[null,null,null,null,"Coincident"]
[null,null,"WEATHER CORRECTED MD 10% POE","MW","Non-coincident"]
[null,null,null,null,"Coincident"]
[null,null,"WEATHER CORRECTED MD 10% POE","MVA","Non-coincident"]
[null,null,null,null,"Coincident"]
[null,null,"WEATHER CORRECTED MD 50% POE","MW","Non-coincident"]
[null,null,null,null,"Coincident"]
[null,null,"WEATHER CORRECTED MD 50% POE","MVA","Non-coincident"]
[null,null,null,null,"Coincident"]
[null,"NSP to enter name","CONNECTION POINT RATING","MVA","Non-coincident"]
[null,null,null,null,"Coincident"]
[null,null,"WINTER/SUMMER PEAKING",null,"Non-coincident"]
[null,null,null,null,"Coincident"]
[null,null,"ADJUSTMENTS - EMBEDDED GENERATION","MW","Non-coincident"]
[null,null,null,null,"Coincident"]
[null,null,"WEATHER CORRECTED MD 10% POE","MW","Non-coincident"]
[null,null,null,null,"Coincident"]
[null,null,"WEATHER CORRECTED MD 10% POE","MVA","Non-coincident"]
[null,null,null,null,"Coincident"]
[null,null,"WEATHER CORRECTED MD 50% POE","MW","Non-coincident"]
[null,null,null,null,"Coincident"]
[null,null,"WEATHER CORRECTED MD 50% POE","MVA","Non-coincident"]
[null,null,null,null,"Coincident"]
[null,"NSP to enter name","CONNECTION POINT RATING","MVA","Non-coincident"]
[null,null,null,null,"Coincident"]
[null,null,"WINTER/SUMMER PEAKING",null,"Non-coincident"]
[null,null,null,null,"Coincident"]
[null,null,"ADJUSTMENTS - EMBEDDED GENERATION","MW","Non-coincident"]
[null,null,null,null,"Coincident"]
[null,null,"WEATHER CORRECTED MD 10% POE","MW","Non-coincident"]
[null,null,null,null,"Coincident"]
[null,null,"WEATHER CORRECTED MD 10% POE","MVA","Non-coincident"]
[null,null,null,null,"Coincident"]
[null,null,"WEATHER CORRECTED MD 50% POE","MW","Non-coincident"]
[null,null,null,null,"Coincident"]
[null,null,"WEATHER CORRECTED MD 50% POE","MVA","Non-coincident"]
[null,null,null,null,"Coincident"]
[null,"NSP to enter name","CONNECTION POINT RATING","MVA","Non-coincident"]
[null,null,null,null,"Coincident"]
[null,null,"WINTER/SUMMER PEAKING",null,"Non-coincident"]
[null,null,null,null,"Coincident"]
[null,null,"ADJUSTMENTS - EMBEDDED GENERATION","MW","Non-coincident"]
[null,null,null,null,"Coincident"]
[null,null,"WEATHER CORRECTED MD 10% POE","MW","Non-coincident"]
[null,null,null,null,"Coincident"]
[null,null,"WEATHER CORRECTED MD 10% POE","MVA","Non-coincident"]
[null,null,null,null,"Coincident"]
[null,null,"WEATHER CORRECTED MD 50% POE","MW","Non-coincident"]
[null,null,null,null,"Coincident"]
[null,null,"WEATHER CORRECTED MD 50% POE","MVA","Non-coincident"]
[null,null,null,null,"Coincident"]
[null,"NSP to enter name","CONNECTION POINT RATING","MVA","Non-coincident"]
[null,null,null,null,"Coincident"]
[null,null,"WINTER/SUMMER PEAKING",null,"Non-coincident"]
[null,null,null,null,"Coincident"]
[null,null,"ADJUSTMENTS - EMBEDDED GENERATION","MW","Non-coincident"]
[null,null,null,null,"Coincident"]
[null,null,"WEATHER CORRECTED MD 10% POE","MW","Non-coincident"]
[null,null,null,null,"Coincident"]
[null,null,"WEATHER CORRECTED MD 10% POE","MVA","Non-coincident"]
[null,null,null,null,"Coincident"]
[null,null,"WEATHER CORRECTED MD 50% POE","MW","Non-coincident"]
[null,null,null,null,"Coincident"]
[null,null,"WEATHER CORRECTED MD 50% POE","MVA","Non-coincident"]
[null,null,null,null,"Coincident"]
[null,"NSP to enter name","CONNECTION POINT RATING","MVA","Non-coincident"]
[null,null,null,null,"Coincident"]
[null,null,"WINTER/SUMMER PEAKING",null,"Non-coincident"]
[null,null,null,null,"Coincident"]
[null,null,"ADJUSTMENTS - EMBEDDED GENERATION","MW","Non-coincident"]
[null,null,null,null,"Coincident"]
[null,null,"WEATHER CORRECTED MD 10% POE","MW","Non-coincident"]
[null,null,null,null,"Coincident"]
[null,null,"WEATHER CORRECTED MD 10% POE","MVA","Non-coincident"]
[null,null,null,null,"Coincident"]
[null,null,"WEATHER CORRECTED MD 50% POE","MW","Non-coincident"]
[null,null,null,null,"Coincident"]
[null,null,"WEATHER CORRECTED MD 50% POE","MVA","Non-coincident"]
[null,null,null,null,"Coincident"]
[null,"NSP to enter name","CONNECTION POINT RATING","MVA","Non-coincident"]
[null,null,null,null,"Coincident"]
[null,null,"WINTER/SUMMER PEAKING",null,"Non-coincident"]
[null,null,null,null,"Coincident"]
[null,null,"ADJUSTMENTS - EMBEDDED GENERATION","MW","Non-coincident"]
[null,null,null,null,"Coincident"]
[null,null,"WEATHER CORRECTED MD 10% POE","MW","Non-coincident"]
[null,null,null,null,"Coincident"]
[null,null,"WEATHER CORRECTED MD 10% POE","MVA","Non-coincident"]
[null,null,null,null,"Coincident"]
[null,null,"WEATHER CORRECTED MD 50% POE","MW","Non-coincident"]
[null,null,null,null,"Coincident"]
[null,null,"WEATHER CORRECTED MD 50% POE","MVA","Non-coincident"]
[null,null,null,null,"Coincident"]
[null,"NSP to enter name","CONNECTION POINT RATING","MVA","Non-coincident"]
[null,null,null,null,"Coincident"]
[null,null,"WINTER/SUMMER PEAKING",null,"Non-coincident"]
[null,null,null,null,"Coincident"]
[null,null,"ADJUSTMENTS - EMBEDDED GENERATION","MW","Non-coincident"]
[null,null,null,null,"Coincident"]
[null,null,"WEATHER CORRECTED MD 10% POE","MW","Non-coincident"]
[null,null,null,null,"Coincident"]
[null,null,"WEATHER CORRECTED MD 10% POE","MVA","Non-coincident"]
[null,null,null,null,"Coincident"]
[null,null,"WEATHER CORRECTED MD 50% POE","MW","Non-coincident"]
[null,null,null,null,"Coincident"]
[null,null,"WEATHER CORRECTED MD 50% POE","MVA","Non-coincident"]
[null,null,null,null,"Coincident"]
[null,"NSP to enter name","CONNECTION POINT RATING","MVA","Non-coincident"]
[null,null,null,null,"Coincident"]
[null,null,"WINTER/SUMMER PEAKING",null,"Non-coincident"]
[null,null,null,null,"Coincident"]
[null,null,"ADJUSTMENTS - EMBEDDED GENERATION","MW","Non-coincident"]
[null,null,null,null,"Coincident"]
[null,null,"WEATHER CORRECTED MD 10% POE","MW","Non-coincident"]
[null,null,null,null,"Coincident"]
[null,null,"WEATHER CORRECTED MD 10% POE","MVA","Non-coincident"]
[null,null,null,null,"Coincident"]
[null,null,"WEATHER CORRECTED MD 50% POE","MW","Non-coincident"]
[null,null,null,null,"Coincident"]
[null,null,"WEATHER CORRECTED MD 50% POE","MVA","Non-coincident"]
[null,null,null,null,"Coincident"]
[null,"NSP to enter name","CONNECTION POINT RATING","MVA","Non-coincident"]
[null,null,null,null,"Coincident"]
[null,null,"WINTER/SUMMER PEAKING",null,"Non-coincident"]
[null,null,null,null,"Coincident"]
[null,null,"ADJUSTMENTS - EMBEDDED GENERATION","MW","Non-coincident"]
[null,null,null,null,"Coincident"]
[null,null,"WEATHER CORRECTED MD 10% POE","MW","Non-coincident"]
[null,null,null,null,"Coincident"]
[null,null,"WEATHER CORRECTED MD 10% POE","MVA","Non-coincident"]
[null,null,null,null,"Coincident"]
[null,null,"WEATHER CORRECTED MD 50% POE","MW","Non-coincident"]
[null,null,null,null,"Coincident"]
[null,null,"WEATHER CORRECTED MD 50% POE","MVA","Non-coincident"]
[null,null,null,null,"Coincident"]
[null,"NSP to enter name","CONNECTION POINT RATING","MVA","Non-coincident"]
[null,null,null,null,"Coincident"]
[null,null,"WINTER/SUMMER PEAKING",null,"Non-coincident"]
[null,null,null,null,"Coincident"]
[null,null,"ADJUSTMENTS - EMBEDDED GENERATION","MW","Non-coincident"]
[null,null,null,null,"Coincident"]
[null,null,"WEATHER CORRECTED MD 10% POE","MW","Non-coincident"]
[null,null,null,null,"Coincident"]
[null,null,"WEATHER CORRECTED MD 10% POE","MVA","Non-coincident"]
[null,null,null,null,"Coincident"]
[null,null,"WEATHER CORRECTED MD 50% POE","MW","Non-coincident"]
[null,null,null,null,"Coincident"]
[null,null,"WEATHER CORRECTED MD 50% POE","MVA","Non-coincident"]
[null,null,null,null,"Coincident"]
[null,"NSP to enter name","CONNECTION POINT RATING","MVA","Non-coincident"]
[null,null,null,null,"Coincident"]
[null,null,"WINTER/SUMMER PEAKING",null,"Non-coincident"]
[null,null,null,null,"Coincident"]
[null,null,"ADJUSTMENTS - EMBEDDED GENERATION","MW","Non-coincident"]
[null,null,null,null,"Coincident"]
[null,null,"WEATHER CORRECTED MD 10% POE","MW","Non-coincident"]
[null,null,null,null,"Coincident"]
[null,null,"WEATHER CORRECTED MD 10% POE","MVA","Non-coincident"]
[null,null,null,null,"Coincident"]
[null,null,"WEATHER CORRECTED MD 50% POE","MW","Non-coincident"]
[null,null,null,null,"Coincident"]
[null,null,"WEATHER CORRECTED MD 50% POE","MVA","Non-coincident"]
[null,null,null,null,"Coincident"]
[null,"NSP to enter name","CONNECTION POINT RATING","MVA","Non-coincident"]
[null,null,null,null,"Coincident"]
[null,null,"WINTER/SUMMER PEAKING",null,"Non-coincident"]
[null,null,null,null,"Coincident"]
[null,null,"ADJUSTMENTS - EMBEDDED GENERATION","MW","Non-coincident"]
[null,null,null,null,"Coincident"]
[null,null,"WEATHER CORRECTED MD 10% POE","MW","Non-coincident"]
[null,null,null,null,"Coincident"]
[null,null,"WEATHER CORRECTED MD 10% POE","MVA","Non-coincident"]
[null,null,null,null,"Coincident"]
[null,null,"WEATHER CORRECTED MD 50% POE","MW","Non-coincident"]
[null,null,null,null,"Coincident"]
[null,null,"WEATHER CORRECTED MD 50% POE","MVA","Non-coincident"]
[null,null,null,null,"Coincident"]
[null,"NSP to enter name","CONNECTION POINT RATING","MVA","Non-coincident"]
[null,null,null,null,"Coincident"]
[null,null,"WINTER/SUMMER PEAKING",null,"Non-coincident"]
[null,null,null,null,"Coincident"]
[null,null,"ADJUSTMENTS - EMBEDDED GENERATION","MW","Non-coincident"]
[null,null,null,null,"Coincident"]
[null,null,"WEATHER CORRECTED MD 10% POE","MW","Non-coincident"]
[null,null,null,null,"Coincident"]
[null,null,"WEATHER CORRECTED MD 10% POE","MVA","Non-coincident"]
[null,null,null,null,"Coincident"]
[null,null,"WEATHER CORRECTED MD 50% POE","MW","Non-coincident"]
[null,null,null,null,"Coincident"]
[null,null,"WEATHER CORRECTED MD 50% POE","MVA","Non-coincident"]
[null,null,null,null,"Coincident"]
[null,"NSP to enter name","CONNECTION POINT RATING","MVA","Non-coincident"]
[null,null,null,null,"Coincident"]
[null,null,"WINTER/SUMMER PEAKING",null,"Non-coincident"]
[null,null,null,null,"Coincident"]
[null,null,"ADJUSTMENTS - EMBEDDED GENERATION","MW","Non-coincident"]
[null,null,null,null,"Coincident"]
[null,null,"WEATHER CORRECTED MD 10% POE","MW","Non-coincident"]
[null,null,null,null,"Coincident"]
[null,null,"WEATHER CORRECTED MD 10% POE","MVA","Non-coincident"]
[null,null,null,null,"Coincident"]
[null,null,"WEATHER CORRECTED MD 50% POE","MW","Non-coincident"]
[null,null,null,null,"Coincident"]
[null,null,"WEATHER CORRECTED MD 50% POE","MVA","Non-coincident"]
[null,null,null,null,"Coincident"]
[null,"NSP to enter name","CONNECTION POINT RATING","MVA","Non-coincident"]
[null,null,null,null,"Coincident"]
[null,null,"WINTER/SUMMER PEAKING",null,"Non-coincident"]
[null,null,null,null,"Coincident"]
[null,null,"ADJUSTMENTS - EMBEDDED GENERATION","MW","Non-coincident"]
[null,null,null,null,"Coincident"]
[null,null,"WEATHER CORRECTED MD 10% POE","MW","Non-coincident"]
[null,null,null,null,"Coincident"]
[null,null,"WEATHER CORRECTED MD 10% POE","MVA","Non-coincident"]
[null,null,null,null,"Coincident"]
[null,null,"WEATHER CORRECTED MD 50% POE","MW","Non-coincident"]
[null,null,null,null,"Coincident"]
[null,null,"WEATHER CORRECTED MD 50% POE","MVA","Non-coincident"]
[null,null,null,null,"Coincident"]
[null,"NSP to enter name","CONNECTION POINT RATING","MVA","Non-coincident"]
[null,null,null,null,"Coincident"]
[null,null,"WINTER/SUMMER PEAKING",null,"Non-coincident"]
[null,null,null,null,"Coincident"]
[null,null,"ADJUSTMENTS - EMBEDDED GENERATION","MW","Non-coincident"]
[null,null,null,null,"Coincident"]
[null,null,"WEATHER CORRECTED MD 10% POE","MW","Non-coincident"]
[null,null,null,null,"Coincident"]
[null,null,"WEATHER CORRECTED MD 10% POE","MVA","Non-coincident"]
[null,null,null,null,"Coincident"]
[null,null,"WEATHER CORRECTED MD 50% POE","MW","Non-coincident"]
[null,null,null,null,"Coincident"]
[null,null,"WEATHER CORRECTED MD 50% POE","MVA","Non-coincident"]
[null,null,null,null,"Coincident"]
[null,"NSP to enter name","CONNECTION POINT RATING","MVA","Non-coincident"]
[null,null,null,null,"Coincident"]
[null,null,"WINTER/SUMMER PEAKING",null,"Non-coincident"]
[null,null,null,null,"Coincident"]
[null,null,"ADJUSTMENTS - EMBEDDED GENERATION","MW","Non-coincident"]
[null,null,null,null,"Coincident"]
[null,null,"WEATHER CORRECTED MD 10% POE","MW","Non-coincident"]
[null,null,null,null,"Coincident"]
[null,null,"WEATHER CORRECTED MD 10% POE","MVA","Non-coincident"]
[null,null,null,null,"Coincident"]
[null,null,"WEATHER CORRECTED MD 50% POE","MW","Non-coincident"]
[null,null,null,null,"Coincident"]
[null,null,"WEATHER CORRECTED MD 50% POE","MVA","Non-coincident"]
[null,null,null,null,"Coincident"]
[null,"NSP to enter name","CONNECTION POINT RATING","MVA","Non-coincident"]
[null,null,null,null,"Coincident"]
[null,null,"WINTER/SUMMER PEAKING",null,"Non-coincident"]
[null,null,null,null,"Coincident"]
[null,null,"ADJUSTMENTS - EMBEDDED GENERATION","MW","Non-coincident"]
[null,null,null,null,"Coincident"]
[null,null,"WEATHER CORRECTED MD 10% POE","MW","Non-coincident"]
[null,null,null,null,"Coincident"]
[null,null,"WEATHER CORRECTED MD 10% POE","MVA","Non-coincident"]
[null,null,null,null,"Coincident"]
[null,null,"WEATHER CORRECTED MD 50% POE","MW","Non-coincident"]
[null,null,null,null,"Coincident"]
[null,null,"WEATHER CORRECTED MD 50% POE","MVA","Non-coincident"]
[null,null,null,null,"Coincident"]
[null,"NSP to enter name","CONNECTION POINT RATING","MVA","Non-coincident"]
[null,null,null,null,"Coincident"]
[null,null,"WINTER/SUMMER PEAKING",null,"Non-coincident"]
[null,null,null,null,"Coincident"]
[null,null,"ADJUSTMENTS - EMBEDDED GENERATION","MW","Non-coincident"]
[null,null,null,null,"Coincident"]
[null,null,"WEATHER CORRECTED MD 10% POE","MW","Non-coincident"]
[null,null,null,null,"Coincident"]
[null,null,"WEATHER CORRECTED MD 10% POE","MVA","Non-coincident"]
[null,null,null,null,"Coincident"]
[null,null,"WEATHER CORRECTED MD 50% POE","MW","Non-coincident"]
[null,null,null,null,"Coincident"]
[null,null,"WEATHER CORRECTED MD 50% POE","MVA","Non-coincident"]
[null,null,null,null,"Coincident"]
[null,"NSP to enter name","CONNECTION POINT RATING","MVA","Non-coincident"]
[null,null,null,null,"Coincident"]
[null,null,"WINTER/SUMMER PEAKING",null,"Non-coincident"]
[null,null,null,null,"Coincident"]
[null,null,"ADJUSTMENTS - EMBEDDED GENERATION","MW","Non-coincident"]
[null,null,null,null,"Coincident"]
[null,null,"WEATHER CORRECTED MD 10% POE","MW","Non-coincident"]
[null,null,null,null,"Coincident"]
[null,null,"WEATHER CORRECTED MD 10% POE","MVA","Non-coincident"]
[null,null,null,null,"Coincident"]
[null,null,"WEATHER CORRECTED MD 50% POE","MW","Non-coincident"]
[null,null,null,null,"Coincident"]
[null,null,"WEATHER CORRECTED MD 50% POE","MVA","Non-coincident"]
[null,null,null,null,"Coincident"]
[null,"NSP to enter name","CONNECTION POINT RATING","MVA","Non-coincident"]
[null,null,null,null,"Coincident"]
[null,null,"WINTER/SUMMER PEAKING",null,"Non-coincident"]
[null,null,null,null,"Coincident"]
[null,null,"ADJUSTMENTS - EMBEDDED GENERATION","MW","Non-coincident"]
[null,null,null,null,"Coincident"]
[null,null,"WEATHER CORRECTED MD 10% POE","MW","Non-coincident"]
[null,null,null,null,"Coincident"]
[null,null,"WEATHER CORRECTED MD 10% POE","MVA","Non-coincident"]
[null,null,null,null,"Coincident"]
[null,null,"WEATHER CORRECTED MD 50% POE","MW","Non-coincident"]
[null,null,null,null,"Coincident"]
[null,null,"WEATHER CORRECTED MD 50% POE","MVA","Non-coincident"]
[null,null,null,null,"Coincident"]
[null,"NSP to enter name","CONNECTION POINT RATING","MVA","Non-coincident"]
[null,null,null,null,"Coincident"]
[null,null,"WINTER/SUMMER PEAKING",null,"Non-coincident"]
[null,null,null,null,"Coincident"]
[null,null,"ADJUSTMENTS - EMBEDDED GENERATION","MW","Non-coincident"]
[null,null,null,null,"Coincident"]
[null,null,"WEATHER CORRECTED MD 10% POE","MW","Non-coincident"]
[null,null,null,null,"Coincident"]
[null,null,"WEATHER CORRECTED MD 10% POE","MVA","Non-coincident"]
[null,null,null,null,"Coincident"]
[null,null,"WEATHER CORRECTED MD 50% POE","MW","Non-coincident"]
[null,null,null,null,"Coincident"]
[null,null,"WEATHER CORRECTED MD 50% POE","MVA","Non-coincident"]
[null,null,null,null,"Coincident"]
[null,"NSP to enter name","CONNECTION POINT RATING","MVA","Non-coincident"]
[null,null,null,null,"Coincident"]
[null,null,"WINTER/SUMMER PEAKING",null,"Non-coincident"]
[null,null,null,null,"Coincident"]
[null,null,"ADJUSTMENTS - EMBEDDED GENERATION","MW","Non-coincident"]
[null,null,null,null,"Coincident"]
[null,null,"WEATHER CORRECTED MD 10% POE","MW","Non-coincident"]
[null,null,null,null,"Coincident"]
[null,null,"WEATHER CORRECTED MD 10% POE","MVA","Non-coincident"]
[null,null,null,null,"Coincident"]
[null,null,"WEATHER CORRECTED MD 50% POE","MW","Non-coincident"]
[null,null,null,null,"Coincident"]
[null,null,"WEATHER CORRECTED MD 50% POE","MVA","Non-coincident"]
[null,null,null,null,"Coincident"]
[null,"NSP to enter name","CONNECTION POINT RATING","MVA","Non-coincident"]
[null,null,null,null,"Coincident"]
[null,null,"WINTER/SUMMER PEAKING",null,"Non-coincident"]
[null,null,null,null,"Coincident"]
[null,null,"ADJUSTMENTS - EMBEDDED GENERATION","MW","Non-coincident"]
[null,null,null,null,"Coincident"]
[null,null,"WEATHER CORRECTED MD 10% POE","MW","Non-coincident"]
[null,null,null,null,"Coincident"]
[null,null,"WEATHER CORRECTED MD 10% POE","MVA","Non-coincident"]
[null,null,null,null,"Coincident"]
[null,null,"WEATHER CORRECTED MD 50% POE","MW","Non-coincident"]
[null,null,null,null,"Coincident"]
[null,null,"WEATHER CORRECTED MD 50% POE","MVA","Non-coincident"]
[null,null,null,null,"Coincident"]
[null,"NSP to enter name","CONNECTION POINT RATING","MVA","Non-coincident"]
[null,null,null,null,"Coincident"]
[null,null,"WINTER/SUMMER PEAKING",null,"Non-coincident"]
[null,null,null,null,"Coincident"]
[null,null,"ADJUSTMENTS - EMBEDDED GENERATION","MW","Non-coincident"]
[null,null,null,null,"Coincident"]
[null,null,"WEATHER CORRECTED MD 10% POE","MW","Non-coincident"]
[null,null,null,null,"Coincident"]
[null,null,"WEATHER CORRECTED MD 10% POE","MVA","Non-coincident"]
[null,null,null,null,"Coincident"]
[null,null,"WEATHER CORRECTED MD 50% POE","MW","Non-coincident"]
[null,null,null,null,"Coincident"]
[null,null,"WEATHER CORRECTED MD 50% POE","MVA","Non-coincident"]
[null,null,null,null,"Coincident"]
[null,"NSP to enter name","CONNECTION POINT RATING","MVA","Non-coincident"]
[null,null,null,null,"Coincident"]
[null,null,"WINTER/SUMMER PEAKING",null,"Non-coincident"]
[null,null,null,null,"Coincident"]
[null,null,"ADJUSTMENTS - EMBEDDED GENERATION","MW","Non-coincident"]
[null,null,null,null,"Coincident"]
[null,null,"WEATHER CORRECTED MD 10% POE","MW","Non-coincident"]
[null,null,null,null,"Coincident"]
[null,null,"WEATHER CORRECTED MD 10% POE","MVA","Non-coincident"]
[null,null,null,null,"Coincident"]
[null,null,"WEATHER CORRECTED MD 50% POE","MW","Non-coincident"]
[null,null,null,null,"Coincident"]
[null,null,"WEATHER CORRECTED MD 50% POE","MVA","Non-coincident"]
[null,null,null,null,"Coincident"]
[null,"NSP to enter name","CONNECTION POINT RATING","MVA","Non-coincident"]
[null,null,null,null,"Coincident"]
[null,null,"WINTER/SUMMER PEAKING",null,"Non-coincident"]
[null,null,null,null,"Coincident"]
[null,null,"ADJUSTMENTS - EMBEDDED GENERATION","MW","Non-coincident"]
[null,null,null,null,"Coincident"]
[null,null,"WEATHER CORRECTED MD 10% POE","MW","Non-coincident"]
[null,null,null,null,"Coincident"]
[null,null,"WEATHER CORRECTED MD 10% POE","MVA","Non-coincident"]
[null,null,null,null,"Coincident"]
[null,null,"WEATHER CORRECTED MD 50% POE","MW","Non-coincident"]
[null,null,null,null,"Coincident"]
[null,null,"WEATHER CORRECTED MD 50% POE","MVA","Non-coincident"]
[null,null,null,null,"Coincident"]
[null,"NSP to enter name","CONNECTION POINT RATING","MVA","Non-coincident"]
[null,null,null,null,"Coincident"]
[null,null,"WINTER/SUMMER PEAKING",null,"Non-coincident"]
[null,null,null,null,"Coincident"]
[null,null,"ADJUSTMENTS - EMBEDDED GENERATION","MW","Non-coincident"]
[null,null,null,null,"Coincident"]
[null,null,"WEATHER CORRECTED MD 10% POE","MW","Non-coincident"]
[null,null,null,null,"Coincident"]
[null,null,"WEATHER CORRECTED MD 10% POE","MVA","Non-coincident"]
[null,null,null,null,"Coincident"]
[null,null,"WEATHER CORRECTED MD 50% POE","MW","Non-coincident"]
[null,null,null,null,"Coincident"]
[null,null,"WEATHER CORRECTED MD 50% POE","MVA","Non-coincident"]
[null,null,null,null,"Coincident"]
[null,"NSP to enter name","CONNECTION POINT RATING","MVA","Non-coincident"]
[null,null,null,null,"Coincident"]
[null,null,"WINTER/SUMMER PEAKING",null,"Non-coincident"]
[null,null,null,null,"Coincident"]
[null,null,"ADJUSTMENTS - EMBEDDED GENERATION","MW","Non-coincident"]
[null,null,null,null,"Coincident"]
[null,null,"WEATHER CORRECTED MD 10% POE","MW","Non-coincident"]
[null,null,null,null,"Coincident"]
[null,null,"WEATHER CORRECTED MD 10% POE","MVA","Non-coincident"]
[null,null,null,null,"Coincident"]
[null,null,"WEATHER CORRECTED MD 50% POE","MW","Non-coincident"]
[null,null,null,null,"Coincident"]
[null,null,"WEATHER CORRECTED MD 50% POE","MVA","Non-coincident"]
[null,null,null,null,"Coincident"]
[null,"NSP to enter name","CONNECTION POINT RATING","MVA","Non-coincident"]
[null,null,null,null,"Coincident"]
[null,null,"WINTER/SUMMER PEAKING",null,"Non-coincident"]
[null,null,null,null,"Coincident"]
[null,null,"ADJUSTMENTS - EMBEDDED GENERATION","MW","Non-coincident"]
[null,null,null,null,"Coincident"]
[null,null,"WEATHER CORRECTED MD 10% POE","MW","Non-coincident"]
[null,null,null,null,"Coincident"]
[null,null,"WEATHER CORRECTED MD 10% POE","MVA","Non-coincident"]
[null,null,null,null,"Coincident"]
[null,null,"WEATHER CORRECTED MD 50% POE","MW","Non-coincident"]
[null,null,null,null,"Coincident"]
[null,null,"WEATHER CORRECTED MD 50% POE","MVA","Non-coincident"]
[null,null,null,null,"Coincident"]
[null,"NSP to enter name","CONNECTION POINT RATING","MVA","Non-coincident"]
[null,null,null,null,"Coincident"]
[null,null,"WINTER/SUMMER PEAKING",null,"Non-coincident"]
[null,null,null,null,"Coincident"]
[null,null,"ADJUSTMENTS - EMBEDDED GENERATION","MW","Non-coincident"]
[null,null,null,null,"Coincident"]
[null,null,"WEATHER CORRECTED MD 10% POE","MW","Non-coincident"]
[null,null,null,null,"Coincident"]
[null,null,"WEATHER CORRECTED MD 10% POE","MVA","Non-coincident"]
[null,null,null,null,"Coincident"]
[null,null,"WEATHER CORRECTED MD 50% POE","MW","Non-coincident"]
[null,null,null,null,"Coincident"]
[null,null,"WEATHER CORRECTED MD 50% POE","MVA","Non-coincident"]
[null,null,null,null,"Coincident"]
[null,"NSP to enter name","CONNECTION POINT RATING","MVA","Non-coincident"]
[null,null,null,null,"Coincident"]
[null,null,"WINTER/SUMMER PEAKING",null,"Non-coincident"]
[null,null,null,null,"Coincident"]
[null,null,"ADJUSTMENTS - EMBEDDED GENERATION","MW","Non-coincident"]
[null,null,null,null,"Coincident"]
[null,null,"WEATHER CORRECTED MD 10% POE","MW","Non-coincident"]
[null,null,null,null,"Coincident"]
[null,null,"WEATHER CORRECTED MD 10% POE","MVA","Non-coincident"]
[null,null,null,null,"Coincident"]
[null,null,"WEATHER CORRECTED MD 50% POE","MW","Non-coincident"]
[null,null,null,null,"Coincident"]
[null,null,"WEATHER CORRECTED MD 50% POE","MVA","Non-coincident"]
[null,null,null,null,"Coincident"]
[null,"NSP to enter name","CONNECTION POINT RATING","MVA","Non-coincident"]
[null,null,null,null,"Coincident"]
[null,null,"WINTER/SUMMER PEAKING",null,"Non-coincident"]
[null,null,null,null,"Coincident"]
[null,null,"ADJUSTMENTS - EMBEDDED GENERATION","MW","Non-coincident"]
[null,null,null,null,"Coincident"]
[null,null,"WEATHER CORRECTED MD 10% POE","MW","Non-coincident"]
[null,null,null,null,"Coincident"]
[null,null,"WEATHER CORRECTED MD 10% POE","MVA","Non-coincident"]
[null,null,null,null,"Coincident"]
[null,null,"WEATHER CORRECTED MD 50% POE","MW","Non-coincident"]
[null,null,null,null,"Coincident"]
[null,null,"WEATHER CORRECTED MD 50% POE","MVA","Non-coincident"]
[null,null,null,null,"Coincident"]
[null,"NSP to enter name","CONNECTION POINT RATING","MVA","Non-coincident"]
[null,null,null,null,"Coincident"]
[null,null,"WINTER/SUMMER PEAKING",null,"Non-coincident"]
[null,null,null,null,"Coincident"]
[null,null,"ADJUSTMENTS - EMBEDDED GENERATION","MW","Non-coincident"]
[null,null,null,null,"Coincident"]
[null,null,"WEATHER CORRECTED MD 10% POE","MW","Non-coincident"]
[null,null,null,null,"Coincident"]
[null,null,"WEATHER CORRECTED MD 10% POE","MVA","Non-coincident"]
[null,null,null,null,"Coincident"]
[null,null,"WEATHER CORRECTED MD 50% POE","MW","Non-coincident"]
[null,null,null,null,"Coincident"]
[null,null,"WEATHER CORRECTED MD 50% POE","MVA","Non-coincident"]
[null,null,null,null,"Coincident"]
[null,"NSP to enter name","CONNECTION POINT RATING","MVA","Non-coincident"]
[null,null,null,null,"Coincident"]
[null,null,"WINTER/SUMMER PEAKING",null,"Non-coincident"]
[null,null,null,null,"Coincident"]
[null,null,"ADJUSTMENTS - EMBEDDED GENERATION","MW","Non-coincident"]
[null,null,null,null,"Coincident"]
[null,null,"WEATHER CORRECTED MD 10% POE","MW","Non-coincident"]
[null,null,null,null,"Coincident"]
[null,null,"WEATHER CORRECTED MD 10% POE","MVA","Non-coincident"]
[null,null,null,null,"Coincident"]
[null,null,"WEATHER CORRECTED MD 50% POE","MW","Non-coincident"]
[null,null,null,null,"Coincident"]
[null,null,"WEATHER CORRECTED MD 50% POE","MVA","Non-coincident"]
[null,null,null,null,"Coincident"]
[null,"NSP to enter name","CONNECTION POINT RATING","MVA","Non-coincident"]
[null,null,null,null,"Coincident"]
[null,null,"WINTER/SUMMER PEAKING",null,"Non-coincident"]
[null,null,null,null,"Coincident"]
[null,null,"ADJUSTMENTS - EMBEDDED GENERATION","MW","Non-coincident"]
[null,null,null,null,"Coincident"]
[null,null,"WEATHER CORRECTED MD 10% POE","MW","Non-coincident"]
[null,null,null,null,"Coincident"]
[null,null,"WEATHER CORRECTED MD 10% POE","MVA","Non-coincident"]
[null,null,null,null,"Coincident"]
[null,null,"WEATHER CORRECTED MD 50% POE","MW","Non-coincident"]
[null,null,null,null,"Coincident"]
[null,null,"WEATHER CORRECTED MD 50% POE","MVA","Non-coincident"]
[null,null,null,null,"Coincident"]
[null,"NSP to enter name","CONNECTION POINT RATING","MVA","Non-coincident"]
[null,null,null,null,"Coincident"]
[null,null,"WINTER/SUMMER PEAKING",null,"Non-coincident"]
[null,null,null,null,"Coincident"]
[null,null,"ADJUSTMENTS - EMBEDDED GENERATION","MW","Non-coincident"]
[null,null,null,null,"Coincident"]
[null,null,"WEATHER CORRECTED MD 10% POE","MW","Non-coincident"]
[null,null,null,null,"Coincident"]
[null,null,"WEATHER CORRECTED MD 10% POE","MVA","Non-coincident"]
[null,null,null,null,"Coincident"]
[null,null,"WEATHER CORRECTED MD 50% POE","MW","Non-coincident"]
[null,null,null,null,"Coincident"]
[null,null,"WEATHER CORRECTED MD 50% POE","MVA","Non-coincident"]
[null,null,null,null,"Coincident"]
[null,"NSP to enter name","CONNECTION POINT RATING","MVA","Non-coincident"]
[null,null,null,null,"Coincident"]
[null,null,"WINTER/SUMMER PEAKING",null,"Non-coincident"]
[null,null,null,null,"Coincident"]
[null,null,"ADJUSTMENTS - EMBEDDED GENERATION","MW","Non-coincident"]
[null,null,null,null,"Coincident"]
[null,null,"WEATHER CORRECTED MD 10% POE","MW","Non-coincident"]
[null,null,null,null,"Coincident"]
[null,null,"WEATHER CORRECTED MD 10% POE","MVA","Non-coincident"]
[null,null,null,null,"Coincident"]
[null,null,"WEATHER CORRECTED MD 50% POE","MW","Non-coincident"]
[null,null,null,null,"Coincident"]
[null,null,"WEATHER CORRECTED MD 50% POE","MVA","Non-coincident"]
[null,null,null,null,"Coincident"]
[null,"NSP to enter name","CONNECTION POINT RATING","MVA","Non-coincident"]
[null,null,null,null,"Coincident"]
[null,null,"WINTER/SUMMER PEAKING",null,"Non-coincident"]
[null,null,null,null,"Coincident"]
[null,null,"ADJUSTMENTS - EMBEDDED GENERATION","MW","Non-coincident"]
[null,null,null,null,"Coincident"]
[null,null,"WEATHER CORRECTED MD 10% POE","MW","Non-coincident"]
[null,null,null,null,"Coincident"]
[null,null,"WEATHER CORRECTED MD 10% POE","MVA","Non-coincident"]
[null,null,null,null,"Coincident"]
[null,null,"WEATHER CORRECTED MD 50% POE","MW","Non-coincident"]
[null,null,null,null,"Coincident"]
[null,null,"WEATHER CORRECTED MD 50% POE","MVA","Non-coincident"]
[null,null,null,null,"Coincident"]
[null,"NSP to enter name","CONNECTION POINT RATING","MVA","Non-coincident"]
[null,null,null,null,"Coincident"]
[null,null,"WINTER/SUMMER PEAKING",null,"Non-coincident"]
[null,null,null,null,"Coincident"]
[null,null,"ADJUSTMENTS - EMBEDDED GENERATION","MW","Non-coincident"]
[null,null,null,null,"Coincident"]
[null,null,"WEATHER CORRECTED MD 10% POE","MW","Non-coincident"]
[null,null,null,null,"Coincident"]
[null,null,"WEATHER CORRECTED MD 10% POE","MVA","Non-coincident"]
[null,null,null,null,"Coincident"]
[null,null,"WEATHER CORRECTED MD 50% POE","MW","Non-coincident"]
[null,null,null,null,"Coincident"]
[null,null,"WEATHER CORRECTED MD 50% POE","MVA","Non-coincident"]
[null,null,null,null,"Coincident"]
[null,"NSP to enter name","CONNECTION POINT RATING","MVA","Non-coincident"]
[null,null,null,null,"Coincident"]
[null,null,"WINTER/SUMMER PEAKING",null,"Non-coincident"]
[null,null,null,null,"Coincident"]
[null,null,"ADJUSTMENTS - EMBEDDED GENERATION","MW","Non-coincident"]
[null,null,null,null,"Coincident"]
[null,null,"WEATHER CORRECTED MD 10% POE","MW","Non-coincident"]
[null,null,null,null,"Coincident"]
[null,null,"WEATHER CORRECTED MD 10% POE","MVA","Non-coincident"]
[null,null,null,null,"Coincident"]
[null,null,"WEATHER CORRECTED MD 50% POE","MW","Non-coincident"]
[null,null,null,null,"Coincident"]
[null,null,"WEATHER CORRECTED MD 50% POE","MVA","Non-coincident"]
[null,null,null,null,"Coincident"]
[null,"NSP to enter name","CONNECTION POINT RATING","MVA","Non-coincident"]
[null,null,null,null,"Coincident"]
[null,null,"WINTER/SUMMER PEAKING",null,"Non-coincident"]
[null,null,null,null,"Coincident"]
[null,null,"ADJUSTMENTS - EMBEDDED GENERATION","MW","Non-coincident"]
[null,null,null,null,"Coincident"]
[null,null,"WEATHER CORRECTED MD 10% POE","MW","Non-coincident"]
[null,null,null,null,"Coincident"]
[null,null,"WEATHER CORRECTED MD 10% POE","MVA","Non-coincident"]
[null,null,null,null,"Coincident"]
[null,null,"WEATHER CORRECTED MD 50% POE","MW","Non-coincident"]
[null,null,null,null,"Coincident"]
[null,null,"WEATHER CORRECTED MD 50% POE","MVA","Non-coincident"]
[null,null,null,null,"Coincident"]
[null,"NSP to enter name","CONNECTION POINT RATING","MVA","Non-coincident"]
[null,null,null,null,"Coincident"]
[null,null,"WINTER/SUMMER PEAKING",null,"Non-coincident"]
[null,null,null,null,"Coincident"]
[null,null,"ADJUSTMENTS - EMBEDDED GENERATION","MW","Non-coincident"]
[null,null,null,null,"Coincident"]
[null,null,"WEATHER CORRECTED MD 10% POE","MW","Non-coincident"]
[null,null,null,null,"Coincident"]
[null,null,"WEATHER CORRECTED MD 10% POE","MVA","Non-coincident"]
[null,null,null,null,"Coincident"]
[null,null,"WEATHER CORRECTED MD 50% POE","MW","Non-coincident"]
[null,null,null,null,"Coincident"]
[null,null,"WEATHER CORRECTED MD 50% POE","MVA","Non-coincident"]
[null,null,null,null,"Coincident"]
[null,"NSP to enter name","CONNECTION POINT RATING","MVA","Non-coincident"]
[null,null,null,null,"Coincident"]
[null,null,"WINTER/SUMMER PEAKING",null,"Non-coincident"]
[null,null,null,null,"Coincident"]
[null,null,"ADJUSTMENTS - EMBEDDED GENERATION","MW","Non-coincident"]
[null,null,null,null,"Coincident"]
[null,null,"WEATHER CORRECTED MD 10% POE","MW","Non-coincident"]
[null,null,null,null,"Coincident"]
[null,null,"WEATHER CORRECTED MD 10% POE","MVA","Non-coincident"]
[null,null,null,null,"Coincident"]
[null,null,"WEATHER CORRECTED MD 50% POE","MW","Non-coincident"]
[null,null,null,null,"Coincident"]
[null,null,"WEATHER CORRECTED MD 50% POE","MVA","Non-coincident"]
[null,null,null,null,"Coincident"]
[null,"NSP to enter name","CONNECTION POINT RATING","MVA","Non-coincident"]
[null,null,null,null,"Coincident"]
[null,null,"WINTER/SUMMER PEAKING",null,"Non-coincident"]
[null,null,null,null,"Coincident"]
[null,null,"ADJUSTMENTS - EMBEDDED GENERATION","MW","Non-coincident"]
[null,null,null,null,"Coincident"]
[null,null,"WEATHER CORRECTED MD 10% POE","MW","Non-coincident"]
[null,null,null,null,"Coincident"]
[null,null,"WEATHER CORRECTED MD 10% POE","MVA","Non-coincident"]
[null,null,null,null,"Coincident"]
[null,null,"WEATHER CORRECTED MD 50% POE","MW","Non-coincident"]
[null,null,null,null,"Coincident"]
[null,null,"WEATHER CORRECTED MD 50% POE","MVA","Non-coincident"]
[null,null,null,null,"Coincident"]
[null,"NSP to enter name","CONNECTION POINT RATING","MVA","Non-coincident"]
[null,null,null,null,"Coincident"]
[null,null,"WINTER/SUMMER PEAKING",null,"Non-coincident"]
[null,null,null,null,"Coincident"]
[null,null,"ADJUSTMENTS - EMBEDDED GENERATION","MW","Non-coincident"]
[null,null,null,null,"Coincident"]
[null,null,"WEATHER CORRECTED MD 10% POE","MW","Non-coincident"]
[null,null,null,null,"Coincident"]
[null,null,"WEATHER CORRECTED MD 10% POE","MVA","Non-coincident"]
[null,null,null,null,"Coincident"]
[null,null,"WEATHER CORRECTED MD 50% POE","MW","Non-coincident"]
[null,null,null,null,"Coincident"]
[null,null,"WEATHER CORRECTED MD 50% POE","MVA","Non-coincident"]
[null,null,null,null,"Coincident"]
[null,"NSP to enter name","CONNECTION POINT RATING","MVA","Non-coincident"]
[null,null,null,null,"Coincident"]
[null,null,"WINTER/SUMMER PEAKING",null,"Non-coincident"]
[null,null,null,null,"Coincident"]
[null,null,"ADJUSTMENTS - EMBEDDED GENERATION","MW","Non-coincident"]
[null,null,null,null,"Coincident"]
[null,null,"WEATHER CORRECTED MD 10% POE","MW","Non-coincident"]
[null,null,null,null,"Coincident"]
[null,null,"WEATHER CORRECTED MD 10% POE","MVA","Non-coincident"]
[null,null,null,null,"Coincident"]
[null,null,"WEATHER CORRECTED MD 50% POE","MW","Non-coincident"]
[null,null,null,null,"Coincident"]
[null,null,"WEATHER CORRECTED MD 50% POE","MVA","Non-coincident"]
[null,null,null,null,"Coincident"]
[null,"NSP to enter name","CONNECTION POINT RATING","MVA","Non-coincident"]
[null,null,null,null,"Coincident"]
[null,null,"WINTER/SUMMER PEAKING",null,"Non-coincident"]
[null,null,null,null,"Coincident"]
[null,null,"ADJUSTMENTS - EMBEDDED GENERATION","MW","Non-coincident"]
[null,null,null,null,"Coincident"]
[null,null,"WEATHER CORRECTED MD 10% POE","MW","Non-coincident"]
[null,null,null,null,"Coincident"]
[null,null,"WEATHER CORRECTED MD 10% POE","MVA","Non-coincident"]
[null,null,null,null,"Coincident"]
[null,null,"WEATHER CORRECTED MD 50% POE","MW","Non-coincident"]
[null,null,null,null,"Coincident"]
[null,null,"WEATHER CORRECTED MD 50% POE","MVA","Non-coincident"]
[null,null,null,null,"Coincident"]
[null,"NSP to enter name","CONNECTION POINT RATING","MVA","Non-coincident"]
[null,null,null,null,"Coincident"]
[null,null,"WINTER/SUMMER PEAKING",null,"Non-coincident"]
[null,null,null,null,"Coincident"]
[null,null,"ADJUSTMENTS - EMBEDDED GENERATION","MW","Non-coincident"]
[null,null,null,null,"Coincident"]
[null,null,"WEATHER CORRECTED MD 10% POE","MW","Non-coincident"]
[null,null,null,null,"Coincident"]
[null,null,"WEATHER CORRECTED MD 10% POE","MVA","Non-coincident"]
[null,null,null,null,"Coincident"]
[null,null,"WEATHER CORRECTED MD 50% POE","MW","Non-coincident"]
[null,null,null,null,"Coincident"]
[null,null,"WEATHER CORRECTED MD 50% POE","MVA","Non-coincident"]
[null,null,null,null,"Coincident"]
[null,"NSP to enter name","CONNECTION POINT RATING","MVA","Non-coincident"]
[null,null,null,null,"Coincident"]
[null,null,"WINTER/SUMMER PEAKING",null,"Non-coincident"]
[null,null,null,null,"Coincident"]
[null,null,"ADJUSTMENTS - EMBEDDED GENERATION","MW","Non-coincident"]
[null,null,null,null,"Coincident"]
[null,null,"WEATHER CORRECTED MD 10% POE","MW","Non-coincident"]
[null,null,null,null,"Coincident"]
[null,null,"WEATHER CORRECTED MD 10% POE","MVA","Non-coincident"]
[null,null,null,null,"Coincident"]
[null,null,"WEATHER CORRECTED MD 50% POE","MW","Non-coincident"]
[null,null,null,null,"Coincident"]
[null,null,"WEATHER CORRECTED MD 50% POE","MVA","Non-coincident"]
[null,null,null,null,"Coincident"]
[null,"NSP to enter name","CONNECTION POINT RATING","MVA","Non-coincident"]
[null,null,null,null,"Coincident"]
[null,null,"WINTER/SUMMER PEAKING",null,"Non-coincident"]
[null,null,null,null,"Coincident"]
[null,null,"ADJUSTMENTS - EMBEDDED GENERATION","MW","Non-coincident"]
[null,null,null,null,"Coincident"]
[null,null,"WEATHER CORRECTED MD 10% POE","MW","Non-coincident"]
[null,null,null,null,"Coincident"]
[null,null,"WEATHER CORRECTED MD 10% POE","MVA","Non-coincident"]
[null,null,null,null,"Coincident"]
[null,null,"WEATHER CORRECTED MD 50% POE","MW","Non-coincident"]
[null,null,null,null,"Coincident"]
[null,null,"WEATHER CORRECTED MD 50% POE","MVA","Non-coincident"]
[null,null,null,null,"Coincident"]
[null,"NSP to enter name","CONNECTION POINT RATING","MVA","Non-coincident"]
[null,null,null,null,"Coincident"]
[null,null,"WINTER/SUMMER PEAKING",null,"Non-coincident"]
[null,null,null,null,"Coincident"]
[null,null,"ADJUSTMENTS - EMBEDDED GENERATION","MW","Non-coincident"]
[null,null,null,null,"Coincident"]
[null,null,"WEATHER CORRECTED MD 10% POE","MW","Non-coincident"]
[null,null,null,null,"Coincident"]
[null,null,"WEATHER CORRECTED MD 10% POE","MVA","Non-coincident"]
[null,null,null,null,"Coincident"]
[null,null,"WEATHER CORRECTED MD 50% POE","MW","Non-coincident"]
[null,null,null,null,"Coincident"]
[null,null,"WEATHER CORRECTED MD 50% POE","MVA","Non-coincident"]
[null,null,null,null,"Coincident"]
[null,"NSP to enter name","CONNECTION POINT RATING","MVA","Non-coincident"]
[null,null,null,null,"Coincident"]
[null,null,"WINTER/SUMMER PEAKING",null,"Non-coincident"]
[null,null,null,null,"Coincident"]
[null,null,"ADJUSTMENTS - EMBEDDED GENERATION","MW","Non-coincident"]
[null,null,null,null,"Coincident"]
[null,null,"WEATHER CORRECTED MD 10% POE","MW","Non-coincident"]
[null,null,null,null,"Coincident"]
[null,null,"WEATHER CORRECTED MD 10% POE","MVA","Non-coincident"]
[null,null,null,null,"Coincident"]
[null,null,"WEATHER CORRECTED MD 50% POE","MW","Non-coincident"]
[null,null,null,null,"Coincident"]
[null,null,"WEATHER CORRECTED MD 50% POE","MVA","Non-coincident"]
[null,null,null,null,"Coincident"]
[null,"NSP to enter name","CONNECTION POINT RATING","MVA","Non-coincident"]
[null,null,null,null,"Coincident"]
[null,null,"WINTER/SUMMER PEAKING",null,"Non-coincident"]
[null,null,null,null,"Coincident"]
[null,null,"ADJUSTMENTS - EMBEDDED GENERATION","MW","Non-coincident"]
[null,null,null,null,"Coincident"]
[null,null,"WEATHER CORRECTED MD 10% POE","MW","Non-coincident"]
[null,null,null,null,"Coincident"]
[null,null,"WEATHER CORRECTED MD 10% POE","MVA","Non-coincident"]
[null,null,null,null,"Coincident"]
[null,null,"WEATHER CORRECTED MD 50% POE","MW","Non-coincident"]
[null,null,null,null,"Coincident"]
[null,null,"WEATHER CORRECTED MD 50% POE","MVA","Non-coincident"]
[null,null,null,null,"Coincident"]
[null,"NSP to enter name","CONNECTION POINT RATING","MVA","Non-coincident"]
[null,null,null,null,"Coincident"]
[null,null,"WINTER/SUMMER PEAKING",null,"Non-coincident"]
[null,null,null,null,"Coincident"]
[null,null,"ADJUSTMENTS - EMBEDDED GENERATION","MW","Non-coincident"]
[null,null,null,null,"Coincident"]
[null,null,"WEATHER CORRECTED MD 10% POE","MW","Non-coincident"]
[null,null,null,null,"Coincident"]
[null,null,"WEATHER CORRECTED MD 10% POE","MVA","Non-coincident"]
[null,null,null,null,"Coincident"]
[null,null,"WEATHER CORRECTED MD 50% POE","MW","Non-coincident"]
[null,null,null,null,"Coincident"]
[null,null,"WEATHER CORRECTED MD 50% POE","MVA","Non-coincident"]
[null,null,null,null,"Coincident"]
[null,"NSP to enter name","CONNECTION POINT RATING","MVA","Non-coincident"]
[null,null,null,null,"Coincident"]
[null,null,"WINTER/SUMMER PEAKING",null,"Non-coincident"]
[null,null,null,null,"Coincident"]
[null,null,"ADJUSTMENTS - EMBEDDED GENERATION","MW","Non-coincident"]
[null,null,null,null,"Coincident"]
[null,null,"WEATHER CORRECTED MD 10% POE","MW","Non-coincident"]
[null,null,null,null,"Coincident"]
[null,null,"WEATHER CORRECTED MD 10% POE","MVA","Non-coincident"]
[null,null,null,null,"Coincident"]
[null,null,"WEATHER CORRECTED MD 50% POE","MW","Non-coincident"]
[null,null,null,null,"Coincident"]
[null,null,"WEATHER CORRECTED MD 50% POE","MVA","Non-coincident"]
[null,null,null,null,"Coincident"]
[null,"NSP to enter name","CONNECTION POINT RATING","MVA","Non-coincident"]
[null,null,null,null,"Coincident"]
[null,null,"WINTER/SUMMER PEAKING",null,"Non-coincident"]
[null,null,null,null,"Coincident"]
[null,null,"ADJUSTMENTS - EMBEDDED GENERATION","MW","Non-coincident"]
[null,null,null,null,"Coincident"]
[null,null,"WEATHER CORRECTED MD 10% POE","MW","Non-coincident"]
[null,null,null,null,"Coincident"]
[null,null,"WEATHER CORRECTED MD 10% POE","MVA","Non-coincident"]
[null,null,null,null,"Coincident"]
[null,null,"WEATHER CORRECTED MD 50% POE","MW","Non-coincident"]
[null,null,null,null,"Coincident"]
[null,null,"WEATHER CORRECTED MD 50% POE","MVA","Non-coincident"]
[null,null,null,null,"Coincident"]
[null,"NSP to enter name","CONNECTION POINT RATING","MVA","Non-coincident"]
[null,null,null,null,"Coincident"]
[null,null,"WINTER/SUMMER PEAKING",null,"Non-coincident"]
[null,null,null,null,"Coincident"]
[null,null,"ADJUSTMENTS - EMBEDDED GENERATION","MW","Non-coincident"]
[null,null,null,null,"Coincident"]
[null,null,"WEATHER CORRECTED MD 10% POE","MW","Non-coincident"]
[null,null,null,null,"Coincident"]
[null,null,"WEATHER CORRECTED MD 10% POE","MVA","Non-coincident"]
[null,null,null,null,"Coincident"]
[null,null,"WEATHER CORRECTED MD 50% POE","MW","Non-coincident"]
[null,null,null,null,"Coincident"]
[null,null,"WEATHER CORRECTED MD 50% POE","MVA","Non-coincident"]
[null,null,null,null,"Coincident"]
[null,"NSP to enter name","CONNECTION POINT RATING","MVA","Non-coincident"]
[null,null,null,null,"Coincident"]
[null,null,"WINTER/SUMMER PEAKING",null,"Non-coincident"]
[null,null,null,null,"Coincident"]
[null,null,"ADJUSTMENTS - EMBEDDED GENERATION","MW","Non-coincident"]
[null,null,null,null,"Coincident"]
[null,null,"WEATHER CORRECTED MD 10% POE","MW","Non-coincident"]
[null,null,null,null,"Coincident"]
[null,null,"WEATHER CORRECTED MD 10% POE","MVA","Non-coincident"]
[null,null,null,null,"Coincident"]
[null,null,"WEATHER CORRECTED MD 50% POE","MW","Non-coincident"]
[null,null,null,null,"Coincident"]
[null,null,"WEATHER CORRECTED MD 50% POE","MVA","Non-coincident"]
[null,null,null,null,"Coincident"]
[null,"NSP to enter name","CONNECTION POINT RATING","MVA","Non-coincident"]
[null,null,null,null,"Coincident"]
[null,null,"WINTER/SUMMER PEAKING",null,"Non-coincident"]
[null,null,null,null,"Coincident"]
[null,null,"ADJUSTMENTS - EMBEDDED GENERATION","MW","Non-coincident"]
[null,null,null,null,"Coincident"]
[null,null,"WEATHER CORRECTED MD 10% POE","MW","Non-coincident"]
[null,null,null,null,"Coincident"]
[null,null,"WEATHER CORRECTED MD 10% POE","MVA","Non-coincident"]
[null,null,null,null,"Coincident"]
[null,null,"WEATHER CORRECTED MD 50% POE","MW","Non-coincident"]
[null,null,null,null,"Coincident"]
[null,null,"WEATHER CORRECTED MD 50% POE","MVA","Non-coincident"]
[null,null,null,null,"Coincident"]
[null,"NSP to enter name","CONNECTION POINT RATING","MVA","Non-coincident"]
[null,null,null,null,"Coincident"]
[null,null,"WINTER/SUMMER PEAKING",null,"Non-coincident"]
[null,null,null,null,"Coincident"]
[null,null,"ADJUSTMENTS - EMBEDDED GENERATION","MW","Non-coincident"]
[null,null,null,null,"Coincident"]
[null,null,"WEATHER CORRECTED MD 10% POE","MW","Non-coincident"]
[null,null,null,null,"Coincident"]
[null,null,"WEATHER CORRECTED MD 10% POE","MVA","Non-coincident"]
[null,null,null,null,"Coincident"]
[null,null,"WEATHER CORRECTED MD 50% POE","MW","Non-coincident"]
[null,null,null,null,"Coincident"]
[null,null,"WEATHER CORRECTED MD 50% POE","MVA","Non-coincident"]
[null,null,null,null,"Coincident"]
[null,"NSP to enter name","CONNECTION POINT RATING","MVA","Non-coincident"]
[null,null,null,null,"Coincident"]
[null,null,"WINTER/SUMMER PEAKING",null,"Non-coincident"]
[null,null,null,null,"Coincident"]
[null,null,"ADJUSTMENTS - EMBEDDED GENERATION","MW","Non-coincident"]
[null,null,null,null,"Coincident"]
[null,null,"WEATHER CORRECTED MD 10% POE","MW","Non-coincident"]
[null,null,null,null,"Coincident"]
[null,null,"WEATHER CORRECTED MD 10% POE","MVA","Non-coincident"]
[null,null,null,null,"Coincident"]
[null,null,"WEATHER CORRECTED MD 50% POE","MW","Non-coincident"]
[null,null,null,null,"Coincident"]
[null,null,"WEATHER CORRECTED MD 50% POE","MVA","Non-coincident"]
[null,null,null,null,"Coincident"]

{"sheet":"7.1  Policies and Procedures","index":26,"n_rows":225,"n_cols":5,"rows_kept":225,"cut":false,"hidden":false,"merged":[[207,1,207,4],[212,1,212,4],[223,1,223,4],[76,1,76,4],[156,1,156,4],[161,1,161,4],[198,1,198,4],[202,1,202,4],[38,1,38,4],[39,1,39,4],[42,1,42,4],[47,1,47,4],[71,1,71,4],[7,1,7,3],[10,1,11,1],[12,1,12,4],[16,1,16,4],[34,1,34,4]]}
[null,{"$f":"(LOOKUP(dms_Model,dms_Model_List,dms_Worksheet_List))","v":"REGULATORY REPORTING STATEMENT"}]
[null,{"$f":"INDEX(dms_TradingNameFull_List,MATCH(dms_TradingName,dms_TradingName_List))","v":"ElectraNet"}]
[null,{"$f":"IF(SUM(dms_SingleYear_Model)>0,CRY,CONCATENATE(FRCP_y1,\" to \",dms_MultiYear_FinalYear_Result))","v":"2023-24 to 2027-28"}]
[null,"7.1  PLANS, POLICIES, PROCEDURES AND STRATEGIES"]
[]
[]
[null,"Instructions"]
[null,{"$f":"CONCATENATE(dms_TradingName, \" must list and provide a brief description of key internal plans, \"&\"policies, procedures or strategies that are used by it to plan and conduct its day to day operations and that have been relied upon in the development of its regulatory proposal. \"&dms_TradingName,\" must identify any internal plans, policies, procedures and strategies that have changed in the current regulatory control period \"&\"or that are expected to change before the next regulatory control period where the change has been identified as a step change.\")","v":"ElectraNet must list and provide a brief description of key internal plans, policies, procedures or strategies that are used by it to plan and conduct its day to day operations and that have been relied upon in the development of its regulatory proposal. ElectraNet must identify any internal plans, policies, procedures and strategies that have changed in the current regulatory control period or that are expected to change before the next regulatory control period where the change has been identified as a step change."}]
[]
[null,"7.1.1 - PLANS, POLICIES, PROCEDURES AND STRATEGIES"]
[null,null,"Brief description","Relevance to regulatory proposal","Expenditure impact"]
[null,null,"Description of the plan, policy, procedure or strategy.","Identify the element of the proposal/supporting documents that the policy, plan, procedure or strategy is relevant to e.g. replacement capex, capacity utilisation thresholds, opex ","Is this policy, plan or procedure identified in the response to section 4 'Step Changes' of the notice (yes or no)?"]
[null,"Corporate"]
[null,"Health Safety Environment and Sustainability Organisational policy","This Policy supports the ElectraNet Vision of ElectraNet to be an Australian leader in enabling the transition to a low carbon economy by expanding our role as a provider of network solutions.\nThis policy sets out ElectraNet’s commitments and expectations for decisions, activities and behaviours concerning the management of health, safety, environment and sustainability.","Capital and operational expenditure","No"]
[null,"Bushfire Risk Management Guideline","This document establishes ElectraNet's approach for bushfire risk management in planning and operating the network","Capital and operational expenditure","No"]
[]
[null,"Governance framework"]
[null,"Corporate Governance Policy","This policy provides the foundation for  corporate governance within ElectraNet, demonstrating ElectraNet's commitment to governance practices that ensure accountability, adequate controls, and reporting.","Capital and operational expenditure","No"]
[null,"Risk Management Policy","This policy sets out a structured approach to risk management acknowledging that the effective management of risk is a key prerequisite to the achievement of ElectraNet's strategic and operational objectives.","Capital and operational expenditure","No"]
[]
[]
[]
[]
[]
[]
[]
[]
[]
[]
[]
[]
[]
[]
[]
[null,"Accounting policies, procedures and methodologies (including a capitalisation policy, depreciation policy and an approved expenditure allocation methodology)"]
[null,"Cost Allocation Methodology","This AER approved policy details the principles for attributing costs to, and allocating costs between or within, the categories of transmission services under the Rules.","Capital and operational expenditure","No"]
[null,"Capitalisation Policy ","This policy establishes a framework for the capitalisation of property, plant, equipment, and intangible assets. ","Capital and operational expenditure","No"]
[null,"Asset Disposal Policy\n\n\n\n\nDepreciation and Amortisation of Asset Policy","This policy establishes a framework for the disposal of assets within ElectraNet for accounting, taxation, and regulatory purposes.\n\nThis policy is to establish a framework for the depreciation and amortisation of assets at ElectraNet for accounting, regulatory and taxation purposes.","Capital expenditure\n\n\n\n\nDepreciation\n\n\n\n","No\n\n\n\n\nNo"]
[null,"Asset management plan or equivalent documentation"]
[null,"Asset Management Policies"]
[null,"Asset Management Organisational Policy","This policy sets out ElectraNet’s commitments and expectations for decisions, activities and behaviours concerning asset management.","Capital and operational expenditure","No"]
[null,"Regulated Investment Planning Policy\n\n\n\n\n\n\n\nAsset Management Strategic Planning Framework","The purpose of this policy is to ensure a consistent framework for regulated asset management investment decisions that promote and support the achievement of ElectraNet’s Asset Management Objectives.\n\nThis framework ensures that planning for regulated transmission network capex and opex investments is performed in a systematic manner.","Capital and operational expenditure\n\n\n\n\n\n\n\nCapital and operational expenditure","No\n\n\n\n\n\n\n\nNo"]
[null,"Asset Management Strategies"]
[null,"Asset class strategy - Instrument Transformers","Provides the strategy and the plan for the management of these assets","Capital and operational expenditure","No"]
[null,"Asset class strategy - Line conductors","Provides the strategy and the plan for the management of these assets","Capital and operational expenditure","No"]
[null,"Asset class strategy - Disconnectors and Earth Switches","Provides the strategy and the plan for the management of these assets","Capital and operational expenditure","No"]
[null,"Asset class strategy - Secondary Systems - Protection\n\nAsset class strategy - Line Insulators\n\n\nAsset class strategy - Circuit Breakers","Provides the strategy and the plan for the management of these assets\n\nProvides the strategy and the plan for the management of these assets\n\nProvides the strategy and the plan for the management of these assets","Capital and operational expenditure\n\n\nCaptial and operational expenditure\n\n\nCapital and operational expenditure","No\n\n\nNo\n\n\nNo"]
[null,"Asset Management Plans"]
[null,"Strategic Asset Management Plan (SAMP)","A SAMP is defined by ISO 55000 as documented “information that specifies how organisational objectives are to be converted into asset management objectives, the approach for developing asset management plans, and the role of the asset management system in supporting achievement of the asset management objectives.” It is a high level strategic plan that documents the relationship between the organisational objectives and the asset management objectives, defines “the framework required to achieve the asset management objectives” and “should be used to develop the asset management plan(s).”","Capital and operational expenditure","No"]
[]
[]
[]
[]
[]
[]
[]
[]
[]
[]
[]
[]
[]
[]
[]
[]
[]
[]
[]
[]
[]
[]
[null,"Capital expenditure policies and procedures (including capex approval policies and procedures and replacement policy) "]
[null,"Expenditure Forecasting Methodology","This document sets out ElectraNet's (capital and operating) expenditure forecasting methodology","Capital and operational expenditure","No"]
[null,"Transmission Asset Life Cycle (TALC)","This document sets out a framework for understanding substation and transmission line asset lifecycle indicators.  It defines processes for asset condition and provides information to asset cost / risk optimisation decision support tools and informs asset replacement decision making.","Capital and operational expenditure","No"]
[]
[]
[null,"Internal standards for network planning, design, maintenance and operation"]
[null,"Guideline for Undertaking Cost-Benefit Analyses","This guideline sets out the economic evaluation framework used to assess and identify preferred options to address identified needs.","Capital expenditure","No"]
[null,"Risk Cost Assumptions Procedure","Sets out the assumptions and principles for conducting risk cost analyses.","Capital expenditure","No"]
[]
[]
[]
[]
[]
[]
[]
[]
[]
[]
[]
[]
[]
[]
[]
[]
[]
[]
[]
[]
[]
[]
[]
[]
[]
[]
[]
[]
[]
[]
[]
[]
[]
[]
[]
[]
[]
[]
[]
[]
[]
[]
[]
[]
[]
[]
[]
[]
[]
[]
[]
[]
[]
[]
[]
[]
[]
[]
[]
[]
[]
[]
[]
[]
[]
[]
[]
[]
[]
[]
[]
[]
[]
[]
[]
[]
[]
[null,"Procurement and contracting out policies"]
[null,"Procurement policy","Establishes high level direction and precedents in relation to procuring goods and services.","Capital and operational expenditure","No"]
[null,"Procurement Business Guideline","Establishes high level direction and precedents in relation to procurement and defines how procurement activities are undertaken.","Capital and operational expenditure","No"]
[]
[]
[null,"Information technology policies or strategies"]
[null,"IT Strategy 2020 - 2028","Describes ElectraNet's proposed ICT strategy to 2023 and the overall IT Systems.","Capital and operational expenditure","No"]
[]
[]
[]
[]
[]
[]
[]
[]
[]
[]
[]
[]
[]
[]
[]
[]
[]
[]
[]
[]
[]
[]
[]
[]
[]
[]
[]
[]
[]
[]
[]
[]
[]
[]
[]
[null,"Demand management policies or strategies"]
[]
[]
[]
[null,"Self insurance guidelines or policy"]
[]
[]
[]
[]
[null,"Land and easement acquisition polices"]
[]
[]
[]
[]
[null,"Asset security plans and policies"]
[null,"Cyber Security Framework","Defines the high level strategies to support ElectraNet’s cyber security objectives.","Capital and operational expenditure","No"]
[]
[]
[]
[]
[]
[]
[]
[]
[]
[null,"Disaster recovery policy"]
[null,"Crisis Management plan","The purpose of the ElectraNet Crisis Management Plan (CMP) is to:\n•Provide documented guidelines to support the response to incidents and crises \n•Outline roles and responsibilities for incident/crisis management \n•Ensure a timely and appropriate transition from response activities to the resumption of business as usual during recovery, including the identification of lessons learned and opportunities for improvement. \nThe CMP applies to all ElectraNet employees and is supported by Business Continuity Plans, IT Recovery Response Procedure and network incident response procedures.","Capital and operational expenditure","No"]

{"sheet":"7.2 Contingent projects","index":27,"n_rows":31,"n_cols":6,"rows_kept":31,"cut":false,"hidden":false,"merged":[[3,1,3,5],[7,1,7,3]]}
[null,{"$f":"(LOOKUP(dms_Model,dms_Model_List,dms_Worksheet_List))","v":"REGULATORY REPORTING STATEMENT"}]
[null,{"$f":"INDEX(dms_TradingNameFull_List,MATCH(dms_TradingName,dms_TradingName_List))","v":"ElectraNet"}]
[null,{"$f":"IF(SUM(dms_SingleYear_Model)>0,CRY,CONCATENATE(FRCP_y1,\" to \",dms_MultiYear_FinalYear_Result))","v":"2023-24 to 2027-28"}]
[null,"7.2 CONTINGENT PROJECTS"]
[]
[]
[null,"Instructions"]
[null,{"$f":"CONCATENATE(dms_TradingName,\" is required to populate all input cells (yellow) in table 7.2.1 presented below. Additional rows may be added by \",dms_TradingName,\"  if required.\"\n\n\n\n)","v":"ElectraNet is required to populate all input cells (yellow) in table 7.2.1 presented below. Additional rows may be added by ElectraNet  if required."}]
[]
[null,"7.2.1 - PROPOSED CONTINGENT PROJECTS FOR THE FORTHCOMING REGULATORY CONTROL PERIOD"]
[null,"Proposed contingent project name","Proposed contingent capital expenditure \n($0's, nominal)","Proposed trigger events",{"$f":"CONCATENATE(\"Proposed MAR for \", FRCP_y1,\" \n($0's, nominal)\")","v":"Proposed MAR for 2023-24 \n($0's, nominal)"},{"$f":"CONCATENATE(\"5 per cent of the \", FRCP_y1,\" ($0's, nominal) MAR\")","v":"5 per cent of the 2023-24 ($0's, nominal) MAR"}]
[null,"Eyre Peninsula Upgrade","$50,000,000-$150,000,000","1.\tCustomer commitment for additional load to connect to the transmission network causing the Cultana 275/132 kV transformers to exceed their thermal limit of 200 MW and/or causing a need for augmentation of power transfer capacity between Davenport and Cultana.\n2.\tSuccessful completion of a RIT-T including an assessment of credible options showing the upgrade of the 132 kV Eyre Peninsula Link to 275 kV and/or augmentation of power transfer capacity between Davenport and Cultana is the preferred option \na.\tdemonstrating positive net market benefits; and/or\nb.\taddressing a reliability corrective action\n3.\tElectraNet board commitment to proceed with the project subject to the AER amending the revenue determination pursuant to the Rules.",349965795.07472402,{"$f":"+E12*0.05","v":17498289.753736202}]
[null,"Interconnector Upgrade","$100,000,000-$150,000,000","1.\tSuccessful completion of a RIT-T with an identified need to increase inter-regional transfer capability between South Australia and adjoining regions \na.\tdemonstrating positive net market benefits; and/or\nb.\taddressing a reliability corrective action\n2.\tElectraNet board commitment to proceed with the project subject to the AER amending the revenue determination pursuant to the Rules.",{"$f":"+$E$12","v":349965795.07472402},17498289.753736202]
[null,"Power Quality Management","$30,000,000-$60,000,000","1.\tSuccessful completion of a RIT-T including an assessment of credible options showing a transmission investment is justified to address voltage quality requirements on the South Australian transmission network.\n2.\tElectraNet board commitment to proceed with the project subject to the AER amending the revenue determination pursuant to the Rules.",349965795.07472402,17498289.753736202]
[null,null,null,null,349965795.07472402,17498289.753736202]
[null,null,null,null,349965795.07472402,17498289.753736202]
[null,null,null,null,349965795.07472402,17498289.753736202]
[null,null,null,null,349965795.07472402,17498289.753736202]
[null,null,null,null,349965795.07472402,17498289.753736202]
[null,null,null,null,349965795.07472402,17498289.753736202]
[null,null,null,null,349965795.07472402,17498289.753736202]
[null,null,null,null,349965795.07472402,17498289.753736202]
[null,null,null,null,349965795.07472402,17498289.753736202]
[null,null,null,null,349965795.07472402,17498289.753736202]
[null,null,null,null,349965795.07472402,17498289.753736202]
[null,null,null,null,349965795.07472402,17498289.753736202]
[null,null,null,null,349965795.07472402,17498289.753736202]
[null,null,null,null,349965795.07472402,17498289.753736202]
[null,null,null,null,349965795.07472402,17498289.753736202]
[null,null,null,null,349965795.07472402,17498289.753736202]
[null,null,null,null,349965795.07472402,17498289.753736202]

{"sheet":"7.3 Obligations","index":28,"n_rows":301,"n_cols":5,"rows_kept":301,"cut":false,"hidden":false,"merged":[[3,1,3,4],[5,1,5,2],[8,1,8,2],[12,1,13,1]]}
[null,{"$f":"(LOOKUP(dms_Model,dms_Model_List,dms_Worksheet_List))","v":"REGULATORY REPORTING STATEMENT"}]
[null,{"$f":"INDEX(dms_TradingNameFull_List,MATCH(dms_TradingName,dms_TradingName_List))","v":"ElectraNet"}]
[null,{"$f":"IF(SUM(dms_SingleYear_Model)>0,CRY,CONCATENATE(FRCP_y1,\" to \",dms_MultiYear_FinalYear_Result))","v":"2023-24 to 2027-28"}]
[null,"7.3  OBLIGATIONS, REQUIREMENTS & STANDARDS"]
[]
[null,"There is ONE table on this worksheet. It has been sub-grouped for ease of navigation. See the Instructions sheet on how to group or ungroup data."]
[]
[null,"Instructions"]
[null,{"$f":"CONCATENATE(\"Outline those obligations and requirements that \",dms_TradingName, \" identifies as having a material impact on expenditure requirements.\")","v":"Outline those obligations and requirements that ElectraNet identifies as having a material impact on expenditure requirements."}]
[]
[]
[null,"7.3.1 - OBLIGATIONS OR REQUIREMENTS"]
[null,null,"Brief description","Relevance to regulatory proposal","Expenditure impact"]
[null,null,"Description of relevant obligations or requirements within the instrument (e.g. safety obligations, reliability targets) ","Identify what element of the proposal/supporting documents the obligation or requirement is relevant to e.g. replacement capex, capacity utilisation thresholds, opex ","Is the obligation or requirement identified in the response to section 4 'Step Changes' of the notice (yes or no)?"]
[null,"Legislation"]
[null,"National Electricity (South Australia) Act 1996 (SA) and Regulations and National Electricity Law (NEL) ","Electricity transmission entities have a large number of obligations under the NEL. The most significant obligations are to: register with AEMO as a \"Registered Participant\"; comply with the transmission determination that applies to the electricity transmission network services provided; provide the AER with necessary information or prepare, maintain or keep the information as is requested by the AER in either a \"relevant notice\" or a \"regulatory information instrument\"; provide information to the AER for the purpose of the preparation of ElectraNet's financial and operational performance ; comply with the guidelines established by AEMO in relation to the shedding and restoration of loads and AEMO directions in order to ensure the safety and security of the transmission network and broader national electricity system ; comply with a wide range of obligations relating to the determination and resolution of access disputes, comply with access determinations; and comply with the general obligation not to prevent or hinder the access of another person to a regulated network service. In addition the Act and Regulations cover such system operations functions that ElectraNet exercises.","Regulatory Proposal and Forecast Operating Expenditure","No"]
[null,"Electricity Act 1996 (SA)","This Act sets out a requirement for ElectraNet to comply with the terms of its transmission licence, requires vegetation clearance to be undertaken, and sets out obligations in relation to the access of land.","Forecast Capital and Operating Expenditure","No"]
[null,"Electricity (General) Regulations 2012 (SA)","These Regulations set out a range of obligations for electricity entities covering safety, design parameters, inspection and maintenance requirements for electricity transmission infrastructure.","Forecast Capital and Operating Expenditure","No"]
[null,"Electricity (Principles of Vegetation Clearance ) Regulations 2021","These Regulations define clearance obligations and provide further detail on the principles and processes which ElectraNet must comply with in relation to vegetation impacting its transmission lines.","Forecast Operating Expenditure","No"]
[null,"Work Health and Safety Act 2012 (SA)","This Act sets out obligations for ElectraNet to maintain appropriate health and safety standards at its place of business to ensure the safety of workers and other persons and sets out safety related duties that must be complied with. \n","Forecast Capital and Operating Expenditure","No"]
[null,"Work Health and Safety Regulations 2012 (SA) ","These Regulations set out detailed requirements in relation to the identification and management of hazards and risks to safety, high risk construction work and undertaking construction projects relevant to ElectraNet's business.","Forecast Capital and Operating Expenditure","No"]
[null,"Return to Work Act 2014 and associated regulations","This Act and Regulations set out obligations for employers in relation to worker recovery and return to work and as a self-insured employer is relevant to ElectraNet's obligation to pay self-insured fees.\n","Forecast Operating Expenditure","No"]
[null,"Native Vegetation Act 1991 (SA) and associated regulations","This Act sets out requirements for the clearing, conservation and management of native vegetation relevant  to constructing and maintaining ElectraNet's transmission network.","Forecast Capital and Operating Expenditure","No"]
[null,"Planning, Development and Infrastructure Act 2016 and associated regulations","This Act sets out the framework for obtaining development approval for ElectraNet's electricity transmission infrastructure and may contain conditions of approval that impact on ongoing operations. ","Forecast Capital and Operating Expenditure","No"]
[null,"Environment Protection Act 1993 (SA) and associated regulations","This Act sets out the environmental requirements that ElectraNet must take into account and comply with when constructing, operating and maintaining its network infrastructure or in undertaking related operations.\n","Forecast Capital and Operating Expenditure","No"]
[null,"Land Tax Act 1936 (SA)","This Act requires the payment of a tax based on site values of land owned by ElectraNet.","Forecast Operating Expenditure","No"]
[null,"Environmental Protection and Biodiversity Conservation Act 1999 (Cth) and associated regulations","This Act aims to protect the environment, particularly related to environmentally sensitive species and habitats and matters of national environmental significance and is relevant when undertaking development activities or in relation to ongoing site management. ","Forecast Capital and Operating Expenditure","No"]
[null,"Fair Work Act and Regulations 2009 (Cth)","This Act and Regulations are focused on providing a balanced framework for cooperative and productive workplace relations that promotes national economic prosperity and social inclusion for all Australians. ","Escalation Rates & Project Cost Escalation\nForecast Capital and Operating Expenditure","No"]
[null,"Security of Critical Infrastructure Act 2018 and Security Legislation Amendment (Critical Infrastructure) Bill 2020 and associated regulations and rules (Cth)","The Act, associated regulations and rules is to provide a framework for managing risks to national security relating to critical infrastructure,","Forecast Capital and Operating Expenditure","Yes"]
[null,"Workplace Health and Safety Act (2011) (Cwth)","This Act establishes a national framework for workplace health and safety and works in concert with the State Act and Regulations identified separately above.\n","Forecast Capital and Operating Expenditure","No"]
[]
[]
[]
[]
[]
[]
[]
[]
[]
[]
[]
[]
[]
[]
[]
[]
[]
[]
[]
[]
[]
[]
[]
[]
[]
[]
[]
[]
[]
[]
[]
[]
[]
[]
[]
[]
[]
[]
[]
[]
[]
[]
[]
[]
[]
[]
[]
[]
[]
[]
[]
[]
[]
[]
[]
[]
[]
[]
[]
[]
[]
[]
[]
[]
[]
[]
[]
[]
[]
[]
[]
[]
[]
[]
[]
[]
[]
[]
[]
[]
[]
[]
[]
[]
[]
[]
[]
[]
[]
[]
[]
[]
[]
[]
[]
[]
[]
[]
[]
[]
[]
[]
[]
[]
[]
[]
[]
[]
[]
[]
[]
[]
[]
[]
[]
[]
[]
[]
[]
[]
[]
[]
[]
[]
[]
[]
[]
[]
[]
[]
[]
[]
[]
[]
[]
[]
[]
[]
[]
[]
[]
[]
[]
[]
[]
[]
[]
[]
[]
[]
[]
[]
[]
[]
[]
[]
[]
[]
[]
[]
[]
[]
[]
[]
[]
[]
[]
[]
[]
[]
[]
[]
[]
[]
[]
[]
[]
[]
[]
[]
[]
[]
[]
[]
[]
[]
[]
[]
[]
[]
[]
[]
[]
[]
[]
[]
[null,"Licences"]
[null,"Electricity Transmission Licence","Licence issued by the Essential Services Commission enabling ElectraNet to operate the transmission network in South Australia with conditions covering compliance with codes, guidelines and reporting obligations.","Forecast Operating Expenditure","No"]
[null,"System Control Licence","Licence issued by the Essential Services Commission to enable ElectraNet to exercise system control over the transmission network.","Forecast Operating Expenditure","No"]
[]
[]
[null,"Rules"]
[null,"National Electricity Rules","The National Electricity Rules govern the registration of ElectraNet as a network services provider, set out the process and requirements for lodgement and the content of ElectraNet's revenue proposal, the process for making a revenue determination, technical and operational requirements that ElectraNet must meet in relation to the transmission system, network augmentation processes, connection processes, obligations to co-operate with AEMO in relation to power system security and comply with the directions of AEMO to ensure the safety and security of the national electricity market, comply with confidentiality obligations and manage NER disputes in accordance with the framework set out in the Rules.","Regulatory Proposal and Forecast Capital and Operating Expenditure"]
[]
[]
[]
[null,"Orders"]
[]
[]
[]
[null,"Codes"]
[null,"Electricity Transmission Code (SA)","This Code made by the Essential Services Commission of South Australia sets out quality of supply, reliability standards and design requirements. These obligations impacting on the planning, development and operation of the transmision network.","Forecast Capital and Operating Expenditure"]
[null,"Applicable Codes made under the Work Health and Safety Act 2012 (SA)","Compliance with these Codes relating to work, health and safety are relevant to ElectraNet's buiness and operations.","Forecast Capital and Operating Expenditure"]
[]
[]
[]
[]
[]
[]
[]
[]
[]
[]
[]
[]
[]
[null,"Guidelines"]
[null,"AER's Better Regulation Guidelines and Schemes","Guidelines relate to confidentiality, expenditure forecast assessment, cost allocation, capital expenditure incentives, rate of return and consumer engagement. Schemes include STPIS and EBSS.","Regulatory Proposal"]
[]
[]
[]
[]
[]
[]
[]
[]
[]
[]
[]
[]
[]
[]
[]
[]
[]
[]
[]
[]
[]
[]
[]
[]
[]
[]
[]
[]
[]
[]
[]
[]
[]
[]
[]
[]
[]
[null,"Default agreements "]
[]
[]
[]
[]
[null,"Other"]

{"sheet":"7.4 Shared Assets","index":29,"n_rows":26,"n_cols":19,"rows_kept":26,"cut":false,"hidden":false,"merged":[[6,1,7,1],[6,2,7,2],[6,11,6,18],[6,6,6,10]]}
[null,{"$f":"(LOOKUP(dms_Model,dms_Model_List,dms_Worksheet_List))","v":"REGULATORY REPORTING STATEMENT"}]
[null,{"$f":"INDEX(dms_TradingNameFull_List,MATCH(dms_TradingName,dms_TradingName_List))","v":"ElectraNet"}]
[null,{"$f":"IF(SUM(dms_SingleYear_Model)>0,CRY,CONCATENATE(FRCP_y1,\" to \",dms_MultiYear_FinalYear_Result))","v":"2023-24 to 2027-28"}]
[null,"7.4 SHARED ASSETS"]
[]
[null,"7.4.1 - TOTAL UNREGULATED REVENUE EARNED WITH SHARED ASSETS "]
[null,"Name of shared asset unregulated service","Description of shared assets used to provide the service",null,null,null,"Shared asset unregulated revenue  ($0's, nominal)",null,null,null,null,{"$f":"CONCATENATE(\"Shared asset unregulated revenue  ($0's, real \", dms_DollarReal,\")\")","v":"Shared asset unregulated revenue  ($0's, real June 2023)"}]
[null,null,null,{"$f":"PRCP_y1","v":"2013-14"},{"$f":"PRCP_y2","v":"2014-15"},{"$f":"PRCP_y3","v":"2015-16"},{"$f":"PRCP_y4","v":"2016-17"},{"$f":"PRCP_y5","v":"2017-18"},{"$f":"CRCP_y1","v":"2018-19"},{"$f":"CRCP_y2","v":"2019-20"},{"$f":"CRCP_y3","v":"2020-21"},{"$f":"dms_y1","v":"2021-22"},{"$f":"dms_y2","v":"2022-23"},{"$f":"dms_y3","v":"2023-24"},{"$f":"dms_y4","v":"2024-25"},{"$f":"dms_y5","v":"2025-26"},{"$f":"dms_y6","v":"2026-27"},{"$f":"dms_y7","v":"2027-28"},{"$f":"CONCATENATE(\"Total \n\",FRCP_y1, \" to \", dms_MultiYear_FinalYear_Result)","v":"Total \n2023-24 to 2027-28"}]
[null,"Telecommunications Revenue ","Non-regulated telecommunications revenue associated with telecommunications services on transmission towers, radio towers, leasing spare available capacity bandwidth and network monitoring.",null,null,null,1006367.38,1200466.0899999999,1330647.1200000001,1234555.6800000002,1396570.98,1764279.5917372182,1960067.6082661585,2040542.0094993543,2124320.4443416614,2211538.5663415724,2302337.5985687771,2396864.5622817231,{"$f":"SUM(N9:R9)","v":11075603.18103309}]
[null,null,null,null,null,null,null,null,null,null,null,null,null,null,null,null,null,null,{"$f":"SUM(N10:R10)","v":0}]
[null,null,null,null,null,null,null,null,null,null,null,null,null,null,null,null,null,null,0]
[null,null,null,null,null,null,null,null,null,null,null,null,null,null,null,null,null,null,0]
[null,null,null,null,null,null,null,null,null,null,null,null,null,null,null,null,null,null,0]
[null,null,null,null,null,null,null,null,null,null,null,null,null,null,null,null,null,null,0]
[null,null,null,null,null,null,null,null,null,null,null,null,null,null,null,null,null,null,0]
[null,null,null,null,null,null,null,null,null,null,null,null,null,null,null,null,null,null,0]
[null,null,null,null,null,null,null,null,null,null,null,null,null,null,null,null,null,null,0]
[null,null,null,null,null,null,null,null,null,null,null,null,null,null,null,null,null,null,0]
[null,null,null,null,null,null,null,null,null,null,null,null,null,null,null,null,null,null,0]
[null,null,null,null,null,null,null,null,null,null,null,null,null,null,null,null,null,null,0]
[null,null,null,null,null,null,null,null,null,null,null,null,null,null,null,null,null,null,0]
[null,null,null,null,null,null,null,null,null,null,null,null,null,null,null,null,null,null,0]
[null,null,null,null,null,null,null,null,null,null,null,null,null,null,null,null,null,null,0]
[]
[null,"7.4.2 - SHARED ASSET UNREGULATED SERVICES - APPORTIONMENT METHODOLOGY"]
[null,"Name of shared asset unregulated service for which revenues were apportioned","Apportionment methodology"]

{"sheet":"7.9 STPIS","index":30,"n_rows":174,"n_cols":13,"rows_kept":174,"cut":false,"hidden":false,"merged":[[67,3,67,7],[68,3,68,4],[68,5,68,6],[8,10,9,10],[8,11,9,11],[29,1,30,1],[29,2,30,2],[29,3,30,3],[29,4,30,4],[29,5,29,11],[5,1,5,2],[8,1,9,1],[8,8,9,8],[8,9,9,9],[8,12,9,12],[8,2,8,7]]}
[null,{"$f":"(LOOKUP(dms_Model,dms_Model_List,dms_Worksheet_List))","v":"REGULATORY REPORTING STATEMENT"}]
[null,{"$f":"INDEX(dms_TradingNameFull_List,MATCH(dms_TradingName,dms_TradingName_List))","v":"ElectraNet"}]
[null,{"$f":"IF(SUM(dms_SingleYear_Model)>0,CRY,CONCATENATE(FRCP_y1,\" to \",dms_MultiYear_FinalYear_Result))","v":"2023-24 to 2027-28"}]
[null,"7.9 SERVICE TARGET PERFORMANCE INCENTIVE SCHEME (STPIS)"]
[]
[null,"There are FOUR tables on this worksheet. Each table has been grouped (and sub-grouped) for ease of navigation. See the Instructions sheet on how to group or ungroup tables. "]
[]
[null,"7.9.1 - Historical performance and proposed floor, caps and targets for the service component of the STPIS"]
[null,"Parameter","Performance actuals",null,null,null,null,null,"Average of actual performance","Floor","Target","Cap","Weighting \n(% of MAR)"]
[null,null,{"$f":"(LEFT(PRCP_y3,2)&RIGHT(PRCP_y3,2))","v":"2016"},{"$f":"LEFT(PRCP_y4,2)&RIGHT(PRCP_y4,2)","v":"2017"},{"$f":"LEFT(PRCP_y5,2)&RIGHT(PRCP_y5,2)","v":"2018"},{"$f":"(LEFT(CRCP_y1,2)&RIGHT(CRCP_y1,2))","v":"2019"},{"$f":"(LEFT(CRCP_y2,2)&RIGHT(CRCP_y2,2))","v":"2020"},{"$f":"(LEFT(CRCP_y3,2)&RIGHT(CRCP_y3,2))","v":"2021"}]
[null,"Unplanned outage circuit event rate:"]
[null,"Transmission line outage - fault",0.32085561497326204,7.3394495412844041E-2,0.15178571428571427,0.10526315789473684,0.15939999999999999,null,{"$f":"+AVERAGE(C12:H12)","v":0.16213979651331142},0.34100000000000003,0.16209999999999999,6.8400000000000002E-2,2E-3]
[null,"Transformer outage – fault ",0.35294117647058826,0.13432835820895522,0.26865671641791045,0.2388059701492537,0.1343,null,{"$f":"+AVERAGE(C13:H13)","v":0.22580644424934154},0.36580000000000001,0.2258,9.4600000000000004E-2,2E-3]
[null,"Reactive plant – fault ",0.5135135135135136,0.1891891891891892,0.15789473684210525,0.31578947368421051,0.1053,null,0.25633738264580369,0.59050000000000002,0.25629999999999997,9.6299999999999997E-2,1E-3]
[null,"Transmission line outage – forced outage",8.0213903743315509E-2,8.2568807339449546E-2,8.9285714285714274E-2,0.17543859649122806,8.8999999999999999E-3,null,8.7281404371941471E-2,0.19739999999999999,8.7300000000000003E-2,1.35E-2,1E-3]
[null,"Transformer outage – forced outage",3.6764705882352942E-2,6.7164179104477612E-2,8.2089552238805957E-2,7.4626865671641784E-2,5.2200000000000003E-2,null,6.256906057945566E-2,8.6800000000000002E-2,6.2600000000000003E-2,3.6499999999999998E-2,1E-3]
[null,"Reactive plant – forced outage",0.1891891891891892,0.1891891891891892,7.8947368421052627E-2,5.2631578947368418E-2,0.15790000000000001,null,0.13357146514935991,0.22869999999999999,0.1336,4.9000000000000002E-2,5.0000000000000001E-4]
[null,"Loss of supply event frequency (number of events):"]
[null,">  (x) system minutes",5,4,3,4,1,null,3.4,7,3,1,1.5E-3]
[null,">  (y) system minutes",2,1,2,3,0,null,1.6,4,2,0,1.5E-3]
[null,"Average outage duration (minutes): ",250.57142857142784,97.4,463,192,205,null,241.59428571428558,462,242,86,2E-3]
[null,"Proper operation of equipment (number of events):"]
[null,"Failure of protection system",17,9,18,6,3,null,10.6,18,11,3,0]
[null,"Material failure of SCADA",2,0,2,0,0,null,0.8,2,1,0,0]
[null,"Incorrect operational isolation of primary or secondary equipment",10,7,13,6,4,null,8,13,8,4,0]
[]
[]
[]
[null,"7.9.2 - Proposed priority projects for the network capability incentive parameter"]
[null,"Project ranking","Transmission Circuit /  Injection Point","Scope of works",{"$f":"CONCATENATE((\"If applicable, the present value of quantified benefits associated with the project\n ($0's, \"),CRCP_y5,\")\")","v":"If applicable, the present value of quantified benefits associated with the project\n ($0's, 2022-23)"},{"$f":"CONCATENATE((\"Project cost ($0's, \"),CRCP_y5,\")\")","v":"Project cost ($0's, 2022-23)"}]
[null,null,null,null,null,{"$f":"FRCP_y1","v":"2023-24"},{"$f":"FRCP_y2","v":"2024-25"},{"$f":"FRCP_y3","v":"2025-26"},{"$f":"FRCP_y4","v":"2026-27"},{"$f":"FRCP_y5","v":"2027-28"},"Opex","Capex"]
[null,1,"F1938 Robertstown – Tungkillo 275 kV;F1945 Robertstown – Para 275 kV ","Lines will be uprated from T100 rating to T120 rating by increasing spans and removing secondary system limitations. ",36453624.18,null,2429032,null,null,null,0,2429032]
[null,2,"F1935 Corraberra Hill - Cultana 275 kV;F1936 Davenport - Cultana No2 275 kV;F1965 Davenport - Corraberra Hill 275 kV","Lines will be uprated from T80 rating to T100 rating by increasing spans and removing secondary system limitations. ",7997162.7199999997,null,1529272,null,null,null,0,1529272]
[null,3,"All transmission lines","Under favorable weather conditions, higher ratings can be applied to transmission lines to allow more access to the network by market participants.  ElectraNet has developed a strategy to apply a 10 band static rating, which is expected to provide increased ratings for a majority of the time, with a small downside risk of lower rating than currently applied for a small period of time when the temperature is extremely high",10604396.060000001,1190312,1190312,1190312,1190312,1190312,4166092.6999999997,1785468.3]
[null,4,"T400 North West Bend 132 kV Substation","1.An additional 15 MVAr capacitor bank will be added to the Riverland 132 kV network North West Bend (Monash is an alternative site) including an automated capacitor switching control system installed to manage voltage and reactive power support; 2. Upgrade the existing runback control scheme to include bi-directionality and allow it to run forward if required.",10132955.550000001,null,5024726,null,null,null,0,5024726]
[null,5]
[null,6]
[null,7]
[null,8]
[null,9]
[null,10]
[null,11]
[null,12]
[null,13]
[null,14]
[null,15]
[null,16]
[]
[]
[]
[]
[null,"7.9.3 – Network limit information"]
[null,"Limit identification ","Define limit  ","Reason for the limit ","Is limit addressed by priority project","Supporting information reference"]
[null,"Robertstown – Tungkillo 275 kV;Robertstown – Para 275 kV (constraints S>>NIL_RBPA_RBTU,S>>NIL_RBTU_RBPA)","597/617/677 MVA (Summer/Autumn/Winter)","Design thermal limit of the lines and protection settings",1,"TAPR 2021"]
[null,"F1935 Corraberra Hill - Cultana 275 kV;F1936 Davenport - Cultana No2 275 kV;F1965 Davenport - Corraberra Hill 275 kV","457 MVA","The limit constraints prevent the overload of one Davenport – Cultana line upon the trip of the other circuit.",2,"TAPR 2021"]
[null,"3-band rating on all transmission lines","3-band rating","-temperature band static rating, with a fixed pre-defined rating for each temperature band",3,"TAPR 2021"]
[null,"Constraint SVML^NIL_MH-CAP_ON,S>NIL_MHNW1_MHNW2 (Murray link limit)","100 - 170 MW","Export limit of Murray link is currently capped at around 100 – 170 MW subject to availability of existing capacitor bank at the Riverland 132 kV network and combined instantaneous MW load at Berri, North West Bend, Morgan-Whyalla Pump 1, Morgan-Whyalla Pump 2 and Morgan-Whyalla Pump 3 connection points",4,"TAPR 2021"]
[null,"Loss of a major line in 275 kV mid-north overloads the 132 kV mid-north network corridor (Robertstown - Waterloo - Templers)","183/189/205 MVA (Summer/Autumn/Winter)","With the development of renewable energy (RE) projects in the mid north region and commissioning of PEC (from 2024), there will be heavy flows from the mid north (Robertstown) to Adelaide load center. A trip in the 275 kV network (Robertstown-Para 275kV or one of the Robertstown 275/132kV transformers) will divert more flows to the 132 kV path from Robertstown to Templers",3,"TAPR 2021"]
[null,"Heywood interconnector limit","650 MW/750 MW (post PEC)","Stability import limit on the Heywood interconnector",null,"TAPR 2021"]
[null,"Loss of Tailem Bend - Tungkillo - Cherry Gardens (275kV) overloads Tailem Bend - Mobilong (132kV)","207 MVA","Plant limits on Tailem Bend - Mobilong 132 kV",null,"TAPR 2021"]
[null,"Loss of Munno Para - Para 275kV overloads Munno - Elizabeth Down 66kV","92 MVA","At times of high generation in the north of South Australia and high demand in the metro area, an outage on the Munno Para – Para 275kV will overload the Munno Para to Elizabeth Downs 66 kV line of SA Power Network.",null,"TAPR 2021"]
[null,"Loss of Templers West 275/132 kV transformer overloads Para 275/132 kV transformer","160 MVA","Loss of Templers West 275/132 kV transformer overloads Para 275/132 kV transformer",null,"TAPR 2021"]
[null,"Project EnergyConnect (PEC) interconnector limit","800 MW","Stability export limit on the PEC interconnector",null,"ElectraNET market modelling forecast"]
[]
[]
[null,"7.9.4 - Market impact component"]
[]
[null,null,null,"Market impact parameter"]
[null,null,null,"Planned outage count(DI)",null,"Unplanned outage count (DI) "]
[null,"Year","Month","without exclusions","with exclusions","without exclusions","with exclusions","Market impact parameters"]
[null,{"$f":"LEFT(PRCP_y2,4)","v":"2014"},"January",268,7,133,0,0.58333333333333337]
[null,"2014","February",143,0,53,0,0]
[null,"2014","March",265,0,93,0,0]
[null,"2014","April",20,0,17,0,0]
[null,"2014","May",85,0,86,0,0]
[null,"2014","June",248,0,35,0,0]
[null,"2014","July",113,0,25,0,0]
[null,"2014","August",38,15,84,0,1.25]
[null,"2014","September",290,0,64,0,0]
[null,"2014","October",383,39,113,9,3.25]
[null,"2014","November",115,0,24,0,0]
[null,"2014","December",99,26,274,0,2.1666666666666665]
[null,{"$f":"CONCATENATE(\"Total \",LEFT(PRCP_y2,4))","v":"Total 2014"},null,{"$f":"+SUM(D71:D82)","v":2067},{"$f":"+SUM(E71:E82)","v":87},{"$f":"+SUM(F71:F82)","v":1001},{"$f":"+SUM(G71:G82)","v":9},{"$f":"+SUM(H71:H82)","v":7.25}]
[null,{"$f":"LEFT(PRCP_y3,4)","v":"2015"},"January",29,0,546,283,0]
[null,"2015","February",85,0,102,0,0]
[null,"2015","March",600,537,42,0,44.75]
[null,"2015","April",1180,593,155,37,49.416666666666664]
[null,"2015","May",1759,967,224,0,80.583333333333329]
[null,"2015","June",118,83,18,0,6.916666666666667]
[null,"2015","July",3927,2749,149,42,229.08333333333334]
[null,"2015","August",998,477,353,236,39.75]
[null,"2015","September",2137,1593,148,33,132.75]
[null,"2015","October",10781,1690,171,0,140.83333333333334]
[null,"2015","November",7919,870,591,81,72.5]
[null,"2015","December",1180,445,188,81,37.083333333333336]
[null,{"$f":"CONCATENATE(\"Total \", LEFT(PRCP_y3,4))","v":"Total 2015"},null,{"$f":"+SUM(D84:D95)","v":30713},{"$f":"+SUM(E84:E95)","v":10004},{"$f":"+SUM(F84:F95)","v":2687},{"$f":"+SUM(G84:G95)","v":793},{"$f":"+SUM(H84:H95)","v":833.66666666666674}]
[null,{"$f":"LEFT(PRCP_y4,4)","v":"2016"},"January",693,217,6,0,18.083333333333332]
[null,"2016","February",414,0,4,3,0]
[null,"2016","March",1845,737,246,184,61.416666666666664]
[null,"2016","April",1938,671,8,0,55.916666666666664]
[null,"2016","May",1542,746,122,23,62.166666666666664]
[null,"2016","June",3865,1318,26,0,109.83333333333333]
[null,"2016","July",4816,4390,95,4,365.83333333333331]
[null,"2016","August",5976,1228,203,7,102.33333333333333]
[null,"2016","September",5178,411,2497,0,34.25]
[null,"2016","October",4103.5,430.5,8558,334,35.875]
[null,"2016","November",8088,645,1014,31,53.75]
[null,"2016","December",4857,305,202,0,25.416666666666668]
[null,{"$f":"CONCATENATE(\"Total \", LEFT(PRCP_y4,4))","v":"Total 2016"},null,{"$f":"+SUM(D97:D108)","v":43315.5},{"$f":"+SUM(E97:E108)","v":11098.5},{"$f":"+SUM(F97:F108)","v":12981},{"$f":"+SUM(G97:G108)","v":586},{"$f":"+SUM(H97:H108)","v":924.875}]
[null,{"$f":"LEFT(PRCP_y5,4)","v":"2017"},"January",824,23,135,0,1.9166666666666667]
[null,"2017","February",886,19,172,0,1.5833333333333333]
[null,"2017","March",5065,2,96,38,0.16666666666666666]
[null,"2017","April",963,106,0,0,8.8333333333333339]
[null,"2017","May",732,0,0,0,0]
[null,"2017","June",1234,414,0,0,34.5]
[null,"2017","July",1599,204,75,0,17]
[null,"2017","August",2755,172,0,0,14.333333333333334]
[null,"2017","September",3340,392,856,200,32.666666666666664]
[null,"2017","October",4737,336,17,0,28]
[null,"2017","November",1358,422,105,0,35.166666666666664]
[null,"2017","December",3521,0,0,0,0]
[null,{"$f":"CONCATENATE(\"Total \", LEFT(PRCP_y5,4))","v":"Total 2017"},null,{"$f":"+SUM(D110:D121)","v":27014},{"$f":"+SUM(E110:E121)","v":2090},{"$f":"+SUM(F110:F121)","v":1456},{"$f":"+SUM(G110:G121)","v":238},{"$f":"+SUM(H110:H121)","v":174.16666666666666}]
[null,{"$f":"LEFT(CRCP_y1,4)","v":"2018"},"January",207,67,2972,0,5.583333333333333]
[null,"2018","February",14,1,982,0,8.3333333333333329E-2]
[null,"2018","March",195,62,3338,0,5.166666666666667]
[null,"2018","April",101,73,14351,49,6.083333333333333]
[null,"2018","May",233,7,9283,7,0.58333333333333337]
[null,"2018","June",88,53,3628,3,4.416666666666667]
[null,"2018","July",9553,3624,208,206,302]
[null,"2018","August",12913,1113,756,0,92.75]
[null,"2018","September",6473,468,7397,0,39]
[null,"2018","October",10761,403,415,0,33.583333333333336]
[null,"2018","November",3762,754,95,2,62.833333333333336]
[null,"2018","December",4315,328,169,0,27.333333333333332]
[null,{"$f":"CONCATENATE(\"Total \", LEFT(CRCP_y1,4))","v":"Total 2018"},null,{"$f":"+SUM(D123:D134)","v":48615},{"$f":"+SUM(E123:E134)","v":6953},{"$f":"+SUM(F123:F134)","v":43594},{"$f":"+SUM(G123:G134)","v":267},{"$f":"+SUM(H123:H134)","v":579.41666666666674}]
[null,{"$f":"LEFT(CRCP_y2,4)","v":"2019"},"January",828,17,514,0,1.4166666666666667]
[null,"2019","February",624,14,0,0,1.1666666666666667]
[null,"2019","March",2096,356,3,3,29.666666666666668]
[null,"2019","April",2497,140.5,140,27,11.708333333333334]
[null,"2019","May",4031,914,144,51,76.166666666666671]
[null,"2019","June",2639,543,31,0,45.25]
[null,"2019","July",4800,621,320,0,51.75]
[null,"2019","August",5105,1161,0,0,96.75]
[null,"2019","September",9320,1528,0,0,127.33333333333333]
[null,"2019","October",14353,1944,8,0,162]
[null,"2019","November",7226,362,529,98,30.166666666666668]
[null,"2019","December",4470,76,126,0,6.333333333333333]
[null,{"$f":"CONCATENATE(\"Total \", LEFT(CRCP_y2,4))","v":"Total 2019"},null,{"$f":"+SUM(D136:D147)","v":57989},{"$f":"+SUM(E136:E147)","v":7676.5},{"$f":"+SUM(F136:F147)","v":1815},{"$f":"+SUM(G136:G147)","v":179},{"$f":"+SUM(H136:H147)","v":639.70833333333326}]
[null,{"$f":"LEFT(CRCP_y3,4)","v":"2020"},"January",7919,92,1506,0,7.666666666666667]
[null,"2020","February",10461,4,22013,0,0.33333333333333331]
[null,"2020","March",9545,112,530,0,9.3333333333333339]
[null,"2020","April",5459,16,0,0,1.3333333333333333]
[null,"2020","May",5610,733,0,0,61.083333333333336]
[null,"2020","June",3531,174,0,0,14.5]
[null,"2020","July",2165,121,156,156,10.083333333333334]
[null,"2020","August",6726,428,783,783,35.666666666666664]
[null,"2020","September",11630,593,1152,1152,49.416666666666664]
[null,"2020","October",15803,306,762,762,25.5]
[null,"2020","November",15653,142,601,601,11.833333333333334]
[null,"2020","December",15758,441,609,609,36.75]
[null,{"$f":"CONCATENATE(\"Total \", LEFT(CRCP_y3,4))","v":"Total 2020"},null,{"$f":"+SUM(D149:D160)","v":110260},{"$f":"+SUM(E149:E160)","v":3162},{"$f":"+SUM(F149:F160)","v":28112},{"$f":"+SUM(G149:G160)","v":4063},{"$f":"+SUM(H149:H160)","v":263.5}]
[null,{"$f":"LEFT(CRCP_y4,4)","v":"2021"},"January",null,null,null,null,{"$f":"+E162/12","v":0}]
[null,"2021","February",null,null,null,null,0]
[null,"2021","March",null,null,null,null,0]
[null,"2021","April",null,null,null,null,0]
[null,"2021","May",null,null,null,null,0]
[null,"2021","June",null,null,null,null,0]
[null,"2021","July",null,null,null,null,0]
[null,"2021","August",null,null,null,null,0]
[null,"2021","September",null,null,null,null,0]
[null,"2021","October",null,null,null,null,0]
[null,"2021","November",null,null,null,null,0]
[null,"2021","December",null,null,null,null,0]
[null,{"$f":"CONCATENATE(\"Total \", LEFT(CRCP_y4,4))","v":"Total 2021"},null,{"$f":"+SUM(D162:D173)","v":0},{"$f":"+SUM(E162:E173)","v":0},{"$f":"+SUM(F162:F173)","v":0},{"$f":"+SUM(G162:G173)","v":0},{"$f":"+SUM(H162:H173)","v":0}]

{"sheet":"8.2 Capex","index":31,"n_rows":60,"n_cols":4,"rows_kept":60,"cut":false,"hidden":false,"merged":[]}
[null,{"$f":"(LOOKUP(dms_Model,dms_Model_List,dms_Worksheet_List))","v":"REGULATORY REPORTING STATEMENT"}]
[null,{"$f":"INDEX(dms_TradingNameFull_List,MATCH(dms_TradingName,dms_TradingName_List))","v":"ElectraNet"}]
[null,{"$f":"IF(SUM(dms_SingleYear_Model)>0,CRY,CONCATENATE(FRCP_y1,\" to \",dms_MultiYear_FinalYear_Result))","v":"2023-24 to 2027-28"}]
[null,"8.2 - CAPEX"]
[]
[null,"8.2.7 - IMMEDIATE EXPENSING OF CAPEX"]
[null,"ESTIMATED - AS COMMISSIONED"]
[null,null,"$0's, (nominal)",{"$f":"CONCATENATE(\"($0's, real \", dms_DollarReal,\")\")","v":"($0's, real June 2023)"}]
[null,"Asset class",{"$f":"dms_y1","v":"2021-22"},{"$f":"dms_y2","v":"2022-23"}]
[null,"Commercial Buildings"]
[null,"Communications - Civil"]
[null,"Communications - Other"]
[null,"Computers, software, and office machines"]
[null,"Easement"]
[null,"Land"]
[null,"Network Switching Centres"]
[null,"Office furniture, movable plant, and misc"]
[null,"Refurbishment"]
[null,"Substation Primary Plant"]
[null,"Substation Demountable Buildings"]
[null,"Substation Establishment"]
[null,"Substation Fences"]
[null,"Substation Secondary Systems - Electro-mechanical"]
[null,"Substation Secondary Systems - Electronic"]
[null,"Transmission lines - Overhead"]
[null,"Transmission lines - Underground"]
[null,"Refurbishment 2008-13"]
[null,"Transmission Line Refit - insulators replacement 2013-18"]
[null,"Transmission Line Refit - insulators replacement 2018-23"]
[null,"Transmission Line Refit - insulators replacement 2023-28"]
[null,"Right of Use Assets"]
[null,"Synchronous Condensers"]
[null,"Communications - Other Post 2018"]
[]
[]
[]
[]
[]
[]
[]
[]
[]
[]
[]
[]
[]
[]
[]
[]
[]
[]
[]
[]
[]
[]
[]
[]
[]
[]
[null,"Total",{"$f":"SUM(C10:C59)","v":0},{"$f":"SUM(D10:D59)","v":0}]