{"text_format":"1","workbook":"xlsx","n_sheets":30,"sheets":["AER only","Instructions","Contents","Business & other details","2.1 Expenditure summary","2.2 Repex","2.3 Augex (a)","2.3 Augex (b)","2.5 Connections","2.6 Non-network","2.10 Overheads","2.11 Labour","2.14 Forecast price changes","2.16 Opex Summary","2.17 Step Changes","3.1 Revenue","3.2 Operating expenditure","3.3 Assets (RAB)","3.4 Operational data","3.5 Physical assets","3.7 Operating environment","5.4 MD & Utilisation - Spatial","7.1  Policies and Procedures","7.2 Contingent projects","7.3 Obligations","7.4 Shared Assets","7.5 EBSS","7.6 Indicative bill impact ","7.9 STPIS","Reconciliation"],"not_rendered":{"charts":0,"images":5,"macros":1,"external_links":2,"defined_names":562,"comments":1,"pivot_tables":0},"unopened":[],"bounds":{"document_bytes":16777216,"sheet_cells":100000,"rows_first":2000,"rows_last":500,"rows_between":2000,"halvings":0,"cell_chars":16384,"cell_head_chars":4096},"cells_cut":0,"cells_raw":0,"read":"whole","date_system":"1900"}

{"sheet":"AER only","index":0,"n_rows":97,"n_cols":38,"rows_kept":97,"cut":false,"hidden":true,"merged":[[80,4,80,11],[0,1,0,11],[3,27,3,37],[4,27,4,30],[4,33,4,37],[43,22,43,26],[44,1,44,5],[44,14,44,21],[44,22,44,26],[45,2,45,3],[45,33,47,33],[48,33,52,33],[56,33,57,33],[62,22,62,25]]}
[null,"Data in these columns used for data validation and database purposes."]
[null,"Date last modified:"]
[]
[null,null,null,null,null,null,null,null,null,null,null,null,null,null,null,null,null,null,null,null,null,null,null,null,null,null,null,"FOR ELECTRICITY BUSINESSES ONLY"]
[null,null,null,null,null,null,null,null,null,null,null,null,null,null,null,null,null,null,null,null,null,null,null,null,null,null,null,"Feeder Types",null,null,null,"TasNetworks (D)","MAIFI flag","Feeder Names"]
[null,null,null,null,null,null,null,null,null,null,null,null,null,null,null,null,null,null,null,null,null,null,null,null,null,null,null,"CBD","Urban","Short rural","long rural","EXTRA"]
[null,"dms_TradingName_List","dms_TradingNameFull_List","dms_ABN_List","dms_JurisdictionList","dms_Sector_List","dms_Segment_List","dms_FormControl_List","dms_RPT_List","dms_RPTMonth_List","dms_CRCPlength_List","dms_FRCPlength_List","dms_663_List","dms_DeterminationRef_List","dms_Addr1_List","dms_Addr2_List","dms_Suburb_List","dms_State_List","dms_PostCode_List","dms_PAddr1_List","dms_PAddr2_List","dms_PSuburb_List","dms_PState_List","dms_PPostCode_List","dms_ContactName1_List","dms_ContactPh1_List","dms_ContactEmail_List","dms_CBD_flag","dms_Urban_flag","dms_ShortRural_flag","dms_LongRural_flag","dms_FeederType_5_flag","dms_MAIFI_flag_List","dms_FeederName_1","dms_FeederName_2","dms_FeederName_3","dms_FeederName_4","dms_FeederName_5"]
[null,"ActewAGL Distribution","ActewAGL Distribution",76670568688,"ACT","Electricity","Distribution","Revenue cap","Financial","June",5,5,5,"2014-19 Distribution Determination","40 Bunda Street",null,"CANBERRA","ACT","2600","GPO BOX 366",null,"CANBERRA","ACT",2601,"Robert Walker","02 6248 3847","robert.walker@actewagle.com.au","NO","YES","YES","NO","NO",null,"CBD","Urban","Short rural","Long rural"]
[null,"ActewAGL Distribution (Tx Assets)","ActewAGL Distribution (Tx Assets)",76670568688,"ACT","Electricity","Distribution","Revenue cap","Financial","June",5,5,5,"distribution determination","40 Bunda Street",null,"CANBERRA","ACT","2600","GPO BOX 366",null,"CANBERRA","ACT",2601,"Robert Walker","02 6248 3847","robert.walker@actewagle.com.au",null,null,null,null,null,null,"CBD","Urban","Short rural","Long rural"]
[null,"ActewAGL Gas","ActewAGL Gas",76670568688,"ACT","Gas","Distribution","Weighted average price cap","Financial","June",5,5,"x",null,"40 Bunda Street",null,"CANBERRA","ACT","2600","GPO BOX 366",null,"CANBERRA","ACT",2601,"Philip Deamer","02 6248 3438","GasAAReview@actewagl.com.au"]
[null,"AGN","AGN",78551685,"SA","Gas","Distribution","Revenue cap","Financial","June",5,5,5,"distribution determination",null,null,null,"SA",null,null,null,null,null,null,null,null,null,null,null,null,null,null,null,"CBD","Urban","Short rural","Long rural"]
[null,"Amadeus","APT Pipelines (NT) Pty Ltd",39009737393,"NT","Gas","Transmission","Weighted average price cap","Financial","June",5,5,"x","n/a","Level 19, HSBC Building","580 George Street","SYDNEY","NSW","2000","Level 19, HSBC Building","580 George Street","SYDNEY","NSW","2000","Alexandra Curran","02 9275 0020","alexandra.curran@apa.com.au"]
[null,"APA GasNet","APA VTS Australia Limited",79096457868,"Vic","Gas","Transmission",null,"Calendar","December",5,5,"x",null,"Level 19, HSBC Building","580 George Street","SYDNEY","NSW","2000","PO Box R41",null,"ROYAL EXCHANGE","NSW","1225",null,"02 9693 0000"]
[null,"Ausgrid","Ausgrid",67505337385,"NSW","Electricity","Distribution","Revenue cap","Financial","June",5,5,5,"2014-19 Distribution Determination","570 George St",null,"SYDNEY","NSW",2000,null,null,null,null,null,"John Thomson","(02) 9269 2312","john.thomson@ausgrid.com.au","YES","YES","YES","YES","NO",null,"CBD","Urban","Short rural","Long rural"]
[null,"Ausgrid (Tx Assets)","Ausgrid (Tx Assets)",67505337385,"NSW","Electricity","Distribution","Revenue cap","Financial","June",5,5,5,"distribution determination",null,null,null,"NSW",null,null,null,null,null,null,null,null,null,null,null,null,null,null,null,"CBD","Urban","Short rural","Long rural"]
[null,"AusNet (D)","AusNet Services (D)",91064651118,"Vic","Electricity","Distribution","Revenue cap","Calendar","December",5,5,2,"2016-20 Distribution Determination","Level 32","2 Southbank Boulevard","SOUTHBANK","Vic","3006","Locked Bag 14051",null,"MELBOURNE CITY MAIL CENTRE","VIC",8001,"Hannah Williams","03 9683 4088","hwilliams@powercor.com.au",null,"YES","YES","YES","NO",null,"CBD","Urban","Short rural","Long rural"]
[null,"AusNet (Gas)",null,null,null,"Gas","Distribution",null,"Calendar","December",5,5,"X"]
[null,"AusNet (T)","AusNet (T)",48116124362,"Vic","Electricity","Transmission","Revenue cap","Financial","March",5,5,2,"transmission determination","Level 32","2 Southbank Boulevard","SOUTHBANK","Vic","3006",null,null,null,null,null,"Tom Hallam","03 9695 6617","Thomas.hallam@SP-Ausnet.com.au",null,null,null,null,null,null,"CBD","Urban","Short rural","Long rural"]
[null,"Australian Distribution Co.","Australian Distribution Co.",11222333444,"-","Electricity","Distribution","Revenue cap","Financial","June",5,5,2,"distribution determination",null,null,null,"-",null,null,null,null,null,null,null,null,null,null,null,null,null,null,null,"CBD","Urban","Short rural","Long rural"]
[null,"Australian Transmission Co.","Australian Transmission Co.",11222333444,"-","Electricity","Transmission","Revenue cap","Financial","June",5,5,5,"transmission determination",null,null,null,"-",null,null,null,null,null,null,null,null,null,null,null,null,null,null,null,"CBD","Urban","Short rural","Long rural"]
[null,"CitiPower","CitiPower",76064651056,"Vic","Electricity","Distribution","Revenue cap","Calendar","December",5,5,2,"2016-20 Distribution Determination","40 Market Street",null,"MELBOURNE","Vic","3000","Locked Bag 14090",null,"MELBOURNE","VIC",8001,"Hannah Williams","03 9683 4088","hwilliams@powercor.com.au","YES","YES","NO","NO","NO",null,"CBD","Urban","Short rural","Long rural"]
[null,"Directlink","Directlink",16779340889,"Qld","Electricity","Transmission","Revenue cap","Financial","June",9,5,5,"transmission determination",null,null,null,"NSW",null,null,null,null,null,null,null,null,null,null,null,null,null,null,null,"CBD","Urban","Short rural","Long rural"]
[null,"ElectraNet","ElectraNet",41094482416,"SA","Electricity","Transmission","Revenue cap","Financial","June",5,5,5,"transmission determination","52-55 East Terrace","Rymill Park","ADELAIDE","SA","5000","PO Box 7096","Hutt Street Post Office","ADELAIDE","SA",5000,"Bill Jackson","08 8404 7969","jackson.bill@electranet.com.au",null,null,null,null,null,null,"CBD","Urban","Short rural","Long rural"]
[null,"Endeavour Energy","Endeavour Energy",59253130878,"NSW","Electricity","Distribution","Revenue cap","Financial","June",5,5,5,"2014-19 Distribution Determination","51 Huntingwood Drive",null,"HUNTINGWOOD","NSW","2148","PO Box 811",null,"SEVEN HILLS","NSW",null,"Jon Hocking","02 9853 4386 / 0407 348 156","Jon.Hocking@Endeavourenergy.com.au","NO","YES","YES","YES","NO",null,"CBD","Urban","Short rural","Long rural"]
[null,"Energex","Energex",40078849055,"Qld","Electricity","Distribution","Revenue cap","Financial","June",5,5,5,"2015-20 Distribution Determination","26 Reddacliff Street",null,"NEWSTEAD","Qld","4006","26 Reddacliff Street",null,"NEWSTEAD","QLD","4006","Nicola Roscoe","07 3664 5891","nicolaroscoe@energex.com.au","YES","YES","YES","NO","NO",null,"CBD","Urban","Short rural","Long rural"]
[null,"Ergon Energy","Ergon Energy",50087646062,"Qld","Electricity","Distribution","Revenue cap","Financial","June",5,5,5,"2015-20 Distribution Determination","22 Walker Street",null,"TOWNSVILLE","Qld","4810","Po Box 264",null,"FORTITUDE VALLEY","QLD",4006,"Jenny Doyle, Group Manager Regulatory Affairs","(07) 3851 6416","jenny.doyle@ergon.com.au","NO","YES","YES","YES","NO",null,"CBD","Urban","Short rural","Long rural"]
[null,"Envestra (Victoria and Albury)","Australian Gas Networks Limited",19078551685,"SA","Gas","Distribution",null,"Calendar","December",5,5,"x",null,"Level 10","81 Flinders Street","ADELAIDE","SA","5000",null,null,null,null,null,null,"08 8227 1500"]
[null,"Essential Energy","Essential Energy",37428185226,"NSW","Electricity","Distribution","Revenue cap","Financial","June",5,5,5,"2014-19 Distribution Determination","8 Buller Street",null,"PORT MACQUARIE","NSW",null,"PO Box 5730",null,"PORT MACQUARIE","NSW",null,"Catherine Waddell","02 6338 3553","catherine.waddell@essentialenergy.com.au",null,null,"YES","YES","NO",null,"CBD","Urban","Short rural","Long rural"]
[null,"Jemena Electricity","Jemena Electricity",82064651083,"Vic","Electricity","Distribution","Revenue cap","Calendar","December",5,5,2,"2016-20 Distribution Determination","Level 16","567 Collins Street","MELBOURNE","VIC","3000","PO Box 16182",null,"MELBOURNE","VIC",8001,"Robert McMillan","03 9173 7000","robert.mcmillan@jemena.com.au",null,null,"YES","NO","NO",null,"CBD","Urban","Short rural","Long rural"]
[null,"Multinet Gas","Multinet Gas (DB No.1) Pty Ltd (ACN 086 026 986), Multinet Gas (DB No.2) Pty Ltd (ACN 086 230 122)",86026986,"Vic","Gas","Distribution",null,"Calendar","December",5,5,"x"]
[null,"Murraylink","Murraylink",79181207909,"SA","Electricity","Transmission","Revenue cap","Financial","June",5,5,5,"transmission determination",null,null,null,null,null,null,null,null,null,null,null,null,null,null,null,null,null,null,null,"CBD","Urban","Short rural","Long rural"]
[null,"Powercor Australia","Powercor Australia",89064651109,"Vic","Electricity","Distribution","Revenue cap","Calendar","December",5,5,2,"2016-20 Distribution Determination","40 Market Street",null,"MELBOURNE","Vic","3000","Locked bag 14090",null,"MELBOURNE","VIC",8001,"Hannah Williams","03 9683 4088","hwilliams@powercor.com.au",null,null,"YES","YES","NO",null,"CBD","Urban","Short rural","Long rural"]
[null,"Powerlink","Queensland Electricity Transmission Corporation Limited trading as Powerlink Queensland",82078849233,"Qld","Electricity","Transmission","Revenue cap","Financial","June",5,5,5,"transmission determination","33 Harold St",null,"VIRGINIA","Qld","4014","PO Box 1193",null,"VIRGINIA","QLD",4014,"Jennifer Harris","07 3860 2667","jharris@powerlink.com.au",null,null,null,null,null,null,"CBD","Urban","Short rural","Long rural"]
[null,"Roma to Brisbane Pipeline","APT Petroleum Pipelines Limited t/a Roma to Brisbane Pipeline","009 737 393","Qld","Gas","Distribution","?","Financial","June",5,5,"x","n/a",null,null,null,null,null,null,null,null,null,null,null,null,null,null,null,null,null,null,null,"CBD","Urban","Short rural","Long rural"]
[null,"SA Power Networks","SA Power Networks",13332330749,"SA","Electricity","Distribution","Revenue cap","Financial","June",5,5,5,"2015-20 Distribution Determination","1 Anzac Highway",null,"KESWICK","SA","5035","GPO Box 77",null,"ADELAIDE","SA",null,"Damien O'Connor","08 8404 5066","damien.oconnor@sapowernetworks.com.au",null,null,"YES","YES","NO",null,"CBD","Urban","Short rural","Long rural"]
[null,"TasNetworks (D)","TasNetworks (D)",24167357299,"Tas","Electricity","Distribution","Revenue cap","Financial","June",5,5,5,"distribution determination","21 Kirksway Place",null,"HOBART","Tas","7000","GPO Box 191",null,"HOBART","Tas",null,"Leigh Mayne","03 6270 3691","rrp2012@auroraenergy.com.au",null,null,"YES","YES","YES",null,"Critical Infrastructure","High density commercial","Urban","High density rural","Low density rural"]
[null,"TasNetworks (T)","TasNetworks (T)",24167357299,"Tas","Electricity","Transmission","Revenue cap","Financial","March",5,5,5,"transmission determination","1-7 Maria Street",null,"LENAH VALLEY","Tas","7008","PO Box 606",null,"MOONAH","Tas",null,"Heath Dillon","03 6274 3664","heath.dillon@transend.com.au",null,null,null,null,null,null,"CBD","Urban","Short rural","Long rural"]
[null,"TransGrid","TransGrid",19622755774,"NSW","Electricity","Transmission","Revenue cap","Financial","June",5,4,5,"transmission determination","180 Thomas Street",null,"HAYMARKET","NSW","2000","PO Box A1000",null,"SYDNEY SOUTH","NSW",null,"Andrew Kingsmill","02 9284 3149","andrew.kingsmill@transgrid.com.au",null,null,null,null,null,null,"CBD","Urban","Short rural","Long rural"]
[null,"United Energy","United Energy",70064651029,"Vic","Electricity","Distribution","Revenue cap","Calendar","December",5,5,2,"2016-20 Distribution Determination","Level 3","6 Nexus Court","MULGRAVE","Vic","3149","PO Box 449",null,"MOUNT WAVERLEY","VIC",3170,"Mathew Abraham","03 8846 9758","mathew.abraham@ue.com.au",null,null,"YES","NO","NO",null,"CBD","Urban","Short rural","Long rural"]
[null,"Western Power (D)","Western Power (D)",18540492861,"WA","Electricity","Distribution","Revenue cap","Financial","June",12,4,"x","distribution determination","363 Wellington Street",null,"PERTH","WA","6000","GPO Box L921",null,"PERTH","WA",6842,"Judy Hunter","08 9326 6239","judy.hunter@westernpower.com.au",null,null,"YES","YES","NO","NO","CBD","Urban","Short rural","Long rural"]
[null,"Western Power (T)","Western Power (T)",18540492861,"WA","Electricity","Transmission","Revenue cap","Financial","June",12,4,"x","transmission determination","363 Wellington Street",null,"PERTH","WA","6000","GPO Box L921",null,"PERTH","WA",6842,"Judy Hunter","08 9326 6239","judy.hunter@westernpower.com.au",null,null,"YES","YES","NO",null,"CBD","Urban","Short rural","Long rural"]
[]
[]
[null,null,null,null,null,null,null,null,null,null,null,null,null,null,null,null,null,null,null,null,null,null,"For EB & Reset RINs only"]
[null,"The Reg Year Ending (dms_RYE) must be set to the last year of the regulatory period. For forecast data is is usually (FRCP_y5) for actual it is a single year (CRY). For historical actual data the RYE will need to be set manually in the business details sheet by setting the dms_Multiyear_flag to 1 and putting the correct value in 'dms_Specified_FinalYear. See cells C67:C68",null,null,null,null,{"$f":"IF(dms_RPT=\"financial\",VALUE(LEFT(CRCP_y1,4)-1)&\"-\"&TEXT(VALUE(RIGHT(CRCP_y1,2)-1),\"00\"),VALUE(LEFT(CRCP_y1,4)-1))","v":"2012-13"},null,null,null,null,null,null,"Drop down selector box for CA & Reset RINs.","For CA & Reset RINs only",null,null,null,null,null,null,null,"for DNSP only",null,null,null,null,null,null,null,null,null,null,"Reason for interruption","dms_Reason_Interruption_Detailed","dms_Reason_Interruption"]
[null,"dms_Model_List ","DELETE NR 'CRY' IF NOT AN ANNUAL RIN (EB, CA , ARR)",null,"dms_RYE_Formula_Result",null,null,null,null,null,null,null,null,"dms_0203_ProjectType","dms_020303_01_UOM","dms_020501_01_UOM","dms_020501_02_UOM","dms_020501_03_UOM","dms_020501_04_UOM","dms_020603_01_UOM","dms_040102_01_UOM","dms_040102_04_UOM","dms_030601_01_UOM","dms_030601_02_UOM","dms_030701_01_UOM","dms_030702_01_UOM","dms_030703_01_UOM",null,null,null,null,null,null,"Animal","Animal impact","Animal"]
[null,"ARR","ANNUAL REPORTING STATEMENT",null,{"$f":"LEFT(dms_SingleYear_FinalYear_Result,2)&RIGHT(dms_SingleYear_FinalYear_Result,2)","v":{"$error":"#REF!"}},"=LEFT(dms_SingleYear_FinalYear_Result,2)&RIGHT(dms_SingleYear_FinalYear_Result,2)",null,"Formula errors are OK",null,null,null,null,null,"New line on new route - single circuit","Circuit line length in km","0's","0's","0's","0's","0's","0's","days","minutes/customer","minutes/customer","Customer / km","%","km",null,null,null,null,null,null,null,"Animal nesting/burrowing, etc and other","Asset failure"]
[null,"CA","CATEGORY ANALYSIS",null,{"$f":"LEFT(dms_SingleYear_FinalYear_Result,2)&RIGHT(dms_SingleYear_FinalYear_Result,2)","v":{"$error":"#REF!"}},"=LEFT(dms_SingleYear_FinalYear_Result,2)&RIGHT(dms_SingleYear_FinalYear_Result,2)",null,"Formula errors are OK",null,null,null,null,null,"New line on new route - dual circuit","Circuit line length in km","0's","0's","0's","0's","0's","0's","0's","minutes/customer","minutes/customer","MWh/customer","Number of spans",null,null,null,null,null,null,null,null,"Other","Other"]
[null,"CPI","CPI",null,null,null,null,null,null,null,null,null,null,"New line on new route - other","Circuit line length in km","MVA added","MVA added","MVA added","MVA added","0's","0's","$0s real","interruptions/customer","interruptions/customer","kVA / customer","Number of spans",null,null,null,null,null,null,null,"Asset failure","LV","Overloads"]
[null,"EB","ECONOMIC BENCHMARKING",null,{"$f":"LEFT(dms_SingleYear_FinalYear_Result,2)&RIGHT(dms_SingleYear_FinalYear_Result,2)","v":{"$error":"#REF!"}},"=LEFT(dms_SingleYear_FinalYear_Result,2)&RIGHT(dms_SingleYear_FinalYear_Result,2)",null,"Formula errors are OK",null,null,null,null,null,"Line rebuild over existing route - single circuit","Circuit line length in km","0's","0's","0's","0's","0's","$0s real","0's","interruptions/customer","interruptions/customer",null,"Number of spans",null,null,null,null,null,null,null,null,"Distribution substation","Planned"]
[null,"PTRM","POST TAX REVENUE MODEL",null,{"$f":"LEFT(dms_MultiYear_FinalYear_Result,2)&RIGHT(dms_MultiYear_FinalYear_Result,2)","v":"2023"},"=LEFT(dms_MultiYear_FinalYear_Result,2)&RIGHT(dms_MultiYear_FinalYear_Result,2)",null,null,null,null,null,null,null,"Line rebuild over existing route - dual circuit","Number","total spend $0s real","total spend $0s real","total spend $0s real","total spend $0s real","(per cent)",null,null,null,null,null,"Number of spans",null,null,null,null,null,null,null,null,"HV","Network business"]
[null,"Reset","REGULATORY REPORTING STATEMENT",null,{"$f":"LEFT(dms_MultiYear_FinalYear_Result,2)&RIGHT(dms_MultiYear_FinalYear_Result,2)","v":"2023"},"=LEFT(dms_MultiYear_FinalYear_Result,2)&RIGHT(dms_MultiYear_FinalYear_Result,2)",null,"Formula errors are OK",null,null,null,null,null,"Reconductor - Single circuit","Number","net circuit km added","net circuit km added","net circuit km added","net circuit km added",null,null,null,null,null,null,"Years",null,null,null,null,null,null,null,null,"Zone substation","Third party"]
[null,"RFM","ROLL FORWARD MODEL",null,{"$f":"LEFT(dms_CRCP_FinalYear_Result,2)&RIGHT(dms_CRCP_FinalYear_Result,2)","v":"2018"},"=LEFT(dms_CRCP_FinalYear_Result,2)&RIGHT(dms_CRCP_FinalYear_Result,2)",null,null,null,null,null,null,null,"Reconductor - Dual circuit","Number","total spend $0s real","total spend $0s real","total spend $0s real","total spend $0s real",null,null,null,null,null,null,"Years",null,null,null,null,null,null,null,null,"Subtransmission","Unknown"]
[null,"WACC","WEIGHTED AVERAGE COST OF CAPITAL",null,{"$f":"LEFT(dms_MultiYear_FinalYear_Result,2)&RIGHT(dms_MultiYear_FinalYear_Result,2)","v":"2023"},"=LEFT(dms_MultiYear_FinalYear_Result,2)&RIGHT(dms_MultiYear_FinalYear_Result,2)",null,null,null,null,null,null,null,"Other",null,"net circuit km added","net circuit km added","net circuit km added","net circuit km added",null,null,null,null,null,null,"Trees",null,null,null,null,null,null,null,"Other","insert description of 'other'","Vegetation"]
[null,null,null,null,null,null,null,null,null,null,null,null,null,null,null,"total spend $0s real","total spend $0s real","total spend $0s real","total spend $0s real",null,null,null,null,null,null,"Trees",null,null,null,null,null,null,null,"Overloads","-","Weather"]
[null,null,null,null,null,null,null,null,null,null,null,null,null,null,null,"0's",null,"$0s real",null,null,null,null,null,null,null,"Defects",null,null,null,null,null,null,null,"Planned","-","2 - STPIS Exclusion (3.3)(a)"]
[null,null,null,null,null,null,null,null,null,null,null,null,null,null,null,"0's",null,null,null,null,null,null,null,null,null,"Defects",null,null,null,null,null,null,null,"Network business","Network error","3 - STPIS Exclusion (3.3)(a)"]
[null,null,null,null,null,null,null,null,null,null,null,null,null,null,null,"0's",null,null,null,null,null,null,null,null,null,"Spans",null,null,null,null,null,null,null,null,"Switching and protection error","4 - STPIS Exclusion (3.3)(a)"]
[null,null,null,null,null,null,null,null,null,null,null,null,null,null,null,"$0s real",null,null,null,null,null,null,null,null,null,"km",null,null,null,null,null,null,null,"Third party","Fire","5 - STPIS Exclusion (3.3)(a)"]
[null,null,null,null,null,null,null,null,null,null,null,null,null,null,null,null,null,null,null,null,null,null,null,null,null,"Spans",null,null,"",null,null,null,null,null,"Other","6 - STPIS Exclusion (3.3)(a)"]
[null,null,null,null,null,null,null,null,null,null,null,null,null,null,null,null,null,null,null,null,null,null,null,null,null,null,null,null,null,null,null,null,null,null,"Dig-in","7 - STPIS Exclusion (3.3)(a)"]
[null,null,null,null,null,null,null,null,null,null,null,null,null,null,null,null,null,null,null,null,null,null,null,null,null,null,null,null,null,null,null,null,null,null,"Unauthorised access"]
[null,"For all files either AER or business needs to be able to specify the type of submission","For PTRM & RFM templates we must provide a choice in case they change their form of control - otherwise it is drawn from the business specific lookup table above.",null,"These are indeces and lookup values for various dates. All step from the value placed in FRCP_y1 on the business and other details worksheet",null,null,null,null,null,null,null,null,null,null,null,null,null,null,null,null,null,"for TNSP only",null,null,null,null,null,null,null,null,null,null,null,"Vehicle impact"]
[null,"dms_SourceList","dms_FormControl_Choices",null,"dms_FRCPlength_Num_List","dms_FinalYear_List","dms_CRCPlength_Num_List","dms_CFinalYear_List","dms_FRCP_years",null,"dms_CRCP_years",null,"dms_CRCP_index",null,null,null,null,null,null,null,null,null,"dms_030601_01_UOM",null,"dms_030701_01_UOM","dms_030702_01_UOM",null,null,null,null,null,null,null,"Unknown","Unknown"]
[null,"After appeal","Revenue cap",null,1,"dms_FRCP_y1",1,"CRCP_y1",{"$f":"FRCP_y1","v":"2018-19"},"dms_FRCP_y1",{"$f":"IF(dms_RPT=\"financial\",VALUE(LEFT(dms_FRCP_y1,4)-1)&\"-\"&TEXT(VALUE(MID(dms_FRCP_y1,3,2)),\"00\"),VALUE(LEFT(dms_FRCP_y1,4)-1))","v":"2017-18"},"dms_CRCP_yZ",1,null,null,null,null,null,null,null,null,null,"%",null,"Number of spans","km",null,null,null,null,null,null,null,"Vegetation","Blow-in/Fall-in - NSP responsibility"]
[null,"Draft decision","Revenue yield",null,2,"dms_FRCP_y2",2,"CRCP_y2",{"$f":"IF(dms_RPT=\"financial\",VALUE(LEFT(dms_FRCP_y1,4)+1)&\"-\"&TEXT(VALUE(RIGHT(dms_FRCP_y1,2)+1),\"00\"),VALUE(LEFT(dms_FRCP_y1,4)+1))","v":"2019-20"},"dms_FRCP_y2",{"$f":"IF(dms_RPT=\"financial\",VALUE(LEFT(dms_CRCP_yZ,4)-1)&\"-\"&TEXT(VALUE(MID(dms_CRCP_yZ,3,2)),\"00\"),VALUE(LEFT(dms_CRCP_yZ,4)-1))","v":"2016-17"},"dms_CRCP_yY",2,null,null,null,null,null,null,null,null,null,"number",null,"Years","%",null,null,null,null,null,null,null,null,"Grow-in - NSP responsibility"]
[null,"Final decision","Weighted average price cap",null,3,"dms_FRCP_y3",3,"CRCP_y3",{"$f":"IF(dms_RPT=\"financial\",VALUE(LEFT(dms_FRCP_y2,4)+1)&\"-\"&TEXT(VALUE(RIGHT(dms_FRCP_y2,2)+1),\"00\"),VALUE(LEFT(dms_FRCP_y2,4)+1))","v":"2020-21"},"dms_FRCP_y3",{"$f":"IF(dms_RPT=\"financial\",VALUE(LEFT(dms_CRCP_yY,4)-1)&\"-\"&TEXT(VALUE(MID(dms_CRCP_yY,3,2)),\"00\"),VALUE(LEFT(dms_CRCP_yY,4)-1))","v":"2015-16"},"dms_CRCP_yX",3,null,null,null,null,null,null,null,null,null,"number",null,"Trees","km",null,null,null,null,null,null,null,null,"Blow-in/Fall-in - Other responsible party"]
[null,"PTRM update 1",null,null,4,"dms_FRCP_y4",4,"CRCP_y4",{"$f":"IF(dms_RPT=\"financial\",VALUE(LEFT(dms_FRCP_y3,4)+1)&\"-\"&TEXT(VALUE(RIGHT(dms_FRCP_y3,2)+1),\"00\"),VALUE(LEFT(dms_FRCP_y3,4)+1))","v":"2021-22"},"dms_FRCP_y4",{"$f":"IF(dms_RPT=\"financial\",VALUE(LEFT(dms_CRCP_yX,4)-1)&\"-\"&TEXT(VALUE(MID(dms_CRCP_yX,3,2)),\"00\"),VALUE(LEFT(dms_CRCP_yX,4)-1))","v":"2014-15"},"dms_CRCP_yW",4,null,null,null,null,null,null,null,null,null,"%",null,"Defects","number",null,null,null,null,null,null,null,null,"Grow-in - Other responsible party"]
[null,"PTRM update 2",null,null,5,"dms_FRCP_y5",5,"CRCP_y5",{"$f":"IF(dms_RPT=\"financial\",VALUE(LEFT(dms_FRCP_y4,4)+1)&\"-\"&TEXT(VALUE(RIGHT(dms_FRCP_y4,2)+1),\"00\"),VALUE(LEFT(dms_FRCP_y4,4)+1))","v":"2022-23"},"dms_FRCP_y5",{"$f":"IF(dms_RPT=\"financial\",VALUE(LEFT(dms_CRCP_yW,4)-1)&\"-\"&TEXT(VALUE(MID(dms_CRCP_yW,3,2)),\"00\"),VALUE(LEFT(dms_CRCP_yW,4)-1))","v":"2013-14"},"dms_CRCP_yV",5,null,null,null,null,null,null,null,null,null,"number",null,"Number of spans",null,null,null,null,null,null,null,null,"Weather"]
[null,"PTRM update 3",null,null,6,"dms_FRCP_y6",6,"CRCP_y6",{"$f":"IF(dms_RPT=\"financial\",VALUE(LEFT(dms_FRCP_y5,4)+1)&\"-\"&TEXT(VALUE(RIGHT(dms_FRCP_y5,2)+1),\"00\"),VALUE(LEFT(dms_FRCP_y5,4)+1))","v":"2023-24"},"dms_FRCP_y6",{"$f":"IF(dms_RPT=\"financial\",VALUE(LEFT(dms_CRCP_yV,4)-1)&\"-\"&TEXT(VALUE(MID(dms_CRCP_yV,3,2)),\"00\"),VALUE(LEFT(dms_CRCP_yV,4)-1))","v":"2012-13"},"dms_CRCP_yU",6,null,null,null,null,null,null,null,null,null,"number",null,"km",null,null,null,null,null,null,null,null,"2 - STPIS Exclusion (3.3)(a)"]
[null,"PTRM update 4",null,null,7,"dms_FRCP_y7",7,"CRCP_y7",{"$f":"IF(dms_RPT=\"financial\",VALUE(LEFT(dms_FRCP_y6,4)+1)&\"-\"&TEXT(VALUE(RIGHT(dms_FRCP_y6,2)+1),\"00\"),VALUE(LEFT(dms_FRCP_y6,4)+1))","v":"2024-25"},"dms_FRCP_y7",{"$f":"IF(dms_RPT=\"financial\",VALUE(LEFT(dms_CRCP_yU,4)-1)&\"-\"&TEXT(VALUE(MID(dms_CRCP_yU,3,2)),\"00\"),VALUE(LEFT(dms_CRCP_yU,4)-1))","v":"2011-12"},"dms_CRCP_yT",7,null,null,null,null,null,null,null,null,null,"%",null,"km",null,null,null,null,null,null,null,null,"3 - STPIS Exclusion (3.3)(a)"]
[null,"PTRM update 5",null,null,8,"dms_FRCP_y8",8,"CRCP_y8",{"$f":"IF(dms_RPT=\"financial\",VALUE(LEFT(dms_FRCP_y7,4)+1)&\"-\"&TEXT(VALUE(RIGHT(dms_FRCP_y7,2)+1),\"00\"),VALUE(LEFT(dms_FRCP_y7,4)+1))","v":"2025-26"},"dms_FRCP_y8",{"$f":"IF(dms_RPT=\"financial\",VALUE(LEFT(dms_CRCP_yT,4)-1)&\"-\"&TEXT(VALUE(MID(dms_CRCP_yT,3,2)),\"00\"),VALUE(LEFT(dms_CRCP_yT,4)-1))","v":"2010-11"},"dms_CRCP_yS",8,null,null,null,null,null,null,null,null,null,"number",null,"Number of spans",null,null,null,null,null,null,null,null,"4 - STPIS Exclusion (3.3)(a)"]
[null,"PTRM update 6",null,null,9,"dms_FRCP_y9",9,"CRCP_y9",{"$f":"IF(dms_RPT=\"financial\",VALUE(LEFT(dms_FRCP_y8,4)+1)&\"-\"&TEXT(VALUE(RIGHT(dms_FRCP_y8,2)+1),\"00\"),VALUE(LEFT(dms_FRCP_y8,4)+1))","v":"2026-27"},"dms_FRCP_y9",{"$f":"IF(dms_RPT=\"financial\",VALUE(LEFT(dms_CRCP_yS,4)-1)&\"-\"&TEXT(VALUE(MID(dms_CRCP_yS,3,2)),\"00\"),VALUE(LEFT(dms_CRCP_yS,4)-1))","v":"2009-10"},"dms_CRCP_yR",9,null,null,null,null,null,null,null,null,null,"number",null,null,null,null,null,null,null,null,null,null,"5 - STPIS Exclusion (3.3)(a)"]
[null,"PTRM update 7",null,null,10,"dms_FRCP_y10",10,"CRCP_y10",{"$f":"IF(dms_RPT=\"financial\",VALUE(LEFT(dms_FRCP_y9,4)+1)&\"-\"&TEXT(VALUE(RIGHT(dms_FRCP_y9,2)+1),\"00\"),VALUE(LEFT(dms_FRCP_y9,4)+1))","v":"2027-28"},"dms_FRCP_y10",{"$f":"IF(dms_RPT=\"financial\",VALUE(LEFT(dms_CRCP_yR,4)-1)&\"-\"&TEXT(VALUE(MID(dms_CRCP_yR,3,2)),\"00\"),VALUE(LEFT(dms_CRCP_yR,4)-1))","v":"2008-09"},"dms_CRCP_yQ",10,null,null,null,null,null,null,null,null,null,"%",null,null,null,null,null,null,null,null,null,null,"6 - STPIS Exclusion (3.3)(a)"]
[null,"Regulatory proposal",null,null,11,"dms_FRCP_y11",11,"CRCP_y11",{"$f":"IF(dms_RPT=\"financial\",VALUE(LEFT(dms_FRCP_y10,4)+1)&\"-\"&TEXT(VALUE(RIGHT(dms_FRCP_y10,2)+1),\"00\"),VALUE(LEFT(dms_FRCP_y10,4)+1))","v":"2028-29"},"dms_FRCP_y11",{"$f":"IF(dms_RPT=\"financial\",VALUE(LEFT(dms_CRCP_yQ,4)-1)&\"-\"&TEXT(VALUE(MID(dms_CRCP_yQ,3,2)),\"00\"),VALUE(LEFT(dms_CRCP_yQ,4)-1))","v":"2007-08"},"dms_CRCP_yP",11,null,null,null,null,null,null,null,null,null,"number",null,null,null,null,null,null,null,null,null,null,"7 - STPIS Exclusion (3.3)(a)"]
[null,"Reporting",null,null,12,"dms_FRCP_y12",12,"CRCP_y12",{"$f":"IF(dms_RPT=\"financial\",VALUE(LEFT(dms_FRCP_y11,4)+1)&\"-\"&TEXT(VALUE(RIGHT(dms_FRCP_y11,2)+1),\"00\"),VALUE(LEFT(dms_FRCP_y11,4)+1))","v":"2029-30"},"dms_FRCP_y12",{"$f":"IF(dms_RPT=\"financial\",VALUE(LEFT(dms_CRCP_yP,4)-1)&\"-\"&TEXT(VALUE(MID(dms_CRCP_yP,3,2)),\"00\"),VALUE(LEFT(dms_CRCP_yP,4)-1))","v":"2006-07"},"dms_CRCP_yO",12,null,null,null,null,null,null,null,null,null,"%"]
[null,"Revised regulatory proposal",null,null,13,"dms_FRCP_y13",13,"CRCP_y13",{"$f":"IF(dms_RPT=\"financial\",VALUE(LEFT(dms_FRCP_y12,4)+1)&\"-\"&TEXT(VALUE(RIGHT(dms_FRCP_y12,2)+1),\"00\"),VALUE(LEFT(dms_FRCP_y12,4)+1))","v":"2030-31"},"dms_FRCP_y13",{"$f":"IF(dms_RPT=\"financial\",VALUE(LEFT(dms_CRCP_yO,4)-1)&\"-\"&TEXT(VALUE(MID(dms_CRCP_yO,3,2)),\"00\"),VALUE(LEFT(dms_CRCP_yO,4)-1))","v":"2005-06"},"dms_CRCP_yN",13,null,null,null,null,null,null,null,null,null,"number"]
[null,"RFM annual update",null,null,14,"dms_FRCP_y14",14,"CRCP_y14",{"$f":"IF(dms_RPT=\"financial\",VALUE(LEFT(dms_FRCP_y13,4)+1)&\"-\"&TEXT(VALUE(RIGHT(dms_FRCP_y13,2)+1),\"00\"),VALUE(LEFT(dms_FRCP_y13,4)+1))","v":"2031-32"},"dms_FRCP_y14",{"$f":"IF(dms_RPT=\"financial\",VALUE(LEFT(dms_CRCP_yN,4)-1)&\"-\"&TEXT(VALUE(MID(dms_CRCP_yN,3,2)),\"00\"),VALUE(LEFT(dms_CRCP_yN,4)-1))","v":"2004-05"},"dms_CRCP_yM",14,null,null,null,null,null,null,null,null,null,"%"]
[null,null,null,null,15,"dms_FRCP_y15",15,"CRCP_y15",{"$f":"IF(dms_RPT=\"financial\",VALUE(LEFT(dms_FRCP_y14,4)+1)&\"-\"&TEXT(VALUE(RIGHT(dms_FRCP_y14,2)+1),\"00\"),VALUE(LEFT(dms_FRCP_y14,4)+1))","v":"2032-33"},"dms_FRCP_y15",{"$f":"IF(dms_RPT=\"financial\",VALUE(LEFT(dms_CRCP_yM,4)-1)&\"-\"&TEXT(VALUE(MID(dms_CRCP_yM,3,2)),\"00\"),VALUE(LEFT(dms_CRCP_yM,4)-1))","v":"2003-04"},"dms_CRCP_yL",15,null,null,null,null,null,null,null,null,null,"number"]
[]
[null,"dms_DataQuality_List",null,null,"These are drop down lists for businesses to select the correct FRCP_y1 on the business and other details worksheet.\nThis also populates the column headings in the worksheets"]
[null,"Actual",null,null,"dms_RCP_fyear_list","dms_CRY_ListF","dms_CRY_ListC","dms_RCP_cyear_list","dms_FRCP_fyear_list","dms_FRCP_ListF","dms_FRCP_ListC","dms_FRCP_cyear_list"]
[null,"Estimate",null,null,"dms_fy1","2006-07",2007,"dms_cy1","dms_frcp_fy1","2016-17","2017","dms_crcp_cy1"]
[null,"Consolidated",null,null,"dms_fy2","2007-08","2008","dms_cy2","dms_frcp_fy2","2017-18","2018","dms_crcp_cy2"]
[null,"Recast",null,null,"dms_fy3","2008-09","2009","dms_cy3","dms_frcp_fy3","2018-19","2019","dms_crcp_cy3"]
[null,"Public",null,null,"dms_fy4","2009-10","2010","dms_cy4","dms_frcp_fy4","2019-20","2020","dms_crcp_cy4"]
[null,null,null,null,"dms_fy5","2010-11","2011","dms_cy5","dms_frcp_fy5","2020-21","2021","dms_crcp_cy5"]
[null,null,null,null,"dms_fy6","2011-12","2012","dms_cy6","dms_frcp_fy6","2021-22","2022","dms_crcp_cy6"]
[null,null,null,null,"dms_fy7","2012-13","2013","dms_cy7","dms_frcp_fy7","2022-23","2023","dms_crcp_cy7"]
[null,null,null,null,"dms_fy8","2013-14","2014","dms_cy8","dms_frcp_fy8","2023-24","2024","dms_crcp_cy8"]
[null,null,null,null,"dms_fy9","2014-15","2015","dms_cy9","dms_frcp_fy9","2024-25","2025","dms_crcp_cy9"]
[null,null,null,null,"dms_fy10","2015-16","2016","dms_cy10","dms_frcp_fy10","2025-26","2026","dms_crcp_cy10"]
[null,null,null,null,"dms_fy11","2016-17","2017","dms_cy11","dms_frcp_fy11","2026-27","2027","dms_crcp_cy11"]
[null,null,null,null,"dms_fy12","2017-18","2018","dms_cy12","dms_frcp_fy12","2027-28","2028","dms_crcp_cy12"]
[null,null,null,null,"dms_fy13","2018-19",2019,"dms_cy13","dms_frcp_fy13","2028-29","2029","dms_crcp_cy13"]
[null,null,null,null,"dms_fy14","2019-20","2020","dms_cy14","dms_frcp_fy14","2029-30","2030","dms_crcp_cy14"]
[null,null,null,null,"dms_fy15","2020-21","2021","dms_cy15","dms_frcp_fy15","2030-31","2031","dms_crcp_cy15"]

{"sheet":"Instructions","index":1,"n_rows":27,"n_cols":4,"rows_kept":27,"cut":false,"hidden":false,"merged":[[25,2,25,3],[26,2,26,4],[24,2,24,4],[1,1,1,5],[2,1,2,5],[3,2,3,4],[4,2,4,4],[5,2,5,4],[7,2,7,3],[8,2,8,4],[10,2,10,4],[12,2,12,4],[20,2,20,4],[22,2,22,4]]}
[]
[null,{"$f":"CONCATENATE(dms_Segment,\" Network Service Provider\")","v":"Transmission Network Service Provider"}]
[null,{"$f":"IF(dms_Model=\"Reset\",\"Regulatory Proposal RIN Template\",\"Annual Reporting RIN\")","v":"Regulatory Proposal RIN Template"}]
[null,null,{"$f":"CONCATENATE(\"This template is to be used by \",dms_TradingName,\" to fulfil its reporting obligations to the AER.\")","v":"This template is to be used by ElectraNet to fulfil its reporting obligations to the AER."}]
[null,null,"INSTRUCTIONS"]
[null,null,"Complete the Business & other details worksheet before entering data or values in any other worksheets. The Business & other details worksheet is linked to other worksheets within the workbook and automatically generates certain column headings and conditional formatting."]
[]
[null,null,"Identifying CONFIDENTIAL INFORMATION:\n\nPlease use the macro at the top of each \nworksheet to identify confidential information. \n\n"]
[null,null,"-Do this by selecting the cell or cells that contain confidential information and then run the Mark selection CONFIDENTIAL macro. This will format the cells a specific colour that is identified by the AER's database which in turn marks that information as confidential.\n\n-To reverse this, select the cell or cells and run the Return selection to NON-CONFIDENTIAL macro."]
[]
[null,null,"UNITS OF MEASURE\n\nAll amounts are to be unrounded and reported on a one for one basis: that is 1000 is to be entered as '1000'. Applicable units of measure may be identified in the table column headings or row descriptors.\n\n"]
[]
[null,null,"COLOUR CODING OF INPUT / NON-INPUT CELLS:"]
[null,null,null,"Yellow = Input cell (mandatory)"]
[null,null,null,"Darker yellow = input cell (mandatory)"]
[null,null,null,"Orange = input cell (if data available)"]
[null,null,null,"Grey = Not applicable/No inputs required"]
[null,null,null,"\nPLEASE DO NOT ENTER TEXT into cells that are to contain numeric data."]
[]
[]
[null,null,"WORKSHEET NAVIGATION\n\nMany tables in the worksheets have been \"grouped\" to allow for easy navigation. To ungroup or group data use the outline symbols in the left margin (for Row groupings) or above the columns (for column groupings). \n\n\n"]
[]
[null,null,"RETURNING COMPLETED RESPONSES\n\nPlease return two (2) files to the AER: \n1. A confidential version which must contain a complete set of all responses with confidential information marked using the Mark selected cells CONFIDENTIAL macro and which has been completed using the locked template file provided by the AER. \n\n2. A public version with confidential information either removed completely or aggregated in some form together with writtten consent to disclose the public version of the response.\n\nUse the drop down box on the Business and other details worksheet to identify the file as either confidential ('consolidated') or public. "]
[]
[null,null,"SUBMITTING AMENDED DATA TO THE AER\n\nIf an NSP wishes to correct data previously submitted to the AER it should resubmit that data using the original completed submission as the starting point. Please make any necessary changes to the data. Data that is not being amended should be left unchanged. \n\nNSPs must identify the reason for the amendments in the Amendment Reason box on the  Business and other details worksheet. NSPs may provide further details regarding any amendments in the Amendments worksheet. \n\n."]
[null,null,"NSP may use Amended Data macro \nto highlight cells that contain amended data.\nNB: if data is also CONFIDENTIAL, re-apply \nthe Confidentiality macro after applying the \nAmended macro"]
[null,null,"Please resubmit two (2) files - a confidential version and a public version of the amended submission to the AER"]

{"sheet":"Contents","index":2,"n_rows":26,"n_cols":20,"rows_kept":26,"cut":false,"hidden":false,"merged":[[3,2,3,27]]}
[null,null,"REGULATORY REPORTING STATEMENT\n"]
[null,null,{"$f":"dms_TradingName","v":"ElectraNet"}]
[null,null,{"$f":"CONCATENATE(FRCP_y1,\" to \",FRCP_y5)","v":"2018-19 to 2022-23"}]
[null,null,"Contents"]
[]
[]
[null,null,null,null,null,"1. Business details",null,null,null,null,null,null,"2. Expenditure",null,null,null,null,null,null,"3. Economic benchmarking"]
[]
[]
[]
[]
[]
[]
[]
[]
[]
[]
[]
[]
[]
[]
[]
[]
[]
[]
[null,null,null,null,null,"5. Network information",null,null,null,null,null,null,null,null,null,null,null,null,null,"7. Other templates"]

{"sheet":"Business & other details","index":3,"n_rows":88,"n_cols":12,"rows_kept":88,"cut":false,"hidden":false,"merged":[[7,1,7,8],[11,1,11,8],[13,2,13,4],[14,2,14,4],[17,2,17,3],[17,4,17,7],[82,4,82,8],[18,4,18,7],[19,2,19,3],[19,4,19,7],[22,2,22,3],[22,4,22,7],[23,4,23,7],[24,2,24,3],[24,4,24,7],[32,1,32,8],[49,2,49,3],[51,2,51,8]]}
[null,{"$f":"IF(dms_DataQuality=\"backcast\",INDEX(dms_Worksheet_List,MATCH(dms_Model,dms_Model_List))&\" BACKCAST\",INDEX(dms_Worksheet_List,MATCH(dms_Model,dms_Model_List)))","v":"REGULATORY REPORTING STATEMENT"}]
[null,{"$f":"INDEX(dms_TradingNameFull_List,MATCH(dms_TradingName,dms_TradingName_List))","v":"ElectraNet"}]
[null,{"$f":"IF(SUM(dms_SingleYear_Model)>0,CRY,CONCATENATE(FRCP_y1,\" to \",dms_MultiYear_FinalYear_Result))","v":"2018-19 to 2022-23"}]
[null,"BUSINESS & OTHER DETAILS"]
[]
[]
[null,"Instructions"]
[null,"Complete the following business details regulatory template before entering data or values in any other regulatory template. This regulatory template is linked to other cells within the spreadsheet and automatically generates column headings and conditional formatting to distinguish business specific input and non-input cells. "]
[]
[null,"SUBMISSION PARTICULARS INPUT SHEETS"]
[]
[null,"ENTITY DETAILS"]
[]
[null,"Short name","ElectraNet"]
[null,"ACN / ABN",{"$f":"INDEX(dms_ABN_List,MATCH(dms_TradingName,dms_TradingName_List))","v":41094482416}]
[]
[]
[null,"Business address","Address 1",null,{"$f":"INDEX(dms_Addr1_List,MATCH(dms_TradingName,dms_TradingName_List))","v":"52-55 East Terrace"}]
[null,null,null,"Address 2",{"$f":"IF(ISBLANK(INDEX(dms_Addr2_List,MATCH(dms_TradingName,dms_TradingName_List))),\"\",INDEX(dms_Addr2_List,MATCH(dms_TradingName,dms_TradingName_List)))","v":"Rymill Park"}]
[null,null,"Suburb",null,{"$f":"INDEX(dms_Suburb_List,MATCH(dms_TradingName,dms_TradingName_List))","v":"ADELAIDE"}]
[null,null,null,"State",{"$f":"INDEX(dms_State_List,MATCH(dms_TradingName,dms_TradingName_List))","v":"SA"},"p/code",{"$f":"INDEX(dms_PostCode_List,MATCH(dms_TradingName,dms_TradingName_List))","v":"5000"}]
[]
[null,"Postal address","Address 1",null,{"$f":"INDEX(dms_PAddr1_List,MATCH(dms_TradingName,dms_TradingName_List))","v":"PO Box 7096"}]
[null,null,null,"Address 2",{"$f":"IF(ISBLANK(INDEX(dms_PAddr2_List,MATCH(dms_TradingName,dms_TradingName_List))),\"\",INDEX(dms_PAddr2_List,MATCH(dms_TradingName,dms_TradingName_List)))","v":"Hutt Street Post Office"}]
[null,null,"Suburb",null,{"$f":"INDEX(dms_PSuburb_List,MATCH(dms_TradingName,dms_TradingName_List))","v":"ADELAIDE"}]
[null,null,null,"State",{"$f":"INDEX(dms_PState_List,MATCH(dms_TradingName,dms_TradingName_List))","v":"SA"},"p/code",{"$f":"INDEX(dms_PPostCode_List,MATCH(dms_TradingName,dms_TradingName_List))","v":5000}]
[]
[]
[null,"Contact name/s","Andrew Gniel "]
[null,"Contact phone/s","08 84047219"]
[null,"Contact email address/s","Gniel.Andrew@electranet.com.au"]
[]
[null,"REGULATORY CONTROL PERIODS"]
[]
[null,"Forthcoming regulatory control period","2018-19",{"$f":"dms_FRCP_y2","v":"2019-20"},{"$f":"dms_FRCP_y3","v":"2020-21"},{"$f":"dms_FRCP_y4","v":"2021-22"},{"$f":"dms_FRCP_y5","v":"2022-23"},{"$f":"dms_FRCP_y6","v":"2023-24"},{"$f":"dms_FRCP_y7","v":"2024-25"},{"$f":"dms_FRCP_y8","v":"2025-26"},{"$f":"dms_FRCP_y9","v":"2026-27"},{"$f":"dms_FRCP_y10","v":"2027-28"}]
[]
[]
[null,"Current regulatory control period","2013-14",{"$f":"IF(dms_RPT=\"financial\",VALUE(LEFT(CRCP_y1,4)+1)&\"-\"&TEXT(MID(CRCP_y1,3,2)+2,\"00\"),VALUE(LEFT(CRCP_y1,4)+1))","v":"2014-15"},{"$f":"IF(dms_RPT=\"financial\",VALUE(LEFT(CRCP_y2,4)+1)&\"-\"&TEXT(VALUE(MID(CRCP_y2,3,2)+2),\"00\"),VALUE(LEFT(CRCP_y2,4)+1))","v":"2015-16"},{"$f":"IF(dms_RPT=\"financial\",VALUE(LEFT(CRCP_y3,4)+1)&\"-\"&TEXT(VALUE(MID(CRCP_y3,3,2)+2),\"00\"),VALUE(LEFT(CRCP_y3,4)+1))","v":"2016-17"},{"$f":"IF(dms_RPT=\"financial\",VALUE(LEFT(CRCP_y4,4)+1)&\"-\"&TEXT(VALUE(MID(CRCP_y4,3,2)+2),\"00\"),VALUE(LEFT(CRCP_y4,4)+1))","v":"2017-18"},{"$f":"IF(dms_RPT=\"financial\",VALUE(LEFT(CRCP_y5,4)+1)&\"-\"&TEXT(VALUE(MID(CRCP_y5,3,2)+2),\"00\"),VALUE(LEFT(CRCP_y5,4)+1))","v":"2018-19"},{"$f":"IF(dms_RPT=\"financial\",VALUE(LEFT(CRCP_y6,4)+1)&\"-\"&TEXT(VALUE(MID(CRCP_y6,3,2)+2),\"00\"),VALUE(LEFT(CRCP_y6,4)+1))","v":"2019-20"},{"$f":"IF(dms_RPT=\"financial\",VALUE(LEFT(CRCP_y7,4)+1)&\"-\"&TEXT(VALUE(MID(CRCP_y7,3,2)+2),\"00\"),VALUE(LEFT(CRCP_y7,4)+1))","v":"2020-21"},{"$f":"IF(dms_RPT=\"financial\",VALUE(LEFT(CRCP_y8,4)+1)&\"-\"&TEXT(VALUE(MID(CRCP_y8,3,2)+2),\"00\"),VALUE(LEFT(CRCP_y8,4)+1))","v":"2021-22"},{"$f":"IF(dms_RPT=\"financial\",VALUE(LEFT(CRCP_y9,4)+1)&\"-\"&TEXT(VALUE(MID(CRCP_y9,3,2)+2),\"00\"),VALUE(LEFT(CRCP_y9,4)+1))","v":"2022-23"}]
[]
[]
[null,"Previous regulatory control period",{"$f":"IF(dms_RPT=\"financial\",VALUE(LEFT(PRCP_y2,4)-1)&\"-\"&TEXT(VALUE(MID(PRCP_y2,3,2)),\"00\"),VALUE(LEFT(PRCP_y2,4)-1))","v":"2008-09"},{"$f":"IF(dms_RPT=\"financial\",VALUE(LEFT(PRCP_y3,4)-1)&\"-\"&TEXT(VALUE(MID(PRCP_y3,3,2)),\"00\"),VALUE(LEFT(PRCP_y3,4)-1))","v":"2009-10"},{"$f":"IF(dms_RPT=\"financial\",VALUE(LEFT(PRCP_y4,4)-1)&\"-\"&TEXT(VALUE(MID(PRCP_y4,3,2)),\"00\"),VALUE(LEFT(PRCP_y4,4)-1))","v":"2010-11"},{"$f":"IF(dms_RPT=\"financial\",VALUE(LEFT(PRCP_y5,4)-1)&\"-\"&TEXT(VALUE(RIGHT(PRCP_y5,2)-1),\"00\"),VALUE(LEFT(PRCP_y5,4)-1))","v":"2011-12"},{"$f":"IF(dms_RPT=\"financial\",VALUE(LEFT(CRCP_y1,4)-1)&\"-\"&TEXT(VALUE(RIGHT(CRCP_y1,2)-1),\"00\"),VALUE(LEFT(CRCP_y1,4)-1))","v":"2012-13"}]
[]
[]
[null,"Current regulatory year","2013-14","CRY"]
[]
[]
[null,null,"DELETE NR 'CRY' IF NOT AN ANNUAL RIN (EB, CA , ARR)"]
[null,null,"APPLY NR 'CRY' IF AN ANNUAL RIN (EB, CA , ARR) - including multi year annual RINs eg. Recast CA. EB"]
[]
[null,"Source","Regulatory proposal",null,"Please select the correct submission type from the dropdown list."]
[null,"Data quality (actual, estimate, public, consolidated)","Consolidated"]
[null,"Amended RIN submission - amendment reason"]
[null,"Submission Date","2017-03-28","dms_SubmissionDate","Please enter date this file submitted to AER (dd/mm/yyyy)"]
[null,"EBSS - First application of scheme in forthcoming period?","Yes"]
[null,"Sector",{"$f":"INDEX(dms_Sector_List,MATCH(dms_TradingName,dms_TradingName_List))","v":"Electricity"},"dms_Sector","=INDEX(dms_Sector_List,MATCH(dms_TradingName,dms_TradingName_List))"]
[null,"Segment",{"$f":"INDEX(dms_Segment_List,MATCH(dms_TradingName,dms_TradingName_List))","v":"Transmission"},"dms_Segment","=INDEX(dms_Segment_List,MATCH(dms_TradingName,dms_TradingName_List))"]
[null,"Regulatory Year Ending",{"$f":"IF(dms_MultiYear_Flag=1,LEFT(dms_Specified_FinalYear,2)&RIGHT(dms_Specified_FinalYear,2),INDEX(dms_RYE_Formula_Result,MATCH(dms_Model,dms_Model_List)))","v":"2023"},"dms_RYE","=IF(dms_MultiYear_Flag=1,LEFT(dms_Specified_FinalYear,2)&RIGHT(dms_Specified_FinalYear,2),INDEX(dms_RYE_Formula_Result,MATCH(dms_Model,dms_Model_List)))"]
[null,"Reporting Period Type",{"$f":"INDEX(dms_RPT_List,MATCH(dms_TradingName,dms_TradingName_List))","v":"Financial"},"dms_RPT","=INDEX(dms_RPT_List,MATCH(dms_TradingName,dms_TradingName_List))"]
[null,"Model or RIN Type","Reset","dms_Model","Drop down selection"]
[null,"Security Classification","Public","dms_Classification","Always Public"]
[null,"Template - version no.",5,"dms_TemplateNumber"]
[null,"Dollar $ real month",{"$f":"INDEX(dms_RPTMonth_List,MATCH(dms_TradingName,dms_TradingName_List))","v":"June"},"dms_RPTMonth","=INDEX(dms_RPTMonth_List,MATCH(dms_TradingName,dms_TradingName_List))"]
[null,"Dollar $ real  (the last month before the FRCP_y1)",{"$f":"CONCATENATE(dms_RPTMonth)&\" \"&VALUE((LEFT(dms_CRCP_FinalYear_Result,2)&RIGHT(dms_CRCP_FinalYear_Result,2)))","v":"June 2018"},"dms_DollarReal","=IF(SUM(dms_SingleYear_Model)>0,CONCATENATE(dms_RPTMonth)&\" \"&VALUE((LEFT(CRY,2))&RIGHT(CRY,2)),CONCATENATE(dms_RPTMonth)&\" \"&VALUE((LEFT(dms_CRCP_FinalYear_Result,2)&RIGHT(dms_CRCP_FinalYear_Result,2))))"]
[null,"Form of control",{"$f":"INDEX(dms_FormControl_List,MATCH(dms_TradingName,dms_TradingName_List))","v":"Revenue cap"},"dms_FormControl","=INDEX(dms_FormControl_List,MATCH(dms_TradingName,dms_TradingName_List))"]
[null,"RIN response - version no.",1,"dms_RINversion"]
[null,"Jurisdiction",{"$f":"INDEX(dms_JurisdictionList,MATCH(dms_TradingName,dms_TradingName_List))","v":"SA"},"dms_Jurisdiction","=INDEX(dms_JurisdictionList,MATCH(dms_TradingName,dms_TradingName_List))"]
[null,"Backcast Multiyear EB, CA or ARR?",0,"dms_MultiYear_Flag","1=y, 0-n"]
[null,null,2013,"dms_Specified_FinalYear","The result here is returned to dms_CRCP_FinalYear_Result if dms_MultiYear_Flag is set to 1"]
[null,"Single Year Model T/F",{"$f":"IF(dms_Model=\"EB\",1,0)","v":0},"dms_EB"]
[null,null,{"$f":"IF(dms_Model=\"CA\",1,0)","v":0},"dms_CA","=dms_SingleYear_Model"]
[null,null,{"$f":"IF(dms_Model=\"ARR\",1,0)","v":0},"dms_ARR"]
[null,"Single Year Final Year Reference","CRY","dms_SingleYear_FinalYear_Ref","This is the reference for EB, CA & ARR RINs"]
[null,"Single Year Final Year Result",{"$f":"INDIRECT(dms_SingleYear_FinalYear_Ref)","v":{"$error":"#REF!"}},"dms_SingleYear_FinalYear_Result","=INDIRECT(dms_SingleYear_FinalYear_Ref)",null,null,null,"Formula errors OK"]
[null,"FRCP length in years",{"$f":"INDEX(dms_FRCPlength_List,MATCH(dms_TradingName,dms_TradingName_List))","v":5},"dms_FRCPlength_Num","=INDEX(dms_FRCPlength_List,MATCH(dms_TradingName,dms_TradingName_List))"]
[null,"Multi Year Final Year Reference",{"$f":"INDEX(dms_FinalYear_List,MATCH(dms_FRCPlength_Num,dms_FRCPlength_Num_List))","v":"dms_FRCP_y5"},"dms_MultiYear_FinalYear_Ref","=INDEX(dms_FinalYear_List,MATCH(dms_FRCPlength_Num,dms_FRCPlength_Num_List))"]
[null,"Multi Year Final Year Result",{"$f":"IF(dms_MultiYear_Flag=0,INDIRECT(dms_MultiYear_FinalYear_Ref),dms_Specified_FinalYear)","v":"2022-23"},"dms_MultiYear_FinalYear_Result","=IF(dms_MultiYear_Flag=0,INDIRECT(dms_MultiYear_FinalYear_Ref),dms_Specified_FinalYear)",null,null,null,"Formula errors OK"]
[null,"CRCP length in years",{"$f":"INDEX(dms_CRCPlength_List,MATCH(dms_TradingName,dms_TradingName_List))","v":5},"dms_CRCPlength_Num","=INDEX(dms_CRCPlength_List,MATCH(dms_TradingName,dms_TradingName_List))"]
[null,"CRCP Final Year Reference",{"$f":"INDEX(dms_CFinalYear_List,MATCH(dms_CRCPlength_Num,dms_CRCPlength_Num_List))","v":"CRCP_y5"},"dms_CRCP_FinalYear_Ref","=INDEX(dms_CFinalYear_List,MATCH(dms_CRCPlength_Num,dms_CRCPlength_Num_List))"]
[null,"CRCP First Year Result",{"$f":"INDEX(dms_CRCP_years,MATCH(dms_CRCPlength_Num,dms_CRCP_index))","v":"2013-14"},"dms_CRCP_FirstYear_Result","=INDEX(dms_CRCP_years,MATCH(dms_CRCPlength_Num,dms_CRCP_index))"]
[null,"CRCP Final Year Result",{"$f":"IF(dms_MultiYear_Flag=0,(IF(SUM(dms_SingleYear_Model)>0,CRY,dms_CRCP_yZ)),dms_Specified_FinalYear)","v":"2017-18"},"dms_CRCP_FinalYear_Result","=IF(dms_MultiYear_Flag=0,(IF(SUM(dms_SingleYear_Model)>0,CRY,dms_CRCP_yZ)),dms_Specified_FinalYear)"]
[null,"Table 6.6.3 - Public lighting repair - no. business days",{"$f":"INDEX(dms_663_List,MATCH(dms_TradingName,dms_TradingName_List))","v":5},"dms_663"]
[null,"Distribution Determination Reference",{"$f":"INDEX(dms_DeterminationRef_List,MATCH(dms_TradingName,dms_TradingName_List))","v":"transmission determination"}]
[null,"Backcast templates only - unit of measure ","$0s","dms_Backcast_UOM","If the cover sheet is for Backcast data ensure to apply dms_Backcast_UOM named range to this field. Otherwise, do not apply this named range."]
[null,"EB/CA Unit of Measure for Monetary Values","$0s","dms_dollar_nom_UOM","If the cover sheet is attached to an EB files make sure this field is set"]
[]
[null,"discard this record?","NO","dms_DISCARD","If record is to be discarded from DB set this flag to YES"]
[]
[null,"USES NAMED RANGES FLAG","yes","dms_Defined_Names_Used"]

{"sheet":"2.1 Expenditure summary","index":4,"n_rows":50,"n_cols":9,"rows_kept":50,"cut":false,"hidden":false,"merged":[[42,2,42,8],[8,2,8,8],[20,2,20,8],[31,2,31,8]]}
[null,{"$f":"(LOOKUP(dms_Model,dms_Model_List,dms_Worksheet_List))","v":"REGULATORY REPORTING STATEMENT"}]
[null,{"$f":"INDEX(dms_TradingNameFull_List,MATCH(dms_TradingName,dms_TradingName_List))","v":"ElectraNet"}]
[null,{"$f":"IF(SUM(dms_SingleYear_Model)>0,CRY,CONCATENATE(FRCP_y1,\" to \",dms_MultiYear_FinalYear_Result))","v":"2018-19 to 2022-23"}]
[null,"2.1 - EXPENDITURE SUMMARY AND RECONCILIATION"]
[]
[null,"There are four tables on this worksheet. Each has been grouped for ease of navigation. See the Instructions sheet on how to group or ungroup tables. "]
[]
[null,"2.1.1 - PRESCRIBED TRANSMISSION SERVICES CAPEX (as incurred)"]
[null,null,{"$f":"CONCATENATE(\"Forecast \n($0's. real \",dms_DollarReal,\")\")","v":"Forecast \n($0's. real June 2018)"}]
[null,null,{"$f":"CRCP_y4","v":"2016-17"},{"$f":"CRCP_y5","v":"2017-18"},{"$f":"FRCP_y1","v":"2018-19"},{"$f":"FRCP_y2","v":"2019-20"},{"$f":"FRCP_y3","v":"2020-21"},{"$f":"FRCP_y4","v":"2021-22"},{"$f":"FRCP_y5","v":"2022-23"}]
[null,"Replacement expenditure",102511412.32980889,97554272.200856239,50746774.552847035,75530531.649629086,82943078.138731763,82123087.203897893,40553092.598778307]
[null,"Connections",6509387.7812781706,2577822.9879594594,49149.691559322317,1056689.3206576183,4863062.083810118,2927.1988038349564,0]
[null,"Augmentation Expenditure",23783998.255898569,19443604.227830596,13910208.836637834,2637734.3310745056,4946350.7063697791,3682023.1715161377,2367891.4500445998]
[null,"Non-network",12720700.853766723,9441522.6640625298,9771984.2743072584,7471348.0603367286,7886910.577710975,7870023.8225709712,4974714.9496710869]
[null,"Capitalised network overheads",96540.340805116386,95343.594661067327,97221.863475890335,74045.048513143862,76183.511117329181,64160.039832955437,45077.948277217358]
[null,"Capitalised corporate overheads",10497630.245339839,10367498.132556811,10571737.84576818,8051530.93832915,8284063.6756802723,6976652.1339745112,4901698.3914324744]
[null,"Balancing Item",9890856.756332688,24746048.67803818,11757072.264032442,5481602.7903337553,108138.42409147219,97940.622292409069,617235.21130381699]
[null,"TOTAL  CAPEX",{"$f":"SUM(C11:C17)","v":166010526.56322998},{"$f":"SUM(D11:D17)","v":164226112.48596489},96904149.328627959,100303482.13887396,109107787.1175117,100816814.19288871,53459710.549507506]
[]
[null,"2.1.2 - PRESCRIBED TRANSMISSION SERVICES OPEX"]
[null,null,{"$f":"CONCATENATE(\"Forecast \n($0's. real \",dms_DollarReal,\")\")","v":"Forecast \n($0's. real June 2018)"}]
[null,null,{"$f":"CRCP_y4","v":"2016-17"},{"$f":"CRCP_y5","v":"2017-18"},{"$f":"FRCP_y1","v":"2018-19"},{"$f":"FRCP_y2","v":"2019-20"},{"$f":"FRCP_y3","v":"2020-21"},{"$f":"FRCP_y4","v":"2021-22"},{"$f":"FRCP_y5","v":"2022-23"}]
[null,"Vegetation management",2014117.2690157609,2034159.9963974457,2129319.667304866,2139830.1294292393,2152504.940378461,2168088.136078842,2184497.602366392]
[null,"Maintenance",42380365.582949586,42255501.512946151,40170751.454023272,40369036.929026432,40608153.999227732,40902139.299298584,41211712.63478782]
[null,"Non-network",9725433.757399559,9388943.0099473316,8516973.197987264,8559013.5386586338,8609710.964132905,8672041.5113762505,8737677.0224318746]
[null,"Network overheads",27276976.445275038,26650847.095287509,23354916.586212382,22149821.127596863,22620986.664791312,22179357.270475574,21079381.901146106]
[null,"Corporate overheads",26353391.270283073,25590225.936751761,24758296.6408328,23604835.67799411,23924568.548698638,23454454.607199818,22510945.003202304]
[null,"Balancing Item",-13662743.741102193,-13022752.833220683,-12828169.243454657,-10341852.157242777,-10580136.971638652,-9286514.0465510059,-7220679.8002027581]
[null,"TOTAL OPEX",{"$f":"SUM(C23:C28)","v":94087540.58382082},{"$f":"SUM(D23:D28)","v":92896924.718109488},86102088.302905917,86480685.245462507,87335788.145590395,88089566.777878061,88503534.363731742]
[]
[null,"2.1.7  - PRESCRIBED TRANSMISSION SERVICES CAPCONS"]
[null,null,{"$f":"CONCATENATE(\"Forecast \n($0's. real \",dms_DollarReal,\")\")","v":"Forecast \n($0's. real June 2018)"}]
[null,null,{"$f":"CRCP_y4","v":"2016-17"},{"$f":"CRCP_y5","v":"2017-18"},{"$f":"FRCP_y1","v":"2018-19"},{"$f":"FRCP_y2","v":"2019-20"},{"$f":"FRCP_y3","v":"2020-21"},{"$f":"FRCP_y4","v":"2021-22"},{"$f":"FRCP_y5","v":"2022-23"}]
[null,"Replacement expenditure"]
[null,"Connections"]
[null,"Augmentation Expenditure"]
[null,"Non-network"]
[null,"Capitalised network overheads"]
[null,"Capitalised corporate overheads"]
[null,"TOTAL  CAPCONS",{"$f":"SUM(C34:C39)","v":0},0,0,0,0,0,0]
[]
[null,"2.1.8 - PRESCRIBED TRANSMISSION SERVICES CAPITALISED OVERHEADS"]
[null,null,{"$f":"CONCATENATE(\"Forecast \n($0's. real \",dms_DollarReal,\")\")","v":"Forecast \n($0's. real June 2018)"}]
[null,null,{"$f":"CRCP_y4","v":"2016-17"},{"$f":"CRCP_y5","v":"2017-18"},{"$f":"FRCP_y1","v":"2018-19"},{"$f":"FRCP_y2","v":"2019-20"},{"$f":"FRCP_y3","v":"2020-21"},{"$f":"FRCP_y4","v":"2021-22"},{"$f":"FRCP_y5","v":"2022-23"}]
[null,"Replacement expenditure",6325766.5690052845,5893081.0367416283,7620977.6075091399,5674775.4237245992,5595863.703856972,4729312.1753079379,2789357.634296759]
[null,"Connections",408007.65138938063,238573.80671235744,34293.050079959467,194682.01052385883,162909.9215568151,3312.9148527717489,0]
[null,"Augmentation Expenditure",1434999.7529993234,1175512.679165059,412006.84555759875,599713.21151097934,436612.2466632484,261982.47092296614,176030.38654160278]
[null,"Non-network",1272648.7304993041,1418718.4358815383,1884485.4954308325,1457098.449333251,2141672.9231625111,2016680.927092795,1912086.6368733705]
[null,"Balancing Item",1152747.8822516629,1736955.7687172964,717196.71066654101,199306.89174960664,23188.391558053638,29523.685630994798,69301.681997959196]
[null,"TOTAL  CAPITALISED OVERHEADS",{"$f":"SUM(C45:C49)","v":10594170.586144956},{"$f":"SUM(D45:D49)","v":10462841.727217879},10668959.709244071,8125575.9868422942,8360247.1867976012,7040812.1738074664,4946776.3397096917]

{"sheet":"2.2 Repex","index":5,"n_rows":595,"n_cols":10,"rows_kept":595,"cut":false,"hidden":false,"merged":[[570,1,571,1],[573,1,575,1],[5,1,5,2],[10,3,10,9],[208,3,208,9],[404,3,404,9],[9,3,9,9],[207,3,207,9],[403,3,403,9],[374,1,375,1],[377,1,379,1],[181,1,183,1],[178,1,179,1]]}
[null,{"$f":"(LOOKUP(dms_Model,dms_Model_List,dms_Worksheet_List))","v":"REGULATORY REPORTING STATEMENT"}]
[null,{"$f":"INDEX(dms_TradingNameFull_List,MATCH(dms_TradingName,dms_TradingName_List))","v":"ElectraNet"}]
[null,{"$f":"IF(SUM(dms_SingleYear_Model)>0,CRY,CONCATENATE(FRCP_y1,\" to \",dms_MultiYear_FinalYear_Result))","v":"2018-19 to 2022-23"}]
[null,"2.2 REPEX"]
[]
[null,"There is ONE table (with three sub-tables) on this worksheet. See the Instructions sheet on how to group or ungroup tables. "]
[]
[null,"2.2.1 - REPLACEMENT EXPENDITURE, VOLUMES AND ASSET FAILURES BY ASSET CATEGORY"]
[null,"EXPENDITURE"]
[null,null,null,"EXPENDITURE"]
[null,null,null,{"$f":"CONCATENATE(\"($0's. real \",dms_DollarReal,\")\")","v":"($0's. real June 2018)"}]
[null,"ASSET GROUP","ASSET CATEGORY",{"$f":"CRCP_y4","v":"2016-17"},{"$f":"CRCP_y5","v":"2017-18"},{"$f":"FRCP_y1","v":"2018-19"},{"$f":"FRCP_y2","v":"2019-20"},{"$f":"FRCP_y3","v":"2020-21"},{"$f":"FRCP_y4","v":"2021-22"},{"$f":"FRCP_y5","v":"2022-23"}]
[null,"TRANSMISSION TOWERS\nHighest operating voltage; Circuit configuration","< = 33 kV; Single Circuit",0,0,0,0,0,0,0]
[null,null,"> 33 kV & < = 66 kV ; Single Circuit",0,0,0,0,0,0,0]
[null,null,"> 66 kV & < = 132 kV ; Single Circuit",2485426.1,0,0,393426.61,0,0,0]
[null,null,"> 132 kV & < = 275 kV ; Single Circuit",0,0,0,0,0,0,0]
[null,null,"> 275 kV & < = 330 kV ; Single Circuit",0,0,0,0,0,0,0]
[null,null,"> 330 kV & < = 500 kV  ; Single Circuit",0,0,0,0,0,0,0]
[null,null,"> 500 kV  ; Single Circuit",0,0,0,0,0,0,0]
[null,null,"< = 33 kV; Multiple Circuit",0,0,0,0,0,0,0]
[null,null,"> 33 kV & < = 66 kV ; Multiple Circuit",0,0,0,0,0,0,0]
[null,null,"> 66 kV & < = 132 kV ; Multiple Circuit",0,0,0,268044.52,0,0,0]
[null,null,"> 132 kV & < = 275 kV ; Multiple Circuit",0,0,0,0,0,0,0]
[null,null,"> 275 kV & < = 330 kV ; Multiple Circuit",0,0,0,0,0,0,0]
[null,null,"> 330 kV & < = 500 kV  ; Multiple Circuit",0,0,0,0,0,0,0]
[null,null,"> 500 kV  ; Multiple Circuit",0,0,0,0,0,0,0]
[null,null,"Other",0,0,0,0,0,0,0]
[null,"TRANSMISSION TOWER SUPPORT STRUCTURES BY:\nHighest operating voltage; Circuit configuration","< = 33 kV; Single Circuit",0,0,0,0,0,0,0]
[null,null,"> 33 kV & < = 66 kV ; Single Circuit",0,0,0,0,0,0,0]
[null,null,"> 66 kV & < = 132 kV ; Single Circuit",7071916.7300000004,0,0,1119437.93,0,0,0]
[null,null,"> 132 kV & < = 275 kV ; Single Circuit",0,0,0,0,0,0,0]
[null,null,"> 275 kV & < = 330 kV ; Single Circuit",0,0,0,0,0,0,0]
[null,null,"> 330 kV & < = 500 kV  ; Single Circuit",0,0,0,0,0,0,0]
[null,null,"> 500 kV  ; Single Circuit",0,0,0,0,0,0,0]
[null,null,"< = 33 kV; Multiple Circuit",0,0,0,0,0,0,0]
[null,null,"> 33 kV & < = 66 kV ; Multiple Circuit",0,0,0,0,0,0,0]
[null,null,"> 66 kV & < = 132 kV ; Multiple Circuit",0,0,0,851435.52000000002,0,0,0]
[null,null,"> 132 kV & < = 275 kV ; Multiple Circuit",0,0,0,0,0,0,0]
[null,null,"> 275 kV & < = 330 kV ; Multiple Circuit",0,0,0,0,0,0,0]
[null,null,"> 330 kV & < = 500 kV  ; Multiple Circuit",0,0,0,0,0,0,0]
[null,null,"> 500 kV  ; Multiple Circuit",0,0,0,0,0,0,0]
[null,null,"Other",0,0,0,0,0,0,0]
[null,"CONDUCTORS BY: \nVoltage; Maximum continuous rating","< = 33 kV ; < = 100 MVA",0,0,0,0,0,0,0]
[null,null,"< = 33 kV ; > 100 MVA & < = 400 MVA",0,0,0,0,0,0,0]
[null,null,"< = 33 kV ; > 400 MVA",0,0,0,0,0,0,0]
[null,null,"> 33 kV & < = 66 kV  ; < = 100 MVA",0,0,0,0,0,0,0]
[null,null,"> 33 kV & < = 66 kV  ; > 100 MVA & < = 400 MVA",0,0,0,0,0,0,0]
[null,null,"> 33 kV & < = 66 kV  ; > 400 MVA",0,0,0,0,0,0,0]
[null,null,"> 66 kV & < = 132 kV  ; < = 100 MVA",0,0,0,0,0,0,0]
[null,null,"> 66 kV & < = 132 kV  ; > 100 MVA & < = 400 MVA",3587400.8,0,0,1987516.87,0,0,0]
[null,null,"> 66 kV & < = 132 kV  ; > 400 MVA",0,0,0,0,0,0,0]
[null,null,"> 132 kV & < = 275 kV  ; < = 200 MVA",0,0,0,0,0,0,0]
[null,null,"> 132 kV & < = 275 kV  ; > 200 MVA & < = 600 MVA",0,0,0,0,0,0,0]
[null,null,"> 132 kV & < = 275 kV  ; > 600 MVA",0,0,0,0,0,0,0]
[null,null,"> 275 kV & < = 330 kV  ; < = 800 MVA",0,0,0,0,0,0,0]
[null,null,"> 275 kV & < = 330 kV  ; > 800 MVA & < = 1200 MVA",0,0,0,0,0,0,0]
[null,null,"> 275 kV & < = 330 kV  ; > 1200 MVA",0,0,0,0,0,0,0]
[null,null,"> 330 kV & < = 500 kV   ; < = 1000 MVA",0,0,0,0,0,0,0]
[null,null,"> 330 kV & < = 500 kV   ; > 1000 MVA & < = 1500 MVA",0,0,0,0,0,0,0]
[null,null,"> 330 kV & < = 500 kV   ; > 1500 MVA",0,0,0,0,0,0,0]
[null,null,"> 500 kV   ; < = 2000 MVA",0,0,0,0,0,0,0]
[null,null,"> 500 kV   ; > 2000 MVA & < = 3000 MVA",0,0,0,0,0,0,0]
[null,null,"> 500 kV   ; > 3000 MVA",0,0,0,0,0,0,0]
[null,null,"Other",0,0,0,0,0,0,0]
[null,"TRANSMISSION CABLES BY: \nHighest operating voltage; Insulation type","< = 33 kV; Oil Filled",0,0,0,0,0,0,0]
[null,null,"> 33 kV & < = 66 kV ; Oil Filled",0,0,0,0,0,0,0]
[null,null,"> 66 kV & < = 132 kV ; Oil Filled",0,0,0,0,0,0,0]
[null,null,"> 132 kV & < = 275 kV ; Oil Filled",0,0,0,0,0,0,0]
[null,null,"> 275 kV & < = 330 kV ; Oil Filled",0,0,0,0,0,0,0]
[null,null,"> 330 kV & < = 500 kV  ; Oil Filled",0,0,0,0,0,0,0]
[null,null,"> 500 kV  ; Oil Filled",0,0,0,0,0,0,0]
[null,null,"< = 33 kV; XLPE Insulated",0,0,0,0,0,0,0]
[null,null,"> 33 kV & < = 66 kV ; XLPE Insulated",0,0,0,0,0,0,0]
[null,null,"> 66 kV & < = 132 kV ; XLPE Insulated",0,0,0,0,0,0,0]
[null,null,"> 132 kV & < = 275 kV ; XLPE Insulated",0,0,0,0,0,0,0]
[null,null,"> 275 kV & < = 330 kV ; XLPE Insulated",0,0,0,0,0,0,0]
[null,null,"> 330 kV & < = 500 kV  ; XLPE Insulated",0,0,0,0,0,0,0]
[null,null,"> 500 kV  ; XLPE Insulated",0,0,0,0,0,0,0]
[null,null,"< = 33 kV; Other Insulated",0,0,0,0,0,0,0]
[null,null,"> 33 kV & < = 66 kV ; Other Insulated",0,0,0,0,0,0,0]
[null,null,"> 66 kV & < = 132 kV ; Other Insulated",0,0,0,0,0,0,0]
[null,null,"> 132 kV & < = 275 kV ; Other Insulated",0,0,0,0,0,0,0]
[null,null,"> 275 kV & < = 330 kV ; Other Insulated",0,0,0,0,0,0,0]
[null,null,"> 330 kV & < = 500 kV  ; Other Insulated",0,0,0,0,0,0,0]
[null,null,"> 500 kV  ; Other Insulated",0,0,0,0,0,0,0]
[null,null,"Other",0,0,0,0,0,0,0]
[null,"SUBSTATION SWITCHBAYS BY: \nHighest operating voltage; Switch type","< = 33 kV; Air Insulated circuit Breaker",4146282.64,0,289723.90999999997,0,0,0,0]
[null,null,"> 33 kV & < = 66 kV ; Air Insulated circuit Breaker",1148123.78,0,0,0,0,0,109837.55]
[null,null,"> 66 kV & < = 132 kV ; Air Insulated circuit Breaker",6580170.6400000006,0,438020.6,2154632.1800000002,0,0,120769.62]
[null,null,"> 132 kV & < = 275 kV ; Air Insulated circuit Breaker",4320284.8900000006,99711.77,368679.64,0,0,0,3364624.61]
[null,null,"> 275 kV & < = 330 kV ; Air Insulated circuit Breaker",0,0,0,0,0,0,0]
[null,null,"> 330 kV & < = 500 kV  ; Air Insulated circuit Breaker",0,0,0,0,0,0,0]
[null,null,"> 500 kV  ; Air Insulated circuit Breaker",0,0,0,0,0,0,0]
[null,null,"< = 33 kV; Air Insulated Isolators / Earth Switch",0,0,0,726187.26,0,0,0]
[null,null,"> 33 kV & < = 66 kV ; Air Insulated Isolators / Earth Switch",0,0,304436.46000000002,0,0,0,400780.05]
[null,null,"> 66 kV & < = 132 kV ; Air Insulated Isolators / Earth Switch",5597940.9500000002,0,5674046.04,2527098.38,0,0,619605.19999999995]
[null,null,"> 132 kV & < = 275 kV ; Air Insulated Isolators / Earth Switch",1000361.3,56164.52,0,0,0,0,7442198.3499999996]
[null,null,"> 275 kV & < = 330 kV ; Air Insulated Isolators / Earth Switch",0,0,0,0,0,0,0]
[null,null,"> 330 kV & < = 500 kV  ; Air Insulated Isolators / Earth Switch",0,0,0,0,0,0,0]
[null,null,"> 500 kV  ; Air Insulated Isolators / Earth Switch",0,0,0,0,0,0,0]
[null,null,"< = 33 kV; VT",336189,0,47310.35,571223.25,0,0,0]
[null,null,"> 33 kV & < = 66 kV ; VT",536949.65,0,0,0,0,0,6123.26]
[null,null,"> 66 kV & < = 132 kV ; VT",3573437.9800000004,0,119672.2,161473.16,0,0,602230.87]
[null,null,"> 132 kV & < = 275 kV ; VT",5608028.3700000001,0,596514.51,0,0,0,432086.22]
[null,null,"> 275 kV & < = 330 kV ; VT",0,0,0,0,0,0,0]
[null,null,"> 330 kV & < = 500 kV  ; VT",0,0,0,0,0,0,0]
[null,null,"> 500 kV  ; VT",0,0,0,0,0,0,0]
[null,null,"< = 33 kV; CT",553429.5,0,136164.60999999999,2618295.1800000002,0,0,30111.82]
[null,null,"> 33 kV & < = 66 kV ; CT",4456757.71,0,0,0,0,0,1430805.53]
[null,null,"> 66 kV & < = 132 kV ; CT",7431914.209999999,0,745791.32000000007,0,0,0,154210.31]
[null,null,"> 132 kV & < = 275 kV ; CT",21636067.400000002,65798.02,243285.12,0,0,0,1001694.1]
[null,null,"> 275 kV & < = 330 kV ; CT",0,0,0,0,0,0,0]
[null,null,"> 330 kV & < = 500 kV  ; CT",0,0,0,0,0,0,0]
[null,null,"> 500 kV  ; CT",0,0,0,0,0,0,0]
[null,null,"< = 33 kV; GIS Module",0,0,0,0,0,0,0]
[null,null,"> 33 kV & < = 66 kV ; GIS Module",0,0,0,0,0,0,0]
[null,null,"> 66 kV & < = 132 kV ; GIS Module",0,0,0,0,0,0,0]
[null,null,"> 132 kV & < = 275 kV ; GIS Module",0,0,0,0,0,0,0]
[null,null,"> 275 kV & < = 330 kV ; GIS Module",0,0,0,0,0,0,0]
[null,null,"> 330 kV & < = 500 kV  ; GIS Module",0,0,0,0,0,0,0]
[null,null,"> 500 kV  ; GIS Module",0,0,0,0,0,0,0]
[null,null,"Other",0,0,0,0,0,0,0]
[null,"SUBSTATION POWER TRANSFORMERS BY: \nHighest operating voltage;  Ampere rating","< = 33 kV ; < = 10 MVA",0,0,0,0,0,0,0]
[null,null,"< = 33 kV ; > 10 MVA & < =  30 MVA",0,0,0,0,0,0,0]
[null,null,"< = 33 kV ; > 30 MVA",0,0,0,0,0,0,0]
[null,null,"> 33 kV & < = 66 kV  ; < = 10 MVA",0,0,0,0,0,0,0]
[null,null,"> 33 kV & < = 66 kV  ; > 10 MVA & < =  30 MVA",0,0,0,0,0,0,0]
[null,null,"> 33 kV & < = 66 kV  ; > 30 MVA",0,0,0,0,0,0,0]
[null,null,"> 66 kV & < = 132 kV  ; < = 30 MVA",3155991.82,0,0,25028065.380000003,1369507.71,2231596.15,0]
[null,null,"> 66 kV & < = 132 kV  ; > 30 MVA & < =  60 MVA",0,0,0,0,0,0,0]
[null,null,"> 66 kV & < = 132 kV  ; > 60 MVA",13074224.68,0,0,0,0,0,0]
[null,null,"> 132 kV & < = 220 kV  ; < = 50 MVA",0,0,0,0,0,0,0]
[null,null,"> 132 kV & < = 220 kV  ; > 50 MVA & < =  100 MVA",0,0,0,0,0,0,0]
[null,null,"> 132 kV & < = 220 kV  ; > 100 MVA",0,0,0,0,0,0,0]
[null,null,"> 220 kV & < = 275 kV  ; < = 50 MVA",0,0,0,0,0,0,0]
[null,null,"> 220 kV & < = 275 kV  ; > 50 MVA & < =  100 MVA",0,0,0,0,0,0,0]
[null,null,"> 220 kV & < = 275 kV  ; > 100 MVA",0,3333970.9,0,0,0,0,0]
[null,null,"> 275 kV & < = 330 kV  ; < = 100 MVA",0,0,0,0,0,0,0]
[null,null,"> 275 kV & < = 330 kV  ; > 100 MVA & < =  250 MVA",0,0,0,0,0,0,0]
[null,null,"> 275 kV & < = 330 kV  ; > 250 MVA",0,0,0,0,0,0,0]
[null,null,"> 330 kV & < = 500 kV   ; < = 150 MVA",0,0,0,0,0,0,0]
[null,null,"> 330 kV & < = 500 kV   ; > 150 MVA & < =  300 MVA",0,0,0,0,0,0,0]
[null,null,"> 330 kV & < = 500 kV   ; > 300 MVA",0,0,0,0,0,0,0]
[null,null,"> 500 kV   ; < = 1000 MVA",0,0,0,0,0,0,0]
[null,null,"> 500 kV   ; > 1000 MVA & < =  1500 MVA",0,0,0,0,0,0,0]
[null,null,"> 500 kV   ; > 1500 MVA",0,0,0,0,0,0,0]
[null,null,"Other",0,0,0,0,0,0,0]
[null,"SUBSTATION REACTIVE PLANT BY: \nHighest operating voltage; Function","< = 33 kV;  SVCS",0,0,0,0,0,0,0]
[null,null,"> 33 kV & < = 66 kV ;  SVCS",0,0,0,0,0,0,0]
[null,null,"> 66 kV & < = 132 kV ;  SVCS",0,0,0,0,0,0,0]
[null,null,"> 132 kV & < = 275 kV ;  SVCS",0,0,0,0,0,0,0]
[null,null,"> 275 kV & < = 330 kV ;  SVCS",0,0,0,0,0,0,0]
[null,null,"> 330 kV & < = 500 kV  ;  SVCS",0,0,0,0,0,0,0]
[null,null,"> 500 kV  ;  SVCS",0,0,0,0,0,0,0]
[null,null,"< = 33 kV;  Capacitors",0,0,0,0,0,0,0]
[null,null,"> 33 kV & < = 66 kV ;  Capacitors",0,0,0,0,0,0,0]
[null,null,"> 66 kV & < = 132 kV ;  Capacitors",2528202.64,0,0,0,0,0,0]
[null,null,"> 132 kV & < = 275 kV ;  Capacitors",0,0,0,0,0,0,0]
[null,null,"> 275 kV & < = 330 kV ;  Capacitors",0,0,0,0,0,0,0]
[null,null,"> 330 kV & < = 500 kV  ;  Capacitors",0,0,0,0,0,0,0]
[null,null,"> 500 kV  ;  Capacitors",0,0,0,0,0,0,0]
[null,null,"< = 33 kV;  Oil Filled Reactors",0,0,0,0,0,0,0]
[null,null,"> 33 kV & < = 66 kV ;  Oil Filled Reactors",0,0,0,0,0,0,0]
[null,null,"> 66 kV & < = 132 kV ;  Oil Filled Reactors",0,0,0,0,0,0,0]
[null,null,"> 132 kV & < = 275 kV ;  Oil Filled Reactors",0,0,0,0,0,0,0]
[null,null,"> 275 kV & < = 330 kV ;  Oil Filled Reactors",0,0,0,0,0,0,0]
[null,null,"> 330 kV & < = 500 kV  ;  Oil Filled Reactors",0,0,0,0,0,0,0]
[null,null,"> 500 kV  ;  Oil Filled Reactors",0,0,0,0,0,0,0]
[null,null,"Other",0,0,0,0,0,0,0]
[null,"SCADA, NETWORK CONTROL AND PROTECTION SYSTEMS BY:\nFunction","Site Establishment",42589300.979077525,3710251.3396215686,19969591.153727356,30705197.582475819,4709356.1827009274,14326054.077730816,9613328.9071712475]
[null,null,"Secondary Systems",46301370.898571208,30602403.870042436,17174420.451065682,21945130.980020616,11987546.952421885,5098379.0125393234,27703964.589934535]
[null,null,"Telecommunications",12698393.798139375,1009608.7616660491,11151136.561421625,28473914.211902745,2119390.974441851,234095.06284935217,10472905.387653086]
[null,null,"OPGW",0,0,0,0,0,0,0]
[null,null,"OTHER",3403071.8680700837,7338961.0081176655,17531475.601008385,10790358.596726099,4829765.6311234068,5064852.1649506148,5393903.5105575165]
[null,null,"Other Primary Plant",431084.99,492552.97,9021295.879999999,0.01,6342936.9400000004,2414692.5900000003,2096014.7]
[null,null,"Other Lines",987511.05224357522,53662.653293364492,125410.34900297757,0,64589.379556887601,8479000.790159611,0]
[null,null,"Transformer Refurbishment",0,0,0,0,0,0,0]
[null,"OTHER BY: \nNSP defined","<NSP to enter description for Asset Category not listed above>"]
[null,"TRANSMISSION TOWERS BY: HIGHEST OPERATING VOLTAGE; CIRCUIT CONFIGURATION","> 66 kV & < = 132 kV ; SINGLE CIRCUIT REFURBISHED",0,0,0,0,0,0,7830327.0499999998]
[null,null,"> 132 kV & < = 275 kV ; SINGLE CIRCUIT REFURBISHED",0,0,24052439.530000001,0,0,0,0]
[]
[null,"TRANSMISSION TOWER SUPPORT STRUCTURES BY: HIGHEST OPERATING VOLTAGE; CIRCUIT CONFIGURATION","> 33 kV & < = 66 kV ; SINGLE CIRCUIT REFURBISHED",0,0,0,0,0,0,924962.73]
[null,null,"> 66 kV & < = 132 kV ; SINGLE CIRCUIT REFURBISHED",0,13437153,0,0,0,0,25902421.760000002]
[null,null,"> 132 kV & < = 275 kV ; SINGLE CIRCUIT REFURBISHED",2537235.83,0,30218871.719999999,0,0,0,24490955.420000002]
[]
[null,"CONDUCTORS BY: VOLTAGE, MAXIMUM CONTINUOUS RATING ","> 66 kV & < = 132 kV  ; > 100 MVA & < = 400 MVA REFURBISHED",0,0,0,0,0,26056796.93,42259549.420000002]
[]
[null,"SUBSTATION REACTIVE PLANT BY: \nHighest operating voltage; Function",">132 kV & <=275 kV ; SVCS REFURBISHED ",0,2364477.08,0,0,0,0,0]
[]
[]
[]
[]
[]
[]
[]
[]
[]
[]
[]
[]
[]
[]
[]
[]
[]
[]
[null,"ASSET REPLACEMENTS"]
[null,null,null,"VOLUMES "]
[null,null,null,"(0's)"]
[null,"ASSET GROUP","ASSET CATEGORY",{"$f":"CRCP_y4","v":"2016-17"},{"$f":"CRCP_y5","v":"2017-18"},{"$f":"FRCP_y1","v":"2018-19"},{"$f":"FRCP_y2","v":"2019-20"},{"$f":"FRCP_y3","v":"2020-21"},{"$f":"FRCP_y4","v":"2021-22"},{"$f":"FRCP_y5","v":"2022-23"}]
[null,"TRANSMISSION TOWERS\nHighest operating voltage; Circuit configuration","< = 33 kV; Single Circuit",0,0,0,0,0,0,0]
[null,null,"> 33 kV & < = 66 kV ; Single Circuit",0,0,0,0,0,0,0]
[null,null,"> 66 kV & < = 132 kV ; Single Circuit",12,0,0,4,0,0,0]
[null,null,"> 132 kV & < = 275 kV ; Single Circuit",0,0,0,0,0,0,0]
[null,null,"> 275 kV & < = 330 kV ; Single Circuit",0,0,0,0,0,0,0]
[null,null,"> 330 kV & < = 500 kV  ; Single Circuit",0,0,0,0,0,0,0]
[null,null,"> 500 kV  ; Single Circuit",0,0,0,0,0,0,0]
[null,null,"< = 33 kV; Multiple Circuit",0,0,0,0,0,0,0]
[null,null,"> 33 kV & < = 66 kV ; Multiple Circuit",0,0,0,0,0,0,0]
[null,null,"> 66 kV & < = 132 kV ; Multiple Circuit",0,0,0,1,0,0,0]
[null,null,"> 132 kV & < = 275 kV ; Multiple Circuit",0,0,0,0,0,0,0]
[null,null,"> 275 kV & < = 330 kV ; Multiple Circuit",0,0,0,0,0,0,0]
[null,null,"> 330 kV & < = 500 kV  ; Multiple Circuit",0,0,0,0,0,0,0]
[null,null,"> 500 kV  ; Multiple Circuit",0,0,0,0,0,0,0]
[null,null,"Other",0,0,0,0,0,0,0]
[null,"TRANSMISSION TOWER SUPPORT STRUCTURES BY:\nHighest operating voltage; Circuit configuration","< = 33 kV; Single Circuit",0,0,0,0,0,0,0]
[null,null,"> 33 kV & < = 66 kV ; Single Circuit",0,0,0,0,0,0,0]
[null,null,"> 66 kV & < = 132 kV ; Single Circuit",108,0,0,36,0,0,0]
[null,null,"> 132 kV & < = 275 kV ; Single Circuit",0,0,0,0,0,0,0]
[null,null,"> 275 kV & < = 330 kV ; Single Circuit",0,0,0,0,0,0,0]
[null,null,"> 330 kV & < = 500 kV  ; Single Circuit",0,0,0,0,0,0,0]
[null,null,"> 500 kV  ; Single Circuit",0,0,0,0,0,0,0]
[null,null,"< = 33 kV; Multiple Circuit",0,0,0,0,0,0,0]
[null,null,"> 33 kV & < = 66 kV ; Multiple Circuit",0,0,0,0,0,0,0]
[null,null,"> 66 kV & < = 132 kV ; Multiple Circuit",0,0,0,18,0,0,0]
[null,null,"> 132 kV & < = 275 kV ; Multiple Circuit",0,0,0,0,0,0,0]
[null,null,"> 275 kV & < = 330 kV ; Multiple Circuit",0,0,0,0,0,0,0]
[null,null,"> 330 kV & < = 500 kV  ; Multiple Circuit",0,0,0,0,0,0,0]
[null,null,"> 500 kV  ; Multiple Circuit",0,0,0,0,0,0,0]
[null,null,"Other",0,0,0,0,0,0,0]
[null,"CONDUCTORS BY: \nVoltage; Maximum continuous rating","< = 33 kV ; < = 100 MVA",0,0,0,0,0,0,0]
[null,null,"< = 33 kV ; > 100 MVA & < = 400 MVA",0,0,0,0,0,0,0]
[null,null,"< = 33 kV ; > 400 MVA",0,0,0,0,0,0,0]
[null,null,"> 33 kV & < = 66 kV  ; < = 100 MVA",0,0,0,0,0,0,0]
[null,null,"> 33 kV & < = 66 kV  ; > 100 MVA & < = 400 MVA",0,0,0,0,0,0,0]
[null,null,"> 33 kV & < = 66 kV  ; > 400 MVA",0,0,0,0,0,0,0]
[null,null,"> 66 kV & < = 132 kV  ; < = 100 MVA",0,0,0,0,0,0,0]
[null,null,"> 66 kV & < = 132 kV  ; > 100 MVA & < = 400 MVA",3.6,0,0,4.2,0,0,0]
[null,null,"> 66 kV & < = 132 kV  ; > 400 MVA",0,0,0,0,0,0,0]
[null,null,"> 132 kV & < = 275 kV  ; < = 200 MVA",0,0,0,0,0,0,0]
[null,null,"> 132 kV & < = 275 kV  ; > 200 MVA & < = 600 MVA",0,0,0,0,0,0,0]
[null,null,"> 132 kV & < = 275 kV  ; > 600 MVA",0,0,0,0,0,0,0]
[null,null,"> 275 kV & < = 330 kV  ; < = 800 MVA",0,0,0,0,0,0,0]
[null,null,"> 275 kV & < = 330 kV  ; > 800 MVA & < = 1200 MVA",0,0,0,0,0,0,0]
[null,null,"> 275 kV & < = 330 kV  ; > 1200 MVA",0,0,0,0,0,0,0]
[null,null,"> 330 kV & < = 500 kV   ; < = 1000 MVA",0,0,0,0,0,0,0]
[null,null,"> 330 kV & < = 500 kV   ; > 1000 MVA & < = 1500 MVA",0,0,0,0,0,0,0]
[null,null,"> 330 kV & < = 500 kV   ; > 1500 MVA",0,0,0,0,0,0,0]
[null,null,"> 500 kV   ; < = 2000 MVA",0,0,0,0,0,0,0]
[null,null,"> 500 kV   ; > 2000 MVA & < = 3000 MVA",0,0,0,0,0,0,0]
[null,null,"> 500 kV   ; > 3000 MVA",0,0,0,0,0,0,0]
[null,null,"Other",0,0,0,0,0,0,0]
[null,"TRANSMISSION CABLES BY: \nHighest operating voltage; Insulation type","< = 33 kV; Oil Filled",0,0,0,0,0,0,0]
[null,null,"> 33 kV & < = 66 kV ; Oil Filled",0,0,0,0,0,0,0]
[null,null,"> 66 kV & < = 132 kV ; Oil Filled",0,0,0,0,0,0,0]
[null,null,"> 132 kV & < = 275 kV ; Oil Filled",0,0,0,0,0,0,0]
[null,null,"> 275 kV & < = 330 kV ; Oil Filled",0,0,0,0,0,0,0]
[null,null,"> 330 kV & < = 500 kV  ; Oil Filled",0,0,0,0,0,0,0]
[null,null,"> 500 kV  ; Oil Filled",0,0,0,0,0,0,0]
[null,null,"< = 33 kV; XLPE Insulated",0,0,0,0,0,0,0]
[null,null,"> 33 kV & < = 66 kV ; XLPE Insulated",0,0,0,0,0,0,0]
[null,null,"> 66 kV & < = 132 kV ; XLPE Insulated",0,0,0,0,0,0,0]
[null,null,"> 132 kV & < = 275 kV ; XLPE Insulated",0,0,0,0,0,0,0]
[null,null,"> 275 kV & < = 330 kV ; XLPE Insulated",0,0,0,0,0,0,0]
[null,null,"> 330 kV & < = 500 kV  ; XLPE Insulated",0,0,0,0,0,0,0]
[null,null,"> 500 kV  ; XLPE Insulated",0,0,0,0,0,0,0]
[null,null,"< = 33 kV; Other Insulated",0,0,0,0,0,0,0]
[null,null,"> 33 kV & < = 66 kV ; Other Insulated",0,0,0,0,0,0,0]
[null,null,"> 66 kV & < = 132 kV ; Other Insulated",0,0,0,0,0,0,0]
[null,null,"> 132 kV & < = 275 kV ; Other Insulated",0,0,0,0,0,0,0]
[null,null,"> 275 kV & < = 330 kV ; Other Insulated",0,0,0,0,0,0,0]
[null,null,"> 330 kV & < = 500 kV  ; Other Insulated",0,0,0,0,0,0,0]
[null,null,"> 500 kV  ; Other Insulated",0,0,0,0,0,0,0]
[null,null,"Other",0,0,0,0,0,0,0]
[null,"SUBSTATION SWITCHBAYS BY: \nHighest operating voltage; Switch type","< = 33 kV; Air Insulated circuit Breaker",20,0,1,0,0,0,0]
[null,null,"> 33 kV & < = 66 kV ; Air Insulated circuit Breaker",4,0,0,0,0,0,1]
[null,null,"> 66 kV & < = 132 kV ; Air Insulated circuit Breaker",21,0,1,11,0,0,1]
[null,null,"> 132 kV & < = 275 kV ; Air Insulated circuit Breaker",8,2,1,0,0,0,12]
[null,null,"> 275 kV & < = 330 kV ; Air Insulated circuit Breaker",0,0,0,0,0,0,0]
[null,null,"> 330 kV & < = 500 kV  ; Air Insulated circuit Breaker",0,0,0,0,0,0,0]
[null,null,"> 500 kV  ; Air Insulated circuit Breaker",0,0,0,0,0,0,0]
[null,null,"< = 33 kV; Air Insulated Isolators / Earth Switch",0,0,0,23,0,0,0]
[null,null,"> 33 kV & < = 66 kV ; Air Insulated Isolators / Earth Switch",0,0,2,0,0,0,7]
[null,null,"> 66 kV & < = 132 kV ; Air Insulated Isolators / Earth Switch",36,0,31,25,0,0,9]
[null,null,"> 132 kV & < = 275 kV ; Air Insulated Isolators / Earth Switch",12,4,0,0,0,0,85]
[null,null,"> 275 kV & < = 330 kV ; Air Insulated Isolators / Earth Switch",0,0,0,0,0,0,0]
[null,null,"> 330 kV & < = 500 kV  ; Air Insulated Isolators / Earth Switch",0,0,0,0,0,0,0]
[null,null,"> 500 kV  ; Air Insulated Isolators / Earth Switch",0,0,0,0,0,0,0]
[null,null,"< = 33 kV; VT",10,0,1,27,0,0,0]
[null,null,"> 33 kV & < = 66 kV ; VT",9,0,0,0,0,0,0.33333333333333331]
[null,null,"> 66 kV & < = 132 kV ; VT",15.333333333333334,0,1,1,0,0,11]
[null,null,"> 132 kV & < = 275 kV ; VT",20.333333333333332,0,3.9999999999999996,0,0,0,6.333333333333333]
[null,null,"> 275 kV & < = 330 kV ; VT",0,0,0,0,0,0,0]
[null,null,"> 330 kV & < = 500 kV  ; VT",0,0,0,0,0,0,0]
[null,null,"> 500 kV  ; VT",0,0,0,0,0,0,0]
[null,null,"< = 33 kV; CT",16,0,1,43,0,0,1.3333333333333333]
[null,null,"> 33 kV & < = 66 kV ; CT",22,0,0,0,0,0,17.666666666666668]
[null,null,"> 66 kV & < = 132 kV ; CT",23,0,2.6666666666666665,0,0,0,2]
[null,null,"> 132 kV & < = 275 kV ; CT",52,2,1,0,0,0,9]
[null,null,"> 275 kV & < = 330 kV ; CT",0,0,0,0,0,0,0]
[null,null,"> 330 kV & < = 500 kV  ; CT",0,0,0,0,0,0,0]
[null,null,"> 500 kV  ; CT",0,0,0,0,0,0,0]
[null,null,"< = 33 kV; GIS Module",0,0,0,0,0,0,0]
[null,null,"> 33 kV & < = 66 kV ; GIS Module",0,0,0,0,0,0,0]
[null,null,"> 66 kV & < = 132 kV ; GIS Module",0,0,0,0,0,0,0]
[null,null,"> 132 kV & < = 275 kV ; GIS Module",0,0,0,0,0,0,0]
[null,null,"> 275 kV & < = 330 kV ; GIS Module",0,0,0,0,0,0,0]
[null,null,"> 330 kV & < = 500 kV  ; GIS Module",0,0,0,0,0,0,0]
[null,null,"> 500 kV  ; GIS Module",0,0,0,0,0,0,0]
[null,null,"Other",0,0,0,0,0,0,0]
[null,"SUBSTATION POWER TRANSFORMERS BY: \nHighest operating voltage;  Ampere rating","< = 33 kV ; < = 10 MVA",0,0,0,0,0,0,0]
[null,null,"< = 33 kV ; > 10 MVA & < =  30 MVA",0,0,0,0,0,0,0]
[null,null,"< = 33 kV ; > 30 MVA",0,0,0,0,0,0,0]
[null,null,"> 33 kV & < = 66 kV  ; < = 10 MVA",0,0,0,0,0,0,0]
[null,null,"> 33 kV & < = 66 kV  ; > 10 MVA & < =  30 MVA",0,0,0,0,0,0,0]
[null,null,"> 33 kV & < = 66 kV  ; > 30 MVA",0,0,0,0,0,0,0]
[null,null,"> 66 kV & < = 132 kV  ; < = 30 MVA",2,0,0,17,1,2,0]
[null,null,"> 66 kV & < = 132 kV  ; > 30 MVA & < =  60 MVA",0,0,0,0,0,0,0]
[null,null,"> 66 kV & < = 132 kV  ; > 60 MVA",2,0,0,0,0,0,0]
[null,null,"> 132 kV & < = 220 kV  ; < = 50 MVA",0,0,0,0,0,0,0]
[null,null,"> 132 kV & < = 220 kV  ; > 50 MVA & < =  100 MVA",0,0,0,0,0,0,0]
[null,null,"> 132 kV & < = 220 kV  ; > 100 MVA",0,0,0,0,0,0,0]
[null,null,"> 220 kV & < = 275 kV  ; < = 50 MVA",0,0,0,0,0,0,0]
[null,null,"> 220 kV & < = 275 kV  ; > 50 MVA & < =  100 MVA",0,0,0,0,0,0,0]
[null,null,"> 220 kV & < = 275 kV  ; > 100 MVA",0,1,0,0,0,0,0]
[null,null,"> 275 kV & < = 330 kV  ; < = 100 MVA",0,0,0,0,0,0,0]
[null,null,"> 275 kV & < = 330 kV  ; > 100 MVA & < =  250 MVA",0,0,0,0,0,0,0]
[null,null,"> 275 kV & < = 330 kV  ; > 250 MVA",0,0,0,0,0,0,0]
[null,null,"> 330 kV & < = 500 kV   ; < = 150 MVA",0,0,0,0,0,0,0]
[null,null,"> 330 kV & < = 500 kV   ; > 150 MVA & < =  300 MVA",0,0,0,0,0,0,0]
[null,null,"> 330 kV & < = 500 kV   ; > 300 MVA",0,0,0,0,0,0,0]
[null,null,"> 500 kV   ; < = 1000 MVA",0,0,0,0,0,0,0]
[null,null,"> 500 kV   ; > 1000 MVA & < =  1500 MVA",0,0,0,0,0,0,0]
[null,null,"> 500 kV   ; > 1500 MVA",0,0,0,0,0,0,0]
[null,null,"Other",0,0,0,0,0,0,0]
[null,"SUBSTATION REACTIVE PLANT BY: \nHighest operating voltage; Function","< = 33 kV;  SVCS",0,0,0,0,0,0,0]
[null,null,"> 33 kV & < = 66 kV ;  SVCS",0,0,0,0,0,0,0]
[null,null,"> 66 kV & < = 132 kV ;  SVCS",0,0,0,0,0,0,0]
[null,null,"> 132 kV & < = 275 kV ;  SVCS",0,0,0,0,0,0,0]
[null,null,"> 275 kV & < = 330 kV ;  SVCS",0,0,0,0,0,0,0]
[null,null,"> 330 kV & < = 500 kV  ;  SVCS",0,0,0,0,0,0,0]
[null,null,"> 500 kV  ;  SVCS",0,0,0,0,0,0,0]
[null,null,"< = 33 kV;  Capacitors",0,0,0,0,0,0,0]
[null,null,"> 33 kV & < = 66 kV ;  Capacitors",0,0,0,0,0,0,0]
[null,null,"> 66 kV & < = 132 kV ;  Capacitors",2,0,0,0,0,0,0]
[null,null,"> 132 kV & < = 275 kV ;  Capacitors",0,0,0,0,0,0,0]
[null,null,"> 275 kV & < = 330 kV ;  Capacitors",0,0,0,0,0,0,0]
[null,null,"> 330 kV & < = 500 kV  ;  Capacitors",0,0,0,0,0,0,0]
[null,null,"> 500 kV  ;  Capacitors",0,0,0,0,0,0,0]
[null,null,"< = 33 kV;  Oil Filled Reactors",0,0,0,0,0,0,0]
[null,null,"> 33 kV & < = 66 kV ;  Oil Filled Reactors",0,0,0,0,0,0,0]
[null,null,"> 66 kV & < = 132 kV ;  Oil Filled Reactors",0,0,0,0,0,0,0]
[null,null,"> 132 kV & < = 275 kV ;  Oil Filled Reactors",0,0,0,0,0,0,0]
[null,null,"> 275 kV & < = 330 kV ;  Oil Filled Reactors",0,0,0,0,0,0,0]
[null,null,"> 330 kV & < = 500 kV  ;  Oil Filled Reactors",0,0,0,0,0,0,0]
[null,null,"> 500 kV  ;  Oil Filled Reactors",0,0,0,0,0,0,0]
[null,null,"Other",0,0,0,0,0,0,0]
[null,"SCADA, NETWORK CONTROL AND PROTECTION SYSTEMS BY:\nFunction",{"$f":"IF(ISBLANK(C170),\"\",C170)","v":"Site Establishment"}]
[null,null,{"$f":"IF(ISBLANK(C171),\"\",C171)","v":"Secondary Systems"}]
[null,null,{"$f":"IF(ISBLANK(C172),\"\",C172)","v":"Telecommunications"}]
[null,null,{"$f":"IF(ISBLANK(C173),\"\",C173)","v":"OPGW"}]
[null,null,{"$f":"IF(ISBLANK(C175),\"\",C175)","v":"Other Primary Plant"}]
[null,null,{"$f":"IF(ISBLANK(C176),\"\",C176)","v":"Other Lines"}]
[null,"OTHER BY: \nNSP defined",{"$f":"IF(ISBLANK(C178),\"\",C178)","v":"<NSP to enter description for Asset Category not listed above>"}]
[null,"TRANSMISSION TOWERS BY: HIGHEST OPERATING VOLTAGE; CIRCUIT CONFIGURATION","> 66 kV & < = 132 kV ; SINGLE CIRCUIT REFURBISHED",0,0,0,0,0,0,138]
[null,null,"> 132 kV & < = 275 kV ; SINGLE CIRCUIT REFURBISHED",0,0,79,0,0,0,0]
[null,null,""]
[null,"TRANSMISSION TOWER SUPPORT STRUCTURES BY: HIGHEST OPERATING VOLTAGE; CIRCUIT CONFIGURATION","> 33 kV & < = 66 kV ; SINGLE CIRCUIT REFURBISHED",0,0,0,0,0,0,189]
[null,null,"> 66 kV & < = 132 kV ; SINGLE CIRCUIT REFURBISHED",0,2022,0,0,0,0,2798]
[null,null,"> 132 kV & < = 275 kV ; SINGLE CIRCUIT REFURBISHED",267,0,1311,0,0,0,3760]
[null,null,""]
[null,"CONDUCTORS BY: VOLTAGE, MAXIMUM CONTINUOUS RATING ","> 66 kV & < = 132 kV  ; > 100 MVA & < = 400 MVA REFURBISHED",0,0,0,0,0,52,150]
[null,null,""]
[null,"SUBSTATION REACTIVE PLANT BY: \nHighest operating voltage; Function",">132 kV & <=275 kV ; SVCS REFURBISHED ",0,2,0,0,0,0,0]
[null,null,""]
[null,null,""]
[null,null,""]
[null,null,""]
[null,null,""]
[null,null,""]
[null,null,""]
[null,null,""]
[null,null,""]
[null,null,""]
[null,null,""]
[null,null,""]
[null,null,""]
[null,null,""]
[null,null,""]
[]
[]
[]
[null,"ASSET FAILURES"]
[null,null,null,"VOLUMES"]
[null,null,null,"(0's)"]
[null,"ASSET GROUP","ASSET CATEGORY",{"$f":"CRCP_y4","v":"2016-17"},{"$f":"CRCP_y5","v":"2017-18"},{"$f":"FRCP_y1","v":"2018-19"},{"$f":"FRCP_y2","v":"2019-20"},{"$f":"FRCP_y3","v":"2020-21"},{"$f":"FRCP_y4","v":"2021-22"},{"$f":"FRCP_y5","v":"2022-23"}]
[null,"TRANSMISSION TOWERS\nHighest operating voltage; Circuit configuration","< = 33 kV; Single Circuit",0,0,0,0,0,0,0]
[null,null,"> 33 kV & < = 66 kV ; Single Circuit",0,0,0,0,0,0,0]
[null,null,"> 66 kV & < = 132 kV ; Single Circuit",0,0,0,0,0,0,0]
[null,null,"> 132 kV & < = 275 kV ; Single Circuit",0,0,0,0,0,0,0]
[null,null,"> 275 kV & < = 330 kV ; Single Circuit",0,0,0,0,0,0,0]
[null,null,"> 330 kV & < = 500 kV  ; Single Circuit",0,0,0,0,0,0,0]
[null,null,"> 500 kV  ; Single Circuit",0,0,0,0,0,0,0]
[null,null,"< = 33 kV; Multiple Circuit",0,0,0,0,0,0,0]
[null,null,"> 33 kV & < = 66 kV ; Multiple Circuit",0,0,0,0,0,0,0]
[null,null,"> 66 kV & < = 132 kV ; Multiple Circuit",0,0,0,0,0,0,0]
[null,null,"> 132 kV & < = 275 kV ; Multiple Circuit",0,0,0,0,0,0,0]
[null,null,"> 275 kV & < = 330 kV ; Multiple Circuit",0,0,0,0,0,0,0]
[null,null,"> 330 kV & < = 500 kV  ; Multiple Circuit",0,0,0,0,0,0,0]
[null,null,"> 500 kV  ; Multiple Circuit",0,0,0,0,0,0,0]
[null,null,"Other",0,0,0,0,0,0,0]
[null,"TRANSMISSION TOWER SUPPORT STRUCTURES BY:\nHighest operating voltage; Circuit configuration","< = 33 kV; Single Circuit",0,0,0,0,0,0,0]
[null,null,"> 33 kV & < = 66 kV ; Single Circuit",0,0,0,0,0,0,0]
[null,null,"> 66 kV & < = 132 kV ; Single Circuit",0,0,0,0,0,0,0]
[null,null,"> 132 kV & < = 275 kV ; Single Circuit",0,0,0,0,0,0,0]
[null,null,"> 275 kV & < = 330 kV ; Single Circuit",0,0,0,0,0,0,0]
[null,null,"> 330 kV & < = 500 kV  ; Single Circuit",0,0,0,0,0,0,0]
[null,null,"> 500 kV  ; Single Circuit",0,0,0,0,0,0,0]
[null,null,"< = 33 kV; Multiple Circuit",0,0,0,0,0,0,0]
[null,null,"> 33 kV & < = 66 kV ; Multiple Circuit",0,0,0,0,0,0,0]
[null,null,"> 66 kV & < = 132 kV ; Multiple Circuit",0,0,0,0,0,0,0]
[null,null,"> 132 kV & < = 275 kV ; Multiple Circuit",0,0,0,0,0,0,0]
[null,null,"> 275 kV & < = 330 kV ; Multiple Circuit",0,0,0,0,0,0,0]
[null,null,"> 330 kV & < = 500 kV  ; Multiple Circuit",0,0,0,0,0,0,0]
[null,null,"> 500 kV  ; Multiple Circuit",0,0,0,0,0,0,0]
[null,null,"Other",0,0,0,0,0,0,0]
[null,"CONDUCTORS BY: \nVoltage; Maximum continuous rating","< = 33 kV ; < = 100 MVA",0,0,0,0,0,0,0]
[null,null,"< = 33 kV ; > 100 MVA & < = 400 MVA",0,0,0,0,0,0,0]
[null,null,"< = 33 kV ; > 400 MVA",0,0,0,0,0,0,0]
[null,null,"> 33 kV & < = 66 kV  ; < = 100 MVA",0,0,0,0,0,0,0]
[null,null,"> 33 kV & < = 66 kV  ; > 100 MVA & < = 400 MVA",0,0,0,0,0,0,0]
[null,null,"> 33 kV & < = 66 kV  ; > 400 MVA",0,0,0,0,0,0,0]
[null,null,"> 66 kV & < = 132 kV  ; < = 100 MVA",0,0,0,0,0,0,0]
[null,null,"> 66 kV & < = 132 kV  ; > 100 MVA & < = 400 MVA",0,0,0,0,0,0,0]
[null,null,"> 66 kV & < = 132 kV  ; > 400 MVA",0,0,0,0,0,0,0]
[null,null,"> 132 kV & < = 275 kV  ; < = 200 MVA",0,0,0,0,0,0,0]
[null,null,"> 132 kV & < = 275 kV  ; > 200 MVA & < = 600 MVA",0,0,0,0,0,0,0]
[null,null,"> 132 kV & < = 275 kV  ; > 600 MVA",0,0,0,0,0,0,0]
[null,null,"> 275 kV & < = 330 kV  ; < = 800 MVA",0,0,0,0,0,0,0]
[null,null,"> 275 kV & < = 330 kV  ; > 800 MVA & < = 1200 MVA",0,0,0,0,0,0,0]
[null,null,"> 275 kV & < = 330 kV  ; > 1200 MVA",0,0,0,0,0,0,0]
[null,null,"> 330 kV & < = 500 kV   ; < = 1000 MVA",0,0,0,0,0,0,0]
[null,null,"> 330 kV & < = 500 kV   ; > 1000 MVA & < = 1500 MVA",0,0,0,0,0,0,0]
[null,null,"> 330 kV & < = 500 kV   ; > 1500 MVA",0,0,0,0,0,0,0]
[null,null,"> 500 kV   ; < = 2000 MVA",0,0,0,0,0,0,0]
[null,null,"> 500 kV   ; > 2000 MVA & < = 3000 MVA",0,0,0,0,0,0,0]
[null,null,"> 500 kV   ; > 3000 MVA",0,0,0,0,0,0,0]
[null,null,"Other",0,0,0,0,0,0,0]
[null,"TRANSMISSION CABLES BY: \nHighest operating voltage; Insulation type","< = 33 kV; Oil Filled",0,0,0,0,0,0,0]
[null,null,"> 33 kV & < = 66 kV ; Oil Filled",0,0,0,0,0,0,0]
[null,null,"> 66 kV & < = 132 kV ; Oil Filled",0,0,0,0,0,0,0]
[null,null,"> 132 kV & < = 275 kV ; Oil Filled",0,0,0,0,0,0,0]
[null,null,"> 275 kV & < = 330 kV ; Oil Filled",0,0,0,0,0,0,0]
[null,null,"> 330 kV & < = 500 kV  ; Oil Filled",0,0,0,0,0,0,0]
[null,null,"> 500 kV  ; Oil Filled",0,0,0,0,0,0,0]
[null,null,"< = 33 kV; XLPE Insulated",0,0,0,0,0,0,0]
[null,null,"> 33 kV & < = 66 kV ; XLPE Insulated",0,0,0,0,0,0,0]
[null,null,"> 66 kV & < = 132 kV ; XLPE Insulated",0,0,0,0,0,0,0]
[null,null,"> 132 kV & < = 275 kV ; XLPE Insulated",0,0,0,0,0,0,0]
[null,null,"> 275 kV & < = 330 kV ; XLPE Insulated",0,0,0,0,0,0,0]
[null,null,"> 330 kV & < = 500 kV  ; XLPE Insulated",0,0,0,0,0,0,0]
[null,null,"> 500 kV  ; XLPE Insulated",0,0,0,0,0,0,0]
[null,null,"< = 33 kV; Other Insulated",0,0,0,0,0,0,0]
[null,null,"> 33 kV & < = 66 kV ; Other Insulated",0,0,0,0,0,0,0]
[null,null,"> 66 kV & < = 132 kV ; Other Insulated",0,0,0,0,0,0,0]
[null,null,"> 132 kV & < = 275 kV ; Other Insulated",0,0,0,0,0,0,0]
[null,null,"> 275 kV & < = 330 kV ; Other Insulated",0,0,0,0,0,0,0]
[null,null,"> 330 kV & < = 500 kV  ; Other Insulated",0,0,0,0,0,0,0]
[null,null,"> 500 kV  ; Other Insulated",0,0,0,0,0,0,0]
[null,null,"Other",0,0,0,0,0,0,0]
[null,"SUBSTATION SWITCHBAYS BY: \nHighest operating voltage; Switch type","< = 33 kV; Air Insulated circuit Breaker",0,0,0,0,0,0,0]
[null,null,"> 33 kV & < = 66 kV ; Air Insulated circuit Breaker",0,0,0,0,0,0,0]
[null,null,"> 66 kV & < = 132 kV ; Air Insulated circuit Breaker",0,0,0,0,0,0,0]
[null,null,"> 132 kV & < = 275 kV ; Air Insulated circuit Breaker",0,0,0,0,0,0,0]
[null,null,"> 275 kV & < = 330 kV ; Air Insulated circuit Breaker",0,0,0,0,0,0,0]
[null,null,"> 330 kV & < = 500 kV  ; Air Insulated circuit Breaker",0,0,0,0,0,0,0]
[null,null,"> 500 kV  ; Air Insulated circuit Breaker",0,0,0,0,0,0,0]
[null,null,"< = 33 kV; Air Insulated Isolators / Earth Switch",0,0,0,0,0,0,0]
[null,null,"> 33 kV & < = 66 kV ; Air Insulated Isolators / Earth Switch",0,0,0,0,0,0,0]
[null,null,"> 66 kV & < = 132 kV ; Air Insulated Isolators / Earth Switch",0,0,0,0,0,0,0]
[null,null,"> 132 kV & < = 275 kV ; Air Insulated Isolators / Earth Switch",0,0,0,0,0,0,0]
[null,null,"> 275 kV & < = 330 kV ; Air Insulated Isolators / Earth Switch",0,0,0,0,0,0,0]
[null,null,"> 330 kV & < = 500 kV  ; Air Insulated Isolators / Earth Switch",0,0,0,0,0,0,0]
[null,null,"> 500 kV  ; Air Insulated Isolators / Earth Switch",0,0,0,0,0,0,0]
[null,null,"< = 33 kV; VT",0,0,0,0,0,0,0]
[null,null,"> 33 kV & < = 66 kV ; VT",0,0,0,0,0,0,0]
[null,null,"> 66 kV & < = 132 kV ; VT",0,0,0,0,0,0,0]
[null,null,"> 132 kV & < = 275 kV ; VT",0,0,0,0,0,0,0]
[null,null,"> 275 kV & < = 330 kV ; VT",0,0,0,0,0,0,0]
[null,null,"> 330 kV & < = 500 kV  ; VT",0,0,0,0,0,0,0]
[null,null,"> 500 kV  ; VT",0,0,0,0,0,0,0]
[null,null,"< = 33 kV; CT",0,0,0,0,0,0,0]
[null,null,"> 33 kV & < = 66 kV ; CT",0,0,0,0,0,0,0]
[null,null,"> 66 kV & < = 132 kV ; CT",0,0,0,0,0,0,0]
[null,null,"> 132 kV & < = 275 kV ; CT",0,0,0,0,0,0,0]
[null,null,"> 275 kV & < = 330 kV ; CT",0,0,0,0,0,0,0]
[null,null,"> 330 kV & < = 500 kV  ; CT",0,0,0,0,0,0,0]
[null,null,"> 500 kV  ; CT",0,0,0,0,0,0,0]
[null,null,"< = 33 kV; GIS Module",0,0,0,0,0,0,0]
[null,null,"> 33 kV & < = 66 kV ; GIS Module",0,0,0,0,0,0,0]
[null,null,"> 66 kV & < = 132 kV ; GIS Module",0,0,0,0,0,0,0]
[null,null,"> 132 kV & < = 275 kV ; GIS Module",0,0,0,0,0,0,0]
[null,null,"> 275 kV & < = 330 kV ; GIS Module",0,0,0,0,0,0,0]
[null,null,"> 330 kV & < = 500 kV  ; GIS Module",0,0,0,0,0,0,0]
[null,null,"> 500 kV  ; GIS Module",0,0,0,0,0,0,0]
[null,null,"Other",0,0,0,0,0,0,0]
[null,"SUBSTATION POWER TRANSFORMERS BY: \nHighest operating voltage;  Ampere rating","< = 33 kV ; < = 10 MVA",0,0,0,0,0,0,0]
[null,null,"< = 33 kV ; > 10 MVA & < =  30 MVA",0,0,0,0,0,0,0]
[null,null,"< = 33 kV ; > 30 MVA",0,0,0,0,0,0,0]
[null,null,"> 33 kV & < = 66 kV  ; < = 10 MVA",0,0,0,0,0,0,0]
[null,null,"> 33 kV & < = 66 kV  ; > 10 MVA & < =  30 MVA",0,0,0,0,0,0,0]
[null,null,"> 33 kV & < = 66 kV  ; > 30 MVA",0,0,0,0,0,0,0]
[null,null,"> 66 kV & < = 132 kV  ; < = 30 MVA",0,0,0,0,0,0,0]
[null,null,"> 66 kV & < = 132 kV  ; > 30 MVA & < =  60 MVA",0,0,0,0,0,0,0]
[null,null,"> 66 kV & < = 132 kV  ; > 60 MVA",0,0,0,0,0,0,0]
[null,null,"> 132 kV & < = 220 kV  ; < = 50 MVA",0,0,0,0,0,0,0]
[null,null,"> 132 kV & < = 220 kV  ; > 50 MVA & < =  100 MVA",0,0,0,0,0,0,0]
[null,null,"> 132 kV & < = 220 kV  ; > 100 MVA",0,0,0,0,0,0,0]
[null,null,"> 220 kV & < = 275 kV  ; < = 50 MVA",0,0,0,0,0,0,0]
[null,null,"> 220 kV & < = 275 kV  ; > 50 MVA & < =  100 MVA",0,0,0,0,0,0,0]
[null,null,"> 220 kV & < = 275 kV  ; > 100 MVA",0,0,0,0,0,0,0]
[null,null,"> 275 kV & < = 330 kV  ; < = 100 MVA",0,0,0,0,0,0,0]
[null,null,"> 275 kV & < = 330 kV  ; > 100 MVA & < =  250 MVA",0,0,0,0,0,0,0]
[null,null,"> 275 kV & < = 330 kV  ; > 250 MVA",0,0,0,0,0,0,0]
[null,null,"> 330 kV & < = 500 kV   ; < = 150 MVA",0,0,0,0,0,0,0]
[null,null,"> 330 kV & < = 500 kV   ; > 150 MVA & < =  300 MVA",0,0,0,0,0,0,0]
[null,null,"> 330 kV & < = 500 kV   ; > 300 MVA",0,0,0,0,0,0,0]
[null,null,"> 500 kV   ; < = 1000 MVA",0,0,0,0,0,0,0]
[null,null,"> 500 kV   ; > 1000 MVA & < =  1500 MVA",0,0,0,0,0,0,0]
[null,null,"> 500 kV   ; > 1500 MVA",0,0,0,0,0,0,0]
[null,null,"Other",0,0,0,0,0,0,0]
[null,"SUBSTATION REACTIVE PLANT BY: \nHighest operating voltage; Function","< = 33 kV;  SVCS",0,0,0,0,0,0,0]
[null,null,"> 33 kV & < = 66 kV ;  SVCS",0,0,0,0,0,0,0]
[null,null,"> 66 kV & < = 132 kV ;  SVCS",0,0,0,0,0,0,0]
[null,null,"> 132 kV & < = 275 kV ;  SVCS",0,0,0,0,0,0,0]
[null,null,"> 275 kV & < = 330 kV ;  SVCS",0,0,0,0,0,0,0]
[null,null,"> 330 kV & < = 500 kV  ;  SVCS",0,0,0,0,0,0,0]
[null,null,"> 500 kV  ;  SVCS",0,0,0,0,0,0,0]
[null,null,"< = 33 kV;  Capacitors",0,0,0,0,0,0,0]
[null,null,"> 33 kV & < = 66 kV ;  Capacitors",0,0,0,0,0,0,0]
[null,null,"> 66 kV & < = 132 kV ;  Capacitors",0,0,0,0,0,0,0]
[null,null,"> 132 kV & < = 275 kV ;  Capacitors",0,0,0,0,0,0,0]
[null,null,"> 275 kV & < = 330 kV ;  Capacitors",0,0,0,0,0,0,0]
[null,null,"> 330 kV & < = 500 kV  ;  Capacitors",0,0,0,0,0,0,0]
[null,null,"> 500 kV  ;  Capacitors",0,0,0,0,0,0,0]
[null,null,"< = 33 kV;  Oil Filled Reactors",0,0,0,0,0,0,0]
[null,null,"> 33 kV & < = 66 kV ;  Oil Filled Reactors",0,0,0,0,0,0,0]
[null,null,"> 66 kV & < = 132 kV ;  Oil Filled Reactors",0,0,0,0,0,0,0]
[null,null,"> 132 kV & < = 275 kV ;  Oil Filled Reactors",0,0,0,0,0,0,0]
[null,null,"> 275 kV & < = 330 kV ;  Oil Filled Reactors",0,0,0,0,0,0,0]
[null,null,"> 330 kV & < = 500 kV  ;  Oil Filled Reactors",0,0,0,0,0,0,0]
[null,null,"> 500 kV  ;  Oil Filled Reactors",0,0,0,0,0,0,0]
[null,null,"Other",0,0,0,0,0,0,0]
[null,"SCADA, NETWORK CONTROL AND PROTECTION SYSTEMS BY:\nFunction",{"$f":"IF(ISBLANK(C170),\"\",C170)","v":"Site Establishment"}]
[null,null,{"$f":"IF(ISBLANK(C171),\"\",C171)","v":"Secondary Systems"}," "]
[null,null,{"$f":"IF(ISBLANK(C172),\"\",C172)","v":"Telecommunications"}]
[null,null,{"$f":"IF(ISBLANK(C173),\"\",C173)","v":"OPGW"},"                                                                "]
[null,null,{"$f":"IF(ISBLANK(C175),\"\",C175)","v":"Other Primary Plant"},null,"                                    ","                                    "]
[null,null,{"$f":"IF(ISBLANK(C176),\"\",C176)","v":"Other Lines"},"                      "]
[null,"OTHER BY: \nNSP defined",{"$f":"IF(ISBLANK(C178),\"\",C178)","v":"<NSP to enter description for Asset Category not listed above>"}]
[null,"TRANSMISSION TOWERS BY: HIGHEST OPERATING VOLTAGE; CIRCUIT CONFIGURATION","> 66 kV & < = 132 kV ; SINGLE CIRCUIT REFURBISHED",0,0,0,0,0,0,0]
[null,null,"> 132 kV & < = 275 kV ; SINGLE CIRCUIT REFURBISHED",0,0,0,0,0,0,0]
[null,null,""]
[null,"TRANSMISSION TOWER SUPPORT STRUCTURES BY: HIGHEST OPERATING VOLTAGE; CIRCUIT CONFIGURATION","> 33 kV & < = 66 kV ; SINGLE CIRCUIT REFURBISHED",0,0,0,0,0,0,0]
[null,null,"> 66 kV & < = 132 kV ; SINGLE CIRCUIT REFURBISHED",0,0,0,0,0,0,0]
[null,null,"> 132 kV & < = 275 kV ; SINGLE CIRCUIT REFURBISHED",0,0,0,0,0,0,0]
[null,null,""]
[null,"CONDUCTORS BY: VOLTAGE, MAXIMUM CONTINUOUS RATING ","> 66 kV & < = 132 kV  ; > 100 MVA & < = 400 MVA REFURBISHED",0,0,0,0,0,0,0]
[null,null,""]
[null,"SUBSTATION REACTIVE PLANT BY: \nHighest operating voltage; Function",">132 kV & <=275 kV ; SVCS REFURBISHED ",0,0,0,0,0,0,0]
[null,null,""]
[null,null,""]
[null,null,""]
[null,null,""]
[null,null,""]
[null,null,""]
[null,null,""]
[null,null,""]
[null,null,""]
[null,null,""]
[null,null,""]
[null,null,""]
[null,null,""]
[null,null,""]
[null,null,""]

{"sheet":"2.3 Augex (a)","index":6,"n_rows":199,"n_cols":35,"rows_kept":199,"cut":false,"hidden":false,"merged":[[44,34,51,34],[52,34,59,34],[141,28,147,28],[149,28,155,28],[157,28,163,28],[167,7,167,10],[168,7,168,10],[169,7,169,10],[170,7,170,10],[146,7,146,10],[147,7,147,10],[149,7,149,10],[150,7,150,10],[151,7,151,10],[152,7,152,10],[153,7,153,10],[154,7,154,10],[155,7,155,10],[157,25,163,25],[157,26,163,26],[157,27,163,27],[149,27,155,27],[165,26,171,26],[137,29,137,30],[157,7,157,10],[158,7,158,10],[159,7,159,10],[160,7,160,10],[161,7,161,10],[162,7,162,10],[163,7,163,10],[165,7,165,10],[166,7,166,10],[165,25,171,25],[165,1,171,1],[165,3,171,3],[195,7,195,10],[176,7,176,10],[177,7,177,10],[178,7,178,10],[179,7,179,10],[181,7,181,10],[182,7,182,10],[183,7,183,10],[184,7,184,10],[185,7,185,10],[193,7,193,10],[194,7,194,10],[171,7,171,10],[173,7,173,10],[189,26,195,26],[189,27,195,27],[181,27,187,27],[181,1,187,1],[181,3,187,3],[181,25,187,25],[181,26,187,26],[181,2,187,2],[189,2,195,2],[181,4,187,4],[181,5,187,5],[189,4,195,4],[189,5,195,5],[186,7,186,10],[187,7,187,10],[189,7,189,10],[190,7,190,10],[191,7,191,10],[192,7,192,10],[189,1,195,1],[189,3,195,3],[189,25,195,25],[173,26,179,26],[173,27,179,27],[165,27,171,27],[165,2,171,2],[173,2,179,2],[149,25,155,25],[149,26,155,26],[138,1,140,1],[138,3,140,3],[138,4,140,4],[138,5,140,5],[138,7,139,10],[138,26,139,26],[140,25,140,26],[141,27,147,27],[165,4,171,4],[165,5,171,5],[173,4,179,4],[173,5,179,5],[174,7,174,10],[175,7,175,10],[173,1,179,1],[173,3,179,3],[173,25,179,25],[138,29,139,29],[138,30,139,30],[137,28,140,28],[141,26,147,26],[141,1,147,1],[141,25,147,25],[138,6,140,6],[141,7,141,10],[142,7,142,10],[143,7,143,10],[144,7,144,10],[145,7,145,10],[141,2,147,2],[124,32,130,32],[124,10,130,10],[124,24,130,24],[124,25,130,25],[124,26,130,26],[124,27,130,27],[124,28,130,28],[137,25,137,26],[137,27,140,27],[138,25,139,25],[140,7,140,10],[137,31,139,31],[140,29,140,31],[137,11,137,24],[138,11,139,14],[138,23,139,24],[138,15,138,21],[139,15,140,15],[139,16,139,17],[139,18,139,19],[139,20,140,20],[139,21,140,21],[140,32,140,33],[137,32,137,33],[116,31,122,31],[116,7,122,7],[116,8,122,8],[116,9,122,9],[116,10,122,10],[116,24,122,24],[116,25,122,25],[124,29,130,29],[124,30,130,30],[124,31,130,31],[124,1,130,1],[124,2,130,2],[124,3,130,3],[124,4,130,4],[124,5,130,5],[124,6,130,6],[124,7,130,7],[124,8,130,8],[124,9,130,9],[100,24,106,24],[100,25,106,25],[108,29,114,29],[108,30,114,30],[108,31,114,31],[108,32,114,32],[116,1,122,1],[116,2,122,2],[116,3,122,3],[116,4,122,4],[116,5,122,5],[116,6,122,6],[108,10,114,10],[108,24,114,24],[108,25,114,25],[108,26,114,26],[108,27,114,27],[108,28,114,28],[116,32,122,32],[116,26,122,26],[116,27,122,27],[116,28,122,28],[116,29,122,29],[116,30,122,30],[108,1,114,1],[108,2,114,2],[108,3,114,3],[108,4,114,4],[108,5,114,5],[108,6,114,6],[108,7,114,7],[108,8,114,8],[108,9,114,9],[92,32,98,32],[100,1,106,1],[100,2,106,2],[100,3,106,3],[100,4,106,4],[100,5,106,5],[100,6,106,6],[92,10,98,10],[92,24,98,24],[92,25,98,25],[92,26,98,26],[92,27,98,27],[92,28,98,28],[100,32,106,32],[100,26,106,26],[100,27,106,27],[100,28,106,28],[100,29,106,29],[100,30,106,30],[100,31,106,31],[100,7,106,7],[100,8,106,8],[100,9,106,9],[100,10,106,10],[84,31,90,31],[84,7,90,7],[84,8,90,8],[84,9,90,9],[84,10,90,10],[84,24,90,24],[84,25,90,25],[92,29,98,29],[92,30,98,30],[92,31,98,31],[92,1,98,1],[92,2,98,2],[92,3,98,3],[92,4,98,4],[92,5,98,5],[92,6,98,6],[92,7,98,7],[92,8,98,8],[92,9,98,9],[68,24,74,24],[68,25,74,25],[76,29,82,29],[76,30,82,30],[76,31,82,31],[76,32,82,32],[84,1,90,1],[84,2,90,2],[84,3,90,3],[84,4,90,4],[84,5,90,5],[84,6,90,6],[76,10,82,10],[76,24,82,24],[76,25,82,25],[76,26,82,26],[76,27,82,27],[76,28,82,28],[84,32,90,32],[84,26,90,26],[84,27,90,27],[84,28,90,28],[84,29,90,29],[84,30,90,30],[76,1,82,1],[76,2,82,2],[76,3,82,3],[76,4,82,4],[76,5,82,5],[76,6,82,6],[76,7,82,7],[76,8,82,8],[76,9,82,9],[60,32,66,32],[68,1,74,1],[68,2,74,2],[68,3,74,3],[68,4,74,4],[68,5,74,5],[68,6,74,6],[60,10,66,10],[60,24,66,24],[60,25,66,25],[60,26,66,26],[60,27,66,27],[60,28,66,28],[68,32,74,32],[68,26,74,26],[68,27,74,27],[68,28,74,28],[68,29,74,29],[68,30,74,30],[68,31,74,31],[68,7,74,7],[68,8,74,8],[68,9,74,9],[68,10,74,10],[52,31,58,31],[52,7,58,7],[52,8,58,8],[52,9,58,9],[52,10,58,10],[52,24,58,24],[52,25,58,25],[60,29,66,29],[60,30,66,30],[60,31,66,31],[44,31,50,31],[44,32,50,32],[44,26,50,26],[44,27,50,27],[44,28,50,28],[44,8,50,8],[44,9,50,9],[52,1,58,1],[52,2,58,2],[52,3,58,3],[52,4,58,4],[52,5,58,5],[52,6,58,6],[44,10,50,10],[44,24,50,24],[44,25,50,25],[44,1,50,1],[44,2,50,2],[44,3,50,3],[44,4,50,4],[44,5,50,5],[44,6,50,6],[44,7,50,7],[52,32,58,32],[28,31,34,31],[28,32,34,32],[36,1,42,1],[36,2,42,2],[36,3,42,3],[36,4,42,4],[36,5,42,5],[36,6,42,6],[28,10,34,10],[28,24,34,24],[28,25,34,25],[28,26,34,26],[28,27,34,27],[28,28,34,28],[36,32,42,32],[36,26,42,26],[36,27,42,27],[36,28,42,28],[36,29,42,29],[36,30,42,30],[36,31,42,31],[36,7,42,7],[36,8,42,8],[36,9,42,9],[20,32,26,32],[28,1,34,1],[28,2,34,2],[28,3,34,3],[28,4,34,4],[28,5,34,5],[28,6,34,6],[28,7,34,7],[28,8,34,8],[28,9,34,9],[20,26,26,26],[20,27,26,27],[20,28,26,28],[20,29,26,29],[20,30,26,30],[20,31,26,31],[20,7,26,7],[20,8,26,8],[20,9,26,9],[20,10,26,10],[20,24,26,24],[20,25,26,25],[20,1,26,1],[20,2,26,2],[12,32,18,32],[12,8,18,8],[12,9,18,9],[12,10,18,10],[12,24,18,24],[12,25,18,25],[12,26,18,26],[11,25,11,26],[11,29,11,31],[11,32,11,33],[12,27,18,27],[12,28,18,28],[12,29,18,29],[12,30,18,30],[12,31,18,31],[12,6,18,6],[12,7,18,7],[9,31,10,31],[20,3,26,3],[20,4,26,4],[20,5,26,5],[20,6,26,6],[9,27,11,27],[9,28,11,28],[9,29,9,30],[10,11,10,14],[10,15,10,17],[138,33,139,33],[138,32,139,32],[9,32,9,33],[10,1,11,1],[10,2,11,2],[10,3,11,3],[10,4,11,4],[10,5,11,5],[10,6,11,6],[10,7,10,8],[10,9,10,10],[9,1,9,10],[9,25,9,26],[28,29,34,29],[28,30,34,30],[36,10,42,10],[36,24,42,24],[36,25,42,25],[44,29,50,29],[44,30,50,30],[60,1,66,1],[12,3,18,3],[12,4,18,4],[12,5,18,5],[137,34,140,34],[5,1,5,3],[139,22,140,22],[11,18,11,19],[10,23,10,24],[10,18,10,21],[9,11,9,24],[9,34,11,34],[138,2,140,2],[60,2,66,2],[60,3,66,3],[60,4,66,4],[60,5,66,5],[60,6,66,6],[60,7,66,7],[60,8,66,8],[60,9,66,9],[52,26,58,26],[52,27,58,27],[52,28,58,28],[52,29,58,29],[52,30,58,30],[12,1,18,1],[12,2,18,2]]}
[null,{"$f":"(LOOKUP(dms_Model,dms_Model_List,dms_Worksheet_List))","v":"REGULATORY REPORTING STATEMENT"}]
[null,{"$f":"INDEX(dms_TradingNameFull_List,MATCH(dms_TradingName,dms_TradingName_List))","v":"ElectraNet"}]
[null,{"$f":"IF(SUM(dms_SingleYear_Model)>0,CRY,CONCATENATE(FRCP_y1,\" to \",dms_MultiYear_FinalYear_Result))","v":"2018-19 to 2022-23"}]
[null,"2.3 AUGEX PROJECTS"]
[]
[null,"There are TWO tables on this worksheet - each has been 'grouped' for easy navigation. Both ROWS and COLUMNS have been grouped.  See the Instructions sheet on how to group or ungroup tables. "]
[]
[null,"NOTE: TNSP MUST PROVIDE EXPENDITURE INFORMATION ON A PROJECT CLOSE BASIS."]
[null,"2.3.1 - AUGEX ASSET DATA - SUBSTATIONS"]
[null,"SUBSTATION AND PROJECT SUMMARY",null,null,null,null,null,null,null,null,null,"PLANT AND EQUIPMENT EXPENDITURE AND VOLUME",null,null,null,null,null,null,null,null,null,null,null,null,null,"OTHER EXPENDITURE",null,"TOTAL DIRECT EXPENDITURE ($0's)","YEARS INCURRED","RELATED PARTY CONTRACTS",null,"ALL NON RELATED PARTY CONTRACTS","LAND AND EASEMENTS",null,"Comments"]
[null,"SUBSTATION ID","SUBSTATION TYPE\n(drop down)","PROJECT ID","PROJECT TYPE\n(drop down)","PROJECT TRIGGER\n(drop down)","VOLTAGE (KV)","SUBSTATION RATING\nNORMAL CYCLIC\n(MVA)",null,"SUBSTATION RATING\nN-1 EMERGENCY\n(MVA)",null,"TRANSFORMERS",null,null,null,"SWITCHGEAR",null,null,"REACTIVE PLANT",null,null,null,"OTHER PLANT ITEM","INSTALLATION (LABOUR)",null,"CIVIL WORKS","OTHER DIRECT",null,null,"RELATED PARTY MARGINS","TOTAL",null,"LAND PURCHASES","EASEMENTS"]
[null,null,null,null,null,null,null,"PRE","POST","PRE","POST","Units Added","MVA Added","OLTC INCLUDED?","Expenditure ($0's)","Insulation","Units Added","Expenditure\n($0's)","Plant Type",null,"Units Added","Expenditure\n($0's)","Expenditure\n($0's)","Volume","Expenditure\n($0's)","Expenditure ($0's)",null,null,null,"Expenditure ($0's)",null,null,"Expenditure\n($0's)"]
[null,"City West H579","Terminal station",10161,"New substation establishment","Demand growth",275,0,600,0,300,2,600,"Yes",9290665.6601662934,"Gas","6 275kV Circuit Breakers",3181974.3134178873,"Reactor",null,2,3038610.6355605982,4530894.8139606891,1,1675749.0034085442,10556487.677677913,50769281.449669152,null,"2004, 2005, 2006, 2007, 2008, 2009, 2010, 2011, 2012, 2013, 2014, 2015, 2016, 2017, 2018",null,null,null,7181022.2967059286]
[null,null,null,null,null,null,null,null,null,null,null,null,null,null,null,"Gas","11 275kV Disconnectors with ES",1124414.1465766432,null,null,null,null,312652.87023961701,1,0,0,null,null,null,null,null,null,0]
[null,null,null,null,null,null,null,null,null,null,null,null,null,null,null,"Gas","2  66kV Circuit Breaker",325190.7814811687,null,null,null,null,205211.70093160935,12,0,0,null,null,null,null,null,null,0]
[null,null,null,null,null,null,null,null,null,null,null,null,null,null,null,"Gas","2 66kV Disconnector with ES",103649.60797410713,null,null,null,null,26897.590194411936,6,0,0,null,null,null,null,null,null,0]
[null,null,null,null,null,null,null,null,null,null,null,null,null,null,null,null,null,null,null,null,null,null,null,null,0,0,null,null,null,null,null,null,0]
[null,null,null,null,null,null,null,null,null,null,null,null,null,null,null,null,null,null,null,null,null,null,null,null,0,0,null,null,null,null,null,null,0]
[null,null,null,null,null,null,null,null,null,null,null,null,null,null,null,null,null,null,null,null,null,null,null,null,0,0,null,null,null,null,null,null,0]
[null,"Project Totals",null,null,null,null,null,null,null,null,null,{"$f":"SUM(L13:L19)","v":2},{"$f":"SUM(M13:M19)","v":600},null,{"$f":"SUM(O13:O19)","v":9290665.6601662934},null,{"$f":"SUM(Q13:Q19)","v":0},{"$f":"SUM(R13:R19)","v":4735228.8494498068},null,{"$f":"SUM(T13:T19)","v":0},{"$f":"SUM(U13:U19)","v":2},{"$f":"SUM(V13:V19)","v":3038610.6355605982},{"$f":"SUM(W13:W19)","v":5075656.9753263276},{"$f":"SUM(X13:X19)","v":20},{"$f":"SUM(Y13:Y19)","v":1675749.0034085442},{"$f":"SUM(Z13)","v":10556487.677677913},{"$f":"AA13","v":50769281.449669152},{"$f":"O20+R20+V20+W20+Y20+SUM(Z20:AA20)","v":85141680.251258641},null,{"$f":"SUM(AD13)","v":0},0,0,7181022.2967059286]
[null,"Torrens Island B Substation H254","Switching station",10161,"New substation establishment","Demand growth",275,0,0,0,0,0,0,"No",0,"Air","1 275kV Circuit Breaker",110641.79255513054,null,null,null,null,null,null,205394.69359358979,null,667060.95613768965,null,"2004, 2005, 2006, 2007, 2008, 2009, 2010, 2011",null,null,null,218453.0395526491]
[null,null,null,null,null,null,null,null,null,null,null,null,null,null,null,"Air","4 275kV Disconnectors with ES",135584.74138558577,null,null,null,null,null,null,0,null,null,null,null,null,null,null,0]
[null,null,null,null,null,null,null,null,null,null,null,null,null,null,null,null,null,null,null,null,null,null,null,null,0,null,null,null,null,null,null,null,0]
[null,null,null,null,null,null,null,null,null,null,null,null,null,null,null,null,null,null,null,null,null,null,null,null,0,null,null,null,null,null,null,null,0]
[null,null,null,null,null,null,null,null,null,null,null,null,null,null,null,null,null,null,null,null,null,null,null,null,0,null,null,null,null,null,null,null,0]
[null,null,null,null,null,null,null,null,null,null,null,null,null,null,null,null,null,null,null,null,null,null,null,null,0,null,null,null,null,null,null,null,0]
[null,null,null,null,null,null,null,null,null,null,null,null,null,null,null,null,null,null,null,null,null,null,null,null,0,null,null,null,null,null,null,null,0]
[null,"Project Totals",null,null,null,null,null,null,null,null,null,{"$f":"SUM(L21:L27)","v":0},{"$f":"SUM(M21:M27)","v":0},null,{"$f":"SUM(O21:O27)","v":0},null,{"$f":"SUM(Q21:Q27)","v":0},{"$f":"SUM(R21:R27)","v":246226.5339407163},null,{"$f":"SUM(T21:T27)","v":0},{"$f":"SUM(U21:U27)","v":0},{"$f":"SUM(V21:V27)","v":0},{"$f":"SUM(W21:W27)","v":0},{"$f":"SUM(X21:X27)","v":0},{"$f":"SUM(Y21:Y27)","v":205394.69359358979},{"$f":"SUM(Z21)","v":0},{"$f":"AA21","v":667060.95613768965},{"$f":"O28+R28+V28+W28+Y28+SUM(Z28:AA28)","v":1118682.1836719958},null,{"$f":"SUM(AD21)","v":0},0,0,218453.0395526491]
[null,"Black Range H576","Switching station",10344,"New substation establishment","Net market benefit",275,0,0,0,0,0,0,"No",0,"Air","2 275kV Circuit Breakers",270174.24356270715,"Capacitor",null,2,1922915.901345476,30740.357819340228,null,1683818.5044336815,1359667.2461763592,29706211.377124656,null,"2012, 2013, 2014, 2015, 2016, 2017, 2018"]
[null,null,null,null,null,null,null,null,null,null,null,null,null,null,null,"Air","6 275kV Disconnectors with ES",149353.72247622596,null,null,null,null,47716.219372170104,null,0,0]
[null,null,null,null,null,null,null,null,null,null,null,null,null,null,null,null,null,null,null,null,null,null,null,null,0,0]
[null,null,null,null,null,null,null,null,null,null,null,null,null,null,null,null,null,null,null,null,null,null,null,null,0,0]
[null,null,null,null,null,null,null,null,null,null,null,null,null,null,null,null,null,null,null,null,null,null,null,null,0,0]
[null,null,null,null,null,null,null,null,null,null,null,null,null,null,null,null,null,null,null,null,null,null,null,null,0,0]
[null,null,null,null,null,null,null,null,null,null,null,null,null,null,null,null,null,null,null,null,null,null,null,null,0,0]
[null,"Project Totals",null,null,null,null,null,null,null,null,null,{"$f":"SUM(L29:L35)","v":0},{"$f":"SUM(M29:M35)","v":0},null,{"$f":"SUM(O29:O35)","v":0},null,{"$f":"SUM(Q29:Q35)","v":0},{"$f":"SUM(R29:R35)","v":419527.96603893314},null,{"$f":"SUM(T29:T35)","v":0},{"$f":"SUM(U29:U35)","v":2},1922915.901345476,{"$f":"SUM(W29:W35)","v":78456.577191510325},{"$f":"SUM(X29:X35)","v":0},{"$f":"SUM(Y29:Y35)","v":1683818.5044336815},{"$f":"SUM(Z29)","v":1359667.2461763592},{"$f":"AA29","v":29706211.377124656},{"$f":"O36+R36+V36+W36+Y36+SUM(Z36:AA36)","v":35170597.572310612},null,{"$f":"SUM(AD29)","v":0},0,0,0]
[null,"Ardrossan West T282","Terminal station",10615,"Capacity upgrade","Demand growth",132,20,50,10,25,2,50,"Yes",1180611.0816997627,"Air","3 132kV Circuit Breakers",137198.28469245392,"Capacitor",null,1,197698.70190057004,195615.0952022195,null,319716.74294300197,1640467.0326671659,20768471.010261919,null,"2008, 2009, 2010, 2011, 2012, 2013, 2014, 2015, 2016, 2017"]
[null,null,null,null,null,null,null,null,null,null,null,null,null,null,null,"Air","2 33kV Circuit Breakers",54205.395288580199,null,null,null,null,37389.729305685934,null,0,0]
[null,null,null,null,null,null,null,null,null,null,null,null,null,null,null,"Air","8 132kV Disconnectors with ES",177015.09394377298,null,null,null,null,27833.258713755127,null,0,0]
[null,null,null,null,null,null,null,null,null,null,null,null,null,null,null,null,null,null,null,null,null,null,7539.8103461971559,null,0,0]
[null,null,null,null,null,null,null,null,null,null,null,null,null,null,null,null,null,null,null,null,null,null,124230.39091889196,null,0,0]
[null,null,null,null,null,null,null,null,null,null,null,null,null,null,null,null,null,null,null,null,null,null,41236.214083237166,null,0,0]
[null,null,null,null,null,null,null,null,null,null,null,null,null,null,null,null,null,null,null,null,null,null,null,null,0,0]
[null,"Project Totals",null,null,null,null,null,null,null,null,null,{"$f":"SUM(L37:L43)","v":2},{"$f":"SUM(M37:M43)","v":50},null,{"$f":"SUM(O37:O43)","v":1180611.0816997627},null,{"$f":"SUM(Q37:Q43)","v":0},{"$f":"SUM(R37:R43)","v":368418.77392480709},null,{"$f":"SUM(T37:T43)","v":0},{"$f":"SUM(U37:U43)","v":1},197698.70190057004,{"$f":"SUM(W37:W43)","v":433844.49856998684},{"$f":"SUM(X37:X43)","v":0},{"$f":"SUM(Y37:Y43)","v":319716.74294300197},{"$f":"SUM(Z37)","v":1640467.0326671659},{"$f":"AA37","v":20768471.010261919},24909227.841967214,null,{"$f":"SUM(AD37)","v":0},0,0,0]
[null,"Cultana H512","Transmission substation",11101,"Capacity upgrade","Voltage issues",275,160,400,0,200,2,400,"Yes",3887900.7274885303,"Air","8 132kV Circuit Breakers",525179.97784805764,null,null,null,null,395117.46231218812,null,903752.54560900503,2833457.9777217088,45163653.92914097,null,"2010, 2011, 2012, 2013, 2014, 2015, 2016, 2017"]
[null,null,null,null,null,null,null,null,null,null,null,null,null,null,null,"Air","11 132kV Disconnectors with ES",204507.34325093613,null,null,null,null,191150.5051492652,null,0,0]
[null,null,null,null,null,null,null,null,null,null,null,null,null,null,null,"Air","5 275kV Circuit Breakers",359085.44813624129,null,null,null,null,34152.843701851678,null,0,0]
[null,null,null,null,null,null,null,null,null,null,null,null,null,null,null,"Air","13 275kV Disconnectors with ES",390436.70002933592,null,null,null,null,307146.37216867594,null,0,0]
[null,null,null,null,null,null,null,null,null,null,null,null,null,null,null,null,null,null,null,null,null,null,93393.775948841547,null,0,0]
[null,null,null,null,null,null,null,null,null,null,null,null,null,null,null,null,null,null,null,null,null,null,48604.849510582186,null,0,0]
[null,null,null,null,null,null,null,null,null,null,null,null,null,null,null,null,null,null,null,null,null,null,null,null,0,0]
[null,"Project Totals",null,null,null,null,null,null,null,null,null,{"$f":"SUM(L45:L51)","v":2},{"$f":"SUM(M45:M51)","v":400},null,{"$f":"SUM(O45:O51)","v":3887900.7274885303},null,{"$f":"SUM(Q45:Q51)","v":0},{"$f":"SUM(R45:R51)","v":1479209.4692645711},null,{"$f":"SUM(T45:T51)","v":0},{"$f":"SUM(U45:U51)","v":0},0,{"$f":"SUM(W45:W51)","v":1069565.8087914046},{"$f":"SUM(X45:X51)","v":0},{"$f":"SUM(Y45:Y51)","v":903752.54560900503},{"$f":"SUM(Z45)","v":2833457.9777217088},{"$f":"AA45","v":45163653.92914097},{"$f":"O52+R52+V52+W52+Y52+SUM(Z52:AA52)","v":55337540.458016187},null,{"$f":"SUM(AD45)","v":0},0,0,0]
[null,"Tailem Bend H114","Transmission substation",11602,"Capacity upgrade","Net market benefit",275,0,160,0,160,0,0,"No",0,"Air","2 275kV Circuit Breakers",276398.04403372417,null,null,null,null,67219.429741134125,null,166482.70988812385,2072301.5694366738,5732913.7487316374,null,"2014, 2015, 2016, 2017, 2018, 2019"]
[null,null,null,null,null,null,null,null,null,null,null,null,null,null,null,"Air","5 275kV Disconnectors with ES",125169.98576081947,null,null,null,null,149533.79292208687,null,0,0]
[null,null,null,null,null,null,null,null,null,null,null,null,null,null,null,null,null,null,null,null,null,null,14239.971442086138,null,0,0]
[null,null,null,null,null,null,null,null,null,null,null,null,null,null,null,null,null,null,null,null,null,null,null,null,0,0]
[null,null,null,null,null,null,null,null,null,null,null,null,null,null,null,null,null,null,null,null,null,null,null,null,0,0]
[null,null,null,null,null,null,null,null,null,null,null,null,null,null,null,null,null,null,null,null,null,null,null,null,0,0]
[null,null,null,null,null,null,null,null,null,null,null,null,null,null,null,null,null,null,null,null,null,null,null,null,0,0]
[null,"Project Totals",null,null,null,null,null,null,null,null,null,{"$f":"SUM(L53:L59)","v":0},{"$f":"SUM(M53:M59)","v":0},null,{"$f":"SUM(O53:O59)","v":0},null,{"$f":"SUM(Q53:Q59)","v":0},{"$f":"SUM(R53:R59)","v":401568.02979454363},null,{"$f":"SUM(T53:T59)","v":0},{"$f":"SUM(U53:U59)","v":0},0,{"$f":"SUM(W53:W59)","v":230993.19410530714},{"$f":"SUM(X53:X59)","v":0},{"$f":"SUM(Y53:Y59)","v":166482.70988812385},{"$f":"SUM(Z53)","v":2072301.5694366738},{"$f":"AA53","v":5732913.7487316374},{"$f":"O60+R60+V60+W60+Y60+SUM(Z60:AA60)","v":8604259.2519562859},null,{"$f":"SUM(AD53)","v":0},0,0,0]
[null,"<Enter substation ID>",null,null,null,null,""]
[]
[]
[]
[]
[]
[]
[null,"Project Totals",null,null,null,null,null,null,null,null,null,{"$f":"SUM(L61:L66)","v":0},{"$f":"SUM(M61:M66)","v":0},null,{"$f":"SUM(O61:O66)","v":0},null,{"$f":"SUM(Q61:Q66)","v":0},{"$f":"SUM(R61:R66)","v":0},null,{"$f":"SUM(T61:T66)","v":0},0,0,0,0,0,0,{"$f":"O66+R66+U66+V66+SUM(X66:Z66)","v":0},null,{"$f":"SUM(AC61:AC66)","v":0},{"$f":"SUM(AD61:AD66)","v":0},{"$f":"SUM(AE61:AE66)","v":0},{"$f":"SUM(AF61:AF66)","v":0},{"$f":"SUM(AG61:AG66)","v":0}]
[null,"<Enter substation ID>",null,null,null,null,""]
[]
[]
[]
[]
[]
[]
[null,"Project Totals",null,null,null,null,null,null,null,null,null,{"$f":"SUM(L69:L74)","v":0},{"$f":"SUM(M69:M74)","v":0},null,{"$f":"SUM(O69:O74)","v":0},null,{"$f":"SUM(Q69:Q74)","v":0},{"$f":"SUM(R69:R74)","v":0},null,{"$f":"SUM(T69:T74)","v":0},0,0,0,0,0,0,{"$f":"O74+R74+U74+V74+SUM(X74:Z74)","v":0},null,{"$f":"SUM(AC69:AC74)","v":0},{"$f":"SUM(AD69:AD74)","v":0},{"$f":"SUM(AE69:AE74)","v":0},{"$f":"SUM(AF69:AF74)","v":0},{"$f":"SUM(AG69:AG74)","v":0}]
[null,"<Enter substation ID>",null,null,null,null,""]
[]
[]
[]
[]
[]
[]
[null,"Project Totals",null,null,null,null,null,null,null,null,null,{"$f":"SUM(L77:L82)","v":0},{"$f":"SUM(M77:M82)","v":0},null,{"$f":"SUM(O77:O82)","v":0},null,{"$f":"SUM(Q77:Q82)","v":0},{"$f":"SUM(R77:R82)","v":0},null,{"$f":"SUM(T77:T82)","v":0},0,0,0,0,0,0,{"$f":"O82+R82+U82+V82+SUM(X82:Z82)","v":0},null,{"$f":"SUM(AC77:AC82)","v":0},{"$f":"SUM(AD77:AD82)","v":0},{"$f":"SUM(AE77:AE82)","v":0},{"$f":"SUM(AF77:AF82)","v":0},{"$f":"SUM(AG77:AG82)","v":0}]
[null,"<Enter substation ID>",null,null,null,null,""]
[]
[]
[]
[]
[]
[]
[null,"Project Totals",null,null,null,null,null,null,null,null,null,{"$f":"SUM(L85:L90)","v":0},{"$f":"SUM(M85:M90)","v":0},null,{"$f":"SUM(O85:O90)","v":0},null,{"$f":"SUM(Q85:Q90)","v":0},{"$f":"SUM(R85:R90)","v":0},null,{"$f":"SUM(T85:T90)","v":0},0,0,0,0,0,0,{"$f":"O90+R90+U90+V90+SUM(X90:Z90)","v":0},null,{"$f":"SUM(AC85:AC90)","v":0},{"$f":"SUM(AD85:AD90)","v":0},{"$f":"SUM(AE85:AE90)","v":0},{"$f":"SUM(AF85:AF90)","v":0},{"$f":"SUM(AG85:AG90)","v":0}]
[null,"<Enter substation ID>",null,null,null,null,""]
[]
[]
[]
[]
[]
[]
[null,"Project Totals",null,null,null,null,null,null,null,null,null,{"$f":"SUM(L93:L98)","v":0},{"$f":"SUM(M93:M98)","v":0},null,{"$f":"SUM(O93:O98)","v":0},null,{"$f":"SUM(Q93:Q98)","v":0},{"$f":"SUM(R93:R98)","v":0},null,{"$f":"SUM(T93:T98)","v":0},0,0,0,0,0,0,{"$f":"O98+R98+U98+V98+SUM(X98:Z98)","v":0},null,{"$f":"SUM(AC93:AC98)","v":0},{"$f":"SUM(AD93:AD98)","v":0},{"$f":"SUM(AE93:AE98)","v":0},{"$f":"SUM(AF93:AF98)","v":0},{"$f":"SUM(AG93:AG98)","v":0}]
[null,"<Enter substation ID>",null,null,null,null,""]
[]
[]
[]
[]
[]
[]
[null,"Project Totals",null,null,null,null,null,null,null,null,null,{"$f":"SUM(L101:L106)","v":0},{"$f":"SUM(M101:M106)","v":0},null,{"$f":"SUM(O101:O106)","v":0},null,{"$f":"SUM(Q101:Q106)","v":0},{"$f":"SUM(R101:R106)","v":0},null,{"$f":"SUM(T101:T106)","v":0},0,0,0,0,0,0,{"$f":"O106+R106+U106+V106+SUM(X106:Z106)","v":0},null,{"$f":"SUM(AC101:AC106)","v":0},{"$f":"SUM(AD101:AD106)","v":0},{"$f":"SUM(AE101:AE106)","v":0},{"$f":"SUM(AF101:AF106)","v":0},{"$f":"SUM(AG101:AG106)","v":0}]
[null,"<Enter substation ID>",null,null,null,null,""]
[]
[]
[]
[]
[]
[]
[null,"Project Totals",null,null,null,null,null,null,null,null,null,{"$f":"SUM(L109:L114)","v":0},{"$f":"SUM(M109:M114)","v":0},null,{"$f":"SUM(O109:O114)","v":0},null,{"$f":"SUM(Q109:Q114)","v":0},{"$f":"SUM(R109:R114)","v":0},null,{"$f":"SUM(T109:T114)","v":0},0,0,0,0,0,0,{"$f":"O114+R114+U114+V114+SUM(X114:Z114)","v":0},null,{"$f":"SUM(AC109:AC114)","v":0},{"$f":"SUM(AD109:AD114)","v":0},{"$f":"SUM(AE109:AE114)","v":0},{"$f":"SUM(AF109:AF114)","v":0},{"$f":"SUM(AG109:AG114)","v":0}]
[null,"<Enter substation ID>",null,null,null,null,""]
[]
[]
[]
[]
[]
[]
[null,"Project Totals",null,null,null,null,null,null,null,null,null,{"$f":"SUM(L117:L122)","v":0},{"$f":"SUM(M117:M122)","v":0},null,{"$f":"SUM(O117:O122)","v":0},null,{"$f":"SUM(Q117:Q122)","v":0},{"$f":"SUM(R117:R122)","v":0},null,{"$f":"SUM(T117:T122)","v":0},0,0,0,0,0,0,{"$f":"O122+R122+U122+V122+SUM(X122:Z122)","v":0},null,{"$f":"SUM(AC117:AC122)","v":0},{"$f":"SUM(AD117:AD122)","v":0},{"$f":"SUM(AE117:AE122)","v":0},{"$f":"SUM(AF117:AF122)","v":0},{"$f":"SUM(AG117:AG122)","v":0}]
[null,"<Enter substation ID>",null,null,null,null,""]
[]
[]
[]
[]
[]
[]
[null,"Project Totals",null,null,null,null,null,null,null,null,null,{"$f":"SUM(L125:L130)","v":0},{"$f":"SUM(M125:M130)","v":0},null,{"$f":"SUM(O125:O130)","v":0},null,{"$f":"SUM(Q125:Q130)","v":0},{"$f":"SUM(R125:R130)","v":0},null,{"$f":"SUM(T125:T130)","v":0},0,0,0,0,0,0,{"$f":"O130+R130+U130+V130+SUM(X130:Z130)","v":0},null,{"$f":"SUM(AC125:AC130)","v":0},{"$f":"SUM(AD125:AD130)","v":0},{"$f":"SUM(AE125:AE130)","v":0},{"$f":"SUM(AF125:AF130)","v":0},{"$f":"SUM(AG125:AG130)","v":0}]
[null,null,null,null,null,null,null,null,null,null,"Non material projects",null,null,null,null,null,null,null,null,null,null,null,null,null,null,null,null,32611934.611343086]
[null,null,null,null,null,null,null,null,null,null,"Non material projects"]
[]
[null,"NOTE: TNSP MUST PROVIDE EXPENDITURE INFORMATION ON A PROJECT CLOSE BASIS."]
[null,"2.3.2 - AUGEX ASSET DATA - LINES"]
[null,"LINE AND PROJECT SUMMARY",null,null,null,null,null,null,null,null,null,"PLANT AND EQUIPMENT EXPENDITURE AND VOLUME",null,null,null,null,null,null,null,null,null,null,null,null,null,"OTHER EXPENDITURE",null,"TOTAL DIRECT EXPENDITURE ($0's)","YEARS INCURRED","ALL RELATED PARTY CONTRACTS",null,"ALL NON RELATED PARTY CONTRACTS","LAND AND EASEMENTS",null,"Comments"]
[null,"LINE ID",null,"PROJECT ID","PROJECT TYPE\n(drop down)","PROJECT TRIGGER\n(drop down)","VOLTAGE (KV)\n(drop down)","ROUTE LINE LENGTH ADDED",null,null,null,"TOWERS/POLES (INCLUDING STRUCTURES, AND CIVIL WORKS)",null,null,null,"LINES AND CABLES",null,null,null,null,null,null,"OTHER PLANT ITEM","INSTALLATION (LABOUR)",null,"CIVIL WORKS","OTHER DIRECT",null,null,"RELATED PARTY MARGINS","TOTAL",null,"LAND PURCHASES","EASEMENTS"]
[null,null,null,null,null,null,null,null,null,null,null,null,null,null,null,"Type","Rating (MVA)",null,"N-1 Emergency Rating (MVA)",null,"Circuit KM Added","Expenditure\n($0's)","Expenditure\n($0's)"]
[null,null,null,null,null,null,null,"KM ADDED",null,null,null,"Configuration","Towers/Poles Added","Towers/Poles Upgraded","Expenditure\n($0's)",null,"PRE","POST","PRE","POST",null,null,null,"Volume","Expenditure\n($0's)","Expenditure ($0's)",null,null,null,"Expenditure ($0's)",null,null,"Expenditure\n($0's)"]
[null,"F1949 TIPS - CITY WEST CABLE ",null,10161,"New line on new route - single circuit","Demand growth",275,18.399999999999999,null,null,null,"Other - specify",0,0,0,"Underground cable",0,750,0,0,18.399999999999999,81368166.194088355,null,null,20247142.568054799,null,1658162.5932867758,null,"2004, 2005, 2006, 2007, 2008, 2009, 2010, 2011, 2012, 2013, 2014, 2015, 2016, 2017, 2018",null,null,null,349667.50696899864,375271.5138769623]
[null,null,null,null,null,null,null,null,null,null,null,null,null,null,null,null,null,null,null,null,null,null,null,null,null,null,0]
[null,null,null,null,null,null,null,null,null,null,null,null,null,null,null,null,null,null,null,null,null,null,null,null,null,null,0]
[null,null,null,null,null,null,null,null,null,null,null,null,null,null,null,null,null,null,null,null,null,null,null,null,null,null,0]
[null,null,null,null,null,null,null,null,null,null,null,null,null,null,null,null,null,null,null,null,null,null,null,null,null,null,0]
[null,null,null,null,null,null,null,null,null,null,null,null,null,null,null,null,null,null,null,null,null,null,null,null,null,null,0]
[null,null,null,null,null,null,null,null,null,null,null,null,null,null,null,null,null,null,null,null,null,null,null,null,null,null,0]
[null,"Project Totals",null,null,null,null,null,null,null,null,null,null,{"$f":"SUM(M142:M148)","v":0},{"$f":"SUM(N142:N148)","v":0},{"$f":"SUM(O142:O148)","v":0},null,null,null,null,null,{"$f":"SUM(U142:U148)","v":18.399999999999999},{"$f":"SUM(V142:V148)","v":81368166.194088355},{"$f":"SUM(W142:W147)","v":0},{"$f":"SUM(X142:X147)","v":0},{"$f":"SUM(Y142:Y148)","v":20247142.568054799},{"$f":"SUM(Z142:Z148)","v":0},{"$f":"SUM(AA142:AA148)","v":1658162.5932867758},{"$f":"O149+V149+W149+Y149+SUM(Z149:AA149)","v":103273471.35542993},null,{"$f":"SUM(AD142:AD148)","v":0},{"$f":"SUM(AE142:AE148)","v":0},{"$f":"SUM(AF142:AF148)","v":0},{"$f":"SUM(AG142:AG148)","v":349667.50696899864},{"$f":"SUM(AH142:AH148)","v":375271.5138769623}]
[null,"F1923 TAILEM BEND - SOUTH EAST No 1",null,10344,"Other","Net market benefit",275,0,null,null,null,"Multiple circuit steel tower",0,0,0,"Overhead line",450,650,450,650,0,0,null,null,null,null,1413164.0235305699,null,"2012, 2013, 2014, 2015, 2016, 2017, 2018"]
[null,"F1923 TAILEM BEND - SOUTH",null,null,null,null,275,0,null,null,null,null,null,null,null,null,null,null,null,null,null,null,null,null,null,null,0]
[null,null,null,null,null,null,null,null,null,null,null,null,null,null,null,null,null,null,null,null,null,null,null,null,null,null,0]
[null,null,null,null,null,null,null,null,null,null,null,null,null,null,null,null,null,null,null,null,null,null,null,null,null,null,0]
[null,null,null,null,null,null,null,null,null,null,null,null,null,null,null,null,null,null,null,null,null,null,null,null,null,null,0]
[null,null,null,null,null,null,null,null,null,null,null,null,null,null,null,null,null,null,null,null,null,null,null,null,null,null,0]
[null,null,null,null,null,null,null,null,null,null,null,null,null,null,null,null,null,null,null,null,null,null,null,null,null,null,0]
[null,"Project Totals",null,null,null,null,null,null,null,null,null,null,{"$f":"SUM(M150:M156)","v":0},{"$f":"SUM(N150:N156)","v":0},{"$f":"SUM(O150:O156)","v":0},null,null,null,null,null,{"$f":"SUM(U150:U156)","v":0},{"$f":"SUM(V150:V156)","v":0},{"$f":"SUM(W150:W155)","v":0},{"$f":"SUM(X150:X155)","v":0},{"$f":"SUM(Y150:Y156)","v":0},{"$f":"SUM(Z150:Z156)","v":0},{"$f":"SUM(AA150:AA156)","v":1413164.0235305699},{"$f":"O157+V157+W157+Y157+SUM(Z157:AA157)","v":1413164.0235305699},null,{"$f":"SUM(AD150:AD156)","v":0},{"$f":"SUM(AE150:AE156)","v":0},{"$f":"SUM(AF150:AF156)","v":0},{"$f":"SUM(AG150:AG156)","v":0},{"$f":"SUM(AH150:AH156)","v":0}]
[null,"F1810 CULTANA - YADNARIE",null,11101,"Line rebuild over existing route - single circuit","Voltage issues",132,1.7999999999999998,null,null,null,"Single circuit steel tower",6,5,850844.53966805525,"Overhead line",0,96,0,96,1.8,535312.2169983054,null,null,111507.7833826944,null,14899686.146983793,null,"2010, 2011, 2012, 2013, 2014, 2015, 2016, 2017"]
[null,null,null,null,null,null,275,0.5,null,null,null,"Multiple circuit steel tower",1,6,1150602.6823711079,"Overhead line",0,457,0,457,0.5,315427.12455835385,null,null,46014.761273158183,null,0]
[null,"F1935 DAVENPORT - CULTANA No 1 ",null,null,null,null,null,null,null,null,null,null,null,null,null,null,null,null,null,null,null,null,null,null,null,null,0]
[null,null,null,null,null,null,null,null,null,null,null,null,null,null,null,null,null,null,null,null,null,null,null,null,null,null,0]
[null,null,null,null,null,null,null,null,null,null,null,null,null,null,null,null,null,null,null,null,null,null,null,null,null,null,0]
[null,null,null,null,null,null,null,null,null,null,null,null,null,null,null,null,null,null,null,null,null,null,null,null,null,null,0]
[null,null,null,null,null,null,null,null,null,null,null,null,null,null,null,null,null,null,null,null,null,null,null,null,null,null,0]
[null,"Project Totals",null,null,null,null,null,null,null,null,null,null,{"$f":"SUM(M158:M164)","v":7},{"$f":"SUM(N158:N164)","v":11},{"$f":"SUM(O158:O164)","v":2001447.2220391631},null,null,null,null,null,{"$f":"SUM(U158:U164)","v":2.2999999999999998},{"$f":"SUM(V158:V164)","v":850739.3415566592},{"$f":"SUM(W158:W163)","v":0},{"$f":"SUM(X158:X163)","v":0},{"$f":"SUM(Y158:Y164)","v":157522.54465585257},{"$f":"SUM(Z158:Z164)","v":0},{"$f":"SUM(AA158:AA164)","v":14899686.146983793},{"$f":"O165+V165+W165+Y165+SUM(Z165:AA165)","v":17909395.255235467},null,{"$f":"SUM(AD158:AD164)","v":0},{"$f":"SUM(AE158:AE164)","v":0},{"$f":"SUM(AF158:AF164)","v":0},{"$f":"SUM(AG158:AG164)","v":0},{"$f":"SUM(AH158:AH164)","v":0}]
[null,"<Enter line ID>"]
[]
[]
[]
[]
[]
[]
[null,"Project Totals",null,null,null,null,null,null,null,null,null,null,{"$f":"SUM(M166:M172)","v":0},{"$f":"SUM(N166:N172)","v":0},{"$f":"SUM(O166:O172)","v":0},null,null,null,null,null,{"$f":"SUM(U166:U172)","v":0},{"$f":"SUM(V166:V172)","v":0},{"$f":"SUM(W166:W171)","v":0},{"$f":"SUM(X166:X171)","v":0},{"$f":"SUM(Y166:Y172)","v":0},{"$f":"SUM(Z166:Z172)","v":0},{"$f":"SUM(AA166:AA172)","v":0},{"$f":"K100+R100+S100+SUM(U100:W100)","v":0},null,{"$f":"SUM(AD166:AD172)","v":0},{"$f":"SUM(AE166:AE172)","v":0},{"$f":"SUM(AF166:AF172)","v":0},{"$f":"SUM(AG166:AG172)","v":0},{"$f":"SUM(AH166:AH172)","v":0}]
[null,"<Enter line ID>"]
[]
[]
[]
[]
[]
[]
[null,"Project Totals",null,null,null,null,null,null,null,null,null,null,{"$f":"SUM(M174:M180)","v":0},{"$f":"SUM(N174:N180)","v":0},{"$f":"SUM(O174:O180)","v":0},null,null,null,null,null,{"$f":"SUM(U174:U180)","v":0},{"$f":"SUM(V174:V180)","v":0},{"$f":"SUM(W174:W179)","v":0},{"$f":"SUM(X174:X179)","v":0},{"$f":"SUM(Y174:Y180)","v":0},{"$f":"SUM(Z174:Z180)","v":0},{"$f":"SUM(AA174:AA180)","v":0},{"$f":"K108+R108+S108+SUM(U108:W108)","v":0},null,{"$f":"SUM(AD174:AD180)","v":0},{"$f":"SUM(AE174:AE180)","v":0},{"$f":"SUM(AF174:AF180)","v":0},{"$f":"SUM(AG174:AG180)","v":0},{"$f":"SUM(AH174:AH180)","v":0}]
[null,"<Enter line ID>"]
[]
[]
[]
[]
[]
[]
[null,"Project Totals",null,null,null,null,null,null,null,null,null,null,{"$f":"SUM(M182:M188)","v":0},{"$f":"SUM(N182:N188)","v":0},{"$f":"SUM(O182:O188)","v":0},null,null,null,null,null,{"$f":"SUM(U182:U188)","v":0},{"$f":"SUM(V182:V188)","v":0},{"$f":"SUM(W182:W187)","v":0},{"$f":"SUM(X182:X187)","v":0},{"$f":"SUM(Y182:Y188)","v":0},{"$f":"SUM(Z182:Z188)","v":0},{"$f":"SUM(AA182:AA188)","v":0},{"$f":"K116+R116+S116+SUM(U116:W116)","v":0},null,{"$f":"SUM(AD182:AD188)","v":0},{"$f":"SUM(AE182:AE188)","v":0},{"$f":"SUM(AF182:AF188)","v":0},{"$f":"SUM(AG182:AG188)","v":0},{"$f":"SUM(AH182:AH188)","v":0}]
[null,"<Enter line ID>"]
[]
[]
[]
[]
[]
[]
[null,"Project Totals",null,null,null,null,null,null,null,null,null,null,{"$f":"SUM(M190:M196)","v":0},{"$f":"SUM(N190:N196)","v":0},{"$f":"SUM(O190:O196)","v":0},null,null,null,null,null,{"$f":"SUM(U190:U196)","v":0},{"$f":"SUM(V190:V196)","v":0},{"$f":"SUM(W190:W195)","v":0},{"$f":"SUM(X190:X195)","v":0},{"$f":"SUM(Y190:Y196)","v":0},{"$f":"SUM(Z190:Z196)","v":0},{"$f":"SUM(AA190:AA196)","v":0},{"$f":"K124+R124+S124+SUM(U124:W124)","v":0},null,{"$f":"SUM(AD190:AD196)","v":0},{"$f":"SUM(AE190:AE196)","v":0},{"$f":"SUM(AF190:AF196)","v":0},{"$f":"SUM(AG190:AG196)","v":0},{"$f":"SUM(AH190:AH196)","v":0}]
[null,null,null,null,null,null,null,null,null,null,"Non material projects",null,null,null,null,null,null,null,null,null,null,null,null,null,null,null,null,34743667.931250431,null,null,null,null,1020427.3757956782,23392567.580336042]
[null,null,null,null,null,null,null,null,null,null,"Non material projects"]

{"sheet":"2.3 Augex (b)","index":7,"n_rows":31,"n_cols":9,"rows_kept":31,"cut":false,"hidden":false,"merged":[[8,2,8,8],[17,2,17,8],[25,2,25,8],[5,1,5,3]]}
[null,{"$f":"(LOOKUP(dms_Model,dms_Model_List,dms_Worksheet_List))","v":"REGULATORY REPORTING STATEMENT"}]
[null,{"$f":"INDEX(dms_TradingNameFull_List,MATCH(dms_TradingName,dms_TradingName_List))","v":"ElectraNet"}]
[null,{"$f":"IF(SUM(dms_SingleYear_Model)>0,CRY,CONCATENATE(FRCP_y1,\" to \",dms_MultiYear_FinalYear_Result))","v":"2018-19 to 2022-23"}]
[null,"2.3 AUGEX PROJECTS"]
[]
[null,"There are THREE tables on this worksheet - each has been 'grouped' for easy navigation. See the Instructions sheet on how to group or ungroup tables. "]
[]
[null,"2.3.4 - AUGEX - TOTAL EXPENDITURE"]
[null,null,{"$f":"CONCATENATE(\"EXPENDITURE\nForecast ($0's. real \",dms_DollarReal,\")\")","v":"EXPENDITURE\nForecast ($0's. real June 2018)"}]
[null,"As incurred",{"$f":"CRCP_y4","v":"2016-17"},{"$f":"CRCP_y5","v":"2017-18"},{"$f":"FRCP_y1","v":"2018-19"},{"$f":"FRCP_y2","v":"2019-20"},{"$f":"FRCP_y3","v":"2020-21"},{"$f":"FRCP_y4","v":"2021-22"},{"$f":"FRCP_y5","v":"2022-23"}]
[null,"Substations",13246963.042262724,15214331.519364599,13380238.03855446,1309866.0639230467,4337527.9149517063,3146032.1171603967,2096598.9770246546]
[null,"Lines",8132793.936254926,2201033.8662418234,124812.18257865662,15910.971433585979,113160.13210953884,54036.483570323522,72418.264573427834]
[null,"Other assets",2404241.2773809182,2028238.8422241728,405158.61550471681,1311957.2957178734,495662.65930853406,481954.57078541839,198874.20844651782]
[null,"Total ",{"$f":"SUM(C11:C13)","v":23783998.255898569},{"$f":"SUM(D11:D13)","v":19443604.227830596},13910208.836637834,2637734.331074506,4946350.7063697791,3682023.1715161381,2367891.4500446003]
[]
[]
[null,"2.3.5 - AUGEX - BY DRIVER"]
[null,null,{"$f":"CONCATENATE(\"EXPENDITURE\nForecast ($0's. real \",dms_DollarReal,\")\")","v":"EXPENDITURE\nForecast ($0's. real June 2018)"}]
[null,"As incurred",{"$f":"CRCP_y4","v":"2016-17"},{"$f":"CRCP_y5","v":"2017-18"},{"$f":"FRCP_y1","v":"2018-19"},{"$f":"FRCP_y2","v":"2019-20"},{"$f":"FRCP_y3","v":"2020-21"},{"$f":"FRCP_y4","v":"2021-22"},{"$f":"FRCP_y5","v":"2022-23"}]
[null,"Demand driven augex",433953.03125123517,804196.05679340498,0,0,0,0,0]
[null,"Non-demand driven augex",23350045.224647332,18639408.17103719,13910208.836637834,2637734.331074506,4946350.7063697791,3682023.1715161381,2367891.4500446003]
[null,"Total ",{"$f":"SUM(C20:C21)","v":23783998.255898569},19443604.227830596,13910208.836637834,2637734.331074506,4946350.7063697791,3682023.1715161381,2367891.4500446003]
[]
[]
[null,"2.3.6 - AUGEX - DEMAND DRIVEN"]
[null,null,{"$f":"CONCATENATE(\"EXPENDITURE\nForecast ($0's. real \",dms_DollarReal,\")\")","v":"EXPENDITURE\nForecast ($0's. real June 2018)"}]
[null,"As incurred",{"$f":"CRCP_y4","v":"2016-17"},{"$f":"CRCP_y5","v":"2017-18"},{"$f":"FRCP_y1","v":"2018-19"},{"$f":"FRCP_y2","v":"2019-20"},{"$f":"FRCP_y3","v":"2020-21"},{"$f":"FRCP_y4","v":"2021-22"},{"$f":"FRCP_y5","v":"2022-23"}]
[null,"Substations",140612.85303027666,380598.01015001227,0,0,0,0,0]
[null,"Lines",293340.17822095851,423598.04664339276,0,0,0,0,0]
[null,"Other assets",0,0,0,0,0,0,0]
[null,"Total ",{"$f":"SUM(C28:C30)","v":433953.03125123517},{"$f":"SUM(D28:D30)","v":804196.05679340498},{"$f":"SUM(E28:E30)","v":0},0,0,0,0]

{"sheet":"2.5 Connections","index":8,"n_rows":92,"n_cols":9,"rows_kept":92,"cut":false,"hidden":false,"merged":[[8,2,8,8]]}
[null,{"$f":"(LOOKUP(dms_Model,dms_Model_List,dms_Worksheet_List))","v":"REGULATORY REPORTING STATEMENT"}]
[null,{"$f":"INDEX(dms_TradingNameFull_List,MATCH(dms_TradingName,dms_TradingName_List))","v":"ElectraNet"}]
[null,{"$f":"IF(SUM(dms_SingleYear_Model)>0,CRY,CONCATENATE(FRCP_y1,\" to \",dms_MultiYear_FinalYear_Result))","v":"2018-19 to 2022-23"}]
[null,"2.5 CONNECTIONS EXPENDITURE"]
[]
[null,"There are TWO tables on this worksheet. Each has been grouped (or sub-grouped).  See the Instructions sheet on how to group or ungroup data."]
[]
[null,"2.5.1 - EXPENDITURE ON CONNECTION PROJECTS"]
[null,null,{"$f":"CONCATENATE(\"EXPENDITURE\nForecast \n($0's. real \",dms_DollarReal,\")\")","v":"EXPENDITURE\nForecast \n($0's. real June 2018)"}]
[null,null,{"$f":"CRCP_y4","v":"2016-17"},{"$f":"CRCP_y5","v":"2017-18"},{"$f":"FRCP_y1","v":"2018-19"},{"$f":"FRCP_y2","v":"2019-20"},{"$f":"FRCP_y3","v":"2020-21"},{"$f":"FRCP_y4","v":"2021-22"},{"$f":"FRCP_y5","v":"2022-23"}]
[null,"DIRECT MATERIALS EXPENDITURE"]
[null,"EC.10370 Clare North New 132_33 kV Substation",4122570.0441523055]
[null,"EC.11209 Munno Para New 275_66 kV Connection Point",5032823.3281503404]
[null,"EC.11826 Dalrymple Substation Upgrade",1041300.8061625704]
[null,"EC.14085 Gawler East Connection Point",null,null,null,null,null,1129744.5525661707]
[]
[]
[]
[]
[]
[]
[]
[]
[]
[]
[]
[]
[]
[]
[]
[]
[]
[]
[]
[]
[]
[null,"DIRECT LABOUR EXPENDITURE"]
[null,{"$f":"IF(ISBLANK(B12),\"\",B12)","v":"EC.10370 Clare North New 132_33 kV Substation"},2032412.7569133011]
[null,{"$f":"IF(ISBLANK(B13),\"\",B13)","v":"EC.11209 Munno Para New 275_66 kV Connection Point"},3839556.2691201204]
[null,"EC.11826 Dalrymple Substation Upgrade",1542793.2863788009]
[null,"EC.14085 Gawler East Connection Point",null,null,null,null,null,452416.93920062121]
[null,""]
[null,""]
[null,""]
[null,""]
[null,""]
[null,""]
[null,""]
[null,""]
[null,""]
[null,""]
[null,""]
[null,""]
[null,""]
[null,""]
[null,""]
[null,""]
[null,""]
[null,""]
[null,""]
[null,""]
[null,""]
[]
[]
[]
[null,"2.5.2 - DESCRIPTION OF CONNECTION PROJECTS"]
[null,null,"CONNECTION RATING \n(MVA)","CONNECTION \nVOLTAGE \n(KV)","UNDERGROUND / OVERHEAD\n(drop down)","YEAR CONNECTION PROJECT COMPLETED "]
[null,{"$f":"IF(ISBLANK(B12),\"\",B12)","v":"EC.10370 Clare North New 132_33 kV Substation"},50,132,"Overhead",2017]
[null,{"$f":"IF(ISBLANK(B13),\"\",B13)","v":"EC.11209 Munno Para New 275_66 kV Connection Point"},225,275,"Overhead",2017]
[null,{"$f":"IF(ISBLANK(B14),\"\",B14)","v":"EC.11826 Dalrymple Substation Upgrade"},25,132,"Overhead",2017]
[null,"EC.14085 Gawler East Connection Point",25,132,"Overhead",2019]
[null,""]
[null,""]
[null,""]
[null,""]
[null,""]
[null,""]
[null,""]
[null,""]
[null,""]
[null,""]
[null,""]
[null,""]
[null,""]
[null,""]
[null,""]
[null,""]
[null,""]
[null,""]
[null,""]
[null,""]
[null,""]

{"sheet":"2.6 Non-network","index":9,"n_rows":119,"n_cols":11,"rows_kept":119,"cut":false,"hidden":false,"merged":[[121,1,121,3],[122,1,122,3],[123,1,123,3],[114,1,114,3],[115,1,115,3],[116,1,116,3],[118,1,118,3],[119,1,119,3],[109,1,109,3],[111,1,111,3],[112,1,112,3],[113,1,113,3],[120,1,120,3],[97,1,97,3],[98,1,98,3],[99,1,99,3],[100,1,100,3],[108,1,108,3],[107,1,107,3],[101,1,101,3],[102,1,102,3],[104,1,104,3],[105,1,105,3],[106,1,106,3],[94,4,94,10],[5,1,5,2],[39,1,49,1],[19,1,29,1],[63,4,63,10],[55,4,55,10],[8,4,8,10],[59,1,59,3],[58,1,58,3],[57,1,57,3]]}
[null,{"$f":"(LOOKUP(dms_Model,dms_Model_List,dms_Worksheet_List))","v":"REGULATORY REPORTING STATEMENT"}]
[null,{"$f":"INDEX(dms_TradingNameFull_List,MATCH(dms_TradingName,dms_TradingName_List))","v":"ElectraNet"}]
[null,{"$f":"IF(SUM(dms_SingleYear_Model)>0,CRY,CONCATENATE(FRCP_y1,\" to \",dms_MultiYear_FinalYear_Result))","v":"2018-19 to 2022-23"}]
[null,"2.6 NON NETWORK EXPENDITURE"]
[]
[null,"There are THREE tables on this worksheet - each has been 'grouped' for easy navigation. See the Instructions sheet on how to group or ungroup tables. "]
[]
[null,"2.6.1 - NON-NETWORK EXPENDITURE"]
[null,null,null,null,{"$f":"CONCATENATE(\"EXPENDITURE\nForecast \n($0's. real \",dms_DollarReal,\")\")","v":"EXPENDITURE\nForecast \n($0's. real June 2018)"}]
[null,"SERVICE SUBCATEGORY","ASSET CATEGORY",null,{"$f":"CRCP_y4","v":"2016-17"},{"$f":"CRCP_y5","v":"2017-18"},{"$f":"FRCP_y1","v":"2018-19"},{"$f":"FRCP_y2","v":"2019-20"},{"$f":"FRCP_y3","v":"2020-21"},{"$f":"FRCP_y4","v":"2021-22"},{"$f":"FRCP_y5","v":"2022-23"}]
[null,"OPEX"]
[null,"IT & COMMUNICATIONS","Total IT and communications",null,7225118.2654976957,6975136.0532659488,6327341.2944397023,6358573.4678161722,6396237.0727457879,6442543.0357105481,6491304.2880744804]
[null,"MOTOR VEHICLES","Car",null,117983.19099066975,113901.08492593579,103322.86461938042,103832.87308444959,104447.90416498261,105204.06137538668,106000.31244550004]
[null,null,"Light commercial vehicle"]
[null,null,"Elevated work platform (LCV)  "]
[null,null,"Elevated work platform (HCV)"]
[null,null,"Heavy commercial vehicle"]
[null,"BUILDINGS AND PROPERTY","Total buildings and property expenditure",null,2382332.3009111928,2299905.8717554472,2086309.0389281805,2096607.1977580134,2109025.9872221332,2124294.4142903159,2140372.4219118948]
[null,"OTHER","Other expenditure"]
[null,"OTHER - TNSP nominated"]
[]
[]
[]
[]
[]
[]
[]
[]
[]
[]
[null,"CAPEX"]
[null,"IT & COMMUNICATIONS","Total IT and communications",null,10843921.150325062,9537334.2717993241,10171746.320146162,7771073.8637305144,8519017.824965544,8753450.8019862268,6226547.1856752764]
[null,"MOTOR VEHICLES","Car",null,269325.07030586293,509385.49602284917,146900.79234306377,201063.91608500978,262409.68300151965,246896.96750559937,147145.04517393568]
[null,null,"Light commercial vehicle"]
[null,null,"Elevated work platform (LCV)  "]
[null,null,"Elevated work platform (HCV)"]
[null,null,"Heavy commercial vehicle"]
[null,"BUILDINGS AND PROPERTY","Total buildings and property expenditure",null,1624275.8214017428,813883.20934177481,1337822.6572488656,956308.72985445545,1247155.9929064231,886356.98017194099,513109.35569524515]
[null,"OTHER","Other expenditure",null,1256018.8142550099,0,0,0,0,0,0]
[null,"OTHER - TNSP nominated"]
[]
[]
[]
[]
[]
[]
[]
[]
[]
[]
[]
[]
[]
[null,"2.6.3 - ANNUAL DESCRIPTOR METRICS"]
[null,"IT & COMMUNICATIONS"]
[null,null,null,null,"VOLUMES  (0's)"]
[null,null,null,null,{"$f":"CRCP_y4","v":"2016-17"},{"$f":"CRCP_y5","v":"2017-18"},{"$f":"FRCP_y1","v":"2018-19"},{"$f":"FRCP_y2","v":"2019-20"},{"$f":"FRCP_y3","v":"2020-21"},{"$f":"FRCP_y4","v":"2021-22"},{"$f":"FRCP_y5","v":"2022-23"}]
[null,"Employee numbers",null,null,null,null,null,null,null,null,207.23999999999998]
[null,"User numbers",null,null,null,null,null,null,null,null,230.00046242774562]
[null,"Number of devices",null,null,null,null,null,null,null,null,400.90358381502881]
[]
[]
[null,"MOTOR VEHICLES"]
[null,null,null,null,"VOLUMES  (0's or %)"]
[null,null,null,"Units",{"$f":"CRCP_y4","v":"2016-17"},{"$f":"CRCP_y5","v":"2017-18"},{"$f":"FRCP_y1","v":"2018-19"},{"$f":"FRCP_y2","v":"2019-20"},{"$f":"FRCP_y3","v":"2020-21"},{"$f":"FRCP_y4","v":"2021-22"},{"$f":"FRCP_y5","v":"2022-23"}]
[null,"CAR","Average kilometres travelled ","0's",21140.33041186152,21140.33041186152,21140.33041186152,21140.33041186152,21140.33041186152,21140.33041186152,21140.33041186152]
[null,null,"Number purchased","0's",14.129999999999999,14.129999999999999,14.129999999999999,14.129999999999999,14.129999999999999,14.129999999999999,14.129999999999999]
[null,null,"Number leased","0's",4.71,4.71,4.71,4.71,4.71,3.71,2.71]
[null,null,"Number in fleet","0's",18.84,18.84,18.84,18.84,18.84,17.84,16.84]
[null,null,"Proportion of total fleet expenditure allocated as regulatory expenditure","%",0.94199999999999995,0.94199999999999995,0.94199999999999995,0.94199999999999995,0.94199999999999995,0.94199999999999995,0.94199999999999995]
[null,"LIGHT COMMERCIAL VEHICLE","Average kilometres travelled ","0's",0,0,0,0,0,0,0]
[null,null,"Number purchased","0's",0,0,0,0,0,0,0]
[null,null,"Number leased","0's",0,0,0,0,0,0,0]
[null,null,"Number in fleet","0's",0,0,0,0,0,0,0]
[null,null,"Proportion of total fleet expenditure allocated as regulatory expenditure","%",0,0,0,0,0,0,0]
[null,"ELEVATED WORK PLATFORM (LCV) ","Average kilometres travelled ","0's",0,0,0,0,0,0,0]
[null,null,"Number purchased","0's",0,0,0,0,0,0,0]
[null,null,"Number leased","0's",0,0,0,0,0,0,0]
[null,null,"Number in fleet","0's",0,0,0,0,0,0,0]
[null,null,"Proportion of total fleet expenditure allocated as regulatory expenditure","%",0,0,0,0,0,0,0]
[null,"ELEVATED WORK PLATFORM (HCV)","Average kilometres travelled ","0's",0,0,0,0,0,0,0]
[null,null,"Number purchased","0's",0,0,0,0,0,0,0]
[null,null,"Number leased","0's",0,0,0,0,0,0,0]
[null,null,"Number in fleet","0's",0,0,0,0,0,0,0]
[null,null,"Proportion of total fleet expenditure allocated as regulatory expenditure","%",0,0,0,0,0,0,0]
[null,"HEAVY COMMERCIAL VEHICLE ","Average kilometres travelled ","0's",0,0,0,0,0,0,0]
[null,null,"Number purchased","0's",0,0,0,0,0,0,0]
[null,null,"Number leased","0's",0,0,0,0,0,0,0]
[null,null,"Number in fleet","0's",0,0,0,0,0,0,0]
[null,null,"Proportion of total fleet expenditure allocated as regulatory expenditure","%",0,0,0,0,0,0,0]
[]
[]
[]
[null,"2.6.4 - ITC CAPEX BY PURPOSE AND ASSET CATEGORY"]
[null,null,null,null,{"$f":"CONCATENATE(\"EXPENDITURE\nForecast \n($0's. real \",dms_DollarReal,\")\")","v":"EXPENDITURE\nForecast \n($0's. real June 2018)"}]
[null,null,null,null,{"$f":"CRCP_y4","v":"2016-17"},{"$f":"CRCP_y5","v":"2017-18"},{"$f":"FRCP_y1","v":"2018-19"},{"$f":"FRCP_y2","v":"2019-20"},{"$f":"FRCP_y3","v":"2020-21"},{"$f":"FRCP_y4","v":"2021-22"},{"$f":"FRCP_y5","v":"2022-23"}]
[null,"ITC capability growth"]
[null,"Various Projects ",null,null,1062880.6082092582,3900952.2891401271,1466715.0092641076,1304258.7015393155,518869.19449994026,0,0]
[]
[]
[]
[]
[]
[null,"ITC asset extensions"]
[null,"Various Projects ",null,null,1654752.6021831643,2080127.6655377783,5387639.2152629001,426552.41648939368,0,723484.80289877474,0]
[]
[]
[]
[]
[]
[null,"ITC asset remediation"]
[null,"Various Projects ",null,null,4731680.8419079324,0,2182145.5882247514,1034463.0135330297,2842380.3515696703,3906729.379734105,2268705.91455869]
[]
[]
[]
[]
[]
[null,"ITC asset replacement"]
[null,"Various Projects",null,null,4678229.01053013,5180710.6680987664,1423644.5321965057,1523665.2620356795,5616401.6033756919,2543765.8812201722,2217864.7411652207]

{"sheet":"2.10 Overheads","index":10,"n_rows":125,"n_cols":10,"rows_kept":125,"cut":false,"hidden":false,"merged":[[5,1,5,2],[8,3,8,9],[95,3,95,9],[98,1,122,1],[63,1,88,1],[39,1,59,1],[11,1,35,1]]}
[null,{"$f":"(LOOKUP(dms_Model,dms_Model_List,dms_Worksheet_List))","v":"REGULATORY REPORTING STATEMENT"}]
[null,{"$f":"INDEX(dms_TradingNameFull_List,MATCH(dms_TradingName,dms_TradingName_List))","v":"ElectraNet"}]
[null,{"$f":"IF(SUM(dms_SingleYear_Model)>0,CRY,CONCATENATE(FRCP_y1,\" to \",dms_MultiYear_FinalYear_Result))","v":"2018-19 to 2022-23"}]
[null,"2.10 OVERHEADS"]
[]
[null,"There are TWO tables on this worksheet. Each table has been 'grouped' (and sub-grouped) for easy navigation.  See the Instructions sheet on how to group or ungroup data."]
[]
[null,"2.10.1 - NETWORK OVERHEADS EXPENDITURE"]
[null,null,null,{"$f":"CONCATENATE(\"EXPENDITURE\nForecast \n($0's. real \",dms_DollarReal,\")\")","v":"EXPENDITURE\nForecast \n($0's. real June 2018)"}]
[null,null,null,{"$f":"CRCP_y4","v":"2016-17"},{"$f":"CRCP_y5","v":"2017-18"},{"$f":"FRCP_y1","v":"2018-19"},{"$f":"FRCP_y2","v":"2019-20"},{"$f":"FRCP_y3","v":"2020-21"},{"$f":"FRCP_y4","v":"2021-22"},{"$f":"FRCP_y5","v":"2022-23"}]
[null,"MAINTENANCE SUPPORT"]
[null,"Prescribed Services",null,7011001.0827085236,6936076.8314117175,6170642.8656193493,5861725.107957419,5890325.8204506934,5740587.5157367811,5523711.6733025415]
[]
[]
[]
[]
[]
[]
[]
[]
[]
[]
[]
[]
[]
[]
[]
[]
[]
[]
[]
[]
[]
[]
[]
[]
[null,"Negotiated Services","Total",61708.806683702613,62757.608516198816,59121.775339839347,59413.604316942445,59765.527673928736,60198.2039927648,60653.822185841083]
[null,"Unregulated Services","Total",143987.21559530607,146434.41987113055,137950.8091262918,138631.74340619901,139452.89790583367,140462.47598311782,141525.58510029581]
[null,"NETWORK MONITORING AND CONTROL"]
[null,"Prescribed Services",null,7508368.7518522665,7304152.0257964544,6157307.7899305057,5824248.4925191263,5852193.0670381803,5688530.9416685635,5452793.4304697579]
[]
[]
[]
[]
[]
[]
[]
[]
[]
[]
[]
[]
[]
[]
[]
[]
[]
[]
[]
[]
[null,"Negotiated Services","Total",28.275713820567439,28.756287373417909,27.09030509440527,27.224024624640411,27.385280119012915,27.583537587044233,27.792307296445721]
[null,"Unregulated Services","Total",11239.450157898067,11430.475662284727,10768.256313633525,10821.409136043341,10885.507361933882,10964.313681184016,11047.298562067557]
[null,"ASSET MANAGEMENT SUPPORT"]
[null,"Prescribed Services",null,12757606.610714251,12410618.238079337,11026965.93066253,10463847.527120318,10878467.777302438,10750238.81307023,10102876.797373807]
[]
[]
[]
[]
[]
[]
[]
[]
[]
[]
[]
[]
[]
[]
[]
[]
[]
[]
[]
[]
[]
[]
[]
[]
[]
[null,"Negotiated Services","Total",2.6059552501659247,2.6502460214295178,2.4967052374823258,2.5090291389787582,2.5238908186818705,2.5421626859450415,2.5614033857110248]
[null,"Unregulated Services","Total",1350657.5849890676,1373613.3384113025,1294033.6816116557,1300421.1170949603,1308123.8742376275,1317594.1197874481,1327566.5078696182]
[]
[]
[]
[null,"2.10.2 - CORPORATE OVERHEADS EXPENDITURE"]
[null,null,null,{"$f":"CONCATENATE(\"EXPENDITURE\nForecast \n($0's. real \",dms_DollarReal,\")\")","v":"EXPENDITURE\nForecast \n($0's. real June 2018)"}]
[null,null,null,{"$f":"CRCP_y4","v":"2016-17"},{"$f":"CRCP_y5","v":"2017-18"},{"$f":"FRCP_y1","v":"2018-19"},{"$f":"FRCP_y2","v":"2019-20"},{"$f":"FRCP_y3","v":"2020-21"},{"$f":"FRCP_y4","v":"2021-22"},{"$f":"FRCP_y5","v":"2022-23"}]
[null,"CORPORATE OVERHEADS"]
[null,"Prescribed Services",null,26353391.270283073,25590225.936751761,24758296.6408328,23604835.67799411,23924568.548698638,23454454.607199818,22510945.003202304]
[]
[]
[]
[]
[]
[]
[]
[]
[]
[]
[]
[]
[]
[]
[]
[]
[]
[]
[]
[]
[]
[]
[]
[]
[null,"Negotiated Services","Total",0,0,0,0,0,0,0]
[null,"Unregulated Services","Total",23363.603333251031,23760.690739514226,22384.126053152024,22494.615573669453,22627.857458551105,22791.673264239769,22964.175104844282]

{"sheet":"2.11 Labour","index":11,"n_rows":31,"n_cols":14,"rows_kept":31,"cut":false,"hidden":false,"merged":[[5,1,5,2],[23,2,23,6],[23,7,23,13],[7,1,7,2],[12,7,12,13],[11,2,11,13],[12,2,12,6],[22,2,22,13]]}
[null,{"$f":"(LOOKUP(dms_Model,dms_Model_List,dms_Worksheet_List))","v":"REGULATORY REPORTING STATEMENT"}]
[null,{"$f":"INDEX(dms_TradingNameFull_List,MATCH(dms_TradingName,dms_TradingName_List))","v":"ElectraNet"}]
[null,{"$f":"IF(SUM(dms_SingleYear_Model)>0,CRY,CONCATENATE(FRCP_y1,\" to \",dms_MultiYear_FinalYear_Result))","v":"2018-19 to 2022-23"}]
[null,"2.11 LABOUR"]
[]
[null,"There is ONE table on this worksheet. The table has been 'grouped' (and sub-grouped) for easy navigation.  See the Instructions sheet on how to group or ungroup data."]
[]
[null,"Table numbering in this template starts at 2.11.3.\n\nTables 2.11.1 & 2.11.2 appear in the Category Analysis RIN and are not required for this RIN."]
[]
[null,"2.11.3 - LABOUR / NON-LABOUR EXPENDITURE SPLIT"]
[null,"OPEX"]
[null,null,"EXPENDITURE"]
[null,null,"($0's, nominal)",null,null,null,null,{"$f":"CONCATENATE(\"($0's, real \", dms_DollarReal,\")\")","v":"($0's, real June 2018)"}]
[null,null,{"$f":"PRCP_y4","v":"2011-12"},{"$f":"PRCP_y5","v":"2012-13"},{"$f":"CRCP_y1","v":"2013-14"},{"$f":"CRCP_y2","v":"2014-15"},{"$f":"CRCP_y3","v":"2015-16"},{"$f":"CRCP_y4","v":"2016-17"},{"$f":"CRCP_y5","v":"2017-18"},{"$f":"FRCP_y1","v":"2018-19"},{"$f":"FRCP_y2","v":"2019-20"},{"$f":"FRCP_y3","v":"2020-21"},{"$f":"FRCP_y4","v":"2021-22"},{"$f":"FRCP_y5","v":"2022-23"}]
[null,"In-house labour expenditure"]
[null,"Labour expenditure outsourced to related parties"]
[null,"Labour expenditure outsourced to unrelated parties"]
[null,"Controllable non-labour expenditure"]
[null,"Uncontrollable non-labour expenditure"]
[null,"Total",{"$f":"SUM(C15:C19)","v":0},{"$f":"SUM(D15:D19)","v":0},0,0,0,0,{"$f":"SUM(I15:I19)","v":0},0,0,0,0,0]
[]
[null,"CAPEX"]
[null,null,"EXPENDITURE"]
[null,null,"($0's, nominal)",null,null,null,null,{"$f":"CONCATENATE(\"($0's, real \", dms_DollarReal,\")\")","v":"($0's, real June 2018)"}]
[null,null,{"$f":"PRCP_y4","v":"2011-12"},{"$f":"PRCP_y5","v":"2012-13"},{"$f":"CRCP_y1","v":"2013-14"},{"$f":"CRCP_y2","v":"2014-15"},{"$f":"CRCP_y3","v":"2015-16"},{"$f":"CRCP_y4","v":"2016-17"},{"$f":"CRCP_y5","v":"2017-18"},{"$f":"FRCP_y1","v":"2018-19"},{"$f":"FRCP_y2","v":"2019-20"},{"$f":"FRCP_y3","v":"2020-21"},{"$f":"FRCP_y4","v":"2021-22"},{"$f":"FRCP_y5","v":"2022-23"}]
[null,"In-house labour expenditure"]
[null,"Labour expenditure outsourced to related parties"]
[null,"Labour expenditure outsourced to unrelated parties"]
[null,"Controllable non-labour expenditure"]
[null,"Uncontrollable non-labour expenditure"]
[null,"Total",{"$f":"SUM(C26:C30)","v":0},{"$f":"SUM(D26:D30)","v":0},0,0,0,0,{"$f":"SUM(I26:I30)","v":0},0,0,0,0,0]

{"sheet":"2.14 Forecast price changes","index":12,"n_rows":60,"n_cols":12,"rows_kept":60,"cut":false,"hidden":false,"merged":[[6,1,6,11],[9,2,9,6],[9,7,9,11],[10,2,10,4],[10,5,10,11]]}
[null,{"$f":"(LOOKUP(dms_Model,dms_Model_List,dms_Worksheet_List))","v":"REGULATORY REPORTING STATEMENT"}]
[null,{"$f":"INDEX(dms_TradingNameFull_List,MATCH(dms_TradingName,dms_TradingName_List))","v":"ElectraNet"}]
[null,{"$f":"IF(SUM(dms_SingleYear_Model)>0,CRY,CONCATENATE(FRCP_y1,\" to \",dms_MultiYear_FinalYear_Result))","v":"2018-19 to 2022-23"}]
[null,"2.14 FORECAST PRICE CHANGES"]
[]
[null,"Instructions"]
[null,{"$f":"CONCATENATE(dms_TradingName, \"  must provide all forecast price changes used to forecast opex and capex, including forecast changes in CPI. \"&\"Forecast price changes must be expressed in real terms, except for CPI. If the same escalators are not used for capex and opex, report capex and opex escalators separately. \"&\"If price changes for a given year were not used to forecast either opex or capex enter '0' for that year.\")","v":"ElectraNet  must provide all forecast price changes used to forecast opex and capex, including forecast changes in CPI. Forecast price changes must be expressed in real terms, except for CPI. If the same escalators are not used for capex and opex, report capex and opex escalators separately. If price changes for a given year were not used to forecast either opex or capex enter '0' for that year."}]
[]
[null,"2.14.1 - FORECAST LABOUR AND MATERIALS PRICE CHANGES"]
[null,null,"Price changes\n(% YoY real)\nCurrent regulatory period",null,null,null,null,"Price changes\n(%YoY real)\nForthcoming regulatory period "]
[null,null,"Actual",null,null,"Forecast"]
[null,null,{"$f":"CRCP_y1","v":"2013-14"},{"$f":"CRCP_y2","v":"2014-15"},{"$f":"CRCP_y3","v":"2015-16"},{"$f":"CRCP_y4","v":"2016-17"},{"$f":"CRCP_y5","v":"2017-18"},{"$f":"FRCP_y1","v":"2018-19"},{"$f":"FRCP_y2","v":"2019-20"},{"$f":"FRCP_y3","v":"2020-21"},{"$f":"FRCP_y4","v":"2021-22"},{"$f":"FRCP_y5","v":"2022-23"}]
[null,"Materials price changes"]
[null,"Copper",2.4E-2,8.9999999999999993E-3,7.0000000000000001E-3,0,0,0,0,0,0,0]
[null,"Aluminium",5.3999999999999999E-2,2.8000000000000001E-2,3.6999999999999998E-2,0,0,0,0,0,0,0]
[null,"Steel",5.3999999999999999E-2,5.5E-2,1E-3,0,0,0,0,0,0,0]
[null,"Oil",3.1E-2,-3.9E-2,-3.3000000000000002E-2,0,0,0,0,0,0,0]
[null,"Construction Costs",4.0000000000000001E-3,-2E-3,4.0000000000000001E-3,0,0,0,0,0,0,0]
[]
[]
[]
[]
[]
[]
[]
[]
[]
[]
[]
[]
[]
[]
[]
[]
[]
[]
[]
[]
[]
[]
[]
[]
[]
[null,"Labour and Other price changes"]
[null,"Internal Labour",0.02,0.02,4.0000000000000001E-3,6.0000000000000001E-3,6.4999999999999997E-3,6.4999999999999997E-3,7.4999999999999997E-3,8.9999999999999993E-3,1.0999999999999999E-2,1.15E-2]
[null,"External Labour",8.9999999999999993E-3,7.0000000000000001E-3,4.0000000000000001E-3,6.0000000000000001E-3,6.4999999999999997E-3,6.4999999999999997E-3,7.4999999999999997E-3,8.9999999999999993E-3,1.0999999999999999E-2,1.15E-2]
[]
[]
[]
[]
[]
[]
[]
[]
[]
[]
[]
[]
[]
[null,"CPI",2.9296875E-2,1.3282732447817747E-2,1.3108614232209881E-2,1.9699999999999999E-2,1.9699999999999999E-2,1.9699999999999999E-2,1.9699999999999999E-2,1.9699999999999999E-2,1.9699999999999999E-2,1.9699999999999999E-2]

{"sheet":"2.16 Opex Summary","index":13,"n_rows":56,"n_cols":10,"rows_kept":56,"cut":false,"hidden":false,"merged":[[6,9,7,9],[23,2,23,8],[7,1,7,5],[6,1,6,5],[10,2,10,8],[6,7,7,8]]}
[null,{"$f":"(LOOKUP(dms_Model,dms_Model_List,dms_Worksheet_List))","v":"REGULATORY REPORTING STATEMENT"}]
[null,{"$f":"INDEX(dms_TradingNameFull_List,MATCH(dms_TradingName,dms_TradingName_List))","v":"ElectraNet"}]
[null,{"$f":"IF(SUM(dms_SingleYear_Model)>0,CRY,CONCATENATE(FRCP_y1,\" to \",dms_MultiYear_FinalYear_Result))","v":"2018-19 to 2022-23"}]
[null,"2.16 OPEX SUMMARY"]
[]
[null,"Instructions"]
[null,{"$f":"CONCATENATE(\"Complete the tables below in accordance with the regulatory information notice.\n\n\",dms_TradingName, \"'s total forecast opex must reconcile to Table 2.16.1. If \",dms_TradingName,\" did not forecast its total opex using a Base Year approach, total forecast opex must, in addition, reconcile to Table 2.16.2\")","v":"Complete the tables below in accordance with the regulatory information notice.\n\nElectraNet's total forecast opex must reconcile to Table 2.16.1. If ElectraNet did not forecast its total opex using a Base Year approach, total forecast opex must, in addition, reconcile to Table 2.16.2"},null,null,null,null,null,"IMPORTANT!\nHave you used a base-step-trend model to derive your opex forecast? Yes/No",null,"Yes"]
[null,"The total step changes and category specific forecasts in Table 2.16.1 must reconcile (in each year) to the total step changes and category specific forecasts for each year in Tables 2.17.1 and 2.17.5 of worksheet 2.17 Step Changes.\")"]
[]
[null,"2.16.1 - PRESCRIBED TRANSMISSION SERVICES - OPEX BY DRIVER"]
[null,null,{"$f":"CONCATENATE(\"Forecast ($0's, real \", dms_DollarReal, \")\")","v":"Forecast ($0's, real June 2018)"}]
[null,null,{"$f":"CRCP_y4","v":"2016-17"},{"$f":"CRCP_y5","v":"2017-18"},{"$f":"FRCP_y1","v":"2018-19"},{"$f":"FRCP_y2","v":"2019-20"},{"$f":"FRCP_y3","v":"2020-21"},{"$f":"FRCP_y4","v":"2021-22"},{"$f":"FRCP_y5","v":"2022-23"}]
[null,"Efficient historic opex",94767139.323078901,93580055.744593874,85557762.543452278,85557762.543452278,85557762.543452278,85557762.543452278,85557762.543452293]
[null,"Real price changes",0,0,1074336.7494543178,1501958.4975432423,2017637.5181863336,2651645.1676459811,3319269.9186848956]
[null,"Output growth",0,0,0,0,0,0,0]
[null,"Productivity growth",0,0,0,0,0,0,0]
[null,"Step changes",0,0,0,0,0,0,0]
[null,"Category specific forecasts",0,0,153120.03714145653,152839.0317476315,485001.05396943277,617870.55946556828,378493.27023341076]
[null,"Total opex",{"$f":"SUM(C13:C18)","v":94767139.323078901},93580055.744593874,86785219.330048054,87212560.072743148,88060401.115608037,88827278.270563826,89255525.7323706]
[]
[]
[]
[null,"2.16.2 - PRESCRIBED TRANSMISSION SERVICES - OPEX BY CATEGORY"]
[null,null,{"$f":"CONCATENATE(\"Forecast ($0's, real \", dms_DollarReal, \")\")","v":"Forecast ($0's, real June 2018)"}]
[null,null,{"$f":"CRCP_y4","v":"2016-17"},{"$f":"CRCP_y5","v":"2017-18"},{"$f":"FRCP_y1","v":"2018-19"},{"$f":"FRCP_y2","v":"2019-20"},{"$f":"FRCP_y3","v":"2020-21"},{"$f":"FRCP_y4","v":"2021-22"},{"$f":"FRCP_y5","v":"2022-23"}]
[]
[]
[]
[]
[]
[]
[]
[]
[]
[]
[]
[]
[]
[]
[]
[]
[]
[]
[]
[]
[]
[]
[]
[]
[]
[]
[]
[]
[]
[]
[null,"Total opex",{"$f":"SUM(C26:C55)","v":0},0,0,0,0,0,0]

{"sheet":"2.17 Step Changes","index":14,"n_rows":72,"n_cols":10,"rows_kept":72,"cut":false,"hidden":false,"merged":[[6,1,6,5],[10,3,10,9],[26,1,26,2],[27,1,27,2],[9,3,9,9],[54,3,54,9],[70,1,70,2],[71,1,71,2],[30,3,30,9],[53,3,53,9],[48,1,48,2],[31,3,31,9]]}
[null,{"$f":"(LOOKUP(dms_Model,dms_Model_List,dms_Worksheet_List))","v":"REGULATORY REPORTING STATEMENT"}]
[null,{"$f":"INDEX(dms_TradingNameFull_List,MATCH(dms_TradingName,dms_TradingName_List))","v":"ElectraNet"}]
[null,{"$f":"IF(SUM(dms_SingleYear_Model)>0,CRY,CONCATENATE(FRCP_y1,\" to \",dms_MultiYear_FinalYear_Result))","v":"2018-19 to 2022-23"}]
[null,"2.17 STEP CHANGES"]
[]
[null,"Instructions"]
[null,"Complete the Tables below in accordance with the regulatory information notice.\n\nThe total step changes and category specific forecasts in Tables 2.17.1 and 2.17.5 must reconcile (in each year) to the total step changes and category specific forecasts for each year in Table 2.16.1 of worksheet 2.16 Opex Summary."]
[]
[null,"2.17.1 - FORECAST OPEX STEP CHANGES "]
[null,null,null,"EXPENDITURE"]
[null,null,null,{"$f":"CONCATENATE(\"Forecast ($0's, real \", dms_DollarReal, \")\")","v":"Forecast ($0's, real June 2018)"}]
[null,"Step change","Description",{"$f":"CRCP_y4","v":"2016-17"},{"$f":"CRCP_y5","v":"2017-18"},{"$f":"FRCP_y1","v":"2018-19"},{"$f":"FRCP_y2","v":"2019-20"},{"$f":"FRCP_y3","v":"2020-21"},{"$f":"FRCP_y4","v":"2021-22"},{"$f":"FRCP_y5","v":"2022-23"}]
[]
[]
[]
[]
[]
[]
[]
[]
[]
[]
[]
[]
[]
[]
[null,"Total",null,{"$f":"SUM(D13:D26)","v":0},0,0,0,0,0,0]
[null,"Check",null,null,null,{"$f":"IF(F$27-'2.16 Opex Summary'!C$17=0,\"OK\",\"Error\")","v":"OK"},{"$f":"IF(G$27-'2.16 Opex Summary'!D$17=0,\"OK\",\"Error\")","v":"OK"},{"$f":"IF(H$27-'2.16 Opex Summary'!E$17=0,\"OK\",\"Error\")","v":"OK"},{"$f":"IF(I$27-'2.16 Opex Summary'!F$17=0,\"OK\",\"Error\")","v":"OK"},{"$f":"IF(J$27-'2.16 Opex Summary'!G$17=0,\"OK\",\"Error\")","v":"OK"}]
[]
[null,"2.17.2 - FORECAST CAPEX STEP CHANGES  "]
[null,null,null,"EXPENDITURE"]
[null,null,null,{"$f":"CONCATENATE(\"Forecast ($0's, real \", dms_DollarReal, \")\")","v":"Forecast ($0's, real June 2018)"}]
[null,"Step change","Description",{"$f":"CRCP_y4","v":"2016-17"},{"$f":"CRCP_y5","v":"2017-18"},{"$f":"FRCP_y1","v":"2018-19"},{"$f":"FRCP_y2","v":"2019-20"},{"$f":"FRCP_y3","v":"2020-21"},{"$f":"FRCP_y4","v":"2021-22"},{"$f":"FRCP_y5","v":"2022-23"}]
[]
[]
[]
[]
[]
[]
[]
[]
[]
[]
[]
[]
[]
[]
[]
[null,"Total",null,{"$f":"SUM(D34:D48)","v":0},0,0,0,0,0,0]
[]
[]
[]
[null,"2.17.5 - FORECAST CATEGORY SPECIFIC OPEX "]
[null,null,null,"EXPENDITURE"]
[null,null,null,{"$f":"CONCATENATE(\"Forecast ($0's, real \", dms_DollarReal, \")\")","v":"Forecast ($0's, real June 2018)"}]
[null,"Step change","Description",{"$f":"CRCP_y4","v":"2016-17"},{"$f":"CRCP_y5","v":"2017-18"},{"$f":"FRCP_y1","v":"2018-19"},{"$f":"FRCP_y2","v":"2019-20"},{"$f":"FRCP_y3","v":"2020-21"},{"$f":"FRCP_y4","v":"2021-22"},{"$f":"FRCP_y5","v":"2022-23"}]
[]
[]
[]
[]
[]
[]
[]
[]
[]
[]
[]
[]
[]
[]
[null,"Total",null,{"$f":"SUM(D57:D70)","v":0},0,0,0,0,0,0]
[null,"Check",null,null,null,{"$f":"IF(F$71-'2.16 Opex Summary'!C$18=0,\"OK\",\"Error\")","v":"OK"},{"$f":"IF(G$71-'2.16 Opex Summary'!D$18=0,\"OK\",\"Error\")","v":"OK"},{"$f":"IF(H$71-'2.16 Opex Summary'!E$18=0,\"OK\",\"Error\")","v":"Error"},{"$f":"IF(I$71-'2.16 Opex Summary'!F$18=0,\"OK\",\"Error\")","v":"Error"},{"$f":"IF(J$71-'2.16 Opex Summary'!G$18=0,\"OK\",\"Error\")","v":"Error"}]

{"sheet":"3.1 Revenue","index":15,"n_rows":43,"n_cols":9,"rows_kept":43,"cut":false,"hidden":false,"merged":[[9,2,9,8],[26,2,26,8],[37,2,37,8],[8,2,8,8],[25,2,25,8]]}
[null,{"$f":"(LOOKUP(dms_Model,dms_Model_List,dms_Worksheet_List))","v":"REGULATORY REPORTING STATEMENT"}]
[null,{"$f":"INDEX(dms_TradingNameFull_List,MATCH(dms_TradingName,dms_TradingName_List))","v":"ElectraNet"}]
[null,{"$f":"IF(SUM(dms_SingleYear_Model)>0,CRY,CONCATENATE(FRCP_y1,\" to \",dms_MultiYear_FinalYear_Result))","v":"2018-19 to 2022-23"}]
[null,"3.1 REVENUE"]
[]
[]
[]
[null,"3.1.1 - REVENUE GROUPING BY CHARGEABLE QUANTITY"]
[null,null,"REVENUE"]
[null,null,{"$f":"CONCATENATE(\"Forecast ($0's, real \",dms_DollarReal,\")\")","v":"Forecast ($0's, real June 2018)"}]
[null,null,{"$f":"CRCP_y4","v":"2016-17"},{"$f":"CRCP_y5","v":"2017-18"},{"$f":"FRCP_y1","v":"2018-19"},{"$f":"FRCP_y2","v":"2019-20"},{"$f":"FRCP_y3","v":"2020-21"},{"$f":"FRCP_y4","v":"2021-22"},{"$f":"FRCP_y5","v":"2022-23"}]
["TREV0101","From Fixed Customer (Exit Point) Charges",31440154.744166162,33149276.493795302,29045180.36343164,30011031.095324539,31008999.639006704,32040154.020623453,33105597.781810828]
["TREV0102","From Variable Customer (Exit Point) Charges",0,0,0,0,0,0,0]
["TREV0103","From Fixed Generator (Entry Point) Charges",3151628.2116152653,3322954.2234319192,2911550.8682994125,3008369.8069977895,3108408.3036962487,3211773.4196149944,3318575.7761228187]
["TREV0104","From Variable Generator (Entry Point) Charges",0,0,0,0,0,0,0]
["TREV0105","From Fixed Energy Usage Charges (Charge per day basis)",104421464.33693674,110097931.17619421,96467090.895687982,99674948.763304636,102989478.78204852,106414228.16264273,109952862.07259457]
["TREV0106","From Variable Energy Usage charges (Charge per kWh basis)",0,0,0,0,0,0,0]
["TREV0107","From Energy based Common Service and General Charges",68307782.107276499,72021069.049356118,63104392.064099997,65202827.071152091,67371042.157447323,69611357.747226983,71926171.426706359]
["TREV0108","From Fixed Demand based Usage Charges",82096496.471223593,86559353.248776704,75842742.079854831,78364770.417431235,80970664.748787776,83663213.902585879,86445299.445496142]
["TREV0109","From Variable Demand based Usage Charges",0,0,0,0,0,0,0]
["TREV0110","Revenue from other Sources",42117018.665271536,44406546.602270916,38908727.182070121,40202574.290457763,41539446.202305295,42920773.638213903,44348034.895095989]
["TREV01","Total revenue by chargeable quantity",{"$f":"SUM(C12:C21)","v":331534544.53648978},{"$f":"SUM(D12:D21)","v":349557130.79382509},306279683.453444,316464521.44466811,326988039.83329189,337861500.890908,349096541.39782673]
[]
[]
[null,"3.1.2 - REVENUE GROUPING BY TYPE OF CONNECTED EQUIPMENT"]
[null,null,"REVENUE"]
[null,null,{"$f":"CONCATENATE(\"Forecast ($0's, real \",dms_DollarReal,\")\")","v":"Forecast ($0's, real June 2018)"}]
[null,null,{"$f":"CRCP_y4","v":"2016-17"},{"$f":"CRCP_y5","v":"2017-18"},{"$f":"FRCP_y1","v":"2018-19"},{"$f":"FRCP_y2","v":"2019-20"},{"$f":"FRCP_y3","v":"2020-21"},{"$f":"FRCP_y4","v":"2021-22"},{"$f":"FRCP_y5","v":"2022-23"}]
["TREV0201","From Other connected transmission networks"]
["TREV0202","From Distribution networks"]
["TREV0203","From Directly connected end–users"]
["TREV0204","From Generators"]
["TREV0205","Other revenue"]
["TREV02","Total revenue by type of connected equipment",{"$f":"SUM(C29:C33)","v":0},{"$f":"SUM(D29:D33)","v":0},0,0,0,0,0]
[]
[]
[null,"3.1.3 - REVENUE (penalties) ALLOWED (deducted) THROUGH INCENTIVE SCHEMES"]
[null,null,{"$f":"CONCATENATE(\"Forecast ($0's, real \",dms_DollarReal,\")\")","v":"Forecast ($0's, real June 2018)"}]
[null,null,{"$f":"CRCP_y4","v":"2016-17"},{"$f":"CRCP_y5","v":"2017-18"},{"$f":"FRCP_y1","v":"2018-19"},{"$f":"FRCP_y2","v":"2019-20"},{"$f":"FRCP_y3","v":"2020-21"},{"$f":"FRCP_y4","v":"2021-22"},{"$f":"FRCP_y5","v":"2022-23"}]
["TREV0301","EBSS"]
["TREV0302","STPIS"]
["TREV0303","Other"]
["TREV03","Total revenue from incentive schemes",{"$f":"SUM(C40:C42)","v":0},{"$f":"SUM(D40:D42)","v":0},0,0,0,0,0]

{"sheet":"3.2 Operating expenditure","index":16,"n_rows":98,"n_cols":9,"rows_kept":98,"cut":false,"hidden":false,"merged":[[93,2,93,8],[94,2,94,8],[6,1,6,3],[6,5,6,6],[50,2,50,8],[51,2,51,8],[11,2,11,8],[10,2,10,8]]}
[null,{"$f":"(LOOKUP(dms_Model,dms_Model_List,dms_Worksheet_List))","v":"REGULATORY REPORTING STATEMENT"}]
[null,{"$f":"INDEX(dms_TradingNameFull_List,MATCH(dms_TradingName,dms_TradingName_List))","v":"ElectraNet"}]
[null,{"$f":"IF(SUM(dms_SingleYear_Model)>0,CRY,CONCATENATE(FRCP_y1,\" to \",dms_MultiYear_FinalYear_Result))","v":"2018-19 to 2022-23"}]
[null,"3.2 OPERATING EXPENDITURE"]
[]
[]
[null,"Instructions\nTable 3.2.1.2 must be completed if there are any proposed changes to the CAM reported in response to Schedule 1, paragraph 1.3.",null,null,null,{"$f":"CONCATENATE(\"IMPORTANT!\n Does \",dms_TradingName, \" propose to change its CAM?\nYes / No\" )","v":"IMPORTANT!\n Does ElectraNet propose to change its CAM?\nYes / No"},null,"No"]
[]
[null,"3.2.1 - OPEX CATEGORIES"]
[null,"3.2.1.1 - CURRENT OPEX CATEGORIES AND COST ALLOCATIONS"]
[null,null,"EXPENDITURE"]
[null,null,{"$f":"CONCATENATE(\"Forecast ($0's, real \",dms_DollarReal,\")\")","v":"Forecast ($0's, real June 2018)"}]
[null,null,{"$f":"CRCP_y4","v":"2016-17"},{"$f":"CRCP_y5","v":"2017-18"},{"$f":"FRCP_y1","v":"2018-19"},{"$f":"FRCP_y2","v":"2019-20"},{"$f":"FRCP_y3","v":"2020-21"},{"$f":"FRCP_y4","v":"2021-22"},{"$f":"FRCP_y5","v":"2022-23"}]
[null,"Maintenance Communications",2299890.4026018274,2619654.5015127086,2126830.6609909977,2137328.8372162678,2149988.8323137588,2165553.8124906165,2181944.0974096651]
[null,"Maintenance Lines",18100433.79082346,15941983.78361899,15083069.112877036,15157520.135456869,15247302.356734024,15357686.16681071,15473922.877493905]
[null,"Maintenance Secondary Systems",3612046.6432208288,3842669.0777005996,3134791.4319892572,3150264.9689689977,3168924.8674219144,3191866.4994909004,3216024.5698415311]
[null,"Maintenance Substations",16353877.477287699,17817034.153716408,17696740.580861114,17784092.857955057,17889433.00237957,18018944.684427515,18155323.487676319]
[null,"Maintenance Easements",2014117.2690157613,2034159.9963974457,2129319.667304866,2139830.1294292388,2152504.9403784606,2168088.136078842,2184497.6023663925]
[null,"Field Support",13343912.183081321,12159000.780464884,11388362.954499021,11444576.664131157,11512366.0851776,11595710.587814705,11683474.280998819]
[null,"Operations",10954965.24646054,10469310.595266933,9383622.6170389205,9429940.7963241506,9485796.9669668376,9554469.9942558426,9626784.2838168349]
[null,"Asset Manager Support",9523134.0773530137,10130649.404694233,9541261.3584440462,9588357.6529396474,9978491.8369548935,10181978.490518406,10017496.71971168]
[null,"Insurance",2787015.9567728271,2614939.5260679945,2746140.8258193703,2759695.9578087828,2776042.407025239,2796139.7416653284,2817302.7008931399]
[null,"Corporate Support",4880594.1654092586,4821143.5958692068,2940813.2306999196,2955329.2785018212,2972834.5184657541,2994356.5420472445,3017019.7317543267]
[null,"Self-insurance",1546575.5003837678,1583187.4024731966,1444052.5319726607,1451180.4703822627,1459776.2172419466,1470344.3595236752,1481472.8583135493]
[null,"Network Support",9350576.6106685679,9546322.9268112723,9017094.3204093855,9061603.2918812558,9115277.6967051942,9181268.3262951523,9250757.9889016654]
[null,"Debt Raising Costs",null,null,153120.03714145653,152839.0317476315,151661.38784282771,150870.92914489674,149504.53319278738]
[null,"Provision movements",-679598.7392104835,-683131.02646930038,-683131.02646930038,-731874.82594149676,-724612.96487770742,-737711.48072849435,-751991.35778925277]
[]
[]
[]
[]
[]
[]
[]
[]
[]
[]
[]
[]
[]
[]
[]
[]
[]
[]
[]
[]
[null,"Total opex ",{"$f":"SUM(C14:C47)","v":94087540.583868384},{"$f":"SUM(D14:D47)","v":92896924.718124568},86102088.303578749,86480685.2468016,87335788.150730312,88089566.789835349,88503534.374581352]
[]
[null,"3.2.1.2 - PROPOSED OPEX CATEGORIES AND COST ALLOCATIONS"]
[null,null,"EXPENDITURE"]
[null,null,{"$f":"CONCATENATE(\"Forecast ($0's, real \",dms_DollarReal,\")\")","v":"Forecast ($0's, real June 2018)"}]
[null,null,{"$f":"CRCP_y4","v":"2016-17"},{"$f":"CRCP_y5","v":"2017-18"},{"$f":"FRCP_y1","v":"2018-19"},{"$f":"FRCP_y2","v":"2019-20"},{"$f":"FRCP_y3","v":"2020-21"},{"$f":"FRCP_y4","v":"2021-22"},{"$f":"FRCP_y5","v":"2022-23"}]
[]
[]
[]
[]
[]
[]
[]
[]
[]
[]
[]
[]
[]
[]
[]
[]
[]
[]
[]
[]
[]
[]
[]
[]
[]
[]
[]
[]
[]
[]
[]
[]
[]
[]
[null,"Total opex ",{"$f":"SUM(C54:C87)","v":0},{"$f":"SUM(D54:D87)","v":0},{"$f":"SUM(E54:E87)","v":0},0,0,0,0]
[]
[]
[]
[null,"3.2.2 - OPEX CONSISTENCY"]
[null,"CURRENT COST ALLOCATION APPROACH"]
[null,null,"EXPENDITURE"]
[null,null,{"$f":"CONCATENATE(\"Forecast ($0's, real \",dms_DollarReal,\")\")","v":"Forecast ($0's, real June 2018)"}]
[null,null,{"$f":"CRCP_y4","v":"2016-17"},{"$f":"CRCP_y5","v":"2017-18"},{"$f":"FRCP_y1","v":"2018-19"},{"$f":"FRCP_y2","v":"2019-20"},{"$f":"FRCP_y3","v":"2020-21"},{"$f":"FRCP_y4","v":"2021-22"},{"$f":"FRCP_y5","v":"2022-23"}]
["TOPEX0201","Opex for subtransmission assets"]
["TOPEX0202","Opex for HV assets"]

{"sheet":"3.3 Assets (RAB)","index":17,"n_rows":94,"n_cols":9,"rows_kept":94,"cut":false,"hidden":false,"merged":[[8,2,8,8],[69,2,69,8],[80,2,80,8],[20,2,20,8]]}
[null,{"$f":"(LOOKUP(dms_Model,dms_Model_List,dms_Worksheet_List))","v":"REGULATORY REPORTING STATEMENT"}]
[null,{"$f":"INDEX(dms_TradingNameFull_List,MATCH(dms_TradingName,dms_TradingName_List))","v":"ElectraNet"}]
[null,{"$f":"IF(SUM(dms_SingleYear_Model)>0,CRY,CONCATENATE(FRCP_y1,\" to \",dms_MultiYear_FinalYear_Result))","v":"2018-19 to 2022-23"}]
[null,"3.3 ASSETS"]
[]
[null,"There are FOUR tables on this worksheet. Each table has been grouped (and sub-grouped) for ease of navigation. See the Instructions sheet on how to group or ungroup tables. "]
[]
[null,"3.3.1 - REGULATORY ASSET BASE VALUES"]
[null,null,{"$f":"CONCATENATE(\"Forecast ($0's, real \",dms_DollarReal,\")\")","v":"Forecast ($0's, real June 2018)"}]
[null,null,{"$f":"CRCP_y4","v":"2016-17"},{"$f":"CRCP_y5","v":"2017-18"},{"$f":"FRCP_y1","v":"2018-19"},{"$f":"FRCP_y2","v":"2019-20"},{"$f":"FRCP_y3","v":"2020-21"},{"$f":"FRCP_y4","v":"2021-22"},{"$f":"FRCP_y5","v":"2022-23"}]
[null,"For total asset base:"]
["TRAB0101","Opening value",2429856276.7041569,2494542384.2770457,2552000619.0242743,2547317195.7938576,2527689797.3804622,2514515485.7482796,2491742219.8797903]
["TRAB0102","Inflation addition",0,0,0,0,0,0,0]
["TRAB0103","Straight line depreciation",-105324756.25439675,-109372711.6293287,-103493233.12941889,-121903390.42215224,-124427748.95426339,-125572684.82050528,-124781171.24381895]
["TRAB0105","Actual additions (recognised in RAB)",170010579.20163026,166830638.08827275,98809809.899001911,102275992.00875616,111253437.32208112,102799418.95201586,54511018.085909389]
["TRAB0106","Disposals ",0,0,0,0,0,0,0]
["TRAB0107","Closing value ",2494542099.6513906,2552000310.73599,2547317195.7938571,2527689797.3804612,2514515485.74828,2491742219.8797898,2421472066.7218809]
[]
[]
[null,"3.3.2 - ASSET VALUE ROLL FORWARD"]
[null,null,{"$f":"CONCATENATE(\"Forecast ($0's, real \",dms_DollarReal,\")\")","v":"Forecast ($0's, real June 2018)"}]
[null,null,{"$f":"CRCP_y4","v":"2016-17"},{"$f":"CRCP_y5","v":"2017-18"},{"$f":"FRCP_y1","v":"2018-19"},{"$f":"FRCP_y2","v":"2019-20"},{"$f":"FRCP_y3","v":"2020-21"},{"$f":"FRCP_y4","v":"2021-22"},{"$f":"FRCP_y5","v":"2022-23"}]
[null,"For overhead assets:"]
["TRAB0201","Opening value",551247010.93732214,560077930.14672947,562128887.65470207,553191591.72701192,572701744.3679868,602023802.09501362,631621005.94633746]
["TRAB0202","Inflation addition",0,0,0,0,0,0,0]
["TRAB0203","Straight line depreciation",-25939298.613207024,-21104672.918815821,-20286075.266857583,-20452763.77723315,-20835751.512139719,-21645841.294933468,-24079063.937853567]
["TRAB0205","Actual additions (recognised in RAB)",34770217.822614364,23155630.42678846,11348779.339167356,39962916.418208048,50157809.239166625,51243045.146257341,22375995.396251474]
["TRAB0206","Disposals ",0,0,0,0,0,0,0]
["TRAB0207","Closing value ",560077930.14672947,562128887.65470207,553191591.72701192,572701744.3679868,602023802.09501362,631621005.94633746,629917937.40473545]
[null,"For underground assets:"]
["TRAB0301","Opening value",116217927.17328124,115298119.41456862,114023281.87232733,110824248.43487398,107352848.5010917,103899670.43161349,100461518.30942617]
["TRAB0302","Inflation addition",0,0,0,0,0,0,0]
["TRAB0303","Straight line depreciation",-3293500.1833844748,-3387852.0846272623,-3468641.4171274886,-3483283.0489824517,-3483283.0489824512,-3483865.7260051141,-3484199.0543662854]
["TRAB0305","Actual additions (recognised in RAB)",2373692.4246718506,2113014.5423859889,269607.9796741422,11883.11520018081,30104.979504233685,45713.6038177964,70047.568858788727]
["TRAB0306","Disposals ",0,0,0,0,0,0,0]
["TRAB0307","Closing value ",115298119.41456862,114023281.87232733,110824248.43487398,107352848.5010917,103899670.43161349,100461518.30942617,97047366.823918656]
[null,"For switchyards, substations"]
["TRAB0401","Opening value",994642723.89332008,1019853624.2984284,1074003199.1091785,1065905595.565473,1053302533.351213,1038793159.9951205,1018030937.5669992]
["TRAB0402","Inflation addition",0,0,0,0,0,0,0]
["TRAB0403","Straight line depreciation",-29709411.063606519,-32132885.134472843,-36409664.063680768,-37268762.304540709,-37733454.884253122,-38388626.166866526,-38513353.666268595]
["TRAB0405","Actual additions (recognised in RAB)",54920033.762080744,86282158.969373986,28312060.519975334,24665700.090281241,23224081.528160546,17626403.738745328,12381608.271479495]
["TRAB0406","Disposals ",0,0,0,0,0,0,0]
["TRAB0407","Closing value ",1019853624.2984284,1074003199.1091785,1065905595.565473,1053302533.351213,1038793159.9951205,1018030937.5669992,991899192.17221022]
[null,"For easements:"]
["TRAB0501","Opening value",134877847.29598874,138289173.37053934,120404359.93225975,120409408.77083042,120409408.77083041,120409408.77083041,120409408.77083039]
["TRAB0502","Inflation addition",0,0,0,0,0,0,0]
["TRAB0503","Straight line depreciation",0,0,0,0,0,0,0]
["TRAB0505","Actual additions (recognised in RAB)",3411326.0745506161,-17884813.438279565,5048.8385706768204,0,0,0,0]
["TRAB0506","Disposals ",0,0,0,0,0,0,0]
["TRAB0507","Closing value ",138289173.37053934,120404359.93225975,120409408.77083042,120409408.77083041,120409408.77083041,120409408.77083039,120409408.77083038]
[null,"For “other” assets with long lives:"]
["TRAB0601","Opening value",590771927.43966138,614725138.47783792,636490116.75398231,641220392.79653239,627655393.13292122,609586812.40999722,587633889.28300381]
["TRAB0602","Inflation addition",0,0,0,0,0,0,0]
["TRAB0603","Straight line depreciation",-32022803.943815455,-37616084.020364091,-36188347.686309233,-40353188.390112855,-42753175.126452237,-44202115.051813655,-44006321.439765282]
["TRAB0605","Actual additions (recognised in RAB)",55976008.062970564,59381054.984071672,40918623.728859365,26788188.726501647,24684594.403528493,22249191.924819991,10140086.067998255]
["TRAB0606","Disposals ",0,0,0,0,0,0,0]
["TRAB0607","Closing value ",614725138.47783792,636490116.75398231,641220392.79653239,627655393.13292122,609586812.40999722,587633889.28300381,553767653.91123652]
[null,"For “other” assets with short lives:"]
["TRAB0701","Opening value",42098839.964583039,46298398.568941891,44950773.701825455,55765958.499136642,46267869.256418608,39802632.045703948,33585460.003192797]
["TRAB0702","Inflation addition",0,0,0,0,0,0,0]
["TRAB0703","Straight line depreciation",-14359742.450383287,-15131217.471048677,-7140504.6954438519,-20345392.901283082,-19622084.382435884,-17852236.580886524,-14698233.145565223]
["TRAB0705","Actual additions (recognised in RAB)",18559301.054742146,13783592.603932235,17955689.492755041,10847303.658565048,13156847.171721224,11635064.538375387,9543280.7813213766]
["TRAB0706","Disposals ",0,0,0,0,0,0,0]
["TRAB0707","Closing value ",46298398.568941891,44950773.701825455,55765958.499136642,46267869.256418608,39802632.045703948,33585460.003192797,28430507.638948955]
[]
[]
[]
[]
[null,"3.3.3 - TOTAL DISAGGREGATED RAB ASSET VALUES"]
[null,null,{"$f":"CONCATENATE(\"Forecast ($0's, real \",dms_DollarReal,\")\")","v":"Forecast ($0's, real June 2018)"}]
[null,null,{"$f":"CRCP_y4","v":"2016-17"},{"$f":"CRCP_y5","v":"2017-18"},{"$f":"FRCP_y1","v":"2018-19"},{"$f":"FRCP_y2","v":"2019-20"},{"$f":"FRCP_y3","v":"2020-21"},{"$f":"FRCP_y4","v":"2021-22"},{"$f":"FRCP_y5","v":"2022-23"}]
["TRAB0801","Overhead transmission assets (wires and towers/poles etc)",555662470.5420258,561103408.90071583,557660239.69085693,562946668.04749942,587362773.23150015,616822404.02067554,630769471.67553639]
["TRAB0802","Underground transmission assets (cables, ducts etc)",115758023.29392493,114660700.64344797,112423765.15360066,109088548.46798284,105626259.4663526,102180594.37051983,98754442.566672415]
["TRAB0803","Substations, switchyards, Transformers etc with transmission function",1007248174.0958743,1046928411.7038035,1069954397.3373258,1059604064.458343,1046047846.6731668,1028412048.7810599,1004965064.8696047]
["TRAB0804","Easements",136583510.33326405,129346766.65139955,120406884.3515451,120409408.77083042,120409408.77083041,120409408.77083039,120409408.77083039]
["TRAB0805","Other assets with long lives (please specify)",602748532.95874965,625607627.61591005,638855254.77525735,634437892.96472681,618621102.77145922,598610350.84650052,570700771.59712017]
["TRAB0806","Other assets with short lives (please specify)",44198619.266762465,45624586.135383673,50358366.100481048,51016913.877777621,43035250.651061282,36694046.024448372,31007983.821070876]
[]
[]
[null,"3.3.4 - ASSET LIVES"]
[null,null,{"$f":"CONCATENATE(\"Forecast ($0's, real \",dms_DollarReal,\")\")","v":"Forecast ($0's, real June 2018)"}]
[null,null,{"$f":"CRCP_y4","v":"2016-17"},{"$f":"CRCP_y5","v":"2017-18"},{"$f":"FRCP_y1","v":"2018-19"},{"$f":"FRCP_y2","v":"2019-20"},{"$f":"FRCP_y3","v":"2020-21"},{"$f":"FRCP_y4","v":"2021-22"},{"$f":"FRCP_y5","v":"2022-23"}]
[null,"ESTIMATED SERVICE LIFE OF NEW ASSETS"]
["TRAB0901","Overhead transmission assets ",31.797015740151032,39.551524428080917,29.879971527715991,27.557835266131431,27.539410249956436,31.939003085157786,27.128558310376494]
["TRAB0902","Underground transmission assets",40,40,40,40,40,40,40]
["TRAB0903","Switchyard, substation and transformer assets",47.258096587812055,48.211461262857803,49.993091623504199,49.572205900108663,47.017001881664221,45.563842662632375,45.494772572980317]
["TRAB0904","“Other” assets with long lives",17.259614478717193,22.019925751950904,16.915568328213261,16.577448115127076,16.921986932220733,17.499785977227976,14.208805379018147]
["TRAB0905","“Other assets with short lives",4.0177272727272735,4.0612290008841727,4.0259250927904624,4,4.013212282255683,4.0558238520094951,4.0895478567234296]
[null,"ESTIMATED RESIDUAL SERVICE LIFE"]
["TRAB1001","Overhead transmission assets ",29.445675847581743,29.256075290487601,28.366839729742516,27.445472479601587,26.582022028945659,26.330687412570505,25.612725225661368]
["TRAB1002","Underground transmission assets",32.757392696365343,32.079283253587796,31.129948979150875,30.134135687696421,29.141145545022916,28.147635240544133,27.169574421092683]
["TRAB1003","Switchyard, substation and transformer assets",35.975645440049405,35.765404945819938,35.427696065047058,34.912091486453747,34.447850660933881,33.641440382894395,33.179278553804046]
["TRAB1004","Other assets with long lives",15.867710336657121,15.396120336558987,15.78334533913867,15.333832261717456,15.122801071904421,15.080367458569013,14.826669444116797]
["TRAB1005","Other assets with short lives",3.431749345005795,3.1972396335094415,3.2098633460340573,2.7502632767279809,2.7567318004583368,2.7561922425471095,3.1627950529013122]

{"sheet":"3.4 Operational data","index":18,"n_rows":90,"n_cols":10,"rows_kept":90,"cut":false,"hidden":false,"merged":[[8,3,8,9],[28,3,28,9],[59,3,59,9]]}
[null,{"$f":"(LOOKUP(dms_Model,dms_Model_List,dms_Worksheet_List))","v":"REGULATORY REPORTING STATEMENT"}]
[null,{"$f":"INDEX(dms_TradingNameFull_List,MATCH(dms_TradingName,dms_TradingName_List))","v":"ElectraNet"}]
[null,{"$f":"IF(SUM(dms_SingleYear_Model)>0,CRY,CONCATENATE(FRCP_y1,\" to \",dms_MultiYear_FinalYear_Result))","v":"2018-19 to 2022-23"}]
[null,"3.4 OPERATIONAL DATA"]
[]
[null,"There are THREE tables on this worksheet. Each table has been grouped for ease of navigation. See the Instructions sheet on how to group or ungroup tables. "]
[]
[null,"3.4.1 - ENERGY DELIVERY"]
[null,null,null,"Forecast (0's)"]
[null,null,"Units",{"$f":"CRCP_y4","v":"2016-17"},{"$f":"CRCP_y5","v":"2017-18"},{"$f":"FRCP_y1","v":"2018-19"},{"$f":"FRCP_y2","v":"2019-20"},{"$f":"FRCP_y3","v":"2020-21"},{"$f":"FRCP_y4","v":"2021-22"},{"$f":"FRCP_y5","v":"2022-23"}]
[null,"Energy grouping by downstream connection type"]
["TOPED0101","To Other connected transmission networks","GWh",2665.2,2864.3,3063.4,3262.5,3461.6,3660.8,3859.9]
["TOPED0102","To Distribution networks","GWh",10192.5,10195.5,10160.9,10141.5,10160.200000000001,10086.5,10038.5]
["TOPED0103","To Directly connected end–users (330 kV)","GWh"]
["TOPED0104","To Directly connected end–users (275 kV)","GWh",1350.8,1350.8,1350.8,1350.8,1350.8,1350.8,1350.8]
["TOPED0105","To Directly connected end–users (220 kV)","GWh"]
["TOPED0106","To Directly connected end–users (132 kV)","GWh",631.1,631.1,631.1,631.1,631.1,631.1,631.1]
["TOPED0107","To Directly connected end–users (110 kV)","GWh"]
["TOPED0108","To Directly connected end–users (44 kV) ","GWh"]
["TOPED0109","To Directly connected end–users (33 kV)","GWh",2.4,2.4,2.4,2.4,2.4,2.4,2.4]
["TOPED0110","To Directly connected end–users (22 kV)","GWh"]
["TOPED0111","To Directly connected end–users (11 kV)","GWh"]
["TOPED0112","To Directly connected end–users (6.6 kV)","GWh"]
["TOPED0113","Pumping and Power Station Auxillaries","GWh"]
["TOPED01","Total energy transported","GWh",{"$f":"SUM(D12:D24)","v":14842},{"$f":"SUM(E12:E24)","v":15044.099999999999},{"$f":"SUM(F12:F24)","v":15208.599999999999},15388.3,15606.1,15731.599999999999,15882.699999999999]
[]
[]
[null,"3.4.2 -  CONNECTION POINTS"]
[null,null,null,"Forecast (0's)"]
[null,null,"Units",{"$f":"CRCP_y4","v":"2016-17"},{"$f":"CRCP_y5","v":"2017-18"},{"$f":"FRCP_y1","v":"2018-19"},{"$f":"FRCP_y2","v":"2019-20"},{"$f":"FRCP_y3","v":"2020-21"},{"$f":"FRCP_y4","v":"2021-22"},{"$f":"FRCP_y5","v":"2022-23"}]
[null,"Number of entry points at each transmission voltage level"]
["TOPCP0101","500kV","number"]
["TOPCP0102","330kV","number"]
["TOPCP0103","275kV","number",7,7,7,7,7,7,7]
["TOPCP0104","220kV","number"]
["TOPCP0105","132 kV","number",12,12,12,12,12,12,12]
["TOPCP0106","110kV","number"]
["TOPCP0107","66 kV","number",3,3,3,3,3,3,3]
["TOPCP0108","33 kV","number"]
["TOPCP0109","22 kV","number"]
["TOPCP0110","11 kV","number"]
["TOPCP0111","6.6 kV","number"]
[null,"Number of exit points at each transmission voltage level "]
["TOPCP0201","500kV","number"]
["TOPCP0202","330kV","number"]
["TOPCP0203","275kV","number",13,13,13,13,13,13,13]
["TOPCP0204","220kV","number"]
["TOPCP0205","132 kV","number",57,57,57,58,58,58,58]
["TOPCP0206","110kV","number"]
["TOPCP0207","66 kV","number",3,3,3,3,3,3,3]
["TOPCP0208","44 kV","number"]
["TOPCP0209","33kV","number"]
["TOPCP0210","22kV","number"]
["TOPCP0211","11kV","number"]
["TOPCP0212","6.6kV","number"]
[]
[]
[]
[null,"3.4.3 - SYSTEM DEMAND"]
[null,null,null,"Forecast (0's)"]
[null,null,"Units",{"$f":"CRCP_y4","v":"2016-17"},{"$f":"CRCP_y5","v":"2017-18"},{"$f":"FRCP_y1","v":"2018-19"},{"$f":"FRCP_y2","v":"2019-20"},{"$f":"FRCP_y3","v":"2020-21"},{"$f":"FRCP_y4","v":"2021-22"},{"$f":"FRCP_y5","v":"2022-23"}]
[null,"Annual system maximum demand characteristics – MW measure"]
["TOPSD0101","Transmission System coincident maximum demand","MW"]
["TOPSD0102","Transmission System coincident weather adjusted maximum demand 10% POE","MW",3243.2280270000001,3197.7970879999998,3194.177283,3083.2049019999999,3030.8595690000002,2954.624057,2903.9276319999999]
["TOPSD0103","Transmission System coincident weather adjusted maximum demand 50% POE","MW",2849.0718299999999,2807.9376699999998,2747.055034,2687.308833,2655.4085490000002,2570.2183690000002,2541.6297079999999]
["TOPSD0104","Transmission System non-coincident summated maximum demand","MW"]
["TOPSD0105","Transmission System non-coincident weather adjusted summated maximum demand 10% POE","MW",3594.351568,3575.2060190000002,3549.2926579999998,3451.4896130000002,3363.731984,3281.0155089999998,3226.0008659999999]
["TOPSD0106","Transmission System non-coincident weather adjusted summated maximum demand 50% POE","MW",3315.8866440000002,3298.0229570000001,3242.349068,3168.9057509999998,3099.3691490000001,3004.2109089999999,2972.2494280000001]
[null,"Annual system maximum demand characteristics – MVA measure"]
["TOPSD0201","Transmission System coincident maximum demand","MVA"]
["TOPSD0202","Transmission System coincident weather adjusted maximum demand 10% POE","MVA",3336.2029470000002,3289.9191139999998,3286.5444010000001,3173.2050640000002,3119.8046450000002,3041.973575,2990.2626300000002]
["TOPSD0203","Transmission System coincident weather adjusted maximum demand 50% POE","MVA",2927.2943340000002,2885.3996969999998,2823.4362310000001,2762.4576259999999,2729.9542299999998,2642.9627890000002,2613.8515950000001]
["TOPSD0204","Transmission System non-coincident summated maximum demand","MVA"]
["TOPSD0205","Transmission System non-coincident weather adjusted summated maximum demand 10% POE","MVA",3698.1400829999998,3678.7428719999998,3652.5916050000001,3552.6500160000001,3462.9831530000001,3378.4701989999999,3322.312997]
["TOPSD0206","Transmission System non-coincident weather adjusted summated maximum demand 50% POE","MVA",3413.1434530000001,3395.063764,3338.4243099999999,3263.3983669999998,3192.3701430000001,3095.1251470000002,3062.5579010000001]
[null,"Power factor"]
[null,"Power factor conversion between MVA and MW"]
["TOPSD0301","Average overall network power factor conversion between MVA and MW","Factor",0.97209999999999996,0.97209999999999996,0.97209999999999996,0.97209999999999996,0.97209999999999996,0.97209999999999996,0.97209999999999996]
["TOPSD0302","Average power factor conversion for 500 kV lines","Factor"]
["TOPSD0303","Average power factor conversion for 330 kV lines","Factor"]
["TOPSD0304","Average power factor conversion for  275 kV lines","Factor",0.98770000000000002,0.98770000000000002,0.98770000000000002,0.98770000000000002,0.98770000000000002,0.98770000000000002,0.98770000000000002]
["TOPSD0305","Average power factor conversion for  220 kV lines","Factor"]
["TOPSD0306","Average power factor conversion for  132 kV lines","Factor",0.96009999999999995,0.96009999999999995,0.96009999999999995,0.96009999999999995,0.96009999999999995,0.96009999999999995,0.96009999999999995]
["TOPSD0307","Average power factor conversion for  110 kV lines","Factor"]
["TOPSD0308","Average power factor conversion for  88 kV lines","Factor"]
["TOPSD0309","Average power factor conversion for  66 kV lines","Factor",0.97409999999999997,0.97409999999999997,0.97409999999999997,0.97409999999999997,0.97409999999999997,0.97409999999999997,0.97409999999999997]
["TOPSD0310","Average power factor conversion for  33 kV lines","Factor"]
["TOPSD0311","Average power factor conversion for  22 kV lines","Factor"]
["TOPSD0311","Average power factor conversion for  11 kV lines","Factor"]
["TOPSD0312","Average power factor conversion for  6.6 kV lines","Factor"]

{"sheet":"3.5 Physical assets","index":19,"n_rows":75,"n_cols":10,"rows_kept":75,"cut":false,"hidden":false,"merged":[[9,3,9,9],[6,1,6,2]]}
[null,{"$f":"(LOOKUP(dms_Model,dms_Model_List,dms_Worksheet_List))","v":"REGULATORY REPORTING STATEMENT"}]
[null,{"$f":"INDEX(dms_TradingNameFull_List,MATCH(dms_TradingName,dms_TradingName_List))","v":"ElectraNet"}]
[null,{"$f":"IF(SUM(dms_SingleYear_Model)>0,CRY,CONCATENATE(FRCP_y1,\" to \",dms_MultiYear_FinalYear_Result))","v":"2018-19 to 2022-23"}]
[null,"3.5 PHYSICAL ASSETS"]
[]
[]
[null,"There is ONE table on this worksheet. It has been sub-grouped for ease of navigation. See the Instructions sheet on how to group or ungroup tables. "]
[]
[null,"3.5.1 - TRANSMISSION SYSTEM CAPACITIES "]
[null,null,null,"Forecast (0's)"]
[null,null,"Units",{"$f":"CRCP_y4","v":"2016-17"},{"$f":"CRCP_y5","v":"2017-18"},{"$f":"FRCP_y1","v":"2018-19"},{"$f":"FRCP_y2","v":"2019-20"},{"$f":"FRCP_y3","v":"2020-21"},{"$f":"FRCP_y4","v":"2021-22"},{"$f":"FRCP_y5","v":"2022-23"}]
[null,"Overhead network length of circuit at each voltage"]
["TPA0101","500 kV","km"]
["TPA0102","330 kV","km"]
["TPA0103","275 kV","km",2613,2613,2613,2613,2613,2613,2613]
["TPA0104","220 kV","km"]
["TPA0105","132 kV","km",2868,2851.7,2851.7,2851.7,2851.7,2851.7,2851.7]
["TPA0106","110 kV","km"]
["TPA0107","88 kV","km"]
["TPA0108","66 kV","km",13.36,13.36,13.36,13.36,13.36,13.36,13.36]
["TPA0109","33 kV","km"]
["TPA0109","22 kV","km"]
["TPA0109","11 kV","km"]
["TPA01","Total",null,{"$f":"SUM(D13:D23)","v":5494.36},{"$f":"SUM(E13:E23)","v":5478.0599999999995},{"$f":"SUM(F13:F23)","v":5478.0599999999995},5478.0599999999995,5478.0599999999995,5478.0599999999995,5478.0599999999995]
[]
[null,"Underground cable circuit length at each voltage"]
["TPA0201","500 kV","km"]
["TPA0202","330 kV","km"]
["TPA0203","275 kV","km",26.27,26.27,26.27,26.27,26.27,26.27,26.27]
["TPA0204","220 kV","km"]
["TPA0205","132 kV","km"]
["TPA0206","110 kV","km"]
["TPA0207","88 kV","km"]
["TPA0208","66 kV","km",0.91900000000000004,0.91900000000000004,0.91900000000000004,0.91900000000000004,0.91900000000000004,0.91900000000000004,0.91900000000000004]
["TPA0209","33 kV","km"]
["TPA0210","22 kV","km"]
["TPA0211","11 kV","km"]
["TPA02","Total",null,{"$f":"SUM(D27:D37)","v":27.189},{"$f":"SUM(E27:E37)","v":27.189},{"$f":"SUM(F27:F37)","v":27.189},27.189,27.189,27.189,27.189]
[]
[null,"Estimated overhead network weighted average MVA capacity by voltage class"]
["TPA0301","500 kV","MVA"]
["TPA0302","330 kV","MVA"]
["TPA0303","275 kV","MVA",568.56987334886492,568.56987334886492,568.56987334886492,568.56987334886492,568.56987334886492,568.56987334886492,568.56987334886492]
["TPA0304","220 kV","MVA"]
["TPA0305","132 kV","MVA",112.32804341462983,112.32804341462983,112.32804341462983,112.32804341462983,112.32804341462983,112.32804341462983,112.32804341462983]
["TPA0306","110 kV","MVA"]
["TPA0307","88 kV","MVA"]
["TPA0308","66 kV","MVA",108.97294361745088,108.97294361745088,108.97294361745088,108.97294361745088,108.97294361745088,108.97294361745088,108.97294361745088]
["TPA0309","33 kV","MVA"]
["TPA0310","22 kV","MVA"]
["TPA0311","11 kV","MVA"]
[]
[null,"Estimated underground network weighted average MVA capacity by voltage class"]
["TPA0401","500 kV","MVA"]
["TPA0402","330 kV","MVA"]
["TPA0403","275 kV","MVA",660,660,660,660,660,660,660]
["TPA0404","220 kV","MVA"]
["TPA0405","132 kV","MVA"]
["TPA0406","110 kV","MVA"]
["TPA0407","88 kV","MVA"]
["TPA0408","66 kV","MVA"]
["TPA0409","33 kV","MVA"]
["TPA0410","22 kV","MVA"]
["TPA0411","11 kV","MVA"]
[]
[null,"Installed transmission system transformer capacity"]
["TPA0501","Transmission substations (eg 500 kV to 330 kV)","MVA",3840,3840,3840,3840,3840,3840,3840]
["TPA0502","Terminal points to DNSP systems","MVA",7562.6,7562.6,7587.6,7587.6,7582.6,7567.6,7567.6]
["TPA0503","Transformer capacity for directly connected end–users owned by the TNSP","MVA",345,371,371,371,371,371,371]
["TPA0504","Transformer capacity for directly connected end–users owned by the end–user","MVA",440,440,440,440,440,440,440]
["TPA0505","Interconnector capacity","MVA",870,870,870,870,870,870,870]
["TPA0506","Other","MVA"]
[]
[null,"Cold spare capacity"]
["TPA06","Cold spare capacity included in 3.5.1.5","MVA",907.6,907.6,907.6,907.6,907.6,907.6,907.6]

{"sheet":"3.7 Operating environment","index":20,"n_rows":25,"n_cols":10,"rows_kept":25,"cut":false,"hidden":false,"merged":[[7,3,7,9],[19,3,19,9]]}
[null,{"$f":"(LOOKUP(dms_Model,dms_Model_List,dms_Worksheet_List))","v":"REGULATORY REPORTING STATEMENT"}]
[null,{"$f":"INDEX(dms_TradingNameFull_List,MATCH(dms_TradingName,dms_TradingName_List))","v":"ElectraNet"}]
[null,{"$f":"IF(SUM(dms_SingleYear_Model)>0,CRY,CONCATENATE(FRCP_y1,\" to \",dms_MultiYear_FinalYear_Result))","v":"2018-19 to 2022-23"}]
[null,"3.7 OPERATING ENVIRONMENT FACTORS"]
[]
[]
["TEF01","3.7.1 - TERRAIN FACTORS"]
[null,null,null,"Forecast (0's)"]
[null,null,"Units",{"$f":"CRCP_y4","v":"2016-17"},{"$f":"CRCP_y5","v":"2017-18"},{"$f":"FRCP_y1","v":"2018-19"},{"$f":"FRCP_y2","v":"2019-20"},{"$f":"FRCP_y3","v":"2020-21"},{"$f":"FRCP_y4","v":"2021-22"},{"$f":"FRCP_y5","v":"2022-23"}]
["TEF0101","Total number of vegetation maintenance spans","Number of spans",1149]
["TEF0102","Average vegetation maintenance span cycle","Years",1.3809462800563996]
["TEF0103","Average number of trees per vegetation maintenance span","Trees",13.375]
["TEF0104","Average number of defects per vegetation maintenance span","Defects",1.5988286479250333]
["TEF0105","Tropical proportion","Number of spans",0]
["TEF0106","Standard vehicle access","km",4194.7150000000001]
["TEF0107","Altitude","km",10.199999999999999]
["TEF0108","Bushfire risk","Number of spans",927.94084293772914]
[]
["TEF02","3.7.2 - NETWORK CHARACTERISTICS"]
[null,null,null,"Forecast (0's)"]
[null,null,"Units",{"$f":"CRCP_y4","v":"2016-17"},{"$f":"CRCP_y5","v":"2017-18"},{"$f":"FRCP_y1","v":"2018-19"},{"$f":"FRCP_y2","v":"2019-20"},{"$f":"FRCP_y3","v":"2020-21"},{"$f":"FRCP_y4","v":"2021-22"},{"$f":"FRCP_y5","v":"2022-23"}]
["TEF0201","Route line length","km",4537.6000000000004,4521.3,4521.3,4521.3,4521.3,4521.3,4521.3]
["TEF0202","Variability of dispatch","%",0.39983627230818863,0.41633218714718878,0.43194555612909669,0.43194555612909669,0.43194555612909669,0.43194555612909669,0.43194555612909669]
["TEF0203","Concentrated load distance","km",478.5,478.5,478.5,478.5,478.5,478.5,478.5]
["TEF0204","Total number of spans","number",13369,13292,13292,13292,13292,13292,13292]

{"sheet":"5.4 MD & Utilisation - Spatial","index":21,"n_rows":4881,"n_cols":23,"rows_kept":4881,"cut":false,"hidden":false,"merged":[[4863,2,4864,2],[4863,3,4864,3],[4865,2,4866,2],[4865,3,4866,3],[4857,2,4858,2],[4857,3,4858,3],[4859,2,4860,2],[4859,3,4860,3],[4861,2,4862,2],[4861,3,4862,3],[4847,3,4848,3],[4849,2,4850,2],[4849,3,4850,3],[4851,2,4852,2],[4851,3,4852,3],[4853,1,4866,1],[4853,2,4854,2],[4853,3,4854,3],[4855,2,4856,2],[4855,3,4856,3],[4839,1,4852,1],[4839,2,4840,2],[4839,3,4840,3],[4841,2,4842,2],[4841,3,4842,3],[4843,2,4844,2],[4843,3,4844,3],[4845,2,4846,2],[4845,3,4846,3],[4847,2,4848,2],[4831,3,4832,3],[4833,2,4834,2],[4833,3,4834,3],[4835,2,4836,2],[4835,3,4836,3],[4837,2,4838,2],[4837,3,4838,3],[4823,2,4824,2],[4823,3,4824,3],[4825,1,4838,1],[4825,2,4826,2],[4825,3,4826,3],[4827,2,4828,2],[4827,3,4828,3],[4829,2,4830,2],[4829,3,4830,3],[4831,2,4832,2],[4815,3,4816,3],[4817,2,4818,2],[4817,3,4818,3],[4819,2,4820,2],[4819,3,4820,3],[4821,2,4822,2],[4821,3,4822,3],[4807,2,4808,2],[4807,3,4808,3],[4809,2,4810,2],[4809,3,4810,3],[4811,1,4824,1],[4811,2,4812,2],[4811,3,4812,3],[4813,2,4814,2],[4813,3,4814,3],[4815,2,4816,2],[4801,2,4802,2],[4801,3,4802,3],[4803,2,4804,2],[4803,3,4804,3],[4805,2,4806,2],[4805,3,4806,3],[4791,3,4792,3],[4793,2,4794,2],[4793,3,4794,3],[4795,2,4796,2],[4795,3,4796,3],[4797,1,4810,1],[4797,2,4798,2],[4797,3,4798,3],[4799,2,4800,2],[4799,3,4800,3],[4783,1,4796,1],[4783,2,4784,2],[4783,3,4784,3],[4785,2,4786,2],[4785,3,4786,3],[4787,2,4788,2],[4787,3,4788,3],[4789,2,4790,2],[4789,3,4790,3],[4791,2,4792,2],[4775,3,4776,3],[4777,2,4778,2],[4777,3,4778,3],[4779,2,4780,2],[4779,3,4780,3],[4781,2,4782,2],[4781,3,4782,3],[4767,2,4768,2],[4767,3,4768,3],[4769,1,4782,1],[4769,2,4770,2],[4769,3,4770,3],[4771,2,4772,2],[4771,3,4772,3],[4773,2,4774,2],[4773,3,4774,3],[4775,2,4776,2],[4759,3,4760,3],[4761,2,4762,2],[4761,3,4762,3],[4763,2,4764,2],[4763,3,4764,3],[4765,2,4766,2],[4765,3,4766,3],[4751,2,4752,2],[4751,3,4752,3],[4753,2,4754,2],[4753,3,4754,3],[4755,1,4768,1],[4755,2,4756,2],[4755,3,4756,3],[4757,2,4758,2],[4757,3,4758,3],[4759,2,4760,2],[4745,2,4746,2],[4745,3,4746,3],[4747,2,4748,2],[4747,3,4748,3],[4749,2,4750,2],[4749,3,4750,3],[4735,3,4736,3],[4737,2,4738,2],[4737,3,4738,3],[4739,2,4740,2],[4739,3,4740,3],[4741,1,4754,1],[4741,2,4742,2],[4741,3,4742,3],[4743,2,4744,2],[4743,3,4744,3],[4727,1,4740,1],[4727,2,4728,2],[4727,3,4728,3],[4729,2,4730,2],[4729,3,4730,3],[4731,2,4732,2],[4731,3,4732,3],[4733,2,4734,2],[4733,3,4734,3],[4735,2,4736,2],[4719,3,4720,3],[4721,2,4722,2],[4721,3,4722,3],[4723,2,4724,2],[4723,3,4724,3],[4725,2,4726,2],[4725,3,4726,3],[4711,2,4712,2],[4711,3,4712,3],[4713,1,4726,1],[4713,2,4714,2],[4713,3,4714,3],[4715,2,4716,2],[4715,3,4716,3],[4717,2,4718,2],[4717,3,4718,3],[4719,2,4720,2],[4703,3,4704,3],[4705,2,4706,2],[4705,3,4706,3],[4707,2,4708,2],[4707,3,4708,3],[4709,2,4710,2],[4709,3,4710,3],[4695,2,4696,2],[4695,3,4696,3],[4697,2,4698,2],[4697,3,4698,3],[4699,1,4712,1],[4699,2,4700,2],[4699,3,4700,3],[4701,2,4702,2],[4701,3,4702,3],[4703,2,4704,2],[4689,2,4690,2],[4689,3,4690,3],[4691,2,4692,2],[4691,3,4692,3],[4693,2,4694,2],[4693,3,4694,3],[4679,3,4680,3],[4681,2,4682,2],[4681,3,4682,3],[4683,2,4684,2],[4683,3,4684,3],[4685,1,4698,1],[4685,2,4686,2],[4685,3,4686,3],[4687,2,4688,2],[4687,3,4688,3],[4671,1,4684,1],[4671,2,4672,2],[4671,3,4672,3],[4673,2,4674,2],[4673,3,4674,3],[4675,2,4676,2],[4675,3,4676,3],[4677,2,4678,2],[4677,3,4678,3],[4679,2,4680,2],[4663,3,4664,3],[4665,2,4666,2],[4665,3,4666,3],[4667,2,4668,2],[4667,3,4668,3],[4669,2,4670,2],[4669,3,4670,3],[4655,2,4656,2],[4655,3,4656,3],[4657,1,4670,1],[4657,2,4658,2],[4657,3,4658,3],[4659,2,4660,2],[4659,3,4660,3],[4661,2,4662,2],[4661,3,4662,3],[4663,2,4664,2],[4647,3,4648,3],[4649,2,4650,2],[4649,3,4650,3],[4651,2,4652,2],[4651,3,4652,3],[4653,2,4654,2],[4653,3,4654,3],[4639,2,4640,2],[4639,3,4640,3],[4641,2,4642,2],[4641,3,4642,3],[4643,1,4656,1],[4643,2,4644,2],[4643,3,4644,3],[4645,2,4646,2],[4645,3,4646,3],[4647,2,4648,2],[4633,2,4634,2],[4633,3,4634,3],[4635,2,4636,2],[4635,3,4636,3],[4637,2,4638,2],[4637,3,4638,3],[4623,3,4624,3],[4625,2,4626,2],[4625,3,4626,3],[4627,2,4628,2],[4627,3,4628,3],[4629,1,4642,1],[4629,2,4630,2],[4629,3,4630,3],[4631,2,4632,2],[4631,3,4632,3],[4615,1,4628,1],[4615,2,4616,2],[4615,3,4616,3],[4617,2,4618,2],[4617,3,4618,3],[4619,2,4620,2],[4619,3,4620,3],[4621,2,4622,2],[4621,3,4622,3],[4623,2,4624,2],[4607,3,4608,3],[4609,2,4610,2],[4609,3,4610,3],[4611,2,4612,2],[4611,3,4612,3],[4613,2,4614,2],[4613,3,4614,3],[4599,2,4600,2],[4599,3,4600,3],[4601,1,4614,1],[4601,2,4602,2],[4601,3,4602,3],[4603,2,4604,2],[4603,3,4604,3],[4605,2,4606,2],[4605,3,4606,3],[4607,2,4608,2],[4591,3,4592,3],[4593,2,4594,2],[4593,3,4594,3],[4595,2,4596,2],[4595,3,4596,3],[4597,2,4598,2],[4597,3,4598,3],[4583,2,4584,2],[4583,3,4584,3],[4585,2,4586,2],[4585,3,4586,3],[4587,1,4600,1],[4587,2,4588,2],[4587,3,4588,3],[4589,2,4590,2],[4589,3,4590,3],[4591,2,4592,2],[4577,2,4578,2],[4577,3,4578,3],[4579,2,4580,2],[4579,3,4580,3],[4581,2,4582,2],[4581,3,4582,3],[4567,3,4568,3],[4569,2,4570,2],[4569,3,4570,3],[4571,2,4572,2],[4571,3,4572,3],[4573,1,4586,1],[4573,2,4574,2],[4573,3,4574,3],[4575,2,4576,2],[4575,3,4576,3],[4559,1,4572,1],[4559,2,4560,2],[4559,3,4560,3],[4561,2,4562,2],[4561,3,4562,3],[4563,2,4564,2],[4563,3,4564,3],[4565,2,4566,2],[4565,3,4566,3],[4567,2,4568,2],[4551,3,4552,3],[4553,2,4554,2],[4553,3,4554,3],[4555,2,4556,2],[4555,3,4556,3],[4557,2,4558,2],[4557,3,4558,3],[4543,2,4544,2],[4543,3,4544,3],[4545,1,4558,1],[4545,2,4546,2],[4545,3,4546,3],[4547,2,4548,2],[4547,3,4548,3],[4549,2,4550,2],[4549,3,4550,3],[4551,2,4552,2],[4535,3,4536,3],[4537,2,4538,2],[4537,3,4538,3],[4539,2,4540,2],[4539,3,4540,3],[4541,2,4542,2],[4541,3,4542,3],[4527,2,4528,2],[4527,3,4528,3],[4529,2,4530,2],[4529,3,4530,3],[4531,1,4544,1],[4531,2,4532,2],[4531,3,4532,3],[4533,2,4534,2],[4533,3,4534,3],[4535,2,4536,2],[4521,2,4522,2],[4521,3,4522,3],[4523,2,4524,2],[4523,3,4524,3],[4525,2,4526,2],[4525,3,4526,3],[4511,3,4512,3],[4513,2,4514,2],[4513,3,4514,3],[4515,2,4516,2],[4515,3,4516,3],[4517,1,4530,1],[4517,2,4518,2],[4517,3,4518,3],[4519,2,4520,2],[4519,3,4520,3],[4503,1,4516,1],[4503,2,4504,2],[4503,3,4504,3],[4505,2,4506,2],[4505,3,4506,3],[4507,2,4508,2],[4507,3,4508,3],[4509,2,4510,2],[4509,3,4510,3],[4511,2,4512,2],[4495,3,4496,3],[4497,2,4498,2],[4497,3,4498,3],[4499,2,4500,2],[4499,3,4500,3],[4501,2,4502,2],[4501,3,4502,3],[4487,2,4488,2],[4487,3,4488,3],[4489,1,4502,1],[4489,2,4490,2],[4489,3,4490,3],[4491,2,4492,2],[4491,3,4492,3],[4493,2,4494,2],[4493,3,4494,3],[4495,2,4496,2],[4479,3,4480,3],[4481,2,4482,2],[4481,3,4482,3],[4483,2,4484,2],[4483,3,4484,3],[4485,2,4486,2],[4485,3,4486,3],[4471,2,4472,2],[4471,3,4472,3],[4473,2,4474,2],[4473,3,4474,3],[4475,1,4488,1],[4475,2,4476,2],[4475,3,4476,3],[4477,2,4478,2],[4477,3,4478,3],[4479,2,4480,2],[4465,2,4466,2],[4465,3,4466,3],[4467,2,4468,2],[4467,3,4468,3],[4469,2,4470,2],[4469,3,4470,3],[4455,3,4456,3],[4457,2,4458,2],[4457,3,4458,3],[4459,2,4460,2],[4459,3,4460,3],[4461,1,4474,1],[4461,2,4462,2],[4461,3,4462,3],[4463,2,4464,2],[4463,3,4464,3],[4447,1,4460,1],[4447,2,4448,2],[4447,3,4448,3],[4449,2,4450,2],[4449,3,4450,3],[4451,2,4452,2],[4451,3,4452,3],[4453,2,4454,2],[4453,3,4454,3],[4455,2,4456,2],[4439,3,4440,3],[4441,2,4442,2],[4441,3,4442,3],[4443,2,4444,2],[4443,3,4444,3],[4445,2,4446,2],[4445,3,4446,3],[4431,2,4432,2],[4431,3,4432,3],[4433,1,4446,1],[4433,2,4434,2],[4433,3,4434,3],[4435,2,4436,2],[4435,3,4436,3],[4437,2,4438,2],[4437,3,4438,3],[4439,2,4440,2],[4423,3,4424,3],[4425,2,4426,2],[4425,3,4426,3],[4427,2,4428,2],[4427,3,4428,3],[4429,2,4430,2],[4429,3,4430,3],[4415,2,4416,2],[4415,3,4416,3],[4417,2,4418,2],[4417,3,4418,3],[4419,1,4432,1],[4419,2,4420,2],[4419,3,4420,3],[4421,2,4422,2],[4421,3,4422,3],[4423,2,4424,2],[4409,2,4410,2],[4409,3,4410,3],[4411,2,4412,2],[4411,3,4412,3],[4413,2,4414,2],[4413,3,4414,3],[4399,3,4400,3],[4401,2,4402,2],[4401,3,4402,3],[4403,2,4404,2],[4403,3,4404,3],[4405,1,4418,1],[4405,2,4406,2],[4405,3,4406,3],[4407,2,4408,2],[4407,3,4408,3],[4391,1,4404,1],[4391,2,4392,2],[4391,3,4392,3],[4393,2,4394,2],[4393,3,4394,3],[4395,2,4396,2],[4395,3,4396,3],[4397,2,4398,2],[4397,3,4398,3],[4399,2,4400,2],[4383,3,4384,3],[4385,2,4386,2],[4385,3,4386,3],[4387,2,4388,2],[4387,3,4388,3],[4389,2,4390,2],[4389,3,4390,3],[4375,2,4376,2],[4375,3,4376,3],[4377,1,4390,1],[4377,2,4378,2],[4377,3,4378,3],[4379,2,4380,2],[4379,3,4380,3],[4381,2,4382,2],[4381,3,4382,3],[4383,2,4384,2],[4367,3,4368,3],[4369,2,4370,2],[4369,3,4370,3],[4371,2,4372,2],[4371,3,4372,3],[4373,2,4374,2],[4373,3,4374,3],[4359,2,4360,2],[4359,3,4360,3],[4361,2,4362,2],[4361,3,4362,3],[4363,1,4376,1],[4363,2,4364,2],[4363,3,4364,3],[4365,2,4366,2],[4365,3,4366,3],[4367,2,4368,2],[4353,2,4354,2],[4353,3,4354,3],[4355,2,4356,2],[4355,3,4356,3],[4357,2,4358,2],[4357,3,4358,3],[4343,3,4344,3],[4345,2,4346,2],[4345,3,4346,3],[4347,2,4348,2],[4347,3,4348,3],[4349,1,4362,1],[4349,2,4350,2],[4349,3,4350,3],[4351,2,4352,2],[4351,3,4352,3],[4335,1,4348,1],[4335,2,4336,2],[4335,3,4336,3],[4337,2,4338,2],[4337,3,4338,3],[4339,2,4340,2],[4339,3,4340,3],[4341,2,4342,2],[4341,3,4342,3],[4343,2,4344,2],[4327,3,4328,3],[4329,2,4330,2],[4329,3,4330,3],[4331,2,4332,2],[4331,3,4332,3],[4333,2,4334,2],[4333,3,4334,3],[4319,2,4320,2],[4319,3,4320,3],[4321,1,4334,1],[4321,2,4322,2],[4321,3,4322,3],[4323,2,4324,2],[4323,3,4324,3],[4325,2,4326,2],[4325,3,4326,3],[4327,2,4328,2],[4311,3,4312,3],[4313,2,4314,2],[4313,3,4314,3],[4315,2,4316,2],[4315,3,4316,3],[4317,2,4318,2],[4317,3,4318,3],[4303,2,4304,2],[4303,3,4304,3],[4305,2,4306,2],[4305,3,4306,3],[4307,1,4320,1],[4307,2,4308,2],[4307,3,4308,3],[4309,2,4310,2],[4309,3,4310,3],[4311,2,4312,2],[4297,2,4298,2],[4297,3,4298,3],[4299,2,4300,2],[4299,3,4300,3],[4301,2,4302,2],[4301,3,4302,3],[4287,3,4288,3],[4289,2,4290,2],[4289,3,4290,3],[4291,2,4292,2],[4291,3,4292,3],[4293,1,4306,1],[4293,2,4294,2],[4293,3,4294,3],[4295,2,4296,2],[4295,3,4296,3],[4279,1,4292,1],[4279,2,4280,2],[4279,3,4280,3],[4281,2,4282,2],[4281,3,4282,3],[4283,2,4284,2],[4283,3,4284,3],[4285,2,4286,2],[4285,3,4286,3],[4287,2,4288,2],[4271,3,4272,3],[4273,2,4274,2],[4273,3,4274,3],[4275,2,4276,2],[4275,3,4276,3],[4277,2,4278,2],[4277,3,4278,3],[4263,2,4264,2],[4263,3,4264,3],[4265,1,4278,1],[4265,2,4266,2],[4265,3,4266,3],[4267,2,4268,2],[4267,3,4268,3],[4269,2,4270,2],[4269,3,4270,3],[4271,2,4272,2],[4255,3,4256,3],[4257,2,4258,2],[4257,3,4258,3],[4259,2,4260,2],[4259,3,4260,3],[4261,2,4262,2],[4261,3,4262,3],[4247,2,4248,2],[4247,3,4248,3],[4249,2,4250,2],[4249,3,4250,3],[4251,1,4264,1],[4251,2,4252,2],[4251,3,4252,3],[4253,2,4254,2],[4253,3,4254,3],[4255,2,4256,2],[4241,2,4242,2],[4241,3,4242,3],[4243,2,4244,2],[4243,3,4244,3],[4245,2,4246,2],[4245,3,4246,3],[4231,3,4232,3],[4233,2,4234,2],[4233,3,4234,3],[4235,2,4236,2],[4235,3,4236,3],[4237,1,4250,1],[4237,2,4238,2],[4237,3,4238,3],[4239,2,4240,2],[4239,3,4240,3],[4223,1,4236,1],[4223,2,4224,2],[4223,3,4224,3],[4225,2,4226,2],[4225,3,4226,3],[4227,2,4228,2],[4227,3,4228,3],[4229,2,4230,2],[4229,3,4230,3],[4231,2,4232,2],[4215,3,4216,3],[4217,2,4218,2],[4217,3,4218,3],[4219,2,4220,2],[4219,3,4220,3],[4221,2,4222,2],[4221,3,4222,3],[4207,2,4208,2],[4207,3,4208,3],[4209,1,4222,1],[4209,2,4210,2],[4209,3,4210,3],[4211,2,4212,2],[4211,3,4212,3],[4213,2,4214,2],[4213,3,4214,3],[4215,2,4216,2],[4199,3,4200,3],[4201,2,4202,2],[4201,3,4202,3],[4203,2,4204,2],[4203,3,4204,3],[4205,2,4206,2],[4205,3,4206,3],[4191,2,4192,2],[4191,3,4192,3],[4193,2,4194,2],[4193,3,4194,3],[4195,1,4208,1],[4195,2,4196,2],[4195,3,4196,3],[4197,2,4198,2],[4197,3,4198,3],[4199,2,4200,2],[4185,2,4186,2],[4185,3,4186,3],[4187,2,4188,2],[4187,3,4188,3],[4189,2,4190,2],[4189,3,4190,3],[4175,3,4176,3],[4177,2,4178,2],[4177,3,4178,3],[4179,2,4180,2],[4179,3,4180,3],[4181,1,4194,1],[4181,2,4182,2],[4181,3,4182,3],[4183,2,4184,2],[4183,3,4184,3],[4167,1,4180,1],[4167,2,4168,2],[4167,3,4168,3],[4169,2,4170,2],[4169,3,4170,3],[4171,2,4172,2],[4171,3,4172,3],[4173,2,4174,2],[4173,3,4174,3],[4175,2,4176,2],[4159,3,4160,3],[4161,2,4162,2],[4161,3,4162,3],[4163,2,4164,2],[4163,3,4164,3],[4165,2,4166,2],[4165,3,4166,3],[4151,2,4152,2],[4151,3,4152,3],[4153,1,4166,1],[4153,2,4154,2],[4153,3,4154,3],[4155,2,4156,2],[4155,3,4156,3],[4157,2,4158,2],[4157,3,4158,3],[4159,2,4160,2],[4143,3,4144,3],[4145,2,4146,2],[4145,3,4146,3],[4147,2,4148,2],[4147,3,4148,3],[4149,2,4150,2],[4149,3,4150,3],[4135,2,4136,2],[4135,3,4136,3],[4137,2,4138,2],[4137,3,4138,3],[4139,1,4152,1],[4139,2,4140,2],[4139,3,4140,3],[4141,2,4142,2],[4141,3,4142,3],[4143,2,4144,2],[4129,2,4130,2],[4129,3,4130,3],[4131,2,4132,2],[4131,3,4132,3],[4133,2,4134,2],[4133,3,4134,3],[4119,3,4120,3],[4121,2,4122,2],[4121,3,4122,3],[4123,2,4124,2],[4123,3,4124,3],[4125,1,4138,1],[4125,2,4126,2],[4125,3,4126,3],[4127,2,4128,2],[4127,3,4128,3],[4111,1,4124,1],[4111,2,4112,2],[4111,3,4112,3],[4113,2,4114,2],[4113,3,4114,3],[4115,2,4116,2],[4115,3,4116,3],[4117,2,4118,2],[4117,3,4118,3],[4119,2,4120,2],[4103,3,4104,3],[4105,2,4106,2],[4105,3,4106,3],[4107,2,4108,2],[4107,3,4108,3],[4109,2,4110,2],[4109,3,4110,3],[4095,2,4096,2],[4095,3,4096,3],[4097,1,4110,1],[4097,2,4098,2],[4097,3,4098,3],[4099,2,4100,2],[4099,3,4100,3],[4101,2,4102,2],[4101,3,4102,3],[4103,2,4104,2],[4087,3,4088,3],[4089,2,4090,2],[4089,3,4090,3],[4091,2,4092,2],[4091,3,4092,3],[4093,2,4094,2],[4093,3,4094,3],[4079,2,4080,2],[4079,3,4080,3],[4081,2,4082,2],[4081,3,4082,3],[4083,1,4096,1],[4083,2,4084,2],[4083,3,4084,3],[4085,2,4086,2],[4085,3,4086,3],[4087,2,4088,2],[4073,2,4074,2],[4073,3,4074,3],[4075,2,4076,2],[4075,3,4076,3],[4077,2,4078,2],[4077,3,4078,3],[4063,3,4064,3],[4065,2,4066,2],[4065,3,4066,3],[4067,2,4068,2],[4067,3,4068,3],[4069,1,4082,1],[4069,2,4070,2],[4069,3,4070,3],[4071,2,4072,2],[4071,3,4072,3],[4055,1,4068,1],[4055,2,4056,2],[4055,3,4056,3],[4057,2,4058,2],[4057,3,4058,3],[4059,2,4060,2],[4059,3,4060,3],[4061,2,4062,2],[4061,3,4062,3],[4063,2,4064,2],[4047,3,4048,3],[4049,2,4050,2],[4049,3,4050,3],[4051,2,4052,2],[4051,3,4052,3],[4053,2,4054,2],[4053,3,4054,3],[4039,2,4040,2],[4039,3,4040,3],[4041,1,4054,1],[4041,2,4042,2],[4041,3,4042,3],[4043,2,4044,2],[4043,3,4044,3],[4045,2,4046,2],[4045,3,4046,3],[4047,2,4048,2],[4031,3,4032,3],[4033,2,4034,2],[4033,3,4034,3],[4035,2,4036,2],[4035,3,4036,3],[4037,2,4038,2],[4037,3,4038,3],[4023,2,4024,2],[4023,3,4024,3],[4025,2,4026,2],[4025,3,4026,3],[4027,1,4040,1],[4027,2,4028,2],[4027,3,4028,3],[4029,2,4030,2],[4029,3,4030,3],[4031,2,4032,2],[4017,2,4018,2],[4017,3,4018,3],[4019,2,4020,2],[4019,3,4020,3],[4021,2,4022,2],[4021,3,4022,3],[4007,3,4008,3],[4009,2,4010,2],[4009,3,4010,3],[4011,2,4012,2],[4011,3,4012,3],[4013,1,4026,1],[4013,2,4014,2],[4013,3,4014,3],[4015,2,4016,2],[4015,3,4016,3],[3999,1,4012,1],[3999,2,4000,2],[3999,3,4000,3],[4001,2,4002,2],[4001,3,4002,3],[4003,2,4004,2],[4003,3,4004,3],[4005,2,4006,2],[4005,3,4006,3],[4007,2,4008,2],[3991,3,3992,3],[3993,2,3994,2],[3993,3,3994,3],[3995,2,3996,2],[3995,3,3996,3],[3997,2,3998,2],[3997,3,3998,3],[3983,2,3984,2],[3983,3,3984,3],[3985,1,3998,1],[3985,2,3986,2],[3985,3,3986,3],[3987,2,3988,2],[3987,3,3988,3],[3989,2,3990,2],[3989,3,3990,3],[3991,2,3992,2],[3975,3,3976,3],[3977,2,3978,2],[3977,3,3978,3],[3979,2,3980,2],[3979,3,3980,3],[3981,2,3982,2],[3981,3,3982,3],[3967,2,3968,2],[3967,3,3968,3],[3969,2,3970,2],[3969,3,3970,3],[3971,1,3984,1],[3971,2,3972,2],[3971,3,3972,3],[3973,2,3974,2],[3973,3,3974,3],[3975,2,3976,2],[3961,2,3962,2],[3961,3,3962,3],[3963,2,3964,2],[3963,3,3964,3],[3965,2,3966,2],[3965,3,3966,3],[3951,3,3952,3],[3953,2,3954,2],[3953,3,3954,3],[3955,2,3956,2],[3955,3,3956,3],[3957,1,3970,1],[3957,2,3958,2],[3957,3,3958,3],[3959,2,3960,2],[3959,3,3960,3],[3943,1,3956,1],[3943,2,3944,2],[3943,3,3944,3],[3945,2,3946,2],[3945,3,3946,3],[3947,2,3948,2],[3947,3,3948,3],[3949,2,3950,2],[3949,3,3950,3],[3951,2,3952,2],[3935,3,3936,3],[3937,2,3938,2],[3937,3,3938,3],[3939,2,3940,2],[3939,3,3940,3],[3941,2,3942,2],[3941,3,3942,3],[3927,2,3928,2],[3927,3,3928,3],[3929,1,3942,1]],"merged_total":5221,"flags":["merged_cut"]}
[null,{"$f":"(LOOKUP(dms_Model,dms_Model_List,dms_Worksheet_List))","v":"REGULATORY REPORTING STATEMENT"}]
[null,{"$f":"INDEX(dms_TradingNameFull_List,MATCH(dms_TradingName,dms_TradingName_List))","v":"ElectraNet"}]
[null,{"$f":"IF(SUM(dms_SingleYear_Model)>0,CRY,CONCATENATE(FRCP_y1,\" to \",dms_MultiYear_FinalYear_Result))","v":"2018-19 to 2022-23"}]
[null,"5.4 MAXIMUM DEMAND AND UTILISATION AT SPATIAL LEVEL"]
[]
[null,"There is ONE table on this worksheet. It has been sub-grouped into blocks of approximately 1000 rows for ease of navigation. See the Instructions sheet on how to group or ungroup data."]
[]
[null,"5.4.1 - NON-COINCIDENT & COINCIDENT MAXIMUM DEMAND"]
[null,"CONNECTION POINT","FORECASTING ELEMENTS","UNIT","MAX DEMAND",null,"TNSP NAME","SERVICE","SERVICE SUBCATEGORY","DATA TYPE","DATA TYPE SUBCATEGORY","LOCATION","LOCATION SUBCATEGORY","MEASUREMENT","DENOMINATION",null,{"$f":"CRCP_y4","v":"2016-17"},{"$f":"CRCP_y5","v":"2017-18"},{"$f":"FRCP_y1","v":"2018-19"},{"$f":"FRCP_y2","v":"2019-20"},{"$f":"FRCP_y3","v":"2020-21"},{"$f":"FRCP_y4","v":"2021-22"},{"$f":"FRCP_y5","v":"2022-23"}]
[null,"ACR","CONNECTION POINT RATING","MVA","Non-coincident",null,"TNSP NAME","DEMAND FORECASTING","NON-COINCIDENT MAXIMUM DEMAND","DESCRIPTOR METRIC","CONNECTION POINT RATING","CONNECTION POINT",{"$f":"B10","v":"ACR"},"RATING","MVA",null,600,600,600,600,600,600,600]
[null,null,null,null,"Coincident",null,"TNSP NAME","DEMAND FORECASTING","COINCIDENT MAXIMUM DEMAND","DESCRIPTOR METRIC","CONNECTION POINT RATING","CONNECTION POINT",{"$f":"M10","v":"ACR"},"RATING","MVA",null,600,600,600,600,600,600,600]
[null,null,"WINTER/SUMMER PEAKING",null,"Non-coincident",null,"TNSP NAME","DEMAND FORECASTING","NON-COINCIDENT MAXIMUM DEMAND","DESCRIPTOR METRIC","WINTER/SUMMER PEAKING","CONNECTION POINT",{"$f":"#REF!","v":{"$error":"#REF!"}},"WINTER/SUMMER","WINTER/SUMMER",null,"Summer","Summer","Summer","Summer","Summer","Summer","Summer"]
[null,null,null,null,"Coincident",null,"TNSP NAME","DEMAND FORECASTING","COINCIDENT MAXIMUM DEMAND","DESCRIPTOR METRIC","WINTER/SUMMER PEAKING","CONNECTION POINT",{"$error":"#REF!"},"WINTER/SUMMER","WINTER/SUMMER",null,"Summer","Summer","Summer","Summer","Summer","Summer","Summer"]
[null,null,"ADJUSTMENTS - EMBEDDED GENERATION","MW","Non-coincident",null,"TNSP NAME","DEMAND FORECASTING","NON-COINCIDENT MAXIMUM DEMAND","DESCRIPTOR METRIC","ADJUSTMENTS - EMBEDDED GENERATION","CONNECTION POINT",{"$error":"#REF!"},"GENERATED LOAD","MW",null,0.34904321500000002,0.379476064,0.41196972100000001,0.43928739700000002,0.46636544400000002,0.49406652499999998,0.52128834999999996]
[null,null,null,null,"Coincident",null,"TNSP NAME","DEMAND FORECASTING","COINCIDENT MAXIMUM DEMAND","DESCRIPTOR METRIC","ADJUSTMENTS - EMBEDDED GENERATION","CONNECTION POINT",{"$error":"#REF!"},"GENERATED LOAD","MW",null,0.34904321500000002,0.379476064,0.41196972100000001,0.43928739700000002,0.46636544400000002,0.49406652499999998,0.52128834999999996]
[null,null,"WEATHER CORRECTED MD 10% POE","MW","Non-coincident",null,"TNSP NAME","DEMAND FORECASTING","NON-COINCIDENT MAXIMUM DEMAND","DESCRIPTOR METRIC","WEATHER CORRECTED MD 10% POE","CONNECTION POINT",{"$error":"#REF!"},"MAXIMUM DEMAND","MW",null,203.0745819,200.50645990000001,198.82741780000001,191.7071535,185.41692069999999,179.56556639999999,175.5569831]
[null,null,null,null,"Coincident",null,"TNSP NAME","DEMAND FORECASTING","COINCIDENT MAXIMUM DEMAND","DESCRIPTOR METRIC","WEATHER CORRECTED MD 10% POE","CONNECTION POINT",{"$error":"#REF!"},"MAXIMUM DEMAND","MW",null,176.95059649999999,173.05177979999999,172.8770198,165.41546650000001,161.68890669999999,156.60395790000001,153.12701139999999]
[null,null,"WEATHER CORRECTED MD 10% POE","MVA","Non-coincident",null,"TNSP NAME","DEMAND FORECASTING","NON-COINCIDENT MAXIMUM DEMAND","DESCRIPTOR METRIC","WEATHER CORRECTED MD 10% POE","CONNECTION POINT",{"$error":"#REF!"},"MAXIMUM DEMAND","MVA",null,210.54911860000001,207.88647209999999,206.1456297,198.76329089999999,192.24153440000001,186.1748102,182.01868350000001]
[null,null,null,null,"Coincident",null,"TNSP NAME","DEMAND FORECASTING","COINCIDENT MAXIMUM DEMAND","DESCRIPTOR METRIC","WEATHER CORRECTED MD 10% POE","CONNECTION POINT",{"$error":"#REF!"},"MAXIMUM DEMAND","MVA",null,183.46359140000001,179.42127149999999,179.24007929999999,171.50388960000001,167.6401668,162.36805709999999,158.7631351]
[null,null,"WEATHER CORRECTED MD 50% POE","MW","Non-coincident",null,"TNSP NAME","DEMAND FORECASTING","NON-COINCIDENT MAXIMUM DEMAND","DESCRIPTOR METRIC","WEATHER CORRECTED MD 50% POE","CONNECTION POINT",{"$error":"#REF!"},"MAXIMUM DEMAND","MW",null,191.2594627,188.76793549999999,184.9486704,179.28569899999999,174.05669069999999,167.23392699999999,164.6701687]
[null,null,null,null,"Coincident",null,"TNSP NAME","DEMAND FORECASTING","COINCIDENT MAXIMUM DEMAND","DESCRIPTOR METRIC","WEATHER CORRECTED MD 50% POE","CONNECTION POINT",{"$error":"#REF!"},"MAXIMUM DEMAND","MW",null,161.89866280000001,158.24433830000001,154.35433470000001,149.95797519999999,147.45067019999999,141.688715,139.53391450000001]
[null,null,"WEATHER CORRECTED MD 50% POE","MVA","Non-coincident",null,"TNSP NAME","DEMAND FORECASTING","NON-COINCIDENT MAXIMUM DEMAND","DESCRIPTOR METRIC","WEATHER CORRECTED MD 50% POE","CONNECTION POINT",{"$error":"#REF!"},"MAXIMUM DEMAND","MVA",null,198.29912200000001,195.7158896,191.7560493,185.8846418,180.46317010000001,173.38928189999999,170.73115970000001]
[null,null,null,null,"Coincident",null,"TNSP NAME","DEMAND FORECASTING","COINCIDENT MAXIMUM DEMAND","DESCRIPTOR METRIC","WEATHER CORRECTED MD 50% POE","CONNECTION POINT",{"$error":"#REF!"},"MAXIMUM DEMAND","MVA",null,167.85764349999999,164.06881480000001,160.0356323,155.4774567,152.87786560000001,146.903831,144.66971899999999]
[null,"Angas Creek","CONNECTION POINT RATING","MVA","Non-coincident",null,"TNSP NAME","DEMAND FORECASTING","NON-COINCIDENT MAXIMUM DEMAND","DESCRIPTOR METRIC","CONNECTION POINT RATING","CONNECTION POINT",{"$f":"B24","v":"Angas Creek"},"RATING","MVA",null,56.6,56.6,56.6,56.6,56.6,56.6,56.6]
[null,null,null,null,"Coincident",null,"TNSP NAME","DEMAND FORECASTING","COINCIDENT MAXIMUM DEMAND","DESCRIPTOR METRIC","CONNECTION POINT RATING","CONNECTION POINT","Angas Creek","RATING","MVA",null,56.6,56.6,56.6,56.6,56.6,56.6,56.6]
[null,null,"WINTER/SUMMER PEAKING",null,"Non-coincident",null,"TNSP NAME","DEMAND FORECASTING","NON-COINCIDENT MAXIMUM DEMAND","DESCRIPTOR METRIC","WINTER/SUMMER PEAKING","CONNECTION POINT",{"$f":"#REF!","v":{"$error":"#REF!"}},"WINTER/SUMMER","WINTER/SUMMER",null,"Summer","Summer","Summer","Summer","Summer","Summer","Summer"]
[null,null,null,null,"Coincident",null,"TNSP NAME","DEMAND FORECASTING","COINCIDENT MAXIMUM DEMAND","DESCRIPTOR METRIC","WINTER/SUMMER PEAKING","CONNECTION POINT",{"$error":"#REF!"},"WINTER/SUMMER","WINTER/SUMMER",null,"Summer","Summer","Summer","Summer","Summer","Summer","Summer"]
[null,null,"ADJUSTMENTS - EMBEDDED GENERATION","MW","Non-coincident",null,"TNSP NAME","DEMAND FORECASTING","NON-COINCIDENT MAXIMUM DEMAND","DESCRIPTOR METRIC","ADJUSTMENTS - EMBEDDED GENERATION","CONNECTION POINT",{"$error":"#REF!"},"GENERATED LOAD","MW",null,1.3718912350000001,1.491505533,1.6192196969999999,1.726590012,1.8330184819999999,1.9418957489999999,2.0488893259999998]
[null,null,null,null,"Coincident",null,"TNSP NAME","DEMAND FORECASTING","COINCIDENT MAXIMUM DEMAND","DESCRIPTOR METRIC","ADJUSTMENTS - EMBEDDED GENERATION","CONNECTION POINT",{"$error":"#REF!"},"GENERATED LOAD","MW",null,1.3718912350000001,1.491505533,1.6192196969999999,1.726590012,1.8330184819999999,1.9418957489999999,2.0488893259999998]
[null,null,"WEATHER CORRECTED MD 10% POE","MW","Non-coincident",null,"TNSP NAME","DEMAND FORECASTING","NON-COINCIDENT MAXIMUM DEMAND","DESCRIPTOR METRIC","WEATHER CORRECTED MD 10% POE","CONNECTION POINT",{"$error":"#REF!"},"MAXIMUM DEMAND","MW",null,18.46423519,18.39290227,18.457892380000001,18.066420860000001,17.791775940000001,17.595088860000001,17.61420562]
[null,null,null,null,"Coincident",null,"TNSP NAME","DEMAND FORECASTING","COINCIDENT MAXIMUM DEMAND","DESCRIPTOR METRIC","WEATHER CORRECTED MD 10% POE","CONNECTION POINT",{"$error":"#REF!"},"MAXIMUM DEMAND","MW",null,15.17476379,14.972424,15.13691101,14.70293616,14.63336866,14.473224269999999,14.490751619999999]
[null,null,"WEATHER CORRECTED MD 10% POE","MVA","Non-coincident",null,"TNSP NAME","DEMAND FORECASTING","NON-COINCIDENT MAXIMUM DEMAND","DESCRIPTOR METRIC","WEATHER CORRECTED MD 10% POE","CONNECTION POINT",{"$error":"#REF!"},"MAXIMUM DEMAND","MVA",null,19.18107316,19.106970879999999,19.174484100000001,18.767814470000001,18.482506990000001,18.27818392,18.298042850000002]
[null,null,null,null,"Coincident",null,"TNSP NAME","DEMAND FORECASTING","COINCIDENT MAXIMUM DEMAND","DESCRIPTOR METRIC","WEATHER CORRECTED MD 10% POE","CONNECTION POINT",{"$error":"#REF!"},"MAXIMUM DEMAND","MVA",null,15.76389444,15.55369921,15.724572090000001,15.27374902,15.201480699999999,15.035119010000001,15.05332683]
[null,null,"WEATHER CORRECTED MD 50% POE","MW","Non-coincident",null,"TNSP NAME","DEMAND FORECASTING","NON-COINCIDENT MAXIMUM DEMAND","DESCRIPTOR METRIC","WEATHER CORRECTED MD 50% POE","CONNECTION POINT",{"$error":"#REF!"},"MAXIMUM DEMAND","MW",null,16.715772080000001,16.666248809999999,16.543240919999999,16.29415478,16.11815052,15.822289120000001,15.95822452]
[null,null,null,null,"Coincident",null,"TNSP NAME","DEMAND FORECASTING","COINCIDENT MAXIMUM DEMAND","DESCRIPTOR METRIC","WEATHER CORRECTED MD 50% POE","CONNECTION POINT",{"$error":"#REF!"},"MAXIMUM DEMAND","MW",null,13.34568668,13.17746796,13.02214013,12.85434375,12.878503159999999,12.64370467,12.753916569999999]
[null,null,"WEATHER CORRECTED MD 50% POE","MVA","Non-coincident",null,"TNSP NAME","DEMAND FORECASTING","NON-COINCIDENT MAXIMUM DEMAND","DESCRIPTOR METRIC","WEATHER CORRECTED MD 50% POE","CONNECTION POINT",{"$error":"#REF!"},"MAXIMUM DEMAND","MVA",null,17.364729369999999,17.313283460000001,17.18550003,16.926743609999999,16.743906320000001,16.436558680000001,16.577771500000001]
[null,null,null,null,"Coincident",null,"TNSP NAME","DEMAND FORECASTING","COINCIDENT MAXIMUM DEMAND","DESCRIPTOR METRIC","WEATHER CORRECTED MD 50% POE","CONNECTION POINT",{"$error":"#REF!"},"MAXIMUM DEMAND","MVA",null,13.863806970000001,13.68905749,13.52769936,13.35338861,13.37848597,13.134571879999999,13.249062540000001]
[null,"Ardrossan West","CONNECTION POINT RATING","MVA","Non-coincident",null,null,null,null,null,null,null,null,null,null,null,50,50,50,50,50,50,50]
[null,null,null,null,"Coincident",null,null,null,null,null,null,null,null,null,null,null,50,50,50,50,50,50,50]
[null,null,"WINTER/SUMMER PEAKING",null,"Non-coincident",null,null,null,null,null,null,null,null,null,null,null,"Summer","Summer","Summer","Summer","Summer","Summer","Summer"]
[null,null,null,null,"Coincident",null,null,null,null,null,null,null,null,null,null,null,"Summer","Summer","Summer","Summer","Summer","Summer","Summer"]
[null,null,"ADJUSTMENTS - EMBEDDED GENERATION","MW","Non-coincident",null,null,null,null,null,null,null,null,null,null,null,0.97269243900000002,1.057500855,1.1480522040000001,1.224179444,1.2996389020000001,1.376834594,1.4526947210000001]
[null,null,null,null,"Coincident",null,null,null,null,null,null,null,null,null,null,null,0.97269243900000002,1.057500855,1.1480522040000001,1.224179444,1.2996389020000001,1.376834594,1.4526947210000001]
[null,null,"WEATHER CORRECTED MD 10% POE","MW","Non-coincident",null,null,null,null,null,null,null,null,null,null,null,11.940938600000001,9.7538185560000006,9.6882187670000004,9.3522921110000006,9.0750820179999998,8.8096284889999996,8.6264550460000002]
[null,null,null,null,"Coincident",null,null,null,null,null,null,null,null,null,null,null,9.7965880169999995,7.9261500539999998,7.9313086039999998,7.5979385190000004,7.4511161860000001,7.2339780180000002,7.0844473539999999]
[null,null,"WEATHER CORRECTED MD 10% POE","MVA","Non-coincident",null,null,null,null,null,null,null,null,null,null,null,12.162324659999999,9.9346552189999997,9.8678392030000008,9.5256844370000007,9.2433348449999997,8.9729597840000004,8.7863902889999999]
[null,null,null,null,"Coincident",null,null,null,null,null,null,null,null,null,null,null,9.9782176289999995,8.0731015799999994,8.0783557699999999,7.7388049739999998,7.5892605419999999,7.3680966129999996,7.215793637]
[null,null,"WEATHER CORRECTED MD 50% POE","MW","Non-coincident",null,null,null,null,null,null,null,null,null,null,null,10.33771673,8.1592581699999993,8.0341013710000002,7.8186468810000003,7.6118471300000001,7.3267997930000002,7.2213471819999997]
[null,null,null,null,"Coincident",null,null,null,null,null,null,null,null,null,null,null,8.2391967650000009,6.4400693799999997,6.3131315710000004,6.1573725990000003,6.0713602499999997,5.8447388990000002,5.7613331519999997]
[null,null,"WEATHER CORRECTED MD 50% POE","MVA","Non-coincident",null,null,null,null,null,null,null,null,null,null,null,10.52937891,8.3105315409999996,8.1830543240000004,7.9636052890000002,7.7529714519999997,7.4626393120000003,7.3552316009999998]
[null,null,null,null,"Coincident",null,null,null,null,null,null,null,null,null,null,null,8.3919522050000008,6.5594688379999999,6.4301775909999996,6.271530834,6.1839238080000003,5.9531008769999998,5.8681487810000004]
[null,null,"CONNECTION POINT RATING","MVA","Non-coincident"]
[null,null,null,null,"Coincident"]
[null,null,"WINTER/SUMMER PEAKING",null,"Non-coincident"]
[null,null,null,null,"Coincident"]
[null,null,"ADJUSTMENTS - EMBEDDED GENERATION","MW","Non-coincident"]
[null,null,null,null,"Coincident"]
[null,null,"WEATHER CORRECTED MD 10% POE","MW","Non-coincident"]
[null,null,null,null,"Coincident"]
[null,null,"WEATHER CORRECTED MD 10% POE","MVA","Non-coincident"]
[null,null,null,null,"Coincident"]
[null,null,"WEATHER CORRECTED MD 50% POE","MW","Non-coincident"]
[null,null,null,null,"Coincident"]
[null,null,"WEATHER CORRECTED MD 50% POE","MVA","Non-coincident"]
[null,null,null,null,"Coincident"]
[null,"Baroota","CONNECTION POINT RATING","MVA","Non-coincident",null,null,null,null,null,null,null,null,null,null,null,11.8,11.8,11.8,11.8,11.8,11.8,11.8]
[null,null,null,null,"Coincident",null,null,null,null,null,null,null,null,null,null,null,11.8,11.8,11.8,11.8,11.8,11.8,11.8]
[null,null,"WINTER/SUMMER PEAKING",null,"Non-coincident",null,null,null,null,null,null,null,null,null,null,null,"Summer","Summer","Summer","Summer","Summer","Summer","Summer"]
[null,null,null,null,"Coincident",null,null,null,null,null,null,null,null,null,null,null,"Summer","Summer","Summer","Summer","Summer","Summer","Summer"]
[null,null,"ADJUSTMENTS - EMBEDDED GENERATION","MW","Non-coincident",null,null,null,null,null,null,null,null,null,null,null,0.60139454299999995,0.65382973899999997,0.70981566600000001,0.75688348000000005,0.80353841800000003,0.85126683299999995,0.89816949700000004]
[null,null,null,null,"Coincident",null,null,null,null,null,null,null,null,null,null,null,0.60139454299999995,0.65382973899999997,0.70981566600000001,0.75688348000000005,0.80353841800000003,0.85126683299999995,0.89816949700000004]
[null,null,"WEATHER CORRECTED MD 10% POE","MW","Non-coincident",null,null,null,null,null,null,null,null,null,null,null,7.9130465189999999,7.809561585,7.734243523,7.440833069,7.1738404510000002,6.9189258679999996,6.7306159860000001]
[null,null,null,null,"Coincident",null,null,null,null,null,null,null,null,null,null,null,6.2941732789999998,6.152800987,6.1387132940000004,5.8608130699999998,5.710591397,5.5082908579999996,5.3590403010000003]
[null,null,"WEATHER CORRECTED MD 10% POE","MVA","Non-coincident",null,null,null,null,null,null,null,null,null,null,null,7.9133624459999998,7.80987338,7.7345523119999999,7.4411301429999996,7.1741268659999999,6.9192021050000001,6.7308847050000002]
[null,null,null,null,"Coincident",null,null,null,null,null,null,null,null,null,null,null,6.2944245729999997,6.153046636,6.1389583810000001,5.8610470619999999,5.7108193920000003,5.5085107750000004,5.3592542590000001]
[null,null,"WEATHER CORRECTED MD 50% POE","MW","Non-coincident",null,null,null,null,null,null,null,null,null,null,null,7.2114296710000003,7.1082867729999997,6.9489964779999998,6.7144515949999999,6.490644981,6.2031577779999996,6.0697453039999996]
[null,null,null,null,"Coincident",null,null,null,null,null,null,null,null,null,null,null,5.5723734709999997,5.439555447,5.2940522259999998,5.1266418590000002,5.0192912500000002,4.7975798789999997,4.6949808839999996]
[null,null,"WEATHER CORRECTED MD 50% POE","MVA","Non-coincident",null,null,null,null,null,null,null,null,null,null,null,7.2117175859999998,7.1085705700000004,6.9492739160000001,6.7147196679999999,6.4909041189999996,6.2034054379999999,6.0699876369999997]
[null,null,null,null,"Coincident",null,null,null,null,null,null,null,null,null,null,null,5.5725959469999999,5.4397726200000003,5.2942635899999999,5.1268465399999998,5.0194916449999996,4.7977714210000002,4.6951683299999996]
[null,"Berri","CONNECTION POINT RATING","MVA","Non-coincident",null,null,null,null,null,null,null,null,null,null,null,200.1,200.1,200.1,200.1,200.1,200.1,200.1]
[null,null,null,null,"Coincident",null,null,null,null,null,null,null,null,null,null,null,200.1,200.1,200.1,200.1,200.1,200.1,200.1]
[null,null,"WINTER/SUMMER PEAKING",null,"Non-coincident",null,null,null,null,null,null,null,null,null,null,null,"Summer","Summer","Summer","Summer","Summer","Summer","Summer"]
[null,null,null,null,"Coincident",null,null,null,null,null,null,null,null,null,null,null,"Summer","Summer","Summer","Summer","Summer","Summer","Summer"]
[null,null,"ADJUSTMENTS - EMBEDDED GENERATION","MW","Non-coincident",null,null,null,null,null,null,null,null,null,null,null,3.7283948150000001,4.053471117,4.4005604600000003,4.6923612349999999,4.9816023539999996,5.2774985790000004,5.5682754909999996]
[null,null,null,null,"Coincident",null,null,null,null,null,null,null,null,null,null,null,3.7283948150000001,4.053471117,4.4005604600000003,4.6923612349999999,4.9816023539999996,5.2774985790000004,5.5682754909999996]
[null,null,"WEATHER CORRECTED MD 10% POE","MW","Non-coincident",null,null,null,null,null,null,null,null,null,null,null,88.463607039999999,89.024880929999995,89.968542029999995,88.380297040000002,87.022565999999998,85.726525120000005,85.183066269999998]
[null,null,null,null,"Coincident",null,null,null,null,null,null,null,null,null,null,null,80.409513270000005,80.150351119999996,81.601474139999993,79.54988917,79.16059903,77.990413149999995,77.505637550000003]
[null,null,"WEATHER CORRECTED MD 10% POE","MVA","Non-coincident",null,null,null,null,null,null,null,null,null,null,null,91.997505759999996,92.581201140000005,93.562559129999997,91.910867749999994,90.498898769999997,89.151084299999994,88.585915639999996]
[null,null,null,null,"Coincident",null,null,null,null,null,null,null,null,null,null,null,83.621671199999994,83.352156170000001,84.861247910000003,82.727707280000004,82.322865969999995,81.105934110000007,80.601792950000004]
[null,null,"WEATHER CORRECTED MD 50% POE","MW","Non-coincident",null,null,null,null,null,null,null,null,null,null,null,82.64291996,83.285651040000005,83.302760300000003,82.369345640000006,81.500506349999995,79.737696029999995,79.879211949999998]
[null,null,null,null,"Coincident",null,null,null,null,null,null,null,null,null,null,null,72.974698720000006,72.831032410000006,72.522595039999999,71.86805004,72.021582940000002,70.472695540000004,70.606542630000007]
[null,null,"WEATHER CORRECTED MD 50% POE","MVA","Non-coincident",null,null,null,null,null,null,null,null,null,null,null,85.944296870000002,86.612703449999998,86.630496179999994,85.659793949999994,84.756246709999999,82.923016540000006,83.070185679999994]
[null,null,null,null,"Coincident",null,null,null,null,null,null,null,null,null,null,null,75.889854490000005,75.740449080000005,75.419690410000001,74.738997990000001,74.898664139999994,73.287902579999994,73.427096520000006]
[null,"Blanche","CONNECTION POINT RATING","MVA","Non-coincident",null,null,null,null,null,null,null,null,null,null,null,134.80000000000001,134.80000000000001,134.80000000000001,134.80000000000001,134.80000000000001,134.80000000000001,134.80000000000001]
[null,null,null,null,"Coincident",null,null,null,null,null,null,null,null,null,null,null,134.80000000000001,134.80000000000001,134.80000000000001,134.80000000000001,134.80000000000001,134.80000000000001,134.80000000000001]
[null,null,"WINTER/SUMMER PEAKING",null,"Non-coincident",null,null,null,null,null,null,null,null,null,null,null,"Summer","Summer","Summer","Summer","Summer","Summer","Summer"]
[null,null,null,null,"Coincident",null,null,null,null,null,null,null,null,null,null,null,"Summer","Summer","Summer","Summer","Summer","Summer","Summer"]
[null,null,"ADJUSTMENTS - EMBEDDED GENERATION","MW","Non-coincident",null,null,null,null,null,null,null,null,null,null,null,1.0895091100000001,1.1845026949999999,1.285928918,1.37119875,1.455720602,1.5421872050000001,1.6271578449999999]
[null,null,null,null,"Coincident",null,null,null,null,null,null,null,null,null,null,null,1.0895091100000001,1.1845026949999999,1.285928918,1.37119875,1.455720602,1.5421872050000001,1.6271578449999999]
[null,null,"WEATHER CORRECTED MD 10% POE","MW","Non-coincident",null,null,null,null,null,null,null,null,null,null,null,33.79660062,33.492825930000002,33.30409152,32.16628893,31.129450290000001,30.13602564,29.42717541]
[null,null,null,null,"Coincident",null,null,null,null,null,null,null,null,null,null,null,29.800340980000001,29.251708969999999,29.302882050000001,28.08603965,27.46970924,26.596065970000001,25.97371231]
[null,null,"WEATHER CORRECTED MD 10% POE","MVA","Non-coincident",null,null,null,null,null,null,null,null,null,null,null,35.179074010000001,34.862873200000003,34.666418479999997,33.482073290000002,32.402822049999997,31.368760680000001,30.630914430000001]
[null,null,null,null,"Coincident",null,null,null,null,null,null,null,null,null,null,null,31.0193446,30.44827042,30.50153676,29.234918579999999,28.593376750000001,27.683996499999999,27.036185029999999]
[null,null,"WEATHER CORRECTED MD 50% POE","MW","Non-coincident",null,null,null,null,null,null,null,null,null,null,null,31.959246289999999,31.614778909999998,31.013901860000001,30.06760633,29.15883822,27.95606085,27.443099570000001]
[null,null,null,null,"Coincident",null,null,null,null,null,null,null,null,null,null,null,27.37591286,26.818955169999999,26.19242903,25.44922287,24.996430499999999,23.968375590000001,23.531507999999999]
[null,null,"WEATHER CORRECTED MD 50% POE","MVA","Non-coincident",null,null,null,null,null,null,null,null,null,null,null,33.266561430000003,32.908003370000003,32.282547030000003,31.297542629999999,30.35160072,29.099622910000001,28.565678590000001]
[null,null,null,null,"Coincident",null,null,null,null,null,null,null,null,null,null,null,28.495743560000001,27.91600313,27.263848500000002,26.49024099,26.018926820000001,24.948818620000001,24.494080660000002]
[null,"Brinkworth","CONNECTION POINT RATING","MVA","Non-coincident",null,null,null,null,null,null,null,null,null,null,null,24.6,24.6,24.6,24.6,24.6,24.6,24.6]
[null,null,null,null,"Coincident",null,null,null,null,null,null,null,null,null,null,null,24.6,24.6,24.6,24.6,24.6,24.6,24.6]
[null,null,"WINTER/SUMMER PEAKING",null,"Non-coincident",null,null,null,null,null,null,null,null,null,null,null,"Summer","Summer","Summer","Summer","Summer","Summer","Summer"]
[null,null,null,null,"Coincident",null,null,null,null,null,null,null,null,null,null,null,"Summer","Summer","Summer","Summer","Summer","Summer","Summer"]
[null,null,"ADJUSTMENTS - EMBEDDED GENERATION","MW","Non-coincident",null,null,null,null,null,null,null,null,null,null,null,0.30496944599999998,0.33155953199999999,0.35995020700000002,0.38381847299999999,0.40747736899999998,0.43168062800000001,0.45546514599999999]
[null,null,null,null,"Coincident",null,null,null,null,null,null,null,null,null,null,null,0.30496944599999998,0.33155953199999999,0.35995020700000002,0.38381847299999999,0.40747736899999998,0.43168062800000001,0.45546514599999999]
[null,null,"WEATHER CORRECTED MD 10% POE","MW","Non-coincident",null,null,null,null,null,null,null,null,null,null,null,4.8153059540000003,4.7887668100000003,4.7781407150000001,4.6324834270000004,4.5118731910000003,4.3965880100000003,4.3217663809999998]
[null,null,null,null,"Coincident",null,null,null,null,null,null,null,null,null,null,null,3.3101491030000001,3.2606080589999999,3.2775334869999999,3.1533986449999998,3.103951683,3.0249810080000001,2.9738714480000001]
[null,null,"WEATHER CORRECTED MD 10% POE","MVA","Non-coincident",null,null,null,null,null,null,null,null,null,null,null,4.8419089870000001,4.8152232220000002,4.8045384220000003,4.6580764229999998,4.5367998539999999,4.4208777589999997,4.345642765]
[null,null,null,null,"Coincident",null,null,null,null,null,null,null,null,null,null,null,3.3284366240000001,3.2786218809999998,3.2956408160000001,3.1708201690000002,3.1211000279999999,3.0416930660000001,2.9903011410000002]
[null,null,"WEATHER CORRECTED MD 50% POE","MW","Non-coincident",null,null,null,null,null,null,null,null,null,null,null,4.4030229739999998,4.3752175680000001,4.3126246630000002,4.2120166550000002,4.1162551460000003,3.9777334369999999,3.936167652]
[null,null,null,null,"Coincident",null,null,null,null,null,null,null,null,null,null,null,2.940346345,2.8935221809999998,2.8394647800000001,2.7793369800000001,2.7509678979999999,2.6587270680000001,2.6312713840000002]
[null,null,"WEATHER CORRECTED MD 50% POE","MVA","Non-coincident",null,null,null,null,null,null,null,null,null,null,null,4.4273482749999999,4.3993892529999998,4.3364505419999997,4.2352867070000002,4.1389961450000001,3.9997091490000001,3.957913725]
[null,null,null,null,"Coincident",null,null,null,null,null,null,null,null,null,null,null,2.956590823,2.909507971,2.8551519189999999,2.7946919320000001,2.7661661199999998,2.673415688,2.6458083210000001]
[null,"Clare North","CONNECTION POINT RATING","MVA","Non-coincident",null,null,null,null,null,null,null,null,null,null,null,50,50,50,50,50,50,50]
[null,null,null,null,"Coincident",null,null,null,null,null,null,null,null,null,null,null,50,50,50,50,50,50,50]
[null,null,"WINTER/SUMMER PEAKING",null,"Non-coincident",null,null,null,null,null,null,null,null,null,null,null,"Summer","Summer","Summer","Summer","Summer","Summer","Summer"]
[null,null,null,null,"Coincident",null,null,null,null,null,null,null,null,null,null,null,"Summer","Summer","Summer","Summer","Summer","Summer","Summer"]
[null,null,"ADJUSTMENTS - EMBEDDED GENERATION","MW","Non-coincident",null,null,null,null,null,null,null,null,null,null,null,0.62517043900000002,0.67967864,0.73787794799999995,0.78680656900000001,0.835305992,0.88492133100000003,0.93367827299999995]
[null,null,null,null,"Coincident",null,null,null,null,null,null,null,null,null,null,null,0.62517043900000002,0.67967864,0.73787794799999995,0.78680656900000001,0.835305992,0.88492133100000003,0.93367827299999995]
[null,null,"WEATHER CORRECTED MD 10% POE","MW","Non-coincident",null,null,null,null,null,null,null,null,null,null,null,13.37540551,13.461709170000001,13.59446311,13.335126199999999,13.10770293,12.888861260000001,12.783623370000001]
[null,null,null,null,"Coincident",null,null,null,null,null,null,null,null,null,null,null,12.572906809999999,12.53372555,12.751325489999999,12.41272693,12.33075663,12.12624948,12.028734529999999]
[null,null,"WEATHER CORRECTED MD 10% POE","MVA","Non-coincident",null,null,null,null,null,null,null,null,null,null,null,14.163390639999999,14.25477871,14.39535358,14.12073835,13.8799169,13.648182609999999,13.536744840000001]
[null,null,null,null,"Coincident",null,null,null,null,null,null,null,null,null,null,null,13.313614340000001,13.2721248,13.502544200000001,13.14399779,13.05719837,12.84064309,12.737383250000001]
[null,null,"WEATHER CORRECTED MD 50% POE","MW","Non-coincident",null,null,null,null,null,null,null,null,null,null,null,12.140484349999999,12.19970657,12.157777100000001,11.974790759999999,11.79928866,11.495137659999999,11.46703417]
[null,null,null,null,"Coincident",null,null,null,null,null,null,null,null,null,null,null,11.086350879999999,11.03269508,10.94596537,10.80498401,10.783112360000001,10.50648213,10.482098349999999]
[null,null,"WEATHER CORRECTED MD 50% POE","MVA","Non-coincident",null,null,null,null,null,null,null,null,null,null,null,12.855716579999999,12.91842776,12.8740281,12.68026148,12.49442004,12.17235058,12.14259143]
[null,null,null,null,"Coincident",null,null,null,null,null,null,null,null,null,null,null,11.73948096,11.68266414,11.59082491,11.44153792,11.418377749999999,11.1254504,11.099630100000001]
[null,"Dalrymple","CONNECTION POINT RATING","MVA","Non-coincident",null,null,null,null,null,null,null,null,null,null,null,25,25,25,25,25,25,25]
[null,null,null,null,"Coincident",null,null,null,null,null,null,null,null,null,null,null,25,25,25,25,25,25,25]
[null,null,"WINTER/SUMMER PEAKING",null,"Non-coincident",null,null,null,null,null,null,null,null,null,null,null,"Summer","Summer","Summer","Summer","Summer","Summer","Summer"]
[null,null,null,null,"Coincident",null,null,null,null,null,null,null,null,null,null,null,"Summer","Summer","Summer","Summer","Summer","Summer","Summer"]
[null,null,"ADJUSTMENTS - EMBEDDED GENERATION","MW","Non-coincident",null,null,null,null,null,null,null,null,null,null,null,0.62326413199999997,0.677606123,0.73562796600000002,0.78440739199999998,0.83275892699999998,0.88222297599999999,0.930831246]
[null,null,null,null,"Coincident",null,null,null,null,null,null,null,null,null,null,null,0.62326413199999997,0.677606123,0.73562796600000002,0.78440739199999998,0.83275892699999998,0.88222297599999999,0.930831246]
[null,null,"WEATHER CORRECTED MD 10% POE","MW","Non-coincident",null,null,null,null,null,null,null,null,null,null,null,7.8648414530000004,9.9248367799999997,9.9731397640000008,9.7335128389999994,9.5181192570000004,9.3106228980000001,9.1869514799999994]
[null,null,null,null,"Coincident",null,null,null,null,null,null,null,null,null,null,null,5.8719650290000001,7.3395274559999999,7.4300190199999996,7.196219911,7.1117916900000004,6.9575355869999997,6.8659738529999998]
[null,null,"WEATHER CORRECTED MD 10% POE","MVA","Non-coincident",null,null,null,null,null,null,null,null,null,null,null,8.6172076230000005,10.87426615,10.927189889999999,10.66463978,10.42864123,10.20129536,10.06579329]
[null,null,null,null,"Coincident",null,null,null,null,null,null,null,null,null,null,null,6.433688729,8.0416410579999997,8.1407892230000005,7.8846244319999998,7.7921196420000003,7.6231070970000001,7.5227863880000001]
[null,null,"WEATHER CORRECTED MD 50% POE","MW","Non-coincident",null,null,null,null,null,null,null,null,null,null,null,6.9689319779999996,9.0156927459999991,8.9422570369999992,8.7648829979999991,8.5931835840000002,8.3293140660000002,8.2670101569999996]
[null,null,null,null,"Coincident",null,null,null,null,null,null,null,null,null,null,null,5.0545626190000004,6.4758395880000004,6.3945765559999996,6.281553561,6.2374509580000002,6.0466821069999996,6.0021983629999998]
[null,null,"WEATHER CORRECTED MD 50% POE","MVA","Non-coincident",null,null,null,null,null,null,null,null,null,null,null,7.6355936890000002,9.8781516089999997,9.7976908960000006,9.6033489079999992,9.4152243910000006,9.1261125980000006,9.0578485749999995]
[null,null,null,null,"Coincident",null,null,null,null,null,null,null,null,null,null,null,5.5380919999999998,7.0953311130000003,7.0062943000000004,6.8824593030000001,6.8341377589999999,6.6251195850000002,6.5763804390000002]
[null,null,"CONNECTION POINT RATING","MVA","Non-coincident"]
[null,null,null,null,"Coincident"]
[null,null,"WINTER/SUMMER PEAKING",null,"Non-coincident"]
[null,null,null,null,"Coincident"]
[null,null,"ADJUSTMENTS - EMBEDDED GENERATION","MW","Non-coincident"]
[null,null,null,null,"Coincident"]
[null,null,"WEATHER CORRECTED MD 10% POE","MW","Non-coincident"]
[null,null,null,null,"Coincident"]
[null,null,"WEATHER CORRECTED MD 10% POE","MVA","Non-coincident"]
[null,null,null,null,"Coincident"]
[null,null,"WEATHER CORRECTED MD 50% POE","MW","Non-coincident"]
[null,null,null,null,"Coincident"]
[null,null,"WEATHER CORRECTED MD 50% POE","MVA","Non-coincident"]
[null,null,null,null,"Coincident"]
[null,"Dorrien","CONNECTION POINT RATING","MVA","Non-coincident",null,null,null,null,null,null,null,null,null,null,null,216,216,216,216,216,216,216]
[null,null,null,null,"Coincident",null,null,null,null,null,null,null,null,null,null,null,216,216,216,216,216,216,216]
[null,null,"WINTER/SUMMER PEAKING",null,"Non-coincident",null,null,null,null,null,null,null,null,null,null,null,"Summer","Summer","Summer","Summer","Summer","Summer","Summer"]
[null,null,null,null,"Coincident",null,null,null,null,null,null,null,null,null,null,null,"Summer","Summer","Summer","Summer","Summer","Summer","Summer"]
[null,null,"ADJUSTMENTS - EMBEDDED GENERATION","MW","Non-coincident",null,null,null,null,null,null,null,null,null,null,null,2.4074391030000002,2.617342141,2.841459086,3.029875987,3.216640108,3.4077014569999999,3.5954572460000001]
[null,null,null,null,"Coincident",null,null,null,null,null,null,null,null,null,null,null,27.407439100000001,27.617342140000002,27.841459090000001,28.029875990000001,28.21664011,28.407701459999998,28.595457249999999]
[null,null,"WEATHER CORRECTED MD 10% POE","MW","Non-coincident",null,null,null,null,null,null,null,null,null,null,null,61.039577690000002,60.61640611,60.408548750000001,58.484373669999997,56.745362890000003,55.08240679,53.934665389999999]
[null,null,null,null,"Coincident",null,null,null,null,null,null,null,null,null,null,null,51.9243326,51.07411201,51.27696796,49.265237210000002,48.308569509999998,46.89812955,45.92663495]
[null,null,"WEATHER CORRECTED MD 10% POE","MVA","Non-coincident",null,null,null,null,null,null,null,null,null,null,null,64.362001829999997,63.915796729999997,63.696625560000001,61.667716370000001,59.834050099999999,58.080578209999999,56.870364500000001]
[null,null,null,null,"Coincident",null,null,null,null,null,null,null,null,null,null,null,54.750607979999998,53.85410933,54.068006859999997,51.946776290000003,50.93803655,49.45082541,48.426451729999997]
[null,null,"WEATHER CORRECTED MD 50% POE","MW","Non-coincident",null,null,null,null,null,null,null,null,null,null,null,56.551364720000002,56.100889039999998,55.200008830000002,53.686991829999997,52.2419899,50.264644029999999,49.521202889999998]
[null,null,null,null,"Coincident",null,null,null,null,null,null,null,null,null,null,null,46.733290429999997,45.912679369999999,44.974847939999997,43.838524569999997,43.205464569999997,41.575398900000003,40.965567229999998]
[null,null,"WEATHER CORRECTED MD 50% POE","MVA","Non-coincident",null,null,null,null,null,null,null,null,null,null,null,59.629492489999997,59.154497120000002,58.204581410000003,56.609209909999997,55.085555579999998,53.000581480000001,52.216674349999998]
[null,null,null,null,"Coincident",null,null,null,null,null,null,null,null,null,null,null,49.27701399,48.411736529999999,47.422858329999997,46.22468413,45.557166260000002,43.838375050000003,43.195349839999999]
[null,"Eastern Suburbs","CONNECTION POINT RATING","MVA","Non-coincident",null,null,null,null,null,null,null,null,null,null,null,1675,1675,1675,1675,1675,1675,1675]
[null,null,null,null,"Coincident",null,null,null,null,null,null,null,null,null,null,null,1675,1675,1675,1675,1675,1675,1675]
[null,null,"WINTER/SUMMER PEAKING",null,"Non-coincident",null,null,null,null,null,null,null,null,null,null,null,"Summer","Summer","Summer","Summer","Summer","Summer","Summer"]
[null,null,null,null,"Coincident",null,null,null,null,null,null,null,null,null,null,null,"Summer","Summer","Summer","Summer","Summer","Summer","Summer"]
[null,null,"ADJUSTMENTS - EMBEDDED GENERATION","MW","Non-coincident",null,null,null,null,null,null,null,null,null,null,null,22.4314994,24.387287140000002,26.475514050000001,28.231103040000001,29.971292139999999,31.751520979999999,33.500950009999997]
[null,null,null,null,"Coincident",null,null,null,null,null,null,null,null,null,null,null,22.4314994,24.387287140000002,26.475514050000001,28.231103040000001,29.971292139999999,31.751520979999999,33.500950009999997]
[null,null,"WEATHER CORRECTED MD 10% POE","MW","Non-coincident",null,null,null,null,null,null,null,null,null,null,null,722.05408279999995,716.54351240000005,713.25811940000006,689.35330929999998,667.30597209999996,646.04794760000004,630.8522395]
[null,null,null,null,"Coincident",null,null,null,null,null,null,null,null,null,null,null,685.80288710000002,674.09854099999995,675.9908805,648.35487109999997,634.2916434,614.15436539999996,599.7834312]
[null,null,"WEATHER CORRECTED MD 10% POE","MVA","Non-coincident",null,null,null,null,null,null,null,null,null,null,null,739.32450370000004,733.68212889999995,730.31815440000003,705.84157809999999,683.26690259999998,661.5004189,645.94125280000003]
[null,null,null,null,"Coincident",null,null,null,null,null,null,null,null,null,null,null,702.20623520000004,690.22193919999995,692.15954060000001,663.86252049999996,649.46292200000005,628.84399140000005,614.12932660000001]
[null,null,"WEATHER CORRECTED MD 50% POE","MW","Non-coincident",null,null,null,null,null,null,null,null,null,null,null,660.30146070000001,655.12832700000001,644.37436090000006,626.10535649999997,608.26592889999995,584.0989965,574.26781410000001]
[null,null,null,null,"Coincident",null,null,null,null,null,null,null,null,null,null,null,609.25023659999999,598.63134160000004,586.19078449999995,570.82693329999995,561.67182300000002,539.4242319,530.41090159999999]
[null,null,"WEATHER CORRECTED MD 50% POE","MVA","Non-coincident",null,null,null,null,null,null,null,null,null,null,null,676.09485400000005,670.79798700000003,659.78680259999999,641.08083180000006,622.81471250000004,598.06974430000002,588.00341519999995]
[null,null,null,null,"Coincident",null,null,null,null,null,null,null,null,null,null,null,623.82256329999996,612.94968080000001,600.21156470000005,584.48023379999995,575.10614740000005,552.32642820000001,543.09751300000005]
[null,"Hummocks","CONNECTION POINT RATING","MVA","Non-coincident",null,null,null,null,null,null,null,null,null,null,null,50,50,50,50,50,50,50]
[null,null,null,null,"Coincident",null,null,null,null,null,null,null,null,null,null,null,50,50,50,50,50,50,50]
[null,null,"WINTER/SUMMER PEAKING",null,"Non-coincident",null,null,null,null,null,null,null,null,null,null,null,"Summer","Summer","Summer","Summer","Summer","Summer","Summer"]
[null,null,null,null,"Coincident",null,null,null,null,null,null,null,null,null,null,null,"Summer","Summer","Summer","Summer","Summer","Summer","Summer"]
[null,null,"ADJUSTMENTS - EMBEDDED GENERATION","MW","Non-coincident",null,null,null,null,null,null,null,null,null,null,null,0.53560585599999999,0.582304979,0.63216640599999996,0.67408530499999997,0.71563649299999998,0.75814372699999999,0.79991554200000003]
[null,null,null,null,"Coincident",null,null,null,null,null,null,null,null,null,null,null,0.53560585599999999,0.582304979,0.63216640599999996,0.67408530499999997,0.71563649299999998,0.75814372699999999,0.79991554200000003]
[null,null,"WEATHER CORRECTED MD 10% POE","MW","Non-coincident",null,null,null,null,null,null,null,null,null,null,null,14.668468000000001,14.80479338,14.992881929999999,14.748358059999999,14.53791169,14.335402569999999,14.257737179999999]
[null,null,null,null,"Coincident",null,null,null,null,null,null,null,null,null,null,null,13.146375320000001,13.142405350000001,13.40821367,13.08899418,13.03940255,12.85921252,12.79113576]
[null,null,"WEATHER CORRECTED MD 10% POE","MVA","Non-coincident",null,null,null,null,null,null,null,null,null,null,null,16.092635099999999,16.242196379999999,16.44854651,16.180281730000001,15.94940304,15.72723223,15.64202628]
[null,null,null,null,"Coincident",null,null,null,null,null,null,null,null,null,null,null,14.422761879999999,14.41840646,14.71002221,14.35980958,14.305403070000001,14.107718330000001,14.03303197]
[null,null,"WEATHER CORRECTED MD 50% POE","MW","Non-coincident",null,null,null,null,null,null,null,null,null,null,null,13.83506135,13.989524039999999,14.027733,13.90152335,13.78157062,13.50748836,13.554570610000001]
[null,null,null,null,"Coincident",null,null,null,null,null,null,null,null,null,null,null,12.04553866,12.06223263,12.041481259999999,11.959447559999999,12.00824527,11.77091658,11.813413840000001]
[null,null,"WEATHER CORRECTED MD 50% POE","MVA","Non-coincident",null,null,null,null,null,null,null,null,null,null,null,15.17831269,15.34777222,15.3896909,15.25122751,15.11962853,14.81893552,14.870589000000001]
[null,null,null,null,"Coincident",null,null,null,null,null,null,null,null,null,null,null,13.21504457,13.23335936,13.210593230000001,13.120594840000001,13.17413035,12.91375933,12.96038266]
[null,"Kadina East","CONNECTION POINT RATING","MVA","Non-coincident",null,null,null,null,null,null,null,null,null,null,null,120,120,120,120,120,120,120]
[null,null,null,null,"Coincident",null,null,null,null,null,null,null,null,null,null,null,120,120,120,120,120,120,120]
[null,null,"WINTER/SUMMER PEAKING",null,"Non-coincident",null,null,null,null,null,null,null,null,null,null,null,"Summer","Summer","Summer","Summer","Summer","Summer","Summer"]
[null,null,null,null,"Coincident",null,null,null,null,null,null,null,null,null,null,null,"Summer","Summer","Summer","Summer","Summer","Summer","Summer"]
[null,null,"ADJUSTMENTS - EMBEDDED GENERATION","MW","Non-coincident",null,null,null,null,null,null,null,null,null,null,null,1.749904629,1.902477668,2.0653824240000001,2.2023377499999999,2.3380917129999998,2.4769692189999999,2.6134439999999999]
[null,null,null,null,"Coincident",null,null,null,null,null,null,null,null,null,null,null,1.749904629,1.902477668,2.0653824240000001,2.2023377499999999,2.3380917129999998,2.4769692189999999,2.6134439999999999]
[null,null,"WEATHER CORRECTED MD 10% POE","MW","Non-coincident",null,null,null,null,null,null,null,null,null,null,null,27.461903159999999,27.530594619999999,27.690582299999999,27.050195550000002,26.475599070000001,25.954604410000002,25.707451379999998]
[null,null,null,null,"Coincident",null,null,null,null,null,null,null,null,null,null,null,24.06941905,23.900214909999999,24.217627629999999,23.477222609999998,23.222831419999999,22.768404660000002,22.554397699999999]
[null,null,"WEATHER CORRECTED MD 10% POE","MVA","Non-coincident",null,null,null,null,null,null,null,null,null,null,null,28.738045230000001,28.809928750000001,28.977350990000001,28.307205750000001,27.705908040000001,27.160702990000001,26.902064880000001]
[null,null,null,null,"Coincident",null,null,null,null,null,null,null,null,null,null,null,25.187913940000001,25.010846959999999,25.3430097,24.5681984,24.301985760000001,23.826442010000001,23.602490240000002]
[null,null,"WEATHER CORRECTED MD 50% POE","MW","Non-coincident",null,null,null,null,null,null,null,null,null,null,null,24.698232770000001,24.780880629999999,24.654600250000001,24.238899140000001,23.879579400000001,23.289013950000001,23.257211380000001]
[null,null,null,null,"Coincident",null,null,null,null,null,null,null,null,null,null,null,21.029295489999999,20.895617210000001,20.696842539999999,20.392727879999999,20.347975940000001,19.847256770000001,19.822617520000001]
[null,null,"WEATHER CORRECTED MD 50% POE","MVA","Non-coincident",null,null,null,null,null,null,null,null,null,null,null,25.84594834,25.932436809999999,25.80028824,25.365269690000002,24.989252530000002,24.37124377,24.337963349999999]
[null,null,null,null,"Coincident",null,null,null,null,null,null,null,null,null,null,null,22.00651723,21.866626979999999,21.658615340000001,21.340368609999999,21.293537069999999,20.76954971,20.74376548]
[null,null,"CONNECTION POINT RATING","MVA","Non-coincident"]
[null,null,null,null,"Coincident"]
[null,null,"WINTER/SUMMER PEAKING",null,"Non-coincident"]
[null,null,null,null,"Coincident"]
[null,null,"ADJUSTMENTS - EMBEDDED GENERATION","MW","Non-coincident"]
[null,null,null,null,"Coincident"]
[null,null,"WEATHER CORRECTED MD 10% POE","MW","Non-coincident"]
[null,null,null,null,"Coincident"]
[null,null,"WEATHER CORRECTED MD 10% POE","MVA","Non-coincident"]
[null,null,null,null,"Coincident"]
[null,null,"WEATHER CORRECTED MD 50% POE","MW","Non-coincident"]
[null,null,null,null,"Coincident"]
[null,null,"WEATHER CORRECTED MD 50% POE","MVA","Non-coincident"]
[null,null,null,null,"Coincident"]
[null,"Keith","CONNECTION POINT RATING","MVA","Non-coincident",null,null,null,null,null,null,null,null,null,null,null,67.099999999999994,67.099999999999994,67.099999999999994,67.099999999999994,67.099999999999994,67.099999999999994,67.099999999999994]
[null,null,null,null,"Coincident",null,null,null,null,null,null,null,null,null,null,null,67.099999999999994,67.099999999999994,67.099999999999994,67.099999999999994,67.099999999999994,67.099999999999994,67.099999999999994]
[null,null,"WINTER/SUMMER PEAKING",null,"Non-coincident",null,null,null,null,null,null,null,null,null,null,null,"Summer","Summer","Summer","Summer","Summer","Summer","Summer"]
[null,null,null,null,"Coincident",null,null,null,null,null,null,null,null,null,null,null,"Summer","Summer","Summer","Summer","Summer","Summer","Summer"]
[null,null,"ADJUSTMENTS - EMBEDDED GENERATION","MW","Non-coincident",null,null,null,null,null,null,null,null,null,null,null,0.74282767500000002,0.80759433400000002,0.87674676600000001,0.93488376699999998,0.99251079399999997,1.0514637520000001,1.1093967629999999]
[null,null,null,null,"Coincident",null,null,null,null,null,null,null,null,null,null,null,0.74282767500000002,0.80759433400000002,0.87674676600000001,0.93488376699999998,0.99251079399999997,1.0514637520000001,1.1093967629999999]
[null,null,"WEATHER CORRECTED MD 10% POE","MW","Non-coincident",null,null,null,null,null,null,null,null,null,null,null,24.763889129999999,24.624784340000001,24.577474219999999,23.83604746,23.173212370000002,22.541642270000001,22.119652500000001]
[null,null,null,null,"Coincident",null,null,null,null,null,null,null,null,null,null,null,22.28412368,21.948274479999998,22.068788380000001,21.23989096,20.868793799999999,20.30231088,19.924720740000001]
[null,null,"WEATHER CORRECTED MD 10% POE","MVA","Non-coincident",null,null,null,null,null,null,null,null,null,null,null,25.202810499999998,25.061240179999999,25.01309152,24.258523530000002,23.58394019,22.941175980000001,22.511706759999999]
[null,null,null,null,"Coincident",null,null,null,null,null,null,null,null,null,null,null,22.67909306,22.337291189999998,22.459941109999999,21.6163521,21.23867753,20.66215412,20.277871480000002]
[null,null,"WEATHER CORRECTED MD 50% POE","MW","Non-coincident",null,null,null,null,null,null,null,null,null,null,null,22.198300400000001,22.036792070000001,21.702291120000002,21.131373270000001,20.591246819999999,19.84212582,19.57948167]
[null,null,null,null,"Coincident",null,null,null,null,null,null,null,null,null,null,null,19.405297300000001,19.077812430000002,18.704816319999999,18.252900499999999,18.01436339,17.36118317,17.133507699999999]
[null,null,"WEATHER CORRECTED MD 50% POE","MVA","Non-coincident",null,null,null,null,null,null,null,null,null,null,null,22.591748630000001,22.42737769,22.08694796,21.505911019999999,20.956211239999998,20.19381263,19.926513310000001]
[null,null,null,null,"Coincident",null,null,null,null,null,null,null,null,null,null,null,19.749241649999998,19.415952350000001,19.036345170000001,18.576419479999998,18.33365448,17.66889712,17.437186279999999]
[null,"Kincraig","CONNECTION POINT RATING","MVA","Non-coincident",null,null,null,null,null,null,null,null,null,null,null,56.1,56.1,56.1,56.1,56.1,56.1,56.1]
[null,null,null,null,"Coincident",null,null,null,null,null,null,null,null,null,null,null,56.1,56.1,56.1,56.1,56.1,56.1,56.1]
[null,null,"WINTER/SUMMER PEAKING",null,"Non-coincident",null,null,null,null,null,null,null,null,null,null,null,"Summer","Summer","Summer","Summer","Summer","Summer","Summer"]
[null,null,null,null,"Coincident",null,null,null,null,null,null,null,null,null,null,null,"Summer","Summer","Summer","Summer","Summer","Summer","Summer"]
[null,null,"ADJUSTMENTS - EMBEDDED GENERATION","MW","Non-coincident",null,null,null,null,null,null,null,null,null,null,null,1.0042629919999999,1.091824025,1.185314387,1.263912479,1.341821114,1.4215223379999999,1.499844647]
[null,null,null,null,"Coincident",null,null,null,null,null,null,null,null,null,null,null,1.0042629919999999,1.091824025,1.185314387,1.263912479,1.341821114,1.4215223379999999,1.499844647]
[null,null,"WEATHER CORRECTED MD 10% POE","MW","Non-coincident",null,null,null,null,null,null,null,null,null,null,null,22.17866441,21.769184330000002,21.437450649999999,20.503237420000001,19.646984459999999,18.857556290000002,18.26815603]
[null,null,null,null,"Coincident",null,null,null,null,null,null,null,null,null,null,null,19.18408148,18.65086659,18.503048639999999,17.561814829999999,17.00732142,16.325791460000001,15.81748996]
[null,null,"WEATHER CORRECTED MD 10% POE","MVA","Non-coincident",null,null,null,null,null,null,null,null,null,null,null,23.85069502,23.410344590000001,23.053601789999998,22.048959020000002,21.128153879999999,20.27921139,19.64537675]
[null,null,null,null,"Coincident",null,null,null,null,null,null,null,null,null,null,null,20.630353039999999,20.056939530000001,19.897977709999999,18.885785089999999,18.289488890000001,17.55657897,17.009957050000001]
[null,null,"WEATHER CORRECTED MD 50% POE","MW","Non-coincident",null,null,null,null,null,null,null,null,null,null,null,20.213072889999999,19.88045314,19.390369190000001,18.69053302,18.03905421,17.235390679999998,16.860373840000001]
[null,null,null,null,"Coincident",null,null,null,null,null,null,null,null,null,null,null,16.984854479999999,16.54380458,16.064338719999999,15.518679479999999,15.16976839,14.49576579,14.18212162]
[null,null,"WEATHER CORRECTED MD 50% POE","MVA","Non-coincident",null,null,null,null,null,null,null,null,null,null,null,21.736919230000002,21.379223570000001,20.852192609999999,20.099596380000001,19.399003130000001,18.534752090000001,18.131463060000002]
[null,null,null,null,"Coincident",null,null,null,null,null,null,null,null,null,null,null,18.265328190000002,17.791027920000001,17.275415519999999,16.688619509999999,16.313404299999998,15.58858923,15.251299680000001]
[null,null,"CONNECTION POINT RATING","MVA","Non-coincident"]
[null,null,null,null,"Coincident"]
[null,null,"WINTER/SUMMER PEAKING",null,"Non-coincident"]
[null,null,null,null,"Coincident"]
[null,null,"ADJUSTMENTS - EMBEDDED GENERATION","MW","Non-coincident"]
[null,null,null,null,"Coincident"]
[null,null,"WEATHER CORRECTED MD 10% POE","MW","Non-coincident"]
[null,null,null,null,"Coincident"]
[null,null,"WEATHER CORRECTED MD 10% POE","MVA","Non-coincident"]
[null,null,null,null,"Coincident"]
[null,null,"WEATHER CORRECTED MD 50% POE","MW","Non-coincident"]
[null,null,null,null,"Coincident"]
[null,null,"WEATHER CORRECTED MD 50% POE","MVA","Non-coincident"]
[null,null,null,null,"Coincident"]
[null,"Leigh Creek South","CONNECTION POINT RATING","MVA","Non-coincident",null,null,null,null,null,null,null,null,null,null,null,10,10,10,10,10,10,10]
[null,null,null,null,"Coincident",null,null,null,null,null,null,null,null,null,null,null,10,10,10,10,10,10,10]
[null,null,"WINTER/SUMMER PEAKING",null,"Non-coincident",null,null,null,null,null,null,null,null,null,null,null,"Summer","Summer","Summer","Summer","Summer","Summer","Summer"]
[null,null,null,null,"Coincident",null,null,null,null,null,null,null,null,null,null,null,"Summer","Summer","Summer","Summer","Summer","Summer","Summer"]
[null,null,"ADJUSTMENTS - EMBEDDED GENERATION","MW","Non-coincident",null,null,null,null,null,null,null,null,null,null,null,6.0073425999999999E-2,6.5311189000000006E-2,7.0903635000000007E-2,7.5605248999999999E-2,8.0265619999999996E-2,8.5033222000000006E-2,8.9718337999999995E-2]
[null,null,null,null,"Coincident",null,null,null,null,null,null,null,null,null,null,null,6.0073425999999999E-2,6.5311189000000006E-2,7.0903635000000007E-2,7.5605248999999999E-2,8.0265619999999996E-2,8.5033222000000006E-2,8.9718337999999995E-2]
[null,null,"WEATHER CORRECTED MD 10% POE","MW","Non-coincident",null,null,null,null,null,null,null,null,null,null,null,0.98374899400000004,0.40625657700000001,0.39850912700000002,0.37973079199999998,0.36260262900000001,0.34631184100000001,0.33351000600000003]
[null,null,null,null,"Coincident",null,null,null,null,null,null,null,null,null,null,null,0.75811705299999999,0.31010131499999999,0.306446573,0.28978046899999998,0.27965160100000003,0.26711760800000001,0.25727528500000002]
[null,null,"WEATHER CORRECTED MD 10% POE","MVA","Non-coincident",null,null,null,null,null,null,null,null,null,null,null,1.0787767079999999,0.445499955,0.43700412100000002,0.416411845,0.39762914399999999,0.37976470699999998,0.36572624599999998]
[null,null,null,null,"Coincident",null,null,null,null,null,null,null,null,null,null,null,0.83134928100000005,0.34005633200000002,0.336048552,0.31777254399999999,0.306665252,0.292920507,0.28212743899999998]
[null,null,"WEATHER CORRECTED MD 50% POE","MW","Non-coincident",null,null,null,null,null,null,null,null,null,null,null,0.89142733299999999,0.316670379,0.30536901300000002,0.29098828599999998,0.27734134300000002,0.261228766,0.25177840499999998]
[null,null,null,null,"Coincident",null,null,null,null,null,null,null,null,null,null,null,0.66736246700000001,0.234780973,0.225396975,0.21525583200000001,0.20779071900000001,0.19574351100000001,0.18868562999999999]
[null,null,"WEATHER CORRECTED MD 50% POE","MVA","Non-coincident",null,null,null,null,null,null,null,null,null,null,null,0.97753700200000004,0.34725995199999998,0.33486690200000002,0.31909703299999997,0.30413182900000002,0.28646281699999998,0.27609957400000001]
[null,null,null,null,"Coincident",null,null,null,null,null,null,null,null,null,null,null,0.73182802700000005,0.25746023200000001,0.24716976399999999,0.236049012,0.22786278700000001,0.21465184900000001,0.20691219399999999]
[null,"Mannum","CONNECTION POINT RATING","MVA","Non-coincident",null,null,null,null,null,null,null,null,null,null,null,40,40,40,40,40,40,40]
[null,null,null,null,"Coincident",null,null,null,null,null,null,null,null,null,null,null,40,40,40,40,40,40,40]
[null,null,"WINTER/SUMMER PEAKING",null,"Non-coincident",null,null,null,null,null,null,null,null,null,null,null,"Summer","Summer","Summer","Summer","Summer","Summer","Summer"]
[null,null,null,null,"Coincident",null,null,null,null,null,null,null,null,null,null,null,"Summer","Summer","Summer","Summer","Summer","Summer","Summer"]
[null,null,"ADJUSTMENTS - EMBEDDED GENERATION","MW","Non-coincident",null,null,null,null,null,null,null,null,null,null,null,0.76925102999999995,0.83632152299999996,0.90793379799999996,0.96813880799999996,1.027815704,1.088865696,1.1488594599999999]
[null,null,null,null,"Coincident",null,null,null,null,null,null,null,null,null,null,null,0.76925102999999995,0.83632152299999996,0.90793379799999996,0.96813880799999996,1.027815704,1.088865696,1.1488594599999999]
[null,null,"WEATHER CORRECTED MD 10% POE","MW","Non-coincident",null,null,null,null,null,null,null,null,null,null,null,14.665536250000001,14.90144943,15.211406090000001,15.076058659999999,14.960058119999999,14.841027779999999,14.84519877]
[null,null,null,null,"Coincident",null,null,null,null,null,null,null,null,null,null,null,11.29372248,11.36629478,11.688884209999999,11.49657071,11.529403589999999,11.43895504,11.443593310000001]
[null,null,"WEATHER CORRECTED MD 10% POE","MVA","Non-coincident",null,null,null,null,null,null,null,null,null,null,null,15.45340229,15.70198926,16.0285975,15.885978890000001,15.76374655,15.638321619999999,15.642716679999999]
[null,null,null,null,"Coincident",null,null,null,null,null,null,null,null,null,null,null,11.900447,11.97691805,12.316837720000001,12.1141927,12.148789430000001,12.05348178,12.05836923]
[null,null,"WEATHER CORRECTED MD 50% POE","MW","Non-coincident",null,null,null,null,null,null,null,null,null,null,null,13.30894831,13.55705758,13.68325179,13.63771946,13.594126190000001,13.39073494,13.492625390000001]
[null,null,null,null,"Coincident",null,null,null,null,null,null,null,null,null,null,null,9.9565016459999995,10.0440322,10.092520410000001,10.081110430000001,10.17770894,10.02669925,10.104248330000001]
[null,null,"WEATHER CORRECTED MD 50% POE","MVA","Non-coincident",null,null,null,null,null,null,null,null,null,null,null,14.02393535,14.28537362,14.41834727,14.37036883,14.324433640000001,14.110115739999999,14.21747998]
[null,null,null,null,"Coincident",null,null,null,null,null,null,null,null,null,null,null,10.49138761,10.5836205,10.634713619999999,10.62269066,10.724478660000001,10.565356380000001,10.647071589999999]
[null,null,"CONNECTION POINT RATING","MVA","Non-coincident"]
[null,null,null,null,"Coincident"]
[null,null,"WINTER/SUMMER PEAKING",null,"Non-coincident"]
[null,null,null,null,"Coincident"]
[null,null,"ADJUSTMENTS - EMBEDDED GENERATION","MW","Non-coincident"]
[null,null,null,null,"Coincident"]
[null,null,"WEATHER CORRECTED MD 10% POE","MW","Non-coincident"]
[null,null,null,null,"Coincident"]
[null,null,"WEATHER CORRECTED MD 10% POE","MVA","Non-coincident"]
[null,null,null,null,"Coincident"]
[null,null,"WEATHER CORRECTED MD 50% POE","MW","Non-coincident"]
[null,null,null,null,"Coincident"]
[null,null,"WEATHER CORRECTED MD 50% POE","MVA","Non-coincident"]
[null,null,null,null,"Coincident"]
[null,null,"CONNECTION POINT RATING","MVA","Non-coincident"]
[null,null,null,null,"Coincident"]
[null,null,"WINTER/SUMMER PEAKING",null,"Non-coincident"]
[null,null,null,null,"Coincident"]
[null,null,"ADJUSTMENTS - EMBEDDED GENERATION","MW","Non-coincident"]
[null,null,null,null,"Coincident"]
[null,null,"WEATHER CORRECTED MD 10% POE","MW","Non-coincident"]
[null,null,null,null,"Coincident"]
[null,null,"WEATHER CORRECTED MD 10% POE","MVA","Non-coincident"]
[null,null,null,null,"Coincident"]
[null,null,"WEATHER CORRECTED MD 50% POE","MW","Non-coincident"]
[null,null,null,null,"Coincident"]
[null,null,"WEATHER CORRECTED MD 50% POE","MVA","Non-coincident"]
[null,null,null,null,"Coincident"]
[null,null,"CONNECTION POINT RATING","MVA","Non-coincident"]
[null,null,null,null,"Coincident"]
[null,null,"WINTER/SUMMER PEAKING",null,"Non-coincident"]
[null,null,null,null,"Coincident"]
[null,null,"ADJUSTMENTS - EMBEDDED GENERATION","MW","Non-coincident"]
[null,null,null,null,"Coincident"]
[null,null,"WEATHER CORRECTED MD 10% POE","MW","Non-coincident"]
[null,null,null,null,"Coincident"]
[null,null,"WEATHER CORRECTED MD 10% POE","MVA","Non-coincident"]
[null,null,null,null,"Coincident"]
[null,null,"WEATHER CORRECTED MD 50% POE","MW","Non-coincident"]
[null,null,null,null,"Coincident"]
[null,null,"WEATHER CORRECTED MD 50% POE","MVA","Non-coincident"]
[null,null,null,null,"Coincident"]
[null,null,"CONNECTION POINT RATING","MVA","Non-coincident"]
[null,null,null,null,"Coincident"]
[null,null,"WINTER/SUMMER PEAKING",null,"Non-coincident"]
[null,null,null,null,"Coincident"]
[null,null,"ADJUSTMENTS - EMBEDDED GENERATION","MW","Non-coincident"]
[null,null,null,null,"Coincident"]
[null,null,"WEATHER CORRECTED MD 10% POE","MW","Non-coincident"]
[null,null,null,null,"Coincident"]
[null,null,"WEATHER CORRECTED MD 10% POE","MVA","Non-coincident"]
[null,null,null,null,"Coincident"]
[null,null,"WEATHER CORRECTED MD 50% POE","MW","Non-coincident"]
[null,null,null,null,"Coincident"]
[null,null,"WEATHER CORRECTED MD 50% POE","MVA","Non-coincident"]
[null,null,null,null,"Coincident"]
[null,null,"CONNECTION POINT RATING","MVA","Non-coincident"]
[null,null,null,null,"Coincident"]
[null,null,"WINTER/SUMMER PEAKING",null,"Non-coincident"]
[null,null,null,null,"Coincident"]
[null,null,"ADJUSTMENTS - EMBEDDED GENERATION","MW","Non-coincident"]
[null,null,null,null,"Coincident"]
[null,null,"WEATHER CORRECTED MD 10% POE","MW","Non-coincident"]
[null,null,null,null,"Coincident"]
[null,null,"WEATHER CORRECTED MD 10% POE","MVA","Non-coincident"]
[null,null,null,null,"Coincident"]
[null,null,"WEATHER CORRECTED MD 50% POE","MW","Non-coincident"]
[null,null,null,null,"Coincident"]
[null,null,"WEATHER CORRECTED MD 50% POE","MVA","Non-coincident"]
[null,null,null,null,"Coincident"]
[null,null,"CONNECTION POINT RATING","MVA","Non-coincident"]
[null,null,null,null,"Coincident"]
[null,null,"WINTER/SUMMER PEAKING",null,"Non-coincident"]
[null,null,null,null,"Coincident"]
[null,null,"ADJUSTMENTS - EMBEDDED GENERATION","MW","Non-coincident"]
[null,null,null,null,"Coincident"]
[null,null,"WEATHER CORRECTED MD 10% POE","MW","Non-coincident"]
[null,null,null,null,"Coincident"]
[null,null,"WEATHER CORRECTED MD 10% POE","MVA","Non-coincident"]
[null,null,null,null,"Coincident"]
[null,null,"WEATHER CORRECTED MD 50% POE","MW","Non-coincident"]
[null,null,null,null,"Coincident"]
[null,null,"WEATHER CORRECTED MD 50% POE","MVA","Non-coincident"]
[null,null,null,null,"Coincident"]
[null,"Mobilong","CONNECTION POINT RATING","MVA","Non-coincident",null,null,null,null,null,null,null,null,null,null,null,151.19999999999999,151.19999999999999,151.19999999999999,151.19999999999999,151.19999999999999,151.19999999999999,151.19999999999999]
[null,null,null,null,"Coincident",null,null,null,null,null,null,null,null,null,null,null,151.19999999999999,151.19999999999999,151.19999999999999,151.19999999999999,151.19999999999999,151.19999999999999,151.19999999999999]
[null,null,"WINTER/SUMMER PEAKING",null,"Non-coincident",null,null,null,null,null,null,null,null,null,null,null,"Summer","Summer","Summer","Summer","Summer","Summer","Summer"]
[null,null,null,null,"Coincident",null,null,null,null,null,null,null,null,null,null,null,"Summer","Summer","Summer","Summer","Summer","Summer","Summer"]
[null,null,"ADJUSTMENTS - EMBEDDED GENERATION","MW","Non-coincident",null,null,null,null,null,null,null,null,null,null,null,1.7554316750000001,1.908486613,2.071905901,2.209293798,2.3454765380000002,2.484792686,2.6216985209999999]
[null,null,null,null,"Coincident",null,null,null,null,null,null,null,null,null,null,null,1.7554316750000001,1.908486613,2.071905901,2.209293798,2.3454765380000002,2.484792686,2.6216985209999999]
[null,null,"WEATHER CORRECTED MD 10% POE","MW","Non-coincident",null,null,null,null,null,null,null,null,null,null,null,41.045600499999999,41.432502900000003,41.976740149999998,41.316887280000003,40.756793629999997,40.265040949999999,40.256667210000003]
[null,null,null,null,"Coincident",null,null,null,null,null,null,null,null,null,null,null,37.237392460000002,37.231030359999998,38.000200579999998,37.117744309999999,37.003862259999998,36.561499920000003,36.558443740000001]
[null,null,"WEATHER CORRECTED MD 10% POE","MVA","Non-coincident",null,null,null,null,null,null,null,null,null,null,null,43.76321111,44.175730139999999,44.756001099999999,44.052459669999998,43.455282480000001,42.930971059999997,42.922042910000002]
[null,null,null,null,"Coincident",null,null,null,null,null,null,null,null,null,null,null,39.70286334,39.696080019999997,40.516176639999998,39.575293340000002,39.453871210000003,38.982220269999999,38.978961730000002]
[null,null,"WEATHER CORRECTED MD 50% POE","MW","Non-coincident",null,null,null,null,null,null,null,null,null,null,null,37.63558536,37.983321799999999,38.024016109999998,37.623851119999998,37.278481990000003,36.66236739,37.008763600000002]
[null,null,null,null,"Coincident",null,null,null,null,null,null,null,null,null,null,null,33.169214799999999,33.151950300000003,33.040133019999999,32.764485389999997,32.879895830000002,32.3405621,32.650182190000002]
[null,null,"WEATHER CORRECTED MD 50% POE","MVA","Non-coincident",null,null,null,null,null,null,null,null,null,null,null,40.127420409999999,40.498180329999997,40.541568990000002,40.114909259999997,39.746673389999998,39.089766130000001,39.459097079999999]
[null,null,null,null,"Coincident",null,null,null,null,null,null,null,null,null,null,null,35.365333479999997,35.346925910000003,35.22770526,34.933807129999998,35.056858839999997,34.481816070000001,34.81193596]
[null,null,"CONNECTION POINT RATING","MVA","Non-coincident"]
[null,null,null,null,"Coincident"]
[null,null,"WINTER/SUMMER PEAKING",null,"Non-coincident"]
[null,null,null,null,"Coincident"]
[null,null,"ADJUSTMENTS - EMBEDDED GENERATION","MW","Non-coincident"]
[null,null,null,null,"Coincident"]
[null,null,"WEATHER CORRECTED MD 10% POE","MW","Non-coincident"]
[null,null,null,null,"Coincident"]
[null,null,"WEATHER CORRECTED MD 10% POE","MVA","Non-coincident"]
[null,null,null,null,"Coincident"]
[null,null,"WEATHER CORRECTED MD 50% POE","MW","Non-coincident"]
[null,null,null,null,"Coincident"]
[null,null,"WEATHER CORRECTED MD 50% POE","MVA","Non-coincident"]
[null,null,null,null,"Coincident"]
[null,null,"CONNECTION POINT RATING","MVA","Non-coincident"]
[null,null,null,null,"Coincident"]
[null,null,"WINTER/SUMMER PEAKING",null,"Non-coincident"]
[null,null,null,null,"Coincident"]
[null,null,"ADJUSTMENTS - EMBEDDED GENERATION","MW","Non-coincident"]
[null,null,null,null,"Coincident"]
[null,null,"WEATHER CORRECTED MD 10% POE","MW","Non-coincident"]
[null,null,null,null,"Coincident"]
[null,null,"WEATHER CORRECTED MD 10% POE","MVA","Non-coincident"]
[null,null,null,null,"Coincident"]
[null,null,"WEATHER CORRECTED MD 50% POE","MW","Non-coincident"]
[null,null,null,null,"Coincident"]
[null,null,"WEATHER CORRECTED MD 50% POE","MVA","Non-coincident"]
[null,null,null,null,"Coincident"]
[null,null,"CONNECTION POINT RATING","MVA","Non-coincident"]
[null,null,null,null,"Coincident"]
[null,null,"WINTER/SUMMER PEAKING",null,"Non-coincident"]
[null,null,null,null,"Coincident"]
[null,null,"ADJUSTMENTS - EMBEDDED GENERATION","MW","Non-coincident"]
[null,null,null,null,"Coincident"]
[null,null,"WEATHER CORRECTED MD 10% POE","MW","Non-coincident"]
[null,null,null,null,"Coincident"]
[null,null,"WEATHER CORRECTED MD 10% POE","MVA","Non-coincident"]
[null,null,null,null,"Coincident"]
[null,null,"WEATHER CORRECTED MD 50% POE","MW","Non-coincident"]
[null,null,null,null,"Coincident"]
[null,null,"WEATHER CORRECTED MD 50% POE","MVA","Non-coincident"]
[null,null,null,null,"Coincident"]
[null,null,"CONNECTION POINT RATING","MVA","Non-coincident"]
[null,null,null,null,"Coincident"]
[null,null,"WINTER/SUMMER PEAKING",null,"Non-coincident"]
[null,null,null,null,"Coincident"]
[null,null,"ADJUSTMENTS - EMBEDDED GENERATION","MW","Non-coincident"]
[null,null,null,null,"Coincident"]
[null,null,"WEATHER CORRECTED MD 10% POE","MW","Non-coincident"]
[null,null,null,null,"Coincident"]
[null,null,"WEATHER CORRECTED MD 10% POE","MVA","Non-coincident"]
[null,null,null,null,"Coincident"]
[null,null,"WEATHER CORRECTED MD 50% POE","MW","Non-coincident"]
[null,null,null,null,"Coincident"]
[null,null,"WEATHER CORRECTED MD 50% POE","MVA","Non-coincident"]
[null,null,null,null,"Coincident"]
[null,"Mt Barker and Mt Barker Sth","CONNECTION POINT RATING","MVA","Non-coincident",null,null,null,null,null,null,null,null,null,null,null,367.8,367.8,367.8,367.8,367.8,367.8,367.8]
[null,null,null,null,"Coincident",null,null,null,null,null,null,null,null,null,null,null,367.8,367.8,367.8,367.8,367.8,367.8,367.8]
[null,null,"WINTER/SUMMER PEAKING",null,"Non-coincident",null,null,null,null,null,null,null,null,null,null,null,"Summer","Summer","Summer","Summer","Summer","Summer","Summer"]
[null,null,null,null,"Coincident",null,null,null,null,null,null,null,null,null,null,null,"Summer","Summer","Summer","Summer","Summer","Summer","Summer"]
[null,null,"ADJUSTMENTS - EMBEDDED GENERATION","MW","Non-coincident",null,null,null,null,null,null,null,null,null,null,null,6.2926361909999997,6.8412870190000001,7.4270905809999999,7.9195802999999998,8.407749935,8.9071517910000004,9.3979134769999995]
[null,null,null,null,"Coincident",null,null,null,null,null,null,null,null,null,null,null,6.2926361909999997,6.8412870190000001,7.4270905809999999,7.9195802999999998,8.407749935,8.9071517910000004,9.3979134769999995]
[null,null,"WEATHER CORRECTED MD 10% POE","MW","Non-coincident",null,null,null,null,null,null,null,null,null,null,null,89.259220780000007,89.050634970000004,88.917313179999994,88.864642840000002,88.898100360000001,89.04990789,89.340209450000003]
[null,null,null,null,"Coincident",null,null,null,null,null,null,null,null,null,null,null,80.042468290000002,79.855420690000003,79.735865469999993,79.688633780000004,79.718636529999998,79.85476869,80.115094209999995]
[null,null,"WEATHER CORRECTED MD 10% POE","MVA","Non-coincident",null,null,null,null,null,null,null,null,null,null,null,94.168036319999999,93.947979320000002,93.807325489999997,93.751758550000005,93.787056059999998,93.947212260000001,94.253478959999995]
[null,null,null,null,"Coincident",null,null,null,null,null,null,null,null,null,null,null,84.444408039999999,84.247073740000005,84.120943589999996,84.071114390000005,84.102767139999997,84.246385889999999,84.521028020000003]
[null,null,"WEATHER CORRECTED MD 50% POE","MW","Non-coincident",null,null,null,null,null,null,null,null,null,null,null,79.164337990000007,78.937386090000004,78.778531319999999,78.690931579999997,78.678558659999993,78.772659540000006,78.992791260000004]
[null,null,null,null,"Coincident",null,null,null,null,null,null,null,null,null,null,null,70.989965600000005,70.786448359999994,70.643996670000007,70.565442320000002,70.554347000000007,70.638731190000001,70.836132489999997]
[null,null,"WEATHER CORRECTED MD 50% POE","MVA","Non-coincident",null,null,null,null,null,null,null,null,null,null,null,83.517984909999996,83.278551780000001,83.110960789999993,83.018543500000007,83.005490120000005,83.104766089999998,83.337003969999998]
[null,null,null,null,"Coincident",null,null,null,null,null,null,null,null,null,null,null,74.894062489999996,74.679352809999997,74.529066970000002,74.446192530000005,74.434487020000006,74.523511920000004,74.731769319999998]
[null,"Mt Gambier","CONNECTION POINT RATING","MVA","Non-coincident",null,null,null,null,null,null,null,null,null,null,null,88,88,88,88,88,88,88]
[null,null,null,null,"Coincident",null,null,null,null,null,null,null,null,null,null,null,88,88,88,88,88,88,88]
[null,null,"WINTER/SUMMER PEAKING",null,"Non-coincident",null,null,null,null,null,null,null,null,null,null,null,"Summer","Summer","Summer","Summer","Summer","Summer","Summer"]
[null,null,null,null,"Coincident",null,null,null,null,null,null,null,null,null,null,null,"Summer","Summer","Summer","Summer","Summer","Summer","Summer"]
[null,null,"ADJUSTMENTS - EMBEDDED GENERATION","MW","Non-coincident",null,null,null,null,null,null,null,null,null,null,null,0.74850097500000001,0.81376228500000003,0.88344286500000002,0.94202388299999995,1.0000910329999999,1.0594942409999999,1.117869711]
[null,null,null,null,"Coincident",null,null,null,null,null,null,null,null,null,null,null,0.74850097500000001,0.81376228500000003,0.88344286500000002,0.94202388299999995,1.0000910329999999,1.0594942409999999,1.117869711]
[null,null,"WEATHER CORRECTED MD 10% POE","MW","Non-coincident",null,null,null,null,null,null,null,null,null,null,null,22.680948000000001,22.564374969999999,22.528337409999999,21.85169672,21.242658850000002,20.66033079,20.269670609999999]
[null,null,null,null,"Coincident",null,null,null,null,null,null,null,null,null,null,null,17.628015179999998,17.370677570000002,17.471729079999999,16.81778164,16.52286995,16.071732480000001,15.7697983]
[null,null,"WEATHER CORRECTED MD 10% POE","MVA","Non-coincident",null,null,null,null,null,null,null,null,null,null,null,23.825563649999999,23.703107660000001,23.665251420000001,22.954463409999999,22.314689869999999,21.70297407,21.292598850000001]
[null,null,null,null,"Coincident",null,null,null,null,null,null,null,null,null,null,null,18.517629769999999,18.247305359999999,18.35345654,17.666507020000001,17.356712330000001,16.882807769999999,16.565636189999999]
[null,null,"WEATHER CORRECTED MD 50% POE","MW","Non-coincident",null,null,null,null,null,null,null,null,null,null,null,21.164062820000002,21.051093000000002,20.768843749999998,20.25505566,19.76516844,19.071213969999999,18.843232149999999]
[null,null,null,null,"Coincident",null,null,null,null,null,null,null,null,null,null,null,15.979571249999999,15.74056635,15.46057656,15.111344620000001,14.934899290000001,14.412355379999999,14.24183652]
[null,null,"WEATHER CORRECTED MD 50% POE","MVA","Non-coincident",null,null,null,null,null,null,null,null,null,null,null,22.232127420000001,22.113456459999998,21.816963250000001,21.277246349999999,20.762636499999999,20.033660959999999,19.794173820000001]
[null,null,null,null,"Coincident",null,null,null,null,null,null,null,null,null,null,null,16.785995539999998,16.534929030000001,16.240809290000001,15.87395302,15.68860321,15.13968863,14.96056437]
[null,"Mt Gunson","CONNECTION POINT RATING","MVA","Non-coincident",null,null,null,null,null,null,null,null,null,null,null,3.4,3.4,3.4,3.4,3.4,3.4,3.4]
[null,null,null,null,"Coincident",null,null,null,null,null,null,null,null,null,null,null,3.4,3.4,3.4,3.4,3.4,3.4,3.4]
[null,null,"WINTER/SUMMER PEAKING",null,"Non-coincident",null,null,null,null,null,null,null,null,null,null,null,"Summer","Summer","Summer","Summer","Summer","Summer","Summer"]
[null,null,null,null,"Coincident",null,null,null,null,null,null,null,null,null,null,null,"Summer","Summer","Summer","Summer","Summer","Summer","Summer"]
[null,null,"ADJUSTMENTS - EMBEDDED GENERATION","MW","Non-coincident",null,null,null,null,null,null,null,null,null,null,null,0,0,0,0,0,0,0]
[null,null,null,null,"Coincident",null,null,null,null,null,null,null,null,null,null,null,0,0,0,0,0,0,0]
[null,null,"WEATHER CORRECTED MD 10% POE","MW","Non-coincident",null,null,null,null,null,null,null,null,null,null,null,0.18581969300000001,0.18581969300000001,0.18581969300000001,0.18581969300000001,0.18581969300000001,0.18581969300000001,0.18581969300000001]
[null,null,null,null,"Coincident",null,null,null,null,null,null,null,null,null,null,null,0.10743099,0.10743099,0.10743099,0.10743099,0.10743099,0.10743099,0.10743099]
[null,null,"WEATHER CORRECTED MD 10% POE","MVA","Non-coincident",null,null,null,null,null,null,null,null,null,null,null,0.27677475400000001,0.27677475400000001,0.27677475400000001,0.27677475400000001,0.27677475400000001,0.27677475400000001,0.27677475400000001]
[null,null,null,null,"Coincident",null,null,null,null,null,null,null,null,null,null,null,0.16001633300000001,0.16001633300000001,0.16001633300000001,0.16001633300000001,0.16001633300000001,0.16001633300000001,0.16001633300000001]
[null,null,"WEATHER CORRECTED MD 50% POE","MW","Non-coincident",null,null,null,null,null,null,null,null,null,null,null,0.17025711099999999,0.17025711099999999,0.17025711099999999,0.17025711099999999,0.17025711099999999,0.17025711099999999,0.17025711099999999]
[null,null,null,null,"Coincident",null,null,null,null,null,null,null,null,null,null,null,9.8433539E-2,9.8433539E-2,9.8433539E-2,9.8433539E-2,9.8433539E-2,9.8433539E-2,9.8433539E-2]
[null,null,"WEATHER CORRECTED MD 50% POE","MVA","Non-coincident",null,null,null,null,null,null,null,null,null,null,null,0.25359459600000001,0.25359459600000001,0.25359459600000001,0.25359459600000001,0.25359459600000001,0.25359459600000001,0.25359459600000001]
[null,null,null,null,"Coincident",null,null,null,null,null,null,null,null,null,null,null,0.14661480700000001,0.14661480700000001,0.14661480700000001,0.14661480700000001,0.14661480700000001,0.14661480700000001,0.14661480700000001]
[null,null,"CONNECTION POINT RATING","MVA","Non-coincident"]
[null,null,null,null,"Coincident"]
[null,null,"WINTER/SUMMER PEAKING",null,"Non-coincident"]
[null,null,null,null,"Coincident"]
[null,null,"ADJUSTMENTS - EMBEDDED GENERATION","MW","Non-coincident"]
[null,null,null,null,"Coincident"]
[null,null,"WEATHER CORRECTED MD 10% POE","MW","Non-coincident"]
[null,null,null,null,"Coincident"]
[null,null,"WEATHER CORRECTED MD 10% POE","MVA","Non-coincident"]
[null,null,null,null,"Coincident"]
[null,null,"WEATHER CORRECTED MD 50% POE","MW","Non-coincident"]
[null,null,null,null,"Coincident"]
[null,null,"WEATHER CORRECTED MD 50% POE","MVA","Non-coincident"]
[null,null,null,null,"Coincident"]
[null,null,"CONNECTION POINT RATING","MVA","Non-coincident"]
[null,null,null,null,"Coincident"]
[null,null,"WINTER/SUMMER PEAKING",null,"Non-coincident"]
[null,null,null,null,"Coincident"]
[null,null,"ADJUSTMENTS - EMBEDDED GENERATION","MW","Non-coincident"]
[null,null,null,null,"Coincident"]
[null,null,"WEATHER CORRECTED MD 10% POE","MW","Non-coincident"]
[null,null,null,null,"Coincident"]
[null,null,"WEATHER CORRECTED MD 10% POE","MVA","Non-coincident"]
[null,null,null,null,"Coincident"]
[null,null,"WEATHER CORRECTED MD 50% POE","MW","Non-coincident"]
[null,null,null,null,"Coincident"]
[null,null,"WEATHER CORRECTED MD 50% POE","MVA","Non-coincident"]
[null,null,null,null,"Coincident"]
[null,null,"CONNECTION POINT RATING","MVA","Non-coincident"]
[null,null,null,null,"Coincident"]
[null,null,"WINTER/SUMMER PEAKING",null,"Non-coincident"]
[null,null,null,null,"Coincident"]
[null,null,"ADJUSTMENTS - EMBEDDED GENERATION","MW","Non-coincident"]
[null,null,null,null,"Coincident"]
[null,null,"WEATHER CORRECTED MD 10% POE","MW","Non-coincident"]
[null,null,null,null,"Coincident"]
[null,null,"WEATHER CORRECTED MD 10% POE","MVA","Non-coincident"]
[null,null,null,null,"Coincident"]
[null,null,"WEATHER CORRECTED MD 50% POE","MW","Non-coincident"]
[null,null,null,null,"Coincident"]
[null,null,"WEATHER CORRECTED MD 50% POE","MVA","Non-coincident"]
[null,null,null,null,"Coincident"]
[null,"Neuroodla","CONNECTION POINT RATING","MVA","Non-coincident",null,null,null,null,null,null,null,null,null,null,null,3.4,3.4,3.4,3.4,3.4,3.4,3.4]
[null,null,null,null,"Coincident",null,null,null,null,null,null,null,null,null,null,null,3.4,3.4,3.4,3.4,3.4,3.4,3.4]
[null,null,"WINTER/SUMMER PEAKING",null,"Non-coincident",null,null,null,null,null,null,null,null,null,null,null,"Summer","Summer","Summer","Summer","Summer","Summer","Summer"]
[null,null,null,null,"Coincident",null,null,null,null,null,null,null,null,null,null,null,"Summer","Summer","Summer","Summer","Summer","Summer","Summer"]
[null,null,"ADJUSTMENTS - EMBEDDED GENERATION","MW","Non-coincident",null,null,null,null,null,null,null,null,null,null,null,4.6704517000000001E-2,5.0776652999999998E-2,5.512454E-2,5.8779843999999998E-2,6.2403082999999998E-2,6.6109688999999999E-2,6.9752167000000004E-2]
[null,null,null,null,"Coincident",null,null,null,null,null,null,null,null,null,null,null,4.6704517000000001E-2,5.0776652999999998E-2,5.512454E-2,5.8779843999999998E-2,6.2403082999999998E-2,6.6109688999999999E-2,6.9752167000000004E-2]
[null,null,"WEATHER CORRECTED MD 10% POE","MW","Non-coincident",null,null,null,null,null,null,null,null,null,null,null,0.96936831199999995,0.96924270999999995,0.97267923899999997,0.94845906599999996,0.927047607,0.90661593100000004,0.89440826799999995]
[null,null,null,null,"Coincident",null,null,null,null,null,null,null,null,null,null,null,0.60321926400000003,0.59740680499999999,0.60397722399999998,0.58444858099999997,0.57732826199999998,0.56466769299999997,0.55713369199999996]
[null,null,"WEATHER CORRECTED MD 10% POE","MVA","Non-coincident",null,null,null,null,null,null,null,null,null,null,null,1.0629950909999999,1.062857358,1.0666258049999999,1.040066318,1.0165868250000001,0.994181749,0.98079500399999997]
[null,null,null,null,"Coincident",null,null,null,null,null,null,null,null,null,null,null,0.66148140899999996,0.65510755099999995,0.66231257700000001,0.64089775199999999,0.633089715,0.61920632099999995,0.61094464599999998]
[null,null,"WEATHER CORRECTED MD 50% POE","MW","Non-coincident",null,null,null,null,null,null,null,null,null,null,null,0.88758348300000001,0.88694521599999998,0.87922551699999996,0.86169518499999997,0.84513260899999998,0.81967804799999999,0.81409160700000005]
[null,null,null,null,"Coincident",null,null,null,null,null,null,null,null,null,null,null,0.53656144500000003,0.53099040200000003,0.52403201600000004,0.51471580699999997,0.51129413199999996,0.49595708500000002,0.49263815599999999]
[null,null,"WEATHER CORRECTED MD 50% POE","MVA","Non-coincident",null,null,null,null,null,null,null,null,null,null,null,0.97331104499999999,0.97261113099999996,0.96414582299999996,0.94492231699999996,0.92676003900000004,0.89884693999999998,0.89272093100000005]
[null,null,null,null,"Coincident",null,null,null,null,null,null,null,null,null,null,null,0.58838542000000005,0.58227629599999997,0.57464583199999997,0.56442981400000003,0.560677655,0.543859274,0.54021978500000001]
[null,"North West Bend","CONNECTION POINT RATING","MVA","Non-coincident",null,null,null,null,null,null,null,null,null,null,null,73.8,73.8,73.8,73.8,73.8,73.8,73.8]
[null,null,null,null,"Coincident",null,null,null,null,null,null,null,null,null,null,null,73.8,73.8,73.8,73.8,73.8,73.8,73.8]
[null,null,"WINTER/SUMMER PEAKING",null,"Non-coincident",null,null,null,null,null,null,null,null,null,null,null,"Summer","Summer","Summer","Summer","Summer","Summer","Summer"]
[null,null,null,null,"Coincident",null,null,null,null,null,null,null,null,null,null,null,"Summer","Summer","Summer","Summer","Summer","Summer","Summer"]
[null,null,"ADJUSTMENTS - EMBEDDED GENERATION","MW","Non-coincident",null,null,null,null,null,null,null,null,null,null,null,0.96214421699999997,1.046032941,1.135602319,1.210904008,1.285545157,1.3619037119999999,1.436941185]
[null,null,null,null,"Coincident",null,null,null,null,null,null,null,null,null,null,null,0.96214421699999997,1.046032941,1.135602319,1.210904008,1.285545157,1.3619037119999999,1.436941185]
[null,null,"WEATHER CORRECTED MD 10% POE","MW","Non-coincident",null,null,null,null,null,null,null,null,null,null,null,28.711190080000002,28.976620530000002,29.351299260000001,28.88818367,28.50057911,28.131831569999999,28.008181749999999]
[null,null,null,null,"Coincident",null,null,null,null,null,null,null,null,null,null,null,19.41519044,19.408386480000001,19.805340919999999,19.344255919999998,19.287615599999999,19.04020762,18.95887707]
[null,null,"WEATHER CORRECTED MD 10% POE","MVA","Non-coincident",null,null,null,null,null,null,null,null,null,null,null,29.956677559999999,30.233622350000001,30.624554589999999,30.141349099999999,29.736930310000002,29.352186549999999,29.223172819999998]
[null,null,null,null,"Coincident",null,null,null,null,null,null,null,null,null,null,null,20.257418730000001,20.250319609999998,20.664493889999999,20.183407079999999,20.124309709999999,19.866169209999999,19.781310550000001]
[null,null,"WEATHER CORRECTED MD 50% POE","MW","Non-coincident",null,null,null,null,null,null,null,null,null,null,null,26.00846262,26.226589830000002,26.235310330000001,25.947431659999999,25.682598810000002,25.136972849999999,25.191655879999999]
[null,null,null,null,"Coincident",null,null,null,null,null,null,null,null,null,null,null,17.08555179,17.062229370000001,16.992129909999999,16.84272249,16.884530680000001,16.527906489999999,16.565920009999999]
[null,null,"WEATHER CORRECTED MD 50% POE","MVA","Non-coincident",null,null,null,null,null,null,null,null,null,null,null,27.136706149999998,27.364295689999999,27.373394489999999,27.073027679999999,26.796706409999999,26.227411279999998,26.28446645]
[null,null,null,null,"Coincident",null,null,null,null,null,null,null,null,null,null,null,17.826720680000001,17.80238653,17.72924617,17.573357479999999,17.616979300000001,17.244884809999999,17.28454734]
[null,"Northern Suburbs","CONNECTION POINT RATING","MVA","Non-coincident",null,null,null,null,null,null,null,null,null,null,null,985.5,985.5,985.5,985.5,985.5,985.5,985.5]
[null,null,null,null,"Coincident",null,null,null,null,null,null,null,null,null,null,null,985.5,985.5,985.5,985.5,985.5,985.5,985.5]
[null,null,"WINTER/SUMMER PEAKING",null,"Non-coincident",null,null,null,null,null,null,null,null,null,null,null,"Summer","Summer","Summer","Summer","Summer","Summer","Summer"]
[null,null,null,null,"Coincident",null,null,null,null,null,null,null,null,null,null,null,"Summer","Summer","Summer","Summer","Summer","Summer","Summer"]
[null,null,"ADJUSTMENTS - EMBEDDED GENERATION","MW","Non-coincident",null,null,null,null,null,null,null,null,null,null,null,13.18243092,14.33179844,15.558997140000001,16.590712870000001,17.613378449999999,18.6595744,19.687670069999999]
[null,null,null,null,"Coincident",null,null,null,null,null,null,null,null,null,null,null,13.18243092,14.33179844,15.558997140000001,16.590712870000001,17.613378449999999,18.6595744,19.687670069999999]
[null,null,"WEATHER CORRECTED MD 10% POE","MW","Non-coincident",null,null,null,null,null,null,null,null,null,null,null,317.66814440000002,313.28890589999997,297.41981240000001,286.33851670000001,276.57447059999998,267.58382999999998,261.69404020000002]
[null,null,null,null,"Coincident",null,null,null,null,null,null,null,null,null,null,null,304.57800170000002,297.52339480000001,284.55046140000002,271.8604115,265.38193339999998,256.78399039999999,251.16315700000001]
[null,null,"WEATHER CORRECTED MD 10% POE","MVA","Non-coincident",null,null,null,null,null,null,null,null,null,null,null,320.03584719999998,315.62396860000001,299.63659660000002,288.47270780000002,278.63588650000003,269.57823519999999,263.64454649999999]
[null,null,null,null,"Coincident",null,null,null,null,null,null,null,null,null,null,null,306.84813869999999,299.74095110000002,286.6713254,273.88669169999997,267.35992700000003,258.69790030000001,253.03517260000001]
[null,null,"WEATHER CORRECTED MD 50% POE","MW","Non-coincident",null,null,null,null,null,null,null,null,null,null,null,292.29396120000001,288.33612520000003,269.589203,261.04195270000002,253.15689599999999,243.18843810000001,239.94188829999999]
[null,null,null,null,"Coincident",null,null,null,null,null,null,null,null,null,null,null,272.2504318,265.96679280000001,247.5702843,240.2495772,235.97945540000001,226.7160159,223.7171735]
[null,null,"WEATHER CORRECTED MD 50% POE","MVA","Non-coincident",null,null,null,null,null,null,null,null,null,null,null,294.47254049999998,290.48520530000002,271.59855499999998,262.98759869999998,255.04377170000001,245.00101509999999,241.7302674]
[null,null,null,null,"Coincident",null,null,null,null,null,null,null,null,null,null,null,274.2796189,267.94914560000001,249.4155208,242.0402497,237.7383011,228.40581750000001,225.3846236]
[null,"Penola West","CONNECTION POINT RATING","MVA","Non-coincident",null,null,null,null,null,null,null,null,null,null,null,50,50,50,50,50,50,50]
[null,null,null,null,"Coincident",null,null,null,null,null,null,null,null,null,null,null,50,50,50,50,50,50,50]
[null,null,"WINTER/SUMMER PEAKING",null,"Non-coincident",null,null,null,null,null,null,null,null,null,null,null,"Summer","Summer","Summer","Summer","Summer","Summer","Summer"]
[null,null,null,null,"Coincident",null,null,null,null,null,null,null,null,null,null,null,"Summer","Summer","Summer","Summer","Summer","Summer","Summer"]
[null,null,"ADJUSTMENTS - EMBEDDED GENERATION","MW","Non-coincident",null,null,null,null,null,null,null,null,null,null,null,0.162623657,0.176802708,0.19194191399999999,0.204669565,0.21728557000000001,0.230191855,0.242874848]
[null,null,null,null,"Coincident",null,null,null,null,null,null,null,null,null,null,null,0.162623657,0.176802708,0.19194191399999999,0.204669565,0.21728557000000001,0.230191855,0.242874848]
[null,null,"WEATHER CORRECTED MD 10% POE","MW","Non-coincident",null,null,null,null,null,null,null,null,null,null,null,7.0235880350000004,9.4937055529999999,9.4803228970000006,9.1975490210000004,8.9433658820000002,8.7004327309999994,8.5381538910000003]
[null,null,null,null,"Coincident",null,null,null,null,null,null,null,null,null,null,null,5.2768116169999999,7.0647948569999999,7.1072275640000004,6.8426764179999999,6.7243135389999997,6.5423929359999997,6.421164149]
[null,null,"WEATHER CORRECTED MD 10% POE","MVA","Non-coincident",null,null,null,null,null,null,null,null,null,null,null,7.1161958409999997,9.6188824910000008,9.6053233819999999,9.3188210589999994,9.0612864500000008,8.8151501640000003,8.6507316359999997]
[null,null,null,null,"Coincident",null,null,null,null,null,null,null,null,null,null,null,5.3463877289999999,7.1579459859999996,7.2009381790000004,6.9328988579999997,6.8129753339999999,6.628656061,6.5058288419999997]
[null,null,"WEATHER CORRECTED MD 50% POE","MW","Non-coincident",null,null,null,null,null,null,null,null,null,null,null,6.4902527689999996,8.961538869,8.8433800399999996,8.6268292340000006,8.4206342620000001,8.1274957929999996,8.0328692119999996]
[null,null,null,null,"Coincident",null,null,null,null,null,null,null,null,null,null,null,4.7369416859999998,6.4773690830000001,6.3635872420000004,6.2214442959999996,6.1505921580000003,5.9372279570000002,5.8688314950000002]
[null,null,"WEATHER CORRECTED MD 50% POE","MVA","Non-coincident",null,null,null,null,null,null,null,null,null,null,null,6.5758284140000001,9.0796990530000006,8.9599822689999993,8.7405761860000002,8.5316624799999996,8.2346589059999999,8.1387846489999998]
[null,null,null,null,"Coincident",null,null,null,null,null,null,null,null,null,null,null,4.7993994740000003,6.5627748529999996,6.4474927690000001,6.3034756310000004,6.2316892900000003,6.0155118280000002,5.9462135409999997]
[null,null,"CONNECTION POINT RATING","MVA","Non-coincident"]
[null,null,null,null,"Coincident"]
[null,null,"WINTER/SUMMER PEAKING",null,"Non-coincident"]
[null,null,null,null,"Coincident"]
[null,null,"ADJUSTMENTS - EMBEDDED GENERATION","MW","Non-coincident"]
[null,null,null,null,"Coincident"]
[null,null,"WEATHER CORRECTED MD 10% POE","MW","Non-coincident"]
[null,null,null,null,"Coincident"]
[null,null,"WEATHER CORRECTED MD 10% POE","MVA","Non-coincident"]
[null,null,null,null,"Coincident"]
[null,null,"WEATHER CORRECTED MD 50% POE","MW","Non-coincident"]
[null,null,null,null,"Coincident"]
[null,null,"WEATHER CORRECTED MD 50% POE","MVA","Non-coincident"]
[null,null,null,null,"Coincident"]
[null,"Playford","CONNECTION POINT RATING","MVA","Non-coincident",null,null,null,null,null,null,null,null,null,null,null,120,120,120,120,120,120,120]
[null,null,null,null,"Coincident",null,null,null,null,null,null,null,null,null,null,null,120,120,120,120,120,120,120]
[null,null,"WINTER/SUMMER PEAKING",null,"Non-coincident",null,null,null,null,null,null,null,null,null,null,null,"Summer","Summer","Summer","Summer","Summer","Summer","Summer"]
[null,null,null,null,"Coincident",null,null,null,null,null,null,null,null,null,null,null,"Summer","Summer","Summer","Summer","Summer","Summer","Summer"]
[null,null,"ADJUSTMENTS - EMBEDDED GENERATION","MW","Non-coincident",null,null,null,null,null,null,null,null,null,null,null,1.609733992,1.750085645,1.899941425,2.0259263729999999,2.1508061889999999,2.2785593469999998,2.404102242]
[null,null,null,null,"Coincident",null,null,null,null,null,null,null,null,null,null,null,1.609733992,1.750085645,1.899941425,2.0259263729999999,2.1508061889999999,2.2785593469999998,2.404102242]
[null,null,"WEATHER CORRECTED MD 10% POE","MW","Non-coincident",null,null,null,null,null,null,null,null,null,null,null,32.411275070000002,35.166864400000001,35.180899480000001,34.188915770000001,33.295403280000002,32.438960229999999,31.880635689999998]
[null,null,null,null,"Coincident",null,null,null,null,null,null,null,null,null,null,null,30.4268125,32.699809770000002,32.955796489999997,31.782422889999999,31.280884029999999,30.479685239999998,29.958809280000001]
[null,null,"WEATHER CORRECTED MD 10% POE","MVA","Non-coincident",null,null,null,null,null,null,null,null,null,null,null,32.662803089999997,35.439777190000001,35.453921180000002,34.454239180000002,33.55379258,32.69070309,32.128045669999999]
[null,null,null,null,"Coincident",null,null,null,null,null,null,null,null,null,null,null,30.662940070000001,32.953576959999999,33.211550269999996,32.029070689999998,31.523639630000002,30.716223129999999,30.191304909999999]
[null,null,"WEATHER CORRECTED MD 50% POE","MW","Non-coincident",null,null,null,null,null,null,null,null,null,null,null,30.005721279999999,32.739926109999999,32.343340619999999,31.581027760000001,30.850464670000001,29.79779211,29.471394199999999]
[null,null,null,null,"Coincident",null,null,null,null,null,null,null,null,null,null,null,27.36454805,29.569332979999999,29.081470970000002,28.458634419999999,28.15669114,27.199369570000002,26.904777660000001]
[null,null,"WEATHER CORRECTED MD 50% POE","MVA","Non-coincident",null,null,null,null,null,null,null,null,null,null,null,30.238580970000001,32.994004619999998,32.59434143,31.826112630000001,31.089880000000001,30.029038159999999,29.700107240000001]
[null,null,null,null,"Coincident",null,null,null,null,null,null,null,null,null,null,null,27.576910890000001,29.798806070000001,29.307158000000001,28.679487930000001,28.375201409999999,27.410450539999999,27.113572449999999]
[null,"Port Lincoln","CONNECTION POINT RATING","MVA","Non-coincident",null,null,null,null,null,null,null,null,null,null,null,101.4,101.4,101.4,101.4,101.4,101.4,101.4]
[null,null,null,null,"Coincident",null,null,null,null,null,null,null,null,null,null,null,101.4,101.4,101.4,101.4,101.4,101.4,101.4]
[null,null,"WINTER/SUMMER PEAKING",null,"Non-coincident",null,null,null,null,null,null,null,null,null,null,null,"Summer","Summer","Summer","Summer","Summer","Summer","Summer"]
[null,null,null,null,"Coincident",null,null,null,null,null,null,null,null,null,null,null,"Summer","Summer","Summer","Summer","Summer","Summer","Summer"]
[null,null,"ADJUSTMENTS - EMBEDDED GENERATION","MW","Non-coincident",null,null,null,null,null,null,null,null,null,null,null,2.1134682470000001,2.2977401589999999,2.4944903269999998,2.6598997600000001,2.8238582330000002,2.9915892020000001,3.1564182509999998]
[null,null,null,null,"Coincident",null,null,null,null,null,null,null,null,null,null,null,2.1134682470000001,2.2977401589999999,2.4944903269999998,2.6598997600000001,2.8238582330000002,2.9915892020000001,3.1564182509999998]
[null,null,"WEATHER CORRECTED MD 10% POE","MW","Non-coincident",null,null,null,null,null,null,null,null,null,null,null,32.056694329999999,31.82048855,31.68049448,30.658060519999999,29.857884760000001,29.125072769999999,28.714953420000001]
[null,null,null,null,"Coincident",null,null,null,null,null,null,null,null,null,null,null,28.998243890000001,28.510907639999999,28.596273740000001,27.46243054,27.03002184,26.36957876,26.001494600000001]
[null,null,"WEATHER CORRECTED MD 10% POE","MVA","Non-coincident",null,null,null,null,null,null,null,null,null,null,null,32.94832624,32.705550580000001,32.561662689999999,31.51079052,30.6883585,29.93516391,29.513637419999998]
[null,null,null,null,"Coincident",null,null,null,null,null,null,null,null,null,null,null,29.804807390000001,29.303916269999998,29.391656749999999,28.226276590000001,27.78184079,27.103027990000001,26.72470586]
[null,null,"WEATHER CORRECTED MD 50% POE","MW","Non-coincident",null,null,null,null,null,null,null,null,null,null,null,28.841531410000002,28.617983840000001,28.19635482,27.55613451,26.984194129999999,26.177741359999999,26.00613186]
[null,null,null,null,"Coincident",null,null,null,null,null,null,null,null,null,null,null,25.34516636,24.905512770000001,24.429640880000001,23.92757653,23.73132464,23.02499504,22.876896479999999]
[null,null,"WEATHER CORRECTED MD 50% POE","MVA","Non-coincident",null,null,null,null,null,null,null,null,null,null,null,29.64373608,29.4139707,28.9806144,28.322586860000001,27.734738409999999,26.905854779999999,26.72947211]
[null,null,null,null,"Coincident",null,null,null,null,null,null,null,null,null,null,null,26.05012236,25.598240149999999,25.109132259999999,24.593103379999999,24.391392889999999,23.665417290000001,23.513199480000001]
[null,"Port Pirie Network","CONNECTION POINT RATING","MVA","Non-coincident",null,null,null,null,null,null,null,null,null,null,null,192,192,192,192,192,192,192]
[null,null,null,null,"Coincident",null,null,null,null,null,null,null,null,null,null,null,192,192,192,192,192,192,192]
[null,null,"WINTER/SUMMER PEAKING",null,"Non-coincident",null,null,null,null,null,null,null,null,null,null,null,"Summer","Summer","Summer","Summer","Summer","Summer","Summer"]
[null,null,null,null,"Coincident",null,null,null,null,null,null,null,null,null,null,null,"Summer","Summer","Summer","Summer","Summer","Summer","Summer"]
[null,null,"ADJUSTMENTS - EMBEDDED GENERATION","MW","Non-coincident",null,null,null,null,null,null,null,null,null,null,null,2.584100609,2.809406649,3.0499696329999999,3.2522128499999998,3.4526820030000001,3.6577637209999998,3.8592973119999998]
[null,null,null,null,"Coincident",null,null,null,null,null,null,null,null,null,null,null,2.584100609,2.809406649,3.0499696329999999,3.2522128499999998,3.4526820030000001,3.6577637209999998,3.8592973119999998]
[null,null,"WEATHER CORRECTED MD 10% POE","MW","Non-coincident",null,null,null,null,null,null,null,null,null,null,null,67.911035929999997,67.680645179999999,67.689176259999996,65.76708266,64.03975398,62.395921770000001,61.437187620000003]
[null,null,null,null,"Coincident",null,null,null,null,null,null,null,null,null,null,null,61.040376449999997,60.254928569999997,60.710052560000001,58.536500830000001,57.605095349999999,56.132742839999999,55.277120189999998]
[null,null,"WEATHER CORRECTED MD 10% POE","MVA","Non-coincident",null,null,null,null,null,null,null,null,null,null,null,71.059757160000004,70.818684250000004,70.827610879999995,68.816398669999998,67.008981730000002,65.288932610000003,64.285746380000006]
[null,null,null,null,"Coincident",null,null,null,null,null,null,null,null,null,null,null,63.870536909999998,63.04867144,63.524897430000003,61.250568139999999,60.275977689999998,58.735358990000002,57.840065060000001]
[null,null,"WEATHER CORRECTED MD 50% POE","MW","Non-coincident",null,null,null,null,null,null,null,null,null,null,null,63.662348530000003,63.418815449999997,62.661693970000002,61.20028404,59.804526690000003,57.88755184,57.396725119999999]
[null,null,null,null,"Coincident",null,null,null,null,null,null,null,null,null,null,null,55.588297259999997,54.840128710000002,53.944867770000002,52.802895919999997,52.260128250000001,50.591370169999998,50.168642079999998]
[null,null,"WEATHER CORRECTED MD 50% POE","MVA","Non-coincident",null,null,null,null,null,null,null,null,null,null,null,66.614077730000005,66.359253150000001,65.567027440000004,64.037858679999999,62.577386509999997,60.571530379999999,60.057946299999998]
[null,null,null,null,"Coincident",null,null,null,null,null,null,null,null,null,null,null,58.165669979999997,57.382812309999998,56.446042249999998,55.251122440000003,54.683189140000003,52.937058450000002,52.494730410000003]
[null,null,"CONNECTION POINT RATING","MVA","Non-coincident"]
[null,null,null,null,"Coincident"]
[null,null,"WINTER/SUMMER PEAKING",null,"Non-coincident"]
[null,null,null,null,"Coincident"]
[null,null,"ADJUSTMENTS - EMBEDDED GENERATION","MW","Non-coincident"]
[null,null,null,null,"Coincident"]
[null,null,"WEATHER CORRECTED MD 10% POE","MW","Non-coincident"]
[null,null,null,null,"Coincident"]
[null,null,"WEATHER CORRECTED MD 10% POE","MVA","Non-coincident"]
[null,null,null,null,"Coincident"]
[null,null,"WEATHER CORRECTED MD 50% POE","MW","Non-coincident"]
[null,null,null,null,"Coincident"]
[null,null,"WEATHER CORRECTED MD 50% POE","MVA","Non-coincident"]
[null,null,null,null,"Coincident"]
[null,null,"CONNECTION POINT RATING","MVA","Non-coincident"]
[null,null,null,null,"Coincident"]
[null,null,"WINTER/SUMMER PEAKING",null,"Non-coincident"]
[null,null,null,null,"Coincident"]
[null,null,"ADJUSTMENTS - EMBEDDED GENERATION","MW","Non-coincident"]
[null,null,null,null,"Coincident"]
[null,null,"WEATHER CORRECTED MD 10% POE","MW","Non-coincident"]
[null,null,null,null,"Coincident"]
[null,null,"WEATHER CORRECTED MD 10% POE","MVA","Non-coincident"]
[null,null,null,null,"Coincident"]
[null,null,"WEATHER CORRECTED MD 50% POE","MW","Non-coincident"]
[null,null,null,null,"Coincident"]
[null,null,"WEATHER CORRECTED MD 50% POE","MVA","Non-coincident"]
[null,null,null,null,"Coincident"]
[null,"Snuggery Rural","CONNECTION POINT RATING","MVA","Non-coincident",null,null,null,null,null,null,null,null,null,null,null,28.8,28.8,28.8,28.8,28.8,28.8,28.8]
[null,null,null,null,"Coincident",null,null,null,null,null,null,null,null,null,null,null,28.8,28.8,28.8,28.8,28.8,28.8,28.8]
[null,null,"WINTER/SUMMER PEAKING",null,"Non-coincident",null,null,null,null,null,null,null,null,null,null,null,"Summer","Summer","Summer","Summer","Summer","Summer","Summer"]
[null,null,null,null,"Coincident",null,null,null,null,null,null,null,null,null,null,null,"Summer","Summer","Summer","Summer","Summer","Summer","Summer"]
[null,null,"ADJUSTMENTS - EMBEDDED GENERATION","MW","Non-coincident",null,null,null,null,null,null,null,null,null,null,null,0.87990367400000002,0.95662190000000002,1.038535217,1.107400395,1.175661493,1.2454932009999999,1.3141167469999999]
[null,null,null,null,"Coincident",null,null,null,null,null,null,null,null,null,null,null,0.87990367400000002,0.95662190000000002,1.038535217,1.107400395,1.175661493,1.2454932009999999,1.3141167469999999]
[null,null,"WEATHER CORRECTED MD 10% POE","MW","Non-coincident",null,null,null,null,null,null,null,null,null,null,null,14.83631564,14.850262109999999,14.915486080000001,14.552454600000001,14.228138919999999,13.91679654,13.738455269999999]
[null,null,null,null,"Coincident",null,null,null,null,null,null,null,null,null,null,null,12.62235527,12.51410205,12.66240728,12.26004095,12.114258299999999,11.85050408,11.70009731]
[null,null,"WEATHER CORRECTED MD 10% POE","MVA","Non-coincident",null,null,null,null,null,null,null,null,null,null,null,15.35564407,15.37007871,15.437585779999999,15.0618468,14.72617881,14.40393824,14.219354340000001]
[null,null,null,null,"Coincident",null,null,null,null,null,null,null,null,null,null,null,13.06418652,12.95214402,13.105640510000001,12.68918979,12.53830419,12.26531756,12.10964596]
[null,null,"WEATHER CORRECTED MD 50% POE","MW","Non-coincident",null,null,null,null,null,null,null,null,null,null,null,12.99047966,12.944671100000001,12.7927353,12.49546668,12.210043130000001,11.846925150000001,11.77461705]
[null,null,null,null,"Coincident",null,null,null,null,null,null,null,null,null,null,null,10.73651635,10.595192389999999,10.42434804,10.20455973,10.09929595,9.800187631,9.7415824579999999]
[null,null,"WEATHER CORRECTED MD 50% POE","MVA","Non-coincident",null,null,null,null,null,null,null,null,null,null,null,13.44519668,13.39778465,13.240530509999999,12.932856340000001,12.63744187,12.261613349999999,12.18677418]
[null,null,null,null,"Coincident",null,null,null,null,null,null,null,null,null,null,null,11.11233595,10.9660651,10.78924054,10.561758790000001,10.45281037,10.143232100000001,10.082575520000001]
[null,"Southern Suburbs","CONNECTION POINT RATING","MVA","Non-coincident",null,null,null,null,null,null,null,null,null,null,null,1582.6,1582.6,1582.6,1582.6,1582.6,1582.6,1582.6]
[null,null,null,null,"Coincident",null,null,null,null,null,null,null,null,null,null,null,1582.6,1582.6,1582.6,1582.6,1582.6,1582.6,1582.6]
[null,null,"WINTER/SUMMER PEAKING",null,"Non-coincident",null,null,null,null,null,null,null,null,null,null,null,"Summer","Summer","Summer","Summer","Summer","Summer","Summer"]
[null,null,null,null,"Coincident",null,null,null,null,null,null,null,null,null,null,null,"Summer","Summer","Summer","Summer","Summer","Summer","Summer"]
[null,null,"ADJUSTMENTS - EMBEDDED GENERATION","MW","Non-coincident",null,null,null,null,null,null,null,null,null,null,null,32.79979015,35.659582370000003,38.713029810000002,41.280087389999998,43.824626930000001,46.427713390000001,48.985763749999997]
[null,null,null,null,"Coincident",null,null,null,null,null,null,null,null,null,null,null,35.766790149999999,38.626582370000001,41.680029810000001,44.247087389999997,46.79162693,49.39471339,51.952763750000003]
[null,null,"WEATHER CORRECTED MD 10% POE","MW","Non-coincident",null,null,null,null,null,null,null,null,null,null,null,655.99060239999994,651.12186540000005,648.20063519999997,629.06148789999997,612.22197500000004,596.08190060000004,585.43540940000003]
[null,null,null,null,"Coincident",null,null,null,null,null,null,null,null,null,null,null,635.5760358,624.86099149999995,626.67717970000001,603.53759249999996,593.62640050000005,578.04153050000002,567.78787899999998]
[null,null,"WEATHER CORRECTED MD 10% POE","MVA","Non-coincident",null,null,null,null,null,null,null,null,null,null,null,662.10911829999998,657.19496979999997,654.24649299999999,634.92883219999999,617.93225470000004,601.64163970000004,590.89584720000005]
[null,null,null,null,"Coincident",null,null,null,null,null,null,null,null,null,null,null,641.50414209999997,630.68915719999995,632.52228520000006,609.16687179999997,599.16323669999997,583.43300439999996,573.08371569999997]
[null,null,"WEATHER CORRECTED MD 50% POE","MW","Non-coincident",null,null,null,null,null,null,null,null,null,null,null,591.22268039999994,586.74127209999995,579.77580920000003,566.36692400000004,553.5048511,534.84546990000001,529.21110729999998]
[null,null,null,null,"Coincident",null,null,null,null,null,null,null,null,null,null,null,556.47396400000002,546.91524049999998,538.02337009999997,526.73870829999998,521.37582880000002,503.86318599999998,498.6171721]
[null,null,"WEATHER CORRECTED MD 50% POE","MVA","Non-coincident",null,null,null,null,null,null,null,null,null,null,null,596.73709680000002,592.21388979999995,585.18345899999997,571.64950729999998,558.66746809999995,539.83404819999998,534.14713310000002]
[null,null,null,null,"Coincident",null,null,null,null,null,null,null,null,null,null,null,561.66427420000002,552.01639520000003,543.04158910000001,531.65167369999995,526.23877389999996,508.5627882,503.26784409999999]
[null,null,"CONNECTION POINT RATING","MVA","Non-coincident"]
[null,null,null,null,"Coincident"]
[null,null,"WINTER/SUMMER PEAKING",null,"Non-coincident"]
[null,null,null,null,"Coincident"]
[null,null,"ADJUSTMENTS - EMBEDDED GENERATION","MW","Non-coincident"]
[null,null,null,null,"Coincident"]
[null,null,"WEATHER CORRECTED MD 10% POE","MW","Non-coincident"]
[null,null,null,null,"Coincident"]
[null,null,"WEATHER CORRECTED MD 10% POE","MVA","Non-coincident"]
[null,null,null,null,"Coincident"]
[null,null,"WEATHER CORRECTED MD 50% POE","MW","Non-coincident"]
[null,null,null,null,"Coincident"]
[null,null,"WEATHER CORRECTED MD 50% POE","MVA","Non-coincident"]
[null,null,null,null,"Coincident"]
[null,"Stony Point (Whyalla Refiners)","CONNECTION POINT RATING","MVA","Non-coincident",null,null,null,null,null,null,null,null,null,null,null,2.8,2.8,2.8,2.8,2.8,2.8,2.8]
[null,null,null,null,"Coincident",null,null,null,null,null,null,null,null,null,null,null,2.8,2.8,2.8,2.8,2.8,2.8,2.8]
[null,null,"WINTER/SUMMER PEAKING",null,"Non-coincident",null,null,null,null,null,null,null,null,null,null,null,"Summer","Summer","Summer","Summer","Summer","Summer","Summer"]
[null,null,null,null,"Coincident",null,null,null,null,null,null,null,null,null,null,null,"Summer","Summer","Summer","Summer","Summer","Summer","Summer"]
[null,null,"ADJUSTMENTS - EMBEDDED GENERATION","MW","Non-coincident",null,null,null,null,null,null,null,null,null,null,null,6.8186940000000001E-3,7.4132119999999998E-3,8.0479880000000007E-3,8.5816490000000002E-3,9.1106290000000003E-3,9.6517800000000004E-3,1.0183569E-2]
[null,null,null,null,"Coincident",null,null,null,null,null,null,null,null,null,null,null,6.8186940000000001E-3,7.4132119999999998E-3,8.0479880000000007E-3,8.5816490000000002E-3,9.1106290000000003E-3,9.6517800000000004E-3,1.0183569E-2]
[null,null,"WEATHER CORRECTED MD 10% POE","MW","Non-coincident",null,null,null,null,null,null,null,null,null,null,null,0.16865503800000001,0.168819409,0.16896049499999999,0.16907351200000001,0.169156853,0.16922585200000001,0.16929081000000001]
[null,null,null,null,"Coincident",null,null,null,null,null,null,null,null,null,null,null,9.5053825999999994E-2,9.5146465E-2,9.5225981000000001E-2,9.5289677000000003E-2,9.5336647999999996E-2,9.5375535999999997E-2,9.5412146000000003E-2]
[null,null,"WEATHER CORRECTED MD 10% POE","MVA","Non-coincident",null,null,null,null,null,null,null,null,null,null,null,0.19500978299999999,0.19519983900000001,0.195362972,0.19549364899999999,0.19559001300000001,0.19566979500000001,0.195744903]
[null,null,null,null,"Coincident",null,null,null,null,null,null,null,null,null,null,null,0.10990733599999999,0.110014451,0.110106393,0.11018004300000001,0.11023435299999999,0.110279318,0.11032164899999999]
[null,null,"WEATHER CORRECTED MD 50% POE","MW","Non-coincident",null,null,null,null,null,null,null,null,null,null,null,0.161231507,0.161249323,0.16124385299999999,0.16121031499999999,0.16114709999999999,0.16106954400000001,0.16098794599999999]
[null,null,null,null,"Coincident",null,null,null,null,null,null,null,null,null,null,null,9.0869931000000001E-2,9.0879971000000004E-2,9.0876889000000002E-2,9.0857987000000001E-2,9.0822359000000005E-2,9.0778648000000003E-2,9.0732660000000007E-2]
[null,null,"WEATHER CORRECTED MD 50% POE","MVA","Non-coincident",null,null,null,null,null,null,null,null,null,null,null,0.18642622,0.18644681900000001,0.18644049500000001,0.186401716,0.186328622,0.18623894699999999,0.18614459899999999]
[null,null,null,null,"Coincident",null,null,null,null,null,null,null,null,null,null,null,0.105069648,0.105081257,0.105077693,0.105055837,0.10501464200000001,0.104964101,0.104910926]
[null,"Tailem Bend","CONNECTION POINT RATING","MVA","Non-coincident",null,null,null,null,null,null,null,null,null,null,null,60,60,60,60,60,60,60]
[null,null,null,null,"Coincident",null,null,null,null,null,null,null,null,null,null,null,60,60,60,60,60,60,60]
[null,null,"WINTER/SUMMER PEAKING",null,"Non-coincident",null,null,null,null,null,null,null,null,null,null,null,"Summer","Summer","Summer","Summer","Summer","Summer","Summer"]
[null,null,null,null,"Coincident",null,null,null,null,null,null,null,null,null,null,null,"Summer","Summer","Summer","Summer","Summer","Summer","Summer"]
[null,null,"ADJUSTMENTS - EMBEDDED GENERATION","MW","Non-coincident",null,null,null,null,null,null,null,null,null,null,null,0.93441297300000004,1.0158838290000001,1.1028716080000001,1.1760029270000001,1.2484927429999999,1.322650466,1.3955251829999999]
[null,null,null,null,"Coincident",null,null,null,null,null,null,null,null,null,null,null,0.93441297300000004,1.0158838290000001,1.1028716080000001,1.1760029270000001,1.2484927429999999,1.322650466,1.3955251829999999]
[null,null,"WEATHER CORRECTED MD 10% POE","MW","Non-coincident",null,null,null,null,null,null,null,null,null,null,null,21.685077840000002,21.56051815,21.536373709999999,20.925212680000001,20.4036419,19.941643639999999,19.714722200000001]
[null,null,null,null,"Coincident",null,null,null,null,null,null,null,null,null,null,null,19.979384150000001,19.675761219999998,19.79968233,19.091160330000001,18.813222929999998,18.389303219999999,18.182307900000001]
[null,null,"WEATHER CORRECTED MD 10% POE","MVA","Non-coincident",null,null,null,null,null,null,null,null,null,null,null,22.223935919999999,22.096281009999998,22.071536600000002,21.445188680000001,20.91065725,20.437178670000002,20.204618400000001]
[null,null,null,null,"Coincident",null,null,null,null,null,null,null,null,null,null,null,20.475857000000001,20.16468927,20.291689730000002,19.56556149,19.280717549999999,18.846263749999999,18.634124750000002]
[null,null,"WEATHER CORRECTED MD 50% POE","MW","Non-coincident",null,null,null,null,null,null,null,null,null,null,null,19.920181750000001,19.790084459999999,19.521629050000001,19.05896074,18.651459410000001,18.102267820000002,18.017654100000001]
[null,null,null,null,"Coincident",null,null,null,null,null,null,null,null,null,null,null,17.829463530000002,17.541723090000001,17.226947160000002,16.855738429999999,16.706808590000001,16.216925010000001,16.143129900000002]
[null,null,"WEATHER CORRECTED MD 50% POE","MVA","Non-coincident",null,null,null,null,null,null,null,null,null,null,null,20.415183469999999,20.281853359999999,20.00672703,19.53256176,19.11493432,18.552095730000001,18.465379420000001]
[null,null,null,null,"Coincident",null,null,null,null,null,null,null,null,null,null,null,18.272512450000001,17.977621880000001,17.655024000000001,17.274591010000002,17.12196037,16.61990355,16.544274690000002]
[null,"Templers","CONNECTION POINT RATING","MVA","Non-coincident",null,null,null,null,null,null,null,null,null,null,null,147.6,147.6,147.6,147.6,147.6,147.6,147.6]
[null,null,null,null,"Coincident",null,null,null,null,null,null,null,null,null,null,null,147.6,147.6,147.6,147.6,147.6,147.6,147.6]
[null,null,"WINTER/SUMMER PEAKING",null,"Non-coincident",null,null,null,null,null,null,null,null,null,null,null,"Summer","Summer","Summer","Summer","Summer","Summer","Summer"]
[null,null,null,null,"Coincident",null,null,null,null,null,null,null,null,null,null,null,"Summer","Summer","Summer","Summer","Summer","Summer","Summer"]
[null,null,"ADJUSTMENTS - EMBEDDED GENERATION","MW","Non-coincident",null,null,null,null,null,null,null,null,null,null,null,1.7485228370000001,1.9009753979999999,2.0637515180000001,2.2005986989999999,2.3362454659999998,2.4750133089999999,2.6113803240000002]
[null,null,null,null,"Coincident",null,null,null,null,null,null,null,null,null,null,null,1.7485228370000001,1.9009753979999999,2.0637515180000001,2.2005986989999999,2.3362454659999998,2.4750133089999999,2.6113803240000002]
[null,null,"WEATHER CORRECTED MD 10% POE","MW","Non-coincident",null,null,null,null,null,null,null,null,null,null,null,31.028423549999999,31.263675330000002,31.60525612,31.032694379999999,30.531054770000001,30.093926239999998,29.935336199999998]
[null,null,null,null,"Coincident",null,null,null,null,null,null,null,null,null,null,null,27.946386019999998,27.890558590000001,28.404672640000001,27.677493609999999,27.519601959999999,27.128638949999999,26.989032529999999]
[null,null,"WEATHER CORRECTED MD 10% POE","MVA","Non-coincident",null,null,null,null,null,null,null,null,null,null,null,33.018846369999999,33.269189160000003,33.6326818,33.023391160000003,32.489572189999997,32.024402569999999,31.855639239999999]
[null,null,null,null,"Coincident",null,null,null,null,null,null,null,null,null,null,null,29.73910115,29.67969248,30.226786109999999,29.452959719999999,29.28493958,28.868896939999999,28.720334990000001]
[null,null,"WEATHER CORRECTED MD 50% POE","MW","Non-coincident",null,null,null,null,null,null,null,null,null,null,null,28.37869555,28.67762252,28.735158219999999,28.452639040000001,28.22127893,27.6920593,27.8204344]
[null,null,null,null,"Coincident",null,null,null,null,null,null,null,null,null,null,null,24.830315559999999,24.849209519999999,24.788525199999999,24.598915049999999,24.711675889999999,24.2513325,24.366785149999998]
[null,null,"WEATHER CORRECTED MD 50% POE","MVA","Non-coincident",null,null,null,null,null,null,null,null,null,null,null,30.199142630000001,30.517245280000001,30.578471799999999,30.277829480000001,30.03162799,29.46845978,29.60506994]
[null,null,null,null,"Coincident",null,null,null,null,null,null,null,null,null,null,null,26.423139840000001,26.443245829999999,26.378668699999999,26.17689537,26.296889629999999,25.807015969999998,25.929874720000001]
[null,null,"CONNECTION POINT RATING","MVA","Non-coincident"]
[null,null,null,null,"Coincident"]
[null,null,"WINTER/SUMMER PEAKING",null,"Non-coincident"]
[null,null,null,null,"Coincident"]
[null,null,"ADJUSTMENTS - EMBEDDED GENERATION","MW","Non-coincident"]
[null,null,null,null,"Coincident"]
[null,null,"WEATHER CORRECTED MD 10% POE","MW","Non-coincident"]
[null,null,null,null,"Coincident"]
[null,null,"WEATHER CORRECTED MD 10% POE","MVA","Non-coincident"]
[null,null,null,null,"Coincident"]
[null,null,"WEATHER CORRECTED MD 50% POE","MW","Non-coincident"]
[null,null,null,null,"Coincident"]
[null,null,"WEATHER CORRECTED MD 50% POE","MVA","Non-coincident"]
[null,null,null,null,"Coincident"]
[null,"Waterloo","CONNECTION POINT RATING","MVA","Non-coincident",null,null,null,null,null,null,null,null,null,null,null,54.8,54.8,54.8,54.8,54.8,54.8,54.8]
[null,null,null,null,"Coincident",null,null,null,null,null,null,null,null,null,null,null,54.8,54.8,54.8,54.8,54.8,54.8,54.8]
[null,null,"WINTER/SUMMER PEAKING",null,"Non-coincident",null,null,null,null,null,null,null,null,null,null,null,"Summer","Summer","Summer","Summer","Summer","Summer","Summer"]
[null,null,null,null,"Coincident",null,null,null,null,null,null,null,null,null,null,null,"Summer","Summer","Summer","Summer","Summer","Summer","Summer"]
[null,null,"ADJUSTMENTS - EMBEDDED GENERATION","MW","Non-coincident",null,null,null,null,null,null,null,null,null,null,null,0.59766951099999999,0.64977992500000004,0.70541907400000003,0.75219535100000001,0.798561309,0.845994095,0.89260624399999999]
[null,null,null,null,"Coincident",null,null,null,null,null,null,null,null,null,null,null,0.59766951099999999,0.64977992500000004,0.70541907400000003,0.75219535100000001,0.798561309,0.845994095,0.89260624399999999]
[null,null,"WEATHER CORRECTED MD 10% POE","MW","Non-coincident",null,null,null,null,null,null,null,null,null,null,null,10.154169570000001,10.04402857,9.9723032459999992,9.6213332539999996,9.3057750079999995,9.0056644329999997,8.7913328550000003]
[null,null,null,null,"Coincident",null,null,null,null,null,null,null,null,null,null,null,6.4882168299999998,6.3568230229999996,6.3582990710000002,6.0877601459999999,5.9506977020000003,5.7594354430000001,5.623062376]
[null,null,"WEATHER CORRECTED MD 10% POE","MVA","Non-coincident",null,null,null,null,null,null,null,null,null,null,null,11.237131140000001,11.11524339,11.03586842,10.647466809999999,10.29825368,9.9661357380000002,9.7289452880000002]
[null,null,null,null,"Coincident",null,null,null,null,null,null,null,null,null,null,null,7.1801975410000001,7.0347903350000003,7.0364238050000001,6.7370313880000001,6.5853509729999997,6.3736902290000002,6.2227727130000003]
[null,null,"WEATHER CORRECTED MD 50% POE","MW","Non-coincident",null,null,null,null,null,null,null,null,null,null,null,9.26409415,9.2032141050000007,9.0708319419999999,8.8403799640000003,8.6234742149999999,8.3190331420000003,8.2182957240000007]
[null,null,null,null,"Coincident",null,null,null,null,null,null,null,null,null,null,null,5.7505286419999999,5.657492156,5.5513577749999996,5.4222474199999997,5.3570139589999997,5.1685438899999996,5.1065912009999996]
[null,null,"WEATHER CORRECTED MD 50% POE","MVA","Non-coincident",null,null,null,null,null,null,null,null,null,null,null,10.25212748,10.184754460000001,10.038253490000001,9.7832233649999996,9.5431842029999991,9.2062739090000001,9.0947926530000007]
[null,null,null,null,"Coincident",null,null,null,null,null,null,null,null,null,null,null,6.3638335000000001,6.2608744950000004,6.1434206800000002,6.0005404589999998,5.9283497250000003,5.7197789630000004,5.651218901]
[null,"Western Suburbs","CONNECTION POINT RATING","MVA","Non-coincident",null,null,null,null,null,null,null,null,null,null,null,885,885,885,885,885,885,885]
[null,null,null,null,"Coincident",null,null,null,null,null,null,null,null,null,null,null,885,885,885,885,885,885,885]
[null,null,"WINTER/SUMMER PEAKING",null,"Non-coincident",null,null,null,null,null,null,null,null,null,null,null,"Summer","Summer","Summer","Summer","Summer","Summer","Summer"]
[null,null,null,null,"Coincident",null,null,null,null,null,null,null,null,null,null,null,"Summer","Summer","Summer","Summer","Summer","Summer","Summer"]
[null,null,"ADJUSTMENTS - EMBEDDED GENERATION","MW","Non-coincident",null,null,null,null,null,null,null,null,null,null,null,12.55648725,13.651279150000001,14.820206560000001,15.802933149999999,16.77703932,17.773558569999999,18.752836989999999]
[null,null,null,null,"Coincident",null,null,null,null,null,null,null,null,null,null,null,12.55648725,13.651279150000001,14.820206560000001,15.802933149999999,16.77703932,17.773558569999999,18.752836989999999]
[null,null,"WEATHER CORRECTED MD 10% POE","MW","Non-coincident",null,null,null,null,null,null,null,null,null,null,null,442.71326870000001,437.98837209999999,434.58852059999998,418.61658139999997,403.79924590000002,390.07601460000001,380.21044380000001]
[null,null,null,null,"Coincident",null,null,null,null,null,null,null,null,null,null,null,411.70231339999998,403.43594280000002,403.27709060000001,385.49480319999998,375.80336929999999,363.0723921,353.93380509999997]
[null,null,"WEATHER CORRECTED MD 10% POE","MVA","Non-coincident",null,null,null,null,null,null,null,null,null,null,null,444.86789299999998,440.12000110000002,436.70360290000002,420.6539305,405.76448110000001,391.97446070000001,382.06087550000001]
[null,null,null,null,"Coincident",null,null,null,null,null,null,null,null,null,null,null,413.7060118,405.3994098,405.23978449999998,387.37095319999997,377.63235250000002,364.83941529999998,355.65635209999999]
[null,null,"WEATHER CORRECTED MD 50% POE","MW","Non-coincident",null,null,null,null,null,null,null,null,null,null,null,403.19429459999998,398.31172670000001,390.02115459999999,377.19216829999999,365.11225009999998,349.55824489999998,342.63096780000001]
[null,null,null,null,"Coincident",null,null,null,null,null,null,null,null,null,null,null,364.2495419,356.3586894,347.39221859999998,336.706028,330.10092320000001,316.07833549999998,309.85304350000001]
[null,null,"WEATHER CORRECTED MD 50% POE","MVA","Non-coincident",null,null,null,null,null,null,null,null,null,null,null,405.15658560000003,400.25025490000002,391.9193338,379.02791050000002,366.88920109999998,351.25949659999998,344.29850540000001]
[null,null,null,null,"Coincident",null,null,null,null,null,null,null,null,null,null,null,366.02229419999998,358.09303790000001,349.08292849999998,338.34472970000002,331.70747879999999,317.61664519999999,311.36105550000002]
[null,"Whyalla and Whyalla Central","CONNECTION POINT RATING","MVA","Non-coincident",null,null,null,null,null,null,null,null,null,null,null,300.5,300.5,300.5,300.5,300.5,300.5,300.5]
[null,null,null,null,"Coincident",null,null,null,null,null,null,null,null,null,null,null,300.5,300.5,300.5,300.5,300.5,300.5,300.5]
[null,null,"WINTER/SUMMER PEAKING",null,"Non-coincident",null,null,null,null,null,null,null,null,null,null,null,"Summer","Summer","Summer","Summer","Summer","Summer","Summer"]
[null,null,null,null,"Coincident",null,null,null,null,null,null,null,null,null,null,null,"Summer","Summer","Summer","Summer","Summer","Summer","Summer"]
[null,null,"ADJUSTMENTS - EMBEDDED GENERATION","MW","Non-coincident",null,null,null,null,null,null,null,null,null,null,null,2.0601625270000001,2.2397867480000002,2.4315745,2.59281199,2.752635116,2.9161355879999999,3.0768073330000001]
[null,null,null,null,"Coincident",null,null,null,null,null,null,null,null,null,null,null,2.0601625270000001,2.2397867480000002,2.4315745,2.59281199,2.752635116,2.9161355879999999,3.0768073330000001]
[null,null,"WEATHER CORRECTED MD 10% POE","MW","Non-coincident",null,null,null,null,null,null,null,null,null,null,null,82.394979399999997,81.585600409999998,81.179607270000005,78.527780489999998,76.189002209999998,74.01125279,72.684640779999995]
[null,null,null,null,"Coincident",null,null,null,null,null,null,null,null,null,null,null,62.226685410000002,61.029620680000001,61.176890190000002,58.727372920000001,57.584102440000002,55.944434129999998,54.948494940000003]
[null,null,"WEATHER CORRECTED MD 10% POE","MVA","Non-coincident",null,null,null,null,null,null,null,null,null,null,null,86.499545350000005,85.64984656,85.223628579999996,82.439699110000006,79.984412890000002,77.698177290000004,76.305479129999995]
[null,null,null,null,"Coincident",null,null,null,null,null,null,null,null,null,null,null,65.326553099999998,64.069855709999999,64.224461559999995,61.652919799999999,60.452696469999999,58.731346889999998,57.685794260000002]
[null,null,"WEATHER CORRECTED MD 50% POE","MW","Non-coincident",null,null,null,null,null,null,null,null,null,null,null,73.950193119999994,73.276849369999994,72.058962769999994,70.09279789,68.268086440000005,65.897043019999998,65.189670820000003]
[null,null,null,null,"Coincident",null,null,null,null,null,null,null,null,null,null,null,54.25491641,53.240999299999999,52.123681099999999,50.813226309999997,50.124864789999997,48.390070690000002,47.876576880000002]
[null,null,"WEATHER CORRECTED MD 50% POE","MVA","Non-coincident",null,null,null,null,null,null,null,null,null,null,null,77.634075890000005,76.927189029999994,75.648632520000007,73.584521699999996,71.668910929999996,69.179752250000007,68.437141780000005]
[null,null,null,null,"Coincident",null,null,null,null,null,null,null,null,null,null,null,56.957664620000003,55.893238490000002,54.720260260000003,53.344524210000003,52.621871460000001,50.80065733,50.261583450000003]
[null,null,"CONNECTION POINT RATING","MVA","Non-coincident"]
[null,null,null,null,"Coincident"]
[null,null,"WINTER/SUMMER PEAKING",null,"Non-coincident"]
[null,null,null,null,"Coincident"]
[null,null,"ADJUSTMENTS - EMBEDDED GENERATION","MW","Non-coincident"]
[null,null,null,null,"Coincident"]
[null,null,"WEATHER CORRECTED MD 10% POE","MW","Non-coincident"]
[null,null,null,null,"Coincident"]
[null,null,"WEATHER CORRECTED MD 10% POE","MVA","Non-coincident"]
[null,null,null,null,"Coincident"]
[null,null,"WEATHER CORRECTED MD 50% POE","MW","Non-coincident"]
[null,null,null,null,"Coincident"]
[null,null,"WEATHER CORRECTED MD 50% POE","MVA","Non-coincident"]
[null,null,null,null,"Coincident"]
[null,"Wudinna","CONNECTION POINT RATING","MVA","Non-coincident",null,null,null,null,null,null,null,null,null,null,null,58.3,58.3,58.3,58.3,58.3,58.3,58.3]
[null,null,null,null,"Coincident",null,null,null,null,null,null,null,null,null,null,null,58.3,58.3,58.3,58.3,58.3,58.3,58.3]
[null,null,"WINTER/SUMMER PEAKING",null,"Non-coincident",null,null,null,null,null,null,null,null,null,null,null,"Summer","Summer","Summer","Summer","Summer","Summer","Summer"]
[null,null,null,null,"Coincident",null,null,null,null,null,null,null,null,null,null,null,"Summer","Summer","Summer","Summer","Summer","Summer","Summer"]
[null,null,"ADJUSTMENTS - EMBEDDED GENERATION","MW","Non-coincident",null,null,null,null,null,null,null,null,null,null,null,0.850662943,0.92483168800000004,1.004022883,1.070599552,1.1365922150000001,1.204103293,1.2704463589999999]
[null,null,null,null,"Coincident",null,null,null,null,null,null,null,null,null,null,null,0.850662943,0.92483168800000004,1.004022883,1.070599552,1.1365922150000001,1.204103293,1.2704463589999999]
[null,null,"WEATHER CORRECTED MD 10% POE","MW","Non-coincident",null,null,null,null,null,null,null,null,null,null,null,14.994078099999999,14.79638149,14.651418919999999,14.09262652,13.5832587,13.09658458,12.73605006]
[null,null,null,null,"Coincident",null,null,null,null,null,null,null,null,null,null,null,12.141651080000001,11.867650210000001,11.83865044,11.30033332,11.00769401,10.614492690000001,10.323571530000001]
[null,null,"WEATHER CORRECTED MD 10% POE","MVA","Non-coincident",null,null,null,null,null,null,null,null,null,null,null,16.802061779999999,16.580526939999999,16.418084799999999,15.791913299999999,15.221125990000001,14.67576878,14.271761059999999]
[null,null,null,null,"Coincident",null,null,null,null,null,null,null,null,null,null,null,13.605689529999999,13.29864968,13.26615312,12.66292582,12.335000089999999,11.894386620000001,11.56838623]
[null,null,"WEATHER CORRECTED MD 50% POE","MW","Non-coincident",null,null,null,null,null,null,null,null,null,null,null,13.7656288,13.59338926,13.31281828,12.88656304,12.47917367,11.94781034,11.712207940000001]
[null,null,null,null,"Coincident",null,null,null,null,null,null,null,null,null,null,null,10.828739369999999,10.58983576,10.32521579,10.0166509,9.8243397659999996,9.4072072089999992,9.2228498479999992]
[null,null,"WEATHER CORRECTED MD 50% POE","MVA","Non-coincident",null,null,null,null,null,null,null,null,null,null,null,15.42548624,15.232478090000001,14.9180759,14.44042288,13.983910549999999,13.38847552,13.124464209999999]
[null,null,null,null,"Coincident",null,null,null,null,null,null,null,null,null,null,null,12.134467130000001,11.866756560000001,11.57022875,11.22445716,11.008957179999999,10.54152684,10.334939690000001]
[null,"Yadnarie","CONNECTION POINT RATING","MVA","Non-coincident",null,null,null,null,null,null,null,null,null,null,null,46.4,46.4,46.4,46.4,46.4,46.4,46.4]
[null,null,null,null,"Coincident",null,null,null,null,null,null,null,null,null,null,null,46.4,46.4,46.4,46.4,46.4,46.4,46.4]
[null,null,"WINTER/SUMMER PEAKING",null,"Non-coincident",null,null,null,null,null,null,null,null,null,null,null,"Summer","Summer","Summer","Summer","Summer","Summer","Summer"]
[null,null,null,null,"Coincident",null,null,null,null,null,null,null,null,null,null,null,"Summer","Summer","Summer","Summer","Summer","Summer","Summer"]
[null,null,"ADJUSTMENTS - EMBEDDED GENERATION","MW","Non-coincident",null,null,null,null,null,null,null,null,null,null,null,0.58597661000000001,0.63706752700000002,0.69161814300000002,0.73747928100000004,0.78293812900000004,0.82944293199999997,0.87514315300000001]
[null,null,null,null,"Coincident",null,null,null,null,null,null,null,null,null,null,null,0.58597661000000001,0.63706752700000002,0.69161814300000002,0.73747928100000004,0.78293812900000004,0.82944293199999997,0.87514315300000001]
[null,null,"WEATHER CORRECTED MD 10% POE","MW","Non-coincident",null,null,null,null,null,null,null,null,null,null,null,9.2648153170000001,9.1688306300000004,9.1079018789999999,8.7918091619999998,8.507834205,8.2377598899999995,8.045971583]
[null,null,null,null,"Coincident",null,null,null,null,null,null,null,null,null,null,null,6.3391171630000001,6.2137989930000002,6.2183460569999998,5.9567804969999996,5.825663928,5.6413669820000001,5.5107123319999998]
[null,null,"WEATHER CORRECTED MD 10% POE","MVA","Non-coincident",null,null,null,null,null,null,null,null,null,null,null,9.5555492159999993,9.4565524879999998,9.3937117669999992,9.0676999239999994,8.7748137110000002,8.4962643470000003,8.2984576400000005]
[null,null,null,null,"Coincident",null,null,null,null,null,null,null,null,null,null,null,6.5380413930000003,6.4087906849999996,6.4134804369999996,6.1437068369999999,6.0084757729999998,5.8183955100000002,5.6836408609999998]
[null,null,"WEATHER CORRECTED MD 50% POE","MW","Non-coincident",null,null,null,null,null,null,null,null,null,null,null,8.4483817279999993,8.3771383490000009,8.2410390230000008,8.0163648179999996,7.8046497060000002,7.5145231309999998,7.409015203]
[null,null,null,null,"Coincident",null,null,null,null,null,null,null,null,null,null,null,5.6155126280000003,5.5143101799999998,5.4006388530000002,5.2649826129999999,5.191645061,4.9992844549999997,4.9297044469999998]
[null,null,"WEATHER CORRECTED MD 50% POE","MVA","Non-coincident",null,null,null,null,null,null,null,null,null,null,null,8.7134955890000008,8.6400165619999996,8.4996463809999998,8.267921802,8.0495629789999992,7.7503321060000001,7.6415132940000001]
[null,null,null,null,"Coincident",null,null,null,null,null,null,null,null,null,null,null,5.7917298349999999,5.6873516110000004,5.5701132280000003,5.4302000369999996,5.3545611219999998,5.156164156,5.0844006970000004]
[null,"NSP to enter name","CONNECTION POINT RATING","MVA","Non-coincident"]
[null,null,null,null,"Coincident"]
[null,null,"WINTER/SUMMER PEAKING",null,"Non-coincident"]
[null,null,null,null,"Coincident"]
[null,null,"ADJUSTMENTS - EMBEDDED GENERATION","MW","Non-coincident"]
[null,null,null,null,"Coincident"]
[null,null,"WEATHER CORRECTED MD 10% POE","MW","Non-coincident"]
[null,null,null,null,"Coincident"]
[null,null,"WEATHER CORRECTED MD 10% POE","MVA","Non-coincident"]
[null,null,null,null,"Coincident"]
[null,null,"WEATHER CORRECTED MD 50% POE","MW","Non-coincident"]
[null,null,null,null,"Coincident"]
[null,null,"WEATHER CORRECTED MD 50% POE","MVA","Non-coincident"]
[null,null,null,null,"Coincident"]
[null,"NSP to enter name","CONNECTION POINT RATING","MVA","Non-coincident"]
[null,null,null,null,"Coincident"]
[null,null,"WINTER/SUMMER PEAKING",null,"Non-coincident"]
[null,null,null,null,"Coincident"]
[null,null,"ADJUSTMENTS - EMBEDDED GENERATION","MW","Non-coincident"]
[null,null,null,null,"Coincident"]
[null,null,"WEATHER CORRECTED MD 10% POE","MW","Non-coincident"]
[null,null,null,null,"Coincident"]
[null,null,"WEATHER CORRECTED MD 10% POE","MVA","Non-coincident"]
[null,null,null,null,"Coincident"]
[null,null,"WEATHER CORRECTED MD 50% POE","MW","Non-coincident"]
[null,null,null,null,"Coincident"]
[null,null,"WEATHER CORRECTED MD 50% POE","MVA","Non-coincident"]
[null,null,null,null,"Coincident"]
[null,"NSP to enter name","CONNECTION POINT RATING","MVA","Non-coincident"]
[null,null,null,null,"Coincident"]
[null,null,"WINTER/SUMMER PEAKING",null,"Non-coincident"]
[null,null,null,null,"Coincident"]
[null,null,"ADJUSTMENTS - EMBEDDED GENERATION","MW","Non-coincident"]
[null,null,null,null,"Coincident"]
[null,null,"WEATHER CORRECTED MD 10% POE","MW","Non-coincident"]
[null,null,null,null,"Coincident"]
[null,null,"WEATHER CORRECTED MD 10% POE","MVA","Non-coincident"]
[null,null,null,null,"Coincident"]
[null,null,"WEATHER CORRECTED MD 50% POE","MW","Non-coincident"]
[null,null,null,null,"Coincident"]
[null,null,"WEATHER CORRECTED MD 50% POE","MVA","Non-coincident"]
[null,null,null,null,"Coincident"]
[null,"NSP to enter name","CONNECTION POINT RATING","MVA","Non-coincident"]
[null,null,null,null,"Coincident"]
[null,null,"WINTER/SUMMER PEAKING",null,"Non-coincident"]
[null,null,null,null,"Coincident"]
[null,null,"ADJUSTMENTS - EMBEDDED GENERATION","MW","Non-coincident"]
[null,null,null,null,"Coincident"]
[null,null,"WEATHER CORRECTED MD 10% POE","MW","Non-coincident"]
[null,null,null,null,"Coincident"]
[null,null,"WEATHER CORRECTED MD 10% POE","MVA","Non-coincident"]
[null,null,null,null,"Coincident"]
[null,null,"WEATHER CORRECTED MD 50% POE","MW","Non-coincident"]
[null,null,null,null,"Coincident"]
[null,null,"WEATHER CORRECTED MD 50% POE","MVA","Non-coincident"]
[null,null,null,null,"Coincident"]
[null,"NSP to enter name","CONNECTION POINT RATING","MVA","Non-coincident"]
[null,null,null,null,"Coincident"]
[null,null,"WINTER/SUMMER PEAKING",null,"Non-coincident"]
[null,null,null,null,"Coincident"]
[null,null,"ADJUSTMENTS - EMBEDDED GENERATION","MW","Non-coincident"]
[null,null,null,null,"Coincident"]
[null,null,"WEATHER CORRECTED MD 10% POE","MW","Non-coincident"]
[null,null,null,null,"Coincident"]
[null,null,"WEATHER CORRECTED MD 10% POE","MVA","Non-coincident"]
[null,null,null,null,"Coincident"]
[null,null,"WEATHER CORRECTED MD 50% POE","MW","Non-coincident"]
[null,null,null,null,"Coincident"]
[null,null,"WEATHER CORRECTED MD 50% POE","MVA","Non-coincident"]
[null,null,null,null,"Coincident"]
[null,"NSP to enter name","CONNECTION POINT RATING","MVA","Non-coincident"]
[null,null,null,null,"Coincident"]
[null,null,"WINTER/SUMMER PEAKING",null,"Non-coincident"]
[null,null,null,null,"Coincident"]
[null,null,"ADJUSTMENTS - EMBEDDED GENERATION","MW","Non-coincident"]
[null,null,null,null,"Coincident"]
[null,null,"WEATHER CORRECTED MD 10% POE","MW","Non-coincident"]
[null,null,null,null,"Coincident"]
[null,null,"WEATHER CORRECTED MD 10% POE","MVA","Non-coincident"]
[null,null,null,null,"Coincident"]
[null,null,"WEATHER CORRECTED MD 50% POE","MW","Non-coincident"]
[null,null,null,null,"Coincident"]
[null,null,"WEATHER CORRECTED MD 50% POE","MVA","Non-coincident"]
[null,null,null,null,"Coincident"]
[null,"NSP to enter name","CONNECTION POINT RATING","MVA","Non-coincident"]
[null,null,null,null,"Coincident"]
[null,null,"WINTER/SUMMER PEAKING",null,"Non-coincident"]
[null,null,null,null,"Coincident"]
[null,null,"ADJUSTMENTS - EMBEDDED GENERATION","MW","Non-coincident"]
[null,null,null,null,"Coincident"]
[null,null,"WEATHER CORRECTED MD 10% POE","MW","Non-coincident"]
[null,null,null,null,"Coincident"]
[null,null,"WEATHER CORRECTED MD 10% POE","MVA","Non-coincident"]
[null,null,null,null,"Coincident"]
[null,null,"WEATHER CORRECTED MD 50% POE","MW","Non-coincident"]
[null,null,null,null,"Coincident"]
[null,null,"WEATHER CORRECTED MD 50% POE","MVA","Non-coincident"]
[null,null,null,null,"Coincident"]
[null,"NSP to enter name","CONNECTION POINT RATING","MVA","Non-coincident"]
[null,null,null,null,"Coincident"]
[null,null,"WINTER/SUMMER PEAKING",null,"Non-coincident"]
[null,null,null,null,"Coincident"]
[null,null,"ADJUSTMENTS - EMBEDDED GENERATION","MW","Non-coincident"]
[null,null,null,null,"Coincident"]
[null,null,"WEATHER CORRECTED MD 10% POE","MW","Non-coincident"]
[null,null,null,null,"Coincident"]
[null,null,"WEATHER CORRECTED MD 10% POE","MVA","Non-coincident"]
[null,null,null,null,"Coincident"]
[null,null,"WEATHER CORRECTED MD 50% POE","MW","Non-coincident"]
[null,null,null,null,"Coincident"]
[null,null,"WEATHER CORRECTED MD 50% POE","MVA","Non-coincident"]
[null,null,null,null,"Coincident"]
[null,"NSP to enter name","CONNECTION POINT RATING","MVA","Non-coincident"]
[null,null,null,null,"Coincident"]
[null,null,"WINTER/SUMMER PEAKING",null,"Non-coincident"]
[null,null,null,null,"Coincident"]
[null,null,"ADJUSTMENTS - EMBEDDED GENERATION","MW","Non-coincident"]
[null,null,null,null,"Coincident"]
[null,null,"WEATHER CORRECTED MD 10% POE","MW","Non-coincident"]
[null,null,null,null,"Coincident"]
[null,null,"WEATHER CORRECTED MD 10% POE","MVA","Non-coincident"]
[null,null,null,null,"Coincident"]
[null,null,"WEATHER CORRECTED MD 50% POE","MW","Non-coincident"]
[null,null,null,null,"Coincident"]
[null,null,"WEATHER CORRECTED MD 50% POE","MVA","Non-coincident"]
[null,null,null,null,"Coincident"]
[null,"NSP to enter name","CONNECTION POINT RATING","MVA","Non-coincident"]
[null,null,null,null,"Coincident"]
[null,null,"WINTER/SUMMER PEAKING",null,"Non-coincident"]
[null,null,null,null,"Coincident"]
[null,null,"ADJUSTMENTS - EMBEDDED GENERATION","MW","Non-coincident"]
[null,null,null,null,"Coincident"]
[null,null,"WEATHER CORRECTED MD 10% POE","MW","Non-coincident"]
[null,null,null,null,"Coincident"]
[null,null,"WEATHER CORRECTED MD 10% POE","MVA","Non-coincident"]
[null,null,null,null,"Coincident"]
[null,null,"WEATHER CORRECTED MD 50% POE","MW","Non-coincident"]
[null,null,null,null,"Coincident"]
[null,null,"WEATHER CORRECTED MD 50% POE","MVA","Non-coincident"]
[null,null,null,null,"Coincident"]
[null,"NSP to enter name","CONNECTION POINT RATING","MVA","Non-coincident"]
[null,null,null,null,"Coincident"]
[null,null,"WINTER/SUMMER PEAKING",null,"Non-coincident"]
[null,null,null,null,"Coincident"]
[null,null,"ADJUSTMENTS - EMBEDDED GENERATION","MW","Non-coincident"]
[null,null,null,null,"Coincident"]
[null,null,"WEATHER CORRECTED MD 10% POE","MW","Non-coincident"]
[null,null,null,null,"Coincident"]
[null,null,"WEATHER CORRECTED MD 10% POE","MVA","Non-coincident"]
[null,null,null,null,"Coincident"]
[null,null,"WEATHER CORRECTED MD 50% POE","MW","Non-coincident"]
[null,null,null,null,"Coincident"]
[null,null,"WEATHER CORRECTED MD 50% POE","MVA","Non-coincident"]
[null,null,null,null,"Coincident"]
[null,"NSP to enter name","CONNECTION POINT RATING","MVA","Non-coincident"]
[null,null,null,null,"Coincident"]
[null,null,"WINTER/SUMMER PEAKING",null,"Non-coincident"]
[null,null,null,null,"Coincident"]
[null,null,"ADJUSTMENTS - EMBEDDED GENERATION","MW","Non-coincident"]
[null,null,null,null,"Coincident"]
[null,null,"WEATHER CORRECTED MD 10% POE","MW","Non-coincident"]
[null,null,null,null,"Coincident"]
[null,null,"WEATHER CORRECTED MD 10% POE","MVA","Non-coincident"]
[null,null,null,null,"Coincident"]
[null,null,"WEATHER CORRECTED MD 50% POE","MW","Non-coincident"]
[null,null,null,null,"Coincident"]
[null,null,"WEATHER CORRECTED MD 50% POE","MVA","Non-coincident"]
[null,null,null,null,"Coincident"]
[null,"NSP to enter name","CONNECTION POINT RATING","MVA","Non-coincident"]
[null,null,null,null,"Coincident"]
[null,null,"WINTER/SUMMER PEAKING",null,"Non-coincident"]
[null,null,null,null,"Coincident"]
[null,null,"ADJUSTMENTS - EMBEDDED GENERATION","MW","Non-coincident"]
[null,null,null,null,"Coincident"]
[null,null,"WEATHER CORRECTED MD 10% POE","MW","Non-coincident"]
[null,null,null,null,"Coincident"]
[null,null,"WEATHER CORRECTED MD 10% POE","MVA","Non-coincident"]
[null,null,null,null,"Coincident"]
[null,null,"WEATHER CORRECTED MD 50% POE","MW","Non-coincident"]
[null,null,null,null,"Coincident"]
[null,null,"WEATHER CORRECTED MD 50% POE","MVA","Non-coincident"]
[null,null,null,null,"Coincident"]
[null,"NSP to enter name","CONNECTION POINT RATING","MVA","Non-coincident"]
[null,null,null,null,"Coincident"]
[null,null,"WINTER/SUMMER PEAKING",null,"Non-coincident"]
[null,null,null,null,"Coincident"]
[null,null,"ADJUSTMENTS - EMBEDDED GENERATION","MW","Non-coincident"]
[null,null,null,null,"Coincident"]
[null,null,"WEATHER CORRECTED MD 10% POE","MW","Non-coincident"]
[null,null,null,null,"Coincident"]
[null,null,"WEATHER CORRECTED MD 10% POE","MVA","Non-coincident"]
[null,null,null,null,"Coincident"]
[null,null,"WEATHER CORRECTED MD 50% POE","MW","Non-coincident"]
[null,null,null,null,"Coincident"]
[null,null,"WEATHER CORRECTED MD 50% POE","MVA","Non-coincident"]
[null,null,null,null,"Coincident"]
[null,"NSP to enter name","CONNECTION POINT RATING","MVA","Non-coincident"]
[null,null,null,null,"Coincident"]
[null,null,"WINTER/SUMMER PEAKING",null,"Non-coincident"]
[null,null,null,null,"Coincident"]
[null,null,"ADJUSTMENTS - EMBEDDED GENERATION","MW","Non-coincident"]
[null,null,null,null,"Coincident"]
[null,null,"WEATHER CORRECTED MD 10% POE","MW","Non-coincident"]
[null,null,null,null,"Coincident"]
[null,null,"WEATHER CORRECTED MD 10% POE","MVA","Non-coincident"]
[null,null,null,null,"Coincident"]
[null,null,"WEATHER CORRECTED MD 50% POE","MW","Non-coincident"]
[null,null,null,null,"Coincident"]
[null,null,"WEATHER CORRECTED MD 50% POE","MVA","Non-coincident"]
[null,null,null,null,"Coincident"]
[null,"NSP to enter name","CONNECTION POINT RATING","MVA","Non-coincident"]
[null,null,null,null,"Coincident"]
[null,null,"WINTER/SUMMER PEAKING",null,"Non-coincident"]
[null,null,null,null,"Coincident"]
[null,null,"ADJUSTMENTS - EMBEDDED GENERATION","MW","Non-coincident"]
[null,null,null,null,"Coincident"]
[null,null,"WEATHER CORRECTED MD 10% POE","MW","Non-coincident"]
[null,null,null,null,"Coincident"]
[null,null,"WEATHER CORRECTED MD 10% POE","MVA","Non-coincident"]
[null,null,null,null,"Coincident"]
[null,null,"WEATHER CORRECTED MD 50% POE","MW","Non-coincident"]
[null,null,null,null,"Coincident"]
[null,null,"WEATHER CORRECTED MD 50% POE","MVA","Non-coincident"]
[null,null,null,null,"Coincident"]
[null,"NSP to enter name","CONNECTION POINT RATING","MVA","Non-coincident"]
[null,null,null,null,"Coincident"]
[null,null,"WINTER/SUMMER PEAKING",null,"Non-coincident"]
[null,null,null,null,"Coincident"]
[null,null,"ADJUSTMENTS - EMBEDDED GENERATION","MW","Non-coincident"]
[null,null,null,null,"Coincident"]
[null,null,"WEATHER CORRECTED MD 10% POE","MW","Non-coincident"]
[null,null,null,null,"Coincident"]
[null,null,"WEATHER CORRECTED MD 10% POE","MVA","Non-coincident"]
[null,null,null,null,"Coincident"]
[null,null,"WEATHER CORRECTED MD 50% POE","MW","Non-coincident"]
[null,null,null,null,"Coincident"]
[null,null,"WEATHER CORRECTED MD 50% POE","MVA","Non-coincident"]
[null,null,null,null,"Coincident"]
[null,"NSP to enter name","CONNECTION POINT RATING","MVA","Non-coincident"]
[null,null,null,null,"Coincident"]
[null,null,"WINTER/SUMMER PEAKING",null,"Non-coincident"]
[null,null,null,null,"Coincident"]
[null,null,"ADJUSTMENTS - EMBEDDED GENERATION","MW","Non-coincident"]
[null,null,null,null,"Coincident"]
[null,null,"WEATHER CORRECTED MD 10% POE","MW","Non-coincident"]
[null,null,null,null,"Coincident"]
[null,null,"WEATHER CORRECTED MD 10% POE","MVA","Non-coincident"]
[null,null,null,null,"Coincident"]
[null,null,"WEATHER CORRECTED MD 50% POE","MW","Non-coincident"]
[null,null,null,null,"Coincident"]
[null,null,"WEATHER CORRECTED MD 50% POE","MVA","Non-coincident"]
[null,null,null,null,"Coincident"]
[null,"NSP to enter name","CONNECTION POINT RATING","MVA","Non-coincident"]
[null,null,null,null,"Coincident"]
[null,null,"WINTER/SUMMER PEAKING",null,"Non-coincident"]
[null,null,null,null,"Coincident"]
[null,null,"ADJUSTMENTS - EMBEDDED GENERATION","MW","Non-coincident"]
[null,null,null,null,"Coincident"]
[null,null,"WEATHER CORRECTED MD 10% POE","MW","Non-coincident"]
[null,null,null,null,"Coincident"]
[null,null,"WEATHER CORRECTED MD 10% POE","MVA","Non-coincident"]
[null,null,null,null,"Coincident"]
[null,null,"WEATHER CORRECTED MD 50% POE","MW","Non-coincident"]
[null,null,null,null,"Coincident"]
[null,null,"WEATHER CORRECTED MD 50% POE","MVA","Non-coincident"]
[null,null,null,null,"Coincident"]
[null,"NSP to enter name","CONNECTION POINT RATING","MVA","Non-coincident"]
[null,null,null,null,"Coincident"]
[null,null,"WINTER/SUMMER PEAKING",null,"Non-coincident"]
[null,null,null,null,"Coincident"]
[null,null,"ADJUSTMENTS - EMBEDDED GENERATION","MW","Non-coincident"]
[null,null,null,null,"Coincident"]
[null,null,"WEATHER CORRECTED MD 10% POE","MW","Non-coincident"]
[null,null,null,null,"Coincident"]
[null,null,"WEATHER CORRECTED MD 10% POE","MVA","Non-coincident"]
[null,null,null,null,"Coincident"]
[null,null,"WEATHER CORRECTED MD 50% POE","MW","Non-coincident"]
[null,null,null,null,"Coincident"]
[null,null,"WEATHER CORRECTED MD 50% POE","MVA","Non-coincident"]
[null,null,null,null,"Coincident"]
[null,"NSP to enter name","CONNECTION POINT RATING","MVA","Non-coincident"]
[null,null,null,null,"Coincident"]
[null,null,"WINTER/SUMMER PEAKING",null,"Non-coincident"]
[null,null,null,null,"Coincident"]
[null,null,"ADJUSTMENTS - EMBEDDED GENERATION","MW","Non-coincident"]
[null,null,null,null,"Coincident"]
[null,null,"WEATHER CORRECTED MD 10% POE","MW","Non-coincident"]
[null,null,null,null,"Coincident"]
[null,null,"WEATHER CORRECTED MD 10% POE","MVA","Non-coincident"]
[null,null,null,null,"Coincident"]
[null,null,"WEATHER CORRECTED MD 50% POE","MW","Non-coincident"]
[null,null,null,null,"Coincident"]
[null,null,"WEATHER CORRECTED MD 50% POE","MVA","Non-coincident"]
[null,null,null,null,"Coincident"]
[null,"NSP to enter name","CONNECTION POINT RATING","MVA","Non-coincident"]
[null,null,null,null,"Coincident"]
[null,null,"WINTER/SUMMER PEAKING",null,"Non-coincident"]
[null,null,null,null,"Coincident"]
[null,null,"ADJUSTMENTS - EMBEDDED GENERATION","MW","Non-coincident"]
[null,null,null,null,"Coincident"]
[null,null,"WEATHER CORRECTED MD 10% POE","MW","Non-coincident"]
[null,null,null,null,"Coincident"]
[null,null,"WEATHER CORRECTED MD 10% POE","MVA","Non-coincident"]
[null,null,null,null,"Coincident"]
[null,null,"WEATHER CORRECTED MD 50% POE","MW","Non-coincident"]
[null,null,null,null,"Coincident"]
[null,null,"WEATHER CORRECTED MD 50% POE","MVA","Non-coincident"]
[null,null,null,null,"Coincident"]
[null,"NSP to enter name","CONNECTION POINT RATING","MVA","Non-coincident"]
[null,null,null,null,"Coincident"]
[null,null,"WINTER/SUMMER PEAKING",null,"Non-coincident"]
[null,null,null,null,"Coincident"]
[null,null,"ADJUSTMENTS - EMBEDDED GENERATION","MW","Non-coincident"]
[null,null,null,null,"Coincident"]
[null,null,"WEATHER CORRECTED MD 10% POE","MW","Non-coincident"]
[null,null,null,null,"Coincident"]
[null,null,"WEATHER CORRECTED MD 10% POE","MVA","Non-coincident"]
[null,null,null,null,"Coincident"]
[null,null,"WEATHER CORRECTED MD 50% POE","MW","Non-coincident"]
[null,null,null,null,"Coincident"]
[null,null,"WEATHER CORRECTED MD 50% POE","MVA","Non-coincident"]
[null,null,null,null,"Coincident"]
[null,"NSP to enter name","CONNECTION POINT RATING","MVA","Non-coincident"]
[null,null,null,null,"Coincident"]
[null,null,"WINTER/SUMMER PEAKING",null,"Non-coincident"]
[null,null,null,null,"Coincident"]
[null,null,"ADJUSTMENTS - EMBEDDED GENERATION","MW","Non-coincident"]
[null,null,null,null,"Coincident"]
[null,null,"WEATHER CORRECTED MD 10% POE","MW","Non-coincident"]
[null,null,null,null,"Coincident"]
[null,null,"WEATHER CORRECTED MD 10% POE","MVA","Non-coincident"]
[null,null,null,null,"Coincident"]
[null,null,"WEATHER CORRECTED MD 50% POE","MW","Non-coincident"]
[null,null,null,null,"Coincident"]
[null,null,"WEATHER CORRECTED MD 50% POE","MVA","Non-coincident"]
[null,null,null,null,"Coincident"]
[null,"NSP to enter name","CONNECTION POINT RATING","MVA","Non-coincident"]
[null,null,null,null,"Coincident"]
[null,null,"WINTER/SUMMER PEAKING",null,"Non-coincident"]
[null,null,null,null,"Coincident"]
[null,null,"ADJUSTMENTS - EMBEDDED GENERATION","MW","Non-coincident"]
[null,null,null,null,"Coincident"]
[null,null,"WEATHER CORRECTED MD 10% POE","MW","Non-coincident"]
[null,null,null,null,"Coincident"]
[null,null,"WEATHER CORRECTED MD 10% POE","MVA","Non-coincident"]
[null,null,null,null,"Coincident"]
[null,null,"WEATHER CORRECTED MD 50% POE","MW","Non-coincident"]
[null,null,null,null,"Coincident"]
[null,null,"WEATHER CORRECTED MD 50% POE","MVA","Non-coincident"]
[null,null,null,null,"Coincident"]
[null,"NSP to enter name","CONNECTION POINT RATING","MVA","Non-coincident"]
[null,null,null,null,"Coincident"]
[null,null,"WINTER/SUMMER PEAKING",null,"Non-coincident"]
[null,null,null,null,"Coincident"]
[null,null,"ADJUSTMENTS - EMBEDDED GENERATION","MW","Non-coincident"]
[null,null,null,null,"Coincident"]
[null,null,"WEATHER CORRECTED MD 10% POE","MW","Non-coincident"]
[null,null,null,null,"Coincident"]
[null,null,"WEATHER CORRECTED MD 10% POE","MVA","Non-coincident"]
[null,null,null,null,"Coincident"]
[null,null,"WEATHER CORRECTED MD 50% POE","MW","Non-coincident"]
[null,null,null,null,"Coincident"]
[null,null,"WEATHER CORRECTED MD 50% POE","MVA","Non-coincident"]
[null,null,null,null,"Coincident"]
[null,"NSP to enter name","CONNECTION POINT RATING","MVA","Non-coincident"]
[null,null,null,null,"Coincident"]
[null,null,"WINTER/SUMMER PEAKING",null,"Non-coincident"]
[null,null,null,null,"Coincident"]
[null,null,"ADJUSTMENTS - EMBEDDED GENERATION","MW","Non-coincident"]
[null,null,null,null,"Coincident"]
[null,null,"WEATHER CORRECTED MD 10% POE","MW","Non-coincident"]
[null,null,null,null,"Coincident"]
[null,null,"WEATHER CORRECTED MD 10% POE","MVA","Non-coincident"]
[null,null,null,null,"Coincident"]
[null,null,"WEATHER CORRECTED MD 50% POE","MW","Non-coincident"]
[null,null,null,null,"Coincident"]
[null,null,"WEATHER CORRECTED MD 50% POE","MVA","Non-coincident"]
[null,null,null,null,"Coincident"]
[null,"NSP to enter name","CONNECTION POINT RATING","MVA","Non-coincident"]
[null,null,null,null,"Coincident"]
[null,null,"WINTER/SUMMER PEAKING",null,"Non-coincident"]
[null,null,null,null,"Coincident"]
[null,null,"ADJUSTMENTS - EMBEDDED GENERATION","MW","Non-coincident"]
[null,null,null,null,"Coincident"]
[null,null,"WEATHER CORRECTED MD 10% POE","MW","Non-coincident"]
[null,null,null,null,"Coincident"]
[null,null,"WEATHER CORRECTED MD 10% POE","MVA","Non-coincident"]
[null,null,null,null,"Coincident"]
[null,null,"WEATHER CORRECTED MD 50% POE","MW","Non-coincident"]
[null,null,null,null,"Coincident"]
[null,null,"WEATHER CORRECTED MD 50% POE","MVA","Non-coincident"]
[null,null,null,null,"Coincident"]
[null,"NSP to enter name","CONNECTION POINT RATING","MVA","Non-coincident"]
[null,null,null,null,"Coincident"]
[null,null,"WINTER/SUMMER PEAKING",null,"Non-coincident"]
[null,null,null,null,"Coincident"]
[null,null,"ADJUSTMENTS - EMBEDDED GENERATION","MW","Non-coincident"]
[null,null,null,null,"Coincident"]
[null,null,"WEATHER CORRECTED MD 10% POE","MW","Non-coincident"]
[null,null,null,null,"Coincident"]
[null,null,"WEATHER CORRECTED MD 10% POE","MVA","Non-coincident"]
[null,null,null,null,"Coincident"]
[null,null,"WEATHER CORRECTED MD 50% POE","MW","Non-coincident"]
[null,null,null,null,"Coincident"]
[null,null,"WEATHER CORRECTED MD 50% POE","MVA","Non-coincident"]
[null,null,null,null,"Coincident"]
[null,"NSP to enter name","CONNECTION POINT RATING","MVA","Non-coincident"]
[null,null,null,null,"Coincident"]
[null,null,"WINTER/SUMMER PEAKING",null,"Non-coincident"]
[null,null,null,null,"Coincident"]
[null,null,"ADJUSTMENTS - EMBEDDED GENERATION","MW","Non-coincident"]
[null,null,null,null,"Coincident"]
[null,null,"WEATHER CORRECTED MD 10% POE","MW","Non-coincident"]
[null,null,null,null,"Coincident"]
[null,null,"WEATHER CORRECTED MD 10% POE","MVA","Non-coincident"]
[null,null,null,null,"Coincident"]
[null,null,"WEATHER CORRECTED MD 50% POE","MW","Non-coincident"]
[null,null,null,null,"Coincident"]
[null,null,"WEATHER CORRECTED MD 50% POE","MVA","Non-coincident"]
[null,null,null,null,"Coincident"]
[null,"NSP to enter name","CONNECTION POINT RATING","MVA","Non-coincident"]
[null,null,null,null,"Coincident"]
[null,null,"WINTER/SUMMER PEAKING",null,"Non-coincident"]
[null,null,null,null,"Coincident"]
[null,null,"ADJUSTMENTS - EMBEDDED GENERATION","MW","Non-coincident"]
[null,null,null,null,"Coincident"]
[null,null,"WEATHER CORRECTED MD 10% POE","MW","Non-coincident"]
[null,null,null,null,"Coincident"]
[null,null,"WEATHER CORRECTED MD 10% POE","MVA","Non-coincident"]
[null,null,null,null,"Coincident"]
[null,null,"WEATHER CORRECTED MD 50% POE","MW","Non-coincident"]
[null,null,null,null,"Coincident"]
[null,null,"WEATHER CORRECTED MD 50% POE","MVA","Non-coincident"]
[null,null,null,null,"Coincident"]
[null,"NSP to enter name","CONNECTION POINT RATING","MVA","Non-coincident"]
[null,null,null,null,"Coincident"]
[null,null,"WINTER/SUMMER PEAKING",null,"Non-coincident"]
[null,null,null,null,"Coincident"]
[null,null,"ADJUSTMENTS - EMBEDDED GENERATION","MW","Non-coincident"]
[null,null,null,null,"Coincident"]
[null,null,"WEATHER CORRECTED MD 10% POE","MW","Non-coincident"]
[null,null,null,null,"Coincident"]
[null,null,"WEATHER CORRECTED MD 10% POE","MVA","Non-coincident"]
[null,null,null,null,"Coincident"]
[null,null,"WEATHER CORRECTED MD 50% POE","MW","Non-coincident"]
[null,null,null,null,"Coincident"]
[null,null,"WEATHER CORRECTED MD 50% POE","MVA","Non-coincident"]
[null,null,null,null,"Coincident"]
[null,"NSP to enter name","CONNECTION POINT RATING","MVA","Non-coincident"]
[null,null,null,null,"Coincident"]
[null,null,"WINTER/SUMMER PEAKING",null,"Non-coincident"]
[null,null,null,null,"Coincident"]
[null,null,"ADJUSTMENTS - EMBEDDED GENERATION","MW","Non-coincident"]
[null,null,null,null,"Coincident"]
[null,null,"WEATHER CORRECTED MD 10% POE","MW","Non-coincident"]
[null,null,null,null,"Coincident"]
[null,null,"WEATHER CORRECTED MD 10% POE","MVA","Non-coincident"]
[null,null,null,null,"Coincident"]
[null,null,"WEATHER CORRECTED MD 50% POE","MW","Non-coincident"]
[null,null,null,null,"Coincident"]
[null,null,"WEATHER CORRECTED MD 50% POE","MVA","Non-coincident"]
[null,null,null,null,"Coincident"]
[null,"NSP to enter name","CONNECTION POINT RATING","MVA","Non-coincident"]
[null,null,null,null,"Coincident"]
[null,null,"WINTER/SUMMER PEAKING",null,"Non-coincident"]
[null,null,null,null,"Coincident"]
[null,null,"ADJUSTMENTS - EMBEDDED GENERATION","MW","Non-coincident"]
[null,null,null,null,"Coincident"]
[null,null,"WEATHER CORRECTED MD 10% POE","MW","Non-coincident"]
[null,null,null,null,"Coincident"]
[null,null,"WEATHER CORRECTED MD 10% POE","MVA","Non-coincident"]
[null,null,null,null,"Coincident"]
[null,null,"WEATHER CORRECTED MD 50% POE","MW","Non-coincident"]
[null,null,null,null,"Coincident"]
[null,null,"WEATHER CORRECTED MD 50% POE","MVA","Non-coincident"]
[null,null,null,null,"Coincident"]
[null,"NSP to enter name","CONNECTION POINT RATING","MVA","Non-coincident"]
[null,null,null,null,"Coincident"]
[null,null,"WINTER/SUMMER PEAKING",null,"Non-coincident"]
[null,null,null,null,"Coincident"]
[null,null,"ADJUSTMENTS - EMBEDDED GENERATION","MW","Non-coincident"]
[null,null,null,null,"Coincident"]
[null,null,"WEATHER CORRECTED MD 10% POE","MW","Non-coincident"]
[null,null,null,null,"Coincident"]
[null,null,"WEATHER CORRECTED MD 10% POE","MVA","Non-coincident"]
[null,null,null,null,"Coincident"]
[null,null,"WEATHER CORRECTED MD 50% POE","MW","Non-coincident"]
[null,null,null,null,"Coincident"]
[null,null,"WEATHER CORRECTED MD 50% POE","MVA","Non-coincident"]
[null,null,null,null,"Coincident"]
[null,"NSP to enter name","CONNECTION POINT RATING","MVA","Non-coincident"]
[null,null,null,null,"Coincident"]
[null,null,"WINTER/SUMMER PEAKING",null,"Non-coincident"]
[null,null,null,null,"Coincident"]
[null,null,"ADJUSTMENTS - EMBEDDED GENERATION","MW","Non-coincident"]
[null,null,null,null,"Coincident"]
[null,null,"WEATHER CORRECTED MD 10% POE","MW","Non-coincident"]
[null,null,null,null,"Coincident"]
[null,null,"WEATHER CORRECTED MD 10% POE","MVA","Non-coincident"]
[null,null,null,null,"Coincident"]
[null,null,"WEATHER CORRECTED MD 50% POE","MW","Non-coincident"]
[null,null,null,null,"Coincident"]
[null,null,"WEATHER CORRECTED MD 50% POE","MVA","Non-coincident"]
[null,null,null,null,"Coincident"]
[null,"NSP to enter name","CONNECTION POINT RATING","MVA","Non-coincident"]
[null,null,null,null,"Coincident"]
[null,null,"WINTER/SUMMER PEAKING",null,"Non-coincident"]
[null,null,null,null,"Coincident"]
[null,null,"ADJUSTMENTS - EMBEDDED GENERATION","MW","Non-coincident"]
[null,null,null,null,"Coincident"]
[null,null,"WEATHER CORRECTED MD 10% POE","MW","Non-coincident"]
[null,null,null,null,"Coincident"]
[null,null,"WEATHER CORRECTED MD 10% POE","MVA","Non-coincident"]
[null,null,null,null,"Coincident"]
[null,null,"WEATHER CORRECTED MD 50% POE","MW","Non-coincident"]
[null,null,null,null,"Coincident"]
[null,null,"WEATHER CORRECTED MD 50% POE","MVA","Non-coincident"]
[null,null,null,null,"Coincident"]
[null,"NSP to enter name","CONNECTION POINT RATING","MVA","Non-coincident"]
[null,null,null,null,"Coincident"]
[null,null,"WINTER/SUMMER PEAKING",null,"Non-coincident"]
[null,null,null,null,"Coincident"]
[null,null,"ADJUSTMENTS - EMBEDDED GENERATION","MW","Non-coincident"]
[null,null,null,null,"Coincident"]
[null,null,"WEATHER CORRECTED MD 10% POE","MW","Non-coincident"]
[null,null,null,null,"Coincident"]
[null,null,"WEATHER CORRECTED MD 10% POE","MVA","Non-coincident"]
[null,null,null,null,"Coincident"]
[null,null,"WEATHER CORRECTED MD 50% POE","MW","Non-coincident"]
[null,null,null,null,"Coincident"]
[null,null,"WEATHER CORRECTED MD 50% POE","MVA","Non-coincident"]
[null,null,null,null,"Coincident"]
[null,"NSP to enter name","CONNECTION POINT RATING","MVA","Non-coincident"]
[null,null,null,null,"Coincident"]
[null,null,"WINTER/SUMMER PEAKING",null,"Non-coincident"]
[null,null,null,null,"Coincident"]
[null,null,"ADJUSTMENTS - EMBEDDED GENERATION","MW","Non-coincident"]
[null,null,null,null,"Coincident"]
[null,null,"WEATHER CORRECTED MD 10% POE","MW","Non-coincident"]
[null,null,null,null,"Coincident"]
[null,null,"WEATHER CORRECTED MD 10% POE","MVA","Non-coincident"]
[null,null,null,null,"Coincident"]
[null,null,"WEATHER CORRECTED MD 50% POE","MW","Non-coincident"]
[null,null,null,null,"Coincident"]
[null,null,"WEATHER CORRECTED MD 50% POE","MVA","Non-coincident"]
[null,null,null,null,"Coincident"]
[null,"NSP to enter name","CONNECTION POINT RATING","MVA","Non-coincident"]
[null,null,null,null,"Coincident"]
[null,null,"WINTER/SUMMER PEAKING",null,"Non-coincident"]
[null,null,null,null,"Coincident"]
[null,null,"ADJUSTMENTS - EMBEDDED GENERATION","MW","Non-coincident"]
[null,null,null,null,"Coincident"]
[null,null,"WEATHER CORRECTED MD 10% POE","MW","Non-coincident"]
[null,null,null,null,"Coincident"]
[null,null,"WEATHER CORRECTED MD 10% POE","MVA","Non-coincident"]
[null,null,null,null,"Coincident"]
[null,null,"WEATHER CORRECTED MD 50% POE","MW","Non-coincident"]
[null,null,null,null,"Coincident"]
[null,null,"WEATHER CORRECTED MD 50% POE","MVA","Non-coincident"]
[null,null,null,null,"Coincident"]
[null,"NSP to enter name","CONNECTION POINT RATING","MVA","Non-coincident"]
[null,null,null,null,"Coincident"]
[null,null,"WINTER/SUMMER PEAKING",null,"Non-coincident"]
[null,null,null,null,"Coincident"]
[null,null,"ADJUSTMENTS - EMBEDDED GENERATION","MW","Non-coincident"]
[null,null,null,null,"Coincident"]
[null,null,"WEATHER CORRECTED MD 10% POE","MW","Non-coincident"]
[null,null,null,null,"Coincident"]
[null,null,"WEATHER CORRECTED MD 10% POE","MVA","Non-coincident"]
[null,null,null,null,"Coincident"]
[null,null,"WEATHER CORRECTED MD 50% POE","MW","Non-coincident"]
[null,null,null,null,"Coincident"]
[null,null,"WEATHER CORRECTED MD 50% POE","MVA","Non-coincident"]
[null,null,null,null,"Coincident"]
[null,"NSP to enter name","CONNECTION POINT RATING","MVA","Non-coincident"]
[null,null,null,null,"Coincident"]
[null,null,"WINTER/SUMMER PEAKING",null,"Non-coincident"]
[null,null,null,null,"Coincident"]
[null,null,"ADJUSTMENTS - EMBEDDED GENERATION","MW","Non-coincident"]
[null,null,null,null,"Coincident"]
[null,null,"WEATHER CORRECTED MD 10% POE","MW","Non-coincident"]
[null,null,null,null,"Coincident"]
[null,null,"WEATHER CORRECTED MD 10% POE","MVA","Non-coincident"]
[null,null,null,null,"Coincident"]
[null,null,"WEATHER CORRECTED MD 50% POE","MW","Non-coincident"]
[null,null,null,null,"Coincident"]
[null,null,"WEATHER CORRECTED MD 50% POE","MVA","Non-coincident"]
[null,null,null,null,"Coincident"]
[null,"NSP to enter name","CONNECTION POINT RATING","MVA","Non-coincident"]
[null,null,null,null,"Coincident"]
[null,null,"WINTER/SUMMER PEAKING",null,"Non-coincident"]
[null,null,null,null,"Coincident"]
[null,null,"ADJUSTMENTS - EMBEDDED GENERATION","MW","Non-coincident"]
[null,null,null,null,"Coincident"]
[null,null,"WEATHER CORRECTED MD 10% POE","MW","Non-coincident"]
[null,null,null,null,"Coincident"]
[null,null,"WEATHER CORRECTED MD 10% POE","MVA","Non-coincident"]
[null,null,null,null,"Coincident"]
[null,null,"WEATHER CORRECTED MD 50% POE","MW","Non-coincident"]
[null,null,null,null,"Coincident"]
[null,null,"WEATHER CORRECTED MD 50% POE","MVA","Non-coincident"]
[null,null,null,null,"Coincident"]
[null,"NSP to enter name","CONNECTION POINT RATING","MVA","Non-coincident"]
[null,null,null,null,"Coincident"]
[null,null,"WINTER/SUMMER PEAKING",null,"Non-coincident"]
[null,null,null,null,"Coincident"]
[null,null,"ADJUSTMENTS - EMBEDDED GENERATION","MW","Non-coincident"]
[null,null,null,null,"Coincident"]
[null,null,"WEATHER CORRECTED MD 10% POE","MW","Non-coincident"]
[null,null,null,null,"Coincident"]
[null,null,"WEATHER CORRECTED MD 10% POE","MVA","Non-coincident"]
[null,null,null,null,"Coincident"]
[null,null,"WEATHER CORRECTED MD 50% POE","MW","Non-coincident"]
[null,null,null,null,"Coincident"]
[null,null,"WEATHER CORRECTED MD 50% POE","MVA","Non-coincident"]
[null,null,null,null,"Coincident"]
[null,"NSP to enter name","CONNECTION POINT RATING","MVA","Non-coincident"]
[null,null,null,null,"Coincident"]
[null,null,"WINTER/SUMMER PEAKING",null,"Non-coincident"]
[null,null,null,null,"Coincident"]
[null,null,"ADJUSTMENTS - EMBEDDED GENERATION","MW","Non-coincident"]
[null,null,null,null,"Coincident"]
[null,null,"WEATHER CORRECTED MD 10% POE","MW","Non-coincident"]
[null,null,null,null,"Coincident"]
[null,null,"WEATHER CORRECTED MD 10% POE","MVA","Non-coincident"]
[null,null,null,null,"Coincident"]
[null,null,"WEATHER CORRECTED MD 50% POE","MW","Non-coincident"]
[null,null,null,null,"Coincident"]
[null,null,"WEATHER CORRECTED MD 50% POE","MVA","Non-coincident"]
[null,null,null,null,"Coincident"]
[null,"NSP to enter name","CONNECTION POINT RATING","MVA","Non-coincident"]
[null,null,null,null,"Coincident"]
[null,null,"WINTER/SUMMER PEAKING",null,"Non-coincident"]
[null,null,null,null,"Coincident"]
[null,null,"ADJUSTMENTS - EMBEDDED GENERATION","MW","Non-coincident"]
[null,null,null,null,"Coincident"]
[null,null,"WEATHER CORRECTED MD 10% POE","MW","Non-coincident"]
[null,null,null,null,"Coincident"]
[null,null,"WEATHER CORRECTED MD 10% POE","MVA","Non-coincident"]
[null,null,null,null,"Coincident"]
[null,null,"WEATHER CORRECTED MD 50% POE","MW","Non-coincident"]
[null,null,null,null,"Coincident"]
[null,null,"WEATHER CORRECTED MD 50% POE","MVA","Non-coincident"]
[null,null,null,null,"Coincident"]
[null,"NSP to enter name","CONNECTION POINT RATING","MVA","Non-coincident"]
[null,null,null,null,"Coincident"]
[null,null,"WINTER/SUMMER PEAKING",null,"Non-coincident"]
[null,null,null,null,"Coincident"]
[null,null,"ADJUSTMENTS - EMBEDDED GENERATION","MW","Non-coincident"]
[null,null,null,null,"Coincident"]
[null,null,"WEATHER CORRECTED MD 10% POE","MW","Non-coincident"]
[null,null,null,null,"Coincident"]
[null,null,"WEATHER CORRECTED MD 10% POE","MVA","Non-coincident"]
[null,null,null,null,"Coincident"]
[null,null,"WEATHER CORRECTED MD 50% POE","MW","Non-coincident"]
[null,null,null,null,"Coincident"]
[null,null,"WEATHER CORRECTED MD 50% POE","MVA","Non-coincident"]
[null,null,null,null,"Coincident"]
[null,"NSP to enter name","CONNECTION POINT RATING","MVA","Non-coincident"]
[null,null,null,null,"Coincident"]
[null,null,"WINTER/SUMMER PEAKING",null,"Non-coincident"]
[null,null,null,null,"Coincident"]
[null,null,"ADJUSTMENTS - EMBEDDED GENERATION","MW","Non-coincident"]
[null,null,null,null,"Coincident"]
[null,null,"WEATHER CORRECTED MD 10% POE","MW","Non-coincident"]
[null,null,null,null,"Coincident"]
[null,null,"WEATHER CORRECTED MD 10% POE","MVA","Non-coincident"]
[null,null,null,null,"Coincident"]
[null,null,"WEATHER CORRECTED MD 50% POE","MW","Non-coincident"]
[null,null,null,null,"Coincident"]
[null,null,"WEATHER CORRECTED MD 50% POE","MVA","Non-coincident"]
[null,null,null,null,"Coincident"]
[null,"NSP to enter name","CONNECTION POINT RATING","MVA","Non-coincident"]
[null,null,null,null,"Coincident"]
[null,null,"WINTER/SUMMER PEAKING",null,"Non-coincident"]
[null,null,null,null,"Coincident"]
[null,null,"ADJUSTMENTS - EMBEDDED GENERATION","MW","Non-coincident"]
[null,null,null,null,"Coincident"]
[null,null,"WEATHER CORRECTED MD 10% POE","MW","Non-coincident"]
[null,null,null,null,"Coincident"]
[null,null,"WEATHER CORRECTED MD 10% POE","MVA","Non-coincident"]
[null,null,null,null,"Coincident"]
[null,null,"WEATHER CORRECTED MD 50% POE","MW","Non-coincident"]
[null,null,null,null,"Coincident"]
[null,null,"WEATHER CORRECTED MD 50% POE","MVA","Non-coincident"]
[null,null,null,null,"Coincident"]
[null,"NSP to enter name","CONNECTION POINT RATING","MVA","Non-coincident"]
[null,null,null,null,"Coincident"]
[null,null,"WINTER/SUMMER PEAKING",null,"Non-coincident"]
[null,null,null,null,"Coincident"]
[null,null,"ADJUSTMENTS - EMBEDDED GENERATION","MW","Non-coincident"]
[null,null,null,null,"Coincident"]
[null,null,"WEATHER CORRECTED MD 10% POE","MW","Non-coincident"]
[null,null,null,null,"Coincident"]
[null,null,"WEATHER CORRECTED MD 10% POE","MVA","Non-coincident"]
[null,null,null,null,"Coincident"]
[null,null,"WEATHER CORRECTED MD 50% POE","MW","Non-coincident"]
[null,null,null,null,"Coincident"]
[null,null,"WEATHER CORRECTED MD 50% POE","MVA","Non-coincident"]
[null,null,null,null,"Coincident"]
[null,"NSP to enter name","CONNECTION POINT RATING","MVA","Non-coincident"]
[null,null,null,null,"Coincident"]
[null,null,"WINTER/SUMMER PEAKING",null,"Non-coincident"]
[null,null,null,null,"Coincident"]
[null,null,"ADJUSTMENTS - EMBEDDED GENERATION","MW","Non-coincident"]
[null,null,null,null,"Coincident"]
[null,null,"WEATHER CORRECTED MD 10% POE","MW","Non-coincident"]
[null,null,null,null,"Coincident"]
[null,null,"WEATHER CORRECTED MD 10% POE","MVA","Non-coincident"]
[null,null,null,null,"Coincident"]
[null,null,"WEATHER CORRECTED MD 50% POE","MW","Non-coincident"]
[null,null,null,null,"Coincident"]
[null,null,"WEATHER CORRECTED MD 50% POE","MVA","Non-coincident"]
[null,null,null,null,"Coincident"]
[null,"NSP to enter name","CONNECTION POINT RATING","MVA","Non-coincident"]
[null,null,null,null,"Coincident"]
[null,null,"WINTER/SUMMER PEAKING",null,"Non-coincident"]
[null,null,null,null,"Coincident"]
[null,null,"ADJUSTMENTS - EMBEDDED GENERATION","MW","Non-coincident"]
[null,null,null,null,"Coincident"]
[null,null,"WEATHER CORRECTED MD 10% POE","MW","Non-coincident"]
[null,null,null,null,"Coincident"]
[null,null,"WEATHER CORRECTED MD 10% POE","MVA","Non-coincident"]
[null,null,null,null,"Coincident"]
[null,null,"WEATHER CORRECTED MD 50% POE","MW","Non-coincident"]
[null,null,null,null,"Coincident"]
[null,null,"WEATHER CORRECTED MD 50% POE","MVA","Non-coincident"]
[null,null,null,null,"Coincident"]
[null,"NSP to enter name","CONNECTION POINT RATING","MVA","Non-coincident"]
[null,null,null,null,"Coincident"]
[null,null,"WINTER/SUMMER PEAKING",null,"Non-coincident"]
[null,null,null,null,"Coincident"]
[null,null,"ADJUSTMENTS - EMBEDDED GENERATION","MW","Non-coincident"]
[null,null,null,null,"Coincident"]
[null,null,"WEATHER CORRECTED MD 10% POE","MW","Non-coincident"]
[null,null,null,null,"Coincident"]
[null,null,"WEATHER CORRECTED MD 10% POE","MVA","Non-coincident"]
[null,null,null,null,"Coincident"]
[null,null,"WEATHER CORRECTED MD 50% POE","MW","Non-coincident"]
[null,null,null,null,"Coincident"]
[null,null,"WEATHER CORRECTED MD 50% POE","MVA","Non-coincident"]
[null,null,null,null,"Coincident"]
[null,"NSP to enter name","CONNECTION POINT RATING","MVA","Non-coincident"]
[null,null,null,null,"Coincident"]
[null,null,"WINTER/SUMMER PEAKING",null,"Non-coincident"]
[null,null,null,null,"Coincident"]
[null,null,"ADJUSTMENTS - EMBEDDED GENERATION","MW","Non-coincident"]
[null,null,null,null,"Coincident"]
[null,null,"WEATHER CORRECTED MD 10% POE","MW","Non-coincident"]
[null,null,null,null,"Coincident"]
[null,null,"WEATHER CORRECTED MD 10% POE","MVA","Non-coincident"]
[null,null,null,null,"Coincident"]
[null,null,"WEATHER CORRECTED MD 50% POE","MW","Non-coincident"]
[null,null,null,null,"Coincident"]
[null,null,"WEATHER CORRECTED MD 50% POE","MVA","Non-coincident"]
[null,null,null,null,"Coincident"]
[null,"NSP to enter name","CONNECTION POINT RATING","MVA","Non-coincident"]
[null,null,null,null,"Coincident"]
[null,null,"WINTER/SUMMER PEAKING",null,"Non-coincident"]
[null,null,null,null,"Coincident"]
[null,null,"ADJUSTMENTS - EMBEDDED GENERATION","MW","Non-coincident"]
[null,null,null,null,"Coincident"]
[null,null,"WEATHER CORRECTED MD 10% POE","MW","Non-coincident"]
[null,null,null,null,"Coincident"]
[null,null,"WEATHER CORRECTED MD 10% POE","MVA","Non-coincident"]
[null,null,null,null,"Coincident"]
[null,null,"WEATHER CORRECTED MD 50% POE","MW","Non-coincident"]
[null,null,null,null,"Coincident"]
[null,null,"WEATHER CORRECTED MD 50% POE","MVA","Non-coincident"]
[null,null,null,null,"Coincident"]
[null,"NSP to enter name","CONNECTION POINT RATING","MVA","Non-coincident"]
[null,null,null,null,"Coincident"]
[null,null,"WINTER/SUMMER PEAKING",null,"Non-coincident"]
[null,null,null,null,"Coincident"]
[null,null,"ADJUSTMENTS - EMBEDDED GENERATION","MW","Non-coincident"]
[null,null,null,null,"Coincident"]
[null,null,"WEATHER CORRECTED MD 10% POE","MW","Non-coincident"]
[null,null,null,null,"Coincident"]
[null,null,"WEATHER CORRECTED MD 10% POE","MVA","Non-coincident"]
[null,null,null,null,"Coincident"]
[null,null,"WEATHER CORRECTED MD 50% POE","MW","Non-coincident"]
[null,null,null,null,"Coincident"]
[null,null,"WEATHER CORRECTED MD 50% POE","MVA","Non-coincident"]
[null,null,null,null,"Coincident"]
[null,"NSP to enter name","CONNECTION POINT RATING","MVA","Non-coincident"]
[null,null,null,null,"Coincident"]
[null,null,"WINTER/SUMMER PEAKING",null,"Non-coincident"]
[null,null,null,null,"Coincident"]
[null,null,"ADJUSTMENTS - EMBEDDED GENERATION","MW","Non-coincident"]
[null,null,null,null,"Coincident"]
[null,null,"WEATHER CORRECTED MD 10% POE","MW","Non-coincident"]
[null,null,null,null,"Coincident"]
[null,null,"WEATHER CORRECTED MD 10% POE","MVA","Non-coincident"]
[null,null,null,null,"Coincident"]
[null,null,"WEATHER CORRECTED MD 50% POE","MW","Non-coincident"]
[null,null,null,null,"Coincident"]
[null,null,"WEATHER CORRECTED MD 50% POE","MVA","Non-coincident"]
[null,null,null,null,"Coincident"]
[null,"NSP to enter name","CONNECTION POINT RATING","MVA","Non-coincident"]
[null,null,null,null,"Coincident"]
[null,null,"WINTER/SUMMER PEAKING",null,"Non-coincident"]
[null,null,null,null,"Coincident"]
[null,null,"ADJUSTMENTS - EMBEDDED GENERATION","MW","Non-coincident"]
[null,null,null,null,"Coincident"]
[null,null,"WEATHER CORRECTED MD 10% POE","MW","Non-coincident"]
[null,null,null,null,"Coincident"]
[null,null,"WEATHER CORRECTED MD 10% POE","MVA","Non-coincident"]
[null,null,null,null,"Coincident"]
[null,null,"WEATHER CORRECTED MD 50% POE","MW","Non-coincident"]
[null,null,null,null,"Coincident"]
[null,null,"WEATHER CORRECTED MD 50% POE","MVA","Non-coincident"]
[null,null,null,null,"Coincident"]
[null,"NSP to enter name","CONNECTION POINT RATING","MVA","Non-coincident"]
[null,null,null,null,"Coincident"]
[null,null,"WINTER/SUMMER PEAKING",null,"Non-coincident"]
[null,null,null,null,"Coincident"]
[null,null,"ADJUSTMENTS - EMBEDDED GENERATION","MW","Non-coincident"]
[null,null,null,null,"Coincident"]
[null,null,"WEATHER CORRECTED MD 10% POE","MW","Non-coincident"]
[null,null,null,null,"Coincident"]
[null,null,"WEATHER CORRECTED MD 10% POE","MVA","Non-coincident"]
[null,null,null,null,"Coincident"]
[null,null,"WEATHER CORRECTED MD 50% POE","MW","Non-coincident"]
[null,null,null,null,"Coincident"]
[null,null,"WEATHER CORRECTED MD 50% POE","MVA","Non-coincident"]
[null,null,null,null,"Coincident"]
[null,"NSP to enter name","CONNECTION POINT RATING","MVA","Non-coincident"]
[null,null,null,null,"Coincident"]
[null,null,"WINTER/SUMMER PEAKING",null,"Non-coincident"]
[null,null,null,null,"Coincident"]
[null,null,"ADJUSTMENTS - EMBEDDED GENERATION","MW","Non-coincident"]
[null,null,null,null,"Coincident"]
[null,null,"WEATHER CORRECTED MD 10% POE","MW","Non-coincident"]
[null,null,null,null,"Coincident"]
[null,null,"WEATHER CORRECTED MD 10% POE","MVA","Non-coincident"]
[null,null,null,null,"Coincident"]
[null,null,"WEATHER CORRECTED MD 50% POE","MW","Non-coincident"]
[null,null,null,null,"Coincident"]
[null,null,"WEATHER CORRECTED MD 50% POE","MVA","Non-coincident"]
[null,null,null,null,"Coincident"]
[null,"NSP to enter name","CONNECTION POINT RATING","MVA","Non-coincident"]
[null,null,null,null,"Coincident"]
[null,null,"WINTER/SUMMER PEAKING",null,"Non-coincident"]
[null,null,null,null,"Coincident"]
[null,null,"ADJUSTMENTS - EMBEDDED GENERATION","MW","Non-coincident"]
[null,null,null,null,"Coincident"]
[null,null,"WEATHER CORRECTED MD 10% POE","MW","Non-coincident"]
[null,null,null,null,"Coincident"]
[null,null,"WEATHER CORRECTED MD 10% POE","MVA","Non-coincident"]
[null,null,null,null,"Coincident"]
[null,null,"WEATHER CORRECTED MD 50% POE","MW","Non-coincident"]
[null,null,null,null,"Coincident"]
[null,null,"WEATHER CORRECTED MD 50% POE","MVA","Non-coincident"]
[null,null,null,null,"Coincident"]
[null,"NSP to enter name","CONNECTION POINT RATING","MVA","Non-coincident"]
[null,null,null,null,"Coincident"]
[null,null,"WINTER/SUMMER PEAKING",null,"Non-coincident"]
[null,null,null,null,"Coincident"]
[null,null,"ADJUSTMENTS - EMBEDDED GENERATION","MW","Non-coincident"]
[null,null,null,null,"Coincident"]
[null,null,"WEATHER CORRECTED MD 10% POE","MW","Non-coincident"]
[null,null,null,null,"Coincident"]
[null,null,"WEATHER CORRECTED MD 10% POE","MVA","Non-coincident"]
[null,null,null,null,"Coincident"]
[null,null,"WEATHER CORRECTED MD 50% POE","MW","Non-coincident"]
[null,null,null,null,"Coincident"]
[null,null,"WEATHER CORRECTED MD 50% POE","MVA","Non-coincident"]
[null,null,null,null,"Coincident"]
[null,"NSP to enter name","CONNECTION POINT RATING","MVA","Non-coincident"]
[null,null,null,null,"Coincident"]
[null,null,"WINTER/SUMMER PEAKING",null,"Non-coincident"]
[null,null,null,null,"Coincident"]
[null,null,"ADJUSTMENTS - EMBEDDED GENERATION","MW","Non-coincident"]
[null,null,null,null,"Coincident"]
[null,null,"WEATHER CORRECTED MD 10% POE","MW","Non-coincident"]
[null,null,null,null,"Coincident"]
[null,null,"WEATHER CORRECTED MD 10% POE","MVA","Non-coincident"]
[null,null,null,null,"Coincident"]
[null,null,"WEATHER CORRECTED MD 50% POE","MW","Non-coincident"]
[null,null,null,null,"Coincident"]
[null,null,"WEATHER CORRECTED MD 50% POE","MVA","Non-coincident"]
[null,null,null,null,"Coincident"]
[null,"NSP to enter name","CONNECTION POINT RATING","MVA","Non-coincident"]
[null,null,null,null,"Coincident"]
[null,null,"WINTER/SUMMER PEAKING",null,"Non-coincident"]
[null,null,null,null,"Coincident"]
[null,null,"ADJUSTMENTS - EMBEDDED GENERATION","MW","Non-coincident"]
[null,null,null,null,"Coincident"]
[null,null,"WEATHER CORRECTED MD 10% POE","MW","Non-coincident"]
[null,null,null,null,"Coincident"]
[null,null,"WEATHER CORRECTED MD 10% POE","MVA","Non-coincident"]
[null,null,null,null,"Coincident"]
[null,null,"WEATHER CORRECTED MD 50% POE","MW","Non-coincident"]
[null,null,null,null,"Coincident"]
[null,null,"WEATHER CORRECTED MD 50% POE","MVA","Non-coincident"]
[null,null,null,null,"Coincident"]
[null,"NSP to enter name","CONNECTION POINT RATING","MVA","Non-coincident"]
[null,null,null,null,"Coincident"]
[null,null,"WINTER/SUMMER PEAKING",null,"Non-coincident"]
[null,null,null,null,"Coincident"]
[null,null,"ADJUSTMENTS - EMBEDDED GENERATION","MW","Non-coincident"]
[null,null,null,null,"Coincident"]
[null,null,"WEATHER CORRECTED MD 10% POE","MW","Non-coincident"]
[null,null,null,null,"Coincident"]
[null,null,"WEATHER CORRECTED MD 10% POE","MVA","Non-coincident"]
[null,null,null,null,"Coincident"]
[null,null,"WEATHER CORRECTED MD 50% POE","MW","Non-coincident"]
[null,null,null,null,"Coincident"]
[null,null,"WEATHER CORRECTED MD 50% POE","MVA","Non-coincident"]
[null,null,null,null,"Coincident"]
[null,"NSP to enter name","CONNECTION POINT RATING","MVA","Non-coincident"]
[null,null,null,null,"Coincident"]
[null,null,"WINTER/SUMMER PEAKING",null,"Non-coincident"]
[null,null,null,null,"Coincident"]
[null,null,"ADJUSTMENTS - EMBEDDED GENERATION","MW","Non-coincident"]
[null,null,null,null,"Coincident"]
[null,null,"WEATHER CORRECTED MD 10% POE","MW","Non-coincident"]
[null,null,null,null,"Coincident"]
[null,null,"WEATHER CORRECTED MD 10% POE","MVA","Non-coincident"]
[null,null,null,null,"Coincident"]
[null,null,"WEATHER CORRECTED MD 50% POE","MW","Non-coincident"]
[null,null,null,null,"Coincident"]
[null,null,"WEATHER CORRECTED MD 50% POE","MVA","Non-coincident"]
[null,null,null,null,"Coincident"]
[null,"NSP to enter name","CONNECTION POINT RATING","MVA","Non-coincident"]
[null,null,null,null,"Coincident"]
[null,null,"WINTER/SUMMER PEAKING",null,"Non-coincident"]
[null,null,null,null,"Coincident"]
[null,null,"ADJUSTMENTS - EMBEDDED GENERATION","MW","Non-coincident"]
[null,null,null,null,"Coincident"]
[null,null,"WEATHER CORRECTED MD 10% POE","MW","Non-coincident"]
[null,null,null,null,"Coincident"]
[null,null,"WEATHER CORRECTED MD 10% POE","MVA","Non-coincident"]
[null,null,null,null,"Coincident"]
[null,null,"WEATHER CORRECTED MD 50% POE","MW","Non-coincident"]
[null,null,null,null,"Coincident"]
[null,null,"WEATHER CORRECTED MD 50% POE","MVA","Non-coincident"]
[null,null,null,null,"Coincident"]
[null,"NSP to enter name","CONNECTION POINT RATING","MVA","Non-coincident"]
[null,null,null,null,"Coincident"]
[null,null,"WINTER/SUMMER PEAKING",null,"Non-coincident"]
[null,null,null,null,"Coincident"]
[null,null,"ADJUSTMENTS - EMBEDDED GENERATION","MW","Non-coincident"]
[null,null,null,null,"Coincident"]
[null,null,"WEATHER CORRECTED MD 10% POE","MW","Non-coincident"]
[null,null,null,null,"Coincident"]
[null,null,"WEATHER CORRECTED MD 10% POE","MVA","Non-coincident"]
[null,null,null,null,"Coincident"]
[null,null,"WEATHER CORRECTED MD 50% POE","MW","Non-coincident"]
[null,null,null,null,"Coincident"]
[null,null,"WEATHER CORRECTED MD 50% POE","MVA","Non-coincident"]
[null,null,null,null,"Coincident"]
[null,"NSP to enter name","CONNECTION POINT RATING","MVA","Non-coincident"]
[null,null,null,null,"Coincident"]
[null,null,"WINTER/SUMMER PEAKING",null,"Non-coincident"]
[null,null,null,null,"Coincident"]
[null,null,"ADJUSTMENTS - EMBEDDED GENERATION","MW","Non-coincident"]
[null,null,null,null,"Coincident"]
[null,null,"WEATHER CORRECTED MD 10% POE","MW","Non-coincident"]
[null,null,null,null,"Coincident"]
[null,null,"WEATHER CORRECTED MD 10% POE","MVA","Non-coincident"]
[null,null,null,null,"Coincident"]
[null,null,"WEATHER CORRECTED MD 50% POE","MW","Non-coincident"]
[null,null,null,null,"Coincident"]
[null,null,"WEATHER CORRECTED MD 50% POE","MVA","Non-coincident"]
[null,null,null,null,"Coincident"]
[null,"NSP to enter name","CONNECTION POINT RATING","MVA","Non-coincident"]
[null,null,null,null,"Coincident"]
[null,null,"WINTER/SUMMER PEAKING",null,"Non-coincident"]
[null,null,null,null,"Coincident"]
[null,null,"ADJUSTMENTS - EMBEDDED GENERATION","MW","Non-coincident"]
[null,null,null,null,"Coincident"]
[null,null,"WEATHER CORRECTED MD 10% POE","MW","Non-coincident"]
[null,null,null,null,"Coincident"]
[null,null,"WEATHER CORRECTED MD 10% POE","MVA","Non-coincident"]
[null,null,null,null,"Coincident"]
[null,null,"WEATHER CORRECTED MD 50% POE","MW","Non-coincident"]
[null,null,null,null,"Coincident"]
[null,null,"WEATHER CORRECTED MD 50% POE","MVA","Non-coincident"]
[null,null,null,null,"Coincident"]
[null,"NSP to enter name","CONNECTION POINT RATING","MVA","Non-coincident"]
[null,null,null,null,"Coincident"]
[null,null,"WINTER/SUMMER PEAKING",null,"Non-coincident"]
[null,null,null,null,"Coincident"]
[null,null,"ADJUSTMENTS - EMBEDDED GENERATION","MW","Non-coincident"]
[null,null,null,null,"Coincident"]
[null,null,"WEATHER CORRECTED MD 10% POE","MW","Non-coincident"]
[null,null,null,null,"Coincident"]
[null,null,"WEATHER CORRECTED MD 10% POE","MVA","Non-coincident"]
[null,null,null,null,"Coincident"]
[null,null,"WEATHER CORRECTED MD 50% POE","MW","Non-coincident"]
[null,null,null,null,"Coincident"]
[null,null,"WEATHER CORRECTED MD 50% POE","MVA","Non-coincident"]
[null,null,null,null,"Coincident"]
[null,"NSP to enter name","CONNECTION POINT RATING","MVA","Non-coincident"]
[null,null,null,null,"Coincident"]
[null,null,"WINTER/SUMMER PEAKING",null,"Non-coincident"]
[null,null,null,null,"Coincident"]
[null,null,"ADJUSTMENTS - EMBEDDED GENERATION","MW","Non-coincident"]
[null,null,null,null,"Coincident"]
[null,null,"WEATHER CORRECTED MD 10% POE","MW","Non-coincident"]
[null,null,null,null,"Coincident"]
[null,null,"WEATHER CORRECTED MD 10% POE","MVA","Non-coincident"]
[null,null,null,null,"Coincident"]
[null,null,"WEATHER CORRECTED MD 50% POE","MW","Non-coincident"]
[null,null,null,null,"Coincident"]
[null,null,"WEATHER CORRECTED MD 50% POE","MVA","Non-coincident"]
[null,null,null,null,"Coincident"]
[null,"NSP to enter name","CONNECTION POINT RATING","MVA","Non-coincident"]
[null,null,null,null,"Coincident"]
[null,null,"WINTER/SUMMER PEAKING",null,"Non-coincident"]
[null,null,null,null,"Coincident"]
[null,null,"ADJUSTMENTS - EMBEDDED GENERATION","MW","Non-coincident"]
[null,null,null,null,"Coincident"]
[null,null,"WEATHER CORRECTED MD 10% POE","MW","Non-coincident"]
[null,null,null,null,"Coincident"]
[null,null,"WEATHER CORRECTED MD 10% POE","MVA","Non-coincident"]
[null,null,null,null,"Coincident"]
[null,null,"WEATHER CORRECTED MD 50% POE","MW","Non-coincident"]
[null,null,null,null,"Coincident"]
[null,null,"WEATHER CORRECTED MD 50% POE","MVA","Non-coincident"]
[null,null,null,null,"Coincident"]
[null,"NSP to enter name","CONNECTION POINT RATING","MVA","Non-coincident"]
[null,null,null,null,"Coincident"]
[null,null,"WINTER/SUMMER PEAKING",null,"Non-coincident"]
[null,null,null,null,"Coincident"]
[null,null,"ADJUSTMENTS - EMBEDDED GENERATION","MW","Non-coincident"]
[null,null,null,null,"Coincident"]
[null,null,"WEATHER CORRECTED MD 10% POE","MW","Non-coincident"]
[null,null,null,null,"Coincident"]
[null,null,"WEATHER CORRECTED MD 10% POE","MVA","Non-coincident"]
[null,null,null,null,"Coincident"]
[null,null,"WEATHER CORRECTED MD 50% POE","MW","Non-coincident"]
[null,null,null,null,"Coincident"]
[null,null,"WEATHER CORRECTED MD 50% POE","MVA","Non-coincident"]
[null,null,null,null,"Coincident"]
[null,"NSP to enter name","CONNECTION POINT RATING","MVA","Non-coincident"]
[null,null,null,null,"Coincident"]
[null,null,"WINTER/SUMMER PEAKING",null,"Non-coincident"]
[null,null,null,null,"Coincident"]
[null,null,"ADJUSTMENTS - EMBEDDED GENERATION","MW","Non-coincident"]
[null,null,null,null,"Coincident"]
[null,null,"WEATHER CORRECTED MD 10% POE","MW","Non-coincident"]
[null,null,null,null,"Coincident"]
[null,null,"WEATHER CORRECTED MD 10% POE","MVA","Non-coincident"]
[null,null,null,null,"Coincident"]
[null,null,"WEATHER CORRECTED MD 50% POE","MW","Non-coincident"]
[null,null,null,null,"Coincident"]
[null,null,"WEATHER CORRECTED MD 50% POE","MVA","Non-coincident"]
[null,null,null,null,"Coincident"]
[null,"NSP to enter name","CONNECTION POINT RATING","MVA","Non-coincident"]
[null,null,null,null,"Coincident"]
[null,null,"WINTER/SUMMER PEAKING",null,"Non-coincident"]
[null,null,null,null,"Coincident"]
[null,null,"ADJUSTMENTS - EMBEDDED GENERATION","MW","Non-coincident"]
[null,null,null,null,"Coincident"]
[null,null,"WEATHER CORRECTED MD 10% POE","MW","Non-coincident"]
[null,null,null,null,"Coincident"]
[null,null,"WEATHER CORRECTED MD 10% POE","MVA","Non-coincident"]
[null,null,null,null,"Coincident"]
[null,null,"WEATHER CORRECTED MD 50% POE","MW","Non-coincident"]
[null,null,null,null,"Coincident"]
[null,null,"WEATHER CORRECTED MD 50% POE","MVA","Non-coincident"]
[null,null,null,null,"Coincident"]
[null,"NSP to enter name","CONNECTION POINT RATING","MVA","Non-coincident"]
[null,null,null,null,"Coincident"]
[null,null,"WINTER/SUMMER PEAKING",null,"Non-coincident"]
[null,null,null,null,"Coincident"]
[null,null,"ADJUSTMENTS - EMBEDDED GENERATION","MW","Non-coincident"]
[null,null,null,null,"Coincident"]
[null,null,"WEATHER CORRECTED MD 10% POE","MW","Non-coincident"]
[null,null,null,null,"Coincident"]
[null,null,"WEATHER CORRECTED MD 10% POE","MVA","Non-coincident"]
[null,null,null,null,"Coincident"]
[null,null,"WEATHER CORRECTED MD 50% POE","MW","Non-coincident"]
[null,null,null,null,"Coincident"]
[null,null,"WEATHER CORRECTED MD 50% POE","MVA","Non-coincident"]
[null,null,null,null,"Coincident"]
[null,"NSP to enter name","CONNECTION POINT RATING","MVA","Non-coincident"]
[null,null,null,null,"Coincident"]
[null,null,"WINTER/SUMMER PEAKING",null,"Non-coincident"]
[null,null,null,null,"Coincident"]
[null,null,"ADJUSTMENTS - EMBEDDED GENERATION","MW","Non-coincident"]
[null,null,null,null,"Coincident"]
[null,null,"WEATHER CORRECTED MD 10% POE","MW","Non-coincident"]
[null,null,null,null,"Coincident"]
[null,null,"WEATHER CORRECTED MD 10% POE","MVA","Non-coincident"]
[null,null,null,null,"Coincident"]
[null,null,"WEATHER CORRECTED MD 50% POE","MW","Non-coincident"]
[null,null,null,null,"Coincident"]
[null,null,"WEATHER CORRECTED MD 50% POE","MVA","Non-coincident"]
[null,null,null,null,"Coincident"]
[null,"NSP to enter name","CONNECTION POINT RATING","MVA","Non-coincident"]
[null,null,null,null,"Coincident"]
[null,null,"WINTER/SUMMER PEAKING",null,"Non-coincident"]
[null,null,null,null,"Coincident"]
[null,null,"ADJUSTMENTS - EMBEDDED GENERATION","MW","Non-coincident"]
[null,null,null,null,"Coincident"]
[null,null,"WEATHER CORRECTED MD 10% POE","MW","Non-coincident"]
[null,null,null,null,"Coincident"]
[null,null,"WEATHER CORRECTED MD 10% POE","MVA","Non-coincident"]
[null,null,null,null,"Coincident"]
[null,null,"WEATHER CORRECTED MD 50% POE","MW","Non-coincident"]
[null,null,null,null,"Coincident"]
[null,null,"WEATHER CORRECTED MD 50% POE","MVA","Non-coincident"]
[null,null,null,null,"Coincident"]
[null,"NSP to enter name","CONNECTION POINT RATING","MVA","Non-coincident"]
[null,null,null,null,"Coincident"]
[null,null,"WINTER/SUMMER PEAKING",null,"Non-coincident"]
[null,null,null,null,"Coincident"]
[null,null,"ADJUSTMENTS - EMBEDDED GENERATION","MW","Non-coincident"]
[null,null,null,null,"Coincident"]
[null,null,"WEATHER CORRECTED MD 10% POE","MW","Non-coincident"]
[null,null,null,null,"Coincident"]
[null,null,"WEATHER CORRECTED MD 10% POE","MVA","Non-coincident"]
[null,null,null,null,"Coincident"]
[null,null,"WEATHER CORRECTED MD 50% POE","MW","Non-coincident"]
[null,null,null,null,"Coincident"]
[null,null,"WEATHER CORRECTED MD 50% POE","MVA","Non-coincident"]
[null,null,null,null,"Coincident"]
[null,"NSP to enter name","CONNECTION POINT RATING","MVA","Non-coincident"]
[null,null,null,null,"Coincident"]
[null,null,"WINTER/SUMMER PEAKING",null,"Non-coincident"]
[null,null,null,null,"Coincident"]
[null,null,"ADJUSTMENTS - EMBEDDED GENERATION","MW","Non-coincident"]
[null,null,null,null,"Coincident"]
[null,null,"WEATHER CORRECTED MD 10% POE","MW","Non-coincident"]
[null,null,null,null,"Coincident"]
[null,null,"WEATHER CORRECTED MD 10% POE","MVA","Non-coincident"]
[null,null,null,null,"Coincident"]
[null,null,"WEATHER CORRECTED MD 50% POE","MW","Non-coincident"]
[null,null,null,null,"Coincident"]
[null,null,"WEATHER CORRECTED MD 50% POE","MVA","Non-coincident"]
[null,null,null,null,"Coincident"]
[null,"NSP to enter name","CONNECTION POINT RATING","MVA","Non-coincident"]
[null,null,null,null,"Coincident"]
[null,null,"WINTER/SUMMER PEAKING",null,"Non-coincident"]
[null,null,null,null,"Coincident"]
[null,null,"ADJUSTMENTS - EMBEDDED GENERATION","MW","Non-coincident"]
[null,null,null,null,"Coincident"]
[null,null,"WEATHER CORRECTED MD 10% POE","MW","Non-coincident"]
[null,null,null,null,"Coincident"]
[null,null,"WEATHER CORRECTED MD 10% POE","MVA","Non-coincident"]
[null,null,null,null,"Coincident"]
[null,null,"WEATHER CORRECTED MD 50% POE","MW","Non-coincident"]
[null,null,null,null,"Coincident"]
[null,null,"WEATHER CORRECTED MD 50% POE","MVA","Non-coincident"]
[null,null,null,null,"Coincident"]
[null,"NSP to enter name","CONNECTION POINT RATING","MVA","Non-coincident"]
[null,null,null,null,"Coincident"]
[null,null,"WINTER/SUMMER PEAKING",null,"Non-coincident"]
[null,null,null,null,"Coincident"]
[null,null,"ADJUSTMENTS - EMBEDDED GENERATION","MW","Non-coincident"]
[null,null,null,null,"Coincident"]
[null,null,"WEATHER CORRECTED MD 10% POE","MW","Non-coincident"]
[null,null,null,null,"Coincident"]
[null,null,"WEATHER CORRECTED MD 10% POE","MVA","Non-coincident"]
[null,null,null,null,"Coincident"]
[null,null,"WEATHER CORRECTED MD 50% POE","MW","Non-coincident"]
[null,null,null,null,"Coincident"]
[null,null,"WEATHER CORRECTED MD 50% POE","MVA","Non-coincident"]
[null,null,null,null,"Coincident"]
[null,"NSP to enter name","CONNECTION POINT RATING","MVA","Non-coincident"]
[null,null,null,null,"Coincident"]
[null,null,"WINTER/SUMMER PEAKING",null,"Non-coincident"]
[null,null,null,null,"Coincident"]
[null,null,"ADJUSTMENTS - EMBEDDED GENERATION","MW","Non-coincident"]
[null,null,null,null,"Coincident"]
[null,null,"WEATHER CORRECTED MD 10% POE","MW","Non-coincident"]
[null,null,null,null,"Coincident"]
[null,null,"WEATHER CORRECTED MD 10% POE","MVA","Non-coincident"]
[null,null,null,null,"Coincident"]
[null,null,"WEATHER CORRECTED MD 50% POE","MW","Non-coincident"]
[null,null,null,null,"Coincident"]
[null,null,"WEATHER CORRECTED MD 50% POE","MVA","Non-coincident"]
[null,null,null,null,"Coincident"]
[null,"NSP to enter name","CONNECTION POINT RATING","MVA","Non-coincident"]
[null,null,null,null,"Coincident"]
[null,null,"WINTER/SUMMER PEAKING",null,"Non-coincident"]
[null,null,null,null,"Coincident"]
[null,null,"ADJUSTMENTS - EMBEDDED GENERATION","MW","Non-coincident"]
[null,null,null,null,"Coincident"]
[null,null,"WEATHER CORRECTED MD 10% POE","MW","Non-coincident"]
[null,null,null,null,"Coincident"]
[null,null,"WEATHER CORRECTED MD 10% POE","MVA","Non-coincident"]
[null,null,null,null,"Coincident"]
[null,null,"WEATHER CORRECTED MD 50% POE","MW","Non-coincident"]
[null,null,null,null,"Coincident"]
[null,null,"WEATHER CORRECTED MD 50% POE","MVA","Non-coincident"]
[null,null,null,null,"Coincident"]
[null,"NSP to enter name","CONNECTION POINT RATING","MVA","Non-coincident"]
[null,null,null,null,"Coincident"]
[null,null,"WINTER/SUMMER PEAKING",null,"Non-coincident"]
[null,null,null,null,"Coincident"]
[null,null,"ADJUSTMENTS - EMBEDDED GENERATION","MW","Non-coincident"]
[null,null,null,null,"Coincident"]
[null,null,"WEATHER CORRECTED MD 10% POE","MW","Non-coincident"]
[null,null,null,null,"Coincident"]
[null,null,"WEATHER CORRECTED MD 10% POE","MVA","Non-coincident"]
[null,null,null,null,"Coincident"]
[null,null,"WEATHER CORRECTED MD 50% POE","MW","Non-coincident"]
[null,null,null,null,"Coincident"]
[null,null,"WEATHER CORRECTED MD 50% POE","MVA","Non-coincident"]
[null,null,null,null,"Coincident"]
[null,"NSP to enter name","CONNECTION POINT RATING","MVA","Non-coincident"]
[null,null,null,null,"Coincident"]
[null,null,"WINTER/SUMMER PEAKING",null,"Non-coincident"]
[null,null,null,null,"Coincident"]
[null,null,"ADJUSTMENTS - EMBEDDED GENERATION","MW","Non-coincident"]
[null,null,null,null,"Coincident"]
[null,null,"WEATHER CORRECTED MD 10% POE","MW","Non-coincident"]
[null,null,null,null,"Coincident"]
[null,null,"WEATHER CORRECTED MD 10% POE","MVA","Non-coincident"]
[null,null,null,null,"Coincident"]
[null,null,"WEATHER CORRECTED MD 50% POE","MW","Non-coincident"]
[null,null,null,null,"Coincident"]
[null,null,"WEATHER CORRECTED MD 50% POE","MVA","Non-coincident"]
[null,null,null,null,"Coincident"]
[null,"NSP to enter name","CONNECTION POINT RATING","MVA","Non-coincident"]
[null,null,null,null,"Coincident"]
[null,null,"WINTER/SUMMER PEAKING",null,"Non-coincident"]
[null,null,null,null,"Coincident"]
[null,null,"ADJUSTMENTS - EMBEDDED GENERATION","MW","Non-coincident"]
[null,null,null,null,"Coincident"]
[null,null,"WEATHER CORRECTED MD 10% POE","MW","Non-coincident"]
[null,null,null,null,"Coincident"]
[null,null,"WEATHER CORRECTED MD 10% POE","MVA","Non-coincident"]
[null,null,null,null,"Coincident"]
[null,null,"WEATHER CORRECTED MD 50% POE","MW","Non-coincident"]
[null,null,null,null,"Coincident"]
[null,null,"WEATHER CORRECTED MD 50% POE","MVA","Non-coincident"]
[null,null,null,null,"Coincident"]
[null,"NSP to enter name","CONNECTION POINT RATING","MVA","Non-coincident"]
[null,null,null,null,"Coincident"]
[null,null,"WINTER/SUMMER PEAKING",null,"Non-coincident"]
[null,null,null,null,"Coincident"]
[null,null,"ADJUSTMENTS - EMBEDDED GENERATION","MW","Non-coincident"]
[null,null,null,null,"Coincident"]
[null,null,"WEATHER CORRECTED MD 10% POE","MW","Non-coincident"]
[null,null,null,null,"Coincident"]
[null,null,"WEATHER CORRECTED MD 10% POE","MVA","Non-coincident"]
[null,null,null,null,"Coincident"]
[null,null,"WEATHER CORRECTED MD 50% POE","MW","Non-coincident"]
[null,null,null,null,"Coincident"]
[null,null,"WEATHER CORRECTED MD 50% POE","MVA","Non-coincident"]
[null,null,null,null,"Coincident"]
[null,"NSP to enter name","CONNECTION POINT RATING","MVA","Non-coincident"]
[null,null,null,null,"Coincident"]
[null,null,"WINTER/SUMMER PEAKING",null,"Non-coincident"]
[null,null,null,null,"Coincident"]
[null,null,"ADJUSTMENTS - EMBEDDED GENERATION","MW","Non-coincident"]
[null,null,null,null,"Coincident"]
[null,null,"WEATHER CORRECTED MD 10% POE","MW","Non-coincident"]
[null,null,null,null,"Coincident"]
[null,null,"WEATHER CORRECTED MD 10% POE","MVA","Non-coincident"]
[null,null,null,null,"Coincident"]
[null,null,"WEATHER CORRECTED MD 50% POE","MW","Non-coincident"]
[null,null,null,null,"Coincident"]
[null,null,"WEATHER CORRECTED MD 50% POE","MVA","Non-coincident"]
[null,null,null,null,"Coincident"]
[null,"NSP to enter name","CONNECTION POINT RATING","MVA","Non-coincident"]
[null,null,null,null,"Coincident"]
[null,null,"WINTER/SUMMER PEAKING",null,"Non-coincident"]
[null,null,null,null,"Coincident"]
[null,null,"ADJUSTMENTS - EMBEDDED GENERATION","MW","Non-coincident"]
[null,null,null,null,"Coincident"]
[null,null,"WEATHER CORRECTED MD 10% POE","MW","Non-coincident"]
[null,null,null,null,"Coincident"]
[null,null,"WEATHER CORRECTED MD 10% POE","MVA","Non-coincident"]
[null,null,null,null,"Coincident"]
[null,null,"WEATHER CORRECTED MD 50% POE","MW","Non-coincident"]
[null,null,null,null,"Coincident"]
[null,null,"WEATHER CORRECTED MD 50% POE","MVA","Non-coincident"]
[null,null,null,null,"Coincident"]
[null,"NSP to enter name","CONNECTION POINT RATING","MVA","Non-coincident"]
[null,null,null,null,"Coincident"]
[null,null,"WINTER/SUMMER PEAKING",null,"Non-coincident"]
[null,null,null,null,"Coincident"]
[null,null,"ADJUSTMENTS - EMBEDDED GENERATION","MW","Non-coincident"]
[null,null,null,null,"Coincident"]
[null,null,"WEATHER CORRECTED MD 10% POE","MW","Non-coincident"]
[null,null,null,null,"Coincident"]
[null,null,"WEATHER CORRECTED MD 10% POE","MVA","Non-coincident"]
[null,null,null,null,"Coincident"]
[null,null,"WEATHER CORRECTED MD 50% POE","MW","Non-coincident"]
[null,null,null,null,"Coincident"]
[null,null,"WEATHER CORRECTED MD 50% POE","MVA","Non-coincident"]
[null,null,null,null,"Coincident"]
[null,"NSP to enter name","CONNECTION POINT RATING","MVA","Non-coincident"]
[null,null,null,null,"Coincident"]
[null,null,"WINTER/SUMMER PEAKING",null,"Non-coincident"]
[null,null,null,null,"Coincident"]
[null,null,"ADJUSTMENTS - EMBEDDED GENERATION","MW","Non-coincident"]
[null,null,null,null,"Coincident"]
[null,null,"WEATHER CORRECTED MD 10% POE","MW","Non-coincident"]
[null,null,null,null,"Coincident"]
[null,null,"WEATHER CORRECTED MD 10% POE","MVA","Non-coincident"]
[null,null,null,null,"Coincident"]
[null,null,"WEATHER CORRECTED MD 50% POE","MW","Non-coincident"]
[null,null,null,null,"Coincident"]
[null,null,"WEATHER CORRECTED MD 50% POE","MVA","Non-coincident"]
[null,null,null,null,"Coincident"]
[null,"NSP to enter name","CONNECTION POINT RATING","MVA","Non-coincident"]
[null,null,null,null,"Coincident"]
[null,null,"WINTER/SUMMER PEAKING",null,"Non-coincident"]
[null,null,null,null,"Coincident"]
[null,null,"ADJUSTMENTS - EMBEDDED GENERATION","MW","Non-coincident"]
[null,null,null,null,"Coincident"]
[null,null,"WEATHER CORRECTED MD 10% POE","MW","Non-coincident"]
[null,null,null,null,"Coincident"]
[null,null,"WEATHER CORRECTED MD 10% POE","MVA","Non-coincident"]
[null,null,null,null,"Coincident"]
[null,null,"WEATHER CORRECTED MD 50% POE","MW","Non-coincident"]
[null,null,null,null,"Coincident"]
[null,null,"WEATHER CORRECTED MD 50% POE","MVA","Non-coincident"]
[null,null,null,null,"Coincident"]
[null,"NSP to enter name","CONNECTION POINT RATING","MVA","Non-coincident"]
[null,null,null,null,"Coincident"]
[null,null,"WINTER/SUMMER PEAKING",null,"Non-coincident"]
[null,null,null,null,"Coincident"]
[null,null,"ADJUSTMENTS - EMBEDDED GENERATION","MW","Non-coincident"]
[null,null,null,null,"Coincident"]
[null,null,"WEATHER CORRECTED MD 10% POE","MW","Non-coincident"]
[null,null,null,null,"Coincident"]
[null,null,"WEATHER CORRECTED MD 10% POE","MVA","Non-coincident"]
[null,null,null,null,"Coincident"]
[null,null,"WEATHER CORRECTED MD 50% POE","MW","Non-coincident"]
[null,null,null,null,"Coincident"]
[null,null,"WEATHER CORRECTED MD 50% POE","MVA","Non-coincident"]
[null,null,null,null,"Coincident"]
[null,"NSP to enter name","CONNECTION POINT RATING","MVA","Non-coincident"]
[null,null,null,null,"Coincident"]
[null,null,"WINTER/SUMMER PEAKING",null,"Non-coincident"]
[null,null,null,null,"Coincident"]
[null,null,"ADJUSTMENTS - EMBEDDED GENERATION","MW","Non-coincident"]
[null,null,null,null,"Coincident"]
[null,null,"WEATHER CORRECTED MD 10% POE","MW","Non-coincident"]
[null,null,null,null,"Coincident"]
[null,null,"WEATHER CORRECTED MD 10% POE","MVA","Non-coincident"]
[null,null,null,null,"Coincident"]
[null,null,"WEATHER CORRECTED MD 50% POE","MW","Non-coincident"]
[null,null,null,null,"Coincident"]
[null,null,"WEATHER CORRECTED MD 50% POE","MVA","Non-coincident"]
[null,null,null,null,"Coincident"]
[null,"NSP to enter name","CONNECTION POINT RATING","MVA","Non-coincident"]
[null,null,null,null,"Coincident"]
[null,null,"WINTER/SUMMER PEAKING",null,"Non-coincident"]
[null,null,null,null,"Coincident"]
[null,null,"ADJUSTMENTS - EMBEDDED GENERATION","MW","Non-coincident"]
[null,null,null,null,"Coincident"]
[null,null,"WEATHER CORRECTED MD 10% POE","MW","Non-coincident"]
[null,null,null,null,"Coincident"]
[null,null,"WEATHER CORRECTED MD 10% POE","MVA","Non-coincident"]
[null,null,null,null,"Coincident"]
[null,null,"WEATHER CORRECTED MD 50% POE","MW","Non-coincident"]
[null,null,null,null,"Coincident"]
[null,null,"WEATHER CORRECTED MD 50% POE","MVA","Non-coincident"]
[null,null,null,null,"Coincident"]
[null,"NSP to enter name","CONNECTION POINT RATING","MVA","Non-coincident"]
[null,null,null,null,"Coincident"]
[null,null,"WINTER/SUMMER PEAKING",null,"Non-coincident"]
[null,null,null,null,"Coincident"]
[null,null,"ADJUSTMENTS - EMBEDDED GENERATION","MW","Non-coincident"]
[null,null,null,null,"Coincident"]
[null,null,"WEATHER CORRECTED MD 10% POE","MW","Non-coincident"]
[null,null,null,null,"Coincident"]
[null,null,"WEATHER CORRECTED MD 10% POE","MVA","Non-coincident"]
[null,null,null,null,"Coincident"]
[null,null,"WEATHER CORRECTED MD 50% POE","MW","Non-coincident"]
[null,null,null,null,"Coincident"]
[null,null,"WEATHER CORRECTED MD 50% POE","MVA","Non-coincident"]
[null,null,null,null,"Coincident"]
[null,"NSP to enter name","CONNECTION POINT RATING","MVA","Non-coincident"]
[null,null,null,null,"Coincident"]
[null,null,"WINTER/SUMMER PEAKING",null,"Non-coincident"]
[null,null,null,null,"Coincident"]
[null,null,"ADJUSTMENTS - EMBEDDED GENERATION","MW","Non-coincident"]
[null,null,null,null,"Coincident"]
[null,null,"WEATHER CORRECTED MD 10% POE","MW","Non-coincident"]
[null,null,null,null,"Coincident"]
[null,null,"WEATHER CORRECTED MD 10% POE","MVA","Non-coincident"]
[null,null,null,null,"Coincident"]
[null,null,"WEATHER CORRECTED MD 50% POE","MW","Non-coincident"]
[null,null,null,null,"Coincident"]
[null,null,"WEATHER CORRECTED MD 50% POE","MVA","Non-coincident"]
[null,null,null,null,"Coincident"]
[null,"NSP to enter name","CONNECTION POINT RATING","MVA","Non-coincident"]
[null,null,null,null,"Coincident"]
[null,null,"WINTER/SUMMER PEAKING",null,"Non-coincident"]
[null,null,null,null,"Coincident"]
[null,null,"ADJUSTMENTS - EMBEDDED GENERATION","MW","Non-coincident"]
[null,null,null,null,"Coincident"]
[null,null,"WEATHER CORRECTED MD 10% POE","MW","Non-coincident"]
[null,null,null,null,"Coincident"]
[null,null,"WEATHER CORRECTED MD 10% POE","MVA","Non-coincident"]
[null,null,null,null,"Coincident"]
[null,null,"WEATHER CORRECTED MD 50% POE","MW","Non-coincident"]
[null,null,null,null,"Coincident"]
[null,null,"WEATHER CORRECTED MD 50% POE","MVA","Non-coincident"]
[null,null,null,null,"Coincident"]
[null,"NSP to enter name","CONNECTION POINT RATING","MVA","Non-coincident"]
[null,null,null,null,"Coincident"]
[null,null,"WINTER/SUMMER PEAKING",null,"Non-coincident"]
[null,null,null,null,"Coincident"]
[null,null,"ADJUSTMENTS - EMBEDDED GENERATION","MW","Non-coincident"]
[null,null,null,null,"Coincident"]
[null,null,"WEATHER CORRECTED MD 10% POE","MW","Non-coincident"]
[null,null,null,null,"Coincident"]
[null,null,"WEATHER CORRECTED MD 10% POE","MVA","Non-coincident"]
[null,null,null,null,"Coincident"]
[null,null,"WEATHER CORRECTED MD 50% POE","MW","Non-coincident"]
[null,null,null,null,"Coincident"]
[null,null,"WEATHER CORRECTED MD 50% POE","MVA","Non-coincident"]
[null,null,null,null,"Coincident"]
[null,"NSP to enter name","CONNECTION POINT RATING","MVA","Non-coincident"]
[null,null,null,null,"Coincident"]
[null,null,"WINTER/SUMMER PEAKING",null,"Non-coincident"]
[null,null,null,null,"Coincident"]
[null,null,"ADJUSTMENTS - EMBEDDED GENERATION","MW","Non-coincident"]
[null,null,null,null,"Coincident"]
[null,null,"WEATHER CORRECTED MD 10% POE","MW","Non-coincident"]
[null,null,null,null,"Coincident"]
[null,null,"WEATHER CORRECTED MD 10% POE","MVA","Non-coincident"]
[null,null,null,null,"Coincident"]
[null,null,"WEATHER CORRECTED MD 50% POE","MW","Non-coincident"]
[null,null,null,null,"Coincident"]
[null,null,"WEATHER CORRECTED MD 50% POE","MVA","Non-coincident"]
[null,null,null,null,"Coincident"]
[null,"NSP to enter name","CONNECTION POINT RATING","MVA","Non-coincident"]
[null,null,null,null,"Coincident"]
[null,null,"WINTER/SUMMER PEAKING",null,"Non-coincident"]
[null,null,null,null,"Coincident"]
[null,null,"ADJUSTMENTS - EMBEDDED GENERATION","MW","Non-coincident"]
[null,null,null,null,"Coincident"]
[null,null,"WEATHER CORRECTED MD 10% POE","MW","Non-coincident"]
[null,null,null,null,"Coincident"]
[null,null,"WEATHER CORRECTED MD 10% POE","MVA","Non-coincident"]
[null,null,null,null,"Coincident"]
[null,null,"WEATHER CORRECTED MD 50% POE","MW","Non-coincident"]
[null,null,null,null,"Coincident"]
[null,null,"WEATHER CORRECTED MD 50% POE","MVA","Non-coincident"]
[null,null,null,null,"Coincident"]
[null,"NSP to enter name","CONNECTION POINT RATING","MVA","Non-coincident"]
[null,null,null,null,"Coincident"]
[null,null,"WINTER/SUMMER PEAKING",null,"Non-coincident"]
[null,null,null,null,"Coincident"]
[null,null,"ADJUSTMENTS - EMBEDDED GENERATION","MW","Non-coincident"]
[null,null,null,null,"Coincident"]
[null,null,"WEATHER CORRECTED MD 10% POE","MW","Non-coincident"]
[null,null,null,null,"Coincident"]
[null,null,"WEATHER CORRECTED MD 10% POE","MVA","Non-coincident"]
[null,null,null,null,"Coincident"]
[null,null,"WEATHER CORRECTED MD 50% POE","MW","Non-coincident"]
[null,null,null,null,"Coincident"]
[null,null,"WEATHER CORRECTED MD 50% POE","MVA","Non-coincident"]
[null,null,null,null,"Coincident"]
[null,"NSP to enter name","CONNECTION POINT RATING","MVA","Non-coincident"]
[null,null,null,null,"Coincident"]
[null,null,"WINTER/SUMMER PEAKING",null,"Non-coincident"]
[null,null,null,null,"Coincident"]
[null,null,"ADJUSTMENTS - EMBEDDED GENERATION","MW","Non-coincident"]
[null,null,null,null,"Coincident"]
[null,null,"WEATHER CORRECTED MD 10% POE","MW","Non-coincident"]
[null,null,null,null,"Coincident"]
[null,null,"WEATHER CORRECTED MD 10% POE","MVA","Non-coincident"]
[null,null,null,null,"Coincident"]
[null,null,"WEATHER CORRECTED MD 50% POE","MW","Non-coincident"]
[null,null,null,null,"Coincident"]
[null,null,"WEATHER CORRECTED MD 50% POE","MVA","Non-coincident"]
[null,null,null,null,"Coincident"]
[null,"NSP to enter name","CONNECTION POINT RATING","MVA","Non-coincident"]
[null,null,null,null,"Coincident"]
[null,null,"WINTER/SUMMER PEAKING",null,"Non-coincident"]
[null,null,null,null,"Coincident"]
[null,null,"ADJUSTMENTS - EMBEDDED GENERATION","MW","Non-coincident"]
[null,null,null,null,"Coincident"]
[null,null,"WEATHER CORRECTED MD 10% POE","MW","Non-coincident"]
[null,null,null,null,"Coincident"]
[null,null,"WEATHER CORRECTED MD 10% POE","MVA","Non-coincident"]
[null,null,null,null,"Coincident"]
[null,null,"WEATHER CORRECTED MD 50% POE","MW","Non-coincident"]
[null,null,null,null,"Coincident"]
[null,null,"WEATHER CORRECTED MD 50% POE","MVA","Non-coincident"]
[null,null,null,null,"Coincident"]
[null,"NSP to enter name","CONNECTION POINT RATING","MVA","Non-coincident"]
[null,null,null,null,"Coincident"]
[null,null,"WINTER/SUMMER PEAKING",null,"Non-coincident"]
[null,null,null,null,"Coincident"]
[null,null,"ADJUSTMENTS - EMBEDDED GENERATION","MW","Non-coincident"]
[null,null,null,null,"Coincident"]
[null,null,"WEATHER CORRECTED MD 10% POE","MW","Non-coincident"]
[null,null,null,null,"Coincident"]
[null,null,"WEATHER CORRECTED MD 10% POE","MVA","Non-coincident"]
[null,null,null,null,"Coincident"]
[null,null,"WEATHER CORRECTED MD 50% POE","MW","Non-coincident"]
[null,null,null,null,"Coincident"]
[null,null,"WEATHER CORRECTED MD 50% POE","MVA","Non-coincident"]
[null,null,null,null,"Coincident"]
[null,"NSP to enter name","CONNECTION POINT RATING","MVA","Non-coincident"]
[null,null,null,null,"Coincident"]
[null,null,"WINTER/SUMMER PEAKING",null,"Non-coincident"]
[null,null,null,null,"Coincident"]
[null,null,"ADJUSTMENTS - EMBEDDED GENERATION","MW","Non-coincident"]
[null,null,null,null,"Coincident"]
[null,null,"WEATHER CORRECTED MD 10% POE","MW","Non-coincident"]
[null,null,null,null,"Coincident"]
[null,null,"WEATHER CORRECTED MD 10% POE","MVA","Non-coincident"]
[null,null,null,null,"Coincident"]
[null,null,"WEATHER CORRECTED MD 50% POE","MW","Non-coincident"]
[null,null,null,null,"Coincident"]
[null,null,"WEATHER CORRECTED MD 50% POE","MVA","Non-coincident"]
[null,null,null,null,"Coincident"]
[null,"NSP to enter name","CONNECTION POINT RATING","MVA","Non-coincident"]
[null,null,null,null,"Coincident"]
[null,null,"WINTER/SUMMER PEAKING",null,"Non-coincident"]
[null,null,null,null,"Coincident"]
[null,null,"ADJUSTMENTS - EMBEDDED GENERATION","MW","Non-coincident"]
[null,null,null,null,"Coincident"]
[null,null,"WEATHER CORRECTED MD 10% POE","MW","Non-coincident"]
[null,null,null,null,"Coincident"]
[null,null,"WEATHER CORRECTED MD 10% POE","MVA","Non-coincident"]
[null,null,null,null,"Coincident"]
[null,null,"WEATHER CORRECTED MD 50% POE","MW","Non-coincident"]
[null,null,null,null,"Coincident"]
[null,null,"WEATHER CORRECTED MD 50% POE","MVA","Non-coincident"]
[null,null,null,null,"Coincident"]
[null,"NSP to enter name","CONNECTION POINT RATING","MVA","Non-coincident"]
[null,null,null,null,"Coincident"]
[null,null,"WINTER/SUMMER PEAKING",null,"Non-coincident"]
[null,null,null,null,"Coincident"]
[null,null,"ADJUSTMENTS - EMBEDDED GENERATION","MW","Non-coincident"]
[null,null,null,null,"Coincident"]
[null,null,"WEATHER CORRECTED MD 10% POE","MW","Non-coincident"]
[null,null,null,null,"Coincident"]
[null,null,"WEATHER CORRECTED MD 10% POE","MVA","Non-coincident"]
[null,null,null,null,"Coincident"]
[null,null,"WEATHER CORRECTED MD 50% POE","MW","Non-coincident"]
[null,null,null,null,"Coincident"]
[null,null,"WEATHER CORRECTED MD 50% POE","MVA","Non-coincident"]
[null,null,null,null,"Coincident"]
[null,"NSP to enter name","CONNECTION POINT RATING","MVA","Non-coincident"]
[null,null,null,null,"Coincident"]
[null,null,"WINTER/SUMMER PEAKING",null,"Non-coincident"]
[null,null,null,null,"Coincident"]
[null,null,"ADJUSTMENTS - EMBEDDED GENERATION","MW","Non-coincident"]
[null,null,null,null,"Coincident"]
[null,null,"WEATHER CORRECTED MD 10% POE","MW","Non-coincident"]
[null,null,null,null,"Coincident"]
[null,null,"WEATHER CORRECTED MD 10% POE","MVA","Non-coincident"]
[null,null,null,null,"Coincident"]
[null,null,"WEATHER CORRECTED MD 50% POE","MW","Non-coincident"]
[null,null,null,null,"Coincident"]
[null,null,"WEATHER CORRECTED MD 50% POE","MVA","Non-coincident"]
[null,null,null,null,"Coincident"]
[null,"NSP to enter name","CONNECTION POINT RATING","MVA","Non-coincident"]
[null,null,null,null,"Coincident"]
[null,null,"WINTER/SUMMER PEAKING",null,"Non-coincident"]
[null,null,null,null,"Coincident"]
[null,null,"ADJUSTMENTS - EMBEDDED GENERATION","MW","Non-coincident"]
[null,null,null,null,"Coincident"]
[null,null,"WEATHER CORRECTED MD 10% POE","MW","Non-coincident"]
[null,null,null,null,"Coincident"]
[null,null,"WEATHER CORRECTED MD 10% POE","MVA","Non-coincident"]
[null,null,null,null,"Coincident"]
[null,null,"WEATHER CORRECTED MD 50% POE","MW","Non-coincident"]
[null,null,null,null,"Coincident"]
[null,null,"WEATHER CORRECTED MD 50% POE","MVA","Non-coincident"]
[null,null,null,null,"Coincident"]
[null,"NSP to enter name","CONNECTION POINT RATING","MVA","Non-coincident"]
[null,null,null,null,"Coincident"]
[null,null,"WINTER/SUMMER PEAKING",null,"Non-coincident"]
[null,null,null,null,"Coincident"]
[null,null,"ADJUSTMENTS - EMBEDDED GENERATION","MW","Non-coincident"]
[null,null,null,null,"Coincident"]
[null,null,"WEATHER CORRECTED MD 10% POE","MW","Non-coincident"]
[null,null,null,null,"Coincident"]
[null,null,"WEATHER CORRECTED MD 10% POE","MVA","Non-coincident"]
[null,null,null,null,"Coincident"]
[null,null,"WEATHER CORRECTED MD 50% POE","MW","Non-coincident"]
[null,null,null,null,"Coincident"]
[null,null,"WEATHER CORRECTED MD 50% POE","MVA","Non-coincident"]
[null,null,null,null,"Coincident"]
[null,"NSP to enter name","CONNECTION POINT RATING","MVA","Non-coincident"]
[null,null,null,null,"Coincident"]
[null,null,"WINTER/SUMMER PEAKING",null,"Non-coincident"]
[null,null,null,null,"Coincident"]
[null,null,"ADJUSTMENTS - EMBEDDED GENERATION","MW","Non-coincident"]
[null,null,null,null,"Coincident"]
[null,null,"WEATHER CORRECTED MD 10% POE","MW","Non-coincident"]
[null,null,null,null,"Coincident"]
[null,null,"WEATHER CORRECTED MD 10% POE","MVA","Non-coincident"]
[null,null,null,null,"Coincident"]
[null,null,"WEATHER CORRECTED MD 50% POE","MW","Non-coincident"]
[null,null,null,null,"Coincident"]
[null,null,"WEATHER CORRECTED MD 50% POE","MVA","Non-coincident"]
[null,null,null,null,"Coincident"]
[null,"NSP to enter name","CONNECTION POINT RATING","MVA","Non-coincident"]
[null,null,null,null,"Coincident"]
[null,null,"WINTER/SUMMER PEAKING",null,"Non-coincident"]
[null,null,null,null,"Coincident"]
[null,null,"ADJUSTMENTS - EMBEDDED GENERATION","MW","Non-coincident"]
[null,null,null,null,"Coincident"]
[null,null,"WEATHER CORRECTED MD 10% POE","MW","Non-coincident"]
[null,null,null,null,"Coincident"]
[null,null,"WEATHER CORRECTED MD 10% POE","MVA","Non-coincident"]
[null,null,null,null,"Coincident"]
[null,null,"WEATHER CORRECTED MD 50% POE","MW","Non-coincident"]
[null,null,null,null,"Coincident"]
[null,null,"WEATHER CORRECTED MD 50% POE","MVA","Non-coincident"]
[null,null,null,null,"Coincident"]
[null,"NSP to enter name","CONNECTION POINT RATING","MVA","Non-coincident"]
[null,null,null,null,"Coincident"]
[null,null,"WINTER/SUMMER PEAKING",null,"Non-coincident"]
[null,null,null,null,"Coincident"]
[null,null,"ADJUSTMENTS - EMBEDDED GENERATION","MW","Non-coincident"]
[null,null,null,null,"Coincident"]
[null,null,"WEATHER CORRECTED MD 10% POE","MW","Non-coincident"]
[null,null,null,null,"Coincident"]
[null,null,"WEATHER CORRECTED MD 10% POE","MVA","Non-coincident"]
[null,null,null,null,"Coincident"]
[null,null,"WEATHER CORRECTED MD 50% POE","MW","Non-coincident"]
[null,null,null,null,"Coincident"]
[null,null,"WEATHER CORRECTED MD 50% POE","MVA","Non-coincident"]
[null,null,null,null,"Coincident"]
[null,"NSP to enter name","CONNECTION POINT RATING","MVA","Non-coincident"]
[null,null,null,null,"Coincident"]
[null,null,"WINTER/SUMMER PEAKING",null,"Non-coincident"]
[null,null,null,null,"Coincident"]
[null,null,"ADJUSTMENTS - EMBEDDED GENERATION","MW","Non-coincident"]
[null,null,null,null,"Coincident"]
[null,null,"WEATHER CORRECTED MD 10% POE","MW","Non-coincident"]
[null,null,null,null,"Coincident"]
[null,null,"WEATHER CORRECTED MD 10% POE","MVA","Non-coincident"]
[null,null,null,null,"Coincident"]
[null,null,"WEATHER CORRECTED MD 50% POE","MW","Non-coincident"]
[null,null,null,null,"Coincident"]
[null,null,"WEATHER CORRECTED MD 50% POE","MVA","Non-coincident"]
[null,null,null,null,"Coincident"]
[null,"NSP to enter name","CONNECTION POINT RATING","MVA","Non-coincident"]
[null,null,null,null,"Coincident"]
[null,null,"WINTER/SUMMER PEAKING",null,"Non-coincident"]
[null,null,null,null,"Coincident"]
[null,null,"ADJUSTMENTS - EMBEDDED GENERATION","MW","Non-coincident"]
[null,null,null,null,"Coincident"]
[null,null,"WEATHER CORRECTED MD 10% POE","MW","Non-coincident"]
[null,null,null,null,"Coincident"]
[null,null,"WEATHER CORRECTED MD 10% POE","MVA","Non-coincident"]
[null,null,null,null,"Coincident"]
[null,null,"WEATHER CORRECTED MD 50% POE","MW","Non-coincident"]
[null,null,null,null,"Coincident"]
[null,null,"WEATHER CORRECTED MD 50% POE","MVA","Non-coincident"]
[null,null,null,null,"Coincident"]
[null,"NSP to enter name","CONNECTION POINT RATING","MVA","Non-coincident"]
[null,null,null,null,"Coincident"]
[null,null,"WINTER/SUMMER PEAKING",null,"Non-coincident"]
[null,null,null,null,"Coincident"]
[null,null,"ADJUSTMENTS - EMBEDDED GENERATION","MW","Non-coincident"]
[null,null,null,null,"Coincident"]
[null,null,"WEATHER CORRECTED MD 10% POE","MW","Non-coincident"]
[null,null,null,null,"Coincident"]
[null,null,"WEATHER CORRECTED MD 10% POE","MVA","Non-coincident"]
[null,null,null,null,"Coincident"]
[null,null,"WEATHER CORRECTED MD 50% POE","MW","Non-coincident"]
[null,null,null,null,"Coincident"]
[null,null,"WEATHER CORRECTED MD 50% POE","MVA","Non-coincident"]
[null,null,null,null,"Coincident"]
[null,"NSP to enter name","CONNECTION POINT RATING","MVA","Non-coincident"]
[null,null,null,null,"Coincident"]
[null,null,"WINTER/SUMMER PEAKING",null,"Non-coincident"]
[null,null,null,null,"Coincident"]
[null,null,"ADJUSTMENTS - EMBEDDED GENERATION","MW","Non-coincident"]
[null,null,null,null,"Coincident"]
[null,null,"WEATHER CORRECTED MD 10% POE","MW","Non-coincident"]
[null,null,null,null,"Coincident"]
[null,null,"WEATHER CORRECTED MD 10% POE","MVA","Non-coincident"]
[null,null,null,null,"Coincident"]
[null,null,"WEATHER CORRECTED MD 50% POE","MW","Non-coincident"]
[null,null,null,null,"Coincident"]
[null,null,"WEATHER CORRECTED MD 50% POE","MVA","Non-coincident"]
[null,null,null,null,"Coincident"]
[null,"NSP to enter name","CONNECTION POINT RATING","MVA","Non-coincident"]
[null,null,null,null,"Coincident"]
[null,null,"WINTER/SUMMER PEAKING",null,"Non-coincident"]
[null,null,null,null,"Coincident"]
[null,null,"ADJUSTMENTS - EMBEDDED GENERATION","MW","Non-coincident"]
[null,null,null,null,"Coincident"]
[null,null,"WEATHER CORRECTED MD 10% POE","MW","Non-coincident"]
[null,null,null,null,"Coincident"]
[null,null,"WEATHER CORRECTED MD 10% POE","MVA","Non-coincident"]
[null,null,null,null,"Coincident"]
[null,null,"WEATHER CORRECTED MD 50% POE","MW","Non-coincident"]
[null,null,null,null,"Coincident"]
[null,null,"WEATHER CORRECTED MD 50% POE","MVA","Non-coincident"]
[null,null,null,null,"Coincident"]
[null,"NSP to enter name","CONNECTION POINT RATING","MVA","Non-coincident"]
[null,null,null,null,"Coincident"]
[null,null,"WINTER/SUMMER PEAKING",null,"Non-coincident"]
[null,null,null,null,"Coincident"]
[null,null,"ADJUSTMENTS - EMBEDDED GENERATION","MW","Non-coincident"]
[null,null,null,null,"Coincident"]
[null,null,"WEATHER CORRECTED MD 10% POE","MW","Non-coincident"]
[null,null,null,null,"Coincident"]
[null,null,"WEATHER CORRECTED MD 10% POE","MVA","Non-coincident"]
[null,null,null,null,"Coincident"]
[null,null,"WEATHER CORRECTED MD 50% POE","MW","Non-coincident"]
[null,null,null,null,"Coincident"]
[null,null,"WEATHER CORRECTED MD 50% POE","MVA","Non-coincident"]
[null,null,null,null,"Coincident"]
[null,"NSP to enter name","CONNECTION POINT RATING","MVA","Non-coincident"]
[null,null,null,null,"Coincident"]
[null,null,"WINTER/SUMMER PEAKING",null,"Non-coincident"]
[null,null,null,null,"Coincident"]
[null,null,"ADJUSTMENTS - EMBEDDED GENERATION","MW","Non-coincident"]
[null,null,null,null,"Coincident"]
[null,null,"WEATHER CORRECTED MD 10% POE","MW","Non-coincident"]
[null,null,null,null,"Coincident"]
[null,null,"WEATHER CORRECTED MD 10% POE","MVA","Non-coincident"]
[null,null,null,null,"Coincident"]
[null,null,"WEATHER CORRECTED MD 50% POE","MW","Non-coincident"]
[null,null,null,null,"Coincident"]
[null,null,"WEATHER CORRECTED MD 50% POE","MVA","Non-coincident"]
[null,null,null,null,"Coincident"]
[null,"NSP to enter name","CONNECTION POINT RATING","MVA","Non-coincident"]
[null,null,null,null,"Coincident"]
[null,null,"WINTER/SUMMER PEAKING",null,"Non-coincident"]
[null,null,null,null,"Coincident"]
[null,null,"ADJUSTMENTS - EMBEDDED GENERATION","MW","Non-coincident"]
[null,null,null,null,"Coincident"]
[null,null,"WEATHER CORRECTED MD 10% POE","MW","Non-coincident"]
[null,null,null,null,"Coincident"]
[null,null,"WEATHER CORRECTED MD 10% POE","MVA","Non-coincident"]
[null,null,null,null,"Coincident"]
[null,null,"WEATHER CORRECTED MD 50% POE","MW","Non-coincident"]
[null,null,null,null,"Coincident"]
[null,null,"WEATHER CORRECTED MD 50% POE","MVA","Non-coincident"]
[null,null,null,null,"Coincident"]
[null,"NSP to enter name","CONNECTION POINT RATING","MVA","Non-coincident"]
[null,null,null,null,"Coincident"]
[null,null,"WINTER/SUMMER PEAKING",null,"Non-coincident"]
[null,null,null,null,"Coincident"]
[null,null,"ADJUSTMENTS - EMBEDDED GENERATION","MW","Non-coincident"]
[null,null,null,null,"Coincident"]
[null,null,"WEATHER CORRECTED MD 10% POE","MW","Non-coincident"]
[null,null,null,null,"Coincident"]
[null,null,"WEATHER CORRECTED MD 10% POE","MVA","Non-coincident"]
[null,null,null,null,"Coincident"]
[null,null,"WEATHER CORRECTED MD 50% POE","MW","Non-coincident"]
[null,null,null,null,"Coincident"]
[null,null,"WEATHER CORRECTED MD 50% POE","MVA","Non-coincident"]
[null,null,null,null,"Coincident"]
[null,"NSP to enter name","CONNECTION POINT RATING","MVA","Non-coincident"]
[null,null,null,null,"Coincident"]
[null,null,"WINTER/SUMMER PEAKING",null,"Non-coincident"]
[null,null,null,null,"Coincident"]
[null,null,"ADJUSTMENTS - EMBEDDED GENERATION","MW","Non-coincident"]
[null,null,null,null,"Coincident"]
[null,null,"WEATHER CORRECTED MD 10% POE","MW","Non-coincident"]
[null,null,null,null,"Coincident"]
[null,null,"WEATHER CORRECTED MD 10% POE","MVA","Non-coincident"]
[null,null,null,null,"Coincident"]
[null,null,"WEATHER CORRECTED MD 50% POE","MW","Non-coincident"]
[null,null,null,null,"Coincident"]
[null,null,"WEATHER CORRECTED MD 50% POE","MVA","Non-coincident"]
[null,null,null,null,"Coincident"]
[null,"NSP to enter name","CONNECTION POINT RATING","MVA","Non-coincident"]
[null,null,null,null,"Coincident"]
[null,null,"WINTER/SUMMER PEAKING",null,"Non-coincident"]
[null,null,null,null,"Coincident"]
[null,null,"ADJUSTMENTS - EMBEDDED GENERATION","MW","Non-coincident"]
[null,null,null,null,"Coincident"]
[null,null,"WEATHER CORRECTED MD 10% POE","MW","Non-coincident"]
[null,null,null,null,"Coincident"]
[null,null,"WEATHER CORRECTED MD 10% POE","MVA","Non-coincident"]
[null,null,null,null,"Coincident"]
[null,null,"WEATHER CORRECTED MD 50% POE","MW","Non-coincident"]
[null,null,null,null,"Coincident"]
[null,null,"WEATHER CORRECTED MD 50% POE","MVA","Non-coincident"]
[null,null,null,null,"Coincident"]
[null,"NSP to enter name","CONNECTION POINT RATING","MVA","Non-coincident"]
[null,null,null,null,"Coincident"]
[null,null,"WINTER/SUMMER PEAKING",null,"Non-coincident"]
[null,null,null,null,"Coincident"]
[null,null,"ADJUSTMENTS - EMBEDDED GENERATION","MW","Non-coincident"]
[null,null,null,null,"Coincident"]
[null,null,"WEATHER CORRECTED MD 10% POE","MW","Non-coincident"]
[null,null,null,null,"Coincident"]
[null,null,"WEATHER CORRECTED MD 10% POE","MVA","Non-coincident"]
[null,null,null,null,"Coincident"]
[null,null,"WEATHER CORRECTED MD 50% POE","MW","Non-coincident"]
[null,null,null,null,"Coincident"]
[null,null,"WEATHER CORRECTED MD 50% POE","MVA","Non-coincident"]
[null,null,null,null,"Coincident"]
[null,"NSP to enter name","CONNECTION POINT RATING","MVA","Non-coincident"]
[null,null,null,null,"Coincident"]
[null,null,"WINTER/SUMMER PEAKING",null,"Non-coincident"]
[null,null,null,null,"Coincident"]
[null,null,"ADJUSTMENTS - EMBEDDED GENERATION","MW","Non-coincident"]
[null,null,null,null,"Coincident"]
[null,null,"WEATHER CORRECTED MD 10% POE","MW","Non-coincident"]
[null,null,null,null,"Coincident"]
[null,null,"WEATHER CORRECTED MD 10% POE","MVA","Non-coincident"]
[null,null,null,null,"Coincident"]
[null,null,"WEATHER CORRECTED MD 50% POE","MW","Non-coincident"]
[null,null,null,null,"Coincident"]
[null,null,"WEATHER CORRECTED MD 50% POE","MVA","Non-coincident"]
[null,null,null,null,"Coincident"]
[null,"NSP to enter name","CONNECTION POINT RATING","MVA","Non-coincident"]
[null,null,null,null,"Coincident"]
[null,null,"WINTER/SUMMER PEAKING",null,"Non-coincident"]
[null,null,null,null,"Coincident"]
[null,null,"ADJUSTMENTS - EMBEDDED GENERATION","MW","Non-coincident"]
[null,null,null,null,"Coincident"]
[null,null,"WEATHER CORRECTED MD 10% POE","MW","Non-coincident"]
[null,null,null,null,"Coincident"]
[null,null,"WEATHER CORRECTED MD 10% POE","MVA","Non-coincident"]
[null,null,null,null,"Coincident"]
[null,null,"WEATHER CORRECTED MD 50% POE","MW","Non-coincident"]
[null,null,null,null,"Coincident"]
[null,null,"WEATHER CORRECTED MD 50% POE","MVA","Non-coincident"]
[null,null,null,null,"Coincident"]
[null,"NSP to enter name","CONNECTION POINT RATING","MVA","Non-coincident"]
[null,null,null,null,"Coincident"]
[null,null,"WINTER/SUMMER PEAKING",null,"Non-coincident"]
[null,null,null,null,"Coincident"]
[null,null,"ADJUSTMENTS - EMBEDDED GENERATION","MW","Non-coincident"]
[null,null,null,null,"Coincident"]
[null,null,"WEATHER CORRECTED MD 10% POE","MW","Non-coincident"]
[null,null,null,null,"Coincident"]
[null,null,"WEATHER CORRECTED MD 10% POE","MVA","Non-coincident"]
[null,null,null,null,"Coincident"]
[null,null,"WEATHER CORRECTED MD 50% POE","MW","Non-coincident"]
[null,null,null,null,"Coincident"]
[null,null,"WEATHER CORRECTED MD 50% POE","MVA","Non-coincident"]
[null,null,null,null,"Coincident"]
[null,"NSP to enter name","CONNECTION POINT RATING","MVA","Non-coincident"]
[null,null,null,null,"Coincident"]
[null,null,"WINTER/SUMMER PEAKING",null,"Non-coincident"]
[null,null,null,null,"Coincident"]
[null,null,"ADJUSTMENTS - EMBEDDED GENERATION","MW","Non-coincident"]
[null,null,null,null,"Coincident"]
[null,null,"WEATHER CORRECTED MD 10% POE","MW","Non-coincident"]
[null,null,null,null,"Coincident"]
[null,null,"WEATHER CORRECTED MD 10% POE","MVA","Non-coincident"]
[null,null,null,null,"Coincident"]
[null,null,"WEATHER CORRECTED MD 50% POE","MW","Non-coincident"]
[null,null,null,null,"Coincident"]
[null,null,"WEATHER CORRECTED MD 50% POE","MVA","Non-coincident"]
[null,null,null,null,"Coincident"]
[null,"NSP to enter name","CONNECTION POINT RATING","MVA","Non-coincident"]
[null,null,null,null,"Coincident"]
[null,null,"WINTER/SUMMER PEAKING",null,"Non-coincident"]
[null,null,null,null,"Coincident"]
[null,null,"ADJUSTMENTS - EMBEDDED GENERATION","MW","Non-coincident"]
[null,null,null,null,"Coincident"]
[null,null,"WEATHER CORRECTED MD 10% POE","MW","Non-coincident"]
[null,null,null,null,"Coincident"]
[null,null,"WEATHER CORRECTED MD 10% POE","MVA","Non-coincident"]
[null,null,null,null,"Coincident"]
[null,null,"WEATHER CORRECTED MD 50% POE","MW","Non-coincident"]
[null,null,null,null,"Coincident"]
[null,null,"WEATHER CORRECTED MD 50% POE","MVA","Non-coincident"]
[null,null,null,null,"Coincident"]
[null,"NSP to enter name","CONNECTION POINT RATING","MVA","Non-coincident"]
[null,null,null,null,"Coincident"]
[null,null,"WINTER/SUMMER PEAKING",null,"Non-coincident"]
[null,null,null,null,"Coincident"]
[null,null,"ADJUSTMENTS - EMBEDDED GENERATION","MW","Non-coincident"]
[null,null,null,null,"Coincident"]
[null,null,"WEATHER CORRECTED MD 10% POE","MW","Non-coincident"]
[null,null,null,null,"Coincident"]
[null,null,"WEATHER CORRECTED MD 10% POE","MVA","Non-coincident"]
[null,null,null,null,"Coincident"]
[null,null,"WEATHER CORRECTED MD 50% POE","MW","Non-coincident"]
[null,null,null,null,"Coincident"]
[null,null,"WEATHER CORRECTED MD 50% POE","MVA","Non-coincident"]
[null,null,null,null,"Coincident"]
[null,"NSP to enter name","CONNECTION POINT RATING","MVA","Non-coincident"]
[null,null,null,null,"Coincident"]
[null,null,"WINTER/SUMMER PEAKING",null,"Non-coincident"]
[null,null,null,null,"Coincident"]
[null,null,"ADJUSTMENTS - EMBEDDED GENERATION","MW","Non-coincident"]
[null,null,null,null,"Coincident"]
[null,null,"WEATHER CORRECTED MD 10% POE","MW","Non-coincident"]
[null,null,null,null,"Coincident"]
[null,null,"WEATHER CORRECTED MD 10% POE","MVA","Non-coincident"]
[null,null,null,null,"Coincident"]
[null,null,"WEATHER CORRECTED MD 50% POE","MW","Non-coincident"]
[null,null,null,null,"Coincident"]
[null,null,"WEATHER CORRECTED MD 50% POE","MVA","Non-coincident"]
[null,null,null,null,"Coincident"]
[null,"NSP to enter name","CONNECTION POINT RATING","MVA","Non-coincident"]
[null,null,null,null,"Coincident"]
[null,null,"WINTER/SUMMER PEAKING",null,"Non-coincident"]
[null,null,null,null,"Coincident"]
[null,null,"ADJUSTMENTS - EMBEDDED GENERATION","MW","Non-coincident"]
[null,null,null,null,"Coincident"]
[null,null,"WEATHER CORRECTED MD 10% POE","MW","Non-coincident"]
[null,null,null,null,"Coincident"]
[null,null,"WEATHER CORRECTED MD 10% POE","MVA","Non-coincident"]
[null,null,null,null,"Coincident"]
[null,null,"WEATHER CORRECTED MD 50% POE","MW","Non-coincident"]
[null,null,null,null,"Coincident"]
[null,null,"WEATHER CORRECTED MD 50% POE","MVA","Non-coincident"]
[null,null,null,null,"Coincident"]
[null,"NSP to enter name","CONNECTION POINT RATING","MVA","Non-coincident"]
[null,null,null,null,"Coincident"]
[null,null,"WINTER/SUMMER PEAKING",null,"Non-coincident"]
[null,null,null,null,"Coincident"]
[null,null,"ADJUSTMENTS - EMBEDDED GENERATION","MW","Non-coincident"]
[null,null,null,null,"Coincident"]
[null,null,"WEATHER CORRECTED MD 10% POE","MW","Non-coincident"]
[null,null,null,null,"Coincident"]
[null,null,"WEATHER CORRECTED MD 10% POE","MVA","Non-coincident"]
[null,null,null,null,"Coincident"]
[null,null,"WEATHER CORRECTED MD 50% POE","MW","Non-coincident"]
[null,null,null,null,"Coincident"]
[null,null,"WEATHER CORRECTED MD 50% POE","MVA","Non-coincident"]
[null,null,null,null,"Coincident"]
[null,"NSP to enter name","CONNECTION POINT RATING","MVA","Non-coincident"]
[null,null,null,null,"Coincident"]
[null,null,"WINTER/SUMMER PEAKING",null,"Non-coincident"]
[null,null,null,null,"Coincident"]
[null,null,"ADJUSTMENTS - EMBEDDED GENERATION","MW","Non-coincident"]
[null,null,null,null,"Coincident"]
[null,null,"WEATHER CORRECTED MD 10% POE","MW","Non-coincident"]
[null,null,null,null,"Coincident"]
[null,null,"WEATHER CORRECTED MD 10% POE","MVA","Non-coincident"]
[null,null,null,null,"Coincident"]
[null,null,"WEATHER CORRECTED MD 50% POE","MW","Non-coincident"]
[null,null,null,null,"Coincident"]
[null,null,"WEATHER CORRECTED MD 50% POE","MVA","Non-coincident"]
[null,null,null,null,"Coincident"]
[null,"NSP to enter name","CONNECTION POINT RATING","MVA","Non-coincident"]
[null,null,null,null,"Coincident"]
[null,null,"WINTER/SUMMER PEAKING",null,"Non-coincident"]
[null,null,null,null,"Coincident"]
[null,null,"ADJUSTMENTS - EMBEDDED GENERATION","MW","Non-coincident"]
[null,null,null,null,"Coincident"]
[null,null,"WEATHER CORRECTED MD 10% POE","MW","Non-coincident"]
[null,null,null,null,"Coincident"]
[null,null,"WEATHER CORRECTED MD 10% POE","MVA","Non-coincident"]
[null,null,null,null,"Coincident"]
[null,null,"WEATHER CORRECTED MD 50% POE","MW","Non-coincident"]
[null,null,null,null,"Coincident"]
[null,null,"WEATHER CORRECTED MD 50% POE","MVA","Non-coincident"]
[null,null,null,null,"Coincident"]
[null,"NSP to enter name","CONNECTION POINT RATING","MVA","Non-coincident"]
[null,null,null,null,"Coincident"]
[null,null,"WINTER/SUMMER PEAKING",null,"Non-coincident"]
[null,null,null,null,"Coincident"]
[null,null,"ADJUSTMENTS - EMBEDDED GENERATION","MW","Non-coincident"]
[null,null,null,null,"Coincident"]
[null,null,"WEATHER CORRECTED MD 10% POE","MW","Non-coincident"]
[null,null,null,null,"Coincident"]
[null,null,"WEATHER CORRECTED MD 10% POE","MVA","Non-coincident"]
[null,null,null,null,"Coincident"]
[null,null,"WEATHER CORRECTED MD 50% POE","MW","Non-coincident"]
[null,null,null,null,"Coincident"]
[null,null,"WEATHER CORRECTED MD 50% POE","MVA","Non-coincident"]
[null,null,null,null,"Coincident"]
[null,"NSP to enter name","CONNECTION POINT RATING","MVA","Non-coincident"]
[null,null,null,null,"Coincident"]
[null,null,"WINTER/SUMMER PEAKING",null,"Non-coincident"]
[null,null,null,null,"Coincident"]
[null,null,"ADJUSTMENTS - EMBEDDED GENERATION","MW","Non-coincident"]
[null,null,null,null,"Coincident"]
[null,null,"WEATHER CORRECTED MD 10% POE","MW","Non-coincident"]
[null,null,null,null,"Coincident"]
[null,null,"WEATHER CORRECTED MD 10% POE","MVA","Non-coincident"]
[null,null,null,null,"Coincident"]
[null,null,"WEATHER CORRECTED MD 50% POE","MW","Non-coincident"]
[null,null,null,null,"Coincident"]
[null,null,"WEATHER CORRECTED MD 50% POE","MVA","Non-coincident"]
[null,null,null,null,"Coincident"]
[null,"NSP to enter name","CONNECTION POINT RATING","MVA","Non-coincident"]
[null,null,null,null,"Coincident"]
[null,null,"WINTER/SUMMER PEAKING",null,"Non-coincident"]
[null,null,null,null,"Coincident"]
[null,null,"ADJUSTMENTS - EMBEDDED GENERATION","MW","Non-coincident"]
[null,null,null,null,"Coincident"]
[null,null,"WEATHER CORRECTED MD 10% POE","MW","Non-coincident"]
[null,null,null,null,"Coincident"]
[null,null,"WEATHER CORRECTED MD 10% POE","MVA","Non-coincident"]
[null,null,null,null,"Coincident"]
[null,null,"WEATHER CORRECTED MD 50% POE","MW","Non-coincident"]
[null,null,null,null,"Coincident"]
[null,null,"WEATHER CORRECTED MD 50% POE","MVA","Non-coincident"]
[null,null,null,null,"Coincident"]
[null,"NSP to enter name","CONNECTION POINT RATING","MVA","Non-coincident"]
[null,null,null,null,"Coincident"]
[null,null,"WINTER/SUMMER PEAKING",null,"Non-coincident"]
[null,null,null,null,"Coincident"]
[null,null,"ADJUSTMENTS - EMBEDDED GENERATION","MW","Non-coincident"]
[null,null,null,null,"Coincident"]
[null,null,"WEATHER CORRECTED MD 10% POE","MW","Non-coincident"]
[null,null,null,null,"Coincident"]
[null,null,"WEATHER CORRECTED MD 10% POE","MVA","Non-coincident"]
[null,null,null,null,"Coincident"]
[null,null,"WEATHER CORRECTED MD 50% POE","MW","Non-coincident"]
[null,null,null,null,"Coincident"]
[null,null,"WEATHER CORRECTED MD 50% POE","MVA","Non-coincident"]
[null,null,null,null,"Coincident"]
[null,"NSP to enter name","CONNECTION POINT RATING","MVA","Non-coincident"]
[null,null,null,null,"Coincident"]
[null,null,"WINTER/SUMMER PEAKING",null,"Non-coincident"]
[null,null,null,null,"Coincident"]
[null,null,"ADJUSTMENTS - EMBEDDED GENERATION","MW","Non-coincident"]
[null,null,null,null,"Coincident"]
[null,null,"WEATHER CORRECTED MD 10% POE","MW","Non-coincident"]
[null,null,null,null,"Coincident"]
[null,null,"WEATHER CORRECTED MD 10% POE","MVA","Non-coincident"]
[null,null,null,null,"Coincident"]
[null,null,"WEATHER CORRECTED MD 50% POE","MW","Non-coincident"]
[null,null,null,null,"Coincident"]
[null,null,"WEATHER CORRECTED MD 50% POE","MVA","Non-coincident"]
[null,null,null,null,"Coincident"]
[null,"NSP to enter name","CONNECTION POINT RATING","MVA","Non-coincident"]
[null,null,null,null,"Coincident"]
[null,null,"WINTER/SUMMER PEAKING",null,"Non-coincident"]
[null,null,null,null,"Coincident"]
[null,null,"ADJUSTMENTS - EMBEDDED GENERATION","MW","Non-coincident"]
[null,null,null,null,"Coincident"]
[null,null,"WEATHER CORRECTED MD 10% POE","MW","Non-coincident"]
[null,null,null,null,"Coincident"]
[null,null,"WEATHER CORRECTED MD 10% POE","MVA","Non-coincident"]
[null,null,null,null,"Coincident"]
[null,null,"WEATHER CORRECTED MD 50% POE","MW","Non-coincident"]
[null,null,null,null,"Coincident"]
[null,null,"WEATHER CORRECTED MD 50% POE","MVA","Non-coincident"]
[null,null,null,null,"Coincident"]
[null,"NSP to enter name","CONNECTION POINT RATING","MVA","Non-coincident"]
[null,null,null,null,"Coincident"]
[null,null,"WINTER/SUMMER PEAKING",null,"Non-coincident"]
[null,null,null,null,"Coincident"]
[null,null,"ADJUSTMENTS - EMBEDDED GENERATION","MW","Non-coincident"]
[null,null,null,null,"Coincident"]
[null,null,"WEATHER CORRECTED MD 10% POE","MW","Non-coincident"]
[null,null,null,null,"Coincident"]
[null,null,"WEATHER CORRECTED MD 10% POE","MVA","Non-coincident"]
[null,null,null,null,"Coincident"]
[null,null,"WEATHER CORRECTED MD 50% POE","MW","Non-coincident"]
[null,null,null,null,"Coincident"]
[null,null,"WEATHER CORRECTED MD 50% POE","MVA","Non-coincident"]
[null,null,null,null,"Coincident"]
[null,"NSP to enter name","CONNECTION POINT RATING","MVA","Non-coincident"]
[null,null,null,null,"Coincident"]
[null,null,"WINTER/SUMMER PEAKING",null,"Non-coincident"]
[null,null,null,null,"Coincident"]
[null,null,"ADJUSTMENTS - EMBEDDED GENERATION","MW","Non-coincident"]
[null,null,null,null,"Coincident"]
[null,null,"WEATHER CORRECTED MD 10% POE","MW","Non-coincident"]
[null,null,null,null,"Coincident"]
[null,null,"WEATHER CORRECTED MD 10% POE","MVA","Non-coincident"]
[null,null,null,null,"Coincident"]
[null,null,"WEATHER CORRECTED MD 50% POE","MW","Non-coincident"]
[null,null,null,null,"Coincident"]
[null,null,"WEATHER CORRECTED MD 50% POE","MVA","Non-coincident"]
[null,null,null,null,"Coincident"]
[null,"NSP to enter name","CONNECTION POINT RATING","MVA","Non-coincident"]
[null,null,null,null,"Coincident"]
[null,null,"WINTER/SUMMER PEAKING",null,"Non-coincident"]
[null,null,null,null,"Coincident"]
[null,null,"ADJUSTMENTS - EMBEDDED GENERATION","MW","Non-coincident"]
[null,null,null,null,"Coincident"]
[null,null,"WEATHER CORRECTED MD 10% POE","MW","Non-coincident"]
[null,null,null,null,"Coincident"]
[null,null,"WEATHER CORRECTED MD 10% POE","MVA","Non-coincident"]
[null,null,null,null,"Coincident"]
[null,null,"WEATHER CORRECTED MD 50% POE","MW","Non-coincident"]
[null,null,null,null,"Coincident"]
[null,null,"WEATHER CORRECTED MD 50% POE","MVA","Non-coincident"]
[null,null,null,null,"Coincident"]
[null,"NSP to enter name","CONNECTION POINT RATING","MVA","Non-coincident"]
[null,null,null,null,"Coincident"]
[null,null,"WINTER/SUMMER PEAKING",null,"Non-coincident"]
[null,null,null,null,"Coincident"]
[null,null,"ADJUSTMENTS - EMBEDDED GENERATION","MW","Non-coincident"]
[null,null,null,null,"Coincident"]
[null,null,"WEATHER CORRECTED MD 10% POE","MW","Non-coincident"]
[null,null,null,null,"Coincident"]
[null,null,"WEATHER CORRECTED MD 10% POE","MVA","Non-coincident"]
[null,null,null,null,"Coincident"]
[null,null,"WEATHER CORRECTED MD 50% POE","MW","Non-coincident"]
[null,null,null,null,"Coincident"]
[null,null,"WEATHER CORRECTED MD 50% POE","MVA","Non-coincident"]
[null,null,null,null,"Coincident"]
[null,"NSP to enter name","CONNECTION POINT RATING","MVA","Non-coincident"]
[null,null,null,null,"Coincident"]
[null,null,"WINTER/SUMMER PEAKING",null,"Non-coincident"]
[null,null,null,null,"Coincident"]
[null,null,"ADJUSTMENTS - EMBEDDED GENERATION","MW","Non-coincident"]
[null,null,null,null,"Coincident"]
[null,null,"WEATHER CORRECTED MD 10% POE","MW","Non-coincident"]
[null,null,null,null,"Coincident"]
[null,null,"WEATHER CORRECTED MD 10% POE","MVA","Non-coincident"]
[null,null,null,null,"Coincident"]
[null,null,"WEATHER CORRECTED MD 50% POE","MW","Non-coincident"]
[null,null,null,null,"Coincident"]
[null,null,"WEATHER CORRECTED MD 50% POE","MVA","Non-coincident"]
[null,null,null,null,"Coincident"]
[null,"NSP to enter name","CONNECTION POINT RATING","MVA","Non-coincident"]
[null,null,null,null,"Coincident"]
[null,null,"WINTER/SUMMER PEAKING",null,"Non-coincident"]
[null,null,null,null,"Coincident"]
[null,null,"ADJUSTMENTS - EMBEDDED GENERATION","MW","Non-coincident"]
[null,null,null,null,"Coincident"]
[null,null,"WEATHER CORRECTED MD 10% POE","MW","Non-coincident"]
[null,null,null,null,"Coincident"]
[null,null,"WEATHER CORRECTED MD 10% POE","MVA","Non-coincident"]
[null,null,null,null,"Coincident"]
[null,null,"WEATHER CORRECTED MD 50% POE","MW","Non-coincident"]
[null,null,null,null,"Coincident"]
[null,null,"WEATHER CORRECTED MD 50% POE","MVA","Non-coincident"]
[null,null,null,null,"Coincident"]
[null,"NSP to enter name","CONNECTION POINT RATING","MVA","Non-coincident"]
[null,null,null,null,"Coincident"]
[null,null,"WINTER/SUMMER PEAKING",null,"Non-coincident"]
[null,null,null,null,"Coincident"]
[null,null,"ADJUSTMENTS - EMBEDDED GENERATION","MW","Non-coincident"]
[null,null,null,null,"Coincident"]
[null,null,"WEATHER CORRECTED MD 10% POE","MW","Non-coincident"]
[null,null,null,null,"Coincident"]
[null,null,"WEATHER CORRECTED MD 10% POE","MVA","Non-coincident"]
[null,null,null,null,"Coincident"]
[null,null,"WEATHER CORRECTED MD 50% POE","MW","Non-coincident"]
[null,null,null,null,"Coincident"]
[null,null,"WEATHER CORRECTED MD 50% POE","MVA","Non-coincident"]
[null,null,null,null,"Coincident"]
[null,"NSP to enter name","CONNECTION POINT RATING","MVA","Non-coincident"]
[null,null,null,null,"Coincident"]
[null,null,"WINTER/SUMMER PEAKING",null,"Non-coincident"]
[null,null,null,null,"Coincident"]
[null,null,"ADJUSTMENTS - EMBEDDED GENERATION","MW","Non-coincident"]
[null,null,null,null,"Coincident"]
[null,null,"WEATHER CORRECTED MD 10% POE","MW","Non-coincident"]
[null,null,null,null,"Coincident"]
[null,null,"WEATHER CORRECTED MD 10% POE","MVA","Non-coincident"]
[null,null,null,null,"Coincident"]
[null,null,"WEATHER CORRECTED MD 50% POE","MW","Non-coincident"]
[null,null,null,null,"Coincident"]
[null,null,"WEATHER CORRECTED MD 50% POE","MVA","Non-coincident"]
[null,null,null,null,"Coincident"]
[null,"NSP to enter name","CONNECTION POINT RATING","MVA","Non-coincident"]
[null,null,null,null,"Coincident"]
[null,null,"WINTER/SUMMER PEAKING",null,"Non-coincident"]
[null,null,null,null,"Coincident"]
[null,null,"ADJUSTMENTS - EMBEDDED GENERATION","MW","Non-coincident"]
[null,null,null,null,"Coincident"]
[null,null,"WEATHER CORRECTED MD 10% POE","MW","Non-coincident"]
[null,null,null,null,"Coincident"]
[null,null,"WEATHER CORRECTED MD 10% POE","MVA","Non-coincident"]
[null,null,null,null,"Coincident"]
[null,null,"WEATHER CORRECTED MD 50% POE","MW","Non-coincident"]
[null,null,null,null,"Coincident"]
[null,null,"WEATHER CORRECTED MD 50% POE","MVA","Non-coincident"]
[null,null,null,null,"Coincident"]
[null,"NSP to enter name","CONNECTION POINT RATING","MVA","Non-coincident"]
[null,null,null,null,"Coincident"]
[null,null,"WINTER/SUMMER PEAKING",null,"Non-coincident"]
[null,null,null,null,"Coincident"]
[null,null,"ADJUSTMENTS - EMBEDDED GENERATION","MW","Non-coincident"]
[null,null,null,null,"Coincident"]
[null,null,"WEATHER CORRECTED MD 10% POE","MW","Non-coincident"]
[null,null,null,null,"Coincident"]
[null,null,"WEATHER CORRECTED MD 10% POE","MVA","Non-coincident"]
[null,null,null,null,"Coincident"]
[null,null,"WEATHER CORRECTED MD 50% POE","MW","Non-coincident"]
[null,null,null,null,"Coincident"]
[null,null,"WEATHER CORRECTED MD 50% POE","MVA","Non-coincident"]
[null,null,null,null,"Coincident"]
[null,"NSP to enter name","CONNECTION POINT RATING","MVA","Non-coincident"]
[null,null,null,null,"Coincident"]
[null,null,"WINTER/SUMMER PEAKING",null,"Non-coincident"]
[null,null,null,null,"Coincident"]
[null,null,"ADJUSTMENTS - EMBEDDED GENERATION","MW","Non-coincident"]
[null,null,null,null,"Coincident"]
[null,null,"WEATHER CORRECTED MD 10% POE","MW","Non-coincident"]
[null,null,null,null,"Coincident"]
[null,null,"WEATHER CORRECTED MD 10% POE","MVA","Non-coincident"]
[null,null,null,null,"Coincident"]
[null,null,"WEATHER CORRECTED MD 50% POE","MW","Non-coincident"]
[null,null,null,null,"Coincident"]
[null,null,"WEATHER CORRECTED MD 50% POE","MVA","Non-coincident"]
[null,null,null,null,"Coincident"]
[null,"NSP to enter name","CONNECTION POINT RATING","MVA","Non-coincident"]
[null,null,null,null,"Coincident"]
[null,null,"WINTER/SUMMER PEAKING",null,"Non-coincident"]
[null,null,null,null,"Coincident"]
[null,null,"ADJUSTMENTS - EMBEDDED GENERATION","MW","Non-coincident"]
[null,null,null,null,"Coincident"]
[null,null,"WEATHER CORRECTED MD 10% POE","MW","Non-coincident"]
[null,null,null,null,"Coincident"]
[null,null,"WEATHER CORRECTED MD 10% POE","MVA","Non-coincident"]
[null,null,null,null,"Coincident"]
[null,null,"WEATHER CORRECTED MD 50% POE","MW","Non-coincident"]
[null,null,null,null,"Coincident"]
[null,null,"WEATHER CORRECTED MD 50% POE","MVA","Non-coincident"]
[null,null,null,null,"Coincident"]
[null,"NSP to enter name","CONNECTION POINT RATING","MVA","Non-coincident"]
[null,null,null,null,"Coincident"]
[null,null,"WINTER/SUMMER PEAKING",null,"Non-coincident"]
[null,null,null,null,"Coincident"]
[null,null,"ADJUSTMENTS - EMBEDDED GENERATION","MW","Non-coincident"]
[null,null,null,null,"Coincident"]
[null,null,"WEATHER CORRECTED MD 10% POE","MW","Non-coincident"]
[null,null,null,null,"Coincident"]
[null,null,"WEATHER CORRECTED MD 10% POE","MVA","Non-coincident"]
[null,null,null,null,"Coincident"]
[null,null,"WEATHER CORRECTED MD 50% POE","MW","Non-coincident"]
[null,null,null,null,"Coincident"]
[null,null,"WEATHER CORRECTED MD 50% POE","MVA","Non-coincident"]
[null,null,null,null,"Coincident"]
[null,"NSP to enter name","CONNECTION POINT RATING","MVA","Non-coincident"]
[null,null,null,null,"Coincident"]
[null,null,"WINTER/SUMMER PEAKING",null,"Non-coincident"]
[null,null,null,null,"Coincident"]
[null,null,"ADJUSTMENTS - EMBEDDED GENERATION","MW","Non-coincident"]
[null,null,null,null,"Coincident"]
[null,null,"WEATHER CORRECTED MD 10% POE","MW","Non-coincident"]
[null,null,null,null,"Coincident"]
[null,null,"WEATHER CORRECTED MD 10% POE","MVA","Non-coincident"]
[null,null,null,null,"Coincident"]
[null,null,"WEATHER CORRECTED MD 50% POE","MW","Non-coincident"]
[null,null,null,null,"Coincident"]
[null,null,"WEATHER CORRECTED MD 50% POE","MVA","Non-coincident"]
[null,null,null,null,"Coincident"]
[null,"NSP to enter name","CONNECTION POINT RATING","MVA","Non-coincident"]
[null,null,null,null,"Coincident"]
[null,null,"WINTER/SUMMER PEAKING",null,"Non-coincident"]
[null,null,null,null,"Coincident"]
[null,null,"ADJUSTMENTS - EMBEDDED GENERATION","MW","Non-coincident"]
[null,null,null,null,"Coincident"]
[null,null,"WEATHER CORRECTED MD 10% POE","MW","Non-coincident"]
[null,null,null,null,"Coincident"]
[null,null,"WEATHER CORRECTED MD 10% POE","MVA","Non-coincident"]
[null,null,null,null,"Coincident"]
[null,null,"WEATHER CORRECTED MD 50% POE","MW","Non-coincident"]
[null,null,null,null,"Coincident"]
[null,null,"WEATHER CORRECTED MD 50% POE","MVA","Non-coincident"]
[null,null,null,null,"Coincident"]
[null,"NSP to enter name","CONNECTION POINT RATING","MVA","Non-coincident"]
[null,null,null,null,"Coincident"]
[null,null,"WINTER/SUMMER PEAKING",null,"Non-coincident"]
[null,null,null,null,"Coincident"]
[null,null,"ADJUSTMENTS - EMBEDDED GENERATION","MW","Non-coincident"]
[null,null,null,null,"Coincident"]
[null,null,"WEATHER CORRECTED MD 10% POE","MW","Non-coincident"]
[null,null,null,null,"Coincident"]
[null,null,"WEATHER CORRECTED MD 10% POE","MVA","Non-coincident"]
[null,null,null,null,"Coincident"]
[null,null,"WEATHER CORRECTED MD 50% POE","MW","Non-coincident"]
[null,null,null,null,"Coincident"]
[null,null,"WEATHER CORRECTED MD 50% POE","MVA","Non-coincident"]
[null,null,null,null,"Coincident"]
[null,"NSP to enter name","CONNECTION POINT RATING","MVA","Non-coincident"]
[null,null,null,null,"Coincident"]
[null,null,"WINTER/SUMMER PEAKING",null,"Non-coincident"]
[null,null,null,null,"Coincident"]
[null,null,"ADJUSTMENTS - EMBEDDED GENERATION","MW","Non-coincident"]
[null,null,null,null,"Coincident"]
[null,null,"WEATHER CORRECTED MD 10% POE","MW","Non-coincident"]
[null,null,null,null,"Coincident"]
[null,null,"WEATHER CORRECTED MD 10% POE","MVA","Non-coincident"]
[null,null,null,null,"Coincident"]
[null,null,"WEATHER CORRECTED MD 50% POE","MW","Non-coincident"]
[null,null,null,null,"Coincident"]
[null,null,"WEATHER CORRECTED MD 50% POE","MVA","Non-coincident"]
[null,null,null,null,"Coincident"]
[null,"NSP to enter name","CONNECTION POINT RATING","MVA","Non-coincident"]
[null,null,null,null,"Coincident"]
[null,null,"WINTER/SUMMER PEAKING",null,"Non-coincident"]
[null,null,null,null,"Coincident"]
[null,null,"ADJUSTMENTS - EMBEDDED GENERATION","MW","Non-coincident"]
[null,null,null,null,"Coincident"]
[null,null,"WEATHER CORRECTED MD 10% POE","MW","Non-coincident"]
[null,null,null,null,"Coincident"]
[null,null,"WEATHER CORRECTED MD 10% POE","MVA","Non-coincident"]
[null,null,null,null,"Coincident"]
[null,null,"WEATHER CORRECTED MD 50% POE","MW","Non-coincident"]
[null,null,null,null,"Coincident"]
[null,null,"WEATHER CORRECTED MD 50% POE","MVA","Non-coincident"]
[null,null,null,null,"Coincident"]
[null,"NSP to enter name","CONNECTION POINT RATING","MVA","Non-coincident"]
[null,null,null,null,"Coincident"]
[null,null,"WINTER/SUMMER PEAKING",null,"Non-coincident"]
[null,null,null,null,"Coincident"]
[null,null,"ADJUSTMENTS - EMBEDDED GENERATION","MW","Non-coincident"]
[null,null,null,null,"Coincident"]
[null,null,"WEATHER CORRECTED MD 10% POE","MW","Non-coincident"]
[null,null,null,null,"Coincident"]
[null,null,"WEATHER CORRECTED MD 10% POE","MVA","Non-coincident"]
[null,null,null,null,"Coincident"]
[null,null,"WEATHER CORRECTED MD 50% POE","MW","Non-coincident"]
[null,null,null,null,"Coincident"]
[null,null,"WEATHER CORRECTED MD 50% POE","MVA","Non-coincident"]
[null,null,null,null,"Coincident"]
[null,"NSP to enter name","CONNECTION POINT RATING","MVA","Non-coincident"]
[null,null,null,null,"Coincident"]
[null,null,"WINTER/SUMMER PEAKING",null,"Non-coincident"]
[null,null,null,null,"Coincident"]
[null,null,"ADJUSTMENTS - EMBEDDED GENERATION","MW","Non-coincident"]
[null,null,null,null,"Coincident"]
[null,null,"WEATHER CORRECTED MD 10% POE","MW","Non-coincident"]
[null,null,null,null,"Coincident"]
[null,null,"WEATHER CORRECTED MD 10% POE","MVA","Non-coincident"]
[null,null,null,null,"Coincident"]
[null,null,"WEATHER CORRECTED MD 50% POE","MW","Non-coincident"]
[null,null,null,null,"Coincident"]
[null,null,"WEATHER CORRECTED MD 50% POE","MVA","Non-coincident"]
[null,null,null,null,"Coincident"]
[null,"NSP to enter name","CONNECTION POINT RATING","MVA","Non-coincident"]
[null,null,null,null,"Coincident"]
[null,null,"WINTER/SUMMER PEAKING",null,"Non-coincident"]
[null,null,null,null,"Coincident"]
[null,null,"ADJUSTMENTS - EMBEDDED GENERATION","MW","Non-coincident"]
[null,null,null,null,"Coincident"]
[null,null,"WEATHER CORRECTED MD 10% POE","MW","Non-coincident"]
[null,null,null,null,"Coincident"]
[null,null,"WEATHER CORRECTED MD 10% POE","MVA","Non-coincident"]
[null,null,null,null,"Coincident"]
[null,null,"WEATHER CORRECTED MD 50% POE","MW","Non-coincident"]
[null,null,null,null,"Coincident"]
[null,null,"WEATHER CORRECTED MD 50% POE","MVA","Non-coincident"]
[null,null,null,null,"Coincident"]
[null,"NSP to enter name","CONNECTION POINT RATING","MVA","Non-coincident"]
[null,null,null,null,"Coincident"]
[null,null,"WINTER/SUMMER PEAKING",null,"Non-coincident"]
[null,null,null,null,"Coincident"]
[null,null,"ADJUSTMENTS - EMBEDDED GENERATION","MW","Non-coincident"]
[null,null,null,null,"Coincident"]
[null,null,"WEATHER CORRECTED MD 10% POE","MW","Non-coincident"]
[null,null,null,null,"Coincident"]
[null,null,"WEATHER CORRECTED MD 10% POE","MVA","Non-coincident"]
[null,null,null,null,"Coincident"]
[null,null,"WEATHER CORRECTED MD 50% POE","MW","Non-coincident"]
[null,null,null,null,"Coincident"]
[null,null,"WEATHER CORRECTED MD 50% POE","MVA","Non-coincident"]
[null,null,null,null,"Coincident"]
[null,"NSP to enter name","CONNECTION POINT RATING","MVA","Non-coincident"]
[null,null,null,null,"Coincident"]
[null,null,"WINTER/SUMMER PEAKING",null,"Non-coincident"]
[null,null,null,null,"Coincident"]
[null,null,"ADJUSTMENTS - EMBEDDED GENERATION","MW","Non-coincident"]
[null,null,null,null,"Coincident"]
[null,null,"WEATHER CORRECTED MD 10% POE","MW","Non-coincident"]
[null,null,null,null,"Coincident"]
[null,null,"WEATHER CORRECTED MD 10% POE","MVA","Non-coincident"]
[null,null,null,null,"Coincident"]
[null,null,"WEATHER CORRECTED MD 50% POE","MW","Non-coincident"]
[null,null,null,null,"Coincident"]
[null,null,"WEATHER CORRECTED MD 50% POE","MVA","Non-coincident"]
[null,null,null,null,"Coincident"]
[null,"NSP to enter name","CONNECTION POINT RATING","MVA","Non-coincident"]
[null,null,null,null,"Coincident"]
[null,null,"WINTER/SUMMER PEAKING",null,"Non-coincident"]
[null,null,null,null,"Coincident"]
[null,null,"ADJUSTMENTS - EMBEDDED GENERATION","MW","Non-coincident"]
[null,null,null,null,"Coincident"]
[null,null,"WEATHER CORRECTED MD 10% POE","MW","Non-coincident"]
[null,null,null,null,"Coincident"]
[null,null,"WEATHER CORRECTED MD 10% POE","MVA","Non-coincident"]
[null,null,null,null,"Coincident"]
[null,null,"WEATHER CORRECTED MD 50% POE","MW","Non-coincident"]
[null,null,null,null,"Coincident"]
[null,null,"WEATHER CORRECTED MD 50% POE","MVA","Non-coincident"]
[null,null,null,null,"Coincident"]
[null,"NSP to enter name","CONNECTION POINT RATING","MVA","Non-coincident"]
[null,null,null,null,"Coincident"]
[null,null,"WINTER/SUMMER PEAKING",null,"Non-coincident"]
[null,null,null,null,"Coincident"]
[null,null,"ADJUSTMENTS - EMBEDDED GENERATION","MW","Non-coincident"]
[null,null,null,null,"Coincident"]
[null,null,"WEATHER CORRECTED MD 10% POE","MW","Non-coincident"]
[null,null,null,null,"Coincident"]
[null,null,"WEATHER CORRECTED MD 10% POE","MVA","Non-coincident"]
[null,null,null,null,"Coincident"]
[null,null,"WEATHER CORRECTED MD 50% POE","MW","Non-coincident"]
[null,null,null,null,"Coincident"]
[null,null,"WEATHER CORRECTED MD 50% POE","MVA","Non-coincident"]
[null,null,null,null,"Coincident"]
[null,"NSP to enter name","CONNECTION POINT RATING","MVA","Non-coincident"]
[null,null,null,null,"Coincident"]
[null,null,"WINTER/SUMMER PEAKING",null,"Non-coincident"]
[null,null,null,null,"Coincident"]
[null,null,"ADJUSTMENTS - EMBEDDED GENERATION","MW","Non-coincident"]
[null,null,null,null,"Coincident"]
[null,null,"WEATHER CORRECTED MD 10% POE","MW","Non-coincident"]
[null,null,null,null,"Coincident"]
[null,null,"WEATHER CORRECTED MD 10% POE","MVA","Non-coincident"]
[null,null,null,null,"Coincident"]
[null,null,"WEATHER CORRECTED MD 50% POE","MW","Non-coincident"]
[null,null,null,null,"Coincident"]
[null,null,"WEATHER CORRECTED MD 50% POE","MVA","Non-coincident"]
[null,null,null,null,"Coincident"]
[null,"NSP to enter name","CONNECTION POINT RATING","MVA","Non-coincident"]
[null,null,null,null,"Coincident"]
[null,null,"WINTER/SUMMER PEAKING",null,"Non-coincident"]
[null,null,null,null,"Coincident"]
[null,null,"ADJUSTMENTS - EMBEDDED GENERATION","MW","Non-coincident"]
[null,null,null,null,"Coincident"]
[null,null,"WEATHER CORRECTED MD 10% POE","MW","Non-coincident"]
[null,null,null,null,"Coincident"]
[null,null,"WEATHER CORRECTED MD 10% POE","MVA","Non-coincident"]
[null,null,null,null,"Coincident"]
[null,null,"WEATHER CORRECTED MD 50% POE","MW","Non-coincident"]
[null,null,null,null,"Coincident"]
[null,null,"WEATHER CORRECTED MD 50% POE","MVA","Non-coincident"]
[null,null,null,null,"Coincident"]
[null,"NSP to enter name","CONNECTION POINT RATING","MVA","Non-coincident"]
[null,null,null,null,"Coincident"]
[null,null,"WINTER/SUMMER PEAKING",null,"Non-coincident"]
[null,null,null,null,"Coincident"]
[null,null,"ADJUSTMENTS - EMBEDDED GENERATION","MW","Non-coincident"]
[null,null,null,null,"Coincident"]
[null,null,"WEATHER CORRECTED MD 10% POE","MW","Non-coincident"]
[null,null,null,null,"Coincident"]
[null,null,"WEATHER CORRECTED MD 10% POE","MVA","Non-coincident"]
[null,null,null,null,"Coincident"]
[null,null,"WEATHER CORRECTED MD 50% POE","MW","Non-coincident"]
[null,null,null,null,"Coincident"]
[null,null,"WEATHER CORRECTED MD 50% POE","MVA","Non-coincident"]
[null,null,null,null,"Coincident"]
[null,"NSP to enter name","CONNECTION POINT RATING","MVA","Non-coincident"]
[null,null,null,null,"Coincident"]
[null,null,"WINTER/SUMMER PEAKING",null,"Non-coincident"]
[null,null,null,null,"Coincident"]
[null,null,"ADJUSTMENTS - EMBEDDED GENERATION","MW","Non-coincident"]
[null,null,null,null,"Coincident"]
[null,null,"WEATHER CORRECTED MD 10% POE","MW","Non-coincident"]
[null,null,null,null,"Coincident"]
[null,null,"WEATHER CORRECTED MD 10% POE","MVA","Non-coincident"]
[null,null,null,null,"Coincident"]
[null,null,"WEATHER CORRECTED MD 50% POE","MW","Non-coincident"]
[null,null,null,null,"Coincident"]
[null,null,"WEATHER CORRECTED MD 50% POE","MVA","Non-coincident"]
[null,null,null,null,"Coincident"]
[null,"NSP to enter name","CONNECTION POINT RATING","MVA","Non-coincident"]
[null,null,null,null,"Coincident"]
[null,null,"WINTER/SUMMER PEAKING",null,"Non-coincident"]
[null,null,null,null,"Coincident"]
[null,null,"ADJUSTMENTS - EMBEDDED GENERATION","MW","Non-coincident"]
[null,null,null,null,"Coincident"]
[null,null,"WEATHER CORRECTED MD 10% POE","MW","Non-coincident"]
[null,null,null,null,"Coincident"]
[null,null,"WEATHER CORRECTED MD 10% POE","MVA","Non-coincident"]
[null,null,null,null,"Coincident"]
[null,null,"WEATHER CORRECTED MD 50% POE","MW","Non-coincident"]
[null,null,null,null,"Coincident"]
[null,null,"WEATHER CORRECTED MD 50% POE","MVA","Non-coincident"]
[null,null,null,null,"Coincident"]
[null,"NSP to enter name","CONNECTION POINT RATING","MVA","Non-coincident"]
[null,null,null,null,"Coincident"]
[null,null,"WINTER/SUMMER PEAKING",null,"Non-coincident"]
[null,null,null,null,"Coincident"]
[null,null,"ADJUSTMENTS - EMBEDDED GENERATION","MW","Non-coincident"]
[null,null,null,null,"Coincident"]
[null,null,"WEATHER CORRECTED MD 10% POE","MW","Non-coincident"]
[null,null,null,null,"Coincident"]
[null,null,"WEATHER CORRECTED MD 10% POE","MVA","Non-coincident"]
[null,null,null,null,"Coincident"]
[null,null,"WEATHER CORRECTED MD 50% POE","MW","Non-coincident"]
[null,null,null,null,"Coincident"]
[null,null,"WEATHER CORRECTED MD 50% POE","MVA","Non-coincident"]
[null,null,null,null,"Coincident"]
[null,"NSP to enter name","CONNECTION POINT RATING","MVA","Non-coincident"]
[null,null,null,null,"Coincident"]
[null,null,"WINTER/SUMMER PEAKING",null,"Non-coincident"]
[null,null,null,null,"Coincident"]
[null,null,"ADJUSTMENTS - EMBEDDED GENERATION","MW","Non-coincident"]
[null,null,null,null,"Coincident"]
[null,null,"WEATHER CORRECTED MD 10% POE","MW","Non-coincident"]
[null,null,null,null,"Coincident"]
[null,null,"WEATHER CORRECTED MD 10% POE","MVA","Non-coincident"]
[null,null,null,null,"Coincident"]
[null,null,"WEATHER CORRECTED MD 50% POE","MW","Non-coincident"]
[null,null,null,null,"Coincident"]
[null,null,"WEATHER CORRECTED MD 50% POE","MVA","Non-coincident"]
[null,null,null,null,"Coincident"]
[null,"NSP to enter name","CONNECTION POINT RATING","MVA","Non-coincident"]
[null,null,null,null,"Coincident"]
[null,null,"WINTER/SUMMER PEAKING",null,"Non-coincident"]
[null,null,null,null,"Coincident"]
[null,null,"ADJUSTMENTS - EMBEDDED GENERATION","MW","Non-coincident"]
[null,null,null,null,"Coincident"]
[null,null,"WEATHER CORRECTED MD 10% POE","MW","Non-coincident"]
[null,null,null,null,"Coincident"]
[null,null,"WEATHER CORRECTED MD 10% POE","MVA","Non-coincident"]
[null,null,null,null,"Coincident"]
[null,null,"WEATHER CORRECTED MD 50% POE","MW","Non-coincident"]
[null,null,null,null,"Coincident"]
[null,null,"WEATHER CORRECTED MD 50% POE","MVA","Non-coincident"]
[null,null,null,null,"Coincident"]
[null,"NSP to enter name","CONNECTION POINT RATING","MVA","Non-coincident"]
[null,null,null,null,"Coincident"]
[null,null,"WINTER/SUMMER PEAKING",null,"Non-coincident"]
[null,null,null,null,"Coincident"]
[null,null,"ADJUSTMENTS - EMBEDDED GENERATION","MW","Non-coincident"]
[null,null,null,null,"Coincident"]
[null,null,"WEATHER CORRECTED MD 10% POE","MW","Non-coincident"]
[null,null,null,null,"Coincident"]
[null,null,"WEATHER CORRECTED MD 10% POE","MVA","Non-coincident"]
[null,null,null,null,"Coincident"]
[null,null,"WEATHER CORRECTED MD 50% POE","MW","Non-coincident"]
[null,null,null,null,"Coincident"]
[null,null,"WEATHER CORRECTED MD 50% POE","MVA","Non-coincident"]
[null,null,null,null,"Coincident"]
[null,"NSP to enter name","CONNECTION POINT RATING","MVA","Non-coincident"]
[null,null,null,null,"Coincident"]
[null,null,"WINTER/SUMMER PEAKING",null,"Non-coincident"]
[null,null,null,null,"Coincident"]
[null,null,"ADJUSTMENTS - EMBEDDED GENERATION","MW","Non-coincident"]
[null,null,null,null,"Coincident"]
[null,null,"WEATHER CORRECTED MD 10% POE","MW","Non-coincident"]
[null,null,null,null,"Coincident"]
[null,null,"WEATHER CORRECTED MD 10% POE","MVA","Non-coincident"]
[null,null,null,null,"Coincident"]
[null,null,"WEATHER CORRECTED MD 50% POE","MW","Non-coincident"]
[null,null,null,null,"Coincident"]
[null,null,"WEATHER CORRECTED MD 50% POE","MVA","Non-coincident"]
[null,null,null,null,"Coincident"]
[null,"NSP to enter name","CONNECTION POINT RATING","MVA","Non-coincident"]
[null,null,null,null,"Coincident"]
[null,null,"WINTER/SUMMER PEAKING",null,"Non-coincident"]
[null,null,null,null,"Coincident"]
[null,null,"ADJUSTMENTS - EMBEDDED GENERATION","MW","Non-coincident"]
[null,null,null,null,"Coincident"]
[null,null,"WEATHER CORRECTED MD 10% POE","MW","Non-coincident"]
[null,null,null,null,"Coincident"]
[null,null,"WEATHER CORRECTED MD 10% POE","MVA","Non-coincident"]
[null,null,null,null,"Coincident"]
[null,null,"WEATHER CORRECTED MD 50% POE","MW","Non-coincident"]
[null,null,null,null,"Coincident"]
[null,null,"WEATHER CORRECTED MD 50% POE","MVA","Non-coincident"]
[null,null,null,null,"Coincident"]
[null,"NSP to enter name","CONNECTION POINT RATING","MVA","Non-coincident"]
[null,null,null,null,"Coincident"]
[null,null,"WINTER/SUMMER PEAKING",null,"Non-coincident"]
[null,null,null,null,"Coincident"]
[null,null,"ADJUSTMENTS - EMBEDDED GENERATION","MW","Non-coincident"]
[null,null,null,null,"Coincident"]
[null,null,"WEATHER CORRECTED MD 10% POE","MW","Non-coincident"]
[null,null,null,null,"Coincident"]
[null,null,"WEATHER CORRECTED MD 10% POE","MVA","Non-coincident"]
[null,null,null,null,"Coincident"]
[null,null,"WEATHER CORRECTED MD 50% POE","MW","Non-coincident"]
[null,null,null,null,"Coincident"]
[null,null,"WEATHER CORRECTED MD 50% POE","MVA","Non-coincident"]
[null,null,null,null,"Coincident"]
[null,"NSP to enter name","CONNECTION POINT RATING","MVA","Non-coincident"]
[null,null,null,null,"Coincident"]
[null,null,"WINTER/SUMMER PEAKING",null,"Non-coincident"]
[null,null,null,null,"Coincident"]
[null,null,"ADJUSTMENTS - EMBEDDED GENERATION","MW","Non-coincident"]
[null,null,null,null,"Coincident"]
[null,null,"WEATHER CORRECTED MD 10% POE","MW","Non-coincident"]
[null,null,null,null,"Coincident"]
[null,null,"WEATHER CORRECTED MD 10% POE","MVA","Non-coincident"]
[null,null,null,null,"Coincident"]
[null,null,"WEATHER CORRECTED MD 50% POE","MW","Non-coincident"]
[null,null,null,null,"Coincident"]
[null,null,"WEATHER CORRECTED MD 50% POE","MVA","Non-coincident"]
[null,null,null,null,"Coincident"]
[null,"NSP to enter name","CONNECTION POINT RATING","MVA","Non-coincident"]
[null,null,null,null,"Coincident"]
[null,null,"WINTER/SUMMER PEAKING",null,"Non-coincident"]
[null,null,null,null,"Coincident"]
[null,null,"ADJUSTMENTS - EMBEDDED GENERATION","MW","Non-coincident"]
[null,null,null,null,"Coincident"]
[null,null,"WEATHER CORRECTED MD 10% POE","MW","Non-coincident"]
[null,null,null,null,"Coincident"]
[null,null,"WEATHER CORRECTED MD 10% POE","MVA","Non-coincident"]
[null,null,null,null,"Coincident"]
[null,null,"WEATHER CORRECTED MD 50% POE","MW","Non-coincident"]
[null,null,null,null,"Coincident"]
[null,null,"WEATHER CORRECTED MD 50% POE","MVA","Non-coincident"]
[null,null,null,null,"Coincident"]
[null,"NSP to enter name","CONNECTION POINT RATING","MVA","Non-coincident"]
[null,null,null,null,"Coincident"]
[null,null,"WINTER/SUMMER PEAKING",null,"Non-coincident"]
[null,null,null,null,"Coincident"]
[null,null,"ADJUSTMENTS - EMBEDDED GENERATION","MW","Non-coincident"]
[null,null,null,null,"Coincident"]
[null,null,"WEATHER CORRECTED MD 10% POE","MW","Non-coincident"]
[null,null,null,null,"Coincident"]
[null,null,"WEATHER CORRECTED MD 10% POE","MVA","Non-coincident"]
[null,null,null,null,"Coincident"]
[null,null,"WEATHER CORRECTED MD 50% POE","MW","Non-coincident"]
[null,null,null,null,"Coincident"]
[null,null,"WEATHER CORRECTED MD 50% POE","MVA","Non-coincident"]
[null,null,null,null,"Coincident"]
[null,"NSP to enter name","CONNECTION POINT RATING","MVA","Non-coincident"]
[null,null,null,null,"Coincident"]
[null,null,"WINTER/SUMMER PEAKING",null,"Non-coincident"]
[null,null,null,null,"Coincident"]
[null,null,"ADJUSTMENTS - EMBEDDED GENERATION","MW","Non-coincident"]
[null,null,null,null,"Coincident"]
[null,null,"WEATHER CORRECTED MD 10% POE","MW","Non-coincident"]
[null,null,null,null,"Coincident"]
[null,null,"WEATHER CORRECTED MD 10% POE","MVA","Non-coincident"]
[null,null,null,null,"Coincident"]
[null,null,"WEATHER CORRECTED MD 50% POE","MW","Non-coincident"]
[null,null,null,null,"Coincident"]
[null,null,"WEATHER CORRECTED MD 50% POE","MVA","Non-coincident"]
[null,null,null,null,"Coincident"]
[null,"NSP to enter name","CONNECTION POINT RATING","MVA","Non-coincident"]
[null,null,null,null,"Coincident"]
[null,null,"WINTER/SUMMER PEAKING",null,"Non-coincident"]
[null,null,null,null,"Coincident"]
[null,null,"ADJUSTMENTS - EMBEDDED GENERATION","MW","Non-coincident"]
[null,null,null,null,"Coincident"]
[null,null,"WEATHER CORRECTED MD 10% POE","MW","Non-coincident"]
[null,null,null,null,"Coincident"]
[null,null,"WEATHER CORRECTED MD 10% POE","MVA","Non-coincident"]
[null,null,null,null,"Coincident"]
[null,null,"WEATHER CORRECTED MD 50% POE","MW","Non-coincident"]
[null,null,null,null,"Coincident"]
[null,null,"WEATHER CORRECTED MD 50% POE","MVA","Non-coincident"]
[null,null,null,null,"Coincident"]
[null,"NSP to enter name","CONNECTION POINT RATING","MVA","Non-coincident"]
[null,null,null,null,"Coincident"]
[null,null,"WINTER/SUMMER PEAKING",null,"Non-coincident"]
[null,null,null,null,"Coincident"]
[null,null,"ADJUSTMENTS - EMBEDDED GENERATION","MW","Non-coincident"]
[null,null,null,null,"Coincident"]
[null,null,"WEATHER CORRECTED MD 10% POE","MW","Non-coincident"]
[null,null,null,null,"Coincident"]
[null,null,"WEATHER CORRECTED MD 10% POE","MVA","Non-coincident"]
[null,null,null,null,"Coincident"]
[null,null,"WEATHER CORRECTED MD 50% POE","MW","Non-coincident"]
[null,null,null,null,"Coincident"]
[null,null,"WEATHER CORRECTED MD 50% POE","MVA","Non-coincident"]
[null,null,null,null,"Coincident"]
[null,"NSP to enter name","CONNECTION POINT RATING","MVA","Non-coincident"]
[null,null,null,null,"Coincident"]
[null,null,"WINTER/SUMMER PEAKING",null,"Non-coincident"]
[null,null,null,null,"Coincident"]
[null,null,"ADJUSTMENTS - EMBEDDED GENERATION","MW","Non-coincident"]
[null,null,null,null,"Coincident"]
[null,null,"WEATHER CORRECTED MD 10% POE","MW","Non-coincident"]
[null,null,null,null,"Coincident"]
[null,null,"WEATHER CORRECTED MD 10% POE","MVA","Non-coincident"]
[null,null,null,null,"Coincident"]
[null,null,"WEATHER CORRECTED MD 50% POE","MW","Non-coincident"]
[null,null,null,null,"Coincident"]
[null,null,"WEATHER CORRECTED MD 50% POE","MVA","Non-coincident"]
[null,null,null,null,"Coincident"]
[null,"NSP to enter name","CONNECTION POINT RATING","MVA","Non-coincident"]
[null,null,null,null,"Coincident"]
[null,null,"WINTER/SUMMER PEAKING",null,"Non-coincident"]
[null,null,null,null,"Coincident"]
[null,null,"ADJUSTMENTS - EMBEDDED GENERATION","MW","Non-coincident"]
[null,null,null,null,"Coincident"]
[null,null,"WEATHER CORRECTED MD 10% POE","MW","Non-coincident"]
[null,null,null,null,"Coincident"]
[null,null,"WEATHER CORRECTED MD 10% POE","MVA","Non-coincident"]
[null,null,null,null,"Coincident"]
[null,null,"WEATHER CORRECTED MD 50% POE","MW","Non-coincident"]
[null,null,null,null,"Coincident"]
[null,null,"WEATHER CORRECTED MD 50% POE","MVA","Non-coincident"]
[null,null,null,null,"Coincident"]
[null,"NSP to enter name","CONNECTION POINT RATING","MVA","Non-coincident"]
[null,null,null,null,"Coincident"]
[null,null,"WINTER/SUMMER PEAKING",null,"Non-coincident"]
[null,null,null,null,"Coincident"]
[null,null,"ADJUSTMENTS - EMBEDDED GENERATION","MW","Non-coincident"]
[null,null,null,null,"Coincident"]
[null,null,"WEATHER CORRECTED MD 10% POE","MW","Non-coincident"]
[null,null,null,null,"Coincident"]
[null,null,"WEATHER CORRECTED MD 10% POE","MVA","Non-coincident"]
[null,null,null,null,"Coincident"]
[null,null,"WEATHER CORRECTED MD 50% POE","MW","Non-coincident"]
[null,null,null,null,"Coincident"]
[null,null,"WEATHER CORRECTED MD 50% POE","MVA","Non-coincident"]
[null,null,null,null,"Coincident"]
[null,"NSP to enter name","CONNECTION POINT RATING","MVA","Non-coincident"]
[null,null,null,null,"Coincident"]
[null,null,"WINTER/SUMMER PEAKING",null,"Non-coincident"]
[null,null,null,null,"Coincident"]
[null,null,"ADJUSTMENTS - EMBEDDED GENERATION","MW","Non-coincident"]
[null,null,null,null,"Coincident"]
[null,null,"WEATHER CORRECTED MD 10% POE","MW","Non-coincident"]
[null,null,null,null,"Coincident"]
[null,null,"WEATHER CORRECTED MD 10% POE","MVA","Non-coincident"]
[null,null,null,null,"Coincident"]
[null,null,"WEATHER CORRECTED MD 50% POE","MW","Non-coincident"]
[null,null,null,null,"Coincident"]
[null,null,"WEATHER CORRECTED MD 50% POE","MVA","Non-coincident"]
[null,null,null,null,"Coincident"]
[null,"NSP to enter name","CONNECTION POINT RATING","MVA","Non-coincident"]
[null,null,null,null,"Coincident"]
[null,null,"WINTER/SUMMER PEAKING",null,"Non-coincident"]
[null,null,null,null,"Coincident"]
[null,null,"ADJUSTMENTS - EMBEDDED GENERATION","MW","Non-coincident"]
[null,null,null,null,"Coincident"]
[null,null,"WEATHER CORRECTED MD 10% POE","MW","Non-coincident"]
[null,null,null,null,"Coincident"]
[null,null,"WEATHER CORRECTED MD 10% POE","MVA","Non-coincident"]
[null,null,null,null,"Coincident"]
[null,null,"WEATHER CORRECTED MD 50% POE","MW","Non-coincident"]
[null,null,null,null,"Coincident"]
[null,null,"WEATHER CORRECTED MD 50% POE","MVA","Non-coincident"]
[null,null,null,null,"Coincident"]
[null,"NSP to enter name","CONNECTION POINT RATING","MVA","Non-coincident"]
[null,null,null,null,"Coincident"]
[null,null,"WINTER/SUMMER PEAKING",null,"Non-coincident"]
[null,null,null,null,"Coincident"]
[null,null,"ADJUSTMENTS - EMBEDDED GENERATION","MW","Non-coincident"]
[null,null,null,null,"Coincident"]
[null,null,"WEATHER CORRECTED MD 10% POE","MW","Non-coincident"]
[null,null,null,null,"Coincident"]
[null,null,"WEATHER CORRECTED MD 10% POE","MVA","Non-coincident"]
[null,null,null,null,"Coincident"]
[null,null,"WEATHER CORRECTED MD 50% POE","MW","Non-coincident"]
[null,null,null,null,"Coincident"]
[null,null,"WEATHER CORRECTED MD 50% POE","MVA","Non-coincident"]
[null,null,null,null,"Coincident"]
[null,"NSP to enter name","CONNECTION POINT RATING","MVA","Non-coincident"]
[null,null,null,null,"Coincident"]
[null,null,"WINTER/SUMMER PEAKING",null,"Non-coincident"]
[null,null,null,null,"Coincident"]
[null,null,"ADJUSTMENTS - EMBEDDED GENERATION","MW","Non-coincident"]
[null,null,null,null,"Coincident"]
[null,null,"WEATHER CORRECTED MD 10% POE","MW","Non-coincident"]
[null,null,null,null,"Coincident"]
[null,null,"WEATHER CORRECTED MD 10% POE","MVA","Non-coincident"]
[null,null,null,null,"Coincident"]
[null,null,"WEATHER CORRECTED MD 50% POE","MW","Non-coincident"]
[null,null,null,null,"Coincident"]
[null,null,"WEATHER CORRECTED MD 50% POE","MVA","Non-coincident"]
[null,null,null,null,"Coincident"]
[null,"NSP to enter name","CONNECTION POINT RATING","MVA","Non-coincident"]
[null,null,null,null,"Coincident"]
[null,null,"WINTER/SUMMER PEAKING",null,"Non-coincident"]
[null,null,null,null,"Coincident"]
[null,null,"ADJUSTMENTS - EMBEDDED GENERATION","MW","Non-coincident"]
[null,null,null,null,"Coincident"]
[null,null,"WEATHER CORRECTED MD 10% POE","MW","Non-coincident"]
[null,null,null,null,"Coincident"]
[null,null,"WEATHER CORRECTED MD 10% POE","MVA","Non-coincident"]
[null,null,null,null,"Coincident"]
[null,null,"WEATHER CORRECTED MD 50% POE","MW","Non-coincident"]
[null,null,null,null,"Coincident"]
[null,null,"WEATHER CORRECTED MD 50% POE","MVA","Non-coincident"]
[null,null,null,null,"Coincident"]
[null,"NSP to enter name","CONNECTION POINT RATING","MVA","Non-coincident"]
[null,null,null,null,"Coincident"]
[null,null,"WINTER/SUMMER PEAKING",null,"Non-coincident"]
[null,null,null,null,"Coincident"]
[null,null,"ADJUSTMENTS - EMBEDDED GENERATION","MW","Non-coincident"]
[null,null,null,null,"Coincident"]
[null,null,"WEATHER CORRECTED MD 10% POE","MW","Non-coincident"]
[null,null,null,null,"Coincident"]
[null,null,"WEATHER CORRECTED MD 10% POE","MVA","Non-coincident"]
[null,null,null,null,"Coincident"]
[null,null,"WEATHER CORRECTED MD 50% POE","MW","Non-coincident"]
[null,null,null,null,"Coincident"]
[null,null,"WEATHER CORRECTED MD 50% POE","MVA","Non-coincident"]
[null,null,null,null,"Coincident"]
[null,"NSP to enter name","CONNECTION POINT RATING","MVA","Non-coincident"]
[null,null,null,null,"Coincident"]
[null,null,"WINTER/SUMMER PEAKING",null,"Non-coincident"]
[null,null,null,null,"Coincident"]
[null,null,"ADJUSTMENTS - EMBEDDED GENERATION","MW","Non-coincident"]
[null,null,null,null,"Coincident"]
[null,null,"WEATHER CORRECTED MD 10% POE","MW","Non-coincident"]
[null,null,null,null,"Coincident"]
[null,null,"WEATHER CORRECTED MD 10% POE","MVA","Non-coincident"]
[null,null,null,null,"Coincident"]
[null,null,"WEATHER CORRECTED MD 50% POE","MW","Non-coincident"]
[null,null,null,null,"Coincident"]
[null,null,"WEATHER CORRECTED MD 50% POE","MVA","Non-coincident"]
[null,null,null,null,"Coincident"]
[null,"NSP to enter name","CONNECTION POINT RATING","MVA","Non-coincident"]
[null,null,null,null,"Coincident"]
[null,null,"WINTER/SUMMER PEAKING",null,"Non-coincident"]
[null,null,null,null,"Coincident"]
[null,null,"ADJUSTMENTS - EMBEDDED GENERATION","MW","Non-coincident"]
[null,null,null,null,"Coincident"]
[null,null,"WEATHER CORRECTED MD 10% POE","MW","Non-coincident"]
[null,null,null,null,"Coincident"]
[null,null,"WEATHER CORRECTED MD 10% POE","MVA","Non-coincident"]
[null,null,null,null,"Coincident"]
[null,null,"WEATHER CORRECTED MD 50% POE","MW","Non-coincident"]
[null,null,null,null,"Coincident"]
[null,null,"WEATHER CORRECTED MD 50% POE","MVA","Non-coincident"]
[null,null,null,null,"Coincident"]
[null,"NSP to enter name","CONNECTION POINT RATING","MVA","Non-coincident"]
[null,null,null,null,"Coincident"]
[null,null,"WINTER/SUMMER PEAKING",null,"Non-coincident"]
[null,null,null,null,"Coincident"]
[null,null,"ADJUSTMENTS - EMBEDDED GENERATION","MW","Non-coincident"]
[null,null,null,null,"Coincident"]
[null,null,"WEATHER CORRECTED MD 10% POE","MW","Non-coincident"]
[null,null,null,null,"Coincident"]
[null,null,"WEATHER CORRECTED MD 10% POE","MVA","Non-coincident"]
[null,null,null,null,"Coincident"]
[null,null,"WEATHER CORRECTED MD 50% POE","MW","Non-coincident"]
[null,null,null,null,"Coincident"]
[null,null,"WEATHER CORRECTED MD 50% POE","MVA","Non-coincident"]
[null,null,null,null,"Coincident"]
[null,"NSP to enter name","CONNECTION POINT RATING","MVA","Non-coincident"]
[null,null,null,null,"Coincident"]
[null,null,"WINTER/SUMMER PEAKING",null,"Non-coincident"]
[null,null,null,null,"Coincident"]
[null,null,"ADJUSTMENTS - EMBEDDED GENERATION","MW","Non-coincident"]
[null,null,null,null,"Coincident"]
[null,null,"WEATHER CORRECTED MD 10% POE","MW","Non-coincident"]
[null,null,null,null,"Coincident"]
[null,null,"WEATHER CORRECTED MD 10% POE","MVA","Non-coincident"]
[null,null,null,null,"Coincident"]
[null,null,"WEATHER CORRECTED MD 50% POE","MW","Non-coincident"]
[null,null,null,null,"Coincident"]
[null,null,"WEATHER CORRECTED MD 50% POE","MVA","Non-coincident"]
[null,null,null,null,"Coincident"]
[null,"NSP to enter name","CONNECTION POINT RATING","MVA","Non-coincident"]
[null,null,null,null,"Coincident"]
[null,null,"WINTER/SUMMER PEAKING",null,"Non-coincident"]
[null,null,null,null,"Coincident"]
[null,null,"ADJUSTMENTS - EMBEDDED GENERATION","MW","Non-coincident"]
[null,null,null,null,"Coincident"]
[null,null,"WEATHER CORRECTED MD 10% POE","MW","Non-coincident"]
[null,null,null,null,"Coincident"]
[null,null,"WEATHER CORRECTED MD 10% POE","MVA","Non-coincident"]
[null,null,null,null,"Coincident"]
[null,null,"WEATHER CORRECTED MD 50% POE","MW","Non-coincident"]
[null,null,null,null,"Coincident"]
[null,null,"WEATHER CORRECTED MD 50% POE","MVA","Non-coincident"]
[null,null,null,null,"Coincident"]
[null,"NSP to enter name","CONNECTION POINT RATING","MVA","Non-coincident"]
[null,null,null,null,"Coincident"]
[null,null,"WINTER/SUMMER PEAKING",null,"Non-coincident"]
[null,null,null,null,"Coincident"]
[null,null,"ADJUSTMENTS - EMBEDDED GENERATION","MW","Non-coincident"]
[null,null,null,null,"Coincident"]
[null,null,"WEATHER CORRECTED MD 10% POE","MW","Non-coincident"]
[null,null,null,null,"Coincident"]
[null,null,"WEATHER CORRECTED MD 10% POE","MVA","Non-coincident"]
[null,null,null,null,"Coincident"]
[null,null,"WEATHER CORRECTED MD 50% POE","MW","Non-coincident"]
[null,null,null,null,"Coincident"]
[null,null,"WEATHER CORRECTED MD 50% POE","MVA","Non-coincident"]
[null,null,null,null,"Coincident"]
[null,"NSP to enter name","CONNECTION POINT RATING","MVA","Non-coincident"]
[null,null,null,null,"Coincident"]
[null,null,"WINTER/SUMMER PEAKING",null,"Non-coincident"]
[null,null,null,null,"Coincident"]
[null,null,"ADJUSTMENTS - EMBEDDED GENERATION","MW","Non-coincident"]
[null,null,null,null,"Coincident"]
[null,null,"WEATHER CORRECTED MD 10% POE","MW","Non-coincident"]
[null,null,null,null,"Coincident"]
[null,null,"WEATHER CORRECTED MD 10% POE","MVA","Non-coincident"]
[null,null,null,null,"Coincident"]
[null,null,"WEATHER CORRECTED MD 50% POE","MW","Non-coincident"]
[null,null,null,null,"Coincident"]
[null,null,"WEATHER CORRECTED MD 50% POE","MVA","Non-coincident"]
[null,null,null,null,"Coincident"]
[null,"NSP to enter name","CONNECTION POINT RATING","MVA","Non-coincident"]
[null,null,null,null,"Coincident"]
[null,null,"WINTER/SUMMER PEAKING",null,"Non-coincident"]
[null,null,null,null,"Coincident"]
[null,null,"ADJUSTMENTS - EMBEDDED GENERATION","MW","Non-coincident"]
[null,null,null,null,"Coincident"]
[null,null,"WEATHER CORRECTED MD 10% POE","MW","Non-coincident"]
[null,null,null,null,"Coincident"]
[null,null,"WEATHER CORRECTED MD 10% POE","MVA","Non-coincident"]
[null,null,null,null,"Coincident"]
[null,null,"WEATHER CORRECTED MD 50% POE","MW","Non-coincident"]
[null,null,null,null,"Coincident"]
[null,null,"WEATHER CORRECTED MD 50% POE","MVA","Non-coincident"]
[null,null,null,null,"Coincident"]
[null,"NSP to enter name","CONNECTION POINT RATING","MVA","Non-coincident"]
[null,null,null,null,"Coincident"]
[null,null,"WINTER/SUMMER PEAKING",null,"Non-coincident"]
[null,null,null,null,"Coincident"]
[null,null,"ADJUSTMENTS - EMBEDDED GENERATION","MW","Non-coincident"]
[null,null,null,null,"Coincident"]
[null,null,"WEATHER CORRECTED MD 10% POE","MW","Non-coincident"]
[null,null,null,null,"Coincident"]
[null,null,"WEATHER CORRECTED MD 10% POE","MVA","Non-coincident"]
[null,null,null,null,"Coincident"]
[null,null,"WEATHER CORRECTED MD 50% POE","MW","Non-coincident"]
[null,null,null,null,"Coincident"]
[null,null,"WEATHER CORRECTED MD 50% POE","MVA","Non-coincident"]
[null,null,null,null,"Coincident"]
[null,"NSP to enter name","CONNECTION POINT RATING","MVA","Non-coincident"]
[null,null,null,null,"Coincident"]
[null,null,"WINTER/SUMMER PEAKING",null,"Non-coincident"]
[null,null,null,null,"Coincident"]
[null,null,"ADJUSTMENTS - EMBEDDED GENERATION","MW","Non-coincident"]
[null,null,null,null,"Coincident"]
[null,null,"WEATHER CORRECTED MD 10% POE","MW","Non-coincident"]
[null,null,null,null,"Coincident"]
[null,null,"WEATHER CORRECTED MD 10% POE","MVA","Non-coincident"]
[null,null,null,null,"Coincident"]
[null,null,"WEATHER CORRECTED MD 50% POE","MW","Non-coincident"]
[null,null,null,null,"Coincident"]
[null,null,"WEATHER CORRECTED MD 50% POE","MVA","Non-coincident"]
[null,null,null,null,"Coincident"]
[null,"NSP to enter name","CONNECTION POINT RATING","MVA","Non-coincident"]
[null,null,null,null,"Coincident"]
[null,null,"WINTER/SUMMER PEAKING",null,"Non-coincident"]
[null,null,null,null,"Coincident"]
[null,null,"ADJUSTMENTS - EMBEDDED GENERATION","MW","Non-coincident"]
[null,null,null,null,"Coincident"]
[null,null,"WEATHER CORRECTED MD 10% POE","MW","Non-coincident"]
[null,null,null,null,"Coincident"]
[null,null,"WEATHER CORRECTED MD 10% POE","MVA","Non-coincident"]
[null,null,null,null,"Coincident"]
[null,null,"WEATHER CORRECTED MD 50% POE","MW","Non-coincident"]
[null,null,null,null,"Coincident"]
[null,null,"WEATHER CORRECTED MD 50% POE","MVA","Non-coincident"]
[null,null,null,null,"Coincident"]
[null,"NSP to enter name","CONNECTION POINT RATING","MVA","Non-coincident"]
[null,null,null,null,"Coincident"]
[null,null,"WINTER/SUMMER PEAKING",null,"Non-coincident"]
[null,null,null,null,"Coincident"]
[null,null,"ADJUSTMENTS - EMBEDDED GENERATION","MW","Non-coincident"]
[null,null,null,null,"Coincident"]
[null,null,"WEATHER CORRECTED MD 10% POE","MW","Non-coincident"]
[null,null,null,null,"Coincident"]
[null,null,"WEATHER CORRECTED MD 10% POE","MVA","Non-coincident"]
[null,null,null,null,"Coincident"]
[null,null,"WEATHER CORRECTED MD 50% POE","MW","Non-coincident"]
[null,null,null,null,"Coincident"]
[null,null,"WEATHER CORRECTED MD 50% POE","MVA","Non-coincident"]
[null,null,null,null,"Coincident"]
[null,"NSP to enter name","CONNECTION POINT RATING","MVA","Non-coincident"]
[null,null,null,null,"Coincident"]
[null,null,"WINTER/SUMMER PEAKING",null,"Non-coincident"]
[null,null,null,null,"Coincident"]
[null,null,"ADJUSTMENTS - EMBEDDED GENERATION","MW","Non-coincident"]
[null,null,null,null,"Coincident"]
[null,null,"WEATHER CORRECTED MD 10% POE","MW","Non-coincident"]
[null,null,null,null,"Coincident"]
[null,null,"WEATHER CORRECTED MD 10% POE","MVA","Non-coincident"]
[null,null,null,null,"Coincident"]
[null,null,"WEATHER CORRECTED MD 50% POE","MW","Non-coincident"]
[null,null,null,null,"Coincident"]
[null,null,"WEATHER CORRECTED MD 50% POE","MVA","Non-coincident"]
[null,null,null,null,"Coincident"]
[null,"NSP to enter name","CONNECTION POINT RATING","MVA","Non-coincident"]
[null,null,null,null,"Coincident"]
[null,null,"WINTER/SUMMER PEAKING",null,"Non-coincident"]
[null,null,null,null,"Coincident"]
[null,null,"ADJUSTMENTS - EMBEDDED GENERATION","MW","Non-coincident"]
[null,null,null,null,"Coincident"]
[null,null,"WEATHER CORRECTED MD 10% POE","MW","Non-coincident"]
[null,null,null,null,"Coincident"]
[null,null,"WEATHER CORRECTED MD 10% POE","MVA","Non-coincident"]
[null,null,null,null,"Coincident"]
[null,null,"WEATHER CORRECTED MD 50% POE","MW","Non-coincident"]
[null,null,null,null,"Coincident"]
[null,null,"WEATHER CORRECTED MD 50% POE","MVA","Non-coincident"]
[null,null,null,null,"Coincident"]
[null,"NSP to enter name","CONNECTION POINT RATING","MVA","Non-coincident"]
[null,null,null,null,"Coincident"]
[null,null,"WINTER/SUMMER PEAKING",null,"Non-coincident"]
[null,null,null,null,"Coincident"]
[null,null,"ADJUSTMENTS - EMBEDDED GENERATION","MW","Non-coincident"]
[null,null,null,null,"Coincident"]
[null,null,"WEATHER CORRECTED MD 10% POE","MW","Non-coincident"]
[null,null,null,null,"Coincident"]
[null,null,"WEATHER CORRECTED MD 10% POE","MVA","Non-coincident"]
[null,null,null,null,"Coincident"]
[null,null,"WEATHER CORRECTED MD 50% POE","MW","Non-coincident"]
[null,null,null,null,"Coincident"]
[null,null,"WEATHER CORRECTED MD 50% POE","MVA","Non-coincident"]
[null,null,null,null,"Coincident"]
[null,"NSP to enter name","CONNECTION POINT RATING","MVA","Non-coincident"]
[null,null,null,null,"Coincident"]
[null,null,"WINTER/SUMMER PEAKING",null,"Non-coincident"]
[null,null,null,null,"Coincident"]
[null,null,"ADJUSTMENTS - EMBEDDED GENERATION","MW","Non-coincident"]
[null,null,null,null,"Coincident"]
[null,null,"WEATHER CORRECTED MD 10% POE","MW","Non-coincident"]
[null,null,null,null,"Coincident"]
[null,null,"WEATHER CORRECTED MD 10% POE","MVA","Non-coincident"]
[null,null,null,null,"Coincident"]
[null,null,"WEATHER CORRECTED MD 50% POE","MW","Non-coincident"]
[null,null,null,null,"Coincident"]
[null,null,"WEATHER CORRECTED MD 50% POE","MVA","Non-coincident"]
[null,null,null,null,"Coincident"]
[null,"NSP to enter name","CONNECTION POINT RATING","MVA","Non-coincident"]
[null,null,null,null,"Coincident"]
[null,null,"WINTER/SUMMER PEAKING",null,"Non-coincident"]
[null,null,null,null,"Coincident"]
[null,null,"ADJUSTMENTS - EMBEDDED GENERATION","MW","Non-coincident"]
[null,null,null,null,"Coincident"]
[null,null,"WEATHER CORRECTED MD 10% POE","MW","Non-coincident"]
[null,null,null,null,"Coincident"]
[null,null,"WEATHER CORRECTED MD 10% POE","MVA","Non-coincident"]
[null,null,null,null,"Coincident"]
[null,null,"WEATHER CORRECTED MD 50% POE","MW","Non-coincident"]
[null,null,null,null,"Coincident"]
[null,null,"WEATHER CORRECTED MD 50% POE","MVA","Non-coincident"]
[null,null,null,null,"Coincident"]
[null,"NSP to enter name","CONNECTION POINT RATING","MVA","Non-coincident"]
[null,null,null,null,"Coincident"]
[null,null,"WINTER/SUMMER PEAKING",null,"Non-coincident"]
[null,null,null,null,"Coincident"]
[null,null,"ADJUSTMENTS - EMBEDDED GENERATION","MW","Non-coincident"]
[null,null,null,null,"Coincident"]
[null,null,"WEATHER CORRECTED MD 10% POE","MW","Non-coincident"]
[null,null,null,null,"Coincident"]
[null,null,"WEATHER CORRECTED MD 10% POE","MVA","Non-coincident"]
[null,null,null,null,"Coincident"]
[null,null,"WEATHER CORRECTED MD 50% POE","MW","Non-coincident"]
[null,null,null,null,"Coincident"]
[null,null,"WEATHER CORRECTED MD 50% POE","MVA","Non-coincident"]
[null,null,null,null,"Coincident"]
[null,"NSP to enter name","CONNECTION POINT RATING","MVA","Non-coincident"]
[null,null,null,null,"Coincident"]
[null,null,"WINTER/SUMMER PEAKING",null,"Non-coincident"]
[null,null,null,null,"Coincident"]
[null,null,"ADJUSTMENTS - EMBEDDED GENERATION","MW","Non-coincident"]
[null,null,null,null,"Coincident"]
[null,null,"WEATHER CORRECTED MD 10% POE","MW","Non-coincident"]
[null,null,null,null,"Coincident"]
[null,null,"WEATHER CORRECTED MD 10% POE","MVA","Non-coincident"]
[null,null,null,null,"Coincident"]
[null,null,"WEATHER CORRECTED MD 50% POE","MW","Non-coincident"]
[null,null,null,null,"Coincident"]
[null,null,"WEATHER CORRECTED MD 50% POE","MVA","Non-coincident"]
[null,null,null,null,"Coincident"]
[null,"NSP to enter name","CONNECTION POINT RATING","MVA","Non-coincident"]
[null,null,null,null,"Coincident"]
[null,null,"WINTER/SUMMER PEAKING",null,"Non-coincident"]
[null,null,null,null,"Coincident"]
[null,null,"ADJUSTMENTS - EMBEDDED GENERATION","MW","Non-coincident"]
[null,null,null,null,"Coincident"]
[null,null,"WEATHER CORRECTED MD 10% POE","MW","Non-coincident"]
[null,null,null,null,"Coincident"]
[null,null,"WEATHER CORRECTED MD 10% POE","MVA","Non-coincident"]
[null,null,null,null,"Coincident"]
[null,null,"WEATHER CORRECTED MD 50% POE","MW","Non-coincident"]
[null,null,null,null,"Coincident"]
[null,null,"WEATHER CORRECTED MD 50% POE","MVA","Non-coincident"]
[null,null,null,null,"Coincident"]
[null,"NSP to enter name","CONNECTION POINT RATING","MVA","Non-coincident"]
[null,null,null,null,"Coincident"]
[null,null,"WINTER/SUMMER PEAKING",null,"Non-coincident"]
[null,null,null,null,"Coincident"]
[null,null,"ADJUSTMENTS - EMBEDDED GENERATION","MW","Non-coincident"]
[null,null,null,null,"Coincident"]
[null,null,"WEATHER CORRECTED MD 10% POE","MW","Non-coincident"]
[null,null,null,null,"Coincident"]
[null,null,"WEATHER CORRECTED MD 10% POE","MVA","Non-coincident"]
[null,null,null,null,"Coincident"]
[null,null,"WEATHER CORRECTED MD 50% POE","MW","Non-coincident"]
[null,null,null,null,"Coincident"]
[null,null,"WEATHER CORRECTED MD 50% POE","MVA","Non-coincident"]
[null,null,null,null,"Coincident"]
[null,"NSP to enter name","CONNECTION POINT RATING","MVA","Non-coincident"]
[null,null,null,null,"Coincident"]
[null,null,"WINTER/SUMMER PEAKING",null,"Non-coincident"]
[null,null,null,null,"Coincident"]
[null,null,"ADJUSTMENTS - EMBEDDED GENERATION","MW","Non-coincident"]
[null,null,null,null,"Coincident"]
[null,null,"WEATHER CORRECTED MD 10% POE","MW","Non-coincident"]
[null,null,null,null,"Coincident"]
[null,null,"WEATHER CORRECTED MD 10% POE","MVA","Non-coincident"]
[null,null,null,null,"Coincident"]
[null,null,"WEATHER CORRECTED MD 50% POE","MW","Non-coincident"]
[null,null,null,null,"Coincident"]
[null,null,"WEATHER CORRECTED MD 50% POE","MVA","Non-coincident"]
[null,null,null,null,"Coincident"]
[null,"NSP to enter name","CONNECTION POINT RATING","MVA","Non-coincident"]
[null,null,null,null,"Coincident"]
[null,null,"WINTER/SUMMER PEAKING",null,"Non-coincident"]
[null,null,null,null,"Coincident"]
[null,null,"ADJUSTMENTS - EMBEDDED GENERATION","MW","Non-coincident"]
[null,null,null,null,"Coincident"]
[null,null,"WEATHER CORRECTED MD 10% POE","MW","Non-coincident"]
[null,null,null,null,"Coincident"]
[null,null,"WEATHER CORRECTED MD 10% POE","MVA","Non-coincident"]
[null,null,null,null,"Coincident"]
[null,null,"WEATHER CORRECTED MD 50% POE","MW","Non-coincident"]
[null,null,null,null,"Coincident"]
[null,null,"WEATHER CORRECTED MD 50% POE","MVA","Non-coincident"]
[null,null,null,null,"Coincident"]
[null,"NSP to enter name","CONNECTION POINT RATING","MVA","Non-coincident"]
[null,null,null,null,"Coincident"]
[null,null,"WINTER/SUMMER PEAKING",null,"Non-coincident"]
[null,null,null,null,"Coincident"]
[null,null,"ADJUSTMENTS - EMBEDDED GENERATION","MW","Non-coincident"]
[null,null,null,null,"Coincident"]
[null,null,"WEATHER CORRECTED MD 10% POE","MW","Non-coincident"]
[null,null,null,null,"Coincident"]
[null,null,"WEATHER CORRECTED MD 10% POE","MVA","Non-coincident"]
[null,null,null,null,"Coincident"]
[null,null,"WEATHER CORRECTED MD 50% POE","MW","Non-coincident"]
[null,null,null,null,"Coincident"]
[null,null,"WEATHER CORRECTED MD 50% POE","MVA","Non-coincident"]
[null,null,null,null,"Coincident"]
[null,"NSP to enter name","CONNECTION POINT RATING","MVA","Non-coincident"]
[null,null,null,null,"Coincident"]
[null,null,"WINTER/SUMMER PEAKING",null,"Non-coincident"]
[null,null,null,null,"Coincident"]
[null,null,"ADJUSTMENTS - EMBEDDED GENERATION","MW","Non-coincident"]
[null,null,null,null,"Coincident"]
[null,null,"WEATHER CORRECTED MD 10% POE","MW","Non-coincident"]
[null,null,null,null,"Coincident"]
[null,null,"WEATHER CORRECTED MD 10% POE","MVA","Non-coincident"]
[null,null,null,null,"Coincident"]
[null,null,"WEATHER CORRECTED MD 50% POE","MW","Non-coincident"]
[null,null,null,null,"Coincident"]
[null,null,"WEATHER CORRECTED MD 50% POE","MVA","Non-coincident"]
[null,null,null,null,"Coincident"]
[null,"NSP to enter name","CONNECTION POINT RATING","MVA","Non-coincident"]
[null,null,null,null,"Coincident"]
[null,null,"WINTER/SUMMER PEAKING",null,"Non-coincident"]
[null,null,null,null,"Coincident"]
[null,null,"ADJUSTMENTS - EMBEDDED GENERATION","MW","Non-coincident"]
[null,null,null,null,"Coincident"]
[null,null,"WEATHER CORRECTED MD 10% POE","MW","Non-coincident"]
[null,null,null,null,"Coincident"]
[null,null,"WEATHER CORRECTED MD 10% POE","MVA","Non-coincident"]
[null,null,null,null,"Coincident"]
[null,null,"WEATHER CORRECTED MD 50% POE","MW","Non-coincident"]
[null,null,null,null,"Coincident"]
[null,null,"WEATHER CORRECTED MD 50% POE","MVA","Non-coincident"]
[null,null,null,null,"Coincident"]
[null,"NSP to enter name","CONNECTION POINT RATING","MVA","Non-coincident"]
[null,null,null,null,"Coincident"]
[null,null,"WINTER/SUMMER PEAKING",null,"Non-coincident"]
[null,null,null,null,"Coincident"]
[null,null,"ADJUSTMENTS - EMBEDDED GENERATION","MW","Non-coincident"]
[null,null,null,null,"Coincident"]
[null,null,"WEATHER CORRECTED MD 10% POE","MW","Non-coincident"]
[null,null,null,null,"Coincident"]
[null,null,"WEATHER CORRECTED MD 10% POE","MVA","Non-coincident"]
[null,null,null,null,"Coincident"]
[null,null,"WEATHER CORRECTED MD 50% POE","MW","Non-coincident"]
[null,null,null,null,"Coincident"]
[null,null,"WEATHER CORRECTED MD 50% POE","MVA","Non-coincident"]
[null,null,null,null,"Coincident"]
[null,"NSP to enter name","CONNECTION POINT RATING","MVA","Non-coincident"]
[null,null,null,null,"Coincident"]
[null,null,"WINTER/SUMMER PEAKING",null,"Non-coincident"]
[null,null,null,null,"Coincident"]
[null,null,"ADJUSTMENTS - EMBEDDED GENERATION","MW","Non-coincident"]
[null,null,null,null,"Coincident"]
[null,null,"WEATHER CORRECTED MD 10% POE","MW","Non-coincident"]
[null,null,null,null,"Coincident"]
[null,null,"WEATHER CORRECTED MD 10% POE","MVA","Non-coincident"]
[null,null,null,null,"Coincident"]
[null,null,"WEATHER CORRECTED MD 50% POE","MW","Non-coincident"]
[null,null,null,null,"Coincident"]
[null,null,"WEATHER CORRECTED MD 50% POE","MVA","Non-coincident"]
[null,null,null,null,"Coincident"]
[null,"NSP to enter name","CONNECTION POINT RATING","MVA","Non-coincident"]
[null,null,null,null,"Coincident"]
[null,null,"WINTER/SUMMER PEAKING",null,"Non-coincident"]
[null,null,null,null,"Coincident"]
[null,null,"ADJUSTMENTS - EMBEDDED GENERATION","MW","Non-coincident"]
[null,null,null,null,"Coincident"]
[null,null,"WEATHER CORRECTED MD 10% POE","MW","Non-coincident"]
[null,null,null,null,"Coincident"]
[null,null,"WEATHER CORRECTED MD 10% POE","MVA","Non-coincident"]
[null,null,null,null,"Coincident"]
[null,null,"WEATHER CORRECTED MD 50% POE","MW","Non-coincident"]
[null,null,null,null,"Coincident"]
[null,null,"WEATHER CORRECTED MD 50% POE","MVA","Non-coincident"]
[null,null,null,null,"Coincident"]
[null,"NSP to enter name","CONNECTION POINT RATING","MVA","Non-coincident"]
[null,null,null,null,"Coincident"]
[null,null,"WINTER/SUMMER PEAKING",null,"Non-coincident"]
[null,null,null,null,"Coincident"]
[null,null,"ADJUSTMENTS - EMBEDDED GENERATION","MW","Non-coincident"]
[null,null,null,null,"Coincident"]
[null,null,"WEATHER CORRECTED MD 10% POE","MW","Non-coincident"]
[null,null,null,null,"Coincident"]
[null,null,"WEATHER CORRECTED MD 10% POE","MVA","Non-coincident"]
[null,null,null,null,"Coincident"]
[null,null,"WEATHER CORRECTED MD 50% POE","MW","Non-coincident"]
[null,null,null,null,"Coincident"]
[null,null,"WEATHER CORRECTED MD 50% POE","MVA","Non-coincident"]
[null,null,null,null,"Coincident"]
[null,"NSP to enter name","CONNECTION POINT RATING","MVA","Non-coincident"]
[null,null,null,null,"Coincident"]
[null,null,"WINTER/SUMMER PEAKING",null,"Non-coincident"]
[null,null,null,null,"Coincident"]
[null,null,"ADJUSTMENTS - EMBEDDED GENERATION","MW","Non-coincident"]
[null,null,null,null,"Coincident"]
[null,null,"WEATHER CORRECTED MD 10% POE","MW","Non-coincident"]
[null,null,null,null,"Coincident"]
[null,null,"WEATHER CORRECTED MD 10% POE","MVA","Non-coincident"]
[null,null,null,null,"Coincident"]
[null,null,"WEATHER CORRECTED MD 50% POE","MW","Non-coincident"]
[null,null,null,null,"Coincident"]
[null,null,"WEATHER CORRECTED MD 50% POE","MVA","Non-coincident"]
[null,null,null,null,"Coincident"]
[null,"NSP to enter name","CONNECTION POINT RATING","MVA","Non-coincident"]
[null,null,null,null,"Coincident"]
[null,null,"WINTER/SUMMER PEAKING",null,"Non-coincident"]
[null,null,null,null,"Coincident"]
[null,null,"ADJUSTMENTS - EMBEDDED GENERATION","MW","Non-coincident"]
[null,null,null,null,"Coincident"]
[null,null,"WEATHER CORRECTED MD 10% POE","MW","Non-coincident"]
[null,null,null,null,"Coincident"]
[null,null,"WEATHER CORRECTED MD 10% POE","MVA","Non-coincident"]
[null,null,null,null,"Coincident"]
[null,null,"WEATHER CORRECTED MD 50% POE","MW","Non-coincident"]
[null,null,null,null,"Coincident"]
[null,null,"WEATHER CORRECTED MD 50% POE","MVA","Non-coincident"]
[null,null,null,null,"Coincident"]
[null,"NSP to enter name","CONNECTION POINT RATING","MVA","Non-coincident"]
[null,null,null,null,"Coincident"]
[null,null,"WINTER/SUMMER PEAKING",null,"Non-coincident"]
[null,null,null,null,"Coincident"]
[null,null,"ADJUSTMENTS - EMBEDDED GENERATION","MW","Non-coincident"]
[null,null,null,null,"Coincident"]
[null,null,"WEATHER CORRECTED MD 10% POE","MW","Non-coincident"]
[null,null,null,null,"Coincident"]
[null,null,"WEATHER CORRECTED MD 10% POE","MVA","Non-coincident"]
[null,null,null,null,"Coincident"]
[null,null,"WEATHER CORRECTED MD 50% POE","MW","Non-coincident"]
[null,null,null,null,"Coincident"]
[null,null,"WEATHER CORRECTED MD 50% POE","MVA","Non-coincident"]
[null,null,null,null,"Coincident"]
[null,"NSP to enter name","CONNECTION POINT RATING","MVA","Non-coincident"]
[null,null,null,null,"Coincident"]
[null,null,"WINTER/SUMMER PEAKING",null,"Non-coincident"]
[null,null,null,null,"Coincident"]
[null,null,"ADJUSTMENTS - EMBEDDED GENERATION","MW","Non-coincident"]
[null,null,null,null,"Coincident"]
[null,null,"WEATHER CORRECTED MD 10% POE","MW","Non-coincident"]
[null,null,null,null,"Coincident"]
[null,null,"WEATHER CORRECTED MD 10% POE","MVA","Non-coincident"]
[null,null,null,null,"Coincident"]
[null,null,"WEATHER CORRECTED MD 50% POE","MW","Non-coincident"]
[null,null,null,null,"Coincident"]
[null,null,"WEATHER CORRECTED MD 50% POE","MVA","Non-coincident"]
[null,null,null,null,"Coincident"]
[null,"NSP to enter name","CONNECTION POINT RATING","MVA","Non-coincident"]
[null,null,null,null,"Coincident"]
[null,null,"WINTER/SUMMER PEAKING",null,"Non-coincident"]
[null,null,null,null,"Coincident"]
[null,null,"ADJUSTMENTS - EMBEDDED GENERATION","MW","Non-coincident"]
[null,null,null,null,"Coincident"]
[null,null,"WEATHER CORRECTED MD 10% POE","MW","Non-coincident"]
[null,null,null,null,"Coincident"]
[null,null,"WEATHER CORRECTED MD 10% POE","MVA","Non-coincident"]
[null,null,null,null,"Coincident"]
[null,null,"WEATHER CORRECTED MD 50% POE","MW","Non-coincident"]
[null,null,null,null,"Coincident"]
[null,null,"WEATHER CORRECTED MD 50% POE","MVA","Non-coincident"]
[null,null,null,null,"Coincident"]
[null,"NSP to enter name","CONNECTION POINT RATING","MVA","Non-coincident"]
[null,null,null,null,"Coincident"]
[null,null,"WINTER/SUMMER PEAKING",null,"Non-coincident"]
[null,null,null,null,"Coincident"]
[null,null,"ADJUSTMENTS - EMBEDDED GENERATION","MW","Non-coincident"]
[null,null,null,null,"Coincident"]
[null,null,"WEATHER CORRECTED MD 10% POE","MW","Non-coincident"]
[null,null,null,null,"Coincident"]
[null,null,"WEATHER CORRECTED MD 10% POE","MVA","Non-coincident"]
[null,null,null,null,"Coincident"]
[null,null,"WEATHER CORRECTED MD 50% POE","MW","Non-coincident"]
[null,null,null,null,"Coincident"]
[null,null,"WEATHER CORRECTED MD 50% POE","MVA","Non-coincident"]
[null,null,null,null,"Coincident"]
[null,"NSP to enter name","CONNECTION POINT RATING","MVA","Non-coincident"]
[null,null,null,null,"Coincident"]
[null,null,"WINTER/SUMMER PEAKING",null,"Non-coincident"]
[null,null,null,null,"Coincident"]
[null,null,"ADJUSTMENTS - EMBEDDED GENERATION","MW","Non-coincident"]
[null,null,null,null,"Coincident"]
[null,null,"WEATHER CORRECTED MD 10% POE","MW","Non-coincident"]
[null,null,null,null,"Coincident"]
[null,null,"WEATHER CORRECTED MD 10% POE","MVA","Non-coincident"]
[null,null,null,null,"Coincident"]
[null,null,"WEATHER CORRECTED MD 50% POE","MW","Non-coincident"]
[null,null,null,null,"Coincident"]
[null,null,"WEATHER CORRECTED MD 50% POE","MVA","Non-coincident"]
[null,null,null,null,"Coincident"]
[null,"NSP to enter name","CONNECTION POINT RATING","MVA","Non-coincident"]
[null,null,null,null,"Coincident"]
[null,null,"WINTER/SUMMER PEAKING",null,"Non-coincident"]
[null,null,null,null,"Coincident"]
[null,null,"ADJUSTMENTS - EMBEDDED GENERATION","MW","Non-coincident"]
[null,null,null,null,"Coincident"]
[null,null,"WEATHER CORRECTED MD 10% POE","MW","Non-coincident"]
[null,null,null,null,"Coincident"]
[null,null,"WEATHER CORRECTED MD 10% POE","MVA","Non-coincident"]
[null,null,null,null,"Coincident"]
[null,null,"WEATHER CORRECTED MD 50% POE","MW","Non-coincident"]
[null,null,null,null,"Coincident"]
[null,null,"WEATHER CORRECTED MD 50% POE","MVA","Non-coincident"]
[null,null,null,null,"Coincident"]
[null,"NSP to enter name","CONNECTION POINT RATING","MVA","Non-coincident"]
[null,null,null,null,"Coincident"]
[null,null,"WINTER/SUMMER PEAKING",null,"Non-coincident"]
[null,null,null,null,"Coincident"]
[null,null,"ADJUSTMENTS - EMBEDDED GENERATION","MW","Non-coincident"]
[null,null,null,null,"Coincident"]
[null,null,"WEATHER CORRECTED MD 10% POE","MW","Non-coincident"]
[null,null,null,null,"Coincident"]
[null,null,"WEATHER CORRECTED MD 10% POE","MVA","Non-coincident"]
[null,null,null,null,"Coincident"]
[null,null,"WEATHER CORRECTED MD 50% POE","MW","Non-coincident"]
[null,null,null,null,"Coincident"]
[null,null,"WEATHER CORRECTED MD 50% POE","MVA","Non-coincident"]
[null,null,null,null,"Coincident"]
[null,"NSP to enter name","CONNECTION POINT RATING","MVA","Non-coincident"]
[null,null,null,null,"Coincident"]
[null,null,"WINTER/SUMMER PEAKING",null,"Non-coincident"]
[null,null,null,null,"Coincident"]
[null,null,"ADJUSTMENTS - EMBEDDED GENERATION","MW","Non-coincident"]
[null,null,null,null,"Coincident"]
[null,null,"WEATHER CORRECTED MD 10% POE","MW","Non-coincident"]
[null,null,null,null,"Coincident"]
[null,null,"WEATHER CORRECTED MD 10% POE","MVA","Non-coincident"]
[null,null,null,null,"Coincident"]
[null,null,"WEATHER CORRECTED MD 50% POE","MW","Non-coincident"]
[null,null,null,null,"Coincident"]
[null,null,"WEATHER CORRECTED MD 50% POE","MVA","Non-coincident"]
[null,null,null,null,"Coincident"]
[null,"NSP to enter name","CONNECTION POINT RATING","MVA","Non-coincident"]
[null,null,null,null,"Coincident"]
[null,null,"WINTER/SUMMER PEAKING",null,"Non-coincident"]
[null,null,null,null,"Coincident"]
[null,null,"ADJUSTMENTS - EMBEDDED GENERATION","MW","Non-coincident"]
[null,null,null,null,"Coincident"]
[null,null,"WEATHER CORRECTED MD 10% POE","MW","Non-coincident"]
[null,null,null,null,"Coincident"]
[null,null,"WEATHER CORRECTED MD 10% POE","MVA","Non-coincident"]
[null,null,null,null,"Coincident"]
[null,null,"WEATHER CORRECTED MD 50% POE","MW","Non-coincident"]
[null,null,null,null,"Coincident"]
[null,null,"WEATHER CORRECTED MD 50% POE","MVA","Non-coincident"]
[null,null,null,null,"Coincident"]
[null,"NSP to enter name","CONNECTION POINT RATING","MVA","Non-coincident"]
[null,null,null,null,"Coincident"]
[null,null,"WINTER/SUMMER PEAKING",null,"Non-coincident"]
[null,null,null,null,"Coincident"]
[null,null,"ADJUSTMENTS - EMBEDDED GENERATION","MW","Non-coincident"]
[null,null,null,null,"Coincident"]
[null,null,"WEATHER CORRECTED MD 10% POE","MW","Non-coincident"]
[null,null,null,null,"Coincident"]
[null,null,"WEATHER CORRECTED MD 10% POE","MVA","Non-coincident"]
[null,null,null,null,"Coincident"]
[null,null,"WEATHER CORRECTED MD 50% POE","MW","Non-coincident"]
[null,null,null,null,"Coincident"]
[null,null,"WEATHER CORRECTED MD 50% POE","MVA","Non-coincident"]
[null,null,null,null,"Coincident"]
[null,"NSP to enter name","CONNECTION POINT RATING","MVA","Non-coincident"]
[null,null,null,null,"Coincident"]
[null,null,"WINTER/SUMMER PEAKING",null,"Non-coincident"]
[null,null,null,null,"Coincident"]
[null,null,"ADJUSTMENTS - EMBEDDED GENERATION","MW","Non-coincident"]
[null,null,null,null,"Coincident"]
[null,null,"WEATHER CORRECTED MD 10% POE","MW","Non-coincident"]
[null,null,null,null,"Coincident"]
[null,null,"WEATHER CORRECTED MD 10% POE","MVA","Non-coincident"]
[null,null,null,null,"Coincident"]
[null,null,"WEATHER CORRECTED MD 50% POE","MW","Non-coincident"]
[null,null,null,null,"Coincident"]
[null,null,"WEATHER CORRECTED MD 50% POE","MVA","Non-coincident"]
[null,null,null,null,"Coincident"]
[null,"NSP to enter name","CONNECTION POINT RATING","MVA","Non-coincident"]
[null,null,null,null,"Coincident"]
[null,null,"WINTER/SUMMER PEAKING",null,"Non-coincident"]
[null,null,null,null,"Coincident"]
[null,null,"ADJUSTMENTS - EMBEDDED GENERATION","MW","Non-coincident"]
[null,null,null,null,"Coincident"]
[null,null,"WEATHER CORRECTED MD 10% POE","MW","Non-coincident"]
[null,null,null,null,"Coincident"]
[null,null,"WEATHER CORRECTED MD 10% POE","MVA","Non-coincident"]
[null,null,null,null,"Coincident"]
[null,null,"WEATHER CORRECTED MD 50% POE","MW","Non-coincident"]
[null,null,null,null,"Coincident"]
[null,null,"WEATHER CORRECTED MD 50% POE","MVA","Non-coincident"]
[null,null,null,null,"Coincident"]
[null,"NSP to enter name","CONNECTION POINT RATING","MVA","Non-coincident"]
[null,null,null,null,"Coincident"]
[null,null,"WINTER/SUMMER PEAKING",null,"Non-coincident"]
[null,null,null,null,"Coincident"]
[null,null,"ADJUSTMENTS - EMBEDDED GENERATION","MW","Non-coincident"]
[null,null,null,null,"Coincident"]
[null,null,"WEATHER CORRECTED MD 10% POE","MW","Non-coincident"]
[null,null,null,null,"Coincident"]
[null,null,"WEATHER CORRECTED MD 10% POE","MVA","Non-coincident"]
[null,null,null,null,"Coincident"]
[null,null,"WEATHER CORRECTED MD 50% POE","MW","Non-coincident"]
[null,null,null,null,"Coincident"]
[null,null,"WEATHER CORRECTED MD 50% POE","MVA","Non-coincident"]
[null,null,null,null,"Coincident"]
[null,"NSP to enter name","CONNECTION POINT RATING","MVA","Non-coincident"]
[null,null,null,null,"Coincident"]
[null,null,"WINTER/SUMMER PEAKING",null,"Non-coincident"]
[null,null,null,null,"Coincident"]
[null,null,"ADJUSTMENTS - EMBEDDED GENERATION","MW","Non-coincident"]
[null,null,null,null,"Coincident"]
[null,null,"WEATHER CORRECTED MD 10% POE","MW","Non-coincident"]
[null,null,null,null,"Coincident"]
[null,null,"WEATHER CORRECTED MD 10% POE","MVA","Non-coincident"]
[null,null,null,null,"Coincident"]
[null,null,"WEATHER CORRECTED MD 50% POE","MW","Non-coincident"]
[null,null,null,null,"Coincident"]
[null,null,"WEATHER CORRECTED MD 50% POE","MVA","Non-coincident"]
[null,null,null,null,"Coincident"]
[null,"NSP to enter name","CONNECTION POINT RATING","MVA","Non-coincident"]
[null,null,null,null,"Coincident"]
[null,null,"WINTER/SUMMER PEAKING",null,"Non-coincident"]
[null,null,null,null,"Coincident"]
[null,null,"ADJUSTMENTS - EMBEDDED GENERATION","MW","Non-coincident"]
[null,null,null,null,"Coincident"]
[null,null,"WEATHER CORRECTED MD 10% POE","MW","Non-coincident"]
[null,null,null,null,"Coincident"]
[null,null,"WEATHER CORRECTED MD 10% POE","MVA","Non-coincident"]
[null,null,null,null,"Coincident"]
[null,null,"WEATHER CORRECTED MD 50% POE","MW","Non-coincident"]
[null,null,null,null,"Coincident"]
[null,null,"WEATHER CORRECTED MD 50% POE","MVA","Non-coincident"]
[null,null,null,null,"Coincident"]
[null,"NSP to enter name","CONNECTION POINT RATING","MVA","Non-coincident"]
[null,null,null,null,"Coincident"]
[null,null,"WINTER/SUMMER PEAKING",null,"Non-coincident"]
[null,null,null,null,"Coincident"]
[null,null,"ADJUSTMENTS - EMBEDDED GENERATION","MW","Non-coincident"]
[null,null,null,null,"Coincident"]
[null,null,"WEATHER CORRECTED MD 10% POE","MW","Non-coincident"]
[null,null,null,null,"Coincident"]
[null,null,"WEATHER CORRECTED MD 10% POE","MVA","Non-coincident"]
[null,null,null,null,"Coincident"]
[null,null,"WEATHER CORRECTED MD 50% POE","MW","Non-coincident"]
[null,null,null,null,"Coincident"]
[null,null,"WEATHER CORRECTED MD 50% POE","MVA","Non-coincident"]
[null,null,null,null,"Coincident"]
[null,"NSP to enter name","CONNECTION POINT RATING","MVA","Non-coincident"]
[null,null,null,null,"Coincident"]
[null,null,"WINTER/SUMMER PEAKING",null,"Non-coincident"]
[null,null,null,null,"Coincident"]
[null,null,"ADJUSTMENTS - EMBEDDED GENERATION","MW","Non-coincident"]
[null,null,null,null,"Coincident"]
[null,null,"WEATHER CORRECTED MD 10% POE","MW","Non-coincident"]
[null,null,null,null,"Coincident"]
[null,null,"WEATHER CORRECTED MD 10% POE","MVA","Non-coincident"]
[null,null,null,null,"Coincident"]
[null,null,"WEATHER CORRECTED MD 50% POE","MW","Non-coincident"]
[null,null,null,null,"Coincident"]
[null,null,"WEATHER CORRECTED MD 50% POE","MVA","Non-coincident"]
[null,null,null,null,"Coincident"]
[null,"NSP to enter name","CONNECTION POINT RATING","MVA","Non-coincident"]
[null,null,null,null,"Coincident"]
[null,null,"WINTER/SUMMER PEAKING",null,"Non-coincident"]
[null,null,null,null,"Coincident"]
[null,null,"ADJUSTMENTS - EMBEDDED GENERATION","MW","Non-coincident"]
[null,null,null,null,"Coincident"]
[null,null,"WEATHER CORRECTED MD 10% POE","MW","Non-coincident"]
[null,null,null,null,"Coincident"]
[null,null,"WEATHER CORRECTED MD 10% POE","MVA","Non-coincident"]
[null,null,null,null,"Coincident"]
[null,null,"WEATHER CORRECTED MD 50% POE","MW","Non-coincident"]
[null,null,null,null,"Coincident"]
[null,null,"WEATHER CORRECTED MD 50% POE","MVA","Non-coincident"]
[null,null,null,null,"Coincident"]
[null,"NSP to enter name","CONNECTION POINT RATING","MVA","Non-coincident"]
[null,null,null,null,"Coincident"]
[null,null,"WINTER/SUMMER PEAKING",null,"Non-coincident"]
[null,null,null,null,"Coincident"]
[null,null,"ADJUSTMENTS - EMBEDDED GENERATION","MW","Non-coincident"]
[null,null,null,null,"Coincident"]
[null,null,"WEATHER CORRECTED MD 10% POE","MW","Non-coincident"]
[null,null,null,null,"Coincident"]
[null,null,"WEATHER CORRECTED MD 10% POE","MVA","Non-coincident"]
[null,null,null,null,"Coincident"]
[null,null,"WEATHER CORRECTED MD 50% POE","MW","Non-coincident"]
[null,null,null,null,"Coincident"]
[null,null,"WEATHER CORRECTED MD 50% POE","MVA","Non-coincident"]
[null,null,null,null,"Coincident"]
[null,"NSP to enter name","CONNECTION POINT RATING","MVA","Non-coincident"]
[null,null,null,null,"Coincident"]
[null,null,"WINTER/SUMMER PEAKING",null,"Non-coincident"]
[null,null,null,null,"Coincident"]
[null,null,"ADJUSTMENTS - EMBEDDED GENERATION","MW","Non-coincident"]
[null,null,null,null,"Coincident"]
[null,null,"WEATHER CORRECTED MD 10% POE","MW","Non-coincident"]
[null,null,null,null,"Coincident"]
[null,null,"WEATHER CORRECTED MD 10% POE","MVA","Non-coincident"]
[null,null,null,null,"Coincident"]
[null,null,"WEATHER CORRECTED MD 50% POE","MW","Non-coincident"]
[null,null,null,null,"Coincident"]
[null,null,"WEATHER CORRECTED MD 50% POE","MVA","Non-coincident"]
[null,null,null,null,"Coincident"]
[null,"NSP to enter name","CONNECTION POINT RATING","MVA","Non-coincident"]
[null,null,null,null,"Coincident"]
[null,null,"WINTER/SUMMER PEAKING",null,"Non-coincident"]
[null,null,null,null,"Coincident"]
[null,null,"ADJUSTMENTS - EMBEDDED GENERATION","MW","Non-coincident"]
[null,null,null,null,"Coincident"]
[null,null,"WEATHER CORRECTED MD 10% POE","MW","Non-coincident"]
[null,null,null,null,"Coincident"]
[null,null,"WEATHER CORRECTED MD 10% POE","MVA","Non-coincident"]
[null,null,null,null,"Coincident"]
[null,null,"WEATHER CORRECTED MD 50% POE","MW","Non-coincident"]
[null,null,null,null,"Coincident"]
[null,null,"WEATHER CORRECTED MD 50% POE","MVA","Non-coincident"]
[null,null,null,null,"Coincident"]
[null,"NSP to enter name","CONNECTION POINT RATING","MVA","Non-coincident"]
[null,null,null,null,"Coincident"]
[null,null,"WINTER/SUMMER PEAKING",null,"Non-coincident"]
[null,null,null,null,"Coincident"]
[null,null,"ADJUSTMENTS - EMBEDDED GENERATION","MW","Non-coincident"]
[null,null,null,null,"Coincident"]
[null,null,"WEATHER CORRECTED MD 10% POE","MW","Non-coincident"]
[null,null,null,null,"Coincident"]
[null,null,"WEATHER CORRECTED MD 10% POE","MVA","Non-coincident"]
[null,null,null,null,"Coincident"]
[null,null,"WEATHER CORRECTED MD 50% POE","MW","Non-coincident"]
[null,null,null,null,"Coincident"]
[null,null,"WEATHER CORRECTED MD 50% POE","MVA","Non-coincident"]
[null,null,null,null,"Coincident"]
[null,"NSP to enter name","CONNECTION POINT RATING","MVA","Non-coincident"]
[null,null,null,null,"Coincident"]
[null,null,"WINTER/SUMMER PEAKING",null,"Non-coincident"]
[null,null,null,null,"Coincident"]
[null,null,"ADJUSTMENTS - EMBEDDED GENERATION","MW","Non-coincident"]
[null,null,null,null,"Coincident"]
[null,null,"WEATHER CORRECTED MD 10% POE","MW","Non-coincident"]
[null,null,null,null,"Coincident"]
[null,null,"WEATHER CORRECTED MD 10% POE","MVA","Non-coincident"]
[null,null,null,null,"Coincident"]
[null,null,"WEATHER CORRECTED MD 50% POE","MW","Non-coincident"]
[null,null,null,null,"Coincident"]
[null,null,"WEATHER CORRECTED MD 50% POE","MVA","Non-coincident"]
[null,null,null,null,"Coincident"]
[null,"NSP to enter name","CONNECTION POINT RATING","MVA","Non-coincident"]
[null,null,null,null,"Coincident"]
[null,null,"WINTER/SUMMER PEAKING",null,"Non-coincident"]
[null,null,null,null,"Coincident"]
[null,null,"ADJUSTMENTS - EMBEDDED GENERATION","MW","Non-coincident"]
[null,null,null,null,"Coincident"]
[null,null,"WEATHER CORRECTED MD 10% POE","MW","Non-coincident"]
[null,null,null,null,"Coincident"]
[null,null,"WEATHER CORRECTED MD 10% POE","MVA","Non-coincident"]
[null,null,null,null,"Coincident"]
[null,null,"WEATHER CORRECTED MD 50% POE","MW","Non-coincident"]
[null,null,null,null,"Coincident"]
[null,null,"WEATHER CORRECTED MD 50% POE","MVA","Non-coincident"]
[null,null,null,null,"Coincident"]
[null,"NSP to enter name","CONNECTION POINT RATING","MVA","Non-coincident"]
[null,null,null,null,"Coincident"]
[null,null,"WINTER/SUMMER PEAKING",null,"Non-coincident"]
[null,null,null,null,"Coincident"]
[null,null,"ADJUSTMENTS - EMBEDDED GENERATION","MW","Non-coincident"]
[null,null,null,null,"Coincident"]
[null,null,"WEATHER CORRECTED MD 10% POE","MW","Non-coincident"]
[null,null,null,null,"Coincident"]
[null,null,"WEATHER CORRECTED MD 10% POE","MVA","Non-coincident"]
[null,null,null,null,"Coincident"]
[null,null,"WEATHER CORRECTED MD 50% POE","MW","Non-coincident"]
[null,null,null,null,"Coincident"]
[null,null,"WEATHER CORRECTED MD 50% POE","MVA","Non-coincident"]
[null,null,null,null,"Coincident"]
[null,"NSP to enter name","CONNECTION POINT RATING","MVA","Non-coincident"]
[null,null,null,null,"Coincident"]
[null,null,"WINTER/SUMMER PEAKING",null,"Non-coincident"]
[null,null,null,null,"Coincident"]
[null,null,"ADJUSTMENTS - EMBEDDED GENERATION","MW","Non-coincident"]
[null,null,null,null,"Coincident"]
[null,null,"WEATHER CORRECTED MD 10% POE","MW","Non-coincident"]
[null,null,null,null,"Coincident"]
[null,null,"WEATHER CORRECTED MD 10% POE","MVA","Non-coincident"]
[null,null,null,null,"Coincident"]
[null,null,"WEATHER CORRECTED MD 50% POE","MW","Non-coincident"]
[null,null,null,null,"Coincident"]
[null,null,"WEATHER CORRECTED MD 50% POE","MVA","Non-coincident"]
[null,null,null,null,"Coincident"]
[null,"NSP to enter name","CONNECTION POINT RATING","MVA","Non-coincident"]
[null,null,null,null,"Coincident"]
[null,null,"WINTER/SUMMER PEAKING",null,"Non-coincident"]
[null,null,null,null,"Coincident"]
[null,null,"ADJUSTMENTS - EMBEDDED GENERATION","MW","Non-coincident"]
[null,null,null,null,"Coincident"]
[null,null,"WEATHER CORRECTED MD 10% POE","MW","Non-coincident"]
[null,null,null,null,"Coincident"]
[null,null,"WEATHER CORRECTED MD 10% POE","MVA","Non-coincident"]
[null,null,null,null,"Coincident"]
[null,null,"WEATHER CORRECTED MD 50% POE","MW","Non-coincident"]
[null,null,null,null,"Coincident"]
[null,null,"WEATHER CORRECTED MD 50% POE","MVA","Non-coincident"]
[null,null,null,null,"Coincident"]
[null,"NSP to enter name","CONNECTION POINT RATING","MVA","Non-coincident"]
[null,null,null,null,"Coincident"]
[null,null,"WINTER/SUMMER PEAKING",null,"Non-coincident"]
[null,null,null,null,"Coincident"]
[null,null,"ADJUSTMENTS - EMBEDDED GENERATION","MW","Non-coincident"]
[null,null,null,null,"Coincident"]
[null,null,"WEATHER CORRECTED MD 10% POE","MW","Non-coincident"]
[null,null,null,null,"Coincident"]
[null,null,"WEATHER CORRECTED MD 10% POE","MVA","Non-coincident"]
[null,null,null,null,"Coincident"]
[null,null,"WEATHER CORRECTED MD 50% POE","MW","Non-coincident"]
[null,null,null,null,"Coincident"]
[null,null,"WEATHER CORRECTED MD 50% POE","MVA","Non-coincident"]
[null,null,null,null,"Coincident"]
[null,"NSP to enter name","CONNECTION POINT RATING","MVA","Non-coincident"]
[null,null,null,null,"Coincident"]
[null,null,"WINTER/SUMMER PEAKING",null,"Non-coincident"]
[null,null,null,null,"Coincident"]
[null,null,"ADJUSTMENTS - EMBEDDED GENERATION","MW","Non-coincident"]
[null,null,null,null,"Coincident"]
[null,null,"WEATHER CORRECTED MD 10% POE","MW","Non-coincident"]
[null,null,null,null,"Coincident"]
[null,null,"WEATHER CORRECTED MD 10% POE","MVA","Non-coincident"]
[null,null,null,null,"Coincident"]
[null,null,"WEATHER CORRECTED MD 50% POE","MW","Non-coincident"]
[null,null,null,null,"Coincident"]
[null,null,"WEATHER CORRECTED MD 50% POE","MVA","Non-coincident"]
[null,null,null,null,"Coincident"]
[null,"NSP to enter name","CONNECTION POINT RATING","MVA","Non-coincident"]
[null,null,null,null,"Coincident"]
[null,null,"WINTER/SUMMER PEAKING",null,"Non-coincident"]
[null,null,null,null,"Coincident"]
[null,null,"ADJUSTMENTS - EMBEDDED GENERATION","MW","Non-coincident"]
[null,null,null,null,"Coincident"]
[null,null,"WEATHER CORRECTED MD 10% POE","MW","Non-coincident"]
[null,null,null,null,"Coincident"]
[null,null,"WEATHER CORRECTED MD 10% POE","MVA","Non-coincident"]
[null,null,null,null,"Coincident"]
[null,null,"WEATHER CORRECTED MD 50% POE","MW","Non-coincident"]
[null,null,null,null,"Coincident"]
[null,null,"WEATHER CORRECTED MD 50% POE","MVA","Non-coincident"]
[null,null,null,null,"Coincident"]
[null,"NSP to enter name","CONNECTION POINT RATING","MVA","Non-coincident"]
[null,null,null,null,"Coincident"]
[null,null,"WINTER/SUMMER PEAKING",null,"Non-coincident"]
[null,null,null,null,"Coincident"]
[null,null,"ADJUSTMENTS - EMBEDDED GENERATION","MW","Non-coincident"]
[null,null,null,null,"Coincident"]
[null,null,"WEATHER CORRECTED MD 10% POE","MW","Non-coincident"]
[null,null,null,null,"Coincident"]
[null,null,"WEATHER CORRECTED MD 10% POE","MVA","Non-coincident"]
[null,null,null,null,"Coincident"]
[null,null,"WEATHER CORRECTED MD 50% POE","MW","Non-coincident"]
[null,null,null,null,"Coincident"]
[null,null,"WEATHER CORRECTED MD 50% POE","MVA","Non-coincident"]
[null,null,null,null,"Coincident"]
[null,"NSP to enter name","CONNECTION POINT RATING","MVA","Non-coincident"]
[null,null,null,null,"Coincident"]
[null,null,"WINTER/SUMMER PEAKING",null,"Non-coincident"]
[null,null,null,null,"Coincident"]
[null,null,"ADJUSTMENTS - EMBEDDED GENERATION","MW","Non-coincident"]
[null,null,null,null,"Coincident"]
[null,null,"WEATHER CORRECTED MD 10% POE","MW","Non-coincident"]
[null,null,null,null,"Coincident"]
[null,null,"WEATHER CORRECTED MD 10% POE","MVA","Non-coincident"]
[null,null,null,null,"Coincident"]
[null,null,"WEATHER CORRECTED MD 50% POE","MW","Non-coincident"]
[null,null,null,null,"Coincident"]
[null,null,"WEATHER CORRECTED MD 50% POE","MVA","Non-coincident"]
[null,null,null,null,"Coincident"]
[null,"NSP to enter name","CONNECTION POINT RATING","MVA","Non-coincident"]
[null,null,null,null,"Coincident"]
[null,null,"WINTER/SUMMER PEAKING",null,"Non-coincident"]
[null,null,null,null,"Coincident"]
[null,null,"ADJUSTMENTS - EMBEDDED GENERATION","MW","Non-coincident"]
[null,null,null,null,"Coincident"]
[null,null,"WEATHER CORRECTED MD 10% POE","MW","Non-coincident"]
[null,null,null,null,"Coincident"]
[null,null,"WEATHER CORRECTED MD 10% POE","MVA","Non-coincident"]
[null,null,null,null,"Coincident"]
[null,null,"WEATHER CORRECTED MD 50% POE","MW","Non-coincident"]
[null,null,null,null,"Coincident"]
[null,null,"WEATHER CORRECTED MD 50% POE","MVA","Non-coincident"]
[null,null,null,null,"Coincident"]
[null,"NSP to enter name","CONNECTION POINT RATING","MVA","Non-coincident"]
[null,null,null,null,"Coincident"]
[null,null,"WINTER/SUMMER PEAKING",null,"Non-coincident"]
[null,null,null,null,"Coincident"]
[null,null,"ADJUSTMENTS - EMBEDDED GENERATION","MW","Non-coincident"]
[null,null,null,null,"Coincident"]
[null,null,"WEATHER CORRECTED MD 10% POE","MW","Non-coincident"]
[null,null,null,null,"Coincident"]
[null,null,"WEATHER CORRECTED MD 10% POE","MVA","Non-coincident"]
[null,null,null,null,"Coincident"]
[null,null,"WEATHER CORRECTED MD 50% POE","MW","Non-coincident"]
[null,null,null,null,"Coincident"]
[null,null,"WEATHER CORRECTED MD 50% POE","MVA","Non-coincident"]
[null,null,null,null,"Coincident"]
[null,"NSP to enter name","CONNECTION POINT RATING","MVA","Non-coincident"]
[null,null,null,null,"Coincident"]
[null,null,"WINTER/SUMMER PEAKING",null,"Non-coincident"]
[null,null,null,null,"Coincident"]
[null,null,"ADJUSTMENTS - EMBEDDED GENERATION","MW","Non-coincident"]
[null,null,null,null,"Coincident"]
[null,null,"WEATHER CORRECTED MD 10% POE","MW","Non-coincident"]
[null,null,null,null,"Coincident"]
[null,null,"WEATHER CORRECTED MD 10% POE","MVA","Non-coincident"]
[null,null,null,null,"Coincident"]
[null,null,"WEATHER CORRECTED MD 50% POE","MW","Non-coincident"]
[null,null,null,null,"Coincident"]
[null,null,"WEATHER CORRECTED MD 50% POE","MVA","Non-coincident"]
[null,null,null,null,"Coincident"]
[null,"NSP to enter name","CONNECTION POINT RATING","MVA","Non-coincident"]
[null,null,null,null,"Coincident"]
[null,null,"WINTER/SUMMER PEAKING",null,"Non-coincident"]
[null,null,null,null,"Coincident"]
[null,null,"ADJUSTMENTS - EMBEDDED GENERATION","MW","Non-coincident"]
[null,null,null,null,"Coincident"]
[null,null,"WEATHER CORRECTED MD 10% POE","MW","Non-coincident"]
[null,null,null,null,"Coincident"]
[null,null,"WEATHER CORRECTED MD 10% POE","MVA","Non-coincident"]
[null,null,null,null,"Coincident"]
[null,null,"WEATHER CORRECTED MD 50% POE","MW","Non-coincident"]
[null,null,null,null,"Coincident"]
[null,null,"WEATHER CORRECTED MD 50% POE","MVA","Non-coincident"]
[null,null,null,null,"Coincident"]
[null,"NSP to enter name","CONNECTION POINT RATING","MVA","Non-coincident"]
[null,null,null,null,"Coincident"]
[null,null,"WINTER/SUMMER PEAKING",null,"Non-coincident"]
[null,null,null,null,"Coincident"]
[null,null,"ADJUSTMENTS - EMBEDDED GENERATION","MW","Non-coincident"]
[null,null,null,null,"Coincident"]
[null,null,"WEATHER CORRECTED MD 10% POE","MW","Non-coincident"]
[null,null,null,null,"Coincident"]
[null,null,"WEATHER CORRECTED MD 10% POE","MVA","Non-coincident"]
[null,null,null,null,"Coincident"]
[null,null,"WEATHER CORRECTED MD 50% POE","MW","Non-coincident"]
[null,null,null,null,"Coincident"]
[null,null,"WEATHER CORRECTED MD 50% POE","MVA","Non-coincident"]
[null,null,null,null,"Coincident"]
[null,"NSP to enter name","CONNECTION POINT RATING","MVA","Non-coincident"]
[null,null,null,null,"Coincident"]
[null,null,"WINTER/SUMMER PEAKING",null,"Non-coincident"]
[null,null,null,null,"Coincident"]
[null,null,"ADJUSTMENTS - EMBEDDED GENERATION","MW","Non-coincident"]
[null,null,null,null,"Coincident"]
[null,null,"WEATHER CORRECTED MD 10% POE","MW","Non-coincident"]
[null,null,null,null,"Coincident"]
[null,null,"WEATHER CORRECTED MD 10% POE","MVA","Non-coincident"]
[null,null,null,null,"Coincident"]
[null,null,"WEATHER CORRECTED MD 50% POE","MW","Non-coincident"]
[null,null,null,null,"Coincident"]
[null,null,"WEATHER CORRECTED MD 50% POE","MVA","Non-coincident"]
[null,null,null,null,"Coincident"]
[null,"NSP to enter name","CONNECTION POINT RATING","MVA","Non-coincident"]
[null,null,null,null,"Coincident"]
[null,null,"WINTER/SUMMER PEAKING",null,"Non-coincident"]
[null,null,null,null,"Coincident"]
[null,null,"ADJUSTMENTS - EMBEDDED GENERATION","MW","Non-coincident"]
[null,null,null,null,"Coincident"]
[null,null,"WEATHER CORRECTED MD 10% POE","MW","Non-coincident"]
[null,null,null,null,"Coincident"]
[null,null,"WEATHER CORRECTED MD 10% POE","MVA","Non-coincident"]
[null,null,null,null,"Coincident"]
[null,null,"WEATHER CORRECTED MD 50% POE","MW","Non-coincident"]
[null,null,null,null,"Coincident"]
[null,null,"WEATHER CORRECTED MD 50% POE","MVA","Non-coincident"]
[null,null,null,null,"Coincident"]
[null,"NSP to enter name","CONNECTION POINT RATING","MVA","Non-coincident"]
[null,null,null,null,"Coincident"]
[null,null,"WINTER/SUMMER PEAKING",null,"Non-coincident"]
[null,null,null,null,"Coincident"]
[null,null,"ADJUSTMENTS - EMBEDDED GENERATION","MW","Non-coincident"]
[null,null,null,null,"Coincident"]
[null,null,"WEATHER CORRECTED MD 10% POE","MW","Non-coincident"]
[null,null,null,null,"Coincident"]
[null,null,"WEATHER CORRECTED MD 10% POE","MVA","Non-coincident"]
[null,null,null,null,"Coincident"]
[null,null,"WEATHER CORRECTED MD 50% POE","MW","Non-coincident"]
[null,null,null,null,"Coincident"]
[null,null,"WEATHER CORRECTED MD 50% POE","MVA","Non-coincident"]
[null,null,null,null,"Coincident"]
[null,"NSP to enter name","CONNECTION POINT RATING","MVA","Non-coincident"]
[null,null,null,null,"Coincident"]
[null,null,"WINTER/SUMMER PEAKING",null,"Non-coincident"]
[null,null,null,null,"Coincident"]
[null,null,"ADJUSTMENTS - EMBEDDED GENERATION","MW","Non-coincident"]
[null,null,null,null,"Coincident"]
[null,null,"WEATHER CORRECTED MD 10% POE","MW","Non-coincident"]
[null,null,null,null,"Coincident"]
[null,null,"WEATHER CORRECTED MD 10% POE","MVA","Non-coincident"]
[null,null,null,null,"Coincident"]
[null,null,"WEATHER CORRECTED MD 50% POE","MW","Non-coincident"]
[null,null,null,null,"Coincident"]
[null,null,"WEATHER CORRECTED MD 50% POE","MVA","Non-coincident"]
[null,null,null,null,"Coincident"]
[null,"NSP to enter name","CONNECTION POINT RATING","MVA","Non-coincident"]
[null,null,null,null,"Coincident"]
[null,null,"WINTER/SUMMER PEAKING",null,"Non-coincident"]
[null,null,null,null,"Coincident"]
[null,null,"ADJUSTMENTS - EMBEDDED GENERATION","MW","Non-coincident"]
[null,null,null,null,"Coincident"]
[null,null,"WEATHER CORRECTED MD 10% POE","MW","Non-coincident"]
[null,null,null,null,"Coincident"]
[null,null,"WEATHER CORRECTED MD 10% POE","MVA","Non-coincident"]
[null,null,null,null,"Coincident"]
[null,null,"WEATHER CORRECTED MD 50% POE","MW","Non-coincident"]
[null,null,null,null,"Coincident"]
[null,null,"WEATHER CORRECTED MD 50% POE","MVA","Non-coincident"]
[null,null,null,null,"Coincident"]
[null,"NSP to enter name","CONNECTION POINT RATING","MVA","Non-coincident"]
[null,null,null,null,"Coincident"]
[null,null,"WINTER/SUMMER PEAKING",null,"Non-coincident"]
[null,null,null,null,"Coincident"]
[null,null,"ADJUSTMENTS - EMBEDDED GENERATION","MW","Non-coincident"]
[null,null,null,null,"Coincident"]
[null,null,"WEATHER CORRECTED MD 10% POE","MW","Non-coincident"]
[null,null,null,null,"Coincident"]
[null,null,"WEATHER CORRECTED MD 10% POE","MVA","Non-coincident"]
[null,null,null,null,"Coincident"]
[null,null,"WEATHER CORRECTED MD 50% POE","MW","Non-coincident"]
[null,null,null,null,"Coincident"]
[null,null,"WEATHER CORRECTED MD 50% POE","MVA","Non-coincident"]
[null,null,null,null,"Coincident"]
[null,"NSP to enter name","CONNECTION POINT RATING","MVA","Non-coincident"]
[null,null,null,null,"Coincident"]
[null,null,"WINTER/SUMMER PEAKING",null,"Non-coincident"]
[null,null,null,null,"Coincident"]
[null,null,"ADJUSTMENTS - EMBEDDED GENERATION","MW","Non-coincident"]
[null,null,null,null,"Coincident"]
[null,null,"WEATHER CORRECTED MD 10% POE","MW","Non-coincident"]
[null,null,null,null,"Coincident"]
[null,null,"WEATHER CORRECTED MD 10% POE","MVA","Non-coincident"]
[null,null,null,null,"Coincident"]
[null,null,"WEATHER CORRECTED MD 50% POE","MW","Non-coincident"]
[null,null,null,null,"Coincident"]
[null,null,"WEATHER CORRECTED MD 50% POE","MVA","Non-coincident"]
[null,null,null,null,"Coincident"]
[null,"NSP to enter name","CONNECTION POINT RATING","MVA","Non-coincident"]
[null,null,null,null,"Coincident"]
[null,null,"WINTER/SUMMER PEAKING",null,"Non-coincident"]
[null,null,null,null,"Coincident"]
[null,null,"ADJUSTMENTS - EMBEDDED GENERATION","MW","Non-coincident"]
[null,null,null,null,"Coincident"]
[null,null,"WEATHER CORRECTED MD 10% POE","MW","Non-coincident"]
[null,null,null,null,"Coincident"]
[null,null,"WEATHER CORRECTED MD 10% POE","MVA","Non-coincident"]
[null,null,null,null,"Coincident"]
[null,null,"WEATHER CORRECTED MD 50% POE","MW","Non-coincident"]
[null,null,null,null,"Coincident"]
[null,null,"WEATHER CORRECTED MD 50% POE","MVA","Non-coincident"]
[null,null,null,null,"Coincident"]
[null,"NSP to enter name","CONNECTION POINT RATING","MVA","Non-coincident"]
[null,null,null,null,"Coincident"]
[null,null,"WINTER/SUMMER PEAKING",null,"Non-coincident"]
[null,null,null,null,"Coincident"]
[null,null,"ADJUSTMENTS - EMBEDDED GENERATION","MW","Non-coincident"]
[null,null,null,null,"Coincident"]
[null,null,"WEATHER CORRECTED MD 10% POE","MW","Non-coincident"]
[null,null,null,null,"Coincident"]
[null,null,"WEATHER CORRECTED MD 10% POE","MVA","Non-coincident"]
[null,null,null,null,"Coincident"]
[null,null,"WEATHER CORRECTED MD 50% POE","MW","Non-coincident"]
[null,null,null,null,"Coincident"]
[null,null,"WEATHER CORRECTED MD 50% POE","MVA","Non-coincident"]
[null,null,null,null,"Coincident"]
[null,"NSP to enter name","CONNECTION POINT RATING","MVA","Non-coincident"]
[null,null,null,null,"Coincident"]
[null,null,"WINTER/SUMMER PEAKING",null,"Non-coincident"]
[null,null,null,null,"Coincident"]
[null,null,"ADJUSTMENTS - EMBEDDED GENERATION","MW","Non-coincident"]
[null,null,null,null,"Coincident"]
[null,null,"WEATHER CORRECTED MD 10% POE","MW","Non-coincident"]
[null,null,null,null,"Coincident"]
[null,null,"WEATHER CORRECTED MD 10% POE","MVA","Non-coincident"]
[null,null,null,null,"Coincident"]
[null,null,"WEATHER CORRECTED MD 50% POE","MW","Non-coincident"]
[null,null,null,null,"Coincident"]
[null,null,"WEATHER CORRECTED MD 50% POE","MVA","Non-coincident"]
[null,null,null,null,"Coincident"]
[null,"NSP to enter name","CONNECTION POINT RATING","MVA","Non-coincident"]
[null,null,null,null,"Coincident"]
[null,null,"WINTER/SUMMER PEAKING",null,"Non-coincident"]
[null,null,null,null,"Coincident"]
[null,null,"ADJUSTMENTS - EMBEDDED GENERATION","MW","Non-coincident"]
[null,null,null,null,"Coincident"]
[null,null,"WEATHER CORRECTED MD 10% POE","MW","Non-coincident"]
[null,null,null,null,"Coincident"]
[null,null,"WEATHER CORRECTED MD 10% POE","MVA","Non-coincident"]
[null,null,null,null,"Coincident"]
[null,null,"WEATHER CORRECTED MD 50% POE","MW","Non-coincident"]
[null,null,null,null,"Coincident"]
[null,null,"WEATHER CORRECTED MD 50% POE","MVA","Non-coincident"]
[null,null,null,null,"Coincident"]
[null,"NSP to enter name","CONNECTION POINT RATING","MVA","Non-coincident"]
[null,null,null,null,"Coincident"]
[null,null,"WINTER/SUMMER PEAKING",null,"Non-coincident"]
[null,null,null,null,"Coincident"]
[null,null,"ADJUSTMENTS - EMBEDDED GENERATION","MW","Non-coincident"]
[null,null,null,null,"Coincident"]
[null,null,"WEATHER CORRECTED MD 10% POE","MW","Non-coincident"]
[null,null,null,null,"Coincident"]
[null,null,"WEATHER CORRECTED MD 10% POE","MVA","Non-coincident"]
[null,null,null,null,"Coincident"]
[null,null,"WEATHER CORRECTED MD 50% POE","MW","Non-coincident"]
[null,null,null,null,"Coincident"]
[null,null,"WEATHER CORRECTED MD 50% POE","MVA","Non-coincident"]
[null,null,null,null,"Coincident"]
[null,"NSP to enter name","CONNECTION POINT RATING","MVA","Non-coincident"]
[null,null,null,null,"Coincident"]
[null,null,"WINTER/SUMMER PEAKING",null,"Non-coincident"]
[null,null,null,null,"Coincident"]
[null,null,"ADJUSTMENTS - EMBEDDED GENERATION","MW","Non-coincident"]
[null,null,null,null,"Coincident"]
[null,null,"WEATHER CORRECTED MD 10% POE","MW","Non-coincident"]
[null,null,null,null,"Coincident"]
[null,null,"WEATHER CORRECTED MD 10% POE","MVA","Non-coincident"]
[null,null,null,null,"Coincident"]
[null,null,"WEATHER CORRECTED MD 50% POE","MW","Non-coincident"]
[null,null,null,null,"Coincident"]
[null,null,"WEATHER CORRECTED MD 50% POE","MVA","Non-coincident"]
[null,null,null,null,"Coincident"]
[null,"NSP to enter name","CONNECTION POINT RATING","MVA","Non-coincident"]
[null,null,null,null,"Coincident"]
[null,null,"WINTER/SUMMER PEAKING",null,"Non-coincident"]
[null,null,null,null,"Coincident"]
[null,null,"ADJUSTMENTS - EMBEDDED GENERATION","MW","Non-coincident"]
[null,null,null,null,"Coincident"]
[null,null,"WEATHER CORRECTED MD 10% POE","MW","Non-coincident"]
[null,null,null,null,"Coincident"]
[null,null,"WEATHER CORRECTED MD 10% POE","MVA","Non-coincident"]
[null,null,null,null,"Coincident"]
[null,null,"WEATHER CORRECTED MD 50% POE","MW","Non-coincident"]
[null,null,null,null,"Coincident"]
[null,null,"WEATHER CORRECTED MD 50% POE","MVA","Non-coincident"]
[null,null,null,null,"Coincident"]
[null,"NSP to enter name","CONNECTION POINT RATING","MVA","Non-coincident"]
[null,null,null,null,"Coincident"]
[null,null,"WINTER/SUMMER PEAKING",null,"Non-coincident"]
[null,null,null,null,"Coincident"]
[null,null,"ADJUSTMENTS - EMBEDDED GENERATION","MW","Non-coincident"]
[null,null,null,null,"Coincident"]
[null,null,"WEATHER CORRECTED MD 10% POE","MW","Non-coincident"]
[null,null,null,null,"Coincident"]
[null,null,"WEATHER CORRECTED MD 10% POE","MVA","Non-coincident"]
[null,null,null,null,"Coincident"]
[null,null,"WEATHER CORRECTED MD 50% POE","MW","Non-coincident"]
[null,null,null,null,"Coincident"]
[null,null,"WEATHER CORRECTED MD 50% POE","MVA","Non-coincident"]
[null,null,null,null,"Coincident"]
[null,"NSP to enter name","CONNECTION POINT RATING","MVA","Non-coincident"]
[null,null,null,null,"Coincident"]
[null,null,"WINTER/SUMMER PEAKING",null,"Non-coincident"]
[null,null,null,null,"Coincident"]
[null,null,"ADJUSTMENTS - EMBEDDED GENERATION","MW","Non-coincident"]
[null,null,null,null,"Coincident"]
[null,null,"WEATHER CORRECTED MD 10% POE","MW","Non-coincident"]
[null,null,null,null,"Coincident"]
[null,null,"WEATHER CORRECTED MD 10% POE","MVA","Non-coincident"]
[null,null,null,null,"Coincident"]
[null,null,"WEATHER CORRECTED MD 50% POE","MW","Non-coincident"]
[null,null,null,null,"Coincident"]
[null,null,"WEATHER CORRECTED MD 50% POE","MVA","Non-coincident"]
[null,null,null,null,"Coincident"]
[null,"NSP to enter name","CONNECTION POINT RATING","MVA","Non-coincident"]
[null,null,null,null,"Coincident"]
[null,null,"WINTER/SUMMER PEAKING",null,"Non-coincident"]
[null,null,null,null,"Coincident"]
[null,null,"ADJUSTMENTS - EMBEDDED GENERATION","MW","Non-coincident"]
[null,null,null,null,"Coincident"]
[null,null,"WEATHER CORRECTED MD 10% POE","MW","Non-coincident"]
[null,null,null,null,"Coincident"]
[null,null,"WEATHER CORRECTED MD 10% POE","MVA","Non-coincident"]
[null,null,null,null,"Coincident"]
[null,null,"WEATHER CORRECTED MD 50% POE","MW","Non-coincident"]
[null,null,null,null,"Coincident"]
[null,null,"WEATHER CORRECTED MD 50% POE","MVA","Non-coincident"]
[null,null,null,null,"Coincident"]
[null,"NSP to enter name","CONNECTION POINT RATING","MVA","Non-coincident"]
[null,null,null,null,"Coincident"]
[null,null,"WINTER/SUMMER PEAKING",null,"Non-coincident"]
[null,null,null,null,"Coincident"]
[null,null,"ADJUSTMENTS - EMBEDDED GENERATION","MW","Non-coincident"]
[null,null,null,null,"Coincident"]
[null,null,"WEATHER CORRECTED MD 10% POE","MW","Non-coincident"]
[null,null,null,null,"Coincident"]
[null,null,"WEATHER CORRECTED MD 10% POE","MVA","Non-coincident"]
[null,null,null,null,"Coincident"]
[null,null,"WEATHER CORRECTED MD 50% POE","MW","Non-coincident"]
[null,null,null,null,"Coincident"]
[null,null,"WEATHER CORRECTED MD 50% POE","MVA","Non-coincident"]
[null,null,null,null,"Coincident"]
[null,"NSP to enter name","CONNECTION POINT RATING","MVA","Non-coincident"]
[null,null,null,null,"Coincident"]
[null,null,"WINTER/SUMMER PEAKING",null,"Non-coincident"]
[null,null,null,null,"Coincident"]
[null,null,"ADJUSTMENTS - EMBEDDED GENERATION","MW","Non-coincident"]
[null,null,null,null,"Coincident"]
[null,null,"WEATHER CORRECTED MD 10% POE","MW","Non-coincident"]
[null,null,null,null,"Coincident"]
[null,null,"WEATHER CORRECTED MD 10% POE","MVA","Non-coincident"]
[null,null,null,null,"Coincident"]
[null,null,"WEATHER CORRECTED MD 50% POE","MW","Non-coincident"]
[null,null,null,null,"Coincident"]
[null,null,"WEATHER CORRECTED MD 50% POE","MVA","Non-coincident"]
[null,null,null,null,"Coincident"]
[null,"NSP to enter name","CONNECTION POINT RATING","MVA","Non-coincident"]
[null,null,null,null,"Coincident"]
[null,null,"WINTER/SUMMER PEAKING",null,"Non-coincident"]
[null,null,null,null,"Coincident"]
[null,null,"ADJUSTMENTS - EMBEDDED GENERATION","MW","Non-coincident"]
[null,null,null,null,"Coincident"]
[null,null,"WEATHER CORRECTED MD 10% POE","MW","Non-coincident"]
[null,null,null,null,"Coincident"]
[null,null,"WEATHER CORRECTED MD 10% POE","MVA","Non-coincident"]
[null,null,null,null,"Coincident"]
[null,null,"WEATHER CORRECTED MD 50% POE","MW","Non-coincident"]
[null,null,null,null,"Coincident"]
[null,null,"WEATHER CORRECTED MD 50% POE","MVA","Non-coincident"]
[null,null,null,null,"Coincident"]
[null,"NSP to enter name","CONNECTION POINT RATING","MVA","Non-coincident"]
[null,null,null,null,"Coincident"]
[null,null,"WINTER/SUMMER PEAKING",null,"Non-coincident"]
[null,null,null,null,"Coincident"]
[null,null,"ADJUSTMENTS - EMBEDDED GENERATION","MW","Non-coincident"]
[null,null,null,null,"Coincident"]
[null,null,"WEATHER CORRECTED MD 10% POE","MW","Non-coincident"]
[null,null,null,null,"Coincident"]
[null,null,"WEATHER CORRECTED MD 10% POE","MVA","Non-coincident"]
[null,null,null,null,"Coincident"]
[null,null,"WEATHER CORRECTED MD 50% POE","MW","Non-coincident"]
[null,null,null,null,"Coincident"]
[null,null,"WEATHER CORRECTED MD 50% POE","MVA","Non-coincident"]
[null,null,null,null,"Coincident"]

{"sheet":"7.1  Policies and Procedures","index":22,"n_rows":61,"n_cols":5,"rows_kept":61,"cut":false,"hidden":false,"merged":[[11,1,12,1],[6,1,8,4],[21,1,21,4],[26,1,26,4],[36,1,36,4],[32,1,32,4],[55,1,55,4],[57,1,57,4],[59,1,59,4],[17,1,17,4],[13,1,13,4],[29,1,29,4],[27,1,27,4],[42,1,42,4],[47,1,47,4],[49,1,49,4],[51,1,51,4],[53,1,53,4]]}
[null,{"$f":"(LOOKUP(dms_Model,dms_Model_List,dms_Worksheet_List))","v":"REGULATORY REPORTING STATEMENT"}]
[null,{"$f":"INDEX(dms_TradingNameFull_List,MATCH(dms_TradingName,dms_TradingName_List))","v":"ElectraNet"}]
[null,{"$f":"IF(SUM(dms_SingleYear_Model)>0,CRY,CONCATENATE(FRCP_y1,\" to \",dms_MultiYear_FinalYear_Result))","v":"2018-19 to 2022-23"}]
[null,"7.1  PLANS, POLICIES, PROCEDURES AND STRATEGIES"]
[]
[null,"Instructions"]
[null,{"$f":"CONCATENATE(dms_TradingName, \" must list and provide a brief description of key internal plans, \"&\"policies, procedures or strategies that are used by it to plan and conduct its day to day operations and that have been relied upon in the development of its regulatory proposal. \"&dms_TradingName,\" must identify any internal plans, policies, procedures and strategies that have changed in the current regulatory control period \"&\"or that are expected to change before the next regulatory control period where the change has been identified as a step change.\")","v":"ElectraNet must list and provide a brief description of key internal plans, policies, procedures or strategies that are used by it to plan and conduct its day to day operations and that have been relied upon in the development of its regulatory proposal. ElectraNet must identify any internal plans, policies, procedures and strategies that have changed in the current regulatory control period or that are expected to change before the next regulatory control period where the change has been identified as a step change."}]
[]
[]
[]
[null,"7.1.1 - PLANS, POLICIES, PROCEDURES AND STRATEGIES"]
[null,null,"Brief description","Relevance to regulatory proposal","Expenditure impact"]
[null,null,"Description of the plan, policy, procedure or strategy.","Identify the element of the proposal/supporting documents that the policy, plan, procedure or strategy is relevant to e.g. replacement capex, capacity utilisation thresholds, opex ","Is this policy, plan or procedure identified in the response to section 4 'Step Changes' of the notice (yes or no)?"]
[null,"Corporate"]
[null,"Health Safety and Sustainability Policy","This policy provides for the establishment of practices and processes through the implementation of a WHS Safety Manual that aims to protect and promote the safety and well-being of workers and others. ","Forecast Capital and Operating Expenditure","No"]
[null,"Environmental Management Policy","This policy sets out ElectraNet's commitment to an Environmental Management System focusing on improved environmental performance in accordance with relevant legislation, standards and codes.","Forecast Capital and Operating Expenditure","No"]
[null,"Bushfire Risk Management Guideline","This document establishes ElectraNet's approach for bushfire risk management in planing and operating the network","Forecast Capital and Operating Expenditure","No"]
[null,"Governance framework"]
[null,"Corporate Governance Policy","This policy provides the foundation for  corporate governance within ElectraNet, demonstrating ElectraNet's commitment to governance practices that ensure accountability, adequate controls and reporting.","Forecast Capital and Operating Expenditure","No"]
[null,"Risk Management Policy","This policy sets out a structured approach to risk management acknowledging that the effective management of risk is a key prerequisite to the achievement of ElectraNet's strategic and operational objectives.","Forecast Capital and Operating Expenditure","No"]
[null,"Insurance Policy","This policy provides a framework for the cost effective transfer of risk to insurers.","Forecast Capital and Operating Expenditure","No"]
[null,"Accounting policies, procedures and methodologies (including a capitalisation policy, depreciation policy and an approved expenditure allocation methodology)"]
[null,"Cost Allocation Methodology","This AER approved policy details the principles for attributing costs to, and allocating costs between or within, the categories of transmission services under the Rules.","Forecast Capital Expenditure","No"]
[null,"Capitalisation Policy ","This policy establishes a framework for the capitalisation of property, plant, equipment and intangible assets. ","Forecast Capital Expenditure","No"]
[null,"Asset Disposal Policy","This policy establishes a framework for the disposal of assets within ElectraNet for accounting, taxation and regulatory purposes.","Regulatory Asset Base","No"]
[null,"Depreciation and Amortisation of Asset Policy","This policy is to establish a framework for the depreciation and amortisation of assets at ElectraNet for accounting, regulatory and taxation purposes.","Depreciation, Regulatory Asset Base ","No"]
[null,"Asset management plan or equivalent documentation"]
[null,"Asset Management Policies"]
[null,"Asset Management Policy","This policy sets out ElectraNet’s commitments and expectations for decisions, activities and behaviours concerning asset management.","Forecast Capital and Operating Expenditure","No"]
[null,"Asset Management Strategies"]
[null,"Strategic Asset Management Plan (SAMP)","A SAMP is defined by ISO 55000 as documented “information that specifies how organisational objectives are to be converted into asset management objectives, the approach for developing asset management plans, and the role of the asset management system in supporting achievement of the asset management objectives”It is a high level strategic plan that documents the relationship between the organisational objectives and the asset management objectives, defines “the framework required to achieve the asset management objectives” and “should be used to develop the asset management plan(s).”","Forecast Capital and Operating Expenditure","No"]
[null,"Asset Class Strategies (ACS)\n- Instrument Transformers\n- Line conductors\n- Disconnectors and Earth Switches\n- Secondary Systems - Protection\n- Line Insulators\n- Circuit Breakers\n- DC Supplies","The purpose of each ACS is to define the lifecyle asset management of a particular class of asset, provide strategic guidance for the development and implemention of each stage of the asset lifecycle and to explain the medium and long term strategy for development of that asset class.","Forecast Capital and Operating Expenditure","No"]
[null,"Asset Management Plans"]
[null,"Operational Technology Systems Development Plan ","This document outlines the plan to transform ElectraNet’s Operational Technology Systems to ensure it can meet future demands and help reduce the lifecycle costs of ElectraNet’s assets. It provides the context for the management of the Operational Technology Systems.","Forecast Capital and Operating Expenditure","No"]
[null,"Operational Data Network Development Plan ","This plan provides the basis for the current and ongoing development of the operational data network, infrastructure and systems, as well as the underlying telecommunications that link the substation to the main and backup control rooms and data centres.","Forecast Capital and Operating Expenditure","No"]
[null,"Asset Data and Information Management Plan ","This plan provides a framework for improving asset data and information management to support driving best possible asset management and investment decisions. ","Forecast Capital Expenditure, Forecast Operating Expenditure","No"]
[null,"Capital expenditure policies and procedures (including capex approval policies and procedures and replacement policy) "]
[null,"Expenditure Forecasting Methodolgy","This document sets out ElectraNet's (capital and operating) expenditure forecasting methodology","Forecast Capital and Operating Expenditure","No"]
[null,"Project Management System","This system ensures appropriate controls are in place and in use across ElectraNet to achieve optimum outcomes in the delivery of capex projects.","Forecast Capital Expenditure ","No"]
[null,"Line Design Manual","This document sets out the design standards for ElectraNet's overhead transmission line structures.","Forecast Capital Expenditure","No"]
[null,"Substation Design Manual","This document sets out the design requirements for substations. ","Forecast Capital Expenditure","No"]
[null,"Transmission Asset Life Cycle (TALC)","This document sets out a framework for understanding substation and transmission line asset lifecycle indicators.  It defines processes for asset condition and provides information to asset cost / risk optimisation decision support tools and informs asset replacement decision making.","Replacement Forecast Capital Expenditure ","No"]
[null,"Internal standards for network planning, design, maintenance and operation"]
[null,"Transmission Annual Planning Report 2016 \n(T-APR)","This report provides information to interested parties on network developments and potential opportunities for provision of demand management solutions. It is important in providing context for future expenditure. In addition the T-APR is an important consultation and network planning document, informing stakeholders of future network developments and proposed augmentations. ","Forecast Capital and Operating Expenditure","No"]
[null,"RIT-T Handbook","This Handbook documents the assessment approaches and methods used in applying the RIT-T in accordance with the requirements of the Rules and AER RIT-T Guideline.","Forecast Capital and Operating Expenditure","No"]
[null,"Guideline for Undertaking Cost-Benefit Analyses","This guideline sets out the economic evaluation framework used to assess and identify preferred options to address identified needs.","Forecast Capital and Operating Expenditure","No"]
[null,"Risk cost evaluation framework","This framework sets out a systematic process for undertaking detailed risk assessments in our asset management decision making, as a key input to the economic analysis of available options to address risk.","Forecast Capital and Operating Expenditure","No"]
[null,"Procurement and contracting out policies"]
[null,"Procurement Business Guideline","These guidelines establish high level directions and principles in relation to the procurement of services and materials. It defines the way that procurement activities are undertaken in ElectraNet in relataion to externally sourced services and materials.","Forecast Capital and Operating Expenditure","No"]
[null,"Information technology policies or strategies"]
[null,"IT Strategy 2016-17 to 2022-23","Describes ElectraNet's proposed ICT strategy to 2023 and the overal IT Systems.","Forecast Capital and Operating Expenditure","No"]
[null,"Demand management policies or strategies"]
[null,"Non-Network Solutions Policy ","This policy describes the principles and approach to the identification and assessment of non-network solutions including demand management options. ","Forecast Capital Expenditure, Contingent Projects ","No"]
[null,"Self insurance guidelines or policy"]
[null,"Self Insurance Board Resolution","This resolution documents the specific risks that ElectraNet has resolved to manage through its self insurance allowance.","Forecast Operating Expenditure","No"]
[null,"Land and easement acquisition polices"]
[null,"Strategic Land Acquisition Policy","The purpose of the policy is to develop a practical framework for establishing ElectraNet’s land acquisition requirements in a timely manner in accordance with its legislative obligations. The framework will enable ElectraNet to forecast, plan for and secure land and easements in order to meet its service delivery obligations at least long-run cost.","Forecast Capital Expenditure","No"]
[null,"Asset security plans and policies"]
[null,"Information Security Policy","The purpose of this document is to provide a high-level policy to ensure a secure ICT environment at ElectraNet, describing how IT security is managed.","Forecast Operating Expenditure","No"]
[null,"Disaster recovery policy"]
[null,"Business Continuity Plan","This plan provides the mechanisms to ensure ElectraNet has the capability, flexibility and resilience to deal with unplanned and extended disruptions to normal business operations at key business locations, specifically occupied sites.","Operating and Capital Expenditure","No"]

{"sheet":"7.2 Contingent projects","index":23,"n_rows":16,"n_cols":6,"rows_kept":16,"cut":false,"hidden":false,"merged":[[3,1,3,5],[7,1,7,3]]}
[null,{"$f":"(LOOKUP(dms_Model,dms_Model_List,dms_Worksheet_List))","v":"REGULATORY REPORTING STATEMENT"}]
[null,{"$f":"INDEX(dms_TradingNameFull_List,MATCH(dms_TradingName,dms_TradingName_List))","v":"ElectraNet"}]
[null,{"$f":"IF(SUM(dms_SingleYear_Model)>0,CRY,CONCATENATE(FRCP_y1,\" to \",dms_MultiYear_FinalYear_Result))","v":"2018-19 to 2022-23"}]
[null,"7.2 CONTINGENT PROJECTS"]
[]
[]
[null,"Instructions"]
[null,{"$f":"CONCATENATE(dms_TradingName,\" is required to populate all input cells (yellow) in table 7.2.1 presented below. Additional rows may be added by \",dms_TradingName,\"  if required.\"\n\n\n\n)","v":"ElectraNet is required to populate all input cells (yellow) in table 7.2.1 presented below. Additional rows may be added by ElectraNet  if required."}]
[]
[null,"7.2.1 - PROPOSED CONTINGENT PROJECTS FOR THE FORTHCOMING REGULATORY CONTROL PERIOD"]
[null,"Proposed contingent project name","Proposed contingent capital expenditure \n ($0's, nominal)","Proposed trigger events",{"$f":"CONCATENATE(\"Proposed MAR for \", FRCP_y1,\" ($0's, nominal)\")","v":"Proposed MAR for 2018-19 ($0's, nominal)"},{"$f":"CONCATENATE(\"5 per cent \nof the \", FRCP_y1,\" \n($0's, nominal) MAR\")","v":"5 per cent \nof the 2018-19 \n($0's, nominal) MAR"}]
[null,"Eyre Peninsula Reinforcement ",200000000," Successful completion of RIT-T,NER 5.16.6 determination (if applicable) by the AER,ElectraNet Board Commitment",312313393.19986862,{"$f":"+E12*0.05","v":15615669.659993432}]
[null,"South Australian Energy Transformation ","200,000,000-500,000,000","Successful completion of RIT-T (demonstrating positive net market benefits; and/or addressing a reliability corrective action), NER 5.16.6 determination (if applicable) by the AER, ElectraNet Board Commitment",{"$f":"+$E$12","v":312313393.19986862},{"$f":"+E13*0.05","v":15615669.659993432}]
[null,"Upper North-East Line Reinforcement",60000000,"Customer commitment for additional load to connect to the transmission network causing the Davenport to Leigh Creek 132kV line to exceed its thermal limit of 10 MVA, Sucessful completion of RIT-T, NER 5.16.6 determination by the AERElectraNet Board Commitment",{"$f":"+$E$12","v":312313393.19986862},15615669.659993432]
[null,"Upper North-West Line Reinforcement",110000000,"Customer commitment for additional load to connect to the transmission network causing the Davenport to Pimba 132kV line to exceed its thermal limit of 76 MVA, successful completion of RIT-T, NER 5.16.6 determination by the AER, ElectraNet Board Commitment ",312313393.19986862,15615669.659993432]
[null,"Main Grid System Strength Support","60,000,000-80,000,000","Confirmation by AEMO of the existence of an Network Support and Control Ancillary Services (NSCAS) gap relating to system strength, or other requirement for ElectraNet to address a system strength requirement, in the South Australian region, successful completion of RIT-T, NER 5.16.6 determination (if applicable) by the AER, ElectraNet Board Commitment ",312313393.19986862,15615669.659993432]

{"sheet":"7.3 Obligations","index":24,"n_rows":41,"n_cols":5,"rows_kept":41,"cut":false,"hidden":false,"merged":[[3,1,3,4],[12,1,13,1],[8,1,8,2],[5,1,5,2]]}
[null,{"$f":"(LOOKUP(dms_Model,dms_Model_List,dms_Worksheet_List))","v":"REGULATORY REPORTING STATEMENT"}]
[null,{"$f":"INDEX(dms_TradingNameFull_List,MATCH(dms_TradingName,dms_TradingName_List))","v":"ElectraNet"}]
[null,{"$f":"IF(SUM(dms_SingleYear_Model)>0,CRY,CONCATENATE(FRCP_y1,\" to \",dms_MultiYear_FinalYear_Result))","v":"2018-19 to 2022-23"}]
[null,"7.3  OBLIGATIONS, REQUIREMENTS & STANDARDS"]
[]
[null,"There is ONE table on this worksheet. It has been sub-grouped for ease of navigation. See the Instructions sheet on how to group or ungroup data."]
[]
[null,"Instructions"]
[null,{"$f":"CONCATENATE(\"Outline those obligations and requirements that \",dms_TradingName, \" identifies as having a material impact on expenditure requirements.\")","v":"Outline those obligations and requirements that ElectraNet identifies as having a material impact on expenditure requirements."}]
[]
[]
[null,"7.3.1 - OBLIGATIONS OR REQUIREMENTS"]
[null,null,"Brief description","Relevance to regulatory proposal","Expenditure impact"]
[null,null,"Description of relevant obligations or requirements within the instrument (e.g. safety obligations, reliability targets) ","Identify what element of the proposal/supporting documents the obligation or requirement is relevant to e.g. replacement capex, capacity utilisation thresholds, opex ","Is the obligation or requirement identified in the response to section 4 'Step Changes' of the notice (yes or no)?"]
[null,"Legislation"]
[null,"National Electricity (South Australia) Act 1996 (SA) and Regulations and National Electricity Law (NEL) ","Electricity transmission entities have a large number of obligations under the NEL. The most significant obligations are to: register with AEMO as a \"Registered Participant\"; comply with the transmission determination that applies to the electricity transmission network services provided; provide the AER with necessary information or prepare, maintain or keep the information as is requested by the AER in either a \"relevant notice\" or a \"regulatory information instrument\"; provide information to the AER for the purpose of the preparation of ElectraNet's financial and operational performance ; comply with the guidelines established by AEMO in relation to the shedding and restoration of loads and AEMO directions in order to ensure the safety and security of the transmission network and broader national electricity system ; comply with a wide range of obligations relating to the determination and resolution of access disputes, comply with access determinations; and comply with the general obligation not to prevent or hinder the access of another person to a regulated network service. In addition the Act and Regulations cover such system operations functions that ElectraNet exercises.","Regulatory Proposal and Forecast Operating Expenditure","No"]
[null,"Electricity Act 1996 (SA)","This Act sets out a requirement for ElectraNet to comply with the terms of its transmission licence, requires vegetation clearance to be undertaken, and sets out obligations in relation to the access of land.","Forecast Capital and Operating Expenditure","No"]
[null,"Electricity (General) Regulations 2012 (SA)","These Regulations set out a range of obligations for electricity entities covering safety, design parameters, inspection and maintenance requirements for electricity transmission infrastructure.","Forecast Capital and Operating Expenditure","No"]
[null,"Electricity (Prinicples of Vegetation Clearance ) Regulations 2010 ","These Regulations define clearance obligations and provide further detail on the principles and processes which ElectraNet must comply with in relation to vegetation impacting its transmission lines.","Forecast Operating Expenditure","No"]
[null,"Workplace Health and Safety Act 2012 (SA)","This Act sets out obligations for ElectraNet to maintain appropriate health and safety standards at its place of business to ensure the safety of workers and other persons and sets out safety related duties that must be complied with. \n","Forecast Capital and Operating Expenditure","No"]
[null,"Workplace Health and Safety Regulations 2012 (SA) ","These Regulations set out detailed requirements in relation to the identification and management of hazards and risks to safety, high risk construction work and undertaking construction projects relevant to ElectraNet's business.","Forecast Capital and Operating Expenditure","No"]
[null,"Return to Work Act 2014 and associated regulations","This Act and Regulations set out obligations for employers in relation to worker recovery and return to work and as a self-insured employer is relevant to ElectraNet's obligation to pay self-insured fees.\n","Forecast Operating Expenditure","No"]
[null,"Native Vegetation Act 1991 (SA) and associated regulations","This Act sets out requirements for the clearing, conservation and management of native vegetation relevant  to constructing and maintaining ElectraNet's transmission network.","Forecast Capital and Operating Expenditure","No"]
[null,"Development Act 1993 (SA) and associated regulations","This Act sets out the framework for obtaining development approval for ElectraNet's electricity transmission infrastructure and may contain conditions of approval that impact on ongoing operations. ","Forecast Capital and Operating Expenditure","No"]
[null,"Environment Protection Act 1993 (SA) and associated regulations","This Act sets out the environmental requirements that ElectraNet must take into account and comply with when constructing, operating and maintaining its network infrastructure or in undertaking related operations.\n","Forecast Capital and Operating Expenditure","No"]
[null,"Land Tax Act 1936 (SA)","This Act requires the payment of a tax based on site values of land owned by ElectraNet.","Forecast Operating Expenditure","No"]
[null,"Environmental Protection and Biodiversity Conservation Act 1999 (Cth) and associated regulations","This Act aims to protect the environment, particularly related to environmentally sensitive species and habitats and matters of national environmental significance and is relevant when undertaking development activities or in relation to ongoing site management. ","Forecast Capital and Operating Expenditure","No"]
[null,"Fair Work Act and Regulations 2009 (Cth)","This Act and Regulations are focused on providing a balanced framework for cooperative and productive workplace relations that promotes national economic prosperity and social inclusion for all Australians. ","Escalation Rates & Project Cost Escalation\nForecast Capital and Operating Expenditure","No"]
[null,"Licences"]
[null,"Electricity Transmission Licence","Licence issued by the Essential Services Commission enabling ElectraNet to operate the transmission network in South Australia with conditions covering compliance with codes, guidelines and reporting obligations.","Forecast Operating Expenditure","No"]
[null,"System Control Licence","Licence issued by the Essential Services Commission to enable ElectraNet to exercise system control over the transmission network.","Forecast Operating Expenditure","No"]
[null,"Rules"]
[null,"National Electricity Rules Version 89","The National Electricity Rules govern the registration of ElectraNet as a network services provider, set out the process and requirements for lodgement and the content of ElectraNet's revenue proposal, the process for making a revenue determination, technical and operational requirements that ElectraNet must meet in relation to the transmission system, network augmentation processes, connection processes, obligations to co-operate with AEMO in relation to power system security and comply with the directions of AEMO to ensure the safety and security of the national electricity market, comply with confidentiality obligations and manage NER disputes in accordance with the framework set out in the Rules.","Regulatory Proposal and Forecast Capital and Operating Expenditure","No"]
[null,"Orders"]
[null,"Codes"]
[null,"Electricity Transmission Code TC/09 (SA)","This Code made by the Essential Services Commission of South Australia sets out quality of supply, reliability standards and design requirements. These obligations impacting on the planning, development and operation of the transmision network.","Forecast Capital and Operating Expenditure","No"]
[null,"Applicable Codes made under the Work Health and Safety Act 2012 (SA)","Compliance with these Codes relating to work, health and safety are relevant to ElectraNet's buiness and operations.","Forecast Capital and Operating Expenditure","No"]
[null,"Guidelines"]
[null,"AER's Better Regulation Guidelines and Schemes","Guidelines relate to confidentiality, expenditure forecast assessment, cost allocation, capital expenditure incentives, rate of return and consumer engagement. Schemes include STPIS and EBSS.","Regulatory Proposal","No"]
[null,"Default agreements "]
[null,"Other"]

{"sheet":"7.4 Shared Assets","index":25,"n_rows":26,"n_cols":19,"rows_kept":26,"cut":false,"hidden":false,"merged":[[6,1,7,1],[6,2,7,2],[25,2,25,8],[6,11,6,18],[6,3,6,10],[26,2,26,8],[27,2,27,8],[28,2,28,8],[29,2,29,8],[30,2,30,8],[31,2,31,8],[32,2,32,8],[33,2,33,8],[34,2,34,8],[35,2,35,8],[36,2,36,8],[37,2,37,8],[38,2,38,8],[39,2,39,8],[40,2,40,8]]}
[null,{"$f":"(LOOKUP(dms_Model,dms_Model_List,dms_Worksheet_List))","v":"REGULATORY REPORTING STATEMENT"}]
[null,{"$f":"INDEX(dms_TradingNameFull_List,MATCH(dms_TradingName,dms_TradingName_List))","v":"ElectraNet"}]
[null,{"$f":"IF(SUM(dms_SingleYear_Model)>0,CRY,CONCATENATE(FRCP_y1,\" to \",dms_MultiYear_FinalYear_Result))","v":"2018-19 to 2022-23"}]
[null,"7.4 SHARED ASSETS"]
[]
[null,"7.4.1 - TOTAL UNREGULATED REVENUE EARNED WITH SHARED ASSETS "]
[null,"Name of shared asset unregulated service","Description of shared assets used to provide the service","Shared asset unregulated revenue  ($0's, nominal)",null,null,null,null,null,null,null,{"$f":"CONCATENATE(\"Shared asset unregulated revenue  ($0's, real \", dms_DollarReal,\")\")","v":"Shared asset unregulated revenue  ($0's, real June 2018)"}]
[null,null,null,{"$f":"PRCP_y1","v":"2008-09"},{"$f":"PRCP_y2","v":"2009-10"},{"$f":"PRCP_y3","v":"2010-11"},{"$f":"PRCP_y4","v":"2011-12"},{"$f":"PRCP_y5","v":"2012-13"},{"$f":"CRCP_y1","v":"2013-14"},{"$f":"CRCP_y2","v":"2014-15"},{"$f":"CRCP_y3","v":"2015-16"},{"$f":"CRCP_y4","v":"2016-17"},{"$f":"CRCP_y5","v":"2017-18"},{"$f":"FRCP_y1","v":"2018-19"},{"$f":"FRCP_y2","v":"2019-20"},{"$f":"FRCP_y3","v":"2020-21"},{"$f":"FRCP_y4","v":"2021-22"},{"$f":"FRCP_y5","v":"2022-23"},{"$f":"CONCATENATE(\"Total \n\",FRCP_y1, \" to \", dms_MultiYear_FinalYear_Result)","v":"Total \n2018-19 to 2022-23"}]
[null,"Telecommunications Revenue","Transmission and telecommunications towers and telecommunication bandwidth",462231,303466,267065,410970,479328,799983,555494,594775,587601.10530000005,587601.10530000005,587601.10530000005,587601.10530000005,587601.10530000005,587601.10530000005,587601.10530000005,{"$f":"SUM(N9:R9)","v":2938005.5265000002}]
[null,null,null,null,null,null,null,null,null,null,null,null,null,null,null,null,null,null,{"$f":"SUM(N10:R10)","v":0}]
[null,null,null,null,null,null,null,null,null,null,null,null,null,null,null,null,null,null,0]
[null,null,null,null,null,null,null,null,null,null,null,null,null,null,null,null,null,null,0]
[null,null,null,null,null,null,null,null,null,null,null,null,null,null,null,null,null,null,0]
[null,null,null,null,null,null,null,null,null,null,null,null,null,null,null,null,null,null,0]
[null,null,null,null,null,null,null,null,null,null,null,null,null,null,null,null,null,null,0]
[null,null,null,null,null,null,null,null,null,null,null,null,null,null,null,null,null,null,0]
[null,null,null,null,null,null,null,null,null,null,null,null,null,null,null,null,null,null,0]
[null,null,null,null,null,null,null,null,null,null,null,null,null,null,null,null,null,null,0]
[null,null,null,null,null,null,null,null,null,null,null,null,null,null,null,null,null,null,0]
[null,null,null,null,null,null,null,null,null,null,null,null,null,null,null,null,null,null,{"$f":"SUM(N20:R20)","v":0}]
[null,null,null,null,null,null,null,null,null,null,null,null,null,null,null,null,null,null,{"$f":"SUM(N21:R21)","v":0}]
[null,null,null,null,null,null,null,null,null,null,null,null,null,null,null,null,null,null,{"$f":"SUM(N22:R22)","v":0}]
[null,null,null,null,null,null,null,null,null,null,null,null,null,null,null,null,null,null,{"$f":"SUM(N23:R23)","v":0}]
[]
[null,"7.4.2 - SHARED ASSET UNREGULATED SERVICES - APPORTIONMENT METHODOLOGY"]
[null,"Name of shared asset unregulated service for which revenues were apportioned","Apportionment methodology"]

{"sheet":"7.5 EBSS","index":26,"n_rows":92,"n_cols":27,"rows_kept":92,"cut":false,"hidden":false,"merged":[[8,1,8,12],[40,2,40,10],[40,12,40,20],[41,2,41,5],[41,6,41,10],[41,12,41,15],[41,16,41,20],[22,2,22,5],[22,6,22,10],[22,12,22,20],[23,2,23,5],[23,6,23,10],[23,12,23,15],[23,16,23,20],[51,22,55,23],[66,12,66,13],[76,2,76,6],[77,2,77,6],[57,12,57,20],[61,16,61,20],[67,12,67,13],[68,12,68,13],[62,14,62,26],[64,12,64,13],[65,12,65,13],[61,21,61,26]]}
[null,{"$f":"(LOOKUP(dms_Model,dms_Model_List,dms_Worksheet_List))","v":"REGULATORY REPORTING STATEMENT"}]
[null,{"$f":"INDEX(dms_TradingNameFull_List,MATCH(dms_TradingName,dms_TradingName_List))","v":"ElectraNet"}]
[null,{"$f":"IF(SUM(dms_SingleYear_Model)>0,CRY,CONCATENATE(FRCP_y1,\" to \",dms_MultiYear_FinalYear_Result))","v":"2018-19 to 2022-23"}]
[null,"7.5 EBSS"]
[]
[]
[null,"Instructions "]
[null,{"$f":"CONCATENATE(dms_TradingName, \" is required to populate all input cells (yellow) in table 7.5.2 presented below.\")","v":"ElectraNet is required to populate all input cells (yellow) in table 7.5.2 presented below."}]
[null,"\nEfficiency gains are calculated using the formulae below.  Adjusted target and actual amounts are used to calculate the carry-over amounts. \n\nWe will calculate the efficiency gain in 2012–13 (year 6) as follows:\nE6 = (F6 – A6) – (F5 – A5) + (F3 – A3)\nwhere F6 is the forecast opex we approved for year 6 (2012-13), and A6 is the actual opex incurred for year 6, and so on. The formula references year 3 (2010-11) because it is the base year used to forecast opex. Actual opex in 2017-18 should be set so that any incremental efficiency gains made after the base year sum to zero."]
[null,"\n"]
[]
[null,"CPI "]
[null,null,"2007-08",{"$f":"PRCP_y1","v":"2008-09"},{"$f":"PRCP_y2","v":"2009-10"},{"$f":"PRCP_y3","v":"2010-11"},{"$f":"PRCP_y4","v":"2011-12"},{"$f":"PRCP_y5","v":"2012-13"},{"$f":"CRCP_y1","v":"2013-14"},{"$f":"CRCP_y2","v":"2014-15"},{"$f":"CRCP_y3","v":"2015-16"},{"$f":"CRCP_y4","v":"2016-17"},{"$f":"CRCP_y5","v":"2017-18"}]
[null,"ABS CPI index Jun qtr (old base)",164.6,167,172.1,178.3,180.4]
[null,"ABS CPI index Jun qtr (rebased index)",null,null,null,99.2,100.4,102.8,105.9,107.5,108.6,{"$f":"ROUND(K15*(1+L$16),1)","v":110.7},{"$f":"ROUND(L15*(1+M$16),1)","v":112.9}]
[null,"Inflation rate (per cent) ",null,{"$f":"D14/C14-1","v":1.4580801944106936E-2},3.0538922155688653E-2,3.6025566531086683E-2,{"$f":"G14/F14-1","v":1.1777902411665764E-2},{"$f":"H15/G15-1","v":2.3904382470119501E-2},3.0155642023346418E-2,1.5108593012275628E-2,1.0232558139534831E-2,1.9699999999999999E-2,1.9699999999999999E-2]
[null,"Reconstructed cumulative index (2015=1)",{"$f":"D17/(1+D16)","v":0.81114074615736542},0.82296782872588103,0.84810037918397685,{"$f":"F15/$M$15","v":0.87865367581930909},{"$f":"G15/$M$15","v":0.88928255093002662},{"$f":"H15/$M$15","v":0.91054030115146145},{"$f":"I15/$M$15","v":0.93799822852081494},0.95217006200177146,0.9619131975199291,0.98051372896368461,1]
[]
[]
[]
[null,"7.5.1 - The carryover amounts that arise from applying the EBSS during the current regulatory control period"]
[null,"7.5.1.1 - Opex allowance applicable to EBSS (EBSS target)"]
[null,null,"$m, Jun 2013",null,null,null,"$m,  Jun 2013",null,null,null,null,null,{"$f":"CONCATENATE(\"$m, real \",dms_DollarReal)","v":"$m, real June 2018"}]
[null,null,"Previous period",null,null,null,"Current regulatory control period",null,null,null,null,null,"Previous period",null,null,null,"Current regulatory control period"]
[null,null,{"$f":"PRCP_y2","v":"2009-10"},{"$f":"PRCP_y3","v":"2010-11"},{"$f":"PRCP_y4","v":"2011-12"},{"$f":"PRCP_y5","v":"2012-13"},{"$f":"CRCP_y1","v":"2013-14"},{"$f":"CRCP_y2","v":"2014-15"},{"$f":"CRCP_y3","v":"2015-16"},{"$f":"CRCP_y4","v":"2016-17"},{"$f":"CRCP_y5","v":"2017-18"},null,{"$f":"PRCP_y2","v":"2009-10"},{"$f":"PRCP_y3","v":"2010-11"},{"$f":"PRCP_y4","v":"2011-12"},{"$f":"PRCP_y5","v":"2012-13"},{"$f":"CRCP_y1","v":"2013-14"},{"$f":"CRCP_y2","v":"2014-15"},{"$f":"CRCP_y3","v":"2015-16"},{"$f":"CRCP_y4","v":"2016-17"},{"$f":"CRCP_y5","v":"2017-18"}]
[null,"Total opex allowance",null,67.865217703036848,71.093345519912432,73.793489213703651,79.963800000000006,82.999799999999993,84.500699999999995,87.941100000000006,88.593699999999998,null,{"$f":"+C26/$H$17","v":0},{"$f":"+D26/$H$17","v":74.532909325611485},{"$f":"+E26/$H$17","v":78.078197560292935},81.043627745400215,{"$f":"+G26/$H$17","v":87.820165564202341},{"$f":"+H26/$H$17","v":91.154449610894943},92.802811575875481,96.581227529182883,97.297944844357971]
[null,"Approved excludable costs - allowance "]
[null,"Equity raising costs",null,0,0,0,0,0,0,0,0,null,{"$f":"+C28/$H$17","v":0},{"$f":"+D28/$H$17","v":0},{"$f":"+E28/$H$17","v":0},0,{"$f":"+G28/$H$17","v":0},{"$f":"+H28/$H$17","v":0},{"$f":"+I28/$H$17","v":0},{"$f":"+J28/$H$17","v":0},{"$f":"+K28/$H$17","v":0}]
[null,"Debt raising costs",null,-0.83760044961373681,-0.93834411036007193,-1.0055300310719171,-1.1169,-1.1898,-1.2208000000000001,-1.2547999999999999,-1.2693000000000001,null,{"$f":"+C29/$H$17","v":0},-0.91989387900185693,{"$f":"+E29/$H$17","v":-1.0305355064168495},-1.1043223784826794,{"$f":"+G29/$H$17","v":-1.2266343385214009},{"$f":"+H29/$H$17","v":-1.3066966926070038},{"$f":"+I29/$H$17","v":-1.3407424124513621},{"$f":"+J29/$H$17","v":-1.3780828793774318},{"$f":"+K29/$H$17","v":-1.3940074902723736}]
[null,"Network support costs",null,-5.7750861872770107,-6.1425740993308713,-7.2212565209059161,-8.2345000000000006,-8.3017000000000003,-8.3542000000000005,-8.6149000000000004,-8.7001000000000008,null,0,-6.3424827873888576,-6.746076029323496,-7.9307379495163222,{"$f":"+G30/$H$17","v":-9.0435316147859925},-9.1173339494163432,-9.174992023346304,-9.4613055447470824,-9.5548763618677057]
[null,"Self insurance",null,-1.9589606904900609,-1.9796628386300439,-2.0312749554256024,-1.3189,-1.3492999999999999,-1.3828,-1.4142999999999999,-1.4478,null,0,-2.1514266727269251,-2.174162786783385,-2.2308457438477678,-1.4484806420233463,-1.4818674124513618,-1.5186587548638133,-1.5532535992217897,-1.5900449416342413]
[null,"Land tax",null,-1.3474210490589533,-1.5389580150633673,-1.6284649501068726,-2.1305000000000001,-2.2320000000000002,-2.3334000000000001,-2.5364,-2.7393000000000001,null,0,-1.4798038564081306,-1.6901591430024725,-1.7884600473449992,-2.3398195525291832,-2.4512918287937744,-2.5626542801556425,-2.7855988326848249,-3.0084335603112842]
[null,"Reset Costs",null,0,0,0,0,0,0,-1.4634,-1.4753000000000001,null,0,0,0,0,0,0,0,-1.607177626459144,-1.6202467898832686,null," "]
[null,"Adjustment for provisions",null,0,0,0,0,0,0,0,0,null,0,0,0,0,{"$f":"+G34/$H$17","v":0},{"$f":"+H34/$H$17","v":0},{"$f":"+I34/$H$17","v":0},{"$f":"+J34/$H$17","v":0},{"$f":"+K34/$H$17","v":0}]
[null,"Superannuation defined benefits contributions",null,-1.1891873183729429,-1.1891873183729429,-1.1891873183729429,-1.8262,-1.6233,-1.4204000000000001,-1.4204000000000001,-1.0145,null,0,-1.3060238156060822,-1.3060238156060822,-1.3060238156060822,-2.0056223735408563,-1.782787645914397,-1.5599529182879379,-1.5599529182879379,-1.1141736381322958]
[null,"Heywood Opex allowance ",null,0,0,0,0,0,0,1.0896188517952046,0.78322695864608738,null,0,0,0,0,{"$f":"+G36/$H$17","v":0},{"$f":"+H36/$H$17","v":0},{"$f":"+I36/$H$17","v":0},{"$f":"+J36/$H$17","v":1.1966728440435661},{"$f":"+K36/$H$17","v":0.86017824543913679}]
[null,"Other adjustments or exclusions required by the EBSS ",null,0,0,0,0,0,0,0,0,null,0,0,0,0,0,0,0,0,0]
[null,"Forecast opex for EBSS purposes",{"$f":"(C26+SUM(C28:C37))","v":0},56.756962008224143,59.304619138155132,60.7177754378204,65.336800000000011,68.303699999999992,69.789099999999991,72.326518851795214,72.730626958646084,null,{"$f":"+SUM(M26:M37)","v":0},62.333278314479621,65.13124027916065,66.683237810602364,71.756077042801564,75.014472081712057,76.64581118677043,79.432528972448239,79.876340307695912]
[]
[null,"7.5.1.2 - Actual and estimated opex applicable to EBSS"]
[null,null,"$m, Actual",null,null,null,null,null,null,null,null,null,{"$f":"CONCATENATE(\"$m, real \",dms_DollarReal)","v":"$m, real June 2018"}]
[null,null,"Previous period",null,null,null,"Current regulatory control period",null,null,null,null,null,"Previous period",null,null,null,"Current regulatory control period"]
[null,null,{"$f":"PRCP_y2","v":"2009-10"},{"$f":"PRCP_y3","v":"2010-11"},{"$f":"PRCP_y4","v":"2011-12"},{"$f":"PRCP_y5","v":"2012-13"},{"$f":"CRCP_y1","v":"2013-14"},{"$f":"CRCP_y2","v":"2014-15"},{"$f":"CRCP_y3","v":"2015-16"},{"$f":"CRCP_y4","v":"2016-17"},{"$f":"CRCP_y5","v":"2017-18"},null,{"$f":"PRCP_y2","v":"2009-10"},{"$f":"PRCP_y3","v":"2010-11"},{"$f":"PRCP_y4","v":"2011-12"},{"$f":"PRCP_y5","v":"2012-13"},{"$f":"CRCP_y1","v":"2013-14"},{"$f":"CRCP_y2","v":"2014-15"},{"$f":"CRCP_y3","v":"2015-16"},{"$f":"CRCP_y4","v":"2016-17"},{"$f":"CRCP_y5","v":"2017-18"}]
[null,"Total opex ",null,64.36999999999999,72.58,70.533139000000006,75.5,80.989999999999995,84.71,92.03,null,null,{"$f":"+C44/E$17*(1+M$16)^0.5","v":0},{"$f":"+D44/F$17*(1+M$16)^0.5","v":73.977898237269613},{"$f":"+E44/G$17*(1+M$16)^0.5","v":82.41635488848614},{"$f":"+F44/H$17*(1+M$16)^0.5","v":78.222240105427929},{"$f":"+G44/I$17*(1+M$16)^0.5","v":81.279522413703717},{"$f":"+H44/J$17*(1+M$16)^0.5","v":85.892073346468266},{"$f":"+I44/K$17*(1+M$16)^0.5","v":88.927279840243287},{"$f":"+J44/L$17*(1+M$16)^0.5","v":94.778963012609822},{"$f":"+K44/M$17*(1+M$16)^0.5","v":0}]
[null,"Approved excludable costs"]
[null,{"$f":"B28","v":"Equity raising costs"},null,0,0,0,0,0,0,0,null,null,{"$f":"+C46/E$17*(1+M$16)^0.5","v":0},{"$f":"+D46/F$17*(1+M$16)^0.5","v":0},{"$f":"+E46/G$17*(1+M$16)^0.5","v":0},{"$f":"+F46/H$17*(1+M$16)^0.5","v":0},{"$f":"+G46/I$17*(1+M$16)^0.5","v":0},{"$f":"+H46/J$17*(1+M$16)^0.5","v":0},{"$f":"+I46/K$17*(1+M$16)^0.5","v":0},{"$f":"+J46/L$17*(1+M$16)^0.5","v":0},{"$f":"+K46/M$17*(1+M$16)^0.5","v":0}]
[null,"Debt raising costs",null,0,0,0,0,0,0,0,null,null,{"$f":"+C47/E$17*(1+M$16)^0.5","v":0},{"$f":"+D47/F$17*(1+M$16)^0.5","v":0},{"$f":"+E47/G$17*(1+M$16)^0.5","v":0},{"$f":"+F47/H$17*(1+M$16)^0.5","v":0},{"$f":"+G47/I$17*(1+M$16)^0.5","v":0},{"$f":"+H47/J$17*(1+M$16)^0.5","v":0},{"$f":"+I47/K$17*(1+M$16)^0.5","v":0},{"$f":"+J47/L$17*(1+M$16)^0.5","v":0}]
[null,{"$f":"B30","v":"Network support costs"},null,-6.6184655999999995,-6.48,-7.3675705610297735,-7.37,-8.68,-8.09,-9.0809999999999995,null,null,0,{"$f":"+D48/F$17*(1+M$16)^0.5","v":-7.6063410694992939},-7.3581975706446707,-8.1707390538588296,-7.9341732475363758,-9.2053734615056744,-8.4927599328009471,-9.3522521255841546,0]
[null,"Self insurance",null,-1.8735092649416318,-1.9233098597396716,-2.0224959222061343,-1.34,-1.39,-1.44,-1.502,null,null,0,-2.1531501902817123,-2.1839651138168819,-2.2429763354081995,-1.4425769540975231,-1.474132386116692,-1.5116902723403416,-1.5468651792343795,0]
[null,"Land tax",null,-1.0591935527490062,-1.2129161370581714,-1.305225965924963,-1.3405750000000001,-1.294554,-1.3552729999999999,-1.3897248,null,null,0,-1.2172893095982296,-1.3772957674532644,-1.4475138969558912,-1.4431959703278261,-1.3729093359546103,-1.4227451461566054,-1.4312362861774051,0]
[null,"Reset Costs",null,0,0,0,0,0,-0.54815499999999995,-0.84099999999999997,null,null,0,0,0,0,0,0,-0.57544484807966667,-0.86612091593616058,0]
[null,"Adjustment for provisions",null,-0.38800000000000001,-1.9000000000000003E-2,-0.54093284721891499,-0.8033057082513253,-0.76185379993605262,-0.50068786066000004,-0.66,null,null,0,-0.44591307310953254,-2.1574962012692708E-2,-0.59990211205644384,-0.86479873270026142,-0.80796644602287926,-0.52561456141570728,-0.67971439300578607,0,null,{"$f":"CONCATENATE(dms_TradingName,\" to nominate base year used to forecast opex \n(drop down menu)\")","v":"ElectraNet to nominate base year used to forecast opex \n(drop down menu)"}]
[null,"Superannuation defined benefits contributions",null,0,0,0,0.65957647313400858,0.16853185432088971,0,0,null,null,0,0,0,0,0.7100670295582423,0.17873256442210353,0,0,0]
[null,"Heywood Opex allowance ",null,0,0,0,0,0,0,0,null,null,0,0,0,0,0,0,0,0,0]
[null,{"$f":"B37","v":"Other adjustments or exclusions required by the EBSS "},null,0,0,0,0,0,0,0,null,null,0,0,0,0,0,0,0,0,0]
[null,"Actual opex for EBSS purposes",{"$f":"C44+SUM(C46:C55)","v":0},{"$f":"D44+SUM(D46:D55)","v":54.430831582309352},62.944774003202156,59.29691370362022,65.305695764882685,69.032124054384838,72.775884139339993,78.556275200000002,0,null,{"$f":"M44+SUM(M46:M55)","v":0},{"$f":"N44+SUM(N46:N55)","v":62.555204594780847},{"$f":"O44+SUM(O46:O55)","v":71.475321474558626},{"$f":"P44+SUM(P46:P55)","v":65.761108707148566},{"$f":"Q44+SUM(Q46:Q55)","v":70.30484453859998},{"$f":"R44+SUM(R46:R55)","v":73.210424281290514},76.399025079450013,80.902774112671935,{"$f":"IF(V56=\"2016-17\", U38-(T38-T56), U38-(S38-S56))","v":79.629554200375495},"2015-16"]
[null,null,null,"Base year",null,null,null,null,null,"estimates",null,null,null,"base year"]
[null,null,null,null,null,null,null,null,null,null,null,null,{"$f":"CONCATENATE(\"INCREMENTAL GAIN, ($m, real \",dms_DollarReal,\")\")","v":"INCREMENTAL GAIN, ($m, real June 2018)"}]
[null,null,null,null,null,null,null,null,null,null,null,null,null,null,null,null,{"$f":"(Q38-Q56)-(P38-P56)+(N38-N56)","v":0.30717712044656054},{"$f":"(R38-R56)-(Q38-Q56)","v":0.35281529621995844},{"$f":"(S38-S56)-(R38-R56)","v":-1.5572616931011254},-1.7170312475441136,1.7170312475441136]
[]
[null,null,null,null,null,null,null,null,null,null,null,null,"CARRYOVER"]
[null,null,null,null,null,null,null,null,null,null,null,null,null,null,null,null,"Current regulatory control period",null,null,null,null,"Forthcoming regulatory control period"]
[null,null,null,null,null,null,null,null,null,null,null,null,null,null,{"$f":"CONCATENATE(\"$m, real \",dms_DollarReal)","v":"$m, real June 2018"}]
[null,null,null,null,null,null,null,null,null,null,null,null,null,null,null,null,{"$f":"CRCP_y1","v":"2013-14"},{"$f":"CRCP_y2","v":"2014-15"},{"$f":"CRCP_y3","v":"2015-16"},{"$f":"CRCP_y4","v":"2016-17"},{"$f":"CRCP_y5","v":"2017-18"},{"$f":"FRCP_y1","v":"2018-19"},{"$f":"FRCP_y2","v":"2019-20"},{"$f":"FRCP_y3","v":"2020-21"},{"$f":"FRCP_y4","v":"2021-22"},{"$f":"FRCP_y5","v":"2022-23"},"Total "]
[null,null,null,null,null,null,null,null,null,null,null,null,"2013-14",null,null,null,null,{"$f":"$Q$59","v":0.30717712044656054},{"$f":"$Q$59","v":0.30717712044656054},{"$f":"$Q$59","v":0.30717712044656054},{"$f":"$Q$59","v":0.30717712044656054},{"$f":"$Q$59","v":0.30717712044656054}]
[null,null,null,null,null,null,null,null,null,null,null,null,"2014-15",null,null,null,null,null,{"$f":"$R$59","v":0.35281529621995844},{"$f":"$R$59","v":0.35281529621995844},0.35281529621995844,0.35281529621995844,0.35281529621995844]
[null,null,null,null,null,null,null,null,null,null,null,null,"2015-16",null,null,null,null,null,null,{"$f":"$S$59","v":-1.5572616931011254},{"$f":"$S$59","v":-1.5572616931011254},-1.5572616931011254,-1.5572616931011254,-1.5572616931011254]
[null,null,null,null,null,null,null,null,null,null,null,null,"2016-17",null,null,null,null,null,null,null,{"$f":"$T$59","v":-1.7170312475441136},{"$f":"$T$59","v":-1.7170312475441136},-1.7170312475441136,-1.7170312475441136,-1.7170312475441136]
[null,null,null,null,null,null,null,null,null,null,null,null,"2017-18",null,null,null,null,null,null,null,null,{"$f":"$U$59","v":1.7170312475441136},{"$f":"$U$59","v":1.7170312475441136},1.7170312475441136,1.7170312475441136,1.7170312475441136]
[null,null,null,null,null,null,null,null,null,null,null,null,"Total Carryover Amount ($m, 2017-18)",null,null,null,null,null,null,null,null,{"$f":"+SUM(V65:V69)","v":-0.89726927643460641},{"$f":"+SUM(W66:W69)","v":-1.2044463968811669},{"$f":"+SUM(X67:X69)","v":-1.5572616931011254},{"$f":"+SUM(Y68:Y69)","v":0},{"$f":"+SUM(Z69)","v":1.7170312475441136},{"$f":"SUM(V70:Z70)","v":-1.9419461188727851}]
[]
[null,null,null,null,null,null,null,null,null,null,null,null,"PTRM inputs ($m, 2017-18)",null,null,null,null,null,null,null,null,{"$f":"V70","v":-0.89726927643460641},{"$f":"W70","v":-1.2044463968811669},{"$f":"X70","v":-1.5572616931011254},{"$f":"Y70","v":0},{"$f":"Z70","v":1.7170312475441136},{"$f":"SUM(V72:Z72)","v":-1.9419461188727851}]
[]
[]
[]
[null,"7.5.2 - Proposed forecast opex for the EBSS for the forthcoming regulatory control period"]
[null,null,"Forthcoming regulatory control period"]
[null,null,{"$f":"CONCATENATE(\"$m, real \",dms_DollarReal)","v":"$m, real June 2018"}]
[null,null,{"$f":"FRCP_y1","v":"2018-19"},{"$f":"FRCP_y2","v":"2019-20"},{"$f":"FRCP_y3","v":"2020-21"},{"$f":"FRCP_y4","v":"2021-22"},{"$f":"FRCP_y5","v":"2022-23"}]
[null,"Forecast opex",86.652886578573629,86.945420293215633,87.657115875783774,88.285979164553339,88.574316441237116,{"$f":"+SUM(A80:E80)","v":261.25542274757299},{"$f":"+SUM(B80:F80)","v":349.54140191212633},{"$f":"+SUM(C80:G80)","v":438.11571835336343}]
[null,"Less excluded costs"]
[null,"Less debt raising costs",0.15312003714145653,0.1528390317476315,0.15166138784282771,0.15087092914489675,0.14950453319278739,{"$f":"+SUM(A82:E82)","v":0.45762045673191576},0.60849138587681251,0.75799591906959995]
[null,"Less network support costs",9.0170943204093863,9.0615588752770346,9.1152803395906581,9.1812204076297501,9.2507957627276571,27.193933535277079,36.375153942906827,45.625949705634483]
[null,"Less self-insurance costs",1.4440525319726607,1.4511863978404016,1.4597697145070518,1.4703726350952673,1.4814804566638737,4.3550086443201135,5.8253812794153808,7.306861736079254]
[null,"Less Insurance",2.7461408258193702,2.7596959578087827,2.7760424070252392,2.7961397416653284,2.8173027008931397,8.2818791906533917,11.07801893231872,13.895321633211861]
[null,"Adjustment for provisions",0.68313102646930035,0.73187482594149678,0.72461296487770743,0.73771148072849435,0.75199135778925275,2.1396188172885044,2.8773302980169988,3.6293216558062515]
[]
[]
[]
[]
[]
[null,"Adjusted forecast opex ($m, 2016-17)",{"$f":"+C80-SUM(C82:C91)","v":72.609347836761458},72.788265204600293,73.429749061940285,73.949663970289606,74.123241629970408,{"$f":"+H80-SUM(H82:H91)","v":218.82736210330199},292.77702607359157,366.90026770356201]

{"sheet":"7.6 Indicative bill impact ","index":27,"n_rows":70,"n_cols":11,"rows_kept":70,"cut":false,"hidden":false,"merged":[[21,2,21,3],[29,2,29,3],[6,1,6,3]]}
[null,{"$f":"(LOOKUP(dms_Model,dms_Model_List,dms_Worksheet_List))","v":"REGULATORY REPORTING STATEMENT"}]
[null,{"$f":"INDEX(dms_TradingNameFull_List,MATCH(dms_TradingName,dms_TradingName_List))","v":"ElectraNet"}]
[null,{"$f":"IF(SUM(dms_SingleYear_Model)>0,CRY,CONCATENATE(FRCP_y1,\" to \",dms_MultiYear_FinalYear_Result))","v":"2018-19 to 2022-23"}]
[null,"7.6 INDICATIVE IMPACT ON TRANSMISSION CHARGES AND ELECTRICITY BILLS"]
[]
[null,"Instructions"]
[null,{"$f":"CONCATENATE(dms_TradingName,\" is required to populate all input cells (yellow) in table 7.6.1 presented below.\nTransmission pricing impact should refer to \",dms_TradingName,\"'s related transmission costs only.\")","v":"ElectraNet is required to populate all input cells (yellow) in table 7.6.1 presented below.\nTransmission pricing impact should refer to ElectraNet's related transmission costs only."}]
[]
[null,"7.6.1 - Indicative impact of the revenue proposal on the average residential electricity bills"]
[]
[null,"Transmission costs as a proportion of a typical residential customer's electricity bill (per cent)",6.963558107462306E-2]
[null,"Transmission costs as a proportion of a typical business customer's electricity bill (per cent)",6.963558107462306E-2]
[null,"Source data:","Transmission proportion of typical costs reflects the forecast average for the 2018-19 to 2022-23 regulatory period.\n\nBased on published data on average residential and small business electricity usage, including $1,767 per annum for average annual household bill and 5,000kWh annual household consumption and 10,000kWh annual small business consumption as per ESCOSA, Energy Retail Offers Comparison Report 2015-16, August 2016.\n\nMarket offer has been escalated from 2016 at 1.1% per year as per Jacobs, Retail electricity price history and projections report, May 2016."]
[]
[null,"Typical electricity bill - Residential customer"]
[null,"Tariff type","Description of tariff type",{"$f":"CONCATENATE(\"Annual bill amount \n($\",  dms_CRCP_FinalYear_Result,\")\")","v":"Annual bill amount \n($2017-18)"}]
[null,"Residential",null,1806.09]
[]
[]
[null,"<NSP to insert any additional items>"]
[null,"<NSP to insert any additional items>"]
[null,"Source data:","Annual bill amount reflects forecast amount for 2018-19.\n\nBased on published data on average residential and small busines electricity usage, including $1,767 per annum for average annual household bill and 5,000kWh annual household consumption and 10,000kWh annual small business consumption as per ESCOSA, Energy Retail Offers Comparison Report 2015-16, August 2016."]
[]
[null,"Typical electricity bill - Business customer"]
[null,"Tariff type","Description of tariff type",{"$f":"CONCATENATE(\"Annual bill amount \n($\",  dms_CRCP_FinalYear_Result,\")\")","v":"Annual bill amount \n($2017-18)"}]
[null,"Business",null,{"$f":"D17*2","v":3612.18}]
[]
[null,"<NSP to insert any additional items>"]
[null,"<NSP to insert any additional items>"]
[null,"Source data:","Annual bill reflects forecast amount for 2018-19.\n\nBased on published data on average residential and small business electricity usage, including $1,767 per annum for average annual household bill and 5,000kWh annual household consumption and 10,000kWh annual small business consumption as per ESCOSA, Energy Retail Offers Comparison Report 2015-16, August 2016."]
[]
[null,"Indicative annual average transmission price impact as shown in the proposed PTRM (per cent) ("]
[null,null,{"$f":"CRCP_y5","v":"2017-18"},{"$f":"FRCP_y1","v":"2018-19"},{"$f":"FRCP_y2","v":"2019-20"},{"$f":"FRCP_y3","v":"2020-21"},{"$f":"FRCP_y4","v":"2021-22"},{"$f":"FRCP_y5","v":"2022-23"},"Average"]
[null,"Annual price path (per cent, nominal)",null,-0.10108357891531827,5.9831754589720454E-2,5.5316252188079673E-2,6.4391277722110285E-2,6.2569069918254838E-2,{"$f":"+AVERAGE(D34:H34)","v":2.8204955100569397E-2}]
[null,{"$f":"CONCATENATE(\"Annual price path (per cent, $\",dms_DollarReal)","v":"Annual price path (per cent, $June 2018"},null,-0.11845011171454178,3.9356432862332369E-2,3.4928167292419099E-2,4.382786870855182E-2,4.2040864880116269E-2,{"$f":"+AVERAGE(D35:H35)","v":8.340644405775555E-3}]
[]
[]
[null,"Transmission bill component - Residential customer",{"$f":"CONCATENATE(\"Real \", dms_DollarReal)","v":"Real June 2018"}]
[null,"Tariff type",{"$f":"CRCP_y5","v":"2017-18"},{"$f":"FRCP_y1","v":"2018-19"},{"$f":"FRCP_y2","v":"2019-20"},{"$f":"FRCP_y3","v":"2020-21"},{"$f":"FRCP_y4","v":"2021-22"},{"$f":"FRCP_y5","v":"2022-23"},{"$f":"CONCATENATE(\"Total\n \",FRCP_y1,\" to \", IF(SUM(dms_SingleYear_Model)>0,\"\",dms_MultiYear_FinalYear_Result))","v":"Total\n 2018-19 to 2022-23"},"Annual average","Annual impact on customer bill (%)"]
[]
[null,{"$f":"+B17","v":"Residential"},{"$f":"+D17*$C$11","v":125.76812662306595},{"$f":"+C41*(1+IF($C$38=\"Nominal\",D$34,D$35))","v":110.87087797443516},{"$f":"+D41*(1+IF($C$38=\"Nominal\",E$34,E$35))","v":115.23436023982386},{"$f":"+E41*(1+IF($C$38=\"Nominal\",F$34,F$35))","v":119.25928525211532},{"$f":"+F41*(1+IF($C$38=\"Nominal\",G$34,G$35))","v":124.48616554842076},{"$f":"+G41*(1+IF($C$38=\"Nominal\",H$34,H$35))","v":129.7196716136857},{"$f":"+SUM(D41:H41)","v":599.57036062848078},{"$f":"+AVERAGE(D41:H41)","v":119.91407212569615}]
[null,"Annual change",null,{"$f":"+D41-C41","v":-14.897248648630793},{"$f":"+E41-D41","v":4.3634822653886971},{"$f":"+F41-E41","v":4.0249250122914617},{"$f":"+G41-F41","v":5.2268802963054384},{"$f":"+H41-G41","v":5.2335060652649474},{"$f":"+SUM(D42:H42)","v":3.9515449906197517},{"$f":"+AVERAGE(D42:H42)","v":0.79030899812395039},{"$f":"+J42/D17","v":4.375800752586806E-4}]
[]
[null,{"$f":"+B18","v":0},{"$f":"+D18*$C$11","v":0},{"$f":"+C44*(1+IF($C$38=\"Nominal\",D$34,D$35))","v":0},{"$f":"+D44*(1+IF($C$38=\"Nominal\",E$34,E$35))","v":0},{"$f":"+E44*(1+IF($C$38=\"Nominal\",F$34,F$35))","v":0},{"$f":"+F44*(1+IF($C$38=\"Nominal\",G$34,G$35))","v":0},{"$f":"+G44*(1+IF($C$38=\"Nominal\",H$34,H$35))","v":0},0,{"$f":"+AVERAGE(D44:H44)","v":0}]
[null,"Annual change",null,{"$f":"+D44-C44","v":0},{"$f":"+E44-D44","v":0},{"$f":"+F44-E44","v":0},{"$f":"+G44-F44","v":0},{"$f":"+H44-G44","v":0},0,0,{"$f":"+J45/D18","v":{"$error":"#DIV/0!"}}]
[]
[null,{"$f":"+B19","v":0},{"$f":"+D19*$C$11","v":0},{"$f":"+C47*(1+IF($C$38=\"Nominal\",D$34,D$35))","v":0},{"$f":"+D47*(1+IF($C$38=\"Nominal\",E$34,E$35))","v":0},{"$f":"+E47*(1+IF($C$38=\"Nominal\",F$34,F$35))","v":0},{"$f":"+F47*(1+IF($C$38=\"Nominal\",G$34,G$35))","v":0},{"$f":"+G47*(1+IF($C$38=\"Nominal\",H$34,H$35))","v":0},0,0]
[null,"Annual change",null,{"$f":"+D47-C47","v":0},{"$f":"+E47-D47","v":0},{"$f":"+F47-E47","v":0},{"$f":"+G47-F47","v":0},{"$f":"+H47-G47","v":0},0,0,{"$f":"+J48/D19","v":{"$error":"#DIV/0!"}}]
[]
[null,{"$f":"+B20","v":"<NSP to insert any additional items>"},{"$f":"+D20*$C$11","v":0},{"$f":"+C50*(1+IF($C$38=\"Nominal\",D$34,D$35))","v":0},{"$f":"+D50*(1+IF($C$38=\"Nominal\",E$34,E$35))","v":0},{"$f":"+E50*(1+IF($C$38=\"Nominal\",F$34,F$35))","v":0},{"$f":"+F50*(1+IF($C$38=\"Nominal\",G$34,G$35))","v":0},{"$f":"+G50*(1+IF($C$38=\"Nominal\",H$34,H$35))","v":0},0,0]
[null,"Annual change",null,{"$f":"+D50-C50","v":0},{"$f":"+E50-D50","v":0},{"$f":"+F50-E50","v":0},{"$f":"+G50-F50","v":0},{"$f":"+H50-G50","v":0},0,0,{"$f":"+J51/D20","v":{"$error":"#DIV/0!"}}]
[]
[null,{"$f":"+B21","v":"<NSP to insert any additional items>"},{"$f":"+D21*$C$11","v":0},{"$f":"+C53*(1+IF($C$38=\"Nominal\",D$34,D$35))","v":0},{"$f":"+D53*(1+IF($C$38=\"Nominal\",E$34,E$35))","v":0},{"$f":"+E53*(1+IF($C$38=\"Nominal\",F$34,F$35))","v":0},{"$f":"+F53*(1+IF($C$38=\"Nominal\",G$34,G$35))","v":0},{"$f":"+G53*(1+IF($C$38=\"Nominal\",H$34,H$35))","v":0},{"$f":"+SUM(D53:H53)","v":0},{"$f":"+AVERAGE(D53:H53)","v":0}]
[null,"Annual change",null,{"$f":"+D53-C53","v":0},{"$f":"+E53-D53","v":0},{"$f":"+F53-E53","v":0},{"$f":"+G53-F53","v":0},{"$f":"+H53-G53","v":0},{"$f":"+SUM(D54:H54)","v":0},{"$f":"+AVERAGE(D54:H54)","v":0},{"$f":"+J54/D21","v":{"$error":"#DIV/0!"}}]
[]
[]
[null,"Transmission bill component - Business customer",{"$f":"CONCATENATE(\"Real \", dms_DollarReal)","v":"Real June 2018"}]
[null,"Tariff type",{"$f":"CRCP_y5","v":"2017-18"},{"$f":"FRCP_y1","v":"2018-19"},{"$f":"FRCP_y2","v":"2019-20"},{"$f":"FRCP_y3","v":"2020-21"},{"$f":"FRCP_y4","v":"2021-22"},{"$f":"FRCP_y5","v":"2022-23"},{"$f":"CONCATENATE(\"Total\n \",FRCP_y1,\" to \", IF(SUM(dms_SingleYear_Model)>0,\"\",dms_MultiYear_FinalYear_Result))","v":"Total\n 2018-19 to 2022-23"},"Annual average","Annual impact on customer bill (%)"]
[]
[null,{"$f":"+B26","v":"Business"},{"$f":"+D26*$C$12","v":251.53625324613191},{"$f":"+C60*(1+IF($C$57=\"Nominal\",D$34,D$35))","v":221.74175594887032},{"$f":"+D60*(1+IF(D57=\"Nominal\",E$34,E$35))","v":230.46872047964771},{"$f":"+E60*(1+IF(E57=\"Nominal\",F$34,F$35))","v":238.51857050423064},{"$f":"+F60*(1+IF(F57=\"Nominal\",G$34,G$35))","v":248.97233109684151},{"$f":"+G60*(1+IF(G57=\"Nominal\",H$34,H$35))","v":259.43934322737141},{"$f":"+SUM(D60:H60)","v":1199.1407212569616},{"$f":"+AVERAGE(D60:H60)","v":239.8281442513923}]
[null,"Annual change",null,{"$f":"+D60-C60","v":-29.794497297261586},{"$f":"+E60-D60","v":8.7269645307773942},{"$f":"+F60-E60","v":8.0498500245829234},{"$f":"+G60-F60","v":10.453760592610877},{"$f":"+H60-G60","v":10.467012130529895},{"$f":"+SUM(D61:H61)","v":7.9030899812395035},{"$f":"+AVERAGE(D61:H61)","v":1.5806179962479008},{"$f":"+J61/D26","v":4.375800752586806E-4}]
[]
[null,{"$f":"+B27","v":0},{"$f":"+D27*$C$12","v":0},{"$f":"+C63*(1+IF(C60=\"Nominal\",D$34,D$35))","v":0},{"$f":"+D63*(1+IF(D60=\"Nominal\",E$34,E$35))","v":0},{"$f":"+E63*(1+IF(E60=\"Nominal\",F$34,F$35))","v":0},{"$f":"+F63*(1+IF(F60=\"Nominal\",G$34,G$35))","v":0},{"$f":"+G63*(1+IF(G60=\"Nominal\",H$34,H$35))","v":0},0,0]
[null,"Annual change",null,{"$f":"+D63-C63","v":0},{"$f":"+E63-D63","v":0},{"$f":"+F63-E63","v":0},{"$f":"+G63-F63","v":0},{"$f":"+H63-G63","v":0},0,0,{"$f":"+J64/D27","v":{"$error":"#DIV/0!"}}]
[]
[null,{"$f":"+B28","v":"<NSP to insert any additional items>"},{"$f":"+D28*$C$12","v":0},{"$f":"+C66*(1+IF(C63=\"Nominal\",D$34,D$35))","v":0},{"$f":"+D66*(1+IF(D63=\"Nominal\",E$34,E$35))","v":0},{"$f":"+E66*(1+IF(E63=\"Nominal\",F$34,F$35))","v":0},{"$f":"+F66*(1+IF(F63=\"Nominal\",G$34,G$35))","v":0},{"$f":"+G66*(1+IF(G63=\"Nominal\",H$34,H$35))","v":0},0,0]
[null,"Annual change",null,{"$f":"+D66-C66","v":0},{"$f":"+E66-D66","v":0},{"$f":"+F66-E66","v":0},{"$f":"+G66-F66","v":0},{"$f":"+H66-G66","v":0},0,0,{"$f":"+J67/D28","v":{"$error":"#DIV/0!"}}]
[]
[null,{"$f":"+B29","v":"<NSP to insert any additional items>"},{"$f":"+D29*$C$12","v":0},{"$f":"+C69*(1+IF(C66=\"Nominal\",D$34,D$35))","v":0},{"$f":"+D69*(1+IF(D66=\"Nominal\",E$34,E$35))","v":0},{"$f":"+E69*(1+IF(E66=\"Nominal\",F$34,F$35))","v":0},{"$f":"+F69*(1+IF(F66=\"Nominal\",G$34,G$35))","v":0},{"$f":"+G69*(1+IF(G66=\"Nominal\",H$34,H$35))","v":0},{"$f":"+SUM(D69:H69)","v":0},{"$f":"+AVERAGE(D69:H69)","v":0}]
[null,"Annual change",null,{"$f":"+D69-C69","v":0},{"$f":"+E69-D69","v":0},{"$f":"+F69-E69","v":0},{"$f":"+G69-F69","v":0},{"$f":"+H69-G69","v":0},{"$f":"+SUM(D70:H70)","v":0},{"$f":"+AVERAGE(D70:H70)","v":0},{"$f":"+J70/D29","v":{"$error":"#DIV/0!"}}]

{"sheet":"7.9 STPIS","index":28,"n_rows":166,"n_cols":12,"rows_kept":166,"cut":false,"hidden":false,"merged":[[72,3,72,6],[73,3,73,4],[73,5,73,6],[8,1,8,5],[69,1,69,4],[11,1,12,1],[5,1,5,2],[11,11,12,11],[32,1,33,1],[32,2,33,2],[32,4,33,4],[32,5,32,11],[11,7,12,7],[11,8,12,8],[11,9,12,9],[11,10,12,10],[32,3,33,3]]}
[null,{"$f":"(LOOKUP(dms_Model,dms_Model_List,dms_Worksheet_List))","v":"REGULATORY REPORTING STATEMENT"}]
[null,{"$f":"INDEX(dms_TradingNameFull_List,MATCH(dms_TradingName,dms_TradingName_List))","v":"ElectraNet"}]
[null,{"$f":"IF(SUM(dms_SingleYear_Model)>0,CRY,CONCATENATE(FRCP_y1,\" to \",dms_MultiYear_FinalYear_Result))","v":"2018-19 to 2022-23"}]
[null,"7.9 SERVICE TARGET PERFORMANCE INCENTIVE SCHEME (STPIS)"]
[]
[null,"There are FOUR tables on this worksheet. Each table has been grouped (and sub-grouped) for ease of navigation. See the Instructions sheet on how to group or ungroup tables. "]
[]
[null,"Instructions"]
[null,{"$f":"dms_TradingName&\" is required to provide the performance actuals for five years, and the proposed floor, target and cap for the next regulatory control period for the parameters under the service component of the STPIS in table 7.9.1 below.\"","v":"ElectraNet is required to provide the performance actuals for five years, and the proposed floor, target and cap for the next regulatory control period for the parameters under the service component of the STPIS in table 7.9.1 below."}]
[]
[null,"7.9.1 - Historical performance and proposed floor, caps and targets for the service component of the STPIS"]
[null,"Parameter","Performance actuals",null,null,null,null,"Average of actual performance","Floor","Target","Cap","Weighting \n(% of MAR)"]
[null,null,{"$f":"(LEFT(PRCP_y4,2)&RIGHT(PRCP_y4,2))","v":"2012"},{"$f":"LEFT(PRCP_y5,2)&RIGHT(PRCP_y5,2)","v":"2013"},{"$f":"(LEFT(CRCP_y1,2)&RIGHT(CRCP_y1,2))","v":"2014"},{"$f":"(LEFT(CRCP_y2,2)&RIGHT(CRCP_y2,2))","v":"2015"},{"$f":"(LEFT(CRCP_y3,2)&RIGHT(CRCP_y3,2))","v":"2016"}]
[null,"Unplanned outage circuit event rate:"]
[null,"Transmission line outage - fault",0.39090909090909093,0.22522522522522523,0.22123893805309736,0.19298245614035087,0.32085561497326204,{"$f":"+AVERAGE(C15:G15)","v":0.27024226506020527},0.41099999999999998,0.27,0.158,2E-3]
[null,"Transformer outage – fault ",0.4,0.28467153284671531,0.35555555555555557,0.15441176470588236,0.35294117647058826,0.30951600591574835,0.43,0.31,0.18,2E-3]
[null,"Reactive plant – fault ",0.22580645161290322,0.26470588235294118,0.20588235294117646,0.17647058823529413,0.5135135135135136,0.2772757577311657,0.438,0.27700000000000002,0.13300000000000001,1E-3]
[null,"Transmission line outage – forced outage",9.0909090909090912E-2,0.14414414414414414,0.11504424778761062,0.14035087719298245,8.0213903743315509E-2,0.11413245275542874,0.16600000000000001,0.114,7.6999999999999999E-2,1E-3]
[null,"Transformer outage – forced outage",0.24444444444444444,0.16058394160583941,0.16296296296296298,0.16911764705882354,3.6764705882352942E-2,0.15477474039088468,0.28999999999999998,0.155,1.4999999999999999E-2,1E-3]
[null,"Reactive plant – forced outage",0.12903225806451613,0.3235294117647059,0.11764705882352941,0.11764705882352941,0.1891891891891892,0.17540899533309401,0.29499999999999998,0.17499999999999999,7.8E-2,5.0000000000000001E-4]
[null,"Loss of supply event frequency (number of events):"]
[null,">  (x) system minutes",6,5,4,1,5,{"$f":"+AVERAGE(C22:G22)","v":4.2},8,4,1,1.5E-3]
[null,">  (y) system minutes",5,4,1,0,2,{"$f":"+AVERAGE(C23:G23)","v":2.4},5,2,0,1.5E-3]
[null,"Average outage duration (minutes): ",122,154.16999999999999,130.71,147,250.57142857142784,{"$f":"+AVERAGE(C24:G24)","v":160.89028571428557},236,161,106,2E-3]
[null,"Proper operation of equipment (number of events):"]
[null,"Failure of protection system",23,28,28,24,10,{"$f":"+AVERAGE(C26:G26)","v":22.6},31,22.6,15,0]
[null,"Material failure of SCADA",2,2,0,0,2,{"$f":"+AVERAGE(C27:G27)","v":1.2},4,1.2,0,0]
[null,"Incorrect operational isolation of primary or secondary equipment",8,5,9,7,10,{"$f":"+AVERAGE(C28:G28)","v":7.8},13,7.8,4,0]
[]
[]
[]
[null,"7.9.2 - Proposed priority projects for the network capability incentive parameter"]
[null,"Project ranking","Transmission Circuit /  Injection Point","Scope of works",{"$f":"CONCATENATE((\"If applicable, the present value of quantified benefits associated with the project\n ($0's, \"),CRCP_y5,\")\")","v":"If applicable, the present value of quantified benefits associated with the project\n ($0's, 2017-18)"},{"$f":"CONCATENATE((\"Project cost ($0's, \"),CRCP_y5,\")\")","v":"Project cost ($0's, 2017-18)"}]
[null,null,null,null,null,{"$f":"FRCP_y1","v":"2018-19"},{"$f":"FRCP_y2","v":"2019-20"},{"$f":"FRCP_y3","v":"2020-21"},{"$f":"FRCP_y4","v":"2021-22"},{"$f":"FRCP_y5","v":"2022-23"},"Opex","Capex"]
[null,1,"Tailem Bend – Mobilong 132 kV\nTailem Bend – Tungkillo 275 kV\nTailem Bend – Cherry Gardens 275 kV\nSouth East – Tailem Bend #1 275 kV\nSouth East – Tailem Bend #2 275 kV\n","Apply dynamic ratings to the circuits that make up the Heywood interconnector in South Australia to better account for favourable weather conditions.\n","$800,000 p.a.",100000,"",null,null,null,100000]
[null,2,"Davenport – Belalie – Mokota – Robertstown 275 kV\nDavenport – Mt Lock - Canowie – Robertstown 275 kV\n","Remove and replace plant that are rated lower than the design capability of the conductors\n","$6,200,000 p.a.",1300000,null,null,null,null,null,1300000]
[null,3,"Robertstown 275/132 kV transformers\n","Install DR-E3 transformer management relays and the bushing monitoring add-on to the two 275/132 kV transformers at Robertstown\n","$200,000 p.a.",null,null,null,500000,null,null,300000]
[null,4,"State-wide","To review the existing AULimit search program to support other power system analysis software packages currently available in the market such as Power Factory, its limit search criteria, appropriate programing language and any improvement that potentially be achieved in improving the accuracy of the limit derivation methodology.\n","$300,000 p.a.",null,null,null,null,300000,100000,200000]
[null,5,"South East 275 kV substation\n","Install an additional 100 Mar capacitor at South East substation","$1,000,000 p.a.",null,3600000,null,null,null,null,3600000]
[null,6,"Templers - Waterloo 132 Kv\n\n","Install Smart Wires Powerline Guardian SD4-1200 and 3 Guardian 390-800 devices on Waterloo - Templers 132 kV. \n","$1,300,000 p.a.",null,5900000,null,null,null,null,5900000]
[null,7,"Tungkillo 275 kV","Tie in Tailem Bend to Cherry Gardens 275 kV at Tungkillo.","$300,000 p.a.",null,null,5300000,null,null,null,5300000]
[]
[]
[]
[]
[]
[]
[]
[]
[]
[]
[]
[]
[]
[null,"7.9.3 – Network limit information"]
[null,"Limit identification ","Define limit  ","Reason for the limit ","Is limit addressed by priority project","Supporting information reference"]
[null,"Transmission limitations on NSA - ADE 175 kV corridor","Thermal limits of various transmission network elements","Design capability","Yes","2016 NTNDP, Draft NCIPAP template"]
[null,"Transmission limiations on 132 kV network in the mid north","Thermal limits of various transmission network elements","design capability","Yes","2016 NTNDP, Draft NCIPAP template"]
[null,"Transmission limiations on the 132 kV newtork in the Riverland","Thermal and voltage limiations ","Design capability and reactive shortfalls","No","2016 NTNDP"]
[null,"Transmission limiations on the 132 kV network in the Eyre Pensinula","Thermal and voltage limits","Design capability and reactive shortfalls","No","2016 NTNDP"]
[null,"Transmission limiations on the Tungkillo-Tailem Bend - South East transmission corridor","Thermal and voltage limitations","Design capability and reactive shortfalls","Yes","2016 NTNDP, Draft NCIPAP template"]
[]
[]
[]
[]
[]
[]
[]
[null,"Instructions"]
[null,{"$f":"dms_TradingName&\" is required to provide performance data in accordance with Appendix C of the STPIS for the preceding seven calendar years in table 7.9.4 below.\n\n\"&dms_TradingName&\" is also required to provide relevant information in the MIC workbook attached to Appendix A of the Notice.\"","v":"ElectraNet is required to provide performance data in accordance with Appendix C of the STPIS for the preceding seven calendar years in table 7.9.4 below.\n\nElectraNet is also required to provide relevant information in the MIC workbook attached to Appendix A of the Notice."}]
[]
[null,"7.9.4 - Market impact component"]
[null,null,null,"Market impact parameter"]
[null,null,null,"Planned outage count(DI)",null,"Unplanned outage count (DI) "]
[null,"Year","Month","without exclusions","with exclusions","without exclusions","with exclusions","Market impact parameters"]
[null,{"$f":"LEFT(PRCP_y3,4)","v":"2010"},"January",476,227,46,46,{"$f":"+E76/12","v":18.916666666666668}]
[null,"2010","February",329,144,33,0,12]
[null,"2010","March",286,6,0,0,0.5]
[null,"2010","April",699,15,0,0,1.25]
[null,"2010","May",324,13,95,5,1.0833333333333333]
[null,"2010","June",372,68,3,0,5.666666666666667]
[null,"2010","July",320,208,5,5,17.333333333333332]
[null,"2010","August",501,358,0,0,29.833333333333332]
[null,"2010","September",160,61,127,11,5.083333333333333]
[null,"2010","October",1259,275,112,112,22.916666666666668]
[null,"2010","November",1736,29,98,0,2.4166666666666665]
[null,"2010","December",3190,207,105,0,17.25]
[null,{"$f":"CONCATENATE(\"Total \",LEFT(PRCP_y3,4))","v":"Total 2010"},null,{"$f":"+SUM(D76:D87)","v":9652},{"$f":"+SUM(E76:E87)","v":1611},{"$f":"+SUM(F76:F87)","v":624},{"$f":"+SUM(G76:G87)","v":179},{"$f":"+SUM(H76:H87)","v":134.25}]
[null,{"$f":"LEFT(PRCP_y4,4)","v":"2011"},"January",634,88,18,0,{"$f":"+E89/12","v":7.333333333333333}]
[null,"2011","February",855,49,36,32,4.083333333333333]
[null,"2011","March",450,60,0,0,5]
[null,"2011","April",43,5,0,0,0.41666666666666669]
[null,"2011","May",282,116,6,6,9.6666666666666661]
[null,"2011","June",316,65,0,0,5.416666666666667]
[null,"2011","July",478,201,87,0,16.75]
[null,"2011","August",212,18,16,0,1.5]
[null,"2011","September",400,224,65,0,18.666666666666668]
[null,"2011","October",1444,380,161,5,31.666666666666668]
[null,"2011","November",198,73,0,0,6.083333333333333]
[null,"2011","December",198,40,45,0,3.3333333333333335]
[null,{"$f":"CONCATENATE(\"Total \", LEFT(PRCP_y4,4))","v":"Total 2011"},null,{"$f":"+SUM(D89:D100)","v":5510},{"$f":"+SUM(E89:E100)","v":1319},{"$f":"+SUM(F89:F100)","v":434},{"$f":"+SUM(G89:G100)","v":43},{"$f":"+SUM(H89:H100)","v":109.91666666666667}]
[null,{"$f":"LEFT(PRCP_y5,4)","v":"2012"},"January",282,0,0,0,{"$f":"+E102/12","v":0}]
[null,"2012","February",140,0,0,0,0]
[null,"2012","March",683,29,9,0,2.4166666666666665]
[null,"2012","April",1226,38,24,11,3.1666666666666665]
[null,"2012","May",844,11,0,0,0.91666666666666663]
[null,"2012","June",887,279,2,0,23.25]
[null,"2012","July",184,69,0,0,5.75]
[null,"2012","August",1553,583,0,0,48.583333333333336]
[null,"2012","September",1183,1053,19,19,87.75]
[null,"2012","October",908,676,116,64,56.333333333333336]
[null,"2012","November",1116,559,361,67,46.583333333333336]
[null,"2012","December",1432,781,280,16,65.083333333333329]
[null,{"$f":"CONCATENATE(\"Total \", LEFT(PRCP_y5,4))","v":"Total 2012"},null,{"$f":"+SUM(D102:D113)","v":10438},{"$f":"+SUM(E102:E113)","v":4078},{"$f":"+SUM(F102:F113)","v":811},{"$f":"+SUM(G102:G113)","v":177},{"$f":"+SUM(H102:H113)","v":339.83333333333331}]
[null,{"$f":"LEFT(CRCP_y1,4)","v":"2013"},"January",179,0,0,0,{"$f":"+E115/12","v":0}]
[null,"2013","February",361,10,42,1,0.83333333333333337]
[null,"2013","March",944,0,0,0,0]
[null,"2013","April",197,20,14,14,1.6666666666666667]
[null,"2013","May",332,0,2759,0,0]
[null,"2013","June",232,1,186,0,8.3333333333333329E-2]
[null,"2013","July",742,530,20,20,44.166666666666664]
[null,"2013","August",756,187,0,0,15.583333333333334]
[null,"2013","September",1149,164,35,35,13.666666666666666]
[null,"2013","October",2131,1099,33,33,91.583333333333329]
[null,"2013","November",442,95,0,0,7.916666666666667]
[null,"2013","December",428,256,0,0,21.333333333333332]
[null,{"$f":"CONCATENATE(\"Total \", LEFT(CRCP_y1,4))","v":"Total 2013"},null,{"$f":"+SUM(D115:D126)","v":7893},{"$f":"+SUM(E115:E126)","v":2362},{"$f":"+SUM(F115:F126)","v":3089},{"$f":"+SUM(G115:G126)","v":103},{"$f":"+SUM(H115:H126)","v":196.83333333333331}]
[null,{"$f":"LEFT(CRCP_y2,4)","v":"2014"},"January",268,7,133,0,{"$f":"+E128/12","v":0.58333333333333337}]
[null,"2014","February",143,0,53,0,0]
[null,"2014","March",265,0,93,0,0]
[null,"2014","April",20,0,17,0,0]
[null,"2014","May",85,0,86,0,0]
[null,"2014","June",248,0,35,0,0]
[null,"2014","July",113,0,25,0,0]
[null,"2014","August",38,15,84,0,1.25]
[null,"2014","September",290,0,64,0,0]
[null,"2014","October",383,39,113,9,3.25]
[null,"2014","November",115,0,24,0,0]
[null,"2014","December",99,26,274,0,2.1666666666666665]
[null,{"$f":"CONCATENATE(\"Total \", LEFT(CRCP_y2,4))","v":"Total 2014"},null,{"$f":"+SUM(D128:D139)","v":2067},{"$f":"+SUM(E128:E139)","v":87},{"$f":"+SUM(F128:F139)","v":1001},{"$f":"+SUM(G128:G139)","v":9},{"$f":"+SUM(H128:H139)","v":7.25}]
[null,{"$f":"LEFT(CRCP_y3,4)","v":"2015"},"January",29,0,546,283,{"$f":"+E141/12","v":0}]
[null,"2015","February",85,0,102,0,0]
[null,"2015","March",600,537,42,0,44.75]
[null,"2015","April",1102,515,233,115,42.916666666666664]
[null,"2015","May",1759,967,224,0,80.583333333333329]
[null,"2015","June",118,83,18,0,6.916666666666667]
[null,"2015","July",3927,2749,149,42,229.08333333333334]
[null,"2015","August",998,477,353,236,39.75]
[null,"2015","September",2137,1593,148,33,132.75]
[null,"2015","October",10781,7324,171,0,610.33333333333337]
[null,"2015","November",7919,2547,591,81,212.25]
[null,"2015","December",1180,445,188,81,37.083333333333336]
[null,{"$f":"CONCATENATE(\"Total \", LEFT(CRCP_y3,4))","v":"Total 2015"},null,{"$f":"+SUM(D141:D152)","v":30635},{"$f":"+SUM(E141:E152)","v":17237},{"$f":"+SUM(F141:F152)","v":2765},{"$f":"+SUM(G141:G152)","v":871},{"$f":"+SUM(H141:H152)","v":1436.4166666666667}]
[null,{"$f":"LEFT(CRCP_y4,4)","v":"2016"},"January",693,217,6,0,{"$f":"+E154/12","v":18.083333333333332}]
[null,"2016","February",414,0,4,3,0]
[null,"2016","March",1845,737,246,184,61.416666666666664]
[null,"2016","April",1938,671,8,0,55.916666666666664]
[null,"2016","May",1542,746,122,23,62.166666666666664]
[null,"2016","June",3865,1318,26,0,109.83333333333333]
[null,"2016","July",4816,4390,95,4,365.83333333333331]
[null,"2016","August",5976,1228,203,7,102.33333333333333]
[null,"2016","September",4944,177,2731,234,14.75]
[null,"2016","October",2938,1596,8558,334,133]
[null,"2016","November",8088,2477,1014,31,206.41666666666666]
[null,"2016","December",4857,305,202,0,25.416666666666668]
[null,{"$f":"CONCATENATE(\"Total \", LEFT(CRCP_y4,4))","v":"Total 2016"},null,{"$f":"+SUM(D154:D165)","v":41916},{"$f":"+SUM(E154:E165)","v":13862},{"$f":"+SUM(F154:F165)","v":13215},{"$f":"+SUM(G154:G165)","v":820},{"$f":"+SUM(H154:H165)","v":1155.1666666666667}]

{"sheet":"Reconciliation","index":29,"n_rows":59,"n_cols":9,"rows_kept":59,"cut":false,"hidden":false,"merged":[[2,1,2,3],[1,5,1,7],[2,5,2,7],[4,5,4,7],[1,0,1,3],[5,5,5,7],[6,5,6,7],[3,1,3,3],[4,1,4,3],[5,1,5,3],[6,1,6,3],[17,5,17,7],[14,1,14,3],[15,1,15,3],[16,1,16,3],[17,1,17,3],[14,5,14,7],[15,5,15,7],[16,5,16,7],[13,1,13,3],[8,4,9,4],[8,5,9,7],[7,5,7,7],[8,0,9,3],[13,5,13,7],[11,1,11,3],[12,1,12,3],[10,5,10,7],[11,5,11,7],[12,5,12,7],[7,1,7,3],[10,1,10,3]]}
["Regulatory Information Notice - Reconciliations"]
["Schedule 1 \nClause ",null,null,null,"Reconciles ","Comment"]
[1.6,"Provide reconciliation of the of the capital and operating expenditure forecasts provided in regulatory templates to the ex-ante capital and operating allowance in the Post Tax Revenue Model for the forthcoming regulatory control period",null,null,"Yes- Capex \nYes- Opex","Post Tax Revenue Model - PTRM input - Forecast Net Capital Expenditure As incurred ($m Real June 2018) ; Forecast Net Operating Expenditure ($m Real June 2018)"]
[7.3,"If cost base year approach used to develop ElectraNet's total forecast opex proposal, provide:",null,null,"Yes","Cost base approach has been applied "]
[null," (a) reconciliation of ElectraNet's forecast total opex proposal to forecast prescribed transmission services opex by opex driver in table 2.16.1;",null,null,"Yes ","See below - Reconciliation Clause 7.3 (a) (Forecast Operational Expenditure). Template 2.16, table 2.16.1 has been prepared excluding provisions, the reconciliation inclusive of provisions is provided below "]
[7.14,"The amount of the total opex attributable to category specific opex must align with opex reported in table 2.16.1",null,null,"Yes","Reconciles with Forecast Operating Expenditure Model for Zero base ('bottom up') expenditure items"]
[8.1999999999999993,"Total revenues must equal total forecast revenue as proposed by ElectraNet's in its revenue proposal ",null,null,"Yes","Reconciles to Post Tax Revenue Model - Revenue Summary- Revenue Smoothing ($m Real June 2018) Maximum Allowed Revenue "]
[8.9,"Regulatory Asset Base (RAB) financial data in Workbook 1 - Regulatory Determination, 3.3 Assets (RAB) regulatory template must reconcile to that in ElectraNet's revenue proposal Post Tax Revenue Model and Roll Forward Model",null,null,"Yes","Template 3.3 Assets (RAB) reconciles with Post Tax Revenue Model and Roll Forward Model"]
["Appendix E: Instructions Part B: Workbook 1 - Regulatory determination\nClause ",null,null,null,"Reconciles ","Comment"]
[]
[2.9,"Capex must be mutually exclusive and collectively exhaustive. Total expenditure for capex in table 2.1.1 must be reported on an as-incurred basis",null,null,"Yes","Post Tax Revenue Model  - PTRM input - Forecast Net Capital Expenditure As incurred ($m Real June 2018) "]
[2.11,"Total capitalised overheads in table 2.1.8 must reconcile with overheads reported in table 2.1.1",null,null,"Yes ","See below - Reconciliation Clause 2.11 (Forecast Capital Expenditure Overheads). Overhead total from table 2.8.1 reconciles with the total of capitalised network overheads and capitalised corporate overheads from table 2.1.1"]
["2.12 (a)","Where ElectraNet provides asset sub-categories corresponding to the prescribed asset categories in table 2.2.1, ElectraNet must ensure that the expenditure and asset replacement / asset failure volumes of these sub  categories reconcile to the higher level asset category ",null,null,"Not Applicable","Template 2.2 is prepared according to a project close basis as required by clause 2.7, summarised data within the Revenue Proposal is prepared on an annual as incurred basis. "]
["2.12 (c)","ElectraNet must ensure that the sum of the individual assets categories, including any additional sub-category, additional other asset category or asset refurbishment / life extension asset category expenditure reconciles to the total expenditure of the asset group ",null,null,"Not Applicable","Template 2.2 is prepared according to a project close basis as required by clause 2.7 and template 2.1 is reported on an annual as-incurred basis as required by clause 2.10"]
["2.12 (d)","Sum of asset group replacement expenditures is equal to the total replacement expenditure contained in template 2.1",null,null,"Not Applicable","Template 2.2 is prepared according to a project close basis as required by clause 2.7 and Template 2.1 is reported on a as-incurred basis as required by clause 2.10"]
["2.16 (b) ","ElectraNet must explain how the sum of the asset group augmentation expenditure reconciles to the augmentation expenditure in table 2.3.1 and 2.3.2 ",null,null,"Not Applicable","Summary table 2.1.1 is prepared on an as incurred annual basis according to clause 2.10. Tables 2.3.1 & 2.3.2 are prepared on an aggregate project close basis according to clause 2.14 (c) and 2.15 (c)"]
["2.16 (b) ","The sum of demand and non-demand augex should reconcile with total augmentation expenditure in table 2.3.4.",null,null,"Yes","See below"]
["2.18 (b)","The sum of expenditure in table 2.3.6  should reconcile with demand-driven augex in table 2.3.5",null,null,"Yes","See below "]
[]
[]
[]
["Reconciliation Clause 7.3 (a) (Forecast Operational Expenditure)"]
["Year ",{"$f":"'2.16 Opex Summary'!C12","v":"2016-17"},{"$f":"'2.16 Opex Summary'!D12","v":"2017-18"},{"$f":"'2.16 Opex Summary'!E12","v":"2018-19"},{"$f":"'2.16 Opex Summary'!F12","v":"2019-20"},{"$f":"'2.16 Opex Summary'!G12","v":"2020-21"},{"$f":"'2.16 Opex Summary'!H12","v":"2021-22"},{"$f":"'2.16 Opex Summary'!I12","v":"2022-23"}]
["Table 2.16.1 Total ",{"$f":"'2.16 Opex Summary'!C19","v":94767139.323078901},{"$f":"'2.16 Opex Summary'!D19","v":93580055.744593874},{"$f":"'2.16 Opex Summary'!E19","v":86785219.330048054},{"$f":"'2.16 Opex Summary'!F19","v":87212560.072743148},{"$f":"'2.16 Opex Summary'!G19","v":88060401.115608037},{"$f":"'2.16 Opex Summary'!H19","v":88827278.270563826},{"$f":"'2.16 Opex Summary'!I19","v":89255525.7323706}]
["Add Provisions from Table 3.2.1",{"$f":"'3.2 Operating expenditure'!C27","v":-679598.7392104835},{"$f":"'3.2 Operating expenditure'!D27","v":-683131.02646930038},{"$f":"'3.2 Operating expenditure'!E27","v":-683131.02646930038},{"$f":"'3.2 Operating expenditure'!F27","v":-731874.82594149676},{"$f":"'3.2 Operating expenditure'!G27","v":-724612.96487770742},{"$f":"'3.2 Operating expenditure'!H27","v":-737711.48072849435},{"$f":"'3.2 Operating expenditure'!I27","v":-751991.35778925277}]
[]
["Table Total 2.16.1 with Provisions ",{"$f":"B24+B25","v":94087540.583868414},{"$f":"C24+C25","v":92896924.718124568},86102088.303578749,86480685.246801645,87335788.150730327,88089566.789835334,88503534.374581352,"Reconciles"]
[]
["Table 2.1.1 Total ",{"$f":"'2.1 Expenditure summary'!C29","v":94087540.58382082},{"$f":"'2.1 Expenditure summary'!D29","v":92896924.718109488},{"$f":"'2.1 Expenditure summary'!E29","v":86102088.302905917},{"$f":"'2.1 Expenditure summary'!F29","v":86480685.245462507},{"$f":"'2.1 Expenditure summary'!G29","v":87335788.145590395},{"$f":"'2.1 Expenditure summary'!H29","v":88089566.777878061},{"$f":"'2.1 Expenditure summary'!I29","v":88503534.363731742},"Reconciles "]
[]
["Table 3.2.1 Total ",{"$f":"'3.2 Operating expenditure'!C48","v":94087540.583868384},{"$f":"'3.2 Operating expenditure'!D48","v":92896924.718124568},{"$f":"'3.2 Operating expenditure'!E48","v":86102088.303578749},{"$f":"'3.2 Operating expenditure'!F48","v":86480685.2468016},{"$f":"'3.2 Operating expenditure'!G48","v":87335788.150730312},{"$f":"'3.2 Operating expenditure'!H48","v":88089566.789835349},{"$f":"'3.2 Operating expenditure'!I48","v":88503534.374581352},"Reconciles "]
[]
[]
["Reconciliation Clause 2.11 (Forecast Capital Expenditure Overheads)"]
["Year",{"$f":"'2.1 Expenditure summary'!C44","v":"2016-17"},{"$f":"'2.1 Expenditure summary'!D44","v":"2017-18"},{"$f":"'2.1 Expenditure summary'!E44","v":"2018-19"},{"$f":"'2.1 Expenditure summary'!F44","v":"2019-20"},{"$f":"'2.1 Expenditure summary'!G44","v":"2020-21"},{"$f":"'2.1 Expenditure summary'!H44","v":"2021-22"},{"$f":"'2.1 Expenditure summary'!I44","v":"2022-23"}]
["Table 2.1.8 Total Capitalised Overheads ",{"$f":"'2.1 Expenditure summary'!C50","v":10594170.586144956},{"$f":"'2.1 Expenditure summary'!D50","v":10462841.727217879},{"$f":"'2.1 Expenditure summary'!E50","v":10668959.709244071},{"$f":"'2.1 Expenditure summary'!F50","v":8125575.9868422942},{"$f":"'2.1 Expenditure summary'!G50","v":8360247.1867976012},{"$f":"'2.1 Expenditure summary'!H50","v":7040812.1738074664},{"$f":"'2.1 Expenditure summary'!I50","v":4946776.3397096917},"Reconciles "]
[]
[]
["Table 2.1.1 Capitalised network overheads ",{"$f":"'2.1 Expenditure summary'!C15","v":96540.340805116386},{"$f":"'2.1 Expenditure summary'!D15","v":95343.594661067327},{"$f":"'2.1 Expenditure summary'!E15","v":97221.863475890335},{"$f":"'2.1 Expenditure summary'!F15","v":74045.048513143862},{"$f":"'2.1 Expenditure summary'!G15","v":76183.511117329181},{"$f":"'2.1 Expenditure summary'!H15","v":64160.039832955437},{"$f":"'2.1 Expenditure summary'!I15","v":45077.948277217358}]
["Table 2.1.1 Capitalised corporate overheads ",{"$f":"'2.1 Expenditure summary'!C16","v":10497630.245339839},{"$f":"'2.1 Expenditure summary'!D16","v":10367498.132556811},{"$f":"'2.1 Expenditure summary'!E16","v":10571737.84576818},{"$f":"'2.1 Expenditure summary'!F16","v":8051530.93832915},{"$f":"'2.1 Expenditure summary'!G16","v":8284063.6756802723},{"$f":"'2.1 Expenditure summary'!H16","v":6976652.1339745112},{"$f":"'2.1 Expenditure summary'!I16","v":4901698.3914324744}]
[]
["Table 2.1.1 Total Overheads ",{"$f":"B39+B40","v":10594170.586144956},{"$f":"C39+C40","v":10462841.727217879},10668959.709244071,8125575.9868422942,8360247.1867976012,7040812.1738074664,4946776.3397096917,"Reconciles "]
[]
[]
["Reconciliation Clause 2.16 (b) (Forecast Augmentation)"]
["Year",{"$f":"'2.3 Augex (b)'!C19","v":"2016-17"},{"$f":"'2.3 Augex (b)'!D19","v":"2017-18"},{"$f":"'2.3 Augex (b)'!E19","v":"2018-19"},{"$f":"'2.3 Augex (b)'!F19","v":"2019-20"},{"$f":"'2.3 Augex (b)'!G19","v":"2020-21"},{"$f":"'2.3 Augex (b)'!H19","v":"2021-22"},{"$f":"'2.3 Augex (b)'!I19","v":"2022-23"}]
["Table 2.3.5 Demand driven augex",{"$f":"'2.3 Augex (b)'!C20","v":433953.03125123517},{"$f":"'2.3 Augex (b)'!D20","v":804196.05679340498},{"$f":"'2.3 Augex (b)'!E20","v":0},{"$f":"'2.3 Augex (b)'!F20","v":0},{"$f":"'2.3 Augex (b)'!G20","v":0},{"$f":"'2.3 Augex (b)'!H20","v":0},{"$f":"'2.3 Augex (b)'!I20","v":0}]
["Table 2.3.5 Non-demand driven augex",{"$f":"'2.3 Augex (b)'!C21","v":23350045.224647332},{"$f":"'2.3 Augex (b)'!D21","v":18639408.17103719},{"$f":"'2.3 Augex (b)'!E21","v":13910208.836637834},{"$f":"'2.3 Augex (b)'!F21","v":2637734.331074506},{"$f":"'2.3 Augex (b)'!G21","v":4946350.7063697791},{"$f":"'2.3 Augex (b)'!H21","v":3682023.1715161381},{"$f":"'2.3 Augex (b)'!I21","v":2367891.4500446003}]
[]
["Table 2.3.5 Total Augex - by Driver",{"$f":"B47+B48","v":23783998.255898569},{"$f":"C47+C48","v":19443604.227830596},13910208.836637834,2637734.331074506,4946350.7063697791,3682023.1715161381,2367891.4500446003,"Reconciles "]
[]
["Table 2.3.4 Augex - Total Expenditure ",{"$f":"'2.3 Augex (b)'!C14","v":23783998.255898569},{"$f":"'2.3 Augex (b)'!D14","v":19443604.227830596},{"$f":"'2.3 Augex (b)'!E14","v":13910208.836637834},{"$f":"'2.3 Augex (b)'!F14","v":2637734.331074506},{"$f":"'2.3 Augex (b)'!G14","v":4946350.7063697791},{"$f":"'2.3 Augex (b)'!H14","v":3682023.1715161381},{"$f":"'2.3 Augex (b)'!I14","v":2367891.4500446003},"Reconciles "]
[]
[]
["Reconciliation Clause 2.18 (b) (Forecast Augmentation)"]
["Year ",{"$f":"'2.3 Augex (b)'!C19","v":"2016-17"},{"$f":"'2.3 Augex (b)'!D19","v":"2017-18"},{"$f":"'2.3 Augex (b)'!E19","v":"2018-19"},{"$f":"'2.3 Augex (b)'!F19","v":"2019-20"},{"$f":"'2.3 Augex (b)'!G19","v":"2020-21"},{"$f":"'2.3 Augex (b)'!H19","v":"2021-22"},{"$f":"'2.3 Augex (b)'!I19","v":"2022-23"}]
["Table 2.3.6 Total Augex - Demand Driven",{"$f":"'2.3 Augex (b)'!C31","v":433953.03125123517},{"$f":"'2.3 Augex (b)'!D31","v":804196.05679340498},{"$f":"'2.3 Augex (b)'!E31","v":0},{"$f":"'2.3 Augex (b)'!F31","v":0},{"$f":"'2.3 Augex (b)'!G31","v":0},{"$f":"'2.3 Augex (b)'!H31","v":0},{"$f":"'2.3 Augex (b)'!I31","v":0},"Reconciles "]
[]
["Table 2.3.5 Augex - By Driver - Demand Driven Augex ",{"$f":"'2.3 Augex (b)'!C20","v":433953.03125123517},{"$f":"'2.3 Augex (b)'!D20","v":804196.05679340498},{"$f":"'2.3 Augex (b)'!E20","v":0},{"$f":"'2.3 Augex (b)'!F20","v":0},{"$f":"'2.3 Augex (b)'!G20","v":0},{"$f":"'2.3 Augex (b)'!H20","v":0},{"$f":"'2.3 Augex (b)'!I20","v":0},"Reconciles "]