{"text_format":"1","workbook":"xlsx","n_sheets":17,"sheets":["Introduction","Dashboard","Contents","1. Revenue","2. RAB","3. Capex","4. Opex","5. SAIDI","6. SAIFI","7. Energy delivered","8. Customer numbers","9. Circuit length","10. Utilisation","11. Reg service life","12. Return on assets","New data sheet","Calculations"],"not_rendered":{"charts":22,"images":1,"macros":1,"external_links":7,"defined_names":375,"comments":0,"pivot_tables":0},"unopened":[],"bounds":{"document_bytes":16777216,"sheet_cells":100000,"rows_first":2000,"rows_last":500,"rows_between":2000,"halvings":0,"cell_chars":16384,"cell_head_chars":4096},"cells_cut":0,"cells_raw":0,"read":"whole","date_system":"1900"}

{"sheet":"Introduction","index":0,"n_rows":29,"n_cols":10,"rows_kept":29,"cut":false,"hidden":false,"merged":[[9,2,9,15],[11,2,15,15],[18,2,18,15]]}
[]
[null,null,null,"Electricity Distribution Network Service Provider"]
[null,null,null,null,null,null,null,null,"Operational Performance Data"]
[]
[]
[null,"Introduction"]
[]
[]
[]
[null,null,"This workbook contains operational performance data for the electricity distribution businesses regulated by the AER. Charts and data are presented for a range of financial and network operational performance measures.  "]
[null,null,"Interpretation"]
[null,null,"The data covers the regulatory years from 2006 to 2019. It is reported on an end of year basis. Victorian distribution businesses report on a calendar year basis, and so for these businesses the label 2015 refers to the year ending 31 December. All other distribution businesses report on a financial year basis, and for these businesses the label 2015 refers to data collected for the year ending 30 June 2015. \n\nAll financial values have been converted to June 2019 dollars.\n\nAny changes in service classification between regulatory periods have not been adjusted for in the data contained in this report."]
[]
[]
[]
{"$rows_left_out":15}
{"sheet":"Dashboard","index":1,"n_rows":129,"n_cols":22,"rows_kept":129,"cut":false,"hidden":false,"merged":[[2,5,2,9],[0,5,0,9],[1,4,1,10]]}
[null,null,null,null,null,"Electricity Distribution Network Service Provider"]
[null,null,null,null,"Operational Performance Data"]
[null,null,null,null,null,"SA Power Networks"]
[]
[]
[null,null,null,null,null,null,"Summary statistics"]
[]
[]
[null,null,null,null,null,null,null,2019,"5 year trend"]
[null,null,null,null,null,null,"Target Revenue",{"$f":"\"$\"&TEXT(Calculations!R10,\"#,##0\")&\"m\"","v":"$811m"}]
[null,null,null,null,null,null,"Actual Revenue",{"$f":"IF(Calculations!R11>0,\"$\"&TEXT(Calculations!R11,\"#,##0\")&\"m\",\" \")","v":"$812m"}]
[null,null,null,null,null,null,"Forecast RAB",{"$f":"\"$\"&TEXT(Calculations!R12,\"#,##0\")&\"m\"","v":"$4,539m"}]
[null,null,null,null,null,null,"Actual RAB",{"$f":"IF(Calculations!R13>0,\"$\"&TEXT(Calculations!R13,\"#,##0\")&\"m\",\" \")","v":"$4,235m"}]
[null,null,null,null,null,null,"Forecast Capex",{"$f":"\"$\"&TEXT(Calculations!R14,\"#,##0\")&\"m\"","v":"$382m"}]
[null,null,null,null,null,null,"Actual Capex",{"$f":"IF(Calculations!R15>0,\"$\"&TEXT(Calculations!R15,\"#,##0\")&\"m\",\" \")","v":"$370m"}]
{"$rows_left_out":115}
{"sheet":"Contents","index":2,"n_rows":20,"n_cols":3,"rows_kept":20,"cut":false,"hidden":false,"merged":[[2,1,2,11],[3,1,3,11]]}
[]
[]
[null,"Electricity Distribution Network Service Provider"]
[null,"Operational Performance Data"]
[]
[]
[null,null,"Contents"]
[]
[null,null,"1. Revenue"]
[null,null,"2. Regulated asset base"]
[null,null,"3. Capital expenditure"]
[null,null,"4. Operating expenditure"]
[null,null,"5. Network reliability - outage duration"]
[null,null,"6. Network reliability - outage frequency"]
[null,null,"7. Energy delivered"]
{"$rows_left_out":6}
{"sheet":"1. Revenue","index":3,"n_rows":79,"n_cols":17,"rows_kept":79,"cut":false,"hidden":false,"merged":[[3,1,3,13],[26,1,26,13],[28,1,28,16],[48,1,49,16],[47,1,47,16],[77,1,77,16],[78,1,78,16],[71,1,71,16],[69,1,70,16],[73,1,73,16],[74,1,74,16],[75,1,75,16],[76,1,76,16]]}
[]
[]
[]
[null,"Revenue"]
[]
[]
[]
[]
[]
[]
[]
[]
[]
[]
[]
{"$rows_left_out":65}
{"sheet":"2. RAB","index":4,"n_rows":76,"n_cols":17,"rows_kept":76,"cut":false,"hidden":false,"merged":[[75,1,75,16],[74,1,74,16],[3,1,3,13],[26,1,26,13],[28,1,28,16],[48,1,49,16],[47,1,47,16],[70,1,72,16],[69,1,69,16]]}
[]
[]
[]
[null,"Regulated asset base"]
[]
[]
[]
[]
[]
[]
[]
[]
[]
[]
[]
{"$rows_left_out":62}
{"sheet":"3. Capex","index":5,"n_rows":75,"n_cols":17,"rows_kept":75,"cut":false,"hidden":false,"merged":[[73,1,73,16],[74,1,74,16],[3,1,3,13],[26,1,26,13],[28,1,28,16],[48,1,49,16],[69,1,71,16]]}
[]
[]
[]
[null,"Capital expenditure"]
[]
[]
[]
[]
[]
[]
[]
[]
[]
[]
[]
{"$rows_left_out":61}
{"sheet":"4. Opex","index":6,"n_rows":75,"n_cols":17,"rows_kept":75,"cut":false,"hidden":false,"merged":[[70,1,71,16],[69,1,69,16],[73,1,73,16],[74,1,76,16],[3,1,3,13],[26,1,26,13],[28,1,28,16],[47,1,47,16],[48,1,49,16]]}
[]
[]
[]
[null,"Operating expenditure"]
[]
[]
[]
[]
[]
[]
[]
[]
[]
[]
[]
{"$rows_left_out":61}
{"sheet":"5. SAIDI","index":7,"n_rows":49,"n_cols":17,"rows_kept":49,"cut":false,"hidden":false,"merged":[[3,1,3,13],[26,1,26,13],[28,1,28,16],[48,1,49,16]]}
[]
[]
[]
[null,"Network reliability - outage duration"]
[]
[]
[]
[]
[]
[]
[]
[]
[]
[]
[]
{"$rows_left_out":35}
{"sheet":"6. SAIFI","index":8,"n_rows":49,"n_cols":17,"rows_kept":49,"cut":false,"hidden":false,"merged":[[3,1,3,13],[26,1,26,13],[28,1,28,16],[48,1,49,16]]}
[]
[]
[]
[null,"Network reliability - outage frequency"]
[]
[]
[]
[]
[]
[]
[]
[]
[]
[]
[]
{"$rows_left_out":35}
{"sheet":"7. Energy delivered","index":9,"n_rows":75,"n_cols":17,"rows_kept":75,"cut":false,"hidden":false,"merged":[[74,1,74,16],[3,1,3,13],[26,1,26,13],[28,1,28,16],[48,1,49,16],[70,1,71,16],[73,1,73,16]]}
[]
[]
[]
[null,"Energy delivered"]
[]
[]
[]
[]
[]
[]
[]
[]
[]
[]
[]
{"$rows_left_out":61}
{"sheet":"8. Customer numbers","index":10,"n_rows":84,"n_cols":17,"rows_kept":84,"cut":false,"hidden":false,"merged":[[3,1,3,13],[26,1,26,13],[28,1,28,16],[48,1,49,16]]}
[]
[]
[]
[null,"Customer numbers"]
[]
[]
[]
[]
[]
[]
[]
[]
[]
[]
[]
{"$rows_left_out":70}
{"sheet":"9. Circuit length","index":11,"n_rows":88,"n_cols":17,"rows_kept":88,"cut":false,"hidden":false,"merged":[[87,1,88,16],[3,1,3,13],[26,1,26,13],[28,1,28,16],[66,1,67,16]]}
[]
[]
[]
[null,"Circuit length"]
[]
[]
[]
[]
[]
[]
[]
[]
[]
[]
[]
{"$rows_left_out":74}
{"sheet":"10. Utilisation","index":12,"n_rows":49,"n_cols":17,"rows_kept":49,"cut":false,"hidden":false,"merged":[[3,1,3,13],[26,1,26,13],[28,1,28,16],[48,1,49,16]]}
[]
[]
[]
[null,"Network utilisation"]
[]
[]
[]
[]
[]
[]
[]
[]
[]
[]
[]
{"$rows_left_out":35}
{"sheet":"11. Reg service life","index":13,"n_rows":86,"n_cols":17,"rows_kept":86,"cut":false,"hidden":false,"merged":[[3,1,3,13],[26,1,26,13],[28,1,28,16],[85,1,86,16]]}
[]
[]
[]
[null,"Regulatory Service Life"]
[]
[]
[]
[]
[]
[]
[]
[]
[]
[]
[]
{"$rows_left_out":72}
{"sheet":"12. Return on assets","index":14,"n_rows":9,"n_cols":3,"rows_kept":9,"cut":false,"hidden":false,"merged":[[3,1,3,3]]}
[]
[]
[]
[null,"Return on assets"]
[]
[null,"This page has been removed."]
[]
[null,"For information on Return on Assets go to the ","Profitability measures for electricity and gas network businesses"]
[null,"webpage at www.aer.gov.au."]

{"sheet":"New data sheet","index":15,"n_rows":286,"n_cols":21,"rows_kept":286,"cut":false,"hidden":true,"merged":[]}
[]
[]
[]
[null,null,null,"Raw data"]
[]
[null,null,null,"Category","Year","Evoenergy","Ausgrid","Endeavour Energy","Essential Energy","Energex","Ergon Energy","SA Power Networks","TasNetworks (D)","AusNet (D)","CitiPower","Jemena Electricity","Powercor Australia","United Energy","Power and Water*","DNSP Total"]
[null,null,null,"Target Revenue","2006",141.12030171648811,831.31401446450548,717.31888460255834,796.5655423300791,851.70230622446559,1022.7203349365225,620.42370337976058,210.91316359566954,414.55924758379774,261.44278403023765,185.60004974669855,457.91839567419845,388.80133782712414,106.03272864997574,{"$f":"SUM(F7:S7)","v":7006.4327947620814},{"$f":"E7&D7","v":"2006Target Revenue"}]
[null,null,null,"Target Revenue","2007",146.88094830854081,894.98102768526269,745.14519208888305,826.45799480341225,927.07265359266319,1052.8802370247258,635.18865197167156,227.38395811707909,399.96309872168268,245.12944118434436,176.29858233456639,466.50436559308963,360.46763709478307,94.590640972443012,{"$f":"SUM(F8:S8)","v":7198.9444294931473},{"$f":"E8&D8","v":"2007Target Revenue"}]
[null,null,null,"Target Revenue","2008",153.48995218860964,947.2176749929522,771.18739719657515,853.11793011965153,1009.2014244480646,1095.3120749827351,649.65773804408832,240.43385589146843,416.13334206892785,229.10229733574738,182.16566177914206,474.66103701603629,367.76571152584057,96.658159242101632,7486.1042568319417,"2008Target Revenue"]
[null,null,null,"Target Revenue","2009",146.91472841379229,1004.5426825697974,806.61004801113211,904.84151065954654,1098.4883998989505,1091.7446102679203,662.59115675341502,261.72489960663245,413.98684958920501,230.53329232222927,193.18432317505247,486.8244944011322,348.44727920833532,103.40258715748645,7753.8368620346282,"2009Target Revenue"]
[null,null,null,"Target Revenue","2010",168.34856536657387,1525.1508267901547,933.16472364867207,1043.9405977375741,1127.6837792903098,1126.9545948226146,675.24280163465187,275.11370666602483,440.17405784182324,242.41055071002879,189.6068357088478,497.9862552956908,329.41504588812649,121.86763489042308,8697.0599762915153,"2010Target Revenue"]
[null,null,null,"Target Revenue","2011",176.89046839486261,1826.6487586015578,1079.9057577478607,1249.4776113424102,1281.4047010932766,1279.3650286534837,679.46216325361945,277.91480463307653,500.16073544064113,236.25725632589595,214.54444631200047,508.49294141735368,356.46912874054931,116.14768631796375,9783.1414882745503,"2011Target Revenue"]
[null,null,null,"Target Revenue","2012",181.1980016968358,2159.7496426970933,1213.6364421488781,1475.0838817011486,1407.1603294341689,1377.9237796832022,904.84526519209226,284.88281000624596,527.55462307408811,253.41548320820499,232.19063631525745,528.91573822947942,371.23562991881732,117.75560866527489,11035.547871970788,"2012Target Revenue"]
[null,null,null,"Target Revenue","2013",192.22925582405645,2555.0269800881265,1208.1135028834613,1646.6688341763418,1685.3995165017836,1544.9123263640579,929.2887493954338,313.22798275106078,554.78883768080857,264.79548828227337,255.88136078296424,566.57626267853948,386.89881265289671,123.10142532331723,12226.90933538512,"2013Target Revenue"]
[null,null,null,"Target Revenue","2014",207.51555635153883,2411.8684174786304,1138.4273335276573,1566.2895317607258,1871.0729582417575,1752.2323972403442,985.50038879234239,319.02606961324437,623.66302629159179,281.93469338309563,275.73186006886448,622.82708631122068,398.54809259540843,147.89879918070369,12602.536210837126,"2014Target Revenue"]
{"$rows_left_out":272}
{"sheet":"Calculations","index":16,"n_rows":29,"n_cols":21,"rows_kept":29,"cut":false,"hidden":true,"merged":[]}
[]
[]
[null,null,null,"Calculations"]
[]
[null,null,null,"Summary statistics"]
[]
[null,null,null,"Match",{"$f":"Dashboard!F3","v":"SA Power Networks"}]
[]
[null,null,null,null,"2006","2007","2008","2009","2010","2011","2012","2013","2014","2015",2016,2017,"2018","2019","2020","2021","2022"]
[null,null,null,"Target Revenue",{"$f":"INDEX('New data sheet'!$F:$T,MATCH(E$9&$D10,'New data sheet'!$U:$U,0),MATCH($E$7,'New data sheet'!$F$6:$T$6,0))","v":620.42370337976058},{"$f":"INDEX('New data sheet'!$F:$T,MATCH(F$9&$D10,'New data sheet'!$U:$U,0),MATCH($E$7,'New data sheet'!$F$6:$T$6,0))","v":635.18865197167156},{"$f":"INDEX('New data sheet'!$F:$T,MATCH(G$9&$D10,'New data sheet'!$U:$U,0),MATCH($E$7,'New data sheet'!$F$6:$T$6,0))","v":649.65773804408832},{"$f":"INDEX('New data sheet'!$F:$T,MATCH(H$9&$D10,'New data sheet'!$U:$U,0),MATCH($E$7,'New data sheet'!$F$6:$T$6,0))","v":662.59115675341502},{"$f":"INDEX('New data sheet'!$F:$T,MATCH(I$9&$D10,'New data sheet'!$U:$U,0),MATCH($E$7,'New data sheet'!$F$6:$T$6,0))","v":675.24280163465187},{"$f":"INDEX('New data sheet'!$F:$T,MATCH(J$9&$D10,'New data sheet'!$U:$U,0),MATCH($E$7,'New data sheet'!$F$6:$T$6,0))","v":679.46216325361945},{"$f":"INDEX('New data sheet'!$F:$T,MATCH(K$9&$D10,'New data sheet'!$U:$U,0),MATCH($E$7,'New data sheet'!$F$6:$T$6,0))","v":904.84526519209226},{"$f":"INDEX('New data sheet'!$F:$T,MATCH(L$9&$D10,'New data sheet'!$U:$U,0),MATCH($E$7,'New data sheet'!$F$6:$T$6,0))","v":929.2887493954338},{"$f":"INDEX('New data sheet'!$F:$T,MATCH(M$9&$D10,'New data sheet'!$U:$U,0),MATCH($E$7,'New data sheet'!$F$6:$T$6,0))","v":985.50038879234239},{"$f":"INDEX('New data sheet'!$F:$T,MATCH(N$9&$D10,'New data sheet'!$U:$U,0),MATCH($E$7,'New data sheet'!$F$6:$T$6,0))","v":986.3203887910463},{"$f":"INDEX('New data sheet'!$F:$T,MATCH(O$9&$D10,'New data sheet'!$U:$U,0),MATCH($E$7,'New data sheet'!$F$6:$T$6,0))","v":723.93182274695801},{"$f":"INDEX('New data sheet'!$F:$T,MATCH(P$9&$D10,'New data sheet'!$U:$U,0),MATCH($E$7,'New data sheet'!$F$6:$T$6,0))","v":793.68891544534108},{"$f":"INDEX('New data sheet'!$F:$T,MATCH(Q$9&$D10,'New data sheet'!$U:$U,0),MATCH($E$7,'New data sheet'!$F$6:$T$6,0))","v":810.24829686890064},{"$f":"INDEX('New data sheet'!$F:$T,MATCH(R$9&$D10,'New data sheet'!$U:$U,0),MATCH($E$7,'New data sheet'!$F$6:$T$6,0))","v":811.29972893532431},{"$f":"INDEX('New data sheet'!$F:$T,MATCH(S$9&$D10,'New data sheet'!$U:$U,0),MATCH($E$7,'New data sheet'!$F$6:$T$6,0))","v":{"$error":"#N/A"}},{"$f":"INDEX('New data sheet'!$F:$T,MATCH(T$9&$D10,'New data sheet'!$U:$U,0),MATCH($E$7,'New data sheet'!$F$6:$T$6,0))","v":{"$error":"#N/A"}},{"$f":"INDEX('New data sheet'!$F:$T,MATCH(U$9&$D10,'New data sheet'!$U:$U,0),MATCH($E$7,'New data sheet'!$F$6:$T$6,0))","v":{"$error":"#N/A"}}]
[null,null,null,"Actual Revenue",{"$f":"INDEX('New data sheet'!$F:$T,MATCH(E$9&$D11,'New data sheet'!$U:$U,0),MATCH($E$7,'New data sheet'!$F$6:$T$6,0))","v":627.48603908571181},{"$f":"INDEX('New data sheet'!$F:$T,MATCH(F$9&$D11,'New data sheet'!$U:$U,0),MATCH($E$7,'New data sheet'!$F$6:$T$6,0))","v":638.18497750327845},{"$f":"INDEX('New data sheet'!$F:$T,MATCH(G$9&$D11,'New data sheet'!$U:$U,0),MATCH($E$7,'New data sheet'!$F$6:$T$6,0))","v":644.88691003210124},{"$f":"INDEX('New data sheet'!$F:$T,MATCH(H$9&$D11,'New data sheet'!$U:$U,0),MATCH($E$7,'New data sheet'!$F$6:$T$6,0))","v":658.72343305051902},{"$f":"INDEX('New data sheet'!$F:$T,MATCH(I$9&$D11,'New data sheet'!$U:$U,0),MATCH($E$7,'New data sheet'!$F$6:$T$6,0))","v":674.1515478485469},{"$f":"INDEX('New data sheet'!$F:$T,MATCH(J$9&$D11,'New data sheet'!$U:$U,0),MATCH($E$7,'New data sheet'!$F$6:$T$6,0))","v":729.0871718970792},{"$f":"INDEX('New data sheet'!$F:$T,MATCH(K$9&$D11,'New data sheet'!$U:$U,0),MATCH($E$7,'New data sheet'!$F$6:$T$6,0))","v":892.5024819402239},{"$f":"INDEX('New data sheet'!$F:$T,MATCH(L$9&$D11,'New data sheet'!$U:$U,0),MATCH($E$7,'New data sheet'!$F$6:$T$6,0))","v":923.46036880053964},{"$f":"INDEX('New data sheet'!$F:$T,MATCH(M$9&$D11,'New data sheet'!$U:$U,0),MATCH($E$7,'New data sheet'!$F$6:$T$6,0))","v":935.17454239537346},{"$f":"INDEX('New data sheet'!$F:$T,MATCH(N$9&$D11,'New data sheet'!$U:$U,0),MATCH($E$7,'New data sheet'!$F$6:$T$6,0))","v":999.99277426646086},{"$f":"INDEX('New data sheet'!$F:$T,MATCH(O$9&$D11,'New data sheet'!$U:$U,0),MATCH($E$7,'New data sheet'!$F$6:$T$6,0))","v":720.72509916398155},{"$f":"INDEX('New data sheet'!$F:$T,MATCH(P$9&$D11,'New data sheet'!$U:$U,0),MATCH($E$7,'New data sheet'!$F$6:$T$6,0))","v":789.74143039642183},{"$f":"INDEX('New data sheet'!$F:$T,MATCH(Q$9&$D11,'New data sheet'!$U:$U,0),MATCH($E$7,'New data sheet'!$F$6:$T$6,0))","v":808.85772581162496},{"$f":"INDEX('New data sheet'!$F:$T,MATCH(R$9&$D11,'New data sheet'!$U:$U,0),MATCH($E$7,'New data sheet'!$F$6:$T$6,0))","v":812.03666651816638},{"$f":"INDEX('New data sheet'!$F:$T,MATCH(S$9&$D11,'New data sheet'!$U:$U,0),MATCH($E$7,'New data sheet'!$F$6:$T$6,0))","v":{"$error":"#N/A"}},{"$f":"INDEX('New data sheet'!$F:$T,MATCH(T$9&$D11,'New data sheet'!$U:$U,0),MATCH($E$7,'New data sheet'!$F$6:$T$6,0))","v":{"$error":"#N/A"}},{"$f":"INDEX('New data sheet'!$F:$T,MATCH(U$9&$D11,'New data sheet'!$U:$U,0),MATCH($E$7,'New data sheet'!$F$6:$T$6,0))","v":{"$error":"#N/A"}}]
[null,null,null,"Forecast RAB",{"$f":"INDEX('New data sheet'!$F:$T,MATCH(E$9&$D12,'New data sheet'!$U:$U,0),MATCH($E$7,'New data sheet'!$F$6:$T$6,0))","v":3477.0890386294454},{"$f":"INDEX('New data sheet'!$F:$T,MATCH(F$9&$D12,'New data sheet'!$U:$U,0),MATCH($E$7,'New data sheet'!$F$6:$T$6,0))","v":3474.2713003485469},{"$f":"INDEX('New data sheet'!$F:$T,MATCH(G$9&$D12,'New data sheet'!$U:$U,0),MATCH($E$7,'New data sheet'!$F$6:$T$6,0))","v":3460.1826089440519},{"$f":"INDEX('New data sheet'!$F:$T,MATCH(H$9&$D12,'New data sheet'!$U:$U,0),MATCH($E$7,'New data sheet'!$F$6:$T$6,0))","v":3457.364870663152},{"$f":"INDEX('New data sheet'!$F:$T,MATCH(I$9&$D12,'New data sheet'!$U:$U,0),MATCH($E$7,'New data sheet'!$F$6:$T$6,0))","v":3470.044692927198},{"$f":"INDEX('New data sheet'!$F:$T,MATCH(J$9&$D12,'New data sheet'!$U:$U,0),MATCH($E$7,'New data sheet'!$F$6:$T$6,0))","v":3660.125758263735},{"$f":"INDEX('New data sheet'!$F:$T,MATCH(K$9&$D12,'New data sheet'!$U:$U,0),MATCH($E$7,'New data sheet'!$F$6:$T$6,0))","v":3875.9739226270531},{"$f":"INDEX('New data sheet'!$F:$T,MATCH(L$9&$D12,'New data sheet'!$U:$U,0),MATCH($E$7,'New data sheet'!$F$6:$T$6,0))","v":4028.1209400620187},{"$f":"INDEX('New data sheet'!$F:$T,MATCH(M$9&$D12,'New data sheet'!$U:$U,0),MATCH($E$7,'New data sheet'!$F$6:$T$6,0))","v":4165.2764881142912},{"$f":"INDEX('New data sheet'!$F:$T,MATCH(N$9&$D12,'New data sheet'!$U:$U,0),MATCH($E$7,'New data sheet'!$F$6:$T$6,0))","v":4282.5724697500091},{"$f":"INDEX('New data sheet'!$F:$T,MATCH(O$9&$D12,'New data sheet'!$U:$U,0),MATCH($E$7,'New data sheet'!$F$6:$T$6,0))","v":4243.9036000533324},{"$f":"INDEX('New data sheet'!$F:$T,MATCH(P$9&$D12,'New data sheet'!$U:$U,0),MATCH($E$7,'New data sheet'!$F$6:$T$6,0))","v":4359.7332632589096},{"$f":"INDEX('New data sheet'!$F:$T,MATCH(Q$9&$D12,'New data sheet'!$U:$U,0),MATCH($E$7,'New data sheet'!$F$6:$T$6,0))","v":4455.6725793030055},{"$f":"INDEX('New data sheet'!$F:$T,MATCH(R$9&$D12,'New data sheet'!$U:$U,0),MATCH($E$7,'New data sheet'!$F$6:$T$6,0))","v":4539.0164039372357},{"$f":"INDEX('New data sheet'!$F:$T,MATCH(S$9&$D12,'New data sheet'!$U:$U,0),MATCH($E$7,'New data sheet'!$F$6:$T$6,0))","v":{"$error":"#N/A"}},{"$f":"INDEX('New data sheet'!$F:$T,MATCH(T$9&$D12,'New data sheet'!$U:$U,0),MATCH($E$7,'New data sheet'!$F$6:$T$6,0))","v":{"$error":"#N/A"}},{"$f":"INDEX('New data sheet'!$F:$T,MATCH(U$9&$D12,'New data sheet'!$U:$U,0),MATCH($E$7,'New data sheet'!$F$6:$T$6,0))","v":{"$error":"#N/A"}}]
[null,null,null,"Actual RAB",{"$f":"INDEX('New data sheet'!$F:$T,MATCH(E$9&$D13,'New data sheet'!$U:$U,0),MATCH($E$7,'New data sheet'!$F$6:$T$6,0))","v":3660.0828602804486},{"$f":"INDEX('New data sheet'!$F:$T,MATCH(F$9&$D13,'New data sheet'!$U:$U,0),MATCH($E$7,'New data sheet'!$F$6:$T$6,0))","v":3623.5820485111508},{"$f":"INDEX('New data sheet'!$F:$T,MATCH(G$9&$D13,'New data sheet'!$U:$U,0),MATCH($E$7,'New data sheet'!$F$6:$T$6,0))","v":3574.3654509727394},{"$f":"INDEX('New data sheet'!$F:$T,MATCH(H$9&$D13,'New data sheet'!$U:$U,0),MATCH($E$7,'New data sheet'!$F$6:$T$6,0))","v":3572.865207105348},{"$f":"INDEX('New data sheet'!$F:$T,MATCH(I$9&$D13,'New data sheet'!$U:$U,0),MATCH($E$7,'New data sheet'!$F$6:$T$6,0))","v":3483.3443367703594},{"$f":"INDEX('New data sheet'!$F:$T,MATCH(J$9&$D13,'New data sheet'!$U:$U,0),MATCH($E$7,'New data sheet'!$F$6:$T$6,0))","v":3599.7955824226583},{"$f":"INDEX('New data sheet'!$F:$T,MATCH(K$9&$D13,'New data sheet'!$U:$U,0),MATCH($E$7,'New data sheet'!$F$6:$T$6,0))","v":3762.2453321760154},{"$f":"INDEX('New data sheet'!$F:$T,MATCH(L$9&$D13,'New data sheet'!$U:$U,0),MATCH($E$7,'New data sheet'!$F$6:$T$6,0))","v":3909.481307209297},{"$f":"INDEX('New data sheet'!$F:$T,MATCH(M$9&$D13,'New data sheet'!$U:$U,0),MATCH($E$7,'New data sheet'!$F$6:$T$6,0))","v":3985.1980977637681},{"$f":"INDEX('New data sheet'!$F:$T,MATCH(N$9&$D13,'New data sheet'!$U:$U,0),MATCH($E$7,'New data sheet'!$F$6:$T$6,0))","v":4044.1888224837721},{"$f":"INDEX('New data sheet'!$F:$T,MATCH(O$9&$D13,'New data sheet'!$U:$U,0),MATCH($E$7,'New data sheet'!$F$6:$T$6,0))","v":4089.2282393648352},{"$f":"INDEX('New data sheet'!$F:$T,MATCH(P$9&$D13,'New data sheet'!$U:$U,0),MATCH($E$7,'New data sheet'!$F$6:$T$6,0))","v":4078.3601639748517},{"$f":"INDEX('New data sheet'!$F:$T,MATCH(Q$9&$D13,'New data sheet'!$U:$U,0),MATCH($E$7,'New data sheet'!$F$6:$T$6,0))","v":4161.8020462238565},{"$f":"INDEX('New data sheet'!$F:$T,MATCH(R$9&$D13,'New data sheet'!$U:$U,0),MATCH($E$7,'New data sheet'!$F$6:$T$6,0))","v":4234.6598132146119},{"$f":"INDEX('New data sheet'!$F:$T,MATCH(S$9&$D13,'New data sheet'!$U:$U,0),MATCH($E$7,'New data sheet'!$F$6:$T$6,0))","v":{"$error":"#N/A"}},{"$f":"INDEX('New data sheet'!$F:$T,MATCH(T$9&$D13,'New data sheet'!$U:$U,0),MATCH($E$7,'New data sheet'!$F$6:$T$6,0))","v":{"$error":"#N/A"}},{"$f":"INDEX('New data sheet'!$F:$T,MATCH(U$9&$D13,'New data sheet'!$U:$U,0),MATCH($E$7,'New data sheet'!$F$6:$T$6,0))","v":{"$error":"#N/A"}}]
[null,null,null,"Forecast Capex",{"$f":"INDEX('New data sheet'!$F:$T,MATCH(E$9&$D14,'New data sheet'!$U:$U,0),MATCH($E$7,'New data sheet'!$F$6:$T$6,0))","v":208.51263278653079},{"$f":"INDEX('New data sheet'!$F:$T,MATCH(F$9&$D14,'New data sheet'!$U:$U,0),MATCH($E$7,'New data sheet'!$F$6:$T$6,0))","v":209.92150192698031},{"$f":"INDEX('New data sheet'!$F:$T,MATCH(G$9&$D14,'New data sheet'!$U:$U,0),MATCH($E$7,'New data sheet'!$F$6:$T$6,0))","v":202.87715622473263},{"$f":"INDEX('New data sheet'!$F:$T,MATCH(H$9&$D14,'New data sheet'!$U:$U,0),MATCH($E$7,'New data sheet'!$F$6:$T$6,0))","v":217.31643422453206},{"$f":"INDEX('New data sheet'!$F:$T,MATCH(I$9&$D14,'New data sheet'!$U:$U,0),MATCH($E$7,'New data sheet'!$F$6:$T$6,0))","v":228.23680075282425},{"$f":"INDEX('New data sheet'!$F:$T,MATCH(J$9&$D14,'New data sheet'!$U:$U,0),MATCH($E$7,'New data sheet'!$F$6:$T$6,0))","v":363.43546201587213},{"$f":"INDEX('New data sheet'!$F:$T,MATCH(K$9&$D14,'New data sheet'!$U:$U,0),MATCH($E$7,'New data sheet'!$F$6:$T$6,0))","v":417.06377052692227},{"$f":"INDEX('New data sheet'!$F:$T,MATCH(L$9&$D14,'New data sheet'!$U:$U,0),MATCH($E$7,'New data sheet'!$F$6:$T$6,0))","v":372.11337944424304},{"$f":"INDEX('New data sheet'!$F:$T,MATCH(M$9&$D14,'New data sheet'!$U:$U,0),MATCH($E$7,'New data sheet'!$F$6:$T$6,0))","v":374.39017312505297},{"$f":"INDEX('New data sheet'!$F:$T,MATCH(N$9&$D14,'New data sheet'!$U:$U,0),MATCH($E$7,'New data sheet'!$F$6:$T$6,0))","v":370.34331128164951},{"$f":"INDEX('New data sheet'!$F:$T,MATCH(O$9&$D14,'New data sheet'!$U:$U,0),MATCH($E$7,'New data sheet'!$F$6:$T$6,0))","v":413.08448327532932},{"$f":"INDEX('New data sheet'!$F:$T,MATCH(P$9&$D14,'New data sheet'!$U:$U,0),MATCH($E$7,'New data sheet'!$F$6:$T$6,0))","v":404.46514279132185},{"$f":"INDEX('New data sheet'!$F:$T,MATCH(Q$9&$D14,'New data sheet'!$U:$U,0),MATCH($E$7,'New data sheet'!$F$6:$T$6,0))","v":388.20822633858188},{"$f":"INDEX('New data sheet'!$F:$T,MATCH(R$9&$D14,'New data sheet'!$U:$U,0),MATCH($E$7,'New data sheet'!$F$6:$T$6,0))","v":381.72942221736963},{"$f":"INDEX('New data sheet'!$F:$T,MATCH(S$9&$D14,'New data sheet'!$U:$U,0),MATCH($E$7,'New data sheet'!$F$6:$T$6,0))","v":{"$error":"#N/A"}},{"$f":"INDEX('New data sheet'!$F:$T,MATCH(T$9&$D14,'New data sheet'!$U:$U,0),MATCH($E$7,'New data sheet'!$F$6:$T$6,0))","v":{"$error":"#N/A"}},{"$f":"INDEX('New data sheet'!$F:$T,MATCH(U$9&$D14,'New data sheet'!$U:$U,0),MATCH($E$7,'New data sheet'!$F$6:$T$6,0))","v":{"$error":"#N/A"}}]
[null,null,null,"Actual Capex",{"$f":"INDEX('New data sheet'!$F:$T,MATCH(E$9&$D15,'New data sheet'!$U:$U,0),MATCH($E$7,'New data sheet'!$F$6:$T$6,0))","v":195.24221286218278},{"$f":"INDEX('New data sheet'!$F:$T,MATCH(F$9&$D15,'New data sheet'!$U:$U,0),MATCH($E$7,'New data sheet'!$F$6:$T$6,0))","v":156.26964012830607},{"$f":"INDEX('New data sheet'!$F:$T,MATCH(G$9&$D15,'New data sheet'!$U:$U,0),MATCH($E$7,'New data sheet'!$F$6:$T$6,0))","v":146.7181816357139},{"$f":"INDEX('New data sheet'!$F:$T,MATCH(H$9&$D15,'New data sheet'!$U:$U,0),MATCH($E$7,'New data sheet'!$F$6:$T$6,0))","v":202.95117388472426},{"$f":"INDEX('New data sheet'!$F:$T,MATCH(I$9&$D15,'New data sheet'!$U:$U,0),MATCH($E$7,'New data sheet'!$F$6:$T$6,0))","v":184.84751377035195},{"$f":"INDEX('New data sheet'!$F:$T,MATCH(J$9&$D15,'New data sheet'!$U:$U,0),MATCH($E$7,'New data sheet'!$F$6:$T$6,0))","v":304.41574127252795},{"$f":"INDEX('New data sheet'!$F:$T,MATCH(K$9&$D15,'New data sheet'!$U:$U,0),MATCH($E$7,'New data sheet'!$F$6:$T$6,0))","v":360.19429293192707},{"$f":"INDEX('New data sheet'!$F:$T,MATCH(L$9&$D15,'New data sheet'!$U:$U,0),MATCH($E$7,'New data sheet'!$F$6:$T$6,0))","v":361.68727875185675},{"$f":"INDEX('New data sheet'!$F:$T,MATCH(M$9&$D15,'New data sheet'!$U:$U,0),MATCH($E$7,'New data sheet'!$F$6:$T$6,0))","v":305.36481905867566},{"$f":"INDEX('New data sheet'!$F:$T,MATCH(N$9&$D15,'New data sheet'!$U:$U,0),MATCH($E$7,'New data sheet'!$F$6:$T$6,0))","v":330.61835815496755},{"$f":"INDEX('New data sheet'!$F:$T,MATCH(O$9&$D15,'New data sheet'!$U:$U,0),MATCH($E$7,'New data sheet'!$F$6:$T$6,0))","v":260.33625050335155},{"$f":"INDEX('New data sheet'!$F:$T,MATCH(P$9&$D15,'New data sheet'!$U:$U,0),MATCH($E$7,'New data sheet'!$F$6:$T$6,0))","v":279.56243960513962},{"$f":"INDEX('New data sheet'!$F:$T,MATCH(Q$9&$D15,'New data sheet'!$U:$U,0),MATCH($E$7,'New data sheet'!$F$6:$T$6,0))","v":374.2537088449219},{"$f":"INDEX('New data sheet'!$F:$T,MATCH(R$9&$D15,'New data sheet'!$U:$U,0),MATCH($E$7,'New data sheet'!$F$6:$T$6,0))","v":370.08142614587996},{"$f":"INDEX('New data sheet'!$F:$T,MATCH(S$9&$D15,'New data sheet'!$U:$U,0),MATCH($E$7,'New data sheet'!$F$6:$T$6,0))","v":{"$error":"#N/A"}},{"$f":"INDEX('New data sheet'!$F:$T,MATCH(T$9&$D15,'New data sheet'!$U:$U,0),MATCH($E$7,'New data sheet'!$F$6:$T$6,0))","v":{"$error":"#N/A"}},{"$f":"INDEX('New data sheet'!$F:$T,MATCH(U$9&$D15,'New data sheet'!$U:$U,0),MATCH($E$7,'New data sheet'!$F$6:$T$6,0))","v":{"$error":"#N/A"}}]
{"$rows_left_out":14}