{"text_format":"1","workbook":"xlsx","n_sheets":17,"sheets":["Calculations","New data sheet","Introduction","Contents","Dashboard","1. Revenue","2. RAB","3. Capex","4. Opex","5. SAIDI","6. SAIFI","7. Energy delivered","8. Customer numbers","9. Circuit length","10. Utilisation","11. Reg service life","12. Return on assets"],"not_rendered":{"charts":24,"images":1,"macros":1,"external_links":6,"defined_names":350,"comments":0,"pivot_tables":0},"unopened":[],"bounds":{"document_bytes":16777216,"sheet_cells":100000,"rows_first":2000,"rows_last":500,"rows_between":2000,"halvings":0,"cell_chars":16384,"cell_head_chars":4096},"cells_cut":0,"cells_raw":0,"read":"whole","date_system":"1900"}

{"sheet":"Calculations","index":0,"n_rows":32,"n_cols":21,"rows_kept":32,"cut":false,"hidden":true,"merged":[]}
[]
[]
[null,null,null,"Calculations"]
[]
[null,null,null,"Summary statistics"]
[]
[null,null,null,"Match",{"$f":"Dashboard!F3","v":"DNSP Total"}]
[]
[null,null,null,null,"2006","2007","2008","2009","2010","2011","2012","2013","2014","2015",2016,2017,"2018","2019","2020","2021","2022"]
[null,null,null,"Target Revenue",{"$f":"INDEX('New data sheet'!$F:$T,MATCH(E$9&$D10,'New data sheet'!$U:$U,0),MATCH($E$7,'New data sheet'!$F$6:$T$6,0))","v":6879.6109067557081},{"$f":"INDEX('New data sheet'!$F:$T,MATCH(F$9&$D10,'New data sheet'!$U:$U,0),MATCH($E$7,'New data sheet'!$F$6:$T$6,0))","v":7069.0305924005679},{"$f":"INDEX('New data sheet'!$F:$T,MATCH(G$9&$D10,'New data sheet'!$U:$U,0),MATCH($E$7,'New data sheet'!$F$6:$T$6,0))","v":7350.6460676570523},{"$f":"INDEX('New data sheet'!$F:$T,MATCH(H$9&$D10,'New data sheet'!$U:$U,0),MATCH($E$7,'New data sheet'!$F$6:$T$6,0))","v":7613.4975081055218},{"$f":"INDEX('New data sheet'!$F:$T,MATCH(I$9&$D10,'New data sheet'!$U:$U,0),MATCH($E$7,'New data sheet'!$F$6:$T$6,0))","v":8539.6348118920505},{"$f":"INDEX('New data sheet'!$F:$T,MATCH(J$9&$D10,'New data sheet'!$U:$U,0),MATCH($E$7,'New data sheet'!$F$6:$T$6,0))","v":9604.9274811442065},{"$f":"INDEX('New data sheet'!$F:$T,MATCH(K$9&$D10,'New data sheet'!$U:$U,0),MATCH($E$7,'New data sheet'!$F$6:$T$6,0))","v":10835.214854273287},{"$f":"INDEX('New data sheet'!$F:$T,MATCH(L$9&$D10,'New data sheet'!$U:$U,0),MATCH($E$7,'New data sheet'!$F$6:$T$6,0))","v":12005.573906783404},{"$f":"INDEX('New data sheet'!$F:$T,MATCH(M$9&$D10,'New data sheet'!$U:$U,0),MATCH($E$7,'New data sheet'!$F$6:$T$6,0))","v":12374.175142312935},{"$f":"INDEX('New data sheet'!$F:$T,MATCH(N$9&$D10,'New data sheet'!$U:$U,0),MATCH($E$7,'New data sheet'!$F$6:$T$6,0))","v":12331.118670633858},{"$f":"INDEX('New data sheet'!$F:$T,MATCH(O$9&$D10,'New data sheet'!$U:$U,0),MATCH($E$7,'New data sheet'!$F$6:$T$6,0))","v":9942.5180512714414},{"$f":"INDEX('New data sheet'!$F:$T,MATCH(P$9&$D10,'New data sheet'!$U:$U,0),MATCH($E$7,'New data sheet'!$F$6:$T$6,0))","v":10054.722819015842},{"$f":"INDEX('New data sheet'!$F:$T,MATCH(Q$9&$D10,'New data sheet'!$U:$U,0),MATCH($E$7,'New data sheet'!$F$6:$T$6,0))","v":9680.4743811527042},{"$f":"INDEX('New data sheet'!$F:$T,MATCH(R$9&$D10,'New data sheet'!$U:$U,0),MATCH($E$7,'New data sheet'!$F$6:$T$6,0))","v":{"$error":"#N/A"}},{"$f":"INDEX('New data sheet'!$F:$T,MATCH(S$9&$D10,'New data sheet'!$U:$U,0),MATCH($E$7,'New data sheet'!$F$6:$T$6,0))","v":{"$error":"#N/A"}},{"$f":"INDEX('New data sheet'!$F:$T,MATCH(T$9&$D10,'New data sheet'!$U:$U,0),MATCH($E$7,'New data sheet'!$F$6:$T$6,0))","v":{"$error":"#N/A"}},{"$f":"INDEX('New data sheet'!$F:$T,MATCH(U$9&$D10,'New data sheet'!$U:$U,0),MATCH($E$7,'New data sheet'!$F$6:$T$6,0))","v":{"$error":"#N/A"}}]
[null,null,null,"Actual Revenue",{"$f":"INDEX('New data sheet'!$F:$T,MATCH(E$9&$D11,'New data sheet'!$U:$U,0),MATCH($E$7,'New data sheet'!$F$6:$T$6,0))","v":7212.2179986596848},{"$f":"INDEX('New data sheet'!$F:$T,MATCH(F$9&$D11,'New data sheet'!$U:$U,0),MATCH($E$7,'New data sheet'!$F$6:$T$6,0))","v":7386.1630081376179},{"$f":"INDEX('New data sheet'!$F:$T,MATCH(G$9&$D11,'New data sheet'!$U:$U,0),MATCH($E$7,'New data sheet'!$F$6:$T$6,0))","v":7653.2361283983},{"$f":"INDEX('New data sheet'!$F:$T,MATCH(H$9&$D11,'New data sheet'!$U:$U,0),MATCH($E$7,'New data sheet'!$F$6:$T$6,0))","v":7982.5445361921002},{"$f":"INDEX('New data sheet'!$F:$T,MATCH(I$9&$D11,'New data sheet'!$U:$U,0),MATCH($E$7,'New data sheet'!$F$6:$T$6,0))","v":8687.7529322208684},{"$f":"INDEX('New data sheet'!$F:$T,MATCH(J$9&$D11,'New data sheet'!$U:$U,0),MATCH($E$7,'New data sheet'!$F$6:$T$6,0))","v":9470.9252860780307},{"$f":"INDEX('New data sheet'!$F:$T,MATCH(K$9&$D11,'New data sheet'!$U:$U,0),MATCH($E$7,'New data sheet'!$F$6:$T$6,0))","v":10569.547036241675},{"$f":"INDEX('New data sheet'!$F:$T,MATCH(L$9&$D11,'New data sheet'!$U:$U,0),MATCH($E$7,'New data sheet'!$F$6:$T$6,0))","v":11777.363345190352},{"$f":"INDEX('New data sheet'!$F:$T,MATCH(M$9&$D11,'New data sheet'!$U:$U,0),MATCH($E$7,'New data sheet'!$F$6:$T$6,0))","v":12071.107104013112},{"$f":"INDEX('New data sheet'!$F:$T,MATCH(N$9&$D11,'New data sheet'!$U:$U,0),MATCH($E$7,'New data sheet'!$F$6:$T$6,0))","v":12523.814218185584},{"$f":"INDEX('New data sheet'!$F:$T,MATCH(O$9&$D11,'New data sheet'!$U:$U,0),MATCH($E$7,'New data sheet'!$F$6:$T$6,0))","v":10033.151654400948},{"$f":"INDEX('New data sheet'!$F:$T,MATCH(P$9&$D11,'New data sheet'!$U:$U,0),MATCH($E$7,'New data sheet'!$F$6:$T$6,0))","v":10290.838092791073},{"$f":"INDEX('New data sheet'!$F:$T,MATCH(Q$9&$D11,'New data sheet'!$U:$U,0),MATCH($E$7,'New data sheet'!$F$6:$T$6,0))","v":9762.203267869616},{"$f":"INDEX('New data sheet'!$F:$T,MATCH(R$9&$D11,'New data sheet'!$U:$U,0),MATCH($E$7,'New data sheet'!$F$6:$T$6,0))","v":{"$error":"#N/A"}},{"$f":"INDEX('New data sheet'!$F:$T,MATCH(S$9&$D11,'New data sheet'!$U:$U,0),MATCH($E$7,'New data sheet'!$F$6:$T$6,0))","v":{"$error":"#N/A"}},{"$f":"INDEX('New data sheet'!$F:$T,MATCH(T$9&$D11,'New data sheet'!$U:$U,0),MATCH($E$7,'New data sheet'!$F$6:$T$6,0))","v":{"$error":"#N/A"}},{"$f":"INDEX('New data sheet'!$F:$T,MATCH(U$9&$D11,'New data sheet'!$U:$U,0),MATCH($E$7,'New data sheet'!$F$6:$T$6,0))","v":{"$error":"#N/A"}}]
[null,null,null,"Forecast RAB",{"$f":"INDEX('New data sheet'!$F:$T,MATCH(E$9&$D12,'New data sheet'!$U:$U,0),MATCH($E$7,'New data sheet'!$F$6:$T$6,0))","v":41400.00434417963},{"$f":"INDEX('New data sheet'!$F:$T,MATCH(F$9&$D12,'New data sheet'!$U:$U,0),MATCH($E$7,'New data sheet'!$F$6:$T$6,0))","v":43968.240781219814},{"$f":"INDEX('New data sheet'!$F:$T,MATCH(G$9&$D12,'New data sheet'!$U:$U,0),MATCH($E$7,'New data sheet'!$F$6:$T$6,0))","v":46587.613424152099},{"$f":"INDEX('New data sheet'!$F:$T,MATCH(H$9&$D12,'New data sheet'!$U:$U,0),MATCH($E$7,'New data sheet'!$F$6:$T$6,0))","v":49221.023126601409},{"$f":"INDEX('New data sheet'!$F:$T,MATCH(I$9&$D12,'New data sheet'!$U:$U,0),MATCH($E$7,'New data sheet'!$F$6:$T$6,0))","v":54949.186200483324},{"$f":"INDEX('New data sheet'!$F:$T,MATCH(J$9&$D12,'New data sheet'!$U:$U,0),MATCH($E$7,'New data sheet'!$F$6:$T$6,0))","v":60656.682417146927},{"$f":"INDEX('New data sheet'!$F:$T,MATCH(K$9&$D12,'New data sheet'!$U:$U,0),MATCH($E$7,'New data sheet'!$F$6:$T$6,0))","v":66119.378672873281},{"$f":"INDEX('New data sheet'!$F:$T,MATCH(L$9&$D12,'New data sheet'!$U:$U,0),MATCH($E$7,'New data sheet'!$F$6:$T$6,0))","v":71420.994322677914},{"$f":"INDEX('New data sheet'!$F:$T,MATCH(M$9&$D12,'New data sheet'!$U:$U,0),MATCH($E$7,'New data sheet'!$F$6:$T$6,0))","v":76368.194157724414},{"$f":"INDEX('New data sheet'!$F:$T,MATCH(N$9&$D12,'New data sheet'!$U:$U,0),MATCH($E$7,'New data sheet'!$F$6:$T$6,0))","v":75907.89872100894},{"$f":"INDEX('New data sheet'!$F:$T,MATCH(O$9&$D12,'New data sheet'!$U:$U,0),MATCH($E$7,'New data sheet'!$F$6:$T$6,0))","v":73039.954390644125},{"$f":"INDEX('New data sheet'!$F:$T,MATCH(P$9&$D12,'New data sheet'!$U:$U,0),MATCH($E$7,'New data sheet'!$F$6:$T$6,0))","v":74832.063982222884},{"$f":"INDEX('New data sheet'!$F:$T,MATCH(Q$9&$D12,'New data sheet'!$U:$U,0),MATCH($E$7,'New data sheet'!$F$6:$T$6,0))","v":76188.440300035028},{"$f":"INDEX('New data sheet'!$F:$T,MATCH(R$9&$D12,'New data sheet'!$U:$U,0),MATCH($E$7,'New data sheet'!$F$6:$T$6,0))","v":{"$error":"#N/A"}},{"$f":"INDEX('New data sheet'!$F:$T,MATCH(S$9&$D12,'New data sheet'!$U:$U,0),MATCH($E$7,'New data sheet'!$F$6:$T$6,0))","v":{"$error":"#N/A"}},{"$f":"INDEX('New data sheet'!$F:$T,MATCH(T$9&$D12,'New data sheet'!$U:$U,0),MATCH($E$7,'New data sheet'!$F$6:$T$6,0))","v":{"$error":"#N/A"}},{"$f":"INDEX('New data sheet'!$F:$T,MATCH(U$9&$D12,'New data sheet'!$U:$U,0),MATCH($E$7,'New data sheet'!$F$6:$T$6,0))","v":{"$error":"#N/A"}}]
[null,null,null,"Actual RAB",{"$f":"INDEX('New data sheet'!$F:$T,MATCH(E$9&$D13,'New data sheet'!$U:$U,0),MATCH($E$7,'New data sheet'!$F$6:$T$6,0))","v":40919.776216796388},{"$f":"INDEX('New data sheet'!$F:$T,MATCH(F$9&$D13,'New data sheet'!$U:$U,0),MATCH($E$7,'New data sheet'!$F$6:$T$6,0))","v":43915.843385788787},{"$f":"INDEX('New data sheet'!$F:$T,MATCH(G$9&$D13,'New data sheet'!$U:$U,0),MATCH($E$7,'New data sheet'!$F$6:$T$6,0))","v":46308.865397655565},{"$f":"INDEX('New data sheet'!$F:$T,MATCH(H$9&$D13,'New data sheet'!$U:$U,0),MATCH($E$7,'New data sheet'!$F$6:$T$6,0))","v":49907.737565838303},{"$f":"INDEX('New data sheet'!$F:$T,MATCH(I$9&$D13,'New data sheet'!$U:$U,0),MATCH($E$7,'New data sheet'!$F$6:$T$6,0))","v":54800.547086111896},{"$f":"INDEX('New data sheet'!$F:$T,MATCH(J$9&$D13,'New data sheet'!$U:$U,0),MATCH($E$7,'New data sheet'!$F$6:$T$6,0))","v":59213.084654294769},{"$f":"INDEX('New data sheet'!$F:$T,MATCH(K$9&$D13,'New data sheet'!$U:$U,0),MATCH($E$7,'New data sheet'!$F$6:$T$6,0))","v":63879.887848669176},{"$f":"INDEX('New data sheet'!$F:$T,MATCH(L$9&$D13,'New data sheet'!$U:$U,0),MATCH($E$7,'New data sheet'!$F$6:$T$6,0))","v":67530.545003597581},{"$f":"INDEX('New data sheet'!$F:$T,MATCH(M$9&$D13,'New data sheet'!$U:$U,0),MATCH($E$7,'New data sheet'!$F$6:$T$6,0))","v":69636.882395101245},{"$f":"INDEX('New data sheet'!$F:$T,MATCH(N$9&$D13,'New data sheet'!$U:$U,0),MATCH($E$7,'New data sheet'!$F$6:$T$6,0))","v":70792.575146814328},{"$f":"INDEX('New data sheet'!$F:$T,MATCH(O$9&$D13,'New data sheet'!$U:$U,0),MATCH($E$7,'New data sheet'!$F$6:$T$6,0))","v":71479.092601814278},{"$f":"INDEX('New data sheet'!$F:$T,MATCH(P$9&$D13,'New data sheet'!$U:$U,0),MATCH($E$7,'New data sheet'!$F$6:$T$6,0))","v":72002.04774845767},{"$f":"INDEX('New data sheet'!$F:$T,MATCH(Q$9&$D13,'New data sheet'!$U:$U,0),MATCH($E$7,'New data sheet'!$F$6:$T$6,0))","v":73002.757439121953},{"$f":"INDEX('New data sheet'!$F:$T,MATCH(R$9&$D13,'New data sheet'!$U:$U,0),MATCH($E$7,'New data sheet'!$F$6:$T$6,0))","v":{"$error":"#N/A"}},{"$f":"INDEX('New data sheet'!$F:$T,MATCH(S$9&$D13,'New data sheet'!$U:$U,0),MATCH($E$7,'New data sheet'!$F$6:$T$6,0))","v":{"$error":"#N/A"}},{"$f":"INDEX('New data sheet'!$F:$T,MATCH(T$9&$D13,'New data sheet'!$U:$U,0),MATCH($E$7,'New data sheet'!$F$6:$T$6,0))","v":{"$error":"#N/A"}},{"$f":"INDEX('New data sheet'!$F:$T,MATCH(U$9&$D13,'New data sheet'!$U:$U,0),MATCH($E$7,'New data sheet'!$F$6:$T$6,0))","v":{"$error":"#N/A"}}]
[null,null,null,"Forecast Capex",{"$f":"INDEX('New data sheet'!$F:$T,MATCH(E$9&$D14,'New data sheet'!$U:$U,0),MATCH($E$7,'New data sheet'!$F$6:$T$6,0))","v":3924.1314041415135},{"$f":"INDEX('New data sheet'!$F:$T,MATCH(F$9&$D14,'New data sheet'!$U:$U,0),MATCH($E$7,'New data sheet'!$F$6:$T$6,0))","v":4448.7091163680088},{"$f":"INDEX('New data sheet'!$F:$T,MATCH(G$9&$D14,'New data sheet'!$U:$U,0),MATCH($E$7,'New data sheet'!$F$6:$T$6,0))","v":4706.9270510935366},{"$f":"INDEX('New data sheet'!$F:$T,MATCH(H$9&$D14,'New data sheet'!$U:$U,0),MATCH($E$7,'New data sheet'!$F$6:$T$6,0))","v":4864.6390856214975},{"$f":"INDEX('New data sheet'!$F:$T,MATCH(I$9&$D14,'New data sheet'!$U:$U,0),MATCH($E$7,'New data sheet'!$F$6:$T$6,0))","v":6343.6296549766312},{"$f":"INDEX('New data sheet'!$F:$T,MATCH(J$9&$D14,'New data sheet'!$U:$U,0),MATCH($E$7,'New data sheet'!$F$6:$T$6,0))","v":7688.7481962221509},{"$f":"INDEX('New data sheet'!$F:$T,MATCH(K$9&$D14,'New data sheet'!$U:$U,0),MATCH($E$7,'New data sheet'!$F$6:$T$6,0))","v":7876.7310545150003},{"$f":"INDEX('New data sheet'!$F:$T,MATCH(L$9&$D14,'New data sheet'!$U:$U,0),MATCH($E$7,'New data sheet'!$F$6:$T$6,0))","v":7813.6698534051629},{"$f":"INDEX('New data sheet'!$F:$T,MATCH(M$9&$D14,'New data sheet'!$U:$U,0),MATCH($E$7,'New data sheet'!$F$6:$T$6,0))","v":7754.3924917862514},{"$f":"INDEX('New data sheet'!$F:$T,MATCH(N$9&$D14,'New data sheet'!$U:$U,0),MATCH($E$7,'New data sheet'!$F$6:$T$6,0))","v":6033.9130166845734},{"$f":"INDEX('New data sheet'!$F:$T,MATCH(O$9&$D14,'New data sheet'!$U:$U,0),MATCH($E$7,'New data sheet'!$F$6:$T$6,0))","v":4719.6409041109719},{"$f":"INDEX('New data sheet'!$F:$T,MATCH(P$9&$D14,'New data sheet'!$U:$U,0),MATCH($E$7,'New data sheet'!$F$6:$T$6,0))","v":4734.2556859007045},{"$f":"INDEX('New data sheet'!$F:$T,MATCH(Q$9&$D14,'New data sheet'!$U:$U,0),MATCH($E$7,'New data sheet'!$F$6:$T$6,0))","v":4426.2676520973237},{"$f":"INDEX('New data sheet'!$F:$T,MATCH(R$9&$D14,'New data sheet'!$U:$U,0),MATCH($E$7,'New data sheet'!$F$6:$T$6,0))","v":{"$error":"#N/A"}},{"$f":"INDEX('New data sheet'!$F:$T,MATCH(S$9&$D14,'New data sheet'!$U:$U,0),MATCH($E$7,'New data sheet'!$F$6:$T$6,0))","v":{"$error":"#N/A"}},{"$f":"INDEX('New data sheet'!$F:$T,MATCH(T$9&$D14,'New data sheet'!$U:$U,0),MATCH($E$7,'New data sheet'!$F$6:$T$6,0))","v":{"$error":"#N/A"}},{"$f":"INDEX('New data sheet'!$F:$T,MATCH(U$9&$D14,'New data sheet'!$U:$U,0),MATCH($E$7,'New data sheet'!$F$6:$T$6,0))","v":{"$error":"#N/A"}}]
[null,null,null,"Actual Capex",{"$f":"INDEX('New data sheet'!$F:$T,MATCH(E$9&$D15,'New data sheet'!$U:$U,0),MATCH($E$7,'New data sheet'!$F$6:$T$6,0))","v":4439.5269942094083},{"$f":"INDEX('New data sheet'!$F:$T,MATCH(F$9&$D15,'New data sheet'!$U:$U,0),MATCH($E$7,'New data sheet'!$F$6:$T$6,0))","v":4788.7610395591346},{"$f":"INDEX('New data sheet'!$F:$T,MATCH(G$9&$D15,'New data sheet'!$U:$U,0),MATCH($E$7,'New data sheet'!$F$6:$T$6,0))","v":4784.0068503368766},{"$f":"INDEX('New data sheet'!$F:$T,MATCH(H$9&$D15,'New data sheet'!$U:$U,0),MATCH($E$7,'New data sheet'!$F$6:$T$6,0))","v":5748.0648624694122},{"$f":"INDEX('New data sheet'!$F:$T,MATCH(I$9&$D15,'New data sheet'!$U:$U,0),MATCH($E$7,'New data sheet'!$F$6:$T$6,0))","v":6179.9149137019849},{"$f":"INDEX('New data sheet'!$F:$T,MATCH(J$9&$D15,'New data sheet'!$U:$U,0),MATCH($E$7,'New data sheet'!$F$6:$T$6,0))","v":6832.4476800618622},{"$f":"INDEX('New data sheet'!$F:$T,MATCH(K$9&$D15,'New data sheet'!$U:$U,0),MATCH($E$7,'New data sheet'!$F$6:$T$6,0))","v":6952.9528338400614},{"$f":"INDEX('New data sheet'!$F:$T,MATCH(L$9&$D15,'New data sheet'!$U:$U,0),MATCH($E$7,'New data sheet'!$F$6:$T$6,0))","v":6338.937831148538},{"$f":"INDEX('New data sheet'!$F:$T,MATCH(M$9&$D15,'New data sheet'!$U:$U,0),MATCH($E$7,'New data sheet'!$F$6:$T$6,0))","v":5319.7806834984622},{"$f":"INDEX('New data sheet'!$F:$T,MATCH(N$9&$D15,'New data sheet'!$U:$U,0),MATCH($E$7,'New data sheet'!$F$6:$T$6,0))","v":4792.8679054710392},{"$f":"INDEX('New data sheet'!$F:$T,MATCH(O$9&$D15,'New data sheet'!$U:$U,0),MATCH($E$7,'New data sheet'!$F$6:$T$6,0))","v":3589.6598584754179},{"$f":"INDEX('New data sheet'!$F:$T,MATCH(P$9&$D15,'New data sheet'!$U:$U,0),MATCH($E$7,'New data sheet'!$F$6:$T$6,0))","v":3651.2381138477208},{"$f":"INDEX('New data sheet'!$F:$T,MATCH(Q$9&$D15,'New data sheet'!$U:$U,0),MATCH($E$7,'New data sheet'!$F$6:$T$6,0))","v":4000.2234548554334},{"$f":"INDEX('New data sheet'!$F:$T,MATCH(R$9&$D15,'New data sheet'!$U:$U,0),MATCH($E$7,'New data sheet'!$F$6:$T$6,0))","v":{"$error":"#N/A"}},{"$f":"INDEX('New data sheet'!$F:$T,MATCH(S$9&$D15,'New data sheet'!$U:$U,0),MATCH($E$7,'New data sheet'!$F$6:$T$6,0))","v":{"$error":"#N/A"}},{"$f":"INDEX('New data sheet'!$F:$T,MATCH(T$9&$D15,'New data sheet'!$U:$U,0),MATCH($E$7,'New data sheet'!$F$6:$T$6,0))","v":{"$error":"#N/A"}},{"$f":"INDEX('New data sheet'!$F:$T,MATCH(U$9&$D15,'New data sheet'!$U:$U,0),MATCH($E$7,'New data sheet'!$F$6:$T$6,0))","v":{"$error":"#N/A"}}]
{"$rows_left_out":18}
{"sheet":"New data sheet","index":1,"n_rows":281,"n_cols":30,"rows_kept":281,"cut":false,"hidden":true,"merged":[]}
[]
[]
[]
[null,null,null,"Raw data"]
[]
[null,null,null,"Category","Year","Evoenergy","Ausgrid","Endeavour Energy","Essential Energy","Energex","Ergon Energy","SA Power Networks","TasNetworks (D)","AusNet (D)","CitiPower","Jemena Electricity","Powercor Australia","United Energy","Power and Water*","DNSP Total"]
[null,null,null,"Target Revenue","2006",138.42846138184609,815.72229089224277,703.86519854977212,781.62554429431839,836.77325615917709,1004.7935981278139,609.54861655452066,207.21617562729671,407.08909973500471,256.73171736826151,182.25563077538871,449.666937919232,381.7953344770479,104.09904489378627,6879.6109067557081,{"$f":"E7&D7","v":"2006Target Revenue"}]
[null,null,null,"Target Revenue","2007",144.12612028421867,878.19519640696194,731.16960927167975,810.95734838719397,910.82247561557415,1034.4248428612721,624.05475798443479,223.39826209399268,392.75596608882915,240.71233270488889,173.1217710989043,458.09819300521764,353.97219269329543,93.221523904104757,7069.0305924005679,{"$f":"E8&D8","v":"2007Target Revenue"}]
[null,null,null,"Target Revenue","2008",150.61116888410086,929.45211842313461,756.72337937624889,837.11726285129714,991.51165364265955,1076.1129150356176,638.27022291623064,236.21941494683281,408.63482983410211,224.97398987771578,178.88312874099449,466.10788533690391,361.13875951638317,94.88933827482974,7350.6460676570523,"2008Target Revenue"]
[null,null,null,"Target Revenue","2009",144.15926682615452,985.70196588435033,791.48166008506041,887.87074093181639,1079.2335637920396,1072.6079825682139,650.97693840541137,257.13725894744528,406.5270160626057,226.37919905871334,189.70323943467599,478.05216337538349,342.1684355729156,101.49807716073649,7613.4975081055218,"2009Target Revenue"]
[null,null,null,"Target Revenue","2010",165.19110109998942,1496.5458355551193,915.66273743725378,1024.3609528108957,1107.9171924491068,1107.2007894795306,663.40681913447929,270.29138051938116,432.24234407486176,238.04243526099341,186.190216482182,489.0127949871648,323.47915346564753,120.09105913544342,8539.6348118920505,"2010Target Revenue"]
[null,null,null,"Target Revenue","2011",173.57279632655676,1792.3890179834816,1059.6515676753627,1226.0430136009943,1258.9436195666608,1256.9396994921578,667.55222174172297,273.04337948613403,491.1480921003257,232.00002012771489,210.67846396224246,499.33015594195047,350.04573543611264,113.58969770278935,9604.9274811442065,"2011Target Revenue"]
[null,null,null,"Target Revenue","2012",177.7995396173489,2119.2424230083693,1190.8740640414908,1447.417921872237,1382.4949424151657,1353.7708650524717,888.98469963219611,279.88924629009807,518.04835574162303,248.84906444473094,228.00667855170656,519.38494429072284,364.54615173591316,115.90595757921179,10835.214854273287,"2012Target Revenue"]
[null,null,null,"Target Revenue","2013",188.62389687766472,2507.106129843748,1185.4547103536486,1615.7847099695873,1655.8570184035843,1517.8323557003503,912.99972661899722,307.73757113403735,544.79182358332605,260.02400758635019,251.27050815347772,556.36684514776528,379.92709184366225,121.79751156720641,12005.573906783404,"2013Target Revenue"]
[null,null,null,"Target Revenue","2014",203.62349494600539,2366.6325799928309,1117.0755410850641,1536.9129628728977,1838.2758862305038,1721.5184200757412,968.22606120614637,313.43402632466785,612.42493416995671,276.8543728847585,270.76331148783169,611.60405740499459,391.36645765687189,145.46303597466593,12374.175142312935,"2014Target Revenue"]
{"$rows_left_out":267}
{"sheet":"Introduction","index":2,"n_rows":28,"n_cols":11,"rows_kept":28,"cut":false,"hidden":false,"merged":[[9,2,9,15],[11,2,15,15],[19,2,19,15],[16,2,16,15]]}
[]
[null,null,null,"Electricity Distribution Network Service Provider"]
[null,null,null,null,"Performance Data"]
[]
[]
[null,"Introduction"]
[]
[]
[]
[null,null,"This workbook contains performance data for the electricity distribution businesses regulated by the AER. Charts and data are presented for a range of financial and network performance measures.  "]
[null,null,"Interpretation"]
[null,null,"The data covers the regulatory years from 2006 to 2018. It is reported on an end of year basis. Victorian distribution businesses report on a calendar year basis, and so is for the year ending 31 December. All other distribution businesses report on a financial year basis, so refers to data collected for the year ending 30 June. \n\nAll financial values have been converted to June 2018 dollars.\n\nAny changes in service classification between regulatory periods have not been adjusted for in the data contained in this report."]
[]
[]
[]
{"$rows_left_out":14}
{"sheet":"Contents","index":3,"n_rows":21,"n_cols":3,"rows_kept":21,"cut":false,"hidden":false,"merged":[[2,1,2,11],[3,1,3,11]]}
[]
[]
[null,"Electricity Distribution Network Service Provider"]
[null,"Performance Data"]
[]
[]
[null,null,"Contents"]
[]
[null,null,"A. Dashboard"]
[null,null,"1. Revenue"]
[null,null,"2. Regulated asset base"]
[null,null,"3. Capital expenditure"]
[null,null,"4. Operating expenditure"]
[null,null,"5. Network reliability - outage duration"]
[null,null,"6. Network reliability - outage frequency"]
{"$rows_left_out":7}
{"sheet":"Dashboard","index":4,"n_rows":132,"n_cols":23,"rows_kept":132,"cut":false,"hidden":false,"merged":[[2,5,2,9]]}
[]
[]
[null,null,null,null,null,"DNSP Total"]
[]
[]
[null,null,null,null,null,null,"Summary statistics"]
[]
[]
[null,null,null,null,null,null,null,"2018 value","5 year trend"]
[null,null,null,null,null,null,"Target Revenue",{"$f":"\"$\"&TEXT(Calculations!Q10,\"#,##0\")&\"m\"","v":"$9,680m"}]
[null,null,null,null,null,null,"Actual Revenue",{"$f":"\"$\"&TEXT(Calculations!Q11,\"#,##0\")&\"m\"","v":"$9,762m"}]
[null,null,null,null,null,null,"Forecast RAB",{"$f":"\"$\"&TEXT(Calculations!Q12,\"#,##0\")&\"m\"","v":"$76,188m"}]
[null,null,null,null,null,null,"Actual RAB",{"$f":"\"$\"&TEXT(Calculations!Q13,\"#,##0\")&\"m\"","v":"$73,003m"}]
[null,null,null,null,null,null,"Forecast Capex",{"$f":"\"$\"&TEXT(Calculations!Q14,\"#,##0\")&\"m\"","v":"$4,426m"}]
[null,null,null,null,null,null,"Actual Capex",{"$f":"\"$\"&TEXT(Calculations!Q15,\"#,##0\")&\"m\"","v":"$4,000m"}]
{"$rows_left_out":118}
{"sheet":"1. Revenue","index":5,"n_rows":78,"n_cols":16,"rows_kept":78,"cut":false,"hidden":false,"merged":[[77,1,77,15],[3,1,3,13],[26,1,26,13],[28,1,28,15],[47,1,47,15],[48,1,49,15],[69,1,70,15],[71,1,71,15],[73,1,73,15],[74,1,74,15],[75,1,75,15],[76,1,76,15]]}
[]
[]
[]
[null,"Revenue"]
[]
[]
[]
[]
[]
[]
[]
[]
[]
[]
[]
{"$rows_left_out":64}
{"sheet":"2. RAB","index":6,"n_rows":77,"n_cols":16,"rows_kept":77,"cut":false,"hidden":false,"merged":[[76,1,76,15],[74,1,74,15],[75,1,75,15],[3,1,3,13],[26,1,26,13],[28,1,28,15],[48,1,49,15],[70,1,72,15],[69,1,69,15]]}
[]
[]
[]
[null,"Regulated asset base"]
[]
[]
[]
[]
[]
[]
[]
[]
[]
[]
[]
{"$rows_left_out":63}
{"sheet":"3. Capex","index":7,"n_rows":76,"n_cols":16,"rows_kept":76,"cut":false,"hidden":false,"merged":[[74,1,74,15],[75,1,75,15],[3,1,3,13],[26,1,26,13],[28,1,28,15],[70,1,72,15],[48,1,49,15]]}
[]
[]
[]
[null,"Capital expenditure"]
[]
[]
[]
[]
[]
[]
[]
[]
[]
[]
[]
{"$rows_left_out":62}
{"sheet":"4. Opex","index":8,"n_rows":76,"n_cols":16,"rows_kept":76,"cut":false,"hidden":false,"merged":[[70,1,70,15],[71,1,72,15],[75,1,77,15],[74,1,74,15],[3,1,3,13],[26,1,26,13],[28,1,28,15],[47,1,47,15],[48,1,49,15]]}
[]
[]
[]
[null,"Operating expenditure"]
[]
[]
[]
[]
[]
[]
[]
[]
[]
[]
[]
{"$rows_left_out":62}
{"sheet":"5. SAIDI","index":9,"n_rows":84,"n_cols":16,"rows_kept":84,"cut":false,"hidden":false,"merged":[[3,1,3,13],[26,1,26,13],[48,1,49,15],[28,1,28,15]]}
[]
[]
[]
[null,"Network reliability - outage duration"]
[]
[]
[]
[]
[]
[]
[]
[]
[]
[]
[]
{"$rows_left_out":70}
{"sheet":"6. SAIFI","index":10,"n_rows":84,"n_cols":16,"rows_kept":84,"cut":false,"hidden":false,"merged":[[3,1,3,13],[26,1,26,13],[48,1,49,15],[28,1,28,15]]}
[]
[]
[]
[null,"Network reliability - outage frequency"]
[]
[]
[]
[]
[]
[]
[]
[]
[]
[]
[]
{"$rows_left_out":70}
{"sheet":"7. Energy delivered","index":11,"n_rows":75,"n_cols":16,"rows_kept":75,"cut":false,"hidden":false,"merged":[[74,1,74,14],[3,1,3,13],[26,1,26,13],[48,1,49,14],[70,1,71,14],[73,1,73,14],[28,1,28,15]]}
[]
[]
[]
[null,"Energy delivered"]
[]
[]
[]
[]
[]
[]
[]
[]
[]
[]
[]
{"$rows_left_out":61}
{"sheet":"8. Customer numbers","index":12,"n_rows":84,"n_cols":16,"rows_kept":84,"cut":false,"hidden":false,"merged":[[3,1,3,13],[26,1,26,13],[48,1,49,14],[28,1,28,15]]}
[]
[]
[]
[null,"Customer numbers"]
[]
[]
[]
[]
[]
[]
[]
[]
[]
[]
[]
{"$rows_left_out":70}
{"sheet":"9. Circuit length","index":13,"n_rows":87,"n_cols":16,"rows_kept":87,"cut":false,"hidden":false,"merged":[[86,1,87,14],[3,1,3,13],[26,1,26,13],[28,1,28,15]]}
[]
[]
[]
[null,"Circuit length"]
[]
[]
[]
[]
[]
[]
[]
[]
[]
[]
[]
{"$rows_left_out":73}
{"sheet":"10. Utilisation","index":14,"n_rows":83,"n_cols":16,"rows_kept":83,"cut":false,"hidden":false,"merged":[[52,1,53,15],[3,1,3,13],[26,1,26,13],[48,1,49,14],[51,1,51,15],[28,1,28,15]]}
[]
[]
[]
[null,"Network utilisation"]
[]
[]
[]
[]
[]
[]
[]
[]
[]
[]
[]
{"$rows_left_out":69}
{"sheet":"11. Reg service life","index":15,"n_rows":86,"n_cols":16,"rows_kept":86,"cut":false,"hidden":false,"merged":[[3,1,3,13],[26,1,26,13],[85,1,86,14],[28,1,28,15]]}
[]
[]
[]
[null,"Regulatory Service Life"]
[]
[]
[]
[]
[]
[]
[]
[]
[]
[]
[]
{"$rows_left_out":72}
{"sheet":"12. Return on assets","index":16,"n_rows":83,"n_cols":8,"rows_kept":83,"cut":false,"hidden":false,"merged":[[82,1,82,9],[3,1,3,8],[79,1,79,9]]}
[]
[]
[]
[null,"Return on assets"]
[]
[]
[]
[]
[]
[]
[]
[]
[]
[]
[]
{"$rows_left_out":68}