{"text_format":"1","workbook":"xlsx","n_sheets":17,"sheets":["New data sheet","Calculations","Introduction","Dashboard","Contents","1. Revenue","2. RAB - Closing","3. Capex","4. Capex by Driver","5. Opex","6. Reliability -outage events","7. Reliability -outage duration","8. Market impact","9. Maximum demand","10. Energy delivered","11. Circuit length","12. Return on assets"],"not_rendered":{"charts":22,"images":2,"macros":1,"external_links":5,"defined_names":348,"comments":0,"pivot_tables":0},"unopened":[],"bounds":{"document_bytes":16777216,"sheet_cells":100000,"rows_first":2000,"rows_last":500,"rows_between":2000,"halvings":0,"cell_chars":16384,"cell_head_chars":4096},"cells_cut":0,"cells_raw":0,"read":"whole","date_system":"1900"}

{"sheet":"New data sheet","index":0,"n_rows":227,"n_cols":12,"rows_kept":227,"cut":false,"hidden":true,"merged":[[0,3,0,12]]}
[null,null,null,"This sheet contains the data, as reported in the tables on worksheets 1-12, reformatted for presentation on the Dashboard."]
[]
[]
[null,null,null,"Raw data"]
[]
[null,null,null,"Category","Year","Powerlink","Transgrid","AusNet (T)","ElectraNet","TasNetworks (T)","Transmission total",{"$f":"D6&E6","v":"CategoryYear"}]
[null,null,null,"Actual Revenue","2006",524.43109000144091,442.14759870463524,457.00205241091709,204.68199901278044,161.53776893958144,1789.800509069355,{"$f":"D7&E7","v":"Actual Revenue2006"}]
[null,null,null,"Actual Revenue","2007",556.81118232983226,428.86815563942804,501.49371289907765,225.03862439427624,138.96735974822522,1851.1790350108395,{"$f":"D8&E8","v":"Actual Revenue2007"}]
[null,null,null,"Actual Revenue","2008",602.32788722541363,441.2820921956548,509.02960279439526,231.93793453347348,151.80866929448166,1936.3861860434188,"Actual Revenue2008"]
[null,null,null,"Actual Revenue","2009",627.96699530738965,542.36931513484524,479.74628692122536,259.59490428746028,163.33800535491272,2073.0155070058331,"Actual Revenue2009"]
[null,null,null,"Actual Revenue","2010",707.35852778910271,660.52056994090231,570.78363351286453,251.12987072423661,192.09981097052099,2381.8924129376273,"Actual Revenue2010"]
[null,null,null,"Actual Revenue","2011",804.47573327091129,746.67637495176916,569.35035616253583,290.49637116951084,229.02615261128855,2640.0249881660156,"Actual Revenue2011"]
[null,null,null,"Actual Revenue","2012",890.03687921150242,768.82805140067501,599.02342934853164,335.647041210711,240.36836748681193,2833.9037686582319,"Actual Revenue2012"]
[null,null,null,"Actual Revenue","2013",879.96579623707089,804.71735403020557,674.18669548291825,347.49686249516668,237.85154827939371,2944.2182565247549,"Actual Revenue2013"]
[null,null,null,"Actual Revenue","2014",904.01442974213751,753.59312302858166,593.53490582093468,299.23732185142592,233.28809656587211,2783.6678770089516,"Actual Revenue2014"]
{"$rows_left_out":213}
{"sheet":"Calculations","index":1,"n_rows":31,"n_cols":21,"rows_kept":31,"cut":false,"hidden":true,"merged":[]}
[]
[]
[null,null,null,"Calculations"]
[]
[null,null,null,"Summary statistics"]
[]
[null,null,null,"Match",{"$f":"Dashboard!F3","v":"Powerlink"}]
[]
[null,null,null,null,"2006","2007","2008","2009","2010","2011","2012","2013","2014","2015",2016,2017,"2018","2019","2020","2021","2022"]
[null,null,null,"Actual revenue",{"$f":"INDEX('New data sheet'!$F:$K,MATCH($D10&E$9,'New data sheet'!$L:$L,0),MATCH($E$7,'New data sheet'!$F$6:$K$6,0))","v":524.43109000144091},{"$f":"INDEX('New data sheet'!$F:$K,MATCH($D10&F$9,'New data sheet'!$L:$L,0),MATCH($E$7,'New data sheet'!$F$6:$K$6,0))","v":556.81118232983226},{"$f":"INDEX('New data sheet'!$F:$K,MATCH($D10&G$9,'New data sheet'!$L:$L,0),MATCH($E$7,'New data sheet'!$F$6:$K$6,0))","v":602.32788722541363},{"$f":"INDEX('New data sheet'!$F:$K,MATCH($D10&H$9,'New data sheet'!$L:$L,0),MATCH($E$7,'New data sheet'!$F$6:$K$6,0))","v":627.96699530738965},{"$f":"INDEX('New data sheet'!$F:$K,MATCH($D10&I$9,'New data sheet'!$L:$L,0),MATCH($E$7,'New data sheet'!$F$6:$K$6,0))","v":707.35852778910271},{"$f":"INDEX('New data sheet'!$F:$K,MATCH($D10&J$9,'New data sheet'!$L:$L,0),MATCH($E$7,'New data sheet'!$F$6:$K$6,0))","v":804.47573327091129},{"$f":"INDEX('New data sheet'!$F:$K,MATCH($D10&K$9,'New data sheet'!$L:$L,0),MATCH($E$7,'New data sheet'!$F$6:$K$6,0))","v":890.03687921150242},{"$f":"INDEX('New data sheet'!$F:$K,MATCH($D10&L$9,'New data sheet'!$L:$L,0),MATCH($E$7,'New data sheet'!$F$6:$K$6,0))","v":879.96579623707089},{"$f":"INDEX('New data sheet'!$F:$K,MATCH($D10&M$9,'New data sheet'!$L:$L,0),MATCH($E$7,'New data sheet'!$F$6:$K$6,0))","v":904.01442974213751},{"$f":"INDEX('New data sheet'!$F:$K,MATCH($D10&N$9,'New data sheet'!$L:$L,0),MATCH($E$7,'New data sheet'!$F$6:$K$6,0))","v":884.11022807428935},{"$f":"INDEX('New data sheet'!$F:$K,MATCH($D10&O$9,'New data sheet'!$L:$L,0),MATCH($E$7,'New data sheet'!$F$6:$K$6,0))","v":989.87155633956502},{"$f":"INDEX('New data sheet'!$F:$K,MATCH($D10&P$9,'New data sheet'!$L:$L,0),MATCH($E$7,'New data sheet'!$F$6:$K$6,0))","v":1104.8789738732394},{"$f":"INDEX('New data sheet'!$F:$K,MATCH($D10&Q$9,'New data sheet'!$L:$L,0),MATCH($E$7,'New data sheet'!$F$6:$K$6,0))","v":733.02707159824888},{"$f":"INDEX('New data sheet'!$F:$K,MATCH($D10&R$9,'New data sheet'!$L:$L,0),MATCH($E$7,'New data sheet'!$F$6:$K$6,0))","v":676.40572543279154},{"$f":"INDEX('New data sheet'!$F:$K,MATCH($D10&S$9,'New data sheet'!$L:$L,0),MATCH($E$7,'New data sheet'!$F$6:$K$6,0))","v":{"$error":"#N/A"}},{"$f":"INDEX('New data sheet'!$F:$K,MATCH($D10&T$9,'New data sheet'!$L:$L,0),MATCH($E$7,'New data sheet'!$F$6:$K$6,0))","v":{"$error":"#N/A"}},{"$f":"INDEX('New data sheet'!$F:$K,MATCH($D10&U$9,'New data sheet'!$L:$L,0),MATCH($E$7,'New data sheet'!$F$6:$K$6,0))","v":{"$error":"#N/A"}}]
[null,null,null,"Actual closing RAB",{"$f":"INDEX('New data sheet'!$F:$K,MATCH($D11&E$9,'New data sheet'!$L:$L,0),MATCH($E$7,'New data sheet'!$F$6:$K$6,0))","v":4077.6155941802708},{"$f":"INDEX('New data sheet'!$F:$K,MATCH($D11&F$9,'New data sheet'!$L:$L,0),MATCH($E$7,'New data sheet'!$F$6:$K$6,0))","v":4967.1106419925763},{"$f":"INDEX('New data sheet'!$F:$K,MATCH($D11&G$9,'New data sheet'!$L:$L,0),MATCH($E$7,'New data sheet'!$F$6:$K$6,0))","v":5647.7787127380516},{"$f":"INDEX('New data sheet'!$F:$K,MATCH($D11&H$9,'New data sheet'!$L:$L,0),MATCH($E$7,'New data sheet'!$F$6:$K$6,0))","v":6215.6072014084457},{"$f":"INDEX('New data sheet'!$F:$K,MATCH($D11&I$9,'New data sheet'!$L:$L,0),MATCH($E$7,'New data sheet'!$F$6:$K$6,0))","v":6539.1693452536529},{"$f":"INDEX('New data sheet'!$F:$K,MATCH($D11&J$9,'New data sheet'!$L:$L,0),MATCH($E$7,'New data sheet'!$F$6:$K$6,0))","v":6807.0853796527899},{"$f":"INDEX('New data sheet'!$F:$K,MATCH($D11&K$9,'New data sheet'!$L:$L,0),MATCH($E$7,'New data sheet'!$F$6:$K$6,0))","v":7375.9608582949795},{"$f":"INDEX('New data sheet'!$F:$K,MATCH($D11&L$9,'New data sheet'!$L:$L,0),MATCH($E$7,'New data sheet'!$F$6:$K$6,0))","v":7665.0058667139956},{"$f":"INDEX('New data sheet'!$F:$K,MATCH($D11&M$9,'New data sheet'!$L:$L,0),MATCH($E$7,'New data sheet'!$F$6:$K$6,0))","v":7774.2271447588764},{"$f":"INDEX('New data sheet'!$F:$K,MATCH($D11&N$9,'New data sheet'!$L:$L,0),MATCH($E$7,'New data sheet'!$F$6:$K$6,0))","v":7676.1389520505281},{"$f":"INDEX('New data sheet'!$F:$K,MATCH($D11&O$9,'New data sheet'!$L:$L,0),MATCH($E$7,'New data sheet'!$F$6:$K$6,0))","v":7532.0974080649585},{"$f":"INDEX('New data sheet'!$F:$K,MATCH($D11&P$9,'New data sheet'!$L:$L,0),MATCH($E$7,'New data sheet'!$F$6:$K$6,0))","v":7332.9072273140655},{"$f":"INDEX('New data sheet'!$F:$K,MATCH($D11&Q$9,'New data sheet'!$L:$L,0),MATCH($E$7,'New data sheet'!$F$6:$K$6,0))","v":7240.6760998105319},{"$f":"INDEX('New data sheet'!$F:$K,MATCH($D11&R$9,'New data sheet'!$L:$L,0),MATCH($E$7,'New data sheet'!$F$6:$K$6,0))","v":7129.226180824674},{"$f":"INDEX('New data sheet'!$F:$K,MATCH($D11&S$9,'New data sheet'!$L:$L,0),MATCH($E$7,'New data sheet'!$F$6:$K$6,0))","v":{"$error":"#N/A"}},{"$f":"INDEX('New data sheet'!$F:$K,MATCH($D11&T$9,'New data sheet'!$L:$L,0),MATCH($E$7,'New data sheet'!$F$6:$K$6,0))","v":{"$error":"#N/A"}},{"$f":"INDEX('New data sheet'!$F:$K,MATCH($D11&U$9,'New data sheet'!$L:$L,0),MATCH($E$7,'New data sheet'!$F$6:$K$6,0))","v":{"$error":"#N/A"}}]
[null,null,null,"Forecast closing RAB",{"$f":"INDEX('New data sheet'!$F:$K,MATCH($D12&E$9,'New data sheet'!$L:$L,0),MATCH($E$7,'New data sheet'!$F$6:$K$6,0))","v":4065.1239096922081},{"$f":"INDEX('New data sheet'!$F:$K,MATCH($D12&F$9,'New data sheet'!$L:$L,0),MATCH($E$7,'New data sheet'!$F$6:$K$6,0))","v":4000.9141389623915},{"$f":"INDEX('New data sheet'!$F:$K,MATCH($D12&G$9,'New data sheet'!$L:$L,0),MATCH($E$7,'New data sheet'!$F$6:$K$6,0))","v":5726.4434099391283},{"$f":"INDEX('New data sheet'!$F:$K,MATCH($D12&H$9,'New data sheet'!$L:$L,0),MATCH($E$7,'New data sheet'!$F$6:$K$6,0))","v":6372.0035634484138},{"$f":"INDEX('New data sheet'!$F:$K,MATCH($D12&I$9,'New data sheet'!$L:$L,0),MATCH($E$7,'New data sheet'!$F$6:$K$6,0))","v":6709.8732698010836},{"$f":"INDEX('New data sheet'!$F:$K,MATCH($D12&J$9,'New data sheet'!$L:$L,0),MATCH($E$7,'New data sheet'!$F$6:$K$6,0))","v":7093.8991275224989},{"$f":"INDEX('New data sheet'!$F:$K,MATCH($D12&K$9,'New data sheet'!$L:$L,0),MATCH($E$7,'New data sheet'!$F$6:$K$6,0))","v":7373.5411703545069},{"$f":"INDEX('New data sheet'!$F:$K,MATCH($D12&L$9,'New data sheet'!$L:$L,0),MATCH($E$7,'New data sheet'!$F$6:$K$6,0))","v":7935.3327279826763},{"$f":"INDEX('New data sheet'!$F:$K,MATCH($D12&M$9,'New data sheet'!$L:$L,0),MATCH($E$7,'New data sheet'!$F$6:$K$6,0))","v":8329.1690300001355},{"$f":"INDEX('New data sheet'!$F:$K,MATCH($D12&N$9,'New data sheet'!$L:$L,0),MATCH($E$7,'New data sheet'!$F$6:$K$6,0))","v":8501.0718265244213},{"$f":"INDEX('New data sheet'!$F:$K,MATCH($D12&O$9,'New data sheet'!$L:$L,0),MATCH($E$7,'New data sheet'!$F$6:$K$6,0))","v":8704.3131537107147},{"$f":"INDEX('New data sheet'!$F:$K,MATCH($D12&P$9,'New data sheet'!$L:$L,0),MATCH($E$7,'New data sheet'!$F$6:$K$6,0))","v":8963.7503786162906},{"$f":"INDEX('New data sheet'!$F:$K,MATCH($D12&Q$9,'New data sheet'!$L:$L,0),MATCH($E$7,'New data sheet'!$F$6:$K$6,0))","v":7240.6760998105319},{"$f":"INDEX('New data sheet'!$F:$K,MATCH($D12&R$9,'New data sheet'!$L:$L,0),MATCH($E$7,'New data sheet'!$F$6:$K$6,0))","v":7129.226180824674},{"$f":"INDEX('New data sheet'!$F:$K,MATCH($D12&S$9,'New data sheet'!$L:$L,0),MATCH($E$7,'New data sheet'!$F$6:$K$6,0))","v":{"$error":"#N/A"}},{"$f":"INDEX('New data sheet'!$F:$K,MATCH($D12&T$9,'New data sheet'!$L:$L,0),MATCH($E$7,'New data sheet'!$F$6:$K$6,0))","v":{"$error":"#N/A"}},{"$f":"INDEX('New data sheet'!$F:$K,MATCH($D12&U$9,'New data sheet'!$L:$L,0),MATCH($E$7,'New data sheet'!$F$6:$K$6,0))","v":{"$error":"#N/A"}}]
[null,null,null,"Actual annual capex",{"$f":"INDEX('New data sheet'!$F:$K,MATCH($D13&E$9,'New data sheet'!$L:$L,0),MATCH($E$7,'New data sheet'!$F$6:$K$6,0))","v":367.80804317063115},{"$f":"INDEX('New data sheet'!$F:$K,MATCH($D13&F$9,'New data sheet'!$L:$L,0),MATCH($E$7,'New data sheet'!$F$6:$K$6,0))","v":329.27439532679745},{"$f":"INDEX('New data sheet'!$F:$K,MATCH($D13&G$9,'New data sheet'!$L:$L,0),MATCH($E$7,'New data sheet'!$F$6:$K$6,0))","v":859.35005486491582},{"$f":"INDEX('New data sheet'!$F:$K,MATCH($D13&H$9,'New data sheet'!$L:$L,0),MATCH($E$7,'New data sheet'!$F$6:$K$6,0))","v":778.79102461828234},{"$f":"INDEX('New data sheet'!$F:$K,MATCH($D13&I$9,'New data sheet'!$L:$L,0),MATCH($E$7,'New data sheet'!$F$6:$K$6,0))","v":542.33474408578684},{"$f":"INDEX('New data sheet'!$F:$K,MATCH($D13&J$9,'New data sheet'!$L:$L,0),MATCH($E$7,'New data sheet'!$F$6:$K$6,0))","v":502.11468482390939},{"$f":"INDEX('New data sheet'!$F:$K,MATCH($D13&K$9,'New data sheet'!$L:$L,0),MATCH($E$7,'New data sheet'!$F$6:$K$6,0))","v":729.40779383510721},{"$f":"INDEX('New data sheet'!$F:$K,MATCH($D13&L$9,'New data sheet'!$L:$L,0),MATCH($E$7,'New data sheet'!$F$6:$K$6,0))","v":507.09149703568022},{"$f":"INDEX('New data sheet'!$F:$K,MATCH($D13&M$9,'New data sheet'!$L:$L,0),MATCH($E$7,'New data sheet'!$F$6:$K$6,0))","v":348.91345324570295},{"$f":"INDEX('New data sheet'!$F:$K,MATCH($D13&N$9,'New data sheet'!$L:$L,0),MATCH($E$7,'New data sheet'!$F$6:$K$6,0))","v":172.29422034264124},{"$f":"INDEX('New data sheet'!$F:$K,MATCH($D13&O$9,'New data sheet'!$L:$L,0),MATCH($E$7,'New data sheet'!$F$6:$K$6,0))","v":141.16642992726759},{"$f":"INDEX('New data sheet'!$F:$K,MATCH($D13&P$9,'New data sheet'!$L:$L,0),MATCH($E$7,'New data sheet'!$F$6:$K$6,0))","v":180.07103453201665},{"$f":"INDEX('New data sheet'!$F:$K,MATCH($D13&Q$9,'New data sheet'!$L:$L,0),MATCH($E$7,'New data sheet'!$F$6:$K$6,0))","v":153.53567846646644},{"$f":"INDEX('New data sheet'!$F:$K,MATCH($D13&R$9,'New data sheet'!$L:$L,0),MATCH($E$7,'New data sheet'!$F$6:$K$6,0))","v":169.2739498492343},{"$f":"INDEX('New data sheet'!$F:$K,MATCH($D13&S$9,'New data sheet'!$L:$L,0),MATCH($E$7,'New data sheet'!$F$6:$K$6,0))","v":{"$error":"#N/A"}},{"$f":"INDEX('New data sheet'!$F:$K,MATCH($D13&T$9,'New data sheet'!$L:$L,0),MATCH($E$7,'New data sheet'!$F$6:$K$6,0))","v":{"$error":"#N/A"}},{"$f":"INDEX('New data sheet'!$F:$K,MATCH($D13&U$9,'New data sheet'!$L:$L,0),MATCH($E$7,'New data sheet'!$F$6:$K$6,0))","v":{"$error":"#N/A"}}]
[null,null,null,"Forecast annual capex",{"$f":"INDEX('New data sheet'!$F:$K,MATCH($D14&E$9,'New data sheet'!$L:$L,0),MATCH($E$7,'New data sheet'!$F$6:$K$6,0))","v":276.10225215048547},{"$f":"INDEX('New data sheet'!$F:$K,MATCH($D14&F$9,'New data sheet'!$L:$L,0),MATCH($E$7,'New data sheet'!$F$6:$K$6,0))","v":123.65914781569455},{"$f":"INDEX('New data sheet'!$F:$K,MATCH($D14&G$9,'New data sheet'!$L:$L,0),MATCH($E$7,'New data sheet'!$F$6:$K$6,0))","v":937.04117602876761},{"$f":"INDEX('New data sheet'!$F:$K,MATCH($D14&H$9,'New data sheet'!$L:$L,0),MATCH($E$7,'New data sheet'!$F$6:$K$6,0))","v":854.79236093077623},{"$f":"INDEX('New data sheet'!$F:$K,MATCH($D14&I$9,'New data sheet'!$L:$L,0),MATCH($E$7,'New data sheet'!$F$6:$K$6,0))","v":566.50291884119383},{"$f":"INDEX('New data sheet'!$F:$K,MATCH($D14&J$9,'New data sheet'!$L:$L,0),MATCH($E$7,'New data sheet'!$F$6:$K$6,0))","v":625.40600553350316},{"$f":"INDEX('New data sheet'!$F:$K,MATCH($D14&K$9,'New data sheet'!$L:$L,0),MATCH($E$7,'New data sheet'!$F$6:$K$6,0))","v":532.89821862900419},{"$f":"INDEX('New data sheet'!$F:$K,MATCH($D14&L$9,'New data sheet'!$L:$L,0),MATCH($E$7,'New data sheet'!$F$6:$K$6,0))","v":770.54571488788827},{"$f":"INDEX('New data sheet'!$F:$K,MATCH($D14&M$9,'New data sheet'!$L:$L,0),MATCH($E$7,'New data sheet'!$F$6:$K$6,0))","v":636.24024500564326},{"$f":"INDEX('New data sheet'!$F:$K,MATCH($D14&N$9,'New data sheet'!$L:$L,0),MATCH($E$7,'New data sheet'!$F$6:$K$6,0))","v":453.11826242004912},{"$f":"INDEX('New data sheet'!$F:$K,MATCH($D14&O$9,'New data sheet'!$L:$L,0),MATCH($E$7,'New data sheet'!$F$6:$K$6,0))","v":503.78795661154589},{"$f":"INDEX('New data sheet'!$F:$K,MATCH($D14&P$9,'New data sheet'!$L:$L,0),MATCH($E$7,'New data sheet'!$F$6:$K$6,0))","v":570.43418027013945},{"$f":"INDEX('New data sheet'!$F:$K,MATCH($D14&Q$9,'New data sheet'!$L:$L,0),MATCH($E$7,'New data sheet'!$F$6:$K$6,0))","v":170.59984907858166},{"$f":"INDEX('New data sheet'!$F:$K,MATCH($D14&R$9,'New data sheet'!$L:$L,0),MATCH($E$7,'New data sheet'!$F$6:$K$6,0))","v":171.29194563686369},{"$f":"INDEX('New data sheet'!$F:$K,MATCH($D14&S$9,'New data sheet'!$L:$L,0),MATCH($E$7,'New data sheet'!$F$6:$K$6,0))","v":{"$error":"#N/A"}},{"$f":"INDEX('New data sheet'!$F:$K,MATCH($D14&T$9,'New data sheet'!$L:$L,0),MATCH($E$7,'New data sheet'!$F$6:$K$6,0))","v":{"$error":"#N/A"}},{"$f":"INDEX('New data sheet'!$F:$K,MATCH($D14&U$9,'New data sheet'!$L:$L,0),MATCH($E$7,'New data sheet'!$F$6:$K$6,0))","v":{"$error":"#N/A"}}]
[null,null,null,"Actual annual opex",{"$f":"INDEX('New data sheet'!$F:$K,MATCH($D15&E$9,'New data sheet'!$L:$L,0),MATCH($E$7,'New data sheet'!$F$6:$K$6,0))","v":163.42793082415326},{"$f":"INDEX('New data sheet'!$F:$K,MATCH($D15&F$9,'New data sheet'!$L:$L,0),MATCH($E$7,'New data sheet'!$F$6:$K$6,0))","v":171.82196609602371},{"$f":"INDEX('New data sheet'!$F:$K,MATCH($D15&G$9,'New data sheet'!$L:$L,0),MATCH($E$7,'New data sheet'!$F$6:$K$6,0))","v":186.82032622371156},{"$f":"INDEX('New data sheet'!$F:$K,MATCH($D15&H$9,'New data sheet'!$L:$L,0),MATCH($E$7,'New data sheet'!$F$6:$K$6,0))","v":179.1139079232577},{"$f":"INDEX('New data sheet'!$F:$K,MATCH($D15&I$9,'New data sheet'!$L:$L,0),MATCH($E$7,'New data sheet'!$F$6:$K$6,0))","v":185.56844521958695},{"$f":"INDEX('New data sheet'!$F:$K,MATCH($D15&J$9,'New data sheet'!$L:$L,0),MATCH($E$7,'New data sheet'!$F$6:$K$6,0))","v":178.9362035828257},{"$f":"INDEX('New data sheet'!$F:$K,MATCH($D15&K$9,'New data sheet'!$L:$L,0),MATCH($E$7,'New data sheet'!$F$6:$K$6,0))","v":185.46618614775318},{"$f":"INDEX('New data sheet'!$F:$K,MATCH($D15&L$9,'New data sheet'!$L:$L,0),MATCH($E$7,'New data sheet'!$F$6:$K$6,0))","v":189.67925820886157},{"$f":"INDEX('New data sheet'!$F:$K,MATCH($D15&M$9,'New data sheet'!$L:$L,0),MATCH($E$7,'New data sheet'!$F$6:$K$6,0))","v":199.71514054510263},{"$f":"INDEX('New data sheet'!$F:$K,MATCH($D15&N$9,'New data sheet'!$L:$L,0),MATCH($E$7,'New data sheet'!$F$6:$K$6,0))","v":228.22784190763559},{"$f":"INDEX('New data sheet'!$F:$K,MATCH($D15&O$9,'New data sheet'!$L:$L,0),MATCH($E$7,'New data sheet'!$F$6:$K$6,0))","v":232.07940409586752},{"$f":"INDEX('New data sheet'!$F:$K,MATCH($D15&P$9,'New data sheet'!$L:$L,0),MATCH($E$7,'New data sheet'!$F$6:$K$6,0))","v":237.17584476748249},{"$f":"INDEX('New data sheet'!$F:$K,MATCH($D15&Q$9,'New data sheet'!$L:$L,0),MATCH($E$7,'New data sheet'!$F$6:$K$6,0))","v":192.77569642030207},{"$f":"INDEX('New data sheet'!$F:$K,MATCH($D15&R$9,'New data sheet'!$L:$L,0),MATCH($E$7,'New data sheet'!$F$6:$K$6,0))","v":201.13756149662501},{"$f":"INDEX('New data sheet'!$F:$K,MATCH($D15&S$9,'New data sheet'!$L:$L,0),MATCH($E$7,'New data sheet'!$F$6:$K$6,0))","v":{"$error":"#N/A"}},{"$f":"INDEX('New data sheet'!$F:$K,MATCH($D15&T$9,'New data sheet'!$L:$L,0),MATCH($E$7,'New data sheet'!$F$6:$K$6,0))","v":{"$error":"#N/A"}},{"$f":"INDEX('New data sheet'!$F:$K,MATCH($D15&U$9,'New data sheet'!$L:$L,0),MATCH($E$7,'New data sheet'!$F$6:$K$6,0))","v":{"$error":"#N/A"}}]
{"$rows_left_out":17}
{"sheet":"Introduction","index":2,"n_rows":25,"n_cols":10,"rows_kept":25,"cut":false,"hidden":false,"merged":[[10,2,10,14],[16,2,16,14],[12,2,13,14]]}
[]
[null,null,null,"Electricity Transmission Network Service Provider"]
[null,null,"Operational Performance Data"]
[]
[]
[null,"Introduction"]
[]
[]
[]
[]
[null,null,"This workbook contains operational performance data for electricity transmission businesses in the National Energy Market (NEM). The charts and data are presented for a range of financial, service and network operational performance measures.  "]
[null,null,"Interpretation"]
[null,null,"The data covers the regulatory years from 2006 to 2019. It is reported on an end of year basis. All transmission businesses report on a financial year basis, hence the label 2015 refers to data collected for the year ending 30 June 2015 (or 31 March 2015 for AusNet (T)). Exceptions to this are tables 6,7 and 8, which are reported on a calendar year basis, in line with service performance scheme (STPIS) reporting timeframes.\n\nAll financial values have been converted to June 2019 dollars (or March 2019 dollars for AusNet (T))."]
[]
[]
{"$rows_left_out":11}
{"sheet":"Dashboard","index":3,"n_rows":125,"n_cols":17,"rows_kept":125,"cut":false,"hidden":false,"merged":[[2,5,2,9],[0,5,0,9],[1,4,1,10]]}
[null,null,null,null,null,"Electricity Transmission Network Service Provider"]
[null,null,null,null,"Operational Performance Data"]
[null,null,null,null,null,"Powerlink"]
[]
[]
[null,null,null,null,null,null,"Summary statistics"]
[]
[]
[null,null,null,null,null,null,null,"2019 value","5 year trend"]
[null,null,null,null,null,null,"Actual revenue",{"$f":"\"$\"&TEXT(Calculations!R10,\"#,##0\")&\"m\"","v":"$676m"}]
[null,null,null,null,null,null,"Actual closing RAB",{"$f":"\"$\"&TEXT(Calculations!R11,\"#,##0\")&\"m\"","v":"$7,129m"}]
[null,null,null,null,null,null,"Forecast closing RAB",{"$f":"\"$\"&TEXT(Calculations!R12,\"#,##0\")&\"m\"","v":"$7,129m"}]
[null,null,null,null,null,null,"Actual annual capex",{"$f":"\"$\"&TEXT(Calculations!R13,\"#,##0\")&\"m\"","v":"$169m"}]
[null,null,null,null,null,null,"Forecast annual capex",{"$f":"\"$\"&TEXT(Calculations!R14,\"#,##0\")&\"m\"","v":"$171m"}]
[null,null,null,null,null,null,"Actual annual opex",{"$f":"\"$\"&TEXT(Calculations!R15,\"#,##0\")&\"m\"","v":"$201m"}]
{"$rows_left_out":111}
{"sheet":"Contents","index":4,"n_rows":24,"n_cols":8,"rows_kept":24,"cut":false,"hidden":false,"merged":[[23,2,23,8],[12,2,12,8],[13,2,13,8],[14,2,14,8],[15,2,15,8],[16,2,16,8],[22,2,22,5],[20,2,20,6],[19,2,19,6],[18,2,18,7],[17,2,17,7]]}
[]
[]
[null,null,null,null,null,null,null,"Electricity Transmission Network Service Provider"]
[null,"Operational Performance Data"]
[]
[null,"Contents"]
[]
[]
[]
[]
[]
[]
[null,null,"1. Revenue"]
[null,null,"2. Regulated asset base - closing"]
[null,null,"3. Capital expenditure"]
{"$rows_left_out":10}
{"sheet":"1. Revenue","index":5,"n_rows":59,"n_cols":17,"rows_kept":59,"cut":false,"hidden":false,"merged":[[58,1,58,16],[3,1,3,13],[29,1,29,13],[43,1,43,13],[31,1,31,16],[56,1,56,13]]}
[]
[]
[]
[null,"Revenue"]
[]
[]
[]
[]
[]
[]
[]
[]
[]
[]
[]
{"$rows_left_out":45}
{"sheet":"2. RAB - Closing","index":6,"n_rows":62,"n_cols":17,"rows_kept":62,"cut":false,"hidden":false,"merged":[[3,1,3,13],[29,1,29,13],[61,1,61,16],[60,1,60,16],[59,1,59,16],[56,1,56,16],[57,1,57,16],[43,1,44,16],[31,1,31,16]]}
[]
[]
[]
[null,"Regulatory Asset Base"]
[]
[]
[]
[]
[]
[]
[]
[]
[]
[]
[]
{"$rows_left_out":48}
{"sheet":"3. Capex","index":7,"n_rows":58,"n_cols":17,"rows_kept":58,"cut":false,"hidden":false,"merged":[[3,1,3,13],[29,1,29,13],[57,1,57,16],[43,1,45,16],[31,1,31,16]]}
[]
[]
[]
[null,"Capital expenditure"]
[]
[]
[]
[]
[]
[]
[]
[]
[]
[]
[]
{"$rows_left_out":44}
{"sheet":"4. Capex by Driver","index":8,"n_rows":96,"n_cols":18,"rows_kept":96,"cut":false,"hidden":false,"merged":[[51,12,52,13],[48,1,48,13],[36,1,36,13],[3,1,3,13]]}
[]
[]
[]
[null,"Capital expenditure by driver"]
[]
[]
[]
[null,null,null,null,null,null,null,null,null,null,null,null,null,null,null,null,null," "]
[]
[]
[]
[]
[]
[]
[]
{"$rows_left_out":82}
{"sheet":"5. Opex","index":9,"n_rows":57,"n_cols":18,"rows_kept":57,"cut":false,"hidden":false,"merged":[[3,1,3,13],[43,1,43,13],[55,1,55,16],[56,1,56,16],[31,1,31,16]]}
[]
[]
[]
[null,"Operating expenditure"]
[]
[]
[]
[]
[]
[]
[]
[]
[]
[]
[]
{"$rows_left_out":43}
{"sheet":"6. Reliability -outage events","index":10,"n_rows":45,"n_cols":16,"rows_kept":45,"cut":false,"hidden":false,"merged":[[3,1,3,12],[28,1,32,15],[44,1,44,12]]}
[]
[]
[]
[null,"Network Reliability - Outage events"]
[]
[]
[]
[]
[]
[]
[]
[]
[]
[]
[]
{"$rows_left_out":31}
{"sheet":"7. Reliability -outage duration","index":11,"n_rows":46,"n_cols":16,"rows_kept":46,"cut":false,"hidden":false,"merged":[[3,1,3,12],[28,1,34,15],[45,1,45,12]]}
[]
[]
[]
[null,"Network Reliability - Outage Duration"]
[]
[]
[]
[]
[]
[]
[]
[]
[]
[]
[]
{"$rows_left_out":32}
{"sheet":"8. Market impact","index":12,"n_rows":41,"n_cols":16,"rows_kept":41,"cut":false,"hidden":false,"merged":[[3,1,3,12],[29,1,29,15],[40,1,40,12]]}
[]
[]
[]
[null,"Quality of Services - Market impact"]
[]
[]
[]
[]
[]
[]
[]
[]
[]
[]
[]
{"$rows_left_out":27}
{"sheet":"9. Maximum demand","index":13,"n_rows":42,"n_cols":17,"rows_kept":42,"cut":false,"hidden":false,"merged":[[41,1,41,16],[3,1,3,13],[26,1,27,16],[37,1,37,16],[38,1,38,16],[40,1,40,16]]}
[]
[]
[]
[null,"Maximum demand"]
[]
[]
[]
[]
[]
[]
[]
[]
[]
[]
[]
{"$rows_left_out":28}
{"sheet":"10. Energy delivered","index":14,"n_rows":43,"n_cols":17,"rows_kept":43,"cut":false,"hidden":false,"merged":[[3,1,3,13],[26,1,26,16],[41,1,41,16],[42,1,42,16]]}
[]
[]
[]
[null,"Energy delivered"]
[]
[]
[]
[]
[]
[]
[]
[]
[]
[]
[]
{"$rows_left_out":29}
{"sheet":"11. Circuit length","index":15,"n_rows":57,"n_cols":17,"rows_kept":57,"cut":false,"hidden":false,"merged":[[3,1,3,13],[26,1,26,16],[56,1,56,13]]}
[]
[]
[]
[null,"Circuit length"]
[]
[]
[]
[]
[]
[]
[]
[]
[]
[]
[]
{"$rows_left_out":43}
{"sheet":"12. Return on assets","index":16,"n_rows":9,"n_cols":12,"rows_kept":9,"cut":false,"hidden":false,"merged":[[5,1,5,11],[3,1,3,11]]}
[]
[]
[]
[null,"Return on assets"]
[]
[null,"This page has been removed. We will report Return on Assets alongside our other profitability measures as part of our 2020 network performance report."]
[]
[null,"For information on Return on Assets go to the ",null,null,"Profitability measures for electricity and gas network businesses",null,null,null,null,null,null,"webpage"]
[null,"at www.aer.gov.au."]