{"text_format":"1","workbook":"xlsx","n_sheets":10,"sheets":["Index","Input|General","Input|Inflation","Input|Reported opex","Input|Rate of change","Input|Step changes","Calc|Opex forecast","Output|Models","Lookup|Tables","Check|List"],"not_rendered":{"charts":0,"images":0,"macros":1,"external_links":0,"defined_names":19,"comments":3,"pivot_tables":0},"unopened":[],"bounds":{"document_bytes":16777216,"sheet_cells":100000,"rows_first":2000,"rows_last":500,"rows_between":2000,"halvings":0,"cell_chars":16384,"cell_head_chars":4096},"cells_cut":0,"cells_raw":0,"read":"whole","date_system":"1900"}

{"sheet":"Index","index":0,"n_rows":17,"n_cols":4,"rows_kept":17,"cut":false,"hidden":false,"merged":[]}
[null,"AER opex model v2.0"]
[null,"Index"]
[]
[null,"Model index"]
[]
[null,null,"Sheet Name","Sheet Description"]
[null,null,"Input | General","Inputs NSP name, regulatory years for the prior and forecast regulatory control period etc."]
[null,null,"Input | Inflation","Inputs inflation data."]
[null,null,"Input | Reported opex","Inputs the reported operating expenditure (opex) from the prior regulatory control period."]
[null,null,"Input | Rate of change","Inputs the cost escalation weights, cost escalation forecast, and inflation actuals and forecast. Sheet used when the rate of change is applied from the final year."]
{"$rows_left_out":8}
{"sheet":"Input|General","index":1,"n_rows":17,"n_cols":22,"rows_kept":17,"cut":false,"hidden":false,"merged":[]}
[null,{"$f":"Index!$B$1","v":"AER opex model v2.0"},null,null,null,null,null,null,null,"Back to Index",null,"Key:","Input","External Link","Internal Link",null,null,"Worksheet check:",{"$f":"IF(COUNTA($S$5:$S$16)=COUNTIF($S5:$S17,\"OK\"),\"OK\",\"Check\")","v":"OK"},null,"Overall Check:",{"$f":"'Check|List'!$S$1","v":"Ok"}]
[null,{"$f":"Index!$C$7","v":"Input | General"}]
[]
[null,"Input | General inputs"]
[]
[null,null,"Inputs","Source",null,null,"Value"]
[null,null,"NSP name","NSP",null,null,"Endeavour",null,null,null,null,null,null,null,null,null,null,null,{"$f":"IF(COUNTBLANK($G7),\"Check\",\"Ok\")","v":"Ok"}]
[null,null,"Decision stage","AER",null,null,"Proposal",null,null,null,null,null,null,null,null,null,null,null,{"$f":"IF(COUNTBLANK($G8),\"Check\",\"Ok\")","v":"Ok"}]
[null,null,"Year ending","NSP",null,null,"2000-06-01",null,null,null,null,null,null,null,null,null,null,null,{"$f":"IF(COUNTBLANK($G9),\"Check\",\"Ok\")","v":"Ok"}]
[null,null,"Previous regulatory control period, first year","NSP",null,null,2020,null,null,null,null,null,null,null,null,null,null,null,{"$f":"IF(COUNTBLANK($G10),\"Check\",\"Ok\")","v":"Ok"}]
{"$rows_left_out":8}
{"sheet":"Input|Inflation","index":2,"n_rows":86,"n_cols":25,"rows_kept":86,"cut":false,"hidden":false,"merged":[]}
[null,{"$f":"Index!$B$1","v":"AER opex model v2.0"},null,null,null,null,null,null,null,null,null,null,"Back to Index",null,"Key:","Input","External Link","Internal Link",null,null,"Worksheet check:",{"$f":"IF(COUNTA($V$5:$V$85)=COUNTIF($V5:$V86,\"OK\"),\"OK\",\"Check\")","v":"OK"},null,"Overall Check:",{"$f":"'Check|List'!$S$1","v":"Ok"}]
[null,{"$f":"Index!$C$7","v":"Input | General"}]
[]
[null,"Input | General inputs"]
[]
[null,null,null,"Index value, new base","Percentage Change from Corresponding Quarter of Previous Year","Index value, new base","Forecast annual CPI growth","Forecast and actual index value","Percentage Change from Corresponding Quarter of Previous Year"]
[null,null,"Source","ABS","Calculated","ABS","RBA","Calculated","Calculated"]
[null,null,"Unit","index","Percent","index","Percent","index","Percent"]
[null,null,"2007-03-31",155.6,null,null,null,null,null,null,null,null,null,null,null,null,null,null,null,null,null,{"$f":"IF(C9>EOMONTH(DATE('Input|General'!$G$12,MONTH('Input|General'!$G$9),1),0),\"Ok\",IF(D9=\"\",\"Check\",\"Ok\"))","v":"Ok"}]
[null,null,"2007-06-30",157.5,null,null,null,null,null,null,null,null,null,null,null,null,null,null,null,null,null,{"$f":"IF(C10>EOMONTH(DATE('Input|General'!$G$12,MONTH('Input|General'!$G$9),1),0),\"Ok\",IF(D10=\"\",\"Check\",\"Ok\"))","v":"Ok"}]
{"$rows_left_out":77}
{"sheet":"Input|Reported opex","index":3,"n_rows":73,"n_cols":22,"rows_kept":73,"cut":false,"hidden":false,"merged":[]}
[null,null,{"$f":"Index!$B$1","v":"AER opex model v2.0"},null,null,null,null,null,null,"Back to Index",null,"Key:","Input","External Link","Internal Link",null,null,"Worksheet check:",{"$f":"IF(COUNTA($V$29:$V$266)=COUNTIF($V$29:$V$266,\"OK\"),\"OK\",\"Check\")","v":"OK"},null,"Overall Check:",{"$f":"'Check|List'!$S$1","v":"Ok"}]
[null,null,{"$f":"Index!$C$9","v":"Input | Reported opex"}]
[null,null,null,null,null,null,null,null,null,"Year ending"]
[null,null,null,"Source","Unit","Basis",null,null,null,{"$f":"DATE(PPFirstYear,MONTH('Input|General'!$G$9),1)","v":"2020-06-01"},{"$f":"DATE(PPFirstYear+1,MONTH('Input|General'!$G$9),1)","v":"2021-06-01"},{"$f":"DATE(PPFirstYear+2,MONTH('Input|General'!$G$9),1)","v":"2022-06-01"},{"$f":"DATE(PPFirstYear+3,MONTH('Input|General'!$G$9),1)","v":"2023-06-01"},{"$f":"DATE(PPFirstYear+4,MONTH('Input|General'!$G$9),1)","v":"2024-06-01"},{"$f":"DATE(PPFirstYear+5,MONTH('Input|General'!$G$9),1)","v":"2025-06-01"},{"$f":"DATE(PPFirstYear+6,MONTH('Input|General'!$G$9),1)","v":"2026-06-01"},{"$f":"DATE(PPFirstYear+7,MONTH('Input|General'!$G$9),1)","v":"2027-06-01"},{"$f":"DATE(PPFirstYear+8,MONTH('Input|General'!$G$9),1)","v":"2028-06-01"},{"$f":"DATE(PPFirstYear+9,MONTH('Input|General'!$G$9),1)","v":"2029-06-01"},{"$f":"DATE(PPFirstYear+10,MONTH('Input|General'!$G$9),1)","v":"2030-06-01"}]
[]
[]
[]
[null,"Input | Opex allowances"]
[]
[null,null,"Cost category","Source","Unit","Basis",null,null,null,{"$f":"IF(YEAR(J$4)<=PPLastYear,J$4,\"\")","v":"2020-06-01"},"2021-06-01","2022-06-01","2023-06-01","2024-06-01","","","","","",null,"Notes"]
{"$rows_left_out":64}
{"sheet":"Input|Rate of change","index":4,"n_rows":119,"n_cols":24,"rows_kept":119,"cut":false,"hidden":false,"merged":[[2,10,2,12],[2,14,2,19]]}
[null,{"$f":"Index!$B$1","v":"AER opex model v2.0"},null,null,null,null,null,null,null,null,"Back to Index",null,"Key:","Input","External Link","Internal Link",null,null,"Worksheet check:",{"$f":"IF(COUNTIF(X5:X118,\"Check\")=0,\"Ok\",\"Check\")","v":"Ok"},null,null,"Overall Check:",{"$f":"'Check|List'!$S$1","v":"Ok"}]
[null,{"$f":"Index!$C$10","v":"Input | Rate of change"}]
[null,null,null,null,null,null,null,null,null,"Year ending"]
[null,null,null,"Source","Unit","Basis",null,null,null,{"$f":"DATE(PPFirstYear-1,MONTH('Input|General'!$G$9),1)","v":"2019-06-01"},{"$f":"DATE(PPFirstYear,MONTH('Input|General'!$G$9),1)","v":"2020-06-01"},{"$f":"DATE(PPFirstYear+1,MONTH('Input|General'!$G$9),1)","v":"2021-06-01"},{"$f":"DATE(PPFirstYear+2,MONTH('Input|General'!$G$9),1)","v":"2022-06-01"},{"$f":"DATE(PPFirstYear+3,MONTH('Input|General'!$G$9),1)","v":"2023-06-01"},{"$f":"DATE(PPFirstYear+4,MONTH('Input|General'!$G$9),1)","v":"2024-06-01"},{"$f":"DATE(PPFirstYear+5,MONTH('Input|General'!$G$9),1)","v":"2025-06-01"},{"$f":"DATE(PPFirstYear+6,MONTH('Input|General'!$G$9),1)","v":"2026-06-01"},{"$f":"DATE(PPFirstYear+7,MONTH('Input|General'!$G$9),1)","v":"2027-06-01"},{"$f":"DATE(PPFirstYear+8,MONTH('Input|General'!$G$9),1)","v":"2028-06-01"},{"$f":"DATE(PPFirstYear+9,MONTH('Input|General'!$G$9),1)","v":"2029-06-01"},{"$f":"DATE(PPFirstYear+10,MONTH('Input|General'!$G$9),1)","v":"2030-06-01"}]
[]
[]
[]
[null,"Input | Inflation"]
[]
[null,null,"Inflation",null,null,null,null,null,null,{"$f":"IF(YEAR(J$4)<=PPLastYear,J$4,\"\")","v":"2019-06-01"},"2020-06-01","2021-06-01","2022-06-01","2023-06-01","2024-06-01","","","","",""]
{"$rows_left_out":110}
{"sheet":"Input|Step changes","index":5,"n_rows":44,"n_cols":23,"rows_kept":44,"cut":false,"hidden":false,"merged":[[2,13,2,18]]}
[null,{"$f":"Index!$B$1","v":"AER opex model v2.0"},null,null,null,null,null,null,null,"Back to Index",null,"Key:","Input","External Link","Internal Link",null,null,"Worksheet check:",{"$f":"IF(COUNTA($W$8:$W$237)=COUNTIF($W$8:$W$237,\"OK\"),\"OK\",\"Check\")","v":"OK"},null,"Overall Check:",{"$f":"'Check|List'!$S$1","v":"Ok"}]
[null,{"$f":"Index!$C$11","v":"Input | Step changes"}]
[null,null,null,null,null,null,null,null,null,"Year ending"]
[null,null,null,"Source","Unit","Basis",null,null,null,{"$f":"DATE(PPFirstYear,MONTH('Input|General'!$G$9),1)","v":"2020-06-01"},{"$f":"DATE(PPFirstYear+1,MONTH('Input|General'!$G$9),1)","v":"2021-06-01"},{"$f":"DATE(PPFirstYear+2,MONTH('Input|General'!$G$9),1)","v":"2022-06-01"},{"$f":"DATE(PPFirstYear+3,MONTH('Input|General'!$G$9),1)","v":"2023-06-01"},{"$f":"DATE(PPFirstYear+4,MONTH('Input|General'!$G$9),1)","v":"2024-06-01"},{"$f":"DATE(PPFirstYear+5,MONTH('Input|General'!$G$9),1)","v":"2025-06-01"},{"$f":"DATE(PPFirstYear+6,MONTH('Input|General'!$G$9),1)","v":"2026-06-01"},{"$f":"DATE(PPFirstYear+7,MONTH('Input|General'!$G$9),1)","v":"2027-06-01"},{"$f":"DATE(PPFirstYear+8,MONTH('Input|General'!$G$9),1)","v":"2028-06-01"},{"$f":"DATE(PPFirstYear+9,MONTH('Input|General'!$G$9),1)","v":"2029-06-01"},{"$f":"DATE(PPFirstYear+10,MONTH('Input|General'!$G$9),1)","v":"2030-06-01"}]
[]
[]
[]
[null,"Input |Step changes"]
[]
[null,null,"Step change","Source","Unit","Basis",null,null,null,{"$f":"IF(YEAR(J$4)>=FPFirstYear,IF(YEAR(J$4)<=FPLastYear,J$4,\"\"),\"\")","v":""},"","","","","2025-06-01","2026-06-01","2027-06-01","2028-06-01","2029-06-01",""]
{"$rows_left_out":35}
{"sheet":"Calc|Opex forecast","index":6,"n_rows":109,"n_cols":23,"rows_kept":109,"cut":false,"hidden":false,"merged":[[2,13,2,18]]}
[null,{"$f":"Index!$B$1","v":"AER opex model v2.0"},null,null,null,null,null,null,null,"Back to Index",null,"Key:","Input","External Link","Internal Link",null,null,"Worksheet check:","n/a",null,null,"Overall Check:",{"$f":"'Check|List'!$S$1","v":"Ok"}]
[null,{"$f":"Index!$C$12","v":"Calc | Opex Forecast"}]
[null,null,null,null,null,null,null,null,null,"Year ending"]
[null,null,null,"Source","Unit","Basis",null,null,null,{"$f":"DATE(PPFirstYear,MONTH('Input|General'!$G$9),1)","v":"2020-06-01"},{"$f":"DATE(PPFirstYear+1,MONTH('Input|General'!$G$9),1)","v":"2021-06-01"},{"$f":"DATE(PPFirstYear+2,MONTH('Input|General'!$G$9),1)","v":"2022-06-01"},{"$f":"DATE(PPFirstYear+3,MONTH('Input|General'!$G$9),1)","v":"2023-06-01"},{"$f":"DATE(PPFirstYear+4,MONTH('Input|General'!$G$9),1)","v":"2024-06-01"},{"$f":"DATE(PPFirstYear+5,MONTH('Input|General'!$G$9),1)","v":"2025-06-01"},{"$f":"DATE(PPFirstYear+6,MONTH('Input|General'!$G$9),1)","v":"2026-06-01"},{"$f":"DATE(PPFirstYear+7,MONTH('Input|General'!$G$9),1)","v":"2027-06-01"},{"$f":"DATE(PPFirstYear+8,MONTH('Input|General'!$G$9),1)","v":"2028-06-01"},{"$f":"DATE(PPFirstYear+9,MONTH('Input|General'!$G$9),1)","v":"2029-06-01"},{"$f":"DATE(PPFirstYear+10,MONTH('Input|General'!$G$9),1)","v":"2030-06-01"}]
[]
[]
[]
[null,"Calc | Estimated final year expenditure",null,null,"$millions",{"$f":"DATE(PPLastYear,MONTH('Input|General'!$G$9),1)","v":"2024-06-01"}]
[]
[null,null,null,"Source","Unit","Basis",null,null,null,{"$f":"IF(YEAR(J$4)<=PPLastYear,J$4,\"\")","v":"2020-06-01"},"2021-06-01","2022-06-01","2023-06-01","2024-06-01","","","","",""]
{"$rows_left_out":100}
{"sheet":"Output|Models","index":7,"n_rows":20,"n_cols":23,"rows_kept":20,"cut":false,"hidden":false,"merged":[[2,13,2,18]]}
[null,{"$f":"Index!$B$1","v":"AER opex model v2.0"},null,null,null,null,null,null,null,"Back to Index",null,"Key:","Input","External Link","Internal Link",null,null,"Worksheet check:","n/a",null,null,"Overall Check:",{"$f":"'Check|List'!$S$1","v":"Ok"}]
[null,{"$f":"Index!$C$13","v":"Output | Models"}]
[null,null,null,null,null,null,null,null,null,"Year ending"]
[null,null,null,"Source","Unit","Basis",null,null,null,{"$f":"DATE(PPFirstYear,MONTH('Input|General'!$G$9),1)","v":"2020-06-01"},{"$f":"DATE(PPFirstYear+1,MONTH('Input|General'!$G$9),1)","v":"2021-06-01"},{"$f":"DATE(PPFirstYear+2,MONTH('Input|General'!$G$9),1)","v":"2022-06-01"},{"$f":"DATE(PPFirstYear+3,MONTH('Input|General'!$G$9),1)","v":"2023-06-01"},{"$f":"DATE(PPFirstYear+4,MONTH('Input|General'!$G$9),1)","v":"2024-06-01"},{"$f":"DATE(PPFirstYear+5,MONTH('Input|General'!$G$9),1)","v":"2025-06-01"},{"$f":"DATE(PPFirstYear+6,MONTH('Input|General'!$G$9),1)","v":"2026-06-01"},{"$f":"DATE(PPFirstYear+7,MONTH('Input|General'!$G$9),1)","v":"2027-06-01"},{"$f":"DATE(PPFirstYear+8,MONTH('Input|General'!$G$9),1)","v":"2028-06-01"},{"$f":"DATE(PPFirstYear+9,MONTH('Input|General'!$G$9),1)","v":"2029-06-01"},{"$f":"DATE(PPFirstYear+10,MONTH('Input|General'!$G$9),1)","v":"2030-06-01"}]
[]
[]
[]
[null,"Inputs for Post Tax Revenue Model",null,null,"$millions",{"$f":"DATE(PPLastYear,MONTH('Input|General'!$G$9),1)","v":"2024-06-01"},null,null,null,"Note. The dollar base should be consistent with the post tax revenue model"]
[]
[]
{"$rows_left_out":11}
{"sheet":"Lookup|Tables","index":8,"n_rows":85,"n_cols":22,"rows_kept":85,"cut":false,"hidden":false,"merged":[]}
[null,{"$f":"Index!$B$1","v":"AER opex model v2.0"},null,null,null,null,null,null,null,"Back to Index",null,"Key:","Input","External Link","Internal Link",null,null,null,null,null,"Overall Check:",{"$f":"'Check|List'!$S$1","v":"Ok"}]
[null,{"$f":"Index!$C$14","v":"Lookup | Tables"}]
[]
[]
[null,"Stage"]
[]
[null,null,{"$f":"B5","v":"Stage"},"Source",null,null,"Ref"]
[null,null,"Pre-submission","Network",null,null,"Pre-submission"]
[null,null,"Proposal","Network",null,null,"Proposal"]
[null,null,"Draft decision","AER",null,null,"Draft decision"]
{"$rows_left_out":76}
{"sheet":"Check|List","index":9,"n_rows":18,"n_cols":19,"rows_kept":18,"cut":false,"hidden":false,"merged":[]}
[null,{"$f":"Index!$B$1","v":"AER opex model v2.0"},null,null,null,null,null,null,null,"Back to Index",null,"Key:","Input","External Link","Internal Link",null,null,"Overall Check:",{"$f":"IF(COUNTIF(G10:G16,\"Check\")=0,\"Ok\",\"Check\")","v":"Ok"}]
[null,{"$f":"Index!$C$15","v":"Check | List"}]
[]
[]
[]
[]
[null,"Check List"]
[]
[null,null,"Sheet","Source","Unit",null,"Status"]
[null,null,{"$f":"Index!C7","v":"Input | General"},{"$f":"C10","v":"Input | General"},"Ok/Check",null,{"$f":"'Input|General'!S1","v":"OK"}]
{"$rows_left_out":8}