{"text_format":"1","workbook":"xlsx","n_sheets":24,"sheets":["AER only","Contents","Instructions","Business & other details","2.11 Labour","3.6 Quality of services","3.6.8 Network-feeders","3.6.9 Network-reliability","4.1 Public lighting","6.2 STPIS Reliability","6.6 STPIS Customer Service","6.7 STPIS Daily Performance","6.8 STPIS Exclusions","6.9 STPIS - GSL","7.8 Avoided TUOS Payments","7.10 Juris Scheme","7.11 DMIS-DMIA","7.12 Safety and Bushfire","7.13 TARC","8.1 Income","8.2 Capex"," 8.4 Opex","9.5 TUoS","NSP amendments"],"not_rendered":{"charts":0,"images":4,"macros":1,"external_links":83,"defined_names":2008,"comments":2,"pivot_tables":0},"unopened":[],"bounds":{"document_bytes":16777216,"sheet_cells":100000,"rows_first":2000,"rows_last":500,"rows_between":2000,"halvings":0,"cell_chars":16384,"cell_head_chars":4096},"cells_cut":0,"cells_raw":0,"read":"whole","date_system":"1900"}

{"sheet":"AER only","index":0,"n_rows":74,"n_cols":23,"rows_kept":74,"cut":false,"hidden":true,"merged":[[0,1,0,9],[18,13,18,16]]}
[null,"Data in this worksheet is used for data validation and database purposes."]
[null,"Date last modified:"]
[null,"14 April 2015","merged cell C46/47"]
[null,"17 April 2015","adjusted dms_RYE to automate based on dms_Model (NB: EB & CA refer to CRCP_y5)"]
[null,"14 May 2015","adapted this cover for use in CA & EB RINs"]
[]
[null,"October 2015","added full Trading Name for worksheet headings"]
[null,"USES NAMED RANGES FLAG","yes"]
[null,"dms_Model_List ","dms_Worksheet_List ",null,"dms_RYE_Formula_Result"]
[null,"ARR","REGULATORY REPORTING STATEMENT",null,{"$f":"LEFT(CRY,2)&RIGHT(CRY,2)","v":"2017"}]
[null,"CA","CATEGORY ANALYSIS",null,{"$f":"LEFT(CRY,2)&RIGHT(CRY,2)","v":"2017"}]
[null,"CAM/Service change Backcast","REGULATORY REPORTING STATEMENT",null,{"$f":"LEFT(dms_FRCP_FinalYear_Num,2)&RIGHT(dms_FRCP_FinalYear_Num,2)","v":"2021"}]
[null,"CPI","CPI"]
[null,"EB","ECONOMIC BENCHMARKING",null,{"$f":"LEFT(CRY,2)&RIGHT(CRY,2)","v":"2017"}]
[null,"PTRM","POST TAX REVENUE MODEL",null,{"$f":"LEFT(dms_FRCP_FinalYear_Num,2)&RIGHT(dms_FRCP_FinalYear_Num,2)","v":"2021"}]
[null,"Reset","REGULATORY REPORTING STATEMENT",null,{"$f":"LEFT(dms_FRCP_FinalYear_Num,2)&RIGHT(dms_FRCP_FinalYear_Num,2)","v":"2021"}]
[null,"RFM","ROLL FORWARD MODEL",null,{"$f":"LEFT(dms_CRCP_FinalYear_Num,2)&RIGHT(dms_CRCP_FinalYear_Num,2)","v":"2015"}]
[null,"WACC","WEIGHTED AVERAGE COST OF CAPITAL"]
[null,null,null,null,null,null,null,null,null,null,null,null,null,"Feeder Types",null,null,null,"TasNetworks (D)"]
[null,null,null,null,null,null,null,null,null,null,null,null,null,"CBD","Urban","Short rural","long rural","EXTRA"]
[null,"dms_TradingName_List","dms_TradingNameFull_List","dms_ABN_List","dms_State_List","dms_Sector_List","dms_Segment_List","dms_FormControl_List","dms_CRCPlength_List","dms_FRCPlength_List","dms_JurisdictionList","dms_663_List","dms_DeterminationRef_List","dms_CBD_flag","dms_Urban_flag","dms_ShortRural_flag","dms_LongRural_flag","dms_FeederType_5_flag","dms_FeederName_1","dms_FeederName_2","dms_FeederName_3","dms_FeederName_4","dms_FeederName_5"]
[null,"ActewAGL Distribution","ActewAGL Distribution",76670568688,"ACT","Electricity","Distribution","Revenue cap",5,6,"ACT",5,"2014-19 Distribution Determination","NO","YES","YES","NO","NO","CBD","Urban","Short rural","Long rural"]
[null,"ActewAGL Distribution (Tx Assets)","ActewAGL Distribution (Tx Assets)",76670568688,"ACT","Electricity","Distribution","Revenue cap",5,5,"ACT",5,"distribution determination",null,null,null,null,null,"CBD","Urban","Short rural","Long rural"]
[null,"AGN","AGN",78551685,"SA","Gas","Distribution","Revenue cap",5,5,"SA",5,"distribution determination",null,null,null,null,null,"CBD","Urban","Short rural","Long rural"]
[null,"Ausgrid","Ausgrid",67505337385,"NSW","Electricity","Distribution","Revenue cap",5,5,"NSW",5,"2014-19 Distribution Determination","YES","YES","YES","YES","NO","CBD","Urban","Short rural","Long rural"]
[null,"Ausgrid (Tx Assets)","Ausgrid (Tx Assets)",67505337385,"NSW","Electricity","Distribution","Revenue cap",5,5,"NSW",5,"distribution determination",null,null,null,null,null,"CBD","Urban","Short rural","Long rural"]
[null,"AusNet (D)","AusNet Electricity Services",91064651118,"Vic","Electricity","Distribution","Revenue cap",5,5,"Vic",2,"2016-20 Distribution Determination","NO","YES","YES","YES","NO","CBD","Urban","Short rural","Long rural"]
[null,"AusNet (T)","AusNet (T)",48116124362,"Vic","Electricity","Transmission","Revenue cap",5,5,"Vic",2,"distribution determination",null,null,null,null,null,"CBD","Urban","Short rural","Long rural"]
[null,"Australian Distribution Co.","Australian Distribution Co.",11222333444,"-","Electricity","Distribution","Revenue cap",5,5,"NSW",2,"distribution determination",null,null,null,null,null,"CBD","Urban","Short rural","Long rural"]
[null,"Australian Transmission Co.","Australian Transmission Co.",11222333444,"-","Electricity","Transmission","Revenue cap",5,5,"Vic",5,"distribution determination",null,null,null,null,null,"CBD","Urban","Short rural","Long rural"]
[null,"CitiPower","CitiPower",76064651056,"Vic","Electricity","Distribution","Revenue cap",5,5,"Vic",2,"2016-20 Distribution Determination","YES","YES","NO","NO","NO","CBD","Urban","Short rural","Long rural"]
[null,"Directlink","Directlink",16779340889,"NSW","Electricity","Transmission","Revenue cap",10,5,"Qld",5,"distribution determination",null,null,null,null,null,"CBD","Urban","Short rural","Long rural"]
[null,"ElectraNet","ElectraNet",41094482416,"SA","Electricity","Transmission","Revenue cap",5,5,"SA",5,"distribution determination",null,null,null,null,null,"CBD","Urban","Short rural","Long rural"]
[null,"Endeavour Energy","Endeavour Energy",59253130878,"NSW","Electricity","Distribution","Revenue cap",5,5,"NSW",5,"2014-19 Distribution Determination","NO","YES","YES","YES","NO","CBD","Urban","Short rural","Long rural"]
[null,"Energex","Energex",40078849055,"Qld","Electricity","Distribution","Revenue cap",5,5,"Qld",5,"2015-20 Distribution Determination","YES","YES","YES","NO","NO","CBD","Urban","Short rural","Long rural"]
[null,"Ergon Energy","Ergon Energy",50087646062,"Qld","Electricity","Distribution","Revenue cap",5,5,"Qld",5,"2015-20 Distribution Determination","NO","YES","YES","YES","NO","CBD","Urban","Short rural","Long rural"]
[null,"Essential Energy","Essential Energy",37428185226,"NSW","Electricity","Distribution","Revenue cap",5,5,"NSW",5,"2014-19 Distribution Determination","NO","YES","YES","YES","NO","CBD","Urban","Short rural","Long rural"]
[null,"Jemena Electricity","Jemena Electricity",82064651083,"Vic","Electricity","Distribution","Revenue cap",5,5,"Vic",2,"2016-20 Distribution Determination","NO","YES","YES","NO","NO","CBD","Urban","Short rural","Long rural"]
[null,"Murraylink","Murraylink",79181207909,"NSW","Electricity","Transmission","Revenue cap",5,5,"SA",5,"distribution determination",null,null,null,null,null,"CBD","Urban","Short rural","Long rural"]
[null,"Powercor Australia","Powercor Australia",89064651109,"Vic","Electricity","Distribution","Revenue cap",5,5,"Vic",2,"2016-20 Distribution Determination","NO","YES","YES","YES","NO","CBD","Urban","Short rural","Long rural"]
[null,"Powerlink","Queensland Electricity Transmission Corporation Limited trading as Powerlink Queensland",82078849233,"Qld","Electricity","Transmission","Revenue cap",5,5,"Qld",5,"distribution determination",null,null,null,null,null,"CBD","Urban","Short rural","Long rural"]
[null,"Qld,SA &ACT Gas Reset","Qld,SA &ACT Gas Reset",22222222222,"-","Gas","Distribution","?",5,5,"-","x","distribution determination",null,null,null,null,null,"CBD","Urban","Short rural","Long rural"]
[null,"SA Power Networks","SA Power Networks",13332330749,"SA","Electricity","Distribution","Revenue cap",5,5,"SA",5,"2015-20 Distribution Determination","YES","YES","YES","YES","NO","CBD","Urban","Short rural","Long rural"]
[null,"TasNetworks (D)","TasNetworks (D)",24167357299,"Tas","Electricity","Distribution","Revenue cap",5,5,"Tas",5,"distribution determination","YES","YES","YES","YES","YES","Critical Infrastructure","High density commercial","Urban","High density rural","Low density rural"]
[null,"TasNetworks (T)","TasNetworks (T)",24167357299,"Tas","Electricity","Transmission","Revenue cap",5,5,"Tas",5,"distribution determination",null,null,null,null,null,"CBD","Urban","Short rural","Long rural"]
[null,"TransGrid","TransGrid",19622755774,"NSW","Electricity","Transmission","Revenue cap",5,5,"NSW",5,"distribution determination",null,null,null,null,null,"CBD","Urban","Short rural","Long rural"]
[null,"United Energy","United Energy",70064651029,"Vic","Electricity","Distribution","Revenue cap",5,5,"Vic",2,"2016-20 Distribution Determination","NO","YES","YES","NO","NO","CBD","Urban","Short rural","Long rural"]
[null,"DNSP Backcasting","Victorian DNSP Backcasting",33333333666,"Vic","Electricity","Distribution","?",5,5,"-","x","distribution determination",null,null,null,null,null,"CBD","Urban","Short rural","Long rural"]
[null,"DNSP Reset ","Victorian DNSP Reset ",33333333333,"Vic","Electricity","Distribution","?",5,5,"-","x","distribution determination",null,null,null,null,null,"CBD","Urban","Short rural","Long rural"]
[]
[]
[]
[]
[null,"dms_SourceList","dms_FormControl_Choices",null,"dms_FRCPlength_Num_List","dms_FinalYear_List"]
[null,"After appeal","Revenue cap",null,1,"FRCP_y1"]
[null,"Draft decision","Revenue yield",null,2,"FRCP_y2"]
[null,"Final decision","Weighted average price cap",null,3,"FRCP_y3"]
[null,"Pass through decision",null,null,4,"FRCP_y4"]
[null,"PTRM annual update",null,null,5,"FRCP_y5"]
[null,"PTRM interim update 1",null,null,6,"FRCP_y6"]
[null,"PTRM interim update 2",null,null,7,"FRCP_y7"]
[null,"PTRM interim update 3",null,null,8,"FRCP_y8"]
[null,"PTRM interim update 4",null,null,9,"FRCP_y9"]
[null,"Regulatory proposal",null,null,10,"FRCP_y10"]
[null,"Reporting"]
[null,"Revised regulatory proposal"]
[null,"RFM annual update"]
[null,"WACC annual update"]
[]
[]
[null,"Notes"]
[null,"RFM - Base year is usually CRCP_y1","EG. Victorian 2016-20 - base year = 2011"]
[null,"RFM - Form of Control Field is not relevant"]
[null,"PTRM - capture base year input by NSP","=PTRM input'!Q7"]

{"sheet":"Contents","index":1,"n_rows":31,"n_cols":4,"rows_kept":31,"cut":false,"hidden":false,"merged":[[2,1,2,3],[3,1,3,3],[4,1,4,3]]}
[]
[]
[null,{"$f":"CONCATENATE(dms_Segment,\" Network Service Provider\")","v":"Distribution Network Service Provider"}]
[null,"Annual Reporting RIN Template"]
[null,"Table of Contents"]
[]
[]
[null,null,"Instructions"]
[null,null,"Business & other details"]
[]
[]
[null,"CATEGORY ANALYSIS","STPIS","STATUTORY ACCOUNTS"]
[]
[null,"2.11 Labour","6.2 STPIS Reliability","8.1 Income"]
[null,null,"6.6 STPIS Customer Service","8.2 Capex"]
[null,null,"6.7 STPIS Daily Performance"]
[null,null,"6.8 STPIS Exclusions","8.4 Opex"]
[null,null,"6.9 STPIS GSL"]
[]
[]
[]
[null,"NETWORK PERFORMANCE","OTHER INFORMATION","PRICING PROPOSAL"]
[null,null,null,"Victorian Businesses Only"]
[null,"3.6 Quality of services","7.8 Avoided Cost Payments"]
[null,"3.6.8 Network-feeders","7.10 Juris Scheme","9.5 TUoS"]
[null,"3.6.9 Network-reliability","7.11 DMIS-DMIA"]
[null,null,"7.12 Safety and Bushfire"]
[null,null,"7.13 TARC"]
[null,"PUBLIC LIGHTING"]
[]
[null,"4.1 Public lighting tariffs"]

{"sheet":"Instructions","index":2,"n_rows":26,"n_cols":6,"rows_kept":26,"cut":false,"hidden":false,"merged":[[17,2,17,4],[19,2,19,4],[25,2,25,4],[7,1,7,5],[8,1,8,5],[14,2,14,4],[10,2,10,4],[16,2,16,3]]}
[]
[]
[]
[]
[]
[]
[]
[null,{"$f":"CONCATENATE(dms_Segment,\" Network Service Provider\")","v":"Distribution Network Service Provider"}]
[null,"Annual Reporting RIN Template"]
[]
[null,null,{"$f":"CONCATENATE(\"This template is to be used by \",dms_TradingName, \" to fulfil its annual reporting obligations to the AER.\")","v":"This template is to be used by Endeavour Energy to fulfil its annual reporting obligations to the AER."}]
[null,null,null,null,null,"Amendments made December 2015"]
[null,null,null,null,null,"Click here for details."]
[null,null,"INSTRUCTIONS"]
[null,null,"Complete the Business & other details worksheet before entering data or values in any other worksheets. The Business & other details worksheet is linked to other cells within the workbook and automatically generates certain column headings and conditional formatting."]
[]
[null,null,"Identifying CONFIDENTIAL INFORMATION:\n\nPlease use the macro at the top of each \nworksheet to identify confidential information. \n\n"]
[null,null,"-Do this by selecting the cell or cells that contain confidential information and then run the Mark selected cells as CONFIDENTIAL macro. This will format the cells a specific colour that is identified by the AER's database which in turn marks that information as confidential.\n\n-To reverse this, select the cell or cells and run the Return cells to NON-CONFIDENTIAL macro"]
[]
[null,null,"All amounts are to be unrounded and reported in nominal terms on a one for one basis: that is 1000 is to be entered as '1000' not '1' as in previous templates.\n\nColour coding of input sheets:"]
[null,null,null,"Yellow = Input cells"]
[null,null,null,"Grey = Not applicable/No inputs required"]
[null,null,null,"Leave coloured cells blank if no information exists. \nPLEASE DO NOT ENTER TEXT into cells that are to contain numeric data."]
[]
[]
[null,null,"Returning completed responses\n\nPlease return two (2) files to the AER: \n1. A confidential version which must contain a complete set of all responses with confidential information marked using the Mark selected cells CONFIDENTIAL macro and which has been completed using the locked template file provided by the AER. \n\n2. A public version with confidential information either removed completely or aggregated in some form together with writtten consent to disclose the public version of the response.\n\nUse the drop down box on the Business and other details worksheet to identify the file as either confidential ('consolidated') or public. "]

{"sheet":"Business & other details","index":3,"n_rows":78,"n_cols":13,"rows_kept":78,"cut":false,"hidden":false,"merged":[[13,3,13,4],[14,3,14,4],[30,6,30,7],[71,4,71,9],[48,3,48,4],[50,3,50,9],[23,5,23,8],[24,5,24,8],[6,2,6,9],[11,2,11,9],[32,2,32,9],[28,6,28,7],[29,6,29,7],[19,3,19,4],[22,3,22,4],[17,3,17,4],[24,3,24,4],[28,3,28,4],[29,3,29,4],[30,3,30,4],[17,5,17,8],[18,5,18,8],[19,5,19,8],[22,5,22,8]]}
[null,null,{"$f":"(LOOKUP(dms_Model,dms_Model_List,dms_Worksheet_List))","v":"REGULATORY REPORTING STATEMENT"}]
[null,null,{"$f":"dms_TradingName","v":"Endeavour Energy"}]
[null,null,{"$f":"CONCATENATE(\"Annual Reporting RIN Response \",CRY)","v":"Annual Reporting RIN Response 2016-17"}]
[null,null,"BUSINESS & OTHER DETAILS"]
[]
[null,null,"Instructions"]
[null,null,"Complete the following business details regulatory template before entering data or values in any other regulatory templates. This regulatory template is linked to other cells within these worksheets and is used to automatically generate some column headings and to apply conditional formatting to certain cells."]
[]
[]
[null,null,"SUBMISSION PARTICULARS INPUT SHEETS"]
[]
[null,null,"ENTITY DETAILS"]
[]
[null,null,"Short name","Endeavour Energy"]
[null,null,"ACN / ABN",{"$f":"INDEX(dms_ABN_List,MATCH(dms_TradingName,dms_TradingName_List))","v":59253130878}]
[]
[]
[null,null,"Business address","Address 1",null,"51 Huntingwood Drive"]
[null,null,null,null,"Address 2"]
[null,null,null,"Suburb",null,"Huntingwood"]
[null,null,null,null,"State",{"$f":"INDEX(dms_State_List,MATCH(dms_TradingName,dms_TradingName_List))","v":"NSW"},"p/code",2148]
[]
[null,null,"Postal address","Address 1",null,"PO Box 811"]
[null,null,null,null,"Address 2"]
[null,null,null,"Suburb",null,"Seven Hills"]
[null,null,null,null,"State","NSW","p/code",1730]
[]
[]
[null,null,"Contact name/s","Fiona Place"]
[null,null,"Contact phone/s","02 9853 6302"]
[null,null,"Contact email address/s","EndeavourEnergyRIN@endeavourenergy.com.au"]
[]
[null,null,"REGULATORY CONTROL PERIODS"]
[]
[null,null,"Forthcoming regulatory control period","2016-17",{"$f":"IF(dms_RPT=\"financial\",VALUE(LEFT(FRCP_y1,4)+1)&\"-\"&VALUE(MID(FRCP_y1,3,2)+2),VALUE(LEFT(FRCP_y1,4)+1))","v":"2017-18"},{"$f":"IF(dms_RPT=\"financial\",VALUE(LEFT(FRCP_y2,4)+1)&\"-\"&VALUE(MID(FRCP_y2,3,2)+2),VALUE(LEFT(FRCP_y2,4)+1))","v":"2018-19"},{"$f":"IF(dms_RPT=\"financial\",VALUE(LEFT(FRCP_y3,4)+1)&\"-\"&VALUE(MID(FRCP_y3,3,2)+2),VALUE(LEFT(FRCP_y3,4)+1))","v":"2019-20"},{"$f":"IF(dms_RPT=\"financial\",VALUE(LEFT(FRCP_y4,4)+1)&\"-\"&VALUE(MID(FRCP_y4,3,2)+2),VALUE(LEFT(FRCP_y4,4)+1))","v":"2020-21"},{"$f":"IF(dms_RPT=\"financial\",VALUE(LEFT(FRCP_y5,4)+1)&\"-\"&VALUE(MID(FRCP_y5,3,2)+2),VALUE(LEFT(FRCP_y5,4)+1))","v":"2021-22"},{"$f":"IF(dms_RPT=\"financial\",VALUE(LEFT(FRCP_y6,4)+1)&\"-\"&VALUE(MID(FRCP_y6,3,2)+2),VALUE(LEFT(FRCP_y6,4)+1))","v":"2022-23"},{"$f":"IF(dms_RPT=\"financial\",VALUE(LEFT(FRCP_y7,4)+1)&\"-\"&VALUE(MID(FRCP_y7,3,2)+2),VALUE(LEFT(FRCP_y7,4)+1))","v":"2023-24"},{"$f":"IF(dms_RPT=\"financial\",VALUE(LEFT(FRCP_y8,4)+1)&\"-\"&VALUE(MID(FRCP_y8,3,2)+2),VALUE(LEFT(FRCP_y8,4)+1))","v":"2024-25"},{"$f":"IF(dms_RPT=\"financial\",VALUE(LEFT(FRCP_y9,4)+1)&\"-\"&VALUE(MID(FRCP_y9,3,2)+2),VALUE(LEFT(FRCP_y9,4)+1))","v":"2025-26"}]
[]
[]
[null,null,"Current regulatory control period",{"$f":"IF(dms_RPT=\"financial\",VALUE(LEFT(CRCP_y2,4)-1)&\"-\"&TEXT(VALUE(RIGHT(CRCP_y2,2)-1),\"0#\"),VALUE(LEFT(CRCP_y2,4)-1))","v":"2011-12"},{"$f":"IF(dms_RPT=\"financial\",VALUE(LEFT(CRCP_y3,4)-1)&\"-\"&TEXT(VALUE(RIGHT(CRCP_y3,2)-1),\"0#\"),VALUE(LEFT(CRCP_y3,4)-1))","v":"2012-13"},{"$f":"IF(dms_RPT=\"financial\",VALUE(LEFT(CRCP_y4,4)-1)&\"-\"&TEXT(VALUE(RIGHT(CRCP_y4,2)-1),\"0#\"),VALUE(LEFT(CRCP_y4,4)-1))","v":"2013-14"},{"$f":"IF(dms_RPT=\"financial\",VALUE(LEFT(CRCP_y5,4)-1)&\"-\"&TEXT(VALUE(RIGHT(CRCP_y5,2)-1),\"0#\"),VALUE(LEFT(CRCP_y5,4)-1))","v":"2014-15"},{"$f":"IF(dms_RPT=\"financial\",VALUE(LEFT(FRCP_y1,4)-1)&\"-\"&TEXT(VALUE(RIGHT(FRCP_y1,2)-1),\"0#\"),VALUE(LEFT(FRCP_y1,4)-1))","v":"2015-16"}]
[]
[]
[null,null,"Previous regulatory control period",{"$f":"IF(dms_RPT=\"financial\",VALUE(LEFT(PRCP_y2,4)-1)&\"-\"&TEXT(VALUE(MID(PRCP_y2,3,2)),\"0#\"),VALUE(LEFT(PRCP_y2,4)-1))","v":"2006-07"},{"$f":"IF(dms_RPT=\"financial\",VALUE(LEFT(PRCP_y3,4)-1)&\"-\"&TEXT(VALUE(MID(PRCP_y3,3,2)),\"0#\"),VALUE(LEFT(PRCP_y3,4)-1))","v":"2007-08"},{"$f":"IF(dms_RPT=\"financial\",VALUE(LEFT(PRCP_y4,4)-1)&\"-\"&TEXT(VALUE(MID(PRCP_y4,3,2)),\"0#\"),VALUE(LEFT(PRCP_y4,4)-1))","v":"2008-09"},{"$f":"IF(dms_RPT=\"financial\",VALUE(LEFT(PRCP_y5,4)-1)&\"-\"&TEXT(VALUE(RIGHT(PRCP_y5,2)-1),\"0#\"),VALUE(LEFT(PRCP_y5,4)-1))","v":"2009-10"},{"$f":"IF(dms_RPT=\"financial\",VALUE(LEFT(CRCP_y1,4)-1)&\"-\"&TEXT(VALUE(RIGHT(CRCP_y1,2)-1),\"0#\"),VALUE(LEFT(CRCP_y1,4)-1))","v":"2010-11"}]
[]
[]
[null,null,"Current regulatory year","2016-17"]
[]
[]
[]
[]
[null,null,"Source","Reporting"]
[null,null,"Consolidated confidential or public version?","Public"]
[null,null,"Amended RIN submission - amendment reason"]
[null,null,"EBSS - First application of scheme in forthcoming period?","No"]
[null,null,"Sector",{"$f":"INDEX(dms_Sector_List,MATCH(dms_TradingName,dms_TradingName_List))","v":"Electricity"},"dms_Sector","=INDEX(dms_Sector_List,MATCH(dms_TradingName,dms_TradingName_List))"]
[null,null,"Segment",{"$f":"INDEX(dms_Segment_List,MATCH(dms_TradingName,dms_TradingName_List))","v":"Distribution"},"dms_Segment","=INDEX(dms_Segment_List,MATCH(dms_TradingName,dms_TradingName_List))"]
[null,null,"Regulatory Year Ending",{"$f":"INDEX(dms_RYE_Formula_Result,MATCH(dms_Model,dms_Model_List))","v":"2017"},"dms_RYE","=INDEX(dms_RYE_Formula_Result,MATCH(dms_Model,dms_Model_List))"]
[null,null,"Reporting Period Type",{"$f":"IF(LEN(FRCP_y1)>4,\"Financial\",\"Calendar\")","v":"Financial"},"dms_RPT","=IF(LEN(FRCP_y1)>4,\"Financial\",\"Calendar\")"]
[null,null,"Model or RIN Type","ARR","dms_Model"]
[null,null,"Security Classification","Public","dms_Classification"]
[null,null,"Template - version no.",5,"dms_TemplateNumber"]
[null,null,"Dollar $ real  (the last month before the FRCP_y1)",{"$f":"CONCATENATE(IF(dms_RPT=\"Financial\",\"June \",\"December \"),VALUE((LEFT(FRCP_y1,2))&RIGHT(FRCP_y1,2))-1)","v":"June 2016"},"dms_DollarReal","=CONCATENATE(IF(dms_RPT=\"Financial\",\"June \",\"December \"),VALUE((LEFT(FRCP_y1,2))&RIGHT(FRCP_y1,2))-1)"]
[null,null,"Form of control",{"$f":"INDEX(dms_FormControl_List,MATCH(dms_TradingName,dms_TradingName_List))","v":"Revenue cap"},"dms_FormControl","=INDEX(dms_FormControl_List,MATCH(dms_TradingName,dms_TradingName_List))"]
[null,null,"RIN response - version no.",1,"dms_RINversion"]
[null,null,"Jurisdiction",{"$f":"INDEX(dms_JurisdictionList,MATCH(dms_TradingName,dms_TradingName_List))","v":"NSW"},"dms_Jurisdiction","=INDEX(dms_JurisdictionList,MATCH(dms_TradingName,dms_TradingName_List))"]
[null,null,"Length of current reg control period",{"$f":"INDEX(dms_CRCPlength_List,MATCH(dms_TradingName,dms_TradingName_List))","v":5},"dms_CRCPlength","=INDEX(dms_CRCPlength_List,MATCH(dms_TradingName,dms_TradingName_List))"]
[null,null,"Length of forthcoming reg control period",{"$f":"INDEX(dms_FRCPlength_List,MATCH(dms_TradingName,dms_TradingName_List))","v":5},"dms_FRCPlength","=INDEX(dms_FRCPlength_List,MATCH(dms_TradingName,dms_TradingName_List))"]
[null,null,"FRCP length in years",{"$f":"INDEX(dms_FRCPlength_List,MATCH(dms_TradingName,dms_TradingName_List))","v":5},"dms_FRCPlength_Num","=INDEX(dms_FRCPlength_List,MATCH(dms_TradingName,dms_TradingName_List))"]
[null,null,"FRCP Final Year Reference",{"$f":"INDEX(dms_FinalYear_List,MATCH(dms_FRCPlength_Num,dms_FRCPlength_Num_List))","v":"FRCP_y5"},"dms_FRCP_FinalYear","=INDEX(dms_FinalYear_List,MATCH(dms_FRCPlength_Num,dms_FRCPlength_Num_List))"]
[null,null,"FRCP Final Year",{"$f":"INDIRECT(dms_FRCP_FinalYear)","v":"2020-21"},"dms_FRCP_FinalYear_Num","=INDIRECT(dms_FRCP_FinalYear)"]
[null,null,"CRCP length in years",5,"dms_CRCPlength_Num","=INDEX(dms_CRCPlength_List,MATCH(dms_TradingName,dms_TradingName_List))"]
[null,null,"CRCP Final Year Reference","CRCP_y5","dms_CRCP_FinalYear","=INDEX(dms_CFinalYear_List,MATCH(dms_CRCPlength_Num,dms_CRCPlength_Num_List))"]
[null,null,"CRCP Final Year","2014-15","dms_CRCP_FinalYear_Num","=INDIRECT(dms_CRCP_FinalYear)"]
[null,null,"Backcast templates only - unit of measure ","$0s","If the cover sheet is for Backcast data ensure to apply dms_Backcast_UOM named range to this field. Otherwise, do not apply this named range."]
[null,null,"Table 6.6.3 - Public lighting repair - no. business days",{"$f":"INDEX(dms_663_List,MATCH(dms_TradingName,dms_TradingName_List))","v":5}]
[null,null,"Distribution Determination Reference",{"$f":"INDEX(dms_DeterminationRef_List,MATCH(dms_TradingName,dms_TradingName_List))","v":"2014-19 Distribution Determination"},"=dms_DeterminationRef"]
[null,null,"CBD Feeder for this business",{"$f":"INDEX(dms_CBD_flag,MATCH(dms_TradingName,dms_TradingName_List))","v":"NO"},"dms_CBD_flag_NSP"]
[null,null,"Urban Feeder for this business",{"$f":"INDEX(dms_Urban_flag,MATCH(dms_TradingName,dms_TradingName_List))","v":"YES"},"dms_Urban_flag_NSP"]
[null,null,"Short rural Feeder for this business",{"$f":"INDEX(dms_ShortRural_flag,MATCH(dms_TradingName,dms_TradingName_List))","v":"YES"},"dms_ShortRural_flag_NSP"]
[null,null,"Long rural Feeder for this business",{"$f":"INDEX(dms_LongRural_flag,MATCH(dms_TradingName,dms_TradingName_List))","v":"YES"},"dms_LongRural_flag_NSP"]

{"sheet":"2.11 Labour","index":4,"n_rows":36,"n_cols":4,"rows_kept":36,"cut":false,"hidden":false,"merged":[]}
[null,{"$f":"(LOOKUP(dms_Model,dms_Model_List,dms_Worksheet_List))","v":"REGULATORY REPORTING STATEMENT"}]
[null,{"$f":"dms_TradingName","v":"Endeavour Energy"}]
[null,{"$f":"CONCATENATE(\"Annual Reporting RIN Response \",CRY)","v":"Annual Reporting RIN Response 2016-17"}]
[null,"2.11 LABOUR "]
[]
[null,"Tables 2.11.1 and 2.11.2 deliberately omitted."]
[]
[null,"2.11.3 - LABOUR / NON-LABOUR EXPENDITURE SPLIT"]
[null,"2.11.3.1 - Opex"]
[null,null,{"$f":"CRY","v":"2016-17"}]
[null,null,"$0's, nominal"]
[null,null,"Opex "]
[null,"In-house labour expenditure",163583864.49480599]
[null,"Labour expenditure outsourced to related parties",0]
[null,"Labour expenditure outsourced to unrelated parties",67879354.016410142]
[null,"Controllable non-labour expenditure",66341706.420164026]
[null,"Uncontrollable non-labour expenditure",7278177.6728255292]
[null,"Total",{"$f":"SUM(C13:C17)","v":305083102.60420567}]
[]
[null,"Reconciliation with Opex worksheets - SCS","Opex"]
[null,"Total including margins",{"$f":"dms_Total_Actual_Opex","v":{"$error":"#REF!"}},{"$f":"IF(C18=dms_Total_Actual_Opex,\"OK\",\"Error\")","v":{"$error":"#REF!"}}]
[]
[]
[null,"2.11.3.2 - Capex"]
[null,null,{"$f":"CRY","v":"2016-17"}]
[null,null,"$0's, nominal"]
[null,null,"Capex"]
[null,"In-house labour expenditure",45610759.429207869]
[null,"Labour expenditure outsourced to related parties",0]
[null,"Labour expenditure outsourced to unrelated parties",66829123.51460062]
[null,"Controllable non-labour expenditure",86521913.55082874]
[null,"Uncontrollable non-labour expenditure",164136466.68199998]
[null,"Total",{"$f":"SUM(C28:C32)","v":363098263.17663723}]
[]
[null,"Reconciliation with Capex & Opex worksheets - SCS","Capex"]
[null,"Total including margins",{"$f":"dms_Total_Actual_Capex","v":363098263.25910807},{"$f":"IF(C33=dms_Total_Actual_Capex,\"OK\",\"Error\")","v":"Error"}]

{"sheet":"3.6 Quality of services","index":5,"n_rows":71,"n_cols":4,"rows_kept":71,"cut":false,"hidden":false,"merged":[[6,2,7,2],[24,2,25,2],[24,1,25,1]]}
[null,{"$f":"(LOOKUP(dms_Model,dms_Model_List,dms_Worksheet_List))","v":"REGULATORY REPORTING STATEMENT"}]
[null,{"$f":"dms_TradingName","v":"Endeavour Energy"}]
[null,{"$f":"CONCATENATE(\"Annual Reporting RIN Response \",CRY)","v":"Annual Reporting RIN Response 2016-17"}]
[null,"3.6 QUALITY OF SERVICES"]
[]
[null,"3.6.5 - QUALITY OF SUPPLY METRICS"]
[null,null,"Unit","Volume"]
[null,null,null,{"$f":"CRY","v":"2016-17"}]
[null,"Over voltage events - due to high voltage injection","number"]
[null,"Customers receiving over-voltage - due to high voltage injection","number"]
[null,"Over voltage events - due to lightning","number"]
[null,"Customers receiving over-voltage - due to lightning","number"]
[null,"Over voltage events - due to voltage regulation or other cause","number"]
[null,"Customers receiving over-voltage - due to voltage regulation or other cause","number"]
[null,"Voltage variations - steady state (zone sub)","number"]
[null,"Voltage variations - one minute (zone sub)","number"]
[null,"Voltage variations - 10 seconds (zone sub) Min<0.7","number"]
[null,"Voltage variations - 10 seconds (zone sub) Min<0.8","number"]
[null,"Voltage variations - 10 seconds (zone sub) Min<0.9","number"]
[null,"Voltage variations - steady state (feeder)","number"]
[null,"Voltage variations - % zone subs monitored","(per cent)"]
[null,"Voltage variations - % feeders monitored","(per cent)"]
[]
[null,"3.6.6 - COMPLAINTS - TECHNICAL QUALITY OF SUPPLY"]
[null,null,"Unit","Volume"]
[null,null,null,{"$f":"CRY","v":"2016-17"}]
[null,"3.6.6.1 - TECHNICAL QUALITY OF SUPPLY"]
[null,"Number of complaints - technical quality of supply","number",12]
[null,"3.6.6.2 - PERCENTAGE OF COMPLAINTS BY CATEGORY"]
[null,"Low voltage supply","(per cent)"]
[null,"Voltage dips","(per cent)"]
[null,"Voltage swell","(per cent)"]
[null,"Voltage spike (impulsive transient)","(per cent)"]
[null,"Waveform distortion","(per cent)"]
[null,"TV or radio interference","(per cent)"]
[null,"Solar related","(per cent)"]
[null,"Noise from appliances","(per cent)"]
[null,"Other","(per cent)"]
[null,"3.6.6.3 - PERCENTAGE OF COMPLAINTS BY LIKELY CAUSE"]
[null,"Network equipment faulty","(per cent)"]
[null,"Network interference by NSP equipment","(per cent)"]
[null,"Network interference by another customer","(per cent)"]
[null,"Network limitation","(per cent)"]
[null,"Customer internal problem","(per cent)"]
[null,"No problem identified","(per cent)"]
[null,"Environmental","(per cent)"]
[null,"Other","(per cent)"]
[]
[null,"3.6.7 - CUSTOMER SERVICE METRICS"]
[null,null,"Unit",{"$f":"CRY","v":"2016-17"}]
[null,"3.6.7.1 - TIMELY PROVISIONS OF SERVICES"]
[null,"Number of connections made","number",0]
[null,"Number of connections not made on or before agreed date","number",0]
[null,"3.6.7.2 - TIMELY REPAIR OF FAULTY STREET LIGHTS"]
[null,"Street lights - average monthly number \"out\"","number",1453]
[null,"Street lights - not repaired by \"fix by\" date","number",139]
[null,"Street lights - average number of days to repair","number",4.7]
[null,"Total number of street lights","number",204651]
[null,"3.6.7.3 - CALL CENTRE PERFORMANCE"]
[null,"Calls to call centre fault line","number",257640]
[null,"Calls to fault line answered within 30 seconds","number",165236]
[null,"Calls to fault line - average waiting time before call answered","number",18]
[null,"Call centre - number of overload events","number",5]
[null,"Percentage of calls abandoned","(per cent)",4.68]
[null,"3.6.7.4 - NUMBER OF CUSTOMER COMPLAINTS"]
[null,"Complaint - reliability of supply","number"]
[null,"Complaint - technical quality of supply","number",{"$f":"IF(ISBLANK(D28),\"\",D28)","v":12}]
[null,"Complaint - administrative process or customer service","number"]
[null,"Complaint - connection or augmentation","number"]
[null,"Complaint - other","number"]
[null,"Total number of complaints","number"]

{"sheet":"3.6.8 Network-feeders","index":6,"n_rows":1339,"n_cols":23,"rows_kept":1339,"cut":false,"hidden":false,"merged":[[10,10,10,14],[10,15,10,19],[10,20,10,22],[11,5,12,5],[11,6,12,6],[11,8,12,8],[11,9,12,9],[11,10,12,10],[11,11,11,12],[11,13,11,14],[11,15,12,15],[11,16,11,17],[11,18,11,19],[11,20,12,20],[11,21,11,22],[5,1,5,4],[5,6,5,8],[10,1,12,1],[10,2,12,2],[10,3,12,3],[10,4,12,4],[10,5,10,6],[10,7,12,7],[10,8,10,9]]}
[null,{"$f":"(LOOKUP(dms_Model,dms_Model_List,dms_Worksheet_List))","v":"REGULATORY REPORTING STATEMENT"},null,null,null,null,{"$f":"CONCATENATE(\"1-Jan-\",LEFT(CRY,4))","v":"1-Jan-2016"}]
[null,{"$f":"dms_TradingName","v":"Endeavour Energy"}]
[null,{"$f":"CONCATENATE(\"Annual Reporting RIN Response \",CRY)","v":"Annual Reporting RIN Response 2016-17"}]
[null,"3.6 QUALITY OF SERVICES"]
[]
[null,"Did the MAIFI parameter of the STPIS apply during the period?",null,null,null,"No","** IMPORTANT\nPlease ensure this question is answered correctly. Your response will affect other tables throughout this workbook and will determine which cells are grey and which are input cells. "]
[]
[]
[]
[null,"3.6.8 - NETWORK FEEDER RELIABILITY"]
[null,"Feeder ID / name","Description of the service area for the feeder","Feeder classification\n\n(drop down)","Number of distribution customers","Length of high voltage distribution lines",null,"Maximum demand\n(MVA)","Energy not supplied\n(MWh)",null,"Unplanned Outages",null,null,null,null,"Planned Outages",null,null,null,null,"Momentary feeder outages"]
[null,null,null,null,null,"Overhead","Underground",null,"Unplanned","Planned","Total number of unplanned outages","Unplanned customer minutes off-supply (SAIDI)",null,"Unplanned interruptions\n(SAIFI)",null,"Total number of planned outages","Planned customer minutes off-supply (SAIDI)",null,"Planned interruptions\n(SAIFI)",null,"Total number of momentary feeder outages","Momentary interruptions due to feeder outages (MAIFI)"]
[null,null,null,null,null,null,null,null,null,null,null,"Including excluded events and MEDs","After removing excluded events and MED","Including excluded events and MEDs","After removing excluded events and MED",null,"Including MEDs","After removing  MED","Including MEDs","After removing  MED",null,"Including excluded events and MEDs","After removing excluded events and MED"]
[null,"(unknown Bonnyrigg)","BONNYRIGG","Urban",0,0,0,0,0,0.3359281109551267,0,0,0,0,0,2,2.7102343611829432E-2,"N/A",5.0189525207091539E-5,"N/A"]
[null,"(unknown Dapto)","DAPTO","Urban",0,0,0,0,0,5.5988018492521122E-2,0,0,0,0,0,1,4.5170572686382389E-3,"N/A",1.0754898258662473E-5,"N/A"]
[null,"(unknown Hazelbrook)","HAZELBROOK","Urban",0,0,0,0,0,3.5547948249219758E-3,0,0,0,0,0,2,2.8679728689766593E-4,"N/A",2.389977390813883E-6,"N/A"]
[null,"(unknown Katoomba)","KATOOMBA","Urban",0,0,0,0,0,0.39991441780372228,0,0,0,0,0,1,3.2264694775987417E-2,"N/A",8.9624152155520613E-5,"N/A"]
[null,"(unknown Nowra)","NOWRA","Urban",0,0,0,0,0,0.52788703150091343,0,0,0,0,0,2,4.2589397104303393E-2,"N/A",1.1830388084528721E-4,"N/A"]
[null,"10241","KATOOMBA","Urban",1166,10173.875957251499,198.80168209996401,139.19999999999999,3.6795681232689996,0.4473857403615345,4,0.29686387167011996,0.296863871667774,1.4543012423102477E-3,1.4543012423102477E-3,4,3.6094633544766663E-2,"N/A",1.2666880171313579E-4,"N/A"]
[null,"10242","KATOOMBA","Urban",1346,8534.6936358593994,800.58675019263296,184.03200000000001,2.6665256564189996,1.6378717155828004,8,0.21513261984199,0.21513261984541623,2.0541855674045323E-3,2.0541855674045323E-3,8,0.13214184993809958,"N/A",2.9755218515632845E-4,"N/A"]
[null,"10244","KATOOMBA","Rural short",924,22051.9443655379,3120.3799069280799,85,4.0571004842071989,0.69622137810607276,6,1.7067393269809898,1.6444235296311238,9.4959846585124467E-3,9.0411248238820349E-3,3,0.29288611680551313,"N/A",7.1656001345886638E-4,"N/A"]
[null,"10245","KATOOMBA","Urban",899.5,9803.0756065375608,507.71321846126898,70,0,0.58069054629610861,0,0,0,0,0,7,4.6849531803429142E-2,"N/A",1.6371345127075097E-4,"N/A"]
[null,"10247","KATOOMBA","Urban",457,24.857088888282998,2608.2310005280801,175.488,1.00244650013,0.13908134752507231,2,8.0876379834999998E-2,8.0876379835370035E-2,8.2005097293352271E-4,8.2005097293352271E-4,2,1.1220943849871181E-2,"N/A",3.2264694775987422E-5,"N/A"]
[null,"10248","KATOOMBA","Urban",1155,6229.8133860608104,1912.36872654328,109.248,0.70893912249800006,1.2255895741173704,3,5.7196498510199999E-2,5.7196498510324149E-2,3.9206569246699442E-4,3.9206569246699442E-4,5,9.8879339601447375E-2,"N/A",2.2585286343191192E-4,"N/A"]
[null,"10250","KATOOMBA","Urban",992.5,6825.8680339584598,5022.6860693211202,148.512,0.77392326832000002,1.055107538972154,1,6.2439354324000003E-2,6.2439354323708098E-2,1.1842337971482791E-3,1.1842337971482791E-3,6,8.5125019717313469E-2,"N/A",2.2704785212731887E-4,"N/A"]
[null,"10251","KATOOMBA","Urban",1388,8604.32207620193,1013.93363290892,143.52000000000001,3.4586503853134998,0.24528084291961633,9,0.27904044978069997,0.27904044978452569,1.6940945490152577E-3,1.6940945490152577E-3,4,1.9789012795938952E-2,"N/A",5.8554446074940131E-5,"N/A"]
[null,"10286","NORTH RICHMOND","Rural short",569,18990.2677660974,4183.05,141.624,3.4481509801529996E-2,5.6802658973232403E-2,3,1.4505667055229998E-2,1.4505667055062963E-2,8.7233392942818512E-5,8.7233392942818512E-5,3,2.3895718709693498E-2,"N/A",6.8540523026500261E-5,"N/A"]
[null,"10287","NORTH RICHMOND","Urban",943,4386.26,745.19267958397904,253.512,2.5375902858120001,-2.1635370003181373,2,0.20473024325,0.20473024325189884,1.1471891475906639E-3,1.1471891475906639E-3,3,-0.17455199873809193,"N/A",4.8277543294440435E-4,"N/A"]
[null,"10289","NORTH RICHMOND","Rural short",89.5,6300.5289642793996,209.99,30.312000000000001,0,0.1173082292224252,0,0,0,0,0,1,4.9349176579080188E-2,"N/A",2.2431443899581903E-4,"N/A"]
[null,"10290","NORTH RICHMOND","Urban",109.5,15834.0947647262,537.81091741404305,156.744,0,8.2648979679435935E-2,0,0,0,0,0,3,6.6680369203707332E-3,"N/A",2.7484739994359652E-5,"N/A"]
[null,"16647","NORTH PARRAMATTA","Urban",245.5,0,1192.3832587228901,65.471999999999994,1.2145548985000001E-2,0,1,9.7989073022999992E-4,9.7989073023369206E-4,2.9396721907010761E-4,2.9396721907010761E-4,0,0,"N/A",0,"N/A"]
[null,"16649","NORTH PARRAMATTA","Urban",1819,2451.1555747226698,3783.4249985207798,180.28800000000001,5.5676973945E-2,0,1,4.4919625060000001E-3,4.4919625060346928E-3,5.1384513902498485E-5,5.1384513902498485E-5,0,0,"N/A",0,"N/A"]
[null,"16651","NORTH PARRAMATTA","Urban",1150,0,2583.4607495718901,174.048,0.8001546917989999,1.7773974124609879E-2,5,6.4555679303599997E-2,6.4555679303273786E-2,3.3698681210475747E-4,3.3698681210475747E-4,1,1.4339864344883298E-3,"N/A",5.9749434770347074E-6,"N/A"]
[null,"16653","NORTH PARRAMATTA","Urban",1598.5,5232.3161285934902,1922.1580127729501,232.03200000000001,2.4368710990698998,0.34051972093731758,6,0.19660432012127999,0.19660432012313162,4.0247219261305787E-3,4.0247219261305787E-3,4,2.7472790107405585E-2,"N/A",5.8554446074940131E-5,"N/A"]
[null,"16660","NORTH PARRAMATTA","Urban",1321.5,6158.1004979972804,1467.4541150505499,263.23200000000003,0.31532511261899998,2.9623290207683129E-3,2,2.5440114336500001E-2,2.5440114336518375E-2,1.775753201374715E-3,1.775753201374715E-3,1,2.3899773908138828E-4,"N/A",1.1949886954069415E-6,"N/A"]
[null,"16662","NORTH PARRAMATTA","Urban",392,0,2209.9539009690802,155.71199999999999,0,8.2945212581512773E-3,0,0,0,0,0,1,6.6919366942788726E-4,"N/A",4.7799547816277659E-6,"N/A"]
[null,"16666","NORTH PARRAMATTA","Urban",2355.5,2239.0733323405898,5511.27,220.512,0.26998666694949996,5.7765415904982107E-3,2,2.1782253939739999E-2,2.1782253939877729E-2,9.9184061718776145E-5,9.9184061718776145E-5,1,4.6604559120870715E-4,"N/A",1.1949886954069415E-6,"N/A"]
[null,"17058","ARNDELL PARK","Urban",1335.5,3418.3105169759001,2249.95486255787,331.2,8.0693842525999995E-2,1.9846123274637315,1,6.5102984125999996E-3,6.5102984125770171E-3,2.8679728689766596E-5,2.8679728689766596E-5,6,0.16011653529757608,"N/A",3.6566654079452408E-4,"N/A"]
[null,"17059","ARNDELL PARK","Urban",56.5,135.87861545339501,1906.1596256601299,165.13,5.3158994277999999E-2,7.8205486148283463E-3,1,4.2888144277999996E-3,4.2888144278155132E-3,6.5724378247381776E-5,6.5724378247381776E-5,2,6.3095403117486507E-4,"N/A",2.389977390813883E-6,"N/A"]
[null,"17061","ARNDELL PARK","Urban",842.5,2121.4348713014201,5034.77656038033,210,0.63146486571659999,1.3539472905872614,6,5.0945953051290002E-2,5.0945953051284139E-2,1.6968839474778568E-4,1.6968839474778568E-4,2,0.10923511163584393,"N/A",4.1944103208783645E-4,"N/A"]
[null,"17067","ARNDELL PARK","Urban",1219.5,2216.0423443057198,4908.1365544209402,208.32,2.1095341434819002,0,2,0.17019510232210999,0.1701951023215405,1.3343000373260646E-3,1.3343000373260646E-3,0,0,"N/A",0,"N/A"]
[null,"17069","ARNDELL PARK","Urban",23,759.94,2520.8000000000002,82.75,9.5564734210000002E-2,0,1,7.7100670627999997E-3,7.7100670627655863E-3,2.389977390813883E-5,2.389977390813883E-5,0,0,"N/A",0,"N/A"]
[null,"1949","MARAYONG","Urban",2,75.89,1037.36003587189,596.928,4.2657537899000002E-3,0,1,3.4415674428000002E-4,3.4415674427719915E-4,2.389977390813883E-6,2.389977390813883E-6,0,0,"N/A",0,"N/A"]
[null,"1950","MARAYONG","Urban",346.5,3586.35788655747,2456.91617999344,175.56,0.81263933209000005,0.31815413683051685,2,6.5562927579999999E-2,6.5562927580163702E-2,7.3458514674931404E-4,7.3458514674931404E-4,2,2.5668357177341103E-2,"N/A",4.5409570425463773E-5,"N/A"]
[null,"1952","MARAYONG","Urban",360.5,1443.1906443487201,3572.89973113323,89.76,0.25556012462600003,8.8869870623049397E-3,3,2.0618334950100001E-2,2.0618334950551369E-2,1.7566333822482039E-4,1.7566333822482039E-4,1,7.169932172441649E-4,"N/A",2.389977390813883E-6,"N/A"]
[null,"1953","MARAYONG","Urban",23,1515.2271724357499,2802.1702052175501,110.4,1.9344008506000002E-2,0,1,1.5606552362000001E-3,1.5606552362014655E-3,2.7484739994359652E-5,2.7484739994359652E-5,0,0,"N/A",0,"N/A"]
[null,"1954","MARAYONG","Urban",368.5,467.11594702777802,5114.3044327232301,286.08,0.22426311851827999,0.83271068773797285,4,1.8093323837578001E-2,1.8093323837156498E-2,4.4334080599597528E-4,4.4334080599597528E-4,2,6.7182264455778254E-2,"N/A",1.4220365475342604E-4,"N/A"]
[null,"1957","MARAYONG","Urban",1531,10108.354468269799,953.68,264.83999999999997,4.0942793745685009,1.5242663976363355,8,0.33032236015511002,0.32825741968480976,2.2453837586696433E-3,2.2238739621523182E-3,4,0.12297628664432834,"N/A",3.1547701558743254E-4,"N/A"]
[null,"1958","MARAYONG","Urban",151,2308.0648368305301,1561.58,271.8,0.27367476658399997,0,2,2.20798061249E-2,2.2079806125034056E-2,3.6208157470830329E-4,3.6208157470830329E-4,0,0,"N/A",0,"N/A"]
[null,"1959","MARAYONG","Urban",883,5158.50593208191,1822.27862574405,335.04,0.15669239355600001,1.2964632959392524,2,1.26417854087E-2,1.2641785408710034E-2,1.4817859823046072E-4,1.4817859823046072E-4,4,0.10459736050896959,"N/A",2.7006744516196878E-4,"N/A"]
[null,"1960","MARAYONG","Urban",796.5,339.95,6649.4711863217899,238.08,4.8522949359999998E-2,8.5907541602281076E-3,1,3.9147829661999997E-3,3.9147829661531405E-3,4.6604559120870719E-5,4.6604559120870719E-5,1,6.9309344333602608E-4,"N/A",2.389977390813883E-6,"N/A"]
[null,"1962","MARAYONG","Urban",1932,7642.4855727322802,3791.03,311.39999999999998,1.167618371718,2.4517864256839981,5,9.4202281040500005E-2,9.4202281040883573E-2,1.9469694857417532E-3,1.9469694857417532E-3,6,0.19780767373940641,"N/A",5.1026017293876401E-4,"N/A"]
[null,"19816","WEST CASTLE HILL","Urban",954.5,1768.59090864673,11802.6666766816,302.11200000000002,1.0995869091999999,0.12441781887226916,1,8.871357077E-2,8.8713570769620526E-2,1.1388242267228153E-3,1.1388242267228153E-3,1,1.0037905041418308E-2,"N/A",4.1824604339242954E-5,"N/A"]
[null,"19856","SPRINGWOOD","Urban",1113.5,9715.5051808091703,3963.4381847194081,310.72000000000003,2.9563006812176003,0.74591444742946122,9,0.238511378677216,0.23851137868235769,3.1201154837075242E-3,3.1201154837075242E-3,2,6.017963070069357E-2,"N/A",2.8560229820225898E-4,"N/A"]
[null,"19857","SPRINGWOOD","Urban",2440.5,21685.009414384298,3479.97513855753,509,9.397307482651879,5.9010038443057917,17,0.7581653577589389,0.39084734258413922,9.9733756518663313E-3,6.9906838681306083E-3,17,0.47608708121621168,"N/A",2.3863924247276621E-3,"N/A"]
[null,"19868","LENNOX","Urban",1542,774.03409597401401,3555.0131441252202,121.44,0.30140216621999999,0.20262330502055262,1,2.4316824963E-2,2.431682496283585E-2,2.0434306691458699E-4,2.0434306691458699E-4,1,1.634744535316696E-2,"N/A",6.8114355638195656E-5,"N/A"]
[null,"19870","LENNOX","Urban",1655,381.30220754112497,3238.1933035981101,169.44,0,1.9995720890186114E-2,0,0,0,0,0,1,1.6132347387993709E-3,"N/A",5.9749434770347074E-6,"N/A"]
[null,"19871","LENNOX","Urban",1434.5,198.69,3258.4079633818201,107.04,0,0.13345292238561252,0,0,0,0,0,1,1.0766848145616542E-2,"N/A",2.0314807821918003E-5,"N/A"]
[null,"1A","SCHOFIELDS","Urban",0,0,0,0,0,1.1233151646753443,0,0,0,0,0,2,9.0627942659662439E-2,"N/A",1.8880821387429674E-4,"N/A"]
[null,"25449","KEMBLA GRANGE","Rural short",263.5,18208.915173986501,4824.22,61.2,0.71523564775370008,1.2815035343843724,10,0.300885031769,0.30088503177179232,1.9566413740217396E-3,1.9566413740217396E-3,13,0.5391023683866184,"N/A",1.4455819401952782E-3,"N/A"]
[null,"25450","KEMBLA GRANGE","Rural short",1184,16753.209050249101,446.93600337037299,175.2,3.0251921796498999,1.8235356869594543,9,1.2726365750493001,1.2726365750284836,8.7089026603445092E-3,8.7089026603445092E-3,6,0.76712422658250723,"N/A",2.1932967368480084E-3,"N/A"]
[null,"25451","KEMBLA GRANGE","Rural short",29,3359.94,1281.7554417511799,64,0.121751599494,0.37947434756042092,2,5.1218411717999998E-2,5.1218411717858042E-2,3.0077112884621378E-4,3.0077112884621378E-4,3,0.15963710908535789,"N/A",3.4893357177127405E-4,"N/A"]
[null,"25739","PRESTONS","Urban",407,478.68315793538801,7396.46,102.4,1.7744350834E-2,4.9767127548907664E-2,1,1.4315964571E-3,1.4315964570975159E-3,4.2780595295568503E-4,4.2780595295568503E-4,2,4.0151620165673231E-3,"N/A",9.5599095632555318E-6,"N/A"]
[null,"25740","PRESTONS","Urban",1054,0,5165.6188327059599,245,0.94776754690389997,0,4,7.6464936641320008E-2,7.6464936641699385E-2,1.6849340605237873E-4,1.6849340605237873E-4,0,0,"N/A",0,"N/A"]
[null,"25741","PRESTONS","Urban",388.5,1360.62,3234.25,104.64,2.4498461001800004E-2,0.12797261369719112,3,1.9765113021899998E-3,1.9765113022030814E-3,2.0314807821918003E-5,2.0314807821918003E-5,1,1.0324702328315975E-2,"N/A",1.9119819126511064E-5,"N/A"]
[null,"25744","PRESTONS","Rural short",613,8875.7999999999993,14740.25,180,0.64448430176000004,0.85033654541154424,1,0.27112138527000001,0.27112138526627994,3.445719021241331E-3,3.445719021241331E-3,7,0.35771922063194361,"N/A",8.7233392942818512E-4,"N/A"]
[null,"25747","PRESTONS","Urban",579,1003.10496809123,8772.7729550063505,120,0.17683623089,0.69910964890132188,1,1.4266970033999999E-2,1.4266970034463474E-2,5.2579502597905425E-5,5.2579502597905425E-5,2,5.6403466423207635E-2,"N/A",1.2188884693150803E-4,"N/A"]
[null,"25773","PARKLEA","Urban",1748.5,0,11917.1,290,9.6320128110500003E-2,0.21062159337662706,2,7.7710114862570004E-3,7.7710114862313395E-3,3.7044649557615181E-5,3.7044649557615181E-5,2,1.6992739248686706E-2,"N/A",9.4404106937148372E-5,"N/A"]
[null,"25774","PARKLEA","Urban",1728.5,220.36,11967.608552631,228.096,0.38310320061000003,2.8142125697298973E-3,7,3.090838260668E-2,3.0908382606700539E-2,2.9157724167929371E-4,2.9157724167929371E-4,1,2.2704785212731887E-4,"N/A",1.1949886954069415E-6,"N/A"]
[null,"25775","PARKLEA","Urban",1064,469.29132109773599,9738.5909772677805,188.928,0.23147638968599998,0,3,1.8675283331500002E-2,1.867528333181968E-2,1.326437451901705E-4,1.326437451901705E-4,0,0,"N/A",0,"N/A"]
[null,"25777","PARKLEA","Urban",1277.5,885.90595525325205,14392.37,306.81599999999997,9.5386994469000008E-3,1.6120846414570122,2,7.6957271984999997E-4,7.6957271984207023E-4,7.1699321724416489E-6,7.1699321724416489E-6,16,0.1300613746193961,"N/A",4.3019593034649892E-4,"N/A"]
[null,"25779","PARKLEA","Urban",758.5,0,9544.8499999999985,140.16,8.7388706112999999E-4,0,1,7.0504333028999995E-5,7.0504333029009549E-5,1.1949886954069415E-6,1.1949886954069415E-6,0,0,"N/A",0,"N/A"]
[null,"25780","PARKLEA","Urban",1661,538.85068427704005,11948.132004002,243.072,7.2665930880000007E-2,0.21987887156652805,2,5.8626145396000005E-3,5.8626145396664543E-3,5.2579502597905425E-5,5.2579502597905425E-5,3,1.7739607183316047E-2,"N/A",9.2014129546334492E-5,"N/A"]
[null,"25781","PARKLEA","Urban",1886,1385.0451700436299,15746.1093552235,231.93600000000001,2.4723598007732996,0,5,0.19946751304068999,0.19946751303732668,2.3087181595262104E-3,2.3087181595262104E-3,0,0,"N/A",0,"N/A"]
[null,"25782","PARKLEA","Urban",1065,0,12871.75,251.136,6.5867385776800014E-2,1.9551371537070868E-2,3,5.3141147285100006E-3,5.3141147284746686E-3,3.2264694775987422E-5,3.2264694775987422E-5,1,1.5773850779371627E-3,"N/A",4.7799547816277659E-6,"N/A"]
[null,"25783","PARKLEA","Urban",2307,5074.0448485022698,18512.758637774899,284,3.4097443844399997,0.75576419142351592,5,0.27509476260117,0.27509476260354576,2.7652038411716626E-3,2.7652038411716626E-3,5,6.0974298183139188E-2,"N/A",2.0434306691458699E-4,"N/A"]
[null,"25784","PARKLEA","Urban",2096,0,20704.5,289.92,7.2873293911E-3,2.1328768949531854E-2,1,5.8793443814E-4,0,1.1949886954069415E-6,0,1,1.7207837213859957E-3,"N/A",7.1699321724416489E-6,"N/A"]
[null,"27027","NARELLAN","Urban",759,0,5301.88,151,7.8368414244100001E-2,0,3,6.3226851874500015E-3,6.3226851873981272E-3,8.723417476470672E-5,8.723417476470672E-5,0,0,"N/A",0,"N/A"]
[null,"27029","NARELLAN","Urban",1019,2251.7600000000002,23970.0542946022,316,3.8954626623000001E-3,0.56950775424270816,1,3.1428202688999998E-4,3.1428202689202559E-4,1.1949886954069415E-6,1.1949886954069415E-6,12,4.5947315338396896E-2,"N/A",1.2666880171313579E-4,"N/A"]
[null,"27030","NARELLAN","Urban",1630,0,10839.595984646299,369,6.6948635868999996E-3,0.44523805182147747,1,5.4013489031999996E-4,5.4013489032393757E-4,1.1949886954069415E-6,1.1949886954069415E-6,2,3.592136018393266E-2,"N/A",1.6729841735697181E-4,"N/A"]
[null,"27031","NARELLAN","Urban",482,16483.992159401001,10480.1,148,1.7525879069529999,0.25313101482465233,3,0.14139703738411,0.14139703738402634,1.1328492832457804E-3,1.1328492832457804E-3,6,2.0422356804504629E-2,"N/A",4.3019593034649893E-5,"N/A"]
[null,"27033","NARELLAN","Urban",628.5,0,15651.94,287,3.7532708693000003E-2,0,1,3.0281013542000001E-3,3.0281013541611896E-3,1.6729841735697181E-5,1.6729841735697181E-5,0,0,"N/A",0,"N/A"]
[null,"27035","NARELLAN","Rural short",449.5,0,8919.25,144,1.1553083181E-3,4.2657537899063708E-2,1,4.8601461782000002E-4,4.8601461782427454E-4,6.2309566387727505E-6,6.2309566387727505E-6,2,1.7945155119665521E-2,"N/A",3.7385739832636508E-5,"N/A"]
[null,"27036","NARELLAN","Urban",0,0,0,0,0,3.3326201483643522E-3,0,0,0,0,0,1,2.6887245646656184E-4,"N/A",1.1949886954069415E-6,"N/A"]
[null,"27038","NARELLAN","Urban",502,0,15846.39,200,0.100911738093,0.12264042145980816,3,8.1414579817599992E-3,8.1414579818074907E-3,5.7359457379533191E-5,5.7359457379533191E-5,4,9.8945063979694759E-3,"N/A",2.6289751298952713E-5,"N/A"]
[null,"27039","NARELLAN","Urban",1153.5,0,7428.5928822412598,221,0.36490784383200003,0,3,2.9440399440839999E-2,2.944039944126477E-2,1.2020377337801508E-3,1.2020377337801508E-3,0,0,"N/A",0,"N/A"]
[null,"27040","NARELLAN","Urban",1239.5,0,15142.3687563638,311,0.14515412201850003,0.35636818119842806,5,1.1710889214947E-2,1.1710889214988024E-2,1.0037905041418309E-4,1.0037905041418309E-4,3,2.8751428011491012E-2,"N/A",1.4339864344883296E-4,"N/A"]
[null,"27041","NARELLAN","Urban",25.5,0,7343.44,69,5.0418839932999997E-2,0,1,4.0677415192000004E-3,4.0677415191652288E-3,4.4214581730056833E-5,4.4214581730056833E-5,0,0,"N/A",0,"N/A"]
[null,"27142","BOSSLEY PARK","Urban",628.5,45.18,4464.60562606236,75,0,0.23017296491369793,0,0,0,0,0,1,1.8570124326623871E-2,"N/A",4.4214581730056833E-5,"N/A"]
[null,"27187","WEST CASTLE HILL","Urban",632,963.14881430514504,6931.76373710608,284,0,8.4426377091896931E-2,0,0,0,0,0,1,6.8114355638195659E-3,"N/A",2.2704785212731886E-5,"N/A"]
[null,"27188","WEST CASTLE HILL","Urban",359,493.42052635192601,1496.2016601594601,201.6,2.4238812862999999,0,1,0.19555631504000001,0,4.4214581730056833E-4,0,0,0,"N/A",0,"N/A"]
[null,"27189","WEST CASTLE HILL","Urban",71.5,0,2642.3552849774701,180,8.7240589661000002E-3,2.2217467655762349E-3,2,7.0384834158999997E-4,7.0384834159468849E-4,2.389977390813883E-6,2.389977390813883E-6,1,1.7924830431104123E-4,"N/A",1.1949886954069415E-6,"N/A"]
[null,"27191","WEST CASTLE HILL","Urban",1054,3112.4428219280298,7361.0773758553796,360,3.01565094317E-2,1.3309744290312031,2,2.4329969838499999E-3,2.4329969838485328E-3,1.4339864344883298E-5,1.4339864344883298E-5,5,0.10738168416926776,"N/A",2.4736265994923685E-4,"N/A"]
[null,"27199","WEST CASTLE HILL","Urban",19,0,2081.75,13.36,1.2219607211000001E-2,0,1,9.8586567370999995E-4,9.8586567371072679E-4,1.7924830431104121E-5,1.7924830431104121E-5,0,0,"N/A",0,"N/A"]
[null,"27200","WEST CASTLE HILL","Urban",588.5,366.92899763664798,4271.89937784024,213.6,1.20418674689E-2,0,2,9.7152580936000002E-4,9.7152580936584344E-4,3.5849660862208244E-6,3.5849660862208244E-6,0,0,"N/A",0,"N/A"]
[null,"27201","WEST CASTLE HILL","Urban",574.5,1245.53458627909,3693.86,151.19999999999999,5.3118706603409995,0,5,0.4285564058595,3.8600524839035019E-2,7.9586247114102305E-4,1.3144875649476355E-4,0,0,"N/A",0,"N/A"]
[null,"27334","BOW BOWING","Urban",1767,6461.8055160444601,8717.5692797873198,217,1.8113012680563998,4.4434935311524698E-3,8,0.14613397256935098,0.14613397257261948,2.1533696291233082E-3,2.1533696291233082E-3,1,3.5849660862208245E-4,"N/A",1.1949886954069415E-6,"N/A"]
[null,"27335","BOW BOWING","Urban",505,4166.9657928460801,1421.3624175305799,199,1.6988956934400001E-2,0.43368496864048106,2,1.37065203363E-3,1.3706520336317619E-3,9.5599095632555318E-6,9.5599095632555318E-6,2,3.4989269001515243E-2,"N/A",5.9749434770347071E-5,"N/A"]
[null,"27336","BOW BOWING","Urban",9,278.39,1710.70758762783,192,0,8.4426377091896924E-3,0,0,0,0,0,1,6.8114355638195661E-4,"N/A",2.389977390813883E-6,"N/A"]
[null,"27337","BOW BOWING","Urban",5,0,626.12359410120996,99,0,5.3321922373829635E-3,0,0,0,0,0,1,4.3019593034649892E-4,"N/A",2.389977390813883E-6,"N/A"]
[null,"27339","BOW BOWING","Urban",30.5,0,3638.7926830503502,188,0,2.2958049910954425E-3,0,0,0,0,0,1,1.8522324778807593E-4,"N/A",1.1949886954069415E-6,"N/A"]
[null,"27340","BOW BOWING","Urban",626.5,213.560828706188,8787.7583103329198,189,8.5211394282509997E-2,3.443707486643164E-2,6,6.8747699647029991E-3,6.8747699646761334E-3,3.7044649557615181E-5,3.7044649557615181E-5,2,2.7783487168211388E-3,"N/A",5.9749434770347074E-6,"N/A"]
[null,"27446","NORTH RICHMOND","Urban",383.5,1876.8,2725.33,147,0,0.37947434756042092,0,0,0,0,0,3,3.061561037632584E-2,"N/A",6.5724378247381776E-5,"N/A"]
[null,"27454","NORTH RICHMOND","Rural short",548.5,28454.885903590599,5919.3,172.8,5.2070438352242006,-0.15248588634404892,7,2.1904970126825001,1.6023944012978886,8.5585360181743043E-3,6.0349985794713405E-3,8,-6.4147698596165467E-2,"N/A",7.9756244976291206E-4,"N/A"]
[null,"2806","DUNDAS","Urban",865,4448.3778202433896,3468.8585276395202,325.92,2.1269382143539999,0.10760660167940897,4,0.17159924533490001,0.11486889237208747,3.4766153735310123E-3,2.7038464572604203E-3,2,8.6815928721314297E-3,"N/A",1.2188884693150803E-4,"N/A"]
[null,"2807","DUNDAS","Urban",1301.5,7493.6898325194497,2646.3205191407201,205,2.5211800908849997,1.7856919337191393,4,0.20340628515529999,0.20340628515844722,4.4327089429543661E-3,4.4327089429543661E-3,6,0.14406783711826085,"N/A",3.1428202689202559E-4,"N/A"]
[null,"2809","DUNDAS","Urban",625,3368.2344146938399,1691.9688899508001,162.048,0.55847204772600001,0.14219179299687904,3,4.5056965587599994E-2,4.5056965587593055E-2,1.2547214956321537E-3,1.2547214956321537E-3,2,1.1471891475906638E-2,"N/A",2.9874717385173535E-5,"N/A"]
[null,"2810","DUNDAS","Urban",1413.5,5707.0583823274401,1417.9289589714799,202.08,0.25852705496200001,0,3,2.0857703919700002E-2,2.0857703919751683E-2,1.8489607555574046E-3,1.8489607555574046E-3,0,0,"N/A",0,"N/A"]
[null,"2812","DUNDAS","Urban",1767.5,4877.2295693894102,1545.1629474439601,80.831999999999994,4.4803187987499999,0.52670209989260608,5,0.36146763432400003,0.24564042468940656,7.2296833724652954E-3,5.6519095248727842E-3,4,4.2493798008670841E-2,"N/A",1.1710889214988026E-4,"N/A"]
[null,"2813","DUNDAS","Urban",851,6205.73195194241,334.34309482545802,133.24799999999999,2.4294763568809996,0,6,0.19600771972799999,0.19600771972816158,4.0302373244219831E-3,4.0302373244219831E-3,0,0,"N/A",0,"N/A"]
[null,"2815","DUNDAS","Urban",1799,6693.7586857260003,1060.3599999999999,285.39999999999998,4.8266052809918003,0,7,0.38940568097252898,0.3894056809742395,6.6447530910320601E-3,6.6447530910320601E-3,0,0,"N/A",0,"N/A"]
[null,"2816","DUNDAS","Urban",731.5,5564.0688595990996,199.43,150,0.40541269732349994,0,6,3.270829046202E-2,3.2708290462290936E-2,1.7377248794397415E-3,1.7377248794397415E-3,0,0,"N/A",0,"N/A"]
[null,"317","TRANSMISSION","Rural short",0,0,0,0,7.2577061009000004E-4,0,1,3.0531687529999999E-4,3.0531687529986479E-4,6.2309566387727505E-6,6.2309566387727505E-6,0,0,"N/A",0,"N/A"]
[null,"35001","QUARRIES","Urban",908.5,3026.3239282274999,3886.83,193.96799999999999,0.13693365899000001,0.87625692434326707,1,1.1047670488999999E-2,1.1047670489037174E-2,9.7989073023369198E-5,9.7989073023369198E-5,2,7.0695531220274652E-2,"N/A",1.6251846257534403E-4,"N/A"]
[null,"35004","QUARRIES","Urban",698,0,7745.21,184.96799999999999,0,1.0012672090196899,0,0,0,0,0,3,8.0781235809509244E-2,"N/A",1.9717313474214534E-4,"N/A"]
[null,"35005","QUARRIES","Urban",666,3091.7444240023601,2874.0378186764801,149.976,5.5452873755100001,2.3060250262170934,2,0.44738823271,5.0580286510489611E-2,1.4722260727413519E-3,6.7516861290492188E-4,3,0.18604778998790672,"N/A",3.0711209471958397E-4,"N/A"]
[null,"35009","QUARRIES","Urban",11,348.95,2764.11,94.968000000000004,0,2.6364728284837987E-2,0,0,0,0,0,2,2.1270798778243558E-3,"N/A",5.9749434770347074E-6,"N/A"]
[null,"35010","QUARRIES","Urban",647.5,2515.0252942239599,5510.01,158.976,0,0.62816186885392078,0,0,0,0,0,2,5.0679470572208389E-2,"N/A",1.3025376779935661E-4,"N/A"]
[null,"35011","QUARRIES","Urban",70,0,1687.56,93.02,9.4794528665000002E-4,3.9547092427256979E-2,1,7.6479276506000006E-5,7.6479276506044255E-5,1.1949886954069415E-6,1.1949886954069415E-6,2,3.1906198167365339E-3,"N/A",8.3649208678485904E-6,"N/A"]
[null,"35014","QUARRIES","Urban",19,0,3165.3,139.03200000000001,0,4.5175517566716774E-3,0,0,0,0,0,1,3.6447155209911713E-4,"N/A",1.1949886954069415E-6,"N/A"]
[null,"35304","BAULKHAM HILLS","Urban",1068,6146.05996253181,1343.71376751358,270.048,7.8627721849999999E-2,7.6650263412380099E-2,1,6.3436058654000003E-3,6.3436058653575647E-3,1.2687211730715128E-3,1.2687211730715128E-3,2,6.1840664987309222E-3,"N/A",1.1949886954069415E-5,"N/A"]
[null,"35305","BAULKHAM HILLS","Urban",1087.5,6100.7820279494799,288.98,396,8.0681431001000004E-2,0,1,6.5092970631999997E-3,6.5092970631927703E-3,1.3018594126385542E-3,1.3018594126385542E-3,0,0,"N/A",0,"N/A"]
[null,"35306","BAULKHAM HILLS","Urban",484,2440.8709310202798,1973.6095666966401,160,0.92875696521040008,1.2858729696900055,4,7.4931181946130007E-2,7.4931181946536349E-2,1.3100687658529878E-3,1.3100687658529878E-3,5,0.10374294359175362,"N/A",2.3302279560435358E-4,"N/A"]
[null,"35307","BAULKHAM HILLS","Urban",513,3956.0096388368502,675.55006310026602,143.04,0.52546038280899998,0,3,4.2393617517599999E-2,1.1043089093651599E-2,7.3854272564070032E-4,6.7281834739331859E-4,0,0,"N/A",0,"N/A"]
[null,"35312","BAULKHAM HILLS","Urban",101.5,1165.0126504575601,853.2,84,7.5547158083999998E-3,3.3326201483643522E-3,1,6.0950690655E-4,6.0950690654657837E-4,1.2190138130931566E-4,1.2190138130931566E-4,1,2.6887245646656184E-4,"N/A",1.1949886954069415E-6,"N/A"]
[null,"35314","BAULKHAM HILLS","Urban",425.5,3094.1301181894701,1431.16,170,3.1172371067E-2,0.14885703329360775,1,2.5149556833000001E-3,2.5149556833416668E-3,5.0299113666833328E-4,5.0299113666833328E-4,2,1.2009636388839761E-2,"N/A",2.8679728689766596E-5,"N/A"]
[null,"35315","BAULKHAM HILLS","Urban",1364,3550.432784526,1832.4351561257599,201.024,0.18616628230300003,0.91847011288921554,3,1.5019709239499999E-2,1.5019709239490456E-2,1.7291279076379661E-3,1.7291279076379661E-3,1,7.4101249002184441E-2,"N/A",1.2666880171313579E-4,"N/A"]
[null,"35325","BAULKHAM HILLS","Urban",831.5,6206.6399485573002,2565.9588875732102,211.00800000000001,6.2077550279399998E-2,0,2,5.0083545955279998E-3,5.0083545954837071E-3,9.83507090926556E-4,9.83507090926556E-4,0,0,"N/A",0,"N/A"]
[null,"35326","BAULKHAM HILLS","Urban",477,4213.6572358394496,3151.0767022611599,201.024,0.60838748484500005,4.2657537899063708E-2,4,4.9084093070900003E-2,4.908409307138327E-2,1.2181579576064662E-3,1.2181579576064662E-3,1,3.4415674427719914E-3,"N/A",9.5599095632555318E-6,"N/A"]
[null,"35327","BAULKHAM HILLS","Urban",1383.5,6454.08518632701,763.13632589070198,244.99199999999999,5.7516516321875999,0.8922535010554159,6,0.46403749429839003,8.4213922427990542E-2,6.1622145237899498E-3,3.3707209313193348E-3,3,7.1986119011314159E-2,"N/A",1.6849340605237873E-4,"N/A"]
[null,"35333","BAULKHAM HILLS","Urban",996,4238.4114053415797,1008.22,230.01599999999999,3.669796777512,2.1435412794279514,3,0.29607552926969999,7.3952225559368381E-2,3.6199297849486686E-3,2.4106012251968434E-3,2,0.17293876399929256,"N/A",3.7881141644400043E-4,"N/A"]
[null,"35335","BAULKHAM HILLS","Urban",645,2846.4237060852001,1341.0625388559999,239,1.8388060444439998,0,4,0.14835303038129999,0.14416578999324084,2.0013598274588708E-3,1.9822400083323597E-3,0,0,"N/A",0,"N/A"]
[null,"35384","NORTH PARRAMATTA","Urban",4,0,1250.26,47.015999999999998,0,1.1849316083073253E-3,0,0,0,0,0,1,9.5599095632555318E-5,"N/A",1.1949886954069415E-6,"N/A"]
[null,"35388","NORTH PARRAMATTA","Urban",1568,1884.6555150444599,4579.1791483065299,243,2.4807876268304998,0,6,0.20014746160558,0.20014746160501323,4.4322130712643459E-3,4.4322130712643459E-3,0,0,"N/A",0,"N/A"]
[null,"35403","NORTH PARRAMATTA","Urban",1588,387.02719250337998,6496.0326929789499,201.024,0,4.7397264332293011E-3,0,0,0,0,0,1,3.8239638253022127E-4,"N/A",2.389977390813883E-5,"N/A"]
[null,"35418","WISEMANS","Rural short",356.5,44309.846157557498,460.59,80.712000000000003,6.8392030683623002,0.6134242819755984,10,2.8771130731737999,2.8771130731701238,1.1664350827782591E-2,1.1664350827782591E-2,5,0.2580550691947735,"N/A",7.5394575329150286E-4,"N/A"]
[null,"35441","HOMEPRIDE","Urban",16,0,1584.51,165,1.3774829947000001E-3,6.9318499085978522E-2,1,1.1113394867E-4,1.1113394867284556E-4,2.2704785212731886E-5,2.2704785212731886E-5,1,5.5925470945044856E-3,"N/A",1.5534853040290238E-5,"N/A"]
[null,"35442","HOMEPRIDE","Urban",705,0,5590.1811878298904,220,0,0.12797261369719112,0,0,0,0,0,1,1.0324702328315975E-2,"N/A",1.9119819126511064E-5,"N/A"]
[null,"35443","HOMEPRIDE","Urban",480,0,3336.3441366029101,167.2,3.6362588729999999E-2,0.10183006008891077,1,2.9336972471999999E-3,2.9336972472240415E-3,5.771795398815527E-4,5.771795398815527E-4,1,8.2155472809227227E-3,"N/A",2.9874717385173535E-5,"N/A"]
[null,"35444","HOMEPRIDE","Urban",41,1053.03952474891,2217.9230103446898,254,7.4265588549999997E-2,9.9312080421257692E-2,2,5.9916733187999997E-3,5.9916733187704045E-3,5.0189525207091539E-5,5.0189525207091539E-5,2,8.0123992027035431E-3,"N/A",1.4339864344883298E-5,"N/A"]
[null,"35569","LIVERPOOL 11kV","Urban",0,0,0,0,6.2208909436E-2,1.7515510917547843,1,5.0189525206999997E-3,5.0189525207091539E-3,4.1824604339242954E-5,4.1824604339242954E-5,2,0.14131338817534786,"N/A",3.1069706080580475E-4,"N/A"]
[null,"35570","LIVERPOOL","Urban",786,412.76,2868.53,null,0.13490446361,1.1986323800283787,1,1.0883957038E-2,1.0883957037766423E-2,9.8945063979694742E-4,9.8945063979694742E-4,2,9.6704460175806736E-2,"N/A",3.2503692515068806E-4,"N/A"]
[null,"35571","LIVERPOOL","Urban",1872.5,5693.7392738130602,3568.26,185,0.42188008749299999,-1.7298520316776564,3,3.40368630114E-2,3.4036863011275911E-2,1.9239317996051758E-4,1.9239317996051758E-4,4,-0.13956272973657669,"N/A",2.5931254690330632E-4,"N/A"]
[null,"35572","LIVERPOOL","Urban",1560,1377.73757029183,3980.54,120,8.9758569328999994E-3,0.27994009246260559,2,7.2416314941E-4,7.2416314941660658E-4,7.1699321724416489E-6,7.1699321724416489E-6,3,2.2585286343191194E-2,"N/A",4.8994536511684599E-5,"N/A"]
[null,"35590","KEMBLA GRANGE","Urban",3,0,595.78,10,6.9185071020000004E-3,0,1,5.5817822517999997E-4,5.5817822517737457E-4,3.6172854753187038E-6,3.6172854753187038E-6,0,0,"N/A",0,"N/A"]
[null,"35693","SPRINGWOOD","Rural short",941,18226.886605696502,1485.03,132,0.81480340880699997,2.613248168960975,3,0.342771155652,0.34277115565552779,6.6671236034868435E-4,6.6671236034868435E-4,4,1.0993401416919539,"N/A",3.1715569291353302E-3,"N/A"]
[null,"35695","SPRINGWOOD","Rural short",548,13354.0311089636,1345.8754640272,117.024,3.8467619732237996,0.87945623968569686,12,1.6182542105708002,1.1372555128388862,1.2923004068814685E-2,1.0767093071799315E-2,6,0.36996928138377083,"N/A",7.9133149312413933E-4,"N/A"]
[null,"35696","SPRINGWOOD","Urban",1380,13309.6750110423,1863.0276967770201,254.01599999999999,2.4528528641606999,1.9326234531492474,6,0.19789371292757002,0.19718388964040401,3.2898038784553098E-3,3.2336394097711835E-3,4,0.15592212497669772,"N/A",4.3856085121434749E-4,"N/A"]
[null,"35701","SPRINGWOOD","Urban",1069.5,10383.6983723952,2544.9774360541601,164,1.1157167907350001,2.0255517145307493,3,9.0014913459099996E-2,9.0014913458918669E-2,1.3861868866720522E-3,1.3861868866720522E-3,4,0.16341948405168086,"N/A",4.2422098686946424E-4,"N/A"]
[null,"35702","SPRINGWOOD","Urban",856.5,8234.8196982335994,1545.7667269421299,143.04,3.6154195749221998,2.5797442277360854,6,0.29168843102415998,0.29168843102191261,1.6493165444147865E-3,1.6493165444147865E-3,4,0.20813118107902701,"N/A",4.6604559120870715E-4,"N/A"]
[null,"35761","WERRINGTON","Urban",184.5,3150.04405922356,2387.6864686522399,178,0.2644174883964,0.13463785399391984,3,2.1332938190560001E-2,2.1332938190404719E-2,2.2585286343191192E-4,2.2585286343191192E-4,2,1.0862447241249098E-2,"N/A",2.2704785212731886E-5,"N/A"]
[null,"35762","WERRINGTON","Urban",730.5,2385.3608980478398,3887.0898373231298,171,0.78229184780899996,0,2,6.3114522936700002E-2,6.3114522936613016E-2,1.3861868866720521E-4,1.3861868866720521E-4,0,0,"N/A",0,"N/A"]
[null,"35763","WERRINGTON","Urban",253,5134.6887649606897,1120.38054490589,230,0.49784901522999997,2.6438786510357196E-2,3,4.0165960030199996E-2,4.0165960030018114E-2,7.1699321724416482E-5,7.1699321724416482E-5,1,2.1330548213013903E-3,"N/A",8.3649208678485904E-6,"N/A"]
[null,"35764","WERRINGTON","Urban",123,1851.6101807597299,2271.26187865169,109.008,1.9373631796000001E-2,0,1,1.5630452136E-3,1.5630452135922794E-3,1.4339864344883298E-5,1.4339864344883298E-5,0,0,"N/A",0,"N/A"]
[null,"35765","WERRINGTON","Urban",1104,6571.7833083154501,247.50399869080101,192,0.51046853685479998,0.97016275430162258,3,4.1184090398700003E-2,3.5601103213563599E-2,5.9749434770347068E-4,5.5925470945044861E-4,1,7.8271759549154662E-2,"N/A",1.5654351909830932E-4,"N/A"]
[null,"35766","WERRINGTON","Urban",373.5,2266.8713413230698,185.57408842255299,65.016000000000005,1.18789393733E-2,0.10412586508000621,3,9.5838093371999997E-4,9.5838093371636702E-4,3.5849660862208244E-6,3.5849660862208244E-6,1,8.4007705287107992E-3,"N/A",2.2704785212731886E-5,"N/A"]
[null,"35767","WERRINGTON","Urban",567,2801.7290141344502,2459.3891330568999,228.024,2.0025344180100001E-2,1.807020702668671E-2,2,1.6156247161879999E-3,1.6156247161901848E-3,5.9749434770347074E-6,5.9749434770347074E-6,1,1.4578862083964685E-3,"N/A",2.389977390813883E-6,"N/A"]
[null,"35768","WERRINGTON","Urban",593,0,7369.25,114,0,6.8429800379748038E-2,0,0,0,0,0,1,5.5208477727800697E-3,"N/A",1.3144875649476356E-5,"N/A"]
[null,"35769","WERRINGTON","Urban",70,3341.9539042204801,1128.50309354975,93,0,0.11286473569127273,0,0,0,0,0,3,9.1058138590008938E-3,"N/A",1.7924830431104121E-5,"N/A"]
[null,"35771","WERRINGTON","Urban",116,1945.45075188172,852.96893303182799,110.01600000000001,0,4.0065500005891437E-2,0,0,0,0,0,2,3.2324444210757768E-3,"N/A",8.3649208678485904E-6,"N/A"]
[null,"35773","WERRINGTON","Urban",381.5,3510.47797594961,1572.45,164,0.53906982354999999,4.4434935311524698E-3,1,4.3491613568999998E-2,4.3491613569335633E-2,4.5529069295004469E-4,4.5529069295004469E-4,1,3.5849660862208245E-4,"N/A",1.1949886954069415E-6,"N/A"]
[null,"35815","TAHMOOR","Rural short",509.5,16784.397908734099,228.169145097274,119,0.18341260132100004,0.5449944815958504,5,7.7157936057900001E-2,6.9306930693069313E-2,4.2370505143654705E-4,3.8631931160391052E-4,3,0.22926804952364335,"N/A",5.1093844437936561E-4,"N/A"]
[null,"35816","TAHMOOR","Rural short",1077,34020.605879374903,71.16,149,6.9815874128750011,1.118767989628465,15,2.9370112593356694,1.1667279377402813,1.4711288624142463E-2,8.006779280822985E-3,9,0.47064284779642218,"N/A",1.6387415959972335E-3,"N/A"]
[null,"35818","TAHMOOR","Rural short",1379.5,24822.5550229119,2068.5,202,9.424086936996348,4.6325641809030076,14,3.9645209329381501,3.9645209328988282,3.1553564418745211E-2,3.1553564418745211E-2,16,1.9488251531257594,"N/A",4.579753129497972E-3,"N/A"]
[null,"35824","TAHMOOR","Rural short",1217.5,13867.853943566301,770.39,152,1.4561920767350001,0.62801375240288237,5,0.61259027097880003,0.61259027098430419,9.2218158253836707E-3,9.2218158253836707E-3,6,0.26419256148396464,"N/A",8.8479584270573057E-4,"N/A"]
[null,"35825","TAHMOOR","Rural short",1129.5,27887.809430139201,1254.93,196,0.74615143375070003,4.1176373388679556E-2,8,0.31389067163189999,0.29800173220594556,3.3397927583821946E-3,3.1528640592190121E-3,3,1.7322059455788248E-2,"N/A",6.2309566387727506E-5,"N/A"]
[null,"35827","TAHMOOR","Rural short",152,8438.9329843091491,330.97,110,0,0.33104026807085901,0,0,0,0,0,2,0.13926188087657099,"N/A",3.7385739832636506E-4,"N/A"]
[null,"35980","MALDON","Rural short",450.5,30769.220033798701,125.6,119,1.8524035832289001,0.48502213057039589,5,0.77926836107069997,0.77926836107147524,4.8165294817713363E-3,4.8165294817713363E-3,6,0.20403890609325251,"N/A",5.6078609748954754E-4,"N/A"]
[null,"35981","MALDON","Rural short",448,12313.279393049799,1347.44,107,5.0952059157000004E-3,3.8806510172064899E-2,1,2.1434490837E-3,2.1434490837378261E-3,6.2309566387727505E-6,6.2309566387727505E-6,4,1.6325106393584608E-2,"N/A",9.9695306220364007E-5,"N/A"]
[null,"35982","MALDON","Rural short",455.5,38350.883416250203,1432.71568639425,119,1.7719763503043997,1.1997432534111669E-2,7,0.74543426651904987,0.7385428284804566,3.1653259724965578E-3,3.1528640592190121E-3,19,5.0470748774059278E-3,"N/A",1.8568250783542798E-3,"N/A"]
[null,"35983","MALDON","Rural short",1081.5,24050.2187996578,6856.5349471932605,215,2.3566512291797999,0.36036732537646532,11,0.99139504887942997,0.99139504888185481,1.4393509835565055E-2,1.4393509835565055E-2,3,0.15159917502134101,"N/A",3.6139548504881956E-4,"N/A"]
[null,"35988","MALDON","Rural short",667,52870.332709766197,3419.84,153,9.8304888554700015E-2,1.3970639894845442,5,4.1354859211400002E-2,1.3240782857392096E-2,1.3708104605300052E-4,6.2309566387727506E-5,8,0.58771629208232334,"N/A",1.6200487260809152E-3,"N/A"]
[null,"35989","MALDON","Rural short",295,35268.178434710397,622.82000000000005,68,0.40258051392760003,1.0069252574493572,6,0.16935740144219999,0.16935740144184336,2.4674588289540097E-3,2.4674588289540097E-3,20,0.42359289421704915,"N/A",1.3957342870850962E-3,"N/A"]
[null,"35990","MALDON","Rural short",1151.5,43914.705917293999,3280.5489716808202,213,4.8262412523052198,1.5023451628826501,20,2.0303011420876702,1.8254958283745299,1.2517991887294459E-2,1.1589579348117321E-2,22,0.63200593187072007,"N/A",2.1808348235704627E-3,"N/A"]
[null,"41361","PARKLEA","Urban",1613,0,10294.6854483364,238,7.2177146591200003E-2,0.94557542342924561,3,5.8231799126800005E-3,3.6733952496809381E-3,4.5409570425463773E-5,2.1509796517324943E-5,5,7.6288078314779142E-2,"N/A",1.4339864344883296E-4,"N/A"]
[null,"41362","PARKLEA","Urban",455.5,533.47,6886.09,62,0.57341802855000001,0,2,4.6262792353999993E-2,4.6262792353984332E-2,5.6642464162289018E-4,5.6642464162289018E-4,0,0,"N/A",0,"N/A"]
[null,"41533","WERRINGTON","Rural short",1168,18295.5924432514,3378.1490319398299,215,0.98996592380778003,2.6568388405015808,4,0.41645844886738004,0.41645844886565436,9.1221205191633088E-3,9.1221205191633088E-3,9,1.1176778470798621,"N/A",2.5983089183682371E-3,"N/A"]
[null,"41535","WERRINGTON","Urban",1709.5,11227.815888012599,1312.9907977768901,256,8.7992873116631998,0,5,0.7099176891794301,2.6124842858986554E-2,1.0300802554407836E-3,8.8429163460113666E-5,0,0,"N/A",0,"N/A"]
[null,"41537","WERRINGTON","Urban",1398,7193.1406498855304,1877.56,218,1.145873300214,1.6535720593928724,2,9.2447910443099995E-2,9.2447910442767206E-2,1.6932989813916361E-3,1.6932989813916361E-3,4,0.13340853795523094,"N/A",3.3579182340935052E-4,"N/A"]
[null,"457","TRANSMISSION","Rural short",0,0,0,0,0,0,0,0,0,0,0,0,0,"N/A",0,"N/A"]
[null,"461","TRANSMISSION","Rural short",0,0,0,0,0,0,0,0,0,0,0,0,0,"N/A",0,"N/A"]
[null,"46395","NEWTON","Urban",870.5,3361.6868418286399,4932.0873694821003,142,0,0.77035366185079979,0,0,0,0,0,2,6.2151362048115028E-2,"N/A",1.5654351909830932E-4,"N/A"]
[null,"46397","NEWTON","Urban",1141.5,2520.2374937264199,3644.43840648995,114,0.42761219414400004,0.76428088735822475,2,3.4499323636400001E-2,3.4499323636398398E-2,1.4017217397123425E-3,1.4017217397123425E-3,4,6.1661416682998176E-2,"N/A",1.2666880171313579E-4,"N/A"]
[null,"46748","ARNDELL PARK","Urban",13,0,1829.57,140,9.8941789293999997E-3,0,1,7.9825244852999998E-4,7.9825244853183683E-4,2.389977390813883E-6,2.389977390813883E-6,0,0,"N/A",0,"N/A"]
[null,"46750","ARNDELL PARK","Urban",96.5,959.24493432181202,2664.8156958069999,148.03200000000001,6.5763704260999997E-3,2.1476885400570269E-3,1,5.3057498076000003E-4,5.30574980760682E-4,4.7799547816277659E-6,4.7799547816277659E-6,1,1.7327336083400652E-4,"N/A",1.1949886954069415E-6,"N/A"]
[null,"46752","ARNDELL PARK","Urban",1553.5,6505.9522999894498,2355.81,258.98399999999998,3.9302696271210005,1.0118575352689365,6,0.31709021795940007,0.3170902179589441,4.1901327015371999E-3,4.1901327015371999E-3,4,8.1635652726725211E-2,"N/A",2.0314807821918005E-4,"N/A"]
[null,"46768","ARNDELL PARK","Urban",94,778.57586191242797,711.09449202680696,122.976,0,9.6645984302566212E-2,0,0,0,0,0,1,7.7973012375302927E-3,"N/A",3.4654672166801301E-5,"N/A"]
[null,"46772","ARNDELL PARK","Urban",10,1029.25,1341.36,100.008,2.0736303145000002E-3,0,1,1.6729841735999999E-4,1.6729841735697181E-4,2.389977390813883E-6,2.389977390813883E-6,0,0,"N/A",0,"N/A"]
[null,"46774","ARNDELL PARK","Urban",777.5,2759.46222556984,5134.1092589324298,238.96799999999999,1.6373207419419999,0,2,0.1320973979358,0.13209739793267763,9.3806612589421962E-4,9.3806612589421962E-4,0,0,"N/A",0,"N/A"]
[null,"48157","HINCHINBROOK","Urban",8,0,2680.87,94.72,0,5.9246580415366263E-4,0,0,0,0,0,1,4.7799547816277659E-5,"N/A",1.1949886954069415E-6,"N/A"]
[null,"48159","HINCHINBROOK","Urban",839,0,4271.4991988832999,240,6.3541957495000002E-3,0,1,5.1265015032999999E-4,5.1265015032957791E-4,1.1949886954069415E-6,1.1949886954069415E-6,0,0,"N/A",0,"N/A"]
[null,"48161","HINCHINBROOK","Urban",1087,863.24016340250103,8720.5319991827291,250,0.21546500132199997,6.0579628474712001E-3,2,1.7383500552000001E-2,1.7383500552084777E-2,5.3774491293312365E-5,5.3774491293312365E-5,2,4.8875037642143908E-4,"N/A",2.389977390813883E-6,"N/A"]
[null,"48168","HINCHINBROOK","Urban",727.5,17.41,10207.048728723399,184,0,1.4959761554879981E-2,0,0,0,0,0,2,1.2069385823610108E-3,"N/A",4.7799547816277659E-6,"N/A"]
[null,"48178","HINCHINBROOK","Urban",952.5,57.91,7852.8784329258497,240,0.23277981445000001,0,1,1.8780442336999999E-2,1.8780442337015493E-2,1.0671249049983987E-3,1.0671249049983987E-3,0,0,"N/A",0,"N/A"]
[null,"48180","HINCHINBROOK","Urban",521,227.3,5503.5,205,0,2.2513700557839179E-2,0,0,0,0,0,1,1.816382817018551E-3,"N/A",9.5599095632555318E-6,"N/A"]
[null,"48185","HINCHINBROOK","Rural short",974,4538.0212230544103,10579.22,210,0,0.6466023670082035,0,0,0,0,0,4,0.27201241206562443,"N/A",6.5425044707113878E-4,"N/A"]
[null,"48187","HINCHINBROOK","Urban",652,0,5811.69,150.72,0,0.14663528652803151,0,0,0,0,0,1,1.183038808452872E-2,"N/A",6.5724378247381776E-5,"N/A"]
[null,"48189","HINCHINBROOK","Urban",1067,0,7095.49497686226,230,0.27552622222000001,0,2,2.2229179711699999E-2,2.2229179711959923E-2,8.484419737389284E-5,8.484419737389284E-5,0,0,"N/A",0,"N/A"]
[null,"48196","HINCHINBROOK","Rural short",791,15989.501389483199,2433.58,300,9.5179631437499995E-2,4.2338643179978002,4,4.0040127361660002E-2,4.0040127360753699E-2,2.8039304874477377E-4,2.8039304874477377E-4,20,1.7811002623232746,"N/A",3.6575715469596049E-3,"N/A"]
[null,"48198","HINCHINBROOK","Urban",171,0,1338.77,40,0,3.6658821632007878E-2,0,0,0,0,0,1,2.95759702113218E-3,"N/A",1.0754898258662473E-5,"N/A"]
[null,"48205","HINCHINBROOK","Urban",1223,324.88,7510.99,230,1.6589042516000001E-2,7.420634197024624E-2,1,1.3383873389E-3,1.3383873388557745E-3,4.1824604339242954E-5,4.1824604339242954E-5,2,5.9868933639887767E-3,"N/A",2.0314807821918003E-5,"N/A"]
[null,"4857","YENNORA","Urban",566.5,3727.6781200187702,486.705299605108,170.976,3.3153281161959995,6.4356597976191601E-2,5,0.26747735263079997,0.26747735262633882,2.1791042299043324E-3,2.1791042299043324E-3,3,5.1922258815431605E-3,"N/A",1.0754898258662473E-5,"N/A"]
[null,"4859","YENNORA","Urban",239,2028.9985405442401,510.14516055594999,38.015999999999998,0.66298642529999996,0.37467537454677624,2,5.3489080915000001E-2,5.348908091500143E-2,5.5880230392657743E-4,5.5880230392657743E-4,2,3.0228434039013992E-2,"N/A",8.1259231287672014E-5,"N/A"]
[null,"4860","YENNORA","Urban",214.5,2168.46239454751,1233.53,150,0.86032504125000009,8.8869870623049397E-3,5,6.9410162845099987E-2,6.9410162845845086E-2,7.8575807460681769E-4,7.8575807460681769E-4,1,7.169932172441649E-4,"N/A",2.389977390813883E-6,"N/A"]
[null,"4866","YENNORA","Urban",967,4289.9760706118896,1014.59,192.96,6.9529351759460001,0.61720125147707805,11,0.56095584769609996,0.56095584770350115,5.2822346825517714E-3,5.2822346825517714E-3,2,4.9795178937607251E-2,"N/A",1.4578862083964686E-4,"N/A"]
[null,"4867","YENNORA","Urban",82,339.32,279.19,67.968000000000004,0.23283221278999999,1.0071918670612265E-2,2,1.8784669782699999E-2,1.8784669782672091E-2,1.9623850645642118E-4,1.9623850645642118E-4,1,8.1259231287672019E-4,"N/A",2.389977390813883E-6,"N/A"]
[null,"4869","YENNORA","Urban",1078,3950.5240707947,1702.89602368643,172.99199999999999,2.9455390577699996,-1.962765150935565,3,0.23764314167,0.23764314167151013,2.378730100188825E-3,2.378730100188825E-3,4,-0.15835392697185086,"N/A",3.5132667644964077E-4,"N/A"]
[null,"487","TRANSMISSION","Rural short",0,0,0,0,0,0,0,0,0,0,0,0,0,"N/A",0,"N/A"]
[null,"4870","YENNORA","Urban",270,3195.0149890244002,1620.3620998543799,160.99199999999999,1.4195486761654001,0.40917169599362324,6,0.11452776573492002,0.11452776573502702,1.1051122089673327E-3,1.1051122089673327E-3,4,3.3011562710616754E-2,"N/A",5.7359457379533191E-5,"N/A"]
[null,"4871","YENNORA","Urban",837.5,5882.8904022063298,780.21082734961396,187.00800000000001,3.6236368442849995,1.2026315242064158,4,0.29235139208140004,0.29235139208636474,3.0391806607932489E-3,3.0391806607932489E-3,3,9.7027107123566617E-2,"N/A",2.0314807821918005E-4,"N/A"]
[null,"4873","YENNORA","Urban",1469.5,7839.7817990895101,1568.38664532965,204.96,6.8263627356719994,5.2833878667658061,5,0.55074410996539991,0.55074410996979006,6.0251955127234563E-3,6.0251955127234563E-3,5,0.42625844259513307,"N/A",5.8434947205399438E-4,"N/A"]
[null,"4874","YENNORA","Urban",22,667.12747563245,1024.1600000000001,84.96,6.2467179040000001E-2,0,2,5.0397894538000004E-3,5.0397894538080192E-3,5.2649355389866255E-5,5.2649355389866255E-5,0,0,"N/A",0,"N/A"]
[null,"488","TRANSMISSION","Rural short",0,0,0,0,0,0,0,0,0,0,0,0,0,"N/A",0,"N/A"]
[null,"48999","QUAKERS HILL","Urban",159.5,849.94,4829.78,71.36,0,2.8882707952491054E-3,0,0,0,0,0,1,2.3302279560435358E-4,"N/A",1.1949886954069415E-6,"N/A"]
[null,"49001","QUAKERS HILL","Urban",915,1638.87265981019,5520.71,105.04,0.65803695702700005,0,4,5.3089762771500001E-2,5.3089762770844186E-2,2.5453259212167853E-4,2.5453259212167853E-4,0,0,"N/A",0,"N/A"]
[null,"49008","QUAKERS HILL","Urban",964,2981.8790520192401,5986.35,119.04,1.4965538096156998,0.1266395656378454,3,0.12074046279122,0.12074046279522195,1.1603340232401401E-3,1.1603340232401401E-3,1,1.0217153345729349E-2,"N/A",2.2704785212731886E-5,"N/A"]
[null,"49010","QUAKERS HILL","Urban",674,3199.5127947337,3501.3254945140802,71.36,0,0.52788703150091343,0,0,0,0,0,1,4.2589397104303393E-2,"N/A",7.8869253896858134E-5,"N/A"]
[null,"49319","BELLA VISTA","Urban",862.5,0,7044.48855372046,257.60000000000002,4.1324489839999999E-3,0,1,3.3340184601999998E-4,3.3340184601853668E-4,1.1949886954069415E-6,1.1949886954069415E-6,0,0,"N/A",0,"N/A"]
[null,"49321","BELLA VISTA","Urban",1,0,3221.62,189.6,0,7.4798807774399904E-3,0,0,0,0,0,2,6.0346929118050541E-4,"N/A",2.389977390813883E-6,"N/A"]
[null,"49328","BELLA VISTA","Urban",708,0,6239.2342178279696,196.8,6.5171238457000001E-4,8.8869870623049393E-2,1,5.2579502598000001E-5,5.2579502597905425E-5,1.1949886954069415E-6,1.1949886954069415E-6,1,7.169932172441649E-3,"N/A",4.7799547816277659E-5,"N/A"]
[null,"49337","BELLA VISTA","Urban",537,814.74,8308.99,178.64,1.6945855047,0.12382535306811548,1,0.13671746165000001,0.13671746165281276,6.5963375986463168E-4,6.5963375986463168E-4,4,9.9901054936020299E-3,"N/A",1.9119819126511064E-5,"N/A"]
[null,"49341","BELLA VISTA","Urban",942.5,850.34049870757303,6952.0870215229497,204,0,0.81938020714451543,0,0,0,0,0,2,6.6106774629912005E-2,"N/A",1.5176356431668156E-4,"N/A"]
[null,"49353","BELLA VISTA","Urban",76,0,5218.03,192.24,0,0.13226799077730519,0,0,0,0,0,1,1.0671249049983986E-2,"N/A",5.6164468684126251E-5,"N/A"]
[null,"49357","BELLA VISTA","Urban",971,2190.3911004727702,7300.5656877445599,275.2,0.45886476531920006,1.1553083180996421E-2,7,3.7020749784069995E-2,3.7020749783707049E-2,9.3209118241741452E-5,9.3209118241741452E-5,1,9.3209118241741431E-4,"N/A",3.5849660862208244E-6,"N/A"]
[null,"49362","BELLA VISTA","Urban",1079.5,121.488287105711,8412.23,287.2,0.38416963905169998,0.10870266341709325,4,3.0994421793260001E-2,3.0994421792769841E-2,1.1232893736825249E-4,1.1232893736825249E-4,2,8.7700220355915424E-3,"N/A",2.389977390813883E-5,"N/A"]
[null,"49364","BELLA VISTA","Urban",1,0,849.52,34.799999999999997,0,0.3725869325871346,0,0,0,0,0,3,3.005994063296161E-2,"N/A",1.3981367736261215E-4,"N/A"]
[null,"49391","BELLA VISTA","Urban",877,0,6412.25043378185,218.64,9.6645984302799998E-2,0.14663528652803151,2,7.7973012375799995E-3,7.7973012375302927E-3,2.270478521273189E-5,2.270478521273189E-5,1,1.183038808452872E-2,"N/A",6.5724378247381776E-5,"N/A"]
[null,"49397","BELLA VISTA","Urban",43.5,0,4439.2829644124604,175.76,1.9107022183999999E-3,0.11279067746575352,1,1.5415354170999999E-4,1.5415354170749546E-4,5.1384513902498485E-5,5.1384513902498485E-5,4,9.0998389155238588E-3,"N/A",1.5534853040290238E-5,"N/A"]
[null,"49914","SMITHFIELD","Urban",647.5,4045.26714269696,629.01,131.6,5.5188189657000002E-2,0,1,4.4525278790999998E-3,4.4525278790862642E-3,3.9434626948429067E-5,3.9434626948429067E-5,0,0,"N/A",0,"N/A"]
[null,"49915","SMITHFIELD","Urban",1117.5,5224.3792124689999,260.49800218914999,191.2,1.0627355361999999,1.3691884733991144,1,8.5740438895000007E-2,8.5740438895448051E-2,4.8994536511684603E-4,4.8994536511684603E-4,3,0.11046475500341767,"N/A",2.3899773908138828E-4,"N/A"]
[null,"49916","SMITHFIELD","Urban",934,2152.2647939579902,4326.6434746124496,190.8,0.78762404004980002,1.8111679632977467,3,6.354471886636999E-2,6.3544718866959518E-2,1.1651139780217679E-3,1.1651139780217679E-3,3,0.14612321767436079,"N/A",2.8440730950685209E-4,"N/A"]
[null,"49917","SMITHFIELD","Urban",297,2866.7088584663402,1194.7276446686701,193.2,0.18647861186,8.953639465272227E-2,1,1.5044907675E-2,1.5044907675173393E-2,7.6479276506044255E-5,7.6479276506044255E-5,1,7.223706663734961E-3,"N/A",1.5534853040290238E-5,"N/A"]
[null,"49918","SMITHFIELD","Urban",1208,1665.12806659735,6159.3220254337402,240,2.1413343443085,0,8,0.17276071068652601,0.17276071068367693,1.5271955527300712E-3,1.5271955527300712E-3,0,0,"N/A",0,"N/A"]
[null,"52237","BONNYRIGG","Urban",585,0,7023.6076331001304,180.96,0.11400200882,1.1701199632034837E-2,1,9.1975679159000002E-3,9.19756791594167E-3,2.6850999898178601E-5,2.6850999898178601E-5,2,9.4404106937148377E-4,"N/A",2.389977390813883E-6,"N/A"]
[null,"53801","PRESTONS","Urban",670,0,3849.73,160,5.7187761746000002E-2,0,1,4.6138513530000003E-3,4.6138513529662009E-3,4.6604559120870719E-5,4.6604559120870719E-5,0,0,"N/A",0,"N/A"]
[null,"53803","PRESTONS","Urban",858.5,68.55,6385.1860483984701,240,0.32945542204629996,0,6,2.6580133551990001E-2,2.6580133551936599E-2,2.2346288604109803E-4,2.2346288604109803E-4,1,0,"N/A",1.0754898258662473E-5,"N/A"]
[null,"53807","PRESTONS","Urban",291,4474.82,5855.34,138,0,2.8438358599375806E-2,0,0,0,0,0,1,2.2943782951813274E-3,"N/A",4.7799547816277659E-6,"N/A"]
[null,"53809","PRESTONS","Urban",6.5,4636.0160700599899,10095.43,152,0,8.3537678385666433E-2,0,0,0,0,0,2,6.73973624209515E-3,"N/A",1.0754898258662473E-5,"N/A"]
[null,"54649","EASTERN CREEK","Urban",6.5,559.87,675.18,22.847999999999999,0,2.3846748617184922E-2,0,0,0,0,0,2,1.9239317996051757E-3,"N/A",4.7799547816277659E-6,"N/A"]
[null,"54658","EASTERN CREEK","Urban",8,0,1734.01,46.752000000000002,0,4.6656682077100935E-3,0,0,0,0,0,1,3.7642143905318654E-4,"N/A",3.5849660862208244E-6,"N/A"]
[null,"54663","EASTERN CREEK","Urban",5,0,304.13,118.27200000000001,0,3.7325345661680748E-2,0,0,0,0,0,1,3.0113715124254923E-3,"N/A",7.1699321724416489E-6,"N/A"]
[null,"54701","EASTERN CREEK","Urban",9,0,5837.03,38.4,0,1.7773974124609879E-2,0,0,0,0,0,1,1.4339864344883298E-3,"N/A",2.389977390813883E-6,"N/A"]
[null,"5494","DUNDAS","Urban",832.5,1624.9719925101299,4863.5664714996101,153,0.18612294361500001,0,3,1.5016212717600001E-2,1.5016212717511459E-2,1.992043109448938E-3,1.992043109448938E-3,0,0,"N/A",0,"N/A"]
[null,"5495","DUNDAS","Urban",2934.5,4360.9631678513797,2638.0244098959602,235,5.2266729752406711,4.6424139248970624,8,0.42168274193399302,0.37405766247265809,9.4336144381778481E-3,9.2878258173382001E-3,5,0.37454530680139764,"N/A",8.9026657807817139E-4,"N/A"]
[null,"5496","DUNDAS","Urban",954,6071.2044807523598,1193.72343023144,99.36,0.34138708135000001,0,3,2.7542767877E-2,2.7542767876827828E-2,2.3217577224543349E-3,2.3217577224543349E-3,0,0,"N/A",0,"N/A"]
[null,"5498","DUNDAS","Urban",2513,4738.6917638197501,2412.5785924656102,201,0.85237455284999997,0,3,6.8768725402999997E-2,3.3397060018941334E-2,3.1240816372135353E-3,3.0356524737534213E-3,0,0,"N/A",0,"N/A"]
[null,"55163","NARELLAN","Urban",472.5,2217.8164725381298,10431.8343789309,267,8.7388706112999999E-4,0.18010960446271343,1,7.0504333028999995E-5,7.0504333029009549E-5,1.3144875649476356E-5,1.3144875649476356E-5,1,1.4531062536148408E-2,"N/A",3.8239638253022127E-5,"N/A"]
[null,"55167","NARELLAN","Urban",600,2015.38,9321.23,190,3.4896235865E-2,0.36918025421325101,1,2.8153933664E-3,2.815393366378754E-3,2.2704785212731886E-5,2.2704785212731886E-5,6,2.9785093233018017E-2,"N/A",6.8114355638195656E-5,"N/A"]
[null,"55169","NARELLAN","Urban",1021.5,116.12,9949.5433417410895,239,1.4456165621E-2,0,1,1.1663089667E-3,1.1663089667171749E-3,1.9119819126511064E-5,1.9119819126511064E-5,0,0,"N/A",0,"N/A"]
[null,"55171","NARELLAN","Urban",1578.5,0,18594.688172497601,319,2.4291097969999999E-3,9.0647268035510389E-2,1,1.9597814605E-4,1.959781460467384E-4,1.1949886954069415E-6,1.1949886954069415E-6,2,7.3133308158904817E-3,"N/A",1.4339864344883298E-5,"N/A"]
[null,"55175","NARELLAN","Urban",618,0,7396.32,193,6.2830998530999993E-2,0,2,5.0691420458999995E-3,5.0691420459162452E-3,9.4404106937148372E-5,9.4404106937148372E-5,0,0,"N/A",0,"N/A"]
[null,"55177","NARELLAN","Urban",909.5,0,6354.1840486138299,169,1.1627141407E-2,0,1,9.3806612589000002E-4,9.3806612589444904E-4,2.389977390813883E-5,2.389977390813883E-5,0,0,"N/A",0,"N/A"]
[null,"55354","EMU PLAINS","Urban",920,3991.92018528572,3687.4231656937,210,2.1656920153344998,1.4480604835770707,6,0.17472586319198,0.17472586319150671,2.9863172940808123E-3,2.9863172940808123E-3,2,0.11682806980645963,"N/A",2.7604238863900346E-4,"N/A"]
[null,"55356","EMU PLAINS","Urban",643,5768.6928837696596,2604.7399999999998,173,4.5506113485230006,0.96201634949450965,5,0.36713876686500002,2.3691845875138024E-2,2.2848183856180723E-3,1.7327336083400649E-4,3,7.7614515766680853E-2,"N/A",2.2704785212731887E-4,"N/A"]
[null,"55361","EMU PLAINS","Urban",636.5,3847.3895447856698,2109.3315582764399,176,2.997876969E-2,0,1,2.4186571195E-3,2.4186571195036494E-3,2.7484739994359652E-5,2.7484739994359652E-5,0,0,"N/A",0,"N/A"]
[null,"55363","EMU PLAINS","Urban",49.5,91.28,2231.9299999999998,58.4,0,1.1775257857554044E-2,0,0,0,0,0,2,9.5001601284851851E-4,"N/A",7.1699321724416489E-6,"N/A"]
[null,"55864","JASPER RD","Urban",276.5,0,2069.4699999999998,139.04,7.3532899252299999E-2,0,3,5.9325606797779994E-3,5.9325606798335618E-3,4.0618451786597962E-4,4.0618451786597962E-4,0,0,"N/A",0,"N/A"]
[null,"55865","JASPER RD","Urban",453,3705.1474484680298,374.7,103.04,0.65542500210400001,0.16885275418379386,4,5.2879032862399998E-2,5.2879032862930081E-2,9.8135034380902051E-4,9.8135034380902051E-4,1,1.3622871127639132E-2,"N/A",3.5849660862208241E-5,"N/A"]
[null,"55866","JASPER RD","Urban",453.5,3122.8306643361698,49.67,107.04,0.27081967932700002,0.75243157127515159,3,2.1849460543999999E-2,1.5300922493369581E-2,6.5443325708066172E-4,6.0663370926438407E-4,3,6.0705425726672625E-2,"N/A",1.2547381301772885E-4,"N/A"]
[null,"55867","JASPER RD","Urban",799.5,2170.04698934813,4110.8376877686596,205.04,0.13868848827499999,0.55158566366705986,3,1.1189248358900001E-2,1.1189248358954768E-2,1.0184832069977104E-3,1.0184832069977104E-3,1,4.4501379016954501E-2,"N/A",1.1710889214988026E-4,"N/A"]
[null,"55870","JASPER RD","Urban",835,5130.6755918340696,1080.1400000000001,176,6.4094860090474999,1.7354804568171163,8,0.51711091309503998,5.5585964125079226E-2,2.5166201864330064E-3,1.5188046257682106E-3,6,0.14001682544083133,"N/A",4.1824604339242951E-4,"N/A"]
[null,"55874","JASPER RD","Urban",1336,5470.99962391805,701.00874143942497,216,2.1301559267244001,2.6446192332909115,7,0.17185884714206004,0.17185884714424202,3.1558943440573306E-3,3.1558943440573306E-3,6,0.21336523156490939,"N/A",4.4214581730056833E-4,"N/A"]
[null,"55875","JASPER RD","Urban",935.5,6267.5372296876903,1379.5510123625199,212,0.85340172105800005,1.2441041304971723,4,6.8851596305199991E-2,1.660191058719053E-2,1.2272399185633081E-3,1.1866103029194719E-3,4,0.10037307547070605,"N/A",2.6289751298952711E-4,"N/A"]
[null,"55876","JASPER RD","Urban",1478,4638.4913073479602,2136.76403685475,272,1.4258720017853002,2.6726873007626915,4,0.11503792531428,0.11503792531420741,4.7235410298980341E-3,4.7235410298980341E-3,7,0.21562973514270556,"N/A",8.6517181547462563E-4,"N/A"]
[null,"55879","JASPER RD","Urban",717.5,4688.2995856979896,1030.71,157.04,1.629338076712,0.89877062490110626,4,0.1314533644991,6.5160171632915528E-2,1.48475055623906E-3,1.4297810762503404E-3,4,7.2511914037293207E-2,"N/A",2.7245742255278262E-4,"N/A"]
[null,"55880","JASPER RD","Urban",257.5,3067.25633755331,74.17,71.040000000000006,0.55454217315010002,0.7882757524264481,5,4.4739907241450001E-2,4.4739907241639953E-2,6.8893657889245591E-4,6.8893657889245591E-4,3,6.3597298369557423E-2,"N/A",1.469836095350538E-4,"N/A"]
[null,"55885","JASPER RD","Urban",1603,6003.7705920548597,2853.51816669149,261.04000000000002,3.648358348126,4.1540739858234055,5,0.29434589826407997,0.29434589825991581,5.2344044239899133E-3,5.2344044239899133E-3,9,0.33514652951383078,"N/A",6.9189845464061913E-4,"N/A"]
[null,"55888","JASPER RD","Urban",248,2461.9440905137199,712.28,65.040000000000006,1.2863186141779999,0,3,0.1037788977453,7.6360822562609757E-3,6.5559169682237212E-4,3.5923450036145062E-4,0,0,"N/A",0,"N/A"]
[null,"55890","JASPER RD","Urban",1843.5,7164.0716840804898,1578.2708961743499,271.04000000000002,1.1373000859188001,0.41924361466423554,4,9.1756232102069998E-2,9.1756232101766325E-2,4.4205462047773062E-3,4.4205462047773062E-3,3,3.382415502349348E-2,"N/A",8.0064242592265081E-5,"N/A"]
[null,"55891","JASPER RD","Urban",195.5,1080.86139871255,3042.68,68,0.77059291326081991,0,3,6.2170664611542997E-2,1.2800156375493174E-3,4.8878692537513563E-4,2.4381424281671267E-4,0,0,"N/A",0,"N/A"]
[null,"57040","NORTH PARRAMATTA","Urban",497,0,3388.52899117879,220,0,1.3774829946572656E-2,0,0,0,0,0,2,1.1113394867284555E-3,"N/A",7.1699321724416489E-6,"N/A"]
[null,"57444","MEADOW FLAT","Rural short",41,16452.591445200898,0,null,0.27873271896859997,0.48635517862974165,6,0.11725716309800001,0.11535672132342865,5.5455514084990247E-4,5.4832418421112974E-4,8,0.20459969219074203,"N/A",4.2370505143654705E-4,"N/A"]
[null,"57448","MEADOW FLAT","Rural short",142.5,63266.006547873796,273.77,12.023999999999999,0.84326645348340001,1.9488570161830578,11,0.35474497733170002,0.3450246849730389,1.5265843764965823E-3,1.507891506580264E-3,12,0.81984435070316342,"N/A",2.2867610864295996E-3,"N/A"]
[null,"5867","LEABONS LANE","Urban",0,0,0,0,4.4970553826474999,0.14996790667639584,4,0.36281792516141997,0.36281792516805933,3.6901250914146873E-3,3.6901250914146873E-3,1,1.2099260540995282E-2,"N/A",3.2264694775987422E-5,"N/A"]
[null,"5868","LEABONS LANE","Urban",0,0,0,0,0,0.60786991506165788,0,0,0,0,0,1,4.9042336059500875E-2,"N/A",8.6039186069299787E-5,"N/A"]
[null,"5869","LEABONS LANE","Urban",0,0,0,0,1.51623848597,0.65600776164914298,3,0.12232860277366001,0.12232860277141779,1.7697782578976803E-3,1.7697782578976803E-3,6,5.292604931957344E-2,"N/A",5.3296495815149589E-4,"N/A"]
[null,"5871","LEABONS LANE","Urban",0,0,0,0,1.227426218108,0.39902571909749179,5,9.9027518199999998E-2,9.9027518199677825E-2,2.1079600586978446E-3,2.1079600586978446E-3,2,3.2192995454263004E-2,"N/A",9.9184061718776145E-5,"N/A"]
[null,"61617","MALDON","Rural short",480.5,15042.759511102,790.36,170,2.0202787688370001,0.7856837145332759,2,0.84989002361319999,0.84989002361532562,3.053168752998648E-3,3.053168752998648E-3,3,0.33052109490370057,"N/A",8.2248627631800308E-4,"N/A"]
[null,"6419","MOOREBANK","Urban",394,3373.2428185025601,1687.24530538261,187.68,0.56430886681000003,0.11316096859334956,2,4.5527874305999999E-2,4.5527874306309064E-2,9.4165109198066988E-4,9.4165109198066988E-4,2,9.1297136329090318E-3,"N/A",1.9119819126511064E-5,"N/A"]
[null,"6420","MOOREBANK","Urban",190,2513.7685726872201,1276.281513375,85,0.61132977181500003,2.0484505178612885E-2,4,4.932147383688E-2,4.932147383734662E-2,3.3124876065982974E-4,3.3124876065982974E-4,1,1.6526693657477999E-3,"N/A",3.5849660862208244E-6,"N/A"]
[null,"6421","MOOREBANK","Urban",199,2829.1779386776402,2454.8739734248702,156.96,0,0.91364151658536319,0,0,0,0,0,2,7.371168268748178E-2,"N/A",1.7566333822482039E-4,"N/A"]
[null,"6423","MOOREBANK","Urban",573,3125.48,858.094931309446,140.83199999999999,3.6540328471E-2,0,1,2.9480371116000002E-3,2.9480371115689244E-3,6.8831348855439829E-4,6.8831348855439829E-4,0,0,"N/A",0,"N/A"]
[null,"6426","MOOREBANK","Urban",20,1639.89855521452,519.80999999999995,62.88,5.1100175607999999E-3,1.4219179299687903E-2,1,4.1227109991999998E-4,4.1227109991539478E-4,3.5849660862208244E-6,3.5849660862208244E-6,1,1.1471891475906637E-3,"N/A",2.389977390813883E-6,"N/A"]
[null,"6429","MOOREBANK","Urban",124,1350.7390061493199,946.05,122.592,0,1.570034381007206E-2,0,0,0,0,0,2,1.2666880171313579E-3,"N/A",7.1699321724416489E-6,"N/A"]
[null,"6430","MOOREBANK","Urban",741.5,4971.5593968714702,1110.5999999999999,184.03200000000001,0.18449385141409999,0,3,1.488477919001E-2,1.4884779189988862E-2,1.242788243223219E-4,1.242788243223219E-4,0,0,"N/A",0,"N/A"]
[null,"68179","SMITHFIELD","Urban",868.5,3294.33235132154,169.58028226441101,140.4,4.2568668027999995E-2,0,2,3.4343975105999998E-3,3.4343975105995501E-3,6.9309344333602603E-5,6.9309344333602603E-5,0,0,"N/A",0,"N/A"]
[null,"68181","SMITHFIELD","Urban",1111,2863.1026271384299,3535.7396237439698,215,0.28900481926240001,0.15396705085443307,5,2.3316619424953E-2,2.3316619424780242E-2,1.6132347387993711E-4,1.6132347387993711E-4,1,1.2421907488755156E-2,"N/A",3.2264694775987422E-5,"N/A"]
[null,"68186","SMITHFIELD","Urban",504,1798.8164787805299,1114.75183069892,105.2,1.35148855745601,0,4,0.10903674351244701,0.10903674351240637,3.3579182340935057E-4,3.3579182340935057E-4,0,0,"N/A",0,"N/A"]
[null,"68188","SMITHFIELD","Urban",1050,4286.3434527716399,366.52,202.4,0.77698927885999991,0.58494148844091109,3,6.2686716983000004E-2,3.7764032752250168E-2,1.5773850779371627E-4,1.0515900519581085E-4,2,4.719249355901093E-2,"N/A",1.1352392606365944E-4,"N/A"]
[null,"68190","SMITHFIELD","Urban",339,2241.80950113172,1686.6877673152301,171.6,0,0.18484933089594274,0,0,0,0,0,1,1.4913458918678629E-2,"N/A",3.1069706080580475E-5,"N/A"]
[null,"68195","SMITHFIELD","Urban",904,3733.2811815730402,310.55129490251198,147.6,0.27844411630999999,0,1,2.2464592485E-2,2.2464592484955092E-2,1.242788243223219E-4,1.242788243223219E-4,0,0,"N/A",0,"N/A"]
[null,"68197","SMITHFIELD","Urban",747.5,5204.8393414083603,765.27,130.80000000000001,2.9506870677249997,0.13115711739451708,3,0.23805847796379997,0.23805847796679844,1.8510374891853522E-3,1.8510374891853522E-3,1,1.0581624897828467E-2,"N/A",2.7484739994359652E-5,"N/A"]
[null,"68204","SMITHFIELD","Urban",1060.5,2024.6980994620101,6991.4867152546403,225,0.6242515945510001,0,5,5.0363993555899995E-2,5.0363993556620947E-2,1.9597814604673842E-4,1.9597814604673842E-4,0,0,"N/A",0,"N/A"]
[null,"685","TRANSMISSION","Rural short",0,0,0,0,0,0,0,0,0,0,0,0,0,"N/A",0,"N/A"]
[null,"686","TRANSMISSION","Rural short",0,0,0,0,0,0,0,0,0,0,0,0,0,"N/A",0,"N/A"]
[null,"7008","TRANSMISSION","Rural short",0,0,0,0,0,0,0,0,0,0,0,0,0,"N/A",0,"N/A"]
[null,"7011","TRANSMISSION","Rural short",0,0,0,0,0,1.3330480593457409E-2,0,0,0,0,0,1,5.6078609748954761E-3,"N/A",1.8692869916318254E-5,"N/A"]
[null,"7013","TRANSMISSION","Rural short",0,0,0,0,0,0.54121751209437086,0,0,0,0,0,3,0.22767915558075633,"N/A",4.2370505143654705E-4,"N/A"]
[null,"7017","TRANSMISSION","Rural short",0,0,0,0,0,0,0,0,0,0,0,0,0,"N/A",0,"N/A"]
[null,"7043","TRANSMISSION","Rural short",0,0,0,0,0,0,0,0,0,0,0,0,0,"N/A",0,"N/A"]
[null,"7093","TRANSMISSION","Rural short",0,0,0,0,1.9107022183570001E-2,0,3,8.0379340639999998E-3,8.0379340640168474E-3,7.4771479665273002E-5,7.4771479665273002E-5,0,0,"N/A",0,"N/A"]
[null,"7093/1","TRANSMISSION","Rural short",0,0,0,0,1.37007717211E-2,0,3,5.7636348908699994E-3,3.7198811133473324E-3,3.1154783193863753E-5,1.8692869916318251E-5,0,0,"N/A",0,"N/A"]
[null,"7117","TRANSMISSION","Rural short",0,0,0,0,0,0,0,0,0,0,0,0,0,"N/A",0,"N/A"]
[null,"7175","TRANSMISSION","Rural short",0,0,0,0,0,0,0,0,0,0,0,0,0,"N/A",0,"N/A"]
[null,"7217","TRANSMISSION","Rural short",0,0,0,0,0,0,0,0,0,0,0,0,0,"N/A",0,"N/A"]
[null,"7341","TRANSMISSION","Rural short",0,0,0,0,0,0,0,0,0,0,0,0,0,"N/A",0,"N/A"]
[null,"7381","TRANSMISSION","Rural short",0,0,0,0,0,0.5474384030379843,0,0,0,0,0,1,0.23029615736904088,"N/A",4.7978366118550181E-4,"N/A"]
[null,"7512","TRANSMISSION","Rural short",0,0,0,0,0,0,0,0,0,0,0,0,0,"N/A",0,"N/A"]
[null,"7513","TRANSMISSION","Rural short",0,0,0,0,0,0,0,0,0,0,0,0,0,"N/A",0,"N/A"]
[null,"7520","TRANSMISSION","Rural short",0,0,0,0,2.2217467655999999E-2,0,1,9.3464349581999992E-3,9.3464349581591256E-3,1.2461913277545501E-5,1.2461913277545501E-5,0,0,"N/A",0,"N/A"]
[null,"7530","TRANSMISSION","Rural short",0,0,0,0,7.5539390030000004E-3,0,1,3.1777878857999998E-3,3.177787885774103E-3,1.2461913277545501E-5,1.2461913277545501E-5,0,0,"N/A",0,"N/A"]
[null,"76225","BYLONG","Rural short",29,18477.063753375249,0,4.9980000000000002,4.6004969691999999E-2,0.38098513536101275,3,1.93533513198E-2,1.9353351319990216E-2,3.7385739832094411E-4,3.7385739832094411E-4,3,0.16027266666251269,"N/A",4.2993600807531983E-4,"N/A"]
[null,"77674","ILFORD HALL","Rural short",22,23055.709424441098,142.04,20,3.2407879487200003E-2,0,3,1.3633333126059998E-2,1.3633333125628238E-2,1.7446678588470236E-4,1.7446678588470236E-4,0,0,"N/A",0,"N/A"]
[null,"7911","TRANSMISSION","Rural short",0,0,0,0,1.5522604069000001E-2,0,1,6.5300425574000001E-3,6.5300425574338428E-3,4.9847653110182004E-5,4.9847653110182004E-5,0,0,"N/A",0,"N/A"]
[null,"7962","GREYSTANES","Urban",865,5173.6686241190901,327.51,222.72,8.2012078939999997E-2,2.5627700824470829,1,6.6166524065000001E-3,6.6166524064682347E-3,1.3503372258098439E-4,1.3503372258098439E-4,5,0.20676172403409063,"N/A",4.4573078338678917E-4,"N/A"]
[null,"7966","GREYSTANES","Urban",532.5,4325.4368845285699,80.12,124.992,0.52051083224000005,1.67341966383202,1,4.1994292734000002E-2,4.1994292733990739E-2,3.7044649557615188E-5,3.7044649557615188E-5,3,0.13500982280707624,"N/A",2.796273547252243E-4,"N/A"]
[null,"7967","GREYSTANES","Urban",100.5,365.02122941182898,280.62,76.992000000000004,0,1.5404110907995228E-2,0,0,0,0,0,2,1.242788243223219E-3,"N/A",2.389977390813883E-6,"N/A"]
[null,"7970","GREYSTANES","Urban",755.5,5480.3453797687998,1382.6088091572601,173.28,1.2088672268164002,0.29697348433202342,8,9.7530197364561991E-2,9.7530197364332938E-2,2.7102343611829431E-3,2.7102343611829431E-3,4,2.3959523342909177E-2,"N/A",5.9749434770347071E-5,"N/A"]
[null,"7972","GREYSTANES","Urban",599,4579.8371015747498,1072.6141657375799,117.89,3.2970722001E-2,0.18077612849238631,1,2.660044836E-3,2.6600448359758518E-3,6.3334400856567897E-5,6.3334400856567897E-5,3,1.4584837027441721E-2,"N/A",5.1384513902498485E-5,"N/A"]
[null,"7973","GREYSTANES","Urban",310,2021.57614756883,193.94,74.400000000000006,8.8869870622999998E-4,0,1,7.1699321723999999E-5,7.1699321724416482E-5,1.1949886954069415E-6,1.1949886954069415E-6,0,0,"N/A",0,"N/A"]
[null,"7974","GREYSTANES","Urban",918.5,4406.0943055839098,187.042195553955,225.6,0.21524282665,3.443707486643164E-2,2,1.73655757217E-2,1.7365575721653675E-2,1.2188884693150803E-4,1.2188884693150803E-4,4,2.7783487168211388E-3,"N/A",3.3101186862772279E-4,"N/A"]
[null,"7976","GREYSTANES","Urban",1281,4058.2331605593099,954.75,262.08,0,3.5743461964590466,0,0,0,0,0,8,0.28837467197560313,"N/A",6.7755859029573577E-4,"N/A"]
[null,"7977","GREYSTANES","Urban",145.5,2728.0333233234801,708.421056446497,102.048,8.6500007405999994E-3,0.34022348803524077,1,6.9787339811999997E-4,6.9787339811765376E-4,1.7446834952941344E-4,1.7446834952941344E-4,2,2.7448890333497445E-2,"N/A",4.1824604339242954E-5,"N/A"]
[null,"7979","GREYSTANES","Urban",301,6244.20539829892,828.42785281887802,119.232,0.14408768357000001,7.9538534207629213E-2,1,1.1624850028999999E-2,1.1624850028918726E-2,7.6479276506044255E-5,7.6479276506044255E-5,3,6.4170892943352757E-3,"N/A",1.3144875649476356E-5,"N/A"]
[null,"7981","GREYSTANES","Urban",719.5,4192.1372130438003,288.27999999999997,147.16800000000001,0.24070404458199998,1.8759689106270536,4,1.9419761289100002E-2,1.9419761289058209E-2,1.7088338344319263E-4,1.7088338344319263E-4,4,0.15135129321676616,"N/A",3.1428202689202559E-4,"N/A"]
[null,"815","TRANSMISSION","Rural short",0,0,0,0,0,0,0,0,0,0,0,0,0,"N/A",0,"N/A"]
[null,"828","TRANSMISSION","Rural short",0,0,0,0,0,0,0,0,0,0,0,0,0,"N/A",0,"N/A"]
[null,"8610","SEVEN HILLS","Urban",1617.5,8442.9442928414501,809.39633310844397,307.00799999999998,2.8869263737826998,0.54077316274125553,4,0.23291432902596998,4.179739699645791E-2,4.0897847906025799E-3,2.028429291025606E-3,3,4.3629037269307433E-2,"N/A",1.1830388084528721E-4,"N/A"]
[null,"8611","SEVEN HILLS","Urban",142,1005.08524607729,2437.6124308721101,162.048,1.0488586029E-2,2.9327057305606301E-2,1,8.4620861808000004E-4,8.4620861808467197E-4,1.692417236169344E-4,1.692417236169344E-4,2,2.3660776169057442E-3,"N/A",1.3144875649476356E-5,"N/A"]
[null,"8614","SEVEN HILLS","Urban",18,0,1265.7377841694199,78.05,1.3202415975E-3,2.2809933459916013E-2,1,1.0651577007E-4,1.0651577007141253E-4,2.1303154014282504E-5,2.1303154014282504E-5,1,1.8402825909266899E-3,"N/A",1.6729841735697181E-5,"N/A"]
[null,"8615","SEVEN HILLS","Urban",624.5,4049.6560989535101,647.49230929149701,92.64,1.3773345587530001,0,4,0.11112197301429999,0.1111219730136733,1.5809648895797465E-3,1.5809648895797465E-3,0,0,"N/A",0,"N/A"]
[null,"8617","SEVEN HILLS","Urban",394.5,2603.7662016444501,1642.1914569574801,231.36,2.9045315158000001E-2,0.12101114049838559,1,2.3433469425E-3,2.3433469425369132E-3,4.6866938850738263E-4,4.6866938850738263E-4,2,9.7630576414747122E-3,"N/A",4.8994536511684599E-5,"N/A"]
[null,"8618","SEVEN HILLS","Urban",79,751.7,862.93743478773501,42.24,5.7943936764000004E-3,0,1,4.6748587962000001E-4,4.6748587962372197E-4,9.3497175924744393E-5,9.3497175924744393E-5,0,0,"N/A",0,"N/A"]
[null,"8620","SEVEN HILLS","Urban",1030,3457.5387247755598,2728.6175991881601,215.80799999999999,1.6308255832530001,0.4739726433229301,5,0.13157337503640001,0.13157337503737049,4.0785643610808144E-3,4.0785643610808144E-3,2,3.8239638253022123E-2,"N/A",9.5599095632555318E-5,"N/A"]
[null,"8622","SEVEN HILLS","Urban",141,1590.19685578391,972.56401585293895,100.608,1.0341892518999999E-2,3.3326201483643521E-2,1,8.3437353263000002E-4,8.343735326284972E-4,1.6687470652569942E-4,1.6687470652569942E-4,1,2.6887245646656181E-3,"N/A",1.7924830431104121E-5,"N/A"]
[null,"8645","KELLYVILLE","Urban",799,256.609553182855,6621.68,253,1.9906851020000001E-2,5.6876717198751613E-2,1,1.6060648066E-3,1.6060648066269292E-3,1.6729841735697181E-5,1.6729841735697181E-5,1,4.5887565903626549E-3,"N/A",1.9119819126511064E-5,"N/A"]
[null,"8647","KELLYVILLE","Urban",601,0,3629.4287020320899,224,0.11938185953699999,0.10664384474765927,3,9.6316088850000002E-3,9.6316088849799468E-3,7.1699321724416496E-5,7.1699321724416496E-5,1,8.6039186069299788E-3,"N/A",2.389977390813883E-5,"N/A"]
[null,"8648","KELLYVILLE","Urban",317.5,6473.6509923823296,3244.1964091300501,145,0.53431528547499996,0.98378946779715681,2,4.3108022197689999E-2,4.3108022198110003E-2,3.8837132600725595E-4,3.8837132600725595E-4,2,7.9371149148929052E-2,"N/A",2.5811755820789937E-4,"N/A"]
[null,"8650","KELLYVILLE","Urban",136,823.62,4524.9399999999996,18,0,1.1890788689364009,0,0,0,0,0,11,9.5933692467269266E-2,"N/A",2.1390297647784251E-4,"N/A"]
[null,"8651","KELLYVILLE","Urban",573.5,1945.4258892953601,2405.8332206939599,74,8.0249493172999994E-2,0,1,6.4744487516999998E-3,6.4744487517148092E-3,2.5094762603545769E-5,2.5094762603545769E-5,0,0,"N/A",0,"N/A"]
[null,"8652","KELLYVILLE","Urban",723.5,639.70000000000005,8725.1699803240099,258,3.2615242518E-2,9.257278189900979E-2,2,2.6313651072999997E-3,2.6313651072860851E-3,2.270478521273189E-5,2.270478521273189E-5,1,7.4686793462933844E-3,"N/A",2.9874717385173535E-5,"N/A"]
[null,"8675","PLUMPTON","Urban",837,4883.9520283138399,655.89525023275905,146.1,4.6661352911299998,0,5,0.37645912288,7.8073391425717106E-2,2.1632086255920879E-3,1.0826597580386888E-3,0,0,"N/A",0,"N/A"]
[null,"8676","PLUMPTON","Urban",1171,3492.45602657175,2163.9856854438099,154.75,5.2679444877500003,0,5,0.42501248623760002,1.0582819886523874E-2,1.7109127954661174E-3,1.3503372258098439E-4,0,0,"N/A",0,"N/A"]
[null,"8677","PLUMPTON","Urban",425.5,3151.5355934605,728.9,52.32,1.2551835855,0.63986306848595564,1,0.1012669548,0,5.0862408498797841E-4,0,2,5.1623511641579869E-2,"N/A",1.4578862083964686E-4,"N/A"]
[null,"8679","PLUMPTON","Urban",1120,2975.11854891237,5925.3124629246404,180,4.8779276934960993,0.74339646776180823,10,0.39354632181284005,0.12620156113323169,2.8926679223371869E-3,1.549900337942803E-3,2,5.9976482622474389E-2,"N/A",2.0075810082836616E-4,"N/A"]
[null,"8680","PLUMPTON","Urban",1412.5,2956.1227403583098,4227.3429991604798,219.36,4.1819498463061997,1.6391307054166269,2,0.33739552602208001,4.7441051207655578E-4,1.6934172385476966E-3,1.1949886954069415E-6,2,0.13224342397720917,"N/A",3.2025697036906032E-4,"N/A"]
[null,"8682","PLUMPTON","Urban",870.5,3390.6665032872002,5050.4360253928899,182.11,2.69686782808053,0,5,0.21758059587634401,9.3280817563465863E-3,1.11766979298838E-3,7.1699321724416496E-5,0,0,"N/A",0,"N/A"]
[null,"8683","PLUMPTON","Urban",1219,2668.6135568044201,5648.5207061688698,205.63200000000001,4.3915060346238004,9.4350179311470772E-2,4,0.35430230946086999,1.5595797463755992E-2,1.6990604706740217E-3,1.1949886954069415E-4,1,7.6120779897422171E-3,"N/A",1.1710889214988026E-4,"N/A"]
[null,"8685","PLUMPTON","Urban",1674.5,1843.3139399855199,6314.3419348978196,211.488,5.3865482192981,0.21195464143597281,11,0.43458131653623006,3.5708652196150222E-2,2.3702420431166455E-3,3.6686152948993108E-4,2,1.7100288231273332E-2,"N/A",4.7799547816277659E-5,"N/A"]
[null,"8686","PLUMPTON","Urban",768,5114.1283436260501,1876.76,110.88,2.2770506927,0,1,0.18371016976999999,0,9.227039283076188E-4,0,0,0,"N/A",0,"N/A"]
[null,"8689","PLUMPTON","Urban",659,3280.5433911707701,702.35,144.28800000000001,1.0422658426694,1.6589042516302555E-2,3,8.4088964518429996E-2,7.5857882384432647E-3,8.1976224504916187E-4,3.1069706080580475E-5,2,1.3383873388557745E-3,"N/A",5.9749434770347074E-6,"N/A"]
[null,"8690","PLUMPTON","Urban",809,4173.1886028058298,564.95000000000005,122.88,4.3779998811029994,0,6,0.35321264651106998,0.15931828284904423,2.0747422111339103E-3,1.1041695545560139E-3,0,0,"N/A",0,"N/A"]
[null,"8693","PLUMPTON","Urban",391.5,3003.4355569357099,419.48,63.84,1.1606756449,0.72873293910900505,1,9.3642148795999997E-2,0,4.7032768330449755E-4,0,1,5.8793443814021518E-2,"N/A",1.4339864344883296E-4,"N/A"]
[null,"8694","PLUMPTON","Urban",1410,3204.9967396970101,6865.8900071445296,219.36,4.8624650248832006,0.65674834390433501,10,0.39229880920280003,5.5615968872934456E-2,1.9419731133401273E-3,2.5094762603545769E-4,3,5.2985798754343783E-2,"N/A",1.5654351909830932E-4,"N/A"]
[null,"8711","HORSLEY PARK","Rural short",447,13556.382687052401,4388.7419502804996,160.03200000000001,1.3330480593E-2,0.40339515440312507,1,5.6078609749000002E-3,5.6078609748954761E-3,3.7385739832636508E-5,3.7385739832636508E-5,4,0.16970010405697586,"N/A",4.1747409479777432E-4,"N/A"]
[null,"8714","HORSLEY PARK","Urban",29,5357.0544691776404,759.31619707245602,230,1.8070207027000001E-3,0.17773974124609879,1,1.4578862084000001E-4,1.4578862083964686E-4,1.1949886954069415E-6,1.1949886954069415E-6,3,1.4339864344883298E-2,"N/A",2.9874717385173535E-5,"N/A"]
[null,"8715","HORSLEY PARK","Rural short",66,3608.4785983834499,423.12,25.92,0,7.0873721821881897E-2,0,0,0,0,0,2,2.9815127516527613E-2,"N/A",8.7233392942818512E-5,"N/A"]
[null,"8716","HORSLEY PARK","Rural short",237.5,16113.877668782699,1417.17,142.56,0,0.10526636175300201,0,0,0,0,0,4,4.4283408831757937E-2,"N/A",1.4954295933054603E-4,"N/A"]
[null,"8718","HORSLEY PARK","Rural short",323,7120.8883770857701,1143.3620921489601,60.768000000000001,0,0.20240113034399498,0,0,0,0,0,4,8.5146022468829644E-2,"N/A",1.5577391596931876E-4,"N/A"]
[null,"8721","HORSLEY PARK","Urban",17,3350.18959301013,3073.62159039381,131.04,0,4.8137846587485086E-3,0,0,0,0,0,1,3.8837132600725595E-4,"N/A",1.1949886954069415E-6,"N/A"]
[null,"87218","KANDOS","Rural short",241,49127.275862019997,390.55,75,0.27285073055359998,0,6,0.11478273068430001,0.11478273068410054,3.0864515951363023E-3,3.0864515951363023E-3,0,0,"N/A",0,"N/A"]
[null,"87220","KANDOS","Rural short",739,185947.3047612308,173.65,103.008,2.1540551576514204,2.126478264268326,23,0.90616701863268989,0.58863123736979073,2.1697432252002973E-2,2.144819398645206E-2,30,0.89456598271532628,"N/A",2.5235374387029639E-3,"N/A"]
[null,"87221","KANDOS","Rural short",293.5,2027.39033993301,400.86,27.984000000000002,0.37567913329699998,0,3,0.15804053994700001,0.15804053994265216,3.9641312086838038E-3,3.9641312086838038E-3,0,0,"N/A",0,"N/A"]
[null,"87222","KANDOS","Rural long",312.5,238158.14286326841,348.96070203538301,26,8.2144947076697896,0.51242367401250277,50,1766.2326492163738,1761.5065345579694,10.778625870858034,10.711746889966314,7,110.17834394904459,"N/A",0.32802547770700635,"N/A"]
[null,"87223","KANDOS","Rural short",426.5,5079.7239372836502,117.2,45.984000000000002,0.46805991687900006,0,3,0.196903249167,0.19690324916650753,5.3575842165556522E-3,5.3575842165556522E-3,0,0,"N/A",0,"N/A"]
[null,"8734","NORTH ROCKS","Urban",579.5,4539.2300129558798,957.02,136.99199999999999,7.0387722427000005E-2,0,2,5.6788109630000003E-3,5.6788109630017637E-3,7.1512617181710932E-4,7.1512617181710932E-4,0,0,"N/A",0,"N/A"]
[null,"8735","NORTH ROCKS","Urban",540.5,4309.5543659568502,1146.9669871138501,205.44,0.87221452958130008,0,5,7.0369394858529985E-2,7.0369394858566109E-2,2.1365636012549293E-3,2.1365636012549293E-3,0,0,"N/A",0,"N/A"]
[null,"8737","NORTH ROCKS","Urban",718,2698.6429863028102,4379.2534931571699,237.12,0.55048093941499998,1.3663742608293845,2,4.4412250970799996E-2,4.4412250970461406E-2,1.7125180216506332E-3,1.7125180216506332E-3,4,0.11023770715129035,"N/A",3.0352712863336313E-4,"N/A"]
[null,"8738","NORTH ROCKS","Urban",1331,5893.6011292032299,1167.2229355597201,230,3.8498895585030009,0.64786135684203006,6,0.31060523451464001,0.29449559191225771,3.1774257365973272E-3,3.1618908835570371E-3,1,5.2268805537099616E-2,"N/A",2.9038225298388677E-4,"N/A"]
[null,"8740","NORTH ROCKS","Urban",2,0,583.33000000000004,106.08,1.4669351091E-4,0,1,1.183508557E-5,1.1835085569744454E-5,2.3670171139488909E-6,2.3670171139488909E-6,0,0,"N/A",0,"N/A"]
[null,"8741","NORTH ROCKS","Urban",404,2876.5535059703202,1307.8399999999999,145,0.4244295523478,0,4,3.4242551282139995E-2,3.4242551282643731E-2,8.5382526372143261E-4,8.5382526372143261E-4,0,0,"N/A",0,"N/A"]
[null,"8743","NORTH ROCKS","Urban",740.5,4755.99362594385,533.88121006321001,188.352,1.4602748563889998,0.79294142063415818,5,0.11781351317549998,0.11781351317481546,2.7125398775027796E-3,2.7125398775027796E-3,3,6.3973719808610607E-2,"N/A",1.4220365475342604E-4,"N/A"]
[null,"8744","NORTH ROCKS","Urban",587.5,3362.153402807,1649.46271429684,222.048,1.28451658466,1.1784885426871541,2,0.10363351180989999,0.10363351180902454,1.2589892995005987E-3,1.2589892995005987E-3,4,9.5079275550053299E-2,"N/A",2.5453259212167853E-4,"N/A"]
[null,"8745","NORTH ROCKS","Urban",8,0,1144.2584787959199,61.631999999999998,5.8677404365999996E-4,0,1,4.7340342279000001E-5,4.734034227897787E-5,9.4680684557955736E-6,9.4680684557955736E-6,0,0,"N/A",0,"N/A"]
[null,"8762","BONNYRIGG","Urban",1600,7496.2833071155801,1142.07,150,1.5812023613704,1.6218010806451322,4,0.12756982319304,0.12756982318947263,1.5749951005463486E-3,1.5749951005463486E-3,5,0.13084528720358304,"N/A",3.429617555817922E-4,"N/A"]
[null,"8764","BONNYRIGG","Urban",1242.5,4005.3962878686202,2611.2081950260699,175,0.33675756308100002,0,3,2.7169262978899999E-2,2.7169262978772223E-2,1.553485304029024E-4,1.553485304029024E-4,0,0,"N/A",0,"N/A"]
[null,"8766","BONNYRIGG","Urban",1197,60.38,7764.10008818599,201.6,4.2168753610999997E-2,0.43835063684819114,1,3.4021328158E-3,3.4021328158235623E-3,1.5534853040290238E-5,1.5534853040290238E-5,5,3.5365690440568434E-2,"N/A",7.4089299115230375E-5,"N/A"]
[null,"8767","BONNYRIGG","Urban",511,3280.8140125259902,943.71524332000195,185,0.87242070826100004,0,3,7.0386029147900001E-2,7.0386029148164261E-2,7.1340825115794406E-4,7.1340825115794406E-4,0,0,"N/A",0,"N/A"]
[null,"8769","BONNYRIGG","Urban",803,2348.8198770292202,4858.9361508453203,199.00800000000001,7.5569013319740003E-2,0,4,6.096832323956E-3,6.0968323239662158E-3,7.6479276506044268E-5,7.6479276506044268E-5,0,0,"N/A",0,"N/A"]
[null,"8770","BONNYRIGG","Urban",931.5,4846.7774676294703,741.93111496181905,220,0.167964055478,0,2,1.35511718059E-2,1.3551171805914716E-2,1.0276902780499697E-4,1.0276902780499697E-4,0,0,"N/A",0,"N/A"]
[null,"8772","BONNYRIGG","Urban",410.5,0,3005.3317980645502,92.64,0.50245543685060001,0,5,4.053760151507E-2,4.053760151428968E-2,2.5692256951249243E-4,2.5692256951249243E-4,0,0,"N/A",0,"N/A"]
[null,"8776","BONNYRIGG","Urban",661,1721.4909436319699,3229.3198908015002,260,0.24071885622399999,0,8,1.9420956277489996E-2,1.9420956277753611E-2,1.2905877910394969E-4,1.2905877910394969E-4,0,0,"N/A",0,"N/A"]
[null,"8777","BONNYRIGG","Urban",669,0,4350.1807072868796,157.72800000000001,1.5374487617900001E-2,0.48345209618938872,3,1.2403982658399999E-3,1.2403982658324053E-3,4.7799547816277659E-6,4.7799547816277659E-6,2,3.9004431018082569E-2,"N/A",8.6039186069299787E-5,"N/A"]
[null,"8779","BONNYRIGG","Urban",1033.5,270.31,6106.2083637220103,250,0.76743576777,5.3321922373829635E-3,1,6.1915949275E-2,6.1915949275119855E-2,1.3025376779935661E-4,1.3025376779935661E-4,1,4.3019593034649892E-4,"N/A",1.1949886954069415E-6,"N/A"]
[null,"8798","KURRAJONG","Rural short",1087,31854.788176400602,1328.5,225,1.9519082151081002,3.5421308683581914,7,0.82112792777229993,0.82112792777075061,6.4241162945747063E-3,6.4241162945747063E-3,6,1.4901021253793094,"N/A",4.1373552081451067E-3,"N/A"]
[null,"8799","KURRAJONG","Rural short",1143.5,55830.637546105398,372.9,187,6.4973947344557983,1.1237595140284595,17,2.7333212868167003,1.9980870963118966,1.1022562293988998E-2,9.122120519163307E-3,8,0.47274268018368859,"N/A",1.3832723738075507E-3,"N/A"]
[null,"8801","KURRAJONG","Rural short",714.5,77674.492614867602,2583.6714282171902,148,11.825869248856602,2.0188272276536052,19,4.9749017066396002,1.6072316482749598,1.0200076017670996E-2,4.8102985251325643E-3,9,0.84927938986472595,"N/A",1.7072821190237336E-3,"N/A"]
[null,"8802","KURRAJONG","Rural short",1058,40654.5982909909,920.66,279.60000000000002,2.2030840927890005,1.7260750621761769,6,0.92679249045599998,0.92679249045105883,1.3440173469832825E-2,1.3440173469832825E-2,10,0.72612453189938253,"N/A",2.2929920430683724E-3,"N/A"]
[null,"9015","KINGSWOOD","Urban",4.5,0,1474.7282094485399,264.95999999999998,4.6982272415E-4,0,1,3.7904826929000001E-5,0,5.9778675844641911E-6,0,0,0,"N/A",0,"N/A"]
[null,"9016","KINGSWOOD","Urban",607.5,1419.01,2483.66,133.44,0.1941590116186,0.13330480593457408,3,1.566455463768E-2,1.1002260918611711E-2,8.7389640259699967E-4,1.3861868866720521E-4,1,1.0754898258662472E-2,"N/A",2.9874717385173535E-5,"N/A"]
[null,"9017","KINGSWOOD","Urban",620.5,4275.2569436725998,570.75568484505402,148,7.4545732816999999E-2,0,2,6.0142750776000006E-3,1.3216574971200773E-3,7.4842492887107741E-4,8.3649208678485904E-6,0,0,"N/A",0,"N/A"]
[null,"9019","KINGSWOOD","Urban",1065.5,3627.8300091742899,2723.8175344409801,238.27199999999999,0.89628616129248007,0.6816319076787889,9,7.2311470001969011E-2,6.426048475036561E-2,2.6702258277446992E-3,1.400526751013331E-3,2,5.4993379762627442E-2,"N/A",1.5415354170749546E-4,"N/A"]
[null,"9020","KINGSWOOD","Urban",614,1295.6175737226899,2188.80117111031,142,5.7694230605999999E-2,0.4068758910025278,1,4.6547127535000003E-3,0,7.3408214040410701E-4,0,1,3.2826339462828681E-2,"N/A",8.0064242592265081E-5,"N/A"]
[null,"9022","KINGSWOOD","Urban",1018,4125.1189475742904,1312.65,245,9.5561942226999999E-2,1.1059855399038496,1,7.7098418083000001E-3,0,1.2158982683979024E-3,0,2,8.9229805886036323E-2,"N/A",8.8429163460113666E-5,"N/A"]
[null,"9025","KINGSWOOD","Urban",2293.5,7055.3811709703696,8272.93956453391,480,3.8653855568657698,0.78800914281457901,10,0.31185543613898797,0.2945026063506605,8.3985242228662282E-3,5.6618564388376744E-3,4,6.3575788573040096E-2,"N/A",3.1308703819661864E-4,"N/A"]
[null,"9026","KINGSWOOD","Urban",989,2001.2576141940799,1440.3341863432699,107.04,0.152967627248,0.39517469137049299,2,1.2341274992900001E-2,4.8361192503118917E-3,1.2517321390330869E-3,6.8114355638195656E-5,2,3.1882298393457201E-2,"N/A",9.2014129546334492E-5,"N/A"]
[null,"9027","KINGSWOOD","Urban",871.5,1296.17229323163,4371.4711321861396,192,2.5473104097965003,0.21032536047455022,10,0.20551445312390301,0.19891901322613489,1.4213503549973569E-3,3.8120139383481433E-4,1,1.696883947477857E-2,"N/A",8.484419737389284E-5,"N/A"]
[null,"9029","KINGSWOOD","Urban",818,4076.1572758736902,2503.4584241541102,203,0.239075040282,0.47856425330512098,4,1.9288334853299997E-2,1.3094686124269264E-2,1.1333270837805163E-3,1.5654351909830932E-4,3,3.8610084748598276E-2,"N/A",1.3144875649476355E-4,"N/A"]
[null,"9030","KINGSWOOD","Urban",977.5,4053.6259245870901,3464.3610983604499,214.08,9.1051644067999996E-2,1.023780909577529,1,7.3459554693000003E-3,0,1.1585107395020314E-3,0,1,8.25976186265278E-2,"N/A",1.7207837213859957E-4,"N/A"]
[null,"9032","KINGSWOOD","Urban",662,7353.0395549866298,3550.7585664202502,210,0.16404430582400001,0.99645342436094131,4,1.3234930329E-2,8.2239122017905703E-3,8.5719346271707919E-4,6.6919366942788723E-5,6,8.0392864483501983E-2,"N/A",2.1509796517324946E-4,"N/A"]
[null,"9033","KINGSWOOD","Urban",1238,2358.29767942119,1486.34,182.4,0.138250657069,0,2,1.1153924575600001E-2,1.9430516187316869E-3,1.4681566781171711E-3,1.5534853040290238E-5,0,0,"N/A",0,"N/A"]
[null,"9034","KINGSWOOD","Urban",516,1274.5999999999999,2722.94,120,4.8579669744999998E-2,0,1,3.9193591100000003E-3,0,6.1811150910133505E-4,0,0,0,"N/A",0,"N/A"]
[null,"9046","SHERWOOD","Urban",1151,5746.9946939158899,276.69,215.52,0,1.6449813052326443,0,0,0,0,0,3,0.13271544451189493,"N/A",2.820173321160382E-4,"N/A"]
[null,"9047","SHERWOOD","Urban",239,1112.48656574854,532.55999999999995,36.479999999999997,0,0.42657537899063708,0,0,0,0,0,1,3.4415674427719915E-2,"N/A",8.6039186069299787E-5,"N/A"]
[null,"9049","SHERWOOD","Urban",851,2596.33156013487,770.09551001440798,133.44,0.18699701944,0.27490413312729944,1,1.5086732279999999E-2,1.5086732279512636E-2,1.4937358692586767E-4,1.4937358692586767E-4,2,2.2178990186752835E-2,"N/A",6.3334400856567897E-5,"N/A"]
[null,"9050","SHERWOOD","Urban",1415,3095.3556263702599,1308.5490129950799,240,0,1.5232295824790667,0,0,0,0,0,2,0.12289263743564986,"N/A",2.7365241124818957E-4,"N/A"]
[null,"9052","SHERWOOD","Urban",1156,4244.8063427527304,871.05123659536605,215,2.03002483136,1.3343811074050866,5,0.16378037063709999,0.16378037063769374,2.0171409178469171E-3,2.0171409178469171E-3,1,0.10765653156921136,"N/A",3.26231913846095E-4,"N/A"]
[null,"9055","SHERWOOD","Urban",1719.5,2695.6004922406501,2232.8011813998901,175.00800000000001,0.36384806197899999,0.23943024310359892,3,2.9354897303000001E-2,2.9354897302671518E-2,1.8641823648348285E-4,1.8641823648348285E-4,3,1.9316992261253208E-2,"N/A",8.484419737389284E-5,"N/A"]
[null,"9056","SHERWOOD","Urban",1520.5,4838.0061692212203,1816.61,230,1.0990981249280001,0,7,8.8674136143245999E-2,8.8674136142672083E-2,7.6957271984207033E-4,7.6957271984207033E-4,0,0,"N/A",0,"N/A"]
[null,"9057","SHERWOOD","Urban",855.5,1208.1996112025299,2374.8675358827099,116.352,0.66437634113100008,0,2,5.3601217932199997E-2,5.3601217932478358E-2,1.1352392606365944E-4,1.1352392606365944E-4,0,0,"N/A",0,"N/A"]
[null,"9059","SHERWOOD","Urban",967,4872.6109674735299,569.68999922754494,188.83199999999999,1.8127824326125999,3.7029112759603914E-3,6,0.14625347144187997,0.10057861352631604,1.5976998857590808E-3,1.3551171805914718E-3,1,2.9874717385173534E-4,"N/A",1.1949886954069415E-6,"N/A"]
[null,"9060","SHERWOOD","Urban",1297.5,1239.18545223304,3196.7395652210298,160.03200000000001,8.9684511103999998E-2,0.16292809614225723,1,7.2356565507000004E-3,7.2356565506890309E-3,4.1824604339242954E-5,4.1824604339242954E-5,1,1.3144875649476357E-2,"N/A",2.9874717385173535E-5,"N/A"]
[null,"9062","SHERWOOD","Urban",849,3081.46006928306,1358.30785639329,48,0.25421226491799997,2.1399864846030292,4,2.05095909794E-2,2.0509590979269337E-2,4.505107381684169E-4,4.505107381684169E-4,2,0.17265196671239491,"N/A",3.7522645035777959E-4,"N/A"]
[null,"988","TRANSMISSION","Rural short",0,0,0,0,0,0,0,0,0,0,0,0,0,"N/A",0,"N/A"]
[null,"A","PORT CENTRAL","Urban",0,0,0,0,0,1.732962477149463E-2,0,0,0,0,0,1,1.3981367736261214E-3,"N/A",3.5849660862208244E-6,"N/A"]
[null,"A045","RIVERSTONE","Urban",134,946.74453594720205,984.02658887999598,69.888000000000005,0,6.220890943613458E-3,0,0,0,0,0,1,5.0189525207091539E-4,"N/A",1.1949886954069415E-6,"N/A"]
[null,"A046","RIVERSTONE","Urban",336,5826.4232857802899,1278.19686732634,280,1.5297467063179,0.32422691132309189,4,0.12341843246153,0.12341843246162891,5.5447475466882082E-4,5.5447475466882082E-4,2,2.6158302542457948E-2,"N/A",9.2014129546334492E-5,"N/A"]
[null,"A048","RIVERSTONE","Urban",302,8751.1134833788492,1595.13,195.648,0.25191645992299999,0.30045422093142615,3,2.0324367731399999E-2,2.032436773148126E-2,3.9673624687510452E-4,3.9673624687510452E-4,5,2.4240345686329809E-2,"N/A",6.8114355638195656E-5,"N/A"]
[null,"A051","RIVERSTONE","Rural short",986.5,36575.007071721302,5302.66974551357,242.11199999999999,5.2261556700394989,1.3057205741291533,9,2.1985369713516998,2.1985369713812162,1.9023110618173206E-2,1.9023110618173206E-2,14,0.5492899824910118,"N/A",1.2150365445606863E-3,"N/A"]
[null,"A052","RIVERSTONE","Rural short",710.5,13269.390261994,16324.5435002955,181.2,3.1456971871207995,2.1484291223122192,6,1.3233305709454999,1.3233305709425567,1.4063269133710097E-2,1.4063269133710097E-2,12,0.90380026045398754,"N/A",1.950289427935871E-3,"N/A"]
[null,"A053","RIVERSTONE","Rural short",176.5,4739.93823368003,3260.4059139948299,181.68,1.2325161601185699,5.2496913741545663,5,0.51849438036333995,0.51849438036520379,1.9454483004724436E-3,1.9454483004724436E-3,17,2.2084379614802261,"N/A",3.8445002461227873E-3,"N/A"]
[null,"A054","RIVERSTONE","Urban",231,983.11,28.04,47.231999999999999,0,0.20617809984547458,0,0,0,0,0,1,1.6634242640064623E-2,"N/A",3.4654672166801301E-5,"N/A"]
[null,"A055","RIVERSTONE","Rural short",547.5,5045.9008300147098,5168.33,199.488,6.1162761998628996,5.9559402359959401,7,2.5729925018104001,2.5729925018192912,1.4871983081718405E-2,1.4871983081718405E-2,25,2.5055424359301885,"N/A",7.0409810018132084E-3,"N/A"]
[null,"A095","LUDDENHAM","Rural short",263,30541.3435821028,56.96,123,2.5449220501018002,0.56121323298455694,6,1.0705967387161999,0.55580133217852934,5.5081656686751116E-3,3.302407018549558E-3,5,0.23609094704309952,"N/A",5.4209322757322936E-4,"N/A"]
[null,"A096","LUDDENHAM","Rural short",969,26189.194389734599,3315.8786377174201,343.488,7.1554761263701003,0.56654542522193985,12,3.0101626902669998,2.4907065281732708,2.0761547520390805E-2,1.7452909545202476E-2,4,0.23833409143305773,"N/A",7.5394575329150286E-4,"N/A"]
[null,"A098","LUDDENHAM","Rural short",474.5,30367.4372587123,1064.3499999999999,150,2.3180224587599999E-2,0.52647992521604847,4,9.7514471396800001E-3,9.7514471396793548E-3,1.5577391596931879E-4,1.5577391596931879E-4,7,0.22147935372517744,"N/A",5.9817183732218413E-4,"N/A"]
[null,"A314","HOMEPRIDE","Urban",525.5,3034.3859809544701,783.93318014429406,120,0.29527014514479999,0.23195036232615893,3,2.3822099642840003E-2,2.3822099642937376E-2,1.1830388084528721E-4,1.1830388084528721E-4,1,1.8713522970072703E-2,"N/A",4.3019593034649893E-5,"N/A"]
[null,"A315","HOMEPRIDE","Urban",1365,444.720177104735,2862.9713656782201,179.04,4.25928195956,2.4919852304958243,4,0.34363460348710001,0.34363460348532887,2.3565913322360077E-3,2.3565913322360077E-3,4,0.20105087305874086,"N/A",4.971152972892876E-4,"N/A"]
[null,"A321","HOMEPRIDE","Urban",92.5,0,1527.8198469372801,145,8.2827609385999999E-3,0,1,6.6824485861999999E-4,6.6824485862099507E-4,1.1137414310349918E-4,1.1137414310349918E-4,0,0,"N/A",0,"N/A"]
[null,"A322","HOMEPRIDE","Urban",1438,3123.4662462189799,1546.4510946965099,159.84,0.37160713909099996,0,3,2.9980891874399999E-2,2.9980891874286403E-2,1.8051996717316939E-3,1.8051996717316939E-3,0,0,"N/A",0,"N/A"]
[null,"A324","HOMEPRIDE","Urban",1108.5,5833.4591643870499,676.46,160,0.12208689184669999,1.6003093835994582,3,9.8498481830500001E-3,9.8498481830568037E-3,1.380735498678952E-3,1.380735498678952E-3,5,0.12911135860654757,"N/A",3.4057177819097831E-4,"N/A"]
[null,"A325","HOMEPRIDE","Urban",1342,3843.6895652316698,2144.63520738637,150,5.4572436033759999,3.9725424634307234,7,0.44028494933989998,0.44028494933162438,5.1018970598490608E-3,5.1018970598490608E-3,12,0.32050074806292334,"N/A",7.1579822854875796E-4,"N/A"]
[null,"A326","HOMEPRIDE","Urban",190.5,1028.72285110453,2660.09563023495,65,3.3941313847999997E-2,0.95772097241439569,1,2.7383512143E-3,2.7383512142945985E-3,4.5639186904909972E-4,4.5639186904909972E-4,2,7.7267969045012833E-2,"N/A",1.6610342866156487E-4,"N/A"]
[null,"A327","HOMEPRIDE","Urban",713,326.22000000000003,1594.85,null,6.4551517318999996E-2,0,1,5.2079517788999998E-3,5.2079517789065371E-3,8.6799196315108951E-4,8.6799196315108951E-4,0,0,"N/A",0,"N/A"]
[null,"A328","HOMEPRIDE","Urban",457,0,1650.62,null,4.1143714664999997E-2,0,1,3.3194337001000002E-3,3.3194337000784753E-3,5.5323895001307911E-4,5.5323895001307911E-4,0,0,"N/A",0,"N/A"]
[null,"A339","CABRAMATTA","Urban",796,395.55676188755098,2176.3231938117601,199.584,0,4.2953770801140538E-3,0,0,0,0,0,1,3.4654672166801304E-4,"N/A",1.1949886954069415E-6,"N/A"]
[null,"A341","CABRAMATTA","Urban",242,1900.8846483541599,493.70250793123898,96.768000000000001,0,0.20333426398553703,0,0,0,0,0,2,1.6404804810546493E-2,"N/A",3.7044649557615188E-5,"N/A"]
[null,"A343","CABRAMATTA","Urban",421.5,2401.1880303998601,891.20458693083799,124.032,0,6.754110167351754E-2,0,0,0,0,0,2,5.4491484510556529E-3,"N/A",1.6729841735697181E-5,"N/A"]
[null,"A344","CABRAMATTA","Urban",617.5,3414.8577789064798,136.88375153608001,140.352,0.31371064329999998,0.39813702039126131,1,2.5309860569E-2,2.530986056871902E-2,6.8114355638195656E-5,6.8114355638195656E-5,1,3.2121296132538585E-2,"N/A",6.6919366942788723E-5,"N/A"]
[null,"A346","CABRAMATTA","Urban",198.5,3678.7409361954401,1085.19379503819,159.16800000000001,1.6292809613999999E-2,0.72806641507933212,1,1.3144875649000001E-3,1.3144875649476356E-3,1.1949886954069415E-5,1.1949886954069415E-5,3,5.8739669322728207E-2,"N/A",8.9624152155520613E-5,"N/A"]
[null,"A347","CABRAMATTA","Urban",1356.5,5967.7563921419696,801.79114276132998,220,7.8501719050000005E-4,0.67096752320402298,1,6.3334400857000006E-5,6.3334400856567897E-5,1.1949886954069415E-6,1.1949886954069415E-6,3,5.4132987901934444E-2,"N/A",1.0157403910959002E-4,"N/A"]
[null,"A348","CABRAMATTA","Urban",806,6135.2429507622201,1171.7690277655599,198.048,0.18107236139300001,1.826275841303665,2,1.4608736801199999E-2,1.4608736801349859E-2,8.8429163460113666E-5,8.8429163460113666E-5,5,0.14734210614367588,"N/A",3.3220685732312974E-4,"N/A"]
[null,"A350","CABRAMATTA","Urban",661,2897.0853680277201,793.02,105.21599999999999,1.5596217944949999,0.51129798898461087,3,0.1258287246599,0.12582872466026471,1.0850497354295029E-3,1.0850497354295029E-3,5,4.125100976544762E-2,"N/A",9.0819140850927546E-5,"N/A"]
[null,"AB1213","ABBOTSBURY","Urban",927.5,0,7943.5507534039298,205,2.0143837341000002E-3,0.16174316453394991,1,1.6251846258E-4,1.6251846257534403E-4,1.1949886954069415E-6,1.1949886954069415E-6,1,1.3049276553843801E-2,"N/A",3.1069706080580475E-5,"N/A"]
[null,"AB1215","ABBOTSBURY","Urban",229.5,0,2275.6074151367302,65.28,0,4.9767127548907664E-2,0,0,0,0,0,1,4.0151620165673231E-3,"N/A",8.3649208678485904E-6,"N/A"]
[null,"AB1223","ABBOTSBURY","Urban",961,0,5209.3949183324203,179.328,9.6423809626000005E-3,0,1,7.7793764070999995E-4,7.7793764070991885E-4,2.389977390813883E-6,2.389977390813883E-6,0,0,"N/A",0,"N/A"]
[null,"AB1230","ABBOTSBURY","Urban",605.5,0,6153.2538447637298,183.55199999999999,9.6275693175000001E-4,0,1,7.7674265200999997E-5,7.7674265201451188E-5,1.1949886954069415E-6,1.1949886954069415E-6,0,0,"N/A",0,"N/A"]
[null,"AB1241","ABBOTSBURY","Urban",628.5,214.78,4912.3511535645903,144.96,0.59760544500500012,1.2441781887226916E-2,5,4.8214208893800001E-2,4.8214208893583868E-2,3.1667200428283954E-4,3.1667200428283954E-4,1,1.0037905041418308E-3,"N/A",2.389977390813883E-6,"N/A"]
[null,"AB1245","ABBOTSBURY","Urban",1020,0,8671.2831565684191,220,0.24396260649900001,0,4,1.9682658802E-2,1.9682658802047732E-2,4.4214581730056833E-5,4.4214581730056833E-5,0,0,"N/A",0,"N/A"]
[null,"AB1246","ABBOTSBURY","Urban",744.5,0,5867.5230605785,250,1.1493836601E-2,0.86514819051538583,1,9.2731122763999995E-4,9.2731122763578652E-4,2.7484739994359652E-5,2.7484739994359652E-5,4,6.9799289698719444E-2,"N/A",2.1509796517324946E-4,"N/A"]
[null,"AB1263","ABBOTSBURY","Urban",482.5,0,5138.5879889070802,162.624,0.1938548111193,0,6,1.5640012045569002E-2,1.5640012045486051E-2,1.3503372258098439E-4,1.3503372258098439E-4,0,0,"N/A",0,"N/A"]
[null,"AB1265","ABBOTSBURY","Urban",463.5,0,2713.9835805810699,108.096,1.9773546214000001E-2,0,1,1.5953099084E-3,1.5953099083682669E-3,1.7924830431104121E-5,1.7924830431104121E-5,0,0,"N/A",0,"N/A"]
[null,"AB1271","ABBOTSBURY","Urban",756.5,0,3695.4849509999999,193.536,0,0.23994865068223337,0,0,0,0,0,1,1.9358816865592453E-2,"N/A",3.5849660862208241E-5,"N/A"]
[null,"AB1280","ABBOTSBURY","Urban",601,0,6962.0714771134599,200,3.5059163961099996E-2,5.8654114611212602E-2,4,2.8285382420199998E-3,2.8285382420282302E-3,4.8994536511684592E-5,4.8994536511684592E-5,1,4.7321552338114884E-3,"N/A",1.3144875649476356E-5,"N/A"]
[null,"AB1287","ABBOTSBURY","Urban",768.5,0,7040.3638003509795,190,0.1798281832028,0,4,1.4508357750449999E-2,1.4508357750935676E-2,3.5849660862208241E-5,3.5849660862208241E-5,0,0,"N/A",0,"N/A"]
[null,"AB1289","ABBOTSBURY","Urban",1006.5,0,7499.1893785818502,250,0.31802083201608,0.13330480593457408,5,2.565760227902E-2,2.5657602279082439E-2,1.0754898258662473E-4,1.0754898258662473E-4,2,1.0754898258662472E-2,"N/A",3.5849660862208241E-5,"N/A"]
[null,"APA2","ALBION PARK","Urban",1533,1585.94014046405,8277.0355314924891,234,1.4959761555E-3,1.698303227606474,1,1.2069385824E-4,1.2069385823610109E-4,1.1949886954069415E-6,1.1949886954069415E-6,11,0.1370174038153599,"N/A",5.0548021815713623E-4,"N/A"]
[null,"APB2","ALBION PARK","Urban",1476,9607.6671007270506,4886.8,201,0.3549758865573,1.9853529097189235,5,2.863909907412E-2,2.8639099074122758E-2,2.7365241124818957E-4,2.7365241124818957E-4,8,0.16017628473234644,"N/A",4.1227109991539478E-4,"N/A"]
[null,"APC2","ALBION PARK","Rural short",1565.5,53508.6184479437,16266.85,268.99200000000002,8.9045240500812302,4.6799021986548848,19,3.7459514359423296,3.7459514359239572,1.34464044264716E-2,1.34464044264716E-2,21,1.968739290543277,"N/A",5.4333941890098384E-3,"N/A"]
[null,"APD2","ALBION PARK","Urban",445,11385.569682761199,2046.0114067013601,215.04,0.7026496320783,1.2691506223677684,3,5.6689068721549996E-2,5.6689068721409892E-2,5.4730482249637914E-4,5.4730482249637914E-4,13,0.10239380135463919,"N/A",3.0233213993795618E-4,"N/A"]
[null,"APE2","ALBION PARK","Urban",681,22310.652639585202,3447.69115674152,160.03,0.75148362598259999,1.9551371537070867,5,6.0628946450589999E-2,6.0628946450166574E-2,9.8825565110154069E-4,9.8825565110154069E-4,9,0.15773850779371626,"N/A",3.6566654079452408E-4,"N/A"]
[null,"APG2","ALBION PARK","Urban",1626,4862.3795852676803,5894.9396154189599,244.12799999999999,3.8564339774439,0.34792554348923838,3,0.31113323167517998,0.31113323167962836,3.8861032374633737E-3,3.8861032374633737E-3,1,2.8070284455109056E-2,"N/A",1.039640165004039E-4,"N/A"]
[null,"APH2","ALBION PARK","Urban",2006.5,6061.9420810923202,5342.0708977349004,233.31,0.16815660686860001,2.7621200138996866,3,1.3566706658639998E-2,1.3566706658955006E-2,1.3861868866720521E-4,1.3861868866720521E-4,11,0.22284507688557267,"N/A",7.2057818333038574E-4,"N/A"]
[null,"AZ1227","ANZAC VILLAGE","Urban",978.5,3919.72866420221,5862.39,250,2.4071737506353497,2.1254710724012648E-2,3,0.19420836778643599,0.19420836778884068,2.6253901638090501E-3,2.6253901638090501E-3,2,1.7148087779089609E-3,"N/A",3.5849660862208244E-6,"N/A"]
[null,"AZ1231","ANZAC VILLAGE","Urban",36.5,259.26087939543203,3107.96501282281,139.19999999999999,8.228475675880001E-2,1.6292809614225723E-3,2,6.6386517798300007E-3,6.6386517798269779E-3,1.171299492189793E-5,1.171299492189793E-5,1,1.3144875649476355E-4,"N/A",1.1949886954069415E-6,"N/A"]
[null,"AZ1253","ANZAC VILLAGE","Urban",1222.5,0,7145.18,255,0,0.44434935311524698,0,0,0,0,0,1,3.5849660862208241E-2,"N/A",1.1949886954069414E-4,"N/A"]
[null,"AZ1257","ANZAC VILLAGE","Urban",1103.5,1379.2204561506901,4393.45,205,0.33868307693999999,0.39280482815387835,1,2.7324611509000001E-2,2.7324611509175124E-2,1.326437451901705E-4,1.326437451901705E-4,2,3.1691100202192089E-2,"N/A",1.7446834952941344E-4,"N/A"]
[null,"AZ1272","ANZAC VILLAGE","Urban",1367,9708.5908574840705,5765.9229443275499,240,1.49597615548E-2,0,2,1.2069385823560001E-3,1.2069385823610108E-3,4.7799547816277659E-6,4.7799547816277659E-6,0,0,"N/A",0,"N/A"]
[null,"B201","PROSPECT","Urban",1587.5,4495.9672024256997,2197.12606008804,256.99200000000002,2.747397238644,1.2478070417731326,5,0.22165725812250001,0.22165725812233819,1.0683198936938055E-3,1.0683198936938055E-3,6,0.10067182264455778,"N/A",2.796273547252243E-4,"N/A"]
[null,"B202","PROSPECT","Urban",58,1737.3119299943801,944.63979614986795,237.41,2.26173820731E-2,3.6880996308565499E-2,3,1.82474773788E-3,1.8247477378863996E-3,7.1699321724416496E-5,7.1699321724416496E-5,2,2.9755218515632844E-3,"N/A",7.1699321724416489E-6,"N/A"]
[null,"B204","PROSPECT","Urban",78.5,467.23107062880803,971.86570882146395,159.16800000000001,5.7454371358000002E-2,0,1,4.6353611495000002E-3,4.6353611494835256E-3,1.2308383562691498E-4,1.2308383562691498E-4,0,0,"N/A",0,"N/A"]
[null,"B205","PROSPECT","Urban",657.5,2913.4830316800699,1481.48731601852,110.11,0.12638776767589999,4.9989302225465285E-2,3,1.019683853787E-2,1.0196838537907432E-2,5.4969479988719312E-5,5.4969479988719312E-5,1,4.0330868469984271E-3,"N/A",1.7924830431104121E-5,"N/A"]
[null,"B210","PROSPECT","Urban",902.5,5319.67677979358,933.82212050720102,200.83199999999999,0,1.9729851860572158,0,0,0,0,0,2,0.15917846917168163,"N/A",3.6447155209911713E-4,"N/A"]
[null,"B211","PROSPECT","Urban",1126.5,6498.1634952141203,1835.2380731246601,220.32,1.1837762999500001,3.1993153424297781E-2,2,9.5505886514999999E-2,9.5505886514313562E-2,3.2408093419436252E-3,3.2408093419436252E-3,1,2.5811755820789937E-3,"N/A",4.7799547816277659E-6,"N/A"]
[null,"B212","PROSPECT","Urban",164.5,2139.46263473931,722.53,90.24,0.40284712353499996,0.18129453607102078,3,3.2501302537599995E-2,2.9285587958337914E-2,3.0711209471958397E-4,2.796273547252243E-4,1,1.4626661631780963E-2,"N/A",4.0629615643836007E-5,"N/A"]
[null,"B214","PROSPECT","Urban",1454,5004.16617351889,1581.9532942657099,224.83,0,1.5636653736125541,0,0,0,0,0,6,0.1261549565741108,"N/A",2.820173321160382E-4,"N/A"]
[null,"B215","PROSPECT","Urban",653.5,3406.9763645939402,1289.08,216.96,2.0479321102877002,0.26409163220149512,7,0.16522511197036002,0.14953371541105223,9.7869574153828512E-4,9.679408432796226E-4,4,2.1306648439105767E-2,"N/A",4.7799547816277659E-5,"N/A"]
[null,"B217","PROSPECT","Urban",2109,8141.8367574701897,3015.6231938199498,243.16800000000001,3.4042936990589996,4.508531464803438,6,0.27465500676619997,0.2518952520709154,2.9934466819943883E-3,2.8655828915858453E-3,13,0.36374380398361433,"N/A",8.2215222243997577E-4,"N/A"]
[null,"B709","QUAKERS HILL","Urban",401.5,270.06,3564.22,244.03200000000001,0.18647861185680001,0,2,1.504490767541E-2,1.5044907675173393E-2,4.7919046685818351E-4,4.7919046685818351E-4,0,0,"N/A",0,"N/A"]
[null,"B710","QUAKERS HILL","Urban",1117,324.14130736299097,5413.4801597958103,235.00800000000001,0.149019961388,0,2,1.20227812645E-2,1.2022781264489238E-2,6.213941216116095E-5,6.213941216116095E-5,0,0,"N/A",0,"N/A"]
[null,"B712","QUAKERS HILL","Urban",784.5,648.65399793297399,13108.202315802901,207.79,2.1506508690299998E-2,3.4066783738835602E-3,2,1.7351235857700001E-3,1.735123585730879E-3,1.1949886954069415E-5,1.1949886954069415E-5,1,2.7484739994359652E-4,"N/A",2.389977390813883E-6,"N/A"]
[null,"B713","QUAKERS HILL","Urban",1579.5,0,7099.4782930887004,276.95999999999998,1.7704359392328002,0.43812846217163354,3,0.14283699876048001,0.14283699876199171,1.9275167656913966E-3,1.9275167656913966E-3,4,3.5347765610137326E-2,"N/A",1.123289373682525E-4,"N/A"]
[null,"B715","QUAKERS HILL","Urban",302,1110.0275979880601,2253.70297241976,55.008000000000003,8.3789476351999986E-2,0.16440926065264139,2,6.7600510500000002E-3,6.7600510499170674E-3,8.8429163460113666E-5,8.8429163460113666E-5,1,1.326437451901705E-2,"N/A",4.4214581730056833E-5,"N/A"]
[null,"B716","QUAKERS HILL","Urban",1125,2064.84184903289,4482.0572131928002,201.024,0.12278853791062999,0.10664384474765927,5,9.9064562849289998E-3,9.9064562849235441E-3,7.0504333029009549E-5,7.0504333029009549E-5,1,8.6039186069299788E-3,"N/A",7.1699321724416482E-5,"N/A"]
[null,"B718","QUAKERS HILL","Urban",237,0,2303.83,86.016000000000005,0,0.18596020427873086,0,0,0,0,0,1,1.500308307083415E-2,"N/A",3.7044649557615188E-5,"N/A"]
[null,"B719","QUAKERS HILL","Urban",648.5,0,14212.2130761185,166.08,0.26526175216699999,0,3,2.1401052545900003E-2,2.1401052546042913E-2,2.2585286343191192E-4,2.2585286343191192E-4,0,0,"N/A",0,"N/A"]
[null,"B720","QUAKERS HILL","Urban",1115,40.69,6039.16912269567,205,9.6275693175000001E-4,0,1,7.7674265200999997E-5,7.7674265201451188E-5,1.1949886954069415E-6,1.1949886954069415E-6,0,0,"N/A",0,"N/A"]
[null,"B743","MOOREBANK","Urban",757.5,4831.2733636775702,2051.22609536253,168.768,2.0557526588820001,0,3,0.1658560659993,0.16585606600161562,1.8928620935245953E-3,1.8928620935245953E-3,0,0,"N/A",0,"N/A"]
[null,"B745","MOOREBANK","Urban",378.5,1847.4860090754901,2067.6697541819799,162.048,0.37429027177000002,0.50255911837334433,1,3.0197364333E-2,3.0197364332933411E-2,1.1352392606365944E-4,1.1352392606365944E-4,3,4.0545966435157524E-2,"N/A",1.1352392606365944E-4,"N/A"]
[null,"B746","MOOREBANK","Urban",51,1406.01198184541,1461.29653659771,144.47999999999999,3.5459078379000003E-2,0,1,2.8608029367999999E-3,2.8608029368042179E-3,2.2704785212731886E-5,2.2704785212731886E-5,0,0,"N/A",0,"N/A"]
[null,"B747","MOOREBANK","Urban",629,4066.9757368279402,678.7,144.28800000000001,1.2048236476359999,0.64756512393995325,2,9.7203965450399998E-2,9.7203965450486846E-2,6.8233854507736356E-4,6.8233854507736356E-4,3,5.2244905763191483E-2,"N/A",1.3383873388557745E-4,"N/A"]
[null,"B748","SEVEN HILLS","Urban",1040,5333.1008204452301,1540.9678725742001,193.25,0.179750509542,0.76102232543537962,2,1.4502091117800001E-2,1.45020911177463E-2,1.2941144191832492E-3,1.2941144191832492E-3,3,6.1398519170008652E-2,"N/A",1.6610342866156487E-4,"N/A"]
[null,"B773","LENNOX","Urban",993.5,1238.1723773107301,2936.6529055239198,115.872,0.15946217118574002,0,3,1.2865248294834999E-2,1.2865248294751131E-2,8.9624152155520613E-5,8.9624152155520613E-5,0,0,"N/A",0,"N/A"]
[null,"B775","LENNOX","Urban",224.5,0,2344.5023591898598,142.27199999999999,0,4.4790414794016895E-2,0,0,0,0,0,1,3.6136458149105908E-3,"N/A",1.9119819126511064E-5,"N/A"]
[null,"B776","LENNOX","Urban",1534,4537.5162089984397,1048.40527987619,184.32,0,1.754291246098995,0,0,0,0,0,2,0.14153446108399814,"N/A",3.0830708341499091E-4,"N/A"]
[null,"B778","LENNOX","Urban",1464,0,2750.9822191615899,100.8,0,0.32037588359609309,0,0,0,0,0,1,2.5847605481652144E-2,"N/A",1.2308383562691498E-4,"N/A"]
[null,"B798","CASTLE HILL","Urban",8,0,2093.7600000000002,147.16800000000001,4.1771216580700002E-3,2.3106166361992843E-2,2,3.3700599263399998E-4,3.3700599263449362E-4,2.0211486518565344E-5,2.0211486518565344E-5,2,1.8641823648348286E-3,"N/A",2.389977390813883E-6,"N/A"]
[null,"BDA2","BOMADERRY","Urban",1845,12963.137870898199,3210.3514698316699,266.976,13.068270040494799,6.2482036171849415,6,1.0543349409801701,3.5255751480590992E-2,2.4306070064577185E-3,2.2465787473650501E-4,15,0.5040988112252458,"N/A",1.3515322145052507E-3,"N/A"]
[null,"BDB2","BOMADERRY","Urban",162.5,3770.43427322865,540.1,105.98399999999999,0.27737767785919998,0.89292002508508883,3,2.2378553298990002E-2,2.2378553298885797E-2,1.8044329300644817E-4,1.8044329300644817E-4,3,7.2039893502607463E-2,"N/A",2.1270798778243557E-4,"N/A"]
[null,"BDC2","BOMADERRY","Rural short",752.5,31062.900831421601,849.75,131.04,2.2567763062374997,1.2271596084983776,7,0.94937970826999996,2.3839640099944544E-2,4.6919103489958813E-3,1.806977425244098E-4,9,0.51624098847896116,"N/A",1.1901127180055954E-3,"N/A"]
[null,"BDD2","BOMADERRY","Urban",703.5,3025.0034630415998,2981.19,148,0.39969224313000001,1.1134654206812897,1,3.2246769946000002E-2,3.2246769945556315E-2,1.2547381301772885E-4,1.2547381301772885E-4,4,8.9833275177216829E-2,"N/A",2.3541277299516747E-4,"N/A"]
[null,"BDE2","BOMADERRY","Urban",1298,9099.1263642137801,1087.69,189.98400000000001,5.4521665627199997E-2,0.3511841054120835,4,4.3987533877659999E-3,4.3987533877929514E-3,4.1824604339242947E-5,4.1824604339242947E-5,4,2.8333181968098583E-2,"N/A",1.1591390345447332E-4,"N/A"]
[null,"BDF2","BOMADERRY","Rural short",1501,52553.770430742901,5360.2218744887296,318.048,4.6865378156769006,3.5346954225160627,14,1.9715307591214299,0.60032774831919933,1.4530590881618056E-2,3.9192717257880609E-3,13,1.4869741851466456,"N/A",4.5922150427755177E-3,"N/A"]
[null,"BDG2","BOMADERRY","Rural short",1577,29799.509091343501,5564.48,271.96800000000002,0.23304642405930001,1.3210506268116293,2,9.8037871754799999E-2,9.8037871754450459E-2,5.7947896740586583E-4,5.7947896740586583E-4,4,0.5557390226121417,"N/A",1.8381322084379615E-3,"N/A"]
[null,"BGA2","BOLONG","Rural short",756.5,34985.361780981097,525.49779819257503,88,7.4863889245115001,3.2893108980807195,14,3.1493709471563198,3.1367345671004681,3.9116104813751856E-2,3.9041333334086582E-2,10,1.3837459265120975,"N/A",4.1622790347001972E-3,"N/A"]
[null,"BGB2","BOLONG","Urban",27,4767.81210836836,91.653098630884998,79,1.2293665436E-3,6.5763704261056558E-2,1,9.9184061719000005E-5,9.9184061718776145E-5,1.1949886954069415E-6,1.1949886954069415E-6,2,5.3057498076068202E-3,"N/A",1.6729841735697181E-5,"N/A"]
[null,"BJ1255","BERRIMA JUNCTION","Urban",2,0,423.26,80,1.4841752382999999E-4,0,1,1.1974177205E-5,1.1974177205222504E-5,2.394835441044501E-6,2.394835441044501E-6,0,0,"N/A",0,"N/A"]
[null,"BK1236","BLACKHEATH","Urban",966.5,8549.7696663446404,465.02918537266999,75.552000000000007,3.5934384069942,0.3243009695486111,7,0.28991501240348,0.28991501240398265,2.7293541803094538E-3,2.7293541803094538E-3,4,2.6164277485934983E-2,"N/A",8.8429163460113666E-5,"N/A"]
[null,"BK1251","BLACKHEATH","Rural short",941.5,78349.583281272193,367.21,67.2,5.9335450285849994E-2,2.5611556131307642,17,2.4961212295100003E-2,2.4961212294923641E-2,1.3708104605300055E-4,1.3708104605300055E-4,13,1.0774258671933903,"N/A",2.5297683953417367E-3,"N/A"]
[null,"BK1288","BLACKHEATH","Rural short",1408.5,13082.313494984301,274.06,110.976,0.207185291716,1.882648962568886,4,8.7158621463200012E-2,8.7158621463153244E-2,6.8540523026500253E-4,6.8540523026500253E-4,9,0.79199197452784931,"N/A",1.825670295160416E-3,"N/A"]
[null,"BK1299","BLACKHEATH","Rural short",739.5,13899.918473038,230.75,60.768000000000001,2.3720849633111598,15.938366946890794,12,0.99788770569961005,0.99788770569945573,7.470917009888528E-3,7.470917009888528E-3,15,6.7049455102841939,"N/A",1.2617687193514821E-2,"N/A"]
[null,"BL1210","BULLI","Urban",1264,6823.6415147064899,4224.7700000000004,138.52799999999999,5.1026117382600003E-2,2.2910652646622136,3,4.11673605572E-3,4.1167360556769129E-3,3.4654672166801301E-5,3.4654672166801301E-5,6,0.18484085140554571,"N/A",4.839704216398113E-4,"N/A"]
[null,"BL1213","BULLI","Urban",614,3640.7056064582898,2177.71,57,2.5914750506713,0.97801292620665858,5,0.209077612129066,3.0173464559025275E-2,1.350337225809844E-3,6.1661416682998182E-4,2,7.8905103557720346E-2,"N/A",2.3182780690894663E-4,"N/A"]
[null,"BL1232","BULLI","Urban",1562,20192.625695135699,1838.8120686658101,175.2,3.0867468396299998E-2,9.7682799459835129E-2,3,2.4903564412900002E-3,2.4903564412280662E-3,4.3019593034649893E-5,4.3019593034649893E-5,6,7.8809504462087794E-3,"N/A",1.9119819126511064E-5,"N/A"]
[null,"BL1243","BULLI","Urban",1135.5,8011.3997025113804,126.85,135.26400000000001,0.31613975309300002,1.3745206656364972,2,2.55058387145E-2,2.5505838714765756E-2,1.5893349648912322E-4,1.5893349648912322E-4,1,0.11089495093376417,"N/A",2.7723737733441041E-4,"N/A"]
[null,"BL1251","BULLI","Urban",1551,5623.4277067941603,3187.5294179743,178.36799999999999,1.2698467697297999,2.3224659522823576,3,0.10244996581994999,0.1024499658233233,4.5170572686382385E-4,4.5170572686382385E-4,5,0.18737422743980842,"N/A",4.672405799041141E-4,"N/A"]
[null,"BWA2","BOWRAL","Rural short",1767.5,8858.6630177533098,1397.29,160,2.8626894185950005,0.50931322854069605,7,1.2042749817388498,9.2454233939386718E-2,2.2341577990638906E-2,1.1294091870094818E-2,3,0.21425767498083981,"N/A",5.2340035765691107E-4,"N/A"]
[null,"BWB2","BOWRAL","Urban",587.5,5469.7232221719596,909.01341060689401,160,0.10711761345749002,0.69385151488945818,4,8.6421417919900004E-3,8.6421417919393048E-3,7.5785853997834321E-4,7.5785853997834321E-4,3,5.5979245436338171E-2,"N/A",1.1591390345447332E-4,"N/A"]
[null,"BWC2","BOWRAL","Rural short",449,7014.3039977438502,49.21,53,0.98436125671960006,0.46501159803510594,8,0.41410067987072002,0.41410067986972804,5.551288887852464E-3,5.551288887852464E-3,3,0.19562088367427052,"N/A",6.4801949043236605E-4,"N/A"]
[null,"BWD2","BOWRAL","Urban",775.5,4883.1599981365098,834.63,116,0.40192742569500001,0.18218323477725126,3,3.2427102236200003E-2,3.2427102236651517E-2,1.0642347317471727E-3,1.0642347317471727E-3,3,1.4698360953505379E-2,"N/A",3.2264694775987422E-5,"N/A"]
[null,"BWE2","BOWRAL","Rural short",917.5,51023.168016069903,6024.84,130,4.9241813395276886,1.1824136286396723,13,2.07150253685603,1.9854467947169807,2.4511799110634971E-2,2.3994629709616831E-2,13,0.4974172684732287,"N/A",1.2960389808647321E-3,"N/A"]
[null,"BWF2","BOWRAL","Rural short",139.5,29892.595069585001,3615.14,40,0.23074207087910001,0.71580237293335136,4,9.7068477424339994E-2,9.7068477423880917E-2,1.6342838117020171E-3,1.6342838117020171E-3,8,0.30112344148197073,"N/A",6.7294331698745707E-4,"N/A"]
[null,"BWG2","BOWRAL","Urban",446,3258.38,1030.7143355959499,137,1.2260715899449999,5.7765415904982107E-3,4,9.8918228155500013E-2,9.8918228156011284E-2,1.6370252982306089E-3,1.6370252982306089E-3,2,4.6604559120870715E-4,"N/A",2.389977390813883E-6,"N/A"]
[null,"BWH2","BOWRAL","Rural short",1120.5,147411.962942671,1593.52,124,5.4421973920008995,5.3973634758398665,24,2.2894213121948797,1.3400573515561296,2.8350380743447322E-2,1.9087244974909968E-2,30,2.2705605991687903,"N/A",5.9692564599442954E-3,"N/A"]
[null,"BWK2","BOWRAL","Urban",1247,171.71,18498.183051461499,109,0.11315718984460001,0.51722264702614751,3,9.1294087672190005E-3,7.5078091076183516E-3,1.5039517989144842E-3,1.5015618215236703E-3,2,4.1729005243610395E-2,"N/A",8.9624152155520613E-5,"N/A"]
[null,"BYB2","BERRY","Rural short",756,38278.4189958485,2956.9,124.032,1.2978555905814002,1.6995474057951967,8,0.54598134451780012,0.53339481210550255,4.0812765983961521E-3,3.9566574656206971E-3,7,0.71496488855934048,"N/A",1.476736723389142E-3,"N/A"]
[null,"BYC2","BERRY","Rural short",409,52268.250671902002,235.48,54.72,1.4512005523524003,2.0853759491051655,13,0.6104904385934401,0.3385652599243561,3.1653259724965582E-3,2.6107708316457836E-3,10,0.87727507804273186,"N/A",2.5546922218968276E-3,"N/A"]
[null,"BYD2","BERRY","Rural short",955.5,17263.8788831282,1356.54,129.40799999999999,6.0582680571348,1.2740680885422437,9,2.5485896607659,2.548589660728009,3.3973016559042064E-2,3.3973016559042064E-2,5,0.53597442815395446,"N/A",1.9939061244072802E-3,"N/A"]
[null,"BYE2","BERRY","Rural short",211,27782.210205552401,430.38,71.52,0.62242976219400004,1.5455211083603482,5,0.26184349083309999,0.25980596801026862,3.0656306662761937E-3,3.0593997096374208E-3,10,0.6501691704727427,"N/A",1.4144271570014145E-3,"N/A"]
[null,"BYF2","BERRY","Urban",471.5,2798.48,707.37,82.272000000000006,3.8618106046,0,1,0.31156701258000002,0,5.616446868412625E-4,0,0,0,"N/A",0,"N/A"]
[null,"BYG2","BERRY","Rural short",623.5,27729.534385727002,1787.92,80.543999999999997,1.0881967541300999,1.7181508320456215E-2,5,0.45778215329525002,0.45778215329399524,4.4862887799163803E-3,4.4862887799163803E-3,1,7.2279097009763909E-3,"N/A",2.4923826555091002E-5,"N/A"]
[null,"C808","CRANEBROOK","Urban",390.5,0,4518.59984484708,150.24,0.14907920796599999,0,2,1.2027561219299999E-2,1.2027561219270864E-2,5.6164468684126245E-5,5.6164468684126245E-5,0,0,"N/A",0,"N/A"]
[null,"C811","CRANEBROOK","Urban",735,0,6323.9147548476603,203.232,1.2619521629000001E-2,8.8869870623049397E-3,2,1.0181303684899999E-3,1.0181303684867141E-3,2.389977390813883E-5,2.389977390813883E-5,1,7.169932172441649E-4,"N/A",2.389977390813883E-6,"N/A"]
[null,"C812","CRANEBROOK","Urban",490.5,3556.7699661577799,8828.0230524540093,122,1.62902916345,0.27105310540030064,4,0.13142844168699999,0.13142844168694165,9.500160128485184E-4,9.500160128485184E-4,2,2.1868293125947028E-2,"N/A",7.1699321724416482E-5,"N/A"]
[null,"C820","CASTLE HILL","Urban",531,187.40457465153199,1423.97,84.768000000000001,0.28066895603800002,0.5474384030379843,2,2.2644090326899999E-2,2.2644090326509193E-2,1.302221505562302E-3,1.302221505562302E-3,1,4.4166782182240558E-2,"N/A",9.2014129546334492E-5,"N/A"]
[null,"C821","CASTLE HILL","Urban",536.5,0,3146.27426500201,117.12,0.276198447357,0.3498510573527378,2,2.2283414162700001E-2,2.2283414162479434E-2,1.2772759847646826E-3,1.2772759847646826E-3,3,2.8225632985511957E-2,"N/A",1.5295855301208851E-4,"N/A"]
[null,"C824","CASTLE HILL","Urban",772,279.07541298004003,5398.6843585965098,239.71199999999999,0.41227746487199995,0,3,3.32621330341E-2,3.3262133033692076E-2,1.8373948674543371E-3,1.8373948674543371E-3,0,0,"N/A",0,"N/A"]
[null,"C826","CASTLE HILL","Urban",511.5,2872.8493440027701,714.41891283404595,118.752,0.58344307514399996,0,6,4.70716030747E-2,4.7071603074976452E-2,1.403036801185369E-3,1.403036801185369E-3,0,0,"N/A",0,"N/A"]
[null,"C827","CASTLE HILL","Urban",355,0,2292.87,202.56,0.42916396330799994,0,3,3.4624518818499997E-2,3.4624518818457579E-2,1.2674040028466901E-3,1.2674040028466901E-3,0,0,"N/A",0,"N/A"]
[null,"C830","CASTLE HILL","Urban",7,609.41068351240597,567.83000000000004,136.32,4.2504684158200003E-3,0,2,3.4292353560400003E-4,3.4292353560404053E-4,2.1394995112474727E-5,2.1394995112474727E-5,0,0,"N/A",0,"N/A"]
[null,"C832","CASTLE HILL","Urban",1061.5,7251.3389461528204,7348.2978270335298,297.40800000000002,0.61508676050199995,0.92424665447971366,3,4.9624583923499992E-2,4.9624583923195714E-2,2.5619170641024464E-3,2.5619170641024464E-3,3,7.4567294593393146E-2,"N/A",1.5534853040290238E-4,"N/A"]
[null,"C833","CASTLE HILL","Urban",1029,2708.4372625063602,3511.2,186.52799999999999,1.9683997384149998,1.9995720890186114E-2,4,0.15880851984739999,0.15880851984823122,3.9376360559256664E-3,3.9376360559256664E-3,1,1.6132347387993709E-3,"N/A",7.1699321724416489E-6,"N/A"]
[null,"C847","EMU PLAINS","Rural short",2,2336.9194186321201,326.258821589744,4.032,3.2289386325999999E-3,0,1,1.3583485472999999E-3,1.3583485472524596E-3,1.2461913277545501E-5,1.2461913277545501E-5,0,0,"N/A",0,"N/A"]
[null,"C848","EMU PLAINS","Urban",73,3275.4168433187601,949.01158456332405,70,0,4.0732024035564302E-3,0,0,0,0,0,1,3.286218912369089E-4,"N/A",1.1949886954069415E-6,"N/A"]
[null,"C849","EMU PLAINS","Urban",3,0,2208.0377049894701,274.56,0,5.5543669139405871E-3,0,0,0,0,0,1,4.4812076077760306E-4,"N/A",3.5849660862208244E-6,"N/A"]
[null,"C851","EMU PLAINS","Urban",862,4962.8885062990103,1353.14540039336,220,0.27163075955900001,0.9378733679752479,5,2.19148976849E-2,2.1914897685067901E-2,1.9836812343755229E-4,1.9836812343755229E-4,4,7.5666684193167535E-2,"N/A",2.1987791995487722E-4,"N/A"]
[null,"C852","EMU PLAINS","Urban",845.5,7510.7201230446099,2632.9241106245599,230,1.5802099811907,0.63445681802305343,8,0.12748975894681,0.12748975894688039,1.2559331188726954E-3,1.2559331188726954E-3,7,5.1187340767756336E-2,"N/A",1.2069385823610109E-4,"N/A"]
[null,"C854","EMU PLAINS","Urban",960.5,4748.93363077913,1295.59020710351,238,0.378407909115,1.5659759902487533,3,3.0529571190599999E-2,3.0529571190256538E-2,1.6132347387993708E-4,1.6132347387993708E-4,5,0.12634137481059429,"N/A",3.1906198167365338E-4,"N/A"]
[null,"C855","EMU PLAINS","Urban",756,17326.907396103321,559.59,190,1.1477618642630001,1.5820170018962139,5,9.2600277903459996E-2,9.2600277903052267E-2,1.229602823313327E-3,1.229602823313327E-3,9,0.12763554756772,"N/A",3.0591710602417702E-4,"N/A"]
[null,"C857","EMU PLAINS","Urban",400.5,5035.6679080336298,2289.5677777901601,203,3.6170037343999997E-2,0.78535785834099137,1,2.9181623942000001E-3,2.9181623941837509E-3,2.6289751298952713E-5,2.6289751298952713E-5,2,6.3361885596562251E-2,"N/A",2.1748794256406335E-4,"N/A"]
[null,"C869","EMU PLAINS","Urban",821,4347.9766615620701,2634.9044798211298,222.24,1.340128025731,0.97749451862802417,7,0.10812018718344998,0.10812018718302926,1.3849918979766454E-3,1.3849918979766454E-3,3,7.8863278953381105E-2,"N/A",1.5295855301208851E-4,"N/A"]
[null,"C889","CAMBRIDGE PARK","Urban",712,185.77,3992.5576234105802,191.232,0.2991063612305,0.14663528652803151,8,2.4131601715109998E-2,2.4131601715047777E-2,1.5893349648912322E-4,1.5893349648912322E-4,1,1.183038808452872E-2,"N/A",6.5724378247381776E-5,"N/A"]
[null,"C890","CAMBRIDGE PARK","Urban",929,0,5589.1992789255501,216.768,1.6292809614000001E-3,0,1,1.3144875649E-4,1.3144875649476355E-4,1.1949886954069415E-6,1.1949886954069415E-6,0,0,"N/A",0,"N/A"]
[null,"C891","CAMBRIDGE PARK","Urban",850.5,9098.6380046510003,887.5,170.88,5.4610535497999997E-2,2.5912973109170818,3,4.4059233199640006E-3,4.4059233199653935E-3,9.2014129546334492E-5,9.2014129546334492E-5,4,0.20906327226144442,"N/A",5.3774491293312368E-4,"N/A"]
[null,"C893","CAMBRIDGE PARK","Urban",147.5,180.18,2513.40903548904,31.391999999999999,3.1993153424000002E-3,0.33770550836758773,1,2.5811755821000002E-4,2.5811755820789937E-4,1.1949886954069415E-6,1.1949886954069415E-6,1,2.7245742255278264E-2,"N/A",1.1352392606365944E-4,"N/A"]
[null,"C896","CAMBRIDGE PARK","Urban",702.5,1773.95,4979.6063943102899,155.232,0.26923394400370004,0,7,2.1721525006319999E-2,2.1721525006172596E-2,8.5577873669690776E-5,8.5577873669690776E-5,0,0,"N/A",0,"N/A"]
[null,"C899","CAMBRIDGE PARK","Urban",627,119.93,10752.483291123601,178.27199999999999,1.851455638E-3,4.9767127548907664E-2,1,1.4937358693E-4,1.4937358692586767E-4,1.1949886954069415E-6,1.1949886954069415E-6,1,4.0151620165673231E-3,"N/A",8.3649208678485904E-6,"N/A"]
[null,"C900","CAMBRIDGE PARK","Urban",1199,2721.81,6564.25,226.75200000000001,0.1173674758073,0.64312163040880077,2,9.4690904223780001E-3,9.4690904224046038E-3,3.9434626948429067E-5,3.9434626948429067E-5,3,5.18864091545694E-2,"N/A",1.2547381301772885E-4,"N/A"]
[null,"CA1210","CASULA","Urban",1187.5,4074.0630222332902,4724.1568633389197,210,2.1386238132587003,0.80279116462821287,8,0.17254202775750996,0.17254202775241748,2.4102921986358006E-3,2.4102921986358006E-3,4,6.4768387291056231E-2,"N/A",1.6968839474778568E-4,"N/A"]
[null,"CA1213","CASULA","Urban",674,2896.1261067396899,3794.9,147.072,0.16492766823060001,6.5763704261056558E-2,3,1.330619912353E-2,1.3306199123356293E-2,9.4404106937148372E-5,9.4404106937148372E-5,1,5.3057498076068202E-3,"N/A",2.389977390813883E-5,"N/A"]
[null,"CA1221","CASULA","Urban",586.5,182.33,4084.31,126.91200000000001,0.258937179706,1.3765942959510351,2,2.0890792372900001E-2,2.089079237310415E-2,1.0754898258662473E-4,1.0754898258662473E-4,3,0.11106224935112113,"N/A",2.7006744516196878E-4,"N/A"]
[null,"CA1236","CASULA","Urban",643.5,860.53,4463.07,139.488,0.31630268119580002,0,2,2.5518983590700001E-2,2.5518983590415233E-2,1.0993895997743862E-4,1.0993895997743862E-4,0,0,"N/A",0,"N/A"]
[null,"CA1238","CASULA","Urban",585.5,516.32000000000005,5583.5,79.391999999999996,2.640916322E-2,0,2,2.1306648439500002E-3,2.1306648439105768E-3,1.3144875649476356E-5,1.3144875649476356E-5,0,0,"N/A",0,"N/A"]
[null,"CA1251","CASULA","Urban",90.5,0,3615.17,190,2.9860276529000002E-2,4.4286818860486285E-2,1,2.4090972099E-3,2.4090972099403939E-3,2.1509796517324947E-5,2.1509796517324947E-5,2,3.573016199266755E-3,"N/A",7.1699321724416489E-6,"N/A"]
[null,"CA1254","CASULA","Urban",696.5,390.952907575849,4378.6206875538501,154.56,0,0.42302058416571514,0,0,0,0,0,2,3.4128877140822245E-2,"N/A",6.8114355638195656E-5,"N/A"]
[null,"CA1265","CASULA","Urban",710,256.10000000000002,4603.7388057838698,188.73599999999999,9.3994699828999995E-2,0,1,7.5833982611E-3,7.5833982610524504E-3,8.3051714330782428E-4,8.3051714330782428E-4,0,0,"N/A",0,"N/A"]
[null,"CA1269","CASULA","Urban",536.5,344.34,2973.7656169042998,190.75200000000001,8.1982455650000008E-2,0,2,6.6142624290999995E-3,6.6142624290774204E-3,4.7799547816277659E-5,4.7799547816277659E-5,0,0,"N/A",0,"N/A"]
[null,"CA1276","CASULA","Urban",826,1040.55,3392.09,173.28,0,0.13460823070371214,0,0,0,0,0,1,1.0860057263858284E-2,"N/A",3.8239638253022127E-5,"N/A"]
[null,"CA1280","CASULA","Urban",312.5,0,4553.3100000000004,56.832000000000001,0,-0.95668415725712674,0,0,0,0,0,4,-7.718431983633435E-2,"N/A",2.1629295386865641E-4,"N/A"]
[null,"CA1284","CASULA","Urban",1386.5,3754.0258187927202,5375.2501109778505,215,2.5689465384128005,0,13,0.20726003431992002,0.20726003432007536,3.2228845115125208E-3,3.2228845115125208E-3,0,0,"N/A",0,"N/A"]
[null,"CD1230","CAWDOR","Rural short",260,33691.767271558601,5715.83,129,1.9972022258031001,0.44205354812415154,8,0.84018219317269993,0.84018219317211773,6.6546616902092978E-3,6.6546616902092978E-3,9,0.18596290088417275,"N/A",5.3586227093445652E-4,"N/A"]
[null,"CD1234","CAWDOR","Rural short",496.5,65501.625631562303,1167.01,139,4.1894100265582992,1.3563467770940838,18,1.7623992496663998,1.7623992496781449,1.3452486689817012E-2,1.3452486689817012E-2,22,0.57058739228233712,"N/A",1.576432029609506E-3,"N/A"]
[null,"CD1241","CAWDOR","Urban",742,2396.23159197419,4535.4399999999996,254,3.2704112389599999E-2,0.39436005088978171,2,2.6385350394899998E-3,2.6385350394585267E-3,1.3144875649476356E-5,1.3144875649476356E-5,3,3.1816574015209813E-2,"N/A",9.6794084327962252E-5,"N/A"]
[null,"CD1260","CAWDOR","Urban",1343,7941.3159502250101,2422.9184234701002,220,2.1022760362040001,-0.62653258789249822,9,0.16960952549412001,0.16925461385135296,3.8036490174802942E-3,3.8024540287848875E-3,3,-5.054802181571362E-2,"N/A",1.5534853040290238E-4,"N/A"]
[null,"CD1267","CAWDOR","Urban",1136,5655.7246642160999,8487.57,291,9.25875935442E-2,4.2953770801140538E-2,2,7.4698743349999996E-3,7.4698743349887907E-3,8.0064242592265081E-5,8.0064242592265081E-5,2,3.4654672166801303E-3,"N/A",1.4339864344883298E-5,"N/A"]
[null,"CD1271","CAWDOR","Rural short",734.5,15759.2775090695,5235.22,247,0.11018382792689999,0.14774615991081963,5,4.6352086435400001E-2,4.635208643583049E-2,2.6793113546722826E-4,2.6793113546722826E-4,1,6.2153792471758187E-2,"N/A",2.1808348235704628E-4,"N/A"]
[null,"CJ1204","CHERITON AVE","Urban",1025,5625.7736374483502,3979.9523847249902,239,27.857297761815001,0.32570807583347605,13,2.2474988886625296,0.110832811521603,7.624027876696287E-3,1.469836095350538E-3,2,2.6277801411998643E-2,"N/A",7.8869253896858134E-5,"N/A"]
[null,"CJ1241","CHERITON AVE","Urban",1243,4267.1563546601201,7292.6858784815704,211.2,1.4728848007597,0.46523377271166361,4,0.11883087085697,0.11883087085996168,1.6204046709718126E-3,1.6204046709718126E-3,2,3.7534594922732034E-2,"N/A",6.9309344333602603E-5,"N/A"]
[null,"CJ1245","CHERITON AVE","Urban",1138,35.066892486047003,11693.9559524251,334.17599999999999,0.60270065092240011,0,8,4.8625285004770001E-2,4.8625285004803856E-2,2.5811755820789937E-4,2.5811755820789937E-4,0,0,"N/A",0,"N/A"]
[null,"CJ1249","CHERITON AVE","Urban",687,328.8,5061.25,240,0.47837170191799999,3.3942365919963331,3,3.8594549896029999E-2,3.8594549895557988E-2,9.2014129546334492E-5,9.2014129546334492E-5,4,0.27384360943945468,"N/A",4.9233534250765992E-4,"N/A"]
[null,"CJ1253","CHERITON AVE","Urban",243.5,903.30723217007301,5679.2794217998398,127.392,0.42321313554999995,0,2,3.41444119942E-2,3.414441199386254E-2,5.8076450596777354E-4,5.8076450596777354E-4,0,0,"N/A",0,"N/A"]
[null,"CJ1267","CHERITON AVE","Urban",1309,1890.87623582482,3538.3875926108299,253.63200000000001,0.15771439707000001,1.7296298570010988,1,1.2724239629E-2,1.2724239628693113E-2,7.2894310419823429E-5,7.2894310419823429E-5,7,0.1395448049061456,"N/A",5.6881461901370418E-4,"N/A"]
[null,"CJ1275","CHERITON AVE","Urban",1203,7220.2944322185904,733.75,278.88,1.9016967381279999,1.626318632401804,5,0.1534269885791,0.15342698858068807,2.3732475490781859E-3,2.3732475490781859E-3,3,0.13120975875568217,"N/A",4.4931574947301001E-4,"N/A"]
[null,"CJ1282","CHERITON AVE","Urban",0,0,1338.63,13.247999999999999,1.3922946398E-3,0,1,1.1232893737000001E-4,1.123289373682525E-4,1.1949886954069415E-6,1.1949886954069415E-6,0,0,"N/A",0,"N/A"]
[null,"CJ1286","CHERITON AVE","Urban",280.5,0,3555.3018389053,173.376,0,0.18366439928763542,0,0,0,0,0,2,1.4817859823046073E-2,"N/A",7.5284287810637308E-5,"N/A"]
[null,"CLA2","CULBURRA","Rural short",1325,48491.1217047178,2132.81,140.4,4.1560735579361996,2.3561624448935969,17,1.7483752780113202,1.7483752780564397,8.2996342428453048E-3,8.2996342428453048E-3,16,0.99118942731277537,"N/A",2.4799207422315549E-3,"N/A"]
[null,"CLB2","CULBURRA","Rural short",2119,26716.902484970102,899.75,169.2,0.42453137196859997,9.0878329699130305,5,0.17859167917697003,2.9160877069456474E-3,4.5485983463041074E-4,2.4923826555091002E-5,10,3.823065755285409,"N/A",1.1764046134002953E-2,"N/A"]
[null,"CLC2","CULBURRA","Rural short",2350,18516.773983052,510.23,202.4,0.49975971744770004,0.40598719229629732,5,0.21023870794382998,0.21023870794883137,1.2898080242259597E-3,1.2898080242259597E-3,4,0.17079052146876109,"N/A",4.1747409479777432E-4,"N/A"]
[null,"CLD2","CULBURRA","Urban",948.5,8963.2853107218398,1989.5932110988499,145.024,0.16980069946796,2.4789657944495476,3,1.3699350404092E-2,1.3699350404145178E-2,1.959781460467384E-4,1.959781460467384E-4,5,0.20000047799547815,"N/A",6.0227430248509847E-4,"N/A"]
[null,"CN1206","CHIPPING NORTON","Urban",297.5,3166.7886298366102,566.47,101.28,0,0.34214900189874015,0,0,0,0,0,1,2.7604238863900347E-2,"N/A",7.8869253896858134E-5,"N/A"]
[null,"CN1213","CHIPPING NORTON","Urban",243,2817.7220217101199,1031.05717544339,140.256,2.0436959797809999,0.10664384474765927,4,0.16488334520360001,0.16488334520355438,4.2541597556487113E-4,4.2541597556487113E-4,1,8.6039186069299788E-3,"N/A",1.7924830431104121E-5,"N/A"]
[null,"CN1217","CHIPPING NORTON","Urban",683,0,5760.66,188.44800000000001,0.10726593383999999,0.28438358599375807,1,8.6541081321E-3,8.6541081321370693E-3,2.1509796517324947E-5,2.1509796517324947E-5,1,2.2943782951813277E-2,"N/A",4.7799547816277659E-5,"N/A"]
[null,"CN1221","CHIPPING NORTON","Urban",520,0,5668.1435994661697,148.512,8.1464048070999996E-4,0.63719697236726414,1,6.5724378247000002E-5,6.5724378247381776E-5,1.1949886954069415E-6,1.1949886954069415E-6,2,5.1408413676406618E-2,"N/A",1.0635399389121778E-4,"N/A"]
[null,"CN1239","CHIPPING NORTON","Urban",338,2191.4425802750402,960.72,94.272000000000006,0.25504171704,0.62268156016549947,1,2.0576510345999999E-2,2.0576510346212124E-2,4.0271119035213926E-4,4.0271119035213926E-4,3,5.0237324754907817E-2,"N/A",1.1949886954069414E-4,"N/A"]
[null,"CN1243","CHIPPING NORTON","Urban",204,1846.20885513083,1337.5643721901499,103.872,4.5856853241299997E-2,7.7316787442052975E-2,3,3.6996850009600002E-3,3.6996850009798905E-3,4.3019593034649893E-5,4.3019593034649893E-5,2,6.2378409900242342E-3,"N/A",1.4339864344883298E-5,"N/A"]
[null,"CN1247","CHIPPING NORTON","Urban",450.5,60.56,6940.15,132.57599999999999,0,5.1840757863445483E-3,0,0,0,0,0,1,4.1824604339242951E-4,"N/A",1.1949886954069415E-6,"N/A"]
[null,"CN1258","CHIPPING NORTON","Urban",864.5,0,4115.8551595046802,209.08799999999999,0.44529729840490001,0,2,3.592614013842E-2,3.5926140138714285E-2,6.811435563819567E-5,6.811435563819567E-5,0,0,"N/A",0,"N/A"]
[null,"CN1261","CHIPPING NORTON","Urban",228.5,1139.03772752071,599.59929100744296,116.06399999999999,0,1.1339795491501103,0,0,0,0,0,1,9.1488334520355444E-2,"N/A",1.3861868866720521E-4,"N/A"]
[null,"CR1210","CORRIMAL","Urban",1610,6411.2839124684997,2008.0259706224299,223.68,0.2052894011434,3.8139245560136841,2,1.6562543318328002E-2,1.6562543318340207E-2,2.1509796517324946E-4,2.1509796517324946E-4,5,0.30770361412381037,"N/A",7.4925791202015224E-4,"N/A"]
[null,"CR1214","CORRIMAL","Urban",1198,5680.2643757085398,796.66703503229496,150.43199999999999,0.31692477028897004,1.4436910482714373,4,2.5569173115877E-2,2.5429359438259712E-2,1.4566912197010618E-3,1.4554962310056548E-3,5,0.11647554814131458,"N/A",3.3340184601853668E-4,"N/A"]
[null,"CR1228","CORRIMAL","Urban",1549.5,5043.8297117618504,1541.15941232413,216,0.35952306161000003,3.7906702732006528,1,2.9005960604E-2,2.9005960603612688E-2,6.2497908769783034E-4,6.2497908769783034E-4,6,0.30582748187202147,"N/A",6.7755859029573577E-4,"N/A"]
[null,"CR1254","CORRIMAL","Urban",1338,5788.5118079745598,1555.2,135.45599999999999,0.22958049911,4.2417589248381473,1,1.8522324779E-2,1.8522324778807591E-2,1.6036748292361153E-3,1.6036748292361153E-3,6,0.34222086259063988,"N/A",9.6077091110718092E-4,"N/A"]
[null,"CR1262","CORRIMAL","Urban",2010,8251.1777610820409,434.89328726686603,177.696,5.5543669139599995E-3,0.58165330322785824,3,4.4812076078199999E-4,4.4812076077760306E-4,5.9749434770347074E-6,5.9749434770347074E-6,1,4.6927206068630593E-2,"N/A",1.4220365475342604E-4,"N/A"]
[null,"CR1280","CORRIMAL","Urban",2125,7495.1940289086797,921.52,187.584,3.0177393851110001,2.4222223820567303,5,0.24346819178858001,0.24346819179090562,5.1707160850258359E-3,5.1707160850258359E-3,4,0.19542247630337417,"N/A",4.839704216398113E-4,"N/A"]
[null,"CS1213","CLAREMONT MEADOWS","Urban",1655.5,2834.1084210551198,3854.44,252.96,2.5363016726190004,2.8362078627091023,4,0.20462627923089999,0.20462627923539844,2.2764534647502234E-3,2.2764534647502234E-3,5,0.22882241033999817,"N/A",5.8673944944480827E-4,"N/A"]
[null,"CS1239","CLAREMONT MEADOWS","Urban",726.5,9826.4454347320407,5894.04,217,0.12892055898499999,1.3884436120341084,2,1.0401181604899999E-2,1.0401181604822018E-2,4.7799547816277659E-5,4.7799547816277659E-5,6,0.1120182403074467,"N/A",3.0113715124254923E-4,"N/A"]
[null,"CS1243","CLAREMONT MEADOWS","Urban",741,4618.2691341788704,3253.20117559867,204,9.6275693175000001E-4,3.3326201483643522E-3,1,7.7674265200999997E-5,7.7674265201451188E-5,1.1949886954069415E-6,1.1949886954069415E-6,1,2.6887245646656184E-4,"N/A",5.9749434770347074E-6,"N/A"]
[null,"CS1247","CLAREMONT MEADOWS","Urban",1089.5,4323.5869886746596,9355.6428795457396,264.096,0.2782663765658,0.66517616996842088,2,2.2450252620700002E-2,2.2450252620610209E-2,1.2487631867002537E-3,1.2487631867002537E-3,8,5.3665747322030333E-2,"N/A",1.3981367736261215E-4,"N/A"]
[null,"CS1250","CLAREMONT MEADOWS","Urban",1208.5,3863.8352879225799,3838.12,220,0.79360794466099993,0.55988018492521119,3,6.4027494299800009E-2,6.2955589440123902E-2,1.4507162762240271E-3,1.4495212875286201E-3,1,4.5170572686382388E-2,"N/A",1.6132347387993711E-4,"N/A"]
[null,"CS1276","CLAREMONT MEADOWS","Urban",1215.5,6818.6114699503196,6190.5665124645902,188.256,1.851455638E-3,1.021070378523526,1,1.4937358693E-4,1.4937358692586767E-4,1.1949886954069415E-6,1.1949886954069415E-6,6,8.2378935695268329E-2,"N/A",2.103180103916217E-4,"N/A"]
[null,"CS1280","CLAREMONT MEADOWS","Urban",955.5,3390.7162714514102,4843.1303530136702,89.664000000000001,1.1832134575,2.7594391061358916,1,9.5460476944000006E-2,9.5460476943888109E-2,1.6132347387993709E-3,1.6132347387993709E-3,3,0.22262878393170402,"N/A",6.3453899726108591E-4,"N/A"]
[null,"CS1284","CLAREMONT MEADOWS","Urban",1145,6276.3296173565795,2096.86,195,0.74237446424500009,0.19136645474163302,2,5.9894028402600004E-2,4.4895725286438794E-3,1.063539938912178E-4,2.6289751298952713E-5,1,1.5439253944657684E-2,"N/A",4.5409570425463773E-5,"N/A"]
[null,"CT1202","CAMPBELLTOWN","Urban",292.5,818.25738729247701,4611.9483389642601,193,0,0.1940325508603245,0,0,0,0,0,4,1.5654351909830933E-2,"N/A",3.7044649557615188E-5,"N/A"]
[null,"CT1203","CAMPBELLTOWN","Urban",404.5,0,3764.1076662093901,174,7.7316787441999999E-3,0,1,6.2378409899999999E-4,6.237840990024234E-4,2.389977390813883E-6,2.389977390813883E-6,0,0,"N/A",0,"N/A"]
[null,"CT1206","CAMPBELLTOWN","Urban",1867.5,0,16099.5700017992,208,4.6567812206839997E-2,0.77827789198135511,6,3.7570444583309996E-3,3.7570444583594239E-3,8.1259231287672014E-5,8.1259231287672014E-5,3,6.2790681000157736E-2,"N/A",2.5214261473086464E-4,"N/A"]
[null,"CT1225","CAMPBELLTOWN","Urban",1184.5,6073.5460882430598,10957.125829446501,181,0.19540000750800002,0.29412964847208584,5,1.5764676942979998E-2,1.5764676943062945E-2,1.0089994292238069E-4,1.0089994292238069E-4,5,2.3730085513391043E-2,"N/A",5.7359457379533191E-5,"N/A"]
[null,"CT1228","CAMPBELLTOWN","Urban",473,237.2,4608.55764385571,217,0,0.75672694835526555,0,0,0,0,0,4,6.1051972448340638E-2,"N/A",1.6968839474778568E-4,"N/A"]
[null,"CT1233","CAMPBELLTOWN","Urban",823,0,7989.5460427512999,166,0.1037851972428,0.2035120037267831,4,8.3732857886899999E-3,8.3732857887164388E-3,2.9874717385173535E-5,2.9874717385173535E-5,2,1.6419144674891376E-2,"N/A",4.7799547816277659E-5,"N/A"]
[null,"CT1236","CAMPBELLTOWN","Urban",193,101.36,7182.45,46,0,0.45234764147132139,0,0,0,0,0,3,3.6494954757727995E-2,"N/A",8.0064242592265081E-5,"N/A"]
[null,"CT1262","CAMPBELLTOWN","Urban",396,3934.92,6998.34,148,1.5478169134E-2,3.8065927916872827E-2,1,1.2487631867E-3,1.2487631867002537E-3,1.1949886954069415E-6,1.1949886954069415E-6,5,3.0711209471958397E-3,"N/A",5.9749434770347074E-6,"N/A"]
[null,"CT1265","CAMPBELLTOWN","Urban",1087.5,1161.8335653617601,5946.4340234167603,203,6.8726033281599999E-2,0.50759507770865042,2,5.544747546719E-3,5.5447475466882086E-3,2.6289751298952709E-5,2.6289751298952709E-5,5,4.0952262591595887E-2,"N/A",1.0276902780499697E-4,"N/A"]
[null,"CT1266","CAMPBELLTOWN","Urban",187.5,2543.9001259792099,3363.3627850438202,30,0,2.5476029578607493E-2,0,0,0,0,0,2,2.0553805560999394E-3,"N/A",4.7799547816277659E-6,"N/A"]
[null,"CT1270","CAMPBELLTOWN","Urban",78,0,2152.8819883849801,194,0,4.8878428842677171E-3,0,0,0,0,0,1,3.9434626948429069E-4,"N/A",1.1949886954069415E-6,"N/A"]
[null,"CT1273","CAMPBELLTOWN","Urban",263.5,968.18,1727.91825480274,127,0.56297581875199998,0,3,4.5420325324000005E-2,4.5420325323722442E-2,1.8163828170185509E-4,1.8163828170185509E-4,0,0,"N/A",0,"N/A"]
[null,"CT1280","CAMPBELLTOWN","Urban",3,34.32,1890.14572584387,165,1.5996576712000001E-3,0,1,1.2905877909999999E-4,1.2905877910394969E-4,3.5849660862208244E-6,3.5849660862208244E-6,0,0,"N/A",0,"N/A"]
[null,"CT1296","CAMPBELLTOWN","Urban",762.5,7515.9400487581197,6497.5239218640199,285,0,0.49589387807661561,0,0,0,0,0,2,4.0008221522224399E-2,"N/A",8.3649208678485907E-5,"N/A"]
[null,"CV1210","CANLEY VALE","Urban",1934.5,1418.25653577915,2542.5955369530998,168.96,0.28872339801000002,0,1,2.329391464E-2,2.3293914639567509E-2,1.2069385823610109E-4,1.2069385823610109E-4,0,0,"N/A",0,"N/A"]
[null,"CV1213","CANLEY VALE","Urban",1111.5,1647.1368595235699,1737.37060819569,153.696,0.67354474944999998,3.0704540300263568,1,5.4340915934999998E-2,5.4340915934935258E-2,7.8869253896858134E-5,7.8869253896858134E-5,2,0.24772115655785895,"N/A",5.0189525207091539E-4,"N/A"]
[null,"CV1221","CANLEY VALE","Urban",1418,4343.7635024110004,2333.4617522332201,240,0.26449154662300001,2.341128625113198,3,2.13389131339E-2,2.1338913133881754E-2,1.5654351909830932E-4,1.5654351909830932E-4,4,0.18887991319602115,"N/A",5.0906518424335707E-4,"N/A"]
[null,"CV1236","CANLEY VALE","Urban",1647,5294.9849591517896,1929.8428656036599,208.8,1.7466780604960002,6.7985451026632782E-2,3,0.1409202368951,0.14092023689455896,2.1282748665197625E-3,2.1282748665197625E-3,1,5.4849981119178609E-3,"N/A",1.0754898258662473E-5,"N/A"]
[null,"CV1239","CANLEY VALE","Urban",1249.5,6224.9805118541799,339.99864441960102,190.65600000000001,1.1705495009119999,1.7602159041405316,7,9.4438761610400004E-2,9.4438761609315178E-2,7.0862829637631617E-4,7.0862829637631617E-4,3,0.14201245656216091,"N/A",3.0113715124254923E-4,"N/A"]
[null,"CV1247","CANLEY VALE","Urban",1506,3958.80645802763,1567.8213902531099,197.66399999999999,0.24932442203470001,1.9096654032382931,2,2.0115244709670001E-2,2.0115244709785044E-2,4.4214581730056833E-5,4.4214581730056833E-5,3,0.15406989249881697,"N/A",3.3459683471394363E-4,"N/A"]
[null,"CV1251","CANLEY VALE","Urban",613.5,2808.9137768800101,1646.48559357416,97.343999999999994,1.0664384475E-3,0.34081595383939445,1,8.6039186069000005E-5,8.6039186069299787E-5,1.1949886954069415E-6,1.1949886954069415E-6,1,2.7496689881313721E-2,"N/A",7.0504333029009549E-5,"N/A"]
[null,"CV1269","CANLEY VALE","Urban",789,3403.9429733718098,163.47968594862999,174.43199999999999,0.17936902221099998,0.65941444002302652,2,1.4471313101299999E-2,1.4471313101378062E-2,2.103180103916217E-4,2.103180103916217E-4,3,5.3200896719517034E-2,"N/A",1.2905877910394969E-4,"N/A"]
[null,"CV1276","CANLEY VALE","Urban",466,2708.6307366041501,259.54000000000002,92.927999999999997,0,0.51055740672941874,0,0,0,0,0,2,4.1191260330677271E-2,"N/A",1.3622871127639131E-4,"N/A"]
[null,"CV1280","CANLEY VALE","Urban",1240.5,817.24532741855899,2845.8126147140601,208.12799999999999,9.3417045670000004E-2,0.40376544553072108,1,7.5367937018999999E-3,7.5367937019315797E-3,6.3334400856567897E-5,6.3334400856567897E-5,2,3.2575391836793227E-2,"N/A",1.123289373682525E-4,"N/A"]
[null,"CV1284","CANLEY VALE","Urban",1341.5,4753.0313794423,1051.99,219.648,0.67736615388999999,0,2,5.4649223018000001E-2,5.4649223018350242E-2,5.2579502597905432E-4,5.2579502597905432E-4,0,0,"N/A",0,"N/A"]
[null,"CX1206","CATTAI","Rural short",673.5,35690.852133292698,1776.3864796821599,215.232,2.1923561424210005,8.750719927349597E-2,11,0.92227946079980005,0.92227946079769374,1.7531617959803476E-2,1.7531617959803476E-2,12,3.6812491821869409E-2,"N/A",1.4518128968340508E-3,"N/A"]
[null,"CX1210","CATTAI","Rural short",761.5,55923.846295330201,2949.47,212,3.3424319543848,0.91691489015331218,21,1.406092870156,1.4060928701600977,1.1497462641646779E-2,1.1497462641646779E-2,11,0.38572737072322716,"N/A",1.1589579348117317E-3,"N/A"]
[null,"CX1232","CATTAI","Rural short",634.5,95286.468878049098,1995.03,146.49600000000001,8.1359033507962977,3.8313726739460092,22,3.4226084030645003,3.4168136133940643,9.034887126220489E-3,9.0224252129429434E-3,11,1.6117802466212638,"N/A",3.9753503355370147E-3,"N/A"]
[null,"CX1273","CATTAI","Rural short",559.5,54309.254517593297,3961.2419509568399,162.43199999999999,2.4901031489367997,0.88936523026016678,8,1.0475355464271001,1.0475355464332472,4.5075838501136339E-3,4.5075838501136339E-3,15,0.37413779137510983,"N/A",1.5951248995258241E-3,"N/A"]
[null,"CX1284","CATTAI","Rural short",184.5,20458.9676026241,178.69694925175301,74.784000000000006,0.60666799415289996,0.60438917846225504,4,0.25521283686980001,0.25521283687297952,2.2316288552629775E-3,2.2316288552629775E-3,7,0.25425418564512209,"N/A",7.6640766656904831E-4,"N/A"]
[null,"D810","WISEMANS","Rural short",209,28741.270158536001,692.07995445987501,64,1.1019873982969,6.6652402967287042E-2,6,0.4635835956805,0.4635835956879531,2.0909992303453817E-3,2.0909992303453817E-3,1,2.8039304874477377E-2,"N/A",5.6078609748954758E-5,"N/A"]
[null,"D813","WISEMANS","Rural short",301.5,36032.113701218797,893.56630033279203,248.2,1.7587347396372,0.92920855558950066,13,0.73986379129275004,0.60351799811825102,3.8507312027615602E-3,3.632647720404514E-3,8,0.39089906473340852,"N/A",8.4117914623432137E-4,"N/A"]
[null,"D814","WISEMANS","Rural short",347,68782.467521241095,829.53125710514701,77.040000000000006,5.5402810394329993,0.87514605096047893,6,2.3306830997296006,2.3306830997763091,4.1498171214226533E-3,4.1498171214226533E-3,9,0.36815607300188796,"N/A",7.7886957984659388E-4,"N/A"]
[null,"D818","LIVERPOOL 11kV","Urban",0,0,0,0,0,1.9329196860513244E-2,0,0,0,0,0,1,1.5594602475060585E-3,"N/A",3.5849660862208244E-6,"N/A"]
[null,"D819","LIVERPOOL 11kV","Urban",0,0,0,0,3.2289386325999999E-3,0,1,2.605075356E-4,2.6050753559871321E-4,1.1949886954069415E-6,1.1949886954069415E-6,0,0,"N/A",0,"N/A"]
[null,"D820","LIVERPOOL 11kV","Urban",0,0,0,0,0,2.6604676935520222,0,0,0,0,0,7,0.21464386946899483,"N/A",6.0466427987591236E-4,"N/A"]
[null,"D823","LIVERPOOL 11kV","Urban",0,0,0,0,0.113427578205,1.1382749262302243,4,9.1512234292999983E-3,9.1512234294263573E-3,1.6012848518453013E-4,1.6012848518453013E-4,3,9.183488124202345E-2,"N/A",1.8522324778807593E-4,"N/A"]
[null,"D826","LIVERPOOL 11kV","Urban",0,0,0,0,0,1.647054935547182E-2,0,0,0,0,0,1,1.3288274292925189E-3,"N/A",4.7799547816277659E-6,"N/A"]
[null,"D827","LIVERPOOL 11kV","Urban",0,0,0,0,4.3857281152000001E-2,9.3313364154201869E-3,1,3.5383615271000002E-3,3.5383615270999538E-3,5.6164468684126251E-5,5.6164468684126251E-5,1,7.5284287810637308E-4,"N/A",1.1949886954069415E-6,"N/A"]
[null,"D828","LIVERPOOL 11kV","Urban",0,0,0,0,1.1170794620916,0.15167124586333763,6,9.0124852418530008E-2,9.0124852418896131E-2,1.5857499988050114E-3,1.5857499988050114E-3,2,1.2236684240967081E-2,"N/A",3.7044649557615188E-5,"N/A"]
[null,"D830","LIVERPOOL 11kV","Urban",0,0,0,0,0,5.8022397947533761,0,0,0,0,0,8,0.4681188965952382,"N/A",9.3567614850363515E-4,"N/A"]
[null,"D840","CARRAMAR","Urban",667,0,2118.4512448023702,69.983999999999995,0.49909319342299996,0,3,4.0266339080399997E-2,4.0266339080432298E-2,1.8283327039726204E-4,1.8283327039726204E-4,0,0,"N/A",0,"N/A"]
[null,"D841","CARRAMAR","Urban",466.5,797.87075889276105,1392.4645481689699,110.976,0.34013461816899998,0,3,2.7441720401699999E-2,2.7441720401325004E-2,2.019530895237731E-4,2.019530895237731E-4,0,0,"N/A",0,"N/A"]
[null,"D845","CARRAMAR","Urban",1453.5,4864.1345868549997,535.01230538143602,185,2.731079735557,0.22039727914516249,4,0.22034077831670001,0.2203407783123387,1.9311017317773594E-3,1.9311017317773594E-3,1,1.7781431787655289E-2,"N/A",3.7044649557615188E-5,"N/A"]
[null,"D847","CARRAMAR","Urban",1060.5,0,3763.7909656502102,150,3.3464394132010002,0,3,0.26998738091680002,0.26998738091937652,1.3575071579822854E-3,1.3575071579822854E-3,0,0,"N/A",0,"N/A"]
[null,"D848","CARRAMAR","Urban",562.5,0,2374.1164748215901,150,0.49916716362699998,0,2,4.0272306923200003E-2,4.0272306922921296E-2,4.0381792436424812E-4,4.0381792436424812E-4,0,0,"N/A",0,"N/A"]
[null,"D850","CARRAMAR","Urban",1215,4259.6748391962001,1459.6220011324201,180,5.0875137420199996,0.75569013319799672,4,0.41045551434689997,0.41045551435435712,5.5172628066909191E-3,5.5172628066909191E-3,5,6.0968323239662156E-2,"N/A",1.8283327039726204E-4,"N/A"]
[null,"D852","CARRAMAR","Urban",1373,5671.4774945181498,1258.6509224481299,180,9.5135196502000002E-2,6.6652402967287043E-3,2,7.6754123905999998E-3,7.6754123905987846E-3,1.326437451901705E-4,1.326437451901705E-4,2,5.3774491293312368E-4,"N/A",2.389977390813883E-6,"N/A"]
[null,"DFA2","DARKES FOREST","Rural short",63,18572.942607956,160.088643007554,52.991999999999997,0.26767605031999997,0.30060233738246456,2,0.11260584837599999,0.11260584837590115,4.7978366118550187E-4,4.7978366118550187E-4,5,0.12645726498389298,"N/A",4.2370505143654705E-4,"N/A"]
[null,"DFC2","DARKES FOREST","Rural short",3,6329.7240002675899,48.33,null,0,0.13555617599035802,0,0,0,0,0,7,5.7025715158048218E-2,"N/A",8.7233392942818512E-5,"N/A"]
[null,"DP1206","DAPTO","Urban",1602.5,7792.0267960927304,3320.39,240.38399999999999,1.0368151573000001E-4,3.6806493733693175,1,8.3649208677999995E-6,8.3649208678485904E-6,1.1949886954069415E-6,1.1949886954069415E-6,8,0.29695110584253875,"N/A",8.2812716591701039E-4,"N/A"]
[null,"DP1210","DAPTO","Rural short",1876.5,31218.257193470101,3393.58,238.75200000000001,7.3125091877999995E-2,1.6035827571674071,4,3.07622329253E-2,2.1746038669316898E-3,6.4178853379359322E-4,3.7385739832636508E-5,4,0.67459452049673185,"N/A",1.8692869916318252E-3,"N/A"]
[null,"DP1221","DAPTO","Urban",939,9940.2101951236109,4171.3900000000003,164.44800000000001,2.3828234060412501,0.7933117117617543,2,0.19224380637434499,0.1922438063735917,1.0563700067397362E-3,1.0563700067397362E-3,4,6.4003594525995786E-2,"N/A",2.4736265994923685E-4,"N/A"]
[null,"DP1236","DAPTO","Urban",2288,15503.8369637214,11884.43,327,4.1242729558914002,5.5509009889862879,10,0.33274221226702,0.33274221225867207,4.2422098686946425E-3,4.2422098686946425E-3,11,0.44784113342287785,"N/A",1.3539221918960646E-3,"N/A"]
[null,"DP1243","DAPTO","Urban",1294,2907.6371731506601,6336.0355703632003,241.72800000000001,2.3880963517089002,3.3397593613044041,2,0.19266922235255998,0.19266922234915659,1.5463153718565823E-3,1.5463153718565823E-3,5,0.26944844101774795,"N/A",8.102023354859063E-4,"N/A"]
[null,"DP1258","DAPTO","Urban",1186,7087.1120493775297,991.56,163.00800000000001,2.3598209211825596,6.1833286116301158,6,0.19038798893411299,0.19023025042183103,1.6084547840177431E-3,1.6072597953223362E-3,10,0.49886476073936342,"N/A",1.3945518075399006E-3,"N/A"]
[null,"DP1269","DAPTO","Urban",1646.5,8459.5049031517301,5339.6594182347499,242.4,3.9733058635982101,2.0001645548227649,8,0.32056233842456699,0.32056233842610343,4.5198969195274896E-3,4.5198969195274896E-3,3,0.16137127342775337,"N/A",5.5327976597341387E-4,"N/A"]
[null,"DP1273","DAPTO","Urban",223,863.36,1039.04,135.26400000000001,0,1.1510869992450472,0,0,0,0,0,2,9.2868546463550458E-2,"N/A",1.242788243223219E-4,"N/A"]
[null,"DP1284","DAPTO","Rural short",1129,16760.504453994701,5735.0181351942701,228.38399999999999,7.278442403999999E-2,0.22632193718669913,2,3.0618920923E-2,3.0618920922929296E-2,6.7294331698745707E-4,6.7294331698745707E-4,2,9.520901744044763E-2,"N/A",2.3677635227336454E-4,"N/A"]
[null,"DP1295","DAPTO","Urban",758.5,6025.7344627809998,1226.47122688067,202,4.2262283144681003,1.5344864327579861,6,0.34096786849610999,0.34096786849796218,2.1899646051790809E-3,2.1899646051790809E-3,2,0.12380082884415913,"N/A",3.26231913846095E-4,"N/A"]
[null,"DS1204","DOONSIDE","Urban",569.5,3322.6564387355502,2643.6360124590101,125.76,2.0677404237559998,3.5123150267641581,2,0.1668232268697,1.5116606996897809E-3,3.2568834498042609E-4,1.3144875649476356E-5,5,0.28337005931923887,"N/A",5.9390938161724995E-4,"N/A"]
[null,"DS1205","DOONSIDE","Urban",1778,8026.1738782683196,2673.7045573804799,291.072,2.2083422267744002,2.6810558802463618,5,0.17816683954228002,0.17816683954169793,1.7494634500757624E-3,1.7494634500757624E-3,4,0.21630490375561048,"N/A",4.3378089643271976E-4,"N/A"]
[null,"DS1223","DOONSIDE","Urban",1686.5,3778.4708684308198,9671.2824255923897,283.10399999999998,0.39831476013699996,0,4,3.2135635997009998E-2,3.2135635996883467E-2,1.2308383562691495E-4,1.2308383562691495E-4,0,0,"N/A",0,"N/A"]
[null,"DS1226","DOONSIDE","Urban",1259.5,4651.3027860836501,3175.44791522896,270.048,0.13579316230999999,2.9808435771481152,1,1.0955656358999999E-2,1.0955656359490839E-2,5.7359457379533191E-5,5.7359457379533191E-5,8,0.24049147495064696,"N/A",6.1063922335294709E-4,"N/A"]
[null,"DS1235","DOONSIDE","Urban",1195,1274.8218837278,9243.7899597882497,250.85,1.8958905732700003E-2,0,2,1.5295855301099999E-3,1.5295855301208851E-3,1.3144875649476356E-5,1.3144875649476356E-5,0,0,"N/A",0,"N/A"]
[null,"DS1241","DOONSIDE","Urban",717,2820.4981423010099,2221.0300000000002,111.84,3.5533136604000003E-2,0,1,2.8667778803E-3,2.8667778802812524E-3,6.9309344333602603E-5,6.9309344333602603E-5,0,0,"N/A",0,"N/A"]
[null,"DS1245","DOONSIDE","Urban",661,1970.8750655515701,4463.4055040190697,89.087999999999994,4.8878428843000003E-3,1.399700462313028E-2,1,3.9434626948000001E-4,3.9434626948429069E-4,8.3649208678485904E-6,8.3649208678485904E-6,2,1.1292643171595597E-3,"N/A",2.389977390813883E-6,"N/A"]
[null,"DS1256","DOONSIDE","Urban",1856.5,5891.7655776538304,3875.6332315065902,268.32,0.23682339356400001,2.7354146177774603,2,1.91066742507E-2,1.9106674250861586E-2,1.410086660580191E-4,1.410086660580191E-4,5,0.22069051226775394,"N/A",5.1384513902498485E-4,"N/A"]
[null,"DS1257","DOONSIDE","Urban",1758.5,3928.4730121585899,5736.7948786533398,240,17.560449448707001,0.30215756011836792,7,1.4167594774038699,0.12978772220814791,3.8502535766011653E-3,1.9765113022030814E-3,3,2.4377769386301606E-2,"N/A",9.0819140850927546E-5,"N/A"]
[null,"DS1271","DOONSIDE","Urban",1360.5,723.85685099291402,6805.7189544081702,197.85599999999999,2.5725309565969998,2.0100142988168197,3,0.20754922158900002,0.20754922158436381,1.8331126587542482E-3,1.8331126587542482E-3,3,0.16216594091019898,"N/A",7.480629233247453E-4,"N/A"]
[null,"DS1275","DOONSIDE","Urban",704.5,0,4669.84,158.88,0.22706251944,0,1,1.8319176701000001E-2,1.8319176700588413E-2,3.5849660862208241E-5,3.5849660862208241E-5,0,0,"N/A",0,"N/A"]
[null,"DS1286","DOONSIDE","Urban",258.5,758.53834446603298,2089.9051905107299,52.128,0,0.46212332723985683,0,0,0,0,0,1,3.7283647296696573E-2,"N/A",9.5599095632555318E-5,"N/A"]
[null,"DS1290","DOONSIDE","Urban",1595.5,0,7761.8669391397998,284.35199999999998,4.4094267473999998E-2,4.2657537899063708E-2,1,3.5574813462E-3,3.5574813462264645E-3,2.9874717385173535E-5,2.9874717385173535E-5,1,3.4415674427719914E-3,"N/A",1.9119819126511064E-5,"N/A"]
[null,"ED1122","EDMONDSON PARK","Urban",186,0,7888.0135391209897,null,0,1.0664384474765927E-2,0,0,0,0,0,1,8.6039186069299784E-4,"N/A",1.1949886954069415E-6,"N/A"]
[null,"ED1152","","Urban",0,0,0,0,0.45619866920000002,0,1,3.6805651819000001E-2,3.6805651818533798E-2,3.286218912369089E-4,3.286218912369089E-4,0,0,"N/A",0,"N/A"]
[null,"ED1242","EDMONDSON PARK","Urban",168,0,2919.57,null,0,1.3183845306929378,0,0,0,0,0,6,0.10636594377817186,"N/A",2.2226789734569111E-4,"N/A"]
[null,"ER1122","EAST RICHMOND","Rural short",1038,17506.7584027337,1798.4,186.624,1.6411302775100001E-2,1.3263828190490121,4,6.9038999557200003E-3,6.9038999557602086E-3,2.4923826555091002E-5,2.4923826555091002E-5,1,0.55798216700209979,"N/A",1.2399603711157775E-3,"N/A"]
[null,"ER1132","EAST RICHMOND","Urban",13,3637.74,1844.34,216.38399999999999,0,5.2655398344156765E-2,0,0,0,0,0,1,4.2481848121716766E-3,"N/A",1.0754898258662473E-5,"N/A"]
[null,"ER1142","EAST RICHMOND","Urban",930.5,4619.8819880971596,2493.13,175.29599999999999,0.92689970918999998,0.68237248993398092,1,7.4781340390999998E-2,7.4781340390756165E-2,6.488954438120929E-4,6.488954438120929E-4,2,5.5053129197397792E-2,"N/A",1.4817859823046075E-4,"N/A"]
[null,"ER1232","EAST RICHMOND","Rural short",1355,22477.167560506601,1860.23,307.2,1.4310401330774001,-0.26742425234985945,6,0.60200936191160004,0.5897593011566783,5.0345265005346841E-3,4.9036764111204563E-3,2,-0.11249992211304201,"N/A",5.6701705412832027E-4,"N/A"]
[null,"ER1252","EAST RICHMOND","Rural short",628,13520.488880977,2400.12425990573,165.21600000000001,9.701627543E-3,0.55143754721602145,1,4.0812765983999997E-3,4.0812765983961521E-3,3.1154783193863753E-5,3.1154783193863753E-5,2,0.23197851566150951,"N/A",4.7978366118550181E-4,"N/A"]
[null,"ER1262","EAST RICHMOND","Rural short",604.5,20015.3692332192,1273.3769746382,163.584,3.1360992411500002,1.172415768194579,3,1.31929291103,0.83303528590744536,1.012530453800572E-2,6.355575771548206E-3,4,0.49321137274205706,"N/A",1.2835770675871867E-3,"N/A"]
[null,"F601","DUNDAS","Urban",1466,4569.78948829604,1496.41495029218,191,1.9911423318099999,1.9571663490863129,7,0.1606433695086,0.16064336951004524,2.7866824772479217E-3,2.7866824772479217E-3,3,0.15790222124498701,"N/A",3.6208157470830324E-4,"N/A"]
[null,"F602","DUNDAS","Urban",880,2463.3123036842198,2876.89458388096,180,0.13971353223319999,4.9100603519234794E-2,4,1.127194787912E-2,1.1271947879140373E-2,1.0725457560706094E-3,1.0725457560706094E-3,1,3.9613875252740112E-3,"N/A",6.0944423465754017E-5,"N/A"]
[null,"F603","DUNDAS","Urban",1515.5,714.30678393870403,5273.8183017157698,260,0.18906619653099999,0,2,1.5253671415199999E-2,1.5253671415183336E-2,1.8801233570160275E-3,1.8801233570160275E-3,0,0,"N/A",0,"N/A"]
[null,"FF1202","FAIRFIELD","Urban",614,180.24513513907101,2208.4348590739,81.792000000000002,0.48191177311,3.4066783738835602E-3,1,3.8880159295000001E-2,3.8880159294673811E-2,3.8367962590819138E-4,3.8367962590819138E-4,1,2.7484739994359652E-4,"N/A",1.1949886954069415E-6,"N/A"]
[null,"FF1206","FAIRFIELD","Urban",1511.5,4107.6697762599597,2056.9364127192498,240,0.49690106994,0.39813702039126131,1,4.0089480753999998E-2,4.0089480753512069E-2,7.2894310419823429E-5,7.2894310419823429E-5,2,3.2121296132538585E-2,"N/A",7.0504333029009549E-5,"N/A"]
[null,"FF1217","FAIRFIELD","Urban",439,2692.7476117318502,1828.69213715723,144.19200000000001,0.15925480816000001,8.3982027738781675E-2,1,1.2848518453E-2,1.2848518453015434E-2,1.3383873388557745E-4,1.3383873388557745E-4,1,6.775585902957358E-3,"N/A",1.0754898258662473E-5,"N/A"]
[null,"FF1232","FAIRFIELD","Urban",448.5,2960.7233984057498,487.44,171.26400000000001,2.6068495383E-2,1.2433635482419803,1,2.1031801039000002E-3,2.1031801039162168E-3,5.2579502597905425E-5,5.2579502597905425E-5,5,0.10031332603593569,"N/A",1.9717313474214534E-4,"N/A"]
[null,"FF1239","FAIRFIELD","Urban",1643.5,5056.62456364638,1700.27,250,0.24304428450560001,0,2,1.9608569503310001E-2,1.9608569502932504E-2,8.6039186069299787E-5,8.6039186069299787E-5,0,0,"N/A",0,"N/A"]
[null,"FF1243","FAIRFIELD","Urban",108.5,1300.0638816738999,2367.3453876849298,139.77600000000001,0,0.10397774862896779,0,0,0,0,0,4,8.3888206417567293E-3,"N/A",1.3144875649476356E-5,"N/A"]
[null,"FF1265","FAIRFIELD","Urban",384,3311.9881936951201,1133.4369892317,195,0.96641540809699988,0,6,7.7969427409219999E-2,7.796942740921671E-2,5.8434947205399438E-4,5.8434947205399438E-4,0,0,"N/A",0,"N/A"]
[null,"FF1269","FAIRFIELD","Urban",584.5,1408.17,1590.41,94.463999999999999,0,4.9619011097869247E-3,0,0,0,0,0,1,4.0032121296132536E-4,"N/A",1.1949886954069415E-6,"N/A"]
[null,"FF1280","FAIRFIELD","Urban",170.5,3662.7171471581801,3194.1577450208301,164.73599999999999,0.23236508838700001,3.9606339007672346E-2,2,1.8746982653899999E-2,1.87469826535441E-2,1.0515900519581084E-4,1.0515900519581084E-4,6,3.1953997715181612E-3,"N/A",8.3649208678485904E-6,"N/A"]
[null,"FF1284","FAIRFIELD","Urban",889,3656.7886790379198,1007.94,195,0.27671115383099998,0.19729111278316966,2,2.23247788079E-2,2.2324778807592479E-2,2.5811755820789937E-4,2.5811755820789937E-4,1,1.5917249422820461E-2,"N/A",4.4214581730056833E-5,"N/A"]
[null,"FT1202","FIGTREE","Urban",1597.5,5418.98862810836,5405.82287366938,219.55199999999999,0.48201536661659999,3.2150601211751617,3,3.8888517114489998E-2,3.8888517114628096E-2,2.8440730950685209E-4,2.8440730950685209E-4,5,0.25938783119111691,"N/A",7.8152260679613969E-4,"N/A"]
[null,"FT1203","FIGTREE","Urban",331.5,3442.7020623977101,978.37,141.98400000000001,0,0.7731678744205297,0,0,0,0,0,2,6.2378409900242342E-2,"N/A",1.5773850779371627E-4,"N/A"]
[null,"FT1204","FIGTREE","Urban",815.5,3839.3023449705402,3498.35,125.08799999999999,8.3907969513000003E-2,1.8151671074757838,1,6.7696109595E-3,6.769610959480323E-3,6.5724378247381776E-5,6.5724378247381776E-5,5,0.14644586462212067,"N/A",3.9315128078888374E-4,"N/A"]
[null,"FT1205","FIGTREE","Urban",1150,5478.5094483400999,4003.25,144,1.3707288844929999,3.8056300347555325,4,0.11058903382720001,0.11058903382773999,1.6084547840177431E-3,1.6084547840177431E-3,5,0.30703442045438251,"N/A",7.7315768592829107E-4,"N/A"]
[null,"FT1206","FIGTREE","Rural short",444,12214.704957743699,899.83,76.608000000000004,0.38834652298700001,5.8505998160174183E-3,7,0.1633694521124,0.1587398513293746,3.9566574656206971E-3,3.794652593012606E-3,1,2.4612278723152364E-3,"N/A",6.2309566387727505E-6,"N/A"]
[null,"FT1207","FIGTREE","Urban",922.5,0,5406.1214643315298,167.52,0.33209189487000002,0.70177574502001339,2,2.6792841540000001E-2,2.6792841539719035E-2,8.1259231287672014E-5,8.1259231287672014E-5,1,5.6618564388380886E-2,"N/A",1.0993895997743861E-4,"N/A"]
[null,"FT1208","FIGTREE","Urban",1549.5,8524.5507265052001,1849.7373872953899,202.65600000000001,0.23732698950063999,1.2661734817018961,4,1.9147303866940999E-2,1.9147303866505424E-2,8.1259231287672014E-5,8.1259231287672014E-5,6,0.10215360862686239,"N/A",5.150401277203918E-4,"N/A"]
[null,"FT1209","FIGTREE","Urban",688,3748.8510960675299,1347.31355421489,213.792,6.8296495573999999E-2,0.13982192978026439,1,5.5100928744999996E-3,5.510092874521407E-3,6.3334400856567897E-5,6.3334400856567897E-5,2,1.1280693284641527E-2,"N/A",6.5724378247381776E-5,"N/A"]
[null,"FT1210","FIGTREE","Urban",1407.5,8235.5303127565803,2061.6091086318702,201.6,2.5328801826,0.46212332723985683,2,0.20435023684599998,0.20435023684675943,3.3650881662659472E-3,3.3650881662659472E-3,1,3.7283647296696573E-2,"N/A",7.7674265201451188E-5,"N/A"]
[null,"GG1232","GERRINGONG","Rural short",947,22062.567599857,3057.28,96.4,1.649039695995,1.6533054497810034,6,0.69371732642700001,0.43095788496407855,1.8505941217155067E-3,1.320962807419823E-3,10,0.69551184193309201,"N/A",2.6980042245886011E-3,"N/A"]
[null,"GG1258","GERRINGONG","Urban",1028,3689.3285357589798,1964.51604632209,114,0.40450602778090006,1.139904207191647,5,3.2635141272199998E-2,3.2635141271563577E-2,6.8114355638195656E-5,6.8114355638195656E-5,3,9.1966329998518212E-2,"N/A",2.6050753559871321E-4,"N/A"]
[null,"GG1269","GERRINGONG","Rural short",937,8879.1213053515294,2069.58,122,2.3780836796,0.33443213479963874,2,1.0004112431359999,8.4242533756207591E-2,6.3742686414645236E-3,4.9847653110182005E-4,6,0.14068876994684995,"N/A",8.2871723295677581E-4,"N/A"]
[null,"GG1295","GERRINGONG","Rural short",246,43541.3704727968,304.72000000000003,34,4.1894738175569701,2.6011026199758249,16,1.7624260852649103,1.1445208082796954,8.5301796384798963E-3,6.9973643053418003E-3,20,1.0942307572481602,"N/A",3.1341711893026936E-3,"N/A"]
[null,"GL1207","GLENORIE","Rural short",307,17882.7006541665,510.34,100.128,2.31506012973E-2,1.1380379399085629,4,9.7389852264300001E-3,9.7389852264018091E-3,4.3616696471409256E-5,4.3616696471409256E-5,13,0.47874932238346551,"N/A",1.227498457838232E-3,"N/A"]
[null,"GL1233","GLENORIE","Rural short",537,26218.4734296852,1311.09,154.56,2.132669531895,0.41167486401617248,8,0.89717052258763019,0.89717052259033325,6.2870352485217048E-3,6.2870352485217048E-3,6,0.17318320881804983,"N/A",5.1093844437936561E-4,"N/A"]
[null,"GL1255","GLENORIE","Rural short",480.5,17778.875833568902,130.63,175.68,1.5305317235139999,0.89758569329279891,6,0.64386344236019999,0.59614054545794415,2.3241468262622357E-3,2.2369134333194173E-3,4,0.37759597230962871,"N/A",8.0379340640168489E-4,"N/A"]
[null,"GV1204","GRANVILLE","Urban",203,653.76,547.21,43.968000000000004,5.7587676163999998E-2,0,1,4.6461160476999998E-3,4.6461160477421883E-3,8.6039186069299787E-5,8.6039186069299787E-5,0,0,"N/A",0,"N/A"]
[null,"GV1208","GRANVILLE","Urban",1795,635.88,4845.2817248095298,136.608,0.19200335548349998,4.8878428842677171E-3,3,1.549063845859E-2,1.5490638458560182E-2,2.6289751298952709E-5,2.6289751298952709E-5,1,3.9434626948429069E-4,"N/A",1.1949886954069415E-6,"N/A"]
[null,"GV1223","GRANVILLE","Urban",1238.5,4197.6233549131002,2434.21,213.98400000000001,0.23052844439764997,0.26172176898488048,4,1.8598804054906E-2,1.8598804055313639E-2,2.6409250168493405E-4,2.6409250168493405E-4,1,2.1115450247840655E-2,"N/A",6.8114355638195656E-5,"N/A"]
[null,"GV1234","GRANVILLE","Urban",337.5,0,2025.4984269030799,159.36000000000001,6.3690073947000002E-4,2.3698632166146505E-3,1,5.1384513902000003E-5,5.1384513902498485E-5,1.1949886954069415E-6,1.1949886954069415E-6,1,1.9119819126511064E-4,"N/A",2.389977390813883E-6,"N/A"]
[null,"GV1241","GRANVILLE","Urban",818.5,782.075354564897,1118.1087651824801,62.88,3.7177229210999998E-3,0,1,2.9994216255000003E-4,2.9994216254714229E-4,1.1949886954069415E-6,1.1949886954069415E-6,0,0,"N/A",0,"N/A"]
[null,"GV1245","GRANVILLE","Urban",716.5,1210.5148330064301,4751.0551326260602,150.816,0.27352665012999999,2.6675032249763468,1,2.2067856237999998E-2,2.2067856238079987E-2,7.0504333029009549E-5,7.0504333029009549E-5,3,0.21521148909931312,"N/A",4.8994536511684603E-4,"N/A"]
[null,"GV1249","GRANVILLE","Urban",598,1532.72553647211,1661.48,81.792000000000002,0.31070387933999999,0,2,2.5067277864000002E-2,2.506727786355141E-2,1.2188884693150802E-4,1.2188884693150802E-4,0,0,"N/A",0,"N/A"]
[null,"GV1256","GRANVILLE","Urban",729,1626.42254048615,1275.6500000000001,130.84800000000001,0,0.31282194459313389,0,0,0,0,0,1,2.5238161246994604E-2,"N/A",5.2579502597905425E-5,"N/A"]
[null,"GV1267","GRANVILLE","Urban",102,0,2303.54,217.05600000000001,0,9.6275693174970173E-3,0,0,0,0,0,2,7.7674265201451191E-4,"N/A",2.9874717385173535E-5,"N/A"]
[null,"GV1271","GRANVILLE","Urban",1342,4850.5710334609903,878.46,229.72800000000001,4.5324078366740004,0,14,0.3656701257587,0.36567012576061031,4.1561706826253424E-3,4.1561706826253424E-3,0,0,"N/A",0,"N/A"]
[null,"GV1286","GRANVILLE","Urban",259,979.09917969834203,3775.8327891742601,171.648,0.20191234606,0,1,1.6290085895999999E-2,1.6290085895787426E-2,1.1471891475906638E-4,1.1471891475906638E-4,0,0,"N/A",0,"N/A"]
[null,"GV1293","GRANVILLE","Urban",602,1517.3598280466399,2935.53,89.664000000000001,1.7727169326189998,0,4,0.14302102702120001,0.14302102702108438,1.5379504509887337E-3,1.5379504509887337E-3,0,0,"N/A",0,"N/A"]
[null,"H745","OAKDALE","Rural short",565.5,45234.774045803897,685.66,100,1.0727185850009,1.1401263818682046,15,0.45127080360598998,0.45127080360647776,3.4332571079637858E-3,3.4332571079637858E-3,14,0.47962788726953248,"N/A",1.6262796827196879E-3,"N/A"]
[null,"HBA2","HELENSBURGH","Rural short",808.5,19120.569311171101,360.02,127.2,1.4281388209057999,3.4080854801684253,10,0.60078883911409986,0.60078883911046865,5.7698658475035672E-3,5.7698658475035672E-3,17,1.433711967798416,"N/A",4.0625837284798336E-3,"N/A"]
[null,"HBB2","HELENSBURGH","Urban",1378,11562.8296757062,1004.78,165,3.3657241751540004,3.9634481133369648,10,0.27154325619649999,0.27154325620079633,2.5130612264407976E-3,2.5130612264407976E-3,12,0.31976702500394344,"N/A",9.8945063979694742E-4,"N/A"]
[null,"HBC2","HELENSBURGH","Urban",856,11853.8747489896,1565.96,163.19999999999999,8.2693414615000002E-2,4.3109144958279835,1,6.6716218865000001E-3,6.6716218864569538E-3,4.4214581730056833E-5,4.4214581730056833E-5,13,0.34780026480949489,"N/A",8.9624152155520613E-4,"N/A"]
[null,"HBD2","HELENSBURGH","Urban",13.5,5245.1607699329697,72.88,82.272000000000006,1.5922518486999999E-2,6.0727744925750419E-3,1,1.2846128476E-3,1.2846128475624621E-3,7.1699321724416489E-6,7.1699321724416489E-6,1,4.8994536511684603E-4,"N/A",1.1949886954069415E-6,"N/A"]
[null,"HKA2","HUSKISSON","Rural short",54,2105.14,4605.6400000000003,6.5279999999999996,4.1324489839999999E-3,3.2585619228451441E-2,1,1.7384369021999999E-3,1.7384369022175974E-3,6.2309566387727505E-6,6.2309566387727505E-6,1,1.3708104605300052E-2,"N/A",2.4923826555091002E-5,"N/A"]
[null,"HKB2","HUSKISSON","Urban",1059.5,10396.293428242399,36.19,113.184,14.2204531008,4.2424995070933393,3,1.1472919166169999,0.21119154712796417,2.694699508142653E-3,1.4327914457929229E-3,4,0.34228061202541021,"N/A",9.2850621633119347E-4,"N/A"]
[null,"HKC2","HUSKISSON","Rural short",808.5,13180.471665198,739.01,112.224,1.7500106807,1.2104076378859328,1,0.73619375782999996,0.73619375782763929,5.0221510508508373E-3,5.0221510508508373E-3,3,0.50919377652050923,"N/A",1.6636654225523244E-3,"N/A"]
[null,"HKD2","HUSKISSON","Rural short",1002.5,9953.0564517152106,2008.6267715034401,146.01599999999999,0.61336503539999998,1.4004410445682201,1,0.25803014537000002,0.25803014536821839,6.8540523026500264E-4,6.8540523026500264E-4,5,0.58913695019596357,"N/A",4.0189670320084246E-3,"N/A"]
[null,"HKF2","HUSKISSON","Urban",2320.5,14430.4970351966,1048.95688048579,227.42400000000001,0.20863683293030003,3.0934120799373108,3,1.6832610763580003E-2,1.6832610763502176E-2,1.3144875649476358E-4,1.3144875649476358E-4,6,0.24957338903573972,"N/A",7.3491804767526899E-4,"N/A"]
[null,"HKG2","HUSKISSON","Urban",2430.5,12949.825587585099,1464.71,171.84,13.7420962109315,9.8545577787133904,10,1.1086985617074099,1.1057720343965547,9.4416056824102434E-3,9.4045610328526291E-3,13,0.79505585377162336,"N/A",2.5250111133948675E-3,"N/A"]
[null,"HKH2","HUSKISSON","Urban",221.5,0,3382.83,76.415999999999997,0,-1.2251452247642551,0,0,0,0,0,1,-9.8843489940585158E-2,"N/A",8.484419737389284E-5,"N/A"]
[null,"HR1206","HOLROYD","Urban",1501,6412.4260182200996,529.62632462768204,240,3.2595098680878003,0,8,0.26297399226127999,0.26297399226603313,2.0350657482780211E-3,2.0350657482780211E-3,0,0,"N/A",0,"N/A"]
[null,"HR1210","HOLROYD","Urban",610.5,2357.4667296247599,691.37,94.751999999999995,0,0.82152789568457241,0,0,0,0,0,3,6.6280047990746008E-2,"N/A",1.6012848518453016E-4,"N/A"]
[null,"HR1213","HOLROYD","Urban",557,5021.16386258066,530.96,105.792,0.16791962054199999,0.6185342995364238,2,1.3547586839800001E-2,1.3547586839828495E-2,1.469836095350538E-4,1.469836095350538E-4,3,4.9902727920193873E-2,"N/A",1.0993895997743861E-4,"N/A"]
[null,"HR1217","HOLROYD","Urban",329,469.91,1626.35,120.57599999999999,0.2419682721601,1.9551371537070868E-2,2,1.952175790391E-2,1.9521757903856851E-2,3.7194398382491987E-4,3.7194398382491987E-4,1,1.5773850779371627E-3,"N/A",3.5849660862208244E-6,"N/A"]
[null,"HR1236","HOLROYD","Urban",1708.5,3017.8832497446601,3214.2577996770701,190,0,1.3339367580519714,0,0,0,0,0,2,0.10762068190834914,"N/A",1.6729841735697181E-4,"N/A"]
[null,"HR1239","HOLROYD","Urban",1026,3378.2633262526701,1672.4225620633099,138.43199999999999,0,0.1381926488188418,0,0,0,0,0,2,1.1149244528146763E-2,"N/A",2.5094762603545769E-5,"N/A"]
[null,"HR1243","HOLROYD","Urban",1076,3370.4020060686298,1553.97926018044,195.36,0.12330694549,0.16352056194641088,1,9.9482808893000003E-3,9.948280889262787E-3,5.3774491293312365E-5,5.3774491293312365E-5,2,1.3192675197292633E-2,"N/A",3.1069706080580475E-5,"N/A"]
[null,"HR1247","HOLROYD","Urban",715,5069.3201247336801,1145.32,82.176000000000002,0.57613813351100007,0,2,4.6482247698299999E-2,4.6482247698189288E-2,8.3260462114410731E-4,8.3260462114410731E-4,0,0,"N/A",0,"N/A"]
[null,"HR1250","HOLROYD","Urban",1385,1986.93269161641,3110.1857519110599,170,0.615853391774,2.7458568275756687,4,4.9686434967290007E-2,4.9686434966325216E-2,8.1856725635375493E-4,8.1856725635375493E-4,4,0.22153297929801585,"N/A",5.3535493554230978E-4,"N/A"]
[null,"HR1269","HOLROYD","Urban",1976.5,5580.3379466422703,1017.24,225,0.650334901573,0,4,5.2468368648299998E-2,5.2468368649232572E-2,3.5132667644964083E-4,3.5132667644964083E-4,0,0,"N/A",0,"N/A"]
[null,"HR1273","HOLROYD","Urban",1477.5,6152.6907747493797,1054.75,235,4.0216578785674004,0,4,0.32446333057435006,0.32446333057689269,3.6184257696922186E-3,3.6184257696922186E-3,0,0,"N/A",0,"N/A"]
[null,"HR1276","HOLROYD","Urban",1746.5,5132.3527234002804,1776.73,240,0.72411170583200002,2.8334677083648914,5,5.8420607341199998E-2,5.8420607341054552E-2,4.0749114513376704E-4,4.0749114513376704E-4,3,0.22860133743134789,"N/A",4.8636039903062519E-4,"N/A"]
[null,"HT1238","HUNTINGWOOD","Urban",78,5322.9277659359695,4806.9549829274702,224.26,0.10686601942400001,7.020719779220902E-2,2,8.6218434372999989E-3,8.6218434373610819E-3,1.4339864344883298E-5,1.4339864344883298E-5,2,5.6642464162289024E-3,"N/A",1.0754898258662473E-5,"N/A"]
[null,"HT1260","HUNTINGWOOD","Urban",20,288.52,3450.02,67.103999999999999,0,8.4426377091896924E-3,0,0,0,0,0,1,6.8114355638195661E-4,"N/A",1.1949886954069415E-6,"N/A"]
[null,"HT1272","HUNTINGWOOD","Urban",12,0,1955.26,39.648000000000003,1.3448973754000001E-2,0,1,1.0850497354000001E-3,1.0850497354295029E-3,4.7799547816277659E-6,4.7799547816277659E-6,0,0,"N/A",0,"N/A"]
[null,"HT1279","HUNTINGWOOD","Urban",82.5,0,1736.26,210,1.8633049541E-2,0.19558777359622787,1,1.5032957787999999E-3,1.5032957788219323E-3,2.0314807821918003E-5,2.0314807821918003E-5,4,1.577982572284866E-2,"N/A",3.7044649557615188E-5,"N/A"]
[null,"HT1293","HUNTINGWOOD","Urban",8.5,3353.53,3989.8,58.56,1.7699915899E-2,0,1,1.4280114910000001E-3,1.4280114910112951E-3,1.1949886954069415E-6,1.1949886954069415E-6,0,0,"N/A",0,"N/A"]
[null,"HT1294","HUNTINGWOOD","Urban",623.5,4537.9646904456104,6910.3101789688599,339.64800000000002,2.9678486203756997,-1.6885275418379385E-2,2,0.23944305485039,2.3780275038598134E-4,4.5344428442413496E-4,1.1949886954069415E-6,1,-1.3622871127639132E-3,"N/A",1.1949886954069415E-6,"N/A"]
[null,"IHK2","INNER HARBOUR","Urban",4,0,719.37,83.616,0,3.1993153424297781E-2,0,0,0,0,0,1,2.5811755820789937E-3,"N/A",4.7799547816277659E-6,"N/A"]
[null,"IHL2","INNER HARBOUR","Urban",6,0,4090.32,48.72,0,7.9982883560744452E-3,0,0,0,0,0,2,6.4529389551974843E-4,"N/A",4.7799547816277659E-6,"N/A"]
[null,"J459","MINTO","Urban",1828,868.56217847929202,15937.9127798711,252,3.7711921921846789,2.8047331168634391,18,0.3042560097973,0.30425600979670092,5.4780568465880959E-3,5.4780568465880959E-3,4,0.22628305936225843,"N/A",6.3453899726108591E-4,"N/A"]
[null,"J460","MINTO","Urban",57.5,0,3921.1363926972499,207,5.6693782327799994E-2,5.3988446403502505E-2,2,4.57399758819E-3,4.5739975881879192E-3,1.2699430236513598E-4,1.2699430236513598E-4,1,4.3557337947583014E-3,"N/A",3.2264694775987422E-5,"N/A"]
[null,"J462","MINTO","Urban",31,0,2128.6941008732801,168,0,1.3330480593457409E-2,0,0,0,0,0,1,1.0754898258662474E-3,"N/A",2.389977390813883E-6,"N/A"]
[null,"J464","MINTO","Urban",14,0,2769.9126809168501,176,0,1.0664384474765927E-2,0,0,0,0,0,1,8.6039186069299784E-4,"N/A",2.389977390813883E-6,"N/A"]
[null,"J465","MINTO","Urban",1274,0,10448.548083015899,312,2.3113572184470002,0,6,0.18647798592109999,2.1808543691176682E-2,3.16074509935136E-3,1.6359395240121029E-3,0,0,"N/A",0,"N/A"]
[null,"J468","MINTO","Urban",1394.5,1159.17,10879.3833575349,245,2.6537825510469997,5.8654114611212602E-2,7,0.21410451886670001,0.21410451886630505,3.9323496150859057E-3,3.9323496150859057E-3,1,4.7321552338114884E-3,"N/A",1.3144875649476356E-5,"N/A"]
[null,"J469","MINTO","Urban",927.5,5799.1787947570201,2628.3353287320101,177,0.19231440002547001,0.33339531964236979,6,1.5515733220777999E-2,1.5515733221163728E-2,1.1830388084528722E-4,1.1830388084528722E-4,3,2.6898000544914844E-2,"N/A",1.9717313474214534E-4,"N/A"]
[null,"J470","MINTO","Urban",15,146.22811481437,1101.75,168,0,4.5916099821908855E-2,0,0,0,0,0,2,3.7044649557615183E-3,"N/A",1.0754898258662473E-5,"N/A"]
[null,"J472","MINTO","Urban",635.5,1767.43173042233,4151.5436581122103,186,0.97590967259700001,0.37740071724588309,4,7.8735415162839981E-2,7.8735415162972541E-2,1.5678251683739072E-3,1.5678251683739072E-3,3,3.0448311958968868E-2,"N/A",7.1699321724416482E-5,"N/A"]
[null,"J473","MINTO","Urban",1072,0,7358.9115100071804,228,0.8450836065210301,0,9,6.8180499153924004E-2,6.8180499154208388E-2,1.8005224633244696E-3,1.8005224633244696E-3,0,0,"N/A",0,"N/A"]
[null,"J474","MINTO","Urban",965.5,2044.05,8287.6533075544794,166,0.55360112039702014,0.33548376160201149,12,4.4663984047398998E-2,4.4663984047672516E-2,7.2496676024977422E-4,7.2496676024977422E-4,4,2.7066493950967222E-2,"N/A",6.0944423465754017E-5,"N/A"]
[null,"J475","MINTO","Urban",8,0,2226.4299999999998,64,0,6.1912676534057742E-2,0,0,0,0,0,3,4.995052746801015E-3,"N/A",1.6729841735697181E-5,"N/A"]
[null,"J477","MINTO","Rural short",1304,10835.954051827301,6467.46713909747,165,2.1017576285989996,0.38702828656338012,5,0.88416651608350005,0.84541619674868684,8.7794179040308062E-3,8.5301796384798963E-3,2,0.16281489697113197,"N/A",6.6048140370991162E-4,"N/A"]
[null,"J478","MINTO","Urban",1569,2182.32613094209,10112.489531085201,198,0.29808435771499997,0.12619521628473013,4,2.4049147495129999E-2,2.4049147495064697E-2,8.0064242592265081E-5,8.0064242592265081E-5,1,1.0181303684867141E-2,"N/A",8.484419737389284E-5,"N/A"]
[null,"J480","MINTO","Urban",905.5,939.34554284108106,12286.287253934001,302,2.6037242811878003,0,2,0.21006586778037001,0.21006586777689082,1.7064438570411123E-3,1.7064438570411123E-3,0,0,"N/A",0,"N/A"]
[null,"J481","MINTO","Urban",1534,254.27,11204.2685532385,217,1.1956996743027,1.1088738106990987,6,9.6467852413489999E-2,9.6467852414116151E-2,2.0267008274101727E-3,2.0267008274101727E-3,6,8.9462828681640669E-2,"N/A",2.5572758081708548E-4,"N/A"]
[null,"J482","MINTO","Urban",767.5,3305.6575953765,3154.4764576838202,178,0.48913976791000002,5.7395124777386064E-2,1,3.9463306677000001E-2,3.9463306677118837E-2,9.1775131807253106E-4,9.1775131807253106E-4,3,4.6305811947018978E-3,"N/A",1.1949886954069415E-5,"N/A"]
[null,"J483","MINTO","Urban",1117.5,0,11977.174626967,240,0.36292973997535,1.239171852677593,11,2.9280808003618999E-2,2.9280808003556289E-2,1.6132347387993714E-4,1.6132347387993714E-4,4,9.9975144235135538E-2,"N/A",4.6485060251330021E-4,"N/A"]
[null,"J489","KENTLYN","Urban",1769.5,7963.8626506065502,614.15,193,0.80951565151000004,0.6058703429726392,3,6.5310912159230003E-2,6.5310912158770981E-2,1.8749372630934911E-3,1.8749372630934911E-3,3,4.8881012585620942E-2,"N/A",1.7924830431104123E-4,"N/A"]
[null,"J491","KENTLYN","Urban",1549.5,7353.5607772416997,2797.9966393173199,213,1.5041373719186,0.27371920151899215,5,0.12135229700806999,0.12135229700727032,1.9191518448235482E-3,1.9191518448235482E-3,1,2.2083391091120279E-2,"N/A",9.2014129546334492E-5,"N/A"]
[null,"J492","KENTLYN","Urban",1338,6723.9479053373298,1289.4930193007101,168,0.21595378561280001,0,3,1.7422935179510001E-2,1.7422935179033205E-2,1.8641823648348288E-4,1.8641823648348288E-4,0,0,"N/A",0,"N/A"]
[null,"J493","KENTLYN","Urban",812,71.163866512436996,3860.7936153938599,118,8.5463192248800002E-3,0.50581768029618945,2,6.8950847725399991E-4,5.6164468684126251E-5,2.389977390813883E-6,1.1949886954069415E-6,2,4.0808863948147048E-2,"N/A",1.7446834952941344E-4,"N/A"]
[null,"J495","KENTLYN","Urban",1027,1153.67793651633,5804.6231535646502,182,0.12342543864970001,0,9,9.9578407987520011E-3,9.556324597169312E-3,8.0064242592265067E-5,7.8869253896858121E-5,0,0,"N/A",0,"N/A"]
[null,"J496","KENTLYN","Urban",968,3181.9971933554898,1550.72,156,0.75533465371600006,0,3,6.0939643510799994E-2,6.0939643510972384E-2,1.8868871500475604E-3,1.8868871500475604E-3,0,0,"N/A",0,"N/A"]
[null,"J497","KENTLYN","Rural short",957.5,9798.9396987514792,3994.9660359374602,147,0.38726527288410001,0,6,0.16291459227899999,0.1629145922773523,1.950289427935871E-3,1.950289427935871E-3,0,0,"N/A",0,"N/A"]
[null,"J499","KENTLYN","Urban",1289,563.56684605251201,7948.6509840550898,150,1.5401889161130902,0.24172604809469436,15,0.12426089949207,0.12426089949189083,4.0151620165673226E-4,4.0151620165673226E-4,1,1.9502215509041285E-2,"N/A",4.0629615643836007E-5,"N/A"]
[null,"J500","KENTLYN","Urban",744.5,1404.18169850302,4113.91610016082,120,0.75819330122090012,0.88736565817114821,7,6.1170276328888995E-2,6.1170276329185931E-2,2.0075810082836618E-4,2.0075810082836618E-4,3,7.1591772741829859E-2,"N/A",3.1069706080580475E-4,"N/A"]
[null,"J502","KENTLYN","Urban",781,1523.2765798011601,3564.7641070893801,126,0.65406743614039997,-3.4214900189874019E-2,10,5.2769505800219996E-2,5.2769505800475125E-2,3.3818180080016441E-4,3.3818180080016441E-4,1,-2.7604238863900349E-3,"N/A",2.389977390813883E-6,"N/A"]
[null,"J503","KENTLYN","Urban",946,0,6310.9749404604599,140,1.8455309799300001E-2,0.43664729766124938,3,1.4889559144800001E-3,1.4889559144770491E-3,3.3459683471394355E-5,3.3459683471394355E-5,1,3.5228266740596634E-2,"N/A",1.0515900519581085E-4,"N/A"]
[null,"J504","KENTLYN","Urban",1193.5,4283.4886014396598,1745.50361625085,177,2.043429370163,2.3994865068223337E-2,2,0.16486183540319999,0.16486183540703703,1.469836095350538E-3,1.469836095350538E-3,1,1.9358816865592452E-3,"N/A",1.0754898258662473E-5,"N/A"]
[null,"J505","MACQUARIE FIELDS","Urban",364.5,1922.8668849819301,521.07000000000005,42,0,0.93935453248563205,0,0,0,0,0,1,7.5786183062708221E-2,"N/A",1.8044329300644817E-4,"N/A"]
[null,"J506","MACQUARIE FIELDS","Urban",1197.5,0,5789.3885105896597,183,8.6040846408130006E-2,0,5,6.9416893316410003E-3,6.9416893316189224E-3,8.0064242592265067E-5,8.0064242592265067E-5,0,0,"N/A",0,"N/A"]
[null,"J507","MACQUARIE FIELDS","Urban",868.5,5879.3868590992097,4996.3464285998898,118,3.1967825510929999,0,4,0.25791321514319998,0.25791321514098475,2.1151299908702863E-3,2.1151299908702863E-3,0,0,"N/A",0,"N/A"]
[null,"J509","MACQUARIE FIELDS","Urban",259,5057.7724123213202,1114.6170124451901,131,0.100111909257,0,2,8.0769285922999996E-3,8.0769285922555178E-3,6.4529389551974843E-5,6.4529389551974843E-5,0,0,"N/A",0,"N/A"]
[null,"J510","MACQUARIE FIELDS","Urban",1217.5,2068.0328554992202,5966.6893721099896,158,0.39199018767339988,7.85017190503603E-3,16,3.1625375823999997E-2,3.1625375823944701E-2,5.0309024076632233E-4,5.0309024076632233E-4,1,6.3334400856567897E-4,"N/A",1.1949886954069415E-6,"N/A"]
[null,"J513","MACQUARIE FIELDS","Urban",387,1319.6884457583201,772.03055446737301,57,1.1999802397300001,0,2,9.6813204147000009E-2,9.6813204147088772E-2,2.5811755820789937E-4,2.5811755820789937E-4,0,0,"N/A",0,"N/A"]
[null,"J514","MACQUARIE FIELDS","Urban",1929.5,0,9809.3654849708892,178,0.36055987676083995,0.11464213310373372,18,2.9089609812261E-2,2.9089609812291178E-2,3.0472211732877013E-4,3.0472211732877013E-4,2,9.2492125024497274E-3,"N/A",4.3019593034649893E-5,"N/A"]
[null,"J515","MACQUARIE FIELDS","Urban",588,885.93960614571597,8862.2309568476194,202,3.4614814607500002E-2,4.3694353056332623E-3,2,2.79268858112E-3,2.7926885811660222E-3,2.389977390813883E-5,2.389977390813883E-5,1,3.5252166514504772E-4,"N/A",1.1949886954069415E-6,"N/A"]
[null,"J516","MACQUARIE FIELDS","Urban",1431,3227.23202137506,2868.77101788239,189,0.13877030297749998,0,6,1.1195849087169999E-2,1.1195849087267635E-2,2.330227956043536E-4,2.330227956043536E-4,0,0,"N/A",0,"N/A"]
[null,"JBA2","JAMBEROO","Rural short",643.5,55034.3400962003,377.04,147,1.37996268934481,1.5329312100220829,21,0.5805221243208899,0.38538725526789114,6.2060328122176414E-3,5.7200181943933663E-3,12,0.64487285732978583,"N/A",1.950289427935871E-3,"N/A"]
[null,"JBB2","JAMBEROO","Rural short",319.5,44804.059640296196,2608.78347847433,47.16,1.7351780739675999,3.2768691161934926,13,0.72995398307175008,0.72866417504816094,6.903899955754164E-3,6.8976689991153911E-3,21,1.3785119229355283,"N/A",4.4052863436123352E-3,"N/A"]
[null,"JS1122","JORDAN SPRINGS","Urban",1186,24579.6608034214,7227.53,280,4.5524183692010993,1.4208070565860023,8,0.36728455548982003,0.36630227478048061,2.5524958533892261E-3,2.5489108873030055E-3,13,0.11462929060691086,"N/A",3.8478635992103517E-4,"N/A"]
[null,"JS1142","JORDAN SPRINGS","Urban",436.5,0,5474.5,128.44800000000001,4.3398120154300002E-2,0,2,3.5013168775499997E-3,3.5013168775423387E-3,7.0504333029009549E-5,7.0504333029009549E-5,0,0,"N/A",0,"N/A"]
[null,"JS1152","JORDAN SPRINGS","Urban",1022,1855.45445030727,5390.1671399475699,236.06399999999999,9.3876206669000012E-2,5.5988018492521122E-2,2,7.5738383514999995E-3,7.5738383514891948E-3,1.3861868866720521E-4,1.3861868866720521E-4,1,4.5170572686382389E-3,"N/A",2.5094762603545769E-5,"N/A"]
[null,"JS1222","JORDAN SPRINGS","Urban",891.5,0,11848.62,208.32,8.0916017202999999E-2,3.5547948249219759E-2,3,6.528223243E-3,6.5282232430081211E-3,9.9184061718776131E-5,9.9184061718776131E-5,1,2.8679728689766596E-3,"N/A",5.9749434770347074E-6,"N/A"]
[null,"JS1232","JORDAN SPRINGS","Urban",856,0,6578.9230432962704,245.76,3.9961818490299998E-2,0.17996148801167502,3,3.2240795002200003E-3,3.2240795002079275E-3,2.7484739994359649E-5,2.7484739994359649E-5,1,1.4519112649194338E-2,"N/A",9.6794084327962252E-5,"N/A"]
[null,"JS1252","JORDAN SPRINGS","Urban",469,25017.470593724302,1852.85,190,1.5886316801456,0.23350558506206229,11,0.12816921318513999,0.12816921318468522,1.6776072323533198E-3,1.6776072323533198E-3,4,1.8838996783090433E-2,"N/A",5.4969479988719305E-5,"N/A"]
[null,"KC1214","KEMPS CREEK","Rural short",231,12579.6886915867,1929.6185967766401,194.49600000000001,0.12438819558,6.220890943613458E-3,1,5.2327573852000001E-2,5.2327573852413559E-2,1.0592626285913676E-4,1.0592626285913676E-4,1,2.6170017882845551E-3,"N/A",6.2309566387727505E-6,"N/A"]
[null,"KC1221","KEMPS CREEK","Rural short",479.5,15317.9579478819,207.50658927168499,148.12799999999999,0.27324522887649999,0.42020637159598523,6,0.11494868807271001,0.11494868807207971,3.2837141486332395E-3,3.2837141486332395E-3,3,0.17677223984198295,"N/A",3.925502682426833E-4,"N/A"]
[null,"KC1236","KEMPS CREEK","Rural short",260.5,32275.312581693099,349.37654353501398,130.464,2.1312328023518798,0.41480012113308307,20,0.89656611980343981,0.89656611979637224,7.720155275439438E-3,7.720155275439438E-3,7,0.1744979406688309,"N/A",4.9847653110182005E-4,"N/A"]
[null,"KC1262","KEMPS CREEK","Rural short",120,17850.467138547101,54.55,53.951999999999998,0,0.27971791778604799,0,0,0,0,0,3,0.1176716161232234,"N/A",5.9817183732218413E-4,"N/A"]
[null,"KC1284","KEMPS CREEK","Rural short",811,21560.306739144999,4002.57,210,2.6764050236555001,2.4902078330833635,5,1.1259089408043002,1.125908940799681,1.2312370318214956E-2,1.2312370318214956E-2,15,1.0475795848936686,"N/A",3.5080285876290585E-3,"N/A"]
[null,"KC1288","KEMPS CREEK","Rural short",377.5,18013.048627166099,3478.5849490447999,187.87200000000001,2.47058240328E-2,0.10990240667050442,5,1.039323567351E-2,1.0393235673472948E-2,9.9695306220364021E-5,9.9695306220364021E-5,3,4.6233698259693812E-2,"N/A",1.2461913277545501E-4,"N/A"]
[null,"KMA2","KIAMA","Urban",1512.5,6360.4015950068197,3584.0218419794801,130.68,6.0579628474900005E-2,7.5626630619253614,3,4.8875037641509999E-3,4.8875037642143911E-3,1.5893349648912322E-4,1.5893349648912322E-4,14,0.61014808299913481,"N/A",1.7649983031160525E-3,"N/A"]
[null,"KMB2","KIAMA","Urban",1423,8726.0124079875895,1790.6931131891699,130.392,2.0219821080934,5.6709049376176131,6,0.16313149177543002,0.16313149177608779,3.4845870358066414E-3,3.4845870358066414E-3,11,0.45752293183306486,"N/A",1.326437451901705E-3,"N/A"]
[null,"KMC2","KIAMA","Urban",395.5,2922.4518907922402,1461.6150170036999,65,5.7321066551999991E-3,0.54281716976558569,2,4.6246062511999997E-4,4.6246062512248637E-4,2.389977390813883E-6,2.389977390813883E-6,6,4.3793945709273592E-2,"N/A",9.9184061718776145E-5,"N/A"]
[null,"KMD2","KIAMA","Urban",1303.5,8156.7073169544501,3697.84,139,0.39702614701300004,2.3057287933150166,7,3.2031671980200002E-2,3.2031671980383071E-2,2.4736265994923685E-4,2.4736265994923685E-4,4,0.18602389021399857,"N/A",4.971152972892876E-4,"N/A"]
[null,"KME2","KIAMA","Rural short",941,10844.377537472101,4410.3228690886299,92.28,2.8244029815239999,1.1891529271619201,3,1.1881686595643699,1.1881686595342984,5.9131778501953407E-3,5.9131778501953407E-3,7,0.50025235374387034,"N/A",1.7633607287726885E-3,"N/A"]
[null,"KMF2","KIAMA","Urban",1475.5,5644.0982653850097,1354.83092731693,144,4.7184865341660007,1.8049470723541332,5,0.38068276874439999,0.38068276874100765,3.4248376010362941E-3,3.4248376010362941E-3,6,0.14562132242228989,"N/A",4.995052746801015E-4,"N/A"]
[null,"KVA2","KANGAROO VALLEY","Rural short",357,64374.233836723703,423.07,59.04,2.7046825961795107,3.2934433470646916,21,1.1378047381132801,1.1097155855876575,8.7698254261649837E-3,8.595358640279346E-3,8,1.385484363414315,"N/A",3.6388786770432864E-3,"N/A"]
[null,"KVB2","KANGAROO VALLEY","Rural short",386,47148.465184795998,91.27,65.040000000000006,3.9456323475579,0.94462747814259973,15,1.6598469581190198,1.0057273611370778,9.6366441601254231E-3,7.8109738649650082E-3,15,0.39738549059437095,"N/A",1.1963436746443683E-3,"N/A"]
[null,"KVC2","KANGAROO VALLEY","Rural short",135.5,38665.6721764096,0,20.04,0.2903228278103,-1.9896630984441415,5,0.12213288521560001,0.12213288521567872,2.4896026902357046E-3,2.4896026902357046E-3,7,-0.83701063624298233,"N/A",1.2960389808647321E-3,"N/A"]
[null,"KVD2","KANGAROO VALLEY","Rural short",100,32182.2872873409,0,20.04,0.12582036772870001,0.29764000836169624,5,5.2930059428500001E-2,4.9122944922620516E-2,1.6849145823680128E-3,1.653759799174149E-3,5,0.12521107365613843,"N/A",4.7355270454672909E-4,"N/A"]
[null,"KYA2","KENNY STREET","Urban",255.5,0,2300.2272795776298,116.16,2.7549659892999998E-3,0,1,2.2226789735E-4,2.2226789734569111E-4,3.5849660862208244E-6,3.5849660862208244E-6,0,0,"N/A",0,"N/A"]
[null,"KYB2","KENNY STREET","Urban",232,0,1338.21182905041,170.4,7.5243157127999998E-3,0.291493175643602,1,6.0705425727E-4,6.0705425726672625E-4,2.389977390813883E-6,2.389977390813883E-6,2,2.3517377525608608E-2,"N/A",7.1699321724416482E-5,"N/A"]
[null,"KYD2","KENNY STREET","Urban",346,0,1376.63,154,0,7.9982883560744452E-3,0,0,0,0,0,1,6.4529389551974843E-4,"N/A",1.1949886954069415E-6,"N/A"]
[null,"KYE2","KENNY STREET","Urban",329.5,0,1508.0868785041,99.84,0,3.110445471806729E-2,0,0,0,0,0,1,2.5094762603545769E-3,"N/A",8.3649208678485904E-6,"N/A"]
[null,"KYF2","KENNY STREET","Urban",428.5,905.58907653487302,1906.9272694158301,147.6,3.3000345291000002E-2,0.29008606935873704,2,2.6624348134000001E-3,2.6624348133666657E-3,3.7044649557615181E-5,3.7044649557615181E-5,2,2.3403853599544947E-2,"N/A",1.1591390345447332E-4,"N/A"]
[null,"KYH2","KENNY STREET","Urban",445.5,545.50376101096504,1391.0440004341201,171,0.5051659679153,0.18092424494342474,2,4.075628444585E-2,4.0756284445549143E-2,5.2101507119742642E-4,5.2101507119742642E-4,4,1.459678691439579E-2,"N/A",6.8114355638195656E-5,"N/A"]
[null,"L502","SEVEN HILLS","Urban",24,336.53237219937898,1558.72404612937,26.59,1.7603221260999999E-3,0,1,1.4202102644E-4,1.4202102643993749E-4,2.8404205287987497E-5,2.8404205287987497E-5,0,0,"N/A",0,"N/A"]
[null,"L503","SEVEN HILLS","Urban",22,0,1387.9,84.96,1.6136286164999999E-3,0,1,1.3018594098E-4,1.3018594098376248E-4,2.6037188196752498E-5,2.6037188196752498E-5,0,0,"N/A",0,"N/A"]
[null,"L504","SEVEN HILLS","Urban",106,1214.8828139632701,1433.1954805048599,161.18,7.7747560756999999E-3,3.5547948249219758E-3,1,6.2725953496999996E-4,6.272595349723002E-4,1.2545190699446004E-4,1.2545190699446004E-4,1,2.8679728689766593E-4,"N/A",1.1949886954069415E-6,"N/A"]
[null,"L508","LENNOX","Urban",498.5,0,1238.7298411705899,152.83199999999999,0,-5.3914388177983302E-2,0,0,0,0,0,1,-4.3497588512812673E-3,"N/A",1.6729841735697181E-5,"N/A"]
[null,"L509","BOSSLEY PARK","Urban",1003.5,1936.47001409159,9758.0580924703208,330,2.2374058979642997,-1.70333918694178E-2,8,0.18051166743301,0.18051166743466696,1.6401582301944317E-3,1.6401582301944317E-3,1,-1.3742369997179827E-3,"N/A",1.1949886954069415E-6,"N/A"]
[null,"L511","BOSSLEY PARK","Urban",857,0,5229.4560394808104,191.232,9.7105145300000001E-2,0,2,7.834345886999999E-3,7.8343458870879078E-3,5.0189525207091539E-5,5.0189525207091539E-5,0,0,"N/A",0,"N/A"]
[null,"L513","BOSSLEY PARK","Urban",1133,0,6393.5733013989102,240,0.79286736240769995,0.32348632906789981,4,6.3967744865530002E-2,6.3967744865133569E-2,1.5080757336035601E-3,1.5080757336035601E-3,2,2.6098553107687602E-2,"N/A",6.213941216116095E-5,"N/A"]
[null,"L516","BOSSLEY PARK","Urban",630.5,0,4549.3342805952198,196.512,0,3.9102743074141737E-2,0,0,0,0,0,1,3.1547701558743255E-3,"N/A",5.2579502597905425E-5,"N/A"]
[null,"L517","BOSSLEY PARK","Urban",658.5,5198.8124135632497,4741.8232502544597,179.52,0,1.2441781887226916E-2,0,0,0,0,0,1,1.0037905041418308E-3,"N/A",2.389977390813883E-6,"N/A"]
[null,"L519","BOSSLEY PARK","Urban",996.5,888.96,6828.6102510958299,240,0.22319668007079999,0.20795549725793558,3,1.8007284651259999E-2,1.8007284651087196E-2,4.1824604339242947E-5,4.1824604339242947E-5,2,1.6777641283513459E-2,"N/A",3.1069706080580475E-5,"N/A"]
[null,"L526","CRANEBROOK","Urban",733,0,7089.7822825522398,181.92,6.0518604497000004,0.99312080421257698,1,0.48825804107999998,0,1.9944361326341854E-3,0,2,8.0123992027035421E-2,"N/A",1.9478315735133145E-4,"N/A"]
[null,"L528","CRANEBROOK","Urban",590.5,1332.64189072212,6379.5795434922402,221.47200000000001,6.4282539750999998E-2,4.0880140486602719E-2,1,5.1862509381000003E-3,5.1862509380661255E-3,4.1824604339242954E-5,4.1824604339242954E-5,3,3.2981687993231582E-3,"N/A",1.4339864344883298E-5,"N/A"]
[null,"L533","NEWTON","Urban",316.5,153.30591510731699,2922.49907714763,274.32,0,0.32704112389282175,0,0,0,0,0,2,2.6385350394585266E-2,"N/A",9.2014129546334492E-5,"N/A"]
[null,"L534","NEWTON","Urban",540.5,2373.14,2505.96,79.2,0.85128449070000001,1.1226486406456715,1,6.8680780280000006E-2,6.8680780279818554E-2,2.9277223037470066E-4,2.9277223037470066E-4,4,9.0574168168369121E-2,"N/A",1.8880821387429674E-4,"N/A"]
[null,"L535","NEWTON","Urban",2,0,782.09,41.76,0,4.4434935311524698E-3,0,0,0,0,0,1,3.5849660862208245E-4,"N/A",2.389977390813883E-6,"N/A"]
[null,"L540","NEWTON","Urban",439,25.22,2267.85112538269,300.024,0.51005111150799998,6.220890943613458E-3,2,4.1150412939900002E-2,4.1150412939451708E-2,5.0734272247708731E-4,5.0734272247708731E-4,1,5.0189525207091539E-4,"N/A",1.1949886954069415E-6,"N/A"]
[null,"L543","NEWTON","Urban",919,1602.9950596921001,3233.2887651649298,238.9,0.91473757832000002,0.26572091316291768,1,7.3800111850999994E-2,7.3800111850941888E-2,1.1340442719411875E-3,1.1340442719411875E-3,2,2.1438097195600529E-2,"N/A",1.3981367736261215E-4,"N/A"]
[null,"L544","NEWTON","Urban",969.5,4222.6644833586397,319.92,135.36000000000001,1.8810789281999999E-3,0.84456000382104612,1,1.5176356432000001E-4,1.5176356431668156E-4,1.1949886954069415E-6,1.1949886954069415E-6,3,6.8138255412103804E-2,"N/A",1.5176356431668156E-4,"N/A"]
[null,"L579","LITHGOW","Urban",829,4000.5828567365702,3774.9481129204701,79.775999999999996,1.3626713496E-3,0.81121899069229875,1,1.0993895998E-4,1.0993895997743861E-4,1.1949886954069415E-6,1.1949886954069415E-6,3,6.5448335858742782E-2,"N/A",1.2905877910394969E-4,"N/A"]
[null,"L580","LITHGOW","Urban",139.5,865.44,1289.56,61.344000000000001,0,0.25327913127569079,0,0,0,0,0,1,2.0434306691458699E-2,"N/A",4.5409570425463773E-5,"N/A"]
[null,"L582","LITHGOW","Rural short",1249.5,158332.63714228501,1646.96962629522,92.52,4.6999275428400296,0.37045405569218143,40,1.9771635439131601,1.9771635439188975,1.0549009589442269E-2,1.0549009589442269E-2,11,0.15584245649234527,"N/A",3.8008835496513779E-4,"N/A"]
[null,"L584","LITHGOW","Rural short",386,32532.378107283501,3020.9861732825698,140,2.7930319172722005,1.0112650694647829,11,1.17497149337694,0.65651228433101316,6.311959075076797E-3,4.6545246091632452E-3,6,0.42541856451220955,"N/A",1.2088055879219137E-3,"N/A"]
[null,"L585","LITHGOW","Rural short",742.5,7426.7208956948798,1991.68,49.176000000000002,6.2208909436E-4,1.0484422986754252,1,2.6170017882999998E-4,2.6170017882845553E-4,1.2461913277545501E-5,1.2461913277545501E-5,1,0.44105826567552914,"N/A",7.5394575329150286E-4,"N/A"]
[null,"L588","LITHGOW","Rural short",1083,65370.987156491603,2001.11,131.4,3.7871006666928495,0.50698780025939294,12,1.5931559172588392,7.9918249848899309E-2,3.2774831919944675E-3,5.9194088068341129E-4,7,0.21327941478855247,"N/A",6.9163618690377536E-4,"N/A"]
[null,"L591","LITHGOW","Rural short",1539,136072.79807279,5264.5513908457096,129.31200000000001,17.058586477686521,2.349141725114376,41,7.1761989918274871,6.9433792970234718,4.0513680065300414E-2,3.9329798303933586E-2,23,0.98823595386599705,"N/A",2.3615325660948728E-3,"N/A"]
[null,"L940","GLOSSODIA","Rural short",570,40330.932432680398,1038.3800000000001,171.36,9.1085544613320302,0.20951071999383894,16,3.83178286362133,3.0973462355675467,2.3864563926499639E-2,2.0325380555676714E-2,6,8.8136881655440563E-2,"N/A",3.7385739832636506E-4,"N/A"]
[null,"L941","GLOSSODIA","Rural short",658.5,32393.251669547299,64.66,175,0.76242943171459998,0.67370767754823357,7,0.32073849298020002,0.32073849298082735,1.4524359924979281E-2,1.4524359924979281E-2,4,0.28341506271457856,"N/A",6.8540523026500264E-4,"N/A"]
[null,"L942","GLOSSODIA","Rural short",593,22876.808353650202,381.012750569292,221.76,7.3383110735772004,2.0296397285794097,8,3.0870776190515996,3.0870776190268492,1.9633744368772937E-2,1.9633744368772937E-2,11,0.85382798821103001,"N/A",2.1309871704602809E-3,"N/A"]
[null,"L946","GLOSSODIA","Rural short",502,37350.001889328501,212.3,174.72,2.1682471034186999,1.2077415417672412,3,0.91213728043730002,0.91213728043666542,3.2276355388842853E-3,3.2276355388842853E-3,8,0.50807220432553013,"N/A",1.5577391596931878E-3,"N/A"]
[null,"L947","GLOSSODIA","Rural short",859,19333.2104912541,236.51,211,1.87096257458,0.42716784479479075,3,0.78707574973999994,0.5640012711151543,6.9412856955928439E-3,6.7169712565970253E-3,4,0.17970078946220613,"N/A",4.8601461782427454E-4,"N/A"]
[null,"L948","GLOSSODIA","Rural short",727.5,21763.1501802762,40.26,218.88,0.95447722214590003,0.33104026807085901,8,0.40152907676299993,0.36302176473153924,1.0281078453975039E-2,1.0249923670781175E-2,2,0.13926188087657099,"N/A",3.8008835496513779E-4,"N/A"]
[null,"LL1122","LEABONS LANE","Urban",0,0,566.42999999999995,null,0,0.40062537676870669,0,0,0,0,0,1,3.2322054233366954E-2,"N/A",6.6919366942788723E-5,"N/A"]
[null,"LL1162","LEABONS LANE","Urban",0,1324.95805480483,2617.6526928039002,null,0,2.6660961186914817E-3,0,0,0,0,0,1,2.1509796517324946E-4,"N/A",3.5849660862208244E-6,"N/A"]
[null,"LL1172","LEABONS LANE","Urban",532.5,2740.4072461770602,90.31,101.304,3.6584763405999999E-3,1.1517535232747202,1,2.9516220777000001E-4,2.9516220776551455E-4,1.1949886954069415E-6,1.1949886954069415E-6,1,9.2922320954843762E-2,"N/A",1.935881686559245E-4,"N/A"]
[null,"LL1222","LEABONS LANE","Urban",1007.5,6855.6821513879104,70.59,375.40800000000002,1.305839067245,1.4145121074168696,3,0.10535378835289999,0.10535378835316217,1.7207837213859955E-4,1.7207837213859955E-4,7,0.1141214204113629,"N/A",5.4132987901934452E-4,"N/A"]
[null,"LL1252","LEABONS LANE","Urban",1496,0,2089.75,207.14400000000001,1.6839386311436,0,2,0.13585848255171901,0.1358584825562211,1.714141262282199E-3,1.714141262282199E-3,0,0,"N/A",0,"N/A"]
[null,"LP1112","LIVERPOOL","Urban",0,1914.8697875743101,1017.25,null,0,0.1125685027891959,0,0,0,0,0,2,9.0819140850927557E-3,"N/A",1.1949886954069415E-5,"N/A"]
[null,"LP1132","LIVERPOOL","Urban",0,1770.32516655823,2169.8763965049802,null,0.11896713347,0,1,9.5981492014999992E-3,9.5981492015085532E-3,6.7755859029573577E-4,6.7755859029573577E-4,0,0,"N/A",0,"N/A"]
[null,"LP1142","LIVERPOOL","Urban",1115,4861.4415578074804,833.83734045827805,null,0.34745157084199996,8.9166103525126231E-2,3,2.8032044816900002E-2,2.8032044816856033E-2,1.4507162762240271E-3,1.4507162762240271E-3,1,7.193831946349788E-3,"N/A",3.3459683471394361E-5,"N/A"]
[null,"LP1152","LIVERPOOL","Urban",630,0,1848.3006692465499,null,3.0644256904349993,2.2217467655762348E-2,8,0.2472347961618,0.24723479615882832,1.7709732465930872E-3,1.7709732465930872E-3,1,1.7924830431104123E-3,"N/A",2.389977390813883E-6,"N/A"]
[null,"LP1212","LIVERPOOL","Urban",555,0,1716.9863673985899,null,7.5480143449000003E-2,0,1,6.0896623917999996E-3,6.0896623917937737E-3,9.2014129546334492E-5,9.2014129546334492E-5,0,0,"N/A",0,"N/A"]
[null,"LP1322","LIVERPOOL","Urban",1015,4488.43316994217,1606.2,null,0,0.9757911794410824,0,0,0,0,0,2,7.8725855253409305E-2,"N/A",1.5893349648912322E-4,"N/A"]
[null,"M158","WOODPARK","Urban",27,503.53226840271498,1397.8504808949001,206.59,0,0.43257409525769291,0,0,0,0,0,1,3.4899644849359722E-2,"N/A",7.0504333029009549E-5,"N/A"]
[null,"M159","WOODPARK","Urban",124.5,1344.8314458391101,796.43104915459901,null,0.125810113512,0.46841827640898953,3,1.0150233978799999E-2,1.015023397878656E-2,8.723417476470672E-5,8.723417476470672E-5,3,3.7791517492244527E-2,"N/A",8.484419737389284E-5,"N/A"]
[null,"M160","WOODPARK","Urban",61,2913.7065661382999,1389.80567567047,162.05000000000001,0,6.2357025887172991E-2,0,0,0,0,0,3,5.0309024076632238E-3,"N/A",9.5599095632555318E-6,"N/A"]
[null,"M162","WOODPARK","Urban",93,1671.34344378628,2300.34498530984,150.05000000000001,0,0.11590112293756025,0,0,0,0,0,3,9.3507865415593163E-3,"N/A",4.3019593034649893E-5,"N/A"]
[null,"M163","WOODPARK","Urban",13.5,473.16,686.15386450675703,110.592,0,4.6212332723985686E-2,0,0,0,0,0,1,3.7283647296696572E-3,"N/A",9.5599095632555318E-6,"N/A"]
[null,"M165","WOODPARK","Urban",50,0,1555.17848017503,184.03200000000001,0,1.7773974124609879E-2,0,0,0,0,0,1,1.4339864344883298E-3,"N/A",2.389977390813883E-6,"N/A"]
[null,"M166","WOODPARK","Urban",62,1398.49524451979,946.08693814793003,226.75200000000001,0.22919539633200001,2.0662244919858984E-2,2,1.8491255072400001E-2,1.849125507272701E-2,1.0754898258662473E-4,1.0754898258662473E-4,1,1.6670092300926833E-3,"N/A",3.5849660862208244E-6,"N/A"]
[null,"M168","WOODPARK","Urban",327.5,2695.8519403219898,964.43191290143704,224.16,0.23337228025600001,0.33201783664771256,4,1.88282418849E-2,1.8828241884831769E-2,9.4404106937148372E-5,9.4404106937148372E-5,2,2.6786866596242E-2,"N/A",6.5724378247381776E-5,"N/A"]
[null,"M169","WOODPARK","Urban",97,562.077500419751,900.26342535414904,76.319999999999993,0,0.40258051392241379,0,0,0,0,0,2,3.2479792741160668E-2,"N/A",6.5724378247381776E-5,"N/A"]
[null,"M388","MACQUARIE FIELDS","Urban",939.5,2099.52388182918,4397,181,0.10578476933150001,0.86470384116227061,3,8.5346092625799997E-3,8.5346092625963755E-3,1.3861868866720521E-4,1.3861868866720521E-4,2,6.9763440037857241E-2,"N/A",2.7006744516196878E-4,"N/A"]
[null,"M399","LITHGOW","Rural short",1083.5,25511.983877656901,949.91356633730697,83.52,9.4364990957229999E-2,4.7752743814785205E-2,4,3.9697424745429997E-2,3.9697424745621199E-2,1.5577391596931879E-4,1.5577391596931879E-4,2,2.0088604203403349E-2,"N/A",4.9847653110182004E-5,"N/A"]
[null,"M400","LITHGOW","Urban",750.5,3778.25476996109,4256.5092256322196,163.80000000000001,0.67434457829079997,5.3321922373829635E-3,5,5.4405445324729997E-2,5.1802759945890911E-2,9.2133628415875201E-4,9.1058138590008949E-4,1,4.3019593034649892E-4,"N/A",1.1949886954069415E-6,"N/A"]
[null,"MG1204","MITTAGONG","Urban",245,0,2951.71,33,1.8255355429E-2,0,1,1.4728237961E-3,1.4728237960871947E-3,2.9456475921743895E-4,2.9456475921743895E-4,0,0,"N/A",0,"N/A"]
[null,"MG1208","MITTAGONG","Urban",806,8081.9187554492901,1117.0857647648099,136,0.33267238820139999,1.6194312174285177,4,2.6839675160450001E-2,2.6839675160425871E-2,1.0917874844409748E-3,1.0917874844409748E-3,4,0.13065408901231795,"N/A",2.8082234342063125E-4,"N/A"]
[null,"MG1219","MITTAGONG","Rural short",583.5,39191.903407081903,1860.56,105,7.8241316247364008,0.69322942579509683,12,3.2914524043841595,1.3128744332904168,1.78777423055109E-2,1.4207708845273751E-2,10,0.29162746356448105,"N/A",7.4771479665273013E-4,"N/A"]
[null,"MG1234","MITTAGONG","Rural short",1308.5,8029.2144587510302,5027.22,224,0.41683191936979996,0.27549659893145312,8,0.17535267669852,0.17535267669807625,8.4020409256678769E-3,8.4020409256678769E-3,4,0.11589579348117317,"N/A",3.4893357177127405E-4,"N/A"]
[null,"MG1267","MITTAGONG","Rural short",1171,45689.425871112297,2785.0555436229301,147,9.5542720994446206,1.6612000566213507,17,4.0192871723232413,4.0187076933505388,3.4242071416900235E-2,3.4235840460261464E-2,10,0.69883294182155786,"N/A",1.8568250783542798E-3,"N/A"]
[null,"MG1282","MITTAGONG","Rural short",1421,37686.772754067199,2816.2985317008201,155,7.4186582437446003,4.1303012954317397,15,3.1208780329026897,1.1914996954011858,2.0767273290058456E-2,1.9178379347171405E-2,15,1.7375334135049754,"N/A",4.0189670320084246E-3,"N/A"]
[null,"MG1286","MITTAGONG","Rural short",1383.5,33322.585504821203,2162.13,119,7.4005659993865001,5.1885192798757007,16,3.1132669950444698,1.325287756624548,3.9646463960666622E-2,2.8605208796761303E-2,18,2.1827041105620948,"N/A",5.2963131429568377E-3,"N/A"]
[null,"MM1112","MAMRE","Urban",547.5,5998.3356189310798,5441.1476504361399,262,0.59616069435100005,0.22350772461696922,2,4.8097647857999998E-2,4.8097647857715239E-2,6.9320926531619162E-4,6.9320926531619162E-4,3,1.8032379413690746E-2,"N/A",4.7799547816277659E-5,"N/A"]
[null,"MM1142","MAMRE","Urban",1228,0,11697.632280404499,250,2.51797966761E-2,6.220890943613458E-3,4,2.0314807822029999E-3,2.0314807821918005E-3,5.9749434770347074E-6,5.9749434770347074E-6,1,5.0189525207091539E-4,"N/A",1.1949886954069415E-6,"N/A"]
[null,"MM1162","MAMRE","Urban",749,0,7671.7135174759196,285.98399999999998,0.14436651916950002,1.0945805731738917E-2,5,1.1647346206149999E-2,1.1647346206175205E-2,4.5474814061078257E-5,4.5474814061078257E-5,2,8.8309664590572972E-4,"N/A",2.389977390813883E-6,"N/A"]
[null,"MM1192","MAMRE","Urban",229,2735.28894386304,16086.27,116.544,2.8438358599E-3,6.220890943613458E-3,1,2.2943782952E-4,2.2943782951813276E-4,2.389977390813883E-6,2.389977390813883E-6,1,5.0189525207091539E-4,"N/A",2.389977390813883E-6,"N/A"]
[null,"MM1202","MAMRE","Urban",1399,0,10536.213671108901,230,1.575730073808,0.4436087708600549,4,0.12712832449945,0.12712832450442482,1.7433726846162187E-3,1.7433726846162187E-3,2,3.5789911427437898E-2,"N/A",1.2786379040854274E-4,"N/A"]
[null,"MM1222","MAMRE","Urban",939,48.59,7760.5260013823199,225.024,0.13924427561659999,0,3,1.123408872586E-2,1.1234088725520657E-2,3.2264694775987415E-5,3.2264694775987415E-5,0,0,"N/A",0,"N/A"]
[null,"MM1232","MAMRE","Urban",9,0,3576.18,60.96,0,5.9246580415366259E-3,0,0,0,0,0,1,4.7799547816277657E-4,"N/A",2.389977390813883E-6,"N/A"]
[null,"MM1242","MAMRE","Urban",4,0,1177.3900000000001,48.96,4.6321471160999999E-3,0,1,3.7371699095000002E-4,3.7371699095043901E-4,4.2768016466896421E-6,4.2768016466896421E-6,0,0,"N/A",0,"N/A"]
[null,"MM1252","MAMRE","Urban",639,140.61000000000001,4705.30800175072,151.488,0.10380259454,6.220890943613458E-3,1,8.3746893852999996E-3,8.3746893853499076E-3,2.861448505408997E-5,2.861448505408997E-5,1,5.0189525207091539E-4,"N/A",1.1949886954069415E-6,"N/A"]
[null,"MM1262","MAMRE","Urban",6,0,6033.05,120,0,2.9623290207683132E-4,0,0,0,0,0,1,2.389977390813883E-5,"N/A",1.1949886954069415E-6,"N/A"]
[null,"MM1292","MAMRE","Urban",9,0,2585.42,132.47999999999999,0,2.9623290207683132E-4,0,0,0,0,0,1,2.389977390813883E-5,"N/A",1.1949886954069415E-6,"N/A"]
[null,"MM1352","MAMRE","Urban",32,925.36,2726.53,50.975999999999999,4.3698250857300003E-2,2.7549659893145312E-2,2,3.5255311221600001E-3,3.5255311221588604E-3,4.1132768778733509E-5,4.1132768778733509E-5,1,2.2226789734569111E-3,"N/A",7.1699321724416489E-6,"N/A"]
[null,"MM1362","MAMRE","Urban",128.5,4869.6392778004101,8029.4553739169896,227,0.14721294068510002,1.7687029767850329,2,1.187699264405E-2,1.1876992643649591E-2,1.959781460467384E-4,1.959781460467384E-4,4,0.14269718508462909,"N/A",2.9874717385173534E-4,"N/A"]
[null,"MM1372","MAMRE","Urban",898,0,7291.9356364180803,224.5,8.9788192619800006E-2,0,3,7.2440214714900005E-3,7.2440214715568784E-3,6.5724378247381776E-5,6.5724378247381776E-5,0,0,"N/A",0,"N/A"]
[null,"MM1382","MAMRE","Urban",482.5,0,6625.0291278160003,185,6.9629543632699992E-2,0,6,5.6176418571099998E-3,5.6176418571080317E-3,5.8554446074940124E-5,5.8554446074940124E-5,0,0,"N/A",0,"N/A"]
[null,"MM1392","MAMRE","Urban",640.5,0,4948.69497740922,144,1.3478597044E-3,0,1,1.0874397128E-4,1.0874397128203168E-4,1.1949886954069415E-6,1.1949886954069415E-6,0,0,"N/A",0,"N/A"]
[null,"MR2205","MUNGERIE PARK","Urban",763.5,3800.40640888604,16311.140000000001,94.176000000000002,0.91485607148330006,3.2099797269045443,4,7.3809671760559997E-2,7.3809671760505138E-2,1.1770638649758374E-3,1.1770638649758374E-3,29,0.25897795006859237,"N/A",5.1623511641579875E-4,"N/A"]
[null,"MR2218","MUNGERIE PARK","Rural short",1,5614.98,8825.86,7.4880000000000004,0.24025969522999999,0,1,0.10107234764,0.1010723476375328,9.1595062589959432E-4,9.1595062589959432E-4,0,0,"N/A",0,"N/A"]
[null,"MR2224","MUNGERIE PARK","Urban",1167.5,2318.1546702041401,19430.79,128.06399999999999,0.41674044663999998,0.68074320897255836,1,3.3622201934E-2,3.3622201933969705E-2,2.9157724167929371E-4,2.9157724167929371E-4,9,5.492168044090303E-2,"N/A",1.3742369997179826E-4,"N/A"]
[null,"MR2225","MUNGERIE PARK","Urban",1975,306.12929193794702,16045.2596818492,245.76,0.16152098985799998,0.35622006474738965,6,1.303135172341E-2,1.3031351723412696E-2,1.5056857562127462E-4,1.5056857562127462E-4,6,2.8739478124536942E-2,"N/A",8.723417476470672E-5,"N/A"]
[null,"MR2231","MUNGERIE PARK","Urban",1124.5,0,14223.609282498701,160.512,0.33349900115800002,0.14663528652803151,3,2.6906365465600001E-2,2.6906365465782692E-2,5.9749434770347071E-5,5.9749434770347071E-5,1,1.183038808452872E-2,"N/A",7.1699321724416482E-5,"N/A"]
[null,"MR2232","MUNGERIE PARK","Rural short",528.5,24957.647492219701,4740.95,95.04,4.6538686848291002,1.3250793942798742,12,1.9577875229191002,1.903746435984055,1.3614560841563034E-2,1.2735995955496076E-2,13,0.55743384281788788,"N/A",1.5888939428870515E-3,"N/A"]
[null,"MR2272","MUNGERIE PARK","Rural short",215,5166.24,7172.61,18.623999999999999,4.35018016696E-2,0,2,1.83003196479E-2,1.8300319648075568E-2,7.4771479665273002E-5,7.4771479665273002E-5,0,0,"N/A",0,"N/A"]
[null,"MR2291","MUNGERIE PARK","Urban",205,0,4872.4680065030798,99.263999999999996,3.8273290947999999E-2,9.0647268035510389E-2,1,3.0878507889000001E-3,3.0878507889315369E-3,2.2704785212731886E-5,2.2704785212731886E-5,1,7.3133308158904817E-3,"N/A",4.0629615643836007E-5,"N/A"]
[null,"MR2292","MUNGERIE PARK","Urban",1220,1359.0236609992201,7690.97,172.03200000000001,1.9903888691,2.0884419596416608E-2,1,0.16058258088999999,0.1605825808887848,1.5044907675173392E-3,1.5044907675173392E-3,2,1.6849340605237875E-3,"N/A",5.9749434770347074E-6,"N/A"]
[null,"MR2298","MUNGERIE PARK","Urban",1183.5,0,15324.184174879099,252.57599999999999,1.7227572536670002,0,2,0.13899033015200002,0.13899033015147677,1.4495212875286199E-3,1.4495212875286199E-3,0,0,"N/A",0,"N/A"]
[null,"MR2299","MUNGERIE PARK","Urban",1465,0,11365.3770561243,274.75200000000001,0.145065252147,0.23217253700271653,5,1.17037192828E-2,1.1703719282815585E-2,1.6012848518453013E-4,1.6012848518453013E-4,3,1.8731447800503807E-2,"N/A",7.5284287810637308E-5,"N/A"]
[null,"MVB2","MOSS VALE","Rural short",1177,132687.79396053401,929.68,152,5.1646064777709508,2.8512416824895013,33,2.1726444830261253,1.3626043723650199,1.9245999582150369E-2,1.4601640132955675E-2,16,1.1994591529637546,"N/A",3.1030164061088298E-3,"N/A"]
[null,"MVC2","MOSS VALE","Rural short",762,73387.099696574107,257.14999999999998,68,1.2905798905551997,0.91365632823046694,12,0.54292060609267012,0.2591379169285391,5.7297199807392601E-3,5.4244031054393954E-3,7,0.38435656026269716,"N/A",1.7882845553277794E-3,"N/A"]
[null,"MVD2","MOSS VALE","Rural short",1597,22385.834971780099,4646.4506494712596,180,0.22371453491893001,7.7638940723061527,8,9.4112136551180003E-2,9.4112136551618999E-2,1.0682305557431078E-2,1.0682305557431078E-2,15,3.2661116961287067,"N/A",6.9849023920642538E-3,"N/A"]
[null,"MVE2","MOSS VALE","Rural short",487.5,13170.482953368501,2371.4725794861802,157,1.9250096711453999,0.98029391955265022,4,0.80981225959699998,1.8374840206903494E-2,6.106287321829826E-3,3.0655804821087232E-3,8,0.41238963418053576,"N/A",1.6138177694421424E-3,"N/A"]
[null,"MVF2","MOSS VALE","Rural short",1070.5,83543.382806328504,7066.47,109,2.2077491111009002,2.3557180955404817,17,0.9287549684075298,0.36846111649305113,1.4656401528893932E-2,7.9643540988519959E-3,20,0.99100249861361212,"N/A",2.6170017882845551E-3,"N/A"]
[null,"MVG2","MOSS VALE","Urban",12,2815.8563696720998,1616.9,180,8.9050514259000001E-4,0,1,7.1845063201000003E-5,7.1845063200920613E-5,1.4369012640184122E-5,1.4369012640184122E-5,0,0,"N/A",0,"N/A"]
[null,"MVH2","MOSS VALE","Rural short",1521.5,48889.3868394776,2532.7800000000002,143,0.58718032193870007,2.655802025344312,8,0.24701477111030001,0.14046541259065426,1.0206498390869798E-2,1.0081879258094343E-2,14,1.1172416801151481,"N/A",3.0656306662761932E-3,"N/A"]
[null,"MYB2","MOUNT OUSLEY","Urban",40,0,1715.84,191,0,3.2378256196997662E-2,0,0,0,0,0,2,2.6122452881595739E-3,"N/A",4.7799547816277659E-6,"N/A"]
[null,"MYC2","MOUNT OUSLEY","Urban",1156,3736.6909819493499,2335.7344485783401,133,1.4219179299999999E-3,0.74428516646803866,1,1.1471891476E-4,0,1.1949886954069415E-6,0,3,6.0048181944198809E-2,"N/A",2.4736265994923685E-4,"N/A"]
[null,"MYE2","MOUNT OUSLEY","Rural short",403,6316.5909161141299,1264.97,55.52,0.71384723577760001,0.41524447048619828,4,0.30030095520099997,0.3003009552056527,2.5048445687866458E-3,2.5048445687866458E-3,3,0.17468486936799407,"N/A",5.8570992404463856E-4,"N/A"]
[null,"MYF2","MOUNT OUSLEY","Urban",4,0,2770.41,89.28,0,9.7756857685354342E-3,0,0,0,0,0,2,7.8869253896858137E-4,"N/A",3.5849660862208244E-6,"N/A"]
[null,"MYG2","MOUNT OUSLEY","Urban",1616,5973.0586294619297,3529.43,195,4.9568799620365995,4.2995539640333371,5,0.39991611178391001,0.3999161117935825,2.9743268628678772E-3,2.9743268628678772E-3,8,0.34688370848011779,"N/A",9.1177637459549632E-4,"N/A"]
[null,"MYK2","MOUNT OUSLEY","Urban",661.5,1648.6555822938799,2825.3,168,5.0803942706000001E-3,0.32348632906789981,1,4.0988112252000002E-4,4.0988112252458094E-4,1.1949886954069415E-6,1.1949886954069415E-6,1,2.6098553107687602E-2,"N/A",5.7359457379533191E-5,"N/A"]
[null,"MYM2","MOUNT OUSLEY","Urban",1352,7629.8878469402098,860.84,158.08000000000001,4.2302058416499998E-2,2.5293698227379204,2,3.41288771405E-3,3.4128877140822251E-3,5.8554446074940131E-5,5.8554446074940131E-5,4,0.20406702452594799,"N/A",5.9868933639887763E-4,"N/A"]
[null,"MYQ2","MOUNT OUSLEY","Urban",1921.5,8905.5639690563003,2385.0721400110501,153,1.460961426488,2.6459819046404651,2,0.11786890495765,0.11786890496015907,2.2931833064859207E-3,2.2931833064859207E-3,9,0.21347517052488685,"N/A",4.839704216398113E-4,"N/A"]
[null,"NA1207","NOWRA","Rural short",1564.5,35162.187375661997,2413.99854260132,224,13.060627231257639,1.9410364675682295,17,5.4943391758973474,2.7263052296419064,3.7840599667266925E-2,2.6070322576625185E-2,16,0.8165544055978915,"N/A",2.623232744923328E-3,"N/A"]
[null,"NA1207/NA1266","NOWRA","Urban",0,0,0,0,0,0.45960534757220378,0,0,0,0,0,1,3.7080499218477392E-2,"N/A",1.2786379040854274E-4,"N/A"]
[null,"NA1214","NOWRA","Urban",629.5,3325.77,864.69,184.38,0.91599656815530006,0.582986351287204,7,7.3901685889809998E-2,7.3901685890051486E-2,3.7403146166237265E-4,3.7403146166237265E-4,1,4.7034755051217216E-2,"N/A",9.7989073023369198E-5,"N/A"]
[null,"NA1218","NOWRA","Urban",697,3990.85,1536.89,152,0.98642594062860001,1.0476276581947139,5,7.9583857136860003E-2,7.9583857136711497E-2,1.3778219658042035E-3,1.3778219658042035E-3,3,8.4521550426132963E-2,"N/A",1.9119819126511064E-4,"N/A"]
[null,"NA1225","NOWRA","Rural short",437.5,27969.286843436399,741.41704620466203,113.28,2.8305053793800002E-2,0.26274377249704556,3,1.1907358136800002E-2,1.1907358136694728E-2,1.4331200269177328E-4,1.4331200269177328E-4,3,0.11053093981518983,"N/A",2.4300730891213727E-4,"N/A"]
[null,"NA1236","NOWRA","Urban",1344,3482.85,6456.5399146029604,187.98,0.40739429858999998,1.5380412275829083,3,3.2868164067200001E-2,3.2868164067167929E-2,3.9912622426591842E-4,3.9912622426591842E-4,3,0.1240876261310568,"N/A",2.9277223037470066E-4,"N/A"]
[null,"NA1266","NOWRA","Urban",493,3704.22,516.62,126,0,1.9387702858673417,0,0,0,0,0,8,0.1564180452852916,"N/A",3.6925150688074492E-4,"N/A"]
[null,"NA1270","NOWRA","Rural short",743.5,57993.7348840337,3758.7054437188799,91,0.82601582415039998,-0.13001662072152126,11,0.34748798983278006,0.33577379135018603,6.6671236034868424E-4,6.4178853379359322E-4,13,-5.4695337375147209E-2,"N/A",2.9347805768619654E-3,"N/A"]
[null,"NA1281","NOWRA","Urban",1772,4016.36,6192.41,201,0.33019600429779999,5.8540213060364055,4,2.6639882986669E-2,2.6639882986706942E-2,1.3981367736261215E-4,1.3981367736261215E-4,18,0.47229657707438089,"N/A",1.30492765538438E-3,"N/A"]
[null,"NA1285","NOWRA","Urban",358.5,3411.16,989.99,150.66,0.19311422885999999,0,1,1.5580262611E-2,1.5580262610715703E-2,4.3019593034649892E-4,4.3019593034649892E-4,0,0,"N/A",0,"N/A"]
[null,"NA1288","NOWRA","Urban",429.5,2100.96,1457.95,130.74,7.2828858975899996E-2,2.9623290207683129E-3,3,5.8757594153500004E-3,5.8757594153159304E-3,4.4214581730056833E-5,4.4214581730056833E-5,1,2.3899773908138828E-4,"N/A",1.1949886954069415E-6,"N/A"]
[null,"NE1212","NORTH EASTERN CREEK","Urban",27,0,7030.29,152.01,3.5547948248999999E-3,2.5979625512138105E-2,1,2.867972869E-4,2.8679728689766593E-4,1.1949886954069415E-6,1.1949886954069415E-6,5,2.0960101717437752E-3,"N/A",7.1699321724416489E-6,"N/A"]
[null,"NE1216","NORTH EASTERN CREEK","Urban",14,1923.6251018488099,3934.99,59.01,1.6396491129999999E-2,5.3321922373829635E-3,3,1.3228524858199999E-3,1.322852485815484E-3,1.0754898258662473E-5,1.0754898258662473E-5,1,4.3019593034649892E-4,"N/A",1.1949886954069415E-6,"N/A"]
[null,"NE1219","NORTH EASTERN CREEK","Urban",15.5,0,6618.3,148.99,3.6436646955000001E-3,0,1,2.9396721907E-4,2.9396721907010761E-4,2.389977390813883E-6,2.389977390813883E-6,0,0,"N/A",0,"N/A"]
[null,"NE1241","NORTH EASTERN CREEK","Urban",12,854.97,2886.42,117.87,0,1.2738014789303746E-2,0,0,0,0,0,2,1.0276902780499697E-3,"N/A",3.5849660862208244E-6,"N/A"]
[null,"NG1210","NORTH WARRAGAMBA","Rural short",700.5,38199.489657439903,2647.73,188,1.6574230871E-2,-0.54654970433175376,1,6.9724404788000004E-3,0,3.1154783193863753E-5,0,5,-0.22992229997071451,"N/A",7.2902192673641184E-4,"N/A"]
[null,"NG1247","NORTH WARRAGAMBA","Urban",881.5,9153.2692923747709,85.19,173,0.17033391869299999,0.50789131061072734,4,1.37423699972E-2,1.3742369997179827E-2,1.1949886954069414E-4,1.1949886954069414E-4,2,4.0976162365504019E-2,"N/A",8.6039186069299787E-5,"N/A"]
[null,"NG1262","NORTH WARRAGAMBA","Rural short",362,10002.917299566099,731.64,123,7.7761136795E-3,0.5044846322368437,1,3.2712522353999999E-3,3.2712522353556942E-3,3.1154783193863753E-5,3.1154783193863753E-5,4,0.21222638311659989,"N/A",4.1747409479777432E-4,"N/A"]
[null,"NG1299","NORTH WARRAGAMBA","Rural short",238.5,20190.711984119702,2382.73,75,2.9193752499720001E-2,0.21787929947750942,3,1.228121553545E-2,1.2281215535021092E-2,4.9847653110182004E-5,4.9847653110182004E-5,3,9.1657372156347158E-2,"N/A",2.4300730891213727E-4,"N/A"]
[null,"NM1210","NORTHMEAD","Urban",337,2173.9306048876601,1517.1915434934699,94.847999999999999,2.4644509831E-2,1.2043348633933577,1,1.9882943754999998E-3,1.9882943754712321E-3,3.9765887509424642E-4,3.9765887509424642E-4,4,9.7164530823538403E-2,"N/A",2.2346288604109806E-4,"N/A"]
[null,"NM1213","NORTHMEAD","Urban",664.5,3803.9284883022801,1592.29,143.71199999999999,4.8115471579000001E-2,1.7763605973037191,1,3.8819080667999999E-3,3.8819080668101454E-3,7.7638161336202906E-4,7.7638161336202906E-4,7,0.14331499424015448,"N/A",3.3579182340935052E-4,"N/A"]
[null,"NM1221","NORTHMEAD","Urban",758.5,5103.6476961709104,75.69,169.24799999999999,0.33417283880969995,0,3,2.6960730012969999E-2,2.6960730012585955E-2,1.0572050110589704E-3,1.0572050110589704E-3,0,0,"N/A",0,"N/A"]
[null,"NM1228","NORTHMEAD","Urban",567,79.48,2877.35,104.256,4.1587610343E-2,0,1,3.3552467588999998E-3,3.3552467589397102E-3,6.7104935178794215E-4,6.7104935178794215E-4,0,0,"N/A",0,"N/A"]
[null,"NM1236","NORTHMEAD","Urban",398,2898.4310813687398,515.88,80.736000000000004,0.199822160267,0,2,1.6121451799E-2,1.6121451799081053E-2,5.6663550123117301E-4,5.6663550123117301E-4,0,0,"N/A",0,"N/A"]
[null,"NM1239","NORTHMEAD","Urban",1204.5,4633.4229940088999,1294.8,195.36,0.50288601707799996,0.13734838504792285,5,4.0572340296099997E-2,4.0572340295651294E-2,1.6161195335073107E-3,1.6161195335073107E-3,1,1.1081130172508568E-2,"N/A",3.9434626948429067E-5,"N/A"]
[null,"NM1243","NORTHMEAD","Urban",1285.5,3242.74977683514,3071.0883954963201,239,1.8969226100299998,0,4,0.1530418167016,0.15304181669862796,3.2409712352549011E-3,3.2409712352549011E-3,0,0,"N/A",0,"N/A"]
[null,"NM1258","NORTHMEAD","Urban",1898.5,6069.65713989916,1080.7955495681299,289.24799999999999,1.496801674204,0,7,0.12076046025960001,0.1207604602590171,2.6394275616094974E-3,2.6394275616094974E-3,0,0,"N/A",0,"N/A"]
[null,"NN1207","NEPEAN","Urban",1256.5,1099.19,16122.62,212,0,1.8060579457369212,0,0,0,0,0,4,0.14571094657444542,"N/A",3.5491164253586161E-4,"N/A"]
[null,"NN1214","NEPEAN","Rural short",762.5,2440.8146713646302,9393.7121630184902,168,2.3701661060999997,0.28364300373856599,2,0.99708048162999996,0.10301920640247991,1.0344018389512651E-2,4.7236955013396304E-3,2,0.11932281963249818,"N/A",3.7385739832636506E-4,"N/A"]
[null,"NN1233","NEPEAN","Rural short",762,35902.6308986355,10484.82,253,7.3694155281932003,9.0647268035510389E-2,20,3.1001626280120091,3.0332982322776014,1.7521450068228975E-2,1.7477833371757564E-2,6,3.8133454629289236E-2,"N/A",1.2461913277545501E-4,"N/A"]
[null,"NN1236","NEPEAN","Urban",1025.5,0,9932.2000000000007,215,0,5.3321922373829635E-3,0,0,0,0,0,1,4.3019593034649892E-4,"N/A",1.1949886954069415E-6,"N/A"]
[null,"NN1240","NEPEAN","Urban",666,5974.06,3955.17,205,1.0368151572700001E-2,0,2,8.3649208678999998E-4,8.3649208678485902E-4,5.1384513902498479E-5,5.1384513902498479E-5,0,0,"N/A",0,"N/A"]
[null,"NN1251","NEPEAN","Rural short",176.5,26972.302017406499,2044.46,118,5.1900004444199996E-2,0.27958461298011339,3,2.1833272062199999E-2,8.4491772021758511E-3,8.7233392942818512E-5,4.9847653110182004E-5,6,0.11761553751347445,"N/A",3.6139548504881956E-4,"N/A"]
[null,"NN1255","NEPEAN","Urban",1111.5,1094.1400000000001,8898.5300000000007,208,1.0545891314E-2,0,1,8.5083195112999998E-4,8.5083195112974227E-4,1.1949886954069415E-6,1.1949886954069415E-6,0,0,"N/A",0,"N/A"]
[null,"NN1262","NEPEAN","Urban",1456,4665.54,9844.2999999999993,252,0.571092600274,0.62312590951861468,6,4.6075179129199999E-2,4.6075179128805439E-2,3.6686152948993108E-4,3.6686152948993108E-4,3,5.0273174415770026E-2,"N/A",1.1591390345447332E-4,"N/A"]
[null,"NN1277","NEPEAN","Urban",1350.5,9160.5358016960308,6301.4357310918904,260,0.73735331655978009,0.6718562219102534,12,5.9488927234328998E-2,5.9488927234748357E-2,3.3937678949557136E-4,3.3937678949557136E-4,2,5.4204687223658864E-2,"N/A",1.5295855301208851E-4,"N/A"]
[null,"NN1281","NEPEAN","Urban",41,465.44,2023.63,27,0,7.9982883560744452E-3,0,0,0,0,0,1,6.4529389551974843E-4,"N/A",1.1949886954069415E-6,"N/A"]
[null,"NN1285","NEPEAN","Urban",567,2953.4003880691098,6771.94,115,5.3188617567899998E-2,0,3,4.2912044051199999E-3,4.2912044052063267E-3,1.7924830431104124E-5,1.7924830431104124E-5,0,0,"N/A",0,"N/A"]
[null,"NWA2","NORTH WOLLONGONG","Urban",1669.5,2302.8235598869001,3683.6340247622002,148,0.20174941795850002,1.9051478514816214,2,1.6276941020380003E-2,1.627694102013795E-2,2.8679728689766596E-5,2.8679728689766596E-5,4,0.15370542094671785,"N/A",4.5529069295004469E-4,"N/A"]
[null,"NWB2","NORTH WOLLONGONG","Urban",1713.5,1878.3284644043999,2069.4899999999998,129,0.80754570271049997,0.39369352686010883,2,6.5151978662450011E-2,6.5151978662281854E-2,2.5333760342627159E-4,2.5333760342627159E-4,2,3.1762799523916502E-2,"N/A",1.5893349648912322E-4,"N/A"]
[null,"NWD2","NORTH WOLLONGONG","Urban",1734,1860.74175069332,1542.33,109,0.24716192184410002,0.94609383100788003,2,1.994077636058E-2,1.9778257897680288E-2,1.6968839474778568E-4,1.6849340605237873E-4,3,7.6329902919118384E-2,"N/A",3.6447155209911713E-4,"N/A"]
[null,"NWE2","NORTH WOLLONGONG","Urban",470.5,3007.5322844521102,373.67,104.83199999999999,0,1.0129684086517248,0,0,0,0,0,2,8.1725276878880732E-2,"N/A",2.5931254690330632E-4,"N/A"]
[null,"NWF2","NORTH WOLLONGONG","Urban",1524.5,4401.7542585041401,2617.1010306562898,173,5.4467603122775996,1.3888139031617044,6,0.4394391679029,0.4368066078094901,1.9072019578694785E-3,1.8892771274383743E-3,5,0.11204811502483186,"N/A",2.7723737733441041E-4,"N/A"]
[null,"NWG2","NORTH WOLLONGONG","Urban",33,0,2052.2199999999998,148.512,0,3.1993153424297781E-2,0,0,0,0,0,1,2.5811755820789937E-3,"N/A",9.5599095632555318E-6,"N/A"]
[null,"OA1207","THE OAKS","Rural short",915,35204.043559166799,1910.16,177,3.0804963253711999,0.22698846121637201,16,1.2959018998158403,1.2959018998186791,1.8705331829595797E-2,1.8705331829595797E-2,9,9.5489410489192406E-2,"N/A",3.177787885774103E-4,"N/A"]
[null,"OA1233","THE OAKS","Rural short",635,58997.166833968899,279.91000000000003,146,1.4775504689840999,1.1281141376889889,13,0.62157531046032011,0.62157531045741443,4.9972272242957468E-3,4.9972272242957468E-3,15,0.47457458143548781,"N/A",2.1621419536541446E-3,"N/A"]
[null,"OA1244","THE OAKS","Rural short",367,23936.5894567287,608.16999999999996,90,3.4645520158115999,1.2703948005564911,8,1.4574662862780001,1.4509237818043383,1.1683192390974057E-2,1.1371644559035419E-2,10,0.53442915090753884,"N/A",1.5078915065830057E-3,"N/A"]
[null,"OP1112","ORAN PARK","Rural short",26.5,11742.6561498091,127.78,9,2.6764642702500001E-2,4.4434935311524698E-3,3,1.12593386463E-2,1.125933864626236E-2,4.9847653110182004E-5,4.9847653110182004E-5,1,1.8692869916318252E-3,"N/A",6.2309566387727505E-6,"N/A"]
[null,"OP1122","ORAN PARK","Urban",220,5015.3,4608.1899999999996,50,3.2126458230000002E-2,7.1984595204670015E-2,1,2.5919304803E-3,2.591930480337656E-3,1.0754898258662473E-5,1.0754898258662473E-5,1,5.8076450596777351E-3,"N/A",1.0754898258662473E-5,"N/A"]
[null,"OP1162","ORAN PARK","Urban",383,597.52,18752.64,178,0,0.32673007934564108,0,0,0,0,0,8,2.6360255631981723E-2,"N/A",2.4019272777679522E-3,"N/A"]
[null,"OP1232","ORAN PARK","Urban",1645.5,0,20509.009999999998,315,0,0.38043710449217061,0,0,0,0,0,5,3.0693284641527291E-2,"N/A",1.2786379040854274E-4,"N/A"]
[null,"OP1282","ORAN PARK","Urban",367.5,2244.5700000000002,13010.5,83,0.130386911849,1.5852903754641627,4,1.05194854857E-2,1.0519485485667307E-2,8.723417476470673E-4,8.723417476470673E-4,5,0.12789964006940494,"N/A",2.7365241124818957E-4,"N/A"]
[null,"P608","OAKDALE","Rural short",153,26611.1370514677,0,36,0.53387093612800007,0.25779668303236247,4,0.2245886010881,5.8396525618578221E-2,1.0904174117852313E-3,1.3708104605300052E-4,5,0.10844980029783972,"N/A",3.4893357177127405E-4,"N/A"]
[null,"PCA2","PORT CENTRAL","Urban",76,4184.3501498329597,2233.61,83,0,2.8882707952491054E-3,0,0,0,0,0,1,2.3302279560435358E-4,"N/A",1.1949886954069415E-6,"N/A"]
[null,"PCB2","PORT CENTRAL","Urban",1068,7299.5618614383302,1594.9098991216099,105.88800000000001,0.48901184239600004,1.9746589019539498,3,3.9452985774900001E-2,3.9452985774739595E-2,1.3763219799939653E-3,1.3763219799939653E-3,7,0.15931350289426263,"N/A",4.4573078338678917E-4,"N/A"]
[null,"PCC2","PORT CENTRAL","Urban",62,387.27482072406701,3609.7,144,1.2589898338E-2,0,1,1.0157403911E-3,1.0157403910959002E-3,1.1949886954069415E-6,1.1949886954069415E-6,0,0,"N/A",0,"N/A"]
[null,"PCD2","PORT CENTRAL","Urban",559,3837.4206972362799,1101.29,99.168000000000006,0,0.21373203884843378,0,0,0,0,0,1,1.7243686874722164E-2,"N/A",4.4214581730056833E-5,"N/A"]
[null,"PCE2","PORT CENTRAL","Urban",977.5,4315.7625736830896,629.71,161.47200000000001,0.88230007555000012,1.3383802515831238,2,7.1183086608000004E-2,7.1183086608000684E-2,1.852232477880759E-4,1.852232477880759E-4,4,0.10797917851697122,"N/A",2.8560229820225898E-4,"N/A"]
[null,"PCF2","PORT CENTRAL","Urban",643.5,2284.6571742396,1466.07,197.76,0,0.67741058882419403,0,0,0,0,0,2,5.4652807984436468E-2,"N/A",1.2547381301772885E-4,"N/A"]
[null,"PH1201","PENRITH","Urban",611,363.64613610894003,4585.8478034904101,150.24,1.1656764696839999E-2,0.55899148621898065,2,9.4045610329000003E-4,9.4045610328526293E-4,8.3649208678485904E-6,8.3649208678485904E-6,2,4.5098873364657968E-2,"N/A",2.1390297647784251E-4,"N/A"]
[null,"PH1219","PENRITH","Urban",1080,7362.7794311218704,818.43243788678296,183.16800000000001,1.1323387156658999,1.5163273558606765,4,9.1355953718060004E-2,9.135595371776542E-2,1.5453092320345998E-3,1.5453092320345998E-3,4,0.12233577270359022,"N/A",3.2264694775987422E-4,"N/A"]
[null,"PH1223","PENRITH","Urban",4,172.729849715358,671.89461225668595,1,0,9.123973383966405E-2,0,0,0,0,0,1,7.3611303637067596E-3,"N/A",1.6729841735697181E-5,"N/A"]
[null,"PH1234","PENRITH","Urban",12,0,4247.7694951677204,235.2,0,9.3313364154201869E-3,0,0,0,0,0,1,7.5284287810637308E-4,"N/A",3.5849660862208244E-6,"N/A"]
[null,"PH1238","PENRITH","Urban",36,0,2152.89,205.44,0,0.11330908504438798,0,0,0,0,0,1,9.1416635198631017E-3,"N/A",1.1949886954069415E-5,"N/A"]
[null,"PH1249","PENRITH","Urban",423.5,0,2488.91,127.2,0.36475157233,2.2513700557839179E-2,1,2.9427791613E-2,2.942779161309134E-2,5.0787019554795012E-4,5.0787019554795012E-4,1,1.816382817018551E-3,"N/A",4.7799547816277659E-6,"N/A"]
[null,"PH1260","PENRITH","Urban",719.5,1979.8298558098099,3776.3505662344,138.24,1.8662080365,0.29282622370294775,1,0.15056379567,0.150563795666493,8.5800188330218395E-4,8.5800188330218395E-4,3,2.3624926508195233E-2,"N/A",9.6794084327962252E-5,"N/A"]
[null,"PH1264","PENRITH","Urban",278.5,141.91478908644399,6222.1534667610704,223.87200000000001,0.57996477569000005,0.10017115583728051,1,4.6790977357000003E-2,4.6790977357354199E-2,3.3101186862772279E-4,3.3101186862772279E-4,2,8.0817085470371447E-3,"N/A",3.5849660862208241E-5,"N/A"]
[null,"PH1267","PENRITH","Urban",144,1819.10422223918,3849.0452544295099,219.16800000000001,3.4407451576000003E-2,0,1,2.7759587393999998E-3,2.7759587394303249E-3,2.7484739994359652E-5,2.7484739994359652E-5,0,0,"N/A",0,"N/A"]
[null,"PH1271","PENRITH","Urban",145.5,3470.6395767058998,1350.36876943078,86.4,1.8070207027000001E-3,0,1,1.4578862084000001E-4,1.4578862083964686E-4,2.389977390813883E-6,2.389977390813883E-6,0,0,"N/A",0,"N/A"]
[null,"PH1286","PENRITH","Urban",1541,2985.48028279747,6146.62,244.8,10.279026644909999,11.167684175394463,8,0.82930157686340011,0.82930157686181827,7.6441538356415272E-3,7.6441538356415272E-3,11,0.90099757656292567,"N/A",2.0386507143642422E-3,"N/A"]
[null,"PH1293","PENRITH","Urban",894,1030.3716559325501,4317.4814119499497,315.16800000000001,0.44125371928799995,0.50892812576799618,3,3.5599908224599998E-2,3.5599908224868193E-2,1.6729841735697181E-4,1.6729841735697181E-4,5,4.1059811574182509E-2,"N/A",2.3182780690894663E-4,"N/A"]
[null,"PH1297","PENRITH","Urban",399.5,0,3057.99904555793,226.27199999999999,1.0590326249E-2,1.1108733827881174E-2,1,8.5441691722000002E-4,8.5441691721596311E-4,9.5599095632555318E-6,9.5599095632555318E-6,1,8.9624152155520613E-4,"N/A",3.5849660862208244E-6,"N/A"]
[null,"PK1221","PORT KEMBLA","Urban",1325.5,10902.0208838406,1161.15446355526,205.34399999999999,3.4999567354321002,2.2235241629886957,6,0.28237300475348004,5.3759717433069974E-2,1.9397716497601717E-3,1.0291902638600824E-3,7,0.17939170295449006,"N/A",5.4013489032393757E-4,"N/A"]
[null,"PK1225","PORT KEMBLA","Urban",1589,7606.7361443995796,932.88,162.33600000000001,1.4416322296244,5.0800980377155804,5,0.11630944471233,0.116309444712653,2.0972051604391823E-3,2.0972051604391823E-3,10,0.40985722275067277,"N/A",1.2057435936656039E-3,"N/A"]
[null,"PK1236","PORT KEMBLA","Urban",873,9099.4045767316202,3243.24,155.232,8.5907541601999999E-3,0.38214044367911237,1,6.9309344334000001E-4,6.9309344333602608E-4,5.9749434770347074E-6,5.9749434770347074E-6,4,3.0830708341499088E-2,"N/A",7.5284287810637308E-5,"N/A"]
[null,"PK1262","PORT KEMBLA","Urban",1031.5,7475.1220794610999,688.61761970417399,120.96,1.1377268953640001,0.47486134202916058,5,9.1790666660499995E-2,9.1790666660293396E-2,3.0364662750290384E-3,3.0364662750290384E-3,2,3.8311337574746543E-2,"N/A",1.4817859823046075E-4,"N/A"]
[null,"PK1288","PORT KEMBLA","Urban",1965,10757.660178075001,3342.6967895149601,215.04,2.7932392802599999,1.8509372304015612,2,0.22535574813100001,0.22535574813462264,4.6963055729492796E-3,4.6963055729492796E-3,4,0.14933176232152845,"N/A",4.5768067034085858E-4,"N/A"]
[null,"R208","WENTWORTH FALLS","Rural short",1091.5,10362.211786503,396.33,89,5.7015057963610003,0.47945295201135146,12,2.398507062777,1.6706503249443889,2.0549694994672532E-2,1.5546236813738012E-2,7,0.20169606639707394,"N/A",4.9224557446304732E-4,"N/A"]
[null,"R210","WENTWORTH FALLS","Rural short",1176.5,16771.2400406532,1687.2150652647899,99,7.3707930112822,0,11,3.1007421069563499,2.9814815968695676,4.2295733663989428E-2,4.1610328433724426E-2,0,0,"N/A",0,"N/A"]
[null,"R211","WENTWORTH FALLS","Rural short",1341.5,17758.0465361481,782.89808253214505,108.288,5.0796685000137005,7.9717755113385689,18,2.1369128102303199,1.5615587361127554,2.2718067904965451E-2,2.0668083170809218E-2,18,3.3535631725538821,"N/A",8.006779280822985E-3,"N/A"]
[null,"R246","BLAXLAND","Urban",1098,9458.2572395822608,2138.6683782344398,226.65600000000001,1.6303473998700002,0.11322021517376493,3,0.13153479568000001,0.13153479568083287,1.4650561405689104E-3,1.4650561405689104E-3,2,9.1344935876906605E-3,"N/A",5.0189525207091539E-5,"N/A"]
[null,"R247","BLAXLAND","Urban",911.5,5120.5075879545202,896.61634200997901,237.96,5.1078277043199005,8.1612164522167033E-2,3,0.41209442447903999,0.41209442448395517,1.8306602208639218E-3,1.8306602208639218E-3,1,6.5843877116922474E-3,"N/A",4.5409570425463773E-5,"N/A"]
[null,"R248","BLAXLAND","Urban",0,0,0,0,5.9607176732199996,0.34770336881268077,4,0.48090473313599996,0.48090473313603743,2.1052627093753767E-3,2.1052627093753767E-3,3,2.8052359624677951E-2,"N/A",1.1830388084528721E-4,"N/A"]
[null,"R250","BLAXLAND","Urban",1224.5,9314.0685122308096,1032.20668908221,260,7.626413163706899,1.9899445197011143,11,0.61529137736761996,0.60923875962951612,3.6962032360280043E-3,3.6268938916944019E-3,5,0.1605467312279226,"N/A",4.0749114513376704E-4,"N/A"]
[null,"R251","BLAXLAND","Urban",323,1975.2269971411099,1444.85,75,1.80700792825,0.60016785960766028,2,0.145787590208,0.14578759020868962,6.4793560305916021E-4,6.4793560305916021E-4,2,4.8420941937889268E-2,"N/A",1.2905877910394969E-4,"N/A"]
[null,"R253","BLAXLAND","Urban",0,0,0,0,6.2541253956399991,1.3300857303249727,3,0.50457657437999992,0.50457657438338266,2.2506739924744489E-3,2.2506739924744489E-3,6,0.10730998484754334,"N/A",3.9195629209347679E-4,"N/A"]
[null,"R254","BLAXLAND","Urban",0,0,0,0,12.711611540703199,3.1266642231954354,5,1.0255600903947999,0.50112018159387528,3.8687641469462158E-3,2.3905631307278292E-3,4,0.25225613865692831,"N/A",5.8912942683562216E-4,"N/A"]
[null,"R256","BLAXLAND","Urban",1277,9155.7847397904898,1105.45979978681,256,7.4664119834126996,0,9,0.60238264236514494,0.60238264236558881,3.0249241525728099E-3,3.0249241525728099E-3,0,0,"N/A",0,"N/A"]
[null,"R257","BLAXLAND","Urban",739,14424.2335960202,3201.8131634517299,168,3.5316619608005997,0,5,0.28493095058246998,0.28493095058848422,1.2733319108855562E-3,1.2733319108855562E-3,0,0,"N/A",0,"N/A"]
[null,"R258","BLAXLAND","Urban",1116,6848.28166775311,747.45,274,0.74084886481099999,2.0124730319040576,3,5.9770944566899999E-2,5.9770944566864395E-2,2.8560229820225898E-4,2.8560229820225898E-4,2,0.16236430903363655,"N/A",3.8717633731184901E-4,"N/A"]
[null,"R259","BLAXLAND","Urban",0,0,0,0,1.6508319050529998,2.7234319968884524,5,0.13318746504660001,0.13318746504658063,1.896447059610816E-3,1.896447059610816E-3,4,0.21972376641316974,"N/A",5.3296495815149589E-4,"N/A"]
[null,"R260","HARTLEY VALE","Rural short",290.5,71921.328489516702,319.85000000000002,32,2.5807366079574607,2.4321313726312006,14,1.0856631918641502,1.0566892434995543,6.2371875954115238E-3,6.1748780290237972E-3,17,1.0231480039130407,"N/A",2.5546922218968276E-3,"N/A"]
[null,"R290","BYLONG","Rural short",42,36149.6060337901,0,3,0.16303177765788002,0.59332487956968549,5,6.8584139722780005E-2,6.858413972295857E-2,6.9786714354067882E-4,6.9786714354067882E-4,6,0.24959966103595885,"N/A",7.2279097009763911E-4,"N/A"]
[null,"R293","BYLONG","Rural short",94.5,85394.722954280296,0,7.9980000000000002,0.45815380635370001,0.13330480593457408,10,0.19273595075512001,0.19273595075046115,1.4705057667421446E-3,1.4705057667421446E-3,6,5.6078609748954754E-2,"N/A",4.4239792135286529E-4,"N/A"]
[null,"RBA2","ROBERTSON","Rural short",493.5,67770.665675804994,1891.75,52,2.28839992691295,1.640893291183984,28,0.96268311972099962,0.44223000455094713,9.2841891972371502E-3,8.4617029209191463E-3,21,0.69029030026980043,"N/A",1.9378275146583255E-3,"N/A"]
[null,"RBB2","ROBERTSON","Rural short",355,61331.688085714297,1032.02,54,3.2917045784320007,1.2334841809577179,18,1.3847528989533302,1.0092318352052205,6.5594626426117627E-3,5.6622048866284873E-3,12,0.51890160696371712,"N/A",1.3708104605300053E-3,"N/A"]
[null,"RBC2","ROBERTSON","Rural short",487.5,36717.5405947338,0,55,2.1781415891677001,1.054811306070077,8,0.91629968851270005,3.0295040222319818E-2,6.9849282009855932E-3,3.2338923044443976E-3,6,0.44373757703020145,"N/A",1.3957342870850962E-3,"N/A"]
[null,"RBD2","ROBERTSON","Rural short",199.5,39090.965095558699,0,39,0.93461498897179984,0.95135196501974373,17,0.39317344085543998,0.3910424536849183,2.4201189482629401E-3,2.4014260783466216E-3,11,0.40021434490837376,"N/A",1.1714198480892771E-3,"N/A"]
[null,"RBE2","ROBERTSON","Rural short",401,42596.616513939502,1542.72,46,0.61348524920759007,1.647706647931751,9,0.25808071686313,0.25808071686713063,4.0240965664798652E-3,4.0240965664798652E-3,14,0.69315654032363594,"N/A",1.8319012517991886E-3,"N/A"]
[null,"RD1206","RYDALMERE","Urban",205,177.99402525426601,4860.875619597,216.096,9.6146787863100006E-2,0,3,7.7570265686500006E-3,7.7570265686603222E-3,2.6774845712592793E-4,2.6774845712592793E-4,0,0,"N/A",0,"N/A"]
[null,"RD1228","RYDALMERE","Urban",883.5,893.64744814691699,3032.1437749632,181.72800000000001,0.39959225399300002,5.7765415904982107E-3,3,3.2238702922100002E-2,3.2238702922251505E-2,1.2755905129899765E-3,1.2755905129899765E-3,1,4.6604559120870715E-4,"N/A",2.389977390813883E-6,"N/A"]
[null,"RD1229","RYDALMERE","Urban",44,0,2423.6786187490302,86.111999999999995,3.4472975063E-3,2.9623290207683129E-3,1,2.7812451088000002E-4,2.7812451087616573E-4,5.5624902175233142E-5,5.5624902175233142E-5,1,2.3899773908138828E-4,"N/A",1.1949886954069415E-6,"N/A"]
[null,"RD1232","RYDALMERE","Urban",465.5,2520.66570631688,3375.42379080195,208.608,0.42753302931199999,0,5,3.4492936696099999E-2,3.4492936696453751E-2,8.0820795427973251E-4,8.0820795427973251E-4,0,0,"N/A",0,"N/A"]
[null,"RD1233","RYDALMERE","Urban",76.5,0,3470.1458532729198,137.56800000000001,9.543874297E-3,0,2,7.6999022157E-4,7.699902215670604E-4,9.23366276304139E-5,9.23366276304139E-5,0,0,"N/A",0,"N/A"]
[null,"RD1236","RYDALMERE","Urban",79,140.1,3174.68,50.4,5.7943936764000004E-3,0,1,4.6748587962000001E-4,4.6748587962372197E-4,9.3497175924744393E-5,9.3497175924744393E-5,0,0,"N/A",0,"N/A"]
[null,"RD1251","RYDALMERE","Urban",1064,2344.6062694163602,2522.7276874869399,227.136,5.191921502085,0.56876717198751614,3,0.418879027889,3.6167168339141471E-2,2.7457731210970664E-3,1.4743051491840809E-3,1,4.5887565903626554E-2,"N/A",9.5599095632555318E-5,"N/A"]
[null,"RD1259","RYDALMERE","Urban",112.5,0,2485.31292612573,117.408,9.0949976731999997E-3,0,1,7.3377530503999997E-4,7.3377530504371272E-4,1.4675506100874253E-4,1.4675506100874253E-4,0,0,"N/A",0,"N/A"]
[null,"RD1265","RYDALMERE","Urban",497,2407.7051287121899,3533.0974163431501,192,0.26353066854899998,0.19084804716299858,6,2.12613904529E-2,2.1261390452911137E-2,7.6745205703650449E-4,7.6745205703650449E-4,5,1.5397429340318441E-2,"N/A",4.0629615643836007E-5,"N/A"]
[null,"RD1266","RYDALMERE","Urban",156,0,2788.3080917771499,134.68799999999999,1.2248908161000001E-2,1.1479024955477214E-2,1,9.8822964501000003E-4,9.8822964500752826E-4,1.9764592900150567E-4,1.9764592900150567E-4,1,9.2611623894037958E-4,"N/A",5.9749434770347074E-6,"N/A"]
[null,"RD1269","RYDALMERE","Urban",1326,3415.7869161704202,1723.5809047133,233.376,3.7764470922380005,1.0220035121650681,15,0.30467996987449997,0.30467996987466373,3.121484900188598E-3,3.121484900188598E-3,2,8.2454219983078961E-2,"N/A",1.7924830431104123E-4,"N/A"]
[null,"RD1273","RYDALMERE","Urban",676.5,0,3312.61,94.176000000000002,6.8505869592000002E-2,0,1,5.5269849607E-3,5.5269849606718697E-3,1.105396992134374E-3,1.105396992134374E-3,0,0,"N/A",0,"N/A"]
[null,"RD1288","RYDALMERE","Urban",42,0,2855.9098226297801,210,3.1539104813000001E-3,0,1,2.5445433947999998E-4,2.5445433948089694E-4,5.0890867896179385E-5,5.0890867896179385E-5,0,0,"N/A",0,"N/A"]
[null,"RD1292","RYDALMERE","Urban",1923,5743.4409276303304,1666.8493889112999,292.22399999999999,0.76736392089899996,0.56759705202431265,5,6.1910152742090004E-2,6.1910152741981819E-2,2.7609375639359966E-3,2.7609375639359966E-3,3,4.5793161796689401E-2,"N/A",1.9119819126511064E-4,"N/A"]
[null,"RD1296","RYDALMERE","Urban",130.5,1832.01298051051,3770.9018514989498,210,1.5858227725599999E-2,1.4441353976245526E-2,3,1.2794259333299999E-3,1.2794259333360259E-3,1.5861310686108017E-4,1.5861310686108017E-4,5,1.1651139780217679E-3,"N/A",8.3649208678485904E-6,"N/A"]
[null,"RD1299","RYDALMERE","Urban",800.5,3146.6045996312801,2487.8027892959999,195.26400000000001,0.208593890634,3.9991441780372226E-3,2,1.6829146221100003E-2,1.682914622159206E-2,9.9114770880573779E-4,9.9114770880573779E-4,1,3.2264694775987422E-4,"N/A",1.1949886954069415E-6,"N/A"]
[null,"RS1203","ROSEHILL","Urban",282,3219.7769289739899,1932.90016459292,145,0.54182478954299995,2.4439214421338585E-3,4,4.3713881466199998E-2,4.3713881466681329E-2,3.6566654079452408E-4,3.6566654079452408E-4,1,1.9717313474214534E-4,"N/A",1.1949886954069415E-6,"N/A"]
[null,"RS1207","ROSEHILL","Urban",1300,2511.1480459735899,2733.7382493916598,155,5.0285535127999999E-2,0.18484933089594274,1,4.0569866209000001E-3,4.056986620906566E-3,1.1591390345447332E-4,1.1591390345447332E-4,1,1.4913458918678629E-2,"N/A",6.213941216116095E-5,"N/A"]
[null,"RS1262","ROSEHILL","Urban",1152,1549.20509008214,4615.4128940334003,215,0,0.46656682077100931,0,0,0,0,0,3,3.7642143905318656E-2,"N/A",2.7604238863900346E-4,"N/A"]
[null,"RS1296","ROSEHILL","Urban",11,1019.5937336036,1216.6635588644101,122,0,9.7756857685354342E-3,0,0,0,0,0,1,7.8869253896858137E-4,"N/A",2.389977390813883E-6,"N/A"]
[null,"RV1206","RUSSELL VALE","Urban",1010,6353.4931447530098,1656.1327088262501,108.288,8.2500863228000001E-2,3.1545841742161769,1,6.6560870334000004E-3,6.6560870334166642E-3,8.6039186069299787E-5,8.6039186069299787E-5,5,0.2545086923477704,"N/A",5.7956951727236659E-4,"N/A"]
[null,"RV1220","RUSSELL VALE","Urban",1875.5,5138.1157051602304,5561.56,223.00800000000001,2.3860375330400001,3.7910405643282488,2,0.192503118922,0.19250311892049499,2.2776484534456302E-3,2.2776484534456302E-3,6,0.30585735658940666,"N/A",6.9548342072683997E-4,"N/A"]
[null,"RV1228","RUSSELL VALE","Urban",1177,5632.9398999028399,814.23,125,0.61003241524899998,3.3868307694444124,2,4.92168044087E-2,4.9216804409030292E-2,1.4399613779653643E-3,1.4399613779653643E-3,5,0.27324611509175123,"N/A",7.4208797984771067E-4,"N/A"]
[null,"RV1246","RUSSELL VALE","Urban",1591,7119.27690779767,2078.0091326341199,131.80799999999999,0.75613448255499993,3.8281437353133718,2,6.1004172900499996E-2,6.1004172900524366E-2,1.876132251788898E-4,1.876132251788898E-4,9,0.30885080327140108,"N/A",8.4844197373892848E-4,"N/A"]
[null,"RV1280","RUSSELL VALE","Urban",1094,4742.6016548594798,2258.4173311435602,105,0.24791731574619999,3.9407862963280871,4,2.0001720783440001E-2,2.0001720783721387E-2,1.8402825909266901E-4,1.8402825909266901E-4,11,0.31793869229997085,"N/A",9.5599095632555313E-4,"N/A"]
[null,"RV1298","RUSSELL VALE","Urban",1712,6220.41940429633,2782.9884849968598,117,0.81344073746500001,2.3893849648615135,8,6.5627584162500002E-2,6.5627584163053823E-2,7.0982328507172322E-4,7.0982328507172322E-4,7,0.19277318636565699,"N/A",6.6202373725544558E-4,"N/A"]
[null,"RW1218","RINGWOOD","Rural short",542.5,135867.324974627,292.14999999999998,63,3.7832769373675008,1.7723910764158894,30,1.5915473523673997,1.1156580390838138,1.360201232336263E-2,1.0218602868509027E-2,16,0.74560873330882493,"N/A",1.8942108181869163E-3,"N/A"]
[null,"RW1229","RINGWOOD","Rural short",164.5,33461.828743492202,1265.4000000000001,39,0.341373861035,1.1973437669043445,9,0.14360901242080001,0.13909156885754054,3.2484055534993984E-3,3.2421745968606256E-3,11,0.50369807276511158,"N/A",1.2399603711157775E-3,"N/A"]
[null,"RW1255","RINGWOOD","Rural short",225,58059.654713052398,758.93911609352301,63,2.1883956398401998,0.52144396588074238,10,0.92061335824315005,0.23857284456136935,3.3364495396065834E-3,3.0124397943904003E-3,8,0.21936082846799468,"N/A",6.0440279396095685E-4,"N/A"]
[null,"RW1281","RINGWOOD","Rural short",557,140280.29328949601,248.41,81,3.969644969994401,0.7928229274733275,30,1.6699485780230701,1.5948967053077219,1.4750361200882673E-2,1.4681820677856172E-2,14,0.33352441600358901,"N/A",1.0281078453975038E-3,"N/A"]
[null,"RW1292","RINGWOOD","Rural short",1587,47219.4327941062,4475.66,113,3.6201768466963995,3.9538501673096751,16,1.5229344747653999,1.2778958739827178,2.3274157007162288E-2,2.3006225871695058E-2,14,1.6633040270672756,"N/A",4.3616696471409254E-3,"N/A"]
[null,"S326","WEST CASTLE HILL","Urban",250,0,2626.04,67.2,0.26837219764109999,5.3321922373829635E-2,4,2.1652000172029999E-2,2.165200017207837E-2,5.6164468684126245E-5,5.6164468684126245E-5,1,4.3019593034649894E-3,"N/A",1.1949886954069415E-5,"N/A"]
[null,"S327","WEST CASTLE HILL","Urban",669,159.88999999999999,6555.1854257468804,340.99200000000002,6.3690073947000006E-2,0,1,5.1384513902000004E-3,5.1384513902498485E-3,2.389977390813883E-5,2.389977390813883E-5,0,0,"N/A",0,"N/A"]
[null,"S328","WEST CASTLE HILL","Urban",315.5,671.60187745077906,1333.97375695609,186.72,1.4041439558E-2,0,1,1.1328492831999999E-3,1.1328492832457806E-3,2.0314807821918003E-5,2.0314807821918003E-5,0,0,"N/A",0,"N/A"]
[null,"S330","WEST CASTLE HILL","Urban",217,0,2401.02,135.84,0,0.72064578088230757,0,0,0,0,0,3,5.8140979986329326E-2,"N/A",1.9119819126511064E-4,"N/A"]
[null,"S332","WEST CASTLE HILL","Urban",32,0,812.6,109.63200000000001,0,4.4286818860486285E-2,0,0,0,0,0,1,3.573016199266755E-3,"N/A",2.7484739994359652E-5,"N/A"]
[null,"S336","WEST CASTLE HILL","Urban",231,295.55026761778799,2151.0300092938,233.47200000000001,0.37233513462000001,3.851027726998807E-3,1,3.0039625824999999E-2,3.0039625825139693E-2,2.7604238863900346E-4,2.7604238863900346E-4,1,3.1069706080580475E-4,"N/A",1.1949886954069415E-6,"N/A"]
[null,"S735","KENTHURST","Rural short",536,17356.2108353365,885.30094161325496,232.8,1.1396079742859999,0,6,0.47940980378999998,0.47940980378717546,3.6700334602371501E-3,3.6700334602371501E-3,0,0,"N/A",0,"N/A"]
[null,"S737","KENTHURST","Rural short",471.5,14961.620165464699,313.01,175.584,2.8877375760488002,0.2763112394121644,8,1.2148122301270001,1.2148122301216906,9.981992535313948E-3,9.981992535313948E-3,2,0.11623849609630567,"N/A",3.2400974521618303E-4,"N/A"]
[null,"S738","KENTHURST","Rural short",484.5,18503.162052161599,402.22,150,5.5678158876976998,0.37510491225478765,15,2.3422664481693096,1.0666650050782298,1.6013558561645966E-2,9.5894422670712628E-3,5,0.15779897687691991,"N/A",3.6762644168759228E-4,"N/A"]
[null,"S740","KENTHURST","Urban",870.5,8749.8176544301205,2748.0274865168699,235,4.1109128520480001,0.16974145289002435,7,0.33166433245167998,0.26126993838638285,3.2228845115125208E-3,2.1820493578130749E-3,2,1.369457044936355E-2,"N/A",5.0189525207091539E-5,"N/A"]
[null,"S741","KENTHURST","Rural short",699.5,26020.6685319303,2102.5694025970001,247.96799999999999,1.2327435986751201,0.92039562675271491,3,0.51859005913116007,0.51859005913177847,2.205758650125554E-3,2.205758650125554E-3,5,0.38719164553333874,"N/A",9.3464349581591261E-4,"N/A"]
[null,"S743","KENTHURST","Rural short",278.5,13970.978065498701,616.98501898325196,98.016000000000005,0.19372150631320001,0.32259763036166933,5,8.1494681878500008E-2,6.3960769897002279E-2,6.2309566387727504E-4,5.8570992404463856E-4,3,0.1357102355924705,"N/A",3.6139548504881956E-4,"N/A"]
[null,"S744","KENTHURST","Urban",511,6614.5082386291097,2807.3290762080601,199.2,1.2046162846305999,0.13152740852211312,2,9.7187235608689998E-2,9.7187235608751144E-2,6.1183421204835404E-4,6.1183421204835404E-4,1,1.061149961521364E-2,"N/A",4.4214581730056833E-5,"N/A"]
[null,"S764","GLENMORE PARK","Rural short",364,9843.7742188746797,4446.6804858665801,155,0.40634267178,9.9460196872296111E-2,1,0.17094006443000001,0.17094006442809165,2.0686776040725534E-3,2.0686776040725534E-3,2,4.184087382935902E-2,"N/A",9.3464349581591266E-5,"N/A"]
[null,"S765","GLENMORE PARK","Urban",1426.5,7578.0300671211498,15988.0747919851,438,0.45853890912200002,0.58187547790441596,3,3.6994460032199999E-2,1.4170175950135512E-2,1.8163828170185509E-4,9.6794084327962252E-5,4,4.6945130899061695E-2,"N/A",9.7989073023369198E-5,"N/A"]
[null,"S766","GLENMORE PARK","Urban",911,0,4705.8306433774296,254,0.13206062774489999,0.36258907214204156,2,1.065451920866E-2,1.065451920824829E-2,3.7044649557615181E-5,3.7044649557615181E-5,1,2.9253323263561927E-2,"N/A",6.0944423465754017E-5,"N/A"]
[null,"S769","GLENMORE PARK","Urban",955.5,0,6019.2883412730698,259.2,0,0,0,0,0,0,0,0,0,"N/A",0,"N/A"]
[null,"S771","GLENMORE PARK","Urban",579.5,0,4029.1046820179199,194.4,0.22808452295580001,0,3,1.8401630920900001E-2,1.8401630920571493E-2,7.6479276506044255E-5,7.6479276506044255E-5,0,0,"N/A",0,"N/A"]
[null,"S772","GLENMORE PARK","Urban",1668,0,12601.904182009001,481,0.14937544086999999,0.17818409059921403,1,1.2051460993E-2,1.2051460993179004E-2,2.5094762603545769E-5,2.5094762603545769E-5,2,1.4375714005745506E-2,"N/A",9.5599095632555318E-5,"N/A"]
[null,"S774","GLENMORE PARK","Urban",671.5,0,4683.46,182.78399999999999,0,0.35073975605896829,0,0,0,0,0,2,2.8297332307236373E-2,"N/A",1.3861868866720521E-4,"N/A"]
[null,"S775","GLENMORE PARK","Urban",597.5,0,2196.86,150.43199999999999,0,0.67652189011796349,0,0,0,0,0,1,5.4581108662712048E-2,"N/A",3.118920495012117E-4,"N/A"]
[null,"S776","GLENMORE PARK","Urban",993,402.83711935830001,7922.4305142251696,265,9.3802148443E-2,0.42761219414790602,2,7.5678634080000003E-3,7.5678634080121598E-3,3.7044649557615188E-5,3.7044649557615188E-5,2,3.4499323636398398E-2,"N/A",8.0064242592265081E-5,"N/A"]
[null,"S785","CRANEBROOK","Urban",1196,5519.2962189687996,2979.75,299,0.24161969562659999,0.57321066551866862,3,1.9493635098240002E-2,1.9493635098383925E-2,3.5115984566360113E-5,3.5115984566360113E-5,1,4.6246062512248637E-2,"N/A",1.0276902780499697E-4,"N/A"]
[null,"S786","CRANEBROOK","Rural short",583.5,33981.050538736003,2951.6077641197498,211,4.0948531568709994,1.6508319050486617,8,1.7226211054938998,1.0222989650316756,1.2234984378629962E-2,8.783034400749859E-3,15,0.69447127217441695,"N/A",1.651203509274779E-3,"N/A"]
[null,"S788","CRANEBROOK","Rural short",750,14465.048156979299,8342.75,333,0.33997169007,-0.65842205980106916,1,0.14301914772999999,0.14301914772975094,7.3338359638355274E-3,7.3338359638355274E-3,4,-0.27698471546336512,"N/A",2.4300730891213727E-4,"N/A"]
[null,"S790","CRANEBROOK","Urban",6,3784.00344114274,2047.75,50,3.5547948249000001E-4,-3.1474745845663329E-2,1,2.8679728690000001E-5,2.8679728689766596E-5,7.1699321724416489E-6,7.1699321724416489E-6,2,-2.5393509777397504E-3,"N/A",4.7799547816277659E-6,"N/A"]
[null,"SC1204","SCHOFIELDS","Rural short",1256.5,12450.8088723071,12884.08,247.10400000000001,2.0004163527759999,0.73895297423065576,7,0.84153431076429996,0.84153431076273144,1.0069225928256766E-2,1.0069225928256766E-2,11,0.31086242670837255,"N/A",7.9133149312413933E-4,"N/A"]
[null,"SC1208","SCHOFIELDS","Urban",0,0,0,0,5.8061648806999999E-3,3.8197751558297015,2,4.6843556859999999E-4,4.6843556859952105E-4,2.389977390813883E-6,2.389977390813883E-6,7,0.30817563465849612,"N/A",7.4567294593393151E-4,"N/A"]
[null,"SC1216","SCHOFIELDS","Urban",1192.5,141.41999999999999,9433.1839602333803,205.92,0,0.16263186324018039,0,0,0,0,0,3,1.3120975875568217E-2,"N/A",3.7044649557615188E-5,"N/A"]
[null,"SC1238","SCHOFIELDS","Urban",716.5,9778.1178792733699,10050.31,220.5,1.7171288285252002,1.0659940981234775,5,0.1385362344471,0.13853623444722213,1.4853709483908281E-3,1.4853709483908281E-3,5,8.6003336408437575E-2,"N/A",2.019530895237731E-4,"N/A"]
[null,"SC1241","SCHOFIELDS","Urban",236,3944.8604026395301,2727.74,40.42,4.5708736789999996E-2,0.50870595109143857,2,3.6877351140000001E-3,3.687735114025821E-3,2.6289751298952713E-5,2.6289751298952713E-5,4,4.1041886743751407E-2,"N/A",1.1113394867284556E-4,"N/A"]
[null,"SC1267","SCHOFIELDS","Urban",88.5,120.57,4018.11,17.856000000000002,5.0063360450700006E-2,3.110445471806729E-2,2,4.0390617904999997E-3,4.039061790475462E-3,2.389977390813883E-5,2.389977390813883E-5,1,2.5094762603545769E-3,"N/A",5.9749434770347074E-6,"N/A"]
[null,"SC1271","SCHOFIELDS","Urban",962.5,5170.25282128046,4908.79,183.36,0.18271645400179998,0.57232196681243808,4,1.474138054655E-2,1.4741380546540029E-2,1.3622871127639134E-4,1.3622871127639134E-4,5,4.6174363190524217E-2,"N/A",1.326437451901705E-4,"N/A"]
[null,"SC1289","SCHOFIELDS","Urban",1371,1489.02,14931.15,192.38399999999999,5.6476802781E-2,0.74472951582115388,2,4.5564918955999997E-3,4.5564918955866684E-3,1.5534853040290238E-5,1.5534853040290238E-5,8,6.0084031605061018E-2,"N/A",1.3503372258098439E-4,"N/A"]
[null,"SG1209","SOUTH GRANVILLE","Urban",1521.5,4420.1488790516196,1607.25,239,3.1232279215379997,0,11,0.25197890128060002,0.25197890127959388,1.2153035032288592E-3,1.2153035032288592E-3,0,0,"N/A",0,"N/A"]
[null,"SG1220","SOUTH GRANVILLE","Urban",1470.5,5040.5447929225002,1389.43,252,0.16879350760299999,0,2,1.36180911729E-2,1.3618091172857505E-2,1.2905877910394969E-4,1.2905877910394969E-4,0,0,"N/A",0,"N/A"]
[null,"SG1228","SOUTH GRANVILLE","Urban",92,403.13,2420.8492045521898,115.2,0,8.8869870623049397E-3,0,0,0,0,0,1,7.169932172441649E-4,"N/A",3.5849660862208244E-6,"N/A"]
[null,"SG1247","SOUTH GRANVILLE","Urban",1028,3191.64577648573,434.65,157.44,2.2132893162302003,0,11,0.17856596576646,0.17856596576596384,1.3288274292925189E-3,1.3288274292925189E-3,0,0,"N/A",0,"N/A"]
[null,"SG1250","SOUTH GRANVILLE","Urban",1330.5,6098.2136717222402,1431.4987638370801,237.21600000000001,2.1674472746339997,9.7608741234315913E-2,3,0.17486747574890002,0.17486747575367939,1.6849340605237873E-3,1.6849340605237873E-3,3,7.8749755027317445E-3,"N/A",2.6289751298952713E-5,"N/A"]
[null,"SG1254","SOUTH GRANVILLE","Urban",170.5,0,786.08,94.847999999999999,1.3477412112930001,0,8,0.10873441137260001,0.10873441137246841,6.703886581232942E-4,6.703886581232942E-4,0,0,"N/A",0,"N/A"]
[null,"SG1257","SOUTH GRANVILLE","Urban",205,260.41000000000003,1575.39,94.656000000000006,0.47338017752000006,0.10190411831442997,2,3.8191838705200001E-2,3.8191838705205851E-2,2.5333760342627159E-4,2.5333760342627159E-4,2,8.2215222243997577E-3,"N/A",1.4339864344883298E-5,"N/A"]
[null,"SHA2","SHELLHARBOUR","Urban",1610,0,9499.7418721613103,326.976,0,0.29642545346318128,0,0,0,0,0,5,2.3915308761179119E-2,"N/A",1.6251846257534403E-4,"N/A"]
[null,"SHB2","SHELLHARBOUR","Urban",1034.5,5230.8480472396204,4647.7037396713904,187.96799999999999,4.9204285035000003E-2,3.492437799034803,1,3.9697524460999998E-3,3.9697524461418596E-3,3.5849660862208241E-5,3.5849660862208241E-5,4,0.28176638449000274,"N/A",7.9825244853183683E-4,"N/A"]
[null,"SHC2","SHELLHARBOUR","Urban",1341.5,1823.85078650064,9212.6322988373504,194.01599999999999,0,1.4984941351556511,0,0,0,0,0,5,0.12089700631432027,"N/A",5.30574980760682E-4,"N/A"]
[null,"SHD2","SHELLHARBOUR","Urban",1203.5,5201.9919778006797,2981.81,138.048,1.6010647774971001,5.1644503565819582,9,0.12917230303020999,0.12917230303001334,3.1356503367478143E-3,3.1356503367478143E-3,10,0.41666268337101531,"N/A",1.2117185371426386E-3,"N/A"]
[null,"SHE2","SHELLHARBOUR","Urban",1567.5,7769.43671282585,2813.41,196.99199999999999,0.412474692852,5.3278968603028494,5,3.3278045189800001E-2,3.3278045189692504E-2,1.8880821387429674E-4,1.8880821387429674E-4,13,0.42984938362483088,"N/A",1.2009636388839761E-3,"N/A"]
[null,"SHG2","SHELLHARBOUR","Urban",627.5,0,4917.8,74,1.4071062849000001E-3,0.16129881518083466,1,1.1352392606E-4,1.1352392606365944E-4,1.1949886954069415E-6,1.1949886954069415E-6,1,1.3013426892981593E-2,"N/A",7.8869253896858134E-5,"N/A"]
[null,"SHH2","SHELLHARBOUR","Rural short",380,5376.5167383670096,5869.99,150,2.5920378931999998E-3,0.26995704366261636,1,1.0904174117999999E-3,1.0904174117852313E-3,6.2309566387727505E-6,6.2309566387727505E-6,6,0.11356541569827215,"N/A",5.2340035765691107E-4,"N/A"]
[null,"SHJ2","SHELLHARBOUR","Rural short",1487,16830.3729437443,12475.690234129899,169,1.1406447894482998,0.93086745984113084,8,0.47984597074749991,0.33351818504695024,2.4612278723152364E-3,1.9876751677685074E-3,10,0.39159693187695105,"N/A",1.7384369022175974E-3,"N/A"]
[null,"SHK2","SHELLHARBOUR","Urban",1321,6575.1569437630396,6354.35,170,1.7672662472,2.6024801029704823,3,0.1425812711785,0.14258127118117461,1.3766269771087966E-3,1.3766269771087966E-3,12,0.20996548872647663,"N/A",5.5447475466882082E-4,"N/A"]
[null,"SL1112","SOUTH LEPPINGTON","Rural short",479,18370.195228321802,7017.8605466933896,130,6.4164046589199997E-2,0.40613530874733572,4,2.6992504159200001E-2,2.6992504159163558E-2,2.430073089121373E-4,2.430073089121373E-4,5,0.17085283103514884,"N/A",3.4893357177127405E-4,"N/A"]
[null,"SL1122","SOUTH LEPPINGTON","Rural short",148.5,6483.9997366235602,3275.24,135,0.24117801722900001,0.22306337526385397,3,0.10145866694932,0.1014586669491367,1.071724541868913E-3,1.071724541868913E-3,3,9.3838206979917627E-2,"N/A",2.5546922218968281E-4,"N/A"]
[null,"SL1132","SOUTH LEPPINGTON","Urban",944,4561.6099999999997,27163.37,215,1.3597090205000001E-2,0.95268501307908948,1,1.0969996224E-3,1.0969996223835722E-3,1.6729841735697181E-5,1.6729841735697181E-5,5,7.686167288857447E-2,"N/A",1.7327336083400652E-4,"N/A"]
[null,"SL1142","SOUTH LEPPINGTON","Rural short",164,6292.0653884188796,1428.05,39.072000000000003,0.14318417321900001,0,2,6.0234657827E-2,6.0234657827016182E-2,1.0904174117852316E-3,1.0904174117852316E-3,0,0,"N/A",0,"N/A"]
[null,"SN1208","SOUTH NOWRA","Urban",342.5,9533.4599647205196,2316.6466070443498,174,3.9250859524999999E-3,0.37925217288386331,1,3.1667200428000001E-4,3.1667200428283948E-4,1.1949886954069415E-6,1.1949886954069415E-6,4,3.0597685545894735E-2,"N/A",9.5599095632555318E-5,"N/A"]
[null,"SN1219","SOUTH NOWRA","Urban",61.5,8650.5305702098103,498.92,38,0.15998057876569999,0.31630268119253663,3,1.290707289903E-2,1.2907072899090375E-2,2.186829312594703E-4,2.186829312594703E-4,3,2.5518983590415236E-2,"N/A",6.5724378247381776E-5,"N/A"]
[null,"SN1230","SOUTH NOWRA","Rural short",373,46842.109878780197,108.38,63.84,1.7093527148476,0.88684725059251379,8,0.71908978184819994,0.42597311965306034,5.240234533207884E-3,4.3928244303347887E-3,7,0.37307852874651848,"N/A",1.2150365445606863E-3,"N/A"]
[null,"SN1252","SOUTH NOWRA","Urban",69.5,5665.4540786451698,3679.34,92,0.35638299285000002,1.2441781887226916E-2,2,2.8752623000199998E-2,9.046064424230546E-3,9.6794084327962265E-5,1.4339864344883298E-5,2,1.0037905041418308E-3,"N/A",4.7799547816277659E-6,"N/A"]
[null,"SN1271","SOUTH NOWRA","Urban",1393.5,7803.9,6024.98,224.256,3.5399831798E-3,2.2205618339679276,1,2.8560229819999999E-4,0,1.1949886954069415E-6,0,6,0.17915270521540866,"N/A",3.4893669905882688E-4,"N/A"]
[null,"SQ1132","SOUTH MARSDEN PARK","Urban",0,3398.0305306486898,2445.8174529881198,null,1.6174316453E-2,1.7773974124609879E-2,1,1.3049276553999999E-3,1.30492765538438E-3,7.1699321724416489E-6,7.1699321724416489E-6,1,1.4339864344883298E-3,"N/A",4.7799547816277659E-6,"N/A"]
[null,"SQ1142","SOUTH MARSDEN PARK","Urban",332,1243.3900000000001,15528.81,256.32,0.71353619123000001,6.4430656201710818E-2,2,5.7567385411999995E-2,5.7567385412533999E-2,4.373658625189406E-4,4.373658625189406E-4,4,5.1982008250201954E-3,"N/A",1.0754898258662473E-5,"N/A"]
[null,"SWC2","SOUTH WOLLONGONG","Urban",1771,7146.9839211881099,1192.78,165,0.50903180728630004,2.975807617812809,3,4.1068176494799997E-2,4.106817649505036E-2,1.2547381301772885E-4,1.2547381301772885E-4,5,0.2400851787942086,"N/A",6.3812396334730675E-4,"N/A"]
[null,"SWD2","SOUTH WOLLONGONG","Urban",257.5,2286.9177727751098,2441.3581093585799,121,8.2945212581999994E-2,4.1176373388679556E-2,1,6.6919366943000002E-3,6.6919366942788721E-3,4.1824604339242954E-5,4.1824604339242954E-5,4,3.3220685732312971E-3,"N/A",1.0754898258662473E-5,"N/A"]
[null,"SWE2","SOUTH WOLLONGONG","Urban",1404,2140.3982920415101,2628.36,243.35,9.7031087075400008E-2,1.8848558976893584,3,7.8283709436199993E-3,7.8283709436108729E-3,1.6646192527018694E-3,1.6646192527018694E-3,3,0.15206828643401032,"N/A",4.2302599817405729E-4,"N/A"]
[null,"SWF2","SOUTH WOLLONGONG","Urban",52,759.35,58.77,6.984,0,2.5253854902049868E-2,0,0,0,0,0,1,2.037455725668835E-3,"N/A",1.3144875649476356E-5,"N/A"]
[null,"SWG2","SOUTH WOLLONGONG","Urban",234.5,837.79100354747902,699.73,141.88800000000001,0,0.56432367845636366,0,0,0,0,0,2,4.5529069295004471E-2,"N/A",1.0993895997743861E-4,"N/A"]
[null,"SWH2","SOUTH WOLLONGONG","Urban",1054,3841.0154614140602,1186.55,191.232,1.4071062849000001E-3,2.072889732282627,1,1.1352392606E-4,1.1352392606365944E-4,1.1949886954069415E-6,1.1949886954069415E-6,3,0.16723866792220146,"N/A",5.8195949466318048E-4,"N/A"]
[null,"SWJ2","SOUTH WOLLONGONG","Urban",837,2373.89674398546,2400.6999999999998,176,0.14076987506999999,6.1290587439696398E-2,1,1.1357172561E-2,1.1357172561147572E-2,6.8114355638195656E-5,6.8114355638195656E-5,4,4.9448632215939236E-3,"N/A",1.6729841735697181E-5,"N/A"]
[null,"SXA2","SUSSEX INLET","Urban",1300.5,6741.9374768589196,1473.7682051417801,144.96,5.0366210620407994,0.36392212020138726,7,0.40634954389111994,0.40634954388664596,4.0126423302898296E-3,4.0126423302898296E-3,1,2.9360872246148553E-2,"N/A",7.5284287810637308E-5,"N/A"]
[null,"SXB2","SUSSEX INLET","Rural short",988,10439.4179899336,347.62,110.01600000000001,7.0898060892948989,1.5255994456956812,6,2.9825366466606802,1.5403069611522313,2.1640788739584839E-2,1.5497065493754906E-2,3,0.64178853379359335,"N/A",1.7633607287726885E-3,"N/A"]
[null,"SXC2","SUSSEX INLET","Rural short",456,44093.651665847203,601.70000000000005,60,1.4253097966990798,1.4712703314547904,4,0.59959872639477996,2.1060633439051899E-3,2.8973948370293293E-3,1.8692869916318251E-5,6,0.61893338484257487,"N/A",1.526584376499324E-3,"N/A"]
[null,"SXD2","SUSSEX INLET","Rural short",778,16235.33799905,199.81700322131999,103.968,0.60335236330940001,4.9248719970273205E-2,7,0.25381801868334997,0.19552118836805013,3.2961760619107851E-3,2.8911638803905564E-3,2,2.0717930823919397E-2,"N/A",6.2309566387727506E-5,"N/A"]
[null,"SY1112","ST MARYS","Urban",1180.5,5586.93676754436,484.27762766341101,205,0.12748382941,0.30660105364952039,1,1.0285267701E-2,1.0285267701367545E-2,1.0276902780499697E-4,1.0276902780499697E-4,2,2.4736265994923689E-2,"N/A",1.0157403910959002E-4,"N/A"]
[null,"SY1122","ST MARYS","Urban",528.5,2649.45966567405,1299.99936750642,117,0,0.53025689471752802,0,0,0,0,0,2,4.2780595295568505E-2,"N/A",1.1830388084528721E-4,"N/A"]
[null,"SY1132","ST MARYS","Urban",1778,6276.4602963813904,799.02,205,3.8909787655456998,0.69959843318974868,4,0.31392027059162997,4.909491556209878E-2,2.499009765264011E-3,6.4887886160596916E-4,2,5.6442901050156064E-2,"N/A",1.9119819126511064E-4,"N/A"]
[null,"SY1152","ST MARYS","Urban",723,2572.2768500819502,6378.1953661077796,204.48,6.2801375240000004E-3,3.1845036973259366E-3,1,5.0667520684999996E-4,5.0667520685254317E-4,1.1949886954069415E-6,1.1949886954069415E-6,1,2.5692256951249243E-4,"N/A",1.1949886954069415E-6,"N/A"]
[null,"SY1222","ST MARYS","Urban",445.5,1703.30901343907,88.41,75.311999999999998,0.60982505221000005,0,3,4.9200074566999999E-2,3.7654093792272726E-2,1.0671249049983987E-3,5.3415994684690284E-4,0,0,"N/A",0,"N/A"]
[null,"SY1232","ST MARYS","Urban",1123,3443.4145198217702,4297.4542863476399,218,0.1034149061158,0.97667987814731283,7,8.3434110713290002E-3,8.3434110713312658E-3,6.6919366942788723E-5,6.6919366942788723E-5,2,7.8797554575133724E-2,"N/A",1.8402825909266898E-4,"N/A"]
[null,"SY1252","ST MARYS","Urban",179.5,1365.42,1904.01,90,0.28518341482999998,7.5539390029591988E-3,1,2.3008312340999999E-2,2.3008312341365252E-2,1.7207837213859957E-4,1.7207837213859957E-4,1,6.0944423465754015E-4,"N/A",1.1949886954069415E-6,"N/A"]
[null,"SY1322","ST MARYS","Urban",1116,5354.5293815893301,369.44,145,2.0517642946999999,2.303906960967244,1,0.16553428877000001,0,1.156460653982816E-3,0,3,0.18587690660446352,"N/A",5.6522965292748334E-4,"N/A"]
[null,"SY1332","ST MARYS","Urban",843,7882.8082507245599,5250.48893374623,190,1.4133864224417503,0.23461645844485041,8,0.11403060127042,0.11403060127051198,1.0778798032570612E-3,1.0778798032570612E-3,1,1.8928620935245954E-2,"N/A",3.9434626948429067E-5,"N/A"]
[null,"SY1352","ST MARYS","Urban",1330,7151.5582988480501,661.77,165.88800000000001,2.3328341038800002,2.3523854753921176,3,0.18821071952900001,0.18821071952659327,2.7962735472522432E-3,2.7962735472522432E-3,3,0.18978810460453044,"N/A",4.3378089643271976E-4,"N/A"]
[null,"SY1362","ST MARYS","Urban",0,0,0,0,0.12813554179300002,0,3,1.0337847204E-2,1.0337847203965449E-2,8.1259231287672014E-5,8.1259231287672014E-5,0,0,"N/A",0,"N/A"]
[null,"SZ1112","SOUTH WINDSOR","Urban",1002,1237.48,7001.66,314.88,1.3908134752499999E-2,0,3,1.1220943849900001E-3,1.1220943849871181E-3,3.5849660862208244E-6,3.5849660862208244E-6,0,0,"N/A",0,"N/A"]
[null,"SZ1122","SOUTH WINDSOR","Urban",816.5,18775.2589278091,3799.7180252039502,235,0.33406184367319997,0.2015124316377645,5,2.6951775035969999E-2,2.6951775036208155E-2,1.2188884693150803E-4,1.2188884693150803E-4,2,1.6257821201011439E-2,"N/A",3.8239638253022127E-5,"N/A"]
[null,"SZ1132","SOUTH WINDSOR","Urban",224,6454.23564172433,1508.54,258,0.37710448434119997,0,2,3.0424412184620001E-2,3.0424412185060729E-2,5.1623511641579875E-4,5.1623511641579875E-4,0,0,"N/A",0,"N/A"]
[null,"SZ1142","SOUTH WINDSOR","Urban",225,907.38,1292.24,135,0.43347760560800003,9.6275693174970173E-2,2,3.49725391601E-2,3.4972539159779548E-2,2.9874717385173534E-4,2.9874717385173534E-4,1,7.7674265201451197E-3,"N/A",2.9874717385173535E-5,"N/A"]
[null,"SZ1152","SOUTH WINDSOR","Urban",1051,6362.52,743.44,282,1.860638857986,4.6656682077100935E-2,6,0.15011447991399998,0.15011447991701998,2.6636298020620724E-3,2.6636298020620724E-3,2,3.7642143905318656E-3,"N/A",1.4339864344883298E-5,"N/A"]
[null,"SZ1162","SOUTH WINDSOR","Urban",1,0,390.23,53.567999999999998,0,3.7029112759603912E-4,0,0,0,0,0,1,2.9874717385173535E-5,"N/A",1.1949886954069415E-6,"N/A"]
[null,"SZ1212","SOUTH WINDSOR","Urban",278,0,1722.2,75.936000000000007,1.61891280984E-2,1.2960189465861371E-2,2,1.30612264412E-3,1.3061226440797872E-3,2.389977390813883E-6,2.389977390813883E-6,3,1.0456151084810737E-3,"N/A",3.5849660862208244E-6,"N/A"]
[null,"SZ1242","SOUTH WINDSOR","Rural short",824.5,27517.650534840199,9859.1400934006906,308.16000000000003,3.0564866487104001,1.3610124453017938,5,1.2858015191151999,1.2858015191072285,8.2622485030126678E-3,8.2622485030126678E-3,11,0.5725501436235505,"N/A",1.5328153331380966E-3,"N/A"]
[null,"SZ1322","SOUTH WINDSOR","Rural short",1167.5,27387.2383050057,2505.91685348498,296,0.2482876068729,0.75154287256892105,4,0.1044495261354,0.10444952613574762,1.0094149754811856E-3,1.0094149754811856E-3,4,0.31615873985132936,"N/A",8.7856488606695784E-4,"N/A"]
[null,"SZ1332","SOUTH WINDSOR","Rural short",714,19838.57,4045.61,228.57599999999999,1.1492503552789999,1.9934993145260362,3,0.48346615655899999,0.468262622360411,4.5610602595816535E-3,4.498750693193926E-3,12,0.83862445401242458,"N/A",2.2306824766806449E-3,"N/A"]
[null,"SZ1342","SOUTH WINDSOR","Urban",426.5,5072.25,2234.5700000000002,222,5.3573720340599998E-2,0.44494181891940066,2,4.3222741112600004E-3,4.3222741112869077E-3,3.8239638253022127E-5,3.8239638253022127E-5,5,3.589746041002452E-2,"N/A",5.2579502597905425E-5,"N/A"]
[null,"SZ1352","SOUTH WINDSOR","Urban",1419.5,1484.29,7200.5651950560496,292.22399999999999,0.1361190185036,0.10664384474765927,3,1.098194611071E-2,1.0981946110789793E-2,1.242788243223219E-4,1.242788243223219E-4,1,8.6039186069299788E-3,"N/A",3.8239638253022127E-5,"N/A"]
[null,"T828","BLACKMANS FLAT","Rural short",265,93669.611908870298,4795.25,51.84,4.2583924022910002,0.13508220334703508,17,1.7914187265162398,1.0560910716622323,4.5049816498326989E-3,3.6949572867922414E-3,5,5.6826324545607487E-2,"N/A",1.9315965580195529E-4,"N/A"]
[null,"T831","BLACKMANS FLAT","Rural short",1085,69330.350361027202,3550.8553118026698,106.56,2.8014301199604987,0.65470433688000484,16,1.1785044457801599,1.1568269476412714,8.6111820747839431E-3,8.4678700720921696E-3,12,0.27542074534703315,"N/A",6.9786714354254809E-4,"N/A"]
[null,"T834","BLACKMANS FLAT","Rural short",134,29455.438699974002,221.43326124651199,1.8,2.032157708204E-2,9.3239305928682653E-2,4,8.5488725083399993E-3,8.5488725083962148E-3,2.4923826555091002E-5,2.4923826555091002E-5,2,3.9223872041074463E-2,"N/A",1.1838817613668227E-4,"N/A"]
[null,"T836","BLACKMANS FLAT","Rural short",33,12031.1373418944,786.75714705979999,56.76,0,4.9619011097869247E-3,0,0,0,0,0,1,2.0873704739888714E-3,"N/A",6.2309566387727505E-6,"N/A"]
[null,"T838","PORTLAND","Rural short",640.5,23617.008375544501,421.23,77.471999999999994,0.42712340986000003,0.27080130743353537,1,0.17968209659000001,0.17968209659228981,3.2400974521618303E-4,3.2400974521618303E-4,9,0.11392058022668221,"N/A",2.5546922218968281E-4,"N/A"]
[null,"T841","PORTLAND","Rural short",394.5,20611.1106221806,366.57,40.512,1.5370340357196,9.2424665447971371E-2,5,0.64659883232000004,0.64659883231872584,1.8568250783542795E-3,1.8568250783542795E-3,1,3.8881169425941962E-2,"N/A",8.1002436304045757E-5,"N/A"]
[null,"T842","PORTLAND","Rural short",231.5,42495.172639376899,169.3,39.840000000000003,1.5926073281447002,0.94969306076811355,8,0.66997738162930009,0.51374237486681329,2.249375346596963E-3,2.1185252571827356E-3,8,0.39951647776483123,"N/A",1.0156459321199584E-3,"N/A"]
[null,"T865","AMBARVALE","Urban",833.5,0,6304.11982211744,201,9.9741618128999995E-2,0,1,8.0470538748999999E-3,8.047053874870343E-3,1.0874397128203168E-4,1.0874397128203168E-4,0,0,"N/A",0,"N/A"]
[null,"T868","AMBARVALE","Rural short",922,39584.820337380697,3978.8937807181201,210,4.5266312951268004,0.16596448338854475,6,1.9042613512021,1.9042613512452566,9.8449114892609473E-3,9.8449114892609473E-3,4,6.9817869137448668E-2,"N/A",1.8069774252440978E-4,"N/A"]
[null,"T869","AMBARVALE","Urban",1518.5,0,9772.4518809527308,155,2.2986784502368605,0.25372348062880601,14,0.18545507559493202,0.18545507559498489,2.1473946856462737E-3,2.1473946856462737E-3,2,2.0470156352320908E-2,"N/A",9.3209118241741439E-5,"N/A"]
[null,"T870","AMBARVALE","Urban",826,0,7448.09127248194,168,0.1247584867087,0,2,1.0065389781430002E-2,1.0065389781412666E-2,2.8679728689766596E-5,2.8679728689766596E-5,0,0,"N/A",0,"N/A"]
[null,"T872","AMBARVALE","Urban",1134.5,0,7724.5270592248098,161,3.0995144776813,0,2,0.25006572437517999,0.25006572437824737,3.5730161992667546E-3,3.5730161992667546E-3,0,0,"N/A",0,"N/A"]
[null,"T874","AMBARVALE","Urban",454,12453.6491390066,3341.26679118519,135,1.0202113031139999,0.70725605370843481,3,8.2309626350799997E-2,8.2309626350934723E-2,1.0910246789065377E-3,1.0910246789065377E-3,7,5.7060710205681452E-2,"N/A",1.3981367736261215E-4,"N/A"]
[null,"T876","AMBARVALE","Urban",898.5,0,7572.0718339763498,219,0.1076066016796,0,3,8.6815928721800002E-3,8.6815928721314297E-3,5.1384513902498485E-5,5.1384513902498485E-5,0,0,"N/A",0,"N/A"]
[null,"T882","ROOTY HILL","Urban",706.5,1545.3561618872,3775.3444853482902,161.76,0.11305728708,0.58431939934654975,1,9.1213487120000002E-3,9.1213487120411843E-3,5.8554446074940131E-5,5.8554446074940131E-5,2,4.7142304033803838E-2,"N/A",1.4220365475342604E-4,"N/A"]
[null,"T883","ROOTY HILL","Urban",1292,1130.8238691515601,7958.14808112627,229.63,2.58463207061E-2,0.32733735679489862,3,2.0852552735099996E-3,1.8450625457083177E-3,9.5599095632555318E-6,8.3649208678485904E-6,1,2.6409250168493405E-2,"N/A",1.0157403910959002E-4,"N/A"]
[null,"T884","ROOTY HILL","Urban",339,896.93,7784.2667723797404,141.12,0.98085676207000005,3.0408307398186736E-2,1,7.9134541387000004E-2,0,4.062961564383601E-4,0,4,2.4533117916704507E-3,"N/A",9.5599095632555318E-6,"N/A"]
[null,"T887","ROOTY HILL","Urban",87,868.82,3015.19,169.24799999999999,7.2162334945999995E-2,0,1,5.8219849240000003E-3,5.8219849240226185E-3,1.039640165004039E-4,1.039640165004039E-4,0,0,"N/A",0,"N/A"]
[null,"T888","ROOTY HILL","Urban",722.5,3308.3302080532098,4535.7082143989801,403.49,0.10621430704,1.1110214992391558,2,8.5692639348000001E-3,8.5692639347631772E-3,6.3334400856567897E-5,6.3334400856567897E-5,5,8.9636102042474672E-2,"N/A",2.3541277299516747E-4,"N/A"]
[null,"T889","ROOTY HILL","Urban",1198,4357.8584546722605,3608.4168494341502,226.56,7.6836593907999999,0,1,0.61990994565000002,0,1.4339864344883298E-3,0,0,0,"N/A",0,"N/A"]
[null,"T890","ROOTY HILL","Urban",1446,1921.88406939429,6952.7342799029202,240.96,0.37269061410300003,0,3,3.0068305554100002E-2,3.0068305553829465E-2,1.4459363214423994E-4,1.4459363214423994E-4,0,0,"N/A",0,"N/A"]
[null,"T892","ROOTY HILL","Urban",56,858.77,2856.1134733377999,181.44,0,1.9847604439147699E-2,0,0,0,0,0,2,1.6012848518453015E-3,"N/A",9.5599095632555318E-6,"N/A"]
[null,"T893","ROOTY HILL","Urban",837,3259.22753075726,1418.63,159.648,0.35345028711600002,0.52655398344156767,7,2.85160152382E-2,2.8516015238495847E-2,2.5811755820789932E-4,2.5811755820789932E-4,2,4.2481848121716771E-2,"N/A",1.2666880171313579E-4,"N/A"]
[null,"T894","ROOTY HILL","Urban",1463,3246.3609283195301,7669.4759441564302,280.8,0.1568849449395,1.5127133144553391,5,1.2657320261830002E-2,1.2657320261750326E-2,1.5295855301208851E-4,1.5295855301208851E-4,5,0.12204419546191093,"N/A",2.7484739994359652E-4,"N/A"]
[null,"T895","ROOTY HILL","Urban",321,1099.5367758126999,3944.6940949590899,155.22999999999999,1.3121043931266998,0,3,0.10585926856734,1.0515900519581085E-4,3.8598134861644211E-4,1.1949886954069415E-6,0,0,"N/A",0,"N/A"]
[null,"T899","ROOTY HILL","Urban",432.5,2142.2336505255898,2522.5237635221902,159.648,0.54731990987759993,0.31896877731122814,2,4.4157222272499998E-2,4.41572222726773E-2,5.2340504858824032E-4,5.2340504858824032E-4,1,2.5734081555588484E-2,"N/A",7.0504333029009549E-5,"N/A"]
[null,"T900","ROOTY HILL","Urban",331.5,2304.4972752256799,3778.7096976487801,134.4,0.4182512344398,7.6161479123953338E-2,4,3.3744090780940005E-2,3.3744090780901209E-2,4.5529069295004474E-4,4.5529069295004474E-4,2,6.1446318717824928E-3,"N/A",3.5849660862208241E-5,"N/A"]
[null,"TM1210","TOMERONG","Rural short",465,35135.026444248302,148.36000000000001,83.231999999999999,2.7180553697663998,0.51174233833772609,12,1.1434303908641998,1.14343039086791,8.4304843322595309E-3,8.4304843322595309E-3,7,0.21527955186959855,"N/A",7.6017670993027558E-4,"N/A"]
[null,"TM1217","TOMERONG","Rural short",1576,15557.1778162394,5196.59,210.048,0.131453350302,-1.5731448264790127,2,5.5299740169000001E-2,5.5299740169108158E-2,1.4331200269177328E-4,1.4331200269177328E-4,7,-0.66178990460405385,"N/A",1.5951248995258241E-3,"N/A"]
[null,"TM1232","TOMERONG","Rural short",170.5,22804.6721587545,233.24,31.872,1.8899659152830001E-2,0.53855141597567935,3,7.9507006710300004E-3,7.9507006710740295E-3,1.3708104605300049E-4,1.3708104605300049E-4,2,0.22655758338577722,"N/A",5.4832418421200209E-4,"N/A"]
[null,"TM1258","TOMERONG","Rural short",1659.5,19751.637683097,2197.94,182.304,2.8627503307666,1.2455556717173488,5,1.2043006062471,1.2043006062720811,1.2044439182747727E-2,1.2044439182747727E-2,7,0.52397983662431691,"N/A",2.4612278723152364E-3,"N/A"]
[null,"TM1284","TOMERONG","Rural short",896.5,21193.867479264001,522.19000000000005,107.328,0.61940818659920005,1.8972976795765855,4,0.26057237567389996,0.26057237567683772,5.2963131429568386E-3,5.2963131429568386E-3,9,0.7981543906435955,"N/A",3.5142595442678314E-3,"N/A"]
[null,"ULB2","ULLADULLA","Urban",1414,9275.6243691746695,4940.3900000000003,153,0.3535539686311,11.293242490939729,4,2.852438015889E-2,2.8524380159363691E-2,3.2384193645528111E-4,3.2384193645528111E-4,13,0.9111274957338904,"N/A",2.1641245273819709E-3,"N/A"]
[null,"ULC2","ULLADULLA","Urban",2193,8615.6842989738307,7266.57,189.96,6.982950084176001,4.7521534034714241,8,0.56337742044119998,0.5633774204496026,7.0874779524585686E-3,7.0874779524585686E-3,11,0.38339897804566769,"N/A",1.021715334572935E-3,"N/A"]
[null,"ULD2","ULLADULLA","Urban",923.5,3879.88435321011,1053.8723454529099,179,0.38927965662499997,2.0752595954992419,4,3.1406692892600001E-2,3.1406692892685231E-2,2.103180103916217E-4,2.103180103916217E-4,5,0.16742986611346658,"N/A",5.9868933639887763E-4,"N/A"]
[null,"ULE2","ULLADULLA","Rural short",1481.5,94634.8489884429,2782.24,88.96,1.408942928853,4.7186335112441151,9,0.59271351930702998,0.5927135193066192,2.6730803980335107E-3,2.6730803980335107E-3,28,1.985032762849311,"N/A",1.2954158852008549E-2,"N/A"]
[null,"ULF2","ULLADULLA","Urban",1666,11650.262350139399,1636.58,176,2.7773019501340004,4.0129634429191068,7,0.22406994030244001,0.22406994029836474,4.4130932521378357E-3,4.4130932521378357E-3,9,0.32376187221268887,"N/A",8.5083195112974227E-4,"N/A"]
[null,"ULH2","ULLADULLA","Rural short",734.5,81447.935918870004,2598.5500000000002,99,3.3916889890474997,4.0281009442152333,12,1.4268142987761803,1.4268142987992944,8.5987201615063975E-3,8.5987201615063975E-3,10,1.6945398126974434,"N/A",3.445719021241331E-3,"N/A"]
[null,"ULJ2","ULLADULLA","Urban",1877.5,9094.0602277845701,622.1,170.04,0.65380082653300009,3.0065121581130727,6,5.2747996003699997E-2,5.2747996003957798E-2,5.1982008250201948E-4,5.1982008250201948E-4,10,0.24256239035978719,"N/A",7.7435267462369801E-4,"N/A"]
[null,"ULK2","ULLADULLA","Rural short",1432.5,13224.757708954899,6248.6268897537402,156,1.65742308714E-2,4.4032058564700209,2,6.9724404787799999E-3,6.9724404787867081E-3,3.7385739832636501E-5,3.7385739832636501E-5,10,1.8523387895743633,"N/A",5.8321754138912947E-3,"N/A"]
[null,"ULL2","ULLADULLA","Rural short",531,30140.327445854498,4692.24,120.96,1.5241182812200001E-2,1.4245988377325856,2,6.4116543812799999E-3,6.4116543812971607E-3,3.7385739832636501E-5,3.7385739832636501E-5,10,0.59929964047380191,"N/A",1.526584376499324E-3,"N/A"]
[null,"UNA2","UNANDERRA","Urban",3,0,534.82000000000005,78.08,0,2.2661817008877597E-2,0,0,0,0,0,1,1.8283327039726204E-3,"N/A",3.5849660862208244E-6,"N/A"]
[null,"UNB2","UNANDERRA","Urban",182,2785.0764175120698,343.25,149.6,0,1.4219179299687903E-2,0,0,0,0,0,1,1.1471891475906637E-3,"N/A",2.389977390813883E-6,"N/A"]
[null,"UNC2","UNANDERRA","Urban",9,1930.72740159822,235.53,180,0,4.1916955643871634E-3,0,0,0,0,0,1,3.3818180080016441E-4,"N/A",1.1949886954069415E-6,"N/A"]
[null,"UNE2","UNANDERRA","Urban",68,2061.2545275984698,1155.53,74,0.19521748247000001,0,1,1.5749951004999999E-2,1.5749951005463489E-2,8.1259231287672014E-5,8.1259231287672014E-5,0,0,"N/A",0,"N/A"]
[null,"UNF2","UNANDERRA","Urban",590,2983.4337688711998,1801.1006704272299,109.92,3.1548804071000001E-3,1.2323881192200337,1,2.5453259212000003E-4,2.5453259212167853E-4,1.1949886954069415E-6,1.1949886954069415E-6,5,9.9427839412639163E-2,"N/A",3.5610663123126856E-4,"N/A"]
[null,"UNG2","UNANDERRA","Urban",36,1041.7438673423301,322.17,25.92,0.45865740229000002,0,1,3.7004019941999998E-2,3.7004019941971347E-2,4.3019593034649893E-5,4.3019593034649893E-5,0,0,"N/A",0,"N/A"]
[null,"UNH2","UNANDERRA","Urban",396.5,4404.3612274881498,585.87796481958503,124.8,4.9293154906000003E-2,1.826275841303665E-2,2,3.9769223782999998E-3,3.9769223783143008E-3,8.484419737389284E-5,8.484419737389284E-5,1,1.4734210614367588E-3,"N/A",1.0754898258662473E-5,"N/A"]
[null,"UNJ2","UNANDERRA","Urban",1511,6856.6977428008104,4465.0786727349396,282.048,3.4363016640999999E-3,-2.4807283802169047,2,2.7723737733600001E-4,2.7723737733441041E-4,2.389977390813883E-6,2.389977390813883E-6,3,-0.20014268165023158,"N/A",3.7044649557615186E-4,"N/A"]
[null,"W111","APPIN","Rural short",577,34388.033369029399,141.46,114,0.58412684796303005,2.1646330620558216,8,0.24573023696867,0.24573023696328097,2.0312918642399168E-3,2.0312918642399168E-3,7,0.91061692701680486,"N/A",2.0437537775174625E-3,"N/A"]
[null,"W112","APPIN","Rural short",311.5,18254.599787769799,66.888801674324,67,9.5831343822000009E-3,0,2,4.0314289452999998E-3,4.0314289452859694E-3,1.3085008941422777E-4,1.3085008941422777E-4,0,0,"N/A",0,"N/A"]
[null,"W113","APPIN","Urban",693,3965.5537981747102,4334.47,128,0.43189275958200002,0.47189901300839227,2,3.4844675369299999E-2,3.4844675369371005E-2,2.0087759969790687E-3,2.0087759969790687E-3,3,3.8072339835665152E-2,"N/A",9.2014129546334492E-5,"N/A"]
[null,"W114","APPIN","Rural short",36,13717.308674338199,122.32,7,0.1062291186893,0.11197603698504224,2,4.4688421013099999E-2,4.4688421013278169E-2,2.3677635227336454E-4,2.3677635227336454E-4,1,4.7106032189121995E-2,"N/A",1.1215721949790952E-4,"N/A"]
[null,"W118","HAZELBROOK","Urban",718,7083.2703285223897,683.19,70,1.5807876353020001,0.99889734580307521,6,0.12753636350636,9.1242166849101594E-2,1.4805909936092005E-3,9.5001601284851851E-4,4,8.0590037618244126E-2,"N/A",2.5214261473086464E-4,"N/A"]
[null,"W120","HAZELBROOK","Urban",1127.5,10412.417616160799,4638.38,92,8.1858926529779996,2.35216330071556,8,0.66042962233619995,0.15793807090584924,4.3437839078042332E-3,1.6419144674891376E-3,9,0.18977017977409932,"N/A",4.4334080599597528E-4,"N/A"]
[null,"W123","HAZELBROOK","Urban",1016.5,7227.2936413441703,1182.94663848919,123.16800000000001,0.99663116410079988,0.60253772282427487,7,8.0407204347529987E-2,8.0407204347846858E-2,8.0661736939968546E-4,8.0661736939968546E-4,13,4.861214012915438E-2,"N/A",1.326437451901705E-4,"N/A"]
[null,"W124","HAZELBROOK","Rural short",1116.5,18386.586639082801,1681.52084971768,117,2.4044187846478002,1.1810065223548072,5,1.01148988403877,0.13827738972764489,3.7323430266248776E-3,2.4799207422315549E-3,7,0.49682532759254527,"N/A",1.1278031516178679E-3,"N/A"]
[null,"W126","HAZELBROOK","Rural short",82,1201.55855386545,143.99,6.9119999999999999,0,0.26972005734095489,0,0,0,0,0,4,0.11346572039205179,"N/A",3.1154783193863752E-4,"N/A"]
[null,"W127","HAZELBROOK","Rural short",971,9925.4798152807598,4013.23,91,0.80673106222799995,1.2304774170016382,2,0.33937528428399999,0.33937528428739666,2.847547183919147E-3,2.847547183919147E-3,10,0.51763672276604622,"N/A",1.651203509274779E-3,"N/A"]
[null,"W163","MEADOW FLAT","Rural short",242.5,66916.217149160206,103.91,26.975999999999999,5.5277759714563608,1.5260586066939004,22,2.3254224730223605,2.3254224730213555,9.6517518334587101E-3,9.6517518334587101E-3,24,0.64198169344939526,"N/A",1.6449725526360062E-3,"N/A"]
[null,"W164","MEADOW FLAT","Rural short",68.5,30724.858809076501,0,9,0.35503692848489998,0.18270164235588571,8,0.14935678589790002,0.12450149986664173,1.1589579348094572E-3,1.0717245418666388E-3,3,7.6858850139261886E-2,"N/A",1.9315965580195529E-4,"N/A"]
[null,"W184","BOW BOWING","Urban",0,0,0,0,0,3.7251287436161538E-2,0,0,0,0,0,2,3.0053965689484578E-3,"N/A",1.5534853040290238E-5,"N/A"]
[null,"W185","BOW BOWING","Urban",414.5,2140.62,7438.1641343070596,297,3.6880996309E-3,0,1,2.9755218515999999E-4,2.9755218515632845E-4,1.1949886954069415E-6,1.1949886954069415E-6,0,0,"N/A",0,"N/A"]
[null,"W188","BOW BOWING","Urban",138,13098.704432348901,1865.72459842901,63,0.123677236617,0.31141483830826894,2,9.9781556066000001E-3,9.9781556066479617E-3,5.3774491293312365E-5,5.3774491293312365E-5,4,2.5124637320930943E-2,"N/A",6.5724378247381776E-5,"N/A"]
[null,"W190","BOW BOWING","Urban",219.5,787.42327998572705,3309.2324477386701,162,0,3.473330776850847E-2,0,0,0,0,0,2,2.8022484907292778E-3,"N/A",1.9119819126511064E-5,"N/A"]
[null,"W191","BOW BOWING","Urban",10,0,1527.75741550303,215,0,7.1836478753631592E-3,0,0,0,0,0,1,5.7956951727236659E-4,"N/A",1.1949886954069415E-6,"N/A"]
[null,"W196","BOW BOWING","Urban",1056.5,3610.2425961449399,2412.63221651001,149,3.3607622741011998,1.0513305694706743,6,0.27114293499052006,0.27114293498783504,2.9074074959250882E-3,2.9074074959250882E-3,3,8.4820297599984704E-2,"N/A",2.8321232081144514E-4,"N/A"]
[null,"WBB2","WOMBARRA","Urban",1049,7443.6278184605999,533.46,89,2.7613646199580999,8.8921711380912836,9,0.22278413246491,0.2227841324621069,1.6024798405407084E-3,1.6024798405407084E-3,16,0.71741146328755734,"N/A",1.9287117543868035E-3,"N/A"]
[null,"WBC2","WOMBARRA","Rural short",948,10999.4171919031,2079.11,95,3.502687457495,5.1613399111101508,7,1.4735090878519999,1.4735090878502579,1.3421480599916505E-2,1.3421480599916505E-2,14,2.1712703051299465,"N/A",5.8695611537239309E-3,"N/A"]
[null,"WBD2","WOMBARRA","Rural short",842.5,8300.3772863806607,433.51,68,1.012035275014,1.3545249447463112,5,0.42574257425999995,0.42574257425742573,6.0938755927197504E-3,6.0938755927197504E-3,11,0.56982098461576802,"N/A",2.2618372598745087E-3,"N/A"]
[null,"WBE2","WOMBARRA","Rural short",40,5329.4826353533099,78.16,6.9119999999999999,0.25591560410399999,5.1840757863445483E-3,4,0.10765846880459999,0.10765846880471558,9.969530622036401E-4,9.969530622036401E-4,1,2.1808348235704627E-3,"N/A",1.2461913277545501E-5,"N/A"]
[null,"WD1210","WINDSOR","Rural short",277.5,9193.7099999999991,831.53,87.456000000000003,1.2017960954500001E-2,0.72428944557785258,2,5.0557107647000001E-3,5.0557107646759906E-3,1.0102166190249489E-3,1.0102166190249489E-3,6,0.30469377963598754,"N/A",9.7202923564854908E-4,"N/A"]
[null,"WD1221","WINDSOR","Rural short",135.5,10887.85,1114.53,7.968,0.31325148229920002,0.13508220334703508,4,0.13177850195230001,0.1317785019534049,9.8449114892609465E-4,9.8449114892609465E-4,1,5.6826324545607487E-2,"N/A",1.4954295933054603E-4,"N/A"]
[null,"WD1225","WINDSOR","Urban",733.5,18807.711989305299,1647.82,258.43200000000002,0.21688691925550002,1.6125438024552312,4,1.7498219466919998E-2,1.7498219466843844E-2,1.3503372258098439E-4,1.3503372258098439E-4,9,0.13009841926895371,"N/A",3.2384193645528111E-4,"N/A"]
[null,"WD1247","WINDSOR","Rural short",746.5,8307.51,10726.6,257.76,0.12424007913,0,1,5.2265264286E-2,5.2265264286025834E-2,2.2431443899581903E-4,2.2431443899581903E-4,0,0,"N/A",0,"N/A"]
[null,"WD1251","WINDSOR","Rural short",1037.5,21225.302505235501,5003.18,346.84800000000001,2.2964567034962999,2.2405575548581136,6,0.96607244110376,0.96607244110188228,9.296587305048943E-3,9.296587305048943E-3,11,0.94255681074715403,"N/A",1.8319012517991886E-3,"N/A"]
[null,"WD1258","WINDSOR","Urban",767,4838.8100000000004,3202.29,294.43200000000002,8.7092473211000006E-3,8.2426805002878314E-2,1,7.0265335290000004E-4,7.0265335289928154E-4,8.3649208678485904E-6,8.3649208678485904E-6,3,6.6501120899396292E-3,"N/A",1.5534853040290238E-5,"N/A"]
[null,"WD1284","WINDSOR","Urban",235,6139.44,1404.31,109.152,0.6423605197394,0.27794052037358696,4,5.1825003507050001E-2,5.1825003507395842E-2,9.9766181942886E-4,9.9766181942886E-4,2,2.2423962869311257E-2,"N/A",9.5599095632555318E-5,"N/A"]
[null,"WH1209","WHALAN","Urban",1155,4580.4819077880302,1344.39709564692,204.96,0.28230995567899997,0.145746587821801,3,2.2776484534800003E-2,6.309540311748651E-3,1.5773850779371627E-4,4.0629615643836007E-5,2,1.1758688762804304E-2,"N/A",6.213941216116095E-5,"N/A"]
[null,"WH1213","WHALAN","Urban",139.5,0,2820.18,70.751999999999995,0,5.5543669139405871E-3,0,0,0,0,0,1,4.4812076077760306E-4,"N/A",1.1949886954069415E-6,"N/A"]
[null,"WH1220","WHALAN","Urban",196,0,1714.34062133001,76.031999999999996,0,0.17137073385144691,0,0,0,0,0,2,1.3826019205858313E-2,"N/A",6.9309344333602603E-5,"N/A"]
[null,"WH1224","WHALAN","Urban",1290.5,4800.2702492724702,4338.4351321870399,212.928,1.35550251332,0.31237759524001862,3,0.1093605854489,2.4210470968944633E-3,1.2547381301772885E-4,3.4654672166801301E-5,3,2.5202311586132394E-2,"N/A",9.5599095632555318E-5,"N/A"]
[null,"WH1235","WHALAN","Urban",1152.5,6444.5013883929296,1205.3800000000001,171.26400000000001,13.642621202351,0,12,1.1006730176372004,7.9360394250670388E-2,2.068525431749416E-3,4.2541597556487113E-4,0,0,"N/A",0,"N/A"]
[null,"WH1246","WHALAN","Urban",801.5,0,4155.08232339403,211.29599999999999,4.6153086144000002E-2,0,1,3.7235847748999999E-3,3.7235847748880294E-3,2.389977390813883E-6,2.389977390813883E-6,0,0,"N/A",0,"N/A"]
[null,"WH1261","WHALAN","Urban",1049.5,463.51318492579401,6362.88673683262,201.40799999999999,0.18609350908,1.3990339382833552,1,1.5013837969E-2,0,1.2511531640910676E-3,0,3,0.11287265722466265,"N/A",2.8918726428847982E-4,"N/A"]
[null,"WH1287","WHALAN","Urban",1626.5,2101.9312262202402,3907.0205666900802,156.57599999999999,1.802162483072,0,5,0.14539666454569999,2.305969685526775E-2,2.9157724167929371E-4,2.019530895237731E-4,0,0,"N/A",0,"N/A"]
[null,"WH1294","WHALAN","Urban",1427.5,6007.27850196702,3715.87158441783,266.01600000000002,0.29458880946900001,4.0732024035564302E-3,4,2.3767130162699997E-2,2.2155090412844695E-2,2.0673304430540086E-4,1.8402825909266898E-4,1,3.286218912369089E-4,"N/A",1.1949886954069415E-6,"N/A"]
[null,"WL1214","WEST LIVERPOOL","Urban",50.5,662.88,1315.29,49.44,0,6.0727744925750421E-2,0,0,0,0,0,1,4.8994536511684601E-3,"N/A",1.1949886954069415E-5,"N/A"]
[null,"WL1217","WEST LIVERPOOL","Urban",1566.5,7119.6259518942197,1552.2602301992999,235,0.13837038856,5.4877145109733003E-2,2,1.11635843925E-2,1.1163584392491648E-2,1.0874397128203168E-4,1.0874397128203168E-4,1,4.4274331164827182E-3,"N/A",2.2704785212731886E-5,"N/A"]
[null,"WL1218","WEST LIVERPOOL","Urban",631.5,0,4038.1026260885601,144.96,0.10273357044,0,1,8.2884415913000008E-3,8.2884415913425467E-3,4.0629615643836007E-5,4.0629615643836007E-5,0,0,"N/A",0,"N/A"]
[null,"WL1221","WEST LIVERPOOL","Urban",135,801.14463774336298,1504.64,171.648,0,4.7397264332293011E-3,0,0,0,0,0,1,3.8239638253022127E-4,"N/A",1.1949886954069415E-6,"N/A"]
[null,"WL1229","WEST LIVERPOOL","Urban",0,0,2361.46,2,0,0.27371920151899215,0,0,0,0,0,1,2.2083391091120279E-2,"N/A",5.2579502597905425E-5,"N/A"]
[null,"WL1236","WEST LIVERPOOL","Urban",2219.5,8887.7381906365499,1580.11156015798,275,1.433796869349,1.0628836526516707,8,0.11567729569270001,8.629849861620309E-2,3.596915973174894E-3,3.5311915949275121E-3,1,8.5752388782402114E-2,"N/A",1.6490843996615792E-4,"N/A"]
[null,"WL1243","WEST LIVERPOOL","Urban",8,0,3700.48,67.584000000000003,0,6.0727744925750419E-3,0,0,0,0,0,1,4.8994536511684603E-4,"N/A",1.1949886954069415E-6,"N/A"]
[null,"WL1251","WEST LIVERPOOL","Urban",731,3121.7409726836199,3861.8277647422501,170,0.25199051815509999,0.3839178410915734,3,2.0330342675029998E-2,2.0330342674958295E-2,4.8158044424899741E-4,4.8158044424899741E-4,1,3.0974106984947923E-2,"N/A",5.7359457379533191E-5,"N/A"]
[null,"WL1255","WEST LIVERPOOL","Urban",4.5,0,511.81,110.304,2.4587330872000001E-3,0,1,1.9836812344000001E-4,1.9836812343755229E-4,1.1949886954069415E-6,1.1949886954069415E-6,0,0,"N/A",0,"N/A"]
[null,"WL1258","WEST LIVERPOOL","Urban",12.5,799.47246641434697,3961.05,75.744,0,0.24039300003534861,0,0,0,0,0,2,1.9394666526454659E-2,"N/A",2.2704785212731886E-5,"N/A"]
[null,"WL1262","WEST LIVERPOOL","Urban",30,241.64335945668401,1835.49,166.27199999999999,0,1.3982192978026439E-2,0,0,0,0,0,1,1.1280693284641528E-3,"N/A",4.7799547816277659E-6,"N/A"]
[null,"WL1277","WEST LIVERPOOL","Urban",768,1437.6991735983499,3964.4585593066199,200.16,0.49878214887000005,0,2,4.0241244317999997E-2,4.0241244317828752E-2,3.1189204950121175E-4,3.1189204950121175E-4,0,0,"N/A",0,"N/A"]
[null,"WL1280","WEST LIVERPOOL","Urban",324.5,3496.2468753845801,2529.91,195,8.6959168404710005E-2,4.591609982190885E-3,2,7.0157786307470001E-3,7.0157786307341536E-3,4.8994536511684599E-5,4.8994536511684599E-5,1,3.7044649557615186E-4,"N/A",1.1949886954069415E-6,"N/A"]
[null,"WL1292","WEST LIVERPOOL","Urban",1613.5,6759.0639871761396,1354.69,150,0.4729062048753,2.1217681611253041,8,3.8153599067249994E-2,2.9583140143494245E-2,1.7327336083400649E-4,1.4698360953505378E-4,4,0.17118213061704438,"N/A",3.9195629209347679E-4,"N/A"]
[null,"WL1295","WEST LIVERPOOL","Urban",1052,0,5622.0633020216101,205,7.6694698347999996E-2,0,2,6.1876514648400004E-3,6.1876514648171429E-3,3.7044649557615181E-5,3.7044649557615181E-5,0,0,"N/A",0,"N/A"]
[null,"WL1296","WEST LIVERPOOL","Urban",137.5,1267.02,2541.5089919992702,98.304000000000002,0,8.0871582266974953E-2,0,0,0,0,0,1,6.5246382769219005E-3,"N/A",3.1069706080580475E-5,"N/A"]
[null,"WL1299","WEST LIVERPOOL","Urban",34,965.08713423843801,2806.32,98.4,0,1.7773974124609879E-2,0,0,0,0,0,1,1.4339864344883298E-3,"N/A",5.9749434770347074E-6,"N/A"]
[null,"WM1112","WESTMEAD","Urban",2100.5,557.45000000000005,5275.9102210622796,238,1.6043139741099999,0.42302058416571514,3,0.12943444495799999,0.12943444496205572,5.008046506261063E-3,5.008046506261063E-3,1,3.4128877140822245E-2,"N/A",2.4377769386301607E-4,"N/A"]
[null,"WM1142","WESTMEAD","Urban",1222.5,0,4205.69805612858,168.38399999999999,1.1791095398440001,0,2,9.5129376982600003E-2,9.5129376982449831E-2,2.8971129745824758E-3,2.8971129745824758E-3,0,0,"N/A",0,"N/A"]
[null,"WM1222","WESTMEAD","Urban",582,520.01,2289.9299999999998,160,4.2541118163999997E-2,0.24579925049825077,1,3.4321748151000002E-3,3.4321748151292263E-3,6.8643496302584525E-4,6.8643496302584525E-4,2,1.9830837400278193E-2,"N/A",2.3660776169057442E-4,"N/A"]
[null,"WM1252","WESTMEAD","Urban",361.5,1647.03572836389,1077.3813424099501,154,0.12386364612670001,8.2945212581512773E-3,3,9.9931949391400005E-3,9.9931949391983063E-3,5.2330594449025126E-4,5.2330594449025126E-4,2,6.6919366942788726E-4,"N/A",4.7799547816277659E-6,"N/A"]
[null,"WP1209","WEST PARRAMATTA","Urban",200.5,0,1516.23011695587,228.096,0.14156970390000001,5.3321922373829635E-2,1,1.1421701951E-2,1.1421701950699546E-2,2.1509796517324947E-5,2.1509796517324947E-5,1,4.3019593034649894E-3,"N/A",1.9119819126511064E-5,"N/A"]
[null,"WP1212","WEST PARRAMATTA","Urban",838,0,2774.97102436664,274.94400000000002,2.4439214421E-2,0.23584582498846926,1,1.9717313473999998E-3,1.9717313474214536E-3,1.1949886954069415E-5,1.1949886954069415E-5,3,1.9027804996964728E-2,"N/A",9.9184061718776145E-5,"N/A"]
[null,"WP1223","WEST PARRAMATTA","Urban",1,0,955.33,207.16800000000001,2.4439214421000002E-3,0,1,1.9717313474E-4,1.9717313474214534E-4,1.1949886954069415E-6,1.1949886954069415E-6,0,0,"N/A",0,"N/A"]
[null,"WP1226","WEST PARRAMATTA","Urban",132,0,1265.52,198.14400000000001,0,0.18277570058140491,0,0,0,0,0,2,1.4746160501321657E-2,"N/A",8.0064242592265081E-5,"N/A"]
[null,"WP1235","WEST PARRAMATTA","Urban",288.5,0,2215.1,154.36799999999999,1.0812500925999999E-3,1.732962477149463E-2,1,8.7234174764999996E-5,8.723417476470672E-5,1.1949886954069415E-6,1.1949886954069415E-6,1,1.3981367736261214E-3,"N/A",3.5849660862208244E-6,"N/A"]
[null,"WP1241","WEST PARRAMATTA","Urban",189,0,2225.7622787178798,260.928,0,0.10560702959039037,0,0,0,0,0,1,8.520269398251493E-3,"N/A",3.7044649557615188E-5,"N/A"]
[null,"WP1245","WEST PARRAMATTA","Urban",965.5,0,4038.8072686747,179.52,0,0.76761350750658919,0,0,0,0,0,3,6.1930289139464738E-2,"N/A",1.0874397128203168E-4,"N/A"]
[null,"WP1256","WEST PARRAMATTA","Urban",511,0,2128.4867698642101,152.256,0,5.1988874314483895E-2,0,0,0,0,0,1,4.1944103208783647E-3,"N/A",2.1509796517324947E-5,"N/A"]
[null,"WP1264","WEST PARRAMATTA","Urban",444.5,0,2983.1062115023201,180,0,9.7608741234315913E-2,0,0,0,0,0,2,7.8749755027317445E-3,"N/A",5.1384513902498485E-5,"N/A"]
[null,"WP1271","WEST PARRAMATTA","Urban",151,0,3106.8361806401499,187.96799999999999,2.7534848248199999E-2,0.18795977636774946,2,2.2214839847500001E-3,2.2214839847615039E-3,6.572437824738179E-5,6.572437824738179E-5,3,1.5164406544714086E-2,"N/A",4.6604559120870719E-5,"N/A"]
[null,"WP1275","WEST PARRAMATTA","Urban",1073.5,188.78458057345301,3281.8922263200102,98.688000000000002,2.5256520998208001,0.32948504533495565,2,0.20376708235908,0.20376708236340085,1.3634821014593202E-3,1.3634821014593202E-3,3,2.6582523529327412E-2,"N/A",1.6968839474778568E-4,"N/A"]
[null,"WP1286","WEST PARRAMATTA","Urban",155.5,0,2664.68,176.83199999999999,0,0.14730181055770436,0,0,0,0,0,4,1.1884162575822033E-2,"N/A",7.7674265201451188E-5,"N/A"]
[null,"WP1290","WEST PARRAMATTA","Urban",179,0,1356.73,140.54400000000001,0,9.2424665447971371E-2,0,0,0,0,0,1,7.4567294593393145E-3,"N/A",6.213941216116095E-5,"N/A"]
[null,"WQ1208","WETHERILL PARK","Urban",109,799.03604777703003,1810.58,126.816,3.0423119043000001E-2,0.22484077267631497,1,2.4545067803999998E-3,2.4545067803658578E-3,2.6289751298952713E-5,2.6289751298952713E-5,3,1.8139928396277372E-2,"N/A",5.4969479988719305E-5,"N/A"]
[null,"WQ1212","WETHERILL PARK","Urban",120.5,2118.7376331625401,2218.9836543534102,178.464,0,2.2883991685435218E-2,0,0,0,0,0,4,1.8462575344037246E-3,"N/A",7.1699321724416489E-6,"N/A"]
[null,"WQ1219","WETHERILL PARK","Urban",24.5,1240.9605721026001,1785.2754275924499,146.49600000000001,5.4062504629E-3,0.18040583736479027,1,4.3617087382000002E-4,4.3617087382353365E-4,1.1949886954069415E-6,1.1949886954069415E-6,3,1.4554962310056548E-2,"N/A",3.1069706080580475E-5,"N/A"]
[null,"WQ1227","WETHERILL PARK","Urban",219,1666.3844700278501,1013.19162814763,154.17599999999999,0,0.44212760634967074,0,0,0,0,0,2,3.5670412557897199E-2,"N/A",7.1699321724416482E-5,"N/A"]
[null,"WQ1249","WETHERILL PARK","Urban",536.5,2264.3522915209601,2900.4487116515702,134.976,0.27653341408999998,0.17485147045084967,2,2.2310438942999999E-2,2.2310438943247596E-2,5.4969479988719312E-5,5.4969479988719312E-5,2,1.4106841549278944E-2,"N/A",4.4214581730056833E-5,"N/A"]
[null,"WQ1256","WETHERILL PARK","Urban",1.5,0,1038.74,10.944000000000001,0,5.1100175608253398E-3,0,0,0,0,0,1,4.1227109991539478E-4,"N/A",1.1949886954069415E-6,"N/A"]
[null,"WQ1260","WETHERILL PARK","Urban",138,3893.84491385501,2135.29954852637,202.17599999999999,0.13477115880000001,4.8878428842677171E-3,1,1.087320214E-2,1.087320213950776E-2,1.6490843996615792E-4,1.6490843996615792E-4,1,3.9434626948429069E-4,"N/A",2.389977390813883E-6,"N/A"]
[null,"WQ1264","WETHERILL PARK","Urban",250.5,2275.8560818555602,1496.1937571564999,145.05600000000001,5.1692641412000003E-3,3.851027726998807E-3,2,4.1705105469999994E-4,4.1705105469702256E-4,2.389977390813883E-6,2.389977390813883E-6,1,3.1069706080580475E-4,"N/A",1.1949886954069415E-6,"N/A"]
[null,"WQ1271","WETHERILL PARK","Urban",10.5,615.32000000000005,677.41,111.648,2.3965241778099999E-2,0,2,1.93349170912E-3,1.9334917091684313E-3,4.7799547816277659E-6,4.7799547816277659E-6,0,0,"N/A",0,"N/A"]
[null,"WQ1275","WETHERILL PARK","Urban",32,564.21983916290606,2191.7837066442899,260,0,4.2065072094910047E-2,0,0,0,0,0,6,3.3937678949557139E-3,"N/A",8.3649208678485904E-6,"N/A"]
[null,"WQ1290","WETHERILL PARK","Urban",91.5,1662.03608477683,1837.48726008309,240,0.21750900835,0,3,1.7548408991800001E-2,1.7548408992050936E-2,8.3649208678485894E-5,8.3649208678485894E-5,0,0,"N/A",0,"N/A"]
[null,"WRA2","WARILLA","Urban",2233,11814.101059516401,3872.9377237573499,null,9.1183745821409996,6.7993597431439898,7,0.73566133064830008,0.73566133064381201,8.8835459616552048E-3,8.8835459616552048E-3,15,0.54856553557003351,"N/A",1.8809122065705259E-3,"N/A"]
[null,"WRB2","WARILLA","Urban",1304.5,5816.0447636179397,1048.6445078521399,112,3.5917795027018591,0.310659444407973,10,0.28978117367371203,0.28978117367009709,3.6363506001233226E-3,3.6363506001233226E-3,7,2.5063692897465191E-2,"N/A",9.0102147633683381E-4,"N/A"]
[null,"WRC2","WARILLA","Urban",1607,9281.3826535679691,1707.66,148.03200000000001,2.5738936279,4.3252225449982946,1,0.20765916054,0.20765916054434125,1.9215418222143618E-3,1.9215418222143618E-3,9,0.34895462388925802,"N/A",9.3806612589444904E-4,"N/A"]
[null,"WRD2","WARILLA","Urban",1627.5,6899.6747759864702,521.23188393530995,131,4.3995621917857699,8.8147506691335042,8,0.35495227215503805,0.35495227215150543,2.2884033517042925E-3,2.2884033517042925E-3,9,0.71116525737666525,"N/A",1.7649983031160525E-3,"N/A"]
[null,"WRE2","WARILLA","Urban",2010,9642.7251942057101,1510.69588251972,148,3.0578345083967999,4.2714562732713501,4,0.24670302618658002,0.24670302618937226,2.4616767125382991E-3,2.4616767125382991E-3,10,0.34461681492493079,"N/A",1.083854746734096E-3,"N/A"]
[null,"WRF2","WARILLA","Urban",1439.5,9028.56,701.54,166.08,0.15679607506900001,0.70681170435531948,2,1.2650150329499999E-2,1.2650150329577883E-2,6.4529389551974843E-5,6.4529389551974843E-5,4,5.7024860544819249E-2,"N/A",2.0075810082836616E-4,"N/A"]
[null,"WRG2","WARILLA","Urban",42,0,3394.99,92.64,0,0.60120467476492911,0,0,0,0,0,1,4.8504591146567751E-2,"N/A",1.1830388084528721E-4,"N/A"]
[null,"WT1215","WILTON","Rural short",408.5,18132.158161468,1573.19,87,2.7994009245999999E-3,1.3902950676720887,1,1.1776508046999999E-3,1.17765080472805E-3,6.2309566387727505E-6,6.2309566387727505E-6,12,0.58486874489840424,"N/A",1.8319012517991886E-3,"N/A"]
[null,"WT1219","WILTON","Urban",92,355.25,2186.8000000000002,22,0,1.1108733827881175E-3,0,0,0,0,0,1,8.9624152155520613E-5,"N/A",1.1949886954069415E-6,"N/A"]
[null,"WT1252","WILTON","Urban",546.5,0,9627.2099999999991,107,7.9686650659000005E-3,1.1997432534111669E-2,2,6.4290391812999999E-4,6.4290391812893443E-4,4.7799547816277659E-6,4.7799547816277659E-6,1,9.679408432796226E-4,"N/A",2.389977390813883E-6,"N/A"]
[null,"WWA2","WEST WOLLONGONG","Urban",166,607.624261307903,539.18689151736896,12.672000000000001,0.20094958911999999,0.29860276529344598,1,1.6212411630999998E-2,1.6212411630585975E-2,1.2905877910394969E-4,1.2905877910394969E-4,1,2.4090972099403939E-2,"N/A",1.0037905041418308E-4,"N/A"]
[null,"WWB2","WEST WOLLONGONG","Urban",1318.5,8823.9139736502293,1295.05,150.52799999999999,3.1524035851389502,3.5278968774133994,5,0.25433276460294102,0.25433276460206189,3.1170205578573864E-3,3.1170205578573864E-3,11,0.28462718742680693,"N/A",6.7636360160032883E-4,"N/A"]
[null,"WWC2","WEST WOLLONGONG","Urban",1159.5,8824.3292988985704,1496.99075892325,120,0.97882035575000004,0.65504500471739324,2,7.8970246165999999E-2,7.8970246165138591E-2,1.1803815309582759E-3,1.1803815309582759E-3,4,5.2848375054371989E-2,"N/A",1.8283327039726204E-4,"N/A"]
[null,"WWD2","WEST WOLLONGONG","Urban",1209.5,3285.1581167928898,911.19655639190398,202.65600000000001,0,1.576107155499781,0,0,0,0,0,3,0.12715874707825264,"N/A",2.9874717385173534E-4,"N/A"]
[null,"WWE2","WEST WOLLONGONG","Urban",917,1376.2679608037699,132.59,120.768,1.990151882738,0.63986306848595564,2,0.16056346106800001,0.16056346106965827,1.7339285970354721E-3,1.7339285970354721E-3,1,5.1623511641579869E-2,"N/A",1.0754898258662473E-4,"N/A"]
[null,"WWF2","WEST WOLLONGONG","Urban",1578.5,7270.2934491802998,304.91000000000003,153,3.3661049544775001,1.651646545529373,11,0.27157397710100001,0.27157397709605963,3.7532367521354803E-3,3.7532367521354803E-3,5,0.13325318942482803,"N/A",3.5491164253586161E-4,"N/A"]
[null,"WX1206","WEST WETHERILL PARK","Urban",43.5,291.08938997726398,2257.29598549209,163.00800000000001,0,4.1472606290756386E-2,0,0,0,0,0,1,3.3459683471394361E-3,"N/A",9.5599095632555318E-6,"N/A"]
[null,"WX1210","WEST WETHERILL PARK","Urban",39,590.94708149207099,4072.31,120,4.3783222925999996E-2,6.9614731988055355E-3,2,3.5323865836000001E-3,3.5323865836229193E-3,4.6604559120870713E-5,4.6604559120870713E-5,1,5.616446868412625E-4,"N/A",2.389977390813883E-6,"N/A"]
[null,"WX1228","WEST WETHERILL PARK","Urban",39,2228.47491755089,2416.2191014158898,54.048000000000002,4.5916099821999998E-2,0,2,3.7044649557399999E-3,3.7044649557615183E-3,1.5534853040290238E-5,1.5534853040290238E-5,0,0,"N/A",0,"N/A"]
[null,"WX1240","WEST WETHERILL PARK","Urban",7,2087.7199999999998,1189.95,126.048,0,9.4053946409393945E-3,0,0,0,0,0,2,7.5881782158340782E-4,"N/A",3.5849660862208244E-6,"N/A"]
[null,"WX1244","WEST WETHERILL PARK","Urban",185.5,1989.59591471166,2206.1,220,1.5848460261E-3,1.0664384474765927E-2,1,1.2786379040999999E-4,1.2786379040854274E-4,1.1949886954069415E-6,1.1949886954069415E-6,1,8.6039186069299784E-4,"N/A",3.5849660862208244E-6,"N/A"]
[null,"WX1254","WEST WETHERILL PARK","Urban",57,1366.4095023944401,658.36626676513401,156,3.9058308138999999E-2,3.2659677453970651E-2,1,3.1511851897999999E-3,3.1511851897881044E-3,8.3649208678485904E-6,8.3649208678485904E-6,2,2.6349500733723061E-3,"N/A",7.1699321724416489E-6,"N/A"]
[null,"WX1258","WEST WETHERILL PARK","Urban",458,2934.9097331746898,1361.8339275118501,177.024,0,0.28882707952491055,0,0,0,0,0,1,2.330227956043536E-2,"N/A",7.7674265201451188E-5,"N/A"]
[null,"WX1262","WEST WETHERILL PARK","Urban",6,36.409999999999997,2040.29,74.016000000000005,0,9.5535110919778097E-3,0,0,0,0,0,1,7.7076770853747728E-4,"N/A",3.5849660862208244E-6,"N/A"]
[null,"WX1270","WEST WETHERILL PARK","Urban",74,1154.61249681861,1874.08336846059,194.976,0,7.5243157127515151E-3,0,0,0,0,0,2,6.0705425726672625E-4,"N/A",2.389977390813883E-6,"N/A"]
[null,"WX1280","WEST WETHERILL PARK","Urban",99,2171.4884031248398,2393.0661354491599,194.01599999999999,0,2.4291097970300168E-2,0,0,0,0,0,2,1.9597814604673841E-3,"N/A",8.3649208678485904E-6,"N/A"]
[null,"WX1284","WEST WETHERILL PARK","Urban",111,483.10519476216899,2792.22,127.008,3.6140414052999999E-3,3.2585619228451446E-3,1,2.9157724168000002E-4,2.9157724167929371E-4,1.1949886954069415E-6,1.1949886954069415E-6,1,2.6289751298952711E-4,"N/A",1.1949886954069415E-6,"N/A"]
[null,"X213","ILFORD HALL","Rural short",79,56593.6999822996,373.4,9,0.73333936073859995,9.4942645115624433E-2,9,0.30850089414249998,0.30850089414219523,1.6013558561528203E-3,1.6013558561528203E-3,3,3.9940432054533334E-2,"N/A",1.7446678588563702E-4,"N/A"]
[null,"X217","ILFORD HALL","Rural short",224.5,137074.751411523,156.21,15,0.72648156905710015,1.4316639924471182,14,0.30561596121603002,0.30561596121852591,2.2431443899581902E-3,2.2431443899581902E-3,25,0.60227180679049652,"N/A",1.7197440323012793E-3,"N/A"]
[null,"X482","KANDOS","Rural short",182,152095.01628304529,692.98,20.8,1.9748391605704299,1.1841465911168216,19,0.83077450827009014,0.82112275644284993,4.6915237487331601E-3,4.6229832257066597E-3,31,0.49814629039996511,"N/A",1.1527269781729588E-3,"N/A"]
[null,"X858","WEST PENNANT HILLS","Urban",547,0,6300.1768793432802,199.96799999999999,0.72800167420299999,5.5988018492521122E-2,7,5.8734446094600004E-2,5.8734446094003405E-2,9.4012845075754623E-4,9.4012845075754623E-4,1,4.5170572686382389E-3,"N/A",2.5094762603545769E-5,"N/A"]
[null,"X859","WEST PENNANT HILLS","Urban",464.5,0,3385.3283391728601,135.16800000000001,0.77771007208100007,4.7989730136446675E-2,7,6.2744869859420016E-2,6.274486985908985E-2,1.1896504310186656E-3,1.1896504310186656E-3,1,3.8717633731184904E-3,"N/A",2.1509796517324947E-5,"N/A"]
[null,"X863","WEST PENNANT HILLS","Urban",635,4396.3339721033199,1807.5123477213499,155.904,0.74601140627899998,0.13774829946572656,3,6.01874532431E-2,6.018745324332709E-2,1.5414269414280881E-3,1.5414269414280881E-3,3,1.1113394867284555E-2,"N/A",5.3774491293312365E-5,"N/A"]
[null,"X866","WEST PENNANT HILLS","Urban",838.5,0,8378.8452269627105,248.64,0.20103400141759997,7.1095896498439516E-3,3,1.6219221929319998E-2,1.6219221929775485E-2,2.6492180111206028E-3,2.6492180111206028E-3,1,5.7359457379533186E-4,"N/A",2.389977390813883E-6,"N/A"]
[null,"X867","WEST PENNANT HILLS","Urban",982.5,1727.8101883735401,5211.9027134132002,252.38399999999999,0.17084980998839999,0.38480653979780388,3,1.378399159029E-2,1.3783991590272696E-2,1.2064199846335733E-3,1.2064199846335733E-3,6,3.1045806306672339E-2,"N/A",1.8283327039726204E-4,"N/A"]
[null,"X870","WEST PENNANT HILLS","Urban",701,0,6209.4514289048302,223.96799999999999,5.1489422328000002E-2,0.20617809984547458,1,4.1541150346999997E-3,4.1541150347167641E-3,8.3082300694335275E-4,8.3082300694335275E-4,4,1.6634242640064623E-2,"N/A",7.4089299115230375E-5,"N/A"]
[null,"X871","WEST PENNANT HILLS","Urban",817.5,1871.3821410455701,5864.7499733847599,230,0.88709258579299999,5.0063360450984494E-2,3,7.1569741536299997E-2,7.1569741536149409E-2,2.166649220679241E-3,2.166649220679241E-3,2,4.039061790475462E-3,"N/A",2.0314807821918003E-5,"N/A"]
[null,"X877","BRINGELLY","Rural short",1262.5,96808.394900923202,3476.9244000195199,375,3.2906439461267998,0.95181112601796281,17,1.3843067126037099,0.52154976353519544,1.0605088199191225E-2,3.9753503355370165E-3,8,0.40040750456417573,"N/A",1.0343388020362767E-3,"N/A"]
[null,"X879","BRINGELLY","Rural short",678,25664.034786681899,1070.6400000000001,181.82400000000001,5.1144610543900001E-2,0.31741355457532477,2,2.1515493273200001E-2,2.151549327368231E-2,8.1002436304045757E-5,8.1002436304045757E-5,4,0.13352940076890005,"N/A",5.1716940101813834E-4,"N/A"]
[null,"X881","BRINGELLY","Rural short",512,25451.3962733441,2624.49,187.392,1.109125608664,0.42413145754850323,9,0.46658649502140004,0.46658649502458116,3.8195764195676964E-3,3.8195764195676964E-3,3,0.17842344335125773,"N/A",4.3616696471409256E-4,"N/A"]
[null,"YYA2","YATTE YATTAH","Rural short",991.5,41752.487505497003,277.750065889376,95,0.31307374256249998,3.997544520366008,4,0.13170373047327999,0.13170373047373962,1.1963436746443683E-3,1.1963436746443683E-3,16,1.6816853491516552,"N/A",4.8414533083264277E-3,"N/A"]
[null,"YYB2","YATTE YATTAH","Rural short",1177,30318.068546538201,2463.7740145483799,142.99199999999999,2.2441271613198008,2.0031268838435334,8,0.94405847129734,9.7327542697630373E-2,1.393241904429587E-2,4.9224557446304732E-4,12,0.84267457582762684,"N/A",2.8600090971966927E-3,"N/A"]
[null,"To enter further feeder ID's - please insert new lines above this line. "]

{"sheet":"3.6.9 Network-reliability","index":7,"n_rows":24,"n_cols":7,"rows_kept":24,"cut":false,"hidden":false,"merged":[]}
[null,{"$f":"(LOOKUP(dms_Model,dms_Model_List,dms_Worksheet_List))","v":"REGULATORY REPORTING STATEMENT"},null,null,null,null,{"$f":"CONCATENATE(\"1-Jan-\",LEFT(CRY,4))","v":"1-Jan-2016"}]
[null,{"$f":"dms_TradingName","v":"Endeavour Energy"}]
[null,{"$f":"CONCATENATE(\"Annual Reporting RIN Response \",CRY)","v":"Annual Reporting RIN Response 2016-17"}]
[null,"3.6 QUALITY OF SERVICES"]
[]
[]
[null,"3.6.9 - NETWORK FEEDER RELIABILITY - PLANNED OUTAGES"]
[]
[]
[null,"3.6.9.1 - PLANNED MINUTES OFF SUPPLY (SAIDI)"]
[null,null,{"$f":"CRY","v":"2016-17"}]
[null,{"$f":"INDEX(dms_FeederName_1,MATCH(dms_TradingName,dms_TradingName_List))","v":"CBD"}]
[null,{"$f":"INDEX(dms_FeederName_2,MATCH(dms_TradingName,dms_TradingName_List))","v":"Urban"},53.858789380852443]
[null,{"$f":"INDEX(dms_FeederName_3,MATCH(dms_TradingName,dms_TradingName_List))","v":"Short rural"},125.89310122860088]
[null,{"$f":"INDEX(dms_FeederName_4,MATCH(dms_TradingName,dms_TradingName_List))","v":"Long rural"},110.17834394904459]
[null,{"$f":"IF((INDEX(dms_FeederName_5,MATCH(dms_TradingName,dms_TradingName_List))=0),\"\",(INDEX(dms_FeederName_5,MATCH(dms_TradingName,dms_TradingName_List))))","v":""}]
[]
[null,"3.6.9.2 - PLANNED INTERRUPTIONS TO SUPPLY (SAIFI)"]
[null,null,{"$f":"CRY","v":"2016-17"}]
[null,{"$f":"INDEX(dms_FeederName_1,MATCH(dms_TradingName,dms_TradingName_List))","v":"CBD"}]
[null,{"$f":"INDEX(dms_FeederName_2,MATCH(dms_TradingName,dms_TradingName_List))","v":"Urban"},0.2]
[null,{"$f":"INDEX(dms_FeederName_3,MATCH(dms_TradingName,dms_TradingName_List))","v":"Short rural"},0.4]
[null,{"$f":"INDEX(dms_FeederName_4,MATCH(dms_TradingName,dms_TradingName_List))","v":"Long rural"},0.3]
[null,{"$f":"IF((INDEX(dms_FeederName_5,MATCH(dms_TradingName,dms_TradingName_List))=0),\"\",(INDEX(dms_FeederName_5,MATCH(dms_TradingName,dms_TradingName_List))))","v":""}]

{"sheet":"4.1 Public lighting","index":8,"n_rows":23,"n_cols":4,"rows_kept":23,"cut":false,"hidden":false,"merged":[[9,1,10,1],[5,1,5,2]]}
[null,{"$f":"(LOOKUP(dms_Model,dms_Model_List,dms_Worksheet_List))","v":"REGULATORY REPORTING STATEMENT"}]
[null,{"$f":"dms_TradingName","v":"Endeavour Energy"}]
[null,{"$f":"CONCATENATE(\"Annual Reporting RIN Response \",CRY)","v":"Annual Reporting RIN Response 2016-17"}]
[null,"4.1 PUBLIC LIGHTING"]
[]
[null,"Tables 4.1.1 - 4.1.3 deliberately omitted."]
[]
[null,"4.1.4 - PUBLIC LIGHTING METRICS BY TARIFF"]
[]
[null,"Tariff categories","Number of Lights","Public Lighting Revenue"]
[null,"<insert tariff category>","0's","$0's, nominal"]
[]
[]
[]
[]
[]
[]
[]
[]
[]
[]
[null,"To enter further tariff categories - please insert new lines above this line. "]
[null,"Total ",{"$f":"SUM(C12:C21)","v":0},{"$f":"SUM(D12:D21)","v":0}]

{"sheet":"6.2 STPIS Reliability","index":9,"n_rows":98,"n_cols":8,"rows_kept":98,"cut":false,"hidden":false,"merged":[[5,1,5,2],[31,1,31,2],[68,1,73,1],[62,1,67,1],[55,1,55,2],[56,1,61,1],[16,1,21,1],[9,1,9,2],[10,1,15,1],[80,1,85,1],[86,1,91,1],[92,1,97,1],[79,1,79,2],[22,1,27,1],[32,1,37,1],[38,1,43,1],[44,1,49,1]]}
[null,{"$f":"(LOOKUP(dms_Model,dms_Model_List,dms_Worksheet_List))","v":"REGULATORY REPORTING STATEMENT"}]
[null,{"$f":"dms_TradingName","v":"Endeavour Energy"}]
[null,{"$f":"CONCATENATE(\"Annual Reporting RIN Response \",CRY)","v":"Annual Reporting RIN Response 2016-17"}]
[null,"6.2 RELIABILITY AND CUSTOMER SERVICE PERFORMANCE"]
[]
[null,"Did the MAIFI parameter of the STPIS apply during the period?\nThis flag is set from the response on worksheet 3.6.8 Network feeders",null,{"$f":"dms_MAIFI_Flag","v":{"$error":"#REF!"}}]
[]
[]
[null,"6.2.1 - UNPLANNED MINUTES OFF SUPPLY (SAIDI)"]
[null,null,null,{"$f":"CRY","v":"2016-17"}]
[null,"Total sustained minutes off supply",{"$f":"INDEX(dms_FeederName_1,MATCH(dms_TradingName,dms_TradingName_List))","v":"CBD"}]
[null,null,{"$f":"INDEX(dms_FeederName_2,MATCH(dms_TradingName,dms_TradingName_List))","v":"Urban"},73.601053948064674," "]
[null,null,{"$f":"INDEX(dms_FeederName_3,MATCH(dms_TradingName,dms_TradingName_List))","v":"Short rural"},213.56157851832947]
[null,null,{"$f":"INDEX(dms_FeederName_4,MATCH(dms_TradingName,dms_TradingName_List))","v":"Long rural"},1766.2326492076502]
[null,null,{"$f":"IF((INDEX(dms_FeederName_5,MATCH(dms_TradingName,dms_TradingName_List))=0),\"\",(INDEX(dms_FeederName_5,MATCH(dms_TradingName,dms_TradingName_List))))","v":""},null,"","","",""]
[null,null,"Whole Network",96.64926611134824,"","","",""]
[null,"Total of excluded events*\n\n*see 3.3 of STPIS",{"$f":"INDEX(dms_FeederName_1,MATCH(dms_TradingName,dms_TradingName_List))","v":"CBD"}]
[null,null,{"$f":"INDEX(dms_FeederName_2,MATCH(dms_TradingName,dms_TradingName_List))","v":"Urban"},19.044037723381358]
[null,null,{"$f":"INDEX(dms_FeederName_3,MATCH(dms_TradingName,dms_TradingName_List))","v":"Short rural"},45.28368922480567]
[null,null,{"$f":"INDEX(dms_FeederName_4,MATCH(dms_TradingName,dms_TradingName_List))","v":"Long rural"},4.726114649681449]
[null,null,{"$f":"IF((INDEX(dms_FeederName_5,MATCH(dms_TradingName,dms_TradingName_List))=0),\"\",(INDEX(dms_FeederName_5,MATCH(dms_TradingName,dms_TradingName_List))))","v":""},null,null,"","",""]
[null,null,"Whole Network",23.260706613950063,null,"","",""]
[null,"Total sustained minutes off supply after removing excluded events",{"$f":"INDEX(dms_FeederName_1,MATCH(dms_TradingName,dms_TradingName_List))","v":"CBD"}]
[null,null,{"$f":"INDEX(dms_FeederName_2,MATCH(dms_TradingName,dms_TradingName_List))","v":"Urban"},54.557016224683316]
[null,null,{"$f":"INDEX(dms_FeederName_3,MATCH(dms_TradingName,dms_TradingName_List))","v":"Short rural"},168.2778892935238]
[null,null,{"$f":"INDEX(dms_FeederName_4,MATCH(dms_TradingName,dms_TradingName_List))","v":"Long rural"},1761.5065345579687]
[null,null,{"$f":"IF((INDEX(dms_FeederName_5,MATCH(dms_TradingName,dms_TradingName_List))=0),\"\",(INDEX(dms_FeederName_5,MATCH(dms_TradingName,dms_TradingName_List))))","v":""},null,"","","",""]
[null,null,"Whole Network",73.388559497398177,"","","",""]
[]
[]
[null,"6.2.2 - UNPLANNED INTERRUPTIONS TO SUPPLY (SAIFI)"]
[null,null,null,{"$f":"CRY","v":"2016-17"}]
[null,"Total sustained interruptions",{"$f":"INDEX(dms_FeederName_1,MATCH(dms_TradingName,dms_TradingName_List))","v":"CBD"}]
[null,null,{"$f":"INDEX(dms_FeederName_2,MATCH(dms_TradingName,dms_TradingName_List))","v":"Urban"},0.78727405543051876]
[null,null,{"$f":"INDEX(dms_FeederName_3,MATCH(dms_TradingName,dms_TradingName_List))","v":"Short rural"},1.6551448274558127]
[null,null,{"$f":"INDEX(dms_FeederName_4,MATCH(dms_TradingName,dms_TradingName_List))","v":"Long rural"},10.778625870858029]
[null,null,{"$f":"IF((INDEX(dms_FeederName_5,MATCH(dms_TradingName,dms_TradingName_List))=0),\"\",(INDEX(dms_FeederName_5,MATCH(dms_TradingName,dms_TradingName_List))))","v":""},null,"","","",""]
[null,null,"Whole Network",0.93003324876113125,"","","",""]
[null,"Total of excluded events*\n\n*see 3.3 of STPIS",{"$f":"INDEX(dms_FeederName_1,MATCH(dms_TradingName,dms_TradingName_List))","v":"CBD"}]
[null,null,{"$f":"INDEX(dms_FeederName_2,MATCH(dms_TradingName,dms_TradingName_List))","v":"Urban"},8.3781852423480685E-2]
[null,null,{"$f":"INDEX(dms_FeederName_3,MATCH(dms_TradingName,dms_TradingName_List))","v":"Short rural"},0.19973954601249022]
[null,null,{"$f":"INDEX(dms_FeederName_4,MATCH(dms_TradingName,dms_TradingName_List))","v":"Long rural"},6.687898089172073E-2]
[null,null,{"$f":"IF((INDEX(dms_FeederName_5,MATCH(dms_TradingName,dms_TradingName_List))=0),\"\",(INDEX(dms_FeederName_5,MATCH(dms_TradingName,dms_TradingName_List))))","v":""},null,"",null,"",""]
[null,null,"Whole Network",0.10243065822918018,"",null,"",""]
[null,"Total sustained interruptions after removing excluded events",{"$f":"INDEX(dms_FeederName_1,MATCH(dms_TradingName,dms_TradingName_List))","v":"CBD"}]
[null,null,{"$f":"INDEX(dms_FeederName_2,MATCH(dms_TradingName,dms_TradingName_List))","v":"Urban"},0.70349220300703807]
[null,null,{"$f":"INDEX(dms_FeederName_3,MATCH(dms_TradingName,dms_TradingName_List))","v":"Short rural"},1.4554052814433225]
[null,null,{"$f":"INDEX(dms_FeederName_4,MATCH(dms_TradingName,dms_TradingName_List))","v":"Long rural"},10.711746889966308]
[null,null,{"$f":"IF((INDEX(dms_FeederName_5,MATCH(dms_TradingName,dms_TradingName_List))=0),\"\",(INDEX(dms_FeederName_5,MATCH(dms_TradingName,dms_TradingName_List))))","v":""},null,"","","",""]
[null,null,"Whole Network",0.82760259053195107,"","","",""]
[]
[]
[]
[]
[null,"6.2.3 - UNPLANNED MOMENTARY INTERRUPTIONS TO SUPPLY (MAIFI)"]
[null,null,null,{"$f":"CRY","v":"2016-17"}]
[null,"Total momentary interruptions",{"$f":"INDEX(dms_FeederName_1,MATCH(dms_TradingName,dms_TradingName_List))","v":"CBD"}]
[null,null,{"$f":"INDEX(dms_FeederName_2,MATCH(dms_TradingName,dms_TradingName_List))","v":"Urban"}]
[null,null,{"$f":"INDEX(dms_FeederName_3,MATCH(dms_TradingName,dms_TradingName_List))","v":"Short rural"}]
[null,null,{"$f":"INDEX(dms_FeederName_4,MATCH(dms_TradingName,dms_TradingName_List))","v":"Long rural"}]
[null,null,{"$f":"IF((INDEX(dms_FeederName_5,MATCH(dms_TradingName,dms_TradingName_List))=0),\"\",(INDEX(dms_FeederName_5,MATCH(dms_TradingName,dms_TradingName_List))))","v":""}]
[null,null,"Whole Network"]
[null,"Total of excluded events*\n\n*see 3.3 of STPIS",{"$f":"INDEX(dms_FeederName_1,MATCH(dms_TradingName,dms_TradingName_List))","v":"CBD"}]
[null,null,{"$f":"INDEX(dms_FeederName_2,MATCH(dms_TradingName,dms_TradingName_List))","v":"Urban"}]
[null,null,{"$f":"INDEX(dms_FeederName_3,MATCH(dms_TradingName,dms_TradingName_List))","v":"Short rural"}]
[null,null,{"$f":"INDEX(dms_FeederName_4,MATCH(dms_TradingName,dms_TradingName_List))","v":"Long rural"}]
[null,null,{"$f":"IF((INDEX(dms_FeederName_5,MATCH(dms_TradingName,dms_TradingName_List))=0),\"\",(INDEX(dms_FeederName_5,MATCH(dms_TradingName,dms_TradingName_List))))","v":""}]
[null,null,"Whole Network"]
[null,"Total momentary interruptions after removing excluded events",{"$f":"INDEX(dms_FeederName_1,MATCH(dms_TradingName,dms_TradingName_List))","v":"CBD"}]
[null,null,{"$f":"INDEX(dms_FeederName_2,MATCH(dms_TradingName,dms_TradingName_List))","v":"Urban"}]
[null,null,{"$f":"INDEX(dms_FeederName_3,MATCH(dms_TradingName,dms_TradingName_List))","v":"Short rural"}]
[null,null,{"$f":"INDEX(dms_FeederName_4,MATCH(dms_TradingName,dms_TradingName_List))","v":"Long rural"}]
[null,null,{"$f":"IF((INDEX(dms_FeederName_5,MATCH(dms_TradingName,dms_TradingName_List))=0),\"\",(INDEX(dms_FeederName_5,MATCH(dms_TradingName,dms_TradingName_List))))","v":""}]
[null,null,"Whole Network"]
[]
[]
[]
[]
[null,"6.2.4 - DISTRIBUTION CUSTOMER NUMBERS"]
[null,null,null,{"$f":"CRY","v":"2016-17"}]
[null,"Customer numbers at the start of the period",{"$f":"INDEX(dms_FeederName_1,MATCH(dms_TradingName,dms_TradingName_List))","v":"CBD"}]
[null,null,{"$f":"INDEX(dms_FeederName_2,MATCH(dms_TradingName,dms_TradingName_List))","v":"Urban"},"829228"]
[null,null,{"$f":"INDEX(dms_FeederName_3,MATCH(dms_TradingName,dms_TradingName_List))","v":"Short rural"},159368]
[null,null,{"$f":"INDEX(dms_FeederName_4,MATCH(dms_TradingName,dms_TradingName_List))","v":"Long rural"},313]
[null,null,{"$f":"IF((INDEX(dms_FeederName_5,MATCH(dms_TradingName,dms_TradingName_List))=0),\"\",(INDEX(dms_FeederName_5,MATCH(dms_TradingName,dms_TradingName_List))))","v":""}]
[null,null,"Whole Network",988909]
[null,"Customer numbers at the end of the period",{"$f":"INDEX(dms_FeederName_1,MATCH(dms_TradingName,dms_TradingName_List))","v":"CBD"}]
[null,null,{"$f":"INDEX(dms_FeederName_2,MATCH(dms_TradingName,dms_TradingName_List))","v":"Urban"},"844427"]
[null,null,{"$f":"INDEX(dms_FeederName_3,MATCH(dms_TradingName,dms_TradingName_List))","v":"Short rural"},161610]
[null,null,{"$f":"INDEX(dms_FeederName_4,MATCH(dms_TradingName,dms_TradingName_List))","v":"Long rural"},315]
[null,null,{"$f":"IF((INDEX(dms_FeederName_5,MATCH(dms_TradingName,dms_TradingName_List))=0),\"\",(INDEX(dms_FeederName_5,MATCH(dms_TradingName,dms_TradingName_List))))","v":""}]
[null,null,"Whole Network",1006352]
[null,"Average customer numbers",{"$f":"INDEX(dms_FeederName_1,MATCH(dms_TradingName,dms_TradingName_List))","v":"CBD"},{"$f":"ROUND(SUM(D81+D87)/2,0)","v":0}]
[null,null,{"$f":"INDEX(dms_FeederName_2,MATCH(dms_TradingName,dms_TradingName_List))","v":"Urban"},{"$f":"ROUND(SUM(D82+D88)/2,0)","v":836828}]
[null,null,{"$f":"INDEX(dms_FeederName_3,MATCH(dms_TradingName,dms_TradingName_List))","v":"Short rural"},{"$f":"ROUND(SUM(D83+D89)/2,0)","v":160489}]
[null,null,{"$f":"INDEX(dms_FeederName_4,MATCH(dms_TradingName,dms_TradingName_List))","v":"Long rural"},{"$f":"ROUND(SUM(D84+D90)/2,0)","v":314}]
[null,null,{"$f":"IF((INDEX(dms_FeederName_5,MATCH(dms_TradingName,dms_TradingName_List))=0),\"\",(INDEX(dms_FeederName_5,MATCH(dms_TradingName,dms_TradingName_List))))","v":""},{"$f":"ROUND(SUM(D85+D91)/2,0)","v":0}]
[null,null,"Whole Network",997631]

{"sheet":"6.6 STPIS Customer Service","index":10,"n_rows":13,"n_cols":4,"rows_kept":13,"cut":false,"hidden":false,"merged":[[8,1,9,1]]}
[null,{"$f":"(LOOKUP(dms_Model,dms_Model_List,dms_Worksheet_List))","v":"REGULATORY REPORTING STATEMENT"}]
[null,{"$f":"dms_TradingName","v":"Endeavour Energy"}]
[null,{"$f":"CONCATENATE(\"Annual Reporting RIN Response \",CRY)","v":"Annual Reporting RIN Response 2016-17"}]
[null,"6.6 STPIS CUSTOMER SERVICE"]
[]
[]
[null,"6.6.1 - TELEPHONE ANSWERING"]
[]
[null,null,"Number of calls \nafter removing excluded events","Total number of calls"]
[null,null,{"$f":"CRY","v":"2016-17"},{"$f":"CRY","v":"2016-17"}]
[null,"Number of calls received",192137,257640]
[null,"Number of calls answered within 30 seconds",162817]
[null,"Percentage of calls answered within 30 seconds",{"$f":"C12/C11","v":0.84740055273060366}]

{"sheet":"6.7 STPIS Daily Performance","index":11,"n_rows":381,"n_cols":16,"rows_kept":381,"cut":false,"hidden":false,"merged":[[13,14,13,15],[13,3,14,3],[6,1,6,5],[8,1,8,6],[13,4,13,5],[13,6,13,7],[13,10,13,11],[13,8,13,9],[13,12,13,13],[12,1,14,1],[12,2,12,3],[13,2,14,2],[12,4,12,13]]}
[null,{"$f":"(LOOKUP(dms_Model,dms_Model_List,dms_Worksheet_List))","v":"REGULATORY REPORTING STATEMENT"},null,null,null,null,null,null,{"$f":"CONCATENATE(IF(LEN(CRY)=4,\"1-Jan-\",\"1-Jul-\"),LEFT(CRY,4))","v":"1-Jul-2016"}]
[null,{"$f":"dms_TradingName","v":"Endeavour Energy"}]
[null,{"$f":"CONCATENATE(\"Annual Reporting RIN Response \",CRY)","v":"Annual Reporting RIN Response 2016-17"}]
[null,"6.7 STPIS DAILY PERFORMANCE"]
[]
[]
[null,"Did the MAIFI parameter of the STPIS apply during the period?\nThis flag is set from the response on worksheet 3.6.8 Network feeders",null,null,null,null,{"$f":"dms_MAIFI_Flag","v":{"$error":"#REF!"}}]
[]
[null,"The excluded events to be removed from the data refer only to events listed in clause 3.3(a) of the STPIS, with respect to reliability data, and in clause 5.4 of the STPIS with respect to customer service parameters.\n\n*Customer service information must be reported as per the definitions in the STPIS, that is excluding: \n   • calls to payment lines and automated interactive services \n   • calls abandoned by the customer within 30 seconds of the call being queued for response by a human operator (where the time in which a telephone call is abandoned is not measured, then an estimate of the number of calls abandoned within 30 seconds will be determined by taking 20 per cent of all calls abandoned)."]
[]
[null,"6.7.1 - DAILY PERFORMANCE DATA - UNPLANNED"]
[]
[null,"Date","Customer service*",null,"MAIFI"]
[null,null,"Number of calls received\n(after removing excluded events)","Number of calls answered in 30 seconds\n(after removing excluded events)",{"$f":"INDEX(dms_FeederName_1,MATCH(dms_TradingName,dms_TradingName_List))","v":"CBD"},null,{"$f":"INDEX(dms_FeederName_2,MATCH(dms_TradingName,dms_TradingName_List))","v":"Urban"},null,{"$f":"INDEX(dms_FeederName_3,MATCH(dms_TradingName,dms_TradingName_List))","v":"Short rural"},null,{"$f":"INDEX(dms_FeederName_4,MATCH(dms_TradingName,dms_TradingName_List))","v":"Long rural"},null,{"$f":"IF((INDEX(dms_FeederName_5,MATCH(dms_TradingName,dms_TradingName_List))=0),\"Network\",(INDEX(dms_FeederName_5,MATCH(dms_TradingName,dms_TradingName_List))))","v":"Network"},null,"Network"]
[null,null,null,null,"All events","After removing excluded events","All events","After removing excluded events","All events","After removing excluded events","All events","After removing excluded events","All events","After removing excluded events","All events","After removing excluded events"]
[null,{"$f":"CONCATENATE(IF(LEN(CRY)=4,\"1-Jan-\",\"1-Jul-\"),LEFT(CRY,4))","v":"1-Jul-2016"},554,551]
[null,{"$f":"B16+1","v":"2016-07-02"},196,196]
[null,"2016-07-03",136,136]
[null,"2016-07-04",726,718]
[null,"2016-07-05",720,705]
[null,"2016-07-06",701,693]
[null,"2016-07-07",661,658]
[null,"2016-07-08",596,592]
[null,"2016-07-09",211,210]
[null,"2016-07-10",132,132]
[null,"2016-07-11",671,659]
[null,"2016-07-12",775,766]
[null,"2016-07-13",1395,1334]
[null,"2016-07-14",727,718]
[null,"2016-07-15",664,655]
[null,"2016-07-16",225,223]
[null,"2016-07-17",126,125]
[null,"2016-07-18",670,664]
[null,"2016-07-19",773,768]
[null,"2016-07-20",598,589]
[null,"2016-07-21",596,587]
[null,"2016-07-22",592,587]
[null,"2016-07-23",0,0]
[null,"2016-07-24",492,479]
[null,"2016-07-25",830,819]
[null,"2016-07-26",710,701]
[null,"2016-07-27",734,723]
[null,"2016-07-28",631,624]
[null,"2016-07-29",663,654]
[null,"2016-07-30",211,208]
[null,"2016-07-31",111,111]
[null,"2016-08-01",610,604]
[null,"2016-08-02",586,581]
[null,"2016-08-03",755,740]
[null,"2016-08-04",653,646]
[null,"2016-08-05",611,597]
[null,"2016-08-06",165,165]
[null,"2016-08-07",144,143]
[null,"2016-08-08",574,572]
[null,"2016-08-09",575,570]
[null,"2016-08-10",668,652]
[null,"2016-08-11",601,597]
[null,"2016-08-12",554,551]
[null,"2016-08-13",165,163]
[null,"2016-08-14",109,107]
[null,"2016-08-15",579,573]
[null,"2016-08-16",550,548]
[null,"2016-08-17",659,649]
[null,"2016-08-18",540,540]
[null,"2016-08-19",488,485]
[null,"2016-08-20",160,160]
[null,"2016-08-21",134,133]
[null,"2016-08-22",609,605]
[null,"2016-08-23",609,600]
[null,"2016-08-24",693,679]
[null,"2016-08-25",605,601]
[null,"2016-08-26",556,552]
[null,"2016-08-27",142,142]
[null,"2016-08-28",141,140]
[null,"2016-08-29",593,591]
[null,"2016-08-30",681,671]
[null,"2016-08-31",557,555]
[null,"2016-09-01",555,544]
[null,"2016-09-02",500,497]
[null,"2016-09-03",627,600]
[null,{"$f":"B80+1","v":"2016-09-04"},133,132]
[null,"2016-09-05",723,717]
[null,"2016-09-06",676,668]
[null,"2016-09-07",671,662]
[null,"2016-09-08",598,593]
[null,"2016-09-09",544,535]
[null,"2016-09-10",157,157]
[null,"2016-09-11",111,111]
[null,"2016-09-12",608,602]
[null,"2016-09-13",661,652]
[null,"2016-09-14",606,596]
[null,"2016-09-15",771,766]
[null,"2016-09-16",579,574]
[null,"2016-09-17",125,124]
[null,"2016-09-18",97,97]
[null,"2016-09-19",687,677]
[null,"2016-09-20",586,584]
[null,"2016-09-21",628,621]
[null,"2016-09-22",608,603]
[null,"2016-09-23",567,556]
[null,"2016-09-24",150,148]
[null,"2016-09-25",187,176]
[null,"2016-09-26",574,571]
[null,"2016-09-27",626,618]
[null,"2016-09-28",574,572]
[null,"2016-09-29",742,735]
[null,"2016-09-30",591,586]
[null,"2016-10-01",178,178]
[null,"2016-10-02",248,242]
[null,"2016-10-03",358,350]
[null,"2016-10-04",0,0]
[null,"2016-10-05",860,850]
[null,"2016-10-06",682,679]
[null,"2016-10-07",606,606]
[null,"2016-10-08",165,165]
[null,"2016-10-09",444,417]
[null,"2016-10-10",817,811]
[null,"2016-10-11",785,779]
[null,"2016-10-12",644,637]
[null,"2016-10-13",596,593]
[null,"2016-10-14",560,560]
[null,"2016-10-15",173,170]
[null,"2016-10-16",99,98]
[null,"2016-10-17",603,598]
[null,"2016-10-18",650,644]
[null,"2016-10-19",749,721]
[null,"2016-10-20",659,652]
[null,"2016-10-21",646,643]
[null,"2016-10-22",206,202]
[null,"2016-10-23",89,88]
[null,"2016-10-24",565,556]
[null,"2016-10-25",578,574]
[null,"2016-10-26",620,615]
[null,"2016-10-27",594,591]
[null,"2016-10-28",520,515]
[null,"2016-10-29",162,162]
[null,"2016-10-30",261,249]
[null,"2016-10-31",581,578]
[null,"2016-11-01",559,555]
[null,"2016-11-02",715,704]
[null,"2016-11-03",571,568]
[null,"2016-11-04",586,580]
[null,"2016-11-05",391,377]
[null,"2016-11-06",111,109]
[null,{"$f":"B144+1","v":"2016-11-07"},687,680]
[null,"2016-11-08",563,558]
[null,"2016-11-09",530,528]
[null,"2016-11-10",732,712]
[null,"2016-11-11",597,593]
[null,"2016-11-12",333,321]
[null,"2016-11-13",304,298]
[null,"2016-11-14",588,585]
[null,"2016-11-15",549,543]
[null,"2016-11-16",603,599]
[null,"2016-11-17",579,577]
[null,"2016-11-18",569,565]
[null,"2016-11-19",182,177]
[null,"2016-11-20",196,189]
[null,"2016-11-21",791,778]
[null,"2016-11-22",630,629]
[null,"2016-11-23",607,602]
[null,"2016-11-24",583,581]
[null,"2016-11-25",639,634]
[null,"2016-11-26",159,157]
[null,"2016-11-27",126,125]
[null,"2016-11-28",698,689]
[null,"2016-11-29",640,636]
[null,"2016-11-30",609,607]
[null,"2016-12-01",669,666]
[null,"2016-12-02",672,661]
[null,"2016-12-03",180,180]
[null,"2016-12-04",153,149]
[null,"2016-12-05",888,872]
[null,"2016-12-06",732,731]
[null,"2016-12-07",701,695]
[null,"2016-12-08",887,873]
[null,"2016-12-09",618,616]
[null,"2016-12-10",212,209]
[null,"2016-12-11",163,162]
[null,"2016-12-12",601,596]
[null,"2016-12-13",1029,1007]
[null,"2016-12-14",881,875]
[null,"2016-12-15",842,833]
[null,"2016-12-16",716,705]
[null,"2016-12-17",193,191]
[null,"2016-12-18",279,274]
[null,"2016-12-19",666,654]
[null,"2016-12-20",1090,1067]
[null,"2016-12-21",588,584]
[null,"2016-12-22",556,553]
[null,"2016-12-23",335,334]
[null,"2016-12-24",483,457]
[null,"2016-12-25",132,131]
[null,"2016-12-26",165,163]
[null,"2016-12-27",200,195]
[null,"2016-12-28",291,289]
[null,"2016-12-29",484,476]
[null,"2016-12-30",403,394]
[null,"2016-12-31",203,200]
[null,"2017-01-01",129,128]
[null,"2017-01-02",144,143]
[null,"2017-01-03",502,500]
[null,"2017-01-04",428,425]
[null,"2017-01-05",444,443]
[null,"2017-01-06",480,476]
[null,"2017-01-07",224,216]
[null,"2017-01-08",158,155]
[null,"2017-01-09",616,610]
[null,{"$f":"B208+1","v":"2017-01-10"},619,618]
[null,"2017-01-11",1382,1249]
[null,"2017-01-12",698,690]
[null,"2017-01-13",1272,1203]
[null,"2017-01-14",288,284]
[null,"2017-01-15",111,111]
[null,"2017-01-16",703,697]
[null,"2017-01-17",825,816]
[null,"2017-01-18",1105,1056]
[null,"2017-01-19",756,746]
[null,"2017-01-20",683,671]
[null,"2017-01-21",157,157]
[null,"2017-01-22",127,126]
[null,"2017-01-23",795,787]
[null,"2017-01-24",901,888]
[null,"2017-01-25",662,650]
[null,"2017-01-26",159,158]
[null,"2017-01-27",421,417]
[null,"2017-01-28",203,203]
[null,"2017-01-29",240,238]
[null,"2017-01-30",1234,1201]
[null,"2017-01-31",1047,1033]
[null,"2017-02-01",773,764]
[null,"2017-02-02",740,732]
[null,"2017-02-03",596,592]
[null,"2017-02-04",269,266]
[null,"2017-02-05",813,778]
[null,"2017-02-06",883,869]
[null,"2017-02-07",867,855]
[null,"2017-02-08",791,773]
[null,"2017-02-09",943,929]
[null,"2017-02-10",1368,1339]
[null,"2017-02-11",825,790]
[null,"2017-02-12",339,326]
[null,"2017-02-13",730,726]
[null,"2017-02-14",690,685]
[null,"2017-02-15",667,659]
[null,"2017-02-16",675,666]
[null,"2017-02-17",1053,1034]
[null,"2017-02-18",440,432]
[null,"2017-02-19",219,216]
[null,"2017-02-20",654,650]
[null,"2017-02-21",684,680]
[null,"2017-02-22",681,676]
[null,"2017-02-23",590,586]
[null,"2017-02-24",658,650]
[null,"2017-02-25",224,221]
[null,"2017-02-26",140,140]
[null,"2017-02-27",607,605]
[null,"2017-02-28",656,653]
[null,"2017-03-01",637,629]
[null,"2017-03-02",659,656]
[null,"2017-03-03",755,740]
[null,"2017-03-04",378,363]
[null,"2017-03-05",247,245]
[null,"2017-03-06",641,633]
[null,"2017-03-07",731,724]
[null,"2017-03-08",606,603]
[null,"2017-03-09",659,654]
[null,"2017-03-10",590,585]
[null,"2017-03-11",149,149]
[null,"2017-03-12",200,196]
[null,"2017-03-13",928,906]
[null,"2017-03-14",1056,1021]
[null,{"$f":"B272+1","v":"2017-03-15"},784,768]
[null,"2017-03-16",880,861]
[null,"2017-03-17",741,736]
[null,"2017-03-18",471,460]
[null,"2017-03-19",287,277]
[null,"2017-03-20",787,781]
[null,"2017-03-21",1057,1035]
[null,"2017-03-22",null,0]
[null,"2017-03-23",1303,1284]
[null,"2017-03-24",709,702]
[null,"2017-03-25",265,253]
[null,"2017-03-26",170,168]
[null,"2017-03-27",718,709]
[null,"2017-03-28",739,730]
[null,"2017-03-29",862,851]
[null,"2017-03-30",661,651]
[null,"2017-03-31",696,690]
[null,"2017-04-01",178,177]
[null,"2017-04-02",101,99]
[null,"2017-04-03",798,794]
[null,"2017-04-04",650,646]
[null,"2017-04-05",755,749]
[null,"2017-04-06",635,632]
[null,"2017-04-07",604,600]
[null,"2017-04-08",181,181]
[null,"2017-04-09",615,569]
[null,"2017-04-10",832,825]
[null,"2017-04-11",676,671]
[null,"2017-04-12",622,615]
[null,"2017-04-13",619,610]
[null,"2017-04-14",116,112]
[null,"2017-04-15",187,186]
[null,"2017-04-16",95,94]
[null,"2017-04-17",179,175]
[null,"2017-04-18",657,654]
[null,"2017-04-19",657,647]
[null,"2017-04-20",764,758]
[null,"2017-04-21",674,669]
[null,"2017-04-22",137,136]
[null,"2017-04-23",104,103]
[null,"2017-04-24",496,492]
[null,"2017-04-25",190,179]
[null,"2017-04-26",822,809]
[null,"2017-04-27",696,680]
[null,"2017-04-28",632,631]
[null,"2017-04-29",158,155]
[null,"2017-04-30",81,80]
[null,"2017-05-01",628,621]
[null,"2017-05-02",673,670]
[null,"2017-05-03",638,626]
[null,"2017-05-04",676,666]
[null,"2017-05-05",624,615]
[null,"2017-05-06",209,207]
[null,"2017-05-07",123,123]
[null,"2017-05-08",660,653]
[null,"2017-05-09",710,703]
[null,"2017-05-10",671,659]
[null,"2017-05-11",682,666]
[null,"2017-05-12",654,642]
[null,"2017-05-13",149,149]
[null,"2017-05-14",111,109]
[null,"2017-05-15",677,669]
[null,"2017-05-16",863,843]
[null,"2017-05-17",713,704]
[null,{"$f":"B336+1","v":"2017-05-18"},627,622]
[null,"2017-05-19",821,799]
[null,"2017-05-20",289,283]
[null,"2017-05-21",153,148]
[null,"2017-05-22",645,641]
[null,"2017-05-23",643,639]
[null,"2017-05-24",728,716]
[null,"2017-05-25",591,582]
[null,"2017-05-26",630,623]
[null,"2017-05-27",142,140]
[null,"2017-05-28",112,110]
[null,"2017-05-29",665,654]
[null,"2017-05-30",632,625]
[null,"2017-05-31",693,681]
[null,"2017-06-01",618,609]
[null,"2017-06-02",544,538]
[null,"2017-06-03",192,191]
[null,"2017-06-04",106,105]
[null,"2017-06-05",577,571]
[null,"2017-06-06",674,666]
[null,"2017-06-07",956,919]
[null,"2017-06-08",769,760]
[null,"2017-06-09",660,655]
[null,"2017-06-10",212,209]
[null,"2017-06-11",184,180]
[null,"2017-06-12",150,149]
[null,"2017-06-13",773,764]
[null,"2017-06-14",684,676]
[null,"2017-06-15",690,682]
[null,"2017-06-16",777,735]
[null,"2017-06-17",201,199]
[null,"2017-06-18",133,132]
[null,"2017-06-19",643,628]
[null,"2017-06-20",592,587]
[null,"2017-06-21",635,625]
[null,"2017-06-22",618,612]
[null,"2017-06-23",568,558]
[null,"2017-06-24",191,187]
[null,"2017-06-25",131,131]
[null,"2017-06-26",661,659]
[null,"2017-06-27",742,728]
[null,"2017-06-28",667,656]
[null,"2017-06-29",585,581]
[null,"2017-06-30",548,540]
[null,"2017-07-01"]

{"sheet":"6.8 STPIS Exclusions","index":12,"n_rows":44,"n_cols":15,"rows_kept":44,"cut":false,"hidden":false,"merged":[[10,11,11,11],[6,1,6,4],[10,6,10,8],[10,5,11,5],[10,4,11,4],[10,2,11,2],[10,3,11,3]]}
[null,{"$f":"(LOOKUP(dms_Model,dms_Model_List,dms_Worksheet_List))","v":"REGULATORY REPORTING STATEMENT"}]
[null,{"$f":"dms_TradingName","v":"Endeavour Energy"}]
[null,{"$f":"CONCATENATE(\"Annual Reporting RIN Response \",CRY)","v":"Annual Reporting RIN Response 2016-17"}]
[null,"6.8 STPIS EXCLUSIONS"]
[]
[]
[null,{"$f":"CONCATENATE(\"This information is collected to inform the application of the STPIS to \",dms_TradingName,\" in future regulatory periods. The information is also collected to monitor network performance, and may be used in performance reports.\")","v":"This information is collected to inform the application of the STPIS to Endeavour Energy in future regulatory periods. The information is also collected to monitor network performance, and may be used in performance reports."}]
[]
[null,"6.8.1 - STPIS EXCLUSIONS"]
[]
[null,"Date of event","Outage ID","Feeder ID / name","Feeder classification\n(drop down)","Cause of event\n(drop down)","Unplanned",null,null,"Event category","Effect on unplanned MAIFI","Please provide separate explanation to confirm the outage was not due to inadequate transmission connection planning "]
[null,"DD/MM/YYYY",null,null,null,null,"Number of  interruptions","Duration of interruption\n(mins)","Total unplanned minutes off supply","Use exclusion categories listed in section 3.3(a) of the STPIS\n(drop down)","by feeder classification",null,null,null,"Cause of Event"]
[null,null,null,null,null,null,null,null,null,null,null,null,null,null,"Weather"]
[null,null,null,null,null,null,null,null,null,null,null,null,null,null,"Equipment failure"]
[null,null,null,null,null,null,null,null,null,null,null,null,null,null,"Operational error"]
[null,null,null,null,null,null,null,null,null,null,null,null,null,null,"Vegetation"]
[null,null,null,null,null,null,null,null,null,null,null,null,null,null,"Animals"]
[null,null,null,null,null,null,null,null,null,null,null,null,null,null,"Third party impacts"]
[null,null,null,null,null,null,null,null,null,null,null,null,null,null,"Transmission failure"]
[null,null,null,null,null,null,null,null,null,null,null,null,null,null,"Load shedding"]
[null,null,null,null,null,null,null,null,null,null,null,null,null,null,"Inter-distributor connection failure"]
[null,null,null,null,null,null,null,null,null,null,null,null,null,null,"Other"]
[]
[]
[]
[]
[]
[]
[]
[]
[]
[]
[]
[]
[]
[]
[]
[]
[]
[]
[]
[]
[]
[null,"To enter further events - please insert new lines above this line. "]

{"sheet":"6.9 STPIS - GSL","index":13,"n_rows":102,"n_cols":5,"rows_kept":102,"cut":false,"hidden":false,"merged":[[5,4,5,5],[101,1,101,2],[69,1,69,2],[98,1,98,2],[100,1,100,2],[93,1,93,2],[94,1,94,2],[95,1,95,2],[96,1,96,2],[88,1,88,2],[89,1,89,2],[90,1,90,2],[91,1,91,2],[92,1,92,2],[83,1,83,2],[84,1,84,2],[85,1,85,2],[86,1,86,2],[45,1,45,2],[46,1,46,2],[71,1,71,2],[70,1,70,2],[77,1,77,2],[49,1,49,2],[50,1,50,2],[51,1,51,2],[53,1,53,4],[58,1,58,4],[63,1,63,4],[68,1,68,4],[66,1,66,2],[65,1,65,2],[40,1,40,2],[42,1,42,2],[43,1,43,2],[44,1,44,2],[41,1,41,2],[33,1,33,2],[34,1,34,2],[35,1,35,2],[36,1,36,2],[37,1,37,2],[27,1,27,2],[31,1,31,2],[32,1,32,2],[28,1,28,2],[29,1,29,2],[30,1,30,2],[20,1,20,2],[22,1,22,2],[23,1,23,2],[24,1,24,2],[21,1,21,2],[17,1,17,2],[15,1,15,2],[5,1,5,2],[7,1,7,2],[14,1,14,2],[16,1,16,2],[64,1,64,2],[54,1,54,2],[55,1,55,2],[56,1,56,2],[61,1,61,2],[60,1,60,2],[59,1,59,2]]}
[null,{"$f":"(LOOKUP(dms_Model,dms_Model_List,dms_Worksheet_List))","v":"REGULATORY REPORTING STATEMENT"}]
[null,{"$f":"dms_TradingName","v":"Endeavour Energy"}]
[null,{"$f":"CONCATENATE(\"Annual Reporting RIN Response \",CRY)","v":"Annual Reporting RIN Response 2016-17"}]
[null,"6.9 STPIS - GUARANTEED SERVICE LEVEL"]
[]
[null,"Did the AER's GSL Scheme apply at any time during the regulatory year?",null,"No","**IMPORTANT \nPlease ensure this flag is set. Conditional formatting on this worksheet is dependant on this response."]
[]
[null,"Instructions:\nTable 6.9.1 collects information relating to jurisdiction GSL scheme parameters. These parameters can be found in the jurisdictonal scheme relevant to NSP. Please identify each parameter in the relevant sub-tables and provide the volume and value of GSL payments. \n\nFor GSL parameters that do not fit within the provided sub-tables provided, please enter a heading and identify the relevant parameter(s). "]
[]
[null,"6.9.1 - GUARANTEED SERVICE LEVELS - JURISDICTIONAL GSL SCHEME"]
[null,null,null,{"$f":"CRY","v":"2016-17"},{"$f":"CRY","v":"2016-17"}]
[null,null,null,"Volume","Value of GSL payments"]
[null,null,null,"0's","$0's"]
[null,"Appointments"]
[]
[]
[]
[]
[null,"To enter further GSL parameters relating to appointments - please copy a row from above and \"insert copied cells\" above this row."]
[null,"Connections"]
[]
[]
[]
[]
[]
[null,"To enter further GSL parameters relating to connections -  please copy a row from above and \"insert copied cells\" above this row."]
[null,"Reliability of supply"]
[]
[]
[]
[]
[]
[]
[]
[]
[]
[]
[]
[null,"To enter further GSL parameters relating to reliability of supply -  please copy a row from above and \"insert copied cells\" above this row."]
[null,"Street lights"]
[null,"Street Lights - GSL payments",null,309,4635]
[null,"Street lights \"out\" during period",null,17430]
[null,"Street lights not repaired by \"fix by\" date",null,1664]
[null,"Street lights not repaired in 2 business days",null,1664]
[null,"Street lights - number of business days to repair",null,4.7]
[]
[]
[null,"To enter further GSL parameters relating to street lights -  please copy a row from above and \"insert copied cells\" above this row."]
[null,"Planned interruptions"]
[]
[]
[]
[null,"To enter further GSL parameters relating to planned interruptions -  please copy a row from above and \"insert copied cells\" above this row."]
[null,"<NSP defined parameter category>"]
[]
[]
[]
[null,"To enter further GSL parameters - please identify the parameter and if insufficient rows  please copy a row from above and \"insert copied cells\" above this row."]
[null,"<NSP defined parameter category>"]
[]
[]
[]
[null,"To enter further GSL parameters - please identify the parameter and if insufficient rows  please copy a row from above and \"insert copied cells\" above this row."]
[null,"<NSP defined parameter category>"]
[]
[]
[]
[null,"To enter further GSL parameters - please identify the parameter and if insufficient rows  please copy a row from above and \"insert copied cells\" above this row."]
[null,"<NSP defined parameter category>"]
[]
[]
[]
[null,"To enter further GSL parameters - please identify the parameter and if insufficient rows  please copy a row from above and \"insert copied cells\" above this row."]
[]
[]
[null,"6.9.2 - GUARANTEED SERVICE LEVELS - AER GSL SCHEME"]
[]
[null,"Complete Table 6.9.2 if the AER's GSL scheme applied at any time during the regulatory year. \n\nDo not complete Table 6.9.2 if the AER's GSL scheme did not apply during the regulatory year."]
[]
[null,null,null,{"$f":"CRY","v":"2016-17"},{"$f":"CRY","v":"2016-17"}]
[null,null,null,"Volume","Value \nof GSL payments"]
[null,null,null,"0's","$0's"]
[null,"New connections "]
[null,"Number of connections made"]
[null,"Number of connections not made on or before the day agreed"]
[null,"Connections - GSL payments – 1-6 day delay"]
[null,"Connections - GSL payments – 7+ day delay"]
[null,"Reliability of supply"]
[null,"Frequency of interruptions – CBD feeders – 9 interruptions"]
[null,"Frequency of interruptions – Urban feeders – 9 interruptions"]
[null,"Frequency of interruptions – Rural (short and long) feeders – 15 interruptions"]
[null,"Interruptions – CBD feeders – 12 hours duration"]
[null,"Interruptions – Urban feeders – 12 hours duration"]
[null,"Interruptions – Rural (short and long) feeders – 18 hours duration"]
[null,"Total duration of interruptions Level 1 – 20 hours"]
[null,"Total duration of interruptions Level 2 – 30 hours"]
[null,"Total duration of interruptions Level 3 – 60 hours"]
[null,"Street lights"]
[null,"Streetlight repair 5 days – GSL payments"]
[null,"Planned interruptions"]
[null,"Notice of planned interruptions – 4 business days notice not given"]
[null,"Total ",null,null,{"$f":"SUM(E101,E99,E89:E97,E86:E87)","v":0}]

{"sheet":"7.8 Avoided TUOS Payments","index":14,"n_rows":11,"n_cols":3,"rows_kept":11,"cut":false,"hidden":false,"merged":[[6,1,7,1]]}
[null,{"$f":"(LOOKUP(dms_Model,dms_Model_List,dms_Worksheet_List))","v":"REGULATORY REPORTING STATEMENT"}]
[null,{"$f":"dms_TradingName","v":"Endeavour Energy"}]
[null,{"$f":"CONCATENATE(\"Annual Reporting RIN Response \",CRY)","v":"Annual Reporting RIN Response 2016-17"}]
[null,"7.8 - AVOIDED TUOS PAYMENTS"]
[]
[null,"7.8.1 - AVOIDED TUOS PAYMENTS"]
[null,"Description","Avoided TUOS Payment "]
[null,null,"$0's, nominal"]
[null,"Embedded generators",1095381.1800000002]
[null,"Market network service providers",0]
[null,"Other",0]

{"sheet":"7.10 Juris Scheme","index":15,"n_rows":17,"n_cols":6,"rows_kept":17,"cut":false,"hidden":false,"merged":[[8,4,9,4],[8,3,9,3],[8,2,9,2],[8,1,9,1],[5,1,5,2]]}
[null,{"$f":"(LOOKUP(dms_Model,dms_Model_List,dms_Worksheet_List))","v":"REGULATORY REPORTING STATEMENT"}]
[null,{"$f":"dms_TradingName","v":"Endeavour Energy"}]
[null,{"$f":"CONCATENATE(\"Annual Reporting RIN Response \",CRY)","v":"Annual Reporting RIN Response 2016-17"}]
[null,"7.10 - JURISDICTIONAL SCHEMES"]
[]
[null,"Instructions\nBusiness must list each relevant jurisdictional scheme individually and report information for each scheme separately from other schemes."]
[]
[null,"7.10.1 - JURISDICTIONAL SCHEME PAYMENTS"]
[null,"Jurisdictional Scheme Name","Description","Date DNSP Became Subject to Scheme","Description of Cost Recovery Method","Total Scheme Payments  "]
[null,null,null,null,null,"$0's, nominal"]
[null,"Solar Bonus Scheme (established under the Electricity Supply Act 1995 (NSW)) - [Rule 6.18.7A(e)(2)]"," The NSW Government’s Solar Bonus Scheme (SBS) credits participating customers with a feed in tariff for all the electricity that their eligible solar photovoltaic (PV) system or wind turbine generates and provides to the network.","The SBS commenced 1 January 2010.","Not applicable. The Solar Bonus Scheme is funded by the Climate Change Fund (See Below)",0]
[null,"Climate Change Fund (established under the Energy and Utilities Administration Act 1987 (NSW)) - [Rule 6.18.7A(e)(3)].","The NSW Government's Climate Change Fund (CCF) was established to address the impacts of climate change, encourage energy and water saving activities and increase public awareness and acceptance of cliamte change.","The CCF commenced 1 July 2007","Costs are recovered in accordance with 6.18.7A of the Rules.  The NSW Government requires Endeavour Energy to recover no more than 25% of CCF payments from Residential customers. ",87333710.420000002]
[]
[]
[]
[]
[null,null,null,null,"Total",{"$f":"SUM(F11:F16)","v":87333710.420000002}]

{"sheet":"7.11 DMIS-DMIA","index":16,"n_rows":17,"n_cols":5,"rows_kept":17,"cut":false,"hidden":false,"merged":[[14,5,14,7],[6,1,7,1],[6,5,7,7],[6,2,6,4],[13,5,13,7],[9,5,9,7],[10,5,10,7],[11,5,11,7],[12,5,12,7],[8,2,8,4]]}
[null,{"$f":"(LOOKUP(dms_Model,dms_Model_List,dms_Worksheet_List))","v":"REGULATORY REPORTING STATEMENT"}]
[null,{"$f":"dms_TradingName","v":"Endeavour Energy"}]
[null,{"$f":"CONCATENATE(\"Annual Reporting RIN Response \",CRY)","v":"Annual Reporting RIN Response 2016-17"}]
[null,"7.11 - DEMAND MANAGEMENT INCENTIVE SCHEME"]
[]
[null,"7.11.1 - DMIA - PROJECTS SUBMITTED FOR APPROVAL"]
[null,"Name of project",{"$f":"CONCATENATE(\"Total amount of the DMIA spent in \", CRY)","v":"Total amount of the DMIA spent in 2016-17"}]
[null,null,"Operating expenditure","Capital expenditure","Total"]
[null,null,"$0's, nominal"]
[null,"Residential Energy Storage Trial",318937,0,{"$f":"SUM(C10:D10)","v":318937}]
[null,null,null,null,0]
[null,null,null,null,0]
[null,null,null,null,0]
[null,null,null,null,0]
[null,null,null,null,{"$f":"SUM(C15:D15)","v":0}]
[null,"To enter additional projects - please copy a row from above and \"insert copied cells\" above this row. "]
[null,"Total",{"$f":"SUM(C10:C16)","v":318937},{"$f":"SUM(D10:D16)","v":0},{"$f":"SUM(E10:E16)","v":318937}]

{"sheet":"7.12 Safety and Bushfire","index":17,"n_rows":340,"n_cols":10,"rows_kept":340,"cut":false,"hidden":false,"merged":[[319,4,319,6],[320,4,320,6],[214,6,214,8],[212,3,212,5],[212,6,212,8],[40,2,40,5],[41,2,41,5],[38,2,38,5],[39,2,39,5],[119,6,119,8],[120,6,120,8],[44,2,44,5],[68,6,68,7],[69,6,69,7],[70,6,70,7],[122,6,122,8],[123,6,123,8],[124,6,124,8],[125,6,125,8],[126,6,126,8],[59,6,59,7],[60,6,60,7],[61,6,61,7],[62,6,62,7],[337,4,337,6],[338,4,338,6],[324,4,324,6],[313,4,313,6],[314,4,314,6],[315,4,315,6],[316,4,316,6],[317,4,317,6],[318,4,318,6],[325,4,325,6],[326,4,326,6],[321,4,321,6],[322,4,322,6],[323,4,323,6],[332,4,332,6],[333,4,333,6],[334,4,334,6],[336,4,336,6],[331,4,331,6],[335,4,335,6],[329,4,329,6],[330,4,330,6],[327,4,327,6],[328,4,328,6],[248,1,249,1],[248,2,249,2],[312,4,312,6],[10,1,10,2],[82,3,82,5],[82,1,84,1],[82,2,84,2],[11,1,11,2],[164,2,164,4],[84,3,84,5],[82,6,82,8],[84,6,84,8],[17,6,17,8],[32,6,32,8],[33,6,33,8],[34,2,34,5],[34,6,34,8],[35,2,35,5],[35,6,35,8],[36,2,36,5],[36,6,36,8],[249,3,249,5],[311,4,311,6],[43,2,43,5],[37,2,37,5],[5,1,5,2],[25,2,25,5],[26,2,26,5],[27,2,27,5],[28,2,28,5],[29,2,29,5],[30,2,30,5],[42,2,42,5],[31,2,31,5],[32,2,32,5],[14,1,14,4],[13,1,13,4],[33,2,33,5],[24,2,24,5],[17,2,17,5],[18,2,18,5],[19,2,19,5],[20,2,20,5],[21,2,21,5],[22,2,22,5],[23,2,23,5],[212,1,214,1],[212,2,214,2],[214,3,214,5],[82,9,84,9],[162,2,162,4],[162,5,162,7],[162,1,164,1],[164,5,164,7],[133,6,133,8],[134,6,134,8],[135,6,135,8],[136,6,136,8],[137,6,137,8],[138,6,138,8],[139,6,139,8],[140,6,140,8],[141,6,141,8],[142,6,142,8],[143,6,143,8],[144,6,144,8],[145,6,145,8],[212,9,214,9],[117,6,118,8],[121,6,121,8],[18,6,18,8],[19,6,19,8],[20,6,20,8],[21,6,21,8],[22,6,22,8],[42,6,42,8],[43,6,43,8],[44,6,44,8],[28,6,28,8],[29,6,29,8],[30,6,30,8],[31,6,31,8],[23,6,23,8],[24,6,24,8],[25,6,25,8],[26,6,26,8],[27,6,27,8],[40,6,40,8],[37,6,37,8],[41,6,41,8],[38,6,38,8],[39,6,39,8],[63,6,63,7],[64,6,64,7],[65,6,65,7],[66,6,66,7],[67,6,67,7],[50,6,50,7],[51,6,51,7],[52,6,52,7],[53,6,53,7],[54,6,54,7],[55,6,55,7],[56,6,56,7],[57,6,57,7],[58,6,58,7],[162,8,164,9],[171,8,171,9],[172,8,172,9],[166,8,166,9],[167,8,167,9],[71,6,71,7],[72,6,72,7],[73,6,73,7],[74,6,74,7],[75,6,75,7],[76,6,76,7],[77,6,77,7],[165,8,165,9],[168,8,168,9],[130,6,130,8],[131,6,131,8],[132,6,132,8],[127,6,127,8],[128,6,128,8],[129,6,129,8],[248,6,249,7],[250,6,250,7],[251,6,251,7],[252,6,252,7],[253,6,253,7],[254,6,254,7],[255,6,255,7],[256,6,256,7],[169,8,169,9],[170,8,170,9],[207,6,207,7],[190,6,190,7],[191,6,191,7],[192,6,192,7],[193,6,193,7],[194,6,194,7],[195,6,195,7],[196,6,196,7],[197,6,197,7],[198,6,198,7],[199,6,199,7],[200,6,200,7],[201,6,201,7],[202,6,202,7],[272,6,272,7],[273,6,273,7],[274,6,274,7],[257,6,257,7],[258,6,258,7],[259,6,259,7],[260,6,260,7],[261,6,261,7],[262,6,262,7],[263,6,263,7],[264,6,264,7],[265,6,265,7],[304,6,304,7],[305,6,305,7],[288,6,288,7],[289,6,289,7],[290,6,290,7],[291,6,291,7],[292,6,292,7],[293,6,293,7],[294,6,294,7],[295,6,295,7],[296,6,296,7],[138,1,138,2],[297,6,297,7],[298,6,298,7],[299,6,299,7],[300,6,300,7],[301,6,301,7],[302,6,302,7],[303,6,303,7],[275,6,275,7],[276,6,276,7],[282,6,282,7],[283,6,283,7],[284,6,284,7],[285,6,285,7],[286,6,286,7],[287,6,287,7],[280,6,280,7],[281,6,281,7],[266,6,266,7],[267,6,267,7],[268,6,268,7],[269,6,269,7],[270,6,270,7],[271,6,271,7],[117,1,118,2],[180,6,180,7],[306,6,306,7],[307,6,307,7],[118,3,118,5],[119,1,119,2],[120,1,120,2],[121,1,121,2],[122,1,122,2],[123,1,123,2],[124,1,124,2],[125,1,125,2],[126,1,126,2],[127,1,127,2],[128,1,128,2],[129,1,129,2],[130,1,130,2],[131,1,131,2],[132,1,132,2],[133,1,133,2],[134,1,134,2],[135,1,135,2],[136,1,136,2],[137,1,137,2],[206,6,206,7],[181,6,181,7],[182,6,182,7],[183,6,183,7],[184,6,184,7],[185,6,185,7],[186,6,186,7],[187,6,187,7],[188,6,188,7],[189,6,189,7],[139,1,139,2],[140,1,140,2],[141,1,141,2],[142,1,142,2],[143,1,143,2],[144,1,144,2],[203,6,203,7],[204,6,204,7],[205,6,205,7],[145,1,145,2]]}
[null,{"$f":"(LOOKUP(dms_Model,dms_Model_List,dms_Worksheet_List))","v":"REGULATORY REPORTING STATEMENT"}]
[null,{"$f":"dms_TradingName","v":"Endeavour Energy"}]
[null,{"$f":"CONCATENATE(\"Annual Reporting RIN Response \",CRY)","v":"Annual Reporting RIN Response 2016-17"}]
[null,"7.12 SAFETY AND BUSHFIRE RELATED EXPENDITURE"]
[]
[null,"These templates collect information from Victorian businesses only.\n\nBushfire and safety related expenditure information is used by the AER to monitor the expenditures throughout the regulatory control period."]
[]
[null,"CPI applied to convert expected expenditure in real $ to nominal based on lagged September CPI index"]
[]
[null,"Instructions"]
[null,"For \"Exclusive of Margins & Overheads\" reported expenditure is to EXCLUDE any overheads, profit margins or management fees paid directly or indirectly to related party contractors (not including actual incurred expense of the related party contractor) for the reporting period."]
[null,"For \"Value of Margins & Overheads\" reported expenditure is to COMPRISE ONLY the sum of overheads, profit margins or management fees paid directly or indirectly to related party contractors (not including actual incurred expenses of the related party contractor) for the reporting period. "]
[]
[null,{"$f":"CONCATENATE(dms_TradingName, \" is to specify each activity in this table in accordance with the definition in Appendix F of the RIN.\")","v":"Endeavour Energy is to specify each activity in this table in accordance with the definition in Appendix F of the RIN."}]
[null,"All activities must be reported but the Reason for Difference is only required if there is a 10 per cent difference between the expected value and the actual value.\n\nUse median unit costs. Where unit costs are not recorded at the asset category level - provide the best estimates of the unit cost using the cost allocation method identified in this table. (As a transitional measure, the unit cost may be based on a statistically significant annual sample of actual work orders at a 5% or better confidence interval.)\n\nProvide basis of allocation where applicable."]
[]
[null,"7.12.1 - SAFETY AND BUSHFIRE RELATED ASSET GROUP DEFINITIONS AND ALLOCATION BASIS"]
[null,"Activity","Definitions",null,null,null,"Basis for allocation of cost to activity"]
[null,"Planned non-preferred services replacements"]
[null,"Planned replacement of non-preferred services due to height "]
[null,"Removal of public lighting switchwire "]
[null,"Replacement of existing SWER lines with 22kV overhead bare conductor "]
[null,"Installation of GFN and associated equipment at zone substations "]
[null,"Replacement of crossarms/insulator sets – pole top fire mitigation"]
[null,"Replacement of crossarms – based on age and condition "]
[null,"Replacement of poles – based on age and condition "]
[null,"Stake poles – based on age and condition "]
[null,"Replacement of undersized poles "]
[null,"Stake undersized poles"]
[null,"Replacement of overhead conductor – mainly steel "]
[null,"Service line clearance – overhead services requiring relocation "]
[null,"Service line clearance – overhead services requiring undergrounding "]
[null,"Replacement of 22kV distribution feeders with ABC/underground cabling"]
[null,"Replacement of SWER with covered carbon core conductor or equivalent"]
[null,"Replacement of SWER with ABC"]
[null,"Replacement of SWER with underground"]
[null,"Replacement of surge diverters (neptune configuration)"]
[null,"Replacement of surge diverters (single phase or three phase)"]
[]
[]
[]
[]
[]
[]
[]
[null,"To enter further activities - please copy row from above and \"insert copied cells\" into a row above this row. "]
[]
[null,"7.12.2 - BUSHFIRE RELATED"]
[]
[null,"7.12.2.1 - NUMBER OF ACTIVITIES"]
[null,"Activity","Units","AER expected number","Actual Number","Difference","Reasons for Difference"]
[null,"Planned non-preferred services replacements","number of services",null,null,{"$f":"D52-E52","v":0}]
[null,"Planned replacement of non-preferred services due to height ","number of services",null,null,{"$f":"D53-E53","v":0}]
[null,"Removal of public lighting switchwire ","number of spans removed",null,null,0]
[null,"Replacement of existing SWER lines with 22kV overhead bare conductor ","kms of SWER",null,null,0]
[null,"Installation of GFN and associated equipment at zone substations ","number of zone substations",null,null,{"$f":"D56-E56","v":0}]
[null,"Replacement of crossarms/insulator sets – pole top fire mitigation","number of crossarms/sets",null,null,0]
[null,"Replacement of crossarms – based on age and condition ","number of crossarms",null,null,0]
[null,"Replacement of poles – based on age and condition ","number of poles",null,null,0]
[null,"Stake poles – based on age and condition ","number of poles",null,null,0]
[null,"Replacement of undersized poles ","number of poles",null,null,0]
[null,"Stake undersized poles","number of poles",null,null,0]
[null,"Replacement of overhead conductor – mainly steel ","kms ",null,null,0]
[null,"Service line clearance – overhead services requiring relocation ","number of services",null,null,0]
[null,"Service line clearance – overhead services requiring undergrounding ","number of services",null,null,0]
[null,"Replacement of 22kV distribution feeders with ABC/underground cabling","number of feeders",null,null,0]
[null,"Replacement of SWER with covered carbon core conductor or equivalent","kms ",null,null,0]
[null,"Replacement of SWER with ABC","kms ",null,null,0]
[null,"Replacement of SWER with underground","kms ",null,null,0]
[null,"Replacement of surge diverters (neptune configuration)","number of units",null,null,{"$f":"D70-E70","v":0}]
[null,"Replacement of surge diverters (single phase or three phase)","number of units",null,null,0]
[null,{"$f":"IF(ISBLANK(B39),\"\",B39)","v":""},null,null,null,{"$f":"D72-E72","v":0}]
[null,{"$f":"IF(ISBLANK(B40),\"\",B40)","v":""},null,null,null,0]
[null,"",null,null,null,0]
[null,"",null,null,null,0]
[null,"",null,null,null,0]
[null,"",null,null,null,0]
[null,"",null,null,null,0]
[null,"To enter further activities - please copy row from above and \"insert copied cells\" into a row above this row. "]
[]
[]
[null,"7.12.2.2 - EXPENDITURE "]
[null,"Activity","Units","Exclusive of Margins & Overheads",null,null,"Value of Margins & Overheads",null,null,"Reasons for Difference"]
[null,null,null,"AER expected expenditure ","Actual expenditure","Difference  ","AER expected expenditure ","Actual expenditure","Difference  "]
[null,null,null,"$0's, Nominal",null,null,"$0's, Nominal"]
[null,"Planned non-preferred services replacements","number of services",null,null,{"$f":"D86*$C$8-E86","v":0},null,null,{"$f":"G86*$C$8-H86","v":0}]
[null,"Planned replacement of non-preferred services due to height ","number of services",null,null,{"$f":"D87*$C$8-E87","v":0},null,null,{"$f":"G87*$C$8-H87","v":0}]
[null,"Removal of public lighting switchwire ","number of spans removed",null,null,0,null,null,0]
[null,"Replacement of existing SWER lines with 22kV overhead bare conductor ","kms of SWER",null,null,0,null,null,0]
[null,"Installation of GFN and associated equipment at zone substations ","number of zone substations",null,null,0,null,null,0]
[null,"Replacement of crossarms/insulator sets – pole top fire mitigation","number of crossarms/sets",null,null,0,null,null,0]
[null,"Replacement of crossarms – based on age and condition ","number of crossarms",null,null,0,null,null,0]
[null,"Replacement of poles – based on age and condition ","number of poles",null,null,0,null,null,0]
[null,"Stake poles – based on age and condition ","number of poles",null,null,0,null,null,0]
[null,"Replacement of undersized poles ","number of poles",null,null,0,null,null,0]
[null,"Stake undersized poles","number of poles",null,null,0,null,null,0]
[null,"Replacement of overhead conductor – mainly steel ","kms ",null,null,0,null,null,0]
[null,"Service line clearance – overhead services requiring relocation ","number of services",null,null,0,null,null,0]
[null,"Service line clearance – overhead services requiring undergrounding ","number of services",null,null,0,null,null,0]
[null,"Replacement of 22kV distribution feeders with ABC/underground cabling","number of feeders",null,null,0,null,null,0]
[null,"Replacement of SWER with covered carbon core conductor or equivalent","kms ",null,null,0,null,null,0]
[null,"Replacement of SWER with ABC","kms ",null,null,0,null,null,0]
[null,"Replacement of SWER with underground","kms ",null,null,0,null,null,0]
[null,"Replacement of surge diverters (neptune configuration)","number of units",null,null,0,null,null,0]
[null,"Replacement of surge diverters (single phase or three phase)","number of units",null,null,0,null,null,0]
[null,{"$f":"IF(ISBLANK(B39),\"\",B39)","v":""},{"$f":"IF(ISBLANK(C72),\"\",C72)","v":""},null,null,0,null,null,0]
[null,"","",null,null,{"$f":"D107*$C$8-E107","v":0},null,null,{"$f":"G107*$C$8-H107","v":0}]
[null,"","",null,null,0,null,null,0]
[null,"","",null,null,0,null,null,0]
[null,"","",null,null,0,null,null,0]
[null,"","",null,null,0,null,null,0]
[null,"","",null,null,0,null,null,0]
[null,"To enter further activities - please copy row from above and \"insert copied cells\" into a row above this row. "]
[]
[]
[]
[null,"7.12.2.3 - UNIT COSTS"]
[null,"Activity",null,"AER expected ","Actual","Difference","Reasons for Difference"]
[null,null,null,"$0's, Per Unit"]
[null,"Planned non-preferred services replacements",null,null,null,{"$f":"D120*$C$8-E120","v":0}]
[null,"Planned replacement of non-preferred services due to height ",null,null,null,0]
[null,"Removal of public lighting switchwire ",null,null,null,0]
[null,"Replacement of existing SWER lines with 22kV overhead bare conductor ",null,null,null,0]
[null,"Installation of GFN and associated equipment at zone substations ",null,null,null,0]
[null,"Replacement of crossarms/insulator sets – pole top fire mitigation",null,null,null,0]
[null,"Replacement of crossarms – based on age and condition ",null,null,null,0]
[null,"Replacement of poles – based on age and condition ",null,null,null,0]
[null,"Stake poles – based on age and condition ",null,null,null,0]
[null,"Replacement of undersized poles ",null,null,null,0]
[null,"Stake undersized poles",null,null,null,0]
[null,"Replacement of overhead conductor – mainly steel ",null,null,null,0]
[null,"Service line clearance – overhead services requiring relocation ",null,null,null,0]
[null,"Service line clearance – overhead services requiring undergrounding ",null,null,null,0]
[null,"Replacement of 22kV distribution feeders with ABC/underground cabling",null,null,null,0]
[null,"Replacement of SWER with covered carbon core conductor or equivalent",null,null,null,0]
[null,"Replacement of SWER with ABC",null,null,null,0]
[null,"Replacement of SWER with underground",null,null,null,0]
[null,"Replacement of surge diverters (neptune configuration)",null,null,null,0]
[null,"Replacement of surge diverters (single phase or three phase)",null,null,null,0]
[null,{"$f":"IF(ISBLANK(B39),\"\",B39)","v":""},null,null,null,0]
[null,"",null,null,null,0]
[null,"",null,null,null,0]
[null,"",null,null,null,0]
[null,"",null,null,null,0]
[null,"",null,null,null,0]
[null,"",null,null,null,0]
[null,"To enter further activities - please copy row from above and \"insert copied cells\" into a row above this row. "]
[]
[]
[null,"7.12.2.4 - CONTINGENT PROJECT APPLICATIONS - VOLUMES APPROVED"]
[null,"Activity","Units","Volume approved under contingent project applications ","Actual volumes","Difference"]
[null,null,null,null,null,{"$f":"E152-D152","v":0}]
[null,null,null,null,null,0]
[null,null,null,null,null,0]
[null,null,null,null,null,0]
[null,null,null,null,null,0]
[null,null,null,null,null,0]
[null,null,null,null,null,0]
[null,null,null,null,null,0]
[null,"To enter further activities - please copy row from above and \"insert copied cells\" into a row above this row. "]
[]
[null,"7.12.2.5 - CONTINGENT PROJECT APPLICATIONS - EXPENDITURE APPROVED"]
[null,"Activity","Exclusive of Margins & Overheads",null,null,"Value of Margins & Overheads",null,null,"Reasons for Difference"]
[null,null,"Expenditure approved under contingent project applications","Actual expenditure ","Difference","Expenditure approved under contingent project applications","Actual expenditure","Difference"]
[null,null,"$0's, Nominal",null,null,"$0's, Nominal"]
[null,{"$f":"IF(ISBLANK(B152),\"\",B152)","v":""},null,null,{"$f":"C166-D166","v":0},null,null,{"$f":"F166-G166","v":0}]
[null,{"$f":"IF(ISBLANK(B153),\"\",B153)","v":""},null,null,{"$f":"C167-D167","v":0},null,null,{"$f":"F167-G167","v":0}]
[null,"",null,null,0,null,null,0]
[null,"",null,null,0,null,null,0]
[null,"",null,null,0,null,null,0]
[null,"",null,null,0,null,null,0]
[null,"",null,null,0,null,null,0]
[null,"",null,null,0,null,null,0]
[null,"To enter further activities - please copy row from above and \"insert copied cells\" into a row above this row. "]
[]
[]
[]
[null,"7.12.3 - SAFETY RELATED"]
[]
[null,"7.12.3.1 - NUMBER OF ACTIVITIES"]
[null,"Activity","Units","AER expected volumes","Actual units","Difference","Reasons for Difference"]
[null,"Planned non-preferred services replacements","number of services",null,null,{"$f":"D182-E182","v":0}]
[null,"Planned replacement of non-preferred services due to height ","number of services",null,null,{"$f":"D183-E183","v":0}]
[null,"Removal of public lighting switchwire ","number of spans removed",null,null,0]
[null,"Replacement of existing SWER lines with 22kV overhead bare conductor ","kms of SWER",null,null,0]
[null,"Installation of GFN and associated equipment at zone substations ","number of zone substations",null,null,0]
[null,"Replacement of crossarms/insulator sets – pole top fire mitigation","number of crossarms/sets",null,null,0]
[null,"Replacement of crossarms – based on age and condition ","number of crossarms",null,null,0]
[null,"Replacement of poles – based on age and condition ","number of poles",null,null,0]
[null,"Stake poles – based on age and condition ","number of poles",null,null,0]
[null,"Replacement of undersized poles ","number of poles",null,null,0]
[null,"Stake undersized poles","number of poles",null,null,0]
[null,"Replacement of overhead conductor – mainly steel ","kms ",null,null,0]
[null,"Service line clearance – overhead services requiring relocation ","number of services",null,null,0]
[null,"Service line clearance – overhead services requiring undergrounding ","number of services",null,null,0]
[null,"Replacement of 22kV distribution feeders with ABC/underground cabling","number of feeders",null,null,0]
[null,"Replacement of SWER with covered carbon core conductor or equivalent","kms ",null,null,0]
[null,"Replacement of SWER with ABC","kms ",null,null,{"$f":"D198-E198","v":0}]
[null,"Replacement of SWER with underground","kms ",null,null,{"$f":"D199-E199","v":0}]
[null,"Replacement of surge diverters (neptune configuration)","number of units",null,null,0]
[null,"Replacement of surge diverters (single phase or three phase)","number of units",null,null,0]
[null,{"$f":"IF(ISBLANK(B39),\"\",B39)","v":""},{"$f":"IF(ISBLANK(C72),\"\",C72)","v":""},null,null,0]
[null,"","",null,null,0]
[null,"","",null,null,{"$f":"D204-E204","v":0}]
[null,"","",null,null,{"$f":"D205-E205","v":0}]
[null,"","",null,null,{"$f":"D206-E206","v":0}]
[null,"","",null,null,0]
[null,"","",null,null,0]
[null,"To enter further activities - please copy row from above and \"insert copied cells\" into a row above this row. "]
[]
[]
[null,"7.12.3.2 - EXPENDITURE"]
[null,"Activity","Units","Exclusive of Margins & Overheads",null,null,"Value of Margins & Overheads",null,null,"Reasons for Difference"]
[null,null,null,"AER expected expenditure ","Actual expenditure","Difference  ","AER expected expenditure ","Actual expenditure","Difference  "]
[null,null,null,"$0's, Nominal",null,null,"$0's, Nominal"]
[null,"Planned non-preferred services replacements","number of services",null,null,{"$f":"D216*$C$8-E216","v":0},null,null,{"$f":"G216*$C$8-H216","v":0}]
[null,"Planned replacement of non-preferred services due to height ","number of services",null,null,{"$f":"D217*$C$8-E217","v":0},null,null,{"$f":"G217*$C$8-H217","v":0}]
[null,"Removal of public lighting switchwire ","number of spans removed",null,null,0,null,null,0]
[null,"Replacement of existing SWER lines with 22kV overhead bare conductor ","kms of SWER",null,null,0,null,null,0]
[null,"Installation of GFN and associated equipment at zone substations ","number of zone substations",null,null,0,null,null,0]
[null,"Replacement of crossarms/insulator sets – pole top fire mitigation","number of crossarms/sets",null,null,0,null,null,0]
[null,"Replacement of crossarms – based on age and condition ","number of crossarms",null,null,0,null,null,0]
[null,"Replacement of poles – based on age and condition ","number of poles",null,null,0,null,null,0]
[null,"Stake poles – based on age and condition ","number of poles",null,null,0,null,null,0]
[null,"Replacement of undersized poles ","number of poles",null,null,0,null,null,0]
[null,"Stake undersized poles","number of poles",null,null,0,null,null,0]
[null,"Replacement of overhead conductor – mainly steel ","kms ",null,null,0,null,null,0]
[null,"Service line clearance – overhead services requiring relocation ","number of services",null,null,0,null,null,0]
[null,"Service line clearance – overhead services requiring undergrounding ","number of services",null,null,0,null,null,0]
[null,"Replacement of 22kV distribution feeders with ABC/underground cabling","number of feeders",null,null,0,null,null,0]
[null,"Replacement of SWER with covered carbon core conductor or equivalent","kms ",null,null,0,null,null,0]
[null,"Replacement of SWER with ABC","kms ",null,null,{"$f":"D232-E232","v":0},null,null,{"$f":"G232-H232","v":0}]
[null,"Replacement of SWER with underground","kms ",null,null,{"$f":"D233-E233","v":0},null,null,{"$f":"G233-H233","v":0}]
[null,"Replacement of surge diverters (neptune configuration)","number of units",null,null,0,null,null,0]
[null,"Replacement of surge diverters (single phase or three phase)","number of units",null,null,0,null,null,0]
[null,{"$f":"IF(ISBLANK(B39),\"\",B39)","v":""},{"$f":"IF(ISBLANK(C72),\"\",C72)","v":""},null,null,0,null,null,0]
[null,"","",null,null,0,null,null,0]
[null,"","",null,null,{"$f":"D238-E238","v":0},null,null,{"$f":"G238-H238","v":0}]
[null,"","",null,null,{"$f":"D239-E239","v":0},null,null,{"$f":"G239-H239","v":0}]
[null,"","",null,null,{"$f":"D240-E240","v":0},null,null,{"$f":"G240-H240","v":0}]
[null,"","",null,null,0,null,null,0]
[null,"","",null,null,0,null,null,0]
[null,"To enter further activities - please copy row from above and \"insert copied cells\" into a row above this row. "]
[]
[]
[]
[]
[null,"7.12.3.3 - UNIT COSTS"]
[null,"Activity","Units","AER expected","Actual\n  ","Difference\n  ","Reasons for Difference"]
[null,null,null,"$0's per Unit"]
[null,"Planned non-preferred services replacements","number of services",null,null,{"$f":"D251*$C$8-E251","v":0}]
[null,"Planned replacement of non-preferred services due to height ","number of services",null,null,0]
[null,"Removal of public lighting switchwire ","number of spans removed",null,null,0]
[null,"Replacement of  existing SWER lines with 22kV overhead bare conductor ","kms of SWER",null,null,0]
[null,"Installation of GFN and associated equipment at zone substations ","number of zone substations",null,null,0]
[null,"Replacement of crossarms/insulator sets – pole top fire mitigation","number of crossarms/sets",null,null,0]
[null,"Replacement of crossarms – based on age and condition ","number of crossarms",null,null,0]
[null,"Replacement of poles – based on age and condition ","number of poles",null,null,0]
[null,"Stake poles – based on age and condition ","number of poles",null,null,0]
[null,"Replacement of undersized poles ","number of poles",null,null,0]
[null,"Stake undersized poles","number of poles",null,null,0]
[null,"Replacement of overhead conductor – mainly steel ","kms ",null,null,0]
[null,"Service line clearance – overhead services requiring relocation ","number of services",null,null,0]
[null,"Service line clearance – overhead services requiring undergrounding ","number of services",null,null,0]
[null,"Replacement of 22kV distribution feeders with ABC/underground cabling","number of feeders",null,null,0]
[null,"Replacement of SWER with covered carbon core conductor or equivalent","kms ",null,null,0]
[null,"Replacement of SWER with ABC","kms ",null,null,{"$f":"D267-E267","v":0}]
[null,"Replacement of SWER with underground","kms ",null,null,{"$f":"D268-E268","v":0}]
[null,"Replacement of surge diverters (neptune configuration)","number of units",null,null,0]
[null,"Replacement of surge diverters (single phase or three phase)","number of units",null,null,0]
[null,{"$f":"IF(ISBLANK(B39),\"\",B39)","v":""},{"$f":"IF(ISBLANK(C72),\"\",C72)","v":""},null,null,0]
[null,"","",null,null,0]
[null,"","",null,null,{"$f":"D273-E273","v":0}]
[null,"","",null,null,{"$f":"D274-E274","v":0}]
[null,"","",null,null,{"$f":"D275-E275","v":0}]
[null,"","",null,null,0]
[null,"","",null,null,0]
[null,"To enter further activities - please copy row from above and \"insert copied cells\" into a row above this row. "]
[]
[null,"7.12.3.4 - SAFETY IMPROVEMENT OUTCOMES REPORTED TO ESV"]
[null,"Activity","Units","Safety Improvement Programme - outcomes","Safety Improvement Target","Difference","Reasons for Difference"]
[null,"Planned non-preferred services replacements","number of services",null,null,{"$f":"D282-E282","v":0}]
[null,"Planned replacement of non-preferred services due to height ","number of services",null,null,{"$f":"D283-E283","v":0}]
[null,"Removal of public lighting switchwire ","number of spans removed",null,null,0]
[null,"Replacement of  existing SWER lines with 22kV overhead bare conductor ","kms of SWER",null,null,0]
[null,"Installation of GFN and associated equipment at zone substations ","number of zone substations",null,null,0]
[null,"Replacement of crossarms/insulator sets – pole top fire mitigation","number of crossarms/sets",null,null,0]
[null,"Replacement of crossarms – based on age and condition ","number of crossarms",null,null,0]
[null,"Replacement of poles – based on age and condition ","number of poles",null,null,0]
[null,"Stake poles – based on age and condition ","number of poles",null,null,0]
[null,"Replacement of undersized poles ","number of poles",null,null,0]
[null,"Stake undersized poles","number of poles",null,null,0]
[null,"Replacement of overhead conductor – mainly steel ","kms ",null,null,0]
[null,"Service line clearance – overhead services requiring relocation ","number of services",null,null,0]
[null,"Service line clearance – overhead services requiring undergrounding ","number of services",null,null,0]
[null,"Replacement of 22kV distribution feeders with ABC/underground cabling","number of feeders",null,null,0]
[null,"Replacement of SWER with covered carbon core conductor or equivalent","kms ",null,null,0]
[null,"Replacement of SWER with ABC","kms ",null,null,0]
[null,"Replacement of SWER with underground","kms ",null,null,{"$f":"D299-E299","v":0}]
[null,"Replacement of surge diverters (neptune configuration)","number of units",null,null,0]
[null,"Replacement of surge diverters (single phase or three phase)","number of units",null,null,0]
[null,{"$f":"IF(ISBLANK(B39),\"\",B39)","v":""},{"$f":"IF(ISBLANK(C72),\"\",C72)","v":""},null,null,0]
[null,"","",null,null,0]
[null,"","",null,null,{"$f":"D304-E304","v":0}]
[null,"","",null,null,{"$f":"D305-E305","v":0}]
[null,"","",null,null,{"$f":"D306-E306","v":0}]
[null,"","",null,null,0]
[null,"","",null,null,0]
[null,"To enter further activities - please copy row from above and \"insert copied cells\" into a row above this row. "]
[]
[null,"7.12.3.5 - SAFETY IMPROVEMENT OUTCOMES RECONCILIATION"]
[null,"Activity","Units","Difference","Reasons for Difference"]
[null,"Planned non-preferred services replacements","number of services",{"$f":"D282-E52-E182","v":0}]
[null,"Planned replacement of non-preferred services due to height ","number of services",0]
[null,"Removal of public lighting switchwire ","number of spans removed",0]
[null,"Replacement of  existing SWER lines with 22kV overhead bare conductor ","kms of SWER",0]
[null,"Installation of GFN and associated equipment at zone substations ","number of zone substations",0]
[null,"Replacement of crossarms/insulator sets – pole top fire mitigation","number of crossarms/sets",0]
[null,"Replacement of crossarms – based on age and condition ","number of crossarms",0]
[null,"Replacement of poles – based on age and condition ","number of poles",0]
[null,"Stake poles – based on age and condition ","number of poles",0]
[null,"Replacement of undersized poles ","number of poles",0]
[null,"Stake undersized poles","number of poles",0]
[null,"Replacement of overhead conductor – mainly steel ","kms ",0]
[null,"Service line clearance – overhead services requiring relocation ","number of services",0]
[null,"Service line clearance – overhead services requiring undergrounding ","number of services",0]
[null,"Replacement of 22kV distribution feeders with ABC/underground cabling","number of feeders",0]
[null,"Replacement of SWER with covered carbon core conductor or equivalent","kms ",0]
[null,"Replacement of SWER with ABC","kms ",0]
[null,"Replacement of SWER with underground","kms ",0]
[null,"Replacement of surge diverters (neptune configuration)","number of units",0]
[null,"Replacement of surge diverters (single phase or three phase)","number of units",0]
[null,{"$f":"IF(ISBLANK(B39),\"\",B39)","v":""},{"$f":"IF(ISBLANK(C72),\"\",C72)","v":""},{"$f":"D302-E73-E202","v":0}]
[null,"","",0]
[null,"","",0]
[null,"","",0]
[null,"","",0]
[null,"","",0]
[null,"","",0]
[null,"To enter further activities - please copy row from above and \"insert copied cells\" into a row above this row. "]

{"sheet":"7.13 TARC","index":18,"n_rows":9,"n_cols":3,"rows_kept":9,"cut":false,"hidden":false,"merged":[]}
[null,{"$f":"(LOOKUP(dms_Model,dms_Model_List,dms_Worksheet_List))","v":"REGULATORY REPORTING STATEMENT"}]
[null,{"$f":"dms_TradingName","v":"Endeavour Energy"}]
[null,{"$f":"CONCATENATE(\"Annual Reporting RIN Response \",CRY)","v":"Annual Reporting RIN Response 2016-17"}]
[null,"7.13 - TARC"]
[]
[]
[null,"7.13.1 - TOTAL ANNUAL RETAILER CHARGES"]
[null,null,"$0's"]
[null,"TARC",1167975749.4699998]

{"sheet":"8.1 Income","index":19,"n_rows":40,"n_cols":12,"rows_kept":40,"cut":false,"hidden":false,"merged":[[6,1,9,1],[6,6,6,10],[7,8,7,10],[6,11,8,11],[9,2,9,11],[6,5,8,5],[7,6,7,7],[6,2,8,2],[6,3,8,3],[6,4,8,4]]}
[null,{"$f":"(LOOKUP(dms_Model,dms_Model_List,dms_Worksheet_List))","v":"REGULATORY REPORTING STATEMENT"}]
[null,{"$f":"dms_TradingName","v":"Endeavour Energy"}]
[null,{"$f":"CONCATENATE(\"Annual Reporting RIN Response \",CRY)","v":"Annual Reporting RIN Response 2016-17"}]
[null,"8.1 - INCOME"]
[]
[null,"8.1.1 - INCOME STATEMENT"]
[null,"Description","Audited Statutory Accounts","Adjustments","Distribution business","Standard Control Services","Alternative Control Services",null,null,null,null,"Negotiated Services"]
[null,null,null,null,null,null,"Public Lighting",null,"Other"]
[null,null,null,null,null,null,{"$f":"IF(dms_Jurisdiction=\"Vic\",\"Energy efficient\",\"\")","v":""},{"$f":"IF(dms_Jurisdiction=\"Vic\",\"Non-energy efficient\",\"\")","v":""},"Connection services","Metering services","Ancillary network services"]
[null,null,"$0's, nominal"]
[]
[null,"8.1.1.1 - REVENUE"]
[null,"Distribution revenue",832191098.57871306,43543248.034203306,875734346.61291635,875734346.61291635,0,null,0,0,0]
[null,"Cross boundary revenue",0,0,0,0,0,null,0,0,0]
[null,"Contributions",171721909.18000004,10915712.589999951,182637621.77000001,164886991.68199998,15388097.318000013,null,0,2362532.77,0]
[null,"Interest income",148583.1,58034.769999999982,206617.87,206617.87,0,null,0,0,0]
[null,"Jurisdictional scheme amounts",100284048.8,3953302.429999996,104237351.23,104237351.23,0,null,0,0,0]
[null,"Profit from sale of fixed assets",0,0,0,0,0,null,0,0,0]
[null,"TUOS revenue",200333718.2212868,10534098.925796513,210867817.14708331,210867817.14708331,0,null,0,0,0]
[null,"Pass through revenue (F-factor)",0,0,0,0,0,null,0,0,0]
[null,"Other Revenue ",126235469.65000002,-55365564.118837096,70869905.531162918,245247.23604526749,20653626.968501616,null,0,17106601.086206302,32864430.240409732]
[null,"Total revenue",{"$f":"SUM(C13:C21)","v":1430914827.53},13638832.631162666,1444553660.1611626,1356178371.7780449,36041724.286501631,0,0,19469133.856206302,32864430.240409732,0]
[]
[null,"8.1.1.2 - EXPENDITURE"]
[null,"TUOS expenditure",195821702.19999999,9726774.770000048,205548476.97000006,205548476.97000006,0,null,0,0,0]
[null,"Avoided TUOS expenditure",1273481,-178099.82000000012,1095381.18,1095381.18,0,null,0,0,0]
[null,"Cross boundary expenditure",0,0,0,0,0,null,0,0,0]
[null,"Depreciation ",201448260.96000001,7801572.0578189939,209249833.01781902,191588394.261841,10786260.7588972,null,0,6875177.9970808197,0]
[null,"Finance charges",220300000,7353614.5099998685,227653614.50999987,227653614.50999987,0,null,0,0,0]
[null,"Impairment losses",0,0,0,0,0,null,0,0,0]
[null,"Jurisdictional scheme amounts",106070198,4127354.8199999933,110197552.81999999,110197552.81999999,0,null,0,0,0]
[null,"Loss from sale of fixed assets",15578316.290000003,-235628.63015388211,15342687.659846121,15216373.7347707,70304.722240836796,null,0,56009.202834583397,0]
[null,"Maintenance expenditure",230173798.21742803,28656809.237013165,258830607.45444119,258830607.45444119,0,null,0,0,0]
[null,"Operating expenditure excluding maintenance expenditure",16343989.552956903,1786556.5502878018,18130546.103244707,18130546.103244707,0,null,0,0,0]
[null,"Other ",132670276.54961462,-38244690.672140539,94425585.877474099,28121949.04651973,16914373.65839557,null,0,19479747.22899675,29909515.943562038]
[]
[null,"8.1.1.3 - PROFIT"]
[null,"Profit before tax (PBT)",{"$f":"C22-SUM(C25:C35)","v":311234804.76000047},-7155430.1916627809,304079374.56833768,299795475.69722784,8270785.146968022,0,0,-6941800.5727058537,2954914.2968476936,0]
[null,"Income tax expenses (/ benefit)",95069899,-389992.26934727631,94679906.730652735,93346047.286433578,2575239.3348474721,null,0,-2161439.0377499103,920059.14712159359]
[null,"Profit after tax",{"$f":"C38-C39","v":216164905.76000047},-6765437.9223155044,209399467.83768493,206449428.41079426,5695545.8121205494,0,0,-4780361.534955943,2034855.1497261,{"$f":"L38-L39","v":0}]

{"sheet":"8.2 Capex","index":20,"n_rows":251,"n_cols":10,"rows_kept":251,"cut":false,"hidden":false,"merged":[[62,1,65,1],[63,2,64,2],[52,2,52,5],[53,2,53,5],[54,2,54,5],[62,2,62,9],[63,6,63,9],[85,2,85,3],[45,2,45,5],[46,2,46,5],[47,2,47,5],[65,2,65,3],[57,2,57,5],[83,3,84,3],[63,4,64,4],[81,1,81,2],[58,2,58,5],[63,3,64,3],[63,5,64,5],[83,1,85,1],[83,2,84,2],[65,5,65,9],[48,2,48,5],[83,5,84,5],[43,2,43,5],[44,2,44,5],[55,2,55,5],[56,2,56,5],[50,2,50,5],[51,2,51,5],[49,2,49,5],[83,4,84,4],[6,1,6,4],[41,1,41,4],[10,1,10,4],[7,1,7,4],[8,1,8,4],[14,1,14,4],[16,1,19,1],[16,2,16,9],[17,2,18,2],[17,3,18,3],[17,4,18,4],[17,5,18,5],[17,6,17,9],[19,2,19,3],[19,5,19,9],[140,4,141,4],[197,4,198,4],[140,3,141,3],[140,2,141,2],[197,2,198,2],[197,1,199,1],[140,1,142,1],[197,3,198,3],[142,2,142,3],[199,2,199,3]]}
[null,{"$f":"(LOOKUP(dms_Model,dms_Model_List,dms_Worksheet_List))","v":"REGULATORY REPORTING STATEMENT"}]
[null,{"$f":"dms_TradingName","v":"Endeavour Energy"}]
[null,{"$f":"CONCATENATE(\"Annual Reporting RIN Response \",CRY)","v":"Annual Reporting RIN Response 2016-17"}]
[null,"8.2 - CAPEX"]
[]
[null,"Instructions"]
[null,"Reported expenditure must EXCLUDE capital contributions (except tables 8.2.1 and 8.2.5 which should include all capital contributions)."]
[null,{"$f":"CONCATENATE(\"Forecast expenditure is to be taken from \",dms_TradingName,\"'s \",dms_DeterminationRef,\".\")","v":"Forecast expenditure is to be taken from Endeavour Energy's 2014-19 Distribution Determination."}]
[null,"If allocating based on assumptions then provide method in Basis of Preparation. All adjustments must be explained in Basis of Preparation with supporting documentation attached. "]
[]
[null,"For tables 8.2.1 and 8.2.3:\nReported expenditure must INCLUDE any profit margins or management fees paid directly or indirectly to related party contractors (not including actual incurred expenses of the related party contractor) for the regulatory reporting period.\n\n'Related Party Margin Expenditure' must COMPRISE ONLY profit margins or management fees paid directly or indirectly to related party contractors (not including actual incurred expenses of the related party contractor) for the regulatory reporting period."]
[]
[null,"8.2.1 - CAPEX BY PURPOSE - STANDARD CONTROL SERVICES"]
[]
[null,"Each line item in this table must INCLUDE the capital contributions. Total capital contributions should also be identified in the last item in the table. "]
[]
[null,"Description","EXPENDITURE"]
[null,null,"CPI adjusted Forecast","Actual","Difference","Related Party Margin","Voltage level"]
[null,null,null,null,null,null,"Subtransmission","HV","LV","Other "]
[null,null,"$0's, nominal",null," (%)","$0's, nominal"]
[null,"Augmentation",45991288.459090501,{"$f":"SUM(G21:J21)","v":27897793.08710796},{"$f":"IF(C21=0,1,(D21-C21)/C21*1)","v":-0.39341136067707261},0,25427409.49710796,1756979.4219999998,713404.16799999995,0]
[null,"Connections",16498917.063076271,{"$f":"SUM(G22:J22)","v":13269832},{"$f":"IF(C22=0,1,(D22-C22)/C22*1)","v":-0.19571497030570553},0,0,10560607,2709225,0]
[null,"Replacement",133156727.63790792,83891621.140000135,-0.3699783508639084,0,24728524.76337852,25087382.800384521,30586500.525978763,3489213.0502583454]
[null,"Reliability improvement",5276632.0757647464,2536950.4399999958,-0.51921028345863707,0,0,2536950.4399999958,0,0]
[null,"Other System Assets",88255882.495916456,180281552.59199998,1.0427142927310424,0,49695208.35800001,47768113.507000014,66024716.726999953,16793514]
[null,"Non-Network",30808157.625791132,{"$f":"SUM(G26:J26)","v":15958149},-0.48201547155677388,0,0,0,0,15958149]
[null,"Capitalised overheads",73807261.523965776,39262365,-0.4680419759612513,0,0,0,0,39262365]
[null,null,null,0,1]
[null,null,null,0,1]
[null,null,null,{"$f":"SUM(G30:J30)","v":0},1]
[null,null,null,0,1]
[null,null,null,0,1]
[null,null,null,0,1]
[null,null,null,0,1]
[null,null,null,0,1]
[null,"Capital contributions included in the above",84519077,164136467,0.9420049629742171,null,49695208,43770890,67389619,3280750]
[null,"Total",{"$f":"SUM(C21:C35)","v":393794866.88151282},363098263.25910807,{"$f":"IF(C37=0,1,(D37-C37)/C37*1)","v":-7.7950745944184482E-2},null,{"$f":"SUM(G21:G35)","v":99851142.618486494},{"$f":"SUM(H21:H35)","v":87710033.169384539},100033846.42097872,75503241.050258338]
[]
[]
[null,"8.2.2 - CAPEX BY PURPOSE - MATERIAL DIFFERENCE EXPLANATION"]
[]
[null,"Where the difference between forecast and actual expenditure shown in table 8.2.1 is a Material Difference please explain the main factors driving the difference."]
[]
[null,"Description","Reason for material difference"]
[null,"Augmentation","Below the forecast due to lower than expected major projects and HV developments."]
[null,"Connections","Below the forecast due to lower than expected industrial & commercial and non urban developments."]
[null,"Replacement","Below the forecast due to lower than expected distribution refurbishment and transmission mains/subs expenditure."]
[null,"Reliability improvement ","Below the forecast due to lower than expected HV reliability developments"]
[null,"Other System Assets","Above the forecast due to capital contributions and direct capital overheads being reported in the actuals within other system assets whereas the forecast for direct capital overheads was within capitalised overheads."]
[null,"Non-Network","Below the forecast due to information & communication technology and motor vehicles"]
[null,"Capitalised overheads","Below the forecast due to direct capital overheads being reported in the actuals within other system assets.  The remainder of the variance is due to lower indirect capitalised overheads as a result of a lower eligible operating overhead pool."]
[]
[]
[]
[]
[]
[]
[]
[]
[]
[]
[null,"8.2.3 - CAPEX OTHER"]
[null,null,"EXPENDITURE"]
[null,null,"CPI adjusted Forecast","Actual","Difference","Related Party Margin","Voltage level"]
[null,null,null,null,null,null,"Subtransmission","HV","LV","Other "]
[null,null,"$0's, nominal",null," (%)","$0's, nominal"]
[null,"Public lighting"]
[null,{"$f":"IF(dms_Jurisdiction=\"Vic\",\"Energy Efficient\", \"Total\")","v":"Total"},0,{"$f":"SUM(G68:J68)","v":7695340.970565537},{"$f":"IF(C68=0,1,((D68-C68)/C68)*1)","v":1},0,0,0,0,7695340.970565537]
[null,{"$f":"IF(dms_Jurisdiction=\"Vic\",\"Non-energy efficient\", \"\")","v":""},null,{"$f":"SUM(G69:J69)","v":0},{"$f":"IF(C69=0,1,((D69-C69)/C69)*1)","v":1}]
[null,"Alternative Control Services"]
[null,"Connection services",0,{"$f":"SUM(G71:J71)","v":0},{"$f":"IF(C71=0,1,((D71-C71)/C71)*1)","v":1},0,0,0,0,0]
[null,"Metering services",0,4293216.1660345839,{"$f":"IF(C72=0,1,((D72-C72)/C72)*1)","v":1},0,0,0,0,4293216.1660345839]
[null,"Ancillary network services",0,0,{"$f":"IF(C73=0,1,((D73-C73)/C73)*1)","v":1},0,0,0,0,0]
[null,"Negotiated Services"]
[null,"Negotiated services",0,{"$f":"SUM(G75:J75)","v":0},{"$f":"IF(C75=0,1,((D75-C75)/C75)*1)","v":1},0,0,0,0,0]
[null,"Total",{"$f":"SUM(C68:C69,C71:C73,C75)","v":0},{"$f":"SUM(D68:D69,D71:D73,D75)","v":11988557.136600122},{"$f":"IF(C76=0,1,((C76-#REF!)/#REF!)*1)","v":1},null,{"$f":"SUM(G68:G69,G71:G73,G75)","v":0},{"$f":"SUM(H68:H69,H71:H73,H75)","v":0},{"$f":"SUM(I68:I69,I71:I73,I75)","v":0},{"$f":"SUM(J68:J69,J71:J73,J75)","v":11988557.136600122}]
[]
[]
[]
[null,"8.2.4 - CAPEX BY ASSET CLASS"]
[]
[null,{"$f":"CONCATENATE(dms_TradingName, \" to enter in Table 8.2.4 each Asset Class specified in its current determination as listed in the AER's final decision in its Roll Forward Model and Post-tax Revenue Model and enter information against that Asset Class.\")","v":"Endeavour Energy to enter in Table 8.2.4 each Asset Class specified in its current determination as listed in the AER's final decision in its Roll Forward Model and Post-tax Revenue Model and enter information against that Asset Class."}]
[]
[null,"Asset class","CPI adjusted Forecast","Actual ","Difference","Movements in provisions \nallocated to \nas-incurred capex"]
[]
[null,null,"$0's, nominal",null," (%)","$0's, nominal"]
[null,"Sub-transmission lines and cables",39246812.062106237,32298911.169969618,{"$f":"IF(C87=0,1,((D87-C87)/C87)*1)","v":-0.17703096193244669},-364700.99035125988]
[null,"Distribution lines and cables",107707102.89222145,50225262.047607481,{"$f":"IF(C88=0,1,((D88-C88)/C88)*1)","v":-0.5336866306963427},-567115.17961152445]
[null,"Substations",96506208.216720611,43178571.24185776,-0.5525824499819415,-487547.94274610729]
[null,"Transformers",6472886.585026104,15490449.824837647,1.3931285712115065,-174909.37581070486]
[null,"Low Voltage lines and cables",17023425.716693789,32522115.986049131,0.91043310126214871,-367221.29256971524]
[null,"Customer metering and Load control",536925.53522913461,1752128.4290250009,2.2632615028772562,-19784.040704199873]
[null,"Communication",4971149.267462153,6819142.8956929343,0.37174374149787098,-76997.894892452197]
[null,"Land",3861000.3708005431,293113.62818489375,-0.92408350167443287,-3309.6728840776664]
[null,"Easements",0,136205.01641023558,1,-1537.9498124323068]
[null,"Equity raising costs",0,0,1,0]
[null,"Emergency Spares (Major Plant, Excludes Inventory)",2142121.2011471498,287747.04224210704,-0.86567191338752791,-3249.0764386482865]
[null,"Information & Communication Technology",17819287.377025068,8428605.0272217337,-0.5269953927512846,-95171.028661962948]
[null,"Furniture, fittings, plant and equipment",3405070.7087851702,1414270.5074110045,-0.58465752157153439,-15969.14063025541]
[null,"Motor Vehicles",5454194.8601517351,2623676.9864731585,-0.51896163343159907,-29625.072817260236]
[null,"Buildings",4129604.6798291695,3484646.6916547865,-0.15617911112040467,-39346.654529095606]
[null,"Land (non-system)",0,6950.0000000000036,1,-78.475459113863408]
[null,"Other non system assets",0,0,1,0]
[null,null,null,null,1]
[null,null,null,null,1]
[null,null,null,null,1]
[null,null,null,null,1]
[null,null,null,null,1]
[null,null,null,null,1]
[null,null,null,null,1]
[null,null,null,null,1]
[null,null,null,null,1]
[null,null,null,null,1]
[null,null,null,null,1]
[null,null,null,null,1]
[null,null,null,null,1]
[null,null,null,null,{"$f":"IF(C117=0,1,((D117-C117)/C117)*1)","v":1}]
[null,null,null,null,1]
[null,null,null,null,1]
[null,null,null,null,1]
[null,null,null,null,1]
[null,null,null,null,1]
[null,null,null,null,1]
[null,null,null,null,1]
[null,null,null,null,1]
[null,null,null,null,1]
[null,null,null,null,1]
[null,null,null,null,1]
[null,null,null,null,1]
[null,null,null,null,1]
[null,null,null,null,1]
[null,null,null,null,1]
[null,null,null,null,1]
[null,null,null,null,1]
[null,null,null,null,1]
[null,null,null,null,1]
[null,"Total",{"$f":"SUM(C87:C136)","v":309275789.47319835},{"$f":"SUM(D87:D136)","v":198961796.49463755},-0.35668486423222129,{"$f":"SUM(F87:F136)","v":-2246563.7879188103}]
[]
[]
[null,"8.2.5 - CAPITAL CONTRIBUTIONS BY ASSET CLASS"]
[null,"Asset class","CPI Adjusted Forecast","Actual","Difference"]
[]
[null,null,"$0's, nominal",null," (%)"]
[null,{"$f":"IF(ISBLANK(B87),\"\",B87)","v":"Sub-transmission lines and cables"},0,20667415.357999999,{"$f":"IF(C144=0,1,((D144-C144)/C144)*1)","v":1}]
[null,"Distribution lines and cables",0,42679466.84700001,{"$f":"IF(C145=0,1,((D145-C145)/C145)*1)","v":1}]
[null,"Substations",0,29027793.000000007,1]
[null,"Transformers",0,1091422.9300000002,1]
[null,"Low Voltage lines and cables",0,67389618.546999961,1]
[null,"Customer metering and Load control",0,0,1]
[null,"Communication",0,0,1]
[null,"Land",0,3280750,1]
[null,"Easements",0,0,1]
[null,"Equity raising costs",0,0,1]
[null,"Emergency Spares (Major Plant, Excludes Inventory)",0,0,1]
[null,"Information & Communication Technology",0,0,1]
[null,"Furniture, fittings, plant and equipment",0,0,1]
[null,"Motor Vehicles",0,0,1]
[null,"Buildings",0,0,1]
[null,"Land (non-system)",0,0,1]
[null,"Other non system assets",0,0,1]
[null,"",null,null,1]
[null,"",null,null,1]
[null,"",null,null,1]
[null,"",null,null,1]
[null,"",null,null,1]
[null,"",null,null,1]
[null,"",null,null,1]
[null,"",null,null,1]
[null,"",null,null,1]
[null,"",null,null,1]
[null,"",null,null,1]
[null,"",null,null,1]
[null,"",null,null,{"$f":"IF(C173=0,1,((D173-C173)/C173)*1)","v":1}]
[null,"",null,null,1]
[null,"",null,null,1]
[null,{"$f":"IF(ISBLANK(B119),\"\",B119)","v":""},null,null,1]
[null,"",null,null,1]
[null,"",null,null,1]
[null,"",null,null,1]
[null,"",null,null,1]
[null,"",null,null,1]
[null,"",null,null,1]
[null,"",null,null,{"$f":"IF(C183=0,1,((D183-C183)/C183)*1)","v":1}]
[null,"",null,null,1]
[null,"",null,null,1]
[null,"",null,null,1]
[null,"",null,null,1]
[null,"",null,null,1]
[null,"",null,null,1]
[null,"",null,null,1]
[null,"",null,null,1]
[null,"",null,null,1]
[null,"",null,null,1]
[null,"Total",{"$f":"SUM(C183:C193)","v":0},{"$f":"SUM(D183:D193)","v":0},1]
[]
[]
[null,"8.2.6 - DISPOSALS BY ASSET CLASS"]
[null,"Asset class","CPI Adjusted Forecast","Actual","Difference"]
[]
[null,null,"$0's, nominal",null," (%)"]
[null,{"$f":"IF(ISBLANK(B87),\"\",B87)","v":"Sub-transmission lines and cables"},null,0,{"$f":"IF(C201=0,1,((D201-C201)/C201)*1)","v":1}]
[null,"Distribution lines and cables",null,0,{"$f":"IF(C202=0,1,((D202-C202)/C202)*1)","v":1}]
[null,"Substations",null,0,1]
[null,"Transformers",null,1505172.08,1]
[null,"Low Voltage lines and cables",null,0,1]
[null,"Customer metering and Load control",null,0,1]
[null,"Communication",null,0,1]
[null,"Land",null,5508511.4000000004,1]
[null,"Easements",null,0,1]
[null,"Equity raising costs",null,1,1]
[null,"Emergency Spares (Major Plant, Excludes Inventory)",null,0,1]
[null,"Information & Communication Technology",null,0,1]
[null,"Furniture, fittings, plant and equipment",null,1130947.6884208054,1]
[null,"Motor Vehicles",null,2867320.42,1]
[null,"Buildings",null,0,1]
[null,"Land (non-system)",null,null,1]
[null,"Other non system assets",null,null,1]
[null,"",null,null,1]
[null,"",null,null,1]
[null,"",null,null,1]
[null,"",null,null,1]
[null,"",null,null,1]
[null,"",null,null,1]
[null,"",null,null,1]
[null,"",null,null,1]
[null,"",null,null,1]
[null,"",null,null,1]
[null,"",null,null,1]
[null,"",null,null,1]
[null,"",null,null,1]
[null,"",null,null,{"$f":"IF(C231=0,1,((D231-C231)/C231)*1)","v":1}]
[null,"",null,null,1]
[null,{"$f":"IF(ISBLANK(B119),\"\",B119)","v":""},null,null,1]
[null,"",null,null,1]
[null,"",null,null,1]
[null,"",null,null,1]
[null,"",null,null,1]
[null,"",null,null,1]
[null,"",null,null,1]
[null,"",null,null,1]
[null,"",null,null,1]
[null,"",null,null,1]
[null,"",null,null,1]
[null,"",null,null,1]
[null,"",null,null,1]
[null,"",null,null,1]
[null,"",null,null,1]
[null,"",null,null,1]
[null,"",null,null,1]
[null,"",null,null,1]
[null,"Total",{"$f":"SUM(C201:C250)","v":0},{"$f":"SUM(D201:D250)","v":11011952.588420805},1]

{"sheet":" 8.4 Opex","index":21,"n_rows":144,"n_cols":14,"rows_kept":144,"cut":false,"hidden":false,"merged":[[16,4,18,4],[16,5,16,7],[6,1,6,4],[7,1,7,4],[12,1,12,5],[13,1,13,5],[14,1,14,5],[16,8,16,12],[16,13,18,13],[17,5,18,5],[17,6,18,6],[17,7,18,7],[17,8,17,9],[17,10,17,12],[78,10,78,12],[80,2,80,4],[80,8,80,13],[19,2,19,6],[19,8,19,13],[75,1,75,4],[77,1,80,1],[77,2,79,2],[77,3,79,3],[77,4,79,4],[77,5,77,7],[77,8,77,12],[77,13,79,13],[16,1,19,1],[16,2,18,2],[16,3,18,3],[143,2,143,7],[78,5,79,5],[78,6,79,6],[78,7,79,7],[78,8,78,9],[137,1,137,4],[139,2,139,7],[140,2,140,7],[141,2,141,7],[142,2,142,7]]}
[null,{"$f":"(LOOKUP(dms_Model,dms_Model_List,dms_Worksheet_List))","v":"REGULATORY REPORTING STATEMENT"}]
[null,{"$f":"dms_TradingName","v":"Endeavour Energy"}]
[null,{"$f":"CONCATENATE(\"Annual Reporting RIN Response \",CRY)","v":"Annual Reporting RIN Response 2016-17"}]
[null,"8.4 OPEX"]
[]
[null,"Instructions"]
[null,{"$f":"CONCATENATE(\"Forecast expenditure is to be taken from \",dms_TradingName,\"'s \",dms_DeterminationRef,\".\")","v":"Forecast expenditure is to be taken from Endeavour Energy's 2014-19 Distribution Determination."}]
[null,"If allocating based on assumptions then provide method in Basis of Preparation.  \n\nAll adjustments must be explained in Basis of Preparation with supporting documentation attached. "]
[]
[null,"8.4.1 - OPERATING & MAINTENANCE EXPENDITURE - BY PURPOSE"]
[]
[]
[null,{"$f":"CONCATENATE(dms_TradingName,\" is to list the operating expenditure categories identified in \", dms_TradingName,\"'s regulatory proposal at table 3.2.1.1 current opex categories and cost allocations.\")","v":"Endeavour Energy is to list the operating expenditure categories identified in Endeavour Energy's regulatory proposal at table 3.2.1.1 current opex categories and cost allocations."}]
[null,{"$f":"CONCATENATE(dms_TradingName, \" must specify any expenditure category where the expense is more than 5 per cent of the total standard control services operating expenditure.\")","v":"Endeavour Energy must specify any expenditure category where the expense is more than 5 per cent of the total standard control services operating expenditure."}]
[null,"Reported operating expenditure must INCLUDE any profit margins or management fees paid directly or indirectly to related party contractors (not including actual incurred expenditure of the related party contractor) for the regulatory reporting period.  "]
[]
[null,"Opex category","Audited Statutory Accounts","Adjustments","Distribution business","Standard Control Services",null,null,"Alternative Control Services",null,null,null,null,"Negotiated Services"]
[null,null,null,null,null,"CPI Adjusted Forecast","Actual","Difference","Public Lighting",null,"Other"]
[null,null,null,null,null,null,null,null,{"$f":"IF(dms_Jurisdiction=\"Vic\",\"Energy efficient\",\"\")","v":""},{"$f":"IF(dms_Jurisdiction=\"Vic\",\"Non-energy efficient\",\"\")","v":""},"Connection services","Metering services","Ancillary network services"]
[null,null,"$0's, nominal",null,null,null,null,"%","$0's, nominal"]
[null,"Vegetation management",33815272.690000005,2147711.5,35962984.190000005,30256072.705137353,35962984.190000005,{"$f":"IF(F21=0,1,((G21-F21)/F21)*1)","v":0.18862036525624962},0,null,0,0,0]
[null,"Maintenance",61920831.824845172,3606446.4650843963,65527278.289929569,55128853.757947199,65527278.289929569,0.18862036525624962,0,null,0,0,0]
[null,"Emergency response",19568529.103511441,419191.05749707669,19987720.161008518,16815899.125789799,19987720.161008518,0.18862036525624956,0,null,0,0,0]
[null,"Non-network",68710327.420145825,3091320.6835299432,71801648.103675768,60407553.33028166,71801648.103675768,0.18862036525624967,0,null,0,0,0]
[null,"network overheads",62494363.100999519,4349832.4901818857,66844195.591181405,56236791.447512135,66844195.591181405,0.18862036525624956,0,null,0,0,0]
[null,"corporate overheads",94323584.753350452,22437339.618735746,116760924.3720862,98232310.151369661,116760924.3720862,0.18862036525624956,0,null,0,0,0]
[null,"Metering",17888717.910813861,1591029.3181828931,19479747.228996754,0,0,1,0,null,0,19479747.228996754,0]
[null,"Public Lighting",14424219.275922235,2490154.3824733384,16914373.658395573,0,0,1,16914373.658395573,null,0,0,0]
[null,"Fee and quoted",25991343.145871378,3918172.797690656,29909515.943562035,0,0,1,0,null,0,0,29909515.943562035]
[null,"Balancing Item",-19949124.905460358,-51852523.19821541,-71801648.103675768,-60407553.33028166,-71801648.103675768,0.18862036525624967,0,null,0,0,0]
[null,null,null,null,null,null,null,1]
[null,null,null,null,null,null,null,1]
[null,null,null,null,null,null,null,1]
[null,null,null,null,null,null,null,1]
[null,null,null,null,null,null,null,1]
[null,null,null,null,null,null,null,1]
[null,null,null,null,null,null,null,1]
[null,null,null,null,null,null,null,1]
[null,null,null,null,null,null,null,1]
[null,null,null,null,null,null,null,1]
[null,null,null,null,null,null,null,1]
[null,null,null,null,null,null,null,1]
[null,null,null,null,null,null,null,1]
[null,null,null,null,null,null,null,1]
[null,null,null,null,null,null,null,1]
[null,null,null,null,null,null,null,1]
[null,null,null,null,null,null,null,1]
[null,null,null,null,null,null,null,1]
[null,null,null,null,null,null,null,1]
[null,null,null,null,null,null,null,1]
[null,null,null,null,null,null,null,1]
[null,null,null,null,null,null,null,1]
[null,null,null,null,null,null,null,1]
[null,null,null,null,null,null,null,1]
[null,null,null,null,null,null,null,1]
[null,null,null,null,null,null,null,1]
[null,null,null,null,null,null,null,1]
[null,null,null,null,null,null,null,1]
[null,null,null,null,null,null,null,1]
[null,null,null,null,null,null,null,1]
[null,null,null,null,null,null,null,1]
[null,null,null,null,null,null,null,1]
[null,null,null,null,null,null,null,1]
[null,null,null,null,null,null,null,1]
[null,null,null,null,null,null,null,1]
[null,null,null,null,null,null,null,1]
[null,null,null,null,null,null,null,1]
[null,null,null,null,null,null,null,1]
[null,null,null,null,null,null,null,1]
[null,null,null,null,null,null,null,1]
[null,"Total",{"$f":"SUM(C21:C70)","v":379188064.31999958},-7801324.8848394752,371386739.43516004,256669927.18775612,305083102.60420567,0.18862036525624959,{"$f":"SUM(I21:I70)","v":16914373.658395573},0,0,19479747.228996754,29909515.943562035,0]
[]
[]
[null,"8.4.2 - OPERATING & MAINTENANCE EXPENDITURE - BY PURPOSE - MARGINS ONLY"]
[]
[null,"\"Related party margin expenditure' must COMPRISE ONLY profit margins or management fees paid directly or indirectly to related party contractors (for expenditure that is not an actual incurred expenditure of the related party contractor) for the regulatory reporting period."]
[]
[null,"Opex category","Audited Statutory Accounts","Adjustments","Distribution business","Standard Control Services",null,null,"Alternative Control Services",null,null,null,null,"Negotiated Services"]
[null,null,null,null,null,"CPI Adjusted Forecast","Actual","Difference","Public Lighting",null,"Other"]
[null,null,null,null,null,null,null,null,{"$f":"IF(dms_Jurisdiction=\"Vic\",\"Energy efficient\",\"\")","v":""},{"$f":"IF(dms_Jurisdiction=\"Vic\",\"Non-energy efficient\",\"\")","v":""},"Connection services","Metering services","Ancillary network services"]
[null,null,"$0's, nominal",null,null,null,"$0's, nominal","per cent","$0's, nominal"]
[null,{"$f":"IF(ISBLANK(B21),\"\",B21)","v":"Vegetation management"},null,null,null,null,null,{"$f":"IF(F82=0,1,((G82-F82)/F82)*1)","v":1}]
[null,"Maintenance",null,null,null,null,null,1]
[null,"Emergency response",null,null,null,null,null,1]
[null,"Non-network",null,null,null,null,null,1]
[null,"network overheads",null,null,null,null,null,1]
[null,"corporate overheads",null,null,null,null,null,1]
[null,"Metering",null,null,null,null,null,1]
[null,{"$f":"IF(ISBLANK(B27),\"\",B27)","v":"Metering"},null,null,null,null,null,1]
[null,"Public Lighting",null,null,null,null,null,1]
[null,"Fee and quoted",null,null,null,null,null,1]
[null,"Balancing Item",null,null,null,null,null,1]
[null,"",null,null,null,null,null,1]
[null,"",null,null,null,null,null,1]
[null,"",null,null,null,null,null,1]
[null,"",null,null,null,null,null,1]
[null,"",null,null,null,null,null,1]
[null,"",null,null,null,null,null,1]
[null,"",null,null,null,null,null,1]
[null,"",null,null,null,null,null,1]
[null,"",null,null,null,null,null,1]
[null,"",null,null,null,null,null,1]
[null,"",null,null,null,null,null,1]
[null,"",null,null,null,null,null,1]
[null,"",null,null,null,null,null,1]
[null,"",null,null,null,null,null,1]
[null,"",null,null,null,null,null,1]
[null,"",null,null,null,null,null,1]
[null,"",null,null,null,null,null,1]
[null,"",null,null,null,null,null,1]
[null,"",null,null,null,null,null,1]
[null,"",null,null,null,null,null,1]
[null,"",null,null,null,null,null,1]
[null,"",null,null,null,null,null,1]
[null,"",null,null,null,null,null,1]
[null,"",null,null,null,null,null,1]
[null,"",null,null,null,null,null,1]
[null,"",null,null,null,null,null,1]
[null,"",null,null,null,null,null,1]
[null,"",null,null,null,null,null,1]
[null,"",null,null,null,null,null,1]
[null,"",null,null,null,null,null,1]
[null,"",null,null,null,null,null,1]
[null,"",null,null,null,null,null,1]
[null,"",null,null,null,null,null,1]
[null,"",null,null,null,null,null,1]
[null,"",null,null,null,null,null,1]
[null,"",null,null,null,null,null,1]
[null,"",null,null,null,null,null,1]
[null,"",null,null,null,null,null,1]
[null,"",null,null,null,null,null,1]
[null,null,null,null,null,null,null,1]
[null,"Total",{"$f":"SUM(C82:C132)","v":0},{"$f":"SUM(D82:D132)","v":0},{"$f":"SUM(E82:E132)","v":0},0,{"$f":"SUM(G82:G132)","v":0},1,{"$f":"SUM(I82:I132)","v":0},{"$f":"SUM(J82:J132)","v":0},0,0,{"$f":"SUM(M82:M132)","v":0},{"$f":"SUM(N82:N132)","v":0}]
[]
[]
[null,"8.4.3 - OPERATING & MAINTENANCE EXPENDITURE - EXPLANATION OF MATERIAL DIFFERENCE"]
[]
[null,"Where the difference between forecast and actual expenditure shown in table 8.4.1, column I is a Material Difference please explain the main factors driving the difference."]
[]
[null,"Category","Explanation"]
[null,"Vegetation management","The increase in vegetation management costs have been driven by higher actual program compliance (preventative maintenance), resulting in a higher than forecast variance to the AER allowance. "]
[null,"Maintenance","An increase in the spend associated with maintenance and repairs across all activities, and in particular the transmission substation, distribution substation and distribution mains maintenance activities is driving the variance to the AER allowance."]
[null,"Emergency response","The increase in emergency response costs have been driven by higher than expected fault and emerency activities across the network"]
[null,"Non-network","The increase in non-network costs have been driven by higher than expected fleet, IT and property expenditure"]

{"sheet":"9.5 TUoS","index":22,"n_rows":60,"n_cols":6,"rows_kept":60,"cut":false,"hidden":false,"merged":[[5,1,5,3],[21,1,21,3],[24,2,24,5],[36,1,36,4],[25,2,25,5],[24,1,27,1],[9,1,9,4],[10,1,10,4],[11,1,11,4],[12,1,12,4],[17,1,17,4],[18,1,18,4],[13,1,13,3],[50,1,50,4],[54,1,54,4],[52,1,52,4],[55,1,55,4],[56,1,56,4],[57,1,57,4],[51,1,51,4],[19,1,19,4],[20,1,20,4],[59,1,59,4],[53,1,53,4],[48,1,48,4],[58,1,58,4],[40,1,40,4],[44,1,44,4],[45,1,45,4],[46,1,46,4],[47,1,47,4],[41,1,41,4],[42,1,42,4],[43,1,43,4]]}
[null,{"$f":"(LOOKUP(dms_Model,dms_Model_List,dms_Worksheet_List))","v":"REGULATORY REPORTING STATEMENT"}]
[null,{"$f":"dms_TradingName","v":"Endeavour Energy"}]
[null,{"$f":"CONCATENATE(\"Annual Reporting RIN Response \",CRY)","v":"Annual Reporting RIN Response 2016-17"}]
[null,"9.5 - TUoS AUDIT (t-2)"]
[]
[null,"This template collects information for annual pricing proposals from Victorian businesses only.\n"]
[]
[null,"9.5.1 - TUOS CHARGES (AEMO)"]
[null,null,null,null,null,{"$f":"CRY","v":"2016-17"}]
[]
[]
[]
[]
[null,null,null,null,"Total",{"$f":"SUM(F10:F13)","v":0}]
[]
[null,"9.5.2 - TRANSMISSION CONNECTION FEES"]
[null,null,null,null,null,{"$f":"CRY","v":"2016-17"}]
[]
[]
[]
[]
[null,null,null,null,"Total",{"$f":"SUM(F18:F21)","v":0}]
[]
[null,"9.5.3 - CROSS BOUNDARY NETWORK CHARGES"]
[null,"Distribution Business","Amount (payable)/receivable"]
[null,null,"$0's, nominal"]
[null,null,"HV crossings","Subtransmission crossings","TUoS Adjustment","Total"]
[null,null,null,null,null,{"$f":"CRY","v":"2016-17"}]
[null,null,null,null,null,{"$f":"IF((SUM(C29:E29)=0),\"\",(SUM(C29:E29)))","v":""}]
[null,null,null,null,null,{"$f":"IF((SUM(C30:E30)=0),\"\",(SUM(C30:E30)))","v":""}]
[null,null,null,null,null,""]
[null,null,null,null,null,""]
[null,null,null,null,null,""]
[null,null,null,null,null,""]
[null,null,null,null,null,""]
[null,null,null,null,null,""]
[null,"Total",null,null,null,""]
[]
[null,"9.5.4 - PAYMENTS TO EMBEDDED GENERATORS"]
[null,"9.5.4.1 - AVOIDED TRANSMISSION COSTS",null,null,null,{"$f":"CRY","v":"2016-17"}]
[]
[]
[]
[]
[]
[]
[]
[]
[null,"Total",null,null,null,{"$f":"SUM(F41:F48)","v":0}]
[null,"9.5.4.2 - AVOIDED TUoS USAGE CHARGES",null,null,null,{"$f":"CRY","v":"2016-17"}]
[]
[]
[]
[]
[]
[]
[]
[]
[null,"Total",null,null,null,{"$f":"SUM(F51:F58)","v":0}]
[null,"Total payments to embedded generators",null,null,null,{"$f":"F59+F49","v":0}]

{"sheet":"NSP amendments","index":23,"n_rows":28,"n_cols":3,"rows_kept":28,"cut":false,"hidden":false,"merged":[[30,2,30,7],[0,1,0,2],[19,1,19,4],[21,2,21,7],[22,2,22,7],[23,2,23,7],[24,2,24,7],[25,2,25,7],[26,2,26,7],[27,2,27,7],[28,2,28,7],[29,2,29,7]]}
[null,{"$f":"CONCATENATE(dms_TradingName,\" data amendments\")","v":"Endeavour Energy data amendments"}]
[null,"Amended Table","Comments"]
[null,"Business & other details","ABN number is incorrectly entered in the template and is unable to be changed due to the locked cell format .  The correct ABN number for Endeavour Energy is 11 247 365 823."]
[null,"8.4.3 - Operating & Maintenance Expenditure - Explanation of Material Difference","Due to the locked cell version of the template, there were not enough rows within this table (only four rows) to populate the full response required (six rows required).  Endeavour Energy has provided the completed table below. "]
[null,"2.11.3.1 - Opex","Please note that the error message found in cell C21 and D21 of table 2.11.3.1 are errors within the AER’s template. I have confirmed with Kaye Johnston of the AER that the total opex in table 2.11.3.1 needs to align to the opex actual in table 8.4. It does however the error message remains. "]
[null,"6.2 - Reliability and Customer Service Performance","Row 6 within the template of table 6.2 is displaying an error #REF! as the cell is not correctly reading the application of the MAIFI parameter from the template applicable to network feeders 3.6.8, row 6.  Endeavour Energy has completed this cell with a \"no\" response however it is not translating to row 6 of table 6.2 and is therefore showing table 6.2.3 with yellow cells where it should be shaded out in grey not requiring a response.  Endeavour Energy therefore confirm that the MAIFI parameter of STPIS did not apply and there is no response required for table 6.2.3."]
[null,"6.7 - STPIS Daily Performance","Row 7 within the template of table 6.7 is displaying an error #REF! as the cell is not correctly reading the application of the MAIFI parameter from the template applicable to network feeders 3.6.8, row 6.  Endeavour Energy has completed this cell with a \"no\" response however it is not translating to row 7 of table 6.7. Endeavour Energy therefore confirm that the MAIFI parameter of STPIS did not apply."]
[]
[]
[]
[]
[]
[]
[]
[]
[]
[]
[null,"8.4.3 - OPERATING & MAINTENANCE EXPENDITURE - EXPLANATION OF MATERIAL DIFFERENCE"]
[]
[null,"Where the difference between forecast and actual expenditure shown in table 8.4.1, column I is a Material Difference please explain the main factors driving the difference."]
[]
[null,"Category","Explanation"]
[null,"Vegetation management","The increase in vegetation management costs have been driven by higher actual program compliance (preventative maintenance), resulting in a higher than forecast variance to the AER allowance. "]
[null,"Maintenance","An increase in the spend associated with maintenance and repairs across all activities, and in particular the transmission substation, distribution substation and distribution mains maintenance activities is driving the variance to the AER allowance."]
[null,"Emergency response","The increase in emergency response costs have been driven by higher than expected fault and emerency activities across the network"]
[null,"Non-network","The increase in non-network costs have been driven by higher than expected fleet, IT and property expenditure"]
[null,"network overheads","Higher than expected overhead costs across all activities primarily driven by labour expenditure"]
[null,"corporate overheads","Higher than expected overhead costs across all activities primarily driven by labour expenditure"]