{"text_format":"1","workbook":"xlsx","n_sheets":11,"sheets":["Index","Input|General","Input|Inflation","Input|Reported opex","Input|Rate of change","Input|Step changes","Calc|Opex forecast","Output|Models","Output|RIN","Lookup|Tables","Check|List"],"not_rendered":{"charts":0,"images":0,"macros":0,"external_links":1,"defined_names":8,"comments":1,"pivot_tables":0},"unopened":[],"bounds":{"document_bytes":16777216,"sheet_cells":100000,"rows_first":2000,"rows_last":500,"rows_between":2000,"halvings":0,"cell_chars":16384,"cell_head_chars":4096},"cells_cut":0,"cells_raw":0,"read":"whole","date_system":"1900"}

{"sheet":"Index","index":0,"n_rows":19,"n_cols":4,"rows_kept":19,"cut":false,"hidden":false,"merged":[]}
[null,"AER opex model"]
[null,"Index"]
[]
[null,"Model index"]
[]
[null,null,"Sheet Name","Sheet Description"]
[null,null,"Input | General","Inputs NSP name, regulatory years for the prior and forecast regulatory control period etc."]
[null,null,"Input | Inflation","Inputs inflation data."]
[null,null,"Input | Reported opex","Inputs the reported operating expenditure (opex) from the prior regulatory control period."]
[null,null,"Input | Rate of change","Inputs the cost escalation weights, cost escalation forecast, and inflation actuals and forecast"]
{"$rows_left_out":10}
{"sheet":"Input|General","index":1,"n_rows":16,"n_cols":22,"rows_kept":16,"cut":false,"hidden":false,"merged":[]}
[null,{"$f":"Index!$B$1","v":"AER opex model"},null,null,null,null,null,null,null,"Back to Index",null,"Key:","Input","External Link","Internal Link",null,null,"Worksheet check:",{"$f":"IF(COUNTA($S$5:$S$15)=COUNTIF($S5:$S15,\"OK\"),\"OK\",\"Check\")","v":"OK"},null,"Overall Check:",{"$f":"'Check|List'!$S$1","v":"Ok"}]
[null,{"$f":"Index!$C$7","v":"Input | General"}]
[]
[null,"Input | General inputs"]
[]
[null,null,"Inputs","Source",null,null,"Value"]
[null,null,"NSP name","Evoenergy",null,null,"Evonergy Gas Network",null,null,null,null,null,null,null,null,null,null,null,{"$f":"IF(COUNTBLANK($G7),\"Check\",\"Ok\")","v":"Ok"}]
[null,null,"Decision stage","Evoenergy",null,null,"initial",null,null,null,null,null,null,null,null,null,null,null,"Ok"]
[null,null,"Year ending","Evoenergy",null,null,"2000-06-01",null,null,null,null,null,null,null,null,null,null,null,"Ok"]
[null,null,"Previous regulatory control period, first year","Evoenergy",null,null,2017,null,null,null,null,null,null,null,null,null,null,null,"Ok"]
{"$rows_left_out":7}
{"sheet":"Input|Inflation","index":2,"n_rows":64,"n_cols":23,"rows_kept":64,"cut":false,"hidden":false,"merged":[]}
[null,{"$f":"Index!$B$1","v":"AER opex model"},null,null,null,null,null,null,null,null,"Back to Index",null,"Key:","Input","External Link","Internal Link",null,null,"Worksheet check:",{"$f":"IF(COUNTA($T$5:$T$63)=COUNTIF($T5:$T63,\"OK\"),\"OK\",\"Check\")","v":"OK"},null,"Overall Check:",{"$f":"'Check|List'!$S$1","v":"Ok"}]
[null,{"$f":"Index!$C$7","v":"Input | General"}]
[]
[null,"Input | General inputs"]
[]
[null,null,null,"Index value, new base","Percentage Change from Corresponding Quarter of Previous Year","Index value, new base","Percentage Change from Corresponding Quarter of Previous Year"]
[null,null,"Source","ABS","Calculated","ABS","Calculated"]
[null,null,"Unit","index","Percent","index","Percent"]
[null,null,"2007-03-31",155.6,null,null,null,null,null,null,null,null,null,null,null,null,null,null,null,{"$f":"IF(C9>EOMONTH(DATE('Input|General'!$G$12,MONTH('Input|General'!$G$9),1),0),\"Ok\",IF(ISBLANK($D9),\"Check\",\"Ok\"))","v":"Ok"}]
[null,null,"2007-06-30",157.5,null,null,null,null,null,null,null,null,null,null,null,null,null,null,null,{"$f":"IF(C10>EOMONTH(DATE('Input|General'!$G$12,MONTH('Input|General'!$G$9),1),0),\"Ok\",IF(ISBLANK($D10),\"Check\",\"Ok\"))","v":"Ok"}]
{"$rows_left_out":55}
{"sheet":"Input|Reported opex","index":3,"n_rows":69,"n_cols":22,"rows_kept":69,"cut":false,"hidden":false,"merged":[]}
[null,null,{"$f":"Index!$B$1","v":"AER opex model"},null,null,null,null,null,null,"Back to Index",null,"Key:","Input","External Link","Internal Link",null,null,"Worksheet check:",{"$f":"IF(COUNTA($W$8:$W$69)=COUNTIF($W$8:$W$69,\"OK\"),\"OK\",\"Check\")","v":"OK"},null,"Overall Check:",{"$f":"'Check|List'!$S$1","v":"Ok"}]
[null,null,{"$f":"Index!$C$9","v":"Input | Reported opex"}]
[null,null,null,null,null,null,null,null,null,"Year ending"]
[null,null,null,"Source","Unit","Basis",null,null,null,{"$f":"DATE(PPFirstYear,MONTH('Input|General'!$G$9),1)","v":"2017-06-01"},{"$f":"DATE(PPFirstYear+1,MONTH('Input|General'!$G$9),1)","v":"2018-06-01"},{"$f":"DATE(PPFirstYear+2,MONTH('Input|General'!$G$9),1)","v":"2019-06-01"},{"$f":"DATE(PPFirstYear+3,MONTH('Input|General'!$G$9),1)","v":"2020-06-01"},{"$f":"DATE(PPFirstYear+4,MONTH('Input|General'!$G$9),1)","v":"2021-06-01"},{"$f":"DATE(PPFirstYear+5,MONTH('Input|General'!$G$9),1)","v":"2022-06-01"},{"$f":"DATE(PPFirstYear+6,MONTH('Input|General'!$G$9),1)","v":"2023-06-01"},{"$f":"DATE(PPFirstYear+7,MONTH('Input|General'!$G$9),1)","v":"2024-06-01"},{"$f":"DATE(PPFirstYear+8,MONTH('Input|General'!$G$9),1)","v":"2025-06-01"},{"$f":"DATE(PPFirstYear+9,MONTH('Input|General'!$G$9),1)","v":"2026-06-01"}]
[]
[]
[]
[null,"Input | Opex allowances"]
[]
[null,null,"Cost category","Source","Unit","Basis",null,null,null,{"$f":"IF(YEAR(J$4)<=PPLastYear,J$4,\"\")","v":"2017-06-01"},"2018-06-01","2019-06-01","2020-06-01","2021-06-01","","","","","","Notes"]
{"$rows_left_out":60}
{"sheet":"Input|Rate of change","index":4,"n_rows":110,"n_cols":23,"rows_kept":110,"cut":false,"hidden":false,"merged":[[2,10,2,12],[2,14,2,19]]}
[null,{"$f":"Index!$B$1","v":"AER opex model"},null,null,null,null,null,null,null,null,"Back to Index",null,"Key:","Input","External Link","Internal Link",null,null,"Worksheet check:",{"$f":"IF(COUNTIF(W5:W109,\"Check\")=0,\"Ok\",\"Check\")","v":"Ok"},null,"Overall Check:",{"$f":"'Check|List'!$S$1","v":"Ok"}]
[null,{"$f":"Index!$C$10","v":"Input | Rate of change"}]
[null,null,null,null,null,null,null,null,null,"Year ending"]
[null,null,null,"Source","Unit","Basis",null,null,{"$f":"DATE(PPFirstYear-2,MONTH('Input|General'!$G$9),1)","v":"2015-06-01"},{"$f":"DATE(PPFirstYear-1,MONTH('Input|General'!$G$9),1)","v":"2016-06-01"},{"$f":"DATE(PPFirstYear,MONTH('Input|General'!$G$9),1)","v":"2017-06-01"},{"$f":"DATE(PPFirstYear+1,MONTH('Input|General'!$G$9),1)","v":"2018-06-01"},{"$f":"DATE(PPFirstYear+2,MONTH('Input|General'!$G$9),1)","v":"2019-06-01"},{"$f":"DATE(PPFirstYear+3,MONTH('Input|General'!$G$9),1)","v":"2020-06-01"},{"$f":"DATE(PPFirstYear+4,MONTH('Input|General'!$G$9),1)","v":"2021-06-01"},{"$f":"DATE(PPFirstYear+5,MONTH('Input|General'!$G$9),1)","v":"2022-06-01"},{"$f":"DATE(PPFirstYear+6,MONTH('Input|General'!$G$9),1)","v":"2023-06-01"},{"$f":"DATE(PPFirstYear+7,MONTH('Input|General'!$G$9),1)","v":"2024-06-01"},{"$f":"DATE(PPFirstYear+8,MONTH('Input|General'!$G$9),1)","v":"2025-06-01"},{"$f":"DATE(PPFirstYear+9,MONTH('Input|General'!$G$9),1)","v":"2026-06-01"}]
[]
[]
[]
[null,"Input | Inflation"]
[]
[null,null,"Inflation",null,null,null,null,null,{"$f":"IF(YEAR(I$4)<=PPLastYear,I$4,\"\")","v":"2015-06-01"},{"$f":"IF(YEAR(J$4)<=PPLastYear,J$4,\"\")","v":"2016-06-01"},{"$f":"IF(YEAR(K$4)<=PPLastYear,K$4,\"\")","v":"2017-06-01"},"2018-06-01","2019-06-01","2020-06-01","2021-06-01","","","","",""]
{"$rows_left_out":101}
{"sheet":"Input|Step changes","index":5,"n_rows":44,"n_cols":23,"rows_kept":44,"cut":false,"hidden":false,"merged":[[2,13,2,18]]}
[null,{"$f":"Index!$B$1","v":"AER opex model"},null,null,null,null,null,null,null,"Back to Index",null,"Key:","Input","External Link","Internal Link",null,null,"Worksheet check:",{"$f":"IF(COUNTA($W$8:$W$44)=COUNTIF($W$8:$W$44,\"OK\"),\"OK\",\"Check\")","v":"OK"},null,"Overall Check:",{"$f":"'Check|List'!$S$1","v":"Ok"}]
[null,{"$f":"Index!$C$11","v":"Input | Step changes"}]
[null,null,null,null,null,null,null,null,null,"Year ending"]
[null,null,null,"Source","Unit","Basis",null,null,null,{"$f":"DATE(PPFirstYear,MONTH('Input|General'!$G$9),1)","v":"2017-06-01"},{"$f":"DATE(PPFirstYear+1,MONTH('Input|General'!$G$9),1)","v":"2018-06-01"},{"$f":"DATE(PPFirstYear+2,MONTH('Input|General'!$G$9),1)","v":"2019-06-01"},{"$f":"DATE(PPFirstYear+3,MONTH('Input|General'!$G$9),1)","v":"2020-06-01"},{"$f":"DATE(PPFirstYear+4,MONTH('Input|General'!$G$9),1)","v":"2021-06-01"},{"$f":"DATE(PPFirstYear+5,MONTH('Input|General'!$G$9),1)","v":"2022-06-01"},{"$f":"DATE(PPFirstYear+6,MONTH('Input|General'!$G$9),1)","v":"2023-06-01"},{"$f":"DATE(PPFirstYear+7,MONTH('Input|General'!$G$9),1)","v":"2024-06-01"},{"$f":"DATE(PPFirstYear+8,MONTH('Input|General'!$G$9),1)","v":"2025-06-01"},{"$f":"DATE(PPFirstYear+9,MONTH('Input|General'!$G$9),1)","v":"2026-06-01"}]
[]
[]
[]
[null,"Input |Step changes"]
[]
[null,null,"Step change","Source","Unit","Basis",null,null,null,{"$f":"IF(YEAR(J$4)>=FPFirstYear,IF(YEAR(J$4)<=FPLastYear,J$4,\"\"),\"\")","v":""},"","","","","2022-06-01","2023-06-01","2024-06-01","2025-06-01","2026-06-01"]
{"$rows_left_out":35}
{"sheet":"Calc|Opex forecast","index":6,"n_rows":106,"n_cols":22,"rows_kept":106,"cut":false,"hidden":false,"merged":[[2,13,2,18]]}
[null,{"$f":"Index!$B$1","v":"AER opex model"},null,null,null,null,null,null,null,"Back to Index",null,"Key:","Input","External Link","Internal Link",null,null,"Worksheet check:",{"$f":"IF(COUNTA($W$8:$W$106)=COUNTIF($W$8:$W$106,\"OK\"),\"OK\",\"Check\")","v":"OK"},null,"Overall Check:",{"$f":"'Check|List'!$S$1","v":"Ok"}]
[null,{"$f":"Index!$C$13","v":"Calc | Opex Forecast"}]
[null,null,null,null,null,null,null,null,null,"Year ending"]
[null,null,null,"Source","Unit","Basis",null,null,null,{"$f":"DATE(PPFirstYear,MONTH('Input|General'!$G$9),1)","v":"2017-06-01"},{"$f":"DATE(PPFirstYear+1,MONTH('Input|General'!$G$9),1)","v":"2018-06-01"},{"$f":"DATE(PPFirstYear+2,MONTH('Input|General'!$G$9),1)","v":"2019-06-01"},{"$f":"DATE(PPFirstYear+3,MONTH('Input|General'!$G$9),1)","v":"2020-06-01"},{"$f":"DATE(PPFirstYear+4,MONTH('Input|General'!$G$9),1)","v":"2021-06-01"},{"$f":"DATE(PPFirstYear+5,MONTH('Input|General'!$G$9),1)","v":"2022-06-01"},{"$f":"DATE(PPFirstYear+6,MONTH('Input|General'!$G$9),1)","v":"2023-06-01"},{"$f":"DATE(PPFirstYear+7,MONTH('Input|General'!$G$9),1)","v":"2024-06-01"},{"$f":"DATE(PPFirstYear+8,MONTH('Input|General'!$G$9),1)","v":"2025-06-01"},{"$f":"DATE(PPFirstYear+9,MONTH('Input|General'!$G$9),1)","v":"2026-06-01"}]
[]
[]
[]
[null,"Calc | Estimated final year expenditure",null,null,"$millions",{"$f":"DATE(PPLastYear,MONTH('Input|General'!$G$9),1)","v":"2021-06-01"}]
[]
[null,null,null,"Source","Unit","Basis",null,null,null,{"$f":"IF(YEAR(J$4)<=PPLastYear,J$4,\"\")","v":"2017-06-01"},"2018-06-01","2019-06-01","2020-06-01","2021-06-01","","","","",""]
{"$rows_left_out":97}
{"sheet":"Output|Models","index":7,"n_rows":22,"n_cols":23,"rows_kept":22,"cut":false,"hidden":false,"merged":[[2,13,2,18]]}
[null,{"$f":"Index!$B$1","v":"AER opex model"},null,null,null,null,null,null,null,"Back to Index",null,"Key:","Input","External Link","Internal Link",null,null,"Worksheet check:",{"$f":"IF(COUNTA($W$8:$W$22)=COUNTIF($W$8:$W$22,\"OK\"),\"OK\",\"Check\")","v":"OK"},null,"Overall Check:",{"$f":"'Check|List'!$S$1","v":"Ok"}]
[null,{"$f":"Index!$C$14","v":"Output | Models"}]
[null,null,null,null,null,null,null,null,null,"Year ending"]
[null,null,null,"Source","Unit","Basis",null,null,null,{"$f":"DATE(PPFirstYear,MONTH('Input|General'!$G$9),1)","v":"2017-06-01"},{"$f":"DATE(PPFirstYear+1,MONTH('Input|General'!$G$9),1)","v":"2018-06-01"},{"$f":"DATE(PPFirstYear+2,MONTH('Input|General'!$G$9),1)","v":"2019-06-01"},{"$f":"DATE(PPFirstYear+3,MONTH('Input|General'!$G$9),1)","v":"2020-06-01"},{"$f":"DATE(PPFirstYear+4,MONTH('Input|General'!$G$9),1)","v":"2021-06-01"},{"$f":"DATE(PPFirstYear+5,MONTH('Input|General'!$G$9),1)","v":"2022-06-01"},{"$f":"DATE(PPFirstYear+6,MONTH('Input|General'!$G$9),1)","v":"2023-06-01"},{"$f":"DATE(PPFirstYear+7,MONTH('Input|General'!$G$9),1)","v":"2024-06-01"},{"$f":"DATE(PPFirstYear+8,MONTH('Input|General'!$G$9),1)","v":"2025-06-01"},{"$f":"DATE(PPFirstYear+9,MONTH('Input|General'!$G$9),1)","v":"2026-06-01"}]
[]
[]
[]
[null,"Inputs for Post Tax Revenue Model",null,null,"$millions",{"$f":"DATE(PPLastYear,MONTH('Input|General'!$G$9),1)","v":"2021-06-01"},null,null,null,"Note. The dollar base should be consistent with the post tax revenue model"]
[]
[]
{"$rows_left_out":13}
{"sheet":"Output|RIN","index":8,"n_rows":47,"n_cols":23,"rows_kept":47,"cut":false,"hidden":false,"merged":[[2,13,2,18]]}
[null,{"$f":"Index!$B$1","v":"AER opex model"},null,null,null,null,null,null,null,"Back to Index",null,"Key:","Input","External Link","Internal Link","Empty cell",null,"Worksheet check:",{"$f":"IF(COUNTA($W$4:$W$47)=COUNTIF($W$4:$W$47,\"Ok\"),\"Ok\",\"Check\")","v":"Ok"},null,"Overall Check:",{"$f":"'Check|List'!$S$1","v":"Ok"}]
[null,{"$f":"Index!$C$15","v":"Output | RIN"}]
[null,null,null,null,null,null,null,null,null,"Year ending"]
[null,null,null,"Source","Unit","Basis",null,null,null,{"$f":"DATE(PPFirstYear,MONTH('Input|General'!$G$9),1)","v":"2017-06-01"},{"$f":"DATE(PPFirstYear+1,MONTH('Input|General'!$G$9),1)","v":"2018-06-01"},{"$f":"DATE(PPFirstYear+2,MONTH('Input|General'!$G$9),1)","v":"2019-06-01"},{"$f":"DATE(PPFirstYear+3,MONTH('Input|General'!$G$9),1)","v":"2020-06-01"},{"$f":"DATE(PPFirstYear+4,MONTH('Input|General'!$G$9),1)","v":"2021-06-01"},{"$f":"DATE(PPFirstYear+5,MONTH('Input|General'!$G$9),1)","v":"2022-06-01"},{"$f":"DATE(PPFirstYear+6,MONTH('Input|General'!$G$9),1)","v":"2023-06-01"},{"$f":"DATE(PPFirstYear+7,MONTH('Input|General'!$G$9),1)","v":"2024-06-01"},{"$f":"DATE(PPFirstYear+8,MONTH('Input|General'!$G$9),1)","v":"2025-06-01"},{"$f":"DATE(PPFirstYear+9,MONTH('Input|General'!$G$9),1)","v":"2026-06-01"}]
[]
[]
[]
[null,"Output | Reset RIN",null,null,"$millions",{"$f":"DATE(PPLastYear,MONTH('Input|General'!$G$9),1)","v":"2021-06-01"}]
[]
[null,null,"Operating expenditure (exc. DRC)","Source","Unit","Basis",null,null,null,{"$f":"J4","v":"2017-06-01"},"2018-06-01","2019-06-01","2020-06-01","2021-06-01","2022-06-01","2023-06-01","2024-06-01","2025-06-01","2026-06-01"]
{"$rows_left_out":38}
{"sheet":"Lookup|Tables","index":9,"n_rows":79,"n_cols":22,"rows_kept":79,"cut":false,"hidden":false,"merged":[]}
[null,{"$f":"Index!$B$1","v":"AER opex model"},null,null,null,null,null,null,null,"Back to Index",null,"Key:","Input","External Link","Internal Link",null,null,null,null,null,"Overall Check:",{"$f":"'Check|List'!$S$1","v":"Ok"}]
[null,{"$f":"Index!$C$16","v":"Lookup | Tables"}]
[]
[]
[]
[]
[null,"Unit Denominations"]
[]
[null,null,{"$f":"B7","v":"Unit Denominations"},"Source",null,null,"Ref"]
[null,null,"Dollars","AER",null,null,"$dollars"]
{"$rows_left_out":70}
{"sheet":"Check|List","index":10,"n_rows":19,"n_cols":19,"rows_kept":19,"cut":false,"hidden":false,"merged":[]}
[null,{"$f":"Index!$B$1","v":"AER opex model"},null,null,null,null,null,null,null,"Back to Index",null,"Key:","Input","External Link","Internal Link",null,null,"Overall Check:",{"$f":"IF(COUNTIF(G10:G17,\"Check\")=0,\"Ok\",\"Check\")","v":"Ok"}]
[null,{"$f":"Index!$C$17","v":"Check | List"}]
[]
[]
[]
[]
[null,"Check List"]
[]
[null,null,"Sheet","Source","Unit",null,"Status"]
[null,null,{"$f":"Index!C7","v":"Input | General"},{"$f":"C10","v":"Input | General"},"Ok/Check",null,{"$f":"'Input|General'!S1","v":"OK"}]
{"$rows_left_out":9}