{"text_format":"1","workbook":"xlsx","n_sheets":28,"sheets":["CF","AER only","Instructions","CONTENTS","Business & other details","E1. Expenditure Summary","E2. Mains Repex","E3. Mains Augex","E4. Meter replacement","E5. New Connections","E6. Non-network","E10. Overheads","E11. Labour","E12. ICT","E13. Other capex","E17. Step changes","E20. Opex","E21. ARS","E21. ARS (NEW)","E25. Escalators","N1.1. Demand","N1.2. Demand","N2. Network characteristics","S1.1. Customer numbers","S1.2. Customer numbers","S11. Network reliability","F3. Revenue","F8. WACC inputs"],"not_rendered":{"charts":0,"images":5,"macros":1,"external_links":0,"defined_names":929,"comments":1,"pivot_tables":0},"unopened":[],"bounds":{"document_bytes":16777216,"sheet_cells":100000,"rows_first":2000,"rows_last":500,"rows_between":2000,"halvings":0,"cell_chars":16384,"cell_head_chars":4096},"cells_cut":0,"cells_raw":0,"read":"whole","date_system":"1900"}

{"sheet":"CF","index":0,"n_rows":125,"n_cols":21,"rows_kept":125,"cut":false,"hidden":true,"merged":[[1,1,1,20]]}
[]
[null,"CONDITIONAL FORMATTING MAP"]
[null,null,null,null,null,{"$f":"INDEX(dms_CF_3.6.1, MATCH(dms_TradingName,dms_CF_TradingName))=\"Y\"","v":false},"=INDEX(dms_CF_3.6.5, MATCH(dms_TradingName,dms_CF_TradingName))=\"Y\"",{"$f":"INDEX(dms_CF_3.6.6, MATCH(dms_TradingName,dms_CF_TradingName))=\"Y\"","v":false},"=INDEX(dms_CF_3.6.7.1, MATCH(dms_TradingName,dms_CF_TradingName))=\"Y\"","=INDEX(dms_CF_3.6.7.2, MATCH(dms_TradingName,dms_CF_TradingName))=\"Y\"","=INDEX(dms_CF_3.6.7.3, MATCH(dms_TradingName,dms_CF_TradingName))=\"Y\"","=INDEX(dms_CF_3.6.7.4, MATCH(dms_TradingName,dms_CF_TradingName))=\"Y\"","=INDEX(dms_CF_4.1, MATCH(dms_TradingName,dms_CF_TradingName))=\"Y\"","=INDEX(dms_CF_6.6.1, MATCH(dms_TradingName,dms_CF_TradingName))=\"Y\"","=INDEX(dms_CF_6.8, MATCH(dms_TradingName,dms_CF_TradingName))=\"Y\"","=INDEX(dms_CF_7.12, MATCH(dms_TradingName,dms_CF_TradingName))=\"Y\"","=INDEX(dms_CF_8.1_A, MATCH(dms_TradingName,dms_CF_TradingName))=\"Y\"","=INDEX(dms_CF_8.1_B, MATCH(dms_TradingName,dms_CF_TradingName))=\"Y\"","=INDEX(dms_CF_8.1_Neg, MATCH(dms_TradingName,dms_CF_TradingName))=\"Y\""]
[null,"dms_CF_TradingName","JurisdictionList","Sector","Segment","dms_CF_3.6.1","dms_CF_3.6.5","dms_CF_3.6.6","dms_CF_3.6.7.1","dms_CF_3.6.7.2","dms_CF_3.6.7.3","dms_CF_3.6.7.4","dms_CF_4.1","dms_CF_6.6.1","dms_CF_6.8","dms_CF_7.12","dms_CF_8.1_A","dms_CF_8.1_B","dms_CF_8.1_Neg","Spare1","Spare2"]
[null,"ActewAGL Distribution","ACT","Electricity","Distribution",null,"Y",null,"Y","Y","N","Y","Y","N","Y","Y","N","Y","Y","N","N"]
[null,"Ausgrid","NSW","Electricity","Distribution",null,"Y",null,"N","N","N","Y","Y","N","Y","Y","N","Y","Y","N","N"]
[null,"AusNet (D)","Vic","Electricity","Distribution",null,"N",null,"N","N","N","N","Y","N","Y","N","N","N","Y","N","N"]
[null,"AusNet (T)","Vic","Electricity","Transmission",null,"N",null,"N","N","N","N","Y","N","Y","N","N","N","Y","N","N"]
[null,"CitiPower","Vic","Electricity","Distribution",null,"N",null,"N","N","N","N","Y","N","Y","N","N","N","Y","N","N"]
[null,"Directlink","Qld","Electricity","Transmission",null,"N",null,"N","N","N","N","Y","N","Y","N","N","Y","Y","N","N"]
[null,"ElectraNet","SA","Electricity","Transmission",null,"N",null,"N","N","N","N","Y","N","Y","N","N","Y","Y","N","N"]
[null,"Endeavour Energy","NSW","Electricity","Distribution",null,"Y",null,"N","N","N","Y","Y","N","Y","Y","N","Y","Y","N","N"]
[null,"Energex","Qld","Electricity","Distribution",null,"Y",null,"N","N","N","N","Y","N","Y","Y","N","Y","Y","N","N"]
[null,"Ergon Energy","Qld","Electricity","Distribution",null,"Y",null,"N","N","N","N","Y","N","Y","Y","N","Y","Y","N","N"]
[null,"Essential Energy","NSW","Electricity","Distribution",null,"Y",null,"N","N","N","Y","Y","N","Y","Y","N","Y","Y","N","N"]
[null,"Jemena Electricity","Vic","Electricity","Distribution",null,"N",null,"N","N","N","N","Y","N","Y","N","N","N","Y","N","N"]
[null,"Murraylink","SA","Electricity","Transmission",null,"N",null,"N","N","N","N","Y","N","Y","N","N","Y","Y","N","N"]
[null,"Power and Water","NT","Electricity","Distribution",null,"N",null,"N","Y","N","N","Y","Y","Y","Y","N","Y","Y","N","N"]
[null,"Powercor Australia","Vic","Electricity","Distribution",null,"N",null,"N","N","N","N","Y","N","Y","N","N","N","Y","N","N"]
[null,"Powerlink","Qld","Electricity","Transmission",null,"N",null,"N","N","N","N","Y","N","Y","N","N","Y","Y","N","N"]
[null,"SA Power Networks","SA","Electricity","Distribution",null,"Y",null,"N","N","N","N","Y","N","Y","Y","Y","Y","N","N","N"]
[null,"TasNetworks (D)","Tas","Electricity","Distribution",null,"Y",null,"N","N","N","N","Y","N","Y","Y","N","Y","Y","N","N"]
[null,"TasNetworks (T)","Tas","Electricity","Transmission",null,"N",null,"N","N","N","N","Y","N","Y","N","N","Y","Y","N","N"]
[null,"TransGrid","NSW","Electricity","Transmission",null,"N",null,"N","N","N","N","Y","N","Y","N","N","Y","Y","N","N"]
[null,"United Energy","Vic","Electricity","Distribution",null,"N",null,"N","N","N","N","Y","N","Y","N","N","N","Y","N","N"]
[]
[]
[]
[]
[]
[]
[]
[]
[]
[]
[]
[]
[]
[]
[]
[]
[]
[]
[]
[]
[]
[]
[]
[]
[]
[]
[]
[]
[]
[]
[]
[]
[]
[]
[]
[]
[]
[]
[]
[]
[]
[]
[]
[]
[]
[]
[]
[]
[]
[]
[]
[]
[]
[]
[]
[]
[]
[]
[]
[]
[]
[]
[]
[]
[]
[]
[]
[]
[]
[]
[]
[]
[]
[]
[]
[]
[]
[]
[]
[]
[]
[]
[]
[]
[]
[]
[]
[]
[]
[]
[]
[]
[]
[]
[]
[]
[]
[]
[null,null,"0",null,"=IFERROR(IF(dms_060801_StartCell<>\"\",IF(dms_Model=\"ARR\",(LOOKUP(2,1/(dms_060801_01_Values<>\"\"),(ROW(dms_060801_01_Values)))),\"not an ARR\"),0),\"0\")"]
[null,null,{"$f":"IFERROR(IF(dms_Model=\"ARR\",(MAX(0,dms_0608_LastRow-dms_0608_OffsetRows)),\"not an ARR\"),\"0\")","v":"not an ARR"},null,"=IFERROR(IF(dms_Model=\"ARR\",(MAX(0,dms_0608_LastRow-dms_0608_OffsetRows)),\"not an ARR\"),\"0\")"]

{"sheet":"AER only","index":1,"n_rows":224,"n_cols":40,"rows_kept":224,"cut":false,"hidden":true,"merged":[[0,1,0,11],[4,27,4,38],[6,27,6,30],[6,33,6,37],[53,25,53,29],[53,30,53,33],[54,14,54,21],[54,25,54,29],[54,30,54,33],[72,14,72,15],[72,25,72,28],[93,1,95,1],[96,1,100,1],[104,1,105,1],[148,1,148,8],[54,1,54,5]]}
[null,"Data in these columns used for data validation and database purposes."]
[null,"Date last modified:","2017-01-16","added (Albury and Victora) for AGN"]
[null,null,"2016-10-17","updated TransGrid's correct legal name, corrected TasNetworks (T) to June financial year"]
[null,null,"2017-02-01","inserted Power and Water, added NRs (dms_FeederCat_1 and dms_FeederCat_2)"]
[null,null,"2017-03-03","inserted AEMO as a business",null,null,null,null,null,null,null,null,null,null,null,null,null,null,null,null,null,null,null,null,null,null,null,"FOR ELECTRICITY BUSINESSES ONLY"]
[null,null,"2018-03-28","major changes to accommodate STPIS"]
[null,null,"Template Version",5,null,null,null,null,null,null,null,null,null,null,null,null,null,null,null,null,null,null,null,null,null,null,null,"Feeder Types",null,null,null,"TasNetworks (D)","MAIFI flag","Feeder Names"]
[]
[null,null,null,null,null,null,null,null,null,null,null,null,null,null,null,null,null,null,null,null,null,null,null,null,null,null,null,"CBD","Urban","Short rural","long rural","EXTRA"]
[null,"dms_TradingName_List","dms_TradingNameFull_List","dms_ABN_List","dms_JurisdictionList","dms_Sector_List","dms_Segment_List","dms_FormControl_List","dms_RPT_List","dms_RPTMonth_List","dms_CRCPlength_List","dms_FRCPlength_List","dms_663_List","dms_DeterminationRef_List","dms_Addr1_List","dms_Addr2_List","dms_Suburb_List","dms_State_List","dms_PostCode_List","dms_PAddr1_List","dms_PAddr2_List","dms_PSuburb_List","dms_PState_List","dms_PPostCode_List","dms_ContactName1_List","dms_ContactPh1_List","dms_ContactEmail_List","dms_CBD_flag","dms_Urban_flag","dms_ShortRural_flag","dms_LongRural_flag","dms_FeederType_5_flag","dms_MAIFI_flag_List","dms_FeederName_1","dms_FeederName_2","dms_FeederName_3","dms_FeederName_4","dms_FeederName_5","dms_Public_Lighting_List","Column1"]
[null,"ActewAGL Distribution","ActewAGL Distribution",76670568688,"ACT","Electricity","Distribution","Revenue cap","Financial","June",5,5,5,"2014-19 Distribution Determination","40 Bunda Street",null,"CANBERRA","ACT",2600,"GPO BOX 366",null,"CANBERRA","ACT",2601,"Robert Walker","02 6248 3847","robert.walker@actewagle.com.au","NO","YES","YES","NO","NO","NO","CBD","Urban","Short rural","Long rural",null,"YES","ActewAGL Distribution"]
[null,"ActewAGL Distribution (Tx Assets)","ActewAGL Distribution (Tx Assets)",76670568688,"ACT","Electricity","Distribution","Revenue cap","Financial","June",5,5,5,"distribution determination","40 Bunda Street",null,"CANBERRA","ACT",2600,"GPO BOX 366",null,"CANBERRA","ACT",2601,"Robert Walker","02 6248 3847","robert.walker@actewagle.com.au","NO","YES","YES","NO","NO","NO","CBD","Urban","Short rural","Long rural",null,"NO","ActewAGL Distribution (Tx Assets)"]
[null,"ActewAGL Gas","ActewAGL Gas",76670568688,"ACT","Gas","Distribution","Weighted average price cap","Financial","June",5,5,"x",null,"40 Bunda Street",null,"CANBERRA","ACT",2600,"GPO BOX 366",null,"CANBERRA","ACT",2601,"Philip Deamer","02 6248 3438","GasAAReview@actewagl.com.au","NO","NO","NO","NO","NO","-","CBD","Urban","Short rural","Long rural",null,"NO","ActewAGL Gas"]
[null,"AEMO","Australian Energy Market Operator Ltd",94072010327,"Vic","Electricity","Transmission","-","Financial","March",5,5,"x","-","Level 22","530 Collins Street","MELBOURNE","VIC",3000,"GPO Box 2008",null,"MELBOURNE","VIC",3001,null,null,null,"NO","NO","NO","NO","NO","-","CBD","Urban","Short rural","Long rural",null,"NO","AEMO"]
[null,"AGN (Albury and Victoria)","Australian Gas Networks Limited (reporting data for Albury and Victoria)",19078551685,"Vic","Gas","Distribution","Weighted average price cap","Calendar","December",5,5,"x",null,"Level 6","400 King William Street","ADELAIDE","SA",5000,"PO Box 6468","Halifax Street","ADELAIDE","SA",5000,"Craig de Laine","08 8418 1129 ","craig.delaine@agn.com.au","NO","NO","NO","NO","NO","-","CBD","Urban","Short rural","Long rural",null,"NO","AGN (Albury)"]
[null,"AGN (Albury)","Australian Gas Networks Limited (reporting data for Albury)",19078551685,"Vic","Gas","Distribution","Weighted average price cap","Calendar","December",5,5,"x",null,"Level 6","400 King William Street","ADELAIDE","SA",5000,"PO Box 6468","Halifax Street","ADELAIDE","SA",5000,"Craig de Laine","08 8418 1129 ","craig.delaine@agn.com.au","NO","NO","NO","NO","NO","-","CBD","Urban","Short rural","Long rural",null,"NO"]
[null,"AGN (SA)","Australian Gas Networks Limited (reporting data for SA)",19078551685,"SA","Gas","Distribution","Weighted average price cap","Financial","June",5,5,5,"distribution determination","Level 6","400 King William Street","ADELAIDE","SA",5000,"PO Box 6468","Halifax Street","ADELAIDE","SA",5000,"Craig de Laine","08 8418 1129 ","craig.delaine@agn.com.au","NO","NO","NO","NO","NO","-","CBD","Urban","Short rural","Long rural",null,"NO","AGN (SA)"]
[null,"AGN (Victoria)","Australian Gas Networks Limited (reporting data for Victoria)",19078551685,"Vic","Gas","Distribution","Weighted average price cap","Calendar","December",5,5,"x",null,"Level 6","400 King William Street","ADELAIDE","SA",5000,"PO Box 6468","Halifax Street","ADELAIDE","SA",5000,"Craig de Laine","08 8418 1129 ","craig.delaine@agn.com.au","NO","NO","NO","NO","NO","-","CBD","Urban","Short rural","Long rural",null,"NO","AGN (Victoria)"]
[null,"Amadeus","APT Pipelines (NT) Pty Ltd",39009737393,"NT","Gas","Transmission","Weighted average price cap","Financial","June",5,5,"x","n/a","Level 19, HSBC Building","580 George Street","SYDNEY","NSW",2000,"Level 19, HSBC Building","580 George Street","SYDNEY","NSW",2000,"Alexandra Curran","02 9275 0020","alexandra.curran@apa.com.au","NO","NO","NO","NO","NO","-","CBD","Urban","Short rural","Long rural",null,"NO","Amadeus"]
[null,"APA GasNet","APA GasNet Australia (Operations) Pty Ltd","065083009","Vic","Gas","Transmission","Weighted average price cap","Calendar","December",5,5,"x",null,"Level 19, HSBC Building","580 George Street","SYDNEY","NSW",2000,"PO Box R41",null,"ROYAL EXCHANGE","NSW",1225,"Alexandra Curran","02 9275 0020","alexandra.curran@apa.com.au","NO","NO","NO","NO","NO","-","CBD","Urban","Short rural","Long rural",null,"NO","APA GasNet"]
[null,"Ausgrid","Ausgrid",78508211731,"NSW","Electricity","Distribution","Revenue cap","Financial","June",5,5,5,"2014-19 Distribution Determination","570 George St",null,"SYDNEY","NSW",2000,"GPO Box 4009",null,"SYDNEY","NSW",2001,"John Thomson","02 9269 2312","john.thomson@ausgrid.com.au","YES","YES","YES","YES","NO","NO","CBD","Urban","Short rural","Long rural",null,"YES","Ausgrid"]
[null,"Ausgrid (Tx Assets)","Ausgrid (Tx Assets)",67505337385,"NSW","Electricity","Distribution","Revenue cap","Financial","June",5,5,5,"distribution determination","570 George St",null,"SYDNEY","NSW",2000,"GPO Box 4009",null,"SYDNEY","NSW",2001,"John Thomson","02 9269 2312","john.thomson@ausgrid.com.au","YES","YES","YES","YES","NO","NO","CBD","Urban","Short rural","Long rural",null,"NO","Ausgrid (Tx Assets)"]
[null,"AusNet (D)","AusNet Electricity Services Pty Ltd",91064651118,"Vic","Electricity","Distribution","Revenue cap","Calendar","December",5,5,2,"2016-20 Distribution Determination","Level 32","2 Southbank Boulevard","SOUTHBANK","Vic",3006,"Locked Bag 14051",null,"MELBOURNE CITY MAIL CENTRE","VIC",8001,"Thomas Hall",null,"thomas. hall@ausnetservices.com.au","NO","YES","YES","YES","NO","YES","CBD","Urban","Short rural","Long rural",null,"YES","AusNet (D)"]
[null,"AusNet (Gas)","AusNet Gas Services","086015036","Vic","Gas","Distribution","Weighted average price cap","Calendar","December",5,5,"X",null,"Level 19, HSBC Building","580 George Street","SYDNEY","NSW",2000,"PO Box R41",null,"ROYAL EXCHANGE","NSW",1225,"Alexandra Curran","02 9275 0020","alexandra.curran@apa.com.au","NO","NO","NO","NO","NO","-","CBD","Urban","Short rural","Long rural",null,"NO","AusNet (Gas)"]
[null,"AusNet (T)","Ausnet Services (Transmission) Ltd",48116124362,"Vic","Electricity","Transmission","Revenue cap","Financial","March",5,5,2,"transmission determination","Level 32","2 Southbank Boulevard","SOUTHBANK","Vic",3006,"Locked Bag 14051",null,"MELBOURNE CITY MAIL CENTRE","Vic",8001,"Clare Thompson","03 9695 6670","clare.e.thompson@ausnetservices.com.au","NO","NO","NO","NO","NO","-","CBD","Urban","Short rural","Long rural",null,"NO","AusNet (T)"]
[null,"Australian Distribution Co.","Australian Distribution Co.",11222333444,"-","Electricity","Distribution","Revenue cap","Financial","June",5,5,2,"distribution determination","123 Straight Street",null,"SYDNEY","NSW",2000,"PO Box 123",null,"SYDNEY","NSW",2000,"Bob Smith","02 1234 5678","bob@auselec.net.au","YES","YES","YES","YES","NO","NO","CBD","Urban","Short rural","Long rural",null,"YES","Australian Distribution Co."]
[null,"Australian Distribution Co. (Gas)","Australian Gas Distribution Co. ",11222333444,"NSW","Gas","Distribution","Weighted average price cap","Financial","June",5,5,null,null,"123 Straight Street",null,"SYDNEY","NSW",2000,"PO Box 123",null,"SYDNEY","NSW",2000,"Bob Smith","02 1234 5678","bob@auselec.net.au","NO","NO","NO","NO","NO","-","CBD","Urban","Short rural","Long rural",null,"NO","Australian Distribution Co. (Vic)"]
[null,"Australian Distribution Co. (Vic)","Australian Distribution Co. (Victoria)",11222333444,"Vic","Electricity","Distribution","Revenue cap","Calendar","December",5,5,2,"distribution determination","123 Straight Street",null,"MELBOURNE","Vic",3000,"PO Box 123",null,"MELBOURNE","VIC",3000,"Bob Smith","02 1234 5678","bob@auselec.net.au","NO","NO","NO","NO","NO","YES","CBD","Urban","Short rural","Long rural",null,"YES","Australian Distribution Co. (Vic)"]
[null,"Australian Transmission Co.","Australian Transmission Co.",11222333444,"-","Electricity","Transmission","Revenue cap","Financial","June",5,5,5,"transmission determination","123 Straight Street",null,"SYDNEY","NSW",2000,"PO Box 123",null,"SYDNEY","NSW",2000,"Bob Smith","02 1234 5678","bob@auselec.net.au","NO","NO","NO","NO","NO","-","CBD","Urban","Short rural","Long rural",null,"NO","Australian Transmission Co."]
[null,"Central Ranges Pipeline (D)","Central Ranges Pipeline Pty Ltd",108218355,"NSW","Gas","Distribution","Weighted average price cap","Financial","June",15,5,5,"distribution determination","Level 19","580 George Street","SYDNEY","NSW",2000,"PO Box R41",null,"ROYAL EXCHANGE","NSW",1225,"Scott Young","02 9275 0031","scott.young@apa.com.au","NO","NO","NO","NO","NO","-","CBD","Urban","Short rural","Long rural",null,"NO"]
[null,"Central Ranges Pipeline (T)","Central Ranges Pipeline Pty Ltd",108218355,"NSW","Gas","Distribution","Weighted average price cap","Financial","June",14,5,5,"transmission determination","Level 19","580 George Street","SYDNEY","NSW",2000,"PO Box R41",null,"ROYAL EXCHANGE","NSW",1225,"Scott Young","02 9275 0031","scott.young@apa.com.au","NO","NO","NO","NO","NO","-","CBD","Urban","Short rural","Long rural",null,"NO"]
[null,"CitiPower","CitiPower",76064651056,"Vic","Electricity","Distribution","Revenue cap","Calendar","December",5,5,2,"2016-20 Distribution Determination","40 Market Street",null,"MELBOURNE","Vic",3000,"Locked Bag 14090",null,"MELBOURNE","VIC",8001,"Hannah Williams","03 9683 4088","hwilliams@powercor.com.au","YES","YES","NO","NO","NO","YES","CBD","Urban","Short rural","Long rural",null,"YES","CitiPower"]
[null,"Directlink","Directlink",16779340889,"Qld","Electricity","Transmission","Revenue cap","Financial","June",5,5,5,"transmission determination","Level 19, HSBC Building","580 George Street","SYDNEY","NSW",2000,"PO Box R41",null,"ROYAL EXCHANGE","NSW",1225,"Scott Young","02 9275 0031","scott.young@apa.com.au","NO","NO","NO","NO","NO","-","CBD","Urban","Short rural","Long rural",null,"NO","Directlink"]
[null,"ElectraNet","ElectraNet",41094482416,"SA","Electricity","Transmission","Revenue cap","Financial","June",5,5,5,"transmission determination","52-55 East Terrace","Rymill Park","ADELAIDE","SA",5000,"PO Box 7096","Hutt Street Post Office","ADELAIDE","SA",5000,"Bill Jackson","08 8404 7969","jackson.bill@electranet.com.au","NO","NO","NO","NO","NO","-","CBD","Urban","Short rural","Long rural",null,"NO","ElectraNet"]
[null,"Endeavour Energy","Endeavour Energy",11247365823,"NSW","Electricity","Distribution","Revenue cap","Financial","June",5,5,5,"2014-19 Distribution Determination","51 Huntingwood Drive",null,"HUNTINGWOOD","NSW",2148,"PO Box 811",null,"SEVEN HILLS","NSW",1730,"Jon Hocking","02 9853 4386 / 0407 348 156","Jon.Hocking@Endeavourenergy.com.au","NO","YES","YES","YES","NO","NO","CBD","Urban","Short rural","Long rural",null,"YES","Endeavour Energy"]
[null,"Energex","Energex",40078849055,"Qld","Electricity","Distribution","Revenue cap","Financial","June",5,5,5,"2015-20 Distribution Determination","26 Reddacliff Street",null,"NEWSTEAD","Qld",4006,"26 Reddacliff Street",null,"NEWSTEAD","QLD",4006,"Jenny Doyle, Group Manager Regulatory Affairs","(07) 3851 6416","jenny.doyle@ergon.com.au","YES","YES","YES","NO","NO","NO","CBD","Urban","Short rural","Long rural",null,"YES","Energex"]
[null,"Ergon Energy","Ergon Energy",50087646062,"Qld","Electricity","Distribution","Revenue cap","Financial","June",5,5,5,"2015-20 Distribution Determination","22 Walker Street",null,"TOWNSVILLE","Qld",4810,"Po Box 264",null,"FORTITUDE VALLEY","QLD",4006,"Jenny Doyle, Group Manager Regulatory Affairs","(07) 3851 6416","jenny.doyle@ergon.com.au","NO","YES","YES","YES","NO","NO","CBD","Urban","Short rural","Long rural",null,"YES","Ergon Energy"]
[null,"Essential Energy","Essential Energy",37428185226,"NSW","Electricity","Distribution","Revenue cap","Financial","June",5,5,5,"2014-19 Distribution Determination","8 Buller Street",null,"PORT MACQUARIE","NSW",2444,"PO Box 5730",null,"PORT MACQUARIE","NSW",2444,"Catherine Waddell","02 6338 3553","catherine.waddell@essentialenergy.com.au","NO","NO","YES","YES","NO","NO","CBD","Urban","Short rural","Long rural",null,"YES","Essential Energy"]
[null,"Jemena Electricity","Jemena Electricity",82064651083,"Vic","Electricity","Distribution","Revenue cap","Calendar","December",5,5,2,"2016-20 Distribution Determination","Level 16","567 Collins Street","MELBOURNE","VIC",3000,"PO Box 16182",null,"MELBOURNE","VIC",8001,"Matthew Serpell","03 9173 8231","matthew.serpell@jemena.com.au","NO","YES","YES","NO","NO","YES","CBD","Urban","Short rural","Long rural",null,"YES","Jemena Electricity"]
[null,"JGN","Jemena Gas Networks (NSW) Ltd","003 004 322","NSW","Gas","Distribution","Weighted average price cap","Financial","June",5,5,null,null,"Level 16","567 Collins Street","MELBOURNE","VIC",3000,"PO Box 16182",null,"MELBOURNE","VIC",8001,"Scott Young",null,null,"NO","NO","NO","NO","NO","-","CBD","Urban","Short rural","Long rural",null,"NO","JGN"]
[null,"Multinet Gas","Multinet Gas (DB No.1) Pty Ltd (ACN 086 026 986), Multinet Gas (DB No.2) Pty Ltd (ACN 086 230 122)","086026986","Vic","Gas","Distribution","Weighted average price cap","Calendar","December",5,5,"x",null,"43-45 Centreway",null,"MT WAVERLEY","Vic",3149,null,null,null,null,null,"Andrew Schille","03 8846 9860","andrew.schille@ue.com.au","NO","NO","NO","NO","NO","-","CBD","Urban","Short rural","Long rural",null,"NO","Multinet Gas"]
[null,"Murraylink","Murraylink",79181207909,"SA","Electricity","Transmission","Revenue cap","Financial","June",5,5,5,"transmission determination","Level 19","580 George Street","SYDNEY","NSW",2000,"PO Box R41",null,"ROYAL EXCHANGE","NSW",1225,"Scott Young","02 9275 0031","scott.young@apa.com.au","NO","NO","NO","NO","NO","-","CBD","Urban","Short rural","Long rural",null,"NO","Murraylink"]
[null,"Power and Water","Power and Water Corporation",15947352360,"NT","Electricity","Distribution","Revenue cap","Financial","June",5,5,"x","distribution determination","GPO Box 1921",null,"DARWIN","NT",801,"GPO Box 1921",null,"DARWIN","NT",801,"Lucy Moon","08 8924 5822","Lucy.Moon@powerwater.com.au","YES","YES","YES","YES","NO","NO","CBD","Urban","Short rural","Long rural",null,"NO","Power and Water"]
[null,"Powercor Australia","Powercor Australia",89064651109,"Vic","Electricity","Distribution","Revenue cap","Calendar","December",5,5,2,"2016-20 Distribution Determination","40 Market Street",null,"MELBOURNE","Vic",3000,"Locked bag 14090",null,"MELBOURNE","VIC",8001,"Hannah Williams","03 9683 4088","hwilliams@powercor.com.au","NO","NO","YES","YES","NO","YES","CBD","Urban","Short rural","Long rural",null,"YES","Powercor Australia"]
[null,"Powerlink","Queensland Electricity Transmission Corporation Limited trading as Powerlink Queensland",82078849233,"Qld","Electricity","Transmission","Revenue cap","Financial","June",5,5,5,"transmission determination","33 Harold St",null,"VIRGINIA","Qld",4014,"PO Box 1193",null,"VIRGINIA","QLD",4014,"Jennifer Harris","07 3860 2667","jharris@powerlink.com.au","NO","NO","NO","NO","NO","-","CBD","Urban","Short rural","Long rural",null,"NO","Powerlink"]
[null,"Roma to Brisbane Pipeline","APT Petroleum Pipelines Limited t/a Roma to Brisbane Pipeline","009 737 393","Qld","Gas","Transmission","Weighted average price cap","Financial","June",5,5,"x","n/a","580 George Street",null,"SYDNEY","NSW",2000,"PO Box R41",null,"ROYAL EXCHANGE","NSW",1225,"Mark Allen","02 9275 0010","mark.allen@apa.com.au","NO","NO","NO","NO","NO","-","CBD","Urban","Short rural","Long rural",null,"NO","Roma to Brisbane Pipeline"]
[null,"SA Power Networks","SA Power Networks",13332330749,"SA","Electricity","Distribution","Revenue cap","Financial","June",5,5,5,"2015-20 Distribution Determination","1 Anzac Highway",null,"KESWICK","SA",5035,"GPO Box 77",null,"ADELAIDE","SA",5000,"Richard Sibly","08 8404 5613","richard.sibly@sapowernetworks.com.au","NO","NO","YES","YES","NO","NO","CBD","Urban","Short rural","Long rural",null,"NO","SA Power Networks"]
[null,"TasNetworks (D)","TasNetworks (D)",24167357299,"Tas","Electricity","Distribution","Revenue cap","Financial","June",5,5,5,"distribution determination","1-7 Maria Street",null,"LENAH VALLEY","Tas",7008,"PO Box 606",null,"MOONAH","Tas",7009,"John Sayers","03 6271 6469","john.sayers@tasnetworks.com.au","YES","YES","YES","YES","YES","NO","Critical Infrastructure","High density commercial","Urban","High density rural","Low density rural","YES","TasNetworks (D)"]
[null,"TasNetworks (T)","TasNetworks (T)",24167357299,"Tas","Electricity","Transmission","Revenue cap","Financial","June",5,5,5,"transmission determination","1-7 Maria Street",null,"LENAH VALLEY","Tas",7008,"PO Box 606",null,"MOONAH","Tas",7009,"John Sayers","03 6271 6469","john.sayers@tasnetworks.com.au","NO","NO","NO","NO","NO","-","CBD","Urban","Short rural","Long rural",null,"NO","TasNetworks (T)"]
[null,"TransGrid","NSW Electricity Networks Operations Pty Ltd trading as TransGrid","70 250 995 390","NSW","Electricity","Transmission","Revenue cap","Financial","June",4,5,5,"transmission determination","180 Thomas Street",null,"SYDNEY","NSW",2000,"PO Box A1000",null,"SYDNEY SOUTH","NSW",1235,"Garrie Chubb","0408 210 221","garrie.chubb@transgrid.com.au","NO","NO","NO","NO","NO","-","CBD","Urban","Short rural","Long rural",null,"NO","TransGrid"]
[null,"United Energy","United Energy",70064651029,"Vic","Electricity","Distribution","Revenue cap","Calendar","December",5,5,2,"2016-20 Distribution Determination","43-45 Centreway",null,"MOUNT WAVERLEY","Vic",3149,"PO Box 449",null,"MOUNT WAVERLEY","VIC",3170,"Mathew Abraham","03 8846 9758","mathew.abraham@ue.com.au","NO","NO","YES","NO","NO","YES","CBD","Urban","Short rural","Long rural",null,"YES","United Energy"]
[]
[]
[null,null,null,null,null,null,null,null,null,null,null,null,null,null,null,null,null,null,null,null,null,null,null,null,null,"For EB & Reset RINs only",null,null,null,null,"For AARs only"]
[null,"The Reg Year Ending (dms_RYE) must be set to the last year of the regulatory period. For forecast data is is usually (FRCP_y5) for actual it is a single year (CRY). For historical actual data the RYE will need to be set manually in the business details sheet by setting the dms_Multiyear_flag to 1 and putting the correct value in 'dms_Specified_FinalYear. See cells C67:C68",null,null,null,null,null,null,null,null,null,null,null,"Drop down selector box for CA & Reset RINs.","For CA & Reset RINs only",null,null,null,null,null,null,null,null,null,null,"for DNSP only",null,null,null,null,"For DNSPs only"]
[null,"dms_Model_List ","dms_Worksheet_List",null,"dms_RYE_Formula_Result",null,null,null,null,null,null,null,null,"dms_0203_ProjectType","dms_020303_01_UOM","dms_020501_01_UOM","dms_020501_02_UOM","dms_020501_03_UOM","dms_020501_04_UOM","dms_020603_01_UOM","dms_020701_01_UOM","dms_020701_02_UOM","dms_020701_01_Rows","dms_040102_01_UOM","dms_040102_04_UOM","dms_030601_01_UOM","dms_030601_02_UOM","dms_030701_01_UOM","dms_030702_01_UOM","dms_030703_01_UOM","dms_030605_UOM","dms_03060703_UOM"]
[null,"ARR","ANNUAL REPORTING STATEMENT",null,{"$f":"LEFT(dms_SingleYear_FinalYear_Result,2)&RIGHT(dms_SingleYear_FinalYear_Result,2)","v":"noIN"},"=LEFT(dms_SingleYear_FinalYear_Result,2)&RIGHT(dms_SingleYear_FinalYear_Result,2)",null,"Formula errors are OK",null,null,null,null,null,"New line on new route - single circuit","Circuit line length in km","0's","0's","0's","0's","0's","km","km","Route line length within zone","0's","days","minutes/customer","minutes/customer","Customer / km","%","km","number","number"]
[null,"CA","CATEGORY ANALYSIS",null,{"$f":"LEFT(dms_SingleYear_FinalYear_Result,2)&RIGHT(dms_SingleYear_FinalYear_Result,2)","v":"noIN"},"=LEFT(dms_SingleYear_FinalYear_Result,2)&RIGHT(dms_SingleYear_FinalYear_Result,2)",null,"Formula errors are OK",null,null,null,null,null,"New line on new route - dual circuit","Circuit line length in km","0's","0's","0's","0's","0's","0's","0's","Number of maintenance spans","0's","0's","minutes/customer","minutes/customer","MWh/customer","Number of spans",null,"number","number"]
[null,"CESS","CAPITLAL EXPENDITURE SHARING SCHEMING",null,"2016","=LEFT(dms_SingleYear_FinalYear_Result,2)&RIGHT(dms_SingleYear_FinalYear_Result,2)",null,null,null,null,null,null,null,"New line on new route - other","Circuit line length in km","MVA added","MVA added","MVA added","MVA added","0's","km","km","Total length of maintenance spans","0's","$0s","interruptions/customer","interruptions/customer","kVA / customer","Number of spans",null,"number","number"]
[null,"CPI","CPI",null,null,null,null,null,null,null,null,null,null,"Line rebuild over existing route - single circuit","Circuit line length in km","0's","0's","0's","0's","0's","km","km","Length of vegetation corridors","$0s","0's","interruptions/customer","interruptions/customer",null,"Number of spans",null,"number","number"]
[null,"EB","ECONOMIC BENCHMARKING",null,{"$f":"LEFT(dms_SingleYear_FinalYear_Result,2)&RIGHT(dms_SingleYear_FinalYear_Result,2)","v":"noIN"},"=LEFT(dms_SingleYear_FinalYear_Result,2)&RIGHT(dms_SingleYear_FinalYear_Result,2)",null,"Formula errors are OK",null,null,null,null,null,"Line rebuild over existing route - dual circuit","Number","total spend $0s","total spend $0s","total spend $0s","total spend $0s","(per cent)","0's","0's","Average number of trees per maintenance span",null,null,null,null,null,"Number of spans",null,"number","(per cent)"]
[null,"PTRM","POST TAX REVENUE MODEL",null,{"$f":"LEFT(dms_MultiYear_FinalYear_Result,2)&RIGHT(dms_MultiYear_FinalYear_Result,2)","v":"2025"},"=LEFT(dms_MultiYear_FinalYear_Result,2)&RIGHT(dms_MultiYear_FinalYear_Result,2)",null,null,null,null,null,null,null,"Reconductor - Single circuit","Number","net circuit km added","net circuit km added","net circuit km added","net circuit km added",null,"years","years","Average frequency of cutting cycle",null,null,null,null,null,"Years",null,"number"]
[null,"Reset","REGULATORY REPORTING STATEMENT",null,{"$f":"LEFT(dms_MultiYear_FinalYear_Result,2)&RIGHT(dms_MultiYear_FinalYear_Result,2)","v":"2025"},"=LEFT(dms_MultiYear_FinalYear_Result,2)&RIGHT(dms_MultiYear_FinalYear_Result,2)",null,"Formula errors are OK",null,null,null,null,null,"Reconductor - Dual circuit","Number","total spend $0s","total spend $0s","total spend $0s","total spend $0s",null,null,null,null,null,null,null,null,null,"Years",null,"number"]
[null,"RFM","ROLL FORWARD MODEL",null,{"$f":"LEFT(dms_CRCP_FinalYear_Result,2)&RIGHT(dms_CRCP_FinalYear_Result,2)","v":"2020"},"=LEFT(dms_CRCP_FinalYear_Result,2)&RIGHT(dms_CRCP_FinalYear_Result,2)",null,null,null,null,null,null,null,"Other",null,"net circuit km added","net circuit km added","net circuit km added","net circuit km added",null,null,null,null,null,null,null,null,null,"Trees",null,"number"]
[null,"WACC","WEIGHTED AVERAGE COST OF CAPITAL",null,{"$f":"LEFT(dms_MultiYear_FinalYear_Result,2)&RIGHT(dms_MultiYear_FinalYear_Result,2)","v":"2025"},"=LEFT(dms_MultiYear_FinalYear_Result,2)&RIGHT(dms_MultiYear_FinalYear_Result,2)",null,null,null,null,null,null,null,null,null,"total spend $0s","total spend $0s","total spend $0s","total spend $0s",null,null,null,null,null,null,null,null,null,"Trees",null,"number"]
[null,null,null,null,null,null,null,null,null,null,null,null,null,null,null,"0's",null,"$0s",null,null,null,null,null,null,null,null,null,null,"Defects",null,"number"]
[null,"dms_DataQuality_List","dms_Confid_status_List",null,null,null,null,null,null,null,null,null,null,null,null,"0's",null,null,null,null,null,null,null,null,null,null,null,null,"Defects",null,"number"]
[null,"Actual","Public",null,null,null,null,null,null,null,null,null,null,null,null,"0's",null,null,null,null,null,null,null,null,null,null,null,null,"Spans",null,"number"]
[null,"Estimate","Confidential",null,null,null,null,null,null,null,null,null,null,null,null,"$0s",null,null,null,null,null,null,null,null,null,null,null,null,"km",null,"(per cent)"]
[null,"Consolidated",null,null,null,null,null,null,null,null,null,null,null,null,null,null,null,null,null,null,null,null,null,null,null,null,null,null,"Spans",null,"(per cent)",""]
[]
[]
[null,null,null,null,null,null,null,null,null,null,"STYLES IN USE",null,null,null,"For PTRM files - this field set the text for the named range \"DMS_Xfactor\" which in all cases is simply the text \"x factors\" - this saves putting in each old gas PTRM file ",null,null,null,null,null,null,null,null,null,null,"for TNSP only"]
[null,"For all files either AER or business needs to be able to specify the type of submission","For PTRM & RFM templates we must provide a choice in case they change their form of control - otherwise it is drawn from the business specific lookup table above.",null,null,null,null,null,null,null,null,null,null,null,"DMS_Xfactor",null,null,null,null,null,null,null,null,null,null,"dms_030601_01_UOM",null,"dms_030701_01_UOM","dms_030702_01_UOM"]
[null,"dms_SourceList","dms_FormControl_Choices",null,null,null,null,null,null,null,null,null,null,null,"x factors",null,null,null,null,null,null,null,null,null,null,"%",null,"Number of spans","km"]
[null,"After appeal","Revenue cap",null,null,null,null,null,null,null,null,null,null,null,null,null,null,null,null,null,null,null,null,null,null,"number",null,"Years","%"]
[null,"Draft decision","Revenue yield",null,null,null,null,null,null,null,null,null,null,null,null,null,null,null,null,null,null,null,null,null,null,"number",null,"Trees","km"]
[null,"Final decision","Weighted average price cap",null,null,null,null,null,null,null,null,null,null,null,null,null,null,null,null,null,null,null,null,null,null,"%",null,"Defects","number"]
[null,"PTRM update 1",null,null,null,null,null,null,null,null,null,null,null,null,null,null,null,null,null,null,null,null,null,null,null,"number",null,"Number of spans"]
[null,"PTRM update 2",null,null,null,null,null,null,null,null,null,null,null,null,null,null,null,null,null,null,null,null,null,null,null,"number",null,"km"]
[null,"PTRM update 3",null,null,null,null,null,null,null,null,null,null,null,null,null,null,null,null,null,null,null,null,null,null,null,"%",null,"km"]
[null,"PTRM update 4",null,null,null,null,null,null,null,null,null,null,null,null,null,null,null,null,null,null,null,null,null,null,null,"number",null,"Number of spans"]
[null,"PTRM update 5",null,null,null,null,null,null,null,null,null,null,null,null,null,null,null,null,null,null,null,null,null,null,null,"number"]
[null,"PTRM update 6",null,null,null,null,null,null,null,null,null,null,null,null,null,null,null,null,null,null,null,null,null,null,null,"%"]
[null,"PTRM update 7",null,null,null,null,null,null,null,null,null,null,null,null,null,null,null,null,null,null,null,null,null,null,null,"number"]
[null,"Regulatory proposal",null,null,null,null,null,null,null,null,null,null,null,null,null,null,null,null,null,null,null,null,null,null,null,"%"]
[null,"Reporting",null,null,null,null,null,null,null,null,null,null,null,null,null,null,null,null,null,null,null,null,null,null,null,"number"]
[null,"Revised regulatory proposal",null,null,null,null,null,null,null,null,null,null,null,null,null,null,null,null,null,null,null,null,null,null,null,"%"]
[null,null,null,null,null,null,null,null,null,null,null,null,null,null,null,null,null,null,null,null,null,null,null,null,null,"number"]
[]
[]
[]
[null,"Reason for interruption","dms_Reason_Interruption_Detailed","dms_Reason_Interruption","dms_STPIS_Exclusion_List","dms_020301_ProjectType_List","dms_020302_ProjectType_List","dms_N0205_AssetType"]
[null,"Animal","Animal impact","Animal","Weather","New substation establishment","New line on new route - single circuit","Cast Iron"]
[null,null,"Animal nesting/burrowing, etc and other","Asset failure","Equipment failure","Capacity upgrade","New line on new route - dual circuit","PVC"]
[null,null,"Other","Other","Operational error","Voltage upgrade","New line on new route - other","Polyamide"]
[null,"Asset failure","LV","Overloads","Vegetation","Other","Line rebuild over existing route - single circuit","High density polyethylene (80)"]
[null,null,"Distribution substation","Planned","Animals",null,"Line rebuild over existing route - dual circuit","High density polyethylene (100)"]
[null,null,"HV","Network business","Third party impacts",null,"Reconductor - Single circuit","High density polyethylene (250)"]
[null,null,"Zone substation","Third party","Transmission failure",null,"Reconductor - Dual circuit","High density polyethylene (575)"]
[null,null,"Subtransmission","Unknown","Load shedding",null,"Reconductor - Other","Medium density polyethylene"]
[null,"Other","insert description of 'other'","Vegetation","Inter-distributor connection failure",null,"Line upgrade - raising/retensoring","Unprotected steel"]
[null,"Overloads","-","Weather","Other",null,"Line upgrade - voltage upgrade","Protected steel"]
[null,"Planned","-","2 - STPIS Exclusion (3.3)(a)",null,null,"Line upgrade - capacity","Other"]
[null,"Network business","Network error","3 - STPIS Exclusion (3.3)(a)",null,null,"String spare circuit"]
[null,null,"Switching and protection error","4 - STPIS Exclusion (3.3)(a)",null,null,"Other"]
[null,"Third party","Fire","5 - STPIS Exclusion (3.3)(a)"]
[null,null,"Other","6 - STPIS Exclusion (3.3)(a)"]
[null,null,"Dig-in","7 - STPIS Exclusion (3.3)(a)"]
[null,null,"Unauthorised access"]
[null,null,"Vehicle impact"]
[null,"Unknown","Unknown"]
[null,"Vegetation","Blow-in/Fall-in - NSP responsibility"]
[null,null,"Grow-in - NSP responsibility"]
[null,null,"Blow-in/Fall-in - Other responsible party"]
[null,null,"Grow-in - Other responsible party"]
[null,"Weather"]
[null,"2 - STPIS Exclusion (3.3)(a)"]
[null,"3 - STPIS Exclusion (3.3)(a)"]
[null,"4 - STPIS Exclusion (3.3)(a)"]
[null,"5 - STPIS Exclusion (3.3)(a)"]
[null,"6 - STPIS Exclusion (3.3)(a)"]
[null,"7 - STPIS Exclusion (3.3)(a)"]
[]
[]
[]
[]
[null,null,null,null,null,null,null,null,null,null,null,null,null,null,null,"The first row in these tables always refers to CRY in either it's financial or calendar format. "]
[null,null,null,null,null,null,null,null,null,null,null,null,null,null,null,"The correct column headings will be correctly generated in the relevant worksheets in Recast RIN templates"]
[]
[null,"These are indeces and lookup values for various dates. All step from the value placed in FRCP_y1 on the business and other details worksheet",null,null,null,null,null,null,null,null,null,null,null,null,"These date tables are currently used in the Recast templates to provide column headings and conditional formatting"]
[null,"dms_FRCPlength_Num_List","dms_FinalYear_List","dms_CRCPlength_Num_List","dms_CFinalYear_List","dms_FRCP_years",null,"dms_CRCP_years",null,"dms_CRCP_index",null,"dms_Financial_Years","dms_Calendar_Years",null,"CRY from input cell on business sheet","CRY - financial","dms_FinYears","CRY calendar","dms_CalYears"]
[null,1,"dms_FRCP_y1",1,"CRCP_y1",{"$f":"FRCP_y1","v":"2020-21"},"dms_FRCP_y1",{"$f":"IF(dms_RPT=\"financial\",VALUE(LEFT(dms_FRCP_y1,4)-1)&\"-\"&TEXT(VALUE(MID(dms_FRCP_y1,3,2)),\"00\"),VALUE(LEFT(dms_FRCP_y1,4)-1))","v":"2019-20"},"dms_CRCP_yZ",1,null,"2005-06","2006",null,{"$f":"CRY","v":{"$error":"#NAME?"}},{"$f":"CRY","v":{"$error":"#NAME?"}},"dms_CRYf_y1",{"$f":"CRY","v":{"$error":"#NAME?"}},"dms_CRYc_y1"]
[null,2,"dms_FRCP_y2",2,"CRCP_y2",{"$f":"IF(dms_RPT=\"financial\",VALUE(LEFT(dms_FRCP_y1,4)+1)&\"-\"&TEXT(VALUE(RIGHT(dms_FRCP_y1,2)+1),\"00\"),VALUE(LEFT(dms_FRCP_y1,4)+1))","v":"2021-22"},"dms_FRCP_y2",{"$f":"IF(dms_RPT=\"financial\",VALUE(LEFT(dms_CRCP_yZ,4)-1)&\"-\"&TEXT(VALUE(MID(dms_CRCP_yZ,3,2)),\"00\"),VALUE(LEFT(dms_CRCP_yZ,4)-1))","v":"2018-19"},"dms_CRCP_yY",2,null,"2006-07","2007",null,null,{"$f":"VALUE(LEFT(dms_CRYf_y1,4)+1)&\"-\"&TEXT(MID(dms_CRYf_y1,3,2)+2,\"00\")","v":{"$error":"#NAME?"}},"dms_CRYf_y2",{"$f":"VALUE(LEFT(dms_CRYc_y1,4)+1)","v":{"$error":"#NAME?"}},"dms_CRYc_y2"]
[null,3,"dms_FRCP_y3",3,"CRCP_y3",{"$f":"IF(dms_RPT=\"financial\",VALUE(LEFT(dms_FRCP_y2,4)+1)&\"-\"&TEXT(VALUE(RIGHT(dms_FRCP_y2,2)+1),\"00\"),VALUE(LEFT(dms_FRCP_y2,4)+1))","v":"2022-23"},"dms_FRCP_y3",{"$f":"IF(dms_RPT=\"financial\",VALUE(LEFT(dms_CRCP_yY,4)-1)&\"-\"&TEXT(VALUE(MID(dms_CRCP_yY,3,2)),\"00\"),VALUE(LEFT(dms_CRCP_yY,4)-1))","v":"2017-18"},"dms_CRCP_yX",3,null,"2007-08","2008",null,null,{"$f":"VALUE(LEFT(dms_CRYf_y2,4)+1)&\"-\"&TEXT(MID(dms_CRYf_y2,3,2)+2,\"00\")","v":{"$error":"#NAME?"}},"dms_CRYf_y3",{"$f":"VALUE(LEFT(dms_CRYc_y2,4)+1)","v":{"$error":"#NAME?"}},"dms_CRYc_y3"]
[null,4,"dms_FRCP_y4",4,"CRCP_y4",{"$f":"IF(dms_RPT=\"financial\",VALUE(LEFT(dms_FRCP_y3,4)+1)&\"-\"&TEXT(VALUE(RIGHT(dms_FRCP_y3,2)+1),\"00\"),VALUE(LEFT(dms_FRCP_y3,4)+1))","v":"2023-24"},"dms_FRCP_y4",{"$f":"IF(dms_RPT=\"financial\",VALUE(LEFT(dms_CRCP_yX,4)-1)&\"-\"&TEXT(VALUE(MID(dms_CRCP_yX,3,2)),\"00\"),VALUE(LEFT(dms_CRCP_yX,4)-1))","v":"2016-17"},"dms_CRCP_yW",4,null,"2008-09","2009",null,null,{"$f":"VALUE(LEFT(dms_CRYf_y3,4)+1)&\"-\"&TEXT(MID(dms_CRYf_y3,3,2)+2,\"00\")","v":{"$error":"#NAME?"}},"dms_CRYf_y4",{"$f":"VALUE(LEFT(dms_CRYc_y3,4)+1)","v":{"$error":"#NAME?"}},"dms_CRYc_y4"]
[null,5,"dms_FRCP_y5",5,"CRCP_y5",{"$f":"IF(dms_RPT=\"financial\",VALUE(LEFT(dms_FRCP_y4,4)+1)&\"-\"&TEXT(VALUE(RIGHT(dms_FRCP_y4,2)+1),\"00\"),VALUE(LEFT(dms_FRCP_y4,4)+1))","v":"2024-25"},"dms_FRCP_y5",{"$f":"IF(dms_RPT=\"financial\",VALUE(LEFT(dms_CRCP_yW,4)-1)&\"-\"&TEXT(VALUE(MID(dms_CRCP_yW,3,2)),\"00\"),VALUE(LEFT(dms_CRCP_yW,4)-1))","v":"2015-16"},"dms_CRCP_yV",5,null,"2009-10",2010,null,null,{"$f":"VALUE(LEFT(dms_CRYf_y4,4)+1)&\"-\"&TEXT(MID(dms_CRYf_y4,3,2)+2,\"00\")","v":{"$error":"#NAME?"}},"dms_CRYf_y5",{"$f":"VALUE(LEFT(dms_CRYc_y4,4)+1)","v":{"$error":"#NAME?"}},"dms_CRYc_y5"]
[null,6,"dms_FRCP_y6",6,"CRCP_y6",{"$f":"IF(dms_RPT=\"financial\",VALUE(LEFT(dms_FRCP_y5,4)+1)&\"-\"&TEXT(VALUE(RIGHT(dms_FRCP_y5,2)+1),\"00\"),VALUE(LEFT(dms_FRCP_y5,4)+1))","v":"2025-26"},"dms_FRCP_y6",{"$f":"IF(dms_RPT=\"financial\",VALUE(LEFT(dms_CRCP_yV,4)-1)&\"-\"&TEXT(VALUE(MID(dms_CRCP_yV,3,2)),\"00\"),VALUE(LEFT(dms_CRCP_yV,4)-1))","v":"2014-15"},"dms_CRCP_yU",6,null,"2010-11",2011,null,null,{"$f":"VALUE(LEFT(dms_CRYf_y5,4)+1)&\"-\"&TEXT(MID(dms_CRYf_y5,3,2)+2,\"00\")","v":{"$error":"#NAME?"}},"dms_CRYf_y6",{"$f":"VALUE(LEFT(dms_CRYc_y5,4)+1)","v":{"$error":"#NAME?"}},"dms_CRYc_y6"]
[null,7,"dms_FRCP_y7",7,"CRCP_y7",{"$f":"IF(dms_RPT=\"financial\",VALUE(LEFT(dms_FRCP_y6,4)+1)&\"-\"&TEXT(VALUE(RIGHT(dms_FRCP_y6,2)+1),\"00\"),VALUE(LEFT(dms_FRCP_y6,4)+1))","v":"2026-27"},"dms_FRCP_y7",{"$f":"IF(dms_RPT=\"financial\",VALUE(LEFT(dms_CRCP_yU,4)-1)&\"-\"&TEXT(VALUE(MID(dms_CRCP_yU,3,2)),\"00\"),VALUE(LEFT(dms_CRCP_yU,4)-1))","v":"2013-14"},"dms_CRCP_yT",7,null,"2011-12",2012,null,null,{"$f":"VALUE(LEFT(dms_CRYf_y6,4)+1)&\"-\"&TEXT(MID(dms_CRYf_y6,3,2)+2,\"00\")","v":{"$error":"#NAME?"}},"dms_CRYf_y7",{"$f":"VALUE(LEFT(dms_CRYc_y6,4)+1)","v":{"$error":"#NAME?"}},"dms_CRYc_y7"]
[null,8,"dms_FRCP_y8",8,"CRCP_y8",{"$f":"IF(dms_RPT=\"financial\",VALUE(LEFT(dms_FRCP_y7,4)+1)&\"-\"&TEXT(VALUE(RIGHT(dms_FRCP_y7,2)+1),\"00\"),VALUE(LEFT(dms_FRCP_y7,4)+1))","v":"2027-28"},"dms_FRCP_y8",{"$f":"IF(dms_RPT=\"financial\",VALUE(LEFT(dms_CRCP_yT,4)-1)&\"-\"&TEXT(VALUE(MID(dms_CRCP_yT,3,2)),\"00\"),VALUE(LEFT(dms_CRCP_yT,4)-1))","v":"2012-13"},"dms_CRCP_yS",8,null,"2012-13",2013,null,null,{"$f":"VALUE(LEFT(dms_CRYf_y7,4)+1)&\"-\"&TEXT(MID(dms_CRYf_y7,3,2)+2,\"00\")","v":{"$error":"#NAME?"}},"dms_CRYf_y8",{"$f":"VALUE(LEFT(dms_CRYc_y7,4)+1)","v":{"$error":"#NAME?"}},"dms_CRYc_y8"]
[null,9,"dms_FRCP_y9",9,"CRCP_y9",{"$f":"IF(dms_RPT=\"financial\",VALUE(LEFT(dms_FRCP_y8,4)+1)&\"-\"&TEXT(VALUE(RIGHT(dms_FRCP_y8,2)+1),\"00\"),VALUE(LEFT(dms_FRCP_y8,4)+1))","v":"2028-29"},"dms_FRCP_y9",{"$f":"IF(dms_RPT=\"financial\",VALUE(LEFT(dms_CRCP_yS,4)-1)&\"-\"&TEXT(VALUE(MID(dms_CRCP_yS,3,2)),\"00\"),VALUE(LEFT(dms_CRCP_yS,4)-1))","v":"2011-12"},"dms_CRCP_yR",9,null,"2013-14",2014,null,null,{"$f":"VALUE(LEFT(dms_CRYf_y8,4)+1)&\"-\"&TEXT(MID(dms_CRYf_y8,3,2)+2,\"00\")","v":{"$error":"#NAME?"}},"dms_CRYf_y9",{"$f":"VALUE(LEFT(dms_CRYc_y8,4)+1)","v":{"$error":"#NAME?"}},"dms_CRYc_y9"]
[null,10,"dms_FRCP_y10",10,"CRCP_y10",{"$f":"IF(dms_RPT=\"financial\",VALUE(LEFT(dms_FRCP_y9,4)+1)&\"-\"&TEXT(VALUE(RIGHT(dms_FRCP_y9,2)+1),\"00\"),VALUE(LEFT(dms_FRCP_y9,4)+1))","v":"2029-30"},"dms_FRCP_y10",{"$f":"IF(dms_RPT=\"financial\",VALUE(LEFT(dms_CRCP_yR,4)-1)&\"-\"&TEXT(VALUE(MID(dms_CRCP_yR,3,2)),\"00\"),VALUE(LEFT(dms_CRCP_yR,4)-1))","v":"2010-11"},"dms_CRCP_yQ",10,null,"2014-15",2015,null,null,{"$f":"VALUE(LEFT(dms_CRYf_y9,4)+1)&\"-\"&TEXT(MID(dms_CRYf_y9,3,2)+2,\"00\")","v":{"$error":"#NAME?"}},"dms_CRYf_y10",{"$f":"VALUE(LEFT(dms_CRYc_y9,4)+1)","v":{"$error":"#NAME?"}},"dms_CRYc_y10"]
[null,11,"dms_FRCP_y11",11,"CRCP_y11",{"$f":"IF(dms_RPT=\"financial\",VALUE(LEFT(dms_FRCP_y10,4)+1)&\"-\"&TEXT(VALUE(RIGHT(dms_FRCP_y10,2)+1),\"00\"),VALUE(LEFT(dms_FRCP_y10,4)+1))","v":"2030-31"},"dms_FRCP_y11",{"$f":"IF(dms_RPT=\"financial\",VALUE(LEFT(dms_CRCP_yQ,4)-1)&\"-\"&TEXT(VALUE(MID(dms_CRCP_yQ,3,2)),\"00\"),VALUE(LEFT(dms_CRCP_yQ,4)-1))","v":"2009-10"},"dms_CRCP_yP",11,null,"2015-16",2016,null,null,{"$f":"VALUE(LEFT(dms_CRYf_y10,4)+1)&\"-\"&TEXT(MID(dms_CRYf_y10,3,2)+2,\"00\")","v":{"$error":"#NAME?"}},"dms_CRYf_y11",{"$f":"VALUE(LEFT(dms_CRYc_y10,4)+1)","v":{"$error":"#NAME?"}},"dms_CRYc_y11"]
[null,12,"dms_FRCP_y12",12,"CRCP_y12",{"$f":"IF(dms_RPT=\"financial\",VALUE(LEFT(dms_FRCP_y11,4)+1)&\"-\"&TEXT(VALUE(RIGHT(dms_FRCP_y11,2)+1),\"00\"),VALUE(LEFT(dms_FRCP_y11,4)+1))","v":"2031-32"},"dms_FRCP_y12",{"$f":"IF(dms_RPT=\"financial\",VALUE(LEFT(dms_CRCP_yP,4)-1)&\"-\"&TEXT(VALUE(MID(dms_CRCP_yP,3,2)),\"00\"),VALUE(LEFT(dms_CRCP_yP,4)-1))","v":"2008-09"},"dms_CRCP_yO",12,null,"2016-17",2017,null,null,{"$f":"VALUE(LEFT(dms_CRYf_y11,4)+1)&\"-\"&TEXT(MID(dms_CRYf_y11,3,2)+2,\"00\")","v":{"$error":"#NAME?"}},"dms_CRYf_y12",{"$f":"VALUE(LEFT(dms_CRYc_y11,4)+1)","v":{"$error":"#NAME?"}},"dms_CRYc_y12"]
[null,13,"dms_FRCP_y13",13,"CRCP_y13",{"$f":"IF(dms_RPT=\"financial\",VALUE(LEFT(dms_FRCP_y12,4)+1)&\"-\"&TEXT(VALUE(RIGHT(dms_FRCP_y12,2)+1),\"00\"),VALUE(LEFT(dms_FRCP_y12,4)+1))","v":"2032-33"},"dms_FRCP_y13",{"$f":"IF(dms_RPT=\"financial\",VALUE(LEFT(dms_CRCP_yO,4)-1)&\"-\"&TEXT(VALUE(MID(dms_CRCP_yO,3,2)),\"00\"),VALUE(LEFT(dms_CRCP_yO,4)-1))","v":"2007-08"},"dms_CRCP_yN",13,null,"2017-18",2018,null,null,{"$f":"VALUE(LEFT(dms_CRYf_y12,4)+1)&\"-\"&TEXT(MID(dms_CRYf_y12,3,2)+2,\"00\")","v":{"$error":"#NAME?"}},"dms_CRYf_y13",{"$f":"VALUE(LEFT(dms_CRYc_y12,4)+1)","v":{"$error":"#NAME?"}},"dms_CRYc_y13"]
[null,14,"dms_FRCP_y14",14,"CRCP_y14",{"$f":"IF(dms_RPT=\"financial\",VALUE(LEFT(dms_FRCP_y13,4)+1)&\"-\"&TEXT(VALUE(RIGHT(dms_FRCP_y13,2)+1),\"00\"),VALUE(LEFT(dms_FRCP_y13,4)+1))","v":"2033-34"},"dms_FRCP_y14",{"$f":"IF(dms_RPT=\"financial\",VALUE(LEFT(dms_CRCP_yN,4)-1)&\"-\"&TEXT(VALUE(MID(dms_CRCP_yN,3,2)),\"00\"),VALUE(LEFT(dms_CRCP_yN,4)-1))","v":"2006-07"},"dms_CRCP_yM",14,null,"2018-19",2019,null,null,{"$f":"VALUE(LEFT(dms_CRYf_y13,4)+1)&\"-\"&TEXT(MID(dms_CRYf_y13,3,2)+2,\"00\")","v":{"$error":"#NAME?"}},"dms_CRYf_y14",{"$f":"VALUE(LEFT(dms_CRYc_y13,4)+1)","v":{"$error":"#NAME?"}},"dms_CRYc_y14"]
[null,15,"dms_FRCP_y15",15,"CRCP_y15",{"$f":"IF(dms_RPT=\"financial\",VALUE(LEFT(dms_FRCP_y14,4)+1)&\"-\"&TEXT(VALUE(RIGHT(dms_FRCP_y14,2)+1),\"00\"),VALUE(LEFT(dms_FRCP_y14,4)+1))","v":"2034-35"},"dms_FRCP_y15",{"$f":"IF(dms_RPT=\"financial\",VALUE(LEFT(dms_CRCP_yM,4)-1)&\"-\"&TEXT(VALUE(MID(dms_CRCP_yM,3,2)),\"00\"),VALUE(LEFT(dms_CRCP_yM,4)-1))","v":"2005-06"},"dms_CRCP_yL",15,null,"2019-20",2020,null,null,{"$f":"VALUE(LEFT(dms_CRYf_y14,4)+1)&\"-\"&TEXT(MID(dms_CRYf_y14,3,2)+2,\"00\")","v":{"$error":"#NAME?"}},"dms_CRYf_y15",{"$f":"VALUE(LEFT(dms_CRYc_y14,4)+1)","v":{"$error":"#NAME?"}},"dms_CRYc_y15"]
[null,null,null,null,null,null,null,null,null,null,null,"2020-21",2021,null,null,{"$f":"VALUE(LEFT(dms_CRYf_y15,4)+1)&\"-\"&TEXT(MID(dms_CRYf_y15,3,2)+2,\"00\")","v":{"$error":"#NAME?"}},"dms_CRYf_y16",{"$f":"VALUE(LEFT(dms_CRYc_y15,4)+1)","v":{"$error":"#NAME?"}},"dms_CRYc_y16"]
[null,"These are drop down lists for businesses to select the correct FRCP_y1 on the business and other details worksheet.\nThis also populates the column headings in the worksheets",null,null,null,null,null,null,null,null,null,"2021-22",2022,null,null,{"$f":"VALUE(LEFT(dms_CRYf_y16,4)+1)&\"-\"&TEXT(MID(dms_CRYf_y16,3,2)+2,\"00\")","v":{"$error":"#NAME?"}},"dms_CRYf_y17",{"$f":"VALUE(LEFT(dms_CRYc_y16,4)+1)","v":{"$error":"#NAME?"}},"dms_CRYc_y17"]
[null,"dms_RCP_fyear_list","dms_CRY_ListF","dms_CRY_ListC","dms_RCP_cyear_list","dms_FRCP_fyear_list","dms_FRCP_ListF","dms_FRCP_ListC","dms_FRCP_cyear_list",null,null,"2022-23",2023,null,null,{"$f":"VALUE(LEFT(dms_CRYf_y17,4)+1)&\"-\"&TEXT(MID(dms_CRYf_y17,3,2)+2,\"00\")","v":{"$error":"#NAME?"}},"dms_CRYf_y18",{"$f":"VALUE(LEFT(dms_CRYc_y17,4)+1)","v":{"$error":"#NAME?"}},"dms_CRYc_y18"]
[null,"dms_y1",{"$f":"CRY","v":{"$error":"#NAME?"}},"2006","dms_cy1","dms_frcp_fy1","2010-11",2011,"dms_crcp_cy1",null,null,"2023-24",2024,null,null,{"$f":"VALUE(LEFT(dms_CRYf_y18,4)+1)&\"-\"&TEXT(MID(dms_CRYf_y18,3,2)+2,\"00\")","v":{"$error":"#NAME?"}},"dms_CRYf_y19",{"$f":"VALUE(LEFT(dms_CRYc_y18,4)+1)","v":{"$error":"#NAME?"}},"dms_CRYc_y19"]
[null,"dms_y2",{"$f":"IF(dms_RPT=\"financial\",VALUE(LEFT(CRY,4)+1)&\"-\"&TEXT(MID(CRY,3,2)+2,\"00\"),VALUE(LEFT(CRY,4)+1))","v":{"$error":"#NAME?"}},"2007","dms_cy2","dms_frcp_fy2","2011-12",2012,"dms_crcp_cy2",null,null,"2024-25",2025,null,null,{"$f":"VALUE(LEFT(dms_CRYf_y19,4)+1)&\"-\"&TEXT(MID(dms_CRYf_y19,3,2)+2,\"00\")","v":{"$error":"#NAME?"}},"dms_CRYf_y20",{"$f":"VALUE(LEFT(dms_CRYc_y19,4)+1)","v":{"$error":"#NAME?"}},"dms_CRYc_y20"]
[null,"dms_y3",{"$f":"IF(dms_RPT=\"financial\",VALUE(LEFT(dms_fy2,4)+1)&\"-\"&TEXT(MID(dms_fy2,3,2)+2,\"00\"),VALUE(LEFT(dms_fy2,4)+1))","v":{"$error":"#NAME?"}},"2008","dms_cy3","dms_frcp_fy3","2012-13",2013,"dms_crcp_cy3",null,null,"2025-26",2026]
[null,"dms_y4",{"$f":"IF(dms_RPT=\"financial\",VALUE(LEFT(dms_fy3,4)+1)&\"-\"&TEXT(MID(dms_fy3,3,2)+2,\"00\"),VALUE(LEFT(dms_fy3,4)+1))","v":{"$error":"#NAME?"}},"2009","dms_cy4","dms_frcp_fy4","2013-14",2014,"dms_crcp_cy4",null,null,"2026-27",2027]
[null,"dms_y5",{"$f":"IF(dms_RPT=\"financial\",VALUE(LEFT(dms_fy4,4)+1)&\"-\"&TEXT(MID(dms_fy4,3,2)+2,\"00\"),VALUE(LEFT(dms_fy4,4)+1))","v":{"$error":"#NAME?"}},2010,"dms_cy5","dms_frcp_fy5","2014-15",2015,"dms_crcp_cy5",null,null,"2027-28",2028]
[null,"dms_y6",{"$f":"IF(dms_RPT=\"financial\",VALUE(LEFT(dms_fy5,4)+1)&\"-\"&TEXT(MID(dms_fy5,3,2)+2,\"00\"),VALUE(LEFT(dms_fy5,4)+1))","v":{"$error":"#NAME?"}},2011,"dms_cy6","dms_frcp_fy6","2015-16",2016,"dms_crcp_cy6",null,null,"2028-29",2029]
[null,"dms_y7",{"$f":"IF(dms_RPT=\"financial\",VALUE(LEFT(dms_fy6,4)+1)&\"-\"&TEXT(MID(dms_fy6,3,2)+2,\"00\"),VALUE(LEFT(dms_fy6,4)+1))","v":{"$error":"#NAME?"}},2012,"dms_cy7","dms_frcp_fy7","2016-17",2017,"dms_crcp_cy7",null,null,"2029-30",2030]
[null,"dms_y8",{"$f":"IF(dms_RPT=\"financial\",VALUE(LEFT(dms_fy7,4)+1)&\"-\"&TEXT(MID(dms_fy7,3,2)+2,\"00\"),VALUE(LEFT(dms_fy7,4)+1))","v":{"$error":"#NAME?"}},2013,"dms_cy8","dms_frcp_fy8","2017-18",2018,"dms_crcp_cy8",null,null,"2030-31",2031]
[null,"dms_y9",{"$f":"IF(dms_RPT=\"financial\",VALUE(LEFT(dms_fy8,4)+1)&\"-\"&TEXT(MID(dms_fy8,3,2)+2,\"00\"),VALUE(LEFT(dms_fy8,4)+1))","v":{"$error":"#NAME?"}},2014,"dms_cy9","dms_frcp_fy9","2018-19",2019,"dms_crcp_cy9",null,null,"2031-32",2032]
[null,"dms_y10",{"$f":"IF(dms_RPT=\"financial\",VALUE(LEFT(dms_fy9,4)+1)&\"-\"&TEXT(MID(dms_fy9,3,2)+2,\"00\"),VALUE(LEFT(dms_fy9,4)+1))","v":{"$error":"#NAME?"}},2015,"dms_cy10","dms_frcp_fy10","2019-20",2020,"dms_crcp_cy10",null,null,"2032-33",2033]
[null,"dms_y11",{"$f":"IF(dms_RPT=\"financial\",VALUE(LEFT(dms_fy10,4)+1)&\"-\"&TEXT(MID(dms_fy10,3,2)+2,\"00\"),VALUE(LEFT(dms_fy10,4)+1))","v":{"$error":"#NAME?"}},2016,"dms_cy11","dms_frcp_fy11","2020-21",2021,"dms_crcp_cy11",null,null,"2033-34",2034]
[null,"dms_y12",{"$f":"IF(dms_RPT=\"financial\",VALUE(LEFT(dms_fy11,4)+1)&\"-\"&TEXT(MID(dms_fy11,3,2)+2,\"00\"),VALUE(LEFT(dms_fy11,4)+1))","v":{"$error":"#NAME?"}},2017,"dms_cy12","dms_frcp_fy12","2021-22",2022,"dms_crcp_cy12",null,null,"2034-35",2035]
[null,"dms_y13",{"$f":"IF(dms_RPT=\"financial\",VALUE(LEFT(dms_fy12,4)+1)&\"-\"&TEXT(MID(dms_fy12,3,2)+2,\"00\"),VALUE(LEFT(dms_fy12,4)+1))","v":{"$error":"#NAME?"}},2018,"dms_cy13","dms_frcp_fy13","2022-23",2023,"dms_crcp_cy13",null,null,"2035-36",2036]
[null,"dms_y14",{"$f":"IF(dms_RPT=\"financial\",VALUE(LEFT(dms_fy13,4)+1)&\"-\"&TEXT(MID(dms_fy13,3,2)+2,\"00\"),VALUE(LEFT(dms_fy13,4)+1))","v":{"$error":"#NAME?"}},2019,"dms_cy14","dms_frcp_fy14","2023-24",2024,"dms_crcp_cy14"]
[null,"dms_y15",{"$f":"IF(dms_RPT=\"financial\",VALUE(LEFT(dms_fy14,4)+1)&\"-\"&TEXT(MID(dms_fy14,3,2)+2,\"00\"),VALUE(LEFT(dms_fy14,4)+1))","v":{"$error":"#NAME?"}},2020,"dms_cy15","dms_frcp_fy15","2024-25",2025,"dms_crcp_cy15"]
[null,"dms_y16",{"$f":"IF(dms_RPT=\"financial\",VALUE(LEFT(dms_fy15,4)+1)&\"-\"&TEXT(MID(dms_fy15,3,2)+2,\"00\"),VALUE(LEFT(dms_fy15,4)+1))","v":{"$error":"#NAME?"}},2021,"dms_cy16"]
[null,"dms_y17",{"$f":"IF(dms_RPT=\"financial\",VALUE(LEFT(dms_fy16,4)+1)&\"-\"&TEXT(MID(dms_fy16,3,2)+2,\"00\"),VALUE(LEFT(dms_fy16,4)+1))","v":{"$error":"#NAME?"}},2022,"dms_cy17"]
[null,"dms_y18",{"$f":"IF(dms_RPT=\"financial\",VALUE(LEFT(dms_fy17,4)+1)&\"-\"&TEXT(MID(dms_fy17,3,2)+2,\"00\"),VALUE(LEFT(dms_fy17,4)+1))","v":{"$error":"#NAME?"}},2023,"dms_cy18"]
[null,"dms_y19",{"$f":"IF(dms_RPT=\"financial\",VALUE(LEFT(dms_fy18,4)+1)&\"-\"&TEXT(MID(dms_fy18,3,2)+2,\"00\"),VALUE(LEFT(dms_fy18,4)+1))","v":{"$error":"#NAME?"}},2024,"dms_cy19"]
[null,"dms_y20",{"$f":"IF(dms_RPT=\"financial\",VALUE(LEFT(dms_fy19,4)+1)&\"-\"&TEXT(MID(dms_fy19,3,2)+2,\"00\"),VALUE(LEFT(dms_fy19)+1))","v":{"$error":"#NAME?"}},2025,"dms_cy20"]
[]
[]
[]
[]
[]
[null,"These \"row descriptions\" are the column headings in the various templates but become row descriptions in the ETL process"]
[null,null,"Table 6.3 sustained interruptions - row descriptions"]
[null,null,"dms_060301_CustNo_Affected_Row","dms_060301_Avg_Duration_Sustained_Int_Row","dms_060301_Effect_unplanned_SAIDI_Row","dms_060301_Effect_unplanned_SAIFI_Row"]
[null,null,"Number of customers affected by the interruption","Average duration of sustained customer interruption","Effect on unplanned SAIDI","Effect on unplanned SAIFI"]
[]
[]
[]
[null,null,"Table 6.1 telephone answering - row descriptions and start date"]
[null,null,"dms_060101_Rows","dms_060102_Rows","dms_060101_StartDateTxt"]
[null,null,"Total number of calls \n(after removing excluded events)","Number of calls answered within 30 seconds \n(after excluding excluded events) ",{"$f":"dms_060701_StartDateTxt","v":"1-Jul-2013"}]
[]
[]
[]
[null,null,null,null,null,null,null,"dms_0603_FeederList",{"$f":"INDEX(dms_FeederName_1,MATCH(dms_TradingName,dms_TradingName_List))","v":"CBD"},{"$f":"INDEX(dms_FeederName_2,MATCH(dms_TradingName,dms_TradingName_List))","v":"Urban"},{"$f":"INDEX(dms_FeederName_3,MATCH(dms_TradingName,dms_TradingName_List))","v":"Short rural"},{"$f":"INDEX(dms_FeederName_4,MATCH(dms_TradingName,dms_TradingName_List))","v":"Long rural"}]
[null,null,"Table 6.7.1 - daily performance data - unplanned - MAIFI  -- row descriptions and header named range values"]
[null,null,"These headings (Lists) are determined from the INDEX/MATCH function on the NSP selected on the Business & other details sheet"]
[null,"dms_060701_Feeder_Header_Lvl4",{"$f":"INDEX(dms_FeederName_1,MATCH(dms_TradingName,dms_TradingName_List))","v":"CBD"},{"$f":"INDEX(dms_FeederName_1,MATCH(dms_TradingName,dms_TradingName_List))","v":"CBD"},{"$f":"INDEX(dms_FeederName_2,MATCH(dms_TradingName,dms_TradingName_List))","v":"Urban"},{"$f":"INDEX(dms_FeederName_2,MATCH(dms_TradingName,dms_TradingName_List))","v":"Urban"},{"$f":"INDEX(dms_FeederName_3,MATCH(dms_TradingName,dms_TradingName_List))","v":"Short rural"},{"$f":"INDEX(dms_FeederName_3,MATCH(dms_TradingName,dms_TradingName_List))","v":"Short rural"},{"$f":"INDEX(dms_FeederName_4,MATCH(dms_TradingName,dms_TradingName_List))","v":"Long rural"},{"$f":"INDEX(dms_FeederName_4,MATCH(dms_TradingName,dms_TradingName_List))","v":"Long rural"},{"$f":"IF((INDEX(dms_FeederName_5,MATCH(dms_TradingName,dms_TradingName_List))=0),\"Network\",(INDEX(dms_FeederName_5,MATCH(dms_TradingName,dms_TradingName_List))))","v":"Network"},{"$f":"IF((INDEX(dms_FeederName_5,MATCH(dms_TradingName,dms_TradingName_List))=0),\"Network\",(INDEX(dms_FeederName_5,MATCH(dms_TradingName,dms_TradingName_List))))","v":"Network"},"Network","Network"]
[]
[null,"dms_060701_Rows","All events","After removing excluded events","All events","After removing excluded events","All events","After removing excluded events","All events","After removing excluded events","All events","After removing excluded events","All events","After removing excluded events"]
[null,null,"the number of column headings changes from 10 to 12 depending on the number of feeder categories for the NSP"]
[]
[]
[]
[]
[null,null,"Table 6.8.1 - row descriptions"]
[null,null,"dms_060801_01_Rows","dms_060801_02_Rows","dms_060801_03_Rows","dms_060801_04_Rows"]
[null,null,"Number of interruptions","Duration of interruptions","Total unplanned minutes off supply","Effect on unplanned MAIFI"]
[]
[]
[]
[]
[null,null,"Table 7.9.4 - market impact component - row descriptions"]
[null,"dms_070904_01_Rows","without exclusions","with exclusions"]
[]
[]
[]
[]
[]
[null,null,"Use this to add to existing files"]
[null,null,"ARRs 6.7 STPIS daily performance"]
[null,null,"dms_060101_Values","dms_060102_Values","dms_060701_Values"]
[null,null,"dms_LeapYear"]
[]
[null,null,"ARR's  6.8 STPIS exclusions"]
[null,null,"dms_060801_Event_Date","dms_060801_OutageID","dms_060801_FeederID","dms_060801_FeederClass","dms_060801_CauseID","dms_060801_01_Values","dms_060801_02_Values","dms_060801_03_Values","dms_060801_Excl_Cat","dms_060801_04_Values"]
[null,null,"dms_060801_StartCell"]
[]
[null,null,"CA 6.3 sustained interruptions"]
[null,null,"dms_060301_Event_Date","dms_060301_Event_Time","dms_060301_AssetID","dms_060301_FeederClass","dms_060301_Reason","dms_060301_DetailedReason","dms_060301_CustNo_Affected_Values","dms_060301_Avg_Duration_Sustained_Int_Values","dms_060301_Effect_unplanned_SAIDI_Values","dms_060301_Effect_unplanned_SAIFI_Values","dms_060301_MED"]

{"sheet":"Instructions","index":2,"n_rows":27,"n_cols":4,"rows_kept":27,"cut":false,"hidden":false,"merged":[[7,1,8,1],[7,2,7,3],[8,2,8,4],[1,1,1,4],[2,1,2,4],[3,1,3,4],[4,1,4,4],[5,2,5,4],[18,1,24,1],[18,2,18,4],[26,2,26,4],[10,2,10,4],[12,1,14,1],[12,2,12,4],[13,2,13,3],[14,2,14,4],[16,2,16,4]]}
[]
[null,{"$f":"CONCATENATE(dms_Sector,\" \",dms_Segment,\" \", \"Network Service Provider\")","v":"Gas Distribution Network Service Provider"}]
[null,{"$f":"IF(dms_Model=\"Reset\",\"Regulatory Proposal RIN Template\",\"Annual Reporting RIN\")","v":"Regulatory Proposal RIN Template"}]
[null,{"$f":"CONCATENATE(\"This template is to be used by \",dms_TradingNameFull,\" to fulfil its reporting obligations to the AER.\")","v":"This template is to be used by Jemena Gas Networks (NSW) Ltd to fulfil its reporting obligations to the AER."}]
[null,"INSTRUCTIONS"]
[null,"GENERAL","Complete the Business & other details worksheet before entering data or values in any other worksheets. The Business & other details worksheet is linked to other worksheets within the workbook and automatically generates certain column headings and conditional formatting."]
[]
[null,"CONFIDENTIAL INFORMATION","\nPlease use the macro at the top of each \nworksheet to identify confidential information\nin the confidential workbook. \n\n"]
[null,null,"-Do this by selecting the cell or cells that contain confidential information and then run the Mark selection as CONFIDENTIAL macro. This will format the cells a specific colour that is identified by the AER's database which in turn marks that information as confidential.\n\n-To reverse this, select the cell or cells and run the Return selection to NON-CONFIDENTIAL macro."]
[]
[null,"RESPONSES","\nPlease return two (2) files to the AER: \n\n1. A confidential version which must contain a complete set of all responses with confidential information marked using the Mark selection CONFIDENTIAL macro and which has been completed using the locked template file provided by the AER. \n\n2. A public version with confidential information either removed completely or aggregated in some form together with writtten consent to disclose the public version of the response.\n\nUse the drop down box on the Business and other details worksheet to identify the file as either confidential ('consolidated') or public. "]
[]
[null,"AMENDMENTS","\nIf an NSP wishes to correct data previously submitted to the AER it should resubmit that data using the original completed submission as the starting point. Please make any necessary changes to the data. Data that is not being amended should be left unchanged. \n\nNSPs must identify the reason for the amendments in the Amendment Reason box on the  Business and other details worksheet. NSPs may provide further details regarding any amendments in the Amendments worksheet. \n\n."]
[null,null,"NSP may use Amended Data macro \nto highlight cells that contain amended data.\nNB: if data is also CONFIDENTIAL, re-apply \nthe Confidentiality macro after applying the \nAmended macro"]
[null,null,"Please resubmit two (2) files - a confidential version and a public version of the amended submission to the AER"]
[]
[null,"UNITS OF MEASURE","\nAll amounts are to be unrounded and reported on a one for one basis: that is 1000 is to be entered as '1000'. Applicable units of measure may be identified in the table column headings or row descriptors.\n\n"]
[]
[null,"INPUT / NON-INPUT CELLS"]
[null,null,null,"Yellow = Input cell (mandatory)"]
[null,null,null,"Darker yellow = input cell (mandatory)"]
[null,null,null,"Orange = input cell (if data available)"]
[null,null,null,"Grey = Not applicable/No inputs required"]
[null,null,null," \nPLEASE DO NOT ENTER TEXT into cells that are to contain numeric data."]
[]
[]
[null,"NAVIGATION","\nMany tables in the worksheets have been \"grouped\" to allow for easy navigation. To ungroup or group data use the outline symbols in the left margin (for Row groupings) or above the columns (for column groupings). \n\n\n\n"]

{"sheet":"CONTENTS","index":3,"n_rows":31,"n_cols":4,"rows_kept":31,"cut":false,"hidden":false,"merged":[[2,2,2,3]]}
[]
[]
[null,null,"CONTENTS"]
[]
[null,null,"SUBMISSION","Business & other details"]
[]
[null,null,"EXPENDITURE","E1. Expenditure Summary"]
[null,null,null,"E2. Mains Repex"]
[null,null,null,"E3. Mains Augex"]
[null,null,null,"E4. Meter replacement"]
[null,null,null,"E5. New Connections"]
[null,null,null,"E6. Non-network"]
[null,null,null,"E10. Overheads"]
[null,null,null,"E11. Labour"]
[null,null,null,"E12. ICT"]
[null,null,null,"E13. Other capex"]
[null,null,null,"E17. Step changes"]
[null,null,null,"E20. Opex"]
[null,null,null,"E21. ARS"]
[null,null,null,"E25. Escalators"]
[]
[null,null,"NETWORK","N1.1. Demand - by customer type"]
[null,null,null,"N1.2. Demand - by tariff"]
[null,null,null,"N2. Network characteristcs"]
[]
[null,null,"SERVICE","S1.1. Customer numbers - by customer type"]
[null,null,null,"S1.2. Customer numbers - by tariff"]
[null,null,null,"S11. Network reliability"]
[]
[null,null,"FINANCIAL","F3. Revenue"]
[null,null,null,"F8. WACC inputs"]

{"sheet":"Business & other details","index":4,"n_rows":157,"n_cols":9,"rows_kept":157,"cut":false,"hidden":false,"merged":[[7,1,7,8],[10,1,10,8],[12,2,12,4],[13,2,13,4],[16,2,16,3],[16,4,16,7],[9,1,9,8],[59,2,59,8],[17,4,17,7],[18,2,18,3],[18,4,18,7],[21,2,21,3],[21,4,21,7],[22,4,22,7],[23,2,23,3],[23,4,23,7],[31,1,31,8],[56,2,56,3],[57,4,57,8],[58,4,58,8]]}
[null,{"$f":"IF(dms_DataQuality=\"backcast\",INDEX(dms_Worksheet_List,MATCH(dms_Model,dms_Model_List))&\" BACKCAST\",INDEX(dms_Worksheet_List,MATCH(dms_Model,dms_Model_List)))","v":"REGULATORY REPORTING STATEMENT"}]
[null,{"$f":"INDEX(dms_TradingNameFull_List,MATCH(dms_TradingName,dms_TradingName_List))","v":"Jemena Gas Networks (NSW) Ltd"}]
[null,{"$f":"IF(SUM(dms_SingleYear_Model)>0,CONCATENATE(CRY),CONCATENATE(FRCP_y1,\" to \",dms_MultiYear_FinalYear_Result))","v":"2020-21 to 2024-25"}]
[null,"BUSINESS & OTHER DETAILS"]
[]
[]
[null,"Instructions"]
[null,"Complete the following business details regulatory template before entering data or values in any other regulatory template. This regulatory template is linked to other cells within the spreadsheet and automatically generates column headings and conditional formatting to distinguish business specific input and non-input cells. "]
[]
[null,"SUBMISSION PARTICULARS INPUT SHEET"]
[null,"ENTITY DETAILS"]
[]
[null,"Short name","JGN",null,null,"Select business name from drop down list first"]
[null,"ACN / ABN",{"$f":"INDEX(dms_ABN_List,MATCH(dms_TradingName,dms_TradingName_List))","v":"003 004 322"}]
[]
[]
[null,"Business address","Address 1",null,"Level 14, 99 Walker Street"]
[null,null,null,"Address 2"]
[null,null,"Suburb",null,"North Sydney"]
[null,null,null,"State","NSW","p/code",2060]
[]
[null,"Postal address","Address 1"]
[null,null,null,"Address 2",{"$f":"IF(ISBLANK(INDEX(dms_PAddr2_List,MATCH(dms_TradingName,dms_TradingName_List))),\"\",(INDEX(dms_PAddr2_List,MATCH(dms_TradingName,dms_TradingName_List))))","v":""}]
[null,null,"Suburb"]
[null,null,null,"State",null,"p/code"]
[]
[]
[null,"Contact name/s","Ms Ana Dijanosic"]
[null,"Contact phone/s"]
[null,"Contact email address/s","Ana.Dijanosic@jemena.com.au"]
[]
[null,"REGULATORY CONTROL PERIODS"]
[null,null,"FRPC_y1","FRCP_y2","FRPC_y3","FRCP_y4","FRCP_y5"]
[null,"Forthcoming regulatory control period","2020-21",{"$f":"dms_FRCP_y2","v":"2021-22"},{"$f":"dms_FRCP_y3","v":"2022-23"},{"$f":"dms_FRCP_y4","v":"2023-24"},{"$f":"dms_FRCP_y5","v":"2024-25"}]
[null,null,{"$f":"dms_FRCP_y6","v":"2025-26"},{"$f":"dms_FRCP_y7","v":"2026-27"},{"$f":"dms_FRCP_y8","v":"2027-28"},{"$f":"dms_FRCP_y9","v":"2028-29"},{"$f":"dms_FRCP_y10","v":"2029-30"}]
[]
[null,null,"CRPC_y1","CRCP_y2","CRPC_y3","CRCP_y4","CRCP_y5"]
[null,"Current regulatory control period",{"$f":"dms_CRCP_FirstYear_Result","v":"2015-16"},{"$f":"IF(dms_RPT=\"financial\",VALUE(LEFT(CRCP_y1,4)+1)&\"-\"&TEXT(MID(CRCP_y1,3,2)+2,\"00\"),VALUE(LEFT(CRCP_y1,4)+1))","v":"2016-17"},{"$f":"IF(dms_RPT=\"financial\",VALUE(LEFT(CRCP_y1,4)+2)&\"-\"&TEXT(VALUE(MID(CRCP_y1,3,2)+3),\"00\"),VALUE(LEFT(CRCP_y1,4)+2))","v":"2017-18"},{"$f":"IF(dms_RPT=\"financial\",VALUE(LEFT(CRCP_y1,4)+3)&\"-\"&TEXT(MID(CRCP_y1,3,2)+4,\"00\"),VALUE(LEFT(CRCP_y1,4)+3))","v":"2018-19"},{"$f":"IF(dms_RPT=\"financial\",VALUE(LEFT(CRCP_y1,4)+4)&\"-\"&TEXT(MID(CRCP_y1,3,2)+5,\"00\"),VALUE(LEFT(CRCP_y1,4)+4))","v":"2019-20"}]
[null,null,{"$f":"IF(dms_RPT=\"financial\",VALUE(LEFT(CRCP_y1,4)+5)&\"-\"&TEXT(MID(CRCP_y1,3,2)+6,\"00\"),VALUE(LEFT(CRCP_y1,4)+5))","v":"2020-21"},{"$f":"IF(dms_RPT=\"financial\",VALUE(LEFT(CRCP_y1,4)+6)&\"-\"&TEXT(MID(CRCP_y1,3,2)+7,\"00\"),VALUE(LEFT(CRCP_y1,4)+6))","v":"2021-22"},{"$f":"IF(dms_RPT=\"financial\",VALUE(LEFT(CRCP_y1,4)+7)&\"-\"&TEXT(MID(CRCP_y1,3,2)+8,\"00\"),VALUE(LEFT(CRCP_y1,4)+7))","v":"2022-23"},{"$f":"IF(dms_RPT=\"financial\",VALUE(LEFT(CRCP_y1,4)+8)&\"-\"&TEXT(MID(CRCP_y1,3,2)+9,\"00\"),VALUE(LEFT(CRCP_y1,4)+8))","v":"2023-24"},{"$f":"IF(dms_RPT=\"financial\",VALUE(LEFT(CRCP_y1,4)+9)&\"-\"&TEXT(MID(CRCP_y1,3,2)+10,\"00\"),VALUE(LEFT(CRCP_y1,4)+9))","v":"2024-25"}]
[null,null,{"$f":"IF(dms_RPT=\"financial\",VALUE(LEFT(CRCP_y1,4)+10)&\"-\"&TEXT(MID(CRCP_y1,3,2)+11,\"00\"),VALUE(LEFT(CRCP_y1,4)+10))","v":"2025-26"},{"$f":"IF(dms_RPT=\"financial\",VALUE(LEFT(CRCP_y1,4)+11)&\"-\"&TEXT(MID(CRCP_y1,3,2)+12,\"00\"),VALUE(LEFT(CRCP_y1,4)+11))","v":"2026-27"},{"$f":"IF(dms_RPT=\"financial\",VALUE(LEFT(CRCP_y1,4)+12)&\"-\"&TEXT(MID(CRCP_y1,3,2)+13,\"00\"),VALUE(LEFT(CRCP_y1,4)+12))","v":"2027-28"},{"$f":"IF(dms_RPT=\"financial\",VALUE(LEFT(CRCP_y1,4)+13)&\"-\"&TEXT(MID(CRCP_y1,3,2)+14,\"00\"),VALUE(LEFT(CRCP_y1,4)+13))","v":"2028-29"},{"$f":"IF(dms_RPT=\"financial\",VALUE(LEFT(CRCP_y1,4)+14)&\"-\"&TEXT(MID(CRCP_y1,3,2)+15,\"00\"),VALUE(LEFT(CRCP_y1,4)+14))","v":"2029-30"}]
[]
[null,null,"PRCP_y1","PRCP_y2","PRCP_y3","PRCP_y4","PRCP_y5"]
[null,"Previous regulatory control period",{"$f":"IF(dms_RPT=\"financial\",VALUE(LEFT(PRCP_y2,4)-1)&\"-\"&TEXT(VALUE(MID(PRCP_y2,3,2)),\"00\"),VALUE(LEFT(PRCP_y2,4)-1))","v":"2010-11"},{"$f":"IF(dms_RPT=\"financial\",VALUE(LEFT(PRCP_y3,4)-1)&\"-\"&TEXT(VALUE(MID(PRCP_y3,3,2)),\"00\"),VALUE(LEFT(PRCP_y3,4)-1))","v":"2011-12"},{"$f":"IF(dms_RPT=\"financial\",VALUE(LEFT(PRCP_y4,4)-1)&\"-\"&TEXT(VALUE(MID(PRCP_y4,3,2)),\"00\"),VALUE(LEFT(PRCP_y4,4)-1))","v":"2012-13"},{"$f":"IF(dms_RPT=\"financial\",VALUE(LEFT(PRCP_y5,4)-1)&\"-\"&TEXT(VALUE(RIGHT(PRCP_y5,2)-1),\"00\"),VALUE(LEFT(PRCP_y5,4)-1))","v":"2013-14"},{"$f":"IF(dms_RPT=\"financial\",VALUE(LEFT(CRCP_y1,4)-1)&\"-\"&TEXT(VALUE(RIGHT(CRCP_y1,2)-1),\"00\"),VALUE(LEFT(CRCP_y1,4)-1))","v":"2014-15"}]
[]
[]
[]
[null,"Commencing regulatory year","2010-11","CRY"]
[]
[null,"Last completed regulatory year","2017-18","dms_FinalYear"]
[]
[]
[]
[null,null,"IF THIS IS AN ABC RIN - make sure the the named range CRY is applied and the named range dms_dollar_nom_UOM is applied"]
[null,null,"IF THIS IS A RESET RIN - make sure the named ranges CRY and dms_dollar_nom_UOM are NOT present in the workbook"]
[null,null,"FOR ABC RINS THAT SPAN MULTIPLE YEARS - make sure MultiYear Flag is set and final year entered as required"]
[]
[null,"Source","Regulatory proposal",null,"Please select the correct submission type from the dropdown list."]
[null,"Data quality (actual, estimate, consolidated)","Consolidated"]
[null,"Confidentiality Status (public, confidential)","Confidential"]
[null,"Amended RIN submission - amendment reason","."]
[null,"Submission Date","2019-06-28","dms_SubmissionDate","Please enter date this file submitted to AER (dd/mm/yyyy)"]
[null,"EBSS - First application of scheme in forthcoming period?","No"]
[null,"Data ingestion data quality",{"$f":"IF(dms_DQ_2=\"Confidential\",\"Consolidated\",\"Public\")","v":"Consolidated"},"dms_DataQuality","=IF(dms_DQ_2=\"Confidential\",\"Consolidated\",\"Public\")"]
[null,"Sector",{"$f":"INDEX(dms_Sector_List,MATCH(dms_TradingName,dms_TradingName_List))","v":"Gas"},"dms_Sector","=INDEX(dms_Sector_List,MATCH(dms_TradingName,dms_TradingName_List))"]
[null,"Segment",{"$f":"INDEX(dms_Segment_List,MATCH(dms_TradingName,dms_TradingName_List))","v":"Distribution"},"dms_Segment","=INDEX(dms_Segment_List,MATCH(dms_TradingName,dms_TradingName_List))"]
[null,"Regulatory Year Ending",{"$f":"IF(dms_MultiYear_Flag=1,LEFT(dms_Specified_FinalYear,2)&RIGHT(dms_Specified_FinalYear,2),INDEX(dms_RYE_Formula_Result,MATCH(dms_Model,dms_Model_List)))","v":"2025"},"dms_RYE","=IF(dms_MultiYear_Flag=1,LEFT(dms_Specified_FinalYear,2)&RIGHT(dms_Specified_FinalYear,2),INDEX(dms_RYE_Formula_Result,MATCH(dms_Model,dms_Model_List)))"]
[null,"Reporting Period Type",{"$f":"INDEX(dms_RPT_List,MATCH(dms_TradingName,dms_TradingName_List))","v":"Financial"},"dms_RPT","=INDEX(dms_RPT_List,MATCH(dms_TradingName,dms_TradingName_List))"]
[null,"Model or RIN Type","Reset","dms_Model","Drop down selection"]
[null,"EB/CA Unit of Measure for Monetary Values","$0s","dms_dollar_nom_UOM","If the cover sheet is attached to an ABC RIN apply the NAMED RANGE to the cell"]
[null,"Security Classification","Public","dms_Classification","Always Public"]
[null,"Jurisdiction",{"$f":"INDEX(dms_JurisdictionList,MATCH(dms_TradingName,dms_TradingName_List))","v":"NSW"},"dms_Jurisdiction","=INDEX(dms_JurisdictionList,MATCH(dms_TradingName,dms_TradingName_List))"]
[null,"FORECAST and MultiYear RINS"]
[null,"CRY-1  (last full calendar year before CRY)",{"$f":"IF(dms_RPT=\"financial\",VALUE(LEFT(dms_SingleYear_FinalYear_Result,4)),VALUE(LEFT(dms_SingleYear_FinalYear_Result,4)-1))","v":{"$error":"#VALUE!"}},"dms_Cal_Year_B4_CRY","'=IF(dms_RPT=\"financial\",VALUE(LEFT(dms_SingleYear_FinalYear_Result,4)),VALUE(LEFT(dms_SingleYear_FinalYear_Result,4)-1))"]
[null,"Dollar $ real month",{"$f":"INDEX(dms_RPTMonth_List,MATCH(dms_TradingName,dms_TradingName_List))","v":"June"},"dms_RPTMonth","=INDEX(dms_RPTMonth_List,MATCH(dms_TradingName,dms_TradingName_List))"]
[null,"Dollar $ real  (the last month before the FRCP_y1)",{"$f":"IF(SUM(dms_SingleYear_Model)>0,CONCATENATE(dms_RPTMonth)&\" \"&VALUE((LEFT(CRY,2))&RIGHT(CRY,2)),CONCATENATE(dms_RPTMonth)&\" \"&VALUE((LEFT(dms_CRCP_FinalYear_Result,2)&RIGHT(dms_CRCP_FinalYear_Result,2))))","v":"June 2020"},"dms_DollarReal","=IF(SUM(dms_SingleYear_Model)>0,CONCATENATE(dms_RPTMonth)&\" \"&VALUE((LEFT(CRY,2))&RIGHT(CRY,2)),CONCATENATE(dms_RPTMonth)&\" \"&VALUE((LEFT(dms_CRCP_FinalYear_Result,2)&RIGHT(dms_CRCP_FinalYear_Result,2))))"]
[null,"Dollar $ real previous year (PRCP_y5)",{"$f":"IF(SUM(dms_SingleYear_Model)>0,CONCATENATE(dms_RPTMonth)&\" \"&VALUE(((LEFT(CRY,2))&RIGHT(CRY,2))-1),CONCATENATE(dms_RPTMonth)&\" \"&VALUE(((LEFT(dms_CRCP_FirstYear_Result,2)&RIGHT(dms_CRCP_FirstYear_Result,2))))-1)","v":"June 2015"},"dms_DollarReal_Prev","=IF(SUM(dms_SingleYear_Model)>0,CONCATENATE(dms_RPTMonth)&\" \"&VALUE(((LEFT(CRY,2))&RIGHT(CRY,2))-1),CONCATENATE(dms_RPTMonth)&\" \"&VALUE(((LEFT(dms_CRCP_FirstYear_Result,2)&RIGHT(dms_CRCP_FirstYear_Result,2))))-1)"]
[null,"This block works out the various RYE's for ALL RIN types and MODELS"]
[null,"Single Year Model T/F",{"$f":"IF(dms_Model=\"EB\",1,0)","v":0},"dms_EB"]
[null,null,{"$f":"IF(dms_Model=\"CA\",1,0)","v":0},"dms_CA","=dms_SingleYear_Model"]
[null,null,{"$f":"IF(dms_Model=\"ARR\",1,0)","v":0},"dms_ARR"]
[null,"Is this a single Year RIN?",{"$f":"IF(SUM(dms_SingleYear_Model)=1,\"yes\",\"no\")","v":"no"},"dms_SingleYearModel","=IF(SUM(dms_SingleYear_Model)=1,\"yes\",\"no\")"]
[null,"Single Year Final Year Reference","CRY","dms_SingleYear_FinalYear_Ref","This is the reference for EB, CA & ARR RINs"]
[null,"Single Year Final Year Result",{"$f":"IFERROR(IF(SUM(dms_SingleYear_Model)<>0,(INDIRECT(dms_SingleYear_FinalYear_Ref)),\"not a single year RIN\"),\"CRY not present\")","v":"not a single year RIN"},"dms_SingleYear_FinalYear_Result","=IFERROR(IF(SUM(dms_SingleYear_Model)<>0,(INDIRECT(dms_SingleYear_FinalYear_Ref)),\"not a single year RIN\"),\"CRY not present\")"]
[null,"FRCP length in years",{"$f":"INDEX(dms_FRCPlength_List,MATCH(dms_TradingName,dms_TradingName_List))","v":5},"dms_FRCPlength_Num","=INDEX(dms_FRCPlength_List,MATCH(dms_TradingName,dms_TradingName_List))"]
[null,"Multi Year Final Year Reference",{"$f":"INDEX(dms_FinalYear_List,MATCH(dms_FRCPlength_Num,dms_FRCPlength_Num_List))","v":"dms_FRCP_y5"},"dms_MultiYear_FinalYear_Ref","=INDEX(dms_FinalYear_List,MATCH(dms_FRCPlength_Num,dms_FRCPlength_Num_List))"]
[null,"Multi Year Final Year Result",{"$f":"IF(dms_MultiYear_Flag=0,INDIRECT(dms_MultiYear_FinalYear_Ref),dms_Specified_FinalYear)","v":"2024-25"},"dms_MultiYear_FinalYear_Result","=IF(dms_MultiYear_Flag=0,INDIRECT(dms_MultiYear_FinalYear_Ref),dms_Specified_FinalYear)",null,null,null,"Formula errors OK"]
[null,"CRCP length in years",{"$f":"INDEX(dms_CRCPlength_List,MATCH(dms_TradingName,dms_TradingName_List))","v":5},"dms_CRCPlength_Num","=INDEX(dms_CRCPlength_List,MATCH(dms_TradingName,dms_TradingName_List))"]
[null,"CRCP Final Year Reference",{"$f":"INDEX(dms_CFinalYear_List,MATCH(dms_CRCPlength_Num,dms_CRCPlength_Num_List))","v":"CRCP_y5"},"dms_CRCP_FinalYear_Ref","=INDEX(dms_CFinalYear_List,MATCH(dms_CRCPlength_Num,dms_CRCPlength_Num_List))"]
[null,"CRCP First Year Result",{"$f":"INDEX(dms_CRCP_years,MATCH(dms_CRCPlength_Num,dms_CRCP_index))","v":"2015-16"},"dms_CRCP_FirstYear_Result","=INDEX(dms_CRCP_years,MATCH(dms_CRCPlength_Num,dms_CRCP_index))"]
[null,"CRCP Final Year Result",{"$f":"IF(dms_MultiYear_Flag=0,(IF(SUM(dms_SingleYear_Model)>0,CRY,dms_CRCP_yZ)),dms_Specified_FinalYear)","v":"2019-20"},"dms_CRCP_FinalYear_Result","=IF(dms_MultiYear_Flag=0,(IF(SUM(dms_SingleYear_Model)>0,CRY,dms_CRCP_yZ)),dms_Specified_FinalYear)"]
[null,"PTRM/ RFMs"]
[null,"Form of control",{"$f":"INDEX(dms_FormControl_List,MATCH(dms_TradingName,dms_TradingName_List))","v":"Weighted average price cap"},"dms_FormControl","=INDEX(dms_FormControl_List,MATCH(dms_TradingName,dms_TradingName_List))"]
[null,"ABC RINS THAT SPAN MULTIPLE YEARS"]
[null,"Is this a multi year ABC RIN?","No"]
[null,"Multiyear EB, CA or ARR?",{"$f":"IF(dms_MultiYear_ResponseFlag=\"No\",0,1)","v":0},"dms_MultiYear_Flag","This is set from the answer provided above"]
[null,null,{"$f":"IF(dms_MultiYear_Flag=1,FRY,\"not a Multiple year submission\")","v":"not a Multiple year submission"},"dms_Specified_FinalYear","The result here is returned to dms_CRCP_FinalYear_Result if response to Q in C73 is \"yes\" and dms_MultiYear_Flag is set to 1"]
[null," Start year for 5.2 in Multi year ABC RINS",{"$f":"IFERROR(IF(dms_MultiYear_Flag=1,FRY,CRY),\"not an ABC\")","v":"not an ABC"},"dms_0502_Inst_Year","=IF(dms_MultiYear_Flag=1,FRY,CRY)",null,"For single year RINS this is CRY - multi year RINS need to start a the end of the span of years (ie. FRY)"]
[null,"EB RINS"]
[null,"Calendar Year for table 3.6 data",{"$f":"IF(dms_MultiYear_Flag=0,CRY, FRY)","v":{"$error":"#NAME?"}},"dms_0306_Year","=IF(dms_MultiYear_Flag=0,CRY, FRY)"]
[null,"CA RINS"]
[null,"Find how many rows in tables 6.3 sustained interruptions?",null,null,"dms_060301_MaxRows only returns a valid value when cover sheet is attached to a CA file"]
[null,null,{"$f":"IF(dms_Model<>\"CA\",\"not a CA\",\"Is a CA\")","v":"not a CA"},null,"=IF(dms_Model<>\"CA\",\"not a CA\",\"Is a CA\")"]
[null,"dms_060301_Avg_Duration_Sustained_Int_Values present?",{"$f":"IFERROR(IF(INDEX(dms_060301_Avg_Duration_Sustained_Int_Values,1,1)<>\"\",\"yes\",\"no\"),\"no\")","v":"no"},"dms_060301_checkvalue","=IFERROR(IF(INDEX(dms_060301_Avg_Duration_Sustained_Int_Values,1,1)<>\"\",\"yes\",\"no\"),\"no\")"]
[null,null,{"$f":"IF(AND(dms_Model=\"CA\",(dms_060301_checkvalue=\"no\")),\"error - NR not present\",\"no errors\")","v":"no errors"},null,"=IF(AND(dms_Model=\"CA\",(dms_060301_checkvalue=\"no\")),\"error - NR not present\",\"no errors\")"]
[null,"Table 6.3.1 - last row reference",{"$f":"IFERROR(IF(dms_Model=\"CA\",LOOKUP(2,1/(dms_060301_Avg_Duration_Sustained_Int_Values<>\"\"),(ROW(dms_060301_Avg_Duration_Sustained_Int_Values))),\"not a CA\"),\"6.3 not present\")","v":"not a CA"},"dms_060301_LastRow","=IFERROR(IF(dms_Model=\"CA\",LOOKUP(2,1/(dms_060301_Avg_Duration_Sustained_Int_Values<>\"\"),(ROW(dms_060301_Avg_Duration_Sustained_Int_Values))),\"not a CA\"),\"6.3 not present\")"]
[null,"Table 6.3.1 - max number rows",{"$f":"IFERROR(IF(dms_Model=\"CA\",(dms_060301_LastRow-15),\"not a CA\"),\"error\")","v":"not a CA"},"dms_060301_MaxRows","=IFERROR(IF(dms_Model=\"CA\",(dms_060301_LastRow-15),\"not a CA\"),\"error\")"]
[null,"Table 6.6.3 - Public lighting repair - no. business days",{"$f":"INDEX(dms_663_List,MATCH(dms_TradingName,dms_TradingName_List))","v":0},"dms_663","=INDEX(dms_663_List,MATCH(dms_TradingName,dms_TradingName_List))"]
[null,"ARR or RESET RINS"]
[null,"How many rows in tables 6.1 or 6.7?  (leap year?)","insert dms_LeapYear NR if required",null,"'dms_LeapYear is used to determine dms_060701_Max_Rows BUT it is only found on worksheet 6.1 or 6.7 and the date value in the cell is used to determine whether it is a leap year"]
[null,"Is dms_LeapYear named range present?",{"$f":"IFERROR(IF(dms_LeapYear,\"yes\"),\"no\")","v":"no"}]
[null,"Table 6.7.1 - includes a leap year?",{"$f":"\nIFERROR(IF(MONTH(DATE(YEAR(dms_LeapYear),2,29))=2,\"is a leap year\",\"not a leap year\"),\n\"dms_LeapYear not present\")","v":"dms_LeapYear not present"},"dms_LeapYear_Result","=IFERROR(IF(MONTH(DATE(YEAR(dms_LeapYear),2,29))=2,\"is a leap year\",\"not a leap year\"),\"dms_LeapYear not present\")"]
[null,"MaxRows if Reset and leap year",{"$f":"IF(dms_LeapYear_Result=\"is a leap year\",1827,1826)","v":1826},"dms_060701_Reset_MaxRows","=IF(dms_LeapYear_Result=\"is a leap year\",1827,1826)",null,null,"number of days present in Reset RIN table"]
[null,"MaxRows if ARR and leap year",{"$f":"IF(dms_LeapYear_Result=\"is a leap year\",366,365)","v":365},"dms_060701_ARR_MaxRows","=IF(dms_LeapYear_Result=\"is a leap year\",366,365)",null,null,"number of days present in ARR RIN table"]
[null,"Table 6.7.1 - Max Rows (leap year/ non leap year)",{"$f":"IF(dms_Model=\"ARR\",dms_060701_ARR_MaxRows,IF(dms_Model=\"Reset\",dms_060701_Reset_MaxRows,\"not a relevant RIN type\"))","v":1826},"dms_060701_MaxRows","=IF(dms_Model=\"ARR\",dms_060701_ARR_MaxRows,IF(dms_Model=\"Reset\",dms_060701_Reset_MaxRows,\"not a relevant RIN type\"))"]
[null,"How many columns in 6.7?   (4 or 5 feeder categories)",{"$f":"IF(dms_FifthFeeder_flag_NSP=\"NO\",\"This NSP has only 4 feeder categories\",\"This NSP has 5 feeder categories\")","v":"This NSP has only 4 feeder categories"}]
[null,"Table 6.7.1 - Last column (# of feeder categories > 4)",{"$f":"IF(dms_FifthFeeder_flag_NSP=\"NO\",10,12)","v":10},"dms_060701_MaxCols","=IF(dms_FifthFeeder_flag_NSP=\"NO\",8,10)"]
[null,"Table 6.7.1 - Number of offset rows",{"$f":"IF(dms_Model=\"ARR\",15,9)","v":9},"dms_060701_OffsetRows","=IF(dms_Model=\"ARR\",15,9)"]
[null,"Start date for telephone answering in 6.1 or 6.7?",null,null,"Using 060101 as naming standard not 060701 for start dates"]
[null,"Table 6.1.1 and 6.7.1 - Start Date as Text",{"$f":"IF(dms_SingleYearModel=\"yes\",(CONCATENATE(IF(LEN(CRY)=4,\"1-Jan-\",\"1-Jul-\"),LEFT(CRY,4))),(CONCATENATE(IF(LEN(PRCP_y4)=4,\"1-Jan-\",\"1-Jul-\"),LEFT(PRCP_y4,4))))","v":"1-Jul-2013"},"dms_060101_StartDateTxt","=IF(SUM(dms_SingleYear_Model)>1,(CONCATENATE(IF(LEN(CRY)=4,\"1-Jan-\",\"1-Jul-\"),LEFT(CRY,4))),(CONCATENATE(IF(LEN(CRCP_y4)=4,\"1-Jan-\",\"1-Jul-\"),LEFT(CRCP_y4,4))))"]
[null,"Table 6.1.1 and 6.7.1 - Start Date as Date Value",{"$f":"DATEVALUE(dms_060701_StartDateTxt)","v":41456},"dms_060101_StartDateVal","=DATEVALUE(dms_060701_StartDateTxt)"]
[null,"ARRs"]
[null,"How many rows in table 6.8?","insert dms_060801_StartCell NR if required",null,"dms_060801_StartCell is only found on worksheet 6.8 and is used to determine the starting date for the date range"]
[null,"Is dms_060801_StartCell named range present?","yes",null,"=IFERROR(IF((ROW(dms_060801_StartCell)-1)=1,\"yes\",\"yes\"),\"no\")"]
[null,"Table 6.8 - Number of offset rows",12,"dms_0608_OffsetRows","=IFERROR(IF(dms_Model=\"ARR\",(ROW(dms_060801_StartCell)-1),\"not an ARR\"),\"6.8 error\")"]
[null,"Table 6.8 - Last row","0","dms_0608_LastRow","=IFERROR(IF(dms_060801_StartCell<>\"\",IF(dms_Model=\"ARR\",(LOOKUP(2,1/(dms_060801_01_Values<>\"\"),(ROW(dms_060801_01_Values)))),\"not an ARR\"),0),\"0\")"]
[null,"Table 6.8 - MaxRows",{"$f":"IFERROR(IF(dms_Model=\"ARR\",(MAX(0,dms_0608_LastRow-dms_0608_OffsetRows)),\"not an ARR\"),\"0\")","v":"not an ARR"},"dms_060801_MaxRows","=IFERROR(IF(dms_Model=\"ARR\",(MAX(0,dms_0608_LastRow-dms_0608_OffsetRows)),\"not an ARR\"),\"0\")"]
[null,"TNSP RESET RINS"]
[null,"Table 7.9.4 only appears in TNSPs Reset RIN"]
[null,"Table 7.9.4 - first year",{"$f":"LEFT(PRCP_y3,4)","v":"2012"},"dms_070904_Start_Year","=LEFT(PRCP_y3,4)"]
[null,"SUBSET FILES"]
[null,"Is this Submission File a Subset File","NO","dms_Partial"]
[null,"MISC"]
[null,"Distribution Determination Reference",{"$f":"INDEX(dms_DeterminationRef_List,MATCH(dms_TradingName,dms_TradingName_List))","v":0},"dms_DeterminationRef"]
[null,"Public lighting NSP?",{"$f":"INDEX(dms_Public_Lighting_List,MATCH(dms_TradingName,dms_TradingName_List))","v":"NO"},"dms_Public_Lighting","=INDEX(dms_Public_Lighting_List,MATCH(dms_TradingName,dms_TradingName_List))"]
[null,"CBD Feeder for this business",{"$f":"INDEX(dms_CBD_flag,MATCH(dms_TradingName,dms_TradingName_List))","v":"NO"},"dms_CBD_flag_NSP"]
[null,"Urban Feeder for this business",{"$f":"INDEX(dms_Urban_flag,MATCH(dms_TradingName,dms_TradingName_List))","v":"NO"},"dms_Urban_flag_NSP"]
[null,"Short rural Feeder for this business",{"$f":"INDEX(dms_ShortRural_flag,MATCH(dms_TradingName,dms_TradingName_List))","v":"NO"},"dms_ShortRural_flag_NSP"]
[null,"Long rural Feeder for this business",{"$f":"INDEX(dms_LongRural_flag,MATCH(dms_TradingName,dms_TradingName_List))","v":"NO"},"dms_LongRural_flag_NSP"]
[null,"Fifth Feeder Category (eg. TasNetworks (D))",{"$f":"INDEX(dms_FeederType_5_flag,MATCH(dms_TradingName,dms_TradingName_List))","v":"NO"},"dms_FifthFeeder_flag_NSP","=INDEX(dms_FeederType_5_flag,MATCH(dms_TradingName,dms_TradingName_List))"]
[]
[null,"DISCARD FILES"]
[null,"discard this record?","NO","dms_DISCARD","If record is to be discarded from DB set this flag to YES"]
[]
[null,"USES NAMED RANGES FLAG","yes","dms_Defined_Names_Used"]
[]
[null,"REGULATORY YEARS FOR MULTI RYE SUBMISSIONS"]
[null,"Multiple RYE flag","NO","dms_Multi_RYE_flag"]
[null,null,"Manually specify RYE","Named ranges to apply"]
[null,null,2011,"dms_RYE_01"]
[null,null,2012,"dms_RYE_02"]
[null,null,2013,"dms_RYE_03"]
[null,null,2014,"dms_RYE_04"]
[null,null,2015,"dms_RYE_05"]
[null,null,2016,"dms_RYE_06"]
[null,null,2017,"dms_RYE_07"]
[null,null,2018,"dms_RYE_08"]
[null,null,2019,"dms_RYE_09"]

{"sheet":"E1. Expenditure Summary","index":5,"n_rows":121,"n_cols":9,"rows_kept":121,"cut":false,"hidden":false,"merged":[[8,2,8,8],[9,2,9,8],[41,2,41,8],[42,2,42,8],[109,2,109,8],[74,2,74,8],[75,2,75,8],[90,2,90,8],[91,2,91,8],[108,2,108,8]]}
[null,{"$f":"IF(dms_MultiYear_ResponseFlag=\"Yes\",\"REGULATORY REPORTING STATEMENT - HISTORICAL INFORMATION\",INDEX(dms_Worksheet_List,MATCH(dms_Model,dms_Model_List)))","v":"REGULATORY REPORTING STATEMENT"}]
[null,{"$f":"INDEX(dms_TradingNameFull_List,MATCH(dms_TradingName,dms_TradingName_List))","v":"Jemena Gas Networks (NSW) Ltd"}]
[null,{"$f":"IF(SUM(dms_SingleYear_Model)>0,CONCATENATE(CRY),CONCATENATE(FRCP_y1,\" to \",dms_MultiYear_FinalYear_Result))","v":"2020-21 to 2024-25"}]
[null,"E1. EXPENDITURE SUMMARY"]
[]
[]
[null,"E1.1 - CAPEX"]
[null,"E1.1.1 - REFERENCE SERVICES"]
[null,null,"EXPENDITURE"]
[null,null,{"$f":"CONCATENATE(\"$0's, real \",dms_DollarReal)","v":"$0's, real June 2020"}]
[null,null,{"$f":"CRCP_y4","v":"2018-19"},{"$f":"CRCP_y5","v":"2019-20"},{"$f":"FRCP_y1","v":"2020-21"},{"$f":"FRCP_y2","v":"2021-22"},{"$f":"FRCP_y3","v":"2022-23"},{"$f":"FRCP_y4","v":"2023-24"},{"$f":"FRCP_y5","v":"2024-25"}]
[null,"Connections",100999291.36159223,94018588.17866382,79985973.221725836,76165996.84559153,75199003.027378395,76504908.834155306,79653265.219188675]
[null,"Mains replacement",3245988.2871403047,9834110.8355774973,11713297.624148594,6149639.997234988,6777412.5035264418,9679285.3204846885,10457227.568235587]
[null,"Mains augmentation",7184321.0975456303,3388286.2155460943,16459007.058047514,19865216.578947261,13183756.079830239,10683075.71902767,582800.60307703249]
[null,"Telemetry",852536.87620901479,415999.97736909217,489256.91323452047,540294.92215567199,512783.38679168664,351462.49269667378,304808.76096393954]
[null,"Meter replacement",22142482.39978788,19498389.272185151,18172353.285914648,20362773.766268101,23591753.849511854,26808097.414827187,29075912.073063456]
[null,"ICT",16973025.772050843,15690914.248412941,16266629.32971761,22797316.871989001,26974878.322358005,19868091.192816611,21289792.908579927]
[null,"Capitalised network overheads",15981141.327514187,16245583.624922801,16295340.006579895,16101438.584393123,15623986.854481515,15781676.304801684,15837105.742643632]
[null,"Capitalised corporate overheads",16548108.535145797,16838116.688962333,8419058.3444811832,0,0,0,0]
[null,"Other capex",11041248.437615745,30690026.585939646,34306234.638913631,28917880.493011374,13163190.617426174,11241135.723792322,16678829.875660533]
[null,"Related party expenditure",0,0,0,0,0,0,0]
[null,"Customer contributions included in the above",7425468.950689856,2100862.7482728469,5123845.6039902475,2033207.0829698239,2042609.1452465267,2058933.9458795162,2106090.2826303341]
[null,"Total (less customer contributions)",{"$f":"SUM(C12:C21)-C22","v":187542675.14391175},{"$f":"SUM(D12:D21)-D22","v":204519152.87930655},196983304.81877318,188867350.97662124,172984155.49605781,168858799.05672258,171773652.46878245]
[]
[null,"E1.1.2 - NON-REFERENCE SERVICES"]
[null,"Connections",0,0,0,0,0,0,0]
[null,"Mains replacement",0,0,0,0,0,0,0]
[null,"Mains augmentation",0,0,0,0,0,0,0]
[null,"Telemetry",0,0,0,0,0,0,0]
[null,"Meter replacement",0,0,0,0,0,0,0]
[null,"ICT",0,0,0,0,0,0,0]
[null,"Capitalised network overheads",0,0,0,0,0,0,0]
[null,"Capitalised corporate overheads",0,0,0,0,0,0,0]
[null,"Other capex",0,0,0,0,0,0,0]
[null,"Related party expenditure",0,0,0,0,0,0,0]
[null,"Customer contributions included in the above",0,0,0,0,0,0,0]
[null,"Total (less customer contributions)",{"$f":"SUM(C26:C35)-C36","v":0},{"$f":"SUM(D26:D35)-D36","v":0},0,0,0,0,0]
[]
[]
[null,"E1.2 - OPEX"]
[null,"E1.2.1 - REFERENCE SERVICES"]
[null,null,"EXPENDITURE"]
[null,null,{"$f":"CONCATENATE(\"$0's, real \",dms_DollarReal)","v":"$0's, real June 2020"}]
[null,null,{"$f":"CRCP_y4","v":"2018-19"},{"$f":"CRCP_y5","v":"2019-20"},{"$f":"FRCP_y1","v":"2020-21"},{"$f":"FRCP_y2","v":"2021-22"},{"$f":"FRCP_y3","v":"2022-23"},{"$f":"FRCP_y4","v":"2023-24"},{"$f":"FRCP_y5","v":"2024-25"}]
[null,"Connections"]
[null,"Mains replacement"]
[null,"Mains augmentation"]
[null,"Telemetry"]
[null,"Meter replacement"]
[null,"ICT"]
[null,"Capitalised network overheads"]
[null,"Capitalised corporate overheads"]
[null,"Other capex"]
[null,"Related party expenditure"]
[null,"Customer contributions included in the above"]
[null,"Total (less customer contributions)",{"$f":"SUM(C45:C54)-C55","v":0},{"$f":"SUM(D45:D54)-D55","v":0},0,0,0,0,0]
[]
[null,"E1.2.2 - NON-REFERENCE SERVICES"]
[null,"Connections"]
[null,"Mains replacement"]
[null,"Mains augmentation"]
[null,"Telemetry"]
[null,"Meter replacement"]
[null,"ICT"]
[null,"Capitalised network overheads"]
[null,"Capitalised corporate overheads"]
[null,"Other capex"]
[null,"Related party expenditure"]
[null,"Customer contributions included in the above"]
[null,"Total (less customer contributions)",{"$f":"SUM(C59:C68)-C69","v":0},{"$f":"SUM(D59:D68)-D69","v":0},0,0,0,0,0]
[]
[]
[null,"E1.3 - CAPCONS"]
[null,"E1.3.1 - REFERENCE SERVICES"]
[null,null,"EXPENDITURE"]
[null,null,{"$f":"CONCATENATE(\"$0's, real \",dms_DollarReal)","v":"$0's, real June 2020"}]
[null,null,{"$f":"CRCP_y4","v":"2018-19"},{"$f":"CRCP_y5","v":"2019-20"},{"$f":"FRCP_y1","v":"2020-21"},{"$f":"FRCP_y2","v":"2021-22"},{"$f":"FRCP_y3","v":"2022-23"},{"$f":"FRCP_y4","v":"2023-24"},{"$f":"FRCP_y5","v":"2024-25"}]
[null,"Connections",2084232.895798598,2094998.9604228025,2207762.3105891026,2033207.0829698239,2042609.1452465267,2058933.9458795162,2106090.2826303341]
[null,"Mains replacement",0,0,0,0,0,0,0]
[null,"Mains augmentation",5341236.0548912585,5863.7878500441029,2916083.2934011454,0,0,0,0]
[null,"Telemetry",0,0,0,0,0,0,0]
[null,"Meter replacement",0,0,0,0,0,0,0]
[null,"ICT",0,0,0,0,0,0,0]
[null,"Capitalised network overheads",0,0,0,0,0,0,0]
[null,"Capitalised corporate overheads",0,0,0,0,0,0,0]
[null,"Other capex",0,0,0,0,0,0,0]
[null,"Related party expenditure",0,0,0,0,0,0,0]
[null,"Total",{"$f":"SUM(C78:C87)","v":7425468.950689856},{"$f":"SUM(D78:D87)","v":2100862.7482728465},5123845.6039902475,2033207.0829698239,2042609.1452465267,2058933.9458795162,2106090.2826303341]
[]
[null,"E1.3.2 - NON-REFERENCE SERVICES"]
[null,null,"EXPENDITURE"]
[null,null,{"$f":"CONCATENATE(\"$0's, real \",dms_DollarReal)","v":"$0's, real June 2020"}]
[null,null,{"$f":"CRCP_y4","v":"2018-19"},{"$f":"CRCP_y5","v":"2019-20"},{"$f":"FRCP_y1","v":"2020-21"},{"$f":"FRCP_y2","v":"2021-22"},{"$f":"FRCP_y3","v":"2022-23"},{"$f":"FRCP_y4","v":"2023-24"},{"$f":"FRCP_y5","v":"2024-25"}]
[null,"Connections",0,0,0,0,0,0,0]
[null,"Mains replacement",0,0,0,0,0,0,0]
[null,"Mains augmentation",0,0,0,0,0,0,0]
[null,"Telemetry",0,0,0,0,0,0,0]
[null,"Meter replacement",0,0,0,0,0,0,0]
[null,"ICT",0,0,0,0,0,0,0]
[null,"Capitalised network overheads",0,0,0,0,0,0,0]
[null,"Capitalised corporate overheads",0,0,0,0,0,0,0]
[null,"Other capex",0,0,0,0,0,0,0]
[null,"Related party expenditure",0,0,0,0,0,0,0]
[null,"Total",{"$f":"SUM(C94:C103)","v":0},{"$f":"SUM(D94:D103)","v":0},0,0,0,0,0]
[]
[]
[null,"E1.4 - CAPITALISED OVERHEADS"]
[null,"E1.4.1 - REFERENCE SERVICES"]
[null,null,"EXPENDITURE"]
[null,null,{"$f":"CONCATENATE(\"$0's, real \",dms_DollarReal)","v":"$0's, real June 2020"}]
[null,null,{"$f":"CRCP_y4","v":"2018-19"},{"$f":"CRCP_y5","v":"2019-20"},{"$f":"FRCP_y1","v":"2020-21"},{"$f":"FRCP_y2","v":"2021-22"},{"$f":"FRCP_y3","v":"2022-23"},{"$f":"FRCP_y4","v":"2023-24"},{"$f":"FRCP_y5","v":"2024-25"}]
[null,"Connections",23134417.91145217,20615930.522084758,12993264.815285055,8489941.5004097987,9287951.8221235815,9193851.7674565725,9516546.9835120402]
[null,"Mains replacement",743510.65792664769,2156375.1345370165,1902758.3432525261,685477.58825961233,837089.30008677696,1163192.2161277768,1249373.7349817706]
[null,"Mains augmentation",1645606.4635705692,742966.62566230563,2673671.7537840684,2214302.0984828714,1628347.2702358917,1283821.0786469912,69629.90538981228]
[null,"Telemetry",0,0,0,0,0,0,0]
[null,"Meter replacement",5071851.8370562121,4275510.2614820488,2951995.0692638448,2269762.9548808527,2913856.0929310182,3221619.0771986339,3473834.7834247355]
[null,"ICT",0,0,0,0,0,0,0]
[null,"Other capex",1933862.9926543881,5292917.7701190142,4192708.3694755696,2441954.4423599904,956742.36910424393,919192.16537170811,1527720.3353352773]
[null,"Related party expenditure",0,0,0,0,0,0,0]
[null,"Customer contributions included in the above",0,0,0,0,0,0,0]
[null,"Total (less customer contributions)",{"$f":"SUM(C112:C119)-C120","v":32529249.862659987},{"$f":"SUM(D112:D119)-D120","v":33083700.313885141},{"$f":"SUM(E112:E119)-E120","v":24714398.351061065},16101438.584393125,15623986.854481515,15781676.304801684,15837105.742643636]

{"sheet":"E2. Mains Repex","index":6,"n_rows":795,"n_cols":10,"rows_kept":795,"cut":false,"hidden":false,"merged":[[62,3,62,9],[63,3,63,9],[407,3,407,9],[120,3,120,9],[121,3,121,9],[177,3,177,9],[178,3,178,9],[234,3,234,9],[235,3,235,9],[291,3,291,9],[292,3,292,9],[348,3,348,9],[349,3,349,9],[439,3,439,9],[440,3,440,9],[768,3,768,9],[769,3,769,9],[408,3,408,9]]}
[null,{"$f":"IF(dms_DataQuality=\"backcast\",INDEX(dms_Worksheet_List,MATCH(dms_Model,dms_Model_List))&\" BACKCAST\",INDEX(dms_Worksheet_List,MATCH(dms_Model,dms_Model_List)))","v":"REGULATORY REPORTING STATEMENT"}]
[null,{"$f":"INDEX(dms_TradingNameFull_List,MATCH(dms_TradingName,dms_TradingName_List))","v":"Jemena Gas Networks (NSW) Ltd"}]
[null,{"$f":"IF(SUM(dms_SingleYear_Model)>0,CONCATENATE(CRY),CONCATENATE(FRCP_y1,\" to \",dms_MultiYear_FinalYear_Result))","v":"2020-21 to 2024-25"}]
[null,"E2. MAINS REPLACEMENT"]
[]
[]
[]
[null,"Please list all projects here:"]
[null,"Mt Druitt Steel Main Stage 6: Oakhurst "]
[null,"Bidwill Mains and Serivce Area Renewal"]
[null,"Maitland 2kPa Rehabilitation"]
[null,"Kurri Kurri Rehabilitation (100kPa)"]
[null,"Matraville 2kPa and 7kPa"]
[null,"Mittagong Rehab"]
[null,"Newcastle MP1 (30kPa) Rehabilitation"]
[null,0]
[null,0]
[null,0]
[null,0]
[null,""]
[null,""]
[null,""]
[null,""]
[null,""]
[null,""]
[null,""]
[null,""]
[null,""]
[null,""]
[null,""]
[null,""]
[null,""]
[null,""]
[null,""]
[null,""]
[null,""]
[null,""]
[null,""]
[null,""]
[null,""]
[null,""]
[null,""]
[null,""]
[null,""]
[null,""]
[null,""]
[null,""]
[null,""]
[null,""]
[null,""]
[null,""]
[null,""]
[null,""]
[null,""]
[null,""]
[null,""]
[null,""]
[null,""]
[]
[]
[null,"E2.1 - CAPEX"]
[null,"E2.1.1 - PROACTIVE - BY CONNECTION TYPE - BY PROJECT"]
[null,null,null,"EXPENDITURE"]
[null,null,null,{"$f":"CONCATENATE(\"$0's, real \",dms_DollarReal)","v":"$0's, real June 2020"}]
[null,null,null,{"$f":"CRCP_y4","v":"2018-19"},{"$f":"CRCP_y5","v":"2019-20"},{"$f":"FRCP_y1","v":"2020-21"},{"$f":"FRCP_y2","v":"2021-22"},{"$f":"FRCP_y3","v":"2022-23"},{"$f":"FRCP_y4","v":"2023-24"},{"$f":"FRCP_y5","v":"2024-25"}]
[null,"A. DIRECT INTERNAL LABOUR EXPENDITURE"]
[null,{"$f":"IF(ISBLANK(dms_E2_Projects_01),\"\",dms_E2_Projects_01)","v":"Mt Druitt Steel Main Stage 6: Oakhurst "},null,63400.174371024339,0,0,0,0,0,0]
[null,{"$f":"IF(ISBLANK(dms_E2_Projects_02),\"\",dms_E2_Projects_02)","v":"Bidwill Mains and Serivce Area Renewal"},null,74014.934931902753,147116.08325927786,0,0,0,0,0]
[null,{"$f":"IF(ISBLANK(dms_E2_Projects_03),\"\",dms_E2_Projects_03)","v":"Maitland 2kPa Rehabilitation"},null,2624.1749506789065,125411.02483010717,0,0,0,0,0]
[null,{"$f":"IF(ISBLANK(dms_E2_Projects_04),\"\",dms_E2_Projects_04)","v":"Kurri Kurri Rehabilitation (100kPa)"},null,10401.794465006857,2845.2517398717159,263758.5261507589,0,0,0,0]
[null,{"$f":"IF(ISBLANK(dms_E2_Projects_05),\"\",dms_E2_Projects_05)","v":"Matraville 2kPa and 7kPa"},null,0,329580.71601639932,391926.91518414923,323362.50233475654,0,0,0]
[null,{"$f":"IF(ISBLANK(dms_E2_Projects_06),\"\",dms_E2_Projects_06)","v":"Mittagong Rehab"},null,0,8151.440365340276,92655.104792255588,1383.4539254157319,0,0,0]
[null,{"$f":"IF(ISBLANK(dms_E2_Projects_07),\"\",dms_E2_Projects_07)","v":"Newcastle MP1 (30kPa) Rehabilitation"},null,0,0,0,22857.035090480051,392677.6432601065,601508.49602934357,606507.65214307688]
[null,{"$f":"IF(ISBLANK(dms_E2_Projects_08),\"\",dms_E2_Projects_08)","v":0},null,0,0,0,0,0,0,0]
[null,{"$f":"IF(ISBLANK(dms_E2_Projects_09),\"\",dms_E2_Projects_09)","v":0},null,0,0,0,0,0,0,0]
[null,{"$f":"IF(ISBLANK(dms_E2_Projects_10),\"\",dms_E2_Projects_10)","v":0},null,0,0,0,0,0,0,0]
[null,{"$f":"IF(ISBLANK(dms_E2_Projects_11),\"\",dms_E2_Projects_11)","v":0},null,0,0,0,0,0,0,0]
[null,{"$f":"IF(ISBLANK(dms_E2_Projects_12),\"\",dms_E2_Projects_12)","v":""}]
[null,{"$f":"IF(ISBLANK(dms_E2_Projects_13),\"\",dms_E2_Projects_13)","v":""}]
[null,{"$f":"IF(ISBLANK(dms_E2_Projects_14),\"\",dms_E2_Projects_14)","v":""}]
[null,{"$f":"IF(ISBLANK(dms_E2_Projects_15),\"\",dms_E2_Projects_15)","v":""}]
[null,{"$f":"IF(ISBLANK(dms_E2_Projects_16),\"\",dms_E2_Projects_16)","v":""}]
[null,{"$f":"IF(ISBLANK(dms_E2_Projects_17),\"\",dms_E2_Projects_17)","v":""}]
[null,{"$f":"IF(ISBLANK(dms_E2_Projects_18),\"\",dms_E2_Projects_18)","v":""}]
[null,{"$f":"IF(ISBLANK(dms_E2_Projects_19),\"\",dms_E2_Projects_19)","v":""}]
[null,{"$f":"IF(ISBLANK(dms_E2_Projects_20),\"\",dms_E2_Projects_20)","v":""}]
[null,{"$f":"IF(ISBLANK(dms_E2_Projects_21),\"\",dms_E2_Projects_21)","v":""}]
[null,{"$f":"IF(ISBLANK(dms_E2_Projects_22),\"\",dms_E2_Projects_22)","v":""}]
[null,{"$f":"IF(ISBLANK(dms_E2_Projects_23),\"\",dms_E2_Projects_23)","v":""}]
[null,{"$f":"IF(ISBLANK(dms_E2_Projects_24),\"\",dms_E2_Projects_24)","v":""}]
[null,{"$f":"IF(ISBLANK(dms_E2_Projects_25),\"\",dms_E2_Projects_25)","v":""}]
[null,{"$f":"IF(ISBLANK(dms_E2_Projects_26),\"\",dms_E2_Projects_26)","v":""}]
[null,{"$f":"IF(ISBLANK(dms_E2_Projects_27),\"\",dms_E2_Projects_27)","v":""}]
[null,{"$f":"IF(ISBLANK(dms_E2_Projects_28),\"\",dms_E2_Projects_28)","v":""}]
[null,{"$f":"IF(ISBLANK(dms_E2_Projects_29),\"\",dms_E2_Projects_29)","v":""}]
[null,{"$f":"IF(ISBLANK(dms_E2_Projects_30),\"\",dms_E2_Projects_30)","v":""}]
[null,{"$f":"IF(ISBLANK(dms_E2_Projects_31),\"\",dms_E2_Projects_31)","v":""}]
[null,{"$f":"IF(ISBLANK(dms_E2_Projects_32),\"\",dms_E2_Projects_32)","v":""}]
[null,{"$f":"IF(ISBLANK(dms_E2_Projects_33),\"\",dms_E2_Projects_33)","v":""}]
[null,{"$f":"IF(ISBLANK(dms_E2_Projects_34),\"\",dms_E2_Projects_34)","v":""}]
[null,{"$f":"IF(ISBLANK(dms_E2_Projects_35),\"\",dms_E2_Projects_35)","v":""}]
[null,{"$f":"IF(ISBLANK(dms_E2_Projects_36),\"\",dms_E2_Projects_36)","v":""}]
[null,{"$f":"IF(ISBLANK(dms_E2_Projects_37),\"\",dms_E2_Projects_37)","v":""}]
[null,{"$f":"IF(ISBLANK(dms_E2_Projects_38),\"\",dms_E2_Projects_38)","v":""}]
[null,{"$f":"IF(ISBLANK(dms_E2_Projects_39),\"\",dms_E2_Projects_39)","v":""}]
[null,{"$f":"IF(ISBLANK(dms_E2_Projects_40),\"\",dms_E2_Projects_40)","v":""}]
[null,{"$f":"IF(ISBLANK(dms_E2_Projects_41),\"\",dms_E2_Projects_41)","v":""}]
[null,{"$f":"IF(ISBLANK(dms_E2_Projects_42),\"\",dms_E2_Projects_42)","v":""}]
[null,{"$f":"IF(ISBLANK(dms_E2_Projects_43),\"\",dms_E2_Projects_43)","v":""}]
[null,{"$f":"IF(ISBLANK(dms_E2_Projects_44),\"\",dms_E2_Projects_44)","v":""}]
[null,{"$f":"IF(ISBLANK(dms_E2_Projects_45),\"\",dms_E2_Projects_45)","v":""}]
[null,{"$f":"IF(ISBLANK(dms_E2_Projects_46),\"\",dms_E2_Projects_46)","v":""}]
[null,{"$f":"IF(ISBLANK(dms_E2_Projects_47),\"\",dms_E2_Projects_47)","v":""}]
[null,{"$f":"IF(ISBLANK(dms_E2_Projects_48),\"\",dms_E2_Projects_48)","v":""}]
[null,{"$f":"IF(ISBLANK(dms_E2_Projects_49),\"\",dms_E2_Projects_49)","v":""}]
[null,{"$f":"IF(ISBLANK(dms_E2_Projects_50),\"\",dms_E2_Projects_50)","v":""}]
[null,"Aggregate of other projects with total expenditure of less than $500,000",null,0,0,0,0,0,0,50903.677078372959]
[null,null,"Total",{"$f":"SUM(D67:D117)","v":150441.07871861287},{"$f":"SUM(E67:E117)","v":613104.51621099631},{"$f":"SUM(F67:F117)","v":748340.54612716369},{"$f":"SUM(G67:G117)","v":347602.99135065236},{"$f":"SUM(H67:H117)","v":392677.6432601065},{"$f":"SUM(I67:I117)","v":601508.49602934357},{"$f":"SUM(J67:J117)","v":657411.32922144979}]
[]
[null,"B. DIRECT CONTRACTOR EXPENDITURE"]
[null,null,null,"EXPENDITURE"]
[null,null,null,{"$f":"CONCATENATE(\"$0's, real \",dms_DollarReal)","v":"$0's, real June 2020"}]
[null,null,null,{"$f":"CRCP_y4","v":"2018-19"},{"$f":"CRCP_y5","v":"2019-20"},{"$f":"FRCP_y1","v":"2020-21"},{"$f":"FRCP_y2","v":"2021-22"},{"$f":"FRCP_y3","v":"2022-23"},{"$f":"FRCP_y4","v":"2023-24"},{"$f":"FRCP_y5","v":"2024-25"}]
[null,{"$f":"IF(ISBLANK(dms_E2_Projects_01),\"\",dms_E2_Projects_01)","v":"Mt Druitt Steel Main Stage 6: Oakhurst "}]
[null,{"$f":"IF(ISBLANK(dms_E2_Projects_02),\"\",dms_E2_Projects_02)","v":"Bidwill Mains and Serivce Area Renewal"}]
[null,{"$f":"IF(ISBLANK(dms_E2_Projects_03),\"\",dms_E2_Projects_03)","v":"Maitland 2kPa Rehabilitation"}]
[null,{"$f":"IF(ISBLANK(dms_E2_Projects_04),\"\",dms_E2_Projects_04)","v":"Kurri Kurri Rehabilitation (100kPa)"}]
[null,{"$f":"IF(ISBLANK(dms_E2_Projects_05),\"\",dms_E2_Projects_05)","v":"Matraville 2kPa and 7kPa"}]
[null,{"$f":"IF(ISBLANK(dms_E2_Projects_06),\"\",dms_E2_Projects_06)","v":"Mittagong Rehab"}]
[null,{"$f":"IF(ISBLANK(dms_E2_Projects_07),\"\",dms_E2_Projects_07)","v":"Newcastle MP1 (30kPa) Rehabilitation"}]
[null,{"$f":"IF(ISBLANK(dms_E2_Projects_08),\"\",dms_E2_Projects_08)","v":0},null,0,0,0,0,0,0,0]
[null,{"$f":"IF(ISBLANK(dms_E2_Projects_09),\"\",dms_E2_Projects_09)","v":0},null,0,0,0,0,0,0,0]
[null,{"$f":"IF(ISBLANK(dms_E2_Projects_10),\"\",dms_E2_Projects_10)","v":0},null,0,0,0,0,0,0,0]
[null,{"$f":"IF(ISBLANK(dms_E2_Projects_11),\"\",dms_E2_Projects_11)","v":0},null,0,0,0,0,0,0,0]
[null,{"$f":"IF(ISBLANK(dms_E2_Projects_12),\"\",dms_E2_Projects_12)","v":""}]
[null,{"$f":"IF(ISBLANK(dms_E2_Projects_13),\"\",dms_E2_Projects_13)","v":""}]
[null,{"$f":"IF(ISBLANK(dms_E2_Projects_14),\"\",dms_E2_Projects_14)","v":""}]
[null,{"$f":"IF(ISBLANK(dms_E2_Projects_15),\"\",dms_E2_Projects_15)","v":""}]
[null,{"$f":"IF(ISBLANK(dms_E2_Projects_16),\"\",dms_E2_Projects_16)","v":""}]
[null,{"$f":"IF(ISBLANK(dms_E2_Projects_17),\"\",dms_E2_Projects_17)","v":""}]
[null,{"$f":"IF(ISBLANK(dms_E2_Projects_18),\"\",dms_E2_Projects_18)","v":""}]
[null,{"$f":"IF(ISBLANK(dms_E2_Projects_19),\"\",dms_E2_Projects_19)","v":""}]
[null,{"$f":"IF(ISBLANK(dms_E2_Projects_20),\"\",dms_E2_Projects_20)","v":""}]
[null,{"$f":"IF(ISBLANK(dms_E2_Projects_21),\"\",dms_E2_Projects_21)","v":""}]
[null,{"$f":"IF(ISBLANK(dms_E2_Projects_22),\"\",dms_E2_Projects_22)","v":""}]
[null,{"$f":"IF(ISBLANK(dms_E2_Projects_23),\"\",dms_E2_Projects_23)","v":""}]
[null,{"$f":"IF(ISBLANK(dms_E2_Projects_24),\"\",dms_E2_Projects_24)","v":""}]
[null,{"$f":"IF(ISBLANK(dms_E2_Projects_25),\"\",dms_E2_Projects_25)","v":""}]
[null,{"$f":"IF(ISBLANK(dms_E2_Projects_26),\"\",dms_E2_Projects_26)","v":""}]
[null,{"$f":"IF(ISBLANK(dms_E2_Projects_27),\"\",dms_E2_Projects_27)","v":""}]
[null,{"$f":"IF(ISBLANK(dms_E2_Projects_28),\"\",dms_E2_Projects_28)","v":""}]
[null,{"$f":"IF(ISBLANK(dms_E2_Projects_29),\"\",dms_E2_Projects_29)","v":""}]
[null,{"$f":"IF(ISBLANK(dms_E2_Projects_30),\"\",dms_E2_Projects_30)","v":""}]
[null,{"$f":"IF(ISBLANK(dms_E2_Projects_31),\"\",dms_E2_Projects_31)","v":""}]
[null,{"$f":"IF(ISBLANK(dms_E2_Projects_32),\"\",dms_E2_Projects_32)","v":""}]
[null,{"$f":"IF(ISBLANK(dms_E2_Projects_33),\"\",dms_E2_Projects_33)","v":""}]
[null,{"$f":"IF(ISBLANK(dms_E2_Projects_34),\"\",dms_E2_Projects_34)","v":""}]
[null,{"$f":"IF(ISBLANK(dms_E2_Projects_35),\"\",dms_E2_Projects_35)","v":""}]
[null,{"$f":"IF(ISBLANK(dms_E2_Projects_36),\"\",dms_E2_Projects_36)","v":""}]
[null,{"$f":"IF(ISBLANK(dms_E2_Projects_37),\"\",dms_E2_Projects_37)","v":""}]
[null,{"$f":"IF(ISBLANK(dms_E2_Projects_38),\"\",dms_E2_Projects_38)","v":""}]
[null,{"$f":"IF(ISBLANK(dms_E2_Projects_39),\"\",dms_E2_Projects_39)","v":""}]
[null,{"$f":"IF(ISBLANK(dms_E2_Projects_40),\"\",dms_E2_Projects_40)","v":""}]
[null,{"$f":"IF(ISBLANK(dms_E2_Projects_41),\"\",dms_E2_Projects_41)","v":""}]
[null,{"$f":"IF(ISBLANK(dms_E2_Projects_42),\"\",dms_E2_Projects_42)","v":""}]
[null,{"$f":"IF(ISBLANK(dms_E2_Projects_43),\"\",dms_E2_Projects_43)","v":""}]
[null,{"$f":"IF(ISBLANK(dms_E2_Projects_44),\"\",dms_E2_Projects_44)","v":""}]
[null,{"$f":"IF(ISBLANK(dms_E2_Projects_45),\"\",dms_E2_Projects_45)","v":""}]
[null,{"$f":"IF(ISBLANK(dms_E2_Projects_46),\"\",dms_E2_Projects_46)","v":""}]
[null,{"$f":"IF(ISBLANK(dms_E2_Projects_47),\"\",dms_E2_Projects_47)","v":""}]
[null,{"$f":"IF(ISBLANK(dms_E2_Projects_48),\"\",dms_E2_Projects_48)","v":""}]
[null,{"$f":"IF(ISBLANK(dms_E2_Projects_49),\"\",dms_E2_Projects_49)","v":""}]
[null,{"$f":"IF(ISBLANK(dms_E2_Projects_50),\"\",dms_E2_Projects_50)","v":""}]
[null,"Aggregate of other projects with total expenditure of less than $500,000"]
[null,null,"Total"]
[]
[null,"C. OTHER INTERNAL DIRECT EXPENDITURE"]
[null,null,null,"EXPENDITURE"]
[null,null,null,{"$f":"CONCATENATE(\"$0's, real \",dms_DollarReal)","v":"$0's, real June 2020"}]
[null,null,null,{"$f":"CRCP_y4","v":"2018-19"},{"$f":"CRCP_y5","v":"2019-20"},{"$f":"FRCP_y1","v":"2020-21"},{"$f":"FRCP_y2","v":"2021-22"},{"$f":"FRCP_y3","v":"2022-23"},{"$f":"FRCP_y4","v":"2023-24"},{"$f":"FRCP_y5","v":"2024-25"}]
[null,{"$f":"IF(ISBLANK(dms_E2_Projects_01),\"\",dms_E2_Projects_01)","v":"Mt Druitt Steel Main Stage 6: Oakhurst "},null,40969.28001691345,0,0,0,0,0,0]
[null,{"$f":"IF(ISBLANK(dms_E2_Projects_02),\"\",dms_E2_Projects_02)","v":"Bidwill Mains and Serivce Area Renewal"},null,47828.552913958803,95066.615665264253,0,0,0,0,0]
[null,{"$f":"IF(ISBLANK(dms_E2_Projects_03),\"\",dms_E2_Projects_03)","v":"Maitland 2kPa Rehabilitation"},null,1695.7454681208178,81040.777008035424,0,0,0,0,0]
[null,{"$f":"IF(ISBLANK(dms_E2_Projects_04),\"\",dms_E2_Projects_04)","v":"Kurri Kurri Rehabilitation (100kPa)"},null,6721.6539125168511,1838.6055938465893,170441.12294519923,0,0,0,0]
[null,{"$f":"IF(ISBLANK(dms_E2_Projects_05),\"\",dms_E2_Projects_05)","v":"Matraville 2kPa and 7kPa"},null,0,212975.51271123634,253263.71249986623,208957.29446411657,0,0,0]
[null,{"$f":"IF(ISBLANK(dms_E2_Projects_06),\"\",dms_E2_Projects_06)","v":"Mittagong Rehab"},null,0,5267.4719932856451,59873.85635591032,893.98983241218264,0,0,0]
[null,{"$f":"IF(ISBLANK(dms_E2_Projects_07),\"\",dms_E2_Projects_07)","v":"Newcastle MP1 (30kPa) Rehabilitation"},null,0,0,0,14770.247562698682,253748.83401673243,388695.6187559219,391926.08032331796]
[null,{"$f":"IF(ISBLANK(dms_E2_Projects_08),\"\",dms_E2_Projects_08)","v":0},null,0,0,0,0,0,0,0]
[null,{"$f":"IF(ISBLANK(dms_E2_Projects_09),\"\",dms_E2_Projects_09)","v":0},null,0,0,0,0,0,0,0]
[null,{"$f":"IF(ISBLANK(dms_E2_Projects_10),\"\",dms_E2_Projects_10)","v":0},null,0,0,0,0,0,0,0]
[null,{"$f":"IF(ISBLANK(dms_E2_Projects_11),\"\",dms_E2_Projects_11)","v":0},null,0,0,0,0,0,0,0]
[null,{"$f":"IF(ISBLANK(dms_E2_Projects_12),\"\",dms_E2_Projects_12)","v":""}]
[null,{"$f":"IF(ISBLANK(dms_E2_Projects_13),\"\",dms_E2_Projects_13)","v":""}]
[null,{"$f":"IF(ISBLANK(dms_E2_Projects_14),\"\",dms_E2_Projects_14)","v":""}]
[null,{"$f":"IF(ISBLANK(dms_E2_Projects_15),\"\",dms_E2_Projects_15)","v":""}]
[null,{"$f":"IF(ISBLANK(dms_E2_Projects_16),\"\",dms_E2_Projects_16)","v":""}]
[null,{"$f":"IF(ISBLANK(dms_E2_Projects_17),\"\",dms_E2_Projects_17)","v":""}]
[null,{"$f":"IF(ISBLANK(dms_E2_Projects_18),\"\",dms_E2_Projects_18)","v":""}]
[null,{"$f":"IF(ISBLANK(dms_E2_Projects_19),\"\",dms_E2_Projects_19)","v":""}]
[null,{"$f":"IF(ISBLANK(dms_E2_Projects_20),\"\",dms_E2_Projects_20)","v":""}]
[null,{"$f":"IF(ISBLANK(dms_E2_Projects_21),\"\",dms_E2_Projects_21)","v":""}]
[null,{"$f":"IF(ISBLANK(dms_E2_Projects_22),\"\",dms_E2_Projects_22)","v":""}]
[null,{"$f":"IF(ISBLANK(dms_E2_Projects_23),\"\",dms_E2_Projects_23)","v":""}]
[null,{"$f":"IF(ISBLANK(dms_E2_Projects_24),\"\",dms_E2_Projects_24)","v":""}]
[null,{"$f":"IF(ISBLANK(dms_E2_Projects_25),\"\",dms_E2_Projects_25)","v":""}]
[null,{"$f":"IF(ISBLANK(dms_E2_Projects_26),\"\",dms_E2_Projects_26)","v":""}]
[null,{"$f":"IF(ISBLANK(dms_E2_Projects_27),\"\",dms_E2_Projects_27)","v":""}]
[null,{"$f":"IF(ISBLANK(dms_E2_Projects_28),\"\",dms_E2_Projects_28)","v":""}]
[null,{"$f":"IF(ISBLANK(dms_E2_Projects_29),\"\",dms_E2_Projects_29)","v":""}]
[null,{"$f":"IF(ISBLANK(dms_E2_Projects_30),\"\",dms_E2_Projects_30)","v":""}]
[null,{"$f":"IF(ISBLANK(dms_E2_Projects_31),\"\",dms_E2_Projects_31)","v":""}]
[null,{"$f":"IF(ISBLANK(dms_E2_Projects_32),\"\",dms_E2_Projects_32)","v":""}]
[null,{"$f":"IF(ISBLANK(dms_E2_Projects_33),\"\",dms_E2_Projects_33)","v":""}]
[null,{"$f":"IF(ISBLANK(dms_E2_Projects_34),\"\",dms_E2_Projects_34)","v":""}]
[null,{"$f":"IF(ISBLANK(dms_E2_Projects_35),\"\",dms_E2_Projects_35)","v":""}]
[null,{"$f":"IF(ISBLANK(dms_E2_Projects_36),\"\",dms_E2_Projects_36)","v":""}]
[null,{"$f":"IF(ISBLANK(dms_E2_Projects_37),\"\",dms_E2_Projects_37)","v":""}]
[null,{"$f":"IF(ISBLANK(dms_E2_Projects_38),\"\",dms_E2_Projects_38)","v":""}]
[null,{"$f":"IF(ISBLANK(dms_E2_Projects_39),\"\",dms_E2_Projects_39)","v":""}]
[null,{"$f":"IF(ISBLANK(dms_E2_Projects_40),\"\",dms_E2_Projects_40)","v":""}]
[null,{"$f":"IF(ISBLANK(dms_E2_Projects_41),\"\",dms_E2_Projects_41)","v":""}]
[null,{"$f":"IF(ISBLANK(dms_E2_Projects_42),\"\",dms_E2_Projects_42)","v":""}]
[null,{"$f":"IF(ISBLANK(dms_E2_Projects_43),\"\",dms_E2_Projects_43)","v":""}]
[null,{"$f":"IF(ISBLANK(dms_E2_Projects_44),\"\",dms_E2_Projects_44)","v":""}]
[null,{"$f":"IF(ISBLANK(dms_E2_Projects_45),\"\",dms_E2_Projects_45)","v":""}]
[null,{"$f":"IF(ISBLANK(dms_E2_Projects_46),\"\",dms_E2_Projects_46)","v":""}]
[null,{"$f":"IF(ISBLANK(dms_E2_Projects_47),\"\",dms_E2_Projects_47)","v":""}]
[null,{"$f":"IF(ISBLANK(dms_E2_Projects_48),\"\",dms_E2_Projects_48)","v":""}]
[null,{"$f":"IF(ISBLANK(dms_E2_Projects_49),\"\",dms_E2_Projects_49)","v":""}]
[null,{"$f":"IF(ISBLANK(dms_E2_Projects_50),\"\",dms_E2_Projects_50)","v":""}]
[null,"Aggregate of other projects with total expenditure of less than $500,000",null,0,0,0,0,0,0,32894.026251567004]
[null,null,"Total",{"$f":"SUM(D181:D231)","v":97215.232311509913},{"$f":"SUM(E181:E231)","v":396188.98297166824},483578.69180097576,224621.53185922743,253748.83401673243,388695.6187559219,424820.10657488497]
[]
[null,"D. TOTAL OVERHEAD EXPENDITURE"]
[null,null,null,"EXPENDITURE"]
[null,null,null,{"$f":"CONCATENATE(\"$0's, real \",dms_DollarReal)","v":"$0's, real June 2020"}]
[null,null,null,{"$f":"CRCP_y4","v":"2018-19"},{"$f":"CRCP_y5","v":"2019-20"},{"$f":"FRCP_y1","v":"2020-21"},{"$f":"FRCP_y2","v":"2021-22"},{"$f":"FRCP_y3","v":"2022-23"},{"$f":"FRCP_y4","v":"2023-24"},{"$f":"FRCP_y5","v":"2024-25"}]
[null,{"$f":"IF(ISBLANK(dms_E2_Projects_01),\"\",dms_E2_Projects_01)","v":"Mt Druitt Steel Main Stage 6: Oakhurst "},null,201675.89073128763,0,0,0,0,0,0]
[null,{"$f":"IF(ISBLANK(dms_E2_Projects_02),\"\",dms_E2_Projects_02)","v":"Bidwill Mains and Serivce Area Renewal"},null,235441.43336980874,447994.46879682096,0,0,0,0,0]
[null,{"$f":"IF(ISBLANK(dms_E2_Projects_03),\"\",dms_E2_Projects_03)","v":"Maitland 2kPa Rehabilitation"},null,8347.4978714691897,381898.73061676684,0,0,0,0,0]
[null,{"$f":"IF(ISBLANK(dms_E2_Projects_04),\"\",dms_E2_Projects_04)","v":"Kurri Kurri Rehabilitation (100kPa)"},null,33088.097702342988,8664.2943011920743,595023.6741164861,0,0,0,0]
[null,{"$f":"IF(ISBLANK(dms_E2_Projects_05),\"\",dms_E2_Projects_05)","v":"Matraville 2kPa and 7kPa"},null,0,1003631.5168697314,884163.99826528213,500560.41930193454,0,0,0]
[null,{"$f":"IF(ISBLANK(dms_E2_Projects_06),\"\",dms_E2_Projects_06)","v":"Mittagong Rehab"},null,0,24822.576264239153,209024.45006696647,2141.5664215577563,0,0,0]
[null,{"$f":"IF(ISBLANK(dms_E2_Projects_07),\"\",dms_E2_Projects_07)","v":"Newcastle MP1 (30kPa) Rehabilitation"},null,0,0,0,35382.355672907463,673546.10404865933,1003860.2153260058,1006318.3189691242]
[null,{"$f":"IF(ISBLANK(dms_E2_Projects_08),\"\",dms_E2_Projects_08)","v":0},null,0,0,0,0,0,0,0]
[null,{"$f":"IF(ISBLANK(dms_E2_Projects_09),\"\",dms_E2_Projects_09)","v":0},null,0,0,0,0,0,0,0]
[null,{"$f":"IF(ISBLANK(dms_E2_Projects_10),\"\",dms_E2_Projects_10)","v":0},null,0,0,0,0,0,0,0]
[null,{"$f":"IF(ISBLANK(dms_E2_Projects_11),\"\",dms_E2_Projects_11)","v":0},null,0,0,0,0,0,0,0]
[null,{"$f":"IF(ISBLANK(dms_E2_Projects_12),\"\",dms_E2_Projects_12)","v":""}]
[null,{"$f":"IF(ISBLANK(dms_E2_Projects_13),\"\",dms_E2_Projects_13)","v":""}]
[null,{"$f":"IF(ISBLANK(dms_E2_Projects_14),\"\",dms_E2_Projects_14)","v":""}]
[null,{"$f":"IF(ISBLANK(dms_E2_Projects_15),\"\",dms_E2_Projects_15)","v":""}]
[null,{"$f":"IF(ISBLANK(dms_E2_Projects_16),\"\",dms_E2_Projects_16)","v":""}]
[null,{"$f":"IF(ISBLANK(dms_E2_Projects_17),\"\",dms_E2_Projects_17)","v":""}]
[null,{"$f":"IF(ISBLANK(dms_E2_Projects_18),\"\",dms_E2_Projects_18)","v":""}]
[null,{"$f":"IF(ISBLANK(dms_E2_Projects_19),\"\",dms_E2_Projects_19)","v":""}]
[null,{"$f":"IF(ISBLANK(dms_E2_Projects_20),\"\",dms_E2_Projects_20)","v":""}]
[null,{"$f":"IF(ISBLANK(dms_E2_Projects_21),\"\",dms_E2_Projects_21)","v":""}]
[null,{"$f":"IF(ISBLANK(dms_E2_Projects_22),\"\",dms_E2_Projects_22)","v":""}]
[null,{"$f":"IF(ISBLANK(dms_E2_Projects_23),\"\",dms_E2_Projects_23)","v":""}]
[null,{"$f":"IF(ISBLANK(dms_E2_Projects_24),\"\",dms_E2_Projects_24)","v":""}]
[null,{"$f":"IF(ISBLANK(dms_E2_Projects_25),\"\",dms_E2_Projects_25)","v":""}]
[null,{"$f":"IF(ISBLANK(dms_E2_Projects_26),\"\",dms_E2_Projects_26)","v":""}]
[null,{"$f":"IF(ISBLANK(dms_E2_Projects_27),\"\",dms_E2_Projects_27)","v":""}]
[null,{"$f":"IF(ISBLANK(dms_E2_Projects_28),\"\",dms_E2_Projects_28)","v":""}]
[null,{"$f":"IF(ISBLANK(dms_E2_Projects_29),\"\",dms_E2_Projects_29)","v":""}]
[null,{"$f":"IF(ISBLANK(dms_E2_Projects_30),\"\",dms_E2_Projects_30)","v":""}]
[null,{"$f":"IF(ISBLANK(dms_E2_Projects_31),\"\",dms_E2_Projects_31)","v":""}]
[null,{"$f":"IF(ISBLANK(dms_E2_Projects_32),\"\",dms_E2_Projects_32)","v":""}]
[null,{"$f":"IF(ISBLANK(dms_E2_Projects_33),\"\",dms_E2_Projects_33)","v":""}]
[null,{"$f":"IF(ISBLANK(dms_E2_Projects_34),\"\",dms_E2_Projects_34)","v":""}]
[null,{"$f":"IF(ISBLANK(dms_E2_Projects_35),\"\",dms_E2_Projects_35)","v":""}]
[null,{"$f":"IF(ISBLANK(dms_E2_Projects_36),\"\",dms_E2_Projects_36)","v":""}]
[null,{"$f":"IF(ISBLANK(dms_E2_Projects_37),\"\",dms_E2_Projects_37)","v":""}]
[null,{"$f":"IF(ISBLANK(dms_E2_Projects_38),\"\",dms_E2_Projects_38)","v":""}]
[null,{"$f":"IF(ISBLANK(dms_E2_Projects_39),\"\",dms_E2_Projects_39)","v":""}]
[null,{"$f":"IF(ISBLANK(dms_E2_Projects_40),\"\",dms_E2_Projects_40)","v":""}]
[null,{"$f":"IF(ISBLANK(dms_E2_Projects_41),\"\",dms_E2_Projects_41)","v":""}]
[null,{"$f":"IF(ISBLANK(dms_E2_Projects_42),\"\",dms_E2_Projects_42)","v":""}]
[null,{"$f":"IF(ISBLANK(dms_E2_Projects_43),\"\",dms_E2_Projects_43)","v":""}]
[null,{"$f":"IF(ISBLANK(dms_E2_Projects_44),\"\",dms_E2_Projects_44)","v":""}]
[null,{"$f":"IF(ISBLANK(dms_E2_Projects_45),\"\",dms_E2_Projects_45)","v":""}]
[null,{"$f":"IF(ISBLANK(dms_E2_Projects_46),\"\",dms_E2_Projects_46)","v":""}]
[null,{"$f":"IF(ISBLANK(dms_E2_Projects_47),\"\",dms_E2_Projects_47)","v":""}]
[null,{"$f":"IF(ISBLANK(dms_E2_Projects_48),\"\",dms_E2_Projects_48)","v":""}]
[null,{"$f":"IF(ISBLANK(dms_E2_Projects_49),\"\",dms_E2_Projects_49)","v":""}]
[null,{"$f":"IF(ISBLANK(dms_E2_Projects_50),\"\",dms_E2_Projects_50)","v":""}]
[null,"Aggregate of other projects with total expenditure of less than $500,000",null,0,0,0,0,0,0,84459.450042967001]
[null,null,"Total",{"$f":"SUM(D238:D288)","v":478552.91967490851},{"$f":"SUM(E238:E288)","v":1867011.5868487505},1688212.1224487347,538084.34139639977,673546.10404865933,1003860.2153260058,1090777.7690120912]
[]
[null,"E. RELATED PARTY MARGIN EXPENDITURE"]
[null,null,null,"EXPENDITURE"]
[null,null,null,{"$f":"CONCATENATE(\"$0's, real \",dms_DollarReal)","v":"$0's, real June 2020"}]
[null,null,null,{"$f":"CRCP_y4","v":"2018-19"},{"$f":"CRCP_y5","v":"2019-20"},{"$f":"FRCP_y1","v":"2020-21"},{"$f":"FRCP_y2","v":"2021-22"},{"$f":"FRCP_y3","v":"2022-23"},{"$f":"FRCP_y4","v":"2023-24"},{"$f":"FRCP_y5","v":"2024-25"}]
[null,{"$f":"IF(ISBLANK(dms_E2_Projects_01),\"\",dms_E2_Projects_01)","v":"Mt Druitt Steel Main Stage 6: Oakhurst "},null,0,0,0,0,0,0,0]
[null,{"$f":"IF(ISBLANK(dms_E2_Projects_02),\"\",dms_E2_Projects_02)","v":"Bidwill Mains and Serivce Area Renewal"},null,0,0,0,0,0,0,0]
[null,{"$f":"IF(ISBLANK(dms_E2_Projects_03),\"\",dms_E2_Projects_03)","v":"Maitland 2kPa Rehabilitation"},null,0,0,0,0,0,0,0]
[null,{"$f":"IF(ISBLANK(dms_E2_Projects_04),\"\",dms_E2_Projects_04)","v":"Kurri Kurri Rehabilitation (100kPa)"},null,0,0,0,0,0,0,0]
[null,{"$f":"IF(ISBLANK(dms_E2_Projects_05),\"\",dms_E2_Projects_05)","v":"Matraville 2kPa and 7kPa"},null,0,0,0,0,0,0,0]
[null,{"$f":"IF(ISBLANK(dms_E2_Projects_06),\"\",dms_E2_Projects_06)","v":"Mittagong Rehab"},null,0,0,0,0,0,0,0]
[null,{"$f":"IF(ISBLANK(dms_E2_Projects_07),\"\",dms_E2_Projects_07)","v":"Newcastle MP1 (30kPa) Rehabilitation"},null,0,0,0,0,0,0,0]
[null,{"$f":"IF(ISBLANK(dms_E2_Projects_08),\"\",dms_E2_Projects_08)","v":0},null,0,0,0,0,0,0,0]
[null,{"$f":"IF(ISBLANK(dms_E2_Projects_09),\"\",dms_E2_Projects_09)","v":0},null,0,0,0,0,0,0,0]
[null,{"$f":"IF(ISBLANK(dms_E2_Projects_10),\"\",dms_E2_Projects_10)","v":0},null,0,0,0,0,0,0,0]
[null,{"$f":"IF(ISBLANK(dms_E2_Projects_11),\"\",dms_E2_Projects_11)","v":0},null,0,0,0,0,0,0,0]
[null,{"$f":"IF(ISBLANK(dms_E2_Projects_12),\"\",dms_E2_Projects_12)","v":""}]
[null,{"$f":"IF(ISBLANK(dms_E2_Projects_13),\"\",dms_E2_Projects_13)","v":""}]
[null,{"$f":"IF(ISBLANK(dms_E2_Projects_14),\"\",dms_E2_Projects_14)","v":""}]
[null,{"$f":"IF(ISBLANK(dms_E2_Projects_15),\"\",dms_E2_Projects_15)","v":""}]
[null,{"$f":"IF(ISBLANK(dms_E2_Projects_16),\"\",dms_E2_Projects_16)","v":""}]
[null,{"$f":"IF(ISBLANK(dms_E2_Projects_17),\"\",dms_E2_Projects_17)","v":""}]
[null,{"$f":"IF(ISBLANK(dms_E2_Projects_18),\"\",dms_E2_Projects_18)","v":""}]
[null,{"$f":"IF(ISBLANK(dms_E2_Projects_19),\"\",dms_E2_Projects_19)","v":""}]
[null,{"$f":"IF(ISBLANK(dms_E2_Projects_20),\"\",dms_E2_Projects_20)","v":""}]
[null,{"$f":"IF(ISBLANK(dms_E2_Projects_21),\"\",dms_E2_Projects_21)","v":""}]
[null,{"$f":"IF(ISBLANK(dms_E2_Projects_22),\"\",dms_E2_Projects_22)","v":""}]
[null,{"$f":"IF(ISBLANK(dms_E2_Projects_23),\"\",dms_E2_Projects_23)","v":""}]
[null,{"$f":"IF(ISBLANK(dms_E2_Projects_24),\"\",dms_E2_Projects_24)","v":""}]
[null,{"$f":"IF(ISBLANK(dms_E2_Projects_25),\"\",dms_E2_Projects_25)","v":""}]
[null,{"$f":"IF(ISBLANK(dms_E2_Projects_26),\"\",dms_E2_Projects_26)","v":""}]
[null,{"$f":"IF(ISBLANK(dms_E2_Projects_27),\"\",dms_E2_Projects_27)","v":""}]
[null,{"$f":"IF(ISBLANK(dms_E2_Projects_28),\"\",dms_E2_Projects_28)","v":""}]
[null,{"$f":"IF(ISBLANK(dms_E2_Projects_29),\"\",dms_E2_Projects_29)","v":""}]
[null,{"$f":"IF(ISBLANK(dms_E2_Projects_30),\"\",dms_E2_Projects_30)","v":""}]
[null,{"$f":"IF(ISBLANK(dms_E2_Projects_31),\"\",dms_E2_Projects_31)","v":""}]
[null,{"$f":"IF(ISBLANK(dms_E2_Projects_32),\"\",dms_E2_Projects_32)","v":""}]
[null,{"$f":"IF(ISBLANK(dms_E2_Projects_33),\"\",dms_E2_Projects_33)","v":""}]
[null,{"$f":"IF(ISBLANK(dms_E2_Projects_34),\"\",dms_E2_Projects_34)","v":""}]
[null,{"$f":"IF(ISBLANK(dms_E2_Projects_35),\"\",dms_E2_Projects_35)","v":""}]
[null,{"$f":"IF(ISBLANK(dms_E2_Projects_36),\"\",dms_E2_Projects_36)","v":""}]
[null,{"$f":"IF(ISBLANK(dms_E2_Projects_37),\"\",dms_E2_Projects_37)","v":""}]
[null,{"$f":"IF(ISBLANK(dms_E2_Projects_38),\"\",dms_E2_Projects_38)","v":""}]
[null,{"$f":"IF(ISBLANK(dms_E2_Projects_39),\"\",dms_E2_Projects_39)","v":""}]
[null,{"$f":"IF(ISBLANK(dms_E2_Projects_40),\"\",dms_E2_Projects_40)","v":""}]
[null,{"$f":"IF(ISBLANK(dms_E2_Projects_41),\"\",dms_E2_Projects_41)","v":""}]
[null,{"$f":"IF(ISBLANK(dms_E2_Projects_42),\"\",dms_E2_Projects_42)","v":""}]
[null,{"$f":"IF(ISBLANK(dms_E2_Projects_43),\"\",dms_E2_Projects_43)","v":""}]
[null,{"$f":"IF(ISBLANK(dms_E2_Projects_44),\"\",dms_E2_Projects_44)","v":""}]
[null,{"$f":"IF(ISBLANK(dms_E2_Projects_45),\"\",dms_E2_Projects_45)","v":""}]
[null,{"$f":"IF(ISBLANK(dms_E2_Projects_46),\"\",dms_E2_Projects_46)","v":""}]
[null,{"$f":"IF(ISBLANK(dms_E2_Projects_47),\"\",dms_E2_Projects_47)","v":""}]
[null,{"$f":"IF(ISBLANK(dms_E2_Projects_48),\"\",dms_E2_Projects_48)","v":""}]
[null,{"$f":"IF(ISBLANK(dms_E2_Projects_49),\"\",dms_E2_Projects_49)","v":""}]
[null,{"$f":"IF(ISBLANK(dms_E2_Projects_50),\"\",dms_E2_Projects_50)","v":""}]
[null,"Aggregate of other projects with total expenditure of less than $500,000",null,0,0,0,0,0,0,0]
[null,null,"Total",{"$f":"SUM(D295:D345)","v":0},{"$f":"SUM(E295:E345)","v":0},0,0,0,0,0]
[]
[null,"F. CUSTOMER CONTRIBUTIONS included in the above"]
[null,null,null,"EXPENDITURE"]
[null,null,null,{"$f":"CONCATENATE(\"$0's, real \",dms_DollarReal)","v":"$0's, real June 2020"}]
[null,null,null,{"$f":"CRCP_y4","v":"2018-19"},{"$f":"CRCP_y5","v":"2019-20"},{"$f":"FRCP_y1","v":"2020-21"},{"$f":"FRCP_y2","v":"2021-22"},{"$f":"FRCP_y3","v":"2022-23"},{"$f":"FRCP_y4","v":"2023-24"},{"$f":"FRCP_y5","v":"2024-25"}]
[null,{"$f":"IF(ISBLANK(dms_E2_Projects_01),\"\",dms_E2_Projects_01)","v":"Mt Druitt Steel Main Stage 6: Oakhurst "},null,0,0,0,0,0,0,0]
[null,{"$f":"IF(ISBLANK(dms_E2_Projects_02),\"\",dms_E2_Projects_02)","v":"Bidwill Mains and Serivce Area Renewal"},null,0,0,0,0,0,0,0]
[null,{"$f":"IF(ISBLANK(dms_E2_Projects_03),\"\",dms_E2_Projects_03)","v":"Maitland 2kPa Rehabilitation"},null,0,0,0,0,0,0,0]
[null,{"$f":"IF(ISBLANK(dms_E2_Projects_04),\"\",dms_E2_Projects_04)","v":"Kurri Kurri Rehabilitation (100kPa)"},null,0,0,0,0,0,0,0]
[null,{"$f":"IF(ISBLANK(dms_E2_Projects_05),\"\",dms_E2_Projects_05)","v":"Matraville 2kPa and 7kPa"},null,0,0,0,0,0,0,0]
[null,{"$f":"IF(ISBLANK(dms_E2_Projects_06),\"\",dms_E2_Projects_06)","v":"Mittagong Rehab"},null,0,0,0,0,0,0,0]
[null,{"$f":"IF(ISBLANK(dms_E2_Projects_07),\"\",dms_E2_Projects_07)","v":"Newcastle MP1 (30kPa) Rehabilitation"},null,0,0,0,0,0,0,0]
[null,{"$f":"IF(ISBLANK(dms_E2_Projects_08),\"\",dms_E2_Projects_08)","v":0},null,0,0,0,0,0,0,0]
[null,{"$f":"IF(ISBLANK(dms_E2_Projects_09),\"\",dms_E2_Projects_09)","v":0},null,0,0,0,0,0,0,0]
[null,{"$f":"IF(ISBLANK(dms_E2_Projects_10),\"\",dms_E2_Projects_10)","v":0},null,0,0,0,0,0,0,0]
[null,{"$f":"IF(ISBLANK(dms_E2_Projects_11),\"\",dms_E2_Projects_11)","v":0},null,0,0,0,0,0,0,0]
[null,{"$f":"IF(ISBLANK(dms_E2_Projects_12),\"\",dms_E2_Projects_12)","v":""}]
[null,{"$f":"IF(ISBLANK(dms_E2_Projects_13),\"\",dms_E2_Projects_13)","v":""}]
[null,{"$f":"IF(ISBLANK(dms_E2_Projects_14),\"\",dms_E2_Projects_14)","v":""}]
[null,{"$f":"IF(ISBLANK(dms_E2_Projects_15),\"\",dms_E2_Projects_15)","v":""}]
[null,{"$f":"IF(ISBLANK(dms_E2_Projects_16),\"\",dms_E2_Projects_16)","v":""}]
[null,{"$f":"IF(ISBLANK(dms_E2_Projects_17),\"\",dms_E2_Projects_17)","v":""}]
[null,{"$f":"IF(ISBLANK(dms_E2_Projects_18),\"\",dms_E2_Projects_18)","v":""}]
[null,{"$f":"IF(ISBLANK(dms_E2_Projects_19),\"\",dms_E2_Projects_19)","v":""}]
[null,{"$f":"IF(ISBLANK(dms_E2_Projects_20),\"\",dms_E2_Projects_20)","v":""}]
[null,{"$f":"IF(ISBLANK(dms_E2_Projects_21),\"\",dms_E2_Projects_21)","v":""}]
[null,{"$f":"IF(ISBLANK(dms_E2_Projects_22),\"\",dms_E2_Projects_22)","v":""}]
[null,{"$f":"IF(ISBLANK(dms_E2_Projects_23),\"\",dms_E2_Projects_23)","v":""}]
[null,{"$f":"IF(ISBLANK(dms_E2_Projects_24),\"\",dms_E2_Projects_24)","v":""}]
[null,{"$f":"IF(ISBLANK(dms_E2_Projects_25),\"\",dms_E2_Projects_25)","v":""}]
[null,{"$f":"IF(ISBLANK(dms_E2_Projects_26),\"\",dms_E2_Projects_26)","v":""}]
[null,{"$f":"IF(ISBLANK(dms_E2_Projects_27),\"\",dms_E2_Projects_27)","v":""}]
[null,{"$f":"IF(ISBLANK(dms_E2_Projects_28),\"\",dms_E2_Projects_28)","v":""}]
[null,{"$f":"IF(ISBLANK(dms_E2_Projects_29),\"\",dms_E2_Projects_29)","v":""}]
[null,{"$f":"IF(ISBLANK(dms_E2_Projects_30),\"\",dms_E2_Projects_30)","v":""}]
[null,{"$f":"IF(ISBLANK(dms_E2_Projects_31),\"\",dms_E2_Projects_31)","v":""}]
[null,{"$f":"IF(ISBLANK(dms_E2_Projects_32),\"\",dms_E2_Projects_32)","v":""}]
[null,{"$f":"IF(ISBLANK(dms_E2_Projects_33),\"\",dms_E2_Projects_33)","v":""}]
[null,{"$f":"IF(ISBLANK(dms_E2_Projects_34),\"\",dms_E2_Projects_34)","v":""}]
[null,{"$f":"IF(ISBLANK(dms_E2_Projects_35),\"\",dms_E2_Projects_35)","v":""}]
[null,{"$f":"IF(ISBLANK(dms_E2_Projects_36),\"\",dms_E2_Projects_36)","v":""}]
[null,{"$f":"IF(ISBLANK(dms_E2_Projects_37),\"\",dms_E2_Projects_37)","v":""}]
[null,{"$f":"IF(ISBLANK(dms_E2_Projects_38),\"\",dms_E2_Projects_38)","v":""}]
[null,{"$f":"IF(ISBLANK(dms_E2_Projects_39),\"\",dms_E2_Projects_39)","v":""}]
[null,{"$f":"IF(ISBLANK(dms_E2_Projects_40),\"\",dms_E2_Projects_40)","v":""}]
[null,{"$f":"IF(ISBLANK(dms_E2_Projects_41),\"\",dms_E2_Projects_41)","v":""}]
[null,{"$f":"IF(ISBLANK(dms_E2_Projects_42),\"\",dms_E2_Projects_42)","v":""}]
[null,{"$f":"IF(ISBLANK(dms_E2_Projects_43),\"\",dms_E2_Projects_43)","v":""}]
[null,{"$f":"IF(ISBLANK(dms_E2_Projects_44),\"\",dms_E2_Projects_44)","v":""}]
[null,{"$f":"IF(ISBLANK(dms_E2_Projects_45),\"\",dms_E2_Projects_45)","v":""}]
[null,{"$f":"IF(ISBLANK(dms_E2_Projects_46),\"\",dms_E2_Projects_46)","v":""}]
[null,{"$f":"IF(ISBLANK(dms_E2_Projects_47),\"\",dms_E2_Projects_47)","v":""}]
[null,{"$f":"IF(ISBLANK(dms_E2_Projects_48),\"\",dms_E2_Projects_48)","v":""}]
[null,{"$f":"IF(ISBLANK(dms_E2_Projects_49),\"\",dms_E2_Projects_49)","v":""}]
[null,{"$f":"IF(ISBLANK(dms_E2_Projects_50),\"\",dms_E2_Projects_50)","v":""}]
[null,"Aggregate of other projects with total expenditure of less than $500,000",null,0,0,0,0,0,0,0]
[null,null,"Total",{"$f":"SUM(D352:D402)","v":0},{"$f":"SUM(E352:E402)","v":0},0,0,0,0,0]
[]
[]
[]
[null,"E2.1.2 - REACTIVE - BY CONNECTION TYPE"]
[null,null,null,"EXPENDITURE"]
[null,null,null,{"$f":"CONCATENATE(\"$0's, real \",dms_DollarReal)","v":"$0's, real June 2020"}]
[null,null,null,{"$f":"CRCP_y4","v":"2018-19"},{"$f":"CRCP_y5","v":"2019-20"},{"$f":"FRCP_y1","v":"2020-21"},{"$f":"FRCP_y2","v":"2021-22"},{"$f":"FRCP_y3","v":"2022-23"},{"$f":"FRCP_y4","v":"2023-24"},{"$f":"FRCP_y5","v":"2024-25"}]
[null,"A. DIRECT INTERNAL LABOUR EXPENDITURE"]
[null,"Mains",null,32566.553805326374,35996.406982777196,36026.407910570197,36069.370933602026,36118.454537010992,36165.907235904459,36209.362062176799]
[null,"Services",null,98904.355224225277,113988.62211212778,114083.62505013896,114219.67462307306,114375.10603386814,114525.37291369746,114662.97986355987]
[null,null,"Total",{"$f":"SUM(D412:D413)","v":131470.90902955167},{"$f":"SUM(E412:E413)","v":149985.02909490498},{"$f":"SUM(F412:F413)","v":150110.03296070916},{"$f":"SUM(G412:G413)","v":150289.04555667509},{"$f":"SUM(H412:H413)","v":150493.56057087914},{"$f":"SUM(I412:I413)","v":150691.28014960192},{"$f":"SUM(J412:J413)","v":150872.34192573666}]
[null,"B. DIRECT CONTRACTOR EXPENDITURE"]
[null,"Mains",null,237816.71064416997,262863.15570340742,263082.23697330954,263395.97372537229,263754.40591254999,264100.92844697263,264418.25658391573]
[null,"Services",null,722247.38817654154,832399.99306079024,833093.75041548023,834087.25013034546,835222.28538974165,836319.60674874671,837324.47918239993]
[null,null,"Total",{"$f":"SUM(D416:D417)","v":960064.09882071149},{"$f":"SUM(E416:E417)","v":1095263.1487641977},{"$f":"SUM(F416:F417)","v":1096175.9873887897},{"$f":"SUM(G416:G417)","v":1097483.2238557178},{"$f":"SUM(H416:H417)","v":1098976.6913022916},{"$f":"SUM(I416:I417)","v":1100420.5351957195},{"$f":"SUM(J416:J417)","v":1101742.7357663156}]
[null,"C. OTHER INTERNAL DIRECT EXPENDITURE"]
[null,"Mains",null,16152.275122768611,17853.404830383755,17868.284612952939,17889.593301992136,17913.937660655869,17937.473127516343,17959.025739854715]
[null,"Services",null,49054.326287371623,56535.781962881891,56582.901274350974,56650.378789641763,56727.469258743578,56801.998237135092,56870.248176206602]
[null,null,"Total",{"$f":"SUM(D420:D421)","v":65206.601410140232},{"$f":"SUM(E420:E421)","v":74389.186793265646},{"$f":"SUM(F420:F421)","v":74451.185887303916},{"$f":"SUM(G420:G421)","v":74539.972091633899},{"$f":"SUM(H420:H421)","v":74641.406919399451},{"$f":"SUM(I420:I421)","v":74739.471364651428},{"$f":"SUM(J420:J421)","v":74829.273916061313}]
[null,"D. TOTAL OVERHEAD EXPENDITURE"]
[null,"Mains",null,65632.469590465043,69447.251445183894,51491.092992909944,35374.379247171019,39250.367049148197,38239.680192425069,38063.031832723042]
[null,"Services",null,199325.26866127408,219916.29624308235,163055.12781088147,112018.86761604153,124292.8289889693,121092.32060934606,120532.93413695632]
[null,null,"Total",{"$f":"SUM(D424:D425)","v":264957.73825173912},{"$f":"SUM(E424:E425)","v":289363.54768826626},{"$f":"SUM(F424:F425)","v":214546.22080379142},{"$f":"SUM(G424:G425)","v":147393.24686321255},{"$f":"SUM(H424:H425)","v":163543.19603811749},{"$f":"SUM(I424:I425)","v":159332.00080177112},{"$f":"SUM(J424:J425)","v":158595.96596967935}]
[null,"E. RELATED PARTY MARGIN EXPENDITURE"]
[null,"Mains",null,0,0,0,0,0,0,0]
[null,"Services",null,0,0,0,0,0,0,0]
[null,null,"Total",{"$f":"SUM(D428:D429)","v":0},{"$f":"SUM(E428:E429)","v":0},{"$f":"SUM(F428:F429)","v":0},{"$f":"SUM(G428:G429)","v":0},{"$f":"SUM(H428:H429)","v":0},{"$f":"SUM(I428:I429)","v":0},{"$f":"SUM(J428:J429)","v":0}]
[null,"F. CUSTOMER CONTRIBUTIONS included in the above"]
[null,"Mains",null,0,0,0,0,0,0,0]
[null,"Services",null,0,0,0,0,0,0,0]
[null,null,"Total",{"$f":"SUM(D432:D433)","v":0},{"$f":"SUM(E432:E433)","v":0},{"$f":"SUM(F432:F433)","v":0},{"$f":"SUM(G432:G433)","v":0},{"$f":"SUM(H432:H433)","v":0},{"$f":"SUM(I432:I433)","v":0},{"$f":"SUM(J432:J433)","v":0}]
[null,null,"TOTAL",{"$f":"SUM(D434,D430,D426,D422,D418,D414)","v":1421699.3475121427},{"$f":"SUM(E434,E430,E426,E422,E418,E414)","v":1609000.9123406345},1535283.4270405942,1469705.4883672395,1487654.8548306876,1485183.2875117438,1486040.317577793]
[]
[]
[null,"E2.2 - VOLUMES"]
[null,"E2.2.1 - PROACTIVE - BY CONNECTION TYPE - BY PROJECT"]
[null,null,null,"LENGTH"]
[null,null,null,"0s, metres"]
[null,null,null,{"$f":"CRCP_y4","v":"2018-19"},{"$f":"CRCP_y5","v":"2019-20"},{"$f":"FRCP_y1","v":"2020-21"},{"$f":"FRCP_y2","v":"2021-22"},{"$f":"FRCP_y3","v":"2022-23"},{"$f":"FRCP_y4","v":"2023-24"},{"$f":"FRCP_y5","v":"2024-25"}]
[null,"A. LOW PRESSURE TO HIGH PRESSURE"]
[null,{"$f":"IF(ISBLANK(dms_E2_Projects_01),\"\",dms_E2_Projects_01)","v":"Mt Druitt Steel Main Stage 6: Oakhurst "},null,0,0,0,0,0,0,0]
[null,{"$f":"IF(ISBLANK(dms_E2_Projects_02),\"\",dms_E2_Projects_02)","v":"Bidwill Mains and Serivce Area Renewal"},null,0,0,0,0,0,0,0]
[null,{"$f":"IF(ISBLANK(dms_E2_Projects_03),\"\",dms_E2_Projects_03)","v":"Maitland 2kPa Rehabilitation"},null,0,0,0,0,0,0,0]
[null,{"$f":"IF(ISBLANK(dms_E2_Projects_04),\"\",dms_E2_Projects_04)","v":"Kurri Kurri Rehabilitation (100kPa)"},null,0,0,0,0,0,0,0]
[null,{"$f":"IF(ISBLANK(dms_E2_Projects_05),\"\",dms_E2_Projects_05)","v":"Matraville 2kPa and 7kPa"},null,0,0,0,0,0,0,0]
[null,{"$f":"IF(ISBLANK(dms_E2_Projects_06),\"\",dms_E2_Projects_06)","v":"Mittagong Rehab"},null,0,0,0,0,0,0,0]
[null,{"$f":"IF(ISBLANK(dms_E2_Projects_07),\"\",dms_E2_Projects_07)","v":"Newcastle MP1 (30kPa) Rehabilitation"},null,0,0,0,0,0,0,0]
[null,{"$f":"IF(ISBLANK(dms_E2_Projects_08),\"\",dms_E2_Projects_08)","v":0},null,0,0,0,0,0,0,0]
[null,{"$f":"IF(ISBLANK(dms_E2_Projects_09),\"\",dms_E2_Projects_09)","v":0},null,0,0,0,0,0,0,0]
[null,{"$f":"IF(ISBLANK(dms_E2_Projects_10),\"\",dms_E2_Projects_10)","v":0},null,0,0,0,0,0,0,0]
[null,{"$f":"IF(ISBLANK(dms_E2_Projects_11),\"\",dms_E2_Projects_11)","v":0},null,0,0,0,0,0,0,0]
[null,{"$f":"IF(ISBLANK(dms_E2_Projects_12),\"\",dms_E2_Projects_12)","v":""}]
[null,{"$f":"IF(ISBLANK(dms_E2_Projects_13),\"\",dms_E2_Projects_13)","v":""}]
[null,{"$f":"IF(ISBLANK(dms_E2_Projects_14),\"\",dms_E2_Projects_14)","v":""}]
[null,{"$f":"IF(ISBLANK(dms_E2_Projects_15),\"\",dms_E2_Projects_15)","v":""}]
[null,{"$f":"IF(ISBLANK(dms_E2_Projects_16),\"\",dms_E2_Projects_16)","v":""}]
[null,{"$f":"IF(ISBLANK(dms_E2_Projects_17),\"\",dms_E2_Projects_17)","v":""}]
[null,{"$f":"IF(ISBLANK(dms_E2_Projects_18),\"\",dms_E2_Projects_18)","v":""}]
[null,{"$f":"IF(ISBLANK(dms_E2_Projects_19),\"\",dms_E2_Projects_19)","v":""}]
[null,{"$f":"IF(ISBLANK(dms_E2_Projects_20),\"\",dms_E2_Projects_20)","v":""}]
[null,{"$f":"IF(ISBLANK(dms_E2_Projects_21),\"\",dms_E2_Projects_21)","v":""}]
[null,{"$f":"IF(ISBLANK(dms_E2_Projects_22),\"\",dms_E2_Projects_22)","v":""}]
[null,{"$f":"IF(ISBLANK(dms_E2_Projects_23),\"\",dms_E2_Projects_23)","v":""}]
[null,{"$f":"IF(ISBLANK(dms_E2_Projects_24),\"\",dms_E2_Projects_24)","v":""}]
[null,{"$f":"IF(ISBLANK(dms_E2_Projects_25),\"\",dms_E2_Projects_25)","v":""}]
[null,{"$f":"IF(ISBLANK(dms_E2_Projects_26),\"\",dms_E2_Projects_26)","v":""}]
[null,{"$f":"IF(ISBLANK(dms_E2_Projects_27),\"\",dms_E2_Projects_27)","v":""}]
[null,{"$f":"IF(ISBLANK(dms_E2_Projects_28),\"\",dms_E2_Projects_28)","v":""}]
[null,{"$f":"IF(ISBLANK(dms_E2_Projects_29),\"\",dms_E2_Projects_29)","v":""}]
[null,{"$f":"IF(ISBLANK(dms_E2_Projects_30),\"\",dms_E2_Projects_30)","v":""}]
[null,{"$f":"IF(ISBLANK(dms_E2_Projects_31),\"\",dms_E2_Projects_31)","v":""}]
[null,{"$f":"IF(ISBLANK(dms_E2_Projects_32),\"\",dms_E2_Projects_32)","v":""}]
[null,{"$f":"IF(ISBLANK(dms_E2_Projects_33),\"\",dms_E2_Projects_33)","v":""}]
[null,{"$f":"IF(ISBLANK(dms_E2_Projects_34),\"\",dms_E2_Projects_34)","v":""}]
[null,{"$f":"IF(ISBLANK(dms_E2_Projects_35),\"\",dms_E2_Projects_35)","v":""}]
[null,{"$f":"IF(ISBLANK(dms_E2_Projects_36),\"\",dms_E2_Projects_36)","v":""}]
[null,{"$f":"IF(ISBLANK(dms_E2_Projects_37),\"\",dms_E2_Projects_37)","v":""}]
[null,{"$f":"IF(ISBLANK(dms_E2_Projects_38),\"\",dms_E2_Projects_38)","v":""}]
[null,{"$f":"IF(ISBLANK(dms_E2_Projects_39),\"\",dms_E2_Projects_39)","v":""}]
[null,{"$f":"IF(ISBLANK(dms_E2_Projects_40),\"\",dms_E2_Projects_40)","v":""}]
[null,{"$f":"IF(ISBLANK(dms_E2_Projects_41),\"\",dms_E2_Projects_41)","v":""}]
[null,{"$f":"IF(ISBLANK(dms_E2_Projects_42),\"\",dms_E2_Projects_42)","v":""}]
[null,{"$f":"IF(ISBLANK(dms_E2_Projects_43),\"\",dms_E2_Projects_43)","v":""}]
[null,{"$f":"IF(ISBLANK(dms_E2_Projects_44),\"\",dms_E2_Projects_44)","v":""}]
[null,{"$f":"IF(ISBLANK(dms_E2_Projects_45),\"\",dms_E2_Projects_45)","v":""}]
[null,{"$f":"IF(ISBLANK(dms_E2_Projects_46),\"\",dms_E2_Projects_46)","v":""}]
[null,{"$f":"IF(ISBLANK(dms_E2_Projects_47),\"\",dms_E2_Projects_47)","v":""}]
[null,{"$f":"IF(ISBLANK(dms_E2_Projects_48),\"\",dms_E2_Projects_48)","v":""}]
[null,{"$f":"IF(ISBLANK(dms_E2_Projects_49),\"\",dms_E2_Projects_49)","v":""}]
[null,{"$f":"IF(ISBLANK(dms_E2_Projects_50),\"\",dms_E2_Projects_50)","v":""}]
[null,"Aggregate of other projects with total expenditure of less than $500,000",null,0,0,0,0,0,0,0]
[null,null,"Total",{"$f":"SUM(D444:D494)","v":0},{"$f":"SUM(E444:E494)","v":0},0,0,0,0,0]
[]
[null,"B. LOW PRESSURE TO MEDIUM PRESSURE"]
[null,{"$f":"IF(ISBLANK(dms_E2_Projects_01),\"\",dms_E2_Projects_01)","v":"Mt Druitt Steel Main Stage 6: Oakhurst "},null,190.04198398677161,9009.95801601323,0,0,0,0,0]
[null,{"$f":"IF(ISBLANK(dms_E2_Projects_02),\"\",dms_E2_Projects_02)","v":"Bidwill Mains and Serivce Area Renewal"},null,0,13077.414185928958,14826.397450650671,11696.188363420375,0,0,0]
[null,{"$f":"IF(ISBLANK(dms_E2_Projects_03),\"\",dms_E2_Projects_03)","v":"Maitland 2kPa Rehabilitation"},null,0,0,0,0,0,0,0]
[null,{"$f":"IF(ISBLANK(dms_E2_Projects_04),\"\",dms_E2_Projects_04)","v":"Kurri Kurri Rehabilitation (100kPa)"},null,0,0,0,0,0,0,0]
[null,{"$f":"IF(ISBLANK(dms_E2_Projects_05),\"\",dms_E2_Projects_05)","v":"Matraville 2kPa and 7kPa"},null,0,0,0,0,0,0,0]
[null,{"$f":"IF(ISBLANK(dms_E2_Projects_06),\"\",dms_E2_Projects_06)","v":"Mittagong Rehab"},null,0,0,0,0,0,0,0]
[null,{"$f":"IF(ISBLANK(dms_E2_Projects_07),\"\",dms_E2_Projects_07)","v":"Newcastle MP1 (30kPa) Rehabilitation"},null,0,0,0,0,0,0,0]
[null,{"$f":"IF(ISBLANK(dms_E2_Projects_08),\"\",dms_E2_Projects_08)","v":0},null,0,0,0,0,0,0,0]
[null,{"$f":"IF(ISBLANK(dms_E2_Projects_09),\"\",dms_E2_Projects_09)","v":0},null,0,0,0,0,0,0,0]
[null,{"$f":"IF(ISBLANK(dms_E2_Projects_10),\"\",dms_E2_Projects_10)","v":0},null,0,0,0,0,0,0,0]
[null,{"$f":"IF(ISBLANK(dms_E2_Projects_11),\"\",dms_E2_Projects_11)","v":0},null,0,0,0,0,0,0,0]
[null,{"$f":"IF(ISBLANK(dms_E2_Projects_12),\"\",dms_E2_Projects_12)","v":""}]
[null,{"$f":"IF(ISBLANK(dms_E2_Projects_13),\"\",dms_E2_Projects_13)","v":""}]
[null,{"$f":"IF(ISBLANK(dms_E2_Projects_14),\"\",dms_E2_Projects_14)","v":""}]
[null,{"$f":"IF(ISBLANK(dms_E2_Projects_15),\"\",dms_E2_Projects_15)","v":""}]
[null,{"$f":"IF(ISBLANK(dms_E2_Projects_16),\"\",dms_E2_Projects_16)","v":""}]
[null,{"$f":"IF(ISBLANK(dms_E2_Projects_17),\"\",dms_E2_Projects_17)","v":""}]
[null,{"$f":"IF(ISBLANK(dms_E2_Projects_18),\"\",dms_E2_Projects_18)","v":""}]
[null,{"$f":"IF(ISBLANK(dms_E2_Projects_19),\"\",dms_E2_Projects_19)","v":""}]
[null,{"$f":"IF(ISBLANK(dms_E2_Projects_20),\"\",dms_E2_Projects_20)","v":""}]
[null,{"$f":"IF(ISBLANK(dms_E2_Projects_21),\"\",dms_E2_Projects_21)","v":""}]
[null,{"$f":"IF(ISBLANK(dms_E2_Projects_22),\"\",dms_E2_Projects_22)","v":""}]
[null,{"$f":"IF(ISBLANK(dms_E2_Projects_23),\"\",dms_E2_Projects_23)","v":""}]
[null,{"$f":"IF(ISBLANK(dms_E2_Projects_24),\"\",dms_E2_Projects_24)","v":""}]
[null,{"$f":"IF(ISBLANK(dms_E2_Projects_25),\"\",dms_E2_Projects_25)","v":""}]
[null,{"$f":"IF(ISBLANK(dms_E2_Projects_26),\"\",dms_E2_Projects_26)","v":""}]
[null,{"$f":"IF(ISBLANK(dms_E2_Projects_27),\"\",dms_E2_Projects_27)","v":""}]
[null,{"$f":"IF(ISBLANK(dms_E2_Projects_28),\"\",dms_E2_Projects_28)","v":""}]
[null,{"$f":"IF(ISBLANK(dms_E2_Projects_29),\"\",dms_E2_Projects_29)","v":""}]
[null,{"$f":"IF(ISBLANK(dms_E2_Projects_30),\"\",dms_E2_Projects_30)","v":""}]
[null,{"$f":"IF(ISBLANK(dms_E2_Projects_31),\"\",dms_E2_Projects_31)","v":""}]
[null,{"$f":"IF(ISBLANK(dms_E2_Projects_32),\"\",dms_E2_Projects_32)","v":""}]
[null,{"$f":"IF(ISBLANK(dms_E2_Projects_33),\"\",dms_E2_Projects_33)","v":""}]
[null,{"$f":"IF(ISBLANK(dms_E2_Projects_34),\"\",dms_E2_Projects_34)","v":""}]
[null,{"$f":"IF(ISBLANK(dms_E2_Projects_35),\"\",dms_E2_Projects_35)","v":""}]
[null,{"$f":"IF(ISBLANK(dms_E2_Projects_36),\"\",dms_E2_Projects_36)","v":""}]
[null,{"$f":"IF(ISBLANK(dms_E2_Projects_37),\"\",dms_E2_Projects_37)","v":""}]
[null,{"$f":"IF(ISBLANK(dms_E2_Projects_38),\"\",dms_E2_Projects_38)","v":""}]
[null,{"$f":"IF(ISBLANK(dms_E2_Projects_39),\"\",dms_E2_Projects_39)","v":""}]
[null,{"$f":"IF(ISBLANK(dms_E2_Projects_40),\"\",dms_E2_Projects_40)","v":""}]
[null,{"$f":"IF(ISBLANK(dms_E2_Projects_41),\"\",dms_E2_Projects_41)","v":""}]
[null,{"$f":"IF(ISBLANK(dms_E2_Projects_42),\"\",dms_E2_Projects_42)","v":""}]
[null,{"$f":"IF(ISBLANK(dms_E2_Projects_43),\"\",dms_E2_Projects_43)","v":""}]
[null,{"$f":"IF(ISBLANK(dms_E2_Projects_44),\"\",dms_E2_Projects_44)","v":""}]
[null,{"$f":"IF(ISBLANK(dms_E2_Projects_45),\"\",dms_E2_Projects_45)","v":""}]
[null,{"$f":"IF(ISBLANK(dms_E2_Projects_46),\"\",dms_E2_Projects_46)","v":""}]
[null,{"$f":"IF(ISBLANK(dms_E2_Projects_47),\"\",dms_E2_Projects_47)","v":""}]
[null,{"$f":"IF(ISBLANK(dms_E2_Projects_48),\"\",dms_E2_Projects_48)","v":""}]
[null,{"$f":"IF(ISBLANK(dms_E2_Projects_49),\"\",dms_E2_Projects_49)","v":""}]
[null,{"$f":"IF(ISBLANK(dms_E2_Projects_50),\"\",dms_E2_Projects_50)","v":""}]
[null,"Aggregate of other projects with total expenditure of less than $500,000",null,0,0,0,0,0,0,0]
[null,null,"Total",{"$f":"SUM(D498:D548)","v":190.04198398677161},{"$f":"SUM(E498:E548)","v":22087.372201942188},14826.397450650671,11696.188363420375,0,0,0]
[]
[null,"C. LOW PRESSURE TO LOW PRESSURE"]
[null,{"$f":"IF(ISBLANK(dms_E2_Projects_01),\"\",dms_E2_Projects_01)","v":"Mt Druitt Steel Main Stage 6: Oakhurst "},null,0,0,0,0,0,0,0]
[null,{"$f":"IF(ISBLANK(dms_E2_Projects_02),\"\",dms_E2_Projects_02)","v":"Bidwill Mains and Serivce Area Renewal"},null,0,0,0,0,0,0,0]
[null,{"$f":"IF(ISBLANK(dms_E2_Projects_03),\"\",dms_E2_Projects_03)","v":"Maitland 2kPa Rehabilitation"},null,0,0,0,0,0,0,0]
[null,{"$f":"IF(ISBLANK(dms_E2_Projects_04),\"\",dms_E2_Projects_04)","v":"Kurri Kurri Rehabilitation (100kPa)"},null,0,0,0,0,0,0,0]
[null,{"$f":"IF(ISBLANK(dms_E2_Projects_05),\"\",dms_E2_Projects_05)","v":"Matraville 2kPa and 7kPa"},null,0,0,0,0,0,0,0]
[null,{"$f":"IF(ISBLANK(dms_E2_Projects_06),\"\",dms_E2_Projects_06)","v":"Mittagong Rehab"},null,0,0,0,0,0,0,0]
[null,{"$f":"IF(ISBLANK(dms_E2_Projects_07),\"\",dms_E2_Projects_07)","v":"Newcastle MP1 (30kPa) Rehabilitation"},null,0,0,0,0,0,0,0]
[null,{"$f":"IF(ISBLANK(dms_E2_Projects_08),\"\",dms_E2_Projects_08)","v":0},null,0,0,0,0,0,0,0]
[null,{"$f":"IF(ISBLANK(dms_E2_Projects_09),\"\",dms_E2_Projects_09)","v":0},null,0,0,0,0,0,0,0]
[null,{"$f":"IF(ISBLANK(dms_E2_Projects_10),\"\",dms_E2_Projects_10)","v":0},null,0,0,0,0,0,0,0]
[null,{"$f":"IF(ISBLANK(dms_E2_Projects_11),\"\",dms_E2_Projects_11)","v":0},null,0,0,0,0,0,0,0]
[null,{"$f":"IF(ISBLANK(dms_E2_Projects_12),\"\",dms_E2_Projects_12)","v":""}]
[null,{"$f":"IF(ISBLANK(dms_E2_Projects_13),\"\",dms_E2_Projects_13)","v":""}]
[null,{"$f":"IF(ISBLANK(dms_E2_Projects_14),\"\",dms_E2_Projects_14)","v":""}]
[null,{"$f":"IF(ISBLANK(dms_E2_Projects_15),\"\",dms_E2_Projects_15)","v":""}]
[null,{"$f":"IF(ISBLANK(dms_E2_Projects_16),\"\",dms_E2_Projects_16)","v":""}]
[null,{"$f":"IF(ISBLANK(dms_E2_Projects_17),\"\",dms_E2_Projects_17)","v":""}]
[null,{"$f":"IF(ISBLANK(dms_E2_Projects_18),\"\",dms_E2_Projects_18)","v":""}]
[null,{"$f":"IF(ISBLANK(dms_E2_Projects_19),\"\",dms_E2_Projects_19)","v":""}]
[null,{"$f":"IF(ISBLANK(dms_E2_Projects_20),\"\",dms_E2_Projects_20)","v":""}]
[null,{"$f":"IF(ISBLANK(dms_E2_Projects_21),\"\",dms_E2_Projects_21)","v":""}]
[null,{"$f":"IF(ISBLANK(dms_E2_Projects_22),\"\",dms_E2_Projects_22)","v":""}]
[null,{"$f":"IF(ISBLANK(dms_E2_Projects_23),\"\",dms_E2_Projects_23)","v":""}]
[null,{"$f":"IF(ISBLANK(dms_E2_Projects_24),\"\",dms_E2_Projects_24)","v":""}]
[null,{"$f":"IF(ISBLANK(dms_E2_Projects_25),\"\",dms_E2_Projects_25)","v":""}]
[null,{"$f":"IF(ISBLANK(dms_E2_Projects_26),\"\",dms_E2_Projects_26)","v":""}]
[null,{"$f":"IF(ISBLANK(dms_E2_Projects_27),\"\",dms_E2_Projects_27)","v":""}]
[null,{"$f":"IF(ISBLANK(dms_E2_Projects_28),\"\",dms_E2_Projects_28)","v":""}]
[null,{"$f":"IF(ISBLANK(dms_E2_Projects_29),\"\",dms_E2_Projects_29)","v":""}]
[null,{"$f":"IF(ISBLANK(dms_E2_Projects_30),\"\",dms_E2_Projects_30)","v":""}]
[null,{"$f":"IF(ISBLANK(dms_E2_Projects_31),\"\",dms_E2_Projects_31)","v":""}]
[null,{"$f":"IF(ISBLANK(dms_E2_Projects_32),\"\",dms_E2_Projects_32)","v":""}]
[null,{"$f":"IF(ISBLANK(dms_E2_Projects_33),\"\",dms_E2_Projects_33)","v":""}]
[null,{"$f":"IF(ISBLANK(dms_E2_Projects_34),\"\",dms_E2_Projects_34)","v":""}]
[null,{"$f":"IF(ISBLANK(dms_E2_Projects_35),\"\",dms_E2_Projects_35)","v":""}]
[null,{"$f":"IF(ISBLANK(dms_E2_Projects_36),\"\",dms_E2_Projects_36)","v":""}]
[null,{"$f":"IF(ISBLANK(dms_E2_Projects_37),\"\",dms_E2_Projects_37)","v":""}]
[null,{"$f":"IF(ISBLANK(dms_E2_Projects_38),\"\",dms_E2_Projects_38)","v":""}]
[null,{"$f":"IF(ISBLANK(dms_E2_Projects_39),\"\",dms_E2_Projects_39)","v":""}]
[null,{"$f":"IF(ISBLANK(dms_E2_Projects_40),\"\",dms_E2_Projects_40)","v":""}]
[null,{"$f":"IF(ISBLANK(dms_E2_Projects_41),\"\",dms_E2_Projects_41)","v":""}]
[null,{"$f":"IF(ISBLANK(dms_E2_Projects_42),\"\",dms_E2_Projects_42)","v":""}]
[null,{"$f":"IF(ISBLANK(dms_E2_Projects_43),\"\",dms_E2_Projects_43)","v":""}]
[null,{"$f":"IF(ISBLANK(dms_E2_Projects_44),\"\",dms_E2_Projects_44)","v":""}]
[null,{"$f":"IF(ISBLANK(dms_E2_Projects_45),\"\",dms_E2_Projects_45)","v":""}]
[null,{"$f":"IF(ISBLANK(dms_E2_Projects_46),\"\",dms_E2_Projects_46)","v":""}]
[null,{"$f":"IF(ISBLANK(dms_E2_Projects_47),\"\",dms_E2_Projects_47)","v":""}]
[null,{"$f":"IF(ISBLANK(dms_E2_Projects_48),\"\",dms_E2_Projects_48)","v":""}]
[null,{"$f":"IF(ISBLANK(dms_E2_Projects_49),\"\",dms_E2_Projects_49)","v":""}]
[null,{"$f":"IF(ISBLANK(dms_E2_Projects_50),\"\",dms_E2_Projects_50)","v":""}]
[null,"Aggregate of other projects with total expenditure of less than $500,000",null,0,0,0,0,0,0,0]
[null,null,"Total",{"$f":"SUM(D552:D602)","v":0},{"$f":"SUM(E552:E602)","v":0},0,0,0,0,0]
[]
[null,"D. MEDIUM PRESSURE TO MEDIUM PRESSURE"]
[null,{"$f":"IF(ISBLANK(dms_E2_Projects_01),\"\",dms_E2_Projects_01)","v":"Mt Druitt Steel Main Stage 6: Oakhurst "},null,2650,0,0,0,0,0,0]
[null,{"$f":"IF(ISBLANK(dms_E2_Projects_02),\"\",dms_E2_Projects_02)","v":"Bidwill Mains and Serivce Area Renewal"},null,8008.5138515204126,15791.486148479586,0,0,0,0,0]
[null,{"$f":"IF(ISBLANK(dms_E2_Projects_03),\"\",dms_E2_Projects_03)","v":"Maitland 2kPa Rehabilitation"},null,435.57269672322735,118.19615766465492,10446.231145612119,0,0,0,0]
[null,{"$f":"IF(ISBLANK(dms_E2_Projects_04),\"\",dms_E2_Projects_04)","v":"Kurri Kurri Rehabilitation (100kPa)"},null,0,304.37917037191579,3298.5296158876449,47.091213740439542,0,0,0]
[null,{"$f":"IF(ISBLANK(dms_E2_Projects_05),\"\",dms_E2_Projects_05)","v":"Matraville 2kPa and 7kPa"},null,0,0,0,1438.2619983164093,24976.729093129408,38145.98364513219,38439.025263422001]
[null,{"$f":"IF(ISBLANK(dms_E2_Projects_06),\"\",dms_E2_Projects_06)","v":"Mittagong Rehab"},null,0,0,0,0,0,0,0]
[null,{"$f":"IF(ISBLANK(dms_E2_Projects_07),\"\",dms_E2_Projects_07)","v":"Newcastle MP1 (30kPa) Rehabilitation"},null,0,0,0,0,0,0,0]
[null,{"$f":"IF(ISBLANK(dms_E2_Projects_08),\"\",dms_E2_Projects_08)","v":0},null,0,0,0,0,0,0,0]
[null,{"$f":"IF(ISBLANK(dms_E2_Projects_09),\"\",dms_E2_Projects_09)","v":0},null,0,0,0,0,0,0,0]
[null,{"$f":"IF(ISBLANK(dms_E2_Projects_10),\"\",dms_E2_Projects_10)","v":0},null,0,0,0,0,0,0,0]
[null,{"$f":"IF(ISBLANK(dms_E2_Projects_11),\"\",dms_E2_Projects_11)","v":0},null,0,0,0,0,0,0,0]
[null,{"$f":"IF(ISBLANK(dms_E2_Projects_12),\"\",dms_E2_Projects_12)","v":""}]
[null,{"$f":"IF(ISBLANK(dms_E2_Projects_13),\"\",dms_E2_Projects_13)","v":""}]
[null,{"$f":"IF(ISBLANK(dms_E2_Projects_14),\"\",dms_E2_Projects_14)","v":""}]
[null,{"$f":"IF(ISBLANK(dms_E2_Projects_15),\"\",dms_E2_Projects_15)","v":""}]
[null,{"$f":"IF(ISBLANK(dms_E2_Projects_16),\"\",dms_E2_Projects_16)","v":""}]
[null,{"$f":"IF(ISBLANK(dms_E2_Projects_17),\"\",dms_E2_Projects_17)","v":""}]
[null,{"$f":"IF(ISBLANK(dms_E2_Projects_18),\"\",dms_E2_Projects_18)","v":""}]
[null,{"$f":"IF(ISBLANK(dms_E2_Projects_19),\"\",dms_E2_Projects_19)","v":""}]
[null,{"$f":"IF(ISBLANK(dms_E2_Projects_20),\"\",dms_E2_Projects_20)","v":""}]
[null,{"$f":"IF(ISBLANK(dms_E2_Projects_21),\"\",dms_E2_Projects_21)","v":""}]
[null,{"$f":"IF(ISBLANK(dms_E2_Projects_22),\"\",dms_E2_Projects_22)","v":""}]
[null,{"$f":"IF(ISBLANK(dms_E2_Projects_23),\"\",dms_E2_Projects_23)","v":""}]
[null,{"$f":"IF(ISBLANK(dms_E2_Projects_24),\"\",dms_E2_Projects_24)","v":""}]
[null,{"$f":"IF(ISBLANK(dms_E2_Projects_25),\"\",dms_E2_Projects_25)","v":""}]
[null,{"$f":"IF(ISBLANK(dms_E2_Projects_26),\"\",dms_E2_Projects_26)","v":""}]
[null,{"$f":"IF(ISBLANK(dms_E2_Projects_27),\"\",dms_E2_Projects_27)","v":""}]
[null,{"$f":"IF(ISBLANK(dms_E2_Projects_28),\"\",dms_E2_Projects_28)","v":""}]
[null,{"$f":"IF(ISBLANK(dms_E2_Projects_29),\"\",dms_E2_Projects_29)","v":""}]
[null,{"$f":"IF(ISBLANK(dms_E2_Projects_30),\"\",dms_E2_Projects_30)","v":""}]
[null,{"$f":"IF(ISBLANK(dms_E2_Projects_31),\"\",dms_E2_Projects_31)","v":""}]
[null,{"$f":"IF(ISBLANK(dms_E2_Projects_32),\"\",dms_E2_Projects_32)","v":""}]
[null,{"$f":"IF(ISBLANK(dms_E2_Projects_33),\"\",dms_E2_Projects_33)","v":""}]
[null,{"$f":"IF(ISBLANK(dms_E2_Projects_34),\"\",dms_E2_Projects_34)","v":""}]
[null,{"$f":"IF(ISBLANK(dms_E2_Projects_35),\"\",dms_E2_Projects_35)","v":""}]
[null,{"$f":"IF(ISBLANK(dms_E2_Projects_36),\"\",dms_E2_Projects_36)","v":""}]
[null,{"$f":"IF(ISBLANK(dms_E2_Projects_37),\"\",dms_E2_Projects_37)","v":""}]
[null,{"$f":"IF(ISBLANK(dms_E2_Projects_38),\"\",dms_E2_Projects_38)","v":""}]
[null,{"$f":"IF(ISBLANK(dms_E2_Projects_39),\"\",dms_E2_Projects_39)","v":""}]
[null,{"$f":"IF(ISBLANK(dms_E2_Projects_40),\"\",dms_E2_Projects_40)","v":""}]
[null,{"$f":"IF(ISBLANK(dms_E2_Projects_41),\"\",dms_E2_Projects_41)","v":""}]
[null,{"$f":"IF(ISBLANK(dms_E2_Projects_42),\"\",dms_E2_Projects_42)","v":""}]
[null,{"$f":"IF(ISBLANK(dms_E2_Projects_43),\"\",dms_E2_Projects_43)","v":""}]
[null,{"$f":"IF(ISBLANK(dms_E2_Projects_44),\"\",dms_E2_Projects_44)","v":""}]
[null,{"$f":"IF(ISBLANK(dms_E2_Projects_45),\"\",dms_E2_Projects_45)","v":""}]
[null,{"$f":"IF(ISBLANK(dms_E2_Projects_46),\"\",dms_E2_Projects_46)","v":""}]
[null,{"$f":"IF(ISBLANK(dms_E2_Projects_47),\"\",dms_E2_Projects_47)","v":""}]
[null,{"$f":"IF(ISBLANK(dms_E2_Projects_48),\"\",dms_E2_Projects_48)","v":""}]
[null,{"$f":"IF(ISBLANK(dms_E2_Projects_49),\"\",dms_E2_Projects_49)","v":""}]
[null,{"$f":"IF(ISBLANK(dms_E2_Projects_50),\"\",dms_E2_Projects_50)","v":""}]
[null,"Aggregate of other projects with total expenditure of less than $500,000",null,0,0,0,0,0,0,0]
[null,null,"Total",{"$f":"SUM(D606:D656)","v":11094.08654824364},{"$f":"SUM(E606:E656)","v":16214.061476516157},13744.760761499763,1485.3532120568489,24976.729093129408,38145.98364513219,38439.025263422001]
[]
[null,"E. MEDIUM PRESSURE TO HIGH PRESSURE"]
[null,{"$f":"IF(ISBLANK(dms_E2_Projects_01),\"\",dms_E2_Projects_01)","v":"Mt Druitt Steel Main Stage 6: Oakhurst "},null,0,0,0,0,0,0,0]
[null,{"$f":"IF(ISBLANK(dms_E2_Projects_02),\"\",dms_E2_Projects_02)","v":"Bidwill Mains and Serivce Area Renewal"},null,0,0,0,0,0,0,0]
[null,{"$f":"IF(ISBLANK(dms_E2_Projects_03),\"\",dms_E2_Projects_03)","v":"Maitland 2kPa Rehabilitation"},null,0,0,0,0,0,0,0]
[null,{"$f":"IF(ISBLANK(dms_E2_Projects_04),\"\",dms_E2_Projects_04)","v":"Kurri Kurri Rehabilitation (100kPa)"},null,0,0,0,0,0,0,0]
[null,{"$f":"IF(ISBLANK(dms_E2_Projects_05),\"\",dms_E2_Projects_05)","v":"Matraville 2kPa and 7kPa"},null,0,0,0,0,0,0,0]
[null,{"$f":"IF(ISBLANK(dms_E2_Projects_06),\"\",dms_E2_Projects_06)","v":"Mittagong Rehab"},null,0,0,0,0,0,0,0]
[null,{"$f":"IF(ISBLANK(dms_E2_Projects_07),\"\",dms_E2_Projects_07)","v":"Newcastle MP1 (30kPa) Rehabilitation"},null,0,0,0,0,0,0,0]
[null,{"$f":"IF(ISBLANK(dms_E2_Projects_08),\"\",dms_E2_Projects_08)","v":0},null,0,0,0,0,0,0,0]
[null,{"$f":"IF(ISBLANK(dms_E2_Projects_09),\"\",dms_E2_Projects_09)","v":0},null,0,0,0,0,0,0,0]
[null,{"$f":"IF(ISBLANK(dms_E2_Projects_10),\"\",dms_E2_Projects_10)","v":0},null,0,0,0,0,0,0,0]
[null,{"$f":"IF(ISBLANK(dms_E2_Projects_11),\"\",dms_E2_Projects_11)","v":0},null,0,0,0,0,0,0,0]
[null,{"$f":"IF(ISBLANK(dms_E2_Projects_12),\"\",dms_E2_Projects_12)","v":""}]
[null,{"$f":"IF(ISBLANK(dms_E2_Projects_13),\"\",dms_E2_Projects_13)","v":""}]
[null,{"$f":"IF(ISBLANK(dms_E2_Projects_14),\"\",dms_E2_Projects_14)","v":""}]
[null,{"$f":"IF(ISBLANK(dms_E2_Projects_15),\"\",dms_E2_Projects_15)","v":""}]
[null,{"$f":"IF(ISBLANK(dms_E2_Projects_16),\"\",dms_E2_Projects_16)","v":""}]
[null,{"$f":"IF(ISBLANK(dms_E2_Projects_17),\"\",dms_E2_Projects_17)","v":""}]
[null,{"$f":"IF(ISBLANK(dms_E2_Projects_18),\"\",dms_E2_Projects_18)","v":""}]
[null,{"$f":"IF(ISBLANK(dms_E2_Projects_19),\"\",dms_E2_Projects_19)","v":""}]
[null,{"$f":"IF(ISBLANK(dms_E2_Projects_20),\"\",dms_E2_Projects_20)","v":""}]
[null,{"$f":"IF(ISBLANK(dms_E2_Projects_21),\"\",dms_E2_Projects_21)","v":""}]
[null,{"$f":"IF(ISBLANK(dms_E2_Projects_22),\"\",dms_E2_Projects_22)","v":""}]
[null,{"$f":"IF(ISBLANK(dms_E2_Projects_23),\"\",dms_E2_Projects_23)","v":""}]
[null,{"$f":"IF(ISBLANK(dms_E2_Projects_24),\"\",dms_E2_Projects_24)","v":""}]
[null,{"$f":"IF(ISBLANK(dms_E2_Projects_25),\"\",dms_E2_Projects_25)","v":""}]
[null,{"$f":"IF(ISBLANK(dms_E2_Projects_26),\"\",dms_E2_Projects_26)","v":""}]
[null,{"$f":"IF(ISBLANK(dms_E2_Projects_27),\"\",dms_E2_Projects_27)","v":""}]
[null,{"$f":"IF(ISBLANK(dms_E2_Projects_28),\"\",dms_E2_Projects_28)","v":""}]
[null,{"$f":"IF(ISBLANK(dms_E2_Projects_29),\"\",dms_E2_Projects_29)","v":""}]
[null,{"$f":"IF(ISBLANK(dms_E2_Projects_30),\"\",dms_E2_Projects_30)","v":""}]
[null,{"$f":"IF(ISBLANK(dms_E2_Projects_31),\"\",dms_E2_Projects_31)","v":""}]
[null,{"$f":"IF(ISBLANK(dms_E2_Projects_32),\"\",dms_E2_Projects_32)","v":""}]
[null,{"$f":"IF(ISBLANK(dms_E2_Projects_33),\"\",dms_E2_Projects_33)","v":""}]
[null,{"$f":"IF(ISBLANK(dms_E2_Projects_34),\"\",dms_E2_Projects_34)","v":""}]
[null,{"$f":"IF(ISBLANK(dms_E2_Projects_35),\"\",dms_E2_Projects_35)","v":""}]
[null,{"$f":"IF(ISBLANK(dms_E2_Projects_36),\"\",dms_E2_Projects_36)","v":""}]
[null,{"$f":"IF(ISBLANK(dms_E2_Projects_37),\"\",dms_E2_Projects_37)","v":""}]
[null,{"$f":"IF(ISBLANK(dms_E2_Projects_38),\"\",dms_E2_Projects_38)","v":""}]
[null,{"$f":"IF(ISBLANK(dms_E2_Projects_39),\"\",dms_E2_Projects_39)","v":""}]
[null,{"$f":"IF(ISBLANK(dms_E2_Projects_40),\"\",dms_E2_Projects_40)","v":""}]
[null,{"$f":"IF(ISBLANK(dms_E2_Projects_41),\"\",dms_E2_Projects_41)","v":""}]
[null,{"$f":"IF(ISBLANK(dms_E2_Projects_42),\"\",dms_E2_Projects_42)","v":""}]
[null,{"$f":"IF(ISBLANK(dms_E2_Projects_43),\"\",dms_E2_Projects_43)","v":""}]
[null,{"$f":"IF(ISBLANK(dms_E2_Projects_44),\"\",dms_E2_Projects_44)","v":""}]
[null,{"$f":"IF(ISBLANK(dms_E2_Projects_45),\"\",dms_E2_Projects_45)","v":""}]
[null,{"$f":"IF(ISBLANK(dms_E2_Projects_46),\"\",dms_E2_Projects_46)","v":""}]
[null,{"$f":"IF(ISBLANK(dms_E2_Projects_47),\"\",dms_E2_Projects_47)","v":""}]
[null,{"$f":"IF(ISBLANK(dms_E2_Projects_48),\"\",dms_E2_Projects_48)","v":""}]
[null,{"$f":"IF(ISBLANK(dms_E2_Projects_49),\"\",dms_E2_Projects_49)","v":""}]
[null,{"$f":"IF(ISBLANK(dms_E2_Projects_50),\"\",dms_E2_Projects_50)","v":""}]
[null,"Aggregate of other projects with total expenditure of less than $500,000",null,0,0,0,0,0,0,0]
[null,null,"Total",{"$f":"SUM(D660:D710)","v":0},{"$f":"SUM(E660:E710)","v":0},0,0,0,0,0]
[]
[null,"F. HIGH PRESSURE TO HIGH PRESSURE"]
[null,{"$f":"IF(ISBLANK(dms_E2_Projects_01),\"\",dms_E2_Projects_01)","v":"Mt Druitt Steel Main Stage 6: Oakhurst "},null,0,0,0,0,0,0,0]
[null,{"$f":"IF(ISBLANK(dms_E2_Projects_02),\"\",dms_E2_Projects_02)","v":"Bidwill Mains and Serivce Area Renewal"},null,0,0,0,0,0,0,0]
[null,{"$f":"IF(ISBLANK(dms_E2_Projects_03),\"\",dms_E2_Projects_03)","v":"Maitland 2kPa Rehabilitation"},null,0,0,0,0,0,0,0]
[null,{"$f":"IF(ISBLANK(dms_E2_Projects_04),\"\",dms_E2_Projects_04)","v":"Kurri Kurri Rehabilitation (100kPa)"},null,0,0,0,0,0,0,0]
[null,{"$f":"IF(ISBLANK(dms_E2_Projects_05),\"\",dms_E2_Projects_05)","v":"Matraville 2kPa and 7kPa"},null,0,0,0,0,0,0,0]
[null,{"$f":"IF(ISBLANK(dms_E2_Projects_06),\"\",dms_E2_Projects_06)","v":"Mittagong Rehab"},null,0,0,0,0,0,0,0]
[null,{"$f":"IF(ISBLANK(dms_E2_Projects_07),\"\",dms_E2_Projects_07)","v":"Newcastle MP1 (30kPa) Rehabilitation"},null,0,0,0,0,0,0,0]
[null,{"$f":"IF(ISBLANK(dms_E2_Projects_08),\"\",dms_E2_Projects_08)","v":0},null,0,0,0,0,0,0,0]
[null,{"$f":"IF(ISBLANK(dms_E2_Projects_09),\"\",dms_E2_Projects_09)","v":0},null,0,0,0,0,0,0,0]
[null,{"$f":"IF(ISBLANK(dms_E2_Projects_10),\"\",dms_E2_Projects_10)","v":0},null,0,0,0,0,0,0,0]
[null,{"$f":"IF(ISBLANK(dms_E2_Projects_11),\"\",dms_E2_Projects_11)","v":0},null,0,0,0,0,0,0,0]
[null,{"$f":"IF(ISBLANK(dms_E2_Projects_12),\"\",dms_E2_Projects_12)","v":""}]
[null,{"$f":"IF(ISBLANK(dms_E2_Projects_13),\"\",dms_E2_Projects_13)","v":""}]
[null,{"$f":"IF(ISBLANK(dms_E2_Projects_14),\"\",dms_E2_Projects_14)","v":""}]
[null,{"$f":"IF(ISBLANK(dms_E2_Projects_15),\"\",dms_E2_Projects_15)","v":""}]
[null,{"$f":"IF(ISBLANK(dms_E2_Projects_16),\"\",dms_E2_Projects_16)","v":""}]
[null,{"$f":"IF(ISBLANK(dms_E2_Projects_17),\"\",dms_E2_Projects_17)","v":""}]
[null,{"$f":"IF(ISBLANK(dms_E2_Projects_18),\"\",dms_E2_Projects_18)","v":""}]
[null,{"$f":"IF(ISBLANK(dms_E2_Projects_19),\"\",dms_E2_Projects_19)","v":""}]
[null,{"$f":"IF(ISBLANK(dms_E2_Projects_20),\"\",dms_E2_Projects_20)","v":""}]
[null,{"$f":"IF(ISBLANK(dms_E2_Projects_21),\"\",dms_E2_Projects_21)","v":""}]
[null,{"$f":"IF(ISBLANK(dms_E2_Projects_22),\"\",dms_E2_Projects_22)","v":""}]
[null,{"$f":"IF(ISBLANK(dms_E2_Projects_23),\"\",dms_E2_Projects_23)","v":""}]
[null,{"$f":"IF(ISBLANK(dms_E2_Projects_24),\"\",dms_E2_Projects_24)","v":""}]
[null,{"$f":"IF(ISBLANK(dms_E2_Projects_25),\"\",dms_E2_Projects_25)","v":""}]
[null,{"$f":"IF(ISBLANK(dms_E2_Projects_26),\"\",dms_E2_Projects_26)","v":""}]
[null,{"$f":"IF(ISBLANK(dms_E2_Projects_27),\"\",dms_E2_Projects_27)","v":""}]
[null,{"$f":"IF(ISBLANK(dms_E2_Projects_28),\"\",dms_E2_Projects_28)","v":""}]
[null,{"$f":"IF(ISBLANK(dms_E2_Projects_29),\"\",dms_E2_Projects_29)","v":""}]
[null,{"$f":"IF(ISBLANK(dms_E2_Projects_30),\"\",dms_E2_Projects_30)","v":""}]
[null,{"$f":"IF(ISBLANK(dms_E2_Projects_31),\"\",dms_E2_Projects_31)","v":""}]
[null,{"$f":"IF(ISBLANK(dms_E2_Projects_32),\"\",dms_E2_Projects_32)","v":""}]
[null,{"$f":"IF(ISBLANK(dms_E2_Projects_33),\"\",dms_E2_Projects_33)","v":""}]
[null,{"$f":"IF(ISBLANK(dms_E2_Projects_34),\"\",dms_E2_Projects_34)","v":""}]
[null,{"$f":"IF(ISBLANK(dms_E2_Projects_35),\"\",dms_E2_Projects_35)","v":""}]
[null,{"$f":"IF(ISBLANK(dms_E2_Projects_36),\"\",dms_E2_Projects_36)","v":""}]
[null,{"$f":"IF(ISBLANK(dms_E2_Projects_37),\"\",dms_E2_Projects_37)","v":""}]
[null,{"$f":"IF(ISBLANK(dms_E2_Projects_38),\"\",dms_E2_Projects_38)","v":""}]
[null,{"$f":"IF(ISBLANK(dms_E2_Projects_39),\"\",dms_E2_Projects_39)","v":""}]
[null,{"$f":"IF(ISBLANK(dms_E2_Projects_40),\"\",dms_E2_Projects_40)","v":""}]
[null,{"$f":"IF(ISBLANK(dms_E2_Projects_41),\"\",dms_E2_Projects_41)","v":""}]
[null,{"$f":"IF(ISBLANK(dms_E2_Projects_42),\"\",dms_E2_Projects_42)","v":""}]
[null,{"$f":"IF(ISBLANK(dms_E2_Projects_43),\"\",dms_E2_Projects_43)","v":""}]
[null,{"$f":"IF(ISBLANK(dms_E2_Projects_44),\"\",dms_E2_Projects_44)","v":""}]
[null,{"$f":"IF(ISBLANK(dms_E2_Projects_45),\"\",dms_E2_Projects_45)","v":""}]
[null,{"$f":"IF(ISBLANK(dms_E2_Projects_46),\"\",dms_E2_Projects_46)","v":""}]
[null,{"$f":"IF(ISBLANK(dms_E2_Projects_47),\"\",dms_E2_Projects_47)","v":""}]
[null,{"$f":"IF(ISBLANK(dms_E2_Projects_48),\"\",dms_E2_Projects_48)","v":""}]
[null,{"$f":"IF(ISBLANK(dms_E2_Projects_49),\"\",dms_E2_Projects_49)","v":""}]
[null,{"$f":"IF(ISBLANK(dms_E2_Projects_50),\"\",dms_E2_Projects_50)","v":""}]
[null,"Aggregate of other projects with total expenditure of less than $500,000",null,0,0,0,0,0,0,0]
[null,null,"Total",{"$f":"SUM(D714:D764)","v":0},{"$f":"SUM(E714:E764)","v":0},0,0,0,0,0]
[]
[]
[null,"E2.2.2 - REACTIVE - BY CONNECTION TYPE"]
[null,null,null,"VOLUMES"]
[null,null,null,"0s"]
[null,null,null,{"$f":"CRCP_y4","v":"2018-19"},{"$f":"CRCP_y5","v":"2019-20"},{"$f":"FRCP_y1","v":"2020-21"},{"$f":"FRCP_y2","v":"2021-22"},{"$f":"FRCP_y3","v":"2022-23"},{"$f":"FRCP_y4","v":"2023-24"},{"$f":"FRCP_y5","v":"2024-25"}]
[null,"A. LOW PRESSURE TO HIGH PRESSURE"]
[null,"Mains","Length of mains replaced",0,0,0,0,0,0,0]
[null,"Services","Number of services replaced",0,0,0,0,0,0,0]
[null,null,"Total",{"$f":"SUM(D773:D774)","v":0},{"$f":"SUM(E773:E774)","v":0},0,0,0,0,0]
[null,"B. LOW PRESSURE TO MEDIUM PRESSURE"]
[null,"Mains","Length of mains replaced",183.8132514983879,201.55540423857749,192.32100453429979,184.10622489243312,186.35469584457437,186.04508896601277,186.15244691719991]
[null,"Services","Number of services replaced",0,0,0,0,0,0,0]
[null,null,"Total",{"$f":"SUM(D777:D778)","v":183.8132514983879},{"$f":"SUM(E777:E778)","v":201.55540423857749},192.32100453429979,184.10622489243312,186.35469584457437,186.04508896601277,186.15244691719991]
[null,"C. LOW PRESSURE TO LOW PRESSURE"]
[null,"Mains","Length of mains replaced",69.446688365915833,76.149870765685478,72.66101197404987,69.557376968777206,70.406874272373599,70.289901354283415,70.330462380862954]
[null,"Services","Number of services replaced",69.430764626825606,79.383147845973568,75.746154237378533,72.510740782225042,73.396307223350746,73.274367706482735,73.31665092951873]
[null,null,"Total",{"$f":"SUM(D781:D782)","v":138.87745299274144},{"$f":"SUM(E781:E782)","v":155.53301861165903},148.4071662114284,142.06811775100226,143.80318149572435,143.56426906076615,143.64711331038168]
[null,"D. MEDIUM PRESSURE TO MEDIUM PRESSURE"]
[null,"Mains","Length of mains replaced",975.08429321483004,1069.2020694020873,1020.2158399789719,976.63844533680503,988.5660332082482,986.92364452356014,987.49315216841683]
[null,"Services","Number of services replaced",158.66480576233346,181.40822445901179,173.0968816764836,165.70323924460365,167.72695636951289,167.44829733612036,167.54492394546378]
[null,null,"Total",{"$f":"SUM(D785:D786)","v":1133.7490989771636},{"$f":"SUM(E785:E786)","v":1250.6102938610991},1193.3127216554556,1142.3416845814086,1156.2929895777611,1154.3719418596804,1155.0380761138806]
[null,"E. MEDIUM PRESSURE TO HIGH PRESSURE"]
[null,"Mains","Length of mains replaced",0,0,0,0,0,0,0]
[null,"Services","Number of services replaced",0,0,0,0,0,0,0]
[null,null,"Total",{"$f":"SUM(D789:D790)","v":0},{"$f":"SUM(E789:E790)","v":0},0,0,0,0,0]
[null,"F. HIGH PRESSURE TO HIGH PRESSURE"]
[null,"Mains","Length of mains replaced",0,0,0,0,0,0,0]
[null,"Services","Number of services replaced",0,0,0,0,0,0,0]
[null,null,"Total",{"$f":"SUM(D793:D794)","v":0},{"$f":"SUM(E793:E794)","v":0},0,0,0,0,0]

{"sheet":"E3. Mains Augex","index":7,"n_rows":746,"n_cols":9,"rows_kept":746,"cut":false,"hidden":false,"merged":[[406,2,406,8],[407,2,407,8],[61,2,61,8],[62,2,62,8],[118,2,118,8],[119,2,119,8],[175,2,175,8],[176,2,176,8],[232,2,232,8],[233,2,233,8],[289,2,289,8],[290,2,290,8],[346,2,346,8],[347,2,347,8],[463,2,463,8],[464,2,464,8],[520,2,520,8],[521,2,521,8],[577,2,577,8],[578,2,578,8],[634,2,634,8],[635,2,635,8],[691,2,691,8],[692,2,692,8]]}
[null,{"$f":"IF(dms_MultiYear_ResponseFlag=\"Yes\",\"REGULATORY REPORTING STATEMENT - HISTORICAL INFORMATION\",INDEX(dms_Worksheet_List,MATCH(dms_Model,dms_Model_List)))","v":"REGULATORY REPORTING STATEMENT"}]
[null,{"$f":"INDEX(dms_TradingNameFull_List,MATCH(dms_TradingName,dms_TradingName_List))","v":"Jemena Gas Networks (NSW) Ltd"}]
[null,{"$f":"IF(SUM(dms_SingleYear_Model)>0,CONCATENATE(CRY),CONCATENATE(FRCP_y1,\" to \",dms_MultiYear_FinalYear_Result))","v":"2020-21 to 2024-25"}]
[null,"E3. MAINS AUGMENTATION"]
[]
[]
[null,"Please list all projects here:"]
[null,"Minor Capital: ME and CD Projects"]
[null,"Gas feed offtake"]
[null,"Sydney West Development"]
[null,"Edmondson Park RMS Component"]
[null,"Cecil Park (Elizabeth Dr) CDP"]
[null,"Edmondson Park Soldiers Parade Steel"]
[null,"Largs Low CDP"]
[null,"Burwood (Sydney South)"]
[null,"Liverpool - Shepherd ST (Sydney West)"]
[null,"Lidcombe CBD (Sydney West)"]
[null,"Aerotropolis Core"]
[null,"Sydney Science Park (near WSA)"]
[null,"Sydney South West Development"]
[null,"Wilton North (Sth Highlands)"]
[null,"Western Sydney Airport (itself)"]
[null,"Box Hill (Sydney North West)"]
[null,"Campsie (Sydney West)"]
[null,"Mt Gilead (Sydney West)"]
[null,"Sydney Primary Main Integrity Management (Lane Cove to Willoughby) – Stage 1"]
[null,"Sydney Primary Main Integrity Management (Lane Cove to Willoughby) – Stage 2"]
[null,0]
[null,0]
[null,0]
[null,""]
[null,""]
[null,""]
[null,""]
[null,""]
[null,""]
[null,""]
[null,""]
[null,""]
[null,""]
[null,""]
[null,""]
[null,""]
[null,""]
[null,""]
[null,""]
[null,""]
[null,""]
[null,""]
[null,""]
[null,""]
[null,""]
[null,""]
[null,""]
[null,""]
[null,""]
[null,""]
[]
[]
[null,"E3.1 - CAPEX BY PROJECT"]
[null,"A. DIRECT INTERNAL LABOUR EXPENDITURE"]
[null,null,"EXPENDITURE"]
[null,null,{"$f":"CONCATENATE(\"$0's, real \",dms_DollarReal)","v":"$0's, real June 2020"}]
[null,null,{"$f":"CRCP_y4","v":"2018-19"},{"$f":"CRCP_y5","v":"2019-20"},{"$f":"FRCP_y1","v":"2020-21"},{"$f":"FRCP_y2","v":"2021-22"},{"$f":"FRCP_y3","v":"2022-23"},{"$f":"FRCP_y4","v":"2023-24"},{"$f":"FRCP_y5","v":"2024-25"}]
[null,{"$f":"IF(ISBLANK(dms_E3_Projects_01),\"\",dms_E3_Projects_01)","v":"Minor Capital: ME and CD Projects"},74974.238155171624,47417.476460706908,47445.887101801593,47486.563220463257,47533.018563757054,47577.913175301357,47619.010268726794]
[null,{"$f":"IF(ISBLANK(dms_E3_Projects_02),\"\",dms_E3_Projects_02)","v":"Gas feed offtake"},410618.53533833957,0,0,0,0,0,0]
[null,{"$f":"IF(ISBLANK(dms_E3_Projects_03),\"\",dms_E3_Projects_03)","v":"Sydney West Development"},63747.551067133274,269.96478755604784,0,0,0,0,0]
[null,{"$f":"IF(ISBLANK(dms_E3_Projects_04),\"\",dms_E3_Projects_04)","v":"Edmondson Park RMS Component"},26178.690431704421,26197.140493262741,0,0,0,0,0]
[null,{"$f":"IF(ISBLANK(dms_E3_Projects_05),\"\",dms_E3_Projects_05)","v":"Cecil Park (Elizabeth Dr) CDP"},0,0,102815.32361485335,0,0,0,0]
[null,{"$f":"IF(ISBLANK(dms_E3_Projects_06),\"\",dms_E3_Projects_06)","v":"Edmondson Park Soldiers Parade Steel"},0,0,0,62010.285411839017,0,0,0]
[null,{"$f":"IF(ISBLANK(dms_E3_Projects_07),\"\",dms_E3_Projects_07)","v":"Largs Low CDP"},0,0,0,67956.552858305426,0,0,0]
[null,{"$f":"IF(ISBLANK(dms_E3_Projects_08),\"\",dms_E3_Projects_08)","v":"Burwood (Sydney South)"},48779.685834444434,0,0,0,0,0,0]
[null,{"$f":"IF(ISBLANK(dms_E3_Projects_09),\"\",dms_E3_Projects_09)","v":"Liverpool - Shepherd ST (Sydney West)"},9939.5648108708974,50442.024610462569,0,0,0,0,0]
[null,{"$f":"IF(ISBLANK(dms_E3_Projects_10),\"\",dms_E3_Projects_10)","v":"Lidcombe CBD (Sydney West)"},0,11255.629477508213,95748.840928614489,0,0,0,0]
[null,{"$f":"IF(ISBLANK(dms_E3_Projects_11),\"\",dms_E3_Projects_11)","v":"Aerotropolis Core"},0,0,25873.76207947369,224110.35346518824,0,0,0]
[null,{"$f":"IF(ISBLANK(dms_E3_Projects_12),\"\",dms_E3_Projects_12)","v":"Sydney Science Park (near WSA)"},0,0,27318.508553897736,236880.11862475963,0,0,0]
[null,{"$f":"IF(ISBLANK(dms_E3_Projects_13),\"\",dms_E3_Projects_13)","v":"Sydney South West Development"},0,25822.445584961555,320149.7373340432,0,0,0,0]
[null,{"$f":"IF(ISBLANK(dms_E3_Projects_14),\"\",dms_E3_Projects_14)","v":"Wilton North (Sth Highlands)"},0,0,0,11403.09202839566,104592.62300743982,0,0]
[null,{"$f":"IF(ISBLANK(dms_E3_Projects_15),\"\",dms_E3_Projects_15)","v":"Western Sydney Airport (itself)"},0,0,0,0,18401.428619663686,159407.36925801769,0]
[null,{"$f":"IF(ISBLANK(dms_E3_Projects_16),\"\",dms_E3_Projects_16)","v":"Box Hill (Sydney North West)"},0,0,0,0,11809.346110294333,102129.1810124711,0]
[null,{"$f":"IF(ISBLANK(dms_E3_Projects_17),\"\",dms_E3_Projects_17)","v":"Campsie (Sydney West)"},0,0,0,0,2894.4262963128463,25071.784645409003,0]
[null,{"$f":"IF(ISBLANK(dms_E3_Projects_18),\"\",dms_E3_Projects_18)","v":"Mt Gilead (Sydney West)"},19338.377299925771,32591.739430489775,0,0,0,0,0]
[null,{"$f":"IF(ISBLANK(dms_E3_Projects_19),\"\",dms_E3_Projects_19)","v":"Sydney Primary Main Integrity Management (Lane Cove to Willoughby) – Stage 1"},73.453941441992967,0,343618.38334036904,457369.07847724401,0,0,0]
[null,{"$f":"IF(ISBLANK(dms_E3_Projects_20),\"\",dms_E3_Projects_20)","v":"Sydney Primary Main Integrity Management (Lane Cove to Willoughby) – Stage 2"},0,0,7579.6788745861386,101149.46196923575,760677.29142739275,333282.41674001911,0]
[null,{"$f":"IF(ISBLANK(dms_E3_Projects_21),\"\",dms_E3_Projects_21)","v":0},0,0,0,0,0,0,0]
[null,{"$f":"IF(ISBLANK(dms_E3_Projects_22),\"\",dms_E3_Projects_22)","v":0},0,0,0,0,0,0,0]
[null,{"$f":"IF(ISBLANK(dms_E3_Projects_23),\"\",dms_E3_Projects_23)","v":0},0,0,0,0,0,0,0]
[null,{"$f":"IF(ISBLANK(dms_E3_Projects_24),\"\",dms_E3_Projects_24)","v":""},0,0,0,0,0,0,0]
[null,{"$f":"IF(ISBLANK(dms_E3_Projects_25),\"\",dms_E3_Projects_25)","v":""}]
[null,{"$f":"IF(ISBLANK(dms_E3_Projects_26),\"\",dms_E3_Projects_26)","v":""}]
[null,{"$f":"IF(ISBLANK(dms_E3_Projects_27),\"\",dms_E3_Projects_27)","v":""}]
[null,{"$f":"IF(ISBLANK(dms_E3_Projects_28),\"\",dms_E3_Projects_28)","v":""}]
[null,{"$f":"IF(ISBLANK(dms_E3_Projects_29),\"\",dms_E3_Projects_29)","v":""}]
[null,{"$f":"IF(ISBLANK(dms_E3_Projects_30),\"\",dms_E3_Projects_30)","v":""}]
[null,{"$f":"IF(ISBLANK(dms_E3_Projects_31),\"\",dms_E3_Projects_31)","v":""}]
[null,{"$f":"IF(ISBLANK(dms_E3_Projects_32),\"\",dms_E3_Projects_32)","v":""}]
[null,{"$f":"IF(ISBLANK(dms_E3_Projects_33),\"\",dms_E3_Projects_33)","v":""}]
[null,{"$f":"IF(ISBLANK(dms_E3_Projects_34),\"\",dms_E3_Projects_34)","v":""}]
[null,{"$f":"IF(ISBLANK(dms_E3_Projects_35),\"\",dms_E3_Projects_35)","v":""}]
[null,{"$f":"IF(ISBLANK(dms_E3_Projects_36),\"\",dms_E3_Projects_36)","v":""}]
[null,{"$f":"IF(ISBLANK(dms_E3_Projects_37),\"\",dms_E3_Projects_37)","v":""}]
[null,{"$f":"IF(ISBLANK(dms_E3_Projects_38),\"\",dms_E3_Projects_38)","v":""}]
[null,{"$f":"IF(ISBLANK(dms_E3_Projects_39),\"\",dms_E3_Projects_39)","v":""}]
[null,{"$f":"IF(ISBLANK(dms_E3_Projects_40),\"\",dms_E3_Projects_40)","v":""}]
[null,{"$f":"IF(ISBLANK(dms_E3_Projects_41),\"\",dms_E3_Projects_41)","v":""}]
[null,{"$f":"IF(ISBLANK(dms_E3_Projects_42),\"\",dms_E3_Projects_42)","v":""}]
[null,{"$f":"IF(ISBLANK(dms_E3_Projects_43),\"\",dms_E3_Projects_43)","v":""}]
[null,{"$f":"IF(ISBLANK(dms_E3_Projects_44),\"\",dms_E3_Projects_44)","v":""}]
[null,{"$f":"IF(ISBLANK(dms_E3_Projects_45),\"\",dms_E3_Projects_45)","v":""}]
[null,{"$f":"IF(ISBLANK(dms_E3_Projects_46),\"\",dms_E3_Projects_46)","v":""}]
[null,{"$f":"IF(ISBLANK(dms_E3_Projects_47),\"\",dms_E3_Projects_47)","v":""}]
[null,{"$f":"IF(ISBLANK(dms_E3_Projects_48),\"\",dms_E3_Projects_48)","v":""}]
[null,{"$f":"IF(ISBLANK(dms_E3_Projects_49),\"\",dms_E3_Projects_49)","v":""}]
[null,{"$f":"IF(ISBLANK(dms_E3_Projects_50),\"\",dms_E3_Projects_50)","v":""}]
[null,"Aggregate of other projects with total expenditure of less than $500,000",3159.9534890110695,0,4556.7892625063014,11437.786295692489,18291.051238014177,188.66805206424047,0]
[null,"Total",{"$f":"SUM(C65:C115)","v":656810.05036804301},{"$f":"SUM(D65:D115)","v":193996.42084494783},975106.91109014559,1219803.2923511232,964199.1852628747,667657.33288328256,47619.010268726794]
[]
[null,"B. DIRECT CONTRACTOR EXPENDITURE"]
[null,null,"EXPENDITURE"]
[null,null,{"$f":"CONCATENATE(\"$0's, real \",dms_DollarReal)","v":"$0's, real June 2020"}]
[null,null,{"$f":"CRCP_y4","v":"2018-19"},{"$f":"CRCP_y5","v":"2019-20"},{"$f":"FRCP_y1","v":"2020-21"},{"$f":"FRCP_y2","v":"2021-22"},{"$f":"FRCP_y3","v":"2022-23"},{"$f":"FRCP_y4","v":"2023-24"},{"$f":"FRCP_y5","v":"2024-25"}]
[null,{"$f":"IF(ISBLANK(dms_E3_Projects_01),\"\",dms_E3_Projects_01)","v":"Minor Capital: ME and CD Projects"}]
[null,{"$f":"IF(ISBLANK(dms_E3_Projects_02),\"\",dms_E3_Projects_02)","v":"Gas feed offtake"}]
[null,{"$f":"IF(ISBLANK(dms_E3_Projects_03),\"\",dms_E3_Projects_03)","v":"Sydney West Development"}]
[null,{"$f":"IF(ISBLANK(dms_E3_Projects_04),\"\",dms_E3_Projects_04)","v":"Edmondson Park RMS Component"}]
[null,{"$f":"IF(ISBLANK(dms_E3_Projects_05),\"\",dms_E3_Projects_05)","v":"Cecil Park (Elizabeth Dr) CDP"}]
[null,{"$f":"IF(ISBLANK(dms_E3_Projects_06),\"\",dms_E3_Projects_06)","v":"Edmondson Park Soldiers Parade Steel"}]
[null,{"$f":"IF(ISBLANK(dms_E3_Projects_07),\"\",dms_E3_Projects_07)","v":"Largs Low CDP"}]
[null,{"$f":"IF(ISBLANK(dms_E3_Projects_08),\"\",dms_E3_Projects_08)","v":"Burwood (Sydney South)"}]
[null,{"$f":"IF(ISBLANK(dms_E3_Projects_09),\"\",dms_E3_Projects_09)","v":"Liverpool - Shepherd ST (Sydney West)"}]
[null,{"$f":"IF(ISBLANK(dms_E3_Projects_10),\"\",dms_E3_Projects_10)","v":"Lidcombe CBD (Sydney West)"}]
[null,{"$f":"IF(ISBLANK(dms_E3_Projects_11),\"\",dms_E3_Projects_11)","v":"Aerotropolis Core"}]
[null,{"$f":"IF(ISBLANK(dms_E3_Projects_12),\"\",dms_E3_Projects_12)","v":"Sydney Science Park (near WSA)"}]
[null,{"$f":"IF(ISBLANK(dms_E3_Projects_13),\"\",dms_E3_Projects_13)","v":"Sydney South West Development"}]
[null,{"$f":"IF(ISBLANK(dms_E3_Projects_14),\"\",dms_E3_Projects_14)","v":"Wilton North (Sth Highlands)"}]
[null,{"$f":"IF(ISBLANK(dms_E3_Projects_15),\"\",dms_E3_Projects_15)","v":"Western Sydney Airport (itself)"}]
[null,{"$f":"IF(ISBLANK(dms_E3_Projects_16),\"\",dms_E3_Projects_16)","v":"Box Hill (Sydney North West)"}]
[null,{"$f":"IF(ISBLANK(dms_E3_Projects_17),\"\",dms_E3_Projects_17)","v":"Campsie (Sydney West)"}]
[null,{"$f":"IF(ISBLANK(dms_E3_Projects_18),\"\",dms_E3_Projects_18)","v":"Mt Gilead (Sydney West)"}]
[null,{"$f":"IF(ISBLANK(dms_E3_Projects_19),\"\",dms_E3_Projects_19)","v":"Sydney Primary Main Integrity Management (Lane Cove to Willoughby) – Stage 1"}]
[null,{"$f":"IF(ISBLANK(dms_E3_Projects_20),\"\",dms_E3_Projects_20)","v":"Sydney Primary Main Integrity Management (Lane Cove to Willoughby) – Stage 2"}]
[null,{"$f":"IF(ISBLANK(dms_E3_Projects_21),\"\",dms_E3_Projects_21)","v":0},0,0,0,0,0,0,0]
[null,{"$f":"IF(ISBLANK(dms_E3_Projects_22),\"\",dms_E3_Projects_22)","v":0},0,0,0,0,0,0,0]
[null,{"$f":"IF(ISBLANK(dms_E3_Projects_23),\"\",dms_E3_Projects_23)","v":0},0,0,0,0,0,0,0]
[null,{"$f":"IF(ISBLANK(dms_E3_Projects_24),\"\",dms_E3_Projects_24)","v":""},0,0,0,0,0,0,0]
[null,{"$f":"IF(ISBLANK(dms_E3_Projects_25),\"\",dms_E3_Projects_25)","v":""}]
[null,{"$f":"IF(ISBLANK(dms_E3_Projects_26),\"\",dms_E3_Projects_26)","v":""}]
[null,{"$f":"IF(ISBLANK(dms_E3_Projects_27),\"\",dms_E3_Projects_27)","v":""}]
[null,{"$f":"IF(ISBLANK(dms_E3_Projects_28),\"\",dms_E3_Projects_28)","v":""}]
[null,{"$f":"IF(ISBLANK(dms_E3_Projects_29),\"\",dms_E3_Projects_29)","v":""}]
[null,{"$f":"IF(ISBLANK(dms_E3_Projects_30),\"\",dms_E3_Projects_30)","v":""}]
[null,{"$f":"IF(ISBLANK(dms_E3_Projects_31),\"\",dms_E3_Projects_31)","v":""}]
[null,{"$f":"IF(ISBLANK(dms_E3_Projects_32),\"\",dms_E3_Projects_32)","v":""}]
[null,{"$f":"IF(ISBLANK(dms_E3_Projects_33),\"\",dms_E3_Projects_33)","v":""}]
[null,{"$f":"IF(ISBLANK(dms_E3_Projects_34),\"\",dms_E3_Projects_34)","v":""}]
[null,{"$f":"IF(ISBLANK(dms_E3_Projects_35),\"\",dms_E3_Projects_35)","v":""}]
[null,{"$f":"IF(ISBLANK(dms_E3_Projects_36),\"\",dms_E3_Projects_36)","v":""}]
[null,{"$f":"IF(ISBLANK(dms_E3_Projects_37),\"\",dms_E3_Projects_37)","v":""}]
[null,{"$f":"IF(ISBLANK(dms_E3_Projects_38),\"\",dms_E3_Projects_38)","v":""}]
[null,{"$f":"IF(ISBLANK(dms_E3_Projects_39),\"\",dms_E3_Projects_39)","v":""}]
[null,{"$f":"IF(ISBLANK(dms_E3_Projects_40),\"\",dms_E3_Projects_40)","v":""}]
[null,{"$f":"IF(ISBLANK(dms_E3_Projects_41),\"\",dms_E3_Projects_41)","v":""}]
[null,{"$f":"IF(ISBLANK(dms_E3_Projects_42),\"\",dms_E3_Projects_42)","v":""}]
[null,{"$f":"IF(ISBLANK(dms_E3_Projects_43),\"\",dms_E3_Projects_43)","v":""}]
[null,{"$f":"IF(ISBLANK(dms_E3_Projects_44),\"\",dms_E3_Projects_44)","v":""}]
[null,{"$f":"IF(ISBLANK(dms_E3_Projects_45),\"\",dms_E3_Projects_45)","v":""}]
[null,{"$f":"IF(ISBLANK(dms_E3_Projects_46),\"\",dms_E3_Projects_46)","v":""}]
[null,{"$f":"IF(ISBLANK(dms_E3_Projects_47),\"\",dms_E3_Projects_47)","v":""}]
[null,{"$f":"IF(ISBLANK(dms_E3_Projects_48),\"\",dms_E3_Projects_48)","v":""}]
[null,{"$f":"IF(ISBLANK(dms_E3_Projects_49),\"\",dms_E3_Projects_49)","v":""}]
[null,{"$f":"IF(ISBLANK(dms_E3_Projects_50),\"\",dms_E3_Projects_50)","v":""}]
[null,"Aggregate of other projects with total expenditure of less than $500,000"]
[null,"Total"]
[]
[null,"C. OTHER INTERNAL DIRECT EXPENDITURE"]
[null,null,"EXPENDITURE"]
[null,null,{"$f":"CONCATENATE(\"$0's, real \",dms_DollarReal)","v":"$0's, real June 2020"}]
[null,null,{"$f":"CRCP_y4","v":"2018-19"},{"$f":"CRCP_y5","v":"2019-20"},{"$f":"FRCP_y1","v":"2020-21"},{"$f":"FRCP_y2","v":"2021-22"},{"$f":"FRCP_y3","v":"2022-23"},{"$f":"FRCP_y4","v":"2023-24"},{"$f":"FRCP_y5","v":"2024-25"}]
[null,{"$f":"IF(ISBLANK(dms_E3_Projects_01),\"\",dms_E3_Projects_01)","v":"Minor Capital: ME and CD Projects"},89054.557110511189,56322.577853564544,56356.324072561474,56404.639251501896,56459.819005564677,56513.14491918651,56561.960132833061]
[null,{"$f":"IF(ISBLANK(dms_E3_Projects_02),\"\",dms_E3_Projects_02)","v":"Gas feed offtake"},556604.31130536017,0,0,0,0,0,0]
[null,{"$f":"IF(ISBLANK(dms_E3_Projects_03),\"\",dms_E3_Projects_03)","v":"Sydney West Development"},69241.528054340786,293.23125513575667,0,0,0,0,0]
[null,{"$f":"IF(ISBLANK(dms_E3_Projects_04),\"\",dms_E3_Projects_04)","v":"Edmondson Park RMS Component"},31095.103324738513,31117.018346500216,0,0,0,0,0]
[null,{"$f":"IF(ISBLANK(dms_E3_Projects_05),\"\",dms_E3_Projects_05)","v":"Cecil Park (Elizabeth Dr) CDP"},0,0,122124.25673128449,0,0,0,0]
[null,{"$f":"IF(ISBLANK(dms_E3_Projects_06),\"\",dms_E3_Projects_06)","v":"Edmondson Park Soldiers Parade Steel"},0,0,0,73655.946889628976,0,0,0]
[null,{"$f":"IF(ISBLANK(dms_E3_Projects_07),\"\",dms_E3_Projects_07)","v":"Largs Low CDP"},0,0,0,80718.93581670204,0,0,0]
[null,{"$f":"IF(ISBLANK(dms_E3_Projects_08),\"\",dms_E3_Projects_08)","v":"Burwood (Sydney South)"},52983.6821751889,0,0,0,0,0,0]
[null,{"$f":"IF(ISBLANK(dms_E3_Projects_09),\"\",dms_E3_Projects_09)","v":"Liverpool - Shepherd ST (Sydney West)"},10796.189723038489,54789.286862249937,0,0,0,0,0]
[null,{"$f":"IF(ISBLANK(dms_E3_Projects_10),\"\",dms_E3_Projects_10)","v":"Lidcombe CBD (Sydney West)"},0,12225.677240768046,104000.79602034215,0,0,0,0]
[null,{"$f":"IF(ISBLANK(dms_E3_Projects_11),\"\",dms_E3_Projects_11)","v":"Aerotropolis Core"},0,0,21864.72673852291,189385.35581872356,0,0,0]
[null,{"$f":"IF(ISBLANK(dms_E3_Projects_12),\"\",dms_E3_Projects_12)","v":"Sydney Science Park (near WSA)"},0,0,23085.615559124166,200176.4972411239,0,0,0]
[null,{"$f":"IF(ISBLANK(dms_E3_Projects_13),\"\",dms_E3_Projects_13)","v":"Sydney South West Development"},0,21821.361528382986,270543.82353511732,0,0,0,0]
[null,{"$f":"IF(ISBLANK(dms_E3_Projects_14),\"\",dms_E3_Projects_14)","v":"Wilton North (Sth Highlands)"},0,0,0,9636.2287946095112,88386.416861166974,0,0]
[null,{"$f":"IF(ISBLANK(dms_E3_Projects_15),\"\",dms_E3_Projects_15)","v":"Western Sydney Airport (itself)"},0,0,0,0,35969.786054171534,311598.03329302656,0]
[null,{"$f":"IF(ISBLANK(dms_E3_Projects_16),\"\",dms_E3_Projects_16)","v":"Box Hill (Sydney North West)"},0,0,0,0,9979.5354409271276,86304.675292594562,0]
[null,{"$f":"IF(ISBLANK(dms_E3_Projects_17),\"\",dms_E3_Projects_17)","v":"Campsie (Sydney West)"},0,0,0,0,2445.9465863250548,21187.012481414658,0]
[null,{"$f":"IF(ISBLANK(dms_E3_Projects_18),\"\",dms_E3_Projects_18)","v":"Mt Gilead (Sydney West)"},16341.973537925198,27541.78052623172,0,0,0,0,0]
[null,{"$f":"IF(ISBLANK(dms_E3_Projects_19),\"\",dms_E3_Projects_19)","v":"Sydney Primary Main Integrity Management (Lane Cove to Willoughby) – Stage 1"},87.248745490412006,0,408150.63542323723,543263.94935196883,0,0,0]
[null,{"$f":"IF(ISBLANK(dms_E3_Projects_20),\"\",dms_E3_Projects_20)","v":"Sydney Primary Main Integrity Management (Lane Cove to Willoughby) – Stage 2"},0,0,9003.158442492364,120145.54277955589,903534.07995806308,395873.55264717567,0]
[null,{"$f":"IF(ISBLANK(dms_E3_Projects_21),\"\",dms_E3_Projects_21)","v":0},0,0,0,0,0,0,0]
[null,{"$f":"IF(ISBLANK(dms_E3_Projects_22),\"\",dms_E3_Projects_22)","v":0},0,0,0,0,0,0,0]
[null,{"$f":"IF(ISBLANK(dms_E3_Projects_23),\"\",dms_E3_Projects_23)","v":0},0,0,0,0,0,0,0]
[null,{"$f":"IF(ISBLANK(dms_E3_Projects_24),\"\",dms_E3_Projects_24)","v":""},0,0,0,0,0,0,0]
[null,{"$f":"IF(ISBLANK(dms_E3_Projects_25),\"\",dms_E3_Projects_25)","v":""}]
[null,{"$f":"IF(ISBLANK(dms_E3_Projects_26),\"\",dms_E3_Projects_26)","v":""}]
[null,{"$f":"IF(ISBLANK(dms_E3_Projects_27),\"\",dms_E3_Projects_27)","v":""}]
[null,{"$f":"IF(ISBLANK(dms_E3_Projects_28),\"\",dms_E3_Projects_28)","v":""}]
[null,{"$f":"IF(ISBLANK(dms_E3_Projects_29),\"\",dms_E3_Projects_29)","v":""}]
[null,{"$f":"IF(ISBLANK(dms_E3_Projects_30),\"\",dms_E3_Projects_30)","v":""}]
[null,{"$f":"IF(ISBLANK(dms_E3_Projects_31),\"\",dms_E3_Projects_31)","v":""}]
[null,{"$f":"IF(ISBLANK(dms_E3_Projects_32),\"\",dms_E3_Projects_32)","v":""}]
[null,{"$f":"IF(ISBLANK(dms_E3_Projects_33),\"\",dms_E3_Projects_33)","v":""}]
[null,{"$f":"IF(ISBLANK(dms_E3_Projects_34),\"\",dms_E3_Projects_34)","v":""}]
[null,{"$f":"IF(ISBLANK(dms_E3_Projects_35),\"\",dms_E3_Projects_35)","v":""}]
[null,{"$f":"IF(ISBLANK(dms_E3_Projects_36),\"\",dms_E3_Projects_36)","v":""}]
[null,{"$f":"IF(ISBLANK(dms_E3_Projects_37),\"\",dms_E3_Projects_37)","v":""}]
[null,{"$f":"IF(ISBLANK(dms_E3_Projects_38),\"\",dms_E3_Projects_38)","v":""}]
[null,{"$f":"IF(ISBLANK(dms_E3_Projects_39),\"\",dms_E3_Projects_39)","v":""}]
[null,{"$f":"IF(ISBLANK(dms_E3_Projects_40),\"\",dms_E3_Projects_40)","v":""}]
[null,{"$f":"IF(ISBLANK(dms_E3_Projects_41),\"\",dms_E3_Projects_41)","v":""}]
[null,{"$f":"IF(ISBLANK(dms_E3_Projects_42),\"\",dms_E3_Projects_42)","v":""}]
[null,{"$f":"IF(ISBLANK(dms_E3_Projects_43),\"\",dms_E3_Projects_43)","v":""}]
[null,{"$f":"IF(ISBLANK(dms_E3_Projects_44),\"\",dms_E3_Projects_44)","v":""}]
[null,{"$f":"IF(ISBLANK(dms_E3_Projects_45),\"\",dms_E3_Projects_45)","v":""}]
[null,{"$f":"IF(ISBLANK(dms_E3_Projects_46),\"\",dms_E3_Projects_46)","v":""}]
[null,{"$f":"IF(ISBLANK(dms_E3_Projects_47),\"\",dms_E3_Projects_47)","v":""}]
[null,{"$f":"IF(ISBLANK(dms_E3_Projects_48),\"\",dms_E3_Projects_48)","v":""}]
[null,{"$f":"IF(ISBLANK(dms_E3_Projects_49),\"\",dms_E3_Projects_49)","v":""}]
[null,{"$f":"IF(ISBLANK(dms_E3_Projects_50),\"\",dms_E3_Projects_50)","v":""}]
[null,"Aggregate of other projects with total expenditure of less than $500,000",2207.5558444695034,0,5412.5638299725724,13585.826517895843,21726.148970206781,224.10030739771963,0]
[null,"Total",{"$f":"SUM(C179:C229)","v":828412.14982106315},{"$f":"SUM(D179:D229)","v":204110.93361283318},1020541.9003526546,1286972.9224617104,1118501.7328764251,871700.5189407958,56561.960132833061]
[]
[null,"D. TOTAL OVERHEAD EXPENDITURE"]
[null,null,"EXPENDITURE"]
[null,null,{"$f":"CONCATENATE(\"$0's, real \",dms_DollarReal)","v":"$0's, real June 2020"}]
[null,null,{"$f":"CRCP_y4","v":"2018-19"},{"$f":"CRCP_y5","v":"2019-20"},{"$f":"FRCP_y1","v":"2020-21"},{"$f":"FRCP_y2","v":"2021-22"},{"$f":"FRCP_y3","v":"2022-23"},{"$f":"FRCP_y4","v":"2023-24"},{"$f":"FRCP_y5","v":"2024-25"}]
[null,{"$f":"IF(ISBLANK(dms_E3_Projects_01),\"\",dms_E3_Projects_01)","v":"Minor Capital: ME and CD Projects"},210180.26692253412,127252.78084702301,94328.440717147343,64781.937749864395,71852.66718721595,69976.660484825086,69629.90538981228]
[null,{"$f":"IF(ISBLANK(dms_E3_Projects_02),\"\",dms_E3_Projects_02)","v":"Gas feed offtake"},723713.34066741716,0,0,0,0,0,0]
[null,{"$f":"IF(ISBLANK(dms_E3_Projects_03),\"\",dms_E3_Projects_03)","v":"Sydney West Development"},273810.18054247194,1110.0490615775675,0,0,0,0,0]
[null,{"$f":"IF(ISBLANK(dms_E3_Projects_04),\"\",dms_E3_Projects_04)","v":"Edmondson Park RMS Component"},73388.463531036061,70304.436820257921,0,0,0,0,0]
[null,{"$f":"IF(ISBLANK(dms_E3_Projects_05),\"\",dms_E3_Projects_05)","v":"Cecil Park (Elizabeth Dr) CDP"},0,0,204409.90254031416,0,0,0,0]
[null,{"$f":"IF(ISBLANK(dms_E3_Projects_06),\"\",dms_E3_Projects_06)","v":"Edmondson Park Soldiers Parade Steel"},0,0,0,84595.43451798975,0,0,0]
[null,{"$f":"IF(ISBLANK(dms_E3_Projects_07),\"\",dms_E3_Projects_07)","v":"Largs Low CDP"},0,0,0,92707.428763027783,0,0,0]
[null,{"$f":"IF(ISBLANK(dms_E3_Projects_08),\"\",dms_E3_Projects_08)","v":"Burwood (Sydney South)"},209519.80682471298,0,0,0,0,0,0]
[null,{"$f":"IF(ISBLANK(dms_E3_Projects_09),\"\",dms_E3_Projects_09)","v":"Liverpool - Shepherd ST (Sydney West)"},42692.683715991865,207408.98318560055,0,0,0,0,0]
[null,{"$f":"IF(ISBLANK(dms_E3_Projects_10),\"\",dms_E3_Projects_10)","v":"Lidcombe CBD (Sydney West)"},0,46281.224496283008,291664.66513572994,0,0,0,0]
[null,{"$f":"IF(ISBLANK(dms_E3_Projects_11),\"\",dms_E3_Projects_11)","v":"Aerotropolis Core"},0,0,95359.899435999003,566770.49751086638,0,0,0]
[null,{"$f":"IF(ISBLANK(dms_E3_Projects_12),\"\",dms_E3_Projects_12)","v":"Sydney Science Park (near WSA)"},0,0,100684.63258027135,599064.97226707824,0,0,0]
[null,{"$f":"IF(ISBLANK(dms_E3_Projects_13),\"\",dms_E3_Projects_13)","v":"Sydney South West Development"},0,128466.03941663129,1179938.4512720564,0,0,0,0]
[null,{"$f":"IF(ISBLANK(dms_E3_Projects_14),\"\",dms_E3_Projects_14)","v":"Wilton North (Sth Highlands)"},0,0,0,28838.186376337635,293096.52761955006,0,0]
[null,{"$f":"IF(ISBLANK(dms_E3_Projects_15),\"\",dms_E3_Projects_15)","v":"Western Sydney Airport (itself)"},0,0,0,0,44676.839810476755,376564.71520017111,0]
[null,{"$f":"IF(ISBLANK(dms_E3_Projects_16),\"\",dms_E3_Projects_16)","v":"Box Hill (Sydney North West)"},0,0,0,0,33092.948994486011,278458.05945082923,0]
[null,{"$f":"IF(ISBLANK(dms_E3_Projects_17),\"\",dms_E3_Projects_17)","v":"Campsie (Sydney West)"},0,0,0,0,8110.9572788863534,68358.919851488638,0]
[null,{"$f":"IF(ISBLANK(dms_E3_Projects_18),\"\",dms_E3_Projects_18)","v":"Mt Gilead (Sydney West)"},100499.06628375538,162143.11183493226,0,0,0,0,0]
[null,{"$f":"IF(ISBLANK(dms_E3_Projects_19),\"\",dms_E3_Projects_19)","v":"Sydney Primary Main Integrity Management (Lane Cove to Willoughby) – Stage 1"},205.91831806063294,0,683156.9242808664,623950.29585669446,0,0,0]
[null,{"$f":"IF(ISBLANK(dms_E3_Projects_20),\"\",dms_E3_Projects_20)","v":"Sydney Primary Main Integrity Management (Lane Cove to Willoughby) – Stage 2"},0,0,15069.36286895274,137989.73234389783,1149867.9004467838,490185.23439328186,0]
[null,{"$f":"IF(ISBLANK(dms_E3_Projects_21),\"\",dms_E3_Projects_21)","v":0},0,0,0,0,0,0,0]
[null,{"$f":"IF(ISBLANK(dms_E3_Projects_22),\"\",dms_E3_Projects_22)","v":0},0,0,0,0,0,0,0]
[null,{"$f":"IF(ISBLANK(dms_E3_Projects_23),\"\",dms_E3_Projects_23)","v":0},0,0,0,0,0,0,0]
[null,{"$f":"IF(ISBLANK(dms_E3_Projects_24),\"\",dms_E3_Projects_24)","v":""},0,0,0,0,0,0,0]
[null,{"$f":"IF(ISBLANK(dms_E3_Projects_25),\"\",dms_E3_Projects_25)","v":""}]
[null,{"$f":"IF(ISBLANK(dms_E3_Projects_26),\"\",dms_E3_Projects_26)","v":""}]
[null,{"$f":"IF(ISBLANK(dms_E3_Projects_27),\"\",dms_E3_Projects_27)","v":""}]
[null,{"$f":"IF(ISBLANK(dms_E3_Projects_28),\"\",dms_E3_Projects_28)","v":""}]
[null,{"$f":"IF(ISBLANK(dms_E3_Projects_29),\"\",dms_E3_Projects_29)","v":""}]
[null,{"$f":"IF(ISBLANK(dms_E3_Projects_30),\"\",dms_E3_Projects_30)","v":""}]
[null,{"$f":"IF(ISBLANK(dms_E3_Projects_31),\"\",dms_E3_Projects_31)","v":""}]
[null,{"$f":"IF(ISBLANK(dms_E3_Projects_32),\"\",dms_E3_Projects_32)","v":""}]
[null,{"$f":"IF(ISBLANK(dms_E3_Projects_33),\"\",dms_E3_Projects_33)","v":""}]
[null,{"$f":"IF(ISBLANK(dms_E3_Projects_34),\"\",dms_E3_Projects_34)","v":""}]
[null,{"$f":"IF(ISBLANK(dms_E3_Projects_35),\"\",dms_E3_Projects_35)","v":""}]
[null,{"$f":"IF(ISBLANK(dms_E3_Projects_36),\"\",dms_E3_Projects_36)","v":""}]
[null,{"$f":"IF(ISBLANK(dms_E3_Projects_37),\"\",dms_E3_Projects_37)","v":""}]
[null,{"$f":"IF(ISBLANK(dms_E3_Projects_38),\"\",dms_E3_Projects_38)","v":""}]
[null,{"$f":"IF(ISBLANK(dms_E3_Projects_39),\"\",dms_E3_Projects_39)","v":""}]
[null,{"$f":"IF(ISBLANK(dms_E3_Projects_40),\"\",dms_E3_Projects_40)","v":""}]
[null,{"$f":"IF(ISBLANK(dms_E3_Projects_41),\"\",dms_E3_Projects_41)","v":""}]
[null,{"$f":"IF(ISBLANK(dms_E3_Projects_42),\"\",dms_E3_Projects_42)","v":""}]
[null,{"$f":"IF(ISBLANK(dms_E3_Projects_43),\"\",dms_E3_Projects_43)","v":""}]
[null,{"$f":"IF(ISBLANK(dms_E3_Projects_44),\"\",dms_E3_Projects_44)","v":""}]
[null,{"$f":"IF(ISBLANK(dms_E3_Projects_45),\"\",dms_E3_Projects_45)","v":""}]
[null,{"$f":"IF(ISBLANK(dms_E3_Projects_46),\"\",dms_E3_Projects_46)","v":""}]
[null,{"$f":"IF(ISBLANK(dms_E3_Projects_47),\"\",dms_E3_Projects_47)","v":""}]
[null,{"$f":"IF(ISBLANK(dms_E3_Projects_48),\"\",dms_E3_Projects_48)","v":""}]
[null,{"$f":"IF(ISBLANK(dms_E3_Projects_49),\"\",dms_E3_Projects_49)","v":""}]
[null,{"$f":"IF(ISBLANK(dms_E3_Projects_50),\"\",dms_E3_Projects_50)","v":""}]
[null,"Aggregate of other projects with total expenditure of less than $500,000",11596.736764589057,0,9059.4749527306794,15603.613097115065,27649.428898492966,277.48926639527912,0]
[null,"Total",{"$f":"SUM(C236:C286)","v":1645606.4635705694},{"$f":"SUM(D236:D286)","v":742966.62566230563},2673671.7537840679,2214302.0984828714,1628347.2702358919,1283821.0786469912,69629.90538981228]
[]
[null,"E. RELATED PARTY MARGIN EXPENDITURE"]
[null,null,"EXPENDITURE"]
[null,null,{"$f":"CONCATENATE(\"$0's, real \",dms_DollarReal)","v":"$0's, real June 2020"}]
[null,null,{"$f":"CRCP_y4","v":"2018-19"},{"$f":"CRCP_y5","v":"2019-20"},{"$f":"FRCP_y1","v":"2020-21"},{"$f":"FRCP_y2","v":"2021-22"},{"$f":"FRCP_y3","v":"2022-23"},{"$f":"FRCP_y4","v":"2023-24"},{"$f":"FRCP_y5","v":"2024-25"}]
[null,{"$f":"IF(ISBLANK(dms_E3_Projects_01),\"\",dms_E3_Projects_01)","v":"Minor Capital: ME and CD Projects"},0,0,0,0,0,0,0]
[null,{"$f":"IF(ISBLANK(dms_E3_Projects_02),\"\",dms_E3_Projects_02)","v":"Gas feed offtake"},0,0,0,0,0,0,0]
[null,{"$f":"IF(ISBLANK(dms_E3_Projects_03),\"\",dms_E3_Projects_03)","v":"Sydney West Development"},0,0,0,0,0,0,0]
[null,{"$f":"IF(ISBLANK(dms_E3_Projects_04),\"\",dms_E3_Projects_04)","v":"Edmondson Park RMS Component"},0,0,0,0,0,0,0]
[null,{"$f":"IF(ISBLANK(dms_E3_Projects_05),\"\",dms_E3_Projects_05)","v":"Cecil Park (Elizabeth Dr) CDP"},0,0,0,0,0,0,0]
[null,{"$f":"IF(ISBLANK(dms_E3_Projects_06),\"\",dms_E3_Projects_06)","v":"Edmondson Park Soldiers Parade Steel"},0,0,0,0,0,0,0]
[null,{"$f":"IF(ISBLANK(dms_E3_Projects_07),\"\",dms_E3_Projects_07)","v":"Largs Low CDP"},0,0,0,0,0,0,0]
[null,{"$f":"IF(ISBLANK(dms_E3_Projects_08),\"\",dms_E3_Projects_08)","v":"Burwood (Sydney South)"},0,0,0,0,0,0,0]
[null,{"$f":"IF(ISBLANK(dms_E3_Projects_09),\"\",dms_E3_Projects_09)","v":"Liverpool - Shepherd ST (Sydney West)"},0,0,0,0,0,0,0]
[null,{"$f":"IF(ISBLANK(dms_E3_Projects_10),\"\",dms_E3_Projects_10)","v":"Lidcombe CBD (Sydney West)"},0,0,0,0,0,0,0]
[null,{"$f":"IF(ISBLANK(dms_E3_Projects_11),\"\",dms_E3_Projects_11)","v":"Aerotropolis Core"},0,0,0,0,0,0,0]
[null,{"$f":"IF(ISBLANK(dms_E3_Projects_12),\"\",dms_E3_Projects_12)","v":"Sydney Science Park (near WSA)"},0,0,0,0,0,0,0]
[null,{"$f":"IF(ISBLANK(dms_E3_Projects_13),\"\",dms_E3_Projects_13)","v":"Sydney South West Development"},0,0,0,0,0,0,0]
[null,{"$f":"IF(ISBLANK(dms_E3_Projects_14),\"\",dms_E3_Projects_14)","v":"Wilton North (Sth Highlands)"},0,0,0,0,0,0,0]
[null,{"$f":"IF(ISBLANK(dms_E3_Projects_15),\"\",dms_E3_Projects_15)","v":"Western Sydney Airport (itself)"},0,0,0,0,0,0,0]
[null,{"$f":"IF(ISBLANK(dms_E3_Projects_16),\"\",dms_E3_Projects_16)","v":"Box Hill (Sydney North West)"},0,0,0,0,0,0,0]
[null,{"$f":"IF(ISBLANK(dms_E3_Projects_17),\"\",dms_E3_Projects_17)","v":"Campsie (Sydney West)"},0,0,0,0,0,0,0]
[null,{"$f":"IF(ISBLANK(dms_E3_Projects_18),\"\",dms_E3_Projects_18)","v":"Mt Gilead (Sydney West)"},0,0,0,0,0,0,0]
[null,{"$f":"IF(ISBLANK(dms_E3_Projects_19),\"\",dms_E3_Projects_19)","v":"Sydney Primary Main Integrity Management (Lane Cove to Willoughby) – Stage 1"},0,0,0,0,0,0,0]
[null,{"$f":"IF(ISBLANK(dms_E3_Projects_20),\"\",dms_E3_Projects_20)","v":"Sydney Primary Main Integrity Management (Lane Cove to Willoughby) – Stage 2"},0,0,0,0,0,0,0]
[null,{"$f":"IF(ISBLANK(dms_E3_Projects_21),\"\",dms_E3_Projects_21)","v":0},0,0,0,0,0,0,0]
[null,{"$f":"IF(ISBLANK(dms_E3_Projects_22),\"\",dms_E3_Projects_22)","v":0},0,0,0,0,0,0,0]
[null,{"$f":"IF(ISBLANK(dms_E3_Projects_23),\"\",dms_E3_Projects_23)","v":0},0,0,0,0,0,0,0]
[null,{"$f":"IF(ISBLANK(dms_E3_Projects_24),\"\",dms_E3_Projects_24)","v":""},0,0,0,0,0,0,0]
[null,{"$f":"IF(ISBLANK(dms_E3_Projects_25),\"\",dms_E3_Projects_25)","v":""}]
[null,{"$f":"IF(ISBLANK(dms_E3_Projects_26),\"\",dms_E3_Projects_26)","v":""}]
[null,{"$f":"IF(ISBLANK(dms_E3_Projects_27),\"\",dms_E3_Projects_27)","v":""}]
[null,{"$f":"IF(ISBLANK(dms_E3_Projects_28),\"\",dms_E3_Projects_28)","v":""}]
[null,{"$f":"IF(ISBLANK(dms_E3_Projects_29),\"\",dms_E3_Projects_29)","v":""}]
[null,{"$f":"IF(ISBLANK(dms_E3_Projects_30),\"\",dms_E3_Projects_30)","v":""}]
[null,{"$f":"IF(ISBLANK(dms_E3_Projects_31),\"\",dms_E3_Projects_31)","v":""}]
[null,{"$f":"IF(ISBLANK(dms_E3_Projects_32),\"\",dms_E3_Projects_32)","v":""}]
[null,{"$f":"IF(ISBLANK(dms_E3_Projects_33),\"\",dms_E3_Projects_33)","v":""}]
[null,{"$f":"IF(ISBLANK(dms_E3_Projects_34),\"\",dms_E3_Projects_34)","v":""}]
[null,{"$f":"IF(ISBLANK(dms_E3_Projects_35),\"\",dms_E3_Projects_35)","v":""}]
[null,{"$f":"IF(ISBLANK(dms_E3_Projects_36),\"\",dms_E3_Projects_36)","v":""}]
[null,{"$f":"IF(ISBLANK(dms_E3_Projects_37),\"\",dms_E3_Projects_37)","v":""}]
[null,{"$f":"IF(ISBLANK(dms_E3_Projects_38),\"\",dms_E3_Projects_38)","v":""}]
[null,{"$f":"IF(ISBLANK(dms_E3_Projects_39),\"\",dms_E3_Projects_39)","v":""}]
[null,{"$f":"IF(ISBLANK(dms_E3_Projects_40),\"\",dms_E3_Projects_40)","v":""}]
[null,{"$f":"IF(ISBLANK(dms_E3_Projects_41),\"\",dms_E3_Projects_41)","v":""}]
[null,{"$f":"IF(ISBLANK(dms_E3_Projects_42),\"\",dms_E3_Projects_42)","v":""}]
[null,{"$f":"IF(ISBLANK(dms_E3_Projects_43),\"\",dms_E3_Projects_43)","v":""}]
[null,{"$f":"IF(ISBLANK(dms_E3_Projects_44),\"\",dms_E3_Projects_44)","v":""}]
[null,{"$f":"IF(ISBLANK(dms_E3_Projects_45),\"\",dms_E3_Projects_45)","v":""}]
[null,{"$f":"IF(ISBLANK(dms_E3_Projects_46),\"\",dms_E3_Projects_46)","v":""}]
[null,{"$f":"IF(ISBLANK(dms_E3_Projects_47),\"\",dms_E3_Projects_47)","v":""}]
[null,{"$f":"IF(ISBLANK(dms_E3_Projects_48),\"\",dms_E3_Projects_48)","v":""}]
[null,{"$f":"IF(ISBLANK(dms_E3_Projects_49),\"\",dms_E3_Projects_49)","v":""}]
[null,{"$f":"IF(ISBLANK(dms_E3_Projects_50),\"\",dms_E3_Projects_50)","v":""}]
[null,"Aggregate of other projects with total expenditure of less than $500,000",0,0,0,0,0,0,0]
[null,"Total",{"$f":"SUM(C293:C343)","v":0},{"$f":"SUM(D293:D343)","v":0},0,0,0,0,0]
[]
[null,"F. CUSTOMER CONTRIBUTIONS included in the above"]
[null,null,"EXPENDITURE"]
[null,null,{"$f":"CONCATENATE(\"$0's, real \",dms_DollarReal)","v":"$0's, real June 2020"}]
[null,null,{"$f":"CRCP_y4","v":"2018-19"},{"$f":"CRCP_y5","v":"2019-20"},{"$f":"FRCP_y1","v":"2020-21"},{"$f":"FRCP_y2","v":"2021-22"},{"$f":"FRCP_y3","v":"2022-23"},{"$f":"FRCP_y4","v":"2023-24"},{"$f":"FRCP_y5","v":"2024-25"}]
[null,{"$f":"IF(ISBLANK(dms_E3_Projects_01),\"\",dms_E3_Projects_01)","v":"Minor Capital: ME and CD Projects"},null,null,null,0,0,0,0]
[null,{"$f":"IF(ISBLANK(dms_E3_Projects_02),\"\",dms_E3_Projects_02)","v":"Gas feed offtake"},null,null,null,0,0,0,0]
[null,{"$f":"IF(ISBLANK(dms_E3_Projects_03),\"\",dms_E3_Projects_03)","v":"Sydney West Development"},null,null,null,0,0,0,0]
[null,{"$f":"IF(ISBLANK(dms_E3_Projects_04),\"\",dms_E3_Projects_04)","v":"Edmondson Park RMS Component"},null,null,null,0,0,0,0]
[null,{"$f":"IF(ISBLANK(dms_E3_Projects_05),\"\",dms_E3_Projects_05)","v":"Cecil Park (Elizabeth Dr) CDP"},null,null,null,0,0,0,0]
[null,{"$f":"IF(ISBLANK(dms_E3_Projects_06),\"\",dms_E3_Projects_06)","v":"Edmondson Park Soldiers Parade Steel"},null,null,null,0,0,0,0]
[null,{"$f":"IF(ISBLANK(dms_E3_Projects_07),\"\",dms_E3_Projects_07)","v":"Largs Low CDP"},null,null,null,0,0,0,0]
[null,{"$f":"IF(ISBLANK(dms_E3_Projects_08),\"\",dms_E3_Projects_08)","v":"Burwood (Sydney South)"},null,null,null,0,0,0,0]
[null,{"$f":"IF(ISBLANK(dms_E3_Projects_09),\"\",dms_E3_Projects_09)","v":"Liverpool - Shepherd ST (Sydney West)"},null,null,null,0,0,0,0]
[null,{"$f":"IF(ISBLANK(dms_E3_Projects_10),\"\",dms_E3_Projects_10)","v":"Lidcombe CBD (Sydney West)"},null,null,null,0,0,0,0]
[null,{"$f":"IF(ISBLANK(dms_E3_Projects_11),\"\",dms_E3_Projects_11)","v":"Aerotropolis Core"},null,null,null,0,0,0,0]
[null,{"$f":"IF(ISBLANK(dms_E3_Projects_12),\"\",dms_E3_Projects_12)","v":"Sydney Science Park (near WSA)"},null,null,null,0,0,0,0]
[null,{"$f":"IF(ISBLANK(dms_E3_Projects_13),\"\",dms_E3_Projects_13)","v":"Sydney South West Development"},null,null,null,0,0,0,0]
[null,{"$f":"IF(ISBLANK(dms_E3_Projects_14),\"\",dms_E3_Projects_14)","v":"Wilton North (Sth Highlands)"},null,null,null,0,0,0,0]
[null,{"$f":"IF(ISBLANK(dms_E3_Projects_15),\"\",dms_E3_Projects_15)","v":"Western Sydney Airport (itself)"},null,null,null,0,0,0,0]
[null,{"$f":"IF(ISBLANK(dms_E3_Projects_16),\"\",dms_E3_Projects_16)","v":"Box Hill (Sydney North West)"},null,null,null,0,0,0,0]
[null,{"$f":"IF(ISBLANK(dms_E3_Projects_17),\"\",dms_E3_Projects_17)","v":"Campsie (Sydney West)"},null,null,null,0,0,0,0]
[null,{"$f":"IF(ISBLANK(dms_E3_Projects_18),\"\",dms_E3_Projects_18)","v":"Mt Gilead (Sydney West)"},null,null,null,0,0,0,0]
[null,{"$f":"IF(ISBLANK(dms_E3_Projects_19),\"\",dms_E3_Projects_19)","v":"Sydney Primary Main Integrity Management (Lane Cove to Willoughby) – Stage 1"},null,null,null,0,0,0,0]
[null,{"$f":"IF(ISBLANK(dms_E3_Projects_20),\"\",dms_E3_Projects_20)","v":"Sydney Primary Main Integrity Management (Lane Cove to Willoughby) – Stage 2"},null,null,null,0,0,0,0]
[null,{"$f":"IF(ISBLANK(dms_E3_Projects_21),\"\",dms_E3_Projects_21)","v":0},null,null,null,0,0,0,0]
[null,{"$f":"IF(ISBLANK(dms_E3_Projects_22),\"\",dms_E3_Projects_22)","v":0},null,null,null,0,0,0,0]
[null,{"$f":"IF(ISBLANK(dms_E3_Projects_23),\"\",dms_E3_Projects_23)","v":0},null,null,null,0,0,0,0]
[null,{"$f":"IF(ISBLANK(dms_E3_Projects_24),\"\",dms_E3_Projects_24)","v":""},null,null,null,0,0,0,0]
[null,{"$f":"IF(ISBLANK(dms_E3_Projects_25),\"\",dms_E3_Projects_25)","v":""}]
[null,{"$f":"IF(ISBLANK(dms_E3_Projects_26),\"\",dms_E3_Projects_26)","v":""}]
[null,{"$f":"IF(ISBLANK(dms_E3_Projects_27),\"\",dms_E3_Projects_27)","v":""}]
[null,{"$f":"IF(ISBLANK(dms_E3_Projects_28),\"\",dms_E3_Projects_28)","v":""}]
[null,{"$f":"IF(ISBLANK(dms_E3_Projects_29),\"\",dms_E3_Projects_29)","v":""}]
[null,{"$f":"IF(ISBLANK(dms_E3_Projects_30),\"\",dms_E3_Projects_30)","v":""}]
[null,{"$f":"IF(ISBLANK(dms_E3_Projects_31),\"\",dms_E3_Projects_31)","v":""}]
[null,{"$f":"IF(ISBLANK(dms_E3_Projects_32),\"\",dms_E3_Projects_32)","v":""}]
[null,{"$f":"IF(ISBLANK(dms_E3_Projects_33),\"\",dms_E3_Projects_33)","v":""}]
[null,{"$f":"IF(ISBLANK(dms_E3_Projects_34),\"\",dms_E3_Projects_34)","v":""}]
[null,{"$f":"IF(ISBLANK(dms_E3_Projects_35),\"\",dms_E3_Projects_35)","v":""}]
[null,{"$f":"IF(ISBLANK(dms_E3_Projects_36),\"\",dms_E3_Projects_36)","v":""}]
[null,{"$f":"IF(ISBLANK(dms_E3_Projects_37),\"\",dms_E3_Projects_37)","v":""}]
[null,{"$f":"IF(ISBLANK(dms_E3_Projects_38),\"\",dms_E3_Projects_38)","v":""}]
[null,{"$f":"IF(ISBLANK(dms_E3_Projects_39),\"\",dms_E3_Projects_39)","v":""}]
[null,{"$f":"IF(ISBLANK(dms_E3_Projects_40),\"\",dms_E3_Projects_40)","v":""}]
[null,{"$f":"IF(ISBLANK(dms_E3_Projects_41),\"\",dms_E3_Projects_41)","v":""}]
[null,{"$f":"IF(ISBLANK(dms_E3_Projects_42),\"\",dms_E3_Projects_42)","v":""}]
[null,{"$f":"IF(ISBLANK(dms_E3_Projects_43),\"\",dms_E3_Projects_43)","v":""}]
[null,{"$f":"IF(ISBLANK(dms_E3_Projects_44),\"\",dms_E3_Projects_44)","v":""}]
[null,{"$f":"IF(ISBLANK(dms_E3_Projects_45),\"\",dms_E3_Projects_45)","v":""}]
[null,{"$f":"IF(ISBLANK(dms_E3_Projects_46),\"\",dms_E3_Projects_46)","v":""}]
[null,{"$f":"IF(ISBLANK(dms_E3_Projects_47),\"\",dms_E3_Projects_47)","v":""}]
[null,{"$f":"IF(ISBLANK(dms_E3_Projects_48),\"\",dms_E3_Projects_48)","v":""}]
[null,{"$f":"IF(ISBLANK(dms_E3_Projects_49),\"\",dms_E3_Projects_49)","v":""}]
[null,{"$f":"IF(ISBLANK(dms_E3_Projects_50),\"\",dms_E3_Projects_50)","v":""}]
[null,"Aggregate of other projects with total expenditure of less than $500,000",null,null,null,0,0,0,0]
[null,"Total",null,null,null,{"$f":"SUM(F350:F400)","v":0},{"$f":"SUM(G350:G400)","v":0},{"$f":"SUM(H350:H400)","v":0},{"$f":"SUM(I350:I400)","v":0}]
[]
[]
[]
[null,"E3.2 - VOLUMES - BY PRESSURE TYPE - BY PROJECT"]
[null,"A. LOW PRESSURE TO LOW PRESSURE"]
[null,null,"LENGTH"]
[null,null,"0s, metres"]
[null,null,{"$f":"CRCP_y4","v":"2018-19"},{"$f":"CRCP_y5","v":"2019-20"},{"$f":"FRCP_y1","v":"2020-21"},{"$f":"FRCP_y2","v":"2021-22"},{"$f":"FRCP_y3","v":"2022-23"},{"$f":"FRCP_y4","v":"2023-24"},{"$f":"FRCP_y5","v":"2024-25"}]
[null,{"$f":"IF(ISBLANK(dms_E3_Projects_01),\"\",dms_E3_Projects_01)","v":"Minor Capital: ME and CD Projects"},1200,0,0,0,0,0,0]
[null,{"$f":"IF(ISBLANK(dms_E3_Projects_02),\"\",dms_E3_Projects_02)","v":"Gas feed offtake"},0,219.5329623590199,1780.4670376409802,0,0,0,0]
[null,{"$f":"IF(ISBLANK(dms_E3_Projects_03),\"\",dms_E3_Projects_03)","v":"Sydney West Development"},0,0,0,0,0,0,0]
[null,{"$f":"IF(ISBLANK(dms_E3_Projects_04),\"\",dms_E3_Projects_04)","v":"Edmondson Park RMS Component"},0,0,0,0,0,0,0]
[null,{"$f":"IF(ISBLANK(dms_E3_Projects_05),\"\",dms_E3_Projects_05)","v":"Cecil Park (Elizabeth Dr) CDP"},0,0,0,0,0,0,0]
[null,{"$f":"IF(ISBLANK(dms_E3_Projects_06),\"\",dms_E3_Projects_06)","v":"Edmondson Park Soldiers Parade Steel"},0,0,0,0,0,0,0]
[null,{"$f":"IF(ISBLANK(dms_E3_Projects_07),\"\",dms_E3_Projects_07)","v":"Largs Low CDP"},0,0,0,0,0,0,0]
[null,{"$f":"IF(ISBLANK(dms_E3_Projects_08),\"\",dms_E3_Projects_08)","v":"Burwood (Sydney South)"},0,0,0,0,0,0,0]
[null,{"$f":"IF(ISBLANK(dms_E3_Projects_09),\"\",dms_E3_Projects_09)","v":"Liverpool - Shepherd ST (Sydney West)"},0,0,0,0,0,0,0]
[null,{"$f":"IF(ISBLANK(dms_E3_Projects_10),\"\",dms_E3_Projects_10)","v":"Lidcombe CBD (Sydney West)"},0,0,0,0,0,0,0]
[null,{"$f":"IF(ISBLANK(dms_E3_Projects_11),\"\",dms_E3_Projects_11)","v":"Aerotropolis Core"},0,0,0,0,0,0,0]
[null,{"$f":"IF(ISBLANK(dms_E3_Projects_12),\"\",dms_E3_Projects_12)","v":"Sydney Science Park (near WSA)"},0,0,0,0,0,0,0]
[null,{"$f":"IF(ISBLANK(dms_E3_Projects_13),\"\",dms_E3_Projects_13)","v":"Sydney South West Development"},0,0,0,0,0,0,0]
[null,{"$f":"IF(ISBLANK(dms_E3_Projects_14),\"\",dms_E3_Projects_14)","v":"Wilton North (Sth Highlands)"},0,0,0,0,0,0,0]
[null,{"$f":"IF(ISBLANK(dms_E3_Projects_15),\"\",dms_E3_Projects_15)","v":"Western Sydney Airport (itself)"},0,0,0,0,0,0,0]
[null,{"$f":"IF(ISBLANK(dms_E3_Projects_16),\"\",dms_E3_Projects_16)","v":"Box Hill (Sydney North West)"},0,0,0,0,0,0,0]
[null,{"$f":"IF(ISBLANK(dms_E3_Projects_17),\"\",dms_E3_Projects_17)","v":"Campsie (Sydney West)"},0,0,0,0,0,0,0]
[null,{"$f":"IF(ISBLANK(dms_E3_Projects_18),\"\",dms_E3_Projects_18)","v":"Mt Gilead (Sydney West)"},0,0,0,0,0,0,0]
[null,{"$f":"IF(ISBLANK(dms_E3_Projects_19),\"\",dms_E3_Projects_19)","v":"Sydney Primary Main Integrity Management (Lane Cove to Willoughby) – Stage 1"},0,0,0,0,0,0,0]
[null,{"$f":"IF(ISBLANK(dms_E3_Projects_20),\"\",dms_E3_Projects_20)","v":"Sydney Primary Main Integrity Management (Lane Cove to Willoughby) – Stage 2"},0,0,0,0,0,0,0]
[null,{"$f":"IF(ISBLANK(dms_E3_Projects_21),\"\",dms_E3_Projects_21)","v":0},0,0,0,0,0,0,0]
[null,{"$f":"IF(ISBLANK(dms_E3_Projects_22),\"\",dms_E3_Projects_22)","v":0},0,0,0,0,0,0,0]
[null,{"$f":"IF(ISBLANK(dms_E3_Projects_23),\"\",dms_E3_Projects_23)","v":0},0,0,0,0,0,0,0]
[null,{"$f":"IF(ISBLANK(dms_E3_Projects_24),\"\",dms_E3_Projects_24)","v":""},0,0,0,0,0,0,0]
[null,{"$f":"IF(ISBLANK(dms_E3_Projects_25),\"\",dms_E3_Projects_25)","v":""}]
[null,{"$f":"IF(ISBLANK(dms_E3_Projects_26),\"\",dms_E3_Projects_26)","v":""}]
[null,{"$f":"IF(ISBLANK(dms_E3_Projects_27),\"\",dms_E3_Projects_27)","v":""}]
[null,{"$f":"IF(ISBLANK(dms_E3_Projects_28),\"\",dms_E3_Projects_28)","v":""}]
[null,{"$f":"IF(ISBLANK(dms_E3_Projects_29),\"\",dms_E3_Projects_29)","v":""}]
[null,{"$f":"IF(ISBLANK(dms_E3_Projects_30),\"\",dms_E3_Projects_30)","v":""}]
[null,{"$f":"IF(ISBLANK(dms_E3_Projects_31),\"\",dms_E3_Projects_31)","v":""}]
[null,{"$f":"IF(ISBLANK(dms_E3_Projects_32),\"\",dms_E3_Projects_32)","v":""}]
[null,{"$f":"IF(ISBLANK(dms_E3_Projects_33),\"\",dms_E3_Projects_33)","v":""}]
[null,{"$f":"IF(ISBLANK(dms_E3_Projects_34),\"\",dms_E3_Projects_34)","v":""}]
[null,{"$f":"IF(ISBLANK(dms_E3_Projects_35),\"\",dms_E3_Projects_35)","v":""}]
[null,{"$f":"IF(ISBLANK(dms_E3_Projects_36),\"\",dms_E3_Projects_36)","v":""}]
[null,{"$f":"IF(ISBLANK(dms_E3_Projects_37),\"\",dms_E3_Projects_37)","v":""}]
[null,{"$f":"IF(ISBLANK(dms_E3_Projects_38),\"\",dms_E3_Projects_38)","v":""}]
[null,{"$f":"IF(ISBLANK(dms_E3_Projects_39),\"\",dms_E3_Projects_39)","v":""}]
[null,{"$f":"IF(ISBLANK(dms_E3_Projects_40),\"\",dms_E3_Projects_40)","v":""}]
[null,{"$f":"IF(ISBLANK(dms_E3_Projects_41),\"\",dms_E3_Projects_41)","v":""}]
[null,{"$f":"IF(ISBLANK(dms_E3_Projects_42),\"\",dms_E3_Projects_42)","v":""}]
[null,{"$f":"IF(ISBLANK(dms_E3_Projects_43),\"\",dms_E3_Projects_43)","v":""}]
[null,{"$f":"IF(ISBLANK(dms_E3_Projects_44),\"\",dms_E3_Projects_44)","v":""}]
[null,{"$f":"IF(ISBLANK(dms_E3_Projects_45),\"\",dms_E3_Projects_45)","v":""}]
[null,{"$f":"IF(ISBLANK(dms_E3_Projects_46),\"\",dms_E3_Projects_46)","v":""}]
[null,{"$f":"IF(ISBLANK(dms_E3_Projects_47),\"\",dms_E3_Projects_47)","v":""}]
[null,{"$f":"IF(ISBLANK(dms_E3_Projects_48),\"\",dms_E3_Projects_48)","v":""}]
[null,{"$f":"IF(ISBLANK(dms_E3_Projects_49),\"\",dms_E3_Projects_49)","v":""}]
[null,{"$f":"IF(ISBLANK(dms_E3_Projects_50),\"\",dms_E3_Projects_50)","v":""}]
[null,"Aggregate of other projects with total expenditure of less than $500,000",0,0,44.11793818982904,105.88206181017095,0,0,0]
[null,"Total",{"$f":"SUM(C410:C460)","v":1200},{"$f":"SUM(D410:D460)","v":219.5329623590199},{"$f":"SUM(E410:E460)","v":1824.5849758308093},{"$f":"SUM(F410:F460)","v":105.88206181017095},{"$f":"SUM(G410:G460)","v":0},{"$f":"SUM(H410:H460)","v":0},{"$f":"SUM(I410:I460)","v":0}]
[]
[null,"B. LOW PRESSURE TO MEDIUM PRESSURE"]
[null,null,"LENGTH"]
[null,null,"0s, metres"]
[null,null,{"$f":"CRCP_y4","v":"2018-19"},{"$f":"CRCP_y5","v":"2019-20"},{"$f":"FRCP_y1","v":"2020-21"},{"$f":"FRCP_y2","v":"2021-22"},{"$f":"FRCP_y3","v":"2022-23"},{"$f":"FRCP_y4","v":"2023-24"},{"$f":"FRCP_y5","v":"2024-25"}]
[null,{"$f":"IF(ISBLANK(dms_E3_Projects_01),\"\",dms_E3_Projects_01)","v":"Minor Capital: ME and CD Projects"},0,0,0,0,0,0,0]
[null,{"$f":"IF(ISBLANK(dms_E3_Projects_02),\"\",dms_E3_Projects_02)","v":"Gas feed offtake"},0,0,0,0,0,0,0]
[null,{"$f":"IF(ISBLANK(dms_E3_Projects_03),\"\",dms_E3_Projects_03)","v":"Sydney West Development"},0,0,0,0,0,0,0]
[null,{"$f":"IF(ISBLANK(dms_E3_Projects_04),\"\",dms_E3_Projects_04)","v":"Edmondson Park RMS Component"},0,0,0,0,0,0,0]
[null,{"$f":"IF(ISBLANK(dms_E3_Projects_05),\"\",dms_E3_Projects_05)","v":"Cecil Park (Elizabeth Dr) CDP"},0,0,0,0,0,0,0]
[null,{"$f":"IF(ISBLANK(dms_E3_Projects_06),\"\",dms_E3_Projects_06)","v":"Edmondson Park Soldiers Parade Steel"},0,0,0,0,0,0,0]
[null,{"$f":"IF(ISBLANK(dms_E3_Projects_07),\"\",dms_E3_Projects_07)","v":"Largs Low CDP"},0,0,0,0,0,0,0]
[null,{"$f":"IF(ISBLANK(dms_E3_Projects_08),\"\",dms_E3_Projects_08)","v":"Burwood (Sydney South)"},0,0,0,0,0,0,0]
[null,{"$f":"IF(ISBLANK(dms_E3_Projects_09),\"\",dms_E3_Projects_09)","v":"Liverpool - Shepherd ST (Sydney West)"},0,0,0,0,0,0,0]
[null,{"$f":"IF(ISBLANK(dms_E3_Projects_10),\"\",dms_E3_Projects_10)","v":"Lidcombe CBD (Sydney West)"},0,0,0,0,0,0,0]
[null,{"$f":"IF(ISBLANK(dms_E3_Projects_11),\"\",dms_E3_Projects_11)","v":"Aerotropolis Core"},0,0,0,0,0,0,0]
[null,{"$f":"IF(ISBLANK(dms_E3_Projects_12),\"\",dms_E3_Projects_12)","v":"Sydney Science Park (near WSA)"},0,0,0,0,0,0,0]
[null,{"$f":"IF(ISBLANK(dms_E3_Projects_13),\"\",dms_E3_Projects_13)","v":"Sydney South West Development"},0,0,0,0,0,0,0]
[null,{"$f":"IF(ISBLANK(dms_E3_Projects_14),\"\",dms_E3_Projects_14)","v":"Wilton North (Sth Highlands)"},0,0,0,0,0,0,0]
[null,{"$f":"IF(ISBLANK(dms_E3_Projects_15),\"\",dms_E3_Projects_15)","v":"Western Sydney Airport (itself)"},0,0,0,0,0,0,0]
[null,{"$f":"IF(ISBLANK(dms_E3_Projects_16),\"\",dms_E3_Projects_16)","v":"Box Hill (Sydney North West)"},0,0,0,0,0,0,0]
[null,{"$f":"IF(ISBLANK(dms_E3_Projects_17),\"\",dms_E3_Projects_17)","v":"Campsie (Sydney West)"},0,0,0,0,0,0,0]
[null,{"$f":"IF(ISBLANK(dms_E3_Projects_18),\"\",dms_E3_Projects_18)","v":"Mt Gilead (Sydney West)"},0,0,0,0,0,0,0]
[null,{"$f":"IF(ISBLANK(dms_E3_Projects_19),\"\",dms_E3_Projects_19)","v":"Sydney Primary Main Integrity Management (Lane Cove to Willoughby) – Stage 1"},0,0,0,0,0,0,0]
[null,{"$f":"IF(ISBLANK(dms_E3_Projects_20),\"\",dms_E3_Projects_20)","v":"Sydney Primary Main Integrity Management (Lane Cove to Willoughby) – Stage 2"},0,0,0,0,0,0,0]
[null,{"$f":"IF(ISBLANK(dms_E3_Projects_21),\"\",dms_E3_Projects_21)","v":0},0,0,0,0,0,0,0]
[null,{"$f":"IF(ISBLANK(dms_E3_Projects_22),\"\",dms_E3_Projects_22)","v":0},0,0,0,0,0,0,0]
[null,{"$f":"IF(ISBLANK(dms_E3_Projects_23),\"\",dms_E3_Projects_23)","v":0},0,0,0,0,0,0,0]
[null,{"$f":"IF(ISBLANK(dms_E3_Projects_24),\"\",dms_E3_Projects_24)","v":""},0,0,0,0,0,0,0]
[null,{"$f":"IF(ISBLANK(dms_E3_Projects_25),\"\",dms_E3_Projects_25)","v":""}]
[null,{"$f":"IF(ISBLANK(dms_E3_Projects_26),\"\",dms_E3_Projects_26)","v":""}]
[null,{"$f":"IF(ISBLANK(dms_E3_Projects_27),\"\",dms_E3_Projects_27)","v":""}]
[null,{"$f":"IF(ISBLANK(dms_E3_Projects_28),\"\",dms_E3_Projects_28)","v":""}]
[null,{"$f":"IF(ISBLANK(dms_E3_Projects_29),\"\",dms_E3_Projects_29)","v":""}]
[null,{"$f":"IF(ISBLANK(dms_E3_Projects_30),\"\",dms_E3_Projects_30)","v":""}]
[null,{"$f":"IF(ISBLANK(dms_E3_Projects_31),\"\",dms_E3_Projects_31)","v":""}]
[null,{"$f":"IF(ISBLANK(dms_E3_Projects_32),\"\",dms_E3_Projects_32)","v":""}]
[null,{"$f":"IF(ISBLANK(dms_E3_Projects_33),\"\",dms_E3_Projects_33)","v":""}]
[null,{"$f":"IF(ISBLANK(dms_E3_Projects_34),\"\",dms_E3_Projects_34)","v":""}]
[null,{"$f":"IF(ISBLANK(dms_E3_Projects_35),\"\",dms_E3_Projects_35)","v":""}]
[null,{"$f":"IF(ISBLANK(dms_E3_Projects_36),\"\",dms_E3_Projects_36)","v":""}]
[null,{"$f":"IF(ISBLANK(dms_E3_Projects_37),\"\",dms_E3_Projects_37)","v":""}]
[null,{"$f":"IF(ISBLANK(dms_E3_Projects_38),\"\",dms_E3_Projects_38)","v":""}]
[null,{"$f":"IF(ISBLANK(dms_E3_Projects_39),\"\",dms_E3_Projects_39)","v":""}]
[null,{"$f":"IF(ISBLANK(dms_E3_Projects_40),\"\",dms_E3_Projects_40)","v":""}]
[null,{"$f":"IF(ISBLANK(dms_E3_Projects_41),\"\",dms_E3_Projects_41)","v":""}]
[null,{"$f":"IF(ISBLANK(dms_E3_Projects_42),\"\",dms_E3_Projects_42)","v":""}]
[null,{"$f":"IF(ISBLANK(dms_E3_Projects_43),\"\",dms_E3_Projects_43)","v":""}]
[null,{"$f":"IF(ISBLANK(dms_E3_Projects_44),\"\",dms_E3_Projects_44)","v":""}]
[null,{"$f":"IF(ISBLANK(dms_E3_Projects_45),\"\",dms_E3_Projects_45)","v":""}]
[null,{"$f":"IF(ISBLANK(dms_E3_Projects_46),\"\",dms_E3_Projects_46)","v":""}]
[null,{"$f":"IF(ISBLANK(dms_E3_Projects_47),\"\",dms_E3_Projects_47)","v":""}]
[null,{"$f":"IF(ISBLANK(dms_E3_Projects_48),\"\",dms_E3_Projects_48)","v":""}]
[null,{"$f":"IF(ISBLANK(dms_E3_Projects_49),\"\",dms_E3_Projects_49)","v":""}]
[null,{"$f":"IF(ISBLANK(dms_E3_Projects_50),\"\",dms_E3_Projects_50)","v":""}]
[null,"Aggregate of other projects with total expenditure of less than $500,000",0,0,0,0,0,0,0]
[null,"Total",{"$f":"SUM(C467:C517)","v":0},{"$f":"SUM(D467:D517)","v":0},{"$f":"SUM(E467:E517)","v":0},{"$f":"SUM(F467:F517)","v":0},{"$f":"SUM(G467:G517)","v":0},{"$f":"SUM(H467:H517)","v":0},{"$f":"SUM(I467:I517)","v":0}]
[]
[null,"C. LOW PRESSURE TO HIGH PRESSURE"]
[null,null,"LENGTH"]
[null,null,"0s, metres"]
[null,null,{"$f":"CRCP_y4","v":"2018-19"},{"$f":"CRCP_y5","v":"2019-20"},{"$f":"FRCP_y1","v":"2020-21"},{"$f":"FRCP_y2","v":"2021-22"},{"$f":"FRCP_y3","v":"2022-23"},{"$f":"FRCP_y4","v":"2023-24"},{"$f":"FRCP_y5","v":"2024-25"}]
[null,{"$f":"IF(ISBLANK(dms_E3_Projects_01),\"\",dms_E3_Projects_01)","v":"Minor Capital: ME and CD Projects"},0,0,0,0,0,0,0]
[null,{"$f":"IF(ISBLANK(dms_E3_Projects_02),\"\",dms_E3_Projects_02)","v":"Gas feed offtake"},0,0,0,0,0,0,0]
[null,{"$f":"IF(ISBLANK(dms_E3_Projects_03),\"\",dms_E3_Projects_03)","v":"Sydney West Development"},0,0,0,0,0,0,0]
[null,{"$f":"IF(ISBLANK(dms_E3_Projects_04),\"\",dms_E3_Projects_04)","v":"Edmondson Park RMS Component"},0,0,0,0,0,0,0]
[null,{"$f":"IF(ISBLANK(dms_E3_Projects_05),\"\",dms_E3_Projects_05)","v":"Cecil Park (Elizabeth Dr) CDP"},0,0,0,0,0,0,0]
[null,{"$f":"IF(ISBLANK(dms_E3_Projects_06),\"\",dms_E3_Projects_06)","v":"Edmondson Park Soldiers Parade Steel"},0,0,0,0,0,0,0]
[null,{"$f":"IF(ISBLANK(dms_E3_Projects_07),\"\",dms_E3_Projects_07)","v":"Largs Low CDP"},0,0,0,0,0,0,0]
[null,{"$f":"IF(ISBLANK(dms_E3_Projects_08),\"\",dms_E3_Projects_08)","v":"Burwood (Sydney South)"},0,0,0,0,0,0,0]
[null,{"$f":"IF(ISBLANK(dms_E3_Projects_09),\"\",dms_E3_Projects_09)","v":"Liverpool - Shepherd ST (Sydney West)"},0,0,0,0,0,0,0]
[null,{"$f":"IF(ISBLANK(dms_E3_Projects_10),\"\",dms_E3_Projects_10)","v":"Lidcombe CBD (Sydney West)"},0,0,0,0,0,0,0]
[null,{"$f":"IF(ISBLANK(dms_E3_Projects_11),\"\",dms_E3_Projects_11)","v":"Aerotropolis Core"},0,0,0,0,0,0,0]
[null,{"$f":"IF(ISBLANK(dms_E3_Projects_12),\"\",dms_E3_Projects_12)","v":"Sydney Science Park (near WSA)"},0,0,0,0,0,0,0]
[null,{"$f":"IF(ISBLANK(dms_E3_Projects_13),\"\",dms_E3_Projects_13)","v":"Sydney South West Development"},0,0,0,0,0,0,0]
[null,{"$f":"IF(ISBLANK(dms_E3_Projects_14),\"\",dms_E3_Projects_14)","v":"Wilton North (Sth Highlands)"},0,0,0,0,0,0,0]
[null,{"$f":"IF(ISBLANK(dms_E3_Projects_15),\"\",dms_E3_Projects_15)","v":"Western Sydney Airport (itself)"},0,0,0,0,0,0,0]
[null,{"$f":"IF(ISBLANK(dms_E3_Projects_16),\"\",dms_E3_Projects_16)","v":"Box Hill (Sydney North West)"},0,0,0,0,0,0,0]
[null,{"$f":"IF(ISBLANK(dms_E3_Projects_17),\"\",dms_E3_Projects_17)","v":"Campsie (Sydney West)"},0,0,0,0,0,0,0]
[null,{"$f":"IF(ISBLANK(dms_E3_Projects_18),\"\",dms_E3_Projects_18)","v":"Mt Gilead (Sydney West)"},0,0,0,0,0,0,0]
[null,{"$f":"IF(ISBLANK(dms_E3_Projects_19),\"\",dms_E3_Projects_19)","v":"Sydney Primary Main Integrity Management (Lane Cove to Willoughby) – Stage 1"},0,0,0,0,0,0,0]
[null,{"$f":"IF(ISBLANK(dms_E3_Projects_20),\"\",dms_E3_Projects_20)","v":"Sydney Primary Main Integrity Management (Lane Cove to Willoughby) – Stage 2"},0,0,0,0,0,0,0]
[null,{"$f":"IF(ISBLANK(dms_E3_Projects_21),\"\",dms_E3_Projects_21)","v":0},0,0,0,0,0,0,0]
[null,{"$f":"IF(ISBLANK(dms_E3_Projects_22),\"\",dms_E3_Projects_22)","v":0},0,0,0,0,0,0,0]
[null,{"$f":"IF(ISBLANK(dms_E3_Projects_23),\"\",dms_E3_Projects_23)","v":0},0,0,0,0,0,0,0]
[null,{"$f":"IF(ISBLANK(dms_E3_Projects_24),\"\",dms_E3_Projects_24)","v":""},0,0,0,0,0,0,0]
[null,{"$f":"IF(ISBLANK(dms_E3_Projects_25),\"\",dms_E3_Projects_25)","v":""}]
[null,{"$f":"IF(ISBLANK(dms_E3_Projects_26),\"\",dms_E3_Projects_26)","v":""}]
[null,{"$f":"IF(ISBLANK(dms_E3_Projects_27),\"\",dms_E3_Projects_27)","v":""}]
[null,{"$f":"IF(ISBLANK(dms_E3_Projects_28),\"\",dms_E3_Projects_28)","v":""}]
[null,{"$f":"IF(ISBLANK(dms_E3_Projects_29),\"\",dms_E3_Projects_29)","v":""}]
[null,{"$f":"IF(ISBLANK(dms_E3_Projects_30),\"\",dms_E3_Projects_30)","v":""}]
[null,{"$f":"IF(ISBLANK(dms_E3_Projects_31),\"\",dms_E3_Projects_31)","v":""}]
[null,{"$f":"IF(ISBLANK(dms_E3_Projects_32),\"\",dms_E3_Projects_32)","v":""}]
[null,{"$f":"IF(ISBLANK(dms_E3_Projects_33),\"\",dms_E3_Projects_33)","v":""}]
[null,{"$f":"IF(ISBLANK(dms_E3_Projects_34),\"\",dms_E3_Projects_34)","v":""}]
[null,{"$f":"IF(ISBLANK(dms_E3_Projects_35),\"\",dms_E3_Projects_35)","v":""}]
[null,{"$f":"IF(ISBLANK(dms_E3_Projects_36),\"\",dms_E3_Projects_36)","v":""}]
[null,{"$f":"IF(ISBLANK(dms_E3_Projects_37),\"\",dms_E3_Projects_37)","v":""}]
[null,{"$f":"IF(ISBLANK(dms_E3_Projects_38),\"\",dms_E3_Projects_38)","v":""}]
[null,{"$f":"IF(ISBLANK(dms_E3_Projects_39),\"\",dms_E3_Projects_39)","v":""}]
[null,{"$f":"IF(ISBLANK(dms_E3_Projects_40),\"\",dms_E3_Projects_40)","v":""}]
[null,{"$f":"IF(ISBLANK(dms_E3_Projects_41),\"\",dms_E3_Projects_41)","v":""}]
[null,{"$f":"IF(ISBLANK(dms_E3_Projects_42),\"\",dms_E3_Projects_42)","v":""}]
[null,{"$f":"IF(ISBLANK(dms_E3_Projects_43),\"\",dms_E3_Projects_43)","v":""}]
[null,{"$f":"IF(ISBLANK(dms_E3_Projects_44),\"\",dms_E3_Projects_44)","v":""}]
[null,{"$f":"IF(ISBLANK(dms_E3_Projects_45),\"\",dms_E3_Projects_45)","v":""}]
[null,{"$f":"IF(ISBLANK(dms_E3_Projects_46),\"\",dms_E3_Projects_46)","v":""}]
[null,{"$f":"IF(ISBLANK(dms_E3_Projects_47),\"\",dms_E3_Projects_47)","v":""}]
[null,{"$f":"IF(ISBLANK(dms_E3_Projects_48),\"\",dms_E3_Projects_48)","v":""}]
[null,{"$f":"IF(ISBLANK(dms_E3_Projects_49),\"\",dms_E3_Projects_49)","v":""}]
[null,{"$f":"IF(ISBLANK(dms_E3_Projects_50),\"\",dms_E3_Projects_50)","v":""}]
[null,"Aggregate of other projects with total expenditure of less than $500,000",0,0,0,0,0,0,0]
[null,"Total",{"$f":"SUM(C524:C574)","v":0},{"$f":"SUM(D524:D574)","v":0},{"$f":"SUM(E524:E574)","v":0},{"$f":"SUM(F524:F574)","v":0},{"$f":"SUM(G524:G574)","v":0},{"$f":"SUM(H524:H574)","v":0},{"$f":"SUM(I524:I574)","v":0}]
[]
[null,"D. MEDIUM PRESSURE TO MEDIUM PRESSURE"]
[null,null,"LENGTH"]
[null,null,"0s, metres"]
[null,null,{"$f":"CRCP_y4","v":"2018-19"},{"$f":"CRCP_y5","v":"2019-20"},{"$f":"FRCP_y1","v":"2020-21"},{"$f":"FRCP_y2","v":"2021-22"},{"$f":"FRCP_y3","v":"2022-23"},{"$f":"FRCP_y4","v":"2023-24"},{"$f":"FRCP_y5","v":"2024-25"}]
[null,{"$f":"IF(ISBLANK(dms_E3_Projects_01),\"\",dms_E3_Projects_01)","v":"Minor Capital: ME and CD Projects"},0,0,0,0,0,0,0]
[null,{"$f":"IF(ISBLANK(dms_E3_Projects_02),\"\",dms_E3_Projects_02)","v":"Gas feed offtake"},0,0,0,1900,0,0,0]
[null,{"$f":"IF(ISBLANK(dms_E3_Projects_03),\"\",dms_E3_Projects_03)","v":"Sydney West Development"},1.6571410671480322,8.3428589328519678,0,0,0,0,0]
[null,{"$f":"IF(ISBLANK(dms_E3_Projects_04),\"\",dms_E3_Projects_04)","v":"Edmondson Park RMS Component"},0,0,0,311.53536391717023,2888.4646360828301,0,0]
[null,{"$f":"IF(ISBLANK(dms_E3_Projects_05),\"\",dms_E3_Projects_05)","v":"Cecil Park (Elizabeth Dr) CDP"},0,0,0,0,280.59325332536929,2419.4067466746305,0]
[null,{"$f":"IF(ISBLANK(dms_E3_Projects_06),\"\",dms_E3_Projects_06)","v":"Edmondson Park Soldiers Parade Steel"},374.26146348607352,625.73853651392642,0,0,0,0,0]
[null,{"$f":"IF(ISBLANK(dms_E3_Projects_07),\"\",dms_E3_Projects_07)","v":"Largs Low CDP"},0,0,480,0,0,0,0]
[null,{"$f":"IF(ISBLANK(dms_E3_Projects_08),\"\",dms_E3_Projects_08)","v":"Burwood (Sydney South)"},36.457103477256709,183.54289652274329,0,0,0,0,0]
[null,{"$f":"IF(ISBLANK(dms_E3_Projects_09),\"\",dms_E3_Projects_09)","v":"Liverpool - Shepherd ST (Sydney West)"},0,0,0,0,0,0,0]
[null,{"$f":"IF(ISBLANK(dms_E3_Projects_10),\"\",dms_E3_Projects_10)","v":"Lidcombe CBD (Sydney West)"},0,0,0,0,0,0,0]
[null,{"$f":"IF(ISBLANK(dms_E3_Projects_11),\"\",dms_E3_Projects_11)","v":"Aerotropolis Core"},0,0,0,0,0,0,0]
[null,{"$f":"IF(ISBLANK(dms_E3_Projects_12),\"\",dms_E3_Projects_12)","v":"Sydney Science Park (near WSA)"},0,0,0,0,0,0,0]
[null,{"$f":"IF(ISBLANK(dms_E3_Projects_13),\"\",dms_E3_Projects_13)","v":"Sydney South West Development"},0,0,0,0,0,0,0]
[null,{"$f":"IF(ISBLANK(dms_E3_Projects_14),\"\",dms_E3_Projects_14)","v":"Wilton North (Sth Highlands)"},0,0,0,0,0,0,0]
[null,{"$f":"IF(ISBLANK(dms_E3_Projects_15),\"\",dms_E3_Projects_15)","v":"Western Sydney Airport (itself)"},0,0,0,0,0,0,0]
[null,{"$f":"IF(ISBLANK(dms_E3_Projects_16),\"\",dms_E3_Projects_16)","v":"Box Hill (Sydney North West)"},0,0,0,0,0,0,0]
[null,{"$f":"IF(ISBLANK(dms_E3_Projects_17),\"\",dms_E3_Projects_17)","v":"Campsie (Sydney West)"},0,0,0,0,0,0,0]
[null,{"$f":"IF(ISBLANK(dms_E3_Projects_18),\"\",dms_E3_Projects_18)","v":"Mt Gilead (Sydney West)"},0,0,0,0,0,0,0]
[null,{"$f":"IF(ISBLANK(dms_E3_Projects_19),\"\",dms_E3_Projects_19)","v":"Sydney Primary Main Integrity Management (Lane Cove to Willoughby) – Stage 1"},0,0,0,0,0,0,0]
[null,{"$f":"IF(ISBLANK(dms_E3_Projects_20),\"\",dms_E3_Projects_20)","v":"Sydney Primary Main Integrity Management (Lane Cove to Willoughby) – Stage 2"},0,0,0,0,0,0,0]
[null,{"$f":"IF(ISBLANK(dms_E3_Projects_21),\"\",dms_E3_Projects_21)","v":0},0,0,0,0,0,0,0]
[null,{"$f":"IF(ISBLANK(dms_E3_Projects_22),\"\",dms_E3_Projects_22)","v":0},0,0,0,0,0,0,0]
[null,{"$f":"IF(ISBLANK(dms_E3_Projects_23),\"\",dms_E3_Projects_23)","v":0},0,0,0,0,0,0,0]
[null,{"$f":"IF(ISBLANK(dms_E3_Projects_24),\"\",dms_E3_Projects_24)","v":""},0,0,0,0,0,0,0]
[null,{"$f":"IF(ISBLANK(dms_E3_Projects_25),\"\",dms_E3_Projects_25)","v":""}]
[null,{"$f":"IF(ISBLANK(dms_E3_Projects_26),\"\",dms_E3_Projects_26)","v":""}]
[null,{"$f":"IF(ISBLANK(dms_E3_Projects_27),\"\",dms_E3_Projects_27)","v":""}]
[null,{"$f":"IF(ISBLANK(dms_E3_Projects_28),\"\",dms_E3_Projects_28)","v":""}]
[null,{"$f":"IF(ISBLANK(dms_E3_Projects_29),\"\",dms_E3_Projects_29)","v":""}]
[null,{"$f":"IF(ISBLANK(dms_E3_Projects_30),\"\",dms_E3_Projects_30)","v":""}]
[null,{"$f":"IF(ISBLANK(dms_E3_Projects_31),\"\",dms_E3_Projects_31)","v":""}]
[null,{"$f":"IF(ISBLANK(dms_E3_Projects_32),\"\",dms_E3_Projects_32)","v":""}]
[null,{"$f":"IF(ISBLANK(dms_E3_Projects_33),\"\",dms_E3_Projects_33)","v":""}]
[null,{"$f":"IF(ISBLANK(dms_E3_Projects_34),\"\",dms_E3_Projects_34)","v":""}]
[null,{"$f":"IF(ISBLANK(dms_E3_Projects_35),\"\",dms_E3_Projects_35)","v":""}]
[null,{"$f":"IF(ISBLANK(dms_E3_Projects_36),\"\",dms_E3_Projects_36)","v":""}]
[null,{"$f":"IF(ISBLANK(dms_E3_Projects_37),\"\",dms_E3_Projects_37)","v":""}]
[null,{"$f":"IF(ISBLANK(dms_E3_Projects_38),\"\",dms_E3_Projects_38)","v":""}]
[null,{"$f":"IF(ISBLANK(dms_E3_Projects_39),\"\",dms_E3_Projects_39)","v":""}]
[null,{"$f":"IF(ISBLANK(dms_E3_Projects_40),\"\",dms_E3_Projects_40)","v":""}]
[null,{"$f":"IF(ISBLANK(dms_E3_Projects_41),\"\",dms_E3_Projects_41)","v":""}]
[null,{"$f":"IF(ISBLANK(dms_E3_Projects_42),\"\",dms_E3_Projects_42)","v":""}]
[null,{"$f":"IF(ISBLANK(dms_E3_Projects_43),\"\",dms_E3_Projects_43)","v":""}]
[null,{"$f":"IF(ISBLANK(dms_E3_Projects_44),\"\",dms_E3_Projects_44)","v":""}]
[null,{"$f":"IF(ISBLANK(dms_E3_Projects_45),\"\",dms_E3_Projects_45)","v":""}]
[null,{"$f":"IF(ISBLANK(dms_E3_Projects_46),\"\",dms_E3_Projects_46)","v":""}]
[null,{"$f":"IF(ISBLANK(dms_E3_Projects_47),\"\",dms_E3_Projects_47)","v":""}]
[null,{"$f":"IF(ISBLANK(dms_E3_Projects_48),\"\",dms_E3_Projects_48)","v":""}]
[null,{"$f":"IF(ISBLANK(dms_E3_Projects_49),\"\",dms_E3_Projects_49)","v":""}]
[null,{"$f":"IF(ISBLANK(dms_E3_Projects_50),\"\",dms_E3_Projects_50)","v":""}]
[null,"Aggregate of other projects with total expenditure of less than $500,000",0,0,0,0,593.8923367294467,6.1076632705533305,0]
[null,"Total",{"$f":"SUM(C581:C631)","v":412.37570803047822},{"$f":"SUM(D581:D631)","v":817.62429196952166},{"$f":"SUM(E581:E631)","v":480},{"$f":"SUM(F581:F631)","v":2211.5353639171703},{"$f":"SUM(G581:G631)","v":3762.9502261376465},{"$f":"SUM(H581:H631)","v":2425.5144099451841},{"$f":"SUM(I581:I631)","v":0}]
[]
[null,"E. MEDIUM PRESSURE TO HIGH PRESSURE"]
[null,null,"LENGTH"]
[null,null,"0s, metres"]
[null,null,{"$f":"CRCP_y4","v":"2018-19"},{"$f":"CRCP_y5","v":"2019-20"},{"$f":"FRCP_y1","v":"2020-21"},{"$f":"FRCP_y2","v":"2021-22"},{"$f":"FRCP_y3","v":"2022-23"},{"$f":"FRCP_y4","v":"2023-24"},{"$f":"FRCP_y5","v":"2024-25"}]
[null,{"$f":"IF(ISBLANK(dms_E3_Projects_01),\"\",dms_E3_Projects_01)","v":"Minor Capital: ME and CD Projects"},0,0,0,0,0,0,0]
[null,{"$f":"IF(ISBLANK(dms_E3_Projects_02),\"\",dms_E3_Projects_02)","v":"Gas feed offtake"},0,0,0,0,0,0,0]
[null,{"$f":"IF(ISBLANK(dms_E3_Projects_03),\"\",dms_E3_Projects_03)","v":"Sydney West Development"},0,0,0,0,0,0,0]
[null,{"$f":"IF(ISBLANK(dms_E3_Projects_04),\"\",dms_E3_Projects_04)","v":"Edmondson Park RMS Component"},0,0,0,0,0,0,0]
[null,{"$f":"IF(ISBLANK(dms_E3_Projects_05),\"\",dms_E3_Projects_05)","v":"Cecil Park (Elizabeth Dr) CDP"},0,0,0,0,0,0,0]
[null,{"$f":"IF(ISBLANK(dms_E3_Projects_06),\"\",dms_E3_Projects_06)","v":"Edmondson Park Soldiers Parade Steel"},0,0,0,0,0,0,0]
[null,{"$f":"IF(ISBLANK(dms_E3_Projects_07),\"\",dms_E3_Projects_07)","v":"Largs Low CDP"},0,0,0,0,0,0,0]
[null,{"$f":"IF(ISBLANK(dms_E3_Projects_08),\"\",dms_E3_Projects_08)","v":"Burwood (Sydney South)"},0,0,0,0,0,0,0]
[null,{"$f":"IF(ISBLANK(dms_E3_Projects_09),\"\",dms_E3_Projects_09)","v":"Liverpool - Shepherd ST (Sydney West)"},0,0,0,0,0,0,0]
[null,{"$f":"IF(ISBLANK(dms_E3_Projects_10),\"\",dms_E3_Projects_10)","v":"Lidcombe CBD (Sydney West)"},0,0,0,0,0,0,0]
[null,{"$f":"IF(ISBLANK(dms_E3_Projects_11),\"\",dms_E3_Projects_11)","v":"Aerotropolis Core"},0,0,0,0,0,0,0]
[null,{"$f":"IF(ISBLANK(dms_E3_Projects_12),\"\",dms_E3_Projects_12)","v":"Sydney Science Park (near WSA)"},0,0,0,0,0,0,0]
[null,{"$f":"IF(ISBLANK(dms_E3_Projects_13),\"\",dms_E3_Projects_13)","v":"Sydney South West Development"},0,0,0,0,0,0,0]
[null,{"$f":"IF(ISBLANK(dms_E3_Projects_14),\"\",dms_E3_Projects_14)","v":"Wilton North (Sth Highlands)"},0,0,0,0,0,0,0]
[null,{"$f":"IF(ISBLANK(dms_E3_Projects_15),\"\",dms_E3_Projects_15)","v":"Western Sydney Airport (itself)"},0,0,0,0,0,0,0]
[null,{"$f":"IF(ISBLANK(dms_E3_Projects_16),\"\",dms_E3_Projects_16)","v":"Box Hill (Sydney North West)"},0,0,0,0,0,0,0]
[null,{"$f":"IF(ISBLANK(dms_E3_Projects_17),\"\",dms_E3_Projects_17)","v":"Campsie (Sydney West)"},0,0,0,0,0,0,0]
[null,{"$f":"IF(ISBLANK(dms_E3_Projects_18),\"\",dms_E3_Projects_18)","v":"Mt Gilead (Sydney West)"},0,0,0,0,0,0,0]
[null,{"$f":"IF(ISBLANK(dms_E3_Projects_19),\"\",dms_E3_Projects_19)","v":"Sydney Primary Main Integrity Management (Lane Cove to Willoughby) – Stage 1"},0,0,0,0,0,0,0]
[null,{"$f":"IF(ISBLANK(dms_E3_Projects_20),\"\",dms_E3_Projects_20)","v":"Sydney Primary Main Integrity Management (Lane Cove to Willoughby) – Stage 2"},0,0,0,0,0,0,0]
[null,{"$f":"IF(ISBLANK(dms_E3_Projects_21),\"\",dms_E3_Projects_21)","v":0},0,0,0,0,0,0,0]
[null,{"$f":"IF(ISBLANK(dms_E3_Projects_22),\"\",dms_E3_Projects_22)","v":0},0,0,0,0,0,0,0]
[null,{"$f":"IF(ISBLANK(dms_E3_Projects_23),\"\",dms_E3_Projects_23)","v":0},0,0,0,0,0,0,0]
[null,{"$f":"IF(ISBLANK(dms_E3_Projects_24),\"\",dms_E3_Projects_24)","v":""},0,0,0,0,0,0,0]
[null,{"$f":"IF(ISBLANK(dms_E3_Projects_25),\"\",dms_E3_Projects_25)","v":""}]
[null,{"$f":"IF(ISBLANK(dms_E3_Projects_26),\"\",dms_E3_Projects_26)","v":""}]
[null,{"$f":"IF(ISBLANK(dms_E3_Projects_27),\"\",dms_E3_Projects_27)","v":""}]
[null,{"$f":"IF(ISBLANK(dms_E3_Projects_28),\"\",dms_E3_Projects_28)","v":""}]
[null,{"$f":"IF(ISBLANK(dms_E3_Projects_29),\"\",dms_E3_Projects_29)","v":""}]
[null,{"$f":"IF(ISBLANK(dms_E3_Projects_30),\"\",dms_E3_Projects_30)","v":""}]
[null,{"$f":"IF(ISBLANK(dms_E3_Projects_31),\"\",dms_E3_Projects_31)","v":""}]
[null,{"$f":"IF(ISBLANK(dms_E3_Projects_32),\"\",dms_E3_Projects_32)","v":""}]
[null,{"$f":"IF(ISBLANK(dms_E3_Projects_33),\"\",dms_E3_Projects_33)","v":""}]
[null,{"$f":"IF(ISBLANK(dms_E3_Projects_34),\"\",dms_E3_Projects_34)","v":""}]
[null,{"$f":"IF(ISBLANK(dms_E3_Projects_35),\"\",dms_E3_Projects_35)","v":""}]
[null,{"$f":"IF(ISBLANK(dms_E3_Projects_36),\"\",dms_E3_Projects_36)","v":""}]
[null,{"$f":"IF(ISBLANK(dms_E3_Projects_37),\"\",dms_E3_Projects_37)","v":""}]
[null,{"$f":"IF(ISBLANK(dms_E3_Projects_38),\"\",dms_E3_Projects_38)","v":""}]
[null,{"$f":"IF(ISBLANK(dms_E3_Projects_39),\"\",dms_E3_Projects_39)","v":""}]
[null,{"$f":"IF(ISBLANK(dms_E3_Projects_40),\"\",dms_E3_Projects_40)","v":""}]
[null,{"$f":"IF(ISBLANK(dms_E3_Projects_41),\"\",dms_E3_Projects_41)","v":""}]
[null,{"$f":"IF(ISBLANK(dms_E3_Projects_42),\"\",dms_E3_Projects_42)","v":""}]
[null,{"$f":"IF(ISBLANK(dms_E3_Projects_43),\"\",dms_E3_Projects_43)","v":""}]
[null,{"$f":"IF(ISBLANK(dms_E3_Projects_44),\"\",dms_E3_Projects_44)","v":""}]
[null,{"$f":"IF(ISBLANK(dms_E3_Projects_45),\"\",dms_E3_Projects_45)","v":""}]
[null,{"$f":"IF(ISBLANK(dms_E3_Projects_46),\"\",dms_E3_Projects_46)","v":""}]
[null,{"$f":"IF(ISBLANK(dms_E3_Projects_47),\"\",dms_E3_Projects_47)","v":""}]
[null,{"$f":"IF(ISBLANK(dms_E3_Projects_48),\"\",dms_E3_Projects_48)","v":""}]
[null,{"$f":"IF(ISBLANK(dms_E3_Projects_49),\"\",dms_E3_Projects_49)","v":""}]
[null,{"$f":"IF(ISBLANK(dms_E3_Projects_50),\"\",dms_E3_Projects_50)","v":""}]
[null,"Aggregate of other projects with total expenditure of less than $500,000",0,0,0,0,0,0,0]
[null,"Total",{"$f":"SUM(C638:C688)","v":0},{"$f":"SUM(D638:D688)","v":0},{"$f":"SUM(E638:E688)","v":0},{"$f":"SUM(F638:F688)","v":0},{"$f":"SUM(G638:G688)","v":0},{"$f":"SUM(H638:H688)","v":0},{"$f":"SUM(I638:I688)","v":0}]
[]
[null,"F. HIGH PRESSURE TO HIGH PRESSURE"]
[null,null,"LENGTH"]
[null,null,"0s, metres"]
[null,null,{"$f":"CRCP_y4","v":"2018-19"},{"$f":"CRCP_y5","v":"2019-20"},{"$f":"FRCP_y1","v":"2020-21"},{"$f":"FRCP_y2","v":"2021-22"},{"$f":"FRCP_y3","v":"2022-23"},{"$f":"FRCP_y4","v":"2023-24"},{"$f":"FRCP_y5","v":"2024-25"}]
[null,{"$f":"IF(ISBLANK(dms_E3_Projects_01),\"\",dms_E3_Projects_01)","v":"Minor Capital: ME and CD Projects"},0,0,0,0,0,0,0]
[null,{"$f":"IF(ISBLANK(dms_E3_Projects_02),\"\",dms_E3_Projects_02)","v":"Gas feed offtake"},547.69900408648107,2.3009959135189422,0,0,0,0,0]
[null,{"$f":"IF(ISBLANK(dms_E3_Projects_03),\"\",dms_E3_Projects_03)","v":"Sydney West Development"},92.836920459844649,92.163079540155337,0,0,0,0,0]
[null,{"$f":"IF(ISBLANK(dms_E3_Projects_04),\"\",dms_E3_Projects_04)","v":"Edmondson Park RMS Component"},0,0,310,0,0,0,0]
[null,{"$f":"IF(ISBLANK(dms_E3_Projects_05),\"\",dms_E3_Projects_05)","v":"Cecil Park (Elizabeth Dr) CDP"},0,0,0,480,0,0,0]
[null,{"$f":"IF(ISBLANK(dms_E3_Projects_06),\"\",dms_E3_Projects_06)","v":"Edmondson Park Soldiers Parade Steel"},0,0,430.94934375232799,3569.0506562476721,0,0,0]
[null,{"$f":"IF(ISBLANK(dms_E3_Projects_07),\"\",dms_E3_Projects_07)","v":"Largs Low CDP"},0,0,591.98427553002932,4908.0157244699703,0,0,0]
[null,{"$f":"IF(ISBLANK(dms_E3_Projects_08),\"\",dms_E3_Projects_08)","v":"Burwood (Sydney South)"},0,468.01001173575935,5531.9899882642412,0,0,0,0]
[null,{"$f":"IF(ISBLANK(dms_E3_Projects_09),\"\",dms_E3_Projects_09)","v":"Liverpool - Shepherd ST (Sydney West)"},0,0,0,0,259.4159752720002,2240.5840247279993,0]
[null,{"$f":"IF(ISBLANK(dms_E3_Projects_10),\"\",dms_E3_Projects_10)","v":"Lidcombe CBD (Sydney West)"},0.26848675587326809,0,1187.9137146946425,1511.8177985494845,0,0,0]
[null,{"$f":"IF(ISBLANK(dms_E3_Projects_11),\"\",dms_E3_Projects_11)","v":"Aerotropolis Core"},0,0,42.448298619395459,541.62313488714324,4117.3269766502654,1798.6015898431961,0]
[null,{"$f":"IF(ISBLANK(dms_E3_Projects_12),\"\",dms_E3_Projects_12)","v":"Sydney Science Park (near WSA)"},0,0,0,0,0,0,0]
[null,{"$f":"IF(ISBLANK(dms_E3_Projects_13),\"\",dms_E3_Projects_13)","v":"Sydney South West Development"},0,0,0,0,0,0,0]
[null,{"$f":"IF(ISBLANK(dms_E3_Projects_14),\"\",dms_E3_Projects_14)","v":"Wilton North (Sth Highlands)"},0,0,0,0,0,0,0]
[null,{"$f":"IF(ISBLANK(dms_E3_Projects_15),\"\",dms_E3_Projects_15)","v":"Western Sydney Airport (itself)"},0,0,0,0,0,0,0]
[null,{"$f":"IF(ISBLANK(dms_E3_Projects_16),\"\",dms_E3_Projects_16)","v":"Box Hill (Sydney North West)"},0,0,0,0,0,0,0]
[null,{"$f":"IF(ISBLANK(dms_E3_Projects_17),\"\",dms_E3_Projects_17)","v":"Campsie (Sydney West)"},0,0,0,0,0,0,0]
[null,{"$f":"IF(ISBLANK(dms_E3_Projects_18),\"\",dms_E3_Projects_18)","v":"Mt Gilead (Sydney West)"},0,0,0,0,0,0,0]
[null,{"$f":"IF(ISBLANK(dms_E3_Projects_19),\"\",dms_E3_Projects_19)","v":"Sydney Primary Main Integrity Management (Lane Cove to Willoughby) – Stage 1"},0,0,0,0,0,0,0]
[null,{"$f":"IF(ISBLANK(dms_E3_Projects_20),\"\",dms_E3_Projects_20)","v":"Sydney Primary Main Integrity Management (Lane Cove to Willoughby) – Stage 2"},0,0,0,0,0,0,0]
[null,{"$f":"IF(ISBLANK(dms_E3_Projects_21),\"\",dms_E3_Projects_21)","v":0},0,0,0,0,0,0,0]
[null,{"$f":"IF(ISBLANK(dms_E3_Projects_22),\"\",dms_E3_Projects_22)","v":0},0,0,0,0,0,0,0]
[null,{"$f":"IF(ISBLANK(dms_E3_Projects_23),\"\",dms_E3_Projects_23)","v":0},0,0,0,0,0,0,0]
[null,{"$f":"IF(ISBLANK(dms_E3_Projects_24),\"\",dms_E3_Projects_24)","v":""},0,0,0,0,0,0,0]
[null,{"$f":"IF(ISBLANK(dms_E3_Projects_25),\"\",dms_E3_Projects_25)","v":""}]
[null,{"$f":"IF(ISBLANK(dms_E3_Projects_26),\"\",dms_E3_Projects_26)","v":""}]
[null,{"$f":"IF(ISBLANK(dms_E3_Projects_27),\"\",dms_E3_Projects_27)","v":""}]
[null,{"$f":"IF(ISBLANK(dms_E3_Projects_28),\"\",dms_E3_Projects_28)","v":""}]
[null,{"$f":"IF(ISBLANK(dms_E3_Projects_29),\"\",dms_E3_Projects_29)","v":""}]
[null,{"$f":"IF(ISBLANK(dms_E3_Projects_30),\"\",dms_E3_Projects_30)","v":""}]
[null,{"$f":"IF(ISBLANK(dms_E3_Projects_31),\"\",dms_E3_Projects_31)","v":""}]
[null,{"$f":"IF(ISBLANK(dms_E3_Projects_32),\"\",dms_E3_Projects_32)","v":""}]
[null,{"$f":"IF(ISBLANK(dms_E3_Projects_33),\"\",dms_E3_Projects_33)","v":""}]
[null,{"$f":"IF(ISBLANK(dms_E3_Projects_34),\"\",dms_E3_Projects_34)","v":""}]
[null,{"$f":"IF(ISBLANK(dms_E3_Projects_35),\"\",dms_E3_Projects_35)","v":""}]
[null,{"$f":"IF(ISBLANK(dms_E3_Projects_36),\"\",dms_E3_Projects_36)","v":""}]
[null,{"$f":"IF(ISBLANK(dms_E3_Projects_37),\"\",dms_E3_Projects_37)","v":""}]
[null,{"$f":"IF(ISBLANK(dms_E3_Projects_38),\"\",dms_E3_Projects_38)","v":""}]
[null,{"$f":"IF(ISBLANK(dms_E3_Projects_39),\"\",dms_E3_Projects_39)","v":""}]
[null,{"$f":"IF(ISBLANK(dms_E3_Projects_40),\"\",dms_E3_Projects_40)","v":""}]
[null,{"$f":"IF(ISBLANK(dms_E3_Projects_41),\"\",dms_E3_Projects_41)","v":""}]
[null,{"$f":"IF(ISBLANK(dms_E3_Projects_42),\"\",dms_E3_Projects_42)","v":""}]
[null,{"$f":"IF(ISBLANK(dms_E3_Projects_43),\"\",dms_E3_Projects_43)","v":""}]
[null,{"$f":"IF(ISBLANK(dms_E3_Projects_44),\"\",dms_E3_Projects_44)","v":""}]
[null,{"$f":"IF(ISBLANK(dms_E3_Projects_45),\"\",dms_E3_Projects_45)","v":""}]
[null,{"$f":"IF(ISBLANK(dms_E3_Projects_46),\"\",dms_E3_Projects_46)","v":""}]
[null,{"$f":"IF(ISBLANK(dms_E3_Projects_47),\"\",dms_E3_Projects_47)","v":""}]
[null,{"$f":"IF(ISBLANK(dms_E3_Projects_48),\"\",dms_E3_Projects_48)","v":""}]
[null,{"$f":"IF(ISBLANK(dms_E3_Projects_49),\"\",dms_E3_Projects_49)","v":""}]
[null,{"$f":"IF(ISBLANK(dms_E3_Projects_50),\"\",dms_E3_Projects_50)","v":""}]
[null,"Aggregate of other projects with total expenditure of less than $500,000",0,0,0,0,0,0,0]
[null,"Total",{"$f":"SUM(C695:C745)","v":640.80441130219901},{"$f":"SUM(D695:D745)","v":562.47408718943359},8095.2856208606363,11010.507314154269,4376.742951922266,4039.1856145711954,0]

{"sheet":"E4. Meter replacement","index":8,"n_rows":207,"n_cols":9,"rows_kept":207,"cut":false,"hidden":false,"merged":[[191,2,191,8],[200,2,200,8],[201,2,201,8],[163,2,163,8],[164,2,164,8],[180,2,180,8],[181,2,181,8],[190,2,190,8],[115,2,115,8],[116,2,116,8],[153,2,153,8],[154,2,154,8],[7,2,7,8],[8,2,8,8],[43,2,43,8],[44,2,44,8],[79,2,79,8],[80,2,80,8]]}
[null,{"$f":"IF(dms_MultiYear_ResponseFlag=\"Yes\",\"REGULATORY REPORTING STATEMENT - HISTORICAL INFORMATION\",INDEX(dms_Worksheet_List,MATCH(dms_Model,dms_Model_List)))","v":"REGULATORY REPORTING STATEMENT"}]
[null,{"$f":"INDEX(dms_TradingNameFull_List,MATCH(dms_TradingName,dms_TradingName_List))","v":"Jemena Gas Networks (NSW) Ltd"}]
[null,{"$f":"IF(SUM(dms_SingleYear_Model)>0,CONCATENATE(CRY),CONCATENATE(FRCP_y1,\" to \",dms_MultiYear_FinalYear_Result))","v":"2020-21 to 2024-25"}]
[null,"E4. METER REPLACEMENT"]
[]
[null,"E4.1 - CAPEX"]
[null,"E4.1.1 - NEW METERS ACQUIRED"]
[null,null,"EXPENDITURE"]
[null,null,{"$f":"CONCATENATE(\"$0's, real \",dms_DollarReal)","v":"$0's, real June 2020"}]
[null,null,{"$f":"CRCP_y4","v":"2018-19"},{"$f":"CRCP_y5","v":"2019-20"},{"$f":"FRCP_y1","v":"2020-21"},{"$f":"FRCP_y2","v":"2021-22"},{"$f":"FRCP_y3","v":"2022-23"},{"$f":"FRCP_y4","v":"2023-24"},{"$f":"FRCP_y5","v":"2024-25"}]
[null,"A. DIRECT INTERNAL LABOUR EXPENDITURE"]
[null,"Residential",0,0,0,0,0,0,0]
[null,"Industrial and Commercial",0,0,0,0,0,0,0]
[null,"Other",0,0,0,0,0,0,0]
[null,"Total",{"$f":"SUM(C12:C14)","v":0},{"$f":"SUM(D12:D14)","v":0},0,0,0,0,0]
[null,"B. DIRECT CONTRACTOR EXPENDITURE"]
[null,"Residential",0,0,0,0,0,0,0]
[null,"Industrial and Commercial",0,0,0,0,0,0,0]
[null,"Other",0,0,0,0,0,0,0]
[null,"Total",{"$f":"SUM(C17:C19)","v":0},{"$f":"SUM(D17:D19)","v":0},0,0,0,0,0]
[null,"C. OTHER INTERNAL DIRECT EXPENDITURE"]
[null,"Residential"]
[null,"Industrial and Commercial"]
[null,"Other"]
[null,"Total"]
[null,"D. TOTAL OVERHEAD EXPENDITURE"]
[null,"Residential",820288.1694561278,735734.8780117901,465897.37174882542,449596.7563176002,670066.07855544775,761895.85526053095,845957.26010791364]
[null,"Industrial and Commercial",319224.16180724936,299811.54166948836,229765.65201920984,174430.40547094424,233460.32263934441,302481.10331325309,349338.32243717468]
[null,"Other",904707.16272211925,620245.55696358334,450294.22988091549,322858.68853642693,338908.38400264224,282756.93651930499,246326.74218147426]
[null,"Total",{"$f":"SUM(C27:C29)","v":2044219.4939854965},{"$f":"SUM(D27:D29)","v":1655791.976644862},1145957.2536489507,946885.85032497137,1242434.7851974345,1347133.895093089,1441622.3247265627]
[null,"E. RELATED PARTY MARGIN EXPENDITURE"]
[null,"Residential",0,0,0,0,0,0,0]
[null,"Industrial and Commercial",0,0,0,0,0,0,0]
[null,"Other",0,0,0,0,0,0,0]
[null,"Total",{"$f":"SUM(C32:C34)","v":0},{"$f":"SUM(D32:D34)","v":0},0,0,0,0,0]
[null,"F. CUSTOMER CONTRIBUTIONS included in the above"]
[null,"Residential",0,0,0,0,0,0,0]
[null,"Industrial and Commercial",0,0,0,0,0,0,0]
[null,"Other",0,0,0,0,0,0,0]
[null,"Total",{"$f":"SUM(C37:C39)","v":0},{"$f":"SUM(D37:D39)","v":0},0,0,0,0,0]
[null,"TOTAL",{"$f":"SUM(C15,C20,C25,C30,C35,C40)","v":2044219.4939854965},{"$f":"SUM(D15,D20,D25,D30,D35,D40)","v":1655791.976644862},1145957.2536489507,946885.85032497137,1242434.7851974345,1347133.895093089,1441622.3247265627]
[]
[null,"E4.1.2 - METER REFURBISHMENT"]
[null,null,"EXPENDITURE"]
[null,null,{"$f":"CONCATENATE(\"$0's, real \",dms_DollarReal)","v":"$0's, real June 2020"}]
[null,null,{"$f":"CRCP_y4","v":"2018-19"},{"$f":"CRCP_y5","v":"2019-20"},{"$f":"FRCP_y1","v":"2020-21"},{"$f":"FRCP_y2","v":"2021-22"},{"$f":"FRCP_y3","v":"2022-23"},{"$f":"FRCP_y4","v":"2023-24"},{"$f":"FRCP_y5","v":"2024-25"}]
[null,"A. DIRECT INTERNAL LABOUR EXPENDITURE"]
[null,"Residential",0,0,0,0,0,0,0]
[null,"Industrial and Commercial",0,0,0,0,0,0,0]
[null,"Other",0,0,0,0,0,0,0]
[null,"Total",{"$f":"SUM(C48:C50)","v":0},{"$f":"SUM(D48:D50)","v":0},0,0,0,0,0]
[null,"B. DIRECT CONTRACTOR EXPENDITURE"]
[null,"Residential",0,0,0,0,0,0,0]
[null,"Industrial and Commercial",0,0,0,0,0,0,0]
[null,"Other",0,0,0,0,0,0,0]
[null,"Total",{"$f":"SUM(C53:C55)","v":0},{"$f":"SUM(D53:D55)","v":0},0,0,0,0,0]
[null,"C. OTHER INTERNAL DIRECT EXPENDITURE"]
[null,"Residential",0,0,0,0,0,0,0]
[null,"Industrial and Commercial"]
[null,"Other",0,0,0,0,0,0,0]
[null,"Total"]
[null,"D. TOTAL OVERHEAD EXPENDITURE"]
[null,"Residential",0,0,0,0,0,0,0]
[null,"Industrial and Commercial",339281.2048283469,288277.92955643084,195649.11362405503,139261.00113953798,201157.77425931682,283795.9368302112,334449.56967177463]
[null,"Other",0,0,0,0,0,0,0]
[null,"Total",{"$f":"SUM(C63:C65)","v":339281.2048283469},{"$f":"SUM(D63:D65)","v":288277.92955643084},195649.11362405503,139261.00113953798,201157.77425931682,283795.9368302112,334449.56967177463]
[null,"E. RELATED PARTY MARGIN EXPENDITURE"]
[null,"Residential",0,0,0,0,0,0,0]
[null,"Industrial and Commercial",0,0,0,0,0,0,0]
[null,"Other",0,0,0,0,0,0,0]
[null,"Total",{"$f":"SUM(C68:C70)","v":0},{"$f":"SUM(D68:D70)","v":0},0,0,0,0,0]
[null,"F. CUSTOMER CONTRIBUTIONS included in the above"]
[null,"Residential",0,0,0,0,0,0,0]
[null,"Industrial and Commercial",0,0,0,0,0,0,0]
[null,"Other",0,0,0,0,0,0,0]
[null,"Total",{"$f":"SUM(C73:C75)","v":0},{"$f":"SUM(D73:D75)","v":0},0,0,0,0,0]
[null,"TOTAL",{"$f":"SUM(C51,C56,C61,C66,C71,C76)","v":339281.2048283469},{"$f":"SUM(D51,D56,D61,D66,D71,D76)","v":288277.92955643084},195649.11362405503,139261.00113953798,201157.77425931682,283795.9368302112,334449.56967177463]
[]
[null,"E4.1.3 - METER INSTALLATION"]
[null,null,"EXPENDITURE"]
[null,null,{"$f":"CONCATENATE(\"$0's, real \",dms_DollarReal)","v":"$0's, real June 2020"}]
[null,null,{"$f":"CRCP_y4","v":"2018-19"},{"$f":"CRCP_y5","v":"2019-20"},{"$f":"FRCP_y1","v":"2020-21"},{"$f":"FRCP_y2","v":"2021-22"},{"$f":"FRCP_y3","v":"2022-23"},{"$f":"FRCP_y4","v":"2023-24"},{"$f":"FRCP_y5","v":"2024-25"}]
[null,"A. DIRECT INTERNAL LABOUR EXPENDITURE"]
[null,"Residential",1992401.1325495378,1872591.5654141251,1605679.9793898948,2244505.7751729586,3007762.0596778123,3510149.1588566834,3916865.3100214005]
[null,"Industrial and Commercial",842044.85509022442,744222.35913648631,718406.25737584615,821822.11981753493,1235100.3682799141,1963414.4934387917,2423823.9512447142]
[null,"Other",98938.800693311103,96075.486980499758,95956.698685373689,96317.514652054335,95968.442935558094,95001.845433315219,94289.507559605699]
[null,"Total",{"$f":"SUM(C84:C86)","v":2933384.7883330737},{"$f":"SUM(D84:D86)","v":2712889.4115311112},2420042.9354511146,3162645.4096425478,4338830.8708932847,5568565.4977287902,6434978.7688257201]
[null,"B. DIRECT CONTRACTOR EXPENDITURE"]
[null,"Residential"]
[null,"Industrial and Commercial"]
[null,"Other"]
[null,"Total"]
[null,"C. OTHER INTERNAL DIRECT EXPENDITURE"]
[null,"Residential",0,0,0,0,0,0,0]
[null,"Industrial and Commercial",0,0,0,0,0,0,0]
[null,"Other",0,0,0,0,0,0,0]
[null,"Total",{"$f":"SUM(C94:C96)","v":0},{"$f":"SUM(D94:D96)","v":0},0,0,0,0,0]
[null,"D. TOTAL OVERHEAD EXPENDITURE"]
[null,"Residential",665154.93979877396,599397.39671851532,378967.0546238487,366866.01616210729,548072.73684415384,624083.78732168884,693541.63440266822]
[null,"Industrial and Commercial",255534.32720077693,222612.82449489922,159976.80784600478,123301.90021738822,202129.87897881819,299065.49591323663,361533.13793498959]
[null,"Other",661458.29426375858,477991.54869381967,348318.0744155139,247791.66945032065,262695.34379703953,225940.91875183341,202679.08798288251]
[null,"Total",{"$f":"SUM(C99:C101)","v":1582147.5612633093},{"$f":"SUM(D99:D101)","v":1300001.7699072342},887261.93688536738,737959.58582981618,1012897.9596200115,1149090.201986759,1257753.8603205404]
[null,"E. RELATED PARTY MARGIN EXPENDITURE"]
[null,"Residential",0,0,0,0,0,0,0]
[null,"Industrial and Commercial",0,0,0,0,0,0,0]
[null,"Other",0,0,0,0,0,0,0]
[null,"Total",{"$f":"SUM(C104:C106)","v":0},{"$f":"SUM(D104:D106)","v":0},0,0,0,0,0]
[null,"F. CUSTOMER CONTRIBUTIONS included in the above"]
[null,"Residential",0,0,0,0,0,0,0]
[null,"Industrial and Commercial",0,0,0,0,0,0,0]
[null,"Other",0,0,0,0,0,0,0]
[null,"Total",{"$f":"SUM(C109:C111)","v":0},{"$f":"SUM(D109:D111)","v":0},0,0,0,0,0]
[null,"TOTAL"]
[]
[null,"E4.1.4 - OTHER METER REPLACEMENT CAPEX"]
[null,null,"EXPENDITURE"]
[null,null,{"$f":"CONCATENATE(\"$0's, real \",dms_DollarReal)","v":"$0's, real June 2020"}]
[null,null,{"$f":"CRCP_y4","v":"2018-19"},{"$f":"CRCP_y5","v":"2019-20"},{"$f":"FRCP_y1","v":"2020-21"},{"$f":"FRCP_y2","v":"2021-22"},{"$f":"FRCP_y3","v":"2022-23"},{"$f":"FRCP_y4","v":"2023-24"},{"$f":"FRCP_y5","v":"2024-25"}]
[null,"A. DIRECT INTERNAL LABOUR EXPENDITURE"]
[null,"Residential",0,0,0,0,0,0,0]
[null,"Industrial and Commercial",0,0,0,0,0,0,0]
[null,"Other",841543.13540920673,858499.37015673786,840816.93650411197,819574.69793036242,784035.97159251024,773894.23851828359,776013.97056061286]
[null,"Total",{"$f":"SUM(C120:C122)","v":841543.13540920673},{"$f":"SUM(D120:D122)","v":858499.37015673786},840816.93650411197,819574.69793036242,784035.97159251024,773894.23851828359,776013.97056061286]
[null,"B. DIRECT CONTRACTOR EXPENDITURE"]
[null,"Residential",0,0,0,0,0,0,0]
[null,"Industrial and Commercial",0,0,0,0,0,0,0]
[null,"Other"]
[null,"Total"]
[null,"C. OTHER INTERNAL DIRECT EXPENDITURE"]
[null,"Residential",0,0,0,0,0,0,0]
[null,"Industrial and Commercial",0,0,0,0,0,0,0]
[null,"Other"]
[null,"Total"]
[null,"D. TOTAL OVERHEAD EXPENDITURE"]
[null,"Residential",0,0,0,0,0,0,0]
[null,"Industrial and Commercial",0,0,0,0,0,0,0]
[null,"Other",1106203.5769790607,1031438.5853735209,723126.76510547171,445656.51758652658,457365.57385425654,441599.04328857496,440009.02870585909]
[null,"Total",{"$f":"SUM(C135:C137)","v":1106203.5769790607},{"$f":"SUM(D135:D137)","v":1031438.5853735209},723126.76510547171,445656.51758652658,457365.57385425654,441599.04328857496,440009.02870585909]
[null,"E. RELATED PARTY MARGIN EXPENDITURE"]
[null,"Residential",0,0,0,0,0,0,0]
[null,"Industrial and Commercial",0,0,0,0,0,0,0]
[null,"Other",0,0,0,0,0,0,0]
[null,"Total",{"$f":"SUM(C140:C142)","v":0},{"$f":"SUM(D140:D142)","v":0},0,0,0,0,0]
[null,"F. CUSTOMER CONTRIBUTIONS included in the above"]
[null,"Residential",0,0,0,0,0,0,0]
[null,"Industrial and Commercial",0,0,0,0,0,0,0]
[null,"Other",0,0,0,0,0,0,0]
[null,"Total",{"$f":"SUM(C145:C147)","v":0},{"$f":"SUM(D145:D147)","v":0},0,0,0,0,0]
[null,"TOTAL"]
[]
[]
[null,"E4.2 - VOLUMES"]
[null,"E4.2.1 - NUMBER OF NEW METERS ACQUIRED"]
[null,null,"VOLUMES"]
[null,null,"0s"]
[null,null,{"$f":"CRCP_y4","v":"2018-19"},{"$f":"CRCP_y5","v":"2019-20"},{"$f":"FRCP_y1","v":"2020-21"},{"$f":"FRCP_y2","v":"2021-22"},{"$f":"FRCP_y3","v":"2022-23"},{"$f":"FRCP_y4","v":"2023-24"},{"$f":"FRCP_y5","v":"2024-25"}]
[null,"Residential"]
[null,"Industrial and commercial"]
[null,"Other meters"]
[null,"Total"]
[]
[]
[null,"E4.2.2 - NUMBER OF METERS REFURBISHED"]
[null,null,"VOLUMES"]
[null,null,"0s"]
[null,null,{"$f":"CRCP_y4","v":"2018-19"},{"$f":"CRCP_y5","v":"2019-20"},{"$f":"FRCP_y1","v":"2020-21"},{"$f":"FRCP_y2","v":"2021-22"},{"$f":"FRCP_y3","v":"2022-23"},{"$f":"FRCP_y4","v":"2023-24"},{"$f":"FRCP_y5","v":"2024-25"}]
[null,"A. REFURBISHABLE METERS REMOVED"]
[null,"Residential",0,0,0,0,0,0,0]
[null,"Industrial and commercial"]
[null,"Other meters",0,0,0,0,0,0,0]
[null,"Total"]
[null,"B. METERS DECOMMISSIONED"]
[null,"Residential",0,0,0,0,0,0,0]
[null,"Industrial and commercial"]
[null,"Other meters",0,0,0,0,0,0,0]
[null,"Total"]
[null,"TOTAL"]
[]
[]
[null,"E4.2.3 - NUMBER OF METERS INSTALLED"]
[null,null,"VOLUMES"]
[null,null,"0s"]
[null,null,{"$f":"CRCP_y4","v":"2018-19"},{"$f":"CRCP_y5","v":"2019-20"},{"$f":"FRCP_y1","v":"2020-21"},{"$f":"FRCP_y2","v":"2021-22"},{"$f":"FRCP_y3","v":"2022-23"},{"$f":"FRCP_y4","v":"2023-24"},{"$f":"FRCP_y5","v":"2024-25"}]
[null,"Residential"]
[null,"Industrial and commercial"]
[null,"Other meters"]
[null,"Total"]
[]
[]
[null,"E4.2.4 - NUMBER OF METERS REMOVED / DECOMMISSIONED"]
[null,null,"VOLUMES"]
[null,null,"0s"]
[null,null,{"$f":"CRCP_y4","v":"2018-19"},{"$f":"CRCP_y5","v":"2019-20"},{"$f":"FRCP_y1","v":"2020-21"},{"$f":"FRCP_y2","v":"2021-22"},{"$f":"FRCP_y3","v":"2022-23"},{"$f":"FRCP_y4","v":"2023-24"},{"$f":"FRCP_y5","v":"2024-25"}]
[null,"Residential"]
[null,"Industrial and commercial"]
[null,"Other meters"]
[null,"Total",{"$f":"SUM(C194:C196)","v":0},{"$f":"SUM(D194:D196)","v":0},0,0,0,0,0]
[]
[]
[null,"E4.2.5 - OTHER METER REPLACEMENT VOLUMES"]
[null,null,"VOLUMES"]
[null,null,"0s"]
[null,null,{"$f":"CRCP_y4","v":"2018-19"},{"$f":"CRCP_y5","v":"2019-20"},{"$f":"FRCP_y1","v":"2020-21"},{"$f":"FRCP_y2","v":"2021-22"},{"$f":"FRCP_y3","v":"2022-23"},{"$f":"FRCP_y4","v":"2023-24"},{"$f":"FRCP_y5","v":"2024-25"}]
[null,"Residential",0,0,0,0,0,0,0]
[null,"Industrial and commercial",0,0,0,0,0,0,0]
[null,"Other meters",0,0,0,0,0,0,0]
[null,"Total",{"$f":"SUM(C204:C206)","v":0},{"$f":"SUM(D204:D206)","v":0},0,0,0,0,0]

{"sheet":"E5. New Connections","index":9,"n_rows":283,"n_cols":10,"rows_kept":283,"cut":false,"hidden":false,"merged":[[235,3,235,9],[275,3,275,9],[263,3,263,9],[264,3,264,9],[274,3,274,9],[236,3,236,9],[224,3,224,9],[225,3,225,9],[195,3,195,9],[196,3,196,9],[8,3,8,9],[9,3,9,9],[39,3,39,9],[40,3,40,9],[70,3,70,9],[71,3,71,9],[101,3,101,9],[102,3,102,9],[132,3,132,9],[133,3,133,9],[163,3,163,9],[164,3,164,9]]}
[null,{"$f":"IF(dms_MultiYear_ResponseFlag=\"Yes\",\"REGULATORY REPORTING STATEMENT - HISTORICAL INFORMATION\",INDEX(dms_Worksheet_List,MATCH(dms_Model,dms_Model_List)))","v":"REGULATORY REPORTING STATEMENT"}]
[null,{"$f":"INDEX(dms_TradingNameFull_List,MATCH(dms_TradingName,dms_TradingName_List))","v":"Jemena Gas Networks (NSW) Ltd"}]
[null,{"$f":"IF(SUM(dms_SingleYear_Model)>0,CONCATENATE(CRY),CONCATENATE(FRCP_y1,\" to \",dms_MultiYear_FinalYear_Result))","v":"2020-21 to 2024-25"}]
[null,"E5. NEW CONNECTIONS"]
[]
[null,"E5.1 - EXPENDITURE"]
[null,"E5.1.1 - CAPEX - BY CONNECTION TYPE"]
[null,"A. DIRECT INTERNAL LABOUR EXPENDITURE"]
[null,null,null,"EXPENDITURE"]
[null,null,null,"$0's, nominal"]
[null,null,null,{"$f":"CRCP_y4","v":"2018-19"},{"$f":"CRCP_y5","v":"2019-20"},{"$f":"FRCP_y1","v":"2020-21"},{"$f":"FRCP_y2","v":"2021-22"},{"$f":"FRCP_y3","v":"2022-23"},{"$f":"FRCP_y4","v":"2023-24"},{"$f":"FRCP_y5","v":"2024-25"}]
[null,"(i)  ELECTRICITY TO GAS"]
[null,"Distribution Mains",null,233534.61187254891,233655.90858178193,233759.08185882267,233906.77396643566,234075.41202528577,234238.34255915417,234387.45420552272]
[null,"Inlet service pipes",null,648985.26616211992,649299.62172325305,649566.99879021489,649949.73653672531,650386.73621284729,650808.92520690314,651195.28829353687]
[null,"Meters",null,40951.608299851119,40964.162466868693,40974.838593441746,40990.118659210311,41007.561256242698,41024.408536603223,41039.822527003314]
[null,null,"Total",{"$f":"SUM(D13:D15)","v":923471.48633451993},{"$f":"SUM(E13:E15)","v":923919.69277190359},924300.91924247937,924846.62916237128,925469.70949437574,926071.67630266049,926622.56502606289]
[null,"(ii)  NEW HOMES"]
[null,"Distribution Mains",null,801741.4292738596,744477.6834508063,627746.60887273739,588448.00840591465,576083.73570751178,591173.22560752556,629310.65913506737]
[null,"Inlet service pipes",null,968404.86509373912,899103.36709423503,758031.60239305196,710448.07144798525,695376.58573543769,713448.30863030965,759335.24133640632]
[null,"Meters",null,65408.186567858851,60720.259609672656,51187.959910257654,47967.891632190665,46942.623507410317,48154.98618644369,51244.778205052571]
[null,null,"Total",{"$f":"SUM(D18:D20)","v":1835554.4809354576},{"$f":"SUM(E18:E20)","v":1704301.3101547142},{"$f":"SUM(F18:F20)","v":1436966.1711760471},{"$f":"SUM(G18:G20)","v":1346863.9714860904},{"$f":"SUM(H18:H20)","v":1318402.9449503599},{"$f":"SUM(I18:I20)","v":1352776.5204242787},{"$f":"SUM(J18:J20)","v":1439890.6786765261}]
[null,"(iii)  NEW MEDIUM DENSITY / HIGH RISE"]
[null,"Distribution Mains",null,210372.99937517935,180592.7948227241,135805.06677716918,120476.59308116249,119429.61335195808,122432.76582159262,127768.32501621077]
[null,"Inlet service pipes",null,136443.39329919757,117112.29938753067,88057.568717171685,78105.191023247666,77411.482905983547,79343.262798728887,82786.885908362761]
[null,"Meters",null,106759.48879127158,85920.64620320515,38802.989627424358,34207.31420471544,33876.907921120153,34755.883823247328,36331.186097534934]
[null,null,"Total",{"$f":"SUM(D23:D25)","v":453575.88146564853},{"$f":"SUM(E23:E25)","v":383625.74041345995},{"$f":"SUM(F23:F25)","v":262665.62512176519},{"$f":"SUM(G23:G25)","v":232789.09830912558},{"$f":"SUM(H23:H25)","v":230718.00417906177},{"$f":"SUM(I23:I25)","v":236531.91244356884},{"$f":"SUM(J23:J25)","v":246886.39702210846}]
[null,"(iv)  INDUSTRIAL & COMMERCIAL TARIFF"]
[null,"Distribution Mains",null,95885.337061878105,95927.411535913241,95963.196609676801,96014.419282348914,96072.900713017531,96129.396533621053,96181.095103393265]
[null,"Inlet service pipes",null,136224.76247192139,136298.10075361902,136360.48244843836,136449.78301877202,136551.75070222805,136650.2698995453,136740.43552114069]
[null,"Meters",null,35596.289580182791,35601.899040928947,35606.66864402873,35613.494211399353,35621.284364646534,35628.807084305947,35635.688431651157]
[null,null,"Total",{"$f":"SUM(D28:D30)","v":267706.38911398232},{"$f":"SUM(E28:E30)","v":267827.41133046121},{"$f":"SUM(F28:F30)","v":267930.34770214389},{"$f":"SUM(G28:G30)","v":268077.69651252031},{"$f":"SUM(H28:H30)","v":268245.93577989214},{"$f":"SUM(I28:I30)","v":268408.47351747233},{"$f":"SUM(J28:J30)","v":268557.2190561851}]
[null,"(v)  INDUSTRIAL & COMMERCIAL CONTRACT"]
[null,"Distribution Mains",null,149655.70346465646,149823.46601656868,149966.24828761703,150170.74499057763,150404.41453880043,150630.36397178296,150837.31619335248]
[null,"Inlet service pipes",null,156477.8758128116,156659.53474127344,156814.1503494764,157035.60259479651,157288.65878426292,157533.36789377301,157757.51450651084]
[null,"Meters",null,65075.110651563395,65137.042897337677,65189.744357297124,65265.213987817042,65351.432140262557,65434.782205479321,65511.107131288918]
[null,null,"Total",{"$f":"SUM(D33:D35)","v":371208.68992903142},{"$f":"SUM(E33:E35)","v":371620.04365517979},{"$f":"SUM(F33:F35)","v":371970.14299439057},{"$f":"SUM(G33:G35)","v":372471.5615731912},{"$f":"SUM(H33:H35)","v":373044.50546332588},{"$f":"SUM(I33:I35)","v":373598.51407103532},{"$f":"SUM(J33:J35)","v":374105.93783115223}]
[null,null,"TOTAL",{"$f":"SUM(D36,D31,D26,D21,D16)","v":3851516.9277786398},{"$f":"SUM(E36,E31,E26,E21,E16)","v":3651294.1983257188},3263833.2062368263,3145048.9570432985,3115881.0998670151,3157387.0967590157,3256062.7976120347]
[]
[null,"B. DIRECT CONTRACTOR EXPENDITURE"]
[null,null,null,"EXPENDITURE"]
[null,null,null,"$0's, nominal"]
[null,null,null,{"$f":"CRCP_y4","v":"2018-19"},{"$f":"CRCP_y5","v":"2019-20"},{"$f":"FRCP_y1","v":"2020-21"},{"$f":"FRCP_y2","v":"2021-22"},{"$f":"FRCP_y3","v":"2022-23"},{"$f":"FRCP_y4","v":"2023-24"},{"$f":"FRCP_y5","v":"2024-25"}]
[null,"(i)  ELECTRICITY TO GAS"]
[null,"Distribution Mains"]
[null,"Inlet service pipes"]
[null,"Meters"]
[null,null,"Total"]
[null,"(ii)  NEW HOMES"]
[null,"Distribution Mains"]
[null,"Inlet service pipes"]
[null,"Meters"]
[null,null,"Total"]
[null,"(iii)  NEW MEDIUM DENSITY / HIGH RISE"]
[null,"Distribution Mains"]
[null,"Inlet service pipes"]
[null,"Meters"]
[null,null,"Total"]
[null,"(iv)  INDUSTRIAL & COMMERCIAL TARIFF"]
[null,"Distribution Mains"]
[null,"Inlet service pipes"]
[null,"Meters"]
[null,null,"Total"]
[null,"(v)  INDUSTRIAL & COMMERCIAL CONTRACT"]
[null,"Distribution Mains"]
[null,"Inlet service pipes"]
[null,"Meters"]
[null,null,"Total"]
[null,null,"TOTAL"]
[]
[null,"C. OTHER INTERNAL DIRECT EXPENDITURE"]
[null,null,null,"EXPENDITURE"]
[null,null,null,"$0's, nominal"]
[null,null,null,{"$f":"CRCP_y4","v":"2018-19"},{"$f":"CRCP_y5","v":"2019-20"},{"$f":"FRCP_y1","v":"2020-21"},{"$f":"FRCP_y2","v":"2021-22"},{"$f":"FRCP_y3","v":"2022-23"},{"$f":"FRCP_y4","v":"2023-24"},{"$f":"FRCP_y5","v":"2024-25"}]
[null,"(i)  ELECTRICITY TO GAS"]
[null,"Distribution Mains",null,340661.68248032435,340838.62045416608,340989.12140930025,341204.56288696855,341450.55864921317,341688.22872882138,341905.74091650965]
[null,"Inlet service pipes",null,620155.38929208938,620455.78023400344,620711.27960771043,621077.01499271765,621494.60182927037,621898.03591878654,622267.23559540848]
[null,"Meters",null,677140.00341972732,677347.58815327345,677524.11925142352,677776.77706429933,678065.19260411581,678343.76450774923,678598.63678128261]
[null,null,"Total",{"$f":"SUM(D75:D77)","v":1637957.0751921411},{"$f":"SUM(E75:E77)","v":1638641.9888414429},{"$f":"SUM(F75:F77)","v":1639224.5202684342},{"$f":"SUM(G75:G77)","v":1640058.3549439856},{"$f":"SUM(H75:H77)","v":1641010.3530825994},{"$f":"SUM(I75:I77)","v":1641930.0291553573},{"$f":"SUM(J75:J77)","v":1642771.6132932007}]
[null,"(ii)  NEW HOMES"]
[null,"Distribution Mains",null,677514.82031028683,629123.86152356374,530479.79732818285,497270.35690068762,486821.87851394276,499573.31266078615,531801.50429472746]
[null,"Inlet service pipes",null,1067939.408119302,991514.96683130064,835943.57068518165,783469.31151385652,766848.74906988477,786777.91893230344,837381.20018473233]
[null,"Meters",null,3819888.4858440277,3546109.9399203458,2989416.293817908,2801361.8256473443,2741485.3772965223,2812288.2917528339,2992734.5260065836]
[null,null,"Total",{"$f":"SUM(D80:D82)","v":5565342.7142736167},{"$f":"SUM(E80:E82)","v":5166748.7682752106},{"$f":"SUM(F80:F82)","v":4355839.6618312728},{"$f":"SUM(G80:G82)","v":4082101.4940618882},{"$f":"SUM(H80:H82)","v":3995156.0048803501},{"$f":"SUM(I80:I82)","v":4098639.5233459235},{"$f":"SUM(J80:J82)","v":4361917.2304860428}]
[null,"(iii)  NEW MEDIUM DENSITY / HIGH RISE"]
[null,"Distribution Mains",null,228503.64750125218,196156.8853987944,147509.20127535891,130859.66849041263,129722.45654927172,132984.43073489459,138779.82625166801]
[null,"Inlet service pipes",null,344125.20740195463,295370.06770038168,222090.84929205422,196989.86085097937,195240.25287101325,200112.41370028973,208797.60899016599]
[null,"Meters",null,6435808.6466204375,5179575.548913762,2339170.2132177884,2062127.9759665623,2042210.0123182186,2095197.5338502957,2190161.8701606994]
[null,null,"Total",{"$f":"SUM(D85:D87)","v":7008437.5015236447},{"$f":"SUM(E85:E87)","v":5671102.5020129383},{"$f":"SUM(F85:F87)","v":2708770.2637852016},{"$f":"SUM(G85:G87)","v":2389977.5053079543},{"$f":"SUM(H85:H87)","v":2367172.7217385033},{"$f":"SUM(I85:I87)","v":2428294.3782854802},{"$f":"SUM(J85:J87)","v":2537739.3054025332}]
[null,"(iv)  INDUSTRIAL & COMMERCIAL TARIFF"]
[null,"Distribution Mains",null,187429.74424074442,187511.98838931933,187581.93847166415,187682.06485941482,187796.38014399249,187906.81410116315,188007.87073825634]
[null,"Inlet service pipes",null,95167.150909703298,95218.385319623572,95261.965415174112,95324.35114225524,95395.58616401843,95464.412059901544,95527.402115171455]
[null,"Meters",null,1543768.2672391389,1544011.5428051702,1544218.3947551802,1544514.4114028965,1544852.2609799663,1545178.512283979,1545476.9480421061]
[null,null,"Total",{"$f":"SUM(D90:D92)","v":1826365.1623895867},{"$f":"SUM(E90:E92)","v":1826741.9165141131},{"$f":"SUM(F90:F92)","v":1827062.2986420183},{"$f":"SUM(G90:G92)","v":1827520.8274045666},{"$f":"SUM(H90:H92)","v":1828044.2272879772},{"$f":"SUM(I90:I92)","v":1828549.7384450436},{"$f":"SUM(J90:J92)","v":1829012.2208955339}]
[null,"(v)  INDUSTRIAL & COMMERCIAL CONTRACT"]
[null,"Distribution Mains",null,202862.27384067792,203089.68042765281,203283.22558161913,203560.42628426597,203877.17155212007,204183.45199908389,204463.98122230789]
[null,"Inlet service pipes",null,124664.61059906978,124809.33674301124,124932.51770063248,125108.94684619518,125310.55458885941,125505.51228296573,125684.08800844074]
[null,"Meters",null,489060.14013281016,489525.58064445661,489921.6488667755,490488.82712753135,491136.78394688678,491763.18617912038,492336.7922558267]
[null,null,"Total",{"$f":"SUM(D95:D97)","v":816587.02457255789},{"$f":"SUM(E95:E97)","v":817424.59781512059},{"$f":"SUM(F95:F97)","v":818137.3921490272},{"$f":"SUM(G95:G97)","v":819158.20025799249},{"$f":"SUM(H95:H97)","v":820324.51008786622},{"$f":"SUM(I95:I97)","v":821452.15046117001},{"$f":"SUM(J95:J97)","v":822484.86148657533}]
[null,null,"TOTAL",{"$f":"SUM(D98,D93,D88,D83,D78)","v":16854689.477951549},{"$f":"SUM(E98,E93,E88,E83,E78)","v":15120659.773458825},{"$f":"SUM(F98,F93,F88,F83,F78)","v":11349034.136675954},{"$f":"SUM(G98,G93,G88,G83,G78)","v":10758816.381976387},{"$f":"SUM(H98,H93,H88,H83,H78)","v":10651707.817077296},{"$f":"SUM(I98,I93,I88,I83,I78)","v":10818865.819692973},{"$f":"SUM(J98,J93,J88,J83,J78)","v":11193925.231563885}]
[]
[null,"D. TOTAL OVERHEAD EXPENDITURE"]
[null,null,null,"EXPENDITURE"]
[null,null,null,"$0's, nominal"]
[null,null,null,{"$f":"CRCP_y4","v":"2018-19"},{"$f":"CRCP_y5","v":"2019-20"},{"$f":"FRCP_y1","v":"2020-21"},{"$f":"FRCP_y2","v":"2021-22"},{"$f":"FRCP_y3","v":"2022-23"},{"$f":"FRCP_y4","v":"2023-24"},{"$f":"FRCP_y5","v":"2024-25"}]
[null,"(i)  ELECTRICITY TO GAS"]
[null,"Distribution Mains",null,888348.29469730437,850859.30256953929,630615.60928030044,432990.26653272309,480126.23223381391,467474.52486118971,465052.45534519997]
[null,"Inlet service pipes",null,2647148.5086702751,2535348.0413908227,1879020.9762539011,1290109.4569086297,1430483.2152485447,1392723.5361792173,1385448.1641354547]
[null,"Meters",null,263926.98880690674,252735.28949499805,187281.24952896553,128556.88277836949,142509.69276097906,138714.9003063897,137960.21958354337]
[null,null,"Total",{"$f":"SUM(D106:D108)","v":3799423.792174486},{"$f":"SUM(E106:E108)","v":3638942.6334553603},{"$f":"SUM(F106:F108)","v":2696917.8350631669},{"$f":"SUM(G106:G108)","v":1851656.6062197224},{"$f":"SUM(H106:H108)","v":2053119.1402433377},{"$f":"SUM(I106:I108)","v":1998912.9613467967},{"$f":"SUM(J106:J108)","v":1988460.8390641981}]
[null,"(ii)  NEW HOMES"]
[null,"Distribution Mains",null,4166547.3681359855,3703758.3877296415,2313612.2729088385,1488172.9707115239,1614340.8368481204,1611850.2818685807,1705857.1022899658]
[null,"Inlet service pipes",null,8276868.9349305704,7356440.1538662612,4594736.7479281006,2954913.503035679,3204769.5096198134,3199186.611996219,3385152.4702204289]
[null,"Meters",null,1139932.2741745042,1013046.8430767138,632672.51630086661,406818.68212956196,441145.56753865368,440307.56702850753,465835.00634642917]
[null,null,"Total",{"$f":"SUM(D111:D113)","v":13583348.577241059},{"$f":"SUM(E111:E113)","v":12073245.384672616},{"$f":"SUM(F111:F113)","v":7541021.5371378055},{"$f":"SUM(G111:G113)","v":4849905.155876765},{"$f":"SUM(H111:H113)","v":5260255.9140065871},{"$f":"SUM(I111:I113)","v":5251344.4608933069},{"$f":"SUM(J111:J113)","v":5556844.578856824}]
[null,"(iii)  NEW MEDIUM DENSITY / HIGH RISE"]
[null,"Distribution Mains",null,903599.71443479578,742566.70373730047,413681.65860962606,251821.07944876046,276608.63503024483,275899.99464397342,286249.57472897915]
[null,"Inlet service pipes",null,840326.93183184927,690473.8661895101,384615.39859360619,234087.91165896883,257080.28877955966,256373.87767281674,265945.64330494456]
[null,"Meters",null,1964594.039797812,1513605.9904467806,506402.37145566155,306329.3650966374,336153.56505276158,335554.15348601958,348723.70939229656]
[null,null,"Total",{"$f":"SUM(D116:D118)","v":3708520.6860644571},{"$f":"SUM(E116:E118)","v":2946646.5603735913},{"$f":"SUM(F116:F118)","v":1304699.4286588938},{"$f":"SUM(G116:G118)","v":792238.35620436666},{"$f":"SUM(H116:H118)","v":869842.48886256607},{"$f":"SUM(I116:I118)","v":867828.02580280975},{"$f":"SUM(J116:J118)","v":900918.92742622038}]
[null,"(iv)  INDUSTRIAL & COMMERCIAL TARIFF"]
[null,"Distribution Mains",null,431733.23556109518,413480.44580463861,306430.64559449255,210379.32645990339,233255.45445404496,227084.47543259754,225885.60920108174]
[null,"Inlet service pipes",null,499932.26694610022,478843.81217656989,354901.50781236682,243686.39074114375,270221.56354343897,263107.69389096956,261750.56648778432]
[null,"Meters",null,446291.00001842511,427302.59336026642,316598.56878615683,217285.7781044773,240818.91384449563,234359.53345448241,233041.95422540212]
[null,null,"Total",{"$f":"SUM(D121:D123)","v":1377956.5025256204},{"$f":"SUM(E121:E123)","v":1319626.8513414748},{"$f":"SUM(F121:F123)","v":977930.7221930162},{"$f":"SUM(G121:G123)","v":671351.49530552444},{"$f":"SUM(H121:H123)","v":744295.93184197962},{"$f":"SUM(I121:I123)","v":724551.70277804951},{"$f":"SUM(J121:J123)","v":720678.12991426815}]
[null,"(v)  INDUSTRIAL & COMMERCIAL CONTRACT"]
[null,"Distribution Mains",null,263767.51116482337,252788.22195891821,187450.13698475977,128800.24272391375,142940.80824190131,139286.33134561361,138666.76628695079]
[null,"Inlet service pipes",null,266304.75165094133,255230.03067176393,189267.23146336814,130055.10870526392,144341.43014840316,140658.66037908991,140039.8353693166]
[null,"Meters",null,135096.09063078344,129450.83961103462,95977.923784044935,65934.535374241605,73156.108778808804,71269.624910906976,70937.906594261018]
[null,null,"Total",{"$f":"SUM(D126:D128)","v":665168.35344654811},{"$f":"SUM(E126:E128)","v":637469.0922417168},{"$f":"SUM(F126:F128)","v":472695.2922321728},{"$f":"SUM(G126:G128)","v":324789.88680341927},{"$f":"SUM(H126:H128)","v":360438.34716911329},{"$f":"SUM(I126:I128)","v":351214.61663561047},{"$f":"SUM(J126:J128)","v":349644.50825052842}]
[null,null,"TOTAL",{"$f":"SUM(D129,D124,D119,D114,D109)","v":23134417.91145217},{"$f":"SUM(E129,E124,E119,E114,E109)","v":20615930.522084758},{"$f":"SUM(F129,F124,F119,F114,F109)","v":12993264.815285055},{"$f":"SUM(G129,G124,G119,G114,G109)","v":8489941.5004097968},{"$f":"SUM(H129,H124,H119,H114,H109)","v":9287951.8221235834},{"$f":"SUM(I129,I124,I119,I114,I109)","v":9193851.7674565725},{"$f":"SUM(J129,J124,J119,J114,J109)","v":9516546.9835120384}]
[]
[null,"E. RELATED PARTY MARGIN EXPENDITURE"]
[null,null,null,"EXPENDITURE"]
[null,null,null,"$0's, nominal"]
[null,null,null,{"$f":"CRCP_y4","v":"2018-19"},{"$f":"CRCP_y5","v":"2019-20"},{"$f":"FRCP_y1","v":"2020-21"},{"$f":"FRCP_y2","v":"2021-22"},{"$f":"FRCP_y3","v":"2022-23"},{"$f":"FRCP_y4","v":"2023-24"},{"$f":"FRCP_y5","v":"2024-25"}]
[null,"(i)  ELECTRICITY TO GAS"]
[null,"Distribution Mains",null,0,0,0,0,0,0,0]
[null,"Inlet service pipes",null,0,0,0,0,0,0,0]
[null,"Meters",null,0,0,0,0,0,0,0]
[null,null,"Total",{"$f":"SUM(D137:D139)","v":0},{"$f":"SUM(E137:E139)","v":0},{"$f":"SUM(F137:F139)","v":0},{"$f":"SUM(G137:G139)","v":0},{"$f":"SUM(H137:H139)","v":0},{"$f":"SUM(I137:I139)","v":0},{"$f":"SUM(J137:J139)","v":0}]
[null,"(ii)  NEW HOMES"]
[null,"Distribution Mains",null,0,0,0,0,0,0,0]
[null,"Inlet service pipes",null,0,0,0,0,0,0,0]
[null,"Meters",null,0,0,0,0,0,0,0]
[null,null,"Total",{"$f":"SUM(D142:D144)","v":0},{"$f":"SUM(E142:E144)","v":0},{"$f":"SUM(F142:F144)","v":0},{"$f":"SUM(G142:G144)","v":0},{"$f":"SUM(H142:H144)","v":0},{"$f":"SUM(I142:I144)","v":0},{"$f":"SUM(J142:J144)","v":0}]
[null,"(iii)  NEW MEDIUM DENSITY / HIGH RISE"]
[null,"Distribution Mains",null,0,0,0,0,0,0,0]
[null,"Inlet service pipes",null,0,0,0,0,0,0,0]
[null,"Meters",null,0,0,0,0,0,0,0]
[null,null,"Total",{"$f":"SUM(D147:D149)","v":0},{"$f":"SUM(E147:E149)","v":0},{"$f":"SUM(F147:F149)","v":0},{"$f":"SUM(G147:G149)","v":0},{"$f":"SUM(H147:H149)","v":0},{"$f":"SUM(I147:I149)","v":0},{"$f":"SUM(J147:J149)","v":0}]
[null,"(iv)  INDUSTRIAL & COMMERCIAL TARIFF"]
[null,"Distribution Mains",null,0,0,0,0,0,0,0]
[null,"Inlet service pipes",null,0,0,0,0,0,0,0]
[null,"Meters",null,0,0,0,0,0,0,0]
[null,null,"Total",{"$f":"SUM(D152:D154)","v":0},{"$f":"SUM(E152:E154)","v":0},{"$f":"SUM(F152:F154)","v":0},{"$f":"SUM(G152:G154)","v":0},{"$f":"SUM(H152:H154)","v":0},{"$f":"SUM(I152:I154)","v":0},{"$f":"SUM(J152:J154)","v":0}]
[null,"(v)  INDUSTRIAL & COMMERCIAL CONTRACT"]
[null,"Distribution Mains",null,0,0,0,0,0,0,0]
[null,"Inlet service pipes",null,0,0,0,0,0,0,0]
[null,"Meters",null,0,0,0,0,0,0,0]
[null,null,"Total",{"$f":"SUM(D157:D159)","v":0},{"$f":"SUM(E157:E159)","v":0},{"$f":"SUM(F157:F159)","v":0},{"$f":"SUM(G157:G159)","v":0},{"$f":"SUM(H157:H159)","v":0},{"$f":"SUM(I157:I159)","v":0},{"$f":"SUM(J157:J159)","v":0}]
[null,null,"TOTAL",{"$f":"SUM(D160,D155,D150,D145,D140)","v":0},{"$f":"SUM(E160,E155,E150,E145,E140)","v":0},{"$f":"SUM(F160,F155,F150,F145,F140)","v":0},{"$f":"SUM(G160,G155,G150,G145,G140)","v":0},{"$f":"SUM(H160,H155,H150,H145,H140)","v":0},{"$f":"SUM(I160,I155,I150,I145,I140)","v":0},{"$f":"SUM(J160,J155,J150,J145,J140)","v":0}]
[]
[null,"F. CUSTOMER CONTRIBUTIONS included in the above"]
[null,null,null,"EXPENDITURE"]
[null,null,null,"$0's, nominal"]
[null,null,null,{"$f":"CRCP_y4","v":"2018-19"},{"$f":"CRCP_y5","v":"2019-20"},{"$f":"FRCP_y1","v":"2020-21"},{"$f":"FRCP_y2","v":"2021-22"},{"$f":"FRCP_y3","v":"2022-23"},{"$f":"FRCP_y4","v":"2023-24"},{"$f":"FRCP_y5","v":"2024-25"}]
[null,"(i)  ELECTRICITY TO GAS"]
[null,"Distribution Mains"]
[null,"Inlet service pipes"]
[null,"Meters"]
[null,null,"Total"]
[null,"(ii)  NEW HOMES"]
[null,"Distribution Mains"]
[null,"Inlet service pipes"]
[null,"Meters"]
[null,null,"Total"]
[null,"(iii)  NEW MEDIUM DENSITY / HIGH RISE"]
[null,"Distribution Mains"]
[null,"Inlet service pipes"]
[null,"Meters"]
[null,null,"Total"]
[null,"(iv)  INDUSTRIAL & COMMERCIAL TARIFF"]
[null,"Distribution Mains"]
[null,"Inlet service pipes"]
[null,"Meters"]
[null,null,"Total"]
[null,"(v)  INDUSTRIAL & COMMERCIAL CONTRACT"]
[null,"Distribution Mains"]
[null,"Inlet service pipes"]
[null,"Meters"]
[null,null,"Total"]
[null,null,"TOTAL"]
[]
[]
[null,"E5.1.2 - UNIT RATES - PER CONNECTION - BY CONNECTION TYPE"]
[null,null,null,"RATES PER CONNECTION"]
[null,null,null,"$0's"]
[null,null,"Units",{"$f":"CRCP_y4","v":"2018-19"},{"$f":"CRCP_y5","v":"2019-20"},{"$f":"FRCP_y1","v":"2020-21"},{"$f":"FRCP_y2","v":"2021-22"},{"$f":"FRCP_y3","v":"2022-23"},{"$f":"FRCP_y4","v":"2023-24"},{"$f":"FRCP_y5","v":"2024-25"}]
[null,"A. ELECTRICITY TO GAS"]
[null,"Distribution mains","per metre per connection"]
[null,"Inlet service pipes","per service per connection"]
[null,"Meters","number per connection"]
[null,"B. NEW HOMES"]
[null,"Distribution mains","per metre per connection"]
[null,"Inlet service pipes","per service per connection"]
[null,"Meters","number per connection"]
[null,"C. NEW MEDIUM DENSITY / HIGH RISE"]
[null,"Distribution mains","per metre per connection"]
[null,"Inlet service pipes","per service per connection"]
[null,"Meters","number per connection"]
[null,"D. INDUSTRIAL & COMMERCIAL TARIFF"]
[null,"Distribution mains","per metre per connection"]
[null,"Inlet service pipes","per service per connection"]
[null,"Meters","number per connection"]
[null,"E. INDUSTRIAL & COMMERCIAL CONTRACT"]
[null,"Distribution mains","per metre per connection"]
[null,"Inlet service pipes","per service per connection"]
[null,"Meters","number per connection"]
[]
[]
[]
[]
[null,"E5.2 - VOLUMES"]
[null,"E5.2.1 - NUMBER OF NEW CONNECTIONS"]
[null,null,null,"VOLUMES"]
[null,null,null,"0s"]
[null,null,null,{"$f":"CRCP_y4","v":"2018-19"},{"$f":"CRCP_y5","v":"2019-20"},{"$f":"FRCP_y1","v":"2020-21"},{"$f":"FRCP_y2","v":"2021-22"},{"$f":"FRCP_y3","v":"2022-23"},{"$f":"FRCP_y4","v":"2023-24"},{"$f":"FRCP_y5","v":"2024-25"}]
[null,"Electricity to gas",null,4000.0000000000027,3999.999999999995,4000.0000000000055,4000.0000000000045,3999.9999999999809,4000.0000000000114,3999.9999999999864]
[null,"New homes",null,24200.80119562296,22463.737926213518,18935.395082741066,17741.784242005873,17359.838688208783,17805.477084323986,18945.306321716456]
[null,"New medium density / high rise",null,14751.626103579805,11384.128471100199,7354.9668148490955,6513.8525391959211,6452.524324358792,6612.2819881804999,6899.3229421500009]
[null,"Industrial and commericla tariff",null,827.60000000000014,827.60000000000082,827.59999999999695,827.59999999999718,827.59999999999923,827.59999999999718,827.59999999999786]
[null,"Industrial and commericla contract",null,29,29,29,7,7,7,7]
[null,null,"Total",{"$f":"SUM(D228:D232)","v":43809.027299202768},{"$f":"SUM(E228:E232)","v":38704.466397313714},31146.961897590169,29090.236781201798,28646.963012567554,29252.359072504496,30679.22926386644]
[]
[null,"E5.2.2 - VOLUMES - PER CONNECTION - BY CONNECTION TYPE"]
[null,null,null,"VOLUMES"]
[null,null,null,"0s"]
[null,null,"Units",{"$f":"CRCP_y4","v":"2018-19"},{"$f":"CRCP_y5","v":"2019-20"},{"$f":"FRCP_y1","v":"2020-21"},{"$f":"FRCP_y2","v":"2021-22"},{"$f":"FRCP_y3","v":"2022-23"},{"$f":"FRCP_y4","v":"2023-24"},{"$f":"FRCP_y5","v":"2024-25"}]
[null,"A. ELECTRICITY TO GAS"]
[null,"Distribution mains","metres per connection"]
[null,"Inlet service pipes","number per connection"]
[null,"Meters","number per connection"]
[null,"B. NEW HOMES"]
[null,"Distribution mains","metres per connection"]
[null,"Inlet service pipes","number per connection"]
[null,"Meters","number per connection"]
[null,"C. NEW MEDIUM DENSITY / HIGH RISE"]
[null,"Distribution mains","metres per connection"]
[null,"Inlet service pipes","number per connection"]
[null,"Meters","number per connection"]
[null,"D. INDUSTRIAL & COMMERCIAL TARIFF"]
[null,"Distribution mains","metres per connection"]
[null,"Inlet service pipes","number per connection"]
[null,"Meters","number per connection"]
[null,"E. INDUSTRIAL & COMMERCIAL CONTRACT"]
[null,"Distribution mains","metres per connection"]
[null,"Inlet service pipes","number per connection"]
[null,"Meters","number per connection"]
[]
[]
[]
[null,"E5.3 -  CUSTOMER CONTRIBUTIONS"]
[null,"E5.3.1 - VALUE OF CUSTOMER CONTRIBUTIONS - BY CONNECTION TYPE"]
[null,null,null,"VALUE"]
[null,null,null,"$0's, nominal"]
[null,null,null,{"$f":"CRCP_y4","v":"2018-19"},{"$f":"CRCP_y5","v":"2019-20"},{"$f":"FRCP_y1","v":"2020-21"},{"$f":"FRCP_y2","v":"2021-22"},{"$f":"FRCP_y3","v":"2022-23"},{"$f":"FRCP_y4","v":"2023-24"},{"$f":"FRCP_y5","v":"2024-25"}]
[null,"Electricity to gas",null,407735.8420930077,404685.52891068457,385980.53517328692,369269.27585198689,373519.99111194169,372649.82658146229,372636.5874071343]
[null,"New homes",null,364424.8689756252,402798.41038813017,539632.22216400213,483599.64770079928,478494.08827132359,489494.20022593567,520674.97632780601]
[null,"New medium density / high rise",null,547223.26868446986,491543.28959508636,420136.75708813523,355484.85988651001,356059.7106936574,364018.30971926288,379871.47300840978]
[null,"Industrial & commercial tariff",null,443626.94370816625,476954.52176626236,552844.34827700001,528846.67963785399,534862.85689325188,533548.02478248766,533466.17796734755]
[null,"Industrial & commercial contract",null,321221.97233732947,319017.20976263908,309168.44788667822,296006.6198926738,299672.49827635166,299223.58457036753,299441.06791963644]
[null,null,"Total",{"$f":"SUM(D267:D271)","v":2084232.8957985984},2094998.9604228027,2207762.3105891026,2033207.0829698241,2042609.1452465262,2058933.945879516,2106090.2826303341]
[]
[null,"E5.3.2 - NUMBER OF CUSTOMER CONTRIBUTIONS - BY CONNECTION TYPE"]
[null,null,null,"VOLUMES"]
[null,null,null,"0's"]
[null,null,null,{"$f":"CRCP_y4","v":"2018-19"},{"$f":"CRCP_y5","v":"2019-20"},{"$f":"FRCP_y1","v":"2020-21"},{"$f":"FRCP_y2","v":"2021-22"},{"$f":"FRCP_y3","v":"2022-23"},{"$f":"FRCP_y4","v":"2023-24"},{"$f":"FRCP_y5","v":"2024-25"}]
[null,"Electricity to gas",null,80,80,80,80,80,80,80]
[null,"New homes",null,242,225,189,177,174,178,189]
[null,"New medium density / high rise",null,123,115,144,129,128,131,136]
[null,"Industrial & commercial tariff",null,54,54,65,65,65,65,65]
[null,"Industrial & commercial contract",null,2,2,2,1,1,1,1]
[null,null,"Total",{"$f":"SUM(D278:D282)","v":501},{"$f":"SUM(E278:E282)","v":476},480,452,448,455,471]

{"sheet":"E6. Non-network","index":10,"n_rows":142,"n_cols":9,"rows_kept":142,"cut":false,"hidden":false,"merged":[[27,2,27,8],[28,2,28,8]]}
[null,{"$f":"IF(dms_MultiYear_ResponseFlag=\"Yes\",\"REGULATORY REPORTING STATEMENT - HISTORICAL INFORMATION\",INDEX(dms_Worksheet_List,MATCH(dms_Model,dms_Model_List)))","v":"REGULATORY REPORTING STATEMENT"}]
[null,{"$f":"INDEX(dms_TradingNameFull_List,MATCH(dms_TradingName,dms_TradingName_List))","v":"Jemena Gas Networks (NSW) Ltd"}]
[null,{"$f":"IF(SUM(dms_SingleYear_Model)>0,CONCATENATE(CRY),CONCATENATE(FRCP_y1,\" to \",dms_MultiYear_FinalYear_Result))","v":"2020-21 to 2024-25"}]
[null,"E6. NON-NETWORK EXPENDITURE"]
[]
[null,"E6.5 - TELEMETRY"]
[]
[null,"Please list all projects here:"]
[null,"RTU's End of Life Replacement"]
[null,"Scada Security Infrastructure"]
[null,"SCADA/RTS Branch Network Replacement"]
[null,0]
[null,0]
[null,0]
[null,0]
[null,0]
[null,0]
[null,0]
[null,""]
[null,""]
[null,""]
[null,""]
[null,""]
[]
[]
[null,"E6.5.1 - CAPEX - BY PROJECT"]
[null,"A. DIRECT INTERNAL LABOUR EXPENDITURE"]
[null,null,"EXPENDITURE"]
[null,null,{"$f":"CONCATENATE(\"$0's, real \",dms_DollarReal)","v":"$0's, real June 2020"}]
[null,null,{"$f":"CRCP_y4","v":"2018-19"},{"$f":"CRCP_y5","v":"2019-20"},{"$f":"FRCP_y1","v":"2020-21"},{"$f":"FRCP_y2","v":"2021-22"},{"$f":"FRCP_y3","v":"2022-23"},{"$f":"FRCP_y4","v":"2023-24"},{"$f":"FRCP_y5","v":"2024-25"}]
[null,{"$f":"IF(ISBLANK(dms_E65_Projects_01),\"\",dms_E65_Projects_01)","v":"RTU's End of Life Replacement"},14284.29437274396,41394.942021502728,71798.16969741373,82821.03571801084,52600.77938354497,28784.853459514052,34329.829839020524]
[null,{"$f":"IF(ISBLANK(dms_E65_Projects_02),\"\",dms_E65_Projects_02)","v":"Scada Security Infrastructure"},31409.206296632663,50745.582984284571,52854.586107403629,36234.796237406204,37539.461670478449,38727.739522471311,39773.426471002065]
[null,{"$f":"IF(ISBLANK(dms_E65_Projects_03),\"\",dms_E65_Projects_03)","v":"SCADA/RTS Branch Network Replacement"},0,0,21373.135678047147,42203.100800078595,62907.471034136201,37386.535534202929,16871.382673180095]
[null,{"$f":"IF(ISBLANK(dms_E65_Projects_04),\"\",dms_E65_Projects_04)","v":0},0,0,0,0,0,0,0]
[null,{"$f":"IF(ISBLANK(dms_E65_Projects_05),\"\",dms_E65_Projects_05)","v":0},0,0,0,0,0,0,0]
[null,{"$f":"IF(ISBLANK(dms_E65_Projects_06),\"\",dms_E65_Projects_06)","v":0},0,0,0,0,0,0,0]
[null,{"$f":"IF(ISBLANK(dms_E65_Projects_07),\"\",dms_E65_Projects_07)","v":0},0,0,0,0,0,0,0]
[null,{"$f":"IF(ISBLANK(dms_E65_Projects_08),\"\",dms_E65_Projects_08)","v":0},0,0,0,0,0,0,0]
[null,{"$f":"IF(ISBLANK(dms_E65_Projects_09),\"\",dms_E65_Projects_09)","v":0},0,0,0,0,0,0,0]
[null,{"$f":"IF(ISBLANK(dms_E65_Projects_10),\"\",dms_E65_Projects_10)","v":0},0,0,0,0,0,0,0]
[null,{"$f":"IF(ISBLANK(dms_E65_Projects_11),\"\",dms_E65_Projects_11)","v":""},0,0,0,0,0,0,0]
[null,{"$f":"IF(ISBLANK(dms_E65_Projects_12),\"\",dms_E65_Projects_12)","v":""},0,0,0,0,0,0,0]
[null,{"$f":"IF(ISBLANK(dms_E65_Projects_13),\"\",dms_E65_Projects_13)","v":""},0,0,0,0,0,0,0]
[null,{"$f":"IF(ISBLANK(dms_E65_Projects_14),\"\",dms_E65_Projects_14)","v":""},0,0,0,0,0,0,0]
[null,{"$f":"IF(ISBLANK(dms_E65_Projects_15),\"\",dms_E65_Projects_15)","v":""},0,0,0,0,0,0,0]
[null,"Aggregate of other projects with total expenditure of less than $500,000",208758.61641448288,32020.761036286036,0,0,0,0,0]
[null,"Total",{"$f":"SUM(C31:C46)","v":254452.11708385951},{"$f":"SUM(D31:D46)","v":124161.28604207333},146025.89148286451,161258.93275549565,153047.71208815961,104899.1285161883,90974.638983202676]
[]
[null,"B. DIRECT CONTRACTOR EXPENDITURE"]
[null,{"$f":"IF(ISBLANK(dms_E65_Projects_01),\"\",dms_E65_Projects_01)","v":"RTU's End of Life Replacement"},6128.8236570678746,17760.926323979398,30805.74437161738,35535.218595043632,22568.906286418849,12350.437917642317,14729.567157477048]
[null,{"$f":"IF(ISBLANK(dms_E65_Projects_02),\"\",dms_E65_Projects_02)","v":"Scada Security Infrastructure"},13476.443538425112,21772.915159129439,22677.804676000906,15546.912615620442,16106.692760310631,16616.535614316774,17065.19837222459]
[null,{"$f":"IF(ISBLANK(dms_E65_Projects_03),\"\",dms_E65_Projects_03)","v":"SCADA/RTS Branch Network Replacement"},0,0,9170.3640481733964,18107.675173558826,26991.098518383693,16041.078226100401,7238.8405444887303]
[null,{"$f":"IF(ISBLANK(dms_E65_Projects_04),\"\",dms_E65_Projects_04)","v":0},0,0,0,0,0,0,0]
[null,{"$f":"IF(ISBLANK(dms_E65_Projects_05),\"\",dms_E65_Projects_05)","v":0},0,0,0,0,0,0,0]
[null,{"$f":"IF(ISBLANK(dms_E65_Projects_06),\"\",dms_E65_Projects_06)","v":0},0,0,0,0,0,0,0]
[null,{"$f":"IF(ISBLANK(dms_E65_Projects_07),\"\",dms_E65_Projects_07)","v":0},0,0,0,0,0,0,0]
[null,{"$f":"IF(ISBLANK(dms_E65_Projects_08),\"\",dms_E65_Projects_08)","v":0},0,0,0,0,0,0,0]
[null,{"$f":"IF(ISBLANK(dms_E65_Projects_09),\"\",dms_E65_Projects_09)","v":0},0,0,0,0,0,0,0]
[null,{"$f":"IF(ISBLANK(dms_E65_Projects_10),\"\",dms_E65_Projects_10)","v":0},0,0,0,0,0,0,0]
[null,{"$f":"IF(ISBLANK(dms_E65_Projects_11),\"\",dms_E65_Projects_11)","v":""},0,0,0,0,0,0,0]
[null,{"$f":"IF(ISBLANK(dms_E65_Projects_12),\"\",dms_E65_Projects_12)","v":""},0,0,0,0,0,0,0]
[null,{"$f":"IF(ISBLANK(dms_E65_Projects_13),\"\",dms_E65_Projects_13)","v":""},0,0,0,0,0,0,0]
[null,{"$f":"IF(ISBLANK(dms_E65_Projects_14),\"\",dms_E65_Projects_14)","v":""},0,0,0,0,0,0,0]
[null,{"$f":"IF(ISBLANK(dms_E65_Projects_15),\"\",dms_E65_Projects_15)","v":""},0,0,0,0,0,0,0]
[null,"Aggregate of other projects with total expenditure of less than $500,000",89570.03499866015,13738.837399694967,0,0,0,0,0]
[null,"Total",{"$f":"SUM(C50:C65)","v":109175.30219415313},{"$f":"SUM(D50:D65)","v":53272.678882803804},{"$f":"SUM(E50:E65)","v":62653.913095791686},{"$f":"SUM(F50:F65)","v":69189.806384222902},{"$f":"SUM(G50:G65)","v":65666.697565113165},{"$f":"SUM(H50:H65)","v":45008.05175805949},{"$f":"SUM(I50:I65)","v":39033.606074190371}]
[]
[null,"C. OTHER INTERNAL DIRECT EXPENDITURE"]
[null,{"$f":"IF(ISBLANK(dms_E65_Projects_01),\"\",dms_E65_Projects_01)","v":"RTU's End of Life Replacement"},27446.13283024562,79537.080906869713,137954.45900665739,159134.01727371328,101068.20401922967,55307.801066915112,65962.031110150652]
[null,{"$f":"IF(ISBLANK(dms_E65_Projects_02),\"\",dms_E65_Projects_02)","v":"Scada Security Infrastructure"},60350.285818449469,97503.592042494478,101555.87340453205,69622.272172321129,72129.08278828382,74412.263946134044,76421.468050957905]
[null,{"$f":"IF(ISBLANK(dms_E65_Projects_03),\"\",dms_E65_Projects_03)","v":"SCADA/RTS Branch Network Replacement"},0,0,41066.776244674817,81089.893569919135,120871.6903309004,71835.247409376825,32417.016745437897]
[null,{"$f":"IF(ISBLANK(dms_E65_Projects_04),\"\",dms_E65_Projects_04)","v":0},0,0,0,0,0,0,0]
[null,{"$f":"IF(ISBLANK(dms_E65_Projects_05),\"\",dms_E65_Projects_05)","v":0},0,0,0,0,0,0,0]
[null,{"$f":"IF(ISBLANK(dms_E65_Projects_06),\"\",dms_E65_Projects_06)","v":0},0,0,0,0,0,0,0]
[null,{"$f":"IF(ISBLANK(dms_E65_Projects_07),\"\",dms_E65_Projects_07)","v":0},0,0,0,0,0,0,0]
[null,{"$f":"IF(ISBLANK(dms_E65_Projects_08),\"\",dms_E65_Projects_08)","v":0},0,0,0,0,0,0,0]
[null,{"$f":"IF(ISBLANK(dms_E65_Projects_09),\"\",dms_E65_Projects_09)","v":0},0,0,0,0,0,0,0]
[null,{"$f":"IF(ISBLANK(dms_E65_Projects_10),\"\",dms_E65_Projects_10)","v":0},0,0,0,0,0,0,0]
[null,{"$f":"IF(ISBLANK(dms_E65_Projects_11),\"\",dms_E65_Projects_11)","v":""},0,0,0,0,0,0,0]
[null,{"$f":"IF(ISBLANK(dms_E65_Projects_12),\"\",dms_E65_Projects_12)","v":""},0,0,0,0,0,0,0]
[null,{"$f":"IF(ISBLANK(dms_E65_Projects_13),\"\",dms_E65_Projects_13)","v":""},0,0,0,0,0,0,0]
[null,{"$f":"IF(ISBLANK(dms_E65_Projects_14),\"\",dms_E65_Projects_14)","v":""},0,0,0,0,0,0,0]
[null,{"$f":"IF(ISBLANK(dms_E65_Projects_15),\"\",dms_E65_Projects_15)","v":""},0,0,0,0,0,0,0]
[null,"Aggregate of other projects with total expenditure of less than $500,000",401113.0382823071,61525.339494850865,0,0,0,0,0]
[null,"Total"]
[]
[null,"D. TOTAL OVERHEAD EXPENDITURE"]
[null,{"$f":"IF(ISBLANK(dms_E65_Projects_01),\"\",dms_E65_Projects_01)","v":"RTU's End of Life Replacement"},0,0,0,0,0,0,0]
[null,{"$f":"IF(ISBLANK(dms_E65_Projects_02),\"\",dms_E65_Projects_02)","v":"Scada Security Infrastructure"},0,0,0,0,0,0,0]
[null,{"$f":"IF(ISBLANK(dms_E65_Projects_03),\"\",dms_E65_Projects_03)","v":"SCADA/RTS Branch Network Replacement"},0,0,0,0,0,0,0]
[null,{"$f":"IF(ISBLANK(dms_E65_Projects_04),\"\",dms_E65_Projects_04)","v":0},0,0,0,0,0,0,0]
[null,{"$f":"IF(ISBLANK(dms_E65_Projects_05),\"\",dms_E65_Projects_05)","v":0},0,0,0,0,0,0,0]
[null,{"$f":"IF(ISBLANK(dms_E65_Projects_06),\"\",dms_E65_Projects_06)","v":0},0,0,0,0,0,0,0]
[null,{"$f":"IF(ISBLANK(dms_E65_Projects_07),\"\",dms_E65_Projects_07)","v":0},0,0,0,0,0,0,0]
[null,{"$f":"IF(ISBLANK(dms_E65_Projects_08),\"\",dms_E65_Projects_08)","v":0},0,0,0,0,0,0,0]
[null,{"$f":"IF(ISBLANK(dms_E65_Projects_09),\"\",dms_E65_Projects_09)","v":0},0,0,0,0,0,0,0]
[null,{"$f":"IF(ISBLANK(dms_E65_Projects_10),\"\",dms_E65_Projects_10)","v":0},0,0,0,0,0,0,0]
[null,{"$f":"IF(ISBLANK(dms_E65_Projects_11),\"\",dms_E65_Projects_11)","v":""},0,0,0,0,0,0,0]
[null,{"$f":"IF(ISBLANK(dms_E65_Projects_12),\"\",dms_E65_Projects_12)","v":""},0,0,0,0,0,0,0]
[null,{"$f":"IF(ISBLANK(dms_E65_Projects_13),\"\",dms_E65_Projects_13)","v":""},0,0,0,0,0,0,0]
[null,{"$f":"IF(ISBLANK(dms_E65_Projects_14),\"\",dms_E65_Projects_14)","v":""},0,0,0,0,0,0,0]
[null,{"$f":"IF(ISBLANK(dms_E65_Projects_15),\"\",dms_E65_Projects_15)","v":""},0,0,0,0,0,0,0]
[null,"Aggregate of other projects with total expenditure of less than $500,000",0,0,0,0,0,0,0]
[null,"Total",{"$f":"SUM(C88:C103)","v":0},{"$f":"SUM(D88:D103)","v":0},{"$f":"SUM(E88:E103)","v":0},{"$f":"SUM(F88:F103)","v":0},{"$f":"SUM(G88:G103)","v":0},{"$f":"SUM(H88:H103)","v":0},{"$f":"SUM(I88:I103)","v":0}]
[]
[null,"E. RELATED PARTY MARGIN EXPENDITURE"]
[null,{"$f":"IF(ISBLANK(dms_E65_Projects_01),\"\",dms_E65_Projects_01)","v":"RTU's End of Life Replacement"},0,0,0,0,0,0,0]
[null,{"$f":"IF(ISBLANK(dms_E65_Projects_02),\"\",dms_E65_Projects_02)","v":"Scada Security Infrastructure"},0,0,0,0,0,0,0]
[null,{"$f":"IF(ISBLANK(dms_E65_Projects_03),\"\",dms_E65_Projects_03)","v":"SCADA/RTS Branch Network Replacement"},0,0,0,0,0,0,0]
[null,{"$f":"IF(ISBLANK(dms_E65_Projects_04),\"\",dms_E65_Projects_04)","v":0},0,0,0,0,0,0,0]
[null,{"$f":"IF(ISBLANK(dms_E65_Projects_05),\"\",dms_E65_Projects_05)","v":0},0,0,0,0,0,0,0]
[null,{"$f":"IF(ISBLANK(dms_E65_Projects_06),\"\",dms_E65_Projects_06)","v":0},0,0,0,0,0,0,0]
[null,{"$f":"IF(ISBLANK(dms_E65_Projects_07),\"\",dms_E65_Projects_07)","v":0},0,0,0,0,0,0,0]
[null,{"$f":"IF(ISBLANK(dms_E65_Projects_08),\"\",dms_E65_Projects_08)","v":0},0,0,0,0,0,0,0]
[null,{"$f":"IF(ISBLANK(dms_E65_Projects_09),\"\",dms_E65_Projects_09)","v":0},0,0,0,0,0,0,0]
[null,{"$f":"IF(ISBLANK(dms_E65_Projects_10),\"\",dms_E65_Projects_10)","v":0},0,0,0,0,0,0,0]
[null,{"$f":"IF(ISBLANK(dms_E65_Projects_11),\"\",dms_E65_Projects_11)","v":""},0,0,0,0,0,0,0]
[null,{"$f":"IF(ISBLANK(dms_E65_Projects_12),\"\",dms_E65_Projects_12)","v":""},0,0,0,0,0,0,0]
[null,{"$f":"IF(ISBLANK(dms_E65_Projects_13),\"\",dms_E65_Projects_13)","v":""},0,0,0,0,0,0,0]
[null,{"$f":"IF(ISBLANK(dms_E65_Projects_14),\"\",dms_E65_Projects_14)","v":""},0,0,0,0,0,0,0]
[null,{"$f":"IF(ISBLANK(dms_E65_Projects_15),\"\",dms_E65_Projects_15)","v":""},0,0,0,0,0,0,0]
[null,"Aggregate of other projects with total expenditure of less than $500,000",0,0,0,0,0,0,0]
[null,"Total",{"$f":"SUM(C107:C122)","v":0},{"$f":"SUM(D107:D122)","v":0},{"$f":"SUM(E107:E122)","v":0},{"$f":"SUM(F107:F122)","v":0},{"$f":"SUM(G107:G122)","v":0},{"$f":"SUM(H107:H122)","v":0},{"$f":"SUM(I107:I122)","v":0}]
[]
[null,"F. CUSTOMER CONTRIBUTIONS included in the above"]
[null,{"$f":"IF(ISBLANK(dms_E65_Projects_01),\"\",dms_E65_Projects_01)","v":"RTU's End of Life Replacement"},0,0,0,0,0,0,0]
[null,{"$f":"IF(ISBLANK(dms_E65_Projects_02),\"\",dms_E65_Projects_02)","v":"Scada Security Infrastructure"},0,0,0,0,0,0,0]
[null,{"$f":"IF(ISBLANK(dms_E65_Projects_03),\"\",dms_E65_Projects_03)","v":"SCADA/RTS Branch Network Replacement"},0,0,0,0,0,0,0]
[null,{"$f":"IF(ISBLANK(dms_E65_Projects_04),\"\",dms_E65_Projects_04)","v":0},0,0,0,0,0,0,0]
[null,{"$f":"IF(ISBLANK(dms_E65_Projects_05),\"\",dms_E65_Projects_05)","v":0},0,0,0,0,0,0,0]
[null,{"$f":"IF(ISBLANK(dms_E65_Projects_06),\"\",dms_E65_Projects_06)","v":0},0,0,0,0,0,0,0]
[null,{"$f":"IF(ISBLANK(dms_E65_Projects_07),\"\",dms_E65_Projects_07)","v":0},0,0,0,0,0,0,0]
[null,{"$f":"IF(ISBLANK(dms_E65_Projects_08),\"\",dms_E65_Projects_08)","v":0},0,0,0,0,0,0,0]
[null,{"$f":"IF(ISBLANK(dms_E65_Projects_09),\"\",dms_E65_Projects_09)","v":0},0,0,0,0,0,0,0]
[null,{"$f":"IF(ISBLANK(dms_E65_Projects_10),\"\",dms_E65_Projects_10)","v":0},0,0,0,0,0,0,0]
[null,{"$f":"IF(ISBLANK(dms_E65_Projects_11),\"\",dms_E65_Projects_11)","v":""},0,0,0,0,0,0,0]
[null,{"$f":"IF(ISBLANK(dms_E65_Projects_12),\"\",dms_E65_Projects_12)","v":""},0,0,0,0,0,0,0]
[null,{"$f":"IF(ISBLANK(dms_E65_Projects_13),\"\",dms_E65_Projects_13)","v":""},0,0,0,0,0,0,0]
[null,{"$f":"IF(ISBLANK(dms_E65_Projects_14),\"\",dms_E65_Projects_14)","v":""},0,0,0,0,0,0,0]
[null,{"$f":"IF(ISBLANK(dms_E65_Projects_15),\"\",dms_E65_Projects_15)","v":""},0,0,0,0,0,0,0]
[null,"Aggregate of other projects with total expenditure of less than $500,000",0,0,0,0,0,0,0]
[null,"Total",{"$f":"SUM(C126:C141)","v":0},{"$f":"SUM(D126:D141)","v":0},{"$f":"SUM(E126:E141)","v":0},{"$f":"SUM(F126:F141)","v":0},{"$f":"SUM(G126:G141)","v":0},{"$f":"SUM(H126:H141)","v":0},{"$f":"SUM(I126:I141)","v":0}]

{"sheet":"E10. Overheads","index":11,"n_rows":32,"n_cols":9,"rows_kept":32,"cut":false,"hidden":false,"merged":[[6,2,6,8],[7,2,7,8],[21,2,21,8],[22,2,22,8]]}
[null,{"$f":"IF(dms_MultiYear_ResponseFlag=\"Yes\",\"REGULATORY REPORTING STATEMENT - HISTORICAL INFORMATION\",INDEX(dms_Worksheet_List,MATCH(dms_Model,dms_Model_List)))","v":"REGULATORY REPORTING STATEMENT"}]
[null,{"$f":"INDEX(dms_TradingNameFull_List,MATCH(dms_TradingName,dms_TradingName_List))","v":"Jemena Gas Networks (NSW) Ltd"}]
[null,{"$f":"IF(SUM(dms_SingleYear_Model)>0,CONCATENATE(CRY),CONCATENATE(FRCP_y1,\" to \",dms_MultiYear_FinalYear_Result))","v":"2020-21 to 2024-25"}]
[null,"E10. OVERHEADS EXPENDITURE"]
[]
[null,"E10.1 - NETWORK"]
[null,null,"EXPENDITURE"]
[null,null,{"$f":"CONCATENATE(\"$0's, real \",dms_DollarReal)","v":"$0's, real June 2020"}]
[null,null,{"$f":"CRCP_y4","v":"2018-19"},{"$f":"CRCP_y5","v":"2019-20"},{"$f":"FRCP_y1","v":"2020-21"},{"$f":"FRCP_y2","v":"2021-22"},{"$f":"FRCP_y3","v":"2022-23"},{"$f":"FRCP_y4","v":"2023-24"},{"$f":"FRCP_y5","v":"2024-25"}]
[null,"E10.1.1 - OPEX"]
[null,"Reference services",63112224.81437625,62744530.580985464,63608344.85489244,64467730.718556523,65343127.101124525,66207697.219598375,67067737.049850591]
[null,"Non-reference services",0,0,0,0,0,0,0]
[null,"Total",{"$f":"SUM(C11:C12)","v":63112224.81437625},{"$f":"SUM(D11:D12)","v":62744530.580985464},63608344.85489244,64467730.718556523,65343127.101124525,66207697.219598375,67067737.049850591]
[null,"E10.1.2 - CAPEX"]
[null,"Reference services",15981141.327514187,16245583.624922803,16295340.006579895,16101438.584393121,15623986.854481515,15781676.304801684,15837105.742643632]
[null,"Non-reference services",0,0,0,0,0,0,0]
[null,"Total",{"$f":"SUM(C15:C16)","v":15981141.327514187},{"$f":"SUM(D15:D16)","v":16245583.624922803},16295340.006579895,16101438.584393121,15623986.854481515,15781676.304801684,15837105.742643632]
[]
[]
[]
[null,"E10.2 - CORPORATE"]
[null,null,"EXPENDITURE"]
[null,null,{"$f":"CONCATENATE(\"$0's, real \",dms_DollarReal)","v":"$0's, real June 2020"}]
[null,null,{"$f":"CRCP_y4","v":"2018-19"},{"$f":"CRCP_y5","v":"2019-20"},{"$f":"FRCP_y1","v":"2020-21"},{"$f":"FRCP_y2","v":"2021-22"},{"$f":"FRCP_y3","v":"2022-23"},{"$f":"FRCP_y4","v":"2023-24"},{"$f":"FRCP_y5","v":"2024-25"}]
[null,"E10.2.1 - OPEX"]
[null,"Reference services",23968752.038584009,23829109.173321657,32808039.905957799,41784100.409780532,42351479.623224005,42911841.904305644,43469267.925403759]
[null,"Non-reference services",0,0,0,0,0,0,0]
[null,"Total",{"$f":"SUM(C26:C27)","v":23968752.038584009},23829109.173321657,32808039.905957799,41784100.409780532,42351479.623224005,42911841.904305644,43469267.925403759]
[null,"E10.2.2 - CAPEX"]
[null,"Reference services",16548108.535145797,16838116.688962333,8419058.3444811832,0,0,0,0]
[null,"Non-reference services",0,0,0,0,0,0,0]
[null,"Total",{"$f":"SUM(C30:C31)","v":16548108.535145797},16838116.688962333,8419058.3444811832,0,0,0,0]

{"sheet":"E11. Labour","index":12,"n_rows":23,"n_cols":9,"rows_kept":23,"cut":false,"hidden":false,"merged":[[6,2,6,8],[7,2,7,8]]}
[null,{"$f":"IF(dms_MultiYear_ResponseFlag=\"Yes\",\"REGULATORY REPORTING STATEMENT - HISTORICAL INFORMATION\",INDEX(dms_Worksheet_List,MATCH(dms_Model,dms_Model_List)))","v":"REGULATORY REPORTING STATEMENT"}]
[null,{"$f":"INDEX(dms_TradingNameFull_List,MATCH(dms_TradingName,dms_TradingName_List))","v":"Jemena Gas Networks (NSW) Ltd"}]
[null,{"$f":"IF(SUM(dms_SingleYear_Model)>0,CONCATENATE(CRY),CONCATENATE(FRCP_y1,\" to \",dms_MultiYear_FinalYear_Result))","v":"2020-21 to 2024-25"}]
[null,"E11. LABOUR "]
[]
[null,"E11.3 - LABOUR / NON-LABOUR EXPENDITURE SPLIT"]
[null,null,"EXPENDITURE"]
[null,null,{"$f":"CONCATENATE(\"$0's, real \",dms_DollarReal)","v":"$0's, real June 2020"}]
[null,null,{"$f":"CRCP_y4","v":"2018-19"},{"$f":"CRCP_y5","v":"2019-20"},{"$f":"FRCP_y1","v":"2020-21"},{"$f":"FRCP_y2","v":"2021-22"},{"$f":"FRCP_y3","v":"2022-23"},{"$f":"FRCP_y4","v":"2023-24"},{"$f":"FRCP_y5","v":"2024-25"}]
[null,"E11.3.1 - OPEX"]
[null,"In-house labour expenditure",99679211.184884921,92420918.799185961,101720542.66193557,107530639.76078142,110525668.07053484,110560382.75545485,112586549.93817692]
[null,"Labour expenditure outsourced to related parties",8475306.5378777534,7858164.2854552045,8648872.4179420844,9142880.6804695465,9397535.4145213664,9400487.0590274334,9572763.5825515427]
[null,"Labour expenditure outsourced to unrelated parties",0,0,0,0,0,0,0]
[null,"Controllable non-labour expenditure",76789612.154719934,71198060.510419831,78362187.323991627,82838096.568238243,85145368.662033126,85172111.722691342,86733004.814363822]
[null,"Uncontrollable non-labour expenditure",5472299.0817221897,5073825.3550043898,5584366.3446405847,5903335.4520481303,6067759.8137015952,6069665.6186949527,6180900.3754875185]
[null,"Total",{"$f":"SUM(C11:C15)","v":190416428.95920479},{"$f":"SUM(D11:D15)","v":176550968.9500654},194315968.74850985,205414952.46153733,211136331.96079093,211202647.15586859,215073218.71057978]
[null,"E11.3.2 - CAPEX"]
[null,"In-house labour expenditure",26518871.554587334,28020071.057106089,26061181.385260507,32062311.971251573,30506170.686016075,30749267.527281012,32433315.741992109]
[null,"Labour expenditure outsourced to related parties",0,0,0,0,0,0,0]
[null,"Labour expenditure outsourced to unrelated parties",122917247.91480151,131356551.23789603,131118682.0562882,116991314.03697321,99102885.171383083,101252316.26078482,99682531.433791146]
[null,"Controllable non-labour expenditure",45532024.6252129,47243393.332577296,44927286.981214575,41846932.051366352,45417708.783905275,38916149.214536324,41763895.57562957]
[null,"Uncontrollable non-labour expenditure",0,0,0,0,0,0,0]
[null,"Total",{"$f":"SUM(C18:C22)","v":194968144.09460175},{"$f":"SUM(D18:D22)","v":206620015.62757939},{"$f":"SUM(E18:E22)","v":202107150.42276329},{"$f":"SUM(F18:F22)","v":190900558.05959114},{"$f":"SUM(G18:G22)","v":175026764.64130443},{"$f":"SUM(H18:H22)","v":170917733.00260216},{"$f":"SUM(I18:I22)","v":173879742.75141281}]

{"sheet":"E12. ICT","index":13,"n_rows":139,"n_cols":10,"rows_kept":139,"cut":false,"hidden":false,"merged":[[24,3,24,9],[25,3,25,9]]}
[null,{"$f":"IF(dms_MultiYear_ResponseFlag=\"Yes\",\"REGULATORY REPORTING STATEMENT - HISTORICAL INFORMATION\",INDEX(dms_Worksheet_List,MATCH(dms_Model,dms_Model_List)))","v":"REGULATORY REPORTING STATEMENT"}]
[null,{"$f":"INDEX(dms_TradingNameFull_List,MATCH(dms_TradingName,dms_TradingName_List))","v":"Jemena Gas Networks (NSW) Ltd"}]
[null,{"$f":"IF(SUM(dms_SingleYear_Model)>0,CONCATENATE(CRY),CONCATENATE(FRCP_y1,\" to \",dms_MultiYear_FinalYear_Result))","v":"2020-21 to 2024-25"}]
[null,"E12. INFORMATION AND COMMUNICATION TECHNOLOGY"]
[]
[null,"Please list all projects here:"]
[null,"Asset Management & Geospatial Systems"]
[null,"Corporate Systems/SAP ERP"]
[null,"Customer Experience"]
[null,"Cyber-Security"]
[null,"Data Warehouse & Reporting"]
[null,"Document & Content Management"]
[null,"Enabling Platforms & Networking"]
[null,"End User Services & Support"]
[null,"Market Interactions & Regulatory Compliance"]
[null,"Metering"]
[null,"Real Time Systems/SCADA"]
[null,""]
[null,""]
[null,""]
[null,""]
[]
[null,"E12.1 - CAPEX - BY PROJECT"]
[null,"A. DIRECT INTERNAL LABOUR EXPENDITURE"]
[null,null,null,"EXPENDITURE"]
[null,null,null,{"$f":"CONCATENATE(\"$0's, real \",dms_DollarReal)","v":"$0's, real June 2020"}]
[null,null,null,{"$f":"CRCP_y4","v":"2018-19"},{"$f":"CRCP_y5","v":"2019-20"},{"$f":"FRCP_y1","v":"2020-21"},{"$f":"FRCP_y2","v":"2021-22"},{"$f":"FRCP_y3","v":"2022-23"},{"$f":"FRCP_y4","v":"2023-24"},{"$f":"FRCP_y5","v":"2024-25"}]
[null,{"$f":"IF(ISBLANK(dms_E12_Projects_01),\"\",dms_E12_Projects_01)","v":"Asset Management & Geospatial Systems"},null,1689040.6179892784,3697815.0425867136,1176048.0078290524,2211695.2282243334,2169518.8583690361,1378880.5222857257,1882378.4069173422]
[null,{"$f":"IF(ISBLANK(dms_E12_Projects_02),\"\",dms_E12_Projects_02)","v":"Corporate Systems/SAP ERP"},null,3747885.3081613495,3610671.7451769784,3191113.1889077872,2375851.5165155153,4212622.7871409412,6478904.7454814566,2567764.8984509073]
[null,{"$f":"IF(ISBLANK(dms_E12_Projects_03),\"\",dms_E12_Projects_03)","v":"Customer Experience"},null,22292.895277115,202285.70481754516,1517889.1572253241,2601100.6749152257,1122131.0666010454,229766.17106772086,891272.27311276796]
[null,{"$f":"IF(ISBLANK(dms_E12_Projects_04),\"\",dms_E12_Projects_04)","v":"Cyber-Security"},null,1100134.6890315316,1225107.5182350979,2017205.8258860551,2667320.7548009478,1731116.4888375339,1200069.8398656927,1500979.0524413423]
[null,{"$f":"IF(ISBLANK(dms_E12_Projects_05),\"\",dms_E12_Projects_05)","v":"Data Warehouse & Reporting"},null,0,0,0,0,0,0,0]
[null,{"$f":"IF(ISBLANK(dms_E12_Projects_06),\"\",dms_E12_Projects_06)","v":"Document & Content Management"},null,0,0,0,0,0,0,0]
[null,{"$f":"IF(ISBLANK(dms_E12_Projects_07),\"\",dms_E12_Projects_07)","v":"Enabling Platforms & Networking"},null,1464666.7323104693,1410979.0741055829,1330897.8618182591,2826778.7626657258,3032578.8277897923,1392891.4882883905,1780276.7633252924]
[null,{"$f":"IF(ISBLANK(dms_E12_Projects_08),\"\",dms_E12_Projects_08)","v":"End User Services & Support"},null,464448.14488298126,750946.47014794801,1409792.3378893605,524481.80355200928,1130038.6075095141,351369.87116542185,812454.6587389902]
[null,{"$f":"IF(ISBLANK(dms_E12_Projects_09),\"\",dms_E12_Projects_09)","v":"Market Interactions & Regulatory Compliance"},null,869996.85205573868,0,0,0,0,4293257.8612867706,4335343.0222043637]
[null,{"$f":"IF(ISBLANK(dms_E12_Projects_10),\"\",dms_E12_Projects_10)","v":"Metering"},null,414362.42435608892,0,909754.06366170745,5135003.3195794094,4140296.8507538475,1379975.7411278905,3611732.5615011579]
[null,{"$f":"IF(ISBLANK(dms_E12_Projects_11),\"\",dms_E12_Projects_11)","v":"Real Time Systems/SCADA"},null,4311444.4702433608,2016378.1014056585,386044.16837558849,396781.72630539036,93239.658660865913,300458.5400710681,303403.81995327072]
[null,{"$f":"IF(ISBLANK(dms_E12_Projects_12),\"\",dms_E12_Projects_12)","v":""}]
[null,{"$f":"IF(ISBLANK(dms_E12_Projects_13),\"\",dms_E12_Projects_13)","v":""}]
[null,{"$f":"IF(ISBLANK(dms_E12_Projects_14),\"\",dms_E12_Projects_14)","v":""}]
[null,{"$f":"IF(ISBLANK(dms_E12_Projects_15),\"\",dms_E12_Projects_15)","v":""}]
[null,"Aggregate of other projects with total expenditure of less than $500,000",null,0,0,0,0,0,0,0]
[null,null,"Total",{"$f":"SUM(D28:D43)","v":14084272.134307913},{"$f":"SUM(E28:E43)","v":12914183.656475525},11938744.611593135,18739013.786558557,17631543.145662576,17005574.780640136,17685605.456645433]
[]
[null,"B. DIRECT CONTRACTOR EXPENDITURE"]
[null,{"$f":"IF(ISBLANK(dms_E12_Projects_01),\"\",dms_E12_Projects_01)","v":"Asset Management & Geospatial Systems"}]
[null,{"$f":"IF(ISBLANK(dms_E12_Projects_02),\"\",dms_E12_Projects_02)","v":"Corporate Systems/SAP ERP"}]
[null,{"$f":"IF(ISBLANK(dms_E12_Projects_03),\"\",dms_E12_Projects_03)","v":"Customer Experience"}]
[null,{"$f":"IF(ISBLANK(dms_E12_Projects_04),\"\",dms_E12_Projects_04)","v":"Cyber-Security"}]
[null,{"$f":"IF(ISBLANK(dms_E12_Projects_05),\"\",dms_E12_Projects_05)","v":"Data Warehouse & Reporting"}]
[null,{"$f":"IF(ISBLANK(dms_E12_Projects_06),\"\",dms_E12_Projects_06)","v":"Document & Content Management"}]
[null,{"$f":"IF(ISBLANK(dms_E12_Projects_07),\"\",dms_E12_Projects_07)","v":"Enabling Platforms & Networking"}]
[null,{"$f":"IF(ISBLANK(dms_E12_Projects_08),\"\",dms_E12_Projects_08)","v":"End User Services & Support"}]
[null,{"$f":"IF(ISBLANK(dms_E12_Projects_09),\"\",dms_E12_Projects_09)","v":"Market Interactions & Regulatory Compliance"}]
[null,{"$f":"IF(ISBLANK(dms_E12_Projects_10),\"\",dms_E12_Projects_10)","v":"Metering"}]
[null,{"$f":"IF(ISBLANK(dms_E12_Projects_11),\"\",dms_E12_Projects_11)","v":"Real Time Systems/SCADA"}]
[null,{"$f":"IF(ISBLANK(dms_E12_Projects_12),\"\",dms_E12_Projects_12)","v":""}]
[null,{"$f":"IF(ISBLANK(dms_E12_Projects_13),\"\",dms_E12_Projects_13)","v":""}]
[null,{"$f":"IF(ISBLANK(dms_E12_Projects_14),\"\",dms_E12_Projects_14)","v":""}]
[null,{"$f":"IF(ISBLANK(dms_E12_Projects_15),\"\",dms_E12_Projects_15)","v":""}]
[null,"Aggregate of other projects with total expenditure of less than $500,000"]
[null,null,"Total"]
[]
[null,"C. OTHER INTERNAL DIRECT EXPENDITURE"]
[null,{"$f":"IF(ISBLANK(dms_E12_Projects_01),\"\",dms_E12_Projects_01)","v":"Asset Management & Geospatial Systems"},null,92689.312974116678,202924.6260582777,64537.868840609139,121370.97771887152,119056.46929083647,75668.688439360209,103299.09147015448]
[null,{"$f":"IF(ISBLANK(dms_E12_Projects_02),\"\",dms_E12_Projects_02)","v":"Corporate Systems/SAP ERP"},null,205672.32701177488,198142.47204659792,175118.39913868962,130379.36592459983,231175.67914028757,355542.20738534821,140910.97738063862]
[null,{"$f":"IF(ISBLANK(dms_E12_Projects_03),\"\",dms_E12_Projects_03)","v":"Customer Experience"},null,1223.364983311986,11100.812380902877,83297.051388594453,142740.34144981936,61579.074252211933,12608.855177392545,48910.259343583268]
[null,{"$f":"IF(ISBLANK(dms_E12_Projects_04),\"\",dms_E12_Projects_04)","v":"Cyber-Security"},null,60371.981241467984,202813.7343703302,285444.45068808616,229911.63630683959,94998.306328199105,65856.11251346198,259291.3112448715]
[null,{"$f":"IF(ISBLANK(dms_E12_Projects_05),\"\",dms_E12_Projects_05)","v":"Data Warehouse & Reporting"},null,0,0,0,0,0,0,0]
[null,{"$f":"IF(ISBLANK(dms_E12_Projects_06),\"\",dms_E12_Projects_06)","v":"Document & Content Management"},null,0,0,0,0,0,0,0]
[null,{"$f":"IF(ISBLANK(dms_E12_Projects_07),\"\",dms_E12_Projects_07)","v":"Enabling Platforms & Networking"},null,1598831.8349624809,1421538.0038141911,1459847.6131770576,1700560.2759955192,5948766.2796603879,1202703.3015220151,453541.04007336835]
[null,{"$f":"IF(ISBLANK(dms_E12_Projects_08),\"\",dms_E12_Projects_08)","v":"End User Services & Support"},null,307450.42463321378,341527.35848195816,1938732.6792613217,1012101.1925623112,2314149.0567847425,435606.97944728384,1749166.6017008268]
[null,{"$f":"IF(ISBLANK(dms_E12_Projects_09),\"\",dms_E12_Projects_09)","v":"Market Interactions & Regulatory Compliance"},null,47742.73019123009,0,0,0,0,235600.68203518027,237910.18519946805]
[null,{"$f":"IF(ISBLANK(dms_E12_Projects_10),\"\",dms_E12_Projects_10)","v":"Metering"},null,22738.925296880625,0,49924.482714097612,281793.06331793935,227206.65596670043,75728.790654165088,198200.68635786592]
[null,{"$f":"IF(ISBLANK(dms_E12_Projects_11),\"\",dms_E12_Projects_11)","v":"Real Time Systems/SCADA"},null,236598.70675498957,110652.57929547949,21184.907197196044,21774.151089221523,5116.7034180060609,16488.23323713,16649.861066496731]
[null,{"$f":"IF(ISBLANK(dms_E12_Projects_12),\"\",dms_E12_Projects_12)","v":""}]
[null,{"$f":"IF(ISBLANK(dms_E12_Projects_13),\"\",dms_E12_Projects_13)","v":""}]
[null,{"$f":"IF(ISBLANK(dms_E12_Projects_14),\"\",dms_E12_Projects_14)","v":""}]
[null,{"$f":"IF(ISBLANK(dms_E12_Projects_15),\"\",dms_E12_Projects_15)","v":""}]
[null,"Aggregate of other projects with total expenditure of less than $500,000",null,0,0,0,0,0,0,0]
[null,null,"Total",{"$f":"SUM(D66:D81)","v":2573319.6080494667},{"$f":"SUM(E66:E81)","v":2488699.5864477376},{"$f":"SUM(F66:F81)","v":4078087.452405652},{"$f":"SUM(G66:G81)","v":3640631.0043651219},{"$f":"SUM(H66:H81)","v":9002048.224841373},{"$f":"SUM(I66:I81)","v":2475803.8504113373},{"$f":"SUM(J66:J81)","v":3207880.0138372737}]
[]
[null,"D. TOTAL OVERHEAD EXPENDITURE"]
[null,{"$f":"IF(ISBLANK(dms_E12_Projects_01),\"\",dms_E12_Projects_01)","v":"Asset Management & Geospatial Systems"},null,0,0,0,0,0,0,0]
[null,{"$f":"IF(ISBLANK(dms_E12_Projects_02),\"\",dms_E12_Projects_02)","v":"Corporate Systems/SAP ERP"},null,0,0,0,0,0,0,0]
[null,{"$f":"IF(ISBLANK(dms_E12_Projects_03),\"\",dms_E12_Projects_03)","v":"Customer Experience"},null,0,0,0,0,0,0,0]
[null,{"$f":"IF(ISBLANK(dms_E12_Projects_04),\"\",dms_E12_Projects_04)","v":"Cyber-Security"},null,0,0,0,0,0,0,0]
[null,{"$f":"IF(ISBLANK(dms_E12_Projects_05),\"\",dms_E12_Projects_05)","v":"Data Warehouse & Reporting"},null,0,0,0,0,0,0,0]
[null,{"$f":"IF(ISBLANK(dms_E12_Projects_06),\"\",dms_E12_Projects_06)","v":"Document & Content Management"},null,0,0,0,0,0,0,0]
[null,{"$f":"IF(ISBLANK(dms_E12_Projects_07),\"\",dms_E12_Projects_07)","v":"Enabling Platforms & Networking"},null,0,0,0,0,0,0,0]
[null,{"$f":"IF(ISBLANK(dms_E12_Projects_08),\"\",dms_E12_Projects_08)","v":"End User Services & Support"},null,0,0,0,0,0,0,0]
[null,{"$f":"IF(ISBLANK(dms_E12_Projects_09),\"\",dms_E12_Projects_09)","v":"Market Interactions & Regulatory Compliance"},null,0,0,0,0,0,0,0]
[null,{"$f":"IF(ISBLANK(dms_E12_Projects_10),\"\",dms_E12_Projects_10)","v":"Metering"},null,0,0,0,0,0,0,0]
[null,{"$f":"IF(ISBLANK(dms_E12_Projects_11),\"\",dms_E12_Projects_11)","v":"Real Time Systems/SCADA"},null,0,0,0,0,0,0,0]
[null,{"$f":"IF(ISBLANK(dms_E12_Projects_12),\"\",dms_E12_Projects_12)","v":""}]
[null,{"$f":"IF(ISBLANK(dms_E12_Projects_13),\"\",dms_E12_Projects_13)","v":""}]
[null,{"$f":"IF(ISBLANK(dms_E12_Projects_14),\"\",dms_E12_Projects_14)","v":""}]
[null,{"$f":"IF(ISBLANK(dms_E12_Projects_15),\"\",dms_E12_Projects_15)","v":""}]
[null,"Aggregate of other projects with total expenditure of less than $500,000",null,0,0,0,0,0,0,0]
[null,null,"Total",{"$f":"SUM(D85:D100)","v":0},{"$f":"SUM(E85:E100)","v":0},{"$f":"SUM(F85:F100)","v":0},{"$f":"SUM(G85:G100)","v":0},{"$f":"SUM(H85:H100)","v":0},{"$f":"SUM(I85:I100)","v":0},{"$f":"SUM(J85:J100)","v":0}]
[]
[null,"E. RELATED PARTY MARGIN EXPENDITURE"]
[null,{"$f":"IF(ISBLANK(dms_E12_Projects_01),\"\",dms_E12_Projects_01)","v":"Asset Management & Geospatial Systems"},null,0,0,0,0,0,0,0]
[null,{"$f":"IF(ISBLANK(dms_E12_Projects_02),\"\",dms_E12_Projects_02)","v":"Corporate Systems/SAP ERP"},null,0,0,0,0,0,0,0]
[null,{"$f":"IF(ISBLANK(dms_E12_Projects_03),\"\",dms_E12_Projects_03)","v":"Customer Experience"},null,0,0,0,0,0,0,0]
[null,{"$f":"IF(ISBLANK(dms_E12_Projects_04),\"\",dms_E12_Projects_04)","v":"Cyber-Security"},null,0,0,0,0,0,0,0]
[null,{"$f":"IF(ISBLANK(dms_E12_Projects_05),\"\",dms_E12_Projects_05)","v":"Data Warehouse & Reporting"},null,0,0,0,0,0,0,0]
[null,{"$f":"IF(ISBLANK(dms_E12_Projects_06),\"\",dms_E12_Projects_06)","v":"Document & Content Management"},null,0,0,0,0,0,0,0]
[null,{"$f":"IF(ISBLANK(dms_E12_Projects_07),\"\",dms_E12_Projects_07)","v":"Enabling Platforms & Networking"},null,0,0,0,0,0,0,0]
[null,{"$f":"IF(ISBLANK(dms_E12_Projects_08),\"\",dms_E12_Projects_08)","v":"End User Services & Support"},null,0,0,0,0,0,0,0]
[null,{"$f":"IF(ISBLANK(dms_E12_Projects_09),\"\",dms_E12_Projects_09)","v":"Market Interactions & Regulatory Compliance"},null,0,0,0,0,0,0,0]
[null,{"$f":"IF(ISBLANK(dms_E12_Projects_10),\"\",dms_E12_Projects_10)","v":"Metering"},null,0,0,0,0,0,0,0]
[null,{"$f":"IF(ISBLANK(dms_E12_Projects_11),\"\",dms_E12_Projects_11)","v":"Real Time Systems/SCADA"},null,0,0,0,0,0,0,0]
[null,{"$f":"IF(ISBLANK(dms_E12_Projects_12),\"\",dms_E12_Projects_12)","v":""}]
[null,{"$f":"IF(ISBLANK(dms_E12_Projects_13),\"\",dms_E12_Projects_13)","v":""}]
[null,{"$f":"IF(ISBLANK(dms_E12_Projects_14),\"\",dms_E12_Projects_14)","v":""}]
[null,{"$f":"IF(ISBLANK(dms_E12_Projects_15),\"\",dms_E12_Projects_15)","v":""}]
[null,"Aggregate of other projects with total expenditure of less than $500,000",null,0,0,0,0,0,0,0]
[null,null,"Total",{"$f":"SUM(D104:D119)","v":0},{"$f":"SUM(E104:E119)","v":0},{"$f":"SUM(F104:F119)","v":0},{"$f":"SUM(G104:G119)","v":0},{"$f":"SUM(H104:H119)","v":0},{"$f":"SUM(I104:I119)","v":0},{"$f":"SUM(J104:J119)","v":0}]
[]
[null,"F. CUSTOMER CONTRIBUTIONS included in the above"]
[null,{"$f":"IF(ISBLANK(dms_E12_Projects_01),\"\",dms_E12_Projects_01)","v":"Asset Management & Geospatial Systems"},null,0,0,0,0,0,0,0]
[null,{"$f":"IF(ISBLANK(dms_E12_Projects_02),\"\",dms_E12_Projects_02)","v":"Corporate Systems/SAP ERP"},null,0,0,0,0,0,0,0]
[null,{"$f":"IF(ISBLANK(dms_E12_Projects_03),\"\",dms_E12_Projects_03)","v":"Customer Experience"},null,0,0,0,0,0,0,0]
[null,{"$f":"IF(ISBLANK(dms_E12_Projects_04),\"\",dms_E12_Projects_04)","v":"Cyber-Security"},null,0,0,0,0,0,0,0]
[null,{"$f":"IF(ISBLANK(dms_E12_Projects_05),\"\",dms_E12_Projects_05)","v":"Data Warehouse & Reporting"},null,0,0,0,0,0,0,0]
[null,{"$f":"IF(ISBLANK(dms_E12_Projects_06),\"\",dms_E12_Projects_06)","v":"Document & Content Management"},null,0,0,0,0,0,0,0]
[null,{"$f":"IF(ISBLANK(dms_E12_Projects_07),\"\",dms_E12_Projects_07)","v":"Enabling Platforms & Networking"},null,0,0,0,0,0,0,0]
[null,{"$f":"IF(ISBLANK(dms_E12_Projects_08),\"\",dms_E12_Projects_08)","v":"End User Services & Support"},null,0,0,0,0,0,0,0]
[null,{"$f":"IF(ISBLANK(dms_E12_Projects_09),\"\",dms_E12_Projects_09)","v":"Market Interactions & Regulatory Compliance"},null,0,0,0,0,0,0,0]
[null,{"$f":"IF(ISBLANK(dms_E12_Projects_10),\"\",dms_E12_Projects_10)","v":"Metering"},null,0,0,0,0,0,0,0]
[null,{"$f":"IF(ISBLANK(dms_E12_Projects_11),\"\",dms_E12_Projects_11)","v":"Real Time Systems/SCADA"},null,0,0,0,0,0,0,0]
[null,{"$f":"IF(ISBLANK(dms_E12_Projects_12),\"\",dms_E12_Projects_12)","v":""}]
[null,{"$f":"IF(ISBLANK(dms_E12_Projects_13),\"\",dms_E12_Projects_13)","v":""}]
[null,{"$f":"IF(ISBLANK(dms_E12_Projects_14),\"\",dms_E12_Projects_14)","v":""}]
[null,{"$f":"IF(ISBLANK(dms_E12_Projects_15),\"\",dms_E12_Projects_15)","v":""}]
[null,"Aggregate of other projects with total expenditure of less than $500,000",null,0,0,0,0,0,0,0]
[null,null,"Total",{"$f":"SUM(D123:D138)","v":0},{"$f":"SUM(E123:E138)","v":0},{"$f":"SUM(F123:F138)","v":0},{"$f":"SUM(G123:G138)","v":0},{"$f":"SUM(H123:H138)","v":0},{"$f":"SUM(I123:I138)","v":0},{"$f":"SUM(J123:J138)","v":0}]

{"sheet":"E13. Other capex","index":14,"n_rows":139,"n_cols":9,"rows_kept":139,"cut":false,"hidden":false,"merged":[[23,2,23,8],[24,2,24,8]]}
[null,{"$f":"IF(dms_MultiYear_ResponseFlag=\"Yes\",\"REGULATORY REPORTING STATEMENT - HISTORICAL INFORMATION\",INDEX(dms_Worksheet_List,MATCH(dms_Model,dms_Model_List)))","v":"REGULATORY REPORTING STATEMENT"}]
[null,{"$f":"INDEX(dms_TradingNameFull_List,MATCH(dms_TradingName,dms_TradingName_List))","v":"Jemena Gas Networks (NSW) Ltd"}]
[null,{"$f":"IF(SUM(dms_SingleYear_Model)>0,CONCATENATE(CRY),CONCATENATE(FRCP_y1,\" to \",dms_MultiYear_FinalYear_Result))","v":"2020-21 to 2024-25"}]
[null,"E13. OTHER CAPITAL EXPENDITURE"]
[]
[null,"Please list all projects here:"]
[null,"Other capex - Allocations - Facilities projects"]
[null,"Other capex - Facility upgrade projects - TRS"]
[null,"Other capex - Facility upgrade projects - PRS"]
[null,"Other capex - Mains relocation projects"]
[null,"Other capex - Allocations - Networks projects"]
[null,"Other capex - Networks upgrade projects"]
[null,"Other capex - Non Network General - Property"]
[null,"Other capex - Pipes upgrade projects"]
[null,"Other capex - Pipes washaway projects"]
[null,"Other capex - Pigging facilities projects"]
[null,"Other capex - Pigging & Validation digs"]
[null,"Other capex - Primary mains integrity projects - SPM"]
[null,"Other capex - Allocations - Pipes projects"]
[null,"Other capex - Non Network General - Vehicles"]
[null,"Other capex - Non Network General - Plant & Equipt"]
[]
[null,"E13.1 - OTHER CAPEX - BY PROJECT"]
[null,null,"EXPENDITURE"]
[null,null,{"$f":"CONCATENATE(\"$0's, real \",dms_DollarReal)","v":"$0's, real June 2020"}]
[null,null,{"$f":"CRCP_y4","v":"2018-19"},{"$f":"CRCP_y5","v":"2019-20"},{"$f":"FRCP_y1","v":"2020-21"},{"$f":"FRCP_y2","v":"2021-22"},{"$f":"FRCP_y3","v":"2022-23"},{"$f":"FRCP_y4","v":"2023-24"},{"$f":"FRCP_y5","v":"2024-25"}]
[null,"A. DIRECT INTERNAL LABOUR EXPENDITURE"]
[null,{"$f":"IF(ISBLANK(dms_E13_Projects_01),\"\",dms_E13_Projects_01)","v":"Other capex - Allocations - Facilities projects"},55771.997352875333,114490.23160205674,257162.55796724951,218023.15844745148,98455.317482669925,98784.233833755367,99086.051812916659]
[null,{"$f":"IF(ISBLANK(dms_E13_Projects_02),\"\",dms_E13_Projects_02)","v":"Other capex - Facility upgrade projects - TRS"},246763.46592360438,493106.45952598948,112902.95658799843,244943.80701783832,788414.48159434122,332360.11040100572,356220.58416014758]
[null,{"$f":"IF(ISBLANK(dms_E13_Projects_03),\"\",dms_E13_Projects_03)","v":"Other capex - Facility upgrade projects - PRS"},377183.48635658843,1670904.0220619391,837151.79102581332,585340.19155825255,195324.62914507289,91063.357161125168,86061.174411319065]
[null,{"$f":"IF(ISBLANK(dms_E13_Projects_04),\"\",dms_E13_Projects_04)","v":"Other capex - Mains relocation projects"},60817.743730573216,101820.9282035988,63290.414370829763,63347.279006807265,63412.225587222776,63474.993141816063,63532.453955369543]
[null,{"$f":"IF(ISBLANK(dms_E13_Projects_05),\"\",dms_E13_Projects_05)","v":"Other capex - Allocations - Networks projects"},91554.868333658233,63484.165478497423,84600.425141604312,84725.053808405952,84867.480288992578,85005.221819981045,85131.400663075794]
[null,{"$f":"IF(ISBLANK(dms_E13_Projects_06),\"\",dms_E13_Projects_06)","v":"Other capex - Networks upgrade projects"},1152.4946049707623,193410.55191166414,834629.0011916256,1204023.7193444034,135114.77999695597,47909.666524257394,47985.763413399429]
[null,{"$f":"IF(ISBLANK(dms_E13_Projects_07),\"\",dms_E13_Projects_07)","v":"Other capex - Non Network General - Property"},5773.878547725466,10267.830656880224,19706.025670046896,12962.296804034477,11909.895198016431,15012.665634409252,6626.7917883858327]
[null,{"$f":"IF(ISBLANK(dms_E13_Projects_08),\"\",dms_E13_Projects_08)","v":"Other capex - Pipes upgrade projects"},20674.202294756535,142690.0366716148,0,0,0,0,0]
[null,{"$f":"IF(ISBLANK(dms_E13_Projects_09),\"\",dms_E13_Projects_09)","v":"Other capex - Pipes washaway projects"},17507.662564536568,35048.750467434947,35077.193957433134,35117.925750215109,35164.458802209701,35209.444090507532,35250.637964238711]
[null,{"$f":"IF(ISBLANK(dms_E13_Projects_10),\"\",dms_E13_Projects_10)","v":"Other capex - Pigging facilities projects"},115667.42606896212,333611.4004756111,200663.64806871073,372622.96532374748,52017.963402070105,361732.43940078357,959274.19149513938]
[null,{"$f":"IF(ISBLANK(dms_E13_Projects_11),\"\",dms_E13_Projects_11)","v":"Other capex - Pigging & Validation digs"},250455.67189833464,245612.88108816723,0,0,0,0,0]
[null,{"$f":"IF(ISBLANK(dms_E13_Projects_12),\"\",dms_E13_Projects_12)","v":"Other capex - Primary mains integrity projects - SPM"},22043.431064006276,472189.96799329302,1003811.565999371,143850.51569704112,62867.957165491913,1153.2266587777567,0]
[null,{"$f":"IF(ISBLANK(dms_E13_Projects_13),\"\",dms_E13_Projects_13)","v":"Other capex - Allocations - Pipes projects"},19165.885651029093,29207.292056195787,29230.994964527617,29264.938125179255,29303.715668508092,29341.203408756275,29375.531636865595]
[null,{"$f":"IF(ISBLANK(dms_E13_Projects_14),\"\",dms_E13_Projects_14)","v":"Other capex - Non Network General - Vehicles"},0,0,0,0,0,0,0]
[null,{"$f":"IF(ISBLANK(dms_E13_Projects_15),\"\",dms_E13_Projects_15)","v":"Other capex - Non Network General - Plant & Equipt"},0,0,0,0,0,0,0]
[null,"Aggregate of other projects with total expenditure of less than $500,000",61547.638108327053,203637.92888168618,149571.85187159386,4163.5411528535187,21389.314982083626,96469.787713772152,1716.60965992813]
[null,"Total",{"$f":"SUM(C28:C43)","v":1346079.8524999481},{"$f":"SUM(D28:D43)","v":4109482.4470746289},3627798.4268168039,2998385.3920362303,1578242.2193136353,1257516.3497889475,1770261.1909607858]
[]
[null,"B. DIRECT CONTRACTOR EXPENDITURE"]
[null,{"$f":"IF(ISBLANK(dms_E13_Projects_01),\"\",dms_E13_Projects_01)","v":"Other capex - Allocations - Facilities projects"}]
[null,{"$f":"IF(ISBLANK(dms_E13_Projects_02),\"\",dms_E13_Projects_02)","v":"Other capex - Facility upgrade projects - TRS"}]
[null,{"$f":"IF(ISBLANK(dms_E13_Projects_03),\"\",dms_E13_Projects_03)","v":"Other capex - Facility upgrade projects - PRS"}]
[null,{"$f":"IF(ISBLANK(dms_E13_Projects_04),\"\",dms_E13_Projects_04)","v":"Other capex - Mains relocation projects"}]
[null,{"$f":"IF(ISBLANK(dms_E13_Projects_05),\"\",dms_E13_Projects_05)","v":"Other capex - Allocations - Networks projects"}]
[null,{"$f":"IF(ISBLANK(dms_E13_Projects_06),\"\",dms_E13_Projects_06)","v":"Other capex - Networks upgrade projects"}]
[null,{"$f":"IF(ISBLANK(dms_E13_Projects_07),\"\",dms_E13_Projects_07)","v":"Other capex - Non Network General - Property"}]
[null,{"$f":"IF(ISBLANK(dms_E13_Projects_08),\"\",dms_E13_Projects_08)","v":"Other capex - Pipes upgrade projects"}]
[null,{"$f":"IF(ISBLANK(dms_E13_Projects_09),\"\",dms_E13_Projects_09)","v":"Other capex - Pipes washaway projects"}]
[null,{"$f":"IF(ISBLANK(dms_E13_Projects_10),\"\",dms_E13_Projects_10)","v":"Other capex - Pigging facilities projects"}]
[null,{"$f":"IF(ISBLANK(dms_E13_Projects_11),\"\",dms_E13_Projects_11)","v":"Other capex - Pigging & Validation digs"}]
[null,{"$f":"IF(ISBLANK(dms_E13_Projects_12),\"\",dms_E13_Projects_12)","v":"Other capex - Primary mains integrity projects - SPM"}]
[null,{"$f":"IF(ISBLANK(dms_E13_Projects_13),\"\",dms_E13_Projects_13)","v":"Other capex - Allocations - Pipes projects"}]
[null,{"$f":"IF(ISBLANK(dms_E13_Projects_14),\"\",dms_E13_Projects_14)","v":"Other capex - Non Network General - Vehicles"}]
[null,{"$f":"IF(ISBLANK(dms_E13_Projects_15),\"\",dms_E13_Projects_15)","v":"Other capex - Non Network General - Plant & Equipt"}]
[null,"Aggregate of other projects with total expenditure of less than $500,000"]
[null,"Total"]
[]
[null,"C. OTHER INTERNAL DIRECT EXPENDITURE"]
[null,{"$f":"IF(ISBLANK(dms_E13_Projects_01),\"\",dms_E13_Projects_01)","v":"Other capex - Allocations - Facilities projects"},24633.525501942881,50906.956498099651,116013.90381410773,98148.018152909295,43577.217337509479,43722.618828905506,43856.040625133202]
[null,{"$f":"IF(ISBLANK(dms_E13_Projects_02),\"\",dms_E13_Projects_02)","v":"Other capex - Facility upgrade projects - TRS"},113333.40336130126,214638.04923087737,49144.094315335547,106618.47942537925,343178.92829360487,144668.81210034332,155054.73473925944]
[null,{"$f":"IF(ISBLANK(dms_E13_Projects_03),\"\",dms_E13_Projects_03)","v":"Other capex - Facility upgrade projects - PRS"},176376.22004209348,800567.7379411686,477216.61200730596,402327.47586362954,95382.652805211823,41557.64887907204,39274.854121378477]
[null,{"$f":"IF(ISBLANK(dms_E13_Projects_04),\"\",dms_E13_Projects_04)","v":"Other capex - Mains relocation projects"},128934.04573875311,215861.08607257548,134176.12493919278,134296.67836860841,134434.36557724551,134567.43323576788,134689.25056585023]
[null,{"$f":"IF(ISBLANK(dms_E13_Projects_05),\"\",dms_E13_Projects_05)","v":"Other capex - Allocations - Networks projects"},227044.35781453244,157432.60675039445,184204.73373585701,184484.07760218551,184803.32497632451,185112.08357516385,185394.93453060568]
[null,{"$f":"IF(ISBLANK(dms_E13_Projects_06),\"\",dms_E13_Projects_06)","v":"Other capex - Networks upgrade projects"},2858.0391434422872,302335.61313399801,1119707.0448816195,1658426.3861839408,302995.90689061908,118809.84230643576,118998.55285390736]
[null,{"$f":"IF(ISBLANK(dms_E13_Projects_07),\"\",dms_E13_Projects_07)","v":"Other capex - Non Network General - Property"},570900.7784158315,1009897.2571685148,1938195.3149507281,1274912.7275708369,1171403.2784112722,1476577.7069783227,651781.18675275287]
[null,{"$f":"IF(ISBLANK(dms_E13_Projects_08),\"\",dms_E13_Projects_08)","v":"Other capex - Pipes upgrade projects"},26128.39276000738,180333.9866729166,0,0,0,0,0]
[null,{"$f":"IF(ISBLANK(dms_E13_Projects_09),\"\",dms_E13_Projects_09)","v":"Other capex - Pipes washaway projects"},22126.468401245591,44295.180288184209,44331.127632973745,44382.60513447311,44441.414361620176,44498.267499860282,44550.328986770823]
[null,{"$f":"IF(ISBLANK(dms_E13_Projects_10),\"\",dms_E13_Projects_10)","v":"Other capex - Pigging facilities projects"},146182.37234891817,421623.50820440834,253601.97867101859,470926.95769194304,65741.147298809621,457163.33408889786,1212346.3088237476]
[null,{"$f":"IF(ISBLANK(dms_E13_Projects_11),\"\",dms_E13_Projects_11)","v":"Other capex - Pigging & Validation digs"},316529.94737267058,310409.54966452293,0,0,0,0,0]
[null,{"$f":"IF(ISBLANK(dms_E13_Projects_12),\"\",dms_E13_Projects_12)","v":"Other capex - Primary mains integrity projects - SPM"},27858.846324850951,596761.35336032626,1268633.3663341228,181800.61891989721,79453.545700087532,1457.4665881787571,0]
[null,{"$f":"IF(ISBLANK(dms_E13_Projects_13),\"\",dms_E13_Projects_13)","v":"Other capex - Allocations - Pipes projects"},24222.157679596949,36912.650240153504,36942.606360811456,36985.504278727589,37034.511968016814,37081.8895832169,37125.274155642357]
[null,{"$f":"IF(ISBLANK(dms_E13_Projects_14),\"\",dms_E13_Projects_14)","v":"Other capex - Non Network General - Vehicles"},1730788.7343915978,4897244.1400713651,5853464.1525960425,5073704.7515301434,3590581.296124395,1440974.2985913751,2618516.3670929191]
[null,{"$f":"IF(ISBLANK(dms_E13_Projects_15),\"\",dms_E13_Projects_15)","v":"Other capex - Non Network General - Plant & Equipt"},259973.49061644948,579084.43101561686,579084.43101561686,579084.43101561686,579084.43101561686,579084.43101561686,579084.43101561686]
[null,"Aggregate of other projects with total expenditure of less than $500,000",62125.299577986822,272467.89022118971,74546.196910196915,1812.294959185645,9310.2833139766008,41991.108906797133,747.20122111588717]
[null,"Total",{"$f":"SUM(C66:C81)","v":3860016.0794912209},{"$f":"SUM(D66:D81)","v":10090771.996534312},12129261.688164929,10247911.006697476,6681422.3040743107,4747266.9421779541,5821419.4654847002]
[]
[null,"D. TOTAL OVERHEAD EXPENDITURE"]
[null,{"$f":"IF(ISBLANK(dms_E13_Projects_01),\"\",dms_E13_Projects_01)","v":"Other capex - Allocations - Facilities projects"},44108.107467647147,88128.400741998194,151934.79836478044,87933.373877789665,42206.176346959342,41202.194511467125,41087.412106922675]
[null,{"$f":"IF(ISBLANK(dms_E13_Projects_02),\"\",dms_E13_Projects_02)","v":"Other capex - Facility upgrade projects - TRS"},197441.06683068181,359819.62777458783,61032.99935889124,90858.376547874257,324054.01422693161,132914.39893048297,141628.20984568924]
[null,{"$f":"IF(ISBLANK(dms_E13_Projects_03),\"\",dms_E13_Projects_03)","v":"Other capex - Facility upgrade projects - PRS"},329413.54988693853,1424638.0372776326,609890.96761870058,342816.2873804117,95262.566997144226,40917.473795207152,38445.015591191586]
[null,{"$f":"IF(ISBLANK(dms_E13_Projects_04),\"\",dms_E13_Projects_04)","v":"Other capex - Mains relocation projects"},162684.73055229627,260736.90523321263,120065.61054887666,82460.843052696931,91465.456277134712,89081.412785953507,88643.660360798865]
[null,{"$f":"IF(ISBLANK(dms_E13_Projects_05),\"\",dms_E13_Projects_05)","v":"Other capex - Allocations - Networks projects"},139580.0287201092,92652.303808999248,99607.159701228229,68447.552567800594,75969.466599968437,74034.053744707693,73710.981353293333]
[null,{"$f":"IF(ISBLANK(dms_E13_Projects_06),\"\",dms_E13_Projects_06)","v":"Other capex - Networks upgrade projects"},1757.0363323044737,358364.89371763763,1204464.24086002,1182855.454963794,118826.91494335601,38320.655937089185,38158.369755785345]
[null,{"$f":"IF(ISBLANK(dms_E13_Projects_07),\"\",dms_E13_Projects_07)","v":"Other capex - Non Network General - Property"},0,0,0,0,0,0,0]
[null,{"$f":"IF(ISBLANK(dms_E13_Projects_08),\"\",dms_E13_Projects_08)","v":"Other capex - Pipes upgrade projects"},42789.862635010781,282718.83788637177,0,0,0,0,0]
[null,{"$f":"IF(ISBLANK(dms_E13_Projects_09),\"\",dms_E13_Projects_09)","v":"Other capex - Pipes washaway projects"},36236.003958742462,69443.825460126289,51487.426086177999,35370.752916175523,39244.941840500396,38233.076380981314,38055.258353743659]
[null,{"$f":"IF(ISBLANK(dms_E13_Projects_10),\"\",dms_E13_Projects_10)","v":"Other capex - Pigging facilities projects"},239399.47971252253,661000.79338526377,294540.51429137238,375305.61830743036,58054.126749342642,392796.43125116709,1035596.2132220231]
[null,{"$f":"IF(ISBLANK(dms_E13_Projects_11),\"\",dms_E13_Projects_11)","v":"Other capex - Pigging & Validation digs"},518373.7512042796,486644.96786820004,0,0,0,0,0]
[null,{"$f":"IF(ISBLANK(dms_E13_Projects_12),\"\",dms_E13_Projects_12)","v":"Other capex - Primary mains integrity projects - SPM"},45623.786291013734,935573.3737730782,1473426.6906173381,144886.14970527706,70163.153554229037,1252.260695065075,0]
[null,{"$f":"IF(ISBLANK(dms_E13_Projects_13),\"\",dms_E13_Projects_13)","v":"Other capex - Allocations - Pipes projects"},39668.065669158001,57869.854550105243,42906.188405148336,29475.627430146273,32704.118200417,31860.896984151099,31712.715294786383]
[null,{"$f":"IF(ISBLANK(dms_E13_Projects_14),\"\",dms_E13_Projects_14)","v":"Other capex - Non Network General - Vehicles"},0,0,0,0,0,0,0]
[null,{"$f":"IF(ISBLANK(dms_E13_Projects_15),\"\",dms_E13_Projects_15)","v":"Other capex - Non Network General - Plant & Equipt"},0,0,0,0,0,0,0]
[null,"Aggregate of other projects with total expenditure of less than $500,000",136787.52339368314,215325.94864179939,83351.773623035289,1544.4056105939671,8791.4333682605065,38579.310355435824,682.49945104308426]
[null,"Total",{"$f":"SUM(C85:C100)","v":1933862.9926543876},{"$f":"SUM(D85:D100)","v":5292917.7701190133},4192708.3694755691,2441954.44235999,956742.36910424405,919192.16537170799,1527720.3353352773]
[]
[null,"E. RELATED PARTY MARGIN EXPENDITURE"]
[null,{"$f":"IF(ISBLANK(dms_E13_Projects_01),\"\",dms_E13_Projects_01)","v":"Other capex - Allocations - Facilities projects"},0,0,0,0,0,0,0]
[null,{"$f":"IF(ISBLANK(dms_E13_Projects_02),\"\",dms_E13_Projects_02)","v":"Other capex - Facility upgrade projects - TRS"},0,0,0,0,0,0,0]
[null,{"$f":"IF(ISBLANK(dms_E13_Projects_03),\"\",dms_E13_Projects_03)","v":"Other capex - Facility upgrade projects - PRS"},0,0,0,0,0,0,0]
[null,{"$f":"IF(ISBLANK(dms_E13_Projects_04),\"\",dms_E13_Projects_04)","v":"Other capex - Mains relocation projects"},0,0,0,0,0,0,0]
[null,{"$f":"IF(ISBLANK(dms_E13_Projects_05),\"\",dms_E13_Projects_05)","v":"Other capex - Allocations - Networks projects"},0,0,0,0,0,0,0]
[null,{"$f":"IF(ISBLANK(dms_E13_Projects_06),\"\",dms_E13_Projects_06)","v":"Other capex - Networks upgrade projects"},0,0,0,0,0,0,0]
[null,{"$f":"IF(ISBLANK(dms_E13_Projects_07),\"\",dms_E13_Projects_07)","v":"Other capex - Non Network General - Property"},0,0,0,0,0,0,0]
[null,{"$f":"IF(ISBLANK(dms_E13_Projects_08),\"\",dms_E13_Projects_08)","v":"Other capex - Pipes upgrade projects"},0,0,0,0,0,0,0]
[null,{"$f":"IF(ISBLANK(dms_E13_Projects_09),\"\",dms_E13_Projects_09)","v":"Other capex - Pipes washaway projects"},0,0,0,0,0,0,0]
[null,{"$f":"IF(ISBLANK(dms_E13_Projects_10),\"\",dms_E13_Projects_10)","v":"Other capex - Pigging facilities projects"},0,0,0,0,0,0,0]
[null,{"$f":"IF(ISBLANK(dms_E13_Projects_11),\"\",dms_E13_Projects_11)","v":"Other capex - Pigging & Validation digs"},0,0,0,0,0,0,0]
[null,{"$f":"IF(ISBLANK(dms_E13_Projects_12),\"\",dms_E13_Projects_12)","v":"Other capex - Primary mains integrity projects - SPM"},0,0,0,0,0,0,0]
[null,{"$f":"IF(ISBLANK(dms_E13_Projects_13),\"\",dms_E13_Projects_13)","v":"Other capex - Allocations - Pipes projects"},0,0,0,0,0,0,0]
[null,{"$f":"IF(ISBLANK(dms_E13_Projects_14),\"\",dms_E13_Projects_14)","v":"Other capex - Non Network General - Vehicles"},0,0,0,0,0,0,0]
[null,{"$f":"IF(ISBLANK(dms_E13_Projects_15),\"\",dms_E13_Projects_15)","v":"Other capex - Non Network General - Plant & Equipt"},0,0,0,0,0,0,0]
[null,"Aggregate of other projects with total expenditure of less than $500,000",0,0,0,0,0,0,0]
[null,"Total",{"$f":"SUM(C104:C119)","v":0},{"$f":"SUM(D104:D119)","v":0},0,0,0,0,0]
[]
[null,"F. CUSTOMER CONTRIBUTIONS included in the above"]
[null,{"$f":"IF(ISBLANK(dms_E13_Projects_01),\"\",dms_E13_Projects_01)","v":"Other capex - Allocations - Facilities projects"},0,0,0,0,0,0,0]
[null,{"$f":"IF(ISBLANK(dms_E13_Projects_02),\"\",dms_E13_Projects_02)","v":"Other capex - Facility upgrade projects - TRS"},0,0,0,0,0,0,0]
[null,{"$f":"IF(ISBLANK(dms_E13_Projects_03),\"\",dms_E13_Projects_03)","v":"Other capex - Facility upgrade projects - PRS"},0,0,0,0,0,0,0]
[null,{"$f":"IF(ISBLANK(dms_E13_Projects_04),\"\",dms_E13_Projects_04)","v":"Other capex - Mains relocation projects"},0,0,0,0,0,0,0]
[null,{"$f":"IF(ISBLANK(dms_E13_Projects_05),\"\",dms_E13_Projects_05)","v":"Other capex - Allocations - Networks projects"},0,0,0,0,0,0,0]
[null,{"$f":"IF(ISBLANK(dms_E13_Projects_06),\"\",dms_E13_Projects_06)","v":"Other capex - Networks upgrade projects"},0,0,0,0,0,0,0]
[null,{"$f":"IF(ISBLANK(dms_E13_Projects_07),\"\",dms_E13_Projects_07)","v":"Other capex - Non Network General - Property"},0,0,0,0,0,0,0]
[null,{"$f":"IF(ISBLANK(dms_E13_Projects_08),\"\",dms_E13_Projects_08)","v":"Other capex - Pipes upgrade projects"},0,0,0,0,0,0,0]
[null,{"$f":"IF(ISBLANK(dms_E13_Projects_09),\"\",dms_E13_Projects_09)","v":"Other capex - Pipes washaway projects"},0,0,0,0,0,0,0]
[null,{"$f":"IF(ISBLANK(dms_E13_Projects_10),\"\",dms_E13_Projects_10)","v":"Other capex - Pigging facilities projects"},0,0,0,0,0,0,0]
[null,{"$f":"IF(ISBLANK(dms_E13_Projects_11),\"\",dms_E13_Projects_11)","v":"Other capex - Pigging & Validation digs"},0,0,0,0,0,0,0]
[null,{"$f":"IF(ISBLANK(dms_E13_Projects_12),\"\",dms_E13_Projects_12)","v":"Other capex - Primary mains integrity projects - SPM"},0,0,0,0,0,0,0]
[null,{"$f":"IF(ISBLANK(dms_E13_Projects_13),\"\",dms_E13_Projects_13)","v":"Other capex - Allocations - Pipes projects"},0,0,0,0,0,0,0]
[null,{"$f":"IF(ISBLANK(dms_E13_Projects_14),\"\",dms_E13_Projects_14)","v":"Other capex - Non Network General - Vehicles"},0,0,0,0,0,0,0]
[null,{"$f":"IF(ISBLANK(dms_E13_Projects_15),\"\",dms_E13_Projects_15)","v":"Other capex - Non Network General - Plant & Equipt"},0,0,0,0,0,0,0]
[null,"Aggregate of other projects with total expenditure of less than $500,000",0,0,0,0,0,0,0]
[null,"Total",{"$f":"SUM(C123:C138)","v":0},{"$f":"SUM(D123:D138)","v":0},0,0,0,0,0]

{"sheet":"E17. Step changes","index":15,"n_rows":70,"n_cols":10,"rows_kept":70,"cut":false,"hidden":false,"merged":[[7,3,7,9],[8,3,8,9],[41,3,41,9],[42,3,42,9],[69,1,69,2],[23,3,23,9],[24,3,24,9],[36,1,36,2],[20,1,20,2]]}
[null,{"$f":"IF(dms_MultiYear_ResponseFlag=\"Yes\",\"REGULATORY REPORTING STATEMENT - HISTORICAL INFORMATION\",INDEX(dms_Worksheet_List,MATCH(dms_Model,dms_Model_List)))","v":"REGULATORY REPORTING STATEMENT"}]
[null,{"$f":"INDEX(dms_TradingNameFull_List,MATCH(dms_TradingName,dms_TradingName_List))","v":"Jemena Gas Networks (NSW) Ltd"}]
[null,{"$f":"IF(SUM(dms_SingleYear_Model)>0,CONCATENATE(CRY),CONCATENATE(FRCP_y1,\" to \",dms_MultiYear_FinalYear_Result))","v":"2020-21 to 2024-25"}]
[null,"E17. STEP CHANGES"]
[]
[null,"E17.1 - STEP CHANGES FOR REFERENCE SERVICES"]
[null,"E17.1.1 - FORECAST OPEX"]
[null,null,null,"EXPENDITURE"]
[null,null,null,{"$f":"CONCATENATE(\"$0's, real \",dms_DollarReal)","v":"$0's, real June 2020"}]
[null,"Step change","Description",{"$f":"CRCP_y4","v":"2018-19"},{"$f":"CRCP_y5","v":"2019-20"},{"$f":"FRCP_y1","v":"2020-21"},{"$f":"FRCP_y2","v":"2021-22"},{"$f":"FRCP_y3","v":"2022-23"},{"$f":"FRCP_y4","v":"2023-24"},{"$f":"FRCP_y5","v":"2024-25"}]
[null,"Expensing of corporate overheads","Negative adjustment to account for capitalised corporate overheads in the first half of 2020-21",0,0,-8419058.3444811665,0,0,0,0]
[null,"Pigging and inspection costs","Pigging and inspection costs to be expensed from 2020-21 onwards",0,0,0,0,3319065.4390144851,1296801.1382355106,3085514.0304299858]
[null,"",""]
[null,"",""]
[null,"",""]
[null,"",""]
[null,"",""]
[null,"",""]
[null,"",""]
[null,"",""]
[null,"Total",null,{"$f":"SUM(D11:D20)","v":0},0,-8419058.3444811665,0,3319065.4390144851,1296801.1382355106,3085514.0304299858]
[]
[null,"E17.1.2 - FORECAST CAPEX"]
[null,null,null,"EXPENDITURE"]
[null,null,null,{"$f":"CONCATENATE(\"$0's, real \", dms_DollarReal)","v":"$0's, real June 2020"}]
[null,"Step change","Description",{"$f":"CRCP_y4","v":"2018-19"},{"$f":"CRCP_y5","v":"2019-20"},{"$f":"FRCP_y1","v":"2020-21"},{"$f":"FRCP_y2","v":"2021-22"},{"$f":"FRCP_y3","v":"2022-23"},{"$f":"FRCP_y4","v":"2023-24"},{"$f":"FRCP_y5","v":"2024-25"}]
[null,"None to report",""]
[null,"",""]
[null,"",""]
[null,"",""]
[null,"",""]
[null,"",""]
[null,"",""]
[null,"",""]
[null,"",""]
[null,"",""]
[null,"Total",null,{"$f":"SUM(D27:D36)","v":0},0,0,0,0,0,0]
[]
[]
[]
[null,"E17.2 - CATEGORY SPECIFIC FORECASTS"]
[null,null,null,"EXPENDITURE"]
[null,null,null,{"$f":"CONCATENATE(\"$0's, real \",dms_DollarReal)","v":"$0's, real June 2020"}]
[null,"Category desription",null,{"$f":"CRCP_y4","v":"2018-19"},{"$f":"CRCP_y5","v":"2019-20"},{"$f":"FRCP_y1","v":"2020-21"},{"$f":"FRCP_y2","v":"2021-22"},{"$f":"FRCP_y3","v":"2022-23"},{"$f":"FRCP_y4","v":"2023-24"},{"$f":"FRCP_y5","v":"2024-25"}]
[null,"Total UAG (tariff and demand market)","",24066133.989852618,24108825.012517869,31201028.824622821,31630239.980120197,31739908.601793408,31564196.426002137,31393628.150188956]
[null,"Total Government levies (Mains tax and licence fees)","",4833680.8913637334,4842255.3795044888,4833680.8913637334,4833680.8913637334,4833680.8913637334,4833680.8913637334,4833680.8913637334]
[null,"",""]
[null,"",""]
[null,"",""]
[null,"",""]
[null,"",""]
[null,"",""]
[null,"",""]
[null,"",""]
[null,"",""]
[null,"",""]
[null,"",""]
[null,"",""]
[null,"",""]
[null,"",""]
[null,"",""]
[null,"",""]
[null,"",""]
[null,"",""]
[null,"",""]
[null,"",""]
[null,"",""]
[null,"",""]
[null,"",""]
[null,"Total",null,{"$f":"SUM(D45:D69)","v":28899814.881216351},28951080.392022356,36034709.715986557,36463920.871483929,36573589.493157141,36397877.31736587,36227309.041552693]

{"sheet":"E20. Opex","index":16,"n_rows":203,"n_cols":12,"rows_kept":203,"cut":false,"hidden":false,"merged":[[40,2,40,11],[90,2,90,11],[91,2,91,11],[25,2,25,11],[26,2,26,11],[6,1,6,2],[13,2,13,11],[14,2,14,11],[6,5,6,7],[7,5,7,6],[7,7,8,7],[8,5,8,6],[9,5,9,6],[174,2,174,11],[175,2,175,11],[125,2,125,11],[41,2,41,11],[124,2,124,11]]}
[null,{"$f":"IF(dms_MultiYear_ResponseFlag=\"Yes\",\"REGULATORY REPORTING STATEMENT - HISTORICAL INFORMATION\",INDEX(dms_Worksheet_List,MATCH(dms_Model,dms_Model_List)))","v":"REGULATORY REPORTING STATEMENT"}]
[null,{"$f":"INDEX(dms_TradingNameFull_List,MATCH(dms_TradingName,dms_TradingName_List))","v":"Jemena Gas Networks (NSW) Ltd"}]
[null,{"$f":"IF(SUM(dms_SingleYear_Model)>0,CONCATENATE(CRY),CONCATENATE(FRCP_y1,\" to \",dms_MultiYear_FinalYear_Result))","v":"2020-21 to 2024-25"}]
[null,"E20. OPERATING EXPENDITURE"]
[]
[null,"Instructions"]
[null,"This template asks for information relating to a base-step-trend approach to forecasting operating expenditure.\n\n\n\nStep changes should be EXCLUSIVE of base level opex",null,null,null,"IMPORTANT!"]
[null,null,null,null,null,{"$f":"CONCATENATE(\"Has \",dms_TradingName,\" used a base-step-trend model to derive its opex forecast? \")","v":"Has JGN used a base-step-trend model to derive its opex forecast? "},null,"Yes"]
[null,null,null,null,null,"Yes /  No"]
[null,null,null,null,null,"Please nominate the base year.",null,"2018-19"]
[null,null,null,null,"2015-16","2016-17","2017-18","2018-19","2019-20"]
[null,"E20.1 - OPEX BY  DRIVER"]
[null,"E20.1.1 - REFERENCE SERVICES  "]
[null,null,"EXPENDITURE"]
[null,null,{"$f":"CONCATENATE(\"$0's, real \",dms_DollarReal)","v":"$0's, real June 2020"}]
[null,null,{"$f":"CRCP_y1","v":"2015-16"},{"$f":"CRCP_y2","v":"2016-17"},{"$f":"CRCP_y3","v":"2017-18"},{"$f":"CRCP_y4","v":"2018-19"},{"$f":"CRCP_y5","v":"2019-20"},{"$f":"FRCP_y1","v":"2020-21"},{"$f":"FRCP_y2","v":"2021-22"},{"$f":"FRCP_y3","v":"2022-23"},{"$f":"FRCP_y4","v":"2023-24"},{"$f":"FRCP_y5","v":"2024-25"}]
[null,"Base year total opex, excluding category specific",null,188718521.96692806,183196853.78107646,148352850.5256691,148301585.0148631,164326657.83866176,164326657.83866176,164326657.83866176,164326657.83866176,164326657.83866176]
[null,"Increment from base year to final year",null,null,null,null,-813043.86516367795,"","","","",""]
[null,"Price growth",null,null,null,null,null,719390.30054679245,1753246.2315632075,2940369.9409814896,4094681.7060784646,5157641.3938888749]
[null,"Output growth",null,null,null,null,null,2776416.9478421328,5269357.5416946271,7694926.7630653987,10168210.521011388,12764663.940205395]
[null,"Productivity growth",null,null,null,null,null,-1233495.1183898046,-2509577.430209775,-3829624.9224329428,-5192928.7738279868,-6599914.9425024781]
[null,"Step changes",null,null,null,null,null,-8419058.3444811665,0,3319065.4390144851,1296801.1382355106,3085514.0304299858]
[null,"Category specific",null,null,null,{"$f":"IF(ISBLANK('E17. Step changes'!D70),\"\",'E17. Step changes'!D70)","v":28899814.881216351},{"$f":"IF(ISBLANK('E17. Step changes'!E70),\"\",'E17. Step changes'!E70)","v":28951080.392022356},{"$f":"IF(ISBLANK('E17. Step changes'!F70),\"\",'E17. Step changes'!F70)","v":36034709.715986557},{"$f":"IF(ISBLANK('E17. Step changes'!G70),\"\",'E17. Step changes'!G70)","v":36463920.871483929},{"$f":"IF(ISBLANK('E17. Step changes'!H70),\"\",'E17. Step changes'!H70)","v":36573589.493157141},{"$f":"IF(ISBLANK('E17. Step changes'!I70),\"\",'E17. Step changes'!I70)","v":36397877.31736587},{"$f":"IF(ISBLANK('E17. Step changes'!J70),\"\",'E17. Step changes'!J70)","v":36227309.041552693}]
[]
[null,"E20.1.2 - NON-REFERENCE SERVICES  "]
[null,null,"EXPENDITURE"]
[null,null,{"$f":"CONCATENATE(\"$0's, real \",dms_DollarReal)","v":"$0's, real June 2020"}]
[null,null,{"$f":"CRCP_y1","v":"2015-16"},{"$f":"CRCP_y2","v":"2016-17"},{"$f":"CRCP_y3","v":"2017-18"},{"$f":"CRCP_y4","v":"2018-19"},{"$f":"CRCP_y5","v":"2019-20"},{"$f":"FRCP_y1","v":"2020-21"},{"$f":"FRCP_y2","v":"2021-22"},{"$f":"FRCP_y3","v":"2022-23"},{"$f":"FRCP_y4","v":"2023-24"},{"$f":"FRCP_y5","v":"2024-25"}]
[null,"Base year total opex, excluding category specific",null,148352850.5256691,148352850.5256691,148352850.5256691,111347.40834358885,111347.40834358885,111347.40834358885,111347.40834358885,111347.40834358885,111347.40834358885]
[null,"Increment from base year to final year"]
[null,"Price growth"]
[null,"Output growth"]
[null,"Productivity growth"]
[null,"Step changes"]
[null,"Category specific"]
[]
[]
[]
[null,"E20.2 - OPEX BY CATEGORY"]
[null,"E20.2.1 - REFERENCE SERVICES"]
[null,null,"EXPENDITURE"]
[null,null,{"$f":"CONCATENATE(\"$0's, real \",dms_DollarReal)","v":"$0's, real June 2020"}]
[null,null,{"$f":"CRCP_y1","v":"2015-16"},{"$f":"CRCP_y2","v":"2016-17"},{"$f":"CRCP_y3","v":"2017-18"},{"$f":"CRCP_y4","v":"2018-19"},{"$f":"CRCP_y5","v":"2019-20"},{"$f":"FRCP_y1","v":"2020-21"},{"$f":"FRCP_y2","v":"2021-22"},{"$f":"FRCP_y3","v":"2022-23"},{"$f":"FRCP_y4","v":"2023-24"},{"$f":"FRCP_y5","v":"2024-25"}]
[null,"A. OPERATING EXPENDITURE"]
[null,"Maintenance",null,null,null,33302840.762794044,33108817.139953543,33564631.67187921,34018109.435586266,34480035.574598677,34936248.947974227,35390071.794511355]
[null,"Emergency Response",null,null,null,4791973.6972051654,4764055.4753360311,4829643.0107462816,4894894.3066170942,4961361.2462984668,5027006.1713395547,5092307.1214682981]
[null,"Management",null,null,null,5561770.8002160303,5529367.7110095341,5605491.4258612292,5681224.8866400756,5758369.2759165,5834559.5996423699,5910350.6912888475]
[null,"Network planning",null,null,null,8448441.4786199331,8399220.5357366074,8514853.9865135998,8629894.6335209515,8747078.5092355758,8862813.1402293798,8977941.3296814002]
[null,"Network control and operational switching",null,null,null,7189035.5235279901,7147151.9278630083,7245547.9441516502,7343439.5257029245,7443154.8456739569,7541636.9592830073,7639603.0333600501]
[null,"Project governance and related functions",null,null,null,992769.10429581604,986985.19355884334,1000573.1810764252,1014091.5087320198,1027861.6853528235,1041461.5624708093,1054990.1771639127]
[null,"Quality and standard functions",null,null,null,3889895.049866837,3867232.3726670058,3920473.1968965083,3973441.0779500529,4027395.7605054197,4080683.1708923234,4133691.3588975156]
[null,"Other network overheads",null,null,null,20818277.587862335,20696989.507134717,20981928.366308905,21265406.464529399,21554165.812584579,21839353.995595038,22123047.812054038]
[null,"Information technology",null,null,null,7527576.249656057,7483720.3027844531,7586749.9112557247,7689251.3305233009,7793662.3703469625,7896782.1305697653,7999361.5503098546]
[null,"Corporate overheads",null,null,null,23475181.313431352,23338414.010073893,40378139.207988501,40923671.435176097,41479367.02949059,42028190.185924582,42574137.546598099]
[null,"Pigging/integrity digs, adhoc, mains renewal",null,null,null,0,0,0,0,0,0,0]
[null,"Step changes",null,null,null,0,0,-8419058.3444811665,0,3319065.4390144851,1296801.1382355106,3085514.0304299858]
[null,"Transformation cost",null,null,null,13052416.143975751,0,0,0,0,0,0]
[null,"",null,null,null,0,0,0,0,0,0,0]
[null,"",null,null,null,0,0,0,0,0,0,0]
[null,"Total",null,null,null,{"$f":"SUM(F45:F59)","v":129050177.71145131},{"$f":"SUM(G45:G59)","v":115321954.17611763},125208973.55819684,135433424.60497817,140591517.54901806,140385537.00215659,143981016.44576335]
[null,"B. NON- OPERATING EXPENDITURE"]
[null,"Administration and overheads",null,null,null,0,0,0,0,0,0,0]
[null,"Corporate overheads",null,null,null,493570.72515265847,490695.16324776731,848959.04245047108,860428.97460443794,872112.5937334206,883651.71838106331,895130.37880566379]
[null,"Management administration and overheads",null,null,null,8684459.0203312524,8633863.030231297,8752726.8428284004,8870981.290957801,8991438.8415087089,9110406.660915684,9228751.0970949754]
[null,"Other direct expenditure",null,null,null,6937700.9144446785,6897281.6038161311,6992237.6142502567,7086706.8254013238,7182936.0155733703,7277975.1132945921,7372516.212651317]
[null,"Government levies",null,null,null,4833680.8913637334,4842255.3795044888,4833680.8913637334,4833680.8913637334,4833680.8913637334,4833680.8913637334,4833680.8913637334]
[null,"Marketing",null,null,null,4439513.2532990826,4413648.4794442393,4474411.9041005261,4534863.8203917956,4596441.9671570389,4657258.5603077291,4717756.478674572]
[null,"Unaccounted for gas expenditure",null,null,null,24066133.989852618,24108825.012517869,31201028.824622821,31630239.980120197,31739908.601793408,31564196.426002137,31393628.150188956]
[null,"Carbon costs",null,null,null,0,0,0,0,0,0,0]
[null,"Self insurance",null,null,null,0,0,0,0,0,0,0]
[null,"Debt raising costs",null,null,null,0,0,1820538.4000194748,1847247.2871377598,1864069.5144139533,1868403.2230860146,1865877.4801808631]
[null,"Step changes",null,null,null,0,0,0,0,0,0,0]
[null,"",null,null,null,0,0,0,0,0,0,0]
[null,"",null,null,null,0,0,0,0,0,0,0]
[null,"",null,null,null,0,0,0,0,0,0,0]
[null,"Total",null,null,null,{"$f":"SUM(F62:F75)","v":49455058.794444025},{"$f":"SUM(G62:G75)","v":49386568.66876179},58923583.519635685,59664149.069977045,60080588.425543636,60195572.593350954,60307340.688960075]
[null,"C. ANCILLARY REFERENCE SERVICES"]
[null,"Request for service",null,null,null,11684.980462452762,11804.262523614123,15009.013056708234,15576.979317099545,15538.500948818259,15500.43532838668,15454.340440218191]
[null,"Temporary disconnection",null,null,null,2937066.1004814454,3013769.2640244481,3729396.7528584143,3930331.6214404199,3977163.4575138111,4023636.9429281657,4070019.4354606071]
[null,"Permanent disconnection",null,null,null,0,0,0,0,0,0,0]
[null,"De-commissioning and meter removal",null,null,null,3365079.0897916029,3076239.8752761725,2904257.3045676784,2586179.3731767382,2642188.2341805175,2696994.0383284367,2751348.066699198]
[null,"Special meter reads",null,null,null,5486014.874230369,5629285.2950181272,4441920.4493727861,4681245.1340050548,4737024.4742365889,4792376.9987587985,4847621.1456613299]
[null,"Hourly charge non-standard requests",null,null,null,0,0,0,0,0,0,0]
[null,"Disconnection Wasted Truck Visit (NEW)",null,null,null,0,0,110271.39354666794,116212.66754860186,117597.39869103226,118971.53406444989,120342.9789459311]
[null,"Special Meter Read Wasted Truck Vist (NEW",null,null,null,0,0,362178.3647484284,381692.04670468392,386240.09533861559,390753.34294055821,395257.75381759362]
[null,"Out of hours reconnection (NEW)",null,null,null,0,0,329569.38420249749,342040.84318369272,341195.93139024783,340360.08275466331,339347.92666877178]
[null,"Total",null,null,null,{"$f":"SUM(F78:F86)","v":11799845.044965871},11731098.696842361,11892602.66235318,12053278.665376291,12216948.092299633,12378593.375103459,12539391.647693651]
[null,"TOTAL",null,null,null,{"$f":"SUM(F87,F76,F60)","v":190305081.55086121},176439621.54172176,196025159.74018571,207150852.34033149,212889054.06686133,212959702.97061101,216827748.78241706]
[]
[null,"E20.2.2 - NON-REFERENCE SERVICES"]
[null,null,"EXPENDITURE"]
[null,null,{"$f":"CONCATENATE(\"$0's, real \",dms_DollarReal)","v":"$0's, real June 2020"}]
[null,null,{"$f":"CRCP_y1","v":"2015-16"},{"$f":"CRCP_y2","v":"2016-17"},{"$f":"CRCP_y3","v":"2017-18"},{"$f":"CRCP_y4","v":"2018-19"},{"$f":"CRCP_y5","v":"2019-20"},{"$f":"FRCP_y1","v":"2020-21"},{"$f":"FRCP_y2","v":"2021-22"},{"$f":"FRCP_y3","v":"2022-23"},{"$f":"FRCP_y4","v":"2023-24"},{"$f":"FRCP_y5","v":"2024-25"}]
[null,"Maintenance",null,null,null,111347.40834358885,111347.40834358885,111347.40834358885,111347.40834358885,111347.40834358885,111347.40834358885,111347.40834358885]
[null,""]
[null,""]
[null,""]
[null,""]
[null,""]
[null,""]
[null,""]
[null,""]
[null,""]
[null,""]
[null,""]
[null,""]
[null,""]
[null,""]
[null,""]
[null,""]
[null,""]
[null,""]
[null,""]
[null,""]
[null,""]
[null,""]
[null,""]
[null,""]
[null,"Total",null,null,null,{"$f":"SUM(F94:F118)","v":111347.40834358885},{"$f":"SUM(G94:G118)","v":111347.40834358885},111347.40834358885,111347.40834358885,111347.40834358885,111347.40834358885,111347.40834358885]
[]
[]
[]
[null,"20.3 - OPEX BY CATEGORY - RELATED PARTY MARGIN EXPENDITURE"]
[null,"20.3.1 - REFERENCE SERVICES"]
[null,null,"EXPENDITURE"]
[null,null,{"$f":"CONCATENATE(\"$0's, real \",dms_DollarReal)","v":"$0's, real June 2020"}]
[null,null,{"$f":"CRCP_y1","v":"2015-16"},{"$f":"CRCP_y2","v":"2016-17"},{"$f":"CRCP_y3","v":"2017-18"},{"$f":"CRCP_y4","v":"2018-19"},{"$f":"CRCP_y5","v":"2019-20"},{"$f":"FRCP_y1","v":"2020-21"},{"$f":"FRCP_y2","v":"2021-22"},{"$f":"FRCP_y3","v":"2022-23"},{"$f":"FRCP_y4","v":"2023-24"},{"$f":"FRCP_y5","v":"2024-25"}]
[null,"A. OPERATING EXPENDITURE"]
[null,"Maintenance"]
[null,"Emergency Response"]
[null,"Management"]
[null,"Network planning"]
[null,"Network control and operational switching"]
[null,"Project governance and related functions"]
[null,"Quality and standard functions"]
[null,"Other network overheads"]
[null,"Information technology"]
[null,"Corporate overheads"]
[null,"Pigging/integrity digs, adhoc, mains renewal"]
[null,"Step changes"]
[null,{"$f":"IF(ISBLANK(B57),\"\",B57)","v":"Transformation cost"}]
[null,{"$f":"IF(ISBLANK(B58),\"\",B58)","v":""}]
[null,""]
[null,"Total",null,null,null,{"$f":"SUM(F129:F143)","v":0},{"$f":"SUM(G129:G143)","v":0},0,0,0,0,0]
[null,"B. NON- OPERATING EXPENDITURE"]
[null,"Administration and overheads"]
[null,"Corporate overheads"]
[null,"Management administration and overheads"]
[null,"Other direct expenditure"]
[null,"Government levies"]
[null,"Marketing"]
[null,"Unaccounted for gas expenditure"]
[null,"Carbon costs"]
[null,"Self insurance"]
[null,"Debt raising costs"]
[null,"Step changes"]
[null,{"$f":"IF(ISBLANK(B73),\"\",B73)","v":""}]
[null,{"$f":"IF(ISBLANK(B74),\"\",B74)","v":""}]
[null,""]
[null,"Total",null,null,null,{"$f":"SUM(F146:F159)","v":0},{"$f":"SUM(G146:G159)","v":0},0,0,0,0,0]
[null,"C. ANCILLARY REFERENCE SERVICES"]
[null,"Request for service"]
[null,"Temporary disconnection"]
[null,"Permanent disconnection"]
[null,"De-commissioning and meter removal"]
[null,"Special meter reads"]
[null,"Hourly charge non-standard requests"]
[null,{"$f":"IF(ISBLANK(B84),\"\",B84)","v":"Disconnection Wasted Truck Visit (NEW)"}]
[null,{"$f":"IF(ISBLANK(B85),\"\",B85)","v":"Special Meter Read Wasted Truck Vist (NEW"}]
[null,"Out of hours reconnection (NEW)"]
[null,"Total",null,null,null,{"$f":"SUM(F162:F170)","v":0},{"$f":"SUM(G162:G170)","v":0},0,0,0,0,0]
[null,"TOTAL",null,null,null,{"$f":"SUM(F171,F160,F144)","v":0},{"$f":"SUM(G171,G160,G144)","v":0},0,0,0,0,0]
[]
[null,"20.3.2 - NON-REFERENCE SERVICES"]
[null,null,"EXPENDITURE"]
[null,null,{"$f":"CONCATENATE(\"$0's, real \",dms_DollarReal)","v":"$0's, real June 2020"}]
[null,null,{"$f":"CRCP_y1","v":"2015-16"},{"$f":"CRCP_y2","v":"2016-17"},{"$f":"CRCP_y3","v":"2017-18"},{"$f":"CRCP_y4","v":"2018-19"},{"$f":"CRCP_y5","v":"2019-20"},{"$f":"FRCP_y1","v":"2020-21"},{"$f":"FRCP_y2","v":"2021-22"},{"$f":"FRCP_y3","v":"2022-23"},{"$f":"FRCP_y4","v":"2023-24"},{"$f":"FRCP_y5","v":"2024-25"}]
[null,{"$f":"IF(ISBLANK(B94),\"\",B94)","v":"Maintenance"}]
[null,{"$f":"IF(ISBLANK(B95),\"\",B95)","v":""}]
[null,""]
[null,""]
[null,""]
[null,""]
[null,""]
[null,""]
[null,""]
[null,""]
[null,""]
[null,""]
[null,""]
[null,""]
[null,""]
[null,""]
[null,""]
[null,""]
[null,""]
[null,""]
[null,""]
[null,""]
[null,""]
[null,""]
[null,""]
[null,"Total",null,null,null,{"$f":"SUM(F178:F202)","v":0},{"$f":"SUM(G178:G202)","v":0},{"$f":"SUM(H178:H202)","v":0},{"$f":"SUM(I178:I202)","v":0},{"$f":"SUM(J178:J202)","v":0},{"$f":"SUM(K178:K202)","v":0},{"$f":"SUM(L178:L202)","v":0}]

{"sheet":"E21. ARS","index":17,"n_rows":51,"n_cols":9,"rows_kept":51,"cut":false,"hidden":false,"merged":[[43,2,43,8],[6,2,6,8],[7,2,7,8],[30,2,30,8],[31,2,31,8],[42,2,42,8],[18,2,18,8],[19,2,19,8]]}
[null,{"$f":"IF(dms_MultiYear_ResponseFlag=\"Yes\",\"REGULATORY REPORTING STATEMENT - HISTORICAL INFORMATION\",INDEX(dms_Worksheet_List,MATCH(dms_Model,dms_Model_List)))","v":"REGULATORY REPORTING STATEMENT"}]
[null,{"$f":"INDEX(dms_TradingNameFull_List,MATCH(dms_TradingName,dms_TradingName_List))","v":"Jemena Gas Networks (NSW) Ltd"}]
[null,{"$f":"IF(SUM(dms_SingleYear_Model)>0,CONCATENATE(CRY),CONCATENATE(FRCP_y1,\" to \",dms_MultiYear_FinalYear_Result))","v":"2020-21 to 2024-25"}]
[null,"E21. ANCILLARY REFERENCE SERVICES"]
[]
[null,"E21.1 - VOLUMES"]
[null,null,"VOLUME"]
[null,null,"0's"]
[null,null,{"$f":"CRCP_y4","v":"2018-19"},{"$f":"CRCP_y5","v":"2019-20"},{"$f":"FRCP_y1","v":"2020-21"},{"$f":"FRCP_y2","v":"2021-22"},{"$f":"FRCP_y3","v":"2022-23"},{"$f":"FRCP_y4","v":"2023-24"},{"$f":"FRCP_y5","v":"2024-25"}]
[null,"Request for service",97.333333333333329,97.333333333333329,97.333333333333329,97.333333333333329,97.333333333333329,97.333333333333329,97.333333333333329]
[null,"Temporary Disconnection",21246.024116307446,21580.578373103257,20331.437814800836,20645.60394498493,20943.340873164907,21240.098725993044,21549.026125261142]
[null,"Permanent Disconnection"]
[null,"Decommissioning & meter removal",3464.4678079251566,3133.5486356256174,2758.3335015184393,2364.1523906963507,2421.7642745082394,2478.4821758072485,2536.3864810892592]
[null,"Special Meter Reading",407570.55682071648,413988.43830209685,390025.70013952989,396052.46843803057,401764.06910929497,407456.88780591165,413383.15953786514]
[null,"Hourly charge non-standard requests"]
[null,"Total",{"$f":"SUM(C10:C15)","v":432378.38207828242},{"$f":"SUM(D10:D15)","v":438799.89864415908},{"$f":"SUM(E10:E15)","v":413212.8047891825},419159.55810704519,425226.50759030145,431272.80204104527,437565.90547754889]
[]
[null,"E21.2 - REVENUE"]
[null,null,"REVENUE"]
[null,null,{"$f":"CONCATENATE(\"$0's, real \",dms_DollarReal)","v":"$0's, real June 2020"}]
[null,null,{"$f":"CRCP_y4","v":"2018-19"},{"$f":"CRCP_y5","v":"2019-20"},{"$f":"FRCP_y1","v":"2020-21"},{"$f":"FRCP_y2","v":"2021-22"},{"$f":"FRCP_y3","v":"2022-23"},{"$f":"FRCP_y4","v":"2023-24"},{"$f":"FRCP_y5","v":"2024-25"}]
[null,"Request for service",12848,12848,14892,14490.456717300765,14099.740523500328,14926.137519510266,15800.970300127448]
[null,"Temporary Disconnection",3229395.6656787316,3280247.9127116948,3700321.6822937522,3656183.8521928233,3608904.9358881013,3874559.4601941146,4161307.0754733924]
[null,"Permanent Disconnection"]
[null,"Decommissioning & meter removal",3700009.2798244413,3348242.1996700312,2881615.17457614,2405788.6646261164,2397539.4176633293,2597069.246930595,2813058.846179612]
[null,"Special Meter Reading",6032044.2409466039,6127028.8868710333,4407290.4115766883,4354719.7833736185,4298407.945541624,4614817.3656653604,4956349.8387500932]
[null,"Hourly charge non-standard requests"]
[null,"Total",{"$f":"SUM(C22:C27)","v":12974297.186449777},12768366.999252759,11004119.26844658,10431182.756909858,10318952.039616555,11101372.21030958,11946516.730703223]
[]
[null,"E21.3 - EXPENDITURE"]
[null,null,"EXPENDITURE"]
[null,null,{"$f":"CONCATENATE(\"$0's, real \",dms_DollarReal)","v":"$0's, real June 2020"}]
[null,null,{"$f":"CRCP_y4","v":"2018-19"},{"$f":"CRCP_y5","v":"2019-20"},{"$f":"FRCP_y1","v":"2020-21"},{"$f":"FRCP_y2","v":"2021-22"},{"$f":"FRCP_y3","v":"2022-23"},{"$f":"FRCP_y4","v":"2023-24"},{"$f":"FRCP_y5","v":"2024-25"}]
[null,"Request for service",11684.980462452762,11804.262523614123,15009.013056708234,15576.979317099545,15538.500948818259,15500.43532838668,15454.340440218191]
[null,"Temporary Disconnection",2937066.1004814454,3013769.2640244481,3729396.7528584143,3930331.6214404199,3977163.4575138111,4023636.9429281657,4070019.4354606071]
[null,"Permanent Disconnection"]
[null,"Decommissioning & meter removal",3365079.0897916029,3076239.8752761725,2904257.3045676784,2586179.3731767382,2642188.2341805175,2696994.0383284367,2751348.066699198]
[null,"Special Meter Reading",5486014.874230369,5629285.2950181272,4441920.4493727861,4681245.1340050548,4737024.4742365889,4792376.9987587985,4847621.1456613299]
[null,"Hourly charge non-standard requests"]
[null,"Total",{"$f":"SUM(C34:C39)","v":11799845.044965871},11731098.696842361,11090583.519855587,11213333.107939312,11371914.666879736,11528508.415343788,11684442.988261353]
[]
[null,"E21.4 - PRICE"]
[null,null,"PRICE"]
[null,null,{"$f":"CONCATENATE(\"$0's, real \",dms_DollarReal)","v":"$0's, real June 2020"}]
[null,null,{"$f":"CRCP_y4","v":"2018-19"},{"$f":"CRCP_y5","v":"2019-20"},{"$f":"FRCP_y1","v":"2020-21"},{"$f":"FRCP_y2","v":"2021-22"},{"$f":"FRCP_y3","v":"2022-23"},{"$f":"FRCP_y4","v":"2023-24"},{"$f":"FRCP_y5","v":"2024-25"}]
[null,"Request for service",{"$f":"C34/C10","v":120.05116913478867},{"$f":"D34/D10","v":121.27666976315881},154.20218893878322,160.0374587373241,159.64213303580402,159.2510478943837,158.7774702762143]
[null,"Temporary Disconnection",138.24074021581723,139.65192275757678,183.43005481606895,190.37135614505215,189.90109942821132,189.43588703776365,188.87254634164051]
[null,"Permanent Disconnection",{"$error":"#DIV/0!"},{"$error":"#DIV/0!"},{"$error":"#DIV/0!"},{"$error":"#DIV/0!"},{"$error":"#DIV/0!"},{"$error":"#DIV/0!"},{"$error":"#DIV/0!"}]
[null,"Decommissioning & meter removal",971.31198104765281,981.71122678681411,1052.9028860973153,1093.9139893663921,1091.0179252342953,1088.1635803775825,1084.7511162879337]
[null,"Special Meter Reading",13.460282599961154,13.597687215869319,11.388789117700986,11.819760024390604,11.79056276669664,11.761678700696313,11.726702053079878]
[null,"Hourly charge non-standard requests",{"$error":"#DIV/0!"},{"$error":"#DIV/0!"},{"$error":"#DIV/0!"},{"$error":"#DIV/0!"},{"$error":"#DIV/0!"},{"$error":"#DIV/0!"},{"$error":"#DIV/0!"}]

{"sheet":"E21. ARS (NEW)","index":18,"n_rows":46,"n_cols":10,"rows_kept":46,"cut":false,"hidden":false,"merged":[[35,2,35,8],[6,2,6,8],[7,2,7,8],[20,2,20,8],[21,2,21,8],[34,2,34,8]]}
[null,"REGULATORY REPORTING STATEMENT"]
[null,"Jemena Gas Networks (NSW) Ltd"]
[null,"2020-21 to 2024-25"]
[null,"E21. ANCILLARY REFERENCE SERVICES (WITH NEW SERVICES)"]
[null,"This sheet has been included as E21. ARS does not include all services included in the AA Proposal."]
[null,"E21.1 - VOLUMES",null,null,null,null,null,null,null,"MAPPING for E21. ARS"]
[null,null,"VOLUME"]
[null,null,"0's"]
[null,null,{"$f":"CRCP_y4","v":"2018-19"},{"$f":"CRCP_y5","v":"2019-20"},{"$f":"FRCP_y1","v":"2020-21"},{"$f":"FRCP_y2","v":"2021-22"},{"$f":"FRCP_y3","v":"2022-23"},{"$f":"FRCP_y4","v":"2023-24"},{"$f":"FRCP_y5","v":"2024-25"}]
[null,"Hourly charge - non-standard User - initiated requests and queries",97.333333333333329,97.333333333333329,97.333333333333329,97.333333333333329,97.333333333333329,97.333333333333329,97.333333333333329,"Request for service"]
[null,"Disconnection & Reconnection – Volume Customer Delivery Points",21246.024116307446,21580.578373103257,20331.437814800836,20645.60394498493,20943.340873164907,21240.098725993044,21549.026125261142,"Temporary Disconnection"]
[null,"Disconnection Wasted Truck Visit (NEW)",0,0,1657.7529887525773,1683.3689754831557,1707.6453836274461,1731.8419614564627,1757.0308007362621,"NEW Service not on E21.ARS"]
[null,"Abolishment",3449.4678079251566,3118.5486356256174,2743.3335015184393,2349.1523906963507,2406.7642745082394,2463.4821758072485,2521.3864810892592,"Decommissioning & meter removal"]
[null,"Abolishment large",15,15,15,15,15,15,15,"Decommissioning & meter removal"]
[null,"Special Meter Reads",407570.55682071648,413988.43830209685,390025.70013952989,396052.46843803057,401764.06910929497,407456.88780591165,413383.15953786514,"Special Meter Reads"]
[null,"Special Meter Read Wasted Truck Vist (NEW)",0,0,31801.305740705473,32292.706951498621,32758.410517060373,33222.582667338538,33705.789746212911,"NEW Service not on E21.ARS"]
[null,"Out of hours reconnection (NEW)",0,0,2180,2180,2180,2180,2180,"NEW Service not on E21.ARS"]
[null,"Total",{"$f":"SUM(C10:C17)","v":432378.38207828242},{"$f":"SUM(D10:D17)","v":438799.89864415908},448851.86351864052,455315.634034027,461872.56349098927,468407.22666984028,475208.726024498]
[null,null,{"$f":"'E21. ARS'!C17","v":0}]
[null,"E21.2 - REVENUE",null,null,null,null,null,null,null,"MAPPING for E21. ARS"]
[null,null,"REVENUE"]
[null,null,"$0's, real June 2020"]
[null,null,{"$f":"CRCP_y4","v":"2018-19"},{"$f":"CRCP_y5","v":"2019-20"},{"$f":"FRCP_y1","v":"2020-21"},{"$f":"FRCP_y2","v":"2021-22"},{"$f":"FRCP_y3","v":"2022-23"},{"$f":"FRCP_y4","v":"2023-24"},{"$f":"FRCP_y5","v":"2024-25"}]
[null,"Hourly charge - non-standard User - initiated requests and queries",12848,12848,14892,14490.456717300765,14099.740523500328,14926.137519510266,15800.970300127448,"Request for service"]
[null,"Disconnection & Reconnection – Volume Customer Delivery Points",3229395.6656787316,3280247.9127116948,3700321.6822937522,3656183.8521928233,3608904.9358881013,3874559.4601941146,4161307.0754733924,"Temporary Disconnection"]
[null,"Disconnection Wasted Truck Visit (NEW)",0,0,109411.69725767009,108106.62291029074,106708.67242880813,114563.58745621804,123042.18633653145,"NEW Service not on E21.ARS"]
[null,"Abolishment",3666784.2798244413,3315017.1996700312,2847580.17457614,2372671.3738409076,2365315.0912654423,2562956.2271564524,2776946.4352096389,"Decommissioning & meter removal"]
[null,"Abolishment large",33225,33225,34035,33117.290785208941,32224.326397887031,34113.019774142624,36112.410969972982,"Decommissioning & meter removal"]
[null,"Special Meter Reads",6032044.2409466039,6127028.8868710333,4407290.4115766883,4354719.7833736185,4298407.945541624,4614817.3656653604,4956349.8387500932,"Special Meter Reads"]
[null,"Special Meter Read Wasted Truck Vist (NEW)",0,0,359354.75486997189,355068.33318066091,350476.866589932,376275.76318827044,404123.10399955884,"NEW Service not on E21.ARS"]
[null,"Out of hours reconnection (NEW)",0,0,327000,318182.873123647,309603.48852972116,327749.59500939149,346959.2592090838,"NEW Service not on E21.ARS"]
[null,"Total",{"$f":"SUM(C24:C31)","v":12974297.186449777},{"$f":"SUM(D24:D31)","v":12768366.999252759},11799885.720574223,11212540.586124457,11085741.067165017,11919961.155963462,12820641.280248398]
[]
[null,"E21.3 - EXPENDITURE",null,null,null,null,null,null,null,"MAPPING for E21. ARS"]
[null,null,"EXPENDITURE"]
[null,null,"$0's, real June 2020"]
[null,null,{"$f":"CRCP_y4","v":"2018-19"},{"$f":"CRCP_y5","v":"2019-20"},{"$f":"FRCP_y1","v":"2020-21"},{"$f":"FRCP_y2","v":"2021-22"},{"$f":"FRCP_y3","v":"2022-23"},{"$f":"FRCP_y4","v":"2023-24"},{"$f":"FRCP_y5","v":"2024-25"}]
[null,"Hourly charge - non-standard User - initiated requests and queries",11684.980462452762,11804.262523614123,15009.013056708234,15576.979317099545,15538.500948818259,15500.435328386682,15454.340440218191,"Request for service"]
[null,"Disconnection & Reconnection – Volume Customer Delivery Points",2937066.1004814459,3013769.2640244486,3729396.7528584143,3930331.6214404199,3977163.4575138111,4023636.9429281652,4070019.4354606071,"Temporary Disconnection"]
[null,"Disconnection Wasted Truck Visit (NEW)",0,0,110271.39354666794,116212.66754860186,117597.39869103226,118971.53406444989,120342.9789459311,"NEW Service not on E21.ARS"]
[null,"Abolishment",3334861.6648332444,3045713.9862391958,2869954.8764596293,2550578.8835811513,2606675.6851748079,2661568.4865958523,2716027.8627720675,"Decommissioning & meter removal"]
[null,"Abolishment large",30217.424958358737,30525.889036976903,34302.428108048938,35600.489595587096,35512.549005709741,35425.55173258399,35320.203927130409,"Decommissioning & meter removal"]
[null,"Special Meter Reads",5486014.874230369,5629285.2950181272,4441920.4493727852,4681245.1340050548,4737024.4742365889,4792376.9987587985,4847621.1456613299,"Special Meter Reads"]
[null,"Special Meter Read Wasted Truck Vist (NEW)",0,0,362178.36474842834,381692.04670468392,386240.09533861565,390753.34294055821,395257.75381759368,"NEW Service not on E21.ARS"]
[null,"Out of hours reconnection (NEW)",0,0,329569.38420249749,342040.84318369272,341195.93139024783,340360.08275466325,339347.92666877178,"NEW Service not on E21.ARS"]
[null,"Total",{"$f":"SUM(C38:C45)","v":11799845.044965871},{"$f":"SUM(D38:D45)","v":11731098.696842361},11892602.662353177,12053278.665376291,12216948.092299633,12378593.375103459,12539391.647693649]

{"sheet":"E25. Escalators","index":19,"n_rows":22,"n_cols":9,"rows_kept":22,"cut":false,"hidden":false,"merged":[[6,1,7,1],[6,2,6,8]]}
[null,{"$f":"IF(dms_MultiYear_ResponseFlag=\"Yes\",\"REGULATORY REPORTING STATEMENT - HISTORICAL INFORMATION\",INDEX(dms_Worksheet_List,MATCH(dms_Model,dms_Model_List)))","v":"REGULATORY REPORTING STATEMENT"}]
[null,{"$f":"INDEX(dms_TradingNameFull_List,MATCH(dms_TradingName,dms_TradingName_List))","v":"Jemena Gas Networks (NSW) Ltd"}]
[null,{"$f":"IF(SUM(dms_SingleYear_Model)>0,CONCATENATE(CRY),CONCATENATE(FRCP_y1,\" to \",dms_MultiYear_FinalYear_Result))","v":"2020-21 to 2024-25"}]
[null,"E25. ESCALATORS"]
[]
[null,"E25.1 - FORECAST CAPEX AND OPEX PRICE CHANGES"]
[null,null,"Price changes (% YoY real)"]
[null,null,{"$f":"CRCP_y4","v":"2018-19"},{"$f":"CRCP_y5","v":"2019-20"},{"$f":"FRCP_y1","v":"2020-21"},{"$f":"FRCP_y2","v":"2021-22"},{"$f":"FRCP_y3","v":"2022-23"},{"$f":"FRCP_y4","v":"2023-24"},{"$f":"FRCP_y5","v":"2024-25"}]
[null,"E25.1.1 - OPEX"]
[null,"CPI",0.02,2.2499999999999999E-2,2.4248746575396662E-2,2.4248746575396662E-2,2.4248746575396662E-2,2.4248746575396662E-2,2.4248746575396662E-2]
[null,"Labour",null,null,7.3330091081202356E-3,1.0492538281142619E-2,1.1973043556690339E-2,1.1559484078943852E-2,1.0571712554032768E-2]
[null,""]
[null,""]
[null,""]
[null,""]
[null,"E25.1.2 - CAPEX"]
[null,"CPI",0.02,2.2499999999999999E-2,2.4248746575396662E-2,2.4248746575396662E-2,2.4248746575396662E-2,2.4248746575396662E-2,2.4248746575396662E-2]
[null,"Labour",7.9074238138088747E-3,8.6256042778509109E-3,7.3330091081202356E-3,1.0492538281142619E-2,1.1973043556690339E-2,1.1559484078943852E-2,1.0571712554032768E-2]
[null,""]
[null,""]
[null,""]
[null,""]

{"sheet":"N1.1. Demand","index":20,"n_rows":14,"n_cols":9,"rows_kept":14,"cut":false,"hidden":false,"merged":[[7,2,7,8],[8,2,8,8]]}
[null,{"$f":"IF(dms_MultiYear_ResponseFlag=\"Yes\",\"REGULATORY REPORTING STATEMENT - HISTORICAL INFORMATION\",INDEX(dms_Worksheet_List,MATCH(dms_Model,dms_Model_List)))","v":"REGULATORY REPORTING STATEMENT"}]
[null,{"$f":"INDEX(dms_TradingNameFull_List,MATCH(dms_TradingName,dms_TradingName_List))","v":"Jemena Gas Networks (NSW) Ltd"}]
[null,{"$f":"IF(SUM(dms_SingleYear_Model)>0,CONCATENATE(CRY),CONCATENATE(FRCP_y1,\" to \",dms_MultiYear_FinalYear_Result))","v":"2020-21 to 2024-25"}]
[null,"N1. DEMAND"]
[]
[]
[null,"N1.1 - DEMAND - BY CUSTOMER TYPE"]
[null,null,"VOLUME"]
[null,null,"GJ's"]
[null,null,{"$f":"CRCP_y4","v":"2018-19"},{"$f":"CRCP_y5","v":"2019-20"},{"$f":"FRCP_y1","v":"2020-21"},{"$f":"FRCP_y2","v":"2021-22"},{"$f":"FRCP_y3","v":"2022-23"},{"$f":"FRCP_y4","v":"2023-24"},{"$f":"FRCP_y5","v":"2024-25"}]
[null,"Residential",26108821.544717494,26199266.341536153,26585541.346186142,26886480.073324375,27112545.040691324,27332635.772456639,27550787.721119326]
[null,"Commercial",13289514.190969117,13039687.717601046,13091660.201429857,13175722.773967506,13234527.188561933,13256372.707058119,13289423.666774873]
[null,"Industrial",47896975.460098557,46563806.388066374,45845197.381650425,44898000.998115443,43955208.220787115,43018110.721620575,42086221.556783028]
[null,"Total",{"$f":"SUM(C11:C13)","v":87295311.195785165},85802760.447203577,85522398.929266423,84960203.845407322,84302280.45004037,83607119.201135337,82926432.944677234]

{"sheet":"N1.2. Demand","index":21,"n_rows":60,"n_cols":9,"rows_kept":60,"cut":false,"hidden":false,"merged":[[6,2,6,8],[7,2,7,8]]}
[null,{"$f":"IF(dms_MultiYear_ResponseFlag=\"Yes\",\"REGULATORY REPORTING STATEMENT - HISTORICAL INFORMATION\",INDEX(dms_Worksheet_List,MATCH(dms_Model,dms_Model_List)))","v":"REGULATORY REPORTING STATEMENT"}]
[null,{"$f":"INDEX(dms_TradingNameFull_List,MATCH(dms_TradingName,dms_TradingName_List))","v":"Jemena Gas Networks (NSW) Ltd"}]
[null,{"$f":"IF(SUM(dms_SingleYear_Model)>0,CONCATENATE(CRY),CONCATENATE(FRCP_y1,\" to \",dms_MultiYear_FinalYear_Result))","v":"2020-21 to 2024-25"}]
[null,"N1. DEMAND"]
[]
[null,"N1.2 - DEMAND - BY TARIFF"]
[null,null,"VOLUME"]
[null,null,"GJ's"]
[null,"Tariff",{"$f":"CRCP_y4","v":"2018-19"},{"$f":"CRCP_y5","v":"2019-20"},{"$f":"FRCP_y1","v":"2020-21"},{"$f":"FRCP_y2","v":"2021-22"},{"$f":"FRCP_y3","v":"2022-23"},{"$f":"FRCP_y4","v":"2023-24"},{"$f":"FRCP_y5","v":"2024-25"}]
[null,"Volume - Individual metered  (VI-Coastal)",35118341.822349571,34925362.580455109,35255353.271763846,35540343.179128528,35741637.844597347,35905222.099698052,36075883.329783067]
[null,"Volume - Individual metered  (VI-Country)",4261375.0386806577,4235427.3733284157,4271623.5498030288,4301669.0163708478,4321456.9837100673,4337004.4021876585,4353267.6234256178]
[null,"Volume - Boundary metered (VB-Coastal)",18618.874656380969,78164.105353668536,150224.72604912578,220190.65179249973,283977.40094584122,346781.97762904392,411060.43468551117]
[null,"Volume - Boundary metered (VB-Country)",0,0,0,0,0,0,0]
[null,"Volume - Residential distributed generation technology (VRT3)",0,0,0,0,0,0,0]
[null,"Volume - Residential distributed generation technology (VRT4)",0,0,0,0,0,0,0]
[null,"Volume - Residential distributed generation technology (VRT6)",0,0,0,0,0,0,0]
[null,"Volume - Residential distributed generation technology (VRT10)",0,0,0,0,0,0,0]
[null,"Demand - Capacity country (DC Country) - Distance",0,0,0,0,0,0,0]
[null,"Demand - Capacity country (DC Country) - Pressure reduction",2672131.6457119272,2596198.798814598,2543306.9939855724,2478104.5526439273,2413757.0723074749,2350251.9995626439,2287578.6618329072]
[null,"Demand - Capacity coastal (DC1)",3113347.1764955046,3033175.5195844257,2978053.8673948278,2908320.098257828,2839364.8178293291,2771175.5279908637,2703741.7895647725]
[null,"Demand - Capacity coastal (DC2)",4110187.0926027214,3995571.6495684488,3918784.807096757,3822879.1223956603,3728122.573699051,3634497.1083234521,3541987.5029743314]
[null,"Demand - Capacity coastal (DC3)",7533636.6316350773,7266209.8851835635,7148642.6431780821,6995501.269887357,6843670.1182902036,6693119.3643845199,6543824.013592218]
[null,"Demand - Capacity coastal (DC4)",1438438.7634596017,1413562.3221217461,1399917.3635693563,1379301.7259197512,1358893.6661586093,1338680.7225746205,1318650.9532833493]
[null,"Demand - Capacity coastal (DC5)"]
[null,"Demand - Capacity coastal (DC6)",3555780.4054765478,3441693.4253483783,3386489.0737242391,3314274.1156771639,3242524.9366234383,3171232.7458202839,3100391.173164574]
[null,"Demand - Capacity coastal (DC7)",1297968.3096363,1251857.1092649468,1230917.3658281348,1203834.3975214555,1176963.5854984454,1150301.2521741947,1123844.5901842928]
[null,"Demand - Capacity coastal (DC8)",118985.73350438906,115864.13411518029,113748.27779004563,111078.90776532571,108443.68488665968,105841.89956188903,103272.91809568103]
[null,"Demand - Capacity coastal (DC9)"]
[null,"Demand - Capacity coastal (DC10)",426860.80595084472,415563.66436208232,407882.74332273594,398219.04894306191,388680.2848254923,379263.97206905729,369967.90555899113]
[null,"Demand - Capacity coastal (DC11)",0,0,0,0,0,0,0]
[null,"Demand - Throughput  (DT)",382397.39096253016,371752.80933570955,364392.97908547561,355265.30408952292,346255.17287852953,337360.75607181812,328580.48477131681]
[null,"Demand - Major end-user (throughput) (DMT1)"]
[null,"Demand - Major end-user (throughput) (DMT2)"]
[null,"Demand - Major end-user (throughput) (DMT3)",0,0,0,0,0,0,0]
[null,"Demand - Major end-user (throughput) (DMT4)",0,0,0,0,0,0,0]
[null,"Demand - Major end-user (throughput) (DMT5)",0,0,0,0,0,0,0]
[null,"Demand - First response (DCFR1)"]
[null,"Demand - First response (DCFR6)"]
[null,"Demand - First response (DMTFR3)"]
[null,"Prudent Discount"]
[null,""]
[null,""]
[null,""]
[null,""]
[null,""]
[null,""]
[null,""]
[null,""]
[null,""]
[null,""]
[null,""]
[null,""]
[null,""]
[null,""]
[null,""]
[null,""]
[null,""]
[null,""]
[null,""]
[null,null,{"$f":"SUM(C10:C59)","v":64048069.691122063},63140403.37683627,63169337.662591226,63028981.390392929,62793748.142250471,62520733.828048095,62262051.380916633]

{"sheet":"N2. Network characteristics","index":22,"n_rows":1341,"n_cols":10,"rows_kept":1341,"cut":false,"hidden":false,"merged":[[67,3,67,9],[68,3,68,9],[7,3,7,9],[8,3,8,9],[57,3,57,9],[58,3,58,9]]}
[null,{"$f":"IF(dms_MultiYear_ResponseFlag=\"Yes\",\"REGULATORY REPORTING STATEMENT - HISTORICAL INFORMATION\",INDEX(dms_Worksheet_List,MATCH(dms_Model,dms_Model_List)))","v":"REGULATORY REPORTING STATEMENT"}]
[null,{"$f":"INDEX(dms_TradingNameFull_List,MATCH(dms_TradingName,dms_TradingName_List))","v":"Jemena Gas Networks (NSW) Ltd"}]
[null,{"$f":"IF(SUM(dms_SingleYear_Model)>0,CONCATENATE(CRY),CONCATENATE(FRCP_y1,\" to \",dms_MultiYear_FinalYear_Result))","v":"2020-21 to 2024-25"}]
[null,"N2. NETWORK CHARACTERISTICS"]
[]
[]
[null,"N2.1 - NETWORK LENGTH - BY PRESSURE AND ASSET TYPE"]
[null,null,null,"VOLUMES"]
[null,null,null,"KM"]
[null,null,null,{"$f":"CRCP_y4","v":"2018-19"},{"$f":"CRCP_y5","v":"2019-20"},{"$f":"FRCP_y1","v":"2020-21"},{"$f":"FRCP_y2","v":"2021-22"},{"$f":"FRCP_y3","v":"2022-23"},{"$f":"FRCP_y4","v":"2023-24"},{"$f":"FRCP_y5","v":"2024-25"}]
[null,"N2.1.1 - LOW PRESSURE"]
[null,null,"Cast Iron",37.790014999999997,37.790014999999997,37.790014999999997,37.790014999999997,37.790014999999997,37.790014999999997,37.790014999999997]
[null,null,"PVC",0,0,0,0,0,0,0]
[null,null,"Polyamide",973.39391599999942,973.39391599999942,973.39391599999942,973.39391599999942,973.39391599999942,973.39391599999942,973.39391599999942]
[null,null,"High density polyethylene (80)",30.509878999999994,30.509878999999994,30.509878999999994,30.509878999999994,30.509878999999994,30.509878999999994,30.509878999999994]
[null,null,"High density polyethylene (100)",35.832621000000046,35.832621000000046,35.876738938189874,35.982621000000044,35.982621000000044,35.982621000000044,35.982621000000044]
[null,null,"High density polyethylene (250)",0,0,0,0,0,0,0]
[null,null,"High density polyethylene (575)",35.29134700000003,35.29134700000003,35.29134700000003,35.29134700000003,35.29134700000003,35.29134700000003,35.29134700000003]
[null,null,"Medium density polyethylene",0,0,0,0,0,0,0]
[null,null,"Other polyethylene",0,0,0,0,0,0,0]
[null,null,"Unprotected steel",0,0,0,0,0,0,0]
[null,null,"Protected steel",7.0659930000000024,7.2855259623590225,9.0659930000000024,9.0659930000000024,9.0659930000000024,9.0659930000000024,9.0659930000000024]
[null,null,"Other",0.257189,0.257189,0.257189,0.257189,0.257189,0.257189,0.257189]
[null,"N2.1.2 - MEDIUM PRESSURE"]
[null,null,"Cast Iron",20.419772999999989,20.419772999999989,20.419772999999989,20.419772999999989,20.419772999999989,20.419772999999989,20.419772999999989]
[null,null,"PVC",0,0,0,0,0,0,0]
[null,null,"Polyamide",18920.915460859251,19140.362708950019,19327.033623043604,19502.759348046562,19675.039560050671,19851.363985974855,20037.99921665504]
[null,null,"High density polyethylene (80)",642.65907700000037,642.65907700000037,642.65907700000037,642.65907700000037,642.65907700000037,642.65907700000037,642.65907700000037]
[null,null,"High density polyethylene (100)",1884.6968874261572,2104.9534169499611,2292.1043310435462,2470.0415914104228,2646.0847536406686,2824.8346939747989,3011.4699246549844]
[null,null,"High density polyethylene (250)",0,0,0,0,0,0,0]
[null,null,"High density polyethylene (575)",374.74631400000032,374.74631400000032,374.74631400000032,374.74631400000032,374.74631400000032,374.74631400000032,374.74631400000032]
[null,null,"Medium density polyethylene",0,0,0,0,0,0,0]
[null,null,"Other polyethylene",0,0,0,0,0,0,0]
[null,null,"Unprotected steel",0,0,0,0,0,0,0]
[null,null,"Protected steel",363.83086414106799,363.83920700000084,363.83920700000084,363.83920700000084,363.83920700000084,363.83920700000084,363.83920700000084]
[null,null,"Other",1.1123859999999997,1.1123859999999997,1.1123859999999997,1.1123859999999997,1.1123859999999997,1.1123859999999997,1.1123859999999997]
[null,"N2.1.3 - HIGH PRESSURE"]
[null,null,"Cast Iron",0,0,0,0,0,0,0]
[null,null,"PVC",0,0,0,0,0,0,0]
[null,null,"Polyamide",0,0,0,0,0,0,0]
[null,null,"High density polyethylene (80)",9.4900109999999991,9.4900109999999991,9.4900109999999991,9.4900109999999991,9.4900109999999991,9.4900109999999991,9.4900109999999991]
[null,null,"High density polyethylene (100)",0,0,0,0,0,0,0]
[null,null,"High density polyethylene (250)",0,0,0,0,0,0,0]
[null,null,"High density polyethylene (575)",0,0,0,0,0,0,0]
[null,null,"Medium density polyethylene",0,0,0,0,0,0,0]
[null,null,"Other polyethylene",0,0,0,0,0,0,0]
[null,null,"Unprotected steel",0,0,0,0,0,0,0]
[null,null,"Protected steel",1447.6428447446292,1458.7954421651521,1477.480851119346,1491.0475951001667,1497.9805747187556,1504.5759969999933,1507.1322336666599]
[null,null,"Other",0,0,0,0,0,0,0]
[null,"N2.1.4 - TRANSMISSION"]
[null,null,"Protected steel",414.30353781999997,414.30353781999997,414.30353781999997,414.30353781999997,414.30353781999997,414.30353781999997,414.30353781999997]
[null,null,"Other",0,0,0,0,0,0,0]
[null,null,"Total",{"$f":"SUM(D12:D52)","v":25199.95811599111},25651.042366847494,26045.374188964692,26412.709800377157,26767.9661542301,27129.635942769652,27505.46264079669]
[]
[]
[]
[null,"N2.2 - CITY GATES/REGULATORS"]
[null,null,null,"VOLUMES"]
[null,null,null," 0's"]
[null,null,null,{"$f":"CRCP_y4","v":"2018-19"},{"$f":"CRCP_y5","v":"2019-20"},{"$f":"FRCP_y1","v":"2020-21"},{"$f":"FRCP_y2","v":"2021-22"},{"$f":"FRCP_y3","v":"2022-23"},{"$f":"FRCP_y4","v":"2023-24"},{"$f":"FRCP_y5","v":"2024-25"}]
[null,null,"City Gate",75,75,75,75,75,75,75]
[null,null,"Field Regulator"]
[null,null,"District Regulator",643,644,647,649,650,652,652]
[null,null,"Total",{"$f":"SUM(D61:D63)","v":718},{"$f":"SUM(E61:E63)","v":719},{"$f":"SUM(F61:F63)","v":722},{"$f":"SUM(G61:G63)","v":724},725,727,727]
[]
[]
[null,"N2.5 - NETWORK LENGTH - BY POST CODE"]
[null,null,null,"VOLUMES"]
[null,null,null,"Metres, 0's"]
[null,"Post Code\n","Asset Type\n(drop down)",{"$f":"CRCP_y4","v":"2018-19"},{"$f":"CRCP_y5","v":"2019-20"},{"$f":"FRCP_y1","v":"2020-21"},{"$f":"FRCP_y2","v":"2021-22"},{"$f":"FRCP_y3","v":"2022-23"},{"$f":"FRCP_y4","v":"2023-24"},{"$f":"FRCP_y5","v":"2024-25"}]
[null,2000,"Cast Iron",242.309,242.309,242.309,242.309,242.309,242.309,242.309]
[null,2000,"High density polyethylene (100)",3289.6372799755641,3665.8396769307828,3985.8530101341303,4287.1028071945302,4582.4458988385468,4884.7220597453115,5204.6742202259693]
[null,2000,"High density polyethylene (575)",179.23400000000001,179.23400000000001,179.23400000000001,179.23400000000001,179.23400000000001,179.23400000000001,179.23400000000001]
[null,2000,"High density polyethylene (80)",1339.9519999999995,1339.9519999999995,1339.9519999999995,1339.9519999999995,1339.9519999999995,1339.9519999999995,1339.9519999999995]
[null,2000,"Other",260.21800000000002,260.21800000000002,260.21800000000002,260.21800000000002,260.21800000000002,260.21800000000002,260.21800000000002]
[null,2000,"Polyamide",58990.242808299423,59640.943780284164,60194.456965337798,60715.515675606308,61226.357813660565,61749.191780965833,62302.599158213794]
[null,2000,"Protected Steel",18817.874142396424,18927.497284792844,19037.120427189264,19063.581185698746,19090.041944208228,19116.502702717709,19142.963461227191]
[null,2007,"High density polyethylene (100)",170.71064350485628,190.23308558782412,206.83968303059243,222.47257575859257,237.7989491360363,253.48510342990863,270.08852640875688]
[null,2007,"High density polyethylene (80)",327.90300000000002,327.90300000000002,327.90300000000002,327.90300000000002,327.90300000000002,327.90300000000002,327.90300000000002]
[null,2007,"Polyamide",9975.0307322971112,10085.061847343992,10178.658868966437,10266.76795956893,10353.149465795357,10441.558745762333,10535.137875678232]
[null,2007,"Protected Steel",2358.8061773245859,2372.5473546491717,2386.2885319737575,2389.605367879692,2392.9222037856266,2396.2390396915612,2399.5558755974957]
[null,2008,"High density polyethylene (100)",627.93362819916615,699.74401820637945,760.82890881534638,818.33217193005805,874.70794935344736,932.40712719037572,993.48034100751534]
[null,2008,"High density polyethylene (575)",2.6960000000000002,2.6960000000000002,2.6960000000000002,2.6960000000000002,2.6960000000000002,2.6960000000000002,2.6960000000000002]
[null,2008,"Polyamide",14198.667394507125,14355.287985212577,14488.515943581739,14613.932266144706,14736.889508970478,14862.733127353986,14995.935618293806]
[null,2008,"Protected Steel",3344.4902598637941,3363.9735197275886,3383.4567795913831,3388.1596354205749,3392.8624912497667,3397.5653470789584,3402.2682029081502]
[null,2009,"High density polyethylene (100)",32.279258595251648,35.970709482372314,39.110810428843841,42.066795929212425,44.964822434301503,47.930879034061896,51.070379728904861]
[null,2009,"High density polyethylene (80)",116.93299999999999,116.93299999999999,116.93299999999999,116.93299999999999,116.93299999999999,116.93299999999999,116.93299999999999]
[null,2009,"Polyamide",11682.992506090271,11811.86355691995,11921.486607871251,12024.682063890694,12125.854132127093,12229.401177047843,12339.003272808217]
[null,2009,"Protected Steel",3500.3703360716372,3520.7616721432751,3541.1530082149129,3546.0750548528945,3550.997101490876,3555.9191481288576,3560.8411947668392]
[null,2010,"High density polyethylene (100)",57.773145664528634,64.380073428552549,70.000199703959325,75.290797701775489,80.477661177097232,85.786284343937893,91.405336294026128]
[null,2010,"Polyamide",53964.662461455911,54559.927994276499,55066.285499812693,55542.953438163437,56010.275188995562,56488.56714417028,56994.827856029289]
[null,2010,"Protected Steel",6637.1012983806913,6675.76559676138,6714.4298951420687,6723.7626568201658,6733.0954184982629,6742.42818017636,6751.7609418544571]
[null,2011,"High density polyethylene (100)",154.81729890721542,172.52218062580405,187.58268597769046,201.76013957147521,215.65961109605999,229.88536754662397,244.94299398059704]
[null,2011,"High density polyethylene (575)",2.0529999999999999,2.0529999999999999,2.0529999999999999,2.0529999999999999,2.0529999999999999,2.0529999999999999,2.0529999999999999]
[null,2011,"High density polyethylene (80)",844.88200000000006,844.88200000000006,844.88200000000006,844.88200000000006,844.88200000000006,844.88200000000006,844.88200000000006]
[null,2011,"Polyamide",21497.364701419388,21734.49469852386,21936.207290974289,22126.092746470626,22312.255054401663,22502.787453293062,22704.461487011085]
[null,2011,"Protected Steel",2168.1354287638219,2180.7658575276437,2193.3962862914655,2196.4450104758362,2199.4937346602069,2202.5424588445776,2205.5911830289483]
[null,2015,"High density polyethylene (100)",495.81442893362055,552.5156882928884,600.74812687181304,646.15252358298494,690.6666611185542,736.22575148165583,784.44897010227339]
[null,2015,"Polyamide",27420.261934290371,27722.725362872981,27980.013276868798,28222.215472325704,28459.668728418252,28702.696111408404,28959.934843071544]
[null,2015,"Protected Steel",10178.707855216184,10238.003710432369,10297.299565648555,10311.612358286944,10325.925150925334,10340.237943563723,10354.550736202113]
[null,2016,"Polyamide",22518.434393334937,22766.827457166441,22978.120880453091,23177.025408111796,23372.029948244108,23571.612147450014,23782.865180563356]
[null,2016,"Protected Steel",3222.4020374114848,3241.1740748229695,3259.9461122344542,3264.4772936786057,3269.0084751227573,3273.5396565669089,3278.0708380110605]
[null,2017,"High density polyethylene (100)",629.37370956991151,701.34878705400331,762.5737676486782,820.20890676787462,876.71397445886998,934.54547760436412,995.75875462805925]
[null,2017,"High density polyethylene (575)",10.579000000000001,10.579000000000001,10.579000000000001,10.579000000000001,10.579000000000001,10.579000000000001,10.579000000000001]
[null,2017,"Polyamide",25421.392769385227,25701.807363337663,25940.339625800265,26164.885881232552,26385.029383215271,26610.340672053928,26848.827337454062]
[null,2017,"Protected Steel",4066.2629318581526,4089.9508637163049,4113.6387955744576,4119.3565722298736,4125.0743488852895,4130.7921255407055,4136.5099021961214]
[null,2018,"High density polyethylene (100)",171.33433670342933,190.9281042415457,207.59537406925642,223.28538174140004,238.66775019119572,254.41121402092355,271.07529778677565]
[null,2018,"Polyamide",31935.948539175082,32288.222945354883,32587.882139012938,32869.971233155178,33146.529312184612,33429.579489290249,33729.181401057664]
[null,2018,"Protected Steel",2198.5697231255181,2211.3774462510355,2224.1851693765529,2227.2766887516777,2230.3682081268025,2233.4597275019273,2236.5512468770521]
[null,2019,"Cast Iron",160.43299999999999,160.43299999999999,160.43299999999999,160.43299999999999,160.43299999999999,160.43299999999999,160.43299999999999]
[null,2019,"High density polyethylene (100)",470.92713195875098,524.78228398798763,570.59370584636713,613.71903878090382,655.99879890472528,699.27106067711793,745.07372537098388]
[null,2019,"Polyamide",29115.545332549609,29436.708846138172,29709.903826602396,29967.080399837458,30219.214426080231,30477.267204841326,30750.409962229052]
[null,2019,"Protected Steel",12330.136961639615,12401.965923279226,12473.794884918836,12491.132910142191,12508.470935365545,12525.8089605889,12543.146985812255]
[null,2020,"High density polyethylene (100)",392.9677625510102,437.90749347445029,476.13508905190088,512.12126279828135,547.40184361329125,583.51062294501219,621.73091105786443]
[null,2020,"High density polyethylene (575)",98.427000000000007,98.427000000000007,98.427000000000007,98.427000000000007,98.427000000000007,98.427000000000007,98.427000000000007]
[null,2020,"Other",46.591999999999999,46.591999999999999,46.591999999999999,46.591999999999999,46.591999999999999,46.591999999999999,46.591999999999999]
[null,2020,"Polyamide",32088.794411781444,32442.754807934063,32743.848174461073,33027.287350743325,33305.16904040119,33589.573899402625,33890.609709887111]
[null,2020,"Protected Steel",6040.7180800940578,6075.9081601881135,6111.0982402821692,6119.592397546252,6128.0865548103347,6136.5807120744175,6145.0748693385003]
[null,2021,"High density polyethylene (100)",999.04134321262177,1113.2915525781787,1210.4775104938171,1301.9651051078918,1391.6588718890121,1483.4581664956477,1580.6255466551863]
[null,2021,"High density polyethylene (575)",1.498,1.498,1.498,1.498,1.498,1.498,1.498]
[null,2021,"Polyamide",42713.747738677346,43184.908321300987,43585.697018395258,43962.986028372317,44332.877406681175,44711.45184756392,45112.163931175935]
[null,2021,"Protected Steel",4605.6672205514042,4632.497441102807,4659.3276616542098,4665.8039217873074,4672.2801819204051,4678.7564420535027,4685.2327021866004]
[null,2022,"High density polyethylene (100)",9.9836520049460766,11.125380862863016,12.096582695689039,13.010839461539527,13.907170089535288,14.824541745752242,15.795557926749947]
[null,2022,"High density polyethylene (575)",90.093000000000004,90.093000000000004,90.093000000000004,90.093000000000004,90.093000000000004,90.093000000000004,90.093000000000004]
[null,2022,"High density polyethylene (80)",2175.7540000000004,2175.7540000000004,2175.7540000000004,2175.7540000000004,2175.7540000000004,2175.7540000000004,2175.7540000000004]
[null,2022,"Polyamide",26393.356020176245,26684.492004682685,26932.144325803951,27165.275897956013,27393.836381485286,27627.762237382725,27875.367218080351]
[null,2022,"Protected Steel",702.0698938617968,706.15978772359358,710.24968158539036,711.23689734513437,712.22411310487837,713.21132886462237,714.19854462436638]
[null,2023,"High density polyethylene (100)",473.26797681555252,527.39082749089516,573.42996490007317,616.7696616012031,659.25958238962892,702.74693827008616,748.77727498537615]
[null,2023,"High density polyethylene (80)",903.279,903.279,903.279,903.279,903.279,903.279,903.279]
[null,2023,"Polyamide",29849.003727631083,30178.257767175623,30458.334883956613,30721.990069029547,30980.475678803428,31245.029142157397,31525.052720294778]
[null,2024,"Polyamide",28522.890984525548,28837.517132916895,29105.15115990485,29357.092838426561,29604.094612285571,29856.894660946451,30124.477527871943]
[null,2025,"High density polyethylene (100)",52.452940062075648,58.451449958232907,63.554030807421519,68.357428934353905,73.066645229430307,77.886408626066739,82.988014082261046]
[null,2025,"High density polyethylene (80)",36.359000000000002,36.359000000000002,36.359000000000002,36.359000000000002,36.359000000000002,36.359000000000002,36.359000000000002]
[null,2025,"Polyamide",24537.485937173107,24808.150460478548,25038.388909206929,25255.127647123369,25467.616716194607,25685.093887155235,25915.288324239991]
[null,2025,"Protected Steel",1249.9163623011459,1257.1977246022918,1264.4790869034377,1266.2366571140592,1267.9942273246807,1269.7517975353021,1271.5093677459236]
[null,2026,"High density polyethylene (100)",1024.8020387068825,1141.9982371184556,1241.690175277246,1335.5368154727344,1427.5433732404133,1521.7097507420822,1621.3826321096246]
[null,2026,"High density polyethylene (575)",6.008,6.008,6.008,6.008,6.008,6.008,6.008]
[null,2026,"High density polyethylene (80)",1420.9340000000002,1420.9340000000002,1420.9340000000002,1420.9340000000002,1420.9340000000002,1420.9340000000002,1420.9340000000002]
[null,2026,"Polyamide",56182.828662176536,56802.562019405355,57329.732869323416,57825.993790592787,58312.524358181574,58810.476049944155,59337.546127572859]
[null,2027,"Polyamide",17237.526662325705,17427.667858900171,17589.409832336642,17741.668290401962,17890.941366011524,18043.718571568748,18205.429626928184]
[null,2027,"Protected Steel",2529.7298899297434,2544.4667798594865,2559.2036697892295,2562.7608501170985,2566.3180304449675,2569.8752107728365,2573.4323911007054]
[null,2028,"High density polyethylene (100)",84.269274637911124,93.906295503839317,102.10394441414914,109.82093559661968,117.38661715478352,125.1299002744759,133.32598214850483]
[null,2028,"High density polyethylene (80)",13.515000000000001,13.515000000000001,13.515000000000001,13.515000000000001,13.515000000000001,13.515000000000001,13.515000000000001]
[null,2028,"Polyamide",13264.024796089925,13410.335667453743,13534.793751740204,13651.954409574415,13766.817859247925,13884.377685694333,14008.811978972462]
[null,2028,"Protected Steel",1417.5207381778239,1425.7784763556476,1434.0362145334714,1436.0294616798426,1438.0227088262138,1440.0159559725851,1442.0092031189563]
[null,2029,"High density polyethylene (100)",1712.5862696232284,1908.437363464687,2075.0364118997436,2231.8671571350533,2385.6228695524951,2542.9879401499416,2709.5551420450793]
[null,2029,"High density polyethylene (80)",41.064,41.064,41.064,41.064,41.064,41.064,41.064]
[null,2029,"Polyamide",26110.7338988995,26398.752376505403,26643.752817195815,26874.387998233087,27100.501038222184,27331.921997752346,27576.875604944082]
[null,2029,"Protected Steel",2744.2153707279244,2760.2017414558482,2776.1881121837719,2780.0468913249947,2783.9056704662175,2787.7644496074404,2791.6232287486632]
[null,2030,"Polyamide",53546.979411030115,54137.637626539312,54640.075957232722,55113.054516099757,55576.759226344308,56051.349232248533,56553.691518441658]
[null,2031,"High density polyethylene (100)",291.83254679190651,325.20647050105077,353.59571165069923,380.32038918029434,406.5210670290416,433.33679604842956,461.72061040176663]
[null,2031,"High density polyethylene (80)",298.84399999999999,298.84399999999999,298.84399999999999,298.84399999999999,298.84399999999999,298.84399999999999,298.84399999999999]
[null,2031,"Polyamide",68895.272270317364,69655.232197540143,70301.68557311628,70910.235055264187,71506.852504403549,72117.475326328917,72763.80512795056]
[null,2031,"Protected Steel",1371.8134714266641,1379.8049428533288,1387.7964142799935,1389.7253901416022,1391.654366003211,1393.5833418648197,1395.5123177264284]
[null,2032,"Polyamide",36616.926631474307,37020.835288497874,37364.416713523155,37687.852720162351,38004.947008961695,38329.484968289544,38673.000715391267]
[null,2033,"High density polyethylene (100)",200.6490572433064,223.59525156728898,243.11423440573029,261.48874886750571,279.5029880854342,297.94010487100235,317.45535652326959]
[null,2033,"High density polyethylene (575)",9.4740000000000002,9.4740000000000002,9.4740000000000002,9.4740000000000002,9.4740000000000002,9.4740000000000002,9.4740000000000002]
[null,2033,"Polyamide",24908.823291083041,25183.583908346063,25417.30666416842,25637.325411684611,25853.030178111549,26073.798533727651,26307.476611857408]
[null,2033,"Protected Steel",2947.533798083809,2964.7045961676172,2981.8753942514254,2986.0200696509655,2990.1647450505056,2994.3094204500458,2998.4540958495859]
[null,2034,"High density polyethylene (575)",12.824,12.824,12.824,12.824,12.824,12.824,12.824]
[null,2034,"Polyamide",41926.516555920811,42388.99346356008,42782.395467218332,43152.730892242318,43515.805026861417,43887.402191793546,44280.728993986173]
[null,2035,"Cast Iron",121.11799999999999,121.11799999999999,121.11799999999999,121.11799999999999,121.11799999999999,121.11799999999999,121.11799999999999]
[null,2035,"High density polyethylene (100)",555.14737769805402,618.63394365615977,672.63824493206573,723.47607920885685,773.31711908442333,824.32815883932051,878.32213682615293]
[null,2035,"Other",8.1349999999999998,8.1349999999999998,8.1349999999999998,8.1349999999999998,8.1349999999999998,8.1349999999999998,8.1349999999999998]
[null,2035,"Polyamide",88220.671751080808,89193.803478036483,90021.589611536547,90800.839657870863,91564.810688204787,92346.715654418353,93174.343550975333]
[null,2035,"Protected Steel",655.84762698791633,659.66825397583261,663.4888809637489,664.41110127117702,665.33332157860514,666.25554188603326,667.17776219346138]
[null,2036,"Cast Iron",29488.822000000007,29488.822000000007,29488.822000000007,29488.822000000007,29488.822000000007,29488.822000000007,29488.822000000007]
[null,2036,"High density polyethylene (100)",3998.5495455711762,17533.237222576103,32748.610435340725,44810.967508749767,45169.956626507315,45537.372880325951,45926.274287080421]
[null,2036,"High density polyethylene (575)",523.37,523.37,523.37,523.37,523.37,523.37,523.37]
[null,2036,"High density polyethylene (80)",1897.067,1897.067,1897.067,1897.067,1897.067,1897.067,1897.067]
[null,2036,"Polyamide",29532.777029568028,16781.128695815642,2231.8411653637595,-9203.4852321263916,-8947.7380739142936,-8685.9873462543183,-8408.9303974993527]
[null,2036,"Protected Steel",8548.374380779409,8598.1727615588206,8647.9711423382323,8659.9914411470563,8672.0117399558803,8684.0320387647043,8696.0523375735283]
[null,2037,"High density polyethylene (100)",1634.1856401280143,1821.0708504301433,1980.0431471492202,2129.6943246344294,2276.4112414852898,2426.5722834073731,2585.514191491935]
[null,2037,"High density polyethylene (575)",16.966999999999999,16.966999999999999,16.966999999999999,16.966999999999999,16.966999999999999,16.966999999999999,16.966999999999999]
[null,2037,"High density polyethylene (80)",181.565,181.565,181.565,181.565,181.565,181.565,181.565]
[null,2037,"Polyamide",35485.824872455058,35877.256737064003,36210.224885936324,36523.669911089775,36830.969114915286,37145.482053291518,37478.386553040124]
[null,2038,"High density polyethylene (100)",1063.8586873794982,1185.5213979312136,1289.0127362249541,1386.4360040195108,1481.9490612539973,1579.7042519936806,1683.1758072150255]
[null,2038,"High density polyethylene (575)",44.311,44.311,44.311,44.311,44.311,44.311,44.311]
[null,2038,"High density polyethylene (80)",304.73700000000002,304.73700000000002,304.73700000000002,304.73700000000002,304.73700000000002,304.73700000000002,304.73700000000002]
[null,2038,"Polyamide",24247.244444137526,24514.70741388703,24742.222488620042,24956.397533782769,25166.373177280624,25381.277920937071,25608.749504617896]
[null,2038,"Protected Steel",1915.261315770972,1926.4186315419436,1937.5759473129151,1940.2690924990118,1942.9622376851084,1945.6553828712051,1948.3485280573018]
[null,2039,"High density polyethylene (100)",426.72358913922727,475.5236310309898,517.03496693059822,556.11234345827188,594.42351680889328,633.6340307091732,675.13743143491229]
[null,2039,"High density polyethylene (80)",884.97,884.97,884.97,884.97,884.97,884.97,884.97]
[null,2039,"Polyamide",23924.382041382927,24188.283627600369,24412.769242063765,24624.092455140966,24831.272183377776,25043.315378701991,25267.75808121511]
[null,2039,"Protected Steel",1860.3202577569523,1871.1575155139046,1881.994773270857,1884.6106630742593,1887.2265528776616,1889.8424426810639,1892.4583324844662]
[null,2040,"High density polyethylene (100)",170.25570093405071,189.72611585686448,206.28845684334021,221.87968803073113,237.16521673931118,252.809567550905,269.36874253338294]
[null,2040,"Polyamide",61977.423122971828,62661.074648161914,63242.616937887607,63790.061305308962,64326.771748121006,64876.081269019975,65457.512392986209]
[null,2040,"Protected Steel",7306.1991140729242,7348.7612281458496,7391.323342218775,7401.5969559605155,7411.870569702256,7422.1441834439966,7432.4177971857371]
[null,2041,"High density polyethylene (80)",97.742000000000004,97.742000000000004,97.742000000000004,97.742000000000004,97.742000000000004,97.742000000000004,97.742000000000004]
[null,2041,"Polyamide",42268.939967670936,42735.194029569095,43131.809037009865,43505.169075813996,43871.208519600354,44245.840603229895,44642.379795017543]
[null,2041,"Protected Steel",4170.0797144096059,4194.3724288192125,4218.665143228819,4224.5289018794138,4230.3926605300085,4236.2564191806032,4242.1201778311979]
[null,2042,"High density polyethylene (100)",19.820217314067797,22.086854218724053,24.014949406025874,25.829993417078757,27.609449253813601,29.430677154683785,31.358403773491812]
[null,2042,"Polyamide",43230.537270138622,43707.398379398954,44113.036180445735,44494.889973917903,44869.256632486817,45252.411409169734,45657.971669795101]
[null,2042,"Protected Steel",1354.0520023504569,1361.9400047009137,1369.8280070513706,1371.7320076187223,1373.6360081860739,1375.5400087534256,1377.4440093207772]
[null,2043,"Polyamide",12050.603664381146,12183.5297067929,12296.602101455976,12403.044653722196,12507.400151304431,12614.205355391257,12727.256135497923]
[null,2043,"Protected Steel",1894.7548558062729,1905.7927116125456,1916.8305674188184,1919.4948774410223,1922.1591874632261,1924.8234974854299,1927.4878075076338]
[null,2044,"High density polyethylene (100)",317.71296401532658,354.04656812842222,384.95343595708908,414.04812263141633,442.57234006379167,471.76615289460176,502.66711266551374]
[null,2044,"High density polyethylene (80)",70.075000000000003,70.075000000000003,70.075000000000003,70.075000000000003,70.075000000000003,70.075000000000003,70.075000000000003]
[null,2044,"Other",66.497,66.497,66.497,66.497,66.497,66.497,66.497]
[null,2044,"Polyamide",26459.005676886056,26750.865820056672,26999.134140517035,27232.845593744783,27461.974588427758,27696.482301066852,27944.703163351118]
[null,2044,"Protected Steel",2529.0549581282862,2543.7879162565719,2558.5208743848575,2562.0771056572021,2565.6333369295467,2569.1895682018912,2572.7457994742358]
[null,2045,"Cast Iron",896.04900000000009,896.04900000000009,896.04900000000009,896.04900000000009,896.04900000000009,896.04900000000009,896.04900000000009]
[null,2045,"High density polyethylene (100)",1570.5226174999111,2956.5614276119022,4275.0461288268107,5536.6832929669526,6812.7316151275509,8087.4321262589838,9364.6886694465429]
[null,2045,"High density polyethylene (575)",124.38800000000001,124.38800000000001,124.38800000000001,124.38800000000001,124.38800000000001,124.38800000000001,124.38800000000001]
[null,2045,"High density polyethylene (80)",603.60199999999998,603.60199999999998,603.60199999999998,603.60199999999998,603.60199999999998,603.60199999999998,603.60199999999998]
[null,2045,"Polyamide",30882.224438599158,29889.517674677692,28905.617495453764,27958.946955798878,26991.689602289138,26033.028812983895,25090.292833682899]
[null,2045,"Protected Steel",354.97489904164183,357.04279808328363,359.11069712492542,359.60984516945962,360.10899321399381,360.60814125852801,361.1072893030622]
[null,2046,"High density polyethylene (80)",26.652000000000001,26.652000000000001,26.652000000000001,26.652000000000001,26.652000000000001,26.652000000000001,26.652000000000001]
[null,2046,"Other",182.79500000000002,182.79500000000002,182.79500000000002,182.79500000000002,182.79500000000002,182.79500000000002,182.79500000000002]
[null,2046,"Polyamide",76779.304106428928,77626.230062857387,78346.660343170995,79024.849197267074,79689.740575922799,80370.240032474525,81090.532597645724]
[null,2046,"Protected Steel",5187.4926326346176,5217.7122652692351,5247.9318979038526,5255.2262919880704,5262.5206860722883,5269.8150801565062,5277.109474240724]
[null,2047,"High density polyethylene (100)",31.718276778619224,35.345573874271736,38.431102949826133,41.335716324932221,44.183377975181884,47.097887423862019,50.182826679571718]
[null,2047,"Polyamide",31781.095864311043,32131.662144176193,32429.868334876512,32710.589620865998,32985.806710814097,33267.484419618326,33565.633606179392]
[null,2047,"Protected Steel",453.02710014130338,455.66620028260678,458.30530042391018,458.94232459594895,459.57934876798771,460.21637294002647,460.85339711206524]
[null,2048,"Polyamide",20762.916567251727,20991.945120930573,21186.766290212581,21370.164391541006,21549.966545024679,21733.989487207877,21928.773415099837]
[null,2049,"High density polyethylene (100)",313.96738420305525,349.8726444036044,380.41514516730626,409.16682893210645,437.35476882759667,466.20441013137702,496.74107248856382]
[null,2049,"Polyamide",34133.420287365916,34509.934244603399,34830.212603881082,35131.711887581027,35427.299574096694,35729.826071648778,36050.043207542236]
[null,2049,"Protected Steel",1807.6283018413812,1818.1586036827625,1828.6889055241438,1831.2307025203393,1833.7724995165347,1836.3142965127302,1838.8560935089256]
[null,2050,"Polyamide",13630.764619663789,13781.120871217692,13909.020123368,14029.420180980518,14147.459514438622,14268.26977736062,14396.14458069998]
[null,2050,"Protected Steel",3783.7330598453768,3805.7751196907539,3827.8171795361309,3833.1376767401875,3838.4581739442442,3843.7786711483009,3849.0991683523575]
[null,2060,"Cast Iron",105.34,105.34,105.34,105.34,105.34,105.34,105.34]
[null,2060,"High density polyethylene (100)",506.25188330242781,564.14676828588154,613.39455423548793,659.75476483823081,705.20597530306839,751.72413603403322,800.96250793478475]
[null,2060,"High density polyethylene (575)",47.856000000000002,47.856000000000002,47.856000000000002,47.856000000000002,47.856000000000002,47.856000000000002,47.856000000000002]
[null,2060,"High density polyethylene (80)",44.106999999999999,44.106999999999999,44.106999999999999,44.106999999999999,44.106999999999999,44.106999999999999,44.106999999999999]
[null,2060,"Other",18.228000000000002,18.228000000000002,18.228000000000002,18.228000000000002,18.228000000000002,18.228000000000002,18.228000000000002]
[null,2060,"Polyamide",34933.004992643459,35318.338892300897,35646.119859736624,35954.681846613363,36257.193755525041,36566.807019019339,36894.525328896321]
[null,2060,"Protected Steel",4328.1958165409078,4353.4096330818147,4378.6234496227216,4384.7095432705264,4390.7956369183312,4396.881730566136,4402.9678242139407]
[null,2061,"High density polyethylene (80)",100.71600000000001,100.71600000000001,100.71600000000001,100.71600000000001,100.71600000000001,100.71600000000001,100.71600000000001]
[null,2061,"Polyamide",9221.1379694968855,9322.8531541428601,9409.376301096192,9490.8262838197425,9570.6792495201717,9652.4067338997247,9738.9133413657128]
[null,2062,"High density polyethylene (100)",174.63067497961697,194.60141123955128,211.58934626811856,227.58121738362374,243.25953053939654,259.30588626703701,276.29057393641403]
[null,2062,"Polyamide",17172.325323013865,17361.747306158359,17522.877486876674,17674.56002383789,17823.268470620846,17975.467792899697,18136.567172489311]
[null,2062,"Protected Steel",18.196000429754296,18.302000859508592,18.408001289262888,18.433587599893237,18.459173910523585,18.484760221153934,18.510346531784283]
[null,2063,"High density polyethylene (100)",59.488016908868396,66.291057076079511,72.078004680468737,77.525642670957268,82.866467003349086,88.332665201134276,94.118506591174608]
[null,2063,"Polyamide",24837.515524730032,25111.48957067775,25344.543236376143,25563.932124936018,25779.019382261627,25999.155732979849,26232.164848886769]
[null,2064,"High density polyethylene (100)",49.677676359467299,55.35880753929635,60.191412913256713,64.740665200983983,69.200718779232872,73.765470456907209,78.597152045519465]
[null,2064,"Polyamide",25811.987531343919,26096.710641063695,26338.907905405671,26566.904270436004,26790.430234565218,27019.203387591602,27261.354354281102]
[null,2064,"Protected Steel",3574.5474533570023,3595.3709067140039,3616.1943600710056,3621.2207108813163,3626.2470616916271,3631.2734125019379,3636.2997633122486]
[null,2065,"High density polyethylene (100)",306.24020174102702,341.26178258226793,371.05258909961736,399.09665316339328,426.59084789374793,454.73045862258738,484.51557042488366]
[null,2065,"Other",28.975999999999999,28.975999999999999,28.975999999999999,28.975999999999999,28.975999999999999,28.975999999999999,28.975999999999999]
[null,2065,"Polyamide",67877.966218137793,68626.704594042152,69263.612453507318,69863.17610758837,70450.983916793892,71052.590295763555,71689.376405964475]
[null,2065,"Protected Steel",8620.7117808295079,8670.9315616590138,8721.1513424885197,8733.273358550814,8745.3953746131083,8757.5173906754026,8769.6394067376968]
[null,2066,"Cast Iron",700.755,700.755,700.755,700.755,700.755,700.755,700.755]
[null,2066,"High density polyethylene (100)",603.56056455620967,672.58365487557091,731.29755297899999,786.56884343190029,840.75641122714467,896.21601202852105,954.91868657144789]
[null,2066,"Other",29.839999999999996,29.839999999999996,29.839999999999996,29.839999999999996,29.839999999999996,29.839999999999996,29.839999999999996]
[null,2066,"Polyamide",93479.014847728686,94510.149539261693,95387.275395688295,96212.972199005671,97022.47928924096,97850.989257430992,98727.947445291284]
[null,2066,"Protected Steel",7468.9059594856726,7512.4159189713464,7555.9258784570202,7566.4282824708034,7576.9306864845867,7587.4330904983699,7597.9354945121531]
[null,2067,"High density polyethylene (100)",387.8516539916003,432.20630755260629,469.93621210403012,505.45387624461216,540.27513367819029,575.91380718288451,613.63649940673076]
[null,2067,"High density polyethylene (80)",30.286000000000001,30.286000000000001,30.286000000000001,30.286000000000001,30.286000000000001,30.286000000000001,30.286000000000001]
[null,2067,"Polyamide",65450.180767779057,66172.139081810252,66786.26671198188,67364.385823790348,67931.169561028088,68511.258335757637,69125.268571260603]
[null,2067,"Protected Steel",3863.5399733941645,3886.046946788329,3908.5539201824936,3913.9866378983265,3919.4193556141595,3924.8520733299924,3930.2847910458254]
[null,2068,"Other",8.5890000000000004,8.5890000000000004,8.5890000000000004,8.5890000000000004,8.5890000000000004,8.5890000000000004,8.5890000000000004]
[null,2068,"Polyamide",68624.295269352631,69381.26614297062,70025.176905807093,70631.33285777249,71225.603707475297,71833.824844414848,72477.612519334521]
[null,2068,"Protected Steel",2337.8883207774784,2351.507641554957,2365.1269623324356,2368.4143845890685,2371.7018068457014,2374.9892291023343,2378.2766513589672]
[null,2069,"High density polyethylene (100)",377.64452142555677,420.83188892716663,457.56885163214702,492.15179368868456,526.05665644640408,560.75742325095507,597.48736343593748]
[null,2069,"Other",4.3049999999999997,4.3049999999999997,4.3049999999999997,4.3049999999999997,4.3049999999999997,4.3049999999999997,4.3049999999999997]
[null,2069,"Polyamide",63628.534607493413,64330.398972581868,64927.433857916061,65489.462434177345,66040.47112837412,66604.41454679273,67201.335304852561]
[null,2069,"Protected Steel",3680.4000957685894,3701.8401915371787,3723.2802873057681,3728.4554828361174,3733.6306783664668,3738.8058738968161,3743.9810694271655]
[null,2070,"High density polyethylene (100)",316.44277347929301,352.63111880438964,383.4144234944352,412.3927919827006,440.8029719185493,469.88007026500287,500.6574905172269]
[null,2070,"Polyamide",55649.59812744872,56263.449603018453,56785.617080894059,57277.167995873002,57759.080907838281,58252.306546228509,58774.374208243309]
[null,2070,"Protected Steel",3251.5669369394409,3270.5088738788818,3289.4508108183227,3294.0230024933603,3298.5951941683979,3303.1673858434356,3307.7395775184732]
[null,2071,"High density polyethylene (100)",574.15576766772688,639.81613008429917,695.66955262048862,748.2480875075463,799.79569749495806,852.55336846054422,908.39611423556903]
[null,2071,"High density polyethylene (80)",264.59699999999998,264.59699999999998,264.59699999999998,264.59699999999998,264.59699999999998,264.59699999999998,264.59699999999998]
[null,2071,"Polyamide",46744.642327876078,47260.2663149933,47698.877424684404,48111.771182767043,48516.569194990079,48930.869690039253,49369.396956236982]
[null,2072,"High density polyethylene (100)",1350.3071769800667,1504.7280913154943,1636.084913900203,1759.7398121197014,1880.970167437586,2005.0463602710456,2136.3780731067291]
[null,2072,"High density polyethylene (80)",202.95499999999998,202.95499999999998,202.95499999999998,202.95499999999998,202.95499999999998,202.95499999999998,202.95499999999998]
[null,2072,"Polyamide",26496.754406594722,26789.030942950772,27037.653464692874,27271.698351103467,27501.154241233471,27735.996523068668,27984.571518926692]
[null,2072,"Protected Steel",574.81557642843563,578.16415285687117,581.5127292853067,582.32100635423944,583.12928342317218,583.93756049210492,584.74583756103766]
[null,2073,"High density polyethylene (100)",317.46895972923033,353.77465955091509,384.65779083410172,413.73013272223756,442.23244349010957,471.40383540561243,502.28106316844611]
[null,2073,"High density polyethylene (80)",750.27599999999995,750.27599999999995,750.27599999999995,750.27599999999995,750.27599999999995,750.27599999999995,750.27599999999995]
[null,2073,"Polyamide",73120.698154106649,73927.267293272598,74613.368394096193,75259.24091233495,75892.449592327175,76540.522610644432,77226.492558581493]
[null,2073,"Protected Steel",7725.1376318723624,7770.1402637447236,7815.1428956170848,7826.0055998621374,7836.8683041071899,7847.7310083522425,7858.5937125972951]
[null,2074,"High density polyethylene (100)",652.37396405184086,726.97934698612698,790.4417742884043,850.18317054336319,908.75319728277464,968.69813362255945,1032.1484296507185]
[null,2074,"High density polyethylene (80)",4890.0889999999999,4890.0889999999999,4890.0889999999999,4890.0889999999999,4890.0889999999999,4890.0889999999999,4890.0889999999999]
[null,2074,"Polyamide",77479.21054888831,78333.856931284274,79060.854525542745,79745.225628276137,80416.1780381547,81102.880806383619,81829.739430112997]
[null,2074,"Protected Steel",3122.6780976322075,3140.8691952644149,3159.0602928966223,3163.4512474974999,3167.8422020983776,3172.2331566992552,3176.6241113001329]
[null,2075,"Polyamide",93315.89714309253,94345.232539625184,95220.827841235703,96045.083831687196,96853.178359555823,97680.242606002852,98555.670531623007]
[null,2075,"Protected Steel",9119.3445559008851,9172.469111801769,9225.593667702653,9238.4168363683839,9251.2400050341148,9264.0631736998457,9276.8863423655766]
[null,2076,"High density polyethylene (100)",480.23122062484964,535.15038675648498,581.86690305934371,625.84426148603893,668.9593411535385,713.08653128531114,759.79411740870444]
[null,2076,"High density polyethylene (80)",629.14300000000003,629.14300000000003,629.14300000000003,629.14300000000003,629.14300000000003,629.14300000000003,629.14300000000003]
[null,2076,"Polyamide",83395.602625474625,84315.510683218963,85098.022560288227,85834.652943168796,86556.839968029235,87295.980064776828,88078.342359384696]
[null,2076,"Protected Steel",8656.8684105391767,8707.2988210783533,8757.7292316175299,8769.9020893338839,8782.0749470502378,8794.2478047665918,8806.4206624829458]
[null,2077,"High density polyethylene (100)",989.77260096179884,1102.9628384353953,1199.247140378096,1289.8859463615631,1378.7475669943306,1469.6951811311869,1565.9610776754525]
[null,2077,"High density polyethylene (80)",285.279,285.279,285.279,285.279,285.279,285.279,285.279]
[null,2077,"Polyamide",73133.105312794753,73939.811311038298,74626.028829859104,75272.01094008793,75905.327063263467,76553.510046952812,77239.596390633]
[null,2077,"Protected Steel",4075.4182660710676,4099.1595321421346,4122.9007982132016,4128.6314486441488,4134.362099075096,4140.0927495060432,4145.8233999369904]
[null,2079,"High density polyethylene (100)",1457.4387410596378,1624.1112040510909,1765.8897011228562,1899.3552134590495,2030.2038229049865,2164.1240548059236,2305.8754499547845]
[null,2079,"High density polyethylene (575)",378.24199999999996,378.24199999999996,378.24199999999996,378.24199999999996,378.24199999999996,378.24199999999996,378.24199999999996]
[null,2079,"High density polyethylene (80)",370.59800000000001,370.59800000000001,370.59800000000001,370.59800000000001,370.59800000000001,370.59800000000001,370.59800000000001]
[null,2079,"Polyamide",24292.507297276872,24560.469545909295,24788.409327929698,25002.984178259467,25213.351787810883,25428.657698778257,25656.553908560792]
[null,2080,"High density polyethylene (100)",3541.0654534866039,3946.0211364386387,4290.4932050643592,4614.7676336567893,4932.6839051900215,5258.063142990808,5602.4693634403993]
[null,2080,"High density polyethylene (575)",316.952,316.952,316.952,316.952,316.952,316.952,316.952]
[null,2080,"Polyamide",2204.9565235299774,2229.278636556493,2249.9680328047853,2269.4443351160385,2288.5387590609807,2308.0814175083979,2328.7668588380411]
[null,2084,"High density polyethylene (100)",133.76679830016718,149.06434811207896,162.07707728333105,174.32682320110715,186.33638425812023,198.62786529558718,211.63810699525467]
[null,2084,"High density polyethylene (575)",67.906999999999996,67.906999999999996,67.906999999999996,67.906999999999996,67.906999999999996,67.906999999999996,67.906999999999996]
[null,2084,"High density polyethylene (80)",2563.047,2563.047,2563.047,2563.047,2563.047,2563.047,2563.047]
[null,2084,"Polyamide",17809.218376983747,18005.665707194796,18172.771938969334,18330.080129555317,18484.303925892931,18642.148068506536,18809.222356789618]
[null,2084,"Protected Steel",457.12899565001197,459.79199130002394,462.4549869500359,463.09777900348706,463.74057105693822,464.38336311038938,465.02615516384054]
[null,2085,"High density polyethylene (100)",4972.0320099186911,5540.6328010318621,6024.308173381618,6479.6239138382507,6926.0121264539921,7382.8791363861419,7866.4620509025681]
[null,2085,"High density polyethylene (575)",494.39900000000006,494.39900000000006,494.39900000000006,494.39900000000006,494.39900000000006,494.39900000000006,494.39900000000006]
[null,2085,"High density polyethylene (80)",2220.6430000000005,2220.6430000000005,2220.6430000000005,2220.6430000000005,2220.6430000000005,2220.6430000000005,2220.6430000000005]
[null,2085,"Polyamide",48760.030420290837,49297.885456616015,49755.407217103675,50186.102826308314,50608.353642810929,51040.516640230897,51497.950942325806]
[null,2086,"High density polyethylene (100)",3116.2425893236496,3472.6155969903803,3775.761230750677,4061.1323424349707,4340.9080873920075,4627.2514639365199,4930.3391493494682]
[null,2086,"High density polyethylene (575)",390.46100000000001,390.46100000000001,390.46100000000001,390.46100000000001,390.46100000000001,390.46100000000001,390.46100000000001]
[null,2086,"High density polyethylene (80)",1566.7299999999998,1566.7299999999998,1566.7299999999998,1566.7299999999998,1566.7299999999998,1566.7299999999998,1566.7299999999998]
[null,2086,"Other",52.555,52.555,52.555,52.555,52.555,52.555,52.555]
[null,2086,"Polyamide",64930.81771229305,65647.047112033863,66256.301490539525,66829.833087006991,67392.119257849685,67967.60488748533,68576.742802877503]
[null,2086,"Protected Steel",5440.2550952102374,5471.9471904204747,5546.0875842501073,6095.3605352224804,10220.337327957976,12026.588733886401,12034.238549971631]
[null,2087,"High density polyethylene (100)",1779.6019327788592,1983.1169272169452,2156.235206776299,2319.2029370975911,2478.9753046841111,2642.4982691936352,2815.5834560177518]
[null,2087,"Polyamide",50759.65453955008,51319.566738145884,51795.851234002475,52244.209451716612,52683.776560062724,53133.662342838717,53609.855793678231]
[null,2087,"Protected Steel",2286.8912383126617,2300.2134766253234,2313.5357149379852,2316.7514276341449,2319.9671403303046,2323.1828530264643,2326.398565722624]
[null,2088,"High density polyethylene (100)",375.34586422569714,418.27035765494969,454.78370879129403,489.15615043212182,522.85464012610908,557.34418933598977,593.85056069720667]
[null,2088,"Other",69.841999999999999,69.841999999999999,69.841999999999999,69.841999999999999,69.841999999999999,69.841999999999999,69.841999999999999]
[null,2088,"Polyamide",93293.734273983908,94322.825199570449,95198.21254407338,96022.272770692696,96830.175373136008,97657.043188779717,98532.263197044696]
[null,2088,"Protected Steel",1544.3143719076566,1553.3107438153131,1562.3071157229697,1564.4786537696455,1566.6501918163212,1568.821729862997,1570.9932679096728]
[null,2089,"High density polyethylene (100)",59.000008336675968,65.747239921065187,71.486714434493976,76.889662852599685,82.186673855984864,87.608030223155524,93.346407597039274]
[null,2089,"High density polyethylene (575)",14.666,14.666,14.666,14.666,14.666,14.666,14.666]
[null,2089,"Polyamide",23607.892222499402,23868.302718954084,24089.818667938111,24298.346337735784,24502.785335844117,24712.02346341914,24933.497068124623]
[null,2089,"Protected Steel",42.605195699452892,42.853391398905785,43.101587098358678,43.161496405123167,43.221405711887655,43.281315018652144,43.341224325416633]
[null,2090,"High density polyethylene (100)",67.201516887564168,74.886671687462368,81.423982516962155,87.577987229810049,93.611328316243828,99.786299841382572,106.32236101950531]
[null,2090,"Polyamide",26510.333464937146,26802.759787190687,27051.50972301816,27285.674552766664,27515.24803446548,27750.210668287844,27998.913053875171]
[null,2090,"Protected Steel",4721.8017599443592,4749.3085198887184,4776.8152798330775,4783.4548425782677,4790.094405323458,4796.7339680686482,4803.3735308138384]
[null,2092,"Other",9.5340000000000007,9.5340000000000007,9.5340000000000007,9.5340000000000007,9.5340000000000007,9.5340000000000007,9.5340000000000007]
[null,2092,"Polyamide",31920.11777381134,32272.217556292053,32571.728207802436,32853.677469358976,33130.098457546934,33413.008325654569,33712.461723669156]
[null,2093,"High density polyethylene (100)",59.075261995004702,65.831099575810384,71.577894706069529,76.987734506832396,82.291501771232618,87.719773000133557,93.465469591462025]
[null,2093,"High density polyethylene (80)",2030.0020000000002,2030.0020000000002,2030.0020000000002,2030.0020000000002,2030.0020000000002,2030.0020000000002,2030.0020000000002]
[null,2093,"Polyamide",71170.439548779657,71955.496059590572,72623.297628136919,73251.943581689644,73868.263464004907,74499.051226399286,75166.725140139024]
[null,2093,"Protected Steel",8957.6113825951561,9009.7937651903121,9061.9761477854681,9074.5718953084361,9087.167642831404,9099.7633903543719,9112.3591378773399]
[null,2094,"High density polyethylene (100)",161.05537109989018,179.47363776384927,195.14097788359669,209.88968533370488,224.34920994940029,239.14816652915144,254.81251173039706]
[null,2094,"High density polyethylene (80)",133.23699999999999,133.23699999999999,133.23699999999999,133.23699999999999,133.23699999999999,133.23699999999999,133.23699999999999]
[null,2094,"Other",48.194000000000003,48.194000000000003,48.194000000000003,48.194000000000003,48.194000000000003,48.194000000000003,48.194000000000003]
[null,2094,"Polyamide",14388.539426569068,14547.254430010147,14682.263982558548,14809.357438007099,14933.958929613647,15061.4853949067,15196.469139461929]
[null,2095,"High density polyethylene (100)",1430.3782096487901,1593.9560345652155,1733.1021043758501,1864.0895381574603,1992.5086575629425,2123.9423680480509,2263.0618391421358]
[null,2095,"High density polyethylene (575)",6.7,6.7,6.7,6.7,6.7,6.7,6.7]
[null,2095,"High density polyethylene (80)",2129.9300000000007,2129.9300000000007,2129.9300000000007,2129.9300000000007,2129.9300000000007,2129.9300000000007,2129.9300000000007]
[null,2095,"Polyamide",32183.606963427454,32538.613204054946,32840.596209189054,33124.872861357588,33403.57560623224,33688.820794416395,33990.746073447517]
[null,2096,"High density polyethylene (100)",1201.9286266877361,1339.3809935737229,1456.303667219287,1566.3707427217432,1674.279696302194,1784.7217724455575,1901.6220955277263]
[null,2096,"High density polyethylene (80)",777.47400000000005,777.47400000000005,777.47400000000005,777.47400000000005,777.47400000000005,777.47400000000005,777.47400000000005]
[null,2096,"Polyamide",33240.921548362348,33607.590660599752,33919.494587154935,34213.11046133285,34500.96931097078,34795.585540073138,35107.429844073806]
[null,2096,"Protected Steel",70.452419132164209,70.862838264328417,71.273257396492625,71.372324083566738,71.471390770640852,71.570457457714966,71.669524144789079]
[null,2097,"High density polyethylene (100)",6018.3828196673157,6706.6441232265242,7292.1076812725969,7843.2433989071078,8383.5728143954275,8936.5862620086482,9521.9379047181847]
[null,2097,"High density polyethylene (575)",676.51099999999997,676.51099999999997,676.51099999999997,676.51099999999997,676.51099999999997,676.51099999999997,676.51099999999997]
[null,2097,"High density polyethylene (80)",4.5940000000000003,4.5940000000000003,4.5940000000000003,4.5940000000000003,4.5940000000000003,4.5940000000000003,4.5940000000000003]
[null,2097,"Polyamide",47391.059343543675,47913.813733255934,48358.49025858497,48777.093795106288,49187.489632234559,49607.519359047248,50052.110881437504]
[null,2099,"High density polyethylene (100)",6680.1042002491395,7444.0398558126662,8093.8751505060945,8705.6082576534955,9305.3469093933672,9919.1642029897794,10568.875277251895]
[null,2099,"High density polyethylene (575)",420.98400000000004,420.98400000000004,420.98400000000004,420.98400000000004,420.98400000000004,420.98400000000004,420.98400000000004]
[null,2099,"High density polyethylene (80)",18.411000000000001,18.411000000000001,18.411000000000001,18.411000000000001,18.411000000000001,18.411000000000001,18.411000000000001]
[null,2099,"Other",40.262,40.262,40.262,40.262,40.262,40.262,40.262]
[null,2099,"Polyamide",100392.08734017951,101499.47774411664,102441.46986641432,103328.22959243596,104197.60232424937,105087.38325769448,106029.19531179845]
[null,2099,"Protected Steel",4161.6576518558022,4185.9013037116038,4210.1449555674053,4215.9968715325986,4221.8487874977918,4227.7007034629851,4233.5526194281783]
[null,2100,"High density polyethylene (100)",5231.9684076486574,5830.2954839292452,6339.2572650769507,6818.3767809654282,7288.1020404354495,7768.8539257196717,8277.7184153652197]
[null,2100,"High density polyethylene (575)",67.73,67.73,67.73,67.73,67.73,67.73,67.73]
[null,2100,"High density polyethylene (80)",5222.7960000000003,5222.7960000000003,5222.7960000000003,5222.7960000000003,5222.7960000000003,5222.7960000000003,5222.7960000000003]
[null,2100,"Polyamide",83799.677269466527,84724.042534896114,85510.345897345804,86250.545457141518,86976.231676872907,87718.953110789982,88505.106166010097]
[null,2100,"Protected Steel",7746.2284962731937,7791.3539925463892,7836.4794888195847,7847.3718499889765,7858.2642111583682,7869.1565723277599,7880.0489334971517]
[null,2101,"High density polyethylene (100)",6827.4884900859734,7608.278989631136,8272.451712386799,8897.681592468256,9510.6523814060893,10138.012431701251,10802.058193328823]
[null,2101,"High density polyethylene (575)",1148.308,1148.308,1148.308,1148.308,1148.308,1148.308,1148.308]
[null,2101,"High density polyethylene (80)",3808.7290000000003,3808.7290000000003,3808.7290000000003,3808.7290000000003,3808.7290000000003,3808.7290000000003,3808.7290000000003]
[null,2101,"Other",141.73699999999999,141.73699999999999,141.73699999999999,141.73699999999999,141.73699999999999,141.73699999999999,141.73699999999999]
[null,2101,"Polyamide",61552.060992600891,62231.020495203833,62808.57155627248,63352.258715170916,63885.285618302813,64430.825129797238,65008.265788056895]
[null,2101,"Protected Steel",6935.4191429056482,6975.8212858112965,7016.2234287169449,7025.9756701079632,7035.7279114989815,7045.4801528899998,7055.2323942810181]
[null,2102,"High density polyethylene (100)",430.55240405843796,479.79030861635914,521.67410862682073,561.10211035089992,599.75703407255946,639.31936775602549,681.19516139357256]
[null,2102,"Polyamide",26701.523125107749,26996.058394397001,27246.602287881069,27482.455889077231,27713.685029917728,27950.342188864517,28200.838189181246]
[null,2103,"High density polyethylene (100)",2979.4485415861668,3320.1778036760506,3610.0162198153294,3882.8603640522292,4150.3547619977835,4424.1284914761336,4713.9115030331159]
[null,2103,"High density polyethylene (575)",4.9420000000000002,4.9420000000000002,4.9420000000000002,4.9420000000000002,4.9420000000000002,4.9420000000000002,4.9420000000000002]
[null,2103,"High density polyethylene (80)",184.398,184.398,184.398,184.398,184.398,184.398,184.398]
[null,2103,"Polyamide",41516.892086623346,41974.850568373324,42364.40901191243,42731.126238612327,43090.653118130693,43458.619757467532,43848.103734263641]
[null,2103,"Protected Steel",5689.3713166826028,5722.5146333652056,5755.6579500478083,5763.6580609711955,5771.6581718945827,5779.6582828179698,5787.658393741357]
[null,2104,"High density polyethylene (100)",22.443833493074301,25.010506727340751,27.193825237773304,29.249127907828239,31.264131571769369,33.326436697508811,35.509337851775463]
[null,2104,"Polyamide",13552.896036852762,13702.393346993475,13829.56194801852,13949.274195217004,14066.639204389654,14186.759313514322,14313.903605397347]
[null,2104,"Protected Steel",33.209461038627296,33.402922077254594,33.596383115881892,33.643080607964343,33.689778100046794,33.736475592129246,33.783173084211697]
[null,2105,"High density polyethylene (80)",17.798999999999999,17.798999999999999,17.798999999999999,17.798999999999999,17.798999999999999,17.798999999999999,17.798999999999999]
[null,2105,"Polyamide",2709.5514169656799,2739.4395417932346,2764.8636181060765,2788.7969891097932,2812.2610905122706,2836.2760029708184,2861.6952192987515]
[null,2106,"High density polyethylene (100)",2876.5870525132805,3205.5530910468306,3485.3852222449564,3748.8097861235115,4007.0692965698222,4271.3913529985721,4551.1699923837468]
[null,2106,"Other",44.498000000000005,44.498000000000005,44.498000000000005,44.498000000000005,44.498000000000005,44.498000000000005,44.498000000000005]
[null,2106,"Polyamide",34879.101656561252,35263.840967155949,35591.1161525196,35899.202013151713,36201.247131385113,36510.382646463513,36837.595270952093]
[null,2106,"Protected Steel",67.47507467267981,67.868149345359626,68.261224018039442,68.356104111444907,68.450984204850371,68.545864298255836,68.6407443916613]
[null,2107,"High density polyethylene (100)",3276.0710977513927,3650.7220682617171,3969.4156939037393,4269.4231626178516,4563.54828466252,4864.5778845864534,5183.2105897768515]
[null,2107,"High density polyethylene (575)",4.0289999999999999,4.0289999999999999,4.0289999999999999,4.0289999999999999,4.0289999999999999,4.0289999999999999,4.0289999999999999]
[null,2107,"Other",34.679000000000002,34.679000000000002,34.679000000000002,34.679000000000002,34.679000000000002,34.679000000000002,34.679000000000002]
[null,2107,"Polyamide",63051.296103539389,63746.793150276389,64338.411731021071,64895.341580169719,65441.351519699798,66000.178839544547,66591.68432837828]
[null,2107,"Protected Steel",117.31038928252927,117.99377856505853,118.6771678475878,118.84212388130176,119.00707991501572,119.17203594872969,119.33699198244365]
[null,2108,"Other",18.603000000000002,18.603000000000002,18.603000000000002,18.603000000000002,18.603000000000002,18.603000000000002,18.603000000000002]
[null,2108,"Polyamide",17384.419932370602,17576.181457817198,17739.301750072082,17892.85771115134,18043.40284919976,18197.48197838862,18360.571089091463]
[null,2110,"Polyamide",44502.006902855181,44992.89315401137,45410.461321379764,45803.545960758463,46188.923258286071,46583.347144583291,47000.835490959696]
[null,2111,"Polyamide",50366.827298629993,50922.406355754931,51395.004902089255,51839.893290798325,52276.058604235921,52722.462736232766,53194.970942144304]
[null,2111,"Protected Steel",1850.0172377236754,1860.794475447351,1871.5717131710267,1874.1731153801898,1876.7745175893529,1879.375919798516,1881.977322007679]
[null,2112,"High density polyethylene (100)",1570.4207069707966,1750.0137696427125,1902.7830637008753,2046.5949429479138,2187.587054632027,2331.8889037146546,2484.6289948844023]
[null,2112,"High density polyethylene (80)",105.64500000000001,105.64500000000001,105.64500000000001,105.64500000000001,105.64500000000001,105.64500000000001,105.64500000000001]
[null,2112,"Polyamide",91574.039335604015,92584.160900926057,93443.41212227798,94252.282344856125,95045.292778742383,95856.918837709323,96716.005807352849]
[null,2112,"Protected Steel",14315.099319410569,14398.49163882114,14481.883958231712,14502.013138779092,14522.142319326471,14542.27149987385,14562.400680421229]
[null,2113,"Cast Iron",7.492,7.492,7.492,7.492,7.492,7.492,7.492]
[null,2113,"High density polyethylene (100)",1573.1093149456319,1753.0098463986087,1906.0406861308013,2050.0987756855002,2191.3322701495144,2335.8811683830509,2488.8827552305956]
[null,2113,"Polyamide",60937.425936036336,61609.605611846186,62181.389471567476,62719.647580938181,63247.35188373024,63787.443848820891,64359.118408172915]
[null,2113,"Protected Steel",14032.796693909464,14114.542901063058,15384.202822911295,16915.75246456682,16935.484307672861,16955.216150778902,16974.947993884944]
[null,2114,"High density polyethylene (100)",83.54524322823309,93.099463977124145,101.22667968005109,108.87736740816861,116.37804554596045,124.05479931415697,132.1804614445891]
[null,2114,"Other",49.226999999999997,49.226999999999997,49.226999999999997,49.226999999999997,49.226999999999997,49.226999999999997,49.226999999999997]
[null,2114,"Polyamide",65447.425083186266,66169.353000213523,66783.454773435195,67361.549544379959,67928.30941801345,68508.373768949503,69122.35815244526]
[null,2114,"Protected Steel",9505.5795600478832,9560.9541200957665,9616.3286801436498,9629.6949532586568,9643.0612263736639,9656.4274994886709,9669.793772603678]
[null,2115,"Polyamide",33998.763147475926,34373.791748362259,34692.806602035584,34993.116464022729,35287.538050214498,35588.871073671151,35907.824945487933]
[null,2115,"Protected Steel",1903.563168452119,1914.6523369042382,1925.7415053563573,1928.4182011896273,1931.0948970228974,1933.7715928561674,1936.4482886894375]
[null,2116,"Polyamide",24678.16247183286,24950.37874935189,25181.937184455222,25399.918513183722,25613.625809173827,25832.349804477286,26063.863975612629]
[null,2116,"Protected Steel",5436.4237759378811,5468.0935518757615,5499.7633278136418,5507.4077564883028,5515.0521851629637,5522.6966138376247,5530.3410425122856]
[null,2117,"High density polyethylene (100)",642.83613296214526,716.35077104758761,778.88536562583681,837.75333133644449,895.46705317599469,954.53558317678278,1017.0582238424422]
[null,2117,"Polyamide",57145.765856822371,57776.121041300699,58312.327257208817,58817.09376836603,59311.963153900077,59818.449414258663,60354.553130705826]
[null,2117,"Protected Steel",14.879681280119144,14.966362560238288,15.053043840357432,15.073966907972398,15.094889975587364,15.11581304320233,15.136736110817296]
[null,2118,"High density polyethylene (100)",284.15781384931944,316.6540563178699,344.29670546925979,370.3185663827129,395.83020797551683,421.94072586904866,449.5780909402597]
[null,2118,"Polyamide",40122.989300133871,40565.572122201142,40942.051393079229,41296.456326193082,41643.912323379191,41999.524720909183,42375.932025216993]
[null,2119,"High density polyethylene (80)",268.60000000000002,268.60000000000002,268.60000000000002,268.60000000000002,268.60000000000002,268.60000000000002,268.60000000000002]
[null,2119,"Polyamide",41894.413791817489,42356.536584965768,42749.637364178045,43119.689226631956,43482.485358587037,43853.797994845976,44246.823630173734]
[null,2119,"Protected Steel",3304.1019787551204,3323.3499575102405,3342.5979362653607,3347.2440001028035,3351.8900639402464,3356.5361277776892,3361.1821916151321]
[null,2120,"High density polyethylene (575)",200.995,200.995,200.995,200.995,200.995,200.995,200.995]
[null,2120,"High density polyethylene (80)",829.93799999999987,829.93799999999987,829.93799999999987,829.93799999999987,829.93799999999987,829.93799999999987,829.93799999999987]
[null,2120,"Polyamide",53949.829531203679,54544.931447099276,55051.149773305522,55527.68669291251,55994.879993929157,56473.040483976736,56979.162043110875]
[null,2120,"Protected Steel",11430.031415118281,11496.616830236564,11563.202245354847,11579.274586935122,11595.346928515397,11611.419270095672,11627.491611675947]
[null,2121,"High density polyethylene (80)",99.557000000000002,99.557000000000002,99.557000000000002,99.557000000000002,99.557000000000002,99.557000000000002,99.557000000000002]
[null,2121,"Polyamide",84635.703196375835,85569.290374741307,86363.438278111003,87111.022425094168,87843.94843994487,88594.07962047981,89388.07571708264]
[null,2121,"Protected Steel",2912.1255279274674,2929.0900558549347,2946.054583782402,2950.1494698338597,2954.2443558853174,2958.3392419367751,2962.4341279882328]
[null,2122,"Cast Iron",28.896999999999998,28.896999999999998,28.896999999999998,28.896999999999998,28.896999999999998,28.896999999999998,28.896999999999998]
[null,2122,"High density polyethylene (100)",962.71206955095079,1072.8076689495194,1166.4595436310897,1254.6202710599737,1341.0524016522861,1429.5134943733137,1523.1474668628034]
[null,2122,"High density polyethylene (575)",12.452999999999999,12.452999999999999,12.452999999999999,12.452999999999999,12.452999999999999,12.452999999999999,12.452999999999999]
[null,2122,"High density polyethylene (80)",2162.8450000000003,2162.8450000000003,2162.8450000000003,2162.8450000000003,2162.8450000000003,2162.8450000000003,2162.8450000000003]
[null,2122,"Polyamide",74715.309502448581,75539.468248046149,76240.531796290277,76900.489459681703,77547.507112679843,78209.713264509934,78910.642799694047]
[null,2122,"Protected Steel",4434.9356271326524,4460.7712542653044,4486.6068813979564,4492.8430672575623,4499.0792531171683,4505.3154389767742,4511.5516248363801]
[null,2125,"High density polyethylene (100)",758.72448637451498,845.49209815353458,919.30022081364439,988.78070698650788,1056.8988660540426,1126.616073578195,1200.4100873142343]
[null,2125,"High density polyethylene (80)",275.02999999999997,275.02999999999997,275.02999999999997,275.02999999999997,275.02999999999997,275.02999999999997,275.02999999999997]
[null,2125,"Polyamide",77270.489958052422,78122.834015777989,78847.87315735819,79530.400638558756,80199.545575407843,80884.398440849967,81609.29898627261]
[null,2126,"High density polyethylene (100)",25972.739779706091,28942.978176533892,31469.58592138188,33848.049539655673,36179.877827138152,38566.444916655775,41092.569683268528]
[null,2126,"High density polyethylene (575)",7874.7379999999976,7874.7379999999976,7874.7379999999976,7874.7379999999976,7874.7379999999976,7874.7379999999976,7874.7379999999976]
[null,2126,"High density polyethylene (80)",21187.226000000002,21187.226000000002,21187.226000000002,21187.226000000002,21187.226000000002,21187.226000000002,21187.226000000002]
[null,2126,"Polyamide",58527.261484623785,59172.855469707225,59722.024440279143,60238.993653032332,60745.826477715324,61264.557014508668,61813.621007701018]
[null,2127,"Cast Iron",316.423,316.423,316.423,316.423,316.423,316.423,316.423]
[null,2127,"High density polyethylene (100)",1377.2707908006432,1534.7752597308654,1668.7550815095747,1794.8791830181131,1918.5303271312061,2045.0841358767509,2179.0383465023197]
[null,2127,"Polyamide",30106.354106105093,30438.446888693255,30720.938757827898,30986.867109613006,31247.581315359887,31514.415690148689,31796.853559043404]
[null,2127,"Protected Steel",7881.6001007971099,7927.5142015942201,7973.4283023913304,7984.5110163768395,7995.5937303623487,8006.6764443478578,8017.7591583333669]
[null,2127,"Steel Not Gas",0,0,0,0,0,0,0]
[null,2128,"Cast Iron",937.13599999999997,937.13599999999997,937.13599999999997,937.13599999999997,937.13599999999997,937.13599999999997,937.13599999999997]
[null,2128,"High density polyethylene (100)",629.37941060463334,701.35514005815071,762.58067524500973,820.21633643864993,876.72191596760103,934.55394296625661,995.76777447612176]
[null,2128,"High density polyethylene (575)",162.38900000000001,162.38900000000001,162.38900000000001,162.38900000000001,162.38900000000001,162.38900000000001,162.38900000000001]
[null,2128,"High density polyethylene (80)",457.83499999999998,457.83499999999998,457.83499999999998,457.83499999999998,457.83499999999998,457.83499999999998,457.83499999999998]
[null,2128,"Polyamide",13481.154121145992,13629.860071019988,13756.355508240746,13875.434061657161,13992.17780209344,14111.662058429149,14238.133315187721]
[null,2128,"Protected Steel",8866.5428648002926,8918.1947296005856,8969.8465944008785,8982.3142859043965,8994.7819774079144,9007.2496689114323,9019.7173604149502]
[null,2128,"Steel Not Gas",0,0,0,0,0,0,0]
[null,2130,"Cast Iron",23.193999999999999,23.193999999999999,23.193999999999999,23.193999999999999,23.193999999999999,23.193999999999999,23.193999999999999]
[null,2130,"High density polyethylene (80)",127.086,127.086,127.086,127.086,127.086,127.086,127.086]
[null,2130,"Polyamide",18250.090467718015,18451.400905526265,18622.643897950133,18783.846295985608,18941.887944746224,19103.639562448916,19274.84982061142]
[null,2130,"Protected Steel",1259.1048898813453,1266.4397797626907,1273.7746696440361,1275.5451603050506,1277.315650966065,1279.0861416270795,1280.856632288094]
[null,2131,"Cast Iron",699.2700000000001,699.2700000000001,699.2700000000001,699.2700000000001,699.2700000000001,699.2700000000001,699.2700000000001]
[null,2131,"High density polyethylene (100)",938.14289031356202,1045.4287622760419,1136.6905664809406,1222.6013618871491,1306.8276756256409,1393.0311707623648,1484.2755296533919]
[null,2131,"High density polyethylene (575)",10.538,10.538,10.538,10.538,10.538,10.538,10.538]
[null,2131,"High density polyethylene (80)",242.27699999999999,242.27699999999999,242.27699999999999,242.27699999999999,242.27699999999999,242.27699999999999,242.27699999999999]
[null,2131,"Polyamide",45697.437654466026,46201.510288911762,46630.295339807584,47033.939176368665,47429.668633371752,47834.687692239029,48263.390777959372]
[null,2131,"Protected Steel",1124.6456000279547,1131.1972000559094,1137.7488000838641,1139.3302207802669,1140.9116414766697,1142.4930621730725,1144.0744828694753]
[null,2132,"Cast Iron",23.492000000000001,23.492000000000001,23.492000000000001,23.492000000000001,23.492000000000001,23.492000000000001,23.492000000000001]
[null,2132,"High density polyethylene (100)",140.94896184278429,157.06786273692754,170.77926714173046,183.68672244371081,196.341096957296,209.29252820747544,223.00131158417634]
[null,2132,"High density polyethylene (80)",224.32900000000001,224.32900000000001,224.32900000000001,224.32900000000001,224.32900000000001,224.32900000000001,224.32900000000001]
[null,2132,"Polyamide",35109.12288981703,35496.399485103764,35825.832989867165,36135.950619846692,36439.987669847113,36751.161876550133,37080.532407861057]
[null,2132,"Protected Steel",3638.9657206606371,3660.1644413212734,3681.3631619819098,3686.4800945551669,3691.5970271284241,3696.7139597016812,3701.8308922749384]
[null,2133,"Cast Iron",199.07300000000001,199.07300000000001,199.07300000000001,199.07300000000001,199.07300000000001,199.07300000000001,199.07300000000001]
[null,2133,"High density polyethylene (100)",8.8309027841831167,9.8408034242661113,10.699866717463637,11.508560030793015,12.301397024149248,13.112845571134208,13.971744648547093]
[null,2133,"High density polyethylene (80)",530.11299999999994,530.11299999999994,530.11299999999994,530.11299999999994,530.11299999999994,530.11299999999994,530.11299999999994]
[null,2133,"Polyamide",32812.521384518273,33174.464962671715,33482.349154303316,33772.180985117033,34056.329986393226,34347.149279822937,34654.97461729966]
[null,2133,"Protected Steel",19.096244784902449,19.207489569804899,19.318734354707349,19.345586544166562,19.372438733625774,19.399290923084987,19.426143112544199]
[null,2134,"Cast Iron",246.08699999999999,246.08699999999999,246.08699999999999,246.08699999999999,246.08699999999999,246.08699999999999,246.08699999999999]
[null,2134,"High density polyethylene (100)",2481.5310343023211,2628.0867198825304,2752.7530532764858,2870.1097498217796,2985.1653944098703,3102.9219274750167,3227.5644300524086]
[null,2134,"High density polyethylene (575)",51.067000000000007,51.067000000000007,51.067000000000007,51.067000000000007,51.067000000000007,51.067000000000007,51.067000000000007]
[null,2134,"High density polyethylene (80)",902.96100000000001,902.96100000000001,902.96100000000001,902.96100000000001,902.96100000000001,902.96100000000001,902.96100000000001]
[null,2134,"Polyamide",38936.54614854823,39366.041726434283,39731.388445614743,40075.313568696598,40412.495236987248,40757.592119571127,41122.869000244187]
[null,2135,"Cast Iron",6679.7340000000031,6679.7340000000031,6679.7340000000031,6679.7340000000031,6679.7340000000031,6679.7340000000031,6679.7340000000031]
[null,2135,"High density polyethylene (100)",4514.5068703841234,5030.7851591934977,5469.9528449912968,5883.3705451157002,6288.6822262738451,6703.5084484453855,7142.5921843565075]
[null,2135,"High density polyethylene (575)",1408.557,1408.557,1408.557,1408.557,1408.557,1408.557,1408.557]
[null,2135,"High density polyethylene (80)",2872.8020000000001,2872.8020000000001,2872.8020000000001,2872.8020000000001,2872.8020000000001,2872.8020000000001,2872.8020000000001]
[null,2135,"Polyamide",65086.181448750685,65804.124612149884,66414.836788971239,66989.740707780278,67553.372293381908,68130.234920887713,68740.830355927523]
[null,2135,"Protected Steel",96.498147994964526,97.060295989929045,97.622443984893565,97.758134880229832,97.8938257755661,98.029516670902368,98.165207566238635]
[null,2136,"Cast Iron",7338.2550000000001,7338.2550000000001,7338.2550000000001,7338.2550000000001,7338.2550000000001,7338.2550000000001,7338.2550000000001]
[null,2136,"High density polyethylene (100)",525.34692899987317,585.42552037706093,636.53085738814946,684.63970413270351,731.80526464631271,780.07801915601954,831.17358703474827]
[null,2136,"High density polyethylene (575)",88.180999999999997,88.180999999999997,88.180999999999997,88.180999999999997,88.180999999999997,88.180999999999997,88.180999999999997]
[null,2136,"High density polyethylene (80)",1104.3230000000001,1104.3230000000001,1104.3230000000001,1104.3230000000001,1104.3230000000001,1104.3230000000001,1104.3230000000001]
[null,2136,"Polyamide",17920.811964956636,18118.490245452074,18286.643574498466,18444.937467265951,18600.127638793077,18758.960841894452,18927.082027289627]
[null,2136,"Protected Steel",2889.1486767490887,2905.9793534981768,2922.8100302472649,2926.8726073935964,2930.9351845399278,2934.9977616862593,2939.0603388325908]
[null,2137,"High density polyethylene (100)",285.35389093396867,317.9869165879868,345.74591917960447,371.87731131135098,397.49633650725764,423.71675879404796,451.47045506373621]
[null,2137,"High density polyethylene (80)",42.683999999999997,42.683999999999997,42.683999999999997,42.683999999999997,42.683999999999997,42.683999999999997,42.683999999999997]
[null,2137,"Polyamide",79243.018704822432,80117.121045133172,80860.668682648582,81560.619439900067,82246.84602880555,82949.181531734837,83692.587035067962]
[null,2137,"Protected Steel",7841.7529721611381,7887.4349443222773,7933.1169164834164,7944.1435994188641,7955.1702823543119,7966.1969652897596,7977.2236482252074]
[null,2138,"High density polyethylene (100)",509.80020731332229,568.1008780672006,617.6938421922016,664.37899192871873,710.14877033717471,756.99297727578539,806.57646136877827]
[null,2138,"High density polyethylene (575)",41.818000000000005,41.818000000000005,41.818000000000005,41.818000000000005,41.818000000000005,41.818000000000005,41.818000000000005]
[null,2138,"Polyamide",33110.316469107551,33475.544921873632,33786.223363840836,34078.685608012987,34365.413447254097,34658.872115911094,34969.491169583489]
[null,2138,"Protected Steel",9234.548675150254,9288.3443503005055,9342.1400254507571,9355.1251884180601,9368.1103513853632,9381.0955143526662,9394.0806773199693]
[null,2138,"Steel Not Gas",0,0,0,0,0,0,0]
[null,2140,"Cast Iron",1735.0790000000002,1735.0790000000002,1735.0790000000002,1735.0790000000002,1735.0790000000002,1735.0790000000002,1735.0790000000002]
[null,2140,"High density polyethylene (100)",1144.0049737065499,1274.8332008356797,1386.1211069721764,1490.8838017115022,1593.5923792946012,1698.7120025476634,1809.9786352448546]
[null,2140,"High density polyethylene (575)",87.933000000000007,87.933000000000007,87.933000000000007,87.933000000000007,87.933000000000007,87.933000000000007,87.933000000000007]
[null,2140,"High density polyethylene (80)",404.87200000000001,404.87200000000001,404.87200000000001,404.87200000000001,404.87200000000001,404.87200000000001,404.87200000000001]
[null,2140,"Polyamide",23528.239478124975,23787.771352697149,24008.539909533967,24216.364009482164,24420.113232870121,24628.645393519677,24849.371748947036]
[null,2140,"Protected Steel",5339.1973855818796,5370.3007711637592,5401.4041567456388,5408.9118705067822,5416.4195842679255,5423.9272980290689,5431.4350117902122]
[null,2141,"Cast Iron",3608.7730000000006,3608.7730000000006,3608.7730000000006,3608.7730000000006,3608.7730000000006,3608.7730000000006,3608.7730000000006]
[null,2141,"High density polyethylene (100)",1866.157322340242,2079.5707773838772,2261.1090973193718,2432.0031706750678,2599.5464668399818,2771.0227795869137,2952.5263972392509]
[null,2141,"High density polyethylene (575)",2134.3789999999999,2134.3789999999999,2134.3789999999999,2134.3789999999999,2134.3789999999999,2134.3789999999999,2134.3789999999999]
[null,2141,"High density polyethylene (80)",2252.0740000000001,2252.0740000000001,2252.0740000000001,2252.0740000000001,2252.0740000000001,2252.0740000000001,2252.0740000000001]
[null,2141,"Polyamide",74285.864951348034,75105.286642586929,75802.320656284865,76458.485051276715,77101.78381175609,77760.183771448283,78457.084542359124]
[null,2141,"Protected Steel",12121.225954826048,12411.370872011114,14262.449864478138,14279.494129436149,14296.53839439416,14313.582659352171,14330.626924310181]
[null,2141,"Steel Not Gas",0,0,0,0,0,0,0]
[null,2142,"Cast Iron",4630.0599999999995,4630.0599999999995,4630.0599999999995,4630.0599999999995,4630.0599999999995,4630.0599999999995,4630.0599999999995]
[null,2142,"High density polyethylene (100)",708.86551711089214,789.93126508235218,858.88914633704667,923.80377825487244,987.44560729716761,1052.5814046131138,1121.526104100333]
[null,2142,"High density polyethylene (575)",76.960000000000008,76.960000000000008,76.960000000000008,76.960000000000008,76.960000000000008,76.960000000000008,76.960000000000008]
[null,2142,"High density polyethylene (80)",648.83299999999997,648.83299999999997,648.83299999999997,648.83299999999997,648.83299999999997,648.83299999999997,648.83299999999997]
[null,2142,"Polyamide",70534.378361403651,71312.418701180781,71974.252024184258,72597.279671960161,73208.091408497014,73833.241723438841,74494.948532506387]
[null,2142,"Protected Steel",14804.870471276523,14891.115942553048,14977.361413829572,14998.179286206665,15018.997158583757,15039.81503096085,15060.632903337942]
[null,2143,"Cast Iron",1255.585,1255.585,1255.585,1255.585,1255.585,1255.585,1255.585]
[null,2143,"High density polyethylene (100)",2011.8062172077391,2241.8760567398913,2437.5829868767751,2621.8149137058581,2802.4345435950236,2987.2941521383805,3182.9636715660108]
[null,2143,"High density polyethylene (575)",60.915999999999997,60.915999999999997,60.915999999999997,60.915999999999997,60.915999999999997,60.915999999999997,60.915999999999997]
[null,2143,"Polyamide",25665.637706993599,25948.746482402799,26189.570527148586,26416.274189401414,26638.532797208365,26866.008843194046,27106.786852787613]
[null,2143,"Protected Steel",3528.0656747025309,3548.618349405062,3569.171024107593,3574.1320145530317,3579.0930049984704,3584.0539954439091,3589.0149858893478]
[null,2144,"Cast Iron",7709.549,7709.549,7709.549,7709.549,7709.549,7709.549,7709.549]
[null,2144,"High density polyethylene (100)",2750.3832468751511,3064.9166382366434,3332.471762254967,3584.3391641727908,3831.2681177941004,4083.993636789276,4351.497615827976]
[null,2144,"High density polyethylene (575)",2632.6150000000007,2632.6150000000007,2632.6150000000007,2632.6150000000007,2632.6150000000007,2632.6150000000007,2632.6150000000007]
[null,2144,"High density polyethylene (80)",1047.3589999999999,1047.3589999999999,1047.3589999999999,1047.3589999999999,1047.3589999999999,1047.3589999999999,1047.3589999999999]
[null,2144,"Polyamide",69115.873778200519,69878.267084381703,70526.790392838986,71137.288440236138,71735.81624845491,72348.394274428778,72996.793613249829]
[null,2144,"Protected Steel",11477.952578881373,11544.817157762751,11611.681736644128,11627.821462581012,11643.961188517897,11660.100914454781,11676.240640391665]
[null,2145,"High density polyethylene (100)",2700.91308817956,3009.789080048311,3272.5317858481762,3519.8689389880242,3762.3564699326716,4010.5363055052471,4273.2287862519252]
[null,2145,"High density polyethylene (575)",4.4829999999999997,4.4829999999999997,4.4829999999999997,4.4829999999999997,4.4829999999999997,4.4829999999999997,4.4829999999999997]
[null,2145,"High density polyethylene (80)",177.46600000000001,177.46600000000001,177.46600000000001,177.46600000000001,177.46600000000001,177.46600000000001,177.46600000000001]
[null,2145,"Polyamide",188493.60887572469,190572.81670178723,192341.47695548565,194006.43427823842,195638.74622651355,197309.37609085304,199077.69825312833]
[null,2145,"Protected Steel",10637.90791581285,10699.878831625696,10761.849747438542,10776.808244358885,10791.766741279227,10806.72523819957,10821.683735119912]
[null,2146,"High density polyethylene (100)",984.44099328990228,1097.0215089567812,1192.7871562888956,1282.9377182525916,1371.3206680292024,1461.7783746895318,1557.5257157675635]
[null,2146,"High density polyethylene (575)",352.43700000000001,352.43700000000001,352.43700000000001,352.43700000000001,352.43700000000001,352.43700000000001,352.43700000000001]
[null,2146,"High density polyethylene (80)",146.22399999999999,146.22399999999999,146.22399999999999,146.22399999999999,146.22399999999999,146.22399999999999,146.22399999999999]
[null,2146,"Polyamide",43157.057745013619,43633.108327038535,44038.056660063965,44419.26141151206,44792.991754040711,45175.495277400907,45580.366201801415]
[null,2146,"Protected Steel",10516.340728640949,10577.603457281895,10638.866185922841,10653.653741112035,10668.441296301229,10683.228851490423,10698.016406679617]
[null,2147,"High density polyethylene (575)",1386.3679999999999,1386.3679999999999,1386.3679999999999,1386.3679999999999,1386.3679999999999,1386.3679999999999,1386.3679999999999]
[null,2147,"Polyamide",94656.965268832093,95701.093524172815,96589.27224389308,97425.373841257067,98245.081715265929,99084.0319268358,99972.040865159841]
[null,2147,"Protected Steel",8987.785159316647,9040.1433186332943,9092.5014779499415,9105.1396543367191,9117.7778307234967,9130.4160071102742,9143.0541834970518]
[null,2148,"High density polyethylene (100)",6343.085252251657,7068.4794744396113,7685.5298303320787,8266.4002979089237,8835.8814441632876,9418.7309485831756,10035.663351108109]
[null,2148,"High density polyethylene (575)",10417.043000000009,10417.043000000009,10417.043000000009,10417.043000000009,10417.043000000009,10417.043000000009,10417.043000000009]
[null,2148,"High density polyethylene (80)",2438.1150000000007,2438.1150000000007,2438.1150000000007,2438.1150000000007,2438.1150000000007,2438.1150000000007,2438.1150000000007]
[null,2148,"Other",13.92,13.92,13.92,13.92,13.92,13.92,13.92]
[null,2148,"Polyamide",180545.72672451401,182537.26421062188,184231.34844370204,185826.10240695122,187389.58749644697,188989.77481708824,190683.53521445827]
[null,2148,"Protected Steel",20762.958189883346,20883.912379766702,21004.866569650057,21034.062408587419,21063.25824752478,21092.454086462141,21121.649925399503]
[null,2150,"Cast Iron",694.58399999999995,694.58399999999995,694.58399999999995,694.58399999999995,694.58399999999995,694.58399999999995,694.58399999999995]
[null,2150,"High density polyethylene (100)",1319.4132698222306,1470.3011618409316,1598.6526493799092,1719.4784261888642,1837.9351316248913,1959.1725641768069,2087.4995164569705]
[null,2150,"High density polyethylene (575)",389.88800000000003,389.88800000000003,389.88800000000003,389.88800000000003,389.88800000000003,389.88800000000003,389.88800000000003]
[null,2150,"High density polyethylene (80)",430.995,430.995,430.995,430.995,430.995,430.995,430.995]
[null,2150,"Polyamide",51432.891662848575,52000.230107373391,52482.831675455367,52937.136572662086,53382.533761969229,53838.386484689094,54320.895800202721]
[null,2150,"Protected Steel",9799.7908767765493,9855.9897453801404,9909.8876180702118,9922.8974494091945,9935.9072807481771,9948.9171120871597,9961.9269434261423]
[null,2151,"High density polyethylene (100)",266.80386415593443,297.31551169329538,323.26998223623252,347.70264854298802,371.65625539868648,396.17216426896317,422.12167343853133]
[null,2151,"High density polyethylene (80)",1762.4969999999998,1762.4969999999998,1762.4969999999998,1762.4969999999998,1762.4969999999998,1762.4969999999998,1762.4969999999998]
[null,2151,"Polyamide",39659.98874839826,40097.464371466151,40469.599247443111,40819.914513200871,41163.361030505075,41514.869827103721,41886.933566970998]
[null,2151,"Protected Steel",6323.9922882217015,6360.8325764434039,6397.6728646651063,6406.5653480289657,6415.457831392825,6424.3503147566844,6433.2427981205437]
[null,2152,"Polyamide",26511.342432083336,26803.779883904605,27052.539287003139,27286.713028922451,27516.295248048165,27751.266824405273,27999.978675453927]
[null,2152,"Protected Steel",6337.1197620530293,6374.036524106059,6410.9532861590887,6419.8642287236135,6428.7751712881382,6437.6861138526629,6446.5970564171876]
[null,2153,"High density polyethylene (100)",8821.2098849489867,9830.0020466147635,10688.122422180853,11495.928104541012,12287.894871004988,13098.452762844961,13956.409102871521]
[null,2153,"High density polyethylene (575)",2682.9789999999994,2682.9789999999994,2682.9789999999994,2682.9789999999994,2682.9789999999994,2682.9789999999994,2682.9789999999994]
[null,2153,"High density polyethylene (80)",11970.469999999998,11970.469999999998,11970.469999999998,11970.469999999998,11970.469999999998,11970.469999999998,11970.469999999998]
[null,2153,"Polyamide",219818.82869051603,222243.57418536494,224306.16308500123,226247.81495686132,228151.39621177773,230099.66332886933,232161.85795062501]
[null,2153,"Protected Steel",9751.8552339683629,9808.6644679367255,9865.4737019050881,9879.1862756215887,9892.8988493380893,9906.61142305459,9920.3239967710906]
[null,2154,"High density polyethylene (100)",5264.9899409646951,5867.0933545516018,6379.2674445481516,6861.4109200295707,7334.1008473065112,7817.8869948721058,8329.9631793118369]
[null,2154,"High density polyethylene (575)",1146.2630000000001,1146.2630000000001,1146.2630000000001,1146.2630000000001,1146.2630000000001,1146.2630000000001,1146.2630000000001]
[null,2154,"High density polyethylene (80)",15908.384000000002,15908.384000000002,15908.384000000002,15908.384000000002,15908.384000000002,15908.384000000002,15908.384000000002]
[null,2154,"Polyamide",126834.4728892405,128233.54010546477,129423.64459938364,130543.96897363687,131642.32677359169,132766.4681145123,133956.34511187204]
[null,2154,"Protected Steel",4922.1307725253828,4950.8045450507652,4979.4783175761477,4986.3995730133092,4993.3208284504708,5000.2420838876324,5007.1633393247939]
[null,2155,"High density polyethylene (100)",36081.622993766745,40207.911669699555,43717.903641126759,47022.092121311667,50261.494274059667,53576.940187878485,57086.261200494802]
[null,2155,"High density polyethylene (575)",2258.819,2258.819,2258.819,2258.819,2258.819,2258.819,2258.819]
[null,2155,"Polyamide",370814.22114271461,374904.54460362066,378383.9430742269,381659.33186090708,384870.49900536268,388157.0471045677,391635.78046451858]
[null,2155,"Protected Steel",1918.6470392340204,1929.8240784680409,1941.0011177020613,1943.6990237240661,1946.396929746071,1949.0948357680759,1951.7927417900808]
[null,2156,"High density polyethylene (100)",1978.1735329695148,2204.3971440729347,2396.8323130788376,2577.9843139346117,2755.5844069880086,2937.353596191092,3129.7519799071088]
[null,2156,"High density polyethylene (575)",7.5670000000000002,7.5670000000000002,7.5670000000000002,7.5670000000000002,7.5670000000000002,7.5670000000000002,7.5670000000000002]
[null,2156,"Polyamide",13182.20940097188,13327.617795000597,13451.308194704281,13567.74618007215,13681.901126959809,13798.735818780899,13922.402574224374]
[null,2157,"High density polyethylene (100)",6080.4260403385269,6775.7825967614508,7367.281670628834,7924.099020019511,8469.99866561196,9028.7131024098981,9620.0991072108936]
[null,2157,"High density polyethylene (575)",1542.6460000000002,1542.6460000000002,1542.6460000000002,1542.6460000000002,1542.6460000000002,1542.6460000000002,1542.6460000000002]
[null,2157,"Polyamide",256.35760337829527,259.18539546309859,261.59083247782257,263.85523004299125,266.0752288085805,268.34734121975856,270.75231841885557]
[null,2158,"High density polyethylene (100)",12475.314314693967,13901.989278686497,15115.578065786547,16258.009764394417,17378.041423009359,18524.365408363425,19737.722209722164]
[null,2158,"High density polyethylene (575)",344.55400000000003,344.55400000000003,344.55400000000003,344.55400000000003,344.55400000000003,344.55400000000003,344.55400000000003]
[null,2158,"High density polyethylene (80)",1398.2170000000001,1398.2170000000001,1398.2170000000001,1398.2170000000001,1398.2170000000001,1398.2170000000001,1398.2170000000001]
[null,2158,"Polyamide",25609.086970656233,25891.571954445848,26131.865376215748,26358.069527831936,26579.838419074182,26806.813252580887,27047.060740630754]
[null,2160,"High density polyethylene (100)",147.16765051740464,163.99771966087167,178.31407322010961,191.79100732530472,205.00369468095121,218.52654495956915,232.84016185056441]
[null,2160,"Polyamide",98223.983923565538,99307.458728356229,100229.10725194123,101096.71619783028,101947.31364525529,102817.87855149197,103739.35089570037]
[null,2160,"Protected Steel",3637.0686694273304,3658.2563388546605,3679.4440082819906,3684.5582733161737,3689.6725383503567,3694.7868033845398,3699.9010684187228]
[null,2161,"High density polyethylene (80)",56.067999999999998,56.067999999999998,56.067999999999998,56.067999999999998,56.067999999999998,56.067999999999998,56.067999999999998]
[null,2161,"Polyamide",92151.55411641972,93168.046047607757,94032.716165891208,94846.687555925644,95644.699136973621,96461.443743172378,97325.948573888483]
[null,2161,"Protected Steel",7193.9150052850046,7235.8230105700095,7277.7310158550144,7287.8467412686359,7297.9624666822574,7308.0781920958789,7318.1939175095004]
[null,2162,"High density polyethylene (100)",46.225129731900282,51.511428227652985,56.008172574911981,60.241256579519636,64.391341091805629,68.638847294945364,73.134732058973213]
[null,2162,"Polyamide",44519.594505697147,45010.674759619207,45428.407953771748,45821.647943818913,46207.177546002538,46601.757312250942,47019.410653865503]
[null,2162,"Protected Steel",7569.0966181261674,7613.1902362523351,7657.2838543785028,7667.9271415124058,7678.5704286463088,7689.2137157802117,7699.8570029141147]
[null,2163,"Polyamide",29131.82542731447,29453.168520999388,29726.516259727981,29983.836634459316,30236.11164263438,30494.308712826205,30767.604199277521]
[null,2163,"Protected Steel",3659.9449346442402,3681.2658692884802,3702.5868039327202,3707.7332364330541,3712.8796689333881,3718.026101433722,3723.172533934056]
[null,2164,"Cast Iron",-32778.241000000002,-32778.241000000002,-32778.241000000002,-32778.241000000002,-32778.241000000002,-32778.241000000002,-32778.241000000002]
[null,2164,"High density polyethylene (100)",946.6819001199849,1054.9442918879627,1147.036764266232,1233.7295227742513,1318.7224674027684,1405.7105898046143,1497.7854580811475]
[null,2164,"High density polyethylene (575)",15155.099000000009,15155.099000000009,15155.099000000009,15155.099000000009,15155.099000000009,15155.099000000009,15155.099000000009]
[null,2164,"High density polyethylene (80)",522.05099999999993,522.05099999999993,522.05099999999993,522.05099999999993,522.05099999999993,522.05099999999993,522.05099999999993]
[null,2164,"Polyamide",32148.974191435016,32503.598409929265,32805.256451221561,33089.227193350598,33367.630026266103,33652.568262169378,33954.168639477728]
[null,2164,"Protected Steel",32151.158921205497,32338.454842410996,32525.750763616496,32570.960123907476,32616.169484198457,32661.378844489438,32706.588204780419]
[null,2165,"High density polyethylene (100)",655.77178074607775,730.76573745795542,794.55870170196658,854.6112543253854,913.48633648638508,973.74348931035513,1037.524259095866]
[null,2165,"High density polyethylene (80)",430.03300000000002,430.03300000000002,430.03300000000002,430.03300000000002,430.03300000000002,430.03300000000002,430.03300000000002]
[null,2165,"Polyamide",87806.749304381359,88775.315195945092,89599.217440840352,90374.811324969516,91135.197880692154,91913.434228085694,92737.178978469572]
[null,2165,"Protected Steel",4710.7805561461928,4738.2231122923858,4765.6656684385789,4772.2897337152463,4778.9137989919136,4785.537864268581,4792.1619295452483]
[null,2166,"High density polyethylene (100)",1141.6914938164134,1272.2551517526797,1383.3180043808616,1487.8688413109239,1590.3697150516059,1695.2767586917782,1806.3183809011618]
[null,2166,"High density polyethylene (80)",29.963999999999999,29.963999999999999,29.963999999999999,29.963999999999999,29.963999999999999,29.963999999999999,29.963999999999999]
[null,2166,"Polyamide",88098.102988885003,89069.88270220421,89896.518756933263,90674.686157763703,91437.595770385858,92218.414402501512,93044.892440132855]
[null,2166,"Protected Steel",2630.1760369123681,2645.4980738247364,2660.8201107371046,2664.5185334400903,2668.216956143076,2671.9153788460617,2675.6138015490474]
[null,2167,"High density polyethylene (100)",117.39456678588888,130.81979080168037,142.23984213858472,152.99029466887256,163.52995948474916,174.3170390133514,185.73490732985923]
[null,2167,"High density polyethylene (575)",1715.789,1715.789,1715.789,1715.789,1715.789,1715.789,1715.789]
[null,2167,"High density polyethylene (80)",2983.7080000000001,2983.7080000000001,2983.7080000000001,2983.7080000000001,2983.7080000000001,2983.7080000000001,2983.7080000000001]
[null,2167,"Polyamide",25773.764172155246,26058.065653215897,26299.904262765474,26527.5630022277,26750.757960726118,26979.192337887598,27220.984718344]
[null,2167,"Protected Steel",5499.0757537581185,5531.1105075162368,5563.1452612743551,5570.8777880435564,5578.6103148127577,5586.342841581959,5594.0753683511603]
[null,2168,"High density polyethylene (100)",2398.0672825119364,2672.3098761353826,2905.5919796043218,3125.1959118041877,3340.4939963372954,3560.8461233533199,3794.0836333633515]
[null,2168,"High density polyethylene (575)",1961.3579999999999,1961.3579999999999,1961.3579999999999,1961.3579999999999,1961.3579999999999,1961.3579999999999,1961.3579999999999]
[null,2168,"High density polyethylene (80)",1000.077,1000.077,1000.077,1000.077,1000.077,1000.077,1000.077]
[null,2168,"Polyamide",146470.36202217767,148086.02594213324,149460.37655910425,150754.14404156493,152022.54419275848,153320.71956588849,154694.80746640224]
[null,2168,"Protected Steel",14562.324524807322,14647.157049614641,14731.989574421961,14752.466390754762,14772.943207087563,14793.420023420364,14813.896839753164]
[null,2170,"Cast Iron",150.87400000000002,150.87400000000002,150.87400000000002,150.87400000000002,150.87400000000002,150.87400000000002,150.87400000000002]
[null,2170,"High density polyethylene (100)",14086.602445602861,15876.91773233761,17243.704846009456,18530.352300654027,19791.7720287956,21082.80311603794,22449.328959067578]
[null,2170,"High density polyethylene (575)",4340.1870000000008,4340.1870000000008,4340.1870000000008,4340.1870000000008,4340.1870000000008,4340.1870000000008,4340.1870000000008]
[null,2170,"High density polyethylene (80)",1614.8800000000003,1614.8800000000003,1614.8800000000003,1614.8800000000003,1614.8800000000003,1614.8800000000003,1614.8800000000003]
[null,2170,"Polyamide",273588.67042447801,276606.53245206363,279173.65082879859,281590.24979447364,283959.4656968601,286384.29806164023,288950.92571625748]
[null,2170,"Protected Steel",60984.324426799147,61347.92057146399,61703.17385719598,61788.924650303699,61874.675443411419,61960.426236519139,62046.177029626859]
[null,2171,"High density polyethylene (100)",12548.569190249214,13983.621570177627,15204.336534088272,16353.476576053336,17480.085045296059,18633.14022946202,19853.621845414244]
[null,2171,"High density polyethylene (575)",40.087000000000003,40.087000000000003,40.087000000000003,40.087000000000003,40.087000000000003,40.087000000000003,40.087000000000003]
[null,2171,"Polyamide",211881.42178396901,214218.6124876652,216206.72365727779,218078.26469709669,219913.10980647927,221791.02722257792,223778.75835123396]
[null,2171,"Protected Steel",2079.9476929054317,2092.0643858108633,2104.1810787162949,2107.105797693468,2110.0305166706412,2112.9552356478143,2115.8799546249875]
[null,2172,"Polyamide",14398.472237541717,14557.296806386272,14692.399559802754,14819.580751416275,14944.268258915496,15071.882759292321,15206.95968689965]
[null,2172,"Protected Steel",1166.5527291548124,1173.3484583096247,1180.144187464437,1181.7845358811157,1183.4248842977945,1185.0652327144733,1186.705581131152]
[null,2173,"High density polyethylene (100)",209.39900533443887,233.34584233266247,253.71601325528684,272.89180757329075,291.69161568560475,310.9327423032662,331.29901932933154]
[null,2173,"High density polyethylene (575)",91.93,91.93,91.93,91.93,91.93,91.93,91.93]
[null,2173,"Polyamide",88312.212496524677,89286.353977792271,90114.999050112732,90895.05767258587,91659.82142503612,92442.537722222944,93271.024393408341]
[null,2173,"Protected Steel",3877.8453088342953,3900.4356176685906,3923.0259265028858,3928.4787596697847,3933.9315928366836,3939.3844260035826,3944.8372591704815]
[null,2174,"High density polyethylene (100)",9361.1537432507448,10431.693798810733,11342.339489216125,12199.590737726548,13040.03357460587,13900.20549458996,14810.677108885053]
[null,2174,"High density polyethylene (575)",0.60599999999999998,0.60599999999999998,0.60599999999999998,0.60599999999999998,0.60599999999999998,0.60599999999999998,0.60599999999999998]
[null,2174,"Polyamide",55885.482906988371,56501.936346001814,57026.317161700979,57519.951638522485,58003.907259237174,58499.223558205187,59023.504134948984]
[null,2174,"Protected Steel",742.88073747099577,838.83063402230209,842.61745103345311,1323.531510312007,1324.4455695905606,1325.3596288691142,1326.2736881476678]
[null,2175,"Protected Steel",8168.6201301298661,8216.2062602597307,8263.7923903895953,8275.2786976623211,8286.7650049350468,8298.2513122077726,8309.7376194804983]
[null,2176,"High density polyethylene (100)",5657.0295750629857,6303.9665789508626,6854.2779769172885,7372.3226324256493,7880.2098132984147,8400.0194569010564,8950.2256591051555]
[null,2176,"High density polyethylene (575)",20912.549999999977,20912.549999999977,20912.549999999977,20912.549999999977,20912.549999999977,20912.549999999977,20912.549999999977]
[null,2176,"High density polyethylene (80)",63348.429000000055,63348.429000000055,63348.429000000055,63348.429000000055,63348.429000000055,63348.429000000055,63348.429000000055]
[null,2176,"Polyamide",97799.741068684991,98878.536197229478,99796.203994466152,100660.06561835278,101506.98921876981,102373.794035806,103291.28641460896]
[null,2177,"High density polyethylene (100)",1650.333250874251,1839.0650993771362,1999.6082229985066,2150.7381241381213,2298.9047708146641,2450.5495744310538,2611.0620091436754]
[null,2177,"High density polyethylene (575)",1739.6120000000001,1739.6120000000001,1739.6120000000001,1739.6120000000001,1739.6120000000001,1739.6120000000001,1739.6120000000001]
[null,2177,"High density polyethylene (80)",18518.82,18518.82,18518.82,18518.82,18518.82,18518.82,18518.82]
[null,2177,"Polyamide",57364.70565552394,57997.475889221241,58535.736445975323,59042.436844563861,59539.202199152271,60047.628935733817,60585.786600325737]
[null,2178,"Polyamide",4381.8795476454579,4430.214545859295,4471.3302963541782,4510.0352820764419,4547.981366212588,4586.81822056483,4627.926111504682]
[null,2178,"Protected Steel",14095.070546275831,14177.181092551662,14569.291638827493,14589.11142585959,14608.931212891686,14628.750999923783,14648.570786955879]
[null,2178,"High density polyethylene (100)",0,0,480,480,480,480,480]
[null,2179,"High density polyethylene (100)",11766.008677702548,13111.567561683971,14256.155653012713,15333.632415555701,16389.982731238168,17471.130477812228,18615.499773351417]
[null,2179,"High density polyethylene (575)",3.1629999999999998,3.1629999999999998,3.1629999999999998,3.1629999999999998,3.1629999999999998,3.1629999999999998,3.1629999999999998]
[null,2179,"Polyamide",44113.754928201757,44600.358506067336,45014.283654236911,45403.938877774257,45785.95400116266,46176.936787532868,46590.782811098325]
[null,2179,"Protected Steel",5345.7726898831133,5376.9143797662264,5408.0560696493394,5415.5730292762973,5423.0899889032553,5430.6069485302132,5438.1239081571712]
[null,2190,"Cast Iron",4883.5579999999991,4883.5579999999991,4883.5579999999991,4883.5579999999991,4883.5579999999991,4883.5579999999991,4883.5579999999991]
[null,2190,"High density polyethylene (100)",2760.2665606689916,3075.9302062265119,3344.4467712552209,3597.2192414286856,3845.0355173299704,4098.6691881657225,4367.1344244288275]
[null,2190,"High density polyethylene (575)",1813.0410000000002,1813.0410000000002,1813.0410000000002,1813.0410000000002,1813.0410000000002,1813.0410000000002,1813.0410000000002]
[null,2190,"High density polyethylene (80)",2870.8550000000005,2870.8550000000005,2870.8550000000005,2870.8550000000005,2870.8550000000005,2870.8550000000005,2870.8550000000005]
[null,2190,"Polyamide",59743.034511666185,60402.039268645924,60962.615996983601,61490.32408951236,62007.68523316738,62537.191237306004,63097.660807593718]
[null,2190,"Protected Steel",11682.756660888161,11750.814321776321,11818.871982664481,11835.299693913346,11851.727405162212,11868.155116411077,11884.582827659942]
[null,2191,"Cast Iron",4589.9910000000009,4589.9910000000009,4589.9910000000009,4589.9910000000009,4589.9910000000009,4589.9910000000009,4589.9910000000009]
[null,2191,"High density polyethylene (575)",14.316000000000001,14.316000000000001,14.316000000000001,14.316000000000001,14.316000000000001,14.316000000000001,14.316000000000001]
[null,2191,"High density polyethylene (80)",1178.1420000000001,1178.1420000000001,1178.1420000000001,1178.1420000000001,1178.1420000000001,1178.1420000000001,1178.1420000000001]
[null,2191,"Polyamide",18470.417722745929,18674.158514324161,18847.468866278668,19010.617407097703,19170.56703997013,19334.271431002238,19507.548653505568]
[null,2191,"Protected Steel",1651.6114287259402,1661.2328574518804,1670.8542861778205,1673.17670000822,1675.4991138386195,1677.8215276690189,1680.1439414994184]
[null,2192,"Cast Iron",6199.257999999998,6199.257999999998,6199.257999999998,6199.257999999998,6199.257999999998,6199.257999999998,6199.257999999998]
[null,2192,"High density polyethylene (100)",6.1069483940716287,6.8053380426558139,7.3994171902821471,7.9586633343999198,8.5069441525298064,9.068095659005138,9.6620612443664555]
[null,2192,"High density polyethylene (575)",560.745,560.745,560.745,560.745,560.745,560.745,560.745]
[null,2192,"High density polyethylene (80)",265.25299999999999,265.25299999999999,265.25299999999999,265.25299999999999,265.25299999999999,265.25299999999999,265.25299999999999]
[null,2192,"Polyamide",33656.488500189742,34027.741587786557,34343.544833553839,34640.831395792033,34932.288961083097,35230.588384350478,35546.331262181884]
[null,2192,"Protected Steel",3727.8615816877696,3749.5781633755387,3771.2947450633078,3776.5366785741485,3781.7786120849892,3787.0205455958298,3792.2624791066705]
[null,2193,"Cast Iron",465.40100000000001,465.40100000000001,465.40100000000001,465.40100000000001,465.40100000000001,465.40100000000001,465.40100000000001]
[null,2193,"High density polyethylene (100)",223.38250330025187,248.92849090531575,270.65896553714276,291.11530405071431,311.17054830073272,331.69658195263867,353.42290265661126]
[null,2193,"High density polyethylene (80)",44.725000000000001,44.725000000000001,44.725000000000001,44.725000000000001,44.725000000000001,44.725000000000001,44.725000000000001]
[null,2193,"Polyamide",47460.0405146419,47983.555811801649,48428.879596506231,48848.092441250978,49259.085639692777,49679.726750653725,50124.965408691503]
[null,2194,"Cast Iron",1132.8689999999999,1132.8689999999999,1132.8689999999999,1132.8689999999999,1132.8689999999999,1132.8689999999999,1132.8689999999999]
[null,2194,"High density polyethylene (100)",1439.710803488498,1604.3559023544494,1744.4098395704839,1876.2519092164712,2005.5089073554097,2137.8001654657046,2277.8273304201675]
[null,2194,"High density polyethylene (80)",1674.3809999999996,1674.3809999999996,1674.3809999999996,1674.3809999999996,1674.3809999999996,1674.3809999999996,1674.3809999999996]
[null,2194,"Polyamide",41073.701496659531,41526.771296248953,41912.171224356382,42274.973764385802,42630.662713803111,42994.701329056777,43380.027585349686]
[null,2194,"Protected Steel",854.17699065493525,859.15298130987048,864.12897196480571,865.33007315737632,866.53117434994692,867.73227554251753,868.93337673508813]
[null,2195,"Cast Iron",8092.9060000000009,8092.9060000000009,8092.9060000000009,8092.9060000000009,8092.9060000000009,8092.9060000000009,8092.9060000000009]
[null,2195,"High density polyethylene (100)",227.294553326402,253.28792235123666,275.3989581398049,296.21354413666029,316.62001159186985,337.50551328311803,359.61232239698137]
[null,2195,"High density polyethylene (575)",692.28899999999999,692.28899999999999,692.28899999999999,692.28899999999999,692.28899999999999,692.28899999999999,692.28899999999999]
[null,2195,"High density polyethylene (80)",1509.5250000000001,1509.5250000000001,1509.5250000000001,1509.5250000000001,1509.5250000000001,1509.5250000000001,1509.5250000000001]
[null,2195,"Polyamide",32775.892942302875,33137.432484774872,33444.972986929213,33734.48128001955,34018.313087284594,34308.807740691685,34616.289454389727]
[null,2195,"Protected Steel",4169.6341186002974,4193.9242372005956,4218.2143558008938,4224.0774878768279,4229.9406199527621,4235.8037520286962,4241.6668841046303]
[null,2196,"Cast Iron",4228.1689999999999,4228.1689999999999,4228.1689999999999,4228.1689999999999,4228.1689999999999,4228.1689999999999,4228.1689999999999]
[null,2196,"High density polyethylene (100)",763.43240084783872,850.7384089784274,925.00451386418115,994.91612911267248,1063.4569639640119,1133.6067694288361,1207.8586778441054]
[null,2196,"High density polyethylene (575)",394.18400000000003,394.18400000000003,394.18400000000003,394.18400000000003,394.18400000000003,394.18400000000003,394.18400000000003]
[null,2196,"High density polyethylene (80)",1138.6999999999998,1138.6999999999998,1138.6999999999998,1138.6999999999998,1138.6999999999998,1138.6999999999998,1138.6999999999998]
[null,2196,"Polyamide",77319.341374381693,78172.224295189939,78897.721816016594,79580.680800034839,80250.248779081696,80935.534617479891,81660.893454526682]
[null,2196,"Protected Steel",3237.6277343990569,3256.4884687981144,3275.3492031971718,3279.9017942590135,3284.4543853208552,3289.0069763826968,3293.5595674445385]
[null,2197,"Polyamide",15651.230943913541,15823.874260894929,15970.731813557126,16108.978578132281,16244.514692207147,16383.232466165284,16530.061946008595]
[null,2198,"Polyamide",13241.762750672075,13387.8280571102,13512.07725370476,13629.041271685985,13743.711937089804,13861.07445372747,13985.299899243997]
[null,2199,"Cast Iron",171.53899999999999,171.53899999999999,171.53899999999999,171.53899999999999,171.53899999999999,171.53899999999999,171.53899999999999]
[null,2199,"High density polyethylene (100)",835.08186502540889,930.58169450166258,1011.8178030389644,1088.2907454812973,1163.2642573920962,1239.9977446185712,1321.218324321839]
[null,2199,"High density polyethylene (80)",331.459,331.459,331.459,331.459,331.459,331.459,331.459]
[null,2199,"Polyamide",34443.433286053332,34823.366889489414,35146.554141393106,35450.791758850843,35749.064087699458,36054.338248565058,36377.463721029941]
[null,2199,"Protected Steel",1377.6726036822379,1385.6982073644758,1393.7238110467138,1395.6610257286331,1397.5982404105525,1399.5354550924719,1401.4726697743913]
[null,2200,"Cast Iron",315.17,315.17,315.17,315.17,315.17,315.17,315.17]
[null,2200,"High density polyethylene (100)",1903.3725367976924,2121.0419178570369,2350.3184428418408,2630.5025755614529,2801.3870475334879,2976.2829689473069,3161.4061614205193]
[null,2200,"High density polyethylene (575)",17.982999999999997,17.982999999999997,17.982999999999997,17.982999999999997,17.982999999999997,17.982999999999997,17.982999999999997]
[null,2200,"High density polyethylene (80)",1567.788,1567.788,1567.788,1567.788,1567.788,1567.788,1567.788]
[null,2200,"Polyamide",96579.592139997418,97644.928227587559,98551.147207399423,99404.231299327352,100240.58868645551,101096.57925227456,102002.62500217193]
[null,2200,"Protected Steel",4044.6741669480466,4068.2363338960931,4091.7985008441397,4097.4859204522891,4103.173340060438,4108.860759668587,4114.5481792767359]
[null,2203,"High density polyethylene (100)",185.043044795648,206.20453801429605,224.20538020793495,241.15076808745869,257.76390208549475,274.76702322708832,292.76442443745105]
[null,2203,"High density polyethylene (80)",21.257000000000001,21.257000000000001,21.257000000000001,21.257000000000001,21.257000000000001,21.257000000000001,21.257000000000001]
[null,2203,"Polyamide",30497.434629578478,30833.841286201292,31120.002715179307,31389.385467276585,31653.486341754626,31923.786886063834,32209.893613340628]
[null,2203,"Protected Steel",1432.6498726423861,1440.9957452847723,1449.3416179271585,1451.3561389098033,1453.3706598924482,1455.3851808750931,1457.3997018577379]
[null,2204,"High density polyethylene (100)",6.3851588884990891,7.1153646450471548,7.7365078912584071,8.3212312682299387,8.8944897785972596,9.4812053193481667,10.102229829808095]
[null,2204,"Polyamide",73880.45142718112,74695.40114201048,75388.631107439709,76041.21449923559,76681.002470445048,77335.809226394573,78028.906676206374]
[null,2204,"Protected Steel",6556.3629588286976,6594.5569176573954,6632.7508764860931,6641.9701079275028,6651.1893393689124,6660.4085708103221,6669.6278022517317]
[null,2205,"High density polyethylene (100)",337.65974430021993,376.27445903921773,409.12173400167381,440.04305473970464,470.35809081143105,501.38476108329405,534.22575706598923]
[null,2205,"High density polyethylene (575)",1.4530000000000001,1.4530000000000001,1.4530000000000001,1.4530000000000001,1.4530000000000001,1.4530000000000001,1.4530000000000001]
[null,2205,"Other",2.5609999999999999,2.5609999999999999,2.5609999999999999,2.5609999999999999,2.5609999999999999,2.5609999999999999,2.5609999999999999]
[null,2205,"Polyamide",37509.495198695608,37923.249470970179,38275.205983925283,38606.526016876654,38931.349747250279,39263.798593919426,39615.687827996022]
[null,2205,"Protected Steel",7472.573323640836,7516.1046472816724,7559.6359709225089,7570.1435318013318,7580.6510926801548,7591.1586535589777,7601.6662144378006]
[null,2206,"Other",4.43,4.43,4.43,4.43,4.43,4.43,4.43]
[null,2206,"Polyamide",64147.121456559158,64854.706173873354,65456.607027626873,66023.216263025548,66578.715801845625,67147.255485795307,67749.041282111546]
[null,2206,"Protected Steel",1059.3522348595391,1065.5234697190781,1071.6947045786171,1073.1843129929887,1074.6739214073602,1076.1635298217318,1077.6531382361034]
[null,2207,"Other",14.499000000000001,14.499000000000001,14.499000000000001,14.499000000000001,14.499000000000001,14.499000000000001,14.499000000000001]
[null,2207,"Polyamide",82543.964525883493,83454.478458213169,84228.999303298551,84958.107197227335,85672.919229090083,86404.511207621515,87178.883997785568]
[null,2208,"Cast Iron",1155.2249999999999,1155.2249999999999,1155.2249999999999,1155.2249999999999,1155.2249999999999,1155.2249999999999,1155.2249999999999]
[null,2208,"High density polyethylene (100)",624.08656996884542,695.4570110077384,756.16766281086302,813.31863009094934,869.34901926184239,926.69470098546833,987.39374753505581]
[null,2208,"High density polyethylene (575)",12.87,12.87,12.87,12.87,12.87,12.87,12.87]
[null,2208,"High density polyethylene (80)",1225.6090000000002,1225.6090000000002,1225.6090000000002,1225.6090000000002,1225.6090000000002,1225.6090000000002,1225.6090000000002]
[null,2208,"Polyamide",46395.187518200648,46906.956790139637,47342.288919519291,47752.095955734745,48153.867768477503,48565.071025138786,49000.319937824432]
[null,2208,"Protected Steel",2127.4303018765195,2139.8236037530392,2152.2169056295588,2155.2083922894085,2158.1998789492582,2161.1913656091078,2164.1828522689575]
[null,2209,"Cast Iron",23.173999999999999,23.173999999999999,23.173999999999999,23.173999999999999,23.173999999999999,23.173999999999999,23.173999999999999]
[null,2209,"High density polyethylene (100)",108.89090339474136,121.34364981547293,131.93647145054808,141.90819774057636,151.68440506175304,161.69010521483384,172.28090196008986]
[null,2209,"High density polyethylene (575)",6.5979999999999999,6.5979999999999999,6.5979999999999999,6.5979999999999999,6.5979999999999999,6.5979999999999999,6.5979999999999999]
[null,2209,"High density polyethylene (80)",707.17799999999988,707.17799999999988,707.17799999999988,707.17799999999988,707.17799999999988,707.17799999999988,707.17799999999988]
[null,2209,"Polyamide",46297.907702861135,46808.603914792533,47243.023254906264,47651.971021983256,48052.900413564617,48463.241473540969,48897.577771446558]
[null,2209,"Protected Steel",2859.5351638329798,2876.1933276659597,2892.8514914989396,2896.8724275965556,2900.8933636941715,2904.9142997917875,2908.9352358894034]
[null,2210,"High density polyethylene (100)",4539.0509650687345,5058.1361126487254,5499.6914287175859,5915.3567637371125,6322.8720096620727,6739.9535244640065,7181.4244342344427]
[null,2210,"High density polyethylene (575)",1402.9829999999999,1402.9829999999999,1402.9829999999999,1402.9829999999999,1402.9829999999999,1402.9829999999999,1402.9829999999999]
[null,2210,"High density polyethylene (80)",62.136000000000003,62.136000000000003,62.136000000000003,62.136000000000003,62.136000000000003,62.136000000000003,62.136000000000003]
[null,2210,"Polyamide",82104.71366420445,83010.382372154068,83780.781668794982,84506.009675532681,85217.017894448742,85944.716766938887,86714.96879652045]
[null,2210,"Protected Steel",6323.6291729007999,6360.4673458015986,6397.3055187023974,6406.1974914715556,6415.0894642407138,6423.981437009872,6432.8734097790302]
[null,2211,"High density polyethylene (100)",1008.5438278870417,1123.8807398910044,1221.9910920591294,1314.3488803560042,1404.8957786416604,1497.5682316976922,1595.6598294054761]
[null,2211,"Polyamide",36888.24973751825,37295.151265912064,37641.278551226358,37967.111145181872,38286.55503060935,38613.497742472551,38959.558863204802]
[null,2211,"Protected Steel",3958.0093025462979,3981.0666050925961,4004.1239076388943,4009.6894634259315,4015.2550192129688,4020.8205750000061,4026.3861307870434]
[null,2212,"High density polyethylene (100)",2270.2101768044645,2529.8310521224612,2750.6753166782041,2958.5706853286588,3162.3897800296168,3370.9934521952659,3591.7955008695076]
[null,2212,"Polyamide",48092.735779522227,48623.230119388514,49074.490566743734,49499.29198619198,49915.764182285966,50342.012908331795,50793.187094186818]
[null,2212,"Protected Steel",6170.7364997485865,6206.6839994971733,6242.6314992457601,6251.3084819436945,6259.9854646416288,6268.6624473395632,6277.3394300374976]
[null,2213,"Polyamide",39199.102271254829,39631.494014949203,39999.3043326642,40345.548604611322,40685.003949440623,41032.427882274504,41400.16789054851]
[null,2213,"Protected Steel",75.54910979980184,75.989219599603686,76.429329399405532,76.535562799357706,76.64179619930988,76.748029599262054,76.854262999214228]
[null,2214,"High density polyethylene (100)",377.20554175197248,420.34270760781965,457.03696671462302,491.57970903899377,525.44516027412544,560.1055903852498,596.79283513513815]
[null,2214,"Polyamide",9782.3321754214521,9890.2376993147827,9982.026605104953,10068.433596229019,10153.146376610153,10239.847758013078,10331.619117730328]
[null,2214,"Protected Steel",4543.1973033214244,4569.6636066428482,4596.129909964272,4602.5183280073743,4608.9067460504766,4615.2951640935789,4621.6835821366813]
[null,2216,"Polyamide",59315.446986356154,59969.735173186622,60526.29979169467,61050.231018866405,61563.889351425278,62089.605622354051,62646.06384975418]
[null,2216,"Protected Steel",332.77557734541864,334.71415469083723,336.65273203625583,337.12066449894309,337.58859696163034,338.0565294243176,338.52446188700486]
[null,2217,"Polyamide",70789.467924827957,71570.322069379603,72234.548931212616,72859.829776002007,73472.850530365729,74100.261719006565,74764.36160936243]
[null,2217,"Protected Steel",7053.6770519452175,7094.7681038904338,7135.8591558356502,7145.7776856155297,7155.6962153954091,7165.6147451752886,7175.5332749551681]
[null,2218,"High density polyethylene (80)",164.46499999999997,164.46499999999997,164.46499999999997,164.46499999999997,164.46499999999997,164.46499999999997,164.46499999999997]
[null,2218,"Polyamide",35303.253431157937,35692.671413323733,36023.926470417457,36335.758848543104,36641.477025049862,36954.371822078887,37285.563557518028]
[null,2219,"Polyamide",42218.905519652631,42684.607668854587,43080.753196507401,43453.671282817151,43819.277439619334,44193.466065013854,44589.535866757797]
[null,2219,"Protected Steel",2968.7001019557442,2985.9942039114885,3003.2883058672328,3007.4627442703436,3011.6371826734544,3015.8116210765652,3019.986059479676]
[null,2220,"High density polyethylene (80)",382.55599999999998,382.55599999999998,382.55599999999998,382.55599999999998,382.55599999999998,382.55599999999998,382.55599999999998]
[null,2220,"Polyamide",64999.192693500983,65716.176314018216,66326.072263940179,66900.207814177396,67463.086096866507,68039.177737954,68648.957102121727]
[null,2220,"Protected Steel",3903.5973266896058,3926.3376533792116,3949.0779800688174,3954.5670244421704,3960.0560688155233,3965.5451131888763,3971.0341575622292]
[null,2221,"High density polyethylene (575)",88.128,88.128,88.128,88.128,88.128,88.128,88.128]
[null,2221,"High density polyethylene (80)",1113.9829999999999,1113.9829999999999,1113.9829999999999,1113.9829999999999,1113.9829999999999,1113.9829999999999,1113.9829999999999]
[null,2221,"Polyamide",52995.018721897606,53579.588449890602,54076.847661046246,54544.950770837189,55003.875626564528,55473.573572643989,55970.737729323228]
[null,2221,"Protected Steel",1392.7333396930014,1400.8466793860027,1408.960019079004,1410.9184114186939,1412.8768037583839,1414.8351960980738,1416.7935884377637]
[null,2222,"High density polyethylene (100)",29.805009525958251,33.213505682416546,36.11291362098121,38.842318812773328,41.518207645095067,44.256911972814478,47.155765669854219]
[null,2222,"High density polyethylene (80)",160.07300000000001,160.07300000000001,160.07300000000001,160.07300000000001,160.07300000000001,160.07300000000001,160.07300000000001]
[null,2222,"Polyamide",29567.545409983355,29893.694780142796,30171.130936615024,30432.300010409104,30688.348254918572,30950.407136764796,31227.790259430916]
[null,2223,"High density polyethylene (575)",19.611999999999998,19.611999999999998,19.611999999999998,19.611999999999998,19.611999999999998,19.611999999999998,19.611999999999998]
[null,2223,"Polyamide",57401.104373022936,58034.27610838777,58572.878199081963,59079.900106243658,59576.980665479212,60085.730006019796,60624.229139265299]
[null,2223,"Protected Steel",5651.3729580184327,5684.2949160368662,5717.2168740552997,5725.1635535769901,5733.1102330986805,5741.0569126203709,5749.0035921420613]
[null,2224,"High density polyethylene (100)",231.9101110372313,258.43131450894214,280.99134812977161,302.22860559626639,323.04945706039859,344.3590702711038,366.91479138824246]
[null,2224,"High density polyethylene (575)",789.90099999999984,789.90099999999984,789.90099999999984,789.90099999999984,789.90099999999984,789.90099999999984,789.90099999999984]
[null,2224,"High density polyethylene (80)",2917.6210000000001,2917.6210000000001,2917.6210000000001,2917.6210000000001,2917.6210000000001,2917.6210000000001,2917.6210000000001]
[null,2224,"Other",54.573999999999998,54.573999999999998,54.573999999999998,54.573999999999998,54.573999999999998,54.573999999999998,54.573999999999998]
[null,2224,"Polyamide",21838.451257000848,22079.343661966042,22284.256714302224,22477.154975175861,22666.27101540261,22859.826484357116,23064.700366171244]
[null,2224,"Protected Steel",652.723427024687,656.52585404937406,660.32828107406112,661.24610828691664,662.16393549977215,663.08176271262766,663.99958992548318]
[null,2226,"High density polyethylene (100)",93.687383998447274,104.40145835528386,113.51529355375528,122.09475171725883,130.50598957821447,139.11467812051444,148.22677114747177]
[null,2226,"High density polyethylene (80)",268.17500000000001,268.17500000000001,268.17500000000001,268.17500000000001,268.17500000000001,268.17500000000001,268.17500000000001]
[null,2226,"Polyamide",15412.749364276537,15582.762073410207,15727.38192213295,15863.522187422923,15996.993105047857,16133.597202837276,16278.189406493444]
[null,2226,"Protected Steel",4448.2139799061842,4474.1269598123681,4500.039939718552,4506.2947969372863,4512.5496541560206,4518.8045113747548,4525.0593685934891]
[null,2227,"High density polyethylene (575)",55.573999999999998,55.573999999999998,55.573999999999998,55.573999999999998,55.573999999999998,55.573999999999998,55.573999999999998]
[null,2227,"Polyamide",20073.494477484994,20294.918254465825,20483.270485859353,20660.578946463771,20834.410860843622,21012.323414779868,21200.639641364774]
[null,2227,"Protected Steel",1369.3551505283606,1377.3323010567212,1385.3094515850819,1387.2349706781345,1389.160489771187,1391.0860088642396,1393.0115279572922]
[null,2228,"High density polyethylene (100)",790.94103358782604,881.39292459028593,958.33504768284195,1030.765776537193,1101.7763318923044,1174.453833631442,1251.3812487144535]
[null,2228,"High density polyethylene (575)",31.702000000000002,31.702000000000002,31.702000000000002,31.702000000000002,31.702000000000002,31.702000000000002,31.702000000000002]
[null,2228,"High density polyethylene (80)",962.45399999999995,962.45399999999995,962.45399999999995,962.45399999999995,962.45399999999995,962.45399999999995,962.45399999999995]
[null,2228,"Polyamide",33468.98556751517,33838.170375092559,34152.214256250874,34447.844611773864,34737.678444148107,35034.316017972174,35348.299867509108]
[null,2228,"Protected Steel",9049.9513069429922,9102.6716138859829,9155.3919208289735,9168.1175121600409,9180.8431034911082,9193.5686948221755,9206.2942861532429]
[null,2229,"High density polyethylene (100)",4074.6617797290291,4540.6394538169352,4937.0193543441619,5310.1580714012152,5675.9805329699338,6050.3905408049504,6446.6946706213384]
[null,2229,"High density polyethylene (80)",441.98,441.98,441.98,441.98,441.98,441.98,441.98]
[null,2229,"Polyamide",62596.988658910792,63287.474397307189,63874.830151714857,64427.747119412365,64969.822859398591,65524.623625827997,66111.867103192941]
[null,2229,"Protected Steel",14783.578434952753,14869.699869905506,14955.821304858258,14976.60923743306,14997.397170007862,15018.185102582664,15038.973035157465]
[null,2230,"High density polyethylene (100)",3038.0506176992571,3385.4816039076313,3681.0207840258872,3959.2314358847211,4231.9871185443544,4511.1456394392098,4806.628325235406]
[null,2230,"High density polyethylene (575)",26.315999999999999,26.315999999999999,26.315999999999999,26.315999999999999,26.315999999999999,26.315999999999999,26.315999999999999]
[null,2230,"High density polyethylene (80)",217.024,217.024,217.024,217.024,217.024,217.024,217.024]
[null,2230,"Polyamide",59268.803760912495,59922.577442450434,60478.704401456715,61002.223630682092,61515.478043475989,62040.78091277348,62596.801564333437]
[null,2230,"Protected Steel",6113.7515349975156,6149.3670699950317,6184.9826049925477,6193.57945826781,6202.1763115430722,6210.7731648183344,6219.3700180935966]
[null,2231,"Protected Steel",7143.6280597081586,7185.2431194163182,7226.8581791244778,7236.9031935367921,7246.9482079491063,7256.9932223614205,7267.0382367737348]
[null,2232,"High density polyethylene (100)",3157.0540164836584,3518.094212479697,3825.2099498492153,4114.3183836463559,4397.7581717929597,4687.8516035785606,4994.9086336884538]
[null,2232,"High density polyethylene (80)",445.55799999999999,445.55799999999999,445.55799999999999,445.55799999999999,445.55799999999999,445.55799999999999,445.55799999999999]
[null,2232,"Polyamide",45939.574589501266,46446.318152756248,46877.375206270641,47283.157829740732,47680.984137743355,48088.149270407739,48519.12392443791]
[null,2232,"Protected Steel",5926.5942540708656,5961.1195081417318,5995.6447622125979,6003.9784442297032,6012.3121262468085,6020.6458082639138,6028.979490281019]
[null,2233,"High density polyethylene (100)",3581.7297939507885,3991.3358444209539,4339.7637081775456,4667.7619893621741,4989.3290986657175,5318.4448762960292,5666.8061356993785]
[null,2233,"High density polyethylene (80)",460.59400000000005,460.59400000000005,460.59400000000005,460.59400000000005,460.59400000000005,460.59400000000005,460.59400000000005]
[null,2233,"Polyamide",38673.061006944765,39099.650171336267,39462.524574876035,39804.122343101852,40139.022289760673,40481.783888145801,40844.588925778102]
[null,2233,"Protected Steel",5105.7393807314038,5135.4827614628075,5165.2261421942112,5172.4055789224813,5179.5850156507513,5186.7644523790213,5193.9438891072914]
[null,2234,"High density polyethylene (100)",2388.8190639861123,2662.0040328075297,2894.3864768353938,3113.1434998726495,3327.611280874045,3547.1136132916713,3779.4516358366418]
[null,2234,"Polyamide",17664.716470395648,17859.56985003802,18025.320201471099,18181.352011871248,18334.324454435759,18490.88786821171,18656.606535339066]
[null,2234,"Protected Steel",527.20019398820841,530.2713879764168,533.3425819646252,534.08390465143407,534.82522733824294,535.56655002505181,536.30787271186068]
[null,2250,"High density polyethylene (100)",16817.00115872614,18740.190740757644,20376.1354171046,21916.158755564695,23425.986341916734,24971.256569478755,26606.888523886846]
[null,2250,"High density polyethylene (575)",1220.6699999999998,1220.6699999999998,1220.6699999999998,1220.6699999999998,1220.6699999999998,1220.6699999999998,1220.6699999999998]
[null,2250,"High density polyethylene (80)",21721.848999999995,21721.848999999995,21721.848999999995,21721.848999999995,21721.848999999995,21721.848999999995,21721.848999999995]
[null,2250,"Polyamide",182630.48662124501,184645.02037294829,186358.66618156325,187971.83475460715,189553.37339249119,191172.03806185653,192885.3562954333]
[null,2250,"Protected Steel",26932.588244055773,27089.483488111557,27246.378732167341,27284.249997973908,27322.121263780475,27359.992529587042,27397.863795393609]
[null,2251,"High density polyethylene (100)",1732.4007859025742,1930.5178646792635,2099.0444537094377,2257.6897208813562,2413.2243772975771,2572.4101519427322,2740.9045259705081]
[null,2251,"High density polyethylene (575)",61.739000000000004,61.739000000000004,61.739000000000004,61.739000000000004,61.739000000000004,61.739000000000004,61.739000000000004]
[null,2251,"High density polyethylene (80)",13530.522999999997,13530.522999999997,13530.522999999997,13530.522999999997,13530.522999999997,13530.522999999997,13530.522999999997]
[null,2251,"Polyamide",44928.31728018287,45423.906013710526,45845.474307261531,46242.32453099468,46631.393579806252,47029.595879876171,47451.083587783891]
[null,2251,"Protected Steel",15.465091575869117,15.555183151738234,15.645274727607351,15.667020970058518,15.688767212509685,15.710513454960852,15.732259697412019]
[null,2256,"High density polyethylene (100)",12560.263152670719,13996.652852284695,15218.5053956834,16368.716316747432,17496.374668004853,18650.504379775448,19872.123357759683]
[null,2256,"Polyamide",11138.508496271706,11261.373532249565,11365.887618325694,11464.273666510695,11560.730626578852,11659.451877920266,11763.945985418814]
[null,2257,"High density polyethylene (100)",8996.9967297702005,10025.891847095401,10901.112628984998,11725.016059157848,12532.764939515009,13359.475424503753,14234.528901994976]
[null,2257,"Polyamide",23183.115029952496,23438.83995606692,23656.370164942218,23861.145792951909,24061.906316809131,24267.379619317715,24484.868245815767]
[null,2258,"High density polyethylene (100)",6533.3128180233771,7280.4614344255187,7916.016978643861,8514.3076085993525,9100.8673542886536,9701.196371915099,10336.630425373443]
[null,2258,"High density polyethylene (575)",11.114000000000001,11.114000000000001,11.114000000000001,11.114000000000001,11.114000000000001,11.114000000000001,11.114000000000001]
[null,2258,"Polyamide",17347.215660359656,17538.566798345426,17701.337998036557,17854.565335108393,18004.788292590096,18158.537678143224,18321.277763013728]
[null,2258,"Protected Steel",20.209731378365024,20.32746275673005,20.445194135095075,20.473612054010772,20.502029972926469,20.530447891842165,20.558865810757862]
[null,2259,"High density polyethylene (100)",26445.442213877232,29469.738786013368,32042.330652725868,34464.082177915967,36838.349611861668,39268.352091026143,41840.452189326119]
[null,2259,"High density polyethylene (575)",875.7700000000001,875.7700000000001,875.7700000000001,875.7700000000001,875.7700000000001,875.7700000000001,875.7700000000001]
[null,2259,"High density polyethylene (80)",2703.174,2703.174,2703.174,2703.174,2703.174,2703.174,2703.174]
[null,2259,"Polyamide",169178.02683757371,171044.17115671834,172631.59077084443,174125.93424653116,175590.97763044055,177090.41236305909,178677.52853114164]
[null,2259,"Protected Steel",26940.997230434601,27097.941460869199,27254.885691303796,27292.7687814087,27330.651871513604,27368.534961618509,27406.418051723413]
[null,2260,"High density polyethylene (100)",3589.3064690961592,3999.7789869327999,4348.9439037020829,4677.6360218224218,4999.8833637690705,5329.6953422508623,5678.7935137742124]
[null,2260,"High density polyethylene (575)",12.336,12.336,12.336,12.336,12.336,12.336,12.336]
[null,2260,"High density polyethylene (80)",12535.445999999991,12535.445999999991,12535.445999999991,12535.445999999991,12535.445999999991,12535.445999999991,12535.445999999991]
[null,2260,"Polyamide",49956.837496193424,50507.894097565535,50976.645655811953,51417.912619222348,51850.527513856992,52293.297882289597,52761.959835491136]
[null,2261,"High density polyethylene (100)",13664.024522275564,15226.640196844141,16555.86578015166,17807.154072456768,19033.907937168107,20289.459392725548,21618.430885532569]
[null,2261,"High density polyethylene (575)",235.71899999999999,235.71899999999999,235.71899999999999,235.71899999999999,235.71899999999999,235.71899999999999,235.71899999999999]
[null,2261,"High density polyethylene (80)",29425.022000000012,29425.022000000012,29425.022000000012,29425.022000000012,29425.022000000012,29425.022000000012,29425.022000000012]
[null,2261,"Polyamide",164707.39258917203,166524.22288768657,168069.69395432007,169524.54847717905,170950.87718135177,172410.6884215216,173955.86406086138]
[null,2261,"Protected Steel",6264.71698112798,6301.2119622559603,6337.7069433839406,6346.5160767596599,6355.3252101353792,6364.1343435110985,6372.9434768868177]
[null,2262,"High density polyethylene (100)",12749.218247492519,14207.216821744914,15447.450768494,16614.965324920839,17759.588033381489,18931.080334333019,20171.077201937507]
[null,2262,"High density polyethylene (575)",397.41,397.41,397.41,397.41,397.41,397.41,397.41]
[null,2262,"Polyamide",50144.025695886514,50697.147105567346,51167.655075241892,51610.575465342299,52044.81136737745,52489.240795756567,52959.658824636259]
[null,2262,"Protected Steel",189.73328739987249,190.838574799745,191.94386219961751,192.21065570993156,192.4774492202456,192.74424273055965,193.01103624087369]
[null,2263,"High density polyethylene (100)",14227.681264399489,15854.756634490657,17238.814303368097,18541.719678264697,19819.078552184259,21126.422950725282,22510.216047576556]
[null,2263,"High density polyethylene (575)",270.49099999999999,270.49099999999999,270.49099999999999,270.49099999999999,270.49099999999999,270.49099999999999,270.49099999999999]
[null,2263,"High density polyethylene (80)",5088.0549999999994,5088.0549999999994,5088.0549999999994,5088.0549999999994,5088.0549999999994,5088.0549999999994,5088.0549999999994]
[null,2263,"Polyamide",34003.375857859362,34378.455339959051,34697.513475298882,34997.864081192281,35292.325612410925,35593.699518589114,35912.696663798815]
[null,2263,"Protected Steel",99.364847896832941,99.943695793665881,100.52254369049882,100.66226559663092,100.80198750276301,100.94170940889511,101.0814313150272]
[null,2264,"High density polyethylene (100)",20026.311999677437,22316.517859852902,24264.661776447432,26098.578987470737,27896.537971038779,29736.703373234282,31684.474888884211]
[null,2264,"High density polyethylene (575)",18.093000000000004,18.093000000000004,18.093000000000004,18.093000000000004,18.093000000000004,18.093000000000004,18.093000000000004]
[null,2264,"Polyamide",13867.319345292446,14020.284950233729,14150.403826399615,14272.8933634646,14392.981207253468,14515.888068524571,14645.982071583301]
[null,2264,"Protected Steel",63.202183029473829,63.570366058947656,63.938549088421482,64.027420854156546,64.11629261989161,64.205164385626674,64.294036151361738]
[null,2265,"High density polyethylene (100)",19135.638204872092,21323.986751309472,23185.486620060939,24937.840036326263,26655.834473710031,28414.158191731767,30275.302222137001]
[null,2265,"High density polyethylene (575)",9.3279999999999994,9.3279999999999994,9.3279999999999994,9.3279999999999994,9.3279999999999994,9.3279999999999994,9.3279999999999994]
[null,2265,"Polyamide",1610.4906898573013,1628.2554558147503,1643.3669011793511,1657.5923079891436,1671.5387924950089,1685.8126655391088,1700.9212222482668]
[null,2280,"High density polyethylene (100)",14607.346232530468,16277.840028087638,17698.831207140109,19036.504547276101,20347.949679324876,21690.180498230842,23110.900045165767]
[null,2280,"High density polyethylene (575)",105.59099999999999,105.59099999999999,105.59099999999999,105.59099999999999,105.59099999999999,105.59099999999999,105.59099999999999]
[null,2280,"Polyamide",65093.363635146256,65811.386022760285,66422.165590978562,66997.132949783816,67560.82673149246,68137.753015135764,68748.41582869018]
[null,2280,"Protected Steel",50.188371334605883,50.480742669211764,50.773114003817646,50.843686394929414,50.914258786041181,50.984831177152948,51.055403568264715]
[null,2281,"High density polyethylene (100)",8069.106580300454,8991.8883274779746,9776.844683746589,10515.776217192824,11240.219273190998,11981.668360568452,12766.474667096873]
[null,2281,"High density polyethylene (575)",580.13300000000004,580.13300000000004,580.13300000000004,580.13300000000004,580.13300000000004,580.13300000000004,580.13300000000004]
[null,2281,"Polyamide",20236.384481411133,20459.605041704515,20649.485691368496,20828.232953566549,21003.475458476492,21182.831716031043,21372.676068718865]
[null,2281,"Protected Steel",177.42156571605867,178.45513143211733,179.48869714817599,179.73817852791427,179.98765990765256,180.23714128739084,180.48662266712913]
[null,2282,"High density polyethylene (100)",6196.7248682508707,6905.3813401660072,7508.1938727525076,8075.6613319653889,8632.0022671186307,9201.4030988675531,9804.1003997431726]
[null,2282,"High density polyethylene (575)",8.4120000000000008,8.4120000000000008,8.4120000000000008,8.4120000000000008,8.4120000000000008,8.4120000000000008,8.4120000000000008]
[null,2282,"Polyamide",53044.663548700926,53629.780891613227,54127.505926689861,54596.047547464892,55055.402316144959,55525.540267223856,56023.170158778681]
[null,2282,"Protected Steel",4666.7882800380821,4693.9745600761635,4721.1608401142448,4727.7230456406787,4734.2852511671126,4740.8474566935465,4747.4096622199804]
[null,2283,"High density polyethylene (100)",755.36657692333119,841.7501787107376,915.23164657440236,984.40463089991215,1052.2213174115484,1121.6299754236454,1195.097396805523]
[null,2283,"High density polyethylene (575)",4.0670000000000002,4.0670000000000002,4.0670000000000002,4.0670000000000002,4.0670000000000002,4.0670000000000002,4.0670000000000002]
[null,2283,"Polyamide",34987.066201217967,35372.996431375017,35701.284662221122,36010.324169824584,36313.304236554563,36623.396647697875,36951.622124018388]
[null,2284,"High density polyethylene (100)",8472.6246777077631,9441.5526904275339,10265.762970569525,11041.646828727698,18226.682219426373,25362.873469651375,33874.73124908335]
[null,2284,"High density polyethylene (575)",359.53399999999999,359.53399999999999,359.53399999999999,359.53399999999999,359.53399999999999,359.53399999999999,359.53399999999999]
[null,2284,"Polyamide",34072.124268231702,34447.962090275796,34767.66530096675,35068.623159116396,28939.315489428714,22883.63477592788,15515.471820493769]
[null,2284,"Protected Steel",3069.9941885935541,3087.8783771871081,3105.762565780662,3110.079438889451,3114.39631199824,3118.7131851070289,3123.0300582158179]
[null,2285,"High density polyethylene (100)",13046.155500774395,14538.111772159518,15807.231541899911,17001.938241313255,24597.584473892872,32154.025502839861,41110.707724398759]
[null,2285,"High density polyethylene (575)",5395.6960000000008,5395.6960000000008,5395.6960000000008,5395.6960000000008,5395.6960000000008,5395.6960000000008,5395.6960000000008]
[null,2285,"High density polyethylene (80)",1047.559,1047.559,1047.559,1047.559,1047.559,1047.559,1047.559]
[null,2285,"Polyamide",121795.06250727206,123138.54172999658,124281.36077536458,125357.17221749316,119987.52531869027,114709.33813021593,108164.13366527512]
[null,2285,"Protected Steel",36859.159281376677,37073.881562753362,37288.603844130048,37340.433360324423,37392.262876518798,37444.092392713173,37495.921908907549]
[null,2286,"High density polyethylene (100)",2411.1682603028044,2686.9090796660253,2921.4656359740657,3142.2692952456105,3358.7435834008825,3580.2995249817695,3814.8112442105839]
[null,2286,"High density polyethylene (575)",1.498,1.498,1.498,1.498,1.498,1.498,1.498]
[null,2286,"Polyamide",5717.6700769284143,5780.73971860858,5834.3893668334767,5884.8933426470167,5934.4070701337605,5985.0831139632073,6038.7225066933706]
[null,2287,"High density polyethylene (100)",11321.304025050524,12616.00655557219,13717.334127252618,14754.086890472425,15770.511695892039,16810.796695694811,17911.913741127912]
[null,2287,"High density polyethylene (575)",56.77,56.77,56.77,56.77,56.77,56.77,56.77]
[null,2287,"High density polyethylene (80)",5259.91,5259.91,5259.91,5259.91,5259.91,5259.91,5259.91]
[null,2287,"Polyamide",176721.17047072254,178670.52059917129,180328.71851931774,181889.69031361694,183420.05561243571,184986.34566762834,186644.22661197721]
[null,2287,"Protected Steel",10365.851054108227,10426.237108216455,10486.623162324684,10501.199106419774,10515.775050514863,10530.350994609953,10544.926938705043]
[null,2289,"Cast Iron",6093.759,6093.759,6093.759,6093.759,-0.24099999999998545,0,0]
[null,2289,"High density polyethylene (100)",1565.7686626377467,1744.8297182584633,1897.1464650943867,2040.5323315953458,8275.106783507621,14776.645109265926,22616.737792405311]
[null,2289,"High density polyethylene (575)",310.31000000000006,310.31000000000006,310.31000000000006,310.31000000000006,310.31000000000006,310.31000000000006,310.31000000000006]
[null,2289,"High density polyethylene (80)",131.72200000000001,131.72200000000001,131.72200000000001,131.72200000000001,131.72200000000001,131.72200000000001,131.72200000000001]
[null,2289,"Polyamide",60856.873520856418,61528.164650826177,62099.192676671097,62636.739269432197,63163.746006558526,63703.124030888808,64274.042900847242]
[null,2289,"Protected Steel",23717.290593102873,23855.455186205731,23993.619779308588,24026.969853505831,24060.319927703073,17735.765061044949,10081.310082557791]
[null,2290,"Cast Iron",3462.8199999999997,3462.8199999999997,3462.8199999999997,3462.8199999999997,-0.18000000000029104,0,0]
[null,2290,"High density polyethylene (100)",12162.715178824161,13553.64135527826,14736.820743738795,15850.626056448358,20405.592616277172,27880.856625941557,36751.614894308317]
[null,2290,"High density polyethylene (575)",7767.9809999999979,7767.9809999999979,7767.9809999999979,7767.9809999999979,7767.9809999999979,7767.9809999999979,7767.9809999999979]
[null,2290,"High density polyethylene (80)",23.087,23.087,23.087,23.087,23.087,23.087,23.087]
[null,2290,"Polyamide",90569.87212039424,91568.917064365596,92418.746053037044,93218.746502426569,94003.061075730438,94805.787142021087,95655.453680107938]
[null,2290,"Protected Steel",41210.423482320926,41450.493964641835,41690.564446962744,41748.512494419512,41806.46054187628,35506.564648477681,27876.707643250047]
[null,2291,"Cast Iron",101.316,101.316,101.316,101.316,101.316,101.316,101.316]
[null,2291,"High density polyethylene (100)",56.070816696577005,62.483066390149801,67.93759143937919,73.0722980082992,78.106326670053363,83.258527282904552,88.712009662614818]
[null,2291,"Polyamide",55551.600801871966,56164.371302826759,56685.619258943771,57176.304567041916,57657.368844369696,58149.725926739848,58670.874242768892]
[null,2292,"Cast Iron",1856.3579999999999,1856.3579999999999,1856.3579999999999,1856.3579999999999,1856.3579999999999,1856.3579999999999,1856.3579999999999]
[null,2292,"High density polyethylene (100)",723.76004042526063,806.52912371775403,876.93593251267316,943.21453612217385,1008.1935930074919,1074.6980090928719,1145.091359147973]
[null,2292,"High density polyethylene (575)",20.53,20.53,20.53,20.53,20.53,20.53,20.53]
[null,2292,"Polyamide",22548.532379186945,22797.25744349372,23008.833280129078,23208.00366222308,23403.268844093953,23603.11780350632,23814.653195983141]
[null,2292,"Protected Steel",1179.4770193439729,1186.3480386879457,1193.2190580319186,1194.8775799425327,1196.5361018531469,1198.194623763761,1199.8531456743751]
[null,2293,"Polyamide",15038.119964101286,15204.000265853278,15345.104917780178,15477.936094943181,15608.162806837596,15741.44654237322,15882.524221187294]
[null,2293,"Protected Steel",1934.2791035059281,1945.5472070118562,1956.8153105177844,1959.5351975709395,1962.2550846240947,1964.9749716772499,1967.694858730405]
[null,2294,"Polyamide",12772.215550522627,12913.101444146283,13032.944817779027,13145.761342092272,13256.365835122107,13369.566727501182,13489.387192258888]
[null,2294,"Protected Steel",1285.1556480422189,1292.6422960844379,1300.128944126657,1301.9360660678822,1303.7431880091074,1305.5503099503326,1307.3574318915578]
[null,2295,"High density polyethylene (100)",3892.0736004846203,4337.1705193884936,4715.7883851165625,5072.2065195495597,5421.6362445439599,5779.2687024086754,6157.8141927595252]
[null,2295,"Polyamide",39301.038313113422,39734.554478040183,40103.321275005219,40450.465944373544,40790.80403223099,41139.131430157388,41507.827734843922]
[null,2295,"Protected Steel",5358.2051147206894,5389.4192294413788,5420.6333441620682,5428.167785646373,5435.7022271306778,5443.2366686149826,5450.7711100992874]
[null,2296,"Polyamide",10854.185197690342,10973.913961669015,11075.760204944529,11171.634835576298,11265.629620294238,11361.830897634567,11463.657672308773]
[null,2297,"Polyamide",11778.429463683295,11908.353246593952,12018.871795035249,12122.91024229643,12224.908772963652,12329.301681213496,12439.799103283438]
[null,2297,"Protected Steel",863.02956112382799,868.05712224765591,873.08468337148383,874.29823260826993,875.51178184505602,876.72533108184211,877.93888031862821]
[null,2298,"Polyamide",43973.408306570738,44458.463769379276,44871.072026791124,45259.487573626415,45640.287327068028,46030.026213133846,46442.555597674182]
[null,2298,"Protected Steel",1716.6744520425918,1726.6749040851837,1736.6753561277756,1739.0892583449529,1741.5031605621302,1743.9170627793076,1746.3309649964849]
[null,2299,"High density polyethylene (100)",595.24389510393951,663.3158924253969,721.22075145063582,775.73043970503068,829.17133829052159,883.86674210006993,941.76053221812265]
[null,2299,"Polyamide",56869.395891041269,57496.702533984593,58030.315534256864,58532.640879365739,59025.116963609733,59529.153740820351,60062.664737342457]
[null,2299,"Protected Steel",2035.1758755959352,2047.0317511918702,2058.8876267878054,2061.7493898626863,2064.6111529375671,2067.472916012448,2070.3346790873288]
[null,2300,"High density polyethylene (100)",1060.5087593769251,1181.7883726942232,1284.9538326205763,1382.0703294720006,1477.2826307237265,1574.7300053457802,1677.8757444936018]
[null,2300,"High density polyethylene (575)",1011.9590000000002,1011.9590000000002,1011.9590000000002,1011.9590000000002,1011.9590000000002,1011.9590000000002,1011.9590000000002]
[null,2300,"Polyamide",45188.764388313044,45687.226023838433,46111.238126763608,46510.38887051151,46901.713332273313,47302.223990273873,47726.155040404992]
[null,2300,"Protected Steel",1502.7884635747671,1511.5429271495339,1520.2973907243006,1522.4105371044168,1524.523683484533,1526.6368298646491,1528.7499762447653]
[null,2302,"Cast Iron",209.57000000000002,209.57000000000002,209.57000000000002,209.57000000000002,209.57000000000002,209.57000000000002,209.57000000000002]
[null,2302,"High density polyethylene (100)",392.18900120800225,437.03967310792052,475.19151139302068,511.10636977038837,546.31703352065165,582.35425451052743,620.49879981255037]
[null,2302,"High density polyethylene (575)",86.762,86.762,86.762,86.762,86.762,86.762,86.762]
[null,2302,"Polyamide",9125.5987995851501,9226.2601246813992,9311.8868150731432,9392.4929037171914,9471.5185218512743,9552.3992369879816,9638.0095592561411]
[null,2302,"Protected Steel",127.8668859387079,128.61177187741578,129.35665781612366,129.53645787029453,129.7162579244654,129.89605797863626,130.07585803280713]
[null,2303,"Polyamide",48578.488186202972,49114.340692913873,49570.159018809165,49999.251071936567,50419.929773821692,50850.483751818057,51306.214944943698]
[null,2303,"Protected Steel",37.50850503181524,37.72701006363048,37.945515095445721,37.998257689332156,38.051000283218592,38.103742877105027,38.156485470991463]
[null,2304,"High density polyethylene (100)",5736.5772527442405,6392.6113164198559,6950.6610500497054,7475.9903146862443,7991.0192729222754,8518.1383444563508,9076.0814030884412]
[null,2304,"High density polyethylene (575)",81.039000000000001,81.039000000000001,81.039000000000001,81.039000000000001,81.039000000000001,81.039000000000001,81.039000000000001]
[null,2304,"High density polyethylene (80)",68.435000000000002,68.435000000000002,68.435000000000002,68.435000000000002,68.435000000000002,68.435000000000002,68.435000000000002]
[null,2304,"Polyamide",79751.662622883887,80631.375638386322,81379.695948495384,82084.139539329408,82774.770869328349,83481.614513010514,84229.791776608501]
[null,2304,"Protected Steel",20252.401954939432,20370.381909878866,20488.3618648183,20516.839784976095,20545.31770513389,20573.795625291685,20602.27354544948]
[null,2305,"Cast Iron",1447.482,1447.482,1447.482,9.2200016835899987,0.22000168358999872,0,0]
[null,2305,"High density polyethylene (100)",1129.0716833560728,1258.1921417720757,1368.027349141496,2909.6845203993398,3020.0523896413169,9481.463772778814,17279.083037086566]
[null,2305,"High density polyethylene (575)",232.523,232.523,232.523,232.523,232.523,232.523,232.523]
[null,2305,"Polyamide",60897.832324574942,61569.575256946628,62140.987604618735,62678.895985031886,63206.257416118904,57388.554521546946,50272.052587182436]
[null,2305,"Protected Steel",736.55377903223712,740.84455806447431,745.13533709671151,746.17104238035495,747.20674766399839,748.24245294764182,749.27815823128526]
[null,2306,"Cast Iron",2561.7770000000005,2561.7770000000005,2561.7770000000005,2561.7770000000005,-0.2229999999995016,0,0]
[null,2306,"High density polyethylene (100)",126.84118132003441,141.34671867386174,153.68572925984827,165.30125914338777,2738.6890394518346,9108.0080845242173,9120.3447364245039]
[null,2306,"Polyamide",2358.1576092440027,2384.1696304763072,2406.2965326047297,2427.1260546406975,2447.5471652791102,2468.4476538968429,2490.5703263176019]
[null,2306,"Protected Steel",11137.575720427745,11202.457440855485,11267.339161283226,11283.00026621406,11298.661371144894,4956.435535220362,4972.096640151196]
[null,2307,"Polyamide",15123.232465500421,15290.051613826894,15431.954887517233,15565.537860368735,15696.501627242415,15830.539719848892,15972.41586776443]
[null,2318,"High density polyethylene (100)",232.02071111083569,258.55456278940102,281.1253554986024,302.37274120930545,323.20352232977797,344.52329829181406,367.08977644065175]
[null,2318,"Polyamide",1362.0884432855244,1377.1131699484629,1389.8938244546289,1401.9251030821199,1413.720480409997,1425.7927498349236,1438.5709612321539]
[null,2318,"Protected Steel",9168.6668821072417,9222.0787642144842,9275.4906463217267,9288.3831695889912,9301.2756928562558,9314.1682161235203,9327.0607393907849]
[null,2320,"Cast Iron",4046.9930000000004,3742.6138296280847,444.08421374043974,396.99300000000017,396.99300000000017,396.99300000000017,396.99300000000017]
[null,2320,"High density polyethylene (100)",57642.444014441928,73527.028773791302,82414.482976051979,89622.799966159975,94780.867130992105,100060.01800466137,105647.87423013069]
[null,2320,"High density polyethylene (575)",2811.7060000000006,2811.7060000000006,2811.7060000000006,2811.7060000000006,2811.7060000000006,2811.7060000000006,2811.7060000000006]
[null,2320,"Polyamide",205110.86868392443,207373.3757573567,209297.95793924906,211109.69492507246,212885.90857852637,214703.81818706859,216628.03247200203]
[null,2320,"Protected Steel",15272.152716192035,6352.2694003576125,6442.3441005364202,6464.0862695450978,6485.8284385537754,6507.570607562453,6529.3127765711306]
[null,2321,"High density polyethylene (100)",24095.999056508161,26851.613682250849,29195.653562232746,31402.25392815351,33565.588743490138,35779.70703925204,38123.298840086369]
[null,2321,"High density polyethylene (575)",505.137,505.137,505.137,505.137,505.137,505.137,505.137]
[null,2321,"Polyamide",65514.242591537666,66236.907549396768,66851.636280062667,67430.321247675005,67997.659745792829,68578.316304207852,69192.927525300649]
[null,2321,"Protected Steel",7682.4559908421916,7727.2099816843838,7771.9639725265761,7782.7666599712429,7793.5693474159098,7804.3720348605766,7815.1747223052434]
[null,2322,"High density polyethylene (100)",18635.606150451229,20766.771110548361,22579.628253423092,24286.191042303777,25959.292684432359,27671.669765522201,29484.180368438214]
[null,2322,"High density polyethylene (575)",1371.7169999999999,1371.7169999999999,1371.7169999999999,1371.7169999999999,1371.7169999999999,1371.7169999999999,1371.7169999999999]
[null,2322,"High density polyethylene (80)",1761.2530000000002,1761.2530000000002,1761.2530000000002,1761.2530000000002,1761.2530000000002,1761.2530000000002,1761.2530000000002]
[null,2322,"Polyamide",99378.394139265554,100474.6028439974,101407.08335004139,102284.88916018252,103145.48353853553,104026.28004993671,104958.58230599706]
[null,2322,"Protected Steel",22162.200447143019,22291.305894286041,22420.411341429062,22451.574725222206,22482.73810901535,22513.901492808494,22545.064876601638]
[null,2323,"High density polyethylene (100)",18830.431030622662,20983.876133078698,22815.685687416575,24540.089639507325,26230.682627198308,27960.961656684049,29792.421048181001]
[null,2323,"High density polyethylene (575)",943.01899999999989,943.01899999999989,943.01899999999989,943.01899999999989,943.01899999999989,943.01899999999989,943.01899999999989]
[null,2323,"High density polyethylene (80)",299.84399999999999,299.84399999999999,299.84399999999999,299.84399999999999,299.84399999999999,299.84399999999999,299.84399999999999]
[null,2323,"Polyamide",135624.05628105722,137120.07835259516,138392.65666026506,139590.61911105274,140765.09271183709,141967.13664371055,143239.47168939153]
[null,2323,"Protected Steel",6839.5134462237374,6879.3568924474748,6919.2003386712122,6928.8177222424592,6938.4351058137063,6948.0524893849533,6957.6698729562004]
[null,2324,"High density polyethylene (100)",10816.12051565498,12053.05034026353,13105.234056569654,14095.724445937472,15066.793959325145,16060.658968479396,17112.641552720015]
[null,2324,"High density polyethylene (575)",28.679000000000002,28.679000000000002,28.679000000000002,28.679000000000002,28.679000000000002,28.679000000000002,28.679000000000002]
[null,2324,"High density polyethylene (80)",1541.7689999999998,1541.7689999999998,1541.7689999999998,1541.7689999999998,1541.7689999999998,1541.7689999999998,1541.7689999999998]
[null,2324,"Polyamide",24866.938504477239,25141.237105141274,25374.566850517567,25594.215631207895,25809.557684872128,26029.954813178283,26263.239955988593]
[null,2325,"High density polyethylene (100)",18658.007796287355,20791.734605045007,22606.770962448009,24315.385190647863,25990.498048839516,27704.933558541703,29519.622959414322]
[null,2325,"High density polyethylene (575)",1010.145,1010.145,1010.145,1010.145,1010.145,1010.145,1010.145]
[null,2325,"High density polyethylene (80)",550.91399999999999,550.91399999999999,550.91399999999999,550.91399999999999,550.91399999999999,550.91399999999999,550.91399999999999]
[null,2325,"Polyamide",114999.526085324,116268.04609539891,117347.10173126063,118362.88844260263,119358.75828452823,120378.00580071165,121456.85516775788]
[null,2325,"Protected Steel",5208.5462802297079,5238.8885604594161,5269.2308406891243,5276.5548393652607,5283.8788380413971,5291.2028367175335,5298.5268353936699]
[null,2326,"High density polyethylene (100)",5677.5533000617315,6326.8373938813702,6879.145323710618,7399.0694472163877,7908.7992447296192,8430.4947597132468,8982.6971121295392]
[null,2326,"High density polyethylene (575)",1801.6900000000003,1801.6900000000003,1801.6900000000003,1801.6900000000003,1801.6900000000003,1801.6900000000003,1801.6900000000003]
[null,2326,"High density polyethylene (80)",388.822,388.822,388.822,388.822,388.822,388.822,388.822]
[null,2326,"Polyamide",11778.496255891559,11908.420775563973,12018.93995072532,12122.978987959694,12224.978097032308,12329.371597265395,12439.869645935587]
[null,2326,"Protected Steel",32781.119745149736,32972.085490299469,33163.051235449202,33209.146415312935,33255.241595176667,33301.3367750404,33347.431954904132]
[null,2327,"High density polyethylene (100)",1343.0998903733805,1565.0807137917525,12099.595392661624,12182.702543890142,12264.180185439014,12347.570484328469,12435.837141589074]
[null,2327,"High density polyethylene (575)",3203.67,3203.67,3203.67,3203.67,3203.67,3203.67,3203.67]
[null,2327,"Polyamide",29032.220028723354,29352.46440969592,29624.877537905926,29881.318101704892,30132.730549694479,30390.04481142119,30662.405866011068]
[null,2327,"Protected Steel",13864.304949138226,13829.412437335028,3466.484937584366,3486.5927141716143,3506.7004907588625,3526.8082673461108,3546.9160439333591]
[null,2330,"High density polyethylene (100)",62657.973507134615,69823.529407545531,75918.847902335372,81656.77588550208,87282.19839770181,93039.675611747458,99133.82894499776]
[null,2330,"High density polyethylene (575)",150.321,150.321,150.321,150.321,150.321,150.321,150.321]
[null,2330,"Polyamide",328.66421684591029,332.28959818318037,335.37349763534445,338.27657693775831,341.12273459439155,344.03570474376431,347.11901468759726]
[null,2330,"Protected Steel",174.51463142960259,175.53126285920519,176.54789428880778,176.79328808216013,177.03868187551248,177.28407566886483,177.52946946221718]
[null,2331,"High density polyethylene (100)",594.33172954843963,662.29941176181865,720.11553603759887,774.5416923809978,827.90069689357915,882.51228419730592,940.31735652815019]
[null,2334,"High density polyethylene (100)",6298.5499092113214,7018.8510766412383,7631.5690693098186,8208.3611957471749,8773.8439662593191,9352.6012345531017,9965.2021020148113]
[null,2334,"Polyamide",310.90760947697896,314.33712381787706,317.25441069425523,320.00064651724034,322.69303597694625,325.44862827814245,328.36535749531532]
[null,2335,"High density polyethylene (100)",34669.867784140413,38634.708358482101,42007.3658909273,45182.272345708465,48294.927348917023,51480.650770987711,54852.663597033039]
[null,2335,"High density polyethylene (575)",17.268999999999998,17.268999999999998,17.268999999999998,17.268999999999998,17.268999999999998,17.268999999999998,17.268999999999998]
[null,2335,"Polyamide",4015.1609761378641,4059.4508285858105,4097.1256106277733,4132.5913842904729,4167.3617686801044,4202.9483749150613,4240.6159551664887]
[null,2500,"Cast Iron",6931.0729999999967,6931.0729999999967,6931.0729999999967,6931.0729999999967,6931.0729999999967,6931.0729999999967,6931.0729999999967]
[null,2500,"High density polyethylene (100)",11347.461512561431,12645.155409201128,13749.027560740722,14788.175705923226,15806.948926251116,16849.637469128953,17953.298608007495]
[null,2500,"High density polyethylene (575)",444.15699999999993,444.15699999999993,444.15699999999993,444.15699999999993,444.15699999999993,444.15699999999993,444.15699999999993]
[null,2500,"High density polyethylene (80)",1911.2949999999994,1911.2949999999994,1911.2949999999994,1911.2949999999994,1911.2949999999994,1911.2949999999994,1911.2949999999994]
[null,2500,"Polyamide",162705.48235478398,164500.23027368233,166026.91715402884,167464.08887520494,168873.08149029507,170315.14968313696,171841.54472691455]
[null,2500,"Protected Steel",13886.685604040749,13967.582208081498,14048.478812122246,14068.00557861484,14087.532345107435,14107.059111600029,14126.585878092623]
[null,2502,"High density polyethylene (100)",11357.825993685794,12656.70517074103,13761.585570871348,14801.682847392543,15821.386589123867,16865.027497049101,17969.6966917848]
[null,2502,"High density polyethylene (575)",155.67899999999997,155.67899999999997,155.67899999999997,155.67899999999997,155.67899999999997,155.67899999999997,155.67899999999997]
[null,2502,"Polyamide",19023.830636406768,19233.675934487852,19412.179032393342,19580.215849735923,19744.95791306096,19913.567235068644,20092.036210894286]
[null,2502,"Protected Steel",2871.8639851302437,2888.5939702604874,2905.323955390731,2909.3622276635483,2913.4004999363656,2917.4387722091828,2921.4770444820001]
[null,2505,"Polyamide",27384.020077280435,27686.083734469335,27943.031586367579,28184.913658794434,28422.053068616129,28664.759237910916,28921.657972481662]
[null,2505,"Protected Steel",7633.2352564569192,7677.7025129138383,7722.1697693707574,7732.9032450672548,7743.6367207637522,7754.3701964602496,7765.1036721567471]
[null,2506,"High density polyethylene (100)",20477.50785046379,22819.312396486872,24811.348291390554,26686.583935698665,28525.051208225905,30406.67581640225,32398.33092011149]
[null,2506,"High density polyethylene (575)",3301.835,3301.835,3301.835,3301.835,3301.835,3301.835,3301.835]
[null,2506,"Polyamide",23926.761260801828,24190.689091366043,24415.197030357289,24626.541258994741,24833.74159073269,25045.805873217574,25270.27089599106]
[null,2515,"High density polyethylene (100)",3546.4723148168296,3952.0463255719988,4297.0443694251362,4621.8139334199941,4940.2156320703989,5266.091692209443,5611.0237873427131]
[null,2515,"High density polyethylene (575)",876.41000000000008,876.41000000000008,876.41000000000008,876.41000000000008,876.41000000000008,876.41000000000008,876.41000000000008]
[null,2515,"Polyamide",47158.500006373601,47678.689114447123,48121.183505014495,48537.732853207068,48946.114779163443,49364.083318988283,49806.493123746761]
[null,2516,"High density polyethylene (100)",3969.9007058868146,4423.8979202058135,4810.0867456761398,5173.6319271701987,5530.0489568328385,5894.8327437448816,6280.9477465975997]
[null,2516,"High density polyethylene (575)",530.91899999999998,530.91899999999998,530.91899999999998,530.91899999999998,530.91899999999998,530.91899999999998,530.91899999999998]
[null,2516,"Polyamide",28705.256989182064,29021.894753916011,29291.239945043617,29544.792455978612,29793.373478121612,30047.789847332755,30317.083551297252]
[null,2516,"Protected Steel",3041.8170432072243,3059.5370864144484,3077.2571296216724,3081.5343814303128,3085.8116332389532,3090.0888850475935,3094.3661368562339]
[null,2517,"High density polyethylene (100)",10428.047661516168,11620.597536150002,12635.029829727959,13589.982298466777,14526.210695108191,15484.416705255086,16498.655083208461]
[null,2517,"High density polyethylene (575)",4996.4309999999996,4996.4309999999996,4996.4309999999996,4996.4309999999996,4996.4309999999996,4996.4309999999996,4996.4309999999996]
[null,2517,"Polyamide",47287.490940595075,47809.102903064158,48252.807632484961,48670.496352997805,49079.995311220715,49499.10710522921,49942.727017476624]
[null,2517,"Protected Steel",3859.7317888929465,3882.2165777858922,3904.701366678838,3910.1287295150664,3915.5560923512949,3920.9834551875233,3926.4108180237517]
[null,2518,"High density polyethylene (100)",26885.02619714207,29959.593523799987,32574.947775461027,35036.954372708955,37450.687584065709,39921.082285091914,42535.93659402003]
[null,2518,"High density polyethylene (575)",835.60599999999988,835.60599999999988,835.60599999999988,835.60599999999988,835.60599999999988,835.60599999999988,835.60599999999988]
[null,2518,"Polyamide",56450.916394131833,57073.606934437987,57603.293286705659,58101.922217347448,58590.77436395776,59091.102132946187,59620.68723206914]
[null,2518,"Protected Steel",3270.9337579606954,3289.9885159213904,3309.0432738820855,3313.6426982174257,3318.242122552766,3322.8415468881062,3327.4409712234465]
[null,2519,"Cast Iron",89.302999999999997,89.302999999999997,89.302999999999997,89.302999999999997,89.302999999999997,89.302999999999997,89.302999999999997]
[null,2519,"High density polyethylene (100)",15066.531513376058,16789.537664733729,18255.19802758217,19634.921436128407,20987.592146847477,22372.016299554649,23837.396491467596]
[null,2519,"High density polyethylene (575)",103.726,103.726,103.726,103.726,103.726,103.726,103.726]
[null,2519,"Polyamide",70096.046398590115,70869.251650042876,71526.972046750452,72146.127923936176,72753.143804982334,73374.40915813719,74032.003827122637]
[null,2519,"Protected Steel",1478.8661043585787,1487.4812087171572,1496.0963130757357,1498.1758210243581,1500.2553289729806,1502.334836921603,1504.4143448702255]
[null,2525,"Cast Iron",3424.5809999999997,3424.5809999999997,3424.5809999999997,3424.5809999999997,3424.5809999999997,3424.5809999999997,3424.5809999999997]
[null,2525,"High density polyethylene (100)",24150.594445418716,26912.452591167661,29261.803467741538,31473.403427365185,33641.639807700638,35860.774730877223,38209.676513070452]
[null,2525,"High density polyethylene (575)",4932.5049999999983,4932.5049999999983,4932.5049999999983,4932.5049999999983,4932.5049999999983,4932.5049999999983,4932.5049999999983]
[null,2525,"High density polyethylene (80)",9.1300000000000008,9.1300000000000008,9.1300000000000008,9.1300000000000008,9.1300000000000008,9.1300000000000008,9.1300000000000008]
[null,2525,"Polyamide",33027.006345328649,33391.315832924593,33701.212565073954,33992.938933894831,34278.945326338522,34571.66561250278,34881.503105786476]
[null,2525,"Protected Steel",1316.6259778070464,1324.2959556140927,1331.965933421139,1333.8173073745638,1335.6686813279887,1337.5200552814135,1339.3714292348384]
[null,2526,"Cast Iron",12.86,12.86,12.86,12.86,12.86,12.86,12.86]
[null,2526,"High density polyethylene (100)",29288.437629602297,32637.858706023115,35487.014935866486,38169.114857897832,40798.625950687354,43489.863838683064,46338.475432957021]
[null,2526,"High density polyethylene (575)",7605.3319999999994,7605.3319999999994,7605.3319999999994,7605.3319999999994,7605.3319999999994,7605.3319999999994,7605.3319999999994]
[null,2526,"Other",24.821000000000002,24.821000000000002,24.821000000000002,24.821000000000002,24.821000000000002,24.821000000000002,24.821000000000002]
[null,2526,"Polyamide",73132.742003661959,73939.443994368077,74625.658104211645,75271.637005343859,75904.949982344609,76553.129746003891,77239.212681358476]
[null,2526,"Protected Steel",11507.592244147467,11574.629488294933,11641.6667324424,11657.848136202134,11674.029539961868,11690.210943721602,11706.392347481336]
[null,2527,"High density polyethylene (100)",3532.2322702885322,3936.1777918127136,4279.7905753083633,4603.2561017576863,4920.3793315623807,5244.9469112749175,5588.494010852628]
[null,2527,"Polyamide",139912.1373042186,141455.45971487853,142768.27364918604,144004.11256667547,145215.71997762466,146455.76942204961,147768.33240305484]
[null,2527,"Protected Steel",9061.7792101521391,9114.5684203042765,9167.357630456414,9180.0998535965846,9192.8420767367552,9205.5842998769258,9218.3265230170964]
[null,2528,"High density polyethylene (100)",3814.5509303365752,4250.7823689926445,4621.8588902010879,4971.1778563483185,5313.647608821313,5664.1567113975188,6035.1622988079807]
[null,2528,"High density polyethylene (575)",4.8490000000000002,4.8490000000000002,4.8490000000000002,4.8490000000000002,4.8490000000000002,4.8490000000000002,4.8490000000000002]
[null,2528,"Polyamide",121182.96049460612,122519.68783166897,123656.76344357274,124727.16821045997,125776.58519346821,126850.63684996146,127987.49510213715]
[null,2528,"Protected Steel",924.27232962388416,929.6566592477684,935.04098887165264,936.34065464293508,937.64032041421751,938.93998618549995,940.23965195678238]
[null,2529,"High density polyethylene (100)",9068.7134661574892,10105.810098067575,10988.007427796492,11818.478345641621,12632.665942746118,13465.966290963817,14347.994982679846]
[null,2529,"High density polyethylene (575)",724.38900000000001,724.38900000000001,724.38900000000001,724.38900000000001,724.38900000000001,724.38900000000001,724.38900000000001]
[null,2529,"Polyamide",165849.61221485917,167679.04194313142,169235.23060631898,170700.17431438333,172136.39438173638,173606.32918115944,175162.22036831189]
[null,2529,"Protected Steel",7657.5066489594064,7702.1152979188109,7746.7239468782154,7757.4915517994514,7768.2591567206873,7779.0267616419233,7789.7943665631592]
[null,2530,"High density polyethylene (100)",3726.6284326488872,4152.8050684311747,4515.3285580577258,4856.5959877189471,5191.1720728717746,5533.6022072224732,5896.0563980211364]
[null,2530,"Polyamide",173435.26099254805,175348.36538967729,176975.73119023113,178507.67866333332,180009.58873051763,181546.75557809332,183173.8102966187]
[null,2530,"Protected Steel",12472.3675228761,12545.025045752202,12617.682568628303,12635.220591391499,12652.758614154694,12670.29663691789,12687.834659681086]
[null,2533,"High density polyethylene (100)",7658.7096143977305,8534.5584297242058,9279.5916911900858,9980.9409649005866,10668.538649085629,11372.277433246376,12117.168276542856]
[null,2533,"High density polyethylene (575)",231.68300000000002,231.68300000000002,231.68300000000002,231.68300000000002,231.68300000000002,231.68300000000002,231.68300000000002]
[null,2533,"Polyamide",14428.294958535393,14587.448491503741,14722.831075422664,14850.275690066806,14975.221455573281,15103.100276468052,15238.456981086323]
[null,2533,"Protected Steel",292.87513814986892,294.58127629973785,296.28741444960679,296.69924089957516,297.11106734954353,297.52289379951191,297.93472024948028]
[null,2555,"Protected Steel",6789.6690788773549,6829.2221577547098,7891.7088559144222,16378.322531533495,16647.285801706927,18897.417121336355,18906.964416237784]
[null,2556,"High density polyethylene (100)",462.63668726620159,515.54374535689169,560.54867926112797,602.91481153960035,644.45025690826458,686.9607314133716,731.95706231874578]
[null,2556,"Protected Steel",691.52043822292103,695.5488764458421,699.57731466876317,700.54969630877861,701.52207794879405,702.49445958880949,703.46684122882493]
[null,2557,"High density polyethylene (100)",18021.941071953966,20082.927391122001,21836.087676706175,23486.453850389902,25104.460743130585,26760.44974607581,28513.274903161091]
[null,2557,"High density polyethylene (575)",13.981,13.981,13.981,13.981,13.981,13.981,13.981]
[null,2557,"Polyamide",86283.629906966569,87235.394795090338,88045.005410917045,88807.145635745619,89554.342322560347,90319.079173777573,91128.535027034886]
[null,2557,"Protected Steel",5891.8719801717443,5926.1949603434887,5960.517940515233,5968.8027977980682,5977.0876550809035,5985.3725123637387,5993.6573696465739]
[null,2558,"High density polyethylene (100)",9812.2640785162585,10934.393040382482,11888.922390214262,12787.484240892836,13668.427689162017,14570.050957329528,15524.39784239138]
[null,2558,"High density polyethylene (575)",73.046000000000006,73.046000000000006,73.046000000000006,73.046000000000006,73.046000000000006,73.046000000000006,73.046000000000006]
[null,2558,"High density polyethylene (80)",17810.649000000016,17810.649000000016,17810.649000000016,17810.649000000016,17810.649000000016,17810.649000000016,17810.649000000016]
[null,2558,"Polyamide",35327.411970489484,35717.096437149601,36048.578176986353,36360.623946628075,36666.55133061215,36979.660246186235,37311.07862103646]
[null,2559,"High density polyethylene (100)",345.63663208306639,385.16358244220885,418.78684278868172,450.43865008837196,481.469849827693,513.22949544296557,546.84632847479963]
[null,2559,"High density polyethylene (575)",22.835999999999999,22.835999999999999,22.835999999999999,22.835999999999999,22.835999999999999,22.835999999999999,22.835999999999999]
[null,2559,"High density polyethylene (80)",2854.0069999999992,2854.0069999999992,2854.0069999999992,2854.0069999999992,2854.0069999999992,2854.0069999999992,2854.0069999999992]
[null,2559,"Polyamide",5019.3909355434553,5074.7581014516118,5121.8557049110632,5166.1918059796244,5209.6585943021573,5254.1457493188691,5301.2343497514557]
[null,2559,"Protected Steel",63.408384250485419,63.777768500970836,64.147152751456247,64.236314467090651,64.325476182725055,64.414637898359459,64.503799613993863]
[null,2560,"High density polyethylene (100)",24754.785480479644,28168.676872035812,30540.395116905755,32773.050965334143,34961.930384627922,37202.192934426945,39573.457809241838]
[null,2560,"High density polyethylene (575)",13054.682999999999,13054.682999999999,13054.682999999999,13054.682999999999,13054.682999999999,13054.682999999999,13054.682999999999]
[null,2560,"High density polyethylene (80)",51977.125999999982,51977.125999999982,51977.125999999982,51977.125999999982,51977.125999999982,51977.125999999982,51977.125999999982]
[null,2560,"Polyamide",263082.05265057785,265984.0198102619,268452.5532144435,270776.34760014177,273054.57857295644,275386.29017077282,277854.35169802391]
[null,2560,"Protected Steel",21809.344894309535,21936.394788619069,22063.444682928603,22094.111898796422,22124.779114664241,22155.446330532061,22186.11354639988]
[null,2563,"Protected Steel",0,468.01001173575935,6000.0000000000009,6000.0000000000009,6000.0000000000009,6000.0000000000009,6000.0000000000009]
[null,2564,"High density polyethylene (100)",2745.936439792089,3059.9612950016995,3327.0838371164118,3578.5440209681306,3825.0737409840053,4077.3906545133009,4344.4621343393592]
[null,2564,"High density polyethylene (575)",3159.2329999999993,3159.2329999999993,3159.2329999999993,3159.2329999999993,3159.2329999999993,3159.2329999999993,3159.2329999999993]
[null,2564,"High density polyethylene (80)",9696.2780000000002,9696.2780000000002,9696.2780000000002,9696.2780000000002,9696.2780000000002,9696.2780000000002,9696.2780000000002]
[null,2564,"Polyamide",27686.379296101644,27991.778173289804,28251.563101393749,28496.115902013888,28735.87367416891,28981.259670879244,29240.994939329303]
[null,2564,"Protected Steel",5000.928808880637,5030.0616177612728,5059.1944266419086,5066.2264839579238,5073.258541273939,5080.2905985899542,5087.3226559059694]
[null,2565,"High density polyethylene (100)",13017.947921177505,14506.67837823919,15773.054136771008,16965.177716251692,18133.926930429472,19330.112097849193,20596.245780051497]
[null,2565,"High density polyethylene (575)",6241.3759999999984,6241.3759999999984,6241.3759999999984,6241.3759999999984,6241.3759999999984,6241.3759999999984,6241.3759999999984]
[null,2565,"High density polyethylene (80)",5001.4639999999999,5001.4639999999999,5001.4639999999999,5001.4639999999999,5001.4639999999999,5001.4639999999999,5001.4639999999999]
[null,2565,"Polyamide",86085.516121205117,87035.095684657863,87842.847372849428,88603.237665676017,89348.718731990157,90111.699689153451,90919.296970122261]
[null,2565,"Protected Steel",14546.571757381647,14631.312514763296,14716.053272144945,14736.507937719825,14756.962603294705,14777.417268869585,14797.871934444465]
[null,2566,"High density polyethylene (100)",5482.9929479013881,6110.0271507434672,6643.4084021869112,7145.515586736803,7637.7777879687783,8141.5956613431963,8674.8749533368373]
[null,2566,"High density polyethylene (575)",4581.4999999999991,4581.4999999999991,4581.4999999999991,4581.4999999999991,4581.4999999999991,4581.4999999999991,4581.4999999999991]
[null,2566,"High density polyethylene (80)",25131.665999999994,25131.665999999994,25131.665999999994,25131.665999999994,25131.665999999994,25131.665999999994,25131.665999999994]
[null,2566,"Polyamide",63065.092742560191,63760.741975251913,64352.490011670001,64909.541726038929,65455.671141337203,66014.62074159937,66606.255661360192]
[null,2566,"Protected Steel",8759.1281224070899,8810.154244814179,8861.1803672212682,8873.4970174574628,8885.8136676936574,8898.130317929852,8910.4469681660466]
[null,2567,"High density polyethylene (100)",11648.898022445806,12981.064150488826,14114.259809171432,15181.01211849143,16226.848258888214,17297.235013821108,18430.21405445506]
[null,2567,"High density polyethylene (575)",194.28400000000002,194.28400000000002,194.28400000000002,194.28400000000002,194.28400000000002,194.28400000000002,194.28400000000002]
[null,2567,"Polyamide",287400.90137799329,290571.12134951784,293267.84170081362,295806.44360975432,298295.27030293754,300842.52127735503,303538.72613223514]
[null,2567,"Protected Steel",11893.17142782569,11962.454855651376,12031.738283477063,12048.461869503953,12065.185455530844,12081.909041557734,12098.632627584624]
[null,2570,"High density polyethylene (100)",38455.671816995426,42853.456339362099,46594.393917386551,50115.986830139911,53568.530694113717,57102.121741579649,60842.344213971563]
[null,2570,"High density polyethylene (575)",9531.3899999999976,9531.3899999999976,9531.3899999999976,9531.3899999999976,9531.3899999999976,9531.3899999999976,9531.3899999999976]
[null,2570,"High density polyethylene (80)",9115.5209999999988,9115.5209999999988,9115.5209999999988,9115.5209999999988,9115.5209999999988,9115.5209999999988,9115.5209999999988]
[null,2570,"Polyamide",244502.2768548303,247199.29693184441,249493.49386292981,251653.17375185151,253770.50807565742,255937.54603545365,258231.30441520977]
[null,2570,"Protected Steel",13157.046103999895,13233.692207999791,13310.338311999687,13328.839095723799,13347.339879447911,13365.840663172023,13384.341446896135]
[null,2571,"High density polyethylene (100)",14285.155675844593,15918.80381050189,17308.452545024287,18928.156525135022,23099.140078303859,24411.765650106066,25801.14874383212]
[null,2571,"High density polyethylene (575)",333.94,333.94,333.94,333.94,333.94,333.94,333.94]
[null,2571,"High density polyethylene (80)",71.204999999999998,71.204999999999998,71.204999999999998,71.204999999999998,71.204999999999998,71.204999999999998,71.204999999999998]
[null,2571,"Polyamide",33344.103366105533,33711.910641298375,34024.782736382105,34319.310011875175,34608.062392678177,34903.593128257475,35216.405415714697]
[null,2571,"Protected Steel",53.416174838148258,53.727349676296512,54.038524514444767,54.113635682273653,54.18874685010254,54.263858017931426,54.338969185760313]
[null,2572,"High density polyethylene (100)",6237.2740478136748,6950.5677174645471,7557.3248424197991,8128.5056083211157,8688.4870421179639,9261.6138318625508,9868.2549710712919]
[null,2572,"Polyamide",25047.540587633495,25323.831347431951,25558.855705841113,25780.099738289042,25997.005765076701,26219.003580193843,26453.983012100231]
[null,2572,"Protected Steel",24.076255737235979,24.216511474471957,24.356767211707936,24.390622044833862,24.424476877959787,24.458331711085712,24.492186544211638]
[null,2573,"High density polyethylene (100)",4058.8345671341617,4523.0022437030239,4917.8424854087043,5289.5318193950898,5653.9333164312347,6026.8890031196152,6421.6537684307004]
[null,2573,"Polyamide",27880.184984429648,28187.721665155608,28449.325097451452,28695.589776802637,28937.025862310504,29184.129570155616,29445.68299517814]
[null,2573,"Protected Steel",589.93163471800699,593.36826943601397,596.80490415402096,597.63443667216063,598.4639691903003,599.29350170843998,600.12303422657965]
[null,2574,"High density polyethylene (100)",517.21269265870308,576.36105405960268,626.67509894239276,674.0390498706405,720.47431998907825,767.9996408081214,818.30406781941781]
[null,2574,"High density polyethylene (575)",647.86800000000005,647.86800000000005,647.86800000000005,647.86800000000005,647.86800000000005,647.86800000000005,647.86800000000005]
[null,2574,"Polyamide",22098.971229358311,22342.737340061336,22550.094885466282,22745.294309961791,22936.666394126474,23132.530866811521,23339.848774412956]
[null,2574,"Protected Steel",7228.7921815647906,7270.9033631295797,7313.0145446943689,7323.1793126582834,7333.3440806221979,7343.5088485861124,7353.673616550027]
[null,2575,"High density polyethylene (100)",57111.400339601023,63642.651013349037,69198.403222821289,74428.401638411917,79555.853727762689,84803.670848436886,90358.361038130635]
[null,2575,"High density polyethylene (575)",9977.7759999999998,9977.7759999999998,9977.7759999999998,9977.7759999999998,9977.7759999999998,9977.7759999999998,9977.7759999999998]
[null,2575,"High density polyethylene (80)",103.19899999999998,103.19899999999998,103.19899999999998,103.19899999999998,103.19899999999998,103.19899999999998,103.19899999999998]
[null,2575,"Polyamide",60540.949411736998,61208.755692092811,61776.819360587273,62311.575406963006,62835.84631287925,63372.424283379019,63940.379362644046]
[null,2575,"Protected Steel",7886.4473382803044,7932.3896765606096,7978.3320148409148,7989.4215447706438,8000.5110747003728,8011.6006046301018,8022.6901345598308]
[null,2576,"Cast Iron",115.92699999999999,115.92699999999999,115.92699999999999,115.92699999999999,115.92699999999999,115.92699999999999,115.92699999999999]
[null,2576,"High density polyethylene (100)",80518.311908655422,89726.373272505574,97559.131471910165,104932.6268021639,112161.54754604488,119560.16451655251,127391.42543101452]
[null,2576,"High density polyethylene (575)",2752.0360000000001,2752.0360000000001,2752.0360000000001,2752.0360000000001,2752.0360000000001,2752.0360000000001,2752.0360000000001]
[null,2576,"High density polyethylene (80)",511.22299999999996,511.22299999999996,511.22299999999996,511.22299999999996,511.22299999999996,511.22299999999996,511.22299999999996]
[null,2576,"Other",16.384,16.384,16.384,16.384,16.384,16.384,16.384]
[null,2576,"Polyamide",83851.099173811177,84776.03165648799,85562.817517410309,86303.471285052641,87029.602806825642,87772.779996084195,88559.415457544077]
[null,2576,"Protected Steel",14673.679219311265,14759.16043862253,14844.641657933795,14865.275055698583,14885.908453463371,14906.541851228159,14927.175248992948]
[null,2577,"High density polyethylene (100)",66986.102150391191,74646.622155153382,81162.977608057859,87297.255633634719,93311.256820545343,99466.43444921053,105981.54425650055]
[null,2577,"High density polyethylene (575)",1563.87,1563.87,1563.87,1563.87,1563.87,1563.87,1563.87]
[null,2577,"Polyamide",35838.279259483883,36233.598926571707,36569.874201183186,36886.43244336357,37196.783822329664,37514.420584523054,37850.631577831264]
[null,2577,"Protected Steel",10757.792299849367,10820.461599698734,10883.130899548101,10898.257971925535,10913.38504430297,10928.512116680404,10943.639189057838]
[null,2578,"High density polyethylene (100)",10237.140532405601,11407.858298069728,12403.719295933464,13341.189371019946,14260.278157142106,15200.942210785606,16196.612843054101]
[null,2578,"High density polyethylene (575)",1108.3729999999998,1108.3729999999998,1108.3729999999998,1108.3729999999998,1108.3729999999998,1108.3729999999998,1108.3729999999998]
[null,2578,"Polyamide",27481.987042762572,27785.131339674703,28042.998428458784,28285.745839596802,28523.733621144449,28767.308077376016,29025.125873114226]
[null,2579,"High density polyethylene (100)",13104.304914730574,14602.911143861804,15877.687642961757,17077.719397286204,18254.22172808152,19458.342013648635,20732.874830560439]
[null,2579,"High density polyethylene (575)",2083.549,2083.549,2083.549,2083.549,2083.549,2083.549,2083.549]
[null,2579,"Polyamide",21433.674282818964,21670.101732937419,21871.216709836892,22060.539590137865,22246.150353473346,22436.118260464882,22637.194792870221]
[null,2579,"Protected Steel",23259.099409699731,23394.594819399466,23530.090229099202,23562.796017647412,23595.501806195622,23628.207594743832,23660.913383292042]
[null,2580,"Cast Iron",1087.6669999999999,1087.6669999999999,1087.6669999999999,1087.6669999999999,1087.6669999999999,1087.6669999999999,1087.6669999999999]
[null,2580,"High density polyethylene (100)",25637.459647298794,28569.355461425799,31063.347418088983,33411.10762949755,35712.834522071003,38068.593597626328,40562.108810783764]
[null,2580,"High density polyethylene (575)",30130.780000000013,30130.780000000013,30130.780000000013,30130.780000000013,30130.780000000013,30130.780000000013,30130.780000000013]
[null,2580,"High density polyethylene (80)",39272.405000000013,39272.405000000013,39272.405000000013,39272.405000000013,39272.405000000013,39272.405000000013,39272.405000000013]
[null,2580,"Polyamide",183117.58904013495,185137.49585020074,186855.7122046974,188473.18333603011,190058.94017050517,191681.92205705811,193399.80996282568]
[null,2580,"Protected Steel",15632.253373515327,15723.318747030657,15814.384120545987,15836.365417601412,15858.346714656836,15880.328011712261,15902.309308767686]
[null,2581,"Protected Steel",8110.1434755702085,8157.3889511404168,8204.6344267106251,8216.0385070206758,8227.4425873307264,8238.846667640777,8250.2507479508276]
[null,2582,"High density polyethylene (100)",3249.821253477995,3621.4702959655961,3937.610357355069,4235.2139865004965,4526.9824018620084,4825.5999722896613,5141.6796013586654]
[null,2582,"Polyamide",82806.356704078877,83719.76499380164,84496.747899108712,85228.173493786744,85945.257782465822,86679.175358197477,87456.009737943677]
[null,2582,"Protected Steel",18149.970282066824,18255.702564133648,18361.434846200471,18386.956431526945,18412.47801685342,18437.999602179894,18463.521187506369]
[null,2586,"High density polyethylene (100)",1269.5771046974951,1414.7657407863383,1538.2692052886371,1654.5312161403292,1768.5136389029394,1885.1717566592943,2008.6516126353181]
[null,2586,"High density polyethylene (575)",1305.914,1305.914,1305.914,1305.914,1305.914,1305.914,1305.914]
[null,2586,"Polyamide",25313.732837678337,25592.959872148553,25830.48194735196,26054.077246448214,26273.288437813484,26497.645530389596,26735.122201634695]
[null,2590,"High density polyethylene (100)",21939.30788308565,24448.283648710683,26582.522303706977,28591.622847300729,30561.330285310003,32577.275873055743,34711.106553833932]
[null,2590,"High density polyethylene (575)",2198.5850000000005,2198.5850000000005,2198.5850000000005,2198.5850000000005,2198.5850000000005,2198.5850000000005,2198.5850000000005]
[null,2590,"Polyamide",65487.922413465669,66210.297042540915,66824.778807523966,67403.231289942356,67970.341861281107,68550.765142420656,69165.129445039784]
[null,2590,"Protected Steel",5397.5784834781407,5429.0219669562821,5460.4654504344235,5468.0552567912164,5475.6450631480093,5483.2348695048022,5490.8246758615951]
[null,2594,"High density polyethylene (100)",7567.7701291352269,8433.2191193679519,9169.4058590681052,9862.4273144969775,10541.860466715705,11237.243059557941,11973.289072161429]
[null,2594,"Polyamide",108437.21489862254,109633.34832297801,110650.8289323041,111608.65098304223,112547.69269683,113508.7780656972,114526.06417669244]
[null,2594,"Protected Steel",6771.1341037574502,6810.5792075149002,6850.0243112723501,6859.5455432138033,6869.0667751552564,6878.5880070967096,6888.1092390381627]
[null,2663,"High density polyethylene (100)",2259.3508458662382,2517.7298498225628,2737.5177271859993,2944.4186484360475,3147.2627941990163,3354.8686308628598,3574.6144942803835]
[null,2663,"Polyamide",59310.946608322956,59965.185153039391,60521.70754391011,61045.599019403227,61559.218379707927,62084.894763523349,62641.310771358258]
[null,2671,"High density polyethylene (100)",14665.870774571349,16343.057427462823,17769.741828040569,19112.774575586063,20429.474031352722,21777.0825172722,23203.494197434426]
[null,2671,"High density polyethylene (575)",72487.651000000085,72487.651000000085,72487.651000000085,72487.651000000085,72487.651000000085,72487.651000000085,72487.651000000085]
[null,2671,"Polyamide",78.98279828539907,79.854030224236823,80.595136179427939,81.292788418997944,81.976761558026027,82.676790712179923,83.41775499993291]
[null,2680,"High density polyethylene (100)",102123.5904663517,113802.42805521804,123736.93079895931,133088.93780907453,142257.57689330322,151641.44637097791,161574.0500670285]
[null,2680,"High density polyethylene (575)",3450.6350000000002,3450.6350000000002,3450.6350000000002,3450.6350000000002,3450.6350000000002,3450.6350000000002,3450.6350000000002]
[null,2680,"Polyamide",241728.21226069835,244394.63259033364,246662.8001095037,248797.97678482925,250891.28833773432,253033.73960101494,255301.47354455467]
[null,2680,"Protected Steel",34707.392206122713,34909.579412245439,35111.766618368165,35160.570426742619,35209.374235117073,35258.178043491527,35306.981851865981]
[null,2681,"High density polyethylene (100)",9036.4775354261219,10069.887671416722,10948.949115099767,11776.468015210299,12587.76147577817,13418.099748680135,14296.993153796213]
[null,2681,"High density polyethylene (575)",3.899,3.899,3.899,3.899,3.899,3.899,3.899]
[null,2681,"Polyamide",13976.977983231724,14131.153194692604,14262.301012240403,14385.75916014227,14506.796622891734,14630.67539507545,14761.798142826956]
[null,2700,"High density polyethylene (100)",4661.5890053806979,5194.6875837921571,5648.1633042664325,6075.0501073793748,6493.5667983238309,6921.908012976568,7375.2970484861344]
[null,2700,"Polyamide",69029.741177620468,69791.184384865803,70438.899499835243,71048.636741044218,71646.418660455922,72258.233288160307,72905.824587985189]
[null,2701,"High density polyethylene (100)",11797.634597718668,13146.81021689105,14294.474852901963,15374.84777121407,16434.037456771905,17518.091226373428,18665.536478492373]
[null,2701,"High density polyethylene (575)",453.84099999999995,453.84099999999995,453.84099999999995,453.84099999999995,453.84099999999995,453.84099999999995,453.84099999999995]
[null,2701,"Polyamide",30455.470906726539,30791.414676031927,31077.182353894728,31346.194441925098,31609.931920070427,31879.860537453125,32165.573588882908]
[null,2702,"High density polyethylene (100)",1199.7850376323113,1336.9922640143141,1453.7064109986502,1563.5771865102661,1671.2936890193791,1781.538796374062,1898.2306326562909]
[null,2702,"High density polyethylene (575)",9.8309999999999995,9.8309999999999995,9.8309999999999995,9.8309999999999995,9.8309999999999995,9.8309999999999995,9.8309999999999995]
[null,2702,"Polyamide",16187.171623092168,16365.726716399024,16517.613070744508,16660.593780219344,16800.771019154665,16944.238866653708,17096.096186890703]
[null,2703,"High density polyethylene (100)",1930.4661342099275,2151.2339347669676,2339.0281654577411,2515.8113429535392,2689.1282736261724,2866.5137548041562,3054.2720873519311]
[null,2703,"Polyamide",9400.9405701601736,9504.639095125618,9592.8493534627341,9675.887526143546,9757.2975416301415,9840.6186269606533,9928.8120233076224]
[null,2705,"High density polyethylene (100)",31811.551407703824,35449.515375126772,38544.118133405507,41457.273168485372,44313.308999528002,47236.389209781555,50330.400413719501]
[null,2705,"High density polyethylene (575)",134.07300000000001,134.07300000000001,134.07300000000001,134.07300000000001,134.07300000000001,134.07300000000001,134.07300000000001]
[null,2705,"Polyamide",101733.53091908981,102855.71832332911,103810.29738666289,104708.9060359615,105589.89536525453,106491.56559148587,107445.96218054663]
[null,2705,"Protected Steel",8057.028052756853,8103.9641055137054,8150.9001582705578,8162.2295503153155,8173.5589423600732,8184.8883344048309,8196.2177264495876]
[null,2745,"High density polyethylene (100)",4587.4744137893886,5112.0972592756007,5558.3631704379159,5978.4629013675503,6390.325596520508,6811.8566153046113,7258.0372197062479]
[null,2745,"High density polyethylene (575)",4.7669999999999995,4.7669999999999995,4.7669999999999995,4.7669999999999995,4.7669999999999995,4.7669999999999995,4.7669999999999995]
[null,2745,"High density polyethylene (80)",478.56099999999998,478.56099999999998,478.56099999999998,478.56099999999998,478.56099999999998,478.56099999999998,478.56099999999998]
[null,2745,"Polyamide",166912.33494465804,168753.4871999163,170319.6475298575,171793.9782298819,173239.40123530751,174718.75500835257,176284.61595610681]
[null,2745,"Protected Steel",2532.9275176448441,2547.6830352896886,2562.4385529345332,2566.0002296074267,2569.5619062803203,2573.1235829532138,2576.6852596261074]
[null,2747,"High density polyethylene (100)",25172.582453386884,28051.314985438981,30500.084053469567,32805.272957343281,35065.263252231489,37378.30597898928,39826.606948176515]
[null,2747,"High density polyethylene (575)",21356.603000000006,21356.603000000006,21356.603000000006,21356.603000000006,21356.603000000006,21356.603000000006,21356.603000000006]
[null,2747,"High density polyethylene (80)",21534.891,21534.891,21534.891,21534.891,21534.891,21534.891,21534.891]
[null,2747,"Polyamide",118274.96841485954,119579.61869675643,120689.40823758226,121734.12681417074,122758.361244595,123806.63919744563,124916.21659446126]
[null,2747,"Protected Steel",11648.224494456212,11716.080988912425,11783.937483368638,11800.316637202897,11816.695791037157,11833.074944871416,11849.454098705675]
[null,2748,"High density polyethylene (100)",182.45591523886145,203.32154473222243,221.07071299270896,237.77918348967049,254.16004542341668,270.92544200037383,288.67121738676633]
[null,2748,"High density polyethylene (80)",30.866,30.866,30.866,30.866,30.866,30.866,30.866]
[null,2748,"Polyamide",484.40340647429139,489.74669296405636,494.29191365826063,498.57063166671838,502.76545542169504,507.05875110461278,511.60310294900285]
[null,2749,"High density polyethylene (100)",2897.3992498689536,3228.7453679871946,3510.6020934126586,3775.9325422554743,4036.0605683428089,4302.2950031225091,4584.0978497200813]
[null,2749,"High density polyethylene (575)",3188.4870000000005,3188.4870000000005,3188.4870000000005,3188.4870000000005,3188.4870000000005,3188.4870000000005,3188.4870000000005]
[null,2749,"High density polyethylene (80)",31372.698000000015,31372.698000000015,31372.698000000015,31372.698000000015,31372.698000000015,31372.698000000015,31372.698000000015]
[null,2749,"Polyamide",55465.558269572772,56077.379665103792,56597.820272855453,57087.745570335333,57568.064738826964,58059.65922120808,58580.000343201893]
[null,2749,"Protected Steel",3101.012887391385,3119.0777747827697,3137.1426621741543,3141.5031522341437,3145.8636422941331,3150.2241323541225,3154.5846224141119]
[null,2750,"High density polyethylene (100)",6434.3097892502556,7170.1364350032345,7796.0610422706341,8385.2854318512927,8962.956701969757,9554.188590366226,10179.993547892655]
[null,2750,"High density polyethylene (575)",5140.2009999999991,5140.2009999999991,5140.2009999999991,5140.2009999999991,5140.2009999999991,5140.2009999999991,5140.2009999999991]
[null,2750,"High density polyethylene (80)",11463.449999999999,11463.449999999999,11463.449999999999,11463.449999999999,11463.449999999999,11463.449999999999,11463.449999999999]
[null,2750,"Polyamide",86133.844331902816,87083.956987137833,87892.162145268798,88652.979319456383,89398.878897126051,90162.288190043342,90970.338854267698]
[null,2750,"Protected Steel",13946.350178805356,14027.594357610713,14108.838536416069,14128.449200265639,14148.059864115208,14167.670527964778,14187.281191814347]
[null,2753,"High density polyethylene (100)",4753.205773568161,5296.781631041119,5759.1697588325942,6194.4464026710793,6621.1884319309856,7057.9480716578082,7520.2478108173682]
[null,2753,"High density polyethylene (575)",5378.2309999999998,5378.2309999999998,5378.2309999999998,5378.2309999999998,5378.2309999999998,5378.2309999999998,5378.2309999999998]
[null,2753,"Polyamide",33129.640669364584,33495.082280702176,33805.94204417483,34098.574978318466,34385.470160755765,34679.100100928263,34989.900441445272]
[null,2753,"Protected Steel",693.64380786953302,697.68461573906609,701.72542360859916,702.70079102538296,703.67615844216675,704.65152585895055,705.62689327573435]
[null,2756,"High density polyethylene (100)",20226.325961652718,22539.405386758164,24507.006504621826,26359.240071013872,28175.15627505158,30033.700436790474,32000.925434333323]
[null,2756,"High density polyethylene (575)",502.39300000000003,502.39300000000003,502.39300000000003,502.39300000000003,502.39300000000003,502.39300000000003,502.39300000000003]
[null,2756,"High density polyethylene (80)",11459.632999999998,11459.632999999998,11459.632999999998,11459.632999999998,11459.632999999998,11459.632999999998,11459.632999999998]
[null,2756,"Polyamide",102003.06379155171,103128.22431971361,104085.3324453399,104986.32186888547,105869.64529178941,106773.70440361131,107730.62957151716]
[null,2756,"Protected Steel",12688.425162252039,12762.341324504081,12836.257486756123,12854.099319023859,12871.941151291594,12889.782983559329,12907.624815827065]
[null,2759,"High density polyethylene (100)",5801.1939204889059,6464.6175360269026,7028.9531283899732,7560.1996891865747,8081.0299211799311,8614.0864492157743,9178.3141649964855]
[null,2759,"High density polyethylene (575)",36153.762999999955,36153.762999999955,36153.762999999955,36153.762999999955,36153.762999999955,36153.762999999955,36153.762999999955]
[null,2759,"High density polyethylene (80)",65161.632000000063,65161.632000000063,65161.632000000063,65161.632000000063,65161.632000000063,65161.632000000063,65161.632000000063]
[null,2759,"Polyamide",62220.224944080175,62906.554732207886,63490.375263265378,64039.96429051071,64578.77734208505,65130.238829705217,65713.947759501942]
[null,2759,"Protected Steel",7761.0558728533515,7806.267745706702,7851.4796185600526,7862.3928292487926,7873.3060399375327,7884.2192506262727,7895.1324613150127]
[null,2760,"High density polyethylene (100)",7103.4516366260723,7915.8012377875875,8606.8194388891898,9257.3207500786903,9895.0674647318265,10547.785046386345,11238.671154664295]
[null,2760,"High density polyethylene (575)",1106.5430000000001,1106.5430000000001,1106.5430000000001,1106.5430000000001,1106.5430000000001,1106.5430000000001,1106.5430000000001]
[null,2760,"High density polyethylene (80)",3006.4349999999995,3006.4349999999995,3006.4349999999995,3006.4349999999995,3006.4349999999995,3006.4349999999995,3006.4349999999995]
[null,2760,"Polyamide",108957.63448540286,110159.50847828013,111181.87225284388,112144.29115122625,113087.83958073071,114053.53745879039,115075.70580157309]
[null,2760,"Protected Steel",17431.488782731725,17533.035565463459,17634.582348195192,17659.093640578714,17683.604932962236,17708.116225345759,17732.627517729281]
[null,2761,"High density polyethylene (100)",4860.7717564935383,5416.6488426927444,5889.5009048957063,6334.6279449234989,6771.0272303636812,7217.6708267688782,7690.4325000877743]
[null,2761,"High density polyethylene (575)",179.97200000000001,179.97200000000001,179.97200000000001,179.97200000000001,179.97200000000001,179.97200000000001,179.97200000000001]
[null,2761,"High density polyethylene (80)",22451.90700000001,22451.90700000001,22451.90700000001,22451.90700000001,22451.90700000001,22451.90700000001,22451.90700000001]
[null,2761,"Polyamide",145172.07126982705,146773.41419338973,148135.58277795589,149417.88250451715,150675.03975193249,151961.70829829841,153323.61649508559]
[null,2761,"Protected Steel",13755.26501608334,13835.396032166678,13915.527048250016,13934.869017649444,13954.210987048871,13973.552956448299,13992.894925847726]
[null,2762,"High density polyethylene (100)",9702.5351230174056,10812.115498957352,11755.970502102991,12644.483881548309,13515.575882316827,14407.116443916533,15350.791022766132]
[null,2762,"High density polyethylene (575)",14.27,14.27,14.27,14.27,14.27,14.27,14.27]
[null,2762,"Polyamide",71757.487399321428,72549.01943199434,73222.32934751577,73856.160673789593,74477.564257490623,75113.555059270584,75786.736267027445]
[null,2763,"High density polyethylene (100)",1812.4182288449113,2019.6860896899989,2195.996712779568,2361.9696080138274,2524.6882172408623,2691.2265853179492,2867.5035054341279]
[null,2763,"High density polyethylene (575)",3206.7310000000007,3206.7310000000007,3206.7310000000007,3206.7310000000007,3206.7310000000007,3206.7310000000007,3206.7310000000007]
[null,2763,"High density polyethylene (80)",2493.6810000000005,2493.6810000000005,2493.6810000000005,2493.6810000000005,2493.6810000000005,2493.6810000000005,2493.6810000000005]
[null,2763,"Polyamide",133063.0932394219,134530.86621312471,135779.41466869539,136954.75622429783,138107.05246534629,139286.39843220997,140534.7082192612]
[null,2763,"Protected Steel",5719.7201129770528,5753.0402259541033,5786.3603389311538,5794.4031248221663,5802.4459107131788,5810.4886966041913,5818.5314824952038]
[null,2765,"High density polyethylene (100)",37664.412665670119,41971.708917140386,45635.673425828412,49084.806477973463,52746.904479359604,58627.195540754619,62290.459657735235]
[null,2765,"High density polyethylene (575)",26.987000000000002,26.987000000000002,26.987000000000002,26.987000000000002,26.987000000000002,26.987000000000002,26.987000000000002]
[null,2765,"Polyamide",126789.55209316783,128188.12380362242,129377.80679982023,130497.73439028428,131595.70318632224,132719.44639160368,133908.90197181451]
[null,2765,"Protected Steel",15072.057966586424,15159.859933172847,15247.66189975927,15268.855477900821,15290.049056042371,15311.242634183922,15332.436212325472]
[null,2766,"High density polyethylene (80)",45.279000000000003,45.279000000000003,45.279000000000003,45.279000000000003,45.279000000000003,45.279000000000003,45.279000000000003]
[null,2766,"Polyamide",54128.362067906659,54725.433314485315,55233.326834898631,55711.440726033223,56180.180078369878,56659.92291271736,57167.719345833815]
[null,2766,"Protected Steel",5463.4140069788755,5495.2410139577505,5527.0680209366255,5534.7504019315265,5542.4327829264275,5550.1151639213285,5557.7975449162295]
[null,2767,"High density polyethylene (100)",2185.0378582666081,2434.918440761679,2647.4772090051479,2847.5728898812458,3043.745227891859,3244.5226385970523,3457.0407747879285]
[null,2767,"High density polyethylene (575)",3303.5719999999997,3303.5719999999997,3303.5719999999997,3303.5719999999997,3303.5719999999997,3303.5719999999997,3303.5719999999997]
[null,2767,"High density polyethylene (80)",13746.177000000001,13746.177000000001,13746.177000000001,13746.177000000001,13746.177000000001,13746.177000000001,13746.177000000001]
[null,2767,"Polyamide",87841.789913645596,88810.742326054504,89634.97336158219,90410.876758162922,91171.566757623077,91950.113671983054,92774.187150148791]
[null,2767,"Protected Steel",6814.9181669253194,6854.6183338506398,6894.3185007759603,6903.9012996889687,6913.4840986019772,6923.0668975149856,6932.6496964279941]
[null,2768,"High density polyethylene (100)",1886.6525421653801,2102.4098272936494,2285.9419061310455,2458.7128371119315,2628.0961907275332,2801.4557555896431,2984.9527510233229]
[null,2768,"High density polyethylene (575)",517.86,517.86,517.86,517.86,517.86,517.86,517.86]
[null,2768,"Polyamide",150237.69860554583,151894.91871276032,153304.61874299287,154631.66297509597,155932.68740758416,157264.25290488196,158673.68346137676]
[null,2768,"Protected Steel",4032.6802969024752,4056.1725938049503,4079.6648907074255,4085.3354451321607,4091.0059995568959,4096.6765539816315,4102.3471084063667]
[null,2769,"High density polyethylene (100)",8603.1760924247974,9587.0339442005043,10423.944163521906,11211.783317611595,11984.175046195576,12774.698383419656,13611.448621666987]
[null,2769,"High density polyethylene (575)",46.216000000000001,46.216000000000001,46.216000000000001,46.216000000000001,46.216000000000001,46.216000000000001,46.216000000000001]
[null,2769,"Polyamide",87011.323932073545,87971.115761381181,88787.554425685172,89556.122345877273,90309.620698085084,91080.807143947444,91897.089740454176]
[null,2770,"High density polyethylene (100)",26268.758747356333,43845.430023271932,45363.982397311818,46793.496567630507,48194.981776021217,49629.366328582815,51147.628421019937]
[null,2770,"High density polyethylene (575)",13608.240000000003,13608.240000000003,13608.240000000003,13608.240000000003,13608.240000000003,13608.240000000003,13608.240000000003]
[null,2770,"High density polyethylene (80)",21032.227000000006,21032.227000000006,21032.227000000006,21032.227000000006,21032.227000000006,21032.227000000006,21032.227000000006]
[null,2770,"Polyamide",73544.989585138712,74356.238936377602,75046.321219345919,75695.941488658529,76332.824436317198,76984.657974368223,77674.608343419997]
[null,2770,"Protected Steel",70620.655292237949,55302.659287516668,55776.149431274978,55890.440155630429,56004.73087998588,56119.021604341331,56233.312328696782]
[null,2773,"Polyamide",41684.758110065814,42144.568263879126,42535.701816332425,42903.901797628823,43264.882358878938,43634.336804585677,44025.395589203217]
[null,2773,"Protected Steel",6.142784666915948,6.1785693338318959,6.2143540007478437,6.2229916789689348,6.2316293571900259,6.2402670354111169,6.248904713632208]
[null,2774,"Polyamide",74427.039391560378,75248.01832923686,75946.377001222849,76603.788385008753,77248.30968415628,77907.960881157298,78606.186057138751]
[null,2774,"Protected Steel",11666.48688162054,11734.449763241078,11802.412644861617,11818.81747835623,11835.222311850843,11851.627145345456,11868.031978840068]
[null,2776,"Polyamide",34403.741510285799,34783.237287467193,35106.052106233139,35409.939127651516,35707.86773471444,36012.790105053238,36335.543215573496]
[null,2776,"Protected Steel",5102.9481203006362,5132.6752406012729,5162.4023609019096,5169.5778726986155,5176.7533844953214,5183.9288962920273,5191.1044080887332]
[null,2777,"High density polyethylene (100)",7981.4862374530285,8894.2477361363199,9670.6804542088012,10401.588121114544,11118.164637204203,11851.562520573703,12627.846818257338]
[null,2777,"High density polyethylene (575)",244.751,244.751,244.751,244.751,244.751,244.751,244.751]
[null,2777,"High density polyethylene (80)",353.03500000000003,353.03500000000003,353.03500000000003,353.03500000000003,353.03500000000003,353.03500000000003,353.03500000000003]
[null,2777,"Polyamide",103250.06521197094,104388.98098163896,105357.78988514178,106269.79402774756,107163.91620043514,108079.02755867669,109047.6512677759]
[null,2777,"Protected Steel",3810.0000778234098,3832.1951556468193,3854.3902334702288,3859.747666048293,3865.1050986263572,3870.4625312044213,3875.8199637824855]
[null,2778,"High density polyethylene (100)",247.96194440014028,276.31883298625894,300.44037636068879,323.14758663093448,345.40956904309371,368.1941432149938,392.31107559253508]
[null,2778,"Polyamide",16300.506868495908,16480.312123708081,16633.261917525517,16777.243713179807,16918.402409663406,17062.874754061748,17215.795310487014]
[null,2778,"Protected Steel",6986.5630808742108,7027.2631617484212,7067.9632426226317,7077.7874000750271,7087.6115575274225,7097.4357149798179,7107.2598724322133]
[null,2779,"Polyamide",38832.379651734627,39260.726205010884,39625.095516289926,39968.100540421532,40304.380150449448,40648.553799288275,41012.853458898084]
[null,2779,"Protected Steel",3136.0580422268226,3154.3270844536451,3172.5961266804675,3177.0058954938386,3181.4156643072097,3185.8254331205808,3190.2352019339519]
[null,2780,"High density polyethylene (100)",9169.2067454069074,10217.795772773979,11109.769009850766,11949.442638330316,12772.652505447266,13615.186918111325,14506.989648444121]
[null,2780,"High density polyethylene (575)",35.612000000000002,35.612000000000002,35.612000000000002,35.612000000000002,35.612000000000002,35.612000000000002,35.612000000000002]
[null,2780,"Polyamide",157059.56836160694,158792.03815537467,160265.74868424117,161653.05024853162,163013.15052756344,164405.17865493704,165878.60747402415]
[null,2780,"Protected Steel",4766.5222784135058,4794.2895568270114,4822.0568352405171,4828.7592817541217,4835.4617282677264,4842.164174781331,4848.8666212949356]
[null,2782,"High density polyethylene (100)",1791.3141385114773,1996.1685389372883,2170.4261726796926,2334.4664527381724,2495.2903402208522,2659.889508665125,2834.1138318769999]
[null,2782,"High density polyethylene (575)",79.646000000000001,79.646000000000001,79.646000000000001,79.646000000000001,79.646000000000001,79.646000000000001,79.646000000000001]
[null,2782,"Polyamide",76979.086685394199,77828.216374374504,78550.521240828763,79230.474767317661,79897.096217845043,80579.366359062333,81301.533152034302]
[null,2782,"Protected Steel",6722.5420316313575,6761.7040632627159,6800.8660948940742,6810.3189990809542,6819.7719032678342,6829.2248074547142,6838.6777116415942]
[null,2783,"Polyamide",29052.484379911974,29372.952289935911,29645.555561210862,29902.175119300955,30153.763051980801,30411.256917835624,30683.808079143309]
[null,2783,"Protected Steel",2132.382148759642,2144.8042975192839,2157.2264462789258,2160.2248959795288,2163.2233456801318,2166.2217953807349,2169.2202450813379]
[null,2784,"Polyamide",13212.980368922392,13358.728186859216,13482.707314590903,13599.417098820937,13713.838515319661,13830.94593202686,13954.901360306014]
[null,2784,"Protected Steel",1818.5338317838577,1829.1276635677154,1839.7214953515731,1842.2786271614698,1844.8357589713664,1847.3928907812631,1849.9500225911597]
[null,2785,"High density polyethylene (100)",8233.9622611459472,9175.596877806458,9976.590265344752,10730.618521065282,11469.862292860411,12226.459537334995,13027.299809545619]
[null,2785,"Polyamide",57124.692915112377,57754.815651256868,58290.824136989126,58795.404511603985,59290.091410237052,59796.390899882506,60332.296923951282]
[null,2786,"High density polyethylene (100)",3503.0315704430923,3903.6377045699173,4244.4098668985189,4565.2013280470846,4879.7029238427594,5201.5873276626835,5542.2943490773796]
[null,2786,"High density polyethylene (575)",19.696999999999999,19.696999999999999,19.696999999999999,19.696999999999999,19.696999999999999,19.696999999999999,19.696999999999999]
[null,2786,"Polyamide",12890.645219811891,13032.837470169301,13153.792084921466,13267.654694278604,13379.284761413388,13493.535302868198,13614.466796324034]
[null,2787,"High density polyethylene (100)",537.94051470049328,599.45930653858704,651.7897376843905,701.05184687513213,749.34805743284983,798.77800357605554,851.09843140443252]
[null,2787,"Polyamide",29659.804677667635,29986.971727909386,30265.27356519043,30527.257561804647,30784.104750670256,31046.981331794323,31325.229969788496]
[null,2787,"Protected Steel",1026.1528324170586,1032.1306648341172,1038.1084972511758,1039.5514223173623,1040.9943473835488,1042.4372724497352,1043.8801975159217]
[null,2790,"High density polyethylene (100)",289.59774118093185,322.71609287528429,350.88793388875882,377.40795823641389,403.40799560653255,430.0183741866577,458.18482996133378]
[null,2790,"Polyamide",108972.0869024687,110174.12031496156,111196.61969845013,112159.16625451685,113102.8398386788,114068.66580935504,115090.96973513998]
[null,2790,"Protected Steel",4241.3830907757992,4266.0911815515983,4290.7992723273974,4296.7632942387972,4302.7273161501971,4308.691338061597,4314.6553599729968]
[null,2794,"Other",75.080000000000013,75.080000000000013,75.080000000000013,75.080000000000013,75.080000000000013,75.080000000000013,75.080000000000013]
[null,2794,"Polyamide",102202.98197893972,103330.34773550309,104289.33171970163,105192.08701346438,106077.14168257818,106982.97268097101,107941.773348866]
[null,2794,"Protected Steel",8898.3129407302968,8950.1498814605948,9001.9868221908928,9014.4991871947568,9027.0115521986208,9039.5239172024849,9052.0362822063489]
[null,2795,"High density polyethylene (100)",12207.922103754732,13604.018136965191,14791.595219608902,15909.540373827424,17599.457940639088,18727.319618747173,19914.669687963593]
[null,2795,"High density polyethylene (575)",725.42700000000002,725.42700000000002,725.42700000000002,725.42700000000002,725.42700000000002,725.42700000000002,725.42700000000002]
[null,2795,"Polyamide",275147.87583041791,278182.93691372644,280764.68551928079,283195.05689068238,285577.77515863505,288016.42685199267,290597.68193876161]
[null,2795,"Protected Steel",34754.67163145166,34957.13426290331,35159.59689435496,35208.467184705354,35257.337475055749,35306.207765406143,35355.078055756538]
[null,2798,"High density polyethylene (100)",4468.8666668146852,4979.9255491913627,5414.6533917999932,5823.891572757715,6225.1056839778266,6635.7381472805846,7070.3828887087257]
[null,2798,"High density polyethylene (575)",14.206,14.206,14.206,14.206,14.206,14.206,14.206]
[null,2798,"Polyamide",13920.310866531432,14073.861002621183,14204.477105180886,14327.434714462521,14447.981452819706,14571.357981038493,14701.949115442834]
[null,2799,"High density polyethylene (100)",331.3475586561608,369.24041284725678,401.47364334345826,431.81692325739721,461.56525234458906,492.01191239616691,524.23898129137888]
[null,2799,"High density polyethylene (575)",6.4829999999999997,6.4829999999999997,6.4829999999999997,6.4829999999999997,6.4829999999999997,6.4829999999999997,6.4829999999999997]
[null,2799,"Polyamide",37087.8714079817,37496.974894001316,37844.97525563067,38172.571100679954,38493.74366454791,38822.455634935235,39170.389473931282]
[null,2799,"Protected Steel",4769.6092615709913,4797.394523141983,4825.1797847129747,4831.8865719887317,4838.5933592644888,4845.3001465402458,4852.0069338160029]
[null,2800,"High density polyethylene (100)",19379.318672196103,21595.534478181056,23480.739391576681,25255.407940205012,26995.279969696221,28775.994848165657,30660.839391834725]
[null,2800,"High density polyethylene (575)",41.876999999999995,41.876999999999995,41.876999999999995,41.876999999999995,41.876999999999995,41.876999999999995,41.876999999999995]
[null,2800,"Polyamide",349250.42956616048,353102.89029807015,356379.95288414444,359464.86946910998,362489.29906394536,365584.72601898503,368861.16217228287]
[null,2800,"Protected Steel",8264.7119108404895,8312.8578216809838,8361.003732521478,8372.62515927608,8384.246586030682,8395.868012785284,8407.489439539886]
[null,2818,"High density polyethylene (100)",11097.076628404497,12366.136549452242,13445.651455939156,14461.870509212831,15458.164215997396,16477.845547109744,17557.154096988474]
[null,2820,"High density polyethylene (100)",25090.687089607149,27960.05408086209,30400.856432167831,32698.545736657441,34951.183479312233,37256.701055406731,39697.036830761142]
[null,2820,"High density polyethylene (575)",146.053,146.053,146.053,146.053,146.053,146.053,146.053]
[null,2820,"Polyamide",66262.899250010581,66993.82238061419,67615.575854895564,68200.87368006412,68774.695375230745,69361.987321334716,69983.621943215519]
[null,2820,"Protected Steel",119.04449125825599,119.73798251651198,120.43147377476797,120.59886821641597,120.76626265806397,120.93365709971197,121.10105154135996]
[null,2821,"Polyamide",53462.670440136557,54052.398672538453,54554.045921100544,55026.279781835372,55489.25439549279,55963.097166063963,56464.648521346491]
[null,2830,"High density polyethylene (100)",12249.06305072167,13649.86395609423,14841.443197775405,15963.155850009622,17062.874707515242,18188.409056306591,19379.760519520587]
[null,2830,"Polyamide",370231.2951810254,374315.18858720019,377789.11738705507,381059.35720951133,384265.47634720482,387546.8579395659,391020.12267433014]
[null,2830,"Protected Steel",6623.2838048536814,6661.867609707364,6700.4514145610465,6709.7647467671077,6719.0780789731689,6728.3914111792301,6737.7047433852913]
[null,2831,"High density polyethylene (100)",11442.062202322322,12750.57461882082,13863.64945122678,14911.460690898672,15938.727145528017,16990.108298224608,18102.970358814549]
[null,2845,"High density polyethylene (100)",605.78054747690737,675.05751469055417,733.98737099047844,789.46195723176515,843.84883472695333,899.51242394937287,958.4310154069185]
[null,2845,"High density polyethylene (575)",500.36800000000005,500.36800000000005,500.36800000000005,500.36800000000005,500.36800000000005,500.36800000000005,500.36800000000005]
[null,2845,"Polyamide",23897.111592347748,24160.712367670898,24384.942099934378,24596.024434108116,24802.968006434599,25014.769502176299,25238.956371403125]
[null,2870,"High density polyethylene (100)",1560.7870984977731,1739.2784632344972,1891.1106074199388,2034.0402852719712,2174.1674931785678,2317.5841351890872,2469.3872556286783]
[null,2870,"Polyamide",103428.83455741247,104569.72226991887,105540.20858963621,106453.79179549273,107349.46207021034,108266.15787160149,109236.45867626571]
[null,2871,"High density polyethylene (100)",11409.207139220161,12713.962255919563,13823.840973568456,14868.643498221165,15892.960230711898,16941.322417639429,18050.988974431351]
[null,2871,"High density polyethylene (575)",825.13499999999999,825.13499999999999,825.13499999999999,825.13499999999999,825.13499999999999,825.13499999999999,825.13499999999999]
[null,2871,"Polyamide",92436.968354402939,93456.608591365497,94323.956788877054,95140.449232693543,95940.932436379793,96760.206685639278,97627.389083650458]
[null,"Please add new rows as required"]

{"sheet":"S1.1. Customer numbers","index":23,"n_rows":34,"n_cols":9,"rows_kept":34,"cut":false,"hidden":false,"merged":[[28,2,28,8],[7,2,7,8],[8,2,8,8],[17,2,17,8],[18,2,18,8],[27,2,27,8]]}
[null,{"$f":"IF(dms_MultiYear_ResponseFlag=\"Yes\",\"REGULATORY REPORTING STATEMENT - HISTORICAL INFORMATION\",INDEX(dms_Worksheet_List,MATCH(dms_Model,dms_Model_List)))","v":"REGULATORY REPORTING STATEMENT"}]
[null,{"$f":"INDEX(dms_TradingNameFull_List,MATCH(dms_TradingName,dms_TradingName_List))","v":"Jemena Gas Networks (NSW) Ltd"}]
[null,{"$f":"IF(SUM(dms_SingleYear_Model)>0,CONCATENATE(CRY),CONCATENATE(FRCP_y1,\" to \",dms_MultiYear_FinalYear_Result))","v":"2020-21 to 2024-25"}]
[null,"S1. CUSTOMER NUMBERS"]
[]
[null,"S1.1 - CUSTOMER NUMBERS - BY CUSTOMER TYPE "]
[null,"S1.1.1 - RESIDENTIAL"]
[null,null,"VOLUMES"]
[null,null,"0's"]
[null,null,{"$f":"CRCP_y4","v":"2018-19"},{"$f":"CRCP_y5","v":"2019-20"},{"$f":"FRCP_y1","v":"2020-21"},{"$f":"FRCP_y2","v":"2021-22"},{"$f":"FRCP_y3","v":"2022-23"},{"$f":"FRCP_y4","v":"2023-24"},{"$f":"FRCP_y5","v":"2024-25"}]
[null,"Customer numbers as at 1 July",1353889,1366846.5550486608,1396853.5088158862,1419534.068633216,1440478.0705090223,1460831.0340875692,1481644.2782031964]
[null,"Customer numbers as at 30 June",1366846.5550486608,1396853.5088158862,1419534.068633216,1440478.0705090223,1460831.0340875692,1481644.2782031964,1503736.0639846136]
[null,"Total customer connections",16091.785211551569,32821.093864185459,25137.347839775517,23002.326432511618,22464.652524721365,22977.438045551135,24309.705394394023]
[null,"Total customer disconnections",3134.2301628906293,2814.1400969601309,2456.7880224457463,2058.3245567050944,2111.6889461744991,2164.1939299240471,2217.9196129767047]
[]
[]
[null,"S1.1.2 - COMMERCIAL"]
[null,null,"VOLUMES"]
[null,null,"0's"]
[null,null,{"$f":"CRCP_y4","v":"2018-19"},{"$f":"CRCP_y5","v":"2019-20"},{"$f":"FRCP_y1","v":"2020-21"},{"$f":"FRCP_y2","v":"2021-22"},{"$f":"FRCP_y3","v":"2022-23"},{"$f":"FRCP_y4","v":"2023-24"},{"$f":"FRCP_y5","v":"2024-25"}]
[null,"Customer numbers as at 1 July",36022,36534.36235496548,37042.553816299995,37568.608337227291,38090.38050323604,38607.905174902291,39121.216929019094]
[null,"Customer numbers as at 30 June",36534.36235496548,37042.553816299995,37568.608337227291,38090.38050323604,38607.905174902291,39121.216929019094,39630.350060906538]
[null,"Total customer connections",827.60000000000014,827.60000000000082,827.59999999999695,827.59999999999729,827.59999999999934,827.59999999999729,827.59999999999798]
[null,"Total customer disconnections",315.23764503452526,319.40853866548287,301.54547907269927,305.82783399125458,310.07532833374063,314.28824588319787,318.46686811255347]
[]
[]
[null,"S1.1.3 - INDUSTRIAL"]
[null,null,"VOLUMES"]
[null,null,"0's"]
[null,null,{"$f":"CRCP_y4","v":"2018-19"},{"$f":"CRCP_y5","v":"2019-20"},{"$f":"FRCP_y1","v":"2020-21"},{"$f":"FRCP_y2","v":"2021-22"},{"$f":"FRCP_y3","v":"2022-23"},{"$f":"FRCP_y4","v":"2023-24"},{"$f":"FRCP_y5","v":"2024-25"}]
[null,"Customer numbers as at 1 July",386,386,400,414,428,420,412]
[null,"Customer numbers as at 30 June",400,414,428,420,412,404,396]
[null,"Total customer connections",29,29,29,7,7,7,7]
[null,"Total customer disconnections",15,15,15,15,15,15,15]

{"sheet":"S1.2. Customer numbers","index":24,"n_rows":229,"n_cols":9,"rows_kept":229,"cut":false,"hidden":false,"merged":[[120,2,120,8],[175,2,175,8],[176,2,176,8],[7,2,7,8],[8,2,8,8],[63,2,63,8],[64,2,64,8],[119,2,119,8]]}
[null,{"$f":"IF(dms_MultiYear_ResponseFlag=\"Yes\",\"REGULATORY REPORTING STATEMENT - HISTORICAL INFORMATION\",INDEX(dms_Worksheet_List,MATCH(dms_Model,dms_Model_List)))","v":"REGULATORY REPORTING STATEMENT"}]
[null,{"$f":"INDEX(dms_TradingNameFull_List,MATCH(dms_TradingName,dms_TradingName_List))","v":"Jemena Gas Networks (NSW) Ltd"}]
[null,{"$f":"IF(SUM(dms_SingleYear_Model)>0,CONCATENATE(CRY),CONCATENATE(FRCP_y1,\" to \",dms_MultiYear_FinalYear_Result))","v":"2020-21 to 2024-25"}]
[null,"S1. CUSTOMER NUMBERS"]
[]
[null,"S1.2 - CUSTOMER NUMBERS - BY TARIFF"]
[null,"S1.2.1 - CUSTOMER NUMBERS AS AT 1 JULY"]
[null,null,"VOLUMES"]
[null,null,"0's"]
[null,null,{"$f":"CRCP_y4","v":"2018-19"},{"$f":"CRCP_y5","v":"2019-20"},{"$f":"FRCP_y1","v":"2020-21"},{"$f":"FRCP_y2","v":"2021-22"},{"$f":"FRCP_y3","v":"2022-23"},{"$f":"FRCP_y4","v":"2023-24"},{"$f":"FRCP_y5","v":"2024-25"}]
[null,{"$f":"IF(ISBLANK('N1.2. Demand'!B10),\"\",'N1.2. Demand'!B10)","v":"Volume - Individual metered  (VI-Coastal)"},1292572.42285955,{"$f":"C67","v":1304996.4924433152},1333762.3512654435,1355737.1547169851,1376124.4254855032,1395973.4874788022,1416259.9020777789]
[null,{"$f":"IF(ISBLANK('N1.2. Demand'!B11),\"\",'N1.2. Demand'!B11)","v":"Volume - Individual metered  (VI-Country)"},97166.577140449896,{"$f":"C68","v":98069.934960928091},99652.465365573298,100718.7243755322,101651.9751367164,102529.62897028991,103422.14224283642]
[null,{"$f":"IF(ISBLANK('N1.2. Demand'!B12),\"\",'N1.2. Demand'!B12)","v":"Volume - Boundary metered (VB-Coastal)"},172,{"$f":"C69","v":314.4899993830154},481.24600116930611,646.79787792582067,792.0503900389632,935.82281337946017,1083.4508116000441]
[null,{"$f":"IF(ISBLANK('N1.2. Demand'!B13),\"\",'N1.2. Demand'!B13)","v":"Volume - Boundary metered (VB-Country)"},0,{"$f":"C70","v":0},0,0,0,0,0]
[null,{"$f":"IF(ISBLANK('N1.2. Demand'!B14),\"\",'N1.2. Demand'!B14)","v":"Volume - Residential distributed generation technology (VRT3)"},0,{"$f":"C71","v":0},0,0,0,0,0]
[null,{"$f":"IF(ISBLANK('N1.2. Demand'!B15),\"\",'N1.2. Demand'!B15)","v":"Volume - Residential distributed generation technology (VRT4)"},0,{"$f":"C72","v":0},0,0,0,0,0]
[null,{"$f":"IF(ISBLANK('N1.2. Demand'!B16),\"\",'N1.2. Demand'!B16)","v":"Volume - Residential distributed generation technology (VRT6)"},0,{"$f":"C73","v":0},0,0,0,0,0]
[null,{"$f":"IF(ISBLANK('N1.2. Demand'!B17),\"\",'N1.2. Demand'!B17)","v":"Volume - Residential distributed generation technology (VRT10)"},0,{"$f":"C74","v":0},0,0,0,0,0]
[null,{"$f":"IF(ISBLANK('N1.2. Demand'!B18),\"\",'N1.2. Demand'!B18)","v":"Demand - Capacity country (DC Country) - Distance"},0,{"$f":"C75","v":0},0,0,0,0,0]
[null,{"$f":"IF(ISBLANK('N1.2. Demand'!B19),\"\",'N1.2. Demand'!B19)","v":"Demand - Capacity country (DC Country) - Pressure reduction"},42,{"$f":"C76","v":41},41,41,41,41,41]
[null,{"$f":"IF(ISBLANK('N1.2. Demand'!B20),\"\",'N1.2. Demand'!B20)","v":"Demand - Capacity coastal (DC1)"},28,{"$f":"C77","v":27},27,27,27,27,27]
[null,{"$f":"IF(ISBLANK('N1.2. Demand'!B21),\"\",'N1.2. Demand'!B21)","v":"Demand - Capacity coastal (DC2)"},76,{"$f":"C78","v":70},70,70,70,70,70]
[null,{"$f":"IF(ISBLANK('N1.2. Demand'!B22),\"\",'N1.2. Demand'!B22)","v":"Demand - Capacity coastal (DC3)"},101,{"$f":"C79","v":101},101,101,101,101,101]
[null,{"$f":"IF(ISBLANK('N1.2. Demand'!B23),\"\",'N1.2. Demand'!B23)","v":"Demand - Capacity coastal (DC4)"},46,{"$f":"C80","v":46},46,46,46,46,46]
[null,{"$f":"IF(ISBLANK('N1.2. Demand'!B24),\"\",'N1.2. Demand'!B24)","v":"Demand - Capacity coastal (DC5)"},3,{"$f":"C81","v":2},2,2,2,2,2]
[null,{"$f":"IF(ISBLANK('N1.2. Demand'!B25),\"\",'N1.2. Demand'!B25)","v":"Demand - Capacity coastal (DC6)"},26,{"$f":"C82","v":26},26,26,26,26,26]
[null,{"$f":"IF(ISBLANK('N1.2. Demand'!B26),\"\",'N1.2. Demand'!B26)","v":"Demand - Capacity coastal (DC7)"},19,{"$f":"C83","v":18},18,18,18,18,18]
[null,{"$f":"IF(ISBLANK('N1.2. Demand'!B27),\"\",'N1.2. Demand'!B27)","v":"Demand - Capacity coastal (DC8)"},5,{"$f":"C84","v":4},4,4,4,4,4]
[null,{"$f":"IF(ISBLANK('N1.2. Demand'!B28),\"\",'N1.2. Demand'!B28)","v":"Demand - Capacity coastal (DC9)"},3,{"$f":"C85","v":2},2,2,2,2,2]
[null,{"$f":"IF(ISBLANK('N1.2. Demand'!B29),\"\",'N1.2. Demand'!B29)","v":"Demand - Capacity coastal (DC10)"},10,{"$f":"C86","v":11},11,11,11,11,11]
[null,{"$f":"IF(ISBLANK('N1.2. Demand'!B30),\"\",'N1.2. Demand'!B30)","v":"Demand - Capacity coastal (DC11)"},0,{"$f":"C87","v":0},0,0,0,0,0]
[null,{"$f":"IF(ISBLANK('N1.2. Demand'!B31),\"\",'N1.2. Demand'!B31)","v":"Demand - Throughput  (DT)"},17,{"$f":"C88","v":17},17,17,17,17,17]
[null,{"$f":"IF(ISBLANK('N1.2. Demand'!B32),\"\",'N1.2. Demand'!B32)","v":"Demand - Major end-user (throughput) (DMT1)"},1,{"$f":"C89","v":1},1,1,1,1,1]
[null,{"$f":"IF(ISBLANK('N1.2. Demand'!B33),\"\",'N1.2. Demand'!B33)","v":"Demand - Major end-user (throughput) (DMT2)"},1,{"$f":"C90","v":1},1,1,1,1,1]
[null,{"$f":"IF(ISBLANK('N1.2. Demand'!B34),\"\",'N1.2. Demand'!B34)","v":"Demand - Major end-user (throughput) (DMT3)"},0,{"$f":"C91","v":0},0,0,0,0,0]
[null,{"$f":"IF(ISBLANK('N1.2. Demand'!B35),\"\",'N1.2. Demand'!B35)","v":"Demand - Major end-user (throughput) (DMT4)"},0,{"$f":"C92","v":0},0,0,0,0,0]
[null,{"$f":"IF(ISBLANK('N1.2. Demand'!B36),\"\",'N1.2. Demand'!B36)","v":"Demand - Major end-user (throughput) (DMT5)"},0,{"$f":"C93","v":0},0,0,0,0,0]
[null,{"$f":"IF(ISBLANK('N1.2. Demand'!B37),\"\",'N1.2. Demand'!B37)","v":"Demand - First response (DCFR1)"},1,{"$f":"C94","v":1},1,1,1,1,1]
[null,{"$f":"IF(ISBLANK('N1.2. Demand'!B38),\"\",'N1.2. Demand'!B38)","v":"Demand - First response (DCFR6)"},3,{"$f":"C95","v":3},3,3,3,3,3]
[null,{"$f":"IF(ISBLANK('N1.2. Demand'!B39),\"\",'N1.2. Demand'!B39)","v":"Demand - First response (DMTFR3)"},1,{"$f":"C96","v":1},1,1,1,1,1]
[null,{"$f":"IF(ISBLANK('N1.2. Demand'!B40),\"\",'N1.2. Demand'!B40)","v":"Prudent Discount"},4,{"$f":"C97","v":4},4,4,4,4,4]
[null,{"$f":"IF(ISBLANK('N1.2. Demand'!B41),\"\",'N1.2. Demand'!B41)","v":""},null,{"$f":"C98","v":0},0,0,0,0,0]
[null,{"$f":"IF(ISBLANK('N1.2. Demand'!B42),\"\",'N1.2. Demand'!B42)","v":""},null,{"$f":"C99","v":0},0,0,0,0,0]
[null,{"$f":"IF(ISBLANK('N1.2. Demand'!B43),\"\",'N1.2. Demand'!B43)","v":""},null,{"$f":"C100","v":0},0,0,0,0,0]
[null,{"$f":"IF(ISBLANK('N1.2. Demand'!B44),\"\",'N1.2. Demand'!B44)","v":""},null,{"$f":"C101","v":0},0,0,0,0,0]
[null,{"$f":"IF(ISBLANK('N1.2. Demand'!B45),\"\",'N1.2. Demand'!B45)","v":""},null,{"$f":"C102","v":0},0,0,0,0,0]
[null,{"$f":"IF(ISBLANK('N1.2. Demand'!B46),\"\",'N1.2. Demand'!B46)","v":""},null,{"$f":"C103","v":0},0,0,0,0,0]
[null,{"$f":"IF(ISBLANK('N1.2. Demand'!B47),\"\",'N1.2. Demand'!B47)","v":""},null,{"$f":"C104","v":0},0,0,0,0,0]
[null,{"$f":"IF(ISBLANK('N1.2. Demand'!B48),\"\",'N1.2. Demand'!B48)","v":""},null,{"$f":"C105","v":0},0,0,0,0,0]
[null,{"$f":"IF(ISBLANK('N1.2. Demand'!B49),\"\",'N1.2. Demand'!B49)","v":""}]
[null,{"$f":"IF(ISBLANK('N1.2. Demand'!B50),\"\",'N1.2. Demand'!B50)","v":""}]
[null,{"$f":"IF(ISBLANK('N1.2. Demand'!B51),\"\",'N1.2. Demand'!B51)","v":""}]
[null,{"$f":"IF(ISBLANK('N1.2. Demand'!B52),\"\",'N1.2. Demand'!B52)","v":""},null,{"$f":"C109","v":0},0,0,0,0,0]
[null,{"$f":"IF(ISBLANK('N1.2. Demand'!B53),\"\",'N1.2. Demand'!B53)","v":""},null,{"$f":"C110","v":0},0,0,0,0,0]
[null,{"$f":"IF(ISBLANK('N1.2. Demand'!B54),\"\",'N1.2. Demand'!B54)","v":""},null,{"$f":"C111","v":0},0,0,0,0,0]
[null,{"$f":"IF(ISBLANK('N1.2. Demand'!B55),\"\",'N1.2. Demand'!B55)","v":""},null,{"$f":"C112","v":0},0,0,0,0,0]
[null,{"$f":"IF(ISBLANK('N1.2. Demand'!B56),\"\",'N1.2. Demand'!B56)","v":""},null,{"$f":"C113","v":0},0,0,0,0,0]
[null,{"$f":"IF(ISBLANK('N1.2. Demand'!B57),\"\",'N1.2. Demand'!B57)","v":""},null,{"$f":"C114","v":0},0,0,0,0,0]
[null,{"$f":"IF(ISBLANK('N1.2. Demand'!B58),\"\",'N1.2. Demand'!B58)","v":""},null,{"$f":"C115","v":0},0,0,0,0,0]
[null,{"$f":"IF(ISBLANK('N1.2. Demand'!B59),\"\",'N1.2. Demand'!B59)","v":""},null,{"$f":"C116","v":0},{"$f":"D116","v":0},{"$f":"E116","v":0},{"$f":"F116","v":0},{"$f":"G116","v":0},{"$f":"H116","v":0}]
[null,"Total",{"$f":"SUM(C11:C60)","v":1390298},{"$f":"SUM(D11:D60)","v":1403756.9174036263},1434272.0626321861,1457478.6769704432,1478944.4510122584,1499814.9392624714,1521141.4951322156]
[]
[null,"S1.2.2 - CUSTOMER NUMBERS AS AT 30 JUNE"]
[null,null,"VOLUMES"]
[null,null,"0's"]
[null,null,{"$f":"CRCP_y4","v":"2018-19"},{"$f":"CRCP_y5","v":"2019-20"},{"$f":"FRCP_y1","v":"2020-21"},{"$f":"FRCP_y2","v":"2021-22"},{"$f":"FRCP_y3","v":"2022-23"},{"$f":"FRCP_y4","v":"2023-24"},{"$f":"FRCP_y5","v":"2024-25"}]
[null,{"$f":"IF(ISBLANK(B11),\"\",B11)","v":"Volume - Individual metered  (VI-Coastal)"},1304996.4924433152,1333762.3512654435,1355737.1547169851,1376124.4254855032,1395973.4874788022,1416259.9020777789,1437745.2173454596]
[null,"Volume - Individual metered  (VI-Country)",98069.934960928091,99652.465365573298,100718.7243755322,101651.9751367164,102529.62897028991,103422.14224283642,104383.19047364414]
[null,"Volume - Boundary metered (VB-Coastal)",314.4899993830154,481.24600116930611,646.79787792582067,792.0503900389632,935.82281337946017,1083.4508116000441,1238.0062264165263]
[null,"Volume - Boundary metered (VB-Country)",0,0,0,0,0,0,0]
[null,"Volume - Residential distributed generation technology (VRT3)",0,0,0,0,0,0,0]
[null,"Volume - Residential distributed generation technology (VRT4)",0,0,0,0,0,0,0]
[null,"Volume - Residential distributed generation technology (VRT6)",0,0,0,0,0,0,0]
[null,"Volume - Residential distributed generation technology (VRT10)",0,0,0,0,0,0,0]
[null,"Demand - Capacity country (DC Country) - Distance",0,0,0,0,0,0,0]
[null,"Demand - Capacity country (DC Country) - Pressure reduction",41,41,41,41,41,41,41]
[null,"Demand - Capacity coastal (DC1)",27,27,27,27,27,27,27]
[null,"Demand - Capacity coastal (DC2)",70,70,70,70,70,70,70]
[null,"Demand - Capacity coastal (DC3)",101,101,101,101,101,101,101]
[null,"Demand - Capacity coastal (DC4)",46,46,46,46,46,46,46]
[null,"Demand - Capacity coastal (DC5)",2,2,2,2,2,2,2]
[null,"Demand - Capacity coastal (DC6)",26,26,26,26,26,26,26]
[null,"Demand - Capacity coastal (DC7)",18,18,18,18,18,18,18]
[null,"Demand - Capacity coastal (DC8)",4,4,4,4,4,4,4]
[null,"Demand - Capacity coastal (DC9)",2,2,2,2,2,2,2]
[null,"Demand - Capacity coastal (DC10)",11,11,11,11,11,11,11]
[null,"Demand - Capacity coastal (DC11)",0,0,0,0,0,0,0]
[null,"Demand - Throughput  (DT)",17,17,17,17,17,17,17]
[null,"Demand - Major end-user (throughput) (DMT1)",1,1,1,1,1,1,1]
[null,"Demand - Major end-user (throughput) (DMT2)",1,1,1,1,1,1,1]
[null,"Demand - Major end-user (throughput) (DMT3)",0,0,0,0,0,0,0]
[null,"Demand - Major end-user (throughput) (DMT4)",0,0,0,0,0,0,0]
[null,"Demand - Major end-user (throughput) (DMT5)",0,0,0,0,0,0,0]
[null,"Demand - First response (DCFR1)",1,1,1,1,1,1,1]
[null,"Demand - First response (DCFR6)",3,3,3,3,3,3,3]
[null,"Demand - First response (DMTFR3)",1,1,1,1,1,1,1]
[null,"Prudent Discount",4,4,4,4,4,4,4]
[null,"",0,0,0,0,0,0,0]
[null,{"$f":"IF(ISBLANK(B43),\"\",B43)","v":""},0,0,0,0,0,0,0]
[null,"",0,0,0,0,0,0,0]
[null,"",0,0,0,0,0,0,0]
[null,"",0,0,0,0,0,0,0]
[null,"",0,0,0,0,0,0,0]
[null,"",0,0,0,0,0,0,0]
[null,"",0,0,0,0,0,0,0]
[null,"",0,0,0,0,0,0,0]
[null,"",0,0,0,0,0,0,0]
[null,"",0,0,0,0,0,0,0]
[null,"",0,0,0,0,0,0,0]
[null,"",0,0,0,0,0,0,0]
[null,"",0,0,0,0,0,0,0]
[null,"",0,0,0,0,0,0,0]
[null,"",0,0,0,0,0,0,0]
[null,"",0,0,0,0,0,0,0]
[null,"",0,0,0,0,0,0,0]
[null,"",0,0,0,0,0,0,0]
[null,"Total",{"$f":"SUM(C67:C116)","v":1403756.9174036263},{"$f":"SUM(D67:D116)","v":1434272.0626321861},{"$f":"SUM(E67:E116)","v":1457478.6769704432},{"$f":"SUM(F67:F116)","v":1478944.4510122584},{"$f":"SUM(G67:G116)","v":1499814.9392624714},{"$f":"SUM(H67:H116)","v":1521141.4951322156},{"$f":"SUM(I67:I116)","v":1543742.4140455201}]
[]
[null,"S1.2.3 - TOTAL CUSTOMER CONNECTIONS"]
[null,null,"VOLUMES"]
[null,null,"0's"]
[null,null,{"$f":"CRCP_y4","v":"2018-19"},{"$f":"CRCP_y5","v":"2019-20"},{"$f":"FRCP_y1","v":"2020-21"},{"$f":"FRCP_y2","v":"2021-22"},{"$f":"FRCP_y3","v":"2022-23"},{"$f":"FRCP_y4","v":"2023-24"},{"$f":"FRCP_y5","v":"2024-25"}]
[null,{"$f":"IF(ISBLANK(B11),\"\",B11)","v":"Volume - Individual metered  (VI-Coastal)"},15734.179969117185,31292.9328367495,24612.421859686063,22638.993001339513,22158.268101087786,22652.321022926175,23909.183734272781]
[null,"Volume - Individual metered  (VI-Country)",1042.7152430513679,2189.0050256496643,1186.9741033329344,1045.6809190589597,990.21200029308102,1005.0890244043734,1073.5662453047607]
[null,"Volume - Boundary metered (VB-Coastal)",142.48999938301537,166.75600178629071,165.55187675651453,145.2525121131425,143.772423340497,147.62799822058383,154.55541481648223]
[null,"Volume - Boundary metered (VB-Country)",0,0,0,0,0,0,0]
[null,"Volume - Residential distributed generation technology (VRT3)",0,0,0,0,0,0,0]
[null,"Volume - Residential distributed generation technology (VRT4)",0,0,0,0,0,0,0]
[null,"Volume - Residential distributed generation technology (VRT6)",0,0,0,0,0,0,0]
[null,"Volume - Residential distributed generation technology (VRT10)",0,0,0,0,0,0,0]
[null,"Demand - Capacity country (DC Country) - Distance",0,0,0,0,0,0,0]
[null,"Demand - Capacity country (DC Country) - Pressure reduction",0,0,0,0,0,0,0]
[null,"Demand - Capacity coastal (DC1)",0,0,0,0,0,0,0]
[null,"Demand - Capacity coastal (DC2)",0,0,0,0,0,0,0]
[null,"Demand - Capacity coastal (DC3)",0,0,0,0,0,0,0]
[null,"Demand - Capacity coastal (DC4)",0,0,0,0,0,0,0]
[null,"Demand - Capacity coastal (DC5)",0,0,0,0,0,0,0]
[null,"Demand - Capacity coastal (DC6)",0,0,0,0,0,0,0]
[null,"Demand - Capacity coastal (DC7)",0,0,0,0,0,0,0]
[null,"Demand - Capacity coastal (DC8)",0,0,0,0,0,0,0]
[null,"Demand - Capacity coastal (DC9)",0,0,0,0,0,0,0]
[null,"Demand - Capacity coastal (DC10)",1,0,0,0,0,0,0]
[null,"Demand - Capacity coastal (DC11)",0,0,0,0,0,0,0]
[null,"Demand - Throughput  (DT)",0,0,0,0,0,0,0]
[null,"Demand - Major end-user (throughput) (DMT1)",0,0,0,0,0,0,0]
[null,"Demand - Major end-user (throughput) (DMT2)",0,0,0,0,0,0,0]
[null,"Demand - Major end-user (throughput) (DMT3)",0,0,0,0,0,0,0]
[null,"Demand - Major end-user (throughput) (DMT4)",0,0,0,0,0,0,0]
[null,"Demand - Major end-user (throughput) (DMT5)",0,0,0,0,0,0,0]
[null,"Demand - First response (DCFR1)",0,0,0,0,0,0,0]
[null,"Demand - First response (DCFR6)",0,0,0,0,0,0,0]
[null,"Demand - First response (DMTFR3)",0,0,0,0,0,0,0]
[null,"Prudent Discount",0,0,0,0,0,0,0]
[null,"",0,0,0,0,0,0,0]
[null,{"$f":"IF(ISBLANK(B43),\"\",B43)","v":""},0,0,0,0,0,0,0]
[null,"",0,0,0,0,0,0,0]
[null,"",0,0,0,0,0,0,0]
[null,"",0,0,0,0,0,0,0]
[null,"",0,0,0,0,0,0,0]
[null,"",0,0,0,0,0,0,0]
[null,"",0,0,0,0,0,0,0]
[null,"",0,0,0,0,0,0,0]
[null,"",0,0,0,0,0,0,0]
[null,"",0,0,0,0,0,0,0]
[null,"",0,0,0,0,0,0,0]
[null,"",0,0,0,0,0,0,0]
[null,"",0,0,0,0,0,0,0]
[null,"",0,0,0,0,0,0,0]
[null,"",0,0,0,0,0,0,0]
[null,"",0,0,0,0,0,0,0]
[null,"",0,0,0,0,0,0,0]
[null,"",0,0,0,0,0,0,0]
[null,"Total",{"$f":"SUM(C123:C172)","v":16920.385211551569},{"$f":"SUM(D123:D172)","v":33648.693864185458},{"$f":"SUM(E123:E172)","v":25964.947839775512},{"$f":"SUM(F123:F172)","v":23829.926432511616},{"$f":"SUM(G123:G172)","v":23292.252524721367},{"$f":"SUM(H123:H172)","v":23805.038045551133},{"$f":"SUM(I123:I172)","v":25137.305394394025}]
[]
[null,"S1.2.4 - TOTAL CUSTOMER DISCONNECTIONS"]
[null,null,"VOLUMES"]
[null,null,"0's"]
[null,null,{"$f":"CRCP_y4","v":"2018-19"},{"$f":"CRCP_y5","v":"2019-20"},{"$f":"FRCP_y1","v":"2020-21"},{"$f":"FRCP_y2","v":"2021-22"},{"$f":"FRCP_y3","v":"2022-23"},{"$f":"FRCP_y4","v":"2023-24"},{"$f":"FRCP_y5","v":"2024-25"}]
[null,{"$f":"IF(ISBLANK(B11),\"\",B11)","v":"Volume - Individual metered  (VI-Coastal)"},3310.1103853519876,3002.0659296290937,2637.6184081444007,2251.7222328215994,2309.206107788661,2365.9064239493759,2423.8684665922174]
[null,"Volume - Individual metered  (VI-Country)",139.35742257316713,131.48270599652014,120.71509337404476,112.43015787474953,112.55816671957879,112.5757518578688,112.51801449704084]
[null,"Volume - Boundary metered (VB-Coastal)",0,0,0,0,0,0,0]
[null,"Volume - Boundary metered (VB-Country)",0,0,0,0,0,0,0]
[null,"Volume - Residential distributed generation technology (VRT3)",0,0,0,0,0,0,0]
[null,"Volume - Residential distributed generation technology (VRT4)",0,0,0,0,0,0,0]
[null,"Volume - Residential distributed generation technology (VRT6)",0,0,0,0,0,0,0]
[null,"Volume - Residential distributed generation technology (VRT10)",0,0,0,0,0,0,0]
[null,"Demand - Capacity country (DC Country) - Distance",0,0,0,0,0,0,0]
[null,"Demand - Capacity country (DC Country) - Pressure reduction",1,0,0,0,0,0,0]
[null,"Demand - Capacity coastal (DC1)",1,0,0,0,0,0,0]
[null,"Demand - Capacity coastal (DC2)",6,0,0,0,0,0,0]
[null,"Demand - Capacity coastal (DC3)",0,0,0,0,0,0,0]
[null,"Demand - Capacity coastal (DC4)",0,0,0,0,0,0,0]
[null,"Demand - Capacity coastal (DC5)",1,0,0,0,0,0,0]
[null,"Demand - Capacity coastal (DC6)",0,0,0,0,0,0,0]
[null,"Demand - Capacity coastal (DC7)",1,0,0,0,0,0,0]
[null,"Demand - Capacity coastal (DC8)",1,0,0,0,0,0,0]
[null,"Demand - Capacity coastal (DC9)",1,0,0,0,0,0,0]
[null,"Demand - Capacity coastal (DC10)",0,0,0,0,0,0,0]
[null,"Demand - Capacity coastal (DC11)",0,0,0,0,0,0,0]
[null,"Demand - Throughput  (DT)",0,0,0,0,0,0,0]
[null,"Demand - Major end-user (throughput) (DMT1)",0,0,0,0,0,0,0]
[null,"Demand - Major end-user (throughput) (DMT2)",0,0,0,0,0,0,0]
[null,"Demand - Major end-user (throughput) (DMT3)",0,0,0,0,0,0,0]
[null,"Demand - Major end-user (throughput) (DMT4)",0,0,0,0,0,0,0]
[null,"Demand - Major end-user (throughput) (DMT5)",0,0,0,0,0,0,0]
[null,"Demand - First response (DCFR1)",0,0,0,0,0,0,0]
[null,"Demand - First response (DCFR6)",0,0,0,0,0,0,0]
[null,"Demand - First response (DMTFR3)",0,0,0,0,0,0,0]
[null,"Prudent Discount",0,0,0,0,0,0,0]
[null,"",0,0,0,0,0,0,0]
[null,{"$f":"IF(ISBLANK(B43),\"\",B43)","v":""},0,0,0,0,0,0,0]
[null,"",0,0,0,0,0,0,0]
[null,"",0,0,0,0,0,0,0]
[null,"",0,0,0,0,0,0,0]
[null,"",0,0,0,0,0,0,0]
[null,"",0,0,0,0,0,0,0]
[null,"",0,0,0,0,0,0,0]
[null,"",0,0,0,0,0,0,0]
[null,"",0,0,0,0,0,0,0]
[null,"",0,0,0,0,0,0,0]
[null,"",0,0,0,0,0,0,0]
[null,"",0,0,0,0,0,0,0]
[null,"",0,0,0,0,0,0,0]
[null,"",0,0,0,0,0,0,0]
[null,"",0,0,0,0,0,0,0]
[null,"",0,0,0,0,0,0,0]
[null,"",0,0,0,0,0,0,0]
[null,"",0,0,0,0,0,0,0]
[null,"Total",{"$f":"SUM(C179:C228)","v":3461.4678079251548},{"$f":"SUM(D179:D228)","v":3133.5486356256138},{"$f":"SUM(E179:E228)","v":2758.3335015184457},{"$f":"SUM(F179:F228)","v":2364.1523906963489},{"$f":"SUM(G179:G228)","v":2421.7642745082399},{"$f":"SUM(H179:H228)","v":2478.4821758072449},{"$f":"SUM(I179:I228)","v":2536.3864810892583}]

{"sheet":"S11. Network reliability","index":25,"n_rows":321,"n_cols":9,"rows_kept":321,"cut":false,"hidden":false,"merged":[[307,2,307,8],[308,2,308,8],[27,2,27,8],[7,2,7,8],[8,2,8,8],[15,2,15,8],[16,2,16,8],[26,2,26,8],[119,2,119,8],[120,2,120,8],[212,2,212,8],[213,2,213,8]]}
[null,{"$f":"IF(dms_MultiYear_ResponseFlag=\"Yes\",\"REGULATORY REPORTING STATEMENT - HISTORICAL INFORMATION\",INDEX(dms_Worksheet_List,MATCH(dms_Model,dms_Model_List)))","v":"REGULATORY REPORTING STATEMENT"}]
[null,{"$f":"INDEX(dms_TradingNameFull_List,MATCH(dms_TradingName,dms_TradingName_List))","v":"Jemena Gas Networks (NSW) Ltd"}]
[null,{"$f":"IF(SUM(dms_SingleYear_Model)>0,CONCATENATE(CRY),CONCATENATE(FRCP_y1,\" to \",dms_MultiYear_FinalYear_Result))","v":"2020-21 to 2024-25"}]
[null,"S11. NETWORK RELIABILITY"]
[]
[null,"S11.1 - NETWORK OUTAGES"]
[null,"S11.1.1 - PLANNED"]
[null,null,"VOLUMES"]
[null,null,"0's"]
[null,null,{"$f":"CRCP_y4","v":"2018-19"},{"$f":"CRCP_y5","v":"2019-20"},{"$f":"FRCP_y1","v":"2020-21"},{"$f":"FRCP_y2","v":"2021-22"},{"$f":"FRCP_y3","v":"2022-23"},{"$f":"FRCP_y4","v":"2023-24"},{"$f":"FRCP_y5","v":"2024-25"}]
[null,"Count of outage events",41493.75,41493.75,41493.75,41493.75,41493.75,41493.75,41493.75]
[null,"Outages affecting 5+ customers",116.375,116.375,116.375,116.375,116.375,116.375,116.375]
[null,"Outages with >12 hr supply interruption",0.125,0.125,0.125,0.125,0.125,0.125,0.125]
[]
[null,"S11.1.2 - UNPLANNED"]
[null,null,"VOLUMES"]
[null,null,"0's"]
[null,null,{"$f":"PRCP_y1","v":"2010-11"},{"$f":"PRCP_y2","v":"2011-12"},{"$f":"PRCP_y3","v":"2012-13"},{"$f":"PRCP_y4","v":"2013-14"},{"$f":"PRCP_y5","v":"2014-15"},{"$f":"CRCP_y1","v":"2015-16"},{"$f":"CRCP_y2","v":"2016-17"}]
[null,"Count of outage events",3917.375,3917.375,3917.375,3917.375,3917.375,3917.375,3917.375]
[null,"Outages affecting 5+ customers",45.75,45.75,45.75,45.75,45.75,45.75,45.75]
[null,"Outages with >12 hr supply interruption",1785.125,1785.125,1785.125,1785.125,1785.125,1785.125,1785.125]
[]
[]
[]
[null,"S11.2 - LEAKS - BY ASSET TYPE AND CAUSE OF LEAK"]
[null,"S11.2.1 - LOW PRESSURE"]
[null,null,"VOLUMES"]
[null,null,"Number per KM"]
[null,null,{"$f":"CRCP_y4","v":"2018-19"},{"$f":"CRCP_y5","v":"2019-20"},{"$f":"FRCP_y1","v":"2020-21"},{"$f":"FRCP_y2","v":"2021-22"},{"$f":"FRCP_y3","v":"2022-23"},{"$f":"FRCP_y4","v":"2023-24"},{"$f":"FRCP_y5","v":"2024-25"}]
[null,"Cast Iron"]
[null,"Broken pipe - cracked",0,0,0,0,0,0,0]
[null,"Broken pipe - full break",0,0,0,0,0,0,0]
[null,"Corrosion",0,0,0,0,0,0,0]
[null,"Joint leak",0,0,0,0,0,0,0]
[null,"3rd party damage",8.5429576402202088,8.5429576402202088,8.5429576402202088,8.5429576402202088,8.5429576402202088,8.5429576402202088,8.5429576402202088]
[null,"Identified water in main",0,0,0,0,0,0,0]
[null,"Other ",40.84236111111111,40.84236111111111,40.84236111111111,40.84236111111111,40.84236111111111,40.84236111111111,40.84236111111111]
[null,"PVC"]
[null,"Broken pipe - cracked",0,0,0,0,0,0,0]
[null,"Broken pipe - full break",0,0,0,0,0,0,0]
[null,"Corrosion",0,0,0,0,0,0,0]
[null,"Joint leak",0,0,0,0,0,0,0]
[null,"3rd party damage",0,0,0,0,0,0,0]
[null,"Identified water in main",0,0,0,0,0,0,0]
[null,"Other ",0,0,0,0,0,0,0]
[null,"Polyamide"]
[null,"Broken pipe - cracked",0,0,0,0,0,0,0]
[null,"Broken pipe - full break",0,0,0,0,0,0,0]
[null,"Corrosion",0,0,0,0,0,0,0]
[null,"Joint leak",0,0,0,0,0,0,0]
[null,"3rd party damage",101.26424993279744,101.26424993279744,101.26424993279744,101.26424993279744,101.26424993279744,101.26424993279744,101.26424993279744]
[null,"Identified water in main",0,0,0,0,0,0,0]
[null,"Other ",73.919398148148161,73.919398148148161,73.919398148148161,73.919398148148161,73.919398148148161,73.919398148148161,73.919398148148161]
[null,"High density polyethylene (80)"]
[null,"Broken pipe - cracked",0,0,0,0,0,0,0]
[null,"Broken pipe - full break",0,0,0,0,0,0,0]
[null,"Corrosion",0,0,0,0,0,0,0]
[null,"Joint leak",0,0,0,0,0,0,0]
[null,"3rd party damage",6.6506194026064671,6.6506194026064671,6.6506194026064671,6.6506194026064671,6.6506194026064671,6.6506194026064671,6.6506194026064671]
[null,"Identified water in main",0,0,0,0,0,0,0]
[null,"Other ",11.988148148148149,11.988148148148149,11.988148148148149,11.988148148148149,11.988148148148149,11.988148148148149,11.988148148148149]
[null,"High density polyethylene (100)"]
[null,"Broken pipe - cracked",0,0,0,0,0,0,0]
[null,"Broken pipe - full break",0,0,0,0,0,0,0]
[null,"Corrosion",0,0,0,0,0,0,0]
[null,"Joint leak",0,0,0,0,0,0,0]
[null,"3rd party damage",0,0,0,0,0,0,0]
[null,"Identified water in main",0,0,0,0,0,0,0]
[null,"Other ",0,0,0,0,0,0,0]
[null,"High density polyethylene (250)"]
[null,"Broken pipe - cracked",0,0,0,0,0,0,0]
[null,"Broken pipe - full break",0,0,0,0,0,0,0]
[null,"Corrosion",0,0,0,0,0,0,0]
[null,"Joint leak",0,0,0,0,0,0,0]
[null,"3rd party damage",0,0,0,0,0,0,0]
[null,"Identified water in main",0,0,0,0,0,0,0]
[null,"Other ",0,0,0,0,0,0,0]
[null,"High density polyethylene (575)"]
[null,"Broken pipe - cracked",0,0,0,0,0,0,0]
[null,"Broken pipe - full break",0,0,0,0,0,0,0]
[null,"Corrosion",0,0,0,0,0,0,0]
[null,"Joint leak",0,0,0,0,0,0,0]
[null,"3rd party damage",0,0,0,0,0,0,0]
[null,"Identified water in main",0,0,0,0,0,0,0]
[null,"Other ",0,0,0,0,0,0,0]
[null,"Medium density polyethylene"]
[null,"Broken pipe - cracked",0,0,0,0,0,0,0]
[null,"Broken pipe - full break",0,0,0,0,0,0,0]
[null,"Corrosion",0,0,0,0,0,0,0]
[null,"Joint leak",0,0,0,0,0,0,0]
[null,"3rd party damage",0,0,0,0,0,0,0]
[null,"Identified water in main",0,0,0,0,0,0,0]
[null,"Other ",0,0,0,0,0,0,0]
[null,"Other polyethylene"]
[null,"Broken pipe - cracked",0,0,0,0,0,0,0]
[null,"Broken pipe - full break",0,0,0,0,0,0,0]
[null,"Corrosion",0,0,0,0,0,0,0]
[null,"Joint leak",0,0,0,0,0,0,0]
[null,"3rd party damage",0,0,0,0,0,0,0]
[null,"Identified water in main",0,0,0,0,0,0,0]
[null,"Other ",0,0,0,0,0,0,0]
[null,"Unprotected steel"]
[null,"Broken pipe - cracked",0,0,0,0,0,0,0]
[null,"Broken pipe - full break",0,0,0,0,0,0,0]
[null,"Corrosion",0,0,0,0,0,0,0]
[null,"Joint leak",0,0,0,0,0,0,0]
[null,"3rd party damage",11.393553401524805,11.393553401524805,11.393553401524805,11.393553401524805,11.393553401524805,11.393553401524805,11.393553401524805]
[null,"Identified water in main",0,0,0,0,0,0,0]
[null,"Other ",1.9875,1.9875,1.9875,1.9875,1.9875,1.9875,1.9875]
[null,"Protected steel"]
[null,"Broken pipe - cracked",0,0,0,0,0,0,0]
[null,"Broken pipe - full break",0,0,0,0,0,0,0]
[null,"Corrosion",0,0,0,0,0,0,0]
[null,"Joint leak",0,0,0,0,0,0,0]
[null,"3rd party damage",0,0,0,0,0,0,0]
[null,"Identified water in main",0,0,0,0,0,0,0]
[null,"Other ",0,0,0,0,0,0,0]
[]
[null,"S11.2.2 - MEDIUM PRESSURE"]
[null,null,"VOLUMES"]
[null,null,"Number per KM"]
[null,null,{"$f":"CRCP_y4","v":"2018-19"},{"$f":"CRCP_y5","v":"2019-20"},{"$f":"FRCP_y1","v":"2020-21"},{"$f":"FRCP_y2","v":"2021-22"},{"$f":"FRCP_y3","v":"2022-23"},{"$f":"FRCP_y4","v":"2023-24"},{"$f":"FRCP_y5","v":"2024-25"}]
[null,"Cast Iron"]
[null,"Broken pipe - cracked",0,0,0,0,0,0,0]
[null,"Broken pipe - full break",0,0,0,0,0,0,0]
[null,"Corrosion",0,0,0,0,0,0,0]
[null,"Joint leak",0,0,0,0,0,0,0]
[null,"3rd party damage",4.5113795996766353,4.5113795996766353,4.5113795996766353,4.5113795996766353,4.5113795996766353,4.5113795996766353,4.5113795996766353]
[null,"Identified water in main",0,0,0,0,0,0,0]
[null,"Other ",29.111898148148143,29.111898148148143,29.111898148148143,29.111898148148143,29.111898148148143,29.111898148148143,29.111898148148143]
[null,"PVC"]
[null,"Broken pipe - cracked",0,0,0,0,0,0,0]
[null,"Broken pipe - full break",0,0,0,0,0,0,0]
[null,"Corrosion",0,0,0,0,0,0,0]
[null,"Joint leak",0,0,0,0,0,0,0]
[null,"3rd party damage",0,0,0,0,0,0,0]
[null,"Identified water in main",0,0,0,0,0,0,0]
[null,"Other ",0,0,0,0,0,0,0]
[null,"Polyamide"]
[null,"Broken pipe - cracked",0,0,0,0,0,0,0]
[null,"Broken pipe - full break",0,0,0,0,0,0,0]
[null,"Corrosion",0,0,0,0,0,0,0]
[null,"Joint leak",0,0,0,0,0,0,0]
[null,"3rd party damage",1614.0186013469881,1614.0186013469881,1614.0186013469881,1614.0186013469881,1614.0186013469881,1614.0186013469881,1614.0186013469881]
[null,"Identified water in main",0,0,0,0,0,0,0]
[null,"Other ",746.05129629629619,746.05129629629619,746.05129629629619,746.05129629629619,746.05129629629619,746.05129629629619,746.05129629629619]
[null,"High density polyethylene (80)"]
[null,"Broken pipe - cracked",0,0,0,0,0,0,0]
[null,"Broken pipe - full break",0,0,0,0,0,0,0]
[null,"Corrosion",0,0,0,0,0,0,0]
[null,"Joint leak",0,0,0,0,0,0,0]
[null,"3rd party damage",193.64554447644642,193.64554447644642,193.64554447644642,193.64554447644642,193.64554447644642,193.64554447644642,193.64554447644642]
[null,"Identified water in main",0,0,0,0,0,0,0]
[null,"Other ",136.60296296296298,136.60296296296298,136.60296296296298,136.60296296296298,136.60296296296298,136.60296296296298,136.60296296296298]
[null,"High density polyethylene (100)"]
[null,"Broken pipe - cracked",0,0,0,0,0,0,0]
[null,"Broken pipe - full break",0,0,0,0,0,0,0]
[null,"Corrosion",0,0,0,0,0,0,0]
[null,"Joint leak",0,0,0,0,0,0,0]
[null,"3rd party damage",0,0,0,0,0,0,0]
[null,"Identified water in main",0,0,0,0,0,0,0]
[null,"Other ",0,0,0,0,0,0,0]
[null,"High density polyethylene (250)"]
[null,"Broken pipe - cracked",0,0,0,0,0,0,0]
[null,"Broken pipe - full break",0,0,0,0,0,0,0]
[null,"Corrosion",0,0,0,0,0,0,0]
[null,"Joint leak",0,0,0,0,0,0,0]
[null,"3rd party damage",0,0,0,0,0,0,0]
[null,"Identified water in main",0,0,0,0,0,0,0]
[null,"Other ",0,0,0,0,0,0,0]
[null,"High density polyethylene (575)"]
[null,"Broken pipe - cracked",0,0,0,0,0,0,0]
[null,"Broken pipe - full break",0,0,0,0,0,0,0]
[null,"Corrosion",0,0,0,0,0,0,0]
[null,"Joint leak",0,0,0,0,0,0,0]
[null,"3rd party damage",0,0,0,0,0,0,0]
[null,"Identified water in main",0,0,0,0,0,0,0]
[null,"Other ",0,0,0,0,0,0,0]
[null,"Medium density polyethylene"]
[null,"Broken pipe - cracked",0,0,0,0,0,0,0]
[null,"Broken pipe - full break",0,0,0,0,0,0,0]
[null,"Corrosion",0,0,0,0,0,0,0]
[null,"Joint leak",0,0,0,0,0,0,0]
[null,"3rd party damage",0,0,0,0,0,0,0]
[null,"Identified water in main",0,0,0,0,0,0,0]
[null,"Other ",0,0,0,0,0,0,0]
[null,"Other polyethylene"]
[null,"Broken pipe - cracked",0,0,0,0,0,0,0]
[null,"Broken pipe - full break",0,0,0,0,0,0,0]
[null,"Corrosion",0,0,0,0,0,0,0]
[null,"Joint leak",0,0,0,0,0,0,0]
[null,"3rd party damage",0,0,0,0,0,0,0]
[null,"Identified water in main",0,0,0,0,0,0,0]
[null,"Other ",0,0,0,0,0,0,0]
[null,"Unprotected steel"]
[null,"Broken pipe - cracked",0,0,0,0,0,0,0]
[null,"Broken pipe - full break",0,0,0,0,0,0,0]
[null,"Corrosion",0,0,0,0,0,0,0]
[null,"Joint leak",0,0,0,0,0,0,0]
[null,"3rd party damage",125.82875610905549,125.82875610905549,125.82875610905549,125.82875610905549,125.82875610905549,125.82875610905549,125.82875610905549]
[null,"Identified water in main",0,0,0,0,0,0,0]
[null,"Other ",84.23324074074074,84.23324074074074,84.23324074074074,84.23324074074074,84.23324074074074,84.23324074074074,84.23324074074074]
[null,"Protected steel"]
[null,"Broken pipe - cracked",0,0,0,0,0,0,0]
[null,"Broken pipe - full break",0,0,0,0,0,0,0]
[null,"Corrosion",0,0,0,0,0,0,0]
[null,"Joint leak",0,0,0,0,0,0,0]
[null,"3rd party damage",0,0,0,0,0,0,0]
[null,"Identified water in main",0,0,0,0,0,0,0]
[null,"Other ",0,0,0,0,0,0,0]
[]
[null,"S11.2.3 - HIGH PRESSURE"]
[null,null,"VOLUMES"]
[null,null,"Number per KM"]
[null,null,{"$f":"CRCP_y4","v":"2018-19"},{"$f":"CRCP_y5","v":"2019-20"},{"$f":"FRCP_y1","v":"2020-21"},{"$f":"FRCP_y2","v":"2021-22"},{"$f":"FRCP_y3","v":"2022-23"},{"$f":"FRCP_y4","v":"2023-24"},{"$f":"FRCP_y5","v":"2024-25"}]
[null,"Cast Iron"]
[null,"Broken pipe - cracked",0,0,0,0,0,0,0]
[null,"Broken pipe - full break",0,0,0,0,0,0,0]
[null,"Corrosion",0,0,0,0,0,0,0]
[null,"Joint leak",0,0,0,0,0,0,0]
[null,"3rd party damage",0,0,0,0,0,0,0]
[null,"Identified water in main",0,0,0,0,0,0,0]
[null,"Other ",0,0,0,0,0,0,0]
[null,"PVC"]
[null,"Broken pipe - cracked",0,0,0,0,0,0,0]
[null,"Broken pipe - full break",0,0,0,0,0,0,0]
[null,"Corrosion",0,0,0,0,0,0,0]
[null,"Joint leak",0,0,0,0,0,0,0]
[null,"3rd party damage",0,0,0,0,0,0,0]
[null,"Identified water in main",0,0,0,0,0,0,0]
[null,"Other ",0,0,0,0,0,0,0]
[null,"Polyamide"]
[null,"Broken pipe - cracked",0,0,0,0,0,0,0]
[null,"Broken pipe - full break",0,0,0,0,0,0,0]
[null,"Corrosion",0,0,0,0,0,0,0]
[null,"Joint leak",0,0,0,0,0,0,0]
[null,"3rd party damage",0,0,0,0,0,0,0]
[null,"Identified water in main",0,0,0,0,0,0,0]
[null,"Other ",0,0,0,0,0,0,0]
[null,"High density polyethylene (80)"]
[null,"Broken pipe - cracked",0,0,0,0,0,0,0]
[null,"Broken pipe - full break",0,0,0,0,0,0,0]
[null,"Corrosion",0,0,0,0,0,0,0]
[null,"Joint leak",0,0,0,0,0,0,0]
[null,"3rd party damage",0,0,0,0,0,0,0]
[null,"Identified water in main",0,0,0,0,0,0,0]
[null,"Other ",0,0,0,0,0,0,0]
[null,"High density polyethylene (100)"]
[null,"Broken pipe - cracked",0,0,0,0,0,0,0]
[null,"Broken pipe - full break",0,0,0,0,0,0,0]
[null,"Corrosion",0,0,0,0,0,0,0]
[null,"Joint leak",0,0,0,0,0,0,0]
[null,"3rd party damage",0,0,0,0,0,0,0]
[null,"Identified water in main",0,0,0,0,0,0,0]
[null,"Other ",0,0,0,0,0,0,0]
[null,"High density polyethylene (250)"]
[null,"Broken pipe - cracked",0,0,0,0,0,0,0]
[null,"Broken pipe - full break",0,0,0,0,0,0,0]
[null,"Corrosion",0,0,0,0,0,0,0]
[null,"Joint leak",0,0,0,0,0,0,0]
[null,"3rd party damage",0,0,0,0,0,0,0]
[null,"Identified water in main",0,0,0,0,0,0,0]
[null,"Other ",0,0,0,0,0,0,0]
[null,"High density polyethylene (575)"]
[null,"Broken pipe - cracked",0,0,0,0,0,0,0]
[null,"Broken pipe - full break",0,0,0,0,0,0,0]
[null,"Corrosion",0,0,0,0,0,0,0]
[null,"Joint leak",0,0,0,0,0,0,0]
[null,"3rd party damage",0,0,0,0,0,0,0]
[null,"Identified water in main",0,0,0,0,0,0,0]
[null,"Other ",0,0,0,0,0,0,0]
[null,"Medium density polyethylene"]
[null,"Broken pipe - cracked",0,0,0,0,0,0,0]
[null,"Broken pipe - full break",0,0,0,0,0,0,0]
[null,"Corrosion",0,0,0,0,0,0,0]
[null,"Joint leak",0,0,0,0,0,0,0]
[null,"3rd party damage",0,0,0,0,0,0,0]
[null,"Identified water in main",0,0,0,0,0,0,0]
[null,"Other ",0,0,0,0,0,0,0]
[null,"Other polyethylene"]
[null,"Broken pipe - cracked",0,0,0,0,0,0,0]
[null,"Broken pipe - full break",0,0,0,0,0,0,0]
[null,"Corrosion",0,0,0,0,0,0,0]
[null,"Joint leak",0,0,0,0,0,0,0]
[null,"3rd party damage",0,0,0,0,0,0,0]
[null,"Identified water in main",0,0,0,0,0,0,0]
[null,"Other ",0,0,0,0,0,0,0]
[null,"Unprotected steel"]
[null,"Broken pipe - cracked",0,0,0,0,0,0,0]
[null,"Broken pipe - full break",0,0,0,0,0,0,0]
[null,"Corrosion",0,0,0,0,0,0,0]
[null,"Joint leak",0,0,0,0,0,0,0]
[null,"3rd party damage",0,0,0,0,0,0,0]
[null,"Identified water in main",0,0,0,0,0,0,0]
[null,"Other ",0,0,0,0,0,0,0]
[null,"Protected steel"]
[null,"Broken pipe - cracked",0,0,0,0,0,0,0]
[null,"Broken pipe - full break",0,0,0,0,0,0,0]
[null,"Corrosion",0,0,0,0,0,0,0]
[null,"Joint leak",0,0,0,0,0,0,0]
[null,"3rd party damage",0,0,0,0,0,0,0]
[null,"Identified water in main",0,0,0,0,0,0,0]
[null,"Other ",0,0,0,0,0,0,0]
[]
[]
[]
[null,"S11.3 - UNACCOUNTED FOR GAS - TRANSMISSION AND DISTRIBUTION"]
[null,null,"VOLUMES"]
[null,null,"TJ"]
[null,"Place of loss",{"$f":"CRCP_y4","v":"2018-19"},{"$f":"CRCP_y5","v":"2019-20"},{"$f":"FRCP_y1","v":"2020-21"},{"$f":"FRCP_y2","v":"2021-22"},{"$f":"FRCP_y3","v":"2022-23"},{"$f":"FRCP_y4","v":"2023-24"},{"$f":"FRCP_y5","v":"2024-25"}]
[null,"Transmission and distribution",2358.8058535917953,2344.1362295633621,2674.0828332368837,2690.2164257387576,2700.4482475398045,2708.176432998674,2716.4903867080511]
[null,""]
[null,""]
[null,""]
[null,""]
[null,""]
[null,""]
[null,""]
[null,""]
[null,""]
[null,"Total",{"$f":"SUM(C311:C320)","v":2358.8058535917953},2344.1362295633621,2674.0828332368837,2690.2164257387576,2700.4482475398045,2708.176432998674,2716.4903867080511]

{"sheet":"F3. Revenue","index":26,"n_rows":159,"n_cols":9,"rows_kept":159,"cut":false,"hidden":false,"merged":[[63,2,63,8],[64,2,64,8],[144,2,144,8],[145,2,145,8],[7,2,7,8],[8,2,8,8],[115,2,115,8],[116,2,116,8],[131,2,131,8],[132,2,132,8],[88,2,88,8],[89,2,89,8]]}
[null,{"$f":"IF(dms_MultiYear_ResponseFlag=\"Yes\",\"REGULATORY REPORTING STATEMENT - HISTORICAL INFORMATION\",INDEX(dms_Worksheet_List,MATCH(dms_Model,dms_Model_List)))","v":"REGULATORY REPORTING STATEMENT"}]
[null,"Jemena Gas Networks (NSW) Ltd"]
[null,{"$f":"IF(SUM(dms_SingleYear_Model)>0,CONCATENATE(CRY),CONCATENATE(FRCP_y1,\" to \",dms_MultiYear_FinalYear_Result))","v":"2020-21 to 2024-25"}]
[null,"F3. REVENUE"]
[]
[null,"F3.1.1 - REFERENCE SERVICES"]
[null,"F3.1.1 -  REVENUE - BY TARIFF"]
[null,null,"REVENUE"]
[null,null,{"$f":"CONCATENATE(\"$0's, real \",dms_DollarReal)","v":"$0's, real June 2020"}]
[null,"Tariff",{"$f":"CRCP_y4","v":"2018-19"},{"$f":"CRCP_y5","v":"2019-20"},{"$f":"FRCP_y1","v":"2020-21"},{"$f":"FRCP_y2","v":"2021-22"},{"$f":"FRCP_y3","v":"2022-23"},{"$f":"FRCP_y4","v":"2023-24"},{"$f":"FRCP_y5","v":"2024-25"}]
[null,{"$f":"IF(ISBLANK('N1.2. Demand'!B10),\"\",'N1.2. Demand'!B10)","v":"Volume - Individual metered  (VI-Coastal)"},419277276.25131142,424300853.09351951,380883760.18733144,374082907.23841447,366610901.0320484,390523439.86405504,416088216.08508098]
[null,{"$f":"IF(ISBLANK('N1.2. Demand'!B11),\"\",'N1.2. Demand'!B11)","v":"Volume - Individual metered  (VI-Country)"},40344650.136482894,40725883.157707036,36515447.557062872,35794315.806468181,35009037.87047933,37218763.210083716,39574991.375276014]
[null,{"$f":"IF(ISBLANK('N1.2. Demand'!B12),\"\",'N1.2. Demand'!B12)","v":"Volume - Boundary metered (VB-Coastal)"},559756.93503593665,1387365.9858264776,1861166.7215156099,2526181.8720080392,3095817.8126629498,3946203.3897582386,4904827.0796240354]
[null,{"$f":"IF(ISBLANK('N1.2. Demand'!B13),\"\",'N1.2. Demand'!B13)","v":"Volume - Boundary metered (VB-Country)"},0,0,0,0,0,0,0]
[null,{"$f":"IF(ISBLANK('N1.2. Demand'!B14),\"\",'N1.2. Demand'!B14)","v":"Volume - Residential distributed generation technology (VRT3)"},0,0,0,0,0,0,0]
[null,{"$f":"IF(ISBLANK('N1.2. Demand'!B15),\"\",'N1.2. Demand'!B15)","v":"Volume - Residential distributed generation technology (VRT4)"},0,0,0,0,0,0,0]
[null,{"$f":"IF(ISBLANK('N1.2. Demand'!B16),\"\",'N1.2. Demand'!B16)","v":"Volume - Residential distributed generation technology (VRT6)"},0,0,0,0,0,0,0]
[null,{"$f":"IF(ISBLANK('N1.2. Demand'!B17),\"\",'N1.2. Demand'!B17)","v":"Volume - Residential distributed generation technology (VRT10)"},0,0,0,0,0,0,0]
[null,{"$f":"IF(ISBLANK('N1.2. Demand'!B18),\"\",'N1.2. Demand'!B18)","v":"Demand - Capacity country (DC Country) - Distance"},0,3255913.1230000001,2605073.284,2498717.9251537076,2395728.5795807391,2498884.5650831582,2606878.33517987]
[null,{"$f":"IF(ISBLANK('N1.2. Demand'!B19),\"\",'N1.2. Demand'!B19)","v":"Demand - Capacity country (DC Country) - Pressure reduction"},3422898.9570967741,237465.033,179478.867,171703.22775095404,164086.6951310877,170600.61710434718,177321.63680626286]
[null,{"$f":"IF(ISBLANK('N1.2. Demand'!B20),\"\",'N1.2. Demand'!B20)","v":"Demand - Capacity coastal (DC1)"},2962216.4854838713,2875472.835,2377806.3339999998,2281598.8421410969,2187474.3928188058,2282291.3168851044,2380825.7085983404]
[null,{"$f":"IF(ISBLANK('N1.2. Demand'!B21),\"\",'N1.2. Demand'!B21)","v":"Demand - Capacity coastal (DC2)"},6051373.1319354838,5899214.8300000001,4357109.9910000004,4174473.1787497709,3996454.9306457206,4164062.2810026198,4337259.4467968354]
[null,{"$f":"IF(ISBLANK('N1.2. Demand'!B22),\"\",'N1.2. Demand'!B22)","v":"Demand - Capacity coastal (DC3)"},12063312.468709677,11537100.444999998,8803152.8139999993,8443337.5632828716,8096414.6457429631,8443534.1298442539,8803630.6421313938]
[null,{"$f":"IF(ISBLANK('N1.2. Demand'!B23),\"\",'N1.2. Demand'!B23)","v":"Demand - Capacity coastal (DC4)"},5492064.6074193548,5554223.324000001,3849401.548,3706314.7081565531,3569285.3051331542,3735095.6819196306,3909622.634888093]
[null,{"$f":"IF(ISBLANK('N1.2. Demand'!B24),\"\",'N1.2. Demand'!B24)","v":"Demand - Capacity coastal (DC5)"}]
[null,{"$f":"IF(ISBLANK('N1.2. Demand'!B25),\"\",'N1.2. Demand'!B25)","v":"Demand - Capacity coastal (DC6)"},4015311.8132258067,2194796.9899999998,1526663.547,1464998.8949041041,1405166.3485414081,1465863.6879686029,1528957.2904349435]
[null,{"$f":"IF(ISBLANK('N1.2. Demand'!B26),\"\",'N1.2. Demand'!B26)","v":"Demand - Capacity coastal (DC7)"},2478407.6158064515,2497938.9589999998,1799947.99,1725819.7440924393,1655732.0922532009,1725611.5504415305,1799377.3444897663]
[null,{"$f":"IF(ISBLANK('N1.2. Demand'!B27),\"\",'N1.2. Demand'!B27)","v":"Demand - Capacity coastal (DC8)"},581461.79774193547,498102.26300000004,411399.43400000001,394002.60379381175,377637.26545749971,393277.36234827497,409510.56521697075]
[null,{"$f":"IF(ISBLANK('N1.2. Demand'!B28),\"\",'N1.2. Demand'!B28)","v":"Demand - Capacity coastal (DC9)"}]
[null,{"$f":"IF(ISBLANK('N1.2. Demand'!B29),\"\",'N1.2. Demand'!B29)","v":"Demand - Capacity coastal (DC10)"},708727.01645161293,739308.85199999996,512801.01,493803.50905328448,474911.14431001164,497043.26199246029,519002.97829019529]
[null,{"$f":"IF(ISBLANK('N1.2. Demand'!B30),\"\",'N1.2. Demand'!B30)","v":"Demand - Capacity coastal (DC11)"},0,0,0,0,0,0,0]
[null,{"$f":"IF(ISBLANK('N1.2. Demand'!B31),\"\",'N1.2. Demand'!B31)","v":"Demand - Throughput  (DT)"},2325170.776129032,1987260.8438023136,1599703.5667204729,1523955.9747402805,1451313.1775295825,1546711.5540081935,1600987.8269092918]
[null,{"$f":"IF(ISBLANK('N1.2. Demand'!B32),\"\",'N1.2. Demand'!B32)","v":"Demand - Major end-user (throughput) (DMT1)"}]
[null,{"$f":"IF(ISBLANK('N1.2. Demand'!B33),\"\",'N1.2. Demand'!B33)","v":"Demand - Major end-user (throughput) (DMT2)"}]
[null,{"$f":"IF(ISBLANK('N1.2. Demand'!B34),\"\",'N1.2. Demand'!B34)","v":"Demand - Major end-user (throughput) (DMT3)"},0,0,0,0,0,0,0]
[null,{"$f":"IF(ISBLANK('N1.2. Demand'!B35),\"\",'N1.2. Demand'!B35)","v":"Demand - Major end-user (throughput) (DMT4)"},0,0,0,0,0,0,0]
[null,{"$f":"IF(ISBLANK('N1.2. Demand'!B36),\"\",'N1.2. Demand'!B36)","v":"Demand - Major end-user (throughput) (DMT5)"},0,0,0,0,0,0,0]
[null,{"$f":"IF(ISBLANK('N1.2. Demand'!B37),\"\",'N1.2. Demand'!B37)","v":"Demand - First response (DCFR1)"}]
[null,{"$f":"IF(ISBLANK('N1.2. Demand'!B38),\"\",'N1.2. Demand'!B38)","v":"Demand - First response (DCFR6)"}]
[null,{"$f":"IF(ISBLANK('N1.2. Demand'!B39),\"\",'N1.2. Demand'!B39)","v":"Demand - First response (DMTFR3)"}]
[null,{"$f":"IF(ISBLANK('N1.2. Demand'!B40),\"\",'N1.2. Demand'!B40)","v":"Prudent Discount"}]
[null,{"$f":"IF(ISBLANK('N1.2. Demand'!B41),\"\",'N1.2. Demand'!B41)","v":""}]
[null,{"$f":"IF(ISBLANK('N1.2. Demand'!B42),\"\",'N1.2. Demand'!B42)","v":""}]
[null,{"$f":"IF(ISBLANK('N1.2. Demand'!B43),\"\",'N1.2. Demand'!B43)","v":""}]
[null,{"$f":"IF(ISBLANK('N1.2. Demand'!B44),\"\",'N1.2. Demand'!B44)","v":""}]
[null,{"$f":"IF(ISBLANK('N1.2. Demand'!B45),\"\",'N1.2. Demand'!B45)","v":""}]
[null,{"$f":"IF(ISBLANK('N1.2. Demand'!B46),\"\",'N1.2. Demand'!B46)","v":""}]
[null,{"$f":"IF(ISBLANK('N1.2. Demand'!B47),\"\",'N1.2. Demand'!B47)","v":""}]
[null,{"$f":"IF(ISBLANK('N1.2. Demand'!B48),\"\",'N1.2. Demand'!B48)","v":""}]
[null,{"$f":"IF(ISBLANK('N1.2. Demand'!B49),\"\",'N1.2. Demand'!B49)","v":""}]
[null,{"$f":"IF(ISBLANK('N1.2. Demand'!B50),\"\",'N1.2. Demand'!B50)","v":""}]
[null,{"$f":"IF(ISBLANK('N1.2. Demand'!B51),\"\",'N1.2. Demand'!B51)","v":""}]
[null,{"$f":"IF(ISBLANK('N1.2. Demand'!B52),\"\",'N1.2. Demand'!B52)","v":""}]
[null,{"$f":"IF(ISBLANK('N1.2. Demand'!B53),\"\",'N1.2. Demand'!B53)","v":""}]
[null,{"$f":"IF(ISBLANK('N1.2. Demand'!B54),\"\",'N1.2. Demand'!B54)","v":""}]
[null,{"$f":"IF(ISBLANK('N1.2. Demand'!B55),\"\",'N1.2. Demand'!B55)","v":""}]
[null,{"$f":"IF(ISBLANK('N1.2. Demand'!B56),\"\",'N1.2. Demand'!B56)","v":""}]
[null,{"$f":"IF(ISBLANK('N1.2. Demand'!B57),\"\",'N1.2. Demand'!B57)","v":""}]
[null,{"$f":"IF(ISBLANK('N1.2. Demand'!B58),\"\",'N1.2. Demand'!B58)","v":""}]
[null,{"$f":"IF(ISBLANK('N1.2. Demand'!B59),\"\",'N1.2. Demand'!B59)","v":""}]
[null,"Total",{"$f":"SUM(C11:C60)","v":500282627.99283028},503690899.73485535,447282912.85163033,439282131.08870953,430489961.29233479,458611382.47249514,488641408.94972301]
[]
[null,"F3.1.2 - STAND ALONE COST PER UNIT - BY TARIFF CLASS"]
[null,null,"STAND ALONE COST PER UNIT"]
[null,null,{"$f":"CONCATENATE(\"$0's, real \",dms_DollarReal)","v":"$0's, real June 2020"}]
[null,"Tariff Class",{"$f":"CRCP_y4","v":"2018-19"},{"$f":"CRCP_y5","v":"2019-20"},{"$f":"FRCP_y1","v":"2020-21"},{"$f":"FRCP_y2","v":"2021-22"},{"$f":"FRCP_y3","v":"2022-23"},{"$f":"FRCP_y4","v":"2023-24"},{"$f":"FRCP_y5","v":"2024-25"}]
[null,"DC-Country",284065.99759142409,284065.99759142409,284065.99759142409,284065.99759142409,284065.99759142409,284065.99759142409,284065.99759142409]
[null,"VI-Country",310914.83593440615,310914.83593440615,310914.83593440615,310914.83593440615,310914.83593440615,310914.83593440615,310914.83593440615]
[null,"VI-Coastal",1476399.960210284,1476399.960210284,1476399.960210284,1476399.960210284,1476399.960210284,1476399.960210284,1476399.960210284]
[null,"VB Coastal",267870.97361046623,267870.97361046623,267870.97361046623,267870.97361046623,267870.97361046623,267870.97361046623,267870.97361046623]
[null,"VB Country",121930.14625269346,121930.14625269346,121930.14625269346,121930.14625269346,121930.14625269346,121930.14625269346,121930.14625269346]
[null,"DC1",272254.761634061,272254.761634061,272254.761634061,272254.761634061,272254.761634061,272254.761634061,272254.761634061]
[null,"DC2",282119.4520336701,282119.4520336701,282119.4520336701,282119.4520336701,282119.4520336701,282119.4520336701,282119.4520336701]
[null,"DC3",287669.39136387361,287669.39136387361,287669.39136387361,287669.39136387361,287669.39136387361,287669.39136387361,287669.39136387361]
[null,"DC4",275546.17372889339,275546.17372889339,275546.17372889339,275546.17372889339,275546.17372889339,275546.17372889339,275546.17372889339]
[null,"DC5",271108.3297561339,271108.3297561339,271108.3297561339,271108.3297561339,271108.3297561339,271108.3297561339,271108.3297561339]
[null,"DC6",242535.03893617995,242535.03893617995,242535.03893617995,242535.03893617995,242535.03893617995,242535.03893617995,242535.03893617995]
[null,"DC7",243664.54457368332,243664.54457368332,243664.54457368332,243664.54457368332,243664.54457368332,243664.54457368332,243664.54457368332]
[null,"DC8",242203.88774161646,242203.88774161646,242203.88774161646,242203.88774161646,242203.88774161646,242203.88774161646,242203.88774161646]
[null,"DC9",236242.11456549549,236242.11456549549,236242.11456549549,236242.11456549549,236242.11456549549,236242.11456549549,236242.11456549549]
[null,"DC10",238808.31923971444,238808.31923971444,238808.31923971444,238808.31923971444,238808.31923971444,238808.31923971444,238808.31923971444]
[null,"DC11",236035.59700269345,236035.59700269345,236035.59700269345,236035.59700269345,236035.59700269345,236035.59700269345,236035.59700269345]
[null,"DT",122047.57052850602,122047.57052850602,122047.57052850602,122047.57052850602,122047.57052850602,122047.57052850602,122047.57052850602]
[null,""]
[null,""]
[null,""]
[]
[null,"F3.1.3 -  AVOIDABLE COST PER UNIT - BY TARIFF CLASS"]
[null,null,"AVOIDABLE COST PER UNIT"]
[null,null,{"$f":"CONCATENATE(\"$0's, real \",dms_DollarReal)","v":"$0's, real June 2020"}]
[null,"Tariff Class",{"$f":"CRCP_y4","v":"2018-19"},{"$f":"CRCP_y5","v":"2019-20"},{"$f":"FRCP_y1","v":"2020-21"},{"$f":"FRCP_y2","v":"2021-22"},{"$f":"FRCP_y3","v":"2022-23"},{"$f":"FRCP_y4","v":"2023-24"},{"$f":"FRCP_y5","v":"2024-25"}]
[null,{"$f":"IF(ISBLANK(B67),\"\",B67)","v":"DC-Country"},316.619562227453,316.619562227453,316.619562227453,316.619562227453,316.619562227453,316.619562227453,316.619562227453]
[null,{"$f":"IF(ISBLANK(B68),\"\",B68)","v":"VI-Country"},15364.122720619409,15364.122720619409,15364.122720619409,15364.122720619409,15364.122720619409,15364.122720619409,15364.122720619409]
[null,"VI-Coastal",109068.48578707397,109068.48578707397,109068.48578707397,109068.48578707397,109068.48578707397,109068.48578707397,109068.48578707397]
[null,"VB Coastal",182.63448646860238,182.63448646860238,182.63448646860238,182.63448646860238,182.63448646860238,182.63448646860238,182.63448646860238]
[null,"VB Country",0,0,0,0,0,0,0]
[null,"DC1",323.48307218089934,323.48307218089934,323.48307218089934,323.48307218089934,323.48307218089934,323.48307218089934,323.48307218089934]
[null,"DC2",497.33310939837691,497.33310939837691,497.33310939837691,497.33310939837691,497.33310939837691,497.33310939837691,497.33310939837691]
[null,"DC3",817.42946288616747,817.42946288616747,817.42946288616747,817.42946288616747,817.42946288616747,817.42946288616747,817.42946288616747]
[null,"DC4",234.34637231037294,234.34637231037294,234.34637231037294,234.34637231037294,234.34637231037294,234.34637231037294,234.34637231037294]
[null,"DC5",40.069034851234505,40.069034851234505,40.069034851234505,40.069034851234505,40.069034851234505,40.069034851234505,40.069034851234505]
[null,"DC6",447.09205506139352,447.09205506139352,447.09205506139352,447.09205506139352,447.09205506139352,447.09205506139352,447.09205506139352]
[null,"DC7",142.98991536895821,142.98991536895821,142.98991536895821,142.98991536895821,142.98991536895821,142.98991536895821,142.98991536895821]
[null,"DC8",23.046599898634252,23.046599898634252,23.046599898634252,23.046599898634252,23.046599898634252,23.046599898634252,23.046599898634252]
[null,"DC9",147.76513853576125,147.76513853576125,147.76513853576125,147.76513853576125,147.76513853576125,147.76513853576125,147.76513853576125]
[null,"DC10",57.264266134257035,57.264266134257035,57.264266134257035,57.264266134257035,57.264266134257035,57.264266134257035,57.264266134257035]
[null,"DC11",0,0,0,0,0,0,0]
[null,"DT"]
[null,""]
[null,""]
[null,""]
[]
[]
[]
[null,"F3.2 - ANCILLARY REFERENCE SERVICES"]
[null,null,"REVENUE"]
[null,null,"$0's, nominal"]
[null,"Service Name",{"$f":"CRCP_y4","v":"2018-19"},{"$f":"CRCP_y5","v":"2019-20"},{"$f":"FRCP_y1","v":"2020-21"},{"$f":"FRCP_y2","v":"2021-22"},{"$f":"FRCP_y3","v":"2022-23"},{"$f":"FRCP_y4","v":"2023-24"},{"$f":"FRCP_y5","v":"2024-25"}]
[null,"Disconnection & Reconnection – Volume Customer Delivery Points",12848,12848,14892,14490.456717300765,14099.740523500328,14926.137519510266,15800.970300127448]
[null,"Disconnection Wasted Truck Visit (NEW)",3229395.6656787316,3280247.9127116948,3700321.6822937522,3656183.8521928233,3608904.9358881013,3874559.4601941146,4161307.0754733924]
[null,"Abolishment",0,0,109411.69725767009,108106.62291029074,106708.67242880813,114563.58745621804,123042.18633653145]
[null,"Abolishment large",3666784.2798244413,3315017.1996700312,2847580.17457614,2372671.3738409076,2365315.0912654423,2562956.2271564524,2776946.4352096389]
[null,"Special Meter Reads",33225,33225,34035,33117.290785208941,32224.326397887031,34113.019774142624,36112.410969972982]
[null,"Special Meter Read Wasted Truck Vist (NEW",6032044.2409466039,6127028.8868710333,4407290.4115766883,4354719.7833736185,4298407.945541624,4614817.3656653604,4956349.8387500932]
[null,"Out of hours reconnection (NEW)",0,0,359354.75486997189,355068.33318066091,350476.866589932,376275.76318827044,404123.10399955884]
[null,"Out of hours reconnection (NEW)",0,0,327000,318182.873123647,309603.48852972116,327749.59500939149,346959.2592090838]
[null,""]
[null,"Total",{"$f":"SUM(C119:C127)","v":12974297.186449777},12768366.999252759,{"$f":"SUM(E119:E127)","v":11799885.720574223},{"$f":"SUM(F119:F127)","v":11212540.586124457},11085741.067165017,11919961.155963462,12820641.280248398]
[]
[]
[null,"F3.3 - REBATEABLE SERVICES"]
[null,null,"REVENUE"]
[null,null,"$0's, nominal"]
[null,"Service Name",{"$f":"CRCP_y4","v":"2018-19"},{"$f":"CRCP_y5","v":"2019-20"},{"$f":"FRCP_y1","v":"2020-21"},{"$f":"FRCP_y2","v":"2021-22"},{"$f":"FRCP_y3","v":"2022-23"},{"$f":"FRCP_y4","v":"2023-24"},{"$f":"FRCP_y5","v":"2024-25"}]
[null,"None to report"]
[null,""]
[null,""]
[null,""]
[null,""]
[null,""]
[null,"Total",{"$f":"SUM(C135:C140)","v":0},{"$f":"SUM(D135:D140)","v":0},0,0,0,0,0]
[]
[]
[null,"F3.4 - NON-REFERENCE SERVICES"]
[null,null,"REVENUE"]
[null,null,"$0's, nominal"]
[null,"Service Name",{"$f":"CRCP_y4","v":"2018-19"},{"$f":"CRCP_y5","v":"2019-20"},{"$f":"FRCP_y1","v":"2020-21"},{"$f":"FRCP_y2","v":"2021-22"},{"$f":"FRCP_y3","v":"2022-23"},{"$f":"FRCP_y4","v":"2023-24"},{"$f":"FRCP_y5","v":"2024-25"}]
[]
[null,""]
[null,""]
[null,""]
[null,""]
[null,""]
[null,"Total"]
[]
[]
[null,"F3.5 - TOTAL REVENUE"]
[null,null,{"$f":"CRCP_y4","v":"2018-19"},{"$f":"CRCP_y5","v":"2019-20"},{"$f":"FRCP_y1","v":"2020-21"},{"$f":"FRCP_y2","v":"2021-22"},{"$f":"FRCP_y3","v":"2022-23"},{"$f":"FRCP_y4","v":"2023-24"},{"$f":"FRCP_y5","v":"2024-25"}]
[null,"Total",{"$f":"SUM(C154,C141,C128,C61)","v":513256925.17928004},{"$f":"SUM(D154,D141,D128,D61)","v":516459266.73410809},459082798.57220453,450494671.67483401,441575702.35949981,470531343.62845862,501462050.22997141]

{"sheet":"F8. WACC inputs","index":27,"n_rows":65,"n_cols":3,"rows_kept":65,"cut":false,"hidden":false,"merged":[]}
[null,{"$f":"IF(dms_MultiYear_ResponseFlag=\"Yes\",\"REGULATORY REPORTING STATEMENT - HISTORICAL INFORMATION\",INDEX(dms_Worksheet_List,MATCH(dms_Model,dms_Model_List)))","v":"REGULATORY REPORTING STATEMENT"}]
[null,{"$f":"INDEX(dms_TradingNameFull_List,MATCH(dms_TradingName,dms_TradingName_List))","v":"Jemena Gas Networks (NSW) Ltd"}]
[null,{"$f":"IF(SUM(dms_SingleYear_Model)>0,CONCATENATE(CRY),CONCATENATE(FRCP_y1,\" to \",dms_MultiYear_FinalYear_Result))","v":"2020-21 to 2024-25"}]
[null,"F8. WACC AND CAPM PARAMETERS"]
[]
[]
[null,"Business Days means Business Days as defined in the Rate of Return Guideline"]
[]
[null,"F8.1 - RATE OF RETURN ON EQUITY"]
[null,"Equity averaging period - nominated (placeholder)"]
[null,"Start date (inclusive)"]
[null,"End date (inclusive)"]
[null,"Number of Business Days",20]
[]
[]
[null,"Nominated equity averaging period"]
[null,"Start date (inclusive)"]
[null,"End date (inclusive)"]
[null,"Number of Business Days",58]
[]
[]
[null,"Nominal risk free rate",1.9569969049529089E-2]
[null,"Equity term - risk free rate","10 Years"]
[null,"Forecast Inflation rate",2.4248746575396662E-2]
[null,"Market risk premium",6.0999999999999999E-2]
[null,"Equity beta",0.6]
[null,"Equity risk premium",{"$f":"C25*C26","v":3.6600000000000001E-2}]
[]
[]
[null,"F8.2 - RATE OF RETURN ON DEBT - Transition - 'trailing average' approach"]
[null,"Debt averaging period - Year 1 nominated (placeholder)"]
[null,"Start date (inclusive)","N/A"]
[null,"End date (inclusive)","N/A"]
[null,"Number of Business Days",0]
[]
[]
[null,"Year 1 nominated debt averaging period"]
[null,"Start date (inclusive)"]
[null,"End date (inclusive)"]
[null,"Number of Business Days",10]
[]
[null,"Year 2 nominated debt averaging period"]
[null,"Start date (inclusive)"]
[null,"End date (inclusive)"]
[null,"Number of Business Days",10]
[]
[null,"Year 3 nominated debt averaging period"]
[null,"Start date (inclusive)"]
[null,"End date (inclusive)"]
[null,"Number of Business Days",10]
[]
[null,"Year 4 nominated debt averaging period"]
[null,"Start date (inclusive)"]
[null,"End date (inclusive)"]
[null,"Number of Business Days",10]
[]
[null,"Year 5 nominated debt averaging period"]
[null,"Start date (inclusive)"]
[null,"End date (inclusive)"]
[null,"Number of Business Days",10]
[]
[]
[null,"Credit rating","BBB+"]
[]
[null,"Debt term","10 Years"]