{"text_format":"1","workbook":"xlsx","n_sheets":28,"sheets":["AER CF","AER NRs","AER lookups","AER ETL","Instructions","Contents","Business & other details","2.11 Labour","4.1 Public lighting","3.6 Quality of services","3.6.8 Network-feeders (2011-12)","3.6.8 Network-feeders (2012-13)","3.6.8 Network-feeders (2013-14)","3.6.8 Network-feeders (2014-15)","3.6.8 Network-feeders (2015-16)","3.6.8 Network-feeders (2016-17)","3.6.8 Network-feeders (2017-18)","3.6.9 Network-reliability","6.2 STPIS Reliability","6.6 STPIS Customer Service","6.9 STPIS - GSL","7.8 Avoided TUOS Payments","7.10 Juris Scheme","7.11 DMIA-DMIAM","8.1 Income","8.2 Capex","8.4 Opex","9.5 TUoS"],"not_rendered":{"charts":0,"images":7,"macros":1,"external_links":0,"defined_names":650,"comments":1,"pivot_tables":0},"unopened":[],"bounds":{"document_bytes":16777216,"sheet_cells":100000,"rows_first":2000,"rows_last":500,"rows_between":2000,"halvings":0,"cell_chars":16384,"cell_head_chars":4096},"cells_cut":0,"cells_raw":0,"read":"whole","date_system":"1900"}

{"sheet":"AER CF","index":0,"n_rows":129,"n_cols":24,"rows_kept":129,"cut":false,"hidden":true,"merged":[[34,37,34,58],[34,68,34,89],[3,1,3,21],[32,37,32,58],[32,68,32,89],[33,37,33,58],[33,68,33,89]]}
[null,"AER CONDITIONAL FORMATTING"]
[]
[]
[null,"CONDITIONAL FORMATTING MAP"]
[null,null,null,null,null,"=INDEX(dms_CF_3.6.1, MATCH(dms_TradingName,dms_CF_TradingName))=\"Y\"","=INDEX(dms_CF_3.6.5, MATCH(dms_TradingName,dms_CF_TradingName))=\"Y\"","=INDEX(dms_CF_3.6.6, MATCH(dms_TradingName,dms_CF_TradingName))=\"Y\"","=INDEX(dms_CF_3.6.7.1, MATCH(dms_TradingName,dms_CF_TradingName))=\"Y\"","=INDEX(dms_CF_3.6.7.2, MATCH(dms_TradingName,dms_CF_TradingName))=\"Y\"","=INDEX(dms_CF_3.6.7.3, MATCH(dms_TradingName,dms_CF_TradingName))=\"Y\"","=INDEX(dms_CF_3.6.7.4, MATCH(dms_TradingName,dms_CF_TradingName))=\"Y\"","=INDEX(dms_CF_3.6.8, MATCH(dms_TradingName,dms_CF_TradingName))=\"Y\"","=INDEX(dms_CF_4.1, MATCH(dms_TradingName,dms_CF_TradingName))=\"Y\"","=INDEX(dms_CF_6.6.1, MATCH(dms_TradingName,dms_CF_TradingName))=\"Y\"","=INDEX(dms_CF_6.8, MATCH(dms_TradingName,dms_CF_TradingName))=\"Y\"","=INDEX(dms_CF_7.12, MATCH(dms_TradingName,dms_CF_TradingName))=\"Y\"","=INDEX(dms_CF_8.1_A, MATCH(dms_TradingName,dms_CF_TradingName))=\"Y\"","=INDEX(dms_CF_8.1_B, MATCH(dms_TradingName,dms_CF_TradingName))=\"Y\"","=INDEX(dms_CF_8.1_Neg, MATCH(dms_TradingName,dms_CF_TradingName))=\"Y\"","=INDEX(dms_CF_4.4.1_Neg, MATCH(dms_TradingName,dms_CF_TradingName))=\"Y\""]
[null,"dms_CF_TradingName","JurisdictionList","Sector","Segment","dms_CF_3.6.1","dms_CF_3.6.5","dms_CF_3.6.6","dms_CF_3.6.7.1","dms_CF_3.6.7.2","dms_CF_3.6.7.3","dms_CF_3.6.7.4","dms_CF_3.6.8","dms_CF_4.1","dms_CF_6.6.1","dms_CF_6.8","dms_CF_7.12","dms_CF_8.1_A","dms_CF_8.1_B","dms_CF_8.1_Neg","dms_CF_4.4.1","dms_CF_MAIFI_flag","Spare1","Spare2"]
[null,"ActewAGL Distribution","ACT","Electricity","Distribution",null,"Y",null,"Y","Y","N","Y","N","Y","N","Y","Y","N","Y","Y","N","N","N","N"]
[null,"Ausgrid","NSW","Electricity","Distribution",null,"Y",null,"N","N","N","Y","N","N","N","Y","Y","N","Y","Y","N","N","N","N"]
[null,"AusNet (D)","Vic","Electricity","Distribution",null,"N",null,"N","N","N","N","N","N","N","Y","N","N","N","Y","N","N","N","N"]
[null,"AusNet (T)","Vic","Electricity","Transmission",null,"N",null,"N","N","N","N","N","Y","N","Y","N","N","N","Y","N","N","N","N"]
[null,"Australian Distribution Co. (Vic)","Vic","Electricity","Distribution",null,"N",null,"N","N","N","N","N","N","N","Y","N","N","N","Y","N","N","N","N"]
[null,"CitiPower","Vic","Electricity","Distribution",null,"N",null,"N","N","N","N","N","N","N","Y","N","N","N","Y","N","N","N","N"]
[null,"Directlink","Qld","Electricity","Transmission",null,"N",null,"N","N","N","N","N","N","N","Y","N","N","Y","Y","N","N","N","N"]
[null,"ElectraNet","SA","Electricity","Transmission",null,"N",null,"N","N","N","N","N","Y","N","Y","N","N","Y","Y","N","N","N","N"]
[null,"Endeavour Energy","NSW","Electricity","Distribution",null,"Y",null,"N","N","N","Y","N","N","N","Y","Y","N","Y","Y","Y","N","N","N"]
[null,"Energex","Qld","Electricity","Distribution",null,"Y",null,"N","N","N","N","N","N","N","Y","Y","N","Y","Y","Y","N","N","N"]
[null,"Ergon Energy","Qld","Electricity","Distribution",null,"Y",null,"N","N","N","N","N","N","N","Y","Y","N","Y","Y","N","N","N","N"]
[null,"Essential Energy","NSW","Electricity","Distribution",null,"Y",null,"N","N","N","Y","N","N","N","Y","Y","N","Y","Y","N","N","N","N"]
[null,"Jemena Electricity","Vic","Electricity","Distribution",null,"N",null,"N","N","N","N","N","N","N","Y","N","N","N","Y","N","N","N","N"]
[null,"Murraylink","SA","Electricity","Transmission",null,"N",null,"N","N","N","N","N","Y","N","Y","N","N","Y","Y","N","N","N","N"]
[null,"Power and Water","NT","Electricity","Distribution",null,"N",null,"N","Y","N","N","Y","Y","Y","Y","Y","N","Y","Y","N","N","N","N"]
[null,"Powercor Australia","Vic","Electricity","Distribution",null,"N",null,"N","N","N","N","N","N","N","Y","N","N","N","Y","N","N","N","N"]
[null,"Powerlink","Qld","Electricity","Transmission",null,"N",null,"N","N","N","N","N","Y","N","Y","N","N","Y","Y","N","N","N","N"]
[null,"SA Power Networks","SA","Electricity","Distribution",null,"Y",null,"N","N","N","N","N","Y","N","Y","Y","Y","Y","N","N","N","N","N"]
[null,"TasNetworks (D)","Tas","Electricity","Distribution",null,"Y",null,"N","N","N","N","N","N","N","Y","Y","N","Y","Y","N","N","N","N"]
[null,"TasNetworks (T)","Tas","Electricity","Transmission",null,"N",null,"N","N","N","N","N","Y","N","Y","N","N","Y","Y","N","N","N","N"]
[null,"TransGrid","NSW","Electricity","Transmission",null,"N",null,"N","N","N","N","N","Y","N","Y","N","N","Y","Y","N","N","N","N"]
[null,"United Energy","Vic","Electricity","Distribution",null,"N",null,"N","N","N","N","N","N","N","Y","N","N","N","Y","N","N","N","N"]
[]
[]
[null,"Confidential"]
[null,"Amended"]
[]
[null,"Worksheet 6.2 STPIS reliability"]
[null,"Formula",null,null,null,"Applied to:"]
[]
[null,"=INDEX(dms_CBD_flag,MATCH(dms_TradingName,dms_TradingName_List))=\"NO\"",null,null,null,"$D$11,$D$17,$D$23,$D$33,$D$39,$D$45,$D$55,$D$61,$D$67,$D$77,$D$83,$D$89"]
[null,"=INDEX(dms_Urban_flag,MATCH(dms_TradingName,dms_TradingName_List))=\"NO\"",null,null,null,"$D$12,$D$18,$D$24,$D$56,$D$62,$D$78,$D$68,$D$84"]
[null,"=INDEX(dms_ShortRural_flag,MATCH(dms_TradingName,dms_TradingName_List))=\"NO\"",null,null,null,"$D$13,$D$19,$D$25,$D$57,$D$63,$D$69,$D$79,$D$85"]
[null,"=INDEX(dms_LongRural_flag,MATCH(dms_TradingName,dms_TradingName_List))=\"NO\"",null,null,null,"$D$14,$D$20,$D$26,$D$58,$D$64,$D$65,$D$70,$D$71,$D$80,$D$86"]
[null,"=INDEX(dms_FeederType_5_flag,MATCH(dms_TradingName,dms_TradingName_List))=\"NO\"",null,null,null,"$D$87,$D$81,$D$71,$D$65,$D$59,$D$49,$D$43,$D$37,$D$21,$D$15"]
[null,"=dms_MAIFI_Flag=\"No\"",null,null,null,"$D$55:$D$72"]
[]
[]
[null,"Business & other details"]
[null,"=(INDEX(dms_Model_Span,MATCH(dms_Model,dms_Model_List))>1)"]
[null,"=(INDEX(dms_Model_Span,MATCH(dms_Model,dms_Model_List))=1)"]
[]
[]
[null,"STYLES IN USE","dms_H"]
[null,"HEADING ONE","dms_1"]
[null,"HEADING TWO","dms_2"]
[null,"HEADING THREE","dms_3"]
[null,"HEADING FOUR","dms_4"]
[null,"HEADING FIVE","dms_5"]
[null,null,"dms_NUM"]
[null,null,"dms_NUM%"]
[null,5.5555000000000003,"dms_NUM3d"]
[null,null,"dms_Row_Locked"]
[null,null,"dms_Row1"]
[null,null,"dms_Row2"]
[null,null,"dms_T1"]
[null,null,"dms_T2"]
[null,null,"dms_BH"]
[null,null,"dms_BY1"]
[null,null,"dms_BY2"]
[null,null,"dms_GH"]
[null,null,"dms_GY1"]
[null,null,"dms_GY2"]
[]
[]
[]
[]
[]
[]
[]
[]
[]
[]
[]
[]
[]
[]
[]
[]
[]
[]
[]
[]
[]
[]
[]
[]
[]
[]
[]
[]
[]
[]
[]
[]
[]
[]
[]
[]
[]
[]
[]
[]
[]
[]
[]
[]
[]
[]
[]
[]
[]
[]
[]
[]
[]
[]
[]
[]
[]
[]
[null,null,"0"]
[null,null,{"$f":"IFERROR(IF(dms_Model=\"ARR\",(MAX(0,dms_0608_LastRow-dms_0608_OffsetRows)),\"not an ARR\"),\"0\")","v":0}]

{"sheet":"AER NRs","index":1,"n_rows":226,"n_cols":15,"rows_kept":226,"cut":false,"hidden":true,"merged":[[189,1,190,1],[193,1,194,1],[197,1,198,1],[206,1,211,1],[116,1,130,1],[133,1,148,1],[150,1,156,1],[158,1,172,1],[174,1,175,1],[177,1,182,1],[108,1,113,1],[4,1,26,1],[30,1,53,1],[30,11,30,12],[31,11,33,11],[34,11,38,11],[42,11,43,11],[63,1,76,1],[82,1,95,1],[98,1,105,1],[31,37,31,58],[31,68,31,89],[32,37,32,58],[32,68,32,89],[33,37,33,58],[33,68,33,89]]}
[null,"AER NAMED RANGES"]
[]
[null,"DROP DOWN SELECTORS USED IN WORKBOOKS"]
[]
[null,"COVER SHEET","dms_DataQuality_List","dms_Confid_status_List"]
[null,null,"-- select --","-- select --"]
[null,null,"Actual","Public"]
[null,null,"Estimate","Confidential"]
[null,null,"Consolidated"]
[]
[]
[null,null,"For all files either AER or business needs to be able to specify the type of submission","For PTRM & RFM templates we must provide a choice in case they change their form of control - otherwise it is drawn from the business specific lookup table above."]
[null,null,"dms_SourceList","dms_FormControl_Choices"]
[null,null,"-- select --","Revenue cap"]
[null,null,"After appeal","Revenue yield"]
[null,null,"Draft decision","Weighted average price cap"]
[null,null,"Final decision"]
[null,null,"PTRM update 1"]
[null,null,"PTRM update 2"]
[null,null,"PTRM update 3"]
[null,null,"PTRM update 4"]
[null,null,"PTRM update 5"]
[null,null,"PTRM update 6"]
[null,null,"PTRM update 7"]
[null,null,"Regulatory proposal"]
[null,null,"Reporting"]
[null,null,"Revised regulatory proposal"]
[]
[]
[null,null,null,null,null,null,null,null,null,null,null,"This is used to create an image to insert on 6.3 STPIS sheet - not for dropdown lists."]
[null,"CA & RESET RINS \nDNSP","dms_DNSP_020301_SubstationType","dms_DNSP_020301_ProjectType","dms_DNSP_020301_ProjectTrigger","dms_DNSP_020302_ProjectType","dms_DNSP_020302_ProjectTrigger","dms_STPIS_Exclusion_List","dms_Reason_Interruption","dms_Reason_Interruption_Detailed",null,"Reason for interruption"]
[null,null,"Subtransmission substation","New substation establishment","Demand growth","New line on new route - single circuit","Demand growth","Weather","Animal","Animal impact",null,"Animal","Animal impact"]
[null,null,"Zone substation","Substation upgrade - capacity"," Voltage issues","New line on new route - dual circuit"," Voltage issues","Equipment failure","Asset failure","Animal nesting/burrowing, etc and other",null,null,"Animal nesting/burrowing, etc and other"]
[null,null,"Switching station","Substation upgrade - voltage"," Reactive power issue","New line on new route - other"," Reactive power issue","Operational error","Other","Other",null,null,"Other"]
[null,null,"Other","Other"," Fault level issues","Line rebuild over existing route - single circuit"," Fault level issues","Vegetation","Overloads","LV",null,"Asset failure","LV"]
[null,null,null,null," Safety","Line rebuild over existing route - dual circuit"," Net market benefit","Animals","Planned","Distribution substation",null,null,"Distribution substation"]
[null,null,null,null," Environment","Reconductor - Single circuit"," Safety","Third party impacts","Network business","HV",null,null,"HV"]
[null,null,null,null," Other","Reconductor - Dual circuit"," Environment","Transmission failure","Third party","Zone substation",null,null,"Zone substation"]
[null,null,null,null,null,"Reconductor - Other"," Other","Load shedding","Unknown","Subtransmission",null,null,"Subtransmission"]
[null,null,null,null,null,"Line upgrade - raising/retensoring",null,"Inter-distributor connection failure","Vegetation","insert description of 'other'",null,"Other","insert description of 'other'"]
[null,null,null,null,null,"Line upgrade - voltage upgrade",null,"Other","Weather","Network error",null,"Overloads"]
[null,null,null,null,null,"Line upgrade - capacity",null,null,"2 - STPIS Exclusion (3.3)(a)","Switching and protection error",null,"Planned"]
[null,null,null,null,null,"String spare circuit",null,null,"3 - STPIS Exclusion (3.3)(a)","Fire",null,"Network business","Network error"]
[null,null,null,null,null,"Other",null,null,"4 - STPIS Exclusion (3.3)(a)","Other",null,null,"Switching and protection error"]
[null,null,null,null,null,null,null,null,"5 - STPIS Exclusion (3.3)(a)","Dig-in",null,"Third party","Fire"]
[null,null,null,null,null,null,null,null,"6 - STPIS Exclusion (3.3)(a)","Unauthorised access",null,null,"Other"]
[null,null,null,null,null,null,null,null,"7 - STPIS Exclusion (3.3)(a)","Vehicle impact",null,null,"Dig-in"]
[null,null,null,null,null,null,null,null,null,"Unknown",null,null,"Unauthorised access"]
[null,null,null,null,null,null,null,null,null,"Blow-in/Fall-in - NSP responsibility",null,null,"Vehicle impact"]
[null,null,null,null,null,null,null,null,null,"Grow-in - NSP responsibility",null,"Unknown","Unknown"]
[null,null,null,null,null,null,null,null,null,"Blow-in/Fall-in - Other responsible party",null,"Vegetation","Blow-in/Fall-in - NSP responsibility"]
[null,null,null,null,null,null,null,null,null,"Grow-in - Other responsible party",null,null,"Grow-in - NSP responsibility"]
[null,null,null,null,null,null,null,null,null,null,null,null,"Blow-in/Fall-in - Other responsible party"]
[null,null,null,null,null,null,null,null,null,null,null,null,"Grow-in - Other responsible party"]
[null,null,null,null,null,null,null,null,null,null,null,"Weather"]
[null,null,null,null,null,null,null,null,null,null,null,"2 - STPIS Exclusion (3.3)(a)"]
[null,null,null,null,null,null,null,null,null,null,null,"3 - STPIS Exclusion (3.3)(a)"]
[null,null,null,null,null,null,null,null,null,null,null,"4 - STPIS Exclusion (3.3)(a)"]
[null,null,null,null,null,null,null,null,null,null,null,"5 - STPIS Exclusion (3.3)(a)"]
[null,null,null,null,null,null,null,null,null,null,null,"6 - STPIS Exclusion (3.3)(a)"]
[null,null,null,null,null,null,null,null,null,null,null,"7 - STPIS Exclusion (3.3)(a)"]
[]
[]
[null,"CA & RESET RINS \nTNSP ","dms_TNSP_0203_SubstationType","dms_TNSP_020301_ProjectType","dms_TNSP_020301_ProjectTrigger","dms_TNSP_020302_ProjectType","dms_TNSP_0203_ProjectTrigger"]
[null,null,"Terminal station","New substation establishment","Demand growth","New line on new route - single circuit","Demand growth"]
[null,null,"Switching station","Capacity upgrade"," Voltage issues","New line on new route - dual circuit"," Voltage issues"]
[null,null,"Transmission substation","Voltage upgrade"," Reactive power issue","New line on new route - other"," Reactive power issue"]
[null,null,"Other","Other"," Fault level issues","Line rebuild over existing route - single circuit"," Fault level issues"]
[null,null,null,null,"Net market benefit","Line rebuild over existing route - dual circuit"," Net market benefit"]
[null,null,null,null," Safety","Reconductor - Single circuit"," Safety"]
[null,null,null,null," Environment","Reconductor - Dual circuit"," Environment"]
[null,null,null,null," Other","Reconductor - Other"," Other"]
[null,null,null,null,null,"Line upgrade - raising/retensoring"]
[null,null,null,null,null,"Line upgrade - voltage upgrade"]
[null,null,null,null,null,"Line upgrade - capacity"]
[null,null,null,null,null,"String spare circuit"]
[null,null,null,null,null,"Other"]
[]
[]
[]
[null,"NAMED RANGES USED IN ETL PROCESS"]
[]
[null,"CA & RESET RINS \nDNSP ONLY","dms_020303_01_UOM","dms_020501_01_UOM","dms_020501_02_UOM","dms_020501_03_UOM","dms_020501_04_UOM","dms_020701_01_UOM","dms_020701_02_UOM","dms_020701_01_Rows","dms_040102_01_UOM","dms_040102_04_UOM"]
[null,null,"Circuit line length in km","0's","0's","0's","0's","km","km","Route line length within zone","0's","days"]
[null,null,"Circuit line length in km","0's","0's","0's","0's","0's","0's","Number of maintenance spans","0's","0's"]
[null,null,"Circuit line length in km","MVA added","MVA added","MVA added","MVA added","km","km","Total length of maintenance spans","0's","$0s"]
[null,null,"Circuit line length in km","0's","0's","0's","0's","km","km","Length of vegetation corridors","$0s","0's"]
[null,null,"Number","total spend $0s","total spend $0s","total spend $0s","total spend $0s","0's","0's","Average number of trees per maintenance span"]
[null,null,"Number","net circuit km added","net circuit km added","net circuit km added","net circuit km added","years","years","Average frequency of cutting cycle"]
[null,null,"Number","total spend $0s","total spend $0s","total spend $0s","total spend $0s"]
[null,null,null,"net circuit km added","net circuit km added","net circuit km added","net circuit km added"]
[null,null,null,"total spend $0s","total spend $0s","total spend $0s","total spend $0s"]
[null,null,null,"0's",null,"$0s"]
[null,null,null,"0's"]
[null,null,null,"0's"]
[null,null,null,"$0s"]
[]
[]
[null,"CA & RESET RINS \nTNSP ONLY","dms_020701_01_UOM"]
[null,null,"km"]
[null,null,"0's"]
[null,null,"km"]
[null,null,"0's"]
[null,null,"km"]
[null,null,"metres"]
[null,null,"years"]
[]
[]
[null,"CA & RESET RINS \nDNSP & TNSP","dms_020603_01_UOM"]
[null,null,"0's"]
[null,null,"0's"]
[null,null,"0's"]
[null,null,"0's"]
[null,null,"(per cent)"]
[]
[]
[null,"EB & RESET RINS \nDNSP ONLY","dms_030601_01_UOM","dms_030601_02_UOM","dms_030701_01_UOM","dms_030702_01_UOM","dms_030703_01_UOM"]
[null,null,"minutes/customer","minutes/customer","Customer / km","%","km"]
[null,null,"minutes/customer","minutes/customer","MWh/customer","Number of spans"]
[null,null,"interruptions/customer","interruptions/customer","kVA / customer","Number of spans"]
[null,null,"interruptions/customer","interruptions/customer",null,"Number of spans"]
[null,null,null,null,null,"Number of spans"]
[null,null,null,null,null,"Years"]
[null,null,null,null,null,"Years"]
[null,null,null,null,null,"Trees"]
[null,null,null,null,null,"Trees"]
[null,null,null,null,null,"Defects"]
[null,null,null,null,null,"Defects"]
[null,null,null,null,null,"Spans"]
[null,null,null,null,null,"km"]
[null,null,null,null,null,"Spans"]
[]
[null,null,"WHEN INSERTING COVER SHEET INTO A TNSP FILE - APPLY THESE NAMED RANGES"]
[null,"EB & RESET RINS \nTNSP ONLY","dms_030601_01_UOM",null,"dms_030701_01_UOM","dms_030702_01_UOM"]
[null,null,"%",null,"Number of spans","km"]
[null,null,"number",null,"Years","%"]
[null,null,"number",null,"Trees","km"]
[null,null,"%",null,"Defects","number"]
[null,null,"number",null,"Number of spans"]
[null,null,"number",null,"km"]
[null,null,"%",null,"km"]
[null,null,"number",null,"Number of spans"]
[null,null,"number"]
[null,null,"%"]
[null,null,"number"]
[null,null,"%"]
[null,null,"number"]
[null,null,"%"]
[null,null,"number"]
[]
[null,"EB & RESET RINS \nDNSP & TNSP","dms_EB_RAB_PIT"]
[null,null,"Beginning of year"]
[null,null,"End of year"]
[null,null,"End of year"]
[null,null,"End of year"]
[null,null,"End of year"]
[null,null,"End of year"]
[]
[null,"ARR \nDNSP ONLY","dms_030605_UOM","dms_03060703_UOM","Spare","Spare"]
[null,null,"number","number"]
[null,null,"number","number"]
[null,null,"number","number"]
[null,null,"number","number"]
[null,null,"number","(per cent)"]
[null,null,"number"]
[null,null,"number"]
[null,null,"number"]
[null,null,"number"]
[null,null,"number"]
[null,null,"number"]
[null,null,"number"]
[null,null,"(per cent)"]
[null,null,"(per cent)",""]
[]
[null,"RFM","dms_Beg","dms_Mid","dms_End"]
[null,null,"Beginning of year","Mid year","End of Year"]
[]
[null,"PTRM","dms_PTRM_RAB_PIT","dms_PTRM_TAB_PIT","DMS_Xfactor"]
[null,null,"Beginning of year","Beginning of year","x factors"]
[null,null,"End of year","End of year"]
[null,null,"End of year","End of year"]
[null,null,"End of year","End of year"]
[null,null,"End of year"]
[]
[]
[null,"STPIS & MIC NAMED RANGES "]
[]
[null,"These \"row descriptions\" are the column headings in the various templates but become row descriptions in the ETL process"]
[]
[null,"Table 6.3 sustained interruptions - row descriptions","dms_060301_CustNo_Affected_Row","dms_060301_Avg_Duration_Sustained_Int_Row","dms_060301_Effect_unplanned_SAIDI_Row","dms_060301_Effect_unplanned_SAIFI_Row"]
[null,null,"Number of customers affected by the interruption","Average duration of sustained customer interruption","Effect on unplanned SAIDI","Effect on unplanned SAIFI"]
[]
[]
[null,"Table 6.1 telephone answering - row descriptions and start date","dms_060101_Rows","dms_060102_Rows","dms_060101_StartDateTxt"]
[null,null,"Total number of calls \n(after removing excluded events)","Number of calls answered within 30 seconds \n(after excluding excluded events) ",{"$f":"dms_060701_StartDateTxt","v":"1-Jul-2011"}]
[]
[]
[null,"Table 6.8.1 - row descriptions","dms_060801_01_Rows","dms_060801_02_Rows","dms_060801_03_Rows","dms_060801_04_Rows"]
[null,null,"Number of interruptions","Duration of interruptions","Total unplanned minutes off supply","Effect on unplanned MAIFI"]
[]
[]
[null,"Table 7.9.4 - market impact component - row descriptions","dms_070904_01_Rows","without exclusions","with exclusions"]
[]
[]
[null,"These headings (Lists) are determined from the INDEX/MATCH function on the NSP selected on the Business & other details sheet"]
[]
[null,"Table 6.7.1 - daily performance data - unplanned - MAIFI  -- row descriptions and header named range values","dms_060701_Feeder_Header_Lvl4",{"$f":"INDEX(dms_FeederName_1,MATCH(dms_TradingName,dms_TradingName_List))","v":"CBD"},{"$f":"INDEX(dms_FeederName_1,MATCH(dms_TradingName,dms_TradingName_List))","v":"CBD"},{"$f":"INDEX(dms_FeederName_2,MATCH(dms_TradingName,dms_TradingName_List))","v":"Urban"},{"$f":"INDEX(dms_FeederName_2,MATCH(dms_TradingName,dms_TradingName_List))","v":"Urban"},{"$f":"INDEX(dms_FeederName_3,MATCH(dms_TradingName,dms_TradingName_List))","v":"Short rural"},{"$f":"INDEX(dms_FeederName_3,MATCH(dms_TradingName,dms_TradingName_List))","v":"Short rural"},{"$f":"INDEX(dms_FeederName_4,MATCH(dms_TradingName,dms_TradingName_List))","v":"Long rural"},{"$f":"INDEX(dms_FeederName_4,MATCH(dms_TradingName,dms_TradingName_List))","v":"Long rural"},{"$f":"IF((INDEX(dms_FeederName_5,MATCH(dms_TradingName,dms_TradingName_List))=0),\"Network\",(INDEX(dms_FeederName_5,MATCH(dms_TradingName,dms_TradingName_List))))","v":"Network"},{"$f":"IF((INDEX(dms_FeederName_5,MATCH(dms_TradingName,dms_TradingName_List))=0),\"Network\",(INDEX(dms_FeederName_5,MATCH(dms_TradingName,dms_TradingName_List))))","v":"Network"},"Network","Network"]
[]
[null,null,"dms_060701_Rows","All events","After removing excluded events","All events","After removing excluded events","All events","After removing excluded events","All events","After removing excluded events","All events","After removing excluded events","All events","After removing excluded events"]
[null,null,null,"the number of column headings changes from 10 to 12 depending on the number of feeder categories for the NSP"]
[]
[null,null,"dms_0603_FeederList",{"$f":"INDEX(dms_FeederName_1,MATCH(dms_TradingName,dms_TradingName_List))","v":"CBD"},{"$f":"INDEX(dms_FeederName_2,MATCH(dms_TradingName,dms_TradingName_List))","v":"Urban"},{"$f":"INDEX(dms_FeederName_3,MATCH(dms_TradingName,dms_TradingName_List))","v":"Short rural"},{"$f":"INDEX(dms_FeederName_4,MATCH(dms_TradingName,dms_TradingName_List))","v":"Long rural"}]
[]
[]
[null,"Use these to add to specific worksheets in existing files","Use these to add to specific worksheets in existing files"]
[]
[]
[null,"ARRs 6.7 STPIS daily performance","dms_060101_Values","dms_060102_Values","dms_060701_Values"]
[null,null,"dms_LeapYear"]
[]
[]
[null,"ARR's  6.8 STPIS exclusions","dms_060801_Event_Date","dms_060801_OutageID","dms_060801_FeederID","dms_060801_FeederClass","dms_060801_CauseID","dms_060801_01_Values","dms_060801_02_Values","dms_060801_03_Values","dms_060801_Excl_Cat","dms_060801_04_Values"]
[null,null,"dms_060801_StartCell"]
[]
[]
[null,"CA 6.3 sustained interruptions","dms_060301_Event_Date","dms_060301_Event_Time","dms_060301_AssetID","dms_060301_FeederClass","dms_060301_Reason","dms_060301_DetailedReason","dms_060301_CustNo_Affected_Values","dms_060301_Avg_Duration_Sustained_Int_Values","dms_060301_Effect_unplanned_SAIDI_Values","dms_060301_Effect_unplanned_SAIFI_Values","dms_060301_MED"]

{"sheet":"AER lookups","index":2,"n_rows":88,"n_cols":38,"rows_kept":88,"cut":false,"hidden":true,"merged":[[22,1,22,4],[6,25,6,36],[8,25,8,28],[8,31,8,35]]}
[null,"AER LOOKUP TABLES"]
[]
[null,"Data in these columns used for data validation and database purposes."]
[null,"Date last modified:","2017-01-16","added (Albury and Victora) for AGN"]
[null,null,"2016-10-17","updated TransGrid's correct legal name, corrected TasNetworks (T) to June financial year"]
[null,null,"2017-02-01","inserted Power and Water, added NRs (dms_FeederCat_1 and dms_FeederCat_2)"]
[null,null,"2017-03-03","inserted AEMO as a business",null,null,null,null,null,null,null,null,null,null,null,null,null,null,null,null,null,null,null,null,null,"FOR ELECTRICITY BUSINESSES ONLY"]
[null,null,"2018-03-28","major changes to accommodate STPIS"]
[null,null,"Template Version",5,null,null,null,null,null,null,null,null,null,null,null,null,null,null,null,null,null,null,null,null,null,"Feeder Types",null,null,null,"TasNetworks (D)","MAIFI flag","Feeder Names"]
[]
[null,null,null,null,null,null,null,null,null,null,null,null,null,null,null,null,null,null,null,null,null,null,null,null,null,"CBD","Urban","Short rural","long rural","EXTRA"]
[null,"dms_TradingName_List","dms_TradingNameFull_List","dms_ABN_List","dms_JurisdictionList","dms_Sector_List","dms_Segment_List","dms_FormControl_List","dms_RPT_List","dms_RPTMonth_List","dms_CRCPlength_List","dms_FRCPlength_List","dms_PRCPlength_List","dms_663_List","dms_DeterminationRef_List","dms_Addr1_List","dms_Addr2_List","dms_Suburb_List","dms_State_List","dms_PostCode_List","dms_PAddr1_List","dms_PAddr2_List","dms_PSuburb_List","dms_PState_List","dms_PPostCode_List","dms_CBD_flag","dms_Urban_flag","dms_ShortRural_flag","dms_LongRural_flag","dms_FeederType_5_flag","dms_MAIFI_flag_List","dms_FeederName_1","dms_FeederName_2","dms_FeederName_3","dms_FeederName_4","dms_FeederName_5","dms_Public_Lighting_List","Column1"]
[null,"AusNet (D)","AusNet Electricity Services Pty Ltd",91064651118,"Vic","Electricity","Distribution","Revenue cap","Financial","June",5,5,5,2,"2016-20 Distribution Determination","Level 32","2 Southbank Boulevard","SOUTHBANK","Vic",3006,"Locked Bag 14051",null,"MELBOURNE CITY MAIL CENTRE","Vic",8001,"NO","YES","YES","YES","NO","YES","CBD","Urban","Short rural","Long rural",null,"YES","AusNet (D)"]
[null,"Australian Distribution Co. (Vic)","Australian Distribution Co. (Victoria)",11222333444,"Vic","Electricity","Distribution","Revenue cap","Financial","June",5,5,5,2,"distribution determination","123 Straight Street",null,"MELBOURNE","Vic",3000,"PO Box 123",null,"MELBOURNE","Vic",3000,"NO","NO","NO","NO","NO","YES","CBD","Urban","Short rural","Long rural",null,"YES","Australian Distribution Co. (Vic)"]
[null,"CitiPower","CitiPower",76064651056,"Vic","Electricity","Distribution","Revenue cap","Financial","June",5,5,5,2,"2016-20 Distribution Determination","40 Market Street",null,"MELBOURNE","Vic",3000,"Locked Bag 14090",null,"MELBOURNE","Vic",8001,"YES","YES","NO","NO","NO","YES","CBD","Urban","Short rural","Long rural",null,"YES","CitiPower"]
[null,"Jemena Electricity","Jemena Electricity",82064651083,"Vic","Electricity","Distribution","Revenue cap","Financial","June",5,5,5,2,"2016-20 Distribution Determination","Level 16","567 Collins Street","MELBOURNE","Vic",3000,"PO Box 16182",null,"MELBOURNE","Vic",8001,"NO","YES","YES","NO","NO","YES","CBD","Urban","Short rural","Long rural",null,"YES","Jemena Electricity"]
[null,"Powercor Australia","Powercor Australia",89064651109,"Vic","Electricity","Distribution","Revenue cap","Financial","June",5,5,5,2,"2016-20 Distribution Determination","40 Market Street",null,"MELBOURNE","Vic",3000,"Locked bag 14090",null,"MELBOURNE","Vic",8001,"NO","NO","YES","YES","NO","YES","CBD","Urban","Short rural","Long rural",null,"YES","Powercor Australia"]
[null,"United Energy","United Energy",70064651029,"Vic","Electricity","Distribution","Revenue cap","Financial","June",5,5,5,2,"2016-20 Distribution Determination","43-45 Centreway",null,"MOUNT WAVERLEY","Vic",3149,"PO Box 449",null,"MOUNT WAVERLEY","Vic",3170,"NO","NO","YES","NO","NO","YES","CBD","Urban","Short rural","Long rural",null,"YES","United Energy"]
[]
[]
[]
[]
[null,"The Reg Year Ending (dms_RYE) must be set to the last year of the regulatory period. For forecast data is is usually (FRCP_y5) for actual it is a single year (CRY). For historical actual data the RYE will need to be set manually in the business details sheet by setting the dms_Multiyear_flag to 1 and putting the correct value in 'dms_Specified_FinalYear. See cells C67:C68"]
[null,"dms_Model_List ","dms_Model_Name_Format1","dms_Worksheet_List","dms_Model_Span_List"]
[null,"ARR","Annual Reporting","HISTORICAL ANNUAL REPORTING - FINANCIAL YEARS",1]
[null,"CA","Category Analysis",{"$f":"IF(dms_MultiYear_ResponseFlag=\"yes\",\"HISTORICAL CATEGORY ANALYSIS\",\"CATEGORY ANALYSIS\")","v":"HISTORICAL CATEGORY ANALYSIS"},1]
[null,"CESS","Capitlal Expenditure","CAPITLAL EXPENDITURE SHARING SCHEMING",5]
[null,"CPI","CPI","CPI",5]
[null,"EB","Economic Benchmarking",{"$f":"IF(dms_MultiYear_ResponseFlag=\"yes\",\"NEW HISTORICAL ECONOMIC BENCHMARKING\",\"ECONOMIC BENCHMARKING\")","v":"NEW HISTORICAL ECONOMIC BENCHMARKING"},1]
[null,"Pricing","Pricing Proposal","PRICING PROPOSAL",5]
[null,"PTRM","Post Tax Revenue Model","POST TAX REVENUE MODEL",5]
[null,"Reset","Regulatory Reporting (Reset)","REGULATORY REPORTING STATEMENT",5]
[null,"RFM","Roll Forward Model","ROLL FORWARD MODEL",5]
[null,"WACC","Weighted Average Cost of Capital","WEIGHTED AVERAGE COST OF CAPITAL",1]
[]
[]
[]
[null,"Financial","Calendar",null,"PREVIOUS",null,"CURRENT",null,"FORTHCOMING"]
[null,"1987-88","1988","PRCP_y1",{"$f":"INDEX(INDIRECT(dms_RPT),dms_PRCP_start_row)","v":"2009-10"},"CRCP_y1",{"$f":"INDEX(INDIRECT(dms_RPT),dms_CRCP_start_row)","v":"2014-15"},{"$f":"FRCP_y1","v":"2019-20"},{"$f":"INDEX(INDIRECT(dms_RPT),dms_FRCP_start_row)","v":"2019-20"}]
[null,"1988-89","1989","PRCP_y2",{"$f":"INDEX(INDIRECT(dms_RPT),dms_PRCP_start_row+1)","v":"2010-11"},"CRCP_y2",{"$f":"INDEX(INDIRECT(dms_RPT),dms_CRCP_start_row+1)","v":"2015-16"},"FRCP_y2",{"$f":"INDEX(INDIRECT(dms_RPT),dms_FRCP_start_row+1)","v":"2020-21"}]
[null,"1989-90","1990","PRCP_y3",{"$f":"INDEX(INDIRECT(dms_RPT),dms_PRCP_start_row+2)","v":"2011-12"},"CRCP_y3",{"$f":"INDEX(INDIRECT(dms_RPT),dms_CRCP_start_row+2)","v":"2016-17"},"FRCP_y3",{"$f":"INDEX(INDIRECT(dms_RPT),dms_FRCP_start_row+2)","v":"2021-22"}]
[null,"1990-91","1991","PRCP_y4",{"$f":"INDEX(INDIRECT(dms_RPT),dms_PRCP_start_row+3)","v":"2012-13"},"CRCP_y4",{"$f":"INDEX(INDIRECT(dms_RPT),dms_CRCP_start_row+3)","v":"2017-18"},"FRCP_y4",{"$f":"INDEX(INDIRECT(dms_RPT),dms_FRCP_start_row+3)","v":"2022-23"}]
[null,"1991-92","1992","PRCP_y5",{"$f":"INDEX(INDIRECT(dms_RPT),dms_PRCP_start_row+4)","v":"2013-14"},"CRCP_y5",{"$f":"INDEX(INDIRECT(dms_RPT),dms_CRCP_start_row+4)","v":"2018-19"},"FRCP_y5",{"$f":"INDEX(INDIRECT(dms_RPT),dms_FRCP_start_row+4)","v":"2023-24"}]
[null,"1992-93","1993","PRCP_y6",{"$f":"INDEX(INDIRECT(dms_RPT),dms_PRCP_start_row+5)","v":"2014-15"},"CRCP_y6",{"$f":"INDEX(INDIRECT(dms_RPT),dms_CRCP_start_row+5)","v":"2019-20"},"FRCP_y6",{"$f":"INDEX(INDIRECT(dms_RPT),dms_FRCP_start_row+5)","v":"2024-25"}]
[null,"1993-94","1994","PRCP_y7",{"$f":"INDEX(INDIRECT(dms_RPT),dms_PRCP_start_row+6)","v":"2015-16"},"CRCP_y7",{"$f":"INDEX(INDIRECT(dms_RPT),dms_CRCP_start_row+6)","v":"2020-21"},"FRCP_y7",{"$f":"INDEX(INDIRECT(dms_RPT),dms_FRCP_start_row+6)","v":"2025-26"}]
[null,"1994-95","1995","PRCP_y8",{"$f":"INDEX(INDIRECT(dms_RPT),dms_PRCP_start_row+7)","v":"2016-17"},"CRCP_y8",{"$f":"INDEX(INDIRECT(dms_RPT),dms_CRCP_start_row+7)","v":"2021-22"},"FRCP_y8",{"$f":"INDEX(INDIRECT(dms_RPT),dms_FRCP_start_row+7)","v":"2026-27"}]
[null,"1995-96","1996","PRCP_y9",{"$f":"INDEX(INDIRECT(dms_RPT),dms_PRCP_start_row+8)","v":"2017-18"},"CRCP_y9",{"$f":"INDEX(INDIRECT(dms_RPT),dms_CRCP_start_row+8)","v":"2022-23"},"FRCP_y9",{"$f":"INDEX(INDIRECT(dms_RPT),dms_FRCP_start_row+8)","v":"2027-28"}]
[null,"1996-97","1997","PRCP_y10",{"$f":"INDEX(INDIRECT(dms_RPT),dms_PRCP_start_row+9)","v":"2018-19"},"CRCP_y10",{"$f":"INDEX(INDIRECT(dms_RPT),dms_CRCP_start_row+9)","v":"2023-24"},"FRCP_y10",{"$f":"INDEX(INDIRECT(dms_RPT),dms_FRCP_start_row+9)","v":"2028-29"}]
[null,"1997-98","1998","PRCP_y11",{"$f":"INDEX(INDIRECT(dms_RPT),dms_PRCP_start_row+10)","v":"2019-20"},"CRCP_y11",{"$f":"INDEX(INDIRECT(dms_RPT),dms_CRCP_start_row+10)","v":"2024-25"},"FRCP_y11",{"$f":"INDEX(INDIRECT(dms_RPT),dms_FRCP_start_row+10)","v":"2029-30"}]
[null,"1998-99","1999","PRCP_y12",{"$f":"INDEX(INDIRECT(dms_RPT),dms_PRCP_start_row+11)","v":"2020-21"},"CRCP_y12",{"$f":"INDEX(INDIRECT(dms_RPT),dms_CRCP_start_row+11)","v":"2025-26"},"FRCP_y12",{"$f":"INDEX(INDIRECT(dms_RPT),dms_FRCP_start_row+11)","v":"2030-31"}]
[null,"1999-00","2000","PRCP_y13",{"$f":"INDEX(INDIRECT(dms_RPT),dms_PRCP_start_row+12)","v":"2021-22"},"CRCP_y13",{"$f":"INDEX(INDIRECT(dms_RPT),dms_CRCP_start_row+12)","v":"2026-27"},"FRCP_y13",{"$f":"INDEX(INDIRECT(dms_RPT),dms_FRCP_start_row+12)","v":"2031-32"}]
[null,"2000-01","2001","PRCP_y14",{"$f":"INDEX(INDIRECT(dms_RPT),dms_PRCP_start_row+13)","v":"2022-23"},"CRCP_y14",{"$f":"INDEX(INDIRECT(dms_RPT),dms_CRCP_start_row+13)","v":"2027-28"},"FRCP_y14",{"$f":"INDEX(INDIRECT(dms_RPT),dms_FRCP_start_row+13)","v":"2032-33"}]
[null,"2001-02","2002","PRCP_y15",{"$f":"INDEX(INDIRECT(dms_RPT),dms_PRCP_start_row+14)","v":"2023-24"},"CRCP_y15",{"$f":"INDEX(INDIRECT(dms_RPT),dms_CRCP_start_row+14)","v":"2028-29"},"FRCP_y15",{"$f":"INDEX(INDIRECT(dms_RPT),dms_FRCP_start_row+14)","v":"2033-34"}]
[null,"2002-03","2003","PRCP_y16",{"$f":"INDEX(INDIRECT(dms_RPT),dms_PRCP_start_row+15)","v":"2024-25"},"CRCP_y16",{"$f":"INDEX(INDIRECT(dms_RPT),dms_CRCP_start_row+15)","v":"2029-30"},"FRCP_y16",{"$f":"INDEX(INDIRECT(dms_RPT),dms_FRCP_start_row+15)","v":"2034-35"}]
[null,"2003-04","2004"]
[null,"2004-05","2005"]
[null,"2005-06","2006",null,"CRY - FRY"]
[null,"2006-07","2007","dms_y1",{"$f":"IFERROR(INDEX(INDIRECT(dms_RPT),dms_CRY_start_row),0)","v":"2011-12"}]
[null,"2007-08","2008","dms_y2",{"$f":"IFERROR(INDEX(INDIRECT(dms_RPT),dms_CRY_start_row+1),0)","v":"2012-13"}]
[null,"2008-09","2009","dms_y3",{"$f":"IFERROR(INDEX(INDIRECT(dms_RPT),dms_CRY_start_row+2),0)","v":"2013-14"}]
[null,"2009-10",2010,"dms_y4",{"$f":"IFERROR(INDEX(INDIRECT(dms_RPT),dms_CRY_start_row+3),0)","v":"2014-15"}]
[null,"2010-11",2011,"dms_y5",{"$f":"IFERROR(INDEX(INDIRECT(dms_RPT),dms_CRY_start_row+4),0)","v":"2015-16"}]
[null,"2011-12",2012,"dms_y6",{"$f":"IFERROR(INDEX(INDIRECT(dms_RPT),dms_CRY_start_row+5),0)","v":"2016-17"}]
[null,"2012-13",2013,"dms_y7",{"$f":"IFERROR(INDEX(INDIRECT(dms_RPT),dms_CRY_start_row+6),0)","v":"2017-18"}]
[null,"2013-14",2014,"dms_y8",{"$f":"IFERROR(INDEX(INDIRECT(dms_RPT),dms_CRY_start_row+7),0)","v":"2018-19"}]
[null,"2014-15",2015,"dms_y9",{"$f":"IFERROR(INDEX(INDIRECT(dms_RPT),dms_CRY_start_row+8),0)","v":"2019-20"}]
[null,"2015-16",2016,"dms_y10",{"$f":"IFERROR(INDEX(INDIRECT(dms_RPT),dms_CRY_start_row+9),0)","v":"2020-21"}]
[null,"2016-17",2017,"dms_y11",{"$f":"IFERROR(INDEX(INDIRECT(dms_RPT),dms_CRY_start_row+10),0)","v":"2021-22"}]
[null,"2017-18",2018,"dms_y12",{"$f":"IFERROR(INDEX(INDIRECT(dms_RPT),dms_CRY_start_row+11),0)","v":"2022-23"}]
[null,"2018-19",2019,"dms_y13",{"$f":"IFERROR(INDEX(INDIRECT(dms_RPT),dms_CRY_start_row+12),0)","v":"2023-24"}]
[null,"2019-20",2020,"dms_y14",{"$f":"IFERROR(INDEX(INDIRECT(dms_RPT),dms_CRY_start_row+13),0)","v":"2024-25"}]
[null,"2020-21",2021,"dms_y15",{"$f":"IFERROR(INDEX(INDIRECT(dms_RPT),dms_CRY_start_row+14),0)","v":"2025-26"}]
[null,"2021-22",2022,"dms_y16",{"$f":"IFERROR(INDEX(INDIRECT(dms_RPT),dms_CRY_start_row+15),0)","v":"2026-27"}]
[null,"2022-23",2023]
[null,"2023-24",2024]
[null,"2024-25",2025]
[null,"2025-26",2026]
[null,"2026-27",2027]
[null,"2027-28",2028]
[null,"2028-29",2029]
[null,"2029-30",2030]
[null,"2030-31",2031]
[null,"2031-32",2032]
[null,"2032-33",2033]
[null,"2033-34",2034]
[null,"2034-35",2035]
[null,"2035-36",2036]
[null,"2036-37","2037"]

{"sheet":"AER ETL","index":3,"n_rows":145,"n_cols":8,"rows_kept":145,"cut":false,"hidden":true,"merged":[[71,1,73,1],[32,68,32,89],[33,37,33,58],[33,68,33,89],[34,0,59,0],[34,37,34,58],[34,68,34,89],[32,37,32,58],[11,0,15,0],[12,4,12,8],[14,2,14,4],[18,0,25,0],[26,0,31,0]]}
[null,"AER ETL INFORMATION"]
[]
[null,"USES NAMED RANGES FLAG","yes","dms_Defined_Names_Used"]
[]
[null,"IF THIS IS AN ABC RIN - make sure the the named range CRY is applied and the named range dms_dollar_nom_UOM is applied"]
[null,"IF THIS IS A RESET RIN - make sure the named ranges CRY and dms_dollar_nom_UOM are NOT present in the workbook"]
[null,"FOR ABC RINS THAT SPAN MULTIPLE YEARS - make sure MultiYear Flag is set and final year entered as required"]
[]
[null,"Full trading name",{"$f":"INDEX(dms_TradingNameFull_List,MATCH(dms_TradingName,dms_TradingName_List))","v":"Jemena Electricity"},null,"dms_TradingNameFull"]
[null,"Trading name",{"$f":"dms_TradingName","v":"Jemena Electricity"}]
["Selected here","Model / RIN","ARR","dms_Model"]
["Read from Business & other details","Source","Reporting","dms_Source"]
[null,"Data quality",{"$f":"dms_Selected_Quality","v":"Consolidated"},"dms_DQ_1"]
[null,"Data status",{"$f":"dms_Selected_Status","v":"Public"},"dms_DQ_2"]
[null,"Amendment reason",{"$f":"dms_Amendment_Text","v":0},null,null,"dms_AmendmentReason"]
[null,"Submission date",{"$f":"dms_Typed_Submission_Date","v":"2020-01-31"},"dms_SubmissionDate"]
[]
["Redundant","EBSS - First application of scheme in forthcoming period?","No"]
["Pre-populated from lookup table","Data ingestion data quality",{"$f":"IF(dms_DQ_2=\"Confidential\",\"Consolidated\",\"Public\")","v":"Public"},"dms_DataQuality","=IF(dms_DQ_2=\"Confidential\",\"Consolidated\",\"Public\")"]
[null,"Sector",{"$f":"INDEX(dms_Sector_List,MATCH(dms_TradingName,dms_TradingName_List))","v":"Electricity"},"dms_Sector","=INDEX(dms_Sector_List,MATCH(dms_TradingName,dms_TradingName_List))"]
[null,"Segment",{"$f":"INDEX(dms_Segment_List,MATCH(dms_TradingName,dms_TradingName_List))","v":"Distribution"},"dms_Segment","=INDEX(dms_Segment_List,MATCH(dms_TradingName,dms_TradingName_List))"]
[null,"Regulatory Year Ending",{"$f":"dms_RYE_result","v":"2018"},"dms_RYE","=IF(dms_MultiYear_Flag=1,LEFT(dms_Specified_FinalYear,2)&RIGHT(dms_Specified_FinalYear,2),INDEX(dms_RYE_Formula_Result,MATCH(dms_Model,dms_Model_List)))"]
[null,"Reporting Period Type",{"$f":"INDEX(dms_RPT_List,MATCH(dms_TradingName,dms_TradingName_List))","v":"Financial"},"dms_RPT","=INDEX(dms_RPT_List,MATCH(dms_TradingName,dms_TradingName_List))"]
[null,"EB/CA Unit of Measure for Monetary Values","$0s","dms_dollar_nom_UOM","If the cover sheet is attached to an ABC RIN apply the NAMED RANGE to the cell"]
[null,"Security Classification","Public","dms_Classification","Always Public"]
[null,"Jurisdiction",{"$f":"INDEX(dms_JurisdictionList,MATCH(dms_TradingName,dms_TradingName_List))","v":"Vic"},"dms_Jurisdiction","=INDEX(dms_JurisdictionList,MATCH(dms_TradingName,dms_TradingName_List))"]
["Relevant for PTRM, RFMs and Reset RINS","$ REAL REFERENCES"]
[null,"Does the named range CRY exist in this file? ",{"$f":"IFERROR(CRY,\"NO\")","v":"2011-12"}]
[null,"CRY-1  (last full calendar year before CRY)",{"$f":"IFERROR(IF(dms_RPT=\"calendar\",CRY-1,LEFT(CRY,4)),\"CRY not present\")","v":"2011"},"dms_Cal_Year_B4_CRY","'=IF(dms_RPT=\"financial\",VALUE(LEFT(dms_SingleYear_FinalYear_Result,4)),VALUE(LEFT(dms_SingleYear_FinalYear_Result,4)-1))"]
[null,"Dollar $ real month",{"$f":"INDEX(dms_RPTMonth_List,MATCH(dms_TradingName,dms_TradingName_List))","v":"June"},"dms_RPTMonth","=INDEX(dms_RPTMonth_List,MATCH(dms_TradingName,dms_TradingName_List))"]
[null,"Dollar $ real  (the last month before the FRCP_y1)",{"$f":"IF(dms_SingleYearModel=\"yes\",CONCATENATE(dms_RPTMonth)&\" \"&VALUE((LEFT(CRY,2))&RIGHT(CRY,2)),CONCATENATE(dms_RPTMonth)&\" \"&dms_DollarReal_year)","v":"June 2012"},"dms_DollarReal","=IF(SUM(dms_SingleYear_Model)>0,CONCATENATE(dms_RPTMonth)&\" \"&VALUE((LEFT(CRY,2))&RIGHT(CRY,2)),CONCATENATE(dms_RPTMonth)&\" \"&VALUE((LEFT(dms_RYE,2)&RIGHT(dms_RYE,2))))"]
[null,"Dollar $ real previous year (PRCP_y5)",{"$f":"IF(dms_SingleYearModel=\"yes\",CONCATENATE(dms_RPTMonth)&\" \"&VALUE((LEFT(CRY,2))&RIGHT(CRY,2)),CONCATENATE(dms_RPTMonth)&\" \"&dms_Previous_DollarReal_year)","v":"June 2012"},"dms_DollarReal_Prev","=IF(SUM(dms_SingleYear_Model)>0,CONCATENATE(dms_RPTMonth)&\" \"&VALUE(((LEFT(CRY,2))&RIGHT(CRY,2))-1),CONCATENATE(dms_RPTMonth)&\" \"&VALUE(((LEFT(dms_CRCP_FirstYear_Result,2)&RIGHT(dms_CRCP_FirstYear_Result,2))))-1)"]
[null,"PTRM/ RFMs"]
[null,"Form of control",{"$f":"INDEX(dms_FormControl_List,MATCH(dms_TradingName,dms_TradingName_List))","v":"Revenue cap"},"dms_FormControl","=INDEX(dms_FormControl_List,MATCH(dms_TradingName,dms_TradingName_List))"]
["All potential values for Regulatory Years or RYEs as calculated","This block works out the various RYE's for ALL RIN types and MODELS"]
[null,"dms_start_year",{"$f":"FRCP_y1","v":"2019-20"},"FRCP_y1 from cover sheet"]
[null,"dms_CRY_start_year",{"$f":"IFERROR(CRY,CRCP_y4)","v":"2011-12"}]
[null,"dms_CRY_start_row",{"$f":"IFERROR(MATCH(dms_CRY_start_year,INDIRECT(dms_RPT),0),0)","v":25}]
[null,"dms_FRCP_start_row",{"$f":"MATCH(dms_start_year,INDIRECT(dms_RPT),0)","v":33},"Uses FRCP_y1 as a start reference"]
[null,"dms_CRCP_start_row",{"$f":"dms_FRCP_start_row-dms_CRCPlength_Num","v":28},"Uses the value in dms_CRCPlength_Num"]
[null,"dms_PRCP_start_row",{"$f":"dms_FRCP_start_row-dms_CRCPlength_Num-dms_PRCPlength_Num","v":23},"Uses the value in dms_CRCPlength_Num and dms_PRCPlength_Num"]
[null,"dms_RYE_start_row",{"$f":"dms_FRCP_start_row+(dms_FRCPlength_Num-1)","v":37},"Uses the value in dms_FRCPlength_Num-1"]
[null,"FRCP_start_year",{"$f":"INDEX(INDIRECT(dms_RPT),dms_FRCP_start_row)","v":"2019-20"},"Converts the FRCP start row to display the year"]
[null,"CRCP_start_year",{"$f":"INDEX(INDIRECT(dms_RPT),dms_CRCP_start_row)","v":"2014-15"},"Converts the CRCP start row to display the year"]
[null,"PRCP_start_year",{"$f":"INDEX(INDIRECT(dms_RPT),dms_PRCP_start_row)","v":"2009-10"},"Converts the PRCP start row to display the year"]
[null,"FRCP_final_year",{"$f":"INDEX(INDIRECT(dms_RPT),dms_FRCP_start_row+dms_FRCPlength_Num-1)","v":"2023-24"},"Finds the FRCP final year"]
[null,"CRCP_final_year",{"$f":"INDEX(INDIRECT(dms_RPT),dms_CRCP_start_row+dms_CRCPlength_Num-1)","v":"2018-19"},"Finds the CRCP final year"]
[null,"PRCP_final_year",{"$f":"INDEX(INDIRECT(dms_RPT),dms_PRCP_start_row+dms_FRCPlength_Num-1)","v":"2013-14"},"Finds the PRCP final year"]
[null,"dms_Reset_final_year",{"$f":"INDEX(INDIRECT(dms_RPT),dms_RYE_start_row)","v":"2023-24"},"For Resets and PTRM/RFMs (same as FRCP_final_year)"]
[null,"dms_SpecifiedYear_final_year",{"$f":"FRY","v":"2017-18"},"FRY from cover sheet"]
[null,"dms_DollarReal_year",{"$f":"LEFT(CRCP_final_year,2)&RIGHT(CRCP_final_year,2)","v":"2019"},"Uses the value in CRCP_final_year"]
[null,"dms_Previous_DollarReal_year",{"$f":"LEFT(PRCP_final_year,2)&RIGHT(PRCP_final_year,2)","v":"2014"},"Uses the value in PRCP_final_year"]
[null,"dms_CRY_RYE",{"$f":"IFERROR(LEFT(CRY,2)&RIGHT(CRY,2),0)","v":"2012"},"For ABC single year RINS"]
[null,"dms_Reset_RYE",{"$f":"IF(dms_Model_Span>1,IF(dms_Model=\"RFM\",(LEFT(dms_DollarReal_year,2)&RIGHT(dms_DollarReal_year,2)),(LEFT(dms_Reset_final_year,2)&RIGHT(dms_Reset_final_year,2))),0)","v":0},"If model span > 1 then uses dms_Reset_RYE otherwise it's a multi year ABC and uses dms_Specified_RYE"]
[null,"dms_Specified_RYE",{"$f":"IF(dms_MultiYear_ResponseFlag=\"Yes\",(LEFT(dms_Specified_FinalYear,2)&RIGHT(dms_Specified_FinalYear,2)),0)","v":"2018"},"If multi year ABC - uses dms_Specified_FinalYear"]
[null,"dms_Model_Span",{"$f":"INDEX(dms_Model_Span_List,MATCH(dms_Model,dms_Model_List))","v":1},"A result of 5 is used to signify that it is more than 1 year span"]
[null,"dms_RYE_result",{"$f":"IF(dms_MultiYear_ResponseFlag=\"yes\",dms_Specified_RYE,(IF(dms_Model_Span>1,dms_Reset_RYE,dms_CRY_RYE)))","v":"2018"},"Nested IF - feeds into dms_RYE"]
[null,"dms_Reset_Span",{"$f":"IF(dms_Reset_RYE>0,CONCATENATE(FRCP_y1,\" to \",FRCP_final_year),0)","v":0},"Reset span of years as text"]
[null,"dms_SpecifiedYear_Span",{"$f":"IF(dms_Specified_RYE>0,CONCATENATE(CRY,\" to \",dms_Specified_FinalYear),0)","v":"2011-12 to 2017-18"},"Multi year ABC span of years as text"]
[null,"dms_Header_Span",{"$f":"IF(dms_MultiYear_Flag=1,dms_SpecifiedYear_Span,IF(dms_Model_Span>1,dms_Reset_Span,CRY))","v":"2011-12 to 2017-18"},"NESTED IF - for Sheet Headers"]
[null,"ABC RINS THAT SPAN MULTIPLE YEARS"]
[null,"This is a multi year ABC RIN?","Yes"]
[null,null,{"$f":"IF(dms_MultiYear_ResponseFlag=\"No\",0,1)","v":1},"dms_MultiYear_Flag","This is set from the answer provided above"]
[null,null,{"$f":"IF(dms_MultiYear_Flag=1,FRY,\"not a Multiple year submission\")","v":"2017-18"},"dms_Specified_FinalYear","The result here is returned to dms_CRCP_FinalYear_Result if response to Q in C73 is \"yes\" and dms_MultiYear_Flag is set to 1"]
[null," Start year for 5.2 in Multi year ABC RINS",{"$f":"IFERROR(IF(dms_MultiYear_Flag=1,FRY,CRY),\"not an ABC\")","v":"2017-18"},"dms_0502_Inst_Year","=IF(dms_MultiYear_Flag=1,FRY,CRY)",null,"For single year RINS this is CRY - multi year RINS need to start a the end of the span of years (ie. FRY)"]
[null,"WHAT IS THE RYE?"]
[null,"Reg Period Lengths"]
[null,"PRCP length in years",{"$f":"INDEX(dms_PRCPlength_List,MATCH(dms_TradingName,dms_TradingName_List))","v":5},"dms_PRCPlength_Num","=INDEX(dms_PRCPlength_List,MATCH(dms_TradingName,dms_TradingName_List))"]
[null,"CRCP length in years",{"$f":"INDEX(dms_CRCPlength_List,MATCH(dms_TradingName,dms_TradingName_List))","v":5},"dms_CRCPlength_Num","=INDEX(dms_CRCPlength_List,MATCH(dms_TradingName,dms_TradingName_List))"]
[null,"FRCP length in years",{"$f":"INDEX(dms_FRCPlength_List,MATCH(dms_TradingName,dms_TradingName_List))","v":5},"dms_FRCPlength_Num","=INDEX(dms_FRCPlength_List,MATCH(dms_TradingName,dms_TradingName_List))"]
[null,"Single year RIN?"]
[null,"Single Year ABC RIN ?",{"$f":"IF(dms_Model=\"EB\",1,0)","v":0},"dms_EB"]
[null,null,{"$f":"IF(dms_Model=\"CA\",1,0)","v":0},"dms_CA","=dms_SingleYear_Model"]
[null,null,{"$f":"IF(dms_Model=\"ARR\",1,0)","v":1},"dms_ARR"]
[null,"Is this a single Year ABC RIN?",{"$f":"IF(SUM(dms_SingleYear_Model)=1,\"yes\",\"no\")","v":"yes"},"dms_SingleYearModel","=IF(SUM(dms_SingleYear_Model)=1,\"yes\",\"no\")"]
[null,"Single Year Final Year Result",{"$f":"IF(AND(dms_SingleYearModel=\"yes\",dms_MultiYear_Flag=0),CRY,0)","v":0},"dms_SingleYear_FinalYear_Result","=IFERROR(IF(SUM(dms_SingleYear_Model)<>0,(INDIRECT(dms_SingleYear_FinalYear_Ref)),\"not a single year RIN\"),\"CRY not present\")"]
[null,"Multi year RIN?"]
[]
[null,"Multi Year Reset/Model?",{"$f":"IF(dms_Model_Span>1,\"yes\",\"no\")","v":"no"}]
[null,"Final year result for Reset/Model",{"$f":"IF(dms_Model_Span>1,dms_Reset_final_year,0)","v":0}]
[]
[null,"Multi Year ABC RIN?",{"$f":"IF(dms_MultiYear_Flag=1,\"yes\",\"no\")","v":"yes"}]
[null,"Final year result for ABC multi year",{"$f":"IF(dms_MultiYear_Flag=1,C50,0)","v":"2017-18"}]
[]
[null,"EB RINS"]
[null,"Calendar Year for table 3.6 data",{"$f":"IFERROR(IF(dms_Segment=\"Transmission\",dms_Cal_Year_B4_CRY,CRY),\"CRY not present\")","v":"2011-12"},"dms_0306_Year","=IF(dms_Segment=\"Transmission\",dms_Cal_Year_B4_CRY,CRY)"]
[null,"CA RINS"]
[null,"Find how many rows in tables 6.3 sustained interruptions?",null,null,"dms_060301_MaxRows only returns a valid value when cover sheet is attached to a CA file"]
[null,null,{"$f":"IF(dms_Model<>\"CA\",\"not a CA\",\"Is a CA\")","v":"not a CA"},null,"=IF(dms_Model<>\"CA\",\"not a CA\",\"Is a CA\")"]
[null,"dms_060301_Avg_Duration_Sustained_Int_Values present?",{"$f":"IFERROR(IF(INDEX(dms_060301_Avg_Duration_Sustained_Int_Values,1,1)<>\"\",\"yes\",\"no\"),\"no\")","v":"no"},"dms_060301_checkvalue","=IFERROR(IF(INDEX(dms_060301_Avg_Duration_Sustained_Int_Values,1,1)<>\"\",\"yes\",\"no\"),\"no\")"]
[null,null,{"$f":"IF(AND(dms_Model=\"CA\",(dms_060301_checkvalue=\"no\")),\"error - NR not present\",\"no errors\")","v":"no errors"},null,"=IF(AND(dms_Model=\"CA\",(dms_060301_checkvalue=\"no\")),\"error - NR not present\",\"no errors\")"]
[null,"Table 6.3.1 - last row reference",{"$f":"IFERROR(IF(dms_Model=\"CA\",LOOKUP(2,1/(dms_060301_Avg_Duration_Sustained_Int_Values<>\"\"),(ROW(dms_060301_Avg_Duration_Sustained_Int_Values))),\"not a CA\"),\"6.3 not present\")","v":"not a CA"},"dms_060301_LastRow","=IFERROR(IF(dms_Model=\"CA\",LOOKUP(2,1/(dms_060301_Avg_Duration_Sustained_Int_Values<>\"\"),(ROW(dms_060301_Avg_Duration_Sustained_Int_Values))),\"not a CA\"),\"6.3 not present\")"]
[null,"Table 6.3.1 - max number rows",{"$f":"IFERROR(IF(dms_Model=\"CA\",(dms_060301_LastRow-15),\"not a CA\"),\"error\")","v":"not a CA"},"dms_060301_MaxRows","=IFERROR(IF(dms_Model=\"CA\",(dms_060301_LastRow-15),\"not a CA\"),\"error\")"]
[null,"Table 6.6.3 - Public lighting repair - no. business days",{"$f":"INDEX(dms_663_List,MATCH(dms_TradingName,dms_TradingName_List))","v":2},"dms_663","=INDEX(dms_663_List,MATCH(dms_TradingName,dms_TradingName_List))"]
[null,"ARR or RESET RINS"]
[null,"How many rows in tables 6.1 or 6.7?  (leap year?)","insert dms_LeapYear NR if required",null,"'dms_LeapYear is used to determine dms_060701_Max_Rows BUT it is only found on worksheet 6.1 or 6.7 and the date value in the cell is used to determine whether it is a leap year"]
[null,"Is dms_LeapYear named range present?",{"$f":"IFERROR(IF(dms_LeapYear,\"yes\"),\"no\")","v":"no"}]
[null,"Table 6.7.1 - includes a leap year?",{"$f":"\nIFERROR(IF(MONTH(DATE(YEAR(dms_LeapYear),2,29))=2,\"is a leap year\",\"not a leap year\"),\n\"dms_LeapYear not present\")","v":"dms_LeapYear not present"},"dms_LeapYear_Result","=IFERROR(IF(MONTH(DATE(YEAR(dms_LeapYear),2,29))=2,\"is a leap year\",\"not a leap year\"),\"dms_LeapYear not present\")"]
[null,"MaxRows if Reset and leap year",{"$f":"IF(dms_LeapYear_Result=\"is a leap year\",1827,1826)","v":{"$error":"#NAME?"}},"dms_060701_Reset_MaxRows","=IF(dms_LeapYear_Result=\"is a leap year\",1827,1826)",null,null,"number of days present in Reset RIN table"]
[null,"MaxRows if ARR and leap year",{"$f":"IF(dms_LeapYear_Result=\"is a leap year\",366,365)","v":{"$error":"#NAME?"}},"dms_060701_ARR_MaxRows","=IF(dms_LeapYear_Result=\"is a leap year\",366,365)",null,null,"number of days present in ARR RIN table"]
[null,"Table 6.7.1 - Max Rows (leap year/ non leap year)",{"$f":"IF(dms_Model=\"ARR\",dms_060701_ARR_MaxRows,IF(dms_Model=\"Reset\",dms_060701_Reset_MaxRows,\"not a relevant RIN type\"))","v":{"$error":"#NAME?"}},"dms_060701_MaxRows","=IF(dms_Model=\"ARR\",dms_060701_ARR_MaxRows,IF(dms_Model=\"Reset\",dms_060701_Reset_MaxRows,\"not a relevant RIN type\"))"]
[null,"How many columns in 6.7?   (4 or 5 feeder categories)",{"$f":"IF(dms_FifthFeeder_flag_NSP=\"NO\",\"This NSP has only 4 feeder categories\",\"This NSP has 5 feeder categories\")","v":"This NSP has only 4 feeder categories"}]
[null,"Table 6.7.1 - Last column (# of feeder categories > 4)",{"$f":"IF(dms_FifthFeeder_flag_NSP=\"NO\",10,12)","v":10},"dms_060701_MaxCols","=IF(dms_FifthFeeder_flag_NSP=\"NO\",8,10)"]
[null,"Table 6.7.1 - Number of offset rows",{"$f":"IF(dms_Model=\"ARR\",15,9)","v":15},"dms_060701_OffsetRows","=IF(dms_Model=\"ARR\",15,9)"]
[null,"Start date for telephone answering in 6.1 or 6.7?",null,null,"Using 060101 as naming standard not 060701 for start dates"]
[null,"Table 6.1.1 and 6.7.1 - Start Date as Text",{"$f":"IF(dms_SingleYearModel=\"yes\",(CONCATENATE(IF(LEN(CRY)=4,\"1-Jan-\",\"1-Jul-\"),LEFT(CRY,4))),(CONCATENATE(IF(LEN(PRCP_y4)=4,\"1-Jan-\",\"1-Jul-\"),LEFT(PRCP_y4,4))))","v":"1-Jul-2011"},"dms_060101_StartDateTxt","=IF(SUM(dms_SingleYear_Model)>1,(CONCATENATE(IF(LEN(CRY)=4,\"1-Jan-\",\"1-Jul-\"),LEFT(CRY,4))),(CONCATENATE(IF(LEN(CRCP_y4)=4,\"1-Jan-\",\"1-Jul-\"),LEFT(CRCP_y4,4))))"]
[null,"Table 6.1.1 and 6.7.1 - Start Date as Date Value",{"$f":"DATEVALUE(dms_060701_StartDateTxt)","v":40725},"dms_060101_StartDateVal","=DATEVALUE(dms_060701_StartDateTxt)"]
[null,"ARRs"]
[null,"How many rows in table 6.8?","insert dms_060801_StartCell NR if required",null,"dms_060801_StartCell is only found on worksheet 6.8 and is used to determine the starting date for the date range"]
[null,"Is dms_060801_StartCell named range present?","yes",null,"=IFERROR(IF((ROW(dms_060801_StartCell)-1)=1,\"yes\",\"yes\"),\"no\")"]
[null,"Table 6.8 - Number of offset rows",12,"dms_0608_OffsetRows","=IFERROR(IF(dms_Model=\"ARR\",(ROW(dms_060801_StartCell)-1),\"not an ARR\"),\"6.8 error\")"]
[null,"Table 6.8 - Last row","0","dms_0608_LastRow","=IFERROR(IF(dms_060801_StartCell<>\"\",IF(dms_Model=\"ARR\",(LOOKUP(2,1/(dms_060801_01_Values<>\"\"),(ROW(dms_060801_01_Values)))),\"not an ARR\"),0),\"0\")"]
[null,"Table 6.8 - MaxRows",{"$f":"IFERROR(IF(dms_Model=\"ARR\",(MAX(0,dms_0608_LastRow-dms_0608_OffsetRows)),\"not an ARR\"),\"0\")","v":0},"dms_060801_MaxRows","=IFERROR(IF(dms_Model=\"ARR\",(MAX(0,dms_0608_LastRow-dms_0608_OffsetRows)),\"not an ARR\"),\"0\")"]
[null,"TNSP RESET RINS"]
[null,"Table 7.9.4 only appears in TNSPs Reset RIN"]
[null,"Table 7.9.4 - first year",{"$f":"LEFT(PRCP_y3,4)","v":"2011"},"dms_070904_Start_Year","=LEFT(PRCP_y3,4)"]
[]
[null,"MISC"]
[null,"Distribution Determination Reference",{"$f":"INDEX(dms_DeterminationRef_List,MATCH(dms_TradingName,dms_TradingName_List))","v":"2016-20 Distribution Determination"},"dms_DeterminationRef"]
[null,"Public lighting NSP?",{"$f":"INDEX(dms_Public_Lighting_List,MATCH(dms_TradingName,dms_TradingName_List))","v":"YES"},"dms_Public_Lighting","=INDEX(dms_Public_Lighting_List,MATCH(dms_TradingName,dms_TradingName_List))"]
[null,"CBD Feeder for this business",{"$f":"INDEX(dms_CBD_flag,MATCH(dms_TradingName,dms_TradingName_List))","v":"NO"},"dms_CBD_flag_NSP"]
[null,"Urban Feeder for this business",{"$f":"INDEX(dms_Urban_flag,MATCH(dms_TradingName,dms_TradingName_List))","v":"YES"},"dms_Urban_flag_NSP"]
[null,"Short rural Feeder for this business",{"$f":"INDEX(dms_ShortRural_flag,MATCH(dms_TradingName,dms_TradingName_List))","v":"YES"},"dms_ShortRural_flag_NSP"]
[null,"Long rural Feeder for this business",{"$f":"INDEX(dms_LongRural_flag,MATCH(dms_TradingName,dms_TradingName_List))","v":"NO"},"dms_LongRural_flag_NSP"]
[null,"Fifth Feeder Category (eg. TasNetworks (D))",{"$f":"INDEX(dms_FeederType_5_flag,MATCH(dms_TradingName,dms_TradingName_List))","v":"NO"},"dms_FifthFeeder_flag_NSP","=INDEX(dms_FeederType_5_flag,MATCH(dms_TradingName,dms_TradingName_List))"]
[]
[null,"DISCARD FILES"]
[null,"discard this record?","NO","dms_DISCARD","If record is to be discarded from DB set this flag to YES"]
[]
[null,"SUBSET FILES"]
[null,"Is this Submission File a Subset File","YES","dms_Partial"]
[]
[]
[null,"REGULATORY YEARS FOR MULTI RYE SUBMISSIONS"]
[null,"Multiple RYE flag","NO","dms_Multi_RYE_flag"]
[null,null,"Manually specify RYE","Named ranges to apply"]
[null,null,2013,"dms_RYE_01"]
[null,null,2014,"dms_RYE_02"]
[null,null,2015,"dms_RYE_03"]
[null,null,2016,"dms_RYE_04"]
[null,null,2017,"dms_RYE_05"]
[null,null,2018,"dms_RYE_06"]
[null,null,2019,"dms_RYE_07"]
[null,null,2020,"dms_RYE_08"]
[null,null,2021,"dms_RYE_09"]

{"sheet":"Instructions","index":4,"n_rows":27,"n_cols":4,"rows_kept":27,"cut":false,"hidden":false,"merged":[[18,1,24,1],[18,2,18,4],[26,2,26,4],[10,2,10,4],[12,1,14,1],[12,2,12,4],[13,2,13,3],[14,2,14,4],[16,2,16,4],[7,1,8,1],[7,2,7,3],[8,2,8,4],[1,1,1,4],[2,1,2,4],[3,1,3,4],[4,1,4,4],[5,2,5,4]]}
[]
[null,{"$f":"CONCATENATE(dms_Sector,\" \",dms_Segment,\" \", \"Network Service Provider\")","v":"Electricity Distribution Network Service Provider"}]
[null," Historical Annual Reporting RIN - Financial Years"]
[null,{"$f":"CONCATENATE(\"This template is to be used by \",dms_TradingNameFull,\" to fulfil its reporting obligations to the AER.\")","v":"This template is to be used by Jemena Electricity to fulfil its reporting obligations to the AER."}]
[null,"INSTRUCTIONS"]
[null,"GENERAL","Complete the Business & other details worksheet before entering data or values in any other worksheets. The Business & other details worksheet is linked to other worksheets within the workbook and automatically generates certain column headings and conditional formatting."]
[]
[null,"CONFIDENTIAL INFORMATION","\nBusinesses must use the macro at the top of  \neach worksheet to identify confidential\ninformation in the confidential workbook. \n\n"]
[null,null,"-Do this by selecting the cell or cells that contain confidential information and then run the Mark selection  CONFIDENTIAL macro. This will format the cells a specific colour that is identified by the AER's database which in turn marks that information as confidential.\n\n-To reverse this, select the cell or cells and run the Return selection to NON-CONFIDENTIAL macro."]
[]
[null,"RESPONSES","\nPlease return four (4) files to the AER: \n\n1. A confidential version which must contain a complete set of all responses with confidential information marked using the Mark selection CONFIDENTIAL macro and which has been completed using the locked template file provided by the AER. \n\n2. An actual and an estimate version with confidential information marked using the Mark selection CONFIDENTIAL macro and which has been completed using the locked template file provided by the AER.\n\n3. A public version with confidential information either removed completely or aggregated in some form together with writtten consent to disclose the public version of the response.\n\nUse the drop down box on the Business and other details worksheet to identify the file as either confidential ('consolidated') or public. "]
[]
[null,"AMENDMENTS","\nIf an NSP wishes to correct data previously submitted to the AER it should resubmit that data using the original completed submission as the starting point. Please make any necessary changes to the data. Data that is not being amended should be left unchanged. \n\nNSPs must identify the reason for the amendments in the Amendment Reason box on the  Business and other details worksheet. NSPs may provide further details regarding any amendments in the Amendments worksheet. \n\n."]
[null,null,"NSP may use Amended Data macro \nto highlight cells that contain amended data.\nNB: if data is also CONFIDENTIAL, re-apply \nthe Confidentiality macro after applying the \nAmended macro"]
[null,null,"Please resubmit two (2) files - a confidential version and a public version of the amended submission to the AER"]
[]
[null,"UNITS OF MEASURE","\nAll amounts are to be unrounded and reported on a one for one basis: that is 1000 is to be entered as '1000'. Applicable units of measure may be identified in the table column headings or row descriptors.\n\n"]
[]
[null,"INPUT / NON-INPUT CELLS"]
[null,null,null,"Yellow = Input cell (mandatory)"]
[null,null,null,"Darker yellow = input cell (mandatory)"]
[null,null,null,"Orange = input cell (if data available)"]
[null,null,null,"Grey = Not applicable/No inputs required"]
[null,null,null," \nPLEASE DO NOT ENTER TEXT into cells that are to contain numeric data."]
[]
[]
[null,"NAVIGATION","\nMany tables in the worksheets have been \"grouped\" to allow for easy navigation. To ungroup or group data use the outline symbols in the left margin (for Row groupings) or above the columns (for column groupings). \n\n\n\n"]

{"sheet":"Contents","index":5,"n_rows":37,"n_cols":5,"rows_kept":37,"cut":false,"hidden":false,"merged":[[5,3,5,4]]}
[null,null,{"$f":"INDEX(dms_Worksheet_List,MATCH(dms_Model,dms_Model_List))","v":"HISTORICAL ANNUAL REPORTING - FINANCIAL YEARS"}]
[null,null,{"$f":"INDEX(dms_TradingNameFull_List,MATCH(dms_TradingName,dms_TradingName_List))","v":"Jemena Electricity"}]
[null,null,{"$f":"dms_Header_Span","v":"2011-12 to 2017-18"}]
[]
[]
[null,null,null,"CONTENTS"]
[]
[null,null,null,"SUBMISSION","Business & other details"]
[]
[null,null,null,"EXPENDITURE","2.11 Labour"]
[]
[null,null,null,"ALTERNATIVE CONTROL","4.1 Public lighting"]
[]
[null,null,null,"SERVICE","3.6 Quality of services"]
[]
[null,null,null,null,"3.6.8 Network-feeders 2011-12"]
[null,null,null,null,"3.6.8 Network-feeders 2012-13"]
[null,null,null,null,"3.6.8 Network-feeders 2013-14"]
[null,null,null,null,"3.6.8 Network-feeders 2014-15"]
[null,null,null,null,"3.6.8 Network-feeders 2015-16"]
[null,null,null,null,"3.6.8 Network-feeders 2016-17"]
[null,null,null,null,"3.6.9 Network-reliability 2017-18"]
[]
[null,null,null,null,"6.2 STPIS Reliability"]
[null,null,null,null,"6.6 STPIS Customer Service"]
[null,null,null,null,"6.7 STPIS Daily Performance"]
[null,null,null,null,"6.8 STPIS Exclusions"]
[null,null,null,null,"6.9 STPIS - GSL"]
[]
[null,null,null,"OTHER","7.10 Juris Scheme"]
[null,null,null,null,"7.11 DMIA-DMIAM"]
[null,null,null,null,"7.8 Avoided TUOS Payments"]
[null,null,null,null,"9.5 TUoS"]
[]
[null,null,null,"FINANCIAL","8.1 Income"]
[null,null,null,null,"8.2 Capex"]
[null,null,null,null,"8.4 Opex"]

{"sheet":"Business & other details","index":6,"n_rows":74,"n_cols":81,"rows_kept":74,"cut":false,"hidden":false,"merged":[[69,25,71,34],[69,37,71,81],[73,25,73,34],[73,37,73,52],[63,25,63,34],[63,37,63,52],[65,25,65,34],[65,37,65,52],[67,25,67,34],[67,37,67,52],[53,25,53,34],[53,37,53,44],[55,25,55,34],[55,37,55,44],[61,25,61,34],[61,37,61,52],[50,37,50,44],[50,46,50,53],[50,55,50,62],[50,64,50,71],[50,73,50,80],[51,37,51,44],[51,46,51,53],[51,55,51,62],[51,64,51,71],[51,73,51,80],[49,25,49,34],[49,37,49,44],[49,46,49,53],[49,55,49,62],[49,64,49,71],[49,73,49,80],[46,37,46,44],[46,46,46,53],[46,55,46,62],[46,64,46,71],[46,73,46,80],[47,37,47,44],[47,46,47,53],[47,55,47,62],[47,64,47,71],[47,73,47,80],[45,25,45,34],[45,37,45,44],[45,46,45,53],[45,55,45,62],[45,64,45,71],[45,73,45,80],[42,37,42,44],[42,46,42,53],[42,55,42,62],[42,64,42,71],[42,73,42,80],[43,37,43,44],[43,46,43,53],[43,55,43,62],[43,64,43,71],[43,73,43,80],[33,21,33,35],[33,37,33,58],[33,60,33,66],[33,68,33,89],[41,25,41,34],[41,37,41,44],[41,46,41,53],[41,55,41,62],[41,64,41,71],[41,73,41,80],[31,21,31,35],[31,37,31,58],[31,60,31,66],[31,68,31,89],[32,21,32,35],[32,37,32,58],[32,60,32,66],[32,68,32,89],[25,21,25,35],[25,37,25,40],[25,49,25,51],[25,60,25,66],[25,68,25,71],[25,80,25,82],[24,21,24,35],[24,37,24,51],[24,60,24,66],[24,68,24,82],[16,21,16,35],[16,37,16,48],[22,21,22,35],[22,37,22,58],[22,60,22,66],[22,68,22,89],[0,7,2,15],[3,21,3,57],[6,21,6,75],[8,16,8,93],[15,21,15,35],[15,37,15,58],[23,21,23,35],[23,37,23,58],[23,60,23,66],[23,68,23,89]]}
[null,null,null,null,null,null,null,null,null,null,null,null,null,null,null,null,null,null,null,null,null,{"$f":"INDEX(dms_Worksheet_List,MATCH(dms_Model,dms_Model_List))","v":"HISTORICAL ANNUAL REPORTING - FINANCIAL YEARS"}]
[null,null,null,null,null,null,null,null,null,null,null,null,null,null,null,null,null,null,null,null,null,{"$f":"INDEX(dms_TradingNameFull_List,MATCH(dms_TradingName,dms_TradingName_List))","v":"Jemena Electricity"}]
[null,null,null,null,null,null,null,null,null,null,null,null,null,null,null,null,null,null,null,null,null,{"$f":"dms_Header_Span","v":"2011-12 to 2017-18"}]
[null,null,null,null,null,null,null,null,null,null,null,null,null,null,null,null,null,null,null,null,null,"BUSINESS & OTHER DETAILS"]
[]
[null,null,null,null,null,null,null,null,null,null,null,null,null,null,null,null,null,null,null,null,null,"INSTRUCTIONS"]
[null,null,null,null,null,null,null,null,null,null,null,null,null,null,null,null,null,null,null,null,null,"Complete the following business details regulatory template before entering data or values in any other regulatory template. This regulatory template is linked to other cells within the spreadsheet and automatically generates column headings and conditional formatting to distinguish business specific input and non-input cells. "]
[]
[null,null,null,null,null,null,null,null,null,null,null,null,null,null,null,null,"SUBMISSION PARTICULARS INPUT SHEET"]
[]
[]
[null,null,null,null,null,null,null,null,null,null,null,null,null,null,null,null,null,null,null,null,null,"ENTITY DETAILS"]
[]
[null,null,null,null,null,null,null,null,null,null,null,null,null,null,null,null,null,null,null,null,null,"Business Name"]
[]
[null,null,null,null,null,null,null,null,null,null,null,null,null,null,null,null,null,null,null,null,null,"Short name",null,null,null,null,null,null,null,null,null,null,null,null,null,null,null,"Jemena Electricity"]
[null,null,null,null,null,null,null,null,null,null,null,null,null,null,null,null,null,null,null,null,null,"ACN/ABN",null,null,null,null,null,null,null,null,null,null,null,null,null,null,null,{"$f":"INDEX(dms_ABN_List,MATCH(dms_TradingName,dms_TradingName_List))","v":82064651083}]
[]
[]
[]
[null,null,null,null,null,null,null,null,null,null,null,null,null,null,null,null,null,null,null,null,null,"Business Address",null,null,null,null,null,null,null,null,null,null,null,null,null,null,null,null,null,null,null,null,null,null,null,null,null,null,null,null,null,null,null,null,null,null,null,null,null,null,null,null,null,null,null,null,null,null,"Postal Address"]
[]
[null,null,null,null,null,null,null,null,null,null,null,null,null,null,null,null,null,null,null,null,null,"Address 1",null,null,null,null,null,null,null,null,null,null,null,null,null,null,null,{"$f":"INDEX(dms_Addr1_List,MATCH(dms_TradingName,dms_TradingName_List))","v":"Level 16"},null,null,null,null,null,null,null,null,null,null,null,null,null,null,null,null,null,null,null,null,null,null,"Address 1",null,null,null,null,null,null,null,{"$f":"INDEX(dms_PAddr1_List,MATCH(dms_TradingName,dms_TradingName_List))","v":"PO Box 16182"}]
[null,null,null,null,null,null,null,null,null,null,null,null,null,null,null,null,null,null,null,null,null,"Address 2",null,null,null,null,null,null,null,null,null,null,null,null,null,null,null,{"$f":"IF(ISBLANK(INDEX(dms_Addr2_List,MATCH(dms_TradingName,dms_TradingName_List))),\"\",(INDEX(dms_Addr2_List,MATCH(dms_TradingName,dms_TradingName_List))))","v":"567 Collins Street"},null,null,null,null,null,null,null,null,null,null,null,null,null,null,null,null,null,null,null,null,null,null,"Address 2",null,null,null,null,null,null,null,{"$f":"IF(ISBLANK(INDEX(dms_PAddr2_List,MATCH(dms_TradingName,dms_TradingName_List))),\"\",(INDEX(dms_PAddr2_List,MATCH(dms_TradingName,dms_TradingName_List))))","v":""}]
[null,null,null,null,null,null,null,null,null,null,null,null,null,null,null,null,null,null,null,null,null,"Suburb",null,null,null,null,null,null,null,null,null,null,null,null,null,null,null,{"$f":"INDEX(dms_Suburb_List,MATCH(dms_TradingName,dms_TradingName_List))","v":"MELBOURNE"},null,null,null,null,null,null,null,null,null,null,null,null,null,null,null,null,null,null,null,null,null,null,"Suburb",null,null,null,null,null,null,null,{"$f":"INDEX(dms_PSuburb_List,MATCH(dms_TradingName,dms_TradingName_List))","v":"MELBOURNE"}]
[null,null,null,null,null,null,null,null,null,null,null,null,null,null,null,null,null,null,null,null,null,"State",null,null,null,null,null,null,null,null,null,null,null,null,null,null,null,{"$f":"INDEX(dms_State_List,MATCH(dms_TradingName,dms_TradingName_List))","v":"Vic"},null,null,null,null,null,null,null,null,null,"Post code",null,3000,null,null,null,null,null,null,null,null,null,null,"State",null,null,null,null,null,null,null,{"$f":"INDEX(dms_PState_List,MATCH(dms_TradingName,dms_TradingName_List))","v":"Vic"},null,null,null,null,null,null,null,null,null,"Post code",null,3000]
[]
[null,null,null,null,null,null,null,null,null,null,null,null,null,null,null,null,null,null,null,null,null,null,null,null,null,null,null,null,null,null,null,null,null,null,null,null,null,null,null,null,null,null,null,null,null,null,null,null,null,null,null,null,"`"]
[]
[null,null,null,null,null,null,null,null,null,null,null,null,null,null,null,null,null,null,null,null,null,"Contact Names"]
[]
[null,null,null,null,null,null,null,null,null,null,null,null,null,null,null,null,null,null,null,null,null,"Name",null,null,null,null,null,null,null,null,null,null,null,null,null,null,null,"Matthew Serpell",null,null,null,null,null,null,null,null,null,null,null,null,null,null,null,null,null,null,null,null,null,null,"Name"]
[null,null,null,null,null,null,null,null,null,null,null,null,null,null,null,null,null,null,null,null,null,"Phone",null,null,null,null,null,null,null,null,null,null,null,null,null,null,null,"(03) 9173 7000",null,null,null,null,null,null,null,null,null,null,null,null,null,null,null,null,null,null,null,null,null,null,"Phone"]
[null,null,null,null,null,null,null,null,null,null,null,null,null,null,null,null,null,null,null,null,null,"Email",null,null,null,null,null,null,null,null,null,null,null,null,null,null,null,"matthew.serpell@jemena.com.au",null,null,null,null,null,null,null,null,null,null,null,null,null,null,null,null,null,null,null,null,null,null,"Email"]
[]
[]
[]
[]
[null,null,null,null,null,null,null,null,null,null,null,null,null,null,null,null,"REGULATORY CONTROL PERIODS"]
[]
[]
[null,null,null,null,null,null,null,null,null,null,null,null,null,null,null,null,null,null,null,null,null,null,null,null,null,"Forthcoming period",null,null,null,null,null,null,null,null,null,null,null,"2019-20",null,null,null,null,null,null,null,null,{"$f":"FRCP_y2","v":"2020-21"},null,null,null,null,null,null,null,null,{"$f":"FRCP_y3","v":"2021-22"},null,null,null,null,null,null,null,null,{"$f":"FRCP_y4","v":"2022-23"},null,null,null,null,null,null,null,null,{"$f":"FRCP_y5","v":"2023-24"}]
[null,null,null,null,null,null,null,null,null,null,null,null,null,null,null,null,null,null,null,null,null,null,null,null,null,null,null,null,null,null,null,null,null,null,null,null,null,{"$f":"FRCP_y6","v":"2024-25"},null,null,null,null,null,null,null,null,{"$f":"FRCP_y7","v":"2025-26"},null,null,null,null,null,null,null,null,{"$f":"FRCP_y8","v":"2026-27"},null,null,null,null,null,null,null,null,{"$f":"FRCP_y9","v":"2027-28"},null,null,null,null,null,null,null,null,{"$f":"FRCP_y10","v":"2028-29"}]
[null,null,null,null,null,null,null,null,null,null,null,null,null,null,null,null,null,null,null,null,null,null,null,null,null,null,null,null,null,null,null,null,null,null,null,null,null,{"$f":"FRCP_y11","v":"2029-30"},null,null,null,null,null,null,null,null,{"$f":"FRCP_y12","v":"2030-31"},null,null,null,null,null,null,null,null,{"$f":"FRCP_y13","v":"2031-32"},null,null,null,null,null,null,null,null,{"$f":"FRCP_y14","v":"2032-33"},null,null,null,null,null,null,null,null,{"$f":"FRCP_y15","v":"2033-34"}]
[]
[null,null,null,null,null,null,null,null,null,null,null,null,null,null,null,null,null,null,null,null,null,null,null,"RESETS",null,"Current period",null,null,null,null,null,null,null,null,null,null,null,{"$f":"CRCP_y1","v":"2014-15"},null,null,null,null,null,null,null,null,{"$f":"CRCP_y2","v":"2015-16"},null,null,null,null,null,null,null,null,{"$f":"CRCP_y3","v":"2016-17"},null,null,null,null,null,null,null,null,{"$f":"CRCP_y4","v":"2017-18"},null,null,null,null,null,null,null,null,{"$f":"CRCP_y5","v":"2018-19"}]
[null,null,null,null,null,null,null,null,null,null,null,null,null,null,null,null,null,null,null,null,null,null,null,null,null,null,null,null,null,null,null,null,null,null,null,null,null,{"$f":"CRCP_y6","v":"2019-20"},null,null,null,null,null,null,null,null,{"$f":"CRCP_y7","v":"2020-21"},null,null,null,null,null,null,null,null,{"$f":"CRCP_y8","v":"2021-22"},null,null,null,null,null,null,null,null,{"$f":"CRCP_y9","v":"2022-23"},null,null,null,null,null,null,null,null,{"$f":"CRCP_y10","v":"2023-24"}]
[null,null,null,null,null,null,null,null,null,null,null,null,null,null,null,null,null,null,null,null,null,null,null,null,null,null,null,null,null,null,null,null,null,null,null,null,null,{"$f":"CRCP_y11","v":"2024-25"},null,null,null,null,null,null,null,null,{"$f":"CRCP_y12","v":"2025-26"},null,null,null,null,null,null,null,null,{"$f":"CRCP_y13","v":"2026-27"},null,null,null,null,null,null,null,null,{"$f":"CRCP_y14","v":"2027-28"},null,null,null,null,null,null,null,null,{"$f":"CRCP_y15","v":"2028-29"}]
[]
[null,null,null,null,null,null,null,null,null,null,null,null,null,null,null,null,null,null,null,null,null,null,null,null,null,"Previous period",null,null,null,null,null,null,null,null,null,null,null,{"$f":"PRCP_y1","v":"2009-10"},null,null,null,null,null,null,null,null,{"$f":"PRCP_y2","v":"2010-11"},null,null,null,null,null,null,null,null,{"$f":"PRCP_y3","v":"2011-12"},null,null,null,null,null,null,null,null,{"$f":"PRCP_y4","v":"2012-13"},null,null,null,null,null,null,null,null,{"$f":"PRCP_y5","v":"2013-14"}]
[null,null,null,null,null,null,null,null,null,null,null,null,null,null,null,null,null,null,null,null,null,null,null,null,null,null,null,null,null,null,null,null,null,null,null,null,null,{"$f":"PRCP_y6","v":"2014-15"},null,null,null,null,null,null,null,null,{"$f":"PRCP_y7","v":"2015-16"},null,null,null,null,null,null,null,null,{"$f":"PRCP_y8","v":"2016-17"},null,null,null,null,null,null,null,null,{"$f":"PRCP_y9","v":"2017-18"},null,null,null,null,null,null,null,null,{"$f":"PRCP_y10","v":"2018-19"}]
[null,null,null,null,null,null,null,null,null,null,null,null,null,null,null,null,null,null,null,null,null,null,null,null,null,null,null,null,null,null,null,null,null,null,null,null,null,{"$f":"PRCP_y11","v":"2019-20"},null,null,null,null,null,null,null,null,{"$f":"PRCP_y12","v":"2020-21"},null,null,null,null,null,null,null,null,{"$f":"PRCP_y13","v":"2021-22"},null,null,null,null,null,null,null,null,{"$f":"PRCP_y14","v":"2022-23"},null,null,null,null,null,null,null,null,{"$f":"PRCP_y15","v":"2023-24"}]
[]
[null,null,null,null,null,null,null,null,null,null,null,null,null,null,null,null,null,null,null,null,null,null,null,null,null,"Commencing year",null,null,null,null,null,null,null,null,null,null,null,"2011-12"]
[null,null,null,null,null,null,null,null,null,null,null,null,null,null,null,null,null,null,null,null,null,null,null,"ANNUAL RINS"]
[null,null,null,null,null,null,null,null,null,null,null,null,null,null,null,null,null,null,null,null,null,null,null,null,null,"Ending year",null,null,null,null,null,null,null,null,null,null,null,"2017-18"]
[]
[]
[]
[null,null,null,null,null,null,null,null,null,null,null,null,null,null,null,null,"SUBMISSION DETAILS"]
[]
[null,null,null,null,null,null,null,null,null,null,null,null,null,null,null,null,null,null,null,null,null,null,null,null,null,"RIN type",null,null,null,null,null,null,null,null,null,null,null,{"$f":"INDIRECT(dms_Model)","v":"Annual Reporting"}]
[]
[null,null,null,null,null,null,null,null,null,null,null,null,null,null,null,null,null,null,null,null,null,null,null,null,null,"Source",null,null,null,null,null,null,null,null,null,null,null,"Reporting"]
[]
[null,null,null,null,null,null,null,null,null,null,null,null,null,null,null,null,null,null,null,null,null,null,null,"THIS FILE",null,"Data Quality",null,null,null,null,null,null,null,null,null,null,null,"Consolidated"]
[]
[null,null,null,null,null,null,null,null,null,null,null,null,null,null,null,null,null,null,null,null,null,null,null,null,null,"Confidentiality Status",null,null,null,null,null,null,null,null,null,null,null,"Public"]
[]
[null,null,null,null,null,null,null,null,null,null,null,null,null,null,null,null,null,null,null,null,null,null,null,null,null,"Amended RIN \nAmendment Reason"]
[]
[]
[]
[null,null,null,null,null,null,null,null,null,null,null,null,null,null,null,null,null,null,null,null,null,null,null,null,null,"Submission Date",null,null,null,null,null,null,null,null,null,null,null,"2020-01-31"]

{"sheet":"2.11 Labour","index":7,"n_rows":25,"n_cols":9,"rows_kept":25,"cut":false,"hidden":false,"merged":[[5,1,5,2],[8,2,8,8],[9,2,9,8]]}
[null,{"$f":"INDEX(dms_Worksheet_List,MATCH(dms_Model,dms_Model_List))","v":"HISTORICAL ANNUAL REPORTING - FINANCIAL YEARS"}]
[null,{"$f":"INDEX(dms_TradingNameFull_List,MATCH(dms_TradingName,dms_TradingName_List))","v":"Jemena Electricity"}]
[null,{"$f":"dms_Header_Span","v":"2011-12 to 2017-18"}]
[null,"2.11 LABOUR"]
[]
[null,"Table numbering on this worksheet starts at 2.11.3."]
[]
[null,"2.11.3 - LABOUR / NON-LABOUR EXPENDITURE SPLIT - STANDARD CONTROL SERVICES"]
[null,null,"EXPENDITURE"]
[null,null,"($0's, nominal)"]
[null,null,{"$f":"dms_y1","v":"2011-12"},{"$f":"dms_y2","v":"2012-13"},{"$f":"dms_y3","v":"2013-14"},{"$f":"dms_y4","v":"2014-15"},{"$f":"dms_y5","v":"2015-16"},{"$f":"dms_y6","v":"2016-17"},{"$f":"dms_y7","v":"2017-18"}]
[null,"OPEX"]
[null,"In-house labour expenditure",0,0,0,0,0,0,0]
[null,"Labour expenditure outsourced to related parties",28248449.827008467,30413669.230898082,30766746.743889607,42557588.589999944,57188390.574999899,64308693.984999955,59725920.605000004]
[null,"Labour expenditure outsourced to unrelated parties",0,0,0,0,0,0,0]
[null,"Controllable non-labour expenditure",37327602.057106182,40098741.14168939,39057987.72504849,28426123.004241832,18845598.195298918,17938580.978203453,22203703.750967]
[null,"Uncontrollable non-labour expenditure",2555495.2172727278,2618812.7400000002,2677064.8609090908,2722653.4772727271,2765709.3927272726,2844245.4750000015,2787062.81422175]
[null,"Total",{"$f":"SUM(C13:C17)","v":68131547.101387382},73131223.112587467,72501799.329847187,73706365.071514502,78799698.16302608,85091520.438203394,84716687.170188755]
[null,"CAPEX"]
[null,"In-house labour expenditure",0,0,0,0,0,0,0]
[null,"Labour expenditure outsourced to related parties",33889388.93094714,40432876.687480137,40329530.206196621,38886151.939663626,35973041.564999953,36039025.960000113,44931785.735000163]
[null,"Labour expenditure outsourced to unrelated parties",0,0,0,0,0,0,0]
[null,"Controllable non-labour expenditure",93636489.515389532,82203184.785716757,87203121.673521936,94630828.203520522,91591759.401421383,102154239.37595135,107887204.014025]
[null,"Uncontrollable non-labour expenditure",0,0,0,0,0,0,0]
[null,"Total",{"$f":"SUM(C20:C24)","v":127525878.44633667},122636061.47319689,127532651.87971856,133516980.14318416,127564800.96642134,138193265.33595145,152818989.74902517]

{"sheet":"4.1 Public lighting","index":8,"n_rows":100,"n_cols":9,"rows_kept":100,"cut":false,"hidden":false,"merged":[[5,1,5,2],[9,2,9,8],[56,2,56,8]]}
[null,{"$f":"INDEX(dms_Worksheet_List,MATCH(dms_Model,dms_Model_List))","v":"HISTORICAL ANNUAL REPORTING - FINANCIAL YEARS"}]
[null,{"$f":"INDEX(dms_TradingNameFull_List,MATCH(dms_TradingName,dms_TradingName_List))","v":"Jemena Electricity"}]
[null,{"$f":"dms_Header_Span","v":"2011-12 to 2017-18"}]
[null,"4.1 PUBLIC LIGHTING"]
[]
[null,"Tables 4.1.1 - 4.1.3 deliberately omitted."]
[]
[null,"4.1.4 - PUBLIC LIGHTING METRICS BY TARIFF"]
[null,"NUMBER OF LIGHTS"]
[null,null,"VOLUMES\n0's"]
[null,"Tariff categories",{"$f":"dms_y1","v":"2011-12"},{"$f":"dms_y2","v":"2012-13"},{"$f":"dms_y3","v":"2013-14"},{"$f":"dms_y4","v":"2014-15"},{"$f":"dms_y5","v":"2015-16"},{"$f":"dms_y6","v":"2016-17"},{"$f":"dms_y7","v":"2017-18"}]
[null,"Fluorescent 20 watt ","Incomplete","Incomplete","Incomplete","Incomplete","Incomplete",2.083333333333333,"Incomplete"]
[null,"Fluorescent 40 watt ","Incomplete","Incomplete","Incomplete","Incomplete","Incomplete",21.583333333333336,"Incomplete"]
[null,"Incandescent 150 watt ","Incomplete","Incomplete","Incomplete","Incomplete","Incomplete",1,"Incomplete"]
[null,"Metal Halide 70 watt ","Incomplete","Incomplete","Incomplete","Incomplete","Incomplete",10.333333333333332,"Incomplete"]
[null,"Metal Halide 150 watt ","Incomplete","Incomplete","Incomplete","Incomplete","Incomplete",43.958333333333336,"Incomplete"]
[null,"Metal Halide 250 watt ","Incomplete","Incomplete","Incomplete","Incomplete","Incomplete",55.055555555555557,"Incomplete"]
[null,"Mercury Vapour 50 watt ","Incomplete","Incomplete","Incomplete","Incomplete","Incomplete",1.7083333333333335,"Incomplete"]
[null,"Mercury Vapour 80 watt ","Incomplete","Incomplete","Incomplete","Incomplete","Incomplete",8425.7638888888887,"Incomplete"]
[null,"Mercury Vapour 125 watt ","Incomplete","Incomplete","Incomplete","Incomplete","Incomplete",108.91666666666667,"Incomplete"]
[null,"Mercury Vapour 250 watt ","Incomplete","Incomplete","Incomplete","Incomplete","Incomplete",115.91666666666666,"Incomplete"]
[null,"Mercury Vapour 400 watt ","Incomplete","Incomplete","Incomplete","Incomplete","Incomplete",153,"Incomplete"]
[null,"Sodium High Pressure 50 watt ","Incomplete","Incomplete","Incomplete","Incomplete","Incomplete",1.7380952380952379,"Incomplete"]
[null,"Sodium Low Pressure 90 watt ","Incomplete","Incomplete","Incomplete","Incomplete","Incomplete",5.5,"Incomplete"]
[null,"Sodium High Pressure 100 watt ","Incomplete","Incomplete","Incomplete","Incomplete","Incomplete",1226.6666666666665,"Incomplete"]
[null,"Sodium High Pressure 150 watt ","Incomplete","Incomplete","Incomplete","Incomplete","Incomplete",15880.680555555555,"Incomplete"]
[null,"Sodium High Pressure 250 watt ","Incomplete","Incomplete","Incomplete","Incomplete","Incomplete",5072.2222222222217,"Incomplete"]
[null,"Sodium High Pressure 250 watt (24 hrs)","Incomplete","Incomplete","Incomplete","Incomplete","Incomplete",10,"Incomplete"]
[null,"Sodium High Pressure 400 watt ","Incomplete","Incomplete","Incomplete","Incomplete","Incomplete",326.16666666666669,"Incomplete"]
[null,"T5 2X14W ","Incomplete","Incomplete","Incomplete","Incomplete","Incomplete",26873.486111111109,"Incomplete"]
[null,"T5 (2x24W) ","Incomplete","Incomplete","Incomplete","Incomplete","Incomplete",942.1388888888888,"Incomplete"]
[null,"LED 18W ","Incomplete","Incomplete","Incomplete","Incomplete","Incomplete","Incomplete","Incomplete"]
[null,"LED 19W ","Incomplete","Incomplete","Incomplete","Incomplete","Incomplete",27.5,"Incomplete"]
[null,"LED 22W","Incomplete","Incomplete","Incomplete","Incomplete","Incomplete",10783.571969696968,"Incomplete"]
[null,"LED 23W","Incomplete","Incomplete","Incomplete","Incomplete","Incomplete",49.25,"Incomplete"]
[null,"LED 118W","Incomplete","Incomplete","Incomplete","Incomplete","Incomplete",31.25,"Incomplete"]
[null,"Compact Fluoro 32W ","Incomplete","Incomplete","Incomplete","Incomplete","Incomplete",2389.7361111111113,"Incomplete"]
[null,"Compact Fluoro 42W ","Incomplete","Incomplete","Incomplete","Incomplete","Incomplete",288.43055555555554,"Incomplete"]
[null,"Cash proceeds on Public Lighting scrapping","Incomplete","Incomplete","Incomplete","Incomplete","Incomplete","Incomplete","Incomplete"]
[null,"Avoided costs adjustment","Incomplete","Incomplete","Incomplete","Incomplete","Incomplete",0,"Incomplete"]
[null,"LED 17W ","Incomplete","Incomplete","Incomplete","Incomplete","Incomplete","Incomplete","Incomplete"]
[null,"Wrtten Down Value adjustment","Incomplete","Incomplete","Incomplete","Incomplete","Incomplete","Incomplete","Incomplete"]
[]
[]
[]
[]
[]
[]
[]
[]
[]
[null,"To enter further tariff categories - please insert new rows above this row. "]
[null,"Total ",{"$f":"SUM(C12:C51)","v":0},{"$f":"SUM(D12:D51)","v":0},0,0,0,72847.657287157301,0]
[]
[]
[null,"REVENUE"]
[null,null,"$0's, nominal"]
[null,null,{"$f":"dms_y1","v":"2011-12"},{"$f":"dms_y2","v":"2012-13"},{"$f":"dms_y3","v":"2013-14"},{"$f":"dms_y4","v":"2014-15"},{"$f":"dms_y5","v":"2015-16"},{"$f":"dms_y6","v":"2016-17"},{"$f":"dms_y7","v":"2017-18"}]
[null,{"$f":"IF(ISBLANK(B12),\"\",B12)","v":"Fluorescent 20 watt "},"Incomplete","Incomplete","Incomplete","Incomplete","Incomplete",124.55000000000001,"Incomplete"]
[null,{"$f":"IF(ISBLANK(B13),\"\",B13)","v":"Fluorescent 40 watt "},"Incomplete","Incomplete","Incomplete","Incomplete","Incomplete",1334.2800000000002,"Incomplete"]
[null,{"$f":"IF(ISBLANK(B14),\"\",B14)","v":"Incandescent 150 watt "},"Incomplete","Incomplete","Incomplete","Incomplete","Incomplete",67.81,"Incomplete"]
[null,"Metal Halide 70 watt ","Incomplete","Incomplete","Incomplete","Incomplete","Incomplete",1536.5250000000001,"Incomplete"]
[null,"Metal Halide 150 watt ","Incomplete","Incomplete","Incomplete","Incomplete","Incomplete",9415.4150000000009,"Incomplete"]
[null,"Metal Halide 250 watt ","Incomplete","Incomplete","Incomplete","Incomplete","Incomplete",11445.51,"Incomplete"]
[null,"Mercury Vapour 50 watt ","Incomplete","Incomplete","Incomplete","Incomplete","Incomplete",105.77,"Incomplete"]
[null,"Mercury Vapour 80 watt ","Incomplete","Incomplete","Incomplete","Incomplete","Incomplete",395112.93499999994,"Incomplete"]
[null,"Mercury Vapour 125 watt ","Incomplete","Incomplete","Incomplete","Incomplete","Incomplete",7521.0400000000009,"Incomplete"]
[null,"Mercury Vapour 250 watt ","Incomplete","Incomplete","Incomplete","Incomplete","Incomplete",10710.14,"Incomplete"]
[null,"Mercury Vapour 400 watt ","Incomplete","Incomplete","Incomplete","Incomplete","Incomplete",15829.445,"Incomplete"]
[null,"Sodium High Pressure 50 watt ","Incomplete","Incomplete","Incomplete","Incomplete","Incomplete",84.65,"Incomplete"]
[null,"Sodium Low Pressure 90 watt ","Incomplete","Incomplete","Incomplete","Incomplete","Incomplete",557.42499999999995,"Incomplete"]
[null,"Sodium High Pressure 100 watt ","Incomplete","Incomplete","Incomplete","Incomplete","Incomplete",160318.36000000004,"Incomplete"]
[null,"Sodium High Pressure 150 watt ","Incomplete","Incomplete","Incomplete","Incomplete","Incomplete",1510159.8050000002,"Incomplete"]
[null,"Sodium High Pressure 250 watt ","Incomplete","Incomplete","Incomplete","Incomplete","Incomplete",489688.70500000002,"Incomplete"]
[null,"Sodium High Pressure 250 watt (24 hrs)","Incomplete","Incomplete","Incomplete","Incomplete","Incomplete",1510.135,"Incomplete"]
[null,"Sodium High Pressure 400 watt ","Incomplete","Incomplete","Incomplete","Incomplete","Incomplete",41634.22,"Incomplete"]
[null,"T5 2X14W ","Incomplete","Incomplete","Incomplete","Incomplete","Incomplete",890769.50499999989,"Incomplete"]
[null,"T5 (2x24W) ","Incomplete","Incomplete","Incomplete","Incomplete","Incomplete",35153.050000000003,"Incomplete"]
[null,"LED 18W ","Incomplete","Incomplete","Incomplete","Incomplete","Incomplete","Incomplete","Incomplete"]
[null,"LED 19W ","Incomplete","Incomplete","Incomplete","Incomplete","Incomplete",532.7299999999999,"Incomplete"]
[null,"LED 22W","Incomplete","Incomplete","Incomplete","Incomplete","Incomplete",206694.46499999997,"Incomplete"]
[null,"LED 23W","Incomplete","Incomplete","Incomplete","Incomplete","Incomplete",940.36500000000012,"Incomplete"]
[null,"LED 118W","Incomplete","Incomplete","Incomplete","Incomplete","Incomplete",2278.0650000000001,"Incomplete"]
[null,"Compact Fluoro 32W ","Incomplete","Incomplete","Incomplete","Incomplete","Incomplete",68511.724999999991,"Incomplete"]
[null,"Compact Fluoro 42W ","Incomplete","Incomplete","Incomplete","Incomplete","Incomplete",9308.4599999999991,"Incomplete"]
[null,"Cash proceeds on Public Lighting scrapping","Incomplete","Incomplete","Incomplete","Incomplete","Incomplete","Incomplete","Incomplete"]
[null,"Avoided costs adjustment","Incomplete","Incomplete","Incomplete","Incomplete","Incomplete",-200905.25859254802,"Incomplete"]
[null,"LED 17W ","Incomplete","Incomplete","Incomplete","Incomplete","Incomplete","Incomplete","Incomplete"]
[null,"Wrtten Down Value adjustment","Incomplete","Incomplete","Incomplete","Incomplete","Incomplete","Incomplete","Incomplete"]
[null,""]
[null,""]
[null,""]
[null,""]
[null,""]
[null,""]
[null,""]
[null,""]
[null,""]
[null,"To enter further tariff categories - please insert new rows above this row. "]
[null,"Total ",{"$f":"SUM(C59:C98)","v":0},{"$f":"SUM(D59:D98)","v":0},0,0,0,3670439.8264074521,0]

{"sheet":"3.6 Quality of services","index":9,"n_rows":74,"n_cols":10,"rows_kept":74,"cut":false,"hidden":false,"merged":[[6,3,6,9],[24,3,24,9],[51,3,51,9]]}
[null,{"$f":"INDEX(dms_Worksheet_List,MATCH(dms_Model,dms_Model_List))","v":"HISTORICAL ANNUAL REPORTING - FINANCIAL YEARS"}]
[null,{"$f":"INDEX(dms_TradingNameFull_List,MATCH(dms_TradingName,dms_TradingName_List))","v":"Jemena Electricity"}]
[null,{"$f":"dms_Header_Span","v":"2011-12 to 2017-18"}]
[null,"3.6 QUALITY OF SERVICES"]
[]
[null,"3.6.5 - QUALITY OF SUPPLY METRICS"]
[null,null,null,"VOLUMES"]
[null,null,"Units",{"$f":"dms_y1","v":"2011-12"},{"$f":"dms_y2","v":"2012-13"},{"$f":"dms_y3","v":"2013-14"},{"$f":"dms_y4","v":"2014-15"},{"$f":"dms_y5","v":"2015-16"},{"$f":"dms_y6","v":"2016-17"},{"$f":"dms_y7","v":"2017-18"}]
[null,"Over voltage events - due to high voltage injection","number",6,10.5,12,12.5,11.5,8,6]
[null,"Customers receiving over-voltage - due to high voltage injection","number",39,277,372,179,294.5,313.5,95]
[null,"Over voltage events - due to lightning","number",1.5,1.5,2,2,0,0,0]
[null,"Customers receiving over-voltage - due to lightning","number",2.5,2.5,23.5,23.5,0,0,0]
[null,"Over voltage events - due to voltage regulation or other cause","number",41.5,43,43,44,46,64,86.5]
[null,"Customers receiving over-voltage - due to voltage regulation or other cause","number",3571.5,4656,4344.5,4062,4288.5,6524.5,8606]
[null,"Voltage variations - steady state (zone sub)","number",178.5,143,110,99.5,79.5,127.5,239]
[null,"Voltage variations - one minute (zone sub)","number",36.5,42,38.5,193.5,189.5,34,46.5]
[null,"Voltage variations - 10 seconds (zone sub) Min<0.7","number",462,310.5,182.5,145.5,166.5,256,323.5]
[null,"Voltage variations - 10 seconds (zone sub) Min<0.8","number",657,468,280,231.5,269.5,397,462.5]
[null,"Voltage variations - 10 seconds (zone sub) Min<0.9","number",1381,1122.5,805,673.5,779.5,1178,1467]
[null,"Voltage variations - steady state (feeder)","number",2259.5,3410,2507,2095.5,1542.5,309,492]
[null,"Voltage variations - % zone subs monitored","(per cent)",1,1,1,1,1,1,1]
[null,"Voltage variations - % feeders monitored","(per cent)",0.93500000000000005,0.93500000000000005,0.93500000000000005,0.93833333333333324,0.8783333333333333,0.91999999999999993,1]
[]
[null,"3.6.6 - COMPLAINTS - TECHNICAL QUALITY OF SUPPLY"]
[null,null,null,"VOLUMES"]
[null,null,"Units",{"$f":"dms_y1","v":"2011-12"},{"$f":"dms_y2","v":"2012-13"},{"$f":"dms_y3","v":"2013-14"},{"$f":"dms_y4","v":"2014-15"},{"$f":"dms_y5","v":"2015-16"},{"$f":"dms_y6","v":"2016-17"},{"$f":"dms_y7","v":"2017-18"}]
[null,"3.6.6.1 - TECHNICAL QUALITY OF SUPPLY"]
[null,"Number of complaints - technical quality of supply","number",109,134,155,126.5,118,140.5,164.5]
[null,"3.6.6.2 - PERCENTAGE OF COMPLAINTS BY CATEGORY"]
[null,"Low voltage supply","(per cent)",0.19459253617669459,0.16902828007351633,0.19121896068003852,0.20594405594405593,0.21962481962481961,0.17959549411162307,0.15072302558398215]
[null,"Voltage dips","(per cent)",0.11563848692561564,9.13025434279955E-2,6.1911142749466103E-2,6.2237762237762242E-2,9.8701298701298693E-2,0.11981566820276497,0.10585836114200964]
[null,"Voltage swell","(per cent)",9.9009900990099011E-3,1.2895002075057806E-2,6.4905154725514013E-3,3.4965034965034965E-3,7.9365079365079361E-3,7.9365079365079361E-3,1.4367816091954023E-2]
[null,"Voltage spike (impulsive transient)","(per cent)",9.9009900990099011E-3,1.2895002075057806E-2,6.4905154725514013E-3,8.0419580419580413E-3,8.5137085137085133E-3,3.968253968253968E-3,5.7471264367816091E-3]
[null,"Waveform distortion","(per cent)","Incomplete","Incomplete","Incomplete","Incomplete","Incomplete",0,2.8735632183908046E-3]
[null,"TV or radio interference","(per cent)",9.9009900990099011E-3,1.2895002075057806E-2,2.9940119760479044E-3,0,0,0,0]
[null,"Solar related","(per cent)","Incomplete","Incomplete","Incomplete","Incomplete","Incomplete",0.34548387096774202,0.49123099740452358]
[null,"Noise from appliances","(per cent)",2.1367521367521368E-2,0,0,0,0,0,0]
[null,"Other","(per cent)",0.63869848523313877,0.70098417027331483,0.7308948536493447,0.72027972027972031,0.5536363636363637,0.34161290322580651,0.22919911012235822]
[null,"3.6.6.3 - PERCENTAGE OF COMPLAINTS BY LIKELY CAUSE"]
[null,"Network equipment faulty","(per cent)",0.15185749344165186,0.13010612438489358,0.14180729450190527,0.15454545454545454,0.15490620490620488,0.14610855094726077,0.10656284760845398]
[null,"Network interference by NSP equipment","(per cent)",0,0,0,0,3.968253968253968E-3,3.968253968253968E-3,5.7471264367816091E-3]
[null,"Network interference by another customer","(per cent)",2.3398493695523399E-2,1.4851485148514851E-2,0,0,1.1904761904761904E-2,2.1582181259600604E-2,1.5424545791620309E-2]
[null,"Network limitation","(per cent)",0.33295252602183295,0.42891444833106063,0.50971483606214152,0.406993006993007,0.3354256854256854,0.28850486431131567,0.2464961067853168]
[null,"Customer internal problem","(per cent)",5.6020986714056024E-2,4.9623525226774177E-2,3.5949080859260504E-2,3.4615384615384617E-2,6.9191919191919193E-2,7.8136200716845849E-2,4.8442714126807541E-2]
[null,"No problem identified","(per cent)",9.9009900990099011E-3,9.9009900990099011E-3,0,0,0,0,0]
[null,"Environmental","(per cent)",0,0,0,0,0,0,5.7471264367816091E-3]
[null,"Other","(per cent)",0.42586951002792583,0.36660342680974684,0.31252878857669275,0.40384615384615385,0.42460317460317459,0.4616999487967231,0.57157953281423812]
[]
[]
[]
[null,"3.6.7 - CUSTOMER SERVICE METRICS"]
[null,null,null,"VOLUMES"]
[null,null,"Unit",{"$f":"dms_y1","v":"2011-12"},{"$f":"dms_y2","v":"2012-13"},{"$f":"dms_y3","v":"2013-14"},{"$f":"dms_y4","v":"2014-15"},{"$f":"dms_y5","v":"2015-16"},{"$f":"dms_y6","v":"2016-17"},{"$f":"dms_y7","v":"2017-18"}]
[null,"3.6.7.1 - TIMELY PROVISIONS OF SERVICES"]
[null,"Number of connections made","number",6728.5,7272.5,7838.5,8486,8597,9412,9893]
[null,"Number of connections not made on or before agreed date","number",5,7,6,15.5,59.5,477.5,535.5]
[null,"3.6.7.2 - TIMELY REPAIR OF FAULTY STREET LIGHTS"]
[null,"Street lights - average monthly number \"out\"","number",333.95833333333337,271.20833333333337,282.08333333333337,361.58333333333337,450.70833333333337,488.08333333333337,467.20833333333337]
[null,"Street lights - not repaired by \"fix by\" date","number",0,0,0,1.5,13,24.5,17]
[null,"Street lights - average number of days to repair","number",2.935296671490593,3.3394541971400207,3.3629592725995576,2.9015744864368989,2.6829265254247114,2.9752202790823903,3.2359599061689694]
[null,"Total number of street lights","number",68223.5,68998.5,69891.5,71249,72140.5,73439.5,74750]
[null,"3.6.7.3 - CALL CENTRE PERFORMANCE"]
[null,"Calls to call centre fault line","number",109280,122775.5,124147,104992,94543,90653,86988]
[null,"Calls to fault line answered within 30 seconds","number",24504,26678.5,38782.5,42040.5,36479,37420.5,38576.5]
[null,"Calls to fault line - average waiting time before call answered","number",65.958391897749806,66.091009366176408,53.7814309898056,47.863762287569351,56.403622739970707,49.495472859876941,37.631469197422852]
[null,"Call centre - number of overload events","number",6,2,0.5,0,0,0,0]
[null,"Percentage of calls abandoned","(per cent)",0.26816053960360453,0.28254782862597433,0.28466703083339767,0.26059387451658639,0.26440875564377969,0.27246809789868964,0.15516167919581597]
[null,"3.6.7.4 - NUMBER OF CUSTOMER COMPLAINTS"]
[null,"Complaint - reliability of supply","number",28,28.5,33,41.5,36.5,27,23]
[null,"Complaint - technical quality of supply","number",{"$f":"IF(ISBLANK(dms_030606_01_Values),\"\",dms_030606_01_Values)","v":109},109,109,109,109,109,109]
[null,"Complaint - administrative process or customer service","number",164,84,193.5,250,147.5,110.5,98.5]
[null,"Complaint - connection or augmentation","number",57.5,72,64,86.5,67,25,87.5]
[null,"Complaint - other","number",264.5,399.5,357.5,402,441.5,356,347]
[null,"Total number of complaints","number",{"$f":"IF(SUM(D69:D73)=0,\"\",(SUM(D69:D73)))","v":623},{"$f":"IF(SUM(E69:E73)=0,\"\",(SUM(E69:E73)))","v":693},757,889,801.5,{"$f":"IF(SUM(I69:I73)=0,\"\",(SUM(I69:I73)))","v":627.5},{"$f":"IF(SUM(J69:J73)=0,\"\",(SUM(J69:J73)))","v":665}]

{"sheet":"3.6.8 Network-feeders (2011-12)","index":10,"n_rows":421,"n_cols":23,"rows_kept":421,"cut":false,"hidden":false,"merged":[[10,10,10,14],[11,11,11,12],[11,13,11,14],[11,18,11,19],[11,15,12,15],[11,10,12,10],[10,15,10,19],[11,16,11,17],[5,6,5,8],[5,1,5,4],[11,8,12,8],[11,9,12,9],[11,20,12,20],[10,20,10,22],[11,21,11,22],[10,1,12,1],[10,2,12,2],[10,3,12,3],[10,4,12,4],[10,7,12,7],[11,5,12,5],[11,6,12,6],[10,5,10,6],[10,8,10,9]]}
[null,{"$f":"INDEX(dms_Worksheet_List,MATCH(dms_Model,dms_Model_List))","v":"HISTORICAL ANNUAL REPORTING - FINANCIAL YEARS"}]
[null,{"$f":"INDEX(dms_TradingNameFull_List,MATCH(dms_TradingName,dms_TradingName_List))","v":"Jemena Electricity"}]
[null,{"$f":"dms_Header_Span","v":"2011-12 to 2017-18"}]
[null,"3.6 QUALITY OF SERVICES"]
[]
[null,"Did the MAIFI parameter of the STPIS apply during the period?",null,null,null,"No","** IMPORTANT\nPlease ensure this question is answered correctly. Your response will affect other tables throughout this workbook and will determine which cells are grey and which are input cells. "]
[]
[]
[]
[null,"3.6.8 - NETWORK FEEDER RELIABILITY"]
[null,"Feeder ID / name","Description of the service area for the feeder","Feeder classification\n\n(drop down)","Number of distribution customers","Length of high voltage distribution lines",null,"Maximum demand\n(MVA)","Energy not supplied\n(MWh)",null,"Unplanned Outages",null,null,null,null,"Planned Outages",null,null,null,null,"Momentary feeder outages"]
[null,null,null,null,null,"Overhead","Underground",null,"Unplanned","Planned","Total number of unplanned outages","Unplanned customer minutes off-supply (SAIDI)",null,"Unplanned interruptions\n(SAIFI)",null,"Total number of planned outages","Planned customer minutes off-supply (SAIDI)",null,"Planned interruptions\n(SAIFI)",null,"Total number of momentary feeder outages","Momentary interruptions due to feeder outages (MAIFI)"]
[null,null,null,null,null,null,null,null,null,null,null,"Including excluded events and MEDs","After removing excluded events and MED","Including excluded events and MEDs","After removing excluded events and MED",null,"Including MEDs","After removing  MED","Including MEDs","After removing  MED",null,"Including excluded events and MEDs","After removing excluded events and MED"]
[null,"AW 01","Airport West","Urban",714,4.746985746,4.05865014875,8.9353879999999997,0.59520067332786486,0,5,7421,7421,59,59,0,0,0,0,0]
[null,"AW 02","Airport West","Urban",2395,11.03227221415,2.8883503415000003,10.154716000000001,13.682249991576382,0,12,464886,222232,6046,5104,0,0,0,0,0]
[null,"AW 03","Airport West","Urban",247.5,6.1185398612500004,3.8823488018000001,13.507868,1.0209290979894656,0,1,2521,2521,12,12,0,0,0,0,0]
[null,"AW 04","Airport West","Urban",1905,11.386291963499998,10.21534416235,11.678875999999999,14.067193749583236,3.7238914088433335E-2,5,362645,9288,1956,51,3,3200,3200,59,59]
[null,"AW 05","Airport West","Urban",534,4.9969074660000015,0.87238628120000006,7.9446840000000005,0.10373874465265305,4.2127408996001231E-3,2,1182,1182,18,18,1,160,160,4,4]
[null,"AW 06","Airport West","Urban",4700,16.6688924585,1.7038762149999997,10.554808000000001,2.0221261913043538,0.63975154680282842,9,177098,177098,940,940,5,186765,186765,631,631]
[null,"AW 07","Airport West","Urban",4446.5,17.620803380999995,5.4053489744999998,9.2211680000000005,1.0612201899169711,0.4495836779255124,13,99510,99510,797,797,8,140524,140524,349,349]
[null,"AW 08","Airport West","Urban",2309.5,14.399765443599998,7.7386134361500014,10.135664,1.0514201988145733,8.7391501932875787E-2,6,39165,39165,112,112,4,10851,10851,34,34]
[null,"AW 09","Airport West","Urban",2424,9.6476542219999981,6.8323584509499993,8.211412000000001,3.4220878384774052,6.9762230790729268E-2,10,178403,144449,2869,2802,3,12123,12123,55,55]
[null,"AW 11","Airport West","Urban",471.5,5.9977963619499999,3.7984761739999997,9.1640120000000014,7.1967017304382194E-2,0.57939652983243561,1,580,580,4,4,2,15565,15565,9,9]
[null,"AW 12","Airport West","Urban",1768.5,5.7086449527999994,6.46027757335,10.459547999999998,0.5784697876160223,0.36442497057399903,4,17361,17361,151,151,4,36457,36457,113,113]
[null,"AW 14","Airport West","Urban",1256,9.0157688529999973,4.8190800442000006,10.116612000000002,2.4358305100045405,5.6383411733688278E-3,3,36289,35568,1303,1302,1,280,280,2,2]
[null,"BD 01","Broadmeadows","Urban",1651.5,10.969855529500002,5.2005189484999992,10.0023,0.62144093865978534,9.6159685934032527E-2,3,16024,16024,86,86,2,8265,8265,30,30]
[null,"BD 02","Broadmeadows","Urban",1,0.87916227599999996,7.1699015000000005E-2,null,0,0,0,0,0,0,0,0,0,0,0,0]
[null,"BD 03","Broadmeadows","Urban",339.5,3.9922575918500005,5.2733309943999993,9.5641039999999986,0.24934273939780721,0,1,1123,1123,9,9,0,0,0,0,0]
[null,"BD 04","Broadmeadows","Urban",1035.5,8.8597235987999987,4.1407433215500005,13.507868,0.87913333758582834,0.62789499778868529,3,16195,16195,90,90,1,38556,38556,102,102]
[null,"BD 06","Broadmeadows","Urban",1,0.74939087900000001,7.98603705E-2,null,0,0,0,0,0,0,0,0,0,0,0,0]
[null,"BD 07","Broadmeadows","Urban",4614.5,25.035178342250003,2.0502877320000001,13.603127999999998,6.6813342913490734,0.49703668819851293,13,478855,478633,10092,10091,10,118743,118743,353,353]
[null,"BD 08","Broadmeadows","Urban",1837,10.69069375115,1.2845290149999997,8.5162439999999986,1.0283787307143875,0.18865783681059956,6,38155,38155,2118,2118,2,23332,23332,76,76]
[null,"BD 09","Broadmeadows","Urban",690,5.2725514264999997,1.2907575742500002,3.9247119999999995,0.11175581384579898,0,2,2960,2960,43,43,0,0,0,0,0]
[null,"BD 10","Broadmeadows","Urban",1087,6.5251384269999999,4.325371292949999,12.593372,0.22616032495878768,1.5539272773789399E-2,1,3362,3362,32,32,1,770,770,154,154]
[null,"BD 11","Broadmeadows","Urban",2749.5,10.0887640515,1.72015181035,8.1542560000000002,2.2853460998590025,8.7651546364930208E-2,5,102960,8500,198,78,5,13163,13163,47,47]
[null,"BD 13","Broadmeadows","Urban",679,10.897939480899998,3.0231640824000001,11.945603999999999,3.2335007169774048,0.31774859999442145,4,34751,34751,684,684,4,11383,11383,32,32]
[null,"BD 14","Broadmeadows","Urban",553,6.7413517350000003,2.9524154045,9.9451440000000009,1.5062396916043996E-2,0.45046420683496058,1,321,321,6,6,8,32000,32000,106,106]
[null,"BD 15","Broadmeadows","Urban",820.5,9.0561139425999979,1.62230407015,11.126367999999999,10.67078298675079,0.4992013037224905,8,101789,89066,346,332,5,15873,15873,39,39]
[null,"BD 16","Broadmeadows","Urban",156,5.8799625875000006,1.8615393680000001,6.687252,2.7363914694982793E-2,0.16348483502874825,0,94,94,1,1,3,1872,1872,38,38]
[null,"BY 11","Braybrook","Urban",3995.5,13.403088175500002,1.4244123369999999,7.8303719999999997,0.93166002220980815,0.21622995914482784,6,66464,66464,472,472,6,51419,51419,152,152]
[null,"BY 12","Braybrook","Urban",1224,4.6802952749945002,0.69791449851499987,2.5720200000000002,0.98487607276697464,8.3835910728771914E-3,2,56565,56565,1261,1261,2,1605,1605,5,5]
[null,"BY 13","Braybrook","Urban",763.5,2.9812612635000004,1.6089762076,11.716980000000001,1.7988233082926763,0,3,20688,20688,122,122,0,0,0,0,0]
[null,"BY 14","Braybrook","Urban",2917,12.036649342299999,3.1259193616499998,8.0589959999999987,0.46484656748581832,4.5177661094642921E-3,4,28275,28275,193,193,2,916,916,7,7]
[null,"BY 15","Braybrook","Urban",970.5,7.4397853439999988,2.9383411868500002,8.2304639999999996,2.9732895142532163,6.1403583455411574E-2,3,46921,46921,1930,1930,1,3230,3230,17,17]
[null,"CN 01","Coburg North","Urban",101.5,1.8693740912000001,0.31005538599999999,7.6970079999999994,0.51837245599813486,0,0,733,733,4,4,0,0,0,0,0]
[null,"CN 02","Coburg North","Urban",439,4.7862866542500004,0.90126416635000006,10.497652,5.5835653731837747,3.5941072221497925E-3,5,46606,46606,491,491,1,100,100,1,1]
[null,"CN 03","Coburg North","Urban",2431.5,8.1411713883499992,1.2962308141999999,3.9247119999999995,0.82614595416397829,0.11253545922458838,2,80384,80384,102,102,4,36499,36499,141,141]
[null,"CN 04","Coburg North","Urban",1362.5,7.4717574530000022,4.5597211155499995,8.8782320000000006,6.698992290682499,0.7095602272612247,4,115363,115363,1465,1465,5,40731,40731,142,142]
[null,"CN 05","Coburg North","Urban",3864,13.0713784975,1.6267775945,7.563644,7.9514679681728948,0.17056469304230609,14,656034,656034,10430,10430,10,46908,46908,254,254]
[null,"CN 06","Coburg North","Urban",2083.5,9.8708730844999995,1.3305153563999998,7.4874360000000006,3.499886972415271,0.49810978452347832,2,176562,11189,2142,63,10,83762,83762,336,336]
[null,"CN 07","Coburg North","Urban",5440.5,15.715279499500006,0.93190281600000002,8.8020239999999994,11.438046016825165,0.22484994403097941,6,990036,257281,11253,5588,10,64874,64874,259,259]
[null,"CN 08","Coburg North","Urban",1789.5,6.7080608824999999,0.501518507,5.0868840000000004,3.528655289252868,0.37339859084813531,5,271922,271922,3740,3740,3,95915,95915,249,249]
[null,"CN 09","Coburg North","Urban",49,2.4415851729999991,0.54085826780000001,4.9535199999999993,5.6250951127151545,0.44917031475144958,3,7390,7390,103,103,1,1967,1967,7,7]
[null,"CN 10","Coburg North","Urban",1896.5,6.4240429790000011,1.0682704940000001,7.5445919999999997,0.84242841415436642,0.20901382174171501,4,24507,9755,169,86,5,20268,20268,90,90]
[null,"CN 11","Coburg North","Urban",2456.5,8.9758228548000005,1.3564204905000001,8.1733080000000005,3.1613834087925254,8.9862148941997191E-2,5,213383,213383,3654,3654,2,20218,20218,62,62]
[null,"COO11","Coolaroo","Rural-short",1927.5,144.1057199315342,24.446673269800002,9.9451440000000009,5.3235136654539001,2.4051588090713105,23,154742,43826,482,374,34,233041,233041,649,649]
[null,"COO12","Coolaroo","Urban",718.5,0.26968668400000001,4.4331766549999987,6.3633679999999995,1.5749827138984394E-2,3.4217652181768869E-3,1,649,649,167,167,1,470,470,1,1]
[null,"COO13","Coolaroo","Urban",3902,6.2163966239999997,11.27506813375,9.5641039999999986,0.44972574897135437,7.7167249019752818E-2,7,40218,40218,328,328,4,23003,23003,72,72]
[null,"COO14","Coolaroo","Urban",3576.5,9.863386724599998,14.8275755177,9.8308320000000009,5.6540376919102339E-2,0,4,4190,4190,51,51,0,0,0,0,0]
[null,"CS 02","Coburg South","Urban",5633,14.5130748192,0.85803471725000002,10.021352,2.1658375813760022,2.5597498919503452E-2,14,227689,227689,2677,2677,3,8970,8970,46,46]
[null,"CS 03","Coburg South","Urban",3598,11.166272479,2.4615109224500005,7.0111359999999996,2.5490949605772992,4.8176558101970891E-2,7,187656,187351,2563,2562,7,11822,11822,48,48]
[null,"CS 05","Coburg South","Urban",4626.5,12.102753834,0.88225260800000005,8.8020239999999994,4.8723399998234838,0.3595225166930765,18,459832,459832,5558,5558,11,113101,113101,330,330]
[null,"CS 08","Coburg South","Urban",4527,12.113571225000003,3.3678466679999999,7.735112,2.8642574779478038,0.21559343942912668,6,235041,235041,4476,4476,3,58972,58972,162,162]
[null,"CS 12","Coburg South","Urban",2005,9.2007430850000027,0.83924050000000006,6.7253559999999997,3.2844599803991072,1.2405854909812514E-2,3,132799,132799,2075,2075,3,1672,1672,9,9]
[null,"CS 13","Coburg South","Urban",1987,5.5779526715000003,2.5977104999999998,6.7063040000000003,0.29134877746147059,4.8063985157350241E-2,4,15821,15821,130,130,2,8700,8700,33,33]
[null,"EP 02","East Preston","Urban",70,0.77182185800000003,0.47061966749999995,2.5205796,5.7650833563315747E-2,0,0,440,440,1,1,0,0,0,0,0]
[null,"EP 03","East Preston","Urban",93.5,1.0463329465,0.43905013849999996,1.3031568,0.51233370023267633,0,1,6856,6856,92,92,0,0,0,0,0]
[null,"EP 04","East Preston","Urban",20,1.1279763295,0.36855857149999999,1.0402392,1.9315927590228214E-2,0,0,72,72,1,1,0,0,0,0,0]
[null,"EP 07","East Preston","Urban",44.5,1.9123600000000001,0.71926699999999988,2.4348455999999996,0,0,0,0,0,0,0,0,0,0,0,0]
[null,"EP 09","East Preston","Urban",259,2.5671407917,0.72438591699999999,3.6808463999999996,2.1647469338122889,1.0164646107935767E-2,5,26834,26834,412,412,1,420,420,1,1]
[null,"EP 11","East Preston","Urban",519.5,3.8501293580000002,0.55208352250000003,2.3091023999999996,6.5933956084063272E-2,1.389959074204577E-2,2,3145,3145,21,21,2,2210,2210,5,5]
[null,"EP 16","East Preston","Urban",58,1.9508969999999999,0.15031,3.2407451999999997,0.84720524283958798,0,1,2773,2773,60,60,0,0,0,0,0]
[null,"EP 17","East Preston","Urban",128,1.0204199434999999,0.65900572300000004,3.4579379999999995,2.7446808772322188E-2,0,0,167,167,1,1,0,0,0,0,0]
[null,"EP 18","East Preston","Urban",16.5,1.2699707505,0.59092005749999998,1.5889367999999999,0,0,0,0,0,0,0,0,0,0,0,0]
[null,"EP 20","East Preston","Urban",256,2.4001655228000001,0.17213407149999999,3.4579379999999995,2.112168232027261,0,2,30106,30106,114,114,0,0,0,0,0]
[null,"EP 27","East Preston","Urban",1,2.5000000000000001E-2,0.95176195500000005,null,0,0,0,0,0,0,0,0,0,0,0,0]
[null,"EP 34","East Preston","Urban",1436,5.7977921217499997,0.75203704199999999,2.5891668000000001,0.23071873408764895,3.2120354962480488E-2,1,23012,23012,97,97,2,10679,10679,48,48]
[null,"EP 35","East Preston","Urban",31,1.8741275183499999,0.39832812480000002,2.7892127999999996,4.0672464482042051E-2,0,0,64,64,1,1,0,0,0,0,0]
[null,"EP 36","East Preston","Urban",940,5.3175816510000002,0.15033097449999999,1.9032947999999998,5.6807451788371308E-2,2.4508769243565588E-2,3,4339,4339,162,162,2,6240,6240,18,18]
[null,"EP 37","East Preston","Urban",788.5,3.6317332392500004,0.30943776099999998,2.9606808,0.21568549111851915,0,1,8406,8406,131,131,0,0,0,0,0]
[null,"EP 41","East Preston","Urban",56.5,1.4022288155,0.51623616550000007,2.7320567999999996,2.8361148654806434,4.3977730509035293E-2,3,9480,9480,39,39,1,490,490,2,2]
[null,"EP 42","East Preston","Urban",308.5,2.6653113838500002,0.51996474050000008,3.1550112000000001,0.23926173119210004,0,1,3800,3800,24,24,0,0,0,0,0]
[null,"ES 01","Essendon","Urban",1752,4.3301918829999995,0.54003212400000011,5.6298659999999998,5.3637240044854506,5.93015739342014E-2,3,332126,42345,1900,148,2,12240,12240,57,57]
[null,"ES 02","Essendon","Urban",1496.5,5.0185374879999998,0.72189533019999996,2.9530599999999998,8.3964939986243936E-2,0.1038426092194772,1,6051,6006,76,75,5,24945,24945,112,112]
[null,"ES 03","Essendon","Urban",2619,7.5661644292000005,0.51849818719999996,5.9632759999999996,6.4083109950061196E-2,0.13351776925113171,1,5203,4856,49,48,2,36135,36135,117,117]
[null,"ES 06","Essendon","Urban",2042.5,5.7294469670000003,1.960913927,4.9630459999999994,0.25740487486284913,0.11309145685132398,7,16863,16863,218,218,1,24696,24696,63,63]
[null,"ES 07","Essendon","Urban",1311,4.0018958654999999,0.29272851350000001,3.1054759999999995,0.69519195461766137,0.19881385525578327,2,47967,47967,302,302,4,45726,45726,109,109]
[null,"ES 11","Essendon","Urban",1550.5,3.4282710628500004,0.55098508050000006,5.353612,3.0364138675948795,0,5,177733,12573,1663,115,0,0,0,0,0]
[null,"ES 12","Essendon","Urban",1164.5,2.7583899999999999,1.7989554999999999,3.9913939999999997,0.19657106518924242,8.8803356061812957E-3,1,10811,10811,32,32,1,1628,1628,11,11]
[null,"ES 13","Essendon","Urban",1828.5,4.1903873955000002,1.05139506345,5.3250339999999996,0.18988562595698458,4.0469021726117493E-2,1,9769,9769,58,58,2,6940,6940,29,29]
[null,"ES 14","Essendon","Urban",971.5,3.889081247,1.729541006,4.7248959999999993,3.6411820700307199E-2,9.2623617633961156E-3,0,1519,1519,10,10,1,1288,1288,4,4]
[null,"FE 05","Footscray","Urban",3023.5,8.3839099145000002,0.81757443511000005,5.7918079999999996,5.9013160350108125,0.17295701446167575,11,463754,463754,9645,9645,11,45306,45306,172,172]
[null,"FE 06","Footscray","Urban",4153,10.408810215800001,7.3080952775000005,10.726276,2.9809688266291987,0.13446960197645061,15,151698,151698,9067,9067,7,22810,22810,92,92]
[null,"FE 08","Footscray","Urban",2279,3.8014570675000003,4.7696184027499999,9.7927280000000003,4.4584174503891241,0.22212984999713417,9,149643,149586,7130,7129,6,24852,24852,70,70]
[null,"FE 09","Footscray","Urban",3990.5,7.8750350665000006,1.0788265969999999,5.52508,2.6331080828647448,0.24051722270473244,20,243400,243400,13251,13251,6,74110,74110,249,249]
[null,"FF 87","Fairfield","Urban",1003.5,2.6377528369999999,0.23890166750000003,2.0519004000000001,4.249504345192566E-2,6.0878997516907993E-2,0,2827,2827,16,16,3,13500,13500,69,69]
[null,"FF 88","Fairfield","Urban",1185,3.9798661505000004,0.35816522750000002,1.9947443999999999,0.87431085034680933,0,2,79042,79042,1200,1200,0,0,0,0,0]
[null,"FF 89","Fairfield","Urban",353,3.9285583585000001,0.72827401650000012,2.3319647999999997,0.14544043292533118,0,1,3310,3310,20,20,0,0,0,0,0]
[null,"FF 90","Fairfield","Urban",1036,3.4206502430499999,0.391896578,2.3834052000000003,0.26731055315092372,6.0818965686288149E-3,2,18618,18618,140,140,2,1412,1412,67,67]
[null,"FF 95","Fairfield","Urban",1615.5,4.7947275860000005,6.2385999650000003E-2,2.6577539999999997,7.8075621060792966E-2,0.30196399570910681,1,7561,7561,57,57,5,97476,97476,280,280]
[null,"FF 96","Fairfield","Urban",1002,3.6903725889999999,0.38782771259999999,1.9718819999999999,0.86964861673943505,0.36509952239559001,2,79857,79857,110,110,8,111753,111753,389,389]
[null,"FT 01","Flemington","Urban",3758,7.0521462164999988,2.5189103669000001,5.8108599999999999,1.1245701141616971,7.6209032076164933E-4,4,106246,106246,3846,3846,1,240,240,1,1]
[null,"FT 02","Flemington","Urban",280,1.589863018,5.3804925335650005,2.8101700000000003,0.64941636895428667,0,2,9755,9755,42,42,0,0,0,0,0]
[null,"FT 04","Flemington","Urban",1017.5,2.8502798235000002,2.1875689546700001,4.2390699999999999,1.5187184551255235,0,1,55956,55956,1021,1021,0,0,0,0,0]
[null,"FT 05","Flemington","Urban",2375.5,4.9018561530000007,2.01908571325,3.8103999999999996,5.8977165800403561,0,4,485057,485057,6299,6299,0,0,0,0,0]
[null,"FT 06","Flemington","Urban",533,0.8172596755,1.2524289131500002,2.210032,0.66298960242271987,0.18681226572594173,2,25297,25297,557,557,1,23760,23760,80,80]
[null,"FT 09","Flemington","Urban",1648.5,2.7723283025000001,3.1181103255999996,4.5820060000000007,0.35452330053979325,0,3,15974,15974,79,79,0,0,0,0,0]
[null,"FT 10","Flemington","Urban",2062.5,4.2496859647500003,1.7089610631000003,3.4388859999999997,0.23513708572670999,0.13836634979658091,1,17558,17558,66,66,3,34440,34440,111,111]
[null,"FT 13","Flemington","Urban",1746,3.0072458625000005,5.5609685417999994,5.2964560000000001,2.1137869178558391,0.10823295605212034,3,128517,128517,2011,2011,1,21935,21935,107,107]
[null,"FT 14","Flemington","Urban",1380.5,1.8294165055,1.7595970755500003,4.0009199999999998,2.0199592358897065,6.2302175184578649E-3,4,85594,85594,2772,2772,1,880,880,4,4]
[null,"FT 15","Flemington","Urban",90,0.12832941250000002,0.94081835849999995,3.2388400000000002,1.526270519433687,0,1,5011,5011,91,91,0,0,0,0,0]
[null,"FW 04","Footscray West","Urban",1364,5.5680140235,1.1945622634499999,8.078047999999999,5.0710520419217628,9.7651044010754959E-2,2,111079,111079,748,748,3,7130,7130,26,26]
[null,"FW 05","Footscray West","Urban",2711,7.6165254835000002,1.10879242635,3.7722959999999999,1.877544818595325,0.18868326298458765,5,190831,190831,2906,2906,3,63925,63925,181,181]
[null,"FW 06","Footscray West","Urban",941.5,5.6112198800000002,2.6738750144999996,4.8201559999999999,2.8184489415106948,2.9987774337584833E-2,3,84165,84165,1570,1570,3,2985,2985,18,18]
[null,"FW 08","Footscray West","Urban",2876.5,8.3240989832449976,0.8911096167,7.3159679999999998,5.2205135860572005,0.53647760758652407,6,309983,309983,3151,3151,10,106183,106183,295,295]
[null,"FW 09","Footscray West","Urban",1424.5,9.0521503935500007,3.8254834439999996,9.6403119999999998,1.9397168559612763,0.47989780678527683,9,35468,35468,160,160,5,29250,29250,90,90]
[null,"FW 13","Footscray West","Urban",470.5,5.1400431740499997,0.64211742630000002,10.688172,1.8214926612527516,3.4183345609509965,2,10620,10620,62,62,7,66434,66434,172,172]
[null,"FW 16","Footscray West","Urban",2535,9.1724263627000013,0.24001824999999999,4.0390239999999995,2.9224107820525549,0.3114672989341486,7,208485,208485,3031,3031,4,74067,74067,282,282]
[null,"FW 17","Footscray West","Urban",2218,8.6123635324999999,0.30233966700000003,3.4674640000000001,2.3955045083914617,5.6620812383054657E-2,5,235697,235697,1878,1878,3,18570,18570,115,115]
[null,"HB 05","Heidelberg","Urban",1640,5.2954574329999993,2.004518279,4.5057979999999995,7.7176311369240809,0.58641537982447811,8,413551,413170,5152,5151,6,104744,104744,287,287]
[null,"HB 06","Heidelberg","Urban",1467,5.2099699402499997,0.42823370849999998,3.3341000000000003,0.21734411145867341,4.72449518271887E-2,4,17555,17555,171,171,1,12720,12720,53,53]
[null,"HB 08","Heidelberg","Urban",750.5,1.510292379,0.52457115450000003,3.6484580000000002,2.4547604246256811E-2,0,1,751,751,4,4,0,0,0,0,0]
[null,"HB 09","Heidelberg","Urban",1140.5,5.0092401217500004,0.89943142300000001,3.6198799999999998,1.5805094101546335,1.2956234149341876E-3,3,73193,73193,1286,1286,1,200,200,2,2]
[null,"HB 10","Heidelberg","Urban",905,6.3918063380000003,0.39087725249999999,3.0197419999999999,0.18842900856037201,0.27698221085738889,1,9386,9386,79,79,4,45990,45990,148,148]
[null,"HB 12","Heidelberg","Urban",2486,9.3560599250000003,1.00066776,5.7537039999999999,3.5346726538080944,0.38009131790569267,6,259192,259192,4006,4006,11,92905,92905,271,271]
[null,"HB 13","Heidelberg","Urban",514,2.0697705900000001,0.56980613799999991,2.90543,0.66826412642939192,0,1,18009,18009,92,92,0,0,0,0,0]
[null,"NH 02","North Heidelberg","Urban",4253.5,16.277111381900006,4.1091828300000008,8.325724000000001,0.61718592990446874,0.49948321667116508,6,54524,54421,462,461,8,147086,147086,667,667]
[null,"NH 03","North Heidelberg","Urban",1270,9.1502606735500027,0.77920712175000006,7.6589040000000006,8.4397314447158003,0.84258954930384933,7,254364,254364,2818,2818,14,84649,84649,370,370]
[null,"NH 05","North Heidelberg","Urban",4744.5,16.619846251000006,1.0434868934999999,6.7253559999999997,2.7311303785398993,7.8814076621597937E-2,11,307925,307925,5868,5868,3,29620,29620,123,123]
[null,"NH 08","North Heidelberg","Urban",2605.5,11.638135645649999,1.33146597565,4.9535199999999993,4.4422602882048361,2.0834111129751531E-2,5,446100,446100,6856,6856,2,6974,6974,23,23]
[null,"NH 09","North Heidelberg","Urban",629,6.4808444817099993,1.2722445885,9.4688439999999989,0.69344505385459365,0.35169837910143592,3,8083,8083,58,58,2,13665,13665,40,40]
[null,"NH 12","North Heidelberg","Urban",18,0.15001085,4.0328409999999995,5.3726639999999994,0,0,0,0,0,0,0,0,0,0,0,0]
[null,"NH 13","North Heidelberg","Urban",855.5,2.2040607465000002,2.3792831129999996,5.7537039999999999,2.8448355841136523,4.3899812242859326E-2,1,48991,48991,868,868,1,2520,2520,12,12]
[null,"NH 16","North Heidelberg","Urban",2493.5,7.1769829999999999,4.4796475000000004,7.792268,1.2264764363289875,0.28157478965224808,4,59276,59276,251,251,6,45362,45362,178,178]
[null,"NH 17","North Heidelberg","Urban",1465.5,6.916129999999999,2.1445315000000003,5.5631839999999997,0.38042510635275989,8.8772412036909137E-2,2,13544,13544,163,163,1,10535,10535,49,49]
[null,"NH 20","North Heidelberg","Urban",1904.5,7.558061010714999,2.1936930700000001,7.7541639999999994,4.6283084985732463,0.62429120986472986,4,179439,179439,2131,2131,10,80679,80679,343,343]
[null,"NS 07","North Essendon","Urban",914,3.689922599,1.3939465582000001,4.1247579999999999,4.3595704010081678E-2,0,2,1437,1437,11,11,0,0,0,0,0]
[null,"NS 08","North Essendon","Urban",1152,2.9396609255000001,0.26123234225000003,2.5243900000000004,0.44898345828231534,5.1497082917563691E-2,1,30006,30006,123,123,1,11472,11472,24,24]
[null,"NS 09","North Essendon","Urban",964.5,3.6596114495000003,1.07887148635,4.3819600000000003,0.16949385851795282,0,1,5790,5790,44,44,0,0,0,0,0]
[null,"NS 11","North Essendon","Rural-short",0,0,4.86123745E-2,null,0,0,0,0,0,0,0,0,0,0,0,0]
[null,"NS 12","North Essendon","Urban",1292.5,3.6782210120000003,1.1701517758,3.1340539999999999,1.4856312866613727E-2,0,1,1302,1302,20,20,0,0,0,0,0]
[null,"NS 14","North Essendon","Urban",2915,5.6115958275000004,1.2613047767999999,4.534376,2.1918380027091215,0,2,265897,265897,5643,5643,0,0,0,0,0]
[null,"NS 15","North Essendon","Urban",1539.5,4.4248147517500005,1.11394265745,4.1723879999999998,0.83378774712239978,0.16344011552168372,3,46120,46120,163,163,2,30135,30135,81,81]
[null,"NS 16","North Essendon","Urban",707,3.1976440470000003,0.42096820305000004,1.6194200000000001,5.5183121216306669E-2,0,1,4539,4539,39,39,0,0,0,0,0]
[null,"NS 17","North Essendon","Urban",824.5,3.5757449884999999,0.51147705215000006,2.1338240000000002,1.7243006124886142,0,2,113530,113530,877,877,0,0,0,0,0]
[null,"NS 18","North Essendon","Urban",1753,3.45,2.6150000000000002,5.2011959999999995,0.40305136293166616,0,4,18291,18291,122,122,0,0,0,0,0]
[null,"NT 01","Newport","Urban",2,0.66909923650000003,5.6252296860000008,null,4.6362743866745424,0,1,249,249,1,1,0,0,0,0,0]
[null,"NT 03","Newport","Urban",3117.5,11.668869291850001,3.6909187699499997,9.9070399999999985,4.810999295810638,0.91026323387672992,7,274330,274330,3577,3577,12,173015,173015,542,542]
[null,"NT 04","Newport","Urban",1907.5,3.4820050214999991,1.9595067949999998,9.5450520000000001,2.8969779201496646,4.9340708714740736E-2,5,93531,93477,2007,2006,2,5310,5310,19,19]
[null,"NT 10","Newport","Urban",64,1.8915440025000001,0.83205812364999998,2.210032,0.70463126656413344,2.0150426507859212E-2,1,2780,2780,33,33,1,265,265,1,1]
[null,"NT 11","Newport","Urban",2752,7.9803515158499989,1.9983453034999998,5.2583519999999995,0.73895616472102543,4.7545349719538206E-4,4,58283,58283,490,490,1,125,125,1,1]
[null,"NT 15","Newport","Urban",2360,5.0715699999999995,2.3418800000000002,3.9437640000000003,7.8971484382191509E-2,4.8539158423014503E-3,3,9835,9835,103,103,2,2015,2015,8,8]
[null,"NT 16","Newport","Urban",206.5,2.940237717,1.60954371125,5.4298199999999994,0.63741146830719053,0,2,12183,12183,105,105,0,0,0,0,0]
[null,"NT 17","Newport","Urban",3551,9.2492522189999988,3.5478574725000005,7.9256319999999993,4.3560038444736247,5.1607173712355974E-3,6,303865,303865,5314,5314,1,1200,1200,4,4]
[null,"P  55","Preston","Urban",39,0.809619643,0.39126970500000002,2.1376344,0,1.0737402041166659,0,0,0,0,0,1,18900,18900,35,35]
[null,"P  56","Preston","Urban",2,2.0494275750000002,0.25768540750000002,null,0.96810679682041756,0,1,601,601,2,2,0,0,0,0,0]
[null,"P  57","Preston","Urban",245,1.7817875895000002,0.28091389050000004,1.0631016,0.23893947465607379,0.13784023298113393,1,11070,11070,102,102,6,21287,21287,70,70]
[null,"P  59","Preston","Urban",840,2.5,1.7250000000000001,2.4519924,8.366124341426617E-3,0.13725381767358708,0,593,593,6,6,4,32429,32429,89,89]
[null,"P  60","Preston","Rural-short",206,0.99598200000000014,3.6130555139999965E-2,0.19433039999999999,5.1833388304537552E-3,1.451495347413443E-2,0,1292,1292,2,2,1,12060,12060,36,36]
[null,"P  61","Preston","Urban",520.5,0.61724499999999993,0.32402999999999998,1.5946524,0.26086523821035384,0.40744119376173499,2,19779,19779,99,99,26,102975,102975,626,626]
[null,"P  62","Preston","Urban",694.5,2.010885,0.88612499999999994,3.3036167999999999,5.0698452026489614E-2,0.20051738535346095,1,1873,1873,8,8,5,24693,24693,98,98]
[null,"P  63","Preston","Urban",829,2.8281271265000001,0.1495753175,2.1947904,2.9620299076912545E-2,0,0,1856,1856,5,5,0,0,0,0,0]
[null,"P  65","Preston","Urban",256.5,0.40799853249999996,0.1295381813,1.0116612,3.0574461096112421E-3,0.46519891848321049,0,108,108,1,1,4,54775,54775,140,140]
[null,"P  66","Preston","Urban",1000,2.8001230672249999,0.70654832850000004,3.4693692,0.8342846044319091,1.2284425577864209,4,36719,36468,315,314,18,180223,180223,811,811]
[null,"PV 02","Pascoe Vale","Urban",429.5,2.6033300000000001,1.614916,2.1338240000000002,0.38634701275188432,1.3949344109674739E-2,2,13959,13959,33,33,1,1680,1680,4,4]
[null,"PV 03","Pascoe Vale","Urban",1697.5,5.39,0.36,3.0673719999999998,0.19047698081868644,0.11714835355809503,1,18248,18248,1711,1711,1,37410,37410,87,87]
[null,"PV 04","Pascoe Vale","Urban",3041.5,10.058364999999998,0.48529849999999997,4.5153239999999997,0.13435072012110696,4.5978918667764081E-2,1,14705,14705,49,49,1,16775,16775,61,61]
[null,"PV 05","Pascoe Vale","Urban",2728,10.056520000000003,0.93247999999999998,5.0106760000000001,4.9599444592869366,1.545317983978008E-2,4,466524,466524,2854,2854,1,4845,4845,19,19]
[null,"PV 06","Pascoe Vale","Urban",2303.5,8.18,0.16,4.2676480000000003,1.6981278348202231,0,2,155008,154752,2410,2409,0,0,0,0,0]
[null,"PV 07","Pascoe Vale","Urban",2459,9.8827940250000026,0.40808093849999999,5.0868840000000004,2.9473300181082891,5.6390421171208849E-2,4,315951,18765,2560,100,3,20150,20150,79,79]
[null,"PV 08","Pascoe Vale","Urban",1235,5.5919400000000001,0.18026049999999999,2.5148640000000002,0.20010487543934552,0.10484947240486255,2,14746,14746,1286,1286,3,25755,25755,79,79]
[null,"PV 09","Pascoe Vale","Urban",1619,6.8901399999999988,0.53242499999999993,4.0961800000000004,0.38389521957824146,0,3,21276,20423,1673,1672,0,0,0,0,0]
[null,"PV 11","Pascoe Vale","Urban",1887,5.8049999999999997,1.47,4.3152780000000002,1.0031140548071973,9.8599481166251737E-2,3,57248,31933,332,156,3,18757,18757,55,55]
[null,"SA 02","St Alban","Rural-short",61,15.085017082999999,0,0.51440399999999997,1.8756093985547164,0.26175044430283956,6,40124,40124,122,122,3,18665,18665,55,55]
[null,"SA 06","St Alban","Rural-short",144,4.309920353499999,1.2014705194999999,0.60966399999999998,4.006132016331819E-2,1.4982511301852564E-2,1,1707,1707,29,29,2,2128,2128,24,24]
[null,"SA 10","St Alban","Rural-short",43,0.63,0.64,3.8103999999999999E-2,2.0866533051102587E-2,0,2,4248,4248,57,57,0,0,0,0,0]
[null,"SA 12","St Alban","Urban",1816,1.0824254664999999,6.1887671964999997,4.3819600000000003,5.5776633258903217E-3,0.29571246125047579,0,417,417,2,2,5,73694,73694,423,423]
[null,"SBY11","Sunbury","Rural-short",2443,62.067407668134997,10.559579787799999,6.1728480000000001,7.8397252404982218,0.19036019669227108,36,456360,456360,5762,5762,14,36937,36937,130,130]
[null,"SBY14","Sunbury","Rural-short",4054.5,95.087525735100002,22.902011524317494,10.821536,9.7977937874007193,0.87166275295603812,24,573622,210432,8264,4210,23,170108,170108,659,659]
[null,"SBY31","Sunbury","Urban",2096,6.8105454280000011,7.9061694482499991,6.7825119999999997,0.50054950561394118,1.2736758475180092,7,21268,21268,119,119,3,180392,180392,319,319]
[null,"SBY32","Sunbury","Rural-short",2810,121.72601492350003,10.392226338650001,5.3917160000000006,7.2781533456075609,1.1900655058269665,45,531416,527996,2473,2453,35,289643,289643,907,907]
[null,"SBY33","Sunbury","Urban",3516.5,18.304925151359996,3.3432945642399998,7.2397599999999995,0.85920227045885078,0,15,74149,74149,581,581,0,0,0,0,0]
[null,"SHM11","Sydenham","Rural-short",1018,64.467136991000004,1.9174365524999999,2.7815919999999998,0.74270778870042686,2.1939828682609335,14,35190,35190,296,296,24,346508,346508,1187,1187]
[null,"SHM12","Sydenham","Urban",2821.5,4.7601299200000007,14.03671957525,7.6207999999999991,0.26011181487874774,1.4285720649912013E-2,2,17698,17698,163,163,1,3240,3240,8,8]
[null,"SHM14","Sydenham","Rural-short",3681.5,18.958504683000001,20.949082808850001,9.2592719999999993,8.3384386028831319,0.33436155359518571,11,564862,564862,7544,7544,6,75501,75501,251,251]
[null,"SHM21","Sydenham","Urban",4805,3.8824900000000002,19.449071999999997,8.6686599999999991,0.3751327876960609,0,5,34198,34198,223,223,0,0,0,0,0]
[null,"ST 11","Somerton","Urban",171.5,7.2406633360000008,3.2388409330000001,7.3731239999999998,0.4677362191201348,0.23957220979323979,1,1435,1435,6,6,3,2450,2450,9,9]
[null,"ST 12","Somerton","Urban",237.5,14.7689920035385,3.1320816583499997,9.1830639999999999,2.2305093293853773,4.2340723792433137E-2,1,7902,7902,15,15,1,500,500,2,2]
[null,"ST 13","Somerton","Urban",186,4.8859171650000004,4.3089267928500004,6.1537960000000007,0.17191427330585216,0.43998474248407082,1,772,772,9,9,3,6586,6586,17,17]
[null,"ST 14","Somerton","Urban",40,0,4.1369857810999999,6.3824199999999998,0,0,0,0,0,0,0,0,0,0,0,0]
[null,"ST 21","Somerton","Rural-short",1.5,0.197551587,2.4554536552500004,null,0,0,0,0,0,0,0,0,0,0,0,0]
[null,"ST 22","Somerton","Urban",6240.5,18.264195000000001,32.289590000000004,16.289459999999998,15.634730559293681,0.48459939587361334,8,929161,929161,7117,7117,14,95998,95998,481,481]
[null,"ST 23","Somerton","Urban",141,7.9316736219999999,3.4977252767499998,12.498112000000001,4.0648998722840526,0.12473876860881408,2,6159,6159,145,145,1,630,630,3,3]
[null,"ST 24","Somerton","Urban",1,0,3.7624464340500001,null,0,0,0,0,0,0,0,0,0,0,0,0]
[null,"ST 31","Somerton","Urban",1,0,0.61837395000000006,null,0,0,0,0,0,0,0,0,0,0,0,0]
[null,"ST 32","Somerton","Urban",6524,12.279799021000001,22.61607391750001,11.450252000000001,3.2454639464122352,0.27907488134546277,8,318633,318633,6521,6521,11,91330,91330,274,274]
[null,"ST 33","Somerton","Urban",3335,7.1549999999999994,8.8149999999999995,7.2016559999999998,0.83888163728697185,0.39874896670618648,5,59730,59730,1127,1127,17,94639,94639,329,329]
[null,"ST 34","Somerton","Urban",268,7.1914487410000003,6.7653479412999999,10.364288,7.7792791684803317,2.7053616671303616E-2,2,29934,29934,292,292,1,347,347,1,1]
[null,"TH 11","Tottenham","Urban",60,3.0985768120000001,0.83015052249999999,5.6203400000000006,1.8380512402896263,0.63467942766580543,2,3298,3298,63,63,4,3796,3796,19,19]
[null,"TH 12","Tottenham","Urban",27,3.4804483525099998,0.57817421685000003,10.421443999999999,8.7266311580029772,0,3,4001,4001,39,39,0,0,0,0,0]
[null,"TH 13","Tottenham","Urban",56.5,3.2152628887499999,0.50085734805000004,5.8680160000000008,8.949226058555956,1.8802918042138415,4,10409,10409,67,67,2,7290,7290,25,25]
[null,"TH 14","Tottenham","Rural-short",0.5,0,7.1505170000000007E-2,null,0,0,0,0,0,0,0,0,0,0,0,0]
[null,"TH 21","Tottenham","Urban",176,7.3882393059999991,1.4223976555000002,19.052,3.9974459032307768,5.3027343614285807E-2,3,17640,6526,200,22,4,780,780,6,6]
[null,"TH 22","Tottenham","Urban",870,8.7387598222499996,2.6610693987200005,5.8870680000000002,1.5827582136717304,0.49079626694364292,4,45167,45167,291,291,9,46686,46686,223,223]
[null,"TH 23","Tottenham","Rural-short",2,0,6.7930347500000016E-2,null,0,0,0,0,0,0,0,0,0,0,0,0]
[null,"TH 24","Tottenham","Rural-short",0.5,0,6.7517905000000003E-2,null,0,0,0,0,0,0,0,0,0,0,0,0]
[null,"TT 03","Thomastown","Urban",4247.5,14.472501542035003,3.9992173170500003,10.669119999999999,11.684252014365686,0.11918184880803641,8,715691,714698,11360,11359,6,24334,24334,92,92]
[null,"TT 08","Thomastown","Urban",2434.5,12.23821058675,1.5512647308000003,6.6491479999999994,4.026706642311364,1.2520893366322391E-2,5,216211,216211,2763,2763,2,2241,2241,4,4]
[null,"TT 10","Thomastown","Urban",4321,13.239329241410001,0.632429617,7.563644,3.6456631624244071,8.002300501937186E-2,11,277624,277624,10066,10066,2,20313,20313,74,74]
[null,"TT 11","Thomastown","Urban",3874.5,16.764781130499998,1.0054168402500001,6.57294,1.5954625909307774,0.15702455530194095,8,133245,133092,3821,3820,5,43713,43713,233,233]
[null,"WT 04","Watsonia","Urban",139.5,3.2217148740850003,1.410994605,2.1147719999999999,7.8986041784099417E-2,1.9637413703229134E-2,0,724,724,3,3,1,600,600,2,2]
[null,"YTS01","Yarraville","Rural-short",2530,7.877607145499999,14.015575919200003,4.7629999999999999,3.7723712565202638,7.0850545659481609E-2,5,282726,282726,5121,5121,1,17700,17700,118,118]
[null,"YTS02","Yarraville","Urban",132.5,1.7422838525000002,1.0577741647500001,4.7058439999999999,5.3698161417969251E-2,0.39776415865162412,1,162,162,1,1,2,4000,4000,32,32]
[null,"YTS03","Yarraville","Urban",575.5,4.7110231999999996,2.4714023190000001,6.5348360000000003,0.89727974133267874,9.589754872757196E-2,3,10835,10835,52,52,2,3860,3860,16,16]
[null,"YTS04","Yarraville","Urban",774,3.3500262425800003,1.5228812997119998,4.2104920000000003,1.3591152201315102,1.4805040016202925E-2,3,38997,38997,840,840,1,1416,1416,8,8]
[null,"YTS05","Yarraville","Urban",1,7.7022762500000008E-3,0.82810085550000001,null,0,0,0,0,0,0,0,0,0,0,0,0]
[null,"YTS06","Yarraville","Urban",862,7.9801936947499996,1.0252492289999999,3.753244,3.9318892204877005,0.67567876663090154,6,134449,134449,1482,1482,8,77015,77015,213,213]
[null,"YTS07","Yarraville","Rural-short",194,2.1289625299999999,5.8143474597500013,1.352692,4.7190829291160466E-3,6.9208721929007622E-2,0,140,140,1,1,2,6844,6844,28,28]
[null,"YTS08","Yarraville","Urban",504.5,6.280715829,5.1091384550000001,3.867556,3.2066037413976791,0,5,59129,59129,677,677,0,0,0,0,0]
[null,"YTS10","Yarraville","Urban",1,0,0.632324,null,0,0,0,0,0,0,0,0,0,0,0,0]
[]
[]
[]
[]
[]
[]
[]
[]
[]
[]
[]
[]
[]
[]
[]
[]
[]
[]
[]
[]
[]
[]
[]
[]
[]
[]
[]
[]
[]
[]
[]
[]
[]
[]
[]
[]
[]
[]
[]
[]
[]
[]
[]
[]
[]
[]
[]
[]
[]
[]
[]
[]
[]
[]
[]
[]
[]
[]
[]
[]
[]
[]
[]
[]
[]
[]
[]
[]
[]
[]
[]
[]
[]
[]
[]
[]
[]
[]
[]
[]
[]
[]
[]
[]
[]
[]
[]
[]
[]
[]
[]
[]
[]
[]
[]
[]
[]
[]
[]
[]
[]
[]
[]
[]
[]
[]
[]
[]
[]
[]
[]
[]
[]
[]
[]
[]
[]
[]
[]
[]
[]
[]
[]
[]
[]
[]
[]
[]
[]
[]
[]
[]
[]
[]
[]
[]
[]
[]
[]
[]
[]
[]
[]
[]
[]
[]
[]
[]
[]
[]
[]
[]
[]
[]
[]
[]
[]
[]
[]
[]
[]
[]
[]
[]
[]
[]
[]
[]
[]
[]
[]
[]
[]
[]
[]
[]
[]
[]
[]
[]
[]
[]
[]
[]
[]
[]
[]
[]
[]
[]
[]
[]
[]
[]
[]
[]
[]
[]
[]
[]
[null,null,null,null,null,null,null,null,null,null,null,null,null,null,null,null,null,null,null,null,null,null," "]

{"sheet":"3.6.8 Network-feeders (2012-13)","index":11,"n_rows":421,"n_cols":23,"rows_kept":421,"cut":false,"hidden":false,"merged":[[10,10,10,14],[10,15,10,19],[10,20,10,22],[11,5,12,5],[11,6,12,6],[11,8,12,8],[11,9,12,9],[11,10,12,10],[11,11,11,12],[11,13,11,14],[11,15,12,15],[11,16,11,17],[11,18,11,19],[11,20,12,20],[11,21,11,22],[5,1,5,4],[5,6,5,8],[10,1,12,1],[10,2,12,2],[10,3,12,3],[10,4,12,4],[10,5,10,6],[10,7,12,7],[10,8,10,9]]}
[null,{"$f":"INDEX(dms_Worksheet_List,MATCH(dms_Model,dms_Model_List))","v":"HISTORICAL ANNUAL REPORTING - FINANCIAL YEARS"}]
[null,{"$f":"INDEX(dms_TradingNameFull_List,MATCH(dms_TradingName,dms_TradingName_List))","v":"Jemena Electricity"}]
[null,{"$f":"dms_Header_Span","v":"2011-12 to 2017-18"}]
[null,"3.6 QUALITY OF SERVICES"]
[]
[null,"Did the MAIFI parameter of the STPIS apply during the period?",null,null,null,"No","** IMPORTANT\nPlease ensure this question is answered correctly. Your response will affect other tables throughout this workbook and will determine which cells are grey and which are input cells. "]
[]
[]
[]
[null,"3.6.8 - NETWORK FEEDER RELIABILITY"]
[null,"Feeder ID / name","Description of the service area for the feeder","Feeder classification\n\n(drop down)","Number of distribution customers","Length of high voltage distribution lines",null,"Maximum demand\n(MVA)","Energy not supplied\n(MWh)",null,"Unplanned Outages",null,null,null,null,"Planned Outages",null,null,null,null,"Momentary feeder outages"]
[null,null,null,null,null,"Overhead","Underground",null,"Unplanned","Planned","Total number of unplanned outages","Unplanned customer minutes off-supply (SAIDI)",null,"Unplanned interruptions\n(SAIFI)",null,"Total number of planned outages","Planned customer minutes off-supply (SAIDI)",null,"Planned interruptions\n(SAIFI)",null,"Total number of momentary feeder outages","Momentary interruptions due to feeder outages (MAIFI)"]
[null,null,null,null,null,null,null,null,null,null,null,"Including excluded events and MEDs","After removing excluded events and MED","Including excluded events and MEDs","After removing excluded events and MED",null,"Including MEDs","After removing  MED","Including MEDs","After removing  MED",null,"Including excluded events and MEDs","After removing excluded events and MED"]
[null,"AW 01","Airport West","Urban",716,4.6724999999999994,4.3179999999999996,8.7639200000000006,1.1205989960770224,0.11369987713154578,4,14281,14281,202,202,1,4830,4830,14,14]
[null,"AW 02","Airport West","Urban",2401,11.05,2.97,9.6212599999999995,6.2146996315356979,7.6013379230864306E-2,7,222071,222071,5104,5104,2,9054,9054,46,46]
[null,"AW 03","Airport West","Urban",251,6.1135000000000002,3.9204999999999997,12.917256000000002,9.0216942902001378,0.35356084742783034,3,24496,24496,312,312,1,3200,3200,10,10]
[null,"AW 04","Airport West","Urban",1929,11.393000000000001,10.542999999999999,12.860099999999999,7.9509500561018775,0.4154516548285509,15,173104,173104,5874,5874,5,30150,30150,109,109]
[null,"AW 05","Airport West","Urban",538,4.9370000000000003,0.87250000000000005,7.6398520000000012,3.4533558015456531,9.1729357682629506E-2,3,39891,39891,1081,1081,2,3532,3532,12,12]
[null,"AW 06","Airport West","Urban",4809,16.6845,1.673,11.450252000000001,2.3100868761055988,0.82900095137340502,12,206881,206881,5228,5228,10,247472,247472,772,772]
[null,"AW 07","Airport West","Urban",4516,16.036999999999999,5.6415000000000006,10.021352,1.0279785578713583,0.23815291158011967,6,97619,97619,4627,4627,12,75385,75385,275,275]
[null,"AW 08","Airport West","Urban",2327,14.4255,8.0229999999999997,9.8498839999999994,1.1268376635454727,0.90452926172415704,4,42250,42250,2398,2398,5,113049,113049,304,304]
[null,"AW 09","Airport West","Urban",2442,9.5704999999999991,7.0455000000000005,7.6970079999999994,0.35896128925738008,8.630398621637685E-3,6,18829,18829,105,105,2,1509,1509,5,5]
[null,"AW 11","Airport West","Urban",475,5.9994999999999994,3.5549999999999997,9.1640120000000014,2.8448648701749688,0.31789001290213437,4,22748,22748,493,493,4,8473,8473,23,23]
[null,"AW 12","Airport West","Urban",1766,5.7040000000000006,6.7119999999999997,6.5919920000000003,1.6583316582854979,5.3611552567965973E-2,7,63334,63334,2000,2000,1,6825,6825,35,35]
[null,"AW 14","Airport West","Urban",1258,8.932500000000001,4.7665000000000006,9.9070399999999985,1.2034772131957361,0.26028556266474406,3,18393,18393,1320,1320,1,13260,13260,34,34]
[null,"BD 01","Broadmeadows","Urban",1669,11.0885,5.3635000000000002,10.249976,4.20696868646551,0.95850326497227645,4,112882,112882,1692,1692,6,85729,85729,260,260]
[null,"BD 02","Broadmeadows","Urban",1,0.77249999999999996,7.1500000000000008E-2,null,1.5803541946833231,0,1,31,31,1,1,0,0,0,0,0]
[null,"BD 03","Broadmeadows","Urban",348,3.9925000000000002,5.4874999999999998,10.173768000000001,2.5869832032116973,2.8790302910711073E-2,1,11861,11861,342,342,2,440,440,2,2]
[null,"BD 04","Broadmeadows","Urban",1038,8.4664999999999999,4.3369999999999997,11.888448,7.3845732114262423,0.24198616562377839,8,165430,165430,3221,3221,4,18070,18070,102,102]
[null,"BD 06","Broadmeadows","Urban",1,0.749,0.08,null,1.4538115620423979,0,1,31,31,1,1,0,0,0,0,0]
[null,"BD 07","Broadmeadows","Urban",4642,25.2,2.0499999999999998,13.793648000000001,5.1118228502638896,0.16534410683664036,8,400174,400174,12266,12266,7,43146,43146,170,170]
[null,"BD 08","Broadmeadows","Urban",1310,8.4834999999999994,0.85899999999999999,7.7541639999999994,1.0918342938766581,0.65205618826361067,3,32923,32923,816,816,6,65540,65540,184,184]
[null,"BD 09","Broadmeadows","Urban",689,5.1870000000000003,1.2909999999999999,4.7439479999999996,1.4876587391425333,4.7554702068634486E-3,4,34255,34255,304,304,1,365,365,5,5]
[null,"BD 10","Broadmeadows","Urban",1112,6.6295000000000002,4.3205,12.040863999999999,2.2304066682036878,2.1074708675940354E-3,2,36830,36830,1170,1170,1,116,116,1,1]
[null,"BD 11","Broadmeadows","Urban",2792,10.077500000000001,1.72,7.5445919999999997,0.75868217138896443,0.18140709018603379,8,39020,39020,354,354,5,31100,31100,77,77]
[null,"BD 13","Broadmeadows","Urban",603,9.9989999999999988,3.0985,12.307592000000001,2.9568065467783362,0.22682101069315891,4,30719,30719,552,552,3,7855,7855,30,30]
[null,"BD 14","Broadmeadows","Urban",563,6.6925000000000008,2.9765000000000001,10.173768000000001,1.49881135117259E-2,0.23289693118016533,0,343,343,3,3,1,17766,17766,63,63]
[null,"BD 15","Broadmeadows","Urban",807,8.6404999999999994,1.5980000000000001,10.57386,0.23595658579533063,0.10320261050545876,1,2389,2389,15,15,2,3483,3483,12,12]
[null,"BD 16","Broadmeadows","Urban",800,9.0515000000000008,2.4,7.3350200000000001,0.40350704774296753,0.76440600862636299,2,6435,6435,41,41,1,40635,40635,129,129]
[null,"BY 11","Braybrook","Urban",4001,16.429000000000002,2.4384999999999999,8.5543479999999992,3.3407458341203369,0,6,250165,250165,4275,4275,0,0,0,0,0]
[null,"BY 12","Braybrook","Urban",1244,4.6795,0.69799999999999995,2.8387479999999994,1.5629391841499074,6.22228276560466E-4,7,85905,85905,1616,1616,2,114,114,2,2]
[null,"BY 13","Braybrook","Urban",752,2.9889999999999999,1.8065,12.021812000000001,2.409463792643955,1.7814366733548782E-2,3,25563,25563,93,93,1,630,630,7,7]
[null,"BY 14","Braybrook","Urban",2877,12.041499999999999,3.3220000000000001,7.5445919999999997,2.6491141658969317,0.55429606452640312,7,168603,168603,2001,2001,9,117594,117594,813,813]
[null,"BY 15","Braybrook","Urban",966,6.1414999999999997,2.2104999999999997,7.5826960000000003,14.185908953776977,0.13887616441685152,8,231365,231365,2960,2960,3,7550,7550,34,34]
[null,"CN 01","Coburg North","Urban",103,1.8685,0.31,7.8875280000000005,8.1352442235204823,6.3077268574877055E-2,1,11801,11801,102,102,1,305,305,1,1]
[null,"CN 02","Coburg North","Urban",456,4.8870000000000005,0.92100000000000004,9.9641959999999994,4.1286690770976202,0.90083451154500815,3,39758,39758,495,495,5,28916,28916,108,108]
[null,"CN 03","Coburg North","Urban",2671,9.26,1.92,5.3726639999999994,5.0779558266806957,0.34791430034388532,9,414599,414599,5373,5373,6,94687,94687,283,283]
[null,"CN 04","Coburg North","Urban",1354,7.3979999999999997,5.3704999999999998,9.1640120000000014,3.0686202453788765,1.0877268257561465,4,49119,49119,1387,1387,11,58037,58037,286,286]
[null,"CN 05","Coburg North","Urban",3907,13.060500000000001,1.5895000000000001,7.2969160000000004,7.1458922699100524,0.24516638162988952,10,608924,608924,10801,10801,12,69638,69638,292,292]
[null,"CN 06","Coburg North","Urban",2087,9.8445,1.3315000000000001,7.2207079999999992,0.27666200988323869,0.63542496145730298,4,11835,11835,102,102,13,90607,90607,525,525]
[null,"CN 07","Coburg North","Urban",5420,15.782999999999999,1.115,8.5733999999999995,2.3665628069463982,0.7929248482174841,6,219685,219685,3956,3956,14,245354,245354,847,847]
[null,"CN 08","Coburg North","Urban",1250,6.71,0.70399999999999996,3.0292679999999996,0.84966198981766405,0.19482294560476265,3,61175,61175,1325,1325,3,46757,46757,116,116]
[null,"CN 09","Coburg North","Urban",48,2.4364999999999997,0.54100000000000004,4.4010119999999997,0,0,0,0,0,0,0,0,0,0,0,0]
[null,"CN 10","Coburg North","Urban",1948,6.3934999999999995,1.0685,7.9065799999999999,5.4179160176795387,0.35487134503210216,1,168514,168514,2013,2013,11,36792,36792,194,194]
[null,"CN 11","Coburg North","Urban",2489,8.9400000000000013,1.343,7.9446840000000005,0.95504260615702385,0.42846636205211358,11,67845,67845,488,488,8,101459,101459,359,359]
[null,"COO11","Coolaroo","Rural-short",1809,139.9763599657671,24.405336634900003,9.5831560000000007,5.1228828296759881,5.2350517639742105,19,136543,136543,4735,4735,53,465109,465109,1419,1419]
[null,"COO12","Coolaroo","Urban",719,0.62949999999999995,11.1145,6.4205239999999995,1.4376554228180249,1.8378244600124063E-2,2,57543,57543,2860,2860,2,2452,2452,10,10]
[null,"COO13","Coolaroo","Urban",3908,6.2305000000000001,11.298500000000001,10.326184000000001,5.7557247310659587,0.34492495792510458,5,481058,481058,11733,11733,3,96095,96095,203,203]
[null,"COO14","Coolaroo","Urban",2840,5.6231933622999986,16.593663365099999,7.7541639999999994,0.99697561666697854,0.3962657780653569,5,68401,68401,7222,7222,6,90624,90624,238,238]
[null,"COO21","Coolaroo","Rural-short",0,16.844999999999999,10.581,null,0,0,2,15040,15040,71,71,2,14049,14049,39,39]
[null,"COO22","Coolaroo","Urban",0,0.71299999999999997,19.29,null,0,0,1,1912,1912,11,11,0,0,0,0,0]
[null,"CS 02","Coburg South","Urban",5529,14.541,0.9544999999999999,10.135664,2.9760638053742396,0.65844358399510849,14,305152,305152,6250,6250,17,225046,225046,829,829]
[null,"CS 03","Coburg South","Urban",3828,10.911999999999999,2.3804999999999996,8.8210759999999997,2.5740817702658538,4.0691785635431188E-2,5,158746,158746,3982,3982,4,8365,8365,34,34]
[null,"CS 05","Coburg South","Urban",4671,12.103,0.71550000000000002,8.611504,1.5406644355532686,0.34376642025257087,11,143722,143722,2355,2355,14,106895,106895,357,357]
[null,"CS 08","Coburg South","Urban",3929,10.601500000000001,3.0525000000000002,7.7160600000000006,8.4865228151414538,0.434580526222414,14,540381,540381,6808,6808,5,92240,92240,277,277]
[null,"CS 09","Coburg South","Urban",0,4.0339999999999998,1.8280000000000001,null,0,0,8,119674,119674,4006,4006,0,0,0,0,0]
[null,"CS 12","Coburg South","Urban",1988,9.089500000000001,0.86199999999999999,6.3443160000000001,4.3109676404523949,1.0596774805978348E-2,8,168423,168423,831,831,1,1380,1380,4,4]
[null,"CS 13","Coburg South","Urban",1819,5.5775000000000006,2.5575000000000001,4.8392079999999993,2.1619680740283456,0.17150042980804797,7,143635,143635,2053,2053,3,37980,37980,116,116]
[null,"EP 02","East Preston","Urban",71,0.77150000000000007,0.47049999999999997,2.6234603999999995,2.7220197290991906E-2,0,0,203,203,1,1,0,0,0,0,0]
[null,"EP 03","East Preston","Urban",94,1.038,0.45250000000000001,1.4689092000000001,1.4085124611413279E-2,0,0,164,164,1,1,0,0,0,0,0]
[null,"EP 04","East Preston","Urban",14,1.1284999999999998,0.36849999999999999,1.0745327999999998,5.6751097615370269E-2,0,0,147,147,1,1,0,0,0,0,0]
[null,"EP 07","East Preston","Urban",45,1.9129999999999998,0.71950000000000003,2.6005979999999993,0.26252325422040385,0,2,937,937,9,9,0,0,0,0,0]
[null,"EP 09","East Preston","Urban",247,2.5460000000000003,0.66050000000000009,3.4750848000000003,4.9627027435748691E-2,7.0006778514379033E-4,0,638,638,5,5,1,30,30,2,2]
[null,"EP 11","East Preston","Urban",520,3.851,0.55200000000000005,2.0519004000000001,0.25573454388652928,0,1,13139,13139,235,235,0,0,0,0,0]
[null,"EP 16","East Preston","Urban",57,1.952,0.15049999999999999,3.0064055999999999,8.3995068151537969E-2,0,1,283,283,4,4,0,0,0,0,0]
[null,"EP 17","East Preston","Urban",129,1.0205,0.62850000000000006,3.3893507999999999,0,0,0,0,0,0,0,0,0,0,0,0]
[null,"EP 18","East Preston","Urban",16,1.2705,0.59099999999999997,1.5775056000000001,0.73614967281488275,0,1,1553,1553,9,9,0,0,0,0,0]
[null,"EP 20","East Preston","Urban",264,2.4489999999999998,0.16450000000000001,3.3950663999999997,0.41132978203945619,5.9997887863239667E-3,3,6273,6273,90,90,2,305,305,2,2]
[null,"EP 27","East Preston","Urban",14,5.1000000000000004E-2,1.48,1.5489276000000001,0,0,0,0,0,0,0,0,0,0,0,0]
[null,"EP 34","East Preston","Urban",1443,5.5019999999999998,0.752,2.7492036,5.6496678616696619E-2,9.009293451803551E-3,2,5879,5879,43,43,2,3125,3125,30,30]
[null,"EP 35","East Preston","Urban",31,1.88,0.39850000000000002,2.8349375999999999,0,0,0,0,0,0,0,0,0,0,0,0]
[null,"EP 36","East Preston","Urban",947,5.2705000000000002,0.15049999999999999,2.0118912,0.13471870021282048,2.2279468497425979E-2,2,11120,11120,123,123,2,6130,6130,29,29]
[null,"EP 37","East Preston","Urban",812,3.6630000000000003,0.318,3.0464147999999995,0.14105003679636666,0.10789557917822919,1,5771,5771,82,82,2,14715,14715,69,69]
[null,"EP 41","East Preston","Urban",56,1.4035,0.52800000000000002,2.6806163999999999,0.11130959001625682,0.10616757091224494,0,368,368,4,4,1,1170,1170,2,2]
[null,"EP 42","East Preston","Urban",297,2.6444999999999999,0.53,3.0292680000000001,8.6708184969714733E-2,7.0542252178750972E-2,1,1357,1357,7,7,1,3680,3680,8,8]
[null,"ES 01","Essendon","Urban",1134,4.3315000000000001,0.54,4.9820979999999997,0.22298439701654554,0,1,9490,9490,36,36,0,0,0,0,0]
[null,"ES 02","Essendon","Urban",1474,5.0214999999999996,0.72199999999999998,3.724666,0.42240534841030747,0.10684158865383783,5,29341,29341,274,274,1,24738,24738,133,133]
[null,"ES 03","Essendon","Urban",2622,7.593,0.82299999999999995,6.2585820000000005,0.12145611614243713,0,4,10230,10230,117,117,0,0,0,0,0]
[null,"ES 06","Essendon","Urban",2041,5.7305000000000001,1.9605000000000001,4.9535199999999993,7.3854432875206946E-2,0,2,4869,4869,38,38,0,0,0,0,0]
[null,"ES 07","Essendon","Urban",1272,3.8899999999999997,0.37,2.9530599999999998,0.31124137486176645,4.0312669772424696E-3,2,22583,22583,127,127,2,975,975,9,9]
[null,"ES 11","Essendon","Urban",1553,3.4260000000000002,0.55100000000000005,4.2390699999999999,0.48515519354366743,2.4496265956574514E-2,7,31936,31936,211,211,1,5375,5375,25,25]
[null,"ES 12","Essendon","Urban",1197,2.7589999999999999,1.7989999999999999,4.5248500000000007,0.42045510230774652,8.7531494480722113E-3,2,20751,20751,103,103,1,1440,1440,6,6]
[null,"ES 13","Essendon","Urban",1846,4.2234999999999996,1.0314999999999999,5.353612,0.33533503838471518,0.48998407901549829,3,17271,17271,167,167,3,84120,84120,284,284]
[null,"ES 14","Essendon","Urban",1058,3.8755000000000002,1.7629999999999999,4.6677400000000002,0.27462643115918967,6.8361219802994351E-3,3,13016,13016,120,120,1,1080,1080,4,4]
[null,"FE 05","Footscray","Urban",3049,8.4224999999999994,0.85749999999999993,6.4967319999999997,7.5714923949170565,0.14693469659836614,10,606777,606777,9482,9482,4,39251,39251,237,237]
[null,"FE 06","Footscray","Urban",4166,10.173,7.9164999999999992,11.012056000000001,3.1214697035986902,1.1235728746070803E-3,6,155855,155855,288,288,1,187,187,1,1]
[null,"FE 08","Footscray","Urban",2271,3.5834999999999999,5.0034999999999998,9.1068560000000005,0.16689929879468371,0.4647432897646035,2,5633,5633,51,51,6,52285,52285,169,169]
[null,"FE 09","Footscray","Urban",3976,7.734,1.115,5.8299119999999993,1.9013846103829573,0.12158729737045623,12,188116,188116,4677,4677,2,40098,40098,105,105]
[null,"FF 87","Fairfield","Urban",969,2.6385000000000001,0.23899999999999999,1.9147259999999999,7.2481912074068497E-2,0.28448120080086264,1,4924,4924,45,45,8,64420,64420,320,320]
[null,"FF 88","Fairfield","Urban",1218,3.9615,0.3765,1.9718819999999999,1.659471511296956E-2,0.30917638084245291,0,1567,1567,8,8,9,97316,97316,324,324]
[null,"FF 89","Fairfield","Urban",352,3.9195000000000002,0.78749999999999998,2.3262491999999999,0.182256389874519,0.43098275723268614,1,4131,4131,57,57,4,32562,32562,77,77]
[null,"FF 90","Fairfield","Urban",1031,3.4215,0.39200000000000002,2.3776895999999996,1.4725922104465121E-2,0,0,1033,1033,4,4,0,0,0,0,0]
[null,"FF 95","Fairfield","Urban",1645,4.7895000000000003,6.25E-2,2.8406531999999998,0.13252125236866963,0.19646635420263381,1,13169,13169,107,107,9,65078,65078,259,259]
[null,"FF 96","Fairfield","Urban",1025,3.6915,0.38800000000000001,2.1090564000000001,0.18580467996379027,0.24260671154049912,1,17641,17641,54,54,5,76780,76780,238,238]
[null,"FT 01","Flemington","Urban",3746,6.8535000000000004,2.5825,6.6015180000000004,0.23089284709892821,4.4456413419386803E-2,4,21237,21237,159,159,4,13630,13630,48,48]
[null,"FT 02","Flemington","Urban",278,1.5905,5.3804999999999996,2.5243900000000004,0,0,0,0,0,0,0,0,0,0,0,0]
[null,"FT 04","Flemington","Urban",1013,2.8494999999999999,2.1875,3.867556,0.12781619679314851,5.9642036092719976E-4,2,4629,4629,42,42,1,72,72,2,2]
[null,"FT 05","Flemington","Urban",2406,4.7844999999999995,2.0309999999999997,3.8866079999999998,7.382951938657896E-2,0,1,6042,6042,41,41,0,0,0,0,0]
[null,"FT 06","Flemington","Urban",348,0.95199999999999996,1.2524999999999999,2.1147719999999999,0.15691270010157901,6.357519627276037E-2,2,4145,4145,50,50,1,5598,5598,18,18]
[null,"FT 09","Flemington","Urban",1643,2.9249999999999998,3.1675,4.5057979999999995,2.0025600692487564,0,8,89356,89356,1949,1949,0,0,0,0,0]
[null,"FT 10","Flemington","Urban",2054,4.2040000000000006,1.7090000000000001,3.7722959999999999,3.4899885097927918,8.7434529880704673E-2,4,245013,245013,4505,4505,3,20461,20461,101,101]
[null,"FT 13","Flemington","Urban",1819,3.0059999999999998,5.5609999999999999,5.4774500000000002,6.6144516279954463E-2,0,2,4168,4168,50,50,0,0,0,0,0]
[null,"FT 14","Flemington","Urban",1488,1.8809999999999998,1.73,4.3248040000000003,4.4176586509320463,0,2,188499,188499,2964,2964,0,0,0,0,0]
[null,"FT 15","Flemington","Urban",90,0.128,0.94099999999999995,3.3531520000000001,0,0,0,0,0,0,0,0,0,0,0,0]
[null,"FW 04","Footscray West","Urban",1399,5.5255000000000001,1.4990000000000001,7.677956,8.7928606845560431,0.13411479275584831,9,203964,203964,2614,2614,2,10370,10370,71,71]
[null,"FW 05","Footscray West","Urban",1641,7.4734999999999996,1.1475,4.1533360000000004,4.1212099965940006,3.4366443949435804E-2,5,255033,255033,3351,3351,3,7089,7089,29,29]
[null,"FW 06","Footscray West","Urban",951,5.6185,2.6505000000000001,4.6867920000000005,1.2910658124857646,3.0216153779877929E-2,2,39224,39224,963,963,3,3060,3060,12,12]
[null,"FW 08","Footscray West","Urban",2915,8.4439999999999991,0.82899999999999996,7.792268,3.0968275901982034,5.2788464002390392E-3,7,194298,194298,3350,3350,1,1104,1104,4,4]
[null,"FW 09","Footscray West","Urban",1417,9.0659999999999989,3.7475000000000001,9.0878040000000002,5.7330845142033517,0.11667499509834012,4,120966,120966,1582,1582,2,8206,8206,31,31]
[null,"FW 13","Footscray West","Urban",473,5.1395,0.64200000000000002,11.069212,13.842947548226475,7.8390202011271087E-2,5,76287,76287,1008,1008,1,1440,1440,4,4]
[null,"FW 16","Footscray West","Urban",2519,9.1750000000000007,0.247,4.420064,4.7392980762791828,6.2707815988019347E-2,17,332231,332231,4572,4572,2,14653,14653,52,52]
[null,"FW 17","Footscray West","Urban",2259,8.5984999999999996,0.30249999999999999,3.7151400000000003,3.2162001268134128,0.21853909525480145,7,318625,318625,3849,3849,1,72168,72168,186,186]
[null,"HB 14","Heidelberg","Urban",1699,5.3040000000000003,2.0009999999999999,4.6486879999999999,0.26441661026990748,0.98072710230544669,3,14309,14309,173,173,26,176908,176908,839,839]
[null,"HB 15","Heidelberg","Urban",2403,9.3715000000000011,1.1459999999999999,5.6203400000000006,1.6199048648698535,0.43670095687728266,7,117423,117423,2710,2710,19,105518,105518,539,539]
[null,"HB 22","Heidelberg","Urban",1134,5.0114999999999998,0.90200000000000002,3.5436719999999999,0.33973589133606236,9.6249500534318452E-2,2,15725,15725,57,57,2,14850,14850,53,53]
[null,"HB 23","Heidelberg","Urban",1480,5.3635000000000002,0.47350000000000003,3.4007819999999995,0.28483209352528177,0.20850899823133739,2,23254,23254,242,242,7,56743,56743,216,216]
[null,"HB 24","Heidelberg","Urban",876,6.4295,0.34799999999999998,3.2674180000000002,1.4405950383481501,0.24037064511349321,5,67217,67217,1486,1486,8,37385,37385,155,155]
[null,"HB 31","Heidelberg","Urban",748,1.51,0.52900000000000003,3.5436719999999999,5.7679297284830735,6.7911260539439645E-4,1,178360,178360,752,752,1,70,70,1,1]
[null,"HB 32","Heidelberg","Urban",514,2.0694999999999997,0.57899999999999996,2.9625860000000004,3.4220928606142995E-2,0,0,917,917,4,4,0,0,0,0,0]
[null,"NH 02","North Heidelberg","Urban",4236,16.294499999999999,4.109,8.4781399999999998,5.532732970160299,0.11083505871315256,9,495617,495617,7655,7655,3,33095,33095,183,183]
[null,"NH 03","North Heidelberg","Urban",1279,9.1560000000000006,0.78,7.4302800000000007,6.936582255590535,0.36381880170830044,4,210306,210306,3870,3870,13,36768,36768,128,128]
[null,"NH 05","North Heidelberg","Urban",4535,16.246500000000001,1.1319999999999999,6.5348360000000003,1.8463225711452111,0.55192586333576543,5,208810,208810,4895,4895,26,208067,208067,887,887]
[null,"NH 08","North Heidelberg","Urban",2617,11.638500000000001,1.3315000000000001,5.0297280000000004,1.0747374671915324,0.23939251022250632,3,109096,109096,2742,2742,7,81002,81002,292,292]
[null,"NH 09","North Heidelberg","Urban",633,6.4864999999999995,1.2725,9.5641039999999986,0.53225793692019996,0.33798866328984556,3,6007,6007,60,60,3,12715,12715,41,41]
[null,"NH 12","North Heidelberg","Urban",18,7.4999999999999997E-2,4.02888012468817,4.6677400000000002,0,0,0,0,0,0,0,0,0,0,0,0]
[null,"NH 13","North Heidelberg","Urban",631,0.96199999999999997,2.8165,6.0585359999999993,2.0748245994982084,1.9367672535987035,3,23813,23813,318,318,6,74095,74095,307,307]
[null,"NH 16","North Heidelberg","Urban",2522,7.1814999999999998,4.4830000000000005,6.9349280000000002,1.8024114818555659,2.6265308729040353E-2,5,104376,104376,2749,2749,1,5070,5070,26,26]
[null,"NH 17","North Heidelberg","Urban",1969,8.1585000000000001,2.2625000000000002,6.2871600000000001,0.79508569471119939,0.35023152932817408,4,34846,34846,161,161,8,51165,51165,194,194]
[null,"NH 20","North Heidelberg","Urban",1905,7.6135000000000002,2.2835000000000001,6.630096,0.18131962817351577,0.84548273284453024,1,7766,7766,48,48,8,120708,120708,395,395]
[null,"NS 07","North Essendon","Urban",943,3.7060000000000004,1.5549999999999999,4.1438099999999993,3.4640763646856997E-2,1.9177224163022767E-3,0,1138,1138,5,5,1,210,210,2,2]
[null,"NS 08","North Essendon","Urban",1150,2.9424999999999999,0.26100000000000001,2.6577539999999997,0.19657761341820562,5.9972831212333913E-3,2,13334,13334,66,66,1,1356,1356,12,12]
[null,"NS 09","North Essendon","Urban",955,3.6595,1.1435,3.7722959999999999,0.77912781000429765,4.3436530186434778E-2,1,27686,27686,128,128,1,5145,5145,21,21]
[null,"NS 11","North Essendon","Rural-short",0,0,4.8500000000000001E-2,null,0,0,0,0,0,0,0,0,0,0,0,0]
[null,"NS 12","North Essendon","Urban",1295,3.6785000000000001,1.17,3.1816839999999997,0.52638108676426953,2.2196602542186597E-2,3,46663,46663,336,336,2,6559,6559,35,35]
[null,"NS 14","North Essendon","Urban",1401,5.6120000000000001,1.2614999999999998,4.5534280000000003,0.93329416052506853,0.33539212090040738,2,54887,54887,1447,1447,2,65748,65748,148,148]
[null,"NS 15","North Essendon","Urban",1546,4.4085000000000001,1.1425000000000001,4.0676019999999999,0.14607698153050339,0.50549393985637192,3,8516,8516,55,55,4,98231,98231,327,327]
[null,"NS 16","North Essendon","Urban",708,3.194,0.42099999999999999,1.6670500000000001,0.38594392016857226,9.6932005071827462E-3,2,31367,31367,729,729,1,2626,2626,13,13]
[null,"NS 17","North Essendon","Urban",822,3.5785,0.51150000000000007,2.352922,1.6945462294148741,0,6,110841,110841,1201,1201,0,0,0,0,0]
[null,"NS 18","North Essendon","Urban",1744,3.4480000000000004,2.6390000000000002,4.9249419999999997,3.2398478636417864E-2,0,0,1546,1546,12,12,0,0,0,0,0]
[null,"NT 01","Newport","Urban",2,0.66900000000000004,5.6425000000000001,null,0,0,0,0,0,0,0,0,0,0,0,0]
[null,"NT 03","Newport","Urban",3242,11.3,3.91,10.745327999999999,0.54070629817435034,0.34706270651715448,5,31233,31233,222,222,3,66825,66825,159,159]
[null,"NT 04","Newport","Urban",1751,3.3490000000000002,1.948,8.7448679999999985,0.65464161848624192,0.22616469635230174,3,19242,19242,72,72,5,22159,22159,70,70]
[null,"NT 10","Newport","Urban",929,1.8919999999999999,0.83199999999999996,2.038564,0.98324326443834131,6.1752891695359888E-4,1,64485,64485,932,932,1,135,135,1,1]
[null,"NT 11","Newport","Urban",2981,9.2865000000000002,2.2370000000000001,7.0682920000000005,5.323679114860334,0.19317725456272328,7,366972,366972,3561,3561,8,44387,44387,173,173]
[null,"NT 15","Newport","Urban",1082,5.4115000000000002,2.8380000000000001,4.6677400000000002,1.4006981637084381,1.6259196245661748E-2,5,62957,62957,1130,1130,3,2436,2436,19,19]
[null,"NT 16","Newport","Urban",209,2.94,1.6095000000000002,5.2774040000000007,1.148855310497336E-2,0,0,193,193,2,2,0,0,0,0,0]
[null,"NT 17","Newport","Urban",3180,8.5449999999999999,2.88,8.611504,6.6927034464611515,0.56726584189050666,5,411734,411734,3418,3418,8,116327,116327,420,420]
[null,"P  56","Preston","Urban",2,2.0499999999999998,0.25750000000000001,null,0,0,0,0,0,0,0,0,0,0,0,0]
[null,"P  57","Preston","Rural-short",102,1.7825,0.28100000000000003,0.2743488,0,2.3858887359561366E-2,0,0,0,0,0,2,5625,5625,17,17]
[null,"P  58","Preston","Rural-short",0,0.1285,4.0500000000000001E-2,null,0,0,0,0,0,0,0,0,0,0,0,0]
[null,"P  59","Preston","Urban",867,2.8890000000000002,1.6085,1.6117991999999999,9.7109825099891092E-2,6.9349081620248304E-2,2,10304,10304,60,60,5,24528,24528,143,143]
[null,"P  61","Preston","Urban",86,0.50800000000000001,0.1515,0.48011039999999999,4.2227432606807896E-3,0,0,239,239,2,2,0,0,0,0,0]
[null,"P  62","Preston","Urban",677,1.8210000000000002,0.81,3.3321947999999999,0.19783553531607759,7.2124166107457074E-2,1,7332,7332,60,60,1,8910,8910,27,27]
[null,"P  63","Preston","Urban",834,2.8295000000000003,0.13900000000000001,2.1604967999999998,1.4322921219957967E-2,0.10021929981575893,0,905,905,8,8,3,21108,21108,70,70]
[null,"P  65","Preston","Urban",257,0.40800000000000003,0.1295,0.95450519999999983,1.9325781413978139E-3,0,0,71,71,1,1,0,0,0,0,0]
[null,"P  66","Preston","Urban",712,2.1715,0.65850000000000009,3.28647,0.4542747920565931,1.7913291696455072E-2,3,17346,17346,52,52,1,2280,2280,24,24]
[null,"PV 12","Pascoe Vale","Urban",456,2.6124999999999998,1.6484999999999999,2.1719279999999999,7.2987921217238239E-3,7.5612380512070851E-2,0,235,235,3,3,2,8115,8115,35,35]
[null,"PV 13","Pascoe Vale","Urban",3077,10.059000000000001,0.52849999999999997,4.6582140000000001,0.35639515285982259,0.21438814929668709,3,39969,39969,229,229,5,80144,80144,271,271]
[null,"PV 14","Pascoe Vale","Urban",2743,10.054500000000001,0.93200000000000005,5.2774040000000007,0.37179332972993068,0.20254655810612132,5,35842,35842,271,271,4,65087,65087,170,170]
[null,"PV 15","Pascoe Vale","Urban",1702,5.3914999999999997,0.371,3.2293140000000005,0.10519850153923384,0.19934243339049046,3,10427,10427,69,69,2,65861,65861,161,161]
[null,"PV 21","Pascoe Vale","Urban",1239,5.5954999999999995,0.18049999999999999,2.4672339999999999,3.3691760127497021E-2,0,0,2586,2586,17,17,0,0,0,0,0]
[null,"PV 22","Pascoe Vale","Urban",2466,9.8915000000000006,0.42899999999999999,5.4393459999999996,7.5738171735305573E-2,8.8467204726853613E-2,2,7121,7121,59,59,4,27726,27726,84,84]
[null,"PV 23","Pascoe Vale","Urban",2331,8.19,0.16850000000000001,4.5629540000000004,0.32794897323084987,5.3068372227560827E-3,3,31424,31424,153,153,2,1695,1695,7,7]
[null,"PV 24","Pascoe Vale","Urban",1637,6.891,0.53249999999999997,4.2771739999999996,0.66107350252030506,7.0040033740767685E-2,1,38696,38696,84,84,4,13666,13666,44,44]
[null,"PV 31","Pascoe Vale","Urban",1929,5.8085000000000004,1.4704999999999999,4.2676480000000003,0.22786469790081515,6.7568606421020749E-2,2,13658,13658,67,67,3,13500,13500,64,64]
[null,"SA 02","St Alban","Rural-short",61,14.558,0,0.45724799999999999,0.17919007780062798,0,3,4646,4646,27,27,0,0,0,0,0]
[null,"SA 06","St Alban","Rural-short",144,4.3099999999999996,1.2015,0.45724799999999999,2.315111678333346E-2,3.8838980111037612E-2,2,1417,1417,5,5,1,7924,7924,28,28]
[null,"SA 10","St Alban","Rural-short",43,1.2610000000000001,0.81799999999999995,3.8103999999999999E-2,0,0,0,0,0,0,0,0,0,0,0,0]
[null,"SA 12","St Alban","Urban",1821,1.0825,6.1890000000000001,3.8103999999999996,0.6258872886033322,0,4,58133,58133,1970,1970,0,0,0,0,0]
[null,"SBY11","Sunbury","Rural-short",2954,62.088000000000001,10.738,7.0492400000000011,1.3585675418827019,1.0315545176763257,20,90106,90106,3339,3339,28,228057,228057,1754,1754]
[null,"SBY14","Sunbury","Rural-short",4084,93.009500000000003,22.929500000000001,10.669119999999999,12.224511028599588,2.5185232342755119,27,720542,720542,15725,15725,35,494826,494826,1816,1816]
[null,"SBY31","Sunbury","Urban",2101,6.8445,7.9785000000000004,6.8396679999999996,3.3176220037282693,0.20115672252463329,3,138242,138242,4229,4229,2,27940,27940,62,62]
[null,"SBY32","Sunbury","Rural-short",2877,119.1875,10.324999999999999,5.9251720000000008,9.589522635338982,0.19491904595003084,37,716074,716074,11870,11870,22,48517,48517,226,226]
[null,"SBY33","Sunbury","Rural-short",2956,16.233499999999999,4.0910000000000002,6.0585359999999993,6.5575038742308481E-2,0.52167677647257371,3,5372,5372,190,190,3,142455,142455,527,527]
[null,"SHM11","Sydenham","Rural-short",3841,64.554000000000002,2.21665,2.7815919999999998,0.64018623264119046,8.3987189293917124E-3,11,114062,114062,4100,4100,8,4988,4988,72,72]
[null,"SHM12","Sydenham","Urban",2827,4.7115,14.036950000000001,7.9446840000000005,2.1146387480971467,1.3438890976489207E-2,1,145299,145299,2830,2830,2,3078,3078,18,18]
[null,"SHM14","Sydenham","Rural-short",3772,18.930999999999997,21.655050000000003,10.040404000000001,6.2078029572639624,0.50346771487740549,16,423313,423313,8262,8262,5,114439,114439,302,302]
[null,"SHM21","Sydenham","Urban",4850,3.8824999999999998,19.449249999999999,9.7165199999999992,1.7393015387218054,3.871208098796562E-4,2,161745,161745,3645,3645,1,120,120,1,1]
[null,"SHM24","Sydenham","Urban",1,0,0.40425,null,0,0,0,0,0,0,0,0,0,0,0,0]
[null,"ST 11","Somerton","Urban",178,7.0555000000000003,3.2879999999999998,5.9442240000000002,0.42672930159637024,1.2478599273954463,1,1485,1485,23,23,2,14475,14475,48,48]
[null,"ST 12","Somerton","Urban",240,12.189499999999999,3.133,8.4209840000000007,8.0632577270986694,0,4,28840,28840,506,506,0,0,0,0,0]
[null,"ST 13","Somerton","Urban",187,4.8405000000000005,4.2910000000000004,6.2681079999999998,0.2039788930978331,0.14130775642928803,1,925,925,12,12,5,2136,2136,7,7]
[null,"ST 14","Somerton","Urban",70,0,4.9824999999999999,6.7253559999999997,0,9.46914910440501E-2,0,0,0,0,0,1,346,346,1,1]
[null,"ST 21","Somerton","Rural-short",2,0.1,1.7789999999999999,null,0.34413718050537384,1.4019167392071484E-3,1,1031,1031,2,2,1,14,14,2,2]
[null,"ST 22","Somerton","Urban",5761,17.9285,31.401,16.841968000000001,0.95426481582625833,0.31147753730191369,11,57033,57033,248,248,14,62053,62053,330,330]
[null,"ST 23","Somerton","Urban",141,7.524,3.4975000000000001,12.193280000000001,0.30012707049412801,2.8843058607345964,1,496,496,4,4,4,15889,15889,54,54]
[null,"ST 24","Somerton","Urban",1,0,3.7625000000000002,null,0,0,0,0,0,0,0,0,0,0,0,0]
[null,"ST 31","Somerton","Urban",1,0,0.61850000000000005,null,0,0,0,0,0,0,0,0,0,0,0,0]
[null,"ST 32","Somerton","Rural-short",5842,11.4605,24.490000000000002,10.631015999999999,0.26749792082693208,2.5904993137513651E-2,6,24603,24603,164,164,3,7942,7942,25,25]
[null,"ST 33","Somerton","Urban",3171,10.2605,4.8469999999999995,7.6589040000000006,6.6366358425192812E-2,8.1424211454494119E-2,3,4630,4630,50,50,12,18935,18935,116,116]
[null,"ST 34","Somerton","Urban",289,7.1925000000000008,6.758,10.173768000000001,1.7319535942957904,1.0969239125408483,5,8673,8673,43,43,3,18310,18310,45,45]
[null,"TH 11","Tottenham","Urban",60,3.0990000000000002,0.83,4.8773119999999999,8.7911605696867312,0,2,14328,14328,69,69,0,0,0,0,0]
[null,"TH 12","Tottenham","Urban",25,3.4889999999999999,0.66250000000000009,10.878691999999999,11.496411105580714,0,3,5019,5019,57,57,0,0,0,0,0]
[null,"TH 13","Tottenham","Urban",56,3.2290000000000001,0.501,6.0966400000000007,6.3953267433406378,0,3,7589,7589,66,66,0,0,0,0,0]
[null,"TH 14","Tottenham","Rural-short",0,0,7.1500000000000008E-2,null,0,0,0,0,0,0,0,0,0,0,0,0]
[null,"TH 21","Tottenham","Urban",175,6.4359999999999999,1.111,16.079888,3.7335270778147729,0,2,17143,17143,191,191,0,0,0,0,0]
[null,"TH 22","Tottenham","Urban",873,9.5434999999999999,3.2069999999999999,5.3917160000000006,2.8525002563081805,6.9318401968821941E-2,7,87330,87330,1094,1094,1,7074,7074,27,27]
[null,"TH 23","Tottenham","Rural-short",2,0,6.8000000000000005E-2,null,0,0,0,0,0,0,0,0,0,0,0,0]
[null,"TH 24","Tottenham","Rural-short",0,0,6.7500000000000004E-2,null,0,0,0,0,0,0,0,0,0,0,0,0]
[null,"TT 03","Thomastown","Urban",3362,13.176500000000001,4.1364999999999998,10.173768000000001,3.5135876107201485,0.17129338128359575,7,220140,220140,3247,3247,6,35774,35774,149,149]
[null,"TT 08","Thomastown","Urban",2449,12.227499999999999,1.5514999999999999,6.1156920000000001,1.4050106226411159,6.982667354245288E-2,6,86351,86351,449,449,5,14305,14305,118,118]
[null,"TT 10","Thomastown","Urban",4363,13.5535,0.63250000000000006,7.7541639999999994,0.26938710250477116,0.63042457331627322,3,21458,21458,208,208,16,167388,167388,614,614]
[null,"TT 11","Thomastown","Urban",4892,18.207999999999998,1.04,8.325724000000001,1.7560418773022586,4.3769551119513105E-2,9,163257,163257,6250,6250,4,13564,13564,58,58]
[null,"WT 04","Watsonia","Urban",142,3.145,1.4969999999999999,2.0766680000000002,0.27210699373084918,1.0094116640195041E-2,2,2507,2507,167,167,1,310,310,1,1]
[null,"YTS01","Yarraville","Rural-short",2512,7.8784999999999998,13.86,5.3345599999999997,0.66029254956083028,6.1773892589667478E-2,10,45945,45945,406,406,2,14328,14328,72,72]
[null,"YTS02","Yarraville","Urban",138,1.6985000000000001,1.0580000000000001,4.3438559999999997,1.879841641793635,0,1,5871,5871,31,31,0,0,0,0,0]
[null,"YTS03","Yarraville","Urban",620,4.7469999999999999,2.6340000000000003,6.3443160000000001,8.2606237544450298,1.0748983304586734,9,112714,112714,1880,1880,5,48889,48889,198,198]
[null,"YTS04","Yarraville","Urban",773,3.3485,1.601,3.6008279999999999,2.1210824979779512,0.68058937369821859,2,68916,68916,1550,1550,2,73710,73710,167,167]
[null,"YTS05","Yarraville","Urban",1,7.4999999999999997E-3,0.82799999999999996,null,0,0,0,0,0,0,0,0,0,0,0,0]
[null,"YTS06","Yarraville","Urban",868,7.9820000000000002,1.1875,3.5436719999999999,2.3544217450213463,3.8695461055705586E-2,6,84112,84112,1930,1930,1,4608,4608,18,18]
[null,"YTS07","Yarraville","Rural-short",848,2.13,5.8279999999999994,1.6765760000000001,0.71748946009030456,1.608665772079412E-2,3,70796,70796,1619,1619,1,5291,5291,13,13]
[null,"YTS08","Yarraville","Urban",512,6.2825000000000006,5.1014999999999997,4.0009199999999998,6.1936512407304883E-2,0.69179281696717543,1,1189,1189,13,13,2,44268,44268,168,168]
[null,"YTS10","Yarraville","Urban",1,0,0.63250000000000006,null,11.170234102986244,0,1,103,103,1,1,0,0,0,0,0]
[]
[]
[]
[]
[]
[]
[]
[]
[]
[]
[]
[]
[]
[]
[]
[]
[]
[]
[]
[]
[]
[]
[]
[]
[]
[]
[]
[]
[]
[]
[]
[]
[]
[]
[]
[]
[]
[]
[]
[]
[]
[]
[]
[]
[]
[]
[]
[]
[]
[]
[]
[]
[]
[]
[]
[]
[]
[]
[]
[]
[]
[]
[]
[]
[]
[]
[]
[]
[]
[]
[]
[]
[]
[]
[]
[]
[]
[]
[]
[]
[]
[]
[]
[]
[]
[]
[]
[]
[]
[]
[]
[]
[]
[]
[]
[]
[]
[]
[]
[]
[]
[]
[]
[]
[]
[]
[]
[]
[]
[]
[]
[]
[]
[]
[]
[]
[]
[]
[]
[]
[]
[]
[]
[]
[]
[]
[]
[]
[]
[]
[]
[]
[]
[]
[]
[]
[]
[]
[]
[]
[]
[]
[]
[]
[]
[]
[]
[]
[]
[]
[]
[]
[]
[]
[]
[]
[]
[]
[]
[]
[]
[]
[]
[]
[]
[]
[]
[]
[]
[]
[]
[]
[]
[]
[]
[]
[]
[]
[]
[]
[]
[]
[]
[]
[]
[]
[]
[]
[]
[]
[]
[]
[]
[]
[]
[]
[]
[null,null,null,null,null,null,null,null,null,null,null,null,null,null,null,null,null,null,null,null,null,null," "]

{"sheet":"3.6.8 Network-feeders (2013-14)","index":12,"n_rows":421,"n_cols":23,"rows_kept":421,"cut":false,"hidden":false,"merged":[[10,10,10,14],[10,15,10,19],[10,20,10,22],[11,5,12,5],[11,6,12,6],[11,8,12,8],[11,9,12,9],[11,10,12,10],[11,11,11,12],[11,13,11,14],[11,15,12,15],[11,16,11,17],[11,18,11,19],[11,20,12,20],[11,21,11,22],[5,1,5,4],[5,6,5,8],[10,1,12,1],[10,2,12,2],[10,3,12,3],[10,4,12,4],[10,5,10,6],[10,7,12,7],[10,8,10,9]]}
[null,{"$f":"INDEX(dms_Worksheet_List,MATCH(dms_Model,dms_Model_List))","v":"HISTORICAL ANNUAL REPORTING - FINANCIAL YEARS"}]
[null,{"$f":"INDEX(dms_TradingNameFull_List,MATCH(dms_TradingName,dms_TradingName_List))","v":"Jemena Electricity"}]
[null,{"$f":"dms_Header_Span","v":"2011-12 to 2017-18"}]
[null,"3.6 QUALITY OF SERVICES"]
[]
[null,"Did the MAIFI parameter of the STPIS apply during the period?",null,null,null,"No","** IMPORTANT\nPlease ensure this question is answered correctly. Your response will affect other tables throughout this workbook and will determine which cells are grey and which are input cells. "]
[]
[]
[]
[null,"3.6.8 - NETWORK FEEDER RELIABILITY"]
[null,"Feeder ID / name","Description of the service area for the feeder","Feeder classification\n\n(drop down)","Number of distribution customers","Length of high voltage distribution lines",null,"Maximum demand\n(MVA)","Energy not supplied\n(MWh)",null,"Unplanned Outages",null,null,null,null,"Planned Outages",null,null,null,null,"Momentary feeder outages"]
[null,null,null,null,null,"Overhead","Underground",null,"Unplanned","Planned","Total number of unplanned outages","Unplanned customer minutes off-supply (SAIDI)",null,"Unplanned interruptions\n(SAIFI)",null,"Total number of planned outages","Planned customer minutes off-supply (SAIDI)",null,"Planned interruptions\n(SAIFI)",null,"Total number of momentary feeder outages","Momentary interruptions due to feeder outages (MAIFI)"]
[null,null,null,null,null,null,null,null,null,null,null,"Including excluded events and MEDs","After removing excluded events and MED","Including excluded events and MEDs","After removing excluded events and MED",null,"Including MEDs","After removing  MED","Including MEDs","After removing  MED",null,"Including excluded events and MEDs","After removing excluded events and MED"]
[null,"AW 01","Airport West","Urban",712,4.6764999999999999,4.3159999999999998,8.8591800000000003,1.8601858132014282,0.41243756458380521,5,23998,23998,1528,1528,2,17736,17736,56,56]
[null,"AW 02","Airport West","Urban",3070,16.310500000000001,3.419,11.526459999999998,3.3722252366834167,1.1415335956027894,8,148518,148518,6589,6589,11,167583,167583,481,481]
[null,"AW 03","Airport West","Urban",251,6.1014999999999997,4.2244999999999999,12.783892,14.241375110970642,1.7276848491538093,3,39438,842,271,6,2,15948,15948,35,35]
[null,"AW 04","Airport West","Urban",1955,11.43,10.756,13.965116,0.72333122866353072,0.20383227856402858,5,15162,15162,97,97,4,14242,14242,52,52]
[null,"AW 05","Airport West","Urban",542,4.8959999999999999,0.875,7.5255400000000003,0.16931901656841333,0.21039550306522173,3,1986,1986,23,23,3,8226,8226,31,31]
[null,"AW 06","Airport West","Urban",4949,16.713000000000001,1.6459999999999999,12.745788000000001,3.254792923704668,0.44656339161201858,12,308961,308467,6452,6451,6,141300,141300,596,596]
[null,"AW 07","Airport West","Urban",4574,15.923000000000002,5.7130000000000001,11.488356,1.7249561646427132,8.5628232879904051E-2,12,171361,35121,560,272,3,28355,28355,83,83]
[null,"AW 08","Airport West","Urban",2342,14.567499999999999,8.4079999999999995,10.535755999999999,10.109789645679713,0.66089533365844932,11,378397,356297,7387,7314,4,82455,82455,220,220]
[null,"AW 09","Airport West","Urban",2449,9.4894999999999996,7.2610000000000001,8.325724000000001,4.9858950112517615,0.4705324783026093,8,275053,275053,4998,4998,5,86525,86525,346,346]
[null,"AW 11","Airport West","Urban",474,5.9979999999999993,3.3149999999999999,8.7448679999999985,5.3883780350698149,0.17560224324203991,9,48191,48191,1069,1069,2,5235,5235,16,16]
[null,"AW 12","Airport West","Urban",1783,5.6985000000000001,6.9539999999999997,7.3731239999999998,0.24255849032369198,0,1,7627,7179,67,66,0,0,0,0,0]
[null,"AW 14","Airport West","Urban",1252,8.9080000000000013,4.7130000000000001,9.4116879999999998,0.42703351493911146,0.38720599270717909,1,7083,7083,51,51,6,21408,21408,121,121]
[null,"BD 01","Broadmeadows","Urban",1691,11.209,5.4755000000000003,10.097560000000001,13.283506026530773,0.21721027073670493,5,379461,379461,5179,5179,5,20683,20683,66,66]
[null,"BD 02","Broadmeadows","Urban",1,0.66500000000000004,7.2999999999999995E-2,null,0,0,0,0,0,0,0,0,0,0,0,0]
[null,"BD 03","Broadmeadows","Urban",360,4.0034999999999998,5.9965000000000002,10.631015999999999,2.9277246938623738E-2,3.8749297418766713E-3,0,136,136,1,1,1,60,60,1,1]
[null,"BD 04","Broadmeadows","Urban",1036,8.1555,4.4340000000000002,10.459547999999998,12.250809334904988,0.63442166583491044,7,285314,285314,4165,4165,2,49251,49251,161,161]
[null,"BD 06","Broadmeadows","Urban",1,0.74849999999999994,0.08,null,0,0,0,0,0,0,0,0,0,0,0,0]
[null,"BD 07","Broadmeadows","Urban",3984,19.256999999999998,1.5914999999999999,13.812700000000001,2.6834026911089484,0.22345235182179901,13,206032,193815,5965,5912,3,57189,57189,209,209]
[null,"BD 08","Broadmeadows","Urban",771,8.9965000000000011,1.177,7.6207999999999991,4.2115672166324218,0,7,73645,73645,1116,1116,0,0,0,0,0]
[null,"BD 09","Broadmeadows","Urban",690,5.1775000000000002,1.292,5.2393000000000001,8.7003258802053132E-2,3.3570856542217607E-2,1,1796,1796,16,16,1,2310,2310,7,7]
[null,"BD 10","Broadmeadows","Urban",1137,6.6509999999999998,4.3109999999999999,11.926551999999999,4.472148646647625,0,2,75948,69818,1162,1144,0,0,0,0,0]
[null,"BD 11","Broadmeadows","Urban",2827,10.068999999999999,1.72,7.5255400000000003,0.74025851320482927,0.27398685572714959,6,42692,31725,410,346,5,52671,52671,159,159]
[null,"BD 13","Broadmeadows","Urban",514,9.3889999999999993,2.8029999999999999,12.040863999999999,9.4200432743490889,4.7699852299084786E-2,9,83418,80246,1599,1571,1,1408,1408,8,8]
[null,"BD 14","Broadmeadows","Urban",573,6.6630000000000003,3.0179999999999998,10.57386,3.8346076504329994E-2,0.61286448588499354,0,855,855,6,6,4,45550,45550,107,107]
[null,"BD 15","Broadmeadows","Urban",808,8.64,1.5960000000000001,10.669119999999999,4.6706902183927008,0,4,46967,46967,600,600,0,0,0,0,0]
[null,"BD 16","Broadmeadows","Urban",1447,9.0465,2.4,7.9256319999999993,2.53454779790246,0,3,65871,65286,1511,1510,0,0,0,0,0]
[null,"BY 11","Braybrook","Urban",4018,16.276,2.4369999999999998,9.602208000000001,2.8409650779412945,0.44125128136820135,16,208072,198165,3363,3348,11,107724,107724,347,347]
[null,"BY 12","Braybrook","Urban",1255,4.6775000000000002,0.69599999999999995,3.0483200000000004,1.4383617708168805,1.4682648946792118E-2,10,80232,44547,453,398,1,2730,2730,7,7]
[null,"BY 13","Braybrook","Urban",746,2.9889999999999999,1.7529999999999999,13.412608000000001,3.3981988519820963,5.2839205002129151E-2,3,32066,19779,76,52,1,1662,1662,6,6]
[null,"BY 14","Braybrook","Urban",2872,12.133500000000002,3.3239999999999998,7.4683840000000004,7.4981528957423498,0.21986216112163931,12,532041,166409,6026,3095,12,52002,52002,278,278]
[null,"BY 15","Braybrook","Urban",975,6.1414999999999997,2.2109999999999999,7.7541639999999994,6.8255249443267791,0,7,114697,102046,1781,1738,0,0,0,0,0]
[null,"CN 01","Coburg North","Urban",103,1.8665,0.31,7.5445919999999997,11.348099831627305,1.8164533545841701,5,16182,16182,249,249,3,8634,8634,28,28]
[null,"CN 02","Coburg North","Urban",464,4.8540000000000001,0.93200000000000005,8.6305560000000003,9.7873516771524134,0.43521012915261703,6,109390,109390,1474,1474,2,16214,16214,67,67]
[null,"CN 03","Coburg North","Urban",2045,4.8254999999999999,0.95199999999999996,4.4772199999999991,2.5571916066347979,0.39740900774875793,5,237964,237964,5662,5662,8,123272,123272,397,397]
[null,"CN 04","Coburg North","Urban",1368,7.3710000000000004,5.7565,10.554808000000001,16.166256975813216,1.2971847260898952,8,238571,238571,4246,4246,6,63810,63810,173,173]
[null,"CN 05","Coburg North","Urban",3953,13.041499999999999,1.5840000000000001,8.211412000000001,9.9015982505565852,0.23255812459135222,15,848489,842695,10933,10914,14,66428,66428,208,208]
[null,"CN 06","Coburg North","Urban",2090,9.859,1.333,7.4874360000000006,3.4062460045637213,0.26242142723479517,7,144581,105989,4376,4230,4,37129,37129,111,111]
[null,"CN 07","Coburg North","Urban",5406,15.930499999999999,1.341,9.2211680000000005,4.9401285442743319,0.571745681964688,14,488523,488438,16740,16739,15,188464,188464,783,783]
[null,"CN 08","Coburg North","Urban",2069,11.3865,2.1669999999999998,4.5915319999999999,4.1312187771009397,0.31915228192475342,7,287217,287217,5607,5607,6,73962,73962,250,250]
[null,"CN 09","Coburg North","Urban",48,2.4325000000000001,0.54200000000000004,4.534376,0.54295623585388386,5.9200374775081306,3,778,778,51,51,5,28276,28276,61,61]
[null,"CN 10","Coburg North","Urban",1948,6.2469999999999999,1.0669999999999999,7.9827879999999993,2.4843889737904359,9.9584563591253381E-3,8,80830,80347,2112,2111,1,1080,1080,4,4]
[null,"CN 11","Coburg North","Urban",3219,10.333500000000001,1.3919999999999999,7.735112,3.6663240768219278,0.29188151861578798,15,312475,312475,8786,8786,7,82922,82922,362,362]
[null,"COO11","Coolaroo","Rural-short",1668,134.18900000000002,24.974,8.9734920000000002,27.132370839076106,3.3760658612406091,19,723463,723195,1262,1261,45,300067,300067,1052,1052]
[null,"COO12","Coolaroo","Urban",1,0.26900000000000002,0.54900000000000004,null,0,0,0,0,0,0,0,0,0,0,0,0]
[null,"COO13","Coolaroo","Urban",3913,6.23,11.297000000000001,11.031108,2.7669656585891045,2.9616671816312251E-2,9,228987,178137,4981,4815,2,8170,8170,25,25]
[null,"COO14","Coolaroo","Urban",2514,1.3824999999999998,13.884,6.0775880000000004,0.4357033046521131,0,8,34404,34404,158,158,0,0,0,0,0]
[null,"COO21","Coolaroo","Rural-short",1928,16.844999999999999,10.721499999999999,7.3731239999999998,1.1514770904988108,0.20078868435823397,4,64788,5840,907,26,5,37658,37658,157,157]
[null,"COO22","Coolaroo","Urban",3883,0.71299999999999997,19.277999999999999,9.373584000000001,0.71603122988862478,0,4,48546,48546,195,195,0,0,0,0,0]
[null,"CS 02","Coburg South","Urban",5540,14.763500000000001,1.0449999999999999,10.878691999999999,1.7686632505521198,0.47253926704116828,16,190280,158773,2447,2343,20,169459,169459,666,666]
[null,"CS 03","Coburg South","Urban",3858,10.887499999999999,2.4039999999999999,9.1259080000000008,13.175852849340144,0.34929593380977514,22,877221,560296,21590,17300,9,77518,77518,311,311]
[null,"CS 05","Coburg South","Urban",4717,12.109500000000001,0.71099999999999997,8.9163359999999994,1.9865163944141044,0.30213125739047514,9,194118,64231,682,414,9,98412,98412,369,369]
[null,"CS 08","Coburg South","Urban",2955,8.5,2.2549999999999999,7.9637359999999999,3.0630109705747652,0.59588047735245642,4,156029,19504,3196,156,6,101180,101180,259,259]
[null,"CS 09","Coburg South","Urban",1989,4.0339999999999998,1.8280000000000001,4.6105840000000002,3.2006756594156709,3.2171804654493562E-2,5,267421,250288,1275,1226,1,8960,8960,35,35]
[null,"CS 12","Coburg South","Urban",1944,9.0694999999999997,0.96,6.6682000000000006,1.7971400357856229,0.38916885064430939,14,67980,41890,456,381,4,49070,49070,183,183]
[null,"CS 13","Coburg South","Urban",1768,5.5754999999999999,2.5150000000000001,3.3531520000000001,1.1920609837497493,2.8492950576923855E-2,7,89502,89502,526,526,3,7131,7131,66,66]
[null,"EP 02","East Preston","Urban",65,0.77449999999999997,0.36549999999999999,2.7377723999999999,1.4921562530760487E-2,2.1172298334661872,1,96,96,2,2,3,45405,45405,114,114]
[null,"EP 03","East Preston","Urban",93,1.0354999999999999,0.45650000000000002,1.71468,0,0,0,0,0,0,0,0,0,0,0,0]
[null,"EP 04","East Preston","Urban",6,1.1265000000000001,0.36699999999999999,1.0745327999999998,0.63470195160044141,0,1,745,745,2,2,0,0,0,0,0]
[null,"EP 07","East Preston","Urban",45,1.9155,0.71899999999999997,2.4577079999999998,0,4.1124714798348165E-2,0,0,0,0,0,1,485,485,5,5]
[null,"EP 09","East Preston","Urban",236,2.5505,0.66100000000000003,3.0864239999999996,0.45362685830929494,2.8123954317870445E-2,6,5976,2908,64,54,1,1235,1235,19,19]
[null,"EP 11","East Preston","Urban",472,3.851,0.55400000000000005,1.9204416,4.1662431610066906E-2,0.1805404438389577,1,2143,2143,26,26,2,30955,30955,96,96]
[null,"EP 16","East Preston","Urban",58,1.9529999999999998,0.151,2.8463687999999996,0.20643894161686019,0,1,706,706,5,5,0,0,0,0,0]
[null,"EP 17","East Preston","Urban",131,1.0295000000000001,0.47699999999999998,3.1607267999999995,0,3.8653348515507613,0,0,0,0,0,5,87945,87945,194,194]
[null,"EP 18","East Preston","Urban",18,1.2709999999999999,0.46150000000000002,1.6117991999999999,0.32682360703737834,0,1,800,800,16,16,0,0,0,0,0]
[null,"EP 20","East Preston","Urban",309,2.4975000000000001,0.1615,3.1664423999999998,2.6786204809127865,0.24651819775757705,6,49095,49095,413,413,5,15061,15061,62,62]
[null,"EP 27","East Preston","Urban",26,5.2499999999999998E-2,1.49,1.9890287999999998,2.7686532293200086E-2,0,1,120,120,3,3,0,0,0,0,0]
[null,"EP 34","East Preston","Urban",1431,5.2149999999999999,0.754,3.0406991999999997,0.12289166590134119,0.16552037094087163,4,13415,12952,159,157,9,60228,60228,228,228]
[null,"EP 35","East Preston","Urban",31,1.8809999999999998,0.39700000000000002,2.6520383999999999,0.19873743710352315,0,0,326,326,2,2,0,0,0,0,0]
[null,"EP 36","East Preston","Urban",966,5.218,0.20950000000000002,2.1947904,0.65523286445001561,0.14915941059999158,4,56292,56292,1195,1195,4,42715,42715,82,82]
[null,"EP 37","East Preston","Urban",833,3.6755,0.32600000000000001,3.3036167999999999,0.33482972531002797,0.69075224829377135,4,14301,14301,155,155,7,98343,98343,332,332]
[null,"EP 41","East Preston","Urban",56,1.4055,0.53600000000000003,2.9321027999999996,0,0,0,0,0,0,0,0,0,0,0,0]
[null,"EP 42","East Preston","Urban",286,2.6545000000000001,0.54,3.0121212000000002,2.3072906190684175,0,1,35742,35742,284,284,0,0,0,0,0]
[null,"ES 01","Essendon","Urban",1139,4.3334999999999999,0.5495000000000001,5.1535659999999996,0.10950138564149267,2.7985936391923084E-2,2,4869,4869,58,58,1,4148,4148,17,17]
[null,"ES 02","Essendon","Urban",1469,5.0229999999999997,0.751,3.7056140000000006,0.28134274263616377,0.25744266755695383,4,20113,18475,156,142,4,61348,61348,352,352]
[null,"ES 03","Essendon","Urban",2631,7.5504999999999995,1.133,6.9635060000000006,1.9870641527251531,0.23124735513279127,3,177188,165698,1945,1912,10,68735,68735,284,284]
[null,"ES 06","Essendon","Urban",2029,5.73,1.9704999999999999,5.5631839999999997,0.74622531088836841,0.23420318880990784,5,50944,35131,297,236,4,53296,53296,129,129]
[null,"ES 07","Essendon","Urban",1303,3.7894999999999999,0.45999999999999996,3.0387940000000002,4.2489877727027635E-2,5.5707810091521287E-2,1,3311,3311,19,19,2,14470,14470,43,43]
[null,"ES 11","Essendon","Urban",1546,3.4234999999999998,0.5625,4.7534739999999998,0.58757536596388682,0.12464367939191462,10,39564,39347,321,320,6,27976,27976,127,127]
[null,"ES 12","Essendon","Urban",1242,2.7490000000000001,1.819,5.0106760000000001,0.32900230528034347,0.19685836587541611,3,16904,16904,118,118,2,33715,33715,113,113]
[null,"ES 13","Essendon","Urban",1840,4.2435,1.0255000000000001,5.8299119999999993,0.13307499067367179,0.20313025856814387,2,7093,7093,74,74,9,36090,36090,143,143]
[null,"ES 14","Essendon","Urban",1060,3.8605,1.9024999999999999,4.7629999999999999,0.22374284107777251,0,3,11555,3401,59,28,0,0,0,0,0]
[null,"FE 05","Footscray","Urban",3098,8.4224999999999994,0.85399999999999998,8.0399440000000002,5.2569113138662518,0.43132886107286272,15,385284,351673,3702,3611,5,105375,105375,418,418]
[null,"FE 06","Footscray","Urban",4021,9.89,8.7515000000000001,12.593372,1.1659479059072964,0.32523184393936538,5,52968,35217,286,240,5,49250,49250,169,169]
[null,"FE 08","Footscray","Urban",2216,3.6399999999999997,5.0764999999999993,8.8210759999999997,2.1171146840426762,1.4693265746850452,9,72697,34045,373,235,13,168178,168178,591,591]
[null,"FE 09","Footscray","Urban",4128,7.5860000000000003,1.149,6.4967319999999997,4.4790424746222692,0.51398986725445661,14,471310,471310,11233,11233,11,180283,180283,521,521]
[null,"FF 87","Fairfield","Urban",737,2.6345000000000001,0.23799999999999999,1.9547352,1.0638600698671148,2.6024533967179422E-2,2,55800,55800,1011,1011,1,4550,4550,13,13]
[null,"FF 88","Fairfield","Urban",1269,3.9509999999999996,0.41349999999999998,2.1604967999999998,1.5233529648207587E-2,0.13936371517557183,0,1485,1485,9,9,7,45285,45285,204,204]
[null,"FF 89","Fairfield","Urban",591,3.9104999999999999,0.84050000000000002,2.3891207999999997,0.82878431957698417,4.9195798758276225E-2,2,36692,36692,382,382,1,7260,7260,22,22]
[null,"FF 90","Fairfield","Urban",1036,3.4249999999999998,0.39400000000000002,2.6005979999999993,0.18363454058361456,0,3,12636,12636,109,109,0,0,0,0,0]
[null,"FF 95","Fairfield","Urban",1646,4.7919999999999998,6.5000000000000002E-2,3.1550112000000001,1.2033195851555512,0.32069990499072287,9,118827,118827,518,518,7,105563,103163,455,440]
[null,"FF 96","Fairfield","Urban",1034,3.6920000000000002,0.38600000000000001,2.3719739999999998,5.1060850991601396E-2,4.8010884193783734E-3,1,4403,4403,38,38,1,1380,1380,6,6]
[null,"FT 01","Flemington","Urban",3649,6.7074999999999996,2.6419999999999999,6.9920840000000002,1.8060020311958251,0.20554054876079306,8,165181,114008,3992,3849,5,62664,62664,201,201]
[null,"FT 02","Flemington","Urban",277,1.5905,5.5289999999999999,3.14358,1.5317635717956603E-2,0.25497171299453009,0,206,206,1,1,2,11430,11430,33,33]
[null,"FT 04","Flemington","Urban",1008,3.1715,2.5225,4.0009199999999998,9.3537935006212117E-2,0.62280968096946399,1,3192,3192,13,13,5,70845,70845,166,166]
[null,"FT 05","Flemington","Urban",2404,4.6735000000000007,2.0345,4.3533819999999999,0.30268914582078221,0,4,25500,25500,319,319,0,0,0,0,0]
[null,"FT 06","Flemington","Urban",246,0.81400000000000006,1.2574999999999998,2.1719279999999999,0.51750509320637272,0,2,9938,9398,249,247,0,0,0,0,0]
[null,"FT 09","Flemington","Urban",1711,3.0964999999999998,3.1680000000000001,5.1440400000000004,2.8425168624774773,0.13071704469775722,5,128288,120381,3731,3705,3,19665,19665,50,50]
[null,"FT 10","Flemington","Urban",2061,4.1539999999999999,1.7995000000000001,4.0199720000000001,0.52780081328039474,1.5212844108605097E-2,3,36502,12936,212,57,1,3507,3507,7,7]
[null,"FT 13","Flemington","Urban",1805,2.6804999999999999,5.5805000000000007,5.8108599999999999,1.8041275996165906,5.5362996090280912E-2,3,107010,107010,1862,1862,2,10946,10946,38,38]
[null,"FT 14","Flemington","Urban",1595,1.8824999999999998,1.706,4.6486879999999999,4.0583858573787994,0.58821257561004614,3,176832,176832,835,835,3,85432,85432,220,220]
[null,"FT 15","Flemington","Urban",88,0.1265,0.94249999999999989,3.4293599999999995,0,0,0,0,0,0,0,0,0,0,0,0]
[null,"FW 04","Footscray West","Urban",1498,5.6315,1.4765000000000001,7.735112,2.0611267633715569,0.7941843736050217,7,51388,43209,280,249,9,66002,66002,258,258]
[null,"FW 05","Footscray West","Urban",1637,7.4749999999999996,1.135,4.534376,0.41329419043852322,2.9312402235653328E-2,3,25925,25925,1675,1675,1,6129,6129,27,27]
[null,"FW 06","Footscray West","Urban",959,5.6225000000000005,2.6509999999999998,4.8011040000000005,1.7526071426772611,0.10346455532884324,4,52520,28000,1095,122,3,10335,10335,26,26]
[null,"FW 08","Footscray West","Urban",2879,8.2040000000000006,1.0325,8.3066720000000007,2.2508340804399327,0.45500797099402984,14,148594,28633,3104,244,9,100128,100128,346,346]
[null,"FW 09","Footscray West","Urban",1412,9.0664999999999996,3.665,8.5352960000000007,4.7644559422861361,0.51083401309185383,10,114524,109424,1229,1218,7,40930,40930,124,124]
[null,"FW 13","Footscray West","Urban",467,5.1395,0.64400000000000002,11.316887999999999,7.6873682650405062,0,2,39279,39279,789,789,0,0,0,0,0]
[null,"FW 16","Footscray West","Urban",2519,9.1864999999999988,0.30249999999999999,4.7629999999999999,2.94261123490532,0.94917148133339657,9,206720,108549,637,458,8,222266,222266,692,692]
[null,"FW 17","Footscray West","Urban",2267,8.5830000000000002,0.30499999999999999,4.0009199999999998,1.5917309653371639,0.13638558303693626,10,154720,75323,469,314,4,44190,44190,133,133]
[null,"HB 14","Heidelberg","Urban",1709,5.3064999999999998,2.0019999999999998,5.1059359999999998,5.2313037105662081,0.17683588034225969,7,294352,294352,5406,5406,3,33167,33167,145,145]
[null,"HB 15","Heidelberg","Urban",2393,9.3949999999999996,1.2845,6.0109060000000003,0.45163372912091693,0.23625914571773926,6,33411,33411,263,263,5,58260,58260,179,179]
[null,"HB 22","Heidelberg","Urban",1126,5.0090000000000003,0.90400000000000003,3.9151859999999998,2.135818939918253,0,9,101457,101457,1916,1916,0,0,0,0,0]
[null,"HB 23","Heidelberg","Urban",1482,5.4785000000000004,0.51449999999999996,3.781822,3.3747249451955637,0.33516199172006517,5,281458,52527,1935,397,6,93177,93177,328,328]
[null,"HB 24","Heidelberg","Urban",869,6.4619999999999997,0.34599999999999997,3.5913019999999998,0.72123099381676947,5.242782161088156E-2,2,33635,10136,129,66,4,8150,8150,29,29]
[null,"HB 31","Heidelberg","Urban",743,1.51,0.52800000000000002,3.7341920000000002,0.10608169150443005,0,1,3339,3339,62,62,0,0,0,0,0]
[null,"HB 32","Heidelberg","Urban",512,2.1179999999999999,0.57799999999999996,3.0959499999999998,0.60281513847443791,0.38401101244835562,1,16657,16657,520,520,2,35370,35370,93,93]
[null,"KLO22","Kalkallo","Rural-short",1881,12.246500000000001,16.372499999999999,4.1914400000000009,7.8303586819478105E-2,0,1,6118,6118,23,23,0,0,0,0,0]
[null,"NH 02","North Heidelberg","Urban",4236,16.302,4.1079999999999997,9.1830639999999999,6.7721731439363806,0.33314070806427709,16,609043,607891,7935,7934,8,99868,99868,480,480]
[null,"NH 03","North Heidelberg","Urban",1291,9.1610000000000014,0.78,7.6970079999999994,2.3655959220739535,8.3321446181019179E-2,7,71631,64841,460,397,3,8410,8410,38,38]
[null,"NH 05","North Heidelberg","Urban",4529,16.184000000000001,1.1339999999999999,6.858719999999999,6.3092643698351516,8.808742928095166E-2,10,701782,537876,12589,10469,6,32660,32660,226,226]
[null,"NH 08","North Heidelberg","Urban",2603,11.440000000000001,1.3334999999999999,5.5060280000000006,5.7687490192755986,9.0233991412336567E-2,9,585544,585544,6296,6296,7,30530,30530,138,138]
[null,"NH 09","North Heidelberg","Urban",632,6.5075000000000003,1.2645,9.5259999999999998,6.0463166748653583,0.20738757643321845,10,66840,62714,766,735,4,7642,7642,25,25]
[null,"NH 12","North Heidelberg","Urban",18,0,4.0278801246881697,4.6486879999999999,0,0.10505463174894214,0,0,0,0,0,1,176,176,1,1]
[null,"NH 13","North Heidelberg","Urban",405,1.6885000000000001,2.7275,6.9349280000000002,9.2934473045410276E-2,0,0,635,635,5,5,0,0,0,0,0]
[null,"NH 16","North Heidelberg","Urban",2557,7.1760000000000002,4.4859999999999998,7.9256319999999993,6.1809878571724903,0.25122333637029148,10,333329,331760,1282,1269,6,45160,45160,187,187]
[null,"NH 17","North Heidelberg","Urban",2240,7.2799999999999994,2.1404999999999998,7.0873439999999999,1.3107129088594216,1.8054023713213438,6,60864,53423,263,245,6,279451,279451,741,741]
[null,"NH 20","North Heidelberg","Urban",1962,7.8525,2.4249999999999998,6.7634600000000002,3.3231598951832444,0.19022856882037223,6,149939,142866,2261,2046,2,28610,28610,96,96]
[null,"NS 07","North Essendon","Urban",1019,3.7130000000000001,1.68,4.4486419999999995,3.4659880896030839,0,1,124503,1071,1058,8,0,0,0,0,0]
[null,"NS 08","North Essendon","Urban",1151,2.9449999999999998,0.26250000000000001,2.8578000000000001,0.41497094227654224,7.7928170195343113E-3,2,30193,29197,104,101,1,1890,1890,6,6]
[null,"NS 09","North Essendon","Urban",1013,3.6589999999999998,1.147,4.2485959999999992,8.5209576231072739E-2,1.8330713295868016E-2,1,3319,3319,39,39,1,2380,2380,17,17]
[null,"NS 11","North Essendon","Rural-short",0,0,4.7E-2,null,0,0,0,0,0,0,0,0,0,0,0,0]
[null,"NS 12","North Essendon","Urban",1232,3.6764999999999999,1.17,3.1150020000000005,1.046234181826748,0.30769051117823093,6,95130,95130,1358,1358,6,93257,93257,268,268]
[null,"NS 14","North Essendon","Urban",1411,5.6135000000000002,1.2629999999999999,4.943994,2.0387707823047929,0,8,123114,123114,1802,1802,0,0,0,0,0]
[null,"NS 15","North Essendon","Urban",1557,4.4039999999999999,1.145,4.4486419999999995,0.20323975734868768,1.0119422044548585E-2,5,12653,12653,78,78,1,2100,2100,12,12]
[null,"NS 16","North Essendon","Urban",706,3.1885000000000003,0.42199999999999999,1.8385180000000001,0.45674958320913206,0,3,37427,37334,1262,1261,0,0,0,0,0]
[null,"NS 17","North Essendon","Urban",815,3.5760000000000001,0.51300000000000001,2.6005979999999997,0.39848501928136554,8.7469626931410832E-2,3,27054,24050,110,97,3,19795,19795,109,109]
[null,"NS 18","North Essendon","Urban",1723,3.4465000000000003,2.6379999999999999,4.9249419999999997,3.1969843695880393,3.4636378345254994E-2,4,164481,164481,3520,3520,2,5940,5940,16,16]
[null,"NT 01","Newport","Urban",2,0.66800000000000004,5.6449999999999996,null,0,0,0,0,0,0,0,0,0,0,0,0]
[null,"NT 03","Newport","Urban",3183,10.963000000000001,3.629,10.116612000000002,7.2717514873535452,0.56738495565594849,11,462854,158227,3973,454,7,120382,120382,354,354]
[null,"NT 04","Newport","Urban",1566,3.3769999999999998,1.946,8.078047999999999,10.161018599827361,0.29166116361720712,5,245820,245630,385,384,1,23520,23520,56,56]
[null,"NT 10","Newport","Urban",65,1.8969999999999998,0.83749999999999991,1.828992,2.4114105618744271E-2,0.17037862900967937,0,116,116,1,1,4,2732,2732,16,16]
[null,"NT 11","Newport","Urban",3506,9.8595000000000006,2.4274999999999998,9.5831560000000007,9.9156322153413257,1.5267433960794998,12,795985,538654,10992,7341,8,408535,408535,896,896]
[null,"NT 15","Newport","Urban",1146,5.3810000000000002,2.9364999999999997,5.3726639999999994,0.27836693894296677,0.22828633126139886,4,12911,7127,84,63,3,35294,35294,147,147]
[null,"NT 16","Newport","Urban",213,2.9260000000000002,1.609,5.3726639999999994,0.20916201061745859,0.77314632947329642,1,3305,3305,534,534,3,40722,40722,107,107]
[null,"NT 17","Newport","Urban",2792,8.6834999999999987,2.8849999999999998,9.887988,0.58595628230593222,0.55598949301697942,7,28423,28423,265,265,7,89898,89898,243,243]
[null,"P  56","Preston","Urban",2,2.0495000000000001,0.255,null,1.2910969073322482,0,1,833,833,2,2,0,0,0,0,0]
[null,"P  57","Preston","Rural-short",101,1.7845,0.28199999999999997,0.29721119999999995,0.63571659429513927,0,2,45815,45815,200,200,0,0,0,0,0]
[null,"P  58","Preston","Rural-short",0,0.127,4.1000000000000002E-2,null,0,0,0,0,0,0,0,0,0,0,0,0]
[null,"P  59","Preston","Rural-short",815,2.8354999999999997,1.607,1.1259732,0.39361501768982776,1.6006032572951315E-2,1,53118,53118,815,815,3,7200,7200,38,38]
[null,"P  61","Preston","Urban",82,0.41849999999999998,0.153,0.28577999999999998,0,0,0,0,0,0,0,0,0,0,0,0]
[null,"P  62","Preston","Urban",664,1.8220000000000001,0.81,3.172158,1.6748717532914233E-2,1.2034763969214985E-2,0,620,620,5,5,2,1485,1485,7,7]
[null,"P  63","Preston","Urban",849,2.8295000000000003,0.154,2.3891207999999997,0.88244041149732699,0,2,57197,57197,923,923,0,0,0,0,0]
[null,"P  65","Preston","Urban",254,0.36299999999999999,0.16450000000000001,0.98308319999999993,0.38832707353539708,0.62078843188041588,1,14157,14157,59,59,3,75439,75439,213,213]
[null,"P  66","Preston","Urban",728,2.1524999999999999,0.65700000000000003,3.200736,9.3784371116310272E-2,0.53578920444267608,2,3926,3926,54,54,3,74764,74764,280,280]
[null,"PV 12","Pascoe Vale","Urban",468,2.6145,1.647,2.2767140000000001,0.1596108223385177,0.1528789373147163,1,4851,4126,35,34,1,15488,15488,121,121]
[null,"PV 13","Pascoe Vale","Urban",3119,10.0535,0.52700000000000002,5.2774040000000007,0.39432030192200823,1.0507969228007593E-3,7,45031,44547,363,361,1,400,400,2,2]
[null,"PV 14","Pascoe Vale","Urban",2749,10.064,0.93400000000000005,5.8299119999999993,1.7667731060225869,3.0498783387419265E-2,2,179436,1476,2793,13,4,10325,10325,43,43]
[null,"PV 15","Pascoe Vale","Urban",1724,5.3925000000000001,0.372,3.6389320000000001,0.9985588217643534,0.30307457971758595,4,100712,99630,1807,1804,4,101891,101891,407,407]
[null,"PV 21","Pascoe Vale","Urban",1233,5.5994999999999999,0.18099999999999999,2.6672799999999999,0.41345285850181307,0,3,33435,33435,627,627,0,0,0,0,0]
[null,"PV 22","Pascoe Vale","Urban",2526,9.8885000000000005,0.42799999999999999,5.9442240000000002,1.4768801472489246,3.2462743667372444E-2,7,150064,150064,1922,1922,2,10995,10995,51,51]
[null,"PV 23","Pascoe Vale","Urban",2369,8.1074999999999999,0.17599999999999999,5.0964099999999997,1.0307101093868563,0,3,104312,103454,2462,2461,0,0,0,0,0]
[null,"PV 24","Pascoe Vale","Urban",1661,6.91,0.53500000000000003,4.8011040000000005,3.585841642731447,0,3,227902,227902,1908,1908,0,0,0,0,0]
[null,"PV 31","Pascoe Vale","Urban",1964,5.8109999999999999,1.4710000000000001,4.6772660000000004,2.629737981038367,1.9100835795972302E-3,5,166451,166451,430,430,2,403,403,2,2]
[null,"SA 02","St Alban","Rural-short",62,13.813499999999999,0,0.45724799999999999,7.6830444430731809E-2,0.24745258777887474,2,2283,2283,11,11,2,24510,24510,61,61]
[null,"SA 06","St Alban","Rural-short",144,4.3379999999999992,1.2030000000000001,0.45724799999999999,3.7774407623731278E-2,8.346014112492986E-3,1,2607,1008,9,8,1,1920,1920,16,16]
[null,"SA 10","St Alban","Rural-short",43,1.262,0.81599999999999995,3.8103999999999999E-2,3.1054936232532047E-3,0,1,768,768,43,43,0,0,0,0,0]
[null,"SA 12","St Alban","Urban",1835,1.085,6.1879999999999997,3.8103999999999996,0.27438184679321004,0,2,28957,28957,1998,1998,0,0,0,0,0]
[null,"SBY11","Sunbury","Rural-short",2965,62.229500000000002,10.736000000000001,6.744408,3.8233715848181129,0.35314971173480852,22,259826,257035,5431,5426,23,79997,79997,347,347]
[null,"SBY13","Sunbury","Urban",0,0,0.14149999999999999,null,0,0,0,0,0,0,0,0,0,0,0,0]
[null,"SBY14","Sunbury","Rural-short",4095,90.891999999999996,23.137999999999998,11.812239999999999,4.7637013794889862,0.32506499148853885,13,282771,62489,4452,307,18,64319,64319,278,278]
[null,"SBY31","Sunbury","Urban",2102,6.5579999999999998,7.9669999999999996,7.5255400000000003,0.30454219867152238,0.45029454150935455,6,12782,12782,99,99,5,62998,62998,260,260]
[null,"SBY32","Sunbury","Rural-short",2902,116.59700000000001,10.246500000000001,6.4014720000000001,4.5714320342458228,0.355170237755566,19,356200,356200,3605,3605,45,92248,92248,372,372]
[null,"SBY33","Sunbury","Urban",2991,14.129999999999999,4.5779999999999994,6.8206160000000002,2.3195647887262409,0.64088233673867878,5,187372,186874,3167,3166,13,172566,172566,783,783]
[null,"SHM11","Sydenham","Rural-short",1040,64.442000000000007,2.7656499999999999,2.6672799999999999,0.44058092120190245,0.23285618181101567,16,20599,20599,308,308,20,36290,36290,202,202]
[null,"SHM12","Sydenham","Urban",2834,4.7119999999999997,14.03895,8.211412000000001,0.96280456663006053,0.33973702796424704,5,67875,67875,174,174,4,79835,79835,173,173]
[null,"SHM14","Sydenham","Rural-short",3841,18.914999999999999,21.957550000000001,10.935848,8.9101269949799455,1.6010979899857365,6,630573,629216,7554,7544,14,377701,377701,940,940]
[null,"SHM21","Sydenham","Urban",4882,3.8849999999999998,19.575749999999999,10.57386,2.2351255741045986,0,6,207082,207082,1431,1431,0,0,0,0,0]
[null,"SHM24","Sydenham","Urban",1,0,0.40350000000000003,null,0,0,0,0,0,0,0,0,0,0,0,0]
[null,"ST 11","Somerton","Urban",173,6.9510000000000005,3.9989999999999997,6.9730319999999999,18.083451111844347,0.4473361707201331,4,56914,56914,651,651,1,4693,4693,13,13]
[null,"ST 12","Somerton","Urban",241,9.5745000000000005,3.1360000000000001,7.677956,7.7259613720921596,0.13464398823935858,4,28369,2105,249,9,3,1648,1648,10,10]
[null,"ST 13","Somerton","Urban",191,4.7885,4.2619999999999996,6.3633679999999995,4.435059446595119,0,4,21457,21457,389,389,0,0,0,0,0]
[null,"ST 14","Somerton","Urban",82,0,4.9850000000000003,7.3350200000000001,0,0,0,0,0,0,0,0,0,0,0,0]
[null,"ST 21","Somerton","Rural-short",3,0,1.2889999999999999,0.38104000000000005,0,0,0,0,0,0,0,0,0,0,0,0]
[null,"ST 22","Somerton","Urban",4272,6.8279999999999994,16.856999999999999,14.441415999999998,9.9050165115410262,0.78097295510440445,8,495859,495859,10087,10087,11,130322,130322,446,446]
[null,"ST 23","Somerton","Urban",142,7.1654999999999998,3.5030000000000001,11.012056000000001,4.3905945652617708,5.7869686727882744E-2,3,8194,8194,36,36,1,360,360,2,2]
[null,"ST 24","Somerton","Urban",1,0,3.7650000000000001,null,0,0,0,0,0,0,0,0,0,0,0,0]
[null,"ST 31","Somerton","Urban",1,0,0.61699999999999999,null,1.4488945788569092,0,1,86,86,1,1,0,0,0,0,0]
[null,"ST 32","Somerton","Rural-short",5635,10.0875,30.045999999999999,10.916796,5.6710212174296935,0.17290886391643798,10,497919,497919,11579,11579,10,50605,50125,147,146]
[null,"ST 33","Somerton","Urban",3096,10.651999999999999,5.3245000000000005,8.7258159999999982,5.3503526871871951,0,6,334051,277924,6650,6544,0,0,0,0,0]
[null,"ST 34","Somerton","Urban",301,7.0250000000000004,7.0250000000000004,9.0115959999999991,7.4042046443960112,1.489883574853748,3,51585,51585,930,930,3,34600,34600,114,114]
[null,"TH 11","Tottenham","Urban",61,3.1135000000000002,0.83450000000000002,3.8485039999999997,1.8375450813183782,2.5396208226321,2,3358,3358,62,62,3,15470,15470,41,41]
[null,"TH 12","Tottenham","Urban",24,3.4624999999999999,0.65900000000000003,8.2685680000000001,4.9892723346193044,1.5972915423354723,2,2755,2755,32,32,1,2940,2940,6,6]
[null,"TH 13","Tottenham","Urban",55,3.2275,0.502,4.8392079999999993,1.1700979892220889,0.10979333555255723,3,2270,2270,12,12,2,710,710,11,11]
[null,"TH 14","Tottenham","Rural-short",0,0,7.2999999999999995E-2,null,0,0,0,0,0,0,0,0,0,0,0,0]
[null,"TH 21","Tottenham","Urban",163,5.4820000000000002,0.80200000000000005,16.175148,0.62850826930546122,0.28581692664758274,3,2871,1926,19,16,1,4352,4352,17,17]
[null,"TH 22","Tottenham","Urban",878,10.334,3.7199999999999998,5.6584439999999994,3.3776667048614022,0.45671993397122085,12,112370,80485,306,263,6,50648,50648,204,204]
[null,"TH 23","Tottenham","Rural-short",2,0,6.6000000000000003E-2,null,0,0,0,0,0,0,0,0,0,0,0,0]
[null,"TH 24","Tottenham","Rural-short",0,0,6.5000000000000002E-2,null,0,0,0,0,0,0,0,0,0,0,0,0]
[null,"TT 03","Thomastown","Urban",2856,13.2705,4.3004999999999995,10.840588,1.6381029938942597,3.0106831801313088,10,74200,71434,436,426,42,454576,454576,1751,1751]
[null,"TT 08","Thomastown","Urban",2780,13.57,1.758,7.0111359999999996,1.5941991276020731,0.35365609150375737,16,90978,79382,672,590,4,67275,67275,211,211]
[null,"TT 10","Thomastown","Urban",4121,14.3025,1.0945,8.4209840000000007,3.7089273405171008,0.46501461637721198,13,310315,290700,3460,3295,12,129688,129688,408,408]
[null,"TT 11","Thomastown","Urban",4728,15.121,0.59299999999999997,9.7927280000000003,4.46843077945391,0.77247036115068035,17,485967,485224,6495,6493,39,280035,280035,1216,1216]
[null,"WT 04","Watsonia","Urban",144,3.0449999999999999,1.6139999999999999,2.1719279999999999,5.5321445662298938E-3,0,0,52,52,1,1,0,0,0,0,0]
[null,"YTS01","Yarraville","Rural-short",2506,7.8734999999999999,13.7165,6.0013800000000002,3.6493624229062016,8.4622810243286471E-3,5,244519,244519,5003,5003,1,1890,0,7,0]
[null,"YTS02","Yarraville","Urban",484,1.6625000000000001,0.94900000000000007,4.3438559999999997,7.4191265009573444,0.26262853105151845,2,85935,85935,1048,1048,1,10140,10140,26,26]
[null,"YTS03","Yarraville","Urban",681,4.7769999999999992,2.7655000000000003,6.1918999999999995,3.4524990159221773,0.97825388982294958,5,56493,22279,1435,759,6,53357,53357,117,117]
[null,"YTS04","Yarraville","Urban",779,3.347,1.6,3.5246200000000005,3.6607270970244343,4.1319188838117018E-3,8,119605,45213,2466,898,1,450,450,1,1]
[null,"YTS05","Yarraville","Urban",1,5.0000000000000001E-3,0.83050000000000002,null,0,0,0,0,0,0,0,0,0,0,0,0]
[null,"YTS06","Yarraville","Urban",861,7.9950000000000001,1.3479999999999999,3.2959960000000001,8.4142223213027911,0.28123660686033863,10,313751,225119,3829,2926,5,34956,34956,100,100]
[null,"YTS07","Yarraville","Rural-short",179,2.129,5.8055000000000003,1.657524,0.29985711842946661,0,1,5608,5608,181,181,0,0,0,0,0]
[null,"YTS08","Yarraville","Urban",547,6.2865000000000002,5.1505000000000001,4.1533360000000004,4.9700501127992558,0,4,100191,38086,663,584,0,0,0,0,0]
[null,"YTS10","Yarraville","Urban",1,0,0.63450000000000006,null,0,0,0,0,0,0,0,0,0,0,0,0]
[]
[]
[]
[]
[]
[]
[]
[]
[]
[]
[]
[]
[]
[]
[]
[]
[]
[]
[]
[]
[]
[]
[]
[]
[]
[]
[]
[]
[]
[]
[]
[]
[]
[]
[]
[]
[]
[]
[]
[]
[]
[]
[]
[]
[]
[]
[]
[]
[]
[]
[]
[]
[]
[]
[]
[]
[]
[]
[]
[]
[]
[]
[]
[]
[]
[]
[]
[]
[]
[]
[]
[]
[]
[]
[]
[]
[]
[]
[]
[]
[]
[]
[]
[]
[]
[]
[]
[]
[]
[]
[]
[]
[]
[]
[]
[]
[]
[]
[]
[]
[]
[]
[]
[]
[]
[]
[]
[]
[]
[]
[]
[]
[]
[]
[]
[]
[]
[]
[]
[]
[]
[]
[]
[]
[]
[]
[]
[]
[]
[]
[]
[]
[]
[]
[]
[]
[]
[]
[]
[]
[]
[]
[]
[]
[]
[]
[]
[]
[]
[]
[]
[]
[]
[]
[]
[]
[]
[]
[]
[]
[]
[]
[]
[]
[]
[]
[]
[]
[]
[]
[]
[]
[]
[]
[]
[]
[]
[]
[]
[]
[]
[]
[]
[]
[]
[]
[]
[]
[]
[]
[]
[]
[]
[]
[]
[null,null,null,null,null,null,null,null,null,null,null,null,null,null,null,null,null,null,null,null,null,null," "]

{"sheet":"3.6.8 Network-feeders (2014-15)","index":13,"n_rows":421,"n_cols":23,"rows_kept":421,"cut":false,"hidden":false,"merged":[[10,10,10,14],[10,15,10,19],[10,20,10,22],[11,5,12,5],[11,6,12,6],[11,8,12,8],[11,9,12,9],[11,10,12,10],[11,11,11,12],[11,13,11,14],[11,15,12,15],[11,16,11,17],[11,18,11,19],[11,20,12,20],[11,21,11,22],[5,1,5,4],[5,6,5,8],[10,1,12,1],[10,2,12,2],[10,3,12,3],[10,4,12,4],[10,5,10,6],[10,7,12,7],[10,8,10,9]]}
[null,{"$f":"INDEX(dms_Worksheet_List,MATCH(dms_Model,dms_Model_List))","v":"HISTORICAL ANNUAL REPORTING - FINANCIAL YEARS"}]
[null,{"$f":"INDEX(dms_TradingNameFull_List,MATCH(dms_TradingName,dms_TradingName_List))","v":"Jemena Electricity"}]
[null,{"$f":"dms_Header_Span","v":"2011-12 to 2017-18"}]
[null,"3.6 QUALITY OF SERVICES"]
[]
[null,"Did the MAIFI parameter of the STPIS apply during the period?",null,null,null,"No","** IMPORTANT\nPlease ensure this question is answered correctly. Your response will affect other tables throughout this workbook and will determine which cells are grey and which are input cells. "]
[]
[]
[]
[null,"3.6.8 - NETWORK FEEDER RELIABILITY"]
[null,"Feeder ID / name","Description of the service area for the feeder","Feeder classification\n\n(drop down)","Number of distribution customers","Length of high voltage distribution lines",null,"Maximum demand\n(MVA)","Energy not supplied\n(MWh)",null,"Unplanned Outages",null,null,null,null,"Planned Outages",null,null,null,null,"Momentary feeder outages"]
[null,null,null,null,null,"Overhead","Underground",null,"Unplanned","Planned","Total number of unplanned outages","Unplanned customer minutes off-supply (SAIDI)",null,"Unplanned interruptions\n(SAIFI)",null,"Total number of planned outages","Planned customer minutes off-supply (SAIDI)",null,"Planned interruptions\n(SAIFI)",null,"Total number of momentary feeder outages","Momentary interruptions due to feeder outages (MAIFI)"]
[null,null,null,null,null,null,null,null,null,null,null,"Including excluded events and MEDs","After removing excluded events and MED","Including excluded events and MEDs","After removing excluded events and MED",null,"Including MEDs","After removing  MED","Including MEDs","After removing  MED",null,"Including excluded events and MEDs","After removing excluded events and MED"]
[null,"AW 01","Airport West","Urban",726,4.6790099999999999,4.3238399950000002,8.4971919999999983,0.12867937095435342,0.12361506655185651,1,1677,1677,9,9,5,5370,47,0,0]
[null,"AW 02","Airport West","Urban",3743,13.418119999999998,3.0853750300000002,11.638867265136719,0.28493823368723348,1.0552589378502312E-2,4,15553,15553,225,225,1,1920,8,1,1337]
[null,"AW 03","Airport West","Urban",267,6.0958347973823548,4.4826530156135558,12.98774863256836,0.5563550150778388,0.53055754789825182,1,1611,1611,12,12,3,5121,14,2,538]
[null,"AW 04","Airport West","Urban",1968,11.46397906303406,10.755841723680495,14.104195948852539,0.51062967383060498,0.80189596260241869,3,10465,10465,45,45,5,54781,177,0,0]
[null,"AW 05","Airport West","Urban",549,4.8976299999999995,0.87488383250000001,7.3159679999999998,3.0632571295189814,0.6902306914138564,3,37069,37069,593,593,6,27842,77,0,0]
[null,"AW 06","Airport West","Urban",5042,16.812165,1.6461456000000001,11.92274194885254,1.8075042755691313,0.78381529788827164,7,173764,173764,4481,4481,16,251173,931,0,0]
[null,"AW 07","Airport West","Urban",4676,15.681460000000001,5.7165503849999997,10.802484,6.1969402760381866,0.19108421090296562,10,615659,615659,8570,8570,9,63280,273,0,0]
[null,"AW 08","Airport West","Urban",2389,14.666077700614931,8.653933048784733,10.26521765814209,19.109718668149917,0.46049427349663713,13,722319,722319,11582,11582,9,58020,251,3,3734]
[null,"AW 09","Airport West","Urban",2471,9.4858450000000012,7.2608680184999992,7.7675006325683587,1.1135484701805949,0.19358298922414499,4,63502,63502,414,414,6,36798,87,2,4681]
[null,"AW 11","Airport West","Urban",472,5.9968399999999988,3.3201352489999998,7.8684760000000002,0.1090752643579356,1.6322204350628746,1,1080,1080,7,7,3,53871,101,1,472]
[null,"AW 12","Airport West","Urban",1807,5.7156031506061566,6.95514830160141,8.2647576581420896,1.1820181367914129,0.33349548869204931,3,32269,32269,420,420,10,30348,192,1,2190]
[null,"AW 14","Airport West","Urban",1250,8.8987299999999987,4.713029821000001,7.988503658142089,3.9261481312665567,0.23911786280350708,6,72616,72616,1341,1341,4,14742,62,2,1521]
[null,"BD 01","Broadmeadows","Urban",1695,7.7751150000000013,4.9234617250000001,9.2783240000000013,1.1864470795328763,6.5083667623567348E-2,9,35575,35575,1843,1843,4,6505,41,3,5077]
[null,"BD 02","Broadmeadows","Urban",1,0.66487499999999999,7.3199015000000006E-2,null,0,0,0,0,0,0,0,0,0,0,0,0]
[null,"BD 03","Broadmeadows","Urban",372,4.0118600000000004,6.3280000000000003,11.057780683715821,0.14699175423905916,0.16432265976069496,1,687,687,5,5,3,2560,15,0,0]
[null,"BD 04","Broadmeadows","Urban",1025,8.0632449999999984,4.1286884139999991,9.5907769744262694,3.0429437701295083,0.32082154764943699,4,67608,67608,1101,1101,13,23760,180,4,3454]
[null,"BD 06","Broadmeadows","Urban",1,0.74890499999999993,7.9860364999999989E-2,null,0,0,0,0,0,0,0,0,0,0,3,3]
[null,"BD 07","Broadmeadows","Urban",3341,19.161999999999999,1.84,11.354991999999998,1.8877010806095729,0.80035348383023941,6,139969,139969,2722,2722,10,197815,500,1,2449]
[null,"BD 08","Broadmeadows","Urban",784,9.3769549999999988,1.5205593450000001,8.8896633162841798,2.7635680553398436,0.11837170385840655,6,42472,42472,857,857,2,6064,16,3,1495]
[null,"BD 09","Broadmeadows","Urban",689,5.094125,1.3661574635,5.4641136581420895,8.8151368119704436,0.41945848857950768,9,169570,169570,1553,1553,3,26896,54,2,722]
[null,"BD 10","Broadmeadows","Urban",1150,6.6130000000000004,4.3109999999999999,11.46168331628418,5.1224175617655889E-2,4.3173874605623844E-2,3,929,929,9,9,2,2610,6,0,0]
[null,"BD 11","Broadmeadows","Urban",2856,10.073,1.72,6.7901329744262693,0.63713381276691405,1.0728308168120764,6,38853,38853,324,324,18,218074,833,0,0]
[null,"BD 13","Broadmeadows","Urban",485,8.7864400000000007,2.5091000179999998,10.19663034185791,2.3575980322738417,0.53633477311354849,9,21970,21970,134,134,2,16660,42,0,0]
[null,"BD 14","Broadmeadows","Urban",598,6.6710000000000003,3.0529999999999999,10.531945948852538,6.8862236728729521E-3,1.3281793600335632,0,167,167,2,2,12,107367,369,0,0]
[null,"BD 15","Broadmeadows","Urban",807,8.6471049999999998,1.8169707140000002,10.596722632568358,1.6199394324086194,0.34392065889180107,1,16636,16636,525,525,2,11773,55,2,591]
[null,"BD 16","Broadmeadows","Urban",1450,9.1778650000000006,2.4209478349999998,7.6398520000000012,0.15542535801596155,0.36148401088520138,4,3981,3981,36,36,5,30863,126,0,0]
[null,"BY 11","Braybrook","Urban",4070,16.207664999999999,2.4367753349999997,9.3545320000000007,2.1305188372199302,0.11731210380636628,10,155441,155441,1697,1697,5,28530,101,1,4043]
[null,"BY 12","Braybrook","Urban",1273,4.6783450000000002,0.69591365149999995,2.76254,0.73311635991286594,0,2,43623,43623,1296,1296,0,0,0,1,1269]
[null,"BY 13","Braybrook","Urban",741,2.9738249999999997,1.8459547349999998,13.412608000000001,14.350869341386925,1.8544103156180607E-3,3,139298,139298,2036,2036,1,60,1,0,0]
[null,"BY 14","Braybrook","Urban",2947,12.214164999999998,3.3239141944999999,6.9920840000000002,0.13304363930546159,7.6366486408948886E-3,3,9460,9460,88,88,2,1810,12,3,7714]
[null,"BY 15","Braybrook","Urban",1017,6.1424850000000006,2.2109883149999998,7.3350200000000001,7.2815759017678907,9.695899853785804E-2,10,129772,129772,2308,2308,2,5760,28,0,0]
[null,"CN 01","Coburg North","Urban",103,1.8653650000000002,0.31005535500000003,7.5750753162841793,0.62121272316468679,0.47472404722923012,2,888,888,8,8,1,2262,13,1,103]
[null,"CN 02","Coburg North","Urban",465,4.8538550000000003,0.93005323950000007,8.2228433162841785,1.2619884629526974,0.80563744741790944,3,16482,16482,512,512,3,35073,137,1,460]
[null,"CN 03","Coburg North","Urban",1341,4.7874200000000009,1.1338694999999999,2.1452552436065675,1.0710609418732264,0.33420553648641188,4,125837,125837,2713,2713,17,130884,573,1,1337]
[null,"CN 04","Coburg North","Urban",1426,7.4372600000000002,5.8728564999999993,10.611964,0.36707118119718662,0.30660569269051818,2,5474,5474,66,66,4,15241,104,2,2852]
[null,"CN 05","Coburg North","Urban",4001,13.049609999999998,1.5790204299999999,7.6474729744262699,7.9260931325876944,0.44107388106423601,9,680112,680112,10705,10705,15,126157,495,3,9427]
[null,"CN 06","Coburg North","Urban",2115,9.8653100000000009,1.3328050944999998,7.235949658142089,4.7160401851226093,0.42920251492131994,4,205552,205552,3172,3172,13,62357,375,3,6368]
[null,"CN 07","Coburg North","Urban",5469,16.073456831693647,1.3820599673986433,8.4705193162841788,5.1384244913709036,0.98352444663721572,12,525473,525473,11776,11776,28,335262,1225,8,31777]
[null,"CN 08","Coburg North","Urban",2885,11.639054999999999,2.4958863349999998,6.0090009744262689,2.7032526959369743,0.78500067908206417,9,184018,184018,4648,4648,28,178124,935,1,2904]
[null,"CN 09","Coburg North","Urban",47,2.4295100000000001,0.54185865550000001,4.4353056581420898,3.1003682229153315,1.3061078976394909,2,4235,4235,55,55,2,5947,15,0,0]
[null,"CN 10","Coburg North","Urban",1908,6.2515750000000008,1.0542108799999999,6.8168056581420897,4.9731720499988397,0.51715981243160047,5,157296,157296,3929,3929,7,54524,298,0,0]
[null,"CN 11","Coburg North","Urban",3934,11.85331,1.4315491499999999,8.1332989744262694,3.100187146948171,0.25842634926749675,10,295655,295655,6149,6149,5,82151,210,0,0]
[null,"COO11","Coolaroo","Rural-short",1845,134.20357999999999,26.492919272999998,8.5924519999999998,2.6649811589035655,5.2017802517164258,25,74790,74790,954,954,38,486609,1476,6,1746]
[null,"COO12","Coolaroo","Urban",1,0.26919500000000002,0.54897499999999999,null,0,0,0,0,0,0,0,0,0,0,0,0]
[null,"COO13","Coolaroo","Urban",3933,6.4275199999999995,11.296989061,10.688172,2.8681833381105415,7.7076694499459572E-2,3,237026,237026,3988,3988,6,21232,112,2,7850]
[null,"COO14","Coolaroo","Urban",2940,1.3817900000000001,14.111992726500002,6.5157840000000009,4.9004792998321244E-2,0.37776406378133215,2,4348,4348,38,38,2,111725,385,0,0]
[null,"COO21","Coolaroo","Rural-short",1926,16.354595000000003,10.861879500000001,6.4014720000000001,1.5504704298132983E-2,0.28187057583017527,0,940,940,7,7,6,56963,170,0,0]
[null,"COO22","Coolaroo","Urban",3509,0.71301499999999995,19.538341499999998,8.7258159999999982,3.3109124403754699,0.11518194067181552,4,198065,198065,3606,3606,3,22968,69,0,0]
[null,"CS 02","Coburg South","Urban",5664,14.892444999999995,1.0271241550000001,10.059456000000001,0.29555436139113883,0.28458567109578825,2,32496,32496,1567,1567,8,104300,348,2,6932]
[null,"CS 03","Coburg South","Urban",3981,10.804599999999997,2.4986786445,8.325724000000001,1.7613914095494663,2.4163965846926927E-2,9,127556,127556,1072,1072,3,5833,22,0,0]
[null,"CS 05","Coburg South","Urban",4738,12.120600000000001,0.71092297999999987,8.2685680000000001,3.6799222239830027,0.26580792636863099,7,354969,354969,3854,3854,5,85467,315,1,1578]
[null,"CS 08","Coburg South","Urban",2942,8.6555400000000002,2.4086377600000004,7.8684760000000002,3.1781499824177049,0.67841413405100048,4,149473,149473,3722,3722,12,106356,367,0,0]
[null,"CS 09","Coburg South","Urban",1989,4.0363050000000005,1.8282100000000001,4.2295439999999997,0.62220114463713061,8.2912950506688191E-2,5,50969,50969,376,376,6,22640,85,0,0]
[null,"CS 12","Coburg South","Urban",1874,9.2430800000000026,1.0918085,6.9920840000000002,0.31610752299161199,0.34023398203075328,4,10804,10804,81,81,7,38762,181,0,0]
[null,"CS 13","Coburg South","Urban",1731,5.5760049999999994,2.5179810000000002,3.0102159999999998,0.21170924910388225,6.5068090431487813E-2,5,15681,15681,191,191,1,16065,35,0,0]
[null,"EP 02","East Preston","Urban",58,0.77341688537597664,0.25977823781967163,2.8006439999999997,0,0,0,0,0,0,0,0,0,0,0,0]
[null,"EP 03","East Preston","Urban",90,1.035155,0.45977594999999999,1.7432579999999998,0,0,0,0,0,0,0,0,0,0,0,0]
[null,"EP 04","East Preston","Urban",5,1.1259549999999998,0.36705856699999995,0.99451439999999991,0,0,0,0,0,0,0,0,0,0,0,0]
[null,"EP 07","East Preston","Urban",45,1.914925,0.71876699999999993,2.2405151999999999,0,0,0,0,0,0,0,0,0,0,0,0]
[null,"EP 09","East Preston","Urban",239,2.5483449999999999,0.65696037499999993,2.8406531999999998,0.55652984592403798,8.2031855902098078E-2,6,7439,7439,39,39,2,3655,11,0,0]
[null,"EP 11","East Preston","Urban",432,3.8501883893609046,0.55454145050048831,1.7775516,1.2616307667042624E-2,0.34296947150252799,0,650,650,4,4,3,58900,147,0,0]
[null,"EP 16","East Preston","Urban",59,1.949435,0.15081,2.8292219999999997,0.22370407863713523,0.51893646776843716,1,785,785,5,5,2,6070,19,0,0]
[null,"EP 17","East Preston","Urban",131,0.89944000000000002,0.3306655255,3.0235523999999994,0.51683194152116529,0,1,3727,3727,133,133,0,0,0,0,0]
[null,"EP 18","East Preston","Urban",19,1.2709250000000001,0.32712121,1.4746247999999997,0,0,0,0,0,0,0,0,0,0,0,0]
[null,"EP 20","East Preston","Urban",359,2.4971699999999997,0.161290815,2.8692311999999998,5.4994916102646167E-2,0.58567538692143128,1,1209,1209,5,5,4,42918,119,1,354]
[null,"EP 27","East Preston","Urban",26,5.2854999999999999E-2,1.4901618999999999,2.0804784000000001,0,0,0,0,0,0,0,0,0,0,0,0]
[null,"EP 34","East Preston","Urban",1435,5.227595,0.79032332500000002,2.6977631999999998,0.32552204913983812,2.6541136578191453E-2,4,35709,35709,212,212,2,9705,82,0,0]
[null,"EP 35","East Preston","Urban",31,1.8824350000000001,0.39682811499999998,2.2805244,0,0,0,0,0,0,0,0,0,0,1,30]
[null,"EP 36","East Preston","Urban",989,5.2162649999999999,0.26341115500000001,2.0347535999999997,6.7017283285893792E-2,0.45621143646539547,1,5726,5726,34,34,9,129930,451,0,0]
[null,"EP 37","East Preston","Urban",847,3.6702749999999997,0.32590551499999998,3.1893047999999999,2.6941807881492214E-2,0.29906112031385196,0,1146,1146,8,8,7,42403,208,0,0]
[null,"EP 41","East Preston","Urban",56,1.4042249999999998,0.535769567,3.1092863999999998,0,0,0,0,0,0,0,0,0,0,0,0]
[null,"EP 42","East Preston","Urban",296,2.66,0.53998449500000001,2.8406531999999998,3.5095447690695419E-2,0,0,565,565,4,4,0,0,0,0,0]
[null,"ES 11","Essendon","Urban",1150,4.3322149999999997,0.55746399999999996,4.8487339999999994,1.166020852311106E-2,0,0,547,547,6,6,0,0,0,0,0]
[null,"ES 12","Essendon","Urban",1001,3.91913,0.36212549999999999,2.295766,0.2230462324048679,0,4,17044,17044,123,123,0,0,0,1,1007]
[null,"ES 13","Essendon","Urban",2637,7.4838601908683788,1.1391159133315085,6.4491020000000008,0.22874951383335837,0.28385797362547505,3,20048,20048,284,284,3,82926,307,2,5272]
[null,"ES 15","Essendon","Urban",2026,5.7289650000000005,2.0093674999999998,5.0773580000000003,6.1103783109116286E-3,0,0,423,423,4,4,0,0,0,0,0]
[null,"ES 16","Essendon","Urban",1343,3.7993450000000002,0.45237050000000001,2.7530140000000003,1.57577017053885,0.10577916390853455,1,126295,126295,1349,1349,2,28260,72,2,1974]
[null,"ES 21","Essendon","Urban",1552,3.4251949999999995,0.56978499999999999,4.5153239999999997,0.14042717442358288,0.12169589011012624,2,9776,9776,95,95,2,28240,146,0,0]
[null,"ES 23","Essendon","Urban",482,1.103755,0.42701600000000001,1.1240680000000001,7.430324696252863E-3,0,0,505,505,3,3,0,0,0,0,0]
[null,"ES 24","Essendon","Urban",1879,4.2397650000000002,1.111313,5.3631380000000002,8.9845266958775538E-2,0.10160184884252753,2,4920,4920,41,41,2,18546,51,0,0]
[null,"ES 25","Essendon","Urban",1070,3.8600749999999997,1.9972235,4.5439020000000001,0.93926908139371901,1.6433622221127535E-2,2,50411,50411,1088,1088,1,2940,6,0,0]
[null,"ES 26","Essendon","Urban",1285,2.7048000000000001,1.8621209999999999,4.7248959999999993,9.6971457303979824E-3,0.15758989386981651,0,516,516,4,4,4,27952,97,1,1281]
[null,"FE 02","Footscray","Urban",75,0.74802500000000005,1.9447120000000002,6.2490560000000004,0,0,0,0,0,0,0,0,0,0,2,146]
[null,"FE 05","Footscray","Urban",3187,8.4198550000000019,0.85290792000000004,7.506488,0.17905288981339107,0.11665186103453537,2,13388,13388,69,69,3,29074,124,3,8193]
[null,"FE 06","Footscray","Urban",3880,9.0461899999999993,7.2721092615000025,9.9832479999999997,1.7585600314649836,7.9024052250970034E-2,8,87810,87810,439,439,4,13153,53,1,1408]
[null,"FE 08","Footscray","Urban",2234,3.8146849999999999,5.1534482895,8.3066720000000007,1.3750673230269796,0.13439203522221457,5,48121,48121,227,227,2,15677,41,3,6764]
[null,"FE 09","Footscray","Urban",4209,7.4038750000000011,1.1481105,6.0585359999999993,3.5652651641012811,0.19464119534668847,13,378917,378917,7320,7320,4,68955,305,4,10814]
[null,"FF 87","Fairfield","Urban",738,2.6586750000000001,0.23790285249999998,1.8621424974426271,3.3852533385664359E-2,0.17527707641308446,1,1773,1773,13,13,1,30600,102,0,0]
[null,"FF 88","Fairfield","Urban",1287,3.9489000000000001,0.47041937750000001,1.9638801948852538,6.7871232587357638E-2,0,0,6670,6670,14,14,0,0,0,0,0]
[null,"FF 89","Fairfield","Urban",602,3.9117999999999995,0.83623893299999996,2.2359427025573728,0.33234901671304501,0,1,14962,14962,36,36,0,0,0,0,0]
[null,"FF 90","Fairfield","Urban",1051,3.3835949999999997,0.39389648599999999,2.4931447025573723,0.42413503850863704,0,1,30016,30016,1050,1050,0,0,0,0,0]
[null,"FF 95","Fairfield","Urban",1648,4.7998650000000005,6.4885992499999989E-2,2.9321027999999996,1.0677606431544244,0.40361684680253179,2,106015,106015,1160,1160,4,133580,364,0,0]
[null,"FF 96","Fairfield","Urban",1056,3.6906650000000005,0.38582770099999997,2.1913610923278806,2.829949801080479E-2,4.1093440719632189E-2,1,2511,2511,21,21,2,12154,50,0,0]
[null,"FT 01","Flemington","Urban",3572,6.7178299999999993,2.6388700289999996,6.0204319999999996,0.36221534234552621,0,5,32728,32728,251,251,0,0,0,0,0]
[null,"FT 02","Flemington","Urban",335,1.5898749999999999,5.6770217715000015,3.781822,5.0154818951009756E-3,0.13192997148613339,0,88,88,1,1,2,7716,58,0,0]
[null,"FT 04","Flemington","Urban",1528,3.4941400000000002,2.8601360144999997,4.1723879999999998,9.6971118121838756E-2,0.13292756794360691,2,4400,4400,44,44,2,20105,85,0,0]
[null,"FT 05","Flemington","Urban",2406,4.6680799999999998,2.0371872910000004,3.8866079999999998,2.8643906913393975,2.7615177090388156E-2,8,237676,237676,2649,2649,4,7638,31,0,0]
[null,"FT 06","Flemington","Urban",245,0.67420000000000002,1.2598480985,2.067142,1.6273990994410674,0,1,29138,29138,247,247,0,0,0,0,0]
[null,"FT 09","Flemington","Urban",1795,3.2546300000000006,3.1202758044999999,5.00115,0.22927746461621182,0.1376958128529393,1,12232,12232,121,121,2,24487,61,1,1786]
[null,"FT 10","Flemington","Urban",2091,4.1508306007385256,1.8373288884162906,5.7822820000000004,0.37185735816793736,0,1,21451,21451,129,129,0,0,0,1,2075]
[null,"FT 13","Flemington","Urban",1286,2.3588149999999999,5.5788746170000003,6.0585359999999993,8.9088877909194911E-2,1.1012170084915876E-2,2,4223,4223,39,39,1,1740,6,1,769]
[null,"FT 14","Flemington","Urban",1596,1.8829500000000001,1.7119079309999998,4.2962259999999999,0.50744825970414209,4.6941533814630291E-3,4,22215,22215,160,160,2,685,2,0,0]
[null,"FT 15","Flemington","Urban",86,0.12683,0.94324575099999997,3.2674180000000002,3.3611573430478128,0,1,11068,11068,86,86,0,0,0,0,0]
[null,"FW 04","Footscray West","Urban",1606,5.7819749999999992,1.4481089030000001,7.563644,6.77502305263741,0.31887785661896451,5,172160,172160,4881,4881,1,27010,74,4,1665]
[null,"FW 05","Footscray West","Urban",1642,7.4865399999999998,1.1348773000000001,4.0580759999999998,1.9375657407680353,9.5834191847170638E-2,1,118396,118396,1668,1668,1,19520,61,0,0]
[null,"FW 06","Footscray West","Urban",975,5.62033,2.6511326189999997,4.3438559999999997,2.3705590402637533E-2,1.5738255865262061,1,746,746,21,21,4,165091,449,0,0]
[null,"FW 08","Footscray West","Urban",2852,7.8100999999999967,1.2371219890000003,6.9730319999999999,1.0605573926704033,0.66734326271407962,7,65729,65729,509,509,2,137864,270,2,5684]
[null,"FW 09","Footscray West","Urban",1397,9.05701,3.6407418025000005,7.735112,0.20532272996128256,0.76148774361897997,4,4991,4991,31,31,7,61701,174,2,2535]
[null,"FW 13","Footscray West","Urban",451,5.1401950000000003,0.64411823599999996,11.354991999999998,5.801264783233095,0,5,28043,28043,207,207,0,0,0,0,0]
[null,"FW 16","Footscray West","Urban",2554,9.1951450000000019,0.35946320499999995,5.7346519999999996,2.1331451515078346,0,5,159541,159541,1084,1084,0,0,0,4,9306]
[null,"FW 17","Footscray West","Urban",2293,8.587060000000001,0.34629392850000001,4.7248959999999993,1.8490171240159416,0,5,136318,136318,1477,1477,0,0,0,1,1132]
[null,"HB 14","Heidelberg","Urban",1714,5.3177700000000003,2.0022469999999997,4.6677400000000002,2.8714767344546912,0,4,163120,163120,2633,2633,0,0,0,1,1712]
[null,"HB 15","Heidelberg","Urban",2411,9.3981449999999995,1.3017989999999999,5.4393459999999996,0.75836909676418929,5.2188811953763958E-2,4,56018,56018,1261,1261,2,12850,50,2,2204]
[null,"HB 22","Heidelberg","Urban",1120,5.004834999999999,0.903895,3.5817759999999996,4.5966743888709711,0.11153037455899749,6,215820,215820,4347,4347,3,17455,52,2,1512]
[null,"HB 23","Heidelberg","Urban",1477,5.4802799999999996,0.51192499999999996,3.4865159999999999,1.2960915887113853,0.15506002326453702,2,107162,107162,1574,1574,1,42735,77,0,0]
[null,"HB 24","Heidelberg","Urban",870,6.4547799999999995,0.34618500000000002,3.2578920000000005,7.3290136159028074E-2,0.17687869897709699,3,3402,3402,30,30,2,27368,110,2,1746]
[null,"HB 31","Heidelberg","Urban",745,1.50989,0.52794000000000008,3.5627240000000002,1.3542995578476741E-2,8.8727236840254534E-2,0,427,427,1,1,2,9325,35,0,0]
[null,"HB 32","Heidelberg","Urban",523,2.1668750000000001,0.57804500000000003,2.9340080000000004,1.4021714508740455,0.67350971040311536,2,39778,39778,609,609,4,63689,227,0,0]
[null,"KLO13","Kalkallo","Rural-short",62,0.31974999999999998,3.2786200000000001,0.38104000000000005,5.6537508982771399E-2,0.89104825420216238,1,859,859,75,75,6,45127,87,2,47]
[null,"KLO21","Kalkallo","Rural-short",4,0,2.84822,0.49535199999999996,1.809879177808588E-2,0,1,20,20,2,2,0,0,0,1,1]
[null,"KLO22","Kalkallo","Rural-short",2015,12.250175,17.305577999999997,4.3629079999999991,0.36216778915375003,0.32171788023527925,3,25718,25718,2149,2149,4,76152,194,2,4006]
[null,"NH 02","North Heidelberg","Urban",4244,16.313555000000001,4.1445283644999993,8.7067639999999997,1.0718557137935227,0.13601839306777141,6,96123,96123,2617,2617,9,40660,168,2,2353]
[null,"NH 03","North Heidelberg","Urban",1310,9.1599199999999996,0.78015795399999999,7.3159679999999998,2.0805093105805854,0.35615806737117089,7,65181,65181,588,588,2,37194,83,3,3528]
[null,"NH 05","North Heidelberg","Urban",4582,16.266910537719724,1.1339345979690552,6.4014720000000001,6.9214796473543343,0.3654278143362909,13,756992,756992,8898,8898,9,133221,409,8,14159]
[null,"NH 08","North Heidelberg","Urban",2589,11.160619999999998,1.4233787250000001,4.9344679999999999,4.6895099550584876,0.22523092323538207,7,483861,483861,6850,6850,5,77464,240,5,10213]
[null,"NH 09","North Heidelberg","Urban",733,6.506174999999998,1.2548655150000001,8.9353879999999997,4.8360595698253483,2.3894609858317821,7,66086,66086,929,929,9,108842,220,1,641]
[null,"NH 12","North Heidelberg","Urban",17,0,4.2534974999999999,4.4772199999999991,0,0,0,0,0,0,0,0,0,0,0,0]
[null,"NH 13","North Heidelberg","Urban",788,1.2815000000000001,3.2518350000000003,5.3917160000000006,7.6162124793027752,0,3,125326,125326,2367,2367,0,0,0,0,0]
[null,"NH 16","North Heidelberg","Urban",2592,7.1661349999999988,4.4858029999999998,7.4874360000000006,9.7383168276554741,0.25997630471742023,9,496632,496632,5539,5539,6,44194,199,0,0]
[null,"NH 17","North Heidelberg","Urban",2481,7.7044499999999996,2.2281244999999998,6.2490560000000004,1.8249275787020438,0.26985952930201523,4,91726,91726,4099,4099,7,45213,234,3,4072]
[null,"NH 20","North Heidelberg","Urban",2013,8.1237250000000003,2.4427124115000001,8.4400359999999992,12.961668905129164,0.40326775100553147,6,474921,474921,4665,4665,6,49253,111,1,2096]
[null,"NS 07","North Essendon","Urban",1120,3.7118700000000002,1.8499714799999998,4.1095164872131349,0,0.22420976202747386,0,0,0,0,0,2,29380,114,0,0]
[null,"NS 08","North Essendon","Urban",1171,2.9289849999999999,0.43805204399999997,2.5682095854644778,0.43445456277606898,0.35622762463459118,2,32519,32519,835,835,4,88879,226,1,382]
[null,"NS 09","North Essendon","Urban",1098,3.6332550000000001,1.1472236654999999,4.9325629744262693,1.1559182432709798,0.93401636301529056,2,48893,48893,1127,1127,7,131690,431,1,1114]
[null,"NS 11","North Essendon","Rural-short",0,0,4.7112370000000001E-2,null,0,0,0,0,0,0,0,0,0,0,0,0]
[null,"NS 12","North Essendon","Urban",1160,3.7008100000000006,1.1701516759999999,3.1169071709289558,5.1335151505900782E-2,9.6974948871716617E-3,1,4669,4669,32,32,1,2940,21,1,1155]
[null,"NS 14","North Essendon","Urban",1428,5.6119000000000003,1.2631262089999999,4.5534280000000003,1.795366158879343,0,3,108884,108884,1497,1497,0,0,0,0,0]
[null,"NS 15","North Essendon","Urban",1558,4.3533749999999998,1.2139204375000001,4.1076111709289549,2.9755506801232818,0.38299867547304151,4,185083,185083,3262,3262,2,79410,184,0,0]
[null,"NS 16","North Essendon","Urban",703,3.1885349999999999,0.42196815050000003,1.6689552436065673,0.27048528479368456,0,2,21483,21483,139,139,0,0,0,1,699]
[null,"NS 17","North Essendon","Urban",810,3.5769700000000002,0.51297697249999996,2.3319648290710453,6.9505262744319729E-2,3.1583811734063327E-2,1,4661,4661,23,23,3,7060,38,0,0]
[null,"NS 18","North Essendon","Urban",1714,3.44706,2.6379657695000001,4.3952964872131348,5.6059436323412051E-2,0,0,2940,2940,16,16,0,0,0,0,0]
[null,"NT 03","Newport","Urban",2890,10.166139999999999,3.3239145050000003,8.4781399999999998,5.7136915423682719,0.21516288230585437,10,364709,364709,6881,6881,3,45780,147,4,8367]
[null,"NT 04","Newport","Urban",1541,3.3759300000000003,1.9499001645,7.677956,0.12185480232992958,0.18355397916060118,0,2842,2842,18,18,3,14270,70,0,0]
[null,"NT 08","Newport","Rural-short",0,0,6.6956715E-2,null,0,0,0,0,0,0,0,0,0,0,0,0]
[null,"NT 10","Newport","Urban",65,1.8999949999999999,0.84110659849999991,1.828992,3.5870450557172355,0,1,15331,15331,65,65,0,0,0,0,0]
[null,"NT 11","Newport","Urban",3506,9.2159300000000002,2.5576613949999998,8.5352960000000007,1.1231000922879424,9.1931763657869245E-2,8,88759,88759,502,502,4,24218,107,4,8829]
[null,"NT 15","Newport","Urban",1869,7.6010000000000009,3.2853300000000001,5.9442240000000002,7.2036100345053482,0.17503391554265327,2,408168,408168,2598,2598,4,33059,169,1,2]
[null,"NT 16","Newport","Urban",215,2.9120549999999996,1.6090435855,5.4488719999999997,3.5427930706676061E-2,0,1,642,642,5,5,0,0,0,0,0]
[null,"NT 17","Newport","Urban",2538,7.7671200000000002,2.8040395550000001,8.5162439999999986,0.74666547885476831,0.18464465740327504,7,34384,34384,404,404,4,28343,139,2,3631]
[null,"P  56","Preston","Urban",2,1.9180499999999998,0.25554748999999999,null,9.5076382787571394E-3,0,1,6,6,2,2,0,0,0,0,0]
[null,"P  57","Preston","Rural-short",99,1.5517150000000002,0.24299753499999999,0.30635616217192796,1.8315172189904659E-3,0,0,115,115,1,1,0,0,0,0,0]
[null,"P  58","Preston","Rural-short",0,0.12695000000000001,4.0969000000000005E-2,null,0,0,0,0,0,0,0,0,0,0,0,0]
[null,"P  59","Preston","Rural-short",810,2.7828499999999998,1.6069392775,1.0413823461639404,3.1936536720823757E-3,6.5868013269688011E-2,0,438,438,1,1,3,30112,155,0,0]
[null,"P  61","Preston","Urban",79,0.27965499999999999,0.15290999999999999,0.27206256218032837,0,0.19279250615038243,0,0,0,0,0,1,49770,79,0,0]
[null,"P  62","Preston","Urban",653,1.82186,0.81003500000000006,2.9549651999999997,8.1726810342565251E-2,0,2,3119,3119,16,16,0,0,0,0,0]
[null,"P  63","Preston","Urban",854,2.8299149999999997,0.15738628999999998,2.273665697442627,6.6076976862939479E-2,0.22882802666054158,1,4436,4436,91,91,4,51207,162,0,0]
[null,"P  65","Preston","Urban",255,0.32017000000000001,0.20159100000000002,0.9533620974426269,3.3843135817642533E-2,7.3647432467856211E-2,2,1249,1249,115,115,2,9060,42,0,0]
[null,"P  66","Preston","Urban",744,2.1319850000000002,0.64697023350000005,2.9561083025573729,1.6150851995037703,6.196516242081054E-3,2,69201,69201,830,830,1,885,3,0,0]
[null,"PV 12","Pascoe Vale","Urban",470,2.6137599999999996,1.6469110000000002,2.267188,0.41781004260323723,0,1,12815,12815,95,95,0,0,0,0,0]
[null,"PV 13","Pascoe Vale","Urban",3189,10.051864999999999,0.52676849999999997,5.0392539999999997,1.1996034856836384,7.7826469915138682E-2,4,135543,135543,3323,3323,2,29312,80,1,1176]
[null,"PV 14","Pascoe Vale","Urban",2782,10.048509999999998,0.93403499999999995,5.3821900000000005,7.8156816970701246E-2,0,2,7948,7948,75,75,0,0,0,0,0]
[null,"PV 15","Pascoe Vale","Urban",1766,5.2357700000000005,0.39941000000000004,3.5246200000000005,0.10778585470351919,0.19926536323659561,1,10820,10820,83,83,6,66677,232,1,1773]
[null,"PV 21","Pascoe Vale","Urban",1260,5.5983999999999998,0.18075550000000001,2.4577080000000002,6.6683661907831038E-2,6.0050515961013332E-3,1,5680,5680,182,182,1,1705,11,0,0]
[null,"PV 22","Pascoe Vale","Urban",2588,9.8735299999999988,0.42801800000000001,5.5536579999999995,3.939850532424106,0.13426176343783233,7,401451,401451,7125,7125,5,45602,222,4,2658]
[null,"PV 23","Pascoe Vale","Urban",2429,8.0148249999999983,0.18479099999999998,4.9058900000000003,0.17287352326582181,0.17919949134367102,3,17476,17476,148,148,2,60385,146,0,0]
[null,"PV 24","Pascoe Vale","Urban",1696,6.9295749999999998,0.53492500000000009,3.9437640000000003,3.2232662880516587,0.14703698007722554,3,253456,253456,5085,5085,1,38540,82,2,3393]
[null,"PV 31","Pascoe Vale","Urban",2000,5.8316950000000016,1.4710673000000001,4.4295900000000001,4.012951633031682E-2,2.0791854259038477E-2,0,2594,2594,16,16,1,4480,14,0,0]
[null,"SA 02","St Alban","Rural-short",61,13.590999999999999,0,0.66872520000000002,0.55949996048288286,0.12429874163600543,8,12044,12044,181,181,5,8919,33,0,0]
[null,"SA 06","St Alban","Rural-short",145,4.3659999999999997,1.202970415,0.43819599999999997,2.9581748849819213E-2,0,3,2310,2310,153,153,0,0,0,1,148]
[null,"SA 10","St Alban","Rural-short",43,1.262,0.81620738849999996,1.9051999999999999E-2,1.7443545412765453E-3,0,1,1874,1874,43,43,0,0,0,0,0]
[null,"SA 12","St Alban","Urban",1843,1.085,6.1866675870000005,3.5145224400000004,0.37206263495278891,9.5999480990359713E-4,3,46043,46043,3787,3787,1,396,2,0,0]
[null,"SBY11","Sunbury","Rural-short",3107,62.644959999999976,11.587405091999999,6.4586280000000009,1.5292385066874747,1.2854882784705979,16,106593,106593,644,644,31,298676,1434,2,864]
[null,"SBY13","Sunbury","Urban",1,0,0.14144999999999999,null,0,0,0,0,0,0,0,0,0,0,0,0]
[null,"SBY14","Sunbury","Rural-short",4108,90.91816,23.107266350999996,11.164472,1.3369321039631201,1.5490338138790098,15,79694,79694,487,487,27,307791,1109,1,1218]
[null,"SBY31","Sunbury","Urban",1991,5.8158599999999998,7.4262210075000006,7.2626223418579094,0.3796700603872129,0.29413525222527243,3,15581,15581,39,39,1,40236,84,0,0]
[null,"SBY32","Sunbury","Rural-short",2917,116.62122500000001,10.233119424000002,6.0013800000000002,1.278287260525925,0.43390659647440305,17,98837,98837,811,811,51,111832,482,4,7068]
[null,"SBY33","Sunbury","Urban",3036,14.166025000000001,5.0620809080000004,6.8739616581420888,1.3365993045401054,0.43436324780824453,4,109171,109171,325,325,6,118260,450,2,5964]
[null,"SHM11","Sydenham","Rural-short",1087,65.113919999999979,3.752767795,2.8006439999999997,4.3217000864738671,1.705581676573084,13,192189,192189,1301,1301,16,252828,993,0,0]
[null,"SHM12","Sydenham","Urban",2844,4.7112400000000001,14.038484049000001,7.7541639999999994,0.57591682972976488,0.43993721355377929,3,40723,40723,187,187,3,103693,391,0,0]
[null,"SHM14","Sydenham","Rural-short",3942,18.868049999999997,22.517445418500003,10.135664,0.20847269604298238,0.28968798039329191,4,14980,14980,27,27,4,69386,245,0,0]
[null,"SHM21","Sydenham","Urban",4934,3.8849899999999993,19.708876999999998,11.354991999999998,3.7528240298737483,0.80049546848648079,8,350760,350760,7081,7081,2,249396,654,1,2414]
[null,"SHM24","Sydenham","Urban",1,0,0.40339999999999998,null,0,0,0,0,0,0,0,0,0,0,0,0]
[null,"ST 11","Somerton","Urban",178,7.0105800000000009,4.1096389300000009,6.9539799999999996,0.4808295778065218,1.5137635366742626,2,1528,1528,8,8,3,16035,85,0,0]
[null,"ST 12","Somerton","Urban",242,9.5402050000000003,3.1311656045,7.4493320000000001,3.2629219719954849,0.33765642055478207,8,11973,11973,256,256,3,4130,36,0,0]
[null,"ST 13","Somerton","Urban",195,4.78599,4.2582960275000001,6.2490560000000004,0.25411347312350885,0,1,1242,1242,7,7,0,0,0,0,0]
[null,"ST 14","Somerton","Urban",90,0,5.0063206530000004,7.2016559999999998,8.7035157644856529,0,2,11797,11797,15,15,0,0,0,0,0]
[null,"ST 21","Somerton","Urban",4,0,1.4101698899999999,0.64776800000000001,0,0,0,0,0,0,0,0,0,0,0,0]
[null,"ST 22","Somerton","Urban",3376,6.8474550000000001,16.2489275605,12.402851999999999,0.89540108576958277,0.10738049947452713,4,40513,40513,3389,3389,5,16195,99,0,0]
[null,"ST 23","Somerton","Urban",150,7.2139600000000002,3.5111221845,10.497652,0.25559694029840874,0,3,530,530,9,9,0,0,0,0,0]
[null,"ST 24","Somerton","Urban",1,0,3.7649585464999999,null,0,0,0,0,0,0,0,0,0,0,0,0]
[null,"ST 31","Somerton","Urban",1,0,0.61687390000000009,null,0,0,0,0,0,0,0,0,0,0,0,0]
[null,"ST 32","Somerton","Rural-short",5901,9.2209950000000003,34.636682390000004,11.62172,0.24431334941615407,7.2601363885779799E-2,5,20952,20952,103,103,5,20754,131,2,11602]
[null,"ST 33","Somerton","Urban",3212,11.048395000000003,5.8052445114999998,8.4209840000000007,1.5572756214507613,1.2648209180630676E-2,4,88648,88648,3335,3335,1,2400,8,2,2690]
[null,"ST 34","Somerton","Urban",307,6.8549300000000004,7.4594677040000006,8.0170816581420894,0.46055625635507158,0.97360180325555068,2,3522,3522,12,12,7,24818,70,0,0]
[null,"TH 11","Tottenham","Urban",124,3.1288499999999999,0.83909938499999992,3.8446936581420901,0.65186985844937584,1.0052268965869362,1,2603,2603,6,6,2,13380,50,1,195]
[null,"TH 12","Tottenham","Urban",23,3.4372250000000002,0.65280933699999999,3.9285224872131348,1.1302821900507163,0,1,1308,1308,2,2,0,0,0,0,0]
[null,"TH 13","Tottenham","Urban",54,3.2245949999999999,0.5202406195,3.2159776581420902,6.9590655862392818,0,2,24098,24098,106,106,0,0,0,0,0]
[null,"TH 14","Tottenham","Rural-short",0,0,7.3005169999999994E-2,null,0,0,0,0,0,0,0,0,0,0,0,0]
[null,"TH 21","Tottenham","Urban",150,5.4796449999999997,0.808208225,18.590941948852539,3.2297299364572054,0.68410416931932583,1,14482,14482,81,81,3,10225,36,1,70]
[null,"TH 22","Tottenham","Urban",890,10.348405,3.6810258915,5.780376974426269,1.6474525371999713,0,7,53935,53935,903,903,0,0,0,0,0]
[null,"TH 23","Tottenham","Rural-short",2,0,6.5930345000000001E-2,null,0,0,0,0,0,0,0,0,0,0,0,0]
[null,"TH 24","Tottenham","Rural-short",0,0,6.5017905000000001E-2,null,0,0,0,0,0,0,0,0,0,0,0,0]
[null,"TT 03","Thomastown","Urban",2923,13.492015000000002,4.3178374219999993,11.47692468371582,2.217968088921765,0.63778487582583165,10,94317,94317,646,646,10,90404,426,0,0]
[null,"TT 08","Thomastown","Urban",3126,14.914890000000002,1.9630363450000001,8.1085313162841786,0.73598423725693329,0.18336679649292467,7,37778,37778,240,240,4,31374,150,3,5707]
[null,"TT 10","Thomastown","Urban",3904,14.607130000000002,1.5541024999999999,7.5026776581420895,4.5458415956592013,0.32505160359571722,10,368633,368633,8171,8171,8,87864,331,2,7794]
[null,"TT 11","Thomastown","Urban",4007,11.882995000000001,0.14587843,7.4036071714219993,1.0624586755746472,0.30370511112100768,9,124145,124145,681,681,10,118290,475,0,0]
[null,"WT 04","Watsonia","Urban",144,3.0199699999999998,1.6437956300000001,2.0576159999999999,2.0055567480032531E-2,8.6959687120453558E-2,0,192,192,2,2,1,2775,15,0,0]
[null,"YVE10","Yarraville","Urban",1,0,0.63387400000000005,null,0,0,0,0,0,0,0,0,0,0,0,0]
[null,"YVE11","Yarraville","Urban",1,5.2049999999999996E-3,0.83475999999999995,null,0,0,0,0,0,0,0,0,0,0,0,0]
[null,"YVE12","Yarraville","Urban",859,8.0083200000000012,1.3808735000000001,3.1245280000000002,0.33819751740175014,9.8601606327142932E-2,4,11965,11965,104,104,5,11628,42,1,873]
[null,"YVE14","Yarraville","Urban",137,1.6569099999999999,0.84918649999999996,4.6486879999999999,9.6313024156887455,1.9631230744717354,2,34201,34201,138,138,2,23237,62,0,0]
[null,"YVE15","Yarraville","Urban",584,6.2898849999999999,5.2182034999999996,3.867556,0.28357639729460488,7.3269956446322618E-3,2,5759,5759,65,65,1,496,2,1,569]
[null,"YVE21","Yarraville","Urban",700,4.7700899999999997,2.7831670000000002,5.5060280000000006,0.63047608842324721,0.55355553933512291,4,11248,11248,50,50,9,32919,243,0,0]
[null,"YVE22","Yarraville","Rural-short",2535,7.8552300000000015,13.658592000000002,5.52508,4.261810547759775,0.31543677368329648,7,271754,271754,4804,4804,4,67046,221,0,0]
[null,"YVE23","Yarraville","Rural-short",178,2.1279649999999997,5.7849035000000004,1.543212,1.6599267962478643,0,1,28148,28148,182,182,0,0,0,0,0]
[null,"YVE24","Yarraville","Urban",785,3.3470849999999999,1.3910315000000002,3.5627240000000002,5.1131816251299221E-2,9.6913017329146575E-2,0,1529,1529,10,10,3,9660,35,0,0]
[null,"YVE25","Yarraville","Urban",2,0.66312499999999996,1.4552100000000001,null,0,0,0,0,0,0,0,0,0,0,0,0]
[]
[]
[]
[]
[]
[]
[]
[]
[]
[]
[]
[]
[]
[]
[]
[]
[]
[]
[]
[]
[]
[]
[]
[]
[]
[]
[]
[]
[]
[]
[]
[]
[]
[]
[]
[]
[]
[]
[]
[]
[]
[]
[]
[]
[]
[]
[]
[]
[]
[]
[]
[]
[]
[]
[]
[]
[]
[]
[]
[]
[]
[]
[]
[]
[]
[]
[]
[]
[]
[]
[]
[]
[]
[]
[]
[]
[]
[]
[]
[]
[]
[]
[]
[]
[]
[]
[]
[]
[]
[]
[]
[]
[]
[]
[]
[]
[]
[]
[]
[]
[]
[]
[]
[]
[]
[]
[]
[]
[]
[]
[]
[]
[]
[]
[]
[]
[]
[]
[]
[]
[]
[]
[]
[]
[]
[]
[]
[]
[]
[]
[]
[]
[]
[]
[]
[]
[]
[]
[]
[]
[]
[]
[]
[]
[]
[]
[]
[]
[]
[]
[]
[]
[]
[]
[]
[]
[]
[]
[]
[]
[]
[]
[]
[]
[]
[]
[]
[]
[]
[]
[]
[]
[]
[]
[]
[]
[]
[]
[]
[]
[]
[]
[]
[]
[]
[]
[]
[]
[]
[]
[null,null,null,null,null,null,null,null,null,null,null,null,null,null,null,null,null,null,null,null,null,null," "]

{"sheet":"3.6.8 Network-feeders (2015-16)","index":14,"n_rows":421,"n_cols":23,"rows_kept":421,"cut":false,"hidden":false,"merged":[[5,1,5,4],[5,6,5,8],[10,1,12,1],[10,2,12,2],[10,3,12,3],[10,4,12,4],[10,5,10,6],[10,7,12,7],[10,8,10,9],[11,5,12,5],[11,6,12,6],[11,8,12,8],[11,9,12,9],[11,20,12,20],[11,21,11,22],[10,10,10,14],[10,15,10,19],[10,20,10,22],[11,13,11,14],[11,10,12,10],[11,11,11,12],[11,15,12,15],[11,16,11,17],[11,18,11,19]]}
[null,{"$f":"INDEX(dms_Worksheet_List,MATCH(dms_Model,dms_Model_List))","v":"HISTORICAL ANNUAL REPORTING - FINANCIAL YEARS"}]
[null,{"$f":"INDEX(dms_TradingNameFull_List,MATCH(dms_TradingName,dms_TradingName_List))","v":"Jemena Electricity"}]
[null,{"$f":"dms_Header_Span","v":"2011-12 to 2017-18"}]
[null,"3.6 QUALITY OF SERVICES"]
[]
[null,"Did the MAIFI parameter of the STPIS apply during the period?",null,null,null,"No","** IMPORTANT\nPlease ensure this question is answered correctly. Your response will affect other tables throughout this workbook and will determine which cells are grey and which are input cells. "]
[]
[]
[]
[null,"3.6.8 - NETWORK FEEDER RELIABILITY"]
[null,"Feeder ID / name","Description of the service area for the feeder","Feeder classification\n\n(drop down)","Number of distribution customers","Length of high voltage distribution lines",null,"Maximum demand\n(MVA)","Energy not supplied\n(MWh)",null,"Unplanned Outages",null,null,null,null,"Planned Outages",null,null,null,null,"Momentary feeder outages"]
[null,null,null,null,null,"Overhead","Underground",null,"Unplanned","Planned","Total number of unplanned outages","Unplanned customer minutes off-supply (SAIDI)",null,"Unplanned interruptions\n(SAIFI)",null,"Total number of planned outages","Planned customer minutes off-supply (SAIDI)",null,"Planned interruptions\n(SAIFI)",null,"Total number of momentary feeder outages","Momentary interruptions due to feeder outages (MAIFI)"]
[null,null,null,null,null,null,null,null,null,null,null,"Including excluded events and MEDs","After removing excluded events and MED","Including excluded events and MEDs","After removing excluded events and MED",null,"Including MEDs","After removing  MED","Including MEDs","After removing  MED",null,"Including excluded events and MEDs","After removing excluded events and MED"]
[null,"AW 01","Airport West","Urban",768,4.6691168477630614,4.842287932607765,9.2211680000000005,0.71715528842620901,0.28810585321334858,3,10725,10725,811,811,6,14362,14362,47,47]
[null,"AW 02","Airport West","Urban",3075,10.529876620645521,2.7774035865853124,8.2476112651367188,1.4586465152243522,3.369527891233097E-2,7,105297,105297,5045,5045,2,8108,8108,31,31]
[null,"AW 03","Airport West","Urban",195,4.0971072662162786,2.4589558997947694,9.9965846325683589,6.1506878050999028,1.3373265507436203,3,19768,19768,144,144,5,14327,14327,36,36]
[null,"AW 04","Airport West","Urban",1736,8.7407879216766347,4.3288609434771725,12.313307948852538,1.3172792037895464,0.40899160277793589,4,30824,30824,1598,1598,7,31901,31901,149,149]
[null,"AW 05","Airport West","Urban",555,2.4486300000000001,0.51411606364013673,6.8015639999999991,0.89338751861380594,0.13565487733368453,7,12939,12939,694,694,4,6549,6549,19,19]
[null,"AW 06","Airport West","Urban",5120,17.036313989200593,1.640311422148323,9.9603859488525401,0.89479100378563337,0.17356905001097708,12,97878,97878,5435,5435,6,63287,63287,270,270]
[null,"AW 07","Airport West","Urban",4781,15.676143809757235,5.8553016333596801,10.562428799999999,1.6276186722803641,5.0686305802267857E-2,12,162276,162276,6112,6112,4,16845,16845,82,82]
[null,"AW 08","Airport West","Urban",2332,8.8290416767120377,1.7477811853668634,7.1483104581420882,4.1182860044775724,0.19715873373469581,5,204631,204631,3984,3984,2,32655,32655,67,67]
[null,"AW 09","Airport West","Urban",2502,11.098742415637972,8.0888006635228678,7.4302802907104493,2.8952817245169689,0.14249070868787278,4,172631,172631,2602,2602,3,28320,28320,205,205]
[null,"AW 11","Airport West","Urban",473,5.9984887483978264,3.3151225876621475,7.5684070000000006,4.4171622093952392,0,3,44333,44333,572,572,0,0,0,0,0]
[null,"AW 12","Airport West","Urban",1824,5.5505031634616859,6.891859772101288,8.4305100581420902,0.8121915316517353,0.71461298480767177,1,22490,22490,1818,1818,2,65960,65960,120,120]
[null,"AW 14","Airport West","Urban",1248,8.9206274957466114,4.6133852268074955,7.0749602581420907,4.6242166963487907,0.37955045736670451,6,90915,90915,1847,1847,3,24874,24874,58,58]
[null,"BD 01","Broadmeadows","Urban",1013,4.3392156658077248,4.414865366223907,8.0589959999999987,1.1427378751797697,7.7181488926807942E-2,8,24785,24785,421,421,2,5580,5580,14,14]
[null,"BD 02","Broadmeadows","Urban",1,0.66477979946136467,7.3398031571044922E-2,null,0,0,0,0,0,0,0,0,0,0,0,0]
[null,"BD 03","Broadmeadows","Urban",363,4.0084210187053682,4.4894100007458952,10.768190632568359,0.13199127003820704,0,0,615,615,4,4,0,0,0,0,0]
[null,"BD 04","Broadmeadows","Urban",988,7.9099915901374809,3.8271041820943603,9.63269160699463,2.5360138901359068,0.15886042877475393,3,58188,58188,975,975,1,12150,12150,75,75]
[null,"BD 06","Broadmeadows","Urban",1,0.7487961390304565,7.972073563598632E-2,null,9.6770482460943548,0,1,232,232,1,1,0,0,0,0,0]
[null,"BD 07","Broadmeadows","Urban",2679,17.172552830657956,1.7815066699182132,8.8210759999999997,1.2628945270681124,0.20798532601736494,5,92720,92720,1616,1616,3,50900,50900,121,121]
[null,"BD 08","Broadmeadows","Urban",807,9.2559118231105799,1.544792137854309,10.116612116284179,2.1488796791173397,0.21743582706023673,3,30953,30953,439,439,1,10440,10440,36,36]
[null,"BD 09","Broadmeadows","Urban",685,5.0207110314369192,1.4225302724332582,5.7537040581420893,0.78277486729839929,0.1537616543440487,4,13339,13339,100,100,2,8734,8734,27,27]
[null,"BD 10","Broadmeadows","Urban",1008,6.3855761313819883,2.9155425947570262,10.371908974426269,8.2043729737591012E-2,0.97685919510174368,2,1477,1477,29,29,2,58620,58620,168,168]
[null,"BD 11","Broadmeadows","Urban",1499,6.1941196410179131,1.4252778420879972,5.5669945744262694,1.1203165162667748,2.2145631039868035E-2,1,40567,40567,377,377,2,2673,2673,9,9]
[null,"BD 13","Broadmeadows","Urban",467,8.7269561013603223,2.5656182617896732,8.8515591418579103,1.7006327133279244,0.97383680230256764,1,17758,17758,482,482,5,33896,33896,75,75]
[null,"BD 14","Broadmeadows","Urban",708,9.248165072898864,2.0112559690075686,6.4700595488525385,9.4789222294120352E-3,1.5269547871504209E-2,0,257,257,2,2,2,1380,1380,5,5]
[null,"BD 15","Broadmeadows","Urban",809,8.6627384173679349,2.0244796320469511,10.615774632568359,6.1534736381112433E-2,1.1516507381762267,0,634,634,7,7,3,39552,39552,102,102]
[null,"BD 16","Broadmeadows","Urban",1446,9.3157215811291358,2.4412187371568299,7.4874360000000006,2.8650039308704565,2.1389587685285275E-2,6,76348,76348,1581,1581,2,1900,1900,18,18]
[null,"BMS11","Broadmeadows South","Urban",1,0,0.72049752363204966,null,0,0,0,0,0,0,0,0,0,0,0,0]
[null,"BMS12","Broadmeadows South","Urban",1462,7.7814473921203602,1.7814948426685333,11.62172,3.9865781763349135,6.6341152261294506E-3,4,157922,157922,7088,7088,2,876,876,3,3]
[null,"BMS21","Broadmeadows South","Urban",40,0.82106030838012689,2.9141402358675008,1.9433039999999999,4.159000955134929E-2,0,0,113,113,1,1,0,0,0,0,0]
[null,"BMS23","Broadmeadows South","Urban",2019,11.234457602539063,1.7832287434387206,8.211412000000001,3.1756491792832455,4.645403583179699E-2,6,162467,162467,2540,2540,2,7922,7922,50,50]
[null,"BMS25","Broadmeadows South","Urban",17,0,1.4589868870849609,2.876852,0,0,0,0,0,0,0,0,0,0,0,0]
[null,"BY 11","Braybrook","Urban",4152,16.31420588795185,2.456608284876785,9.4116879999999998,1.5336688191123042,0.83456114469300691,16,113612,113612,732,732,11,206077,206077,624,624]
[null,"BY 12","Braybrook","Urban",1283,4.6832074522686007,0.69582684222246549,2.76254,0.67690247863545483,0,3,41644,41644,1334,1334,0,0,0,0,0]
[null,"BY 13","Braybrook","Urban",738,2.9741231233596803,2.0061177475045775,12.231384,6.544739860949206,4.2425744026661001E-2,5,68169,68169,1675,1675,4,1473,1473,6,6]
[null,"BY 14","Braybrook","Urban",3011,12.216094803133007,3.5602572508211443,7.4493320000000001,0.28722289756044445,7.5380085239495631E-2,3,18261,18261,95,95,2,15975,15975,73,73]
[null,"BY 15","Braybrook","Urban",1049,6.1449416311836256,2.2109813591379543,6.9349280000000002,1.8215838691540043,0.56413309696968605,3,33826,33826,1153,1153,7,34919,34919,142,142]
[null,"CN 01","Coburg North","Urban",103,1.8647935936355591,0.3101107281918335,7.2816745162841796,7.7669939792169115E-2,0.485159731058942,0,112,112,1,1,2,2332,2332,8,8]
[null,"CN 02","Coburg North","Urban",493,4.8532017152118687,0.87945299450106817,7.7274913162841798,2.7862250353852516,0.15951608713557194,4,41611,41611,626,626,3,7941,7941,44,44]
[null,"CN 03","Coburg North","Urban",1377,4.7528419253063205,1.315725869972229,2.0728576436065671,5.16017503386021E-2,4.4543629358176117E-3,2,5995,5995,46,46,1,1725,1725,5,5]
[null,"CN 04","Coburg North","Urban",1477,7.502399238357544,5.965060905426979,7.6055583999999996,8.5934292955510777E-2,0.19579918551689701,0,2086,2086,13,13,5,15843,15843,101,101]
[null,"CN 05","Coburg North","Urban",4065,13.066997634992596,1.5790541932894515,7.4417113744262684,5.9660921506818507,1.4664260811931153,10,518483,518483,8555,8555,14,424799,424799,1271,1271]
[null,"CN 06","Coburg North","Urban",2140,9.8632003255462664,1.3326492786602324,6.4738696581420898,0.15469167987589866,0.11730535264120792,1,6691,6691,36,36,2,16913,16913,118,118]
[null,"CN 07","Coburg North","Urban",6431,14.544910795564647,0.64454369606081396,8.4057426325683586,0.56643444849341562,0.20072097992908461,8,65719,65719,462,462,10,77627,77627,365,365]
[null,"CN 08","Coburg North","Urban",2998,11.660811017532348,2.7631378866662599,5.9594657744262696,6.9887595553099366,0.7038109012474405,8,481642,481642,8236,8236,9,161681,161681,591,591]
[null,"CN 09","Coburg North","Urban",57,2.440227544078827,0.53171690993267817,4.4695992581420896,0,0.92999135511127795,0,0,0,0,0,3,4830,4830,16,16]
[null,"CN 10","Coburg North","Urban",1923,6.2561731073379523,1.0540043389385985,6.8358576581420891,2.0209998587483913,4.1938222085211391E-2,5,62671,62671,346,346,3,4335,4335,53,53]
[null,"CN 11","Coburg North","Urban",3972,11.843868738708498,1.4251211904386518,7.761784974426269,1.5918793791005899,1.0696463097613755,10,155773,155773,4776,4776,22,348900,348900,1050,1050]
[null,"COO11","Coolaroo","Rural-short",2246,134.73439221610306,27.683727704982992,9.1830639999999999,1.2592963017200609,3.6111217190835609,16,40208,40208,450,450,49,384331,384331,1957,1957]
[null,"COO12","Coolaroo","Urban",1,0.26938187343597414,0.54898742256164557,null,0,0,0,0,0,0,0,0,0,0,0,0]
[null,"COO13","Coolaroo","Urban",3966,5.2153364653778063,11.364612439992079,10.4786,5.1810728523962617E-2,3.7552132139765229E-2,2,4380,4380,52,52,1,10582,10582,143,143]
[null,"COO14","Coolaroo","Urban",2954,1.3883361854934693,14.547653274948564,6.687252,2.8868937631549119E-2,0,1,2569,2569,27,27,0,0,0,0,0]
[null,"COO21","Coolaroo","Rural-short",1928,16.532574564309122,12.245384553400994,5.9442240000000002,0.25560764426592619,0.31500634413971323,6,15212,15212,156,156,2,62490,62490,141,141]
[null,"COO22","Coolaroo","Urban",3540,0.71124938835144036,20.110985275463101,8.8210759999999997,3.4090752102064796E-2,0.17247854457456782,1,1980,1980,17,17,4,33392,33392,108,108]
[null,"CS 02","Coburg South","Urban",5693,14.830800540752406,1.0133074245007325,9.7927280000000003,1.0456052110909768,5.5037546052082477E-2,8,116969,116969,2128,2128,4,20523,20523,74,74]
[null,"CS 03","Coburg South","Urban",4072,10.746921775674817,2.6423309678652114,7.735112,1.3512226263681355,0.42269337646241678,4,103245,103245,4268,4268,6,107658,107658,244,244]
[null,"CS 05","Coburg South","Urban",4766,12.25533057794571,0.67059940670869822,8.0399440000000002,1.2084226168088117,0.18294772917779789,10,117195,117195,968,968,8,59142,59142,226,226]
[null,"CS 08","Coburg South","Urban",2956,9.230775435962677,2.510878941612015,7.8113199999999994,0.32998661478155533,0.21460596677144858,5,15540,15540,123,123,3,33688,33688,116,116]
[null,"CS 09","Coburg South","Urban",1999,4.0386366788971424,1.8284569043731689,3.9247119999999995,0.22183710050139588,0.13652096997244886,1,17851,17851,224,224,3,36619,36619,155,155]
[null,"CS 12","Coburg South","Urban",1935,9.5142027904558191,1.1596278945884704,7.2778640000000001,7.9638242165033644,0.11363728299006534,10,262741,262741,2696,2696,4,12497,12497,26,26]
[null,"CS 13","Coburg South","Urban",1738,5.5734862132120124,2.5460528690156936,2.8006439999999997,0.21927559349193937,0.12929833569899027,3,16830,16830,87,87,5,33080,33080,122,122]
[null,"EP 02","East Preston","Urban",57,0.34972500000000001,0.12977049999999998,2.6691851999999994,1.3105560797224882E-2,0,0,77,77,1,1,0,0,0,0,0]
[null,"EP 03","East Preston","Urban",223,1.6765587218093871,0.57905605511398317,1.7432579999999998,0,0.1252477904466873,0,0,0,0,0,1,9660,9660,20,20]
[null,"EP 04","East Preston","Urban",6,1.1259511495399475,0.37591110653933713,1.00023,0,1.4193366675459815,0,0,0,0,0,3,5254,5254,13,13]
[null,"EP 07","East Preston","Urban",45,1.9148211477279662,0.71851667145919795,2.3376804,3.3879201520323761E-2,0,0,119,119,1,1,0,0,0,0,0]
[null,"EP 09","East Preston","Urban",241,2.5441393663001062,0.64224418418502804,2.7263411999999998,6.3045893405547148E-3,0.16611126728794104,0,86,86,1,1,2,7553,7553,66,66]
[null,"EP 11","East Preston","Urban",224,2.0127901690226793,0.31543086126669312,1.5775056000000001,0.1372632188323907,0.31677881749810149,1,4514,4514,42,42,4,34725,34725,315,315]
[null,"EP 16","East Preston","Urban",58,1.9503173330402375,0.15062269550323487,2.7263411999999998,2.3259270761243456,0,2,8118,8118,119,119,0,0,0,0,0]
[null,"EP 17","East Preston","Urban",115,0.60246499999999992,0.16757752550000002,3.0006899999999996,0,0.30008563317903802,0,0,0,0,0,2,6378,6378,36,36]
[null,"EP 18","East Preston","Urban",18,0.96319918565750129,0.32124206771560671,1.3946063999999998,4.5263401778750177E-2,0,1,117,117,1,1,0,0,0,0,0]
[null,"EP 20","East Preston","Urban",371,2.3787017269563675,0.30675553763336183,2.7149099999999997,0.63027363150673388,2.876382941640749E-2,1,15093,15093,30,30,2,2296,2296,10,10]
[null,"EP 27","East Preston","Urban",26,5.2710022430419924E-2,1.4903151669067383,2.1890747999999998,0,0,0,0,0,0,0,0,0,0,0,0]
[null,"EP 34","East Preston","Urban",1485,5.2351078600597383,0.82666355880279541,2.5548731999999994,6.5338666540826054E-2,0.17769316445348082,1,7465,7465,130,130,8,67672,67672,261,261]
[null,"EP 35","East Preston","Urban",30,1.8828700966215135,0.39665636540817262,2.2405151999999999,0,0,0,0,0,0,0,0,0,0,0,0]
[null,"EP 36","East Preston","Urban",997,5.2230374027633673,0.31124512030151363,1.9375883999999999,1.7345824752308561,9.9429221168266996E-2,4,150409,150409,1980,1980,4,28739,28739,101,101]
[null,"EP 37","East Preston","Urban",874,3.6671310861349102,0.32349062328018185,2.9663964000000003,2.9180542906498363E-2,1.4658133180938712E-2,1,1290,1290,7,7,1,2160,2160,16,16]
[null,"EP 41","East Preston","Urban",55,1.4044694829940796,0.53553861759814458,3.1378643999999993,0.28894343113320331,1.8185250910481326E-2,1,1001,1001,58,58,1,210,210,2,2]
[null,"EP 42","East Preston","Urban",303,3.0374627575576305,1.099744588688965,2.7606347999999996,1.8988754578800924E-2,5.4426366627136395E-2,0,314,314,2,2,1,3000,3000,5,5]
[null,"EPN31","East Preston North","Urban",85,0.84168392753601073,1.0086634786224367,1.1812239999999998,0,0,0,0,0,0,0,0,0,0,0,0]
[null,"EPN33","East Preston North","Rural-short",1113,7.2410862998962404,1.2046255212783814,1.7527839999999999,0.22756752393392832,3.4367555469645643E-2,2,21589,21589,87,87,2,10868,10868,43,43]
[null,"EPN34","East Preston North","Urban",126,2.3464355225563049,0.49858122586250309,1.7146799999999998,1.1581390271602618E-2,0,0,130,130,1,1,0,0,0,0,0]
[null,"ES 11","Essendon","Urban",1159,4.3321416119003295,0.55593570662879943,4.8011040000000005,2.2048593761947184E-2,0.70224872179435893,0,1091,1091,7,7,6,115828,115828,437,437]
[null,"ES 12","Essendon","Urban",1033,3.919230518226624,0.39025259951400759,2.705384,0.10798412057898642,6.0489976245702334E-2,3,8241,8241,91,91,4,15388,15388,90,90]
[null,"ES 13","Essendon","Urban",2014,5.0374414281272895,0.493550097846508,4.5439020000000001,0.24292076026254864,0.38112436437732067,2,20579,20579,75,75,11,107623,107623,379,379]
[null,"ES 15","Essendon","Urban",2059,5.7477286094093323,2.1232331339645385,5.0868840000000004,0.2123466388508409,0.61783500609012532,3,15295,15295,109,109,10,148339,148339,422,422]
[null,"ES 16","Essendon","Urban",1365,3.7740654093933106,0.43434145060348511,2.8578000000000001,3.1315206739741415,0.81543685131016086,8,251485,251485,2936,2936,5,218286,218286,483,483]
[null,"ES 21","Essendon","Urban",1582,3.4176418193054197,0.56657515445709228,4.3152780000000002,3.7058447817195021E-2,0.96408017968040016,1,2704,2704,18,18,7,234483,234483,706,706]
[null,"ES 22","Essendon","Urban",1470,4.4837133975028998,3.7414844131469724,3.6008279999999999,1.1274451211300772E-2,6.9343726740785892E-3,1,1156,1156,9,9,1,2370,2370,6,6]
[null,"ES 23","Essendon","Urban",492,1.1035246056365966,0.42014775451755526,1.2574320000000001,6.3005102628926829E-3,0.34383947255181407,0,449,449,1,1,7,81678,81678,348,348]
[null,"ES 24","Essendon","Urban",1935,4.2381663910293579,1.1864627176885607,5.2202479999999998,3.8151619774822461E-2,0.1705092059409932,0,2166,2166,9,9,3,32268,32268,102,102]
[null,"ES 25","Essendon","Urban",1100,3.9065897919654846,1.9848531072006228,4.3533819999999999,0.25713968335716431,0.35556945772110582,1,13885,13885,718,718,3,64000,64000,174,174]
[null,"ES 26","Essendon","Urban",1290,2.6695655200958255,1.8786395145139694,4.6582140000000001,0.13679299826845728,0.78384937634211893,1,7404,7404,35,35,8,141421,141421,506,506]
[null,"FE 02","Footscray","Urban",79,0.85687935628890999,2.0780987654800418,10.402391999999999,0,0,0,0,0,0,0,0,0,0,0,0]
[null,"FE 05","Footscray","Urban",3274,8.4251590466308617,0.83441464829151157,6.5919920000000003,0.37840350534825118,0.1631557633055172,3,29074,29074,122,122,6,41786,41786,292,292]
[null,"FE 06","Footscray","Urban",3967,9.0229126700782771,7.2475036432615525,9.8117800000000006,1.6174310964535872,0.46928412897246879,6,83868,83868,446,446,7,81112,81112,292,292]
[null,"FE 08","Footscray","Urban",2271,3.7860431011295317,5.246210836754563,8.5543479999999992,1.9298191348322367,3.5860475713342325E-2,4,67419,67419,2579,2579,1,4176,4176,8,8]
[null,"FE 09","Footscray","Urban",4126,7.4051746134758005,1.1529764909963607,5.8299119999999993,1.9156970215423308,0.1025010502587385,10,205783,205783,4667,4667,2,36702,36702,205,205]
[null,"FF 87","Fairfield","Urban",995,2.6878126829147337,0.2065146059637451,1.8449956974426269,0.23656085608594363,0.56394560535663452,1,16937,16937,1031,1031,3,134589,134589,292,292]
[null,"FF 88","Fairfield","Urban",1307,3.9566807545661931,0.48610620468276977,1.9901719548852539,0.26572110958601169,0.10405343543483032,2,25716,25716,1329,1329,6,33567,33567,209,209]
[null,"FF 89","Fairfield","Urban",372,3.9153688583850856,0.83648123780194084,2.3353941948852541,0.13950376433266115,8.4617213844062442E-2,1,3888,3888,381,381,2,7861,7861,34,34]
[null,"FF 90","Fairfield","Urban",1060,3.3099215719413753,0.39379373021501157,2.3868345425573732,0.41693908753556574,4.3244126226635531E-2,3,30634,30634,1203,1203,1,10591,10591,89,89]
[null,"FF 95","Fairfield","Urban",1551,4.3718342249298097,6.4771991821937547E-2,2.8555137600000005,0.15304236374215552,0.44563249799276866,1,15062,15062,1680,1680,4,146193,146193,380,380]
[null,"FF 96","Fairfield","Urban",1194,4.1131351738357544,0.36249840929868316,2.1753574123278807,0.26842620324658362,5.3756123262888103E-2,3,25751,25751,1192,1192,3,17190,17190,66,66]
[null,"FT 01","Flemington","Urban",3593,5.5354167671966543,2.4714730298792875,5.8108599999999999,0.4551519660035987,0,5,41794,41794,386,386,0,0,0,0,0]
[null,"FT 02","Flemington","Urban",403,2.826931780338287,5.8600193943252066,3.8103999999999996,2.3685445855006074E-3,0.49114140524940597,1,50,50,1,1,1,34560,34560,96,96]
[null,"FT 04","Flemington","Urban",2056,3.4914842025184631,2.8321808852342145,4.829682,7.2585751006298813E-2,0.15987329860441427,0,4049,4049,16,16,2,29727,29727,77,77]
[null,"FT 05","Flemington","Urban",2409,4.672067790107727,2.0383807041383899,3.66751,0.16704073328474808,0.14915220231451551,2,14004,14004,201,201,6,41681,41681,141,141]
[null,"FT 06","Flemington","Urban",246,0.67026384086608881,1.2713349028661116,2.038564,2.2489507915419173E-2,0.76367213128244982,1,396,396,5,5,2,44823,44823,114,114]
[null,"FT 09","Flemington","Urban",1804,3.3515670193481446,3.1697792497104009,4.2962259999999999,1.971281083781224E-2,3.7412122051333943E-2,0,1214,1214,10,10,1,7680,7680,24,24]
[null,"FT 10","Flemington","Urban",2017,2.7893402366065985,1.2141700324318696,7.5350659999999996,0.57852959197459375,0.12603183493415979,4,30770,30770,319,319,1,22344,22344,76,76]
[null,"FT 13","Flemington","Urban",771,2.355378374519348,5.5174368398384024,5.9061199999999996,1.1767510575445519,0.16136869009859409,3,39466,39466,251,251,1,18040,18040,82,82]
[null,"FT 14","Flemington","Urban",1604,1.8829139863967896,1.713912610083824,4.1057060000000005,1.4174325869102162,0.11363121609994517,3,65058,65058,1620,1620,2,17385,17385,82,82]
[null,"FT 15","Flemington","Urban",86,0.12665975101470947,0.94348648557717896,3.1912099999999999,0,0,0,0,0,0,0,0,0,0,0,0]
[null,"FW 04","Footscray West","Urban",1655,5.735415777301788,1.4498897073956756,7.6589040000000006,0.65300845802771224,0.17209414927155112,3,16399,16399,231,231,4,14406,14406,74,74]
[null,"FW 05","Footscray West","Urban",1664,7.4898130464935306,1.1347342018840791,3.9247119999999995,0.17833638430417401,8.7793742599123703E-2,2,11470,11470,80,80,3,18822,18822,54,54]
[null,"FW 06","Footscray West","Urban",1007,5.6201119941043851,2.6486688002114711,4.0199720000000001,5.0497607065644452,1.8433363180624502E-3,3,175052,175052,1070,1070,2,213,213,2,2]
[null,"FW 08","Footscray West","Urban",2864,7.7891081720352151,1.3226210997583046,6.2871600000000001,0.12067760988446108,0,2,8736,8736,52,52,0,0,0,0,0]
[null,"FW 09","Footscray West","Urban",1376,9.0581339063739783,3.6151289122564703,7.2778640000000001,4.4473218045854557,0.16209887611506152,7,108004,108004,1621,1621,3,13122,13122,53,53]
[null,"FW 13","Footscray West","Urban",445,5.1307962910604488,0.64423430793946834,11.888448,7.7120037386819676E-2,0.19659456339166664,0,376,376,1,1,2,3195,3195,5,5]
[null,"FW 16","Footscray West","Urban",2595,9.1995298543167134,0.37490573491676327,6.4776800000000003,0.5594155366842678,1.6043281834200215E-2,3,50630,50630,1004,1004,1,4840,4840,11,11]
[null,"FW 17","Footscray West","Urban",2344,8.5967185044860859,0.39403633033830265,5.9251720000000008,3.0494758086058615,0.44682782099488694,5,191284,191284,4850,4850,3,93427,93427,251,251]
[null,"HB 14","Heidelberg","Urban",1714,5.3197951822471623,2.0024883959503175,4.5057979999999995,2.3404694233839964,0.10647448654257097,4,136914,136914,1764,1764,2,20762,20762,70,70]
[null,"HB 15","Heidelberg","Urban",2361,9.1912990207862855,1.3971211139907838,5.2107219999999996,5.9826870139618391,0.3964760490931386,8,442984,442984,6716,6716,11,97856,97856,271,271]
[null,"HB 22","Heidelberg","Urban",1120,5.1501063661193838,0.99551319934844962,3.4198339999999998,0.77894185596929255,6.1683802638667462E-2,4,36755,36755,216,216,1,9702,9702,49,49]
[null,"HB 23","Heidelberg","Urban",1479,5.4883256590652465,0.51186013393402097,3.315048,0.99783820718799165,0.15108455814774363,2,83187,83187,1525,1525,5,41985,41985,181,181]
[null,"HB 24","Heidelberg","Urban",951,6.648221198587418,0.34634306674957283,3.200736,2.5362398253523448,0.28680564584268881,6,126905,126905,1898,1898,7,47836,47836,202,202]
[null,"HB 31","Heidelberg","Urban",747,1.5098202678108215,0.54083522790908822,3.372204,2.0540289682365945E-2,0,0,655,655,3,3,0,0,0,0,0]
[null,"HB 32","Heidelberg","Urban",554,2.1668017103672028,0.57810422508239756,2.8578000000000001,1.6270731281637904E-2,0.747105767724912,0,507,507,3,3,5,77600,77600,257,257]
[null,"KLO13","Kalkallo","Rural-short",274,0.31949018859863282,7.2027369376373294,0.32388400000000001,1.5321521957776032,0.6136175695914643,2,83017,83017,505,505,3,110826,110826,190,190]
[null,"KLO21","Kalkallo","Rural-short",4,0,2.8482438653564452,0.64776800000000001,1.3311944119323791,0,2,1141,1141,7,7,0,0,0,0,0]
[null,"KLO22","Kalkallo","Rural-short",2180,12.347550185012818,18.250406349351884,5.0868840000000004,0.42324644205778467,0.33029690477134671,4,26832,26832,4327,4327,5,69798,69798,204,204]
[null,"NH 02","North Heidelberg","Urban",4256,16.314385624103544,4.169629171689941,8.4019320000000004,1.3569180024520628,0.59342209607936225,9,122151,122151,1926,1926,12,178068,178068,740,740]
[null,"NH 03","North Heidelberg","Urban",1337,9.1496230255794533,0.79539499356604004,6.7063040000000003,5.448494123897003,1.4935256350892179E-2,9,183863,183863,1925,1925,1,1680,1680,24,24]
[null,"NH 05","North Heidelberg","Urban",4050,10.846216919593811,0.97450994072875985,5.6774959999999988,3.499145851191797,0.15457572720428045,6,399169,399169,5813,5813,11,58778,58778,284,284]
[null,"NH 08","North Heidelberg","Urban",2594,11.075300464744567,1.504673444219208,4.5534280000000003,0.87132077373494565,0.30482057908010746,5,94086,94086,2475,2475,14,109716,109716,782,782]
[null,"NH 09","North Heidelberg","Urban",649,6.3436972361087776,1.1168282272879029,7.735112,0.33422475407432056,2.9249470681535388,6,4765,4765,44,44,8,139002,139002,325,325]
[null,"NH 12","North Heidelberg","Urban",17,0,4.5038632194375996,5.1821440000000001,0,0,0,0,0,0,0,0,0,0,0,0]
[null,"NH 13","North Heidelberg","Urban",1,0,3.7943350000000002,null,0,0,0,0,0,0,0,0,0,0,0,0]
[null,"NH 16","North Heidelberg","Urban",2631,7.3568572409248345,4.4819113862781528,7.3350200000000001,0.39961731341525741,0.70682031446935378,3,20453,20453,233,233,6,120587,120587,500,500]
[null,"NH 17","North Heidelberg","Urban",2720,9.0095002629280074,2.4777678552503586,6.0775880000000004,0.43828125229245962,0.18766692272087176,3,23829,23829,253,253,3,34011,34011,103,103]
[null,"NH 20","North Heidelberg","Urban",2088,7.8810857952500459,2.2817059131632078,8.8972839999999991,3.3335398759913129,0.94146953496827246,6,123044,123044,2248,2248,3,115835,115835,268,268]
[null,"NS 07","North Essendon","Urban",1185,3.7097913948249817,2.0208985513329312,3.8675560872131349,1.1085578515388767E-2,0,0,470,470,4,4,0,0,0,0,0]
[null,"NS 08","North Essendon","Urban",1200,2.9162224367713927,0.57472569617208857,2.4538975854644778,2.8105926589721941E-2,3.7448724256098478E-2,1,2175,2175,19,19,2,9660,9660,29,29]
[null,"NS 09","North Essendon","Urban",1115,3.6109957689094543,1.1474804853442457,4.6753609744262699,0.15381713461466365,0.7207810255104723,3,6845,6845,88,88,2,106918,106918,236,236]
[null,"NS 11","North Essendon","Rural-short",0,0,4.7224744305725097E-2,null,0,0,0,0,0,0,0,0,0,0,0,0]
[null,"NS 12","North Essendon","Urban",1195,3.7218917189216616,1.1703052689441451,2.9816379999999998,0.17753780362411345,0.49880651681567778,3,16254,16254,105,105,6,152223,152223,503,503]
[null,"NS 14","North Essendon","Urban",1472,5.6079641937255857,1.2612569511922684,4.5153239999999997,6.6861060440662401E-3,0.76271990123954791,0,426,426,3,3,5,161987,161987,317,317]
[null,"NS 15","North Essendon","Urban",1594,4.2833512125015254,1.3062471940965652,3.9571003709289552,1.1469301661670559,0.26595589211357362,2,74499,74499,1612,1612,4,57584,57584,141,141]
[null,"NS 16","North Essendon","Urban",725,3.1879308015441894,0.42193648207539369,1.6365668436065672,0.60366169539652348,0.14341670063053619,1,50040,50040,749,749,2,39628,39628,119,119]
[null,"NS 17","North Essendon","Urban",815,3.5749200064849855,0.51295392994037625,2.286240029071045,0.15317114493976108,0,3,10370,10370,110,110,0,0,0,0,0]
[null,"NS 18","North Essendon","Urban",1707,3.4471002650833129,2.6434112585489578,4.0885592872131351,0.42696356371694139,0.36747232173271704,3,22819,22819,126,126,5,65465,65465,182,182]
[null,"NT 03","Newport","Urban",2730,9.8752863643908491,3.2995592241238407,8.5733999999999995,6.5747024370739684,0.38956185471604726,2,389969,389969,5421,5421,7,77021,77021,226,226]
[null,"NT 04","Newport","Urban",1538,3.3750725156593324,1.9547924640328904,6.6491479999999994,0.65638495381612871,0.20758133242679846,5,20050,20050,110,110,3,21136,21136,88,88]
[null,"NT 08","Newport","Rural-short",0,0,6.6913429630126947E-2,null,0,0,0,0,0,0,0,0,0,0,0,0]
[null,"NT 10","Newport","Urban",64,1.8999392353248594,0.84040299308656308,2.0195119999999998,1.1250454454901611,1.0632742734155435E-2,1,4444,4444,31,31,1,140,140,1,1]
[null,"NT 11","Newport","Urban",2968,8.2596427809524524,2.5166116067633819,7.563644,2.903984658704903,0.17909947578651195,7,213300,213300,1841,1841,4,43850,43850,239,239]
[null,"NT 15","Newport","Urban",2562,9.8486125650405896,3.5524574920701983,6.8206160000000002,0.19319351418491931,4.3824257063878581E-2,2,11609,11609,115,115,3,8778,8778,40,40]
[null,"NT 16","Newport","Urban",213,2.9116828543472288,1.6090899231045226,5.3345599999999997,4.9908710381648777E-2,5.1450292169498936E-3,0,1036,1036,4,4,1,356,356,2,2]
[null,"NT 17","Newport","Urban",2371,6.8555376278114313,2.6778188697563938,7.4112280000000013,4.0861681518492592,1.8598194614875073E-2,4,210524,210524,2507,2507,2,3194,3194,11,11]
[null,"P  56","Preston","Urban",2,1.7870967147827148,0.26438695990966798,null,0.12728881618927004,2.1930044617751383,3,98,98,3,3,4,5628,5628,8,8]
[null,"P  57","Preston","Rural-short",101,1.13425,0.44084753499999996,0.29721120217192798,0.46929987826292069,8.6605527938784191E-2,4,29551,29551,405,405,10,18178,18178,990,990]
[null,"P  58","Preston","Rural-short",0,0.12690070362091066,4.094027103805542E-2,null,0,0,0,0,0,0,0,0,0,0,0,0]
[null,"P  59","Preston","Urban",811,1.3913500000000001,1.0468649536074066,1.0242355461639403,0.11339144967594986,0.43031099829722869,2,17092,17092,864,864,12,216209,216209,998,998]
[null,"P  61","Preston","Urban",83,0.22831770637512205,0.15281946197509766,0.26520384218032833,7.4287660035589342E-2,0.13290075349169669,2,6301,6301,163,163,2,37575,37575,79,79]
[null,"P  62","Preston","Urban",658,1.821721162185669,0.81007867065429684,2.9229578399999996,1.2321753016211312,1.1774704627314938E-2,5,50544,50544,938,938,1,1610,1610,7,7]
[null,"P  63","Preston","Urban",861,1.4149149999999997,6.7386289999999988E-2,2.2576620174426267,1.6639968086341319,0.41731531944861971,3,117582,117582,1817,1817,7,98295,98295,329,329]
[null,"P  65","Preston","Urban",337,0.16017000000000001,0.10159100000000001,0.98994193744262693,5.4764289977809542E-2,0.78064910244872121,1,2643,2643,339,339,13,125584,125584,1025,1025]
[null,"P  66","Preston","Urban",746,2.1319603489494323,0.6470718380808792,2.785783422557373,0.13584628984748021,0,2,5952,5952,745,745,0,0,0,0,0]
[null,"PV 12","Pascoe Vale","Urban",481,2.6134014556503296,1.646831222759247,2.352922,1.0997263946604927,0.24558881048882966,1,37859,37859,486,486,1,28182,28182,66,66]
[null,"PV 13","Pascoe Vale","Urban",3311,10.065922923316956,0.52111817398643501,4.8582599999999996,0.50681048896385039,0.29284596261134099,3,58286,58286,229,229,5,112263,112263,371,371]
[null,"PV 14","Pascoe Vale","Urban",2844,10.000205595055817,0.98073126426696777,5.0773580000000003,0.38879263749005222,0.12847296255666818,2,40968,40968,187,187,4,45125,45125,208,208]
[null,"PV 15","Pascoe Vale","Urban",1832,5.2331894011688229,0.5336937896347046,3.4198339999999998,0.21769936637882631,0.29651131137224146,3,22434,22434,260,260,10,101852,101852,527,527]
[null,"PV 21","Pascoe Vale","Urban",1294,5.5987530454635621,0.18051289753246308,2.2862400000000003,0.2306567261154909,1.7492256534723936E-2,1,20974,20974,75,75,4,5302,5302,55,55]
[null,"PV 22","Pascoe Vale","Urban",2672,9.8460191824722294,0.88046884047317509,5.4298199999999994,1.7146220543017752,0.25999902114019779,4,174352,174352,4940,4940,7,88127,88127,371,371]
[null,"PV 23","Pascoe Vale","Urban",2517,8.1084130088806141,0.18458547031021116,4.7820519999999993,0.3652740555790569,0.63038552195281705,4,37603,37603,249,249,19,216316,216316,1050,1050]
[null,"PV 24","Pascoe Vale","Urban",1752,6.9466427145719525,0.65191809635162357,3.0102159999999998,5.2819501439141443E-2,0.37337551108474198,2,5430,5430,35,35,8,127947,127947,479,479]
[null,"PV 31","Pascoe Vale","Urban",2058,5.8995183032226572,1.5583151308975696,4.2485959999999992,0.16015316427052875,0.63419491873697409,2,10758,10758,59,59,5,142003,142003,528,528]
[null,"SA 02","St Alban","Rural-short",58,12.902170787334441,0,0.95641039999999999,1.7705147526327528E-2,0.5177229345629567,1,261,261,1,1,2,25440,25440,57,57]
[null,"SA 06","St Alban","Rural-short",146,4.4350438692569725,1.2029429186621092,0.41914400000000002,0,0,0,0,0,0,0,0,0,0,0,0]
[null,"SA 10","St Alban","Rural-short",43,1.2621158943176269,0.8164226676023254,5.4076230461587979E-2,7.7296474704932113E-3,0,1,3109,3109,43,43,0,0,0,0,0]
[null,"SA 12","St Alban","Urban",1844,1.0849107551574706,6.186571387010682,3.4903263999999998,1.1175639940641711,0,3,143524,143524,1911,1911,0,0,0,0,0]
[null,"SBY11","Sunbury","Rural-short",3255,63.119910302600836,12.347616942166319,7.0797232000000001,5.6490880714252407,0.48103528083910585,19,405024,405024,6893,6893,6,114963,114963,465,465]
[null,"SBY13","Sunbury","Urban",1,0,0.14139604110717774,null,0,0,0,0,0,0,0,0,0,0,0,0]
[null,"SBY14","Sunbury","Rural-short",4119,91.071060881290435,23.179194181666301,10.5852912,4.2393642555398099,0.48025816931235915,19,256725,256725,2845,2845,15,96944,96944,322,322]
[null,"SBY31","Sunbury","Urban",1907,5.2740690959548946,7.3499585111478041,6.8320471418579096,0.11145302846568442,5.1439859291854337E-3,3,4550,4550,44,44,1,700,700,7,7]
[null,"SBY32","Sunbury","Rural-short",2932,116.64693283042909,10.256221875443671,5.9061199999999996,7.978783280040421,0.169507031232112,19,624268,624268,5998,5998,21,44208,44208,206,206]
[null,"SBY33","Sunbury","Urban",3078,14.229058059597017,5.5407362207765658,6.6262856581420895,0.1631100517217268,0.25197435901225884,1,13242,13242,48,48,3,68188,68188,277,277]
[null,"SHM11","Sydenham","Rural-short",1227,65.893058225555407,5.2586464957331849,3.3531520000000001,0.12263128667488474,1.6407939733092698,7,5820,5820,35,35,9,259570,259570,633,633]
[null,"SHM12","Sydenham","Urban",2845,4.711500103225708,14.039386374272549,7.6589040000000006,0.55213357960146259,6.3372735963070368E-3,3,39938,39938,157,157,2,1528,1528,113,113]
[null,"SHM14","Sydenham","Rural-short",4115,18.864689218568799,22.665630212449152,10.0023,0.1422521622857032,0.54292818475720639,4,10522,10522,75,75,5,133863,133863,428,428]
[null,"SHM21","Sydenham","Urban",4995,3.8848960497283933,20.011660580780049,10.973951999999999,6.1015351560220399,4.9774077149091274E-2,6,594474,594474,8818,8818,3,16165,16165,556,556]
[null,"SHM24","Sydenham","Urban",1,0,0.40330258789062501,null,0,0,0,0,0,0,0,0,0,0,0,0]
[null,"ST 11","Somerton","Urban",191,9.8309754205513009,4.9183535119664006,7.2588119999999989,4.5278802311977167,1.201721278513858,2,13129,13129,192,192,4,11615,11615,113,113]
[null,"ST 12","Somerton","Urban",240,9.5397526059913655,2.7708817030469817,7.6207999999999991,0.71605096442845118,5.3501166398805027E-2,2,2650,2650,12,12,1,660,660,2,2]
[null,"ST 13","Somerton","Urban",194,5.251546153774262,7.1172387855237389,6.2681079999999998,6.6015599797325368,0.60776586732725069,2,29448,29448,360,360,2,9037,9037,66,66]
[null,"ST 14","Somerton","Urban",107,0,5.2453419585610659,7.0492400000000011,0.20797612972047466,0,0,325,325,1,1,0,0,0,0,0]
[null,"ST 21","Somerton","Urban",4,0,1.4543377648130797,0.89544399999999991,0,0,0,0,0,0,0,0,0,0,0,0]
[null,"ST 22","Somerton","Urban",3337,6.5088080025482178,16.551632210425232,11.469303999999999,4.2233931639685016,1.9198689765112253E-2,5,212108,212108,3593,3593,6,3214,3214,9,9]
[null,"ST 23","Somerton","Urban",156,7.2137263841247554,3.5231367175429078,10.173768000000001,14.488300405536183,0,6,30888,30888,473,473,0,0,0,0,0]
[null,"ST 24","Somerton","Urban",1,0,3.7649121792123643,null,0,0,0,0,0,0,0,0,0,0,0,0]
[null,"ST 31","Somerton","Urban",1,0,0.61674857956542972,null,0,0,0,0,0,0,0,0,0,0,0,0]
[null,"ST 32","Somerton","Rural-short",6486,7.3409263836097711,36.957107582117693,12.520974400000002,0.11107364644890054,0.20325238560597322,3,9415,9415,76,76,9,57428,57428,175,175]
[null,"ST 33","Somerton","Urban",3235,10.446493603725436,6.3616482433229677,8.5543479999999992,1.4629600266983798,0.11643348615106974,10,81039,81039,479,479,5,21499,21499,132,132]
[null,"ST 34","Somerton","Urban",321,6.373350190095902,5.405196144046311,8.2914306325683587,4.2347010690422487E-2,0.75542650512316556,0,326,326,2,2,9,19385,19385,88,88]
[null,"TH 11","Tottenham","Urban",187,3.1282695117950441,0.83920005652976992,4.08855925814209,4.8675505460848471E-2,0.20448275622193315,0,320,320,2,2,3,4481,4481,9,9]
[null,"TH 12","Tottenham","Urban",24,3.4374605842590338,0.65262094555293271,2.3548273163626945,0.17642762470922854,0,1,350,350,3,3,0,0,0,0,0]
[null,"TH 13","Tottenham","Urban",53,3.2596244019132854,0.53141449149401854,3.0749928290710451,1.3414565298185122,1.0694224155281125,3,4731,4731,15,15,2,12572,12572,34,34]
[null,"TH 14","Tottenham","Rural-short",0,0,7.3010392320556644E-2,null,0,0,0,0,0,0,0,0,0,0,0,0]
[null,"TH 21","Tottenham","Urban",150,5.478710289735794,0.81441873143920895,20.332295213989259,2.8249360898175309,4.9593647563342461E-2,4,11586,11586,349,349,2,678,678,5,5]
[null,"TH 22","Tottenham","Urban",897,10.374955347328186,3.6150686187617813,5.864205774426269,4.3236904266077021,9.7850976093557338E-3,9,143827,143827,1968,1968,1,1085,1085,7,7]
[null,"TH 23","Tottenham","Rural-short",2,0,6.5860753477783196E-2,null,0,0,0,0,0,0,0,0,0,0,0,0]
[null,"TH 24","Tottenham","Rural-short",0,0,6.5035868409423825E-2,null,0,0,0,0,0,0,0,0,0,0,0,0]
[null,"TMA11","Tullamarine","Urban",758,7.1697639698791509,4.3006651969270706,4.0009199999999998,5.5750494162925331E-2,0.3293485051640937,4,1869,1869,13,13,5,36804,36804,108,108]
[null,"TMA14","Tullamarine","Urban",435,3.6739295519256592,5.9220862660942073,7.9256319999999993,1.7470726162498687E-2,6.6204857036837123E-2,0,152,152,1,1,2,1920,1920,5,5]
[null,"TMA21","Tullamarine","Urban",3,7.6199124908447269E-2,0.20168603090667725,4.420064,0,0,0,0,0,0,0,0,0,0,0,0]
[null,"TMA25","Tullamarine","Urban",336,0,6.0243986669235223,6.0204319999999996,0.18630736734999157,0,2,1569,1569,43,43,0,0,0,0,0]
[null,"TT 03","Thomastown","Urban",3027,13.322404332741501,4.1528826891051018,10.63863668371582,1.0437119976566878,2.4127098627612251,8,56103,56103,417,417,19,432304,432304,1282,1282]
[null,"TT 08","Thomastown","Urban",3142,14.917395617618563,1.9643839909980012,8.4133633162841797,0.80168305440093368,0.33823705533011406,4,42563,42563,356,356,3,59859,59859,155,155]
[null,"TT 10","Thomastown","Urban",3973,14.644871784095766,1.5533620810890199,6.8549096581420894,2.8248605595442213,0.17822050649888457,7,234717,234717,3601,3601,5,49361,49361,164,164]
[null,"TT 11","Thomastown","Urban",4044,12.317869290466309,1.0870323778302002,4.9458991714219991,1.8259809606504787,5.5814979464914233E-2,8,251005,251005,4568,4568,2,25575,25575,102,102]
[null,"WT 04","Watsonia","Urban",146,3.0197177140426632,1.6537114774206925,2.0195119999999998,0,2.2830069163869302E-2,0,0,0,0,0,1,720,720,2,2]
[null,"YVE10","Yarraville","Urban",2,0,0.63372718374633785,null,0,0,0,0,0,0,0,0,0,0,0,0]
[null,"YVE11","Yarraville","Urban",1,5.674664096832276E-3,0.83991117359161382,null,0,0,0,0,0,0,0,0,0,0,0,0]
[null,"YVE12","Yarraville","Urban",882,7.8398188498687746,1.4001445456848145,3.3531520000000001,5.9079413928822451,0.13745074756918435,3,201389,201389,1932,1932,1,15618,15618,38,38]
[null,"YVE14","Yarraville","Urban",138,1.6517134615516662,0.85637177293205258,5.7727560000000002,0.12585348111385264,6.1764505243210015E-3,1,379,379,4,4,1,62,62,1,1]
[null,"YVE15","Yarraville","Urban",621,6.2898191392517093,5.22158051678276,4.6486879999999999,0.37101788852431794,7.0638178748346032E-3,1,7201,7201,35,35,1,457,457,1,1]
[null,"YVE21","Yarraville","Urban",701,4.6684978593254094,3.1828676886005405,4.9154160000000005,3.0383258583018655,0.40140690577137933,2,56174,56174,726,726,5,24738,24738,90,90]
[null,"YVE22","Yarraville","Rural-short",2582,7.8430888814735429,13.704714767746452,5.1059359999999998,6.1131124226686893E-2,0.27668286032684181,1,4145,4145,20,20,3,62535,62535,193,193]
[null,"YVE23","Yarraville","Rural-short",179,2.1318101771736142,5.7871064769420633,1.657524,0.71891298626424138,7.045512072689511E-3,1,12214,12214,182,182,1,399,399,5,5]
[null,"YVE24","Yarraville","Urban",792,3.3471769840037826,1.244078788656235,3.6198799999999998,0.31531374684049646,0,3,9419,9419,111,111,0,0,0,0,0]
[null,"YVE25","Yarraville","Urban",2,0.66326112747192378,1.4554504756546021,null,0,0,0,0,0,0,0,0,0,0,0,0]
[]
[]
[]
[]
[]
[]
[]
[]
[]
[]
[]
[]
[]
[]
[]
[]
[]
[]
[]
[]
[]
[]
[]
[]
[]
[]
[]
[]
[]
[]
[]
[]
[]
[]
[]
[]
[]
[]
[]
[]
[]
[]
[]
[]
[]
[]
[]
[]
[]
[]
[]
[]
[]
[]
[]
[]
[]
[]
[]
[]
[]
[]
[]
[]
[]
[]
[]
[]
[]
[]
[]
[]
[]
[]
[]
[]
[]
[]
[]
[]
[]
[]
[]
[]
[]
[]
[]
[]
[]
[]
[]
[]
[]
[]
[]
[]
[]
[]
[]
[]
[]
[]
[]
[]
[]
[]
[]
[]
[]
[]
[]
[]
[]
[]
[]
[]
[]
[]
[]
[]
[]
[]
[]
[]
[]
[]
[]
[]
[]
[]
[]
[]
[]
[]
[]
[]
[]
[]
[]
[]
[]
[]
[]
[]
[]
[]
[]
[]
[]
[]
[]
[]
[]
[]
[]
[]
[]
[]
[]
[]
[]
[]
[]
[]
[]
[]
[]
[]
[]
[]
[]
[]
[]
[]
[]
[]
[]
[null,null,null,null,null,null,null,null,null,null,null,null,null,null,null,null,null,null,null,null,null,null," "]

{"sheet":"3.6.8 Network-feeders (2016-17)","index":15,"n_rows":421,"n_cols":23,"rows_kept":421,"cut":false,"hidden":false,"merged":[[5,1,5,4],[5,6,5,8],[10,1,12,1],[10,2,12,2],[10,3,12,3],[10,4,12,4],[10,5,10,6],[10,7,12,7],[10,8,10,9],[11,5,12,5],[11,6,12,6],[11,8,12,8],[11,9,12,9],[11,20,12,20],[11,21,11,22],[10,10,10,14],[10,15,10,19],[10,20,10,22],[11,13,11,14],[11,10,12,10],[11,11,11,12],[11,15,12,15],[11,16,11,17],[11,18,11,19]]}
[null,{"$f":"INDEX(dms_Worksheet_List,MATCH(dms_Model,dms_Model_List))","v":"HISTORICAL ANNUAL REPORTING - FINANCIAL YEARS"}]
[null,{"$f":"INDEX(dms_TradingNameFull_List,MATCH(dms_TradingName,dms_TradingName_List))","v":"Jemena Electricity"}]
[null,{"$f":"dms_Header_Span","v":"2011-12 to 2017-18"}]
[null,"3.6 QUALITY OF SERVICES"]
[]
[null,"Did the MAIFI parameter of the STPIS apply during the period?",null,null,null,"No","** IMPORTANT\nPlease ensure this question is answered correctly. Your response will affect other tables throughout this workbook and will determine which cells are grey and which are input cells. "]
[]
[]
[]
[null,"3.6.8 - NETWORK FEEDER RELIABILITY"]
[null,"Feeder ID / name","Description of the service area for the feeder","Feeder classification\n\n(drop down)","Number of distribution customers","Length of high voltage distribution lines",null,"Maximum demand\n(MVA)","Energy not supplied\n(MWh)",null,"Unplanned Outages",null,null,null,null,"Planned Outages",null,null,null,null,"Momentary feeder outages"]
[null,null,null,null,null,"Overhead","Underground",null,"Unplanned","Planned","Total number of unplanned outages","Unplanned customer minutes off-supply (SAIDI)",null,"Unplanned interruptions\n(SAIFI)",null,"Total number of planned outages","Planned customer minutes off-supply (SAIDI)",null,"Planned interruptions\n(SAIFI)",null,"Total number of momentary feeder outages","Momentary interruptions due to feeder outages (MAIFI)"]
[null,null,null,null,null,null,null,null,null,null,null,"Including excluded events and MEDs","After removing excluded events and MED","Including excluded events and MEDs","After removing excluded events and MED",null,"Including MEDs","After removing  MED","Including MEDs","After removing  MED",null,"Including excluded events and MEDs","After removing excluded events and MED"]
[null,"AW 01","Airport West","Urban",818,4.6437684369087222,5.3195657227039339,9.8117800000000006,5.7074318589985058,0.48241837410777666,6,95319,95319,2585,2585,4,26856,26856,95,95]
[null,"AW 02","Airport West","Urban",2360,10.53002653670311,2.7554443163871767,7.4874360000000006,0.12152797848983679,0,2,7250,7250,70,70,0,0,0,0,0]
[null,"AW 03","Airport West","Urban",106,4.0971545324325565,2.0388910245895384,6.5348360000000003,0.67331378628149896,0,2,1768,1768,213,213,0,0,0,0,0]
[null,"AW 04","Airport West","Urban",1471,8.7694960241317759,4.2700299639701846,8.4781399999999998,9.4518134954341129,0.1325039090925767,7,257738,226185,1583,1498,2,12044,12044,32,32]
[null,"AW 05","Airport West","Urban",519,1.7152159113883971,0.84397959631681441,7.0682920000000005,0.73627625462780166,1.7879538697932109,4,10330,10330,931,931,4,83617,83617,261,261]
[null,"AW 06","Airport West","Urban",5143,17.164075558662415,1.634331644296646,10.592912,1.4192835102037153,0.790204189383931,10,154242,129595,3964,3944,16,286254,286254,1167,1167]
[null,"AW 07","Airport West","Urban",4865,15.671717566490173,5.9905024974346155,11.495976800000001,4.0403955532745988,0.17204061206709514,12,403040,402728,14868,14867,9,57205,57205,279,279]
[null,"AW 08","Airport West","Urban",1537,8.8366907348632822,1.7477924827337266,4.8087248000000002,2.1483799959177876,5.5060650694965838E-2,6,106930,18659,243,162,2,9135,9135,39,39]
[null,"AW 09","Airport West","Urban",2474,10.995037261962892,8.2279501559138293,7.5884116581420891,1.5823329047363583,0.14615270244913112,8,92486,38860,7220,5007,3,28475,28475,90,90]
[null,"AW 11","Airport West","Urban",472,5.9977113246917728,3.382808434724808,7.5112510000000006,4.8968794223588956,0.31306366814573611,5,49694,49694,1467,1467,3,10590,10590,45,45]
[null,"AW 12","Airport West","Urban",1847,5.8191421551704412,6.8919672842025754,8.6819963999999992,0.49866310712860656,1.4970048196747201,3,13995,13995,81,81,2,140045,140045,371,371]
[null,"AW 14","Airport West","Urban",1226,8.916305653572083,4.4427642469406123,7.1264006000000002,3.009095085036952,4.0669968708782339E-3,6,68587,60350,684,660,1,309,309,8,8]
[null,"BD 01","Broadmeadows","Urban",233,3.2193806641101839,4.4360301830768583,7.0492400000000011,0.23847323967860654,0.13818990344062534,1,1608,1608,11,11,2,3106,3106,16,16]
[null,"BD 02","Broadmeadows","Urban",1,0.66480959892272951,7.3398033142089841E-2,null,0,0,0,0,0,0,0,0,0,0,0,0]
[null,"BD 03","Broadmeadows","Urban",358,4.0051220374107359,4.3978367729187013,10.779621948852538,3.1659065184578434,0.34959534011971632,1,15434,15434,358,358,4,5681,5681,26,26]
[null,"BD 04","Broadmeadows","Urban",941,5.6437325453758245,4.4587667404562232,11.053970632568358,1.6019773805076305,0.53010183830817059,5,34752,21187,141,107,2,38332,38332,273,273]
[null,"BD 06","Broadmeadows","Urban",1,0.74878227806091313,7.972074127197265E-2,null,0,0,0,0,0,0,0,0,0,0,0,0]
[null,"BD 07","Broadmeadows","Urban",3362,17.167670894622802,1.8797159814834594,7.0492400000000011,0.53285712638465155,6.771059430992625E-2,6,60290,52134,294,267,2,25537,25537,57,57]
[null,"BD 08","Broadmeadows","Urban",815,9.2488447422981253,1.5924753093719484,9.9527647999999989,9.2983547187207432,0.10513376944461467,5,138608,138463,1592,1591,2,5224,5224,14,14]
[null,"BD 09","Broadmeadows","Urban",682,5.0242808275222774,1.4047456178665161,5.8718263999999989,1.3531266269116682,0.10859519380835515,5,24391,11056,150,136,2,6525,6525,34,34]
[null,"BD 10","Broadmeadows","Urban",927,6.3803222475051875,2.9179261515140533,9.6746056581420881,0.53550015139471041,0,2,9661,9661,39,39,0,0,0,0,0]
[null,"BD 11","Broadmeadows","Urban",1497,6.1832250075340269,1.4635563025474547,5.1592815999999999,2.7363534764533133E-2,0.47323967661096933,0,1135,1135,8,8,4,65431,65431,267,267]
[null,"BD 13","Broadmeadows","Urban",472,8.7651761426925674,2.7291604881286622,8.6381768000000001,2.3913515055968082,0.17655807261060166,5,25940,25940,605,605,1,6384,6384,16,16]
[null,"BD 14","Broadmeadows","Urban",1662,10.151370145797729,2.0139177780151369,5.3688536000000004,0.74018541836751561,0.22138087206537638,4,50351,1423,80,8,3,50198,50198,232,232]
[null,"BD 15","Broadmeadows","Urban",817,8.6752675261497494,2.0110178360939024,10.688172,0.37366758901918556,1.3594759570065067,3,3825,3825,831,831,4,46387,46387,158,158]
[null,"BD 16","Broadmeadows","Urban",1444,9.3157651565819979,2.4405418043136597,7.3921759999999992,0.775102644420681,0.30811146872987,4,22776,22776,206,206,3,30179,30179,164,164]
[null,"BMS11","Broadmeadows South","Urban",1,0,0.71906504726409914,null,0,0,0,0,0,0,0,0,0,0,0,0]
[null,"BMS12","Broadmeadows South","Urban",1444,7.7801365356445311,1.7764061992168427,11.374043999999998,2.3572956035086103,0.24584307040220726,1,90926,90926,1510,1510,4,31609,31609,75,75]
[null,"BMS21","Broadmeadows South","Urban",60,3.4477567007541658,2.7074047737121583,2.0004599999999999,0.17068590511165288,0.49640923155432226,1,625,625,12,12,2,6059,6059,17,17]
[null,"BMS23","Broadmeadows South","Urban",1999,11.231128150939941,1.7831974868774414,8.1352039999999999,4.7786143394725373,5.197945046238743E-2,6,234070,199446,2281,2228,7,8487,8487,85,85]
[null,"BMS25","Broadmeadows South","Urban",34,0,1.4734048080444335,2.6672799999999999,0,3.9213101555483541E-2,0,0,0,0,0,1,333,333,1,1]
[null,"BY 11","Braybrook","Urban",4206,16.326960886240006,2.4769718017578124,9.9070399999999985,7.3698417062929922,0.22796035385471947,19,560894,317115,4936,4745,5,57831,57831,265,265]
[null,"BY 12","Braybrook","Urban",1260,4.6852724204063421,0.69582638144493103,2.8578000000000001,0.65099956829028416,0,8,40673,40673,749,749,0,0,0,0,0]
[null,"BY 13","Braybrook","Urban",600,2.9805952816009524,2.0733260250091554,11.354991999999998,0.2024039059823442,0.40661498969667359,1,1848,970,7,6,1,12375,12375,33,33]
[null,"BY 14","Braybrook","Urban",3007,12.2287681517601,3.8749200062751772,9.1449600000000011,19.30328578143957,8.0654319407207062E-2,18,1033921,406157,9744,6702,2,14400,14400,48,48]
[null,"BY 15","Braybrook","Urban",1068,6.1449407835006715,2.2109860882759094,7.2207079999999992,5.2482169657596858,0.20929535435307919,6,100270,100270,154,154,2,13329,13329,46,46]
[null,"CN 01","Coburg North","Urban",101,1.8648571872711182,0.31011074638366698,6.8701512000000005,4.0549401945162744,1.1744165913554242E-2,1,5697,5697,41,41,1,55,55,1,1]
[null,"CN 02","Coburg North","Urban",515,4.8526934304237361,0.83079951000213625,6.5157840000000009,1.0235509227596038,0.34832209370442785,6,15868,15868,138,138,2,18000,18000,42,42]
[null,"CN 03","Coburg North","Urban",1458,4.7593703455924992,1.3363150327205657,2.8806624000000003,1.2221629064613253E-2,0.19607010817916418,0,1348,1348,7,7,4,72086,72086,298,298]
[null,"CN 04","Coburg North","Urban",1494,7.1224655590057377,5.7311696879863732,4.9573304,0.14249268242644281,8.3710732431734866E-2,4,6706,3845,55,54,5,13132,13132,79,79]
[null,"CN 05","Coburg North","Urban",4122,13.064090537548065,1.5790675265789031,7.4721943999999993,0.72555158178788148,1.395509157246526E-2,9,64106,41219,357,316,2,4110,4110,21,21]
[null,"CN 06","Coburg North","Urban",2146,9.8639449577331533,1.3326883683204651,6.6682000000000006,6.3672562903733372,0.50003152640859838,7,290978,290978,6976,6976,13,76170,76170,343,343]
[null,"CN 07","Coburg North","Urban",5951,13.605282956123352,0.60580463385581962,8.3943113162841794,4.9180525611849593,0.24118906247165414,6,539481,539481,11468,11468,7,88190,88190,242,242]
[null,"CN 08","Coburg North","Urban",3250,12.182273818817137,2.9925984487915041,6.6567688,2.1247124739141237,0.60832531516135102,3,149556,148381,4882,4881,9,142731,142731,487,487]
[null,"CN 09","Coburg North","Urban",65,2.4534350881576539,0.52171650886535648,4.5877216000000001,1.4006737900697062,0,2,2381,2381,12,12,0,0,0,0,0]
[null,"CN 10","Coburg North","Urban",1939,6.2573454113006584,1.0665869178771972,7.1444999999999999,1.232883800580717,1.2110832439964014,3,41244,20919,228,87,11,135049,135049,529,529]
[null,"CN 11","Coburg North","Urban",4019,11.841044204711913,1.4251440808773042,7.09687,0.33694562344380613,0.27437088287134404,6,32999,32999,342,342,6,89569,89569,396,396]
[null,"COO11","Coolaroo","Rural short",2896,133.50210128080846,29.673014776885509,10.326184000000001,8.8914102551004781,0.97653725499170807,15,373201,171474,1443,875,22,136628,136628,613,613]
[null,"COO12","Coolaroo","Urban",1,0.26937374687194826,0.54902484512329097,null,0,0,0,0,0,0,0,0,0,0,0,0]
[null,"COO13","Coolaroo","Urban",3695,3.8444024658203126,11.430931484699251,8.4400359999999992,0.21717433372983763,8.4508381045726708E-2,2,17971,17971,149,149,7,23310,16498,126,113]
[null,"COO14","Coolaroo","Urban",3028,1.4143628845214844,15.613750769138335,6.687252,0.64077057846426999,0.25988086489640089,7,56192,56192,267,267,3,75967,75967,257,257]
[null,"COO21","Coolaroo","Rural short",2174,17.136773972272874,13.567373345136643,7.9446840000000005,0.75186085007080627,6.3961563651113246E-2,7,39641,22290,198,170,3,11241,11241,46,46]
[null,"COO22","Coolaroo","Urban",3659,0.70946877670288089,20.411287550926208,8.8782320000000006,0.25132806522930334,0.18473657799830887,4,14791,14791,69,69,2,36240,36240,85,85]
[null,"CS 02","Coburg South","Urban",5646,14.855935425758361,1.0133665390014648,10.040404000000001,1.4309806216009986,2.3454980738858284E-2,10,162786,162786,1247,1247,2,8894,8894,33,33]
[null,"CS 03","Coburg South","Urban",4103,10.704038420200348,2.8700654242038723,8.2304639999999996,4.7883465477999305,0.21973204555978185,10,361231,105946,7500,3310,6,55255,55255,146,146]
[null,"CS 05","Coburg South","Urban",4777,12.402403001785277,0.63472334349155424,8.5924519999999998,3.4529645004347627,0.32480533009231716,7,336633,335600,7563,7561,12,105552,105552,412,412]
[null,"CS 08","Coburg South","Urban",3022,9.5674709329605108,2.5094823632240297,8.7067639999999997,0.16132013018102526,0.52260104624904102,4,7878,7878,83,83,8,85070,85070,291,291]
[null,"CS 09","Coburg South","Urban",2002,4.0386590891480445,1.8284938087463378,4.1533360000000004,0.8742794887220543,4.660043010518166E-2,4,70422,69347,617,616,1,12512,12512,68,68]
[null,"CS 12","Coburg South","Urban",2059,9.5522418844699857,1.1616387891769409,7.8303719999999997,3.814891635360139,1.4388692529093832,9,128573,124974,2247,2245,3,161647,161647,373,373]
[null,"CS 13","Coburg South","Urban",1752,5.5724581539630886,2.5711437380313873,2.9721120000000001,1.634869162011823,0,9,128690,128690,1551,1551,0,0,0,0,0]
[null,"EP 02","East Preston","Urban",57,0,0,1.2802944000000001,0,0,0,0,0,0,0,0,0,0,0,0]
[null,"EP 03","East Preston","Urban",366,1.8963465251922607,0.69655973911285396,1.3888908,0.67537474599729386,1.417061967431025,1,33245,33245,19,19,14,232514,232514,611,611]
[null,"EP 04","East Preston","Urban",8,1.1259923982620239,0.42541122055053709,1.1774135999999999,0,0.13807928926977386,0,0,0,0,0,1,626,626,2,2]
[null,"EP 07","East Preston","Urban",45,1.9173211803436279,0.71523275947570797,2.3548271999999999,0,0.1157066867418953,0,0,0,0,0,2,1398,1398,12,12]
[null,"EP 09","East Preston","Urban",238,2.543093362212181,0.63156761837005615,2.5834511999999998,0.22538909846689356,0,2,3109,3109,17,17,0,0,0,0,0]
[null,"EP 11","East Preston","Urban",8,0.17519033804535866,0.24881401348114013,0.70873439999999999,1.6133445377896596E-2,0.64767976686426809,0,93,93,1,1,3,12445,12445,13,13]
[null,"EP 16","East Preston","Urban",57,1.9537646660804748,0.15062539100646974,2.5148640000000002,3.5296395039261137,0,1,12460,794,60,4,0,0,0,0,0]
[null,"EP 17","East Preston","Urban",101,0.222025,1.5412E-2,1.4746247999999997,0,4.3183541300533586E-3,0,0,0,0,0,1,320,320,1,1]
[null,"EP 18","East Preston","Urban",11,0.65554837131500243,0.32185567855834962,0.86877120000000008,0,0.43835521849253822,0,0,0,0,0,1,4590,4590,9,9]
[null,"EP 20","East Preston","Urban",362,2.2517988789081573,0.47635171651840214,2.6348916,0.86777053204455012,6.1082451442318261E-3,1,20841,20841,56,56,1,489,489,1,1]
[null,"EP 27","East Preston","Urban",25,5.2710044860839841E-2,1.4903065338134767,2.1262032,6.6911422379672986E-2,0,0,235,235,2,2,0,0,0,0,0]
[null,"EP 34","East Preston","Urban",1562,5.2868931584358219,0.82668046760559077,2.8749467999999996,1.5147316372189069E-2,3.3576695469454403E-2,1,1751,1751,19,19,2,12938,12938,65,65]
[null,"EP 35","East Preston","Urban",30,1.8828687055110931,0.39665650081634524,2.3091023999999996,0,0,0,0,0,0,0,0,0,0,0,0]
[null,"EP 36","East Preston","Urban",994,5.2260319805145263,0.42860769844055174,2.2233684,1.4229661926501673E-2,0.18370320916899646,2,1154,1154,9,9,2,49660,49660,138,138]
[null,"EP 37","East Preston","Urban",879,3.6687111794948581,0.32117021656036376,3.0749928,0.28763806581228546,0.1271742427341381,1,12584,12584,100,100,2,18546,18546,81,81]
[null,"EP 41","East Preston","Urban",53,1.4045551147460937,0.53553810119628908,2.8406531999999998,5.25032749413002,0.42428297062672221,3,16947,16947,65,65,1,4565,4565,11,11]
[null,"EP 42","East Preston","Urban",343,3.0329492625594137,1.0997356853485107,2.8806623999999998,0,0,0,0,0,0,0,0,0,0,0,0]
[null,"EPN31","East Preston North","Urban",97,0.44446364402770994,0.97080695724487309,3.753244,0.24645828858563396,0.15020423690488993,1,1111,1111,19,19,1,2257,2257,37,37]
[null,"EPN33","East Preston North","Urban",2064,10.464243700027467,1.8090510425567627,4.7439479999999996,0.18114910949403626,0.13629226873727804,2,12878,12878,77,77,6,32297,32297,156,156]
[null,"EPN34","East Preston North","Urban",122,2.4914756631851196,0.59768245172500611,1.6956279999999999,0,0,0,0,0,0,0,0,0,0,0,0]
[null,"EPN35","East Preston North","Urban",1435,6.9181527053394314,1.5796042487506865,5.3726639999999994,2.1872871609346291E-2,1.1860339025893077E-3,0,1018,1018,5,5,1,184,184,1,1]
[null,"ES 11","Essendon","Urban",1160,4.2973647594451911,0.59881208086013793,4.9344679999999999,8.1971640337721793E-2,9.2315774633589351E-2,1,4154,4004,67,66,2,15594,15594,66,66]
[null,"ES 12","Essendon","Urban",1048,3.9192010364532472,0.39025308704376216,3.0387940000000002,0.38187061019862983,0,1,29404,1172,30,7,0,0,0,0,0]
[null,"ES 13","Essendon","Urban",1623,5.4894618711471557,0.48647619569301603,4.2104920000000003,0.74338343328705858,0,3,57115,57115,199,199,0,0,0,0,0]
[null,"ES 15","Essendon","Urban",2085,5.7665113787651059,2.2109525351524351,5.1821440000000001,0.19215101569000864,9.7376383511905848E-2,2,14313,14313,166,166,3,24178,24178,63,63]
[null,"ES 16","Essendon","Urban",1391,3.7485074081420899,0.43394147908687591,3.0673719999999998,7.9098845756608777E-2,0.2050758337836657,2,6288,6028,49,48,3,54342,54342,147,147]
[null,"ES 21","Essendon","Urban",1591,3.4086325149536134,0.56775033020973198,4.5915319999999999,0.39001380248412426,4.9325559528995248E-2,4,28223,28223,135,135,2,11898,11898,45,45]
[null,"ES 22","Essendon","Urban",1758,5.610032680034637,4.3421975518465041,4.8011040000000005,2.4328845798493211E-2,5.2422132204842452E-2,0,2198,2198,12,12,3,15787,15787,111,111]
[null,"ES 23","Essendon","Urban",490,1.1035392112731934,0.43026350903511046,1.3717439999999999,1.4842184207129645E-2,0,0,1038,1038,4,4,0,0,0,0,0]
[null,"ES 24","Essendon","Urban",1952,4.2541727714538577,1.172029117822647,5.2107219999999996,0.70864192597626674,0.31439005356719024,2,41561,31794,84,69,7,61462,61462,232,232]
[null,"ES 25","Essendon","Urban",1120,3.8814570569992064,2.0062308475971222,4.4295900000000001,1.0049653716044964,5.8055496952346117E-2,3,54559,12921,144,103,1,10506,10506,103,103]
[null,"ES 26","Essendon","Urban",1271,2.6695117912292483,1.8730963344573974,4.9058900000000003,4.1891827395147171E-2,0.35063745806462981,1,2195,2195,23,23,4,61241,61241,151,151]
[null,"FE 02","Footscray East","Urban",79,0.96570871257781987,2.0842833287715914,8.7067639999999997,0,0,0,0,0,0,0,0,0,0,0,0]
[null,"FE 05","Footscray East","Urban",3301,8.4404166870117194,0.8301177332401275,7.0111359999999996,2.5230076847804463,0.55558410725615304,4,190765,70596,325,234,6,140026,140026,462,462]
[null,"FE 06","Footscray East","Urban",3964,8.971894552230836,7.1753396477699276,10.592912,6.7682398387055391,1.8947855863404985,15,339708,313891,4680,4652,14,317007,317007,1198,1198]
[null,"FE 08","Footscray East","Urban",2297,3.7857162022590636,5.4768714079856871,8.5924519999999998,0.23674858662126214,0.38850781788245226,3,8597,8597,55,55,7,47026,47026,148,148]
[null,"FE 09","Footscray East","Urban",4187,7.4065992269515988,1.1577319819927216,6.2490560000000004,1.4942919132029038,0.15571529568296727,12,156986,77312,753,660,3,54530,54530,194,194]
[null,"FF 87","Fairfield","Urban",1022,2.6152737026214599,0.28814657592773441,1.8175607999999996,6.850289954270336E-2,0.22911194840216861,3,5265,5265,50,50,5,58697,58697,226,226]
[null,"FF 88","Fairfield","Urban",1292,3.9646231203079223,0.48537365436553953,2.4497061599999999,4.8909117515231929E-2,0.19289454565635641,2,4479,2583,18,16,2,58883,58883,224,224]
[null,"FF 89","Fairfield","Urban",371,3.9198319916725159,0.83648460960388182,2.3742602923278811,1.1738735785933095E-2,0.13711842439313338,0,329,329,2,2,2,12810,12810,29,29]
[null,"FF 90","Fairfield","Urban",1062,3.2796531438827516,0.39379448843002318,2.44284744,2.2270812032016757E-3,0.15181496531215324,0,164,164,2,2,4,37265,37265,183,183]
[null,"FF 95","Fairfield","Urban",1421,4.7998016061782831,0.11654546475410461,2.8155045599999999,0.1733828462695402,0.23836379670217167,3,18091,18091,69,69,7,82904,82904,250,250]
[null,"FF 96","Fairfield","Urban",1282,4.5366658344268798,0.33934141659736633,2.7217687199999996,4.4027943829522104E-2,0.38130765402172156,1,3912,3912,30,30,8,112934,96784,354,316]
[null,"FT 01","Flemington","Urban",3037,4.3531735343933109,2.3042060017585753,5.2678779999999996,9.2777838561641693E-2,0.63905942875634769,1,8041,5692,64,62,9,184623,184623,681,681]
[null,"FT 02","Flemington","Urban",1020,3.2989595994949337,6.5625783481150863,4.1152319999999998,0.43452552808717199,0.74848089460283274,2,18118,18118,125,125,6,104029,104029,269,269]
[null,"FT 04","Flemington","Urban",2040,3.5694486217498778,3.0067992691993712,6.3728940000000005,0.21492056234182608,8.9580508687193305E-2,1,10412,10412,101,101,2,14466,14466,68,68]
[null,"FT 05","Flemington","Urban",2396,4.6791153430938719,2.1843130120038987,4.4676939999999998,0.11687550648737764,0.73340414783793217,1,9321,9321,47,47,12,194967,194967,781,781]
[null,"FT 06","Flemington","Urban",247,0.66865285873413094,1.4750212059020997,2.0480900000000002,2.0427065475278807E-2,0,0,371,371,2,2,0,0,0,0,0]
[null,"FT 09","Flemington","Urban",1806,3.2880493526458743,3.256385494356044,4.3629079999999991,0.17412061355811373,4.9171851304951615E-2,1,10262,8643,80,79,2,9660,9660,40,40]
[null,"FT 10","Flemington","Urban",1463,1.9925504732131958,0.65321250486373905,6.3919459999999999,0.65155982774332055,0,2,35065,35065,257,257,0,0,0,0,0]
[null,"FT 13","Flemington","Urban",768,2.352779058456421,5.167255587339401,5.1440400000000004,5.6759323042703223E-2,2.0806099486892053,0,1841,338,5,4,1,224950,224950,409,409]
[null,"FT 14","Flemington","Urban",1658,1.882927972793579,1.7160868532657623,4.1628620000000005,2.1332971861027143,2.9509869912178877E-4,1,104099,104099,1671,1671,1,48,48,1,1]
[null,"FT 15","Flemington","Urban",84,0.12665950202941895,0.94348146915435793,3.4007819999999995,0,0,0,0,0,0,0,0,0,0,0,0]
[null,"FW 04","Footscray West","Urban",1727,5.6884034128189089,1.4585616087913513,7.8875280000000005,2.9386360239396692,5.0357614072294193E-2,6,78202,9042,259,207,3,4467,4467,27,27]
[null,"FW 05","Footscray West","Urban",1672,7.4895460472106929,1.1347138037681579,4.3819600000000003,3.132788508715167,0.39667283271676018,10,180524,142221,3334,3285,3,76193,76193,185,185]
[null,"FW 06","Footscray West","Urban",1041,5.6160334248542778,2.646072362422943,3.9628159999999997,3.5803057568256444,6.2646616742114636E-2,3,135276,135276,2169,2169,5,7890,7890,57,57]
[null,"FW 08","Footscray West","Urban",2888,7.7403085813522345,1.3731210879683493,6.9349280000000002,3.334095646776563,0,7,247830,246232,3560,3559,0,0,0,0,0]
[null,"FW 09","Footscray West","Urban",1377,9.0632247643470762,3.673633705854416,7.6017479999999997,3.9052414827467716,8.2007804740169374E-2,5,98217,98217,2839,2839,2,6875,6875,40,40]
[null,"FW 13","Footscray West","Urban",454,5.1212025821208957,0.64423214387893679,12.021812000000001,11.067749722038153,9.9216189944895273E-3,7,60238,59137,619,618,1,180,180,3,3]
[null,"FW 16","Footscray West","Urban",2617,9.1994552249908459,0.38188505983352661,6.230004000000001,3.2673261878852178,0.55210863376671171,5,298795,75799,708,538,1,168300,168300,340,340]
[null,"FW 17","Footscray West","Urban",2401,8.5953381004333487,0.40048480367660522,6.2681079999999998,12.120489183427818,0.16724935666251764,10,721036,212832,5243,2784,3,33165,33165,138,138]
[null,"HB 14","Heidelberg","Urban",1646,5.3069767408370971,1.8418621540069582,4.7820519999999993,2.7823511516158086,9.4079672746424328E-2,3,161636,161636,1667,1667,4,18218,18218,81,81]
[null,"HB 15","Heidelberg","Urban",2339,8.983851262092589,1.6382648658752441,5.582236,0.38754620722546473,0.5536720134675579,6,28663,28663,274,274,9,136499,136499,417,417]
[null,"HB 22","Heidelberg","Urban",1116,5.2974998884201048,1.0872372455596924,3.6770360000000002,4.0297377946879029,0.21674507039355614,3,188451,188451,2399,2399,4,33787,33787,123,123]
[null,"HB 23","Heidelberg","Urban",1473,5.4960913181304933,0.51187026786804202,3.5341460000000002,1.8837749182642805,8.0611001683991976E-2,1,154584,154584,1607,1607,1,22050,22050,70,70]
[null,"HB 24","Heidelberg","Urban",1017,6.8479844222068786,0.34631613516807558,3.457938,1.5284662470280828,0.19306880366854959,3,78228,78228,1103,1103,7,32938,32938,170,170]
[null,"HB 31","Heidelberg","Urban",743,1.5099516000747681,0.57827486324310307,3.5341460000000002,0.1131333149379518,7.3301621994749849E-2,1,3562,3562,19,19,4,7693,7693,45,45]
[null,"HB 32","Heidelberg","Urban",569,2.1668534207344057,0.57811845016479491,2.7434879999999997,2.9096792587048725E-2,0,0,1000,1000,3,3,0,0,0,0,0]
[null,"KLO13","Kalkallo","Rural short",615,0.31948037719726563,11.661978229522706,0.81923599999999996,0.33096345332902705,0.67409878351445973,1,20404,20404,415,415,2,138528,138528,264,264]
[null,"KLO21","Kalkallo","Urban",4,0,2.8482677307128905,0.95259999999999989,3.4994596439956276E-2,0,1,22,22,3,3,0,0,0,0,0]
[null,"KLO22","Kalkallo","Rural short",2688,12.436715702056885,19.296038431406021,5.9061199999999996,0.27426532734191544,0.48274797454699248,5,19400,19400,2943,2943,6,113823,113823,330,330]
[null,"NH 02","North Heidelberg","Urban",4210,16.321526694297791,4.1682078819274899,8.6686599999999991,1.4329758071940557,0.2763294725207654,11,126300,102959,352,324,7,81184,81184,395,395]
[null,"NH 03","North Heidelberg","Urban",1325,9.1390121531486521,0.81047407913208003,6.4395759999999989,1.6509199601320224,4.9992167094479741E-2,5,55757,55757,1575,1575,3,5628,5628,33,33]
[null,"NH 05","North Heidelberg","Urban",3461,10.739256006240844,0.96759693145751957,5.2774040000000007,2.0764975671164958,0.18438841869999736,3,235793,235793,5924,5924,7,69793,69793,304,304]
[null,"NH 08","North Heidelberg","Urban",2577,11.072045103073119,1.4965894384384155,4.8582599999999996,3.0700170904886606,4.9787145746957077E-2,8,322768,322768,3768,3768,5,17448,17448,77,77]
[null,"NH 09","North Heidelberg","Urban",653,6.1850381386280056,1.1952181482315063,7.1063960000000002,2.2447588915290826,0.61592178484753735,3,35284,35284,710,710,8,32271,32271,100,100]
[null,"NH 12","North Heidelberg","Urban",17,0,4.528731438875198,5.8870680000000002,0,0,0,0,0,0,0,0,0,0,0,0]
[null,"NH 13","North Heidelberg","Urban",1,0,3.7444711475372312,null,0,0,0,0,0,0,0,0,0,0,0,0]
[null,"NH 16","North Heidelberg","Urban",2608,7.5617186384201052,4.4782167725563049,8.3638279999999998,4.174577108139629,0.11016067238416942,6,205317,205317,5457,5457,4,18060,18060,46,46]
[null,"NH 17","North Heidelberg","Urban",2737,8.8901186208724976,2.7079643266201021,6.8015639999999991,3.9377334690073549,1.4027980107571184E-2,2,211624,211624,2847,2847,2,2513,2513,21,21]
[null,"NH 20","North Heidelberg","Urban",2040,7.5773029351045844,2.3115608863830568,6.3062120000000004,2.4832810260840263,0.54106275277637872,3,126528,126528,2116,2116,7,91894,91894,338,338]
[null,"NS 07","North Essendon","Urban",1227,3.7192976932525634,2.0120972700119015,4.1495255999999996,4.702743057008666E-2,2.7721191398944307E-2,0,2051,2051,10,10,1,4030,4030,13,13]
[null,"NS 08","North Essendon","Urban",1244,2.9194810533523561,0.53634730434417721,2.6291759999999997,3.0757862637121574,3.5714033963966822E-2,2,243150,240798,2444,2442,2,9411,9411,29,29]
[null,"NS 09","North Essendon","Urban",1117,3.6146074352264401,1.1475136396884917,4.305752,0.42433841999124222,6.6085680906292382E-2,1,18377,16779,56,55,2,9540,9540,27,27]
[null,"NS 11","North Essendon","Rural short",0,0,4.7224748611450193E-2,null,0,0,0,0,0,0,0,0,0,0,0,0]
[null,"NS 12","North Essendon","Urban",1221,3.7180903024673464,1.1703071858882903,2.7415828290710453,0.1979374186014288,1.1816997360723421E-2,4,18241,16436,232,231,1,3630,3630,22,22]
[null,"NS 14","North Essendon","Urban",1500,5.6036106109619137,1.2529825664758683,4.8677859999999997,4.2177166802617458,0.14843385933939937,4,294596,227497,1709,1657,4,34559,34559,146,146]
[null,"NS 15","North Essendon","Urban",1620,4.263563617706299,1.3296535131931304,4.2219232,0.48974968285212273,3.0257270575200786E-2,3,33384,13938,95,79,1,6875,6875,25,25]
[null,"NS 16","North Essendon","Urban",744,3.1877916030883791,0.42193666315078737,1.8251816000000001,0.26310040640795057,1.7698444175579666E-2,2,23971,17783,53,40,1,5375,5375,43,43]
[null,"NS 17","North Essendon","Urban",816,3.5709000129699708,0.51295391488075259,2.5262951999999999,5.8077040330138299E-3,0,0,394,394,2,2,0,0,0,0,0]
[null,"NS 18","North Essendon","Urban",1697,3.4406732730865475,2.7249245655536649,4.3991068000000002,5.4917214254605842,0.59599471113213631,1,287848,683,1704,8,4,104130,104130,216,216]
[null,"NT 03","Newport","Urban",2706,10.044267063498497,3.2992894382476807,10.4786,3.2942520121986978,6.9102851049259756E-2,6,181000,181000,3344,3344,1,12656,12656,28,28]
[null,"NT 04","Newport","Urban",1541,3.3742850313186645,1.9557845990657807,5.3726639999999994,0.28384302858383814,8.269275930597185E-2,3,11803,11803,72,72,2,11462,11462,69,69]
[null,"NT 08","Newport","Rural short",0,0,6.6913429260253912E-2,null,0,0,0,0,0,0,0,0,0,0,0,0]
[null,"NT 10","Newport","Urban",61,1.8998884706497192,0.83959278917312619,2.1147719999999999,1.980530774268644,0.49304115010123956,2,7386,7386,50,50,3,6129,6129,11,11]
[null,"NT 11","Newport","Urban",2969,8.4377916193008424,2.6645688459873202,8.4781399999999998,0.69200573117104747,0.57639355573817941,6,51382,20696,275,248,9,142659,142659,430,430]
[null,"NT 15","Newport","Urban",2591,9.8063945403099062,3.5570548745393751,7.3159679999999998,3.6540459185881975,0.11259020513968428,2,210246,209532,2698,2697,5,21594,21594,53,53]
[null,"NT 16","Newport","Urban",212,2.9112557086944579,1.6090926752090453,5.6584439999999994,0.6609526430206637,0,2,13470,13470,178,178,0,0,0,0,0]
[null,"NT 17","Newport","Urban",2451,6.8455100116729737,2.6348165984153749,6.7634600000000002,2.5625538555191296,0,5,144379,15481,337,183,0,0,0,0,0]
[null,"P  56","Preston","Urban",1,1.7870934295654297,0.27267893981933594,null,0,0,0,0,0,0,0,0,0,0,0,0]
[null,"P  57","Preston","Rural short",51,0.47453499999999998,0.33884999999999998,0.14517623999999998,2.8958540815000045E-3,0.24762655097626646,0,196,196,1,1,4,55867,55867,211,211]
[null,"P  58","Preston","Rural short",0,6.345070362091064E-2,2.0471271038055419E-2,null,0,0,0,0,0,0,0,0,0,0,0,0]
[null,"P  61","Preston","Urban",79,0.22832541275024415,0.15281892395019531,0.26749007999999996,0,0,0,0,0,0,0,0,0,0,0,0]
[null,"P  62","Preston","Urban",837,1.0357571621856689,0.42919367065429687,2.7914990399999997,1.9476793500207014E-2,0,0,1059,1059,10,10,0,0,0,0,0]
[null,"P  65","Preston","Urban",328,0,0,0.52812144000000005,0,0.25208192875433177,0,0,0,0,0,6,76457,76457,338,338]
[null,"P  66","Preston","Urban",374,1.0659753489494324,0.32860160458087923,2.9332459200000005,1.3141911968138167,6.3635011835787861E-2,1,28190,28190,76,76,1,4550,4550,26,26]
[null,"PV 12","Pascoe Vale","Urban",491,2.6847558002471925,1.6468404455184937,2.3148179999999998,0.12671835018629141,0.22858946586091622,1,3982,3982,73,73,1,23944,23944,82,82]
[null,"PV 13","Pascoe Vale","Urban",3405,10.077105226516723,0.51569934797286987,5.2011959999999995,5.4524429940505863,7.6412649145996617E-2,5,635133,127323,6997,5740,6,29670,29670,125,125]
[null,"PV 14","Pascoe Vale","Urban",2917,9.9598261590600004,1.0277054634094238,5.3345599999999997,0.18455660680019054,0.35980047297822831,4,20214,19741,282,281,5,131360,131360,369,369]
[null,"PV 15","Pascoe Vale","Urban",1902,5.3867712898254396,0.64056757926940922,3.5436719999999999,0.78868375743216323,0.14335899333056706,6,84410,25517,332,263,5,51144,51144,196,196]
[null,"PV 21","Pascoe Vale","Urban",1312,5.5987353572845464,0.18051479506492615,2.4100779999999999,0.12328874991776012,8.3812505086949943E-2,2,11375,11375,71,71,3,25776,25776,120,120]
[null,"PV 22","Pascoe Vale","Urban",2745,9.8290327987670896,1.2944059762954712,5.7632299999999992,3.4010178571258955,0.20684768467755868,6,346227,346227,5736,5736,5,70191,70191,213,213]
[null,"PV 23","Pascoe Vale","Urban",2575,8.2021811904907231,0.18458894062042236,4.9154160000000005,0.35299131214162688,0.22447804153796175,4,36754,36754,268,268,9,77910,77910,447,447]
[null,"PV 24","Pascoe Vale","Urban",1791,6.962140739202499,0.76898619270324708,3.457938,0.94774496098960648,3.9098965491135285E-2,4,96658,96658,341,341,5,13292,13292,129,129]
[null,"PV 31","Pascoe Vale","Urban",2119,5.950471218109131,1.6428727846741675,4.2581219999999993,0.46477824951312402,0.5692986659609296,2,33144,17504,126,114,8,135325,116245,443,390]
[null,"SA 02","St Alban","Rural short",56,12.213329047203064,0,0.85924520000000004,0.4714514522188924,0.2075376544348406,1,7523,7523,27,27,5,11039,11039,41,41]
[null,"SA 06","St Alban","Rural short",148,4.5040877385139462,1.2029450073242187,0.400092,0.14254146654798239,6.6962469893121879E-2,3,12910,12910,307,307,4,20216,20216,160,160]
[null,"SA 10","St Alban","Rural short",195,1.2622317886352539,0.81643055820465082,0.10826060203366809,4.0813236120870497E-2,0,1,17999,17999,195,195,0,0,0,0,0]
[null,"SA 12","St Alban","Urban",1842,1.0848215103149415,6.1878076000213627,3.50042396,0.1707383373844607,7.4184790831924507E-3,3,21998,21998,1927,1927,1,3186,3186,18,18]
[null,"SBY11","Sunbury","Rural short",3332,63.240989403724669,12.667195511102676,7.6893872000000005,7.7493465208367329,0.59507702533596674,11,564948,564948,10197,10197,8,144609,144609,524,524]
[null,"SBY13","Sunbury","Urban",1,0,0.14139208221435551,null,0,0,0,0,0,0,0,0,0,0,0,0]
[null,"SBY14","Sunbury","Rural short",4166,91.056047369003295,23.310018085896971,11.0425392,3.9444560830113846,0.22364913601740208,12,241499,241499,1467,1467,14,45643,45643,402,402]
[null,"SBY31","Sunbury","Urban",1957,5.2234187946319581,8.2908435490131378,6.7710808,0.550180854998645,0.19347032296097619,3,22868,21561,80,79,4,26805,26805,185,185]
[null,"SBY32","Sunbury","Rural short",2963,116.67017622947694,10.416720154047013,5.9442240000000002,1.689501571974801,0.30621374769674092,28,134311,134311,3215,3215,18,81144,81144,326,326]
[null,"SBY33","Sunbury","Urban",3148,14.229066332817077,5.5413106255531313,6.630096,0.10770926280822232,6.053121778639093E-2,3,8847,8847,53,53,4,16573,16573,112,112]
[null,"SHM11","Sydenham","Rural short",1481,65.690837825775134,7.5018142799377436,3.5627240000000002,9.3576393841343267E-2,1.1083834495263609,5,5142,3079,19,16,20,203018,203018,998,998]
[null,"SHM12","Sydenham","Urban",2844,4.7115202064514161,14.04025465054511,7.9637359999999999,0.10702254422013775,0.337845148995505,4,7737,7737,103,103,2,81413,81413,224,224]
[null,"SHM14","Sydenham","Rural short",3687,18.917386820316317,19.131779113936449,9.1449600000000011,0.10866640847747409,0.11249458400231788,4,8002,8002,49,49,5,27613,27613,85,85]
[null,"SHM21","Sydenham","Urban",4639,3.7736968698501583,18.521376121997854,9.240219999999999,0.94050256008193722,0.2204001686231708,6,92508,92508,370,370,2,72262,72262,282,282]
[null,"SHM22","Sydenham","Urban",2304,0,11.384844547548294,5.1440400000000004,0,0,0,0,0,0,0,0,0,0,0,0]
[null,"SHM23","Sydenham","Rural short",0,0,1.9560346603393553E-2,null,0,0,0,0,0,0,0,0,0,0,0,0]
[null,"SHM24","Sydenham","Urban",1,0,0.40330517578125002,null,0,0,0,0,0,0,0,0,0,0,0,0]
[null,"ST 11","Somerton","Urban",1045,12.615904376029969,5.8194291639328002,10.726276,0.93790928250301431,4.3150178103604123E-2,3,10042,10042,53,53,1,1540,1540,22,22]
[null,"ST 12","Somerton","Urban",335,10.658915879487992,2.4413056879043582,7.8303719999999997,5.3976797596680592,0,6,27071,27071,514,514,0,0,0,0,0]
[null,"ST 13","Somerton","Urban",272,5.7171123075485228,10.39773720395565,7.1635519999999993,0.36328281383339672,1.3274510188180412E-2,2,1954,1954,13,13,1,238,238,1,1]
[null,"ST 14","Somerton","Urban",124,0,5.4654856214523315,7.4112280000000013,2.1940577863868183,0,1,3802,3802,12,12,0,0,0,0,0]
[null,"ST 21","Somerton","Urban",4,0,1.4983357496261596,1.1240680000000001,0,0,0,0,0,0,0,0,0,0,0,0]
[null,"ST 22","Somerton","Urban",3484,6.1527060050964355,20.371842213392256,10.611964,0.4320450328385278,1.0885696109247789,2,24108,23566,166,165,19,202473,202473,777,777]
[null,"ST 23","Somerton","Urban",151,7.2230329980850225,3.5350290660858152,10.059456000000001,10.013977494181043,0.27347974658818452,5,20597,11882,241,158,2,1875,1875,2,2]
[null,"ST 24","Somerton","Urban",1,0,3.7649072654247284,null,0,0,0,0,0,0,0,0,0,0,0,0]
[null,"ST 31","Somerton","Urban",1,0,0.61674935913085938,null,0,0,0,0,0,0,0,0,0,0,0,0]
[null,"ST 32","Somerton","Urban",6862,5.4338627672195434,34.941775043010708,12.4257144,3.5479616051638456,0.35618718585395831,13,326733,326733,4372,4372,9,109338,109338,414,414]
[null,"ST 33","Somerton","Urban",3018,9.8343169202804575,6.9294359531402581,8.0589959999999987,0.3690179546614345,0.28310830307886758,4,21182,21182,138,138,6,54169,54169,257,257]
[null,"ST 34","Somerton","Urban",267,5.8918403801918027,3.1854568800926208,7.2664329744262695,0.5449402997099605,0.54752288273438521,2,3566,3566,20,20,5,11943,11943,57,57]
[null,"TH 11","Tottenham","Urban",183,3.1303686904907226,0.84637618780136104,3.6922776000000002,1.4796246438724276,1.6839430696575428E-2,3,10544,10544,328,328,1,400,400,4,4]
[null,"TH 12","Tottenham","Urban",23,3.4374810714721677,0.65322246575355525,2.5415368291495599,0,0,0,0,0,0,0,0,0,0,0,0]
[null,"TH 13","Tottenham","Urban",53,3.2970588038265705,0.52434774398803707,3.0597511709289553,7.8406292646904824E-2,7.9821568687462666E-3,1,277,277,2,2,1,94,94,2,2]
[null,"TH 14","Tottenham","Rural short",0,0.13374198460578918,9.288248109817504E-2,null,0,0,0,0,0,0,0,0,0,0,0,0]
[null,"TH 21","Tottenham","Urban",148,6.3394746665954589,1.1797312827110291,21.174393265136718,9.1410227304420211,0,6,31707,8623,454,302,0,0,0,0,0]
[null,"TH 22","Tottenham","Urban",893,9.2541803765296926,3.2370652318596838,6.1423647999999993,0.70547469403170704,2.4941948089403084E-2,11,22376,12777,956,58,3,2637,2637,15,15]
[null,"TH 23","Tottenham","Rural short",2,0,6.5830013275146482E-2,null,0,0,0,0,0,0,0,0,0,0,0,0]
[null,"TH 24","Tottenham","Rural short",0,0,6.496325302124023E-2,null,0,0,0,0,0,0,0,0,0,0,0,0]
[null,"TMA11","Tullamarine","Urban",747,7.1395139465332029,4.6990019590854644,3.867556,0.10962619202918623,0,2,3519,3519,54,54,0,0,0,0,0]
[null,"TMA14","Tullamarine","Urban",432,3.7141791038513183,6.4125357737541204,7.677956,8.8680998255183496,1.6467468886643098E-2,5,78355,42697,1322,886,2,485,485,3,3]
[null,"TMA21","Tullamarine","Urban",3,7.6198249816894534E-2,0.1895090618133545,3.9437640000000003,0,0,0,0,0,0,0,0,0,0,0,0]
[null,"TMA22","Tullamarine","Urban",1,0,4.9530587253570557,null,0,0,0,0,0,0,0,0,0,0,0,0]
[null,"TMA25","Tullamarine","Urban",362,0,6.449236333847046,6.5157840000000009,0.8055324538839842,2.5207138012696102E-2,1,6615,6615,9,9,2,690,690,6,6]
[null,"TT 03","Thomastown","Urban",2942,13.033325235307217,3.9880905342102051,9.6974679999999989,0.68875484178649471,1.0844575076610521,5,44896,43639,432,431,16,235632,235632,844,844]
[null,"TT 08","Thomastown","Urban",3122,14.920207818031312,1.9656952919960022,7.8875280000000005,0.41569809804098118,0.32873289263676952,5,23156,23156,207,207,13,61039,61039,233,233]
[null,"TT 10","Thomastown","Urban",3983,14.690138383865357,1.5525191621780396,6.6682000000000006,1.032073028247811,0.11470218197992828,5,86212,35089,495,452,6,31938,31938,143,143]
[null,"TT 11","Thomastown","Urban",4194,12.755302594184876,2.0283078956604004,5.353612,4.0599182814516368,3.9275497478816819E-2,14,548710,547547,9706,9705,2,17694,17694,67,67]
[null,"WT 04","Watsonia","Urban",147,3.0194954280853272,1.6638316948413849,2.0957200000000005,0,0,0,0,0,0,0,0,0,0,0,0]
[null,"YVE10","Yarraville","Urban",2,0,0.63370636749267573,null,0,0,0,0,0,0,0,0,0,0,0,0]
[null,"YVE11","Yarraville","Urban",1,5.9393281936645512E-3,0.8453023471832275,null,0,0,0,0,0,0,0,0,0,0,0,0]
[null,"YVE12","Yarraville","Urban",908,7.6893891105651857,1.4145121498107911,3.5817759999999996,1.8549044675103004,0.57185801896545174,3,68498,67209,941,940,3,70392,70392,250,250]
[null,"YVE14","Yarraville","Urban",135,1.6576067867279054,0.85511530256271362,7.030187999999999,0.95026476417187322,0.55386860540303473,1,2380,2380,8,8,2,4624,4624,26,26]
[null,"YVE15","Yarraville","Urban",653,6.2918411970138557,5.2752695384025579,5.6584439999999994,0.41336632713015781,0.23719365335385598,2,8339,8339,96,96,1,15950,15950,58,58]
[null,"YVE21","Yarraville","Urban",672,4.5421578378677374,3.6332483005523684,6.3252639999999998,6.1291849906875653,0.65982638383416359,5,98547,62333,1424,749,10,35363,35363,98,98]
[null,"YVE22","Yarraville","Rural short",2610,7.8361703176498416,13.633358831286431,5.1440400000000004,4.6150967622471484,0.12221316951480266,7,392679,370942,8120,8073,4,34662,34662,111,111]
[null,"YVE23","Yarraville","Rural short",176,2.1356903543472292,5.7894059538841249,1.7146799999999998,0.76800889501278513,0,1,12890,12890,172,172,0,0,0,0,0]
[null,"YVE24","Yarraville","Urban",2873,3.3642501472830775,1.2440945773124694,3.8866079999999998,2.0738536318196976,0.69072023002647887,7,182035,182035,3080,3080,5,202096,202096,527,527]
[null,"YVE25","Yarraville","Urban",2,0.66327225494384767,1.4554809513092042,null,1.8346520482454796,0,1,91,91,2,2,0,0,0,0,0]
[]
[]
[]
[]
[]
[]
[]
[]
[]
[]
[]
[]
[]
[]
[]
[]
[]
[]
[]
[]
[]
[]
[]
[]
[]
[]
[]
[]
[]
[]
[]
[]
[]
[]
[]
[]
[]
[]
[]
[]
[]
[]
[]
[]
[]
[]
[]
[]
[]
[]
[]
[]
[]
[]
[]
[]
[]
[]
[]
[]
[]
[]
[]
[]
[]
[]
[]
[]
[]
[]
[]
[]
[]
[]
[]
[]
[]
[]
[]
[]
[]
[]
[]
[]
[]
[]
[]
[]
[]
[]
[]
[]
[]
[]
[]
[]
[]
[]
[]
[]
[]
[]
[]
[]
[]
[]
[]
[]
[]
[]
[]
[]
[]
[]
[]
[]
[]
[]
[]
[]
[]
[]
[]
[]
[]
[]
[]
[]
[]
[]
[]
[]
[]
[]
[]
[]
[]
[]
[]
[]
[]
[]
[]
[]
[]
[]
[]
[]
[]
[]
[]
[]
[]
[]
[]
[]
[]
[]
[]
[]
[]
[]
[]
[]
[]
[]
[]
[]
[]
[]
[]
[]
[]
[]
[]
[null,null,null,null,null,null,null,null,null,null,null,null,null,null,null,null,null,null,null,null,null,null," "]

{"sheet":"3.6.8 Network-feeders (2017-18)","index":16,"n_rows":421,"n_cols":23,"rows_kept":421,"cut":false,"hidden":false,"merged":[[5,1,5,4],[5,6,5,8],[10,1,12,1],[10,2,12,2],[10,3,12,3],[10,4,12,4],[10,5,10,6],[10,7,12,7],[10,8,10,9],[11,5,12,5],[11,6,12,6],[11,8,12,8],[11,9,12,9],[11,20,12,20],[11,21,11,22],[10,10,10,14],[10,15,10,19],[10,20,10,22],[11,13,11,14],[11,10,12,10],[11,11,11,12],[11,15,12,15],[11,16,11,17],[11,18,11,19]]}
[null,{"$f":"INDEX(dms_Worksheet_List,MATCH(dms_Model,dms_Model_List))","v":"HISTORICAL ANNUAL REPORTING - FINANCIAL YEARS"}]
[null,{"$f":"INDEX(dms_TradingNameFull_List,MATCH(dms_TradingName,dms_TradingName_List))","v":"Jemena Electricity"}]
[null,{"$f":"dms_Header_Span","v":"2011-12 to 2017-18"}]
[null,"3.6 QUALITY OF SERVICES"]
[]
[null,"Did the MAIFI parameter of the STPIS apply during the period?",null,null,null,"No","** IMPORTANT\nPlease ensure this question is answered correctly. Your response will affect other tables throughout this workbook and will determine which cells are grey and which are input cells. "]
[]
[]
[]
[null,"3.6.8 - NETWORK FEEDER RELIABILITY"]
[null,"Feeder ID / name","Description of the service area for the feeder","Feeder classification\n\n(drop down)","Number of distribution customers","Length of high voltage distribution lines",null,"Maximum demand\n(MVA)","Energy not supplied\n(MWh)",null,"Unplanned Outages",null,null,null,null,"Planned Outages",null,null,null,null,"Momentary feeder outages"]
[null,null,null,null,null,"Overhead","Underground",null,"Unplanned","Planned","Total number of unplanned outages","Unplanned customer minutes off-supply (SAIDI)",null,"Unplanned interruptions\n(SAIFI)",null,"Total number of planned outages","Planned customer minutes off-supply (SAIDI)",null,"Planned interruptions\n(SAIFI)",null,"Total number of momentary feeder outages","Momentary interruptions due to feeder outages (MAIFI)"]
[null,null,null,null,null,null,null,null,null,null,null,"Including excluded events and MEDs","After removing excluded events and MED","Including excluded events and MEDs","After removing excluded events and MED",null,"Including MEDs","After removing  MED","Including MEDs","After removing  MED",null,"Including excluded events and MEDs","After removing excluded events and MED"]
[null,"AW 01","Airport West","Urban",844,4.6292835891456603,5.2862787850961688,9.2973759999999999,0.12728490917608384,0.35669541248622749,1,1967,1967,21,21,2,18374,18374,87,87]
[null,"AW 02","Airport West","Urban",2309,10.527414416057589,2.7078487598018643,8.6305560000000003,0.9542897182731146,0,2,39242,39242,123,123,0,0,0,0,0]
[null,"AW 03","Airport West","Urban",100,4.0971222662162781,2.0389260122947692,5.9823279999999999,2.6633560843222868,0,2,6085,6085,105,105,0,0,0,0,0]
[null,"AW 04","Airport West","Urban",1441,8.7898581024551383,4.2876512904930113,5.9442240000000002,4.5111495532610402,1.7650963792439366E-2,5,138394,138394,2913,2913,2,1805,1805,17,17]
[null,"AW 05","Airport West","Urban",486,3.4304459113883974,1.5328938651766775,7.4683840000000004,6.6798419142544221,0.17659975761241919,4,77571,77571,524,524,3,6836,6836,27,27]
[null,"AW 06","Airport West","Urban",5158,17.136911569461823,1.634330822148323,12.707683999999999,2.9663308436937976,0.44755942649106223,11,282505,282505,5919,5919,9,142081,142081,471,471]
[null,"AW 07","Airport West","Urban",4940,15.672113756732941,5.9905347490749357,12.307592000000001,0.98858856231765735,0.1404686264617091,9,93585,93585,603,603,3,44325,44325,141,141]
[null,"AW 08","Airport West","Urban",1519,8.838962058151246,1.7478057413668633,4.8773119999999999,1.2580083148171683,0,3,61825,61825,281,281,0,0,0,0,0]
[null,"AW 09","Airport West","Urban",2445,9.2725548463249208,7.5419640108909611,7.677956,2.4566651566756663,0.48195507168805218,8,135015,135015,2531,2531,5,88292,88292,118,118]
[null,"AW 11","Airport West","Urban",472,5.9950435762939449,3.4416860960626603,7.4683840000000004,2.7430966921966129,1.7748406142597652,4,26299,26299,502,502,3,56720,56720,130,130]
[null,"AW 12","Airport West","Urban",1868,5.818349491708755,6.8919446421012873,8.7639200000000006,0.65568894155873636,1.3525932442956996,3,17907,17907,116,116,1,123132,123132,372,372]
[null,"AW 14","Airport West","Urban",1207,8.9248876578254706,4.3718173411331183,6.3443160000000001,1.9353240020519342,7.0349171829933554E-2,6,60330,60330,632,632,1,7310,7310,43,43]
[null,"BD 01","Broadmeadows","Urban",133,2.1010599983024596,4.4452585418529509,6.4205239999999995,1.8715770766096197E-2,0,0,78,78,1,1,0,0,0,0,0]
[null,"BD 02","Broadmeadows","Urban",1,0.66477979946136467,7.3398016571044916E-2,null,0,0,0,0,0,0,0,0,0,0,0,0]
[null,"BD 03","Broadmeadows","Urban",356,4.0046660187053682,4.3129756751728063,10.54337697442627,3.9993054243592203,0.25165330738349262,1,18179,18179,138,138,6,3813,3813,12,12]
[null,"BD 04","Broadmeadows","Urban",740,3.3960059552383424,5.0866579723618628,7.1826039999999995,0.63138158186664162,0.13210281532366241,3,11855,11855,78,78,4,8268,8268,57,57]
[null,"BD 06","Broadmeadows","Urban",1,0.7488111390304566,7.9720870635986318E-2,null,0,0,0,0,0,0,0,0,0,0,0,0]
[null,"BD 07","Broadmeadows","Urban",3395,17.164579063964844,1.9779347215652465,7.3159679999999998,0.28006360927133589,0.11865155433798237,7,30432,30432,246,246,3,42976,42976,188,188]
[null,"BD 08","Broadmeadows","Urban",831,9.1865518691875465,1.6404615165176391,10.341425948852539,4.8268509985057815,0.41688222651445977,8,71402,71402,484,484,5,20556,20556,112,112]
[null,"BD 09","Broadmeadows","Urban",678,5.0243397960853571,1.4047273089332579,6.3976616581420895,0.49016878202456043,0.61365135598648035,2,8783,8783,86,86,5,36652,36652,104,104]
[null,"BD 10","Broadmeadows","Urban",840,6.380356116123199,2.9179075757570265,9.3507216581420902,3.9488866119309983E-2,0.28123419442738345,0,645,645,5,5,1,15312,15312,87,87]
[null,"BD 11","Broadmeadows","Urban",1508,6.1729703665161129,1.5017957369594575,5.2888353162841799,0.11291576096565444,0.57796087771657845,1,4683,4683,28,28,4,79900,79900,334,334]
[null,"BD 13","Broadmeadows","Urban",475,8.7821081563322458,2.7402448543389895,9.0192169744262696,0.37427380042231678,9.4511680449385446E-2,2,3968,3968,25,25,2,3340,3340,18,18]
[null,"BD 14","Broadmeadows","Urban",1962,10.120560072898865,2.0139248890075683,7.9370633162841795,0.58400940603163709,8.9581209884255539E-2,6,41991,41991,165,165,1,21470,21470,113,113]
[null,"BD 15","Broadmeadows","Urban",821,8.6803416087818146,2.0030394180469511,10.238544683715819,2.1126067713559036,0.80598190669517245,4,21104,21104,199,199,9,26838,26838,69,69]
[null,"BD 16","Broadmeadows","Urban",1444,9.3125515754528649,2.5124629021568299,7.8875280000000005,5.9785036877194253,0.21762125901287332,6,180409,180409,4363,4363,2,21890,21890,65,65]
[null,"BMS11","Broadmeadows South","Urban",1,0,0.98617752363204958,null,0,0,0,0,0,0,0,0,0,0,0,0]
[null,"BMS12","Broadmeadows South","Urban",1434,7.7774091435241699,1.7682133565483094,10.764380000000001,7.6499398267348457,9.6818969087346732E-2,4,301987,301987,5751,5751,2,12740,12740,68,68]
[null,"BMS21","Broadmeadows South","Urban",288,6.0745163923740391,2.5113645378446581,5.7346519999999996,2.7241248797285258,3.1657232347536556E-2,1,20394,20394,522,522,1,790,790,1,1]
[null,"BMS23","Broadmeadows South","Urban",1976,11.230441048400879,1.7832537434387206,8.0971000000000011,0.32631153474622959,6.4663176233112032E-2,4,15958,15958,120,120,3,10541,10541,51,51]
[null,"BMS25","Broadmeadows South","Urban",34,0,1.4751419209594725,2.6291759999999997,0,0,1,0,0,0,0,0,0,0,0,0]
[null,"BY 11","Braybrook","Urban",4257,16.326876498288158,2.4773433518810273,9.9260919999999988,3.0937549772417574,7.6918614655510725E-2,16,234618,234618,1804,1804,5,19444,19444,94,94]
[null,"BY 12","Braybrook","Urban",1248,4.684329468137741,0.6958266907224655,2.9149559999999997,0.43305910010553933,0.31239969573575188,5,28327,28327,203,203,4,68115,68115,189,189]
[null,"BY 13","Braybrook","Urban",455,2.9806081582412718,2.0733380125045775,10.669119999999999,2.3523314605006593,2.091085214383661E-4,4,16874,16874,172,172,1,5,5,1,1]
[null,"BY 14","Braybrook","Urban",2997,12.20455834862709,4.1257629499540336,10.497652,7.071484675211944,0.60588409775514218,14,358950,358950,6685,6685,12,102516,102516,324,324]
[null,"BY 15","Braybrook","Urban",1073,6.1450461523170468,2.2109815441379546,6.9920840000000002,7.3613700563040636,0.10186439167617577,6,137494,137494,1503,1503,2,6342,6342,25,25]
[null,"CN 01","Coburg North","Urban",99,1.8648445936355591,0.31011137319183346,6.9006343418579092,0.41540541091164801,0,1,566,566,7,7,0,0,0,0,0]
[null,"CN 02","Coburg North","Urban",514,4.8526862152118682,0.84083275500106813,5.723220974426269,0.28938024204480955,0,1,4262,4262,30,30,0,0,0,0,0]
[null,"CN 03","Coburg North","Urban",1520,4.7619544202861785,1.3569431627483368,3.4788951709289551,4.6624657276293537E-2,3.8242785461127561E-2,1,5295,5295,58,58,2,14477,14477,88,88]
[null,"CN 04","Coburg North","Urban",1466,6.758646320648193,5.614744782559395,4.5381864872131343,1.2564980823220386,2.2000679916085637E-2,6,62229,62229,1558,1558,3,3632,3632,26,26]
[null,"CN 05","Coburg North","Urban",4183,13.063952902555465,1.5678897632894517,7.3997969744262697,2.8756710667992706,0.18040232278499294,5,264273,264273,2768,2768,4,55263,55263,200,200]
[null,"CN 06","Coburg North","Urban",2157,9.8627146321868899,1.3326491841602324,7.3121576581420893,1.0357773564971871,3.1617049434202703E-2,4,50005,50005,1267,1267,2,5088,5088,30,30]
[null,"CN 07","Coburg North","Urban",4584,13.6659281605587,0.63660511429500577,7.8570449744262696,0.17351089889111762,0.22840893640849688,3,15663,15663,189,189,6,68729,68729,296,296]
[null,"CN 08","Coburg North","Urban",3442,12.62037030128479,3.1586883971252444,6.7863223418579102,1.5190053912587922,0.10527990242353623,5,107844,107844,694,694,5,24915,24915,89,89]
[null,"CN 09","Coburg North","Urban",67,2.4534275440788269,0.52171575443267826,4.3972016581420892,0.52566724520646391,0,1,885,885,3,3,0,0,0,0,0]
[null,"CN 10","Coburg North","Urban",1955,6.2584523039627076,1.0665584589385986,6.6682000000000006,0.74339900571763229,3.6273278895810113E-2,7,29266,29266,194,194,1,4760,4760,28,28]
[null,"CN 11","Coburg North","Urban",4070,11.847755966003419,1.425119040438652,7.3540722907104499,1.9241719381561768,0.41331939113311533,7,197220,197220,4187,4187,10,141212,141212,465,465]
[null,"COO11","Coolaroo","Rural short",3549,133.39432406470536,32.940834344902512,10.0023,17.717201452474168,0.73263876633207659,27,931446,931446,13328,13328,22,128390,128390,373,373]
[null,"COO12","Coolaroo","Urban",1,0.26937187343597413,0.54898742256164557,null,0.74512718141732159,0,1,125,125,1,1,0,0,0,0,0]
[null,"COO13","Coolaroo","Urban",3422,3.8843710004425049,11.429580605707169,6.1728480000000001,0.9678806758272831,7.1763624419762168E-2,6,90714,90714,3617,3617,1,22420,22420,59,59]
[null,"COO14","Coolaroo","Urban",3182,1.4336316990280151,16.470591220689773,6.7063040000000003,0.30440152087857558,3.8948688966401373E-3,4,36928,36928,1251,1251,1,1575,1575,5,5]
[null,"COO21","Coolaroo","Urban",2448,17.072659407963755,13.50577779173565,9.6212599999999995,2.0317767522204555,0.22848201948238672,6,99275,99275,4228,4228,7,37213,37213,146,146]
[null,"COO22","Coolaroo","Urban",3794,0.70948938835144038,20.862976275463105,8.9163359999999994,1.4198312337742598,0.11231038977010489,2,79842,79842,5759,5759,3,21052,21052,79,79]
[null,"CS 02","Coburg South","Urban",5695,14.882299885005951,1.0024582695007322,10.326184000000001,0.55383172221460641,0.15415823846234858,5,63446,63446,434,434,7,58867,58867,198,198]
[null,"CS 03","Coburg South","Urban",4073,11.176393644525527,3.1128351008386614,8.4400359999999992,2.4562386295224594,0.68238160400869929,10,186740,186740,6122,6122,8,172931,172931,387,387]
[null,"CS 05","Coburg South","Urban",4807,12.513830423839568,0.67458241678285602,8.9925440000000005,3.4691957674581144,0.22892520562775245,14,334320,334320,5546,5546,13,73537,73537,389,389]
[null,"CS 08","Coburg South","Urban",3118,9.2024274969978332,2.7246911816120152,9.0687519999999999,0.65278468540840429,6.828337200835255E-2,6,33607,33607,342,342,4,11718,11718,49,49]
[null,"CS 09","Coburg South","Urban",2005,4.0377624102509024,1.8284569043731689,4.3629079999999991,1.7657905803527021,0.15397347855643462,6,142486,142486,1915,1915,4,41415,41415,131,131]
[null,"CS 12","Coburg South","Urban",2093,9.5737870940141683,1.1616353945884703,8.0208919999999999,3.0056826885209968,0.49786994534819085,3,108519,108519,1491,1491,2,59918,59918,127,127]
[null,"CS 13","Coburg South","Urban",1840,5.5872009407510763,2.6317878690156933,2.9721120000000001,1.6996206265192686,2.0079507351215938E-2,6,138470,138470,2790,2790,1,5453,5453,41,41]
[null,"EP 03","East Preston","Urban",258,1.4748778033828733,0.69655463399887085,0.86877120000000008,8.9637340372141952E-2,0.10017469137733304,2,4876,4876,142,142,5,18164,18164,233,233]
[null,"EP 04","East Preston","Urban",7,1.1259562487220764,0.46611568101119993,1.2288539999999999,4.2587517829503714E-2,0.34134297309383355,1,53,53,7,7,1,1416,1416,6,6]
[null,"EP 07","East Preston","Urban",43,1.9198850326156616,0.71198508801650995,1.9147259999999999,8.4812311474534191E-2,3.6156827523354043E-2,1,323,323,43,43,1,459,459,1,1]
[null,"EP 09","East Preston","Urban",235,2.5308644959120752,0.65618830918502802,2.9092403999999998,0.1882741002068144,0.23159661242598487,1,2611,2611,239,239,4,10706,10706,31,31]
[null,"EP 16","East Preston","Urban",56,1.9537843330402374,0.15062269550323487,2.5091483999999995,0.29585815663779741,1.6621244754932434E-4,3,1068,1068,63,63,1,2,2,1,1]
[null,"EP 18","East Preston","Urban",4,0.65554418565750128,0.32446832084274291,0.32007360000000001,6.7791216995568646E-3,0,1,30,30,4,4,0,0,0,0,0]
[null,"EP 20","East Preston","Urban",347,2.2501956519517901,0.49823749388504029,2.4920016,0.13325270120085148,0.13983622845675106,1,3032,3032,349,349,2,10606,10606,49,49]
[null,"EP 27","East Preston","Urban",24,5.2710022430419917E-2,1.4903152669067383,1.6861019999999998,4.8004210776934376E-2,0,1,180,180,24,24,0,0,0,0,0]
[null,"EP 34","East Preston","Urban",1597,5.332847298376084,0.82666373380279534,3.0807083999999998,0.21945545058670532,0,3,24211,24211,1652,1652,0,0,0,0,0]
[null,"EP 35","East Preston","Urban",29,1.8828631088895795,0.39665575040817258,2.6005979999999993,1.0533490971217108,0,3,1375,1375,43,43,0,0,0,0,0]
[null,"EP 36","East Preston","Urban",1002,5.22342257775116,0.49354873313903808,2.4119831999999999,0.21030743008185404,1.4717940066254207E-4,2,15861,15861,1021,1021,1,37,37,1,1]
[null,"EP 37","East Preston","Urban",878,3.6703655933599473,0.31687110828018189,3.1950203999999998,0.19609466658243491,3.9990172354757297E-2,1,8238,8238,881,881,1,5600,5600,35,35]
[null,"EP 41","East Preston","Urban",51,1.4046021317520143,0.53553855059814448,2.4519924,0.11482571774035527,3.7325853416903997E-2,1,383,383,51,51,1,415,415,1,1]
[null,"EP 42","East Preston","Urban",320,2.6509775050017836,0.53996009165954595,2.8235063999999999,0.19279512059553106,7.6924195740355847E-2,2,3282,3282,292,292,2,4365,4365,12,12]
[null,"EPN31","East Preston North","Urban",96,0.44449182201385495,0.99080347862243645,6.230004000000001,0.31716871409539332,0,1,962,962,86,86,0,0,0,0,0]
[null,"EPN33","East Preston North","Urban",3015,10.489788848106386,1.8178855212783813,6.8968240000000005,0.8998736810476291,0.72278627633321346,5,66353,66353,3280,3280,12,177651,177651,559,559]
[null,"EPN34","East Preston North","Urban",118,2.4916178315925599,0.63826572586250307,1.7527839999999999,0.64121716575320409,1.818482587609528E-3,2,6347,6347,236,236,1,60,60,4,4]
[null,"EPN35","East Preston North","Urban",2151,9.4453302049198147,2.8150567775011059,8.4400359999999992,0.77973087422630594,1.0396909449583034,4,37593,37593,2806,2806,13,167088,167088,561,561]
[null,"ES 11","Essendon","Urban",1175,4.2609131475448612,0.64206937423133847,4.7344219999999995,1.4338037429518264E-2,0.32991595326851902,0,752,752,5,5,4,57678,57678,148,148]
[null,"ES 12","Essendon","Urban",1050,3.9187355182266237,0.39025148752975458,3.14358,7.0909680092522576E-2,0.12331610806950019,1,5164,5164,45,45,4,29935,29935,126,126]
[null,"ES 13","Essendon","Urban",1856,5.5620254430198672,0.60313009784650795,4.9058900000000003,0.29994280379274968,1.9151766213483658E-2,5,23633,23633,187,187,2,5030,5030,18,18]
[null,"ES 15","Essendon","Urban",1950,5.6272477693557743,2.250326901187897,4.7058439999999999,0.43267728859663529,0.409200541909223,3,32177,32177,122,122,7,101437,101437,264,264]
[null,"ES 16","Essendon","Urban",1417,3.7485819987487794,0.43394602848339081,3.14358,0.44459879446608574,0.11177064665348524,2,34905,34905,209,209,2,29250,29250,87,87]
[null,"ES 21","Essendon","Urban",1584,3.4034756956481935,0.56892017575263976,4.8963640000000002,0.3159224735816864,0.5478451178397914,3,22502,22502,1677,1677,5,130070,130070,443,443]
[null,"ES 22","Essendon","Urban",2459,6.318672726821899,4.3858481386995312,6.630096,0.16810673693870579,0.2566623818404965,2,15458,15458,69,69,5,78670,78670,301,301]
[null,"ES 23","Essendon","Urban",492,1.1035496056365965,0.43026175451755522,1.3907959999999999,6.9346035726276761E-2,0,1,4816,4816,496,496,0,0,0,0,0]
[null,"ES 24","Essendon","Urban",1971,4.3875713804245002,0.98821190013408655,5.00115,0.48203360429892139,0.30442458594710797,4,29256,29256,1998,1998,3,61588,61588,187,187]
[null,"ES 25","Essendon","Urban",1125,3.807937265033722,2.0272247403965,4.5629540000000004,0.95160502062120711,0.10045804963495461,2,49686,49686,1240,1240,1,17484,17484,94,94]
[null,"ES 26","Essendon","Urban",1259,2.669471271133423,1.929945319943428,4.772526,0.49782861228204683,0.16432653166175537,5,25995,25995,1497,1497,3,28602,28602,112,112]
[null,"FE 02","Footscray East","Urban",81,0.96567935628890988,2.0794185632915498,7.1254480000000004,0,0.19039801656929747,0,0,0,0,0,1,2310,2310,7,7]
[null,"FE 05","Footscray East","Urban",3341,8.3137611403808584,0.9037220049486161,6.8396679999999996,6.4161366811981111,0.34902453043482745,11,555148,555148,5500,5500,13,100663,100663,400,400]
[null,"FE 06","Footscray East","Urban",4001,8.8221643821525575,7.2495527660083772,10.592912,1.5586773643402654,1.2549649296440875,2,79206,79206,324,324,6,212575,212575,449,449]
[null,"FE 08","Footscray East","Urban",2315,3.7853321011295318,5.6221708607311243,8.211412000000001,4.5780545102675037,0.86277857811841108,12,171624,171624,692,692,11,107814,107814,373,373]
[null,"FE 09","Footscray East","Urban",4266,7.4302356134757996,1.1660264909963609,6.7253559999999997,0.50501777016833393,0.7144210863892182,6,48370,48370,316,316,19,228088,228088,806,806]
[null,"FF 87","Fairfield","Urban",1029,2.5368910197067263,0.45780032246398927,5.8261016581420888,0.44520675235944218,0.81895612232768145,1,10877,10877,59,59,3,66694,66694,258,258]
[null,"FF 88","Fairfield","Urban",1268,3.9514973657417301,0.48538132718276977,8.1923600000000008,1.8584769061371409,1.5228586494827052,2,50051,50051,644,644,6,136708,136708,711,711]
[null,"FF 89","Fairfield","Urban",372,3.9204651332874301,0.83645530480194097,2.2770950923278805,3.0186378990325446E-2,3.8107109632285079E-2,0,827,827,5,5,1,3480,3480,10,10]
[null,"FF 90","Fairfield","Urban",1008,3.2818500719413759,0.39379624421501158,2.4862859999999998,0.10708006043420318,0,1,7522,7522,96,96,0,0,0,0,0]
[null,"FF 95","Fairfield","Urban",1402,5.3439323812484734,0.47478396543216705,2.6120291999999998,4.1516253353687867E-2,0.41163066692539274,1,4381,4381,13,13,5,144791,144791,293,293]
[null,"FF 96","Fairfield","Urban",1293,4.5373306605911257,0.33934620829868317,2.9915450051147459,0.24884144019294538,3.3453364491679551E-2,2,21454,21454,123,123,1,9614,9614,23,23]
[null,"FT 01","Flemington","Urban",2461,4.3532067671966548,2.3199830008792874,4.7629999999999999,1.5232305492748976,0.1094354103385282,2,134708,134708,2758,2758,2,32260,32260,130,130]
[null,"FT 02","Flemington","Urban",1041,2.1963378191566467,6.5087307252898814,3.867556,1.7301785055252854,0.2945394921105205,2,79416,79416,916,916,3,45065,45065,120,120]
[null,"FT 04","Flemington","Urban",2067,3.5869594192314147,3.0232043984651567,7.3635979999999996,0.40082896667219237,4.2769354154405338E-2,4,15174,15174,102,102,5,5397,5397,78,78]
[null,"FT 05","Flemington","Urban",2436,4.676737552986145,2.3286445988655089,5.1345140000000002,2.3290754589382123,1.5221012762139344E-3,4,187752,187752,2676,2676,2,409,409,2,2]
[null,"FT 06","Flemington","Urban",247,0.73451401786804205,1.8582194015359881,1.9623559999999998,4.0329592222867167E-2,0.15627113249950508,0,835,835,3,3,1,10785,10785,15,15]
[null,"FT 09","Flemington","Urban",1802,3.1278173332977293,3.0432620491456426,4.7629999999999999,1.3993145852992774,0,5,92902,92902,2006,2006,0,0,0,0,0]
[null,"FT 10","Flemington","Urban",1008,1.9729252366065979,0.66006625243186945,5.3440859999999999,1.4269280292401043E-2,0,0,823,823,4,4,0,0,0,0,0]
[null,"FT 13","Flemington","Urban",750,2.3585156839370729,4.392568364500999,4.2200179999999996,0.83239648968539692,0,4,28576,28576,115,115,0,0,0,0,0]
[null,"FT 14","Flemington","Urban",1681,1.8829239863967895,1.7017871741819381,4.0199720000000001,4.2835029658285073,0.11625028715905231,4,229352,229352,1973,1973,1,20748,20748,76,76]
[null,"FT 15","Flemington","Urban",462,0.54221475101470951,2.2560857345771788,3.8770819999999997,3.3893847922499658,0,3,74642,74642,945,945,0,0,0,0,0]
[null,"FW 04","Footscray West","Urban",1829,5.6884326355171204,1.4585858043956756,7.8684760000000002,1.2788575899870185,0.54884607616547654,4,38726,38726,208,208,3,55400,55400,220,220]
[null,"FW 05","Footscray West","Urban",1679,7.4896035007171626,1.1347089018840788,4.6677400000000002,1.7451598994125936,0.46508965340694786,4,92443,92443,1793,1793,6,82121,82121,444,444]
[null,"FW 06","Footscray West","Urban",1059,5.6160559307498934,2.6460476812114715,3.867556,0.59927805121282307,0,2,24204,24204,99,99,0,0,0,0,0]
[null,"FW 08","Footscray West","Urban",2921,7.6996554093170166,1.3382354772100449,7.1444999999999999,7.399870115420403,0.17964353487117041,5,462594,462594,8259,8259,5,37434,37434,178,178]
[null,"FW 09","Footscray West","Urban",683,4.5316008579730989,1.8667465960979461,3.7913480000000002,1.8477877956531918,0.20872127482513864,3,48127,48127,1392,1392,3,18121,18121,139,139]
[null,"FW 13","Footscray West","Urban",462,5.1211832910604471,0.66427907193946845,10.745327999999999,6.6183240067202567,2.5764014144482648,3,37660,37660,560,560,6,48868,48868,134,134]
[null,"FW 16","Footscray West","Urban",2659,9.203500370674135,0.38188352991676333,6.6682000000000006,2.5477253480370905,7.2758987067142705E-2,9,230454,230454,3631,3631,4,21938,21938,109,109]
[null,"FW 17","Footscray West","Urban",2455,8.5948450959472655,0.4004889018383026,6.2871600000000001,3.9724766477760451,0.56439057050531294,12,211937,211937,3386,3386,10,100370,100370,355,355]
[null,"HB 14","Heidelberg","Urban",1590,5.3048265585899355,1.6632807580566404,4.7248959999999993,4.7513180593560893,0.27414109800032949,3,286539,286539,3173,3173,4,55109,55109,154,154]
[null,"HB 15","Heidelberg","Urban",2416,8.8988872413063049,1.8369467518844604,5.7251260000000004,6.1191830152259756,0.15367422499647623,10,452123,452123,5034,5034,4,37848,37848,129,129]
[null,"HB 22","Heidelberg","Urban",1109,5.2994885223007202,1.0872390462112427,3.781822,1.5262657179860852,2.9800902401127404E-3,4,67758,67758,1594,1594,1,441,441,9,9]
[null,"HB 23","Heidelberg","Urban",1461,5.5192356590652469,0.51186013393402097,3.6960879999999996,1.2773412709140841,7.9217783637472255E-2,4,103543,103543,1585,1585,2,21405,21405,89,89]
[null,"HB 24","Heidelberg","Urban",1002,6.8489232236194617,0.34633806841850279,3.66751,1.3619148286639036,0,3,67431,67431,1095,1095,0,0,0,0,0]
[null,"HB 31","Heidelberg","Urban",760,1.5101013322639467,0.60276463533401492,3.5531980000000001,0.78268964788790707,0.51068964519218163,2,26387,26387,114,114,4,57390,57390,178,178]
[null,"HB 32","Heidelberg","Urban",2021,2.1668957103672026,0.57810422508239745,2.591072,1.5633455639515941,0,1,200757,200757,2027,2027,0,0,0,0,0]
[null,"KLO13","Kalkallo","Rural short",1263,0.24485518859863281,16.782341291885377,1.543212,0.85199987931165144,0.1054872858313896,3,74162,74162,1232,1232,9,30607,30607,73,73]
[null,"KLO21","Kalkallo","Urban",4,0,2.8482438653564452,1.0097559999999999,0.36162174016519644,0,1,204,204,4,4,0,0,0,0,0]
[null,"KLO22","Kalkallo","Rural short",3150,12.436770517044067,20.254303082054136,5.9061199999999996,5.4669981008905637,3.9690757736208289E-2,13,448839,448839,14840,14840,2,10862,10862,24,24]
[null,"NH 02","North Heidelberg","Urban",4174,16.331751570194246,4.186292574737549,8.8877579999999998,1.1289344439011335,0.87853125091580109,9,98299,98299,1598,1598,19,254986,254986,1059,1059]
[null,"NH 03","North Heidelberg","Urban",1330,9.1190196275691981,0.83120503956603997,6.1156920000000001,8.347243720440202E-2,0.47846607962019111,1,2904,2904,16,16,7,55486,55486,223,223]
[null,"NH 05","North Heidelberg","Urban",3422,10.739409086647033,0.96754996572875984,5.2240583999999997,1.456622372581071,2.5638327259802151E-2,4,163608,163608,3497,3497,1,9599,9599,29,29]
[null,"NH 08","North Heidelberg","Urban",2548,11.071127138328553,1.4965282192192078,5.1821440000000001,3.4261599783711207,0.1119741832029158,4,355185,355185,4024,4024,8,38694,38694,183,183]
[null,"NH 09","North Heidelberg","Urban",655,6.1978174025192256,1.6374554359436035,6.8206160000000002,3.0602870809117224,0.33768877915306283,4,49239,49239,1310,1310,7,18111,18111,92,92]
[null,"NH 12","North Heidelberg","Urban",16,0,4.528793219437599,5.7727560000000002,0,0,0,0,0,0,0,0,0,0,0,0]
[null,"NH 13","North Heidelberg","Urban",1,0,3.7418786475372317,null,0,0,0,0,0,0,0,0,0,0,0,0]
[null,"NH 16","North Heidelberg","Urban",2573,7.5740113974952692,4.5454613862781521,7.8303719999999997,2.4099723051471837,0.16105466601471338,8,122813,122813,3059,3059,2,27358,27358,69,69]
[null,"NH 17","North Heidelberg","Urban",2760,8.829503357944489,2.9436709713697429,6.8015639999999991,10.047903994039098,0.81004407916897614,8,551265,551265,11137,11137,12,148140,148140,496,496]
[null,"NH 20","North Heidelberg","Urban",2030,7.5257721398545385,2.4804583847198489,4.6296359999999996,1.900129242658146,0.39046977913795106,2,127792,127792,4056,4056,9,87536,87536,316,316]
[null,"NS 07","North Essendon","Urban",1366,3.7287525968551636,2.0023403973579406,4.2466908290710448,1.7347927591774694,0.9755675656647026,2,81395,81395,1538,1538,6,152576,152576,372,372]
[null,"NS 08","North Essendon","Urban",1272,2.9194836165809632,0.57841015217208858,4.0980853162841795,0.25357505736243563,0,2,17042,17042,1283,1283,0,0,0,0,0]
[null,"NS 09","North Essendon","Urban",1120,3.6148266663169863,1.1474898198442458,4.7668103418579104,0.44708520488546705,0,2,18329,18329,88,88,0,0,0,0,0]
[null,"NS 11","North Essendon","Rural short",0,0,4.7224748611450193E-2,null,0,0,0,0,0,0,0,0,0,0,0,0]
[null,"NS 12","North Essendon","Urban",1183,3.7180735835456851,1.1703050929441452,2.705384,1.1035985803217847,0.80729504522631979,9,100887,100887,469,469,6,246000,246000,1011,1011]
[null,"NS 14","North Essendon","Urban",1498,5.6168614172363283,1.2380758242835999,4.9306576581420893,0.1850896018692563,0.13140494286016879,4,12589,12589,157,157,3,29792,29792,114,114]
[null,"NS 15","North Essendon","Urban",1617,4.2637524052047731,1.3296532565965653,4.3590976581420895,4.4393693040422934E-2,2.908475685180862E-2,1,2997,2997,22,22,2,6545,6545,23,23]
[null,"NS 16","North Essendon","Urban",750,3.1933508015441894,0.4219353315753937,1.9261572436065673,7.1444232749101472E-3,0.27520653349794899,0,640,640,3,3,6,82177,82177,299,299]
[null,"NS 17","North Essendon","Urban",855,3.5672900064849853,0.52664145744037627,2.7149099999999997,1.237425545846735E-2,7.2510824041673153E-2,0,856,856,6,6,5,16720,16720,74,74]
[null,"NS 18","North Essendon","Urban",1715,3.4342660160064695,2.8009581530094145,4.5553331709289546,4.067441087044877E-2,0.40710366150776239,2,2172,2172,10,10,3,72464,72464,319,319]
[null,"NT 03","Newport","Urban",2744,9.870129499107648,3.2992882191238402,9.1830639999999999,9.8129172248576833,0.15324907823505743,11,638916,638916,7607,7607,3,33260,33260,125,125]
[null,"NT 04","Newport","Urban",1551,3.3743025156593323,1.9558522995328904,4.8011040000000005,2.1214923464569706,5.6045005032786123E-2,5,97480,97480,945,945,1,8584,8584,29,29]
[null,"NT 08","Newport","Rural short",0,0,6.6913714630126964E-2,null,0,0,0,0,0,0,0,0,0,0,0,0]
[null,"NT 10","Newport","Urban",58,1.8998942353248598,0.83959439458656315,2.4196039999999996,4.7069928244428211E-2,0.10738511536693969,1,172,172,3,3,1,1308,1308,3,3]
[null,"NT 11","Newport","Urban",3000,8.6340573383483896,2.680235634223938,8.5162439999999986,0.19455893141758934,0.30682191363918881,4,14756,14756,72,72,8,77568,77568,309,309]
[null,"NT 15","Newport","Urban",2613,9.9148019752693166,3.5897723824691772,7.3159679999999998,3.0275095115728994,0.13282057679192966,7,172343,172343,3150,3150,3,25203,25203,100,100]
[null,"NT 16","Newport","Urban",216,2.9112278543472287,1.5878678376045228,5.582236,1.6024811524952942E-2,0,1,339,339,3,3,0,0,0,0,0]
[null,"NT 17","Newport","Urban",2464,6.8504025838615412,2.6414692836589815,7.9637359999999999,15.872430787991386,0.2010472518825886,12,762645,762645,9370,9370,2,32200,32200,141,141]
[null,"P  56","Preston","Urban",1,0.89354671478271486,0.13633946990966797,null,0,0,0,0,0,0,0,0,0,0,0,0]
[null,"P  61","Preston","Urban",80,0.11416270637512207,7.6409461975097653E-2,0.1257432,2.0214191814080002E-3,0.27391365536832002,0,356,356,1,1,1,160800,160800,80,80]
[null,"P  62","Preston","Urban",506,0.12489600000000001,2.4149999999999998E-2,1.3260192,2.3781037281280001E-3,0.92005803809771514,0,157,157,2,2,21,202471,202471,2200,2200]
[null,"PV 12","Pascoe Vale","Urban",528,2.7537343445968627,1.6468402227592467,2.1052460000000002,0.17419008315959048,0.21718204185893983,1,6114,6114,52,52,1,25410,25410,154,154]
[null,"PV 13","Pascoe Vale","Urban",3480,10.149017303199768,0.51569317398643499,5.6679699999999995,1.1392352724899075,0.27813963389560181,6,136110,136110,595,595,7,110769,110769,368,368]
[null,"PV 14","Pascoe Vale","Urban",2981,9.9572355640041827,1.028039199142456,5.2678779999999996,4.9683161327826868,0.13808035142069633,12,566922,566922,10087,10087,2,52520,52520,152,152]
[null,"PV 15","Pascoe Vale","Urban",1956,5.3864818886566166,0.64055878963470458,3.4293599999999995,0.1371536960648691,0.28764758520359857,2,15683,15683,155,155,3,109638,109638,335,335]
[null,"PV 21","Pascoe Vale","Urban",1344,5.6012973118209839,0.18051289753246308,2.5053380000000001,0.41712990033623465,7.0883789261201854E-2,2,39953,39953,132,132,1,22631,22631,53,53]
[null,"PV 22","Pascoe Vale","Urban",2782,9.8125336162948606,1.3350581358222962,5.4965020000000004,0.80629973757644458,0.32065600236791275,4,83706,83706,5308,5308,8,110963,110963,376,376]
[null,"PV 23","Pascoe Vale","Urban",2623,8.1551311816101073,0.18458547031021116,4.9916239999999998,0.63976393556072964,0.135946318027203,9,68190,68190,869,869,4,48300,48300,194,194]
[null,"PV 24","Pascoe Vale","Urban",1795,6.9520955246305469,0.77245809635162344,3.6008279999999999,1.0028626624660704,2.6506577844983624E-3,5,98748,98748,1944,1944,1,870,870,29,29]
[null,"PV 31","Pascoe Vale","Urban",2230,5.9502229148864743,1.648442453776598,4.1342840000000001,0.51311362745784683,0.16921995254754008,6,40221,40221,332,332,3,44215,44215,175,175]
[null,"SA 02","St Alban","Rural short",56,12.213339759868621,0,0.66681999999999997,0.15459047616330593,0.10532936817521098,2,3109,3109,14,14,1,7061,7061,23,23]
[null,"SA 06","St Alban","Rural short",151,4.5040868692569731,1.2029430036621094,0.43819599999999997,3.8171870167257259E-3,3.1409996023343116E-3,1,315,315,4,4,1,864,864,3,3]
[null,"SA 10","St Alban","Rural short",43,1.262260894317627,0.81642277910232541,0.10181437157208015,5.189895638132816E-2,0,2,5249,5249,86,86,0,0,0,0,0]
[null,"SA 12","St Alban","Urban",1839,1.0848307551574707,6.1878268000106811,3.3626779999999998,8.3152029917205536E-3,0,0,1089,1089,1,1,0,0,0,0,0]
[null,"SBY11","Sunbury","Rural short",3457,62.966149101123811,12.782748660936356,7.6627143418579111,1.3052586671314195,1.1422391854399001,22,106048,106048,655,655,9,309344,309344,672,672]
[null,"SBY13","Sunbury","Urban",1,0,0.13676104110717774,null,0,0,0,0,0,0,0,0,0,0,0,0]
[null,"SBY14","Sunbury","Rural short",4218,90.005816487712863,23.383960255230662,10.91298594885254,0.62443200236736074,0.58975156199244094,14,42064,42064,124,124,13,132426,132426,652,652]
[null,"SBY31","Sunbury","Urban",2029,5.0304046986770636,8.818811045365333,6.6758209744262693,0.44469870892989416,2.9226707264125754E-2,5,20194,20194,122,122,1,4424,4424,28,28]
[null,"SBY32","Sunbury","Rural short",3020,116.66537839904785,11.069112702603341,5.7384623418579102,1.1556754879058466,0.627683786238875,26,104652,104652,788,788,21,189466,189466,1146,1146]
[null,"SBY33","Sunbury","Rural short",3231,14.229028273220063,5.5145403127765658,5.5441319999999994,1.6195644965058811,0.11711103310784257,9,145996,145996,3371,3371,4,35190,35190,172,172]
[null,"SHM11","Sydenham","Rural short",1811,65.585894600219717,9.6794935792045589,3.5627240000000002,0.49983034658187175,1.7357226128066234,11,29876,29876,192,192,28,345827,345827,943,943]
[null,"SHM12","Sydenham","Urban",2848,4.7114751032257081,14.04034282527256,8.0589959999999987,2.4450126611822685E-2,1.2668459384364086E-4,2,1737,1737,42,42,1,30,30,2,2]
[null,"SHM14","Sydenham","Rural short",3182,18.964997601747513,15.741311319987297,8.211412000000001,0.16350013046827941,0.47612696284565825,7,12019,12019,75,75,12,116668,116668,270,270]
[null,"SHM21","Sydenham","Urban",4277,3.6763758201217653,16.735359541217804,8.7829719999999991,2.3179790628817325,0.12506939171326401,5,225316,225316,8185,8185,4,40524,40524,132,132]
[null,"SHM22","Sydenham","Urban",2309,0,11.769802273774147,5.5060280000000006,8.7692445227069732E-2,3.7304459988306934E-2,1,7854,7854,77,77,1,11137,11137,37,37]
[null,"SHM23","Sydenham","Rural short",0,0,1.2915173301696777E-2,null,0,0,0,0,0,0,0,0,0,0,0,0]
[null,"SHM24","Sydenham","Urban",1,0,0.40330258789062501,null,0,0,0,0,0,0,0,0,0,0,0,0]
[null,"ST 11","Somerton","Urban",1909,12.674012455478668,5.9395650819663999,13.24114,1.7681843336404719,0.1881765618961127,4,29376,29376,216,216,4,10421,10421,37,37]
[null,"ST 12","Somerton","Urban",433,11.777713273496628,2.3594035893573762,8.0589959999999987,7.3641046960989378,0.61223119518010827,2,45467,45467,463,463,1,12600,12600,30,30]
[null,"ST 13","Somerton","Urban",365,5.7148211537742615,10.786282945931912,8.0208919999999999,2.4150581624229632,1.2824883118525164E-2,4,16383,16383,382,382,2,290,290,2,2]
[null,"ST 14","Somerton","Urban",134,0,5.467901815891266,7.7732159999999997,0,0.8503196894247862,0,0,0,0,0,1,5190,5190,15,15]
[null,"ST 21","Somerton","Urban",3,0,1.4983123748130798,1.3336399999999999,0,0,0,0,0,0,0,0,0,0,0,0]
[null,"ST 22","Somerton","Urban",4549,6.1638080025482171,23.889131563467025,13.126828,1.4182837664485248,3.7706941681545326E-3,2,84630,84630,5368,5368,1,750,750,2,2]
[null,"ST 23","Somerton","Urban",150,7.2333941139602658,3.5656610330429075,9.9070399999999985,5.0420503199791487,1.3006988056559554,3,10878,10878,308,308,2,9354,9354,23,23]
[null,"ST 24","Somerton","Urban",1,0,3.7649121327123645,null,0,0,0,0,0,0,0,0,0,0,0,0]
[null,"ST 31","Somerton","Urban",1,0,0.61674867956542978,null,0,0,0,0,0,0,0,0,0,0,0,0]
[null,"ST 32","Somerton","Rural short",6299,5.4338913836097715,35.49137635089302,11.122557948852538,5.7015378909442713,2.5372362416865621E-2,7,553337,553337,7069,7069,1,8208,8208,18,18]
[null,"ST 33","Somerton","Urban",2803,9.7319283165550239,6.947430721317291,6.9730319999999999,1.7151382890208005,3.1814269717764757E-2,5,105369,105369,1578,1578,3,6515,6515,29,29]
[null,"ST 34","Somerton","Urban",201,5.6993626250959011,3.1742963300463103,6.6834416581420903,3.1352385130624465,1.3421730822763918E-2,4,16118,16118,237,237,1,230,230,1,1]
[null,"TH 11","Tottenham","Urban",998,6.2624141786956784,1.4252540162715912,4.3324249744262691,5.9535660710469092,0,9,171487,171487,3423,3423,0,0,0,0,0]
[null,"TH 12","Tottenham","Urban",271,4.8349804872131346,1.9646068572006223,4.8125353162841797,0.39458785290977694,2.2967758610493261E-2,4,4484,4484,54,54,1,870,870,3,3]
[null,"TH 13","Tottenham","Urban",56,3.2780944019132852,0.52434937199401854,3.2693231709289554,0.68658857208829027,6.9746995262776446E-2,5,2587,2587,16,16,1,876,876,4,4]
[null,"TH 14","Tottenham","Urban",2,0.2649569846057892,0.11275225877761841,null,0,0.37648193292850202,0,0,0,0,0,1,786,786,2,2]
[null,"TH 21","Tottenham","Urban",155,7.160474376859665,1.54503527627182,14.66622965814209,0.31739825776967767,0.13537021486255546,3,1117,1117,12,12,1,1588,1588,4,4]
[null,"TH 22","Tottenham","Urban",884,7.8622500292015074,3.1252075045979022,5.3917160000000006,1.2682294913753067,1.2946061452349474E-2,6,41879,41879,931,931,4,1425,1425,26,26]
[null,"TH 23","Tottenham","Rural short",1,0,6.579960479736327E-2,null,0,0,0,0,0,0,0,0,0,0,0,0]
[null,"TH 24","Tottenham","Rural short",0,0,6.4890289611816407E-2,null,0,0,0,0,0,0,0,0,0,0,0,0]
[null,"TMA11","Tullamarine","Urban",755,7.2730299766540529,5.2208227621583934,3.8294520000000003,0.10258279017491746,0.33251112002522165,1,3317,3317,10,10,5,35839,35839,88,88]
[null,"TMA14","Tullamarine","Urban",434,3.7141095519256591,6.4096465076599127,7.030187999999999,0.40325004299056044,0,5,3936,3936,14,14,0,0,0,0,0]
[null,"TMA21","Tullamarine","Urban",3,7.6199124908447269E-2,0.18950603090667723,3.4484120000000003,0,0,0,0,0,0,0,0,0,0,0,0]
[null,"TMA22","Tullamarine","Urban",1,0,4.9528743626785277,null,0,0,0,0,0,0,0,0,0,0,0,0]
[null,"TMA25","Tullamarine","Urban",393,0,6.4691036669235231,6.858719999999999,0.51510726996998657,0,5,4327,4327,19,19,0,0,0,0,0]
[null,"TT 03","Thomastown","Urban",2830,13.030774902565717,3.9879567671051026,9.5450520000000001,8.1372351865882582,0.31887999277210077,9,414137,414137,6042,6042,7,54097,54097,293,293]
[null,"TT 08","Thomastown","Urban",3100,14.93380220041275,1.965742645998001,7.5826960000000003,1.9024469244125446,1.0420609714638009,13,110355,110355,3587,3587,23,201489,201489,959,959]
[null,"TT 10","Thomastown","Urban",3971,14.697546599769591,1.5525095810890197,7.0492400000000011,2.1107495253122788,0.14159708570661411,13,163819,163819,4498,4498,7,36632,36632,210,210]
[null,"TT 11","Thomastown","Urban",4387,12.755103303718567,2.0283074478302003,5.8489640000000005,0.73497466038044801,8.7323439387770208E-2,8,100412,100412,568,568,7,39767,39767,185,185]
[null,"WT 04","Watsonia","Urban",147,3.0193287140426635,1.6638213474206924,2.152876,1.0725094134736419,1.3018117282957034,3,9761,9761,69,69,4,39493,39493,113,113]
[null,"YVE10","Yarraville","Urban",1,0,0.63372718374633785,null,0,0,0,0,0,0,0,0,0,0,0,0]
[null,"YVE11","Yarraville","Urban",1,5.9396640968322756E-3,0.84529117359161376,null,0,0,0,0,0,0,0,0,0,0,0,0]
[null,"YVE12","Yarraville","Urban",937,7.7089042606964115,1.4095111041259765,2.9721120000000001,2.3573066762656452,2.7358471665772256E-3,1,101070,101070,941,941,1,391,391,1,1]
[null,"YVE14","Yarraville","Urban",130,1.6532183251762391,0.88702652963066098,5.8680160000000008,0,6.4262484756048607E-2,0,0,0,0,0,1,644,644,1,1]
[null,"YVE15","Yarraville","Urban",662,6.2958120577621468,5.3258310216197966,5.7346519999999996,2.1472881648138493,7.7042706002893417E-3,4,43563,43563,557,557,2,521,521,2,2]
[null,"YVE21","Yarraville","Urban",648,4.3977799785423279,3.660404111951828,7.506488,3.5948608436764311,0.53647228017392179,5,53789,53789,765,765,5,26757,26757,48,48]
[null,"YVE22","Yarraville","Rural short",2707,7.8264339361763007,13.451350063539982,4.1914400000000009,2.0094141973247002,1.1944636083579978,6,184864,184864,3355,3355,6,366298,366298,783,783]
[null,"YVE23","Yarraville","Rural short",173,2.1357351771736148,5.7894814769420622,1.6194200000000001,0,0.26007590146049309,0,0,0,0,0,1,14280,14280,34,34]
[null,"YVE24","Yarraville","Urban",816,3.3808606632792948,1.1052087886562347,4.420064,6.4723918697282432E-2,4.1488989744219947E-2,0,1419,1419,10,10,3,3032,3032,19,19]
[null,"YVE25","Yarraville","Urban",2,0.66628612747192384,1.4520854756546022,null,0,0,0,0,0,0,0,0,0,0,0,0]
[]
[]
[]
[]
[]
[]
[]
[]
[]
[]
[]
[]
[]
[]
[]
[]
[]
[]
[]
[]
[]
[]
[]
[]
[]
[]
[]
[]
[]
[]
[]
[]
[]
[]
[]
[]
[]
[]
[]
[]
[]
[]
[]
[]
[]
[]
[]
[]
[]
[]
[]
[]
[]
[]
[]
[]
[]
[]
[]
[]
[]
[]
[]
[]
[]
[]
[]
[]
[]
[]
[]
[]
[]
[]
[]
[]
[]
[]
[]
[]
[]
[]
[]
[]
[]
[]
[]
[]
[]
[]
[]
[]
[]
[]
[]
[]
[]
[]
[]
[]
[]
[]
[]
[]
[]
[]
[]
[]
[]
[]
[]
[]
[]
[]
[]
[]
[]
[]
[]
[]
[]
[]
[]
[]
[]
[]
[]
[]
[]
[]
[]
[]
[]
[]
[]
[]
[]
[]
[]
[]
[]
[]
[]
[]
[]
[]
[]
[]
[]
[]
[]
[]
[]
[]
[]
[]
[]
[]
[]
[]
[]
[]
[]
[]
[]
[]
[]
[]
[]
[]
[]
[]
[]
[]
[]
[]
[]
[]
[]
[]
[]
[]
[null,null,null,null,null,null,null,null,null,null,null,null,null,null,null,null,null,null,null,null,null,null," "]

{"sheet":"3.6.9 Network-reliability","index":17,"n_rows":22,"n_cols":9,"rows_kept":22,"cut":false,"hidden":false,"merged":[]}
[null,{"$f":"INDEX(dms_Worksheet_List,MATCH(dms_Model,dms_Model_List))","v":"HISTORICAL ANNUAL REPORTING - FINANCIAL YEARS"}]
[null,{"$f":"INDEX(dms_TradingNameFull_List,MATCH(dms_TradingName,dms_TradingName_List))","v":"Jemena Electricity"}]
[null,{"$f":"dms_Header_Span","v":"2011-12 to 2017-18"}]
[null,"3.6 QUALITY OF SERVICES"]
[]
[]
[null,"3.6.9 - NETWORK FEEDER RELIABILITY - PLANNED OUTAGES"]
[null,null,{"$f":"dms_y1","v":"2011-12"},{"$f":"dms_y2","v":"2012-13"},{"$f":"dms_y3","v":"2013-14"},{"$f":"dms_y4","v":"2014-15"},{"$f":"dms_y5","v":"2015-16"},{"$f":"dms_y6","v":"2016-17"},{"$f":"dms_y7","v":"2017-18"}]
[null,"3.6.9.1 - PLANNED MINUTES OFF SUPPLY (SAIDI)"]
[null,{"$f":"INDEX(dms_FeederName_1,MATCH(dms_TradingName,dms_TradingName_List))","v":"CBD"}]
[null,{"$f":"INDEX(dms_FeederName_2,MATCH(dms_TradingName,dms_TradingName_List))","v":"Urban"},18.265566046740986,20.350182565943584,22.55376953686072,25.465649473461706,28.287503181883945,26.053153396463003,24.971600115050514]
[null,{"$f":"INDEX(dms_FeederName_3,MATCH(dms_TradingName,dms_TradingName_List))","v":"Short rural"},58.570522208027725,61.014733737356963,85.770714901188427,93.223654614417171,62.111062892753338,52.393495248813167,44.964461806894214]
[null,{"$f":"INDEX(dms_FeederName_4,MATCH(dms_TradingName,dms_TradingName_List))","v":"Long rural"}]
[null,{"$f":"IF((INDEX(dms_FeederName_5,MATCH(dms_TradingName,dms_TradingName_List))=0),\"\",(INDEX(dms_FeederName_5,MATCH(dms_TradingName,dms_TradingName_List))))","v":""}]
[]
[null,null,{"$f":"dms_y1","v":"2011-12"},{"$f":"dms_y2","v":"2012-13"},{"$f":"dms_y3","v":"2013-14"},{"$f":"dms_y4","v":"2014-15"},{"$f":"dms_y5","v":"2015-16"},{"$f":"dms_y6","v":"2016-17"},{"$f":"dms_y7","v":"2017-18"}]
[null,"3.6.9.2 - PLANNED INTERRUPTIONS TO SUPPLY (SAIFI)"]
[null,{"$f":"INDEX(dms_FeederName_1,MATCH(dms_TradingName,dms_TradingName_List))","v":"CBD"}]
[null,{"$f":"INDEX(dms_FeederName_2,MATCH(dms_TradingName,dms_TradingName_List))","v":"Urban"},6.4834306887590898E-2,7.1989304117508437E-2,7.852129263209906E-2,8.8277733742510078E-2,0.10322461683655867,9.5861972601391315E-2,9.104204786471462E-2]
[null,{"$f":"INDEX(dms_FeederName_3,MATCH(dms_TradingName,dms_TradingName_List))","v":"Short rural"},0.2284159968158479,0.25392731196297358,0.32937540270855736,0.33789621346518506,0.22360286285038217,0.17873311600150027,0.16459540120659347]
[null,{"$f":"INDEX(dms_FeederName_4,MATCH(dms_TradingName,dms_TradingName_List))","v":"Long rural"}]
[null,{"$f":"IF((INDEX(dms_FeederName_5,MATCH(dms_TradingName,dms_TradingName_List))=0),\"\",(INDEX(dms_FeederName_5,MATCH(dms_TradingName,dms_TradingName_List))))","v":""}]

{"sheet":"6.2 STPIS Reliability","index":18,"n_rows":94,"n_cols":10,"rows_kept":94,"cut":false,"hidden":false,"merged":[[76,1,81,1],[82,1,87,1],[88,1,93,1],[75,1,75,2],[22,1,27,1],[32,1,37,1],[38,1,43,1],[44,1,49,1],[5,1,5,2],[31,1,31,2],[66,1,71,1],[60,1,65,1],[53,1,53,2],[54,1,59,1],[16,1,21,1],[9,1,9,2],[10,1,15,1]]}
[null,{"$f":"INDEX(dms_Worksheet_List,MATCH(dms_Model,dms_Model_List))","v":"HISTORICAL ANNUAL REPORTING - FINANCIAL YEARS"}]
[null,{"$f":"INDEX(dms_TradingNameFull_List,MATCH(dms_TradingName,dms_TradingName_List))","v":"Jemena Electricity"}]
[null,{"$f":"dms_Header_Span","v":"2011-12 to 2017-18"}]
[null,"6.2 RELIABILITY AND CUSTOMER SERVICE PERFORMANCE"]
[]
[null,"Did the MAIFI parameter of the STPIS apply during the period?\nNB:This flag is set from the response on worksheet 3.6.8 Network feeders",null,{"$f":"dms_MAIFI_Flag","v":"No"}]
[]
[]
[null,"6.2.1 - UNPLANNED MINUTES OFF SUPPLY (SAIDI)"]
[null,null,null,{"$f":"dms_y1","v":"2011-12"},{"$f":"dms_y2","v":"2012-13"},{"$f":"dms_y3","v":"2013-14"},{"$f":"dms_y4","v":"2014-15"},{"$f":"dms_y5","v":"2015-16"},{"$f":"dms_y6","v":"2016-17"},{"$f":"dms_y7","v":"2017-18"}]
[null,"Total sustained minutes off supply",{"$f":"INDEX(dms_FeederName_1,MATCH(dms_TradingName,dms_TradingName_List))","v":"CBD"}]
[null,null,{"$f":"INDEX(dms_FeederName_2,MATCH(dms_TradingName,dms_TradingName_List))","v":"Urban"},55.435542481528756,57.209542650372796,63.418367897767034,54.129660068020655,50.321433052161296,48.001502874325425,42.386982044540019]
[null,null,{"$f":"INDEX(dms_FeederName_3,MATCH(dms_TradingName,dms_TradingName_List))","v":"Short rural"},87.745377512294141,85.951412296728847,112.40493604369689,87.13856033442967,98.00455537613864,94.869172669837312,49.446895696978459]
[null,null,{"$f":"INDEX(dms_FeederName_4,MATCH(dms_TradingName,dms_TradingName_List))","v":"Long rural"}]
[null,null,{"$f":"IF((INDEX(dms_FeederName_5,MATCH(dms_TradingName,dms_TradingName_List))=0),\"\",(INDEX(dms_FeederName_5,MATCH(dms_TradingName,dms_TradingName_List))))","v":""}]
[null,null,"Whole Network",57.400805941548768,58.452179318125985,65.461739308541382,55.604638313072755,52.747556201169523,50.46067316656243,42.783302626708178]
[null,"Total of excluded events*\n\n*see 3.3 of STPIS",{"$f":"INDEX(dms_FeederName_1,MATCH(dms_TradingName,dms_TradingName_List))","v":"CBD"}]
[null,null,{"$f":"INDEX(dms_FeederName_2,MATCH(dms_TradingName,dms_TradingName_List))","v":"Urban"},"Incomplete","Incomplete","Incomplete","Incomplete","Incomplete",6.4957989417648641,0]
[null,null,{"$f":"INDEX(dms_FeederName_3,MATCH(dms_TradingName,dms_TradingName_List))","v":"Short rural"},"Incomplete","Incomplete","Incomplete","Incomplete","Incomplete",6.098227517932294,0]
[null,null,{"$f":"INDEX(dms_FeederName_4,MATCH(dms_TradingName,dms_TradingName_List))","v":"Long rural"}]
[null,null,{"$f":"IF((INDEX(dms_FeederName_5,MATCH(dms_TradingName,dms_TradingName_List))=0),\"\",(INDEX(dms_FeederName_5,MATCH(dms_TradingName,dms_TradingName_List))))","v":""}]
[null,null,"Whole Network","Incomplete","Incomplete","Incomplete","Incomplete","Incomplete",6.4753135442566254,0]
[null,"Total sustained minutes off supply after removing excluded events",{"$f":"INDEX(dms_FeederName_1,MATCH(dms_TradingName,dms_TradingName_List))","v":"CBD"}]
[null,null,{"$f":"INDEX(dms_FeederName_2,MATCH(dms_TradingName,dms_TradingName_List))","v":"Urban"},51.286254202940185,53.631309012963627,57.258436147769757,51.547961955432548,43.825634110396436,41.505703932560557,42.386982044540019]
[null,null,{"$f":"INDEX(dms_FeederName_3,MATCH(dms_TradingName,dms_TradingName_List))","v":"Short rural"},75.1357656823496,85.940915665050966,104.33078267402016,79.074903596430829,91.906327858206339,88.770945151905011,49.446895696978459]
[null,null,{"$f":"INDEX(dms_FeederName_4,MATCH(dms_TradingName,dms_TradingName_List))","v":"Long rural"}]
[null,null,{"$f":"IF((INDEX(dms_FeederName_5,MATCH(dms_TradingName,dms_TradingName_List))=0),\"\",(INDEX(dms_FeederName_5,MATCH(dms_TradingName,dms_TradingName_List))))","v":""}]
[null,null,"Whole Network",52.740299881464907,55.016798394122596,59.206533557025423,52.784813485560178,46.272242656912894,43.985359622305801,42.783302626708178]
[]
[]
[null,"6.2.2 - UNPLANNED INTERRUPTIONS TO SUPPLY (SAIFI)"]
[null,null,null,{"$f":"dms_y1","v":"2011-12"},{"$f":"dms_y2","v":"2012-13"},{"$f":"dms_y3","v":"2013-14"},{"$f":"dms_y4","v":"2014-15"},{"$f":"dms_y5","v":"2015-16"},{"$f":"dms_y6","v":"2016-17"},{"$f":"dms_y7","v":"2017-18"}]
[null,"Total sustained interruptions",{"$f":"INDEX(dms_FeederName_1,MATCH(dms_TradingName,dms_TradingName_List))","v":"CBD"}]
[null,null,{"$f":"INDEX(dms_FeederName_2,MATCH(dms_TradingName,dms_TradingName_List))","v":"Urban"},0.93956888193172516,1.025487514436572,1.0737487293339187,0.89318757379881741,0.82529937860854874,0.83681515412362317,0.75430442237461537]
[null,null,{"$f":"INDEX(dms_FeederName_3,MATCH(dms_TradingName,dms_TradingName_List))","v":"Short rural"},1.0601136044830026,1.6436298542620382,1.6954164993008922,0.96822808075840316,1.4652278901458919,1.4074524340364318,0.86030255606686357]
[null,null,{"$f":"INDEX(dms_FeederName_4,MATCH(dms_TradingName,dms_TradingName_List))","v":"Long rural"}]
[null,null,{"$f":"IF((INDEX(dms_FeederName_5,MATCH(dms_TradingName,dms_TradingName_List))=0),\"\",(INDEX(dms_FeederName_5,MATCH(dms_TradingName,dms_TradingName_List))))","v":""}]
[null,null,"Whole Network",0.94674823073317638,1.0494824930667419,1.0985438716766682,0.89692553050630175,0.85791419325985163,0.8664050690119478,0.76078329235671383]
[null,"Total of excluded events*\n\n*see 3.3 of STPIS",{"$f":"INDEX(dms_FeederName_1,MATCH(dms_TradingName,dms_TradingName_List))","v":"CBD"}]
[null,null,{"$f":"INDEX(dms_FeederName_2,MATCH(dms_TradingName,dms_TradingName_List))","v":"Urban"},"Incomplete","Incomplete","Incomplete","Incomplete","Incomplete",3.1133561125477827E-2,0]
[null,null,{"$f":"INDEX(dms_FeederName_3,MATCH(dms_TradingName,dms_TradingName_List))","v":"Short rural"},"Incomplete","Incomplete","Incomplete","Incomplete","Incomplete",6.7964906040666295E-2,0]
[null,null,{"$f":"INDEX(dms_FeederName_4,MATCH(dms_TradingName,dms_TradingName_List))","v":"Long rural"}]
[null,null,{"$f":"IF((INDEX(dms_FeederName_5,MATCH(dms_TradingName,dms_TradingName_List))=0),\"\",(INDEX(dms_FeederName_5,MATCH(dms_TradingName,dms_TradingName_List))))","v":""}]
[null,null,"Whole Network","Incomplete","Incomplete","Incomplete","Incomplete","Incomplete",3.3031345262167555E-2,0]
[null,"Total sustained interruptions after removing excluded events",{"$f":"INDEX(dms_FeederName_1,MATCH(dms_TradingName,dms_TradingName_List))","v":"CBD"}]
[null,null,{"$f":"INDEX(dms_FeederName_2,MATCH(dms_TradingName,dms_TradingName_List))","v":"Urban"},0.9106941523722758,0.99222813077825234,1.0134043776686914,0.8661026057919099,0.79416581748307102,0.80568159299814535,0.75430442237461537]
[null,null,{"$f":"INDEX(dms_FeederName_3,MATCH(dms_TradingName,dms_TradingName_List))","v":"Short rural"},0.94968318462559576,1.6435906877259265,1.5453628735397948,0.8182136215334177,1.3972629841052258,1.3394875279957656,0.86030255606686357]
[null,null,{"$f":"INDEX(dms_FeederName_4,MATCH(dms_TradingName,dms_TradingName_List))","v":"Long rural"}]
[null,null,{"$f":"IF((INDEX(dms_FeederName_5,MATCH(dms_TradingName,dms_TradingName_List))=0),\"\",(INDEX(dms_FeederName_5,MATCH(dms_TradingName,dms_TradingName_List))))","v":""}]
[null,null,"Whole Network",0.91294547226214284,1.017553251778281,1.0341898198338924,0.86450071995198652,0.82488284799768408,0.83337372374978025,0.76078329235671383]
[]
[]
[null,"6.2.3 - UNPLANNED MOMENTARY INTERRUPTIONS TO SUPPLY (MAIFI)"]
[null,null,null,{"$f":"dms_y1","v":"2011-12"},{"$f":"dms_y2","v":"2012-13"},{"$f":"dms_y3","v":"2013-14"},{"$f":"dms_y4","v":"2014-15"},{"$f":"dms_y5","v":"2015-16"},{"$f":"dms_y6","v":"2016-17"},{"$f":"dms_y7","v":"2017-18"}]
[null,"Total momentary interruptions",{"$f":"INDEX(dms_FeederName_1,MATCH(dms_TradingName,dms_TradingName_List))","v":"CBD"}]
[null,null,{"$f":"INDEX(dms_FeederName_2,MATCH(dms_TradingName,dms_TradingName_List))","v":"Urban"}]
[null,null,{"$f":"INDEX(dms_FeederName_3,MATCH(dms_TradingName,dms_TradingName_List))","v":"Short rural"}]
[null,null,{"$f":"INDEX(dms_FeederName_4,MATCH(dms_TradingName,dms_TradingName_List))","v":"Long rural"}]
[null,null,{"$f":"IF((INDEX(dms_FeederName_5,MATCH(dms_TradingName,dms_TradingName_List))=0),\"\",(INDEX(dms_FeederName_5,MATCH(dms_TradingName,dms_TradingName_List))))","v":""}]
[null,null,"Whole Network"]
[null,"Total of excluded events*\n\n*see 3.3 of STPIS",{"$f":"INDEX(dms_FeederName_1,MATCH(dms_TradingName,dms_TradingName_List))","v":"CBD"}]
[null,null,{"$f":"INDEX(dms_FeederName_2,MATCH(dms_TradingName,dms_TradingName_List))","v":"Urban"}]
[null,null,{"$f":"INDEX(dms_FeederName_3,MATCH(dms_TradingName,dms_TradingName_List))","v":"Short rural"}]
[null,null,{"$f":"INDEX(dms_FeederName_4,MATCH(dms_TradingName,dms_TradingName_List))","v":"Long rural"}]
[null,null,{"$f":"IF((INDEX(dms_FeederName_5,MATCH(dms_TradingName,dms_TradingName_List))=0),\"\",(INDEX(dms_FeederName_5,MATCH(dms_TradingName,dms_TradingName_List))))","v":""}]
[null,null,"Whole Network"]
[null,"Total momentary interruptions after removing excluded events",{"$f":"INDEX(dms_FeederName_1,MATCH(dms_TradingName,dms_TradingName_List))","v":"CBD"}]
[null,null,{"$f":"INDEX(dms_FeederName_2,MATCH(dms_TradingName,dms_TradingName_List))","v":"Urban"}]
[null,null,{"$f":"INDEX(dms_FeederName_3,MATCH(dms_TradingName,dms_TradingName_List))","v":"Short rural"}]
[null,null,{"$f":"INDEX(dms_FeederName_4,MATCH(dms_TradingName,dms_TradingName_List))","v":"Long rural"}]
[null,null,{"$f":"IF((INDEX(dms_FeederName_5,MATCH(dms_TradingName,dms_TradingName_List))=0),\"\",(INDEX(dms_FeederName_5,MATCH(dms_TradingName,dms_TradingName_List))))","v":""}]
[null,null,"Whole Network"]
[]
[]
[null,"6.2.4 - DISTRIBUTION CUSTOMER NUMBERS"]
[null,null,null,{"$f":"dms_y1","v":"2011-12"},{"$f":"dms_y2","v":"2012-13"},{"$f":"dms_y3","v":"2013-14"},{"$f":"dms_y4","v":"2014-15"},{"$f":"dms_y5","v":"2015-16"},{"$f":"dms_y6","v":"2016-17"},{"$f":"dms_y7","v":"2017-18"}]
[null,"Customer numbers at the start of the period",{"$f":"INDEX(dms_FeederName_1,MATCH(dms_TradingName,dms_TradingName_List))","v":"CBD"}]
[null,null,{"$f":"INDEX(dms_FeederName_2,MATCH(dms_TradingName,dms_TradingName_List))","v":"Urban"},294427,300520.5,306064,304597,305969,310519,315752.5]
[null,null,{"$f":"INDEX(dms_FeederName_3,MATCH(dms_TradingName,dms_TradingName_List))","v":"Short rural"},18935,16529.5,12766,13832,15448,16866.5,19087]
[null,null,{"$f":"INDEX(dms_FeederName_4,MATCH(dms_TradingName,dms_TradingName_List))","v":"Long rural"}]
[null,null,{"$f":"IF((INDEX(dms_FeederName_5,MATCH(dms_TradingName,dms_TradingName_List))=0),\"\",(INDEX(dms_FeederName_5,MATCH(dms_TradingName,dms_TradingName_List))))","v":""}]
[null,null,"Whole Network",313362,317050,318830,318429,321417,327385.5,334839.5]
[null,"Customer numbers at the end of the period",{"$f":"INDEX(dms_FeederName_1,MATCH(dms_TradingName,dms_TradingName_List))","v":"CBD"}]
[null,null,{"$f":"INDEX(dms_FeederName_2,MATCH(dms_TradingName,dms_TradingName_List))","v":"Urban"},296839.5,302383,304597,305969,310517,315750.5,321982.5]
[null,null,{"$f":"INDEX(dms_FeederName_3,MATCH(dms_TradingName,dms_TradingName_List))","v":"Short rural"},20210.5,16447,13832,15448,16868.5,19089,21672.5]
[null,null,{"$f":"INDEX(dms_FeederName_4,MATCH(dms_TradingName,dms_TradingName_List))","v":"Long rural"}]
[null,null,{"$f":"IF((INDEX(dms_FeederName_5,MATCH(dms_TradingName,dms_TradingName_List))=0),\"\",(INDEX(dms_FeederName_5,MATCH(dms_TradingName,dms_TradingName_List))))","v":""}]
[null,null,"Whole Network",317050,318830,318429,321417,327385.5,334839.5,343655]
[null,"Average customer numbers",{"$f":"INDEX(dms_FeederName_1,MATCH(dms_TradingName,dms_TradingName_List))","v":"CBD"},{"$f":"IFERROR(ROUND(AVERAGE(D77,D83),0),\"\")","v":""},{"$f":"IFERROR(ROUND(AVERAGE(E77,E83),0),\"\")","v":""},"","","",{"$f":"IFERROR(ROUND(AVERAGE(I77,I83),0),\"\")","v":""},""]
[null,null,{"$f":"INDEX(dms_FeederName_2,MATCH(dms_TradingName,dms_TradingName_List))","v":"Urban"},{"$f":"IFERROR(ROUND(AVERAGE(D78,D84),0),\"\")","v":295633},{"$f":"IFERROR(ROUND(AVERAGE(E78,E84),0),\"\")","v":301452},305331,305283,308243,{"$f":"IFERROR(ROUND(AVERAGE(I78,I84),0),\"\")","v":313135},318868]
[null,null,{"$f":"INDEX(dms_FeederName_3,MATCH(dms_TradingName,dms_TradingName_List))","v":"Short rural"},{"$f":"IFERROR(ROUND(AVERAGE(D79,D85),0),\"\")","v":19573},{"$f":"IFERROR(ROUND(AVERAGE(E79,E85),0),\"\")","v":16488},13299,14640,16158,{"$f":"IFERROR(ROUND(AVERAGE(I79,I85),0),\"\")","v":17978},20380]
[null,null,{"$f":"INDEX(dms_FeederName_4,MATCH(dms_TradingName,dms_TradingName_List))","v":"Long rural"},{"$f":"IFERROR(ROUND(AVERAGE(D80,D86),0),\"\")","v":""},{"$f":"IFERROR(ROUND(AVERAGE(E80,E86),0),\"\")","v":""},"","","",{"$f":"IFERROR(ROUND(AVERAGE(I80,I86),0),\"\")","v":""},""]
[null,null,{"$f":"IF((INDEX(dms_FeederName_5,MATCH(dms_TradingName,dms_TradingName_List))=0),\"\",(INDEX(dms_FeederName_5,MATCH(dms_TradingName,dms_TradingName_List))))","v":""}]
[null,null,"Whole Network",{"$f":"IFERROR(ROUND(AVERAGE(D82,D88),0),\"\")","v":315206},{"$f":"IFERROR(ROUND(AVERAGE(E82,E88),0),\"\")","v":317940},318630,319923,324401,{"$f":"IFERROR(ROUND(AVERAGE(I82,I88),0),\"\")","v":331113},339247]

{"sheet":"6.6 STPIS Customer Service","index":19,"n_rows":56,"n_cols":10,"rows_kept":56,"cut":false,"hidden":false,"merged":[[20,3,20,9],[32,3,32,9]]}
[null,{"$f":"INDEX(dms_Worksheet_List,MATCH(dms_Model,dms_Model_List))","v":"HISTORICAL ANNUAL REPORTING - FINANCIAL YEARS"}]
[null,{"$f":"INDEX(dms_TradingNameFull_List,MATCH(dms_TradingName,dms_TradingName_List))","v":"Jemena Electricity"}]
[null,{"$f":"dms_Header_Span","v":"2011-12 to 2017-18"}]
[null,"6.6 STPIS CUSTOMER SERVICE"]
[]
[]
[null,"6.6.1 - TELEPHONE ANSWERING"]
[null,"Number of calls \nafter removing excluded events"]
[]
[null,null,null,{"$f":"dms_y1","v":"2011-12"},{"$f":"dms_y2","v":"2012-13"},{"$f":"dms_y3","v":"2013-14"},{"$f":"dms_y4","v":"2014-15"},{"$f":"dms_y5","v":"2015-16"},{"$f":"dms_y6","v":"2016-17"},{"$f":"dms_y7","v":"2017-18"}]
[null,"Number of calls received",null,63246,71210,70003,59920,54214,52667.5,51368.5]
[null,"Number of calls answered within 30 seconds",null,39397.5,45260.5,47549,41875.5,36479,37420.5,38576.5]
[null,"Percentage of calls answered within 30 seconds",null,{"$f":"IFERROR(D12/D11,\"\")","v":0.62292476994592538},{"$f":"IFERROR(E12/E11,\"\")","v":0.63559191124842018},0.67924231818636349,0.69885680907877168,0.67287047626074448,0.71050458062372435,0.75097579255769586]
[]
[null,"Total number of calls"]
[null,null,null,{"$f":"dms_y1","v":"2011-12"},{"$f":"dms_y2","v":"2012-13"},{"$f":"dms_y3","v":"2013-14"},{"$f":"dms_y4","v":"2014-15"},{"$f":"dms_y5","v":"2015-16"},{"$f":"dms_y6","v":"2016-17"},{"$f":"dms_y7","v":"2017-18"}]
[null,"Number of calls received",null,63941,72034.5,71597.5,60690,55021,53474.5,51368.5]
[]
[]
[null,"6.6.2 - INADEQUATELY SERVED CUSTOMERS"]
[null,null,null,"NUMBER"]
[null,null,null,{"$f":"dms_y1","v":"2011-12"},{"$f":"dms_y2","v":"2012-13"},{"$f":"dms_y3","v":"2013-14"},{"$f":"dms_y4","v":"2014-15"},{"$f":"dms_y5","v":"2015-16"},{"$f":"dms_y6","v":"2016-17"},{"$f":"dms_y7","v":"2017-18"}]
[null,"A - SAIDI VALUES"]
[null,"Threshold SAIDI value for inadquately served customers (see note 1)","SAIDI","Incomplete","Incomplete","Incomplete","Incomplete","Incomplete","Incomplete","Incomplete"]
[null,"Average unplanned SAIDI of inadquately served customers","SAIDI","Incomplete","Incomplete","Incomplete","Incomplete","Incomplete","Incomplete","Incomplete"]
[null,"Highest unplanned SAIDI of inadquately served customers","SAIDI","Incomplete","Incomplete","Incomplete","Incomplete","Incomplete","Incomplete","Incomplete"]
[null,"B - SAIFI VALUES"]
[null,"Average unplanned SAIFI of inadquately served customers","SAIFI","Incomplete","Incomplete","Incomplete","Incomplete","Incomplete","Incomplete","Incomplete"]
[null,"Highest unplanned SAIFI of inadquately served customers","SAIFI","Incomplete","Incomplete","Incomplete","Incomplete","Incomplete","Incomplete","Incomplete"]
[]
[]
[null,"C - TOP 5 FEEDERS WITH MOST INADEQUATELY SERVED CUSTOMERS"]
[null,null,null,"NUMBER"]
[null,null,null,{"$f":"dms_y1","v":"2011-12"},{"$f":"dms_y2","v":"2012-13"},{"$f":"dms_y3","v":"2013-14"},{"$f":"dms_y4","v":"2014-15"},{"$f":"dms_y5","v":"2015-16"},{"$f":"dms_y6","v":"2016-17"},{"$f":"dms_y7","v":"2017-18"}]
[null,"SAIDI VALUE"]
[null,"Feeder ID (see note 2)",null,"Incomplete","Incomplete","Incomplete","Incomplete","Incomplete","Incomplete","Incomplete"]
[null,null,null,"Incomplete","Incomplete","Incomplete","Incomplete","Incomplete","Incomplete","Incomplete"]
[null,null,null,"Incomplete","Incomplete","Incomplete","Incomplete","Incomplete","Incomplete","Incomplete"]
[null,null,null,"Incomplete","Incomplete","Incomplete","Incomplete","Incomplete","Incomplete","Incomplete"]
[null,null,null,"Incomplete","Incomplete","Incomplete","Incomplete","Incomplete","Incomplete","Incomplete"]
[null,"SAIFI VALUE"]
[null,"Feeder ID (see note 2)",null,"Incomplete","Incomplete","Incomplete","Incomplete","Incomplete","Incomplete","Incomplete"]
[null,null,null,"Incomplete","Incomplete","Incomplete","Incomplete","Incomplete","Incomplete","Incomplete"]
[null,null,null,"Incomplete","Incomplete","Incomplete","Incomplete","Incomplete","Incomplete","Incomplete"]
[null,null,null,"Incomplete","Incomplete","Incomplete","Incomplete","Incomplete","Incomplete","Incomplete"]
[null,null,null,"Incomplete","Incomplete","Incomplete","Incomplete","Incomplete","Incomplete","Incomplete"]
[null,"NUMBER OF INADQUATELY SERVED CUSTOMERS"]
[null,"Feeder ID (see note 2)",null,"Incomplete","Incomplete","Incomplete","Incomplete","Incomplete","Incomplete","Incomplete"]
[null,null,null,"Incomplete","Incomplete","Incomplete","Incomplete","Incomplete","Incomplete","Incomplete"]
[null,null,null,"Incomplete","Incomplete","Incomplete","Incomplete","Incomplete","Incomplete","Incomplete"]
[null,null,null,"Incomplete","Incomplete","Incomplete","Incomplete","Incomplete","Incomplete","Incomplete"]
[null,null,null,"Incomplete","Incomplete","Incomplete","Incomplete","Incomplete","Incomplete","Incomplete"]
[]
[]
["Notes:","1) Threshold for inadequately served customers = greater than 4 times the Network average for unplanned SAIDI on a three-year rolling average basis compared with a network average customer."]
[null,"2) If information is not available in feeder or feeder section level, please report by zone substation level"]

{"sheet":"6.9 STPIS - GSL","index":20,"n_rows":124,"n_cols":16,"rows_kept":124,"cut":false,"hidden":false,"merged":[[101,9,101,15],[102,9,102,15],[101,2,101,8],[102,2,102,8],[5,3,5,5],[72,1,72,3],[78,1,78,3],[84,1,84,3],[90,1,90,3],[7,1,7,2],[10,2,10,8],[11,2,11,8],[38,2,38,8],[78,4,78,6],[78,7,78,8],[90,4,90,6],[90,7,90,8],[11,9,11,15],[10,9,10,15],[25,2,25,8],[25,9,25,15],[26,2,26,8],[26,9,26,15],[38,9,38,15],[39,2,39,8],[39,9,39,15],[72,4,72,6],[72,7,72,8],[72,10,72,12],[72,13,72,15],[84,4,84,6],[84,7,84,8],[84,10,84,12],[84,13,84,15],[90,10,90,12],[90,13,90,15],[78,10,78,12],[78,13,78,15]]}
[null,{"$f":"INDEX(dms_Worksheet_List,MATCH(dms_Model,dms_Model_List))","v":"HISTORICAL ANNUAL REPORTING - FINANCIAL YEARS"}]
[null,{"$f":"INDEX(dms_TradingNameFull_List,MATCH(dms_TradingName,dms_TradingName_List))","v":"Jemena Electricity"}]
[null,{"$f":"dms_Header_Span","v":"2011-12 to 2017-18"}]
[null,"6.9 STPIS - GUARANTEED SERVICE LEVEL"]
[]
[null,"Did the AER's GSL Scheme apply at any time during the regulatory year?","No","**IMPORTANT \nPlease ensure this flag is set. Conditional formatting on this worksheet is dependant on this response."]
[]
[null,"Instructions:\nTable 6.9.1 collects information relating to jurisdiction GSL scheme parameters. These parameters can be found in the jurisdictonal scheme relevant to NSP. Please identify each parameter in the relevant sub-tables and provide the volume and value of GSL payments. \n\nFor GSL parameters that do not fit within the provided sub-tables provided, please enter a heading and identify the relevant parameter(s). "]
[]
[null,"6.9.1 - GUARANTEED SERVICE LEVELS - JURISDICTIONAL GSL SCHEME"]
[null,null,"Value of GSL payments",null,null,null,null,null,null,"Volume"]
[null,null,"$0's",null,null,null,null,null,null,"0's"]
[null,null,{"$f":"dms_y1","v":"2011-12"},{"$f":"dms_y2","v":"2012-13"},{"$f":"dms_y3","v":"2013-14"},{"$f":"dms_y4","v":"2014-15"},{"$f":"dms_y5","v":"2015-16"},{"$f":"dms_y6","v":"2016-17"},{"$f":"dms_y7","v":"2017-18"},{"$f":"dms_y1","v":"2011-12"},{"$f":"dms_y2","v":"2012-13"},{"$f":"dms_y3","v":"2013-14"},{"$f":"dms_y4","v":"2014-15"},{"$f":"dms_y5","v":"2015-16"},{"$f":"dms_y6","v":"2016-17"},{"$f":"dms_y7","v":"2017-18"}]
[null,"Appointments"]
[null,"Customer arranged appointments Central","Incomplete","Incomplete","Incomplete","Incomplete","Incomplete",0,0,5611,3905.5,3234.5,3229.5,3360,2244,1693]
[null,"Appointments not met within 15 minutes of agreed time","Incomplete","Incomplete","Incomplete","Incomplete","Incomplete",0,0,61.5,27.5,32,29,12,17.5,14]
[null,"Appointments - GSL payments",1230,550,640,580,280,525,420,61.5,27.5,32,29,12,17.5,14]
[null,""]
[null,""]
[null,""]
[null,""]
[null,""]
[null,"To enter further GSL parameters relating to appointments - please copy a row from above and \"insert copied cells\" above this row."]
[]
[null,"Connections"]
[null,null,"Value of GSL payments",null,null,null,null,null,null,"Volume"]
[null,null,"$0's",null,null,null,null,null,null,"0's"]
[null,null,{"$f":"dms_y1","v":"2011-12"},{"$f":"dms_y2","v":"2012-13"},{"$f":"dms_y3","v":"2013-14"},{"$f":"dms_y4","v":"2014-15"},{"$f":"dms_y5","v":"2015-16"},{"$f":"dms_y6","v":"2016-17"},{"$f":"dms_y7","v":"2017-18"},{"$f":"dms_y1","v":"2011-12"},{"$f":"dms_y2","v":"2012-13"},{"$f":"dms_y3","v":"2013-14"},{"$f":"dms_y4","v":"2014-15"},{"$f":"dms_y5","v":"2015-16"},{"$f":"dms_y6","v":"2016-17"},{"$f":"dms_y7","v":"2017-18"}]
[null,"Connections made","Incomplete","Incomplete","Incomplete","Incomplete","Incomplete",0,0,6728.5,7272.5,6840.5,7488,8597,9412,9893]
[null,"Connections not made on agreed date","Incomplete","Incomplete","Incomplete","Incomplete","Incomplete",0,0,5,7,148,157.5,59.5,477.5,535.5]
[null,"Connections - GSL payments - 1-4 day delay",325,450,3035,3360,3530,46515,49525,3.5,5,147,150.5,30.5,308,319.5]
[null,"Connections - GSL payments - 5+ day delay",375,500,4384,5884,9450,59325,73500,1.5,2,1,7,29,169.5,216]
[null,""]
[null,""]
[null,""]
[null,"To enter further GSL parameters relating to connections -  please copy a row from above and \"insert copied cells\" above this row."]
[]
[null,"Reliability of supply"]
[null,null,"Value of GSL payments",null,null,null,null,null,null,"Volume"]
[null,null,"$0's",null,null,null,null,null,null,"0's"]
[null,null,{"$f":"dms_y1","v":"2011-12"},{"$f":"dms_y2","v":"2012-13"},{"$f":"dms_y3","v":"2013-14"},{"$f":"dms_y4","v":"2014-15"},{"$f":"dms_y5","v":"2015-16"},{"$f":"dms_y6","v":"2016-17"},{"$f":"dms_y7","v":"2017-18"},{"$f":"dms_y1","v":"2011-12"},{"$f":"dms_y2","v":"2012-13"},{"$f":"dms_y3","v":"2013-14"},{"$f":"dms_y4","v":"2014-15"},{"$f":"dms_y5","v":"2015-16"},{"$f":"dms_y6","v":"2016-17"},{"$f":"dms_y7","v":"2017-18"}]
[null,"Low reliability payments - 20 hours",6200,22750,29500,16500,56680,54660,12600,62,227.5,295,165,479,455.5,105]
[null,"Low reliability payments - 30 hours",30150,32250,19650,17550,13410,16020,3150,201,215,131,117,74.5,89,17.5]
[null,"Low reliability payments - 60 hours",0,0,10200,10200,0,0,0,0,0,34,34,0,0,0]
[null,"Interruptions – Urban feeders – 12 hours duration and 20 hours or less in that year","Incomplete","Incomplete","Incomplete","Incomplete","Incomplete",32600,7520,"Incomplete","Incomplete","Incomplete","Incomplete","Incomplete",407.5,94]
[null,"Interruptions – Rural (short and long) feeders – 18 hours duration and 20 hours or less in that year","Incomplete","Incomplete","Incomplete","Incomplete","Incomplete",0,0,"Incomplete","Incomplete","Incomplete","Incomplete","Incomplete",0,0]
[null,"Low reliability payments - 8 events","Incomplete","Incomplete","Incomplete","Incomplete","Incomplete",2340,0,"Incomplete","Incomplete","Incomplete","Incomplete","Incomplete",19.5,0]
[null,"Low reliability payments - 12 events","Incomplete","Incomplete","Incomplete","Incomplete","Incomplete",0,0,"Incomplete","Incomplete","Incomplete","Incomplete","Incomplete",0,0]
[null,"Low reliability payments - 24 events","Incomplete","Incomplete","Incomplete","Incomplete","Incomplete",0,0,"Incomplete","Incomplete","Incomplete","Incomplete","Incomplete",0,0]
[null,"Low reliability payments - 24 momentary events",0,0,0,0,0,0,0,0,0,0,0,0,0,0]
[null,"Low reliability payments - 36 momentary events",0,0,0,0,0,0,0,0,0,0,0,0,0,0]
[null,"Low reliability payments - 10 events - number",0,0,0,0,"Incomplete","Incomplete","Incomplete",0,0,0,0,0,"Incomplete","Incomplete"]
[null,"Low reliability payments - 15 events - number",0,0,0,0,"Incomplete","Incomplete","Incomplete",0,0,0,0,0,"Incomplete","Incomplete"]
[null,"Low reliability payments - 30 events - number",0,0,0,0,"Incomplete","Incomplete","Incomplete",0,0,0,0,0,"Incomplete","Incomplete"]
[null,"To enter further GSL parameters relating to reliability of supply -  please copy a row from above and \"insert copied cells\" above this row."]
[]
[null,"Street lights"]
[null,"Street lights","Incomplete","Incomplete","Incomplete","Incomplete","Incomplete",0,0,68223.5,68998.5,69891.5,71249,72140.5,73439.5,74563]
[null,"Street lights \"out\" during period","Incomplete","Incomplete","Incomplete","Incomplete","Incomplete",0,0,3937,3254.5,3385,4339,5408.5,5857,5606]
[null,"Street lights not repaired by \"fix by\" date","Incomplete","Incomplete","Incomplete","Incomplete","Incomplete",0,0,6,8,81.5,89.5,21.5,24.5,17]
[null,"Street lights not repaired in 2 business days","Incomplete","Incomplete","Incomplete","Incomplete","Incomplete",0,0,1865,1683,1763,1979,2451,2757.5,2767.5]
[null,"Street lights – number of business days to repair","Incomplete","Incomplete","Incomplete","Incomplete","Incomplete",0,0,2.935296671490593,3.3394541971400207,3.3629592725995576,2.9015744864368989,2.6829265254247114,2.9752202790823903,3.2359599061689694]
[null,"Street lights - GSL payments",50,55,110,115,27.5,137.5,200,5,5.5,11,11.5,2,5.5,8]
[null,""]
[null,"To enter further GSL parameters relating to street lights -  please copy a row from above and \"insert copied cells\" above this row."]
[]
[null,"Planned interruptions"]
[null,"Planned interruptions - 4 business days notice not given","Incomplete","Incomplete","Incomplete","Incomplete","Incomplete",0,0,219,32.5,43.5,60.5,49,39,117]
[null,""]
[null,""]
[null,"To enter further GSL parameters relating to planned interruptions -  please copy a row from above and \"insert copied cells\" above this row."]
[]
[null,"<NSP defined parameter category>",0,0]
[null,0]
[null,0]
[null,0]
[null,"To enter further GSL parameters - please identify the parameter and if insufficient rows  please copy a row from above and \"insert copied cells\" above this row."]
[]
[null,"<NSP defined parameter category>",0,0]
[null,0]
[null,0]
[null,0]
[null,"To enter further GSL parameters - please identify the parameter and if insufficient rows  please copy a row from above and \"insert copied cells\" above this row."]
[]
[null,"<NSP defined parameter category>",0,0]
[null,0]
[null,0]
[null,0]
[null,"To enter further GSL parameters - please identify the parameter and if insufficient rows  please copy a row from above and \"insert copied cells\" above this row."]
[]
[null,"<NSP defined parameter category>",0,0]
[null,0]
[null,0]
[null,0]
[null,"To enter further GSL parameters - please identify the parameter and if insufficient rows  please copy a row from above and \"insert copied cells\" above this row."]
[]
[]
[null,"6.9.2 - GUARANTEED SERVICE LEVELS - AER GSL SCHEME"]
[]
[null,"Complete this table (6.9.2) if the AER's GSL scheme applied at any time during the regulatory year. \n\nDo not complete this table (6.9.2) if the AER's GSL scheme did not apply during the regulatory year."]
[]
[null,null,"Value \nof GSL payments",null,null,null,null,null,null,"VOLUMES"]
[null,null,"$0's",null,null,null,null,null,null,"0's"]
[null,null,{"$f":"dms_y1","v":"2011-12"},{"$f":"dms_y2","v":"2012-13"},{"$f":"dms_y3","v":"2013-14"},{"$f":"dms_y4","v":"2014-15"},{"$f":"dms_y5","v":"2015-16"},{"$f":"dms_y6","v":"2016-17"},{"$f":"dms_y7","v":"2017-18"},{"$f":"dms_y1","v":"2011-12"},{"$f":"dms_y2","v":"2012-13"},{"$f":"dms_y3","v":"2013-14"},{"$f":"dms_y4","v":"2014-15"},{"$f":"dms_y5","v":"2015-16"},{"$f":"dms_y6","v":"2016-17"},{"$f":"dms_y7","v":"2017-18"}]
[null,"New connections "]
[null,"Number of connections made"]
[null,"Number of connections not made on or before the day agreed"]
[null,"Connections - GSL payments – 1-6 day delay"]
[null,"Connections - GSL payments – 7+ day delay"]
[null,"Reliability of supply"]
[null,"Frequency of interruptions – CBD feeders – 9 interruptions"]
[null,"Frequency of interruptions – Urban feeders – 9 interruptions"]
[null,"Frequency of interruptions – Rural (short and long) feeders – 15 interruptions"]
[null,"Interruptions – CBD feeders – 12 hours duration"]
[null,"Interruptions – Urban feeders – 12 hours duration"]
[null,"Interruptions – Rural (short and long) feeders – 18 hours duration"]
[null,"Total duration of interruptions Level 1 – 20 hours"]
[null,"Total duration of interruptions Level 2 – 30 hours"]
[null,"Total duration of interruptions Level 3 – 60 hours"]
[null,"Street lights"]
[null,"Streetlight repair 5 days – GSL payments"]
[null,"Planned interruptions"]
[null,"Notice of planned interruptions – 4 business days notice not given"]
[null,"Total ",{"$f":"SUM(C123,C121,C111:C119,C108:C109)","v":0},{"$f":"SUM(D123,D121,D111:D119,D108:D109)","v":0},0,0,0,0,0,0,0,0,0,0,0,0]

{"sheet":"7.8 Avoided TUOS Payments","index":21,"n_rows":11,"n_cols":9,"rows_kept":11,"cut":false,"hidden":false,"merged":[[6,2,6,8]]}
[null,{"$f":"INDEX(dms_Worksheet_List,MATCH(dms_Model,dms_Model_List))","v":"HISTORICAL ANNUAL REPORTING - FINANCIAL YEARS"}]
[null,{"$f":"INDEX(dms_TradingNameFull_List,MATCH(dms_TradingName,dms_TradingName_List))","v":"Jemena Electricity"}]
[null,{"$f":"dms_Header_Span","v":"2011-12 to 2017-18"}]
[null,"7.8 - AVOIDED TUOS PAYMENTS"]
[]
[null,"7.8.1 - AVOIDED TUOS PAYMENTS"]
[null,null,"$0's, nominal"]
[null,null,{"$f":"dms_y1","v":"2011-12"},{"$f":"dms_y2","v":"2012-13"},{"$f":"dms_y3","v":"2013-14"},{"$f":"dms_y4","v":"2014-15"},{"$f":"dms_y5","v":"2015-16"},{"$f":"dms_y6","v":"2016-17"},{"$f":"dms_y7","v":"2017-18"}]
[null,"Embedded generators",null,null,null,null,null,192373.66999999998,659418.5]
[null,"Market network service providers","Incomplete","Incomplete","Incomplete","Incomplete","Incomplete",0,0]
[null,"Other","Incomplete","Incomplete","Incomplete","Incomplete","Incomplete",0,0]

{"sheet":"7.10 Juris Scheme","index":22,"n_rows":44,"n_cols":12,"rows_kept":44,"cut":false,"hidden":false,"merged":[[7,4,8,4],[7,3,8,3],[7,2,8,2],[7,1,8,1],[7,5,7,11]]}
[null,{"$f":"INDEX(dms_Worksheet_List,MATCH(dms_Model,dms_Model_List))","v":"HISTORICAL ANNUAL REPORTING - FINANCIAL YEARS"}]
[null,{"$f":"INDEX(dms_TradingNameFull_List,MATCH(dms_TradingName,dms_TradingName_List))","v":"Jemena Electricity"}]
[null,{"$f":"dms_Header_Span","v":"2011-12 to 2017-18"}]
[null,"7.10 - JURISDICTIONAL SCHEMES"]
[]
[]
[null,"7.10.1 - JURISDICTIONAL SCHEME PAYMENTS"]
[null,"Jurisdictional Scheme Name","Description","Date DNSP Became Subject to Scheme","Description of Cost Recovery Method","$0's, nominal"]
[null,null,null,null,null,{"$f":"dms_y1","v":"2011-12"},{"$f":"dms_y2","v":"2012-13"},{"$f":"dms_y3","v":"2013-14"},{"$f":"dms_y4","v":"2014-15"},{"$f":"dms_y5","v":"2015-16"},{"$f":"dms_y6","v":"2016-17"},{"$f":"dms_y7","v":"2017-18"}]
[null,"PFIT","Premium Solar Feed-in Tariff Scheme","2009-11-01","Cost is recovered through Tarriffs",4294948.3550000004,6274874.5200000005,6428041.8599999994,6257874.8149999995,6389904.25,6315241.54,6037092.2899999991]
[null,"TFIT","Transitional Feed-in Tariff Scheme","2012-01-01","Cost is recovered through Tariffs",393211.77500000002,1875775.8250000002,2929771.5249999999,2848438.0599999996,2921653.5,1520592.865,169.95000000001164]
[]
[]
[]
[]
[]
[]
[]
[]
[]
[]
[]
[]
[]
[]
[]
[]
[]
[]
[]
[]
[]
[]
[]
[]
[]
[]
[]
[]
[]
[]
[]
[]
[null,null,null,null,"Total",{"$f":"SUM(F10:F43)","v":4688160.1300000008},{"$f":"SUM(G10:G43)","v":8150650.3450000007},9357813.3849999998,9106312.875,9311557.75,7835834.4050000003,6037262.2399999993]

{"sheet":"7.11 DMIA-DMIAM","index":23,"n_rows":180,"n_cols":9,"rows_kept":180,"cut":false,"hidden":false,"merged":[[140,2,140,8],[141,2,141,8],[7,2,7,8],[8,2,8,8],[97,2,97,8],[98,2,98,8],[49,2,49,8],[50,2,50,8]]}
[null,{"$f":"INDEX(dms_Worksheet_List,MATCH(dms_Model,dms_Model_List))","v":"HISTORICAL ANNUAL REPORTING - FINANCIAL YEARS"}]
[null,{"$f":"INDEX(dms_TradingNameFull_List,MATCH(dms_TradingName,dms_TradingName_List))","v":"Jemena Electricity"}]
[null,{"$f":"dms_Header_Span","v":"2011-12 to 2017-18"}]
[null,"7.11 - DEMAND MANAGEMENT INCENTIVE SCHEME"]
[]
[null,"7.11.1 - DMIS - PROJECTS SUBMITTED FOR APPROVAL"]
[null,"OPEX"]
[null,null,"Total amount of the DMIS spent"]
[null,null,"$0's"]
[null,"Name of project",{"$f":"dms_y1","v":"2011-12"},{"$f":"dms_y2","v":"2012-13"},{"$f":"dms_y3","v":"2013-14"},{"$f":"dms_y4","v":"2014-15"},{"$f":"dms_y5","v":"2015-16"},{"$f":"dms_y6","v":"2016-17"},{"$f":"dms_y7","v":"2017-18"}]
[null,""]
[null,""]
[null,""]
[null,""]
[null,""]
[null,""]
[null,""]
[null,""]
[null,""]
[null,""]
[null,""]
[null,""]
[null,""]
[null,""]
[null,""]
[null,""]
[null,""]
[null,""]
[null,""]
[null,""]
[null,""]
[null,""]
[null,""]
[null,""]
[null,""]
[null,""]
[null,""]
[null,""]
[null,""]
[null,""]
[null,""]
[null,""]
[null,""]
[null,""]
[null,""]
[null,"To enter additional projects - please insert above this row. "]
[null,"Total",{"$f":"SUM(C11:C46)","v":0},{"$f":"SUM(D11:D46)","v":0},0,0,0,0,0]
[]
[null,"CAPEX"]
[null,null,"Total amount of the DMIS spent"]
[null,null,"$0's"]
[null,"Name of project",{"$f":"dms_y1","v":"2011-12"},{"$f":"dms_y2","v":"2012-13"},{"$f":"dms_y3","v":"2013-14"},{"$f":"dms_y4","v":"2014-15"},{"$f":"dms_y5","v":"2015-16"},{"$f":"dms_y6","v":"2016-17"},{"$f":"dms_y7","v":"2017-18"}]
[null,""]
[null,""]
[null,""]
[null,""]
[null,""]
[null,""]
[null,""]
[null,""]
[null,""]
[null,""]
[null,""]
[null,""]
[null,""]
[null,""]
[null,""]
[null,""]
[null,""]
[null,""]
[null,""]
[null,""]
[null,""]
[null,""]
[null,""]
[null,""]
[null,""]
[null,""]
[null,""]
[null,""]
[null,""]
[null,""]
[null,""]
[null,""]
[null,""]
[null,""]
[null,""]
[null,"To enter additional projects - please insert above this row. "]
[null,"Total",{"$f":"SUM(C53:C88)","v":0},{"$f":"SUM(D53:D88)","v":0},0,0,0,0,0]
[]
[]
[]
[]
[]
[]
[]
[null,"7.11.2 - DMIAM - PROJECTS SUBMITTED FOR APPROVAL"]
[null,null,"Total amount of the DMIAM spent"]
[null,null,"$0's"]
[null,"Name of project",{"$f":"dms_y1","v":"2011-12"},{"$f":"dms_y2","v":"2012-13"},{"$f":"dms_y3","v":"2013-14"},{"$f":"dms_y4","v":"2014-15"},{"$f":"dms_y5","v":"2015-16"},{"$f":"dms_y6","v":"2016-17"},{"$f":"dms_y7","v":"2017-18"}]
[null,"Energy Portal Project",0,"Incomplete","Incomplete","Incomplete","Incomplete","Incomplete","Incomplete"]
[null,"Impact of the Energy Portal on Customers' Consumption Habits","Incomplete","Incomplete",42947.535000000003,"Incomplete","Incomplete","Incomplete","Incomplete"]
[null,"Demand Response Field Trial - Phase 1","Incomplete","Incomplete","Incomplete",26325,"Incomplete","Incomplete","Incomplete"]
[null,"Demand Response Trial Project on 22kV Feeder BD-13 (Phase 1)","Incomplete","Incomplete","Incomplete","Incomplete",12488.055,"Incomplete","Incomplete"]
[null,"Demand Management Constraint Analysis Tool (CAT)","Incomplete","Incomplete","Incomplete","Incomplete",29813.82,"Incomplete","Incomplete"]
[null,"Grid Battery Energy Storage System Feasibility and Concept Design Study","Incomplete","Incomplete","Incomplete","Incomplete",24850,"Incomplete","Incomplete"]
[null,"Commercial and Industrial Solar PV and Battery Storage / Residential Demand Response","Incomplete","Incomplete","Incomplete","Incomplete","Incomplete","Incomplete","Incomplete"]
[null,"JEN Residential Demand Response ","Incomplete","Incomplete","Incomplete","Incomplete","Incomplete","Incomplete",219639.5]
[null,""]
[null,""]
[null,""]
[null,""]
[null,""]
[null,""]
[null,""]
[null,""]
[null,""]
[null,""]
[null,""]
[null,""]
[null,""]
[null,""]
[null,""]
[null,""]
[null,""]
[null,""]
[null,""]
[null,""]
[null,""]
[null,""]
[null,""]
[null,""]
[null,""]
[null,""]
[null,""]
[null,"To enter additional projects - please insert above this row. "]
[null,"Total",{"$f":"SUM(C101:C136)","v":0},{"$f":"SUM(D101:D136)","v":0},42947.535000000003,26325,67151.875,0,219639.5]
[]
[]
[]
[null,null,"Total amount of the DMIAM spent"]
[null,null,"$0's"]
[null,"Name of project",{"$f":"dms_y1","v":"2011-12"},{"$f":"dms_y2","v":"2012-13"},{"$f":"dms_y3","v":"2013-14"},{"$f":"dms_y4","v":"2014-15"},{"$f":"dms_y5","v":"2015-16"},{"$f":"dms_y6","v":"2016-17"},{"$f":"dms_y7","v":"2017-18"}]
[null,"Energy Portal Project",345671.30000000005,"Incomplete","Incomplete","Incomplete","Incomplete","Incomplete","Incomplete"]
[null,"Impact of the Energy Portal on Customers' Consumption Habits","Incomplete","Incomplete",0,"Incomplete","Incomplete","Incomplete","Incomplete"]
[null,"Demand Response Field Trial - Phase 1","Incomplete","Incomplete","Incomplete",0,"Incomplete","Incomplete","Incomplete"]
[null,"Demand Response Trial Project on 22kV Feeder BD-13 (Phase 1)","Incomplete","Incomplete","Incomplete","Incomplete",0,"Incomplete","Incomplete"]
[null,"Demand Management Constraint Analysis Tool (CAT)","Incomplete","Incomplete","Incomplete","Incomplete",0,"Incomplete","Incomplete"]
[null,"Grid Battery Energy Storage System Feasibility and Concept Design Study","Incomplete","Incomplete","Incomplete","Incomplete",0,"Incomplete","Incomplete"]
[null,"Commercial and Industrial Solar PV and Battery Storage / Residential Demand Response","Incomplete","Incomplete","Incomplete","Incomplete","Incomplete","Incomplete","Incomplete"]
[null,"JEN Residential Demand Response ","Incomplete","Incomplete","Incomplete","Incomplete","Incomplete",0,0]
[null,""]
[null,""]
[null,""]
[null,""]
[null,""]
[null,""]
[null,""]
[null,""]
[null,""]
[null,""]
[null,""]
[null,""]
[null,""]
[null,""]
[null,""]
[null,""]
[null,""]
[null,""]
[null,""]
[null,""]
[null,""]
[null,""]
[null,""]
[null,""]
[null,""]
[null,""]
[null,""]
[null,"To enter additional projects - please insert above this row. "]
[null,"Total",{"$f":"SUM(C144:C179)","v":345671.30000000005},{"$f":"SUM(D144:D179)","v":0},0,0,0,0,0]

{"sheet":"8.1 Income","index":24,"n_rows":347,"n_cols":9,"rows_kept":347,"cut":false,"hidden":false,"merged":[[275,2,275,8],[237,2,237,8],[313,2,313,8],[7,2,7,8],[45,2,45,8],[83,2,83,8],[121,2,121,8],[161,2,161,8],[198,2,198,8]]}
[null,{"$f":"INDEX(dms_Worksheet_List,MATCH(dms_Model,dms_Model_List))","v":"HISTORICAL ANNUAL REPORTING - FINANCIAL YEARS"}]
[null,{"$f":"INDEX(dms_TradingNameFull_List,MATCH(dms_TradingName,dms_TradingName_List))","v":"Jemena Electricity"}]
[null,{"$f":"dms_Header_Span","v":"2011-12 to 2017-18"}]
[null,"8.1. INCOME"]
[]
[]
[null,"8.1.1 - AUDITED STATUTORY ACCOUNTS"]
[null,null,"$0's, nominal"]
[null,null,{"$f":"dms_y1","v":"2011-12"},{"$f":"dms_y2","v":"2012-13"},{"$f":"dms_y3","v":"2013-14"},{"$f":"dms_y4","v":"2014-15"},{"$f":"dms_y5","v":"2015-16"},{"$f":"dms_y6","v":"2016-17"},{"$f":"dms_y7","v":"2017-18"}]
[null,"REVENUE"]
[null,"Contributions",14892137.51,12380297.2235,12406204.638499998,14182030.625099998,15348920.852953164,21622154.797853164,26105898.649999999]
[null,"Cross boundary revenue","Incomplete","Incomplete","Incomplete",8766166.1449999996,9177127.4299999997,9023714.5599999987,8824886.8849999998]
[null,"Distribution revenue",193961911.89999998,212988157.21999997,235839595.46499997,252334664.69499999,257053432.52499998,263373102.16499999,261191587.57499999]
[null,"Interest income","Incomplete","Incomplete","Incomplete",0,0,0,0]
[null,"Jurisdictional scheme amounts",2642545.7250000001,0,0,0,0,0,0]
[null,"Pass through revenue (F-factor)","Incomplete","Incomplete","Incomplete","Incomplete","Incomplete",0,327500]
[null,"Profit from sale of fixed assets",254629.995,128069.66500000001,186605.185,95403.86,0,0,0]
[null,"Recoverable works","Incomplete","Incomplete","Incomplete","Incomplete","Incomplete","Incomplete","Incomplete"]
[null,"TUOS revenue",62653178.454999998,72630171.150000006,69542806.109999985,66608397.13499999,69991544.395000011,67791819.375,63665364.204999998]
[null,"Other",62243518.980000034,70648827.416500017,78683960.336499989,89686118.714899987,80198243.891296834,57397741.44139684,49575412.905000001]
[null,"Total",{"$f":"SUM(C11:C20)","v":336647922.565},368775522.67500001,396659171.73499995,431672781.17499995,431769269.09424996,419208532.33924997,409690650.22000003]
[]
[null,"EXPENDITURE"]
[null,"Avoided TUOS expenditure","Incomplete","Incomplete","Incomplete","Incomplete","Incomplete",0,0]
[null,"Cross boundary expenditure","Incomplete","Incomplete","Incomplete",3567714.0949999997,3851228.0999999996,3602219.76,3571682.3]
[null,"Depreciation ",57928245.290000007,67581910.370000005,65736947.419999994,62668173.959999993,68749002.120000005,72256937.780000001,71841427.320000008]
[null,"Finance charges",0,13782.59,189223.63500000004,308524.04500000004,132815.785,-267.21499999999997,0]
[null,"Impairment losses",0,0,0,0,0,0,0]
[null,"Jurisdictional scheme amounts",4748597.8900000006,8157855.0550000006,9365018.0950000007,9106312.875,8750792.6700000018,7491474.0600000005,6253666.9749999996]
[null,"Loss from sale of fixed assets",9569.5,9569.5,0,1383119.3800000001,4530234.8992499998,6478057.1442499999,7004892.5299999993]
[null,"Maintenance expenditure",0,0,0,0,0,0,0]
[null,"Operating expenditure excluding maintenance expenditure",93455641.894999981,100207794.56999984,103684036.61999983,102536909.59000002,100414844.71000004,104821278.67,109284307.515]
[null,"Recoverable works","Incomplete","Incomplete","Incomplete","Incomplete","Incomplete","Incomplete","Incomplete"]
[null,"TUOS expenditure",60558951.859999999,64043485.674999997,62351566.359999999,62697498.230000004,63925526.435000002,62361211.480000004,60304284.980000004]
[null,"Other ",300,0,0,0,0,0,0]
[null,"Total",{"$f":"SUM(C24:C35)","v":216701306.435},240014397.75999987,241326792.12999982,242268252.17500001,250354444.71925002,257010911.67925,258260261.62]
[]
[null,"PROFIT"]
[null,"Profit before tax",{"$f":"C21-C36","v":119946616.13},128761124.91500014,155332379.60500014,189404528.99999994,181414824.37499994,162197620.65999997,151430388.60000002]
[null,"Income tax expenses (/ benefit)",34644246.685000002,37609127.519999996,46784694.329999998,56886374.74000001,55049410,49097664.831500001,45243185.331500001]
[null,"Profit after tax",{"$f":"C39-C40","v":85302369.444999993},91151997.395000145,108547685.27500014,132518154.25999993,126365414.37499994,113099955.82849997,106187203.26850003]
[]
[]
[]
[null,"8.1.2 - ADJUSTMENTS"]
[null,null,"$0's, nominal"]
[null,null,{"$f":"dms_y1","v":"2011-12"},{"$f":"dms_y2","v":"2012-13"},{"$f":"dms_y3","v":"2013-14"},{"$f":"dms_y4","v":"2014-15"},{"$f":"dms_y5","v":"2015-16"},{"$f":"dms_y6","v":"2016-17"},{"$f":"dms_y7","v":"2017-18"}]
[null,"REVENUE"]
[null,"Contributions",14892137.51,12380297.2235,12406204.638499998,14182030.625099998,15348920.852953164,21622154.797853164,26105898.649999999]
[null,"Cross boundary revenue","Incomplete","Incomplete","Incomplete",-8152.3422743330229,-1494.2950992515762,-39092.400099251419,8776.4300000006333]
[null,"Distribution revenue",0.10497908806428313,0.20792415307369083,10.830502622411586,10.787310136947781,-624242.94719111267,-400288.86275225878,228020.70500048995]
[null,"Interest income","Incomplete","Incomplete","Incomplete",0,0,0,0]
[null,"Jurisdictional scheme amounts",558971.56402499974,-7660871.1682099998,-12699745.415899999,-10563100.014234999,-8838644.5402800012,-8090007.1391409952,-6517638.8500098735]
[null,"Pass through revenue (F-factor)","Incomplete","Incomplete","Incomplete","Incomplete","Incomplete",305000,-35000]
[null,"Profit from sale of fixed assets",0,0,0,0,0,0,0]
[null,"Recoverable works","Incomplete","Incomplete","Incomplete","Incomplete","Incomplete","Incomplete","Incomplete"]
[null,"TUOS revenue",6097253.7347868932,4109086.6111535216,10005222.971272783,12613173.508901667,7802599.70900515,8235592.7031964101,6513572.5752989985]
[null,"Other",-17285.670207802468,31881.907424503879,1751719.0224857274,4343403.8900000025,4050425.7434939542,3436795.9558878765,4503281.6573939249]
[null,"Total",{"$f":"SUM(C49:C58)","v":21531077.24358318},8860394.7817921806,11463412.046861131,20567366.454802472,17737564.522881903,25070155.054944947,30806911.167683538]
[]
[null,"EXPENDITURE"]
[null,"Avoided TUOS expenditure","Incomplete","Incomplete","Incomplete","Incomplete","Incomplete",-192373.66999999998,-659418.5]
[null,"Cross boundary expenditure","Incomplete","Incomplete","Incomplete",-132387.64619750259,146155.86624267287,254126.76,-153240.84999999986]
[null,"Depreciation ",-7882731.5219171438,-6687634.7269182522,-4184003.2069766424,-2028788.3971460653,-592683.66696402011,-86345.456363655627,436340.57047578692]
[null,"Finance charges",0,13782.59,189223.63500000004,308524.04500000004,132815.785,-267.21499999999997,0]
[null,"Impairment losses",0,0,0,0,0,0,0]
[null,"Jurisdictional scheme amounts",60437.760000000024,7204.7099999999773,7204.7099999999773,0,-560765.08000000007,-344360.34499999974,216404.73500000034]
[null,"Loss from sale of fixed assets",0,0,0,0.25500000037936843,3147115.7742500002,6478057.1442499999,7004892.5299999993]
[null,"Maintenance expenditure",-22352690.168635957,-26414937.378417268,-32078104.390287202,-31065946.440691687,-24597629.705371033,-23242465.578074895,-24071358.194703378]
[null,"Operating expenditure excluding maintenance expenditure",19818497.024004232,24300132.93029052,32199701.019525565,31245206.040495023,25602568.271554451,23214445.293074898,26548281.014703348]
[null,"Recoverable works","Incomplete","Incomplete","Incomplete","Incomplete","Incomplete","Incomplete","Incomplete"]
[null,"TUOS expenditure",2324907.4405128998,20209.899999994377,12463.875000001281,-2994.1304545391176,-16891.645454533806,189116.09500000626,670056.24999999627]
[null,"Other ",0,0,0,0,0,0,0]
[null,"Total",{"$f":"SUM(C64:C73)","v":-8031579.4660359696},-8761241.9750450067,-3853514.3577382774,-1543998.6277972672,3114529.7330148625,6208179.9378863536,10804616.905475754]
[]
[null,"PROFIT"]
[null,"Profit before tax",{"$f":"C59-C74","v":29562656.70961915},17621636.756837189,15316926.404599408,22111365.08259974,14623034.78986704,18861975.117058594,20002294.262207784]
[null,"Income tax expenses (/ benefit)",34644246.685000002,37609127.519999996,46784694.329999998,56886374.74000001,55049410,49097664.831500001,45243185.331500001]
[null,"Profit after tax",{"$f":"C77-C78","v":-5081589.9753808528},-19987490.763162807,-31467767.925400592,-34775009.657400265,-40426375.210132957,-30235689.714441407,-25240891.069292217]
[]
[]
[]
[null,"8.1.3 - DISTRIBUTION BUSINESS"]
[null,null,"$0's, nominal"]
[null,null,{"$f":"dms_y1","v":"2011-12"},{"$f":"dms_y2","v":"2012-13"},{"$f":"dms_y3","v":"2013-14"},{"$f":"dms_y4","v":"2014-15"},{"$f":"dms_y5","v":"2015-16"},{"$f":"dms_y6","v":"2016-17"},{"$f":"dms_y7","v":"2017-18"}]
[null,"REVENUE"]
[null,"Contributions",{"$f":"C11-C49","v":0},0,0,0,0,0,0]
[null,"Cross boundary revenue",{"$f":"C20-C56","v":{"$error":"#VALUE!"}},{"$error":"#VALUE!"},{"$error":"#VALUE!"},{"$error":"#VALUE!"},{"$error":"#VALUE!"},{"$error":"#VALUE!"},{"$error":"#VALUE!"}]
[null,"Distribution revenue",{"$f":"C21-C57","v":330550668.83021313},364666436.06384647,386653948.76372719,419059607.6660983,423966669.38524479,410972939.63605356,403177077.644701]
[null,"Interest income",{"$f":"C22-C58","v":17285.670207802468},-31881.907424503879,-1751719.0224857274,-4343403.8900000025,-4050425.7434939542,-3436795.9558878765,-4503281.6573939249]
[null,"Jurisdictional scheme amounts",{"$f":"C23-C59","v":-21531077.24358318},-8860394.7817921806,-11463412.046861131,-20567366.454802472,-17737564.522881903,-25070155.054944947,-30806911.167683538]
[null,"Pass through revenue (F-factor)",{"$f":"C24-C60","v":{"$error":"#VALUE!"}},{"$error":"#VALUE!"},{"$error":"#VALUE!"},{"$error":"#VALUE!"},{"$error":"#VALUE!"},0,0]
[null,"Profit from sale of fixed assets",{"$f":"C25-C61","v":{"$error":"#VALUE!"}},{"$error":"#VALUE!"},{"$error":"#VALUE!"},3567714.0949999997,3851228.0999999996,3602219.76,3571682.3]
[null,"Recoverable works",{"$f":"C26-C62","v":{"$error":"#VALUE!"}},{"$error":"#VALUE!"},{"$error":"#VALUE!"},{"$error":"#VALUE!"},{"$error":"#VALUE!"},72449311.450000003,72500845.820000008]
[null,"TUOS revenue",{"$f":"C27-C63","v":{"$error":"#VALUE!"}},{"$error":"#VALUE!"},{"$error":"#VALUE!"},440911.69119750266,-13340.081242672866,-254393.97500000001,153240.84999999986]
[null,"Other",{"$f":"C28-C64","v":7882731.5219171438},6687634.7269182522,4184003.2069766424,2028788.3971460653,592683.66696402011,86345.456363655627,-436340.57047578692]
[null,"Total",{"$f":"SUM(C87:C96)","v":{"$error":"#VALUE!"}},{"$error":"#VALUE!"},{"$error":"#VALUE!"},{"$error":"#VALUE!"},{"$error":"#VALUE!"},{"$error":"#VALUE!"},{"$error":"#VALUE!"}]
[]
[null,"EXPENDITURE"]
[null,"Avoided TUOS expenditure",{"$f":"C24-C62","v":{"$error":"#VALUE!"}},{"$error":"#VALUE!"},{"$error":"#VALUE!"},{"$error":"#VALUE!"},{"$error":"#VALUE!"},192373.66999999998,659418.5]
[null,"Cross boundary expenditure",{"$f":"C30-C68","v":9569.5},9569.5,0,1383119.1249999998,1383119.1249999995,0,0]
[null,"Depreciation ",{"$f":"C31-C69","v":22352690.168635957},26414937.378417268,32078104.390287202,31065946.440691687,24597629.705371033,23242465.578074895,24071358.194703378]
[null,"Finance charges",{"$f":"C32-C70","v":73637144.870995745},75907661.639709324,71484335.600474268,71291703.549504995,74812276.438445583,81606833.376925111,82736026.500296652]
[null,"Impairment losses",{"$f":"C33-C71","v":{"$error":"#VALUE!"}},{"$error":"#VALUE!"},{"$error":"#VALUE!"},{"$error":"#VALUE!"},{"$error":"#VALUE!"},{"$error":"#VALUE!"},{"$error":"#VALUE!"}]
[null,"Jurisdictional scheme amounts",{"$f":"C34-C72","v":58234044.419487096},64023275.775000006,62339102.484999999,62700492.360454544,63942418.080454536,62172095.384999998,59634228.730000004]
[null,"Loss from sale of fixed assets",{"$f":"C35-C73","v":300},0,0,0,0,0,0]
[null,"Maintenance expenditure",{"$f":"C36-C74","v":224732885.90103596},248775639.73504487,245180306.4877381,243812250.80279729,247239914.98623517,250802731.74136364,247455644.71452424]
[null,"Operating expenditure excluding maintenance expenditure",{"$f":"C37-C75","v":0},0,0,0,0,0,0]
[null,"Recoverable works",{"$f":"C38-C76","v":0},0,0,0,0,0,0]
[null,"TUOS expenditure",{"$f":"C39-C77","v":90383959.420380846},111139488.15816295,140015453.20040074,167293163.91740021,166791789.5851329,143335645.54294136,131428094.33779225]
[null,"Other ",{"$f":"C40-C78","v":0},0,0,0,0,0,0]
[null,"Total",{"$f":"SUM(C102:C111)","v":{"$error":"#VALUE!"}},{"$error":"#VALUE!"},{"$error":"#VALUE!"},{"$error":"#VALUE!"},{"$error":"#VALUE!"},{"$error":"#VALUE!"},{"$error":"#VALUE!"}]
[]
[null,"PROFIT"]
[null,"Profit before tax",{"$f":"C97-C112","v":{"$error":"#VALUE!"}},{"$error":"#VALUE!"},{"$error":"#VALUE!"},{"$error":"#VALUE!"},{"$error":"#VALUE!"},{"$error":"#VALUE!"},{"$error":"#VALUE!"}]
[null,"Income tax expenses (/ benefit)",0,0,0,0,0,0,0]
[null,"Profit after tax",{"$f":"C115-C116","v":{"$error":"#VALUE!"}},{"$error":"#VALUE!"},{"$error":"#VALUE!"},{"$error":"#VALUE!"},{"$error":"#VALUE!"},{"$error":"#VALUE!"},{"$error":"#VALUE!"}]
[]
[]
[]
[null,"8.1.4 - STANDARD CONTROL SERVICES"]
[null,null,"$0's, nominal"]
[null,null,{"$f":"dms_y1","v":"2011-12"},{"$f":"dms_y2","v":"2012-13"},{"$f":"dms_y3","v":"2013-14"},{"$f":"dms_y4","v":"2014-15"},{"$f":"dms_y5","v":"2015-16"},{"$f":"dms_y6","v":"2016-17"},{"$f":"dms_y7","v":"2017-18"}]
[null,"REVENUE"]
[null,"Contributions",0,0,0,0,0,0,0]
[null,"Cross boundary revenue","Incomplete","Incomplete","Incomplete",8774318.4872743338,4600285.9950000001,0,0]
[null,"Distribution revenue",193961911.79502091,212988157.01207584,235839584.63449734,252334653.90768987,257677675.4721911,263773391.02775225,260963566.86999953]
[null,"Interest income","Incomplete","Incomplete","Incomplete",0,0,0,0]
[null,"Jurisdictional scheme amounts",2083574.1609750001,7660871.1682099998,12699745.415899999,10563100.014234999,3724738.3576200004,0,0]
[null,"Pass through revenue (F-factor)","Incomplete","Incomplete","Incomplete","Incomplete","Incomplete",-340000,0]
[null,"Profit from sale of fixed assets",246338.95623099996,116428.03517273569,179283.61365673569,95403.86,0,0,0]
[null,"Recoverable works","Incomplete","Incomplete","Incomplete","Incomplete","Incomplete","Incomplete","Incomplete"]
[null,"TUOS revenue",56555924.720213108,68521084.538846478,59537583.138727203,53995223.626098335,31515696.198715128,0,0]
[null,"Other",643260.03,1012229.4650000001,724731.2633039176,777008.799567212,421246.9712632944,0,0]
[null,"Total",{"$f":"SUM(C125:C134)","v":253491009.66244003},290298770.21930504,308980928.06608522,326539708.69486481,297939642.99478954,263433391.02775225,260963566.86999953]
[]
[null,"EXPENDITURE"]
[null,"Avoided TUOS expenditure","Incomplete","Incomplete","Incomplete","Incomplete","Incomplete",0,0]
[null,"Cross boundary expenditure","Incomplete","Incomplete","Incomplete",3700101.7411975022,2001536.7337573271,0,0]
[null,"Depreciation ",40559895.661008246,47792733.188282207,43853198.575836584,40206413.166549154,43888955.69688578,48080801.52231355,52687767.059020102]
[null,"Finance charges",0,0,0,0,0,0,0]
[null,"Impairment losses",0,0,0,0,0,0,0]
[null,"Jurisdictional scheme amounts",4688160.1300000008,8150650.3450000007,9357813.3849999998,9106312.875,4475616.3900000006,0,0]
[null,"Loss from sale of fixed assets",9569.5,9569.5,0,1366262.8049999999,1366262.8049999999,0,0]
[null,"Maintenance expenditure",18339798.742670558,22152509.480403431,26246466.230772667,25212081.062844209,21197438.417434014,20792997.45943103,21131136.553004876]
[null,"Operating expenditure excluding maintenance expenditure",49791748.358716823,50978713.632184044,46255333.099074528,47128021.203670301,56235996.94059208,64298522.978772402,63585550.617183894]
[null,"Recoverable works","Incomplete","Incomplete","Incomplete","Incomplete","Incomplete","Incomplete","Incomplete"]
[null,"TUOS expenditure",58234044.419487096,64023275.775000006,62339102.484999999,62700492.360454544,32178426.815454543,0,0]
[null,"Other ",0,0,0,0,0,0,0]
[null,"Total",{"$f":"SUM(C140:C149)","v":171623216.81188273},193107451.92086971,188051913.77568376,185719583.47351819,159342697.06536642,133172321.96051699,137404454.22920889]
[]
[null,"PROFIT"]
[null,"Profit before tax",{"$f":"C135-C150","v":81867792.850557297},97191318.29843533,120929014.29040146,140820125.22134662,138596945.92942312,130261069.06723526,123559112.64079064]
[null,"Income tax expenses (/ benefit)",0,0,0,0,0,0,0]
[null,"Profit after tax",{"$f":"C153-C154","v":81867792.850557297},97191318.29843533,120929014.29040146,140820125.22134662,138596945.92942312,130261069.06723526,123559112.64079064]
[]
[]
[]
[null,"8.1.5 - ALTERNATIVE CONTROL SERVICES"]
[null,"8.1.5.1 - PUBLIC LIGHTING"]
[null,"ENERGY EFFICIENT"]
[null,null,"$0's, nominal"]
[null,null,{"$f":"dms_y1","v":"2011-12"},{"$f":"dms_y2","v":"2012-13"},{"$f":"dms_y3","v":"2013-14"},{"$f":"dms_y4","v":"2014-15"},{"$f":"dms_y5","v":"2015-16"},{"$f":"dms_y6","v":"2016-17"},{"$f":"dms_y7","v":"2017-18"}]
[null,"REVENUE"]
[null,"Contributions",0,0,0,0,0,0,0]
[null,"Cross boundary revenue","Incomplete","Incomplete","Incomplete",0,0,0,0]
[null,"Distribution revenue",0,0,0,0,0,0,0]
[null,"Interest income","Incomplete","Incomplete","Incomplete",0,0,0,0]
[null,"Jurisdictional scheme amounts",0,0,0,0,0,0,0]
[null,"Pass through revenue (F-factor)","Incomplete","Incomplete","Incomplete","Incomplete","Incomplete",0,0]
[null,"Profit from sale of fixed assets",0,0,0,0,0,0,0]
[null,"Recoverable works","Incomplete","Incomplete","Incomplete","Incomplete","Incomplete","Incomplete","Incomplete"]
[null,"TUOS revenue",0,0,0,0,0,0,0]
[null,"Other",210836.43603726322,28680.174999999999,21021.465,15013.935000000001,575355.87,1219655.2349999999,1383924.625]
[null,"Total",{"$f":"SUM(C165:C174)","v":210836.43603726322},28680.174999999999,21021.465,15013.935000000001,575355.87,1219655.2349999999,1383924.625]
[]
[null,"EXPENDITURE"]
[null,"Avoided TUOS expenditure","Incomplete","Incomplete","Incomplete","Incomplete","Incomplete",0,0]
[null,"Cross boundary expenditure","Incomplete","Incomplete","Incomplete",0,0,0,0]
[null,"Depreciation ",786.65943457481308,1094.0086433337397,1003.8299774736203,920.35254289321028,1004.6484826495941,1100.6027262889766,1206.0593465839913]
[null,"Finance charges",0,0,0,0,0,0,0]
[null,"Impairment losses",0,0,0,0,0,0,0]
[null,"Jurisdictional scheme amounts",0,0,0,0,0,0,0]
[null,"Loss from sale of fixed assets",0,0,0,0,0,0,0]
[null,"Maintenance expenditure",0,0,0,0,0,0,727473.38]
[null,"Operating expenditure excluding maintenance expenditure",55549.659914618343,0,0,0,0,0,0]
[null,"Recoverable works","Incomplete","Incomplete","Incomplete","Incomplete","Incomplete","Incomplete","Incomplete"]
[null,"TUOS expenditure",0,0,0,0,0,0,0]
[null,"Other ",0,0,0,0,0,0,0]
[null,"Total",{"$f":"SUM(C180:C189)","v":56336.31934919316},1094.0086433337397,1003.8299774736203,920.35254289321028,1004.6484826495941,1100.6027262889766,728679.43934658403]
[]
[null,"PROFIT"]
[null,"Profit before tax",{"$f":"C175-C190","v":154500.11668807006},27586.166356666261,20017.635022526381,14093.582457106791,574351.22151735041,1218554.6322737108,655245.18565341597]
[null,"Income tax expenses (/ benefit)",0,0,0,0,0,0,0]
[null,"Profit after tax",{"$f":"C193-C194","v":154500.11668807006},27586.166356666261,20017.635022526381,14093.582457106791,574351.22151735041,1218554.6322737108,655245.18565341597]
[]
[]
[null,"NON-ENERGY EFFICIENT"]
[null,null,"$0's, nominal"]
[null,null,{"$f":"dms_y1","v":"2011-12"},{"$f":"dms_y2","v":"2012-13"},{"$f":"dms_y3","v":"2013-14"},{"$f":"dms_y4","v":"2014-15"},{"$f":"dms_y5","v":"2015-16"},{"$f":"dms_y6","v":"2016-17"},{"$f":"dms_y7","v":"2017-18"}]
[null,"REVENUE"]
[null,"Contributions",0,0,0,0,0,0,0]
[null,"Cross boundary revenue","Incomplete","Incomplete","Incomplete",0,0,0,0]
[null,"Distribution revenue",0,0,0,0,0,0,0]
[null,"Interest income","Incomplete","Incomplete","Incomplete",0,0,0,0]
[null,"Jurisdictional scheme amounts",0,0,0,0,0,0,0]
[null,"Pass through revenue (F-factor)","Incomplete","Incomplete","Incomplete","Incomplete","Incomplete",0,0]
[null,"Profit from sale of fixed assets",0,0,0,0,0,0,0]
[null,"Recoverable works","Incomplete","Incomplete","Incomplete","Incomplete","Incomplete","Incomplete","Incomplete"]
[null,"TUOS revenue",0,0,0,0,0,0,0]
[null,"Other",3447396.7739627371,3759170.0449999999,4000905.9450000003,3818141.5099000009,3398674.1456500008,3067584.2583560785,2802767.3326060781]
[null,"Total",{"$f":"SUM(C202:C211)","v":3447396.7739627371},3759170.0449999999,4000905.9450000003,3818141.5099000009,3398674.1456500008,3067584.2583560785,2802767.3326060781]
[]
[null,"EXPENDITURE"]
[null,"Avoided TUOS expenditure","Incomplete","Incomplete","Incomplete","Incomplete","Incomplete",0,0]
[null,"Cross boundary expenditure","Incomplete","Incomplete","Incomplete",0,0,0,0]
[null,"Depreciation ",258287.37327873579,300836.91523093224,276039.05661956908,253083.94190124644,276264.13397498208,302650.19484907622,331649.27500584401]
[null,"Finance charges",0,0,0,0,0,0,0]
[null,"Impairment losses",0,0,0,0,0,0,0]
[null,"Jurisdictional scheme amounts",0,0,0,0,0,0,0]
[null,"Loss from sale of fixed assets",0,0,0,16856.319999999869,16856.319999999869,0,0]
[null,"Maintenance expenditure",1749334.1841545766,1940314.3752143108,2982836.1227849694,3111341.8313520541,2334361.5655775177,2449468.1186438696,2212748.2616985003]
[null,"Operating expenditure excluding maintenance expenditure",1174483.8674681638,1233972.3983850321,627143.06305917865,166683.35192566094,164747.11989134445,274256.92787011113,243327.57829818089]
[null,"Recoverable works","Incomplete","Incomplete","Incomplete","Incomplete","Incomplete","Incomplete","Incomplete"]
[null,"TUOS expenditure",0,0,0,0,0,0,0]
[null,"Other ",0,0,0,0,0,0,0]
[null,"Total",{"$f":"SUM(C217:C226)","v":3182105.4249014761},3475123.6888302751,3886018.2424637172,3547965.4451789614,2792229.1394438441,3026375.2413630569,2787725.115002525]
[]
[null,"PROFIT"]
[null,"Profit before tax",{"$f":"C212-C227","v":265291.34906126093},284046.35616972484,114887.70253628306,270176.0647210395,606445.00620615669,41209.016993021592,15042.217603553087]
[null,"Income tax expenses (/ benefit)",0,0,0,0,0,0,0]
[null,"Profit after tax",{"$f":"C230-C231","v":265291.34906126093},284046.35616972484,114887.70253628306,270176.0647210395,606445.00620615669,41209.016993021592,15042.217603553087]
[]
[]
[]
[null,"8.1.5.2 - OTHER"]
[null,"CONNECTION SERVICES"]
[null,null,"$0's, nominal"]
[null,null,{"$f":"dms_y1","v":"2011-12"},{"$f":"dms_y2","v":"2012-13"},{"$f":"dms_y3","v":"2013-14"},{"$f":"dms_y4","v":"2014-15"},{"$f":"dms_y5","v":"2015-16"},{"$f":"dms_y6","v":"2016-17"},{"$f":"dms_y7","v":"2017-18"}]
[null,"REVENUE"]
[null,"Contributions","Incomplete","Incomplete","Incomplete","Incomplete","Incomplete",0,0]
[null,"Cross boundary revenue","Incomplete","Incomplete","Incomplete","Incomplete","Incomplete",0,0]
[null,"Distribution revenue","Incomplete","Incomplete","Incomplete","Incomplete","Incomplete",0,0]
[null,"Interest income","Incomplete","Incomplete","Incomplete","Incomplete","Incomplete",0,0]
[null,"Jurisdictional scheme amounts","Incomplete","Incomplete","Incomplete","Incomplete","Incomplete",0,0]
[null,"Pass through revenue (F-factor)","Incomplete","Incomplete","Incomplete","Incomplete","Incomplete",0,0]
[null,"Profit from sale of fixed assets","Incomplete","Incomplete","Incomplete","Incomplete","Incomplete",0,0]
[null,"Recoverable works","Incomplete","Incomplete","Incomplete","Incomplete","Incomplete","Incomplete","Incomplete"]
[null,"TUOS revenue","Incomplete","Incomplete","Incomplete","Incomplete","Incomplete",0,0]
[null,"Other","Incomplete","Incomplete","Incomplete","Incomplete","Incomplete",5767809.5849998686,6443522.625]
[null,"Total",{"$f":"SUM(C241:C250)","v":0},0,0,0,0,5767809.5849998686,6443522.625]
[]
[null,"EXPENDITURE"]
[null,"Avoided TUOS expenditure","Incomplete","Incomplete","Incomplete","Incomplete","Incomplete",0,0]
[null,"Cross boundary expenditure","Incomplete","Incomplete","Incomplete","Incomplete","Incomplete",0,0]
[null,"Depreciation ","Incomplete","Incomplete","Incomplete","Incomplete","Incomplete",0,1066317.2952249192]
[null,"Finance charges","Incomplete","Incomplete","Incomplete","Incomplete","Incomplete",0,0]
[null,"Impairment losses","Incomplete","Incomplete","Incomplete","Incomplete","Incomplete",0,0]
[null,"Jurisdictional scheme amounts","Incomplete","Incomplete","Incomplete","Incomplete","Incomplete",0,0]
[null,"Loss from sale of fixed assets","Incomplete","Incomplete","Incomplete","Incomplete","Incomplete",0,0]
[null,"Maintenance expenditure","Incomplete","Incomplete","Incomplete","Incomplete","Incomplete",0,0]
[null,"Operating expenditure excluding maintenance expenditure","Incomplete","Incomplete","Incomplete","Incomplete","Incomplete",0,0]
[null,"Recoverable works","Incomplete","Incomplete","Incomplete","Incomplete","Incomplete","Incomplete","Incomplete"]
[null,"TUOS expenditure","Incomplete","Incomplete","Incomplete","Incomplete","Incomplete",0,0]
[null,"Other ","Incomplete","Incomplete","Incomplete","Incomplete","Incomplete",0,0]
[null,"Total",{"$f":"SUM(C256:C265)","v":0},0,0,0,0,0,1066317.2952249192]
[]
[null,"PROFIT"]
[null,"Profit before tax",{"$f":"C251-C266","v":0},0,0,0,0,5767809.5849998686,5377205.329775081]
[null,"Income tax expenses (/ benefit)","Incomplete","Incomplete","Incomplete","Incomplete","Incomplete",0,0]
[null,"Profit after tax",{"$f":"C269-C270","v":{"$error":"#VALUE!"}},{"$error":"#VALUE!"},{"$error":"#VALUE!"},{"$error":"#VALUE!"},{"$error":"#VALUE!"},5767809.5849998686,5377205.329775081]
[]
[]
[]
[null,"METERING SERVICES"]
[null,null,"$0's, nominal"]
[null,null,{"$f":"dms_y1","v":"2011-12"},{"$f":"dms_y2","v":"2012-13"},{"$f":"dms_y3","v":"2013-14"},{"$f":"dms_y4","v":"2014-15"},{"$f":"dms_y5","v":"2015-16"},{"$f":"dms_y6","v":"2016-17"},{"$f":"dms_y7","v":"2017-18"}]
[null,"REVENUE"]
[null,"Contributions","Incomplete","Incomplete","Incomplete","Incomplete","Incomplete",0,0]
[null,"Cross boundary revenue","Incomplete","Incomplete","Incomplete","Incomplete","Incomplete",0,0]
[null,"Distribution revenue","Incomplete","Incomplete","Incomplete","Incomplete","Incomplete",0,0]
[null,"Interest income","Incomplete","Incomplete","Incomplete","Incomplete","Incomplete",0,0]
[null,"Jurisdictional scheme amounts","Incomplete","Incomplete","Incomplete","Incomplete","Incomplete",0,0]
[null,"Pass through revenue (F-factor)","Incomplete","Incomplete","Incomplete","Incomplete","Incomplete",0,0]
[null,"Profit from sale of fixed assets","Incomplete","Incomplete","Incomplete","Incomplete","Incomplete",0,0]
[null,"Recoverable works","Incomplete","Incomplete","Incomplete","Incomplete","Incomplete","Incomplete","Incomplete"]
[null,"TUOS revenue","Incomplete","Incomplete","Incomplete","Incomplete","Incomplete",0,0]
[null,"Other","Incomplete","Incomplete","Incomplete","Incomplete","Incomplete",37328794.326243863,28487493.350000001]
[null,"Total",{"$f":"SUM(C279:C288)","v":0},0,0,0,0,37328794.326243863,28487493.350000001]
[]
[null,"EXPENDITURE"]
[null,"Avoided TUOS expenditure","Incomplete","Incomplete","Incomplete","Incomplete","Incomplete",0,0]
[null,"Cross boundary expenditure","Incomplete","Incomplete","Incomplete","Incomplete","Incomplete",0,0]
[null,"Depreciation ","Incomplete","Incomplete","Incomplete","Incomplete","Incomplete",22122847.899999999,16372672.254999999]
[null,"Finance charges","Incomplete","Incomplete","Incomplete","Incomplete","Incomplete",0,0]
[null,"Impairment losses","Incomplete","Incomplete","Incomplete","Incomplete","Incomplete",0,0]
[null,"Jurisdictional scheme amounts","Incomplete","Incomplete","Incomplete","Incomplete","Incomplete",0,0]
[null,"Loss from sale of fixed assets","Incomplete","Incomplete","Incomplete","Incomplete","Incomplete",0,0]
[null,"Maintenance expenditure","Incomplete","Incomplete","Incomplete","Incomplete","Incomplete",0,0]
[null,"Operating expenditure excluding maintenance expenditure","Incomplete","Incomplete","Incomplete","Incomplete","Incomplete",11963347.608004626,12696877.681185063]
[null,"Recoverable works","Incomplete","Incomplete","Incomplete","Incomplete","Incomplete","Incomplete","Incomplete"]
[null,"TUOS expenditure","Incomplete","Incomplete","Incomplete","Incomplete","Incomplete",0,0]
[null,"Other ","Incomplete","Incomplete","Incomplete","Incomplete","Incomplete",0,0]
[null,"Total",{"$f":"SUM(C294:C303)","v":0},0,0,0,0,34086195.508004621,29069549.936185062]
[]
[null,"PROFIT"]
[null,"Profit before tax",{"$f":"C289-C304","v":0},0,0,0,0,3242598.8182392418,-582056.58618506044]
[null,"Income tax expenses (/ benefit)","Incomplete","Incomplete","Incomplete","Incomplete","Incomplete",0,0]
[null,"Profit after tax",{"$f":"C307-C308","v":{"$error":"#VALUE!"}},{"$error":"#VALUE!"},{"$error":"#VALUE!"},{"$error":"#VALUE!"},{"$error":"#VALUE!"},3242598.8182392418,-582056.58618506044]
[]
[]
[]
[null,"ANCILIARY NETWORK SERVICES"]
[null,null,"$0's, nominal"]
[null,null,{"$f":"dms_y1","v":"2011-12"},{"$f":"dms_y2","v":"2012-13"},{"$f":"dms_y3","v":"2013-14"},{"$f":"dms_y4","v":"2014-15"},{"$f":"dms_y5","v":"2015-16"},{"$f":"dms_y6","v":"2016-17"},{"$f":"dms_y7","v":"2017-18"}]
[null,"REVENUE"]
[null,"Contributions","Incomplete","Incomplete","Incomplete","Incomplete","Incomplete",0,0]
[null,"Cross boundary revenue","Incomplete","Incomplete","Incomplete","Incomplete","Incomplete",0,0]
[null,"Distribution revenue","Incomplete","Incomplete","Incomplete","Incomplete","Incomplete",0,0]
[null,"Interest income","Incomplete","Incomplete","Incomplete","Incomplete","Incomplete",0,0]
[null,"Jurisdictional scheme amounts","Incomplete","Incomplete","Incomplete","Incomplete","Incomplete",0,0]
[null,"Pass through revenue (F-factor)","Incomplete","Incomplete","Incomplete","Incomplete","Incomplete",0,0]
[null,"Profit from sale of fixed assets","Incomplete","Incomplete","Incomplete","Incomplete","Incomplete",0,0]
[null,"Recoverable works","Incomplete","Incomplete","Incomplete","Incomplete","Incomplete","Incomplete","Incomplete"]
[null,"TUOS revenue","Incomplete","Incomplete","Incomplete","Incomplete","Incomplete",0,0]
[null,"Other","Incomplete","Incomplete","Incomplete","Incomplete","Incomplete",6577102.0809091562,5954423.3149999995]
[null,"Total",{"$f":"SUM(C317:C326)","v":0},0,0,0,0,6577102.0809091562,5954423.3149999995]
[]
[null,"EXPENDITURE"]
[null,"Avoided TUOS expenditure","Incomplete","Incomplete","Incomplete","Incomplete","Incomplete",0,0]
[null,"Cross boundary expenditure","Incomplete","Incomplete","Incomplete","Incomplete","Incomplete",0,0]
[null,"Depreciation ","Incomplete","Incomplete","Incomplete","Incomplete","Incomplete",1835883.0164747499,945474.80592677544]
[null,"Finance charges","Incomplete","Incomplete","Incomplete","Incomplete","Incomplete",0,0]
[null,"Impairment losses","Incomplete","Incomplete","Incomplete","Incomplete","Incomplete",0,0]
[null,"Jurisdictional scheme amounts","Incomplete","Incomplete","Incomplete","Incomplete","Incomplete",0,0]
[null,"Loss from sale of fixed assets","Incomplete","Incomplete","Incomplete","Incomplete","Incomplete",0,0]
[null,"Maintenance expenditure","Incomplete","Incomplete","Incomplete","Incomplete","Incomplete",0,0]
[null,"Operating expenditure excluding maintenance expenditure","Incomplete","Incomplete","Incomplete","Incomplete","Incomplete",5070705.8622779343,6210270.6236294555]
[null,"Recoverable works","Incomplete","Incomplete","Incomplete","Incomplete","Incomplete","Incomplete","Incomplete"]
[null,"TUOS expenditure","Incomplete","Incomplete","Incomplete","Incomplete","Incomplete",0,0]
[null,"Other ","Incomplete","Incomplete","Incomplete","Incomplete","Incomplete",0,0]
[null,"Total",{"$f":"SUM(C332:C341)","v":0},0,0,0,0,6906588.8787526842,7155745.429556231]
[]
[null,"PROFIT"]
[null,"Profit before tax",{"$f":"C327-C342","v":0},0,0,0,0,-329486.79784352798,-1201322.1145562315]
[null,"Income tax expenses (/ benefit)","Incomplete","Incomplete","Incomplete","Incomplete","Incomplete",0,0]
[null,"Profit after tax",{"$f":"C345-C346","v":{"$error":"#VALUE!"}},{"$error":"#VALUE!"},{"$error":"#VALUE!"},{"$error":"#VALUE!"},{"$error":"#VALUE!"},-329486.79784352798,-1201322.1145562315]

{"sheet":"8.2 Capex","index":25,"n_rows":435,"n_cols":9,"rows_kept":435,"cut":false,"hidden":false,"merged":[[58,2,58,8],[362,2,362,8],[363,2,363,8],[401,2,401,8],[402,2,402,8],[251,2,251,8],[252,2,252,8],[323,2,323,8],[324,2,324,8],[134,2,134,8],[135,2,135,8],[7,2,7,8],[8,2,8,8],[41,2,41,5],[42,2,42,5],[43,2,43,5],[44,2,44,5],[45,2,45,5],[51,2,51,5],[57,2,57,8],[46,2,46,5],[47,2,47,5],[48,2,48,5],[49,2,49,5],[50,2,50,5]]}
[null,{"$f":"INDEX(dms_Worksheet_List,MATCH(dms_Model,dms_Model_List))","v":"HISTORICAL ANNUAL REPORTING - FINANCIAL YEARS"}]
[null,{"$f":"INDEX(dms_TradingNameFull_List,MATCH(dms_TradingName,dms_TradingName_List))","v":"Jemena Electricity"}]
[null,{"$f":"dms_Header_Span","v":"2011-12 to 2017-18"}]
[null,"8.2. CAPITAL EXPENDITURE"]
[]
[]
[null,"8.2.1 - CAPEX BY PURPOSE - STANDARD CONTROL SERVICES"]
[null,null,"EXPENDITURE"]
[null,null,"$0's, nominal"]
[null,"Description",{"$f":"dms_y1","v":"2011-12"},{"$f":"dms_y2","v":"2012-13"},{"$f":"dms_y3","v":"2013-14"},{"$f":"dms_y4","v":"2014-15"},{"$f":"dms_y5","v":"2015-16"},{"$f":"dms_y6","v":"2016-17"},{"$f":"dms_y7","v":"2017-18"}]
[null,"CPI ADJUSTED FORECAST"]
[null,"Replacement expenditure","Incomplete","Incomplete","Incomplete","Incomplete","Incomplete",45852993.654137425,45388451.536370277]
[null,"Connections","Incomplete","Incomplete","Incomplete","Incomplete","Incomplete",37780228.220720105,37605645.952195823]
[null,"Augmentation expenditure","Incomplete","Incomplete","Incomplete","Incomplete","Incomplete",24565660.71560676,38573247.460754111]
[null,"Non-network","Incomplete","Incomplete","Incomplete","Incomplete","Incomplete",46473435.10446766,35263694.922366276]
[null,"Capitalised network overheads","Incomplete","Incomplete","Incomplete","Incomplete","Incomplete",19674584.426562808,20366553.96276905]
[null,"Capitalised corporate overheads","Incomplete","Incomplete","Incomplete","Incomplete","Incomplete",13165249.155737199,13628273.039235497]
[]
[]
[]
[]
[null,"Capital contributions included in the above","Incomplete","Incomplete","Incomplete","Incomplete","Incomplete","Incomplete","Incomplete"]
[null,"Total",{"$f":"SUM(C12:C22)","v":0},0,0,0,0,187512151.27723196,190825866.87369105]
[null,"ACTUAL"]
[null,{"$f":"IF(ISBLANK(B12),\"\",B12)","v":"Replacement expenditure"},"Incomplete","Incomplete","Incomplete","Incomplete","Incomplete",32051366.460000008,34515503.324999996]
[null,{"$f":"IF(ISBLANK(B13),\"\",B13)","v":"Connections"},"Incomplete","Incomplete","Incomplete","Incomplete","Incomplete",32894882.879647374,36603398.983970493]
[null,{"$f":"IF(ISBLANK(B14),\"\",B14)","v":"Augmentation expenditure"},"Incomplete","Incomplete","Incomplete","Incomplete","Incomplete",13244403.145000003,19321309.039999999]
[null,{"$f":"IF(ISBLANK(B15),\"\",B15)","v":"Non-network"},"Incomplete","Incomplete","Incomplete","Incomplete","Incomplete",32815938.333347149,36012194.642097749]
[null,"Capitalised network overheads","Incomplete","Incomplete","Incomplete","Incomplete","Incomplete",16024326.076182792,15245804.911182795]
[null,"Capitalised corporate overheads","Incomplete","Incomplete","Incomplete","Incomplete","Incomplete",11162348.441774191,11120778.846774193]
[null,""]
[null,""]
[null,""]
[null,""]
[null,"Capital contributions included in the above",12418156.602146214,8763474.6471616868,7382069.4234999996,6305502.5042927098,8392584.7692927122,18550540.725000001,24368883.445]
[null,"Total",{"$f":"SUM(C25:C35)","v":12418156.602146214},8763474.6471616868,7382069.4234999996,6305502.5042927098,8392584.7692927122,156743806.06095153,177187873.19402519]
[]
[]
[]
[]
[null,"8.2.2 - CAPEX BY PURPOSE - MATERIAL DIFFERENCE EXPLANATION"]
[null,"Description","Reason for material difference"]
[null,{"$f":"IF(ISBLANK(B12),\"\",B12)","v":"Replacement expenditure"}]
[null,"Connections"]
[null,"Augmentation expenditure"]
[null,"Non-network"]
[null,"Capitalised network overheads"]
[null,"Capitalised corporate overheads"]
[null,""]
[null,""]
[null,""]
[null,""]
[]
[]
[]
[null,"8.2.3 - CAPEX - OTHER"]
[null,"8.2.3.1 - PUBLIC LIGHTING"]
[null,null,"EXPENDITURE"]
[null,null,"$0's, nominal"]
[null,null,{"$f":"dms_y1","v":"2011-12"},{"$f":"dms_y2","v":"2012-13"},{"$f":"dms_y3","v":"2013-14"},{"$f":"dms_y4","v":"2014-15"},{"$f":"dms_y5","v":"2015-16"},{"$f":"dms_y6","v":"2016-17"},{"$f":"dms_y7","v":"2017-18"}]
[null,"ENERGY EFFICIENT"]
[null,"CPI ADJUSTED FORECAST"]
[null,"Total","Incomplete","Incomplete","Incomplete",0,190680.57508213122,391449.76893136813,303315.19384923688]
[null,""]
[null,""]
[null,""]
[null,""]
[null,""]
[null,""]
[null,""]
[null,""]
[null,""]
[null,""]
[null,""]
[null,""]
[null,""]
[null,""]
[null,"Total",{"$f":"SUM(C63:C77)","v":0},0,0,0,190680.57508213122,391449.76893136813,303315.19384923688]
[null,"ACTUAL"]
[null,{"$f":"IF(ISBLANK(B63),\"\",B63)","v":"Total"},45075.275507631275,7603.8222018100432,2183.7200000000003,63773.419597376254,298630.91500000004,444544.99500000011,411945.90500000003]
[null,""]
[null,""]
[null,""]
[null,""]
[null,""]
[null,""]
[null,""]
[null,""]
[null,""]
[null,""]
[null,""]
[null,""]
[null,""]
[null,""]
[null,"Total",{"$f":"SUM(C80:C94)","v":45075.275507631275},7603.8222018100432,2183.7200000000003,63773.419597376254,298630.91500000004,444544.99500000011,411945.90500000003]
[]
[null,"NON-ENERGY EFFICIENT"]
[null,"CPI ADJUSTED FORECAST"]
[null,"Total","Incomplete","Incomplete","Incomplete",0,258574.58247904576,528246.58059232309,662167.99811327737]
[null,""]
[null,""]
[null,""]
[null,""]
[null,""]
[null,""]
[null,""]
[null,""]
[null,""]
[null,""]
[null,""]
[null,""]
[null,""]
[null,""]
[null,"Total",{"$f":"SUM(C99:C113)","v":0},0,0,0,258574.58247904576,528246.58059232309,662167.99811327737]
[null,"ACTUAL"]
[null,{"$f":"IF(ISBLANK(B99),\"\",B99)","v":"Total"},564956.95607146015,716275.94988488581,1054550.4250000003,1047942.0119249241,962297.06999999983,1064858.6999999997,1134794.8999999999]
[null,""]
[null,""]
[null,""]
[null,""]
[null,""]
[null,""]
[null,""]
[null,""]
[null,""]
[null,""]
[null,""]
[null,""]
[null,""]
[null,""]
[null,"Total",{"$f":"SUM(C116:C130)","v":564956.95607146015},716275.94988488581,1054550.4250000003,1047942.0119249241,962297.06999999983,1064858.6999999997,1134794.8999999999]
[]
[]
[null,"8.2.3.2 - ALTERNTIVE CONTROL SERVICES"]
[null,null,"EXPENDITURE"]
[null,null,"$0's, nominal"]
[null,null,{"$f":"dms_y1","v":"2011-12"},{"$f":"dms_y2","v":"2012-13"},{"$f":"dms_y3","v":"2013-14"},{"$f":"dms_y4","v":"2014-15"},{"$f":"dms_y5","v":"2015-16"},{"$f":"dms_y6","v":"2016-17"},{"$f":"dms_y7","v":"2017-18"}]
[null,"CONNECTION SERVICES"]
[null,"CPI ADJUSTED FORECAST"]
[null,"Total","Incomplete","Incomplete","Incomplete","Incomplete","Incomplete","Incomplete","Incomplete"]
[null,""]
[null,""]
[null,""]
[null,""]
[null,""]
[null,""]
[null,""]
[null,""]
[null,""]
[null,""]
[null,""]
[null,""]
[null,""]
[null,""]
[null,"Total",{"$f":"SUM(C140:C154)","v":0},0,0,0,0,0,0]
[null,"ACTUAL"]
[null,{"$f":"IF(ISBLANK(B140),\"\",B140)","v":"Total"},"Incomplete","Incomplete","Incomplete","Incomplete","Incomplete","Incomplete","Incomplete"]
[null,""]
[null,""]
[null,""]
[null,""]
[null,""]
[null,""]
[null,""]
[null,""]
[null,""]
[null,""]
[null,""]
[null,""]
[null,""]
[null,""]
[null,"Total",{"$f":"SUM(C157:C171)","v":0},0,0,0,0,0,0]
[]
[null,"METERING SERVICES"]
[null,"CPI ADJUSTED FORECAST"]
[null,"Total","Incomplete","Incomplete","Incomplete","Incomplete","Incomplete",2883609.2362931203,1793266.9684610059]
[null,""]
[null,""]
[null,""]
[null,""]
[null,""]
[null,""]
[null,""]
[null,""]
[null,""]
[null,""]
[null,""]
[null,""]
[null,""]
[null,""]
[null,"Total",{"$f":"SUM(C176:C190)","v":0},0,0,0,0,2883609.2362931203,1793266.9684610059]
[null,"ACTUAL"]
[null,{"$f":"IF(ISBLANK(B176),\"\",B176)","v":"Total"},"Incomplete","Incomplete","Incomplete","Incomplete","Incomplete",887475.97500000021,1746620]
[null,""]
[null,""]
[null,""]
[null,""]
[null,""]
[null,""]
[null,""]
[null,""]
[null,""]
[null,""]
[null,""]
[null,""]
[null,""]
[null,""]
[null,"Total",{"$f":"SUM(C193:C207)","v":0},0,0,0,0,887475.97500000021,1746620]
[]
[null,"ANCILLIARY NETWORK SERVICES"]
[null,"CPI ADJUSTED FORECAST"]
[null,"Total","Incomplete","Incomplete","Incomplete","Incomplete","Incomplete","Incomplete","Incomplete"]
[null,""]
[null,""]
[null,""]
[null,""]
[null,""]
[null,""]
[null,""]
[null,""]
[null,""]
[null,""]
[null,""]
[null,""]
[null,""]
[null,""]
[null,"Total",{"$f":"SUM(C212:C226)","v":0},0,0,0,0,0,0]
[null,"ACTUAL"]
[null,{"$f":"IF(ISBLANK(B212),\"\",B212)","v":"Total"},"Incomplete","Incomplete","Incomplete","Incomplete","Incomplete","Incomplete","Incomplete"]
[null,""]
[null,""]
[null,""]
[null,""]
[null,""]
[null,""]
[null,""]
[null,""]
[null,""]
[null,""]
[null,""]
[null,""]
[null,""]
[null,""]
[null,"Total",{"$f":"SUM(C229:C243)","v":0},0,0,0,0,0,0]
[]
[]
[]
[]
[]
[]
[null,"8.2.4 - CAPEX BY ASSET CLASS "]
[null,null,"EXPENDITURE"]
[null,null,"$0's, nominal"]
[null,"Asset Class",{"$f":"dms_y1","v":"2011-12"},{"$f":"dms_y2","v":"2012-13"},{"$f":"dms_y3","v":"2013-14"},{"$f":"dms_y4","v":"2014-15"},{"$f":"dms_y5","v":"2015-16"},{"$f":"dms_y6","v":"2016-17"},{"$f":"dms_y7","v":"2017-18"}]
[null,"CPI ADJUSTED FORECAST"]
[]
[]
[]
[]
[]
[]
[]
[]
[]
[]
[]
[]
[]
[]
[]
[]
[]
[]
[]
[]
[]
[]
[]
[]
[]
[]
[]
[]
[]
[]
[null,"Total",{"$f":"SUM(C256:C285)","v":0},0,0,0,0,0,0]
[null,"ACTUAL"]
[null,{"$f":"IF(ISBLANK(B256),\"\",B256)","v":""}]
[null,""]
[null,""]
[null,""]
[null,""]
[null,""]
[null,""]
[null,""]
[null,""]
[null,""]
[null,""]
[null,""]
[null,""]
[null,""]
[null,""]
[null,""]
[null,""]
[null,""]
[null,""]
[null,""]
[null,""]
[null,""]
[null,""]
[null,""]
[null,""]
[null,""]
[null,""]
[null,""]
[null,""]
[null,""]
[null,"Total",{"$f":"SUM(C288:C317)","v":0},0,0,0,0,0,0]
[]
[]
[]
[null,"8.2.5 - CAPITAL CONTRIBUTIONS BY ASSET CLASS"]
[null,"ACTUAL"]
[null,null,"EXPENDITURE"]
[null,null,"$0's, nominal"]
[null,"Asset Class",{"$f":"dms_y1","v":"2011-12"},{"$f":"dms_y2","v":"2012-13"},{"$f":"dms_y3","v":"2013-14"},{"$f":"dms_y4","v":"2014-15"},{"$f":"dms_y5","v":"2015-16"},{"$f":"dms_y6","v":"2016-17"},{"$f":"dms_y7","v":"2017-18"}]
[null,{"$f":"IF(ISBLANK(B256),\"\",B256)","v":""}]
[null,""]
[null,""]
[null,""]
[null,""]
[null,""]
[null,""]
[null,""]
[null,""]
[null,""]
[null,""]
[null,""]
[null,""]
[null,""]
[null,""]
[null,""]
[null,""]
[null,""]
[null,""]
[null,""]
[null,""]
[null,""]
[null,""]
[null,""]
[null,""]
[null,""]
[null,""]
[null,""]
[null,""]
[null,""]
[null,"Total",{"$f":"SUM(C327:C356)","v":0},0,0,0,0,0,0]
[]
[]
[]
[null,"8.2.6 - DISPOSALS BY ASSET CLASS"]
[null,"ACTUAL"]
[null,null,"EXPENDITURE"]
[null,null,"$0's, nominal"]
[null,"Asset Class",{"$f":"dms_y1","v":"2011-12"},{"$f":"dms_y2","v":"2012-13"},{"$f":"dms_y3","v":"2013-14"},{"$f":"dms_y4","v":"2014-15"},{"$f":"dms_y5","v":"2015-16"},{"$f":"dms_y6","v":"2016-17"},{"$f":"dms_y7","v":"2017-18"}]
[null,{"$f":"IF(ISBLANK(B256),\"\",B256)","v":""}]
[null,""]
[null,""]
[null,""]
[null,""]
[null,""]
[null,""]
[null,""]
[null,""]
[null,""]
[null,""]
[null,""]
[null,""]
[null,""]
[null,""]
[null,""]
[null,""]
[null,""]
[null,""]
[null,""]
[null,""]
[null,""]
[null,""]
[null,""]
[null,""]
[null,""]
[null,""]
[null,""]
[null,""]
[null,""]
[null,"Total",{"$f":"SUM(C366:C395)","v":0},0,0,0,0,0,0]
[]
[]
[]
[null,"8.2.7 - IMMEDIATE EXPENSING CAPEX"]
[null,"ACTUAL - AS INCURRED"]
[null,null,"EXPENDITURE"]
[null,null,"$0's, nominal"]
[null,"Asset class",{"$f":"dms_y1","v":"2011-12"},{"$f":"dms_y2","v":"2012-13"},{"$f":"dms_y3","v":"2013-14"},{"$f":"dms_y4","v":"2014-15"},{"$f":"dms_y5","v":"2015-16"},{"$f":"dms_y6","v":"2016-17"},{"$f":"dms_y7","v":"2017-18"}]
[null,{"$f":"IF(ISBLANK(B256),\"\",B256)","v":""}]
[null,""]
[null,""]
[null,""]
[null,""]
[null,""]
[null,""]
[null,""]
[null,""]
[null,""]
[null,""]
[null,""]
[null,""]
[null,""]
[null,""]
[null,""]
[null,""]
[null,""]
[null,""]
[null,""]
[null,""]
[null,""]
[null,""]
[null,""]
[null,""]
[null,""]
[null,""]
[null,""]
[null,""]
[null,""]
[null,"Total",{"$f":"SUM(C405:C434)","v":0},0,0,0,0,0,0]

{"sheet":"8.4 Opex","index":26,"n_rows":719,"n_cols":9,"rows_kept":719,"cut":false,"hidden":false,"merged":[[723,2,723,5],[730,2,730,5],[731,2,731,5],[732,2,732,5],[733,2,733,5],[724,2,724,5],[725,2,725,5],[726,2,726,5],[727,2,727,5],[728,2,728,5],[729,2,729,5],[718,2,718,5],[719,2,719,5],[720,2,720,5],[721,2,721,5],[722,2,722,5],[81,2,81,8],[117,2,117,8],[118,2,118,8],[258,2,258,8],[259,2,259,8],[188,2,188,8],[189,2,189,8],[7,2,7,8],[8,2,8,8],[43,2,43,8],[44,2,44,8],[80,2,80,8],[615,2,615,8],[363,2,363,8],[364,2,364,8],[399,2,399,8],[400,2,400,8],[436,2,436,8],[437,2,437,8],[473,2,473,8],[474,2,474,8],[544,2,544,8],[545,2,545,8],[614,2,614,8]]}
[null,{"$f":"INDEX(dms_Worksheet_List,MATCH(dms_Model,dms_Model_List))","v":"HISTORICAL ANNUAL REPORTING - FINANCIAL YEARS"}]
[null,{"$f":"INDEX(dms_TradingNameFull_List,MATCH(dms_TradingName,dms_TradingName_List))","v":"Jemena Electricity"}]
[null,{"$f":"dms_Header_Span","v":"2011-12 to 2017-18"}]
[null,"8.4. OPERATING EXPENDITURE"]
[]
[null,"8.4.1 - OPEX - BY PURPOSE"]
[null,"8.4.1.1 - AUDITED STATUTORY ACCOUNTS"]
[null,null,"EXPENDITURE"]
[null,null,"$0's, nominal"]
[null,"Description",{"$f":"dms_y1","v":"2011-12"},{"$f":"dms_y2","v":"2012-13"},{"$f":"dms_y3","v":"2013-14"},{"$f":"dms_y4","v":"2014-15"},{"$f":"dms_y5","v":"2015-16"},{"$f":"dms_y6","v":"2016-17"},{"$f":"dms_y7","v":"2017-18"}]
[null,"Maintenance-Routine",0,0,0,0,0,0,0]
[null,"Maintenance-Condition Based",0,0,0,0,0,0,0]
[null,"Maintenance-Vegetation Control","Incomplete","Incomplete","Incomplete","Incomplete","Incomplete",0,0]
[null,"Maintenance-Emergency Fault",0,0,0,0,0,0,0]
[null,"Maintenance-Inspection","Incomplete","Incomplete","Incomplete","Incomplete","Incomplete",0,0]
[null,"Maintenance-SCADA/Network control",0,0,0,0,0,0,0]
[null,"Maintenance-Other - Standard Control Services (a)",0,0,0,0,0,0,0]
[null,"Maintenance-Metering",0,0,0,0,0,0,0]
[null,"Maintenance-Public Lighting",0,0,0,0,0,0,0]
[null,"Maintenance-Alternative Control - Other",0,0,0,0,0,0,0]
[null,"Maintenance-Negotiated Services",0,0,0,0,0,0,0]
[null,"Maintenance-Unregulated Services",0,0,0,0,"Incomplete","Incomplete","Incomplete"]
[null,"Operating-Network operating costs (excl GSL payments)",1060765.82,598179.36499999999,0,0,0,0,0]
[null,"Operating-Billing & revenue collection",0,0,0,0,0,0,0]
[null,"Operating-Advertising, marketing & promotions",0,0,0,0,0,0,0]
[null,"Operating-Customer service",0,0,0,0,0,0,0]
[null,"Operating-Regulatory",23151.165000000001,23151.165000000001,0,0,0,0,0]
[null,"Operating-Regulatory Reset",0,0,0,0,0,0,0]
[null,"Operating-Information technology (IT)",0,0,0,0,0,0,0]
[null,"Operating-Licence Fees",6618.3100000000049,7589.9949999999999,0,0,0,0,0]
[null,"Operating-GSL payments",18505,4405,0,0,0,0,0]
[null,"Operating-Non-Network Alternatives Costs",0,0,0,0,0,0,0]
[null,"Operating-Debt raising costs",0,0,0,0,0,0,0]
[null,"Operating-Other - Standard Control Services (a)",70969524.984999985,88454121.60499984,103684036.61999984,103920028.97000007,104945079.60925008,111299335.81424999,116289200.045]
[null,"Operating-Metering",21227480.805,10970439,0,0,0,0,0]
[null,"Operating-Public Lighting",0,0,0,0,0,0,0]
[null,"Operating-Alternative Control - Other",159477.94,159477.94,0,0,0,0,0]
[null,"Operating-Negotiated Services",0,0,0,0,0,0,0]
[null,"Operating-Unregulated Services",0,0,0,0,"Incomplete","Incomplete","Incomplete"]
[]
[null,"Total",{"$f":"SUM(C11:C40)","v":93465524.024999976},100217364.06999984,103684036.61999984,103920028.97000007,104945079.60925008,111299335.81424999,116289200.045]
[]
[null,"8.4.1.2 - ADJUSTMENTS"]
[null,null,"EXPENDITURE"]
[null,null,"$0's, nominal"]
[null,"Description",{"$f":"dms_y1","v":"2011-12"},{"$f":"dms_y2","v":"2012-13"},{"$f":"dms_y3","v":"2013-14"},{"$f":"dms_y4","v":"2014-15"},{"$f":"dms_y5","v":"2015-16"},{"$f":"dms_y6","v":"2016-17"},{"$f":"dms_y7","v":"2017-18"}]
[null,{"$f":"IF(ISBLANK(B11),\"\",B11)","v":"Maintenance-Routine"},6966969.256478427,9370383.211305486,12758934.564203363,13069356.003216987,6592879.8384843832,1578384.1796137891,1960544.0512460088]
[null,{"$f":"IF(ISBLANK(B12),\"\",B12)","v":"Maintenance-Condition Based"},4129731.3377174735,3573197.4512100937,3494952.6923300661,3592838.8839491443,2884074.9541078387,2135987.6033448819,2055627.6995399848]
[null,{"$f":"IF(ISBLANK(B13),\"\",B13)","v":"Maintenance-Vegetation Control"},"Incomplete","Incomplete","Incomplete","Incomplete","Incomplete",4066967.0602101726,4306683.5039071664]
[null,"Maintenance-Emergency Fault",5060004.3775323257,6568541.5058072191,7309716.9929348696,6783848.6232241113,5650244.4762985958,5244354.2940378096,5164340.3158735614]
[null,"Maintenance-Inspection","Incomplete","Incomplete","Incomplete","Incomplete","Incomplete",1768147.5386274401,2143129.0407774956]
[null,"Maintenance-SCADA/Network control",68376.843688033274,91398.5,42682.084999999999,34969.584999999999,909494.5399999998,1761090.7495186913,1710094.3295186916]
[null,"Maintenance-Other - Standard Control Services (a)",1149090.4849999999,2229957.4913043696,2640179.8963043685,1731067.9674539664,2590999.6443902431,4238066.0340782432,3790717.6121419678]
[null,"Maintenance-Metering",1803472.8066788679,1811319.4439227998,2347341.6511229095,2269417.3688789774,853477.60500000021,0,0]
[null,"Maintenance-Public Lighting",1677607.4178647918,1924550.2231293686,2982836.1227849694,3111341.8313520541,2334361.5655775177,2449468.1186438696,2940221.6416985001]
[null,"Maintenance-Alternative Control - Other",378371.43125249154,494463.52826429531,501460.38560666086,473106.17761644756,212352.11735950375,0,0]
[null,"Maintenance-Negotiated Services",0,0,0,0,0,0,0]
[null,"Maintenance-Unregulated Services",0,0,0,0,"Incomplete","Incomplete","Incomplete"]
[null,"Operating-Network operating costs (excl GSL payments)",9504847.9972926024,12704757.488921225,11847374.32771235,13290290.836766694,14726103.695601013,16617916.68606792,15654765.64866567]
[null,"Operating-Billing & revenue collection",752654.27830909914,819463.79335221439,1042554.0188661816,762199.67062639387,529277.47263199952,600126.04212599935,741049.74949399976]
[null,"Operating-Advertising, marketing & promotions",602233.67589935847,644383.90880418546,829067.27955139568,724455.8981922064,703180.59432439879,489551.60916490783,109167.39460716289]
[null,"Operating-Customer service",2870564.7462783139,2684423.5731723798,2550737.0145919602,1989013.163395518,4084968.6265243581,5129931.7450723778,4838855.3999222741]
[null,"Operating-Regulatory",2573113.0074052243,2189159.015025733,2222472.1534403847,2772476.5291898232,2587370.9500641054,2820061.9596600886,3491723.9349610694]
[null,"Operating-Regulatory Reset",0,0,2015363.8899999983,3521064.2649999983,1505700.375,0,1646549.085]
[null,"Operating-Information technology (IT)",8731988.7054146025,7044168.1740854867,5582110.7070994405,5174609.7897536838,7531217.8102225829,10435314.832558755,8148728.4655897804]
[null,"Operating-Licence Fees",7950,11150.264999999999,28086.54,12981.520000000002,-3954.7549999999992,0,0]
[null,"Operating-GSL payments",0,33465,67452.304999999993,86758.22,162033.41500000001,181857.5,151150]
[null,"Operating-Non-Network Alternatives Costs",0,0,0,0,0,0,0]
[null,"Operating-Debt raising costs",0,0,0,0,0,0,0]
[null,"Operating-Other - Standard Control Services (a)",-46358766.036558151,-63390215.108711548,-83027290.438827768,-83291535.081076458,-78814268.593859479,-82873349.402411759,-87049242.904060155]
[null,"Operating-Metering",-5082502.5748425517,7334031.9046611097,18655509.652417265,17943588.601121146,13857413.226819564,11963347.608004626,12696877.681185063]
[null,"Operating-Public Lighting",760131.82044183416,922420.50698325306,443948.11585184548,29102.969759562056,23527.3486961579,0,0]
[null,"Operating-Alternative Control - Other",3258959.2066792781,3312331.8756358544,4997947.9408170599,5326330.8157281782,4366888.1440247102,4942738.9824322108,6017201.9999318048]
[null,"Operating-Negotiated Services",0,0,0,0,0,0,0]
[null,"Operating-Unregulated Services",1292549.0644419356,1138405.9596112347,544965.47395431402,645844.92935646104,"Incomplete","Incomplete","Incomplete"]
[null,""]
[null,"Total",{"$f":"SUM(C47:C76)","v":147347.8469739561},1511757.7114847656,-121596.62923836743,53128.568504900322,-6712656.9487325111,-6450036.8592499737,-9481815.3499999456]
[]
[]
[null,"8.4.1.3 - DISTRIBUTION BUSINESS"]
[null,null,"EXPENDITURE"]
[null,null,"$0's, nominal"]
[null,"Description",{"$f":"dms_y1","v":"2011-12"},{"$f":"dms_y2","v":"2012-13"},{"$f":"dms_y3","v":"2013-14"},{"$f":"dms_y4","v":"2014-15"},{"$f":"dms_y5","v":"2015-16"},{"$f":"dms_y6","v":"2016-17"},{"$f":"dms_y7","v":"2017-18"}]
[null,{"$f":"IF(ISBLANK(B11),\"\",B11)","v":"Maintenance-Routine"},6966969.256478427,9370383.211305486,12758934.564203363,13069356.003216987,6592879.8384843832,1578384.1796137891,1960544.0512460088]
[null,"Maintenance-Condition Based",4129731.3377174735,3573197.4512100937,3494952.6923300661,3592838.8839491443,2884074.9541078387,2135987.6033448819,2055627.6995399848]
[null,"Maintenance-Vegetation Control","Incomplete","Incomplete","Incomplete","Incomplete","Incomplete",4066967.0602101726,4306683.5039071664]
[null,"Maintenance-Emergency Fault",5060004.3775323257,6568541.5058072191,7309716.9929348696,6783848.6232241113,5650244.4762985958,5244354.2940378096,5164340.3158735614]
[null,"Maintenance-Inspection","Incomplete","Incomplete","Incomplete","Incomplete","Incomplete",1768147.5386274401,2143129.0407774956]
[null,"Maintenance-SCADA/Network control",68376.843688033274,91398.5,42682.084999999999,34969.584999999999,909494.5399999998,1761090.7495186913,1710094.3295186916]
[null,"Maintenance-Other - Standard Control Services (a)",1149090.4849999999,2229957.4913043696,2640179.8963043685,1731067.9674539664,2590999.6443902431,4238066.0340782432,3790717.6121419678]
[null,"Maintenance-Metering",1803472.8066788679,1811319.4439227998,2347341.6511229095,2269417.3688789774,853477.60500000021,0,0]
[null,"Maintenance-Public Lighting",1677607.4178647918,1924550.2231293686,2982836.1227849694,3111341.8313520541,2334361.5655775177,2449468.1186438696,2940221.6416985001]
[null,"Maintenance-Alternative Control - Other",378371.43125249154,494463.52826429531,501460.38560666086,473106.17761644756,212352.11735950375,0,0]
[null,"Maintenance-Negotiated Services",0,0,0,0,0,0,0]
[null,"Maintenance-Unregulated Services",0,0,0,0,"Incomplete","Incomplete","Incomplete"]
[null,"Operating-Network operating costs (excl GSL payments)",10565613.817292603,13302936.853921223,11847374.32771235,13290290.836766694,14726103.695601013,16617916.68606792,15654765.64866567]
[null,"Operating-Billing & revenue collection",752654.27830909914,819463.79335221439,1042554.0188661816,762199.67062639387,529277.47263199952,600126.04212599935,741049.74949399976]
[null,"Operating-Advertising, marketing & promotions",602233.67589935847,644383.90880418546,829067.27955139568,724455.8981922064,703180.59432439879,489551.60916490783,109167.39460716289]
[null,"Operating-Customer service",2870564.7462783139,2684423.5731723798,2550737.0145919602,1989013.163395518,4084968.6265243581,5129931.7450723778,4838855.3999222741]
[null,{"$f":"IF(ISBLANK(B27),\"\",B27)","v":"Operating-Regulatory"},2596264.1724052243,2212310.1800257331,2222472.1534403847,2772476.5291898232,2587370.9500641054,2820061.9596600886,3491723.9349610694]
[null,"Operating-Regulatory Reset",0,0,2015363.8899999983,3521064.2649999983,1505700.375,0,1646549.085]
[null,"Operating-Information technology (IT)",8731988.7054146025,7044168.1740854867,5582110.7070994405,5174609.7897536838,7531217.8102225829,10435314.832558755,8148728.4655897804]
[null,"Operating-Licence Fees",14568.310000000005,18740.259999999998,28086.54,12981.520000000002,-3954.7549999999992,0,0]
[null,"Operating-GSL payments",18505,37870,67452.304999999993,86758.22,162033.41500000001,181857.5,151150]
[null,"Operating-Non-Network Alternatives Costs",0,0,0,0,0,0,0]
[null,"Operating-Debt raising costs",0,0,0,0,0,0,0]
[null,"Operating-Other - Standard Control Services (a)",24610758.948441841,25063906.4962883,20656746.181172073,20628493.888923615,26130811.015390605,28425986.4118382,29239957.140939802]
[null,"Operating-Metering",16144978.230157446,18304470.904661112,18655509.652417265,17943588.601121146,13857413.226819564,11963347.608004626,12696877.681185063]
[null,"Operating-Public Lighting",760131.82044183416,922420.50698325306,443948.11585184548,29102.969759562056,23527.3486961579,0,0]
[null,"Operating-Alternative Control - Other",3418437.146679278,3471809.8156358544,4997947.9408170599,5326330.8157281782,4366888.1440247102,4942738.9824322108,6017201.9999318048]
[null,"Operating-Negotiated Services",0,0,0,0,0,0,0]
[null,"Operating-Unregulated Services",1292549.0644419356,1138405.9596112347,544965.47395431402,645844.92935646104,"Incomplete","Incomplete","Incomplete"]
[null,""]
[null,"Total",{"$f":"SUM(C84:C113)","v":93612871.871973947},101729121.78148463,103562439.99076149,103973157.53850497,98232422.660517573,104849298.955,106807384.69500002]
[]
[]
[null,"8.4.1.4 - STANDARD CONTROL SERVICES"]
[null,null,"EXPENDITURE"]
[null,null,"$0's, nominal"]
[null,"Description",{"$f":"dms_y1","v":"2011-12"},{"$f":"dms_y2","v":"2012-13"},{"$f":"dms_y3","v":"2013-14"},{"$f":"dms_y4","v":"2014-15"},{"$f":"dms_y5","v":"2015-16"},{"$f":"dms_y6","v":"2016-17"},{"$f":"dms_y7","v":"2017-18"}]
[null,"CPI ADJUSTED FORECAST"]
[null,{"$f":"IF(ISBLANK(B11),\"\",B11)","v":"Maintenance-Routine"},"Incomplete","Incomplete","Incomplete",7984437.6168185994,5328140.9867796777,2642241.5358106182,2893002.914815051]
[null,"Maintenance-Condition Based","Incomplete","Incomplete","Incomplete",4974062.0353198238,3232452.806200109,1030980.4808282743,734492.26217706525]
[null,"Maintenance-Vegetation Control","Incomplete","Incomplete","Incomplete","Incomplete","Incomplete",5243864.1776674092,5331195.7376674097]
[null,"Maintenance-Emergency Fault","Incomplete","Incomplete","Incomplete",3193469.8895473592,4296731.9216033798,5328842.9308530446,5459541.9423477771]
[null,"Maintenance-Inspection","Incomplete","Incomplete","Incomplete","Incomplete","Incomplete",3985625.248925291,4163235.8944262438]
[null,"Maintenance-SCADA/Network control","Incomplete","Incomplete","Incomplete",447020.91546251596,747271.40787227603,1059831.8154081276,1107060.8951887321]
[null,"Maintenance-Other - Standard Control Services (a)","Incomplete","Incomplete","Incomplete",222450.99492231349,915229.32453359035,1565407.5141947169,1557517.4531110157]
[null,"Maintenance-Metering","Incomplete","Incomplete","Incomplete",0,0,0,0]
[null,"Maintenance-Public Lighting","Incomplete","Incomplete","Incomplete",0,0,0,0]
[null,"Maintenance-Alternative Control - Other","Incomplete","Incomplete","Incomplete",0,0,0,0]
[null,"Maintenance-Negotiated Services","Incomplete","Incomplete","Incomplete",0,0,0,0]
[null,"Maintenance-Unregulated Services","Incomplete","Incomplete","Incomplete",0,"Incomplete","Incomplete","Incomplete"]
[null,"Operating-Network operating costs (excl GSL payments)","Incomplete","Incomplete","Incomplete",8265640.8115892541,14390285.654674731,18874814.263390474,18565290.698700875]
[null,"Operating-Billing & revenue collection","Incomplete","Incomplete","Incomplete",1869531.1292379354,1592664.7753809798,1292728.9582844132,1350312.6850921432]
[null,"Operating-Advertising, marketing & promotions","Incomplete","Incomplete","Incomplete",4283441.439504277,1895014.036538111,545642.8484623105,459862.13789723266]
[null,"Operating-Customer service","Incomplete","Incomplete","Incomplete",1893775.5408111371,3124800.0026623635,4900827.8319815714,4868755.5733919255]
[null,"Operating-Regulatory","Incomplete","Incomplete","Incomplete",1076673.3643744795,4838272.1650435589,6894459.8055711724,3838689.7455711728]
[null,"Operating-Regulatory Reset","Incomplete","Incomplete","Incomplete",0,0,0,1408007.46]
[null,"Operating-Information technology (IT)","Incomplete","Incomplete","Incomplete",0,4861423.6289716139,9857852.9485738259,9933539.5796022117]
[null,{"$f":"IF(ISBLANK(B30),\"\",B30)","v":"Operating-Licence Fees"},"Incomplete","Incomplete","Incomplete",1120557.9392966602,1245567.9095512361,1292680.2499076512,1338752.5308912196]
[null,"Operating-GSL payments","Incomplete","Incomplete","Incomplete",18737.98304595134,71160.085002865264,124291.10774731971,126331.66515697821]
[null,"Operating-Non-Network Alternatives Costs","Incomplete","Incomplete","Incomplete",0,47117.069153288328,47117.069153288328,0]
[null,"Operating-Debt raising costs","Incomplete","Incomplete","Incomplete",590380.22565677762,617629.32840911136,640904.03347848239,694710.18218967319]
[null,"Operating-Other - Standard Control Services (a)","Incomplete","Incomplete","Incomplete",32815349.697798416,28411344.139824513,24998787.049139332,27478265.736316178]
[null,"Operating-Metering","Incomplete","Incomplete","Incomplete",0,0,0,0]
[null,"Operating-Public Lighting","Incomplete","Incomplete","Incomplete",0,0,0,0]
[null,"Operating-Alternative Control - Other","Incomplete","Incomplete","Incomplete",0,0,0,0]
[null,"Operating-Negotiated Services","Incomplete","Incomplete","Incomplete",0,0,0,0]
[null,"Operating-Unregulated Services","Incomplete","Incomplete","Incomplete",0,"Incomplete","Incomplete","Incomplete"]
[null,""]
[null,"Total",{"$f":"SUM(C122:C151)","v":0},0,0,68755529.583385497,75615105.242201388,90326899.86937733,91308565.094542906]
[null,"ACTUAL"]
[null,{"$f":"IF(ISBLANK(B11),\"\",B11)","v":"Maintenance-Routine"},6966969.256478427,9370383.2113054842,12758934.564203363,13069356.003216987,6592879.8384843832,1578384.1796137891,1960544.0512460088]
[null,"Maintenance-Condition Based",4129731.337717474,3573197.4512100937,3494952.6923300661,3592838.8839491443,2884074.9541078387,2135987.6033448819,2055627.6995399848]
[null,"Maintenance-Vegetation Control","Incomplete","Incomplete","Incomplete","Incomplete","Incomplete",4066967.0602101726,4306683.5039071664]
[null,"Maintenance-Emergency Fault",5060004.3775323257,6568541.5058072191,7309716.9929348696,6783848.6232241113,5650244.4762985958,5244354.2940378096,5164340.3158735614]
[null,"Maintenance-Inspection","Incomplete","Incomplete","Incomplete","Incomplete","Incomplete",1768147.5386274401,2143129.0407774956]
[null,"Maintenance-SCADA/Network control",68376.843688033274,91398.5,42682.084999999999,34969.584999999999,909494.5399999998,1761090.7495186913,1710094.3295186916]
[null,"Maintenance-Other - Standard Control Services (a)",1149090.4849999999,2229957.4913043696,2640179.8963043685,1731067.9674539664,2590999.6443902431,4238066.0340782432,3790717.6121419678]
[null,"Maintenance-Metering",0,0,0,0,0,0,0]
[null,"Maintenance-Public Lighting",0,0,0,0,0,0,0]
[null,"Maintenance-Alternative Control - Other",0,0,0,0,0,0,0]
[null,"Maintenance-Negotiated Services",0,0,0,0,0,0,0]
[null,"Maintenance-Unregulated Services",0,0,0,0,"Incomplete","Incomplete","Incomplete"]
[null,"Operating-Network operating costs (excl GSL payments)",10565613.817292603,13302936.853921223,11847374.32771235,13290290.836766694,14726103.695601013,16617916.68606792,15654765.64866567]
[null,"Operating-Billing & revenue collection",752654.27830909914,819463.79335221439,1042554.0188661816,762199.67062639387,529277.47263199952,600126.04212599935,741049.74949399976]
[null,"Operating-Advertising, marketing & promotions",602233.67589935847,644383.90880418546,829067.27955139568,724455.8981922064,703180.59432439879,489551.60916490783,109167.39460716289]
[null,"Operating-Customer service",2870564.7462783139,2684423.5731723798,2550737.0145919602,1989013.163395518,4084968.6265243581,5129931.7450723778,4838855.3999222741]
[null,"Operating-Regulatory",2596264.1724052243,2212310.1800257331,2222472.1534403847,2772476.5291898232,2587370.9500641054,2820061.9596600886,3491723.9349610694]
[null,"Operating-Regulatory Reset",0,0,2015363.8899999983,3521064.2649999983,1505700.375,0,1646549.085]
[null,{"$f":"IF(ISBLANK(B29),\"\",B29)","v":"Operating-Information technology (IT)"},7075427.5146253137,6018357.3294603955,4995479.3887401782,4706550.0165760498,7176768.3560555987,10033091.02484292,7712332.2635939494]
[null,"Operating-Licence Fees",14568.310000000005,18740.259999999998,28086.54,12981.520000000002,-3954.7549999999992,0,0]
[null,"Operating-GSL payments",18505,37870,67452.304999999993,86758.22,162033.41500000001,181857.5,151150]
[null,"Operating-Non-Network Alternatives Costs",0,0,0,0,0,0,0]
[null,"Operating-Debt raising costs",0,0,0,0,0,0,0]
[null,"Operating-Other - Standard Control Services (a)",24610758.948441833,25063906.496288296,20656746.181172073,20628493.888923615,26130811.015390605,28425986.4118382,29239957.140939802]
[null,"Operating-Metering",0,0,0,0,0,0,0]
[null,"Operating-Public Lighting",0,0,0,0,0,0,0]
[null,"Operating-Alternative Control - Other",0,0,0,0,0,0,0]
[null,"Operating-Negotiated Services",0,0,0,0,0,0,0]
[null,"Operating-Unregulated Services",0,0,0,0,"Incomplete","Incomplete","Incomplete"]
[null,""]
[null,"Total",{"$f":"SUM(C154:C183)","v":66480762.763668001},72635870.554651603,72501799.329847187,73706365.071514517,76229953.198873147,85091520.438203439,84716687.1701888]
[]
[]
[null,"8.4.1.5 - ALTERNATIVE CONTROL SERVICES"]
[null,"PUBLIC LIGHTING"]
[null,null,"EXPENDITURE"]
[null,null,"$0's, nominal"]
[null,"Description",{"$f":"dms_y1","v":"2011-12"},{"$f":"dms_y2","v":"2012-13"},{"$f":"dms_y3","v":"2013-14"},{"$f":"dms_y4","v":"2014-15"},{"$f":"dms_y5","v":"2015-16"},{"$f":"dms_y6","v":"2016-17"},{"$f":"dms_y7","v":"2017-18"}]
[null,"ENERGY EFFICIENT"]
[null,{"$f":"IF(ISBLANK(B11),\"\",B11)","v":"Maintenance-Routine"},0,0,0,0,0,0,0]
[null,"Maintenance-Condition Based",0,0,0,0,0,0,0]
[null,"Maintenance-Vegetation Control","Incomplete","Incomplete","Incomplete","Incomplete","Incomplete",0,0]
[null,"Maintenance-Emergency Fault",0,0,0,0,0,0,0]
[null,"Maintenance-Inspection","Incomplete","Incomplete","Incomplete","Incomplete","Incomplete",0,0]
[null,"Maintenance-SCADA/Network control",0,0,0,0,0,0,0]
[null,"Maintenance-Other - Standard Control Services (a)",0,0,0,0,0,0,0]
[null,"Maintenance-Metering",0,0,0,0,0,0,0]
[null,"Maintenance-Public Lighting",0,0,0,0,0,0,727473.38]
[null,"Maintenance-Alternative Control - Other",0,0,0,0,0,0,0]
[null,"Maintenance-Negotiated Services",0,0,0,0,0,0,0]
[null,"Maintenance-Unregulated Services",0,0,0,0,"Incomplete","Incomplete","Incomplete"]
[null,"Operating-Network operating costs (excl GSL payments)",0,0,0,0,0,0,0]
[null,"Operating-Billing & revenue collection",0,0,0,0,0,0,0]
[null,"Operating-Advertising, marketing & promotions",0,0,0,0,0,0,0]
[null,"Operating-Customer service",0,0,0,0,0,0,0]
[null,{"$f":"IF(ISBLANK(B27),\"\",B27)","v":"Operating-Regulatory"},0,0,0,0,0,0,0]
[null,"Operating-Regulatory Reset",0,0,0,0,0,0,0]
[null,"Operating-Information technology (IT)",25329.490153539471,0,0,0,0,0,0]
[null,"Operating-Licence Fees",0,0,0,0,0,0,0]
[null,"Operating-GSL payments",0,0,0,0,0,0,0]
[null,"Operating-Non-Network Alternatives Costs",0,0,0,0,0,0,0]
[null,"Operating-Debt raising costs",0,0,0,0,0,0,0]
[null,"Operating-Other - Standard Control Services (a)",0,0,0,0,0,0,0]
[null,"Operating-Metering",0,0,0,0,0,0,0]
[null,"Operating-Public Lighting",30220.169761078876,0,0,0,0,0,0]
[null,"Operating-Alternative Control - Other",0,0,0,0,0,0,0]
[null,"Operating-Negotiated Services",0,0,0,0,0,0,0]
[null,"Operating-Unregulated Services",0,0,0,0,"Incomplete","Incomplete","Incomplete"]
[null,""]
[null,"Total",{"$f":"SUM(C193:C222)","v":55549.659914618343},0,0,0,0,0,727473.38]
[null,"NON-ENERGY EFFICIENT"]
[null,{"$f":"IF(ISBLANK(B11),\"\",B11)","v":"Maintenance-Routine"},0,0,0,0,0,0,0]
[null,"Maintenance-Condition Based",0,0,0,0,0,0,0]
[null,"Maintenance-Vegetation Control","Incomplete","Incomplete","Incomplete","Incomplete","Incomplete",0,0]
[null,"Maintenance-Emergency Fault",0,0,0,0,0,0,0]
[null,"Maintenance-Inspection","Incomplete","Incomplete","Incomplete","Incomplete","Incomplete",0,0]
[null,"Maintenance-SCADA/Network control",0,0,0,0,0,0,0]
[null,{"$f":"IF(ISBLANK(B17),\"\",B17)","v":"Maintenance-Other - Standard Control Services (a)"},0,0,0,0,0,0,0]
[null,"Maintenance-Metering",0,0,0,0,0,0,0]
[null,"Maintenance-Public Lighting",1677607.4178647918,1924550.2231293686,2982836.1227849694,3111341.8313520541,2334361.5655775177,2449468.1186438696,2212748.2616985003]
[null,"Maintenance-Alternative Control - Other",0,0,0,0,0,0,0]
[null,"Maintenance-Negotiated Services",0,0,0,0,0,0,0]
[null,"Maintenance-Unregulated Services",0,0,0,0,"Incomplete","Incomplete","Incomplete"]
[null,"Operating-Network operating costs (excl GSL payments)",0,0,0,0,0,0,0]
[null,"Operating-Billing & revenue collection",0,0,0,0,0,0,0]
[null,"Operating-Advertising, marketing & promotions",0,0,0,0,0,0,0]
[null,"Operating-Customer service",0,0,0,0,0,0,0]
[null,"Operating-Regulatory",0,0,0,0,0,0,0]
[null,"Operating-Regulatory Reset",0,0,0,0,0,0,0]
[null,"Operating-Information technology (IT)",432027.42794800352,299007.10256237391,183194.94720733311,154436.70216609875,158076.09119518643,274256.92787011113,243327.57829818089]
[null,"Operating-Licence Fees",0,0,0,0,0,0,0]
[null,"Operating-GSL payments",0,0,0,0,0,0,0]
[null,"Operating-Non-Network Alternatives Costs",0,0,0,0,0,0,0]
[null,"Operating-Debt raising costs",0,0,0,0,0,0,0]
[null,"Operating-Other - Standard Control Services (a)",0,0,0,0,0,0,0]
[null,"Operating-Metering",0,0,0,0,0,0,0]
[null,"Operating-Public Lighting",729911.65068075515,922420.50698325306,443948.11585184548,29102.969759562056,23527.3486961579,0,0]
[null,"Operating-Alternative Control - Other",0,0,0,0,0,0,0]
[null,"Operating-Negotiated Services",0,0,0,0,0,0,0]
[null,"Operating-Unregulated Services",0,0,0,0,"Incomplete","Incomplete","Incomplete"]
[null,""]
[null,"Total",{"$f":"SUM(C225:C254)","v":2839546.4964935505},3145977.8326749955,3609979.185844148,3294881.5032777148,2515965.0054688621,2723725.0465139807,2456075.8399966811]
[]
[]
[null,"OTHER"]
[null,null,"EXPENDITURE"]
[null,null,"$0's, nominal"]
[null,"Description",{"$f":"dms_y1","v":"2011-12"},{"$f":"dms_y2","v":"2012-13"},{"$f":"dms_y3","v":"2013-14"},{"$f":"dms_y4","v":"2014-15"},{"$f":"dms_y5","v":"2015-16"},{"$f":"dms_y6","v":"2016-17"},{"$f":"dms_y7","v":"2017-18"}]
[null,"CONNECTION SERVICES"]
[null,{"$f":"IF(ISBLANK(B11),\"\",B11)","v":"Maintenance-Routine"},"Incomplete","Incomplete","Incomplete","Incomplete","Incomplete",0,0]
[null,"Maintenance-Condition Based","Incomplete","Incomplete","Incomplete","Incomplete","Incomplete",0,0]
[null,"Maintenance-Vegetation Control","Incomplete","Incomplete","Incomplete","Incomplete","Incomplete",0,0]
[null,"Maintenance-Emergency Fault","Incomplete","Incomplete","Incomplete","Incomplete","Incomplete",0,0]
[null,"Maintenance-Inspection","Incomplete","Incomplete","Incomplete","Incomplete","Incomplete",0,0]
[null,"Maintenance-SCADA/Network control","Incomplete","Incomplete","Incomplete","Incomplete","Incomplete",0,0]
[null,"Maintenance-Other - Standard Control Services (a)","Incomplete","Incomplete","Incomplete","Incomplete","Incomplete",0,0]
[null,"Maintenance-Metering","Incomplete","Incomplete","Incomplete","Incomplete","Incomplete",0,0]
[null,"Maintenance-Public Lighting","Incomplete","Incomplete","Incomplete","Incomplete","Incomplete",0,0]
[null,"Maintenance-Alternative Control - Other","Incomplete","Incomplete","Incomplete","Incomplete","Incomplete",0,0]
[null,"Maintenance-Negotiated Services","Incomplete","Incomplete","Incomplete","Incomplete","Incomplete",0,0]
[null,"Maintenance-Unregulated Services","Incomplete","Incomplete","Incomplete","Incomplete","Incomplete","Incomplete","Incomplete"]
[null,"Operating-Network operating costs (excl GSL payments)","Incomplete","Incomplete","Incomplete","Incomplete","Incomplete",0,0]
[null,"Operating-Billing & revenue collection","Incomplete","Incomplete","Incomplete","Incomplete","Incomplete",0,0]
[null,"Operating-Advertising, marketing & promotions","Incomplete","Incomplete","Incomplete","Incomplete","Incomplete",0,0]
[null,"Operating-Customer service","Incomplete","Incomplete","Incomplete","Incomplete","Incomplete",0,0]
[null,"Operating-Regulatory","Incomplete","Incomplete","Incomplete","Incomplete","Incomplete",0,0]
[null,"Operating-Regulatory Reset","Incomplete","Incomplete","Incomplete","Incomplete","Incomplete",0,0]
[null,"Operating-Information technology (IT)","Incomplete","Incomplete","Incomplete","Incomplete","Incomplete",0,0]
[null,"Operating-Licence Fees","Incomplete","Incomplete","Incomplete","Incomplete","Incomplete",0,0]
[null,{"$f":"IF(ISBLANK(B31),\"\",B31)","v":"Operating-GSL payments"},"Incomplete","Incomplete","Incomplete","Incomplete","Incomplete",0,0]
[null,"Operating-Non-Network Alternatives Costs","Incomplete","Incomplete","Incomplete","Incomplete","Incomplete",0,0]
[null,"Operating-Debt raising costs","Incomplete","Incomplete","Incomplete","Incomplete","Incomplete",0,0]
[null,"Operating-Other - Standard Control Services (a)","Incomplete","Incomplete","Incomplete","Incomplete","Incomplete",0,0]
[null,"Operating-Metering","Incomplete","Incomplete","Incomplete","Incomplete","Incomplete",0,0]
[null,"Operating-Public Lighting","Incomplete","Incomplete","Incomplete","Incomplete","Incomplete",0,0]
[null,"Operating-Alternative Control - Other","Incomplete","Incomplete","Incomplete","Incomplete","Incomplete",0,0]
[null,"Operating-Negotiated Services","Incomplete","Incomplete","Incomplete","Incomplete","Incomplete",0,0]
[null,"Operating-Unregulated Services","Incomplete","Incomplete","Incomplete","Incomplete","Incomplete","Incomplete","Incomplete"]
[null,""]
[null,"Total",{"$f":"SUM(C263:C292)","v":0},0,0,0,0,0,0]
[null,"METERING SERVICES"]
[null,{"$f":"IF(ISBLANK(B11),\"\",B11)","v":"Maintenance-Routine"},"Incomplete","Incomplete","Incomplete","Incomplete","Incomplete",0,0]
[null,"Maintenance-Condition Based","Incomplete","Incomplete","Incomplete","Incomplete","Incomplete",0,0]
[null,"Maintenance-Vegetation Control","Incomplete","Incomplete","Incomplete","Incomplete","Incomplete",0,0]
[null,"Maintenance-Emergency Fault","Incomplete","Incomplete","Incomplete","Incomplete","Incomplete",0,0]
[null,"Maintenance-Inspection","Incomplete","Incomplete","Incomplete","Incomplete","Incomplete",0,0]
[null,"Maintenance-SCADA/Network control","Incomplete","Incomplete","Incomplete","Incomplete","Incomplete",0,0]
[null,"Maintenance-Other - Standard Control Services (a)","Incomplete","Incomplete","Incomplete","Incomplete","Incomplete",0,0]
[null,"Maintenance-Metering","Incomplete","Incomplete","Incomplete","Incomplete","Incomplete",0,0]
[null,"Maintenance-Public Lighting","Incomplete","Incomplete","Incomplete","Incomplete","Incomplete",0,0]
[null,"Maintenance-Alternative Control - Other","Incomplete","Incomplete","Incomplete","Incomplete","Incomplete",0,0]
[null,"Maintenance-Negotiated Services","Incomplete","Incomplete","Incomplete","Incomplete","Incomplete",0,0]
[null,"Maintenance-Unregulated Services","Incomplete","Incomplete","Incomplete","Incomplete","Incomplete","Incomplete","Incomplete"]
[null,"Operating-Network operating costs (excl GSL payments)","Incomplete","Incomplete","Incomplete","Incomplete","Incomplete",0,0]
[null,{"$f":"IF(ISBLANK(B24),\"\",B24)","v":"Operating-Billing & revenue collection"},"Incomplete","Incomplete","Incomplete","Incomplete","Incomplete",0,0]
[null,"Operating-Advertising, marketing & promotions","Incomplete","Incomplete","Incomplete","Incomplete","Incomplete",0,0]
[null,"Operating-Customer service","Incomplete","Incomplete","Incomplete","Incomplete","Incomplete",0,0]
[null,"Operating-Regulatory","Incomplete","Incomplete","Incomplete","Incomplete","Incomplete",0,0]
[null,"Operating-Regulatory Reset","Incomplete","Incomplete","Incomplete","Incomplete","Incomplete",0,0]
[null,"Operating-Information technology (IT)","Incomplete","Incomplete","Incomplete","Incomplete","Incomplete",0,0]
[null,"Operating-Licence Fees","Incomplete","Incomplete","Incomplete","Incomplete","Incomplete",0,0]
[null,"Operating-GSL payments","Incomplete","Incomplete","Incomplete","Incomplete","Incomplete",0,0]
[null,"Operating-Non-Network Alternatives Costs","Incomplete","Incomplete","Incomplete","Incomplete","Incomplete",0,0]
[null,"Operating-Debt raising costs","Incomplete","Incomplete","Incomplete","Incomplete","Incomplete",0,0]
[null,"Operating-Other - Standard Control Services (a)","Incomplete","Incomplete","Incomplete","Incomplete","Incomplete",0,0]
[null,"Operating-Metering","Incomplete","Incomplete","Incomplete","Incomplete","Incomplete",11963347.608004626,12696877.681185063]
[null,"Operating-Public Lighting","Incomplete","Incomplete","Incomplete","Incomplete","Incomplete",0,0]
[null,"Operating-Alternative Control - Other","Incomplete","Incomplete","Incomplete","Incomplete","Incomplete",0,0]
[null,"Operating-Negotiated Services","Incomplete","Incomplete","Incomplete","Incomplete","Incomplete",0,0]
[null,"Operating-Unregulated Services","Incomplete","Incomplete","Incomplete","Incomplete","Incomplete","Incomplete","Incomplete"]
[null,""]
[null,"Total",{"$f":"SUM(C295:C324)","v":0},0,0,0,0,11963347.608004626,12696877.681185063]
[null,"ANCILLARY NETWORK SERVICES"]
[null,{"$f":"IF(ISBLANK(B11),\"\",B11)","v":"Maintenance-Routine"},"Incomplete","Incomplete","Incomplete","Incomplete","Incomplete",0,0]
[null,"Maintenance-Condition Based","Incomplete","Incomplete","Incomplete","Incomplete","Incomplete",0,0]
[null,"Maintenance-Vegetation Control","Incomplete","Incomplete","Incomplete","Incomplete","Incomplete",0,0]
[null,"Maintenance-Emergency Fault","Incomplete","Incomplete","Incomplete","Incomplete","Incomplete",0,0]
[null,"Maintenance-Inspection","Incomplete","Incomplete","Incomplete","Incomplete","Incomplete",0,0]
[null,"Maintenance-SCADA/Network control","Incomplete","Incomplete","Incomplete","Incomplete","Incomplete",0,0]
[null,{"$f":"IF(ISBLANK(B17),\"\",B17)","v":"Maintenance-Other - Standard Control Services (a)"},"Incomplete","Incomplete","Incomplete","Incomplete","Incomplete",0,0]
[null,"Maintenance-Metering","Incomplete","Incomplete","Incomplete","Incomplete","Incomplete",0,0]
[null,"Maintenance-Public Lighting","Incomplete","Incomplete","Incomplete","Incomplete","Incomplete",0,0]
[null,"Maintenance-Alternative Control - Other","Incomplete","Incomplete","Incomplete","Incomplete","Incomplete",0,0]
[null,"Maintenance-Negotiated Services","Incomplete","Incomplete","Incomplete","Incomplete","Incomplete",0,0]
[null,"Maintenance-Unregulated Services","Incomplete","Incomplete","Incomplete","Incomplete","Incomplete","Incomplete","Incomplete"]
[null,"Operating-Network operating costs (excl GSL payments)","Incomplete","Incomplete","Incomplete","Incomplete","Incomplete",0,0]
[null,"Operating-Billing & revenue collection","Incomplete","Incomplete","Incomplete","Incomplete","Incomplete",0,0]
[null,"Operating-Advertising, marketing & promotions","Incomplete","Incomplete","Incomplete","Incomplete","Incomplete",0,0]
[null,"Operating-Customer service","Incomplete","Incomplete","Incomplete","Incomplete","Incomplete",0,0]
[null,"Operating-Regulatory","Incomplete","Incomplete","Incomplete","Incomplete","Incomplete",0,0]
[null,"Operating-Regulatory Reset","Incomplete","Incomplete","Incomplete","Incomplete","Incomplete",0,0]
[null,"Operating-Information technology (IT)","Incomplete","Incomplete","Incomplete","Incomplete","Incomplete",127966.87984572415,193068.62369765059]
[null,"Operating-Licence Fees","Incomplete","Incomplete","Incomplete","Incomplete","Incomplete",0,0]
[null,"Operating-GSL payments","Incomplete","Incomplete","Incomplete","Incomplete","Incomplete",0,0]
[null,"Operating-Non-Network Alternatives Costs","Incomplete","Incomplete","Incomplete","Incomplete","Incomplete",0,0]
[null,"Operating-Debt raising costs","Incomplete","Incomplete","Incomplete","Incomplete","Incomplete",0,0]
[null,"Operating-Other - Standard Control Services (a)","Incomplete","Incomplete","Incomplete","Incomplete","Incomplete",0,0]
[null,"Operating-Metering","Incomplete","Incomplete","Incomplete","Incomplete","Incomplete",0,0]
[null,"Operating-Public Lighting","Incomplete","Incomplete","Incomplete","Incomplete","Incomplete",0,0]
[null,"Operating-Alternative Control - Other","Incomplete","Incomplete","Incomplete","Incomplete","Incomplete",4942738.9824322108,6017201.9999318048]
[null,"Operating-Negotiated Services","Incomplete","Incomplete","Incomplete","Incomplete","Incomplete",0,0]
[null,"Operating-Unregulated Services","Incomplete","Incomplete","Incomplete","Incomplete","Incomplete","Incomplete","Incomplete"]
[null,""]
[null,"Total",{"$f":"SUM(C327:C356)","v":0},0,0,0,0,5070705.8622779353,6210270.6236294555]
[]
[]
[]
[]
[null,"8.4.2 - OPEX - BY PURPOSE - RELATED PARTY MARGINS ONLY"]
[null,"8.4.2.1 - AUDITED STATUTORY ACCOUNTS"]
[null,null,"EXPENDITURE"]
[null,null,"$0's, nominal"]
[null,"Description",{"$f":"dms_y1","v":"2011-12"},{"$f":"dms_y2","v":"2012-13"},{"$f":"dms_y3","v":"2013-14"},{"$f":"dms_y4","v":"2014-15"},{"$f":"dms_y5","v":"2015-16"},{"$f":"dms_y6","v":"2016-17"},{"$f":"dms_y7","v":"2017-18"}]
[null,"Maintenance-Routine",0,0,0,0,0,0,0]
[null,"Maintenance-Condition Based",0,0,0,0,0,0,0]
[null,"Maintenance-Vegetation Control",0,0,0,0,0,0,0]
[null,"Maintenance-Emergency Fault",0,0,0,0,0,0,0]
[null,"Maintenance-Inspection",0,0,0,0,0,0,0]
[null,"Maintenance-SCADA/Network control",0,0,0,0,0,0,0]
[null,"Maintenance-Other - Standard Control Services (a)",0,0,0,0,0,0,0]
[null,"Maintenance-Metering",0,0,0,0,0,0,0]
[null,"Maintenance-Public Lighting",0,0,0,0,0,0,0]
[null,"Maintenance-Alternative Control - Other",0,0,0,0,0,0,0]
[null,"Maintenance-Negotiated Services",0,0,0,0,0,0,0]
[null,"Maintenance-Unregulated Services",0,0,0,0,0,0,0]
[null,"Operating-Network operating costs (excl GSL payments)",0,0,0,0,0,0,0]
[null,"Operating-Billing & revenue collection",0,0,0,0,0,0,0]
[null,"Operating-Advertising, marketing & promotions",0,0,0,0,0,0,0]
[null,"Operating-Customer service",0,0,0,0,0,0,0]
[null,"Operating-Regulatory",0,0,0,0,0,0,0]
[null,"Operating-Regulatory Reset",0,0,0,0,0,0,0]
[null,"Operating-Information technology (IT)",0,0,0,0,0,0,0]
[null,"Operating-Licence Fees",0,0,0,0,0,0,0]
[null,"Operating-GSL payments",0,0,0,0,0,0,0]
[null,"Operating-Non-Network Alternatives Costs",0,0,0,0,0,0,0]
[null,"Operating-Debt raising costs",0,0,0,0,0,0,0]
[null,"Operating-Other - Standard Control Services (a)",0,0,0,0,0,0,0]
[null,"Operating-Metering",0,0,0,0,0,0,0]
[null,"Operating-Public Lighting",0,0,0,0,0,0,0]
[null,"Operating-Alternative Control - Other",0,0,0,0,0,0,0]
[null,"Operating-Negotiated Services",0,0,0,0,0,0,0]
[null,"Operating-Unregulated Services",0,0,0,0,0,0,0]
[]
[null,"Total",{"$f":"SUM(C367:C396)","v":0},0,0,0,0,0,0]
[]
[null,"8.4.2.2 - ADJUSTMENTS"]
[null,null,"EXPENDITURE"]
[null,null,"$0's, nominal"]
[null,"Description",{"$f":"dms_y1","v":"2011-12"},{"$f":"dms_y2","v":"2012-13"},{"$f":"dms_y3","v":"2013-14"},{"$f":"dms_y4","v":"2014-15"},{"$f":"dms_y5","v":"2015-16"},{"$f":"dms_y6","v":"2016-17"},{"$f":"dms_y7","v":"2017-18"}]
[null,{"$f":"IF(ISBLANK(B367),\"\",B367)","v":"Maintenance-Routine"},0,0,0,0,0,0,0]
[null,{"$f":"IF(ISBLANK(B368),\"\",B368)","v":"Maintenance-Condition Based"},0,0,0,0,0,0,0]
[null,{"$f":"IF(ISBLANK(B369),\"\",B369)","v":"Maintenance-Vegetation Control"},0,0,0,0,0,0,0]
[null,"Maintenance-Emergency Fault",0,0,0,0,0,0,0]
[null,"Maintenance-Inspection",0,0,0,0,0,0,0]
[null,"Maintenance-SCADA/Network control",0,0,0,0,0,0,0]
[null,"Maintenance-Other - Standard Control Services (a)",0,0,0,0,0,0,0]
[null,"Maintenance-Metering",0,0,0,0,0,0,0]
[null,"Maintenance-Public Lighting",0,0,0,0,0,0,0]
[null,"Maintenance-Alternative Control - Other",0,0,0,0,0,0,0]
[null,"Maintenance-Negotiated Services",0,0,0,0,0,0,0]
[null,"Maintenance-Unregulated Services",0,0,0,0,0,0,0]
[null,"Operating-Network operating costs (excl GSL payments)",0,0,0,0,0,0,0]
[null,"Operating-Billing & revenue collection",0,0,0,0,0,0,0]
[null,"Operating-Advertising, marketing & promotions",0,0,0,0,0,0,0]
[null,"Operating-Customer service",0,0,0,0,0,0,0]
[null,"Operating-Regulatory",0,0,0,0,0,0,0]
[null,"Operating-Regulatory Reset",0,0,0,0,0,0,0]
[null,"Operating-Information technology (IT)",0,0,0,0,0,0,0]
[null,"Operating-Licence Fees",0,0,0,0,0,0,0]
[null,"Operating-GSL payments",0,0,0,0,0,0,0]
[null,"Operating-Non-Network Alternatives Costs",0,0,0,0,0,0,0]
[null,"Operating-Debt raising costs",0,0,0,0,0,0,0]
[null,"Operating-Other - Standard Control Services (a)",0,0,0,0,0,0,0]
[null,"Operating-Metering",0,0,0,0,0,0,0]
[null,"Operating-Public Lighting",0,0,0,0,0,0,0]
[null,"Operating-Alternative Control - Other",0,0,0,0,0,0,0]
[null,"Operating-Negotiated Services",0,0,0,0,0,0,0]
[null,"Operating-Unregulated Services",0,0,0,0,0,0,0]
[null,""]
[null,"Total",{"$f":"SUM(C403:C432)","v":0},0,0,0,0,0,0]
[]
[]
[null,"8.4.2.3 - DISTRIBUTION BUSINESS"]
[null,null,"EXPENDITURE"]
[null,null,"$0's, nominal"]
[null,"Description",{"$f":"dms_y1","v":"2011-12"},{"$f":"dms_y2","v":"2012-13"},{"$f":"dms_y3","v":"2013-14"},{"$f":"dms_y4","v":"2014-15"},{"$f":"dms_y5","v":"2015-16"},{"$f":"dms_y6","v":"2016-17"},{"$f":"dms_y7","v":"2017-18"}]
[null,{"$f":"IF(ISBLANK(B367),\"\",B367)","v":"Maintenance-Routine"},0,0,0,0,0,0,0]
[null,"Maintenance-Condition Based",0,0,0,0,0,0,0]
[null,"Maintenance-Vegetation Control",0,0,0,0,0,0,0]
[null,"Maintenance-Emergency Fault",0,0,0,0,0,0,0]
[null,"Maintenance-Inspection",0,0,0,0,0,0,0]
[null,"Maintenance-SCADA/Network control",0,0,0,0,0,0,0]
[null,"Maintenance-Other - Standard Control Services (a)",0,0,0,0,0,0,0]
[null,"Maintenance-Metering",0,0,0,0,0,0,0]
[null,"Maintenance-Public Lighting",0,0,0,0,0,0,0]
[null,"Maintenance-Alternative Control - Other",0,0,0,0,0,0,0]
[null,"Maintenance-Negotiated Services",0,0,0,0,0,0,0]
[null,"Maintenance-Unregulated Services",0,0,0,0,0,0,0]
[null,"Operating-Network operating costs (excl GSL payments)",0,0,0,0,0,0,0]
[null,"Operating-Billing & revenue collection",0,0,0,0,0,0,0]
[null,"Operating-Advertising, marketing & promotions",0,0,0,0,0,0,0]
[null,"Operating-Customer service",0,0,0,0,0,0,0]
[null,{"$f":"IF(ISBLANK(B383),\"\",B383)","v":"Operating-Regulatory"},0,0,0,0,0,0,0]
[null,"Operating-Regulatory Reset",0,0,0,0,0,0,0]
[null,"Operating-Information technology (IT)",0,0,0,0,0,0,0]
[null,"Operating-Licence Fees",0,0,0,0,0,0,0]
[null,"Operating-GSL payments",0,0,0,0,0,0,0]
[null,"Operating-Non-Network Alternatives Costs",0,0,0,0,0,0,0]
[null,"Operating-Debt raising costs",0,0,0,0,0,0,0]
[null,"Operating-Other - Standard Control Services (a)",0,0,0,0,0,0,0]
[null,"Operating-Metering",0,0,0,0,0,0,0]
[null,"Operating-Public Lighting",0,0,0,0,0,0,0]
[null,"Operating-Alternative Control - Other",0,0,0,0,0,0,0]
[null,"Operating-Negotiated Services",0,0,0,0,0,0,0]
[null,"Operating-Unregulated Services",0,0,0,0,0,0,0]
[null,""]
[null,"Total",{"$f":"SUM(C440:C469)","v":0},0,0,0,0,0,0]
[]
[]
[null,"8.4.2.4 - STANDARD CONTROL SERVICES"]
[null,null,"EXPENDITURE"]
[null,null,"$0's, nominal"]
[null,"Description",{"$f":"dms_y1","v":"2011-12"},{"$f":"dms_y2","v":"2012-13"},{"$f":"dms_y3","v":"2013-14"},{"$f":"dms_y4","v":"2014-15"},{"$f":"dms_y5","v":"2015-16"},{"$f":"dms_y6","v":"2016-17"},{"$f":"dms_y7","v":"2017-18"}]
[null,"CPI ADJUSTED FORECAST"]
[null,{"$f":"IF(ISBLANK(B367),\"\",B367)","v":"Maintenance-Routine"},0,0,0,0,0,0,0]
[null,"Maintenance-Condition Based",0,0,0,0,0,0,0]
[null,"Maintenance-Vegetation Control",0,0,0,0,0,0,0]
[null,"Maintenance-Emergency Fault",0,0,0,0,0,0,0]
[null,"Maintenance-Inspection",0,0,0,0,0,0,0]
[null,"Maintenance-SCADA/Network control",0,0,0,0,0,0,0]
[null,"Maintenance-Other - Standard Control Services (a)",0,0,0,0,0,0,0]
[null,"Maintenance-Metering",0,0,0,0,0,0,0]
[null,"Maintenance-Public Lighting",0,0,0,0,0,0,0]
[null,"Maintenance-Alternative Control - Other",0,0,0,0,0,0,0]
[null,"Maintenance-Negotiated Services",0,0,0,0,0,0,0]
[null,"Maintenance-Unregulated Services",0,0,0,0,0,0,0]
[null,"Operating-Network operating costs (excl GSL payments)",0,0,0,0,0,0,0]
[null,"Operating-Billing & revenue collection",0,0,0,0,0,0,0]
[null,"Operating-Advertising, marketing & promotions",0,0,0,0,0,0,0]
[null,"Operating-Customer service",0,0,0,0,0,0,0]
[null,{"$f":"IF(ISBLANK(B383),\"\",B383)","v":"Operating-Regulatory"},0,0,0,0,0,0,0]
[null,"Operating-Regulatory Reset",0,0,0,0,0,0,0]
[null,"Operating-Information technology (IT)",0,0,0,0,0,0,0]
[null,"Operating-Licence Fees",0,0,0,0,0,0,0]
[null,"Operating-GSL payments",0,0,0,0,0,0,0]
[null,"Operating-Non-Network Alternatives Costs",0,0,0,0,0,0,0]
[null,"Operating-Debt raising costs",0,0,0,0,0,0,0]
[null,"Operating-Other - Standard Control Services (a)",0,0,0,0,0,0,0]
[null,"Operating-Metering",0,0,0,0,0,0,0]
[null,"Operating-Public Lighting",0,0,0,0,0,0,0]
[null,"Operating-Alternative Control - Other",0,0,0,0,0,0,0]
[null,"Operating-Negotiated Services",0,0,0,0,0,0,0]
[null,"Operating-Unregulated Services",0,0,0,0,0,0,0]
[null,""]
[null,"Total",{"$f":"SUM(C478:C507)","v":0},0,0,0,0,0,0]
[null,"ACTUAL"]
[null,{"$f":"IF(ISBLANK(B367),\"\",B367)","v":"Maintenance-Routine"},0,0,0,0,0,0,0]
[null,"Maintenance-Condition Based",0,0,0,0,0,0,0]
[null,"Maintenance-Vegetation Control",0,0,0,0,0,0,0]
[null,"Maintenance-Emergency Fault",0,0,0,0,0,0,0]
[null,"Maintenance-Inspection",0,0,0,0,0,0,0]
[null,"Maintenance-SCADA/Network control",0,0,0,0,0,0,0]
[null,"Maintenance-Other - Standard Control Services (a)",0,0,0,0,0,0,0]
[null,"Maintenance-Metering",0,0,0,0,0,0,0]
[null,"Maintenance-Public Lighting",0,0,0,0,0,0,0]
[null,"Maintenance-Alternative Control - Other",0,0,0,0,0,0,0]
[null,"Maintenance-Negotiated Services",0,0,0,0,0,0,0]
[null,"Maintenance-Unregulated Services",0,0,0,0,0,0,0]
[null,"Operating-Network operating costs (excl GSL payments)",0,0,0,0,0,0,0]
[null,{"$f":"IF(ISBLANK(B380),\"\",B380)","v":"Operating-Billing & revenue collection"},0,0,0,0,0,0,0]
[null,"Operating-Advertising, marketing & promotions",0,0,0,0,0,0,0]
[null,"Operating-Customer service",0,0,0,0,0,0,0]
[null,"Operating-Regulatory",0,0,0,0,0,0,0]
[null,"Operating-Regulatory Reset",0,0,0,0,0,0,0]
[null,"Operating-Information technology (IT)",0,0,0,0,0,0,0]
[null,"Operating-Licence Fees",0,0,0,0,0,0,0]
[null,"Operating-GSL payments",0,0,0,0,0,0,0]
[null,"Operating-Non-Network Alternatives Costs",0,0,0,0,0,0,0]
[null,"Operating-Debt raising costs",0,0,0,0,0,0,0]
[null,"Operating-Other - Standard Control Services (a)",0,0,0,0,0,0,0]
[null,"Operating-Metering",0,0,0,0,0,0,0]
[null,"Operating-Public Lighting",0,0,0,0,0,0,0]
[null,"Operating-Alternative Control - Other",0,0,0,0,0,0,0]
[null,"Operating-Negotiated Services",0,0,0,0,0,0,0]
[null,"Operating-Unregulated Services",0,0,0,0,0,0,0]
[null,""]
[null,"Total",{"$f":"SUM(C510:C539)","v":0},0,0,0,0,0,0]
[]
[]
[null,"8.4.2.5 - ALTERNATIVE CONTROL SERVICES"]
[null,"PUBLIC LIGHTING"]
[null,null,"EXPENDITURE"]
[null,null,"$0's, nominal"]
[null,"Description",{"$f":"dms_y1","v":"2011-12"},{"$f":"dms_y2","v":"2012-13"},{"$f":"dms_y3","v":"2013-14"},{"$f":"dms_y4","v":"2014-15"},{"$f":"dms_y5","v":"2015-16"},{"$f":"dms_y6","v":"2016-17"},{"$f":"dms_y7","v":"2017-18"}]
[null,"ENERGY EFFICIENT"]
[null,{"$f":"IF(ISBLANK(B367),\"\",B367)","v":"Maintenance-Routine"},0,0,0,0,0,0,0]
[null,"Maintenance-Condition Based",0,0,0,0,0,0,0]
[null,"Maintenance-Vegetation Control",0,0,0,0,0,0,0]
[null,"Maintenance-Emergency Fault",0,0,0,0,0,0,0]
[null,"Maintenance-Inspection",0,0,0,0,0,0,0]
[null,"Maintenance-SCADA/Network control",0,0,0,0,0,0,0]
[null,"Maintenance-Other - Standard Control Services (a)",0,0,0,0,0,0,0]
[null,"Maintenance-Metering",0,0,0,0,0,0,0]
[null,"Maintenance-Public Lighting",0,0,0,0,0,0,0]
[null,"Maintenance-Alternative Control - Other",0,0,0,0,0,0,0]
[null,"Maintenance-Negotiated Services",0,0,0,0,0,0,0]
[null,"Maintenance-Unregulated Services",0,0,0,0,0,0,0]
[null,"Operating-Network operating costs (excl GSL payments)",0,0,0,0,0,0,0]
[null,"Operating-Billing & revenue collection",0,0,0,0,0,0,0]
[null,"Operating-Advertising, marketing & promotions",0,0,0,0,0,0,0]
[null,"Operating-Customer service",0,0,0,0,0,0,0]
[null,{"$f":"IF(ISBLANK(B383),\"\",B383)","v":"Operating-Regulatory"},0,0,0,0,0,0,0]
[null,"Operating-Regulatory Reset",0,0,0,0,0,0,0]
[null,"Operating-Information technology (IT)",0,0,0,0,0,0,0]
[null,"Operating-Licence Fees",0,0,0,0,0,0,0]
[null,"Operating-GSL payments",0,0,0,0,0,0,0]
[null,"Operating-Non-Network Alternatives Costs",0,0,0,0,0,0,0]
[null,"Operating-Debt raising costs",0,0,0,0,0,0,0]
[null,"Operating-Other - Standard Control Services (a)",0,0,0,0,0,0,0]
[null,"Operating-Metering",0,0,0,0,0,0,0]
[null,"Operating-Public Lighting",0,0,0,0,0,0,0]
[null,"Operating-Alternative Control - Other",0,0,0,0,0,0,0]
[null,"Operating-Negotiated Services",0,0,0,0,0,0,0]
[null,"Operating-Unregulated Services",0,0,0,0,0,0,0]
[null,""]
[null,"Total",{"$f":"SUM(C549:C578)","v":0},0,0,0,0,0,0]
[null,"NON-ENERGY EFFICIENT"]
[null,{"$f":"IF(ISBLANK(B367),\"\",B367)","v":"Maintenance-Routine"},0,0,0,0,0,0,0]
[null,"Maintenance-Condition Based",0,0,0,0,0,0,0]
[null,"Maintenance-Vegetation Control",0,0,0,0,0,0,0]
[null,"Maintenance-Emergency Fault",0,0,0,0,0,0,0]
[null,"Maintenance-Inspection",0,0,0,0,0,0,0]
[null,"Maintenance-SCADA/Network control",0,0,0,0,0,0,0]
[null,"Maintenance-Other - Standard Control Services (a)",0,0,0,0,0,0,0]
[null,"Maintenance-Metering",0,0,0,0,0,0,0]
[null,"Maintenance-Public Lighting",0,0,0,0,0,0,0]
[null,"Maintenance-Alternative Control - Other",0,0,0,0,0,0,0]
[null,"Maintenance-Negotiated Services",0,0,0,0,0,0,0]
[null,"Maintenance-Unregulated Services",0,0,0,0,0,0,0]
[null,"Operating-Network operating costs (excl GSL payments)",0,0,0,0,0,0,0]
[null,{"$f":"IF(ISBLANK(B380),\"\",B380)","v":"Operating-Billing & revenue collection"},0,0,0,0,0,0,0]
[null,"Operating-Advertising, marketing & promotions",0,0,0,0,0,0,0]
[null,"Operating-Customer service",0,0,0,0,0,0,0]
[null,"Operating-Regulatory",0,0,0,0,0,0,0]
[null,"Operating-Regulatory Reset",0,0,0,0,0,0,0]
[null,"Operating-Information technology (IT)",0,0,0,0,0,0,0]
[null,"Operating-Licence Fees",0,0,0,0,0,0,0]
[null,"Operating-GSL payments",0,0,0,0,0,0,0]
[null,"Operating-Non-Network Alternatives Costs",0,0,0,0,0,0,0]
[null,"Operating-Debt raising costs",0,0,0,0,0,0,0]
[null,"Operating-Other - Standard Control Services (a)",0,0,0,0,0,0,0]
[null,"Operating-Metering",0,0,0,0,0,0,0]
[null,"Operating-Public Lighting",0,0,0,0,0,0,0]
[null,"Operating-Alternative Control - Other",0,0,0,0,0,0,0]
[null,"Operating-Negotiated Services",0,0,0,0,0,0,0]
[null,"Operating-Unregulated Services",0,0,0,0,0,0,0]
[null,""]
[null,"Total",{"$f":"SUM(C581:C610)","v":0},0,0,0,0,0,0]
[]
[]
[null,"OTHER"]
[null,null,"EXPENDITURE"]
[null,null,"$0's, nominal"]
[null,"Description",{"$f":"dms_y1","v":"2011-12"},{"$f":"dms_y2","v":"2012-13"},{"$f":"dms_y3","v":"2013-14"},{"$f":"dms_y4","v":"2014-15"},{"$f":"dms_y5","v":"2015-16"},{"$f":"dms_y6","v":"2016-17"},{"$f":"dms_y7","v":"2017-18"}]
[null,"CONNECTION SERVICES"]
[null,{"$f":"IF(ISBLANK(B367),\"\",B367)","v":"Maintenance-Routine"},0,0,0,0,0,0,0]
[null,"Maintenance-Condition Based",0,0,0,0,0,0,0]
[null,"Maintenance-Vegetation Control",0,0,0,0,0,0,0]
[null,"Maintenance-Emergency Fault",0,0,0,0,0,0,0]
[null,"Maintenance-Inspection",0,0,0,0,0,0,0]
[null,"Maintenance-SCADA/Network control",0,0,0,0,0,0,0]
[null,"Maintenance-Other - Standard Control Services (a)",0,0,0,0,0,0,0]
[null,"Maintenance-Metering",0,0,0,0,0,0,0]
[null,"Maintenance-Public Lighting",0,0,0,0,0,0,0]
[null,"Maintenance-Alternative Control - Other",0,0,0,0,0,0,0]
[null,"Maintenance-Negotiated Services",0,0,0,0,0,0,0]
[null,{"$f":"IF(ISBLANK(B378),\"\",B378)","v":"Maintenance-Unregulated Services"},0,0,0,0,0,0,0]
[null,"Operating-Network operating costs (excl GSL payments)",0,0,0,0,0,0,0]
[null,"Operating-Billing & revenue collection",0,0,0,0,0,0,0]
[null,"Operating-Advertising, marketing & promotions",0,0,0,0,0,0,0]
[null,"Operating-Customer service",0,0,0,0,0,0,0]
[null,"Operating-Regulatory",0,0,0,0,0,0,0]
[null,"Operating-Regulatory Reset",0,0,0,0,0,0,0]
[null,"Operating-Information technology (IT)",0,0,0,0,0,0,0]
[null,"Operating-Licence Fees",0,0,0,0,0,0,0]
[null,"Operating-GSL payments",0,0,0,0,0,0,0]
[null,"Operating-Non-Network Alternatives Costs",0,0,0,0,0,0,0]
[null,"Operating-Debt raising costs",0,0,0,0,0,0,0]
[null,"Operating-Other - Standard Control Services (a)",0,0,0,0,0,0,0]
[null,"Operating-Metering",0,0,0,0,0,0,0]
[null,"Operating-Public Lighting",0,0,0,0,0,0,0]
[null,"Operating-Alternative Control - Other",0,0,0,0,0,0,0]
[null,"Operating-Negotiated Services",0,0,0,0,0,0,0]
[null,"Operating-Unregulated Services",0,0,0,0,0,0,0]
[null,""]
[null,"Total",{"$f":"SUM(C619:C648)","v":0},0,0,0,0,0,0]
[null,"METERING SERVICES"]
[null,{"$f":"IF(ISBLANK(B367),\"\",B367)","v":"Maintenance-Routine"},0,0,0,0,0,0,0]
[null,"Maintenance-Condition Based",0,0,0,0,0,0,0]
[null,"Maintenance-Vegetation Control",0,0,0,0,0,0,0]
[null,"Maintenance-Emergency Fault",0,0,0,0,0,0,0]
[null,"Maintenance-Inspection",0,0,0,0,0,0,0]
[null,"Maintenance-SCADA/Network control",0,0,0,0,0,0,0]
[null,"Maintenance-Other - Standard Control Services (a)",0,0,0,0,0,0,0]
[null,"Maintenance-Metering",0,0,0,0,0,0,0]
[null,"Maintenance-Public Lighting",0,0,0,0,0,0,0]
[null,"Maintenance-Alternative Control - Other",0,0,0,0,0,0,0]
[null,"Maintenance-Negotiated Services",0,0,0,0,0,0,0]
[null,"Maintenance-Unregulated Services",0,0,0,0,0,0,0]
[null,"Operating-Network operating costs (excl GSL payments)",0,0,0,0,0,0,0]
[null,"Operating-Billing & revenue collection",0,0,0,0,0,0,0]
[null,"Operating-Advertising, marketing & promotions",0,0,0,0,0,0,0]
[null,{"$f":"IF(ISBLANK(B382),\"\",B382)","v":"Operating-Customer service"},0,0,0,0,0,0,0]
[null,"Operating-Regulatory",0,0,0,0,0,0,0]
[null,"Operating-Regulatory Reset",0,0,0,0,0,0,0]
[null,"Operating-Information technology (IT)",0,0,0,0,0,0,0]
[null,"Operating-Licence Fees",0,0,0,0,0,0,0]
[null,"Operating-GSL payments",0,0,0,0,0,0,0]
[null,"Operating-Non-Network Alternatives Costs",0,0,0,0,0,0,0]
[null,"Operating-Debt raising costs",0,0,0,0,0,0,0]
[null,"Operating-Other - Standard Control Services (a)",0,0,0,0,0,0,0]
[null,"Operating-Metering",0,0,0,0,0,0,0]
[null,"Operating-Public Lighting",0,0,0,0,0,0,0]
[null,"Operating-Alternative Control - Other",0,0,0,0,0,0,0]
[null,"Operating-Negotiated Services",0,0,0,0,0,0,0]
[null,"Operating-Unregulated Services",0,0,0,0,0,0,0]
[null,""]
[null,"Total",{"$f":"SUM(C651:C680)","v":0},0,0,0,0,0,0]
[null,"ANCILLARY NETWORK SERVICES"]
[null,{"$f":"IF(ISBLANK(B367),\"\",B367)","v":"Maintenance-Routine"},0,0,0,0,0,0,0]
[null,"Maintenance-Condition Based",0,0,0,0,0,0,0]
[null,"Maintenance-Vegetation Control",0,0,0,0,0,0,0]
[null,"Maintenance-Emergency Fault",0,0,0,0,0,0,0]
[null,"Maintenance-Inspection",0,0,0,0,0,0,0]
[null,"Maintenance-SCADA/Network control",0,0,0,0,0,0,0]
[null,"Maintenance-Other - Standard Control Services (a)",0,0,0,0,0,0,0]
[null,"Maintenance-Metering",0,0,0,0,0,0,0]
[null,"Maintenance-Public Lighting",0,0,0,0,0,0,0]
[null,"Maintenance-Alternative Control - Other",0,0,0,0,0,0,0]
[null,"Maintenance-Negotiated Services",0,0,0,0,0,0,0]
[null,"Maintenance-Unregulated Services",0,0,0,0,0,0,0]
[null,"Operating-Network operating costs (excl GSL payments)",0,0,0,0,0,0,0]
[null,"Operating-Billing & revenue collection",0,0,0,0,0,0,0]
[null,"Operating-Advertising, marketing & promotions",0,0,0,0,0,0,0]
[null,"Operating-Customer service",0,0,0,0,0,0,0]
[null,"Operating-Regulatory",0,0,0,0,0,0,0]
[null,"Operating-Regulatory Reset",0,0,0,0,0,0,0]
[null,{"$f":"IF(ISBLANK(B385),\"\",B385)","v":"Operating-Information technology (IT)"},0,0,0,0,0,0,0]
[null,"Operating-Licence Fees",0,0,0,0,0,0,0]
[null,"Operating-GSL payments",0,0,0,0,0,0,0]
[null,"Operating-Non-Network Alternatives Costs",0,0,0,0,0,0,0]
[null,"Operating-Debt raising costs",0,0,0,0,0,0,0]
[null,"Operating-Other - Standard Control Services (a)",0,0,0,0,0,0,0]
[null,"Operating-Metering",0,0,0,0,0,0,0]
[null,"Operating-Public Lighting",0,0,0,0,0,0,0]
[null,"Operating-Alternative Control - Other",0,0,0,0,0,0,0]
[null,"Operating-Negotiated Services",0,0,0,0,0,0,0]
[null,"Operating-Unregulated Services",0,0,0,0,0,0,0]
[null,""]
[null,"Total",{"$f":"SUM(C683:C712)","v":0},0,0,0,0,0,0]
[]
[]
[]
[]
[null,"8.4.3 - OPEX - MATERIAL DIFFERENCE EXPLANATION"]
[null,"Description","Reason for material difference"]

{"sheet":"9.5 TUoS","index":27,"n_rows":90,"n_cols":9,"rows_kept":90,"cut":false,"hidden":false,"merged":[[20,2,20,8],[8,2,8,8],[32,2,32,8],[67,2,67,8],[5,1,5,3]]}
[null,{"$f":"INDEX(dms_Worksheet_List,MATCH(dms_Model,dms_Model_List))","v":"HISTORICAL ANNUAL REPORTING - FINANCIAL YEARS"}]
[null,{"$f":"INDEX(dms_TradingNameFull_List,MATCH(dms_TradingName,dms_TradingName_List))","v":"Jemena Electricity"}]
[null,{"$f":"dms_Header_Span","v":"2011-12 to 2017-18"}]
[null,"9.5 - TUoS AUDIT (t-2)"]
[]
[null,"This template collects information for annual pricing proposals from Victorian businesses only.\n"]
[]
[null,"9.5.1 - TUOS CHARGES (AEMO)"]
[null,null,"$0's, nominal"]
[null,null,{"$f":"dms_y1","v":"2011-12"},{"$f":"dms_y2","v":"2012-13"},{"$f":"dms_y3","v":"2013-14"},{"$f":"dms_y4","v":"2014-15"},{"$f":"dms_y5","v":"2015-16"},{"$f":"dms_y6","v":"2016-17"},{"$f":"dms_y7","v":"2017-18"}]
[null,"AEMO Charges",50751866.725000001,52765136.895000003,53005657.43,56102502.219999999,58012909.399999991,56677289.224999994,54468042.454999998]
[]
[]
[]
[]
[]
[null,"Total",{"$f":"SUM(C11:C16)","v":50751866.725000001},{"$f":"SUM(D11:D16)","v":52765136.895000003},53005657.43,56102502.219999999,58012909.399999991,56677289.224999994,54468042.454999998]
[]
[]
[null,"9.5.2 - TRANSMISSION CONNECTION FEES"]
[null,null,"$0's, nominal"]
[null,null,{"$f":"dms_y1","v":"2011-12"},{"$f":"dms_y2","v":"2012-13"},{"$f":"dms_y3","v":"2013-14"},{"$f":"dms_y4","v":"2014-15"},{"$f":"dms_y5","v":"2015-16"},{"$f":"dms_y6","v":"2016-17"},{"$f":"dms_y7","v":"2017-18"}]
[null,"Prescribed Services charge",6228517.4699999988,6129019.3650000002,5968342.9950000001,5765867.9695454538,5546257.7545454539,5258307.7650000006,4970311.5]
[null,"Excluded Services charge",2137693.5466055046,2235465.9299999997,1665345.3499999999,699159.35045454535,365084.23045454547,236498.39500000002,195874.77500000014]
[]
[]
[]
[]
[null,"Total",{"$f":"SUM(C23:C28)","v":8366211.0166055039},{"$f":"SUM(D23:D28)","v":8364485.2949999999},7633688.3449999997,6465027.3199999994,5911341.9849999994,5494806.1600000001,5166186.2750000004]
[]
[]
[null,"9.5.3 - CROSS BOUNDARY NETWORK CHARGES"]
[null,null,"$0's, nominal"]
[null,"Distribution Business",{"$f":"dms_y1","v":"2011-12"},{"$f":"dms_y2","v":"2012-13"},{"$f":"dms_y3","v":"2013-14"},{"$f":"dms_y4","v":"2014-15"},{"$f":"dms_y5","v":"2015-16"},{"$f":"dms_y6","v":"2016-17"},{"$f":"dms_y7","v":"2017-18"}]
[null,"HV CROSSINGS"]
[null,"CitiPower",1588169.5806498756,1777481.19,964911.83499999996,1044995.1726425971,2098696.8543283204,2000803.5980767747,1905836.4134107812]
[null,"Powercor",-10899.651684349985,387070.09499999997,181938.45499999999,-183905.02840374,-359194.271457845,-313751.48212455504,-280429.64649943204]
[null,"AusNet",-2244495,-2589020,-1411540,-1823780,-3356945,-3016150,-3396606.555000525]
[]
[]
[]
[]
[]
[null,"Total",{"$f":"SUM(C36:C43)","v":-667225.0710344743},{"$f":"SUM(D36:D43)","v":-424468.71499999985},-264689.70999999996,-962689.85576114291,-1617442.4171295245,-1329097.8840477802,-1771199.7880891757]
[null,"SUBTRANSMISSION CROSSINGS"]
[null,"CitiPower",-31155.840000000004,-33610.085000000006,-17189.525000000001,-24212.209006233428,-21618.793548705256,-19994.997875498768,-44735.703054639656]
[null,"Powercor",4217438.1731528845,4427942.6849999996,2513935.09,3048986.48340374,6072553.1094138455,5931305.5119369244,5691922.7683558017]
[null,"AusNet",85683.985000000001,95827.459999999992,53917.665000000001,65088.266242672893,89552.766242672893,72920.5,98800.133214362664]
[]
[]
[]
[]
[]
[null,"Total",{"$f":"SUM(C46:C53)","v":4271966.318152885},{"$f":"SUM(D46:D53)","v":4490160.0599999996},2550663.23,3089862.5406401791,6140487.0821078131,5984231.0140614258,5745987.1985155251]
[null,"TUoS ADJUSTMENT"]
[null,"CitiPower",1356340.2450000001,1354030.7200000002,612784.55500000005,714421.5763636363,1388184.8263636362,1464444.3337068264,1543516.6264087097]
[null,"Powercor",0,0,0,0,0,0,0]
[null,"AusNet",-294137.5,-332929,-173013,-242845,-437680,-404863.5,-427116.72821383731]
[]
[]
[]
[]
[]
[null,"Total",{"$f":"SUM(C56:C63)","v":1062202.7450000001},{"$f":"SUM(D56:D63)","v":1021101.7200000002},439771.55500000005,471576.5763636363,950504.82636363618,1059580.8337068264,1116399.8981948723]
[]
[]
[null,"9.5.4 - PAYMENTS TO EMBEDDED GENERATORS"]
[null,null,"$0's, nominal"]
[null,"Distribution Business",{"$f":"dms_y1","v":"2011-12"},{"$f":"dms_y2","v":"2012-13"},{"$f":"dms_y3","v":"2013-14"},{"$f":"dms_y4","v":"2014-15"},{"$f":"dms_y5","v":"2015-16"},{"$f":"dms_y6","v":"2016-17"},{"$f":"dms_y7","v":"2017-18"}]
[null,"9.5.4.1 - AVOIDED TRANSMISSION COSTS"]
[null,"Embedded generators","Incomplete","Incomplete","Incomplete","Incomplete","Incomplete","Incomplete",659418.5]
[null,"Somerton Power Station","Incomplete","Incomplete","Incomplete","Incomplete","Incomplete","Incomplete","Incomplete"]
[null,""]
[null,""]
[null,""]
[null,""]
[null,""]
[null,""]
[null,"Total",{"$f":"SUM(C71:C78)","v":0},{"$f":"SUM(D71:D78)","v":0},{"$f":"SUM(E71:E78)","v":0},{"$f":"SUM(F71:F78)","v":0},{"$f":"SUM(G71:G78)","v":0},{"$f":"SUM(H71:H78)","v":0},{"$f":"SUM(I71:I78)","v":659418.5}]
[null,"9.5.4.2 - AVOIDED TUoS USAGE CHARGES"]
[null,"Somerton Power Station",null,null,null,null,"Incomplete","Incomplete","Incomplete"]
[null,"Melbourne Water","Incomplete","Incomplete","Incomplete","Incomplete","Incomplete","Incomplete","Incomplete"]
[null,""]
[null,""]
[null,""]
[null,""]
[null,""]
[null,""]
[null,"Total",{"$f":"SUM(C81:C88)","v":0},{"$f":"SUM(D81:D88)","v":0},{"$f":"SUM(E81:E88)","v":0},{"$f":"SUM(F81:F88)","v":0},{"$f":"SUM(G81:G88)","v":0},{"$f":"SUM(H81:H88)","v":0},{"$f":"SUM(I81:I88)","v":0}]
[null,"Total payments to embedded generators",{"$f":"SUM(C79:C89)","v":0},{"$f":"SUM(D79:D89)","v":0},0,0,0,0,659418.5]