{"text_format":"1","workbook":"xlsx","n_sheets":6,"sheets":["NOTES","Model update","Prop2020DistTar","2020TarContForm","2020RebalContForm","ARS"],"not_rendered":{"charts":0,"images":0,"macros":1,"external_links":0,"defined_names":30,"comments":1,"pivot_tables":0},"unopened":[],"bounds":{"document_bytes":16777216,"sheet_cells":100000,"rows_first":2000,"rows_last":500,"rows_between":2000,"halvings":0,"cell_chars":16384,"cell_head_chars":4096},"cells_cut":0,"cells_raw":0,"read":"whole","date_system":"1900"}

{"sheet":"NOTES","index":0,"n_rows":22,"n_cols":5,"rows_kept":22,"cut":false,"hidden":true,"merged":[]}
[]
["The model has actual and test data to illustrate the workings of the model.",null,null,{"$f":"'Model update'!B5","v":2020}]
[]
["Issue","Location","Item","Comment"]
[]
[1,"'Model update'!C25","CPI",{"$f":"\"Updated June \"&D2-1&\" CPI for \"&D2","v":"Updated June 2019 CPI for 2020"},"NOTE: This worksheet is programmed to update for each year - use as checklist and note any placeholders or changes"]
[null,null,null,null,"NOTE: Worksheet names in this file are programmed to update each year once each worksheet is accessed and a cell is selected"]
[{"$f":"A6+1","v":2},"'Model update'!B34",{"$f":"\"Xt for \"&D2","v":"Xt for 2020"},{"$f":"\"Updated for \"&D2&\" annual update \"","v":"Updated for 2020 annual update "}]
[]
[{"$f":"A8+1","v":3},"'Model update'!B44",{"$f":"\"Pass Through Amount for \"&D2","v":"Pass Through Amount for 2020"},"NIL for 2020"]
[]
[{"$f":"A10+1","v":4},"'Model update'!H79:H83","Real Pre-tax WACC (rptw)",{"$f":"\"Updated for \"&$D$2&\" annual update\"","v":"Updated for 2020 annual update"}]
[]
[{"$f":"A12+1","v":5},{"$f":"\"Prop\"&D2&\"DistTar!E8:E96\"","v":"Prop2020DistTar!E8:E96"},{"$f":"D2-1&\" tariffs\"","v":"2019 tariffs"},{"$f":"\"Updated from \"&D2-1&\" model\"","v":"Updated from 2019 model"}]
[]
[{"$f":"A14+1","v":6},"ARS!B6:B12",{"$f":"D2-1&\" ARS tariffs\"","v":"2019 ARS tariffs"},{"$f":"\"Updated from \"&D2-1&\" model\"","v":"Updated from 2019 model"}]
[]
[{"$f":"A16+1","v":7},"The following is test data to illustrate the workings of the model.",null,"Input data required from DNSPs"]
[null,{"$f":"\"Prop\"&D2&\"DistTar!D8:D96\"","v":"Prop2020DistTar!D8:D96"},{"$f":"\"Proposed \"&D2&\" Tariffs\"","v":"Proposed 2020 Tariffs"}]
[null,{"$f":"\"Prop\"&D2&\"DistTar!F8:F96\"","v":"Prop2020DistTar!F8:F96"},{"$f":"\"Actual \"&D2-2&\" Volumes\"","v":"Actual 2018 Volumes"}]
[]
[null,"ARS!C6:C12",{"$f":"\"Proposed \"&D2&\" Ancillary Reference Services Charges\"","v":"Proposed 2020 Ancillary Reference Services Charges"}]

{"sheet":"Model update","index":1,"n_rows":58,"n_cols":2,"rows_kept":58,"cut":false,"hidden":false,"merged":[[54,0,55,1]]}
[]
[]
["Tariff Approval Template for ","MultiNet"]
[]
["Calendar year commencing",2020]
[]
["t",{"$f":"B5","v":2020}]
["t-1",{"$f":"B7-1","v":2019}]
["t-2",2018]
["t-3",2017]
[]
[]
["Please fill in yellow highlighted cells where appropriate"]
[]
["CPI"]
[]
["CPI Index June 2016",108.6]
["CPI Index June 2017",110.7]
["CPI Index June 2018",113]
["CPI Index June 2019",114.8]
["CPI Index June 2020"]
["CPI Index June 2021"]
[]
[]
[{"$f":"\"CPI Index June \" &$B$10","v":"CPI Index June 2017"},{"$f":"VLOOKUP(A25,A$17:D$22,2,FALSE)","v":110.7}]
[{"$f":"\"CPI Index June \" &$B$9","v":"CPI Index June 2018"},{"$f":"VLOOKUP(A26,A$17:D$22,2,FALSE)","v":113}]
[{"$f":"\"CPI Index June \" &$B$8","v":"CPI Index June 2019"},{"$f":"VLOOKUP(A27,A$17:D$22,2,FALSE)","v":114.8}]
[]
[{"$f":"\"CPI \" &$B$8","v":"CPI 2019"},{"$f":"B26/B25-1","v":2.0776874435411097E-2}]
[{"$f":"\"CPI \" &$B$5","v":"CPI 2020"},{"$f":"B27/B26-1","v":1.5929203539823078E-2}]
[]
[]
[{"$f":"\"Xt for \"&B$5","v":"Xt for 2020"}]
[2019,-1.7757344845594263E-2]
[2020,-1.1736521921608076E-2]
[2021,-1.7999999999999999E-2]
[2022,-1.7999999999999999E-2]
[]
[]
[{"$f":"\"Xt for \"&B$5","v":"Xt for 2020"},{"$f":"VLOOKUP(B5,A34:B38,2,FALSE)","v":-1.1736521921608076E-2}]
{"$rows_left_out":19}
{"sheet":"Prop2020DistTar","index":2,"n_rows":168,"n_cols":8,"rows_kept":168,"cut":false,"hidden":false,"merged":[]}
[null,{"$f":"\"Tariff Approval - \"&'Model update'!B3","v":"Tariff Approval - MultiNet"},{"$f":"\"Prop\"&'Model update'!B5&\"DistTar\"","v":"Prop2020DistTar"}]
[]
[null,{"$f":"\"PROPOSED \"&'Model update'!$B$5&\" DISTRIBUTION TARIFFS\"","v":"PROPOSED 2020 DISTRIBUTION TARIFFS"}]
[]
[null,"Proposed tariff name","Existing name","Prop\n2020 Tariff",{"$f":"\"Exist\n\"&'Model update'!$B$8&\" Tariff\"","v":"Exist\n2019 Tariff"},{"$f":"\"Actual \"&'Model update'!$B$9&\" Volumes\"","v":"Actual 2018 Volumes"},"Prop Tar\nRevenue","Exist Tar\nRevenue"]
[null,"Tariff V - Multinet Residential","Tariff V - Multinet Residential"]
[null,"1 January - 31 December","1 January - 31 December"]
[null,"Fixed Charge","Fixed Charge",0.183,0.18010000000000001,677911,{"$f":"D8*$F8*365","v":45281065.245000005},{"$f":"E8*$F8*365","v":44563496.451500006}]
[null,"Peak 0 - 0.05","Peak 0 - 0.05",8.7502965387832621,8.3680402248471015,3644226.8659199998,{"$f":"D9*$F9","v":31888065.731400751},30495037.002487045]
[null,"Peak 0.05 - 0.1","Peak 0.05 - 0.1",5.8383000000000003,5.7468000000000004,3061316.8703399999,17872886.284106024,17592775.790469911]
[null,"Peak 0.1 -0.15","Peak 0.1 -0.15",3.0185,2.9712000000000001,2663703.46123,8040388.8977227546,7914395.7240065765]
[null,"Peak 0.15 - 0.25","Peak 0.15 - 0.25",1.5276000000000001,1.5036,4323577.4184600003,6604696.8644394968,6500931.0063964566]
[null,"Peak >0.25","Peak >0.25",1.1329,1.1151,8511966.0198999997,9643206.3039447106,9491693.30879049]
[null,"May Shoulder 0 - 0.05","May Shoulder 0 - 0.05",8.3515498907265346,7.9867094258476676,909391.3872,7594827.5403978117,7263044.7639349261]
[null,"May Shoulder 0.05 - 0.1","May Shoulder 0.05 - 0.1",5.5464000000000002,5.4593999999999996,720256.52176999999,3994830.772345128,3932168.4549511378]
[null,"May Shoulder 0.1 -0.15","May Shoulder 0.1 -0.15",2.8685999999999998,2.8235999999999999,580423.26826000004,1665002.187330636,1638883.140258936]
[null,"May Shoulder 0.15 - 0.25","May Shoulder 0.15 - 0.25",1.4513,1.4285000000000001,832054.53486000001,1207560.746442318,1188589.9030475102]
[null,"May Shoulder >0.25","May Shoulder >0.25",1.0912999999999999,1.0742,1271057.5099800001,1387105.060641174,1365369.9772205162]
[null,"Oct Shoulder 0 - 0.05","Oct Shoulder 0 - 0.05",8.3515498907265346,7.9867094258476676,879745.98845000006,7347242.5137067055,7026275.5783052891]
[null,"Oct Shoulder 0.05 - 0.1","Oct Shoulder 0.05 - 0.1",5.5464000000000002,5.4593999999999996,597219.39760999999,3312417.6669041039,3260459.5793120335]
[null,"Oct Shoulder 0.1 -0.15","Oct Shoulder 0.1 -0.15",2.8685999999999998,2.8235999999999999,387562.88742000004,1111762.8988530121,1094322.568919112]
[null,"Oct Shoulder 0.15 - 0.25","Oct Shoulder 0.15 - 0.25",1.4513,1.4285000000000001,417870.95835000003,606456.12185335509,596928.6640029751]
[null,"Oct Shoulder >0.25","Oct Shoulder >0.25",1.0912999999999999,1.0742,483169.19057999999,527282.53767995397,519020.34452103602]
[null,"Off Peak 0 - 0.05","Off Peak 0 - 0.05",7.4725368875245666,7.1461077879984369,4421093.8010300007,33036786.511402875,31593612.843012098]
[null,"Off Peak 0.05 - 0.1","Off Peak 0.05 - 0.1",4.9626999999999999,4.8849,1703421.50667,8453569.9111512098,8321043.7179322829]
[null,"Off Peak 0.1 -0.15","Off Peak 0.1 -0.15",2.5666000000000002,2.5264000000000002,742019.84565999999,1904468.1358709561,1874638.9380754242]
[null,"Off Peak 0.15 - 0.25","Off Peak 0.15 - 0.25",1.2985,1.2781,672243.89884000004,872908.70264373999,859194.9271074041]
[null,"Off Peak >0.25","Off Peak >0.25",0.97660000000000002,0.96130000000000004,1113875.99924,{"$f":"D28*$F28","v":1087811.300857784},{"$f":"E28*$F28","v":1070768.9980694121}]
[null,"Tariff V - Multinet Non-Residential","Tariff V - Multinet Non-Residential"]
[null,"1 January - 31 December","1 January - 31 December"]
[null,"Fixed Charge","Fixed Charge",0.30180000000000001,0.29709999999999998,15893,{"$f":"D31*$F31*365","v":1750725.2010000001},{"$f":"E31*$F31*365","v":1723460.7594999997}]
[null,"Peak 0 - 0.25","Peak 0 - 0.25",3.9961125101069404,3.821572772743568,307852.08324999997,{"$f":"D32*$F32","v":1230211.561137808},1176479.1393805861]
[null,"Peak 0.25 - 1","Peak 0.25 - 1",2.3485999999999998,2.3117999999999999,503329.67335000006,1182120.0708298101,1163597.5388505301]
[null,"Peak 1 - 1.5","Peak 1 - 1.5",1.4092,1.3871,195782.12727,275896.173748884,271569.38873621699]
[null,"Peak 1.5 - 5","Peak 1.5 - 5",0.78420000000000001,0.77190000000000003,650338.59620000003,509995.52714004001,501996.36240678007]
[null,"Peak >5","Peak >5",0.26169999999999999,0.2576,795170.69657999999,208096.17129498598,204835.97143900799]
[null,"May Shoulder 0 - 0.25","May Shoulder 0 - 0.25",3.6673575297524805,3.5070925582600845,74339.004409999994,272627.70757731632,260713.76915477458]
[null,"May Shoulder 0.25 - 1","May Shoulder 0.25 - 1",2.1139000000000001,2.0808,116401.105,246060.29585950001,242207.419284]
[null,"May Shoulder 1 - 1.5","May Shoulder 1 - 1.5",1.3387,1.3177000000000001,44612.173840000003,59722.317119608007,58785.461468968009]
[null,"May Shoulder 1.5 - 5","May Shoulder 1.5 - 5",0.7641,0.75209999999999999,145114.82343000002,110882.23658286301,109140.85870170301]
{"$rows_left_out":129}
{"sheet":"2020TarContForm","index":3,"n_rows":44,"n_cols":3,"rows_kept":44,"cut":false,"hidden":false,"merged":[[43,1,43,3]]}
[null,{"$f":"\"Tariff Approval - \"&'Model update'!B3","v":"Tariff Approval - MultiNet"},{"$f":"'Model update'!B5&\"TarContForm\"","v":"2020TarContForm"}]
[]
[null,{"$f":"'Model update'!$B$5&\"  TARIFF CONTROL FORMULA\"","v":"2020  TARIFF CONTROL FORMULA"}]
[]
[]
[null,"CPI"]
[]
[null,{"$f":"\"CPI June \"&'Model update'!$B$9","v":"CPI June 2018"},{"$f":"'Model update'!B26","v":113}]
[null,{"$f":"\"CPI June \"&'Model update'!$B$8","v":"CPI June 2019"},{"$f":"'Model update'!B27","v":114.8}]
[]
[null,{"$f":"\"CPI \"&'Model update'!$B$5","v":"CPI 2020"},{"$f":"(C9/C8-1)","v":1.5929203539823078E-2}]
[]
[]
[]
[null,"X factor"]
[]
[null,{"$f":"\"X \"&'Model update'!$B$5","v":"X 2020"},{"$f":"'Model update'!B40","v":-1.1736521921608076E-2}]
[]
[]
[null,"Pass Through Factor (PT)"]
[]
[null,"pass through"]
[null,{"$f":"\"AP (t) \"&'Model update'!$B$7","v":"AP (t) 2020"},{"$f":"'Model update'!B50","v":0}]
[]
[null,"Revenue"]
[null,"∑∑p(t-1)q(t-2)",{"$f":"C41","v":203598412.88713446}]
[]
[null,"PT' (t-1)",0]
[null,{"$f":"\"PT' \"&'Model update'!$B$5","v":"PT' 2020"},{"$f":"IF(C26=\"\",0,(C23)/((1+C11)*(1-C17)*C26))","v":0}]
[]
[null,{"$f":"\"PTt \"&'Model update'!$B$5","v":"PTt 2020"},{"$f":"((1+C29)/(1+C28))-1","v":0}]
[]
[]
[]
[]
[null,{"$f":"'Model update'!$B$5&\"  Distribution price control\"","v":"2020  Distribution price control"}]
[]
[null,"Average price movement allowed",{"$f":"(1+C11)*(1-C17)*(1+C31)","v":1.0278526789079701}]
[]
[null,"Proposed distribution tariff revenue",{"$f":"IF(Prop2020DistTar!G168=0,\"\",Prop2020DistTar!G168)","v":209269174.00000012}]
{"$rows_left_out":5}
{"sheet":"2020RebalContForm","index":4,"n_rows":285,"n_cols":23,"rows_kept":285,"cut":false,"hidden":false,"merged":[[284,1,284,2],[57,1,57,2],[87,1,87,2],[117,1,117,2],[147,1,147,2],[177,1,177,2],[207,1,207,2],[231,1,231,2],[260,1,260,2]]}
[null,{"$f":"\"Tariff Approval - \"&'Model update'!B3","v":"Tariff Approval - MultiNet"},{"$f":"'Model update'!B5&\"RebalContForm\"","v":"2020RebalContForm"}]
[]
[null,{"$f":"'Model update'!$B$5&\"  REBALANCING CONTROL FORMULA\"","v":"2020  REBALANCING CONTROL FORMULA"}]
[]
[]
[null,"Rebalancing control"]
[]
[null,{"$f":"\"CPI \"&'Model update'!$B$5","v":"CPI 2020"},{"$f":"'2020TarContForm'!C11","v":1.5929203539823078E-2}]
[null,{"$f":"\"Y  \"&'Model update'!$B$5","v":"Y  2020"},0.02]
[null,{"$f":"\"PTt \"&'Model update'!$B$5","v":"PTt 2020"},{"$f":"'2020TarContForm'!C31","v":0}]
[null,{"$f":"\"Xt \"&'Model update'!$B$5","v":"Xt 2020"},{"$f":"'2020TarContForm'!C17","v":-1.1736521921608076E-2}]
[]
[null,"Rebalancing control",{"$f":"(1+C8)*(1+C9)*(1+C10)*(1-C11)","v":1.0484097324861295}]
[]
[]
[]
[null,"Rebalancing control summary"]
[null,null,"Existing","Proposed","Movement","Assessment"]
[null,{"$f":"B32","v":"Tariff V - Multinet Residential"},{"$f":"C53","v":188162651.68232059},{"$f":"C54","v":193440341.93469447},{"$f":"IF(C19=0,0,D19/C19)","v":1.0280485537655173},{"$f":"IF(E19=0,\"\",IF($C$13<=E19,\"Breached\",\"Compliant\"))","v":"Compliant"}]
[null,{"$f":"B62","v":"Tariff V - Yarra Valley Residential"},{"$f":"C83","v":2117975.1536065051},{"$f":"C84","v":2172543.6192192454},1.0257644503146417,{"$f":"IF(E20=0,\"\",IF($C$13<=E20,\"Breached\",\"Compliant\"))","v":"Compliant"}]
[null,{"$f":"B92","v":"Tariff V - South Gippsland Residential"},{"$f":"C113","v":1569612.5018356708},{"$f":"C114","v":1612368.0655710208},1.0272395662530382,"Compliant"]
[null,{"$f":"B122","v":"Tariff V - Multinet Non-Residential"},{"$f":"C143","v":9224671.415439168},{"$f":"C144","v":9453700.0817747805},1.0248278400412498,"Compliant"]
[null,{"$f":"B152","v":"Tariff V - Yarra Valley Non-Residential"},{"$f":"C173","v":127214.96246777033},{"$f":"C174","v":129961.85163508086},1.0215925007092344,"Compliant"]
[null,{"$f":"B182","v":"Tariff V - South Gippsland Non-Residential"},{"$f":"C203","v":342861.47962964914},{"$f":"C204","v":349638.30841832567},1.0197655006214075,"Compliant"]
[null,{"$f":"B212","v":"Tariff D - Multinet"},{"$f":"C227","v":1943846.9623379998},{"$f":"C228","v":1997988.4050359998},1.0278527290198196,"Compliant"]
[null,{"$f":"B265","v":"Tariff D - Multinet South Gippsland"},{"$f":"C280","v":76900.091295999999},{"$f":"C281","v":79041.972758000004},1.0278527817835168,"Compliant"]
[null,"Tariff L - Multinet",{"$f":"C256","v":32678.638200999998},{"$f":"C257","v":33589.760892999999},1.0278812931675996,"Compliant"]
[null,null,{"$f":"SUM(C19:C27)","v":203598412.88713431},{"$f":"SUM(D19:D27)","v":209269173.99999988},1.0278526783802051]
[]
[]
[]
[null,{"$f":"Prop2020DistTar!B6","v":"Tariff V - Multinet Residential"},1,2,3,4,5,6,7,8,9,10,11,12,13,14,15,16,17,18,19,20,21]
[null,null,1,2,3,4,5,6,7,8,9,10,11,12,13,14,15,16,17,18,19,20,21]
[null,"Distribution tariff","Fixed","PkBlk1","PkBlk2","PkBlk3","PkBlk4","PkBlk5","Shd1Blk1","Shd1Blk2","Shd1Blk3","Shd1Blk4","Shd1Blk5","Shd2Blk1","Shd2Blk2","Shd2Blk3","Shd2Blk4","Shd2Blk5","OPkBlk1","OPkBlk2","OPkBlk3","OPkBlk4","OPkBlk5"]
[]
[null,{"$f":"\"Existing (1 Jan-31 Dec): \"&Prop2020DistTar!C6","v":"Existing (1 Jan-31 Dec): Tariff V - Multinet Residential"},{"$f":"INDEX(Prop2020DistTar!$E$8:$E$28,C$33)","v":0.18010000000000001},{"$f":"INDEX(Prop2020DistTar!$E$8:$E$28,D$33)","v":8.3680402248471015},{"$f":"INDEX(Prop2020DistTar!$E$8:$E$28,E$33)","v":5.7468000000000004},{"$f":"INDEX(Prop2020DistTar!$E$8:$E$28,F$33)","v":2.9712000000000001},{"$f":"INDEX(Prop2020DistTar!$E$8:$E$28,G$33)","v":1.5036},{"$f":"INDEX(Prop2020DistTar!$E$8:$E$28,H$33)","v":1.1151},{"$f":"INDEX(Prop2020DistTar!$E$8:$E$28,I$33)","v":7.9867094258476676},{"$f":"INDEX(Prop2020DistTar!$E$8:$E$28,J$33)","v":5.4593999999999996},{"$f":"INDEX(Prop2020DistTar!$E$8:$E$28,K$33)","v":2.8235999999999999},{"$f":"INDEX(Prop2020DistTar!$E$8:$E$28,L$33)","v":1.4285000000000001},{"$f":"INDEX(Prop2020DistTar!$E$8:$E$28,M$33)","v":1.0742},{"$f":"INDEX(Prop2020DistTar!$E$8:$E$28,N$33)","v":7.9867094258476676},{"$f":"INDEX(Prop2020DistTar!$E$8:$E$28,O$33)","v":5.4593999999999996},{"$f":"INDEX(Prop2020DistTar!$E$8:$E$28,P$33)","v":2.8235999999999999},{"$f":"INDEX(Prop2020DistTar!$E$8:$E$28,Q$33)","v":1.4285000000000001},{"$f":"INDEX(Prop2020DistTar!$E$8:$E$28,R$33)","v":1.0742},{"$f":"INDEX(Prop2020DistTar!$E$8:$E$28,S$33)","v":7.1461077879984369},{"$f":"INDEX(Prop2020DistTar!$E$8:$E$28,T$33)","v":4.8849},{"$f":"INDEX(Prop2020DistTar!$E$8:$E$28,U$33)","v":2.5264000000000002},{"$f":"INDEX(Prop2020DistTar!$E$8:$E$28,V$33)","v":1.2781},{"$f":"INDEX(Prop2020DistTar!$E$8:$E$28,W$33)","v":0.96130000000000004}]
[]
[null,{"$f":"\"Proposed (1 Jan-31 Dec): \"&B32","v":"Proposed (1 Jan-31 Dec): Tariff V - Multinet Residential"},{"$f":"INDEX(Prop2020DistTar!$D$8:$D$28,C$32)","v":0.183},{"$f":"INDEX(Prop2020DistTar!$D$8:$D$28,D$32)","v":8.7502965387832621},{"$f":"INDEX(Prop2020DistTar!$D$8:$D$28,E$32)","v":5.8383000000000003},{"$f":"INDEX(Prop2020DistTar!$D$8:$D$28,F$32)","v":3.0185},{"$f":"INDEX(Prop2020DistTar!$D$8:$D$28,G$32)","v":1.5276000000000001},{"$f":"INDEX(Prop2020DistTar!$D$8:$D$28,H$32)","v":1.1329},{"$f":"INDEX(Prop2020DistTar!$D$8:$D$28,I$32)","v":8.3515498907265346},{"$f":"INDEX(Prop2020DistTar!$D$8:$D$28,J$32)","v":5.5464000000000002},{"$f":"INDEX(Prop2020DistTar!$D$8:$D$28,K$32)","v":2.8685999999999998},{"$f":"INDEX(Prop2020DistTar!$D$8:$D$28,L$32)","v":1.4513},{"$f":"INDEX(Prop2020DistTar!$D$8:$D$28,M$32)","v":1.0912999999999999},{"$f":"INDEX(Prop2020DistTar!$D$8:$D$28,N$32)","v":8.3515498907265346},{"$f":"INDEX(Prop2020DistTar!$D$8:$D$28,O$32)","v":5.5464000000000002},{"$f":"INDEX(Prop2020DistTar!$D$8:$D$28,P$32)","v":2.8685999999999998},{"$f":"INDEX(Prop2020DistTar!$D$8:$D$28,Q$32)","v":1.4513},{"$f":"INDEX(Prop2020DistTar!$D$8:$D$28,R$32)","v":1.0912999999999999},{"$f":"INDEX(Prop2020DistTar!$D$8:$D$28,S$32)","v":7.4725368875245666},{"$f":"INDEX(Prop2020DistTar!$D$8:$D$28,T$32)","v":4.9626999999999999},{"$f":"INDEX(Prop2020DistTar!$D$8:$D$28,U$32)","v":2.5666000000000002},{"$f":"INDEX(Prop2020DistTar!$D$8:$D$28,V$32)","v":1.2985},{"$f":"INDEX(Prop2020DistTar!$D$8:$D$28,W$32)","v":0.97660000000000002}]
[]
[null,"Distribution volumes (actual)","Fixed","PkBlk1","PkBlk2","PkBlk3","PkBlk4","PkBlk5","Shd1Blk1","Shd1Blk2","Shd1Blk3","Shd1Blk4","Shd1Blk5","Shd2Blk1","Shd2Blk2","Shd2Blk3","Shd2Blk4","Shd2Blk5","OPkBlk1","OPkBlk2","OPkBlk3","OPkBlk4","OPkBlk5"]
{"$rows_left_out":246}
{"sheet":"ARS","index":5,"n_rows":16,"n_cols":3,"rows_kept":16,"cut":false,"hidden":false,"merged":[]}
[{"$f":"\"Tariff Approval - \"&'Model update'!B3","v":"Tariff Approval - MultiNet"}]
[]
["Ancillary Reference Services (Exc GST)"]
[]
[null,{"$f":"'Model update'!$B$8","v":2019},{"$f":"'Model update'!$B$5","v":2020}]
["Meter Investigation – High Account Investigation Between the hours of 8am and 4pm on a Business Day",148.71698283649505,{"$f":"ROUND(B6*(1+'Model update'!$B$30),2)","v":151.09}]
["Meter Disconnection – Use of locks & plugs Between the hours of 8am and 4pm on a Business Day",52.090243902439028,{"$f":"ROUND(B7*(1+'Model update'!$B$30),2)","v":52.92}]
["Meter Removal – Various Between the hours of 8am and 4pm on a Business Day",62.236766034327012,{"$f":"ROUND(B8*(1+'Model update'!$B$30),2)","v":63.23}]
["Reconnect Between the hours of 8am and 4pm on a Business Day",43.924028906955741,{"$f":"ROUND(B9*(1+'Model update'!$B$30),2)","v":44.62}]
["Special Meter Reads Between the hours of 8am and 4pm on a Business Day",6.6758807588075886,{"$f":"ROUND(B10*(1+'Model update'!$B$30),2)","v":6.78}]
["Installation of a second service valve in a pit and disconnect gas supply – paved (without traffic Mgt)",3320.0359530261971,{"$f":"ROUND(B11*(1+'Model update'!$B$30),2)","v":3372.92}]
["Installation of a second service valve in a pit and disconnect gas supply – paved (with traffic Mgt)",4114.1595302619698,{"$f":"ROUND(B12*(1+'Model update'!$B$30),2)","v":4179.6899999999996}]
["Installation of a second service valve in a pit and disconnect gas supply – unpaved (without traffic Mgt)",1575.7936766034329,{"$f":"ROUND(B13*(1+'Model update'!$B$30),2)","v":1600.89}]
["Installation of a second service valve in a pit and disconnect gas supply – unpaved (with traffic Mgt)",2171.3863595302623,{"$f":"ROUND(B14*(1+'Model update'!$B$30),2)","v":2205.9699999999998}]
[]
["Note: Formula is as per AA2018-22, Part B, section 2, p9 : ART = ARTt-1  * (1+CPIt)"]