{"text_format":"1","workbook":"xlsx","n_sheets":6,"sheets":["NOTES","Model update","Prop2021DistTar","2021TarContForm","2021RebalContForm","ARS"],"not_rendered":{"charts":0,"images":0,"macros":1,"external_links":0,"defined_names":30,"comments":1,"pivot_tables":0},"unopened":[],"bounds":{"document_bytes":16777216,"sheet_cells":100000,"rows_first":2000,"rows_last":500,"rows_between":2000,"halvings":0,"cell_chars":16384,"cell_head_chars":4096},"cells_cut":0,"cells_raw":0,"read":"whole","date_system":"1900"}

{"sheet":"NOTES","index":0,"n_rows":22,"n_cols":5,"rows_kept":22,"cut":false,"hidden":false,"merged":[]}
[]
["The model has actual and test data to illustrate the workings of the model.",null,null,{"$f":"'Model update'!B5","v":2021}]
[]
["Issue","Location","Item","Comment"]
[]
[1,"'Model update'!B21","CPI",{"$f":"\"Updated June \"&D2-1&\" CPI for \"&D2","v":"Updated June 2020 CPI for 2021"},"NOTE: This worksheet is programmed to update for each year - use as checklist and note any placeholders or changes"]
[null,null,null,null,"NOTE: Worksheet names in this file are programmed to update each year once each worksheet is accessed and a cell is selected"]
[{"$f":"A6+1","v":2},"'Model update'!B36",{"$f":"\"Xt for \"&D2","v":"Xt for 2021"},{"$f":"\"Updated for \"&D2&\" annual update \"","v":"Updated for 2021 annual update "}]
[]
[{"$f":"A8+1","v":3},"'Model update'!B46",{"$f":"\"Pass Through Amount for \"&D2","v":"Pass Through Amount for 2021"},"NIL for 2020"]
[]
[{"$f":"A10+1","v":4},"'Model update'!B58","Real Pre-tax WACC (rptw)",{"$f":"\"Updated for \"&$D$2&\" annual update\"","v":"Updated for 2021 annual update"}]
[]
[{"$f":"A12+1","v":5},{"$f":"\"Prop\"&D2&\"DistTar!E8:E165\"","v":"Prop2021DistTar!E8:E165"},{"$f":"D2-1&\" tariffs\"","v":"2020 tariffs"},{"$f":"\"Updated from \"&D2-1&\" model\"","v":"Updated from 2020 model"}]
[]
[{"$f":"A14+1","v":6},"ARS!B6:B14",{"$f":"D2-1&\" ARS tariffs\"","v":"2020 ARS tariffs"},{"$f":"\"Updated from \"&D2-1&\" model\"","v":"Updated from 2020 model"}]
[]
[{"$f":"A16+1","v":7},"The following is test data to illustrate the workings of the model.",null,"Input data required from DNSPs"]
[null,{"$f":"\"Prop\"&D2&\"DistTar!D8:D165\"","v":"Prop2021DistTar!D8:D165"},{"$f":"\"Proposed \"&D2&\" Tariffs\"","v":"Proposed 2021 Tariffs"}]
[null,{"$f":"\"Prop\"&D2&\"DistTar!F8:F165\"","v":"Prop2021DistTar!F8:F165"},{"$f":"\"Actual \"&D2-2&\" Volumes\"","v":"Actual 2019 Volumes"}]
[]
[null,"ARS!C6:C14",{"$f":"\"Proposed \"&D2&\" Ancillary Reference Services Charges\"","v":"Proposed 2021 Ancillary Reference Services Charges"},"Calculated using formula"]

{"sheet":"Model update","index":1,"n_rows":58,"n_cols":2,"rows_kept":58,"cut":false,"hidden":false,"merged":[[54,0,55,1]]}
[]
[]
["Tariff Approval Template for ","MultiNet"]
[]
["Calendar year commencing",2021]
[]
["t",{"$f":"B5","v":2021}]
["t-1",{"$f":"B7-1","v":2020}]
["t-2",2019]
["t-3",2018]
[]
[]
["Please fill in yellow highlighted cells where appropriate"]
[]
["CPI"]
[]
["CPI Index June 2016",108.6]
["CPI Index June 2017",110.7]
["CPI Index June 2018",113]
["CPI Index June 2019",114.8]
["CPI Index June 2020",114.4]
["CPI Index June 2021"]
[]
[]
[{"$f":"\"CPI Index June \" &$B$10","v":"CPI Index June 2018"},{"$f":"VLOOKUP(A25,A$17:D$22,2,FALSE)","v":113}]
[{"$f":"\"CPI Index June \" &$B$9","v":"CPI Index June 2019"},{"$f":"VLOOKUP(A26,A$17:D$22,2,FALSE)","v":114.8}]
[{"$f":"\"CPI Index June \" &$B$8","v":"CPI Index June 2020"},{"$f":"VLOOKUP(A27,A$17:D$22,2,FALSE)","v":114.4}]
[]
[{"$f":"\"CPI \" &$B$8","v":"CPI 2020"},{"$f":"B26/B25-1","v":1.5929203539823078E-2}]
[{"$f":"\"CPI \" &$B$5","v":"CPI 2021"},{"$f":"B27/B26-1","v":-3.4843205574912606E-3}]
[]
[]
[{"$f":"\"Xt for \"&B$5","v":"Xt for 2021"}]
[2019,-1.7757344845594263E-2]
[2020,-1.1736521921608076E-2]
[2021,-9.5596923257416158E-3]
[2022,-1.7999999999999999E-2]
[]
[]
[{"$f":"\"Xt for \"&B$5","v":"Xt for 2021"},{"$f":"VLOOKUP(B5,A34:B38,2,FALSE)","v":-9.5596923257416158E-3}]
{"$rows_left_out":19}
{"sheet":"Prop2021DistTar","index":2,"n_rows":168,"n_cols":8,"rows_kept":168,"cut":false,"hidden":false,"merged":[]}
[null,{"$f":"\"Tariff Approval - \"&'Model update'!B3","v":"Tariff Approval - MultiNet"},{"$f":"\"Prop\"&'Model update'!B5&\"DistTar\"","v":"Prop2021DistTar"}]
[]
[null,{"$f":"\"PROPOSED \"&'Model update'!$B$5&\" DISTRIBUTION TARIFFS\"","v":"PROPOSED 2021 DISTRIBUTION TARIFFS"}]
[]
[null,"Proposed tariff name","Existing name","Prop\n2021 Tariff",{"$f":"\"Exist\n\"&'Model update'!$B$8&\" Tariff\"","v":"Exist\n2020 Tariff"},"Actual 2019 Volumes","Prop Tar\nRevenue","Exist Tar\nRevenue"]
[null,"Tariff V - Multinet Residential","Tariff V - Multinet Residential"]
[null,"1 January - 31 December","1 January - 31 December"]
[null,"Fixed Charge","Fixed Charge",0.183,0.183,683819,{"$f":"D8*$F8*365","v":45675690.104999997},{"$f":"E8*$F8*365","v":45675690.104999997}]
[null,"Peak 0 - 0.05","Peak 0 - 0.05",8.8805999999999994,8.7502965387832621,3656357.6590307998,{"$f":"D9*$F9","v":32470649.826788917},31994213.768370878]
[null,"Peak 0.05 - 0.1","Peak 0.05 - 0.1",5.8383000000000003,5.8383000000000003,3045063.9529073001,17777996.87625869,17777996.87625869]
[null,"Peak 0.1 -0.15","Peak 0.1 -0.15",3.0185,3.0185,2645466.0950507997,7985339.4079108387,7985339.4079108387]
[null,"Peak 0.15 - 0.25","Peak 0.15 - 0.25",1.5276000000000001,1.5276000000000001,4271305.6881771004,6524846.569259339,6524846.569259339]
[null,"Peak >0.25","Peak >0.25",1.1329,1.1329,7916490.7287751995,8968592.346629424,8968592.346629424]
[null,"May Shoulder 0 - 0.05","May Shoulder 0 - 0.05",8.4760000000000009,8.3515498907265346,910259.82547619997,7715362.2807362713,7602080.345988512]
[null,"May Shoulder 0.05 - 0.1","May Shoulder 0.05 - 0.1",5.5464000000000002,5.5464000000000002,709598.92964590003,3935719.5033880202,3935719.5033880202]
[null,"May Shoulder 0.1 -0.15","May Shoulder 0.1 -0.15",2.8685999999999998,2.8685999999999998,564811.02874089999,1620216.9170461455,1620216.9170461455]
[null,"May Shoulder 0.15 - 0.25","May Shoulder 0.15 - 0.25",1.4513,1.4513,787777.1574727,1143300.9886401296,1143300.9886401296]
[null,"May Shoulder >0.25","May Shoulder >0.25",1.0912999999999999,1.0912999999999999,1101432.5439166001,1201993.3351761855,1201993.3351761855]
[null,"Oct Shoulder 0 - 0.05","Oct Shoulder 0 - 0.05",8.4760000000000009,8.3515498907265346,898951.67758010002,7619514.4191689286,7507639.7846625196]
[null,"Oct Shoulder 0.05 - 0.1","Oct Shoulder 0.05 - 0.1",5.5464000000000002,5.5464000000000002,656008.13638489996,3638483.5276452093,3638483.5276452093]
[null,"Oct Shoulder 0.1 -0.15","Oct Shoulder 0.1 -0.15",2.8685999999999998,2.8685999999999998,466704.85743720003,1338789.5540443519,1338789.5540443519]
[null,"Oct Shoulder 0.15 - 0.25","Oct Shoulder 0.15 - 0.25",1.4513,1.4513,536718.77040570008,778939.95148979255,778939.95148979255]
[null,"Oct Shoulder >0.25","Oct Shoulder >0.25",1.0912999999999999,1.0912999999999999,547491.79961370002,597477.80091843079,597477.80091843079]
[null,"Off Peak 0 - 0.05","Off Peak 0 - 0.05",7.5838999999999999,7.4725368875245666,4531241.1013417002,34364479.388465323,33859866.276043296]
[null,"Off Peak 0.05 - 0.1","Off Peak 0.05 - 0.1",4.9626999999999999,4.9626999999999999,1955394.8698773,9704038.1207400765,9704038.1207400765]
[null,"Off Peak 0.1 -0.15","Off Peak 0.1 -0.15",2.5666000000000002,2.5666000000000002,938386.89220689994,2408463.7975382297,2408463.7975382297]
[null,"Off Peak 0.15 - 0.25","Off Peak 0.15 - 0.25",1.2985,1.2985,845215.13879130001,1097511.8577205031,1097511.8577205031]
[null,"Off Peak >0.25","Off Peak >0.25",0.97660000000000002,0.97660000000000002,1162552.1081513001,{"$f":"D28*$F28","v":1135348.3888205597},{"$f":"E28*$F28","v":1135348.3888205597}]
[null,"Tariff V - Multinet Non-Residential","Tariff V - Multinet Non-Residential"]
[null,"1 January - 31 December","1 January - 31 December"]
[null,"Fixed Charge","Fixed Charge",0.30180000000000001,0.30180000000000001,15954,{"$f":"D31*$F31*365","v":1757444.7779999999},{"$f":"E31*$F31*365","v":1757444.7779999999}]
[null,"Peak 0 - 0.25","Peak 0 - 0.25",4.0556000000000001,3.9961125101069404,311065.4927147,{"$f":"D32*$F32","v":1261557.2122537373},1243052.706899792]
[null,"Peak 0.25 - 1","Peak 0.25 - 1",2.3485999999999998,2.3485999999999998,511137.53289869998,1200457.6097658866,1200457.6097658866]
[null,"Peak 1 - 1.5","Peak 1 - 1.5",1.4092,1.4092,201892.02762110002,284506.24532365415,284506.24532365415]
[null,"Peak 1.5 - 5","Peak 1.5 - 5",0.78420000000000001,0.78420000000000001,692403.02085239999,542982.44895245205,542982.44895245205]
[null,"Peak >5","Peak >5",0.26169999999999999,0.26169999999999999,899358.90232170012,235362.2247375889,235362.2247375889]
[null,"May Shoulder 0 - 0.25","May Shoulder 0 - 0.25",3.722,3.6673575297524805,74302.652958199993,276554.4743104204,272494.39380684018]
[null,"May Shoulder 0.25 - 1","May Shoulder 0.25 - 1",2.1139000000000001,2.1139000000000001,115553.00397239999,244267.49509725635,244267.49509725635]
[null,"May Shoulder 1 - 1.5","May Shoulder 1 - 1.5",1.3387,1.3387,44583.311007299999,59683.678445472506,59683.678445472506]
[null,"May Shoulder 1.5 - 5","May Shoulder 1.5 - 5",0.7641,0.7641,145396.4190083,111097.40376424203,111097.40376424203]
{"$rows_left_out":129}
{"sheet":"2021TarContForm","index":3,"n_rows":44,"n_cols":3,"rows_kept":44,"cut":false,"hidden":false,"merged":[[43,1,43,3]]}
[null,{"$f":"\"Tariff Approval - \"&'Model update'!B3","v":"Tariff Approval - MultiNet"},{"$f":"'Model update'!B5&\"TarContForm\"","v":"2021TarContForm"}]
[]
[null,{"$f":"'Model update'!$B$5&\"  TARIFF CONTROL FORMULA\"","v":"2021  TARIFF CONTROL FORMULA"}]
[]
[]
[null,"CPI"]
[]
[null,{"$f":"\"CPI Sept\"&'Model update'!$B$9","v":"CPI Sept2019"},{"$f":"'Model update'!B26","v":114.8}]
[null,{"$f":"\"CPI Sept\"&'Model update'!$B$8","v":"CPI Sept2020"},{"$f":"'Model update'!B27","v":114.4}]
[]
[null,{"$f":"\"CPI \"&'Model update'!$B$5","v":"CPI 2021"},{"$f":"(C9/C8-1)","v":-3.4843205574912606E-3}]
[]
[]
[]
[null,"X factor"]
[]
[null,{"$f":"\"X \"&'Model update'!$B$5","v":"X 2021"},{"$f":"'Model update'!B40","v":-9.5596923257416158E-3}]
[]
[]
[null,"Pass Through Factor (PT)"]
[]
[null,"pass through"]
[null,{"$f":"\"AP (t) \"&'Model update'!$B$7","v":"AP (t) 2021"},{"$f":"'Model update'!B50","v":0}]
[]
[null,"Revenue"]
[null,"∑∑p(t-1)q(t-2)",{"$f":"C41","v":212736084.9228307}]
[]
[null,"PT' (t-1)",0]
[null,{"$f":"\"PT' \"&'Model update'!$B$5","v":"PT' 2021"},{"$f":"IF(C26=\"\",0,(C23)/((1+C11)*(1-C17)*C26))","v":0}]
[]
[null,{"$f":"\"PTt \"&'Model update'!$B$5","v":"PTt 2021"},{"$f":"((1+C29)/(1+C28))-1","v":0}]
[]
[]
[]
[]
[null,{"$f":"'Model update'!$B$5&\"  Distribution price control\"","v":"2021  Distribution price control"}]
[]
[null,"Average price movement allowed",{"$f":"(1+C11)*(1-C17)*(1+C31)","v":1.0060420627357567}]
[]
[null,"Proposed distribution tariff revenue",{"$f":"IF(Prop2021DistTar!G168=0,\"\",Prop2021DistTar!G168)","v":214021448.95674565}]
{"$rows_left_out":5}
{"sheet":"2021RebalContForm","index":4,"n_rows":285,"n_cols":23,"rows_kept":285,"cut":false,"hidden":false,"merged":[[284,1,284,2],[57,1,57,2],[87,1,87,2],[117,1,117,2],[147,1,147,2],[177,1,177,2],[207,1,207,2],[231,1,231,2],[260,1,260,2]]}
[null,{"$f":"\"Tariff Approval - \"&'Model update'!B3","v":"Tariff Approval - MultiNet"},{"$f":"'Model update'!B5&\"RebalContForm\"","v":"2021RebalContForm"}]
[]
[null,{"$f":"'Model update'!$B$5&\"  REBALANCING CONTROL FORMULA\"","v":"2021  REBALANCING CONTROL FORMULA"}]
[]
[]
[null,"Rebalancing control"]
[]
[null,{"$f":"\"CPI \"&'Model update'!$B$5","v":"CPI 2021"},{"$f":"'2021TarContForm'!C11","v":-3.4843205574912606E-3}]
[null,{"$f":"\"Y  \"&'Model update'!$B$5","v":"Y  2021"},0.02]
[null,{"$f":"\"PTt \"&'Model update'!$B$5","v":"PTt 2021"},{"$f":"'2021TarContForm'!C31","v":0}]
[null,{"$f":"\"Xt \"&'Model update'!$B$5","v":"Xt 2021"},{"$f":"'2021TarContForm'!C17","v":-9.5596923257416158E-3}]
[]
[null,"Rebalancing control",{"$f":"(1+C8)*(1+C9)*(1+C10)*(1-C11)","v":1.0261629039904718}]
[]
[]
[]
[null,"Rebalancing control summary"]
[null,null,"Existing","Proposed","Movement","Assessment"]
[null,{"$f":"B32","v":"Tariff V - Multinet Residential"},{"$f":"C53","v":196496549.22329113},{"$f":"C54","v":197702754.96338537},{"$f":"IF(C19=0,0,D19/C19)","v":1.0061385594040309},{"$f":"IF(E19=0,\"\",IF($C$13<=E19,\"Breached\",\"Compliant\"))","v":"Compliant"}]
[null,{"$f":"B62","v":"Tariff V - Yarra Valley Residential"},{"$f":"C83","v":2241032.7135930322},{"$f":"C84","v":2252666.2557577468},1.005191152317479,{"$f":"IF(E20=0,\"\",IF($C$13<=E20,\"Breached\",\"Compliant\"))","v":"Compliant"}]
[null,{"$f":"B92","v":"Tariff V - South Gippsland Residential"},{"$f":"C113","v":1780664.4963502509},{"$f":"C114","v":1791047.5503921581},1.0058309996426553,"Compliant"]
[null,{"$f":"B122","v":"Tariff V - Multinet Non-Residential"},{"$f":"C143","v":9755654.1704569012},{"$f":"C144","v":9799759.6909088157},1.0045210213155649,"Compliant"]
[null,{"$f":"B152","v":"Tariff V - Yarra Valley Non-Residential"},{"$f":"C173","v":112777.85159282466},{"$f":"C174","v":113182.63710210066},1.0035892287675194,"Compliant"]
[null,{"$f":"B182","v":"Tariff V - South Gippsland Non-Residential"},{"$f":"C203","v":378550.85654154012},{"$f":"C204","v":379274.61404442968},1.0019119161676235,"Compliant"]
[null,{"$f":"B212","v":"Tariff D - Multinet"},{"$f":"C227","v":1866759.6455209991},{"$f":"C228","v":1878038.7589909991},1.0060420812593964,"Compliant"]
[null,{"$f":"B265","v":"Tariff D - Multinet South Gippsland"},{"$f":"C280","v":71688.431318000003},{"$f":"C281","v":72121.576526000004},1.0060420516956023,"Compliant"]
[null,"Tariff L - Multinet",{"$f":"C256","v":32407.534165999998},{"$f":"C257","v":32602.909637999997},1.0060287052695598,"Compliant"]
[null,null,{"$f":"SUM(C19:C27)","v":212736084.92283073},{"$f":"SUM(D19:D27)","v":214021448.95674559},1.0060420592697339]
[]
[]
[]
[null,{"$f":"Prop2021DistTar!B6","v":"Tariff V - Multinet Residential"},1,2,3,4,5,6,7,8,9,10,11,12,13,14,15,16,17,18,19,20,21]
[null,null,1,2,3,4,5,6,7,8,9,10,11,12,13,14,15,16,17,18,19,20,21]
[null,"Distribution tariff","Fixed","PkBlk1","PkBlk2","PkBlk3","PkBlk4","PkBlk5","Shd1Blk1","Shd1Blk2","Shd1Blk3","Shd1Blk4","Shd1Blk5","Shd2Blk1","Shd2Blk2","Shd2Blk3","Shd2Blk4","Shd2Blk5","OPkBlk1","OPkBlk2","OPkBlk3","OPkBlk4","OPkBlk5"]
[]
[null,{"$f":"\"Existing (1 Jan-31 Dec): \"&Prop2021DistTar!C6","v":"Existing (1 Jan-31 Dec): Tariff V - Multinet Residential"},{"$f":"INDEX(Prop2021DistTar!$E$8:$E$28,C$33)","v":0.183},{"$f":"INDEX(Prop2021DistTar!$E$8:$E$28,D$33)","v":8.7502965387832621},{"$f":"INDEX(Prop2021DistTar!$E$8:$E$28,E$33)","v":5.8383000000000003},{"$f":"INDEX(Prop2021DistTar!$E$8:$E$28,F$33)","v":3.0185},{"$f":"INDEX(Prop2021DistTar!$E$8:$E$28,G$33)","v":1.5276000000000001},{"$f":"INDEX(Prop2021DistTar!$E$8:$E$28,H$33)","v":1.1329},{"$f":"INDEX(Prop2021DistTar!$E$8:$E$28,I$33)","v":8.3515498907265346},{"$f":"INDEX(Prop2021DistTar!$E$8:$E$28,J$33)","v":5.5464000000000002},{"$f":"INDEX(Prop2021DistTar!$E$8:$E$28,K$33)","v":2.8685999999999998},{"$f":"INDEX(Prop2021DistTar!$E$8:$E$28,L$33)","v":1.4513},{"$f":"INDEX(Prop2021DistTar!$E$8:$E$28,M$33)","v":1.0912999999999999},{"$f":"INDEX(Prop2021DistTar!$E$8:$E$28,N$33)","v":8.3515498907265346},{"$f":"INDEX(Prop2021DistTar!$E$8:$E$28,O$33)","v":5.5464000000000002},{"$f":"INDEX(Prop2021DistTar!$E$8:$E$28,P$33)","v":2.8685999999999998},{"$f":"INDEX(Prop2021DistTar!$E$8:$E$28,Q$33)","v":1.4513},{"$f":"INDEX(Prop2021DistTar!$E$8:$E$28,R$33)","v":1.0912999999999999},{"$f":"INDEX(Prop2021DistTar!$E$8:$E$28,S$33)","v":7.4725368875245666},{"$f":"INDEX(Prop2021DistTar!$E$8:$E$28,T$33)","v":4.9626999999999999},{"$f":"INDEX(Prop2021DistTar!$E$8:$E$28,U$33)","v":2.5666000000000002},{"$f":"INDEX(Prop2021DistTar!$E$8:$E$28,V$33)","v":1.2985},{"$f":"INDEX(Prop2021DistTar!$E$8:$E$28,W$33)","v":0.97660000000000002}]
[]
[null,{"$f":"\"Proposed (1 Jan-31 Dec): \"&B32","v":"Proposed (1 Jan-31 Dec): Tariff V - Multinet Residential"},{"$f":"INDEX(Prop2021DistTar!$D$8:$D$28,C$32)","v":0.183},{"$f":"INDEX(Prop2021DistTar!$D$8:$D$28,D$32)","v":8.8805999999999994},{"$f":"INDEX(Prop2021DistTar!$D$8:$D$28,E$32)","v":5.8383000000000003},{"$f":"INDEX(Prop2021DistTar!$D$8:$D$28,F$32)","v":3.0185},{"$f":"INDEX(Prop2021DistTar!$D$8:$D$28,G$32)","v":1.5276000000000001},{"$f":"INDEX(Prop2021DistTar!$D$8:$D$28,H$32)","v":1.1329},{"$f":"INDEX(Prop2021DistTar!$D$8:$D$28,I$32)","v":8.4760000000000009},{"$f":"INDEX(Prop2021DistTar!$D$8:$D$28,J$32)","v":5.5464000000000002},{"$f":"INDEX(Prop2021DistTar!$D$8:$D$28,K$32)","v":2.8685999999999998},{"$f":"INDEX(Prop2021DistTar!$D$8:$D$28,L$32)","v":1.4513},{"$f":"INDEX(Prop2021DistTar!$D$8:$D$28,M$32)","v":1.0912999999999999},{"$f":"INDEX(Prop2021DistTar!$D$8:$D$28,N$32)","v":8.4760000000000009},{"$f":"INDEX(Prop2021DistTar!$D$8:$D$28,O$32)","v":5.5464000000000002},{"$f":"INDEX(Prop2021DistTar!$D$8:$D$28,P$32)","v":2.8685999999999998},{"$f":"INDEX(Prop2021DistTar!$D$8:$D$28,Q$32)","v":1.4513},{"$f":"INDEX(Prop2021DistTar!$D$8:$D$28,R$32)","v":1.0912999999999999},{"$f":"INDEX(Prop2021DistTar!$D$8:$D$28,S$32)","v":7.5838999999999999},{"$f":"INDEX(Prop2021DistTar!$D$8:$D$28,T$32)","v":4.9626999999999999},{"$f":"INDEX(Prop2021DistTar!$D$8:$D$28,U$32)","v":2.5666000000000002},{"$f":"INDEX(Prop2021DistTar!$D$8:$D$28,V$32)","v":1.2985},{"$f":"INDEX(Prop2021DistTar!$D$8:$D$28,W$32)","v":0.97660000000000002}]
[]
[null,"Distribution volumes (actual)","Fixed","PkBlk1","PkBlk2","PkBlk3","PkBlk4","PkBlk5","Shd1Blk1","Shd1Blk2","Shd1Blk3","Shd1Blk4","Shd1Blk5","Shd2Blk1","Shd2Blk2","Shd2Blk3","Shd2Blk4","Shd2Blk5","OPkBlk1","OPkBlk2","OPkBlk3","OPkBlk4","OPkBlk5"]
{"$rows_left_out":246}
{"sheet":"ARS","index":5,"n_rows":16,"n_cols":3,"rows_kept":16,"cut":false,"hidden":false,"merged":[]}
[{"$f":"\"Tariff Approval - \"&'Model update'!B3","v":"Tariff Approval - MultiNet"}]
[]
["Ancillary Reference Services (Exc GST)"]
[]
[null,{"$f":"'Model update'!$B$8","v":2020},{"$f":"'Model update'!$B$5","v":2021}]
["Meter Investigation – High Account Investigation Between the hours of 8am and 4pm on a Business Day",151.09,{"$f":"ROUND(B6*(1+'Model update'!$B$30),2)","v":150.56}]
["Meter Disconnection – Use of locks & plugs Between the hours of 8am and 4pm on a Business Day",52.92,{"$f":"ROUND(B7*(1+'Model update'!$B$30),2)","v":52.74}]
["Meter Removal – Various Between the hours of 8am and 4pm on a Business Day",63.23,{"$f":"ROUND(B8*(1+'Model update'!$B$30),2)","v":63.01}]
["Reconnect Between the hours of 8am and 4pm on a Business Day",44.62,{"$f":"ROUND(B9*(1+'Model update'!$B$30),2)","v":44.46}]
["Special Meter Reads Between the hours of 8am and 4pm on a Business Day",6.78,{"$f":"ROUND(B10*(1+'Model update'!$B$30),2)","v":6.76}]
["Installation of a second service valve in a pit and disconnect gas supply – paved (without traffic Mgt)",3372.92,{"$f":"ROUND(B11*(1+'Model update'!$B$30),2)","v":3361.17}]
["Installation of a second service valve in a pit and disconnect gas supply – paved (with traffic Mgt)",4179.6899999999996,{"$f":"ROUND(B12*(1+'Model update'!$B$30),2)","v":4165.13}]
["Installation of a second service valve in a pit and disconnect gas supply – unpaved (without traffic Mgt)",1600.89,{"$f":"ROUND(B13*(1+'Model update'!$B$30),2)","v":1595.31}]
["Installation of a second service valve in a pit and disconnect gas supply – unpaved (with traffic Mgt)",2205.9699999999998,{"$f":"ROUND(B14*(1+'Model update'!$B$30),2)","v":2198.2800000000002}]
[]
["Note: Formula is as per AA2018-22, Part B, section 2, p9 : ART = ARTt-1  * (1+CPIt)"]