{"text_format":"1","workbook":"xlsx","n_sheets":6,"sheets":["NOTES","Model update","Prop2022DistTar","2022TarContForm","2022RebalContForm","ARS"],"not_rendered":{"charts":0,"images":0,"macros":1,"external_links":0,"defined_names":30,"comments":1,"pivot_tables":0},"unopened":[],"bounds":{"document_bytes":16777216,"sheet_cells":100000,"rows_first":2000,"rows_last":500,"rows_between":2000,"halvings":0,"cell_chars":16384,"cell_head_chars":4096},"cells_cut":0,"cells_raw":0,"read":"whole","date_system":"1900"}

{"sheet":"NOTES","index":0,"n_rows":22,"n_cols":5,"rows_kept":22,"cut":false,"hidden":true,"merged":[]}
[]
["The model has actual and test data to illustrate the workings of the model.",null,null,{"$f":"'Model update'!B5","v":2022}]
[]
["Issue","Location","Item","Comment"]
[]
[1,"'Model update'!B21","CPI",{"$f":"\"Updated June \"&D2-1&\" CPI for \"&D2","v":"Updated June 2021 CPI for 2022"},"NOTE: This worksheet is programmed to update for each year - use as checklist and note any placeholders or changes"]
[null,null,null,null,"NOTE: Worksheet names in this file are programmed to update each year once each worksheet is accessed and a cell is selected"]
[{"$f":"A6+1","v":2},"'Model update'!B36",{"$f":"\"Xt for \"&D2","v":"Xt for 2022"},{"$f":"\"Updated for \"&D2&\" annual update \"","v":"Updated for 2022 annual update "}]
[]
[{"$f":"A8+1","v":3},"'Model update'!B46",{"$f":"\"Pass Through Amount for \"&D2","v":"Pass Through Amount for 2022"},"NIL for 2022"]
[]
[{"$f":"A10+1","v":4},"'Model update'!B58","Real Pre-tax WACC (rptw)",{"$f":"\"Updated for \"&$D$2&\" annual update\"","v":"Updated for 2022 annual update"}]
[]
[{"$f":"A12+1","v":5},{"$f":"\"Prop\"&D2&\"DistTar!E8:E165\"","v":"Prop2022DistTar!E8:E165"},{"$f":"D2-1&\" tariffs\"","v":"2021 tariffs"},{"$f":"\"Updated from \"&D2-1&\" model\"","v":"Updated from 2021 model"}]
[]
[{"$f":"A14+1","v":6},"ARS!B6:B14",{"$f":"D2-1&\" ARS tariffs\"","v":"2021 ARS tariffs"},{"$f":"\"Updated from \"&D2-1&\" model\"","v":"Updated from 2021 model"}]
[]
[{"$f":"A16+1","v":7},"The following is test data to illustrate the workings of the model.",null,"Input data required from DNSPs"]
[null,{"$f":"\"Prop\"&D2&\"DistTar!D8:D165\"","v":"Prop2022DistTar!D8:D165"},{"$f":"\"Proposed \"&D2&\" Tariffs\"","v":"Proposed 2022 Tariffs"}]
[null,{"$f":"\"Prop\"&D2&\"DistTar!F8:F165\"","v":"Prop2022DistTar!F8:F165"},{"$f":"\"Actual \"&D2-2&\" Volumes\"","v":"Actual 2020 Volumes"}]
[]
[null,"ARS!C6:C14",{"$f":"\"Proposed \"&D2&\" Ancillary Reference Services Charges\"","v":"Proposed 2022 Ancillary Reference Services Charges"},"Calculated using formula"]

{"sheet":"Model update","index":1,"n_rows":58,"n_cols":2,"rows_kept":58,"cut":false,"hidden":false,"merged":[[54,0,55,1]]}
[]
[]
["Tariff Approval Template for ","MultiNet"]
[]
["Calendar year commencing",2022]
[]
["t",{"$f":"B5","v":2022}]
["t-1",{"$f":"B7-1","v":2021}]
["t-2",2020]
["t-3",2019]
[]
[]
["Please fill in yellow highlighted cells where appropriate"]
[]
["CPI"]
[]
["CPI Index June 2016",108.6]
["CPI Index June 2017",110.7]
["CPI Index June 2018",113]
["CPI Index June 2019",114.8]
["CPI Index June 2020",114.4]
["CPI Index June 2021",118.8]
[]
[]
[{"$f":"\"CPI Index June \" &$B$10","v":"CPI Index June 2019"},{"$f":"VLOOKUP(A25,A$17:D$22,2,FALSE)","v":114.8}]
[{"$f":"\"CPI Index June \" &$B$9","v":"CPI Index June 2020"},{"$f":"VLOOKUP(A26,A$17:D$22,2,FALSE)","v":114.4}]
[{"$f":"\"CPI Index June \" &$B$8","v":"CPI Index June 2021"},{"$f":"VLOOKUP(A27,A$17:D$22,2,FALSE)","v":118.8}]
[]
[{"$f":"\"CPI \" &$B$8","v":"CPI 2021"},{"$f":"B26/B25-1","v":-3.4843205574912606E-3}]
[{"$f":"\"CPI \" &$B$5","v":"CPI 2022"},{"$f":"B27/B26-1","v":3.8461538461538325E-2}]
[]
[]
[{"$f":"\"Xt for \"&B$5","v":"Xt for 2022"}]
[2019,-1.7757344845594263E-2]
[2020,-1.1736521921608076E-2]
[2021,-9.5596923257416158E-3]
[2022,-1.0014953218312436E-2]
[]
[]
[{"$f":"\"Xt for \"&B$5","v":"Xt for 2022"},{"$f":"VLOOKUP(B5,A34:B38,2,FALSE)","v":-1.0014953218312436E-2}]
{"$rows_left_out":19}
{"sheet":"Prop2022DistTar","index":2,"n_rows":168,"n_cols":8,"rows_kept":168,"cut":false,"hidden":false,"merged":[]}
[null,{"$f":"\"Tariff Approval - \"&'Model update'!B3","v":"Tariff Approval - MultiNet"},{"$f":"\"Prop\"&'Model update'!B5&\"DistTar\"","v":"Prop2022DistTar"}]
[]
[null,{"$f":"\"PROPOSED \"&'Model update'!$B$5&\" DISTRIBUTION TARIFFS\"","v":"PROPOSED 2022 DISTRIBUTION TARIFFS"}]
[]
[null,"Proposed tariff name","Existing name",{"$f":"\"Prop\n\"&'Model update'!B7&\" Tariff\"","v":"Prop\n2022 Tariff"},{"$f":"\"Exist\n\"&'Model update'!$B$8&\" Tariff\"","v":"Exist\n2021 Tariff"},{"$f":"\"Actual \"&'Model update'!B9&\" Volumes\"","v":"Actual 2020 Volumes"},"Prop Tar\nRevenue","Exist Tar\nRevenue"]
[null,"Tariff V - Multinet Residential","Tariff V - Multinet Residential"]
[null,"1 January - 31 December","1 January - 31 December"]
[null,"Fixed Charge","Fixed Charge",0.183,0.183,689383,{"$f":"D8*$F8*365","v":46047337.484999999},{"$f":"E8*$F8*365","v":46047337.484999999}]
[null,"Peak 0 - 0.05","Peak 0 - 0.05",9.6172000000000004,8.8805999999999994,3668242.6715000002,{"$f":"D9*$F9","v":35278223.420349807},32576195.868522901]
[null,"Peak 0.05 - 0.1","Peak 0.05 - 0.1",6.3226000000000004,5.8383000000000003,3035296.1157999998,19190963.22175708,17720969.31287514]
[null,"Peak 0.1 -0.15","Peak 0.1 -0.15",3.0185,3.0185,2622212.3738000002,7915148.0503153,7915148.0503153]
[null,"Peak 0.15 - 0.25","Peak 0.15 - 0.25",1.5276000000000001,1.5276000000000001,4252284.7959000003,6495790.2542168405,6495790.2542168405]
[null,"Peak >0.25","Peak >0.25",1.1329,1.1329,8080820.3513000002,9154761.37598777,9154761.37598777]
[null,"May Shoulder 0 - 0.05","May Shoulder 0 - 0.05",9.1790000000000003,8.4760000000000009,928731.71010000003,8524828.3670079,7871929.9748076014]
[null,"May Shoulder 0.05 - 0.1","May Shoulder 0.05 - 0.1",6.0064000000000002,5.5464000000000002,758383.4497,4555154.3522780798,4206297.9654160803]
[null,"May Shoulder 0.1 -0.15","May Shoulder 0.1 -0.15",2.8685999999999998,2.8685999999999998,642917.08799999999,1844271.9586367998,1844271.9586367998]
[null,"May Shoulder 0.15 - 0.25","May Shoulder 0.15 - 0.25",1.4513,1.4513,994914.68740000005,1443919.6858236201,1443919.6858236201]
[null,"May Shoulder >0.25","May Shoulder >0.25",1.0912999999999999,1.0912999999999999,1589898.0086000001,1735055.6967851799,1735055.6967851799]
[null,"Oct Shoulder 0 - 0.05","Oct Shoulder 0 - 0.05",9.1790000000000003,8.4760000000000009,892680.26489999995,8193912.1515170997,7566357.9252924006]
[null,"Oct Shoulder 0.05 - 0.1","Oct Shoulder 0.05 - 0.1",6.0064000000000002,5.5464000000000002,626786.33089999994,3764729.4179177596,3476407.70570376]
[null,"Oct Shoulder 0.1 -0.15","Oct Shoulder 0.1 -0.15",2.8685999999999998,2.8685999999999998,425681.24489999999,1221109.21912014,1221109.21912014]
[null,"Oct Shoulder 0.15 - 0.25","Oct Shoulder 0.15 - 0.25",1.4513,1.4513,471225.7807,683889.97552991007,683889.97552991007]
[null,"Oct Shoulder >0.25","Oct Shoulder >0.25",1.0912999999999999,1.0912999999999999,471364.97399999999,514400.59612619993,514400.59612619993]
[null,"Off Peak 0 - 0.05","Off Peak 0 - 0.05",8.2128999999999994,7.5838999999999999,4713253.2405000003,38709477.538902447,35744841.25062795]
[null,"Off Peak 0.05 - 0.1","Off Peak 0.05 - 0.1",5.3742999999999999,4.9626999999999999,2201464.395,11831330.098048499,10925207.3530665]
[null,"Off Peak 0.1 -0.15","Off Peak 0.1 -0.15",2.5666000000000002,2.5666000000000002,1113629.2634999999,2858240.8676991002,2858240.8676991002]
[null,"Off Peak 0.15 - 0.25","Off Peak 0.15 - 0.25",1.2985,1.2985,1108339.0597999999,1439178.2691503,1439178.2691503]
[null,"Off Peak >0.25","Off Peak >0.25",0.97660000000000002,0.97660000000000002,1449295.0033,{"$f":"D28*$F28","v":1415381.50022278},{"$f":"E28*$F28","v":1415381.50022278}]
[null,"Tariff V - Multinet Non-Residential","Tariff V - Multinet Non-Residential"]
[null,"1 January - 31 December","1 January - 31 December"]
[null,"Fixed Charge","Fixed Charge",0.30180000000000001,0.30180000000000001,16019,{"$f":"D31*$F31*365","v":1764604.983},{"$f":"E31*$F31*365","v":1764604.983}]
[null,"Peak 0 - 0.25","Peak 0 - 0.25",4.3920000000000003,4.0556000000000001,278106.35849999997,{"$f":"D32*$F32","v":1221443.126532},1127888.1475326]
[null,"Peak 0.25 - 1","Peak 0.25 - 1",2.5434000000000001,2.3485999999999998,422636.49489999999,1074933.66112866,992604.07192213985]
[null,"Peak 1 - 1.5","Peak 1 - 1.5",1.4092,1.4092,157292.19,221656.154148,221656.154148]
[null,"Peak 1.5 - 5","Peak 1.5 - 5",0.78420000000000001,0.78420000000000001,540414.17200000002,423792.79368240002,423792.79368240002]
[null,"Peak >5","Peak >5",0.26169999999999999,0.26169999999999999,684466.89789999998,179124.98718042998,179124.98718042998]
[null,"May Shoulder 0 - 0.25","May Shoulder 0 - 0.25",4.0307000000000004,3.722,70320.396099999998,283440.42056027002,261732.51428419998]
[null,"May Shoulder 0.25 - 1","May Shoulder 0.25 - 1",2.2892000000000001,2.1139000000000001,104300.19289999999,238764.00158668001,220480.17777131]
[null,"May Shoulder 1 - 1.5","May Shoulder 1 - 1.5",1.3387,1.3387,38641.798999999999,51729.7763213,51729.7763213]
[null,"May Shoulder 1.5 - 5","May Shoulder 1.5 - 5",0.7641,0.7641,131161.90100000001,100220.8085541,100220.8085541]
{"$rows_left_out":129}
{"sheet":"2022TarContForm","index":3,"n_rows":44,"n_cols":3,"rows_kept":44,"cut":false,"hidden":false,"merged":[[43,1,43,3]]}
[null,{"$f":"\"Tariff Approval - \"&'Model update'!B3","v":"Tariff Approval - MultiNet"},{"$f":"'Model update'!B5&\"TarContForm\"","v":"2022TarContForm"}]
[]
[null,{"$f":"'Model update'!$B$5&\"  TARIFF CONTROL FORMULA\"","v":"2022  TARIFF CONTROL FORMULA"}]
[]
[]
[null,"CPI"]
[]
[null,{"$f":"\"CPI Sept\"&'Model update'!$B$9","v":"CPI Sept2020"},{"$f":"'Model update'!B26","v":114.4}]
[null,{"$f":"\"CPI Sept\"&'Model update'!$B$8","v":"CPI Sept2021"},{"$f":"'Model update'!B27","v":118.8}]
[]
[null,{"$f":"\"CPI \"&'Model update'!$B$5","v":"CPI 2022"},{"$f":"(C9/C8-1)","v":3.8461538461538325E-2}]
[]
[]
[]
[null,"X factor"]
[]
[null,{"$f":"\"X \"&'Model update'!$B$5","v":"X 2022"},{"$f":"'Model update'!B40","v":-1.0014953218312436E-2}]
[]
[]
[null,"Pass Through Factor (PT)"]
[]
[null,"pass through"]
[null,{"$f":"\"AP (t) \"&'Model update'!$B$7","v":"AP (t) 2022"},{"$f":"'Model update'!B50","v":0}]
[]
[null,"Revenue"]
[null,"∑∑p(t-1)q(t-2)",{"$f":"C41","v":218410325.84091642}]
[]
[null,"PT' (t-1)",0]
[null,{"$f":"\"PT' \"&'Model update'!$B$5","v":"PT' 2022"},{"$f":"IF(C26=\"\",0,(C23)/((1+C11)*(1-C17)*C26))","v":0}]
[]
[null,{"$f":"\"PTt \"&'Model update'!$B$5","v":"PTt 2022"},{"$f":"((1+C29)/(1+C28))-1","v":0}]
[]
[]
[]
[]
[null,{"$f":"'Model update'!$B$5&\"  Distribution price control\"","v":"2022  Distribution price control"}]
[]
[null,"Average price movement allowed",{"$f":"(1+C11)*(1-C17)*(1+C31)","v":1.0488616821882475}]
[]
[null,"Proposed distribution tariff revenue",{"$f":"IF(Prop2022DistTar!G168=0,\"\",Prop2022DistTar!G168)","v":229082221.45904127}]
{"$rows_left_out":5}
{"sheet":"2022RebalContForm","index":4,"n_rows":285,"n_cols":23,"rows_kept":285,"cut":false,"hidden":false,"merged":[[284,1,284,2],[57,1,57,2],[87,1,87,2],[117,1,117,2],[147,1,147,2],[177,1,177,2],[207,1,207,2],[231,1,231,2],[260,1,260,2]]}
[null,{"$f":"\"Tariff Approval - \"&'Model update'!B3","v":"Tariff Approval - MultiNet"},{"$f":"'Model update'!B5&\"RebalContForm\"","v":"2022RebalContForm"}]
[]
[null,{"$f":"'Model update'!$B$5&\"  REBALANCING CONTROL FORMULA\"","v":"2022  REBALANCING CONTROL FORMULA"}]
[]
[]
[null,"Rebalancing control"]
[]
[null,{"$f":"\"CPI \"&'Model update'!$B$5","v":"CPI 2022"},{"$f":"'2022TarContForm'!C11","v":3.8461538461538325E-2}]
[null,{"$f":"\"Y  \"&'Model update'!$B$5","v":"Y  2022"},0.02]
[null,{"$f":"\"PTt \"&'Model update'!$B$5","v":"PTt 2022"},{"$f":"'2022TarContForm'!C31","v":0}]
[null,{"$f":"\"Xt \"&'Model update'!$B$5","v":"Xt 2022"},{"$f":"'2022TarContForm'!C17","v":-1.0014953218312436E-2}]
[]
[null,"Rebalancing control",{"$f":"(1+C8)*(1+C9)*(1+C10)*(1-C11)","v":1.0698389158320125}]
[]
[]
[]
[null,"Rebalancing control summary"]
[null,null,"Existing","Proposed","Movement","Assessment"]
[null,{"$f":"B32","v":"Tariff V - Multinet Residential"},{"$f":"C53","v":202856692.29092628},{"$f":"C54","v":212817103.50239259},{"$f":"IF(C19=0,0,D19/C19)","v":1.049100727705752},{"$f":"IF(E19=0,\"\",IF($C$13<=E19,\"Breached\",\"Compliant\"))","v":"Compliant"}]
[null,{"$f":"B62","v":"Tariff V - Yarra Valley Residential"},{"$f":"C83","v":2333790.0339742405},{"$f":"C84","v":2432443.2824517004},1.0422716898441211,{"$f":"IF(E20=0,\"\",IF($C$13<=E20,\"Breached\",\"Compliant\"))","v":"Compliant"}]
[null,{"$f":"B92","v":"Tariff V - South Gippsland Residential"},{"$f":"C113","v":1952551.4776582101},{"$f":"C114","v":2043897.38297183},1.0467828409948892,"Compliant"]
[null,{"$f":"B122","v":"Tariff V - Multinet Non-Residential"},{"$f":"C143","v":8938826.6980193816},{"$f":"C144","v":9375398.1604631711},1.0488399067565011,"Compliant"]
[null,{"$f":"B152","v":"Tariff V - Yarra Valley Non-Residential"},{"$f":"C173","v":103714.6952795},{"$f":"C174","v":107807.61705849999},1.0394632772913233,"Compliant"]
[null,{"$f":"B182","v":"Tariff V - South Gippsland Non-Residential"},{"$f":"C203","v":351003.52502070006},{"$f":"C204","v":360676.20866640011},1.0275572265125532,"Compliant"]
[null,{"$f":"B212","v":"Tariff D - Multinet"},{"$f":"C227","v":1774731.1914879999},{"$f":"C228","v":1842851.1189369997},1.0383832367266197,"Compliant"]
[null,{"$f":"B265","v":"Tariff D - Multinet South Gippsland"},{"$f":"C280","v":71555.719580000004},{"$f":"C281","v":74307.866819999996},1.0384615968668034,"Compliant"]
[null,"Tariff L - Multinet",{"$f":"C256","v":27460.20897},{"$f":"C257","v":27736.319279999996},1.0100549238464152,"Compliant"]
[null,null,{"$f":"SUM(C19:C27)","v":218410325.84091631},{"$f":"SUM(D19:D27)","v":229082221.45904118},1.0488616807700657]
[]
[]
[]
[null,{"$f":"Prop2022DistTar!B6","v":"Tariff V - Multinet Residential"},1,2,3,4,5,6,7,8,9,10,11,12,13,14,15,16,17,18,19,20,21]
[null,null,1,2,3,4,5,6,7,8,9,10,11,12,13,14,15,16,17,18,19,20,21]
[null,"Distribution tariff","Fixed","PkBlk1","PkBlk2","PkBlk3","PkBlk4","PkBlk5","Shd1Blk1","Shd1Blk2","Shd1Blk3","Shd1Blk4","Shd1Blk5","Shd2Blk1","Shd2Blk2","Shd2Blk3","Shd2Blk4","Shd2Blk5","OPkBlk1","OPkBlk2","OPkBlk3","OPkBlk4","OPkBlk5"]
[]
[null,{"$f":"\"Existing (1 Jan-31 Dec): \"&Prop2022DistTar!C6","v":"Existing (1 Jan-31 Dec): Tariff V - Multinet Residential"},{"$f":"INDEX(Prop2022DistTar!$E$8:$E$28,C$33)","v":0.183},{"$f":"INDEX(Prop2022DistTar!$E$8:$E$28,D$33)","v":8.8805999999999994},{"$f":"INDEX(Prop2022DistTar!$E$8:$E$28,E$33)","v":5.8383000000000003},{"$f":"INDEX(Prop2022DistTar!$E$8:$E$28,F$33)","v":3.0185},{"$f":"INDEX(Prop2022DistTar!$E$8:$E$28,G$33)","v":1.5276000000000001},{"$f":"INDEX(Prop2022DistTar!$E$8:$E$28,H$33)","v":1.1329},{"$f":"INDEX(Prop2022DistTar!$E$8:$E$28,I$33)","v":8.4760000000000009},{"$f":"INDEX(Prop2022DistTar!$E$8:$E$28,J$33)","v":5.5464000000000002},{"$f":"INDEX(Prop2022DistTar!$E$8:$E$28,K$33)","v":2.8685999999999998},{"$f":"INDEX(Prop2022DistTar!$E$8:$E$28,L$33)","v":1.4513},{"$f":"INDEX(Prop2022DistTar!$E$8:$E$28,M$33)","v":1.0912999999999999},{"$f":"INDEX(Prop2022DistTar!$E$8:$E$28,N$33)","v":8.4760000000000009},{"$f":"INDEX(Prop2022DistTar!$E$8:$E$28,O$33)","v":5.5464000000000002},{"$f":"INDEX(Prop2022DistTar!$E$8:$E$28,P$33)","v":2.8685999999999998},{"$f":"INDEX(Prop2022DistTar!$E$8:$E$28,Q$33)","v":1.4513},{"$f":"INDEX(Prop2022DistTar!$E$8:$E$28,R$33)","v":1.0912999999999999},{"$f":"INDEX(Prop2022DistTar!$E$8:$E$28,S$33)","v":7.5838999999999999},{"$f":"INDEX(Prop2022DistTar!$E$8:$E$28,T$33)","v":4.9626999999999999},{"$f":"INDEX(Prop2022DistTar!$E$8:$E$28,U$33)","v":2.5666000000000002},{"$f":"INDEX(Prop2022DistTar!$E$8:$E$28,V$33)","v":1.2985},{"$f":"INDEX(Prop2022DistTar!$E$8:$E$28,W$33)","v":0.97660000000000002}]
[]
[null,{"$f":"\"Proposed (1 Jan-31 Dec): \"&B32","v":"Proposed (1 Jan-31 Dec): Tariff V - Multinet Residential"},{"$f":"INDEX(Prop2022DistTar!$D$8:$D$28,C$32)","v":0.183},{"$f":"INDEX(Prop2022DistTar!$D$8:$D$28,D$32)","v":9.6172000000000004},{"$f":"INDEX(Prop2022DistTar!$D$8:$D$28,E$32)","v":6.3226000000000004},{"$f":"INDEX(Prop2022DistTar!$D$8:$D$28,F$32)","v":3.0185},{"$f":"INDEX(Prop2022DistTar!$D$8:$D$28,G$32)","v":1.5276000000000001},{"$f":"INDEX(Prop2022DistTar!$D$8:$D$28,H$32)","v":1.1329},{"$f":"INDEX(Prop2022DistTar!$D$8:$D$28,I$32)","v":9.1790000000000003},{"$f":"INDEX(Prop2022DistTar!$D$8:$D$28,J$32)","v":6.0064000000000002},{"$f":"INDEX(Prop2022DistTar!$D$8:$D$28,K$32)","v":2.8685999999999998},{"$f":"INDEX(Prop2022DistTar!$D$8:$D$28,L$32)","v":1.4513},{"$f":"INDEX(Prop2022DistTar!$D$8:$D$28,M$32)","v":1.0912999999999999},{"$f":"INDEX(Prop2022DistTar!$D$8:$D$28,N$32)","v":9.1790000000000003},{"$f":"INDEX(Prop2022DistTar!$D$8:$D$28,O$32)","v":6.0064000000000002},{"$f":"INDEX(Prop2022DistTar!$D$8:$D$28,P$32)","v":2.8685999999999998},{"$f":"INDEX(Prop2022DistTar!$D$8:$D$28,Q$32)","v":1.4513},{"$f":"INDEX(Prop2022DistTar!$D$8:$D$28,R$32)","v":1.0912999999999999},{"$f":"INDEX(Prop2022DistTar!$D$8:$D$28,S$32)","v":8.2128999999999994},{"$f":"INDEX(Prop2022DistTar!$D$8:$D$28,T$32)","v":5.3742999999999999},{"$f":"INDEX(Prop2022DistTar!$D$8:$D$28,U$32)","v":2.5666000000000002},{"$f":"INDEX(Prop2022DistTar!$D$8:$D$28,V$32)","v":1.2985},{"$f":"INDEX(Prop2022DistTar!$D$8:$D$28,W$32)","v":0.97660000000000002}]
[]
[null,"Distribution volumes (actual)","Fixed","PkBlk1","PkBlk2","PkBlk3","PkBlk4","PkBlk5","Shd1Blk1","Shd1Blk2","Shd1Blk3","Shd1Blk4","Shd1Blk5","Shd2Blk1","Shd2Blk2","Shd2Blk3","Shd2Blk4","Shd2Blk5","OPkBlk1","OPkBlk2","OPkBlk3","OPkBlk4","OPkBlk5"]
{"$rows_left_out":246}
{"sheet":"ARS","index":5,"n_rows":16,"n_cols":3,"rows_kept":16,"cut":false,"hidden":false,"merged":[]}
[{"$f":"\"Tariff Approval - \"&'Model update'!B3","v":"Tariff Approval - MultiNet"}]
[]
["Ancillary Reference Services (Exc GST)"]
[]
[null,{"$f":"'Model update'!$B$8","v":2021},{"$f":"'Model update'!$B$5","v":2022}]
["Meter Investigation – High Account Investigation Between the hours of 8am and 4pm on a Business Day",150.56,{"$f":"ROUND(B6*(1+'Model update'!$B$30),2)","v":156.35}]
["Meter Disconnection – Use of locks & plugs Between the hours of 8am and 4pm on a Business Day",52.74,{"$f":"ROUND(B7*(1+'Model update'!$B$30),2)","v":54.77}]
["Meter Removal – Various Between the hours of 8am and 4pm on a Business Day",63.01,{"$f":"ROUND(B8*(1+'Model update'!$B$30),2)","v":65.430000000000007}]
["Reconnect Between the hours of 8am and 4pm on a Business Day",44.46,{"$f":"ROUND(B9*(1+'Model update'!$B$30),2)","v":46.17}]
["Special Meter Reads Between the hours of 8am and 4pm on a Business Day",6.76,{"$f":"ROUND(B10*(1+'Model update'!$B$30),2)","v":7.02}]
["Installation of a second service valve in a pit and disconnect gas supply – paved (without traffic Mgt)",3361.17,{"$f":"ROUND(B11*(1+'Model update'!$B$30),2)","v":3490.45}]
["Installation of a second service valve in a pit and disconnect gas supply – paved (with traffic Mgt)",4165.13,{"$f":"ROUND(B12*(1+'Model update'!$B$30),2)","v":4325.33}]
["Installation of a second service valve in a pit and disconnect gas supply – unpaved (without traffic Mgt)",1595.31,{"$f":"ROUND(B13*(1+'Model update'!$B$30),2)","v":1656.67}]
["Installation of a second service valve in a pit and disconnect gas supply – unpaved (with traffic Mgt)",2198.2800000000002,{"$f":"ROUND(B14*(1+'Model update'!$B$30),2)","v":2282.83}]
[]
["Note: Formula is as per AA2018-22, Part B, section 2, p9 : ART = ARTt-1  * (1+CPIt)"]