{"text_format":"1","workbook":"xlsx","n_sheets":13,"sheets":["Instructions","Contents","Business & other details","3.1 Revenue","3.2 Operating expenditure","3.2.3 Provisions","3.3 Assets (RAB)","NSP Amendments","AER Sheet Heading","AER CF","AER NRs","AER lookups","AER ETL"],"not_rendered":{"charts":0,"images":5,"macros":1,"external_links":2,"defined_names":560,"comments":1,"pivot_tables":0},"unopened":[],"bounds":{"document_bytes":16777216,"sheet_cells":100000,"rows_first":2000,"rows_last":500,"rows_between":2000,"halvings":0,"cell_chars":16384,"cell_head_chars":4096},"cells_cut":0,"cells_raw":0,"read":"whole","date_system":"1900"}

{"sheet":"Instructions","index":0,"n_rows":27,"n_cols":4,"rows_kept":27,"cut":false,"hidden":false,"merged":[[18,1,24,1],[18,2,18,4],[26,2,26,4],[10,2,10,4],[12,1,14,1],[12,2,12,4],[13,2,13,3],[14,2,14,4],[16,2,16,4],[7,1,8,1],[7,2,7,3],[8,2,8,4],[1,1,1,4],[2,1,2,4],[3,1,3,4],[4,1,4,4],[5,2,5,4]]}
[]
[null,{"$f":"CONCATENATE(dms_Sector,\" \",dms_Segment,\" \", \"Network Service Provider\")","v":"Electricity Distribution Network Service Provider"}]
[null,"RECAST ECONOMIC BENCHMARKING"]
[null,{"$f":"CONCATENATE(\"This template is to be used by \",dms_TradingNameFull,\" to fulfil its reporting obligations to the AER.\")","v":"This template is to be used by Power and Water Corporation to fulfil its reporting obligations to the AER."}]
[null,"INSTRUCTIONS"]
[null,"GENERAL","Complete the Business & other details worksheet before entering data or values in any other worksheets. The Business & other details worksheet is linked to other worksheets within the workbook and automatically generates certain column headings and conditional formatting."]
[]
[null,"CONFIDENTIAL INFORMATION","\nPlease use the macro at the top of each \nworksheet to identify confidential information\nin the confidential workbook. \n\n"]
[null,null,"-Do this by selecting the cell or cells that contain confidential information and then run the Mark selection as CONFIDENTIAL macro. This will format the cells a specific colour that is identified by the AER's database which in turn marks that information as confidential.\n\n-To reverse this, select the cell or cells and run the Return selection to NON-CONFIDENTIAL macro."]
[]
{"$rows_left_out":18}
{"sheet":"Contents","index":1,"n_rows":16,"n_cols":4,"rows_kept":16,"cut":false,"hidden":false,"merged":[[6,2,6,3]]}
[null,"RECAST ECONOMIC BENCHMARKING"]
[null,{"$f":"INDEX(dms_TradingNameFull_List,MATCH(dms_TradingName,dms_TradingName_List))","v":"Power and Water Corporation"}]
[null,{"$f":"CONCATENATE(\"REGULATORY PERIOD FROM \", FRCP_y1, \" TO \",FRCP_y5)","v":"REGULATORY PERIOD FROM 2024-25 TO 2028-29"}]
[]
[]
[]
[null,null,"CONTENTS"]
[]
[null,null,"TEMPLATE","FINAL RIN OCTOBER 2022"]
[]
{"$rows_left_out":7}
{"sheet":"Business & other details","index":2,"n_rows":74,"n_cols":81,"rows_kept":74,"cut":false,"hidden":false,"merged":[[69,43,71,87],[73,31,73,40],[73,43,73,58],[61,31,61,40],[61,43,61,58],[63,21,73,27],[63,31,63,40],[63,43,63,58],[65,31,65,40],[65,43,65,58],[67,31,67,40],[67,43,67,58],[69,31,71,40],[51,43,51,50],[51,52,51,59],[51,61,51,68],[51,70,51,77],[51,79,51,86],[53,21,55,27],[53,31,53,40],[53,43,53,50],[55,31,55,40],[55,43,55,50],[50,43,50,50],[50,52,50,59],[50,61,50,68],[50,70,50,77],[50,79,50,86],[47,43,47,50],[47,52,47,59],[47,61,47,68],[47,70,47,77],[47,79,47,86],[45,61,45,68],[45,70,45,77],[49,31,49,40],[49,43,49,50],[49,52,49,59],[49,61,49,68],[49,70,49,77],[45,79,45,86],[46,43,46,50],[46,52,46,59],[46,61,46,68],[46,70,46,77],[46,79,46,86],[49,79,49,86],[41,79,41,86],[42,43,42,50],[42,52,42,59],[42,61,42,68],[42,70,42,77],[42,79,42,86],[33,21,33,35],[33,37,33,58],[33,60,33,66],[33,68,33,89],[41,21,49,27],[41,31,41,40],[41,43,41,50],[41,52,41,59],[41,61,41,68],[41,70,41,77],[43,43,43,50],[43,52,43,59],[43,61,43,68],[43,70,43,77],[43,79,43,86],[45,31,45,40],[45,43,45,50],[45,52,45,59],[31,21,31,35],[31,37,31,58],[31,60,31,66],[31,68,31,89],[32,21,32,35],[32,37,32,58],[32,60,32,66],[32,68,32,89],[25,21,25,35],[25,37,25,40],[25,49,25,51],[25,60,25,66],[25,68,25,71],[25,80,25,82],[24,21,24,35],[24,37,24,51],[24,60,24,66],[24,68,24,82],[16,21,16,35],[16,37,16,48],[22,21,22,35],[22,37,22,58],[22,60,22,66],[22,68,22,89],[0,7,2,15],[3,21,3,57],[6,21,6,75],[8,16,8,93],[15,21,15,35],[15,37,15,58],[23,21,23,35],[23,37,23,58],[23,60,23,66],[23,68,23,89]]}
[null,null,null,null,null,null,null,null,null,null,null,null,null,null,null,null,null,null,null,null,null,"RECAST ECONOMIC BENCHMARKING"]
[null,null,null,null,null,null,null,null,null,null,null,null,null,null,null,null,null,null,null,null,null,{"$f":"INDEX(dms_TradingNameFull_List,MATCH(dms_TradingName,dms_TradingName_List))","v":"Power and Water Corporation"}]
[null,null,null,null,null,null,null,null,null,null,null,null,null,null,null,null,null,null,null,null,null,{"$f":"CONCATENATE(\"REGULATORY PERIOD FROM \", FRCP_y1, \" TO \",FRCP_y5)","v":"REGULATORY PERIOD FROM 2024-25 TO 2028-29"}]
[null,null,null,null,null,null,null,null,null,null,null,null,null,null,null,null,null,null,null,null,null,"BUSINESS & OTHER DETAILS"]
[]
[null,null,null,null,null,null,null,null,null,null,null,null,null,null,null,null,null,null,null,null,null,"INSTRUCTIONS"]
[null,null,null,null,null,null,null,null,null,null,null,null,null,null,null,null,null,null,null,null,null,"Complete the following business details regulatory template before entering data or values in any other regulatory template. This regulatory template is linked to other cells within the spreadsheet and automatically generates column headings and conditional formatting to distinguish business specific input and non-input cells. "]
[]
[null,null,null,null,null,null,null,null,null,null,null,null,null,null,null,null,"SUBMISSION PARTICULARS INPUT SHEET"]
[]
{"$rows_left_out":65}
{"sheet":"3.1 Revenue","index":3,"n_rows":48,"n_cols":35,"rows_kept":48,"cut":false,"hidden":false,"merged":[]}
[null,"RECAST ECONOMIC BENCHMARKING"]
[null,{"$f":"INDEX(dms_TradingNameFull_List,MATCH(dms_TradingName,dms_TradingName_List))","v":"Power and Water Corporation"}]
[null,{"$f":"CONCATENATE(\"REGULATORY PERIOD FROM \", FRCP_y1, \" TO \",FRCP_y5)","v":"REGULATORY PERIOD FROM 2024-25 TO 2028-29"}]
[null,"3.1 REVENUE"]
[]
[null,"There are THREE (x TWO) tables on this worksheet. Both ROWS and COLUMNS have been grouped for ease of navigation. see the Instructions sheet on how to group or ungroup tables. "]
[]
[null,"3.1.1 - REVENUE GROUPING BY CHARGEABLE QUANTITY"]
[null,null,"STANDARD CONTROL SERVICES",null,null,null,null,null,null,null,null,null,null,null,null,null,null,null,null,"ALTERNATIVE CONTROL SERVICES"]
[null,null,"REVENUE\n($0's)",null,null,null,null,null,null,null,null,null,null,null,null,null,null,null,null,"REVENUE\n($0's)"]
{"$rows_left_out":39}
{"sheet":"3.2 Operating expenditure","index":4,"n_rows":196,"n_cols":36,"rows_kept":196,"cut":false,"hidden":false,"merged":[[8,1,8,3],[194,3,194,18]]}
[null,"RECAST ECONOMIC BENCHMARKING"]
[null,{"$f":"INDEX(dms_TradingNameFull_List,MATCH(dms_TradingName,dms_TradingName_List))","v":"Power and Water Corporation"}]
[null,{"$f":"CONCATENATE(\"REGULATORY PERIOD FROM \", FRCP_y1, \" TO \",FRCP_y5)","v":"REGULATORY PERIOD FROM 2024-25 TO 2028-29"}]
[null,"3.2 OPERATING EXPENDITURE"]
[]
[null,"There are THREE tables on this worksheet. Each has been grouped for ease of navigation. see the Instructions sheet on how to group or ungroup tables. "]
[]
[null,"Instructions"]
[null,"Please list current opex categories in tables 3.2.1 and 3.2.2 and provide opex data as required. Where opex categories have changed at any time during the regulatory period, list previous opex categories in the 'Historical' sub-table and provide opex data as required."]
[]
{"$rows_left_out":187}
{"sheet":"3.2.3 Provisions","index":5,"n_rows":371,"n_cols":18,"rows_kept":371,"cut":false,"hidden":false,"merged":[]}
[null,"RECAST ECONOMIC BENCHMARKING"]
[null,{"$f":"INDEX(dms_TradingNameFull_List,MATCH(dms_TradingName,dms_TradingName_List))","v":"Power and Water Corporation"}]
[null,{"$f":"CONCATENATE(\"REGULATORY PERIOD FROM \", FRCP_y1, \" TO \",FRCP_y5)","v":"REGULATORY PERIOD FROM 2024-25 TO 2028-29"}]
[null,"3.2 OPERATING EXPENDITURE"]
[]
[null,"There is ONE table on this worksheet. Each Provision has been grouped for ease of navigation. see the Instructions sheet on how to group or ungroup tables. "]
[]
[null,"3.2.3 - PROVISIONS"]
[null,"For each provision report:"]
[null,null,"$0's"]
{"$rows_left_out":362}
{"sheet":"3.3 Assets (RAB)","index":6,"n_rows":139,"n_cols":52,"rows_kept":139,"cut":false,"hidden":false,"merged":[]}
[null,"RECAST ECONOMIC BENCHMARKING"]
[null,{"$f":"INDEX(dms_TradingNameFull_List,MATCH(dms_TradingName,dms_TradingName_List))","v":"Power and Water Corporation"}]
[null,{"$f":"CONCATENATE(\"REGULATORY PERIOD FROM \", FRCP_y1, \" TO \",FRCP_y5)","v":"REGULATORY PERIOD FROM 2024-25 TO 2028-29"}]
[null,"3.3 ASSETS"]
[]
[null,"There are FOUR tables on this worksheet. Both ROWS and COLUMNS in each have been  grouped (and sub-grouped) for ease of navigation. see the Instructions sheet on how to group or ungroup tables. "]
[]
[null,"3.3.1 - REGULATORY ASSET BASE VALUES"]
[null,null,"Network services",null,null,null,null,null,null,null,null,null,null,null,null,null,null,null,null,"Standard control services",null,null,null,null,null,null,null,null,null,null,null,null,null,null,null,null,"Alternative control services"]
[null,null,"$0's, Nominal",null,null,null,null,null,null,null,null,null,null,null,null,null,null,null,null,"$0's, Nominal",null,null,null,null,null,null,null,null,null,null,null,null,null,null,null,null,"$0's, Nominal"]
{"$rows_left_out":130}
{"sheet":"NSP Amendments","index":7,"n_rows":2,"n_cols":3,"rows_kept":2,"cut":false,"hidden":false,"merged":[[0,1,0,2]]}
[null,{"$f":"CONCATENATE(dms_TradingName,\" data amendments\")","v":"Power and Water data amendments"}]
[null,"Amended Table","Comments"]

{"sheet":"AER Sheet Heading","index":8,"n_rows":44,"n_cols":9,"rows_kept":44,"cut":false,"hidden":true,"merged":[]}
[null,{"$f":"INDEX(dms_Worksheet_List,MATCH(dms_Model,dms_Model_List))","v":"NEW HISTORICAL ECONOMIC BENCHMARKING"}]
[null,{"$f":"INDEX(dms_TradingNameFull_List,MATCH(dms_TradingName,dms_TradingName_List))","v":"Power and Water Corporation"}]
[null,{"$f":"dms_Header_Span","v":"2006-07 to 2021-22"}]
[null,"XX"]
[]
[]
[]
[]
[]
[]
{"$rows_left_out":35}
{"sheet":"AER CF","index":9,"n_rows":77,"n_cols":25,"rows_kept":77,"cut":false,"hidden":true,"merged":[[41,38,41,59],[41,69,41,90],[3,1,3,22],[39,38,39,59],[39,69,39,90],[40,38,40,59],[40,69,40,90]]}
[null,"AER CONDITIONAL FORMATTING"]
[]
[null,"CELLS FLAGED \"Y\" and greyed out will be greyed out in the worksheets."]
[null,"CONDITIONAL FORMATTING MAP"]
[null,null,null,null,null,"=INDEX(dms_CF_3.6.1, MATCH(dms_TradingName,dms_CF_TradingName))=\"Y\"","=INDEX(dms_CF_3.6.5, MATCH(dms_TradingName,dms_CF_TradingName))=\"Y\"","=INDEX(dms_CF_3.6.6.1, MATCH(dms_TradingName,dms_CF_TradingName))=\"Y\"","=INDEX(dms_CF_3.6.6.2, MATCH(dms_TradingName,dms_CF_TradingName))=\"Y\"","=INDEX(dms_CF_3.6.6.3, MATCH(dms_TradingName,dms_CF_TradingName))=\"Y\"","=INDEX(dms_CF_3.6.7.1, MATCH(dms_TradingName,dms_CF_TradingName))=\"Y\"","=INDEX(dms_CF_3.6.7.2, MATCH(dms_TradingName,dms_CF_TradingName))=\"Y\"","=INDEX(dms_CF_3.6.7.3, MATCH(dms_TradingName,dms_CF_TradingName))=\"Y\"","=INDEX(dms_CF_3.6.7.4, MATCH(dms_TradingName,dms_CF_TradingName))=\"Y\"","=INDEX(dms_CF_3.6.8, MATCH(dms_TradingName,dms_CF_TradingName))=\"Y\"","=INDEX(dms_CF_4.1, MATCH(dms_TradingName,dms_CF_TradingName))=\"Y\"","=INDEX(dms_CF_6.8, MATCH(dms_TradingName,dms_CF_TradingName))=\"Y\"","=INDEX(dms_CF_7.12, MATCH(dms_TradingName,dms_CF_TradingName))=\"Y\"","=INDEX(dms_CF_8.1_A, MATCH(dms_TradingName,dms_CF_TradingName))=\"Y\"","=INDEX(dms_CF_8.1_B, MATCH(dms_TradingName,dms_CF_TradingName))=\"Y\"",{"$f":"INDEX(dms_CF_8.1_Neg, MATCH(dms_TradingName,dms_CF_TradingName))=\"Y\"","v":true},"=INDEX(dms_CF_4.4.1_Neg, MATCH(dms_TradingName,dms_CF_TradingName))=\"Y\"",null,null,"=INDEX(dms_CF_F10, MATCH(dms_TradingName,dms_CF_TradingName))=\"Y\""]
[null,"dms_CF_TradingName","JurisdictionList","Sector","Segment","dms_CF_3.6.1","dms_CF_3.6.5","dms_CF_3.6.6.1","dms_CF_3.6.6.2","dms_CF_3.6.6.3","dms_CF_3.6.7.1","dms_CF_3.6.7.2","dms_CF_3.6.7.3","dms_CF_3.6.7.4","dms_CF_3.6.8","dms_CF_4.1","dms_CF_6.8 (set from dms_MAIFI_flag)","dms_CF_7.12","dms_CF_8.1_A  (and 8.4)","dms_CF_8.1_B  (and 8.4)","dms_CF_8.1_Neg  (and 8.4)","dms_CF_4.4.1","dms_CF_MAIFI_flag (set from dms_MAIFI_flag)","9.5 TUOS (set from Jurisdiction)","dms_CF_F10"]
[null,"Amadeus","NT","Gas","Transmission","-","-","-","-","-","-","-","-","-","-","-","-","-","-","-","-","-","-","-","-"]
[null,"APA GasNet","Vic","Gas","Transmission","-","-","-","-","-","-","-","-","-","-","-","-","-","-","-","-","-","-","-","-"]
[null,"Ausgrid","NSW","Electricity","Distribution",null,"Y","N","N","N","N","N","N","Y","N","N",{"$f":"IFERROR(IF(_xlfn.SINGLE(dms_MAIFI_Flag)=\"Yes\",\"N\",\"Y\"),\"Y\")","v":"Y"},"Y","N","Y","Y","N",{"$f":"IFERROR(LEFT(_xlfn.SINGLE(dms_MAIFI_Flag)),\"N\")","v":"N"},{"$f":"IF('AER CF'!$C7=\"Vic\",\"Y\",\"N\")","v":"N"}]
[null,"Ausgrid (Tx Assets)","NSW","Electricity","Distribution",null,"Y","N","N","N","N","N","N","Y","N","N","Y","Y","N","Y","Y","N","N",{"$f":"IF('AER CF'!$C8=\"Vic\",\"Y\",\"N\")","v":"Y"}]
{"$rows_left_out":68}
{"sheet":"AER NRs","index":10,"n_rows":232,"n_cols":16,"rows_kept":232,"cut":false,"hidden":true,"merged":[[195,1,196,1],[199,1,200,1],[208,1,213,1],[135,1,150,1],[152,1,158,1],[160,1,174,1],[176,1,177,1],[179,1,184,1],[191,1,192,1],[65,1,78,1],[84,1,97,1],[100,1,107,1],[110,1,115,1],[118,1,132,1],[4,1,28,1],[32,1,55,1],[33,10,35,10],[33,36,33,57],[33,67,33,88],[34,36,34,57],[34,67,34,88],[35,36,35,57],[35,67,35,88],[36,10,40,10],[44,10,45,10]]}
[null,"AER NAMED RANGES"]
[]
[null,"DROP DOWN SELECTORS USED IN WORKBOOKS"]
[]
[null,"COVER SHEET","dms_DataQuality_List","dms_Confid_status_List"]
[null,null,"-- select --","-- select --"]
[null,null,"Actual","Public"]
[null,null,"Estimate","Confidential"]
[null,null,"Consolidated"]
[]
{"$rows_left_out":223}
{"sheet":"AER lookups","index":11,"n_rows":101,"n_cols":37,"rows_kept":101,"cut":false,"hidden":true,"merged":[[15,60,15,81],[22,1,22,4],[4,24,4,35],[5,24,5,27],[5,29,7,33],[5,34,7,34],[5,35,7,35],[5,36,7,36]]}
[null,"AER LOOKUP TABLES"]
[]
[null,"Template number",5]
[]
[null,null,null,null,null,null,null,null,null,null,null,null,null,null,null,null,null,null,null,null,null,null,null,null,"FOR ELECTRICITY BUSINESSES ONLY"]
[null,null,null,null,null,null,null,null,null,null,null,null,null,null,null,null,null,null,null,null,null,null,null,null,"Feeder Types",null,null,null,"TasNetworks (D)","Feeder Names"]
[]
[null,null,null,null,null,null,null,null,null,null,null,null,null,null,null,null,null,null,null,null,null,null,null,null,"CBD","Urban","Short rural","long rural","EXTRA"]
[null,"dms_TradingName_List","dms_TradingNameFull_List","dms_ABN_List","dms_JurisdictionList","dms_Sector_List","dms_Segment_List","dms_FormControl_List","dms_RPT_List","dms_RPTMonth_List","dms_CRCPlength_List","dms_FRCPlength_List","dms_PRCPlength_List","dms_663_List","dms_Addr1_List","dms_Addr2_List","dms_Suburb_List","dms_State_List","dms_PostCode_List","dms_PAddr1_List","dms_PAddr2_List","dms_PSuburb_List","dms_PState_List","dms_PPostCode_List","dms_CBD_flag","dms_Urban_flag","dms_ShortRural_flag","dms_LongRural_flag","dms_FeederType_5_flag","dms_FeederName_1","dms_FeederName_2","dms_FeederName_3","dms_FeederName_4","dms_FeederName_5","dms_MAIFI_flag_List","dms_Public_Lighting_List","Name"]
[null,"Ausgrid","Ausgrid",67505337385,"NSW","Electricity","Distribution","Revenue cap","Financial","June",5,5,5,5,"570 George St",null,"SYDNEY","NSW",2000,"GPO Box 4009",null,"SYDNEY","NSW",2001,"YES","YES","YES","YES","NO","CBD","Urban","Short rural","Long rural",null,"NO","YES",{"$f":"B10","v":"Ausgrid"}]
{"$rows_left_out":92}
{"sheet":"AER ETL","index":12,"n_rows":148,"n_cols":10,"rows_kept":148,"cut":false,"hidden":true,"merged":[[34,0,59,0],[34,37,34,58],[34,68,34,89],[32,37,32,58],[71,1,73,1],[32,68,32,89],[33,37,33,58],[33,68,33,89],[11,0,15,0],[12,4,12,8],[14,2,14,4],[18,0,25,0],[26,0,31,0]]}
[null,"AER ETL INFORMATION"]
[]
[null,"USES NAMED RANGES FLAG","yes","dms_Defined_Names_Used"]
[]
[null,"IF THIS IS AN ABC RIN - make sure the the named range CRY is applied and the named range dms_dollar_nom_UOM is applied"]
[null,"IF THIS IS A RESET RIN - make sure the named ranges CRY and dms_dollar_nom_UOM are NOT present in the workbook"]
[null,"FOR ABC RINS THAT SPAN MULTIPLE YEARS - make sure MultiYear Flag is set and final year entered as required"]
[]
[null,"Full trading name",{"$f":"INDEX(dms_TradingNameFull_List,MATCH(dms_TradingName,dms_TradingName_List))","v":"Power and Water Corporation"},null,"dms_TradingNameFull"]
[null,"Trading name",{"$f":"dms_TradingName","v":"Power and Water"}]
{"$rows_left_out":138}