{"text_format":"1","workbook":"xlsx","n_sheets":39,"sheets":["AER only","Contents","Instructions","Business & other details","2.1 Expenditure summary","2.1 Balancing Item","2.2 Repex","2.3 Augex project data","2.5 Connections","2.6 Non-network","2.10 Overheads","2.11 Labour","2.12 Input tables","2.14 Forecast price changes","2.15 Insurance & Self-insurance","2.16 Opex Summary","2.17 Step Changes","3.1 Revenue","3.2 Operating expenditure","3.3 Assets (RAB)","Unprotected 3.3 Assets (RAB)","3.4 Operational data","3.5 Physical assets","3.7 Operating environment","5.3 MD - Network level","5.4 MD & Utilisation - Spatial","7.1  Policies and Procedures","7.2 Contingent projects","7.3 Obligations","7.4 Shared Assets","7.5 EBSS","Unprotected 7.5 EBSS","7.6 Indicative bill impact ","7.9 STPIS","Unprotected 7.9 STPIS","Unprotected Worksheet (5)","Unprotected Worksheet (6)","Unprotected Worksheet (7)","Unprotected Worksheet (8)"],"not_rendered":{"charts":0,"images":4,"macros":1,"external_links":0,"defined_names":149,"comments":3,"pivot_tables":0},"unopened":[],"bounds":{"document_bytes":16777216,"sheet_cells":100000,"rows_first":2000,"rows_last":500,"rows_between":2000,"halvings":0,"cell_chars":16384,"cell_head_chars":4096},"cells_cut":0,"cells_raw":0,"read":"whole","date_system":"1900"}

{"sheet":"AER only","index":0,"n_rows":74,"n_cols":13,"rows_kept":74,"cut":false,"hidden":true,"merged":[[0,1,0,9]]}
[null,"Data in these columns used for data validation and database purposes."]
[null,"Date last modified:"]
[null,"14 April 2015","merged cell C46/47"]
[null,"17 April 2015","adjusted dms_RYE to automate based on dms_Model (NB: EB & CA refer to CRCP_y5)"]
[null,"14 May 2015","adapted this cover for use in CA & EB RINs"]
[]
[null,"USES NAMED RANGES FLAG","yes"]
[]
[null,"dms_Model_List ","dms_Worksheet_List ",null,"dms_RYE_List1","dms_RYE_List2"]
[null,"CA","CATEGORY ANALYSIS",null,"dms_RYE",{"$f":"CONCATENATE(LEFT(CRY, 2) &IF(CRY>\"2009-10\",,\"\") &RIGHT(CRY,2))","v":"2016"}]
[null,"CAM/Service change Backcast","REGULATORY REPORTING STATEMENT",null,"dms_RYE",{"$f":"CONCATENATE(LEFT(CRCP_y5, 2) &IF(CRCP_y5>\"2009-10\",,\"\") &RIGHT(CRCP_y5,2))","v":"2017"}]
[null,"CPI","CPI",null,"dms_RYE",{"$f":"CONCATENATE(LEFT(CRCP_y5, 2) &IF(CRCP_y5>\"2009-10\",,\"\") &RIGHT(CRCP_y5,2))","v":"2017"}]
[null,"EB","ECONOMIC BENCHMARKING",null,"dms_RYE",{"$f":"CONCATENATE(LEFT(CRY, 2) &IF(CRY>\"2009-10\",,\"\") &RIGHT(CRY,2))","v":"2016"}]
[null,"PTRM","POST TAX REVENUE MODEL",null,"FRCP",{"$f":"CONCATENATE(LEFT(FRCP_y5, 2) &IF(FRCP_y1>\"2009-10\",,\"\") &RIGHT(FRCP_y5,2))","v":"2022"}]
[null,"Reset","REGULATORY REPORTING STATEMENT",null,"FRCP",{"$f":"CONCATENATE(LEFT(FRCP_y5, 2) &IF(FRCP_y1>\"2009-10\",,\"\") &RIGHT(FRCP_y5,2))","v":"2022"}]
[null,"RFM","ROLL FORWARD MODEL",null,"CRCP",{"$f":"CONCATENATE(LEFT(CRCP_y5, 2) &IF(CRCP_y1>\"2009-10\",,\"\") &RIGHT(CRCP_y5,2))","v":"2017"}]
[null,"WACC","WEIGHTED AVERAGE COST OF CAPITAL",null,"dms_RYE",{"$f":"CONCATENATE(LEFT(CRCP_y5, 2) &IF(CRCP_y5>\"2009-10\",,\"\") &RIGHT(CRCP_y5,2))","v":"2017"}]
[]
[]
[null,"dms_TradingName_List","dms_TradingNameFull_List","dms_ABN_List","dms_State_List","dms_Sector_List","dms_Segment_List","dms_FormControl","dms_CRCPlength_List","dms_FRCPlength_List","dms_JurisdictionList","dms_663_List","dms_DeterminationRef_List"]
[null,"ActewAGL Distribution","ActewAGL Distribution",76670568688,"ACT","Electricity","Distribution","Revenue cap",5,6,"ACT",5,"2014-19 Distribution Determination"]
[null,"ActewAGL Distribution (Tx Assets)","ActewAGL Distribution (Tx Assets)",76670568688,"ACT","Electricity","Distribution","Revenue cap",5,5,"ACT",5,"distribution determination"]
[null,"AGN","AGN",78551685,"SA","Gas","Distribution","Revenue cap",5,5,"SA",5,"distribution determination"]
[null,"Ausgrid","Ausgrid",67505337385,"NSW","Electricity","Distribution","Revenue cap",5,5,"NSW",5,"2014-19 Distribution Determination"]
[null,"Ausgrid (Tx Assets)","Ausgrid (Tx Assets)",67505337385,"NSW","Electricity","Distribution","Revenue cap",5,5,"NSW",5,"distribution determination"]
[null,"AusNet (D)","AusNet Services (D)",91064651118,"Vic","Electricity","Distribution","Revenue cap",5,5,"Vic",2,"2016-20 Distribution Determination"]
[null,"AusNet (T)","AusNet (T)",78079798173,"Vic","Electricity","Transmission","Revenue cap",5,5,"Vic",2,"distribution determination"]
[null,"Australian Distribution Co.","Australian Distribution Co.",11222333444,"-","Electricity","Distribution","Revenue cap",5,5,"-",2,"distribution determination"]
[null,"Australian Transmission Co.","Australian Transmission Co.",11222333444,"-","Electricity","Transmission","Revenue cap",5,5,"-",5,"distribution determination"]
[null,"CitiPower","CitiPower",76064651056,"Vic","Electricity","Distribution","Revenue cap",5,5,"Vic",2,"2016-20 Distribution Determination"]
[null,"Directlink","Directlink",16779340889,"NSW","Electricity","Transmission","Revenue cap",10,5,"Qld",5,"distribution determination"]
[null,"ElectraNet","ElectraNet",41094482416,"SA","Electricity","Transmission","Revenue cap",5,5,"SA",5,"distribution determination"]
[null,"Endeavour Energy","Endeavour Energy",59253130878,"NSW","Electricity","Distribution","Revenue cap",5,5,"NSW",5,"2014-19 Distribution Determination"]
[null,"Energex","Energex",40078849055,"Qld","Electricity","Distribution","Revenue cap",5,5,"Qld",5,"2015-20 Distribution Determination"]
[null,"Ergon Energy","Ergon Energy",50087646062,"Qld","Electricity","Distribution","Revenue cap",5,5,"Qld",5,"2015-20 Distribution Determination"]
[null,"Essential Energy","Essential Energy",37428185226,"NSW","Electricity","Distribution","Revenue cap",5,5,"NSW",5,"2014-19 Distribution Determination"]
[null,"Jemena Electricity","Jemena Electricity",82064651083,"Vic","Electricity","Distribution","Revenue cap",5,5,"Vic",2,"2016-20 Distribution Determination"]
[null,"Murraylink","Murraylink",79181207909,"NSW","Electricity","Transmission","Revenue cap",5,5,"SA",5,"distribution determination"]
[null,"Powercor Australia","Powercor Australia",89064651109,"Vic","Electricity","Distribution","Revenue cap",5,5,"Vic",2,"2016-20 Distribution Determination"]
[null,"Powerlink","Queensland Electricity Transmission Corporation Limited trading as Powerlink Queensland",82078849233,"Qld","Electricity","Transmission","Revenue cap",5,5,"Qld",5,"distribution determination"]
[null,"Qld,SA &ACT Gas Reset","Qld,SA &ACT Gas Reset",22222222222,"-","Gas","Distribution","?",5,5,"-","x","distribution determination"]
[null,"SA Power Networks","SA Power Networks",13332330749,"SA","Electricity","Distribution","Revenue cap",5,5,"SA",5,"2015-20 Distribution Determination"]
[null,"TasNetworks (D)","TasNetworks (D)",24167357299,"Tas","Electricity","Distribution","Revenue cap",5,5,"Tas",5,"distribution determination"]
[null,"TasNetworks (T)","TasNetworks (T)",24167357299,"Tas","Electricity","Transmission","Revenue cap",5,5,"Tas",5,"distribution determination"]
[null,"TransGrid","TransGrid",19622755774,"NSW","Electricity","Transmission","Revenue cap",5,5,"NSW",5,"distribution determination"]
[null,"United Energy","United Energy",70064651029,"Vic","Electricity","Distribution","Revenue cap",5,5,"Vic",2,"2016-20 Distribution Determination"]
[null,"Victorian DNSP Backcasting","Victorian DNSP Backcasting",33333333666,"Vic","Electricity","Distribution","?",5,5,"Vic","x","distribution determination"]
[null,"Victorian DNSP Reset ","Victorian DNSP Reset ",33333333333,"Vic","Electricity","Distribution","?",5,5,"Vic","x","distribution determination"]
[]
[]
[]
[]
[null,"dms_SourceList","dms_FormControl_Choices",null,"dms_FRCPlength_Num_List","dms_FinalYear_List",null,null,null,null,null,null,"dms_0203_ProjectType"]
[null,"After appeal","Revenue cap",null,1,"FRCP_y1",null,null,null,null,null,null,"New line on new route - single circuit"]
[null,"Draft decision","Revenue yield",null,2,"FRCP_y2",null,null,null,null,null,null,"New line on new route - dual circuit"]
[null,"Final decision","Weighted average price cap",null,3,"FRCP_y3",null,null,null,null,null,null,"New line on new route - other"]
[null,"Pass through decision",null,null,4,"FRCP_y4",null,null,null,null,null,null,"Line rebuild over existing route - single circuit"]
[null,"PTRM annual update",null,null,5,"FRCP_y5",null,null,null,null,null,null,"Line rebuild over existing route - dual circuit"]
[null,"PTRM interim update 1",null,null,6,"FRCP_y6",null,null,null,null,null,null,"Reconductor - Single circuit"]
[null,"PTRM interim update 2",null,null,7,"FRCP_y7",null,null,null,null,null,null,"Reconductor - Dual circuit"]
[null,"PTRM interim update 3",null,null,8,"FRCP_y8"]
[null,"PTRM interim update 4",null,null,9,"FRCP_y9"]
[null,"Regulatory proposal",null,null,10,"FRCP_y10"]
[null,"Reporting"]
[null,"Revised regulatory proposal"]
[null,"RFM annual update"]
[null,"WACC annual update"]
[]
[]
[]
[null,"Notes"]
[null,"RFM - Base year is usually CRCP_y1","EG. Victorian 2016-20 - base year = 2011"]
[null,"RFM - Form of Control Field is not relevant"]
[null,"PTRM - capture base year input by NSP","='[Published version - PTRM - TNSP - version 3 - January 2015 - Appendix A.xlsm]PTRM input'!Q7"]

{"sheet":"Contents","index":1,"n_rows":26,"n_cols":20,"rows_kept":26,"cut":false,"hidden":false,"merged":[[3,2,3,27]]}
[null,null,"REGULATORY REPORTING STATEMENT\n"]
[null,null,{"$f":"dms_TradingName","v":"Powerlink"}]
[null,null,{"$f":"CONCATENATE(FRCP_y1,\" to \",FRCP_y5)","v":"2017-18 to 2021-22"}]
[null,null,"Contents"]
[]
[]
[null,null,null,null,null,"1. Business details",null,null,null,null,null,null,"2. Expenditure",null,null,null,null,null,null,"3. Economic benchmarking"]
[]
[]
[]
[]
[]
[]
[]
[]
[]
[]
[]
[]
[]
[]
[]
[]
[]
[]
[null,null,null,null,null,"5. Network information",null,null,null,null,null,null,null,null,null,null,null,null,null,"7. Other templates"]

{"sheet":"Instructions","index":2,"n_rows":28,"n_cols":4,"rows_kept":28,"cut":false,"hidden":false,"merged":[[20,2,20,4],[27,2,27,4],[15,2,15,4],[7,1,7,5],[8,1,8,5],[10,2,10,4],[14,2,14,4],[17,2,17,3],[18,2,18,4]]}
[]
[]
[]
[]
[]
[]
[]
[null,{"$f":"CONCATENATE(dms_Segment,\" Network Service Provider\")","v":"Transmission Network Service Provider"}]
[null,"Regulatory Proposal RIN Template"]
[]
[null,null,{"$f":"CONCATENATE(dms_TradingName,\" must fill out and submit the regulatory templates in this workbook as part of its revenue proposal\")","v":"Powerlink must fill out and submit the regulatory templates in this workbook as part of its revenue proposal"}]
[]
[]
[null,null,"INSTRUCTIONS"]
[null,null,"Complete the Business & other details worksheet before entering data or values in any other worksheets. The Business & other details worksheet is linked to other cells within the workbook and automatically generates certain column headings.\n\nPlease identify whether this is a regulatory proposal or revised regulatory proposal on the Business & other details worksheet."]
[null,null,{"$f":"CONCATENATE(\"If \",dms_TradingName,\" needs to amend any data please resubmit this completed workbook in its entirety after making any necessary amendments and provide a brief description of those amendments and the reason for any amendments on the Business and other details worksheet.\")","v":"If Powerlink needs to amend any data please resubmit this completed workbook in its entirety after making any necessary amendments and provide a brief description of those amendments and the reason for any amendments on the Business and other details worksheet."}]
[]
[null,null,"Identifying CONFIDENTIAL INFORMATION:\n\nPlease use the macro at the top of each \nworksheet to identify confidential information. \n\n"]
[null,null,"-Do this by selecting the cell or cells that contain confidential information and then run the Mark selected cells as CONFIDENTIAL macro. This will format the cells a specific colour that is identified by the AER's database which in turn marks that information as confidential.\n\n-To reverse this, select the cell or cells and run the Return cells to NON-CONFIDENTIAL macro"]
[]
[null,null,"All amounts are to be reported on a one for one basis: that is 1000 is to be entered as '1000' not '1' as in previous templates.\n\nColour coding of input sheets:"]
[null,null,null,"Yellow = input cells"]
[null,null,null,"Orange = optional Input cells"]
[null,null,null,"Grey = Not applicable/No inputs required"]
[null,null,null,"Leave coloured cells blank if no information exists. \nPLEASE DO NOT ENTER TEXT unless specifically requested to do so."]
[]
[]
[null,null,"Returning completed responses\n\nPlease return two (2) files to the AER: \n1. A confidential (consolidated) version which must contain a complete set of all responses with confidential information marked using the Mark selected cells CONFIDENTIAL macro and which has been completed using the locked template file provided by the AER. \n\n2. A public version with confidential information either removed completely or aggregated in some form together with writtten consent to disclose the public version of the response.\n\nUse the drop down box on the Business & other details worksheet to identify the file as either confidential ('consolidated') or public\n\n"]

{"sheet":"Business & other details","index":3,"n_rows":69,"n_cols":8,"rows_kept":69,"cut":false,"hidden":false,"merged":[[59,0,69,0],[51,3,51,4],[58,3,58,9],[30,3,30,4],[30,6,30,7],[32,2,32,9],[38,3,38,4],[43,0,46,0],[32,0,35,0],[36,0,41,0],[56,0,58,0],[24,3,24,4],[24,5,24,8],[28,3,28,4],[28,6,28,7],[29,3,29,4],[29,6,29,7],[23,5,23,8],[7,2,7,9],[11,2,11,9],[13,3,13,5],[14,3,14,5],[17,3,17,4],[17,5,17,8],[18,5,18,8],[19,3,19,4],[19,5,19,8],[22,3,22,4],[22,5,22,8]]}
["HIDE THIS COLUMN",null,{"$f":"(LOOKUP(dms_Model,dms_Model_List,dms_Worksheet_List))","v":"REGULATORY REPORTING STATEMENT"}]
[null,null,{"$f":"INDEX(dms_TradingNameFull_List,MATCH(dms_TradingName,dms_TradingName_List))","v":"Queensland Electricity Transmission Corporation Limited trading as Powerlink Queensland"}]
[null,null,{"$f":"CONCATENATE(FRCP_y1,\" to \",dms_FRCP_FinalYear_Num)","v":"2017-18 to 2021-22"}]
[null,null,"BUSINESS & OTHER DETAILS"]
[]
[]
[null,null,"Instructions"]
[null,null,"Complete the following business details regulatory template before entering data or values in any other regulatory template. This regulatory template is linked to other cells within the spreadsheet and automatically generates column headings."]
[]
[null,null,"SUBMISSION PARTICULARS INPUT SHEETS"]
[]
[null,null,"Entity details"]
[]
[null,null,"Short name","Powerlink"]
[null,null,"ACN / ABN",{"$f":"INDEX(dms_ABN_List,MATCH(dms_TradingName,dms_TradingName_List))","v":82078849233}]
[]
[]
[null,null,"Business address","Address 1",null,"33 Harold Street"]
[null,null,null,null,"Address 2"]
[null,null,null,"Suburb",null,"Virginia"]
[null,null,null,null,"State",{"$f":"INDEX(dms_State_List,MATCH(dms_TradingName,dms_TradingName_List))","v":"Qld"},"p/code",4014]
[]
[null,null,"Postal address","Address 1",null,"33 Harold Street"]
[null,null,null,null,"Address 2"]
[null,null,null,"Suburb",null,"Virginia"]
[null,null,null,null,"State","Qld","p/code",4014]
[]
[]
[null,null,"Contact name/s","Mr Ian Lowry"]
[null,null,"Contact phone/s",738661553]
[null,null,"Contact email address/s","ilowry@powerlink.com.au"]
[]
["KEEP VISIBLE FOR\n RESET, PTRM & RFMS",null,"Regulatory control period details"]
[]
[null,null,"Forthcoming regulatory control period","2017-18",{"$f":"IF(dms_RPT=\"financial\",VALUE(LEFT(D35,4)+1)&\"-\"&VALUE(MID(D35,3,2)+2),VALUE(LEFT(D35,4)+1))","v":"2018-19"},{"$f":"IF(dms_RPT=\"financial\",VALUE(LEFT(E35,4)+1)&\"-\"&VALUE(MID(E35,3,2)+2),VALUE(LEFT(E35,4)+1))","v":"2019-20"},{"$f":"IF(dms_RPT=\"financial\",VALUE(LEFT(F35,4)+1)&\"-\"&VALUE(MID(F35,3,2)+2),VALUE(LEFT(F35,4)+1))","v":"2020-21"},{"$f":"IF(dms_RPT=\"financial\",VALUE(LEFT(G35,4)+1)&\"-\"&VALUE(MID(G35,3,2)+2),VALUE(LEFT(G35,4)+1))","v":"2021-22"}]
[]
["HIDE"]
[null,null,"Current regulatory control period",{"$f":"IF(dms_RPT=\"financial\",VALUE(LEFT(E38,4)-1)&\"-\"&TEXT(VALUE(RIGHT(E38,2)-1),\"0#\"),VALUE(LEFT(E38,4)-1))","v":"2012-13"},{"$f":"IF(dms_RPT=\"financial\",VALUE(LEFT(F38,4)-1)&\"-\"&TEXT(VALUE(RIGHT(F38,2)-1),\"0#\"),VALUE(LEFT(F38,4)-1))","v":"2013-14"},{"$f":"IF(dms_RPT=\"financial\",VALUE(LEFT(G38,4)-1)&\"-\"&TEXT(VALUE(RIGHT(G38,2)-1),\"0#\"),VALUE(LEFT(G38,4)-1))","v":"2014-15"},{"$f":"IF(dms_RPT=\"financial\",VALUE(LEFT(H38,4)-1)&\"-\"&TEXT(VALUE(RIGHT(H38,2)-1),\"0#\"),VALUE(LEFT(H38,4)-1))","v":"2015-16"},{"$f":"IF(dms_RPT=\"financial\",VALUE(LEFT(D35,4)-1)&\"-\"&TEXT(VALUE(RIGHT(D35,2)-1),\"0#\"),VALUE(LEFT(D35,4)-1))","v":"2016-17"}]
[]
[]
[null,null,"Previous regulatory control period",{"$f":"IF(dms_RPT=\"financial\",VALUE(LEFT(E41,4)-1)&\"-\"&TEXT(VALUE(MID(E41,3,2)),\"0#\"),VALUE(LEFT(E41,4)-1))","v":"2007-08"},{"$f":"IF(dms_RPT=\"financial\",VALUE(LEFT(F41,4)-1)&\"-\"&TEXT(VALUE(MID(F41,3,2)),\"0#\"),VALUE(LEFT(F41,4)-1))","v":"2008-09"},{"$f":"IF(dms_RPT=\"financial\",VALUE(LEFT(G41,4)-1)&\"-\"&TEXT(VALUE(MID(G41,3,2)),\"0#\"),VALUE(LEFT(G41,4)-1))","v":"2009-10"},{"$f":"IF(dms_RPT=\"financial\",VALUE(LEFT(H41,4)-1)&\"-\"&TEXT(VALUE(RIGHT(H41,2)-1),\"0#\"),VALUE(LEFT(H41,4)-1))","v":"2010-11"},{"$f":"IF(dms_RPT=\"financial\",VALUE(LEFT(D38,4)-1)&\"-\"&VALUE(MID(D38,3,2)),VALUE(LEFT(D38,4)-1))","v":"2011-12"}]
[]
[]
["KEEP VISIBLE FOR\nCA & EB ONLY"]
[null,null,"Current regulatory year","2015-16"]
[]
[]
[]
[]
["HIDE",null,"Sector",{"$f":"INDEX(dms_Sector_List,MATCH(dms_TradingName,dms_TradingName_List))","v":"Electricity"}]
[null,null,"Segment",{"$f":"INDEX(dms_Segment_List,MATCH(dms_TradingName,dms_TradingName_List))","v":"Transmission"}]
["KEEP VISIBLE",null,"Source","Regulatory proposal"]
[null,null,"Regulatory Year Ending",{"$f":"LEFT(dms_FRCP_FinalYear_Num,2)&RIGHT(dms_FRCP_FinalYear_Num,2)","v":"2022"}]
[null,null,"Reporting Period Type",{"$f":"IF(LEN(FRCP_y1)>4,\"Financial\",\"Calendar\")","v":"Financial"}]
[null,null,"Model or RIN Type","Reset"]
[null,null,"Security Classification","Public"]
["KEEP VISIBLE",null,"Data quality (Public, Consolidated (confidential))","Public"]
[null,null,"EBSS - First application of scheme in forthcoming period?","No"]
[null,null,"Amended RIN submission - amendment reason"]
["HIDE THESE ROWS",null,"Template - version no.",2]
[null,null,"Dollar $ real  (the last month before the FRCP_y1)",{"$f":"CONCATENATE(IF(dms_RPT=\"Financial\",\"June \",\"December \"),VALUE((LEFT(FRCP_y1,2))&RIGHT(FRCP_y1,2))-1)","v":"June 2017"}]
[null,null,"Form of control",{"$f":"INDEX(dms_FormControl_List,MATCH(dms_TradingName,dms_TradingName_List))","v":"Revenue cap"}]
[null,null,"Length of current reg control period",{"$f":"INDEX(dms_CRCPlength_List,MATCH(dms_TradingName,dms_TradingName_List))","v":5}]
[null,null,"Length of forthcoming reg control period",{"$f":"INDEX(dms_FRCPlength_List,MATCH(dms_TradingName,dms_TradingName_List))","v":5}]
[null,null,"RIN response - version no.",1]
[null,null,"Jurisdiction",{"$f":"INDEX(dms_JurisdictionList,MATCH(dms_TradingName,dms_TradingName_List))","v":"Qld"}]
[null,null,"FRCP length in years",5]
[null,null,"FRCP Final Year Reference","FRCP_y5"]
[null,null,"FRCP Final Year",{"$f":"INDIRECT(dms_FRCP_FinalYear)","v":"2021-22"}]

{"sheet":"2.1 Expenditure summary","index":4,"n_rows":28,"n_cols":9,"rows_kept":28,"cut":false,"hidden":false,"merged":[[19,1,20,1],[7,1,8,1],[7,2,7,8],[19,2,19,3]]}
[null,{"$f":"(LOOKUP(dms_Model,dms_Model_List,dms_Worksheet_List))","v":"REGULATORY REPORTING STATEMENT"}]
[null,{"$f":"INDEX(dms_TradingNameFull_List,MATCH(dms_TradingName,dms_TradingName_List))","v":"Queensland Electricity Transmission Corporation Limited trading as Powerlink Queensland"}]
[null,{"$f":"CONCATENATE(FRCP_y1,\" to \",FRCP_y5)","v":"2017-18 to 2021-22"}]
[null,"2.1 Cost summary and reconciliation"]
[]
[]
[null,"2.1.1 - Prescribed transmission services capex (as incurred)"]
[null,null,{"$f":"CONCATENATE(\"Forecast \n($0's. real \",dms_DollarReal,\")\")","v":"Forecast \n($0's. real June 2017)"}]
[null,null,{"$f":"CRCP_y4","v":"2015-16"},{"$f":"CRCP_y5","v":"2016-17"},{"$f":"FRCP_y1","v":"2017-18"},{"$f":"FRCP_y2","v":"2018-19"},{"$f":"FRCP_y3","v":"2019-20"},{"$f":"FRCP_y4","v":"2020-21"},{"$f":"FRCP_y5","v":"2021-22"}]
[null,"Replacement expenditure",75965831.229017958,136729276.52148092,140090718.11282706,188579081.42581227,84903993.713026509,100224389.22590466,186669042.54573622]
[null,"Connections",0,0,0,0,0,0,0]
[null,"Augmentation Expenditure",4064867.4187194873,2784714.5677696583,0,0,2842690.4125215216,0,0]
[null,"Non-network",25973235.966832522,22186115.470526665,16801327.106909223,17882504.349193372,22942193.044346541,22899564.537715185,16298831.211056776]
[null,"capitalised network overheads",0,0,0,0,0,0,0]
[null,"capitalised corporate overheads",8666778.03397654,11417971.525587946,11874022.487445414,15783573.370247334,8340925.9249707758,9164689.9897748828,16053097.25362286]
[null,"balancing item",50938207.285851374,40761313.903799206,29418668.412949532,-28045136.721447021,72356119.105682135,59770732.593352944,-37757077.859379411]
[null,"TOTAL  CAPEX",{"$f":"SUM(C10:C16)","v":165608919.93439788},213879391.98916438,198184736.12013122,194200022.42380595,191385922.20054749,192059376.34674767,181263893.15103644]
[]
[null,"2.1.2 - Prescribed transmission services opex "]
[null,null,{"$f":"CONCATENATE(\"Forecast \n($0's, real \",dms_DollarReal,\")\")","v":"Forecast \n($0's, real June 2017)"}]
[null,null,{"$f":"CRCP_y4","v":"2015-16"},{"$f":"CRCP_y5","v":"2016-17"}]
[null,"Vegetation management",11355397.61779668,11157414.245954897]
[null,"Maintenance",80545645.48650077,89006174.31147109]
[null,"Non-network",31600796.55697,30222706.889145173]
[null,"network overheads",48238958.6952122,49114513.618395165]
[null,"corporate overheads",98585079.991620779,85806028.047204643]
[null,"balancing item",-45883207.05472593,-46578492.176583879]
[null,"TOTAL OPEX",{"$f":"SUM(C22:C27)","v":224442671.29337448},{"$f":"SUM(D22:D27)","v":218728344.93558708}]

{"sheet":"2.1 Balancing Item","index":5,"n_rows":36,"n_cols":8,"rows_kept":36,"cut":false,"hidden":false,"merged":[[2,0,2,7],[22,0,22,2]]}
["Reconciliation of Balancing Item from Template 2.1"]
[]
["Reconciliation to Powerlink's Revenue Proposal"]
[]
["Prescribed transmission services capex (as incurred)","2015-16","2016-17","2017-18","2018-19","2019-20","2020-21","2021-22"]
[]
["Total Capex as per RIN Templates",106003934.61456996,161700106.55977723,156892045.21973628,206461585.77500564,110688877.16989458,123123953.76361984,202967873.75679299]
[]
["Capitalised Corporate Overhead as per RIN Definition",8666778.03397654,11417971.525587946,11874022.487445414,15783573.370247334,8340925.9249707758,9164689.9897748828,16053097.25362286]
[]
["Balancing Items"]
["    - Capex \"As Incurred\" Project Adjustment (Prior year as incurred cost and current year not commissioned)",30722801.90194837,27435867.024455614,11081424.760538148,-39400552.79277432,61441765.889360577,51643082.295719877,-45573204.590875663]
["    - CAPEX not Covered by RIN (Projects not covered by RIN)",12154153.63736606,12021406.043313418,17815091.313522261,11355416.071327295,10914353.216321519,8127650.2976330528,7816126.7314962531]
["    - Post Commissioning Cost",8061251.7465369729,1304040.836030161,522152.33888906473,0,0,0,0]
["Total Balancing Item",{"$f":"SUM(B12:B14)","v":50938207.285851404},{"$f":"SUM(C12:C14)","v":40761313.903799199},29418668.412949476,-28045136.721447024,72356119.10568209,59770732.593352929,-37757077.859379411]
[]
["Total Capex - Table 2.1.1",{"$f":"+B7+B9+B15","v":165608919.93439791},{"$f":"+C7+C9+C15","v":213879391.98916438},198184736.12013116,194200022.42380595,191385922.20054746,192059376.34674764,181263893.15103644]
[]
["Total Regulated Capex - Powerlink's Post-Tax Revenue Model / Revenue Forecast Model",165608919.93439791,213879391.98916438,198184736.12013116,194200022.42380595,191385922.20054746,192059376.34674764,181263893.15103644]
[]
[]
[]
["Reconciliation to Powerlink's Revenue Proposal"]
[]
["Prescribed transmission services opex by category","2015-16","2016-17"]
[]
["Total Opex as per RIN Templates 2.6.1, 2.12",270325878.34810042,265306837.11217096]
[]
["  Balancing Items"]
["    - Capitalised Corporate Overhead as per RIN Definition",-14282410.497755926,-16355785.287438707]
["    - Adjustment for Template 2.5 Double Counting as per RIN Requirement",-31600796.55697,-30222706.889145173]
["  Total Balancing Item",{"$f":"SUM(B30:B31)","v":-45883207.05472593},{"$f":"SUM(C30:C31)","v":-46578492.176583879}]
[]
["Total Opex as Per Table 2.1.2",{"$f":"+B27+B32","v":224442671.29337448},{"$f":"+C27+C32","v":218728344.93558708}]
[]
["Total Regulated Capex - Powerlink's Post-Tax Revenue Model / Revenue Forecast Model",224442671.29337448,218728344.93558708]

{"sheet":"2.2 Repex","index":6,"n_rows":187,"n_cols":24,"rows_kept":187,"cut":false,"hidden":false,"merged":[[7,3,7,9],[7,10,7,16],[7,17,7,23],[6,3,6,9],[6,10,6,16],[6,17,6,23]]}
[null,{"$f":"(LOOKUP(dms_Model,dms_Model_List,dms_Worksheet_List))","v":"REGULATORY REPORTING STATEMENT"}]
[null,{"$f":"INDEX(dms_TradingNameFull_List,MATCH(dms_TradingName,dms_TradingName_List))","v":"Queensland Electricity Transmission Corporation Limited trading as Powerlink Queensland"}]
[null,{"$f":"CONCATENATE(FRCP_y1,\" to \",FRCP_y5)","v":"2017-18 to 2021-22"}]
[null,"2.2 REPEX"]
[]
[null,"2.2.1 - REPLACEMENT EXPENDITURE, VOLUMES AND ASSET FAILURES BY ASSET CATEGORY"]
[null,null,null,"EXPENDITURE",null,null,null,null,null,null,"ASSET REPLACEMENTS",null,null,null,null,null,null,"ASSET FAILURES"]
[null,null,null,{"$f":"CONCATENATE(\"Forecast \n($0's. real \",dms_DollarReal,\")\")","v":"Forecast \n($0's. real June 2017)"},null,null,null,null,null,null,"Forecast \n(0's)",null,null,null,null,null,null,"Forecast \n(0's)"]
[null,"ASSET GROUP","ASSET CATEGORY",{"$f":"CRCP_y4","v":"2015-16"},{"$f":"CRCP_y5","v":"2016-17"},{"$f":"FRCP_y1","v":"2017-18"},{"$f":"FRCP_y2","v":"2018-19"},{"$f":"FRCP_y3","v":"2019-20"},{"$f":"FRCP_y4","v":"2020-21"},{"$f":"FRCP_y5","v":"2021-22"},{"$f":"CRCP_y4","v":"2015-16"},{"$f":"CRCP_y5","v":"2016-17"},{"$f":"FRCP_y1","v":"2017-18"},{"$f":"FRCP_y2","v":"2018-19"},{"$f":"FRCP_y3","v":"2019-20"},{"$f":"FRCP_y4","v":"2020-21"},{"$f":"FRCP_y5","v":"2021-22"},{"$f":"CRCP_y4","v":"2015-16"},{"$f":"CRCP_y5","v":"2016-17"},{"$f":"FRCP_y1","v":"2017-18"},{"$f":"FRCP_y2","v":"2018-19"},{"$f":"FRCP_y3","v":"2019-20"},{"$f":"FRCP_y4","v":"2020-21"},{"$f":"FRCP_y5","v":"2021-22"}]
[null,"TRANSMISSION TOWERS\nHighest operating voltage; Circuit configuration","< = 33 kV; Single Circuit",null,null,null,null,null,null,null,0,0,0,0,0,0,0]
[null,null,"> 33 kV & < = 66 kV ; Single Circuit",null,null,null,null,null,null,null,0,0,0,0,0,0,0]
[null,null,"> 66 kV & < = 132 kV ; Single Circuit",null,null,null,null,null,null,null,0,0,0,0,0,0,0]
[null,null,"> 132 kV & < = 275 kV ; Single Circuit",null,null,null,null,null,null,null,0,0,0,0,0,0,0]
[null,null,"> 275 kV & < = 330 kV ; Single Circuit",null,null,null,null,null,null,null,0,0,0,0,0,0,0]
[null,null,"> 330 kV & < = 500 kV  ; Single Circuit",null,null,null,null,null,null,null,0,0,0,0,0,0,0]
[null,null,"> 500 kV  ; Single Circuit",null,null,null,null,null,null,null,0,0,0,0,0,0,0]
[null,null,"< = 33 kV; Multiple Circuit",null,null,null,null,null,null,null,0,0,0,0,0,0,0]
[null,null,"> 33 kV & < = 66 kV ; Multiple Circuit",null,null,null,null,null,null,null,0,0,0,0,0,0,0]
[null,null,"> 66 kV & < = 132 kV ; Multiple Circuit",null,null,null,null,null,null,null,0,34.6,0.59999999999999964,5.6,1.5999999999999996,6.6,4.5999999999999996]
[null,null,"> 132 kV & < = 275 kV ; Multiple Circuit",null,null,null,null,null,null,null,0,0,0,0,0,0,0]
[null,null,"> 275 kV & < = 330 kV ; Multiple Circuit",null,null,null,null,null,null,null,0,0,0,0,0,0,0]
[null,null,"> 330 kV & < = 500 kV  ; Multiple Circuit",null,null,null,null,null,null,null,0,0,0,0,0,0,0]
[null,null,"> 500 kV  ; Multiple Circuit",null,null,null,null,null,null,null,0,0,0,0,0,0,0]
[]
[]
[]
[]
[]
[]
[null,null,"Other"]
[null,"TRANSMISSION TOWER SUPPORT STRUCTURES BY:\nHighest operating voltage; Circuit configuration","< = 33 kV; Single Circuit",null,null,null,null,null,null,null,0,0,0,0,0,0,0]
[null,null,"> 33 kV & < = 66 kV ; Single Circuit",null,null,null,null,null,null,null,0,0,0,0,0,0,0]
[null,null,"> 66 kV & < = 132 kV ; Single Circuit",null,null,null,null,null,null,null,0,0,0,0,0,0,0]
[null,null,"> 132 kV & < = 275 kV ; Single Circuit",null,null,null,null,null,null,null,0,0,0,0,0,0,0]
[null,null,"> 275 kV & < = 330 kV ; Single Circuit",null,null,null,null,null,null,null,0,0,0,0,0,0,0]
[null,null,"> 330 kV & < = 500 kV  ; Single Circuit",null,null,null,null,null,null,null,0,0,0,0,0,0,0]
[null,null,"> 500 kV  ; Single Circuit",null,null,null,null,null,null,null,0,0,0,0,0,0,0]
[null,null,"< = 33 kV; Multiple Circuit",null,null,null,null,null,null,null,0,0,0,0,0,0,0]
[null,null,"> 33 kV & < = 66 kV ; Multiple Circuit",null,null,null,null,null,null,null,0,0,0,0,0,0,0]
[null,null,"> 66 kV & < = 132 kV ; Multiple Circuit",null,null,null,null,null,null,null,0,0,0,0,0,0,0]
[null,null,"> 132 kV & < = 275 kV ; Multiple Circuit",null,null,null,null,null,null,null,0,0,0,0,0,0,0]
[null,null,"> 275 kV & < = 330 kV ; Multiple Circuit",null,null,null,null,null,null,null,0,0,0,0,0,0,0]
[null,null,"> 330 kV & < = 500 kV  ; Multiple Circuit",null,null,null,null,null,null,null,0,0,0,0,0,0,0]
[null,null,"> 500 kV  ; Multiple Circuit",null,null,null,null,null,null,null,0,0,0,0,0,0,0]
[null,null,"Other",null,null,null,null,null,null,null,0,0,0,0,0,0,0]
[null,"CONDUCTORS BY: \nVoltage; Maximum continuous rating","< = 33 kV ; < = 100 MVA",null,null,null,null,null,null,null,0,0,0,0,0,0,0]
[null,null,"< = 33 kV ; > 100 MVA & < = 400 MVA",null,null,null,null,null,null,null,0,0,0,0,0,0,0]
[null,null,"< = 33 kV ; > 400 MVA",null,null,null,null,null,null,null,0,0,0,0,0,0,0]
[null,null,"> 33 kV & < = 66 kV  ; < = 100 MVA",null,null,null,null,null,null,null,0,0,0,0,0,0,0]
[null,null,"> 33 kV & < = 66 kV  ; > 100 MVA & < = 400 MVA",null,null,null,null,null,null,null,0,0,0,0,0,0,0]
[null,null,"> 33 kV & < = 66 kV  ; > 400 MVA",null,null,null,null,null,null,null,0,0,0,0,0,0,0]
[null,null,"> 66 kV & < = 132 kV  ; < = 100 MVA",null,null,null,null,null,null,null,0,0,0,0,0,0,0]
[null,null,"> 66 kV & < = 132 kV  ; > 100 MVA & < = 400 MVA",null,null,null,null,null,null,null,0,0,0,0,0,0,0]
[null,null,"> 66 kV & < = 132 kV  ; > 400 MVA",null,null,null,null,null,null,null,0,0,0,0,0,0,0]
[null,null,"> 132 kV & < = 275 kV  ; < = 200 MVA",null,null,null,null,null,null,null,0,0,0,0,0,0,0]
[null,null,"> 132 kV & < = 275 kV  ; > 200 MVA & < = 600 MVA",null,null,null,null,null,null,null,0,0,0,0,0,0,0]
[null,null,"> 132 kV & < = 275 kV  ; > 600 MVA",null,null,null,null,null,null,null,0,0,0,0,0,0,0]
[null,null,"> 275 kV & < = 330 kV  ; < = 800 MVA",null,null,null,null,null,null,null,0,0,0,0,0,0,0]
[null,null,"> 275 kV & < = 330 kV  ; > 800 MVA & < = 1200 MVA",null,null,null,null,null,null,null,0,0,0,0,0,0,0]
[null,null,"> 275 kV & < = 330 kV  ; > 1200 MVA",null,null,null,null,null,null,null,0,0,0,0,0,0,0]
[null,null,"> 330 kV & < = 500 kV   ; < = 1000 MVA",null,null,null,null,null,null,null,0,0,0,0,0,0,0]
[null,null,"> 330 kV & < = 500 kV   ; > 1000 MVA & < = 1500 MVA",null,null,null,null,null,null,null,0,0,0,0,0,0,0]
[null,null,"> 330 kV & < = 500 kV   ; > 1500 MVA",null,null,null,null,null,null,null,0,0,0,0,0,0,0]
[null,null,"> 500 kV   ; < = 2000 MVA",null,null,null,null,null,null,null,0,0,0,0,0,0,0]
[null,null,"> 500 kV   ; > 2000 MVA & < = 3000 MVA",null,null,null,null,null,null,null,0,0,0,0,0,0,0]
[null,null,"> 500 kV   ; > 3000 MVA",null,null,null,null,null,null,null,0,0,0,0,0,0,0]
[null,null,"Other",null,null,null,null,null,null,null,0,0,0,0,0,0,0]
[null,"TRANSMISSION CABLES BY: \nHighest operating voltage; Insulation type","< = 33 kV; Oil Filled",0,0,0,0,0,0,0,0,0,0,0,0,0,0]
[null,null,"> 33 kV & < = 66 kV ; Oil Filled",0,0,0,0,0,0,0,0,0,0,0,0,0,0]
[null,null,"> 66 kV & < = 132 kV ; Oil Filled",0,0,0,0,0,0,0,0,0,0,0,0,0,0]
[null,null,"> 132 kV & < = 275 kV ; Oil Filled",0,0,0,0,0,0,0,0,0,0,0,0,0,0]
[null,null,"> 275 kV & < = 330 kV ; Oil Filled",0,0,0,0,0,0,0,0,0,0,0,0,0,0]
[null,null,"> 330 kV & < = 500 kV  ; Oil Filled",0,0,0,0,0,0,0,0,0,0,0,0,0,0]
[null,null,"> 500 kV  ; Oil Filled",0,0,0,0,0,0,0,0,0,0,0,0,0,0]
[null,null,"< = 33 kV; XLPE Insulated",0,0,0,0,0,0,0,0,0,0,0,0,0,0]
[null,null,"> 33 kV & < = 66 kV ; XLPE Insulated",0,0,0,0,0,0,0,0,0,0,0,0,0,0]
[null,null,"> 66 kV & < = 132 kV ; XLPE Insulated",0,0,0,0,0,0,0,0,0,0,0,0,0,0]
[null,null,"> 132 kV & < = 275 kV ; XLPE Insulated",0,0,0,0,0,0,0,0,0,0,0,0,0,0]
[null,null,"> 275 kV & < = 330 kV ; XLPE Insulated",0,0,0,0,0,0,0,0,0,0,0,0,0,0]
[null,null,"> 330 kV & < = 500 kV  ; XLPE Insulated",0,0,0,0,0,0,0,0,0,0,0,0,0,0]
[null,null,"> 500 kV  ; XLPE Insulated",0,0,0,0,0,0,0,0,0,0,0,0,0,0]
[null,null,"< = 33 kV; Other Insulated",0,0,0,0,0,0,0,0,0,0,0,0,0,0]
[null,null,"> 33 kV & < = 66 kV ; Other Insulated",0,0,0,0,0,0,0,0,0,0,0,0,0,0]
[null,null,"> 66 kV & < = 132 kV ; Other Insulated",0,0,0,0,0,0,0,0,0,0,0,0,0,0]
[null,null,"> 132 kV & < = 275 kV ; Other Insulated",0,0,0,0,0,0,0,0,0,0,0,0,0,0]
[null,null,"> 275 kV & < = 330 kV ; Other Insulated",0,0,0,0,0,0,0,0,0,0,0,0,0,0]
[null,null,"> 330 kV & < = 500 kV  ; Other Insulated",0,0,0,0,0,0,0,0,0,0,0,0,0,0]
[null,null,"> 500 kV  ; Other Insulated",0,0,0,0,0,0,0,0,0,0,0,0,0,0]
[null,null,"Other",0,0,0,0,0,0,0,0,0,0,0,0,0,0]
[null,"SUBSTATION SWITCHBAYS BY: \nHighest operating voltage; Switch type","< = 33 kV; Air Insulated circuit Breaker",null,null,null,null,null,null,null,0,0,0,0,1,0,0]
[null,null,"> 33 kV & < = 66 kV ; Air Insulated circuit Breaker",null,null,null,null,null,null,null,0,0,0,0,0,0,0]
[null,null,"> 66 kV & < = 132 kV ; Air Insulated circuit Breaker",null,null,null,null,null,null,null,5,21,12,14,14,12,10]
[null,null,"> 132 kV & < = 275 kV ; Air Insulated circuit Breaker",null,null,null,null,null,null,null,1,6,5,5,6,5,5]
[null,null,"> 275 kV & < = 330 kV ; Air Insulated circuit Breaker",null,null,null,null,null,null,null,0,0,0,0,0,0,0]
[null,null,"> 330 kV & < = 500 kV  ; Air Insulated circuit Breaker",null,null,null,null,null,null,null,0,0,0,0,0,0,0]
[null,null,"> 500 kV  ; Air Insulated circuit Breaker",null,null,null,null,null,null,null,0,0,0,0,0,0,0]
[null,null,"< = 33 kV; Air Insulated Isolators / Earth Switch",null,null,null,null,null,null,null,0,1,1,1,2,0,1]
[null,null,"> 33 kV & < = 66 kV ; Air Insulated Isolators / Earth Switch",null,null,null,null,null,null,null,0,0,1,0,1,1,0]
[null,null,"> 66 kV & < = 132 kV ; Air Insulated Isolators / Earth Switch",null,null,null,null,null,null,null,20,59,39,43,46,37,35]
[null,null,"> 132 kV & < = 275 kV ; Air Insulated Isolators / Earth Switch",null,null,null,null,null,null,null,6,45,33,39,39,37,37]
[null,null,"> 275 kV & < = 330 kV ; Air Insulated Isolators / Earth Switch",null,null,null,null,null,null,null,0,0,0,0,0,0,0]
[null,null,"> 330 kV & < = 500 kV  ; Air Insulated Isolators / Earth Switch",null,null,null,null,null,null,null,0,0,0,0,0,0,0]
[null,null,"> 500 kV  ; Air Insulated Isolators / Earth Switch",null,null,null,null,null,null,null,0,0,0,0,0,0,0]
[null,null,"< = 33 kV; VT",null,null,null,null,null,null,null,0,1,1,0,1,0,1]
[null,null,"> 33 kV & < = 66 kV ; VT",null,null,null,null,null,null,null,0,3,3,3,3,2,2]
[null,null,"> 66 kV & < = 132 kV ; VT",null,null,null,null,null,null,null,18,28,19,21,26,19,18]
[null,null,"> 132 kV & < = 275 kV ; VT",null,null,null,null,null,null,null,3,17,10,13,11,12,10]
[null,null,"> 275 kV & < = 330 kV ; VT",null,null,null,null,null,null,null,0,0,0,0,0,0,0]
[null,null,"> 330 kV & < = 500 kV  ; VT",null,null,null,null,null,null,null,0,0,0,0,0,0,0]
[null,null,"> 500 kV  ; VT",null,null,null,null,null,null,null,0,0,0,0,0,0,0]
[null,null,"< = 33 kV; CT",null,null,null,null,null,null,null,0,1,1,0,1,1,0]
[null,null,"> 33 kV & < = 66 kV ; CT",null,null,null,null,null,null,null,0,3,3,3,2,3,2]
[null,null,"> 66 kV & < = 132 kV ; CT",null,null,null,null,null,null,null,15,60,39,43,51,36,32]
[null,null,"> 132 kV & < = 275 kV ; CT",null,null,null,null,null,null,null,6,32,19,22,20,18,16]
[null,null,"> 275 kV & < = 330 kV ; CT",null,null,null,null,null,null,null,0,0,0,0,0,0,0]
[null,null,"> 330 kV & < = 500 kV  ; CT",null,null,null,null,null,null,null,0,0,0,0,0,0,0]
[null,null,"> 500 kV  ; CT",null,null,null,null,null,null,null,0,0,0,0,0,0,0]
[null,null,"< = 33 kV; GIS Module",null,null,null,null,null,null,null,0,0,0,0,0,0,0]
[null,null,"> 33 kV & < = 66 kV ; GIS Module",null,null,null,null,null,null,null,0,0,0,0,0,0,0]
[null,null,"> 66 kV & < = 132 kV ; GIS Module",null,null,null,null,null,null,null,0,0,0,0,0,0,0]
[null,null,"> 132 kV & < = 275 kV ; GIS Module",null,null,null,null,null,null,null,0,0,0,0,0,0,0]
[null,null,"> 275 kV & < = 330 kV ; GIS Module",null,null,null,null,null,null,null,0,0,0,0,0,0,0]
[null,null,"> 330 kV & < = 500 kV  ; GIS Module",null,null,null,null,null,null,null,0,0,0,0,0,0,0]
[null,null,"> 500 kV  ; GIS Module",null,null,null,null,null,null,null,0,0,0,0,0,0,0]
[null,null,"Other",null,null,null,null,null,null,null,0,0,0,0,0,0,0]
[null,"SUBSTATION POWER TRANSFORMERS BY: \nHighest operating voltage;  Ampere rating","< = 33 kV ; < = 10 MVA",null,null,null,null,null,null,null,0,0,0,0,0,0,0]
[null,null,"< = 33 kV ; > 10 MVA & < =  30 MVA",null,null,null,null,null,null,null,0,0,0,0,0,0,0]
[null,null,"< = 33 kV ; > 30 MVA",null,null,null,null,null,null,null,0,0,0,0,0,0,0]
[null,null,"> 33 kV & < = 66 kV  ; < = 10 MVA",null,null,null,null,null,null,null,0,0,0,0,0,0,0]
[null,null,"> 33 kV & < = 66 kV  ; > 10 MVA & < =  30 MVA",null,null,null,null,null,null,null,0,0,0,0,0,0,0]
[null,null,"> 33 kV & < = 66 kV  ; > 30 MVA",null,null,null,null,null,null,null,0,0,0,0,0,0,0]
[null,null,"> 66 kV & < = 132 kV  ; < = 30 MVA",null,null,null,null,null,null,null,2,0,0,0,0,0,0]
[null,null,"> 66 kV & < = 132 kV  ; > 30 MVA & < =  60 MVA",null,null,null,null,null,null,null,0,0,0,1,2,0,0]
[null,null,"> 66 kV & < = 132 kV  ; > 60 MVA",null,null,null,null,null,null,null,1,1,2,0,2,2,1]
[null,null,"> 132 kV & < = 220 kV  ; < = 50 MVA",null,null,null,null,null,null,null,0,0,0,0,0,0,0]
[null,null,"> 132 kV & < = 220 kV  ; > 50 MVA & < =  100 MVA",null,null,null,null,null,null,null,0,0,0,0,0,0,0]
[null,null,"> 132 kV & < = 220 kV  ; > 100 MVA",null,null,null,null,null,null,null,0,0,0,0,0,0,0]
[null,null,"> 220 kV & < = 275 kV  ; < = 50 MVA",null,null,null,null,null,null,null,0,0,0,0,0,0,0]
[null,null,"> 220 kV & < = 275 kV  ; > 50 MVA & < =  100 MVA",null,null,null,null,null,null,null,0,0,0,0,0,0,0]
[null,null,"> 220 kV & < = 275 kV  ; > 100 MVA",null,null,null,null,null,null,null,0,0,2,0,0,0,1]
[null,null,"> 275 kV & < = 330 kV  ; < = 100 MVA",null,null,null,null,null,null,null,0,0,0,0,0,0,0]
[null,null,"> 275 kV & < = 330 kV  ; > 100 MVA & < =  250 MVA",null,null,null,null,null,null,null,0,0,0,0,0,0,0]
[null,null,"> 275 kV & < = 330 kV  ; > 250 MVA",null,null,null,null,null,null,null,0,0,0,0,0,0,0]
[null,null,"> 330 kV & < = 500 kV   ; < = 150 MVA",null,null,null,null,null,null,null,0,0,0,0,0,0,0]
[null,null,"> 330 kV & < = 500 kV   ; > 150 MVA & < =  300 MVA",null,null,null,null,null,null,null,0,0,0,0,0,0,0]
[null,null,"> 330 kV & < = 500 kV   ; > 300 MVA",null,null,null,null,null,null,null,0,0,0,0,0,0,0]
[null,null,"> 500 kV   ; < = 1000 MVA",null,null,null,null,null,null,null,0,0,0,0,0,0,0]
[null,null,"> 500 kV   ; > 1000 MVA & < =  1500 MVA",null,null,null,null,null,null,null,0,0,0,0,0,0,0]
[null,null,"> 500 kV   ; > 1500 MVA",null,null,null,null,null,null,null,0,0,0,0,0,0,0]
[null,null,"Other",null,null,null,null,null,null,null,0,0,0,0,0,0,0]
[null,"SUBSTATION REACTIVE PLANT BY: \nHighest operating voltage; Function","< = 33 kV;  SVCS",0,0,0,0,0,0,0,0,0,0,0,0,0,0]
[null,null,"> 33 kV & < = 66 kV ;  SVCS",0,0,0,0,0,0,0,0,0,0,0,0,0,0]
[null,null,"> 66 kV & < = 132 kV ;  SVCS",0,0,0,0,0,0,0,0,0,0,0,0,0,0]
[null,null,"> 132 kV & < = 275 kV ;  SVCS",0,0,0,0,0,0,0,0,0,0,0,0,0,0]
[null,null,"> 275 kV & < = 330 kV ;  SVCS",0,0,0,0,0,0,0,0,0,0,0,0,0,0]
[null,null,"> 330 kV & < = 500 kV  ;  SVCS",0,0,0,0,0,0,0,0,0,0,0,0,0,0]
[null,null,"> 500 kV  ;  SVCS",0,0,0,0,0,0,0,0,0,0,0,0,0,0]
[null,null,"< = 33 kV;  Capacitors",0,0,0,0,0,0,0,0,0,0,0,0,0,0]
[null,null,"> 33 kV & < = 66 kV ;  Capacitors",0,0,0,0,0,0,0,0,0,0,0,0,0,0]
[null,null,"> 66 kV & < = 132 kV ;  Capacitors",0,0,0,0,0,0,0,0,0,0,0,0,0,0]
[null,null,"> 132 kV & < = 275 kV ;  Capacitors",0,0,0,0,0,0,0,0,0,0,0,0,0,0]
[null,null,"> 275 kV & < = 330 kV ;  Capacitors",0,0,0,0,0,0,0,0,0,0,0,0,0,0]
[null,null,"> 330 kV & < = 500 kV  ;  Capacitors",0,0,0,0,0,0,0,0,0,0,0,0,0,0]
[null,null,"> 500 kV  ;  Capacitors",0,0,0,0,0,0,0,0,0,0,0,0,0,0]
[null,null,"< = 33 kV;  Oil Filled Reactors",0,0,0,0,0,0,0,0,0,0,0,0,0,0]
[null,null,"> 33 kV & < = 66 kV ;  Oil Filled Reactors",0,0,0,0,0,0,0,0,0,0,0,0,0,0]
[null,null,"> 66 kV & < = 132 kV ;  Oil Filled Reactors",0,0,0,0,0,0,0,0,0,0,0,0,0,0]
[null,null,"> 132 kV & < = 275 kV ;  Oil Filled Reactors",4093220.5587385828,0,0,0,0,0,0,1,0,0,0,0,0,0]
[null,null,"> 275 kV & < = 330 kV ;  Oil Filled Reactors",0,0,0,0,0,0,0,0,0,0,0,0,0,0]
[null,null,"> 330 kV & < = 500 kV  ;  Oil Filled Reactors",0,0,0,0,0,0,0,0,0,0,0,0,0,0]
[null,null,"> 500 kV  ;  Oil Filled Reactors",0,0,0,0,0,0,0,0,0,0,0,0,0,0]
[null,null,"Other",0,0,0,0,0,0,0,0,0,0,0,0,0,0]
[null,"SCADA, NETWORK CONTROL AND PROTECTION SYSTEMS BY:\nFunction","Sec Sys - Bay Non Bay",6163484.6871611485,40182674.092817232,68201971.076981738,41615222.013256542,17614331.340381283,35199629.418448396,36275541.85874135,9,60,91,58,29,49,50]
[null,null,"Sec Sys - Metering",3522283.4801766588,8591179.7045492902,6975660.8327551819,5936362.2651313571,5982422.1880160095,5504863.3068997143,6121767.1915751044,6,16,13,11,11,10,11," "]
[null,null,"Sec Sys - Telecomms",4698996.7607822316,9195889.8619366884,12618221.553920474,9955361.527269939,8648458.3094239477,8173354.9985726466,8315389.1371729923,34,267,345,271,234,219,221]
[null,null,"Sec Sys - OPGW",null,null,null,null,null,null,null,19.309999999999999,0,0,0,0,0,0,"                                                                "]
[null,null,null,null,null,null,null,null,null,null,null,null,null,null,null,null,null,null,"                                    ","                                    "]
[null,null,null,null,null,null,null,null,null,null,null,null,null,null,null,null,null,"                      "]
[null,"OTHER BY: \nNSP defined","Other - Buildings",676167.75219252624,3469609.0937530072,3178083.0927777323,3190623.3128284207,3208204.3156151273,2945884.6870728852,2619181.5130267674,2,6,6,6,6,6,5]
[null,null,"Other - Infrastructure",1836699.1136578997,3814410.2052123556,3808529.6868142467,3824317.2735400395,5769521.6418203861,3882229.5864930344,3911827.5824148278,1,2,2,2,3,2,2]
[null,null,"Other Repex",27835181.43887483,5275555.9687840724,3629682.2267592368,4446183.6709594438,4452600.6392542068,4467360.8016927922,21421916.58224649]
[null,null,"Towers - > 66 kV & < = 132 kV ; Single Circuit - REFURBISHED",null,null,null,null,null,null,null,0,0,0,0,0,0,0]
[null,null,"Towers - > 132 kV & < = 275 kV ; Single Circuit - REFURBISHED",null,null,null,null,null,null,null,0,0,0,371,0,0,336]
[null,null,"Towers - > 275 kV & < = 330 kV ; Single Circuit - REFURBISHED",null,null,null,null,null,null,null,0,0,0,0,0,0,0]
[null,null,"Towers - > 66 kV & < = 132 kV ; Multiple Circuit - REFURBISHED",null,null,null,null,null,null,null,18,108,23,58,15,53,0]
[null,null,"Towers - > 132 kV & < = 275 kV ; Multiple Circuit - REFURBISHED",null,null,null,null,null,null,null,0,0,0,0,0,0,0]
[null,null,"Towers - > 275 kV & < = 330 kV ; Multiple Circuit - REFURBISHED",null,null,null,null,null,null,null,0,0,0,0,0,0,0]

{"sheet":"2.3 Augex project data","index":7,"n_rows":216,"n_cols":34,"rows_kept":216,"cut":false,"hidden":false,"merged":[[209,2,209,8],[12,1,18,1],[12,2,18,2],[12,3,18,3],[12,4,18,4],[12,5,18,5],[12,6,18,6],[12,7,18,7],[9,30,10,30],[20,3,26,3],[20,4,26,4],[20,5,26,5],[20,6,26,6],[28,29,34,29],[28,30,34,30],[36,10,42,10],[36,24,42,24],[36,25,42,25],[44,29,50,29],[44,30,50,30],[60,1,66,1],[60,2,66,2],[60,3,66,3],[60,4,66,4],[9,31,9,32],[10,1,11,1],[10,2,11,2],[10,3,11,3],[10,4,11,4],[10,5,11,5],[10,6,11,6],[10,7,10,8],[10,9,10,10],[9,1,9,10],[9,11,9,23],[9,24,9,25],[9,26,11,26],[9,27,11,27],[9,28,9,29],[10,11,10,14],[10,15,10,17],[10,18,10,20],[10,22,10,23],[12,32,18,32],[12,8,18,8],[12,9,18,9],[12,10,18,10],[12,24,18,24],[12,25,18,25],[12,26,18,26],[11,24,11,25],[11,28,11,30],[11,31,11,32],[12,27,18,27],[12,28,18,28],[12,29,18,29],[12,30,18,30],[12,31,18,31],[20,32,26,32],[28,1,34,1],[28,2,34,2],[28,3,34,3],[28,4,34,4],[28,5,34,5],[28,6,34,6],[28,7,34,7],[28,8,34,8],[28,9,34,9],[20,26,26,26],[20,27,26,27],[20,28,26,28],[20,29,26,29],[20,30,26,30],[20,31,26,31],[20,7,26,7],[20,8,26,8],[20,9,26,9],[20,10,26,10],[20,24,26,24],[20,25,26,25],[20,1,26,1],[20,2,26,2],[28,31,34,31],[28,32,34,32],[36,1,42,1],[36,2,42,2],[36,3,42,3],[36,4,42,4],[36,5,42,5],[36,6,42,6],[28,10,34,10],[28,24,34,24],[28,25,34,25],[28,26,34,26],[28,27,34,27],[28,28,34,28],[36,32,42,32],[36,26,42,26],[36,27,42,27],[36,28,42,28],[36,29,42,29],[36,30,42,30],[36,31,42,31],[36,7,42,7],[36,8,42,8],[36,9,42,9],[44,31,50,31],[44,32,50,32],[44,26,50,26],[44,27,50,27],[44,28,50,28],[44,8,50,8],[44,9,50,9],[52,1,58,1],[52,2,58,2],[52,3,58,3],[52,4,58,4],[52,5,58,5],[52,6,58,6],[44,10,50,10],[44,24,50,24],[44,25,50,25],[44,1,50,1],[44,2,50,2],[44,3,50,3],[44,4,50,4],[44,5,50,5],[44,6,50,6],[44,7,50,7],[52,32,58,32],[60,5,66,5],[60,6,66,6],[60,7,66,7],[60,8,66,8],[60,9,66,9],[52,26,58,26],[52,27,58,27],[52,28,58,28],[52,29,58,29],[52,30,58,30],[52,31,58,31],[52,7,58,7],[52,8,58,8],[52,9,58,9],[52,10,58,10],[52,24,58,24],[52,25,58,25],[60,29,66,29],[60,30,66,30],[60,31,66,31],[60,32,66,32],[68,1,74,1],[68,2,74,2],[68,3,74,3],[68,4,74,4],[68,5,74,5],[68,6,74,6],[60,10,66,10],[60,24,66,24],[60,25,66,25],[60,26,66,26],[60,27,66,27],[60,28,66,28],[68,32,74,32],[68,26,74,26],[68,27,74,27],[68,28,74,28],[68,29,74,29],[68,30,74,30],[68,31,74,31],[68,7,74,7],[68,8,74,8],[68,9,74,9],[68,10,74,10],[76,1,82,1],[76,2,82,2],[76,3,82,3],[76,4,82,4],[76,5,82,5],[76,6,82,6],[76,7,82,7],[76,8,82,8],[76,9,82,9],[68,24,74,24],[68,25,74,25],[76,29,82,29],[76,30,82,30],[76,31,82,31],[76,32,82,32],[84,1,90,1],[84,2,90,2],[84,3,90,3],[84,4,90,4],[84,5,90,5],[84,6,90,6],[76,10,82,10],[76,24,82,24],[76,25,82,25],[76,26,82,26],[76,27,82,27],[76,28,82,28],[84,32,90,32],[84,26,90,26],[84,27,90,27],[84,28,90,28],[84,29,90,29],[84,30,90,30],[92,1,98,1],[92,2,98,2],[92,3,98,3],[92,4,98,4],[92,5,98,5],[92,6,98,6],[92,7,98,7],[92,8,98,8],[92,9,98,9],[84,31,90,31],[84,7,90,7],[84,8,90,8],[84,9,90,9],[84,10,90,10],[84,24,90,24],[84,25,90,25],[92,29,98,29],[92,30,98,30],[92,31,98,31],[92,32,98,32],[100,1,106,1],[100,2,106,2],[100,3,106,3],[100,4,106,4],[100,5,106,5],[100,6,106,6],[92,10,98,10],[92,24,98,24],[92,25,98,25],[92,26,98,26],[92,27,98,27],[92,28,98,28],[100,32,106,32],[100,26,106,26],[100,27,106,27],[100,28,106,28],[100,29,106,29],[100,30,106,30],[100,31,106,31],[100,7,106,7],[100,8,106,8],[100,9,106,9],[100,10,106,10],[108,1,114,1],[108,2,114,2],[108,3,114,3],[108,4,114,4],[108,5,114,5],[108,6,114,6],[108,7,114,7],[108,8,114,8],[108,9,114,9],[100,24,106,24],[100,25,106,25],[108,29,114,29],[108,30,114,30],[108,31,114,31],[108,32,114,32],[116,1,122,1],[116,2,122,2],[116,3,122,3],[116,4,122,4],[116,5,122,5],[116,6,122,6],[108,10,114,10],[108,24,114,24],[108,25,114,25],[108,26,114,26],[108,27,114,27],[108,28,114,28],[116,32,122,32],[116,26,122,26],[116,27,122,27],[116,28,122,28],[116,29,122,29],[116,30,122,30],[124,1,130,1],[124,2,130,2],[124,3,130,3],[124,4,130,4],[124,5,130,5],[124,6,130,6],[124,7,130,7],[124,8,130,8],[124,9,130,9],[116,31,122,31],[116,7,122,7],[116,8,122,8],[116,9,122,9],[116,10,122,10],[116,24,122,24],[116,25,122,25],[124,29,130,29],[124,30,130,30],[124,31,130,31],[124,32,130,32],[132,3,132,10],[133,3,133,10],[124,10,130,10],[124,24,130,24],[124,25,130,25],[124,26,130,26],[124,27,130,27],[124,28,130,28],[134,3,134,10],[140,1,140,6],[140,7,140,20],[140,21,140,22],[140,23,143,23],[140,24,143,24],[141,11,141,17],[141,18,143,18],[141,19,142,20],[141,21,142,21],[141,1,143,1],[141,2,143,2],[141,3,143,3],[141,4,143,4],[141,5,143,5],[141,6,142,6],[141,7,142,10],[141,22,142,22],[142,11,143,11],[142,12,142,13],[142,14,142,15],[142,16,143,16],[142,17,143,17],[143,21,143,22],[144,29,150,29],[144,23,150,23],[144,24,150,24],[144,25,150,25],[144,26,150,26],[144,27,150,27],[140,25,140,26],[140,27,142,27],[140,28,140,29],[141,26,142,26],[141,28,142,28],[141,29,142,29],[143,28,143,29],[141,25,142,25],[144,28,150,28],[143,25,143,27],[152,3,158,3],[152,4,158,4],[152,5,158,5],[152,6,158,6],[152,21,158,21],[152,22,158,22],[144,22,150,22],[144,1,150,1],[144,2,150,2],[144,3,150,3],[144,4,150,4],[144,5,150,5],[144,6,150,6],[144,21,150,21],[160,24,166,24],[160,25,166,25],[160,26,166,26],[160,27,166,27],[160,28,166,28],[160,29,166,29],[152,29,158,29],[160,1,166,1],[160,2,166,2],[160,3,166,3],[160,4,166,4],[160,5,166,5],[160,6,166,6],[160,21,166,21],[160,22,166,22],[160,23,166,23],[152,23,158,23],[152,24,158,24],[152,25,158,25],[152,26,158,26],[152,27,158,27],[152,28,158,28],[152,1,158,1],[152,2,158,2],[176,1,182,1],[176,2,182,2],[176,3,182,3],[176,4,182,4],[176,5,182,5],[176,6,182,6],[176,21,182,21],[168,21,174,21],[168,22,174,22],[168,1,174,1],[168,2,174,2],[168,3,174,3],[168,4,174,4],[168,5,174,5],[168,6,174,6],[176,22,182,22],[168,27,174,27],[168,28,174,28],[176,23,182,23],[176,24,182,24],[176,25,182,25],[176,26,182,26],[176,27,182,27],[168,29,174,29],[168,23,174,23],[168,24,174,24],[168,25,174,25],[168,26,174,26],[176,28,182,28],[176,29,182,29],[184,29,190,29],[192,1,198,1],[192,2,198,2],[192,3,198,3],[192,4,198,4],[192,5,198,5],[192,6,198,6],[192,21,198,21],[192,22,198,22],[192,23,198,23],[184,23,190,23],[184,24,190,24],[184,25,190,25],[184,26,190,26],[184,27,190,27],[184,28,190,28],[184,1,190,1],[184,2,190,2],[184,3,190,3],[184,4,190,4],[184,5,190,5],[184,6,190,6],[184,21,190,21],[184,22,190,22],[200,2,200,6],[201,2,201,6],[202,2,202,6],[192,24,198,24],[192,25,198,25],[192,26,198,26],[192,27,198,27],[192,28,198,28],[192,29,198,29]]}
[null,{"$f":"(LOOKUP(dms_Model,dms_Model_List,dms_Worksheet_List))","v":"REGULATORY REPORTING STATEMENT"},null,null,null,null,"Workbook navigation"]
[null,{"$f":"INDEX(dms_TradingNameFull_List,MATCH(dms_TradingName,dms_TradingName_List))","v":"Queensland Electricity Transmission Corporation Limited trading as Powerlink Queensland"}]
[null,{"$f":"CONCATENATE(FRCP_y1,\" to \",dms_FRCP_FinalYear_Num)","v":"2017-18 to 2021-22"}]
[null,"2.3 AUGEX PROJECTS"]
[]
[null,"2.3.1 - AUGEX ASSET DATA - SUBSTATIONS"]
[null,"NOTE: TNSP MUST PROVIDE EXPENDITURE INFORMATION ON A PROJECT CLOSE BASIS."]
[]
["AUG231",null,null,null,null,null,null,"ET_AUG231_00001","ET_AUG231_00002","ET_AUG231_00003","ET_AUG231_00004","ET_AUG231_00005","ET_AUG231_00006",null,"ET_AUG231_00007",null,"ET_AUG231_00008","ET_AUG231_00009",null,"ET_AUG231_00010","ET_AUG231_00011","ET_AUG231_00012","ET_AUG231_00013","ET_AUG231_00014","ET_AUG231_00015","ET_AUG231_00016","ET_AUG231_00017","ET_AUG231_00018","ET_AUG231_00019","ET_AUG231_00020","ET_AUG231_00021","ET_AUG231_00022","ET_AUG231_00023"]
[null,"SUBSTATION AND PROJECT SUMMARY",null,null,null,null,null,null,null,null,null,"PLANT AND EQUIPMENT EXPENDITURE AND VOLUME",null,null,null,null,null,null,null,null,null,null,null,null,"OTHER EXPENDITURE",null,"TOTAL DIRECT EXPENDITURE ($0's)","YEARS INCURRED","RELATED PARTY CONTRACTS",null,"ALL NON RELATED PARTYCONTRACTS","LAND AND EASEMENTS"]
[null,"SUBSTATION ID","SUBSTATION TYPE","PROJECT ID","PROJECT TYPE","PROJECT TRIGGER","VOLTAGE (KV)","SUBSTATION RATING\nNORMAL CYCLIC\n(MVA)",null,"SUBSTATION RATING\nN-1 EMERGENCY\n(MVA)",null,"TRANSFORMERS",null,null,null,"SWITCHGEAR",null,null,"REACTIVE PLANT",null,null,"OTHER PLANT ITEM","INSTALLATION (LABOUR)",null,"CIVIL WORKS","OTHER DIRECT",null,null,"RELATED PARTY MARGINS","TOTAL",null,"LAND PURCHASES","EASEMENTS","Comments"]
[null,null,null,null,null,null,null,"PRE","POST","PRE","POST","Units Added","MVA Added","OLTC INCLUDED?","Expenditure ($0's)","Insulation","Units Added","Expenditure\n($0's)","Plant Type","Units Added","Expenditure\n($0's)","Expenditure\n($0's)","Volume","Expenditure\n($0's)","Expenditure ($0's)",null,null,null,"Expenditure ($0's)",null,null,"Expenditure\n($0's)"]
["AUG231_1","<Enter substation ID>",null,null,null,null,""]
["AUG231_2"]
["AUG231_3"]
["AUG231_4"]
["AUG231_5"]
["AUG231_6"]
["AUG231_7"]
[null,"Project Totals",null,null,null,null,null,null,null,null,null,{"$f":"SUM(L13:L18)","v":0},{"$f":"SUM(M13:M18)","v":0},null,{"$f":"SUM(O13:O18)","v":0},null,{"$f":"SUM(Q13:Q18)","v":0},{"$f":"SUM(R13:R18)","v":0},null,{"$f":"SUM(T13:T18)","v":0},0,0,0,0,0,0,{"$f":"O18+R18+U18+V18+SUM(X18:Z18)","v":0},null,{"$f":"SUM(AC13:AC18)","v":0},{"$f":"SUM(AD13:AD18)","v":0},{"$f":"SUM(AE13:AE18)","v":0},{"$f":"SUM(AF13:AF18)","v":0},{"$f":"SUM(AG13:AG18)","v":0}]
["AUG231_8","<Enter substation ID>",null,null,null,null,""]
["AUG231_9"]
["AUG231_10"]
["AUG231_11"]
["AUG231_12"]
["AUG231_13"]
["AUG231_14"]
[null,"Project Totals",null,null,null,null,null,null,null,null,null,{"$f":"SUM(L21:L26)","v":0},{"$f":"SUM(M21:M26)","v":0},null,{"$f":"SUM(O21:O26)","v":0},null,{"$f":"SUM(Q21:Q26)","v":0},{"$f":"SUM(R21:R26)","v":0},null,{"$f":"SUM(T21:T26)","v":0},0,0,0,0,0,0,{"$f":"O26+R26+U26+V26+SUM(X26:Z26)","v":0},null,{"$f":"SUM(AC21:AC26)","v":0},{"$f":"SUM(AD21:AD26)","v":0},{"$f":"SUM(AE21:AE26)","v":0},{"$f":"SUM(AF21:AF26)","v":0},{"$f":"SUM(AG21:AG26)","v":0}]
["AUG231_15","<Enter substation ID>",null,null,null,null,""]
["AUG231_16"]
["AUG231_17"]
["AUG231_18"]
["AUG231_19"]
["AUG231_20"]
["AUG231_21"]
[null,"Project Totals",null,null,null,null,null,null,null,null,null,{"$f":"SUM(L29:L34)","v":0},{"$f":"SUM(M29:M34)","v":0},null,{"$f":"SUM(O29:O34)","v":0},null,{"$f":"SUM(Q29:Q34)","v":0},{"$f":"SUM(R29:R34)","v":0},null,{"$f":"SUM(T29:T34)","v":0},0,0,0,0,0,0,{"$f":"O34+R34+U34+V34+SUM(X34:Z34)","v":0},null,{"$f":"SUM(AC29:AC34)","v":0},{"$f":"SUM(AD29:AD34)","v":0},{"$f":"SUM(AE29:AE34)","v":0},{"$f":"SUM(AF29:AF34)","v":0},{"$f":"SUM(AG29:AG34)","v":0}]
["AUG231_22","<Enter substation ID>",null,null,null,null,""]
["AUG231_23"]
["AUG231_24"]
["AUG231_25"]
["AUG231_26"]
["AUG231_27"]
["AUG231_28"]
[null,"Project Totals",null,null,null,null,null,null,null,null,null,{"$f":"SUM(L37:L42)","v":0},{"$f":"SUM(M37:M42)","v":0},null,{"$f":"SUM(O37:O42)","v":0},null,{"$f":"SUM(Q37:Q42)","v":0},{"$f":"SUM(R37:R42)","v":0},null,{"$f":"SUM(T37:T42)","v":0},0,0,0,0,0,0,{"$f":"O42+R42+U42+V42+SUM(X42:Z42)","v":0},null,{"$f":"SUM(AC37:AC42)","v":0},{"$f":"SUM(AD37:AD42)","v":0},{"$f":"SUM(AE37:AE42)","v":0},{"$f":"SUM(AF37:AF42)","v":0},{"$f":"SUM(AG37:AG42)","v":0}]
["AUG231_29","<Enter substation ID>",null,null,null,null,""]
["AUG231_30"]
["AUG231_31"]
["AUG231_32"]
["AUG231_33"]
["AUG231_34"]
["AUG231_35"]
[null,"Project Totals",null,null,null,null,null,null,null,null,null,{"$f":"SUM(L45:L50)","v":0},{"$f":"SUM(M45:M50)","v":0},null,{"$f":"SUM(O45:O50)","v":0},null,{"$f":"SUM(Q45:Q50)","v":0},{"$f":"SUM(R45:R50)","v":0},null,{"$f":"SUM(T45:T50)","v":0},0,0,0,0,0,0,{"$f":"O50+R50+U50+V50+SUM(X50:Z50)","v":0},null,{"$f":"SUM(AC45:AC50)","v":0},{"$f":"SUM(AD45:AD50)","v":0},{"$f":"SUM(AE45:AE50)","v":0},{"$f":"SUM(AF45:AF50)","v":0},{"$f":"SUM(AG45:AG50)","v":0}]
["AUG231_36","<Enter substation ID>",null,null,null,null,""]
["AUG231_37"]
["AUG231_38"]
["AUG231_39"]
["AUG231_40"]
["AUG231_41"]
["AUG231_42"]
[null,"Project Totals",null,null,null,null,null,null,null,null,null,{"$f":"SUM(L53:L58)","v":0},{"$f":"SUM(M53:M58)","v":0},null,{"$f":"SUM(O53:O58)","v":0},null,{"$f":"SUM(Q53:Q58)","v":0},{"$f":"SUM(R53:R58)","v":0},null,{"$f":"SUM(T53:T58)","v":0},0,0,0,0,0,0,{"$f":"O58+R58+U58+V58+SUM(X58:Z58)","v":0},null,{"$f":"SUM(AC53:AC58)","v":0},{"$f":"SUM(AD53:AD58)","v":0},{"$f":"SUM(AE53:AE58)","v":0},{"$f":"SUM(AF53:AF58)","v":0},{"$f":"SUM(AG53:AG58)","v":0}]
["AUG231_43","<Enter substation ID>",null,null,null,null,""]
["AUG231_44"]
["AUG231_45"]
["AUG231_46"]
["AUG231_47"]
["AUG231_48"]
["AUG231_49"]
[null,"Project Totals",null,null,null,null,null,null,null,null,null,{"$f":"SUM(L61:L66)","v":0},{"$f":"SUM(M61:M66)","v":0},null,{"$f":"SUM(O61:O66)","v":0},null,{"$f":"SUM(Q61:Q66)","v":0},{"$f":"SUM(R61:R66)","v":0},null,{"$f":"SUM(T61:T66)","v":0},0,0,0,0,0,0,{"$f":"O66+R66+U66+V66+SUM(X66:Z66)","v":0},null,{"$f":"SUM(AC61:AC66)","v":0},{"$f":"SUM(AD61:AD66)","v":0},{"$f":"SUM(AE61:AE66)","v":0},{"$f":"SUM(AF61:AF66)","v":0},{"$f":"SUM(AG61:AG66)","v":0}]
["AUG231_50","<Enter substation ID>",null,null,null,null,""]
["AUG231_51"]
["AUG231_52"]
["AUG231_53"]
["AUG231_54"]
["AUG231_55"]
["AUG231_56"]
[null,"Project Totals",null,null,null,null,null,null,null,null,null,{"$f":"SUM(L69:L74)","v":0},{"$f":"SUM(M69:M74)","v":0},null,{"$f":"SUM(O69:O74)","v":0},null,{"$f":"SUM(Q69:Q74)","v":0},{"$f":"SUM(R69:R74)","v":0},null,{"$f":"SUM(T69:T74)","v":0},0,0,0,0,0,0,{"$f":"O74+R74+U74+V74+SUM(X74:Z74)","v":0},null,{"$f":"SUM(AC69:AC74)","v":0},{"$f":"SUM(AD69:AD74)","v":0},{"$f":"SUM(AE69:AE74)","v":0},{"$f":"SUM(AF69:AF74)","v":0},{"$f":"SUM(AG69:AG74)","v":0}]
["AUG231_57","<Enter substation ID>",null,null,null,null,""]
["AUG231_58"]
["AUG231_59"]
["AUG231_60"]
["AUG231_61"]
["AUG231_62"]
["AUG231_63"]
[null,"Project Totals",null,null,null,null,null,null,null,null,null,{"$f":"SUM(L77:L82)","v":0},{"$f":"SUM(M77:M82)","v":0},null,{"$f":"SUM(O77:O82)","v":0},null,{"$f":"SUM(Q77:Q82)","v":0},{"$f":"SUM(R77:R82)","v":0},null,{"$f":"SUM(T77:T82)","v":0},0,0,0,0,0,0,{"$f":"O82+R82+U82+V82+SUM(X82:Z82)","v":0},null,{"$f":"SUM(AC77:AC82)","v":0},{"$f":"SUM(AD77:AD82)","v":0},{"$f":"SUM(AE77:AE82)","v":0},{"$f":"SUM(AF77:AF82)","v":0},{"$f":"SUM(AG77:AG82)","v":0}]
["AUG231_64","<Enter substation ID>",null,null,null,null,""]
["AUG231_65"]
["AUG231_66"]
["AUG231_67"]
["AUG231_68"]
["AUG231_69"]
["AUG231_70"]
[null,"Project Totals",null,null,null,null,null,null,null,null,null,{"$f":"SUM(L85:L90)","v":0},{"$f":"SUM(M85:M90)","v":0},null,{"$f":"SUM(O85:O90)","v":0},null,{"$f":"SUM(Q85:Q90)","v":0},{"$f":"SUM(R85:R90)","v":0},null,{"$f":"SUM(T85:T90)","v":0},0,0,0,0,0,0,{"$f":"O90+R90+U90+V90+SUM(X90:Z90)","v":0},null,{"$f":"SUM(AC85:AC90)","v":0},{"$f":"SUM(AD85:AD90)","v":0},{"$f":"SUM(AE85:AE90)","v":0},{"$f":"SUM(AF85:AF90)","v":0},{"$f":"SUM(AG85:AG90)","v":0}]
["AUG231_71","<Enter substation ID>",null,null,null,null,""]
["AUG231_72"]
["AUG231_73"]
["AUG231_74"]
["AUG231_75"]
["AUG231_76"]
["AUG231_77"]
[null,"Project Totals",null,null,null,null,null,null,null,null,null,{"$f":"SUM(L93:L98)","v":0},{"$f":"SUM(M93:M98)","v":0},null,{"$f":"SUM(O93:O98)","v":0},null,{"$f":"SUM(Q93:Q98)","v":0},{"$f":"SUM(R93:R98)","v":0},null,{"$f":"SUM(T93:T98)","v":0},0,0,0,0,0,0,{"$f":"O98+R98+U98+V98+SUM(X98:Z98)","v":0},null,{"$f":"SUM(AC93:AC98)","v":0},{"$f":"SUM(AD93:AD98)","v":0},{"$f":"SUM(AE93:AE98)","v":0},{"$f":"SUM(AF93:AF98)","v":0},{"$f":"SUM(AG93:AG98)","v":0}]
["AUG231_78","<Enter substation ID>",null,null,null,null,""]
["AUG231_79"]
["AUG231_80"]
["AUG231_81"]
["AUG231_82"]
["AUG231_83"]
["AUG231_84"]
[null,"Project Totals",null,null,null,null,null,null,null,null,null,{"$f":"SUM(L101:L106)","v":0},{"$f":"SUM(M101:M106)","v":0},null,{"$f":"SUM(O101:O106)","v":0},null,{"$f":"SUM(Q101:Q106)","v":0},{"$f":"SUM(R101:R106)","v":0},null,{"$f":"SUM(T101:T106)","v":0},0,0,0,0,0,0,{"$f":"O106+R106+U106+V106+SUM(X106:Z106)","v":0},null,{"$f":"SUM(AC101:AC106)","v":0},{"$f":"SUM(AD101:AD106)","v":0},{"$f":"SUM(AE101:AE106)","v":0},{"$f":"SUM(AF101:AF106)","v":0},{"$f":"SUM(AG101:AG106)","v":0}]
["AUG231_85","<Enter substation ID>",null,null,null,null,""]
["AUG231_86"]
["AUG231_87"]
["AUG231_88"]
["AUG231_89"]
["AUG231_90"]
["AUG231_91"]
[null,"Project Totals",null,null,null,null,null,null,null,null,null,{"$f":"SUM(L109:L114)","v":0},{"$f":"SUM(M109:M114)","v":0},null,{"$f":"SUM(O109:O114)","v":0},null,{"$f":"SUM(Q109:Q114)","v":0},{"$f":"SUM(R109:R114)","v":0},null,{"$f":"SUM(T109:T114)","v":0},0,0,0,0,0,0,{"$f":"O114+R114+U114+V114+SUM(X114:Z114)","v":0},null,{"$f":"SUM(AC109:AC114)","v":0},{"$f":"SUM(AD109:AD114)","v":0},{"$f":"SUM(AE109:AE114)","v":0},{"$f":"SUM(AF109:AF114)","v":0},{"$f":"SUM(AG109:AG114)","v":0}]
["AUG231_92","<Enter substation ID>",null,null,null,null,""]
["AUG231_93"]
["AUG231_94"]
["AUG231_95"]
["AUG231_96"]
["AUG231_97"]
["AUG231_98"]
[null,"Project Totals",null,null,null,null,null,null,null,null,null,{"$f":"SUM(L117:L122)","v":0},{"$f":"SUM(M117:M122)","v":0},null,{"$f":"SUM(O117:O122)","v":0},null,{"$f":"SUM(Q117:Q122)","v":0},{"$f":"SUM(R117:R122)","v":0},null,{"$f":"SUM(T117:T122)","v":0},0,0,0,0,0,0,{"$f":"O122+R122+U122+V122+SUM(X122:Z122)","v":0},null,{"$f":"SUM(AC117:AC122)","v":0},{"$f":"SUM(AD117:AD122)","v":0},{"$f":"SUM(AE117:AE122)","v":0},{"$f":"SUM(AF117:AF122)","v":0},{"$f":"SUM(AG117:AG122)","v":0}]
["AUG231_99","<Enter substation ID>",null,null,null,null,""]
["AUG231_100"]
["AUG231_101"]
["AUG231_102"]
["AUG231_103"]
["AUG231_104"]
["AUG231_105"]
[null,"Project Totals",null,null,null,null,null,null,null,null,null,{"$f":"SUM(L125:L130)","v":0},{"$f":"SUM(M125:M130)","v":0},null,{"$f":"SUM(O125:O130)","v":0},null,{"$f":"SUM(Q125:Q130)","v":0},{"$f":"SUM(R125:R130)","v":0},null,{"$f":"SUM(T125:T130)","v":0},0,0,0,0,0,0,{"$f":"O130+R130+U130+V130+SUM(X130:Z130)","v":0},null,{"$f":"SUM(AC125:AC130)","v":0},{"$f":"SUM(AD125:AD130)","v":0},{"$f":"SUM(AE125:AE130)","v":0},{"$f":"SUM(AF125:AF130)","v":0},{"$f":"SUM(AG125:AG130)","v":0}]
["AUG231_1000",null,null,"Non material projects"]
["AUG231_1001",null,null,"Non material projects",null,null,null,null,null,null,null,null,null,null,null,null,null,null,null,null,null,null,null,null,null,null,4064879.4536041962,"2013, 2014, 2015, 2010"]
[null,null,null,"Non material projects",null,null,null,null,null,null,null,null,null,null,null,null,null,null,null,null,null,null,null,null,null,null,5627404.9802911803,"2015, 2016, 2017, 2018, 2019, 20220"]
[]
[]
[null,"2.3.2 - AUGEX ASSET DATA - LINES"]
[null,"NOTE: TNSP MUST PROVIDE EXPENDITURE INFORMATION ON A PROJECT CLOSE BASIS."]
["AUG232",null,null,null,null,null,null,null,"ET_AUG232_00001","ET_AUG232_00002","ET_AUG232_00003",null,"ET_AUG232_00004","ET_AUG232_00005","ET_AUG232_00006","ET_AUG232_00007","ET_AUG232_00008","ET_AUG232_00009","ET_AUG232_00010","ET_AUG232_00011","ET_AUG232_00012","ET_AUG232_00013","ET_AUG232_00014","ET_AUG232_00015","ET_AUG232_00016","ET_AUG232_00017","ET_AUG232_00018","ET_AUG232_00019","ET_AUG232_00020","ET_AUG232_00021"]
[null,"LINE AND PROJECT SUMMARY",null,null,null,null,null,"PLANT AND EQUIPMENT EXPENDITURE AND VOLUME",null,null,null,null,null,null,null,null,null,null,null,null,null,"OTHER EXPENDITURE",null,"TOTAL DIRECT EXPENDITURE ($0's)","YEARS INCURRED","ALL RELATED PARTY CONTRACTS",null,"ALL NON RELATED PARTYCONTRACTS","LAND AND EASEMENTS"]
[null,"LINE ID","PROJECT ID","PROJECT TYPE","PROJECT TRIGGER","VOLTAGE (KV)","ROUTE LINE LENGTH ADDED","TOWERS/POLES (INCLUDING STRUCTURES, AND CIVIL WORKS)",null,null,null,"LINES AND CABLES",null,null,null,null,null,null,"OTHER PLANT ITEM\n\nExpenditure ($0's)","INSTALLATION (LABOUR)",null,"CIVIL WORKS","OTHER DIRECT",null,null,"RELATED PARTY MARGINS","TOTAL",null,"LAND PURCHASES","EASEMENTS"]
[null,null,null,null,null,null,null,null,null,null,null,"Type","Rating (MVA)",null,"N-1 Emergency Rating (MVA)",null,"Circuit KM Added","Expenditure\n($0's)"]
["AUG232_1",null,null,null,null,null,"KM ADDED","Configuration","Towers/Poles Added","Towers/Poles Upgraded","Expenditure\n($0's)",null,"PRE","POST","PRE","POST",null,null,null,"Volume","Expenditure\n($0's)","Expenditure ($0's)",null,null,null,"Expenditure ($0's)",null,null,"Expenditure\n($0's)"]
["AUG232_2","<Enter line ID>"]
["AUG232_3"]
["AUG232_4"]
["AUG232_5"]
["AUG232_6"]
["AUG232_7"]
[]
["AUG232_8","Project Totals",null,null,null,null,null,null,{"$f":"SUM(I145:I151)","v":0},{"$f":"SUM(J145:J151)","v":0},{"$f":"SUM(K145:K151)","v":0},null,null,null,null,null,{"$f":"SUM(Q145:Q151)","v":0},{"$f":"SUM(R145:R151)","v":0},{"$f":"SUM(S145:S150)","v":0},{"$f":"SUM(T145:T150)","v":0},{"$f":"SUM(U145:U151)","v":0},{"$f":"SUM(V145:V151)","v":0},{"$f":"SUM(W145:W151)","v":0},{"$f":"K92+R92+S92+SUM(U92:W92)","v":0},null,{"$f":"SUM(Z145:Z151)","v":0},{"$f":"SUM(AA145:AA151)","v":0},{"$f":"SUM(AB145:AB151)","v":0},{"$f":"SUM(AC145:AC151)","v":0},{"$f":"SUM(AD145:AD151)","v":0}]
["AUG232_9","<Enter line ID>"]
["AUG232_10"]
["AUG232_11"]
["AUG232_12"]
["AUG232_13"]
["AUG232_14"]
[]
["AUG232_15","Project Totals",null,null,null,null,null,null,{"$f":"SUM(I153:I159)","v":0},{"$f":"SUM(J153:J159)","v":0},{"$f":"SUM(K153:K159)","v":0},null,null,null,null,null,{"$f":"SUM(Q153:Q159)","v":0},{"$f":"SUM(R153:R159)","v":0},{"$f":"SUM(S153:S158)","v":0},{"$f":"SUM(T153:T158)","v":0},{"$f":"SUM(U153:U159)","v":0},{"$f":"SUM(V153:V159)","v":0},{"$f":"SUM(W153:W159)","v":0},{"$f":"K84+R84+S84+SUM(U84:W84)","v":0},null,{"$f":"SUM(Z153:Z159)","v":0},{"$f":"SUM(AA153:AA159)","v":0},{"$f":"SUM(AB153:AB159)","v":0},{"$f":"SUM(AC153:AC159)","v":0},{"$f":"SUM(AD153:AD159)","v":0}]
["AUG232_16","<Enter line ID>"]
["AUG232_17"]
["AUG232_18"]
["AUG232_19"]
["AUG232_20"]
["AUG232_21"]
[]
["AUG232_22","Project Totals",null,null,null,null,null,null,{"$f":"SUM(I161:I167)","v":0},{"$f":"SUM(J161:J167)","v":0},{"$f":"SUM(K161:K167)","v":0},null,null,null,null,null,{"$f":"SUM(Q161:Q167)","v":0},{"$f":"SUM(R161:R167)","v":0},{"$f":"SUM(S161:S166)","v":0},{"$f":"SUM(T161:T166)","v":0},{"$f":"SUM(U161:U167)","v":0},{"$f":"SUM(V161:V167)","v":0},{"$f":"SUM(W161:W167)","v":0},{"$f":"K92+R92+S92+SUM(U92:W92)","v":0},null,{"$f":"SUM(Z161:Z167)","v":0},{"$f":"SUM(AA161:AA167)","v":0},{"$f":"SUM(AB161:AB167)","v":0},{"$f":"SUM(AC161:AC167)","v":0},{"$f":"SUM(AD161:AD167)","v":0}]
["AUG232_23","<Enter line ID>"]
["AUG232_24"]
["AUG232_25"]
["AUG232_26"]
["AUG232_27"]
["AUG232_28"]
[]
["AUG232_29","Project Totals",null,null,null,null,null,null,{"$f":"SUM(I169:I175)","v":0},{"$f":"SUM(J169:J175)","v":0},{"$f":"SUM(K169:K175)","v":0},null,null,null,null,null,{"$f":"SUM(Q169:Q175)","v":0},{"$f":"SUM(R169:R175)","v":0},{"$f":"SUM(S169:S174)","v":0},{"$f":"SUM(T169:T174)","v":0},{"$f":"SUM(U169:U175)","v":0},{"$f":"SUM(V169:V175)","v":0},{"$f":"SUM(W169:W175)","v":0},{"$f":"K100+R100+S100+SUM(U100:W100)","v":0},null,{"$f":"SUM(Z169:Z175)","v":0},{"$f":"SUM(AA169:AA175)","v":0},{"$f":"SUM(AB169:AB175)","v":0},{"$f":"SUM(AC169:AC175)","v":0},{"$f":"SUM(AD169:AD175)","v":0}]
["AUG232_30","<Enter line ID>"]
["AUG232_31"]
["AUG232_32"]
["AUG232_33"]
["AUG232_34"]
["AUG232_35"]
[]
["AUG232_36","Project Totals",null,null,null,null,null,null,{"$f":"SUM(I177:I183)","v":0},{"$f":"SUM(J177:J183)","v":0},{"$f":"SUM(K177:K183)","v":0},null,null,null,null,null,{"$f":"SUM(Q177:Q183)","v":0},{"$f":"SUM(R177:R183)","v":0},{"$f":"SUM(S177:S182)","v":0},{"$f":"SUM(T177:T182)","v":0},{"$f":"SUM(U177:U183)","v":0},{"$f":"SUM(V177:V183)","v":0},{"$f":"SUM(W177:W183)","v":0},{"$f":"K108+R108+S108+SUM(U108:W108)","v":0},null,{"$f":"SUM(Z177:Z183)","v":0},{"$f":"SUM(AA177:AA183)","v":0},{"$f":"SUM(AB177:AB183)","v":0},{"$f":"SUM(AC177:AC183)","v":0},{"$f":"SUM(AD177:AD183)","v":0}]
["AUG232_37","<Enter line ID>"]
["AUG232_38"]
["AUG232_39"]
["AUG232_40"]
["AUG232_41"]
["AUG232_42"]
[]
["AUG232_43","Project Totals",null,null,null,null,null,null,{"$f":"SUM(I185:I191)","v":0},{"$f":"SUM(J185:J191)","v":0},{"$f":"SUM(K185:K191)","v":0},null,null,null,null,null,{"$f":"SUM(Q185:Q191)","v":0},{"$f":"SUM(R185:R191)","v":0},{"$f":"SUM(S185:S190)","v":0},{"$f":"SUM(T185:T190)","v":0},{"$f":"SUM(U185:U191)","v":0},{"$f":"SUM(V185:V191)","v":0},{"$f":"SUM(W185:W191)","v":0},{"$f":"K116+R116+S116+SUM(U116:W116)","v":0},null,{"$f":"SUM(Z185:Z191)","v":0},{"$f":"SUM(AA185:AA191)","v":0},{"$f":"SUM(AB185:AB191)","v":0},{"$f":"SUM(AC185:AC191)","v":0},{"$f":"SUM(AD185:AD191)","v":0}]
["AUG232_44","<Enter line ID>"]
["AUG232_45"]
["AUG232_46"]
["AUG232_47"]
["AUG232_48"]
["AUG232_49"]
[]
["AUG232_1000","Project Totals",null,null,null,null,null,null,{"$f":"SUM(I193:I199)","v":0},{"$f":"SUM(J193:J199)","v":0},{"$f":"SUM(K193:K199)","v":0},null,null,null,null,null,{"$f":"SUM(Q193:Q199)","v":0},{"$f":"SUM(R193:R199)","v":0},{"$f":"SUM(S193:S198)","v":0},{"$f":"SUM(T193:T198)","v":0},{"$f":"SUM(U193:U199)","v":0},{"$f":"SUM(V193:V199)","v":0},{"$f":"SUM(W193:W199)","v":0},{"$f":"K124+R124+S124+SUM(U124:W124)","v":0},null,{"$f":"SUM(Z193:Z199)","v":0},{"$f":"SUM(AA193:AA199)","v":0},{"$f":"SUM(AB193:AB199)","v":0},{"$f":"SUM(AC193:AC199)","v":0},{"$f":"SUM(AD193:AD199)","v":0}]
["AUG232_1001",null,"Non material projects"]
["AUG232_1002",null,"Non material projects"]
[null,null,"Non material projects"]
[]
[]
[]
[]
[]
[null,"2.3.3 - AUGEX - TOTAL EXPENDITURE"]
[null,"As incurred",{"$f":"CONCATENATE(\"EXPENDITURE\nForecast ($0's. real \",dms_DollarReal,\")\")","v":"EXPENDITURE\nForecast ($0's. real June 2017)"}]
["AUG233",null,{"$f":"CRCP_y4","v":"2015-16"},{"$f":"CRCP_y5","v":"2016-17"},{"$f":"FRCP_y1","v":"2017-18"},{"$f":"FRCP_y2","v":"2018-19"},{"$f":"FRCP_y3","v":"2019-20"},{"$f":"FRCP_y4","v":"2020-21"},{"$f":"FRCP_y5","v":"2021-22"}]
[null,"AUGMENTATION CAPEX"]
["ET_AUG233_00001","Substations",2008914.4053373199,22741.567538056799,265410.772105565,2583354.5296246801,276531.188769267,0,0]
["ET_AUG233_00002","Lines"]
["ET_AUG233_00003","Other assets"]
[null,"Total augmentation capex",{"$f":"SUM(C213:C215)","v":2008914.4053373199},{"$f":"SUM(D213:D215)","v":22741.567538056799},265410.772105565,2583354.5296246801,276531.188769267,0,0]

{"sheet":"2.5 Connections","index":8,"n_rows":59,"n_cols":16,"rows_kept":59,"cut":false,"hidden":false,"merged":[[7,3,7,9],[25,1,26,1],[27,1,28,1],[29,1,30,1],[19,1,20,1],[21,1,22,1],[23,1,24,1],[9,1,10,1],[11,1,12,1],[13,1,14,1],[15,1,16,1],[17,1,18,1],[31,1,32,1],[33,1,34,1],[35,1,36,1],[37,1,38,1],[39,1,40,1],[41,1,42,1],[43,1,44,1],[55,1,56,1],[57,1,58,1],[45,1,46,1],[47,1,48,1],[49,1,50,1],[51,1,52,1],[53,1,54,1]]}
[null,{"$f":"(LOOKUP(dms_Model,dms_Model_List,dms_Worksheet_List))","v":"REGULATORY REPORTING STATEMENT"}]
[null,{"$f":"INDEX(dms_TradingNameFull_List,MATCH(dms_TradingName,dms_TradingName_List))","v":"Queensland Electricity Transmission Corporation Limited trading as Powerlink Queensland"}]
[null,{"$f":"CONCATENATE(FRCP_y1,\" to \",FRCP_y5)","v":"2017-18 to 2021-22"}]
[null,"2.5 CONNECTIONS EXPENDITURE"]
[]
[null,"TNSP CONNECTION CLASSIFICATIONS AND SPECIFICATIONS OF ANNUAL DIRECT AND INDIRECT COSTS"]
[null,"2.5.1 - EXPENDITURE ON CONNECTION PROJECTS",null,null,null,null,null,null,null,null,null,"2.5.2 - DESCRIPTION OF CONNECTION PROJECTS"]
[null,null,null,{"$f":"CONCATENATE(\"EXPENDITURE\nForecast \n($0's. real \",dms_DollarReal,\")\")","v":"EXPENDITURE\nForecast \n($0's. real June 2017)"},null,null,null,null,null,null,null,null,"CONNECTION RATING \n(MVA)","CONNECTION \nVOLTAGE \n(KV)","UNDERGROUND / OVERHEAD\n(drop down)","YEAR CONNECTION PROJECT COMPLETED "]
[null,"CONNECTION PROJECT","EXPENDITURE CATEGORY",{"$f":"CRCP_y4","v":"2015-16"},{"$f":"CRCP_y5","v":"2016-17"},{"$f":"FRCP_y1","v":"2017-18"},{"$f":"FRCP_y2","v":"2018-19"},{"$f":"FRCP_y3","v":"2019-20"},{"$f":"FRCP_y4","v":"2020-21"},{"$f":"FRCP_y5","v":"2021-22"},null,{"$f":"B10","v":"<Enter project description here…>"}]
[null,"<Enter project description here…>","Direct materials costs ",null,null,null,null,null,null,null,null,{"$f":"B12","v":0}]
[null,null,"Direct labour costs ",null,null,null,null,null,null,null,null,{"$f":"B14","v":0}]
[null,null,"Direct materials costs ",null,null,null,null,null,null,null,null,{"$f":"B16","v":0}]
[null,null,"Direct labour costs ",null,null,null,null,null,null,null,null,{"$f":"B18","v":0}]
[null,null,"Direct materials costs ",null,null,null,null,null,null,null,null,{"$f":"B20","v":0}]
[null,null,"Direct labour costs ",null,null,null,null,null,null,null,null,{"$f":"B22","v":0}]
[null,null,"Direct materials costs ",null,null,null,null,null,null,null,null,{"$f":"B24","v":0}]
[null,null,"Direct labour costs ",null,null,null,null,null,null,null,null,{"$f":"B26","v":0}]
[null,null,"Direct materials costs ",null,null,null,null,null,null,null,null,{"$f":"B28","v":0}]
[null,null,"Direct labour costs ",null,null,null,null,null,null,null,null,{"$f":"B30","v":0}]
[null,null,"Direct materials costs ",null,null,null,null,null,null,null,null,{"$f":"B32","v":0}]
[null,null,"Direct labour costs ",null,null,null,null,null,null,null,null,{"$f":"B34","v":0}]
[null,null,"Direct materials costs ",null,null,null,null,null,null,null,null,{"$f":"B36","v":0}]
[null,null,"Direct labour costs ",null,null,null,null,null,null,null,null,{"$f":"B38","v":0}]
[null,null,"Direct materials costs ",null,null,null,null,null,null,null,null,{"$f":"B40","v":0}]
[null,null,"Direct labour costs ",null,null,null,null,null,null,null,null,{"$f":"B42","v":0}]
[null,null,"Direct materials costs ",null,null,null,null,null,null,null,null,{"$f":"B44","v":0}]
[null,null,"Direct labour costs "]
[null,null,"Direct materials costs "]
[null,null,"Direct labour costs "]
[null,null,"Direct materials costs "]
[null,null,"Direct labour costs "]
[null,null,"Direct materials costs "]
[null,null,"Direct labour costs "]
[null,null,"Direct materials costs "]
[null,null,"Direct labour costs "]
[null,null,"Direct materials costs "]
[null,null,"Direct labour costs "]
[null,null,"Direct materials costs "]
[null,null,"Direct labour costs "]
[null,null,"Direct materials costs "]
[null,null,"Direct labour costs "]
[null,null,"Direct materials costs "]
[null,null,"Direct labour costs "]
[null,null,"Direct materials costs "]
[null,null,"Direct labour costs "]
[null,null,"Direct materials costs "]
[null,null,"Direct labour costs "]
[null,null,"Direct materials costs "]
[null,null,"Direct labour costs "]
[null,null,"Direct materials costs "]
[null,null,"Direct labour costs "]
[null,null,"Direct materials costs "]
[null,null,"Direct labour costs "]
[null,null,"Direct materials costs "]
[null,null,"Direct labour costs "]
[null,null,"Direct materials costs "]
[null,null,"Direct labour costs "]
[null,null,"Direct materials costs "]
[null,null,"Direct labour costs "]

{"sheet":"2.6 Non-network","index":9,"n_rows":50,"n_cols":22,"rows_kept":50,"cut":false,"hidden":false,"merged":[[19,15,19,21],[6,15,6,21],[6,4,6,10],[19,12,20,13],[19,14,20,14],[6,12,7,14],[28,1,49,1],[40,2,41,2],[42,2,43,2],[44,2,45,2],[46,2,47,2],[48,2,49,2],[28,2,29,2],[30,2,31,2],[32,2,33,2],[36,2,37,2],[38,2,39,2]]}
[null,{"$f":"(LOOKUP(dms_Model,dms_Model_List,dms_Worksheet_List))","v":"REGULATORY REPORTING STATEMENT"}]
[null,{"$f":"INDEX(dms_TradingNameFull_List,MATCH(dms_TradingName,dms_TradingName_List))","v":"Queensland Electricity Transmission Corporation Limited trading as Powerlink Queensland"}]
[null,{"$f":"CONCATENATE(FRCP_y1,\" to \",FRCP_y5)","v":"2017-18 to 2021-22"}]
[null,"2.6 NON NETWORK EXPENDITURE"]
[]
[null,"2.6.1 - NON-NETWORK EXPENDITURE",null,null,null,null,null,null,null,null,null,null,"2.6.2 - ANNUAL DESCRIPTOR METRICS - IT & COMMUNICATIONS EXPENDITURE"]
[null,null,null,null,{"$f":"CONCATENATE(\"EXPENDITURE\nForecast \n($0's. real \",dms_DollarReal,\")\")","v":"EXPENDITURE\nForecast \n($0's. real June 2017)"},null,null,null,null,null,null,null,"DESCRIPTOR METRIC",null,null,"VOLUMES  (0's)"]
[null,"SERVICE SUBCATEGORY","ASSET CATEGORY","ASSET REPORTING CATEGORY",{"$f":"CRCP_y4","v":"2015-16"},{"$f":"CRCP_y5","v":"2016-17"},{"$f":"FRCP_y1","v":"2017-18"},{"$f":"FRCP_y2","v":"2018-19"},{"$f":"FRCP_y3","v":"2019-20"},{"$f":"FRCP_y4","v":"2020-21"},{"$f":"FRCP_y5","v":"2021-22"},null,null,null,null,{"$f":"CRCP_y4","v":"2015-16"},{"$f":"CRCP_y5","v":"2016-17"},{"$f":"FRCP_y1","v":"2017-18"},{"$f":"FRCP_y2","v":"2018-19"},{"$f":"FRCP_y3","v":"2019-20"},{"$f":"FRCP_y4","v":"2020-21"},{"$f":"FRCP_y5","v":"2021-22"}]
[null,"IT & COMMUNICATIONS","Client device expenditure","Opex ",1772057.2417367611,1686231.3974159847,1750809.34134199,1762845.7241027539,1774612.1267206974,1788612.5250172797,1808295.2227063826,null,"Employee numbers",null,null,878.79357101965275,826.56728658445127,759.77992294105138,745.47797961780225,733.81980818400518,732.43602893376863,730.92437057530276]
[null,null,null,"Capex ",932098.96978504874,988028.38361658878,561847.92642346432,500631.04393673007,562575.78818608494,566239.58567430929,521476.2874639224,null,"User numbers",null,null,1308.2624338629082,1230.5130189376989,1131.0864848882738,1109.7951420768632,1092.4395898318987,1090.379553812583,1088.1291438091041]
[null,null,"Recurrent expenditure","Opex ",20854446.697788492,19844405.68245079,18523835.783952471,18651182.590042897,18775672.964132167,18923799.360783119,19132045.370881885,null,"Number of devices",null,null,1985.9482387654934,1867.924278404688,1716.9943540477034,1684.6740002235681,1658.3281941211044,1655.2010502098683,1651.7849177373389]
[null,null,null,"Capex ",1425956.5244639404,1511519.2330901718,1744648.4336283384,1601381.6262250282,1746899.5770602843,1756603.9876994269,1651650.3456392924]
[null,null,"Non-recurrent expenditure","Opex ",0,0,0,0,0,0,0]
[null,null,null,"Capex ",12186290.521332582,12917513.393294517,9225985.4402072113,8408050.6806470342,9237901.4609854799,9291374.2934949454,8692506.5324128605]
[null,"MOTOR VEHICLES","Car","Opex ",787347.05234675319,806854.03104658856,807247.81046632852,807641.78206733719,808035.94594340748,808430.30218837736,808824.85089613195]
[null,null,null,"Capex ",872459.24413609796,956298.21953303437,361979.91665029858,271721.84424593096,388528.11331710196,850010.67024777457,428571.50508765853]
[null,null,"Light commercial vehicle","Opex ",1215007.0475219681,1245109.5500023139,1245717.2169374058,1246325.1804400596,1246933.4406550138,1247541.9977270756,1248150.8518011258]
[null,null,null,"Capex ",2356973.335646545,1281721.6446649781,169120.315823393,504086.9183784097,457342.61198375927,496977.24190857506,433221.45952124341]
[null,null,"Elevated work platform (LCV)  ","Opex ",0,0,0,0,0,0,0,null,"2.6.3 - ANNUAL DESCRIPTOR METRICS - MOTOR VEHICLES"]
[null,null,null,"Capex ",0,0,0,0,0,0,0,null,"DESCRIPTOR METRIC",null,"Unit of Measure","VOLUMES  (0's or %)"]
[null,null,"Elevated work platform (HCV)","Opex ",0,0,0,0,0,0,0,null,null,null,null,{"$f":"CRCP_y4","v":"2015-16"},{"$f":"CRCP_y5","v":"2016-17"},{"$f":"FRCP_y1","v":"2017-18"},{"$f":"FRCP_y2","v":"2018-19"},{"$f":"FRCP_y3","v":"2019-20"},{"$f":"FRCP_y4","v":"2020-21"},{"$f":"FRCP_y5","v":"2021-22"}]
[null,null,null,"Capex ",0,0,0,0,0,0,0,null,"CAR","Average kilometres travelled ","0's",0,0,0,0,0,0,0]
[null,null,"Heavy commercial vehicle","Opex ",79755.887882982221,81731.886143828699,81771.774814469958,81811.682952495568,81851.610567406533,81891.557668708352,81931.52426591127,null,null,"Number purchased","0's",23,27,7,7,13,31,11]
[null,null,null,"Capex ",549833.68677820172,0,1395663.1315839477,1222236.0804162524,1762669.7713945615,752598.02940299828,1061465.2243672593,null,null,"Number leased","0's",0,0,0,0,0,0,0]
[null,"BUILDINGS AND PROPERTY","Total buildings and property expenditure","Opex ",6429929.1172989132,6118509.1008246932,6058708.6170701347,6100360.7457337268,6141078.6030411413,6189527.2443631589,6257639.589482788,null,null,"Number in fleet","0's",118,97.379310344827587,97.379310344827587,97.379310344827587,97.379310344827587,97.379310344827587,97.379310344827587]
[null,null,null,"Capex ",5579307.6270807721,2662091.7015193403,2090878.2578164218,4093118.2002519821,7679398.3619265743,7683876.2545289816,1936023.1495803669,null,null,"Proportion of total fleet expenditure allocated as regulatory expenditure","%",0.81669999999999998,0.81669999999999998,0.81669999999999998,0.81669999999999998,0.81669999999999998,0.81669999999999998,0.81669999999999998]
[null,"OTHER","Other expenditure","Opex ",null,null,null,null,null,null,null,null,"LIGHT COMMERCIAL VEHICLE","Average kilometres travelled ","0's",0,0,0,0,0,0,0]
[null,null,null,"Capex ",null,null,null,null,null,null,null,null,null,"Number purchased","0's",37,23,27,29,30,15,21]
[null,"OTHER - TNSP nominated","Tools and equipment","Opex ",0,0,0,0,0,0,0,null,null,"Number leased","0's",0,0,0,0,0,0,0]
[null,null,null,"Capex ",1179116.2510438275,1124372.4153505764,1000900.6081722428,1018335.1846356865,1017177.1235567729,992591.50914060033,956670.21501835086,null,null,"Number in fleet","0's",174,140.82758620689657,140.82758620689657,140.82758620689657,140.82758620689657,140.82758620689657,140.82758620689657]
[null,null,"Motor vehicles - other","Opex ",462253.51239413075,439865.24126097729,443722.9138116652,446773.39949519763,449755.46175145288,453303.70505812945,458292.06316432299,null,null,"Proportion of total fleet expenditure allocated as regulatory expenditure","%",0.81669999999999998,0.81669999999999998,0.81669999999999998,0.81669999999999998,0.81669999999999998,0.81669999999999998,0.81669999999999998]
[null,null,null,"Capex ",891199.80656550662,744570.47945745685,250303.07660390594,262942.77045631991,89700.235935922945,509292.96561757196,617246.49196582171,null,"ELEVATED WORK PLATFORM (LCV) ","Average kilometres travelled ","0's"]
[null,null,null,"Opex ",null,null,null,null,null,null,null,null,null,"Number purchased","0's"]
[null,null,null,"Capex ",null,null,null,null,null,null,null,null,null,"Number leased","0's"]
[null,null,null,"Opex ",null,null,null,null,null,null,null,null,null,"Number in fleet","0's"]
[null,null,null,"Capex ",null,null,null,null,null,null,null,null,null,"Proportion of total fleet expenditure allocated as regulatory expenditure","%"]
[null,null,null,"Opex ",null,null,null,null,null,null,null,null,"ELEVATED WORK PLATFORM (HCV)","Average kilometres travelled ","0's"]
[null,null,null,"Capex ",null,null,null,null,null,null,null,null,null,"Number purchased","0's"]
[null,null,null,"Opex ",null,null,null,null,null,null,null,null,null,"Number leased","0's"]
[null,null,null,"Capex ",null,null,null,null,null,null,null,null,null,"Number in fleet","0's"]
[null,null,null,"Opex ",null,null,null,null,null,null,null,null,null,"Proportion of total fleet expenditure allocated as regulatory expenditure","%"]
[null,null,null,"Capex ",null,null,null,null,null,null,null,null,"HEAVY COMMERCIAL VEHICLE ","Average kilometres travelled ","0's",0,0,0,0,0,0,0]
[null,null,null,"Opex ",null,null,null,null,null,null,null,null,null,"Number purchased","0's",5,0,2,3,5,4,3]
[null,null,null,"Capex ",null,null,null,null,null,null,null,null,null,"Number leased","0's",0,0,0,0,0,0,0]
[null,null,null,"Opex ",null,null,null,null,null,null,null,null,null,"Number in fleet","0's",13,8.5172413793103452,8.5172413793103452,8.5172413793103452,8.5172413793103452,8.5172413793103452,8.5172413793103452]
[null,null,null,"Capex ",null,null,null,null,null,null,null,null,null,"Proportion of total fleet expenditure allocated as regulatory expenditure","%",0.81669999999999998,0.81669999999999998,0.81669999999999998,0.81669999999999998,0.81669999999999998,0.81669999999999998,0.81669999999999998]
[null,null,null,"Opex "]
[null,null,null,"Capex "]
[null,null,null,"Opex "]
[null,null,null,"Capex "]

{"sheet":"2.10 Overheads","index":10,"n_rows":120,"n_cols":11,"rows_kept":120,"cut":false,"hidden":false,"merged":[[7,4,7,10],[91,4,91,10],[93,2,117,2],[93,1,119,1],[9,1,35,1],[36,1,58,1],[59,1,86,1],[59,2,84,2],[36,2,56,2],[9,2,33,2]]}
[null,{"$f":"(LOOKUP(dms_Model,dms_Model_List,dms_Worksheet_List))","v":"REGULATORY REPORTING STATEMENT"}]
[null,{"$f":"INDEX(dms_TradingNameFull_List,MATCH(dms_TradingName,dms_TradingName_List))","v":"Queensland Electricity Transmission Corporation Limited trading as Powerlink Queensland"}]
[null,{"$f":"CONCATENATE(FRCP_y1,\" to \",FRCP_y5)","v":"2017-18 to 2021-22"}]
[null,"2.10 OVERHEADS"]
[]
[]
[null,"2.10.1 - NETWORK OVERHEADS EXPENDITURE"]
[null,null,null,null,{"$f":"CONCATENATE(\"EXPENDITURE\nForecast \n($0's. real \",dms_DollarReal,\")\")","v":"EXPENDITURE\nForecast \n($0's. real June 2017)"}]
[null,null,null,null,{"$f":"CRCP_y4","v":"2015-16"},{"$f":"CRCP_y5","v":"2016-17"},{"$f":"FRCP_y1","v":"2017-18"},{"$f":"FRCP_y2","v":"2018-19"},{"$f":"FRCP_y3","v":"2019-20"},{"$f":"FRCP_y4","v":"2020-21"},{"$f":"FRCP_y5","v":"2021-22"}]
[null,"MAINTENANCE SUPPORT","Total Overhead Expenditure - Prescribed Services","Maintenance support",12366091.238888886,12297387.978241423,11665493.733046768,11624448.244704939,11582363.379050143,11629420.805551674,11607783.102424594]
[]
[]
[]
[]
[]
[]
[]
[]
[]
[]
[]
[]
[]
[]
[]
[]
[]
[]
[]
[]
[]
[]
[]
[]
[null,null,"Total Overhead Expenditure - Negotiated Services","Total"]
[null,null,"Total Overhead Expenditure - Unregulated Services","Total"]
[null," NETWORK MONITORING & CONTROL","Total Overhead Expenditure - Prescribed Services","Network monitoring & control",14030601.149900656,14475102.412519826,14102306.93229669,14044812.934971387,13986331.566126125,14033266.085493445,13991797.961644515]
[]
[]
[]
[]
[]
[]
[]
[]
[]
[]
[]
[]
[]
[]
[]
[]
[]
[]
[]
[]
[null,null,"Total Overhead Expenditure - Negotiated Services","Total"]
[null,null,"Total Overhead Expenditure - Unregulated Services","Total"]
[null,"ASSET MANAGEMENT SUPPORT","Total Overhead Expenditure - Prescribed Services","Asset management support",21842266.306422655,22342023.22763392,21876495.15755938,21787221.671022207,21696216.027481116,21772314.899767909,21719885.441463903]
[]
[]
[]
[]
[]
[]
[]
[]
[]
[]
[]
[]
[]
[]
[]
[]
[]
[]
[]
[]
[]
[]
[]
[]
[]
[null,null,"Total Overhead Expenditure - Negotiated Services","Total"]
[null,null,"Total Overhead Expenditure - Unregulated Services","Total"]
[]
[]
[]
[null,"TABLE 2.10.2 - CORPORATE OVERHEADS EXPENDITURE"]
[null,null,null,null,{"$f":"CONCATENATE(\"EXPENDITURE\nForecast \n($0's. real \",dms_DollarReal,\")\")","v":"EXPENDITURE\nForecast \n($0's. real June 2017)"}]
[null,null,null,null,{"$f":"CRCP_y4","v":"2015-16"},{"$f":"CRCP_y5","v":"2016-17"},{"$f":"FRCP_y1","v":"2017-18"},{"$f":"FRCP_y2","v":"2018-19"},{"$f":"FRCP_y3","v":"2019-20"},{"$f":"FRCP_y4","v":"2020-21"},{"$f":"FRCP_y5","v":"2021-22"}]
[null,"CORPORATE OVERHEADS","Total Overhead Expenditure - Prescribed Services","Grid Support",3669183.7956098723,1821916.5732821024,0,0,0,0,0]
[null,null,null,"Corporate Support",55340164.728033543,47823520.63913136,43354809.25880409,43053565.326027162,42739670.107783042,42467531.017496251,42314504.314117223]
[null,null,null,"Insurance Premiums",7207600.5756249633,7484028.4126932574,7606997.0628740573,7786258.4779116968,7942616.7637325237,8094781.1329273451,8286455.6435248544]
[null,null,null,"Self Insurance",1703993.8305035678,1786490.4176905057,1485684.9163200536,1484743.9125145832,1477870.1104236473,1470405.4143914981,1468948.6613565467]
[null,null,null,"IT Function",22302039.206353795,21221887.109751996,19455798.382368706,19579996.322532136,19701071.247173961,19846812.266104449,20055427.615860082]
[null,null,null,"Regulatory Reset",4112478.2052124147,1417046.2236638572,1379260.31601679,1388064.9554786012,1396648.1981469938,1406980.0693905216,1421769.227233083]
[null,null,null,"AEMC Levy",4249619.6502826205,4251138.6709915726,4200000.0000000009,4199999.9999999991,4199999.9999999991,4199999.9999999981,4199999.9999999972]
[]
[]
[]
[]
[]
[]
[]
[]
[]
[]
[]
[]
[]
[]
[]
[]
[]
[]
[null,null,"Total Overhead Expenditure - Negotiated Services","Total"]
[null,null,"Total Overhead Expenditure - Unregulated Services","Total"]

{"sheet":"2.11 Labour","index":11,"n_rows":30,"n_cols":14,"rows_kept":30,"cut":false,"hidden":false,"merged":[[22,2,22,6],[22,7,22,13],[5,1,5,2],[11,7,11,13],[10,2,10,13],[11,2,11,6],[21,2,21,13]]}
[null,{"$f":"(LOOKUP(dms_Model,dms_Model_List,dms_Worksheet_List))","v":"REGULATORY REPORTING STATEMENT"}]
[null,{"$f":"INDEX(dms_TradingNameFull_List,MATCH(dms_TradingName,dms_TradingName_List))","v":"Queensland Electricity Transmission Corporation Limited trading as Powerlink Queensland"}]
[null,{"$f":"CONCATENATE(FRCP_y1,\" to \",FRCP_y5)","v":"2017-18 to 2021-22"}]
[null,"2.11 LABOUR"]
[]
[null,"Table numbering in this template starts at 2.11.3.\n\nTables 2.11.1 & 2.11.2 appear in the Category Analysis RIN but are not required for this RIN."]
[]
[null,"2.11.3 - LABOUR / NON-LABOUR EXPENDITURE SPLIT"]
[]
[null,"2.11.3.1 - Labour Opex"]
[null,null,"EXPENDITURE"]
[null,null,"($0's, nominal)",null,null,null,null,{"$f":"CONCATENATE(\"($0's, real \", dms_DollarReal,\")\")","v":"($0's, real June 2017)"}]
[null,null,{"$f":"PRCP_y4","v":"2010-11"},{"$f":"PRCP_y5","v":"2011-12"},{"$f":"CRCP_y1","v":"2012-13"},{"$f":"CRCP_y2","v":"2013-14"},{"$f":"CRCP_y3","v":"2014-15"},{"$f":"CRCP_y4","v":"2015-16"},{"$f":"CRCP_y5","v":"2016-17"},{"$f":"FRCP_y1","v":"2017-18"},{"$f":"FRCP_y2","v":"2018-19"},{"$f":"FRCP_y3","v":"2019-20"},{"$f":"FRCP_y4","v":"2020-21"},{"$f":"FRCP_y5","v":"2021-22"}]
[null,"In-house labour expenditure",76713243.214652956,75867206.860939518,80349298.06846036,85862672.92758736,93902792.535833031,102668432.10538992,99360171.226004928,86569778.18341735,86056515.383715972,85919095.024263263,86346475.069931671,86379563.043712467]
[null,"Labour expenditure outsourced to related parties",0,0,0,0,0,0,0,0,0,0,0,0]
[null,"Labour expenditure outsourced to unrelated parties",13449651.955149999,17738172.488699999,17444231.114039999,20222109.9406,20002297.16502,19819075.310957264,19986546.175273739,20103582.256033599,19956370.357869916,19947096.548696347,19991281.99612293,20085605.711979706]
[null,"Controllable non-labour expenditure",79224477.078666583,85045575.654779583,87222217.513707384,88723699.455594718,109106475.95208429,109247468.29636717,108687607.85901946,97251436.343151495,96779342.899218708,95748279.450865477,94816957.872271389,94098105.991104811]
[null,"Uncontrollable non-labour expenditure",1798000,1854000,1978000,2020380.675878074,5994437.8096599001,6990106.078416096,7049804.962727691,9285791.9590761252,9253341.6832324937,9207166.3662527949,9152605.7940461896,9101373.2780091576]
[null,"Total",{"$f":"SUM(C14:C18)","v":171185372.24846953},{"$f":"SUM(D14:D18)","v":180504955.00441909},186993746.69620776,196828862.99966016,229006003.46259722,238725081.79113048,{"$f":"SUM(I14:I18)","v":235084130.22302583},213210588.74167857,212045570.32403708,210821637.39007789,210307320.73237219,209664648.02480611]
[]
[null,"2.11.3.2 - Labour Capex"]
[null,null,"EXPENDITURE"]
[null,null,"($0's, nominal)",null,null,null,null,{"$f":"CONCATENATE(\"($0's, real \", dms_DollarReal,\")\")","v":"($0's, real June 2017)"}]
[null,null,{"$f":"PRCP_y4","v":"2010-11"},{"$f":"PRCP_y5","v":"2011-12"},{"$f":"CRCP_y1","v":"2012-13"},{"$f":"CRCP_y2","v":"2013-14"},{"$f":"CRCP_y3","v":"2014-15"},{"$f":"CRCP_y4","v":"2015-16"},{"$f":"CRCP_y5","v":"2016-17"},{"$f":"FRCP_y1","v":"2017-18"},{"$f":"FRCP_y2","v":"2018-19"},{"$f":"FRCP_y3","v":"2019-20"},{"$f":"FRCP_y4","v":"2020-21"},{"$f":"FRCP_y5","v":"2021-22"}]
[null,"In-house labour expenditure",40187469.186621331,34043711.405252829,18972166.878505085,20598013.712441932,14595153.416299136,26409624.154482059,39224117.332588099,34544109.918231025,34017704.685596548,32718612.480160102,34550674.823469117,32097973.049024709]
[null,"Labour expenditure outsourced to related parties",0,0,0,0,0,0,0,0,0,0,0,0]
[null,"Labour expenditure outsourced to unrelated parties",241104.69490000003,786699.4157400002,910121.29812000017,938165.93043999979,693442.20558000007,687090.24682528712,692896.14824570483,696953.57011605299,691850.00913462893,691528.50352782838,693060.33029078681,696330.35697935196]
[null,"Controllable non-labour expenditure",308082046.26523978,356660056.07479286,156504826.43995878,138467941.84897017,25295693.120620891,105420236.2846245,145157151.2691367,129637090.23413686,132996800.28746296,132169033.81077236,133433062.94064803,125918762.76607893]
[null,"Uncontrollable non-labour expenditure",0,0,0,0,0,0,0,0,0,0,0,0]
[null,"Total",{"$f":"SUM(C25:C29)","v":348510620.14676112},{"$f":"SUM(D25:D29)","v":391490466.89578569},176387114.61658385,160004121.4918521,40584288.74250003,132516950.68593185,{"$f":"SUM(I25:I29)","v":185074164.7499705},164878153.72248393,167706354.98219413,165579174.7944603,168676798.09440795,158713066.17208299]

{"sheet":"2.12 Input tables","index":12,"n_rows":81,"n_cols":45,"rows_kept":81,"cut":false,"hidden":false,"merged":[[5,38,5,44],[5,17,5,23],[5,24,5,30],[7,1,26,1],[27,1,44,1],[5,3,5,9],[5,10,5,16],[5,31,5,37]]}
[null,{"$f":"(LOOKUP(dms_Model,dms_Model_List,dms_Worksheet_List))","v":"REGULATORY REPORTING STATEMENT"}]
[null,{"$f":"INDEX(dms_TradingNameFull_List,MATCH(dms_TradingName,dms_TradingName_List))","v":"Queensland Electricity Transmission Corporation Limited trading as Powerlink Queensland"}]
[null,{"$f":"CONCATENATE(FRCP_y1,\" to \",FRCP_y5)","v":"2017-18 to 2021-22"}]
[null,"2.12 INPUT TABLES"]
[]
[null,null,null,{"$f":"CONCATENATE(\"DIRECT MATERIAL EXPENDITURE\nForecast \n($0's. real \",dms_DollarReal,\")\")","v":"DIRECT MATERIAL EXPENDITURE\nForecast \n($0's. real June 2017)"},null,null,null,null,null,null,{"$f":"CONCATENATE(\"DIRECT LABOUR EXPENDITURE\nForecast \n($0's. real \",dms_DollarReal,\")\")","v":"DIRECT LABOUR EXPENDITURE\nForecast \n($0's. real June 2017)"},null,null,null,null,null,null,{"$f":"CONCATENATE(\"CONTRACT EXPENDITURE\nForecast \n($0's. real \",dms_DollarReal,\")\")","v":"CONTRACT EXPENDITURE\nForecast \n($0's. real June 2017)"},null,null,null,null,null,null,{"$f":"CONCATENATE(\"OTHER EXPENDITURE\nForecast \n($0's. real \",dms_DollarReal,\")\")","v":"OTHER EXPENDITURE\nForecast \n($0's. real June 2017)"},null,null,null,null,null,null,{"$f":"CONCATENATE(\"RELATED PARTY CONTRACT MARGIN EXPENDITURE\nForecast \n($0's. real \",dms_DollarReal,\")\")","v":"RELATED PARTY CONTRACT MARGIN EXPENDITURE\nForecast \n($0's. real June 2017)"},null,null,null,null,null,null,{"$f":"CONCATENATE(\"RELATED PARTY CONTRACT MARGIN \nForecast \n($0's. real \",dms_DollarReal,\")\")","v":"RELATED PARTY CONTRACT MARGIN \nForecast \n($0's. real June 2017)"}]
[null,null,null,{"$f":"CRCP_y4","v":"2015-16"},{"$f":"CRCP_y5","v":"2016-17"},{"$f":"FRCP_y1","v":"2017-18"},{"$f":"FRCP_y2","v":"2018-19"},{"$f":"FRCP_y3","v":"2019-20"},{"$f":"FRCP_y4","v":"2020-21"},{"$f":"FRCP_y5","v":"2021-22"},{"$f":"CRCP_y4","v":"2015-16"},{"$f":"CRCP_y5","v":"2016-17"},{"$f":"FRCP_y1","v":"2017-18"},{"$f":"FRCP_y2","v":"2018-19"},{"$f":"FRCP_y3","v":"2019-20"},{"$f":"FRCP_y4","v":"2020-21"},{"$f":"FRCP_y5","v":"2021-22"},{"$f":"CRCP_y4","v":"2015-16"},{"$f":"CRCP_y5","v":"2016-17"},{"$f":"FRCP_y1","v":"2017-18"},{"$f":"FRCP_y2","v":"2018-19"},{"$f":"FRCP_y3","v":"2019-20"},{"$f":"FRCP_y4","v":"2020-21"},{"$f":"FRCP_y5","v":"2021-22"},{"$f":"CRCP_y4","v":"2015-16"},{"$f":"CRCP_y5","v":"2016-17"},{"$f":"FRCP_y1","v":"2017-18"},{"$f":"FRCP_y2","v":"2018-19"},{"$f":"FRCP_y3","v":"2019-20"},{"$f":"FRCP_y4","v":"2020-21"},{"$f":"FRCP_y5","v":"2021-22"},{"$f":"CRCP_y4","v":"2015-16"},{"$f":"CRCP_y5","v":"2016-17"},{"$f":"FRCP_y1","v":"2017-18"},{"$f":"FRCP_y2","v":"2018-19"},{"$f":"FRCP_y3","v":"2019-20"},{"$f":"FRCP_y4","v":"2020-21"},{"$f":"FRCP_y5","v":"2021-22"},{"$f":"CRCP_y4","v":"2015-16"},{"$f":"CRCP_y5","v":"2016-17"},{"$f":"FRCP_y1","v":"2017-18"},{"$f":"FRCP_y2","v":"2018-19"},{"$f":"FRCP_y3","v":"2019-20"},{"$f":"FRCP_y4","v":"2020-21"},{"$f":"FRCP_y5","v":"2021-22"}]
[null,"VEGETATION MANAGEMENT","Zone 1 - Urban",1546451.963131018,1515776.7551039979,1314763.7932813209,1308560.5870535474,1300948.5275406889,1293423.9080984879,1287125.7241137915,287563.39020196686,292315.01650165691,243226.04210972632,241263.60450510704,238970.66010508151,238999.33400102743,236417.93744406183,9011.3540348311635,8832.6060580340618,7661.2803345329557,7625.1335360534495,7580.7771869136486,7536.9303611553087,7500.2301163266911,616863.8079760999,604575.66238816467,532331.23499301611,529823.54758710915,526742.52190134721,523698.1373431356,521168.1685591272]
[null,null,"Zone 2 - Rural",3324991.901570023,3259037.8204213823,2806041.0765193007,2790145.6575047728,2770970.9065850037,2751710.2216606075,2734814.0652007204,465945.74823310092,473644.92047466541,391204.60804182105,387679.15730903007,383587.13737011736,383182.88590413169,378560.11888689746,14980.349712468145,14683.201559985544,12642.279403435849,12570.664511516441,12484.274985487231,12397.498294171717,12321.374700473287,1945505.5144964813,1906830.2837863637,1654542.1201562684,1645175.8995747995,1633871.3810641393,1622518.172780249,1612587.7431323749]
[null,null,"Zone 3 - Tropical",2032225.1411577675,1991914.2033148999,1758638.1869145697,1754283.4603196136,1748448.6967983132,1743135.4590321484,1739838.2480759618,0,0,0,0,0,0,0,1863.4281800212816,1826.4654754379244,1612.5654040925638,1608.5723818191034,1603.2222547346814,1598.3503353886861,1595.3269913276374,1109995.0191029022,1087977.3108703103,960562.67996331479,958184.14191058592,954997.21231547347,952095.13845745975,950294.21214069671]
[]
[]
[]
[]
[]
[]
[]
[]
[]
[]
[]
[]
[]
[]
[]
[]
[]
[null,"ROUTINE MAINTENANCE","Transmission Lines Maintenance",12823.624310644062,12880.089648474779,12696.470556630748,12495.313101280788,12298.204966040677,12118.533963962709,11964.020343012544,458562.37042599323,477666.99682573485,451685.15118199226,443032.49969515851,434426.85368637461,430622.14259348583,422597.63630247855,2839331.737054355,2851833.9612198882,2811178.0980744655,2766638.9932719208,2722996.4651954933,2683214.7649467657,2649003.2645827984,616863.8079760999,604575.66238816467,532331.23499301611,529823.54758710915,526742.52190134721,523698.1373431356,521168.1685591272]
[null,null,"Substations Equipment & Property Maintenance",87051.900816571535,87435.210157935682,88082.674183193725,87532.758303430019,87000.162849797314,86580.999098748231,86335.7032182275,1732621.5152783855,1804805.9963355591,1744139.0754508777,1727415.7464152523,1710538.3621900608,1712405.7722543033,1697376.4350126013,3947494.850329929,3964876.5690164235,3994236.765422307,3969300.0313232327,3945148.717098006,3926141.128140267,3915017.8302446483,1945505.5144964813,1906830.2837863637,1654542.1201562684,1645175.8995747995,1633871.3810641393,1622518.172780249,1612587.7431323749]
[null,null,"SCADA & Network Control Maintenance",1833.6552915087984,1841.7292932880139,1825.5511335447013,1801.1274401367953,1777.2286571978254,1755.7969392453388,1737.9789245673269,240440.92214451579,250458.17232689133,238149.60587838473,234172.52951955234,230208.47336275547,228782.93230490616,225111.39941784617,704395.24528374663,707496.85794236802,701282.04818319378,691899.73211295728,682719.05941605871,674486.10511221434,667641.34815178253,1109995.0191029022,1087977.3108703103,960562.67996331479,958184.14191058592,954997.21231547347,952095.13845745975,950294.21214069671]
[null,null,"Protection Systems Maintenance",1902.8170515320542,1911.1955882890634,1882.3566347193525,1851.8221787127768,1821.8971274903301,1794.5636163962672,1770.9604526848077,159920.14142892984,166582.73468304996,157388.57960981308,154314.31929433902,151257.62962256622,149873.08075944555,147020.29401674095,650622.79828015075,653487.63861041237,643626.84791806003,633186.32070344151,622954.16488512547,613608.12425524869,605537.58672782313,624071.54442729568,626734.30496916804,632527.2727434024,622512.96512492129,612694.95459169243,603747.85373005306,596085.91987714532]
[null,null,"Other Maintenance Activity",15482.599130658213,3789.7083477058918,2951.8032333561723,2895.0598288072738,2830.7611485192056,2762.2653661306776,2692.4448955269622,33965.147734604136,8622.1217172929173,6442.3189004933283,6297.2074039783465,6134.5141630250146,6021.6246706338661,5834.4343233446816,1892171.2551776557,463150.73719350668,360748.03603466821,353813.26764712168,345955.14811820973,337584.08913497766,329051.13634168863,822022.53143216914,825320.28484258405,888301.51752904884,882783.70433691167,877419.71053380962,873208.57668207877,870879.11726928828]
[]
[]
[]
[]
[]
[]
[]
[]
[]
[]
[]
[]
[]
[null,"NON-ROUTINE MAINTENANCE","Transmission Lines Maintenance",1425497.1704388198,1899527.840081135,1344926.3474840976,1324900.9305071614,1305238.0664349725,1288172.7105925973,1275625.9339947139,6070150.6988943079,8122288.905293447,5736743.8087731535,5657307.6380474074,5577856.0037541529,5559756.6813786868,5486963.2398177097,12992758.086471178,16763379.996006388,12342472.225645818,12212676.674049616,12085979.943579981,11975647.911298664,11889720.258068426,4983446.6669521509,6428242.050356905,4920012.7041913932,4868364.7475640727,4817883.2606786638,4773953.8939677738,4740166.8116358649]
[null,null,"Substations Equipment & Property Maintenance",2470468.2477275273,2562751.1797202942,2459264.9320870708,2422919.6112640006,2387231.3285442106,2356288.3327329597,2333606.9679705189,5830805.913558173,6073728.9612658378,5814179.9168646112,5734315.5996608622,5654422.6585526979,5636718.1473468207,5563557.9899580134,12348773.737033151,12403148.199662874,12377089.69087602,12248305.881237969,12122612.058709025,12013316.566586519,11928492.822442792,3173663.4046704043,3186554.8144767284,3369438.0693738428,3334472.0024565761,3300277.4086517766,3270576.1154588079,3247956.7035966916]
[null,null,"Scada & Network Control Maintenance",529233.68482337752,549002.90719236073,533527.4019813661,528581.67230907141,523714.67862321751,519829.78154825675,517728.39255989314,4113548.5018078536,4284927.1677704575,4153935.1676411829,4119784.7119908365,4085153.1628842298,4095235.4708589874,4064870.5868010256,3322068.3355684066,3336696.158898267,3371991.5462006624,3355564.9194501736,3339742.4357921402,3328221.1186997476,3323352.2045348757,516526.20915493852,518036.58425421087,658960.21844370593,655816.90650338784,652742.03553594695,650529.07777564437,649923.36085980758]
[null,null,"Protection Systems Maintenance",349229.8741282936,362275.15684086003,342232.93210773886,334798.13314746768,327506.36769658263,320913.27070863865,315476.99947611662,1319954.3734142468,1374946.3151764069,1295696.1565288974,1268889.5968048617,1242257.8047877166,1229373.3264063813,1204455.6980120926,1771633.4268173191,1779434.3322036695,1748046.3375299568,1717663.0279376018,1687871.4687196941,1660504.6152864024,1636603.5310232863,776021.57863671251,779193.42385015299,807696.6644259746,793678.4266431377,779917.99945384497,767284.20683805936,756342.5282595501]
[null,null,"Other Maintenance Activity",17683.373354012027,26871.534858506904,19642.49161384688,19111.114704957476,18525.465219734637,17919.744640485398,17327.728878665472,81078.757270964968,123718.34359761045,90213.676882043423,87866.082405817375,85242.375461605334,83276.480233917609,80252.617876520162,2402343.6893358883,3534625.6961420262,2686799.5303022983,2625720.5540914102,2556797.2545870519,2483086.0579961748,2407270.9279249352,1090638.7079197282,1604660.742648761,1222703.4143712725,1194909.1395692048,1163543.9885618694,1130000.3824820591,1095505.3371558376]
[]
[]
[]
[]
[]
[]
[]
[]
[]
[]
[]
[null,"OVERHEADS","Network Overheads",585219.96539004741,582406.05310428992,572341.83255787787,571314.47785958298,570367.23710385838,570134.34714461083,571029.20510714559,32867340.19129917,33934437.782852069,31849692.838698741,31687070.397111692,31518861.758301139,31692985.406930264,31549250.212253764,4014875.4780581081,3961929.2414237219,3855376.6983913924,3849114.4021743583,3843384.5392498695,3842440.3512550928,3849042.8513561934,10771523.06046487,10635740.541015087,11366884.45325483,11348983.573552895,11332297.438002521,11329441.68548307,11350144.236815911]
[null,null,"Corporate Overheads",216164.73706355525,205695.25524666128,206304.71553338342,207621.68131457022,208905.53137281776,210450.93490039787,212663.04306174861,49006534.433697693,41972027.791184247,34397081.236855611,34307106.293552086,34600177.630021736,34899241.784288675,35317294.443589374,11594249.076283433,10860811.766476663,10340569.025474625,10322701.003706571,10389681.303604532,10458371.149336878,10563542.595218606,37768131.744576097,32767493.234297082,32538594.958520077,32655200.015890948,32259111.962261077,31918446.031784113,31653605.380222064]
[null,"AUGMENTATION","Subtransmission Substations, Switching Stations , Zone Substations",656111.49118399573,7476.0772256672144,86970.567023488125,846296.71098854975,90584.203562287177,0,0,430813.48484647996,5091.012295293981,56813.183099373637,550979.08467292157,58755.891924131138,0,0,675408.88798352482,7695.9618499515436,89528.524877120115,871187.79072350694,93248.444843530917,0,0,50829.082327562865,578.26539487542573,8579.5262832416283,83494.936081516746,8937.2145759264095,0,0]
[null,null,"Subtransmission Lines",0,0,0,0,0,0,0,0,0,0,0,0,0,0,0,0,0,0,0,0,0,0,0,0,0,0,0,0]
[null,null,"HV Feeders",0,0,0,0,0,0,0,0,0,0,0,0,0,0,0,0,0,0,0,0,0,0,0,0,0,0,0,0]
[null,null,"Other Assets",0,0,0,0,0,0,0,0,0,0,0,0,0,0,0,0,0,0,0,0,0,0,0,0,0,0,0,0]
[null,"CONNECTIONS","All New Customer Connections",0,0,0,0,0,0,0,0,0,0,0,0,0,0,0,0,0,0,0,0,0,0,0,0,0,0,0,0]
[null,"REPLACEMENT","Transmission Towers",594071.41308029788,1543309.2607885178,1085296.1322174687,1098330.6220296777,1279790.6698882156,1332671.7809393003,1401776.8169399323,1832792.3901884742,8508613.4837745186,7501871.8052647514,7485703.9657016788,7787799.8928404758,8170551.7737985356,8597477.3168878965,8646900.3675597608,43347751.851059921,37481150.915659294,37609679.39361006,40214357.575088218,41926922.045496225,44318905.963146716,403463.76724788971,1949459.5267847509,1953070.9965916027,1958494.4194201278,2078370.0916015294,2167199.6213964815,2292610.8401079597]
[null,null,"Transmission Tower Support Structures",0,0,0,0,0,0,0,0,0,0,0,0,0,0,0,0,0,0,0,0,0,0,0,0,0,0,0,0]
[null,null,"Conductors",0,0,0,0,0,0,0,0,0,0,0,0,0,0,0,0,0,0,0,0,0,0,0,0,0,0,0,0]
[null,null,"Transmission Cables",0,0,0,0,0,0,0,0,0,0,0,0,0,0,0,0,0,0,0,0,0,0,0,0,0,0,0,0]
[null,null,"Substation Switchbays",7683751.1026360318,9117893.9711669274,8507653.1043507941,8965533.3443801552,7602824.403115632,7171256.186752921,6891849.5795039777,4805693.3675367553,6209046.3906697975,5525791.1950616594,5357131.3571584746,4887487.4465470118,4679134.4858685154,4470022.692026577,7592826.0886843977,9386067.3232600726,8713386.4897681102,8555588.5931791477,7764502.4133936977,7382175.4863632983,7094551.0377246821,580447.83193389466,705257.90444848547,835574.18048981798,828593.81848716573,744966.3345457504,707574.53787978424,680386.44198407314]
[null,null,"Substation Power Transformers",1908111.8467996775,5665318.7325053504,6933885.3599971179,7624597.2648158651,5206776.6829617685,3757012.9732573503,2687801.4126391029,523883.81440036779,1130773.5550820048,1327621.8936626331,1454957.4644398645,989894.3197842252,718511.81288938131,510966.04776935943,949496.25164772908,2171705.514127051,2657989.3879988957,2922762.2848460819,1995931.0618020112,1440188.3064153176,1030323.8748449897,87084.054803906605,219605.57658759982,312067.86082901631,343177.77565468516,234357.607484654,169110.3946504326,121026.6090487217]
[null,null,"Substation Reactive Plant",209444.11646064263,0,0,0,0,0,0,137524.41605644359,0,0,0,0,0,0,215604.23753301441,0,0,0,0,0,0,16225.675638435379,0,0,0,0,0,0]
[null,null,"Scada Network Control and Protection Systems",9687014.8618170284,14766396.295197215,12553246.643090315,12273937.557839423,11384923.246745307,11639227.323108429,12304941.122848224,10640444.422680419,17945054.603646442,14570932.539797233,13500359.469315538,13080517.57932814,13519337.77558312,14209334.508420834,20391982.540128589,23965914.515583057,20853525.425349452,19898705.027388345,19534110.150972348,20134549.221433837,21213979.216606691,2441734.9868482002,3296459.6049669432,3319522.5080895098,3129001.56042636,3066679.4605541546,3157815.804185628,3332871.3739259737]
[null,null,"Other ",7852495.7550377352,4663953.0732278032,4163334.0034866282,4360330.4697316717,4296911.3513376564,4456016.9310474498,3977730.7401097827,5463031.2031306373,2750067.1751612443,3556489.5372761884,3735104.6054510414,3812440.6422385066,5343858.0793411229,2366005.8562639905,8234249.0441997033,3933144.2362841205,4614557.6431587934,4791992.9161487129,4837241.8157894276,6176155.3493096279,3463261.4356601429,3832278.2167077432,1591415.368356195,1367967.192152238,1577910.2005101985,1585573.2491891421,1727963.6669759792,1448412.0745665915]
[null,"NON-NETWORK EXPENDITURE","IT and Communications",0,0,0,0,0,0,0,2215026.2512000743,2421422.3145697122,1810240.0356841821,1704471.9720870007,1802029.1817859788,1823278.2036255086,1743042.052420394,1718812.7812316881,1811763.5361205949,1392021.5867506936,1214416.6125282093,1395103.0565713544,1400012.3750604745,1268301.7105326841,10610506.98314981,11183875.15931097,8330220.1778241359,7591174.7661935808,8350244.5878745159,8390927.2881826982,7854289.4025629964]
[null,null,"Motor Vehicles",3437139.5825768309,2032499.9854835733,1750492.0957625692,1815487.4393209936,2370541.6399264853,1907587.6318284958,1747780.8537863838,146999.96381091495,90150.747529983171,74480.981132175919,76986.419659495354,100150.92283928902,81070.565446340974,73836.198614201523,0,0,0,0,0,0,0,195126.72017309931,115369.13118445598,101790.28716289408,105570.98406010419,137847.93392964877,110927.74428451105,101641.13657557595]
[null,null,"Buildings And Property",168079.48970684339,80151.131192914254,62962.373255353974,123261.94001931978,231273.86665395403,231387.71058393555,58305.518917414098,86261.305288298929,42660.867566181056,32147.527058163465,62723.62057819606,117250.62720124573,118004.95382574684,29557.878717555352,2801324.8284473899,1335852.1865485709,1049372.887589233,2054365.6669886629,3854564.4442325677,3856461.8430655929,971758.64862356836,2523642.0036382405,1203427.5162116743,946395.46991367114,1852766.9726658035,3476309.4238388073,3478021.7470537061,876401.103321829]
[null,null,"Other",1714444.191316634,1535513.7998337201,992693.54954987962,1017752.9447131107,859515.24862283876,1221915.1838803277,1293066.183534805,127153.53534319531,121237.18229292335,87721.220194663838,89286.726532337954,82285.975671099528,96927.173090848155,97730.497903894371,59935.620622812072,57040.36073519972,50903.703288108642,51799.967774513294,51817.550893465785,50417.994448932324,48586.570797192231,168782.7103266927,155151.55194619039,119885.21174349672,122438.31607204422,113258.58430529205,132624.12333806435,134533.45474828096]

{"sheet":"2.14 Forecast price changes","index":13,"n_rows":61,"n_cols":12,"rows_kept":61,"cut":false,"hidden":false,"merged":[[6,1,6,11],[10,1,12,1],[10,2,10,6],[10,7,10,11],[11,2,11,4],[11,5,11,11]]}
[null,{"$f":"(LOOKUP(dms_Model,dms_Model_List,dms_Worksheet_List))","v":"REGULATORY REPORTING STATEMENT"}]
[null,{"$f":"INDEX(dms_TradingNameFull_List,MATCH(dms_TradingName,dms_TradingName_List))","v":"Queensland Electricity Transmission Corporation Limited trading as Powerlink Queensland"}]
[null,{"$f":"CONCATENATE(FRCP_y1,\" to \",FRCP_y5)","v":"2017-18 to 2021-22"}]
[null,"2.14 FORECAST PRICE CHANGES"]
[]
[null,"Instructions"]
[null,"The TNSP must provide all forecast price changes used to forecast opex and capex, including forecast changes in CPI. Forecast price changes must be expressed in real terms, except for CPI. If the same escalators are not used for capex and opex, report capex and opex escalators separately. If price changes for a given year were not used to forecast either opex or capex enter '0' for that year. "]
[]
[null,"2.14.1 - Forecast labour and materials price changes"]
[]
[null,null,"Price changes\n(% YoY real)\nCurrent regulatory period",null,null,null,null,"Price changes\n(%YoY real)\nForthcoming regulatory period "]
[null,null,"Actual",null,null,"Forecast"]
[null,null,{"$f":"CRCP_y1","v":"2012-13"},{"$f":"CRCP_y2","v":"2013-14"},{"$f":"CRCP_y3","v":"2014-15"},{"$f":"CRCP_y4","v":"2015-16"},{"$f":"CRCP_y5","v":"2016-17"},{"$f":"FRCP_y1","v":"2017-18"},{"$f":"FRCP_y2","v":"2018-19"},{"$f":"FRCP_y3","v":"2019-20"},{"$f":"FRCP_y4","v":"2020-21"},{"$f":"FRCP_y5","v":"2021-22"}]
[null,"Materials price changes"]
[null,"Copper",-7.5399999999999995E-2,-2.7000000000000001E-3,-2.1999999999999999E-2,0,0,0,0,0,0,0]
[null,"Aluminium",-0.11509999999999999,-4.3E-3,0.14369999999999999,0,0,0,0,0,0,0]
[null,"Steel",-0.1145,7.3400000000000007E-2,-7.9399999999999998E-2,0,0,0,0,0,0,0]
[null,"Oil",-4.48E-2,0.1968,-0.27260000000000001,0,0,0,0,0,0,0]
[null,"Construction Costs",1.2999999999999999E-2,2.1700000000000001E-2,2.2499999999999999E-2,0,0,0,0,0,0,0]
[]
[]
[]
[]
[]
[]
[]
[]
[]
[]
[]
[]
[]
[]
[]
[]
[]
[]
[]
[]
[]
[]
[]
[]
[]
[null,"Labour and Other price changes"]
[null,"Internal Labour",1.4180999999999999E-2,9.888000000000001E-3,2.0369999999999992E-2,6.4999999999999997E-3,5.4999999999999997E-3,6.3E-3,8.9999999999999993E-3,1.15E-2,1.35E-2,1.4500000000000001E-2]
[null,"External Labour",6.0000000000000001E-3,3.0000000000000001E-3,1E-3,-3.0000000000000001E-3,1E-3,7.4999999999999997E-3,8.0000000000000002E-3,1.15E-2,1.6500000000000001E-2,1.6500000000000001E-2]
[]
[]
[]
[]
[]
[]
[]
[]
[]
[]
[]
[]
[]
[null,"CPI",2.5000000000000001E-2,2.93E-2,1.3299999999999999E-2,2.35E-2,2.4500000000000001E-2,2.4500000000000001E-2,2.4500000000000001E-2,2.4500000000000001E-2,2.4500000000000001E-2,2.4500000000000001E-2]

{"sheet":"2.15 Insurance & Self-insurance","index":14,"n_rows":30,"n_cols":14,"rows_kept":30,"cut":false,"hidden":false,"merged":[[24,2,24,3],[25,2,25,3],[26,2,26,3],[27,2,27,3],[28,2,28,3],[19,2,19,3],[20,2,20,3],[21,2,21,3],[22,2,22,3],[23,2,23,3],[14,2,14,3],[15,2,15,3],[16,2,16,3],[17,2,17,3],[18,2,18,3],[7,1,7,3],[12,7,13,7],[12,8,12,13],[12,2,13,3],[12,1,13,1],[12,4,13,4],[12,5,13,5],[12,6,13,6]]}
[null,{"$f":"(LOOKUP(dms_Model,dms_Model_List,dms_Worksheet_List))","v":"REGULATORY REPORTING STATEMENT"}]
[null,{"$f":"INDEX(dms_TradingNameFull_List,MATCH(dms_TradingName,dms_TradingName_List))","v":"Queensland Electricity Transmission Corporation Limited trading as Powerlink Queensland"}]
[null,{"$f":"CONCATENATE(FRCP_y1,\" to \",FRCP_y5)","v":"2017-18 to 2021-22"}]
[null,"2.15 Commercial insurance and self-insurance"]
[]
[]
[null,"Instruction"]
[null,{"$f":"CONCATENATE(dms_TradingName, \" is required to provide a list of forecast commercial insurance premiums by risk category in table 2.15.4 below.  Previous tables 2.15.1, 2.15.2 & 2.15.3 have been deleted from this template.\")","v":"Powerlink is required to provide a list of forecast commercial insurance premiums by risk category in table 2.15.4 below.  Previous tables 2.15.1, 2.15.2 & 2.15.3 have been deleted from this template."}]
[]
[]
[null,"2.15.4 - Proposed self-insurance allowance by risk category"]
[]
[null,"Risk class\n(drop down)","Risk category",null,"Commercially insured \n(Yes/No)","Commercial insurance deductable \n($0's)","Commercial insurance limit \n($0's)","Self insurance limit\n($0's)","Proposed self insurance allowance ($0's)"]
[null,null,null,null,null,null,null,null,{"$f":"FRCP_y1","v":"2017-18"},{"$f":"FRCP_y2","v":"2018-19"},{"$f":"FRCP_y3","v":"2019-20"},{"$f":"FRCP_y4","v":"2020-21"},{"$f":"FRCP_y5","v":"2021-22"},"Total"]
[null,"Property","Industrial Special Risk",null,"Yes",null,null,null,493745.96521894034,494706.93592950207,495994.69881932042,496666.83998542232,497860.35545002873,{"$f":"+SUM(I15:M15)","v":2478974.7954032137}]
[null,"Property","Towers & Lines",null,"Yes",null,null,null,853503.54323710571,851765.89134820411,844943.55125242064,838278.6623459782,835889.90653756505,{"$f":"+SUM(I16:M16)","v":4224381.5547212744}]
[null,"Liability","Casualty",null,"Yes",null,null,null,0,0,0,0,0,0]
[null,"Other insurance","Vehicles, minor claims, theft, etc.",null,"Yes",null,null,null,138435.40786400766,138271.08523687703,136931.86035190622,135459.91206009762,135198.39936895331,684296.66488184186]
[null,null,null,null,null,null,null,null,null,null,null,null,null,0]
[null,null,null,null,null,null,null,null,null,null,null,null,null,0]
[null,null,null,null,null,null,null,null,null,null,null,null,null,0]
[null,null,null,null,null,null,null,null,null,null,null,null,null,0]
[null,null,null,null,null,null,null,null,null,null,null,null,null,0]
[null,null,null,null,null,null,null,null,null,null,null,null,null,{"$f":"+SUM(I24:M24)","v":0}]
[null,null,null,null,null,null,null,null,null,null,null,null,null,0]
[null,null,null,null,null,null,null,null,null,null,null,null,null,0]
[null,null,null,null,null,null,null,null,null,null,null,null,null,0]
[null,null,null,null,null,null,null,null,null,null,null,null,null,0]
[null,null,null,null,null,null,null,null,null,null,null,null,null,0]
[null,"Total",null,null,null,null,null,null,{"$f":"+SUM(I15:I29)","v":1485684.9163200536},1484743.9125145832,1477870.1104236473,1470405.4143914981,1468948.6613565469,7387653.0150063299]

{"sheet":"2.16 Opex Summary","index":15,"n_rows":20,"n_cols":18,"rows_kept":20,"cut":false,"hidden":false,"merged":[[10,11,10,17],[7,1,7,5],[19,1,19,5],[6,1,6,5],[10,1,11,1],[10,2,10,8],[10,10,11,10]]}
[null,{"$f":"(LOOKUP(dms_Model,dms_Model_List,dms_Worksheet_List))","v":"REGULATORY REPORTING STATEMENT"}]
[null,{"$f":"INDEX(dms_TradingNameFull_List,MATCH(dms_TradingName,dms_TradingName_List))","v":"Queensland Electricity Transmission Corporation Limited trading as Powerlink Queensland"}]
[null,{"$f":"CONCATENATE(FRCP_y1,\" to \",FRCP_y5)","v":"2017-18 to 2021-22"}]
[null,"2.16 Opex Summary"]
[]
[null,"Instructions"]
[null,{"$f":"CONCATENATE(\"Complete the tables below in accordance with the regulatory information notice.\n\",dms_TradingName, \" must input forecast opex by category in Table 2.16.2 and Table 2.16.4 if it did not forecast its total opex using a Base Year approach. Otherwise input '0'.\n\n\",dms_TradingName, \"'s total forecast opex must reconcile to Table 2.16.1 (and if \",dms_TradingName,\" owns any dual function assets Table 2.16.3). If \",dms_TradingName,\" did not forecast its total opex using a Base Year approach, total forecast opex must, in addition, reconcile to Table 2.16.2 (and if \",dms_TradingName,\" owns any dual function assets Table 2.16.4).\n\nIf \",dms_TradingName,\" does not own any dual function assets,Table 2.16.3 and 2.16.4 may be left blank.\")","v":"Complete the tables below in accordance with the regulatory information notice.\nPowerlink must input forecast opex by category in Table 2.16.2 and Table 2.16.4 if it did not forecast its total opex using a Base Year approach. Otherwise input '0'.\n\nPowerlink's total forecast opex must reconcile to Table 2.16.1 (and if Powerlink owns any dual function assets Table 2.16.3). If Powerlink did not forecast its total opex using a Base Year approach, total forecast opex must, in addition, reconcile to Table 2.16.2 (and if Powerlink owns any dual function assets Table 2.16.4).\n\nIf Powerlink does not own any dual function assets,Table 2.16.3 and 2.16.4 may be left blank."}]
[null,"The total step changes in Table 2.16.1 and Table 2.16.3 must reconcile (in each year) to the total step changes for each year in Table 2.17.1 and Table 2.17.3 of worksheet 2.17 Step Changes, respectively.\")"]
[]
[null,"2.16.1 - Prescribed services - opex by driver",null,null,null,null,null,null,null,null,"2.16.2 - Prescribed services - opex by category"]
[null,null,{"$f":"CONCATENATE(\"Forecast ($0's, real \", dms_DollarReal, \")\")","v":"Forecast ($0's, real June 2017)"},null,null,null,null,null,null,null,null,{"$f":"CONCATENATE(\"Forecast ($0's, real \", dms_DollarReal, \")\")","v":"Forecast ($0's, real June 2017)"}]
[null,null,{"$f":"CRCP_y4","v":"2015-16"},{"$f":"CRCP_y5","v":"2016-17"},{"$f":"FRCP_y1","v":"2017-18"},{"$f":"FRCP_y2","v":"2018-19"},{"$f":"FRCP_y3","v":"2019-20"},{"$f":"FRCP_y4","v":"2020-21"},{"$f":"FRCP_y5","v":"2021-22"},null,null,{"$f":"CRCP_y4","v":"2015-16"},{"$f":"CRCP_y5","v":"2016-17"},{"$f":"FRCP_y1","v":"2017-18"},{"$f":"FRCP_y2","v":"2018-19"},{"$f":"FRCP_y3","v":"2019-20"},{"$f":"FRCP_y4","v":"2020-21"},{"$f":"FRCP_y5","v":"2021-22"}]
[null,"Efficent historic opex",null,null,null,null,null,null,null,null,"Vegetation management"]
[null,"Real price changes",null,null,null,null,null,null,null,null,"Maintenance"]
[null,"Output growth",null,null,null,null,null,null,null,null,"Emergency response"]
[null,"Productivity growth",null,null,null,null,null,null,null,null,"Non-network"]
[null,"Step changes",null,null,null,null,null,null,null,null,"Network overheads"]
[null,"Total opex",{"$f":"SUM(C13:C17)","v":0},0,0,0,0,0,0,null,"Corporate overheads"]
[null,null,null,null,null,null,null,null,null,null,"Total opex",{"$f":"SUM(L13:L18)","v":0},0,0,0,0,0,0]
[null,"Note: The amount noted against step changes, include Other operating expenditure category in addition to the specifically identified step changes in the revenue proposal."]

{"sheet":"2.17 Step Changes","index":16,"n_rows":48,"n_cols":15,"rows_kept":48,"cut":false,"hidden":false,"merged":[[6,1,6,5],[9,8,9,14],[26,1,26,2],[27,1,27,2],[9,1,9,2],[47,1,47,2],[30,1,30,2],[9,5,9,7],[30,5,30,7],[30,8,30,14]]}
[null,{"$f":"(LOOKUP(dms_Model,dms_Model_List,dms_Worksheet_List))","v":"REGULATORY REPORTING STATEMENT"}]
[null,{"$f":"INDEX(dms_TradingNameFull_List,MATCH(dms_TradingName,dms_TradingName_List))","v":"Queensland Electricity Transmission Corporation Limited trading as Powerlink Queensland"}]
[null,{"$f":"CONCATENATE(FRCP_y1,\" to \",FRCP_y5)","v":"2017-18 to 2021-22"}]
[null,"2.17 STEP CHANGES"]
[]
[null,"Instructions"]
[null,"Complete the Tables below in accordance with the regulatory information notice.\n\nThe total step changes in Table 2.17.1 must reconcile (in each year) to the total step changes for each year in Table 2.16.1 of worksheet 2.16 Opex Summary."]
[]
[null,"2.17.1  Forecast opex step changes"]
[null,null,null,null,null,"Actual \n($0's, nominal)",null,null,{"$f":"CONCATENATE(\"Forecast ($0's, real \", dms_DollarReal, \")\")","v":"Forecast ($0's, real June 2017)"}]
[null,"Step change","Description",{"$f":"CRCP_y1","v":"2012-13"},{"$f":"CRCP_y2","v":"2013-14"},{"$f":"CRCP_y1","v":"2012-13"},{"$f":"CRCP_y2","v":"2013-14"},{"$f":"CRCP_y3","v":"2014-15"},{"$f":"CRCP_y4","v":"2015-16"},{"$f":"CRCP_y5","v":"2016-17"},{"$f":"FRCP_y1","v":"2017-18"},{"$f":"FRCP_y2","v":"2018-19"},{"$f":"FRCP_y3","v":"2019-20"},{"$f":"FRCP_y4","v":"2020-21"},{"$f":"FRCP_y5","v":"2021-22"}]
[]
[]
[]
[]
[]
[]
[]
[]
[]
[]
[]
[]
[]
[]
[]
[null,null,null,{"$f":"SUM(D19:D26)","v":0},0,0,{"$f":"SUM(G19:G26)","v":0},0,0,{"$f":"SUM(J19:J26)","v":0},0,0,0,0,0]
[null,"Check",null,null,null,null,null,null,null,null,{"$f":"IF(K$49-'2.16 Opex Summary'!C$17=0,\"OK\",\"Error\")","v":"OK"},{"$f":"IF(L$49-'2.16 Opex Summary'!F$17=0,\"OK\",\"Error\")","v":"OK"},{"$f":"IF(M$49-'2.16 Opex Summary'!G$17=0,\"OK\",\"Error\")","v":"OK"},{"$f":"IF(N$49-'2.16 Opex Summary'!H$17=0,\"OK\",\"Error\")","v":"OK"},{"$f":"IF(O$49-'2.16 Opex Summary'!I$17=0,\"OK\",\"Error\")","v":"OK"}]
[]
[null,"2.17.2  Forecast capex step changes"]
[null,null,null,null,null,"Actual \n($0's, nominal)",null,null,{"$f":"CONCATENATE(\"Forecast ($0's, real \", dms_DollarReal, \")\")","v":"Forecast ($0's, real June 2017)"}]
[null,"Step change","Description",{"$f":"CRCP_y1","v":"2012-13"},{"$f":"CRCP_y2","v":"2013-14"},{"$f":"CRCP_y1","v":"2012-13"},{"$f":"CRCP_y2","v":"2013-14"},{"$f":"CRCP_y3","v":"2014-15"},{"$f":"CRCP_y4","v":"2015-16"},{"$f":"CRCP_y5","v":"2016-17"},{"$f":"FRCP_y1","v":"2017-18"},{"$f":"FRCP_y2","v":"2018-19"},{"$f":"FRCP_y3","v":"2019-20"},{"$f":"FRCP_y4","v":"2020-21"},{"$f":"FRCP_y5","v":"2021-22"}]
[]
[]
[]
[]
[]
[]
[]
[]
[]
[]
[]
[]
[]
[]
[]
[null,null,null,{"$f":"SUM(D33:D47)","v":0},{"$f":"SUM(E33:E47)","v":0},0,{"$f":"SUM(G33:G47)","v":0},0,0,0,0,0,0,0,0]

{"sheet":"3.1 Revenue","index":17,"n_rows":35,"n_cols":9,"rows_kept":35,"cut":false,"hidden":false,"merged":[[5,2,5,8]]}
[null,{"$f":"(LOOKUP(dms_Model,dms_Model_List,dms_Worksheet_List))","v":"REGULATORY REPORTING STATEMENT"}]
[null,{"$f":"INDEX(dms_TradingNameFull_List,MATCH(dms_TradingName,dms_TradingName_List))","v":"Queensland Electricity Transmission Corporation Limited trading as Powerlink Queensland"}]
[null,{"$f":"CONCATENATE(FRCP_y1,\" to \",FRCP_y5)","v":"2017-18 to 2021-22"}]
[null,"3.1 REVENUE"]
[]
[null,null,{"$f":"CONCATENATE(\"Forecast ($0's, real \",dms_DollarReal,\")\")","v":"Forecast ($0's, real June 2017)"}]
[null,null,{"$f":"CRCP_y4","v":"2015-16"},{"$f":"CRCP_y5","v":"2016-17"},{"$f":"FRCP_y1","v":"2017-18"},{"$f":"FRCP_y2","v":"2018-19"},{"$f":"FRCP_y3","v":"2019-20"},{"$f":"FRCP_y4","v":"2020-21"},{"$f":"FRCP_y5","v":"2021-22"}]
[null,"3.1.1 - Revenue Grouping by chargeable quantity"]
["TREV0101","From Fixed Customer (Exit Point) Charges",114066005.7540579,119641502.00058159,85059814.658350959,83550463.34493579,82036096.318787888,81902380.925225198,81768866.104752839]
["TREV0102","From Variable Customer (Exit Point) Charges",0,0,0,0,0,0,0]
["TREV0103","From Fixed Generator (Entry Point) Charges",9864421.1700872555,10346589.742961947,7355967.5460950024,7225438.9372362494,7094476.5698485058,7082912.8708278676,7071366.5173557587]
["TREV0104","From Variable Generator (Entry Point) Charges",0,0,0,0,0,0,0]
["TREV0105","From Fixed Energy Usage Charges (Charge per day basis)",202386594.47381821,212279162.29344085,150921092.58560053,148243060.07129189,145556128.20952103,145318877.83020794,145081983.32646385]
["TREV0106","From Variable Energy Usage charges (Charge per kWh basis)",102081665.34778206,107071372.30054961,76123008.578208685,74772237.201147467,73416977.087014392,73297310.496014938,73177823.404901952]
["TREV0107","From Energy based Common Service and General Charges",452193186.7380318,474296191.03536415,337203607.67815995,331220068.79811841,325216646.07004189,324686556.58780462,324157262.23979068]
["TREV0108","From Fixed Demand based Usage Charges",64183698.434710406,67320969.415183961,47862230.792189702,47012935.255874082,46160817.432661101,46085577.237830311,46010449.903291762]
["TREV0109","From Variable Demand based Usage Charges",10783105.273739927,11310178.721978625,8041036.6783898296,7898351.8004542794,7755192.767593585,7742552.1289039589,7729930.4511723649]
["TREV0110","Revenue from other Sources",60501251.313587941,60501251.313587941,60501251.313587941,60501251.313587941,60501251.313587941,60501251.313587941,60501251.313587941]
["TREV01","Total revenue by chargeable quantity"]
[]
[]
[null,"3.1.2 - Revenue Grouping by type of connected equipment"]
["TREV0201","From Other connected transmission networks",4390210.5345830405,4604802.0966808116,3273810.5618245392,3215718.1442568591,3157432.6802619635,3152286.197525288,3147147.4345127163]
["TREV0202","From Distribution networks",802735995.6394093,841973378.42536497,598605820.87793422,587983807.58541667,577326496.36931765,576385478.41331697,575445871.98425007]
["TREV0203","From Directly connected end–users",138568049.84814784,145341195.24505299,103331159.53114089,101497590.74214838,99657928.836040229,99495490.595144793,99333296.011610672]
["TREV0204","From Generators",9864421.1700872593,10346589.742961951,7355967.5460950052,7225438.9372362513,7094476.5698485076,7082912.8708278704,7071366.5173557615]
["TREV0205","Other revenue",60501251.313587941,60501251.313587941,60501251.313587941,60501251.313587941,60501251.313587941,60501251.313587941,60501251.313587941]
["TREV02","Total revenue by type of connected equipment"]
[]
[]
["TREV0301","3.1.3 - Revenue (penalties) allowed (deducted) through incentive schemes"]
["TREV0302","EBSS",2346864.0510204178,0,-805349.48752631317,-6754446.3322844245,-2972861.0129698645,2767485.3036077693,0]
["TREV0303","STPIS",4426710.3004568769,21209567.488201726,24045040.455081064,12524371.801207803,960000,960000,960000]
["TREV03","Other"]
[null,"Total revenue of incentive schemes"]

{"sheet":"3.2 Operating expenditure","index":18,"n_rows":45,"n_cols":9,"rows_kept":45,"cut":false,"hidden":false,"merged":[[8,2,8,8]]}
[null,{"$f":"(LOOKUP(dms_Model,dms_Model_List,dms_Worksheet_List))","v":"REGULATORY REPORTING STATEMENT"}]
[null,{"$f":"INDEX(dms_TradingNameFull_List,MATCH(dms_TradingName,dms_TradingName_List))","v":"Queensland Electricity Transmission Corporation Limited trading as Powerlink Queensland"}]
[null,{"$f":"CONCATENATE(FRCP_y1,\" to \",FRCP_y5)","v":"2017-18 to 2021-22"}]
[null,"3.2 OPERATING EXPENDITURE"]
[]
[]
[null,"3.2.1 - Opex categories"]
[null,"3.2.1.1 - Current opex categories  and cost allocations"]
[null,null,{"$f":"CONCATENATE(\"Forecast ($0's, real \",dms_DollarReal,\")\")","v":"Forecast ($0's, real June 2017)"}]
[null,null,{"$f":"CRCP_y4","v":"2015-16"},{"$f":"CRCP_y5","v":"2016-17"},{"$f":"FRCP_y1","v":"2017-18"},{"$f":"FRCP_y2","v":"2018-19"},{"$f":"FRCP_y3","v":"2019-20"},{"$f":"FRCP_y4","v":"2020-21"},{"$f":"FRCP_y5","v":"2021-22"}]
[null,"Field Maintenance - Routine",24933476.784384225,24092735.875052474,22964090.878528535,22670782.66383848,22351487.070672419,22037962.824100863,21773272.056069076]
[null,"Field Maintenance - Condition-based",27579755.356375448,34890362.665854201,23439193.060432464,22935508.2570213,22436415.740015227,21972572.810738146,21581676.90761894]
[null,"Field Maintenance -  Corrective",16282003.333551897,16282984.582305526,16322159.4992745,16426250.255699813,16527808.012297489,16650034.454722658,16825046.431570996]
[null,"Refurbishment",34845328.466406241,35905014.332137801,35941007.2368083,35655830.493157655,35371557.289389238,35137181.477117561,35016789.889822908]
[null,"Maintenance Support",15246929.453755058,14698657.794016493,14084199.349051874,14069793.52912163,14054515.22820537,14057960.273669276,14106497.789946571]
[null,"Network Operations",15188074.294583838,15190473.419741198,14915123.84568812,14888177.800713448,14860455.097585082,14852660.028264739,14892566.650809871]
[null,"Asset Management Support",26930700.012697008,26704675.369274728,26412334.180489253,26370431.011563908,26327079.247419856,26318966.614454314,26395351.573540796]
[null,"Corporate Support",45569513.141969815,34607690.948501542,25923602.336383704,25980347.394464202,26034437.477260187,26122280.200310055,26293484.76209173]
[null,"Network Support",3669183.7956098723,1821916.5732821024,0,0,0,0,0]
[null,"Self Insurance",1703993.8305035678,1786490.4176905057,1485685,1484744,1477870,1470405,1468949]
[null,"Insurance Premiums",7207600.5756249633,7484028.4126932574,7606997,7786258,7942617,8094780.9999999991,8286455.9999999991]
[null,"AEMC Levy",4249619.6502826205,4251138.6709915726,4200000,4200000,4200000,4200000,4200000]
[null,"Debt Management Costs",1036492.5976299075,1012175.8740456124,3600106.9590761242,3568597.6832324946,3529296.3662527935,3482200.7940461901,3432424.2780091567]
[]
[]
[]
[]
[]
[]
[]
[]
[]
[]
[]
[]
[]
[]
[]
[]
[]
[]
[]
[]
[]
[null,"Total opex ",{"$f":"SUM(C11:C44)","v":224442671.29337445},{"$f":"SUM(D11:D44)","v":218728344.93558705},196894499.34573287,196036721.08881292,195113538.52909762,194397005.47742382,194272515.33948004]

{"sheet":"3.3 Assets (RAB)","index":19,"n_rows":93,"n_cols":9,"rows_kept":93,"cut":false,"hidden":false,"merged":[[5,2,5,8]]}
[null,{"$f":"(LOOKUP(dms_Model,dms_Model_List,dms_Worksheet_List))","v":"REGULATORY REPORTING STATEMENT"}]
[null,{"$f":"INDEX(dms_TradingNameFull_List,MATCH(dms_TradingName,dms_TradingName_List))","v":"Queensland Electricity Transmission Corporation Limited trading as Powerlink Queensland"}]
[null,{"$f":"CONCATENATE(FRCP_y1,\" to \",FRCP_y5)","v":"2017-18 to 2021-22"}]
[null,"3.3 ASSETS"]
[]
[null,null,{"$f":"CONCATENATE(\"Forecast ($0's, real \",dms_DollarReal,\")\")","v":"Forecast ($0's, real June 2017)"}]
[null,null,{"$f":"CRCP_y4","v":"2015-16"},{"$f":"CRCP_y5","v":"2016-17"},{"$f":"FRCP_y1","v":"2017-18"},{"$f":"FRCP_y2","v":"2018-19"},{"$f":"FRCP_y3","v":"2019-20"},{"$f":"FRCP_y4","v":"2020-21"},{"$f":"FRCP_y5","v":"2021-22"}]
[]
[null,"3.3.1 - REGULATORY ASSET BASE VALUES"]
[null,"For total asset base:"]
["TRAB0101","Opening value"]
["TRAB0102","Inflation addition"]
["TRAB0103","Straight line depreciation"]
["TRAB0104","Regulatory depreciation"]
["TRAB0105","Actual additions (recognised in RAB)"]
["TRAB0106","Disposals "]
["TRAB0107","Closing value "]
[]
[]
[null,"3.3.2 - ASSET VALUE ROLL FORWARD"]
[null,"For overhead transmission assets:"]
["TRAB0201","Opening value"]
["TRAB0202","Inflation addition"]
["TRAB0203","Straight line depreciation"]
["TRAB0204","Regulatory depreciation"]
["TRAB0205","Actual additions (recognised in RAB)"]
["TRAB0206","Disposals "]
["TRAB0207","Closing value "]
[null,"For underground transmission assets:"]
["TRAB0301","Opening value"]
["TRAB0302","Inflation addition"]
["TRAB0303","Straight line depreciation"]
["TRAB0304","Regulatory depreciation"]
["TRAB0305","Actual additions (recognised in RAB)"]
["TRAB0306","Disposals "]
["TRAB0307","Closing value "]
[null,"For transmission switchyards, substations"]
["TRAB0401","Opening value"]
["TRAB0402","Inflation addition"]
["TRAB0403","Straight line depreciation"]
["TRAB0404","Regulatory depreciation"]
["TRAB0405","Actual additions (recognised in RAB)"]
["TRAB0406","Disposals "]
["TRAB0407","Closing value "]
[null,"For easements:"]
["TRAB0501","Opening value"]
["TRAB0502","Inflation addition"]
["TRAB0503","Straight line depreciation"]
["TRAB0504","Regulatory depreciation"]
["TRAB0505","Actual additions (recognised in RAB)"]
["TRAB0506","Disposals "]
["TRAB0507","Closing value "]
[null,"For “other” assets with long lives:"]
["TRAB0601","Opening value"]
["TRAB0602","Inflation addition"]
["TRAB0603","Straight line depreciation"]
["TRAB0604","Regulatory depreciation"]
["TRAB0605","Actual additions (recognised in RAB)"]
["TRAB0606","Disposals "]
["TRAB0607","Closing value "]
[null,"For “other” assets with short lives:"]
["TRAB0701","Opening value"]
["TRAB0702","Inflation addition"]
["TRAB0703","Straight line depreciation"]
["TRAB0704","Regulatory depreciation"]
["TRAB0705","Actual additions (recognised in RAB)"]
["TRAB0706","Disposals "]
["TRAB0707","Closing value "]
[]
[]
[null,"3.3.3 - TOTAL DISAGGREGATED RAB ASSET VALUES"]
["TRAB0801","Overhead transmission assets (wires and towers/poles etc)"]
["TRAB0802","Underground transmission assets (cables, ducts etc)"]
["TRAB0803","Substations, switchyards, Transformers etc with transmission function"]
["TRAB0804","Easements"]
["TRAB0805","Other assets with long lives (please specify)"]
["TRAB0806","Other assets with short lives (please specify)"]
[]
[]
[null,"3.3.4 - ASSET LIVES"]
[null,"3.3.4.1 Asset Lives – estimated service life of new assets"]
["TRAB0901","Overhead transmission assets "]
["TRAB0902","Underground transmission assets"]
["TRAB0903","Switchyard, substation and transformer assets"]
["TRAB0904","“Other” assets with long lives"]
["TRAB0905","“Other assets with short lives"]
[]
[null,"3.3.4.2 Asset Lives – estimated residual service life"]
["TRAB1001","Overhead transmission assets "]
["TRAB1002","Underground transmission assets"]
["TRAB1003","Switchyard, substation and transformer assets"]
["TRAB1004","Other assets with long lives"]
["TRAB1005","Other assets with short lives"]

{"sheet":"Unprotected 3.3 Assets (RAB)","index":20,"n_rows":100,"n_cols":8,"rows_kept":100,"cut":false,"hidden":false,"merged":[[5,1,5,7]]}
["REGULATORY REPORTING STATEMENT"]
["Queensland Electricity Transmission Corporation Limited trading as Powerlink Queensland"]
["2017-18 to 2021-22"]
["3.3 ASSETS"]
[]
[null,"Forecast ($0's, real June 2017)"]
[null,"2015-16","2016-17","2017-18","2018-19","2019-20","2020-21","2021-22"]
[]
["3.3.1 - REGULATORY ASSET BASE VALUES"]
["For total asset base:"]
["Opening value",7151348018.370409,7217879354.9406128,7237850742.010705,7174502620.4149494,7095488955.7229528,7000805296.6061382,6900731722.2693243]
["Inflation addition",172202056.48322466,176827546.42614657,0,0,0,0,0]
["Straight line depreciation",-277293166.69839621,-279463772.12932098,-265175833.85411137,-276787449.23390567,-289594462.83717483,-295669530.02469599,-296287993.23706502]
["Regulatory depreciation",-105091110.21517155,-102636225.7031744,-265175833.85411137,-276787449.23390567,-289594462.83717483,-295669530.02469599,-296287993.23706502]
["Actual additions (recognised in RAB)",173224749.7865836,221146511.90873501,202216255.41708046,198288604.22721726,195454764.14257532,196305046.95255238,185118062.29292592]
["RFM True Up",0,-97988812.488477841,0,0,0,0,0]
["Disposals ",-1602303.001209165,-550086.64698922925,-388543.15872421698,-514819.68530958734,-543960.42221390351,-709091.26467169542,-505106.10634148156]
["Closing value ",7217879354.9406118,7237850742.010705,7174502620.4149494,7095488955.7229528,7000805296.6061382,6900731722.2693243,6789056685.2188435]
[]
[]
["3.3.2 - ASSET VALUE ROLL FORWARD"]
["For overhead transmission assets:"]
["Opening value",3555805702.4213877,3546668621.1427689,3565649874.8771858,3508023810.2586584,3450436531.5908265,3392981038.9316058,3337838425.3065434]
["Inflation addition",85603428.465525553,86893381.217997849,0,0,0,0,0]
["Straight line depreciation",-114702186.25692587,-115084730.9845611,-110795385.43626748,-110939585.9711583,-114322137.05983384,-114422620.83046828,-114783403.5906391]
["Regulatory depreciation",-29098757.791400317,-28191349.766563263,-110795385.43626748,-110939585.9711583,-114322137.05983384,-114422620.83046828,-114783403.5906391]
["Actual additions (recognised in RAB)",19961676.512781858,61618153.525838621,53169320.81774009,53352307.303326033,56866644.400613144,59280007.205405556,62735477.14083048]
["RFM True Up",0,-14445550.024858663,0,0,0,0,0]
["Disposals ",0,0,0,0,0,0,0]
["Closing value ",3546668621.1427689,3565649874.8771858,3508023810.2586584,3450436531.5908265,3392981038.9316058,3337838425.3065434,3285790498.8567348]
["For underground transmission assets:"]
["Opening value",55813270.176305287,54897688.493863337,53985892.300658025,51588167.104667284,49261468.109005861,46826298.25466691,44379994.709250912]
["Inflation addition",1332816.2515190742,1334407.111244774,0,0,0,0,0]
["Straight line depreciation",-2248397.9339610259,-2246203.3044500835,-2442566.9473509304,-2442566.9473509304,-2442566.9473509304,-2446303.5454159938,-2446303.5454159938]
["Regulatory depreciation",-915581.68244195182,-911796.19320530933,-2442566.9473509304,-2442566.9473509304,-2442566.9473509304,-2446303.5454159938,-2446303.5454159938]
["Actual additions (recognised in RAB)",0,0,44841.75136019411,115867.95168951072,7397.0930119792029,0,0]
["RFM True Up",0,0,0,0,0,0,0]
["Disposals ",0,0,0,0,0,0,0]
["Closing value ",54897688.493863337,53985892.300658025,51588167.104667284,49261468.109005861,46826298.25466691,44379994.709250912,41933691.163834922]
["For transmission switchyards, substations"]
["Opening value",2594890301.7413664,2630733578.2452936,2652249559.5659752,2629129864.3380375,2599050558.8683453,2552448285.8201604,2499553929.8112297]
["Inflation addition",62494566.948596843,64452972.667009689,0,0,0,0,0]
["Straight line depreciation",-121773057.43475308,-124363657.19730365,-125162123.62064505,-132195150.41508439,-136979375.20245481,-140363531.31798181,-144650336.44084054]
["Regulatory depreciation",-59278490.486156233,-59910684.530293964,-125162123.62064505,-132195150.41508439,-136979375.20245481,-140363531.31798181,-144650336.44084054]
["Actual additions (recognised in RAB)",95121766.990083441,108175840.79131725,102042428.39270748,102115844.94539247,90377102.154269978,87469175.309050798,87106582.971668288]
["RFM True Up",0,-26749174.940341868,0,0,0,0,0]
["Disposals ",0,0,0,0,0,0,0]
["Closing value ",2630733578.2452936,2652249559.5659752,2629129864.3380375,2599050558.8683453,2552448285.8201604,2499553929.8112297,2442010176.3420577]
["For easements:"]
["Opening value",629830371.2918216,657281538.72650719,667161227.6961807,669841782.27904451,671399287.26395428,674608114.12377989,674953828.04001319]
["Inflation addition",15179443.571279597,16103397.698799426,0,0,0,0,0]
["Straight line depreciation",0,0,0,0,0,0,0]
["Regulatory depreciation",15179443.571279597,16103397.698799426,0,0,0,0,0]
["Actual additions (recognised in RAB)",12271723.863405908,5566250.7879466768,2680554.5828638575,1557504.9849097345,3208826.8598255725,345713.91623331275,0]
["RFM True Up",0,-11789959.51707259,0,0,0,0,0]
["Disposals ",0,0,0,0,0,0,0]
["Closing value ",657281538.72650719,667161227.6961807,669841782.27904451,671399287.26395428,674608114.12377989,674953828.04001319,674953828.04001319]
["For “other” assets with long lives:"]
["Opening value",257856172.79633272,270651782.10476959,237128805.18228927,251969397.61182868,263120710.46604341,274664834.67550248,288964621.55547267]
["Inflation addition",6215534.7789480779,6631057.148523327,0,0,0,0,0]
["Straight line depreciation",-14948853.500193931,-16301282.714317773,-12995588.447071543,-14413405.550696695,-16240728.261233045,-17593582.145010483,-18904906.337338183]
["Regulatory depreciation",-8733318.7212458532,-9670225.5657944437,-12995588.447071543,-14413405.550696695,-16240728.261233045,-17593582.145010483,-18904906.337338183]
["Actual additions (recognised in RAB)",21528928.029682774,23775191.569669202,27836180.876610953,25564718.404911447,27784852.470692154,31893369.024980634,19049938.036893521]
["RFM True Up",0,-47627942.926355079,0,0,0,0,0]
["Disposals ",0,0,0,0,0,0,0]
["Closing value ",270651782.10476959,237128805.18228927,251969397.61182868,263120710.46604341,274664834.67550248,288964621.55547267,289109653.25502801]
["For “other” assets with short lives:"]
["Opening value",57152199.943195194,57646146.227408879,61675382.388416387,63949598.822713636,62220399.424776711,59276724.800423101,55040922.846814096]
["Inflation addition",1376266.4673555181,1412330.5825715174,0,0,0,0,0]
["Straight line depreciation",-23620671.572562296,-21467897.928688385,-13780169.402776409,-16796740.349615391,-19609655.366302192,-20843492.185819373,-15503043.322831221]
["Regulatory depreciation",-22244405.10520678,-20055567.346116867,-13780169.402776409,-16796740.349615391,-19609655.366302192,-20843492.185819373,-15503043.322831221]
["Actual additions (recognised in RAB)",24340654.390629631,22011075.23396327,16442928.995797882,15582360.636988051,17209941.164162491,17316781.496882066,16226064.143533634]
["RFM True Up",0,2623814.9201503382,0,0,0,0,0]
["Disposals ",-1602303.001209165,-550086.64698922925,-388543.15872421698,-514819.68530958734,-543960.42221390351,-709091.26467169542,-505106.10634148156]
["Closing value ",57646146.227408879,61675382.388416387,63949598.822713636,62220399.424776711,59276724.800423101,55040922.846814096,55258837.561175033]
[]
[]
["3.3.3 - TOTAL DISAGGREGATED RAB ASSET VALUES"]
["Overhead transmission assets (wires and towers/poles etc)",3551237161.7820783,3556159248.0099773,3536836842.5679221,3479230170.9247427,3421708785.2612162,3365409732.1190748,3311814462.0816393]
["Underground transmission assets (cables, ducts etc)",55355479.335084312,54441790.397260681,52787029.702662654,50424817.606836572,48043883.181836382,45603146.481958911,43156842.936542913]
["Substations, switchyards, Transformers etc with transmission function",2612811939.99333,2641491568.9056344,2640689711.9520063,2614090211.6031914,2575749422.3442526,2526001107.8156948,2470782053.0766439]
["Easements",643555955.00916433,662221383.211344,668501504.98761261,670620534.7714994,673003700.69386709,674780971.08189654,674953828.04001319]
["Other assets with long lives (please specify)",264253977.45055115,253890293.64352942,244549101.39705896,257545054.03893605,268892772.57077295,281814728.11548758,289037137.40525031]
["Other assets with short lives (please specify)",57399173.08530204,59660764.307912633,62812490.605565012,63084999.123745173,60748562.112599909,57158823.823618598,55149880.203994565]
[]
[]
["3.3.4 - ASSET LIVES"]
["3.3.4.1 Asset Lives – estimated service life of new assets"]
["Overhead transmission assets ",49.753270530440624,49.669832826861338,49.609393780793468,49.004896879095433,48.959069074743205,48.915365418946728,48.38238378231739]
["Underground transmission assets",45,45,45,45,45,45,45]
["Switchyard, substation and transformer assets",34.818018644361061,34.456224288359898,34.011247769322601,34.019129718928063,34.082897328485949,34.164956265952441,34.258929597032498]
["“Other” assets with long lives",25.838019090695351,25.386242709209078,24.951334221979639,24.679297774203331,24.290475626912379,24.643099243614166,25.03471725168454]
["“Other assets with short lives",5.676284719704876,5.6995519288785355,5.6580376060111934,5.5978046621946351,5.6064372149609767,5.6002974673357517,5.6024111626941107]
[]
["3.3.4.2 Asset Lives – estimated residual service life"]
["Overhead transmission assets ",27.67259181532004,28.07715313627455,28.487655472682885,28.918473818307994,29.339063275882985,29.74224282918048,30.110831648051384]
["Underground transmission assets",18.722222222222221,19.722222222222221,20.722222222222221,21.722222222222221,22.722222222222221,23.722222222222221,24.722222222222221]
["Switchyard, substation and transformer assets",13.717975206611571,13.694770082652381,13.84454944005426,14.103462241649618,14.422741655953811,14.799278438794547,15.197686081788451]
["Other assets with long lives",19.370705149212863,18.607447185606912,17.927064753489113,17.447921825025865,17.490599208375667,17.622139437355724,16.913609453813883]
["Other assets with short lives",3.6691316141771289,3.9843108648110204,4.2108391057978203,4.1188300246275737,4.0783596660572341,4.115768688478278,4.1320796373352922]

{"sheet":"3.4 Operational data","index":21,"n_rows":87,"n_cols":10,"rows_kept":87,"cut":false,"hidden":false,"merged":[[5,3,5,9]]}
[null,{"$f":"(LOOKUP(dms_Model,dms_Model_List,dms_Worksheet_List))","v":"REGULATORY REPORTING STATEMENT"}]
[null,{"$f":"INDEX(dms_TradingNameFull_List,MATCH(dms_TradingName,dms_TradingName_List))","v":"Queensland Electricity Transmission Corporation Limited trading as Powerlink Queensland"}]
[null,{"$f":"CONCATENATE(FRCP_y1,\" to \",FRCP_y5)","v":"2017-18 to 2021-22"}]
[null,"3.4 OPERATIONAL DATA"]
[]
[null,null,null,"Forecast (0's)"]
[null,null,"Units",{"$f":"CRCP_y4","v":"2015-16"},{"$f":"CRCP_y5","v":"2016-17"},{"$f":"FRCP_y1","v":"2017-18"},{"$f":"FRCP_y2","v":"2018-19"},{"$f":"FRCP_y3","v":"2019-20"},{"$f":"FRCP_y4","v":"2020-21"},{"$f":"FRCP_y5","v":"2021-22"}]
[]
[null,"3.4.1 - ENERGY DELIVERY"]
[null,"Energy grouping by downstream connection type"]
["TOPED0101","To Other connected transmission networks","GWh",3267,2641,2468,2362,2444,2459,2718]
["TOPED0102","To Distribution networks","GWh",33638,34180,34345,34529,34464,34322,34365]
["TOPED0103","To Directly connected end–users (330 kV)","GWh",0,0,0,0,0,0,0]
["TOPED0104","To Directly connected end–users (275 kV)","GWh",7967,9045,10035,9865,10020,10065,10294]
["TOPED0105","To Directly connected end–users (220 kV)","GWh",0,0,0,0,0,0,0]
["TOPED0106","To Directly connected end–users (132 kV)","GWh",8866,9278,9735,9838,9778,9603,9471]
["TOPED0107","To Directly connected end–users (110 kV)","GWh"]
["TOPED0108","To Directly connected end–users (44 kV) ","GWh"]
["TOPED0109","To Directly connected end–users (33 kV)","GWh"]
["TOPED0110","To Directly connected end–users (22 kV)","GWh"]
["TOPED0111","To Directly connected end–users (11 kV)","GWh"]
["TOPED0112","To Directly connected end–users (6.6 kV)","GWh"]
["TOPED0113","Pumping and Power Station Auxillaries","GWh",186,186,186,186,186,186,186]
["TOPED01","Total energy transported","GWh",{"$f":"SUM(D11:D23)","v":53924},{"$f":"SUM(E11:E23)","v":55330},{"$f":"SUM(F11:F23)","v":56769},56780,56892,56635,57034]
[]
[]
[null,"3.4.2 -  CONNECTION POINTS"]
[null,"Number of entry points at each transmission voltage level"]
["TOPCP0101","500kV","number",0,0,0,0,0,0,0]
["TOPCP0102","330kV","number",1,1,1,1,1,1,1]
["TOPCP0103","275kV","number",12,12,12,12,12,12,12]
["TOPCP0104","220kV","number",0,0,0,0,0,0,0]
["TOPCP0105","132 kV","number",10,10,10,10,10,10,10]
["TOPCP0106","110kV","number",1,1,1,1,1,1,1]
["TOPCP0107","66 kV","number",0,0,0,0,0,0,0]
["TOPCP0108","33 kV","number",0,0,0,0,0,0,0]
["TOPCP0109","22 kV","number",0,0,0,0,0,0,0]
["TOPCP0110","11 kV","number",0,0,0,0,0,0,0]
["TOPCP0111","6.6 kV","number",0,0,0,0,0,0,0]
[]
[null,"Number of exit points at each transmission voltage level "]
["TOPCP0201","500kV","number"]
["TOPCP0202","330kV","number",1,1,1,1,1,1,1]
["TOPCP0203","275kV","number",4.5,5,5,5,5,5,5]
["TOPCP0204","220kV","number"]
["TOPCP0205","132 kV","number",50,50,50,50,50,50,50]
["TOPCP0206","110kV","number",17,17,17,17,17,17,17]
["TOPCP0207","66 kV","number",23,23,23,23,23,23,23]
["TOPCP0208","44 kV","number"]
["TOPCP0209","33kV","number",14,14,14,14,14,14,14]
["TOPCP0210","22kV","number",7,7,7,7,7,7,7]
["TOPCP0211","11kV","number",4,4,4,4,4,4,4]
["TOPCP0212","6.6kV","number"]
[]
[]
[null,"3.4.3 - SYSTEM DEMAND"]
[null,"3.4.3.1 Annual system maximum demand characteristics – MW measure"]
["TOPSD0101","Transmission System coincident maximum demand","MW"]
["TOPSD0102","Transmission System coincident weather adjusted maximum demand 10% POE","MW",8780,8982,9140,9184,9202,9195,9224]
["TOPSD0103","Transmission System coincident weather adjusted maximum demand 50% POE","MW",8232,8424,8573,8608,8620,8608,8631]
["TOPSD0104","Transmission System non-coincident summated maximum demand","MW"]
["TOPSD0105","Transmission System non-coincident weather adjusted summated maximum demand 10% POE","MW",12204,12433,12692,12756,12681,12672,12716]
["TOPSD0106","Transmission System non-coincident weather adjusted summated maximum demand 50% POE","MW",11551,11767,12017,12071,11988,11973,12010]
[]
[null,"3.4.3.2 Annual system maximum demand characteristics – MVA measure"]
["TOPSD0201","Transmission System coincident maximum demand","MVA"]
["TOPSD0202","Transmission System coincident weather adjusted maximum demand 10% POE","MVA",9489,9703,9868,9914,9933,9926,9955]
["TOPSD0203","Transmission System coincident weather adjusted maximum demand 50% POE","MVA",8916,9119,9276,9313,9325,9313,9336]
["TOPSD0204","Transmission System non-coincident summated maximum demand","MVA"]
["TOPSD0205","Transmission System non-coincident weather adjusted summated maximum demand 10% POE","MVA",12710,12950,13221,13288,13208,13198,13244]
["TOPSD0206","Transmission System non-coincident weather adjusted summated maximum demand 50% POE","MVA",12036,12262,12524,12580,12493,12477,12515]
[]
[null,"3.4.3.3 Power factor"]
[null,"Power factor conversion between MVA and MW"]
["TOPSD0301","Average overall network power factor conversion between MVA and MW","Factor",0.99,0.99099999999999999,0.99199999999999999,0.99199999999999999,0.99199999999999999,0.99199999999999999,0.99199999999999999]
["TOPSD0302","Average power factor conversion for 500 kV lines","Factor"]
["TOPSD0303","Average power factor conversion for 330 kV lines","Factor",0.59799999999999998,0.59799999999999998,0.59799999999999998,0.59799999999999998,0.59799999999999998,0.59799999999999998,0.59799999999999998]
["TOPSD0304","Average power factor conversion for  275 kV lines","Factor",0.97499999999999998,0.98299999999999998,0.98899999999999999,0.99,0.98899999999999999,0.98899999999999999,0.99099999999999999]
["TOPSD0305","Average power factor conversion for  220 kV lines","Factor"]
["TOPSD0306","Average power factor conversion for  132 kV lines","Factor",1,1,0.999,0.999,0.999,0.999,0.999]
["TOPSD0307","Average power factor conversion for  110 kV lines","Factor",0.97299999999999998,0.97299999999999998,0.97399999999999998,0.97299999999999998,0.97399999999999998,0.97399999999999998,0.97399999999999998]
["TOPSD0308","Average power factor conversion for  88 kV lines","Factor"]
["TOPSD0309","Average power factor conversion for  66 kV lines","Factor",0.96199999999999997,0.96299999999999997,0.96299999999999997,0.96099999999999997,0.96099999999999997,0.96099999999999997,0.96]
["TOPSD0310","Average power factor conversion for  33 kV lines","Factor",1,1,1,1,1,1,1]
["TOPSD0311","Average power factor conversion for  22 kV lines","Factor",0.999,0.999,1,0.999,1,1,1]
["TOPSD0311","Average power factor conversion for  11 kV lines","Factor",0.94799999999999995,0.94799999999999995,0.94399999999999995,0.94299999999999995,0.94399999999999995,0.94399999999999995,0.94499999999999995]
["TOPSD0312","Average power factor conversion for  6.6 kV lines","Factor"]

{"sheet":"3.5 Physical assets","index":22,"n_rows":74,"n_cols":10,"rows_kept":74,"cut":false,"hidden":false,"merged":[[6,3,6,9]]}
[null,{"$f":"(LOOKUP(dms_Model,dms_Model_List,dms_Worksheet_List))","v":"REGULATORY REPORTING STATEMENT"}]
[null,{"$f":"INDEX(dms_TradingNameFull_List,MATCH(dms_TradingName,dms_TradingName_List))","v":"Queensland Electricity Transmission Corporation Limited trading as Powerlink Queensland"}]
[null,{"$f":"CONCATENATE(FRCP_y1,\" to \",FRCP_y5)","v":"2017-18 to 2021-22"}]
[null,"3.5 PHYSICAL ASSETS"]
[]
[]
[null,null,null,"Forecast (0's)"]
[null,null,"Units",{"$f":"CRCP_y4","v":"2015-16"},{"$f":"CRCP_y5","v":"2016-17"},{"$f":"FRCP_y1","v":"2017-18"},{"$f":"FRCP_y2","v":"2018-19"},{"$f":"FRCP_y3","v":"2019-20"},{"$f":"FRCP_y4","v":"2020-21"},{"$f":"FRCP_y5","v":"2021-22"}]
[]
[null,"3.5.1 - TRANSMISSION SYSTEM CAPACITIES "]
[null,"3.5.1.1 - Overhead network length of circuit at each voltage"]
["TPA0101","500 kV","km",0,0,0,0,0,0,0]
["TPA0102","330 kV","km",604,604,604,604,604,604,604]
["TPA0103","275 kV","km",9367,9367,9367,9367,9367,9367,9367]
["TPA0104","220 kV","km",0,0,0,0,0,0,0]
["TPA0105","132 kV","km",4368,4157,4157,4145,4076,4076,4076]
["TPA0106","110 kV","km",393,393,393,393,393,393,393]
["TPA0107","88 kV","km",0,0,0,0,0,0,0]
["TPA0108","66 kV","km",1,1,1,1,1,1,1]
["TPA0109","33 kV","km",0,0,0,0,0,0,0]
["TPA0109","22 kV","km",0,0,0,0,0,0,0]
["TPA0109","11 kV","km",0,0,0,0,0,0,0]
["TPA01","Total overhead circuit kilometres","km",{"$f":"SUM(D12:D22)","v":14733},{"$f":"SUM(E12:E22)","v":14522},{"$f":"SUM(F12:F22)","v":14522},14510,14441,14441,14441]
[]
[null,"3.5.1.2 - Underground cable circuit length at each voltage"]
["TPA0201","500 kV","km",0,0,0,0,0,0,0]
["TPA0202","330 kV","km",0,0,0,0,0,0,0]
["TPA0203","275 kV","km",9.4,9.4,9.4,9.4,9.4,9.4,9.4]
["TPA0204","220 kV","km",0,0,0,0,0,0,0]
["TPA0205","132 kV","km",3.2,3.2,3.2,3.2,3.2,3.2,3.2]
["TPA0206","110 kV","km",7.6,7.6,7.6,7.6,7.6,7.6,7.6]
["TPA0207","88 kV","km",0,0,0,0,0,0,0]
["TPA0208","66 kV","km",1.3,1.3,1.3,1.3,1.3,1.3,1.3]
["TPA0209","33 kV","km",0,0,0,0,0,0,0]
["TPA0210","22 kV","km",0,0,0,0,0,0,0]
["TPA0211","11 kV","km",0,0,0,0,0,0,0]
["TPA02","Total underground circuit kilometres","km",{"$f":"SUM(D26:D36)","v":21.500000000000004},{"$f":"SUM(E26:E36)","v":21.500000000000004},{"$f":"SUM(F26:F36)","v":21.500000000000004},21.500000000000004,21.500000000000004,21.500000000000004,21.500000000000004]
[]
["TPA0301","3.5.1.3 - Estimated overhead network weighted average MVA capacity by voltage class"]
["TPA0302","500 kV","MVA",0,0,0,0,0,0,0]
["TPA0303","330 kV","MVA",1237.5,1237.5,1237.5,1237.5,1237.4612380000001,1237.5,1237.5]
["TPA0304","275 kV","MVA",837.9,837.9,837.9,837.9,837.87344970000004,837.9,837.9]
["TPA0305","220 kV","MVA",0,0,0,0,0,0,0]
["TPA0306","132 kV","MVA",139.6,141.4,141.4,141.80000000000001,144.35,144.30000000000001,144.30000000000001]
["TPA0307","110 kV","MVA",158.80000000000001,158.80000000000001,158.80000000000001,158.81,158.80000000000001,158.80000000000001,158.80000000000001]
["TPA0308","88 kV","MVA",0,0,0,0,0,0,0]
["TPA0309","66 kV","MVA",57,57,57,57,57,57,57]
["TPA0310","33 kV","MVA",0,0,0,0,0,0,0]
["TPA0311","22 kV","MVA",0,0,0,0,0,0,0]
["TPA0312","11 kV","MVA",0,0,0,0,0,0,0]
[]
[null,"3.5.1.4 - Estimated underground network weighted average MVA capacity by voltage class"]
["TPA0401","500 kV","MVA",0,0,0,0,0,0,0]
["TPA0402","330 kV","MVA",0,0,0,0,0,0,0]
["TPA0403","275 kV","MVA",568.9,568.9,568.9,568.9,568.87,568.9,568.9]
["TPA0404","220 kV","MVA",0,0,0,0,0,0,0]
["TPA0405","132 kV","MVA",207.9,207.9,207.9,207.9,207.93,207.9,207.9]
["TPA0406","110 kV","MVA",200.8,200.8,200.8,200.8,200.8,200.8,200.8]
["TPA0407","88 kV","MVA",0,0,0,0,0,0,0]
["TPA0408","66 kV","MVA",57,57,57,57,57,57,57]
["TPA0409","33 kV","MVA",0,0,0,0,0,0,0]
["TPA0410","22 kV","MVA",0,0,0,0,0,0,0]
["TPA0411","11 kV","MVA",0,0,0,0,0,0,0]
[]
[null,"3.5.1.5 - Installed transmission system transformer capacity"]
["TPA0501","Transmission substations (eg 500 kV to 330 kV)","MVA",9929,9929,9929,10179,9911,9911,9886]
["TPA0502","Terminal points to DNSP systems","MVA",23431,23431,23489,23264,23268,23298,23298]
["TPA0503","Transformer capacity for directly connected end–users owned by the TNSP","MVA",2197,2197,2197,2197,2197,2197,2197]
["TPA0504","Transformer capacity for directly connected end–users owned by the end–user","MVA",3393,3393,3393,3393,3393,3393,3393]
["TPA0505","Interconnector capacity","MVA",0,0,0,0,0,0,0]
["TPA0506","Other","MVA",3097,3097,3097,3097,3097,3097,3097]
[]
[null,"3.5.1.6 - Cold spare capacity"]
["TPA06","Cold spare capacity included in 3.5.1.5","MVA",2975,2975,2975,3100,3100,3100,3100]

{"sheet":"3.7 Operating environment","index":23,"n_rows":23,"n_cols":10,"rows_kept":23,"cut":false,"hidden":false,"merged":[[6,3,6,9]]}
[null,{"$f":"(LOOKUP(dms_Model,dms_Model_List,dms_Worksheet_List))","v":"REGULATORY REPORTING STATEMENT"}]
[null,{"$f":"INDEX(dms_TradingNameFull_List,MATCH(dms_TradingName,dms_TradingName_List))","v":"Queensland Electricity Transmission Corporation Limited trading as Powerlink Queensland"}]
[null,{"$f":"CONCATENATE(FRCP_y1,\" to \",FRCP_y5)","v":"2017-18 to 2021-22"}]
[null,"3.7 OPERATING ENVIRONMENT FACTORS"]
[]
[]
[null,null,null,"Forecast (0's)"]
[null,null,"Units",{"$f":"CRCP_y4","v":"2015-16"},{"$f":"CRCP_y5","v":"2016-17"},{"$f":"FRCP_y1","v":"2017-18"},{"$f":"FRCP_y2","v":"2018-19"},{"$f":"FRCP_y3","v":"2019-20"},{"$f":"FRCP_y4","v":"2020-21"},{"$f":"FRCP_y5","v":"2021-22"}]
["TEF01","3.7.1 - TERRAIN FACTORS"]
["TEF0101","Total number of vegetation maintenance spans","Number of spans",10833]
["TEF0102","Average vegetation maintenance span cycle","Years",2.6080000000000001]
["TEF0103","Average number of trees per vegetation maintenance span","Trees",576]
["TEF0104","Average number of defects per vegetation maintenance span","Defects",2.794E-2]
["TEF0105","Tropical proportion","Number of spans",7327]
["TEF0106","Standard vehicle access","km",8019]
["TEF0107","Altitude","km",239.5]
["TEF0108","Bushfire risk","Number of spans",3220]
[]
["TEF02","3.7.2 - NETWORK CHARACTERISTICS"]
["TEF0201","Route line length","km",9698,9592.5,9592.5,9586.7999999999993,9517.7000000000007,9517.7000000000007,9517.7000000000007]
["TEF0202","Variability of dispatch","%",5.9,5.9,5.9,5.9,5.9,5.9,5.9]
["TEF0203","Concentrated load distance","km",565.4,565.4,565.4,565.4,565.4,565.4,565.4]
["TEF0204","Total number of spans","number",24096,23824,23824,23802,23571,23571,23571]

{"sheet":"5.3 MD - Network level","index":24,"n_rows":12,"n_cols":10,"rows_kept":12,"cut":false,"hidden":false,"merged":[]}
[null,{"$f":"(LOOKUP(dms_Model,dms_Model_List,dms_Worksheet_List))","v":"REGULATORY REPORTING STATEMENT"}]
[null,{"$f":"INDEX(dms_TradingNameFull_List,MATCH(dms_TradingName,dms_TradingName_List))","v":"Queensland Electricity Transmission Corporation Limited trading as Powerlink Queensland"}]
[null,{"$f":"CONCATENATE(FRCP_y1,\" to \",dms_FRCP_FinalYear_Num)","v":"2017-18 to 2021-22"}]
[null,"5.3 MAXIMUM DEMAND AT NETWORK LEVEL"]
[]
[]
[null,"5.3.1 - RAW AND WEATHER CORRECTED COINCIDENT MAXIMUM DEMAND AT NETWORK LEVEL (SUMMED AT TRANSMISSION CONNECTION POINT)"]
[null,null,"UNIT",{"$f":"CRCP_y4","v":"2015-16"},{"$f":"CRCP_y5","v":"2016-17"},{"$f":"FRCP_y1","v":"2017-18"},{"$f":"FRCP_y2","v":"2018-19"},{"$f":"FRCP_y3","v":"2019-20"},{"$f":"FRCP_y4","v":"2020-21"},{"$f":"FRCP_y5","v":"2021-22"}]
[null,"Winter/Summer peaking",null,"Summer","Summer","Summer","Summer","Summer","Summer","Summer"]
[null,"Embedded generation","MW",285,285,285,285,285,285,285]
[null,"Weather corrected (10% PoE) network coincident MD","MW",8780,8982,9140,9184,9202,9195,9224]
[null,"Weather corrected (50% PoE) network coincident MD","MW",8232,8424,8573,8608,8620,8608,8631]

{"sheet":"5.4 MD & Utilisation - Spatial","index":25,"n_rows":4879,"n_cols":23,"rows_kept":4879,"cut":false,"hidden":false,"merged":[[15,2,16,2],[15,3,16,3],[17,2,18,2],[17,3,18,3],[19,2,20,2],[19,3,20,3],[4877,3,4878,3],[7,1,20,1],[7,2,8,2],[7,3,8,3],[9,2,10,2],[9,3,10,3],[11,2,12,2],[11,3,12,3],[13,2,14,2],[13,3,14,3],[4865,3,4866,3],[4867,3,4868,3],[4869,3,4870,3],[4871,3,4872,3],[4873,3,4874,3],[4875,3,4876,3],[4865,1,4878,1],[4865,2,4866,2],[4867,2,4868,2],[4869,2,4870,2],[4871,2,4872,2],[4873,2,4874,2],[4875,2,4876,2],[4877,2,4878,2],[39,2,40,2],[39,3,40,3],[41,2,42,2],[41,3,42,3],[43,2,44,2],[43,3,44,3],[29,3,30,3],[31,2,32,2],[31,3,32,3],[33,2,34,2],[33,3,34,3],[35,1,48,1],[35,2,36,2],[35,3,36,3],[37,2,38,2],[37,3,38,3],[21,1,34,1],[21,2,22,2],[21,3,22,3],[23,2,24,2],[23,3,24,3],[25,2,26,2],[25,3,26,3],[27,2,28,2],[27,3,28,3],[29,2,30,2],[53,3,54,3],[55,2,56,2],[55,3,56,3],[57,2,58,2],[57,3,58,3],[59,2,60,2],[59,3,60,3],[45,2,46,2],[45,3,46,3],[47,2,48,2],[47,3,48,3],[49,1,62,1],[49,2,50,2],[49,3,50,3],[51,2,52,2],[51,3,52,3],[53,2,54,2],[69,3,70,3],[71,2,72,2],[71,3,72,3],[73,2,74,2],[73,3,74,3],[75,2,76,2],[75,3,76,3],[61,2,62,2],[61,3,62,3],[63,1,76,1],[63,2,64,2],[63,3,64,3],[65,2,66,2],[65,3,66,3],[67,2,68,2],[67,3,68,3],[69,2,70,2],[95,2,96,2],[95,3,96,3],[97,2,98,2],[97,3,98,3],[99,2,100,2],[99,3,100,3],[85,3,86,3],[87,2,88,2],[87,3,88,3],[89,2,90,2],[89,3,90,3],[91,1,104,1],[91,2,92,2],[91,3,92,3],[93,2,94,2],[93,3,94,3],[77,1,90,1],[77,2,78,2],[77,3,78,3],[79,2,80,2],[79,3,80,3],[81,2,82,2],[81,3,82,3],[83,2,84,2],[83,3,84,3],[85,2,86,2],[109,3,110,3],[111,2,112,2],[111,3,112,3],[113,2,114,2],[113,3,114,3],[115,2,116,2],[115,3,116,3],[101,2,102,2],[101,3,102,3],[103,2,104,2],[103,3,104,3],[105,1,118,1],[105,2,106,2],[105,3,106,3],[107,2,108,2],[107,3,108,3],[109,2,110,2],[125,3,126,3],[127,2,128,2],[127,3,128,3],[129,2,130,2],[129,3,130,3],[131,2,132,2],[131,3,132,3],[117,2,118,2],[117,3,118,3],[119,1,132,1],[119,2,120,2],[119,3,120,3],[121,2,122,2],[121,3,122,3],[123,2,124,2],[123,3,124,3],[125,2,126,2],[151,2,152,2],[151,3,152,3],[153,2,154,2],[153,3,154,3],[155,2,156,2],[155,3,156,3],[141,3,142,3],[143,2,144,2],[143,3,144,3],[145,2,146,2],[145,3,146,3],[147,1,160,1],[147,2,148,2],[147,3,148,3],[149,2,150,2],[149,3,150,3],[133,1,146,1],[133,2,134,2],[133,3,134,3],[135,2,136,2],[135,3,136,3],[137,2,138,2],[137,3,138,3],[139,2,140,2],[139,3,140,3],[141,2,142,2],[165,3,166,3],[167,2,168,2],[167,3,168,3],[169,2,170,2],[169,3,170,3],[171,2,172,2],[171,3,172,3],[157,2,158,2],[157,3,158,3],[159,2,160,2],[159,3,160,3],[161,1,174,1],[161,2,162,2],[161,3,162,3],[163,2,164,2],[163,3,164,3],[165,2,166,2],[181,3,182,3],[183,2,184,2],[183,3,184,3],[185,2,186,2],[185,3,186,3],[187,2,188,2],[187,3,188,3],[173,2,174,2],[173,3,174,3],[175,1,188,1],[175,2,176,2],[175,3,176,3],[177,2,178,2],[177,3,178,3],[179,2,180,2],[179,3,180,3],[181,2,182,2],[207,2,208,2],[207,3,208,3],[209,2,210,2],[209,3,210,3],[211,2,212,2],[211,3,212,3],[197,3,198,3],[199,2,200,2],[199,3,200,3],[201,2,202,2],[201,3,202,3],[203,1,216,1],[203,2,204,2],[203,3,204,3],[205,2,206,2],[205,3,206,3],[189,1,202,1],[189,2,190,2],[189,3,190,3],[191,2,192,2],[191,3,192,3],[193,2,194,2],[193,3,194,3],[195,2,196,2],[195,3,196,3],[197,2,198,2],[221,3,222,3],[223,2,224,2],[223,3,224,3],[225,2,226,2],[225,3,226,3],[227,2,228,2],[227,3,228,3],[213,2,214,2],[213,3,214,3],[215,2,216,2],[215,3,216,3],[217,1,230,1],[217,2,218,2],[217,3,218,3],[219,2,220,2],[219,3,220,3],[221,2,222,2],[237,3,238,3],[239,2,240,2],[239,3,240,3],[241,2,242,2],[241,3,242,3],[243,2,244,2],[243,3,244,3],[229,2,230,2],[229,3,230,3],[231,1,244,1],[231,2,232,2],[231,3,232,3],[233,2,234,2],[233,3,234,3],[235,2,236,2],[235,3,236,3],[237,2,238,2],[263,2,264,2],[263,3,264,3],[265,2,266,2],[265,3,266,3],[267,2,268,2],[267,3,268,3],[253,3,254,3],[255,2,256,2],[255,3,256,3],[257,2,258,2],[257,3,258,3],[259,1,272,1],[259,2,260,2],[259,3,260,3],[261,2,262,2],[261,3,262,3],[245,1,258,1],[245,2,246,2],[245,3,246,3],[247,2,248,2],[247,3,248,3],[249,2,250,2],[249,3,250,3],[251,2,252,2],[251,3,252,3],[253,2,254,2],[277,3,278,3],[279,2,280,2],[279,3,280,3],[281,2,282,2],[281,3,282,3],[283,2,284,2],[283,3,284,3],[269,2,270,2],[269,3,270,3],[271,2,272,2],[271,3,272,3],[273,1,286,1],[273,2,274,2],[273,3,274,3],[275,2,276,2],[275,3,276,3],[277,2,278,2],[293,3,294,3],[295,2,296,2],[295,3,296,3],[297,2,298,2],[297,3,298,3],[299,2,300,2],[299,3,300,3],[285,2,286,2],[285,3,286,3],[287,1,300,1],[287,2,288,2],[287,3,288,3],[289,2,290,2],[289,3,290,3],[291,2,292,2],[291,3,292,3],[293,2,294,2],[319,2,320,2],[319,3,320,3],[321,2,322,2],[321,3,322,3],[323,2,324,2],[323,3,324,3],[309,3,310,3],[311,2,312,2],[311,3,312,3],[313,2,314,2],[313,3,314,3],[315,1,328,1],[315,2,316,2],[315,3,316,3],[317,2,318,2],[317,3,318,3],[301,1,314,1],[301,2,302,2],[301,3,302,3],[303,2,304,2],[303,3,304,3],[305,2,306,2],[305,3,306,3],[307,2,308,2],[307,3,308,3],[309,2,310,2],[333,3,334,3],[335,2,336,2],[335,3,336,3],[337,2,338,2],[337,3,338,3],[339,2,340,2],[339,3,340,3],[325,2,326,2],[325,3,326,3],[327,2,328,2],[327,3,328,3],[329,1,342,1],[329,2,330,2],[329,3,330,3],[331,2,332,2],[331,3,332,3],[333,2,334,2],[349,3,350,3],[351,2,352,2],[351,3,352,3],[353,2,354,2],[353,3,354,3],[355,2,356,2],[355,3,356,3],[341,2,342,2],[341,3,342,3],[343,1,356,1],[343,2,344,2],[343,3,344,3],[345,2,346,2],[345,3,346,3],[347,2,348,2],[347,3,348,3],[349,2,350,2],[375,2,376,2],[375,3,376,3],[377,2,378,2],[377,3,378,3],[379,2,380,2],[379,3,380,3],[365,3,366,3],[367,2,368,2],[367,3,368,3],[369,2,370,2],[369,3,370,3],[371,1,384,1],[371,2,372,2],[371,3,372,3],[373,2,374,2],[373,3,374,3],[357,1,370,1],[357,2,358,2],[357,3,358,3],[359,2,360,2],[359,3,360,3],[361,2,362,2],[361,3,362,3],[363,2,364,2],[363,3,364,3],[365,2,366,2],[389,3,390,3],[391,2,392,2],[391,3,392,3],[393,2,394,2],[393,3,394,3],[395,2,396,2],[395,3,396,3],[381,2,382,2],[381,3,382,3],[383,2,384,2],[383,3,384,3],[385,1,398,1],[385,2,386,2],[385,3,386,3],[387,2,388,2],[387,3,388,3],[389,2,390,2],[405,3,406,3],[407,2,408,2],[407,3,408,3],[409,2,410,2],[409,3,410,3],[411,2,412,2],[411,3,412,3],[397,2,398,2],[397,3,398,3],[399,1,412,1],[399,2,400,2],[399,3,400,3],[401,2,402,2],[401,3,402,3],[403,2,404,2],[403,3,404,3],[405,2,406,2],[431,2,432,2],[431,3,432,3],[433,2,434,2],[433,3,434,3],[435,2,436,2],[435,3,436,3],[421,3,422,3],[423,2,424,2],[423,3,424,3],[425,2,426,2],[425,3,426,3],[427,1,440,1],[427,2,428,2],[427,3,428,3],[429,2,430,2],[429,3,430,3],[413,1,426,1],[413,2,414,2],[413,3,414,3],[415,2,416,2],[415,3,416,3],[417,2,418,2],[417,3,418,3],[419,2,420,2],[419,3,420,3],[421,2,422,2],[445,3,446,3],[447,2,448,2],[447,3,448,3],[449,2,450,2],[449,3,450,3],[451,2,452,2],[451,3,452,3],[437,2,438,2],[437,3,438,3],[439,2,440,2],[439,3,440,3],[441,1,454,1],[441,2,442,2],[441,3,442,3],[443,2,444,2],[443,3,444,3],[445,2,446,2],[461,3,462,3],[463,2,464,2],[463,3,464,3],[465,2,466,2],[465,3,466,3],[467,2,468,2],[467,3,468,3],[453,2,454,2],[453,3,454,3],[455,1,468,1],[455,2,456,2],[455,3,456,3],[457,2,458,2],[457,3,458,3],[459,2,460,2],[459,3,460,3],[461,2,462,2],[487,2,488,2],[487,3,488,3],[489,2,490,2],[489,3,490,3],[491,2,492,2],[491,3,492,3],[477,3,478,3],[479,2,480,2],[479,3,480,3],[481,2,482,2],[481,3,482,3],[483,1,496,1],[483,2,484,2],[483,3,484,3],[485,2,486,2],[485,3,486,3],[469,1,482,1],[469,2,470,2],[469,3,470,3],[471,2,472,2],[471,3,472,3],[473,2,474,2],[473,3,474,3],[475,2,476,2],[475,3,476,3],[477,2,478,2],[501,3,502,3],[503,2,504,2],[503,3,504,3],[505,2,506,2],[505,3,506,3],[507,2,508,2],[507,3,508,3],[493,2,494,2],[493,3,494,3],[495,2,496,2],[495,3,496,3],[497,1,510,1],[497,2,498,2],[497,3,498,3],[499,2,500,2],[499,3,500,3],[501,2,502,2],[517,3,518,3],[519,2,520,2],[519,3,520,3],[521,2,522,2],[521,3,522,3],[523,2,524,2],[523,3,524,3],[509,2,510,2],[509,3,510,3],[511,1,524,1],[511,2,512,2],[511,3,512,3],[513,2,514,2],[513,3,514,3],[515,2,516,2],[515,3,516,3],[517,2,518,2],[543,2,544,2],[543,3,544,3],[545,2,546,2],[545,3,546,3],[547,2,548,2],[547,3,548,3],[533,3,534,3],[535,2,536,2],[535,3,536,3],[537,2,538,2],[537,3,538,3],[539,1,552,1],[539,2,540,2],[539,3,540,3],[541,2,542,2],[541,3,542,3],[525,1,538,1],[525,2,526,2],[525,3,526,3],[527,2,528,2],[527,3,528,3],[529,2,530,2],[529,3,530,3],[531,2,532,2],[531,3,532,3],[533,2,534,2],[557,3,558,3],[559,2,560,2],[559,3,560,3],[561,2,562,2],[561,3,562,3],[563,2,564,2],[563,3,564,3],[549,2,550,2],[549,3,550,3],[551,2,552,2],[551,3,552,3],[553,1,566,1],[553,2,554,2],[553,3,554,3],[555,2,556,2],[555,3,556,3],[557,2,558,2],[573,3,574,3],[575,2,576,2],[575,3,576,3],[577,2,578,2],[577,3,578,3],[579,2,580,2],[579,3,580,3],[565,2,566,2],[565,3,566,3],[567,1,580,1],[567,2,568,2],[567,3,568,3],[569,2,570,2],[569,3,570,3],[571,2,572,2],[571,3,572,3],[573,2,574,2],[599,2,600,2],[599,3,600,3],[601,2,602,2],[601,3,602,3],[603,2,604,2],[603,3,604,3],[589,3,590,3],[591,2,592,2],[591,3,592,3],[593,2,594,2],[593,3,594,3],[595,1,608,1],[595,2,596,2],[595,3,596,3],[597,2,598,2],[597,3,598,3],[581,1,594,1],[581,2,582,2],[581,3,582,3],[583,2,584,2],[583,3,584,3],[585,2,586,2],[585,3,586,3],[587,2,588,2],[587,3,588,3],[589,2,590,2],[613,3,614,3],[615,2,616,2],[615,3,616,3],[617,2,618,2],[617,3,618,3],[619,2,620,2],[619,3,620,3],[605,2,606,2],[605,3,606,3],[607,2,608,2],[607,3,608,3],[609,1,622,1],[609,2,610,2],[609,3,610,3],[611,2,612,2],[611,3,612,3],[613,2,614,2],[629,3,630,3],[631,2,632,2],[631,3,632,3],[633,2,634,2],[633,3,634,3],[635,2,636,2],[635,3,636,3],[621,2,622,2],[621,3,622,3],[623,1,636,1],[623,2,624,2],[623,3,624,3],[625,2,626,2],[625,3,626,3],[627,2,628,2],[627,3,628,3],[629,2,630,2],[655,2,656,2],[655,3,656,3],[657,2,658,2],[657,3,658,3],[659,2,660,2],[659,3,660,3],[645,3,646,3],[647,2,648,2],[647,3,648,3],[649,2,650,2],[649,3,650,3],[651,1,664,1],[651,2,652,2],[651,3,652,3],[653,2,654,2],[653,3,654,3],[637,1,650,1],[637,2,638,2],[637,3,638,3],[639,2,640,2],[639,3,640,3],[641,2,642,2],[641,3,642,3],[643,2,644,2],[643,3,644,3],[645,2,646,2],[669,3,670,3],[671,2,672,2],[671,3,672,3],[673,2,674,2],[673,3,674,3],[675,2,676,2],[675,3,676,3],[661,2,662,2],[661,3,662,3],[663,2,664,2],[663,3,664,3],[665,1,678,1],[665,2,666,2],[665,3,666,3],[667,2,668,2],[667,3,668,3],[669,2,670,2],[685,3,686,3],[687,2,688,2],[687,3,688,3],[689,2,690,2],[689,3,690,3],[691,2,692,2],[691,3,692,3],[677,2,678,2],[677,3,678,3],[679,1,692,1],[679,2,680,2],[679,3,680,3],[681,2,682,2],[681,3,682,3],[683,2,684,2],[683,3,684,3],[685,2,686,2],[711,2,712,2],[711,3,712,3],[713,2,714,2],[713,3,714,3],[715,2,716,2],[715,3,716,3],[701,3,702,3],[703,2,704,2],[703,3,704,3],[705,2,706,2],[705,3,706,3],[707,1,720,1],[707,2,708,2],[707,3,708,3],[709,2,710,2],[709,3,710,3],[693,1,706,1],[693,2,694,2],[693,3,694,3],[695,2,696,2],[695,3,696,3],[697,2,698,2],[697,3,698,3],[699,2,700,2],[699,3,700,3],[701,2,702,2],[725,3,726,3],[727,2,728,2],[727,3,728,3],[729,2,730,2],[729,3,730,3],[731,2,732,2],[731,3,732,3],[717,2,718,2],[717,3,718,3],[719,2,720,2],[719,3,720,3],[721,1,734,1],[721,2,722,2],[721,3,722,3],[723,2,724,2],[723,3,724,3],[725,2,726,2],[741,3,742,3],[743,2,744,2],[743,3,744,3],[745,2,746,2],[745,3,746,3],[747,2,748,2],[747,3,748,3],[733,2,734,2],[733,3,734,3],[735,1,748,1],[735,2,736,2],[735,3,736,3],[737,2,738,2],[737,3,738,3],[739,2,740,2],[739,3,740,3],[741,2,742,2],[767,2,768,2],[767,3,768,3],[769,2,770,2],[769,3,770,3],[771,2,772,2],[771,3,772,3],[757,3,758,3],[759,2,760,2],[759,3,760,3],[761,2,762,2],[761,3,762,3],[763,1,776,1],[763,2,764,2],[763,3,764,3],[765,2,766,2],[765,3,766,3],[749,1,762,1],[749,2,750,2],[749,3,750,3],[751,2,752,2],[751,3,752,3],[753,2,754,2],[753,3,754,3],[755,2,756,2],[755,3,756,3],[757,2,758,2],[781,3,782,3],[783,2,784,2],[783,3,784,3],[785,2,786,2],[785,3,786,3],[787,2,788,2],[787,3,788,3],[773,2,774,2],[773,3,774,3],[775,2,776,2],[775,3,776,3],[777,1,790,1],[777,2,778,2],[777,3,778,3],[779,2,780,2],[779,3,780,3],[781,2,782,2],[797,3,798,3],[799,2,800,2],[799,3,800,3],[801,2,802,2],[801,3,802,3],[803,2,804,2],[803,3,804,3],[789,2,790,2],[789,3,790,3],[791,1,804,1],[791,2,792,2],[791,3,792,3],[793,2,794,2],[793,3,794,3],[795,2,796,2],[795,3,796,3],[797,2,798,2],[823,2,824,2],[823,3,824,3],[825,2,826,2],[825,3,826,3],[827,2,828,2],[827,3,828,3],[813,3,814,3],[815,2,816,2],[815,3,816,3],[817,2,818,2],[817,3,818,3],[819,1,832,1],[819,2,820,2],[819,3,820,3],[821,2,822,2],[821,3,822,3],[805,1,818,1],[805,2,806,2],[805,3,806,3],[807,2,808,2],[807,3,808,3],[809,2,810,2],[809,3,810,3],[811,2,812,2],[811,3,812,3],[813,2,814,2],[837,3,838,3],[839,2,840,2],[839,3,840,3],[841,2,842,2],[841,3,842,3],[843,2,844,2],[843,3,844,3],[829,2,830,2],[829,3,830,3],[831,2,832,2],[831,3,832,3],[833,1,846,1],[833,2,834,2],[833,3,834,3],[835,2,836,2],[835,3,836,3],[837,2,838,2],[853,3,854,3],[855,2,856,2],[855,3,856,3],[857,2,858,2],[857,3,858,3],[859,2,860,2],[859,3,860,3],[845,2,846,2],[845,3,846,3],[847,1,860,1],[847,2,848,2],[847,3,848,3],[849,2,850,2],[849,3,850,3],[851,2,852,2],[851,3,852,3],[853,2,854,2],[879,2,880,2],[879,3,880,3],[881,2,882,2],[881,3,882,3],[883,2,884,2],[883,3,884,3],[869,3,870,3],[871,2,872,2],[871,3,872,3],[873,2,874,2],[873,3,874,3],[875,1,888,1],[875,2,876,2],[875,3,876,3],[877,2,878,2],[877,3,878,3],[861,1,874,1],[861,2,862,2],[861,3,862,3],[863,2,864,2],[863,3,864,3],[865,2,866,2],[865,3,866,3],[867,2,868,2],[867,3,868,3],[869,2,870,2],[893,3,894,3],[895,2,896,2],[895,3,896,3],[897,2,898,2],[897,3,898,3],[899,2,900,2],[899,3,900,3],[885,2,886,2],[885,3,886,3],[887,2,888,2],[887,3,888,3],[889,1,902,1],[889,2,890,2],[889,3,890,3],[891,2,892,2],[891,3,892,3],[893,2,894,2],[909,3,910,3],[911,2,912,2],[911,3,912,3],[913,2,914,2],[913,3,914,3],[915,2,916,2],[915,3,916,3],[901,2,902,2],[901,3,902,3],[903,1,916,1],[903,2,904,2],[903,3,904,3],[905,2,906,2],[905,3,906,3],[907,2,908,2],[907,3,908,3],[909,2,910,2],[935,2,936,2],[935,3,936,3],[937,2,938,2],[937,3,938,3],[939,2,940,2],[939,3,940,3],[925,3,926,3],[927,2,928,2],[927,3,928,3],[929,2,930,2]],"merged_total":5220,"flags":["merged_cut"]}
[null,{"$f":"(LOOKUP(dms_Model,dms_Model_List,dms_Worksheet_List))","v":"REGULATORY REPORTING STATEMENT"}]
[null,{"$f":"INDEX(dms_TradingNameFull_List,MATCH(dms_TradingName,dms_TradingName_List))","v":"Queensland Electricity Transmission Corporation Limited trading as Powerlink Queensland"}]
[null,{"$f":"CONCATENATE(FRCP_y1,\" to \",dms_FRCP_FinalYear_Num)","v":"2017-18 to 2021-22"}]
[null,"5.4 MAXIMUM DEMAND AND UTILISATION AT SPATIAL LEVEL"]
[]
[null,"5.4.1 - NON-COINCIDENT & COINCIDENT MAXIMUM DEMAND"]
[null,"CONNECTION POINT","FORECASTING ELEMENTS","UNIT","MAX DEMAND",null,"TNSP NAME","SERVICE","SERVICE SUBCATEGORY","DATA TYPE","DATA TYPE SUBCATEGORY","LOCATION","LOCATION SUBCATEGORY","MEASUREMENT","DENOMINATION",null,{"$f":"CRCP_y4","v":"2015-16"},{"$f":"CRCP_y5","v":"2016-17"},{"$f":"FRCP_y1","v":"2017-18"},{"$f":"FRCP_y2","v":"2018-19"},{"$f":"FRCP_y3","v":"2019-20"},{"$f":"FRCP_y4","v":"2020-21"},{"$f":"FRCP_y5","v":"2021-22"}]
[null,"Abermain (Lockrose)","CONNECTION POINT RATING","MVA","Non-coincident",null,"TNSP NAME","DEMAND FORECASTING","NON-COINCIDENT MAXIMUM DEMAND","DESCRIPTOR METRIC","CONNECTION POINT RATING","CONNECTION POINT",{"$f":"B8","v":"Abermain (Lockrose)"},"RATING","MVA",null,238,238,238,238,238,238,238]
[null,null,null,null,"Coincident",null,"TNSP NAME","DEMAND FORECASTING","COINCIDENT MAXIMUM DEMAND","DESCRIPTOR METRIC","CONNECTION POINT RATING","CONNECTION POINT",{"$f":"M8","v":"Abermain (Lockrose)"},"RATING","MVA",null,238,238,238,238,238,238,238]
[null,null,"WINTER/SUMMER PEAKING",null,"Non-coincident",null,"TNSP NAME","DEMAND FORECASTING","NON-COINCIDENT MAXIMUM DEMAND","DESCRIPTOR METRIC","WINTER/SUMMER PEAKING","CONNECTION POINT",{"$f":"#REF!","v":{"$error":"#REF!"}},"WINTER/SUMMER","WINTER/SUMMER",null,"Summer","Summer","Summer","Summer","Summer","Summer","Summer"]
[null,null,null,null,"Coincident",null,"TNSP NAME","DEMAND FORECASTING","COINCIDENT MAXIMUM DEMAND","DESCRIPTOR METRIC","WINTER/SUMMER PEAKING","CONNECTION POINT",{"$error":"#REF!"},"WINTER/SUMMER","WINTER/SUMMER",null,"Summer","Summer","Summer","Summer","Summer","Summer","Summer"]
[null,null,"ADJUSTMENTS - EMBEDDED GENERATION","MW","Non-coincident",null,"TNSP NAME","DEMAND FORECASTING","NON-COINCIDENT MAXIMUM DEMAND","DESCRIPTOR METRIC","ADJUSTMENTS - EMBEDDED GENERATION","CONNECTION POINT",{"$error":"#REF!"},"GENERATED LOAD","MW",null,0,0,0,0,0,0,0]
[null,null,null,null,"Coincident",null,"TNSP NAME","DEMAND FORECASTING","COINCIDENT MAXIMUM DEMAND","DESCRIPTOR METRIC","ADJUSTMENTS - EMBEDDED GENERATION","CONNECTION POINT",{"$error":"#REF!"},"GENERATED LOAD","MW",null,0,0,0,0,0,0,0]
[null,null,"WEATHER CORRECTED MD 10% POE","MW","Non-coincident",null,"TNSP NAME","DEMAND FORECASTING","NON-COINCIDENT MAXIMUM DEMAND","DESCRIPTOR METRIC","WEATHER CORRECTED MD 10% POE","CONNECTION POINT",{"$error":"#REF!"},"MAXIMUM DEMAND","MW",null,65,64,65,67,67,67,67]
[null,null,null,null,"Coincident",null,"TNSP NAME","DEMAND FORECASTING","COINCIDENT MAXIMUM DEMAND","DESCRIPTOR METRIC","WEATHER CORRECTED MD 10% POE","CONNECTION POINT",{"$error":"#REF!"},"MAXIMUM DEMAND","MW",null,53,53,54,55,55,55,55]
[null,null,"WEATHER CORRECTED MD 10% POE","MVA","Non-coincident",null,"TNSP NAME","DEMAND FORECASTING","NON-COINCIDENT MAXIMUM DEMAND","DESCRIPTOR METRIC","WEATHER CORRECTED MD 10% POE","CONNECTION POINT",{"$error":"#REF!"},"MAXIMUM DEMAND","MVA",null,68,68,69,70,70,70,70]
[null,null,null,null,"Coincident",null,"TNSP NAME","DEMAND FORECASTING","COINCIDENT MAXIMUM DEMAND","DESCRIPTOR METRIC","WEATHER CORRECTED MD 10% POE","CONNECTION POINT",{"$error":"#REF!"},"MAXIMUM DEMAND","MVA",null,58,57,58,60,60,59,60]
[null,null,"WEATHER CORRECTED MD 50% POE","MW","Non-coincident",null,"TNSP NAME","DEMAND FORECASTING","NON-COINCIDENT MAXIMUM DEMAND","DESCRIPTOR METRIC","WEATHER CORRECTED MD 50% POE","CONNECTION POINT",{"$error":"#REF!"},"MAXIMUM DEMAND","MW",null,58,57,58,60,60,59,60]
[null,null,null,null,"Coincident",null,"TNSP NAME","DEMAND FORECASTING","COINCIDENT MAXIMUM DEMAND","DESCRIPTOR METRIC","WEATHER CORRECTED MD 50% POE","CONNECTION POINT",{"$error":"#REF!"},"MAXIMUM DEMAND","MW",null,47,47,48,49,49,49,49]
[null,null,"WEATHER CORRECTED MD 50% POE","MVA","Non-coincident",null,"TNSP NAME","DEMAND FORECASTING","NON-COINCIDENT MAXIMUM DEMAND","DESCRIPTOR METRIC","WEATHER CORRECTED MD 50% POE","CONNECTION POINT",{"$error":"#REF!"},"MAXIMUM DEMAND","MVA",null,61,60,61,63,63,62,63]
[null,null,null,null,"Coincident",null,"TNSP NAME","DEMAND FORECASTING","COINCIDENT MAXIMUM DEMAND","DESCRIPTOR METRIC","WEATHER CORRECTED MD 50% POE","CONNECTION POINT",{"$error":"#REF!"},"MAXIMUM DEMAND","MVA",null,51,51,52,53,53,53,53]
[null,"Abermain (33)","CONNECTION POINT RATING","MVA","Non-coincident",null,"TNSP NAME","DEMAND FORECASTING","NON-COINCIDENT MAXIMUM DEMAND","DESCRIPTOR METRIC","CONNECTION POINT RATING","CONNECTION POINT",{"$f":"B22","v":"Abermain (33)"},"RATING","MVA",null,277,277,277,277,277,277,277]
[null,null,null,null,"Coincident",null,"TNSP NAME","DEMAND FORECASTING","COINCIDENT MAXIMUM DEMAND","DESCRIPTOR METRIC","CONNECTION POINT RATING","CONNECTION POINT","Abermain (33)","RATING","MVA",null,277,277,277,277,277,277,277]
[null,null,"WINTER/SUMMER PEAKING",null,"Non-coincident",null,"TNSP NAME","DEMAND FORECASTING","NON-COINCIDENT MAXIMUM DEMAND","DESCRIPTOR METRIC","WINTER/SUMMER PEAKING","CONNECTION POINT",{"$f":"#REF!","v":{"$error":"#REF!"}},"WINTER/SUMMER","WINTER/SUMMER",null,"Summer","Summer","Summer","Summer","Summer","Summer","Summer"]
[null,null,null,null,"Coincident",null,"TNSP NAME","DEMAND FORECASTING","COINCIDENT MAXIMUM DEMAND","DESCRIPTOR METRIC","WINTER/SUMMER PEAKING","CONNECTION POINT",{"$error":"#REF!"},"WINTER/SUMMER","WINTER/SUMMER",null,"Summer","Summer","Summer","Summer","Summer","Summer","Summer"]
[null,null,"ADJUSTMENTS - EMBEDDED GENERATION","MW","Non-coincident",null,"TNSP NAME","DEMAND FORECASTING","NON-COINCIDENT MAXIMUM DEMAND","DESCRIPTOR METRIC","ADJUSTMENTS - EMBEDDED GENERATION","CONNECTION POINT",{"$error":"#REF!"},"GENERATED LOAD","MW",null,0,0,0,0,0,0,0]
[null,null,null,null,"Coincident",null,"TNSP NAME","DEMAND FORECASTING","COINCIDENT MAXIMUM DEMAND","DESCRIPTOR METRIC","ADJUSTMENTS - EMBEDDED GENERATION","CONNECTION POINT",{"$error":"#REF!"},"GENERATED LOAD","MW",null,0,0,0,0,0,0,0]
[null,null,"WEATHER CORRECTED MD 10% POE","MW","Non-coincident",null,"TNSP NAME","DEMAND FORECASTING","NON-COINCIDENT MAXIMUM DEMAND","DESCRIPTOR METRIC","WEATHER CORRECTED MD 10% POE","CONNECTION POINT",{"$error":"#REF!"},"MAXIMUM DEMAND","MW",null,100,100,99,101,102,102,104]
[null,null,null,null,"Coincident",null,"TNSP NAME","DEMAND FORECASTING","COINCIDENT MAXIMUM DEMAND","DESCRIPTOR METRIC","WEATHER CORRECTED MD 10% POE","CONNECTION POINT",{"$error":"#REF!"},"MAXIMUM DEMAND","MW",null,98,97,96,98,98,98,99]
[null,null,"WEATHER CORRECTED MD 10% POE","MVA","Non-coincident",null,"TNSP NAME","DEMAND FORECASTING","NON-COINCIDENT MAXIMUM DEMAND","DESCRIPTOR METRIC","WEATHER CORRECTED MD 10% POE","CONNECTION POINT",{"$error":"#REF!"},"MAXIMUM DEMAND","MVA",null,101,101,100,102,103,103,104]
[null,null,null,null,"Coincident",null,"TNSP NAME","DEMAND FORECASTING","COINCIDENT MAXIMUM DEMAND","DESCRIPTOR METRIC","WEATHER CORRECTED MD 10% POE","CONNECTION POINT",{"$error":"#REF!"},"MAXIMUM DEMAND","MVA",null,99,98,97,99,99,99,100]
[null,null,"WEATHER CORRECTED MD 50% POE","MW","Non-coincident",null,"TNSP NAME","DEMAND FORECASTING","NON-COINCIDENT MAXIMUM DEMAND","DESCRIPTOR METRIC","WEATHER CORRECTED MD 50% POE","CONNECTION POINT",{"$error":"#REF!"},"MAXIMUM DEMAND","MW",null,91,90,90,91,92,92,94]
[null,null,null,null,"Coincident",null,"TNSP NAME","DEMAND FORECASTING","COINCIDENT MAXIMUM DEMAND","DESCRIPTOR METRIC","WEATHER CORRECTED MD 50% POE","CONNECTION POINT",{"$error":"#REF!"},"MAXIMUM DEMAND","MW",null,89,88,87,88,89,89,89]
[null,null,"WEATHER CORRECTED MD 50% POE","MVA","Non-coincident",null,"TNSP NAME","DEMAND FORECASTING","NON-COINCIDENT MAXIMUM DEMAND","DESCRIPTOR METRIC","WEATHER CORRECTED MD 50% POE","CONNECTION POINT",{"$error":"#REF!"},"MAXIMUM DEMAND","MVA",null,92,91,90,92,93,93,94]
[null,null,null,null,"Coincident",null,"TNSP NAME","DEMAND FORECASTING","COINCIDENT MAXIMUM DEMAND","DESCRIPTOR METRIC","WEATHER CORRECTED MD 50% POE","CONNECTION POINT",{"$error":"#REF!"},"MAXIMUM DEMAND","MVA",null,89,89,88,89,90,90,90]
[null,"Algester","CONNECTION POINT RATING","MVA","Non-coincident",null,null,null,null,null,null,null,null,null,null,null,202,202,202,202,202,202,202]
[null,null,null,null,"Coincident",null,null,null,null,null,null,null,null,null,null,null,202,202,202,202,202,202,202]
[null,null,"WINTER/SUMMER PEAKING",null,"Non-coincident",null,null,null,null,null,null,null,null,null,null,null,"Summer","Summer","Summer","Summer","Summer","Summer","Summer"]
[null,null,null,null,"Coincident",null,null,null,null,null,null,null,null,null,null,null,"Summer","Summer","Summer","Summer","Summer","Summer","Summer"]
[null,null,"ADJUSTMENTS - EMBEDDED GENERATION","MW","Non-coincident",null,null,null,null,null,null,null,null,null,null,null,0,0,0,0,0,0,0]
[null,null,null,null,"Coincident",null,null,null,null,null,null,null,null,null,null,null,0,0,0,0,0,0,0]
[null,null,"WEATHER CORRECTED MD 10% POE","MW","Non-coincident",null,null,null,null,null,null,null,null,null,null,null,66,65,65,65,64,63,63]
[null,null,null,null,"Coincident",null,null,null,null,null,null,null,null,null,null,null,66,65,65,65,64,63,63]
[null,null,"WEATHER CORRECTED MD 10% POE","MVA","Non-coincident",null,null,null,null,null,null,null,null,null,null,null,68,67,67,67,66,66,65]
[null,null,null,null,"Coincident",null,null,null,null,null,null,null,null,null,null,null,68,67,67,67,66,66,65]
[null,null,"WEATHER CORRECTED MD 50% POE","MW","Non-coincident",null,null,null,null,null,null,null,null,null,null,null,61,60,59,59,59,58,58]
[null,null,null,null,"Coincident",null,null,null,null,null,null,null,null,null,null,null,61,60,59,59,59,58,58]
[null,null,"WEATHER CORRECTED MD 50% POE","MVA","Non-coincident",null,null,null,null,null,null,null,null,null,null,null,63,62,61,61,61,60,60]
[null,null,null,null,"Coincident",null,null,null,null,null,null,null,null,null,null,null,63,62,61,61,61,60,60]
[null,"Ashgrove West (33)","CONNECTION POINT RATING","MVA","Non-coincident",null,null,null,null,null,null,null,null,null,null,null,179,179,179,179,179,179,179]
[null,null,null,null,"Coincident",null,null,null,null,null,null,null,null,null,null,null,179,179,179,179,179,179,179]
[null,null,"WINTER/SUMMER PEAKING",null,"Non-coincident",null,null,null,null,null,null,null,null,null,null,null,"Summer","Summer","Summer","Summer","Summer","Summer","Summer"]
[null,null,null,null,"Coincident",null,null,null,null,null,null,null,null,null,null,null,"Summer","Summer","Summer","Summer","Summer","Summer","Summer"]
[null,null,"ADJUSTMENTS - EMBEDDED GENERATION","MW","Non-coincident",null,null,null,null,null,null,null,null,null,null,null,0,0,0,0,0,0,0]
[null,null,null,null,"Coincident",null,null,null,null,null,null,null,null,null,null,null,0,0,0,0,0,0,0]
[null,null,"WEATHER CORRECTED MD 10% POE","MW","Non-coincident",null,null,null,null,null,null,null,null,null,null,null,73,72,71,72,71,71,71]
[null,null,null,null,"Coincident",null,null,null,null,null,null,null,null,null,null,null,73,72,71,72,71,71,71]
[null,null,"WEATHER CORRECTED MD 10% POE","MVA","Non-coincident",null,null,null,null,null,null,null,null,null,null,null,73,73,72,72,72,71,71]
[null,null,null,null,"Coincident",null,null,null,null,null,null,null,null,null,null,null,73,73,72,72,72,71,71]
[null,null,"WEATHER CORRECTED MD 50% POE","MW","Non-coincident",null,null,null,null,null,null,null,null,null,null,null,66,65,64,64,64,63,63]
[null,null,null,null,"Coincident",null,null,null,null,null,null,null,null,null,null,null,66,65,64,64,64,63,63]
[null,null,"WEATHER CORRECTED MD 50% POE","MVA","Non-coincident",null,null,null,null,null,null,null,null,null,null,null,66,65,65,65,65,64,64]
[null,null,null,null,"Coincident",null,null,null,null,null,null,null,null,null,null,null,66,65,65,65,65,64,64]
[null,"Belmont ","CONNECTION POINT RATING","MVA","Non-coincident",null,null,null,null,null,null,null,null,null,null,null,1636,1636,1636,1636,1636,1636,1636]
[null,null,null,null,"Coincident",null,null,null,null,null,null,null,null,null,null,null,1636,1636,1636,1636,1636,1636,1636]
[null,null,"WINTER/SUMMER PEAKING",null,"Non-coincident",null,null,null,null,null,null,null,null,null,null,null,"Summer","Summer","Summer","Summer","Summer","Summer","Summer"]
[null,null,null,null,"Coincident",null,null,null,null,null,null,null,null,null,null,null,"Summer","Summer","Summer","Summer","Summer","Summer","Summer"]
[null,null,"ADJUSTMENTS - EMBEDDED GENERATION","MW","Non-coincident",null,null,null,null,null,null,null,null,null,null,null,0,0,0,0,0,0,0]
[null,null,null,null,"Coincident",null,null,null,null,null,null,null,null,null,null,null,0,0,0,0,0,0,0]
[null,null,"WEATHER CORRECTED MD 10% POE","MW","Non-coincident",null,null,null,null,null,null,null,null,null,null,null,511,508,507,514,516,514,514]
[null,null,null,null,"Coincident",null,null,null,null,null,null,null,null,null,null,null,430,427,426,432,434,432,432]
[null,null,"WEATHER CORRECTED MD 10% POE","MVA","Non-coincident",null,null,null,null,null,null,null,null,null,null,null,523,520,519,526,528,525,525]
[null,null,null,null,"Coincident",null,null,null,null,null,null,null,null,null,null,null,440,437,436,442,444,442,442]
[null,null,"WEATHER CORRECTED MD 50% POE","MW","Non-coincident",null,null,null,null,null,null,null,null,null,null,null,486,481,479,486,488,484,484]
[null,null,null,null,"Coincident",null,null,null,null,null,null,null,null,null,null,null,409,405,403,409,411,407,408]
[null,null,"WEATHER CORRECTED MD 50% POE","MVA","Non-coincident",null,null,null,null,null,null,null,null,null,null,null,496,492,490,497,499,495,494]
[null,null,null,null,"Coincident",null,null,null,null,null,null,null,null,null,null,null,419,414,412,418,420,417,417]
[null,"Ashgrove West (110)","CONNECTION POINT RATING","MVA","Non-coincident",null,null,null,null,null,null,null,null,null,null,null,457,457,457,457,457,457,457]
[null,null,null,null,"Coincident",null,null,null,null,null,null,null,null,null,null,null,457,457,457,457,457,457,457]
[null,null,"WINTER/SUMMER PEAKING",null,"Non-coincident",null,null,null,null,null,null,null,null,null,null,null,"Summer","Summer","Summer","Summer","Summer","Summer","Summer"]
[null,null,null,null,"Coincident",null,null,null,null,null,null,null,null,null,null,null,"Summer","Summer","Summer","Summer","Summer","Summer","Summer"]
[null,null,"ADJUSTMENTS - EMBEDDED GENERATION","MW","Non-coincident",null,null,null,null,null,null,null,null,null,null,null,0,0,0,0,0,0,0]
[null,null,null,null,"Coincident",null,null,null,null,null,null,null,null,null,null,null,0,0,0,0,0,0,0]
[null,null,"WEATHER CORRECTED MD 10% POE","MW","Non-coincident",null,null,null,null,null,null,null,null,null,null,null,163,164,165,168,169,170,172]
[null,null,null,null,"Coincident",null,null,null,null,null,null,null,null,null,null,null,146,146,147,149,151,151,153]
[null,null,"WEATHER CORRECTED MD 10% POE","MVA","Non-coincident",null,null,null,null,null,null,null,null,null,null,null,165,166,167,170,171,172,174]
[null,null,null,null,"Coincident",null,null,null,null,null,null,null,null,null,null,null,156,157,157,160,161,162,164]
[null,null,"WEATHER CORRECTED MD 50% POE","MW","Non-coincident",null,null,null,null,null,null,null,null,null,null,null,154,154,155,158,159,159,161]
[null,null,null,null,"Coincident",null,null,null,null,null,null,null,null,null,null,null,137,138,138,140,141,142,143]
[null,null,"WEATHER CORRECTED MD 50% POE","MVA","Non-coincident",null,null,null,null,null,null,null,null,null,null,null,156,156,157,159,161,161,163]
[null,null,null,null,"Coincident",null,null,null,null,null,null,null,null,null,null,null,147,147,148,150,151,152,153]
[null,"Bundamba ","CONNECTION POINT RATING","MVA","Non-coincident",null,null,null,null,null,null,null,null,null,null,null,686,686,686,686,686,686,686]
[null,null,null,null,"Coincident",null,null,null,null,null,null,null,null,null,null,null,686,686,686,686,686,686,686]
[null,null,"WINTER/SUMMER PEAKING",null,"Non-coincident",null,null,null,null,null,null,null,null,null,null,null,"Summer","Summer","Summer","Summer","Summer","Summer","Summer"]
[null,null,null,null,"Coincident",null,null,null,null,null,null,null,null,null,null,null,"Summer","Summer","Summer","Summer","Summer","Summer","Summer"]
[null,null,"ADJUSTMENTS - EMBEDDED GENERATION","MW","Non-coincident",null,null,null,null,null,null,null,null,null,null,null,0,0,0,0,0,0,0]
[null,null,null,null,"Coincident",null,null,null,null,null,null,null,null,null,null,null,0,0,0,0,0,0,0]
[null,null,"WEATHER CORRECTED MD 10% POE","MW","Non-coincident",null,null,null,null,null,null,null,null,null,null,null,34,33,33,34,34,34,34]
[null,null,null,null,"Coincident",null,null,null,null,null,null,null,null,null,null,null,32,32,32,32,32,32,32]
[null,null,"WEATHER CORRECTED MD 10% POE","MVA","Non-coincident",null,null,null,null,null,null,null,null,null,null,null,37,36,36,37,37,37,37]
[null,null,null,null,"Coincident",null,null,null,null,null,null,null,null,null,null,null,36,35,35,36,36,36,36]
[null,null,"WEATHER CORRECTED MD 50% POE","MW","Non-coincident",null,null,null,null,null,null,null,null,null,null,null,32,32,32,32,32,32,32]
[null,null,null,null,"Coincident",null,null,null,null,null,null,null,null,null,null,null,31,31,30,31,31,31,31]
[null,null,"WEATHER CORRECTED MD 50% POE","MVA","Non-coincident",null,null,null,null,null,null,null,null,null,null,null,35,35,34,35,35,35,35]
[null,null,null,null,"Coincident",null,null,null,null,null,null,null,null,null,null,null,34,34,34,34,34,34,34]
[null,"Goodna","CONNECTION POINT RATING","MVA","Non-coincident",null,null,null,null,null,null,null,null,null,null,null,218,218,218,218,218,218,218]
[null,null,null,null,"Coincident",null,null,null,null,null,null,null,null,null,null,null,218,218,218,218,218,218,218]
[null,null,"WINTER/SUMMER PEAKING",null,"Non-coincident",null,null,null,null,null,null,null,null,null,null,null,"Summer","Summer","Summer","Summer","Summer","Summer","Summer"]
[null,null,null,null,"Coincident",null,null,null,null,null,null,null,null,null,null,null,"Summer","Summer","Summer","Summer","Summer","Summer","Summer"]
[null,null,"ADJUSTMENTS - EMBEDDED GENERATION","MW","Non-coincident",null,null,null,null,null,null,null,null,null,null,null,0,0,0,0,0,0,0]
[null,null,null,null,"Coincident",null,null,null,null,null,null,null,null,null,null,null,0,0,0,0,0,0,0]
[null,null,"WEATHER CORRECTED MD 10% POE","MW","Non-coincident",null,null,null,null,null,null,null,null,null,null,null,125,129,133,139,143,146,149]
[null,null,null,null,"Coincident",null,null,null,null,null,null,null,null,null,null,null,113,117,120,125,129,131,134]
[null,null,"WEATHER CORRECTED MD 10% POE","MVA","Non-coincident",null,null,null,null,null,null,null,null,null,null,null,125,129,133,139,144,146,149]
[null,null,null,null,"Coincident",null,null,null,null,null,null,null,null,null,null,null,114,117,120,126,130,131,134]
[null,null,"WEATHER CORRECTED MD 50% POE","MW","Non-coincident",null,null,null,null,null,null,null,null,null,null,null,114,117,121,126,130,132,135]
[null,null,null,null,"Coincident",null,null,null,null,null,null,null,null,null,null,null,104,107,109,114,118,119,122]
[null,null,"WEATHER CORRECTED MD 50% POE","MVA","Non-coincident",null,null,null,null,null,null,null,null,null,null,null,114,118,121,127,131,132,135]
[null,null,null,null,"Coincident",null,null,null,null,null,null,null,null,null,null,null,104,107,110,115,118,120,122]
[null,"Loganlea ","CONNECTION POINT RATING","MVA","Non-coincident",null,null,null,null,null,null,null,null,null,null,null,313,313,313,313,313,313,313]
[null,null,null,null,"Coincident",null,null,null,null,null,null,null,null,null,null,null,313,313,313,313,313,313,313]
[null,null,"WINTER/SUMMER PEAKING",null,"Non-coincident",null,null,null,null,null,null,null,null,null,null,null,"Summer","Summer","Summer","Summer","Summer","Summer","Summer"]
[null,null,null,null,"Coincident",null,null,null,null,null,null,null,null,null,null,null,"Summer","Summer","Summer","Summer","Summer","Summer","Summer"]
[null,null,"ADJUSTMENTS - EMBEDDED GENERATION","MW","Non-coincident",null,null,null,null,null,null,null,null,null,null,null,0,0,0,0,0,0,0]
[null,null,null,null,"Coincident",null,null,null,null,null,null,null,null,null,null,null,0,0,0,0,0,0,0]
[null,null,"WEATHER CORRECTED MD 10% POE","MW","Non-coincident",null,null,null,null,null,null,null,null,null,null,null,94,92,91,91,90,89,88]
[null,null,null,null,"Coincident",null,null,null,null,null,null,null,null,null,null,null,94,92,91,91,90,89,88]
[null,null,"WEATHER CORRECTED MD 10% POE","MVA","Non-coincident",null,null,null,null,null,null,null,null,null,null,null,95,93,92,91,91,89,89]
[null,null,null,null,"Coincident",null,null,null,null,null,null,null,null,null,null,null,95,93,92,91,91,89,89]
[null,null,"WEATHER CORRECTED MD 50% POE","MW","Non-coincident",null,null,null,null,null,null,null,null,null,null,null,86,85,83,83,82,81,80]
[null,null,null,null,"Coincident",null,null,null,null,null,null,null,null,null,null,null,86,85,83,83,82,81,80]
[null,null,"WEATHER CORRECTED MD 50% POE","MVA","Non-coincident",null,null,null,null,null,null,null,null,null,null,null,87,85,84,84,83,81,81]
[null,null,null,null,"Coincident",null,null,null,null,null,null,null,null,null,null,null,87,85,84,84,83,81,81]
[null,"Molendinar ","CONNECTION POINT RATING","MVA","Non-coincident",null,null,null,null,null,null,null,null,null,null,null,851,851,851,851,851,851,851]
[null,null,null,null,"Coincident",null,null,null,null,null,null,null,null,null,null,null,851,851,851,851,851,851,851]
[null,null,"WINTER/SUMMER PEAKING",null,"Non-coincident",null,null,null,null,null,null,null,null,null,null,null,"Summer","Summer","Summer","Summer","Summer","Summer","Summer"]
[null,null,null,null,"Coincident",null,null,null,null,null,null,null,null,null,null,null,"Summer","Summer","Summer","Summer","Summer","Summer","Summer"]
[null,null,"ADJUSTMENTS - EMBEDDED GENERATION","MW","Non-coincident",null,null,null,null,null,null,null,null,null,null,null,0,0,0,0,0,0,0]
[null,null,null,null,"Coincident",null,null,null,null,null,null,null,null,null,null,null,0,0,0,0,0,0,0]
[null,null,"WEATHER CORRECTED MD 10% POE","MW","Non-coincident",null,null,null,null,null,null,null,null,null,null,null,485,494,492,495,494,490,491]
[null,null,null,null,"Coincident",null,null,null,null,null,null,null,null,null,null,null,450,458,455,459,458,454,454]
[null,null,"WEATHER CORRECTED MD 10% POE","MVA","Non-coincident",null,null,null,null,null,null,null,null,null,null,null,487,495,493,497,496,491,492]
[null,null,null,null,"Coincident",null,null,null,null,null,null,null,null,null,null,null,451,459,457,460,459,455,456]
[null,null,"WEATHER CORRECTED MD 50% POE","MW","Non-coincident",null,null,null,null,null,null,null,null,null,null,null,443,450,447,451,449,444,444]
[null,null,null,null,"Coincident",null,null,null,null,null,null,null,null,null,null,null,411,418,415,418,417,412,412]
[null,null,"WEATHER CORRECTED MD 50% POE","MVA","Non-coincident",null,null,null,null,null,null,null,null,null,null,null,444,452,449,452,450,446,446]
[null,null,null,null,"Coincident",null,null,null,null,null,null,null,null,null,null,null,412,419,416,420,418,413,413]
[null,"Mudgeeraba (110)","CONNECTION POINT RATING","MVA","Non-coincident",null,null,null,null,null,null,null,null,null,null,null,1981,1981,1981,1981,1981,1981,1981]
[null,null,null,null,"Coincident",null,null,null,null,null,null,null,null,null,null,null,1981,1981,1981,1981,1981,1981,1981]
[null,null,"WINTER/SUMMER PEAKING",null,"Non-coincident",null,null,null,null,null,null,null,null,null,null,null,"Summer","Summer","Summer","Summer","Summer","Summer","Summer"]
[null,null,null,null,"Coincident",null,null,null,null,null,null,null,null,null,null,null,"Summer","Summer","Summer","Summer","Summer","Summer","Summer"]
[null,null,"ADJUSTMENTS - EMBEDDED GENERATION","MW","Non-coincident",null,null,null,null,null,null,null,null,null,null,null,0,0,0,0,0,0,0]
[null,null,null,null,"Coincident",null,null,null,null,null,null,null,null,null,null,null,0,0,0,0,0,0,0]
[null,null,"WEATHER CORRECTED MD 10% POE","MW","Non-coincident",null,null,null,null,null,null,null,null,null,null,null,296,298,295,296,294,290,288]
[null,null,null,null,"Coincident",null,null,null,null,null,null,null,null,null,null,null,269,270,268,269,268,264,263]
[null,null,"WEATHER CORRECTED MD 10% POE","MVA","Non-coincident",null,null,null,null,null,null,null,null,null,null,null,307,308,306,307,304,301,299]
[null,null,null,null,"Coincident",null,null,null,null,null,null,null,null,null,null,null,281,283,280,282,280,276,275]
[null,null,"WEATHER CORRECTED MD 50% POE","MW","Non-coincident",null,null,null,null,null,null,null,null,null,null,null,277,278,275,276,274,270,268]
[null,null,null,null,"Coincident",null,null,null,null,null,null,null,null,null,null,null,251,252,249,251,249,245,243]
[null,null,"WEATHER CORRECTED MD 50% POE","MVA","Non-coincident",null,null,null,null,null,null,null,null,null,null,null,287,288,285,286,284,280,278]
[null,null,null,null,"Coincident",null,null,null,null,null,null,null,null,null,null,null,262,264,261,262,260,256,254]
[null,"Mudgeeraba (33)","CONNECTION POINT RATING","MVA","Non-coincident",null,null,null,null,null,null,null,null,null,null,null,101,101,101,101,101,101,101]
[null,null,null,null,"Coincident",null,null,null,null,null,null,null,null,null,null,null,101,101,101,101,101,101,101]
[null,null,"WINTER/SUMMER PEAKING",null,"Non-coincident",null,null,null,null,null,null,null,null,null,null,null,"Summer","Summer","Summer","Summer","Summer","Summer","Summer"]
[null,null,null,null,"Coincident",null,null,null,null,null,null,null,null,null,null,null,"Summer","Summer","Summer","Summer","Summer","Summer","Summer"]
[null,null,"ADJUSTMENTS - EMBEDDED GENERATION","MW","Non-coincident",null,null,null,null,null,null,null,null,null,null,null,0,0,0,0,0,0,0]
[null,null,null,null,"Coincident",null,null,null,null,null,null,null,null,null,null,null,0,0,0,0,0,0,0]
[null,null,"WEATHER CORRECTED MD 10% POE","MW","Non-coincident",null,null,null,null,null,null,null,null,null,null,null,22,22,21,21,21,21,21]
[null,null,null,null,"Coincident",null,null,null,null,null,null,null,null,null,null,null,18,18,17,17,17,17,17]
[null,null,"WEATHER CORRECTED MD 10% POE","MVA","Non-coincident",null,null,null,null,null,null,null,null,null,null,null,23,23,23,23,23,23,22]
[null,null,null,null,"Coincident",null,null,null,null,null,null,null,null,null,null,null,19,19,19,19,19,18,18]
[null,null,"WEATHER CORRECTED MD 50% POE","MW","Non-coincident",null,null,null,null,null,null,null,null,null,null,null,17,17,17,17,17,17,17]
[null,null,null,null,"Coincident",null,null,null,null,null,null,null,null,null,null,null,14,14,14,14,14,14,14]
[null,null,"WEATHER CORRECTED MD 50% POE","MVA","Non-coincident",null,null,null,null,null,null,null,null,null,null,null,19,18,18,18,18,18,18]
[null,null,null,null,"Coincident",null,null,null,null,null,null,null,null,null,null,null,15,15,15,15,15,15,15]
[null,"Murarrie (Belmont) ","CONNECTION POINT RATING","MVA","Non-coincident",null,null,null,null,null,null,null,null,null,null,null,3217,3217,3217,3217,3217,3217,3217]
[null,null,null,null,"Coincident",null,null,null,null,null,null,null,null,null,null,null,3217,3217,3217,3217,3217,3217,3217]
[null,null,"WINTER/SUMMER PEAKING",null,"Non-coincident",null,null,null,null,null,null,null,null,null,null,null,"Summer","Summer","Summer","Summer","Summer","Summer","Summer"]
[null,null,null,null,"Coincident",null,null,null,null,null,null,null,null,null,null,null,"Summer","Summer","Summer","Summer","Summer","Summer","Summer"]
[null,null,"ADJUSTMENTS - EMBEDDED GENERATION","MW","Non-coincident",null,null,null,null,null,null,null,null,null,null,null,0,0,0,0,0,0,0]
[null,null,null,null,"Coincident",null,null,null,null,null,null,null,null,null,null,null,0,0,0,0,0,0,0]
[null,null,"WEATHER CORRECTED MD 10% POE","MW","Non-coincident",null,null,null,null,null,null,null,null,null,null,null,359,377,376,367,368,393,394]
[null,null,null,null,"Coincident",null,null,null,null,null,null,null,null,null,null,null,359,377,376,367,368,393,394]
[null,null,"WEATHER CORRECTED MD 10% POE","MVA","Non-coincident",null,null,null,null,null,null,null,null,null,null,null,366,384,383,374,375,400,401]
[null,null,null,null,"Coincident",null,null,null,null,null,null,null,null,null,null,null,366,384,383,374,375,400,401]
[null,null,"WEATHER CORRECTED MD 50% POE","MW","Non-coincident",null,null,null,null,null,null,null,null,null,null,null,340,359,358,348,349,375,376]
[null,null,null,null,"Coincident",null,null,null,null,null,null,null,null,null,null,null,340,359,358,348,349,375,376]
[null,null,"WEATHER CORRECTED MD 50% POE","MVA","Non-coincident",null,null,null,null,null,null,null,null,null,null,null,347,365,364,354,356,382,383]
[null,null,null,null,"Coincident",null,null,null,null,null,null,null,null,null,null,null,347,365,364,354,356,382,383]
[null,"Palmwoods ","CONNECTION POINT RATING","MVA","Non-coincident",null,null,null,null,null,null,null,null,null,null,null,827,827,827,827,827,827,827]
[null,null,null,null,"Coincident",null,null,null,null,null,null,null,null,null,null,null,827,827,827,827,827,827,827]
[null,null,"WINTER/SUMMER PEAKING",null,"Non-coincident",null,null,null,null,null,null,null,null,null,null,null,"Summer","Summer","Summer","Summer","Summer","Summer","Summer"]
[null,null,null,null,"Coincident",null,null,null,null,null,null,null,null,null,null,null,"Summer","Summer","Summer","Summer","Summer","Summer","Summer"]
[null,null,"ADJUSTMENTS - EMBEDDED GENERATION","MW","Non-coincident",null,null,null,null,null,null,null,null,null,null,null,0,0,0,0,0,0,0]
[null,null,null,null,"Coincident",null,null,null,null,null,null,null,null,null,null,null,0,0,0,0,0,0,0]
[null,null,"WEATHER CORRECTED MD 10% POE","MW","Non-coincident",null,null,null,null,null,null,null,null,null,null,null,292,294,296,305,309,310,313]
[null,null,null,null,"Coincident",null,null,null,null,null,null,null,null,null,null,null,285,286,288,298,302,303,305]
[null,null,"WEATHER CORRECTED MD 10% POE","MVA","Non-coincident",null,null,null,null,null,null,null,null,null,null,null,319,321,323,333,338,339,342]
[null,null,null,null,"Coincident",null,null,null,null,null,null,null,null,null,null,null,315,317,319,329,334,335,338]
[null,null,"WEATHER CORRECTED MD 50% POE","MW","Non-coincident",null,null,null,null,null,null,null,null,null,null,null,269,270,272,281,285,286,288]
[null,null,null,null,"Coincident",null,null,null,null,null,null,null,null,null,null,null,264,264,266,275,278,279,281]
[null,null,"WEATHER CORRECTED MD 50% POE","MVA","Non-coincident",null,null,null,null,null,null,null,null,null,null,null,294,296,298,307,311,312,315]
[null,null,null,null,"Coincident",null,null,null,null,null,null,null,null,null,null,null,292,292,294,304,308,308,311]
[null,"Redbank Plains ","CONNECTION POINT RATING","MVA","Non-coincident",null,null,null,null,null,null,null,null,null,null,null,66,66,66,66,66,66,66]
[null,null,null,null,"Coincident",null,null,null,null,null,null,null,null,null,null,null,66,66,66,66,66,66,66]
[null,null,"WINTER/SUMMER PEAKING",null,"Non-coincident",null,null,null,null,null,null,null,null,null,null,null,"Summer","Summer","Summer","Summer","Summer","Summer","Summer"]
[null,null,null,null,"Coincident",null,null,null,null,null,null,null,null,null,null,null,"Summer","Summer","Summer","Summer","Summer","Summer","Summer"]
[null,null,"ADJUSTMENTS - EMBEDDED GENERATION","MW","Non-coincident",null,null,null,null,null,null,null,null,null,null,null,0,0,0,0,0,0,0]
[null,null,null,null,"Coincident",null,null,null,null,null,null,null,null,null,null,null,0,0,0,0,0,0,0]
[null,null,"WEATHER CORRECTED MD 10% POE","MW","Non-coincident",null,null,null,null,null,null,null,null,null,null,null,20,20,20,21,21,22,22]
[null,null,null,null,"Coincident",null,null,null,null,null,null,null,null,null,null,null,18,18,18,19,19,19,20]
[null,null,"WEATHER CORRECTED MD 10% POE","MVA","Non-coincident",null,null,null,null,null,null,null,null,null,null,null,21,21,21,22,22,23,23]
[null,null,null,null,"Coincident",null,null,null,null,null,null,null,null,null,null,null,19,19,19,20,20,21,21]
[null,null,"WEATHER CORRECTED MD 50% POE","MW","Non-coincident",null,null,null,null,null,null,null,null,null,null,null,18,18,18,19,19,19,19]
[null,null,null,null,"Coincident",null,null,null,null,null,null,null,null,null,null,null,16,16,16,17,17,17,17]
[null,null,"WEATHER CORRECTED MD 50% POE","MVA","Non-coincident",null,null,null,null,null,null,null,null,null,null,null,18,19,19,19,20,20,20]
[null,null,null,null,"Coincident",null,null,null,null,null,null,null,null,null,null,null,17,17,17,18,18,18,18]
[null,"Richlands ","CONNECTION POINT RATING","MVA","Non-coincident",null,null,null,null,null,null,null,null,null,null,null,336,336,336,336,336,336,336]
[null,null,null,null,"Coincident",null,null,null,null,null,null,null,null,null,null,null,336,336,336,336,336,336,336]
[null,null,"WINTER/SUMMER PEAKING",null,"Non-coincident",null,null,null,null,null,null,null,null,null,null,null,"Summer","Summer","Summer","Summer","Summer","Summer","Summer"]
[null,null,null,null,"Coincident",null,null,null,null,null,null,null,null,null,null,null,"Summer","Summer","Summer","Summer","Summer","Summer","Summer"]
[null,null,"ADJUSTMENTS - EMBEDDED GENERATION","MW","Non-coincident",null,null,null,null,null,null,null,null,null,null,null,0,0,0,0,0,0,0]
[null,null,null,null,"Coincident",null,null,null,null,null,null,null,null,null,null,null,0,0,0,0,0,0,0]
[null,null,"WEATHER CORRECTED MD 10% POE","MW","Non-coincident",null,null,null,null,null,null,null,null,null,null,null,107,106,105,106,105,104,104]
[null,null,null,null,"Coincident",null,null,null,null,null,null,null,null,null,null,null,106,105,104,104,104,103,103]
[null,null,"WEATHER CORRECTED MD 10% POE","MVA","Non-coincident",null,null,null,null,null,null,null,null,null,null,null,112,111,110,111,110,109,109]
[null,null,null,null,"Coincident",null,null,null,null,null,null,null,null,null,null,null,110,108,107,108,108,107,106]
[null,null,"WEATHER CORRECTED MD 50% POE","MW","Non-coincident",null,null,null,null,null,null,null,null,null,null,null,101,99,98,99,98,97,97]
[null,null,null,null,"Coincident",null,null,null,null,null,null,null,null,null,null,null,99,98,97,97,97,96,95]
[null,null,"WEATHER CORRECTED MD 50% POE","MVA","Non-coincident",null,null,null,null,null,null,null,null,null,null,null,105,104,103,103,103,102,101]
[null,null,null,null,"Coincident",null,null,null,null,null,null,null,null,null,null,null,103,102,100,101,100,99,99]
[null,"Runcorn ","CONNECTION POINT RATING","MVA","Non-coincident",null,null,null,null,null,null,null,null,null,null,null,190,190,190,190,190,190,190]
[null,null,null,null,"Coincident",null,null,null,null,null,null,null,null,null,null,null,190,190,190,190,190,190,190]
[null,null,"WINTER/SUMMER PEAKING",null,"Non-coincident",null,null,null,null,null,null,null,null,null,null,null,"Summer","Summer","Summer","Summer","Summer","Summer","Summer"]
[null,null,null,null,"Coincident",null,null,null,null,null,null,null,null,null,null,null,"Summer","Summer","Summer","Summer","Summer","Summer","Summer"]
[null,null,"ADJUSTMENTS - EMBEDDED GENERATION","MW","Non-coincident",null,null,null,null,null,null,null,null,null,null,null,0,0,0,0,0,0,0]
[null,null,null,null,"Coincident",null,null,null,null,null,null,null,null,null,null,null,0,0,0,0,0,0,0]
[null,null,"WEATHER CORRECTED MD 10% POE","MW","Non-coincident",null,null,null,null,null,null,null,null,null,null,null,60,59,58,59,58,57,57]
[null,null,null,null,"Coincident",null,null,null,null,null,null,null,null,null,null,null,60,59,58,59,58,57,57]
[null,null,"WEATHER CORRECTED MD 10% POE","MVA","Non-coincident",null,null,null,null,null,null,null,null,null,null,null,60,59,58,59,59,58,57]
[null,null,null,null,"Coincident",null,null,null,null,null,null,null,null,null,null,null,60,59,58,59,59,58,57]
[null,null,"WEATHER CORRECTED MD 50% POE","MW","Non-coincident",null,null,null,null,null,null,null,null,null,null,null,56,55,54,55,54,53,53]
[null,null,null,null,"Coincident",null,null,null,null,null,null,null,null,null,null,null,56,55,54,55,54,53,53]
[null,null,"WEATHER CORRECTED MD 50% POE","MVA","Non-coincident",null,null,null,null,null,null,null,null,null,null,null,56,55,54,55,54,53,53]
[null,null,null,null,"Coincident",null,null,null,null,null,null,null,null,null,null,null,56,55,54,55,54,53,53]
[null,"South Pine ","CONNECTION POINT RATING","MVA","Non-coincident",null,null,null,null,null,null,null,null,null,null,null,5775,5775,5775,5775,5775,5775,5775]
[null,null,null,null,"Coincident",null,null,null,null,null,null,null,null,null,null,null,5775,5775,5775,5775,5775,5775,5775]
[null,null,"WINTER/SUMMER PEAKING",null,"Non-coincident",null,null,null,null,null,null,null,null,null,null,null,"Summer","Summer","Summer","Summer","Summer","Summer","Summer"]
[null,null,null,null,"Coincident",null,null,null,null,null,null,null,null,null,null,null,"Summer","Summer","Summer","Summer","Summer","Summer","Summer"]
[null,null,"ADJUSTMENTS - EMBEDDED GENERATION","MW","Non-coincident",null,null,null,null,null,null,null,null,null,null,null,0,0,0,0,0,0,0]
[null,null,null,null,"Coincident",null,null,null,null,null,null,null,null,null,null,null,0,0,0,0,0,0,0]
[null,null,"WEATHER CORRECTED MD 10% POE","MW","Non-coincident",null,null,null,null,null,null,null,null,null,null,null,910,916,913,920,919,914,916]
[null,null,null,null,"Coincident",null,null,null,null,null,null,null,null,null,null,null,907,913,909,916,916,911,912]
[null,null,"WEATHER CORRECTED MD 10% POE","MVA","Non-coincident",null,null,null,null,null,null,null,null,null,null,null,919,925,922,929,928,923,925]
[null,null,null,null,"Coincident",null,null,null,null,null,null,null,null,null,null,null,916,923,918,925,925,919,921]
[null,null,"WEATHER CORRECTED MD 50% POE","MW","Non-coincident",null,null,null,null,null,null,null,null,null,null,null,830,835,831,837,836,831,832]
[null,null,null,null,"Coincident",null,null,null,null,null,null,null,null,null,null,null,830,835,830,836,835,829,830]
[null,null,"WEATHER CORRECTED MD 50% POE","MVA","Non-coincident",null,null,null,null,null,null,null,null,null,null,null,839,844,840,846,844,839,840]
[null,null,null,null,"Coincident",null,null,null,null,null,null,null,null,null,null,null,838,843,838,844,843,837,838]
[null,"Sumner","CONNECTION POINT RATING","MVA","Non-coincident",null,null,null,null,null,null,null,null,null,null,null,381,381,381,381,381,381,381]
[null,null,null,null,"Coincident",null,null,null,null,null,null,null,null,null,null,null,381,381,381,381,381,381,381]
[null,null,"WINTER/SUMMER PEAKING",null,"Non-coincident",null,null,null,null,null,null,null,null,null,null,null,"Summer","Summer","Summer","Summer","Summer","Summer","Summer"]
[null,null,null,null,"Coincident",null,null,null,null,null,null,null,null,null,null,null,"Summer","Summer","Summer","Summer","Summer","Summer","Summer"]
[null,null,"ADJUSTMENTS - EMBEDDED GENERATION","MW","Non-coincident",null,null,null,null,null,null,null,null,null,null,null,0,0,0,0,0,0,0]
[null,null,null,null,"Coincident",null,null,null,null,null,null,null,null,null,null,null,0,0,0,0,0,0,0]
[null,null,"WEATHER CORRECTED MD 10% POE","MW","Non-coincident",null,null,null,null,null,null,null,null,null,null,null,40,40,45,50,49,49,48]
[null,null,null,null,"Coincident",null,null,null,null,null,null,null,null,null,null,null,40,39,44,49,49,48,48]
[null,null,"WEATHER CORRECTED MD 10% POE","MVA","Non-coincident",null,null,null,null,null,null,null,null,null,null,null,45,44,49,55,55,54,54]
[null,null,null,null,"Coincident",null,null,null,null,null,null,null,null,null,null,null,44,44,49,54,54,53,53]
[null,null,"WEATHER CORRECTED MD 50% POE","MW","Non-coincident",null,null,null,null,null,null,null,null,null,null,null,36,36,40,45,45,44,44]
[null,null,null,null,"Coincident",null,null,null,null,null,null,null,null,null,null,null,36,35,40,45,44,44,43]
[null,null,"WEATHER CORRECTED MD 50% POE","MVA","Non-coincident",null,null,null,null,null,null,null,null,null,null,null,40,40,45,50,50,49,49]
[null,null,null,null,"Coincident",null,null,null,null,null,null,null,null,null,null,null,40,39,44,50,49,49,48]
[null,"Blackstone ","CONNECTION POINT RATING","MVA","Non-coincident",null,null,null,null,null,null,null,null,null,null,null,800,800,800,800,800,800,800]
[null,null,null,null,"Coincident",null,null,null,null,null,null,null,null,null,null,null,800,800,800,800,800,800,800]
[null,null,"WINTER/SUMMER PEAKING",null,"Non-coincident",null,null,null,null,null,null,null,null,null,null,null,"Summer","Summer","Summer","Summer","Summer","Summer","Summer"]
[null,null,null,null,"Coincident",null,null,null,null,null,null,null,null,null,null,null,"Summer","Summer","Summer","Summer","Summer","Summer","Summer"]
[null,null,"ADJUSTMENTS - EMBEDDED GENERATION","MW","Non-coincident",null,null,null,null,null,null,null,null,null,null,null,0,0,0,0,0,0,0]
[null,null,null,null,"Coincident",null,null,null,null,null,null,null,null,null,null,null,0,0,0,0,0,0,0]
[null,null,"WEATHER CORRECTED MD 10% POE","MW","Non-coincident",null,null,null,null,null,null,null,null,null,null,null,95,95,94,98,98,98,98]
[null,null,null,null,"Coincident",null,null,null,null,null,null,null,null,null,null,null,94,93,93,95,96,96,96]
[null,null,"WEATHER CORRECTED MD 10% POE","MVA","Non-coincident",null,null,null,null,null,null,null,null,null,null,null,99,98,98,101,102,101,102]
[null,null,null,null,"Coincident",null,null,null,null,null,null,null,null,null,null,null,98,98,97,100,100,100,100]
[null,null,"WEATHER CORRECTED MD 50% POE","MW","Non-coincident",null,null,null,null,null,null,null,null,null,null,null,87,86,86,89,90,89,90]
[null,null,null,null,"Coincident",null,null,null,null,null,null,null,null,null,null,null,86,85,85,87,87,87,87]
[null,null,"WEATHER CORRECTED MD 50% POE","MVA","Non-coincident",null,null,null,null,null,null,null,null,null,null,null,90,89,89,92,93,92,92]
[null,null,null,null,"Coincident",null,null,null,null,null,null,null,null,null,null,null,90,89,89,91,91,91,91]
[null,"Tennyson ","CONNECTION POINT RATING","MVA","Non-coincident",null,null,null,null,null,null,null,null,null,null,null,264,264,264,264,264,264,264]
[null,null,null,null,"Coincident",null,null,null,null,null,null,null,null,null,null,null,264,264,264,264,264,264,264]
[null,null,"WINTER/SUMMER PEAKING",null,"Non-coincident",null,null,null,null,null,null,null,null,null,null,null,"Summer","Summer","Summer","Summer","Summer","Summer","Summer"]
[null,null,null,null,"Coincident",null,null,null,null,null,null,null,null,null,null,null,"Summer","Summer","Summer","Summer","Summer","Summer","Summer"]
[null,null,"ADJUSTMENTS - EMBEDDED GENERATION","MW","Non-coincident",null,null,null,null,null,null,null,null,null,null,null,0,0,0,0,0,0,0]
[null,null,null,null,"Coincident",null,null,null,null,null,null,null,null,null,null,null,0,0,0,0,0,0,0]
[null,null,"WEATHER CORRECTED MD 10% POE","MW","Non-coincident",null,null,null,null,null,null,null,null,null,null,null,173,188,186,172,171,168,168]
[null,null,null,null,"Coincident",null,null,null,null,null,null,null,null,null,null,null,173,188,186,172,171,168,168]
[null,null,"WEATHER CORRECTED MD 10% POE","MVA","Non-coincident",null,null,null,null,null,null,null,null,null,null,null,174,189,187,173,173,169,169]
[null,null,null,null,"Coincident",null,null,null,null,null,null,null,null,null,null,null,174,189,187,173,172,169,168]
[null,null,"WEATHER CORRECTED MD 50% POE","MW","Non-coincident",null,null,null,null,null,null,null,null,null,null,null,160,175,173,158,158,154,154]
[null,null,null,null,"Coincident",null,null,null,null,null,null,null,null,null,null,null,160,175,173,158,158,154,154]
[null,null,"WEATHER CORRECTED MD 50% POE","MVA","Non-coincident",null,null,null,null,null,null,null,null,null,null,null,161,177,175,160,159,155,155]
[null,null,null,null,"Coincident",null,null,null,null,null,null,null,null,null,null,null,161,176,174,159,158,155,154]
[null,"Tennyson (Rail) ","CONNECTION POINT RATING","MVA","Non-coincident",null,null,null,null,null,null,null,null,null,null,null,301,301,301,301,301,301,301]
[null,null,null,null,"Coincident",null,null,null,null,null,null,null,null,null,null,null,301,301,301,301,301,301,301]
[null,null,"WINTER/SUMMER PEAKING",null,"Non-coincident",null,null,null,null,null,null,null,null,null,null,null,"Summer","Summer","Summer","Summer","Summer","Summer","Summer"]
[null,null,null,null,"Coincident",null,null,null,null,null,null,null,null,null,null,null,"Summer","Summer","Summer","Summer","Summer","Summer","Summer"]
[null,null,"ADJUSTMENTS - EMBEDDED GENERATION","MW","Non-coincident",null,null,null,null,null,null,null,null,null,null,null,0,0,0,0,0,0,0]
[null,null,null,null,"Coincident",null,null,null,null,null,null,null,null,null,null,null,0,0,0,0,0,0,0]
[null,null,"WEATHER CORRECTED MD 10% POE","MW","Non-coincident"]
[null,null,null,null,"Coincident"]
[null,null,"WEATHER CORRECTED MD 10% POE","MVA","Non-coincident"]
[null,null,null,null,"Coincident"]
[null,null,"WEATHER CORRECTED MD 50% POE","MW","Non-coincident"]
[null,null,null,null,"Coincident"]
[null,null,"WEATHER CORRECTED MD 50% POE","MVA","Non-coincident"]
[null,null,null,null,"Coincident"]
[null,"Wecker Road ","CONNECTION POINT RATING","MVA","Non-coincident",null,null,null,null,null,null,null,null,null,null,null,307,307,307,307,307,307,307]
[null,null,null,null,"Coincident",null,null,null,null,null,null,null,null,null,null,null,307,307,307,307,307,307,307]
[null,null,"WINTER/SUMMER PEAKING",null,"Non-coincident",null,null,null,null,null,null,null,null,null,null,null,"Summer","Summer","Summer","Summer","Summer","Summer","Summer"]
[null,null,null,null,"Coincident",null,null,null,null,null,null,null,null,null,null,null,"Summer","Summer","Summer","Summer","Summer","Summer","Summer"]
[null,null,"ADJUSTMENTS - EMBEDDED GENERATION","MW","Non-coincident",null,null,null,null,null,null,null,null,null,null,null,0,0,0,0,0,0,0]
[null,null,null,null,"Coincident",null,null,null,null,null,null,null,null,null,null,null,0,0,0,0,0,0,0]
[null,null,"WEATHER CORRECTED MD 10% POE","MW","Non-coincident",null,null,null,null,null,null,null,null,null,null,null,135,134,135,137,136,135,134]
[null,null,null,null,"Coincident",null,null,null,null,null,null,null,null,null,null,null,135,134,135,137,136,135,134]
[null,null,"WEATHER CORRECTED MD 10% POE","MVA","Non-coincident",null,null,null,null,null,null,null,null,null,null,null,137,136,137,139,138,136,136]
[null,null,null,null,"Coincident",null,null,null,null,null,null,null,null,null,null,null,137,136,137,139,138,136,136]
[null,null,"WEATHER CORRECTED MD 50% POE","MW","Non-coincident",null,null,null,null,null,null,null,null,null,null,null,123,122,123,125,124,122,121]
[null,null,null,null,"Coincident",null,null,null,null,null,null,null,null,null,null,null,123,122,123,125,124,122,121]
[null,null,"WEATHER CORRECTED MD 50% POE","MVA","Non-coincident",null,null,null,null,null,null,null,null,null,null,null,124,123,124,126,125,123,123]
[null,null,null,null,"Coincident",null,null,null,null,null,null,null,null,null,null,null,124,123,124,126,125,123,123]
[null,"Alan Sherriff ","CONNECTION POINT RATING","MVA","Non-coincident",null,null,null,null,null,null,null,null,null,null,null,457,457,457,457,457,457,457]
[null,null,null,null,"Coincident",null,null,null,null,null,null,null,null,null,null,null,457,457,457,457,457,457,457]
[null,null,"WINTER/SUMMER PEAKING",null,"Non-coincident",null,null,null,null,null,null,null,null,null,null,null,"Summer","Summer","Summer","Summer","Summer","Summer","Summer"]
[null,null,null,null,"Coincident",null,null,null,null,null,null,null,null,null,null,null,"Summer","Summer","Summer","Summer","Summer","Summer","Summer"]
[null,null,"ADJUSTMENTS - EMBEDDED GENERATION","MW","Non-coincident",null,null,null,null,null,null,null,null,null,null,null,0,0,0,0,0,0,0]
[null,null,null,null,"Coincident",null,null,null,null,null,null,null,null,null,null,null,0,0,0,0,0,0,0]
[null,null,"WEATHER CORRECTED MD 10% POE","MW","Non-coincident",null,null,null,null,null,null,null,null,null,null,null,31,31,31,32,32,32,32]
[null,null,null,null,"Coincident",null,null,null,null,null,null,null,null,null,null,null,29,29,29,30,30,30,30]
[null,null,"WEATHER CORRECTED MD 10% POE","MVA","Non-coincident",null,null,null,null,null,null,null,null,null,null,null,34,35,35,35,36,36,36]
[null,null,null,null,"Coincident",null,null,null,null,null,null,null,null,null,null,null,32,33,33,34,34,34,34]
[null,null,"WEATHER CORRECTED MD 50% POE","MW","Non-coincident",null,null,null,null,null,null,null,null,null,null,null,25,26,26,26,26,27,26]
[null,null,null,null,"Coincident",null,null,null,null,null,null,null,null,null,null,null,24,24,24,25,25,25,25]
[null,null,"WEATHER CORRECTED MD 50% POE","MVA","Non-coincident",null,null,null,null,null,null,null,null,null,null,null,28,28,29,29,29,29,29]
[null,null,null,null,"Coincident",null,null,null,null,null,null,null,null,null,null,null,27,27,27,28,28,28,28]
[null,"Alligator Creek (33)","CONNECTION POINT RATING","MVA","Non-coincident",null,null,null,null,null,null,null,null,null,null,null,251,251,251,251,251,251,251]
[null,null,null,null,"Coincident",null,null,null,null,null,null,null,null,null,null,null,251,251,251,251,251,251,251]
[null,null,"WINTER/SUMMER PEAKING",null,"Non-coincident",null,null,null,null,null,null,null,null,null,null,null,"Summer","Summer","Summer","Summer","Summer","Summer","Summer"]
[null,null,null,null,"Coincident",null,null,null,null,null,null,null,null,null,null,null,"Summer","Summer","Summer","Summer","Summer","Summer","Summer"]
[null,null,"ADJUSTMENTS - EMBEDDED GENERATION","MW","Non-coincident",null,null,null,null,null,null,null,null,null,null,null,0,0,0,0,0,0,0]
[null,null,null,null,"Coincident",null,null,null,null,null,null,null,null,null,null,null,0,0,0,0,0,0,0]
[null,null,"WEATHER CORRECTED MD 10% POE","MW","Non-coincident",null,null,null,null,null,null,null,null,null,null,null,41,45,45,45,45,45,44]
[null,null,null,null,"Coincident",null,null,null,null,null,null,null,null,null,null,null,16,18,18,18,18,17,17]
[null,null,"WEATHER CORRECTED MD 10% POE","MVA","Non-coincident",null,null,null,null,null,null,null,null,null,null,null,44,48,48,48,48,48,47]
[null,null,null,null,"Coincident",null,null,null,null,null,null,null,null,null,null,null,17,19,19,19,18,18,18]
[null,null,"WEATHER CORRECTED MD 50% POE","MW","Non-coincident",null,null,null,null,null,null,null,null,null,null,null,38,42,41,41,41,41,40]
[null,null,null,null,"Coincident",null,null,null,null,null,null,null,null,null,null,null,15,16,16,16,16,16,16]
[null,null,"WEATHER CORRECTED MD 50% POE","MVA","Non-coincident",null,null,null,null,null,null,null,null,null,null,null,40,44,44,44,44,43,43]
[null,null,null,null,"Coincident",null,null,null,null,null,null,null,null,null,null,null,15,17,17,17,17,17,16]
[null,"Biloela ","CONNECTION POINT RATING","MVA","Non-coincident",null,null,null,null,null,null,null,null,null,null,null,240,200,200,200,200,200,200]
[null,null,null,null,"Coincident",null,null,null,null,null,null,null,null,null,null,null,240,200,200,200,200,200,200]
[null,null,"WINTER/SUMMER PEAKING",null,"Non-coincident",null,null,null,null,null,null,null,null,null,null,null,"Summer","Summer","Summer","Summer","Summer","Summer","Summer"]
[null,null,null,null,"Coincident",null,null,null,null,null,null,null,null,null,null,null,"Summer","Summer","Summer","Summer","Summer","Summer","Summer"]
[null,null,"ADJUSTMENTS - EMBEDDED GENERATION","MW","Non-coincident",null,null,null,null,null,null,null,null,null,null,null,0,0,0,0,0,0,0]
[null,null,null,null,"Coincident",null,null,null,null,null,null,null,null,null,null,null,0,0,0,0,0,0,0]
[null,null,"WEATHER CORRECTED MD 10% POE","MW","Non-coincident",null,null,null,null,null,null,null,null,null,null,null,36,36,36,36,36,36,37]
[null,null,null,null,"Coincident",null,null,null,null,null,null,null,null,null,null,null,29,29,29,29,29,29,29]
[null,null,"WEATHER CORRECTED MD 10% POE","MVA","Non-coincident",null,null,null,null,null,null,null,null,null,null,null,36,36,36,36,36,36,37]
[null,null,null,null,"Coincident",null,null,null,null,null,null,null,null,null,null,null,30,30,29,30,29,29,30]
[null,null,"WEATHER CORRECTED MD 50% POE","MW","Non-coincident",null,null,null,null,null,null,null,null,null,null,null,34,34,34,34,33,34,34]
[null,null,null,null,"Coincident",null,null,null,null,null,null,null,null,null,null,null,28,28,27,27,27,27,28]
[null,null,"WEATHER CORRECTED MD 50% POE","MVA","Non-coincident",null,null,null,null,null,null,null,null,null,null,null,34,34,34,34,33,34,34]
[null,null,null,null,"Coincident",null,null,null,null,null,null,null,null,null,null,null,28,28,28,28,27,28,28]
[null,"Blackwater (66)","CONNECTION POINT RATING","MVA","Non-coincident",null,null,null,null,null,null,null,null,null,null,null,372,372,372,372,372,372,372]
[null,null,null,null,"Coincident",null,null,null,null,null,null,null,null,null,null,null,372,372,372,372,372,372,372]
[null,null,"WINTER/SUMMER PEAKING",null,"Non-coincident",null,null,null,null,null,null,null,null,null,null,null,"Summer","Summer","Summer","Summer","Summer","Summer","Summer"]
[null,null,null,null,"Coincident",null,null,null,null,null,null,null,null,null,null,null,"Summer","Summer","Summer","Summer","Summer","Summer","Summer"]
[null,null,"ADJUSTMENTS - EMBEDDED GENERATION","MW","Non-coincident",null,null,null,null,null,null,null,null,null,null,null,0,0,0,0,0,0,0]
[null,null,null,null,"Coincident",null,null,null,null,null,null,null,null,null,null,null,0,0,0,0,0,0,0]
[null,null,"WEATHER CORRECTED MD 10% POE","MW","Non-coincident",null,null,null,null,null,null,null,null,null,null,null,121,120,119,119,117,127,137]
[null,null,null,null,"Coincident",null,null,null,null,null,null,null,null,null,null,null,107,107,105,105,103,115,128]
[null,null,"WEATHER CORRECTED MD 10% POE","MVA","Non-coincident",null,null,null,null,null,null,null,null,null,null,null,122,121,120,120,118,128,139]
[null,null,null,null,"Coincident",null,null,null,null,null,null,null,null,null,null,null,109,108,106,106,104,116,129]
[null,null,"WEATHER CORRECTED MD 50% POE","MW","Non-coincident",null,null,null,null,null,null,null,null,null,null,null,116,115,113,113,111,120,130]
[null,null,null,null,"Coincident",null,null,null,null,null,null,null,null,null,null,null,104,103,101,101,99,110,123]
[null,null,"WEATHER CORRECTED MD 50% POE","MVA","Non-coincident",null,null,null,null,null,null,null,null,null,null,null,117,116,114,114,112,122,132]
[null,null,null,null,"Coincident",null,null,null,null,null,null,null,null,null,null,null,105,104,102,102,100,111,123]
[null,"Bluff ","CONNECTION POINT RATING","MVA","Non-coincident"]
[null,null,null,null,"Coincident"]
[null,null,"WINTER/SUMMER PEAKING",null,"Non-coincident",null,null,null,null,null,null,null,null,null,null,null,"Summer","Summer","Summer","Summer","Summer","Summer","Summer"]
[null,null,null,null,"Coincident",null,null,null,null,null,null,null,null,null,null,null,"Summer","Summer","Summer","Summer","Summer","Summer","Summer"]
[null,null,"ADJUSTMENTS - EMBEDDED GENERATION","MW","Non-coincident",null,null,null,null,null,null,null,null,null,null,null,0,0,0,0,0,0,0]
[null,null,null,null,"Coincident",null,null,null,null,null,null,null,null,null,null,null,0,0,0,0,0,0,0]
[null,null,"WEATHER CORRECTED MD 10% POE","MW","Non-coincident"]
[null,null,null,null,"Coincident"]
[null,null,"WEATHER CORRECTED MD 10% POE","MVA","Non-coincident"]
[null,null,null,null,"Coincident"]
[null,null,"WEATHER CORRECTED MD 50% POE","MW","Non-coincident"]
[null,null,null,null,"Coincident"]
[null,null,"WEATHER CORRECTED MD 50% POE","MVA","Non-coincident"]
[null,null,null,null,"Coincident"]
[null,"Bolingbroke ","CONNECTION POINT RATING","MVA","Non-coincident",null,null,null,null,null,null,null,null,null,null,null,129,129,129,129,129,129,129]
[null,null,null,null,"Coincident",null,null,null,null,null,null,null,null,null,null,null,129,129,129,129,129,129,129]
[null,null,"WINTER/SUMMER PEAKING",null,"Non-coincident",null,null,null,null,null,null,null,null,null,null,null,"Winter","Winter","Winter","Winter","Winter","Winter","Winter"]
[null,null,null,null,"Coincident",null,null,null,null,null,null,null,null,null,null,null,"Summer","Summer","Summer","Summer","Summer","Summer","Summer"]
[null,null,"ADJUSTMENTS - EMBEDDED GENERATION","MW","Non-coincident",null,null,null,null,null,null,null,null,null,null,null,0,0,0,0,0,0,0]
[null,null,null,null,"Coincident",null,null,null,null,null,null,null,null,null,null,null,0,0,0,0,0,0,0]
[null,null,"WEATHER CORRECTED MD 10% POE","MW","Non-coincident"]
[null,null,null,null,"Coincident"]
[null,null,"WEATHER CORRECTED MD 10% POE","MVA","Non-coincident"]
[null,null,null,null,"Coincident"]
[null,null,"WEATHER CORRECTED MD 50% POE","MW","Non-coincident"]
[null,null,null,null,"Coincident"]
[null,null,"WEATHER CORRECTED MD 50% POE","MVA","Non-coincident"]
[null,null,null,null,"Coincident"]
[null,"Bowen North ","CONNECTION POINT RATING","MVA","Non-coincident",null,null,null,null,null,null,null,null,null,null,null,135,135,135,135,135,135,135]
[null,null,null,null,"Coincident",null,null,null,null,null,null,null,null,null,null,null,135,135,135,135,135,135,135]
[null,null,"WINTER/SUMMER PEAKING",null,"Non-coincident",null,null,null,null,null,null,null,null,null,null,null,"Winter","Winter","Winter","Winter","Winter","Winter","Winter"]
[null,null,null,null,"Coincident",null,null,null,null,null,null,null,null,null,null,null,"Summer","Summer","Summer","Summer","Summer","Summer","Summer"]
[null,null,"ADJUSTMENTS - EMBEDDED GENERATION","MW","Non-coincident",null,null,null,null,null,null,null,null,null,null,null,0,0,0,0,0,0,0]
[null,null,null,null,"Coincident",null,null,null,null,null,null,null,null,null,null,null,0,0,0,0,0,0,0]
[null,null,"WEATHER CORRECTED MD 10% POE","MW","Non-coincident",null,null,null,null,null,null,null,null,null,null,null,24,26,27,28,29,31,30]
[null,null,null,null,"Coincident",null,null,null,null,null,null,null,null,null,null,null,22,23,25,25,28,27,27]
[null,null,"WEATHER CORRECTED MD 10% POE","MVA","Non-coincident",null,null,null,null,null,null,null,null,null,null,null,25,28,28,30,30,33,32]
[null,null,null,null,"Coincident",null,null,null,null,null,null,null,null,null,null,null,24,24,26,26,29,29,29]
[null,null,"WEATHER CORRECTED MD 50% POE","MW","Non-coincident",null,null,null,null,null,null,null,null,null,null,null,22,24,25,26,26,28,28]
[null,null,null,null,"Coincident",null,null,null,null,null,null,null,null,null,null,null,20,21,23,23,26,25,25]
[null,null,"WEATHER CORRECTED MD 50% POE","MVA","Non-coincident",null,null,null,null,null,null,null,null,null,null,null,23,26,26,28,28,30,29]
[null,null,null,null,"Coincident",null,null,null,null,null,null,null,null,null,null,null,22,22,24,24,27,27,26]
[null,"Bulli Creek (Waggamba) ","CONNECTION POINT RATING","MVA","Non-coincident",null,null,null,null,null,null,null,null,null,null,null,110,110,110,110,110,110,110]
[null,null,null,null,"Coincident",null,null,null,null,null,null,null,null,null,null,null,110,110,110,110,110,110,110]
[null,null,"WINTER/SUMMER PEAKING",null,"Non-coincident",null,null,null,null,null,null,null,null,null,null,null,"Winter","Winter","Winter","Winter","Winter","Winter","Winter"]
[null,null,null,null,"Coincident",null,null,null,null,null,null,null,null,null,null,null,"Summer","Summer","Summer","Summer","Summer","Summer","Summer"]
[null,null,"ADJUSTMENTS - EMBEDDED GENERATION","MW","Non-coincident",null,null,null,null,null,null,null,null,null,null,null,0,0,0,0,0,0,0]
[null,null,null,null,"Coincident",null,null,null,null,null,null,null,null,null,null,null,0,0,0,0,0,0,0]
[null,null,"WEATHER CORRECTED MD 10% POE","MW","Non-coincident",null,null,null,null,null,null,null,null,null,null,null,22,22,22,22,23,22,22]
[null,null,null,null,"Coincident",null,null,null,null,null,null,null,null,null,null,null,13,13,13,13,13,13,13]
[null,null,"WEATHER CORRECTED MD 10% POE","MVA","Non-coincident",null,null,null,null,null,null,null,null,null,null,null,22,22,23,23,23,23,22]
[null,null,null,null,"Coincident",null,null,null,null,null,null,null,null,null,null,null,14,14,14,14,13,13,13]
[null,null,"WEATHER CORRECTED MD 50% POE","MW","Non-coincident",null,null,null,null,null,null,null,null,null,null,null,20,20,20,20,21,20,20]
[null,null,null,null,"Coincident",null,null,null,null,null,null,null,null,null,null,null,12,12,12,12,12,12,12]
[null,null,"WEATHER CORRECTED MD 50% POE","MVA","Non-coincident",null,null,null,null,null,null,null,null,null,null,null,20,20,20,21,21,20,20]
[null,null,null,null,"Coincident",null,null,null,null,null,null,null,null,null,null,null,12,12,12,12,12,12,12]
[null,"Cairns ","CONNECTION POINT RATING","MVA","Non-coincident",null,null,null,null,null,null,null,null,null,null,null,174,174,174,174,174,174,174]
[null,null,null,null,"Coincident",null,null,null,null,null,null,null,null,null,null,null,174,174,174,174,174,174,174]
[null,null,"WINTER/SUMMER PEAKING",null,"Non-coincident",null,null,null,null,null,null,null,null,null,null,null,"Summer","Summer","Summer","Summer","Summer","Summer","Summer"]
[null,null,null,null,"Coincident",null,null,null,null,null,null,null,null,null,null,null,"Summer","Summer","Summer","Summer","Summer","Summer","Summer"]
[null,null,"ADJUSTMENTS - EMBEDDED GENERATION","MW","Non-coincident",null,null,null,null,null,null,null,null,null,null,null,0,0,0,0,0,0,0]
[null,null,null,null,"Coincident",null,null,null,null,null,null,null,null,null,null,null,0,0,0,0,0,0,0]
[null,null,"WEATHER CORRECTED MD 10% POE","MW","Non-coincident",null,null,null,null,null,null,null,null,null,null,null,53,52,51,51,51,50,49]
[null,null,null,null,"Coincident",null,null,null,null,null,null,null,null,null,null,null,49,49,48,48,47,47,46]
[null,null,"WEATHER CORRECTED MD 10% POE","MVA","Non-coincident",null,null,null,null,null,null,null,null,null,null,null,54,53,52,52,52,51,50]
[null,null,null,null,"Coincident",null,null,null,null,null,null,null,null,null,null,null,50,49,48,48,47,47,46]
[null,null,"WEATHER CORRECTED MD 50% POE","MW","Non-coincident",null,null,null,null,null,null,null,null,null,null,null,47,47,46,46,45,45,44]
[null,null,null,null,"Coincident",null,null,null,null,null,null,null,null,null,null,null,45,44,44,44,43,42,41]
[null,null,"WEATHER CORRECTED MD 50% POE","MVA","Non-coincident",null,null,null,null,null,null,null,null,null,null,null,49,48,47,47,46,46,45]
[null,null,null,null,"Coincident",null,null,null,null,null,null,null,null,null,null,null,45,45,44,44,43,42,41]
[null,"Cairns City ","CONNECTION POINT RATING","MVA","Non-coincident",null,null,null,null,null,null,null,null,null,null,null,217,217,217,217,217,217,217]
[null,null,null,null,"Coincident",null,null,null,null,null,null,null,null,null,null,null,217,217,217,217,217,217,217]
[null,null,"WINTER/SUMMER PEAKING",null,"Non-coincident",null,null,null,null,null,null,null,null,null,null,null,"Summer","Summer","Summer","Summer","Summer","Summer","Summer"]
[null,null,null,null,"Coincident",null,null,null,null,null,null,null,null,null,null,null,"Summer","Summer","Summer","Summer","Summer","Summer","Summer"]
[null,null,"ADJUSTMENTS - EMBEDDED GENERATION","MW","Non-coincident",null,null,null,null,null,null,null,null,null,null,null,0,0,0,0,0,0,0]
[null,null,null,null,"Coincident",null,null,null,null,null,null,null,null,null,null,null,0,0,0,0,0,0,0]
[null,null,"WEATHER CORRECTED MD 10% POE","MW","Non-coincident",null,null,null,null,null,null,null,null,null,null,null,65,64,63,63,62,62,61]
[null,null,null,null,"Coincident",null,null,null,null,null,null,null,null,null,null,null,60,60,59,59,58,57,56]
[null,null,"WEATHER CORRECTED MD 10% POE","MVA","Non-coincident",null,null,null,null,null,null,null,null,null,null,null,65,65,64,64,63,62,61]
[null,null,null,null,"Coincident",null,null,null,null,null,null,null,null,null,null,null,61,60,59,59,58,57,56]
[null,null,"WEATHER CORRECTED MD 50% POE","MW","Non-coincident",null,null,null,null,null,null,null,null,null,null,null,59,58,57,57,56,56,55]
[null,null,null,null,"Coincident",null,null,null,null,null,null,null,null,null,null,null,55,55,54,54,53,52,51]
[null,null,"WEATHER CORRECTED MD 50% POE","MVA","Non-coincident",null,null,null,null,null,null,null,null,null,null,null,59,58,58,58,57,56,55]
[null,null,null,null,"Coincident",null,null,null,null,null,null,null,null,null,null,null,55,55,54,54,53,52,51]
[null,"Callemondah (Rail) ","CONNECTION POINT RATING","MVA","Non-coincident",null,null,null,null,null,null,null,null,null,null,null,320,320,320,320,320,320,320]
[null,null,null,null,"Coincident",null,null,null,null,null,null,null,null,null,null,null,320,320,320,320,320,320,320]
[null,null,"WINTER/SUMMER PEAKING",null,"Non-coincident",null,null,null,null,null,null,null,null,null,null,null,"Summer","Summer","Summer","Summer","Summer","Summer","Summer"]
[null,null,null,null,"Coincident",null,null,null,null,null,null,null,null,null,null,null,"Summer","Summer","Summer","Summer","Summer","Summer","Summer"]
[null,null,"ADJUSTMENTS - EMBEDDED GENERATION","MW","Non-coincident",null,null,null,null,null,null,null,null,null,null,null,0,0,0,0,0,0,0]
[null,null,null,null,"Coincident",null,null,null,null,null,null,null,null,null,null,null,0,0,0,0,0,0,0]
[null,null,"WEATHER CORRECTED MD 10% POE","MW","Non-coincident"]
[null,null,null,null,"Coincident"]
[null,null,"WEATHER CORRECTED MD 10% POE","MVA","Non-coincident"]
[null,null,null,null,"Coincident"]
[null,null,"WEATHER CORRECTED MD 50% POE","MW","Non-coincident"]
[null,null,null,null,"Coincident"]
[null,null,"WEATHER CORRECTED MD 50% POE","MVA","Non-coincident"]
[null,null,null,null,"Coincident"]
[null,"Cardwell ","CONNECTION POINT RATING","MVA","Non-coincident",null,null,null,null,null,null,null,null,null,null,null,42,42,42,42,42,42,42]
[null,null,null,null,"Coincident",null,null,null,null,null,null,null,null,null,null,null,42,42,42,42,42,42,42]
[null,null,"WINTER/SUMMER PEAKING",null,"Non-coincident",null,null,null,null,null,null,null,null,null,null,null,"Summer","Summer","Summer","Summer","Summer","Summer","Summer"]
[null,null,null,null,"Coincident",null,null,null,null,null,null,null,null,null,null,null,"Summer","Summer","Summer","Summer","Summer","Summer","Summer"]
[null,null,"ADJUSTMENTS - EMBEDDED GENERATION","MW","Non-coincident",null,null,null,null,null,null,null,null,null,null,null,0,0,0,0,0,0,0]
[null,null,null,null,"Coincident",null,null,null,null,null,null,null,null,null,null,null,0,0,0,0,0,0,0]
[null,null,"WEATHER CORRECTED MD 10% POE","MW","Non-coincident",null,null,null,null,null,null,null,null,null,null,null,6,6,6,6,6,6,6]
[null,null,null,null,"Coincident",null,null,null,null,null,null,null,null,null,null,null,4,4,4,4,4,4,4]
[null,null,"WEATHER CORRECTED MD 10% POE","MVA","Non-coincident",null,null,null,null,null,null,null,null,null,null,null,6,6,6,6,6,6,6]
[null,null,null,null,"Coincident",null,null,null,null,null,null,null,null,null,null,null,4,4,4,4,4,4,4]
[null,null,"WEATHER CORRECTED MD 50% POE","MW","Non-coincident",null,null,null,null,null,null,null,null,null,null,null,5,5,5,5,5,5,5]
[null,null,null,null,"Coincident",null,null,null,null,null,null,null,null,null,null,null,4,3,3,3,3,3,3]
[null,null,"WEATHER CORRECTED MD 50% POE","MVA","Non-coincident",null,null,null,null,null,null,null,null,null,null,null,6,6,6,6,6,6,5]
[null,null,null,null,"Coincident",null,null,null,null,null,null,null,null,null,null,null,4,4,4,4,4,3,3]
[null,"Chinchilla ","CONNECTION POINT RATING","MVA","Non-coincident",null,null,null,null,null,null,null,null,null,null,null,440,440,440,440,440,440,440]
[null,null,null,null,"Coincident",null,null,null,null,null,null,null,null,null,null,null,440,440,440,440,440,440,440]
[null,null,"WINTER/SUMMER PEAKING",null,"Non-coincident",null,null,null,null,null,null,null,null,null,null,null,"Summer","Summer","Summer","Summer","Summer","Summer","Summer"]
[null,null,null,null,"Coincident",null,null,null,null,null,null,null,null,null,null,null,"Summer","Summer","Summer","Summer","Summer","Summer","Summer"]
[null,null,"ADJUSTMENTS - EMBEDDED GENERATION","MW","Non-coincident",null,null,null,null,null,null,null,null,null,null,null,0,0,0,0,0,0,0]
[null,null,null,null,"Coincident",null,null,null,null,null,null,null,null,null,null,null,0,0,0,0,0,0,0]
[null,null,"WEATHER CORRECTED MD 10% POE","MW","Non-coincident",null,null,null,null,null,null,null,null,null,null,null,23,23,23,23,23,23,23]
[null,null,null,null,"Coincident",null,null,null,null,null,null,null,null,null,null,null,16,16,16,16,16,16,16]
[null,null,"WEATHER CORRECTED MD 10% POE","MVA","Non-coincident",null,null,null,null,null,null,null,null,null,null,null,23,23,23,24,24,24,24]
[null,null,null,null,"Coincident",null,null,null,null,null,null,null,null,null,null,null,16,16,16,17,17,17,17]
[null,null,"WEATHER CORRECTED MD 50% POE","MW","Non-coincident",null,null,null,null,null,null,null,null,null,null,null,21,21,21,21,21,21,21]
[null,null,null,null,"Coincident",null,null,null,null,null,null,null,null,null,null,null,15,15,15,15,15,15,15]
[null,null,"WEATHER CORRECTED MD 50% POE","MVA","Non-coincident",null,null,null,null,null,null,null,null,null,null,null,22,22,22,22,22,22,22]
[null,null,null,null,"Coincident",null,null,null,null,null,null,null,null,null,null,null,15,15,15,15,15,15,15]
[null,"Clare ","CONNECTION POINT RATING","MVA","Non-coincident",null,null,null,null,null,null,null,null,null,null,null,416,416,416,416,416,416,416]
[null,null,null,null,"Coincident",null,null,null,null,null,null,null,null,null,null,null,416,416,416,416,416,416,416]
[null,null,"WINTER/SUMMER PEAKING",null,"Non-coincident",null,null,null,null,null,null,null,null,null,null,null,"Summer","Summer","Summer","Summer","Summer","Summer","Summer"]
[null,null,null,null,"Coincident",null,null,null,null,null,null,null,null,null,null,null,"Summer","Summer","Summer","Summer","Summer","Summer","Summer"]
[null,null,"ADJUSTMENTS - EMBEDDED GENERATION","MW","Non-coincident",null,null,null,null,null,null,null,null,null,null,null,-1,-1,-1,-1,-1,-1,-1]
[null,null,null,null,"Coincident",null,null,null,null,null,null,null,null,null,null,null,21,21,21,21,21,21,21]
[null,null,"WEATHER CORRECTED MD 10% POE","MW","Non-coincident",null,null,null,null,null,null,null,null,null,null,null,83,76,76,76,75,74,73]
[null,null,null,null,"Coincident",null,null,null,null,null,null,null,null,null,null,null,36,27,27,27,26,25,25]
[null,null,"WEATHER CORRECTED MD 10% POE","MVA","Non-coincident",null,null,null,null,null,null,null,null,null,null,null,89,82,81,81,80,79,78]
[null,null,null,null,"Coincident",null,null,null,null,null,null,null,null,null,null,null,41,31,30,30,29,29,28]
[null,null,"WEATHER CORRECTED MD 50% POE","MW","Non-coincident",null,null,null,null,null,null,null,null,null,null,null,77,71,70,70,69,69,67]
[null,null,null,null,"Coincident",null,null,null,null,null,null,null,null,null,null,null,32,23,23,22,22,21,21]
[null,null,"WEATHER CORRECTED MD 50% POE","MVA","Non-coincident",null,null,null,null,null,null,null,null,null,null,null,82,76,75,75,74,73,72]
[null,null,null,null,"Coincident",null,null,null,null,null,null,null,null,null,null,null,36,26,25,25,24,24,23]
[null,"Collinsville Load ","CONNECTION POINT RATING","MVA","Non-coincident",null,null,null,null,null,null,null,null,null,null,null,143,143,143,143,143,143,143]
[null,null,null,null,"Coincident",null,null,null,null,null,null,null,null,null,null,null,143,143,143,143,143,143,143]
[null,null,"WINTER/SUMMER PEAKING",null,"Non-coincident",null,null,null,null,null,null,null,null,null,null,null,"Summer","Summer","Summer","Summer","Summer","Summer","Summer"]
[null,null,null,null,"Coincident",null,null,null,null,null,null,null,null,null,null,null,"Summer","Summer","Summer","Summer","Summer","Summer","Summer"]
[null,null,"ADJUSTMENTS - EMBEDDED GENERATION","MW","Non-coincident",null,null,null,null,null,null,null,null,null,null,null,0,0,0,0,0,0,0]
[null,null,null,null,"Coincident",null,null,null,null,null,null,null,null,null,null,null,0,0,0,0,0,0,0]
[null,null,"WEATHER CORRECTED MD 10% POE","MW","Non-coincident",null,null,null,null,null,null,null,null,null,null,null,18,18,19,19,23,23,23]
[null,null,null,null,"Coincident",null,null,null,null,null,null,null,null,null,null,null,15,15,15,16,19,19,19]
[null,null,"WEATHER CORRECTED MD 10% POE","MVA","Non-coincident",null,null,null,null,null,null,null,null,null,null,null,19,19,19,20,23,24,24]
[null,null,null,null,"Coincident",null,null,null,null,null,null,null,null,null,null,null,16,16,16,16,19,19,19]
[null,null,"WEATHER CORRECTED MD 50% POE","MW","Non-coincident",null,null,null,null,null,null,null,null,null,null,null,17,17,17,18,21,21,21]
[null,null,null,null,"Coincident",null,null,null,null,null,null,null,null,null,null,null,14,14,14,15,17,17,18]
[null,null,"WEATHER CORRECTED MD 50% POE","MVA","Non-coincident",null,null,null,null,null,null,null,null,null,null,null,17,17,18,18,22,22,22]
[null,null,null,null,"Coincident",null,null,null,null,null,null,null,null,null,null,null,14,15,15,15,18,18,18]
[null,"Columboola ","CONNECTION POINT RATING","MVA","Non-coincident",null,null,null,null,null,null,null,null,null,null,null,857,857,857,857,857,857,857]
[null,null,null,null,"Coincident",null,null,null,null,null,null,null,null,null,null,null,857,857,857,857,857,857,857]
[null,null,"WINTER/SUMMER PEAKING",null,"Non-coincident",null,null,null,null,null,null,null,null,null,null,null,"Summer","Summer","Summer","Summer","Summer","Summer","Summer"]
[null,null,null,null,"Coincident",null,null,null,null,null,null,null,null,null,null,null,"Summer","Summer","Summer","Summer","Summer","Summer","Summer"]
[null,null,"ADJUSTMENTS - EMBEDDED GENERATION","MW","Non-coincident",null,null,null,null,null,null,null,null,null,null,null,0,0,0,0,0,0,0]
[null,null,null,null,"Coincident",null,null,null,null,null,null,null,null,null,null,null,59,59,59,59,59,59,59]
[null,null,"WEATHER CORRECTED MD 10% POE","MW","Non-coincident",null,null,null,null,null,null,null,null,null,null,null,80,80,80,80,84,83,83]
[null,null,null,null,"Coincident",null,null,null,null,null,null,null,null,null,null,null,-3,-3,-4,-2,-2,-2,-2]
[null,null,"WEATHER CORRECTED MD 10% POE","MVA","Non-coincident",null,null,null,null,null,null,null,null,null,null,null,80,80,80,80,84,83,83]
[null,null,null,null,"Coincident",null,null,null,null,null,null,null,null,null,null,null,7,8,8,3,4,4,4]
[null,null,"WEATHER CORRECTED MD 50% POE","MW","Non-coincident",null,null,null,null,null,null,null,null,null,null,null,73,72,72,72,76,75,76]
[null,null,null,null,"Coincident",null,null,null,null,null,null,null,null,null,null,null,-6,-7,-7,-5,-5,-5,-5]
[null,null,"WEATHER CORRECTED MD 50% POE","MVA","Non-coincident",null,null,null,null,null,null,null,null,null,null,null,73,72,72,72,77,75,76]
[null,null,null,null,"Coincident",null,null,null,null,null,null,null,null,null,null,null,15,15,16,11,12,12,12]
[null,"Coppabella (Rail) ","CONNECTION POINT RATING","MVA","Non-coincident",null,null,null,null,null,null,null,null,null,null,null,72,72,72,72,72,72,72]
[null,null,null,null,"Coincident",null,null,null,null,null,null,null,null,null,null,null,72,72,72,72,72,72,72]
[null,null,"WINTER/SUMMER PEAKING",null,"Non-coincident",null,null,null,null,null,null,null,null,null,null,null,"Summer","Summer","Summer","Summer","Summer","Summer","Summer"]
[null,null,null,null,"Coincident",null,null,null,null,null,null,null,null,null,null,null,"Summer","Summer","Summer","Summer","Summer","Summer","Summer"]
[null,null,"ADJUSTMENTS - EMBEDDED GENERATION","MW","Non-coincident",null,null,null,null,null,null,null,null,null,null,null,0,0,0,0,0,0,0]
[null,null,null,null,"Coincident",null,null,null,null,null,null,null,null,null,null,null,0,0,0,0,0,0,0]
[null,null,"WEATHER CORRECTED MD 10% POE","MW","Non-coincident"]
[null,null,null,null,"Coincident"]
[null,null,"WEATHER CORRECTED MD 10% POE","MVA","Non-coincident"]
[null,null,null,null,"Coincident"]
[null,null,"WEATHER CORRECTED MD 50% POE","MW","Non-coincident"]
[null,null,null,null,"Coincident"]
[null,null,"WEATHER CORRECTED MD 50% POE","MVA","Non-coincident"]
[null,null,null,null,"Coincident"]
[null,"Dan Gleeson ","CONNECTION POINT RATING","MVA","Non-coincident",null,null,null,null,null,null,null,null,null,null,null,211,211,211,211,211,211,211]
[null,null,null,null,"Coincident",null,null,null,null,null,null,null,null,null,null,null,211,211,211,211,211,211,211]
[null,null,"WINTER/SUMMER PEAKING",null,"Non-coincident",null,null,null,null,null,null,null,null,null,null,null,"Summer","Summer","Summer","Summer","Summer","Summer","Summer"]
[null,null,null,null,"Coincident",null,null,null,null,null,null,null,null,null,null,null,"Summer","Summer","Summer","Summer","Summer","Summer","Summer"]
[null,null,"ADJUSTMENTS - EMBEDDED GENERATION","MW","Non-coincident",null,null,null,null,null,null,null,null,null,null,null,0,0,0,0,0,0,0]
[null,null,null,null,"Coincident",null,null,null,null,null,null,null,null,null,null,null,19,19,19,19,19,19,19]
[null,null,"WEATHER CORRECTED MD 10% POE","MW","Non-coincident",null,null,null,null,null,null,null,null,null,null,null,98,98,93,94,93,93,92]
[null,null,null,null,"Coincident",null,null,null,null,null,null,null,null,null,null,null,46,46,43,44,44,43,43]
[null,null,"WEATHER CORRECTED MD 10% POE","MVA","Non-coincident",null,null,null,null,null,null,null,null,null,null,null,100,101,96,96,96,95,94]
[null,null,null,null,"Coincident",null,null,null,null,null,null,null,null,null,null,null,47,47,44,44,44,44,43]
[null,null,"WEATHER CORRECTED MD 50% POE","MW","Non-coincident",null,null,null,null,null,null,null,null,null,null,null,83,83,79,79,78,78,77]
[null,null,null,null,"Coincident",null,null,null,null,null,null,null,null,null,null,null,39,39,36,36,36,36,36]
[null,null,"WEATHER CORRECTED MD 50% POE","MVA","Non-coincident",null,null,null,null,null,null,null,null,null,null,null,85,85,81,81,80,80,79]
[null,null,null,null,"Coincident",null,null,null,null,null,null,null,null,null,null,null,39,39,37,37,37,36,36]
[null,"Duaringa (Rail)","CONNECTION POINT RATING","MVA","Non-coincident"]
[null,null,null,null,"Coincident"]
[null,null,"WINTER/SUMMER PEAKING",null,"Non-coincident",null,null,null,null,null,null,null,null,null,null,null,"Summer","Summer","Summer","Summer","Summer","Summer","Summer"]
[null,null,null,null,"Coincident",null,null,null,null,null,null,null,null,null,null,null,"Summer","Summer","Summer","Summer","Summer","Summer","Summer"]
[null,null,"ADJUSTMENTS - EMBEDDED GENERATION","MW","Non-coincident",null,null,null,null,null,null,null,null,null,null,null,0,0,0,0,0,0,0]
[null,null,null,null,"Coincident",null,null,null,null,null,null,null,null,null,null,null,0,0,0,0,0,0,0]
[null,null,"WEATHER CORRECTED MD 10% POE","MW","Non-coincident"]
[null,null,null,null,"Coincident"]
[null,null,"WEATHER CORRECTED MD 10% POE","MVA","Non-coincident"]
[null,null,null,null,"Coincident"]
[null,null,"WEATHER CORRECTED MD 50% POE","MW","Non-coincident"]
[null,null,null,null,"Coincident"]
[null,null,"WEATHER CORRECTED MD 50% POE","MVA","Non-coincident"]
[null,null,null,null,"Coincident"]
[null,"Dingo (Rail) ","CONNECTION POINT RATING","MVA","Non-coincident",null,null,null,null,null,null,null,null,null,null,null,72,72,72,72,72,72,72]
[null,null,null,null,"Coincident",null,null,null,null,null,null,null,null,null,null,null,72,72,72,72,72,72,72]
[null,null,"WINTER/SUMMER PEAKING",null,"Non-coincident",null,null,null,null,null,null,null,null,null,null,null,"Winter","Winter","Winter","Winter","Winter","Winter","Winter"]
[null,null,null,null,"Coincident",null,null,null,null,null,null,null,null,null,null,null,"Summer","Summer","Summer","Summer","Summer","Summer","Summer"]
[null,null,"ADJUSTMENTS - EMBEDDED GENERATION","MW","Non-coincident",null,null,null,null,null,null,null,null,null,null,null,0,0,0,0,0,0,0]
[null,null,null,null,"Coincident",null,null,null,null,null,null,null,null,null,null,null,0,0,0,0,0,0,0]
[null,null,"WEATHER CORRECTED MD 10% POE","MW","Non-coincident"]
[null,null,null,null,"Coincident"]
[null,null,"WEATHER CORRECTED MD 10% POE","MVA","Non-coincident"]
[null,null,null,null,"Coincident"]
[null,null,"WEATHER CORRECTED MD 50% POE","MW","Non-coincident"]
[null,null,null,null,"Coincident"]
[null,null,"WEATHER CORRECTED MD 50% POE","MVA","Non-coincident"]
[null,null,null,null,"Coincident"]
[null,"Dysart ","CONNECTION POINT RATING","MVA","Non-coincident",null,null,null,null,null,null,null,null,null,null,null,180,180,180,180,268,268,268]
[null,null,null,null,"Coincident",null,null,null,null,null,null,null,null,null,null,null,180,180,180,180,268,268,268]
[null,null,"WINTER/SUMMER PEAKING",null,"Non-coincident",null,null,null,null,null,null,null,null,null,null,null,"Summer","Summer","Summer","Summer","Summer","Summer","Summer"]
[null,null,null,null,"Coincident",null,null,null,null,null,null,null,null,null,null,null,"Summer","Summer","Summer","Summer","Summer","Summer","Summer"]
[null,null,"ADJUSTMENTS - EMBEDDED GENERATION","MW","Non-coincident",null,null,null,null,null,null,null,null,null,null,null,0,0,0,0,0,0,0]
[null,null,null,null,"Coincident",null,null,null,null,null,null,null,null,null,null,null,0,0,0,0,0,0,0]
[null,null,"WEATHER CORRECTED MD 10% POE","MW","Non-coincident",null,null,null,null,null,null,null,null,null,null,null,50,75,74,74,73,72,71]
[null,null,null,null,"Coincident",null,null,null,null,null,null,null,null,null,null,null,38,62,61,61,61,60,59]
[null,null,"WEATHER CORRECTED MD 10% POE","MVA","Non-coincident",null,null,null,null,null,null,null,null,null,null,null,51,77,76,76,75,74,73]
[null,null,null,null,"Coincident",null,null,null,null,null,null,null,null,null,null,null,40,64,63,63,62,61,60]
[null,null,"WEATHER CORRECTED MD 50% POE","MW","Non-coincident",null,null,null,null,null,null,null,null,null,null,null,48,71,70,70,70,69,68]
[null,null,null,null,"Coincident",null,null,null,null,null,null,null,null,null,null,null,37,60,59,59,58,57,56]
[null,null,"WEATHER CORRECTED MD 50% POE","MVA","Non-coincident",null,null,null,null,null,null,null,null,null,null,null,49,73,72,72,71,71,69]
[null,null,null,null,"Coincident",null,null,null,null,null,null,null,null,null,null,null,38,61,60,60,59,58,57]
[null,"Edmonton ","CONNECTION POINT RATING","MVA","Non-coincident",null,null,null,null,null,null,null,null,null,null,null,140,140,140,140,140,140,140]
[null,null,null,null,"Coincident",null,null,null,null,null,null,null,null,null,null,null,140,140,140,140,140,140,140]
[null,null,"WINTER/SUMMER PEAKING",null,"Non-coincident",null,null,null,null,null,null,null,null,null,null,null,"Summer","Summer","Summer","Summer","Summer","Summer","Summer"]
[null,null,null,null,"Coincident",null,null,null,null,null,null,null,null,null,null,null,"Summer","Summer","Summer","Summer","Summer","Summer","Summer"]
[null,null,"ADJUSTMENTS - EMBEDDED GENERATION","MW","Non-coincident",null,null,null,null,null,null,null,null,null,null,null,0,0,0,0,0,0,0]
[null,null,null,null,"Coincident",null,null,null,null,null,null,null,null,null,null,null,0,0,0,0,0,0,0]
[null,null,"WEATHER CORRECTED MD 10% POE","MW","Non-coincident",null,null,null,null,null,null,null,null,null,null,null,48,48,48,49,49,49,49]
[null,null,null,null,"Coincident",null,null,null,null,null,null,null,null,null,null,null,28,28,28,28,28,28,28]
[null,null,"WEATHER CORRECTED MD 10% POE","MVA","Non-coincident",null,null,null,null,null,null,null,null,null,null,null,48,48,48,49,49,49,49]
[null,null,null,null,"Coincident",null,null,null,null,null,null,null,null,null,null,null,28,28,28,28,28,28,28]
[null,null,"WEATHER CORRECTED MD 50% POE","MW","Non-coincident",null,null,null,null,null,null,null,null,null,null,null,43,43,43,44,44,44,43]
[null,null,null,null,"Coincident",null,null,null,null,null,null,null,null,null,null,null,25,25,25,25,25,25,25]
[null,null,"WEATHER CORRECTED MD 50% POE","MVA","Non-coincident",null,null,null,null,null,null,null,null,null,null,null,43,43,43,44,44,44,44]
[null,null,null,null,"Coincident",null,null,null,null,null,null,null,null,null,null,null,25,25,25,25,25,25,25]
[null,"Egans Hill ","CONNECTION POINT RATING","MVA","Non-coincident",null,null,null,null,null,null,null,null,null,null,null,90,90,90,90,90,90,90]
[null,null,null,null,"Coincident",null,null,null,null,null,null,null,null,null,null,null,90,90,90,90,90,90,90]
[null,null,"WINTER/SUMMER PEAKING",null,"Non-coincident",null,null,null,null,null,null,null,null,null,null,null,"Summer","Summer","Summer","Summer","Summer","Summer","Summer"]
[null,null,null,null,"Coincident",null,null,null,null,null,null,null,null,null,null,null,"Summer","Summer","Summer","Summer","Summer","Summer","Summer"]
[null,null,"ADJUSTMENTS - EMBEDDED GENERATION","MW","Non-coincident",null,null,null,null,null,null,null,null,null,null,null,0,0,0,0,0,0,0]
[null,null,null,null,"Coincident",null,null,null,null,null,null,null,null,null,null,null,0,0,0,0,0,0,0]
[null,null,"WEATHER CORRECTED MD 10% POE","MW","Non-coincident",null,null,null,null,null,null,null,null,null,null,null,58,58,58,59,58,58,58]
[null,null,null,null,"Coincident",null,null,null,null,null,null,null,null,null,null,null,56,56,56,56,56,56,55]
[null,null,"WEATHER CORRECTED MD 10% POE","MVA","Non-coincident",null,null,null,null,null,null,null,null,null,null,null,60,60,60,61,60,60,59]
[null,null,null,null,"Coincident",null,null,null,null,null,null,null,null,null,null,null,57,58,57,58,57,57,56]
[null,null,"WEATHER CORRECTED MD 50% POE","MW","Non-coincident",null,null,null,null,null,null,null,null,null,null,null,53,53,53,53,53,52,52]
[null,null,null,null,"Coincident",null,null,null,null,null,null,null,null,null,null,null,51,51,51,51,51,50,50]
[null,null,"WEATHER CORRECTED MD 50% POE","MVA","Non-coincident",null,null,null,null,null,null,null,null,null,null,null,54,54,54,55,54,54,53]
[null,null,null,null,"Coincident",null,null,null,null,null,null,null,null,null,null,null,52,52,52,52,52,51,51]
[null,"El Arish ","CONNECTION POINT RATING","MVA","Non-coincident",null,null,null,null,null,null,null,null,null,null,null,184,184,184,184,184,184,184]
[null,null,null,null,"Coincident",null,null,null,null,null,null,null,null,null,null,null,184,184,184,184,184,184,184]
[null,null,"WINTER/SUMMER PEAKING",null,"Non-coincident",null,null,null,null,null,null,null,null,null,null,null,"Summer","Summer","Summer","Summer","Summer","Summer","Summer"]
[null,null,null,null,"Coincident",null,null,null,null,null,null,null,null,null,null,null,"Summer","Summer","Summer","Summer","Summer","Summer","Summer"]
[null,null,"ADJUSTMENTS - EMBEDDED GENERATION","MW","Non-coincident",null,null,null,null,null,null,null,null,null,null,null,0,0,0,0,0,0,0]
[null,null,null,null,"Coincident",null,null,null,null,null,null,null,null,null,null,null,0,0,0,0,0,0,0]
[null,null,"WEATHER CORRECTED MD 10% POE","MW","Non-coincident",null,null,null,null,null,null,null,null,null,null,null,5,5,5,5,5,5,5]
[null,null,null,null,"Coincident",null,null,null,null,null,null,null,null,null,null,null,2,2,2,2,2,2,2]
[null,null,"WEATHER CORRECTED MD 10% POE","MVA","Non-coincident",null,null,null,null,null,null,null,null,null,null,null,5,5,5,5,5,5,5]
[null,null,null,null,"Coincident",null,null,null,null,null,null,null,null,null,null,null,2,2,2,2,2,2,2]
[null,null,"WEATHER CORRECTED MD 50% POE","MW","Non-coincident",null,null,null,null,null,null,null,null,null,null,null,4,4,4,4,4,4,4]
[null,null,null,null,"Coincident",null,null,null,null,null,null,null,null,null,null,null,2,2,2,2,2,2,2]
[null,null,"WEATHER CORRECTED MD 50% POE","MVA","Non-coincident",null,null,null,null,null,null,null,null,null,null,null,4,4,4,5,5,5,5]
[null,null,null,null,"Coincident",null,null,null,null,null,null,null,null,null,null,null,2,2,2,2,2,2,2]
[null,"Garbutt ","CONNECTION POINT RATING","MVA","Non-coincident",null,null,null,null,null,null,null,null,null,null,null,142,142,193,244,244,244,244]
[null,null,null,null,"Coincident",null,null,null,null,null,null,null,null,null,null,null,142,142,193,244,244,244,244]
[null,null,"WINTER/SUMMER PEAKING",null,"Non-coincident",null,null,null,null,null,null,null,null,null,null,null,"Summer","Summer","Summer","Summer","Summer","Summer","Summer"]
[null,null,null,null,"Coincident",null,null,null,null,null,null,null,null,null,null,null,"Summer","Summer","Summer","Summer","Summer","Summer","Summer"]
[null,null,"ADJUSTMENTS - EMBEDDED GENERATION","MW","Non-coincident",null,null,null,null,null,null,null,null,null,null,null,0,0,0,0,0,0,0]
[null,null,null,null,"Coincident",null,null,null,null,null,null,null,null,null,null,null,17,17,17,17,17,17,17]
[null,null,"WEATHER CORRECTED MD 10% POE","MW","Non-coincident",null,null,null,null,null,null,null,null,null,null,null,105,105,100,101,100,99,98]
[null,null,null,null,"Coincident",null,null,null,null,null,null,null,null,null,null,null,56,56,53,53,53,53,52]
[null,null,"WEATHER CORRECTED MD 10% POE","MVA","Non-coincident",null,null,null,null,null,null,null,null,null,null,null,106,106,101,102,101,100,99]
[null,null,null,null,"Coincident",null,null,null,null,null,null,null,null,null,null,null,57,57,54,54,54,53,53]
[null,null,"WEATHER CORRECTED MD 50% POE","MW","Non-coincident",null,null,null,null,null,null,null,null,null,null,null,89,89,84,85,84,84,82]
[null,null,null,null,"Coincident",null,null,null,null,null,null,null,null,null,null,null,48,47,45,45,45,44,44]
[null,null,"WEATHER CORRECTED MD 50% POE","MVA","Non-coincident",null,null,null,null,null,null,null,null,null,null,null,90,90,85,86,85,84,83]
[null,null,null,null,"Coincident",null,null,null,null,null,null,null,null,null,null,null,48,48,45,45,45,44,44]
[null,"Gin Gin ","CONNECTION POINT RATING","MVA","Non-coincident",null,null,null,null,null,null,null,null,null,null,null,549,549,549,549,549,549,549]
[null,null,null,null,"Coincident",null,null,null,null,null,null,null,null,null,null,null,549,549,549,549,549,549,549]
[null,null,"WINTER/SUMMER PEAKING",null,"Non-coincident",null,null,null,null,null,null,null,null,null,null,null,"Summer","Summer","Summer","Summer","Summer","Summer","Summer"]
[null,null,null,null,"Coincident",null,null,null,null,null,null,null,null,null,null,null,"Summer","Summer","Summer","Summer","Summer","Summer","Summer"]
[null,null,"ADJUSTMENTS - EMBEDDED GENERATION","MW","Non-coincident",null,null,null,null,null,null,null,null,null,null,null,0,0,0,0,0,0,0]
[null,null,null,null,"Coincident",null,null,null,null,null,null,null,null,null,null,null,0,0,0,0,0,0,0]
[null,null,"WEATHER CORRECTED MD 10% POE","MW","Non-coincident",null,null,null,null,null,null,null,null,null,null,null,162,161,159,159,158,156,153]
[null,null,null,null,"Coincident",null,null,null,null,null,null,null,null,null,null,null,151,150,148,148,146,144,141]
[null,null,"WEATHER CORRECTED MD 10% POE","MVA","Non-coincident",null,null,null,null,null,null,null,null,null,null,null,163,162,160,160,158,157,154]
[null,null,null,null,"Coincident",null,null,null,null,null,null,null,null,null,null,null,152,151,149,149,146,144,142]
[null,null,"WEATHER CORRECTED MD 50% POE","MW","Non-coincident",null,null,null,null,null,null,null,null,null,null,null,148,147,145,145,143,142,139]
[null,null,null,null,"Coincident",null,null,null,null,null,null,null,null,null,null,null,139,137,136,135,133,131,129]
[null,null,"WEATHER CORRECTED MD 50% POE","MVA","Non-coincident",null,null,null,null,null,null,null,null,null,null,null,149,147,146,146,144,142,140]
[null,null,null,null,"Coincident",null,null,null,null,null,null,null,null,null,null,null,139,138,136,136,133,131,129]
[null,"Calliope River","CONNECTION POINT RATING","MVA","Non-coincident",null,null,null,null,null,null,null,null,null,null,null,363,363,363,363,363,363,363]
[null,null,null,null,"Coincident",null,null,null,null,null,null,null,null,null,null,null,363,363,363,363,363,363,363]
[null,null,"WINTER/SUMMER PEAKING",null,"Non-coincident",null,null,null,null,null,null,null,null,null,null,null,"Summer","Summer","Summer","Summer","Summer","Summer","Summer"]
[null,null,null,null,"Coincident",null,null,null,null,null,null,null,null,null,null,null,"Summer","Summer","Summer","Summer","Summer","Summer","Summer"]
[null,null,"ADJUSTMENTS - EMBEDDED GENERATION","MW","Non-coincident",null,null,null,null,null,null,null,null,null,null,null,0,0,0,0,0,0,0]
[null,null,null,null,"Coincident",null,null,null,null,null,null,null,null,null,null,null,0,0,0,0,0,0,0]
[null,null,"WEATHER CORRECTED MD 10% POE","MW","Non-coincident",null,null,null,null,null,null,null,null,null,null,null,40,39,39,45,42,42,41]
[null,null,null,null,"Coincident",null,null,null,null,null,null,null,null,null,null,null,33,33,32,36,34,33,33]
[null,null,"WEATHER CORRECTED MD 10% POE","MVA","Non-coincident",null,null,null,null,null,null,null,null,null,null,null,42,42,41,47,45,44,44]
[null,null,null,null,"Coincident",null,null,null,null,null,null,null,null,null,null,null,36,36,35,40,37,36,36]
[null,null,"WEATHER CORRECTED MD 50% POE","MW","Non-coincident",null,null,null,null,null,null,null,null,null,null,null,37,36,36,42,39,39,38]
[null,null,null,null,"Coincident",null,null,null,null,null,null,null,null,null,null,null,31,30,30,33,31,31,30]
[null,null,"WEATHER CORRECTED MD 50% POE","MVA","Non-coincident",null,null,null,null,null,null,null,null,null,null,null,39,39,38,44,42,41,40]
[null,null,null,null,"Coincident",null,null,null,null,null,null,null,null,null,null,null,33,33,33,37,34,34,33]
[null,"Gladstone South ","CONNECTION POINT RATING","MVA","Non-coincident",null,null,null,null,null,null,null,null,null,null,null,232,232,232,232,232,232,232]
[null,null,null,null,"Coincident",null,null,null,null,null,null,null,null,null,null,null,232,232,232,232,232,232,232]
[null,null,"WINTER/SUMMER PEAKING",null,"Non-coincident",null,null,null,null,null,null,null,null,null,null,null,"Summer","Summer","Summer","Summer","Summer","Summer","Summer"]
[null,null,null,null,"Coincident",null,null,null,null,null,null,null,null,null,null,null,"Summer","Summer","Summer","Summer","Summer","Summer","Summer"]
[null,null,"ADJUSTMENTS - EMBEDDED GENERATION","MW","Non-coincident",null,null,null,null,null,null,null,null,null,null,null,0,0,0,0,0,0,0]
[null,null,null,null,"Coincident",null,null,null,null,null,null,null,null,null,null,null,0,0,0,0,0,0,0]
[null,null,"WEATHER CORRECTED MD 10% POE","MW","Non-coincident",null,null,null,null,null,null,null,null,null,null,null,79,79,80,81,83,84,84]
[null,null,null,null,"Coincident",null,null,null,null,null,null,null,null,null,null,null,55,56,56,57,59,59,60]
[null,null,"WEATHER CORRECTED MD 10% POE","MVA","Non-coincident",null,null,null,null,null,null,null,null,null,null,null,92,93,94,95,97,98,98]
[null,null,null,null,"Coincident",null,null,null,null,null,null,null,null,null,null,null,73,74,74,76,78,79,79]
[null,null,"WEATHER CORRECTED MD 50% POE","MW","Non-coincident",null,null,null,null,null,null,null,null,null,null,null,72,72,72,74,75,76,75]
[null,null,null,null,"Coincident",null,null,null,null,null,null,null,null,null,null,null,50,50,51,52,53,54,54]
[null,null,"WEATHER CORRECTED MD 50% POE","MVA","Non-coincident",null,null,null,null,null,null,null,null,null,null,null,84,84,85,86,88,88,88]
[null,null,null,null,"Coincident",null,null,null,null,null,null,null,null,null,null,null,66,66,67,68,70,71,71]
[null,"Grantleigh (Rail) ","CONNECTION POINT RATING","MVA","Non-coincident",null,null,null,null,null,null,null,null,null,null,null,72,72,72,72,72,72,72]
[null,null,null,null,"Coincident",null,null,null,null,null,null,null,null,null,null,null,72,72,72,72,72,72,72]
[null,null,"WINTER/SUMMER PEAKING",null,"Non-coincident",null,null,null,null,null,null,null,null,null,null,null,"Winter","Winter","Winter","Winter","Winter","Winter","Winter"]
[null,null,null,null,"Coincident",null,null,null,null,null,null,null,null,null,null,null,"Summer","Summer","Summer","Summer","Summer","Summer","Summer"]
[null,null,"ADJUSTMENTS - EMBEDDED GENERATION","MW","Non-coincident",null,null,null,null,null,null,null,null,null,null,null,0,0,0,0,0,0,0]
[null,null,null,null,"Coincident",null,null,null,null,null,null,null,null,null,null,null,0,0,0,0,0,0,0]
[null,null,"WEATHER CORRECTED MD 10% POE","MW","Non-coincident"]
[null,null,null,null,"Coincident"]
[null,null,"WEATHER CORRECTED MD 10% POE","MVA","Non-coincident"]
[null,null,null,null,"Coincident"]
[null,null,"WEATHER CORRECTED MD 50% POE","MW","Non-coincident"]
[null,null,null,null,"Coincident"]
[null,null,"WEATHER CORRECTED MD 50% POE","MVA","Non-coincident"]
[null,null,null,null,"Coincident"]
[null,"Gregory (Rail) ","CONNECTION POINT RATING","MVA","Non-coincident",null,null,null,null,null,null,null,null,null,null,null,66,66,66,66,66,66,66]
[null,null,null,null,"Coincident",null,null,null,null,null,null,null,null,null,null,null,66,66,66,66,66,66,66]
[null,null,"WINTER/SUMMER PEAKING",null,"Non-coincident",null,null,null,null,null,null,null,null,null,null,null,"Winter","Winter","Winter","Winter","Winter","Winter","Winter"]
[null,null,null,null,"Coincident",null,null,null,null,null,null,null,null,null,null,null,"Summer","Summer","Summer","Summer","Summer","Summer","Summer"]
[null,null,"ADJUSTMENTS - EMBEDDED GENERATION","MW","Non-coincident",null,null,null,null,null,null,null,null,null,null,null,0,0,0,0,0,0,0]
[null,null,null,null,"Coincident",null,null,null,null,null,null,null,null,null,null,null,0,0,0,0,0,0,0]
[null,null,"WEATHER CORRECTED MD 10% POE","MW","Non-coincident"]
[null,null,null,null,"Coincident"]
[null,null,"WEATHER CORRECTED MD 10% POE","MVA","Non-coincident"]
[null,null,null,null,"Coincident"]
[null,null,"WEATHER CORRECTED MD 50% POE","MW","Non-coincident"]
[null,null,null,null,"Coincident"]
[null,null,"WEATHER CORRECTED MD 50% POE","MVA","Non-coincident"]
[null,null,null,null,"Coincident"]
[null,"Ingham","CONNECTION POINT RATING","MVA","Non-coincident",null,null,null,null,null,null,null,null,null,null,null,70,70,70,127,184,184,184]
[null,null,null,null,"Coincident",null,null,null,null,null,null,null,null,null,null,null,70,70,70,127,184,184,184]
[null,null,"WINTER/SUMMER PEAKING",null,"Non-coincident",null,null,null,null,null,null,null,null,null,null,null,"Winter","Winter","Winter","Winter","Winter","Winter","Winter"]
[null,null,null,null,"Coincident",null,null,null,null,null,null,null,null,null,null,null,"Summer","Summer","Summer","Summer","Summer","Summer","Summer"]
[null,null,"ADJUSTMENTS - EMBEDDED GENERATION","MW","Non-coincident",null,null,null,null,null,null,null,null,null,null,null,0,0,0,0,0,0,0]
[null,null,null,null,"Coincident",null,null,null,null,null,null,null,null,null,null,null,0,0,0,0,0,0,0]
[null,null,"WEATHER CORRECTED MD 10% POE","MW","Non-coincident",null,null,null,null,null,null,null,null,null,null,null,23,22,22,22,22,22,21]
[null,null,null,null,"Coincident",null,null,null,null,null,null,null,null,null,null,null,17,17,17,17,16,16,16]
[null,null,"WEATHER CORRECTED MD 10% POE","MVA","Non-coincident",null,null,null,null,null,null,null,null,null,null,null,23,23,22,22,22,22,21]
[null,null,null,null,"Coincident",null,null,null,null,null,null,null,null,null,null,null,17,17,17,17,17,16,16]
[null,null,"WEATHER CORRECTED MD 50% POE","MW","Non-coincident",null,null,null,null,null,null,null,null,null,null,null,21,20,20,20,20,19,19]
[null,null,null,null,"Coincident",null,null,null,null,null,null,null,null,null,null,null,15,15,15,15,14,14,14]
[null,null,"WEATHER CORRECTED MD 50% POE","MVA","Non-coincident",null,null,null,null,null,null,null,null,null,null,null,21,20,20,20,20,20,19]
[null,null,null,null,"Coincident",null,null,null,null,null,null,null,null,null,null,null,15,15,15,15,14,14,14]
[null,"Innisfail ","CONNECTION POINT RATING","MVA","Non-coincident",null,null,null,null,null,null,null,null,null,null,null,100,100,100,100,100,100,100]
[null,null,null,null,"Coincident",null,null,null,null,null,null,null,null,null,null,null,100,100,100,100,100,100,100]
[null,null,"WINTER/SUMMER PEAKING",null,"Non-coincident",null,null,null,null,null,null,null,null,null,null,null,"Summer","Summer","Summer","Summer","Summer","Summer","Summer"]
[null,null,null,null,"Coincident",null,null,null,null,null,null,null,null,null,null,null,"Summer","Summer","Summer","Summer","Summer","Summer","Summer"]
[null,null,"ADJUSTMENTS - EMBEDDED GENERATION","MW","Non-coincident",null,null,null,null,null,null,null,null,null,null,null,0,0,0,0,0,0,0]
[null,null,null,null,"Coincident",null,null,null,null,null,null,null,null,null,null,null,0,0,0,0,0,0,0]
[null,null,"WEATHER CORRECTED MD 10% POE","MW","Non-coincident",null,null,null,null,null,null,null,null,null,null,null,30,30,30,30,29,29,28]
[null,null,null,null,"Coincident",null,null,null,null,null,null,null,null,null,null,null,25,25,24,24,24,24,23]
[null,null,"WEATHER CORRECTED MD 10% POE","MVA","Non-coincident",null,null,null,null,null,null,null,null,null,null,null,32,31,31,31,31,30,30]
[null,null,null,null,"Coincident",null,null,null,null,null,null,null,null,null,null,null,26,26,26,26,25,25,24]
[null,null,"WEATHER CORRECTED MD 50% POE","MW","Non-coincident",null,null,null,null,null,null,null,null,null,null,null,26,26,26,26,25,25,24]
[null,null,null,null,"Coincident",null,null,null,null,null,null,null,null,null,null,null,22,22,21,21,21,21,20]
[null,null,"WEATHER CORRECTED MD 50% POE","MVA","Non-coincident",null,null,null,null,null,null,null,null,null,null,null,27,27,27,27,26,26,25]
[null,null,null,null,"Coincident",null,null,null,null,null,null,null,null,null,null,null,23,23,22,22,22,21,21]
[null,"Invicta Load ","CONNECTION POINT RATING","MVA","Non-coincident"]
[null,null,null,null,"Coincident"]
[null,null,"WINTER/SUMMER PEAKING",null,"Non-coincident",null,null,null,null,null,null,null,null,null,null,null,"Winter","Winter","Winter","Winter","Winter","Winter","Winter"]
[null,null,null,null,"Coincident",null,null,null,null,null,null,null,null,null,null,null,"Summer","Summer","Summer","Summer","Summer","Summer","Summer"]
[null,null,"ADJUSTMENTS - EMBEDDED GENERATION","MW","Non-coincident",null,null,null,null,null,null,null,null,null,null,null,0,0,0,0,0,0,0]
[null,null,null,null,"Coincident",null,null,null,null,null,null,null,null,null,null,null,0,0,0,0,0,0,0]
[null,null,"WEATHER CORRECTED MD 10% POE","MW","Non-coincident"]
[null,null,null,null,"Coincident"]
[null,null,"WEATHER CORRECTED MD 10% POE","MVA","Non-coincident"]
[null,null,null,null,"Coincident"]
[null,null,"WEATHER CORRECTED MD 50% POE","MW","Non-coincident"]
[null,null,null,null,"Coincident"]
[null,null,"WEATHER CORRECTED MD 50% POE","MVA","Non-coincident"]
[null,null,null,null,"Coincident"]
[null,"Kamerunga ","CONNECTION POINT RATING","MVA","Non-coincident",null,null,null,null,null,null,null,null,null,null,null,100,100,100,100,100,100,100]
[null,null,null,null,"Coincident",null,null,null,null,null,null,null,null,null,null,null,100,100,100,100,100,100,100]
[null,null,"WINTER/SUMMER PEAKING",null,"Non-coincident",null,null,null,null,null,null,null,null,null,null,null,"Summer","Summer","Summer","Summer","Summer","Summer","Summer"]
[null,null,null,null,"Coincident",null,null,null,null,null,null,null,null,null,null,null,"Summer","Summer","Summer","Summer","Summer","Summer","Summer"]
[null,null,"ADJUSTMENTS - EMBEDDED GENERATION","MW","Non-coincident",null,null,null,null,null,null,null,null,null,null,null,0,0,0,0,0,0,0]
[null,null,null,null,"Coincident",null,null,null,null,null,null,null,null,null,null,null,0,0,0,0,0,0,0]
[null,null,"WEATHER CORRECTED MD 10% POE","MW","Non-coincident",null,null,null,null,null,null,null,null,null,null,null,64,65,65,66,66,66,69]
[null,null,null,null,"Coincident",null,null,null,null,null,null,null,null,null,null,null,36,36,36,37,37,37,39]
[null,null,"WEATHER CORRECTED MD 10% POE","MVA","Non-coincident",null,null,null,null,null,null,null,null,null,null,null,65,65,65,66,66,66,69]
[null,null,null,null,"Coincident",null,null,null,null,null,null,null,null,null,null,null,36,36,36,37,36,36,38]
[null,null,"WEATHER CORRECTED MD 50% POE","MW","Non-coincident",null,null,null,null,null,null,null,null,null,null,null,61,61,61,62,62,62,65]
[null,null,null,null,"Coincident",null,null,null,null,null,null,null,null,null,null,null,34,34,34,35,35,35,36]
[null,null,"WEATHER CORRECTED MD 50% POE","MVA","Non-coincident",null,null,null,null,null,null,null,null,null,null,null,61,61,61,62,62,62,65]
[null,null,null,null,"Coincident",null,null,null,null,null,null,null,null,null,null,null,34,34,34,35,35,35,36]
[null,"Kemmis ","CONNECTION POINT RATING","MVA","Non-coincident",null,null,null,null,null,null,null,null,null,null,null,85,85,85,85,93,93,93]
[null,null,null,null,"Coincident",null,null,null,null,null,null,null,null,null,null,null,85,85,85,85,93,93,93]
[null,null,"WINTER/SUMMER PEAKING",null,"Non-coincident",null,null,null,null,null,null,null,null,null,null,null,"Summer","Summer","Summer","Summer","Summer","Summer","Summer"]
[null,null,null,null,"Coincident",null,null,null,null,null,null,null,null,null,null,null,"Summer","Summer","Summer","Summer","Summer","Summer","Summer"]
[null,null,"ADJUSTMENTS - EMBEDDED GENERATION","MW","Non-coincident",null,null,null,null,null,null,null,null,null,null,null,0,0,0,0,0,0,0]
[null,null,null,null,"Coincident",null,null,null,null,null,null,null,null,null,null,null,0,0,0,0,0,0,0]
[null,null,"WEATHER CORRECTED MD 10% POE","MW","Non-coincident"]
[null,null,null,null,"Coincident"]
[null,null,"WEATHER CORRECTED MD 10% POE","MVA","Non-coincident"]
[null,null,null,null,"Coincident"]
[null,null,"WEATHER CORRECTED MD 50% POE","MW","Non-coincident"]
[null,null,null,null,"Coincident"]
[null,null,"WEATHER CORRECTED MD 50% POE","MVA","Non-coincident"]
[null,null,null,null,"Coincident"]
[null,"King Creek ","CONNECTION POINT RATING","MVA","Non-coincident",null,null,null,null,null,null,null,null,null,null,null,154,154,154,154,154,154,154]
[null,null,null,null,"Coincident",null,null,null,null,null,null,null,null,null,null,null,154,154,154,154,154,154,154]
[null,null,"WINTER/SUMMER PEAKING",null,"Non-coincident",null,null,null,null,null,null,null,null,null,null,null,"Summer","Summer","Summer","Summer","Summer","Summer","Summer"]
[null,null,null,null,"Coincident",null,null,null,null,null,null,null,null,null,null,null,"Summer","Summer","Summer","Summer","Summer","Summer","Summer"]
[null,null,"ADJUSTMENTS - EMBEDDED GENERATION","MW","Non-coincident",null,null,null,null,null,null,null,null,null,null,null,0,0,0,0,0,0,0]
[null,null,null,null,"Coincident",null,null,null,null,null,null,null,null,null,null,null,0,0,0,0,0,0,0]
[null,null,"WEATHER CORRECTED MD 10% POE","MW","Non-coincident"]
[null,null,null,null,"Coincident"]
[null,null,"WEATHER CORRECTED MD 10% POE","MVA","Non-coincident"]
[null,null,null,null,"Coincident"]
[null,null,"WEATHER CORRECTED MD 50% POE","MW","Non-coincident"]
[null,null,null,null,"Coincident"]
[null,null,"WEATHER CORRECTED MD 50% POE","MVA","Non-coincident"]
[null,null,null,null,"Coincident"]
[null,"Lilyvale (Barcaldine) ","CONNECTION POINT RATING","MVA","Non-coincident",null,null,null,null,null,null,null,null,null,null,null,183,183,183,183,183,183,183]
[null,null,null,null,"Coincident",null,null,null,null,null,null,null,null,null,null,null,183,183,183,183,183,183,183]
[null,null,"WINTER/SUMMER PEAKING",null,"Non-coincident",null,null,null,null,null,null,null,null,null,null,null,"Summer","Summer","Summer","Summer","Summer","Summer","Summer"]
[null,null,null,null,"Coincident",null,null,null,null,null,null,null,null,null,null,null,"Summer","Summer","Summer","Summer","Summer","Summer","Summer"]
[null,null,"ADJUSTMENTS - EMBEDDED GENERATION","MW","Non-coincident",null,null,null,null,null,null,null,null,null,null,null,0,0,0,0,0,0,0]
[null,null,null,null,"Coincident",null,null,null,null,null,null,null,null,null,null,null,7,7,7,7,7,7,7]
[null,null,"WEATHER CORRECTED MD 10% POE","MW","Non-coincident",null,null,null,null,null,null,null,null,null,null,null,45,45,45,45,45,45,44]
[null,null,null,null,"Coincident",null,null,null,null,null,null,null,null,null,null,null,19,19,19,19,19,19,19]
[null,null,"WEATHER CORRECTED MD 10% POE","MVA","Non-coincident",null,null,null,null,null,null,null,null,null,null,null,48,48,48,48,48,47,47]
[null,null,null,null,"Coincident",null,null,null,null,null,null,null,null,null,null,null,26,26,26,26,26,26,26]
[null,null,"WEATHER CORRECTED MD 50% POE","MW","Non-coincident",null,null,null,null,null,null,null,null,null,null,null,42,42,41,42,41,41,41]
[null,null,null,null,"Coincident",null,null,null,null,null,null,null,null,null,null,null,17,17,17,17,17,17,16]
[null,null,"WEATHER CORRECTED MD 50% POE","MVA","Non-coincident",null,null,null,null,null,null,null,null,null,null,null,44,44,44,44,44,43,43]
[null,null,null,null,"Coincident",null,null,null,null,null,null,null,null,null,null,null,23,23,23,23,23,23,22]
[null,"Lilyvale","CONNECTION POINT RATING","MVA","Non-coincident",null,null,null,null,null,null,null,null,null,null,null,269,269,269,269,380,398,398]
[null,null,null,null,"Coincident",null,null,null,null,null,null,null,null,null,null,null,269,269,269,269,380,398,398]
[null,null,"WINTER/SUMMER PEAKING",null,"Non-coincident",null,null,null,null,null,null,null,null,null,null,null,"Summer","Summer","Summer","Summer","Summer","Summer","Summer"]
[null,null,null,null,"Coincident",null,null,null,null,null,null,null,null,null,null,null,"Summer","Summer","Summer","Summer","Summer","Summer","Summer"]
[null,null,"ADJUSTMENTS - EMBEDDED GENERATION","MW","Non-coincident",null,null,null,null,null,null,null,null,null,null,null,11,11,11,11,11,11,11]
[null,null,null,null,"Coincident",null,null,null,null,null,null,null,null,null,null,null,39,39,39,39,39,39,39]
[null,null,"WEATHER CORRECTED MD 10% POE","MW","Non-coincident",null,null,null,null,null,null,null,null,null,null,null,140,144,143,144,149,148,146]
[null,null,null,null,"Coincident",null,null,null,null,null,null,null,null,null,null,null,93,98,97,97,102,100,98]
[null,null,"WEATHER CORRECTED MD 10% POE","MVA","Non-coincident",null,null,null,null,null,null,null,null,null,null,null,159,164,163,163,169,168,165]
[null,null,null,null,"Coincident",null,null,null,null,null,null,null,null,null,null,null,111,116,115,115,120,118,116]
[null,null,"WEATHER CORRECTED MD 50% POE","MW","Non-coincident",null,null,null,null,null,null,null,null,null,null,null,133,137,136,136,141,140,137]
[null,null,null,null,"Coincident",null,null,null,null,null,null,null,null,null,null,null,89,93,91,91,96,94,92]
[null,null,"WEATHER CORRECTED MD 50% POE","MVA","Non-coincident",null,null,null,null,null,null,null,null,null,null,null,151,155,154,154,160,158,156]
[null,null,null,null,"Coincident",null,null,null,null,null,null,null,null,null,null,null,105,110,108,108,113,111,108]
[null,"Alligator Creek (132)","CONNECTION POINT RATING","MVA","Non-coincident"]
[null,null,null,null,"Coincident"]
[null,null,"WINTER/SUMMER PEAKING",null,"Non-coincident"]
[null,null,null,null,"Coincident"]
[null,null,"ADJUSTMENTS - EMBEDDED GENERATION","MW","Non-coincident"]
[null,null,null,null,"Coincident"]
[null,null,"WEATHER CORRECTED MD 10% POE","MW","Non-coincident"]
[null,null,null,null,"Coincident"]
[null,null,"WEATHER CORRECTED MD 10% POE","MVA","Non-coincident"]
[null,null,null,null,"Coincident"]
[null,null,"WEATHER CORRECTED MD 50% POE","MW","Non-coincident"]
[null,null,null,null,"Coincident"]
[null,null,"WEATHER CORRECTED MD 50% POE","MVA","Non-coincident"]
[null,null,null,null,"Coincident"]
[null,"Mackay ","CONNECTION POINT RATING","MVA","Non-coincident",null,null,null,null,null,null,null,null,null,null,null,302,302,302,302,302,302,302]
[null,null,null,null,"Coincident",null,null,null,null,null,null,null,null,null,null,null,302,302,302,302,302,302,302]
[null,null,"WINTER/SUMMER PEAKING",null,"Non-coincident",null,null,null,null,null,null,null,null,null,null,null,"Summer","Summer","Summer","Summer","Summer","Summer","Summer"]
[null,null,null,null,"Coincident",null,null,null,null,null,null,null,null,null,null,null,"Summer","Summer","Summer","Summer","Summer","Summer","Summer"]
[null,null,"ADJUSTMENTS - EMBEDDED GENERATION","MW","Non-coincident",null,null,null,null,null,null,null,null,null,null,null,0,0,0,0,0,0,0]
[null,null,null,null,"Coincident",null,null,null,null,null,null,null,null,null,null,null,0,0,0,0,0,0,0]
[null,null,"WEATHER CORRECTED MD 10% POE","MW","Non-coincident",null,null,null,null,null,null,null,null,null,null,null,107,104,103,103,102,101,99]
[null,null,null,null,"Coincident",null,null,null,null,null,null,null,null,null,null,null,107,104,103,103,102,101,99]
[null,null,"WEATHER CORRECTED MD 10% POE","MVA","Non-coincident",null,null,null,null,null,null,null,null,null,null,null,109,106,105,105,104,103,101]
[null,null,null,null,"Coincident",null,null,null,null,null,null,null,null,null,null,null,109,106,105,105,103,102,101]
[null,null,"WEATHER CORRECTED MD 50% POE","MW","Non-coincident",null,null,null,null,null,null,null,null,null,null,null,98,96,95,95,94,92,91]
[null,null,null,null,"Coincident",null,null,null,null,null,null,null,null,null,null,null,98,96,95,95,94,92,91]
[null,null,"WEATHER CORRECTED MD 50% POE","MVA","Non-coincident",null,null,null,null,null,null,null,null,null,null,null,101,98,97,97,95,94,93]
[null,null,null,null,"Coincident",null,null,null,null,null,null,null,null,null,null,null,100,97,96,96,94,93,92]
[null,"Mindi ","CONNECTION POINT RATING","MVA","Non-coincident",null,null,null,null,null,null,null,null,null,null,null,129,129,129,129,129,129,129]
[null,null,null,null,"Coincident",null,null,null,null,null,null,null,null,null,null,null,129,129,129,129,129,129,129]
[null,null,"WINTER/SUMMER PEAKING",null,"Non-coincident",null,null,null,null,null,null,null,null,null,null,null,"Summer","Summer","Summer","Summer","Summer","Summer","Summer"]
[null,null,null,null,"Coincident",null,null,null,null,null,null,null,null,null,null,null,"Summer","Summer","Summer","Summer","Summer","Summer","Summer"]
[null,null,"ADJUSTMENTS - EMBEDDED GENERATION","MW","Non-coincident",null,null,null,null,null,null,null,null,null,null,null,0,0,0,0,0,0,0]
[null,null,null,null,"Coincident",null,null,null,null,null,null,null,null,null,null,null,0,0,0,0,0,0,0]
[null,null,"WEATHER CORRECTED MD 10% POE","MW","Non-coincident"]
[null,null,null,null,"Coincident"]
[null,null,"WEATHER CORRECTED MD 10% POE","MVA","Non-coincident"]
[null,null,null,null,"Coincident"]
[null,null,"WEATHER CORRECTED MD 50% POE","MW","Non-coincident"]
[null,null,null,null,"Coincident"]
[null,null,"WEATHER CORRECTED MD 50% POE","MVA","Non-coincident"]
[null,null,null,null,"Coincident"]
[null,"Moranbah (Town) ","CONNECTION POINT RATING","MVA","Non-coincident",null,null,null,null,null,null,null,null,null,null,null,40,40,40,40,40,40,40]
[null,null,null,null,"Coincident",null,null,null,null,null,null,null,null,null,null,null,40,40,40,40,40,40,40]
[null,null,"WINTER/SUMMER PEAKING",null,"Non-coincident",null,null,null,null,null,null,null,null,null,null,null,"Summer","Summer","Summer","Summer","Summer","Summer","Summer"]
[null,null,null,null,"Coincident",null,null,null,null,null,null,null,null,null,null,null,"Summer","Summer","Summer","Summer","Summer","Summer","Summer"]
[null,null,"ADJUSTMENTS - EMBEDDED GENERATION","MW","Non-coincident",null,null,null,null,null,null,null,null,null,null,null,-1,-1,-1,-1,-1,-1,-1]
[null,null,null,null,"Coincident",null,null,null,null,null,null,null,null,null,null,null,2,2,2,2,2,2,2]
[null,null,"WEATHER CORRECTED MD 10% POE","MW","Non-coincident",null,null,null,null,null,null,null,null,null,null,null,18,18,28,28,28,28,27]
[null,null,null,null,"Coincident",null,null,null,null,null,null,null,null,null,null,null,12,12,20,20,20,20,20]
[null,null,"WEATHER CORRECTED MD 10% POE","MVA","Non-coincident",null,null,null,null,null,null,null,null,null,null,null,19,19,29,29,29,29,29]
[null,null,null,null,"Coincident",null,null,null,null,null,null,null,null,null,null,null,13,13,22,22,22,22,21]
[null,null,"WEATHER CORRECTED MD 50% POE","MW","Non-coincident",null,null,null,null,null,null,null,null,null,null,null,17,17,26,26,26,25,25]
[null,null,null,null,"Coincident",null,null,null,null,null,null,null,null,null,null,null,11,11,19,19,19,18,18]
[null,null,"WEATHER CORRECTED MD 50% POE","MVA","Non-coincident",null,null,null,null,null,null,null,null,null,null,null,18,18,27,27,27,27,27]
[null,null,null,null,"Coincident",null,null,null,null,null,null,null,null,null,null,null,12,12,20,20,20,20,20]
[null,"Moranbah (Mine) ","CONNECTION POINT RATING","MVA","Non-coincident",null,null,null,null,null,null,null,null,null,null,null,215,215,215,215,215,215,215]
[null,null,null,null,"Coincident",null,null,null,null,null,null,null,null,null,null,null,215,215,215,215,215,215,215]
[null,null,"WINTER/SUMMER PEAKING",null,"Non-coincident",null,null,null,null,null,null,null,null,null,null,null,"Summer","Summer","Summer","Summer","Summer","Summer","Summer"]
[null,null,null,null,"Coincident",null,null,null,null,null,null,null,null,null,null,null,"Summer","Summer","Summer","Summer","Summer","Summer","Summer"]
[null,null,"ADJUSTMENTS - EMBEDDED GENERATION","MW","Non-coincident",null,null,null,null,null,null,null,null,null,null,null,0,0,0,0,0,0,0]
[null,null,null,null,"Coincident",null,null,null,null,null,null,null,null,null,null,null,38,38,38,38,38,38,38]
[null,null,"WEATHER CORRECTED MD 10% POE","MW","Non-coincident",null,null,null,null,null,null,null,null,null,null,null,96,95,102,102,111,110,130]
[null,null,null,null,"Coincident",null,null,null,null,null,null,null,null,null,null,null,36,35,42,41,52,50,63]
[null,null,"WEATHER CORRECTED MD 10% POE","MVA","Non-coincident",null,null,null,null,null,null,null,null,null,null,null,104,102,110,110,120,118,140]
[null,null,null,null,"Coincident",null,null,null,null,null,null,null,null,null,null,null,54,53,63,62,78,76,95]
[null,null,"WEATHER CORRECTED MD 50% POE","MW","Non-coincident",null,null,null,null,null,null,null,null,null,null,null,92,91,98,98,106,105,124]
[null,null,null,null,"Coincident",null,null,null,null,null,null,null,null,null,null,null,34,33,39,39,49,47,59]
[null,null,"WEATHER CORRECTED MD 50% POE","MVA","Non-coincident",null,null,null,null,null,null,null,null,null,null,null,99,98,106,105,114,113,133]
[null,null,null,null,"Coincident",null,null,null,null,null,null,null,null,null,null,null,51,49,58,58,73,71,89]
[null,"Moranbah South (Rail) ","CONNECTION POINT RATING","MVA","Non-coincident",null,null,null,null,null,null,null,null,null,null,null,72,72,72,72,72,72,72]
[null,null,null,null,"Coincident",null,null,null,null,null,null,null,null,null,null,null,72,72,72,72,72,72,72]
[null,null,"WINTER/SUMMER PEAKING",null,"Non-coincident",null,null,null,null,null,null,null,null,null,null,null,"Winter","Winter","Winter","Winter","Winter","Winter","Winter"]
[null,null,null,null,"Coincident",null,null,null,null,null,null,null,null,null,null,null,"Summer","Summer","Summer","Summer","Summer","Summer","Summer"]
[null,null,"ADJUSTMENTS - EMBEDDED GENERATION","MW","Non-coincident",null,null,null,null,null,null,null,null,null,null,null,0,0,0,0,0,0,0]
[null,null,null,null,"Coincident",null,null,null,null,null,null,null,null,null,null,null,0,0,0,0,0,0,0]
[null,null,"WEATHER CORRECTED MD 10% POE","MW","Non-coincident"]
[null,null,null,null,"Coincident"]
[null,null,"WEATHER CORRECTED MD 10% POE","MVA","Non-coincident"]
[null,null,null,null,"Coincident"]
[null,null,"WEATHER CORRECTED MD 50% POE","MW","Non-coincident"]
[null,null,null,null,"Coincident"]
[null,null,"WEATHER CORRECTED MD 50% POE","MVA","Non-coincident"]
[null,null,null,null,"Coincident"]
[null,"Moura ","CONNECTION POINT RATING","MVA","Non-coincident",null,null,null,null,null,null,null,null,null,null,null,154,154,154,154,154,154,154]
[null,null,null,null,"Coincident",null,null,null,null,null,null,null,null,null,null,null,154,154,154,154,154,154,154]
[null,null,"WINTER/SUMMER PEAKING",null,"Non-coincident",null,null,null,null,null,null,null,null,null,null,null,"Summer","Summer","Summer","Summer","Summer","Summer","Summer"]
[null,null,null,null,"Coincident",null,null,null,null,null,null,null,null,null,null,null,"Summer","Summer","Summer","Summer","Summer","Summer","Summer"]
[null,null,"ADJUSTMENTS - EMBEDDED GENERATION","MW","Non-coincident",null,null,null,null,null,null,null,null,null,null,null,0,0,0,0,0,0,0]
[null,null,null,null,"Coincident",null,null,null,null,null,null,null,null,null,null,null,0,0,0,0,0,0,0]
[null,null,"WEATHER CORRECTED MD 10% POE","MW","Non-coincident",null,null,null,null,null,null,null,null,null,null,null,62,62,62,62,62,62,61]
[null,null,null,null,"Coincident",null,null,null,null,null,null,null,null,null,null,null,32,32,32,33,33,33,33]
[null,null,"WEATHER CORRECTED MD 10% POE","MVA","Non-coincident",null,null,null,null,null,null,null,null,null,null,null,68,67,67,67,68,67,66]
[null,null,null,null,"Coincident",null,null,null,null,null,null,null,null,null,null,null,35,35,35,35,36,36,35]
[null,null,"WEATHER CORRECTED MD 50% POE","MW","Non-coincident",null,null,null,null,null,null,null,null,null,null,null,59,59,59,59,59,59,58]
[null,null,null,null,"Coincident",null,null,null,null,null,null,null,null,null,null,null,31,31,31,31,31,31,31]
[null,null,"WEATHER CORRECTED MD 50% POE","MVA","Non-coincident",null,null,null,null,null,null,null,null,null,null,null,64,64,64,64,64,64,63]
[null,null,null,null,"Coincident",null,null,null,null,null,null,null,null,null,null,null,33,33,33,33,34,34,33]
[null,"Mt McLaren (Rail) ","CONNECTION POINT RATING","MVA","Non-coincident",null,null,null,null,null,null,null,null,null,null,null,72,72,72,72,72,72,72]
[null,null,null,null,"Coincident",null,null,null,null,null,null,null,null,null,null,null,72,72,72,72,72,72,72]
[null,null,"WINTER/SUMMER PEAKING",null,"Non-coincident",null,null,null,null,null,null,null,null,null,null,null,"Summer","Summer","Summer","Summer","Summer","Summer","Summer"]
[null,null,null,null,"Coincident",null,null,null,null,null,null,null,null,null,null,null,"Summer","Summer","Summer","Summer","Summer","Summer","Summer"]
[null,null,"ADJUSTMENTS - EMBEDDED GENERATION","MW","Non-coincident",null,null,null,null,null,null,null,null,null,null,null,0,0,0,0,0,0,0]
[null,null,null,null,"Coincident",null,null,null,null,null,null,null,null,null,null,null,0,0,0,0,0,0,0]
[null,null,"WEATHER CORRECTED MD 10% POE","MW","Non-coincident"]
[null,null,null,null,"Coincident"]
[null,null,"WEATHER CORRECTED MD 10% POE","MVA","Non-coincident"]
[null,null,null,null,"Coincident"]
[null,null,"WEATHER CORRECTED MD 50% POE","MW","Non-coincident"]
[null,null,null,null,"Coincident"]
[null,null,"WEATHER CORRECTED MD 50% POE","MVA","Non-coincident"]
[null,null,null,null,"Coincident"]
[null,"Nebo ","CONNECTION POINT RATING","MVA","Non-coincident",null,null,null,null,null,null,null,null,null,null,null,10,10,10,10,10,10,10]
[null,null,null,null,"Coincident",null,null,null,null,null,null,null,null,null,null,null,10,10,10,10,10,10,10]
[null,null,"WINTER/SUMMER PEAKING",null,"Non-coincident",null,null,null,null,null,null,null,null,null,null,null,"Summer","Summer","Summer","Summer","Summer","Summer","Summer"]
[null,null,null,null,"Coincident",null,null,null,null,null,null,null,null,null,null,null,"Summer","Summer","Summer","Summer","Summer","Summer","Summer"]
[null,null,"ADJUSTMENTS - EMBEDDED GENERATION","MW","Non-coincident",null,null,null,null,null,null,null,null,null,null,null,0,0,0,0,0,0,0]
[null,null,null,null,"Coincident",null,null,null,null,null,null,null,null,null,null,null,0,0,0,0,0,0,0]
[null,null,"WEATHER CORRECTED MD 10% POE","MW","Non-coincident",null,null,null,null,null,null,null,null,null,null,null,3,3,3,3,3,3,3]
[null,null,null,null,"Coincident",null,null,null,null,null,null,null,null,null,null,null,2,2,2,2,2,2,2]
[null,null,"WEATHER CORRECTED MD 10% POE","MVA","Non-coincident",null,null,null,null,null,null,null,null,null,null,null,3,3,3,4,4,4,4]
[null,null,null,null,"Coincident",null,null,null,null,null,null,null,null,null,null,null,2,2,2,2,2,2,2]
[null,null,"WEATHER CORRECTED MD 50% POE","MW","Non-coincident",null,null,null,null,null,null,null,null,null,null,null,3,3,3,3,3,3,3]
[null,null,null,null,"Coincident",null,null,null,null,null,null,null,null,null,null,null,2,2,2,2,2,2,2]
[null,null,"WEATHER CORRECTED MD 50% POE","MVA","Non-coincident",null,null,null,null,null,null,null,null,null,null,null,3,3,3,3,3,3,3]
[null,null,null,null,"Coincident",null,null,null,null,null,null,null,null,null,null,null,2,2,2,2,2,2,2]
[null,"Newlands ","CONNECTION POINT RATING","MVA","Non-coincident",null,null,null,null,null,null,null,null,null,null,null,152,152,152,152,152,152,152]
[null,null,null,null,"Coincident",null,null,null,null,null,null,null,null,null,null,null,152,152,152,152,152,152,152]
[null,null,"WINTER/SUMMER PEAKING",null,"Non-coincident",null,null,null,null,null,null,null,null,null,null,null,"Summer","Summer","Summer","Summer","Summer","Summer","Summer"]
[null,null,null,null,"Coincident",null,null,null,null,null,null,null,null,null,null,null,"Summer","Summer","Summer","Summer","Summer","Summer","Summer"]
[null,null,"ADJUSTMENTS - EMBEDDED GENERATION","MW","Non-coincident",null,null,null,null,null,null,null,null,null,null,null,0,0,0,0,0,0,0]
[null,null,null,null,"Coincident",null,null,null,null,null,null,null,null,null,null,null,0,0,0,0,0,0,0]
[null,null,"WEATHER CORRECTED MD 10% POE","MW","Non-coincident",null,null,null,null,null,null,null,null,null,null,null,37,37,36,42,41,41,40]
[null,null,null,null,"Coincident",null,null,null,null,null,null,null,null,null,null,null,27,26,26,32,31,31,30]
[null,null,"WEATHER CORRECTED MD 10% POE","MVA","Non-coincident",null,null,null,null,null,null,null,null,null,null,null,41,40,40,46,45,45,44]
[null,null,null,null,"Coincident",null,null,null,null,null,null,null,null,null,null,null,30,29,29,35,34,34,33]
[null,null,"WEATHER CORRECTED MD 50% POE","MW","Non-coincident",null,null,null,null,null,null,null,null,null,null,null,35,35,35,40,39,38,38]
[null,null,null,null,"Coincident",null,null,null,null,null,null,null,null,null,null,null,25,25,25,30,29,29,28]
[null,null,"WEATHER CORRECTED MD 50% POE","MVA","Non-coincident",null,null,null,null,null,null,null,null,null,null,null,39,38,38,43,43,42,41]
[null,null,null,null,"Coincident",null,null,null,null,null,null,null,null,null,null,null,28,28,27,33,32,32,31]
[null,"Norwich Park (Rail) ","CONNECTION POINT RATING","MVA","Non-coincident",null,null,null,null,null,null,null,null,null,null,null,72,72,72,72,72,72,72]
[null,null,null,null,"Coincident",null,null,null,null,null,null,null,null,null,null,null,72,72,72,72,72,72,72]
[null,null,"WINTER/SUMMER PEAKING",null,"Non-coincident",null,null,null,null,null,null,null,null,null,null,null,"Winter","Winter","Winter","Winter","Winter","Winter","Winter"]
[null,null,null,null,"Coincident",null,null,null,null,null,null,null,null,null,null,null,"Summer","Summer","Summer","Summer","Summer","Summer","Summer"]
[null,null,"ADJUSTMENTS - EMBEDDED GENERATION","MW","Non-coincident",null,null,null,null,null,null,null,null,null,null,null,0,0,0,0,0,0,0]
[null,null,null,null,"Coincident",null,null,null,null,null,null,null,null,null,null,null,0,0,0,0,0,0,0]
[null,null,"WEATHER CORRECTED MD 10% POE","MW","Non-coincident"]
[null,null,null,null,"Coincident"]
[null,null,"WEATHER CORRECTED MD 10% POE","MVA","Non-coincident"]
[null,null,null,null,"Coincident"]
[null,null,"WEATHER CORRECTED MD 50% POE","MW","Non-coincident"]
[null,null,null,null,"Coincident"]
[null,null,"WEATHER CORRECTED MD 50% POE","MVA","Non-coincident"]
[null,null,null,null,"Coincident"]
[null,"Oakey ","CONNECTION POINT RATING","MVA","Non-coincident",null,null,null,null,null,null,null,null,null,null,null,732,732,732,732,732,732,732]
[null,null,null,null,"Coincident",null,null,null,null,null,null,null,null,null,null,null,732,732,732,732,732,732,732]
[null,null,"WINTER/SUMMER PEAKING",null,"Non-coincident",null,null,null,null,null,null,null,null,null,null,null,"Summer","Summer","Summer","Summer","Summer","Summer","Summer"]
[null,null,null,null,"Coincident",null,null,null,null,null,null,null,null,null,null,null,"Summer","Summer","Summer","Summer","Summer","Summer","Summer"]
[null,null,"ADJUSTMENTS - EMBEDDED GENERATION","MW","Non-coincident",null,null,null,null,null,null,null,null,null,null,null,0,0,0,0,0,0,0]
[null,null,null,null,"Coincident",null,null,null,null,null,null,null,null,null,null,null,0,0,0,0,0,0,0]
[null,null,"WEATHER CORRECTED MD 10% POE","MW","Non-coincident",null,null,null,null,null,null,null,null,null,null,null,26,27,27,27,27,27,27]
[null,null,null,null,"Coincident",null,null,null,null,null,null,null,null,null,null,null,23,24,24,24,24,24,24]
[null,null,"WEATHER CORRECTED MD 10% POE","MVA","Non-coincident",null,null,null,null,null,null,null,null,null,null,null,27,28,27,28,28,28,27]
[null,null,null,null,"Coincident",null,null,null,null,null,null,null,null,null,null,null,23,24,24,24,24,24,24]
[null,null,"WEATHER CORRECTED MD 50% POE","MW","Non-coincident",null,null,null,null,null,null,null,null,null,null,null,25,26,26,26,26,26,25]
[null,null,null,null,"Coincident",null,null,null,null,null,null,null,null,null,null,null,22,23,23,23,23,23,22]
[null,null,"WEATHER CORRECTED MD 50% POE","MVA","Non-coincident",null,null,null,null,null,null,null,null,null,null,null,25,26,26,26,26,26,26]
[null,null,null,null,"Coincident",null,null,null,null,null,null,null,null,null,null,null,22,23,23,23,23,23,22]
[null,"Oonooie (Rail) ","CONNECTION POINT RATING","MVA","Non-coincident",null,null,null,null,null,null,null,null,null,null,null,77,77,77,77,77,77,77]
[null,null,null,null,"Coincident",null,null,null,null,null,null,null,null,null,null,null,77,77,77,77,77,77,77]
[null,null,"WINTER/SUMMER PEAKING",null,"Non-coincident",null,null,null,null,null,null,null,null,null,null,null,"Summer","Summer","Summer","Summer","Summer","Summer","Summer"]
[null,null,null,null,"Coincident",null,null,null,null,null,null,null,null,null,null,null,"Summer","Summer","Summer","Summer","Summer","Summer","Summer"]
[null,null,"ADJUSTMENTS - EMBEDDED GENERATION","MW","Non-coincident",null,null,null,null,null,null,null,null,null,null,null,0,0,0,0,0,0,0]
[null,null,null,null,"Coincident",null,null,null,null,null,null,null,null,null,null,null,0,0,0,0,0,0,0]
[null,null,"WEATHER CORRECTED MD 10% POE","MW","Non-coincident"]
[null,null,null,null,"Coincident"]
[null,null,"WEATHER CORRECTED MD 10% POE","MVA","Non-coincident"]
[null,null,null,null,"Coincident"]
[null,null,"WEATHER CORRECTED MD 50% POE","MW","Non-coincident"]
[null,null,null,null,"Coincident"]
[null,null,"WEATHER CORRECTED MD 50% POE","MVA","Non-coincident"]
[null,null,null,null,"Coincident"]
[null,"Pandoin","CONNECTION POINT RATING","MVA","Non-coincident",null,null,null,null,null,null,null,null,null,null,null,116,116,116,116,116,116,116]
[null,null,null,null,"Coincident",null,null,null,null,null,null,null,null,null,null,null,116,116,116,116,116,116,116]
[null,null,"WINTER/SUMMER PEAKING",null,"Non-coincident",null,null,null,null,null,null,null,null,null,null,null,"Summer","Summer","Summer","Summer","Summer","Summer","Summer"]
[null,null,null,null,"Coincident",null,null,null,null,null,null,null,null,null,null,null,"Summer","Summer","Summer","Summer","Summer","Summer","Summer"]
[null,null,"ADJUSTMENTS - EMBEDDED GENERATION","MW","Non-coincident",null,null,null,null,null,null,null,null,null,null,null,0,0,0,0,0,0,0]
[null,null,null,null,"Coincident",null,null,null,null,null,null,null,null,null,null,null,0,0,0,0,0,0,0]
[null,null,"WEATHER CORRECTED MD 10% POE","MW","Non-coincident",null,null,null,null,null,null,null,null,null,null,null,45,45,45,45,45,45,45]
[null,null,null,null,"Coincident",null,null,null,null,null,null,null,null,null,null,null,43,43,43,43,43,43,42]
[null,null,"WEATHER CORRECTED MD 10% POE","MVA","Non-coincident",null,null,null,null,null,null,null,null,null,null,null,46,46,46,46,46,46,45]
[null,null,null,null,"Coincident",null,null,null,null,null,null,null,null,null,null,null,43,44,43,44,43,43,43]
[null,null,"WEATHER CORRECTED MD 50% POE","MW","Non-coincident",null,null,null,null,null,null,null,null,null,null,null,43,43,43,43,43,43,42]
[null,null,null,null,"Coincident",null,null,null,null,null,null,null,null,null,null,null,41,41,41,41,41,41,40]
[null,null,"WEATHER CORRECTED MD 50% POE","MVA","Non-coincident",null,null,null,null,null,null,null,null,null,null,null,44,44,44,44,44,43,43]
[null,null,null,null,"Coincident",null,null,null,null,null,null,null,null,null,null,null,42,42,41,42,41,41,40]
[null,"Peak Downs (Rail) ","CONNECTION POINT RATING","MVA","Non-coincident",null,null,null,null,null,null,null,null,null,null,null,72,72,72,72,72,72,72]
[null,null,null,null,"Coincident",null,null,null,null,null,null,null,null,null,null,null,72,72,72,72,72,72,72]
[null,null,"WINTER/SUMMER PEAKING",null,"Non-coincident",null,null,null,null,null,null,null,null,null,null,null,"Summer","Summer","Summer","Summer","Summer","Summer","Summer"]
[null,null,null,null,"Coincident",null,null,null,null,null,null,null,null,null,null,null,"Summer","Summer","Summer","Summer","Summer","Summer","Summer"]
[null,null,"ADJUSTMENTS - EMBEDDED GENERATION","MW","Non-coincident",null,null,null,null,null,null,null,null,null,null,null,0,0,0,0,0,0,0]
[null,null,null,null,"Coincident",null,null,null,null,null,null,null,null,null,null,null,0,0,0,0,0,0,0]
[null,null,"WEATHER CORRECTED MD 10% POE","MW","Non-coincident"]
[null,null,null,null,"Coincident"]
[null,null,"WEATHER CORRECTED MD 10% POE","MVA","Non-coincident"]
[null,null,null,null,"Coincident"]
[null,null,"WEATHER CORRECTED MD 50% POE","MW","Non-coincident"]
[null,null,null,null,"Coincident"]
[null,null,"WEATHER CORRECTED MD 50% POE","MVA","Non-coincident"]
[null,null,null,null,"Coincident"]
[null,"Pioneer Valley ","CONNECTION POINT RATING","MVA","Non-coincident",null,null,null,null,null,null,null,null,null,null,null,265,265,265,265,265,265,265]
[null,null,null,null,"Coincident",null,null,null,null,null,null,null,null,null,null,null,265,265,265,265,265,265,265]
[null,null,"WINTER/SUMMER PEAKING",null,"Non-coincident",null,null,null,null,null,null,null,null,null,null,null,"Summer","Summer","Summer","Summer","Summer","Summer","Summer"]
[null,null,null,null,"Coincident",null,null,null,null,null,null,null,null,null,null,null,"Summer","Summer","Summer","Summer","Summer","Summer","Summer"]
[null,null,"ADJUSTMENTS - EMBEDDED GENERATION","MW","Non-coincident",null,null,null,null,null,null,null,null,null,null,null,-2,-2,-2,-2,-2,-2,-2]
[null,null,null,null,"Coincident",null,null,null,null,null,null,null,null,null,null,null,21,21,21,21,21,21,21]
[null,null,"WEATHER CORRECTED MD 10% POE","MW","Non-coincident",null,null,null,null,null,null,null,null,null,null,null,65,65,64,64,63,63,62]
[null,null,null,null,"Coincident",null,null,null,null,null,null,null,null,null,null,null,16,15,15,15,14,14,13]
[null,null,"WEATHER CORRECTED MD 10% POE","MVA","Non-coincident",null,null,null,null,null,null,null,null,null,null,null,67,67,66,66,65,65,64]
[null,null,null,null,"Coincident",null,null,null,null,null,null,null,null,null,null,null,17,16,16,16,15,15,14]
[null,null,"WEATHER CORRECTED MD 50% POE","MW","Non-coincident",null,null,null,null,null,null,null,null,null,null,null,59,58,58,58,57,56,55]
[null,null,null,null,"Coincident",null,null,null,null,null,null,null,null,null,null,null,12,12,11,11,11,10,10]
[null,null,"WEATHER CORRECTED MD 50% POE","MVA","Non-coincident",null,null,null,null,null,null,null,null,null,null,null,60,60,59,59,58,58,57]
[null,null,null,null,"Coincident",null,null,null,null,null,null,null,null,null,null,null,13,12,12,12,11,11,10]
[null,"Proserpine ","CONNECTION POINT RATING","MVA","Non-coincident",null,null,null,null,null,null,null,null,null,null,null,190,190,190,190,190,190,190]
[null,null,null,null,"Coincident",null,null,null,null,null,null,null,null,null,null,null,190,190,190,190,190,190,190]
[null,null,"WINTER/SUMMER PEAKING",null,"Non-coincident",null,null,null,null,null,null,null,null,null,null,null,"Summer","Summer","Summer","Summer","Summer","Summer","Summer"]
[null,null,null,null,"Coincident",null,null,null,null,null,null,null,null,null,null,null,"Summer","Summer","Summer","Summer","Summer","Summer","Summer"]
[null,null,"ADJUSTMENTS - EMBEDDED GENERATION","MW","Non-coincident",null,null,null,null,null,null,null,null,null,null,null,0,0,0,0,0,0,0]
[null,null,null,null,"Coincident",null,null,null,null,null,null,null,null,null,null,null,0,0,0,0,0,0,0]
[null,null,"WEATHER CORRECTED MD 10% POE","MW","Non-coincident",null,null,null,null,null,null,null,null,null,null,null,59,59,58,58,58,62,66]
[null,null,null,null,"Coincident",null,null,null,null,null,null,null,null,null,null,null,36,35,35,35,35,36,36]
[null,null,"WEATHER CORRECTED MD 10% POE","MVA","Non-coincident",null,null,null,null,null,null,null,null,null,null,null,62,61,61,61,60,65,69]
[null,null,null,null,"Coincident",null,null,null,null,null,null,null,null,null,null,null,38,38,38,38,37,38,39]
[null,null,"WEATHER CORRECTED MD 50% POE","MW","Non-coincident",null,null,null,null,null,null,null,null,null,null,null,55,55,54,54,54,58,62]
[null,null,null,null,"Coincident",null,null,null,null,null,null,null,null,null,null,null,33,33,33,33,32,33,34]
[null,null,"WEATHER CORRECTED MD 50% POE","MVA","Non-coincident",null,null,null,null,null,null,null,null,null,null,null,57,57,56,56,56,60,64]
[null,null,null,null,"Coincident",null,null,null,null,null,null,null,null,null,null,null,36,35,35,35,34,35,36]
[null,"QLD Nickel (Yabulu) ","CONNECTION POINT RATING","MVA","Non-coincident",null,null,null,null,null,null,null,null,null,null,null,229,229,229,229,229,229,229]
[null,null,null,null,"Coincident",null,null,null,null,null,null,null,null,null,null,null,229,229,229,229,229,229,229]
[null,null,"WINTER/SUMMER PEAKING",null,"Non-coincident",null,null,null,null,null,null,null,null,null,null,null,"Summer","Summer","Summer","Summer","Summer","Summer","Summer"]
[null,null,null,null,"Coincident",null,null,null,null,null,null,null,null,null,null,null,"Summer","Summer","Summer","Summer","Summer","Summer","Summer"]
[null,null,"ADJUSTMENTS - EMBEDDED GENERATION","MW","Non-coincident",null,null,null,null,null,null,null,null,null,null,null,0,0,0,0,0,0,0]
[null,null,null,null,"Coincident",null,null,null,null,null,null,null,null,null,null,null,0,0,0,0,0,0,0]
[null,null,"WEATHER CORRECTED MD 10% POE","MW","Non-coincident"]
[null,null,null,null,"Coincident"]
[null,null,"WEATHER CORRECTED MD 10% POE","MVA","Non-coincident"]
[null,null,null,null,"Coincident"]
[null,null,"WEATHER CORRECTED MD 50% POE","MW","Non-coincident"]
[null,null,null,null,"Coincident"]
[null,null,"WEATHER CORRECTED MD 50% POE","MVA","Non-coincident"]
[null,null,null,null,"Coincident"]
[null,"Raglan ","CONNECTION POINT RATING","MVA","Non-coincident"]
[null,null,null,null,"Coincident"]
[null,null,"WINTER/SUMMER PEAKING",null,"Non-coincident",null,null,null,null,null,null,null,null,null,null,null,"Summer","Summer","Summer","Summer","Summer","Summer","Summer"]
[null,null,null,null,"Coincident",null,null,null,null,null,null,null,null,null,null,null,"Summer","Summer","Summer","Summer","Summer","Summer","Summer"]
[null,null,"ADJUSTMENTS - EMBEDDED GENERATION","MW","Non-coincident",null,null,null,null,null,null,null,null,null,null,null,0,0,0,0,0,0,0]
[null,null,null,null,"Coincident",null,null,null,null,null,null,null,null,null,null,null,0,0,0,0,0,0,0]
[null,null,"WEATHER CORRECTED MD 10% POE","MW","Non-coincident"]
[null,null,null,null,"Coincident"]
[null,null,"WEATHER CORRECTED MD 10% POE","MVA","Non-coincident"]
[null,null,null,null,"Coincident"]
[null,null,"WEATHER CORRECTED MD 50% POE","MW","Non-coincident"]
[null,null,null,null,"Coincident"]
[null,null,"WEATHER CORRECTED MD 50% POE","MVA","Non-coincident"]
[null,null,null,null,"Coincident"]
[null,"Rockhampton ","CONNECTION POINT RATING","MVA","Non-coincident",null,null,null,null,null,null,null,null,null,null,null,229,229,229,229,229,229,229]
[null,null,null,null,"Coincident",null,null,null,null,null,null,null,null,null,null,null,229,229,229,229,229,229,229]
[null,null,"WINTER/SUMMER PEAKING",null,"Non-coincident",null,null,null,null,null,null,null,null,null,null,null,"Summer","Summer","Summer","Summer","Summer","Summer","Summer"]
[null,null,null,null,"Coincident",null,null,null,null,null,null,null,null,null,null,null,"Summer","Summer","Summer","Summer","Summer","Summer","Summer"]
[null,null,"ADJUSTMENTS - EMBEDDED GENERATION","MW","Non-coincident",null,null,null,null,null,null,null,null,null,null,null,0,0,0,0,0,0,0]
[null,null,null,null,"Coincident",null,null,null,null,null,null,null,null,null,null,null,0,0,0,0,0,0,0]
[null,null,"WEATHER CORRECTED MD 10% POE","MW","Non-coincident",null,null,null,null,null,null,null,null,null,null,null,107,108,107,108,107,106,105]
[null,null,null,null,"Coincident",null,null,null,null,null,null,null,null,null,null,null,107,108,107,108,107,106,105]
[null,null,"WEATHER CORRECTED MD 10% POE","MVA","Non-coincident",null,null,null,null,null,null,null,null,null,null,null,111,111,111,111,111,110,109]
[null,null,null,null,"Coincident",null,null,null,null,null,null,null,null,null,null,null,110,111,110,111,110,109,108]
[null,null,"WEATHER CORRECTED MD 50% POE","MW","Non-coincident",null,null,null,null,null,null,null,null,null,null,null,96,96,96,96,95,95,94]
[null,null,null,null,"Coincident",null,null,null,null,null,null,null,null,null,null,null,96,96,96,96,95,95,94]
[null,null,"WEATHER CORRECTED MD 50% POE","MVA","Non-coincident",null,null,null,null,null,null,null,null,null,null,null,99,100,99,99,99,98,97]
[null,null,null,null,"Coincident",null,null,null,null,null,null,null,null,null,null,null,98,99,98,99,97,97,96]
[null,"Rocklands (Rail) ","CONNECTION POINT RATING","MVA","Non-coincident",null,null,null,null,null,null,null,null,null,null,null,101,101,101,101,101,101,101]
[null,null,null,null,"Coincident",null,null,null,null,null,null,null,null,null,null,null,101,101,101,101,101,101,101]
[null,null,"WINTER/SUMMER PEAKING",null,"Non-coincident",null,null,null,null,null,null,null,null,null,null,null,"Winter","Winter","Winter","Winter","Winter","Winter","Winter"]
[null,null,null,null,"Coincident",null,null,null,null,null,null,null,null,null,null,null,"Summer","Summer","Summer","Summer","Summer","Summer","Summer"]
[null,null,"ADJUSTMENTS - EMBEDDED GENERATION","MW","Non-coincident",null,null,null,null,null,null,null,null,null,null,null,0,0,0,0,0,0,0]
[null,null,null,null,"Coincident",null,null,null,null,null,null,null,null,null,null,null,0,0,0,0,0,0,0]
[null,null,"WEATHER CORRECTED MD 10% POE","MW","Non-coincident"]
[null,null,null,null,"Coincident"]
[null,null,"WEATHER CORRECTED MD 10% POE","MVA","Non-coincident"]
[null,null,null,null,"Coincident"]
[null,null,"WEATHER CORRECTED MD 50% POE","MW","Non-coincident"]
[null,null,null,null,"Coincident"]
[null,null,"WEATHER CORRECTED MD 50% POE","MVA","Non-coincident"]
[null,null,null,null,"Coincident"]
[null,"Ross ","CONNECTION POINT RATING","MVA","Non-coincident",null,null,null,null,null,null,null,null,null,null,null,572,572,572,572,572,572,572]
[null,null,null,null,"Coincident",null,null,null,null,null,null,null,null,null,null,null,572,572,572,572,572,572,572]
[null,null,"WINTER/SUMMER PEAKING",null,"Non-coincident",null,null,null,null,null,null,null,null,null,null,null,"Summer","Summer","Summer","Summer","Summer","Summer","Summer"]
[null,null,null,null,"Coincident",null,null,null,null,null,null,null,null,null,null,null,"Summer","Summer","Summer","Summer","Summer","Summer","Summer"]
[null,null,"ADJUSTMENTS - EMBEDDED GENERATION","MW","Non-coincident",null,null,null,null,null,null,null,null,null,null,null,0,0,0,0,0,0,0]
[null,null,null,null,"Coincident",null,null,null,null,null,null,null,null,null,null,null,0,0,0,0,0,0,0]
[null,null,"WEATHER CORRECTED MD 10% POE","MW","Non-coincident",null,null,null,null,null,null,null,null,null,null,null,42,42,42,42,42,42,41]
[null,null,null,null,"Coincident",null,null,null,null,null,null,null,null,null,null,null,31,31,30,31,30,30,30]
[null,null,"WEATHER CORRECTED MD 10% POE","MVA","Non-coincident",null,null,null,null,null,null,null,null,null,null,null,45,44,44,45,44,44,44]
[null,null,null,null,"Coincident",null,null,null,null,null,null,null,null,null,null,null,33,33,33,33,33,33,32]
[null,null,"WEATHER CORRECTED MD 50% POE","MW","Non-coincident",null,null,null,null,null,null,null,null,null,null,null,38,38,38,38,38,38,38]
[null,null,null,null,"Coincident",null,null,null,null,null,null,null,null,null,null,null,28,28,28,28,28,28,28]
[null,null,"WEATHER CORRECTED MD 50% POE","MVA","Non-coincident",null,null,null,null,null,null,null,null,null,null,null,41,41,41,41,41,40,40]
[null,null,null,null,"Coincident",null,null,null,null,null,null,null,null,null,null,null,31,30,30,30,30,30,30]
[null,"Stony Creek ","CONNECTION POINT RATING","MVA","Non-coincident",null,null,null,null,null,null,null,null,null,null,null,572,572,572,572,572,572,572]
[null,null,null,null,"Coincident",null,null,null,null,null,null,null,null,null,null,null,572,572,572,572,572,572,572]
[null,null,"WINTER/SUMMER PEAKING",null,"Non-coincident",null,null,null,null,null,null,null,null,null,null,null,"Summer","Summer","Summer","Summer","Summer","Summer","Summer"]
[null,null,null,null,"Coincident",null,null,null,null,null,null,null,null,null,null,null,"Summer","Summer","Summer","Summer","Summer","Summer","Summer"]
[null,null,"ADJUSTMENTS - EMBEDDED GENERATION","MW","Non-coincident",null,null,null,null,null,null,null,null,null,null,null,0,0,0,0,0,0,0]
[null,null,null,null,"Coincident",null,null,null,null,null,null,null,null,null,null,null,0,0,0,0,0,0,0]
[null,null,"WEATHER CORRECTED MD 10% POE","MW","Non-coincident",null,null,null,null,null,null,null,null,null,null,null,3,3,3,3,3,3,3]
[null,null,null,null,"Coincident",null,null,null,null,null,null,null,null,null,null,null,0,0,0,0,0,0,0]
[null,null,"WEATHER CORRECTED MD 10% POE","MVA","Non-coincident",null,null,null,null,null,null,null,null,null,null,null,3,3,3,3,3,3,3]
[null,null,null,null,"Coincident",null,null,null,null,null,null,null,null,null,null,null,2,2,2,2,2,2,2]
[null,null,"WEATHER CORRECTED MD 50% POE","MW","Non-coincident",null,null,null,null,null,null,null,null,null,null,null,3,3,3,3,2,2,2]
[null,null,null,null,"Coincident",null,null,null,null,null,null,null,null,null,null,null,0,0,0,0,0,0,0]
[null,null,"WEATHER CORRECTED MD 50% POE","MVA","Non-coincident",null,null,null,null,null,null,null,null,null,null,null,3,3,3,3,3,3,3]
[null,null,null,null,"Coincident",null,null,null,null,null,null,null,null,null,null,null,2,2,2,2,2,2,2]
[null,"Tangkam (Dalby) ","CONNECTION POINT RATING","MVA","Non-coincident",null,null,null,null,null,null,null,null,null,null,null,487,487,487,487,487,487,487]
[null,null,null,null,"Coincident",null,null,null,null,null,null,null,null,null,null,null,487,487,487,487,487,487,487]
[null,null,"WINTER/SUMMER PEAKING",null,"Non-coincident",null,null,null,null,null,null,null,null,null,null,null,"Summer","Summer","Summer","Summer","Summer","Summer","Summer"]
[null,null,null,null,"Coincident",null,null,null,null,null,null,null,null,null,null,null,"Summer","Summer","Summer","Summer","Summer","Summer","Summer"]
[null,null,"ADJUSTMENTS - EMBEDDED GENERATION","MW","Non-coincident",null,null,null,null,null,null,null,null,null,null,null,0,0,0,0,0,0,0]
[null,null,null,null,"Coincident",null,null,null,null,null,null,null,null,null,null,null,22,22,22,22,22,22,22]
[null,null,"WEATHER CORRECTED MD 10% POE","MW","Non-coincident",null,null,null,null,null,null,null,null,null,null,null,32,32,32,33,34,34,34]
[null,null,null,null,"Coincident",null,null,null,null,null,null,null,null,null,null,null,8,8,9,9,10,10,10]
[null,null,"WEATHER CORRECTED MD 10% POE","MVA","Non-coincident",null,null,null,null,null,null,null,null,null,null,null,33,33,33,34,34,34,34]
[null,null,null,null,"Coincident",null,null,null,null,null,null,null,null,null,null,null,19,19,19,21,22,22,22]
[null,null,"WEATHER CORRECTED MD 50% POE","MW","Non-coincident",null,null,null,null,null,null,null,null,null,null,null,29,29,29,30,31,31,31]
[null,null,null,null,"Coincident",null,null,null,null,null,null,null,null,null,null,null,6,6,6,7,7,7,7]
[null,null,"WEATHER CORRECTED MD 50% POE","MVA","Non-coincident",null,null,null,null,null,null,null,null,null,null,null,30,30,30,31,31,31,31]
[null,null,null,null,"Coincident",null,null,null,null,null,null,null,null,null,null,null,13,13,13,15,16,16,16]
[null,"Tarong 132kV Load ","CONNECTION POINT RATING","MVA","Non-coincident"]
[null,null,null,null,"Coincident"]
[null,null,"WINTER/SUMMER PEAKING",null,"Non-coincident"]
[null,null,null,null,"Coincident"]
[null,null,"ADJUSTMENTS - EMBEDDED GENERATION","MW","Non-coincident"]
[null,null,null,null,"Coincident"]
[null,null,"WEATHER CORRECTED MD 10% POE","MW","Non-coincident"]
[null,null,null,null,"Coincident"]
[null,null,"WEATHER CORRECTED MD 10% POE","MVA","Non-coincident"]
[null,null,null,null,"Coincident"]
[null,null,"WEATHER CORRECTED MD 50% POE","MW","Non-coincident"]
[null,null,null,null,"Coincident"]
[null,null,"WEATHER CORRECTED MD 50% POE","MVA","Non-coincident"]
[null,null,null,null,"Coincident"]
[null,"Tarong 66kV Load ","CONNECTION POINT RATING","MVA","Non-coincident",null,null,null,null,null,null,null,null,null,null,null,457,457,457,457,457,457,457]
[null,null,null,null,"Coincident",null,null,null,null,null,null,null,null,null,null,null,457,457,457,457,457,457,457]
[null,null,"WINTER/SUMMER PEAKING",null,"Non-coincident",null,null,null,null,null,null,null,null,null,null,null,"Summer","Summer","Summer","Summer","Summer","Summer","Summer"]
[null,null,null,null,"Coincident",null,null,null,null,null,null,null,null,null,null,null,"Summer","Summer","Summer","Summer","Summer","Summer","Summer"]
[null,null,"ADJUSTMENTS - EMBEDDED GENERATION","MW","Non-coincident",null,null,null,null,null,null,null,null,null,null,null,0,0,0,0,0,0,0]
[null,null,null,null,"Coincident",null,null,null,null,null,null,null,null,null,null,null,0,0,0,0,0,0,0]
[null,null,"WEATHER CORRECTED MD 10% POE","MW","Non-coincident",null,null,null,null,null,null,null,null,null,null,null,43,42,42,42,42,42,41]
[null,null,null,null,"Coincident",null,null,null,null,null,null,null,null,null,null,null,30,30,30,30,30,29,29]
[null,null,"WEATHER CORRECTED MD 10% POE","MVA","Non-coincident",null,null,null,null,null,null,null,null,null,null,null,47,47,47,47,47,46,46]
[null,null,null,null,"Coincident",null,null,null,null,null,null,null,null,null,null,null,34,34,33,34,33,33,33]
[null,null,"WEATHER CORRECTED MD 50% POE","MW","Non-coincident",null,null,null,null,null,null,null,null,null,null,null,40,40,39,40,39,39,38]
[null,null,null,null,"Coincident",null,null,null,null,null,null,null,null,null,null,null,29,28,28,28,28,28,27]
[null,null,"WEATHER CORRECTED MD 50% POE","MVA","Non-coincident",null,null,null,null,null,null,null,null,null,null,null,44,44,44,44,44,43,43]
[null,null,null,null,"Coincident",null,null,null,null,null,null,null,null,null,null,null,32,32,32,32,31,31,31]
[null,"Teebar Creek ","CONNECTION POINT RATING","MVA","Non-coincident",null,null,null,null,null,null,null,null,null,null,null,905,905,905,905,905,905,905]
[null,null,null,null,"Coincident",null,null,null,null,null,null,null,null,null,null,null,905,905,905,905,905,905,905]
[null,null,"WINTER/SUMMER PEAKING",null,"Non-coincident",null,null,null,null,null,null,null,null,null,null,null,"Summer","Summer","Summer","Summer","Summer","Summer","Summer"]
[null,null,null,null,"Coincident",null,null,null,null,null,null,null,null,null,null,null,"Summer","Summer","Summer","Summer","Summer","Summer","Summer"]
[null,null,"ADJUSTMENTS - EMBEDDED GENERATION","MW","Non-coincident",null,null,null,null,null,null,null,null,null,null,null,0,0,0,0,0,0,0]
[null,null,null,null,"Coincident",null,null,null,null,null,null,null,null,null,null,null,2,2,2,2,2,2,2]
[null,null,"WEATHER CORRECTED MD 10% POE","MW","Non-coincident",null,null,null,null,null,null,null,null,null,null,null,126,126,125,126,125,124,123]
[null,null,null,null,"Coincident",null,null,null,null,null,null,null,null,null,null,null,111,111,110,111,110,109,108]
[null,null,"WEATHER CORRECTED MD 10% POE","MVA","Non-coincident",null,null,null,null,null,null,null,null,null,null,null,132,131,131,132,131,130,129]
[null,null,null,null,"Coincident",null,null,null,null,null,null,null,null,null,null,null,119,118,118,119,117,117,115]
[null,null,"WEATHER CORRECTED MD 50% POE","MW","Non-coincident",null,null,null,null,null,null,null,null,null,null,null,116,115,115,115,115,114,112]
[null,null,null,null,"Coincident",null,null,null,null,null,null,null,null,null,null,null,103,102,102,102,102,101,100]
[null,null,"WEATHER CORRECTED MD 50% POE","MVA","Non-coincident",null,null,null,null,null,null,null,null,null,null,null,121,121,120,121,120,119,117]
[null,null,null,null,"Coincident",null,null,null,null,null,null,null,null,null,null,null,109,109,108,109,108,107,106]
[null,"Tully ","CONNECTION POINT RATING","MVA","Non-coincident",null,null,null,null,null,null,null,null,null,null,null,50,50,50,50,50,50,50]
[null,null,null,null,"Coincident",null,null,null,null,null,null,null,null,null,null,null,50,50,50,50,50,50,50]
[null,null,"WINTER/SUMMER PEAKING",null,"Non-coincident",null,null,null,null,null,null,null,null,null,null,null,"Summer","Summer","Summer","Summer","Summer","Summer","Summer"]
[null,null,null,null,"Coincident",null,null,null,null,null,null,null,null,null,null,null,"Summer","Summer","Summer","Summer","Summer","Summer","Summer"]
[null,null,"ADJUSTMENTS - EMBEDDED GENERATION","MW","Non-coincident",null,null,null,null,null,null,null,null,null,null,null,0,0,0,0,0,0,0]
[null,null,null,null,"Coincident",null,null,null,null,null,null,null,null,null,null,null,0,0,0,0,0,0,0]
[null,null,"WEATHER CORRECTED MD 10% POE","MW","Non-coincident",null,null,null,null,null,null,null,null,null,null,null,16,16,16,16,16,15,15]
[null,null,null,null,"Coincident",null,null,null,null,null,null,null,null,null,null,null,12,12,12,12,11,11,11]
[null,null,"WEATHER CORRECTED MD 10% POE","MVA","Non-coincident",null,null,null,null,null,null,null,null,null,null,null,17,17,17,17,16,16,16]
[null,null,null,null,"Coincident",null,null,null,null,null,null,null,null,null,null,null,12,12,12,12,12,12,11]
[null,null,"WEATHER CORRECTED MD 50% POE","MW","Non-coincident",null,null,null,null,null,null,null,null,null,null,null,15,14,14,14,14,14,14]
[null,null,null,null,"Coincident",null,null,null,null,null,null,null,null,null,null,null,11,11,11,11,10,10,10]
[null,null,"WEATHER CORRECTED MD 50% POE","MVA","Non-coincident",null,null,null,null,null,null,null,null,null,null,null,15,15,15,15,15,15,14]
[null,null,null,null,"Coincident",null,null,null,null,null,null,null,null,null,null,null,11,11,11,11,11,10,10]
[null,"Turkinje (Craiglee) ","CONNECTION POINT RATING","MVA","Non-coincident",null,null,null,null,null,null,null,null,null,null,null,359,359,359,359,359,359,359]
[null,null,null,null,"Coincident",null,null,null,null,null,null,null,null,null,null,null,359,359,359,359,359,359,359]
[null,null,"WINTER/SUMMER PEAKING",null,"Non-coincident",null,null,null,null,null,null,null,null,null,null,null,"Summer","Summer","Summer","Summer","Summer","Summer","Summer"]
[null,null,null,null,"Coincident",null,null,null,null,null,null,null,null,null,null,null,"Summer","Summer","Summer","Summer","Summer","Summer","Summer"]
[null,null,"ADJUSTMENTS - EMBEDDED GENERATION","MW","Non-coincident",null,null,null,null,null,null,null,null,null,null,null,0,0,0,0,0,0,0]
[null,null,null,null,"Coincident",null,null,null,null,null,null,null,null,null,null,null,0,0,0,0,0,0,0]
[null,null,"WEATHER CORRECTED MD 10% POE","MW","Non-coincident",null,null,null,null,null,null,null,null,null,null,null,23,23,23,23,23,23,22]
[null,null,null,null,"Coincident",null,null,null,null,null,null,null,null,null,null,null,18,18,17,17,17,17,17]
[null,null,"WEATHER CORRECTED MD 10% POE","MVA","Non-coincident",null,null,null,null,null,null,null,null,null,null,null,26,25,25,25,25,25,24]
[null,null,null,null,"Coincident",null,null,null,null,null,null,null,null,null,null,null,21,21,20,20,20,20,19]
[null,null,"WEATHER CORRECTED MD 50% POE","MW","Non-coincident",null,null,null,null,null,null,null,null,null,null,null,22,22,22,22,22,21,21]
[null,null,null,null,"Coincident",null,null,null,null,null,null,null,null,null,null,null,17,17,17,17,16,16,16]
[null,null,"WEATHER CORRECTED MD 50% POE","MVA","Non-coincident",null,null,null,null,null,null,null,null,null,null,null,24,24,24,24,24,23,23]
[null,null,null,null,"Coincident",null,null,null,null,null,null,null,null,null,null,null,20,20,19,19,19,19,18]
[null,"Turkinje ","CONNECTION POINT RATING","MVA","Non-coincident",null,null,null,null,null,null,null,null,null,null,null,160,160,160,160,160,160,160]
[null,null,null,null,"Coincident",null,null,null,null,null,null,null,null,null,null,null,160,160,160,160,160,160,160]
[null,null,"WINTER/SUMMER PEAKING",null,"Non-coincident",null,null,null,null,null,null,null,null,null,null,null,"Summer","Summer","Summer","Summer","Summer","Summer","Summer"]
[null,null,null,null,"Coincident",null,null,null,null,null,null,null,null,null,null,null,"Summer","Summer","Summer","Summer","Summer","Summer","Summer"]
[null,null,"ADJUSTMENTS - EMBEDDED GENERATION","MW","Non-coincident",null,null,null,null,null,null,null,null,null,null,null,0,0,0,0,0,0,0]
[null,null,null,null,"Coincident",null,null,null,null,null,null,null,null,null,null,null,0,0,0,0,0,0,0]
[null,null,"WEATHER CORRECTED MD 10% POE","MW","Non-coincident",null,null,null,null,null,null,null,null,null,null,null,62,61,65,65,64,66,65]
[null,null,null,null,"Coincident",null,null,null,null,null,null,null,null,null,null,null,48,48,51,51,51,53,52]
[null,null,"WEATHER CORRECTED MD 10% POE","MVA","Non-coincident",null,null,null,null,null,null,null,null,null,null,null,63,63,67,67,66,68,67]
[null,null,null,null,"Coincident",null,null,null,null,null,null,null,null,null,null,null,49,49,52,52,51,53,52]
[null,null,"WEATHER CORRECTED MD 50% POE","MW","Non-coincident",null,null,null,null,null,null,null,null,null,null,null,57,56,60,60,59,61,60]
[null,null,null,null,"Coincident",null,null,null,null,null,null,null,null,null,null,null,45,45,48,48,47,49,48]
[null,null,"WEATHER CORRECTED MD 50% POE","MVA","Non-coincident",null,null,null,null,null,null,null,null,null,null,null,58,58,61,61,60,63,62]
[null,null,null,null,"Coincident",null,null,null,null,null,null,null,null,null,null,null,45,45,48,48,47,49,48]
[null,"Townsville East ","CONNECTION POINT RATING","MVA","Non-coincident",null,null,null,null,null,null,null,null,null,null,null,113,113,113,113,113,113,113]
[null,null,null,null,"Coincident",null,null,null,null,null,null,null,null,null,null,null,113,113,113,113,113,113,113]
[null,null,"WINTER/SUMMER PEAKING",null,"Non-coincident",null,null,null,null,null,null,null,null,null,null,null,"Summer","Summer","Summer","Summer","Summer","Summer","Summer"]
[null,null,null,null,"Coincident",null,null,null,null,null,null,null,null,null,null,null,"Summer","Summer","Summer","Summer","Summer","Summer","Summer"]
[null,null,"ADJUSTMENTS - EMBEDDED GENERATION","MW","Non-coincident",null,null,null,null,null,null,null,null,null,null,null,1,1,1,1,1,1,1]
[null,null,null,null,"Coincident",null,null,null,null,null,null,null,null,null,null,null,7,7,7,7,7,7,7]
[null,null,"WEATHER CORRECTED MD 10% POE","MW","Non-coincident",null,null,null,null,null,null,null,null,null,null,null,35,35,34,34,34,33,33]
[null,null,null,null,"Coincident",null,null,null,null,null,null,null,null,null,null,null,35,35,34,34,34,33,33]
[null,null,"WEATHER CORRECTED MD 10% POE","MVA","Non-coincident",null,null,null,null,null,null,null,null,null,null,null,36,36,35,35,35,34,34]
[null,null,null,null,"Coincident",null,null,null,null,null,null,null,null,null,null,null,36,36,35,35,35,34,34]
[null,null,"WEATHER CORRECTED MD 50% POE","MW","Non-coincident",null,null,null,null,null,null,null,null,null,null,null,30,30,29,29,29,28,28]
[null,null,null,null,"Coincident",null,null,null,null,null,null,null,null,null,null,null,30,30,29,29,29,28,28]
[null,null,"WEATHER CORRECTED MD 50% POE","MVA","Non-coincident",null,null,null,null,null,null,null,null,null,null,null,31,31,29,29,29,29,29]
[null,null,null,null,"Coincident",null,null,null,null,null,null,null,null,null,null,null,31,31,29,29,29,29,29]
[null,"Townsville South ","CONNECTION POINT RATING","MVA","Non-coincident",null,null,null,null,null,null,null,null,null,null,null,202,202,202,202,202,202,202]
[null,null,null,null,"Coincident",null,null,null,null,null,null,null,null,null,null,null,202,202,202,202,202,202,202]
[null,null,"WINTER/SUMMER PEAKING",null,"Non-coincident",null,null,null,null,null,null,null,null,null,null,null,"Summer","Summer","Summer","Summer","Summer","Summer","Summer"]
[null,null,null,null,"Coincident",null,null,null,null,null,null,null,null,null,null,null,"Summer","Summer","Summer","Summer","Summer","Summer","Summer"]
[null,null,"ADJUSTMENTS - EMBEDDED GENERATION","MW","Non-coincident",null,null,null,null,null,null,null,null,null,null,null,0,0,0,0,0,0,0]
[null,null,null,null,"Coincident",null,null,null,null,null,null,null,null,null,null,null,14,14,14,14,14,14,14]
[null,null,"WEATHER CORRECTED MD 10% POE","MW","Non-coincident",null,null,null,null,null,null,null,null,null,null,null,103,103,98,99,98,98,97]
[null,null,null,null,"Coincident",null,null,null,null,null,null,null,null,null,null,null,91,91,87,87,87,86,85]
[null,null,"WEATHER CORRECTED MD 10% POE","MVA","Non-coincident",null,null,null,null,null,null,null,null,null,null,null,106,106,101,102,101,101,100]
[null,null,null,null,"Coincident",null,null,null,null,null,null,null,null,null,null,null,100,100,95,95,95,94,93]
[null,null,"WEATHER CORRECTED MD 50% POE","MW","Non-coincident",null,null,null,null,null,null,null,null,null,null,null,88,88,83,83,83,82,81]
[null,null,null,null,"Coincident",null,null,null,null,null,null,null,null,null,null,null,78,78,74,74,74,73,72]
[null,null,"WEATHER CORRECTED MD 50% POE","MVA","Non-coincident",null,null,null,null,null,null,null,null,null,null,null,90,90,85,86,85,85,83]
[null,null,null,null,"Coincident",null,null,null,null,null,null,null,null,null,null,null,85,85,80,81,80,79,78]
[null,"Wandoo (Rail) ","CONNECTION POINT RATING","MVA","Non-coincident",null,null,null,null,null,null,null,null,null,null,null,72,72,72,72,72,72,72]
[null,null,null,null,"Coincident",null,null,null,null,null,null,null,null,null,null,null,72,72,72,72,72,72,72]
[null,null,"WINTER/SUMMER PEAKING",null,"Non-coincident",null,null,null,null,null,null,null,null,null,null,null,"Winter","Winter","Winter","Winter","Winter","Winter","Winter"]
[null,null,null,null,"Coincident",null,null,null,null,null,null,null,null,null,null,null,"Summer","Summer","Summer","Summer","Summer","Summer","Summer"]
[null,null,"ADJUSTMENTS - EMBEDDED GENERATION","MW","Non-coincident",null,null,null,null,null,null,null,null,null,null,null,0,0,0,0,0,0,0]
[null,null,null,null,"Coincident",null,null,null,null,null,null,null,null,null,null,null,0,0,0,0,0,0,0]
[null,null,"WEATHER CORRECTED MD 10% POE","MW","Non-coincident"]
[null,null,null,null,"Coincident"]
[null,null,"WEATHER CORRECTED MD 10% POE","MVA","Non-coincident"]
[null,null,null,null,"Coincident"]
[null,null,"WEATHER CORRECTED MD 50% POE","MW","Non-coincident"]
[null,null,null,null,"Coincident"]
[null,null,"WEATHER CORRECTED MD 50% POE","MVA","Non-coincident"]
[null,null,null,null,"Coincident"]
[null,"Woree ","CONNECTION POINT RATING","MVA","Non-coincident",null,null,null,null,null,null,null,null,null,null,null,572,572,572,572,572,572,572]
[null,null,null,null,"Coincident",null,null,null,null,null,null,null,null,null,null,null,572,572,572,572,572,572,572]
[null,null,"WINTER/SUMMER PEAKING",null,"Non-coincident",null,null,null,null,null,null,null,null,null,null,null,"Summer","Summer","Summer","Summer","Summer","Summer","Summer"]
[null,null,null,null,"Coincident",null,null,null,null,null,null,null,null,null,null,null,"Summer","Summer","Summer","Summer","Summer","Summer","Summer"]
[null,null,"ADJUSTMENTS - EMBEDDED GENERATION","MW","Non-coincident",null,null,null,null,null,null,null,null,null,null,null,0,0,0,0,0,0,0]
[null,null,null,null,"Coincident",null,null,null,null,null,null,null,null,null,null,null,0,0,0,0,0,0,0]
[null,null,"WEATHER CORRECTED MD 10% POE","MW","Non-coincident",null,null,null,null,null,null,null,null,null,null,null,48,50,51,53,54,55,55]
[null,null,null,null,"Coincident",null,null,null,null,null,null,null,null,null,null,null,38,39,40,41,42,42,43]
[null,null,"WEATHER CORRECTED MD 10% POE","MVA","Non-coincident",null,null,null,null,null,null,null,null,null,null,null,48,50,51,53,54,55,55]
[null,null,null,null,"Coincident",null,null,null,null,null,null,null,null,null,null,null,38,39,40,41,42,42,43]
[null,null,"WEATHER CORRECTED MD 50% POE","MW","Non-coincident",null,null,null,null,null,null,null,null,null,null,null,43,44,45,47,47,48,49]
[null,null,null,null,"Coincident",null,null,null,null,null,null,null,null,null,null,null,34,35,35,37,37,38,38]
[null,null,"WEATHER CORRECTED MD 50% POE","MVA","Non-coincident",null,null,null,null,null,null,null,null,null,null,null,43,44,45,47,47,48,49]
[null,null,null,null,"Coincident",null,null,null,null,null,null,null,null,null,null,null,34,35,35,37,37,38,38]
[null,"Wycarbah ","CONNECTION POINT RATING","MVA","Non-coincident"]
[null,null,null,null,"Coincident"]
[null,null,"WINTER/SUMMER PEAKING",null,"Non-coincident",null,null,null,null,null,null,null,null,null,null,null,"Winter","Winter","Winter","Winter","Winter","Winter","Winter"]
[null,null,null,null,"Coincident",null,null,null,null,null,null,null,null,null,null,null,"Summer","Summer","Summer","Summer","Summer","Summer","Summer"]
[null,null,"ADJUSTMENTS - EMBEDDED GENERATION","MW","Non-coincident",null,null,null,null,null,null,null,null,null,null,null,0,0,0,0,0,0,0]
[null,null,null,null,"Coincident",null,null,null,null,null,null,null,null,null,null,null,0,0,0,0,0,0,0]
[null,null,"WEATHER CORRECTED MD 10% POE","MW","Non-coincident"]
[null,null,null,null,"Coincident"]
[null,null,"WEATHER CORRECTED MD 10% POE","MVA","Non-coincident"]
[null,null,null,null,"Coincident"]
[null,null,"WEATHER CORRECTED MD 50% POE","MW","Non-coincident"]
[null,null,null,null,"Coincident"]
[null,null,"WEATHER CORRECTED MD 50% POE","MVA","Non-coincident"]
[null,null,null,null,"Coincident"]
[null,"Yarwun – Boat Creek (Ergon)","CONNECTION POINT RATING","MVA","Non-coincident",null,null,null,null,null,null,null,null,null,null,null,732,732,732,732,732,732,732]
[null,null,null,null,"Coincident",null,null,null,null,null,null,null,null,null,null,null,732,732,732,732,732,732,732]
[null,null,"WINTER/SUMMER PEAKING",null,"Non-coincident",null,null,null,null,null,null,null,null,null,null,null,"Summer","Summer","Summer","Summer","Summer","Summer","Summer"]
[null,null,null,null,"Coincident",null,null,null,null,null,null,null,null,null,null,null,"Summer","Summer","Summer","Summer","Summer","Summer","Summer"]
[null,null,"ADJUSTMENTS - EMBEDDED GENERATION","MW","Non-coincident",null,null,null,null,null,null,null,null,null,null,null,0,0,0,0,0,0,0]
[null,null,null,null,"Coincident",null,null,null,null,null,null,null,null,null,null,null,0,0,0,0,0,0,0]
[null,null,"WEATHER CORRECTED MD 10% POE","MW","Non-coincident",null,null,null,null,null,null,null,null,null,null,null,43,43,42,42,41,41,40]
[null,null,null,null,"Coincident",null,null,null,null,null,null,null,null,null,null,null,28,28,28,28,27,27,26]
[null,null,"WEATHER CORRECTED MD 10% POE","MVA","Non-coincident",null,null,null,null,null,null,null,null,null,null,null,49,49,48,48,48,47,46]
[null,null,null,null,"Coincident",null,null,null,null,null,null,null,null,null,null,null,33,33,32,32,32,31,31]
[null,null,"WEATHER CORRECTED MD 50% POE","MW","Non-coincident",null,null,null,null,null,null,null,null,null,null,null,41,41,40,40,40,39,38]
[null,null,null,null,"Coincident",null,null,null,null,null,null,null,null,null,null,null,27,27,27,27,26,26,25]
[null,null,"WEATHER CORRECTED MD 50% POE","MVA","Non-coincident",null,null,null,null,null,null,null,null,null,null,null,47,47,46,46,45,45,44]
[null,null,null,null,"Coincident",null,null,null,null,null,null,null,null,null,null,null,32,32,31,31,30,30,29]
[null,"Blackwater (132)","CONNECTION POINT RATING","MVA","Non-coincident"]
[null,null,null,null,"Coincident"]
[null,null,"WINTER/SUMMER PEAKING",null,"Non-coincident"]
[null,null,null,null,"Coincident"]
[null,null,"ADJUSTMENTS - EMBEDDED GENERATION","MW","Non-coincident"]
[null,null,null,null,"Coincident"]
[null,null,"WEATHER CORRECTED MD 10% POE","MW","Non-coincident"]
[null,null,null,null,"Coincident"]
[null,null,"WEATHER CORRECTED MD 10% POE","MVA","Non-coincident"]
[null,null,null,null,"Coincident"]
[null,null,"WEATHER CORRECTED MD 50% POE","MW","Non-coincident"]
[null,null,null,null,"Coincident"]
[null,null,"WEATHER CORRECTED MD 50% POE","MVA","Non-coincident"]
[null,null,null,null,"Coincident"]
[null,"Moranbah (Broadlea)","CONNECTION POINT RATING","MVA","Non-coincident",null,null,null,null,null,null,null,null,null,null,null,229,229,229,229,229,229,229]
[null,null,null,null,"Coincident",null,null,null,null,null,null,null,null,null,null,null,229,229,229,229,229,229,229]
[null,null,"WINTER/SUMMER PEAKING",null,"Non-coincident",null,null,null,null,null,null,null,null,null,null,null,"Summer","Summer","Summer","Summer","Summer","Summer","Summer"]
[null,null,null,null,"Coincident",null,null,null,null,null,null,null,null,null,null,null,"Summer","Summer","Summer","Summer","Summer","Summer","Summer"]
[null,null,"ADJUSTMENTS - EMBEDDED GENERATION","MW","Non-coincident",null,null,null,null,null,null,null,null,null,null,null,0,0,0,0,0,0,0]
[null,null,null,null,"Coincident",null,null,null,null,null,null,null,null,null,null,null,0,0,0,0,0,0,0]
[null,null,"WEATHER CORRECTED MD 10% POE","MW","Non-coincident",null,null,null,null,null,null,null,null,null,null,null,48,48,48,48,47,54,56]
[null,null,null,null,"Coincident",null,null,null,null,null,null,null,null,null,null,null,26,26,26,26,26,33,34]
[null,null,"WEATHER CORRECTED MD 10% POE","MVA","Non-coincident",null,null,null,null,null,null,null,null,null,null,null,51,50,50,50,50,57,59]
[null,null,null,null,"Coincident",null,null,null,null,null,null,null,null,null,null,null,27,27,27,27,27,34,35]
[null,null,"WEATHER CORRECTED MD 50% POE","MW","Non-coincident",null,null,null,null,null,null,null,null,null,null,null,46,46,46,46,45,52,54]
[null,null,null,null,"Coincident",null,null,null,null,null,null,null,null,null,null,null,25,25,25,25,25,32,33]
[null,null,"WEATHER CORRECTED MD 50% POE","MVA","Non-coincident",null,null,null,null,null,null,null,null,null,null,null,49,48,48,48,47,55,57]
[null,null,null,null,"Coincident",null,null,null,null,null,null,null,null,null,null,null,26,26,26,26,25,33,34]
[null,"BSL 132kV ","CONNECTION POINT RATING","MVA","Non-coincident",null,null,null,null,null,null,null,null,null,null,null,794,794,794,794,794,794,794]
[null,null,null,null,"Coincident",null,null,null,null,null,null,null,null,null,null,null,794,794,794,794,794,794,794]
[null,null,"WINTER/SUMMER PEAKING",null,"Non-coincident",null,null,null,null,null,null,null,null,null,null,null,"Summer","Summer","Summer","Summer","Summer","Summer","Summer"]
[null,null,null,null,"Coincident",null,null,null,null,null,null,null,null,null,null,null,"Summer","Summer","Summer","Summer","Summer","Summer","Summer"]
[null,null,"ADJUSTMENTS - EMBEDDED GENERATION","MW","Non-coincident",null,null,null,null,null,null,null,null,null,null,null,0,0,0,0,0,0,0]
[null,null,null,null,"Coincident",null,null,null,null,null,null,null,null,null,null,null,0,0,0,0,0,0,0]
[null,null,"WEATHER CORRECTED MD 10% POE","MW","Non-coincident"]
[null,null,null,null,"Coincident"]
[null,null,"WEATHER CORRECTED MD 10% POE","MVA","Non-coincident"]
[null,null,null,null,"Coincident"]
[null,null,"WEATHER CORRECTED MD 50% POE","MW","Non-coincident"]
[null,null,null,null,"Coincident"]
[null,null,"WEATHER CORRECTED MD 50% POE","MVA","Non-coincident"]
[null,null,null,null,"Coincident"]
[null,"BSL 275kV ","CONNECTION POINT RATING","MVA","Non-coincident",null,null,null,null,null,null,null,null,null,null,null,934,934,934,934,934,934,934]
[null,null,null,null,"Coincident",null,null,null,null,null,null,null,null,null,null,null,934,934,934,934,934,934,934]
[null,null,"WINTER/SUMMER PEAKING",null,"Non-coincident",null,null,null,null,null,null,null,null,null,null,null,"Summer","Summer","Summer","Summer","Summer","Summer","Summer"]
[null,null,null,null,"Coincident",null,null,null,null,null,null,null,null,null,null,null,"Summer","Summer","Summer","Summer","Summer","Summer","Summer"]
[null,null,"ADJUSTMENTS - EMBEDDED GENERATION","MW","Non-coincident",null,null,null,null,null,null,null,null,null,null,null,0,0,0,0,0,0,0]
[null,null,null,null,"Coincident",null,null,null,null,null,null,null,null,null,null,null,0,0,0,0,0,0,0]
[null,null,"WEATHER CORRECTED MD 10% POE","MW","Non-coincident"]
[null,null,null,null,"Coincident"]
[null,null,"WEATHER CORRECTED MD 10% POE","MVA","Non-coincident"]
[null,null,null,null,"Coincident"]
[null,null,"WEATHER CORRECTED MD 50% POE","MW","Non-coincident"]
[null,null,null,null,"Coincident"]
[null,null,"WEATHER CORRECTED MD 50% POE","MVA","Non-coincident"]
[null,null,null,null,"Coincident"]
[null,"Burton Downs ","CONNECTION POINT RATING","MVA","Non-coincident"]
[null,null,null,null,"Coincident"]
[null,null,"WINTER/SUMMER PEAKING",null,"Non-coincident",null,null,null,null,null,null,null,null,null,null,null,"Summer","Summer","Summer","Summer","Summer","Summer","Summer"]
[null,null,null,null,"Coincident",null,null,null,null,null,null,null,null,null,null,null,"Summer","Summer","Summer","Summer","Summer","Summer","Summer"]
[null,null,"ADJUSTMENTS - EMBEDDED GENERATION","MW","Non-coincident",null,null,null,null,null,null,null,null,null,null,null,0,0,0,0,0,0,0]
[null,null,null,null,"Coincident",null,null,null,null,null,null,null,null,null,null,null,0,0,0,0,0,0,0]
[null,null,"WEATHER CORRECTED MD 10% POE","MW","Non-coincident"]
[null,null,null,null,"Coincident"]
[null,null,"WEATHER CORRECTED MD 10% POE","MVA","Non-coincident"]
[null,null,null,null,"Coincident"]
[null,null,"WEATHER CORRECTED MD 50% POE","MW","Non-coincident"]
[null,null,null,null,"Coincident"]
[null,null,"WEATHER CORRECTED MD 50% POE","MVA","Non-coincident"]
[null,null,null,null,"Coincident"]
[null,"Goonyella Riverside Mine","CONNECTION POINT RATING","MVA","Non-coincident"]
[null,null,null,null,"Coincident"]
[null,null,"WINTER/SUMMER PEAKING",null,"Non-coincident",null,null,null,null,null,null,null,null,null,null,null,"Summer","Summer","Summer","Summer","Summer","Summer","Summer"]
[null,null,null,null,"Coincident",null,null,null,null,null,null,null,null,null,null,null,"Summer","Summer","Summer","Summer","Summer","Summer","Summer"]
[null,null,"ADJUSTMENTS - EMBEDDED GENERATION","MW","Non-coincident",null,null,null,null,null,null,null,null,null,null,null,0,0,0,0,0,0,0]
[null,null,null,null,"Coincident",null,null,null,null,null,null,null,null,null,null,null,0,0,0,0,0,0,0]
[null,null,"WEATHER CORRECTED MD 10% POE","MW","Non-coincident"]
[null,null,null,null,"Coincident"]
[null,null,"WEATHER CORRECTED MD 10% POE","MVA","Non-coincident"]
[null,null,null,null,"Coincident"]
[null,null,"WEATHER CORRECTED MD 50% POE","MW","Non-coincident"]
[null,null,null,null,"Coincident"]
[null,null,"WEATHER CORRECTED MD 50% POE","MVA","Non-coincident"]
[null,null,null,null,"Coincident"]
[null,"Loganlea (110kV Supplies) ","CONNECTION POINT RATING","MVA","Non-coincident",null,null,null,null,null,null,null,null,null,null,null,1806,1806,1806,1806,1806,1806,1806]
[null,null,null,null,"Coincident",null,null,null,null,null,null,null,null,null,null,null,1806,1806,1806,1806,1806,1806,1806]
[null,null,"WINTER/SUMMER PEAKING",null,"Non-coincident",null,null,null,null,null,null,null,null,null,null,null,"Summer","Summer","Summer","Summer","Summer","Summer","Summer"]
[null,null,null,null,"Coincident",null,null,null,null,null,null,null,null,null,null,null,"Summer","Summer","Summer","Summer","Summer","Summer","Summer"]
[null,null,"ADJUSTMENTS - EMBEDDED GENERATION","MW","Non-coincident",null,null,null,null,null,null,null,null,null,null,null,10,10,10,10,10,10,10]
[null,null,null,null,"Coincident",null,null,null,null,null,null,null,null,null,null,null,17,17,17,17,17,17,17]
[null,null,"WEATHER CORRECTED MD 10% POE","MW","Non-coincident",null,null,null,null,null,null,null,null,null,null,null,412,409,410,414,415,416,420]
[null,null,null,null,"Coincident",null,null,null,null,null,null,null,null,null,null,null,387,384,389,393,394,394,397]
[null,null,"WEATHER CORRECTED MD 10% POE","MVA","Non-coincident",null,null,null,null,null,null,null,null,null,null,null,432,430,430,435,436,437,441]
[null,null,null,null,"Coincident",null,null,null,null,null,null,null,null,null,null,null,409,406,411,415,415,416,419]
[null,null,"WEATHER CORRECTED MD 50% POE","MW","Non-coincident",null,null,null,null,null,null,null,null,null,null,null,376,372,372,377,377,378,381]
[null,null,null,null,"Coincident",null,null,null,null,null,null,null,null,null,null,null,352,348,352,356,356,356,358]
[null,null,"WEATHER CORRECTED MD 50% POE","MVA","Non-coincident",null,null,null,null,null,null,null,null,null,null,null,394,391,390,395,396,396,399]
[null,null,null,null,"Coincident",null,null,null,null,null,null,null,null,null,null,null,371,367,372,376,376,376,378]
[null,"Middle Ridge ","CONNECTION POINT RATING","MVA","Non-coincident"]
[null,null,null,null,"Coincident"]
[null,null,"WINTER/SUMMER PEAKING",null,"Non-coincident"]
[null,null,null,null,"Coincident"]
[null,null,"ADJUSTMENTS - EMBEDDED GENERATION","MW","Non-coincident"]
[null,null,null,null,"Coincident"]
[null,null,"WEATHER CORRECTED MD 10% POE","MW","Non-coincident"]
[null,null,null,null,"Coincident"]
[null,null,"WEATHER CORRECTED MD 10% POE","MVA","Non-coincident"]
[null,null,null,null,"Coincident"]
[null,null,"WEATHER CORRECTED MD 50% POE","MW","Non-coincident"]
[null,null,null,null,"Coincident"]
[null,null,"WEATHER CORRECTED MD 50% POE","MVA","Non-coincident"]
[null,null,null,null,"Coincident"]
[null,"North Goonyella ","CONNECTION POINT RATING","MVA","Non-coincident",null,null,null,null,null,null,null,null,null,null,null,90,90,90,90,90,90,90]
[null,null,null,null,"Coincident",null,null,null,null,null,null,null,null,null,null,null,90,90,90,90,90,90,90]
[null,null,"WINTER/SUMMER PEAKING",null,"Non-coincident",null,null,null,null,null,null,null,null,null,null,null,"Summer","Summer","Summer","Summer","Summer","Summer","Summer"]
[null,null,null,null,"Coincident",null,null,null,null,null,null,null,null,null,null,null,"Summer","Summer","Summer","Summer","Summer","Summer","Summer"]
[null,null,"ADJUSTMENTS - EMBEDDED GENERATION","MW","Non-coincident",null,null,null,null,null,null,null,null,null,null,null,0,0,0,0,0,0,0]
[null,null,null,null,"Coincident",null,null,null,null,null,null,null,null,null,null,null,0,0,0,0,0,0,0]
[null,null,"WEATHER CORRECTED MD 10% POE","MW","Non-coincident"]
[null,null,null,null,"Coincident"]
[null,null,"WEATHER CORRECTED MD 10% POE","MVA","Non-coincident"]
[null,null,null,null,"Coincident"]
[null,null,"WEATHER CORRECTED MD 50% POE","MW","Non-coincident"]
[null,null,null,null,"Coincident"]
[null,null,"WEATHER CORRECTED MD 50% POE","MVA","Non-coincident"]
[null,null,null,null,"Coincident"]
[null,"QAL (Gladstone South) ","CONNECTION POINT RATING","MVA","Non-coincident",null,null,null,null,null,null,null,null,null,null,null,384,384,384,384,384,384,384]
[null,null,null,null,"Coincident",null,null,null,null,null,null,null,null,null,null,null,384,384,384,384,384,384,384]
[null,null,"WINTER/SUMMER PEAKING",null,"Non-coincident",null,null,null,null,null,null,null,null,null,null,null,"Summer","Summer","Summer","Summer","Summer","Summer","Summer"]
[null,null,null,null,"Coincident",null,null,null,null,null,null,null,null,null,null,null,"Summer","Summer","Summer","Summer","Summer","Summer","Summer"]
[null,null,"ADJUSTMENTS - EMBEDDED GENERATION","MW","Non-coincident",null,null,null,null,null,null,null,null,null,null,null,0,0,0,0,0,0,0]
[null,null,null,null,"Coincident",null,null,null,null,null,null,null,null,null,null,null,0,0,0,0,0,0,0]
[null,null,"WEATHER CORRECTED MD 10% POE","MW","Non-coincident"]
[null,null,null,null,"Coincident"]
[null,null,"WEATHER CORRECTED MD 10% POE","MVA","Non-coincident"]
[null,null,null,null,"Coincident"]
[null,null,"WEATHER CORRECTED MD 50% POE","MW","Non-coincident"]
[null,null,null,null,"Coincident"]
[null,null,"WEATHER CORRECTED MD 50% POE","MVA","Non-coincident"]
[null,null,null,null,"Coincident"]
[null,"Yarwun – Rio Tinto","CONNECTION POINT RATING","MVA","Non-coincident"]
[null,null,null,null,"Coincident"]
[null,null,"WINTER/SUMMER PEAKING",null,"Non-coincident",null,null,null,null,null,null,null,null,null,null,null,"Summer","Summer","Summer","Summer","Summer","Summer","Summer"]
[null,null,null,null,"Coincident",null,null,null,null,null,null,null,null,null,null,null,"Summer","Summer","Summer","Summer","Summer","Summer","Summer"]
[null,null,"ADJUSTMENTS - EMBEDDED GENERATION","MW","Non-coincident",null,null,null,null,null,null,null,null,null,null,null,0,0,0,0,0,0,0]
[null,null,null,null,"Coincident",null,null,null,null,null,null,null,null,null,null,null,0,0,0,0,0,0,0]
[null,null,"WEATHER CORRECTED MD 10% POE","MW","Non-coincident"]
[null,null,null,null,"Coincident"]
[null,null,"WEATHER CORRECTED MD 10% POE","MVA","Non-coincident"]
[null,null,null,null,"Coincident"]
[null,null,"WEATHER CORRECTED MD 50% POE","MW","Non-coincident"]
[null,null,null,null,"Coincident"]
[null,null,"WEATHER CORRECTED MD 50% POE","MVA","Non-coincident"]
[null,null,null,null,"Coincident"]
[null,"Rocklea","CONNECTION POINT RATING","MVA","Non-coincident",null,null,null,null,null,null,null,null,null,null,null,646,646,646,646,646,646,646]
[null,null,null,null,"Coincident",null,null,null,null,null,null,null,null,null,null,null,646,646,646,646,646,646,646]
[null,null,"WINTER/SUMMER PEAKING",null,"Non-coincident",null,null,null,null,null,null,null,null,null,null,null,"Summer","Summer","Summer","Summer","Summer","Summer","Summer"]
[null,null,null,null,"Coincident",null,null,null,null,null,null,null,null,null,null,null,"Summer","Summer","Summer","Summer","Summer","Summer","Summer"]
[null,null,"ADJUSTMENTS - EMBEDDED GENERATION","MW","Non-coincident",null,null,null,null,null,null,null,null,null,null,null,0,0,0,0,0,0,0]
[null,null,null,null,"Coincident",null,null,null,null,null,null,null,null,null,null,null,0,0,0,0,0,0,0]
[null,null,"WEATHER CORRECTED MD 10% POE","MW","Non-coincident",null,null,null,null,null,null,null,null,null,null,null,159,159,158,159,159,160,160]
[null,null,null,null,"Coincident",null,null,null,null,null,null,null,null,null,null,null,148,148,146,147,147,150,150]
[null,null,"WEATHER CORRECTED MD 10% POE","MVA","Non-coincident",null,null,null,null,null,null,null,null,null,null,null,170,170,169,170,170,171,171]
[null,null,null,null,"Coincident",null,null,null,null,null,null,null,null,null,null,null,152,152,151,152,152,155,155]
[null,null,"WEATHER CORRECTED MD 50% POE","MW","Non-coincident",null,null,null,null,null,null,null,null,null,null,null,152,152,151,151,151,152,152]
[null,null,null,null,"Coincident",null,null,null,null,null,null,null,null,null,null,null,141,141,139,140,140,143,143]
[null,null,"WEATHER CORRECTED MD 50% POE","MVA","Non-coincident",null,null,null,null,null,null,null,null,null,null,null,163,163,161,162,162,163,163]
[null,null,null,null,"Coincident",null,null,null,null,null,null,null,null,null,null,null,146,145,144,145,144,148,147]
[null,"Townsville South (KZ) ","CONNECTION POINT RATING","MVA","Non-coincident"]
[null,null,null,null,"Coincident"]
[null,null,"WINTER/SUMMER PEAKING",null,"Non-coincident",null,null,null,null,null,null,null,null,null,null,null,"Summer","Summer","Summer","Summer","Summer","Summer","Summer"]
[null,null,null,null,"Coincident",null,null,null,null,null,null,null,null,null,null,null,"Summer","Summer","Summer","Summer","Summer","Summer","Summer"]
[null,null,"ADJUSTMENTS - EMBEDDED GENERATION","MW","Non-coincident",null,null,null,null,null,null,null,null,null,null,null,0,0,0,0,0,0,0]
[null,null,null,null,"Coincident",null,null,null,null,null,null,null,null,null,null,null,0,0,0,0,0,0,0]
[null,null,"WEATHER CORRECTED MD 10% POE","MW","Non-coincident"]
[null,null,null,null,"Coincident"]
[null,null,"WEATHER CORRECTED MD 10% POE","MVA","Non-coincident"]
[null,null,null,null,"Coincident"]
[null,null,"WEATHER CORRECTED MD 50% POE","MW","Non-coincident"]
[null,null,null,null,"Coincident"]
[null,null,"WEATHER CORRECTED MD 50% POE","MVA","Non-coincident"]
[null,null,null,null,"Coincident"]
[null,"Woolooga","CONNECTION POINT RATING","MVA","Non-coincident"]
[null,null,null,null,"Coincident"]
[null,null,"WINTER/SUMMER PEAKING",null,"Non-coincident"]
[null,null,null,null,"Coincident"]
[null,null,"ADJUSTMENTS - EMBEDDED GENERATION","MW","Non-coincident"]
[null,null,null,null,"Coincident"]
[null,null,"WEATHER CORRECTED MD 10% POE","MW","Non-coincident"]
[null,null,null,null,"Coincident"]
[null,null,"WEATHER CORRECTED MD 10% POE","MVA","Non-coincident"]
[null,null,null,null,"Coincident"]
[null,null,"WEATHER CORRECTED MD 50% POE","MW","Non-coincident"]
[null,null,null,null,"Coincident"]
[null,null,"WEATHER CORRECTED MD 50% POE","MVA","Non-coincident"]
[null,null,null,null,"Coincident"]
[null,"QNI","CONNECTION POINT RATING","MVA","Non-coincident",null,null,null,null,null,null,null,null,null,null,null,2472,2472,2472,2472,2472,2472,2472]
[null,null,null,null,"Coincident",null,null,null,null,null,null,null,null,null,null,null,2472,2472,2472,2472,2472,2472,2472]
[null,null,"WINTER/SUMMER PEAKING",null,"Non-coincident",null,null,null,null,null,null,null,null,null,null,null,"Winter","Winter","Winter","Winter","Winter","Winter","Winter"]
[null,null,null,null,"Coincident",null,null,null,null,null,null,null,null,null,null,null,"Summer","Summer","Summer","Summer","Summer","Summer","Summer"]
[null,null,"ADJUSTMENTS - EMBEDDED GENERATION","MW","Non-coincident",null,null,null,null,null,null,null,null,null,null,null,0,0,0,0,0,0,0]
[null,null,null,null,"Coincident",null,null,null,null,null,null,null,null,null,null,null,0,0,0,0,0,0,0]
[null,null,"WEATHER CORRECTED MD 10% POE","MW","Non-coincident",null,null,null,null,null,null,null,null,null,null,null,1127,1127,1127,1127,1127,1127,1127]
[null,null,null,null,"Coincident",null,null,null,null,null,null,null,null,null,null,null,12,12,12,12,12,12,12]
[null,null,"WEATHER CORRECTED MD 10% POE","MVA","Non-coincident",null,null,null,null,null,null,null,null,null,null,null,1129,1129,1129,1129,1129,1129,1129]
[null,null,null,null,"Coincident",null,null,null,null,null,null,null,null,null,null,null,20,20,20,20,20,20,20]
[null,null,"WEATHER CORRECTED MD 50% POE","MW","Non-coincident",null,null,null,null,null,null,null,null,null,null,null,1127,1127,1127,1127,1127,1127,1127]
[null,null,null,null,"Coincident",null,null,null,null,null,null,null,null,null,null,null,12,12,12,12,12,12,12]
[null,null,"WEATHER CORRECTED MD 50% POE","MVA","Non-coincident",null,null,null,null,null,null,null,null,null,null,null,1129,1129,1129,1129,1129,1129,1129]
[null,null,null,null,"Coincident",null,null,null,null,null,null,null,null,null,null,null,20,20,20,20,20,20,20]
[null,"Terranora Interconnector","CONNECTION POINT RATING","MVA","Non-coincident",null,null,null,null,null,null,null,null,null,null,null,263,263,263,263,263,263,263]
[null,null,null,null,"Coincident",null,null,null,null,null,null,null,null,null,null,null,263,263,263,263,263,263,263]
[null,null,"WINTER/SUMMER PEAKING",null,"Non-coincident",null,null,null,null,null,null,null,null,null,null,null,"Winter","Winter","Winter","Winter","Winter","Winter","Winter"]
[null,null,null,null,"Coincident",null,null,null,null,null,null,null,null,null,null,null,"Summer","Summer","Summer","Summer","Summer","Summer","Summer"]
[null,null,"ADJUSTMENTS - EMBEDDED GENERATION","MW","Non-coincident",null,null,null,null,null,null,null,null,null,null,null,0,0,0,0,0,0,0]
[null,null,null,null,"Coincident",null,null,null,null,null,null,null,null,null,null,null,0,0,0,0,0,0,0]
[null,null,"WEATHER CORRECTED MD 10% POE","MW","Non-coincident",null,null,null,null,null,null,null,null,null,null,null,205,205,205,205,205,205,205]
[null,null,null,null,"Coincident",null,null,null,null,null,null,null,null,null,null,null,29,29,29,29,29,29,29]
[null,null,"WEATHER CORRECTED MD 10% POE","MVA","Non-coincident",null,null,null,null,null,null,null,null,null,null,null,205,205,205,205,205,205,205]
[null,null,null,null,"Coincident",null,null,null,null,null,null,null,null,null,null,null,29,29,29,29,29,29,29]
[null,null,"WEATHER CORRECTED MD 50% POE","MW","Non-coincident",null,null,null,null,null,null,null,null,null,null,null,205,205,205,205,205,205,205]
[null,null,null,null,"Coincident",null,null,null,null,null,null,null,null,null,null,null,29,29,29,29,29,29,29]
[null,null,"WEATHER CORRECTED MD 50% POE","MVA","Non-coincident",null,null,null,null,null,null,null,null,null,null,null,205,205,205,205,205,205,205]
[null,null,null,null,"Coincident",null,null,null,null,null,null,null,null,null,null,null,29,29,29,29,29,29,29]
[null,"Columboola (LNG)","CONNECTION POINT RATING","MVA","Non-coincident"]
[null,null,null,null,"Coincident"]
[null,null,"WINTER/SUMMER PEAKING",null,"Non-coincident",null,null,null,null,null,null,null,null,null,null,null,"Winter","Winter","Winter","Winter","Winter","Winter","Winter"]
[null,null,null,null,"Coincident",null,null,null,null,null,null,null,null,null,null,null,"Summer","Summer","Summer","Summer","Summer","Summer","Summer"]
[null,null,"ADJUSTMENTS - EMBEDDED GENERATION","MW","Non-coincident",null,null,null,null,null,null,null,null,null,null,null,0,0,0,0,0,0,0]
[null,null,null,null,"Coincident",null,null,null,null,null,null,null,null,null,null,null,0,0,0,0,0,0,0]
[null,null,"WEATHER CORRECTED MD 10% POE","MW","Non-coincident"]
[null,null,null,null,"Coincident"]
[null,null,"WEATHER CORRECTED MD 10% POE","MVA","Non-coincident"]
[null,null,null,null,"Coincident"]
[null,null,"WEATHER CORRECTED MD 50% POE","MW","Non-coincident"]
[null,null,null,null,"Coincident"]
[null,null,"WEATHER CORRECTED MD 50% POE","MVA","Non-coincident"]
[null,null,null,null,"Coincident"]
[null,"Orana (LNG)","CONNECTION POINT RATING","MVA","Non-coincident"]
[null,null,null,null,"Coincident"]
[null,null,"WINTER/SUMMER PEAKING",null,"Non-coincident",null,null,null,null,null,null,null,null,null,null,null,"Winter","Winter","Summer","Summer","Summer","Summer","Summer"]
[null,null,null,null,"Coincident",null,null,null,null,null,null,null,null,null,null,null,"Summer","Summer","Summer","Summer","Summer","Summer","Summer"]
[null,null,"ADJUSTMENTS - EMBEDDED GENERATION","MW","Non-coincident",null,null,null,null,null,null,null,null,null,null,null,0,0,0,0,0,0,0]
[null,null,null,null,"Coincident",null,null,null,null,null,null,null,null,null,null,null,0,0,0,0,0,0,0]
[null,null,"WEATHER CORRECTED MD 10% POE","MW","Non-coincident"]
[null,null,null,null,"Coincident"]
[null,null,"WEATHER CORRECTED MD 10% POE","MVA","Non-coincident"]
[null,null,null,null,"Coincident"]
[null,null,"WEATHER CORRECTED MD 50% POE","MW","Non-coincident"]
[null,null,null,null,"Coincident"]
[null,null,"WEATHER CORRECTED MD 50% POE","MVA","Non-coincident"]
[null,null,null,null,"Coincident"]
[null,"Braemar - Kumbarilla Park ","CONNECTION POINT RATING","MVA","Non-coincident"]
[null,null,null,null,"Coincident"]
[null,null,"WINTER/SUMMER PEAKING",null,"Non-coincident",null,null,null,null,null,null,null,null,null,null,null,"Summer","Summer","Summer","Summer","Summer","Summer","Summer"]
[null,null,null,null,"Coincident",null,null,null,null,null,null,null,null,null,null,null,"Summer","Summer","Summer","Summer","Summer","Summer","Summer"]
[null,null,"ADJUSTMENTS - EMBEDDED GENERATION","MW","Non-coincident",null,null,null,null,null,null,null,null,null,null,null,0,0,0,0,0,0,0]
[null,null,null,null,"Coincident",null,null,null,null,null,null,null,null,null,null,null,0,0,0,0,0,0,0]
[null,null,"WEATHER CORRECTED MD 10% POE","MW","Non-coincident"]
[null,null,null,null,"Coincident"]
[null,null,"WEATHER CORRECTED MD 10% POE","MVA","Non-coincident"]
[null,null,null,null,"Coincident"]
[null,null,"WEATHER CORRECTED MD 50% POE","MW","Non-coincident"]
[null,null,null,null,"Coincident"]
[null,null,"WEATHER CORRECTED MD 50% POE","MVA","Non-coincident"]
[null,null,null,null,"Coincident"]
[null,"Wandoan South (LNG)","CONNECTION POINT RATING","MVA","Non-coincident"]
[null,null,null,null,"Coincident"]
[null,null,"WINTER/SUMMER PEAKING",null,"Non-coincident",null,null,null,null,null,null,null,null,null,null,null,"Summer","Summer","Summer","Summer","Summer","Summer","Summer"]
[null,null,null,null,"Coincident",null,null,null,null,null,null,null,null,null,null,null,"Summer","Summer","Summer","Summer","Summer","Summer","Summer"]
[null,null,"ADJUSTMENTS - EMBEDDED GENERATION","MW","Non-coincident",null,null,null,null,null,null,null,null,null,null,null,0,0,0,0,0,0,0]
[null,null,null,null,"Coincident",null,null,null,null,null,null,null,null,null,null,null,0,0,0,0,0,0,0]
[null,null,"WEATHER CORRECTED MD 10% POE","MW","Non-coincident"]
[null,null,null,null,"Coincident"]
[null,null,"WEATHER CORRECTED MD 10% POE","MVA","Non-coincident"]
[null,null,null,null,"Coincident"]
[null,null,"WEATHER CORRECTED MD 50% POE","MW","Non-coincident"]
[null,null,null,null,"Coincident"]
[null,null,"WEATHER CORRECTED MD 50% POE","MVA","Non-coincident"]
[null,null,null,null,"Coincident"]
[null,"Pandoin (132)","CONNECTION POINT RATING","MVA","Non-coincident",null,null,null,null,null,null,null,null,null,null,null,366,366,366,366,366,366,366]
[null,null,null,null,"Coincident",null,null,null,null,null,null,null,null,null,null,null,366,366,366,366,366,366,366]
[null,null,"WINTER/SUMMER PEAKING",null,"Non-coincident",null,null,null,null,null,null,null,null,null,null,null,"Summer","Summer","Summer","Summer","Summer","Summer","Summer"]
[null,null,null,null,"Coincident",null,null,null,null,null,null,null,null,null,null,null,"Summer","Summer","Summer","Summer","Summer","Summer","Summer"]
[null,null,"ADJUSTMENTS - EMBEDDED GENERATION","MW","Non-coincident",null,null,null,null,null,null,null,null,null,null,null,0,0,0,0,0,0,0]
[null,null,null,null,"Coincident",null,null,null,null,null,null,null,null,null,null,null,0,0,0,0,0,0,0]
[null,null,"WEATHER CORRECTED MD 10% POE","MW","Non-coincident",null,null,null,null,null,null,null,null,null,null,null,0,0,0,0,0,0,0]
[null,null,null,null,"Coincident",null,null,null,null,null,null,null,null,null,null,null,0,0,0,0,0,0,0]
[null,null,"WEATHER CORRECTED MD 10% POE","MVA","Non-coincident",null,null,null,null,null,null,null,null,null,null,null,0,0,0,0,0,0,0]
[null,null,null,null,"Coincident",null,null,null,null,null,null,null,null,null,null,null,0,0,0,0,0,0,0]
[null,null,"WEATHER CORRECTED MD 50% POE","MW","Non-coincident",null,null,null,null,null,null,null,null,null,null,null,0,0,0,0,0,0,0]
[null,null,null,null,"Coincident",null,null,null,null,null,null,null,null,null,null,null,0,0,0,0,0,0,0]
[null,null,"WEATHER CORRECTED MD 50% POE","MVA","Non-coincident",null,null,null,null,null,null,null,null,null,null,null,0,0,0,0,0,0,0]
[null,null,null,null,"Coincident",null,null,null,null,null,null,null,null,null,null,null,0,0,0,0,0,0,0]
[null,"Wandoan South","CONNECTION POINT RATING","MVA","Non-coincident",null,null,null,null,null,null,null,null,null,null,null,121,121,121,121,121,121,121]
[null,null,null,null,"Coincident",null,null,null,null,null,null,null,null,null,null,null,121,121,121,121,121,121,121]
[null,null,"WINTER/SUMMER PEAKING",null,"Non-coincident",null,null,null,null,null,null,null,null,null,null,null,"Summer","Summer","Summer","Summer","Summer","Summer","Summer"]
[null,null,null,null,"Coincident",null,null,null,null,null,null,null,null,null,null,null,"Summer","Summer","Summer","Summer","Summer","Summer","Summer"]
[null,null,"ADJUSTMENTS - EMBEDDED GENERATION","MW","Non-coincident",null,null,null,null,null,null,null,null,null,null,null,0,0,0,0,0,0,0]
[null,null,null,null,"Coincident",null,null,null,null,null,null,null,null,null,null,null,0,0,0,0,0,0,0]
[null,null,"WEATHER CORRECTED MD 10% POE","MW","Non-coincident",null,null,null,null,null,null,null,null,null,null,null,0,0,0,0,0,0,0]
[null,null,null,null,"Coincident",null,null,null,null,null,null,null,null,null,null,null,0,0,0,0,0,0,0]
[null,null,"WEATHER CORRECTED MD 10% POE","MVA","Non-coincident",null,null,null,null,null,null,null,null,null,null,null,0,0,0,0,0,0,0]
[null,null,null,null,"Coincident",null,null,null,null,null,null,null,null,null,null,null,0,0,0,0,0,0,0]
[null,null,"WEATHER CORRECTED MD 50% POE","MW","Non-coincident",null,null,null,null,null,null,null,null,null,null,null,0,0,0,0,0,0,0]
[null,null,null,null,"Coincident",null,null,null,null,null,null,null,null,null,null,null,0,0,0,0,0,0,0]
[null,null,"WEATHER CORRECTED MD 50% POE","MVA","Non-coincident",null,null,null,null,null,null,null,null,null,null,null,0,0,0,0,0,0,0]
[null,null,null,null,"Coincident",null,null,null,null,null,null,null,null,null,null,null,0,0,0,0,0,0,0]
[null,"Bellevue (LNG)","CONNECTION POINT RATING","MVA","Non-coincident"]
[null,null,null,null,"Coincident"]
[null,null,"WINTER/SUMMER PEAKING",null,"Non-coincident",null,null,null,null,null,null,null,null,null,null,null,"Summer","Summer","Summer","Summer","Summer","Summer","Summer"]
[null,null,null,null,"Coincident",null,null,null,null,null,null,null,null,null,null,null,"Summer","Summer","Summer","Summer","Summer","Summer","Summer"]
[null,null,"ADJUSTMENTS - EMBEDDED GENERATION","MW","Non-coincident",null,null,null,null,null,null,null,null,null,null,null,0,0,0,0,0,0,0]
[null,null,null,null,"Coincident",null,null,null,null,null,null,null,null,null,null,null,0,0,0,0,0,0,0]
[null,null,"WEATHER CORRECTED MD 10% POE","MW","Non-coincident"]
[null,null,null,null,"Coincident"]
[null,null,"WEATHER CORRECTED MD 10% POE","MVA","Non-coincident"]
[null,null,null,null,"Coincident"]
[null,null,"WEATHER CORRECTED MD 50% POE","MW","Non-coincident"]
[null,null,null,null,"Coincident"]
[null,null,"WEATHER CORRECTED MD 50% POE","MVA","Non-coincident"]
[null,null,null,null,"Coincident"]
[null,"Eagle Downs","CONNECTION POINT RATING","MVA","Non-coincident"]
[null,null,null,null,"Coincident"]
[null,null,"WINTER/SUMMER PEAKING",null,"Non-coincident",null,null,null,null,null,null,null,null,null,null,null,"Summer","Summer","Summer","Summer","Summer","Summer","Summer"]
[null,null,null,null,"Coincident",null,null,null,null,null,null,null,null,null,null,null,"Summer","Summer","Summer","Summer","Summer","Summer","Summer"]
[null,null,"ADJUSTMENTS - EMBEDDED GENERATION","MW","Non-coincident",null,null,null,null,null,null,null,null,null,null,null,0,0,0,0,0,0,0]
[null,null,null,null,"Coincident",null,null,null,null,null,null,null,null,null,null,null,0,0,0,0,0,0,0]
[null,null,"WEATHER CORRECTED MD 10% POE","MW","Non-coincident"]
[null,null,null,null,"Coincident"]
[null,null,"WEATHER CORRECTED MD 10% POE","MVA","Non-coincident"]
[null,null,null,null,"Coincident"]
[null,null,"WEATHER CORRECTED MD 50% POE","MW","Non-coincident"]
[null,null,null,null,"Coincident"]
[null,null,"WEATHER CORRECTED MD 50% POE","MVA","Non-coincident"]
[null,null,null,null,"Coincident"]
[null,"Wotonga","CONNECTION POINT RATING","MVA","Non-coincident"]
[null,null,null,null,"Coincident"]
[null,null,"WINTER/SUMMER PEAKING",null,"Non-coincident",null,null,null,null,null,null,null,null,null,null,null,"Winter","Winter","Winter","Winter","Winter","Winter","Winter"]
[null,null,null,null,"Coincident",null,null,null,null,null,null,null,null,null,null,null,"Summer","Summer","Summer","Summer","Summer","Summer","Summer"]
[null,null,"ADJUSTMENTS - EMBEDDED GENERATION","MW","Non-coincident",null,null,null,null,null,null,null,null,null,null,null,0,0,0,0,0,0,0]
[null,null,null,null,"Coincident",null,null,null,null,null,null,null,null,null,null,null,0,0,0,0,0,0,0]
[null,null,"WEATHER CORRECTED MD 10% POE","MW","Non-coincident"]
[null,null,null,null,"Coincident"]
[null,null,"WEATHER CORRECTED MD 10% POE","MVA","Non-coincident"]
[null,null,null,null,"Coincident"]
[null,null,"WEATHER CORRECTED MD 50% POE","MW","Non-coincident"]
[null,null,null,null,"Coincident"]
[null,null,"WEATHER CORRECTED MD 50% POE","MVA","Non-coincident"]
[null,null,null,null,"Coincident"]
[null,"Middle Ridge (Energex)","CONNECTION POINT RATING","MVA","Non-coincident",null,null,null,null,null,null,null,null,null,null,null,382,382,382,382,382,382,382]
[null,null,null,null,"Coincident",null,null,null,null,null,null,null,null,null,null,null,382,382,382,382,382,382,382]
[null,null,"WINTER/SUMMER PEAKING",null,"Non-coincident",null,null,null,null,null,null,null,null,null,null,null,"Summer","Summer","Summer","Summer","Summer","Summer","Summer"]
[null,null,null,null,"Coincident",null,null,null,null,null,null,null,null,null,null,null,"Summer","Summer","Summer","Summer","Summer","Summer","Summer"]
[null,null,"ADJUSTMENTS - EMBEDDED GENERATION","MW","Non-coincident",null,null,null,null,null,null,null,null,null,null,null,0,0,0,0,0,0,0]
[null,null,null,null,"Coincident",null,null,null,null,null,null,null,null,null,null,null,0,0,0,0,0,0,0]
[null,null,"WEATHER CORRECTED MD 10% POE","MW","Non-coincident",null,null,null,null,null,null,null,null,null,null,null,101,102,101,102,102,101,102]
[null,null,null,null,"Coincident",null,null,null,null,null,null,null,null,null,null,null,44,44,44,44,44,44,44]
[null,null,"WEATHER CORRECTED MD 10% POE","MVA","Non-coincident",null,null,null,null,null,null,null,null,null,null,null,102,102,102,102,102,102,102]
[null,null,null,null,"Coincident",null,null,null,null,null,null,null,null,null,null,null,44,44,44,44,44,44,44]
[null,null,"WEATHER CORRECTED MD 50% POE","MW","Non-coincident",null,null,null,null,null,null,null,null,null,null,null,93,93,92,93,93,92,92]
[null,null,null,null,"Coincident",null,null,null,null,null,null,null,null,null,null,null,40,40,40,40,40,40,40]
[null,null,"WEATHER CORRECTED MD 50% POE","MVA","Non-coincident",null,null,null,null,null,null,null,null,null,null,null,93,93,93,93,93,93,93]
[null,null,null,null,"Coincident",null,null,null,null,null,null,null,null,null,null,null,40,40,40,40,40,40,40]
[null,"Middle Ridge (Ergon)","CONNECTION POINT RATING","MVA","Non-coincident",null,null,null,null,null,null,null,null,null,null,null,1674,1674,1674,1674,1674,1674,1674]
[null,null,null,null,"Coincident",null,null,null,null,null,null,null,null,null,null,null,1674,1674,1674,1674,1674,1674,1674]
[null,null,"WINTER/SUMMER PEAKING",null,"Non-coincident",null,null,null,null,null,null,null,null,null,null,null,"Winter","Winter","Winter","Winter","Winter","Winter","Winter"]
[null,null,null,null,"Coincident",null,null,null,null,null,null,null,null,null,null,null,"Summer","Summer","Summer","Summer","Summer","Summer","Summer"]
[null,null,"ADJUSTMENTS - EMBEDDED GENERATION","MW","Non-coincident",null,null,null,null,null,null,null,null,null,null,null,0,0,0,0,0,0,0]
[null,null,null,null,"Coincident",null,null,null,null,null,null,null,null,null,null,null,0,0,0,0,0,0,0]
[null,null,"WEATHER CORRECTED MD 10% POE","MW","Non-coincident",null,null,null,null,null,null,null,null,null,null,null,212,212,212,212,214,207,204]
[null,null,null,null,"Coincident",null,null,null,null,null,null,null,null,null,null,null,197,196,195,195,193,191,189]
[null,null,"WEATHER CORRECTED MD 10% POE","MVA","Non-coincident",null,null,null,null,null,null,null,null,null,null,null,213,214,214,214,215,209,205]
[null,null,null,null,"Coincident",null,null,null,null,null,null,null,null,null,null,null,205,204,202,203,200,198,195]
[null,null,"WEATHER CORRECTED MD 50% POE","MW","Non-coincident",null,null,null,null,null,null,null,null,null,null,null,191,189,188,189,190,183,181]
[null,null,null,null,"Coincident",null,null,null,null,null,null,null,null,null,null,null,181,180,178,178,176,174,172]
[null,null,"WEATHER CORRECTED MD 50% POE","MVA","Non-coincident",null,null,null,null,null,null,null,null,null,null,null,192,190,189,190,191,184,182]
[null,null,null,null,"Coincident",null,null,null,null,null,null,null,null,null,null,null,187,186,184,184,182,180,177]
[null,"Woolooga (Energex)","CONNECTION POINT RATING","MVA","Non-coincident",null,null,null,null,null,null,null,null,null,null,null,823,823,823,823,823,823,823]
[null,null,null,null,"Coincident",null,null,null,null,null,null,null,null,null,null,null,823,823,823,823,823,823,823]
[null,null,"WINTER/SUMMER PEAKING",null,"Non-coincident",null,null,null,null,null,null,null,null,null,null,null,"Summer","Summer","Summer","Summer","Summer","Summer","Summer"]
[null,null,null,null,"Coincident",null,null,null,null,null,null,null,null,null,null,null,"Summer","Summer","Summer","Summer","Summer","Summer","Summer"]
[null,null,"ADJUSTMENTS - EMBEDDED GENERATION","MW","Non-coincident",null,null,null,null,null,null,null,null,null,null,null,0,0,0,0,0,0,0]
[null,null,null,null,"Coincident",null,null,null,null,null,null,null,null,null,null,null,0,0,0,0,0,0,0]
[null,null,"WEATHER CORRECTED MD 10% POE","MW","Non-coincident",null,null,null,null,null,null,null,null,null,null,null,205,203,202,203,203,203,203]
[null,null,null,null,"Coincident",null,null,null,null,null,null,null,null,null,null,null,156,155,154,155,155,154,155]
[null,null,"WEATHER CORRECTED MD 10% POE","MVA","Non-coincident",null,null,null,null,null,null,null,null,null,null,null,206,204,203,204,205,204,204]
[null,null,null,null,"Coincident",null,null,null,null,null,null,null,null,null,null,null,157,156,155,156,156,155,156]
[null,null,"WEATHER CORRECTED MD 50% POE","MW","Non-coincident",null,null,null,null,null,null,null,null,null,null,null,191,189,188,189,189,188,188]
[null,null,null,null,"Coincident",null,null,null,null,null,null,null,null,null,null,null,145,144,143,144,144,143,143]
[null,null,"WEATHER CORRECTED MD 50% POE","MVA","Non-coincident",null,null,null,null,null,null,null,null,null,null,null,192,190,189,190,190,189,189]
[null,null,null,null,"Coincident",null,null,null,null,null,null,null,null,null,null,null,146,145,144,145,145,144,144]
[null,"Woolooga (Ergon)","CONNECTION POINT RATING","MVA","Non-coincident",null,null,null,null,null,null,null,null,null,null,null,714,714,714,714,714,714,714]
[null,null,null,null,"Coincident",null,null,null,null,null,null,null,null,null,null,null,714,714,714,714,714,714,714]
[null,null,"WINTER/SUMMER PEAKING",null,"Non-coincident",null,null,null,null,null,null,null,null,null,null,null,"Summer","Summer","Summer","Summer","Summer","Summer","Summer"]
[null,null,null,null,"Coincident",null,null,null,null,null,null,null,null,null,null,null,"Summer","Summer","Summer","Summer","Summer","Summer","Summer"]
[null,null,"ADJUSTMENTS - EMBEDDED GENERATION","MW","Non-coincident",null,null,null,null,null,null,null,null,null,null,null,0,0,0,0,0,0,0]
[null,null,null,null,"Coincident",null,null,null,null,null,null,null,null,null,null,null,0,0,0,0,0,0,0]
[null,null,"WEATHER CORRECTED MD 10% POE","MW","Non-coincident",null,null,null,null,null,null,null,null,null,null,null,32,32,32,32,31,31,31]
[null,null,null,null,"Coincident",null,null,null,null,null,null,null,null,null,null,null,14,14,14,14,13,13,13]
[null,null,"WEATHER CORRECTED MD 10% POE","MVA","Non-coincident",null,null,null,null,null,null,null,null,null,null,null,33,32,32,32,32,32,31]
[null,null,null,null,"Coincident",null,null,null,null,null,null,null,null,null,null,null,14,14,14,14,14,13,13]
[null,null,"WEATHER CORRECTED MD 50% POE","MW","Non-coincident",null,null,null,null,null,null,null,null,null,null,null,30,30,30,30,30,29,29]
[null,null,null,null,"Coincident",null,null,null,null,null,null,null,null,null,null,null,13,13,13,13,13,13,12]
[null,null,"WEATHER CORRECTED MD 50% POE","MVA","Non-coincident",null,null,null,null,null,null,null,null,null,null,null,31,31,30,30,30,30,29]
[null,null,null,null,"Coincident",null,null,null,null,null,null,null,null,null,null,null,13,13,13,13,13,13,12]
[null,"Alligator Creek (Louisa Creek)","CONNECTION POINT RATING","MVA","Non-coincident",null,null,null,null,null,null,null,null,null,null,null,272,272,272,272,272,272,272]
[null,null,null,null,"Coincident",null,null,null,null,null,null,null,null,null,null,null,272,272,272,272,272,272,272]
[null,null,"WINTER/SUMMER PEAKING",null,"Non-coincident",null,null,null,null,null,null,null,null,null,null,null,"Summer","Summer","Summer","Summer","Summer","Summer","Summer"]
[null,null,null,null,"Coincident",null,null,null,null,null,null,null,null,null,null,null,"Summer","Summer","Summer","Summer","Summer","Summer","Summer"]
[null,null,"ADJUSTMENTS - EMBEDDED GENERATION","MW","Non-coincident",null,null,null,null,null,null,null,null,null,null,null,0,0,0,0,0,0,0]
[null,null,null,null,"Coincident",null,null,null,null,null,null,null,null,null,null,null,0,0,0,0,0,0,0]
[null,null,"WEATHER CORRECTED MD 10% POE","MW","Non-coincident",null,null,null,null,null,null,null,null,null,null,null,49,56,56,56,55,54,53]
[null,null,null,null,"Coincident",null,null,null,null,null,null,null,null,null,null,null,20,23,23,23,22,22,22]
[null,null,"WEATHER CORRECTED MD 10% POE","MVA","Non-coincident",null,null,null,null,null,null,null,null,null,null,null,50,57,57,57,56,55,54]
[null,null,null,null,"Coincident",null,null,null,null,null,null,null,null,null,null,null,21,24,24,24,23,23,23]
[null,null,"WEATHER CORRECTED MD 50% POE","MW","Non-coincident",null,null,null,null,null,null,null,null,null,null,null,47,54,53,53,52,52,51]
[null,null,null,null,"Coincident",null,null,null,null,null,null,null,null,null,null,null,19,22,22,22,21,21,21]
[null,null,"WEATHER CORRECTED MD 50% POE","MVA","Non-coincident",null,null,null,null,null,null,null,null,null,null,null,47,55,54,54,53,52,51]
[null,null,null,null,"Coincident",null,null,null,null,null,null,null,null,null,null,null,20,23,23,23,22,22,21]
[null,"Alligator Creek (Mackay Ports)","CONNECTION POINT RATING","MVA","Non-coincident"]
[null,null,null,null,"Coincident"]
[null,null,"WINTER/SUMMER PEAKING",null,"Non-coincident",null,null,null,null,null,null,null,null,null,null,null,"Summer","Summer","Summer","Summer","Summer","Summer","Summer"]
[null,null,null,null,"Coincident",null,null,null,null,null,null,null,null,null,null,null,"Summer","Summer","Summer","Summer","Summer","Summer","Summer"]
[null,null,"ADJUSTMENTS - EMBEDDED GENERATION","MW","Non-coincident",null,null,null,null,null,null,null,null,null,null,null,0,0,0,0,0,0,0]
[null,null,null,null,"Coincident",null,null,null,null,null,null,null,null,null,null,null,0,0,0,0,0,0,0]
[null,null,"WEATHER CORRECTED MD 10% POE","MW","Non-coincident"]
[null,null,null,null,"Coincident"]
[null,null,"WEATHER CORRECTED MD 10% POE","MVA","Non-coincident"]
[null,null,null,null,"Coincident"]
[null,null,"WEATHER CORRECTED MD 50% POE","MW","Non-coincident"]
[null,null,null,null,"Coincident"]
[null,null,"WEATHER CORRECTED MD 50% POE","MVA","Non-coincident"]
[null,null,null,null,"Coincident"]
[null,"Wandoan South 275kV (LNG)","CONNECTION POINT RATING","MVA","Non-coincident"]
[null,null,null,null,"Coincident"]
[null,null,"WINTER/SUMMER PEAKING",null,"Non-coincident",null,null,null,null,null,null,null,null,null,null,null,"Summer","Summer","Summer","Summer","Summer","Summer","Summer"]
[null,null,null,null,"Coincident",null,null,null,null,null,null,null,null,null,null,null,"Summer","Summer","Summer","Summer","Summer","Summer","Summer"]
[null,null,"ADJUSTMENTS - EMBEDDED GENERATION","MW","Non-coincident",null,null,null,null,null,null,null,null,null,null,null,0,0,0,0,0,0,0]
[null,null,null,null,"Coincident",null,null,null,null,null,null,null,null,null,null,null,0,0,0,0,0,0,0]
[null,null,"WEATHER CORRECTED MD 10% POE","MW","Non-coincident"]
[null,null,null,null,"Coincident"]
[null,null,"WEATHER CORRECTED MD 10% POE","MVA","Non-coincident"]
[null,null,null,null,"Coincident"]
[null,null,"WEATHER CORRECTED MD 50% POE","MW","Non-coincident"]
[null,null,null,null,"Coincident"]
[null,null,"WEATHER CORRECTED MD 50% POE","MVA","Non-coincident"]
[null,null,null,null,"Coincident"]
[null,"Blackwater 132kV (Rangal)","CONNECTION POINT RATING","MVA","Non-coincident",null,null,null,null,null,null,null,null,null,null,null,480,480,480,480,480,480,480]
[null,null,null,null,"Coincident",null,null,null,null,null,null,null,null,null,null,null,480,480,480,480,480,480,480]
[null,null,"WINTER/SUMMER PEAKING",null,"Non-coincident",null,null,null,null,null,null,null,null,null,null,null,"Winter","Winter","Winter","Winter","Winter","Winter","Winter"]
[null,null,null,null,"Coincident",null,null,null,null,null,null,null,null,null,null,null,"Summer","Summer","Summer","Summer","Summer","Summer","Summer"]
[null,null,"ADJUSTMENTS - EMBEDDED GENERATION","MW","Non-coincident",null,null,null,null,null,null,null,null,null,null,null,0,0,0,0,0,0,0]
[null,null,null,null,"Coincident",null,null,null,null,null,null,null,null,null,null,null,0,0,0,0,0,0,0]
[null,null,"WEATHER CORRECTED MD 10% POE","MW","Non-coincident"]
[null,null,null,null,"Coincident"]
[null,null,"WEATHER CORRECTED MD 10% POE","MVA","Non-coincident"]
[null,null,null,null,"Coincident"]
[null,null,"WEATHER CORRECTED MD 50% POE","MW","Non-coincident"]
[null,null,null,null,"Coincident"]
[null,null,"WEATHER CORRECTED MD 50% POE","MVA","Non-coincident"]
[null,null,null,null,"Coincident"]
[null,"Blackwater 132kV (Rolleston)","CONNECTION POINT RATING","MVA","Non-coincident",null,null,null,null,null,null,null,null,null,null,null,183,183,183,183,183,183,183]
[null,null,null,null,"Coincident",null,null,null,null,null,null,null,null,null,null,null,183,183,183,183,183,183,183]
[null,null,"WINTER/SUMMER PEAKING",null,"Non-coincident",null,null,null,null,null,null,null,null,null,null,null,"Summer","Summer","Summer","Summer","Summer","Summer","Summer"]
[null,null,null,null,"Coincident",null,null,null,null,null,null,null,null,null,null,null,"Summer","Summer","Summer","Summer","Summer","Summer","Summer"]
[null,null,"ADJUSTMENTS - EMBEDDED GENERATION","MW","Non-coincident",null,null,null,null,null,null,null,null,null,null,null,0,0,0,0,0,0,0]
[null,null,null,null,"Coincident",null,null,null,null,null,null,null,null,null,null,null,0,0,0,0,0,0,0]
[null,null,"WEATHER CORRECTED MD 10% POE","MW","Non-coincident"]
[null,null,null,null,"Coincident"]
[null,null,"WEATHER CORRECTED MD 10% POE","MVA","Non-coincident"]
[null,null,null,null,"Coincident"]
[null,null,"WEATHER CORRECTED MD 50% POE","MW","Non-coincident"]
[null,null,null,null,"Coincident"]
[null,null,"WEATHER CORRECTED MD 50% POE","MVA","Non-coincident"]
[null,null,null,null,"Coincident"]
[null,"NSP to enter name","CONNECTION POINT RATING","MVA","Non-coincident"]
[null,null,null,null,"Coincident"]
[null,null,"WINTER/SUMMER PEAKING",null,"Non-coincident"]
[null,null,null,null,"Coincident"]
[null,null,"ADJUSTMENTS - EMBEDDED GENERATION","MW","Non-coincident"]
[null,null,null,null,"Coincident"]
[null,null,"WEATHER CORRECTED MD 10% POE","MW","Non-coincident"]
[null,null,null,null,"Coincident"]
[null,null,"WEATHER CORRECTED MD 10% POE","MVA","Non-coincident"]
[null,null,null,null,"Coincident"]
[null,null,"WEATHER CORRECTED MD 50% POE","MW","Non-coincident"]
[null,null,null,null,"Coincident"]
[null,null,"WEATHER CORRECTED MD 50% POE","MVA","Non-coincident"]
[null,null,null,null,"Coincident"]
[null,"NSP to enter name","CONNECTION POINT RATING","MVA","Non-coincident"]
[null,null,null,null,"Coincident"]
[null,null,"WINTER/SUMMER PEAKING",null,"Non-coincident"]
[null,null,null,null,"Coincident"]
[null,null,"ADJUSTMENTS - EMBEDDED GENERATION","MW","Non-coincident"]
[null,null,null,null,"Coincident"]
[null,null,"WEATHER CORRECTED MD 10% POE","MW","Non-coincident"]
[null,null,null,null,"Coincident"]
[null,null,"WEATHER CORRECTED MD 10% POE","MVA","Non-coincident"]
[null,null,null,null,"Coincident"]
[null,null,"WEATHER CORRECTED MD 50% POE","MW","Non-coincident"]
[null,null,null,null,"Coincident"]
[null,null,"WEATHER CORRECTED MD 50% POE","MVA","Non-coincident"]
[null,null,null,null,"Coincident"]
[null,"NSP to enter name","CONNECTION POINT RATING","MVA","Non-coincident"]
[null,null,null,null,"Coincident"]
[null,null,"WINTER/SUMMER PEAKING",null,"Non-coincident"]
[null,null,null,null,"Coincident"]
[null,null,"ADJUSTMENTS - EMBEDDED GENERATION","MW","Non-coincident"]
[null,null,null,null,"Coincident"]
[null,null,"WEATHER CORRECTED MD 10% POE","MW","Non-coincident"]
[null,null,null,null,"Coincident"]
[null,null,"WEATHER CORRECTED MD 10% POE","MVA","Non-coincident"]
[null,null,null,null,"Coincident"]
[null,null,"WEATHER CORRECTED MD 50% POE","MW","Non-coincident"]
[null,null,null,null,"Coincident"]
[null,null,"WEATHER CORRECTED MD 50% POE","MVA","Non-coincident"]
[null,null,null,null,"Coincident"]
[null,"NSP to enter name","CONNECTION POINT RATING","MVA","Non-coincident"]
[null,null,null,null,"Coincident"]
[null,null,"WINTER/SUMMER PEAKING",null,"Non-coincident"]
[null,null,null,null,"Coincident"]
[null,null,"ADJUSTMENTS - EMBEDDED GENERATION","MW","Non-coincident"]
[null,null,null,null,"Coincident"]
[null,null,"WEATHER CORRECTED MD 10% POE","MW","Non-coincident"]
[null,null,null,null,"Coincident"]
[null,null,"WEATHER CORRECTED MD 10% POE","MVA","Non-coincident"]
[null,null,null,null,"Coincident"]
[null,null,"WEATHER CORRECTED MD 50% POE","MW","Non-coincident"]
[null,null,null,null,"Coincident"]
[null,null,"WEATHER CORRECTED MD 50% POE","MVA","Non-coincident"]
[null,null,null,null,"Coincident"]
[null,"NSP to enter name","CONNECTION POINT RATING","MVA","Non-coincident"]
[null,null,null,null,"Coincident"]
[null,null,"WINTER/SUMMER PEAKING",null,"Non-coincident"]
[null,null,null,null,"Coincident"]
[null,null,"ADJUSTMENTS - EMBEDDED GENERATION","MW","Non-coincident"]
[null,null,null,null,"Coincident"]
[null,null,"WEATHER CORRECTED MD 10% POE","MW","Non-coincident"]
[null,null,null,null,"Coincident"]
[null,null,"WEATHER CORRECTED MD 10% POE","MVA","Non-coincident"]
[null,null,null,null,"Coincident"]
[null,null,"WEATHER CORRECTED MD 50% POE","MW","Non-coincident"]
[null,null,null,null,"Coincident"]
[null,null,"WEATHER CORRECTED MD 50% POE","MVA","Non-coincident"]
[null,null,null,null,"Coincident"]
[null,"NSP to enter name","CONNECTION POINT RATING","MVA","Non-coincident"]
[null,null,null,null,"Coincident"]
[null,null,"WINTER/SUMMER PEAKING",null,"Non-coincident"]
[null,null,null,null,"Coincident"]
[null,null,"ADJUSTMENTS - EMBEDDED GENERATION","MW","Non-coincident"]
[null,null,null,null,"Coincident"]
[null,null,"WEATHER CORRECTED MD 10% POE","MW","Non-coincident"]
[null,null,null,null,"Coincident"]
[null,null,"WEATHER CORRECTED MD 10% POE","MVA","Non-coincident"]
[null,null,null,null,"Coincident"]
[null,null,"WEATHER CORRECTED MD 50% POE","MW","Non-coincident"]
[null,null,null,null,"Coincident"]
[null,null,"WEATHER CORRECTED MD 50% POE","MVA","Non-coincident"]
[null,null,null,null,"Coincident"]
[null,"NSP to enter name","CONNECTION POINT RATING","MVA","Non-coincident"]
[null,null,null,null,"Coincident"]
[null,null,"WINTER/SUMMER PEAKING",null,"Non-coincident"]
[null,null,null,null,"Coincident"]
[null,null,"ADJUSTMENTS - EMBEDDED GENERATION","MW","Non-coincident"]
[null,null,null,null,"Coincident"]
[null,null,"WEATHER CORRECTED MD 10% POE","MW","Non-coincident"]
[null,null,null,null,"Coincident"]
[null,null,"WEATHER CORRECTED MD 10% POE","MVA","Non-coincident"]
[null,null,null,null,"Coincident"]
[null,null,"WEATHER CORRECTED MD 50% POE","MW","Non-coincident"]
[null,null,null,null,"Coincident"]
[null,null,"WEATHER CORRECTED MD 50% POE","MVA","Non-coincident"]
[null,null,null,null,"Coincident"]
[null,"NSP to enter name","CONNECTION POINT RATING","MVA","Non-coincident"]
[null,null,null,null,"Coincident"]
[null,null,"WINTER/SUMMER PEAKING",null,"Non-coincident"]
[null,null,null,null,"Coincident"]
[null,null,"ADJUSTMENTS - EMBEDDED GENERATION","MW","Non-coincident"]
[null,null,null,null,"Coincident"]
[null,null,"WEATHER CORRECTED MD 10% POE","MW","Non-coincident"]
[null,null,null,null,"Coincident"]
[null,null,"WEATHER CORRECTED MD 10% POE","MVA","Non-coincident"]
[null,null,null,null,"Coincident"]
[null,null,"WEATHER CORRECTED MD 50% POE","MW","Non-coincident"]
[null,null,null,null,"Coincident"]
[null,null,"WEATHER CORRECTED MD 50% POE","MVA","Non-coincident"]
[null,null,null,null,"Coincident"]
[null,"NSP to enter name","CONNECTION POINT RATING","MVA","Non-coincident"]
[null,null,null,null,"Coincident"]
[null,null,"WINTER/SUMMER PEAKING",null,"Non-coincident"]
[null,null,null,null,"Coincident"]
[null,null,"ADJUSTMENTS - EMBEDDED GENERATION","MW","Non-coincident"]
[null,null,null,null,"Coincident"]
[null,null,"WEATHER CORRECTED MD 10% POE","MW","Non-coincident"]
[null,null,null,null,"Coincident"]
[null,null,"WEATHER CORRECTED MD 10% POE","MVA","Non-coincident"]
[null,null,null,null,"Coincident"]
[null,null,"WEATHER CORRECTED MD 50% POE","MW","Non-coincident"]
[null,null,null,null,"Coincident"]
[null,null,"WEATHER CORRECTED MD 50% POE","MVA","Non-coincident"]
[null,null,null,null,"Coincident"]
[null,"NSP to enter name","CONNECTION POINT RATING","MVA","Non-coincident"]
[null,null,null,null,"Coincident"]
[null,null,"WINTER/SUMMER PEAKING",null,"Non-coincident"]
[null,null,null,null,"Coincident"]
[null,null,"ADJUSTMENTS - EMBEDDED GENERATION","MW","Non-coincident"]
[null,null,null,null,"Coincident"]
[null,null,"WEATHER CORRECTED MD 10% POE","MW","Non-coincident"]
[null,null,null,null,"Coincident"]
[null,null,"WEATHER CORRECTED MD 10% POE","MVA","Non-coincident"]
[null,null,null,null,"Coincident"]
[null,null,"WEATHER CORRECTED MD 50% POE","MW","Non-coincident"]
[null,null,null,null,"Coincident"]
[null,null,"WEATHER CORRECTED MD 50% POE","MVA","Non-coincident"]
[null,null,null,null,"Coincident"]
[null,"NSP to enter name","CONNECTION POINT RATING","MVA","Non-coincident"]
[null,null,null,null,"Coincident"]
[null,null,"WINTER/SUMMER PEAKING",null,"Non-coincident"]
[null,null,null,null,"Coincident"]
[null,null,"ADJUSTMENTS - EMBEDDED GENERATION","MW","Non-coincident"]
[null,null,null,null,"Coincident"]
[null,null,"WEATHER CORRECTED MD 10% POE","MW","Non-coincident"]
[null,null,null,null,"Coincident"]
[null,null,"WEATHER CORRECTED MD 10% POE","MVA","Non-coincident"]
[null,null,null,null,"Coincident"]
[null,null,"WEATHER CORRECTED MD 50% POE","MW","Non-coincident"]
[null,null,null,null,"Coincident"]
[null,null,"WEATHER CORRECTED MD 50% POE","MVA","Non-coincident"]
[null,null,null,null,"Coincident"]
[null,"NSP to enter name","CONNECTION POINT RATING","MVA","Non-coincident"]
[null,null,null,null,"Coincident"]
[null,null,"WINTER/SUMMER PEAKING",null,"Non-coincident"]
[null,null,null,null,"Coincident"]
[null,null,"ADJUSTMENTS - EMBEDDED GENERATION","MW","Non-coincident"]
[null,null,null,null,"Coincident"]
[null,null,"WEATHER CORRECTED MD 10% POE","MW","Non-coincident"]
[null,null,null,null,"Coincident"]
[null,null,"WEATHER CORRECTED MD 10% POE","MVA","Non-coincident"]
[null,null,null,null,"Coincident"]
[null,null,"WEATHER CORRECTED MD 50% POE","MW","Non-coincident"]
[null,null,null,null,"Coincident"]
[null,null,"WEATHER CORRECTED MD 50% POE","MVA","Non-coincident"]
[null,null,null,null,"Coincident"]
[null,"NSP to enter name","CONNECTION POINT RATING","MVA","Non-coincident"]
[null,null,null,null,"Coincident"]
[null,null,"WINTER/SUMMER PEAKING",null,"Non-coincident"]
[null,null,null,null,"Coincident"]
[null,null,"ADJUSTMENTS - EMBEDDED GENERATION","MW","Non-coincident"]
[null,null,null,null,"Coincident"]
[null,null,"WEATHER CORRECTED MD 10% POE","MW","Non-coincident"]
[null,null,null,null,"Coincident"]
[null,null,"WEATHER CORRECTED MD 10% POE","MVA","Non-coincident"]
[null,null,null,null,"Coincident"]
[null,null,"WEATHER CORRECTED MD 50% POE","MW","Non-coincident"]
[null,null,null,null,"Coincident"]
[null,null,"WEATHER CORRECTED MD 50% POE","MVA","Non-coincident"]
[null,null,null,null,"Coincident"]
[null,"NSP to enter name","CONNECTION POINT RATING","MVA","Non-coincident"]
[null,null,null,null,"Coincident"]
[null,null,"WINTER/SUMMER PEAKING",null,"Non-coincident"]
[null,null,null,null,"Coincident"]
[null,null,"ADJUSTMENTS - EMBEDDED GENERATION","MW","Non-coincident"]
[null,null,null,null,"Coincident"]
[null,null,"WEATHER CORRECTED MD 10% POE","MW","Non-coincident"]
[null,null,null,null,"Coincident"]
[null,null,"WEATHER CORRECTED MD 10% POE","MVA","Non-coincident"]
[null,null,null,null,"Coincident"]
[null,null,"WEATHER CORRECTED MD 50% POE","MW","Non-coincident"]
[null,null,null,null,"Coincident"]
[null,null,"WEATHER CORRECTED MD 50% POE","MVA","Non-coincident"]
[null,null,null,null,"Coincident"]
[null,"NSP to enter name","CONNECTION POINT RATING","MVA","Non-coincident"]
[null,null,null,null,"Coincident"]
[null,null,"WINTER/SUMMER PEAKING",null,"Non-coincident"]
[null,null,null,null,"Coincident"]
[null,null,"ADJUSTMENTS - EMBEDDED GENERATION","MW","Non-coincident"]
[null,null,null,null,"Coincident"]
[null,null,"WEATHER CORRECTED MD 10% POE","MW","Non-coincident"]
[null,null,null,null,"Coincident"]
[null,null,"WEATHER CORRECTED MD 10% POE","MVA","Non-coincident"]
[null,null,null,null,"Coincident"]
[null,null,"WEATHER CORRECTED MD 50% POE","MW","Non-coincident"]
[null,null,null,null,"Coincident"]
[null,null,"WEATHER CORRECTED MD 50% POE","MVA","Non-coincident"]
[null,null,null,null,"Coincident"]
[null,"NSP to enter name","CONNECTION POINT RATING","MVA","Non-coincident"]
[null,null,null,null,"Coincident"]
[null,null,"WINTER/SUMMER PEAKING",null,"Non-coincident"]
[null,null,null,null,"Coincident"]
[null,null,"ADJUSTMENTS - EMBEDDED GENERATION","MW","Non-coincident"]
[null,null,null,null,"Coincident"]
[null,null,"WEATHER CORRECTED MD 10% POE","MW","Non-coincident"]
[null,null,null,null,"Coincident"]
[null,null,"WEATHER CORRECTED MD 10% POE","MVA","Non-coincident"]
[null,null,null,null,"Coincident"]
[null,null,"WEATHER CORRECTED MD 50% POE","MW","Non-coincident"]
[null,null,null,null,"Coincident"]
[null,null,"WEATHER CORRECTED MD 50% POE","MVA","Non-coincident"]
[null,null,null,null,"Coincident"]
[null,"NSP to enter name","CONNECTION POINT RATING","MVA","Non-coincident"]
[null,null,null,null,"Coincident"]
[null,null,"WINTER/SUMMER PEAKING",null,"Non-coincident"]
[null,null,null,null,"Coincident"]
[null,null,"ADJUSTMENTS - EMBEDDED GENERATION","MW","Non-coincident"]
[null,null,null,null,"Coincident"]
[null,null,"WEATHER CORRECTED MD 10% POE","MW","Non-coincident"]
[null,null,null,null,"Coincident"]
[null,null,"WEATHER CORRECTED MD 10% POE","MVA","Non-coincident"]
[null,null,null,null,"Coincident"]
[null,null,"WEATHER CORRECTED MD 50% POE","MW","Non-coincident"]
[null,null,null,null,"Coincident"]
[null,null,"WEATHER CORRECTED MD 50% POE","MVA","Non-coincident"]
[null,null,null,null,"Coincident"]
[null,"NSP to enter name","CONNECTION POINT RATING","MVA","Non-coincident"]
[null,null,null,null,"Coincident"]
[null,null,"WINTER/SUMMER PEAKING",null,"Non-coincident"]
[null,null,null,null,"Coincident"]
[null,null,"ADJUSTMENTS - EMBEDDED GENERATION","MW","Non-coincident"]
[null,null,null,null,"Coincident"]
[null,null,"WEATHER CORRECTED MD 10% POE","MW","Non-coincident"]
[null,null,null,null,"Coincident"]
[null,null,"WEATHER CORRECTED MD 10% POE","MVA","Non-coincident"]
[null,null,null,null,"Coincident"]
[null,null,"WEATHER CORRECTED MD 50% POE","MW","Non-coincident"]
[null,null,null,null,"Coincident"]
[null,null,"WEATHER CORRECTED MD 50% POE","MVA","Non-coincident"]
[null,null,null,null,"Coincident"]
[null,"NSP to enter name","CONNECTION POINT RATING","MVA","Non-coincident"]
[null,null,null,null,"Coincident"]
[null,null,"WINTER/SUMMER PEAKING",null,"Non-coincident"]
[null,null,null,null,"Coincident"]
[null,null,"ADJUSTMENTS - EMBEDDED GENERATION","MW","Non-coincident"]
[null,null,null,null,"Coincident"]
[null,null,"WEATHER CORRECTED MD 10% POE","MW","Non-coincident"]
[null,null,null,null,"Coincident"]
[null,null,"WEATHER CORRECTED MD 10% POE","MVA","Non-coincident"]
[null,null,null,null,"Coincident"]
[null,null,"WEATHER CORRECTED MD 50% POE","MW","Non-coincident"]
[null,null,null,null,"Coincident"]
[null,null,"WEATHER CORRECTED MD 50% POE","MVA","Non-coincident"]
[null,null,null,null,"Coincident"]
[null,"NSP to enter name","CONNECTION POINT RATING","MVA","Non-coincident"]
[null,null,null,null,"Coincident"]
[null,null,"WINTER/SUMMER PEAKING",null,"Non-coincident"]
[null,null,null,null,"Coincident"]
[null,null,"ADJUSTMENTS - EMBEDDED GENERATION","MW","Non-coincident"]
[null,null,null,null,"Coincident"]
[null,null,"WEATHER CORRECTED MD 10% POE","MW","Non-coincident"]
[null,null,null,null,"Coincident"]
[null,null,"WEATHER CORRECTED MD 10% POE","MVA","Non-coincident"]
[null,null,null,null,"Coincident"]
[null,null,"WEATHER CORRECTED MD 50% POE","MW","Non-coincident"]
[null,null,null,null,"Coincident"]
[null,null,"WEATHER CORRECTED MD 50% POE","MVA","Non-coincident"]
[null,null,null,null,"Coincident"]
[null,"NSP to enter name","CONNECTION POINT RATING","MVA","Non-coincident"]
[null,null,null,null,"Coincident"]
[null,null,"WINTER/SUMMER PEAKING",null,"Non-coincident"]
[null,null,null,null,"Coincident"]
[null,null,"ADJUSTMENTS - EMBEDDED GENERATION","MW","Non-coincident"]
[null,null,null,null,"Coincident"]
[null,null,"WEATHER CORRECTED MD 10% POE","MW","Non-coincident"]
[null,null,null,null,"Coincident"]
[null,null,"WEATHER CORRECTED MD 10% POE","MVA","Non-coincident"]
[null,null,null,null,"Coincident"]
[null,null,"WEATHER CORRECTED MD 50% POE","MW","Non-coincident"]
[null,null,null,null,"Coincident"]
[null,null,"WEATHER CORRECTED MD 50% POE","MVA","Non-coincident"]
[null,null,null,null,"Coincident"]
[null,"NSP to enter name","CONNECTION POINT RATING","MVA","Non-coincident"]
[null,null,null,null,"Coincident"]
[null,null,"WINTER/SUMMER PEAKING",null,"Non-coincident"]
[null,null,null,null,"Coincident"]
[null,null,"ADJUSTMENTS - EMBEDDED GENERATION","MW","Non-coincident"]
[null,null,null,null,"Coincident"]
[null,null,"WEATHER CORRECTED MD 10% POE","MW","Non-coincident"]
[null,null,null,null,"Coincident"]
[null,null,"WEATHER CORRECTED MD 10% POE","MVA","Non-coincident"]
[null,null,null,null,"Coincident"]
[null,null,"WEATHER CORRECTED MD 50% POE","MW","Non-coincident"]
[null,null,null,null,"Coincident"]
[null,null,"WEATHER CORRECTED MD 50% POE","MVA","Non-coincident"]
[null,null,null,null,"Coincident"]
[null,"NSP to enter name","CONNECTION POINT RATING","MVA","Non-coincident"]
[null,null,null,null,"Coincident"]
[null,null,"WINTER/SUMMER PEAKING",null,"Non-coincident"]
[null,null,null,null,"Coincident"]
[null,null,"ADJUSTMENTS - EMBEDDED GENERATION","MW","Non-coincident"]
[null,null,null,null,"Coincident"]
[null,null,"WEATHER CORRECTED MD 10% POE","MW","Non-coincident"]
[null,null,null,null,"Coincident"]
[null,null,"WEATHER CORRECTED MD 10% POE","MVA","Non-coincident"]
[null,null,null,null,"Coincident"]
[null,null,"WEATHER CORRECTED MD 50% POE","MW","Non-coincident"]
[null,null,null,null,"Coincident"]
[null,null,"WEATHER CORRECTED MD 50% POE","MVA","Non-coincident"]
[null,null,null,null,"Coincident"]
[null,"NSP to enter name","CONNECTION POINT RATING","MVA","Non-coincident"]
[null,null,null,null,"Coincident"]
[null,null,"WINTER/SUMMER PEAKING",null,"Non-coincident"]
[null,null,null,null,"Coincident"]
[null,null,"ADJUSTMENTS - EMBEDDED GENERATION","MW","Non-coincident"]
[null,null,null,null,"Coincident"]
[null,null,"WEATHER CORRECTED MD 10% POE","MW","Non-coincident"]
[null,null,null,null,"Coincident"]
[null,null,"WEATHER CORRECTED MD 10% POE","MVA","Non-coincident"]
[null,null,null,null,"Coincident"]
[null,null,"WEATHER CORRECTED MD 50% POE","MW","Non-coincident"]
[null,null,null,null,"Coincident"]
[null,null,"WEATHER CORRECTED MD 50% POE","MVA","Non-coincident"]
[null,null,null,null,"Coincident"]
[null,"NSP to enter name","CONNECTION POINT RATING","MVA","Non-coincident"]
[null,null,null,null,"Coincident"]
[null,null,"WINTER/SUMMER PEAKING",null,"Non-coincident"]
[null,null,null,null,"Coincident"]
[null,null,"ADJUSTMENTS - EMBEDDED GENERATION","MW","Non-coincident"]
[null,null,null,null,"Coincident"]
[null,null,"WEATHER CORRECTED MD 10% POE","MW","Non-coincident"]
[null,null,null,null,"Coincident"]
[null,null,"WEATHER CORRECTED MD 10% POE","MVA","Non-coincident"]
[null,null,null,null,"Coincident"]
[null,null,"WEATHER CORRECTED MD 50% POE","MW","Non-coincident"]
[null,null,null,null,"Coincident"]
[null,null,"WEATHER CORRECTED MD 50% POE","MVA","Non-coincident"]
[null,null,null,null,"Coincident"]
[null,"NSP to enter name","CONNECTION POINT RATING","MVA","Non-coincident"]
[null,null,null,null,"Coincident"]
[null,null,"WINTER/SUMMER PEAKING",null,"Non-coincident"]
[null,null,null,null,"Coincident"]
[null,null,"ADJUSTMENTS - EMBEDDED GENERATION","MW","Non-coincident"]
[null,null,null,null,"Coincident"]
[null,null,"WEATHER CORRECTED MD 10% POE","MW","Non-coincident"]
[null,null,null,null,"Coincident"]
[null,null,"WEATHER CORRECTED MD 10% POE","MVA","Non-coincident"]
[null,null,null,null,"Coincident"]
[null,null,"WEATHER CORRECTED MD 50% POE","MW","Non-coincident"]
[null,null,null,null,"Coincident"]
[null,null,"WEATHER CORRECTED MD 50% POE","MVA","Non-coincident"]
[null,null,null,null,"Coincident"]
[null,"NSP to enter name","CONNECTION POINT RATING","MVA","Non-coincident"]
[null,null,null,null,"Coincident"]
[null,null,"WINTER/SUMMER PEAKING",null,"Non-coincident"]
[null,null,null,null,"Coincident"]
[null,null,"ADJUSTMENTS - EMBEDDED GENERATION","MW","Non-coincident"]
[null,null,null,null,"Coincident"]
[null,null,"WEATHER CORRECTED MD 10% POE","MW","Non-coincident"]
[null,null,null,null,"Coincident"]
[null,null,"WEATHER CORRECTED MD 10% POE","MVA","Non-coincident"]
[null,null,null,null,"Coincident"]
[null,null,"WEATHER CORRECTED MD 50% POE","MW","Non-coincident"]
[null,null,null,null,"Coincident"]
[null,null,"WEATHER CORRECTED MD 50% POE","MVA","Non-coincident"]
[null,null,null,null,"Coincident"]
[null,"NSP to enter name","CONNECTION POINT RATING","MVA","Non-coincident"]
[null,null,null,null,"Coincident"]
[null,null,"WINTER/SUMMER PEAKING",null,"Non-coincident"]
[null,null,null,null,"Coincident"]
[null,null,"ADJUSTMENTS - EMBEDDED GENERATION","MW","Non-coincident"]
[null,null,null,null,"Coincident"]
[null,null,"WEATHER CORRECTED MD 10% POE","MW","Non-coincident"]
[null,null,null,null,"Coincident"]
[null,null,"WEATHER CORRECTED MD 10% POE","MVA","Non-coincident"]
[null,null,null,null,"Coincident"]
[null,null,"WEATHER CORRECTED MD 50% POE","MW","Non-coincident"]
[null,null,null,null,"Coincident"]
[null,null,"WEATHER CORRECTED MD 50% POE","MVA","Non-coincident"]
[null,null,null,null,"Coincident"]
[null,"NSP to enter name","CONNECTION POINT RATING","MVA","Non-coincident"]
[null,null,null,null,"Coincident"]
[null,null,"WINTER/SUMMER PEAKING",null,"Non-coincident"]
[null,null,null,null,"Coincident"]
[null,null,"ADJUSTMENTS - EMBEDDED GENERATION","MW","Non-coincident"]
[null,null,null,null,"Coincident"]
[null,null,"WEATHER CORRECTED MD 10% POE","MW","Non-coincident"]
[null,null,null,null,"Coincident"]
[null,null,"WEATHER CORRECTED MD 10% POE","MVA","Non-coincident"]
[null,null,null,null,"Coincident"]
[null,null,"WEATHER CORRECTED MD 50% POE","MW","Non-coincident"]
[null,null,null,null,"Coincident"]
[null,null,"WEATHER CORRECTED MD 50% POE","MVA","Non-coincident"]
[null,null,null,null,"Coincident"]
[null,"NSP to enter name","CONNECTION POINT RATING","MVA","Non-coincident"]
[null,null,null,null,"Coincident"]
[null,null,"WINTER/SUMMER PEAKING",null,"Non-coincident"]
[null,null,null,null,"Coincident"]
[null,null,"ADJUSTMENTS - EMBEDDED GENERATION","MW","Non-coincident"]
[null,null,null,null,"Coincident"]
[null,null,"WEATHER CORRECTED MD 10% POE","MW","Non-coincident"]
[null,null,null,null,"Coincident"]
[null,null,"WEATHER CORRECTED MD 10% POE","MVA","Non-coincident"]
[null,null,null,null,"Coincident"]
[null,null,"WEATHER CORRECTED MD 50% POE","MW","Non-coincident"]
[null,null,null,null,"Coincident"]
[null,null,"WEATHER CORRECTED MD 50% POE","MVA","Non-coincident"]
[null,null,null,null,"Coincident"]
[null,"NSP to enter name","CONNECTION POINT RATING","MVA","Non-coincident"]
[null,null,null,null,"Coincident"]
[null,null,"WINTER/SUMMER PEAKING",null,"Non-coincident"]
[null,null,null,null,"Coincident"]
[null,null,"ADJUSTMENTS - EMBEDDED GENERATION","MW","Non-coincident"]
[null,null,null,null,"Coincident"]
[null,null,"WEATHER CORRECTED MD 10% POE","MW","Non-coincident"]
[null,null,null,null,"Coincident"]
[null,null,"WEATHER CORRECTED MD 10% POE","MVA","Non-coincident"]
[null,null,null,null,"Coincident"]
[null,null,"WEATHER CORRECTED MD 50% POE","MW","Non-coincident"]
[null,null,null,null,"Coincident"]
[null,null,"WEATHER CORRECTED MD 50% POE","MVA","Non-coincident"]
[null,null,null,null,"Coincident"]
[null,"NSP to enter name","CONNECTION POINT RATING","MVA","Non-coincident"]
[null,null,null,null,"Coincident"]
[null,null,"WINTER/SUMMER PEAKING",null,"Non-coincident"]
[null,null,null,null,"Coincident"]
[null,null,"ADJUSTMENTS - EMBEDDED GENERATION","MW","Non-coincident"]
[null,null,null,null,"Coincident"]
[null,null,"WEATHER CORRECTED MD 10% POE","MW","Non-coincident"]
[null,null,null,null,"Coincident"]
[null,null,"WEATHER CORRECTED MD 10% POE","MVA","Non-coincident"]
[null,null,null,null,"Coincident"]
[null,null,"WEATHER CORRECTED MD 50% POE","MW","Non-coincident"]
[null,null,null,null,"Coincident"]
[null,null,"WEATHER CORRECTED MD 50% POE","MVA","Non-coincident"]
[null,null,null,null,"Coincident"]
[null,"NSP to enter name","CONNECTION POINT RATING","MVA","Non-coincident"]
[null,null,null,null,"Coincident"]
[null,null,"WINTER/SUMMER PEAKING",null,"Non-coincident"]
[null,null,null,null,"Coincident"]
[null,null,"ADJUSTMENTS - EMBEDDED GENERATION","MW","Non-coincident"]
[null,null,null,null,"Coincident"]
[null,null,"WEATHER CORRECTED MD 10% POE","MW","Non-coincident"]
[null,null,null,null,"Coincident"]
[null,null,"WEATHER CORRECTED MD 10% POE","MVA","Non-coincident"]
[null,null,null,null,"Coincident"]
[null,null,"WEATHER CORRECTED MD 50% POE","MW","Non-coincident"]
[null,null,null,null,"Coincident"]
[null,null,"WEATHER CORRECTED MD 50% POE","MVA","Non-coincident"]
[null,null,null,null,"Coincident"]
[null,"NSP to enter name","CONNECTION POINT RATING","MVA","Non-coincident"]
[null,null,null,null,"Coincident"]
[null,null,"WINTER/SUMMER PEAKING",null,"Non-coincident"]
[null,null,null,null,"Coincident"]
[null,null,"ADJUSTMENTS - EMBEDDED GENERATION","MW","Non-coincident"]
[null,null,null,null,"Coincident"]
[null,null,"WEATHER CORRECTED MD 10% POE","MW","Non-coincident"]
[null,null,null,null,"Coincident"]
[null,null,"WEATHER CORRECTED MD 10% POE","MVA","Non-coincident"]
[null,null,null,null,"Coincident"]
[null,null,"WEATHER CORRECTED MD 50% POE","MW","Non-coincident"]
[null,null,null,null,"Coincident"]
[null,null,"WEATHER CORRECTED MD 50% POE","MVA","Non-coincident"]
[null,null,null,null,"Coincident"]
[null,"NSP to enter name","CONNECTION POINT RATING","MVA","Non-coincident"]
[null,null,null,null,"Coincident"]
[null,null,"WINTER/SUMMER PEAKING",null,"Non-coincident"]
[null,null,null,null,"Coincident"]
[null,null,"ADJUSTMENTS - EMBEDDED GENERATION","MW","Non-coincident"]
[null,null,null,null,"Coincident"]
[null,null,"WEATHER CORRECTED MD 10% POE","MW","Non-coincident"]
[null,null,null,null,"Coincident"]
[null,null,"WEATHER CORRECTED MD 10% POE","MVA","Non-coincident"]
[null,null,null,null,"Coincident"]
[null,null,"WEATHER CORRECTED MD 50% POE","MW","Non-coincident"]
[null,null,null,null,"Coincident"]
[null,null,"WEATHER CORRECTED MD 50% POE","MVA","Non-coincident"]
[null,null,null,null,"Coincident"]
[null,"NSP to enter name","CONNECTION POINT RATING","MVA","Non-coincident"]
[null,null,null,null,"Coincident"]
[null,null,"WINTER/SUMMER PEAKING",null,"Non-coincident"]
[null,null,null,null,"Coincident"]
[null,null,"ADJUSTMENTS - EMBEDDED GENERATION","MW","Non-coincident"]
[null,null,null,null,"Coincident"]
[null,null,"WEATHER CORRECTED MD 10% POE","MW","Non-coincident"]
[null,null,null,null,"Coincident"]
[null,null,"WEATHER CORRECTED MD 10% POE","MVA","Non-coincident"]
[null,null,null,null,"Coincident"]
[null,null,"WEATHER CORRECTED MD 50% POE","MW","Non-coincident"]
[null,null,null,null,"Coincident"]
[null,null,"WEATHER CORRECTED MD 50% POE","MVA","Non-coincident"]
[null,null,null,null,"Coincident"]
[null,"NSP to enter name","CONNECTION POINT RATING","MVA","Non-coincident"]
[null,null,null,null,"Coincident"]
[null,null,"WINTER/SUMMER PEAKING",null,"Non-coincident"]
[null,null,null,null,"Coincident"]
[null,null,"ADJUSTMENTS - EMBEDDED GENERATION","MW","Non-coincident"]
[null,null,null,null,"Coincident"]
[null,null,"WEATHER CORRECTED MD 10% POE","MW","Non-coincident"]
[null,null,null,null,"Coincident"]
[null,null,"WEATHER CORRECTED MD 10% POE","MVA","Non-coincident"]
[null,null,null,null,"Coincident"]
[null,null,"WEATHER CORRECTED MD 50% POE","MW","Non-coincident"]
[null,null,null,null,"Coincident"]
[null,null,"WEATHER CORRECTED MD 50% POE","MVA","Non-coincident"]
[null,null,null,null,"Coincident"]
[null,"NSP to enter name","CONNECTION POINT RATING","MVA","Non-coincident"]
[null,null,null,null,"Coincident"]
[null,null,"WINTER/SUMMER PEAKING",null,"Non-coincident"]
[null,null,null,null,"Coincident"]
[null,null,"ADJUSTMENTS - EMBEDDED GENERATION","MW","Non-coincident"]
[null,null,null,null,"Coincident"]
[null,null,"WEATHER CORRECTED MD 10% POE","MW","Non-coincident"]
[null,null,null,null,"Coincident"]
[null,null,"WEATHER CORRECTED MD 10% POE","MVA","Non-coincident"]
[null,null,null,null,"Coincident"]
[null,null,"WEATHER CORRECTED MD 50% POE","MW","Non-coincident"]
[null,null,null,null,"Coincident"]
[null,null,"WEATHER CORRECTED MD 50% POE","MVA","Non-coincident"]
[null,null,null,null,"Coincident"]
[null,"NSP to enter name","CONNECTION POINT RATING","MVA","Non-coincident"]
[null,null,null,null,"Coincident"]
[null,null,"WINTER/SUMMER PEAKING",null,"Non-coincident"]
[null,null,null,null,"Coincident"]
[null,null,"ADJUSTMENTS - EMBEDDED GENERATION","MW","Non-coincident"]
[null,null,null,null,"Coincident"]
[null,null,"WEATHER CORRECTED MD 10% POE","MW","Non-coincident"]
[null,null,null,null,"Coincident"]
[null,null,"WEATHER CORRECTED MD 10% POE","MVA","Non-coincident"]
[null,null,null,null,"Coincident"]
[null,null,"WEATHER CORRECTED MD 50% POE","MW","Non-coincident"]
[null,null,null,null,"Coincident"]
[null,null,"WEATHER CORRECTED MD 50% POE","MVA","Non-coincident"]
[null,null,null,null,"Coincident"]
[null,"NSP to enter name","CONNECTION POINT RATING","MVA","Non-coincident"]
[null,null,null,null,"Coincident"]
[null,null,"WINTER/SUMMER PEAKING",null,"Non-coincident"]
[null,null,null,null,"Coincident"]
[null,null,"ADJUSTMENTS - EMBEDDED GENERATION","MW","Non-coincident"]
[null,null,null,null,"Coincident"]
[null,null,"WEATHER CORRECTED MD 10% POE","MW","Non-coincident"]
[null,null,null,null,"Coincident"]
[null,null,"WEATHER CORRECTED MD 10% POE","MVA","Non-coincident"]
[null,null,null,null,"Coincident"]
[null,null,"WEATHER CORRECTED MD 50% POE","MW","Non-coincident"]
[null,null,null,null,"Coincident"]
[null,null,"WEATHER CORRECTED MD 50% POE","MVA","Non-coincident"]
[null,null,null,null,"Coincident"]
[null,"NSP to enter name","CONNECTION POINT RATING","MVA","Non-coincident"]
[null,null,null,null,"Coincident"]
[null,null,"WINTER/SUMMER PEAKING",null,"Non-coincident"]
[null,null,null,null,"Coincident"]
[null,null,"ADJUSTMENTS - EMBEDDED GENERATION","MW","Non-coincident"]
[null,null,null,null,"Coincident"]
[null,null,"WEATHER CORRECTED MD 10% POE","MW","Non-coincident"]
[null,null,null,null,"Coincident"]
[null,null,"WEATHER CORRECTED MD 10% POE","MVA","Non-coincident"]
[null,null,null,null,"Coincident"]
[null,null,"WEATHER CORRECTED MD 50% POE","MW","Non-coincident"]
[null,null,null,null,"Coincident"]
[null,null,"WEATHER CORRECTED MD 50% POE","MVA","Non-coincident"]
[null,null,null,null,"Coincident"]
[null,"NSP to enter name","CONNECTION POINT RATING","MVA","Non-coincident"]
[null,null,null,null,"Coincident"]
[null,null,"WINTER/SUMMER PEAKING",null,"Non-coincident"]
[null,null,null,null,"Coincident"]
[null,null,"ADJUSTMENTS - EMBEDDED GENERATION","MW","Non-coincident"]
[null,null,null,null,"Coincident"]
[null,null,"WEATHER CORRECTED MD 10% POE","MW","Non-coincident"]
[null,null,null,null,"Coincident"]
[null,null,"WEATHER CORRECTED MD 10% POE","MVA","Non-coincident"]
[null,null,null,null,"Coincident"]
[null,null,"WEATHER CORRECTED MD 50% POE","MW","Non-coincident"]
[null,null,null,null,"Coincident"]
[null,null,"WEATHER CORRECTED MD 50% POE","MVA","Non-coincident"]
[null,null,null,null,"Coincident"]
[null,"NSP to enter name","CONNECTION POINT RATING","MVA","Non-coincident"]
[null,null,null,null,"Coincident"]
[null,null,"WINTER/SUMMER PEAKING",null,"Non-coincident"]
[null,null,null,null,"Coincident"]
[null,null,"ADJUSTMENTS - EMBEDDED GENERATION","MW","Non-coincident"]
[null,null,null,null,"Coincident"]
[null,null,"WEATHER CORRECTED MD 10% POE","MW","Non-coincident"]
[null,null,null,null,"Coincident"]
[null,null,"WEATHER CORRECTED MD 10% POE","MVA","Non-coincident"]
[null,null,null,null,"Coincident"]
[null,null,"WEATHER CORRECTED MD 50% POE","MW","Non-coincident"]
[null,null,null,null,"Coincident"]
[null,null,"WEATHER CORRECTED MD 50% POE","MVA","Non-coincident"]
[null,null,null,null,"Coincident"]
[null,"NSP to enter name","CONNECTION POINT RATING","MVA","Non-coincident"]
[null,null,null,null,"Coincident"]
[null,null,"WINTER/SUMMER PEAKING",null,"Non-coincident"]
[null,null,null,null,"Coincident"]
[null,null,"ADJUSTMENTS - EMBEDDED GENERATION","MW","Non-coincident"]
[null,null,null,null,"Coincident"]
[null,null,"WEATHER CORRECTED MD 10% POE","MW","Non-coincident"]
[null,null,null,null,"Coincident"]
[null,null,"WEATHER CORRECTED MD 10% POE","MVA","Non-coincident"]
[null,null,null,null,"Coincident"]
[null,null,"WEATHER CORRECTED MD 50% POE","MW","Non-coincident"]
[null,null,null,null,"Coincident"]
[null,null,"WEATHER CORRECTED MD 50% POE","MVA","Non-coincident"]
[null,null,null,null,"Coincident"]
[null,"NSP to enter name","CONNECTION POINT RATING","MVA","Non-coincident"]
[null,null,null,null,"Coincident"]
[null,null,"WINTER/SUMMER PEAKING",null,"Non-coincident"]
[null,null,null,null,"Coincident"]
[null,null,"ADJUSTMENTS - EMBEDDED GENERATION","MW","Non-coincident"]
[null,null,null,null,"Coincident"]
[null,null,"WEATHER CORRECTED MD 10% POE","MW","Non-coincident"]
[null,null,null,null,"Coincident"]
[null,null,"WEATHER CORRECTED MD 10% POE","MVA","Non-coincident"]
[null,null,null,null,"Coincident"]
[null,null,"WEATHER CORRECTED MD 50% POE","MW","Non-coincident"]
[null,null,null,null,"Coincident"]
[null,null,"WEATHER CORRECTED MD 50% POE","MVA","Non-coincident"]
[null,null,null,null,"Coincident"]
[null,"NSP to enter name","CONNECTION POINT RATING","MVA","Non-coincident"]
[null,null,null,null,"Coincident"]
[null,null,"WINTER/SUMMER PEAKING",null,"Non-coincident"]
[null,null,null,null,"Coincident"]
[null,null,"ADJUSTMENTS - EMBEDDED GENERATION","MW","Non-coincident"]
[null,null,null,null,"Coincident"]
[null,null,"WEATHER CORRECTED MD 10% POE","MW","Non-coincident"]
[null,null,null,null,"Coincident"]
[null,null,"WEATHER CORRECTED MD 10% POE","MVA","Non-coincident"]
[null,null,null,null,"Coincident"]
[null,null,"WEATHER CORRECTED MD 50% POE","MW","Non-coincident"]
[null,null,null,null,"Coincident"]
[null,null,"WEATHER CORRECTED MD 50% POE","MVA","Non-coincident"]
[null,null,null,null,"Coincident"]
[null,"NSP to enter name","CONNECTION POINT RATING","MVA","Non-coincident"]
[null,null,null,null,"Coincident"]
[null,null,"WINTER/SUMMER PEAKING",null,"Non-coincident"]
[null,null,null,null,"Coincident"]
[null,null,"ADJUSTMENTS - EMBEDDED GENERATION","MW","Non-coincident"]
[null,null,null,null,"Coincident"]
[null,null,"WEATHER CORRECTED MD 10% POE","MW","Non-coincident"]
[null,null,null,null,"Coincident"]
[null,null,"WEATHER CORRECTED MD 10% POE","MVA","Non-coincident"]
[null,null,null,null,"Coincident"]
[null,null,"WEATHER CORRECTED MD 50% POE","MW","Non-coincident"]
[null,null,null,null,"Coincident"]
[null,null,"WEATHER CORRECTED MD 50% POE","MVA","Non-coincident"]
[null,null,null,null,"Coincident"]
[null,"NSP to enter name","CONNECTION POINT RATING","MVA","Non-coincident"]
[null,null,null,null,"Coincident"]
[null,null,"WINTER/SUMMER PEAKING",null,"Non-coincident"]
[null,null,null,null,"Coincident"]
[null,null,"ADJUSTMENTS - EMBEDDED GENERATION","MW","Non-coincident"]
[null,null,null,null,"Coincident"]
[null,null,"WEATHER CORRECTED MD 10% POE","MW","Non-coincident"]
[null,null,null,null,"Coincident"]
[null,null,"WEATHER CORRECTED MD 10% POE","MVA","Non-coincident"]
[null,null,null,null,"Coincident"]
[null,null,"WEATHER CORRECTED MD 50% POE","MW","Non-coincident"]
[null,null,null,null,"Coincident"]
[null,null,"WEATHER CORRECTED MD 50% POE","MVA","Non-coincident"]
[null,null,null,null,"Coincident"]
[null,"NSP to enter name","CONNECTION POINT RATING","MVA","Non-coincident"]
[null,null,null,null,"Coincident"]
[null,null,"WINTER/SUMMER PEAKING",null,"Non-coincident"]
[null,null,null,null,"Coincident"]
[null,null,"ADJUSTMENTS - EMBEDDED GENERATION","MW","Non-coincident"]
[null,null,null,null,"Coincident"]
[null,null,"WEATHER CORRECTED MD 10% POE","MW","Non-coincident"]
[null,null,null,null,"Coincident"]
[null,null,"WEATHER CORRECTED MD 10% POE","MVA","Non-coincident"]
[null,null,null,null,"Coincident"]
[null,null,"WEATHER CORRECTED MD 50% POE","MW","Non-coincident"]
[null,null,null,null,"Coincident"]
[null,null,"WEATHER CORRECTED MD 50% POE","MVA","Non-coincident"]
[null,null,null,null,"Coincident"]
[null,"NSP to enter name","CONNECTION POINT RATING","MVA","Non-coincident"]
[null,null,null,null,"Coincident"]
[null,null,"WINTER/SUMMER PEAKING",null,"Non-coincident"]
[null,null,null,null,"Coincident"]
[null,null,"ADJUSTMENTS - EMBEDDED GENERATION","MW","Non-coincident"]
[null,null,null,null,"Coincident"]
[null,null,"WEATHER CORRECTED MD 10% POE","MW","Non-coincident"]
[null,null,null,null,"Coincident"]
[null,null,"WEATHER CORRECTED MD 10% POE","MVA","Non-coincident"]
[null,null,null,null,"Coincident"]
[null,null,"WEATHER CORRECTED MD 50% POE","MW","Non-coincident"]
[null,null,null,null,"Coincident"]
[null,null,"WEATHER CORRECTED MD 50% POE","MVA","Non-coincident"]
[null,null,null,null,"Coincident"]
[null,"NSP to enter name","CONNECTION POINT RATING","MVA","Non-coincident"]
[null,null,null,null,"Coincident"]
[null,null,"WINTER/SUMMER PEAKING",null,"Non-coincident"]
[null,null,null,null,"Coincident"]
[null,null,"ADJUSTMENTS - EMBEDDED GENERATION","MW","Non-coincident"]
[null,null,null,null,"Coincident"]
[null,null,"WEATHER CORRECTED MD 10% POE","MW","Non-coincident"]
[null,null,null,null,"Coincident"]
[null,null,"WEATHER CORRECTED MD 10% POE","MVA","Non-coincident"]
[null,null,null,null,"Coincident"]
[null,null,"WEATHER CORRECTED MD 50% POE","MW","Non-coincident"]
[null,null,null,null,"Coincident"]
[null,null,"WEATHER CORRECTED MD 50% POE","MVA","Non-coincident"]
[null,null,null,null,"Coincident"]
[null,"NSP to enter name","CONNECTION POINT RATING","MVA","Non-coincident"]
[null,null,null,null,"Coincident"]
[null,null,"WINTER/SUMMER PEAKING",null,"Non-coincident"]
[null,null,null,null,"Coincident"]
[null,null,"ADJUSTMENTS - EMBEDDED GENERATION","MW","Non-coincident"]
[null,null,null,null,"Coincident"]
[null,null,"WEATHER CORRECTED MD 10% POE","MW","Non-coincident"]
[null,null,null,null,"Coincident"]
[null,null,"WEATHER CORRECTED MD 10% POE","MVA","Non-coincident"]
[null,null,null,null,"Coincident"]
[null,null,"WEATHER CORRECTED MD 50% POE","MW","Non-coincident"]
[null,null,null,null,"Coincident"]
[null,null,"WEATHER CORRECTED MD 50% POE","MVA","Non-coincident"]
[null,null,null,null,"Coincident"]
[null,"NSP to enter name","CONNECTION POINT RATING","MVA","Non-coincident"]
[null,null,null,null,"Coincident"]
[null,null,"WINTER/SUMMER PEAKING",null,"Non-coincident"]
[null,null,null,null,"Coincident"]
[null,null,"ADJUSTMENTS - EMBEDDED GENERATION","MW","Non-coincident"]
[null,null,null,null,"Coincident"]
[null,null,"WEATHER CORRECTED MD 10% POE","MW","Non-coincident"]
[null,null,null,null,"Coincident"]
[null,null,"WEATHER CORRECTED MD 10% POE","MVA","Non-coincident"]
[null,null,null,null,"Coincident"]
[null,null,"WEATHER CORRECTED MD 50% POE","MW","Non-coincident"]
[null,null,null,null,"Coincident"]
[null,null,"WEATHER CORRECTED MD 50% POE","MVA","Non-coincident"]
[null,null,null,null,"Coincident"]
[null,"NSP to enter name","CONNECTION POINT RATING","MVA","Non-coincident"]
[null,null,null,null,"Coincident"]
[null,null,"WINTER/SUMMER PEAKING",null,"Non-coincident"]
[null,null,null,null,"Coincident"]
[null,null,"ADJUSTMENTS - EMBEDDED GENERATION","MW","Non-coincident"]
[null,null,null,null,"Coincident"]
[null,null,"WEATHER CORRECTED MD 10% POE","MW","Non-coincident"]
[null,null,null,null,"Coincident"]
[null,null,"WEATHER CORRECTED MD 10% POE","MVA","Non-coincident"]
[null,null,null,null,"Coincident"]
[null,null,"WEATHER CORRECTED MD 50% POE","MW","Non-coincident"]
[null,null,null,null,"Coincident"]
[null,null,"WEATHER CORRECTED MD 50% POE","MVA","Non-coincident"]
[null,null,null,null,"Coincident"]
[null,"NSP to enter name","CONNECTION POINT RATING","MVA","Non-coincident"]
[null,null,null,null,"Coincident"]
[null,null,"WINTER/SUMMER PEAKING",null,"Non-coincident"]
[null,null,null,null,"Coincident"]
[null,null,"ADJUSTMENTS - EMBEDDED GENERATION","MW","Non-coincident"]
[null,null,null,null,"Coincident"]
[null,null,"WEATHER CORRECTED MD 10% POE","MW","Non-coincident"]
[null,null,null,null,"Coincident"]
[null,null,"WEATHER CORRECTED MD 10% POE","MVA","Non-coincident"]
[null,null,null,null,"Coincident"]
[null,null,"WEATHER CORRECTED MD 50% POE","MW","Non-coincident"]
[null,null,null,null,"Coincident"]
[null,null,"WEATHER CORRECTED MD 50% POE","MVA","Non-coincident"]
[null,null,null,null,"Coincident"]
[null,"NSP to enter name","CONNECTION POINT RATING","MVA","Non-coincident"]
[null,null,null,null,"Coincident"]
[null,null,"WINTER/SUMMER PEAKING",null,"Non-coincident"]
[null,null,null,null,"Coincident"]
[null,null,"ADJUSTMENTS - EMBEDDED GENERATION","MW","Non-coincident"]
[null,null,null,null,"Coincident"]
[null,null,"WEATHER CORRECTED MD 10% POE","MW","Non-coincident"]
[null,null,null,null,"Coincident"]
[null,null,"WEATHER CORRECTED MD 10% POE","MVA","Non-coincident"]
[null,null,null,null,"Coincident"]
[null,null,"WEATHER CORRECTED MD 50% POE","MW","Non-coincident"]
[null,null,null,null,"Coincident"]
[null,null,"WEATHER CORRECTED MD 50% POE","MVA","Non-coincident"]
[null,null,null,null,"Coincident"]
[null,"NSP to enter name","CONNECTION POINT RATING","MVA","Non-coincident"]
[null,null,null,null,"Coincident"]
[null,null,"WINTER/SUMMER PEAKING",null,"Non-coincident"]
[null,null,null,null,"Coincident"]
[null,null,"ADJUSTMENTS - EMBEDDED GENERATION","MW","Non-coincident"]
[null,null,null,null,"Coincident"]
[null,null,"WEATHER CORRECTED MD 10% POE","MW","Non-coincident"]
[null,null,null,null,"Coincident"]
[null,null,"WEATHER CORRECTED MD 10% POE","MVA","Non-coincident"]
[null,null,null,null,"Coincident"]
[null,null,"WEATHER CORRECTED MD 50% POE","MW","Non-coincident"]
[null,null,null,null,"Coincident"]
[null,null,"WEATHER CORRECTED MD 50% POE","MVA","Non-coincident"]
[null,null,null,null,"Coincident"]
[null,"NSP to enter name","CONNECTION POINT RATING","MVA","Non-coincident"]
[null,null,null,null,"Coincident"]
[null,null,"WINTER/SUMMER PEAKING",null,"Non-coincident"]
[null,null,null,null,"Coincident"]
[null,null,"ADJUSTMENTS - EMBEDDED GENERATION","MW","Non-coincident"]
[null,null,null,null,"Coincident"]
[null,null,"WEATHER CORRECTED MD 10% POE","MW","Non-coincident"]
[null,null,null,null,"Coincident"]
[null,null,"WEATHER CORRECTED MD 10% POE","MVA","Non-coincident"]
[null,null,null,null,"Coincident"]
[null,null,"WEATHER CORRECTED MD 50% POE","MW","Non-coincident"]
[null,null,null,null,"Coincident"]
[null,null,"WEATHER CORRECTED MD 50% POE","MVA","Non-coincident"]
[null,null,null,null,"Coincident"]
[null,"NSP to enter name","CONNECTION POINT RATING","MVA","Non-coincident"]
[null,null,null,null,"Coincident"]
[null,null,"WINTER/SUMMER PEAKING",null,"Non-coincident"]
[null,null,null,null,"Coincident"]
[null,null,"ADJUSTMENTS - EMBEDDED GENERATION","MW","Non-coincident"]
[null,null,null,null,"Coincident"]
[null,null,"WEATHER CORRECTED MD 10% POE","MW","Non-coincident"]
[null,null,null,null,"Coincident"]
[null,null,"WEATHER CORRECTED MD 10% POE","MVA","Non-coincident"]
[null,null,null,null,"Coincident"]
[null,null,"WEATHER CORRECTED MD 50% POE","MW","Non-coincident"]
[null,null,null,null,"Coincident"]
[null,null,"WEATHER CORRECTED MD 50% POE","MVA","Non-coincident"]
[null,null,null,null,"Coincident"]
[null,"NSP to enter name","CONNECTION POINT RATING","MVA","Non-coincident"]
[null,null,null,null,"Coincident"]
[null,null,"WINTER/SUMMER PEAKING",null,"Non-coincident"]
[null,null,null,null,"Coincident"]
[null,null,"ADJUSTMENTS - EMBEDDED GENERATION","MW","Non-coincident"]
[null,null,null,null,"Coincident"]
[null,null,"WEATHER CORRECTED MD 10% POE","MW","Non-coincident"]
[null,null,null,null,"Coincident"]
[null,null,"WEATHER CORRECTED MD 10% POE","MVA","Non-coincident"]
[null,null,null,null,"Coincident"]
[null,null,"WEATHER CORRECTED MD 50% POE","MW","Non-coincident"]
[null,null,null,null,"Coincident"]
[null,null,"WEATHER CORRECTED MD 50% POE","MVA","Non-coincident"]
[null,null,null,null,"Coincident"]
[null,"NSP to enter name","CONNECTION POINT RATING","MVA","Non-coincident"]
[null,null,null,null,"Coincident"]
[null,null,"WINTER/SUMMER PEAKING",null,"Non-coincident"]
[null,null,null,null,"Coincident"]
[null,null,"ADJUSTMENTS - EMBEDDED GENERATION","MW","Non-coincident"]
[null,null,null,null,"Coincident"]
[null,null,"WEATHER CORRECTED MD 10% POE","MW","Non-coincident"]
[null,null,null,null,"Coincident"]
[null,null,"WEATHER CORRECTED MD 10% POE","MVA","Non-coincident"]
[null,null,null,null,"Coincident"]
[null,null,"WEATHER CORRECTED MD 50% POE","MW","Non-coincident"]
[null,null,null,null,"Coincident"]
[null,null,"WEATHER CORRECTED MD 50% POE","MVA","Non-coincident"]
[null,null,null,null,"Coincident"]
[null,"NSP to enter name","CONNECTION POINT RATING","MVA","Non-coincident"]
[null,null,null,null,"Coincident"]
[null,null,"WINTER/SUMMER PEAKING",null,"Non-coincident"]
[null,null,null,null,"Coincident"]
[null,null,"ADJUSTMENTS - EMBEDDED GENERATION","MW","Non-coincident"]
[null,null,null,null,"Coincident"]
[null,null,"WEATHER CORRECTED MD 10% POE","MW","Non-coincident"]
[null,null,null,null,"Coincident"]
[null,null,"WEATHER CORRECTED MD 10% POE","MVA","Non-coincident"]
[null,null,null,null,"Coincident"]
[null,null,"WEATHER CORRECTED MD 50% POE","MW","Non-coincident"]
[null,null,null,null,"Coincident"]
[null,null,"WEATHER CORRECTED MD 50% POE","MVA","Non-coincident"]
[null,null,null,null,"Coincident"]
[null,"NSP to enter name","CONNECTION POINT RATING","MVA","Non-coincident"]
[null,null,null,null,"Coincident"]
[null,null,"WINTER/SUMMER PEAKING",null,"Non-coincident"]
[null,null,null,null,"Coincident"]
[null,null,"ADJUSTMENTS - EMBEDDED GENERATION","MW","Non-coincident"]
[null,null,null,null,"Coincident"]
[null,null,"WEATHER CORRECTED MD 10% POE","MW","Non-coincident"]
[null,null,null,null,"Coincident"]
[null,null,"WEATHER CORRECTED MD 10% POE","MVA","Non-coincident"]
[null,null,null,null,"Coincident"]
[null,null,"WEATHER CORRECTED MD 50% POE","MW","Non-coincident"]
[null,null,null,null,"Coincident"]
[null,null,"WEATHER CORRECTED MD 50% POE","MVA","Non-coincident"]
[null,null,null,null,"Coincident"]
[null,"NSP to enter name","CONNECTION POINT RATING","MVA","Non-coincident"]
[null,null,null,null,"Coincident"]
[null,null,"WINTER/SUMMER PEAKING",null,"Non-coincident"]
[null,null,null,null,"Coincident"]
[null,null,"ADJUSTMENTS - EMBEDDED GENERATION","MW","Non-coincident"]
[null,null,null,null,"Coincident"]
[null,null,"WEATHER CORRECTED MD 10% POE","MW","Non-coincident"]
[null,null,null,null,"Coincident"]
[null,null,"WEATHER CORRECTED MD 10% POE","MVA","Non-coincident"]
[null,null,null,null,"Coincident"]
[null,null,"WEATHER CORRECTED MD 50% POE","MW","Non-coincident"]
[null,null,null,null,"Coincident"]
[null,null,"WEATHER CORRECTED MD 50% POE","MVA","Non-coincident"]
[null,null,null,null,"Coincident"]
[null,"NSP to enter name","CONNECTION POINT RATING","MVA","Non-coincident"]
[null,null,null,null,"Coincident"]
[null,null,"WINTER/SUMMER PEAKING",null,"Non-coincident"]
[null,null,null,null,"Coincident"]
[null,null,"ADJUSTMENTS - EMBEDDED GENERATION","MW","Non-coincident"]
[null,null,null,null,"Coincident"]
[null,null,"WEATHER CORRECTED MD 10% POE","MW","Non-coincident"]
[null,null,null,null,"Coincident"]
[null,null,"WEATHER CORRECTED MD 10% POE","MVA","Non-coincident"]
[null,null,null,null,"Coincident"]
[null,null,"WEATHER CORRECTED MD 50% POE","MW","Non-coincident"]
[null,null,null,null,"Coincident"]
[null,null,"WEATHER CORRECTED MD 50% POE","MVA","Non-coincident"]
[null,null,null,null,"Coincident"]
[null,"NSP to enter name","CONNECTION POINT RATING","MVA","Non-coincident"]
[null,null,null,null,"Coincident"]
[null,null,"WINTER/SUMMER PEAKING",null,"Non-coincident"]
[null,null,null,null,"Coincident"]
[null,null,"ADJUSTMENTS - EMBEDDED GENERATION","MW","Non-coincident"]
[null,null,null,null,"Coincident"]
[null,null,"WEATHER CORRECTED MD 10% POE","MW","Non-coincident"]
[null,null,null,null,"Coincident"]
[null,null,"WEATHER CORRECTED MD 10% POE","MVA","Non-coincident"]
[null,null,null,null,"Coincident"]
[null,null,"WEATHER CORRECTED MD 50% POE","MW","Non-coincident"]
[null,null,null,null,"Coincident"]
[null,null,"WEATHER CORRECTED MD 50% POE","MVA","Non-coincident"]
[null,null,null,null,"Coincident"]
[null,"NSP to enter name","CONNECTION POINT RATING","MVA","Non-coincident"]
[null,null,null,null,"Coincident"]
[null,null,"WINTER/SUMMER PEAKING",null,"Non-coincident"]
[null,null,null,null,"Coincident"]
[null,null,"ADJUSTMENTS - EMBEDDED GENERATION","MW","Non-coincident"]
[null,null,null,null,"Coincident"]
[null,null,"WEATHER CORRECTED MD 10% POE","MW","Non-coincident"]
[null,null,null,null,"Coincident"]
[null,null,"WEATHER CORRECTED MD 10% POE","MVA","Non-coincident"]
[null,null,null,null,"Coincident"]
[null,null,"WEATHER CORRECTED MD 50% POE","MW","Non-coincident"]
[null,null,null,null,"Coincident"]
[null,null,"WEATHER CORRECTED MD 50% POE","MVA","Non-coincident"]
[null,null,null,null,"Coincident"]
[null,"NSP to enter name","CONNECTION POINT RATING","MVA","Non-coincident"]
[null,null,null,null,"Coincident"]
[null,null,"WINTER/SUMMER PEAKING",null,"Non-coincident"]
[null,null,null,null,"Coincident"]
[null,null,"ADJUSTMENTS - EMBEDDED GENERATION","MW","Non-coincident"]
[null,null,null,null,"Coincident"]
[null,null,"WEATHER CORRECTED MD 10% POE","MW","Non-coincident"]
[null,null,null,null,"Coincident"]
[null,null,"WEATHER CORRECTED MD 10% POE","MVA","Non-coincident"]
[null,null,null,null,"Coincident"]
[null,null,"WEATHER CORRECTED MD 50% POE","MW","Non-coincident"]
[null,null,null,null,"Coincident"]
[null,null,"WEATHER CORRECTED MD 50% POE","MVA","Non-coincident"]
[null,null,null,null,"Coincident"]
[null,"NSP to enter name","CONNECTION POINT RATING","MVA","Non-coincident"]
[null,null,null,null,"Coincident"]
[null,null,"WINTER/SUMMER PEAKING",null,"Non-coincident"]
[null,null,null,null,"Coincident"]
[null,null,"ADJUSTMENTS - EMBEDDED GENERATION","MW","Non-coincident"]
[null,null,null,null,"Coincident"]
[null,null,"WEATHER CORRECTED MD 10% POE","MW","Non-coincident"]
[null,null,null,null,"Coincident"]
[null,null,"WEATHER CORRECTED MD 10% POE","MVA","Non-coincident"]
[null,null,null,null,"Coincident"]
[null,null,"WEATHER CORRECTED MD 50% POE","MW","Non-coincident"]
[null,null,null,null,"Coincident"]
[null,null,"WEATHER CORRECTED MD 50% POE","MVA","Non-coincident"]
[null,null,null,null,"Coincident"]
[null,"NSP to enter name","CONNECTION POINT RATING","MVA","Non-coincident"]
[null,null,null,null,"Coincident"]
[null,null,"WINTER/SUMMER PEAKING",null,"Non-coincident"]
[null,null,null,null,"Coincident"]
[null,null,"ADJUSTMENTS - EMBEDDED GENERATION","MW","Non-coincident"]
[null,null,null,null,"Coincident"]
[null,null,"WEATHER CORRECTED MD 10% POE","MW","Non-coincident"]
[null,null,null,null,"Coincident"]
[null,null,"WEATHER CORRECTED MD 10% POE","MVA","Non-coincident"]
[null,null,null,null,"Coincident"]
[null,null,"WEATHER CORRECTED MD 50% POE","MW","Non-coincident"]
[null,null,null,null,"Coincident"]
[null,null,"WEATHER CORRECTED MD 50% POE","MVA","Non-coincident"]
[null,null,null,null,"Coincident"]
[null,"NSP to enter name","CONNECTION POINT RATING","MVA","Non-coincident"]
[null,null,null,null,"Coincident"]
[null,null,"WINTER/SUMMER PEAKING",null,"Non-coincident"]
[null,null,null,null,"Coincident"]
[null,null,"ADJUSTMENTS - EMBEDDED GENERATION","MW","Non-coincident"]
[null,null,null,null,"Coincident"]
[null,null,"WEATHER CORRECTED MD 10% POE","MW","Non-coincident"]
[null,null,null,null,"Coincident"]
[null,null,"WEATHER CORRECTED MD 10% POE","MVA","Non-coincident"]
[null,null,null,null,"Coincident"]
[null,null,"WEATHER CORRECTED MD 50% POE","MW","Non-coincident"]
[null,null,null,null,"Coincident"]
[null,null,"WEATHER CORRECTED MD 50% POE","MVA","Non-coincident"]
[null,null,null,null,"Coincident"]
[null,"NSP to enter name","CONNECTION POINT RATING","MVA","Non-coincident"]
[null,null,null,null,"Coincident"]
[null,null,"WINTER/SUMMER PEAKING",null,"Non-coincident"]
[null,null,null,null,"Coincident"]
[null,null,"ADJUSTMENTS - EMBEDDED GENERATION","MW","Non-coincident"]
[null,null,null,null,"Coincident"]
[null,null,"WEATHER CORRECTED MD 10% POE","MW","Non-coincident"]
[null,null,null,null,"Coincident"]
[null,null,"WEATHER CORRECTED MD 10% POE","MVA","Non-coincident"]
[null,null,null,null,"Coincident"]
[null,null,"WEATHER CORRECTED MD 50% POE","MW","Non-coincident"]
[null,null,null,null,"Coincident"]
[null,null,"WEATHER CORRECTED MD 50% POE","MVA","Non-coincident"]
[null,null,null,null,"Coincident"]
[null,"NSP to enter name","CONNECTION POINT RATING","MVA","Non-coincident"]
[null,null,null,null,"Coincident"]
[null,null,"WINTER/SUMMER PEAKING",null,"Non-coincident"]
[null,null,null,null,"Coincident"]
[null,null,"ADJUSTMENTS - EMBEDDED GENERATION","MW","Non-coincident"]
[null,null,null,null,"Coincident"]
[null,null,"WEATHER CORRECTED MD 10% POE","MW","Non-coincident"]
[null,null,null,null,"Coincident"]
[null,null,"WEATHER CORRECTED MD 10% POE","MVA","Non-coincident"]
[null,null,null,null,"Coincident"]
[null,null,"WEATHER CORRECTED MD 50% POE","MW","Non-coincident"]
[null,null,null,null,"Coincident"]
[null,null,"WEATHER CORRECTED MD 50% POE","MVA","Non-coincident"]
[null,null,null,null,"Coincident"]
[null,"NSP to enter name","CONNECTION POINT RATING","MVA","Non-coincident"]
[null,null,null,null,"Coincident"]
[null,null,"WINTER/SUMMER PEAKING",null,"Non-coincident"]
[null,null,null,null,"Coincident"]
[null,null,"ADJUSTMENTS - EMBEDDED GENERATION","MW","Non-coincident"]
[null,null,null,null,"Coincident"]
[null,null,"WEATHER CORRECTED MD 10% POE","MW","Non-coincident"]
[null,null,null,null,"Coincident"]
[null,null,"WEATHER CORRECTED MD 10% POE","MVA","Non-coincident"]
[null,null,null,null,"Coincident"]
[null,null,"WEATHER CORRECTED MD 50% POE","MW","Non-coincident"]
[null,null,null,null,"Coincident"]
[null,null,"WEATHER CORRECTED MD 50% POE","MVA","Non-coincident"]
[null,null,null,null,"Coincident"]
[null,"NSP to enter name","CONNECTION POINT RATING","MVA","Non-coincident"]
[null,null,null,null,"Coincident"]
[null,null,"WINTER/SUMMER PEAKING",null,"Non-coincident"]
[null,null,null,null,"Coincident"]
[null,null,"ADJUSTMENTS - EMBEDDED GENERATION","MW","Non-coincident"]
[null,null,null,null,"Coincident"]
[null,null,"WEATHER CORRECTED MD 10% POE","MW","Non-coincident"]
[null,null,null,null,"Coincident"]
[null,null,"WEATHER CORRECTED MD 10% POE","MVA","Non-coincident"]
[null,null,null,null,"Coincident"]
[null,null,"WEATHER CORRECTED MD 50% POE","MW","Non-coincident"]
[null,null,null,null,"Coincident"]
[null,null,"WEATHER CORRECTED MD 50% POE","MVA","Non-coincident"]
[null,null,null,null,"Coincident"]
[null,"NSP to enter name","CONNECTION POINT RATING","MVA","Non-coincident"]
[null,null,null,null,"Coincident"]
[null,null,"WINTER/SUMMER PEAKING",null,"Non-coincident"]
[null,null,null,null,"Coincident"]
[null,null,"ADJUSTMENTS - EMBEDDED GENERATION","MW","Non-coincident"]
[null,null,null,null,"Coincident"]
[null,null,"WEATHER CORRECTED MD 10% POE","MW","Non-coincident"]
[null,null,null,null,"Coincident"]
[null,null,"WEATHER CORRECTED MD 10% POE","MVA","Non-coincident"]
[null,null,null,null,"Coincident"]
[null,null,"WEATHER CORRECTED MD 50% POE","MW","Non-coincident"]
[null,null,null,null,"Coincident"]
[null,null,"WEATHER CORRECTED MD 50% POE","MVA","Non-coincident"]
[null,null,null,null,"Coincident"]
[null,"NSP to enter name","CONNECTION POINT RATING","MVA","Non-coincident"]
[null,null,null,null,"Coincident"]
[null,null,"WINTER/SUMMER PEAKING",null,"Non-coincident"]
[null,null,null,null,"Coincident"]
[null,null,"ADJUSTMENTS - EMBEDDED GENERATION","MW","Non-coincident"]
[null,null,null,null,"Coincident"]
[null,null,"WEATHER CORRECTED MD 10% POE","MW","Non-coincident"]
[null,null,null,null,"Coincident"]
[null,null,"WEATHER CORRECTED MD 10% POE","MVA","Non-coincident"]
[null,null,null,null,"Coincident"]
[null,null,"WEATHER CORRECTED MD 50% POE","MW","Non-coincident"]
[null,null,null,null,"Coincident"]
[null,null,"WEATHER CORRECTED MD 50% POE","MVA","Non-coincident"]
[null,null,null,null,"Coincident"]
[null,"NSP to enter name","CONNECTION POINT RATING","MVA","Non-coincident"]
[null,null,null,null,"Coincident"]
[null,null,"WINTER/SUMMER PEAKING",null,"Non-coincident"]
[null,null,null,null,"Coincident"]
[null,null,"ADJUSTMENTS - EMBEDDED GENERATION","MW","Non-coincident"]
[null,null,null,null,"Coincident"]
[null,null,"WEATHER CORRECTED MD 10% POE","MW","Non-coincident"]
[null,null,null,null,"Coincident"]
[null,null,"WEATHER CORRECTED MD 10% POE","MVA","Non-coincident"]
[null,null,null,null,"Coincident"]
[null,null,"WEATHER CORRECTED MD 50% POE","MW","Non-coincident"]
[null,null,null,null,"Coincident"]
[null,null,"WEATHER CORRECTED MD 50% POE","MVA","Non-coincident"]
[null,null,null,null,"Coincident"]
[null,"NSP to enter name","CONNECTION POINT RATING","MVA","Non-coincident"]
[null,null,null,null,"Coincident"]
[null,null,"WINTER/SUMMER PEAKING",null,"Non-coincident"]
[null,null,null,null,"Coincident"]
[null,null,"ADJUSTMENTS - EMBEDDED GENERATION","MW","Non-coincident"]
[null,null,null,null,"Coincident"]
[null,null,"WEATHER CORRECTED MD 10% POE","MW","Non-coincident"]
[null,null,null,null,"Coincident"]
[null,null,"WEATHER CORRECTED MD 10% POE","MVA","Non-coincident"]
[null,null,null,null,"Coincident"]
[null,null,"WEATHER CORRECTED MD 50% POE","MW","Non-coincident"]
[null,null,null,null,"Coincident"]
[null,null,"WEATHER CORRECTED MD 50% POE","MVA","Non-coincident"]
[null,null,null,null,"Coincident"]
[null,"NSP to enter name","CONNECTION POINT RATING","MVA","Non-coincident"]
[null,null,null,null,"Coincident"]
[null,null,"WINTER/SUMMER PEAKING",null,"Non-coincident"]
[null,null,null,null,"Coincident"]
[null,null,"ADJUSTMENTS - EMBEDDED GENERATION","MW","Non-coincident"]
[null,null,null,null,"Coincident"]
[null,null,"WEATHER CORRECTED MD 10% POE","MW","Non-coincident"]
[null,null,null,null,"Coincident"]
[null,null,"WEATHER CORRECTED MD 10% POE","MVA","Non-coincident"]
[null,null,null,null,"Coincident"]
[null,null,"WEATHER CORRECTED MD 50% POE","MW","Non-coincident"]
[null,null,null,null,"Coincident"]
[null,null,"WEATHER CORRECTED MD 50% POE","MVA","Non-coincident"]
[null,null,null,null,"Coincident"]
[null,"NSP to enter name","CONNECTION POINT RATING","MVA","Non-coincident"]
[null,null,null,null,"Coincident"]
[null,null,"WINTER/SUMMER PEAKING",null,"Non-coincident"]
[null,null,null,null,"Coincident"]
[null,null,"ADJUSTMENTS - EMBEDDED GENERATION","MW","Non-coincident"]
[null,null,null,null,"Coincident"]
[null,null,"WEATHER CORRECTED MD 10% POE","MW","Non-coincident"]
[null,null,null,null,"Coincident"]
[null,null,"WEATHER CORRECTED MD 10% POE","MVA","Non-coincident"]
[null,null,null,null,"Coincident"]
[null,null,"WEATHER CORRECTED MD 50% POE","MW","Non-coincident"]
[null,null,null,null,"Coincident"]
[null,null,"WEATHER CORRECTED MD 50% POE","MVA","Non-coincident"]
[null,null,null,null,"Coincident"]
[null,"NSP to enter name","CONNECTION POINT RATING","MVA","Non-coincident"]
[null,null,null,null,"Coincident"]
[null,null,"WINTER/SUMMER PEAKING",null,"Non-coincident"]
[null,null,null,null,"Coincident"]
[null,null,"ADJUSTMENTS - EMBEDDED GENERATION","MW","Non-coincident"]
[null,null,null,null,"Coincident"]
[null,null,"WEATHER CORRECTED MD 10% POE","MW","Non-coincident"]
[null,null,null,null,"Coincident"]
[null,null,"WEATHER CORRECTED MD 10% POE","MVA","Non-coincident"]
[null,null,null,null,"Coincident"]
[null,null,"WEATHER CORRECTED MD 50% POE","MW","Non-coincident"]
[null,null,null,null,"Coincident"]
[null,null,"WEATHER CORRECTED MD 50% POE","MVA","Non-coincident"]
[null,null,null,null,"Coincident"]
[null,"NSP to enter name","CONNECTION POINT RATING","MVA","Non-coincident"]
[null,null,null,null,"Coincident"]
[null,null,"WINTER/SUMMER PEAKING",null,"Non-coincident"]
[null,null,null,null,"Coincident"]
[null,null,"ADJUSTMENTS - EMBEDDED GENERATION","MW","Non-coincident"]
[null,null,null,null,"Coincident"]
[null,null,"WEATHER CORRECTED MD 10% POE","MW","Non-coincident"]
[null,null,null,null,"Coincident"]
[null,null,"WEATHER CORRECTED MD 10% POE","MVA","Non-coincident"]
[null,null,null,null,"Coincident"]
[null,null,"WEATHER CORRECTED MD 50% POE","MW","Non-coincident"]
[null,null,null,null,"Coincident"]
[null,null,"WEATHER CORRECTED MD 50% POE","MVA","Non-coincident"]
[null,null,null,null,"Coincident"]
[null,"NSP to enter name","CONNECTION POINT RATING","MVA","Non-coincident"]
[null,null,null,null,"Coincident"]
[null,null,"WINTER/SUMMER PEAKING",null,"Non-coincident"]
[null,null,null,null,"Coincident"]
[null,null,"ADJUSTMENTS - EMBEDDED GENERATION","MW","Non-coincident"]
[null,null,null,null,"Coincident"]
[null,null,"WEATHER CORRECTED MD 10% POE","MW","Non-coincident"]
[null,null,null,null,"Coincident"]
[null,null,"WEATHER CORRECTED MD 10% POE","MVA","Non-coincident"]
[null,null,null,null,"Coincident"]
[null,null,"WEATHER CORRECTED MD 50% POE","MW","Non-coincident"]
[null,null,null,null,"Coincident"]
[null,null,"WEATHER CORRECTED MD 50% POE","MVA","Non-coincident"]
[null,null,null,null,"Coincident"]
[null,"NSP to enter name","CONNECTION POINT RATING","MVA","Non-coincident"]
[null,null,null,null,"Coincident"]
[null,null,"WINTER/SUMMER PEAKING",null,"Non-coincident"]
[null,null,null,null,"Coincident"]
[null,null,"ADJUSTMENTS - EMBEDDED GENERATION","MW","Non-coincident"]
[null,null,null,null,"Coincident"]
[null,null,"WEATHER CORRECTED MD 10% POE","MW","Non-coincident"]
[null,null,null,null,"Coincident"]
[null,null,"WEATHER CORRECTED MD 10% POE","MVA","Non-coincident"]
[null,null,null,null,"Coincident"]
[null,null,"WEATHER CORRECTED MD 50% POE","MW","Non-coincident"]
[null,null,null,null,"Coincident"]
[null,null,"WEATHER CORRECTED MD 50% POE","MVA","Non-coincident"]
[null,null,null,null,"Coincident"]
[null,"NSP to enter name","CONNECTION POINT RATING","MVA","Non-coincident"]
[null,null,null,null,"Coincident"]
[null,null,"WINTER/SUMMER PEAKING",null,"Non-coincident"]
[null,null,null,null,"Coincident"]
[null,null,"ADJUSTMENTS - EMBEDDED GENERATION","MW","Non-coincident"]
[null,null,null,null,"Coincident"]
[null,null,"WEATHER CORRECTED MD 10% POE","MW","Non-coincident"]
[null,null,null,null,"Coincident"]
[null,null,"WEATHER CORRECTED MD 10% POE","MVA","Non-coincident"]
[null,null,null,null,"Coincident"]
[null,null,"WEATHER CORRECTED MD 50% POE","MW","Non-coincident"]
[null,null,null,null,"Coincident"]
[null,null,"WEATHER CORRECTED MD 50% POE","MVA","Non-coincident"]
[null,null,null,null,"Coincident"]
[null,"NSP to enter name","CONNECTION POINT RATING","MVA","Non-coincident"]
[null,null,null,null,"Coincident"]
[null,null,"WINTER/SUMMER PEAKING",null,"Non-coincident"]
[null,null,null,null,"Coincident"]
[null,null,"ADJUSTMENTS - EMBEDDED GENERATION","MW","Non-coincident"]
[null,null,null,null,"Coincident"]
[null,null,"WEATHER CORRECTED MD 10% POE","MW","Non-coincident"]
[null,null,null,null,"Coincident"]
[null,null,"WEATHER CORRECTED MD 10% POE","MVA","Non-coincident"]
[null,null,null,null,"Coincident"]
[null,null,"WEATHER CORRECTED MD 50% POE","MW","Non-coincident"]
[null,null,null,null,"Coincident"]
[null,null,"WEATHER CORRECTED MD 50% POE","MVA","Non-coincident"]
[null,null,null,null,"Coincident"]
[null,"NSP to enter name","CONNECTION POINT RATING","MVA","Non-coincident"]
[null,null,null,null,"Coincident"]
[null,null,"WINTER/SUMMER PEAKING",null,"Non-coincident"]
[null,null,null,null,"Coincident"]
[null,null,"ADJUSTMENTS - EMBEDDED GENERATION","MW","Non-coincident"]
[null,null,null,null,"Coincident"]
[null,null,"WEATHER CORRECTED MD 10% POE","MW","Non-coincident"]
[null,null,null,null,"Coincident"]
[null,null,"WEATHER CORRECTED MD 10% POE","MVA","Non-coincident"]
[null,null,null,null,"Coincident"]
[null,null,"WEATHER CORRECTED MD 50% POE","MW","Non-coincident"]
[null,null,null,null,"Coincident"]
[null,null,"WEATHER CORRECTED MD 50% POE","MVA","Non-coincident"]
[null,null,null,null,"Coincident"]
[null,"NSP to enter name","CONNECTION POINT RATING","MVA","Non-coincident"]
[null,null,null,null,"Coincident"]
[null,null,"WINTER/SUMMER PEAKING",null,"Non-coincident"]
[null,null,null,null,"Coincident"]
[null,null,"ADJUSTMENTS - EMBEDDED GENERATION","MW","Non-coincident"]
[null,null,null,null,"Coincident"]
[null,null,"WEATHER CORRECTED MD 10% POE","MW","Non-coincident"]
[null,null,null,null,"Coincident"]
[null,null,"WEATHER CORRECTED MD 10% POE","MVA","Non-coincident"]
[null,null,null,null,"Coincident"]
[null,null,"WEATHER CORRECTED MD 50% POE","MW","Non-coincident"]
[null,null,null,null,"Coincident"]
[null,null,"WEATHER CORRECTED MD 50% POE","MVA","Non-coincident"]
[null,null,null,null,"Coincident"]
[null,"NSP to enter name","CONNECTION POINT RATING","MVA","Non-coincident"]
[null,null,null,null,"Coincident"]
[null,null,"WINTER/SUMMER PEAKING",null,"Non-coincident"]
[null,null,null,null,"Coincident"]
[null,null,"ADJUSTMENTS - EMBEDDED GENERATION","MW","Non-coincident"]
[null,null,null,null,"Coincident"]
[null,null,"WEATHER CORRECTED MD 10% POE","MW","Non-coincident"]
[null,null,null,null,"Coincident"]
[null,null,"WEATHER CORRECTED MD 10% POE","MVA","Non-coincident"]
[null,null,null,null,"Coincident"]
[null,null,"WEATHER CORRECTED MD 50% POE","MW","Non-coincident"]
[null,null,null,null,"Coincident"]
[null,null,"WEATHER CORRECTED MD 50% POE","MVA","Non-coincident"]
[null,null,null,null,"Coincident"]
[null,"NSP to enter name","CONNECTION POINT RATING","MVA","Non-coincident"]
[null,null,null,null,"Coincident"]
[null,null,"WINTER/SUMMER PEAKING",null,"Non-coincident"]
[null,null,null,null,"Coincident"]
[null,null,"ADJUSTMENTS - EMBEDDED GENERATION","MW","Non-coincident"]
[null,null,null,null,"Coincident"]
[null,null,"WEATHER CORRECTED MD 10% POE","MW","Non-coincident"]
[null,null,null,null,"Coincident"]
[null,null,"WEATHER CORRECTED MD 10% POE","MVA","Non-coincident"]
[null,null,null,null,"Coincident"]
[null,null,"WEATHER CORRECTED MD 50% POE","MW","Non-coincident"]
[null,null,null,null,"Coincident"]
[null,null,"WEATHER CORRECTED MD 50% POE","MVA","Non-coincident"]
[null,null,null,null,"Coincident"]
[null,"NSP to enter name","CONNECTION POINT RATING","MVA","Non-coincident"]
[null,null,null,null,"Coincident"]
[null,null,"WINTER/SUMMER PEAKING",null,"Non-coincident"]
[null,null,null,null,"Coincident"]
[null,null,"ADJUSTMENTS - EMBEDDED GENERATION","MW","Non-coincident"]
[null,null,null,null,"Coincident"]
[null,null,"WEATHER CORRECTED MD 10% POE","MW","Non-coincident"]
[null,null,null,null,"Coincident"]
[null,null,"WEATHER CORRECTED MD 10% POE","MVA","Non-coincident"]
[null,null,null,null,"Coincident"]
[null,null,"WEATHER CORRECTED MD 50% POE","MW","Non-coincident"]
[null,null,null,null,"Coincident"]
[null,null,"WEATHER CORRECTED MD 50% POE","MVA","Non-coincident"]
[null,null,null,null,"Coincident"]
[null,"NSP to enter name","CONNECTION POINT RATING","MVA","Non-coincident"]
[null,null,null,null,"Coincident"]
[null,null,"WINTER/SUMMER PEAKING",null,"Non-coincident"]
[null,null,null,null,"Coincident"]
[null,null,"ADJUSTMENTS - EMBEDDED GENERATION","MW","Non-coincident"]
[null,null,null,null,"Coincident"]
[null,null,"WEATHER CORRECTED MD 10% POE","MW","Non-coincident"]
[null,null,null,null,"Coincident"]
[null,null,"WEATHER CORRECTED MD 10% POE","MVA","Non-coincident"]
[null,null,null,null,"Coincident"]
[null,null,"WEATHER CORRECTED MD 50% POE","MW","Non-coincident"]
[null,null,null,null,"Coincident"]
[null,null,"WEATHER CORRECTED MD 50% POE","MVA","Non-coincident"]
[null,null,null,null,"Coincident"]
[null,"NSP to enter name","CONNECTION POINT RATING","MVA","Non-coincident"]
[null,null,null,null,"Coincident"]
[null,null,"WINTER/SUMMER PEAKING",null,"Non-coincident"]
[null,null,null,null,"Coincident"]
[null,null,"ADJUSTMENTS - EMBEDDED GENERATION","MW","Non-coincident"]
[null,null,null,null,"Coincident"]
[null,null,"WEATHER CORRECTED MD 10% POE","MW","Non-coincident"]
[null,null,null,null,"Coincident"]
[null,null,"WEATHER CORRECTED MD 10% POE","MVA","Non-coincident"]
[null,null,null,null,"Coincident"]
[null,null,"WEATHER CORRECTED MD 50% POE","MW","Non-coincident"]
[null,null,null,null,"Coincident"]
[null,null,"WEATHER CORRECTED MD 50% POE","MVA","Non-coincident"]
[null,null,null,null,"Coincident"]
[null,"NSP to enter name","CONNECTION POINT RATING","MVA","Non-coincident"]
[null,null,null,null,"Coincident"]
[null,null,"WINTER/SUMMER PEAKING",null,"Non-coincident"]
[null,null,null,null,"Coincident"]
[null,null,"ADJUSTMENTS - EMBEDDED GENERATION","MW","Non-coincident"]
[null,null,null,null,"Coincident"]
[null,null,"WEATHER CORRECTED MD 10% POE","MW","Non-coincident"]
[null,null,null,null,"Coincident"]
[null,null,"WEATHER CORRECTED MD 10% POE","MVA","Non-coincident"]
[null,null,null,null,"Coincident"]
[null,null,"WEATHER CORRECTED MD 50% POE","MW","Non-coincident"]
[null,null,null,null,"Coincident"]
[null,null,"WEATHER CORRECTED MD 50% POE","MVA","Non-coincident"]
[null,null,null,null,"Coincident"]
[null,"NSP to enter name","CONNECTION POINT RATING","MVA","Non-coincident"]
[null,null,null,null,"Coincident"]
[null,null,"WINTER/SUMMER PEAKING",null,"Non-coincident"]
[null,null,null,null,"Coincident"]
[null,null,"ADJUSTMENTS - EMBEDDED GENERATION","MW","Non-coincident"]
[null,null,null,null,"Coincident"]
[null,null,"WEATHER CORRECTED MD 10% POE","MW","Non-coincident"]
[null,null,null,null,"Coincident"]
[null,null,"WEATHER CORRECTED MD 10% POE","MVA","Non-coincident"]
[null,null,null,null,"Coincident"]
[null,null,"WEATHER CORRECTED MD 50% POE","MW","Non-coincident"]
[null,null,null,null,"Coincident"]
[null,null,"WEATHER CORRECTED MD 50% POE","MVA","Non-coincident"]
[null,null,null,null,"Coincident"]
[null,"NSP to enter name","CONNECTION POINT RATING","MVA","Non-coincident"]
[null,null,null,null,"Coincident"]
[null,null,"WINTER/SUMMER PEAKING",null,"Non-coincident"]
[null,null,null,null,"Coincident"]
[null,null,"ADJUSTMENTS - EMBEDDED GENERATION","MW","Non-coincident"]
[null,null,null,null,"Coincident"]
[null,null,"WEATHER CORRECTED MD 10% POE","MW","Non-coincident"]
[null,null,null,null,"Coincident"]
[null,null,"WEATHER CORRECTED MD 10% POE","MVA","Non-coincident"]
[null,null,null,null,"Coincident"]
[null,null,"WEATHER CORRECTED MD 50% POE","MW","Non-coincident"]
[null,null,null,null,"Coincident"]
[null,null,"WEATHER CORRECTED MD 50% POE","MVA","Non-coincident"]
[null,null,null,null,"Coincident"]
[null,"NSP to enter name","CONNECTION POINT RATING","MVA","Non-coincident"]
[null,null,null,null,"Coincident"]
[null,null,"WINTER/SUMMER PEAKING",null,"Non-coincident"]
[null,null,null,null,"Coincident"]
[null,null,"ADJUSTMENTS - EMBEDDED GENERATION","MW","Non-coincident"]
[null,null,null,null,"Coincident"]
[null,null,"WEATHER CORRECTED MD 10% POE","MW","Non-coincident"]
[null,null,null,null,"Coincident"]
[null,null,"WEATHER CORRECTED MD 10% POE","MVA","Non-coincident"]
[null,null,null,null,"Coincident"]
[null,null,"WEATHER CORRECTED MD 50% POE","MW","Non-coincident"]
[null,null,null,null,"Coincident"]
[null,null,"WEATHER CORRECTED MD 50% POE","MVA","Non-coincident"]
[null,null,null,null,"Coincident"]
[null,"NSP to enter name","CONNECTION POINT RATING","MVA","Non-coincident"]
[null,null,null,null,"Coincident"]
[null,null,"WINTER/SUMMER PEAKING",null,"Non-coincident"]
[null,null,null,null,"Coincident"]
[null,null,"ADJUSTMENTS - EMBEDDED GENERATION","MW","Non-coincident"]
[null,null,null,null,"Coincident"]
[null,null,"WEATHER CORRECTED MD 10% POE","MW","Non-coincident"]
[null,null,null,null,"Coincident"]
[null,null,"WEATHER CORRECTED MD 10% POE","MVA","Non-coincident"]
[null,null,null,null,"Coincident"]
[null,null,"WEATHER CORRECTED MD 50% POE","MW","Non-coincident"]
[null,null,null,null,"Coincident"]
[null,null,"WEATHER CORRECTED MD 50% POE","MVA","Non-coincident"]
[null,null,null,null,"Coincident"]
[null,"NSP to enter name","CONNECTION POINT RATING","MVA","Non-coincident"]
[null,null,null,null,"Coincident"]
[null,null,"WINTER/SUMMER PEAKING",null,"Non-coincident"]
[null,null,null,null,"Coincident"]
[null,null,"ADJUSTMENTS - EMBEDDED GENERATION","MW","Non-coincident"]
[null,null,null,null,"Coincident"]
[null,null,"WEATHER CORRECTED MD 10% POE","MW","Non-coincident"]
[null,null,null,null,"Coincident"]
[null,null,"WEATHER CORRECTED MD 10% POE","MVA","Non-coincident"]
[null,null,null,null,"Coincident"]
[null,null,"WEATHER CORRECTED MD 50% POE","MW","Non-coincident"]
[null,null,null,null,"Coincident"]
[null,null,"WEATHER CORRECTED MD 50% POE","MVA","Non-coincident"]
[null,null,null,null,"Coincident"]
[null,"NSP to enter name","CONNECTION POINT RATING","MVA","Non-coincident"]
[null,null,null,null,"Coincident"]
[null,null,"WINTER/SUMMER PEAKING",null,"Non-coincident"]
[null,null,null,null,"Coincident"]
[null,null,"ADJUSTMENTS - EMBEDDED GENERATION","MW","Non-coincident"]
[null,null,null,null,"Coincident"]
[null,null,"WEATHER CORRECTED MD 10% POE","MW","Non-coincident"]
[null,null,null,null,"Coincident"]
[null,null,"WEATHER CORRECTED MD 10% POE","MVA","Non-coincident"]
[null,null,null,null,"Coincident"]
[null,null,"WEATHER CORRECTED MD 50% POE","MW","Non-coincident"]
[null,null,null,null,"Coincident"]
[null,null,"WEATHER CORRECTED MD 50% POE","MVA","Non-coincident"]
[null,null,null,null,"Coincident"]
[null,"NSP to enter name","CONNECTION POINT RATING","MVA","Non-coincident"]
[null,null,null,null,"Coincident"]
[null,null,"WINTER/SUMMER PEAKING",null,"Non-coincident"]
[null,null,null,null,"Coincident"]
[null,null,"ADJUSTMENTS - EMBEDDED GENERATION","MW","Non-coincident"]
[null,null,null,null,"Coincident"]
[null,null,"WEATHER CORRECTED MD 10% POE","MW","Non-coincident"]
[null,null,null,null,"Coincident"]
[null,null,"WEATHER CORRECTED MD 10% POE","MVA","Non-coincident"]
[null,null,null,null,"Coincident"]
[null,null,"WEATHER CORRECTED MD 50% POE","MW","Non-coincident"]
[null,null,null,null,"Coincident"]
[null,null,"WEATHER CORRECTED MD 50% POE","MVA","Non-coincident"]
[null,null,null,null,"Coincident"]
[null,"NSP to enter name","CONNECTION POINT RATING","MVA","Non-coincident"]
[null,null,null,null,"Coincident"]
[null,null,"WINTER/SUMMER PEAKING",null,"Non-coincident"]
[null,null,null,null,"Coincident"]
[null,null,"ADJUSTMENTS - EMBEDDED GENERATION","MW","Non-coincident"]
[null,null,null,null,"Coincident"]
[null,null,"WEATHER CORRECTED MD 10% POE","MW","Non-coincident"]
[null,null,null,null,"Coincident"]
[null,null,"WEATHER CORRECTED MD 10% POE","MVA","Non-coincident"]
[null,null,null,null,"Coincident"]
[null,null,"WEATHER CORRECTED MD 50% POE","MW","Non-coincident"]
[null,null,null,null,"Coincident"]
[null,null,"WEATHER CORRECTED MD 50% POE","MVA","Non-coincident"]
[null,null,null,null,"Coincident"]
[null,"NSP to enter name","CONNECTION POINT RATING","MVA","Non-coincident"]
[null,null,null,null,"Coincident"]
[null,null,"WINTER/SUMMER PEAKING",null,"Non-coincident"]
[null,null,null,null,"Coincident"]
[null,null,"ADJUSTMENTS - EMBEDDED GENERATION","MW","Non-coincident"]
[null,null,null,null,"Coincident"]
[null,null,"WEATHER CORRECTED MD 10% POE","MW","Non-coincident"]
[null,null,null,null,"Coincident"]
[null,null,"WEATHER CORRECTED MD 10% POE","MVA","Non-coincident"]
[null,null,null,null,"Coincident"]
[null,null,"WEATHER CORRECTED MD 50% POE","MW","Non-coincident"]
[null,null,null,null,"Coincident"]
[null,null,"WEATHER CORRECTED MD 50% POE","MVA","Non-coincident"]
[null,null,null,null,"Coincident"]
[null,"NSP to enter name","CONNECTION POINT RATING","MVA","Non-coincident"]
[null,null,null,null,"Coincident"]
[null,null,"WINTER/SUMMER PEAKING",null,"Non-coincident"]
[null,null,null,null,"Coincident"]
[null,null,"ADJUSTMENTS - EMBEDDED GENERATION","MW","Non-coincident"]
[null,null,null,null,"Coincident"]
[null,null,"WEATHER CORRECTED MD 10% POE","MW","Non-coincident"]
[null,null,null,null,"Coincident"]
[null,null,"WEATHER CORRECTED MD 10% POE","MVA","Non-coincident"]
[null,null,null,null,"Coincident"]
[null,null,"WEATHER CORRECTED MD 50% POE","MW","Non-coincident"]
[null,null,null,null,"Coincident"]
[null,null,"WEATHER CORRECTED MD 50% POE","MVA","Non-coincident"]
[null,null,null,null,"Coincident"]
[null,"NSP to enter name","CONNECTION POINT RATING","MVA","Non-coincident"]
[null,null,null,null,"Coincident"]
[null,null,"WINTER/SUMMER PEAKING",null,"Non-coincident"]
[null,null,null,null,"Coincident"]
[null,null,"ADJUSTMENTS - EMBEDDED GENERATION","MW","Non-coincident"]
[null,null,null,null,"Coincident"]
[null,null,"WEATHER CORRECTED MD 10% POE","MW","Non-coincident"]
[null,null,null,null,"Coincident"]
[null,null,"WEATHER CORRECTED MD 10% POE","MVA","Non-coincident"]
[null,null,null,null,"Coincident"]
[null,null,"WEATHER CORRECTED MD 50% POE","MW","Non-coincident"]
[null,null,null,null,"Coincident"]
[null,null,"WEATHER CORRECTED MD 50% POE","MVA","Non-coincident"]
[null,null,null,null,"Coincident"]
[null,"NSP to enter name","CONNECTION POINT RATING","MVA","Non-coincident"]
[null,null,null,null,"Coincident"]
[null,null,"WINTER/SUMMER PEAKING",null,"Non-coincident"]
[null,null,null,null,"Coincident"]
[null,null,"ADJUSTMENTS - EMBEDDED GENERATION","MW","Non-coincident"]
[null,null,null,null,"Coincident"]
[null,null,"WEATHER CORRECTED MD 10% POE","MW","Non-coincident"]
[null,null,null,null,"Coincident"]
[null,null,"WEATHER CORRECTED MD 10% POE","MVA","Non-coincident"]
[null,null,null,null,"Coincident"]
[null,null,"WEATHER CORRECTED MD 50% POE","MW","Non-coincident"]
[null,null,null,null,"Coincident"]
[null,null,"WEATHER CORRECTED MD 50% POE","MVA","Non-coincident"]
[null,null,null,null,"Coincident"]
[null,"NSP to enter name","CONNECTION POINT RATING","MVA","Non-coincident"]
[null,null,null,null,"Coincident"]
[null,null,"WINTER/SUMMER PEAKING",null,"Non-coincident"]
[null,null,null,null,"Coincident"]
[null,null,"ADJUSTMENTS - EMBEDDED GENERATION","MW","Non-coincident"]
[null,null,null,null,"Coincident"]
[null,null,"WEATHER CORRECTED MD 10% POE","MW","Non-coincident"]
[null,null,null,null,"Coincident"]
[null,null,"WEATHER CORRECTED MD 10% POE","MVA","Non-coincident"]
[null,null,null,null,"Coincident"]
[null,null,"WEATHER CORRECTED MD 50% POE","MW","Non-coincident"]
[null,null,null,null,"Coincident"]
[null,null,"WEATHER CORRECTED MD 50% POE","MVA","Non-coincident"]
[null,null,null,null,"Coincident"]
[null,"NSP to enter name","CONNECTION POINT RATING","MVA","Non-coincident"]
[null,null,null,null,"Coincident"]
[null,null,"WINTER/SUMMER PEAKING",null,"Non-coincident"]
[null,null,null,null,"Coincident"]
[null,null,"ADJUSTMENTS - EMBEDDED GENERATION","MW","Non-coincident"]
[null,null,null,null,"Coincident"]
[null,null,"WEATHER CORRECTED MD 10% POE","MW","Non-coincident"]
[null,null,null,null,"Coincident"]
[null,null,"WEATHER CORRECTED MD 10% POE","MVA","Non-coincident"]
[null,null,null,null,"Coincident"]
[null,null,"WEATHER CORRECTED MD 50% POE","MW","Non-coincident"]
[null,null,null,null,"Coincident"]
[null,null,"WEATHER CORRECTED MD 50% POE","MVA","Non-coincident"]
[null,null,null,null,"Coincident"]
[null,"NSP to enter name","CONNECTION POINT RATING","MVA","Non-coincident"]
[null,null,null,null,"Coincident"]
[null,null,"WINTER/SUMMER PEAKING",null,"Non-coincident"]
[null,null,null,null,"Coincident"]
[null,null,"ADJUSTMENTS - EMBEDDED GENERATION","MW","Non-coincident"]
[null,null,null,null,"Coincident"]
[null,null,"WEATHER CORRECTED MD 10% POE","MW","Non-coincident"]
[null,null,null,null,"Coincident"]
[null,null,"WEATHER CORRECTED MD 10% POE","MVA","Non-coincident"]
[null,null,null,null,"Coincident"]
[null,null,"WEATHER CORRECTED MD 50% POE","MW","Non-coincident"]
[null,null,null,null,"Coincident"]
[null,null,"WEATHER CORRECTED MD 50% POE","MVA","Non-coincident"]
[null,null,null,null,"Coincident"]
[null,"NSP to enter name","CONNECTION POINT RATING","MVA","Non-coincident"]
[null,null,null,null,"Coincident"]
[null,null,"WINTER/SUMMER PEAKING",null,"Non-coincident"]
[null,null,null,null,"Coincident"]
[null,null,"ADJUSTMENTS - EMBEDDED GENERATION","MW","Non-coincident"]
[null,null,null,null,"Coincident"]
[null,null,"WEATHER CORRECTED MD 10% POE","MW","Non-coincident"]
[null,null,null,null,"Coincident"]
[null,null,"WEATHER CORRECTED MD 10% POE","MVA","Non-coincident"]
[null,null,null,null,"Coincident"]
[null,null,"WEATHER CORRECTED MD 50% POE","MW","Non-coincident"]
[null,null,null,null,"Coincident"]
[null,null,"WEATHER CORRECTED MD 50% POE","MVA","Non-coincident"]
[null,null,null,null,"Coincident"]
[null,"NSP to enter name","CONNECTION POINT RATING","MVA","Non-coincident"]
[null,null,null,null,"Coincident"]
[null,null,"WINTER/SUMMER PEAKING",null,"Non-coincident"]
[null,null,null,null,"Coincident"]
[null,null,"ADJUSTMENTS - EMBEDDED GENERATION","MW","Non-coincident"]
[null,null,null,null,"Coincident"]
[null,null,"WEATHER CORRECTED MD 10% POE","MW","Non-coincident"]
[null,null,null,null,"Coincident"]
[null,null,"WEATHER CORRECTED MD 10% POE","MVA","Non-coincident"]
[null,null,null,null,"Coincident"]
[null,null,"WEATHER CORRECTED MD 50% POE","MW","Non-coincident"]
[null,null,null,null,"Coincident"]
[null,null,"WEATHER CORRECTED MD 50% POE","MVA","Non-coincident"]
[null,null,null,null,"Coincident"]
[null,"NSP to enter name","CONNECTION POINT RATING","MVA","Non-coincident"]
[null,null,null,null,"Coincident"]
[null,null,"WINTER/SUMMER PEAKING",null,"Non-coincident"]
[null,null,null,null,"Coincident"]
[null,null,"ADJUSTMENTS - EMBEDDED GENERATION","MW","Non-coincident"]
[null,null,null,null,"Coincident"]
[null,null,"WEATHER CORRECTED MD 10% POE","MW","Non-coincident"]
[null,null,null,null,"Coincident"]
[null,null,"WEATHER CORRECTED MD 10% POE","MVA","Non-coincident"]
[null,null,null,null,"Coincident"]
[null,null,"WEATHER CORRECTED MD 50% POE","MW","Non-coincident"]
[null,null,null,null,"Coincident"]
[null,null,"WEATHER CORRECTED MD 50% POE","MVA","Non-coincident"]
[null,null,null,null,"Coincident"]
[null,"NSP to enter name","CONNECTION POINT RATING","MVA","Non-coincident"]
[null,null,null,null,"Coincident"]
[null,null,"WINTER/SUMMER PEAKING",null,"Non-coincident"]
[null,null,null,null,"Coincident"]
[null,null,"ADJUSTMENTS - EMBEDDED GENERATION","MW","Non-coincident"]
[null,null,null,null,"Coincident"]
[null,null,"WEATHER CORRECTED MD 10% POE","MW","Non-coincident"]
[null,null,null,null,"Coincident"]
[null,null,"WEATHER CORRECTED MD 10% POE","MVA","Non-coincident"]
[null,null,null,null,"Coincident"]
[null,null,"WEATHER CORRECTED MD 50% POE","MW","Non-coincident"]
[null,null,null,null,"Coincident"]
[null,null,"WEATHER CORRECTED MD 50% POE","MVA","Non-coincident"]
[null,null,null,null,"Coincident"]
[null,"NSP to enter name","CONNECTION POINT RATING","MVA","Non-coincident"]
[null,null,null,null,"Coincident"]
[null,null,"WINTER/SUMMER PEAKING",null,"Non-coincident"]
[null,null,null,null,"Coincident"]
[null,null,"ADJUSTMENTS - EMBEDDED GENERATION","MW","Non-coincident"]
[null,null,null,null,"Coincident"]
[null,null,"WEATHER CORRECTED MD 10% POE","MW","Non-coincident"]
[null,null,null,null,"Coincident"]
[null,null,"WEATHER CORRECTED MD 10% POE","MVA","Non-coincident"]
[null,null,null,null,"Coincident"]
[null,null,"WEATHER CORRECTED MD 50% POE","MW","Non-coincident"]
[null,null,null,null,"Coincident"]
[null,null,"WEATHER CORRECTED MD 50% POE","MVA","Non-coincident"]
[null,null,null,null,"Coincident"]
[null,"NSP to enter name","CONNECTION POINT RATING","MVA","Non-coincident"]
[null,null,null,null,"Coincident"]
[null,null,"WINTER/SUMMER PEAKING",null,"Non-coincident"]
[null,null,null,null,"Coincident"]
[null,null,"ADJUSTMENTS - EMBEDDED GENERATION","MW","Non-coincident"]
[null,null,null,null,"Coincident"]
[null,null,"WEATHER CORRECTED MD 10% POE","MW","Non-coincident"]
[null,null,null,null,"Coincident"]
[null,null,"WEATHER CORRECTED MD 10% POE","MVA","Non-coincident"]
[null,null,null,null,"Coincident"]
[null,null,"WEATHER CORRECTED MD 50% POE","MW","Non-coincident"]
[null,null,null,null,"Coincident"]
[null,null,"WEATHER CORRECTED MD 50% POE","MVA","Non-coincident"]
[null,null,null,null,"Coincident"]
[null,"NSP to enter name","CONNECTION POINT RATING","MVA","Non-coincident"]
[null,null,null,null,"Coincident"]
[null,null,"WINTER/SUMMER PEAKING",null,"Non-coincident"]
[null,null,null,null,"Coincident"]
[null,null,"ADJUSTMENTS - EMBEDDED GENERATION","MW","Non-coincident"]
[null,null,null,null,"Coincident"]
[null,null,"WEATHER CORRECTED MD 10% POE","MW","Non-coincident"]
[null,null,null,null,"Coincident"]
[null,null,"WEATHER CORRECTED MD 10% POE","MVA","Non-coincident"]
[null,null,null,null,"Coincident"]
[null,null,"WEATHER CORRECTED MD 50% POE","MW","Non-coincident"]
[null,null,null,null,"Coincident"]
[null,null,"WEATHER CORRECTED MD 50% POE","MVA","Non-coincident"]
[null,null,null,null,"Coincident"]
[null,"NSP to enter name","CONNECTION POINT RATING","MVA","Non-coincident"]
[null,null,null,null,"Coincident"]
[null,null,"WINTER/SUMMER PEAKING",null,"Non-coincident"]
[null,null,null,null,"Coincident"]
[null,null,"ADJUSTMENTS - EMBEDDED GENERATION","MW","Non-coincident"]
[null,null,null,null,"Coincident"]
[null,null,"WEATHER CORRECTED MD 10% POE","MW","Non-coincident"]
[null,null,null,null,"Coincident"]
[null,null,"WEATHER CORRECTED MD 10% POE","MVA","Non-coincident"]
[null,null,null,null,"Coincident"]
[null,null,"WEATHER CORRECTED MD 50% POE","MW","Non-coincident"]
[null,null,null,null,"Coincident"]
[null,null,"WEATHER CORRECTED MD 50% POE","MVA","Non-coincident"]
[null,null,null,null,"Coincident"]
[null,"NSP to enter name","CONNECTION POINT RATING","MVA","Non-coincident"]
[null,null,null,null,"Coincident"]
[null,null,"WINTER/SUMMER PEAKING",null,"Non-coincident"]
[null,null,null,null,"Coincident"]
[null,null,"ADJUSTMENTS - EMBEDDED GENERATION","MW","Non-coincident"]
[null,null,null,null,"Coincident"]
[null,null,"WEATHER CORRECTED MD 10% POE","MW","Non-coincident"]
[null,null,null,null,"Coincident"]
[null,null,"WEATHER CORRECTED MD 10% POE","MVA","Non-coincident"]
[null,null,null,null,"Coincident"]
[null,null,"WEATHER CORRECTED MD 50% POE","MW","Non-coincident"]
[null,null,null,null,"Coincident"]
[null,null,"WEATHER CORRECTED MD 50% POE","MVA","Non-coincident"]
[null,null,null,null,"Coincident"]
[null,"NSP to enter name","CONNECTION POINT RATING","MVA","Non-coincident"]
[null,null,null,null,"Coincident"]
[null,null,"WINTER/SUMMER PEAKING",null,"Non-coincident"]
[null,null,null,null,"Coincident"]
[null,null,"ADJUSTMENTS - EMBEDDED GENERATION","MW","Non-coincident"]
[null,null,null,null,"Coincident"]
[null,null,"WEATHER CORRECTED MD 10% POE","MW","Non-coincident"]
[null,null,null,null,"Coincident"]
[null,null,"WEATHER CORRECTED MD 10% POE","MVA","Non-coincident"]
[null,null,null,null,"Coincident"]
[null,null,"WEATHER CORRECTED MD 50% POE","MW","Non-coincident"]
[null,null,null,null,"Coincident"]
[null,null,"WEATHER CORRECTED MD 50% POE","MVA","Non-coincident"]
[null,null,null,null,"Coincident"]
[null,"NSP to enter name","CONNECTION POINT RATING","MVA","Non-coincident"]
[null,null,null,null,"Coincident"]
[null,null,"WINTER/SUMMER PEAKING",null,"Non-coincident"]
[null,null,null,null,"Coincident"]
[null,null,"ADJUSTMENTS - EMBEDDED GENERATION","MW","Non-coincident"]
[null,null,null,null,"Coincident"]
[null,null,"WEATHER CORRECTED MD 10% POE","MW","Non-coincident"]
[null,null,null,null,"Coincident"]
[null,null,"WEATHER CORRECTED MD 10% POE","MVA","Non-coincident"]
[null,null,null,null,"Coincident"]
[null,null,"WEATHER CORRECTED MD 50% POE","MW","Non-coincident"]
[null,null,null,null,"Coincident"]
[null,null,"WEATHER CORRECTED MD 50% POE","MVA","Non-coincident"]
[null,null,null,null,"Coincident"]
[null,"NSP to enter name","CONNECTION POINT RATING","MVA","Non-coincident"]
[null,null,null,null,"Coincident"]
[null,null,"WINTER/SUMMER PEAKING",null,"Non-coincident"]
[null,null,null,null,"Coincident"]
[null,null,"ADJUSTMENTS - EMBEDDED GENERATION","MW","Non-coincident"]
[null,null,null,null,"Coincident"]
[null,null,"WEATHER CORRECTED MD 10% POE","MW","Non-coincident"]
[null,null,null,null,"Coincident"]
[null,null,"WEATHER CORRECTED MD 10% POE","MVA","Non-coincident"]
[null,null,null,null,"Coincident"]
[null,null,"WEATHER CORRECTED MD 50% POE","MW","Non-coincident"]
[null,null,null,null,"Coincident"]
[null,null,"WEATHER CORRECTED MD 50% POE","MVA","Non-coincident"]
[null,null,null,null,"Coincident"]
[null,"NSP to enter name","CONNECTION POINT RATING","MVA","Non-coincident"]
[null,null,null,null,"Coincident"]
[null,null,"WINTER/SUMMER PEAKING",null,"Non-coincident"]
[null,null,null,null,"Coincident"]
[null,null,"ADJUSTMENTS - EMBEDDED GENERATION","MW","Non-coincident"]
[null,null,null,null,"Coincident"]
[null,null,"WEATHER CORRECTED MD 10% POE","MW","Non-coincident"]
[null,null,null,null,"Coincident"]
[null,null,"WEATHER CORRECTED MD 10% POE","MVA","Non-coincident"]
[null,null,null,null,"Coincident"]
[null,null,"WEATHER CORRECTED MD 50% POE","MW","Non-coincident"]
[null,null,null,null,"Coincident"]
[null,null,"WEATHER CORRECTED MD 50% POE","MVA","Non-coincident"]
[null,null,null,null,"Coincident"]
[null,"NSP to enter name","CONNECTION POINT RATING","MVA","Non-coincident"]
[null,null,null,null,"Coincident"]
[null,null,"WINTER/SUMMER PEAKING",null,"Non-coincident"]
[null,null,null,null,"Coincident"]
[null,null,"ADJUSTMENTS - EMBEDDED GENERATION","MW","Non-coincident"]
[null,null,null,null,"Coincident"]
[null,null,"WEATHER CORRECTED MD 10% POE","MW","Non-coincident"]
[null,null,null,null,"Coincident"]
[null,null,"WEATHER CORRECTED MD 10% POE","MVA","Non-coincident"]
[null,null,null,null,"Coincident"]
[null,null,"WEATHER CORRECTED MD 50% POE","MW","Non-coincident"]
[null,null,null,null,"Coincident"]
[null,null,"WEATHER CORRECTED MD 50% POE","MVA","Non-coincident"]
[null,null,null,null,"Coincident"]
[null,"NSP to enter name","CONNECTION POINT RATING","MVA","Non-coincident"]
[null,null,null,null,"Coincident"]
[null,null,"WINTER/SUMMER PEAKING",null,"Non-coincident"]
[null,null,null,null,"Coincident"]
[null,null,"ADJUSTMENTS - EMBEDDED GENERATION","MW","Non-coincident"]
[null,null,null,null,"Coincident"]
[null,null,"WEATHER CORRECTED MD 10% POE","MW","Non-coincident"]
[null,null,null,null,"Coincident"]
[null,null,"WEATHER CORRECTED MD 10% POE","MVA","Non-coincident"]
[null,null,null,null,"Coincident"]
[null,null,"WEATHER CORRECTED MD 50% POE","MW","Non-coincident"]
[null,null,null,null,"Coincident"]
[null,null,"WEATHER CORRECTED MD 50% POE","MVA","Non-coincident"]
[null,null,null,null,"Coincident"]
[null,"NSP to enter name","CONNECTION POINT RATING","MVA","Non-coincident"]
[null,null,null,null,"Coincident"]
[null,null,"WINTER/SUMMER PEAKING",null,"Non-coincident"]
[null,null,null,null,"Coincident"]
[null,null,"ADJUSTMENTS - EMBEDDED GENERATION","MW","Non-coincident"]
[null,null,null,null,"Coincident"]
[null,null,"WEATHER CORRECTED MD 10% POE","MW","Non-coincident"]
[null,null,null,null,"Coincident"]
[null,null,"WEATHER CORRECTED MD 10% POE","MVA","Non-coincident"]
[null,null,null,null,"Coincident"]
[null,null,"WEATHER CORRECTED MD 50% POE","MW","Non-coincident"]
[null,null,null,null,"Coincident"]
[null,null,"WEATHER CORRECTED MD 50% POE","MVA","Non-coincident"]
[null,null,null,null,"Coincident"]
[null,"NSP to enter name","CONNECTION POINT RATING","MVA","Non-coincident"]
[null,null,null,null,"Coincident"]
[null,null,"WINTER/SUMMER PEAKING",null,"Non-coincident"]
[null,null,null,null,"Coincident"]
[null,null,"ADJUSTMENTS - EMBEDDED GENERATION","MW","Non-coincident"]
[null,null,null,null,"Coincident"]
[null,null,"WEATHER CORRECTED MD 10% POE","MW","Non-coincident"]
[null,null,null,null,"Coincident"]
[null,null,"WEATHER CORRECTED MD 10% POE","MVA","Non-coincident"]
[null,null,null,null,"Coincident"]
[null,null,"WEATHER CORRECTED MD 50% POE","MW","Non-coincident"]
[null,null,null,null,"Coincident"]
[null,null,"WEATHER CORRECTED MD 50% POE","MVA","Non-coincident"]
[null,null,null,null,"Coincident"]
[null,"NSP to enter name","CONNECTION POINT RATING","MVA","Non-coincident"]
[null,null,null,null,"Coincident"]
[null,null,"WINTER/SUMMER PEAKING",null,"Non-coincident"]
[null,null,null,null,"Coincident"]
[null,null,"ADJUSTMENTS - EMBEDDED GENERATION","MW","Non-coincident"]
[null,null,null,null,"Coincident"]
[null,null,"WEATHER CORRECTED MD 10% POE","MW","Non-coincident"]
[null,null,null,null,"Coincident"]
[null,null,"WEATHER CORRECTED MD 10% POE","MVA","Non-coincident"]
[null,null,null,null,"Coincident"]
[null,null,"WEATHER CORRECTED MD 50% POE","MW","Non-coincident"]
[null,null,null,null,"Coincident"]
[null,null,"WEATHER CORRECTED MD 50% POE","MVA","Non-coincident"]
[null,null,null,null,"Coincident"]
[null,"NSP to enter name","CONNECTION POINT RATING","MVA","Non-coincident"]
[null,null,null,null,"Coincident"]
[null,null,"WINTER/SUMMER PEAKING",null,"Non-coincident"]
[null,null,null,null,"Coincident"]
[null,null,"ADJUSTMENTS - EMBEDDED GENERATION","MW","Non-coincident"]
[null,null,null,null,"Coincident"]
[null,null,"WEATHER CORRECTED MD 10% POE","MW","Non-coincident"]
[null,null,null,null,"Coincident"]
[null,null,"WEATHER CORRECTED MD 10% POE","MVA","Non-coincident"]
[null,null,null,null,"Coincident"]
[null,null,"WEATHER CORRECTED MD 50% POE","MW","Non-coincident"]
[null,null,null,null,"Coincident"]
[null,null,"WEATHER CORRECTED MD 50% POE","MVA","Non-coincident"]
[null,null,null,null,"Coincident"]
[null,"NSP to enter name","CONNECTION POINT RATING","MVA","Non-coincident"]
[null,null,null,null,"Coincident"]
[null,null,"WINTER/SUMMER PEAKING",null,"Non-coincident"]
[null,null,null,null,"Coincident"]
[null,null,"ADJUSTMENTS - EMBEDDED GENERATION","MW","Non-coincident"]
[null,null,null,null,"Coincident"]
[null,null,"WEATHER CORRECTED MD 10% POE","MW","Non-coincident"]
[null,null,null,null,"Coincident"]
[null,null,"WEATHER CORRECTED MD 10% POE","MVA","Non-coincident"]
[null,null,null,null,"Coincident"]
[null,null,"WEATHER CORRECTED MD 50% POE","MW","Non-coincident"]
[null,null,null,null,"Coincident"]
[null,null,"WEATHER CORRECTED MD 50% POE","MVA","Non-coincident"]
[null,null,null,null,"Coincident"]
[null,"NSP to enter name","CONNECTION POINT RATING","MVA","Non-coincident"]
[null,null,null,null,"Coincident"]
[null,null,"WINTER/SUMMER PEAKING",null,"Non-coincident"]
[null,null,null,null,"Coincident"]
[null,null,"ADJUSTMENTS - EMBEDDED GENERATION","MW","Non-coincident"]
[null,null,null,null,"Coincident"]
[null,null,"WEATHER CORRECTED MD 10% POE","MW","Non-coincident"]
[null,null,null,null,"Coincident"]
[null,null,"WEATHER CORRECTED MD 10% POE","MVA","Non-coincident"]
[null,null,null,null,"Coincident"]
[null,null,"WEATHER CORRECTED MD 50% POE","MW","Non-coincident"]
[null,null,null,null,"Coincident"]
[null,null,"WEATHER CORRECTED MD 50% POE","MVA","Non-coincident"]
[null,null,null,null,"Coincident"]
[null,"NSP to enter name","CONNECTION POINT RATING","MVA","Non-coincident"]
[null,null,null,null,"Coincident"]
[null,null,"WINTER/SUMMER PEAKING",null,"Non-coincident"]
[null,null,null,null,"Coincident"]
[null,null,"ADJUSTMENTS - EMBEDDED GENERATION","MW","Non-coincident"]
[null,null,null,null,"Coincident"]
[null,null,"WEATHER CORRECTED MD 10% POE","MW","Non-coincident"]
[null,null,null,null,"Coincident"]
[null,null,"WEATHER CORRECTED MD 10% POE","MVA","Non-coincident"]
[null,null,null,null,"Coincident"]
[null,null,"WEATHER CORRECTED MD 50% POE","MW","Non-coincident"]
[null,null,null,null,"Coincident"]
[null,null,"WEATHER CORRECTED MD 50% POE","MVA","Non-coincident"]
[null,null,null,null,"Coincident"]
[null,"NSP to enter name","CONNECTION POINT RATING","MVA","Non-coincident"]
[null,null,null,null,"Coincident"]
[null,null,"WINTER/SUMMER PEAKING",null,"Non-coincident"]
[null,null,null,null,"Coincident"]
[null,null,"ADJUSTMENTS - EMBEDDED GENERATION","MW","Non-coincident"]
[null,null,null,null,"Coincident"]
[null,null,"WEATHER CORRECTED MD 10% POE","MW","Non-coincident"]
[null,null,null,null,"Coincident"]
[null,null,"WEATHER CORRECTED MD 10% POE","MVA","Non-coincident"]
[null,null,null,null,"Coincident"]
[null,null,"WEATHER CORRECTED MD 50% POE","MW","Non-coincident"]
[null,null,null,null,"Coincident"]
[null,null,"WEATHER CORRECTED MD 50% POE","MVA","Non-coincident"]
[null,null,null,null,"Coincident"]
[null,"NSP to enter name","CONNECTION POINT RATING","MVA","Non-coincident"]
[null,null,null,null,"Coincident"]
[null,null,"WINTER/SUMMER PEAKING",null,"Non-coincident"]
[null,null,null,null,"Coincident"]
[null,null,"ADJUSTMENTS - EMBEDDED GENERATION","MW","Non-coincident"]
[null,null,null,null,"Coincident"]
[null,null,"WEATHER CORRECTED MD 10% POE","MW","Non-coincident"]
[null,null,null,null,"Coincident"]
[null,null,"WEATHER CORRECTED MD 10% POE","MVA","Non-coincident"]
[null,null,null,null,"Coincident"]
[null,null,"WEATHER CORRECTED MD 50% POE","MW","Non-coincident"]
[null,null,null,null,"Coincident"]
[null,null,"WEATHER CORRECTED MD 50% POE","MVA","Non-coincident"]
[null,null,null,null,"Coincident"]
[null,"NSP to enter name","CONNECTION POINT RATING","MVA","Non-coincident"]
[null,null,null,null,"Coincident"]
[null,null,"WINTER/SUMMER PEAKING",null,"Non-coincident"]
[null,null,null,null,"Coincident"]
[null,null,"ADJUSTMENTS - EMBEDDED GENERATION","MW","Non-coincident"]
[null,null,null,null,"Coincident"]
[null,null,"WEATHER CORRECTED MD 10% POE","MW","Non-coincident"]
[null,null,null,null,"Coincident"]
[null,null,"WEATHER CORRECTED MD 10% POE","MVA","Non-coincident"]
[null,null,null,null,"Coincident"]
[null,null,"WEATHER CORRECTED MD 50% POE","MW","Non-coincident"]
[null,null,null,null,"Coincident"]
[null,null,"WEATHER CORRECTED MD 50% POE","MVA","Non-coincident"]
[null,null,null,null,"Coincident"]
[null,"NSP to enter name","CONNECTION POINT RATING","MVA","Non-coincident"]
[null,null,null,null,"Coincident"]
[null,null,"WINTER/SUMMER PEAKING",null,"Non-coincident"]
[null,null,null,null,"Coincident"]
[null,null,"ADJUSTMENTS - EMBEDDED GENERATION","MW","Non-coincident"]
[null,null,null,null,"Coincident"]
[null,null,"WEATHER CORRECTED MD 10% POE","MW","Non-coincident"]
[null,null,null,null,"Coincident"]
[null,null,"WEATHER CORRECTED MD 10% POE","MVA","Non-coincident"]
[null,null,null,null,"Coincident"]
[null,null,"WEATHER CORRECTED MD 50% POE","MW","Non-coincident"]
[null,null,null,null,"Coincident"]
[null,null,"WEATHER CORRECTED MD 50% POE","MVA","Non-coincident"]
[null,null,null,null,"Coincident"]
[null,"NSP to enter name","CONNECTION POINT RATING","MVA","Non-coincident"]
[null,null,null,null,"Coincident"]
[null,null,"WINTER/SUMMER PEAKING",null,"Non-coincident"]
[null,null,null,null,"Coincident"]
[null,null,"ADJUSTMENTS - EMBEDDED GENERATION","MW","Non-coincident"]
[null,null,null,null,"Coincident"]
[null,null,"WEATHER CORRECTED MD 10% POE","MW","Non-coincident"]
[null,null,null,null,"Coincident"]
[null,null,"WEATHER CORRECTED MD 10% POE","MVA","Non-coincident"]
[null,null,null,null,"Coincident"]
[null,null,"WEATHER CORRECTED MD 50% POE","MW","Non-coincident"]
[null,null,null,null,"Coincident"]
[null,null,"WEATHER CORRECTED MD 50% POE","MVA","Non-coincident"]
[null,null,null,null,"Coincident"]
[null,"NSP to enter name","CONNECTION POINT RATING","MVA","Non-coincident"]
[null,null,null,null,"Coincident"]
[null,null,"WINTER/SUMMER PEAKING",null,"Non-coincident"]
[null,null,null,null,"Coincident"]
[null,null,"ADJUSTMENTS - EMBEDDED GENERATION","MW","Non-coincident"]
[null,null,null,null,"Coincident"]
[null,null,"WEATHER CORRECTED MD 10% POE","MW","Non-coincident"]
[null,null,null,null,"Coincident"]
[null,null,"WEATHER CORRECTED MD 10% POE","MVA","Non-coincident"]
[null,null,null,null,"Coincident"]
[null,null,"WEATHER CORRECTED MD 50% POE","MW","Non-coincident"]
[null,null,null,null,"Coincident"]
[null,null,"WEATHER CORRECTED MD 50% POE","MVA","Non-coincident"]
[null,null,null,null,"Coincident"]
[null,"NSP to enter name","CONNECTION POINT RATING","MVA","Non-coincident"]
[null,null,null,null,"Coincident"]
[null,null,"WINTER/SUMMER PEAKING",null,"Non-coincident"]
[null,null,null,null,"Coincident"]
[null,null,"ADJUSTMENTS - EMBEDDED GENERATION","MW","Non-coincident"]
[null,null,null,null,"Coincident"]
[null,null,"WEATHER CORRECTED MD 10% POE","MW","Non-coincident"]
[null,null,null,null,"Coincident"]
[null,null,"WEATHER CORRECTED MD 10% POE","MVA","Non-coincident"]
[null,null,null,null,"Coincident"]
[null,null,"WEATHER CORRECTED MD 50% POE","MW","Non-coincident"]
[null,null,null,null,"Coincident"]
[null,null,"WEATHER CORRECTED MD 50% POE","MVA","Non-coincident"]
[null,null,null,null,"Coincident"]
[null,"NSP to enter name","CONNECTION POINT RATING","MVA","Non-coincident"]
[null,null,null,null,"Coincident"]
[null,null,"WINTER/SUMMER PEAKING",null,"Non-coincident"]
[null,null,null,null,"Coincident"]
[null,null,"ADJUSTMENTS - EMBEDDED GENERATION","MW","Non-coincident"]
[null,null,null,null,"Coincident"]
[null,null,"WEATHER CORRECTED MD 10% POE","MW","Non-coincident"]
[null,null,null,null,"Coincident"]
[null,null,"WEATHER CORRECTED MD 10% POE","MVA","Non-coincident"]
[null,null,null,null,"Coincident"]
[null,null,"WEATHER CORRECTED MD 50% POE","MW","Non-coincident"]
[null,null,null,null,"Coincident"]
[null,null,"WEATHER CORRECTED MD 50% POE","MVA","Non-coincident"]
[null,null,null,null,"Coincident"]
[null,"NSP to enter name","CONNECTION POINT RATING","MVA","Non-coincident"]
[null,null,null,null,"Coincident"]
[null,null,"WINTER/SUMMER PEAKING",null,"Non-coincident"]
[null,null,null,null,"Coincident"]
[null,null,"ADJUSTMENTS - EMBEDDED GENERATION","MW","Non-coincident"]
[null,null,null,null,"Coincident"]
[null,null,"WEATHER CORRECTED MD 10% POE","MW","Non-coincident"]
[null,null,null,null,"Coincident"]
[null,null,"WEATHER CORRECTED MD 10% POE","MVA","Non-coincident"]
[null,null,null,null,"Coincident"]
[null,null,"WEATHER CORRECTED MD 50% POE","MW","Non-coincident"]
[null,null,null,null,"Coincident"]
[null,null,"WEATHER CORRECTED MD 50% POE","MVA","Non-coincident"]
[null,null,null,null,"Coincident"]
[null,"NSP to enter name","CONNECTION POINT RATING","MVA","Non-coincident"]
[null,null,null,null,"Coincident"]
[null,null,"WINTER/SUMMER PEAKING",null,"Non-coincident"]
[null,null,null,null,"Coincident"]
[null,null,"ADJUSTMENTS - EMBEDDED GENERATION","MW","Non-coincident"]
[null,null,null,null,"Coincident"]
[null,null,"WEATHER CORRECTED MD 10% POE","MW","Non-coincident"]
[null,null,null,null,"Coincident"]
[null,null,"WEATHER CORRECTED MD 10% POE","MVA","Non-coincident"]
[null,null,null,null,"Coincident"]
[null,null,"WEATHER CORRECTED MD 50% POE","MW","Non-coincident"]
[null,null,null,null,"Coincident"]
[null,null,"WEATHER CORRECTED MD 50% POE","MVA","Non-coincident"]
[null,null,null,null,"Coincident"]
[null,"NSP to enter name","CONNECTION POINT RATING","MVA","Non-coincident"]
[null,null,null,null,"Coincident"]
[null,null,"WINTER/SUMMER PEAKING",null,"Non-coincident"]
[null,null,null,null,"Coincident"]
[null,null,"ADJUSTMENTS - EMBEDDED GENERATION","MW","Non-coincident"]
[null,null,null,null,"Coincident"]
[null,null,"WEATHER CORRECTED MD 10% POE","MW","Non-coincident"]
[null,null,null,null,"Coincident"]
[null,null,"WEATHER CORRECTED MD 10% POE","MVA","Non-coincident"]
[null,null,null,null,"Coincident"]
[null,null,"WEATHER CORRECTED MD 50% POE","MW","Non-coincident"]
[null,null,null,null,"Coincident"]
[null,null,"WEATHER CORRECTED MD 50% POE","MVA","Non-coincident"]
[null,null,null,null,"Coincident"]
[null,"NSP to enter name","CONNECTION POINT RATING","MVA","Non-coincident"]
[null,null,null,null,"Coincident"]
[null,null,"WINTER/SUMMER PEAKING",null,"Non-coincident"]
[null,null,null,null,"Coincident"]
[null,null,"ADJUSTMENTS - EMBEDDED GENERATION","MW","Non-coincident"]
[null,null,null,null,"Coincident"]
[null,null,"WEATHER CORRECTED MD 10% POE","MW","Non-coincident"]
[null,null,null,null,"Coincident"]
[null,null,"WEATHER CORRECTED MD 10% POE","MVA","Non-coincident"]
[null,null,null,null,"Coincident"]
[null,null,"WEATHER CORRECTED MD 50% POE","MW","Non-coincident"]
[null,null,null,null,"Coincident"]
[null,null,"WEATHER CORRECTED MD 50% POE","MVA","Non-coincident"]
[null,null,null,null,"Coincident"]
[null,"NSP to enter name","CONNECTION POINT RATING","MVA","Non-coincident"]
[null,null,null,null,"Coincident"]
[null,null,"WINTER/SUMMER PEAKING",null,"Non-coincident"]
[null,null,null,null,"Coincident"]
[null,null,"ADJUSTMENTS - EMBEDDED GENERATION","MW","Non-coincident"]
[null,null,null,null,"Coincident"]
[null,null,"WEATHER CORRECTED MD 10% POE","MW","Non-coincident"]
[null,null,null,null,"Coincident"]
[null,null,"WEATHER CORRECTED MD 10% POE","MVA","Non-coincident"]
[null,null,null,null,"Coincident"]
[null,null,"WEATHER CORRECTED MD 50% POE","MW","Non-coincident"]
[null,null,null,null,"Coincident"]
[null,null,"WEATHER CORRECTED MD 50% POE","MVA","Non-coincident"]
[null,null,null,null,"Coincident"]
[null,"NSP to enter name","CONNECTION POINT RATING","MVA","Non-coincident"]
[null,null,null,null,"Coincident"]
[null,null,"WINTER/SUMMER PEAKING",null,"Non-coincident"]
[null,null,null,null,"Coincident"]
[null,null,"ADJUSTMENTS - EMBEDDED GENERATION","MW","Non-coincident"]
[null,null,null,null,"Coincident"]
[null,null,"WEATHER CORRECTED MD 10% POE","MW","Non-coincident"]
[null,null,null,null,"Coincident"]
[null,null,"WEATHER CORRECTED MD 10% POE","MVA","Non-coincident"]
[null,null,null,null,"Coincident"]
[null,null,"WEATHER CORRECTED MD 50% POE","MW","Non-coincident"]
[null,null,null,null,"Coincident"]
[null,null,"WEATHER CORRECTED MD 50% POE","MVA","Non-coincident"]
[null,null,null,null,"Coincident"]
[null,"NSP to enter name","CONNECTION POINT RATING","MVA","Non-coincident"]
[null,null,null,null,"Coincident"]
[null,null,"WINTER/SUMMER PEAKING",null,"Non-coincident"]
[null,null,null,null,"Coincident"]
[null,null,"ADJUSTMENTS - EMBEDDED GENERATION","MW","Non-coincident"]
[null,null,null,null,"Coincident"]
[null,null,"WEATHER CORRECTED MD 10% POE","MW","Non-coincident"]
[null,null,null,null,"Coincident"]
[null,null,"WEATHER CORRECTED MD 10% POE","MVA","Non-coincident"]
[null,null,null,null,"Coincident"]
[null,null,"WEATHER CORRECTED MD 50% POE","MW","Non-coincident"]
[null,null,null,null,"Coincident"]
[null,null,"WEATHER CORRECTED MD 50% POE","MVA","Non-coincident"]
[null,null,null,null,"Coincident"]
[null,"NSP to enter name","CONNECTION POINT RATING","MVA","Non-coincident"]
[null,null,null,null,"Coincident"]
[null,null,"WINTER/SUMMER PEAKING",null,"Non-coincident"]
[null,null,null,null,"Coincident"]
[null,null,"ADJUSTMENTS - EMBEDDED GENERATION","MW","Non-coincident"]
[null,null,null,null,"Coincident"]
[null,null,"WEATHER CORRECTED MD 10% POE","MW","Non-coincident"]
[null,null,null,null,"Coincident"]
[null,null,"WEATHER CORRECTED MD 10% POE","MVA","Non-coincident"]
[null,null,null,null,"Coincident"]
[null,null,"WEATHER CORRECTED MD 50% POE","MW","Non-coincident"]
[null,null,null,null,"Coincident"]
[null,null,"WEATHER CORRECTED MD 50% POE","MVA","Non-coincident"]
[null,null,null,null,"Coincident"]
[null,"NSP to enter name","CONNECTION POINT RATING","MVA","Non-coincident"]
[null,null,null,null,"Coincident"]
[null,null,"WINTER/SUMMER PEAKING",null,"Non-coincident"]
[null,null,null,null,"Coincident"]
[null,null,"ADJUSTMENTS - EMBEDDED GENERATION","MW","Non-coincident"]
[null,null,null,null,"Coincident"]
[null,null,"WEATHER CORRECTED MD 10% POE","MW","Non-coincident"]
[null,null,null,null,"Coincident"]
[null,null,"WEATHER CORRECTED MD 10% POE","MVA","Non-coincident"]
[null,null,null,null,"Coincident"]
[null,null,"WEATHER CORRECTED MD 50% POE","MW","Non-coincident"]
[null,null,null,null,"Coincident"]
[null,null,"WEATHER CORRECTED MD 50% POE","MVA","Non-coincident"]
[null,null,null,null,"Coincident"]
[null,"NSP to enter name","CONNECTION POINT RATING","MVA","Non-coincident"]
[null,null,null,null,"Coincident"]
[null,null,"WINTER/SUMMER PEAKING",null,"Non-coincident"]
[null,null,null,null,"Coincident"]
[null,null,"ADJUSTMENTS - EMBEDDED GENERATION","MW","Non-coincident"]
[null,null,null,null,"Coincident"]
[null,null,"WEATHER CORRECTED MD 10% POE","MW","Non-coincident"]
[null,null,null,null,"Coincident"]
[null,null,"WEATHER CORRECTED MD 10% POE","MVA","Non-coincident"]
[null,null,null,null,"Coincident"]
[null,null,"WEATHER CORRECTED MD 50% POE","MW","Non-coincident"]
[null,null,null,null,"Coincident"]
[null,null,"WEATHER CORRECTED MD 50% POE","MVA","Non-coincident"]
[null,null,null,null,"Coincident"]
[null,"NSP to enter name","CONNECTION POINT RATING","MVA","Non-coincident"]
[null,null,null,null,"Coincident"]
[null,null,"WINTER/SUMMER PEAKING",null,"Non-coincident"]
[null,null,null,null,"Coincident"]
[null,null,"ADJUSTMENTS - EMBEDDED GENERATION","MW","Non-coincident"]
[null,null,null,null,"Coincident"]
[null,null,"WEATHER CORRECTED MD 10% POE","MW","Non-coincident"]
[null,null,null,null,"Coincident"]
[null,null,"WEATHER CORRECTED MD 10% POE","MVA","Non-coincident"]
[null,null,null,null,"Coincident"]
[null,null,"WEATHER CORRECTED MD 50% POE","MW","Non-coincident"]
[null,null,null,null,"Coincident"]
[null,null,"WEATHER CORRECTED MD 50% POE","MVA","Non-coincident"]
[null,null,null,null,"Coincident"]
[null,"NSP to enter name","CONNECTION POINT RATING","MVA","Non-coincident"]
[null,null,null,null,"Coincident"]
[null,null,"WINTER/SUMMER PEAKING",null,"Non-coincident"]
[null,null,null,null,"Coincident"]
[null,null,"ADJUSTMENTS - EMBEDDED GENERATION","MW","Non-coincident"]
[null,null,null,null,"Coincident"]
[null,null,"WEATHER CORRECTED MD 10% POE","MW","Non-coincident"]
[null,null,null,null,"Coincident"]
[null,null,"WEATHER CORRECTED MD 10% POE","MVA","Non-coincident"]
[null,null,null,null,"Coincident"]
[null,null,"WEATHER CORRECTED MD 50% POE","MW","Non-coincident"]
[null,null,null,null,"Coincident"]
[null,null,"WEATHER CORRECTED MD 50% POE","MVA","Non-coincident"]
[null,null,null,null,"Coincident"]
[null,"NSP to enter name","CONNECTION POINT RATING","MVA","Non-coincident"]
[null,null,null,null,"Coincident"]
[null,null,"WINTER/SUMMER PEAKING",null,"Non-coincident"]
[null,null,null,null,"Coincident"]
[null,null,"ADJUSTMENTS - EMBEDDED GENERATION","MW","Non-coincident"]
[null,null,null,null,"Coincident"]
[null,null,"WEATHER CORRECTED MD 10% POE","MW","Non-coincident"]
[null,null,null,null,"Coincident"]
[null,null,"WEATHER CORRECTED MD 10% POE","MVA","Non-coincident"]
[null,null,null,null,"Coincident"]
[null,null,"WEATHER CORRECTED MD 50% POE","MW","Non-coincident"]
[null,null,null,null,"Coincident"]
[null,null,"WEATHER CORRECTED MD 50% POE","MVA","Non-coincident"]
[null,null,null,null,"Coincident"]
[null,"NSP to enter name","CONNECTION POINT RATING","MVA","Non-coincident"]
[null,null,null,null,"Coincident"]
[null,null,"WINTER/SUMMER PEAKING",null,"Non-coincident"]
[null,null,null,null,"Coincident"]
[null,null,"ADJUSTMENTS - EMBEDDED GENERATION","MW","Non-coincident"]
[null,null,null,null,"Coincident"]
[null,null,"WEATHER CORRECTED MD 10% POE","MW","Non-coincident"]
[null,null,null,null,"Coincident"]
[null,null,"WEATHER CORRECTED MD 10% POE","MVA","Non-coincident"]
[null,null,null,null,"Coincident"]
[null,null,"WEATHER CORRECTED MD 50% POE","MW","Non-coincident"]
[null,null,null,null,"Coincident"]
[null,null,"WEATHER CORRECTED MD 50% POE","MVA","Non-coincident"]
[null,null,null,null,"Coincident"]
[null,"NSP to enter name","CONNECTION POINT RATING","MVA","Non-coincident"]
[null,null,null,null,"Coincident"]
[null,null,"WINTER/SUMMER PEAKING",null,"Non-coincident"]
[null,null,null,null,"Coincident"]
[null,null,"ADJUSTMENTS - EMBEDDED GENERATION","MW","Non-coincident"]
[null,null,null,null,"Coincident"]
[null,null,"WEATHER CORRECTED MD 10% POE","MW","Non-coincident"]
[null,null,null,null,"Coincident"]
[null,null,"WEATHER CORRECTED MD 10% POE","MVA","Non-coincident"]
[null,null,null,null,"Coincident"]
[null,null,"WEATHER CORRECTED MD 50% POE","MW","Non-coincident"]
[null,null,null,null,"Coincident"]
[null,null,"WEATHER CORRECTED MD 50% POE","MVA","Non-coincident"]
[null,null,null,null,"Coincident"]
[null,"NSP to enter name","CONNECTION POINT RATING","MVA","Non-coincident"]
[null,null,null,null,"Coincident"]
[null,null,"WINTER/SUMMER PEAKING",null,"Non-coincident"]
[null,null,null,null,"Coincident"]
[null,null,"ADJUSTMENTS - EMBEDDED GENERATION","MW","Non-coincident"]
[null,null,null,null,"Coincident"]
[null,null,"WEATHER CORRECTED MD 10% POE","MW","Non-coincident"]
[null,null,null,null,"Coincident"]
[null,null,"WEATHER CORRECTED MD 10% POE","MVA","Non-coincident"]
[null,null,null,null,"Coincident"]
[null,null,"WEATHER CORRECTED MD 50% POE","MW","Non-coincident"]
[null,null,null,null,"Coincident"]
[null,null,"WEATHER CORRECTED MD 50% POE","MVA","Non-coincident"]
[null,null,null,null,"Coincident"]
[null,"NSP to enter name","CONNECTION POINT RATING","MVA","Non-coincident"]
[null,null,null,null,"Coincident"]
[null,null,"WINTER/SUMMER PEAKING",null,"Non-coincident"]
[null,null,null,null,"Coincident"]
[null,null,"ADJUSTMENTS - EMBEDDED GENERATION","MW","Non-coincident"]
[null,null,null,null,"Coincident"]
[null,null,"WEATHER CORRECTED MD 10% POE","MW","Non-coincident"]
[null,null,null,null,"Coincident"]
[null,null,"WEATHER CORRECTED MD 10% POE","MVA","Non-coincident"]
[null,null,null,null,"Coincident"]
[null,null,"WEATHER CORRECTED MD 50% POE","MW","Non-coincident"]
[null,null,null,null,"Coincident"]
[null,null,"WEATHER CORRECTED MD 50% POE","MVA","Non-coincident"]
[null,null,null,null,"Coincident"]
[null,"NSP to enter name","CONNECTION POINT RATING","MVA","Non-coincident"]
[null,null,null,null,"Coincident"]
[null,null,"WINTER/SUMMER PEAKING",null,"Non-coincident"]
[null,null,null,null,"Coincident"]
[null,null,"ADJUSTMENTS - EMBEDDED GENERATION","MW","Non-coincident"]
[null,null,null,null,"Coincident"]
[null,null,"WEATHER CORRECTED MD 10% POE","MW","Non-coincident"]
[null,null,null,null,"Coincident"]
[null,null,"WEATHER CORRECTED MD 10% POE","MVA","Non-coincident"]
[null,null,null,null,"Coincident"]
[null,null,"WEATHER CORRECTED MD 50% POE","MW","Non-coincident"]
[null,null,null,null,"Coincident"]
[null,null,"WEATHER CORRECTED MD 50% POE","MVA","Non-coincident"]
[null,null,null,null,"Coincident"]
[null,"NSP to enter name","CONNECTION POINT RATING","MVA","Non-coincident"]
[null,null,null,null,"Coincident"]
[null,null,"WINTER/SUMMER PEAKING",null,"Non-coincident"]
[null,null,null,null,"Coincident"]
[null,null,"ADJUSTMENTS - EMBEDDED GENERATION","MW","Non-coincident"]
[null,null,null,null,"Coincident"]
[null,null,"WEATHER CORRECTED MD 10% POE","MW","Non-coincident"]
[null,null,null,null,"Coincident"]
[null,null,"WEATHER CORRECTED MD 10% POE","MVA","Non-coincident"]
[null,null,null,null,"Coincident"]
[null,null,"WEATHER CORRECTED MD 50% POE","MW","Non-coincident"]
[null,null,null,null,"Coincident"]
[null,null,"WEATHER CORRECTED MD 50% POE","MVA","Non-coincident"]
[null,null,null,null,"Coincident"]
[null,"NSP to enter name","CONNECTION POINT RATING","MVA","Non-coincident"]
[null,null,null,null,"Coincident"]
[null,null,"WINTER/SUMMER PEAKING",null,"Non-coincident"]
[null,null,null,null,"Coincident"]
[null,null,"ADJUSTMENTS - EMBEDDED GENERATION","MW","Non-coincident"]
[null,null,null,null,"Coincident"]
[null,null,"WEATHER CORRECTED MD 10% POE","MW","Non-coincident"]
[null,null,null,null,"Coincident"]
[null,null,"WEATHER CORRECTED MD 10% POE","MVA","Non-coincident"]
[null,null,null,null,"Coincident"]
[null,null,"WEATHER CORRECTED MD 50% POE","MW","Non-coincident"]
[null,null,null,null,"Coincident"]
[null,null,"WEATHER CORRECTED MD 50% POE","MVA","Non-coincident"]
[null,null,null,null,"Coincident"]
[null,"NSP to enter name","CONNECTION POINT RATING","MVA","Non-coincident"]
[null,null,null,null,"Coincident"]
[null,null,"WINTER/SUMMER PEAKING",null,"Non-coincident"]
[null,null,null,null,"Coincident"]
[null,null,"ADJUSTMENTS - EMBEDDED GENERATION","MW","Non-coincident"]
[null,null,null,null,"Coincident"]
[null,null,"WEATHER CORRECTED MD 10% POE","MW","Non-coincident"]
[null,null,null,null,"Coincident"]
[null,null,"WEATHER CORRECTED MD 10% POE","MVA","Non-coincident"]
[null,null,null,null,"Coincident"]
[null,null,"WEATHER CORRECTED MD 50% POE","MW","Non-coincident"]
[null,null,null,null,"Coincident"]
[null,null,"WEATHER CORRECTED MD 50% POE","MVA","Non-coincident"]
[null,null,null,null,"Coincident"]
[null,"NSP to enter name","CONNECTION POINT RATING","MVA","Non-coincident"]
[null,null,null,null,"Coincident"]
[null,null,"WINTER/SUMMER PEAKING",null,"Non-coincident"]
[null,null,null,null,"Coincident"]
[null,null,"ADJUSTMENTS - EMBEDDED GENERATION","MW","Non-coincident"]
[null,null,null,null,"Coincident"]
[null,null,"WEATHER CORRECTED MD 10% POE","MW","Non-coincident"]
[null,null,null,null,"Coincident"]
[null,null,"WEATHER CORRECTED MD 10% POE","MVA","Non-coincident"]
[null,null,null,null,"Coincident"]
[null,null,"WEATHER CORRECTED MD 50% POE","MW","Non-coincident"]
[null,null,null,null,"Coincident"]
[null,null,"WEATHER CORRECTED MD 50% POE","MVA","Non-coincident"]
[null,null,null,null,"Coincident"]
[null,"NSP to enter name","CONNECTION POINT RATING","MVA","Non-coincident"]
[null,null,null,null,"Coincident"]
[null,null,"WINTER/SUMMER PEAKING",null,"Non-coincident"]
[null,null,null,null,"Coincident"]
[null,null,"ADJUSTMENTS - EMBEDDED GENERATION","MW","Non-coincident"]
[null,null,null,null,"Coincident"]
[null,null,"WEATHER CORRECTED MD 10% POE","MW","Non-coincident"]
[null,null,null,null,"Coincident"]
[null,null,"WEATHER CORRECTED MD 10% POE","MVA","Non-coincident"]
[null,null,null,null,"Coincident"]
[null,null,"WEATHER CORRECTED MD 50% POE","MW","Non-coincident"]
[null,null,null,null,"Coincident"]
[null,null,"WEATHER CORRECTED MD 50% POE","MVA","Non-coincident"]
[null,null,null,null,"Coincident"]
[null,"NSP to enter name","CONNECTION POINT RATING","MVA","Non-coincident"]
[null,null,null,null,"Coincident"]
[null,null,"WINTER/SUMMER PEAKING",null,"Non-coincident"]
[null,null,null,null,"Coincident"]
[null,null,"ADJUSTMENTS - EMBEDDED GENERATION","MW","Non-coincident"]
[null,null,null,null,"Coincident"]
[null,null,"WEATHER CORRECTED MD 10% POE","MW","Non-coincident"]
[null,null,null,null,"Coincident"]
[null,null,"WEATHER CORRECTED MD 10% POE","MVA","Non-coincident"]
[null,null,null,null,"Coincident"]
[null,null,"WEATHER CORRECTED MD 50% POE","MW","Non-coincident"]
[null,null,null,null,"Coincident"]
[null,null,"WEATHER CORRECTED MD 50% POE","MVA","Non-coincident"]
[null,null,null,null,"Coincident"]
[null,"NSP to enter name","CONNECTION POINT RATING","MVA","Non-coincident"]
[null,null,null,null,"Coincident"]
[null,null,"WINTER/SUMMER PEAKING",null,"Non-coincident"]
[null,null,null,null,"Coincident"]
[null,null,"ADJUSTMENTS - EMBEDDED GENERATION","MW","Non-coincident"]
[null,null,null,null,"Coincident"]
[null,null,"WEATHER CORRECTED MD 10% POE","MW","Non-coincident"]
[null,null,null,null,"Coincident"]
[null,null,"WEATHER CORRECTED MD 10% POE","MVA","Non-coincident"]
[null,null,null,null,"Coincident"]
[null,null,"WEATHER CORRECTED MD 50% POE","MW","Non-coincident"]
[null,null,null,null,"Coincident"]
[null,null,"WEATHER CORRECTED MD 50% POE","MVA","Non-coincident"]
[null,null,null,null,"Coincident"]
[null,"NSP to enter name","CONNECTION POINT RATING","MVA","Non-coincident"]
[null,null,null,null,"Coincident"]
[null,null,"WINTER/SUMMER PEAKING",null,"Non-coincident"]
[null,null,null,null,"Coincident"]
[null,null,"ADJUSTMENTS - EMBEDDED GENERATION","MW","Non-coincident"]
[null,null,null,null,"Coincident"]
[null,null,"WEATHER CORRECTED MD 10% POE","MW","Non-coincident"]
[null,null,null,null,"Coincident"]
[null,null,"WEATHER CORRECTED MD 10% POE","MVA","Non-coincident"]
[null,null,null,null,"Coincident"]
[null,null,"WEATHER CORRECTED MD 50% POE","MW","Non-coincident"]
[null,null,null,null,"Coincident"]
[null,null,"WEATHER CORRECTED MD 50% POE","MVA","Non-coincident"]
[null,null,null,null,"Coincident"]
[null,"NSP to enter name","CONNECTION POINT RATING","MVA","Non-coincident"]
[null,null,null,null,"Coincident"]
[null,null,"WINTER/SUMMER PEAKING",null,"Non-coincident"]
[null,null,null,null,"Coincident"]
[null,null,"ADJUSTMENTS - EMBEDDED GENERATION","MW","Non-coincident"]
[null,null,null,null,"Coincident"]
[null,null,"WEATHER CORRECTED MD 10% POE","MW","Non-coincident"]
[null,null,null,null,"Coincident"]
[null,null,"WEATHER CORRECTED MD 10% POE","MVA","Non-coincident"]
[null,null,null,null,"Coincident"]
[null,null,"WEATHER CORRECTED MD 50% POE","MW","Non-coincident"]
[null,null,null,null,"Coincident"]
[null,null,"WEATHER CORRECTED MD 50% POE","MVA","Non-coincident"]
[null,null,null,null,"Coincident"]
[null,"NSP to enter name","CONNECTION POINT RATING","MVA","Non-coincident"]
[null,null,null,null,"Coincident"]
[null,null,"WINTER/SUMMER PEAKING",null,"Non-coincident"]
[null,null,null,null,"Coincident"]
[null,null,"ADJUSTMENTS - EMBEDDED GENERATION","MW","Non-coincident"]
[null,null,null,null,"Coincident"]
[null,null,"WEATHER CORRECTED MD 10% POE","MW","Non-coincident"]
[null,null,null,null,"Coincident"]
[null,null,"WEATHER CORRECTED MD 10% POE","MVA","Non-coincident"]
[null,null,null,null,"Coincident"]
[null,null,"WEATHER CORRECTED MD 50% POE","MW","Non-coincident"]
[null,null,null,null,"Coincident"]
[null,null,"WEATHER CORRECTED MD 50% POE","MVA","Non-coincident"]
[null,null,null,null,"Coincident"]
[null,"NSP to enter name","CONNECTION POINT RATING","MVA","Non-coincident"]
[null,null,null,null,"Coincident"]
[null,null,"WINTER/SUMMER PEAKING",null,"Non-coincident"]
[null,null,null,null,"Coincident"]
[null,null,"ADJUSTMENTS - EMBEDDED GENERATION","MW","Non-coincident"]
[null,null,null,null,"Coincident"]
[null,null,"WEATHER CORRECTED MD 10% POE","MW","Non-coincident"]
[null,null,null,null,"Coincident"]
[null,null,"WEATHER CORRECTED MD 10% POE","MVA","Non-coincident"]
[null,null,null,null,"Coincident"]
[null,null,"WEATHER CORRECTED MD 50% POE","MW","Non-coincident"]
[null,null,null,null,"Coincident"]
[null,null,"WEATHER CORRECTED MD 50% POE","MVA","Non-coincident"]
[null,null,null,null,"Coincident"]
[null,"NSP to enter name","CONNECTION POINT RATING","MVA","Non-coincident"]
[null,null,null,null,"Coincident"]
[null,null,"WINTER/SUMMER PEAKING",null,"Non-coincident"]
[null,null,null,null,"Coincident"]
[null,null,"ADJUSTMENTS - EMBEDDED GENERATION","MW","Non-coincident"]
[null,null,null,null,"Coincident"]
[null,null,"WEATHER CORRECTED MD 10% POE","MW","Non-coincident"]
[null,null,null,null,"Coincident"]
[null,null,"WEATHER CORRECTED MD 10% POE","MVA","Non-coincident"]
[null,null,null,null,"Coincident"]
[null,null,"WEATHER CORRECTED MD 50% POE","MW","Non-coincident"]
[null,null,null,null,"Coincident"]
[null,null,"WEATHER CORRECTED MD 50% POE","MVA","Non-coincident"]
[null,null,null,null,"Coincident"]
[null,"NSP to enter name","CONNECTION POINT RATING","MVA","Non-coincident"]
[null,null,null,null,"Coincident"]
[null,null,"WINTER/SUMMER PEAKING",null,"Non-coincident"]
[null,null,null,null,"Coincident"]
[null,null,"ADJUSTMENTS - EMBEDDED GENERATION","MW","Non-coincident"]
[null,null,null,null,"Coincident"]
[null,null,"WEATHER CORRECTED MD 10% POE","MW","Non-coincident"]
[null,null,null,null,"Coincident"]
[null,null,"WEATHER CORRECTED MD 10% POE","MVA","Non-coincident"]
[null,null,null,null,"Coincident"]
[null,null,"WEATHER CORRECTED MD 50% POE","MW","Non-coincident"]
[null,null,null,null,"Coincident"]
[null,null,"WEATHER CORRECTED MD 50% POE","MVA","Non-coincident"]
[null,null,null,null,"Coincident"]
[null,"NSP to enter name","CONNECTION POINT RATING","MVA","Non-coincident"]
[null,null,null,null,"Coincident"]
[null,null,"WINTER/SUMMER PEAKING",null,"Non-coincident"]
[null,null,null,null,"Coincident"]
[null,null,"ADJUSTMENTS - EMBEDDED GENERATION","MW","Non-coincident"]
[null,null,null,null,"Coincident"]
[null,null,"WEATHER CORRECTED MD 10% POE","MW","Non-coincident"]
[null,null,null,null,"Coincident"]
[null,null,"WEATHER CORRECTED MD 10% POE","MVA","Non-coincident"]
[null,null,null,null,"Coincident"]
[null,null,"WEATHER CORRECTED MD 50% POE","MW","Non-coincident"]
[null,null,null,null,"Coincident"]
[null,null,"WEATHER CORRECTED MD 50% POE","MVA","Non-coincident"]
[null,null,null,null,"Coincident"]
[null,"NSP to enter name","CONNECTION POINT RATING","MVA","Non-coincident"]
[null,null,null,null,"Coincident"]
[null,null,"WINTER/SUMMER PEAKING",null,"Non-coincident"]
[null,null,null,null,"Coincident"]
[null,null,"ADJUSTMENTS - EMBEDDED GENERATION","MW","Non-coincident"]
[null,null,null,null,"Coincident"]
[null,null,"WEATHER CORRECTED MD 10% POE","MW","Non-coincident"]
[null,null,null,null,"Coincident"]
[null,null,"WEATHER CORRECTED MD 10% POE","MVA","Non-coincident"]
[null,null,null,null,"Coincident"]
[null,null,"WEATHER CORRECTED MD 50% POE","MW","Non-coincident"]
[null,null,null,null,"Coincident"]
[null,null,"WEATHER CORRECTED MD 50% POE","MVA","Non-coincident"]
[null,null,null,null,"Coincident"]
[null,"NSP to enter name","CONNECTION POINT RATING","MVA","Non-coincident"]
[null,null,null,null,"Coincident"]
[null,null,"WINTER/SUMMER PEAKING",null,"Non-coincident"]
[null,null,null,null,"Coincident"]
[null,null,"ADJUSTMENTS - EMBEDDED GENERATION","MW","Non-coincident"]
[null,null,null,null,"Coincident"]
[null,null,"WEATHER CORRECTED MD 10% POE","MW","Non-coincident"]
[null,null,null,null,"Coincident"]
[null,null,"WEATHER CORRECTED MD 10% POE","MVA","Non-coincident"]
[null,null,null,null,"Coincident"]
[null,null,"WEATHER CORRECTED MD 50% POE","MW","Non-coincident"]
[null,null,null,null,"Coincident"]
[null,null,"WEATHER CORRECTED MD 50% POE","MVA","Non-coincident"]
[null,null,null,null,"Coincident"]
[null,"NSP to enter name","CONNECTION POINT RATING","MVA","Non-coincident"]
[null,null,null,null,"Coincident"]
[null,null,"WINTER/SUMMER PEAKING",null,"Non-coincident"]
[null,null,null,null,"Coincident"]
[null,null,"ADJUSTMENTS - EMBEDDED GENERATION","MW","Non-coincident"]
[null,null,null,null,"Coincident"]
[null,null,"WEATHER CORRECTED MD 10% POE","MW","Non-coincident"]
[null,null,null,null,"Coincident"]
[null,null,"WEATHER CORRECTED MD 10% POE","MVA","Non-coincident"]
[null,null,null,null,"Coincident"]
[null,null,"WEATHER CORRECTED MD 50% POE","MW","Non-coincident"]
[null,null,null,null,"Coincident"]
[null,null,"WEATHER CORRECTED MD 50% POE","MVA","Non-coincident"]
[null,null,null,null,"Coincident"]
[null,"NSP to enter name","CONNECTION POINT RATING","MVA","Non-coincident"]
[null,null,null,null,"Coincident"]
[null,null,"WINTER/SUMMER PEAKING",null,"Non-coincident"]
[null,null,null,null,"Coincident"]
[null,null,"ADJUSTMENTS - EMBEDDED GENERATION","MW","Non-coincident"]
[null,null,null,null,"Coincident"]
[null,null,"WEATHER CORRECTED MD 10% POE","MW","Non-coincident"]
[null,null,null,null,"Coincident"]
[null,null,"WEATHER CORRECTED MD 10% POE","MVA","Non-coincident"]
[null,null,null,null,"Coincident"]
[null,null,"WEATHER CORRECTED MD 50% POE","MW","Non-coincident"]
[null,null,null,null,"Coincident"]
[null,null,"WEATHER CORRECTED MD 50% POE","MVA","Non-coincident"]
[null,null,null,null,"Coincident"]
[null,"NSP to enter name","CONNECTION POINT RATING","MVA","Non-coincident"]
[null,null,null,null,"Coincident"]
[null,null,"WINTER/SUMMER PEAKING",null,"Non-coincident"]
[null,null,null,null,"Coincident"]
[null,null,"ADJUSTMENTS - EMBEDDED GENERATION","MW","Non-coincident"]
[null,null,null,null,"Coincident"]
[null,null,"WEATHER CORRECTED MD 10% POE","MW","Non-coincident"]
[null,null,null,null,"Coincident"]
[null,null,"WEATHER CORRECTED MD 10% POE","MVA","Non-coincident"]
[null,null,null,null,"Coincident"]
[null,null,"WEATHER CORRECTED MD 50% POE","MW","Non-coincident"]
[null,null,null,null,"Coincident"]
[null,null,"WEATHER CORRECTED MD 50% POE","MVA","Non-coincident"]
[null,null,null,null,"Coincident"]
[null,"NSP to enter name","CONNECTION POINT RATING","MVA","Non-coincident"]
[null,null,null,null,"Coincident"]
[null,null,"WINTER/SUMMER PEAKING",null,"Non-coincident"]
[null,null,null,null,"Coincident"]
[null,null,"ADJUSTMENTS - EMBEDDED GENERATION","MW","Non-coincident"]
[null,null,null,null,"Coincident"]
[null,null,"WEATHER CORRECTED MD 10% POE","MW","Non-coincident"]
[null,null,null,null,"Coincident"]
[null,null,"WEATHER CORRECTED MD 10% POE","MVA","Non-coincident"]
[null,null,null,null,"Coincident"]
[null,null,"WEATHER CORRECTED MD 50% POE","MW","Non-coincident"]
[null,null,null,null,"Coincident"]
[null,null,"WEATHER CORRECTED MD 50% POE","MVA","Non-coincident"]
[null,null,null,null,"Coincident"]
[null,"NSP to enter name","CONNECTION POINT RATING","MVA","Non-coincident"]
[null,null,null,null,"Coincident"]
[null,null,"WINTER/SUMMER PEAKING",null,"Non-coincident"]
[null,null,null,null,"Coincident"]
[null,null,"ADJUSTMENTS - EMBEDDED GENERATION","MW","Non-coincident"]
[null,null,null,null,"Coincident"]
[null,null,"WEATHER CORRECTED MD 10% POE","MW","Non-coincident"]
[null,null,null,null,"Coincident"]
[null,null,"WEATHER CORRECTED MD 10% POE","MVA","Non-coincident"]
[null,null,null,null,"Coincident"]
[null,null,"WEATHER CORRECTED MD 50% POE","MW","Non-coincident"]
[null,null,null,null,"Coincident"]
[null,null,"WEATHER CORRECTED MD 50% POE","MVA","Non-coincident"]
[null,null,null,null,"Coincident"]
[null,"NSP to enter name","CONNECTION POINT RATING","MVA","Non-coincident"]
[null,null,null,null,"Coincident"]
[null,null,"WINTER/SUMMER PEAKING",null,"Non-coincident"]
[null,null,null,null,"Coincident"]
[null,null,"ADJUSTMENTS - EMBEDDED GENERATION","MW","Non-coincident"]
[null,null,null,null,"Coincident"]
[null,null,"WEATHER CORRECTED MD 10% POE","MW","Non-coincident"]
[null,null,null,null,"Coincident"]
[null,null,"WEATHER CORRECTED MD 10% POE","MVA","Non-coincident"]
[null,null,null,null,"Coincident"]
[null,null,"WEATHER CORRECTED MD 50% POE","MW","Non-coincident"]
[null,null,null,null,"Coincident"]
[null,null,"WEATHER CORRECTED MD 50% POE","MVA","Non-coincident"]
[null,null,null,null,"Coincident"]
[null,"NSP to enter name","CONNECTION POINT RATING","MVA","Non-coincident"]
[null,null,null,null,"Coincident"]
[null,null,"WINTER/SUMMER PEAKING",null,"Non-coincident"]
[null,null,null,null,"Coincident"]
[null,null,"ADJUSTMENTS - EMBEDDED GENERATION","MW","Non-coincident"]
[null,null,null,null,"Coincident"]
[null,null,"WEATHER CORRECTED MD 10% POE","MW","Non-coincident"]
[null,null,null,null,"Coincident"]
[null,null,"WEATHER CORRECTED MD 10% POE","MVA","Non-coincident"]
[null,null,null,null,"Coincident"]
[null,null,"WEATHER CORRECTED MD 50% POE","MW","Non-coincident"]
[null,null,null,null,"Coincident"]
[null,null,"WEATHER CORRECTED MD 50% POE","MVA","Non-coincident"]
[null,null,null,null,"Coincident"]
[null,"NSP to enter name","CONNECTION POINT RATING","MVA","Non-coincident"]
[null,null,null,null,"Coincident"]
[null,null,"WINTER/SUMMER PEAKING",null,"Non-coincident"]
[null,null,null,null,"Coincident"]
[null,null,"ADJUSTMENTS - EMBEDDED GENERATION","MW","Non-coincident"]
[null,null,null,null,"Coincident"]
[null,null,"WEATHER CORRECTED MD 10% POE","MW","Non-coincident"]
[null,null,null,null,"Coincident"]
[null,null,"WEATHER CORRECTED MD 10% POE","MVA","Non-coincident"]
[null,null,null,null,"Coincident"]
[null,null,"WEATHER CORRECTED MD 50% POE","MW","Non-coincident"]
[null,null,null,null,"Coincident"]
[null,null,"WEATHER CORRECTED MD 50% POE","MVA","Non-coincident"]
[null,null,null,null,"Coincident"]
[null,"NSP to enter name","CONNECTION POINT RATING","MVA","Non-coincident"]
[null,null,null,null,"Coincident"]
[null,null,"WINTER/SUMMER PEAKING",null,"Non-coincident"]
[null,null,null,null,"Coincident"]
[null,null,"ADJUSTMENTS - EMBEDDED GENERATION","MW","Non-coincident"]
[null,null,null,null,"Coincident"]
[null,null,"WEATHER CORRECTED MD 10% POE","MW","Non-coincident"]
[null,null,null,null,"Coincident"]
[null,null,"WEATHER CORRECTED MD 10% POE","MVA","Non-coincident"]
[null,null,null,null,"Coincident"]
[null,null,"WEATHER CORRECTED MD 50% POE","MW","Non-coincident"]
[null,null,null,null,"Coincident"]
[null,null,"WEATHER CORRECTED MD 50% POE","MVA","Non-coincident"]
[null,null,null,null,"Coincident"]
[null,"NSP to enter name","CONNECTION POINT RATING","MVA","Non-coincident"]
[null,null,null,null,"Coincident"]
[null,null,"WINTER/SUMMER PEAKING",null,"Non-coincident"]
[null,null,null,null,"Coincident"]
[null,null,"ADJUSTMENTS - EMBEDDED GENERATION","MW","Non-coincident"]
[null,null,null,null,"Coincident"]
[null,null,"WEATHER CORRECTED MD 10% POE","MW","Non-coincident"]
[null,null,null,null,"Coincident"]
[null,null,"WEATHER CORRECTED MD 10% POE","MVA","Non-coincident"]
[null,null,null,null,"Coincident"]
[null,null,"WEATHER CORRECTED MD 50% POE","MW","Non-coincident"]
[null,null,null,null,"Coincident"]
[null,null,"WEATHER CORRECTED MD 50% POE","MVA","Non-coincident"]
[null,null,null,null,"Coincident"]
[null,"NSP to enter name","CONNECTION POINT RATING","MVA","Non-coincident"]
[null,null,null,null,"Coincident"]
[null,null,"WINTER/SUMMER PEAKING",null,"Non-coincident"]
[null,null,null,null,"Coincident"]
[null,null,"ADJUSTMENTS - EMBEDDED GENERATION","MW","Non-coincident"]
[null,null,null,null,"Coincident"]
[null,null,"WEATHER CORRECTED MD 10% POE","MW","Non-coincident"]
[null,null,null,null,"Coincident"]
[null,null,"WEATHER CORRECTED MD 10% POE","MVA","Non-coincident"]
[null,null,null,null,"Coincident"]
[null,null,"WEATHER CORRECTED MD 50% POE","MW","Non-coincident"]
[null,null,null,null,"Coincident"]
[null,null,"WEATHER CORRECTED MD 50% POE","MVA","Non-coincident"]
[null,null,null,null,"Coincident"]
[null,"NSP to enter name","CONNECTION POINT RATING","MVA","Non-coincident"]
[null,null,null,null,"Coincident"]
[null,null,"WINTER/SUMMER PEAKING",null,"Non-coincident"]
[null,null,null,null,"Coincident"]
[null,null,"ADJUSTMENTS - EMBEDDED GENERATION","MW","Non-coincident"]
[null,null,null,null,"Coincident"]
[null,null,"WEATHER CORRECTED MD 10% POE","MW","Non-coincident"]
[null,null,null,null,"Coincident"]
[null,null,"WEATHER CORRECTED MD 10% POE","MVA","Non-coincident"]
[null,null,null,null,"Coincident"]
[null,null,"WEATHER CORRECTED MD 50% POE","MW","Non-coincident"]
[null,null,null,null,"Coincident"]
[null,null,"WEATHER CORRECTED MD 50% POE","MVA","Non-coincident"]
[null,null,null,null,"Coincident"]
[null,"NSP to enter name","CONNECTION POINT RATING","MVA","Non-coincident"]
[null,null,null,null,"Coincident"]
[null,null,"WINTER/SUMMER PEAKING",null,"Non-coincident"]
[null,null,null,null,"Coincident"]
[null,null,"ADJUSTMENTS - EMBEDDED GENERATION","MW","Non-coincident"]
[null,null,null,null,"Coincident"]
[null,null,"WEATHER CORRECTED MD 10% POE","MW","Non-coincident"]
[null,null,null,null,"Coincident"]
[null,null,"WEATHER CORRECTED MD 10% POE","MVA","Non-coincident"]
[null,null,null,null,"Coincident"]
[null,null,"WEATHER CORRECTED MD 50% POE","MW","Non-coincident"]
[null,null,null,null,"Coincident"]
[null,null,"WEATHER CORRECTED MD 50% POE","MVA","Non-coincident"]
[null,null,null,null,"Coincident"]
[null,"NSP to enter name","CONNECTION POINT RATING","MVA","Non-coincident"]
[null,null,null,null,"Coincident"]
[null,null,"WINTER/SUMMER PEAKING",null,"Non-coincident"]
[null,null,null,null,"Coincident"]
[null,null,"ADJUSTMENTS - EMBEDDED GENERATION","MW","Non-coincident"]
[null,null,null,null,"Coincident"]
[null,null,"WEATHER CORRECTED MD 10% POE","MW","Non-coincident"]
[null,null,null,null,"Coincident"]
[null,null,"WEATHER CORRECTED MD 10% POE","MVA","Non-coincident"]
[null,null,null,null,"Coincident"]
[null,null,"WEATHER CORRECTED MD 50% POE","MW","Non-coincident"]
[null,null,null,null,"Coincident"]
[null,null,"WEATHER CORRECTED MD 50% POE","MVA","Non-coincident"]
[null,null,null,null,"Coincident"]
[null,"NSP to enter name","CONNECTION POINT RATING","MVA","Non-coincident"]
[null,null,null,null,"Coincident"]
[null,null,"WINTER/SUMMER PEAKING",null,"Non-coincident"]
[null,null,null,null,"Coincident"]
[null,null,"ADJUSTMENTS - EMBEDDED GENERATION","MW","Non-coincident"]
[null,null,null,null,"Coincident"]
[null,null,"WEATHER CORRECTED MD 10% POE","MW","Non-coincident"]
[null,null,null,null,"Coincident"]
[null,null,"WEATHER CORRECTED MD 10% POE","MVA","Non-coincident"]
[null,null,null,null,"Coincident"]
[null,null,"WEATHER CORRECTED MD 50% POE","MW","Non-coincident"]
[null,null,null,null,"Coincident"]
[null,null,"WEATHER CORRECTED MD 50% POE","MVA","Non-coincident"]
[null,null,null,null,"Coincident"]
[null,"NSP to enter name","CONNECTION POINT RATING","MVA","Non-coincident"]
[null,null,null,null,"Coincident"]
[null,null,"WINTER/SUMMER PEAKING",null,"Non-coincident"]
[null,null,null,null,"Coincident"]
[null,null,"ADJUSTMENTS - EMBEDDED GENERATION","MW","Non-coincident"]
[null,null,null,null,"Coincident"]
[null,null,"WEATHER CORRECTED MD 10% POE","MW","Non-coincident"]
[null,null,null,null,"Coincident"]
[null,null,"WEATHER CORRECTED MD 10% POE","MVA","Non-coincident"]
[null,null,null,null,"Coincident"]
[null,null,"WEATHER CORRECTED MD 50% POE","MW","Non-coincident"]
[null,null,null,null,"Coincident"]
[null,null,"WEATHER CORRECTED MD 50% POE","MVA","Non-coincident"]
[null,null,null,null,"Coincident"]
[null,"NSP to enter name","CONNECTION POINT RATING","MVA","Non-coincident"]
[null,null,null,null,"Coincident"]
[null,null,"WINTER/SUMMER PEAKING",null,"Non-coincident"]
[null,null,null,null,"Coincident"]
[null,null,"ADJUSTMENTS - EMBEDDED GENERATION","MW","Non-coincident"]
[null,null,null,null,"Coincident"]
[null,null,"WEATHER CORRECTED MD 10% POE","MW","Non-coincident"]
[null,null,null,null,"Coincident"]
[null,null,"WEATHER CORRECTED MD 10% POE","MVA","Non-coincident"]
[null,null,null,null,"Coincident"]
[null,null,"WEATHER CORRECTED MD 50% POE","MW","Non-coincident"]
[null,null,null,null,"Coincident"]
[null,null,"WEATHER CORRECTED MD 50% POE","MVA","Non-coincident"]
[null,null,null,null,"Coincident"]
[null,"NSP to enter name","CONNECTION POINT RATING","MVA","Non-coincident"]
[null,null,null,null,"Coincident"]
[null,null,"WINTER/SUMMER PEAKING",null,"Non-coincident"]
[null,null,null,null,"Coincident"]
[null,null,"ADJUSTMENTS - EMBEDDED GENERATION","MW","Non-coincident"]
[null,null,null,null,"Coincident"]
[null,null,"WEATHER CORRECTED MD 10% POE","MW","Non-coincident"]
[null,null,null,null,"Coincident"]
[null,null,"WEATHER CORRECTED MD 10% POE","MVA","Non-coincident"]
[null,null,null,null,"Coincident"]
[null,null,"WEATHER CORRECTED MD 50% POE","MW","Non-coincident"]
[null,null,null,null,"Coincident"]
[null,null,"WEATHER CORRECTED MD 50% POE","MVA","Non-coincident"]
[null,null,null,null,"Coincident"]
[null,"NSP to enter name","CONNECTION POINT RATING","MVA","Non-coincident"]
[null,null,null,null,"Coincident"]
[null,null,"WINTER/SUMMER PEAKING",null,"Non-coincident"]
[null,null,null,null,"Coincident"]
[null,null,"ADJUSTMENTS - EMBEDDED GENERATION","MW","Non-coincident"]
[null,null,null,null,"Coincident"]
[null,null,"WEATHER CORRECTED MD 10% POE","MW","Non-coincident"]
[null,null,null,null,"Coincident"]
[null,null,"WEATHER CORRECTED MD 10% POE","MVA","Non-coincident"]
[null,null,null,null,"Coincident"]
[null,null,"WEATHER CORRECTED MD 50% POE","MW","Non-coincident"]
[null,null,null,null,"Coincident"]
[null,null,"WEATHER CORRECTED MD 50% POE","MVA","Non-coincident"]
[null,null,null,null,"Coincident"]
[null,"NSP to enter name","CONNECTION POINT RATING","MVA","Non-coincident"]
[null,null,null,null,"Coincident"]
[null,null,"WINTER/SUMMER PEAKING",null,"Non-coincident"]
[null,null,null,null,"Coincident"]
[null,null,"ADJUSTMENTS - EMBEDDED GENERATION","MW","Non-coincident"]
[null,null,null,null,"Coincident"]
[null,null,"WEATHER CORRECTED MD 10% POE","MW","Non-coincident"]
[null,null,null,null,"Coincident"]
[null,null,"WEATHER CORRECTED MD 10% POE","MVA","Non-coincident"]
[null,null,null,null,"Coincident"]
[null,null,"WEATHER CORRECTED MD 50% POE","MW","Non-coincident"]
[null,null,null,null,"Coincident"]
[null,null,"WEATHER CORRECTED MD 50% POE","MVA","Non-coincident"]
[null,null,null,null,"Coincident"]
[null,"NSP to enter name","CONNECTION POINT RATING","MVA","Non-coincident"]
[null,null,null,null,"Coincident"]
[null,null,"WINTER/SUMMER PEAKING",null,"Non-coincident"]
[null,null,null,null,"Coincident"]
[null,null,"ADJUSTMENTS - EMBEDDED GENERATION","MW","Non-coincident"]
[null,null,null,null,"Coincident"]
[null,null,"WEATHER CORRECTED MD 10% POE","MW","Non-coincident"]
[null,null,null,null,"Coincident"]
[null,null,"WEATHER CORRECTED MD 10% POE","MVA","Non-coincident"]
[null,null,null,null,"Coincident"]
[null,null,"WEATHER CORRECTED MD 50% POE","MW","Non-coincident"]
[null,null,null,null,"Coincident"]
[null,null,"WEATHER CORRECTED MD 50% POE","MVA","Non-coincident"]
[null,null,null,null,"Coincident"]
[null,"NSP to enter name","CONNECTION POINT RATING","MVA","Non-coincident"]
[null,null,null,null,"Coincident"]
[null,null,"WINTER/SUMMER PEAKING",null,"Non-coincident"]
[null,null,null,null,"Coincident"]
[null,null,"ADJUSTMENTS - EMBEDDED GENERATION","MW","Non-coincident"]
[null,null,null,null,"Coincident"]
[null,null,"WEATHER CORRECTED MD 10% POE","MW","Non-coincident"]
[null,null,null,null,"Coincident"]
[null,null,"WEATHER CORRECTED MD 10% POE","MVA","Non-coincident"]
[null,null,null,null,"Coincident"]
[null,null,"WEATHER CORRECTED MD 50% POE","MW","Non-coincident"]
[null,null,null,null,"Coincident"]
[null,null,"WEATHER CORRECTED MD 50% POE","MVA","Non-coincident"]
[null,null,null,null,"Coincident"]
[null,"NSP to enter name","CONNECTION POINT RATING","MVA","Non-coincident"]
[null,null,null,null,"Coincident"]
[null,null,"WINTER/SUMMER PEAKING",null,"Non-coincident"]
[null,null,null,null,"Coincident"]
[null,null,"ADJUSTMENTS - EMBEDDED GENERATION","MW","Non-coincident"]
[null,null,null,null,"Coincident"]
[null,null,"WEATHER CORRECTED MD 10% POE","MW","Non-coincident"]
[null,null,null,null,"Coincident"]
[null,null,"WEATHER CORRECTED MD 10% POE","MVA","Non-coincident"]
[null,null,null,null,"Coincident"]
[null,null,"WEATHER CORRECTED MD 50% POE","MW","Non-coincident"]
[null,null,null,null,"Coincident"]
[null,null,"WEATHER CORRECTED MD 50% POE","MVA","Non-coincident"]
[null,null,null,null,"Coincident"]
[null,"NSP to enter name","CONNECTION POINT RATING","MVA","Non-coincident"]
[null,null,null,null,"Coincident"]
[null,null,"WINTER/SUMMER PEAKING",null,"Non-coincident"]
[null,null,null,null,"Coincident"]
[null,null,"ADJUSTMENTS - EMBEDDED GENERATION","MW","Non-coincident"]
[null,null,null,null,"Coincident"]
[null,null,"WEATHER CORRECTED MD 10% POE","MW","Non-coincident"]
[null,null,null,null,"Coincident"]
[null,null,"WEATHER CORRECTED MD 10% POE","MVA","Non-coincident"]
[null,null,null,null,"Coincident"]
[null,null,"WEATHER CORRECTED MD 50% POE","MW","Non-coincident"]
[null,null,null,null,"Coincident"]
[null,null,"WEATHER CORRECTED MD 50% POE","MVA","Non-coincident"]
[null,null,null,null,"Coincident"]
[null,"NSP to enter name","CONNECTION POINT RATING","MVA","Non-coincident"]
[null,null,null,null,"Coincident"]
[null,null,"WINTER/SUMMER PEAKING",null,"Non-coincident"]
[null,null,null,null,"Coincident"]
[null,null,"ADJUSTMENTS - EMBEDDED GENERATION","MW","Non-coincident"]
[null,null,null,null,"Coincident"]
[null,null,"WEATHER CORRECTED MD 10% POE","MW","Non-coincident"]
[null,null,null,null,"Coincident"]
[null,null,"WEATHER CORRECTED MD 10% POE","MVA","Non-coincident"]
[null,null,null,null,"Coincident"]
[null,null,"WEATHER CORRECTED MD 50% POE","MW","Non-coincident"]
[null,null,null,null,"Coincident"]
[null,null,"WEATHER CORRECTED MD 50% POE","MVA","Non-coincident"]
[null,null,null,null,"Coincident"]
[null,"NSP to enter name","CONNECTION POINT RATING","MVA","Non-coincident"]
[null,null,null,null,"Coincident"]
[null,null,"WINTER/SUMMER PEAKING",null,"Non-coincident"]
[null,null,null,null,"Coincident"]
[null,null,"ADJUSTMENTS - EMBEDDED GENERATION","MW","Non-coincident"]
[null,null,null,null,"Coincident"]
[null,null,"WEATHER CORRECTED MD 10% POE","MW","Non-coincident"]
[null,null,null,null,"Coincident"]
[null,null,"WEATHER CORRECTED MD 10% POE","MVA","Non-coincident"]
[null,null,null,null,"Coincident"]
[null,null,"WEATHER CORRECTED MD 50% POE","MW","Non-coincident"]
[null,null,null,null,"Coincident"]
[null,null,"WEATHER CORRECTED MD 50% POE","MVA","Non-coincident"]
[null,null,null,null,"Coincident"]
[null,"NSP to enter name","CONNECTION POINT RATING","MVA","Non-coincident"]
[null,null,null,null,"Coincident"]
[null,null,"WINTER/SUMMER PEAKING",null,"Non-coincident"]
[null,null,null,null,"Coincident"]
[null,null,"ADJUSTMENTS - EMBEDDED GENERATION","MW","Non-coincident"]
[null,null,null,null,"Coincident"]
[null,null,"WEATHER CORRECTED MD 10% POE","MW","Non-coincident"]
[null,null,null,null,"Coincident"]
[null,null,"WEATHER CORRECTED MD 10% POE","MVA","Non-coincident"]
[null,null,null,null,"Coincident"]
[null,null,"WEATHER CORRECTED MD 50% POE","MW","Non-coincident"]
[null,null,null,null,"Coincident"]
[null,null,"WEATHER CORRECTED MD 50% POE","MVA","Non-coincident"]
[null,null,null,null,"Coincident"]
[null,"NSP to enter name","CONNECTION POINT RATING","MVA","Non-coincident"]
[null,null,null,null,"Coincident"]
[null,null,"WINTER/SUMMER PEAKING",null,"Non-coincident"]
[null,null,null,null,"Coincident"]
[null,null,"ADJUSTMENTS - EMBEDDED GENERATION","MW","Non-coincident"]
[null,null,null,null,"Coincident"]
[null,null,"WEATHER CORRECTED MD 10% POE","MW","Non-coincident"]
[null,null,null,null,"Coincident"]
[null,null,"WEATHER CORRECTED MD 10% POE","MVA","Non-coincident"]
[null,null,null,null,"Coincident"]
[null,null,"WEATHER CORRECTED MD 50% POE","MW","Non-coincident"]
[null,null,null,null,"Coincident"]
[null,null,"WEATHER CORRECTED MD 50% POE","MVA","Non-coincident"]
[null,null,null,null,"Coincident"]
[null,"NSP to enter name","CONNECTION POINT RATING","MVA","Non-coincident"]
[null,null,null,null,"Coincident"]
[null,null,"WINTER/SUMMER PEAKING",null,"Non-coincident"]
[null,null,null,null,"Coincident"]
[null,null,"ADJUSTMENTS - EMBEDDED GENERATION","MW","Non-coincident"]
[null,null,null,null,"Coincident"]
[null,null,"WEATHER CORRECTED MD 10% POE","MW","Non-coincident"]
[null,null,null,null,"Coincident"]
[null,null,"WEATHER CORRECTED MD 10% POE","MVA","Non-coincident"]
[null,null,null,null,"Coincident"]
[null,null,"WEATHER CORRECTED MD 50% POE","MW","Non-coincident"]
[null,null,null,null,"Coincident"]
[null,null,"WEATHER CORRECTED MD 50% POE","MVA","Non-coincident"]
[null,null,null,null,"Coincident"]
[null,"NSP to enter name","CONNECTION POINT RATING","MVA","Non-coincident"]
[null,null,null,null,"Coincident"]
[null,null,"WINTER/SUMMER PEAKING",null,"Non-coincident"]
[null,null,null,null,"Coincident"]
[null,null,"ADJUSTMENTS - EMBEDDED GENERATION","MW","Non-coincident"]
[null,null,null,null,"Coincident"]
[null,null,"WEATHER CORRECTED MD 10% POE","MW","Non-coincident"]
[null,null,null,null,"Coincident"]
[null,null,"WEATHER CORRECTED MD 10% POE","MVA","Non-coincident"]
[null,null,null,null,"Coincident"]
[null,null,"WEATHER CORRECTED MD 50% POE","MW","Non-coincident"]
[null,null,null,null,"Coincident"]
[null,null,"WEATHER CORRECTED MD 50% POE","MVA","Non-coincident"]
[null,null,null,null,"Coincident"]
[null,"NSP to enter name","CONNECTION POINT RATING","MVA","Non-coincident"]
[null,null,null,null,"Coincident"]
[null,null,"WINTER/SUMMER PEAKING",null,"Non-coincident"]
[null,null,null,null,"Coincident"]
[null,null,"ADJUSTMENTS - EMBEDDED GENERATION","MW","Non-coincident"]
[null,null,null,null,"Coincident"]
[null,null,"WEATHER CORRECTED MD 10% POE","MW","Non-coincident"]
[null,null,null,null,"Coincident"]
[null,null,"WEATHER CORRECTED MD 10% POE","MVA","Non-coincident"]
[null,null,null,null,"Coincident"]
[null,null,"WEATHER CORRECTED MD 50% POE","MW","Non-coincident"]
[null,null,null,null,"Coincident"]
[null,null,"WEATHER CORRECTED MD 50% POE","MVA","Non-coincident"]
[null,null,null,null,"Coincident"]
[null,"NSP to enter name","CONNECTION POINT RATING","MVA","Non-coincident"]
[null,null,null,null,"Coincident"]
[null,null,"WINTER/SUMMER PEAKING",null,"Non-coincident"]
[null,null,null,null,"Coincident"]
[null,null,"ADJUSTMENTS - EMBEDDED GENERATION","MW","Non-coincident"]
[null,null,null,null,"Coincident"]
[null,null,"WEATHER CORRECTED MD 10% POE","MW","Non-coincident"]
[null,null,null,null,"Coincident"]
[null,null,"WEATHER CORRECTED MD 10% POE","MVA","Non-coincident"]
[null,null,null,null,"Coincident"]
[null,null,"WEATHER CORRECTED MD 50% POE","MW","Non-coincident"]
[null,null,null,null,"Coincident"]
[null,null,"WEATHER CORRECTED MD 50% POE","MVA","Non-coincident"]
[null,null,null,null,"Coincident"]
[null,"NSP to enter name","CONNECTION POINT RATING","MVA","Non-coincident"]
[null,null,null,null,"Coincident"]
[null,null,"WINTER/SUMMER PEAKING",null,"Non-coincident"]
[null,null,null,null,"Coincident"]
[null,null,"ADJUSTMENTS - EMBEDDED GENERATION","MW","Non-coincident"]
[null,null,null,null,"Coincident"]
[null,null,"WEATHER CORRECTED MD 10% POE","MW","Non-coincident"]
[null,null,null,null,"Coincident"]
[null,null,"WEATHER CORRECTED MD 10% POE","MVA","Non-coincident"]
[null,null,null,null,"Coincident"]
[null,null,"WEATHER CORRECTED MD 50% POE","MW","Non-coincident"]
[null,null,null,null,"Coincident"]
[null,null,"WEATHER CORRECTED MD 50% POE","MVA","Non-coincident"]
[null,null,null,null,"Coincident"]
[null,"NSP to enter name","CONNECTION POINT RATING","MVA","Non-coincident"]
[null,null,null,null,"Coincident"]
[null,null,"WINTER/SUMMER PEAKING",null,"Non-coincident"]
[null,null,null,null,"Coincident"]
[null,null,"ADJUSTMENTS - EMBEDDED GENERATION","MW","Non-coincident"]
[null,null,null,null,"Coincident"]
[null,null,"WEATHER CORRECTED MD 10% POE","MW","Non-coincident"]
[null,null,null,null,"Coincident"]
[null,null,"WEATHER CORRECTED MD 10% POE","MVA","Non-coincident"]
[null,null,null,null,"Coincident"]
[null,null,"WEATHER CORRECTED MD 50% POE","MW","Non-coincident"]
[null,null,null,null,"Coincident"]
[null,null,"WEATHER CORRECTED MD 50% POE","MVA","Non-coincident"]
[null,null,null,null,"Coincident"]
[null,"NSP to enter name","CONNECTION POINT RATING","MVA","Non-coincident"]
[null,null,null,null,"Coincident"]
[null,null,"WINTER/SUMMER PEAKING",null,"Non-coincident"]
[null,null,null,null,"Coincident"]
[null,null,"ADJUSTMENTS - EMBEDDED GENERATION","MW","Non-coincident"]
[null,null,null,null,"Coincident"]
[null,null,"WEATHER CORRECTED MD 10% POE","MW","Non-coincident"]
[null,null,null,null,"Coincident"]
[null,null,"WEATHER CORRECTED MD 10% POE","MVA","Non-coincident"]
[null,null,null,null,"Coincident"]
[null,null,"WEATHER CORRECTED MD 50% POE","MW","Non-coincident"]
[null,null,null,null,"Coincident"]
[null,null,"WEATHER CORRECTED MD 50% POE","MVA","Non-coincident"]
[null,null,null,null,"Coincident"]
[null,"NSP to enter name","CONNECTION POINT RATING","MVA","Non-coincident"]
[null,null,null,null,"Coincident"]
[null,null,"WINTER/SUMMER PEAKING",null,"Non-coincident"]
[null,null,null,null,"Coincident"]
[null,null,"ADJUSTMENTS - EMBEDDED GENERATION","MW","Non-coincident"]
[null,null,null,null,"Coincident"]
[null,null,"WEATHER CORRECTED MD 10% POE","MW","Non-coincident"]
[null,null,null,null,"Coincident"]
[null,null,"WEATHER CORRECTED MD 10% POE","MVA","Non-coincident"]
[null,null,null,null,"Coincident"]
[null,null,"WEATHER CORRECTED MD 50% POE","MW","Non-coincident"]
[null,null,null,null,"Coincident"]
[null,null,"WEATHER CORRECTED MD 50% POE","MVA","Non-coincident"]
[null,null,null,null,"Coincident"]
[null,"NSP to enter name","CONNECTION POINT RATING","MVA","Non-coincident"]
[null,null,null,null,"Coincident"]
[null,null,"WINTER/SUMMER PEAKING",null,"Non-coincident"]
[null,null,null,null,"Coincident"]
[null,null,"ADJUSTMENTS - EMBEDDED GENERATION","MW","Non-coincident"]
[null,null,null,null,"Coincident"]
[null,null,"WEATHER CORRECTED MD 10% POE","MW","Non-coincident"]
[null,null,null,null,"Coincident"]
[null,null,"WEATHER CORRECTED MD 10% POE","MVA","Non-coincident"]
[null,null,null,null,"Coincident"]
[null,null,"WEATHER CORRECTED MD 50% POE","MW","Non-coincident"]
[null,null,null,null,"Coincident"]
[null,null,"WEATHER CORRECTED MD 50% POE","MVA","Non-coincident"]
[null,null,null,null,"Coincident"]
[null,"NSP to enter name","CONNECTION POINT RATING","MVA","Non-coincident"]
[null,null,null,null,"Coincident"]
[null,null,"WINTER/SUMMER PEAKING",null,"Non-coincident"]
[null,null,null,null,"Coincident"]
[null,null,"ADJUSTMENTS - EMBEDDED GENERATION","MW","Non-coincident"]
[null,null,null,null,"Coincident"]
[null,null,"WEATHER CORRECTED MD 10% POE","MW","Non-coincident"]
[null,null,null,null,"Coincident"]
[null,null,"WEATHER CORRECTED MD 10% POE","MVA","Non-coincident"]
[null,null,null,null,"Coincident"]
[null,null,"WEATHER CORRECTED MD 50% POE","MW","Non-coincident"]
[null,null,null,null,"Coincident"]
[null,null,"WEATHER CORRECTED MD 50% POE","MVA","Non-coincident"]
[null,null,null,null,"Coincident"]
[null,"NSP to enter name","CONNECTION POINT RATING","MVA","Non-coincident"]
[null,null,null,null,"Coincident"]
[null,null,"WINTER/SUMMER PEAKING",null,"Non-coincident"]
[null,null,null,null,"Coincident"]
[null,null,"ADJUSTMENTS - EMBEDDED GENERATION","MW","Non-coincident"]
[null,null,null,null,"Coincident"]
[null,null,"WEATHER CORRECTED MD 10% POE","MW","Non-coincident"]
[null,null,null,null,"Coincident"]
[null,null,"WEATHER CORRECTED MD 10% POE","MVA","Non-coincident"]
[null,null,null,null,"Coincident"]
[null,null,"WEATHER CORRECTED MD 50% POE","MW","Non-coincident"]
[null,null,null,null,"Coincident"]
[null,null,"WEATHER CORRECTED MD 50% POE","MVA","Non-coincident"]
[null,null,null,null,"Coincident"]
[null,"NSP to enter name","CONNECTION POINT RATING","MVA","Non-coincident"]
[null,null,null,null,"Coincident"]
[null,null,"WINTER/SUMMER PEAKING",null,"Non-coincident"]
[null,null,null,null,"Coincident"]
[null,null,"ADJUSTMENTS - EMBEDDED GENERATION","MW","Non-coincident"]
[null,null,null,null,"Coincident"]
[null,null,"WEATHER CORRECTED MD 10% POE","MW","Non-coincident"]
[null,null,null,null,"Coincident"]
[null,null,"WEATHER CORRECTED MD 10% POE","MVA","Non-coincident"]
[null,null,null,null,"Coincident"]
[null,null,"WEATHER CORRECTED MD 50% POE","MW","Non-coincident"]
[null,null,null,null,"Coincident"]
[null,null,"WEATHER CORRECTED MD 50% POE","MVA","Non-coincident"]
[null,null,null,null,"Coincident"]
[null,"NSP to enter name","CONNECTION POINT RATING","MVA","Non-coincident"]
[null,null,null,null,"Coincident"]
[null,null,"WINTER/SUMMER PEAKING",null,"Non-coincident"]
[null,null,null,null,"Coincident"]
[null,null,"ADJUSTMENTS - EMBEDDED GENERATION","MW","Non-coincident"]
[null,null,null,null,"Coincident"]
[null,null,"WEATHER CORRECTED MD 10% POE","MW","Non-coincident"]
[null,null,null,null,"Coincident"]
[null,null,"WEATHER CORRECTED MD 10% POE","MVA","Non-coincident"]
[null,null,null,null,"Coincident"]
[null,null,"WEATHER CORRECTED MD 50% POE","MW","Non-coincident"]
[null,null,null,null,"Coincident"]
[null,null,"WEATHER CORRECTED MD 50% POE","MVA","Non-coincident"]
[null,null,null,null,"Coincident"]
[null,"NSP to enter name","CONNECTION POINT RATING","MVA","Non-coincident"]
[null,null,null,null,"Coincident"]
[null,null,"WINTER/SUMMER PEAKING",null,"Non-coincident"]
[null,null,null,null,"Coincident"]
[null,null,"ADJUSTMENTS - EMBEDDED GENERATION","MW","Non-coincident"]
[null,null,null,null,"Coincident"]
[null,null,"WEATHER CORRECTED MD 10% POE","MW","Non-coincident"]
[null,null,null,null,"Coincident"]
[null,null,"WEATHER CORRECTED MD 10% POE","MVA","Non-coincident"]
[null,null,null,null,"Coincident"]
[null,null,"WEATHER CORRECTED MD 50% POE","MW","Non-coincident"]
[null,null,null,null,"Coincident"]
[null,null,"WEATHER CORRECTED MD 50% POE","MVA","Non-coincident"]
[null,null,null,null,"Coincident"]
[null,"NSP to enter name","CONNECTION POINT RATING","MVA","Non-coincident"]
[null,null,null,null,"Coincident"]
[null,null,"WINTER/SUMMER PEAKING",null,"Non-coincident"]
[null,null,null,null,"Coincident"]
[null,null,"ADJUSTMENTS - EMBEDDED GENERATION","MW","Non-coincident"]
[null,null,null,null,"Coincident"]
[null,null,"WEATHER CORRECTED MD 10% POE","MW","Non-coincident"]
[null,null,null,null,"Coincident"]
[null,null,"WEATHER CORRECTED MD 10% POE","MVA","Non-coincident"]
[null,null,null,null,"Coincident"]
[null,null,"WEATHER CORRECTED MD 50% POE","MW","Non-coincident"]
[null,null,null,null,"Coincident"]
[null,null,"WEATHER CORRECTED MD 50% POE","MVA","Non-coincident"]
[null,null,null,null,"Coincident"]

{"sheet":"7.1  Policies and Procedures","index":26,"n_rows":234,"n_cols":5,"rows_kept":234,"cut":false,"hidden":false,"merged":[[12,1,13,1],[6,1,8,4]]}
[null,{"$f":"(LOOKUP(dms_Model,dms_Model_List,dms_Worksheet_List))","v":"REGULATORY REPORTING STATEMENT"}]
[null,{"$f":"INDEX(dms_TradingNameFull_List,MATCH(dms_TradingName,dms_TradingName_List))","v":"Queensland Electricity Transmission Corporation Limited trading as Powerlink Queensland"}]
[null,{"$f":"CONCATENATE(FRCP_y1,\" to \",FRCP_y5)","v":"2017-18 to 2021-22"}]
[null,"7.1  PLANS, POLICIES, PROCEDURES AND STRATEGIES"]
[]
[null,"Instructions"]
[null,{"$f":"CONCATENATE(dms_TradingName, \" must list and provide a brief description of key internal plans, \"&\"policies, procedures or strategies that are used by it to plan and conduct its day to day operations and that have been relied upon in the development of its regulatory proposal. \"&dms_TradingName,\" must identify any internal plans, policies, procedures and strategies that have changed in the current regulatory control period \"&\"or that are expected to change before the next regulatory control period where the change has been identified as a step change.\")","v":"Powerlink must list and provide a brief description of key internal plans, policies, procedures or strategies that are used by it to plan and conduct its day to day operations and that have been relied upon in the development of its regulatory proposal. Powerlink must identify any internal plans, policies, procedures and strategies that have changed in the current regulatory control period or that are expected to change before the next regulatory control period where the change has been identified as a step change."}]
[]
[]
[]
[null,"7.1.1 - PLANS, POLICIES, PROCEDURES AND STRATEGIES"]
[]
[null,null,"Brief description","Relevance to regulatory proposal","Expenditure impact"]
[null,null,"Description of the plan, policy, procedure or strategy.","Identify the element of the proposal/supporting documents that the policy, plan, procedure or strategy is relevant to e.g. replacement capex, capacity utilisation thresholds, opex ","Is this policy, plan or procedure identified in the response to section 4 'Step Changes' of the notice (yes or no)?"]
[null,"Corporate"]
[null,"Statement of Corporate Intent 2014/15","Statement of the strategic intent and performance objectives for Powerlink in the most recent full financial year.","Briefly describes Powerlink's business strategy and corporate objectives, which provide context for the Revenue Proposal.","No"]
[]
[]
[null,"Governance framework"]
[null,"Asset Management Policy ","Sets out the direction and framework for the sustainable management of all network and non-network assets.","Forecast capital expenditure\nForecast operating expenditure","No"]
[null,"Asset Management Framework","Defines the asset management framework for network assets.","Forecast capital expenditure\nForecast operating expenditure","No"]
[]
[]
[]
[]
[]
[]
[]
[]
[]
[]
[]
[]
[]
[]
[]
[null,"Accounting policies, procedures and methodologies (including a capitalisation policy, depreciation policy and an approved expenditure allocation methodology)"]
[null,"Powerlink Cost Allocation Methodology","Sets out Powerlink’s methodology for attributing costs to, or allocating costs\nbetween or within prescribed, negotiated and other non-regulated transmission\nservices.","Guides allocation of costs to prescribed transmission services which are the subject of the Revenue Proposal.","No"]
[null,"Property Plant & Equipment - Recognition","Sets out the policies and procedures for capitalisation of asset expenditure","Allocation of expendituture to forecast capital or operating expenditure categories","No"]
[null,"Depreciation of Fixed Assets","Sets out the approach to depreciation (methodology and assignment of useful life) for fixed assets.","Forecast depreciation","No"]
[null,"Asset management plan or equivalent documentation"]
[null,"Asset Management Policies"]
[null,"Asset Risk - Framework","Outlines the risk framework applied by Powerlink in the development of its Asset Management Plan.","Forecast capital expenditure\nForecast operating expenditure","No"]
[null,"Asset Planning Criteria","Outlines the criteria Powerlink applies in planning of the transmission network.","Forecast capital expenditure","No"]
[null,"Asset End of Life Policy","Establishes the overarching approach to network assets which have reached end of life.","Forecast capital expenditure\nForecast operating expenditure","No"]
[null,"Asset Refurbishment Policy","Establishes the overarching approach to operational refurbishment needs, plans & projects. ","Forecast operating expenditure","No"]
[null,"Asset Maintenance Policy","Establishes the overarching approach to maintenance needs, plans and work.","Forecast operating expenditure","No"]
[null,"Asset Management Strategies"]
[null,"Asset Management Strategy","Outlines the asset management strategy applied over the life cycle of network assets.","Forecast capital expenditure\nForecast operating expenditure","No"]
[null,"Transmission Line Asset Methodology ","Sets out the whole of life asset management philosophy for Powerlink’s Transmission Line assets.","Forecast capital expenditure\nForecast operating expenditure","No"]
[null,"Substation Asset Methodology ","Sets out the whole of life asset management philosophy for Powerlink’s Substation assets.","Forecast capital expenditure\nForecast operating expenditure","No"]
[null,"Land Asset Methodology ","Sets out the whole of life asset management philosophy for Powerlink’s Land assets.","Forecast capital expenditure\nForecast operating expenditure","No"]
[null,"Digital Asset Management ","Sets out the whole of life asset management philosophy for Powerlink’s Digital assets.","Forecast capital expenditure\nForecast operating expenditure","No"]
[null,"HV Underground Cable Asset Methodology","Sets out the whole of life asset management philosophy for Powerlink’s HV underground cable assets.","Forecast capital expenditure\nForecast operating expenditure","No"]
[null,"Operational Technology Asset Strategy 2015-2022","Outlines the approach to asset management for Operational Technology systems.","Forecast capital expenditure","No"]
[null,"Operational Technology Business Strategy 2015-2022","Outlines strategic initiatives for Operational Technology (OT) systems","Forecast capital expenditure","No"]
[null,"Secondary Systems Asset Strategy 2015-2022","Outlines the approach to asset management for Secondary systems","Forecast capital expenditure","No"]
[null,"Secondary Systems Business Strategy 2015-2022","Outlines strategic initiatives for Secondary Systems.","Forecast capital expenditure","No"]
[null,"Telecommunications Asset Strategy 2015-2022 - Strategy","Outlines the approach to asset management for Telecommunications systems.","Forecast capital expenditure","No"]
[null,"Telecommunications Business Strategy 2015-2022","Outlines strategic initiatives for Telecommunications systems.","Forecast capital expenditure","No"]
[]
[]
[null,"Asset Management Plans"]
[null,"Asset Management Plan","Outlines optimised network investment plans.","Forecast capital expenditure\nForecast operating expenditure","No"]
[null,"Transmission Annual Planning Report 2015","Provides information to interested stakeholders on the planning and development of the Queensland transmission network.","Forecast capital expenditure","No"]
[null,"Operational Technology Development Plan 2015-2022","Outlines development plans for Operational Technology","Forecast capital expenditure","No"]
[null,"Secondary Systems Development Plan 2015-2022","Outlines development plans for Secondary Systems","Forecast capital expenditure","No"]
[null,"Telecommunications Development Plan 2015-2022","Outlines development plans for Telecommunications","Forecast capital expenditure","No"]
[]
[]
[]
[]
[]
[]
[]
[]
[]
[]
[]
[]
[]
[]
[]
[]
[]
[]
[null,"Capital expenditure policies and procedures (including capex approval policies and procedures and replacement policy) "]
[null,"Expenditure Forecasting Methodology","Sets out Powerlink's capital (and operating) expenditure forecating methodology.","Forecast capital expenditure","No"]
[null,"Non load-driven capital expenditure forecasting methodology","Methodology for forecasting of non load-driven capital expenditure","Forecast capital expenditure","No"]
[null,"Project Approval Process for Regulated Network Capital Projects - Procedure","Provides a high level overview of network capital project approval process.","Forecast capital expenditure\nForecast operating expenditure","No"]
[]
[null,"Internal standards for network planning, design, maintenance and operation"]
[null,"Asset Planning Criteria","Outlines the criteria Powerlink applies in planning of the transmission network.","Forecast capital expenditure","No"]
[null,"Asset End of Life Policy","Establishes the overarching approach to network assets which have reached end of life.","Forecast capital expenditure\nForecast operating expenditure","No"]
[]
[]
[]
[]
[]
[]
[]
[]
[]
[]
[]
[]
[]
[]
[]
[]
[]
[]
[]
[]
[]
[]
[]
[]
[]
[]
[]
[]
[]
[]
[]
[]
[]
[]
[]
[]
[]
[]
[]
[]
[]
[]
[]
[]
[]
[]
[]
[]
[]
[]
[]
[]
[]
[]
[]
[]
[]
[]
[]
[]
[]
[]
[]
[]
[]
[]
[]
[]
[]
[]
[]
[]
[]
[]
[]
[]
[]
[null,"Procurement and contracting out policies"]
[null,"Procurement standard","Describes approach to procurement practices.","Forecast capital expenditure\nForecast operating expenditure","No"]
[null,"Information technology policies or strategies"]
[null,"Non-network Plan","Describes Powerlink's non-network programs to 2022.","Forecast capital expenditure","No"]
[]
[]
[]
[]
[]
[]
[]
[]
[]
[]
[]
[]
[]
[]
[]
[]
[]
[]
[]
[]
[]
[]
[]
[]
[]
[]
[]
[]
[]
[]
[]
[]
[]
[]
[]
[null,"Demand management policies or strategies"]
[null,"Transmission Annual Planning Report 2015","Provides information to interested parties on network developments and potential opportunities for provision of demand management solutions.","Forecast capital expenditure\nForecast operating expenditure","No"]
[]
[]
[null,"Self insurance guidelines or policy"]
[null,"Finity Report on Self Insurance","Sets out Powerlink's independent advice on self insurance requirements for the 2018-22 regulatory period.","Forecast operating expenditure","No"]
[null,"Land and easement acquisition polices"]
[null,"Powerlink - Understanding Designation for Transmission Line Infrastructure","Sets out process and requirements for community infrastructure designation","Forecast capital expenditure","No"]
[null,"Powerlink - Understanding resumptions for Transmission Line Infrastructure","Sets out process and requirements for resumption of land and easements","Forecast capital expenditure","No"]
[null,"Appendix 4 - Powerlink Manual, Guidelines for environmental assessment and consultation procedures for designation of land for community infrastructure","Sets out guidelines for environmental and public consultation procedures under the Sustainable Planning Act","Forecast capital expenditure","No"]
[]
[null,"Asset security plans and policies"]
[null,"Security Strategy","Outlines Powerlink’s security drivers and strategy in regard to physical security, personnel security and information security. ","Forecast capital expenditure","No"]
[]
[]
[]
[]
[]
[]
[]
[]
[]
[null,"Disaster recovery policy"]
[null,"Business resilience policy","Sets out Powerlink's approach to proactively plan for and management the impact of emergencies and natural disasters to the transmission network and its business operations.",null,"No"]

{"sheet":"7.2 Contingent projects","index":27,"n_rows":31,"n_cols":6,"rows_kept":31,"cut":false,"hidden":false,"merged":[[3,1,3,5],[7,1,7,5],[8,1,8,5]]}
[null,{"$f":"(LOOKUP(dms_Model,dms_Model_List,dms_Worksheet_List))","v":"REGULATORY REPORTING STATEMENT"}]
[null,{"$f":"INDEX(dms_TradingNameFull_List,MATCH(dms_TradingName,dms_TradingName_List))","v":"Queensland Electricity Transmission Corporation Limited trading as Powerlink Queensland"}]
[null,{"$f":"CONCATENATE(FRCP_y1,\" to \",FRCP_y5)","v":"2017-18 to 2021-22"}]
[null,"7.2 CONTINGENT PROJECTS"]
[]
[]
[null,"7.2.1 - PROPOSED CONTINGENT PROJECTS FOR THE FORTHCOMING REGULATORY CONTROL PERIOD"]
[null,"Instructions"]
[null,{"$f":"CONCATENATE(dms_TradingName,\" is required to populate all input cells (yellow) in table 7.2.1 presented below. Additional rows may be added by \",dms_TradingName,\"  if required.\"\n\n\n\n)","v":"Powerlink is required to populate all input cells (yellow) in table 7.2.1 presented below. Additional rows may be added by Powerlink  if required."}]
[]
[null,"Proposed contingent project name","Proposed contingent capital expenditure  ($0's, nominal)","Proposed trigger events",{"$f":"CONCATENATE(\"Proposed MAR for \", FRCP_y1,\" ($0's, nominal)\")","v":"Proposed MAR for 2017-18 ($0's, nominal)"},{"$f":"CONCATENATE(\"5 per cent of the \", FRCP_y1,\" ($0's, nominal) MAR\")","v":"5 per cent of the 2017-18 ($0's, nominal) MAR"}]
[null,"North West Surat Basin Area",147202350.00000003,"• Commitment of additional load in the north west Surat Basin area that results in forecast net transfer on the transmission system that exceeds the thermal and/or voltage stability limits;\n• Successful completion of the RIT-T, including a comprehensive assessment of credible options, that demonstrates a network investment by Powerlink maximises the net market benefits while meeting Powerlink’s reliability of supply obligations to the north west Surat Basin area; and\n• Powerlink Board commitment to proceed with the project subject to the AER amending Powerlink’s revenue determination pursuant to the Rules.\n",767374032,{"$f":"+E12*0.05","v":38368701.600000001}]
[null,"Central to North Queensland Reinforcement",55133629,"• Commitment of additional load to be connected to the Central West and/or North Queensland zones that requires the dispatch of higher cost generation in northern Queensland to maintain power transfers within limits ;\n• Successful completion of the RIT-T, including a comprehensive assessment of credible options, that demonstrates a network investment by Powerlink maximises the net market benefits while meeting Powerlink’s reliability of supply obligations to North Queensland;\n• Determination by the AER under clause 5.16.6 of the Rules that the proposed investment satisfies the RIT-T; and\n• Powerlink Board commitment to proceed with the project subject to the AER amending Powerlink’s revenue determination pursuant to the Rules.\n",{"$f":"+$E$12","v":767374032},{"$f":"+E13*0.05","v":38368701.600000001}]
[null,"Souther Galilee Basin Connection Shared Network Works",116884270,"• Commitment of additional load in excess of 195 MW to be supplied from the Lilyvale Substation;\n• Successful completion of the RIT-T, including a comprehensive assessment of credible options, that demonstrates a network investment by Powerlink maximises the net market benefits while meeting reliability of supply obligations to North Queensland; and\n• Powerlink Board commitment to proceed with the project subject to the AER amending Powerlink’s revenue determination pursuant to the Rules.\n",{"$f":"+$E$12","v":767374032},38368701.600000001]
[null,"Northern Bowen Basin Area",55654410.550895348,"• Commitment of additional load in excess of 30 MW to be supplied from the network between Moranbah and Collinsville 132kV substations, including supply directly from either of these substations;\n• Successful completion of the RIT-T, including a comprehensive assessment of the credible options, that demonstrates a network investment by Powerlink maximises the net market benefits while meeting reliability of supply obligations to the Northern Bowen Basin area; and\n• Powerlink Board commitment to proceed with the project subject to the AER amending Powerlink’s revenue determination pursuant to the Rules.\n",767374032,38368701.600000001]
[null,"Bowen Industrial Estate",42945677.211868174,"• Commitment of additional load in excess of 10 MW to be supplied from Bowen North Substation;\n• Successful completion of the RIT-T, including a comprehensive assessment of the credible options, that demonstrates a network investment by Powerlink maximises the net market benefits while meeting reliability of supply obligations to the Bowen area; and\n• Powerlink Board commitment to proceed with the project subject to the AER amending Powerlink’s revenue determination pursuant to the Rules.\n",767374032,38368701.600000001]
[null,"QNI Upgrade (Queensland Component)",66662072,"• Successful completion of the RIT-T demonstrating a network investment by Powerlink maximises the net market benefits from increasing the capacity of QNI either northward or southward or in both directions;\n• Determination by the AER under clause 5.16.6 of the Rules that the proposed investment satisfies the RIT-T; and\n• Powerlink Board commitment to proceed with the project subject to the AER amending Powerlink’s revenue determination pursuant to the Rules.\n",767374032,38368701.600000001]
[null,"Central West to Gladstone Area Reinforcement",105499614,"• Successful completion of the RIT-T demonstrating a network investment by Powerlink maximises the net market benefits from increasing the capacity the 275kV network between the Central West and Gladstone zones;\n• Determination by the AER under clause 5.16.6 of the Rules that the proposed investment satisfies the RIT-T; and\n• Powerlink Board commitment to proceed with the project subject to the AER amending Powerlink’s revenue determination pursuant to the Rules.\n",767374032,38368701.600000001]
[null,null,null,null,767374032,38368701.600000001]
[null,null,null,null,767374032,38368701.600000001]
[null,null,null,null,767374032,38368701.600000001]
[null,null,null,null,767374032,38368701.600000001]
[null,null,null,null,767374032,38368701.600000001]
[null,null,null,null,767374032,38368701.600000001]
[null,null,null,null,767374032,38368701.600000001]
[null,null,null,null,767374032,38368701.600000001]
[null,null,null,null,767374032,38368701.600000001]
[null,null,null,null,767374032,38368701.600000001]
[null,null,null,null,767374032,38368701.600000001]
[null,null,null,null,767374032,38368701.600000001]
[null,null,null,null,767374032,38368701.600000001]

{"sheet":"7.3 Obligations","index":28,"n_rows":296,"n_cols":5,"rows_kept":296,"cut":false,"hidden":false,"merged":[[3,1,3,4],[11,1,12,1]]}
[null,{"$f":"(LOOKUP(dms_Model,dms_Model_List,dms_Worksheet_List))","v":"REGULATORY REPORTING STATEMENT"}]
[null,{"$f":"INDEX(dms_TradingNameFull_List,MATCH(dms_TradingName,dms_TradingName_List))","v":"Queensland Electricity Transmission Corporation Limited trading as Powerlink Queensland"}]
[null,{"$f":"CONCATENATE(FRCP_y1,\" to \",FRCP_y5)","v":"2017-18 to 2021-22"}]
[null,"7.3  OBLIGATIONS, REQUIREMENTS & STANDARDS"]
[]
[]
[null,"Instructions"]
[null,{"$f":"CONCATENATE(\"Outline those obligations and requirements that \",dms_TradingName, \" identifies as having a material impact on expenditure requirements.\")","v":"Outline those obligations and requirements that Powerlink identifies as having a material impact on expenditure requirements."}]
[]
[]
[null,"7.3.1 - OBLIGATIONS OR REQUIREMENTS"]
[null,null,"Brief description","Relevance to regulatory proposal","Expenditure impact"]
[null,null,"Description of relevant obligations or requirements within the instrument (e.g. safety obligations, reliability targets) ","Identify what element of the proposal/supporting documents the obligation or requirement is relevant to e.g. replacement capex, capacity utilisation thresholds, opex ","Is the obligation or requirement identified in the response to section 4 'Step Changes' of the notice (yes or no)?"]
[null,"Legislation"]
[null,"National Electricity Law (NEL)","Electricity transmission entities have a large number of obligations under the NEL. The most significant obligations are to: register with AEMO as a \"Registered Participant\"; comply with the transmission determination that applies to the electricity transmission network services provided; provide the AER with the necessary information or prepare, maintain or keep the information as is requested by the AER in either a \"relevant notice\" or a \"regulatory information instrument\"; provide information to the AER for the purpose of the preparation of a NSP's performance or financial report; comply with the guidelines established by AEMO in relation to the shedding and restoration of loads in order to ensure the safety and security of the National Electricity System; comply with a wide range of obligations relating to the determination and resolution of access disputes, as well as to the restrictions on, variation of and compliance with access determinations; and comply with the general obligation not to prevent or hinder the access of another person to a regulated network service.","Revenue Proposal","No"]
[null,"Electricity Act 1994 (Qld)","This Act includes the following key obligations: (a) comply with technical conditions for operating the transmission grid in the transmission authority area, regulations and National Electricity Law and Rules; (b) must properly take into account the environmental impacts of its activities; (c) pay the amounts required under the authority or the regulations for administering the authority and its conditions; (d) must also pay an annual fee that is a proportion of the cost of the State’s funding commitments to national energy market regulation (AEMC Levy).\n","Forecast capital expenditure\nForecast operating expenditure","No"]
[null,"Electricity Regulation 2006 (Qld)","This Regulation is focused on ensuring a secure, efficient and economic supply of electricity to customers on fair and reasonable terms, ensuring customers' interests are adequately protected, provide for proper measurement and information provision regarding the energy efficiency and performance of electrical equipment and prescribes particular conditions of employees in the government owned electricity industry.","Forecast capital expenditure\nForecast operating expenditure","No"]
[null,"Electrical Safety Act 2002(Qld)","This Act sets out compliance obligations for electricity entities, particularly the responsibility to ensure that all electricity inspection, testing and maintenance works are operated in a way that is electrically safe. ","Forecast capital expenditure\nForecast operating expenditure","No"]
[null,"Electrical Safety Regulation 2013 (Qld)","This Regulation sets out the more detailed requirements for how an electricity entity complies with the Electrical Safety Act. ","Forecast capital expenditure\nForecast operating expenditure","No"]
[null,"Workplace Health and Safety Act 2011(Qld)","This Act sets out the requirements for Powerlink to maintain appropriate health and safety standards at its place of business to ensure the safety of its employees and other persons.  \n","Forecast capital expenditure\nForecast operating expenditure","No"]
[null,"Workplace  Health and Safety Regulation 2011 (Qld)","The Regulation sets out the legal requirements intended to prevent or control workplace health and safety hazards","Forecast capital expenditure\nForecast operating expenditure","No"]
[null,"Acquisition of Land Act 1967 (Qld)","This Act relates to the acquiring of land for the purpose of constructing an easement and the payment of compensation to the holder of the land over which an easement is to be taken.","Forecast capital expenditure","No"]
[null,"Acquisition of Land Regulation 2003 (Qld)","The Regulation sets out the more detailed legal requirements to ensure compliance with the Acquisition of Land Act 1967.","Forecast capital expenditure","No"]
[null,"Land Act 1994 (Qld)","This Act sets out a range of legal obligations related to the registration and administration of easements","Forecast capital expenditure\nForecast operating expenditure","No"]
[null,"Land Title Act 1994 (Qld)","This Act relates to the registration and administration of easements and are broadly similar to its obligations under the Land Act 1994. ","Forecast capital expenditure\nForecast operating expenditure","No"]
[null,"Land Act Regulation 2009 (Qld)","This Regulation sets out the obligations under the Land Act relating to the issuing and managing of Trustee issued leases and permits to third parties.","Forecast capital expenditure\nForecast operating expenditure","No"]
[null,"Sustainable Planning Act 2009 (Qld) and associated regulation","This Act sets out the framework to achieve ecological sustainability by managing the process by which development takes place, managing the effects of development on the environment and continuing the coordination and integration of planning at the local, regional and State levels. Community infrastructure designation processes that are applied for the development of Powerlink's network infrastructure are provided for within this Act.","Forecast capital expenditure","No"]
[null,"Environmental Protection Act 1994 and subordinate legislation (Qld) ","This Act sets out the environmental requirements that Powerlink must take into account when constructing, operating and maintaining its network infrastructure or related operations.\n","Forecast capital expenditure\nForecast operating expenditure","No"]
[null,"Nature Conservation Act 1992 and subordinate legislation (Qld)","This Act and related subordinate legislation sets out the framework under which Powerlink may obtain permission to construct, operate and maintain network infrastructure within national park areas.\n","Forecast capital expenditure\nForecast operating expenditure","No"]
[null,"Vegetation Management Act 1999 (Qld)\n\nVegetation Management Regulations 2000","This Act sets out requirements for the clearing, conservation and management of native vegetation related to Powerlink constructing, operating and maintaining its transmission network infrastructure.","Forecast capital expenditure\nForecast operating expenditure","No"]
[null,"Biosecurity Act 2014 (Qld)\n\n\n\n\n\n","This Acts sets out a framework for managing biosecurity risks that Powerlink must apply when constructing, operating and maintaining transmission infrastructure.","Forecast capital expenditure\nForecast operating expenditure","No"]
[null,"Plant Protection Act 1989 (Qld) and associated regulation","This Act is focused on the prevention, control and removal of plants classified as pests in Queensland.","Forecast capital expenditure\nForecast operating expenditure","No"]
[null,"Environmental Offsets Act 2014 (Qld) and associated regulation","This Act sets out the requirements for implementing environmental offsets for certain prescribed activities that have an environmental impact.","Forecast capital expenditure\nForecast operating expenditure","No"]
[null,"National Greenhouse and Energy Reporting Act 2007 (Cth) and associated regulation","This Act establishes a single national reporting framework for the reporting and dissemination of information related to greenhouse gas emissions, projects, energy consumption and energy production of businesses.","Forecast operating expenditure","No"]
[null,"Environmental Protection and Biodiversity Conservation Act 1999 (Cth) and associated regulation","This Act aims to protect the environment, particularly related to National Environmental Significance. Powerlink must comply with this Act when developing and constructing transmission network infrastructure.","Forecast capital expenditure\nForecast operating expenditure","No"]
[null,"Aboriginal Cultural Heritage Act 2003(Qld)","This Act is focused on the protection and conservation of Aboriginal cultural heritage and will impact Powerlink's activities related to the construction, operating and maintenance of transmission network infrastructure. \n","Forecast capital expenditure\nForecast operating expenditure","No"]
[null,"Water Act 2000 (Qld)","This Act provides for the sustainable management of water and\nother resources and the establishment and operation of water\nauthorities.","Forecast capital expenditure\nForecast operating expenditure","No"]
[null,"Industrial Relations Act 1996(Qld)","This Act provides a framework for industrial relations that supports economic prosperity and social justice.","Escalation Rates & Project Cost Escalation\nForecast capital expenditure\nForecast operating expenditure","No"]
[null,"Fair Work Act and Regulations 2009 (Cth)","This Act and Regulation is focused on providing a balanced framework for cooperative and productive workplace relations that promotes national economic prosperity and social inclusion for all Australians. ","Escalation Rates & Project Cost Escalation\nForecast capital expenditure\nForecast operating expenditure","No"]
[]
[]
[]
[]
[]
[]
[]
[]
[]
[]
[]
[]
[]
[]
[]
[]
[]
[]
[]
[]
[]
[]
[]
[]
[]
[]
[]
[]
[]
[]
[]
[]
[]
[]
[]
[]
[]
[]
[]
[]
[]
[]
[]
[]
[]
[]
[]
[]
[]
[]
[]
[]
[]
[]
[]
[]
[]
[]
[]
[]
[]
[]
[]
[]
[]
[]
[]
[]
[]
[]
[]
[]
[]
[]
[]
[]
[]
[]
[]
[]
[]
[]
[]
[]
[]
[]
[]
[]
[]
[]
[]
[]
[]
[]
[]
[]
[]
[]
[]
[]
[]
[]
[]
[]
[]
[]
[]
[]
[]
[]
[]
[]
[]
[]
[]
[]
[]
[]
[]
[]
[]
[]
[]
[]
[]
[]
[]
[]
[]
[]
[]
[]
[]
[]
[]
[]
[]
[]
[]
[]
[]
[]
[]
[]
[]
[]
[]
[]
[]
[]
[]
[]
[]
[]
[]
[]
[]
[]
[]
[]
[]
[]
[]
[]
[]
[]
[]
[]
[]
[]
[]
[]
[]
[]
[]
[]
[]
[]
[]
[]
[]
[]
[]
[]
[]
[]
[null,"Licences"]
[null,"Electricity Act 1994 (Qld)","Powerlink's Transmission Authority sets out the licence obligations and reliability standard to which Powerlink must comply.","Forecast capital expenditure\nForecast operating expenditure","No"]
[]
[]
[]
[null,"Rules"]
[null,"National Electricity Rules\n","The Rules contain provisions that impose specific obligations on the different entities that operate within the electricity industry.  TNSPs, such as Powerlink, have a number of obligations under the Rules which apply to different parts of their operations, including registration as a NSP, technical standards of operation, network connections, economic regulation and metering.","Revenue Proposal","No"]
[]
[]
[]
[null,"Orders"]
[null,"Nil"]
[null,"Codes"]
[null,"Electrical Code of Practice 2013 Managing Electrical Risks in the Workplace                                            ","This Code sets out practices to manage electrical risk when working near exposed live parts.  ","Forecast capital expenditure\nForecast operating expenditure","No"]
[null,"Electrical Code of Practice 2010 Works","This Code sets out practices to manage electrical safety risks associated with earthing systems, underground cable systems and supporting structures for overhead lines forming part of the works of an electricity entity.  ","Forecast capital expenditure\nForecast operating expenditure","No"]
[null,"Code of Practice 2011 How to Manage and Control Asbestos in the workplace.","This Code sets out practices to control the risks of asbestos-containing materials in workplaces.  ","Forecast capital expenditure\nForecast operating expenditure","No"]
[null,"Code of Practice 2011 How to Safely remove Asbestos","This Code sets out practices for the safe removal of asbestos and asbestos-containing material from buildings and structures, plant and equipment and vehicles.  ","Forecast capital expenditure\nForecast operating expenditure","No"]
[null,"Code of Practice 2010 - Working Near Overhead and Underground Electric Lines","This Code sets out compliance requirements to ensure that no person, plant or thing comes within an unsafe distance (exclusion zone) of an overhead electric line.","Forecast capital expenditure\nForecast operating expenditure","No"]
[]
[]
[]
[]
[]
[]
[]
[]
[]
[]
[null,"Guidelines"]
[null,"AER's Better Regulation Guidelines and Schemes","Guidelines relate to confidentiality, expenditure forecast assessment, cost allocation, capital expenditure incentives, rate of return and consumer engagement. Schemes include STPIS and EBSS.","Revenue Proposal"]
[]
[]
[]
[]
[]
[]
[]
[]
[]
[]
[]
[]
[]
[]
[]
[]
[]
[]
[]
[]
[]
[]
[]
[]
[]
[]
[]
[]
[]
[]
[]
[]
[]
[]
[]
[]
[]
[null,"Default agreements "]
[null,"Nil"]
[null,"Other"]
[null,"Nil"]

{"sheet":"7.4 Shared Assets","index":29,"n_rows":26,"n_cols":20,"rows_kept":26,"cut":false,"hidden":false,"merged":[[36,2,36,8],[37,2,37,8],[38,2,38,8],[39,2,39,8],[40,2,40,8],[31,2,31,8],[32,2,32,8],[33,2,33,8],[34,2,34,8],[35,2,35,8],[26,2,26,8],[27,2,27,8],[28,2,28,8],[29,2,29,8],[30,2,30,8],[6,1,7,1],[6,2,7,2],[25,2,25,8],[6,11,6,19],[6,3,6,10]]}
[null,{"$f":"(LOOKUP(dms_Model,dms_Model_List,dms_Worksheet_List))","v":"REGULATORY REPORTING STATEMENT"}]
[null,{"$f":"INDEX(dms_TradingNameFull_List,MATCH(dms_TradingName,dms_TradingName_List))","v":"Queensland Electricity Transmission Corporation Limited trading as Powerlink Queensland"}]
[null,{"$f":"CONCATENATE(FRCP_y1,\" to \",dms_FRCP_FinalYear_Num)","v":"2017-18 to 2021-22"}]
[null,"7.4 SHARED ASSETS"]
[]
[null,"7.4.1 - TOTAL UNREGULATED REVENUE EARNED WITH SHARED ASSETS "]
[null,"Name of shared asset unregulated service","Description of shared assets used to provide the service","Shared asset unregulated revenue  ($0's, nominal)",null,null,null,null,null,null,null,{"$f":"CONCATENATE(\"Shared asset unregulated revenue  ($0's, real \", dms_DollarReal,\")\")","v":"Shared asset unregulated revenue  ($0's, real June 2017)"}]
[null,null,null,{"$f":"PRCP_y1","v":"2007-08"},{"$f":"PRCP_y2","v":"2008-09"},{"$f":"PRCP_y3","v":"2009-10"},{"$f":"PRCP_y4","v":"2010-11"},{"$f":"PRCP_y5","v":"2011-12"},{"$f":"CRCP_y1","v":"2012-13"},{"$f":"CRCP_y2","v":"2013-14"},{"$f":"CRCP_y3","v":"2014-15"},{"$f":"CRCP_y4","v":"2015-16"},{"$f":"CRCP_y5","v":"2016-17"},{"$f":"CONCATENATE(\"Total \n\", PRCP_y1, \"-\", CRCP_y5)","v":"Total \n2007-08-2016-17"},{"$f":"FRCP_y1","v":"2017-18"},{"$f":"FRCP_y2","v":"2018-19"},{"$f":"FRCP_y3","v":"2019-20"},{"$f":"FRCP_y4","v":"2020-21"},{"$f":"FRCP_y5","v":"2021-22"},{"$f":"CONCATENATE(\"Total \n\",FRCP_y1, \"-\", FRCP_y5)","v":"Total \n2017-18-2021-22"}]
[null,"Oil Testing ","Oil lab, tools and equipment.",521418.25000000012,293097.56000000006,294038.87000000011,373143.89000000013,305507.56000000006,347400.59999999986,260391.95999999996,423787.21999999986,432807.97559902316,477785.37576071551,{"$f":"SUM(D9:M9)","v":3729379.2613597387},525595.07096503593,576393.26158997952,630344.32267308759,687621.22176044132,748405.95787600509,{"$f":"SUM(O9:S9)","v":3168359.8348645493}]
[null,"Property Rentals ","Relevant properties and land.",945543.33000000007,1327217.23,1323264.1900000002,1367105.9800000002,1351173.52,1466338.19,206046.76999999993,326439.92000000004,155620.29422390135,239429.79005250864,{"$f":"SUM(D10:M10)","v":8708179.2142764088},349298.00540127885,359662.93137757789,370027.85735387699,380392.78333017608,391535.07875469758,{"$f":"SUM(O10:S10)","v":1850916.6562176072}]
[null,"Tower Access","Transmission and telecommunications towers.",1908301.1399999997,1761401.34,2236877.9,2188569.42,2697079.44,2826870.66,3056775.3400000003,2724748.26,2202546.7699635536,2202546.7699635536,23805717.03992711,2202546.7699635536,2202546.7699635536,2202546.7699635536,2202546.7699635536,2202546.7699635536,11012733.849817768]
[null,null,null,null,null,null,null,null,null,null,null,null,null,0,null,null,null,null,null,0]
[null,null,null,null,null,null,null,null,null,null,null,null,null,0,null,null,null,null,null,0]
[null,null,null,null,null,null,null,null,null,null,null,null,null,0,null,null,null,null,null,0]
[null,null,null,null,null,null,null,null,null,null,null,null,null,0,null,null,null,null,null,0]
[null,null,null,null,null,null,null,null,null,null,null,null,null,0,null,null,null,null,null,0]
[null,null,null,null,null,null,null,null,null,null,null,null,null,0,null,null,null,null,null,0]
[null,null,null,null,null,null,null,null,null,null,null,null,null,0,null,null,null,null,null,0]
[null,null,null,null,null,null,null,null,null,null,null,null,null,0,null,null,null,null,null,0]
[null,null,null,null,null,null,null,null,null,null,null,null,null,{"$f":"SUM(D20:M20)","v":0},null,null,null,null,null,{"$f":"SUM(O20:S20)","v":0}]
[null,null,null,null,null,null,null,null,null,null,null,null,null,{"$f":"SUM(D21:M21)","v":0},null,null,null,null,null,{"$f":"SUM(O21:S21)","v":0}]
[null,null,null,null,null,null,null,null,null,null,null,null,null,{"$f":"SUM(D22:M22)","v":0},null,null,null,null,null,{"$f":"SUM(O22:S22)","v":0}]
[null,null,null,null,null,null,null,null,null,null,null,null,null,{"$f":"SUM(D23:M23)","v":0},null,null,null,null,null,{"$f":"SUM(O23:S23)","v":0}]
[]
[null,"7.4.2 - SHARED ASSET UNREGULATED SERVICES - APPORTIONMENT METHODOLOGY"]
[null,"Name of shared asset unregulated service for which revenues were apportioned","Apportionment methodology"]

{"sheet":"7.5 EBSS","index":30,"n_rows":89,"n_cols":27,"rows_kept":89,"cut":false,"hidden":false,"merged":[[66,12,66,13],[73,2,73,6],[74,2,74,6],[57,12,57,20],[61,16,61,20],[61,21,61,25],[62,14,62,26],[64,12,64,13],[65,12,65,13],[41,2,41,10],[41,12,41,20],[42,2,42,5],[42,6,42,10],[42,12,42,15],[42,16,42,20],[8,1,8,15],[23,2,23,5],[23,6,23,10],[23,12,23,20],[24,2,24,5],[24,6,24,10],[24,12,24,15],[24,16,24,20]]}
[null,{"$f":"(LOOKUP(dms_Model,dms_Model_List,dms_Worksheet_List))","v":"REGULATORY REPORTING STATEMENT"}]
[null,{"$f":"INDEX(dms_TradingNameFull_List,MATCH(dms_TradingName,dms_TradingName_List))","v":"Queensland Electricity Transmission Corporation Limited trading as Powerlink Queensland"}]
[null,{"$f":"CONCATENATE(FRCP_y1,\" to \",dms_FRCP_FinalYear_Num)","v":"2017-18 to 2021-22"}]
[null,"7.5 EBSS"]
[]
[]
[null,"Instructions "]
[null,{"$f":"CONCATENATE(dms_TradingName, \" is required to populate all input cells (yellow) in tableS 7.5.1 and 7.5.2 presented below.\")","v":"Powerlink is required to populate all input cells (yellow) in tableS 7.5.1 and 7.5.2 presented below."}]
[null,"\nEfficiency gains are calculated using the formulae below.  Adjusted target and actual amounts are used to calculate the carry-over amounts.\n\nWe will calculate the efficiency gain in 2012–13 (year 6) as follows:\nE6 = (F6 – A6) – (F5 – A5) + (F3 – A3)\nwhere F6 is the forecast opex we approved for year 6 (2012-13), and A6 is the actual opex incurred for year 6, and so on. The formula references year 3 (2009-10) because it is the base year used to forecast opex."]
[null,"\n"]
[]
[null,"CPI "]
[null,null,"2006-07","2007-08","2008-09","2009-10","2010-11","2011-12","2012-13","2013-14","2014-15","2015-16","2016-17"]
[null,"ABS CPI index Jun qtr (old base)",157.5,164.6,167,172.1,178.3]
[null,"ABS CPI index Jun qtr (rebased index)",null,null,null,95.8,99.2,100.4,102.8,105.9,107.5,110,112.7]
[null,"Inflation rate (per cent) ",null,{"$f":"D14/C14-1","v":4.5079365079365052E-2},1.4580801944106936E-2,3.0538922155688653E-2,{"$f":"G14/F14-1","v":3.6025566531086683E-2},{"$f":"H15/G15-1","v":1.2096774193548487E-2},2.3904382470119501E-2,3.0155642023346418E-2,1.5108593012275628E-2,2.3255813953488413E-2,2.4545454545454648E-2]
[null,"Reconstructed cumulative index (2015=1)",{"$f":"D17/(1+D16)","v":0.77752967118716076},0.8125802150946454,0.82442828627464027,0.84960543753212936,0.88021295474711614,0.89086069210292806,0.91215616681455181,0.93966282165039927,0.95385980479148169,0.97604259094942314,1]
[]
[]
[]
[null,"7.5.1 - The carryover amounts that arise from applying the EBSS during the current regulatory control period"]
[]
[null,"7.5.1.1 - Opex allowance applicable to EBSS (EBSS target)"]
[null,null,"$m, Jun 2007",null,null,null,"$m,  Jun 2012",null,null,null,null,null,"$m, Jun 2017"]
[null,null,"Previous period",null,null,null,"Current regulatory control period",null,null,null,null,null,"Previous period",null,null,null,"Current regulatory control period"]
[null,null,{"$f":"PRCP_y2","v":"2008-09"},{"$f":"PRCP_y3","v":"2009-10"},{"$f":"PRCP_y4","v":"2010-11"},{"$f":"PRCP_y5","v":"2011-12"},{"$f":"CRCP_y1","v":"2012-13"},{"$f":"CRCP_y2","v":"2013-14"},{"$f":"CRCP_y3","v":"2014-15"},{"$f":"CRCP_y4","v":"2015-16"},{"$f":"CRCP_y5","v":"2016-17"},null,{"$f":"PRCP_y2","v":"2008-09"},{"$f":"PRCP_y3","v":"2009-10"},{"$f":"PRCP_y4","v":"2010-11"},{"$f":"PRCP_y5","v":"2011-12"},{"$f":"CRCP_y1","v":"2012-13"},{"$f":"CRCP_y2","v":"2013-14"},{"$f":"CRCP_y3","v":"2014-15"},{"$f":"CRCP_y4","v":"2015-16"},{"$f":"CRCP_y5","v":"2016-17"}]
[null,"Total opex allowance",null,null,null,null,null,null,null,null,null,null,{"$f":"+C27/$C$17","v":0},{"$f":"+D27/$C$17","v":0},0,0,{"$f":"+G27/$H$17","v":0},{"$f":"+H27/$H$17","v":0},0,0,0]
[null,"Approved excludable costs - allowance "]
[null,"Equity raising costs",null,null,null,null,null,null,null,null,null,null,{"$f":"+C29/$C$17","v":0},{"$f":"+D29/$C$17","v":0},0,0]
[null,"Debt raising costs",null,null,null,null,null,null,null,null,null,null,{"$f":"+C30/$C$17","v":0},0,0,0,{"$f":"+G30/$H$17","v":0},0,0,0,0]
[null,"Network support costs",null,null,null,null,null,null,null,null,null,null,0,0,0,0,0,0,0,0,0]
[null,"Insurance",null,null,null,null,null,null,null,null,null,null,0,0,0,0,0,0,0,0,0]
[null,"Self insurance",null,null,null,null,null,null,null,null,null,null,0,0,0,0,0,0,0,0,0,null," "]
[null,"Network growth adjustment",null,null,null,null,null,null,null,null,null,null,0,0,0,0,0,0,0,0,0]
[null,"Capitalisation policy changes",null,null,null,null,null,null,null,null,null,null,0,0,0,0,0,0,0,0,0]
[null,"Movements in provisions related to opex",null,null,null,null,null,null,null,null,null,null,0,0,0,0,0,0,0,0,0]
[null,"Opex associated with pass throughs",null,null,null,null,null,null,null,null,null,null,0,0,0,0,0,0,0,0,0]
[null,"Other adjustments or exclusions required by the EBSS ",null,null,null,null,null,null,null,null,null,null,0,0,0,0,0,0,0,0,0]
[null,"Forecast opex for EBSS purposes",{"$f":"(C27+SUM(C29:C38))","v":0},{"$f":"(D27+SUM(D29:D38))","v":0},0,0,0,0,0,0,0,null,{"$f":"+SUM(M27:M38)","v":0},0,0,0,0,0,0,0,0]
[]
[null,"7.5.1.2 - Actual and estimated opex applicable to EBSS"]
[null,null,"$m, Actual",null,null,null,null,null,null,null,null,null,"$m, Jun 2017"]
[null,null,"Previous period",null,null,null,"Current regulatory control period",null,null,null,null,null,"Previous period",null,null,null,"Current regulatory control period"]
[null,null,{"$f":"PRCP_y2","v":"2008-09"},{"$f":"PRCP_y3","v":"2009-10"},{"$f":"PRCP_y4","v":"2010-11"},{"$f":"PRCP_y5","v":"2011-12"},{"$f":"CRCP_y1","v":"2012-13"},{"$f":"CRCP_y2","v":"2013-14"},{"$f":"CRCP_y3","v":"2014-15"},{"$f":"CRCP_y4","v":"2015-16"},{"$f":"CRCP_y5","v":"2016-17"},null,{"$f":"PRCP_y2","v":"2008-09"},{"$f":"PRCP_y3","v":"2009-10"},{"$f":"PRCP_y4","v":"2010-11"},{"$f":"PRCP_y5","v":"2011-12"},{"$f":"CRCP_y1","v":"2012-13"},{"$f":"CRCP_y2","v":"2013-14"},{"$f":"CRCP_y3","v":"2014-15"},{"$f":"CRCP_y4","v":"2015-16"},{"$f":"CRCP_y5","v":"2016-17"}]
[null,"Total opex ",null,null,null,null,null,null,null,null,null,null,{"$f":"+C45/E$17*(1+E$16)^0.5","v":0},{"$f":"+D45/F$17*(1+F$16)^0.5","v":0},0,0,{"$f":"+G45/I$17*(1+I$16)^0.5","v":0},0,0,0,0]
[null,"Approved excludable costs"]
[null,{"$f":"B29","v":"Equity raising costs"},null,null,null,null,null,null,null,null,null,null,{"$f":"+C47/E$17*(1+E$16)^0.5","v":0},{"$f":"+D47/F$17*(1+F$16)^0.5","v":0},0,0,0,0,0,0,0]
[null,"Debt raising costs",null,null,null,null,null,null,null,null,null,null,{"$f":"+C48/E$17*(1+E$16)^0.5","v":0},0,0,0,0,0,0,0,0]
[null,"Network support costs",null,null,null,null,null,null,null,null,null,null,0,0,0,0,0,0,0,0,0]
[null,"Insurance",null,null,null,null,null,null,null,null,null,null,0,0,0,0,0,0,0,0,0]
[null,"Self insurance",null,null,null,null,null,null,null,null,null,null,0,0,0,0,0,0,0,0,0]
[null,"Network growth adjustment",null,null,null,null,null,null,null,null,null,null,0,0,0,0,0,0,0,0,0]
[null,"Capitalisation policy changes",null,null,null,null,null,null,null,null,null,null,0,0,0,0,0,0,0,0,0]
[null,"Movements in provisions related to opex",null,null,null,null,null,null,null,null,null,null,0,0,0,0,0,0,0,0,0]
[null,{"$f":"B38","v":"Other adjustments or exclusions required by the EBSS "},null,null,null,null,null,null,null,null,null,null,0,0,0,0,0,0,0,0,0]
[null,"Actual opex for EBSS purposes",{"$f":"C45+SUM(C47:C55)","v":0},{"$f":"D45+SUM(D47:D55)","v":0},0,0,0,0,0,0,0,null,{"$f":"M45+SUM(M47:M55)","v":0},{"$f":"N45+SUM(N47:N55)","v":0},{"$f":"O45+SUM(O47:O55)","v":0},{"$f":"P45+SUM(P47:P55)","v":0},{"$f":"Q45+SUM(Q47:Q55)","v":0},{"$f":"R45+SUM(R47:R55)","v":0},0,0,{"$f":"U39-(S39-S56)","v":0}]
[null,null,null,null,null,null,null,null,null,"estimates",null,null,null,"base year",null,null,null,null,"base year"]
[null,null,null,null,null,null,null,null,null,null,null,null,{"$f":"CONCATENATE(\"Incremental gain ($m, \",dms_FRCP_FinalYear_Num,\")\")","v":"Incremental gain ($m, 2021-22)"}]
[null,null,null,null,null,null,null,null,null,null,null,null,null,null,null,null,{"$f":"(Q39-Q56)-(P39-P56)+(N39-N56)","v":0},{"$f":"(R39-R56)-(Q39-Q56)","v":0},{"$f":"(S39-S56)-(R39-R56)","v":0},0,0]
[]
[null,null,null,null,null,null,null,null,null,null,null,null,"Carryover"]
[null,null,null,null,null,null,null,null,null,null,null,null,null,null,null,null,"Current regulatory control period",null,null,null,null,"Forthcoming regulatory control period"]
[null,null,null,null,null,null,null,null,null,null,null,null,null,null,{"$f":"CONCATENATE(\"$m, real \",dms_DollarReal)","v":"$m, real June 2017"}]
[null,null,null,null,null,null,null,null,null,null,null,null,null,null,null,null,{"$f":"CRCP_y1","v":"2012-13"},{"$f":"CRCP_y2","v":"2013-14"},{"$f":"CRCP_y3","v":"2014-15"},{"$f":"CRCP_y4","v":"2015-16"},{"$f":"CRCP_y5","v":"2016-17"},{"$f":"FRCP_y1","v":"2017-18"},{"$f":"FRCP_y2","v":"2018-19"},{"$f":"FRCP_y3","v":"2019-20"},{"$f":"FRCP_y4","v":"2020-21"},{"$f":"FRCP_y5","v":"2021-22"},"Total "]
[null,null,null,null,null,null,null,null,null,null,null,null,{"$f":"CRCP_y3","v":"2014-15"},null,null,null,null,{"$f":"$Q$59","v":0},0,0,0,0,0,0]
[null,null,null,null,null,null,null,null,null,null,null,null,{"$f":"CRCP_y4","v":"2015-16"},null,null,null,null,null,null,null,{"$f":"$T$59","v":0},{"$f":"$T$59","v":0},{"$f":"$T$59","v":0},{"$f":"$T$59","v":0},{"$f":"$T$59","v":0}]
[null,null,null,null,null,null,null,null,null,null,null,null,{"$f":"CRCP_y5","v":"2016-17"},null,null,null,null,null,null,null,null,{"$f":"+$U$59","v":0},{"$f":"+$U$59","v":0},{"$f":"+$U$59","v":0},{"$f":"+$U$59","v":0},{"$f":"+$U$59","v":0}]
[null,null,null,null,null,null,null,null,null,null,null,null,{"$f":"CONCATENATE(\"Total Carryover Amount ($m, \",CRCP_y5,\")\")","v":"Total Carryover Amount ($m, 2016-17)"},null,null,null,null,null,null,null,null,{"$f":"+SUM(V65:V67)","v":0},{"$f":"+SUM(W65:W67)","v":0},{"$f":"+SUM(X65:X67)","v":0},{"$f":"+SUM(Y66:Y67)","v":0},{"$f":"+SUM(Z67)","v":0},{"$f":"SUM(V68:Z68)","v":0}]
[]
[null,null,null,null,null,null,null,null,null,null,null,null,{"$f":"CONCATENATE(\"PTRM inputs ($m, \",CRCP_y5,\")\")","v":"PTRM inputs ($m, 2016-17)"},null,null,null,null,null,null,null,null,{"$f":"V68","v":0},{"$f":"W68","v":0},{"$f":"X68","v":0},{"$f":"Y68","v":0},{"$f":"Z68","v":0},{"$f":"SUM(V70:Z70)","v":0}]
[]
[null,"7.5.2 - Proposed forecast opex for the EBSS for the forthcoming regulatory control period"]
[]
[null,null,"Forthcoming regulatory control period"]
[null,null,{"$f":"CONCATENATE(\"$m, real \",dms_DollarReal)","v":"$m, real June 2017"}]
[null,null,{"$f":"FRCP_y1","v":"2017-18"},{"$f":"FRCP_y2","v":"2018-19"},{"$f":"FRCP_y3","v":"2019-20"},{"$f":"FRCP_y4","v":"2020-21"},{"$f":"FRCP_y5","v":"2021-22"}]
[null,"Forecast opex",null,null,null,null,null,{"$f":"+SUM(A77:E77)","v":0},{"$f":"+SUM(B77:F77)","v":0},{"$f":"+SUM(C77:G77)","v":0}]
[null,"Less excluded costs"]
[null,"< Enter category proposed for exclusion >  eg. Debt raising costs",0,0,0,0,0,{"$f":"+SUM(A79:E79)","v":0},0,0]
[null,null,0,0,0,0,0,0,0,0]
[null,null,0,0,0,0,0,0,0,0]
[null,null,0,0,0,0,0,0,0,0]
[null,null,0,0,0,0,0,0,0,0]
[null,null,0,0,0,0,0,0,0,0]
[null,null,0,0,0,0,0,0,0,0]
[null,null,0,0,0,0,0,0,0,0]
[null,null,0,0,0,0,0,0,0,0]
[null,null,0,0,0,0,0,0,0,0]
[null,{"$f":"CONCATENATE(\"Adjusted forecast opex ($m, \",CRCP_y5,\")\")","v":"Adjusted forecast opex ($m, 2016-17)"},{"$f":"+C77-SUM(C79:C88)","v":0},0,0,0,0,{"$f":"+H77-SUM(H79:H88)","v":0},0,0]

{"sheet":"Unprotected 7.5 EBSS","index":31,"n_rows":96,"n_cols":27,"rows_kept":96,"cut":false,"hidden":false,"merged":[[74,12,74,15],[80,2,80,6],[81,2,81,6],[67,21,67,25],[68,16,68,26],[70,12,70,15],[72,12,72,15],[73,12,73,15],[71,12,71,15],[63,12,63,20],[67,16,67,20],[28,2,28,5],[28,6,28,10],[28,12,28,15],[28,16,28,20],[45,2,45,10],[45,12,45,20],[46,2,46,5],[46,6,46,10],[46,12,46,15],[46,16,46,20],[8,1,8,12],[11,1,11,2],[27,2,27,5],[27,6,27,10],[27,12,27,20]]}
[null,"REGULATORY REPORTING STATEMENT"]
[null,{"$f":"INDEX(dms_TradingNameFull_List,MATCH(dms_TradingName,dms_TradingName_List))","v":"Queensland Electricity Transmission Corporation Limited trading as Powerlink Queensland"}]
[null,{"$f":"CONCATENATE(FRCP_y1,\" to \",dms_FRCP_FinalYear_Num)","v":"2017-18 to 2021-22"}]
[null,"7.5 EBSS"]
[]
[]
[null,"Instructions "]
[null,"Powerlink is required to populate all input cells (yellow) in tableS 7.5.1 and 7.5.2 presented below."]
[null,"\nEfficiency gains are calculated using the formulae below.  Adjusted target and actual amounts are used to calculate the carry-over amounts.\n\nWe will calculate the efficiency gain in 2012–13 (year 6) as follows:\nE6 = (F6 – A6) – (F5 – A5) + (F3 – A3)\nwhere F6 is the forecast opex we approved for year 6 (2012-13), and A6 is the actual opex incurred for year 6, and so on. The formula references year 3 (2009-10) because it is the base year used to forecast opex."]
[]
[]
[null,"SELECT BASE YEAR USED TO FORECAST OPEX FOR 2017-22",null,"2014-15"]
[]
[]
[]
[null,"CPI "]
[null,null,"2006-07","2007-08","2008-09","2009-10","2010-11","2011-12","2012-13","2013-14","2014-15","2015-16","2016-17"]
[null,"ABS CPI index Jun qtr (old base)",157.5,164.6,167,172.1,178.3]
[null,"ABS CPI index Jun qtr (rebased index)",null,null,null,95.8,99.2,100.4,102.8,105.9,107.5,110,112.7]
[null,"Inflation rate (per cent) ",null,{"$f":"D18/C18-1","v":4.5079365079365052E-2},1.4580801944106936E-2,3.0538922155688653E-2,{"$f":"G18/F18-1","v":3.6025566531086683E-2},{"$f":"H19/G19-1","v":1.2096774193548487E-2},2.3904382470119501E-2,3.0155642023346418E-2,1.5108593012275628E-2,2.3255813953488413E-2,2.4545454545454648E-2]
[null,"Reconstructed cumulative index (2016-17=1)",{"$f":"D21/(1+D20)","v":0.77752967118716076},0.8125802150946454,0.82442828627464027,0.84960543753212936,0.88021295474711614,0.89086069210292806,0.91215616681455181,0.93966282165039927,0.95385980479148169,0.97604259094942314,1]
[]
[]
[]
[null,"7.5.1 - The carryover amounts that arise from applying the EBSS during the current regulatory control period"]
[]
[null,"7.5.1.1 - Opex allowance applicable to EBSS (EBSS target)"]
[null,null,"$m, Jun 2007",null,null,null,"$m,  Jun 2012",null,null,null,null,null,"$m, Jun 2017"]
[null,null,"Previous period",null,null,null,"Current regulatory control period",null,null,null,null,null,"Previous period",null,null,null,"Current regulatory control period"]
[null,null,{"$f":"PRCP_y2","v":"2008-09"},{"$f":"PRCP_y3","v":"2009-10"},{"$f":"PRCP_y4","v":"2010-11"},{"$f":"PRCP_y5","v":"2011-12"},{"$f":"CRCP_y1","v":"2012-13"},{"$f":"CRCP_y2","v":"2013-14"},{"$f":"CRCP_y3","v":"2014-15"},{"$f":"CRCP_y4","v":"2015-16"},{"$f":"CRCP_y5","v":"2016-17"},null,{"$f":"PRCP_y2","v":"2008-09"},{"$f":"PRCP_y3","v":"2009-10"},{"$f":"PRCP_y4","v":"2010-11"},{"$f":"PRCP_y5","v":"2011-12"},{"$f":"CRCP_y1","v":"2012-13"},{"$f":"CRCP_y2","v":"2013-14"},{"$f":"CRCP_y3","v":"2014-15"},{"$f":"CRCP_y4","v":"2015-16"},{"$f":"CRCP_y5","v":"2016-17"}]
[null,"Total opex allowance",null,154.227,147.589,151.91399999999999,177.93600000000001,184.71199999999999,189.464,196.54900000000001,202.292,null,null,{"$f":"+D31/$C$21","v":198.35513127688179},189.81783650089611,195.38032518817209,{"$f":"+G31/$H$21","v":199.73493227091635},{"$f":"+H31/$H$21","v":207.34105976095617},212.67522709163347,220.62821015936257,227.0747848605578]
[null,"Approved excludable costs - allowance ",null,0,0,0,0,0,0,0,0]
[null,"Equity raising costs",null,0,0,0,0,0,0,0,0,null,null,{"$f":"+D33/$C$21","v":0},0,0]
[null,"Debt raising costs",null,-2.26823,-2.3885000000000001,-2.5251999999999999,-3.4963563727433424,-3.7608800458814287,-3.9487082582602127,-4.0483570933985531,-4.1832705947625319,null,null,-2.9172262925179222,-3.0719084923835136,-3.2477217186379939,{"$f":"+G34/$H$21","v":-3.9246948526710628},-4.2216253104665045,-4.4324643496606173,-4.544321159621683,-4.6957629086627231]
[null,"Network support costs",null,-22.15,-8.2200000000000006,-8.3000000000000007,0,0,0,0,0,null,null,-28.487658826164882,-10.571943817204305,-10.674833781362011,0,0,0,0,0]
[null,"Insurance & Self Insurance",null,-5.9503000000000004,-6.1618199999999996,-6.3483499999999999,-8.6550563450977105,-9.1838293614270032,-9.9164781194194322,-10.446406428629475,-11.180242574694173,null,null,-7.6528269215949853,-7.9248679868279588,-8.1647687995071703,-9.7153869531126702,-10.30893993060581,-11.131345458750697,-11.726195264009382,-12.549933647091965]
[null,"Capex Efficiencies",null,-3.1947800000000002,-3.1947800000000002,-3.1947800000000002,0,0,0,0,0]
[null,"Network growth adjustment",null,0,0,0,-0.69511177643113342,-1.7388043988991058,-2.7482088891924832,-3.6453323742874493,-4.4394407513314036,null,null,0,0,0,-0.78026989246801537,-1.9518252565331597,-3.0848918507170606,-4.0919218982290397,-4.983316460906865]
[null,"Capitalisation policy changes",null,0,0,0,0,0,0,0,0,null,null,0,0,0,0,0,0,0,0]
[null,"Movements in provisions related to opex",null,-2.2746206128133704,-2.3396345403899721,-2.4497247910863513,-0.71449944004141452,-0.75129960995155431,-0.81990940853815475,-0.82279012746166069,-0.8542102504808583,null,null,-2.9254454165593402,-3.0090614250356933,-3.1506511993889852,-0.80203273797477515,-0.84334129523446388,-0.92035647751245064,-0.92359011319650564,-0.95885951423498739]
[null,"Opex associated with pass throughs",null,0,0,0,0,0,0,0,0,null,null,0,0,0,0,0,0,0,0]
[null,"Other adjustments or exclusions required by the EBSS ",null,0,0,0,0,0,0,0,0,null,null,0,0,0,0,0,0,0,0]
[null,"Forecast opex for EBSS purposes",null,{"$f":"(D31+SUM(D33:D42))","v":118.38906938718662},125.28426545961003,129.09594520891363,164.37497606568641,169.27718658384089,172.03069532458971,177.58611397622286,181.63483582873104,null,null,{"$f":"+SUM(N31:N42)","v":156.37197382004467},165.24005477944465,170.14234968927596,184.51254783468983,190.01532796811622,193.10616895499263,199.34218172430596,203.88691232966124]
[]
[null,"7.5.1.2 - Actual and estimated opex applicable to EBSS"]
[null,null,"$m, Actual",null,null,null,null,null,null,null,null,null,"$m, Jun 2017"]
[null,null,"Previous period",null,null,null,"Current regulatory control period",null,null,null,null,null,"Previous period",null,null,null,"Current regulatory control period"]
[null,null,{"$f":"PRCP_y2","v":"2008-09"},{"$f":"PRCP_y3","v":"2009-10"},{"$f":"PRCP_y4","v":"2010-11"},{"$f":"PRCP_y5","v":"2011-12"},{"$f":"CRCP_y1","v":"2012-13"},{"$f":"CRCP_y2","v":"2013-14"},{"$f":"CRCP_y3","v":"2014-15"},{"$f":"CRCP_y4","v":"2015-16"},{"$f":"CRCP_y5","v":"2016-17"},null,{"$f":"PRCP_y2","v":"2008-09"},{"$f":"PRCP_y3","v":"2009-10"},{"$f":"PRCP_y4","v":"2010-11"},{"$f":"PRCP_y5","v":"2011-12"},{"$f":"CRCP_y1","v":"2012-13"},{"$f":"CRCP_y2","v":"2013-14"},{"$f":"CRCP_y3","v":"2014-15"},{"$f":"CRCP_y4","v":"2015-16"},{"$f":"CRCP_y5","v":"2016-17"}]
[null,"Total opex ",null,151.88399999999999,150.88,160.38399999999999,167.37759669000005,181.01599999999999,211.26,216.54054402600002,null,null,null,{"$f":"+D49/F$21*(1+F$20)^0.5","v":181.47923608140582},174.47337242848232,181.11827123419346,{"$f":"+G49/I$21*(1+I$20)^0.5","v":185.67688005182436},195.52232032729091,223.14593475234969,224.42052028842065]
[null,"Approved excludable costs",null,0,0,0,0,0,0,0]
[null,{"$f":"B33","v":"Equity raising costs"},null,0,0,0,0,0,0,0,null,null,null,{"$f":"+D51/F$21*(1+F$20)^0.5","v":0},0,0]
[null,{"$f":"B34","v":"Debt raising costs"},null,-0.32,-0.249,-0.26500000000000001,-0.501,-0.5,-0.5,-1,null,null,null,-0.38235334561935341,-0.28793657035188297,-0.2992589153348294,-0.55577400288674195,-0.54006916606070987,-0.52813105829865969,-1.0363903041708185]
[null,{"$f":"B35","v":"Network support costs"},null,-12.718,0,0,0,0,-2.6440000000000001,-3.54,null,null,null,-15.196155779959176,0,0,0,0,-2.7927570362833127,-3.6688216767646975]
[null,{"$f":"B36","v":"Insurance & Self Insurance"},null,-6.7130000000000001,-7.3440000000000003,-7.5960000000000001,-7.8440000000000003,-8.1530000000000005,-8.3729999999999993,-8.5978370000000002,null,null,null,-8.0210562785709989,-8.4923942677278248,-8.5780027203145792,-8.7015793984902263,-8.8063678217859369,-8.8440827022693558,-8.910714903641118]
[null,"AEMC Levy",null,0,0,0,0,0,-3.79,-4.0999999999999996,null,null,null,0,0,0,0,0,-4.0032334219038406,-4.2492002471003554]
[null,"500Kv Write Off",null,0,0,0,0,0,-12.054,0,null,null,null,0,0,0,0,0,-12.73218355346409,0]
[null,"Redundancy related costs",null,0,0,0,0,0,0,-9.7564556160000002,null,null,null,0,0,0,0,0,0,-10.111496003495329]
[null,{"$f":"B38","v":"Network growth adjustment"},null,0,0,0,0,0,0,0,null,null,null,0,0,0,0,0,0,0]
[null,{"$f":"B39","v":"Capitalisation policy changes"},null,0,0,0,0,0,0,0,null,null,null,0,0,0,0,0,0,0]
[null,{"$f":"B40","v":"Movements in provisions related to opex"},null,0.46679354620000085,-1.0548444295000001,-1.9412489616000008,-1.3588734600000265E-2,-0.45092892627999914,0.25983895485586767,1.490399254799998,null,null,null,0.55775023157216419,-1.2197923184137294,-2.1922115420501131,-1.5074382081452528E-2,-0.48706561833738099,0.2744580444304941,1.5446353370181312]
[null,{"$f":"B42","v":"Other adjustments or exclusions required by the EBSS "},null,0,0,0,0,0,0,0,null,null,null,0,0,0,0,0,0,0]
[null,"Actual opex for EBSS purposes",null,{"$f":"D49+SUM(D51:D61)","v":132.59979354619998},142.2321555705,150.5817510384,159.01900795540004,171.91207107372,184.15883895485587,191.03665066480002,null,null,null,{"$f":"N49+SUM(N51:N61)","v":158.43742090882844},164.47324927198889,170.04879805649392,176.40445226836593,185.68881772110689,194.52000502456093,197.98853249026646]
[]
[null,null,null,null,null,null,null,null,null,null,null,null,{"$f":"CONCATENATE(\"Incremental gain ($m, \",dms_FRCP_FinalYear_Num,\")\")","v":"Incremental gain ($m, 2021-22)"}]
[null,null,null,null,null,null,null,null,null,null,null,null,null,null,null,null,{"$f":"(Q43-Q62)-(P43-P62)+(N43-N62)","v":5.9490968447580883},{"$f":"(R43-R62)-(Q43-Q62)","v":-3.7815853193145585},{"$f":"(S43-S62)-(R43-R62)","v":-5.7403463165776429},{"$f":"(T43-T62)-(S43-S62)","v":2.7674853036077991}]
[]
[null,null,null,null,null,null,null,null,null,null,null,null,"Carryover"]
[null,null,null,null,null,null,null,null,null,null,null,null,null,null,null,null,"Current regulatory control period",null,null,null,null,"Forthcoming regulatory control period"]
[null,null,null,null,null,null,null,null,null,null,null,null,null,null,null,null,{"$f":"CONCATENATE(\"$m, real \",dms_DollarReal)","v":"$m, real June 2017"}]
[null,null,null,null,null,null,null,null,null,null,null,null,null,null,null,null,{"$f":"CRCP_y1","v":"2012-13"},{"$f":"CRCP_y2","v":"2013-14"},{"$f":"CRCP_y3","v":"2014-15"},{"$f":"CRCP_y4","v":"2015-16"},{"$f":"CRCP_y5","v":"2016-17"},{"$f":"FRCP_y1","v":"2017-18"},{"$f":"FRCP_y2","v":"2018-19"},{"$f":"FRCP_y3","v":"2019-20"},{"$f":"FRCP_y4","v":"2020-21"},{"$f":"FRCP_y5","v":"2021-22"},"Total "]
[null,null,null,null,null,null,null,null,null,null,null,null,{"$f":"CRCP_y1","v":"2012-13"},null,null,null,null,{"$f":"$Q$65","v":5.9490968447580883},{"$f":"$Q$65","v":5.9490968447580883},5.9490968447580883,5.9490968447580883,{"$f":"$Q$65","v":5.9490968447580883}]
[null,null,null,null,null,null,null,null,null,null,null,null,{"$f":"CRCP_y2","v":"2013-14"},null,null,null,null,null,{"$f":"$R$65","v":-3.7815853193145585},{"$f":"$R$65","v":-3.7815853193145585},-3.7815853193145585,-3.7815853193145585,{"$f":"$R$65","v":-3.7815853193145585}]
[null,null,null,null,null,null,null,null,null,null,null,null,{"$f":"CRCP_y3","v":"2014-15"},null,null,null,null,null,null,{"$f":"$S$65","v":-5.7403463165776429},{"$f":"$S$65","v":-5.7403463165776429},{"$f":"$S$65","v":-5.7403463165776429},-5.7403463165776429,{"$f":"$S$65","v":-5.7403463165776429}]
[null,null,null,null,null,null,null,null,null,null,null,null,{"$f":"CRCP_y4","v":"2015-16"},null,null,null,null,null,null,null,{"$f":"$T$65","v":2.7674853036077991},{"$f":"$T$65","v":2.7674853036077991},2.7674853036077991,2.7674853036077991,{"$f":"$T$65","v":2.7674853036077991}]
[null,null,null,null,null,null,null,null,null,null,null,null,{"$f":"CRCP_y5","v":"2016-17"},null,null,null,null,null,null,null,null,{"$f":"$U$65","v":0},{"$f":"$U$65","v":0},0,0,{"$f":"$U$65","v":0}]
[null,null,null,null,null,null,null,null,null,null,null,null,{"$f":"CONCATENATE(\"Total Carryover Amount\")","v":"Total Carryover Amount"},null,null,null,null,null,null,null,null,{"$f":"+SUM(V71:V75)","v":-0.80534948752631408},{"$f":"+SUM(W72:W75)","v":-6.7544463322844024},{"$f":"+SUM(X73:X75)","v":-2.9728610129698438},{"$f":"+SUM(Y74:Y75)","v":2.7674853036077991},{"$f":"+SUM(Z75)","v":0},{"$f":"SUM(V76:Z76)","v":-7.7651715291727612}]
[]
[null,null,null,null,null,null,null,null,null,null,null,null,{"$f":"CONCATENATE(\"PTRM inputs\")","v":"PTRM inputs"},null,null,null,null,null,null,null,null,{"$f":"V76","v":-0.80534948752631408},{"$f":"W76","v":-6.7544463322844024},{"$f":"X76","v":-2.9728610129698438},{"$f":"Y76","v":2.7674853036077991},{"$f":"Z76","v":0},{"$f":"SUM(V78:Z78)","v":-7.7651715291727612}]
[]
[null,"7.5.2 - Proposed forecast opex for the EBSS for the forthcoming regulatory control period"]
[null,null,"Forthcoming regulatory control period"]
[null,null,{"$f":"CONCATENATE(\"$m, real \",dms_DollarReal)","v":"$m, real June 2017"}]
[null,null,{"$f":"FRCP_y1","v":"2017-18"},{"$f":"FRCP_y2","v":"2018-19"},{"$f":"FRCP_y3","v":"2019-20"},{"$f":"FRCP_y4","v":"2020-21"},{"$f":"FRCP_y5","v":"2021-22"}]
[null,"Forecast opex",196.89449932492701,196.03672139940113,195.11353824357761,194.39700578522832,194.27251432500898]
[null,"Less excluded costs"]
[null,"Insurance Premiums",7.6069970628740577,7.786258477911697,7.9426167637325236,8.0947811329273449,8.2864556435248531]
[null,"Self-Insurance",1.4856849163200536,1.4847439125145832,1.4778701104236474,1.4704054143914982,1.4689486613565468]
[null,"AEMC Levy",4.2,4.2,4.2,4.2,4.2]
[null,"Debt Raising ",3.6001069590761241,3.5685976033943958,3.5292962065765954,3.4822005545318926,3.4324239586567611]
[null,"Redundancy related costs",0,0,0,0,0]
[]
[]
[]
[]
[]
[null,"Adjusted forecast opex",{"$f":"+C84-SUM(C86:C95)","v":180.00171038665678},178.99712140558046,177.96375516284485,177.14961868337758,176.88468606147083]

{"sheet":"7.6 Indicative bill impact ","index":32,"n_rows":69,"n_cols":11,"rows_kept":69,"cut":false,"hidden":false,"merged":[[20,2,20,3],[28,2,28,3],[7,1,7,3]]}
[null,{"$f":"(LOOKUP(dms_Model,dms_Model_List,dms_Worksheet_List))","v":"REGULATORY REPORTING STATEMENT"}]
[null,{"$f":"INDEX(dms_TradingNameFull_List,MATCH(dms_TradingName,dms_TradingName_List))","v":"Queensland Electricity Transmission Corporation Limited trading as Powerlink Queensland"}]
[null,{"$f":"CONCATENATE(FRCP_y1,\" to \",dms_FRCP_FinalYear_Num)","v":"2017-18 to 2021-22"}]
[null,"7.6 INDICATIVE IMPACT ON TRANSMISSION CHARGES AND ELECTRICITY BILLS"]
[]
[]
[null,"7.6.1 Indicative impact of the revenue proposal on the average residential electricity bills"]
[null,{"$f":"CONCATENATE(\"Instructions\n\",dms_TradingName,\" is required to populate all input cells (yellow) in table 7.6.1 presented below.\nTransmission pricing impact should refer to \",dms_TradingName,\"'s related transmission costs only.\")","v":"Instructions\nPowerlink is required to populate all input cells (yellow) in table 7.6.1 presented below.\nTransmission pricing impact should refer to Powerlink's related transmission costs only."}]
[]
[null,"Transmission costs as a proportion of a typical residential customer's electricity bill (per cent)",9.2999999999999999E-2]
[null,"Transmission costs as a proportion of a typical business customer's electricity bill (per cent)",9.2999999999999999E-2]
[null,"Source data:","AEMC Final Report: 2015 Residential Electricity Price Trends. 4th December 2015"]
[]
[null,"Typical electricity bill - Residential customer"]
[null,"Tariff type","Description of tariff type",{"$f":"CONCATENATE(\"Annual bill amount \n($\", CRCP_y5,\")\")","v":"Annual bill amount \n($2016-17)"}]
[null,"Average Electricity Residential Bill QLD","Based of indicative usage of 2500kWh",856]
[null,"Average Electricity Residential Bill QLD","Based of indicative usage of 5173kWh",1438]
[]
[null,"<NSP to insert any additional items>"]
[null,"<NSP to insert any additional items>"]
[null,"Source data:","AEMC Final Report: 2015 Residential Electricity Price Trends 4th December 2015"]
[]
[null,"Typical electricity bill - Business customer"]
[null,"Tariff type","Description of tariff type",{"$f":"CONCATENATE(\"Annual bill amount \n($\", CRCP_y5,\")\")","v":"Annual bill amount \n($2016-17)"}]
[null,"Average Electricity Business Bill QLD","Based of indicative usage of 10000kWh",3014]
[null,"Average Electricity Business Bill QLD","Based of indicative usage of 20000kWh",5248.7994467496546]
[null,"<NSP to insert any additional items>"]
[null,"<NSP to insert any additional items>"]
[null,"Source data:","Energy Made Easy"]
[]
[null,"Indicative annual average transmission price impact as shown in the proposed PTRM (per cent)"]
[null,null,{"$f":"CRCP_y5","v":"2016-17"},{"$f":"FRCP_y1","v":"2017-18"},{"$f":"FRCP_y2","v":"2018-19"},{"$f":"FRCP_y3","v":"2019-20"},{"$f":"FRCP_y4","v":"2020-21"},{"$f":"FRCP_y5","v":"2021-22"},"Average"]
[null,"Annual price path (per cent, nominal)",null,-0.27667153603177674,2.0737448563578731E-2,2.239768113965579E-2,2.8097865783186293E-2,2.0336390739885468E-2,{"$f":"+AVERAGE(D33:H33)","v":-3.7020429961094094E-2}]
[null,"Annual price path (per cent, $2013-14)",null,-0.29396928846439885,-3.6725733884054312E-3,-2.0520437875490849E-3,3.5118260450817118E-3,-4.064040273415892E-3,{"$f":"+AVERAGE(D34:H34)","v":-6.0049223973737506E-2}]
[]
[]
[null,"Transmission bill component - Residential customer",{"$f":"CONCATENATE(\"Real \", CRCP_y5)","v":"Real 2016-17"}]
[null,"Tariff type",{"$f":"CRCP_y5","v":"2016-17"},{"$f":"FRCP_y1","v":"2017-18"},{"$f":"FRCP_y2","v":"2018-19"},{"$f":"FRCP_y3","v":"2019-20"},{"$f":"FRCP_y4","v":"2020-21"},{"$f":"FRCP_y5","v":"2021-22"},{"$f":"CONCATENATE(\"Total \",FRCP_y1,\" to \", FRCP_y5)","v":"Total 2017-18 to 2021-22"},"Annual average","Annual impact on customer bill (%)"]
[]
[null,{"$f":"+B16","v":"Average Electricity Residential Bill QLD"},{"$f":"+D16*$C$10","v":79.608000000000004},{"$f":"+C40*(1+IF($C$37=\"Nominal\",D$33,D$34))","v":56.20569288392614},{"$f":"+D40*(1+IF($C$37=\"Nominal\",E$33,E$34))","v":55.999273351963744},{"$f":"+E40*(1+IF($C$37=\"Nominal\",F$33,F$34))","v":55.884360390974585},{"$f":"+F40*(1+IF($C$37=\"Nominal\",G$33,G$34))","v":56.080616543308345},{"$f":"+G40*(1+IF($C$37=\"Nominal\",H$33,H$34))","v":55.852702659118343},{"$f":"+SUM(D40:H40)","v":280.02264582929115},{"$f":"+AVERAGE(D40:H40)","v":56.00452916585823}]
[null,"Annual change",null,{"$f":"+D40-C40","v":-23.402307116073864},{"$f":"+E40-D40","v":-0.20641953196239626},{"$f":"+F40-E40","v":-0.11491296098915882},{"$f":"+G40-F40","v":0.19625615233375981},{"$f":"+H40-G40","v":-0.22791388419000214},{"$f":"+SUM(D41:H41)","v":-23.755297340881661},{"$f":"+AVERAGE(D41:H41)","v":-4.7510594681763321},{"$f":"+J41/D16","v":-5.5503031170284255E-3}]
[]
[null,{"$f":"+B17","v":"Average Electricity Residential Bill QLD"},{"$f":"+D17*$C$10","v":133.73400000000001},{"$f":"+C43*(1+IF($C$37=\"Nominal\",D$33,D$34))","v":94.420311176502096},{"$f":"+D43*(1+IF($C$37=\"Nominal\",E$33,E$34))","v":94.073545654350312},{"$f":"+E43*(1+IF($C$37=\"Nominal\",F$33,F$34))","v":93.880502619417584},{"$f":"+F43*(1+IF($C$37=\"Nominal\",G$33,G$34))","v":94.210194613641818},{"$f":"+G43*(1+IF($C$37=\"Nominal\",H$33,H$34))","v":93.827320588565627},470.41187465247742,{"$f":"+AVERAGE(D43:H43)","v":94.08237493049549}]
[null,"Annual change",null,{"$f":"+D43-C43","v":-39.313688823497912},{"$f":"+E43-D43","v":-0.34676552215178447},{"$f":"+F43-E43","v":-0.19304303493272812},{"$f":"+G43-F43","v":0.32969199422423401},{"$f":"+H43-G43","v":-0.38287402507619106},-39.906679411434382,-7.9813358822868761,{"$f":"+J44/D17","v":-5.5503031170284255E-3}]
[]
[null,{"$f":"+B18","v":0},{"$f":"+D18*$C$10","v":0},{"$f":"+C46*(1+IF($C$37=\"Nominal\",D$33,D$34))","v":0},{"$f":"+D46*(1+IF($C$37=\"Nominal\",E$33,E$34))","v":0},{"$f":"+E46*(1+IF($C$37=\"Nominal\",F$33,F$34))","v":0},{"$f":"+F46*(1+IF($C$37=\"Nominal\",G$33,G$34))","v":0},{"$f":"+G46*(1+IF($C$37=\"Nominal\",H$33,H$34))","v":0},0,0]
[null,"Annual change",null,{"$f":"+D46-C46","v":0},{"$f":"+E46-D46","v":0},{"$f":"+F46-E46","v":0},{"$f":"+G46-F46","v":0},{"$f":"+H46-G46","v":0},0,0,{"$f":"+J47/D18","v":{"$error":"#DIV/0!"}}]
[]
[null,{"$f":"+B19","v":"<NSP to insert any additional items>"},{"$f":"+D19*$C$10","v":0},{"$f":"+C49*(1+IF($C$37=\"Nominal\",D$33,D$34))","v":0},{"$f":"+D49*(1+IF($C$37=\"Nominal\",E$33,E$34))","v":0},{"$f":"+E49*(1+IF($C$37=\"Nominal\",F$33,F$34))","v":0},{"$f":"+F49*(1+IF($C$37=\"Nominal\",G$33,G$34))","v":0},{"$f":"+G49*(1+IF($C$37=\"Nominal\",H$33,H$34))","v":0},0,0]
[null,"Annual change",null,{"$f":"+D49-C49","v":0},{"$f":"+E49-D49","v":0},{"$f":"+F49-E49","v":0},{"$f":"+G49-F49","v":0},{"$f":"+H49-G49","v":0},0,0,{"$f":"+J50/D19","v":{"$error":"#DIV/0!"}}]
[]
[null,{"$f":"+B20","v":"<NSP to insert any additional items>"},{"$f":"+D20*$C$10","v":0},{"$f":"+C52*(1+IF($C$37=\"Nominal\",D$33,D$34))","v":0},{"$f":"+D52*(1+IF($C$37=\"Nominal\",E$33,E$34))","v":0},{"$f":"+E52*(1+IF($C$37=\"Nominal\",F$33,F$34))","v":0},{"$f":"+F52*(1+IF($C$37=\"Nominal\",G$33,G$34))","v":0},{"$f":"+G52*(1+IF($C$37=\"Nominal\",H$33,H$34))","v":0},{"$f":"+SUM(D52:H52)","v":0},{"$f":"+AVERAGE(D52:H52)","v":0}]
[null,"Annual change",null,{"$f":"+D52-C52","v":0},{"$f":"+E52-D52","v":0},{"$f":"+F52-E52","v":0},{"$f":"+G52-F52","v":0},{"$f":"+H52-G52","v":0},{"$f":"+SUM(D53:H53)","v":0},{"$f":"+AVERAGE(D53:H53)","v":0},{"$f":"+J53/D20","v":{"$error":"#DIV/0!"}}]
[]
[]
[null,"Transmission bill component - Business customer",{"$f":"CONCATENATE(\"Real \", CRCP_y5)","v":"Real 2016-17"}]
[null,"Tariff type",{"$f":"CRCP_y5","v":"2016-17"},{"$f":"FRCP_y1","v":"2017-18"},{"$f":"FRCP_y2","v":"2018-19"},{"$f":"FRCP_y3","v":"2019-20"},{"$f":"FRCP_y4","v":"2020-21"},{"$f":"FRCP_y5","v":"2021-22"},{"$f":"CONCATENATE(\"Total \",FRCP_y1,\" to \", FRCP_y5)","v":"Total 2017-18 to 2021-22"},"Annual average","Annual impact on customer bill (%)"]
[]
[null,{"$f":"+B25","v":"Average Electricity Business Bill QLD"},{"$f":"+D25*$C$11","v":280.30200000000002},{"$f":"+C59*(1+IF($C$56=\"Nominal\",D$33,D$34))","v":197.90182050485208},{"$f":"+D59*(1+IF(D56=\"Nominal\",E$33,E$34))","v":197.17501154534898},{"$f":"+E59*(1+IF(E56=\"Nominal\",F$33,F$34))","v":196.77039978784742},{"$f":"+F59*(1+IF(F56=\"Nominal\",G$33,G$34))","v":197.46142320272352},{"$f":"+G59*(1+IF(G56=\"Nominal\",H$33,H$34))","v":196.65893202638165},{"$f":"+SUM(D59:H59)","v":985.96758706715366},{"$f":"+AVERAGE(D59:H59)","v":197.19351741343073}]
[null,"Annual change",null,{"$f":"+D59-C59","v":-82.400179495147938},{"$f":"+E59-D59","v":-0.72680895950310287},{"$f":"+F59-E59","v":-0.40461175750155576},{"$f":"+G59-F59","v":0.6910234148760992},{"$f":"+H59-G59","v":-0.80249117634187428},{"$f":"+SUM(D60:H60)","v":-83.643067973618372},{"$f":"+AVERAGE(D60:H60)","v":-16.728613594723676},{"$f":"+J60/D25","v":-5.5503031170284264E-3}]
[]
[null,{"$f":"+B26","v":"Average Electricity Business Bill QLD"},{"$f":"+D26*$C$11","v":488.1383485477179},{"$f":"+C62*(1+IF(C59=\"Nominal\",D$33,D$34))","v":344.64066555295852},{"$f":"+D62*(1+IF(D59=\"Nominal\",E$33,E$34))","v":343.3749474160864},{"$f":"+E62*(1+IF(E59=\"Nominal\",F$33,F$34))","v":342.67032698844122},{"$f":"+F62*(1+IF(F59=\"Nominal\",G$33,G$34))","v":343.87372556763592},{"$f":"+G62*(1+IF(G59=\"Nominal\",H$33,H$34))","v":342.47620889795945},1717.0358744230814,343.40717488461627]
[null,"Annual change",null,{"$f":"+D62-C62","v":-143.49768299475937},{"$f":"+E62-D62","v":-1.265718136872124},{"$f":"+F62-E62","v":-0.70462042764518173},{"$f":"+G62-F62","v":1.2033985791946975},{"$f":"+H62-G62","v":-1.3975166696764632},-145.66213964975844,-29.132427929951689,{"$f":"+J63/D26","v":-5.5503031170284264E-3}]
[]
[null,{"$f":"+B27","v":"<NSP to insert any additional items>"},{"$f":"+D27*$C$11","v":0},{"$f":"+C65*(1+IF(C62=\"Nominal\",D$33,D$34))","v":0},{"$f":"+D65*(1+IF(D62=\"Nominal\",E$33,E$34))","v":0},{"$f":"+E65*(1+IF(E62=\"Nominal\",F$33,F$34))","v":0},{"$f":"+F65*(1+IF(F62=\"Nominal\",G$33,G$34))","v":0},{"$f":"+G65*(1+IF(G62=\"Nominal\",H$33,H$34))","v":0},0,0]
[null,"Annual change",null,{"$f":"+D65-C65","v":0},{"$f":"+E65-D65","v":0},{"$f":"+F65-E65","v":0},{"$f":"+G65-F65","v":0},{"$f":"+H65-G65","v":0},0,0,{"$f":"+J66/D27","v":{"$error":"#DIV/0!"}}]
[]
[null,{"$f":"+B28","v":"<NSP to insert any additional items>"},{"$f":"+D28*$C$11","v":0},{"$f":"+C68*(1+IF(C65=\"Nominal\",D$33,D$34))","v":0},{"$f":"+D68*(1+IF(D65=\"Nominal\",E$33,E$34))","v":0},{"$f":"+E68*(1+IF(E65=\"Nominal\",F$33,F$34))","v":0},{"$f":"+F68*(1+IF(F65=\"Nominal\",G$33,G$34))","v":0},{"$f":"+G68*(1+IF(G65=\"Nominal\",H$33,H$34))","v":0},{"$f":"+SUM(D68:H68)","v":0},{"$f":"+AVERAGE(D68:H68)","v":0}]
[null,"Annual change",null,{"$f":"+D68-C68","v":0},{"$f":"+E68-D68","v":0},{"$f":"+F68-E68","v":0},{"$f":"+G68-F68","v":0},{"$f":"+H68-G68","v":0},{"$f":"+SUM(D69:H69)","v":0},{"$f":"+AVERAGE(D69:H69)","v":0},{"$f":"+J69/D28","v":{"$error":"#DIV/0!"}}]

{"sheet":"7.9 STPIS","index":33,"n_rows":169,"n_cols":12,"rows_kept":169,"cut":false,"hidden":false,"merged":[[10,11,11,11],[32,1,33,1],[32,2,33,2],[32,4,33,4],[32,5,32,11],[10,7,11,7],[10,8,11,8],[10,9,11,9],[10,10,11,10],[32,3,33,3],[29,1,29,4],[75,3,75,6],[76,3,76,4],[76,5,76,6],[7,1,7,5],[72,1,72,4],[10,1,11,1],[10,2,10,6],[55,1,55,4]]}
[null,{"$f":"(LOOKUP(dms_Model,dms_Model_List,dms_Worksheet_List))","v":"REGULATORY REPORTING STATEMENT"}]
[null,{"$f":"INDEX(dms_TradingNameFull_List,MATCH(dms_TradingName,dms_TradingName_List))","v":"Queensland Electricity Transmission Corporation Limited trading as Powerlink Queensland"}]
[null,{"$f":"CONCATENATE(FRCP_y1,\" to \",dms_FRCP_FinalYear_Num)","v":"2017-18 to 2021-22"}]
[null,"7.9 SERVICE TARGET PERFORMANCE INCENTIVE SCHEME (STPIS)"]
[]
[]
[null,"Instructions"]
[null,{"$f":"dms_TradingName&\" is required to provide the performance actuals for the most recent five years, and the proposed caps, collars and targets for the next regulatory control period for the parameters under the service component of the STPIS in table 7.9.1 below.\"","v":"Powerlink is required to provide the performance actuals for the most recent five years, and the proposed caps, collars and targets for the next regulatory control period for the parameters under the service component of the STPIS in table 7.9.1 below."}]
[]
[null,"7.9.1 Historical performance and proposed floor, caps and targets for the service component of the STPIS"]
[null,"Parameter","Performance actuals",null,null,null,null,"Average of actual performance","Floor","Target","Cap","Weighting \n(% of MAR)"]
[null,null,{"$f":"(LEFT(PRCP_y4,2)&RIGHT(PRCP_y4,2))","v":"2011"},{"$f":"LEFT(PRCP_y5,2)&RIGHT(PRCP_y5,2)","v":"2012"},{"$f":"(LEFT(CRCP_y1,2)&RIGHT(CRCP_y1,2))","v":"2013"},{"$f":"(LEFT(CRCP_y2,2)&RIGHT(CRCP_y2,2))","v":"2014"},{"$f":"(LEFT(CRCP_y3,2)&RIGHT(CRCP_y3,2))","v":"2015"}]
[null,"Unplanned outage circuit event rate:"]
[null,"Transmission line outage - fault","Refer \"Unprotected 7.9 STPIS\"",null,null,null,null,{"$f":"+AVERAGE(C14:G14)","v":{"$error":"#DIV/0!"}},null,null,null,2E-3]
[null,"Transformer outage – fault ",null,null,null,null,null,{"$f":"+AVERAGE(C15:G15)","v":{"$error":"#DIV/0!"}},null,null,null,2E-3]
[null,"Reactive plant – fault ",null,null,null,null,null,{"$error":"#DIV/0!"},null,null,null,1E-3]
[null,"Transmission line outage – forced outage",null,null,null,null,null,{"$error":"#DIV/0!"},null,null,null,1E-3]
[null,"Transformer outage – forced outage",null,null,null,null,null,{"$error":"#DIV/0!"},null,null,null,1E-3]
[null,"Reactive plant – forced outage",null,null,null,null,null,{"$error":"#DIV/0!"},null,null,null,5.0000000000000001E-4]
[null,"Loss of supply event frequency (number of events):"]
[null,">  (x) system minutes",null,null,null,null,null,{"$error":"#DIV/0!"},null,null,null,1.5E-3]
[null,">  (y) system minutes",null,null,null,null,null,{"$error":"#DIV/0!"},null,null,null,1.5E-3]
[null,"Average outage duration (minutes): ",null,null,null,null,null,{"$error":"#DIV/0!"},null,null,null,2E-3]
[null,"Proper operation of equipment (number of events):"]
[null,"Failure of protection system",null,null,null,null,null,{"$error":"#DIV/0!"},null,null,null,0]
[null,"Material failure of SCADA",null,null,null,null,null,{"$error":"#DIV/0!"},null,null,null,0]
[null,"Incorrect operational isolation of primary or secondary equipment",null,null,null,null,null,{"$error":"#DIV/0!"},null,null,null,0]
[]
[null,"Instructions"]
[null,{"$f":"dms_TradingName&\" is required to provide a list of proposed priority projects for the network capability incentive parameter including a brief description and the cost for each proposed project in table 7.9.2 below.\"","v":"Powerlink is required to provide a list of proposed priority projects for the network capability incentive parameter including a brief description and the cost for each proposed project in table 7.9.2 below."}]
[]
[null,"7.9.2 - Proposed priority projects for the network capability incentive parameter"]
[null,"Project ranking","Transmission Circuit /  Injection Point","Scope of works",{"$f":"CONCATENATE((\"If applicable, the present value of quantified benefits associated with the project\n ($0's, \"),CRCP_y5,\")\")","v":"If applicable, the present value of quantified benefits associated with the project\n ($0's, 2016-17)"},{"$f":"CONCATENATE((\"Project cost ($0's, \"),CRCP_y5,\")\")","v":"Project cost ($0's, 2016-17)"}]
[null,null,null,null,null,{"$f":"FRCP_y1","v":"2017-18"},{"$f":"FRCP_y2","v":"2018-19"},{"$f":"FRCP_y3","v":"2019-20"},{"$f":"FRCP_y4","v":"2020-21"},{"$f":"FRCP_y5","v":"2021-22"},"Opex","Capex"]
[null,1,"Refer \"Unprotected 7.9 STPIS\".",null,null,null,""]
[null,2]
[null,3]
[null,4]
[null,5]
[null,6]
[null,7]
[null,8]
[null,9]
[null,10]
[null,11]
[null,12]
[null,13]
[null,14]
[null,15]
[null,16]
[]
[]
[]
[]
[null,"Instructions"]
[null,{"$f":"dms_TradingName&\" is required to provide the following information in table 7.9.3 below.\"","v":"Powerlink is required to provide the following information in table 7.9.3 below."}]
[]
[null,"7.9.3 – Network limit information"]
[null,"Limit identification ","Define limit  ","Reason for the limit ","Is limit addressed by priority project","Supporting information reference"]
[null,"Refer \"Unprotected 7.9 STPIS\"."]
[]
[]
[]
[]
[]
[]
[]
[]
[]
[]
[]
[null,"Instructions"]
[null,{"$f":"dms_TradingName&\" is required to provide performance data in accordance with Appendix C of the STPIS for the preceding six calendar years in table 7.9.4 below.\n\n\"&dms_TradingName&\" is also required to provide relevant information in the MIC workbook attached to Appendix G of the Notice.\"","v":"Powerlink is required to provide performance data in accordance with Appendix C of the STPIS for the preceding six calendar years in table 7.9.4 below.\n\nPowerlink is also required to provide relevant information in the MIC workbook attached to Appendix G of the Notice."}]
[]
[null,"7.9.4 - Market impact component"]
[null,null,null,"Market impact parameter"]
[null,null,null,"Planned outage count(DI)",null,"Unplanned outage count (DI) "]
[null,"Year","Month","without exclusions","with exclusions","without exclusions","with exclusions","Market impact parameters"]
[null,{"$f":"LEFT(PRCP_y3,4)","v":"2009"},"January","Refer \"Unprotected 7.9 STPIS\".",null,null,null,{"$f":"+E79/12","v":0}]
[null,"2009","February",null,null,null,null,0]
[null,"2009","March",null,null,null,null,0]
[null,"2009","April",null,null,null,null,0]
[null,"2009","May",null,null,null,null,0]
[null,"2009","June",null,null,null,null,0]
[null,"2009","July",null,null,null,null,0]
[null,"2009","August",null,null,null,null,0]
[null,"2009","September",null,null,null,null,0]
[null,"2009","October",null,null,null,null,0]
[null,"2009","November",null,null,null,null,0]
[null,"2009","December",null,null,null,null,0]
[null,{"$f":"CONCATENATE(\"Total \",LEFT(PRCP_y3,4))","v":"Total 2009"},null,{"$f":"+SUM(D79:D90)","v":0},{"$f":"+SUM(E79:E90)","v":0},{"$f":"+SUM(F79:F90)","v":0},{"$f":"+SUM(G79:G90)","v":0},{"$f":"+SUM(H79:H90)","v":0}]
[null,{"$f":"LEFT(PRCP_y4,4)","v":"2010"},"January",null,null,null,null,{"$f":"+E92/12","v":0}]
[null,"2010","February",null,null,null,null,0]
[null,"2010","March",null,null,null,null,0]
[null,"2010","April",null,null,null,null,0]
[null,"2010","May",null,null,null,null,0]
[null,"2010","June",null,null,null,null,0]
[null,"2010","July",null,null,null,null,0]
[null,"2010","August",null,null,null,null,0]
[null,"2010","September",null,null,null,null,0]
[null,"2010","October",null,null,null,null,0]
[null,"2010","November",null,null,null,null,0]
[null,"2010","December",null,null,null,null,0]
[null,{"$f":"CONCATENATE(\"Total \", LEFT(PRCP_y4,4))","v":"Total 2010"},null,{"$f":"+SUM(D92:D103)","v":0},{"$f":"+SUM(E92:E103)","v":0},{"$f":"+SUM(F92:F103)","v":0},{"$f":"+SUM(G92:G103)","v":0},{"$f":"+SUM(H92:H103)","v":0}]
[null,{"$f":"LEFT(PRCP_y5,4)","v":"2011"},"January",null,null,null,null,{"$f":"+E105/12","v":0}]
[null,"2011","February",null,null,null,null,0]
[null,"2011","March",null,null,null,null,0]
[null,"2011","April",null,null,null,null,0]
[null,"2011","May",null,null,null,null,0]
[null,"2011","June",null,null,null,null,0]
[null,"2011","July",null,null,null,null,0]
[null,"2011","August",null,null,null,null,0]
[null,"2011","September",null,null,null,null,0]
[null,"2011","October",null,null,null,null,0]
[null,"2011","November",null,null,null,null,0]
[null,"2011","December",null,null,null,null,0]
[null,{"$f":"CONCATENATE(\"Total \", LEFT(PRCP_y5,4))","v":"Total 2011"},null,{"$f":"+SUM(D105:D116)","v":0},{"$f":"+SUM(E105:E116)","v":0},{"$f":"+SUM(F105:F116)","v":0},{"$f":"+SUM(G105:G116)","v":0},{"$f":"+SUM(H105:H116)","v":0}]
[null,{"$f":"LEFT(CRCP_y1,4)","v":"2012"},"January",null,null,null,null,{"$f":"+E118/12","v":0}]
[null,"2012","February",null,null,null,null,0]
[null,"2012","March",null,null,null,null,0]
[null,"2012","April",null,null,null,null,0]
[null,"2012","May",null,null,null,null,0]
[null,"2012","June",null,null,null,null,0]
[null,"2012","July",null,null,null,null,0]
[null,"2012","August",null,null,null,null,0]
[null,"2012","September",null,null,null,null,0]
[null,"2012","October",null,null,null,null,0]
[null,"2012","November",null,null,null,null,0]
[null,"2012","December",null,null,null,null,0]
[null,{"$f":"CONCATENATE(\"Total \", LEFT(CRCP_y1,4))","v":"Total 2012"},null,{"$f":"+SUM(D118:D129)","v":0},{"$f":"+SUM(E118:E129)","v":0},{"$f":"+SUM(F118:F129)","v":0},{"$f":"+SUM(G118:G129)","v":0},{"$f":"+SUM(H118:H129)","v":0}]
[null,{"$f":"LEFT(CRCP_y2,4)","v":"2013"},"January",null,null,null,null,{"$f":"+E131/12","v":0}]
[null,"2013","February",null,null,null,null,0]
[null,"2013","March",null,null,null,null,0]
[null,"2013","April",null,null,null,null,0]
[null,"2013","May",null,null,null,null,0]
[null,"2013","June",null,null,null,null,0]
[null,"2013","July",null,null,null,null,0]
[null,"2013","August",null,null,null,null,0]
[null,"2013","September",null,null,null,null,0]
[null,"2013","October",null,null,null,null,0]
[null,"2013","November",null,null,null,null,0]
[null,"2013","December",null,null,null,null,0]
[null,{"$f":"CONCATENATE(\"Total \", LEFT(CRCP_y2,4))","v":"Total 2013"},null,{"$f":"+SUM(D131:D142)","v":0},{"$f":"+SUM(E131:E142)","v":0},{"$f":"+SUM(F131:F142)","v":0},{"$f":"+SUM(G131:G142)","v":0},{"$f":"+SUM(H131:H142)","v":0}]
[null,{"$f":"LEFT(CRCP_y3,4)","v":"2014"},"January",null,null,null,null,{"$f":"+E144/12","v":0}]
[null,"2014","February",null,null,null,null,0]
[null,"2014","March",null,null,null,null,0]
[null,"2014","April",null,null,null,null,0]
[null,"2014","May",null,null,null,null,0]
[null,"2014","June",null,null,null,null,0]
[null,"2014","July",null,null,null,null,0]
[null,"2014","August",null,null,null,null,0]
[null,"2014","September",null,null,null,null,0]
[null,"2014","October",null,null,null,null,0]
[null,"2014","November",null,null,null,null,0]
[null,"2014","December",null,null,null,null,0]
[null,{"$f":"CONCATENATE(\"Total \", LEFT(CRCP_y3,4))","v":"Total 2014"},null,{"$f":"+SUM(D144:D155)","v":0},{"$f":"+SUM(E144:E155)","v":0},{"$f":"+SUM(F144:F155)","v":0},{"$f":"+SUM(G144:G155)","v":0},{"$f":"+SUM(H144:H155)","v":0}]
[null,{"$f":"LEFT(CRCP_y4,4)","v":"2015"},"January",null,null,null,null,{"$f":"+E157/12","v":0}]
[null,"2015","February",null,null,null,null,0]
[null,"2015","March",null,null,null,null,0]
[null,"2015","April",null,null,null,null,0]
[null,"2015","May",null,null,null,null,0]
[null,"2015","June",null,null,null,null,0]
[null,"2015","July",null,null,null,null,0]
[null,"2015","August",null,null,null,null,0]
[null,"2015","September",null,null,null,null,0]
[null,"2015","October",null,null,null,null,0]
[null,"2015","November",null,null,null,null,0]
[null,"2015","December",null,null,null,null,0]
[null,{"$f":"CONCATENATE(\"Total \", LEFT(CRCP_y4,4))","v":"Total 2015"},null,{"$f":"+SUM(D157:D168)","v":0},{"$f":"+SUM(E157:E168)","v":0},{"$f":"+SUM(F157:F168)","v":0},{"$f":"+SUM(G157:G168)","v":0},{"$f":"+SUM(H157:H168)","v":0}]

{"sheet":"Unprotected 7.9 STPIS","index":34,"n_rows":153,"n_cols":11,"rows_kept":153,"cut":false,"hidden":false,"merged":[[7,0,7,4],[10,0,11,0],[10,1,10,5],[10,6,11,6],[10,7,11,7],[10,9,11,9],[10,10,11,10],[29,0,29,3],[32,0,33,0],[32,1,33,1],[32,2,33,2],[32,3,33,3],[32,4,32,10],[10,8,11,8],[41,0,41,3],[56,0,56,3],[59,2,59,5],[60,2,60,3],[60,4,60,5]]}
["REGULATORY REPORTING STATEMENT"]
["Queensland Electricity Transmission Corporation Limited trading as Powerlink Queensland"]
["2017-18 to 2021-22"]
["7.9 SERVICE TARGET PERFORMANCE INCENTIVE SCHEME (STPIS)"]
[]
[]
["Instructions"]
["Powerlink is required to provide the performance actuals for the most recent seven years, and the proposed caps, collars and targets for the next regulatory control period for the parameters under the service component of the STPIS in table 7.9.1 below."]
[]
["7.9.1 Historical performance and proposed floor, caps and targets for the service component of the STPIS"]
["Parameter","Performance actuals",null,null,null,null,"Average of actual performance","Floor","Target","Cap","Weighting \n(% of MAR)"]
[null,"2011","2012","2013","2014","2015"]
["Unplanned outage circuit event rate:"]
["Transmission line outage - fault",0.26315789473684209,0.23357664233576642,0.16637781629116119,0.19594594594594594,0.1851851851851852,{"$f":"+AVERAGE(B14:F14)","v":0.20884869689898017},27.169999999999998,20.880000000000003,15.86,2E-3]
["Transformer outage – fault ",0.20958083832335325,0.17857142857142858,0.18397626112759644,0.19411764705882356,0.1791907514450867,{"$f":"+AVERAGE(B15:F15)","v":0.18908738530525768},20.84,18.91,17.09,2E-3]
["Reactive plant – fault ",0.35074626865671649,0.39130434782608697,0.23655913978494625,0.29078014184397161,0.22302158273381295,0.29848229616910682,43.419999999999995,29.849999999999998,19.489999999999998,1E-3]
["Transmission line outage – forced outage",0.17293233082706766,0.23357664233576642,0.21837088388214906,0.22297297297297297,0.17171717171717168,0.20391400034702559,24.09,20.39,15.9,1E-3]
["Transformer outage – forced outage",0.22754491017964071,0.17261904761904762,0.21958456973293766,0.18823529411764706,0.15028901734104047,0.1916545677980627,23.49,19.170000000000002,13.96,1E-3]
["Reactive plant – forced outage",0.18656716417910449,0.21739130434782608,0.28673835125448027,0.31914893617021278,0.20143884892086331,0.24225692097449741,34.25,24.23,15.950000000000001,5.0000000000000001E-4]
["Loss of supply event frequency (number of events):"]
[">  (x) system minutes",7,2,1,5,2,3.4,7,3,1,1.5E-3]
[">  (y) system minutes",2,0,0,2,1,1,3,1,0,1.5E-3]
["Average outage duration (minutes): ",86.769421575429149,26.086666666666662,5.6214285714285719,115.971,236.2286666,94.135436682704878,282,94.14,4.83,2E-3]
["Proper operation of equipment (number of events):"]
["Failure of protection system",27,38,39,23,25,30.4,null,null,null,0]
["Material failure of SCADA",0,0,1,0,1,0.4,null,null,null,0]
["Incorrect operational isolation of primary or secondary equipment",11,20,9,10,8,11.6,null,null,null,0]
[]
["Instructions"]
["Powerlink is required to provide a list of proposed priority projects for the network capability incentive parameter including a brief description and the cost for each proposed project in table 7.9.2 below."]
[]
["7.9.2 - Proposed priority projects for the network capability incentive parameter"]
["Project ranking","Transmission Circuit /  Injection Point","Scope of works","If applicable, the present value of quantified benefits associated with the project\n ($0's, 2016-17)","Project cost ($0's, 2016-17)"]
[null,null,null,null,"2017-18","2018-19","2019-20","2020-21","2021-22","Opex","Capex"]
[1,"Bouldercombe to Raglan and Larcom Creek to Calliope River 275kV","Increase design temperature of Bouldercombe to Raglan and Larcom Creek to Calliope River 275kV Transmission Lines",505646,22524,483122,0,0,0,505646,0]
[2,"Greenbank 275kV Substation","Greenbank System Integrity Protection Scheme (SIPS)",1821523,30611,1790912,0,0,0,1821523,0]
[3,"Network wide","Load Model Enhancement and Validation",876852,21883,618866,62540,114870,58693,876852,0]
[]
[]
[]
["Instructions"]
["Powerlink is required to provide the following information in table 7.9.3 below."]
[]
["7.9.3 – Network limit information"]
["Limit identification ","Define limit  ","Reason for the limit ","Is limit addressed by priority project","Supporting information reference"]
["Bouldercombe to Raglan transmission line","Feeder is rated at 541MVA, summer rating.","Feeder is rated to a lower design temperature to maintain ground clearance.","Yes","Refer RIN attachment - STPIS NCC Network Limits Information"]
["Larcom Creek to Calliope River transmission line","Feeder is rated at 541MVA, summer  rating.","Feeder is rated to a lower design temperature to maintain ground clearance.","Yes","Refer RIN attachment - STPIS NCC Network Limits Information"]
["Gold Coast cutset","Voltage stability constraint Q^NIL_GC.","To manage voltage stability in the Gold Coast area for specific outages at Greenbank.","Yes","Refer RIN attachment - STPIS NCC Network Limits Information"]
["Feeder 835 Greenbank to Mudgeeraba cutset","Feeder is limited to 300MVA.","Specific outages at Greenbank result in the stability limit being reached. ","Yes","Refer RIN attachment - STPIS NCC Network Limits Information"]
["Blackwall to Belmont transmission line","Feeder is rated at 718MVA, summer rating.","Specific outages at Greenbank result in the thermal limit being reached. Feeder is rated to the design temperature.","Yes","Refer RIN attachment - STPIS NCC Network Limits Information"]
["Blackwall to Goodna transmission line","Feeder is rated at 718MVA, summer rating.","Specific outages at Greenbank result in the thermal limit being reached. Feeder is rated to the design temperature.","Yes","Refer RIN attachment - STPIS NCC Network Limits Information"]
["Swanbank E to Greenbank transmission line","Feeder is rated at 618MVA, summer rating.","Specific outages at Greenbank result in the thermal limit being reached. Feeder is rated to the design temperature.","Yes","Refer RIN attachment - STPIS NCC Network Limits Information"]
["Goodna to Belmont transmission line","Feeder is rated at 718MVA, summer rating.","Specific outages at Greenbank result in the thermal limit being reached. Feeder is rated to the design temperature.","Yes","Refer RIN attachment - STPIS NCC Network Limits Information"]
[]
[]
["Instructions"]
["Powerlink is required to provide performance data in accordance with Appendix C of the STPIS for the preceding six calendar years in table 7.9.4 below.\n\nPowerlink is also required to provide relevant information in the MIC workbook attached to Appendix G of the Notice."]
[]
["7.9.4 - Market impact component"]
[null,null,"Market impact parameter"]
[null,null,"Planned outage count(DI)",null,"Unplanned outage count (DI) "]
["Year","Month","without exclusions","with exclusions","without exclusions","with exclusions","Market impact parameters"]
["2009","January",0,0,47,47,{"$f":"(SUM(D63,F63)/12)","v":3.9166666666666665}]
["2009","February",0,0,0,0,{"$f":"(SUM(D64,F64)/12)","v":0}]
["2009","March",0,0,18,0,0]
["2009","April",0,0,30,14,1.1666666666666667]
["2009","May",0,0,0,0,0]
["2009","June",3,3,0,0,0.25]
["2009","July",16,0,0,0,0]
["2009","August",0,0,0,0,0]
["2009","September",5,0,0,0,0]
["2009","October",0,0,196,0,0]
["2009","November",75,67,631,12,6.583333333333333]
["2009","December",0,0,276,0,0]
["Total 2009",null,{"$f":"+SUM(C63:C74)","v":99},{"$f":"+SUM(D63:D74)","v":70},{"$f":"+SUM(E63:E74)","v":1198},{"$f":"+SUM(F63:F74)","v":73},{"$f":"+SUM(G63:G74)","v":11.916666666666666}]
["2010","January",0,0,12,12,1]
["2010","February",0,0,120,0,0]
["2010","March",0,0,0,0,0]
["2010","April",110,1,0,0,8.3333333333333329E-2]
["2010","May",1347,1331,2,0,110.91666666666667]
["2010","June",39,38,13,11,4.083333333333333]
["2010","July",1,1,0,0,8.3333333333333329E-2]
["2010","August",39,4,0,0,0.33333333333333331]
["2010","September",0,0,0,0,0]
["2010","October",19,0,1,0,0]
["2010","November",4,3,0,0,0.25]
["2010","December",0,0,4,4,0.33333333333333331]
["Total 2010",null,{"$f":"+SUM(C76:C87)","v":1559},{"$f":"+SUM(D76:D87)","v":1378},{"$f":"+SUM(E76:E87)","v":152},{"$f":"+SUM(F76:F87)","v":27},{"$f":"+SUM(G76:G87)","v":117.08333333333331}]
["2011","January",4,2,795,0,0.16666666666666666]
["2011","February",6,0,11,0,0]
["2011","March",62,0,3,0,0]
["2011","April",36,2,0,0,0.16666666666666666]
["2011","May",0,0,0,0,0]
["2011","June",25,0,0,0,0]
["2011","July",4,0,0,0,0]
["2011","August",0,0,48,0,0]
["2011","September",1,1,0,0,8.3333333333333329E-2]
["2011","October",0,0,1,1,8.3333333333333329E-2]
["2011","November",31,31,0,0,2.5833333333333335]
["2011","December",172,0,0,0,0]
["Total 2011",null,{"$f":"+SUM(C89:C100)","v":341},{"$f":"+SUM(D89:D100)","v":36},{"$f":"+SUM(E89:E100)","v":858},{"$f":"+SUM(F89:F100)","v":1},{"$f":"+SUM(G89:G100)","v":3.0833333333333335}]
["2012","January",105,0,53,0,0]
["2012","February",0,0,5,0,0]
["2012","March",0,0,0,0,0]
["2012","April",1,1,0,0,8.3333333333333329E-2]
["2012","May",5,5,25,0,0.41666666666666669]
["2012","June",0,0,0,0,0]
["2012","July",0,0,0,0,0]
["2012","August",0,0,0,0,0]
["2012","September",11,0,0,0,0]
["2012","October",6,0,0,0,0]
["2012","November",99,99,31,0,8.25]
["2012","December",0,0,292,0,0]
["Total 2012",null,{"$f":"+SUM(C102:C113)","v":227},{"$f":"+SUM(D102:D113)","v":105},{"$f":"+SUM(E102:E113)","v":406},{"$f":"+SUM(F102:F113)","v":0},{"$f":"+SUM(G102:G113)","v":8.75}]
["2013","January",0,0,2,0,0]
["2013","February",0,0,19,13,1.0833333333333333]
["2013","March",0,0,14,0,0]
["2013","April",0,0,0,0,0]
["2013","May",6,0,4,3,0.25]
["2013","June",87,81,0,0,6.75]
["2013","July",5,0,0,0,0]
["2013","August",0,0,0,0,0]
["2013","September",0,0,0,0,0]
["2013","October",1,0,0,0,0]
["2013","November",0,0,0,0,0]
["2013","December",0,0,0,0,0]
["Total 2013",null,{"$f":"+SUM(C115:C126)","v":99},{"$f":"+SUM(D115:D126)","v":81},{"$f":"+SUM(E115:E126)","v":39},{"$f":"+SUM(F115:F126)","v":16},{"$f":"+SUM(G115:G126)","v":8.0833333333333339}]
["2014","January",39,0,0,0,0]
["2014","February",0,0,0,0,{"$f":"(SUM(D129,F129)/12)","v":0}]
["2014","March",13,0,0,0,0]
["2014","April",8,0,0,0,0]
["2014","May",149,2,0,0,0.16666666666666666]
["2014","June",25,25,0,0,2.0833333333333335]
["2014","July",833,811,0,0,67.583333333333329]
["2014","August",115,6,0,0,0.5]
["2014","September",1850,1192,9,5,99.75]
["2014","October",1930,1900,17,0,158.33333333333334]
["2014","November",97,0,0,0,0]
["2014","December",44,0,0,0,0]
["Total 2014",null,{"$f":"+SUM(C128:C139)","v":5103},{"$f":"+SUM(D128:D139)","v":3936},{"$f":"+SUM(E128:E139)","v":26},{"$f":"+SUM(F128:F139)","v":5},{"$f":"+SUM(G128:G139)","v":328.41666666666663}]
["2015","January",323,0,30,1,{"$f":"(SUM(D141,F141)/12)","v":8.3333333333333329E-2}]
["2015","February",15,0,337,0,0]
["2015","March",6,0,0,0,0]
["2015","April",361,2,0,0,0.16666666666666666]
["2015","May",68,0,0,0,0]
["2015","June",1,0,0,0,0]
["2015","July",20,1,0,0,8.3333333333333329E-2]
["2015","August",249,0,0,0,0]
["2015","September",774,1,3,0,8.3333333333333329E-2]
["2015","October",268,58,2,0,4.833333333333333]
["2015","November",10,3,33,0,0.25]
["2015","December",6,0,2,0,0]
["Total 2015",null,{"$f":"+SUM(C141:C152)","v":2101},{"$f":"+SUM(D141:D152)","v":65},{"$f":"+SUM(E141:E152)","v":407},{"$f":"+SUM(F141:F152)","v":1},{"$f":"+SUM(G141:G152)","v":5.5}]

{"sheet":"Unprotected Worksheet (5)","index":35,"n_rows":0,"n_cols":0,"rows_kept":0,"cut":false,"hidden":false,"merged":[]}

{"sheet":"Unprotected Worksheet (6)","index":36,"n_rows":0,"n_cols":0,"rows_kept":0,"cut":false,"hidden":false,"merged":[]}

{"sheet":"Unprotected Worksheet (7)","index":37,"n_rows":0,"n_cols":0,"rows_kept":0,"cut":false,"hidden":false,"merged":[]}

{"sheet":"Unprotected Worksheet (8)","index":38,"n_rows":0,"n_cols":0,"rows_kept":0,"cut":false,"hidden":false,"merged":[]}