{"text_format":"1","workbook":"xlsx","n_sheets":37,"sheets":["AER Sheet Heading","AER CF","AER NRs","AER lookups","AER ETL","Instructions","CONTENTS","Business & other details","CPI series","2.1 Expenditure summary","2.1 Unprotected Exp Summary","2.1 Balancing Item","2.2 Repex","2.3 Augex (a)","2.3 Augex (b)","2.5 Connections","2.6 Non-network","2.10 Overheads","2.11 Labour","2.14 Forecast price changes","2.16 Opex Summary","2.17 Step Changes","3.1 Revenue","3.2 Operating expenditure","3.3 Assets (RAB)","3.3 Unprotected Assets (RAB)","3.4 Operational data","3.5 Physical assets","3.7 Operating environment","5.4 MD & Utilisation - Spatial","7.1  Policies and Procedures","7.2 Contingent projects","7.3 Obligations","7.4 Shared Assets","7.9 STPIS","7.9 STPIS (Alternative)","8.2 Capex"],"not_rendered":{"charts":0,"images":5,"macros":1,"external_links":1,"defined_names":611,"comments":1,"pivot_tables":0},"unopened":[],"bounds":{"document_bytes":16777216,"sheet_cells":100000,"rows_first":2000,"rows_last":500,"rows_between":2000,"halvings":0,"cell_chars":16384,"cell_head_chars":4096},"cells_cut":0,"cells_raw":0,"read":"whole","date_system":"1900"}

{"sheet":"AER Sheet Heading","index":0,"n_rows":44,"n_cols":9,"rows_kept":44,"cut":false,"hidden":true,"merged":[[41,2,41,8],[42,2,42,8],[10,2,10,8],[11,2,11,8]]}
[null,{"$f":"INDEX(dms_Worksheet_List,MATCH(dms_Model,dms_Model_List))","v":"REGULATORY REPORTING STATEMENT"}]
[null,{"$f":"INDEX(dms_TradingNameFull_List,MATCH(dms_TradingName,dms_TradingName_List))","v":"Queensland Electricity Transmission Corporation Limited trading as Powerlink Queensland"}]
[null,{"$f":"dms_Header_Span","v":"2020-21 - 2026-27"}]
[null,"XX"]
[]
[]
[]
[]
[]
[]
[null,null,"EXPENDITURE"]
[null,null,{"$f":"CONCATENATE(\"Forecast ($0's, real \",dms_DollarReal,\")\")","v":"Forecast ($0's, real June 2022)"}]
[null,null,{"$f":"dms_y1","v":"2020-21"},{"$f":"dms_y2","v":"2021-22"},{"$f":"dms_y3","v":"2022-23"},{"$f":"dms_y4","v":"2023-24"},{"$f":"dms_y5","v":"2024-25"},{"$f":"dms_y6","v":"2025-26"},{"$f":"dms_y7","v":"2026-27"}]
[]
[]
[]
[]
[]
[]
[]
[]
[]
[]
[]
[]
[]
[]
[]
[]
[]
[]
[]
[]
[]
[]
[]
[]
[]
[]
[]
[]
[null,null,"VOLUMES"]
[null,null,"0's"]
[null,null,{"$f":"CRCP_y4","v":"2020-21"},{"$f":"CRCP_y5","v":"2021-22"},{"$f":"FRCP_y1","v":"2022-23"},{"$f":"FRCP_y2","v":"2023-24"},{"$f":"FRCP_y3","v":"2024-25"},{"$f":"FRCP_y4","v":"2025-26"},{"$f":"FRCP_y5","v":"2026-27"}]

{"sheet":"AER CF","index":1,"n_rows":75,"n_cols":25,"rows_kept":75,"cut":false,"hidden":true,"merged":[[3,1,3,22],[38,38,38,59],[39,38,39,59],[40,38,40,59],[38,69,38,90],[39,69,39,90],[40,69,40,90]]}
[null,"AER CONDITIONAL FORMATTING"]
[]
[null,"CELLS FLAGED \"Y\" and greyed out will be greyed out in the worksheets."]
[null,"CONDITIONAL FORMATTING MAP"]
[null,null,null,null,null,"=INDEX(dms_CF_3.6.1, MATCH(dms_TradingName,dms_CF_TradingName))=\"Y\"","=INDEX(dms_CF_3.6.5, MATCH(dms_TradingName,dms_CF_TradingName))=\"Y\"","=INDEX(dms_CF_3.6.6.1, MATCH(dms_TradingName,dms_CF_TradingName))=\"Y\"","=INDEX(dms_CF_3.6.6.2, MATCH(dms_TradingName,dms_CF_TradingName))=\"Y\"","=INDEX(dms_CF_3.6.6.3, MATCH(dms_TradingName,dms_CF_TradingName))=\"Y\"","=INDEX(dms_CF_3.6.7.1, MATCH(dms_TradingName,dms_CF_TradingName))=\"Y\"","=INDEX(dms_CF_3.6.7.2, MATCH(dms_TradingName,dms_CF_TradingName))=\"Y\"","=INDEX(dms_CF_3.6.7.3, MATCH(dms_TradingName,dms_CF_TradingName))=\"Y\"","=INDEX(dms_CF_3.6.7.4, MATCH(dms_TradingName,dms_CF_TradingName))=\"Y\"","=INDEX(dms_CF_3.6.8, MATCH(dms_TradingName,dms_CF_TradingName))=\"Y\"","=INDEX(dms_CF_4.1, MATCH(dms_TradingName,dms_CF_TradingName))=\"Y\"","=INDEX(dms_CF_6.8, MATCH(dms_TradingName,dms_CF_TradingName))=\"Y\"","=INDEX(dms_CF_7.12, MATCH(dms_TradingName,dms_CF_TradingName))=\"Y\"","=INDEX(dms_CF_8.1_A, MATCH(dms_TradingName,dms_CF_TradingName))=\"Y\"","=INDEX(dms_CF_8.1_B, MATCH(dms_TradingName,dms_CF_TradingName))=\"Y\"",{"$f":"INDEX(dms_CF_8.1_Neg, MATCH(dms_TradingName,dms_CF_TradingName))=\"Y\"","v":true},"=INDEX(dms_CF_4.4.1_Neg, MATCH(dms_TradingName,dms_CF_TradingName))=\"Y\"",null,null,"=INDEX(dms_CF_F10, MATCH(dms_TradingName,dms_CF_TradingName))=\"Y\""]
[null,"dms_CF_TradingName","JurisdictionList","Sector","Segment","dms_CF_3.6.1","dms_CF_3.6.5","dms_CF_3.6.6.1","dms_CF_3.6.6.2","dms_CF_3.6.6.3","dms_CF_3.6.7.1","dms_CF_3.6.7.2","dms_CF_3.6.7.3","dms_CF_3.6.7.4","dms_CF_3.6.8","dms_CF_4.1","dms_CF_6.8 (set from dms_MAIFI_flag)","dms_CF_7.12","dms_CF_8.1_A  (and 8.4)","dms_CF_8.1_B  (and 8.4)","dms_CF_8.1_Neg  (and 8.4)","dms_CF_4.4.1","dms_CF_MAIFI_flag (set from dms_MAIFI_flag)","9.5 TUOS (set from Jurisdiction)","dms_CF_F10"]
[null,"Ausgrid","NSW","Electricity","Distribution",null,"Y","N","Y","Y","N","N","N","Y","N","N",{"$f":"IFERROR(IF(dms_MAIFI_flag=\"Yes\",\"N\",\"Y\"),\"Y\")","v":"Y"},"Y","N","Y","Y","N",{"$f":"IFERROR(LEFT(dms_MAIFI_flag),\"N\")","v":"N"},{"$f":"IF('AER CF'!$C7=\"Vic\",\"Y\",\"N\")","v":"N"}]
[null,"Ausgrid (Tx Assets)","NSW","Electricity","Distribution",null,"Y","N","Y","Y","N","N","N","Y","N","N","Y","Y","N","Y","Y","N",{"$f":"IFERROR(LEFT(dms_MAIFI_flag),\"N\")","v":"N"},{"$f":"IF('AER CF'!$C8=\"Vic\",\"Y\",\"N\")","v":"N"}]
[null,"AusNet (D)","Vic","Electricity","Distribution",null,"N","N",null,null,"N","N","N","N","N","N","Y","N","N","N","Y","N",{"$f":"IFERROR(LEFT(dms_MAIFI_flag),\"N\")","v":"N"},{"$f":"IF('AER CF'!$C9=\"Vic\",\"Y\",\"N\")","v":"Y"}]
[null,"AusNet (T)","Vic","Electricity","Transmission",null,"N",null,null,null,"N","N","N","N","N","Y","Y","N","N","N","Y","N","N",{"$f":"IF('AER CF'!$C10=\"Vic\",\"Y\",\"N\")","v":"Y"}]
[null,"Amadeus","NT","Gas","Transmission",null,"N",null,null,null,"N","N","N","N","N","Y","Y","N","N","N","Y","N","N",{"$f":"IF('AER CF'!$C11=\"Vic\",\"Y\",\"N\")","v":"N"},"N"]
[null,"APA GasNet","Vic","Gas","Transmission",null,"N",null,null,null,"N","N","N","N","N","Y","Y","N","N","N","Y","N","N",{"$f":"IF('AER CF'!$C12=\"Vic\",\"Y\",\"N\")","v":"Y"},"Y"]
[null,"Australian Distribution Co.","NSW","Electricity","Distribution","N","N","N","N",null,"N","N","N","N","N","N","Y","N","N","N","N","N","N",{"$f":"IF('AER CF'!$C13=\"Vic\",\"Y\",\"N\")","v":"N"}]
[null,"Australian Distribution Co. (Vic)","Vic","Electricity","Distribution","N","N","N","N",null,"N","N","N","N","N","N","Y","N","N","N","N","N","N",{"$f":"IF('AER CF'!$C14=\"Vic\",\"Y\",\"N\")","v":"Y"}]
[null,"CitiPower","Vic","Electricity","Distribution",null,"N","N",null,null,"N","N","N","N","N","N","Y","N","N","N","Y","N","N",{"$f":"IF('AER CF'!$C15=\"Vic\",\"Y\",\"N\")","v":"Y"}]
[null,"Directlink","Qld","Electricity","Transmission",null,"N",null,null,null,"N","N","N","N","N","Y","Y","N","N","Y","Y","N","N",{"$f":"IF('AER CF'!$C16=\"Vic\",\"Y\",\"N\")","v":"N"}]
[null,"ElectraNet","SA","Electricity","Transmission",null,"N",null,null,null,"N","N","N","N","N","Y","Y","N","N","Y","Y","N","N",{"$f":"IF('AER CF'!$C17=\"Vic\",\"Y\",\"N\")","v":"N"}]
[null,"Endeavour Energy","NSW","Electricity","Distribution",null,"Y","N","Y","Y","N","N","N","Y","N","N","Y","Y","N","Y","Y","Y","N",{"$f":"IF('AER CF'!$C18=\"Vic\",\"Y\",\"N\")","v":"N"}]
[null,"Energex","Qld","Electricity","Distribution",null,"Y","N",null,null,"N","N","N","N","N","N","Y","Y","N","Y","Y","Y","N",{"$f":"IF('AER CF'!$C19=\"Vic\",\"Y\",\"N\")","v":"N"}]
[null,"Ergon Energy","Qld","Electricity","Distribution",null,"Y","N","Y","Y","N","N","N","N","N","N","Y","Y","N","Y","Y","N","N",{"$f":"IF('AER CF'!$C20=\"Vic\",\"Y\",\"N\")","v":"N"}]
[null,"Essential Energy","NSW","Electricity","Distribution",null,"Y","N","Y","Y","N","N","N","Y","N","N","Y","Y","N","Y","Y","N","N",{"$f":"IF('AER CF'!$C21=\"Vic\",\"Y\",\"N\")","v":"N"}]
[null,"Evoenergy Distribution","ACT","Electricity","Distribution",null,"Y","N","Y","Y","Y","Y","N","Y","N","Y","Y","Y","N","Y","Y","N","N",{"$f":"IF('AER CF'!$C22=\"Vic\",\"Y\",\"N\")","v":"N"}]
[null,"Evoenergy Distribution (Tx Assets)","ACT","Electricity","Distribution",null,"Y","N","Y","Y","Y","Y","N","Y","N","Y","Y","Y","N","Y","Y","N","N",{"$f":"IF('AER CF'!$C23=\"Vic\",\"Y\",\"N\")","v":"N"}]
[null,"Jemena Electricity","Vic","Electricity","Distribution",null,"N","N",null,null,"N","N","N","N","N","N","Y","N","N","N","Y","N","N",{"$f":"IF('AER CF'!$C24=\"Vic\",\"Y\",\"N\")","v":"Y"}]
[null,"Murraylink","SA","Electricity","Transmission",null,"N",null,null,null,"N","N","N","N","N","Y","Y","N","N","Y","Y","N","N",{"$f":"IF('AER CF'!$C25=\"Vic\",\"Y\",\"N\")","v":"N"}]
[null,"Power and Water","NT","Electricity","Distribution",null,"N","N",null,null,"N","Y","N","N","N","Y","Y","Y","N","Y","Y","N","N",{"$f":"IF('AER CF'!$C26=\"Vic\",\"Y\",\"N\")","v":"N"}]
[null,"Powercor Australia","Vic","Electricity","Distribution",null,"N","N",null,null,"N","N","N","N","N","N","Y","N","N","N","Y","N","N",{"$f":"IF('AER CF'!$C27=\"Vic\",\"Y\",\"N\")","v":"Y"}]
[null,"Powerlink","Qld","Electricity","Transmission",null,"N",null,null,null,"N","N","N","N","N","Y","Y","N","N","Y","Y","N","N",{"$f":"IF('AER CF'!$C28=\"Vic\",\"Y\",\"N\")","v":"N"}]
[null,"Roma to Brisbane Pipeline","Qld","Gas","Transmission",null,"N",null,null,null,"N","N","N","N","N","Y","Y","N","N","N","Y","N","N",{"$f":"IF('AER CF'!$C29=\"Vic\",\"Y\",\"N\")","v":"N"},"Y"]
[null,"SA Power Networks","SA","Electricity","Distribution",null,"Y","N",null,null,"N","N","N","N","N","N","Y","Y","N","Y","N","N","N",{"$f":"IF('AER CF'!$C30=\"Vic\",\"Y\",\"N\")","v":"N"}]
[null,"TasNetworks (D)","Tas","Electricity","Distribution",null,"Y","N",null,null,"N","N","N","N","N","N","Y","Y","N","Y","Y","N","N",{"$f":"IF('AER CF'!$C31=\"Vic\",\"Y\",\"N\")","v":"N"}]
[null,"TasNetworks (T)","Tas","Electricity","Transmission",null,"N",null,null,null,"N","N","N","N","N","Y","Y","N","N","Y","Y","N","N",{"$f":"IF('AER CF'!$C32=\"Vic\",\"Y\",\"N\")","v":"N"}]
[null,"TransGrid","NSW","Electricity","Transmission",null,"N",null,null,null,"N","N","N","N","N","Y","Y","N","N","Y","Y","N","N",{"$f":"IF('AER CF'!$C33=\"Vic\",\"Y\",\"N\")","v":"N"}]
[null,"United Energy","Vic","Electricity","Distribution",null,"N","N",null,null,"N","N","N","N","N","N","Y","N","N","N","Y","N","N",{"$f":"IF('AER CF'!$C34=\"Vic\",\"Y\",\"N\")","v":"Y"}]
[]
[]
[null,"Confidential"]
[null,"Amended"]
[]
[null,"Worksheet 6.2 STPIS reliability"]
[null,"Formula",null,null,null,"Applied to:"]
[]
[null,"=INDEX(dms_CBD_flag,MATCH(dms_TradingName,dms_TradingName_List))=\"NO\"",null,null,null,"$D$11,$D$17,$D$23,$D$33,$D$39,$D$45,$D$55,$D$61,$D$67,$D$77,$D$83,$D$89"]
[null,"=INDEX(dms_Urban_flag,MATCH(dms_TradingName,dms_TradingName_List))=\"NO\"",null,null,null,"$D$12,$D$18,$D$24,$D$56,$D$62,$D$78,$D$68,$D$84"]
[null,"=INDEX(dms_ShortRural_flag,MATCH(dms_TradingName,dms_TradingName_List))=\"NO\"",null,null,null,"$D$13,$D$19,$D$25,$D$57,$D$63,$D$69,$D$79,$D$85"]
[null,"=INDEX(dms_LongRural_flag,MATCH(dms_TradingName,dms_TradingName_List))=\"NO\"",null,null,null,"$D$14,$D$20,$D$26,$D$58,$D$64,$D$65,$D$70,$D$71,$D$80,$D$86"]
[null,"=INDEX(dms_FeederType_5_flag,MATCH(dms_TradingName,dms_TradingName_List))=\"NO\"",null,null,null,"$D$87,$D$81,$D$71,$D$65,$D$59,$D$49,$D$43,$D$37,$D$21,$D$15"]
[null,"=dms_MAIFI_Flag=\"No\"",null,null,null,"$D$55:$D$72"]
[]
[]
[null,"Business & other details"]
[null,"=(INDEX(dms_Model_Span,MATCH(dms_Model,dms_Model_List))>1)"]
[null,"=(INDEX(dms_Model_Span,MATCH(dms_Model,dms_Model_List))=1)"]
[]
[]
[null,"STYLES IN USE"]
[null,"HEADING ONE","dms_1"]
[null,"HEADING TWO","dms_2"]
[null,"HEADING THREE","dms_3"]
[null,"HEADING FOUR","dms_4"]
[null,"HEADING FIVE","dms_5"]
[null,5.1109999999999998,"dms_NUM"]
[null,5.45E-2,"dms_NUM%"]
[null,5.5555000000000003,"dms_NUM3d"]
[null,"Text description","dms_Row_Locked"]
[null,"Text description","dms_Row1"]
[null,"Text description","dms_Row2"]
[null,"Total","dms_T1"]
[null,"Total","dms_T2"]
[null,"EXPENSES","dms_BH"]
[null,2019,"dms_BY1"]
[null,2019,"dms_BY2"]
[null,"VOLUMES","dms_GH"]
[null,2019,"dms_GY1"]
[null,2019,"dms_GY2"]

{"sheet":"AER NRs","index":2,"n_rows":227,"n_cols":15,"rows_kept":227,"cut":false,"hidden":true,"merged":[[4,1,27,1],[175,1,176,1],[178,1,183,1],[64,1,77,1],[134,1,149,1],[83,1,96,1],[151,1,157,1],[117,1,131,1],[207,1,212,1],[198,1,199,1],[31,1,54,1],[99,1,106,1],[109,1,114,1],[190,1,191,1],[194,1,195,1],[159,1,173,1],[32,67,32,88],[33,67,33,88],[34,67,34,88],[35,10,39,10],[43,10,44,10],[32,10,34,10],[32,36,32,57],[33,36,33,57],[34,36,34,57]]}
[null,"AER NAMED RANGES"]
[]
[null,"DROP DOWN SELECTORS USED IN WORKBOOKS"]
[]
[null,"COVER SHEET","dms_DataQuality_List","dms_Confid_status_List"]
[null,null,"-- select --","-- select --"]
[null,null,"Actual","Public"]
[null,null,"Estimate","Confidential"]
[null,null,"Consolidated"]
[]
[]
[null,null,"For all files either AER or business needs to be able to specify the type of submission","For PTRM & RFM templates we must provide a choice in case they change their form of control - otherwise it is drawn from the business specific lookup table above."]
[null,null,"dms_SourceList","dms_FormControl_Choices"]
[null,null,"-- select --","Revenue cap"]
[null,null,"After appeal","Revenue yield"]
[null,null,"Draft decision","Weighted average price cap"]
[null,null,"Final decision"]
[null,null,"PTRM update 1"]
[null,null,"PTRM update 2"]
[null,null,"PTRM update 3"]
[null,null,"PTRM update 4"]
[null,null,"PTRM update 5"]
[null,null,"PTRM update 6"]
[null,null,"PTRM update 7"]
[null,null,"Recast"]
[null,null,"Regulatory proposal"]
[null,null,"Reporting"]
[null,null,"Revised regulatory proposal"]
[]
[]
[null,null,null,null,null,null,null,null,null,null,"This is used to create an image to insert on 6.3 STPIS sheet - not for dropdown lists.",null,null,"GAS"]
[null,"CA & RESET RINS \nDNSP","dms_DNSP_020301_SubstationType","dms_DNSP_020301_ProjectType","dms_DNSP_020301_ProjectTrigger","dms_DNSP_020302_ProjectType","dms_DNSP_020302_ProjectTrigger","dms_STPIS_Exclusion_List","dms_Reason_Interruption","dms_Reason_Interruption_Detailed","Reason for interruption",null,null,"dms_N0205_AssetType"]
[null,null,"Subtransmission substation","New substation establishment","Demand growth","New line on new route - single circuit","Demand growth","Weather","Animal","Animal impact","Animal","Animal impact",null,"Cast Iron"]
[null,null,"Zone substation","Substation upgrade - capacity"," Voltage issues","New line on new route - dual circuit"," Voltage issues","Equipment failure","Asset failure","Animal nesting/burrowing, etc and other",null,"Animal nesting/burrowing, etc and other",null,"PVC"]
[null,null,"Switching station","Substation upgrade - voltage"," Reactive power issue","New line on new route - other"," Reactive power issue","Operational error","Other","Other",null,"Other",null,"Polyamide"]
[null,null,"Other","Other"," Fault level issues","Line rebuild over existing route - single circuit"," Fault level issues","Vegetation","Overloads","LV","Asset failure","LV",null,"High density polyethylene (80)"]
[null,null,null,null," Safety","Line rebuild over existing route - dual circuit"," Net market benefit","Animals","Planned","Distribution substation",null,"Distribution substation",null,"High density polyethylene (100)"]
[null,null,null,null," Environment","Reconductor - Single circuit"," Safety","Third party impacts","Network business","HV",null,"HV",null,"High density polyethylene (250)"]
[null,null,null,null," Other","Reconductor - Dual circuit"," Environment","Transmission failure","Third party","Zone substation",null,"Zone substation",null,"High density polyethylene (575)"]
[null,null,null,null,null,"Reconductor - Other"," Other","Load shedding","Unknown","Subtransmission",null,"Subtransmission",null,"Medium density polyethylene"]
[null,null,null,null,null,"Line upgrade - raising/retensoring",null,"Inter-distributor connection failure","Vegetation","insert description of 'other'","Other","insert description of 'other'",null,"Unprotected steel"]
[null,null,null,null,null,"Line upgrade - voltage upgrade",null,"Other","Weather","Network error","Overloads",null,null,"Protected steel"]
[null,null,null,null,null,"Line upgrade - capacity",null,null,"2 - STPIS Exclusion (3.3)(a)","Switching and protection error","Planned",null,null,"Other"]
[null,null,null,null,null,"String spare circuit",null,null,"3 - STPIS Exclusion (3.3)(a)","Fire","Network business","Network error"]
[null,null,null,null,null,"Other",null,null,"4 - STPIS Exclusion (3.3)(a)","Other",null,"Switching and protection error"]
[null,null,null,null,null,null,null,null,"5 - STPIS Exclusion (3.3)(a)","Dig-in","Third party","Fire"]
[null,null,null,null,null,null,null,null,"6 - STPIS Exclusion (3.3)(a)","Unauthorised access",null,"Other"]
[null,null,null,null,null,null,null,null,"7 - STPIS Exclusion (3.3)(a)","Vehicle impact",null,"Dig-in"]
[null,null,null,null,null,null,null,null,null,"Unknown",null,"Unauthorised access"]
[null,null,null,null,null,null,null,null,null,"Blow-in/Fall-in - NSP responsibility",null,"Vehicle impact"]
[null,null,null,null,null,null,null,null,null,"Grow-in - NSP responsibility","Unknown","Unknown"]
[null,null,null,null,null,null,null,null,null,"Blow-in/Fall-in - Other responsible party","Vegetation","Blow-in/Fall-in - NSP responsibility"]
[null,null,null,null,null,null,null,null,null,"Grow-in - Other responsible party",null,"Grow-in - NSP responsibility"]
[null,null,null,null,null,null,null,null,null,null,null,"Blow-in/Fall-in - Other responsible party"]
[null,null,null,null,null,null,null,null,null,null,null,"Grow-in - Other responsible party"]
[null,null,null,null,null,null,null,null,null,null,"Weather"]
[null,null,null,null,null,null,null,null,null,null,"2 - STPIS Exclusion (3.3)(a)"]
[null,null,null,null,null,null,null,null,null,null,"3 - STPIS Exclusion (3.3)(a)"]
[null,null,null,null,null,null,null,null,null,null,"4 - STPIS Exclusion (3.3)(a)"]
[null,null,null,null,null,null,null,null,null,null,"5 - STPIS Exclusion (3.3)(a)"]
[null,null,null,null,null,null,null,null,null,null,"6 - STPIS Exclusion (3.3)(a)"]
[null,null,null,null,null,null,null,null,null,null,"7 - STPIS Exclusion (3.3)(a)"]
[]
[]
[null,"CA & RESET RINS \nTNSP ","dms_TNSP_0203_SubstationType","dms_TNSP_020301_ProjectType","dms_TNSP_020301_ProjectTrigger","dms_TNSP_020302_ProjectType","dms_TNSP_0203_ProjectTrigger"]
[null,null,"Terminal station","New substation establishment","Demand growth","New line on new route - single circuit","Demand growth"]
[null,null,"Switching station","Capacity upgrade"," Voltage issues","New line on new route - dual circuit"," Voltage issues"]
[null,null,"Transmission substation","Voltage upgrade"," Reactive power issue","New line on new route - other"," Reactive power issue"]
[null,null,"Other","Other"," Fault level issues","Line rebuild over existing route - single circuit"," Fault level issues"]
[null,null,null,null,"Net market benefit","Line rebuild over existing route - dual circuit"," Net market benefit"]
[null,null,null,null," Safety","Reconductor - Single circuit"," Safety"]
[null,null,null,null," Environment","Reconductor - Dual circuit"," Environment"]
[null,null,null,null," Other","Reconductor - Other"," Other"]
[null,null,null,null,null,"Line upgrade - raising/retensoring"]
[null,null,null,null,null,"Line upgrade - voltage upgrade"]
[null,null,null,null,null,"Line upgrade - capacity"]
[null,null,null,null,null,"String spare circuit"]
[null,null,null,null,null,"Other"]
[]
[]
[]
[null,"NAMED RANGES USED IN ETL PROCESS"]
[null,null,null,null,null,null,null,null,null,null,null,null,"GAS ARR & RESET"]
[null,"CA & RESET RINS \nDNSP ONLY","dms_020303_01_UOM","dms_020501_01_UOM","dms_020501_02_UOM","dms_020501_03_UOM","dms_020501_04_UOM","dms_020701_01_UOM","dms_020701_02_UOM","dms_020701_01_Rows","dms_040102_01_UOM","dms_040102_04_UOM","dms_S140101_UOM","dms_E050201_UOM","dms_E050302_UOM"]
[null,null,"Circuit line length in km","0's","0's","0's","0's","km","km","Route line length within zone","0's","days","number","per metre per connection","metres per connection"]
[null,null,"Circuit line length in km","0's","0's","0's","0's","0's","0's","Number of maintenance spans","0's","0's","number","per service per connection","number per connection"]
[null,null,"Circuit line length in km","MVA added","MVA added","MVA added","MVA added","km","km","Total length of maintenance spans","0's","$0s","number","number per connection","number per connection"]
[null,null,"Circuit line length in km","0's","0's","0's","0's","km","km","Length of vegetation corridors","$0s","0's","km"]
[null,null,"Number","total spend $0s","total spend $0s","total spend $0s","total spend $0s","0's","0's","Average number of trees per maintenance span"]
[null,null,"Number","net circuit km added","net circuit km added","net circuit km added","net circuit km added","years","years","Average frequency of cutting cycle"]
[null,null,"Number","total spend $0s","total spend $0s","total spend $0s","total spend $0s"]
[null,null,null,"net circuit km added","net circuit km added","net circuit km added","net circuit km added"]
[null,null,null,"total spend $0s","total spend $0s","total spend $0s","total spend $0s"]
[null,null,null,"0's",null,"$0s"]
[null,null,null,"0's"]
[null,null,null,"0's"]
[null,null,null,"$0s"]
[]
[]
[null,"CA & RESET RINS \nTNSP ONLY","dms_020701_01_UOM"]
[null,null,"km"]
[null,null,"0's"]
[null,null,"km"]
[null,null,"0's"]
[null,null,"km"]
[null,null,"metres"]
[null,null,"years"]
[]
[]
[null,"CA & RESET RINS \nDNSP & TNSP","dms_020603_01_UOM"]
[null,null,"0's"]
[null,null,"0's"]
[null,null,"0's"]
[null,null,"0's"]
[null,null,"(per cent)"]
[]
[]
[null,"EB & RESET RINS \nDNSP ONLY","dms_030601_01_UOM","dms_030601_02_UOM","dms_030701_01_UOM","dms_030702_01_UOM","dms_030703_01_UOM"]
[null,null,"minutes/customer","minutes/customer","Customer / km","%","km"]
[null,null,"minutes/customer","minutes/customer","MWh/customer","Number of spans"]
[null,null,"interruptions/customer","interruptions/customer","kVA / customer","Number of spans"]
[null,null,"interruptions/customer","interruptions/customer",null,"Number of spans"]
[null,null,null,null,null,"Number of spans"]
[null,null,null,null,null,"Years"]
[null,null,null,null,null,"Years"]
[null,null,null,null,null,"Trees"]
[null,null,null,null,null,"Trees"]
[null,null,null,null,null,"Defects"]
[null,null,null,null,null,"Defects"]
[null,null,null,null,null,"Spans"]
[null,null,null,null,null,"km"]
[null,null,null,null,null,"Spans"]
[]
[null,null,"WHEN INSERTING COVER SHEET INTO A TNSP FILE - APPLY THESE NAMED RANGES"]
[null,"EB & RESET RINS \nTNSP ONLY","dms_030601_01_UOM",null,"dms_030701_01_UOM","dms_030702_01_UOM"]
[null,null,"%",null,"Number of spans","km"]
[null,null,"number",null,"Years","%"]
[null,null,"number",null,"Trees","km"]
[null,null,"%",null,"Defects","number"]
[null,null,"number",null,"Number of spans"]
[null,null,"number",null,"km"]
[null,null,"%",null,"km"]
[null,null,"number",null,"Number of spans"]
[null,null,"number"]
[null,null,"%"]
[null,null,"number"]
[null,null,"%"]
[null,null,"number"]
[null,null,"%"]
[null,null,"number"]
[]
[null,"EB & RESET RINS \nDNSP & TNSP","dms_EB_RAB_PIT"]
[null,null,"Beginning of year"]
[null,null,"End of year"]
[null,null,"End of year"]
[null,null,"End of year"]
[null,null,"End of year"]
[null,null,"End of year"]
[]
[null,"ARR \nDNSP ONLY","dms_030605_UOM","dms_03060703_UOM","dms_E020202_UOM","Spare"]
[null,null,"number","number","Length of mains replaced"]
[null,null,"number","number","Number of services replaced"]
[null,null,"number","number"]
[null,null,"number","number"]
[null,null,"number","(per cent)"]
[null,null,"number"]
[null,null,"number"]
[null,null,"number"]
[null,null,"number"]
[null,null,"number"]
[null,null,"number"]
[null,null,"number"]
[null,null,"(per cent)"]
[null,null,"(per cent)",""]
[]
[null,"RFM","dms_Beg","dms_Mid","dms_End"]
[null,null,"Beginning of year","Mid year","End of Year"]
[]
[null,"PTRM","dms_PTRM_RAB_PIT","dms_PTRM_TAB_PIT","DMS_Xfactor"]
[null,null,"Beginning of year","Beginning of year","x factors"]
[null,null,"End of year","End of year"]
[null,null,"End of year","End of year"]
[null,null,"End of year","End of year"]
[null,null,"End of year"]
[]
[]
[null,"STPIS & MIC NAMED RANGES "]
[]
[null,"These \"row descriptions\" are the column headings in the various templates but become row descriptions in the ETL process"]
[]
[null,"Table 6.3 sustained interruptions - row descriptions","dms_060301_CustNo_Affected_Row","dms_060301_Avg_Duration_Sustained_Int_Row","dms_060301_Effect_unplanned_SAIDI_Row","dms_060301_Effect_unplanned_SAIFI_Row"]
[null,null,"Number of customers affected by the interruption","Average duration of sustained customer interruption","Effect on unplanned SAIDI","Effect on unplanned SAIFI"]
[]
[]
[null,"Table 6.1 telephone answering - row descriptions and start date","dms_060101_Rows","dms_060102_Rows","dms_060101_StartDateTxt"]
[null,null,"Total number of calls \n(after removing excluded events)","Number of calls answered within 30 seconds \n(after excluding excluded events) ",{"$f":"dms_060701_StartDateTxt","v":"1-Jul-2015"}]
[]
[]
[null,"Table 6.8.1 - row descriptions","dms_060801_01_Rows","dms_060801_02_Rows","dms_060801_03_Rows","dms_060801_04_Rows"]
[null,null,"Number of interruptions","Duration of interruptions","Total unplanned minutes off supply","Effect on unplanned MAIFI"]
[]
[]
[null,"Table 7.9.4 - market impact component - row descriptions","dms_070904_01_Rows","without exclusions","with exclusions"]
[]
[]
[null,"These headings (Lists) are determined from the INDEX/MATCH function on the NSP selected on the Business & other details sheet"]
[]
[null,"Table 6.7.1 - daily performance data - unplanned - MAIFI  -- row descriptions and header named range values","dms_060701_Feeder_Header_Lvl4",{"$f":"INDEX(dms_FeederName_1,MATCH(dms_TradingName,dms_TradingName_List))","v":"CBD"},{"$f":"INDEX(dms_FeederName_1,MATCH(dms_TradingName,dms_TradingName_List))","v":"CBD"},{"$f":"INDEX(dms_FeederName_2,MATCH(dms_TradingName,dms_TradingName_List))","v":"Urban"},{"$f":"INDEX(dms_FeederName_2,MATCH(dms_TradingName,dms_TradingName_List))","v":"Urban"},{"$f":"INDEX(dms_FeederName_3,MATCH(dms_TradingName,dms_TradingName_List))","v":"Short rural"},{"$f":"INDEX(dms_FeederName_3,MATCH(dms_TradingName,dms_TradingName_List))","v":"Short rural"},{"$f":"INDEX(dms_FeederName_4,MATCH(dms_TradingName,dms_TradingName_List))","v":"Long rural"},{"$f":"INDEX(dms_FeederName_4,MATCH(dms_TradingName,dms_TradingName_List))","v":"Long rural"},{"$f":"IF((INDEX(dms_FeederName_5,MATCH(dms_TradingName,dms_TradingName_List))=0),\"Network\",(INDEX(dms_FeederName_5,MATCH(dms_TradingName,dms_TradingName_List))))","v":"Network"},{"$f":"IF((INDEX(dms_FeederName_5,MATCH(dms_TradingName,dms_TradingName_List))=0),\"Network\",(INDEX(dms_FeederName_5,MATCH(dms_TradingName,dms_TradingName_List))))","v":"Network"},"Network","Network"]
[]
[null,null,"dms_060701_Rows","All events","After removing excluded events","All events","After removing excluded events","All events","After removing excluded events","All events","After removing excluded events","All events","After removing excluded events","All events","After removing excluded events"]
[null,null,null,"the number of column headings changes from 10 to 12 depending on the number of feeder categories for the NSP"]
[]
[null,null,"dms_0603_FeederList",{"$f":"INDEX(dms_FeederName_1,MATCH(dms_TradingName,dms_TradingName_List))","v":"CBD"},{"$f":"INDEX(dms_FeederName_2,MATCH(dms_TradingName,dms_TradingName_List))","v":"Urban"},{"$f":"INDEX(dms_FeederName_3,MATCH(dms_TradingName,dms_TradingName_List))","v":"Short rural"},{"$f":"INDEX(dms_FeederName_4,MATCH(dms_TradingName,dms_TradingName_List))","v":"Long rural"}]
[]
[]
[null,"Use these to add to specific worksheets in existing files","Use these to add to specific worksheets in existing files"]
[]
[]
[null,"ARRs 6.7 STPIS daily performance","dms_060101_Values","dms_060102_Values","dms_060701_Values"]
[null,null,"dms_LeapYear"]
[]
[]
[null,"ARR's  6.8 STPIS exclusions","dms_060801_Event_Date","dms_060801_OutageID","dms_060801_FeederID","dms_060801_FeederClass","dms_060801_CauseID","dms_060801_01_Values","dms_060801_02_Values","dms_060801_03_Values","dms_060801_Excl_Cat","dms_060801_04_Values"]
[null,null,"dms_060801_StartCell"]
[]
[]
[null,"CA 6.3 sustained interruptions","dms_060301_Event_Date","dms_060301_Event_Time","dms_060301_AssetID","dms_060301_FeederClass","dms_060301_Reason","dms_060301_DetailedReason","dms_060301_CustNo_Affected_Values","dms_060301_Avg_Duration_Sustained_Int_Values","dms_060301_Effect_unplanned_SAIDI_Values","dms_060301_Effect_unplanned_SAIFI_Values","dms_060301_MED"]

{"sheet":"AER lookups","index":3,"n_rows":87,"n_cols":37,"rows_kept":87,"cut":false,"hidden":true,"merged":[[10,25,10,35],[21,1,21,4],[11,25,11,28],[11,30,11,34],[11,35,13,35]]}
[null,"AER LOOKUP TABLES"]
[]
[null,"Data in these columns used for data validation and database purposes."]
[null,"Date last modified:","2017-01-16","added (Albury and Victora) for AGN"]
[null,null,"2016-10-17","updated TransGrid's correct legal name, corrected TasNetworks (T) to June financial year"]
[null,null,"2017-02-01","inserted Power and Water, added NRs (dms_FeederCat_1 and dms_FeederCat_2)"]
[null,null,"2017-03-03","inserted AEMO as a business"]
[null,null,"2018-03-28","major changes to accommodate STPIS"]
[null,null,"Template Version",5]
[]
[null,null,null,null,null,null,null,null,null,null,null,null,null,null,null,null,null,null,null,null,null,null,null,null,null,"FOR ELECTRICITY BUSINESSES ONLY"]
[null,null,null,null,null,null,null,null,null,null,null,null,null,null,null,null,null,null,null,null,null,null,null,null,null,"Feeder Types",null,null,null,"TasNetworks (D)","Feeder Names"]
[]
[null,null,null,null,null,null,null,null,null,null,null,null,null,null,null,null,null,null,null,null,null,null,null,null,null,"CBD","Urban","Short rural","long rural","EXTRA"]
[null,"dms_TradingName_List","dms_TradingNameFull_List","dms_ABN_List","dms_JurisdictionList","dms_Sector_List","dms_Segment_List","dms_FormControl_List","dms_RPT_List","dms_RPTMonth_List","dms_CRCPlength_List","dms_FRCPlength_List","dms_PRCPlength_List","dms_663_List","dms_DeterminationRef_List","dms_Addr1_List","dms_Addr2_List","dms_Suburb_List","dms_State_List","dms_PostCode_List","dms_PAddr1_List","dms_PAddr2_List","dms_PSuburb_List","dms_PState_List","dms_PPostCode_List","dms_CBD_flag","dms_Urban_flag","dms_ShortRural_flag","dms_LongRural_flag","dms_FeederType_5_flag","dms_FeederName_1","dms_FeederName_2","dms_FeederName_3","dms_FeederName_4","dms_FeederName_5","dms_Public_Lighting_List","Name"]
[null,"AusNet (T)","AusNet Transmission Group Pty Ltd",78079798173,"Vic","Electricity","Transmission","Revenue cap","Financial","March",5,5,5,2,"transmission determination","Level 32","2 Southbank Boulevard","SOUTHBANK","Vic",3006,"Locked Bag 14051",null,"MELBOURNE CITY MAIL CENTRE","Vic",8001,"NO","NO","NO","NO","NO","CBD","Urban","Short rural","Long rural",null,"NO",{"$f":"B16","v":"AusNet (T)"}]
[null,"Powerlink","Queensland Electricity Transmission Corporation Limited trading as Powerlink Queensland",82078849233,"Qld","Electricity","Transmission","Revenue cap","Financial","June",5,5,5,5,"transmission determination","33 Harold St",null,"VIRGINIA","Qld",4014,"PO Box 1193",null,"VIRGINIA","QLD",4014,"NO","NO","NO","NO","NO","CBD","Urban","Short rural","Long rural",null,"NO","Powerlink"]
[]
[]
[]
[]
[null,"The Reg Year Ending (dms_RYE) must be set to the last year of the regulatory period. For forecast data is is usually (FRCP_y5) for actual it is a single year (CRY). For historical actual data the RYE will need to be set manually in the business details sheet by setting the dms_Multiyear_flag to 1 and putting the correct value in 'dms_Specified_FinalYear. See cells C67:C68"]
[null,"dms_Model_List ","dms_Model_Name_Format1","dms_Worksheet_List","dms_Model_Span_List"]
[null,"ARR","Annual Reporting",{"$f":"IF(dms_MultiYear_ResponseFlag=\"yes\",\"NEW HISTORICAL ANNUAL REPORTING\",\"ANNUAL REPORTING\")","v":"ANNUAL REPORTING"},1]
[null,"CA","Category Analysis",{"$f":"IF(dms_MultiYear_ResponseFlag=\"yes\",\"NEW HISTORICAL CATEGORY ANALYSIS\",\"CATEGORY ANALYSIS\")","v":"CATEGORY ANALYSIS"},1]
[null,"CESS","Capitlal Expenditure","CAPITLAL EXPENDITURE SHARING SCHEMING",5]
[null,"CPI","CPI","CPI",5]
[null,"EB","Economic Benchmarking",{"$f":"IF(dms_MultiYear_ResponseFlag=\"yes\",\"NEW HISTORICAL ECONOMIC BENCHMARKING\",\"ECONOMIC BENCHMARKING\")","v":"ECONOMIC BENCHMARKING"},1]
[null,"Pricing","Pricing Proposal","PRICING PROPOSAL",5]
[null,"PTRM","Post Tax Revenue Model","POST TAX REVENUE MODEL",5]
[null,"Reset","Regulatory Reporting (Reset)","REGULATORY REPORTING STATEMENT",5]
[null,"RFM","Roll Forward Model","ROLL FORWARD MODEL",5]
[null,"WACC","Weighted Average Cost of Capital","WEIGHTED AVERAGE COST OF CAPITAL",1]
[]
[]
[]
[null,"Financial","Calendar",null,"PREVIOUS",null,"CURRENT",null,"FORTHCOMING"]
[null,"1987-88","1988","PRCP_y1",{"$f":"INDEX(INDIRECT(dms_RPT),dms_PRCP_start_row)","v":"2012-13"},"CRCP_y1",{"$f":"INDEX(INDIRECT(dms_RPT),dms_CRCP_start_row)","v":"2017-18"},{"$f":"FRCP_y1","v":"2022-23"},{"$f":"INDEX(INDIRECT(dms_RPT),dms_FRCP_start_row)","v":"2022-23"}]
[null,"1988-89","1989","PRCP_y2",{"$f":"INDEX(INDIRECT(dms_RPT),dms_PRCP_start_row+1)","v":"2013-14"},"CRCP_y2",{"$f":"INDEX(INDIRECT(dms_RPT),dms_CRCP_start_row+1)","v":"2018-19"},"FRCP_y2",{"$f":"INDEX(INDIRECT(dms_RPT),dms_FRCP_start_row+1)","v":"2023-24"}]
[null,"1989-90","1990","PRCP_y3",{"$f":"INDEX(INDIRECT(dms_RPT),dms_PRCP_start_row+2)","v":"2014-15"},"CRCP_y3",{"$f":"INDEX(INDIRECT(dms_RPT),dms_CRCP_start_row+2)","v":"2019-20"},"FRCP_y3",{"$f":"INDEX(INDIRECT(dms_RPT),dms_FRCP_start_row+2)","v":"2024-25"}]
[null,"1990-91","1991","PRCP_y4",{"$f":"INDEX(INDIRECT(dms_RPT),dms_PRCP_start_row+3)","v":"2015-16"},"CRCP_y4",{"$f":"INDEX(INDIRECT(dms_RPT),dms_CRCP_start_row+3)","v":"2020-21"},"FRCP_y4",{"$f":"INDEX(INDIRECT(dms_RPT),dms_FRCP_start_row+3)","v":"2025-26"}]
[null,"1991-92","1992","PRCP_y5",{"$f":"INDEX(INDIRECT(dms_RPT),dms_PRCP_start_row+4)","v":"2016-17"},"CRCP_y5",{"$f":"INDEX(INDIRECT(dms_RPT),dms_CRCP_start_row+4)","v":"2021-22"},"FRCP_y5",{"$f":"INDEX(INDIRECT(dms_RPT),dms_FRCP_start_row+4)","v":"2026-27"}]
[null,"1992-93","1993","PRCP_y6",{"$f":"INDEX(INDIRECT(dms_RPT),dms_PRCP_start_row+5)","v":"2017-18"},"CRCP_y6",{"$f":"INDEX(INDIRECT(dms_RPT),dms_CRCP_start_row+5)","v":"2022-23"},"FRCP_y6",{"$f":"INDEX(INDIRECT(dms_RPT),dms_FRCP_start_row+5)","v":"2027-28"}]
[null,"1993-94","1994","PRCP_y7",{"$f":"INDEX(INDIRECT(dms_RPT),dms_PRCP_start_row+6)","v":"2018-19"},"CRCP_y7",{"$f":"INDEX(INDIRECT(dms_RPT),dms_CRCP_start_row+6)","v":"2023-24"},"FRCP_y7",{"$f":"INDEX(INDIRECT(dms_RPT),dms_FRCP_start_row+6)","v":"2028-29"}]
[null,"1994-95","1995","PRCP_y8",{"$f":"INDEX(INDIRECT(dms_RPT),dms_PRCP_start_row+7)","v":"2019-20"},"CRCP_y8",{"$f":"INDEX(INDIRECT(dms_RPT),dms_CRCP_start_row+7)","v":"2024-25"},"FRCP_y8",{"$f":"INDEX(INDIRECT(dms_RPT),dms_FRCP_start_row+7)","v":"2029-30"}]
[null,"1995-96","1996","PRCP_y9",{"$f":"INDEX(INDIRECT(dms_RPT),dms_PRCP_start_row+8)","v":"2020-21"},"CRCP_y9",{"$f":"INDEX(INDIRECT(dms_RPT),dms_CRCP_start_row+8)","v":"2025-26"},"FRCP_y9",{"$f":"INDEX(INDIRECT(dms_RPT),dms_FRCP_start_row+8)","v":"2030-31"}]
[null,"1996-97","1997","PRCP_y10",{"$f":"INDEX(INDIRECT(dms_RPT),dms_PRCP_start_row+9)","v":"2021-22"},"CRCP_y10",{"$f":"INDEX(INDIRECT(dms_RPT),dms_CRCP_start_row+9)","v":"2026-27"},"FRCP_y10",{"$f":"INDEX(INDIRECT(dms_RPT),dms_FRCP_start_row+9)","v":"2031-32"}]
[null,"1997-98","1998","PRCP_y11",{"$f":"INDEX(INDIRECT(dms_RPT),dms_PRCP_start_row+10)","v":"2022-23"},"CRCP_y11",{"$f":"INDEX(INDIRECT(dms_RPT),dms_CRCP_start_row+10)","v":"2027-28"},"FRCP_y11",{"$f":"INDEX(INDIRECT(dms_RPT),dms_FRCP_start_row+10)","v":"2032-33"}]
[null,"1998-99","1999","PRCP_y12",{"$f":"INDEX(INDIRECT(dms_RPT),dms_PRCP_start_row+11)","v":"2023-24"},"CRCP_y12",{"$f":"INDEX(INDIRECT(dms_RPT),dms_CRCP_start_row+11)","v":"2028-29"},"FRCP_y12",{"$f":"INDEX(INDIRECT(dms_RPT),dms_FRCP_start_row+11)","v":"2033-34"}]
[null,"1999-00","2000","PRCP_y13",{"$f":"INDEX(INDIRECT(dms_RPT),dms_PRCP_start_row+12)","v":"2024-25"},"CRCP_y13",{"$f":"INDEX(INDIRECT(dms_RPT),dms_CRCP_start_row+12)","v":"2029-30"},"FRCP_y13",{"$f":"INDEX(INDIRECT(dms_RPT),dms_FRCP_start_row+12)","v":"2034-35"}]
[null,"2000-01","2001","PRCP_y14",{"$f":"INDEX(INDIRECT(dms_RPT),dms_PRCP_start_row+13)","v":"2025-26"},"CRCP_y14",{"$f":"INDEX(INDIRECT(dms_RPT),dms_CRCP_start_row+13)","v":"2030-31"},"FRCP_y14",{"$f":"INDEX(INDIRECT(dms_RPT),dms_FRCP_start_row+13)","v":"2035-36"}]
[null,"2001-02","2002","PRCP_y15",{"$f":"INDEX(INDIRECT(dms_RPT),dms_PRCP_start_row+14)","v":"2026-27"},"CRCP_y15",{"$f":"INDEX(INDIRECT(dms_RPT),dms_CRCP_start_row+14)","v":"2031-32"},"FRCP_y15",{"$f":"INDEX(INDIRECT(dms_RPT),dms_FRCP_start_row+14)","v":"2036-37"}]
[null,"2002-03","2003","PRCP_y16",{"$f":"INDEX(INDIRECT(dms_RPT),dms_PRCP_start_row+15)","v":"2027-28"},"CRCP_y16",{"$f":"INDEX(INDIRECT(dms_RPT),dms_CRCP_start_row+15)","v":"2032-33"},"FRCP_y16",{"$f":"INDEX(INDIRECT(dms_RPT),dms_FRCP_start_row+15)","v":{"$error":"#REF!"}}]
[null,"2003-04","2004"]
[null,"2004-05","2005"]
[null,"2005-06","2006",null,"CRY - FRY"]
[null,"2006-07","2007","dms_y1",{"$f":"IFERROR(INDEX(INDIRECT(dms_RPT),dms_CRY_start_row),0)","v":"2020-21"}]
[null,"2007-08","2008","dms_y2",{"$f":"IFERROR(INDEX(INDIRECT(dms_RPT),dms_CRY_start_row+1),0)","v":"2021-22"}]
[null,"2008-09","2009","dms_y3",{"$f":"IFERROR(INDEX(INDIRECT(dms_RPT),dms_CRY_start_row+2),0)","v":"2022-23"}]
[null,"2009-10",2010,"dms_y4",{"$f":"IFERROR(INDEX(INDIRECT(dms_RPT),dms_CRY_start_row+3),0)","v":"2023-24"}]
[null,"2010-11",2011,"dms_y5",{"$f":"IFERROR(INDEX(INDIRECT(dms_RPT),dms_CRY_start_row+4),0)","v":"2024-25"}]
[null,"2011-12",2012,"dms_y6",{"$f":"IFERROR(INDEX(INDIRECT(dms_RPT),dms_CRY_start_row+5),0)","v":"2025-26"}]
[null,"2012-13",2013,"dms_y7",{"$f":"IFERROR(INDEX(INDIRECT(dms_RPT),dms_CRY_start_row+6),0)","v":"2026-27"}]
[null,"2013-14",2014,"dms_y8",{"$f":"IFERROR(INDEX(INDIRECT(dms_RPT),dms_CRY_start_row+7),0)","v":"2027-28"}]
[null,"2014-15",2015,"dms_y9",{"$f":"IFERROR(INDEX(INDIRECT(dms_RPT),dms_CRY_start_row+8),0)","v":"2028-29"}]
[null,"2015-16",2016,"dms_y10",{"$f":"IFERROR(INDEX(INDIRECT(dms_RPT),dms_CRY_start_row+9),0)","v":"2029-30"}]
[null,"2016-17",2017,"dms_y11",{"$f":"IFERROR(INDEX(INDIRECT(dms_RPT),dms_CRY_start_row+10),0)","v":"2030-31"}]
[null,"2017-18",2018,"dms_y12",{"$f":"IFERROR(INDEX(INDIRECT(dms_RPT),dms_CRY_start_row+11),0)","v":"2031-32"}]
[null,"2018-19",2019,"dms_y13",{"$f":"IFERROR(INDEX(INDIRECT(dms_RPT),dms_CRY_start_row+12),0)","v":"2032-33"}]
[null,"2019-20",2020,"dms_y14",{"$f":"IFERROR(INDEX(INDIRECT(dms_RPT),dms_CRY_start_row+13),0)","v":"2033-34"}]
[null,"2020-21",2021,"dms_y15",{"$f":"IFERROR(INDEX(INDIRECT(dms_RPT),dms_CRY_start_row+14),0)","v":"2034-35"}]
[null,"2021-22",2022,"dms_y16",{"$f":"IFERROR(INDEX(INDIRECT(dms_RPT),dms_CRY_start_row+15),0)","v":"2035-36"}]
[null,"2022-23",2023]
[null,"2023-24",2024]
[null,"2024-25",2025]
[null,"2025-26",2026]
[null,"2026-27",2027]
[null,"2027-28",2028]
[null,"2028-29",2029]
[null,"2029-30",2030]
[null,"2030-31",2031]
[null,"2031-32",2032]
[null,"2032-33",2033]
[null,"2033-34",2034]
[null,"2034-35",2035]
[null,"2035-36",2036]
[null,"2036-37","2037"]

{"sheet":"AER ETL","index":4,"n_rows":145,"n_cols":8,"rows_kept":145,"cut":false,"hidden":true,"merged":[[12,4,12,8],[71,1,73,1],[11,0,15,0],[18,0,25,0],[26,0,31,0],[34,0,59,0],[14,2,14,4],[32,37,32,58],[33,37,33,58],[34,37,34,58],[32,68,32,89],[33,68,33,89],[34,68,34,89]]}
["DRAFT RIN - 20200429  (WIP)","AER ETL INFORMATION"]
[]
[null,"USES NAMED RANGES FLAG","yes","dms_Defined_Names_Used"]
[]
[null,"IF THIS IS AN ABC RIN - make sure the the named range CRY is applied and the named range dms_dollar_nom_UOM is applied"]
[null,"IF THIS IS A RESET RIN - make sure the named ranges CRY and dms_dollar_nom_UOM are NOT present in the workbook"]
[null,"FOR ABC RINS THAT SPAN MULTIPLE YEARS - make sure MultiYear Flag is set and final year entered as required"]
[]
[null,"Full trading name",{"$f":"INDEX(dms_TradingNameFull_List,MATCH(dms_TradingName,dms_TradingName_List))","v":"Queensland Electricity Transmission Corporation Limited trading as Powerlink Queensland"},null,"dms_TradingNameFull"]
[null,"Trading name",{"$f":"dms_TradingName","v":"Powerlink"}]
["Selected here","Model / RIN","Reset","dms_Model"]
["Read from Business & other details","Source","Regulatory proposal","dms_Source"]
[null,"Data quality","Consolidated","For DB purposes this is always Consoldiated"]
[null,"Data status","Public","For DB purposes this is always Public"]
[null,"Amendment reason",{"$f":"dms_Amendment_Text","v":"."},null,null,"dms_AmendmentReason"]
[null,"Submission date",{"$f":"dms_Typed_Submission_Date","v":"2021-01-28"},"dms_SubmissionDate"]
[]
["Redundant","EBSS - First application of scheme in forthcoming period?","No"]
["Pre-populated from lookup table","Data ingestion data quality","Consolidated","dms_DataQuality","Always Consolidated"]
[null,"Sector",{"$f":"INDEX(dms_Sector_List,MATCH(dms_TradingName,dms_TradingName_List))","v":"Electricity"},"dms_Sector","=INDEX(dms_Sector_List,MATCH(dms_TradingName,dms_TradingName_List))"]
[null,"Segment",{"$f":"INDEX(dms_Segment_List,MATCH(dms_TradingName,dms_TradingName_List))","v":"Transmission"},"dms_Segment","=INDEX(dms_Segment_List,MATCH(dms_TradingName,dms_TradingName_List))"]
[null,"Regulatory Year Ending",{"$f":"dms_RYE_result","v":"2027"},"dms_RYE","=IF(dms_MultiYear_Flag=1,LEFT(dms_Specified_FinalYear,2)&RIGHT(dms_Specified_FinalYear,2),INDEX(dms_RYE_Formula_Result,MATCH(dms_Model,dms_Model_List)))"]
[null,"Reporting Period Type",{"$f":"INDEX(dms_RPT_List,MATCH(dms_TradingName,dms_TradingName_List))","v":"Financial"},"dms_RPT","=INDEX(dms_RPT_List,MATCH(dms_TradingName,dms_TradingName_List))"]
[null,"EB/CA Unit of Measure for Monetary Values","$0s","dms_dollar_nom_UOM","If the cover sheet is attached to an ABC RIN apply the NAMED RANGE to the cell"]
[null,"Security Classification","Public","dms_Classification","Always Public"]
[null,"Jurisdiction",{"$f":"INDEX(dms_JurisdictionList,MATCH(dms_TradingName,dms_TradingName_List))","v":"Qld"},"dms_Jurisdiction","=INDEX(dms_JurisdictionList,MATCH(dms_TradingName,dms_TradingName_List))"]
["Relevant for PTRM, RFMs and Reset RINS","$ REAL REFERENCES"]
[null,"Does the named range CRY exist in this file? ",{"$f":"IFERROR(CRY,\"NO\")","v":"NO"}]
[null,"CRY-1  (last full calendar year before CRY)",{"$f":"IFERROR(IF(dms_RPT=\"calendar\",CRY-1,LEFT(CRY,4)),\"CRY not present\")","v":"CRY not present"},"dms_Cal_Year_B4_CRY","'=IF(dms_RPT=\"financial\",VALUE(LEFT(dms_SingleYear_FinalYear_Result,4)),VALUE(LEFT(dms_SingleYear_FinalYear_Result,4)-1))"]
[null,"Dollar $ real month",{"$f":"INDEX(dms_RPTMonth_List,MATCH(dms_TradingName,dms_TradingName_List))","v":"June"},"dms_RPTMonth","=INDEX(dms_RPTMonth_List,MATCH(dms_TradingName,dms_TradingName_List))"]
[null,"Dollar $ real  (the last month before the FRCP_y1)",{"$f":"IF(dms_SingleYearModel=\"yes\",CONCATENATE(dms_RPTMonth)&\" \"&VALUE((LEFT(dms_CRY_start_year,2)&RIGHT(dms_CRY_start_year,2))),CONCATENATE(dms_RPTMonth)&\" \"&dms_DollarReal_year)","v":"June 2022"},"dms_DollarReal","=IF(SUM(dms_SingleYear_Model)>0,CONCATENATE(dms_RPTMonth)&\" \"&VALUE((LEFT(CRY,2))&RIGHT(CRY,2)),CONCATENATE(dms_RPTMonth)&\" \"&VALUE((LEFT(dms_RYE,2)&RIGHT(dms_RYE,2))))"]
[null,"Dollar $ real previous year (PRCP_y5)",{"$f":"CONCATENATE(dms_RPTMonth)&\" \"&dms_Previous_DollarReal_year","v":"June 2017"},"dms_DollarReal_Prev","=IF(SUM(dms_SingleYear_Model)>0,CONCATENATE(dms_RPTMonth)&\" \"&VALUE(((LEFT(CRY,2))&RIGHT(CRY,2))-1),CONCATENATE(dms_RPTMonth)&\" \"&VALUE(((LEFT(dms_CRCP_FirstYear_Result,2)&RIGHT(dms_CRCP_FirstYear_Result,2))))-1)"]
[null,"PTRM/ RFMs"]
[null,"Form of control",{"$f":"INDEX(dms_FormControl_List,MATCH(dms_TradingName,dms_TradingName_List))","v":"Revenue cap"},"dms_FormControl","=INDEX(dms_FormControl_List,MATCH(dms_TradingName,dms_TradingName_List))"]
["All potential values for Regulatory Years or RYEs as calculated","This block works out the various RYE's for ALL RIN types and MODELS"]
[null,"dms_start_year",{"$f":"FRCP_y1","v":"2022-23"},"=FRCP_y1","FRCP_y1 from cover sheet"]
[null,"dms_CRY_start_year",{"$f":"IFERROR(CRY,CRCP_y4)","v":"2020-21"},"=IFERROR(CRY,CRCP_y4)"]
[null,"dms_CRY_start_row",{"$f":"IFERROR(MATCH(dms_CRY_start_year,INDIRECT(dms_RPT),0),0)","v":34},"=IFERROR(MATCH(dms_CRY_start_year,INDIRECT(dms_RPT),0),0)"]
[null,"dms_FRCP_start_row",{"$f":"MATCH(dms_start_year,INDIRECT(dms_RPT),0)","v":36},"=MATCH(dms_start_year,INDIRECT(dms_RPT),0)","Uses FRCP_y1 as a start reference"]
[null,"dms_CRCP_start_row",{"$f":"dms_FRCP_start_row-dms_CRCPlength_Num","v":31},"=dms_FRCP_start_row-dms_CRCPlength_Num","Uses the value in dms_CRCPlength_Num"]
[null,"dms_PRCP_start_row",{"$f":"dms_FRCP_start_row-dms_CRCPlength_Num-dms_PRCPlength_Num","v":26},"=dms_FRCP_start_row-dms_CRCPlength_Num-dms_PRCPlength_Num","Uses the value in dms_CRCPlength_Num and dms_PRCPlength_Num"]
[null,"dms_RYE_start_row",{"$f":"dms_FRCP_start_row+(dms_FRCPlength_Num-1)","v":40},"=dms_FRCP_start_row+(dms_FRCPlength_Num-1)","Uses the value in dms_FRCPlength_Num-1"]
[null,"FRCP_start_year",{"$f":"INDEX(INDIRECT(dms_RPT),dms_FRCP_start_row)","v":"2022-23"},"=INDEX(INDIRECT(dms_RPT),dms_FRCP_start_row)","Converts the FRCP start row to display the year"]
[null,"CRCP_start_year",{"$f":"INDEX(INDIRECT(dms_RPT),dms_CRCP_start_row)","v":"2017-18"},"=INDEX(INDIRECT(dms_RPT),dms_CRCP_start_row)","Converts the CRCP start row to display the year"]
[null,"PRCP_start_year",{"$f":"INDEX(INDIRECT(dms_RPT),dms_PRCP_start_row)","v":"2012-13"},"=INDEX(INDIRECT(dms_RPT),dms_PRCP_start_row)","Converts the PRCP start row to display the year"]
[null,"FRCP_final_year",{"$f":"INDEX(INDIRECT(dms_RPT),dms_FRCP_start_row+dms_FRCPlength_Num-1)","v":"2026-27"},"=INDEX(INDIRECT(dms_RPT),dms_FRCP_start_row+dms_FRCPlength_Num-1)","Finds the FRCP final year"]
[null,"CRCP_final_year",{"$f":"INDEX(INDIRECT(dms_RPT),dms_CRCP_start_row+dms_CRCPlength_Num-1)","v":"2021-22"},"=INDEX(INDIRECT(dms_RPT),dms_CRCP_start_row+dms_CRCPlength_Num-1)","Finds the CRCP final year"]
[null,"PRCP_final_year",{"$f":"INDEX(INDIRECT(dms_RPT),dms_PRCP_start_row+dms_FRCPlength_Num-1)","v":"2016-17"},"=INDEX(INDIRECT(dms_RPT),dms_PRCP_start_row+dms_FRCPlength_Num-1)","Finds the PRCP final year"]
[null,"dms_Reset_final_year",{"$f":"INDEX(INDIRECT(dms_RPT),dms_RYE_start_row)","v":"2026-27"},"=INDEX(INDIRECT(dms_RPT),dms_RYE_start_row)","For Resets and PTRM/RFMs (same as FRCP_final_year)"]
[null,"dms_SpecifiedYear_final_year",{"$f":"FRY","v":{"$error":"#NAME?"}},"=FRY","FRY from cover sheet"]
[null,"dms_DollarReal_year",{"$f":"LEFT(CRCP_final_year,2)&RIGHT(CRCP_final_year,2)","v":"2022"},"=LEFT(CRCP_final_year,2)&RIGHT(CRCP_final_year,2)","Uses the value in CRCP_final_year"]
[null,"dms_Previous_DollarReal_year",{"$f":"LEFT(PRCP_final_year,2)&RIGHT(PRCP_final_year,2)","v":"2017"},"=LEFT(PRCP_final_year,2)&RIGHT(PRCP_final_year,2)","Uses the value in PRCP_final_year"]
[null,"dms_CRY_RYE",{"$f":"IFERROR(LEFT(CRY,2)&RIGHT(CRY,2),0)","v":0},"=IFERROR(LEFT(CRY,2)&RIGHT(CRY,2),0)","For ABC single year RINS"]
[null,"dms_Reset_RYE",{"$f":"IF(dms_Model_Span>1,IF(dms_Model=\"RFM\",(LEFT(dms_DollarReal_year,2)&RIGHT(dms_DollarReal_year,2)),(LEFT(dms_Reset_final_year,2)&RIGHT(dms_Reset_final_year,2))),0)","v":"2027"},"=IF(dms_Model_Span>1,IF(dms_Model=\"RFM\",(LEFT(dms_DollarReal_year,2)&RIGHT(dms_DollarReal_year,2)),(LEFT(dms_Reset_final_year,2)&RIGHT(dms_Reset_final_year,2))),0)","If model span > 1 then uses dms_Reset_RYE otherwise it's a multi year ABC and uses dms_Specified_RYE"]
[null,"dms_Specified_RYE",{"$f":"IF(dms_MultiYear_ResponseFlag=\"Yes\",(LEFT(dms_Specified_FinalYear,2)&RIGHT(dms_Specified_FinalYear,2)),0)","v":0},"=IF(dms_MultiYear_ResponseFlag=\"Yes\",(LEFT(dms_Specified_FinalYear,2)&RIGHT(dms_Specified_FinalYear,2)),0)","If multi year ABC - uses dms_Specified_FinalYear"]
[null,"dms_Model_Span",{"$f":"INDEX(dms_Model_Span_List,MATCH(dms_Model,dms_Model_List))","v":5},"=INDEX(dms_Model_Span_List,MATCH(dms_Model,dms_Model_List))","A result of 5 is used to signify that it is more than 1 year span"]
[null,"dms_RYE_result",{"$f":"IF(dms_MultiYear_ResponseFlag=\"yes\",dms_Specified_RYE,(IF(dms_Model_Span>1,dms_Reset_RYE,dms_CRY_RYE)))","v":"2027"},"=IF(dms_MultiYear_ResponseFlag=\"yes\",dms_Specified_RYE,(IF(dms_Model_Span>1,dms_Reset_RYE,dms_CRY_RYE)))","Nested IF - feeds into dms_RYE"]
[null,"dms_Reset_Span",{"$f":"IF(dms_Reset_RYE>0,CONCATENATE(FRCP_y1,\" to \",FRCP_final_year),0)","v":"2022-23 to 2026-27"},"=IF(dms_Reset_RYE>0,CONCATENATE(FRCP_y1,\" to \",FRCP_final_year),0)","Reset span of years as text"]
[null,"dms_SpecifiedYear_Span",{"$f":"IF(dms_Specified_RYE>0,CONCATENATE(CRY,\" to \",dms_Specified_FinalYear),0)","v":0},"=IF(dms_Specified_RYE>0,CONCATENATE(CRY,\" to \",dms_Specified_FinalYear),0)","Multi year ABC span of years as text"]
[null,"dms_Header_Span",{"$f":"IF(dms_MultiYear_Flag=1,dms_SpecifiedYear_Span,IF(dms_Model_Span>1,dms_y1&\" - \"&FRCP_final_year,CRY))","v":"2020-21 - 2026-27"},"=IF(dms_MultiYear_Flag=1,dms_SpecifiedYear_Span,IF(dms_Model_Span>1,dms_Reset_Span,CRY))","NESTED IF - for Sheet Headers"]
[null,"ABC RINS THAT SPAN MULTIPLE YEARS"]
[null,"This is a multi year ABC RIN?","No"]
[null,null,{"$f":"IF(dms_MultiYear_ResponseFlag=\"No\",0,1)","v":0},"dms_MultiYear_Flag","This is set from the answer provided above"]
[null,null,{"$f":"IF(dms_MultiYear_Flag=1,FRY,\"not a Multiple year submission\")","v":"not a Multiple year submission"},"dms_Specified_FinalYear","The result here is returned to dms_CRCP_FinalYear_Result if response to Q in C73 is \"yes\" and dms_MultiYear_Flag is set to 1"]
[null," Start year for 5.2 in Multi year ABC RINS",{"$f":"IFERROR(IF(dms_MultiYear_Flag=1,FRY,CRY),\"not an ABC\")","v":"not an ABC"},"dms_0502_Inst_Year","=IF(dms_MultiYear_Flag=1,FRY,CRY)",null,"For single year RINS this is CRY - multi year RINS need to start a the end of the span of years (ie. FRY)"]
[null,"WHAT IS THE RYE?"]
[null,"Reg Period Lengths"]
[null,"PRCP length in years",{"$f":"INDEX(dms_PRCPlength_List,MATCH(dms_TradingName,dms_TradingName_List))","v":5},"dms_PRCPlength_Num","=INDEX(dms_PRCPlength_List,MATCH(dms_TradingName,dms_TradingName_List))"]
[null,"CRCP length in years",{"$f":"INDEX(dms_CRCPlength_List,MATCH(dms_TradingName,dms_TradingName_List))","v":5},"dms_CRCPlength_Num","=INDEX(dms_CRCPlength_List,MATCH(dms_TradingName,dms_TradingName_List))"]
[null,"FRCP length in years",{"$f":"INDEX(dms_FRCPlength_List,MATCH(dms_TradingName,dms_TradingName_List))","v":5},"dms_FRCPlength_Num","=INDEX(dms_FRCPlength_List,MATCH(dms_TradingName,dms_TradingName_List))"]
[null,"Single year RIN?"]
[null,"Single Year ABC RIN ?",{"$f":"IF(dms_Model=\"EB\",1,0)","v":0},"dms_EB"]
[null,null,{"$f":"IF(dms_Model=\"CA\",1,0)","v":0},"dms_CA","=dms_SingleYear_Model"]
[null,null,{"$f":"IF(dms_Model=\"ARR\",1,0)","v":0},"dms_ARR"]
[null,"Is this a single Year ABC RIN?",{"$f":"IF(SUM(dms_SingleYear_Model)=1,\"yes\",\"no\")","v":"no"},"dms_SingleYearModel","=IF(SUM(dms_SingleYear_Model)=1,\"yes\",\"no\")"]
[null,"Single Year Final Year Result",{"$f":"IF(AND(dms_SingleYearModel=\"yes\",dms_MultiYear_Flag=0),CRY,0)","v":0},"dms_SingleYear_FinalYear_Result","=IFERROR(IF(SUM(dms_SingleYear_Model)<>0,(INDIRECT(dms_SingleYear_FinalYear_Ref)),\"not a single year RIN\"),\"CRY not present\")"]
[null,"Multi year RIN?"]
[]
[null,"Multi Year Reset/Model?",{"$f":"IF(dms_Model_Span>1,\"yes\",\"no\")","v":"yes"}]
[null,"Final year result for Reset/Model",{"$f":"IF(dms_Model_Span>1,dms_Reset_final_year,0)","v":"2026-27"},"dms_MultiYear_FinalYear_Result","dms_CRCP_FinalYear_Result"]
[]
[null,"Multi Year ABC RIN?",{"$f":"IF(dms_MultiYear_Flag=1,\"yes\",\"no\")","v":"no"},"dms_MultiYear_ABC_RIN"]
[null,"Final year result for ABC multi year",{"$f":"IF(dms_MultiYear_Flag=1,C50,0)","v":0}]
[]
[null,"EB RINS"]
[null,"Calendar Year for table 3.6 data",{"$f":"IFERROR(IF(dms_Segment=\"Transmission\",dms_Cal_Year_B4_CRY,CRY),\"CRY not present\")","v":"CRY not present"},"dms_0306_Year","=IF(dms_Segment=\"Transmission\",dms_Cal_Year_B4_CRY,CRY)"]
[null,"CA RINS"]
[null,"Find how many rows in tables 6.3 sustained interruptions?",null,null,"dms_060301_MaxRows only returns a valid value when cover sheet is attached to a CA file"]
[null,null,{"$f":"IF(dms_Model<>\"CA\",\"not a CA\",\"Is a CA\")","v":"not a CA"},null,"=IF(dms_Model<>\"CA\",\"not a CA\",\"Is a CA\")"]
[null,"dms_060301_Avg_Duration_Sustained_Int_Values present?",{"$f":"IFERROR(IF(INDEX(dms_060301_Avg_Duration_Sustained_Int_Values,1,1)<>\"\",\"yes\",\"no\"),\"no\")","v":"no"},"dms_060301_checkvalue","=IFERROR(IF(INDEX(dms_060301_Avg_Duration_Sustained_Int_Values,1,1)<>\"\",\"yes\",\"no\"),\"no\")"]
[null,null,{"$f":"IF(AND(dms_Model=\"CA\",(dms_060301_checkvalue=\"no\")),\"error - NR not present\",\"no errors\")","v":"no errors"},null,"=IF(AND(dms_Model=\"CA\",(dms_060301_checkvalue=\"no\")),\"error - NR not present\",\"no errors\")"]
[null,"Table 6.3.1 - last row reference",{"$f":"IFERROR(IF(dms_Model=\"CA\",LOOKUP(2,1/(dms_060301_Avg_Duration_Sustained_Int_Values<>\"\"),(ROW(dms_060301_Avg_Duration_Sustained_Int_Values))),\"not a CA\"),\"6.3 not present\")","v":"not a CA"},"dms_060301_LastRow","=IFERROR(IF(dms_Model=\"CA\",LOOKUP(2,1/(dms_060301_Avg_Duration_Sustained_Int_Values<>\"\"),(ROW(dms_060301_Avg_Duration_Sustained_Int_Values))),\"not a CA\"),\"6.3 not present\")"]
[null,"Table 6.3.1 - max number rows",{"$f":"IFERROR(IF(dms_Model=\"CA\",(dms_060301_LastRow-15),\"not a CA\"),\"error\")","v":"not a CA"},"dms_060301_MaxRows","=IFERROR(IF(dms_Model=\"CA\",(dms_060301_LastRow-15),\"not a CA\"),\"error\")"]
[null,"Table 6.6.3 - Public lighting repair - no. business days",{"$f":"INDEX(dms_663_List,MATCH(dms_TradingName,dms_TradingName_List))","v":5},"dms_663","=INDEX(dms_663_List,MATCH(dms_TradingName,dms_TradingName_List))"]
[null,"ARR or RESET RINS"]
[null,"How many rows in tables 6.1 or 6.7?  (leap year?)","insert dms_LeapYear NR if required",null,"'dms_LeapYear is used to determine dms_060701_Max_Rows BUT it is only found on worksheet 6.1 or 6.7 and the date value in the cell is used to determine whether it is a leap year"]
[null,"Is dms_LeapYear named range present?",{"$f":"IFERROR(IF(dms_LeapYear,\"yes\"),\"no\")","v":"no"}]
[null,"Table 6.7.1 - includes a leap year?",{"$f":"\nIFERROR(IF(MONTH(DATE(YEAR(dms_LeapYear),2,29))=2,\"is a leap year\",\"not a leap year\"),\n\"dms_LeapYear not present\")","v":"dms_LeapYear not present"},"dms_LeapYear_Result","=IFERROR(IF(MONTH(DATE(YEAR(dms_LeapYear),2,29))=2,\"is a leap year\",\"not a leap year\"),\"dms_LeapYear not present\")"]
[null,"MaxRows if Reset and leap year",{"$f":"IF(dms_LeapYear_Result=\"is a leap year\",1827,1826)","v":1826},"dms_060701_Reset_MaxRows","=IF(dms_LeapYear_Result=\"is a leap year\",1827,1826)",null,null,"number of days present in Reset RIN table"]
[null,"MaxRows if ARR and leap year",{"$f":"IF(dms_LeapYear_Result=\"is a leap year\",366,365)","v":365},"dms_060701_ARR_MaxRows","=IF(dms_LeapYear_Result=\"is a leap year\",366,365)",null,null,"number of days present in ARR RIN table"]
[null,"Table 6.7.1 - Max Rows (leap year/ non leap year)",{"$f":"IF(dms_Model=\"ARR\",dms_060701_ARR_MaxRows,IF(dms_Model=\"Reset\",dms_060701_Reset_MaxRows,\"not a relevant RIN type\"))","v":1826},"dms_060701_MaxRows","=IF(dms_Model=\"ARR\",dms_060701_ARR_MaxRows,IF(dms_Model=\"Reset\",dms_060701_Reset_MaxRows,\"not a relevant RIN type\"))"]
[null,"How many columns in 6.7?   (4 or 5 feeder categories)",{"$f":"IF(dms_FifthFeeder_flag_NSP=\"NO\",\"This NSP has only 4 feeder categories\",\"This NSP has 5 feeder categories\")","v":"This NSP has only 4 feeder categories"}]
[null,"Table 6.7.1 - Last column (# of feeder categories > 4)",{"$f":"IF(dms_FifthFeeder_flag_NSP=\"NO\",10,12)","v":10},"dms_060701_MaxCols","=IF(dms_FifthFeeder_flag_NSP=\"NO\",8,10)"]
[null,"Table 6.7.1 - Number of offset rows",{"$f":"IF(dms_Model=\"ARR\",15,9)","v":9},"dms_060701_OffsetRows","=IF(dms_Model=\"ARR\",15,9)"]
[null,"Start date for telephone answering in 6.1 or 6.7?",null,null,"Using 060101 as naming standard not 060701 for start dates"]
[null,"Table 6.1.1 and 6.7.1 - Start Date as Text",{"$f":"IF(dms_SingleYearModel=\"yes\",(CONCATENATE(IF(LEN(CRY)=4,\"1-Jan-\",\"1-Jul-\"),LEFT(CRY,4))),(CONCATENATE(IF(LEN(PRCP_y4)=4,\"1-Jan-\",\"1-Jul-\"),LEFT(PRCP_y4,4))))","v":"1-Jul-2015"},"dms_060101_StartDateTxt","=IF(SUM(dms_SingleYear_Model)>1,(CONCATENATE(IF(LEN(CRY)=4,\"1-Jan-\",\"1-Jul-\"),LEFT(CRY,4))),(CONCATENATE(IF(LEN(CRCP_y4)=4,\"1-Jan-\",\"1-Jul-\"),LEFT(CRCP_y4,4))))"]
[null,"Table 6.1.1 and 6.7.1 - Start Date as Date Value",{"$f":"DATEVALUE(dms_060701_StartDateTxt)","v":42186},"dms_060101_StartDateVal","=DATEVALUE(dms_060701_StartDateTxt)"]
[null,"ARRs"]
[null,"How many rows in table 6.8?","insert dms_060801_StartCell NR if required",null,"dms_060801_StartCell is only found on worksheet 6.8 and is used to determine the starting date for the date range"]
[null,"Is dms_060801_StartCell named range present?","yes",null,"=IFERROR(IF((ROW(dms_060801_StartCell)-1)=1,\"yes\",\"yes\"),\"no\")"]
[null,"Table 6.8 - Number of offset rows",12,"dms_0608_OffsetRows","=IFERROR(IF(dms_Model=\"ARR\",(ROW(dms_060801_StartCell)-1),\"not an ARR\"),\"6.8 error\")"]
[null,"Table 6.8 - Last row","0","dms_0608_LastRow","=IFERROR(IF(dms_060801_StartCell<>\"\",IF(dms_Model=\"ARR\",(LOOKUP(2,1/(dms_060801_01_Values<>\"\"),(ROW(dms_060801_01_Values)))),\"not an ARR\"),0),\"0\")"]
[null,"Table 6.8 - MaxRows",{"$f":"IFERROR(IF(dms_Model=\"ARR\",(MAX(0,dms_0608_LastRow-dms_0608_OffsetRows)),\"not an ARR\"),\"0\")","v":"not an ARR"},"dms_060801_MaxRows","=IFERROR(IF(dms_Model=\"ARR\",(MAX(0,dms_0608_LastRow-dms_0608_OffsetRows)),\"not an ARR\"),\"0\")"]
[null,"TNSP RESET RINS"]
[null,"Table 7.9.4 only appears in TNSPs Reset RIN"]
[null,"Table 7.9.4 - first year",{"$f":"LEFT(PRCP_y3,4)","v":"2014"},"dms_070904_Start_Year","=LEFT(PRCP_y3,4)"]
[]
[null,"MISC"]
[null,"Distribution Determination Reference",{"$f":"INDEX(dms_DeterminationRef_List,MATCH(dms_TradingName,dms_TradingName_List))","v":"transmission determination"},"dms_DeterminationRef"]
[null,"Public lighting NSP?",{"$f":"INDEX(dms_Public_Lighting_List,MATCH(dms_TradingName,dms_TradingName_List))","v":"NO"},"dms_Public_Lighting","=INDEX(dms_Public_Lighting_List,MATCH(dms_TradingName,dms_TradingName_List))"]
[null,"CBD Feeder for this business",{"$f":"INDEX(dms_CBD_flag,MATCH(dms_TradingName,dms_TradingName_List))","v":"NO"},"dms_CBD_flag_NSP"]
[null,"Urban Feeder for this business",{"$f":"INDEX(dms_Urban_flag,MATCH(dms_TradingName,dms_TradingName_List))","v":"NO"},"dms_Urban_flag_NSP"]
[null,"Short rural Feeder for this business",{"$f":"INDEX(dms_ShortRural_flag,MATCH(dms_TradingName,dms_TradingName_List))","v":"NO"},"dms_ShortRural_flag_NSP"]
[null,"Long rural Feeder for this business",{"$f":"INDEX(dms_LongRural_flag,MATCH(dms_TradingName,dms_TradingName_List))","v":"NO"},"dms_LongRural_flag_NSP"]
[null,"Fifth Feeder Category (eg. TasNetworks (D))",{"$f":"INDEX(dms_FeederType_5_flag,MATCH(dms_TradingName,dms_TradingName_List))","v":"NO"},"dms_FifthFeeder_flag_NSP","=INDEX(dms_FeederType_5_flag,MATCH(dms_TradingName,dms_TradingName_List))"]
[]
[null,"DISCARD FILES"]
[null,"discard this record?","NO","dms_DISCARD","If record is to be discarded from DB set this flag to YES"]
[]
[null,"SUBSET FILES"]
[null,"Is this Submission File a Subset File","NO","dms_Partial"]
[]
[]
[null,"REGULATORY YEARS FOR MULTI RYE SUBMISSIONS"]
[null,"Multiple RYE flag","NO","dms_Multi_RYE_flag"]
[null,null,"Manually specify RYE","Named ranges to apply"]
[null,null,2013,"dms_RYE_01"]
[null,null,2014,"dms_RYE_02"]
[null,null,2015,"dms_RYE_03"]
[null,null,2016,"dms_RYE_04"]
[null,null,2017,"dms_RYE_05"]
[null,null,2018,"dms_RYE_06"]
[null,null,2019,"dms_RYE_07"]
[null,null,2020,"dms_RYE_08"]
[null,null,2021,"dms_RYE_09"]

{"sheet":"Instructions","index":5,"n_rows":27,"n_cols":4,"rows_kept":27,"cut":false,"hidden":false,"merged":[[1,1,1,4],[2,1,2,4],[3,1,3,4],[4,1,4,4],[5,2,5,4],[7,1,8,1],[7,2,7,3],[8,2,8,4],[18,1,24,1],[18,2,18,4],[26,2,26,4],[10,2,10,4],[12,1,14,1],[12,2,12,4],[13,2,13,3],[14,2,14,4],[16,2,16,4]]}
[]
[null,{"$f":"CONCATENATE(dms_Sector,\" \",dms_Segment,\" \", \"Network Service Provider\")","v":"Electricity Transmission Network Service Provider"}]
[null,{"$f":"IF(dms_Model=\"Reset\",\"Regulatory Proposal RIN Template\",\"Annual Reporting RIN\")","v":"Regulatory Proposal RIN Template"}]
[null,{"$f":"CONCATENATE(\"This template is to be used by \",dms_TradingNameFull,\" to fulfil its reporting obligations to the AER.\")","v":"This template is to be used by Queensland Electricity Transmission Corporation Limited trading as Powerlink Queensland to fulfil its reporting obligations to the AER."}]
[null,"INSTRUCTIONS"]
[null,"GENERAL","Complete the Business & other details worksheet before entering data or values in any other worksheets. The Business & other details worksheet is linked to other worksheets within the workbook and automatically generates certain column headings and conditional formatting."]
[]
[null,"CONFIDENTIAL INFORMATION","\nPlease use the macro at the top of each \nworksheet to identify confidential information\nin the confidential workbook. \n\n"]
[null,null,"-Do this by selecting the cell or cells that contain confidential information and then run the Mark selection as CONFIDENTIAL macro. This will format the cells a specific colour that is identified by the AER's database which in turn marks that information as confidential.\n\n-To reverse this, select the cell or cells and run the Return selection to NON-CONFIDENTIAL macro."]
[]
[null,"RESPONSES","\nPlease return four (4) files to the AER: \n\n1. A confidential version which must contain a complete set of all responses with confidential information marked using the Mark selection CONFIDENTIAL macro and which has been completed using the locked template file provided by the AER. \n\n2. An actual and an estimate version with confidential information marked using the Mark selection CONFIDENTIAL macro and which has been completed using the locked template file provided by the AER.\n\n3. A public version with confidential information either removed completely or aggregated in some form together with writtten consent to disclose the public version of the response.\n\nUse the drop down box on the Business and other details worksheet to identify the file as either confidential ('consolidated') or public. "]
[]
[null,"AMENDMENTS","\nIf an NSP wishes to correct data previously submitted to the AER it should resubmit that data using the original completed submission as the starting point. Please make any necessary changes to the data. Data that is not being amended should be left unchanged. \n\nNSPs must identify the reason for the amendments in the Amendment Reason box on the  Business and other details worksheet. NSPs may provide further details regarding any amendments in the Amendments worksheet. \n\n."]
[null,null,"NSP may use Amended Data macro \nto highlight cells that contain amended data.\nNB: if data is also CONFIDENTIAL, re-apply \nthe Confidentiality macro after applying the \nAmended macro"]
[null,null,"Please resubmit two (2) files - a confidential version and a public version of the amended submission to the AER"]
[]
[null,"UNITS OF MEASURE","\nAll amounts are to be unrounded and reported on a one for one basis: that is 1000 is to be entered as '1000'. Applicable units of measure may be identified in the table column headings or row descriptors.\n\n"]
[]
[null,"INPUT / NON-INPUT CELLS"]
[null,null,null,"Yellow = Input cell (mandatory)"]
[null,null,null,"Darker yellow = input cell (mandatory)"]
[null,null,null,"Orange = input cell (if data available)"]
[null,null,null,"Grey = Not applicable/No inputs required"]
[null,null,null," \nPLEASE DO NOT ENTER TEXT into cells that are to contain numeric data."]
[]
[]
[null,"NAVIGATION","\nMany tables in the worksheets have been \"grouped\" to allow for easy navigation. To ungroup or group data use the outline symbols in the left margin (for Row groupings) or above the columns (for column groupings). \n\n\n\n"]

{"sheet":"CONTENTS","index":6,"n_rows":40,"n_cols":6,"rows_kept":40,"cut":false,"hidden":false,"merged":[[5,4,5,5]]}
[null,null,null,{"$f":"INDEX(dms_Worksheet_List,MATCH(dms_Model,dms_Model_List))","v":"REGULATORY REPORTING STATEMENT"}]
[null,null,null,{"$f":"INDEX(dms_TradingNameFull_List,MATCH(dms_TradingName,dms_TradingName_List))","v":"Queensland Electricity Transmission Corporation Limited trading as Powerlink Queensland"}]
[null,null,null,{"$f":"dms_Header_Span","v":"2020-21 - 2026-27"}]
[]
[]
[null,null,null,null,"CONTENTS"]
[]
[null,null,null,null,"TEMPLATE DATE","October 2020"]
[]
[null,null,null,null,"SUBMISSION","Business & other details"]
[null,null,null,null,null,"CPI series"]
[]
[null,null,null,null,"EXPENDITURE","2.1 Expenditure summary"]
[null,null,null,null,null,"2.2 Repex"]
[null,null,null,null,null,"2.3 Augex (a)"]
[null,null,null,null,null,"2.3 Augex (b)"]
[null,null,null,null,null,"2.5 Connections"]
[null,null,null,null,null,"2.6 Non-network"]
[null,null,null,null,null,"2.10 Overheads"]
[null,null,null,null,null,"2.11 Labour"]
[null,null,null,null,null,"2.14 Forecast price changes"]
[null,null,null,null,null,"2.16 Opex Summary"]
[null,null,null,null,null,"2.17 Step Changes"]
[]
[null,null,null,null,"ECONOMIC BENCHMARKING","3.1 Revenue"]
[null,null,null,null,null,"3.2 Operating expenditure"]
[null,null,null,null,null,"3.3 Assets (RAB)"]
[null,null,null,null,null,"3.4 Operational data"]
[null,null,null,null,null,"3.5 Physical assets"]
[null,null,null,null,null,"3.7 Operating environment"]
[]
[null,null,null,null,"NETWORK","5.4 MD & Utilisation - Spatial"]
[]
[null,null,null,null,"OTHER","7.1  Policies and Procedures"]
[null,null,null,null,null,"7.2 Contingent projects"]
[null,null,null,null,null,"7.3 Obligations"]
[null,null,null,null,null,"7.4 Shared Assets"]
[null,null,null,null,null,"7.9 STPIS"]
[]
[null,null,null,null,"CAPEX","8.2 Capex"]

{"sheet":"Business & other details","index":7,"n_rows":74,"n_cols":79,"rows_kept":74,"cut":false,"hidden":false,"merged":[[0,7,2,15],[6,21,6,75],[24,21,24,35],[42,37,42,44],[42,46,42,53],[42,55,42,62],[42,64,42,71],[3,21,3,57],[8,16,8,93],[22,68,22,89],[23,68,23,89],[25,68,25,71],[25,80,25,82],[24,68,24,82],[25,37,25,40],[22,37,22,58],[23,37,23,58],[31,21,31,35],[22,21,22,35],[16,21,16,35],[16,37,16,48],[15,21,15,35],[15,37,15,58],[24,37,24,51],[25,21,25,35],[23,21,23,35],[45,73,45,80],[45,64,45,71],[46,73,46,80],[45,55,45,62],[50,46,50,53],[46,46,46,53],[46,37,46,44],[50,37,50,44],[31,68,31,89],[32,68,32,89],[33,68,33,89],[43,64,43,71],[43,73,43,80],[41,73,41,80],[25,49,25,51],[24,60,24,66],[25,60,25,66],[42,73,42,80],[32,21,32,35],[33,21,33,35],[33,60,33,66],[32,60,32,66],[50,73,50,80],[50,64,50,71],[46,64,46,71],[46,55,46,62],[50,55,50,62],[47,73,47,80],[51,73,51,80],[51,64,51,71],[22,60,22,66],[23,60,23,66],[31,60,31,66],[49,25,49,34],[53,25,53,34],[45,46,45,53],[45,37,45,44],[49,37,49,44],[41,46,41,53],[49,55,49,62],[49,64,49,71],[41,55,41,62],[41,64,41,71],[47,46,47,53],[47,55,47,62],[47,64,47,71],[51,55,51,62],[53,37,53,44],[49,46,49,53],[51,46,51,53],[51,37,51,44],[47,37,47,44],[73,25,73,34],[73,37,73,52],[55,25,55,34],[63,25,63,34],[65,25,65,34],[55,37,55,44],[61,25,61,34],[61,37,61,52],[31,37,31,58],[32,37,32,58],[33,37,33,58],[43,37,43,44],[43,46,43,53],[43,55,43,62],[63,37,63,52],[65,37,65,52],[67,37,67,52],[69,37,71,81],[67,25,67,34],[69,25,71,34],[49,73,49,80],[41,25,41,34],[45,25,45,34],[41,37,41,44]]}
[null,null,null,null,null,null,null,null,null,null,null,null,null,null,null,null,null,null,null,null,null,{"$f":"INDEX(dms_Worksheet_List,MATCH(dms_Model,dms_Model_List))","v":"REGULATORY REPORTING STATEMENT"}]
[null,null,null,null,null,null,null,null,null,null,null,null,null,null,null,null,null,null,null,null,null,{"$f":"INDEX(dms_TradingNameFull_List,MATCH(dms_TradingName,dms_TradingName_List))","v":"Queensland Electricity Transmission Corporation Limited trading as Powerlink Queensland"}]
[null,null,null,null,null,null,null,null,null,null,null,null,null,null,null,null,null,null,null,null,null,{"$f":"dms_Header_Span","v":"2020-21 - 2026-27"}]
[null,null,null,null,null,null,null,null,null,null,null,null,null,null,null,null,null,null,null,null,null,"BUSINESS & OTHER DETAILS"]
[]
[null,null,null,null,null,null,null,null,null,null,null,null,null,null,null,null,null,null,null,null,null,"INSTRUCTIONS"]
[null,null,null,null,null,null,null,null,null,null,null,null,null,null,null,null,null,null,null,null,null,"Complete the following business details regulatory template before entering data or values in any other regulatory template. This regulatory template is linked to other cells within the spreadsheet and automatically generates column headings and conditional formatting to distinguish business specific input and non-input cells. "]
[]
[null,null,null,null,null,null,null,null,null,null,null,null,null,null,null,null,"SUBMISSION PARTICULARS INPUT SHEET"]
[]
[]
[null,null,null,null,null,null,null,null,null,null,null,null,null,null,null,null,null,null,null,null,null,"ENTITY DETAILS"]
[]
[null,null,null,null,null,null,null,null,null,null,null,null,null,null,null,null,null,null,null,null,null,"Business Name"]
[]
[null,null,null,null,null,null,null,null,null,null,null,null,null,null,null,null,null,null,null,null,null,"Short name",null,null,null,null,null,null,null,null,null,null,null,null,null,null,null,"Powerlink"]
[null,null,null,null,null,null,null,null,null,null,null,null,null,null,null,null,null,null,null,null,null,"ACN/ABN",null,null,null,null,null,null,null,null,null,null,null,null,null,null,null,{"$f":"INDEX(dms_ABN_List,MATCH(dms_TradingName,dms_TradingName_List))","v":82078849233}]
[]
[]
[]
[null,null,null,null,null,null,null,null,null,null,null,null,null,null,null,null,null,null,null,null,null,"Business Address",null,null,null,null,null,null,null,null,null,null,null,null,null,null,null,null,null,null,null,null,null,null,null,null,null,null,null,null,null,null,null,null,null,null,null,null,null,null,null,null,null,null,null,null,null,null,"Postal Address"]
[]
[null,null,null,null,null,null,null,null,null,null,null,null,null,null,null,null,null,null,null,null,null,"Address 1",null,null,null,null,null,null,null,null,null,null,null,null,null,null,null,{"$f":"INDEX(dms_Addr1_List,MATCH(dms_TradingName,dms_TradingName_List))","v":"33 Harold St"},null,null,null,null,null,null,null,null,null,null,null,null,null,null,null,null,null,null,null,null,null,null,"Address 1",null,null,null,null,null,null,null,{"$f":"INDEX(dms_PAddr1_List,MATCH(dms_TradingName,dms_TradingName_List))","v":"PO Box 1193"}]
[null,null,null,null,null,null,null,null,null,null,null,null,null,null,null,null,null,null,null,null,null,"Address 2",null,null,null,null,null,null,null,null,null,null,null,null,null,null,null,{"$f":"IF(ISBLANK(INDEX(dms_Addr2_List,MATCH(dms_TradingName,dms_TradingName_List))),\"\",(INDEX(dms_Addr2_List,MATCH(dms_TradingName,dms_TradingName_List))))","v":""},null,null,null,null,null,null,null,null,null,null,null,null,null,null,null,null,null,null,null,null,null,null,"Address 2",null,null,null,null,null,null,null,{"$f":"IF(ISBLANK(INDEX(dms_PAddr2_List,MATCH(dms_TradingName,dms_TradingName_List))),\"\",(INDEX(dms_PAddr2_List,MATCH(dms_TradingName,dms_TradingName_List))))","v":""}]
[null,null,null,null,null,null,null,null,null,null,null,null,null,null,null,null,null,null,null,null,null,"Suburb",null,null,null,null,null,null,null,null,null,null,null,null,null,null,null,{"$f":"INDEX(dms_Suburb_List,MATCH(dms_TradingName,dms_TradingName_List))","v":"VIRGINIA"},null,null,null,null,null,null,null,null,null,null,null,null,null,null,null,null,null,null,null,null,null,null,"Suburb",null,null,null,null,null,null,null,{"$f":"INDEX(dms_PSuburb_List,MATCH(dms_TradingName,dms_TradingName_List))","v":"VIRGINIA"}]
[null,null,null,null,null,null,null,null,null,null,null,null,null,null,null,null,null,null,null,null,null,"State",null,null,null,null,null,null,null,null,null,null,null,null,null,null,null,{"$f":"INDEX(dms_State_List,MATCH(dms_TradingName,dms_TradingName_List))","v":"Qld"},null,null,null,null,null,null,null,null,null,"Post code",null,null,null,null,null,null,null,null,null,null,null,null,"State",null,null,null,null,null,null,null,{"$f":"INDEX(dms_PState_List,MATCH(dms_TradingName,dms_TradingName_List))","v":"QLD"},null,null,null,null,null,null,null,null,null,"Post code"]
[]
[null,null,null,null,null,null,null,null,null,null,null,null,null,null,null,null,null,null,null,null,null,null,null,null,null,null,null,null,null,null,null,null,null,null,null,null,null,null,null,null,null,null,null,null,null,null,null,null,null,null,null,null,"`"]
[]
[null,null,null,null,null,null,null,null,null,null,null,null,null,null,null,null,null,null,null,null,null,"Contact Names"]
[]
[null,null,null,null,null,null,null,null,null,null,null,null,null,null,null,null,null,null,null,null,null,"Name",null,null,null,null,null,null,null,null,null,null,null,null,null,null,null,"Matthew Myers",null,null,null,null,null,null,null,null,null,null,null,null,null,null,null,null,null,null,null,null,null,null,"Name",null,null,null,null,null,null,null,"-- enter name --"]
[null,null,null,null,null,null,null,null,null,null,null,null,null,null,null,null,null,null,null,null,null,"Phone",null,null,null,null,null,null,null,null,null,null,null,null,null,null,null,"07 3860 2074",null,null,null,null,null,null,null,null,null,null,null,null,null,null,null,null,null,null,null,null,null,null,"Phone",null,null,null,null,null,null,null,"-- enter phone number --"]
[null,null,null,null,null,null,null,null,null,null,null,null,null,null,null,null,null,null,null,null,null,"Email",null,null,null,null,null,null,null,null,null,null,null,null,null,null,null,"mmyers@powerlink.com.au",null,null,null,null,null,null,null,null,null,null,null,null,null,null,null,null,null,null,null,null,null,null,"Email",null,null,null,null,null,null,null,"-- enter email address --"]
[]
[]
[]
[]
[null,null,null,null,null,null,null,null,null,null,null,null,null,null,null,null,"REGULATORY CONTROL PERIODS"]
[]
[]
[null,null,null,null,null,null,null,null,null,null,null,null,null,null,null,null,null,null,null,null,null,null,null,null,null,"Forthcoming period",null,null,null,null,null,null,null,null,null,null,null,"2022-23",null,null,null,null,null,null,null,null,{"$f":"FRCP_y2","v":"2023-24"},null,null,null,null,null,null,null,null,{"$f":"FRCP_y3","v":"2024-25"},null,null,null,null,null,null,null,null,{"$f":"FRCP_y4","v":"2025-26"},null,null,null,null,null,null,null,null,{"$f":"FRCP_y5","v":"2026-27"}]
[null,null,null,null,null,null,null,null,null,null,null,null,null,null,null,null,null,null,null,null,null,null,null,null,null,null,null,null,null,null,null,null,null,null,null,null,null,{"$f":"FRCP_y6","v":"2027-28"},null,null,null,null,null,null,null,null,{"$f":"FRCP_y7","v":"2028-29"},null,null,null,null,null,null,null,null,{"$f":"FRCP_y8","v":"2029-30"},null,null,null,null,null,null,null,null,{"$f":"FRCP_y9","v":"2030-31"},null,null,null,null,null,null,null,null,{"$f":"FRCP_y10","v":"2031-32"}]
[null,null,null,null,null,null,null,null,null,null,null,null,null,null,null,null,null,null,null,null,null,null,null,null,null,null,null,null,null,null,null,null,null,null,null,null,null,{"$f":"FRCP_y11","v":"2032-33"},null,null,null,null,null,null,null,null,{"$f":"FRCP_y12","v":"2033-34"},null,null,null,null,null,null,null,null,{"$f":"FRCP_y13","v":"2034-35"},null,null,null,null,null,null,null,null,{"$f":"FRCP_y14","v":"2035-36"},null,null,null,null,null,null,null,null,{"$f":"FRCP_y15","v":"2036-37"}]
[]
[null,null,null,null,null,null,null,null,null,null,null,null,null,null,null,null,null,null,null,null,null,null,null,"RESETS",null,"Current period",null,null,null,null,null,null,null,null,null,null,null,{"$f":"CRCP_y1","v":"2017-18"},null,null,null,null,null,null,null,null,{"$f":"CRCP_y2","v":"2018-19"},null,null,null,null,null,null,null,null,{"$f":"CRCP_y3","v":"2019-20"},null,null,null,null,null,null,null,null,{"$f":"CRCP_y4","v":"2020-21"},null,null,null,null,null,null,null,null,{"$f":"CRCP_y5","v":"2021-22"}]
[null,null,null,null,null,null,null,null,null,null,null,null,null,null,null,null,null,null,null,null,null,null,null,null,null,null,null,null,null,null,null,null,null,null,null,null,null,{"$f":"CRCP_y6","v":"2022-23"},null,null,null,null,null,null,null,null,{"$f":"CRCP_y7","v":"2023-24"},null,null,null,null,null,null,null,null,{"$f":"CRCP_y8","v":"2024-25"},null,null,null,null,null,null,null,null,{"$f":"CRCP_y9","v":"2025-26"},null,null,null,null,null,null,null,null,{"$f":"CRCP_y10","v":"2026-27"}]
[null,null,null,null,null,null,null,null,null,null,null,null,null,null,null,null,null,null,null,null,null,null,null,null,null,null,null,null,null,null,null,null,null,null,null,null,null,{"$f":"CRCP_y11","v":"2027-28"},null,null,null,null,null,null,null,null,{"$f":"CRCP_y12","v":"2028-29"},null,null,null,null,null,null,null,null,{"$f":"CRCP_y13","v":"2029-30"},null,null,null,null,null,null,null,null,{"$f":"CRCP_y14","v":"2030-31"},null,null,null,null,null,null,null,null,{"$f":"CRCP_y15","v":"2031-32"}]
[]
[null,null,null,null,null,null,null,null,null,null,null,null,null,null,null,null,null,null,null,null,null,null,null,null,null,"Previous period",null,null,null,null,null,null,null,null,null,null,null,{"$f":"PRCP_y1","v":"2012-13"},null,null,null,null,null,null,null,null,{"$f":"PRCP_y2","v":"2013-14"},null,null,null,null,null,null,null,null,{"$f":"PRCP_y3","v":"2014-15"},null,null,null,null,null,null,null,null,{"$f":"PRCP_y4","v":"2015-16"},null,null,null,null,null,null,null,null,{"$f":"PRCP_y5","v":"2016-17"}]
[null,null,null,null,null,null,null,null,null,null,null,null,null,null,null,null,null,null,null,null,null,null,null,null,null,null,null,null,null,null,null,null,null,null,null,null,null,{"$f":"PRCP_y6","v":"2017-18"},null,null,null,null,null,null,null,null,{"$f":"PRCP_y7","v":"2018-19"},null,null,null,null,null,null,null,null,{"$f":"PRCP_y8","v":"2019-20"},null,null,null,null,null,null,null,null,{"$f":"PRCP_y9","v":"2020-21"},null,null,null,null,null,null,null,null,{"$f":"PRCP_y10","v":"2021-22"}]
[null,null,null,null,null,null,null,null,null,null,null,null,null,null,null,null,null,null,null,null,null,null,null,null,null,null,null,null,null,null,null,null,null,null,null,null,null,{"$f":"PRCP_y11","v":"2022-23"},null,null,null,null,null,null,null,null,{"$f":"PRCP_y12","v":"2023-24"},null,null,null,null,null,null,null,null,{"$f":"PRCP_y13","v":"2024-25"},null,null,null,null,null,null,null,null,{"$f":"PRCP_y14","v":"2025-26"},null,null,null,null,null,null,null,null,{"$f":"PRCP_y15","v":"2026-27"}]
[]
[null,null,null,null,null,null,null,null,null,null,null,null,null,null,null,null,null,null,null,null,null,null,null,null,null,"Commencing year",null,null,null,null,null,null,null,null,null,null,null,"2022-23"]
[null,null,null,null,null,null,null,null,null,null,null,null,null,null,null,null,null,null,null,null,null,null,null,"ANNUAL RINS"]
[null,null,null,null,null,null,null,null,null,null,null,null,null,null,null,null,null,null,null,null,null,null,null,null,null,"Final year",null,null,null,null,null,null,null,null,null,null,null,"2022-23"]
[]
[]
[]
[null,null,null,null,null,null,null,null,null,null,null,null,null,null,null,null,"SUBMISSION DETAILS"]
[]
[null,null,null,null,null,null,null,null,null,null,null,null,null,null,null,null,null,null,null,null,null,null,null,null,null,"RIN type",null,null,null,null,null,null,null,null,null,null,null,{"$f":"INDIRECT(dms_Model)","v":"Regulatory Reporting (Reset)"}]
[]
[null,null,null,null,null,null,null,null,null,null,null,null,null,null,null,null,null,null,null,null,null,null,null,null,null,"Source",null,null,null,null,null,null,null,null,null,null,null,"Regulatory proposal"]
[]
[null,null,null,null,null,null,null,null,null,null,null,null,null,null,null,null,null,null,null,null,null,null,null,"THIS FILE",null,"Data Quality",null,null,null,null,null,null,null,null,null,null,null,"Consolidated"]
[]
[null,null,null,null,null,null,null,null,null,null,null,null,null,null,null,null,null,null,null,null,null,null,null,null,null,"Confidentiality Status",null,null,null,null,null,null,null,null,null,null,null,"Public"]
[]
[null,null,null,null,null,null,null,null,null,null,null,null,null,null,null,null,null,null,null,null,null,null,null,null,null,"Amended RIN \nAmendment Reason",null,null,null,null,null,null,null,null,null,null,null,"."]
[]
[]
[]
[null,null,null,null,null,null,null,null,null,null,null,null,null,null,null,null,null,null,null,null,null,null,null,null,null,"Submission Date",null,null,null,null,null,null,null,null,null,null,null,"2021-01-28",null,null,null,null,null,null,null,null,null,null,null,null,null,null,null,null,null,"Please enter date this file submitted to AER"]

{"sheet":"CPI series","index":8,"n_rows":12,"n_cols":12,"rows_kept":12,"cut":false,"hidden":false,"merged":[[8,2,8,8]]}
[null,{"$f":"(LOOKUP(dms_Model,dms_Model_List,dms_Worksheet_List))","v":"REGULATORY REPORTING STATEMENT"}]
[null,{"$f":"INDEX(dms_TradingNameFull_List,MATCH(dms_TradingName,dms_TradingName_List))","v":"Queensland Electricity Transmission Corporation Limited trading as Powerlink Queensland"}]
[null,{"$f":"IF(SUM(dms_SingleYear_Model)>0,CRY,CONCATENATE(FRCP_y1,\" to \",dms_MultiYear_FinalYear_Result))","v":"2022-23 to 2026-27"}]
[null,"CPI SERIES"]
[]
[]
[null,"NOMINATED CPI SERIES"]
[]
[null,"Name of CPI series","2017/18 to 2019/20: All groups weighted average of 8 capital cities CPI movement from December to December.\n2020/21 and 2021/22: Reserve Bank of Australia forecast per Statement on Monetary Policy, November 2020.\n2022/23 to 2026/27: Forecast of inflation using methodology specified in the AER's 2019 PTRM (Version 4)."]
[]
[null,null,{"$f":"CRCP_y1","v":"2017-18"},{"$f":"CRCP_y2","v":"2018-19"},{"$f":"CRCP_y3","v":"2019-20"},{"$f":"CRCP_y4","v":"2020-21"},{"$f":"CRCP_y5","v":"2021-22"},{"$f":"FRCP_y1","v":"2022-23"},{"$f":"FRCP_y2","v":"2023-24"},{"$f":"FRCP_y3","v":"2024-25"},{"$f":"FRCP_y4","v":"2025-26"},{"$f":"FRCP_y5","v":"2026-27"}]
[null,"Series data",1.9090909090909047E-2,1.7841213202497874E-2,1.8404907975460238E-2,4.9999999999998934E-3,1.0000000000000009E-2,2.248709150177497E-2,2.2487091501775192E-2,2.248709150177497E-2,2.248709150177497E-2,2.248709150177497E-2]

{"sheet":"2.1 Expenditure summary","index":9,"n_rows":37,"n_cols":9,"rows_kept":37,"cut":false,"hidden":false,"merged":[[8,2,8,8],[19,2,19,8],[30,2,30,8]]}
[null,{"$f":"(LOOKUP(dms_Model,dms_Model_List,dms_Worksheet_List))","v":"REGULATORY REPORTING STATEMENT"}]
[null,{"$f":"INDEX(dms_TradingNameFull_List,MATCH(dms_TradingName,dms_TradingName_List))","v":"Queensland Electricity Transmission Corporation Limited trading as Powerlink Queensland"}]
[null,{"$f":"IF(SUM(dms_SingleYear_Model)>0,CRY,CONCATENATE(FRCP_y1,\" to \",dms_MultiYear_FinalYear_Result))","v":"2022-23 to 2026-27"}]
[null,"2.1 - EXPENDITURE SUMMARY AND RECONCILIATION"]
[]
[null,"There are three tables on this worksheet. Each has been grouped for ease of navigation. See the Instructions sheet on how to group or ungroup tables. "]
[]
[null,"2.1.1 - PRESCRIBED TRANSMISSION SERVICES CAPEX (as incurred)"]
[null,null,{"$f":"CONCATENATE(\"Forecast \n($0's. real \",dms_DollarReal,\")\")","v":"Forecast \n($0's. real June 2022)"}]
[null,null,{"$f":"dms_y1","v":"2020-21"},{"$f":"dms_y2","v":"2021-22"},{"$f":"dms_y3","v":"2022-23"},{"$f":"dms_y4","v":"2023-24"},{"$f":"dms_y5","v":"2024-25"},{"$f":"dms_y6","v":"2025-26"},{"$f":"dms_y7","v":"2026-27"}]
[null,"Replacement expenditure",221368588.91396809,120192099.17158762,157930582.54082641,154316088.3030881,130917928.88402976,62904650.651392482,141822148.81885597]
[null,"Connections",0,0,0,0,0,0,0]
[null,"Augmentation Expenditure",0,0,0,0,16645342.598805394,0,0]
[null,"Non-network",21211386.039511062,13758906.502477139,21298871.974861134,36987875.296298459,23473140.809707314,15202355.601009557,12191428.622342387]
[null,"Capitalised network overheads"]
[null,"Capitalised corporate overheads",19201237.92025508,12488717.610874904,17295962.801813517,14879182.898098543,13771575.550454963,7660103.2160903979,14330140.926129883]
[null,"Total",{"$f":"SUM(C11:C16)","v":261781212.87373424},146439723.28493965,196525417.31750107,206183146.4974851,184807987.84299743,85767109.468492433,168343718.36732823]
[]
[null,"2.1.2 - PRESCRIBED TRANSMISSION SERVICES OPEX"]
[null,null,{"$f":"CONCATENATE(\"Forecast \n($0's. real \",dms_DollarReal,\")\")","v":"Forecast \n($0's. real June 2022)"}]
[null,null,{"$f":"dms_y1","v":"2020-21"},{"$f":"dms_y2","v":"2021-22"},{"$f":"dms_y3","v":"2022-23"},{"$f":"dms_y4","v":"2023-24"},{"$f":"dms_y5","v":"2024-25"},{"$f":"dms_y6","v":"2025-26"},{"$f":"dms_y7","v":"2026-27"}]
[null,"Vegetation management"]
[null,"Maintenance"]
[null,"Non-network"]
[null,"Network overheads"]
[null,"Corporate overheads"]
[null,"Total",{"$f":"SUM(C22:C26)","v":0},0,0,0,0,0,0]
[]
[]
[null,"2.1.8 - PRESCRIBED TRANSMISSION SERVICES CAPITALISED OVERHEADS"]
[null,null,{"$f":"CONCATENATE(\"Forecast \n($0's. real \",dms_DollarReal,\")\")","v":"Forecast \n($0's. real June 2022)"}]
[null,null,{"$f":"dms_y1","v":"2020-21"},{"$f":"dms_y2","v":"2021-22"},{"$f":"dms_y3","v":"2022-23"},{"$f":"dms_y4","v":"2023-24"},{"$f":"dms_y5","v":"2024-25"},{"$f":"dms_y6","v":"2025-26"},{"$f":"dms_y7","v":"2026-27"}]
[null,"Replacement expenditure",16915551.861961186,10242708.855635151,14637855.008408457,11602881.500977099,10276526.835059628,5280149.137879245,12194173.971662551]
[null,"Connections",0,0,0,0,0,0,0]
[null,"Augmentation Expenditure",0,0,0,0,866156.28097122535,0,0]
[null,"Non-network",2285686.0582938939,2246008.7552397531,2658107.7934050597,3276301.3971214443,2628892.4344241098,2379954.0782111529,2135966.954467332]
[null,"Total",{"$f":"SUM(C33:C36)","v":19201237.92025508},12488717.610874904,17295962.801813517,14879182.898098543,13771575.550454963,7660103.2160903979,14330140.926129883]

{"sheet":"2.1 Unprotected Exp Summary","index":10,"n_rows":38,"n_cols":8,"rows_kept":38,"cut":false,"hidden":false,"merged":[[8,1,8,7],[20,1,20,7],[31,1,31,7]]}
[{"$f":"(LOOKUP(dms_Model,dms_Model_List,dms_Worksheet_List))","v":"REGULATORY REPORTING STATEMENT"}]
[{"$f":"INDEX(dms_TradingNameFull_List,MATCH(dms_TradingName,dms_TradingName_List))","v":"Queensland Electricity Transmission Corporation Limited trading as Powerlink Queensland"}]
[{"$f":"IF(SUM(dms_SingleYear_Model)>0,CRY,CONCATENATE(FRCP_y1,\" to \",dms_MultiYear_FinalYear_Result))","v":"2022-23 to 2026-27"}]
["2.1 - EXPENDITURE SUMMARY AND RECONCILIATION"]
[]
["There are three tables on this worksheet. Each has been grouped for ease of navigation. See the Instructions sheet on how to group or ungroup tables. "]
[]
["2.1.1 - PRESCRIBED TRANSMISSION SERVICES CAPEX (as incurred)"]
[null,{"$f":"CONCATENATE(\"Forecast \n($0's. real \",dms_DollarReal,\")\")","v":"Forecast \n($0's. real June 2022)"}]
[null,{"$f":"dms_y1","v":"2020-21"},{"$f":"dms_y2","v":"2021-22"},{"$f":"dms_y3","v":"2022-23"},{"$f":"dms_y4","v":"2023-24"},{"$f":"dms_y5","v":"2024-25"},{"$f":"dms_y6","v":"2025-26"},{"$f":"dms_y7","v":"2026-27"}]
["Replacement expenditure",221368588.91396809,120192099.17158762,157930582.54082641,154316088.3030881,130917928.88402976,62904650.651392482,141822148.81885597]
["Connections",0,0,0,0,0,0,0]
["Augmentation Expenditure",0,0,0,0,16645342.598805394,0,0]
["Non-network",21211386.039511062,13758906.502477139,21298871.974861134,36987875.296298459,23473140.809707314,15202355.601009557,12191428.622342387]
["Capitalised network overheads",0,0,0,0,0,0,0]
["Capitalised corporate overheads",19201237.92025508,12488717.610874904,17295962.801813517,14879182.898098543,13771575.550454963,7660103.2160903979,14330140.926129883]
["Balancing Item",-82306498.585953951,60683855.895365208,-4943224.5137295127,3770972.1705991924,-15877309.064926565,67445651.404569879,-13543650.989303082]
["Total",{"$f":"SUM(B11:B17)","v":179474714.28778028},{"$f":"SUM(C11:C17)","v":207123579.18030486},191582192.80377156,209954118.66808429,168930678.77807087,153212760.87306231,154800067.37802514]
[]
["2.1.2 - PRESCRIBED TRANSMISSION SERVICES OPEX"]
[null,{"$f":"CONCATENATE(\"Forecast \n($0's. real \",dms_DollarReal,\")\")","v":"Forecast \n($0's. real June 2022)"}]
[null,{"$f":"dms_y1","v":"2020-21"},{"$f":"dms_y2","v":"2021-22"},{"$f":"dms_y3","v":"2022-23"},{"$f":"dms_y4","v":"2023-24"},{"$f":"dms_y5","v":"2024-25"},{"$f":"dms_y6","v":"2025-26"},{"$f":"dms_y7","v":"2026-27"}]
["Vegetation management"]
["Maintenance"]
["Non-network"]
["Network overheads"]
["Corporate overheads"]
["Total",{"$f":"SUM(B23:B27)","v":0},0,0,0,0,0,0]
[]
[]
["2.1.8 - PRESCRIBED TRANSMISSION SERVICES CAPITALISED OVERHEADS"]
[null,{"$f":"CONCATENATE(\"Forecast \n($0's. real \",dms_DollarReal,\")\")","v":"Forecast \n($0's. real June 2022)"}]
[null,{"$f":"dms_y1","v":"2020-21"},{"$f":"dms_y2","v":"2021-22"},{"$f":"dms_y3","v":"2022-23"},{"$f":"dms_y4","v":"2023-24"},{"$f":"dms_y5","v":"2024-25"},{"$f":"dms_y6","v":"2025-26"},{"$f":"dms_y7","v":"2026-27"}]
["Replacement expenditure",16915551.861961186,10242708.855635151,14637855.008408457,11602881.500977099,10276526.835059628,5280149.137879245,12194173.971662551]
["Connections",0,0,0,0,0,0,0]
["Augmentation Expenditure",0,0,0,0,866156.28097122535,0,0]
["Non-network",2285686.0582938939,2246008.7552397531,2658107.7934050597,3276301.3971214443,2628892.4344241098,2379954.0782111529,2135966.954467332]
["Total",{"$f":"SUM(B34:B37)","v":19201237.92025508},12488717.610874904,17295962.801813517,14879182.898098543,13771575.550454963,7660103.2160903979,14330140.926129883]

{"sheet":"2.1 Balancing Item","index":11,"n_rows":22,"n_cols":8,"rows_kept":22,"cut":false,"hidden":false,"merged":[[3,0,3,7]]}
["RR23-27"]
["Reconciliation of Balancing Item from Template 2.1"]
[]
["Reconciliation to Powerlink's Revenue Proposal"]
["Real June 2022"]
["Prescribed transmission services capex (as incurred)","2020-21","2021-22","2022-23","2023-24","2024-25","2025-26","2026-27"]
[]
["Total Capex as per RIN Templates (as commissioned)",242579974.95347914,133951005.67406476,179229454.51568756,191303963.59938657,171036412.29254246,78107006.252402037,154013577.44119835]
[]
["Capitalised Corporate Overhead as per RIN Definition",19201237.92025508,12488717.610874904,17295962.801813517,14879182.898098543,13771575.550454963,7660103.2160903979,14330140.926129883]
[]
["Balancing Items"]
["    - Capex \"As Incurred\" Project Adjustment (Prior year as incurred cost and current year not commissioned)",-82306498.585953951,60683855.895365208,-4943224.5137295127,3770972.1705991924,-15877309.064926565,67445651.404569879,-13543650.989303082]
["Total Balancing Item",{"$f":"SUM(B13:B13)","v":-82306498.585953951},60683855.895365208,-4943224.5137295127,3770972.1705991924,-15877309.064926565,67445651.404569879,-13543650.989303082]
[]
["Total Capex - Table 2.1.1 (as incurred)",{"$f":"+B8+B10+B14","v":179474714.28778028},207123579.18030486,191582192.80377156,209954118.66808429,168930678.77807087,153212760.87306231,154800067.37802514]
[]
["Total Regulated Capex - Powerlink's Post-Tax Revenue Model / Revenue Forecast Model",179474714.28778028,207123579.18030488,191582192.80377153,209954118.66808426,168930678.77807084,153212760.87306231,154800067.37802511]
[]
[]
[]
[null,-82306498.585953951,61667030.098433584,-4943224.5137295127,25611712.524368614,-15877309.064926565,67445651.404569879,-13543650.989303082]

{"sheet":"2.2 Repex","index":12,"n_rows":591,"n_cols":10,"rows_kept":591,"cut":false,"hidden":false,"merged":[[400,3,400,9],[5,1,5,2],[9,3,9,9],[10,3,10,9],[204,3,204,9],[205,3,205,9],[399,3,399,9]]}
[null,{"$f":"(LOOKUP(dms_Model,dms_Model_List,dms_Worksheet_List))","v":"REGULATORY REPORTING STATEMENT"}]
[null,{"$f":"INDEX(dms_TradingNameFull_List,MATCH(dms_TradingName,dms_TradingName_List))","v":"Queensland Electricity Transmission Corporation Limited trading as Powerlink Queensland"}]
[null,{"$f":"IF(SUM(dms_SingleYear_Model)>0,CRY,CONCATENATE(FRCP_y1,\" to \",dms_MultiYear_FinalYear_Result))","v":"2022-23 to 2026-27"}]
[null,"2.2 REPEX"]
[]
[null,"There is ONE table (with three sub-tables) on this worksheet. See the Instructions sheet on how to group or ungroup tables. "]
[]
[null,"2.2.1 - REPLACEMENT EXPENDITURE, VOLUMES AND ASSET FAILURES BY ASSET CATEGORY"]
[null,"EXPENDITURE"]
[null,null,null,"EXPENDITURE"]
[null,null,null,{"$f":"CONCATENATE(\"($0's. real \",dms_DollarReal,\")\")","v":"($0's. real June 2022)"}]
[null,"ASSET GROUP","ASSET CATEGORY",{"$f":"dms_y1","v":"2020-21"},{"$f":"dms_y2","v":"2021-22"},{"$f":"dms_y3","v":"2022-23"},{"$f":"dms_y4","v":"2023-24"},{"$f":"dms_y5","v":"2024-25"},{"$f":"dms_y6","v":"2025-26"},{"$f":"dms_y7","v":"2026-27"}]
[null,"TRANSMISSION TOWERS\nHighest operating voltage; Circuit configuration","< = 33 kV; Single Circuit"]
[null,null,"> 33 kV & < = 66 kV ; Single Circuit"]
[null,null,"> 66 kV & < = 132 kV ; Single Circuit"]
[null,null,"> 132 kV & < = 275 kV ; Single Circuit"]
[null,null,"> 275 kV & < = 330 kV ; Single Circuit"]
[null,null,"> 330 kV & < = 500 kV  ; Single Circuit"]
[null,null,"> 500 kV  ; Single Circuit"]
[null,null,"< = 33 kV; Multiple Circuit"]
[null,null,"> 33 kV & < = 66 kV ; Multiple Circuit"]
[null,null,"> 66 kV & < = 132 kV ; Multiple Circuit"]
[null,null,"> 132 kV & < = 275 kV ; Multiple Circuit"]
[null,null,"> 275 kV & < = 330 kV ; Multiple Circuit"]
[null,null,"> 330 kV & < = 500 kV  ; Multiple Circuit"]
[null,null,"> 500 kV  ; Multiple Circuit"]
[null,null,"Other"]
[null,"TRANSMISSION TOWER SUPPORT STRUCTURES BY:\nHighest operating voltage; Circuit configuration","< = 33 kV; Single Circuit",0,0,0,0,0,0,0]
[null,null,"> 33 kV & < = 66 kV ; Single Circuit",0,0,0,0,0,0,0]
[null,null,"> 66 kV & < = 132 kV ; Single Circuit",0,0,0,0,0,0,0]
[null,null,"> 132 kV & < = 275 kV ; Single Circuit",0,0,0,0,0,0,0]
[null,null,"> 275 kV & < = 330 kV ; Single Circuit",0,0,0,0,0,0,0]
[null,null,"> 330 kV & < = 500 kV  ; Single Circuit",0,0,0,0,0,0,0]
[null,null,"> 500 kV  ; Single Circuit",0,0,0,0,0,0,0]
[null,null,"< = 33 kV; Multiple Circuit",0,0,0,0,0,0,0]
[null,null,"> 33 kV & < = 66 kV ; Multiple Circuit",0,0,0,0,0,0,0]
[null,null,"> 66 kV & < = 132 kV ; Multiple Circuit",0,0,0,0,0,0,0]
[null,null,"> 132 kV & < = 275 kV ; Multiple Circuit",0,0,0,0,0,0,0]
[null,null,"> 275 kV & < = 330 kV ; Multiple Circuit",0,0,0,0,0,0,0]
[null,null,"> 330 kV & < = 500 kV  ; Multiple Circuit",0,0,0,0,0,0,0]
[null,null,"> 500 kV  ; Multiple Circuit",0,0,0,0,0,0,0]
[null,null,"Other",0,0,0,0,0,0,0]
[null,"CONDUCTORS BY: \nVoltage; Maximum continuous rating","< = 33 kV ; < = 100 MVA"]
[null,null,"< = 33 kV ; > 100 MVA & < = 400 MVA"]
[null,null,"< = 33 kV ; > 400 MVA"]
[null,null,"> 33 kV & < = 66 kV  ; < = 100 MVA"]
[null,null,"> 33 kV & < = 66 kV  ; > 100 MVA & < = 400 MVA"]
[null,null,"> 33 kV & < = 66 kV  ; > 400 MVA"]
[null,null,"> 66 kV & < = 132 kV  ; < = 100 MVA"]
[null,null,"> 66 kV & < = 132 kV  ; > 100 MVA & < = 400 MVA"]
[null,null,"> 66 kV & < = 132 kV  ; > 400 MVA"]
[null,null,"> 132 kV & < = 275 kV  ; < = 200 MVA"]
[null,null,"> 132 kV & < = 275 kV  ; > 200 MVA & < = 600 MVA"]
[null,null,"> 132 kV & < = 275 kV  ; > 600 MVA"]
[null,null,"> 275 kV & < = 330 kV  ; < = 800 MVA"]
[null,null,"> 275 kV & < = 330 kV  ; > 800 MVA & < = 1200 MVA"]
[null,null,"> 275 kV & < = 330 kV  ; > 1200 MVA"]
[null,null,"> 330 kV & < = 500 kV   ; < = 1000 MVA"]
[null,null,"> 330 kV & < = 500 kV   ; > 1000 MVA & < = 1500 MVA"]
[null,null,"> 330 kV & < = 500 kV   ; > 1500 MVA"]
[null,null,"> 500 kV   ; < = 2000 MVA"]
[null,null,"> 500 kV   ; > 2000 MVA & < = 3000 MVA"]
[null,null,"> 500 kV   ; > 3000 MVA"]
[null,null,"Other"]
[null,"TRANSMISSION CABLES BY: \nHighest operating voltage; Insulation type","< = 33 kV; Oil Filled"]
[null,null,"> 33 kV & < = 66 kV ; Oil Filled"]
[null,null,"> 66 kV & < = 132 kV ; Oil Filled"]
[null,null,"> 132 kV & < = 275 kV ; Oil Filled"]
[null,null,"> 275 kV & < = 330 kV ; Oil Filled"]
[null,null,"> 330 kV & < = 500 kV  ; Oil Filled"]
[null,null,"> 500 kV  ; Oil Filled"]
[null,null,"< = 33 kV; XLPE Insulated"]
[null,null,"> 33 kV & < = 66 kV ; XLPE Insulated"]
[null,null,"> 66 kV & < = 132 kV ; XLPE Insulated"]
[null,null,"> 132 kV & < = 275 kV ; XLPE Insulated"]
[null,null,"> 275 kV & < = 330 kV ; XLPE Insulated"]
[null,null,"> 330 kV & < = 500 kV  ; XLPE Insulated"]
[null,null,"> 500 kV  ; XLPE Insulated"]
[null,null,"< = 33 kV; Other Insulated"]
[null,null,"> 33 kV & < = 66 kV ; Other Insulated"]
[null,null,"> 66 kV & < = 132 kV ; Other Insulated"]
[null,null,"> 132 kV & < = 275 kV ; Other Insulated"]
[null,null,"> 275 kV & < = 330 kV ; Other Insulated"]
[null,null,"> 330 kV & < = 500 kV  ; Other Insulated"]
[null,null,"> 500 kV  ; Other Insulated"]
[null,null,"Other"]
[null,"SUBSTATION SWITCHBAYS BY: \nHighest operating voltage; Switch type","< = 33 kV; Air Insulated circuit Breaker"]
[null,null,"> 33 kV & < = 66 kV ; Air Insulated circuit Breaker"]
[null,null,"> 66 kV & < = 132 kV ; Air Insulated circuit Breaker"]
[null,null,"> 132 kV & < = 275 kV ; Air Insulated circuit Breaker"]
[null,null,"> 275 kV & < = 330 kV ; Air Insulated circuit Breaker"]
[null,null,"> 330 kV & < = 500 kV  ; Air Insulated circuit Breaker"]
[null,null,"> 500 kV  ; Air Insulated circuit Breaker"]
[null,null,"< = 33 kV; Air Insulated Isolators / Earth Switch"]
[null,null,"> 33 kV & < = 66 kV ; Air Insulated Isolators / Earth Switch"]
[null,null,"> 66 kV & < = 132 kV ; Air Insulated Isolators / Earth Switch"]
[null,null,"> 132 kV & < = 275 kV ; Air Insulated Isolators / Earth Switch"]
[null,null,"> 275 kV & < = 330 kV ; Air Insulated Isolators / Earth Switch"]
[null,null,"> 330 kV & < = 500 kV  ; Air Insulated Isolators / Earth Switch"]
[null,null,"> 500 kV  ; Air Insulated Isolators / Earth Switch"]
[null,null,"< = 33 kV; VT"]
[null,null,"> 33 kV & < = 66 kV ; VT"]
[null,null,"> 66 kV & < = 132 kV ; VT"]
[null,null,"> 132 kV & < = 275 kV ; VT"]
[null,null,"> 275 kV & < = 330 kV ; VT"]
[null,null,"> 330 kV & < = 500 kV  ; VT"]
[null,null,"> 500 kV  ; VT"]
[null,null,"< = 33 kV; CT"]
[null,null,"> 33 kV & < = 66 kV ; CT"]
[null,null,"> 66 kV & < = 132 kV ; CT"]
[null,null,"> 132 kV & < = 275 kV ; CT"]
[null,null,"> 275 kV & < = 330 kV ; CT"]
[null,null,"> 330 kV & < = 500 kV  ; CT"]
[null,null,"> 500 kV  ; CT"]
[null,null,"< = 33 kV; GIS Module"]
[null,null,"> 33 kV & < = 66 kV ; GIS Module"]
[null,null,"> 66 kV & < = 132 kV ; GIS Module"]
[null,null,"> 132 kV & < = 275 kV ; GIS Module"]
[null,null,"> 275 kV & < = 330 kV ; GIS Module"]
[null,null,"> 330 kV & < = 500 kV  ; GIS Module"]
[null,null,"> 500 kV  ; GIS Module"]
[null,null,"Other"]
[null,"SUBSTATION POWER TRANSFORMERS BY: \nHighest operating voltage;  Ampere rating","< = 33 kV ; < = 10 MVA"]
[null,null,"< = 33 kV ; > 10 MVA & < =  30 MVA"]
[null,null,"< = 33 kV ; > 30 MVA"]
[null,null,"> 33 kV & < = 66 kV  ; < = 10 MVA"]
[null,null,"> 33 kV & < = 66 kV  ; > 10 MVA & < =  30 MVA"]
[null,null,"> 33 kV & < = 66 kV  ; > 30 MVA"]
[null,null,"> 66 kV & < = 132 kV  ; < = 30 MVA"]
[null,null,"> 66 kV & < = 132 kV  ; > 30 MVA & < =  60 MVA"]
[null,null,"> 66 kV & < = 132 kV  ; > 60 MVA"]
[null,null,"> 132 kV & < = 220 kV  ; < = 50 MVA"]
[null,null,"> 132 kV & < = 220 kV  ; > 50 MVA & < =  100 MVA"]
[null,null,"> 132 kV & < = 220 kV  ; > 100 MVA"]
[null,null,"> 220 kV & < = 275 kV  ; < = 50 MVA"]
[null,null,"> 220 kV & < = 275 kV  ; > 50 MVA & < =  100 MVA"]
[null,null,"> 220 kV & < = 275 kV  ; > 100 MVA"]
[null,null,"> 275 kV & < = 330 kV  ; < = 100 MVA"]
[null,null,"> 275 kV & < = 330 kV  ; > 100 MVA & < =  250 MVA"]
[null,null,"> 275 kV & < = 330 kV  ; > 250 MVA"]
[null,null,"> 330 kV & < = 500 kV   ; < = 150 MVA"]
[null,null,"> 330 kV & < = 500 kV   ; > 150 MVA & < =  300 MVA"]
[null,null,"> 330 kV & < = 500 kV   ; > 300 MVA"]
[null,null,"> 500 kV   ; < = 1000 MVA"]
[null,null,"> 500 kV   ; > 1000 MVA & < =  1500 MVA"]
[null,null,"> 500 kV   ; > 1500 MVA"]
[null,null,"Other"]
[null,"SUBSTATION REACTIVE PLANT BY: \nHighest operating voltage; Function","< = 33 kV;  SVCS",0,0,0,0,0,0,0]
[null,null,"> 33 kV & < = 66 kV ;  SVCS",0,0,0,0,0,0,0]
[null,null,"> 66 kV & < = 132 kV ;  SVCS",0,0,0,0,0,0,0]
[null,null,"> 132 kV & < = 275 kV ;  SVCS",0,0,0,0,0,0,0]
[null,null,"> 275 kV & < = 330 kV ;  SVCS",0,0,0,0,0,0,0]
[null,null,"> 330 kV & < = 500 kV  ;  SVCS",0,0,0,0,0,0,0]
[null,null,"> 500 kV  ;  SVCS",0,0,0,0,0,0,0]
[null,null,"< = 33 kV;  Capacitors",0,0,0,0,0,0,0]
[null,null,"> 33 kV & < = 66 kV ;  Capacitors",0,0,0,0,0,0,0]
[null,null,"> 66 kV & < = 132 kV ;  Capacitors",0,0,0,0,0,0,0]
[null,null,"> 132 kV & < = 275 kV ;  Capacitors",0,0,0,0,0,0,0]
[null,null,"> 275 kV & < = 330 kV ;  Capacitors",0,0,0,0,0,0,0]
[null,null,"> 330 kV & < = 500 kV  ;  Capacitors",0,0,0,0,0,0,0]
[null,null,"> 500 kV  ;  Capacitors",0,0,0,0,0,0,0]
[null,null,"< = 33 kV;  Oil Filled Reactors",0,0,0,0,0,0,0]
[null,null,"> 33 kV & < = 66 kV ;  Oil Filled Reactors",0,0,0,0,0,0,0]
[null,null,"> 66 kV & < = 132 kV ;  Oil Filled Reactors",0,0,0,0,0,0,0]
[null,null,"> 132 kV & < = 275 kV ;  Oil Filled Reactors",0,0,0,0,0,0,0]
[null,null,"> 275 kV & < = 330 kV ;  Oil Filled Reactors",0,0,0,0,0,0,0]
[null,null,"> 330 kV & < = 500 kV  ;  Oil Filled Reactors",0,0,0,0,0,0,0]
[null,null,"> 500 kV  ;  Oil Filled Reactors",0,0,0,0,0,0,0]
[null,null,"Other",0,0,0,0,0,0,0]
[null,"SCADA, NETWORK CONTROL AND PROTECTION SYSTEMS BY:\nFunction","Sec Sys - Bay Non Bay"]
[null,null,"Sec Sys - Metering"]
[null,null,"Sec Sys - Telecomms"]
[null,null,"Sec Sys - OPGW"]
[]
[]
[null,"OTHER BY: \nNSP defined","Other - Buildings"]
[null,null,"Other Repex",8608053.3038640954,3617865.264086796,40969151.229807869,0,0,0,1229095.3495176292]
[null,null,"Towers - > 66 kV & < = 132 kV ; Single Circuit - REFURBISHED"]
[null,null,"Towers - > 132 kV & < = 275 kV ; Single Circuit - REFURBISHED"]
[null,null,"Towers - > 275 kV & < = 330 kV ; Single Circuit - REFURBISHED"]
[null,null,"Towers - > 66 kV & < = 132 kV ; Multiple Circuit - REFURBISHED"]
[null,null,"Towers - > 132 kV & < = 275 kV ; Multiple Circuit - REFURBISHED"]
[null,null,"Towers - > 275 kV & < = 330 kV ; Multiple Circuit - REFURBISHED"]
[null,null,"Substation Power Transformers > 66 kV & < = 132 kV  ; < = 30 MVA - REFURBISHED"]
[null,null,"Substation Power Transformers > 66 kV & < = 132 kV  ; > 30 MVA & < =  60 MVA - REFURBISHED"]
[null,null,"Substation Power Transformers > 66 kV & < = 132 kV  ; > 60 MVA - REFURBISHED"]
[null,null,"Substation Power Transformers > 220 kV & < = 275 kV  ; < = 50 MVA - REFURBISHED"]
[null,null,"Substation Power Transformers > 220 kV & < = 275 kV  ; > 50 MVA & < =  100 MVA - REFURBISHED"]
[null,null,"Substation Power Transformers > 220 kV & < = 275 kV  ; > 100 MVA - REFURBISHED"]
[]
[]
[]
[]
[]
[]
[]
[]
[]
[]
[]
[]
[]
[]
[null,"ASSET REPLACEMENTS"]
[null,null,null,"VOLUMES "]
[null,null,null,"(0's)"]
[null,"ASSET GROUP","ASSET CATEGORY",{"$f":"dms_y1","v":"2020-21"},{"$f":"dms_y2","v":"2021-22"},{"$f":"dms_y3","v":"2022-23"},{"$f":"dms_y4","v":"2023-24"},{"$f":"dms_y5","v":"2024-25"},{"$f":"dms_y6","v":"2025-26"},{"$f":"dms_y7","v":"2026-27"}]
[null,"TRANSMISSION TOWERS\nHighest operating voltage; Circuit configuration","< = 33 kV; Single Circuit",0,0,0,0,0,0,0]
[null,null,"> 33 kV & < = 66 kV ; Single Circuit",0,0,0,0,0,0,0]
[null,null,"> 66 kV & < = 132 kV ; Single Circuit",2,0,0,0,0,0,0]
[null,null,"> 132 kV & < = 275 kV ; Single Circuit",0,0,0,0,0,0,0]
[null,null,"> 275 kV & < = 330 kV ; Single Circuit",0,0,0,0,0,0,0]
[null,null,"> 330 kV & < = 500 kV  ; Single Circuit",0,0,0,0,0,0,0]
[null,null,"> 500 kV  ; Single Circuit",0,0,0,0,0,0,0]
[null,null,"< = 33 kV; Multiple Circuit",0,0,0,0,0,0,0]
[null,null,"> 33 kV & < = 66 kV ; Multiple Circuit",0,0,0,0,0,0,0]
[null,null,"> 66 kV & < = 132 kV ; Multiple Circuit",4,0,0,0,0,0,12]
[null,null,"> 132 kV & < = 275 kV ; Multiple Circuit",0,0,0,30,0,0,0]
[null,null,"> 275 kV & < = 330 kV ; Multiple Circuit",0,0,0,0,0,0,0]
[null,null,"> 330 kV & < = 500 kV  ; Multiple Circuit",0,0,0,0,0,0,0]
[null,null,"> 500 kV  ; Multiple Circuit",0,0,0,0,0,0,0]
[null,null,"Other",0,0,0,0,0,0,0]
[null,"TRANSMISSION TOWER SUPPORT STRUCTURES BY:\nHighest operating voltage; Circuit configuration","< = 33 kV; Single Circuit",0,0,0,0,0,0,0]
[null,null,"> 33 kV & < = 66 kV ; Single Circuit",0,0,0,0,0,0,0]
[null,null,"> 66 kV & < = 132 kV ; Single Circuit",0,0,0,0,0,0,0]
[null,null,"> 132 kV & < = 275 kV ; Single Circuit",0,0,0,0,0,0,0]
[null,null,"> 275 kV & < = 330 kV ; Single Circuit",0,0,0,0,0,0,0]
[null,null,"> 330 kV & < = 500 kV  ; Single Circuit",0,0,0,0,0,0,0]
[null,null,"> 500 kV  ; Single Circuit",0,0,0,0,0,0,0]
[null,null,"< = 33 kV; Multiple Circuit",0,0,0,0,0,0,0]
[null,null,"> 33 kV & < = 66 kV ; Multiple Circuit",0,0,0,0,0,0,0]
[null,null,"> 66 kV & < = 132 kV ; Multiple Circuit",0,0,0,0,0,0,0]
[null,null,"> 132 kV & < = 275 kV ; Multiple Circuit",0,0,0,0,0,0,0]
[null,null,"> 275 kV & < = 330 kV ; Multiple Circuit",0,0,0,0,0,0,0]
[null,null,"> 330 kV & < = 500 kV  ; Multiple Circuit",0,0,0,0,0,0,0]
[null,null,"> 500 kV  ; Multiple Circuit",0,0,0,0,0,0,0]
[null,null,"Other",0,0,0,0,0,0,0]
[null,"CONDUCTORS BY: \nVoltage; Maximum continuous rating","< = 33 kV ; < = 100 MVA",0,0,0,0,0,0,0]
[null,null,"< = 33 kV ; > 100 MVA & < = 400 MVA",0,0,0,0,0,0,0]
[null,null,"< = 33 kV ; > 400 MVA",0,0,0,0,0,0,0]
[null,null,"> 33 kV & < = 66 kV  ; < = 100 MVA",0,0,0,0,0,0,0]
[null,null,"> 33 kV & < = 66 kV  ; > 100 MVA & < = 400 MVA",0,0,0,0,0,0,0]
[null,null,"> 33 kV & < = 66 kV  ; > 400 MVA",0,0,0,0,0,0,0]
[null,null,"> 66 kV & < = 132 kV  ; < = 100 MVA",0,0,0,0,0,0,0]
[null,null,"> 66 kV & < = 132 kV  ; > 100 MVA & < = 400 MVA",0,0,0,0,0,0,8]
[null,null,"> 66 kV & < = 132 kV  ; > 400 MVA",0,0,0,0,0,0,0]
[null,null,"> 132 kV & < = 275 kV  ; < = 200 MVA",0,0,0,0,0,0,0]
[null,null,"> 132 kV & < = 275 kV  ; > 200 MVA & < = 600 MVA",0,0,0,0,0,0,0]
[null,null,"> 132 kV & < = 275 kV  ; > 600 MVA",0,0,0,30,0,0,0]
[null,null,"> 275 kV & < = 330 kV  ; < = 800 MVA",0,0,0,0,0,0,0]
[null,null,"> 275 kV & < = 330 kV  ; > 800 MVA & < = 1200 MVA",0,0,0,0,0,0,0]
[null,null,"> 275 kV & < = 330 kV  ; > 1200 MVA",0,0,0,0,0,0,0]
[null,null,"> 330 kV & < = 500 kV   ; < = 1000 MVA",0,0,0,0,0,0,0]
[null,null,"> 330 kV & < = 500 kV   ; > 1000 MVA & < = 1500 MVA",0,0,0,0,0,0,0]
[null,null,"> 330 kV & < = 500 kV   ; > 1500 MVA",0,0,0,0,0,0,0]
[null,null,"> 500 kV   ; < = 2000 MVA",0,0,0,0,0,0,0]
[null,null,"> 500 kV   ; > 2000 MVA & < = 3000 MVA",0,0,0,0,0,0,0]
[null,null,"> 500 kV   ; > 3000 MVA",0,0,0,0,0,0,0]
[null,null,"Other",0,0,0,0,0,0,0]
[null,"TRANSMISSION CABLES BY: \nHighest operating voltage; Insulation type","< = 33 kV; Oil Filled",0,0,0,0,0,0,0]
[null,null,"> 33 kV & < = 66 kV ; Oil Filled",0,0,0,0,0,0,0]
[null,null,"> 66 kV & < = 132 kV ; Oil Filled",0,0,0,0,0,0,0]
[null,null,"> 132 kV & < = 275 kV ; Oil Filled",0,0,0,0,0,0,0]
[null,null,"> 275 kV & < = 330 kV ; Oil Filled",0,0,0,0,0,0,0]
[null,null,"> 330 kV & < = 500 kV  ; Oil Filled",0,0,0,0,0,0,0]
[null,null,"> 500 kV  ; Oil Filled",0,0,0,0,0,0,0]
[null,null,"< = 33 kV; XLPE Insulated",0,0,0,0,0,0,0]
[null,null,"> 33 kV & < = 66 kV ; XLPE Insulated",0,0,0,0,0,0,0]
[null,null,"> 66 kV & < = 132 kV ; XLPE Insulated",0,0,0,0,0,0,10]
[null,null,"> 132 kV & < = 275 kV ; XLPE Insulated",0,0,0,0,0,0,0]
[null,null,"> 275 kV & < = 330 kV ; XLPE Insulated",0,0,0,0,0,0,0]
[null,null,"> 330 kV & < = 500 kV  ; XLPE Insulated",0,0,0,0,0,0,0]
[null,null,"> 500 kV  ; XLPE Insulated",0,0,0,0,0,0,0]
[null,null,"< = 33 kV; Other Insulated",0,0,0,0,0,0,0]
[null,null,"> 33 kV & < = 66 kV ; Other Insulated",0,0,0,0,0,0,0]
[null,null,"> 66 kV & < = 132 kV ; Other Insulated",0,0,0,0,0,0,0]
[null,null,"> 132 kV & < = 275 kV ; Other Insulated",0,0,0,0,0,0,0]
[null,null,"> 275 kV & < = 330 kV ; Other Insulated",0,0,0,0,0,0,0]
[null,null,"> 330 kV & < = 500 kV  ; Other Insulated",0,0,0,0,0,0,0]
[null,null,"> 500 kV  ; Other Insulated",0,0,0,0,0,0,0]
[null,null,"Other",0,0,0,0,0,0,0]
[null,"SUBSTATION SWITCHBAYS BY: \nHighest operating voltage; Switch type","< = 33 kV; Air Insulated circuit Breaker",0,0,0,2,0,0,0]
[null,null,"> 33 kV & < = 66 kV ; Air Insulated circuit Breaker",0,0,2,0,0,0,0]
[null,null,"> 66 kV & < = 132 kV ; Air Insulated circuit Breaker",17,5,19,4,19,3,2]
[null,null,"> 132 kV & < = 275 kV ; Air Insulated circuit Breaker",0,5,17,15,13,15,2]
[null,null,"> 275 kV & < = 330 kV ; Air Insulated circuit Breaker",0,0,0,0,0,0,0]
[null,null,"> 330 kV & < = 500 kV  ; Air Insulated circuit Breaker",0,0,0,0,0,0,0]
[null,null,"> 500 kV  ; Air Insulated circuit Breaker",0,0,0,0,0,0,0]
[null,null,"< = 33 kV; Air Insulated Isolators / Earth Switch",0,0,0,0,0,0,0]
[null,null,"> 33 kV & < = 66 kV ; Air Insulated Isolators / Earth Switch",4,0,10,0,0,0,0]
[null,null,"> 66 kV & < = 132 kV ; Air Insulated Isolators / Earth Switch",62,14,68,14,59,7,7]
[null,null,"> 132 kV & < = 275 kV ; Air Insulated Isolators / Earth Switch",0,32,107,90,77,15,15]
[null,null,"> 275 kV & < = 330 kV ; Air Insulated Isolators / Earth Switch",0,0,0,0,0,0,0]
[null,null,"> 330 kV & < = 500 kV  ; Air Insulated Isolators / Earth Switch",0,0,0,0,0,0,0]
[null,null,"> 500 kV  ; Air Insulated Isolators / Earth Switch",0,0,0,0,0,0,0]
[null,null,"< = 33 kV; VT",0,0,0,0,0,0,0]
[null,null,"> 33 kV & < = 66 kV ; VT",6,0,6,0,0,0,0]
[null,null,"> 66 kV & < = 132 kV ; VT",25,9,43,10,47,4,4]
[null,null,"> 132 kV & < = 275 kV ; VT",0,9,27,22,17,32,2]
[null,null,"> 275 kV & < = 330 kV ; VT",0,0,0,0,0,0,0]
[null,null,"> 330 kV & < = 500 kV  ; VT",0,0,0,0,0,0,0]
[null,null,"> 500 kV  ; VT",0,0,0,0,0,0,0]
[null,null,"< = 33 kV; CT",0,0,0,0,0,0,0]
[null,null,"> 33 kV & < = 66 kV ; CT",6,0,12,0,0,0,0]
[null,null,"> 66 kV & < = 132 kV ; CT",63,12,68,15,63,7,8]
[null,null,"> 132 kV & < = 275 kV ; CT",0,12,62,38,32,12,2]
[null,null,"> 275 kV & < = 330 kV ; CT",0,0,0,0,0,0,0]
[null,null,"> 330 kV & < = 500 kV  ; CT",0,0,0,0,0,0,0]
[null,null,"> 500 kV  ; CT",0,0,0,0,0,0,0]
[null,null,"< = 33 kV; GIS Module",0,0,0,0,0,0,0]
[null,null,"> 33 kV & < = 66 kV ; GIS Module",0,0,0,0,0,0,0]
[null,null,"> 66 kV & < = 132 kV ; GIS Module",0,0,0,0,0,0,0]
[null,null,"> 132 kV & < = 275 kV ; GIS Module",0,0,0,0,0,0,0]
[null,null,"> 275 kV & < = 330 kV ; GIS Module",0,0,0,0,0,0,0]
[null,null,"> 330 kV & < = 500 kV  ; GIS Module",0,0,0,0,0,0,0]
[null,null,"> 500 kV  ; GIS Module",0,0,0,0,0,0,0]
[null,null,"Other",0,0,0,0,0,0,0]
[null,"SUBSTATION POWER TRANSFORMERS BY: \nHighest operating voltage;  Ampere rating","< = 33 kV ; < = 10 MVA",0,0,0,0,0,0,0]
[null,null,"< = 33 kV ; > 10 MVA & < =  30 MVA",0,0,0,0,0,0,0]
[null,null,"< = 33 kV ; > 30 MVA",0,0,0,0,0,0,0]
[null,null,"> 33 kV & < = 66 kV  ; < = 10 MVA",0,0,0,0,0,0,0]
[null,null,"> 33 kV & < = 66 kV  ; > 10 MVA & < =  30 MVA",0,0,0,0,0,0,0]
[null,null,"> 33 kV & < = 66 kV  ; > 30 MVA",0,0,0,0,0,0,0]
[null,null,"> 66 kV & < = 132 kV  ; < = 30 MVA",0,2,0,0,1,0,0]
[null,null,"> 66 kV & < = 132 kV  ; > 30 MVA & < =  60 MVA",3,0,0,0,0,0,0]
[null,null,"> 66 kV & < = 132 kV  ; > 60 MVA",2,2,0,0,0,0,0]
[null,null,"> 132 kV & < = 220 kV  ; < = 50 MVA",0,0,0,0,0,0,0]
[null,null,"> 132 kV & < = 220 kV  ; > 50 MVA & < =  100 MVA",0,0,0,0,0,0,0]
[null,null,"> 132 kV & < = 220 kV  ; > 100 MVA",0,0,0,0,0,0,0]
[null,null,"> 220 kV & < = 275 kV  ; < = 50 MVA",0,0,0,0,0,0,0]
[null,null,"> 220 kV & < = 275 kV  ; > 50 MVA & < =  100 MVA",0,0,0,0,0,0,0]
[null,null,"> 220 kV & < = 275 kV  ; > 100 MVA",0,1,0,3,0,0,0]
[null,null,"> 275 kV & < = 330 kV  ; < = 100 MVA",0,0,0,0,0,0,0]
[null,null,"> 275 kV & < = 330 kV  ; > 100 MVA & < =  250 MVA",0,0,0,0,0,0,0]
[null,null,"> 275 kV & < = 330 kV  ; > 250 MVA",0,0,0,0,0,0,0]
[null,null,"> 330 kV & < = 500 kV   ; < = 150 MVA",0,0,0,0,0,0,0]
[null,null,"> 330 kV & < = 500 kV   ; > 150 MVA & < =  300 MVA",0,0,0,0,0,0,0]
[null,null,"> 330 kV & < = 500 kV   ; > 300 MVA",0,0,0,0,0,0,0]
[null,null,"> 500 kV   ; < = 1000 MVA",0,0,0,0,0,0,0]
[null,null,"> 500 kV   ; > 1000 MVA & < =  1500 MVA",0,0,0,0,0,0,0]
[null,null,"> 500 kV   ; > 1500 MVA",0,0,0,0,0,0,0]
[null,null,"Other",0,0,0,0,0,0,0]
[null,"SUBSTATION REACTIVE PLANT BY: \nHighest operating voltage; Function","< = 33 kV;  SVCS",0,0,0,0,0,0,0]
[null,null,"> 33 kV & < = 66 kV ;  SVCS",0,0,0,0,0,0,0]
[null,null,"> 66 kV & < = 132 kV ;  SVCS",0,0,0,0,0,0,0]
[null,null,"> 132 kV & < = 275 kV ;  SVCS",0,0,0,0,0,0,0]
[null,null,"> 275 kV & < = 330 kV ;  SVCS",0,0,0,0,0,0,0]
[null,null,"> 330 kV & < = 500 kV  ;  SVCS",0,0,0,0,0,0,0]
[null,null,"> 500 kV  ;  SVCS",0,0,0,0,0,0,0]
[null,null,"< = 33 kV;  Capacitors",0,0,0,0,0,0,0]
[null,null,"> 33 kV & < = 66 kV ;  Capacitors",0,0,0,0,0,0,0]
[null,null,"> 66 kV & < = 132 kV ;  Capacitors",0,0,0,0,0,0,0]
[null,null,"> 132 kV & < = 275 kV ;  Capacitors",0,0,0,0,0,0,0]
[null,null,"> 275 kV & < = 330 kV ;  Capacitors",0,0,0,0,0,0,0]
[null,null,"> 330 kV & < = 500 kV  ;  Capacitors",0,0,0,0,0,0,0]
[null,null,"> 500 kV  ;  Capacitors",0,0,0,0,0,0,0]
[null,null,"< = 33 kV;  Oil Filled Reactors",0,0,0,0,0,0,0]
[null,null,"> 33 kV & < = 66 kV ;  Oil Filled Reactors",0,0,0,0,0,0,0]
[null,null,"> 66 kV & < = 132 kV ;  Oil Filled Reactors",0,0,0,0,0,0,0]
[null,null,"> 132 kV & < = 275 kV ;  Oil Filled Reactors",0,0,0,0,0,0,0]
[null,null,"> 275 kV & < = 330 kV ;  Oil Filled Reactors",0,0,0,0,0,0,0]
[null,null,"> 330 kV & < = 500 kV  ;  Oil Filled Reactors",0,0,0,0,0,0,0]
[null,null,"> 500 kV  ;  Oil Filled Reactors",0,0,0,0,0,0,0]
[null,null,"Other",0,0,0,0,0,0,0]
[null,"SCADA, NETWORK CONTROL AND PROTECTION SYSTEMS BY:\nFunction",{"$f":"IF(ISBLANK(C170),\"\",C170)","v":"Sec Sys - Bay Non Bay"},34,56,58,48,20,19,70]
[null,null,"Sec Sys - Metering",5,14,6,3,4,4,18]
[null,null,"Sec Sys - Telecomms",0,182,0,12,0,90,376]
[null,null,"Sec Sys - OPGW",0,0,0,0,0,0,0]
[null,null,""]
[null,null,""]
[null,"OTHER BY: \nNSP defined","Other - Buildings",null,null,3,2,2,2,1]
[null,null,"Other Repex"]
[null,null,"Towers - > 66 kV & < = 132 kV ; Single Circuit - REFURBISHED",192,0,0,42,18,0,0]
[null,null,"Towers - > 132 kV & < = 275 kV ; Single Circuit - REFURBISHED",229,0,0,21,0,77,0]
[null,null,"Towers - > 275 kV & < = 330 kV ; Single Circuit - REFURBISHED",0,0,0,0,0,0,0]
[null,null,"Towers - > 66 kV & < = 132 kV ; Multiple Circuit - REFURBISHED",319,33,0,28,0,0,0]
[null,null,"Towers - > 132 kV & < = 275 kV ; Multiple Circuit - REFURBISHED",3,0,0,0,37,2,0]
[null,null,"Towers - > 275 kV & < = 330 kV ; Multiple Circuit - REFURBISHED",0,0,0,0,0,0,0]
[null,null,"Substation Power Transformers > 66 kV & < = 132 kV  ; < = 30 MVA - REFURBISHED",0,0,0,2,0,0,0]
[null,null,"Substation Power Transformers > 66 kV & < = 132 kV  ; > 30 MVA & < =  60 MVA - REFURBISHED",0,0,0,0,0,0,0]
[null,null,"Substation Power Transformers > 66 kV & < = 132 kV  ; > 60 MVA - REFURBISHED",0,0,0,0,0,0,0]
[null,null,"Substation Power Transformers > 220 kV & < = 275 kV  ; < = 50 MVA - REFURBISHED",0,0,0,0,0,0,0]
[null,null,"Substation Power Transformers > 220 kV & < = 275 kV  ; > 50 MVA & < =  100 MVA - REFURBISHED",0,0,0,0,0,0,0]
[null,null,"Substation Power Transformers > 220 kV & < = 275 kV  ; > 100 MVA - REFURBISHED",0,0,0,0,1,0,0]
[null,null,""]
[null,null,""]
[null,null,""]
[null,null,""]
[null,null,""]
[null,null,""]
[null,null,""]
[null,null,""]
[null,null,""]
[null,null,""]
[null,null,""]
[null,null,""]
[]
[]
[null,"ASSET FAILURES"]
[null,null,null,"VOLUMES"]
[null,null,null,"(0's)"]
[null,"ASSET GROUP","ASSET CATEGORY",{"$f":"dms_y1","v":"2020-21"},{"$f":"dms_y2","v":"2021-22"},{"$f":"dms_y3","v":"2022-23"},{"$f":"dms_y4","v":"2023-24"},{"$f":"dms_y5","v":"2024-25"},{"$f":"dms_y6","v":"2025-26"},{"$f":"dms_y7","v":"2026-27"}]
[null,"TRANSMISSION TOWERS\nHighest operating voltage; Circuit configuration","< = 33 kV; Single Circuit",0,0,0,0,0,0,0]
[null,null,"> 33 kV & < = 66 kV ; Single Circuit",0,0,0,0,0,0,0]
[null,null,"> 66 kV & < = 132 kV ; Single Circuit",0,0,0,0,0,0,0]
[null,null,"> 132 kV & < = 275 kV ; Single Circuit",0,0,0,0,0,0,0]
[null,null,"> 275 kV & < = 330 kV ; Single Circuit",0,0,0,0,0,0,0]
[null,null,"> 330 kV & < = 500 kV  ; Single Circuit",0,0,0,0,0,0,0]
[null,null,"> 500 kV  ; Single Circuit",0,0,0,0,0,0,0]
[null,null,"< = 33 kV; Multiple Circuit",0,0,0,0,0,0,0]
[null,null,"> 33 kV & < = 66 kV ; Multiple Circuit",0,0,0,0,0,0,0]
[null,null,"> 66 kV & < = 132 kV ; Multiple Circuit",0,0,0,0,0,0,0]
[null,null,"> 132 kV & < = 275 kV ; Multiple Circuit",0,0,0,0,0,0,0]
[null,null,"> 275 kV & < = 330 kV ; Multiple Circuit",0,0,0,0,0,0,0]
[null,null,"> 330 kV & < = 500 kV  ; Multiple Circuit",0,0,0,0,0,0,0]
[null,null,"> 500 kV  ; Multiple Circuit",0,0,0,0,0,0,0]
[null,null,"Other",0,0,0,0,0,0,0]
[null,"TRANSMISSION TOWER SUPPORT STRUCTURES BY:\nHighest operating voltage; Circuit configuration","< = 33 kV; Single Circuit",0,0,0,0,0,0,0]
[null,null,"> 33 kV & < = 66 kV ; Single Circuit",0,0,0,0,0,0,0]
[null,null,"> 66 kV & < = 132 kV ; Single Circuit",0,0,0,0,0,0,0]
[null,null,"> 132 kV & < = 275 kV ; Single Circuit",0,0,0,0,0,0,0]
[null,null,"> 275 kV & < = 330 kV ; Single Circuit",0,0,0,0,0,0,0]
[null,null,"> 330 kV & < = 500 kV  ; Single Circuit",0,0,0,0,0,0,0]
[null,null,"> 500 kV  ; Single Circuit",0,0,0,0,0,0,0]
[null,null,"< = 33 kV; Multiple Circuit",0,0,0,0,0,0,0]
[null,null,"> 33 kV & < = 66 kV ; Multiple Circuit",0,0,0,0,0,0,0]
[null,null,"> 66 kV & < = 132 kV ; Multiple Circuit",0,0,0,0,0,0,0]
[null,null,"> 132 kV & < = 275 kV ; Multiple Circuit",0,0,0,0,0,0,0]
[null,null,"> 275 kV & < = 330 kV ; Multiple Circuit",0,0,0,0,0,0,0]
[null,null,"> 330 kV & < = 500 kV  ; Multiple Circuit",0,0,0,0,0,0,0]
[null,null,"> 500 kV  ; Multiple Circuit",0,0,0,0,0,0,0]
[null,null,"Other",0,0,0,0,0,0,0]
[null,"CONDUCTORS BY: \nVoltage; Maximum continuous rating","< = 33 kV ; < = 100 MVA",0,0,0,0,0,0,0]
[null,null,"< = 33 kV ; > 100 MVA & < = 400 MVA",0,0,0,0,0,0,0]
[null,null,"< = 33 kV ; > 400 MVA",0,0,0,0,0,0,0]
[null,null,"> 33 kV & < = 66 kV  ; < = 100 MVA",0,0,0,0,0,0,0]
[null,null,"> 33 kV & < = 66 kV  ; > 100 MVA & < = 400 MVA",0,0,0,0,0,0,0]
[null,null,"> 33 kV & < = 66 kV  ; > 400 MVA",0,0,0,0,0,0,0]
[null,null,"> 66 kV & < = 132 kV  ; < = 100 MVA",0,0,0,0,0,0,0]
[null,null,"> 66 kV & < = 132 kV  ; > 100 MVA & < = 400 MVA",0,0,0,0,0,0,0]
[null,null,"> 66 kV & < = 132 kV  ; > 400 MVA",0,0,0,0,0,0,0]
[null,null,"> 132 kV & < = 275 kV  ; < = 200 MVA",0,0,0,0,0,0,0]
[null,null,"> 132 kV & < = 275 kV  ; > 200 MVA & < = 600 MVA",0,0,0,0,0,0,0]
[null,null,"> 132 kV & < = 275 kV  ; > 600 MVA",0,0,0,0,0,0,0]
[null,null,"> 275 kV & < = 330 kV  ; < = 800 MVA",0,0,0,0,0,0,0]
[null,null,"> 275 kV & < = 330 kV  ; > 800 MVA & < = 1200 MVA",0,0,0,0,0,0,0]
[null,null,"> 275 kV & < = 330 kV  ; > 1200 MVA",0,0,0,0,0,0,0]
[null,null,"> 330 kV & < = 500 kV   ; < = 1000 MVA",0,0,0,0,0,0,0]
[null,null,"> 330 kV & < = 500 kV   ; > 1000 MVA & < = 1500 MVA",0,0,0,0,0,0,0]
[null,null,"> 330 kV & < = 500 kV   ; > 1500 MVA",0,0,0,0,0,0,0]
[null,null,"> 500 kV   ; < = 2000 MVA",0,0,0,0,0,0,0]
[null,null,"> 500 kV   ; > 2000 MVA & < = 3000 MVA",0,0,0,0,0,0,0]
[null,null,"> 500 kV   ; > 3000 MVA",0,0,0,0,0,0,0]
[null,null,"Other",0,0,0,0,0,0,0]
[null,"TRANSMISSION CABLES BY: \nHighest operating voltage; Insulation type","< = 33 kV; Oil Filled",0,0,0,0,0,0,0]
[null,null,"> 33 kV & < = 66 kV ; Oil Filled",0,0,0,0,0,0,0]
[null,null,"> 66 kV & < = 132 kV ; Oil Filled",0,0,0,0,0,0,0]
[null,null,"> 132 kV & < = 275 kV ; Oil Filled",0,0,0,0,0,0,0]
[null,null,"> 275 kV & < = 330 kV ; Oil Filled",0,0,0,0,0,0,0]
[null,null,"> 330 kV & < = 500 kV  ; Oil Filled",0,0,0,0,0,0,0]
[null,null,"> 500 kV  ; Oil Filled",0,0,0,0,0,0,0]
[null,null,"< = 33 kV; XLPE Insulated",0,0,0,0,0,0,0]
[null,null,"> 33 kV & < = 66 kV ; XLPE Insulated",0,0,0,0,0,0,0]
[null,null,"> 66 kV & < = 132 kV ; XLPE Insulated",0,0,0,0,0,0,0]
[null,null,"> 132 kV & < = 275 kV ; XLPE Insulated",0,0,0,0,0,0,0]
[null,null,"> 275 kV & < = 330 kV ; XLPE Insulated",0,0,0,0,0,0,0]
[null,null,"> 330 kV & < = 500 kV  ; XLPE Insulated",0,0,0,0,0,0,0]
[null,null,"> 500 kV  ; XLPE Insulated",0,0,0,0,0,0,0]
[null,null,"< = 33 kV; Other Insulated",0,0,0,0,0,0,0]
[null,null,"> 33 kV & < = 66 kV ; Other Insulated",0,0,0,0,0,0,0]
[null,null,"> 66 kV & < = 132 kV ; Other Insulated",0,0,0,0,0,0,0]
[null,null,"> 132 kV & < = 275 kV ; Other Insulated",0,0,0,0,0,0,0]
[null,null,"> 275 kV & < = 330 kV ; Other Insulated",0,0,0,0,0,0,0]
[null,null,"> 330 kV & < = 500 kV  ; Other Insulated",0,0,0,0,0,0,0]
[null,null,"> 500 kV  ; Other Insulated",0,0,0,0,0,0,0]
[null,null,"Other",0,0,0,0,0,0,0]
[null,"SUBSTATION SWITCHBAYS BY: \nHighest operating voltage; Switch type","< = 33 kV; Air Insulated circuit Breaker",0,0,0,0,0,0,0]
[null,null,"> 33 kV & < = 66 kV ; Air Insulated circuit Breaker",0,0,0,0,0,0,0]
[null,null,"> 66 kV & < = 132 kV ; Air Insulated circuit Breaker",0,0,0,0,0,0,0]
[null,null,"> 132 kV & < = 275 kV ; Air Insulated circuit Breaker",0,0,0,0,0,0,0]
[null,null,"> 275 kV & < = 330 kV ; Air Insulated circuit Breaker",0,0,0,0,0,0,0]
[null,null,"> 330 kV & < = 500 kV  ; Air Insulated circuit Breaker",0,0,0,0,0,0,0]
[null,null,"> 500 kV  ; Air Insulated circuit Breaker",0,0,0,0,0,0,0]
[null,null,"< = 33 kV; Air Insulated Isolators / Earth Switch",0,0,0,0,0,0,0]
[null,null,"> 33 kV & < = 66 kV ; Air Insulated Isolators / Earth Switch",0,0,0,0,0,0,0]
[null,null,"> 66 kV & < = 132 kV ; Air Insulated Isolators / Earth Switch",0,0,0,0,0,0,0]
[null,null,"> 132 kV & < = 275 kV ; Air Insulated Isolators / Earth Switch",0,0,0,0,0,0,0]
[null,null,"> 275 kV & < = 330 kV ; Air Insulated Isolators / Earth Switch",0,0,0,0,0,0,0]
[null,null,"> 330 kV & < = 500 kV  ; Air Insulated Isolators / Earth Switch",0,0,0,0,0,0,0]
[null,null,"> 500 kV  ; Air Insulated Isolators / Earth Switch",0,0,0,0,0,0,0]
[null,null,"< = 33 kV; VT",0,0,0,0,0,0,0]
[null,null,"> 33 kV & < = 66 kV ; VT",0,0,0,0,0,0,0]
[null,null,"> 66 kV & < = 132 kV ; VT",0,0,0,0,0,0,0]
[null,null,"> 132 kV & < = 275 kV ; VT",0,0,0,0,0,0,0]
[null,null,"> 275 kV & < = 330 kV ; VT",0,0,0,0,0,0,0]
[null,null,"> 330 kV & < = 500 kV  ; VT",0,0,0,0,0,0,0]
[null,null,"> 500 kV  ; VT",0,0,0,0,0,0,0]
[null,null,"< = 33 kV; CT",0,0,0,0,0,0,0]
[null,null,"> 33 kV & < = 66 kV ; CT",0,0,0,0,0,0,0]
[null,null,"> 66 kV & < = 132 kV ; CT",0,0,0,0,0,0,0]
[null,null,"> 132 kV & < = 275 kV ; CT",0,0,0,0,0,0,0]
[null,null,"> 275 kV & < = 330 kV ; CT",0,0,0,0,0,0,0]
[null,null,"> 330 kV & < = 500 kV  ; CT",0,0,0,0,0,0,0]
[null,null,"> 500 kV  ; CT",0,0,0,0,0,0,0]
[null,null,"< = 33 kV; GIS Module",0,0,0,0,0,0,0]
[null,null,"> 33 kV & < = 66 kV ; GIS Module",0,0,0,0,0,0,0]
[null,null,"> 66 kV & < = 132 kV ; GIS Module",0,0,0,0,0,0,0]
[null,null,"> 132 kV & < = 275 kV ; GIS Module",0,0,0,0,0,0,0]
[null,null,"> 275 kV & < = 330 kV ; GIS Module",0,0,0,0,0,0,0]
[null,null,"> 330 kV & < = 500 kV  ; GIS Module",0,0,0,0,0,0,0]
[null,null,"> 500 kV  ; GIS Module",0,0,0,0,0,0,0]
[null,null,"Other",0,0,0,0,0,0,0]
[null,"SUBSTATION POWER TRANSFORMERS BY: \nHighest operating voltage;  Ampere rating","< = 33 kV ; < = 10 MVA",0,0,0,0,0,0,0]
[null,null,"< = 33 kV ; > 10 MVA & < =  30 MVA",0,0,0,0,0,0,0]
[null,null,"< = 33 kV ; > 30 MVA",0,0,0,0,0,0,0]
[null,null,"> 33 kV & < = 66 kV  ; < = 10 MVA",0,0,0,0,0,0,0]
[null,null,"> 33 kV & < = 66 kV  ; > 10 MVA & < =  30 MVA",0,0,0,0,0,0,0]
[null,null,"> 33 kV & < = 66 kV  ; > 30 MVA",0,0,0,0,0,0,0]
[null,null,"> 66 kV & < = 132 kV  ; < = 30 MVA",0,0,0,0,0,0,0]
[null,null,"> 66 kV & < = 132 kV  ; > 30 MVA & < =  60 MVA",0,0,0,0,0,0,0]
[null,null,"> 66 kV & < = 132 kV  ; > 60 MVA",0,0,0,0,0,0,0]
[null,null,"> 132 kV & < = 220 kV  ; < = 50 MVA",0,0,0,0,0,0,0]
[null,null,"> 132 kV & < = 220 kV  ; > 50 MVA & < =  100 MVA",0,0,0,0,0,0,0]
[null,null,"> 132 kV & < = 220 kV  ; > 100 MVA",0,0,0,0,0,0,0]
[null,null,"> 220 kV & < = 275 kV  ; < = 50 MVA",0,0,0,0,0,0,0]
[null,null,"> 220 kV & < = 275 kV  ; > 50 MVA & < =  100 MVA",0,0,0,0,0,0,0]
[null,null,"> 220 kV & < = 275 kV  ; > 100 MVA",0,0,0,0,0,0,0]
[null,null,"> 275 kV & < = 330 kV  ; < = 100 MVA",0,0,0,0,0,0,0]
[null,null,"> 275 kV & < = 330 kV  ; > 100 MVA & < =  250 MVA",0,0,0,0,0,0,0]
[null,null,"> 275 kV & < = 330 kV  ; > 250 MVA",0,0,0,0,0,0,0]
[null,null,"> 330 kV & < = 500 kV   ; < = 150 MVA",0,0,0,0,0,0,0]
[null,null,"> 330 kV & < = 500 kV   ; > 150 MVA & < =  300 MVA",0,0,0,0,0,0,0]
[null,null,"> 330 kV & < = 500 kV   ; > 300 MVA",0,0,0,0,0,0,0]
[null,null,"> 500 kV   ; < = 1000 MVA",0,0,0,0,0,0,0]
[null,null,"> 500 kV   ; > 1000 MVA & < =  1500 MVA",0,0,0,0,0,0,0]
[null,null,"> 500 kV   ; > 1500 MVA",0,0,0,0,0,0,0]
[null,null,"Other",0,0,0,0,0,0,0]
[null,"SUBSTATION REACTIVE PLANT BY: \nHighest operating voltage; Function","< = 33 kV;  SVCS",0,0,0,0,0,0,0]
[null,null,"> 33 kV & < = 66 kV ;  SVCS",0,0,0,0,0,0,0]
[null,null,"> 66 kV & < = 132 kV ;  SVCS",0,0,0,0,0,0,0]
[null,null,"> 132 kV & < = 275 kV ;  SVCS",0,0,0,0,0,0,0]
[null,null,"> 275 kV & < = 330 kV ;  SVCS",0,0,0,0,0,0,0]
[null,null,"> 330 kV & < = 500 kV  ;  SVCS",0,0,0,0,0,0,0]
[null,null,"> 500 kV  ;  SVCS",0,0,0,0,0,0,0]
[null,null,"< = 33 kV;  Capacitors",0,0,0,0,0,0,0]
[null,null,"> 33 kV & < = 66 kV ;  Capacitors",0,0,0,0,0,0,0]
[null,null,"> 66 kV & < = 132 kV ;  Capacitors",0,0,0,0,0,0,0]
[null,null,"> 132 kV & < = 275 kV ;  Capacitors",0,0,0,0,0,0,0]
[null,null,"> 275 kV & < = 330 kV ;  Capacitors",0,0,0,0,0,0,0]
[null,null,"> 330 kV & < = 500 kV  ;  Capacitors",0,0,0,0,0,0,0]
[null,null,"> 500 kV  ;  Capacitors",0,0,0,0,0,0,0]
[null,null,"< = 33 kV;  Oil Filled Reactors",0,0,0,0,0,0,0]
[null,null,"> 33 kV & < = 66 kV ;  Oil Filled Reactors",0,0,0,0,0,0,0]
[null,null,"> 66 kV & < = 132 kV ;  Oil Filled Reactors",0,0,0,0,0,0,0]
[null,null,"> 132 kV & < = 275 kV ;  Oil Filled Reactors",0,0,0,0,0,0,0]
[null,null,"> 275 kV & < = 330 kV ;  Oil Filled Reactors",0,0,0,0,0,0,0]
[null,null,"> 330 kV & < = 500 kV  ;  Oil Filled Reactors",0,0,0,0,0,0,0]
[null,null,"> 500 kV  ;  Oil Filled Reactors",0,0,0,0,0,0,0]
[null,null,"Other",0,0,0,0,0,0,0]
[null,"SCADA, NETWORK CONTROL AND PROTECTION SYSTEMS BY:\nFunction",{"$f":"IF(ISBLANK(C170),\"\",C170)","v":"Sec Sys - Bay Non Bay"},0,0,0,0,0,0,0]
[null,null,"Sec Sys - Metering",0,0,0,0,0,0,0]
[null,null,"Sec Sys - Telecomms",0,0,0,0,0,0,0]
[null,null,"Sec Sys - OPGW",0,0,0,0,0,0,0]
[null,null,"",0,0,0,0,0,0,0]
[null,null,"",0,0,0,0,0,0,0]
[null,"OTHER BY: \nNSP defined","Other - Buildings",0,0,0,0,0,0,0]
[null,null,"Other Repex",0,0,0,0,0,0,0]
[null,null,"Towers - > 66 kV & < = 132 kV ; Single Circuit - REFURBISHED",0,0,0,0,0,0,0]
[null,null,"Towers - > 132 kV & < = 275 kV ; Single Circuit - REFURBISHED",0,0,0,0,0,0,0]
[null,null,"Towers - > 275 kV & < = 330 kV ; Single Circuit - REFURBISHED",0,0,0,0,0,0,0]
[null,null,"Towers - > 66 kV & < = 132 kV ; Multiple Circuit - REFURBISHED",0,0,0,0,0,0,0]
[null,null,"Towers - > 132 kV & < = 275 kV ; Multiple Circuit - REFURBISHED",0,0,0,0,0,0,0]
[null,null,"Towers - > 275 kV & < = 330 kV ; Multiple Circuit - REFURBISHED",0,0,0,0,0,0,0]
[null,null,"Substation Power Transformers > 66 kV & < = 132 kV  ; < = 30 MVA - REFURBISHED",0,0,0,0,0,0,0]
[null,null,"Substation Power Transformers > 66 kV & < = 132 kV  ; > 30 MVA & < =  60 MVA - REFURBISHED",0,0,0,0,0,0,0]
[null,null,"Substation Power Transformers > 66 kV & < = 132 kV  ; > 60 MVA - REFURBISHED",0,0,0,0,0,0,0]
[null,null,"Substation Power Transformers > 220 kV & < = 275 kV  ; < = 50 MVA - REFURBISHED",0,0,0,0,0,0,0]
[null,null,"Substation Power Transformers > 220 kV & < = 275 kV  ; > 50 MVA & < =  100 MVA - REFURBISHED",0,0,0,0,0,0,0]
[null,null,"Substation Power Transformers > 220 kV & < = 275 kV  ; > 100 MVA - REFURBISHED",0,0,0,0,0,0,0]
[null,null,""]
[null,null,""]
[null,null,""]
[null,null,""]
[null,null,""]
[null,null,""]
[null,null,""]
[null,null,""]
[null,null,""]
[null,null,""]
[null,null,""]
[null,null,""]

{"sheet":"2.3 Augex (a)","index":13,"n_rows":187,"n_cols":34,"rows_kept":187,"cut":false,"hidden":false,"merged":[[168,28,174,28],[168,29,174,29],[176,1,182,1],[176,2,182,2],[176,3,182,3],[176,4,182,4],[176,5,182,5],[176,6,182,6],[176,21,182,21],[176,22,182,22],[176,23,182,23],[176,24,182,24],[176,25,182,25],[176,26,182,26],[176,27,182,27],[176,28,182,28],[176,29,182,29],[168,1,174,1],[168,2,174,2],[168,3,174,3],[168,4,174,4],[168,5,174,5],[168,6,174,6],[168,21,174,21],[152,28,158,28],[152,29,158,29],[160,1,166,1],[160,2,166,2],[160,3,166,3],[160,4,166,4],[160,5,166,5],[160,6,166,6],[160,21,166,21],[160,22,166,22],[160,23,166,23],[160,24,166,24],[160,25,166,25],[160,26,166,26],[160,27,166,27],[160,28,166,28],[160,29,166,29],[152,1,158,1],[152,2,158,2],[152,3,158,3],[152,4,158,4],[152,5,158,5],[152,6,158,6],[152,21,158,21],[136,28,142,28],[136,29,142,29],[144,1,150,1],[144,2,150,2],[144,3,150,3],[144,4,150,4],[144,5,150,5],[144,6,150,6],[144,21,150,21],[144,22,150,22],[144,23,150,23],[144,24,150,24],[144,25,150,25],[144,26,150,26],[144,27,150,27],[144,28,150,28],[144,29,150,29],[136,1,142,1],[136,2,142,2],[136,3,142,3],[136,24,142,24],[136,25,142,25],[136,26,142,26],[136,27,142,27],[128,24,134,24],[128,25,134,25],[128,26,134,26],[128,27,134,27],[128,28,134,28],[128,29,134,29],[124,24,127,24],[124,28,124,29],[125,1,127,1],[125,2,127,2],[125,3,127,3],[125,4,127,4],[125,5,127,5],[125,6,126,6],[128,1,134,1],[128,2,134,2],[128,3,134,3],[128,4,134,4],[128,5,134,5],[128,6,134,6],[128,21,134,21],[128,22,134,22],[128,23,134,23],[125,7,126,10],[125,11,125,17],[125,18,127,18],[125,19,126,20],[125,21,126,21],[125,22,126,22],[125,25,126,25],[125,26,126,26],[125,28,126,28],[127,28,127,29],[125,29,126,29],[126,11,127,11],[126,12,126,13],[126,14,126,15],[126,16,127,16],[126,17,127,17],[127,21,127,22],[127,25,127,27],[95,32,100,32],[102,32,107,32],[124,25,124,26],[124,27,126,27],[109,32,114,32],[109,30,114,30],[109,31,114,31],[102,1,107,1],[102,2,107,2],[102,3,107,3],[102,4,107,4],[102,5,107,5],[102,6,107,6],[102,7,107,7],[102,8,107,8],[102,9,107,9],[102,10,107,10],[102,24,107,24],[102,25,107,25],[102,26,107,26],[102,27,107,27],[102,28,107,28],[102,29,107,29],[102,30,107,30],[102,31,107,31],[95,10,100,10],[95,24,100,24],[95,25,100,25],[95,26,100,26],[95,27,100,27],[95,28,100,28],[95,29,100,29],[95,30,100,30],[95,31,100,31],[95,1,100,1],[95,2,100,2],[95,3,100,3],[95,4,100,4],[95,5,100,5],[95,6,100,6],[95,7,100,7],[95,8,100,8],[95,9,100,9],[88,24,93,24],[88,25,93,25],[88,26,93,26],[88,27,93,27],[88,28,93,28],[88,29,93,29],[88,30,93,30],[88,31,93,31],[88,32,93,32],[81,24,86,24],[81,25,86,25],[81,26,86,26],[81,27,86,27],[81,28,86,28],[81,29,86,29],[81,30,86,30],[81,31,86,31],[81,32,86,32],[67,32,72,32],[74,1,79,1],[74,2,79,2],[74,3,79,3],[74,4,79,4],[74,5,79,5],[74,6,79,6],[74,7,79,7],[74,8,79,8],[74,9,79,9],[74,10,79,10],[74,24,79,24],[74,25,79,25],[74,26,79,26],[74,27,79,27],[74,28,79,28],[74,29,79,29],[74,30,79,30],[74,31,79,31],[74,32,79,32],[67,10,72,10],[67,24,72,24],[67,25,72,25],[67,26,72,26],[67,27,72,27],[67,28,72,28],[67,29,72,29],[67,30,72,30],[67,31,72,31],[67,1,72,1],[67,2,72,2],[67,3,72,3],[67,4,72,4],[67,5,72,5],[67,6,72,6],[67,7,72,7],[67,8,72,8],[67,9,72,9],[53,32,58,32],[60,1,65,1],[60,2,65,2],[60,3,65,3],[60,4,65,4],[60,5,65,5],[60,6,65,6],[60,7,65,7],[60,8,65,8],[60,9,65,9],[60,10,65,10],[60,24,65,24],[60,25,65,25],[60,26,65,26],[60,27,65,27],[60,28,65,28],[60,29,65,29],[60,30,65,30],[60,31,65,31],[60,32,65,32],[53,10,58,10],[53,24,58,24],[53,25,58,25],[53,26,58,26],[53,27,58,27],[53,28,58,28],[53,29,58,29],[53,30,58,30],[53,31,58,31],[53,1,58,1],[53,2,58,2],[53,3,58,3],[53,4,58,4],[53,5,58,5],[53,6,58,6],[53,7,58,7],[53,8,58,8],[53,9,58,9],[46,24,51,24],[46,25,51,25],[46,26,51,26],[46,27,51,27],[46,28,51,28],[46,29,51,29],[46,30,51,30],[46,31,51,31],[46,32,51,32],[32,32,37,32],[39,1,44,1],[39,2,44,2],[39,3,44,3],[39,4,44,4],[39,5,44,5],[39,6,44,6],[39,7,44,7],[39,8,44,8],[39,9,44,9],[39,10,44,10],[39,24,44,24],[39,25,44,25],[39,26,44,26],[39,27,44,27],[39,28,44,28],[39,29,44,29],[39,30,44,30],[39,31,44,31],[39,32,44,32],[32,10,37,10],[32,24,37,24],[32,25,37,25],[32,26,37,26],[32,27,37,27],[32,28,37,28],[32,29,37,29],[32,30,37,30],[32,31,37,31],[32,1,37,1],[32,2,37,2],[32,3,37,3],[32,4,37,4],[32,5,37,5],[32,6,37,6],[32,7,37,7],[32,8,37,8],[32,9,37,9],[18,27,23,27],[18,28,23,28],[18,29,23,29],[18,30,23,30],[18,31,23,31],[18,32,23,32],[25,24,30,24],[25,25,30,25],[25,26,30,26],[25,27,30,27],[25,28,30,28],[25,29,30,29],[25,30,30,30],[25,31,30,31],[25,32,30,32],[8,11,8,23],[8,24,8,25],[8,26,10,26],[8,27,10,27],[8,28,8,29],[8,30,9,30],[8,31,8,32],[9,1,10,1],[9,2,10,2],[9,3,10,3],[9,4,10,4],[9,5,10,5],[9,6,10,6],[9,7,9,8],[9,9,9,10],[9,11,9,14],[9,15,9,17],[9,18,9,20],[9,22,9,23],[10,24,10,25],[10,28,10,30],[10,31,10,32],[5,1,5,3],[11,1,16,1],[11,2,16,2],[11,3,16,3],[11,4,16,4],[11,5,16,5],[11,6,16,6],[11,7,16,7],[11,8,16,8],[8,1,8,10],[11,31,16,31],[11,32,16,32],[18,1,23,1],[18,2,23,2],[18,3,23,3],[18,4,23,4],[18,5,23,5],[18,6,23,6],[18,7,23,7],[18,8,23,8],[18,9,23,9],[18,10,23,10],[11,9,16,9],[11,10,16,10],[11,24,16,24],[11,25,16,25],[11,26,16,26],[11,27,16,27],[11,28,16,28],[11,29,16,29],[11,30,16,30],[18,24,23,24],[18,25,23,25],[18,26,23,26],[25,10,30,10],[46,1,51,1],[46,2,51,2],[46,3,51,3],[46,4,51,4],[46,5,51,5],[46,6,51,6],[46,7,51,7],[46,8,51,8],[46,9,51,9],[46,10,51,10],[25,1,30,1],[25,2,30,2],[25,3,30,3],[25,4,30,4],[25,5,30,5],[25,6,30,6],[25,7,30,7],[25,8,30,8],[25,9,30,9],[81,10,86,10],[88,1,93,1],[88,2,93,2],[88,3,93,3],[88,4,93,4],[88,5,93,5],[88,6,93,6],[88,7,93,7],[88,8,93,8],[88,9,93,9],[88,10,93,10],[81,1,86,1],[81,2,86,2],[81,3,86,3],[81,4,86,4],[81,5,86,5],[81,6,86,6],[81,7,86,7],[81,8,86,8],[81,9,86,9],[185,2,185,6],[186,2,186,6],[152,22,158,22],[152,23,158,23],[109,1,114,1],[109,2,114,2],[109,3,114,3],[109,4,114,4],[109,5,114,5],[109,6,114,6],[109,7,114,7],[109,8,114,8],[109,9,114,9],[124,1,124,6],[124,7,124,20],[124,21,124,22],[124,23,127,23],[136,4,142,4],[136,5,142,5],[136,6,142,6],[136,21,142,21],[136,22,142,22],[136,23,142,23],[116,3,116,10],[117,3,117,10],[118,3,118,10],[109,10,114,10],[109,24,114,24],[109,25,114,25],[109,26,114,26],[109,27,114,27],[109,28,114,28],[109,29,114,29],[168,24,174,24],[168,25,174,25],[168,26,174,26],[168,27,174,27],[168,22,174,22],[168,23,174,23],[184,2,184,6],[152,24,158,24],[152,25,158,25],[152,26,158,26],[152,27,158,27]]}
[null,{"$f":"(LOOKUP(dms_Model,dms_Model_List,dms_Worksheet_List))","v":"REGULATORY REPORTING STATEMENT"}]
[null,{"$f":"INDEX(dms_TradingNameFull_List,MATCH(dms_TradingName,dms_TradingName_List))","v":"Queensland Electricity Transmission Corporation Limited trading as Powerlink Queensland"}]
[null,{"$f":"IF(SUM(dms_SingleYear_Model)>0,CRY,CONCATENATE(FRCP_y1,\" to \",dms_MultiYear_FinalYear_Result))","v":"2022-23 to 2026-27"}]
[null,"2.3 AUGEX PROJECTS"]
[]
[null,"There are TWO tables on this worksheet - each has been 'grouped' for easy navigation. Both ROWS and COLUMNS have been grouped.  See the Instructions sheet on how to group or ungroup tables. "]
[]
[null,"NOTE: TNSP MUST PROVIDE EXPENDITURE INFORMATION ON A PROJECT CLOSE BASIS."]
[null,"SUBSTATION AND PROJECT SUMMARY",null,null,null,null,null,null,null,null,null,"PLANT AND EQUIPMENT EXPENDITURE AND VOLUME",null,null,null,null,null,null,null,null,null,null,null,null,"OTHER EXPENDITURE",null,"TOTAL DIRECT EXPENDITURE ($0's)","YEARS INCURRED","RELATED PARTY CONTRACTS",null,"ALL NON RELATED PARTYCONTRACTS","LAND AND EASEMENTS"]
[null,"SUBSTATION ID","SUBSTATION TYPE","PROJECT ID","PROJECT TYPE","PROJECT TRIGGER","VOLTAGE (KV)","SUBSTATION RATING\nNORMAL CYCLIC\n(MVA)",null,"SUBSTATION RATING\nN-1 EMERGENCY\n(MVA)",null,"TRANSFORMERS",null,null,null,"SWITCHGEAR",null,null,"REACTIVE PLANT",null,null,"OTHER PLANT ITEM","INSTALLATION (LABOUR)",null,"CIVIL WORKS","OTHER DIRECT",null,null,"RELATED PARTY MARGINS","TOTAL",null,"LAND PURCHASES","EASEMENTS","Comments"]
[null,null,null,null,null,null,null,"PRE","POST","PRE","POST","Units Added","MVA Added","OLTC INCLUDED?","Expenditure ($0's)","Insulation","Units Added","Expenditure\n($0's)","Plant Type","Units Added","Expenditure\n($0's)","Expenditure\n($0's)","Volume","Expenditure\n($0's)","Expenditure ($0's)",null,null,null,"Expenditure ($0's)",null,null,"Expenditure\n($0's)"]
["AUG231_1","<Enter substation ID>",null,null,null,null,""]
["AUG231_2"]
["AUG231_3"]
["AUG231_4"]
["AUG231_5"]
["AUG231_6"]
[null,"Project Totals",null,null,null,null,null,null,null,null,null,{"$f":"SUM(L12:L17)","v":0},{"$f":"SUM(M12:M17)","v":0},null,{"$f":"SUM(O12:O17)","v":0},null,{"$f":"SUM(Q12:Q17)","v":0},{"$f":"SUM(R12:R17)","v":0},null,{"$f":"SUM(T12:T17)","v":0},0,0,0,0,0,0,{"$f":"O17+R17+U17+V17+SUM(X17:Z17)","v":0},null,{"$f":"SUM(AC12:AC17)","v":0},{"$f":"SUM(AD12:AD17)","v":0},{"$f":"SUM(AE12:AE17)","v":0},{"$f":"SUM(AF12:AF17)","v":0},{"$f":"SUM(AG12:AG17)","v":0}]
["AUG231_8","<Enter substation ID>",null,null,null,null,""]
["AUG231_9"]
["AUG231_10"]
["AUG231_11"]
["AUG231_12"]
["AUG231_13"]
[null,"Project Totals",null,null,null,null,null,null,null,null,null,{"$f":"SUM(L19:L24)","v":0},{"$f":"SUM(M19:M24)","v":0},null,{"$f":"SUM(O19:O24)","v":0},null,{"$f":"SUM(Q19:Q24)","v":0},{"$f":"SUM(R19:R24)","v":0},null,{"$f":"SUM(T19:T24)","v":0},0,0,0,0,0,0,{"$f":"O24+R24+U24+V24+SUM(X24:Z24)","v":0},null,{"$f":"SUM(AC19:AC24)","v":0},{"$f":"SUM(AD19:AD24)","v":0},{"$f":"SUM(AE19:AE24)","v":0},{"$f":"SUM(AF19:AF24)","v":0},{"$f":"SUM(AG19:AG24)","v":0}]
["AUG231_15","<Enter substation ID>",null,null,null,null,""]
["AUG231_16"]
["AUG231_17"]
["AUG231_18"]
["AUG231_19"]
["AUG231_20"]
[null,"Project Totals",null,null,null,null,null,null,null,null,null,{"$f":"SUM(L26:L31)","v":0},{"$f":"SUM(M26:M31)","v":0},null,{"$f":"SUM(O26:O31)","v":0},null,{"$f":"SUM(Q26:Q31)","v":0},{"$f":"SUM(R26:R31)","v":0},null,{"$f":"SUM(T26:T31)","v":0},0,0,0,0,0,0,{"$f":"O31+R31+U31+V31+SUM(X31:Z31)","v":0},null,{"$f":"SUM(AC26:AC31)","v":0},{"$f":"SUM(AD26:AD31)","v":0},{"$f":"SUM(AE26:AE31)","v":0},{"$f":"SUM(AF26:AF31)","v":0},{"$f":"SUM(AG26:AG31)","v":0}]
["AUG231_22","<Enter substation ID>",null,null,null,null,""]
["AUG231_23"]
["AUG231_24"]
["AUG231_25"]
["AUG231_26"]
["AUG231_27"]
[null,"Project Totals",null,null,null,null,null,null,null,null,null,{"$f":"SUM(L33:L38)","v":0},{"$f":"SUM(M33:M38)","v":0},null,{"$f":"SUM(O33:O38)","v":0},null,{"$f":"SUM(Q33:Q38)","v":0},{"$f":"SUM(R33:R38)","v":0},null,{"$f":"SUM(T33:T38)","v":0},0,0,0,0,0,0,{"$f":"O38+R38+U38+V38+SUM(X38:Z38)","v":0},null,{"$f":"SUM(AC33:AC38)","v":0},{"$f":"SUM(AD33:AD38)","v":0},{"$f":"SUM(AE33:AE38)","v":0},{"$f":"SUM(AF33:AF38)","v":0},{"$f":"SUM(AG33:AG38)","v":0}]
["AUG231_29","<Enter substation ID>",null,null,null,null,""]
["AUG231_30"]
["AUG231_31"]
["AUG231_32"]
["AUG231_33"]
["AUG231_34"]
[null,"Project Totals",null,null,null,null,null,null,null,null,null,{"$f":"SUM(L40:L45)","v":0},{"$f":"SUM(M40:M45)","v":0},null,{"$f":"SUM(O40:O45)","v":0},null,{"$f":"SUM(Q40:Q45)","v":0},{"$f":"SUM(R40:R45)","v":0},null,{"$f":"SUM(T40:T45)","v":0},0,0,0,0,0,0,{"$f":"O45+R45+U45+V45+SUM(X45:Z45)","v":0},null,{"$f":"SUM(AC40:AC45)","v":0},{"$f":"SUM(AD40:AD45)","v":0},{"$f":"SUM(AE40:AE45)","v":0},{"$f":"SUM(AF40:AF45)","v":0},{"$f":"SUM(AG40:AG45)","v":0}]
["AUG231_36","<Enter substation ID>",null,null,null,null,""]
["AUG231_37"]
["AUG231_38"]
["AUG231_39"]
["AUG231_40"]
["AUG231_41"]
[null,"Project Totals",null,null,null,null,null,null,null,null,null,{"$f":"SUM(L47:L52)","v":0},{"$f":"SUM(M47:M52)","v":0},null,{"$f":"SUM(O47:O52)","v":0},null,{"$f":"SUM(Q47:Q52)","v":0},{"$f":"SUM(R47:R52)","v":0},null,{"$f":"SUM(T47:T52)","v":0},0,0,0,0,0,0,{"$f":"O52+R52+U52+V52+SUM(X52:Z52)","v":0},null,{"$f":"SUM(AC47:AC52)","v":0},{"$f":"SUM(AD47:AD52)","v":0},{"$f":"SUM(AE47:AE52)","v":0},{"$f":"SUM(AF47:AF52)","v":0},{"$f":"SUM(AG47:AG52)","v":0}]
["AUG231_43","<Enter substation ID>",null,null,null,null,""]
["AUG231_44"]
["AUG231_45"]
["AUG231_46"]
["AUG231_47"]
["AUG231_48"]
[null,"Project Totals",null,null,null,null,null,null,null,null,null,{"$f":"SUM(L54:L59)","v":0},{"$f":"SUM(M54:M59)","v":0},null,{"$f":"SUM(O54:O59)","v":0},null,{"$f":"SUM(Q54:Q59)","v":0},{"$f":"SUM(R54:R59)","v":0},null,{"$f":"SUM(T54:T59)","v":0},0,0,0,0,0,0,{"$f":"O59+R59+U59+V59+SUM(X59:Z59)","v":0},null,{"$f":"SUM(AC54:AC59)","v":0},{"$f":"SUM(AD54:AD59)","v":0},{"$f":"SUM(AE54:AE59)","v":0},{"$f":"SUM(AF54:AF59)","v":0},{"$f":"SUM(AG54:AG59)","v":0}]
["AUG231_50","<Enter substation ID>",null,null,null,null,""]
["AUG231_51"]
["AUG231_52"]
["AUG231_53"]
["AUG231_54"]
["AUG231_55"]
[null,"Project Totals",null,null,null,null,null,null,null,null,null,{"$f":"SUM(L61:L66)","v":0},{"$f":"SUM(M61:M66)","v":0},null,{"$f":"SUM(O61:O66)","v":0},null,{"$f":"SUM(Q61:Q66)","v":0},{"$f":"SUM(R61:R66)","v":0},null,{"$f":"SUM(T61:T66)","v":0},0,0,0,0,0,0,{"$f":"O66+R66+U66+V66+SUM(X66:Z66)","v":0},null,{"$f":"SUM(AC61:AC66)","v":0},{"$f":"SUM(AD61:AD66)","v":0},{"$f":"SUM(AE61:AE66)","v":0},{"$f":"SUM(AF61:AF66)","v":0},{"$f":"SUM(AG61:AG66)","v":0}]
["AUG231_57","<Enter substation ID>",null,null,null,null,""]
["AUG231_58"]
["AUG231_59"]
["AUG231_60"]
["AUG231_61"]
["AUG231_62"]
[null,"Project Totals",null,null,null,null,null,null,null,null,null,{"$f":"SUM(L68:L73)","v":0},{"$f":"SUM(M68:M73)","v":0},null,{"$f":"SUM(O68:O73)","v":0},null,{"$f":"SUM(Q68:Q73)","v":0},{"$f":"SUM(R68:R73)","v":0},null,{"$f":"SUM(T68:T73)","v":0},0,0,0,0,0,0,{"$f":"O73+R73+U73+V73+SUM(X73:Z73)","v":0},null,{"$f":"SUM(AC68:AC73)","v":0},{"$f":"SUM(AD68:AD73)","v":0},{"$f":"SUM(AE68:AE73)","v":0},{"$f":"SUM(AF68:AF73)","v":0},{"$f":"SUM(AG68:AG73)","v":0}]
["AUG231_64","<Enter substation ID>",null,null,null,null,""]
["AUG231_65"]
["AUG231_66"]
["AUG231_67"]
["AUG231_68"]
["AUG231_69"]
[null,"Project Totals",null,null,null,null,null,null,null,null,null,{"$f":"SUM(L75:L80)","v":0},{"$f":"SUM(M75:M80)","v":0},null,{"$f":"SUM(O75:O80)","v":0},null,{"$f":"SUM(Q75:Q80)","v":0},{"$f":"SUM(R75:R80)","v":0},null,{"$f":"SUM(T75:T80)","v":0},0,0,0,0,0,0,{"$f":"O80+R80+U80+V80+SUM(X80:Z80)","v":0},null,{"$f":"SUM(AC75:AC80)","v":0},{"$f":"SUM(AD75:AD80)","v":0},{"$f":"SUM(AE75:AE80)","v":0},{"$f":"SUM(AF75:AF80)","v":0},{"$f":"SUM(AG75:AG80)","v":0}]
["AUG231_71","<Enter substation ID>",null,null,null,null,""]
["AUG231_72"]
["AUG231_73"]
["AUG231_74"]
["AUG231_75"]
["AUG231_76"]
[null,"Project Totals",null,null,null,null,null,null,null,null,null,{"$f":"SUM(L82:L87)","v":0},{"$f":"SUM(M82:M87)","v":0},null,{"$f":"SUM(O82:O87)","v":0},null,{"$f":"SUM(Q82:Q87)","v":0},{"$f":"SUM(R82:R87)","v":0},null,{"$f":"SUM(T82:T87)","v":0},0,0,0,0,0,0,{"$f":"O87+R87+U87+V87+SUM(X87:Z87)","v":0},null,{"$f":"SUM(AC82:AC87)","v":0},{"$f":"SUM(AD82:AD87)","v":0},{"$f":"SUM(AE82:AE87)","v":0},{"$f":"SUM(AF82:AF87)","v":0},{"$f":"SUM(AG82:AG87)","v":0}]
["AUG231_78","<Enter substation ID>",null,null,null,null,""]
["AUG231_79"]
["AUG231_80"]
["AUG231_81"]
["AUG231_82"]
["AUG231_83"]
[null,"Project Totals",null,null,null,null,null,null,null,null,null,{"$f":"SUM(L89:L94)","v":0},{"$f":"SUM(M89:M94)","v":0},null,{"$f":"SUM(O89:O94)","v":0},null,{"$f":"SUM(Q89:Q94)","v":0},{"$f":"SUM(R89:R94)","v":0},null,{"$f":"SUM(T89:T94)","v":0},0,0,0,0,0,0,{"$f":"O94+R94+U94+V94+SUM(X94:Z94)","v":0},null,{"$f":"SUM(AC89:AC94)","v":0},{"$f":"SUM(AD89:AD94)","v":0},{"$f":"SUM(AE89:AE94)","v":0},{"$f":"SUM(AF89:AF94)","v":0},{"$f":"SUM(AG89:AG94)","v":0}]
["AUG231_85","<Enter substation ID>",null,null,null,null,""]
["AUG231_86"]
["AUG231_87"]
["AUG231_88"]
["AUG231_89"]
["AUG231_90"]
[null,"Project Totals",null,null,null,null,null,null,null,null,null,{"$f":"SUM(L96:L101)","v":0},{"$f":"SUM(M96:M101)","v":0},null,{"$f":"SUM(O96:O101)","v":0},null,{"$f":"SUM(Q96:Q101)","v":0},{"$f":"SUM(R96:R101)","v":0},null,{"$f":"SUM(T96:T101)","v":0},0,0,0,0,0,0,{"$f":"O101+R101+U101+V101+SUM(X101:Z101)","v":0},null,{"$f":"SUM(AC96:AC101)","v":0},{"$f":"SUM(AD96:AD101)","v":0},{"$f":"SUM(AE96:AE101)","v":0},{"$f":"SUM(AF96:AF101)","v":0},{"$f":"SUM(AG96:AG101)","v":0}]
["AUG231_92","<Enter substation ID>",null,null,null,null,""]
["AUG231_93"]
["AUG231_94"]
["AUG231_95"]
["AUG231_96"]
["AUG231_97"]
[null,"Project Totals",null,null,null,null,null,null,null,null,null,{"$f":"SUM(L103:L108)","v":0},{"$f":"SUM(M103:M108)","v":0},null,{"$f":"SUM(O103:O108)","v":0},null,{"$f":"SUM(Q103:Q108)","v":0},{"$f":"SUM(R103:R108)","v":0},null,{"$f":"SUM(T103:T108)","v":0},0,0,0,0,0,0,{"$f":"O108+R108+U108+V108+SUM(X108:Z108)","v":0},null,{"$f":"SUM(AC103:AC108)","v":0},{"$f":"SUM(AD103:AD108)","v":0},{"$f":"SUM(AE103:AE108)","v":0},{"$f":"SUM(AF103:AF108)","v":0},{"$f":"SUM(AG103:AG108)","v":0}]
["AUG231_99","<Enter substation ID>",null,null,null,null,""]
["AUG231_100"]
["AUG231_101"]
["AUG231_102"]
["AUG231_103"]
["AUG231_104"]
[null,"Project Totals",null,null,null,null,null,null,null,null,null,{"$f":"SUM(L110:L115)","v":0},{"$f":"SUM(M110:M115)","v":0},null,{"$f":"SUM(O110:O115)","v":0},null,{"$f":"SUM(Q110:Q115)","v":0},{"$f":"SUM(R110:R115)","v":0},null,{"$f":"SUM(T110:T115)","v":0},0,0,0,0,0,0,{"$f":"O115+R115+U115+V115+SUM(X115:Z115)","v":0},null,{"$f":"SUM(AC110:AC115)","v":0},{"$f":"SUM(AD110:AD115)","v":0},{"$f":"SUM(AE110:AE115)","v":0},{"$f":"SUM(AF110:AF115)","v":0},{"$f":"SUM(AG110:AG115)","v":0}]
["AUG231_1000",null,null,"Non material projects",null,null,null,null,null,null,null,null,null,null,null,null,null,null,null,null,null,null,null,null,null,null,null,"2021, 2022",null,null,null,0,0,"CP.02759 - T053 Kamerunga Transformer Ratings"]
["AUG231_1001",null,null,"Non material projects"]
[null,null,null,"Non material projects"]
[]
[]
[null,"2.3.2 - AUGEX ASSET DATA - LINES"]
[null,"NOTE: TNSP MUST PROVIDE EXPENDITURE INFORMATION ON A PROJECT CLOSE BASIS."]
["AUG232",null,null,null,null,null,null,null,"ET_AUG232_00001","ET_AUG232_00002","ET_AUG232_00003",null,"ET_AUG232_00004","ET_AUG232_00005","ET_AUG232_00006","ET_AUG232_00007","ET_AUG232_00008","ET_AUG232_00009","ET_AUG232_00010","ET_AUG232_00011","ET_AUG232_00012","ET_AUG232_00013","ET_AUG232_00014","ET_AUG232_00015","ET_AUG232_00016","ET_AUG232_00017","ET_AUG232_00018","ET_AUG232_00019","ET_AUG232_00020","ET_AUG232_00021"]
[null,"LINE AND PROJECT SUMMARY",null,null,null,null,null,"PLANT AND EQUIPMENT EXPENDITURE AND VOLUME",null,null,null,null,null,null,null,null,null,null,null,null,null,"OTHER EXPENDITURE",null,"TOTAL DIRECT EXPENDITURE ($0's)","YEARS INCURRED","ALL RELATED PARTY CONTRACTS",null,"ALL NON RELATED PARTYCONTRACTS","LAND AND EASEMENTS"]
[null,"LINE ID","PROJECT ID","PROJECT TYPE","PROJECT TRIGGER","VOLTAGE (KV)","ROUTE LINE LENGTH ADDED","TOWERS/POLES (INCLUDING STRUCTURES, AND CIVIL WORKS)",null,null,null,"LINES AND CABLES",null,null,null,null,null,null,"OTHER PLANT ITEM\n\nExpenditure ($0's)","INSTALLATION (LABOUR)",null,"CIVIL WORKS","OTHER DIRECT",null,null,"RELATED PARTY MARGINS","TOTAL",null,"LAND PURCHASES","EASEMENTS"]
[null,null,null,null,null,null,null,null,null,null,null,"Type","Rating (MVA)",null,"N-1 Emergency Rating (MVA)",null,"Circuit KM Added","Expenditure\n($0's)"]
["AUG232_1",null,null,null,null,null,"KM ADDED","Configuration","Towers/Poles Added","Towers/Poles Upgraded","Expenditure\n($0's)",null,"PRE","POST","PRE","POST",null,null,null,"Volume","Expenditure\n($0's)","Expenditure ($0's)",null,null,null,"Expenditure ($0's)",null,null,"Expenditure\n($0's)"]
["AUG232_2","<Enter line ID>"]
["AUG232_3"]
["AUG232_4"]
["AUG232_5"]
["AUG232_6"]
["AUG232_7"]
[]
["AUG232_8","Project Totals",null,null,null,null,null,null,{"$f":"SUM(I129:I135)","v":0},{"$f":"SUM(J129:J135)","v":0},{"$f":"SUM(K129:K135)","v":0},null,null,null,null,null,{"$f":"SUM(Q129:Q135)","v":0},{"$f":"SUM(R129:R135)","v":0},{"$f":"SUM(S129:S134)","v":0},{"$f":"SUM(T129:T134)","v":0},{"$f":"SUM(U129:U135)","v":0},{"$f":"SUM(V129:V135)","v":0},{"$f":"SUM(W129:W135)","v":0},{"$f":"K81+R81+S81+SUM(U81:W81)","v":0},null,{"$f":"SUM(Z129:Z135)","v":0},{"$f":"SUM(AA129:AA135)","v":0},{"$f":"SUM(AB129:AB135)","v":0},{"$f":"SUM(AC129:AC135)","v":0},{"$f":"SUM(AD129:AD135)","v":0}]
["AUG232_9","<Enter line ID>"]
["AUG232_10"]
["AUG232_11"]
["AUG232_12"]
["AUG232_13"]
["AUG232_14"]
[]
["AUG232_15","Project Totals",null,null,null,null,null,null,{"$f":"SUM(I137:I143)","v":0},{"$f":"SUM(J137:J143)","v":0},{"$f":"SUM(K137:K143)","v":0},null,null,null,null,null,{"$f":"SUM(Q137:Q143)","v":0},{"$f":"SUM(R137:R143)","v":0},{"$f":"SUM(S137:S142)","v":0},{"$f":"SUM(T137:T142)","v":0},{"$f":"SUM(U137:U143)","v":0},{"$f":"SUM(V137:V143)","v":0},{"$f":"SUM(W137:W143)","v":0},{"$f":"K74+R74+S74+SUM(U74:W74)","v":0},null,{"$f":"SUM(Z137:Z143)","v":0},{"$f":"SUM(AA137:AA143)","v":0},{"$f":"SUM(AB137:AB143)","v":0},{"$f":"SUM(AC137:AC143)","v":0},{"$f":"SUM(AD137:AD143)","v":0}]
["AUG232_16","<Enter line ID>"]
["AUG232_17"]
["AUG232_18"]
["AUG232_19"]
["AUG232_20"]
["AUG232_21"]
[]
["AUG232_22","Project Totals",null,null,null,null,null,null,{"$f":"SUM(I145:I151)","v":0},{"$f":"SUM(J145:J151)","v":0},{"$f":"SUM(K145:K151)","v":0},null,null,null,null,null,{"$f":"SUM(Q145:Q151)","v":0},{"$f":"SUM(R145:R151)","v":0},{"$f":"SUM(S145:S150)","v":0},{"$f":"SUM(T145:T150)","v":0},{"$f":"SUM(U145:U151)","v":0},{"$f":"SUM(V145:V151)","v":0},{"$f":"SUM(W145:W151)","v":0},{"$f":"K81+R81+S81+SUM(U81:W81)","v":0},null,{"$f":"SUM(Z145:Z151)","v":0},{"$f":"SUM(AA145:AA151)","v":0},{"$f":"SUM(AB145:AB151)","v":0},{"$f":"SUM(AC145:AC151)","v":0},{"$f":"SUM(AD145:AD151)","v":0}]
["AUG232_23","<Enter line ID>"]
["AUG232_24"]
["AUG232_25"]
["AUG232_26"]
["AUG232_27"]
["AUG232_28"]
[]
["AUG232_29","Project Totals",null,null,null,null,null,null,{"$f":"SUM(I153:I159)","v":0},{"$f":"SUM(J153:J159)","v":0},{"$f":"SUM(K153:K159)","v":0},null,null,null,null,null,{"$f":"SUM(Q153:Q159)","v":0},{"$f":"SUM(R153:R159)","v":0},{"$f":"SUM(S153:S158)","v":0},{"$f":"SUM(T153:T158)","v":0},{"$f":"SUM(U153:U159)","v":0},{"$f":"SUM(V153:V159)","v":0},{"$f":"SUM(W153:W159)","v":0},{"$f":"K88+R88+S88+SUM(U88:W88)","v":0},null,{"$f":"SUM(Z153:Z159)","v":0},{"$f":"SUM(AA153:AA159)","v":0},{"$f":"SUM(AB153:AB159)","v":0},{"$f":"SUM(AC153:AC159)","v":0},{"$f":"SUM(AD153:AD159)","v":0}]
["AUG232_30","<Enter line ID>"]
["AUG232_31"]
["AUG232_32"]
["AUG232_33"]
["AUG232_34"]
["AUG232_35"]
[]
["AUG232_36","Project Totals",null,null,null,null,null,null,{"$f":"SUM(I161:I167)","v":0},{"$f":"SUM(J161:J167)","v":0},{"$f":"SUM(K161:K167)","v":0},null,null,null,null,null,{"$f":"SUM(Q161:Q167)","v":0},{"$f":"SUM(R161:R167)","v":0},{"$f":"SUM(S161:S166)","v":0},{"$f":"SUM(T161:T166)","v":0},{"$f":"SUM(U161:U167)","v":0},{"$f":"SUM(V161:V167)","v":0},{"$f":"SUM(W161:W167)","v":0},{"$f":"K95+R95+S95+SUM(U95:W95)","v":0},null,{"$f":"SUM(Z161:Z167)","v":0},{"$f":"SUM(AA161:AA167)","v":0},{"$f":"SUM(AB161:AB167)","v":0},{"$f":"SUM(AC161:AC167)","v":0},{"$f":"SUM(AD161:AD167)","v":0}]
["AUG232_37","<Enter line ID>"]
["AUG232_38"]
["AUG232_39"]
["AUG232_40"]
["AUG232_41"]
["AUG232_42"]
[]
["AUG232_43","Project Totals",null,null,null,null,null,null,{"$f":"SUM(I169:I175)","v":0},{"$f":"SUM(J169:J175)","v":0},{"$f":"SUM(K169:K175)","v":0},null,null,null,null,null,{"$f":"SUM(Q169:Q175)","v":0},{"$f":"SUM(R169:R175)","v":0},{"$f":"SUM(S169:S174)","v":0},{"$f":"SUM(T169:T174)","v":0},{"$f":"SUM(U169:U175)","v":0},{"$f":"SUM(V169:V175)","v":0},{"$f":"SUM(W169:W175)","v":0},{"$f":"K102+R102+S102+SUM(U102:W102)","v":0},null,{"$f":"SUM(Z169:Z175)","v":0},{"$f":"SUM(AA169:AA175)","v":0},{"$f":"SUM(AB169:AB175)","v":0},{"$f":"SUM(AC169:AC175)","v":0},{"$f":"SUM(AD169:AD175)","v":0}]
["AUG232_44","<Enter line ID>"]
["AUG232_45"]
["AUG232_46"]
["AUG232_47"]
["AUG232_48"]
["AUG232_49"]
[]
["AUG232_1000","Project Totals",null,null,null,null,null,null,{"$f":"SUM(I177:I183)","v":0},{"$f":"SUM(J177:J183)","v":0},{"$f":"SUM(K177:K183)","v":0},null,null,null,null,null,{"$f":"SUM(Q177:Q183)","v":0},{"$f":"SUM(R177:R183)","v":0},{"$f":"SUM(S177:S182)","v":0},{"$f":"SUM(T177:T182)","v":0},{"$f":"SUM(U177:U183)","v":0},{"$f":"SUM(V177:V183)","v":0},{"$f":"SUM(W177:W183)","v":0},{"$f":"K109+R109+S109+SUM(U109:W109)","v":0},null,{"$f":"SUM(Z177:Z183)","v":0},{"$f":"SUM(AA177:AA183)","v":0},{"$f":"SUM(AB177:AB183)","v":0},{"$f":"SUM(AC177:AC183)","v":0},{"$f":"SUM(AD177:AD183)","v":0}]
["AUG232_1001",null,"Non material projects",null,null,null,null,null,null,null,null,null,null,null,null,null,null,null,null,null,null,null,null,null,2021,null,null,null,null,null,"CP.02741 - Real Time Rating of Loaded Feeders (2019 -2021)"]
["AUG232_1002",null,"Non material projects",null,null,null,null,null,null,null,null,null,null,null,null,null,null,null,null,null,null,null,null,null,2026,null,null,null,null,null,"Ground Clearance Rectification - various (2020 - 2026)"]
[null,null,"Non material projects"]

{"sheet":"2.3 Augex (b)","index":14,"n_rows":14,"n_cols":9,"rows_kept":14,"cut":false,"hidden":false,"merged":[[5,1,5,3],[8,2,8,8]]}
[null,{"$f":"(LOOKUP(dms_Model,dms_Model_List,dms_Worksheet_List))","v":"REGULATORY REPORTING STATEMENT"}]
[null,{"$f":"INDEX(dms_TradingNameFull_List,MATCH(dms_TradingName,dms_TradingName_List))","v":"Queensland Electricity Transmission Corporation Limited trading as Powerlink Queensland"}]
[null,{"$f":"IF(SUM(dms_SingleYear_Model)>0,CRY,CONCATENATE(FRCP_y1,\" to \",dms_MultiYear_FinalYear_Result))","v":"2022-23 to 2026-27"}]
[null,"2.3 AUGEX PROJECTS"]
[]
[null,"There are THREE tables on this worksheet - each has been 'grouped' for easy navigation. See the Instructions sheet on how to group or ungroup tables. "]
[]
[null,"2.3.4 - AUGEX - TOTAL EXPENDITURE"]
[null,null,{"$f":"CONCATENATE(\"EXPENDITURE\nForecast ($0's. real \",dms_DollarReal,\")\")","v":"EXPENDITURE\nForecast ($0's. real June 2022)"}]
[null,"As incurred",{"$f":"dms_y1","v":"2020-21"},{"$f":"dms_y2","v":"2021-22"},{"$f":"dms_y3","v":"2022-23"},{"$f":"dms_y4","v":"2023-24"},{"$f":"dms_y5","v":"2024-25"},{"$f":"dms_y6","v":"2025-26"},{"$f":"dms_y7","v":"2026-27"}]
[null,"Substations",381954.57080217527,189556.20184165996,0,0,0,0,0]
[null,"Lines",5443380.7177437786,3893078.9019929562,3219430.1917372369,2009296.4153332168,1061680.4526960345,77666.006822426469,0]
[null,"Other assets",0,0,0,0,0,0,0]
[null,"Total ",{"$f":"SUM(C11:C13)","v":5825335.288545954},4082635.103834616,3219430.1917372369,2009296.4153332168,1061680.4526960345,77666.006822426469,0]

{"sheet":"2.5 Connections","index":15,"n_rows":92,"n_cols":9,"rows_kept":92,"cut":false,"hidden":false,"merged":[[8,2,8,8]]}
[null,{"$f":"(LOOKUP(dms_Model,dms_Model_List,dms_Worksheet_List))","v":"REGULATORY REPORTING STATEMENT"}]
[null,{"$f":"INDEX(dms_TradingNameFull_List,MATCH(dms_TradingName,dms_TradingName_List))","v":"Queensland Electricity Transmission Corporation Limited trading as Powerlink Queensland"}]
[null,{"$f":"IF(SUM(dms_SingleYear_Model)>0,CRY,CONCATENATE(FRCP_y1,\" to \",dms_MultiYear_FinalYear_Result))","v":"2022-23 to 2026-27"}]
[null,"2.5 CONNECTIONS EXPENDITURE"]
[]
[null,"There are TWO tables on this worksheet. Each has been grouped (or sub-grouped).  See the Instructions sheet on how to group or ungroup data."]
[]
[null,"2.5.1 - EXPENDITURE ON CONNECTION PROJECTS"]
[null,null,{"$f":"CONCATENATE(\"EXPENDITURE\nForecast \n($0's. real \",dms_DollarReal,\")\")","v":"EXPENDITURE\nForecast \n($0's. real June 2022)"}]
[null,null,{"$f":"dms_y1","v":"2020-21"},{"$f":"dms_y2","v":"2021-22"},{"$f":"dms_y3","v":"2022-23"},{"$f":"dms_y4","v":"2023-24"},{"$f":"dms_y5","v":"2024-25"},{"$f":"dms_y6","v":"2025-26"},{"$f":"dms_y7","v":"2026-27"}]
[null,"DIRECT MATERIALS EXPENDITURE"]
[null,"H038 - Goodna, T6"]
[]
[]
[]
[]
[]
[]
[]
[]
[]
[]
[]
[]
[]
[]
[]
[]
[]
[]
[]
[]
[]
[]
[]
[]
[null,"DIRECT LABOUR EXPENDITURE"]
[null,{"$f":"IF(ISBLANK(B12),\"\",B12)","v":"H038 - Goodna, T6"}]
[null,""]
[null,""]
[null,""]
[null,""]
[null,""]
[null,""]
[null,""]
[null,""]
[null,""]
[null,""]
[null,""]
[null,""]
[null,""]
[null,""]
[null,""]
[null,""]
[null,""]
[null,""]
[null,""]
[null,""]
[null,""]
[null,""]
[null,""]
[null,""]
[]
[]
[]
[null,"2.5.2 - DESCRIPTION OF CONNECTION PROJECTS"]
[null,null,"CONNECTION RATING \n(MVA)","CONNECTION \nVOLTAGE \n(KV)","UNDERGROUND / OVERHEAD\n(drop down)","YEAR CONNECTION PROJECT COMPLETED "]
[null,{"$f":"IF(ISBLANK(B12),\"\",B12)","v":"H038 - Goodna, T6"},100,110,"Overhead",2028]
[null,""]
[null,""]
[null,""]
[null,""]
[null,""]
[null,""]
[null,""]
[null,""]
[null,""]
[null,""]
[null,""]
[null,""]
[null,""]
[null,""]
[null,""]
[null,""]
[null,""]
[null,""]
[null,""]
[null,""]
[null,""]
[null,""]
[null,""]
[null,""]

{"sheet":"2.6 Non-network","index":16,"n_rows":111,"n_cols":11,"rows_kept":111,"cut":false,"hidden":false,"merged":[[5,1,5,2],[8,4,8,10],[19,1,29,1],[39,1,49,1],[55,4,55,10],[57,1,57,3],[58,1,58,3],[59,1,59,3],[63,4,63,10],[94,4,94,10],[97,1,97,3],[98,1,98,3],[99,1,99,3],[100,1,100,3],[101,1,101,3],[108,1,108,3],[109,1,109,3],[110,1,110,3],[102,1,102,3],[104,1,104,3],[105,1,105,3],[106,1,106,3],[103,1,103,3]]}
[null,{"$f":"(LOOKUP(dms_Model,dms_Model_List,dms_Worksheet_List))","v":"REGULATORY REPORTING STATEMENT"}]
[null,{"$f":"INDEX(dms_TradingNameFull_List,MATCH(dms_TradingName,dms_TradingName_List))","v":"Queensland Electricity Transmission Corporation Limited trading as Powerlink Queensland"}]
[null,{"$f":"IF(SUM(dms_SingleYear_Model)>0,CRY,CONCATENATE(FRCP_y1,\" to \",dms_MultiYear_FinalYear_Result))","v":"2022-23 to 2026-27"}]
[null,"2.6 NON NETWORK EXPENDITURE"]
[]
[null,"There are THREE tables on this worksheet - each has been 'grouped' for easy navigation. See the Instructions sheet on how to group or ungroup tables. "]
[]
[null,"2.6.1 - NON-NETWORK EXPENDITURE"]
[null,null,null,null,{"$f":"CONCATENATE(\"EXPENDITURE\nForecast \n($0's. real \",dms_DollarReal,\")\")","v":"EXPENDITURE\nForecast \n($0's. real June 2022)"}]
[null,"SERVICE SUBCATEGORY","ASSET CATEGORY",null,{"$f":"dms_y1","v":"2020-21"},{"$f":"dms_y2","v":"2021-22"},{"$f":"dms_y3","v":"2022-23"},{"$f":"dms_y4","v":"2023-24"},{"$f":"dms_y5","v":"2024-25"},{"$f":"dms_y6","v":"2025-26"},{"$f":"dms_y7","v":"2026-27"}]
[null,"OPEX"]
[null,"IT & COMMUNICATIONS","Total IT and communications",null,23982348.986461729,23828779.313853901,23675209.641246088,23964455.817538112,23896199.754630096,23985208.950418837,24027522.611394141]
[null,"MOTOR VEHICLES","Car",null,265531.94290411804,265325.34980215249,265118.75670018705,268357.78130866308,267593.4390785569,268590.17818583315,269064.01327997574]
[null,null,"Light commercial vehicle",null,1740190.5053474228,1738836.5765109197,1737482.6476744167,1758709.9237927247,1753700.7295047625,1760232.9602858138,1763338.2866089263]
[null,null,"Elevated work platform (LCV)  ",null,0,0,0,0,0,0,0]
[null,null,"Elevated work platform (HCV)",null,0,0,0,0,0,0,0]
[null,null,"Heavy commercial vehicle",null,144815.5647278277,144702.89317350247,144590.22161917723,146356.71785580192,145939.86159930957,146483.46224911406,146741.88199325348]
[null,"BUILDINGS AND PROPERTY","Total buildings and property expenditure",null,5705911.9525782447,5664799.5564386686,5623687.1602990925,5692393.2048253128,5676180.011767895,5697322.796946601,5707373.7656830084]
[null,"OTHER","Other expenditure"]
[null,"OTHER - TNSP nominated","Motor Vehicle - Other",null,223849.58537180384,223675.42259609464,223501.2598203854,226231.83267608972,225587.47445153812,226427.74863266828,226827.20260494133]
[]
[]
[]
[]
[]
[]
[]
[]
[]
[]
[null,"CAPEX"]
[null,"IT & COMMUNICATIONS","Total IT and communications",null,16600321.568956673,8933020.5339099094,14828841.60099061,12820018.309687588,8878388.6271707565,10771073.552037839,8329036.9310363829]
[null,"MOTOR VEHICLES","Car",null,472339.56472116604,85613.805167779719,445396.94817403902,118180.96639603455,431613.53092575166,128591.81708463273,340348.53940650367]
[null,null,"Light commercial vehicle",null,3783667.8147349227,2049502.3723386116,2055463.9273425995,1916003.2216290166,2140183.9614692037,3316532.214779858,3274795.484219491]
[null,null,"Elevated work platform (LCV)  ",null,0,0,0,0,0,0,0]
[null,null,"Elevated work platform (HCV)",null,0,0,0,0,0,0,0]
[null,null,"Heavy commercial vehicle",null,0,605744.13973484072,0,0,0,488605.18355463393,113286.07020163961]
[null,"BUILDINGS AND PROPERTY","Total buildings and property expenditure",null,36824.43763561792,1610304.0659462812,3586687.0784130902,22057655.257563867,11651507.455497839,476655.37236727128,39501.168535568278]
[null,"OTHER","Other expenditure",null,0,0,0,0,0,0,0]
[null,"OTHER - TNSP nominated","Motor Vehicle - Other",null,203664.4296691317,411260.27918806882,382482.41994079022,76017.54102196118,371447.23464376386,20897.461185320502,94460.428942808299]
[]
[]
[]
[]
[]
[]
[]
[]
[]
[]
[]
[]
[]
[null,"2.6.3 - ANNUAL DESCRIPTOR METRICS"]
[null,"IT & COMMUNICATIONS"]
[null,null,null,null,"VOLUMES  (0's)"]
[null,null,null,null,{"$f":"dms_y1","v":"2020-21"},{"$f":"dms_y2","v":"2021-22"},{"$f":"dms_y3","v":"2022-23"},{"$f":"dms_y4","v":"2023-24"},{"$f":"dms_y5","v":"2024-25"},{"$f":"dms_y6","v":"2025-26"},{"$f":"dms_y7","v":"2026-27"}]
[null,"Employee numbers",null,null,930,930,930,930,930,930,930]
[null,"User numbers",null,null,1650,1650,1650,1650,1650,1650,1650]
[null,"Number of devices",null,null,2374,2405,2300,2300,2300,2300,2300]
[]
[]
[null,"MOTOR VEHICLES"]
[null,null,null,null,"VOLUMES  (0's or %)"]
[null,null,null,"Units",{"$f":"dms_y1","v":"2020-21"},{"$f":"dms_y2","v":"2021-22"},{"$f":"dms_y3","v":"2022-23"},{"$f":"dms_y4","v":"2023-24"},{"$f":"dms_y5","v":"2024-25"},{"$f":"dms_y6","v":"2025-26"},{"$f":"dms_y7","v":"2026-27"}]
[null,"CAR","Average kilometres travelled ","0's",14638.203679593866,14638.203679593866,14638.203679593866,14638.203679593866,14638.203679593866,14638.203679593866,14638.203679593866]
[null,null,"Number purchased","0's",10,2,8,2,8,3,6]
[null,null,"Number leased","0's",0,0,0,0,0,0,0]
[null,null,"Number in fleet","0's",47,47,47,47,47,47,47]
[null,null,"Proportion of total fleet expenditure allocated as regulatory expenditure","%",0.85099999999999998,0.85099999999999998,0.85099999999999998,0.85099999999999998,0.85099999999999998,0.85099999999999998,0.85099999999999998]
[null,"LIGHT COMMERCIAL VEHICLE","Average kilometres travelled ","0's",23945.819512587645,23945.819512587645,23945.819512587645,23945.819512587645,23945.819512587645,23945.819512587645,23945.819512587645]
[null,null,"Number purchased","0's",46,23,25,20,24,41,39]
[null,null,"Number leased","0's",0,0,0,0,0,0,0]
[null,null,"Number in fleet","0's",173,177,177,177,177,177,177]
[null,null,"Proportion of total fleet expenditure allocated as regulatory expenditure","%",0.85099999999999998,0.85099999999999998,0.85099999999999998,0.85099999999999998,0.85099999999999998,0.85099999999999998,0.85099999999999998]
[null,"ELEVATED WORK PLATFORM (LCV) ","Average kilometres travelled ","0's"]
[null,null,"Number purchased","0's"]
[null,null,"Number leased","0's"]
[null,null,"Number in fleet","0's"]
[null,null,"Proportion of total fleet expenditure allocated as regulatory expenditure","%"]
[null,"ELEVATED WORK PLATFORM (HCV)","Average kilometres travelled ","0's"]
[null,null,"Number purchased","0's"]
[null,null,"Number leased","0's"]
[null,null,"Number in fleet","0's"]
[null,null,"Proportion of total fleet expenditure allocated as regulatory expenditure","%"]
[null,"HEAVY COMMERCIAL VEHICLE ","Average kilometres travelled ","0's",14505.781515990509,14505.781515990509,14505.781515990509,14505.781515990509,14505.781515990509,14505.781515990509,14505.781515990509]
[null,null,"Number purchased","0's",0,2,0,0,0,2,1]
[null,null,"Number leased","0's",0,0,0,0,0,0,0]
[null,null,"Number in fleet","0's",8,8,8,8,8,8,8]
[null,null,"Proportion of total fleet expenditure allocated as regulatory expenditure","%",0.85099999999999998,0.85099999999999998,0.85099999999999998,0.85099999999999998,0.85099999999999998,0.85099999999999998,0.85099999999999998]
[]
[]
[]
[null,"2.6.4 -  INFORMATION & COMMUNICATIONS TECHNOLOGY - CAPEX BY PURPOSE"]
[null,null,null,null,{"$f":"CONCATENATE(\"EXPENDITURE\nForecast \n($0's. real \",dms_DollarReal,\")\")","v":"EXPENDITURE\nForecast \n($0's. real June 2022)"}]
[null,null,null,null,{"$f":"dms_y1","v":"2020-21"},{"$f":"dms_y2","v":"2021-22"},{"$f":"dms_y3","v":"2022-23"},{"$f":"dms_y4","v":"2023-24"},{"$f":"dms_y5","v":"2024-25"},{"$f":"dms_y6","v":"2025-26"},{"$f":"dms_y7","v":"2026-27"}]
[null,"RECURRENT"]
[null,"Recurrent IT and Communications",null,null,2203919.7209231355,1098432.9131731468,8975262.830190016,5040633.9334730553,3866738.5432814206,4118760.3802707563,5637522.4895578492]
[]
[]
[]
[]
[]
[]
[]
[]
[]
[null,"NON-RECURRENT"]
[null,"Maintaining existing services, functionalities, capability and/or market benefits",null,null,13903749.309563549,7834587.6207367629,4569327.7845200198,6875671.4606542792,4694338.9053935492,6652313.171767083,2691514.4414785332]
[null,"Complying with new / altered regulatory obligations / requirements",null,null,492652.53846998833,0,1284250.9862805759,903712.91556025099,317311.17849578656,0,0]
[null,"New or expanded ICT capability, functions and services",null,null,0,0,0,0,0,0,0]

{"sheet":"2.10 Overheads","index":17,"n_rows":30,"n_cols":10,"rows_kept":30,"cut":false,"hidden":false,"merged":[[5,1,5,2],[8,3,8,9],[21,3,21,9]]}
[null,{"$f":"(LOOKUP(dms_Model,dms_Model_List,dms_Worksheet_List))","v":"REGULATORY REPORTING STATEMENT"}]
[null,{"$f":"INDEX(dms_TradingNameFull_List,MATCH(dms_TradingName,dms_TradingName_List))","v":"Queensland Electricity Transmission Corporation Limited trading as Powerlink Queensland"}]
[null,{"$f":"IF(SUM(dms_SingleYear_Model)>0,CRY,CONCATENATE(FRCP_y1,\" to \",dms_MultiYear_FinalYear_Result))","v":"2022-23 to 2026-27"}]
[null,"2.10 OVERHEADS"]
[]
[null,"There are TWO tables on this worksheet. Each has been grouped (and sub-grouped)  for ease of navigation. See the Instructions sheet on how to group or ungroup tables. "]
[]
[null,"2.10.1 - NETWORK OVERHEADS EXPENDITURE"]
[null,null,null,{"$f":"CONCATENATE(\"EXPENDITURE\nForecast \n($0's. real \",dms_DollarReal,\")\")","v":"EXPENDITURE\nForecast \n($0's. real June 2022)"}]
[null,null,null,{"$f":"dms_y1","v":"2020-21"},{"$f":"dms_y2","v":"2021-22"},{"$f":"dms_y3","v":"2022-23"},{"$f":"dms_y4","v":"2023-24"},{"$f":"dms_y5","v":"2024-25"},{"$f":"dms_y6","v":"2025-26"},{"$f":"dms_y7","v":"2026-27"}]
[null,"OPEX"]
[null,"Prescribed Transmission Services","Total  ",47562351.66855371,50019418.168795489,50186290.064874098,50799484.036826432,50654789.064920522,50843475.458625205,50933118.387582637]
[null,"CAPEX"]
[null,"Prescribed Transmission Services","Total  "]
[null,"OTHER TRANSMISSION SERVICES"]
[null,"Negotiated Services","Total  "]
[null,"Unregulated Services","Total  "]
[]
[]
[]
[null,"2.10.2 - CORPORATE OVERHEADS EXPENDITURE"]
[null,null,null,{"$f":"CONCATENATE(\"EXPENDITURE\nForecast \n($0's. real \",dms_DollarReal,\")\")","v":"EXPENDITURE\nForecast \n($0's. real June 2022)"}]
[null,null,null,{"$f":"dms_y1","v":"2020-21"},{"$f":"dms_y2","v":"2021-22"},{"$f":"dms_y3","v":"2022-23"},{"$f":"dms_y4","v":"2023-24"},{"$f":"dms_y5","v":"2024-25"},{"$f":"dms_y6","v":"2025-26"},{"$f":"dms_y7","v":"2026-27"}]
[null,"OPEX"]
[null,"Prescribed Transmission Services","Total",80552177.425926208,74606292.382626861,68075408.92693764,68742004.927949697,68530353.769549817,68680343.071383625,68712192.692628592]
[null,"CAPEX"]
[null,"Prescribed Transmission Services","Total",19201237.92025508,12488717.610874904,17295962.801813517,14879182.898098543,13771575.550454963,7660103.2160903979,14330140.926129883]
[null,"OTHER TRANSMISSION SERVICES"]
[null,"Negotiated Services","Total"]
[null,"Unregulated Services","Total"]

{"sheet":"2.11 Labour","index":18,"n_rows":31,"n_cols":14,"rows_kept":31,"cut":false,"hidden":false,"merged":[[23,2,23,6],[23,7,23,13],[22,2,22,13],[5,1,5,2],[7,1,7,2],[11,2,11,13],[12,2,12,6],[12,7,12,13]]}
[null,{"$f":"(LOOKUP(dms_Model,dms_Model_List,dms_Worksheet_List))","v":"REGULATORY REPORTING STATEMENT"}]
[null,{"$f":"INDEX(dms_TradingNameFull_List,MATCH(dms_TradingName,dms_TradingName_List))","v":"Queensland Electricity Transmission Corporation Limited trading as Powerlink Queensland"}]
[null,{"$f":"IF(SUM(dms_SingleYear_Model)>0,CRY,CONCATENATE(FRCP_y1,\" to \",dms_MultiYear_FinalYear_Result))","v":"2022-23 to 2026-27"}]
[null,"2.11 LABOUR"]
[]
[null,"There is ONE table on this worksheet. The table has been 'grouped' (and sub-grouped) for easy navigation.  See the Instructions sheet on how to group or ungroup data."]
[]
[null,"Table numbering in this template starts at 2.11.3.\n\nTables 2.11.1 & 2.11.2 appear in the Category Analysis RIN and are not required for this RIN."]
[]
[null,"2.11.3 - LABOUR / NON-LABOUR EXPENDITURE SPLIT"]
[null,"OPEX"]
[null,null,"EXPENDITURE"]
[null,null,"($0's, nominal)",null,null,null,null,{"$f":"CONCATENATE(\"($0's, real \", dms_DollarReal,\")\")","v":"($0's, real June 2022)"}]
[null,null,{"$f":"PRCP_y4","v":"2015-16"},{"$f":"PRCP_y5","v":"2016-17"},{"$f":"CRCP_y1","v":"2017-18"},{"$f":"CRCP_y2","v":"2018-19"},{"$f":"CRCP_y3","v":"2019-20"},{"$f":"dms_y1","v":"2020-21"},{"$f":"dms_y2","v":"2021-22"},{"$f":"dms_y3","v":"2022-23"},{"$f":"dms_y4","v":"2023-24"},{"$f":"dms_y5","v":"2024-25"},{"$f":"dms_y6","v":"2025-26"},{"$f":"dms_y7","v":"2026-27"}]
[null,"In-house labour expenditure"]
[null,"Labour expenditure outsourced to related parties"]
[null,"Labour expenditure outsourced to unrelated parties"]
[null,"Controllable non-labour expenditure"]
[null,"Uncontrollable non-labour expenditure"]
[null,"Total",{"$f":"SUM(C15:C19)","v":0},0,0,0,0,0,0,0,0,0,0,0]
[]
[null,"CAPEX"]
[null,null,"EXPENDITURE"]
[null,null,"($0's, nominal)",null,null,null,null,{"$f":"CONCATENATE(\"($0's, real \", dms_DollarReal,\")\")","v":"($0's, real June 2022)"}]
[null,null,{"$f":"PRCP_y4","v":"2015-16"},{"$f":"PRCP_y5","v":"2016-17"},{"$f":"CRCP_y1","v":"2017-18"},{"$f":"CRCP_y2","v":"2018-19"},{"$f":"CRCP_y3","v":"2019-20"},{"$f":"dms_y1","v":"2020-21"},{"$f":"dms_y2","v":"2021-22"},{"$f":"dms_y3","v":"2022-23"},{"$f":"dms_y4","v":"2023-24"},{"$f":"dms_y5","v":"2024-25"},{"$f":"dms_y6","v":"2025-26"},{"$f":"dms_y7","v":"2026-27"}]
[null,"In-house labour expenditure"]
[null,"Labour expenditure outsourced to related parties"]
[null,"Labour expenditure outsourced to unrelated parties"]
[null,"Controllable non-labour expenditure"]
[null,"Uncontrollable non-labour expenditure"]
[null,"Total",{"$f":"SUM(C26:C30)","v":0},0,0,0,0,0,0,0,0,0,0,0]

{"sheet":"2.14 Forecast price changes","index":19,"n_rows":17,"n_cols":9,"rows_kept":17,"cut":false,"hidden":false,"merged":[[6,2,6,3],[6,4,6,8],[7,2,7,8]]}
[null,{"$f":"(LOOKUP(dms_Model,dms_Model_List,dms_Worksheet_List))","v":"REGULATORY REPORTING STATEMENT"}]
[null,{"$f":"INDEX(dms_TradingNameFull_List,MATCH(dms_TradingName,dms_TradingName_List))","v":"Queensland Electricity Transmission Corporation Limited trading as Powerlink Queensland"}]
[null,{"$f":"IF(SUM(dms_SingleYear_Model)>0,CRY,CONCATENATE(FRCP_y1,\" to \",dms_MultiYear_FinalYear_Result))","v":"2022-23 to 2026-27"}]
[null,"2.14 FORECAST PRICE CHANGES"]
[]
[null,"2.14.2 - FORECAST CAPEX AND OPEX PRICE CHANGES"]
[null,null,"Price changes\n(% YoY real)\nCurrent regulatory period",null,"Price changes\n(%YoY real)\nForthcoming regulatory period "]
[null,null,"Forecast"]
[null,null,{"$f":"CRCP_y4","v":"2020-21"},{"$f":"CRCP_y5","v":"2021-22"},{"$f":"FRCP_y1","v":"2022-23"},{"$f":"FRCP_y2","v":"2023-24"},{"$f":"FRCP_y3","v":"2024-25"},{"$f":"FRCP_y4","v":"2025-26"},{"$f":"FRCP_y5","v":"2026-27"}]
[null,"OPEX"]
[null,"Internal labour",4.8154083325816482E-3,6.2715084860139308E-3,3.7938524011807656E-3,5.1289409836666033E-3,8.5049899184493228E-3,1.1396303374195879E-2,6.830847002371368E-3]
[null,"Materials",0,0,0,0,0,0,0]
[]
[null,"CAPEX"]
[null,"Internal labour",4.8154083325816482E-3,6.2715084860139308E-3,3.7938524011807656E-3,5.1289409836666033E-3,8.5049899184493228E-3,1.1396303374195879E-2,6.830847002371368E-3]
[null,"External labour",-5.0206090318868366E-3,3.5999548004793458E-3,3.2026250265786518E-3,4.6216922546365126E-3,8.4657687859347533E-3,1.1500944201773907E-2,5.9049094159379593E-3]
[null,"Materials",0,0,0,0,0,0,0]

{"sheet":"2.16 Opex Summary","index":20,"n_rows":58,"n_cols":13,"rows_kept":58,"cut":false,"hidden":false,"merged":[[8,10,8,11],[11,2,11,11],[22,1,22,8],[25,2,25,11],[5,10,5,12],[6,1,6,8],[6,10,6,11],[6,12,7,12],[7,1,7,8],[7,10,7,11]]}
[null,{"$f":"(LOOKUP(dms_Model,dms_Model_List,dms_Worksheet_List))","v":"REGULATORY REPORTING STATEMENT"}]
[null,{"$f":"INDEX(dms_TradingNameFull_List,MATCH(dms_TradingName,dms_TradingName_List))","v":"Queensland Electricity Transmission Corporation Limited trading as Powerlink Queensland"}]
[null,{"$f":"IF(SUM(dms_SingleYear_Model)>0,CRY,CONCATENATE(FRCP_y1,\" to \",dms_MultiYear_FinalYear_Result))","v":"2022-23 to 2026-27"}]
[null,"2.16 OPEX SUMMARY"]
[]
[null,"Instructions",null,null,null,null,null,null,null,null,"IMPORTANT!"]
[null,{"$f":"CONCATENATE(\"Complete the tables below in accordance with the regulatory information notice.\n\n\",dms_TradingName, \"'s total forecast opex must reconcile to Table 2.16.1. If \",dms_TradingName,\" did not forecast its total opex using a Base Year approach, total forecast opex must reconcile to Table 2.16.2\")","v":"Complete the tables below in accordance with the regulatory information notice.\n\nPowerlink's total forecast opex must reconcile to Table 2.16.1. If Powerlink did not forecast its total opex using a Base Year approach, total forecast opex must reconcile to Table 2.16.2"},null,null,null,null,null,null,null,null,{"$f":"CONCATENATE(\"Has \",dms_TradingName,\" used a base-step-trend model to derive its opex forecast? \")","v":"Has Powerlink used a base-step-trend model to derive its opex forecast? "},null,"Yes"]
[null,"The total step changes and category specific forecasts in Table 2.16.1 must reconcile (in each year) to the total step changes and category secific forecasts for each year in Tables 2.17.1 and 2.17.5 of worksheet 2.17 Step Changes.\")",null,null,null,null,null,null,null,null,"Yes /  No"]
[null,null,null,null,null,null,null,null,null,null,"Please nominate the base year.",null,"2018-19"]
[]
[null,"2.16.1 - PRESCRIBED TRANSMISSION SERVICES - OPEX BY DRIVER"]
[null,null,{"$f":"CONCATENATE(\"Forecast ($0's, real \", dms_DollarReal, \")\")","v":"Forecast ($0's, real June 2022)"}]
[null,null,{"$f":"CRCP_y1","v":"2017-18"},{"$f":"CRCP_y2","v":"2018-19"},{"$f":"CRCP_y3","v":"2019-20"},{"$f":"CRCP_y4","v":"2020-21"},{"$f":"CRCP_y5","v":"2021-22"},{"$f":"FRCP_y1","v":"2022-23"},{"$f":"FRCP_y2","v":"2023-24"},{"$f":"FRCP_y3","v":"2024-25"},{"$f":"FRCP_y4","v":"2025-26"},{"$f":"FRCP_y5","v":"2026-27"}]
[null,"Base year total opex, excluding category specific",null,199680735.34734678,199680735.34734678,199680735.34734678,199680735.34734678,199680735.34734678,199680735.34734678,199680735.34734678,199680735.34734678,199680735.34734678]
[null,"Increment from base year to final year",null,null,null,null,-1741811.3441146659,-1741811.3441146659,-1741811.3441146659,-1741811.3441146659,-1741811.3441146659,-1741811.3441146659]
[null,"Price growth",null,null,null,null,null,485062.03569972096,1238052.6609001248,2420730.8315241109,4014475.4258912918,4974740.2752046352]
[null,"Output growth",null,null,null,null,null,460115.05649082741,3184942.204675647,2416035.0152524216,2556067.0908568962,2942088.3075491027]
[null,"Productivity growth",null,null,null,null,null,-903025.50667608774,-1961839.9635235004,-2946421.5412673438,-3935844.8205754515,-4928496.3885741318]
[null,"Step changes",null,null,null,null,null,0,0,0,0,0]
[null,"Category specific",null,6338267.6644413434,6338267.6644413434,6338267.6644413434,6338267.6644413434,9448284.5848803017,9398553.4935135599,9355933.5605466235,9285501.2960307654,9212630.9402545039]
[null,"Total opex",{"$f":"SUM(C14:C20)","v":0},206019003.01178813,206019003.01178813,206019003.01178813,204277191.66767347,207429360.1736269,209798632.39879793,209185201.86928794,209859122.99543563,210139887.13766623]
[]
[]
[]
[null,"2.16.2 - PRESCRIBED TRANSMISSION SERVICES - OPEX BY CATEGORY"]
[null,null,{"$f":"CONCATENATE(\"Forecast ($0's, real \", dms_DollarReal, \")\")","v":"Forecast ($0's, real June 2022)"}]
[null,null,{"$f":"CRCP_y1","v":"2017-18"},{"$f":"CRCP_y2","v":"2018-19"},{"$f":"CRCP_y3","v":"2019-20"},{"$f":"CRCP_y4","v":"2020-21"},{"$f":"CRCP_y5","v":"2021-22"},{"$f":"FRCP_y1","v":"2022-23"},{"$f":"FRCP_y2","v":"2023-24"},{"$f":"FRCP_y3","v":"2024-25"},{"$f":"FRCP_y4","v":"2025-26"},{"$f":"FRCP_y5","v":"2026-27"}]
[]
[]
[]
[]
[]
[]
[]
[]
[]
[]
[]
[]
[]
[]
[]
[]
[]
[]
[]
[]
[]
[]
[]
[]
[]
[]
[]
[]
[]
[]
[null,"Total opex",{"$f":"SUM(C28:C57)","v":0},0,0,0,0,0,0,0,0,0]

{"sheet":"2.17 Step Changes","index":21,"n_rows":69,"n_cols":12,"rows_kept":69,"cut":false,"hidden":false,"merged":[[6,5,6,11],[7,5,7,11],[23,1,23,2],[24,1,24,2],[28,5,28,11],[68,1,68,2],[29,5,29,11],[46,1,46,2],[50,5,50,11],[51,5,51,11],[67,1,67,2]]}
[null,{"$f":"(LOOKUP(dms_Model,dms_Model_List,dms_Worksheet_List))","v":"REGULATORY REPORTING STATEMENT"}]
[null,{"$f":"INDEX(dms_TradingNameFull_List,MATCH(dms_TradingName,dms_TradingName_List))","v":"Queensland Electricity Transmission Corporation Limited trading as Powerlink Queensland"}]
[null,{"$f":"IF(SUM(dms_SingleYear_Model)>0,CRY,CONCATENATE(FRCP_y1,\" to \",dms_MultiYear_FinalYear_Result))","v":"2022-23 to 2026-27"}]
[null,"2.17 STEP CHANGES"]
[]
[null,"2.17.1 - STEP CHANGES FOR PRESCRIBED TRANSMISSION SERVICES - FORECAST OPEX "]
[null,null,null,null,null,"EXPENDITURE"]
[null,null,null,null,null,{"$f":"CONCATENATE(\"Forecast ($0's, real \", dms_DollarReal, \")\")","v":"Forecast ($0's, real June 2022)"}]
[null,"Step change","Description",{"$f":"CRCP_y1","v":"2017-18"},{"$f":"CRCP_y2","v":"2018-19"},{"$f":"CRCP_y4","v":"2020-21"},{"$f":"CRCP_y5","v":"2021-22"},{"$f":"FRCP_y1","v":"2022-23"},{"$f":"FRCP_y2","v":"2023-24"},{"$f":"FRCP_y3","v":"2024-25"},{"$f":"FRCP_y4","v":"2025-26"},{"$f":"FRCP_y5","v":"2026-27"}]
[]
[]
[]
[]
[]
[]
[]
[]
[]
[]
[]
[]
[]
[]
[null,"Total",null,{"$f":"SUM(D17:D23)","v":0},0,0,0,0,0,0,0,0]
[null,"Check",null,null,null,null,null,{"$f":"IF(ROUND(H$24,0)-ROUND('2.16 Opex Summary'!C$19,0)=0,\"OK\",\"Error\")","v":"OK"},{"$f":"IF(ROUND(I$24,0)-ROUND('2.16 Opex Summary'!D$19,0)=0,\"OK\",\"Error\")","v":"OK"},{"$f":"IF(ROUND(J$24,0)-ROUND('2.16 Opex Summary'!E$19,0)=0,\"OK\",\"Error\")","v":"OK"},{"$f":"IF(ROUND(K$24,0)-ROUND('2.16 Opex Summary'!F$19,0)=0,\"OK\",\"Error\")","v":"OK"},{"$f":"IF(ROUND(L$24,0)-ROUND('2.16 Opex Summary'!G$19,0)=0,\"OK\",\"Error\")","v":"OK"}]
[]
[]
[null,"2.17.2 - STEP CHANGES FOR PRESCRIBED TRANSMISSION SERVICES - FORECAST CAPEX"]
[null,null,null,null,null,"EXPENDITURE"]
[null,null,null,null,null,{"$f":"CONCATENATE(\"Forecast ($0's, real \", dms_DollarReal, \")\")","v":"Forecast ($0's, real June 2022)"}]
[null,"Step change","Description",{"$f":"CRCP_y1","v":"2017-18"},{"$f":"CRCP_y2","v":"2018-19"},{"$f":"CRCP_y4","v":"2020-21"},{"$f":"CRCP_y5","v":"2021-22"},{"$f":"FRCP_y1","v":"2022-23"},{"$f":"FRCP_y2","v":"2023-24"},{"$f":"FRCP_y3","v":"2024-25"},{"$f":"FRCP_y4","v":"2025-26"},{"$f":"FRCP_y5","v":"2026-27"}]
[]
[]
[]
[]
[]
[]
[]
[]
[]
[]
[]
[]
[]
[]
[]
[null,"Total",null,{"$f":"SUM(D32:D46)","v":0},0,0,0,0,0,0,0,0]
[]
[]
[null,"2.17.5 - CATEGORY SPECIFIC OPEX FOR PRESCRIBED TRANSMISSION SERVICES"]
[null,null,null,null,null,"EXPENDITURE"]
[null,null,null,null,null,{"$f":"CONCATENATE(\"Forecast ($0's, real \", dms_DollarReal, \")\")","v":"Forecast ($0's, real June 2022)"}]
[null,"Category","Description",{"$f":"CRCP_y1","v":"2017-18"},{"$f":"CRCP_y2","v":"2018-19"},{"$f":"CRCP_y4","v":"2020-21"},{"$f":"CRCP_y5","v":"2021-22"},{"$f":"FRCP_y1","v":"2022-23"},{"$f":"FRCP_y2","v":"2023-24"},{"$f":"FRCP_y3","v":"2024-25"},{"$f":"FRCP_y4","v":"2025-26"},{"$f":"FRCP_y5","v":"2026-27"}]
[]
[]
[]
[]
[]
[]
[]
[null,"AEMC Levy",null,null,null,5751878.941073305,5924846.7100778231,5916796.3098474974,5931325.9126559515,5945642.7735768249,5960179.7974731009,5974752.3642150909]
[null,"Network Support",null,null,null,3092589.0135695124,0,0,0,0,0,0]
[null,"Debt Raising Costs",null,null,null,563104.99496236269,553426.82443119795,3531488.275032803,3467227.5808576103,3410290.7869697982,3325321.4985576649,3237878.5760394144]
[]
[]
[]
[]
[null,"Total",null,{"$f":"SUM(D61:D67)","v":0},0,9407572.94960518,6478273.5345090209,9448284.5848802999,9398553.4935135618,9355933.5605466235,9285501.2960307654,9212630.9402545057]
[null,"Check",null,null,null,null,null,{"$f":"IF(ROUND(H$68,0)-ROUND('2.16 Opex Summary'!C$20,0)=0,\"OK\",\"Error\")","v":"Error"},{"$f":"IF(ROUND(I$68,0)-ROUND('2.16 Opex Summary'!D$20,0)=0,\"OK\",\"Error\")","v":"Error"},{"$f":"IF(ROUND(J$68,0)-ROUND('2.16 Opex Summary'!E$20,0)=0,\"OK\",\"Error\")","v":"Error"},{"$f":"IF(ROUND(K$68,0)-ROUND('2.16 Opex Summary'!F$20,0)=0,\"OK\",\"Error\")","v":"Error"},{"$f":"IF(ROUND(L$68,0)-ROUND('2.16 Opex Summary'!G$20,0)=0,\"OK\",\"Error\")","v":"Error"}]

{"sheet":"3.1 Revenue","index":22,"n_rows":42,"n_cols":9,"rows_kept":42,"cut":false,"hidden":false,"merged":[[7,2,7,8],[8,2,8,8],[24,2,24,8],[25,2,25,8],[36,2,36,8]]}
[null,{"$f":"(LOOKUP(dms_Model,dms_Model_List,dms_Worksheet_List))","v":"REGULATORY REPORTING STATEMENT"}]
[null,{"$f":"INDEX(dms_TradingNameFull_List,MATCH(dms_TradingName,dms_TradingName_List))","v":"Queensland Electricity Transmission Corporation Limited trading as Powerlink Queensland"}]
[null,{"$f":"IF(SUM(dms_SingleYear_Model)>0,CRY,CONCATENATE(FRCP_y1,\" to \",dms_MultiYear_FinalYear_Result))","v":"2022-23 to 2026-27"}]
[null,"3.1 REVENUE"]
[]
[]
[null,"3.1.1 - REVENUE GROUPING BY CHARGEABLE QUANTITY"]
[null,null,"REVENUE"]
[null,null,{"$f":"CONCATENATE(\"Forecast ($0's, real \",dms_DollarReal,\")\")","v":"Forecast ($0's, real June 2022)"}]
[null,null,{"$f":"dms_y1","v":"2020-21"},{"$f":"dms_y2","v":"2021-22"},{"$f":"dms_y3","v":"2022-23"},{"$f":"dms_y4","v":"2023-24"},{"$f":"dms_y5","v":"2024-25"},{"$f":"dms_y6","v":"2025-26"},{"$f":"dms_y7","v":"2026-27"}]
["TREV0101","From Fixed Customer (Exit Point) Charges",96089891.656086385,100531818.41994441,86652147.463340655,84746377.501937002,84220168.484550223,83696958.858562514,83176731.527442992]
["TREV0102","From Variable Customer (Exit Point) Charges",0,0,0,0,0,0,0]
["TREV0103","From Fixed Generator (Entry Point) Charges",6345231.4388334146,6638551.0884371847,5722016.3416844886,5596170.1026486177,5561422.2437117947,5526872.4475709107,5492519.5852680318]
["TREV0104","From Variable Generator (Entry Point) Charges",0,0,0,0,0,0,0]
["TREV0105","From Fixed Energy Usage Charges (Charge per day basis)",150909135.27243322,157885179.42571887,136087161.90454596,133094150.96502964,132267739.91993646,131446039.41780029,130629022.60852635]
["TREV0106","From Variable Energy Usage charges (Charge per kWh basis)",65650632.123371042,68685449.780744568,59202567.073094912,57900505.009213321,57540987.956742249,57183520.151470259,56828089.912688337]
["TREV0107","From Energy based Common Service and General Charges",318055221.91518486,332757892.28207743,286816516.45024472,280508463.88043898,278766724.73478842,277034913.50226802,275312973.59377313]
["TREV0108","From Fixed Demand based Usage Charges",52444457.746354528,54868796.419909462,47293474.973797671,46253333.596879229,45966136.409927838,45680576.246942058,45396643.776885316]
["TREV0109","From Variable Demand based Usage Charges",8556975.3152329251,8952536.7735228818,7716527.4523312831,7546815.2564365286,7499955.4099445846,7453362.6645776443,7407035.4978592973]
["TREV0110","Revenue from other Sources",88603917.582825959,50481646.67424202,45000000,55000000,55000000,55000000,55000000]
["TREV01","Total",{"$f":"SUM(C11:C20)","v":786655463.05032229},780801870.86459684,674490411.65903974,670645816.31258345,666823135.15960145,663022243.2891916,659243016.50244331]
[]
[]
[null,"3.1.2 - REVENUE GROUPING BY TYPE OF CONNECTED EQUIPMENT"]
[null,null,"REVENUE"]
[null,null,{"$f":"CONCATENATE(\"Forecast ($0's, real \",dms_DollarReal,\")\")","v":"Forecast ($0's, real June 2022)"}]
[null,null,{"$f":"dms_y1","v":"2020-21"},{"$f":"dms_y2","v":"2021-22"},{"$f":"dms_y3","v":"2022-23"},{"$f":"dms_y4","v":"2023-24"},{"$f":"dms_y5","v":"2024-25"},{"$f":"dms_y6","v":"2025-26"},{"$f":"dms_y7","v":"2026-27"}]
["TREV0201","From Other connected transmission networks",14453682.157872967,15121829.415683789,13034072.326929655,12747409.569657147,12668258.081869684,12589557.757562608,12511306.025104089]
["TREV0202","From Distribution networks",575862440.36343265,602482709.59327006,519302459.82133657,507881265.33531153,504727718.13413298,501592146.15200108,498474446.93016756]
["TREV0203","From Directly connected end–users",101390191.50735722,106077134.09296365,91431863.1690889,89420971.304965883,88865736.699886948,88313666.932056963,87764743.961903617]
["TREV0204","From Generators",6345231.4388334146,6638551.0884371847,5722016.3416844886,5596170.1026486177,5561422.2437117947,5526872.4475709107,5492519.5852680318]
["TREV0205","Other revenue",88603917.582825959,50481646.67424202,45000000,55000000,55000000,55000000,55000000]
["TREV02","Total",{"$f":"SUM(C28:C32)","v":786655463.05032206},780801870.86459672,674490411.65903962,670645816.31258321,666823135.15960145,663022243.2891916,659243016.50244331]
[]
[]
[null,"3.1.3 - REVENUE (penalties) ALLOWED (deducted) THROUGH INCENTIVE SCHEMES"]
[null,null,{"$f":"CONCATENATE(\"Forecast ($0's, real \",dms_DollarReal,\")\")","v":"Forecast ($0's, real June 2022)"}]
[null,null,{"$f":"dms_y1","v":"2020-21"},{"$f":"dms_y2","v":"2021-22"},{"$f":"dms_y3","v":"2022-23"},{"$f":"dms_y4","v":"2023-24"},{"$f":"dms_y5","v":"2024-25"},{"$f":"dms_y6","v":"2025-26"},{"$f":"dms_y7","v":"2026-27"}]
["TREV0301","EBSS",2586714.9383149478,0,8311310.0998050272,-7611012.7910957029,0,1644432.925223697,6094934.2013868773]
["TREV0302","STPIS",-2081541,442047.29757768998]
["TREV0303","Other",0,0,-739498.42572269239,-739498.42572269239,-739498.42572269239,-739498.42572269239,-739498.42572269239]
["TREV03","Total",{"$f":"SUM(C39:C41)","v":505173.93831494777},442047.29757768998,7571811.6740823351,-8350511.2168183951,-739498.42572269239,904934.49950100458,5355435.7756641852]

{"sheet":"3.2 Operating expenditure","index":23,"n_rows":91,"n_cols":9,"rows_kept":91,"cut":false,"hidden":false,"merged":[[53,2,53,8],[7,2,7,8],[8,2,8,8],[49,1,49,3],[52,2,52,8]]}
[null,{"$f":"(LOOKUP(dms_Model,dms_Model_List,dms_Worksheet_List))","v":"REGULATORY REPORTING STATEMENT"}]
[null,{"$f":"INDEX(dms_TradingNameFull_List,MATCH(dms_TradingName,dms_TradingName_List))","v":"Queensland Electricity Transmission Corporation Limited trading as Powerlink Queensland"}]
[null,{"$f":"IF(SUM(dms_SingleYear_Model)>0,CRY,CONCATENATE(FRCP_y1,\" to \",dms_MultiYear_FinalYear_Result))","v":"2022-23 to 2026-27"}]
[null,"3.2 OPERATING EXPENDITURE"]
[]
[]
[null,"3.2.1 - OPEX CATEGORIES"]
[null,null,"EXPENDITURE"]
[null,null,{"$f":"CONCATENATE(\"Forecast ($0's, real \",dms_DollarReal,\")\")","v":"Forecast ($0's, real June 2022)"}]
[null,null,{"$f":"dms_y1","v":"2020-21"},{"$f":"dms_y2","v":"2021-22"},{"$f":"dms_y3","v":"2022-23"},{"$f":"dms_y4","v":"2023-24"},{"$f":"dms_y5","v":"2024-25"},{"$f":"dms_y6","v":"2025-26"},{"$f":"dms_y7","v":"2026-27"}]
[null,"OPEX CATEGORIES AND COST ALLOCATIONS - approved CAM"]
[null,"Field Maintenance - Routine",22193503.592362057,22432024.443904068,22282078.993590429,22554329.373201545,22490086.633006655,22573861.008919053,22613661.337288901]
[null,"Field Maintenance - Condition-based",28756236.351832509,28724698.77855204,27523532.001864571,27859824.321710564,27780469.647662871,27883950.418780517,27933113.049066827]
[null,"Field Maintenance -  Corrective",17981655.382875003,15135817.997543862,17350073.13909867,17562062.514046986,17512039.522863891,17577270.938194595,17608261.700249411]
[null,"Operational Refurbishment",37856013.070424289,38448070.839120135,38439243.319123089,38908907.688799076,38798081.301254682,38942602.089486815,39011262.401966169]
[null,"Maintenance Support",13410089.498212773,14626479.306129714,14260376.593523266,14434614.955307232,14393500.045480261,14447115.067208789,14472587.002357354]
[null,"Network Operations",15651247.378162976,16099689.437998485,16137012.051621586,16334179.814024135,16287654.268851612,16348324.914265994,16377148.90231251]
[null,"Asset Management Support",24553425.434886146,25658327.017477892,26175213.817051474,26495031.904948216,26419564.644407667,26517976.116807878,26564730.376379855]
[null,"Corporate Support",32801377.870189399,30438475.343715888,27194950.061634023,27527227.650269937,27448820.329663768,27551065.724720374,27599641.44078197]
[null,"Self Insurance",1593897.0115394541,1588040.6646900959,1574982.9006281721,1594226.6028294063,1589685.6792770957,1595607.1738382978,1598420.4138703402]
[null,"Insurance Premiums",9232573.2555209901,10566962.410327761,7043612.7106112931,7129674.0801472859,7109366.2362727821,7135848.2471825276,7148429.5731383786]
[null,"AEMC Levy",5751878.941073305,5924846.7100778231,5916796.3098474974,5931325.9126559515,5945642.7735768249,5960179.7974731009,5974752.3642150909]
[null,"Network Support",3092589.0135695124,0,0,0,0,0,0]
[null,"Debt Raising Costs",563104.99496236269,553426.82443119795,3531488.275032803,3467227.5808576103,3410290.7869697982,3325321.4985576649,3237878.5760394144]
[]
[]
[]
[]
[]
[]
[]
[]
[]
[]
[]
[]
[]
[]
[]
[]
[]
[]
[]
[]
[]
[null,"Total ",{"$f":"SUM(C12:C45)","v":213437591.79561079},210196859.77396899,207429360.17362687,209798632.3987979,209185201.86928791,209859122.9954356,210139887.1376662]
[]
[]
[]
[null,"Instructions\nTable 3.2.3 must be completed if there are any proposed changes to the CAM reported in response to Schedule 1, paragraph 1.3."]
[]
[null,"3.2.3 - OPEX CATEGORIES - Revised CAM"]
[null,null,"EXPENDITURE"]
[null,null,{"$f":"CONCATENATE(\"Forecast ($0's, real \",dms_DollarReal,\")\")","v":"Forecast ($0's, real June 2022)"}]
[null,null,{"$f":"dms_y1","v":"2020-21"},{"$f":"dms_y2","v":"2021-22"},{"$f":"dms_y3","v":"2022-23"},{"$f":"dms_y4","v":"2023-24"},{"$f":"dms_y5","v":"2024-25"},{"$f":"dms_y6","v":"2025-26"},{"$f":"dms_y7","v":"2026-27"}]
[null,"OPEX CATEGORIES AND COST ALLOCATIONS - revised CAM"]
[]
[]
[]
[]
[]
[]
[]
[]
[]
[]
[]
[]
[]
[]
[]
[]
[]
[]
[]
[]
[]
[]
[]
[]
[]
[]
[]
[]
[]
[]
[]
[]
[]
[]
[null,"Total",{"$f":"SUM(C57:C90)","v":0},0,0,0,0,0,0]

{"sheet":"3.3 Assets (RAB)","index":24,"n_rows":93,"n_cols":9,"rows_kept":93,"cut":false,"hidden":false,"merged":[[8,2,8,8],[20,2,20,8],[68,2,68,8],[79,2,79,8]]}
[null,{"$f":"(LOOKUP(dms_Model,dms_Model_List,dms_Worksheet_List))","v":"REGULATORY REPORTING STATEMENT"}]
[null,{"$f":"INDEX(dms_TradingNameFull_List,MATCH(dms_TradingName,dms_TradingName_List))","v":"Queensland Electricity Transmission Corporation Limited trading as Powerlink Queensland"}]
[null,{"$f":"IF(SUM(dms_SingleYear_Model)>0,CRY,CONCATENATE(FRCP_y1,\" to \",dms_MultiYear_FinalYear_Result))","v":"2022-23 to 2026-27"}]
[null,"3.3 ASSETS"]
[]
[null,"There are FOUR tables on this worksheet. Each table has been grouped (and sub-grouped) for ease of navigation. See the Instructions sheet on how to group or ungroup tables. "]
[]
[null,"3.3.1 - REGULATORY ASSET BASE VALUES"]
[null,null,{"$f":"CONCATENATE(\"Forecast ($0's, real \",dms_DollarReal,\")\")","v":"Forecast ($0's, real June 2022)"}]
[null,null,{"$f":"dms_y1","v":"2020-21"},{"$f":"dms_y2","v":"2021-22"},{"$f":"dms_y3","v":"2022-23"},{"$f":"dms_y4","v":"2023-24"},{"$f":"dms_y5","v":"2024-25"},{"$f":"dms_y6","v":"2025-26"},{"$f":"dms_y7","v":"2026-27"}]
[null,"For total asset base:"]
["TRAB0101","Opening value",7104197525.6558523,{"$f":"C17","v":7003709947.0926743},6958401180.1548796,6831762431.3123817,6719588309.4677248,6552188891.3370275,6379915170.4754009]
["TRAB0102","Inflation addition",35871173.125633128,70037099.470926806,0,0,0,0,0]
["TRAB0103","Straight line depreciation",-317613648.71879357,-316560976.06220585,-318552908.81405836,-322712068.09696174,-325122357.68851256,-324971497.91134059,-325400527.08697754]
["TRAB0105","Actual additions (recognised in RAB)",182156912.51878297,210071679.17118084,192606430.01006237,211056012.93145147,169523189.40155378,153569193.50444606,155083531.31637943]
["TRAB0106","Disposals ",-902015.48880000005,-5086543.2008352764,-692270.03850206709,-518066.67914632108,-11800249.843738278,-871416.45473168744,-809243.40302381036]
["TRAB0107","Closing value ",{"$f":"SUM(C12:C16)","v":7003709947.0926743},6962171206.4717407,6831762431.3123817,6719588309.4677248,6552188891.3370275,6379915170.4754009,6208788931.3017788]
[]
[]
[null,"3.3.2 - ASSET VALUE ROLL FORWARD"]
[null,null,{"$f":"CONCATENATE(\"Forecast ($0's, real \",dms_DollarReal,\")\")","v":"Forecast ($0's, real June 2022)"}]
[null,null,{"$f":"dms_y1","v":"2020-21"},{"$f":"dms_y2","v":"2021-22"},{"$f":"dms_y3","v":"2022-23"},{"$f":"dms_y4","v":"2023-24"},{"$f":"dms_y5","v":"2024-25"},{"$f":"dms_y6","v":"2025-26"},{"$f":"dms_y7","v":"2026-27"}]
[null,"For overhead assets:"]
["TRAB0201","Opening value",3557387634.7249146,{"$f":"C29","v":3490517074.5639129},3458604139.4846945,3385018140.0291791,3309917498.0173192,3223928603.2982392,3135444960.2959371]
["TRAB0202","Inflation addition",17961464.027352393,34905170.745639168,0,0,0,0,0]
["TRAB0203","Straight line depreciation",-120599864.72894171,-121282138.40254697,-121490798.13401097,-121514465.00064261,-122871693.59783493,-124576587.8521938,-124913345.51719174]
["TRAB0205","Actual additions (recognised in RAB)",35767840.540588021,34581070.712724425,47904798.678495347,46413822.988782883,36882798.878755204,36092944.84989164,43513243.890866295]
["TRAB0206","Disposals "]
["TRAB0207","Closing value ",{"$f":"SUM(C24:C28)","v":3490517074.5639129},3438721177.6197295,3385018140.0291791,3309917498.0173192,3223928603.2982392,3135444960.2959371,3054044858.6696115]
[null,"For underground assets:"]
["TRAB0301","Opening value",49143505.733035587,{"$f":"+C36","v":46910977.244776838},45432671.878443539,{"$f":"E36","v":43639278.907725923},56065036.02632001,71528654.013758734,75644743.342390582]
["TRAB0302","Inflation addition",248063.07752741146,469109.77244776877,0,0,0,0,0]
["TRAB0303","Straight line depreciation",-2629081.21146926,-2616065.9579471354,-2580113.4428731366,-2580113.4428731366,-2580113.4428731366,-2657273.2186611909,-2676419.1703170938]
["TRAB0305","Actual additions (recognised in RAB)",148489.64568310388,693355.66519169917,786720.4721555179,15005870.561467221,18043731.430311855,6773362.5472930316,0]
["TRAB0306","Disposals "]
["TRAB0307","Closing value ",{"$f":"SUM(C31:C35)","v":46910977.244776838},45457376.724469177,43639278.907725923,56065036.02632001,71528654.013758734,75644743.342390582,72968324.172073483]
[null,"For switchyards, substations"]
["TRAB0401","Opening value",2526252485.0751095,{"$f":"C43","v":2473405204.6421824},2438225960.1020355,2394850997.3811488,2335390593.6152411,2248519266.2428865,2160503132.4521008]
["TRAB0402","Inflation addition",12754932.685607385,24734052.046421845,0,0,0,0,0]
["TRAB0403","Straight line depreciation",-156709027.94331792,-160430234.69317541,-143314432.30886996,-148863295.22651324,-154185962.53528845,-157731665.37694636,-159466872.97324717]
["TRAB0405","Actual additions (recognised in RAB)",91106814.824783444,124301758.57543507,99939469.587983027,89402891.460605532,67314635.162933737,69715531.586160615,76651083.451838419]
["TRAB0406","Disposals ",null,-4073807.5174352755]
["TRAB0407","Closing value ",{"$f":"SUM(C38:C42)","v":2473405204.6421824},2457936973.0534291,2394850997.3811488,2335390593.6152411,2248519266.2428865,2160503132.4521008,2077687342.9306922]
[null,"For easements:"]
["TRAB0501","Opening value",688763000.3561523,{"$f":"C50","v":694766336.89250207},701524808.54503334,703564605.16580784,706063839.91419303,709459119.91358864,714550195.22157681]
["TRAB0502","Inflation addition",3478553.3186253118,6947663.3689250248,0,0,0,0,0]
["TRAB0503","Straight line depreciation",0,0,0,0,0,0,0]
["TRAB0505","Actual additions (recognised in RAB)",2524783.217724401,277127.60057629499,2039796.6207744721,2499234.7483851933,3395279.9993956224,5091075.3079882003,8176589.0494130198]
["TRAB0506","Disposals ",null,-292638.91499999998]
["TRAB0507","Closing value ",{"$f":"SUM(C45:C49)","v":694766336.89250207},701698488.94700336,703564605.16580784,706063839.91419303,709459119.91358864,714550195.22157681,722726784.27098978]
[null,"For “other” assets with long lives:"]
["TRAB0601","Opening value",204213142.25979093,{"$f":"C57","v":217847710.99300838},228336984.20742315,234799045.45977691,255251290.80921084,254851759.60286537,254409824.43738246]
["TRAB0602","Inflation addition",1031958.0968485828,2178477.1099300859,0,0,0,0,0]
["TRAB0603","Straight line depreciation",-16219823.511593521,-17569297.093885776,-13146514.398933349,-17073412.190308806,-18044451.772469632,-18284121.762234382,-19478427.738198847]
["TRAB0605","Actual additions (recognised in RAB)",28822434.147962388,35690257.940281563,19608575.651287101,37525657.539742738,28749775.022709858,17842186.596751492,11025133.438764798]
["TRAB0606","Disposals ",null,null,null,null,-11104854.456585683]
["TRAB0607","Closing value ",{"$f":"SUM(C52:C56)","v":217847710.99300838},238147148.94933426,234799045.45977691,255251290.80921084,254851759.60286537,254409824.43738246,245956530.13794842]
[null,"For “other” assets with short lives:"]
["TRAB0701","Opening value",78437757.506848335,{"$f":"C64","v":80262642.756290823},86276615.93724975,69890364.368743584,56900051.085441314,43901488.26568985,39362314.726014361]
["TRAB0702","Inflation addition",396201.91967204772,802626.42756290897,0,0,0,0,0]
["TRAB0703","Straight line depreciation",-21455851.323471166,-14663239.914650556,-38021050.529370956,-32680782.236623857,-27440136.340046365,-21721849.701304853,-18865461.688022722]
["TRAB0705","Actual additions (recognised in RAB)",23786550.142041612,14528108.676971788,22327068.999366857,20208535.632467903,15136968.907447496,18054092.616361048,15717481.485496948]
["TRAB0706","Disposals ",-902015.48880000005,-720096.76840000006,-692270.03850206709,-518066.67914632108,-695395.38715259556,-871416.45473168744,-809243.40302381036]
["TRAB0707","Closing value ",{"$f":"SUM(C59:C63)","v":80262642.756290823},80210041.177774966,69890364.368743584,56900051.085441314,43901488.26568985,39362314.726014361,35405091.120464779]
[]
[]
[]
[null,"3.3.3 - TOTAL DISAGGREGATED RAB ASSET VALUES"]
[null,null,{"$f":"CONCATENATE(\"Forecast ($0's, real \",dms_DollarReal,\")\")","v":"Forecast ($0's, real June 2022)"}]
[null,null,{"$f":"dms_y1","v":"2020-21"},{"$f":"dms_y2","v":"2021-22"},{"$f":"dms_y3","v":"2022-23"},{"$f":"dms_y4","v":"2023-24"},{"$f":"dms_y5","v":"2024-25"},{"$f":"dms_y6","v":"2025-26"},{"$f":"dms_y7","v":"2026-27"}]
["TRAB0801","Overhead transmission assets (wires and towers/poles etc)",3523952354.6444139,3474560607.0243039,3421811139.756937,3347467819.0232487,3266923050.6577787,3179686781.7970881,3094744909.4827738]
["TRAB0802","Underground transmission assets (cables, ducts etc)",48027241.488906212,46171824.561610192,44535975.393084735,49852157.467022955,63796845.020039365,73586698.678074643,74306533.75723201]
["TRAB0803","Substations, switchyards, transformers etc with transmission function",2499828844.8586459,2455815582.3721094,2416538478.7415924,2365120795.4981947,2291954929.9290638,2204511199.3474932,2119095237.6913965]
["TRAB0804","Easements",691764668.62432718,698145572.71876764,702544706.85542059,704814222.54000044,707761479.91389084,712004657.56758273,718638489.74628329]
["TRAB0805","Other assets with long lives (please specify)",211030426.62639964,223092347.60021576,231568014.83360004,245025168.13449389,255051525.20603812,254630792.0201239,250183177.28766549]
["TRAB0806","Other assets with short lives (please specify)",79350200.131569579,83269629.346770287,78083490.152996659,63395207.72709243,50400769.675565571,41631901.49585209,37383702.923239544]
[]
[]
[null,"3.3.4 - ASSET LIVES"]
[null,null,"Asset Life"]
[null,null,{"$f":"dms_y1","v":"2020-21"},{"$f":"dms_y2","v":"2021-22"},{"$f":"dms_y3","v":"2022-23"},{"$f":"dms_y4","v":"2023-24"},{"$f":"dms_y5","v":"2024-25"},{"$f":"dms_y6","v":"2025-26"},{"$f":"dms_y7","v":"2026-27"}]
[null,"ESTIMATED SERVICE LIFE OF NEW ASSETS"]
["TRAB0901","Overhead transmission assets (wires and towers/poles etc)",49.568738336749924,48.975356412387818,48.951952017456584,48.952362245231477,48.905268509180608,48.676784089654781,48.683877793030405]
["TRAB0902","Underground transmission assets (cables, ducts etc)",45,45,45,45,45,45,45]
["TRAB0903","Substations, switchyards, transformers etc with transmission function",35.003365458207568,35.133691983336924,35.305402712032922,35.042418313800049,34.827275936852011,34.775680760093088,34.673713925515308]
["TRAB0904","Other assets with long lives",30.387546467188951,29.480144845472513,28.793472308970834,24.908702456590252,25.899917761060816,25.813002573205797,25.075567578946128]
["TRAB0905","Other assets with short lives",5.3716905905955175,5.3585195386695652,5.3642315028251071,5.3677623632850384,5.3685449507405414,5.3867861834960857,5.4058531270418229]
[null,"ESTIMATED RESIDUAL SERVICE LIFE"]
["TRAB1001","Overhead transmission assets (wires and towers/poles etc)",26.387358715558008,25.41475005108332,24.430357041559738,23.930984721678868,23.242508497129201,22.442735513824061,21.599666072950569]
["TRAB1002","Underground transmission assets (cables, ducts etc)",15.946178478113227,14.95080720015228,13.956103014040972,12.962221330706816,15.373972078518111,15.411927600781564,31.655328398644858]
["TRAB1003","Substations, switchyards, transformers etc with transmission function",21.375424654109846,21.015681405888785,20.973284436805709,20.992171174019898,21.053006162300903,20.757974641963056,20.318764248231659]
["TRAB1004","Other assets with long lives",18.250798363881422,17.601523315794363,16.371850919211546,18.208814904852595,17.928344011164125,17.45071869367176,16.840459831899128]
["TRAB1005","Other assets with short lives",3.9873738380680974,3.6768647373707792,3.7983416319149508,3.8525009104990353,3.8845441717465019,4.0095342671259022,4.0398693781042363]

{"sheet":"3.3 Unprotected Assets (RAB)","index":25,"n_rows":100,"n_cols":8,"rows_kept":100,"cut":false,"hidden":false,"merged":[[8,1,8,7],[21,1,21,7],[75,1,75,7],[86,1,86,7]]}
[{"$f":"(LOOKUP(dms_Model,dms_Model_List,dms_Worksheet_List))","v":"REGULATORY REPORTING STATEMENT"}]
[{"$f":"INDEX(dms_TradingNameFull_List,MATCH(dms_TradingName,dms_TradingName_List))","v":"Queensland Electricity Transmission Corporation Limited trading as Powerlink Queensland"}]
[{"$f":"IF(SUM(dms_SingleYear_Model)>0,CRY,CONCATENATE(FRCP_y1,\" to \",dms_MultiYear_FinalYear_Result))","v":"2022-23 to 2026-27"}]
["3.3 ASSETS"]
[]
["There are FOUR tables on this worksheet. Each table has been grouped (and sub-grouped) for ease of navigation. See the Instructions sheet on how to group or ungroup tables. "]
[]
["3.3.1 - REGULATORY ASSET BASE VALUES"]
[null,{"$f":"CONCATENATE(\"Forecast ($0's, real \",dms_DollarReal,\")\")","v":"Forecast ($0's, real June 2022)"}]
[null,{"$f":"dms_y1","v":"2020-21"},{"$f":"dms_y2","v":"2021-22"},{"$f":"dms_y3","v":"2022-23"},{"$f":"dms_y4","v":"2023-24"},{"$f":"dms_y5","v":"2024-25"},{"$f":"dms_y6","v":"2025-26"},{"$f":"dms_y7","v":"2026-27"}]
["For total asset base:"]
["Opening value",7104197525.6558523,{"$f":"B18","v":7003709947.0926743},6958401180.1548805,6831762431.3123827,6719588309.4677258,6552188891.3370285,6379915170.4754019]
["Inflation addition",35871173.125633128,70037099.470926806,0,0,0,0,0]
["Straight line depreciation",-317613648.71879357,-316560976.06220585,-318552908.81405836,-322712068.09696174,-325122357.68851256,-324971497.91134059,-325400527.08697754]
["Actual additions (recognised in RAB)",182156912.51878297,210071679.17118084,192606430.01006237,211056012.93145147,169523189.40155378,153569193.50444606,155083531.31637943]
["RFM True-up / adjustments",0,-3770026.316860416,0,0,0,0,0]
["Disposals ",-902015.48880000005,-5086543.2008352764,-692270.03850206709,-518066.67914632108,-11800249.843738278,-871416.45473168744,-809243.40302381036]
["Closing value ",{"$f":"SUM(B12:B17)","v":7003709947.0926743},6958401180.1548805,6831762431.3123827,6719588309.4677258,6552188891.3370285,6379915170.4754019,6208788931.3017797]
[]
[]
["3.3.2 - ASSET VALUE ROLL FORWARD"]
[null,{"$f":"CONCATENATE(\"Forecast ($0's, real \",dms_DollarReal,\")\")","v":"Forecast ($0's, real June 2022)"}]
[null,{"$f":"dms_y1","v":"2020-21"},{"$f":"dms_y2","v":"2021-22"},{"$f":"dms_y3","v":"2022-23"},{"$f":"dms_y4","v":"2023-24"},{"$f":"dms_y5","v":"2024-25"},{"$f":"dms_y6","v":"2025-26"},{"$f":"dms_y7","v":"2026-27"}]
["For overhead assets:"]
["Opening value",3557387634.7249146,{"$f":"B31","v":3490517074.5639129},3458604139.484694,3385018140.0291786,3309917498.0173187,3223928603.2982388,3135444960.2959366]
["Inflation addition",17961464.027352393,34905170.745639168,0,0,0,0,0]
["Straight line depreciation",-120599864.72894171,-121282138.40254697,-121490798.13401097,-121514465.00064261,-122871693.59783493,-124576587.8521938,-124913345.51719174]
["Actual additions (recognised in RAB)",35767840.540588021,34581070.712724425,47904798.678495347,46413822.988782883,36882798.878755204,36092944.84989164,43513243.890866295]
["RFM True-up / adjustments",0,19882961.8649645,0,0,0,0,0]
["Disposals ",0,0,0,0,0,0,0]
["Closing value ",{"$f":"SUM(B25:B30)","v":3490517074.5639129},3458604139.484694,3385018140.0291786,3309917498.0173187,3223928603.2982388,3135444960.2959366,3054044858.669611]
["For underground assets:"]
["Opening value",49143505.733035587,{"$f":"B39","v":46910977.244776838},45432671.878443539,43639278.907725923,56065036.02632001,71528654.013758734,75644743.342390582]
["Inflation addition",248063.07752741146,469109.77244776877,0,0,0,0,0]
["Straight line depreciation",-2629081.21146926,-2616065.9579471354,-2580113.4428731366,-2580113.4428731366,-2580113.4428731366,-2657273.2186611909,-2676419.1703170938]
["Actual additions (recognised in RAB)",148489.64568310388,693355.66519169917,786720.4721555179,15005870.561467221,18043731.430311855,6773362.5472930316,0]
["RFM True-up / adjustments",0,-24704.846025639854,0,0,0,0,0]
["Disposals ",0,0,0,0,0,0,0]
["Closing value ",{"$f":"SUM(B33:B38)","v":46910977.244776838},45432671.878443539,43639278.907725923,56065036.02632001,71528654.013758734,75644743.342390582,72968324.172073483]
["For switchyards, substations"]
["Opening value",2526252485.0751095,{"$f":"B47","v":2473405204.6421824},2438225960.102036,2394850997.3811493,2335390593.6152415,2248519266.242887,2160503132.4521012]
["Inflation addition",12754932.685607385,24734052.046421845,0,0,0,0,0]
["Straight line depreciation",-156709027.94331792,-160430234.69317541,-143314432.30886996,-148863295.22651324,-154185962.53528845,-157731665.37694636,-159466872.97324717]
["Actual additions (recognised in RAB)",91106814.824783444,124301758.57543507,99939469.587983027,89402891.460605532,67314635.162933737,69715531.586160615,76651083.451838419]
["RFM True-up / adjustments",0,-19711012.951393045,0,0,0,0,0]
["Disposals ",0,-4073807.5174352755,0,0,0,0,0]
["Closing value ",{"$f":"SUM(B41:B46)","v":2473405204.6421824},2438225960.102036,2394850997.3811493,2335390593.6152415,2248519266.242887,2160503132.4521012,2077687342.9306927]
["For easements:"]
["Opening value",688763000.3561523,{"$f":"B55","v":694766336.89250207},701524808.54503345,703564605.16580796,706063839.91419315,709459119.91358876,714550195.22157693]
["Inflation addition",3478553.3186253118,6947663.3689250248,0,0,0,0,0]
["Straight line depreciation",0,0,0,0,0,0,0]
["Actual additions (recognised in RAB)",2524783.217724401,277127.60057629499,2039796.6207744721,2499234.7483851933,3395279.9993956224,5091075.3079882003,8176589.0494130198]
["RFM True-up / adjustments",0,-173680.40196992186,0,0,0,0,0]
["Disposals ",0,-292638.91499999998,0,0,0,0,0]
["Closing value ",{"$f":"SUM(B49:B54)","v":694766336.89250207},701524808.54503345,703564605.16580796,706063839.91419315,709459119.91358876,714550195.22157693,722726784.27098989]
["For “other” assets with long lives:"]
["Opening value",204213142.25979093,{"$f":"B63","v":217847710.99300838},228336984.20742318,234799045.45977694,255251290.80921087,254851759.6028654,254409824.43738249]
["Inflation addition",1031958.0968485828,2178477.1099300859,0,0,0,0,0]
["Straight line depreciation",-16219823.511593521,-17569297.093885776,-13146514.398933349,-17073412.190308806,-18044451.772469632,-18284121.762234382,-19478427.738198847]
["Actual additions (recognised in RAB)",28822434.147962388,35690257.940281563,19608575.651287101,37525657.539742738,28749775.022709858,17842186.596751492,11025133.438764798]
["RFM True-up / adjustments",0,-9810164.7419110946,0,0,0,0,0]
["Disposals ",0,0,0,0,-11104854.456585683,0,0]
["Closing value ",{"$f":"SUM(B57:B62)","v":217847710.99300838},228336984.20742318,234799045.45977694,255251290.80921087,254851759.6028654,254409824.43738249,245956530.13794845]
["For “other” assets with short lives:"]
["Opening value",78437757.506848335,{"$f":"B71","v":80262642.756290823},86276615.93724975,69890364.368743584,56900051.085441314,43901488.26568985,39362314.726014361]
["Inflation addition",396201.91967204772,802626.42756290897,0,0,0,0,0]
["Straight line depreciation",-21455851.323471166,-14663239.914650556,-38021050.529370956,-32680782.236623857,-27440136.340046365,-21721849.701304853,-18865461.688022722]
["Actual additions (recognised in RAB)",23786550.142041612,14528108.676971788,22327068.999366857,20208535.632467903,15136968.907447496,18054092.616361048,15717481.485496948]
["RFM True-up / adjustments",0,6066574.7594747832,0,0,0,0,0]
["Disposals ",-902015.48880000005,-720096.76840000006,-692270.03850206709,-518066.67914632108,-695395.38715259556,-871416.45473168744,-809243.40302381036]
["Closing value ",{"$f":"SUM(B65:B70)","v":80262642.756290823},86276615.93724975,69890364.368743584,56900051.085441314,43901488.26568985,39362314.726014361,35405091.120464779]
[]
[]
[]
["3.3.3 - TOTAL DISAGGREGATED RAB ASSET VALUES"]
[null,{"$f":"CONCATENATE(\"Forecast ($0's, real \",dms_DollarReal,\")\")","v":"Forecast ($0's, real June 2022)"}]
[null,{"$f":"dms_y1","v":"2020-21"},{"$f":"dms_y2","v":"2021-22"},{"$f":"dms_y3","v":"2022-23"},{"$f":"dms_y4","v":"2023-24"},{"$f":"dms_y5","v":"2024-25"},{"$f":"dms_y6","v":"2025-26"},{"$f":"dms_y7","v":"2026-27"}]
["Overhead transmission assets (wires and towers/poles etc)",{"$f":"AVERAGE(B25,B31)","v":3523952354.6444139},{"$f":"AVERAGE(C25,C31)","v":3474560607.0243034},3421811139.7569361,3347467819.0232487,3266923050.6577787,3179686781.7970877,3094744909.4827738]
["Underground transmission assets (cables, ducts etc)",{"$f":"AVERAGE(B33,B39)","v":48027241.488906212},{"$f":"AVERAGE(C33,C39)","v":46171824.561610192},44535975.393084735,49852157.46702297,63796845.020039372,73586698.678074658,74306533.75723204]
["Substations, switchyards, transformers etc with transmission function",{"$f":"AVERAGE(B41,B47)","v":2499828844.8586459},{"$f":"AVERAGE(C41,C47)","v":2455815582.3721094},2416538478.7415924,2365120795.4981956,2291954929.9290643,2204511199.3474941,2119095237.691397]
["Easements",{"$f":"AVERAGE(B49,B55)","v":691764668.62432718},{"$f":"AVERAGE(C49,C55)","v":698145572.71876776},702544706.85542071,704814222.54000056,707761479.91389096,712004657.56758285,718638489.74628341]
["Other assets with long lives (please specify)",{"$f":"AVERAGE(B57,B63)","v":211030426.62639964},{"$f":"AVERAGE(C57,C63)","v":223092347.60021579},231568014.83360004,245025168.13449389,255051525.20603812,254630792.02012396,250183177.28766549]
["Other assets with short lives (please specify)",{"$f":"AVERAGE(B65,B71)","v":79350200.131569579},{"$f":"AVERAGE(C65,C71)","v":83269629.346770287},78083490.152996659,63395207.727092445,50400769.675565585,41631901.495852105,37383702.923239574]
[]
[]
["3.3.4 - ASSET LIVES"]
[null,"Asset Life"]
[null,{"$f":"dms_y1","v":"2020-21"},{"$f":"dms_y2","v":"2021-22"},{"$f":"dms_y3","v":"2022-23"},{"$f":"dms_y4","v":"2023-24"},{"$f":"dms_y5","v":"2024-25"},{"$f":"dms_y6","v":"2025-26"},{"$f":"dms_y7","v":"2026-27"}]
["ESTIMATED SERVICE LIFE OF NEW ASSETS"]
["Overhead transmission assets (wires and towers/poles etc)",49.568738336749924,48.975356412387818,48.951952017456584,48.952362245231477,48.905268509180608,48.676784089654781,48.683877793030405]
["Underground transmission assets (cables, ducts etc)",45,45,45,45,45,45,45]
["Substations, switchyards, transformers etc with transmission function",35.003365458207568,35.133691983336924,35.305402712032922,35.042418313800049,34.827275936852011,34.775680760093088,34.673713925515308]
["Other assets with long lives",30.387546467188951,29.480144845472513,28.793472308970834,24.908702456590252,25.899917761060816,25.813002573205797,25.075567578946128]
["Other assets with short lives",5.3716905905955175,5.3585195386695652,5.3642315028251071,5.3677623632850384,5.3685449507405414,5.3867861834960857,5.4058531270418229]
["ESTIMATED RESIDUAL SERVICE LIFE"]
["Overhead transmission assets (wires and towers/poles etc)",26.387358715558008,25.41475005108332,24.430357041559738,23.930984721678868,23.242508497129201,22.442735513824061,21.599666072950569]
["Underground transmission assets (cables, ducts etc)",15.946178478113227,14.95080720015228,13.956103014040972,12.962221330706816,15.373972078518111,15.411927600781564,31.655328398644858]
["Substations, switchyards, transformers etc with transmission function",21.375424654109846,21.015681405888785,20.973284436805709,20.992171174019898,21.053006162300903,20.757974641963056,20.318764248231659]
["Other assets with long lives",18.250798363881422,17.601523315794363,16.371850919211546,18.208814904852595,17.928344011164125,17.45071869367176,16.840459831899128]
["Other assets with short lives",3.9873738380680974,3.6768647373707792,3.7983416319149508,3.8525009104990353,3.8845441717465019,4.0095342671259022,4.0398693781042363]

{"sheet":"3.4 Operational data","index":26,"n_rows":90,"n_cols":10,"rows_kept":90,"cut":false,"hidden":false,"merged":[[8,3,8,9],[28,3,28,9],[59,3,59,9]]}
[null,{"$f":"(LOOKUP(dms_Model,dms_Model_List,dms_Worksheet_List))","v":"REGULATORY REPORTING STATEMENT"}]
[null,{"$f":"INDEX(dms_TradingNameFull_List,MATCH(dms_TradingName,dms_TradingName_List))","v":"Queensland Electricity Transmission Corporation Limited trading as Powerlink Queensland"}]
[null,{"$f":"IF(SUM(dms_SingleYear_Model)>0,CRY,CONCATENATE(FRCP_y1,\" to \",dms_MultiYear_FinalYear_Result))","v":"2022-23 to 2026-27"}]
[null,"3.4 OPERATIONAL DATA"]
[]
[null,"There are THREE tables on this worksheet. Each table has been grouped for ease of navigation. See the Instructions sheet on how to group or ungroup tables. "]
[]
[null,"3.4.1 - ENERGY DELIVERY"]
[null,null,null,"Forecast (0's)"]
[null,null,"Units",{"$f":"dms_y1","v":"2020-21"},{"$f":"dms_y2","v":"2021-22"},{"$f":"dms_y3","v":"2022-23"},{"$f":"dms_y4","v":"2023-24"},{"$f":"dms_y5","v":"2024-25"},{"$f":"dms_y6","v":"2025-26"},{"$f":"dms_y7","v":"2026-27"}]
[null,"Energy grouping by downstream connection type"]
["TOPED0101","To Other connected transmission networks","GWh",5285,5700,6841,9942,7935,8067,8759]
["TOPED0102","To Distribution networks","GWh",28736.1,29118,29389.4,29624,29245.200000000001,28786.6,28340.1]
["TOPED0103","To Directly connected end–users (330 kV)","GWh",0,0,0,0,0,0,0]
["TOPED0104","To Directly connected end–users (275 kV)","GWh",7304.3,7357.8,7378.6,7375.3,7388.4,7394.1,7376.6]
["TOPED0105","To Directly connected end–users (220 kV)","GWh",0,0,0,0,0,0,0]
["TOPED0106","To Directly connected end–users (132 kV)","GWh",9263.2999999999993,9602.1,9614.4,9611.9,9624,9630.7000000000007,9618.1]
["TOPED0107","To Directly connected end–users (110 kV)","GWh",0,0,0,0,0,0,0]
["TOPED0108","To Directly connected end–users (44 kV) ","GWh",0,0,0,0,0,0,0]
["TOPED0109","To Directly connected end–users (33 kV)","GWh",0,0,0,0,0,0,0]
["TOPED0110","To Directly connected end–users (22 kV)","GWh",0,0,0,0,0,0,0]
["TOPED0111","To Directly connected end–users (11 kV)","GWh",0,0,0,0,0,0,0]
["TOPED0112","To Directly connected end–users (6.6 kV)","GWh",0,0,0,0,0,0,0]
["TOPED0113","Pumping and Power Station Auxillaries","GWh",325,325,325,325,325,325,325]
["TOPED01","Total energy transported","GWh",{"$f":"SUM(D12:D24)","v":50913.7},52102.9,53548.4,56878.200000000004,54517.599999999999,54203.399999999994,54418.799999999996]
[]
[]
[null,"3.4.2 -  CONNECTION POINTS"]
[null,null,null,"Forecast (0's)"]
[null,null,"Units",{"$f":"dms_y1","v":"2020-21"},{"$f":"dms_y2","v":"2021-22"},{"$f":"dms_y3","v":"2022-23"},{"$f":"dms_y4","v":"2023-24"},{"$f":"dms_y5","v":"2024-25"},{"$f":"dms_y6","v":"2025-26"},{"$f":"dms_y7","v":"2026-27"}]
[null,"Number of entry points at each transmission voltage level"]
["TOPCP0101","500kV","number",0,0,0,0,0,0,0]
["TOPCP0102","330kV","number",1,1,1,1,1,1,1]
["TOPCP0103","275kV","number",16.5,17,17,17.5,18,18,18]
["TOPCP0104","220kV","number",0,0,0,0,0,0,0]
["TOPCP0105","132 kV","number",13.5,16.5,18,18,18,18,18]
["TOPCP0106","110kV","number",1,1,1,1,1,1,1]
["TOPCP0107","66 kV","number",0,0,0,0,0,0,0]
["TOPCP0108","33 kV","number",5,5,5,5,5,5,5]
["TOPCP0109","22 kV","number",0,0,0,0,0,0,0]
["TOPCP0110","11 kV","number",0,0,0,0,0,0,0]
["TOPCP0111","6.6 kV","number",0,0,0,0,0,0,0]
[null,"Number of exit points at each transmission voltage level "]
["TOPCP0201","500kV","number",0,0,0,0,0,0,0]
["TOPCP0202","330kV","number",1,1,1,1,1,1,1]
["TOPCP0203","275kV","number",5,5,5,5,5,5,5]
["TOPCP0204","220kV","number",0,0,0,0,0,0,0]
["TOPCP0205","132 kV","number",48,48,48,48,48,48,48]
["TOPCP0206","110kV","number",17,17,17,17,17,17,17]
["TOPCP0207","66 kV","number",23,23,23,23,23,23,23]
["TOPCP0208","44 kV","number",0,0,0,0,0,0,0]
["TOPCP0209","33kV","number",14,14,14,14,14,14,14]
["TOPCP0210","22kV","number",7,7,7,7,7,7,7]
["TOPCP0211","11kV","number",3.5,3.5,3.5,3.5,3.5,3.5,3.5]
["TOPCP0212","6.6kV","number",0,0,0,0,0,0,0]
[]
[]
[]
[null,"3.4.3 - SYSTEM DEMAND"]
[null,null,null,"Forecast (0's)"]
[null,null,"Units",{"$f":"dms_y1","v":"2020-21"},{"$f":"dms_y2","v":"2021-22"},{"$f":"dms_y3","v":"2022-23"},{"$f":"dms_y4","v":"2023-24"},{"$f":"dms_y5","v":"2024-25"},{"$f":"dms_y6","v":"2025-26"},{"$f":"dms_y7","v":"2026-27"}]
[null,"Annual system maximum demand characteristics – MW measure"]
["TOPSD0101","Transmission System coincident maximum demand","MW"]
["TOPSD0102","Transmission System coincident weather adjusted maximum demand 10% POE","MW",9644.9,9971.6,10062.1,10182.799999999999,10256.200000000001,10317.700000000001,10366.9]
["TOPSD0103","Transmission System coincident weather adjusted maximum demand 50% POE","MW",9251.7999999999993,9563.7999999999993,9650.2000000000007,9764.7999999999993,9835.4,9894.1,9940.9]
["TOPSD0104","Transmission System non-coincident summated maximum demand","MW"]
["TOPSD0105","Transmission System non-coincident weather adjusted summated maximum demand 10% POE","MW",12665.4,12817.5,12970.8,13218.7,13279.9,13326.4,13353.7]
["TOPSD0106","Transmission System non-coincident weather adjusted summated maximum demand 50% POE","MW",11819,11965.8,12111.7,12356.1,12415.7,12457.3,12478.2]
[null,"Annual system maximum demand characteristics – MVA measure"]
["TOPSD0201","Transmission System coincident maximum demand","MVA"]
["TOPSD0202","Transmission System coincident weather adjusted maximum demand 10% POE","MVA",10102.299999999999,10416.700000000001,10508.1,10633.2,10707.5,10771.6,10821.2]
["TOPSD0203","Transmission System coincident weather adjusted maximum demand 50% POE","MVA",9680.6,9978.6,10066.1,10183.9,10255.299999999999,10316,10363.5]
["TOPSD0204","Transmission System non-coincident summated maximum demand","MVA"]
["TOPSD0205","Transmission System non-coincident weather adjusted summated maximum demand 10% POE","MVA",13072.1,13234.4,13443,13637,13695.4,13737.7,13765.6]
["TOPSD0206","Transmission System non-coincident weather adjusted summated maximum demand 50% POE","MVA",12225.9,12383.8,12583.5,12774.7,12828.8,12865.4,12889.8]
[null,"Power factor"]
[null,"Power factor conversion between MVA and MW"]
["TOPSD0301","Average overall network power factor conversion between MVA and MW","Factor",0.95599999999999996,0.95799999999999996,0.95899999999999996,0.95899999999999996,0.95899999999999996,0.95899999999999996,0.95899999999999996]
["TOPSD0302","Average power factor conversion for 500 kV lines","Factor"]
["TOPSD0303","Average power factor conversion for 330 kV lines","Factor",0.89400000000000002,0.89400000000000002,0.89400000000000002,0.89400000000000002,0.89400000000000002,0.89400000000000002,0.89400000000000002]
["TOPSD0304","Average power factor conversion for  275 kV lines","Factor",0.91200000000000003,0.94099999999999995,0.94099999999999995,0.94099999999999995,0.94199999999999995,0.94199999999999995,0.94099999999999995]
["TOPSD0305","Average power factor conversion for  220 kV lines","Factor"]
["TOPSD0306","Average power factor conversion for  132 kV lines","Factor",0.96799999999999997,0.97499999999999998,0.97499999999999998,0.97499999999999998,0.97499999999999998,0.97499999999999998,0.97499999999999998]
["TOPSD0307","Average power factor conversion for  110 kV lines","Factor",0.97699999999999998,0.97599999999999998,0.97599999999999998,0.97599999999999998,0.97699999999999998,0.97699999999999998,0.97699999999999998]
["TOPSD0308","Average power factor conversion for  88 kV lines","Factor"]
["TOPSD0309","Average power factor conversion for  66 kV lines","Factor",0.97299999999999998,0.97299999999999998,0.97299999999999998,0.97299999999999998,0.97299999999999998,0.97399999999999998,0.97399999999999998]
["TOPSD0310","Average power factor conversion for  33 kV lines","Factor",0.97699999999999998,0.97599999999999998,0.97699999999999998,0.97599999999999998,0.97499999999999998,0.97499999999999998,0.97499999999999998]
["TOPSD0311","Average power factor conversion for  22 kV lines","Factor",0.98599999999999999,0.98599999999999999,0.98699999999999999,0.98699999999999999,0.98699999999999999,0.98699999999999999,0.98699999999999999]
["TOPSD0311","Average power factor conversion for  11 kV lines","Factor",0.99299999999999999,0.99299999999999999,0.99299999999999999,0.99299999999999999,0.99299999999999999,0.99299999999999999,0.99299999999999999]
["TOPSD0312","Average power factor conversion for  6.6 kV lines","Factor"]

{"sheet":"3.5 Physical assets","index":27,"n_rows":74,"n_cols":10,"rows_kept":74,"cut":false,"hidden":false,"merged":[[36,1,36,2],[5,1,5,2],[8,3,8,9],[22,1,22,2]]}
[null,{"$f":"(LOOKUP(dms_Model,dms_Model_List,dms_Worksheet_List))","v":"REGULATORY REPORTING STATEMENT"}]
[null,{"$f":"INDEX(dms_TradingNameFull_List,MATCH(dms_TradingName,dms_TradingName_List))","v":"Queensland Electricity Transmission Corporation Limited trading as Powerlink Queensland"}]
[null,{"$f":"IF(SUM(dms_SingleYear_Model)>0,CRY,CONCATENATE(FRCP_y1,\" to \",dms_MultiYear_FinalYear_Result))","v":"2022-23 to 2026-27"}]
[null,"3.5 PHYSICAL ASSETS"]
[]
[null,"There is ONE table on this worksheet. It has been sub-grouped for ease of navigation. See the Instructions sheet on how to group or ungroup tables. "]
[]
[null,"3.5.1 - TRANSMISSION SYSTEM CAPACITIES "]
[null,null,null,"Forecast (0's)"]
[null,null,"Units",{"$f":"dms_y1","v":"2020-21"},{"$f":"dms_y2","v":"2021-22"},{"$f":"dms_y3","v":"2022-23"},{"$f":"dms_y4","v":"2023-24"},{"$f":"dms_y5","v":"2024-25"},{"$f":"dms_y6","v":"2025-26"},{"$f":"dms_y7","v":"2026-27"}]
[null,"Overhead network length of circuit at each voltage"]
["TPA0101","500 kV","km",0,0,0,0,0,0,0]
["TPA0102","330 kV","km",603,603,603,603,603,603,603]
["TPA0103","275 kV","km",9381,9381,9381,9378.4,9393.4,9393.4,9393.4]
["TPA0104","220 kV","km",0,0,0,0,0,0,0]
["TPA0105","132 kV","km",4125,4125,4055.9,4055.9,4055.9,4055.9,4045.9]
["TPA0106","110 kV","km",397,397,397,397,397,397,397]
["TPA0107","88 kV","km",0,0,0,0,0,0,0]
["TPA0108","66 kV","km",2,2,2,2,2,2,2]
["TPA0109","33 kV","km",0,0,0,0,0,0,0]
["TPA0109","22 kV","km",0,0,0,0,0,0,0]
["TPA0109","11 kV","km",0,0,0,0,0,0,0]
["TPA01","Total",null,{"$f":"SUM(D12:D22)","v":14508},14508,14438.9,14436.3,14451.3,14451.3,14441.3]
[]
[null,"Underground cable circuit length at each voltage"]
["TPA0201","500 kV","km",0,0,0,0,0,0,0]
["TPA0202","330 kV","km",0,0,0,0,0,0,0]
["TPA0203","275 kV","km",9.4,9.4,9.4,9.4,9.4,9.4,9.4]
["TPA0204","220 kV","km",0,0,0,0,0,0,0]
["TPA0205","132 kV","km",3.2,3.2,3.2,3.2,3.2,3.2,13.2]
["TPA0206","110 kV","km",7.6,7.6,7.6,7.6,7.6,7.6,7.6]
["TPA0207","88 kV","km",0,0,0,0,0,0,0]
["TPA0208","66 kV","km",0,0,0,0,0,0,0]
["TPA0209","33 kV","km",0,0,0,0,0,0,0]
["TPA0210","22 kV","km",0,0,0,0,0,0,0]
["TPA0211","11 kV","km",0,0,0,0,0,0,0]
["TPA02","Total",null,{"$f":"SUM(D26:D36)","v":20.200000000000003},20.200000000000003,20.200000000000003,20.200000000000003,20.200000000000003,20.200000000000003,30.200000000000003]
[]
[null,"Estimated overhead network weighted average MVA capacity by voltage class"]
["TPA0301","500 kV","MVA",0,0,0,0,0,0,0]
["TPA0302","330 kV","MVA",1241.7,1241.7,1241.7,1241.7,1241.7,1241.7,1241.7]
["TPA0303","275 kV","MVA",750.3,711.3,711.3,711,711,711,711]
["TPA0304","220 kV","MVA",0,0,0,0,0,0,0]
["TPA0305","132 kV","MVA",141,141,139.4,139,139,139,139]
["TPA0306","110 kV","MVA",177,177,177,177,177,177,177]
["TPA0307","88 kV","MVA",0,0,0,0,0,0,0]
["TPA0308","66 kV","MVA",37.200000000000003,37.200000000000003,37.200000000000003,37.200000000000003,37.200000000000003,37.200000000000003,37.200000000000003]
["TPA0309","33 kV","MVA",0,0,0,0,0,0,0]
["TPA0310","22 kV","MVA",0,0,0,0,0,0,0]
["TPA0311","11 kV","MVA",0,0,0,0,0,0,0]
[]
[null,"Estimated underground network weighted average MVA capacity by voltage class"]
["TPA0401","500 kV","MVA",0,0,0,0,0,0,0]
["TPA0402","330 kV","MVA",0,0,0,0,0,0,0]
["TPA0403","275 kV","MVA",572,572,572,572,572,572,572]
["TPA0404","220 kV","MVA",0,0,0,0,0,0,0]
["TPA0405","132 kV","MVA",161,161,161,161,161,161,134.6]
["TPA0406","110 kV","MVA",205.3,205.3,205.3,205.3,205.3,205.3,205.3]
["TPA0407","88 kV","MVA",0,0,0,0,0,0,0]
["TPA0408","66 kV","MVA",0,0,0,0,0,0,0]
["TPA0409","33 kV","MVA",0,0,0,0,0,0,0]
["TPA0410","22 kV","MVA",0,0,0,0,0,0,0]
["TPA0411","11 kV","MVA",0,0,0,0,0,0,0]
[]
[null,"Installed transmission system transformer capacity"]
["TPA0501","Transmission substations (eg 500 kV to 330 kV)","MVA",11424,10910,10865,11151,11151,11151,11151]
["TPA0502","Terminal points to DNSP systems","MVA",19931,19796,19611,19719,19726,19726,19726]
["TPA0503","Transformer capacity for directly connected end–users owned by the TNSP","MVA",2172,2172,2172,2172,2172,2172,2172]
["TPA0504","Transformer capacity for directly connected end–users owned by the end–user","MVA",4832,4832,4832,4832,4832,4832,4832]
["TPA0505","Interconnector capacity","MVA",3750,3750,3750,3750,3750,3750,3750]
["TPA0506","Other","MVA",3197,3197,3197,3197,3197,3197,3197]
[]
[null,"Cold spare capacity"]
["TPA06","Cold spare capacity included in 3.5.1.5","MVA",3335,3135,3135,3135,3135,3135,3135]

{"sheet":"3.7 Operating environment","index":28,"n_rows":25,"n_cols":10,"rows_kept":25,"cut":false,"hidden":false,"merged":[[7,3,7,9],[19,3,19,9]]}
[null,{"$f":"(LOOKUP(dms_Model,dms_Model_List,dms_Worksheet_List))","v":"REGULATORY REPORTING STATEMENT"}]
[null,{"$f":"INDEX(dms_TradingNameFull_List,MATCH(dms_TradingName,dms_TradingName_List))","v":"Queensland Electricity Transmission Corporation Limited trading as Powerlink Queensland"}]
[null,{"$f":"IF(SUM(dms_SingleYear_Model)>0,CRY,CONCATENATE(FRCP_y1,\" to \",dms_MultiYear_FinalYear_Result))","v":"2022-23 to 2026-27"}]
[null,"3.7 OPERATING ENVIRONMENT FACTORS"]
[]
[]
["TEF01","3.7.1 - TERRAIN FACTORS"]
[null,null,null,"Forecast (0's)"]
[null,null,"Units",{"$f":"dms_y1","v":"2020-21"},{"$f":"dms_y2","v":"2021-22"},{"$f":"dms_y3","v":"2022-23"},{"$f":"dms_y4","v":"2023-24"},{"$f":"dms_y5","v":"2024-25"},{"$f":"dms_y6","v":"2025-26"},{"$f":"dms_y7","v":"2026-27"}]
["TEF0101","Total number of vegetation maintenance spans","Number of spans",6007]
["TEF0102","Average vegetation maintenance span cycle","Years",2.6640000000000001]
["TEF0103","Average number of trees per vegetation maintenance span","Trees",900]
["TEF0104","Average number of defects per vegetation maintenance span","Defects",0.02]
["TEF0105","Tropical proportion","Number of spans",4805]
["TEF0106","Standard vehicle access","km",7918]
["TEF0107","Altitude","km",432.8]
["TEF0108","Bushfire risk","Number of spans",962]
[]
["TEF02","3.7.2 - NETWORK CHARACTERISTICS"]
[null,null,null,"Forecast (0's)"]
[null,null,"Units",{"$f":"dms_y1","v":"2020-21"},{"$f":"dms_y2","v":"2021-22"},{"$f":"dms_y3","v":"2022-23"},{"$f":"dms_y4","v":"2023-24"},{"$f":"dms_y5","v":"2024-25"},{"$f":"dms_y6","v":"2025-26"},{"$f":"dms_y7","v":"2026-27"}]
["TEF0201","Route line length","km",9634,9634,9564.9,9562.2999999999993,9562.2999999999993,9562.2999999999993,9562.2999999999993]
["TEF0202","Variability of dispatch","%",0.11,0.13,0.13,0.12,0.16,0.2,0.24]
["TEF0203","Concentrated load distance","km",565.4,565.4,565.4,565.4,565.4,565.4,565.4]
["TEF0204","Total number of spans","number",23716,23716,23486,23478,23478,23478,23448]

{"sheet":"5.4 MD & Utilisation - Spatial","index":29,"n_rows":4881,"n_cols":23,"rows_kept":4881,"cut":false,"hidden":false,"merged":[[5,1,5,2],[9,1,22,1],[9,2,10,2],[9,3,10,3],[11,2,12,2],[11,3,12,3],[13,2,14,2],[13,3,14,3],[15,2,16,2],[15,3,16,3],[17,2,18,2],[17,3,18,3],[19,2,20,2],[19,3,20,3],[21,2,22,2],[21,3,22,3],[23,1,36,1],[23,2,24,2],[23,3,24,3],[25,2,26,2],[25,3,26,3],[27,2,28,2],[27,3,28,3],[29,2,30,2],[29,3,30,3],[31,2,32,2],[31,3,32,3],[33,2,34,2],[33,3,34,3],[35,2,36,2],[35,3,36,3],[37,1,50,1],[37,2,38,2],[37,3,38,3],[39,2,40,2],[39,3,40,3],[41,2,42,2],[41,3,42,3],[43,2,44,2],[43,3,44,3],[45,2,46,2],[45,3,46,3],[47,2,48,2],[47,3,48,3],[49,2,50,2],[49,3,50,3],[51,1,64,1],[51,2,52,2],[51,3,52,3],[53,2,54,2],[53,3,54,3],[55,2,56,2],[55,3,56,3],[57,2,58,2],[57,3,58,3],[59,2,60,2],[59,3,60,3],[61,2,62,2],[61,3,62,3],[63,2,64,2],[63,3,64,3],[65,1,78,1],[65,2,66,2],[65,3,66,3],[67,2,68,2],[67,3,68,3],[69,2,70,2],[69,3,70,3],[71,2,72,2],[71,3,72,3],[73,2,74,2],[73,3,74,3],[75,2,76,2],[75,3,76,3],[77,2,78,2],[77,3,78,3],[79,1,92,1],[79,2,80,2],[79,3,80,3],[81,2,82,2],[81,3,82,3],[83,2,84,2],[83,3,84,3],[85,2,86,2],[85,3,86,3],[87,2,88,2],[87,3,88,3],[89,2,90,2],[89,3,90,3],[91,2,92,2],[91,3,92,3],[93,1,106,1],[93,2,94,2],[93,3,94,3],[95,2,96,2],[95,3,96,3],[97,2,98,2],[97,3,98,3],[99,2,100,2],[99,3,100,3],[101,2,102,2],[101,3,102,3],[103,2,104,2],[103,3,104,3],[105,2,106,2],[105,3,106,3],[107,1,120,1],[107,2,108,2],[107,3,108,3],[109,2,110,2],[109,3,110,3],[111,2,112,2],[111,3,112,3],[113,2,114,2],[113,3,114,3],[115,2,116,2],[115,3,116,3],[117,2,118,2],[117,3,118,3],[119,2,120,2],[119,3,120,3],[121,1,134,1],[121,2,122,2],[121,3,122,3],[123,2,124,2],[123,3,124,3],[125,2,126,2],[125,3,126,3],[127,2,128,2],[127,3,128,3],[129,2,130,2],[129,3,130,3],[131,2,132,2],[131,3,132,3],[133,2,134,2],[133,3,134,3],[135,1,148,1],[135,2,136,2],[135,3,136,3],[137,2,138,2],[137,3,138,3],[139,2,140,2],[139,3,140,3],[141,2,142,2],[141,3,142,3],[143,2,144,2],[143,3,144,3],[145,2,146,2],[145,3,146,3],[147,2,148,2],[147,3,148,3],[149,1,162,1],[149,2,150,2],[149,3,150,3],[151,2,152,2],[151,3,152,3],[153,2,154,2],[153,3,154,3],[155,2,156,2],[155,3,156,3],[157,2,158,2],[157,3,158,3],[159,2,160,2],[159,3,160,3],[161,2,162,2],[161,3,162,3],[163,1,176,1],[163,2,164,2],[163,3,164,3],[165,2,166,2],[165,3,166,3],[167,2,168,2],[167,3,168,3],[169,2,170,2],[169,3,170,3],[171,2,172,2],[171,3,172,3],[173,2,174,2],[173,3,174,3],[175,2,176,2],[175,3,176,3],[177,1,190,1],[177,2,178,2],[177,3,178,3],[179,2,180,2],[179,3,180,3],[181,2,182,2],[181,3,182,3],[183,2,184,2],[183,3,184,3],[185,2,186,2],[185,3,186,3],[187,2,188,2],[187,3,188,3],[189,2,190,2],[189,3,190,3],[191,1,204,1],[191,2,192,2],[191,3,192,3],[193,2,194,2],[193,3,194,3],[195,2,196,2],[195,3,196,3],[197,2,198,2],[197,3,198,3],[199,2,200,2],[199,3,200,3],[201,2,202,2],[201,3,202,3],[203,2,204,2],[203,3,204,3],[205,1,218,1],[205,2,206,2],[205,3,206,3],[207,2,208,2],[207,3,208,3],[209,2,210,2],[209,3,210,3],[211,2,212,2],[211,3,212,3],[213,2,214,2],[213,3,214,3],[215,2,216,2],[215,3,216,3],[217,2,218,2],[217,3,218,3],[219,1,232,1],[219,2,220,2],[219,3,220,3],[221,2,222,2],[221,3,222,3],[223,2,224,2],[223,3,224,3],[225,2,226,2],[225,3,226,3],[227,2,228,2],[227,3,228,3],[229,2,230,2],[229,3,230,3],[231,2,232,2],[231,3,232,3],[233,1,246,1],[233,2,234,2],[233,3,234,3],[235,2,236,2],[235,3,236,3],[237,2,238,2],[237,3,238,3],[239,2,240,2],[239,3,240,3],[241,2,242,2],[241,3,242,3],[243,2,244,2],[243,3,244,3],[245,2,246,2],[245,3,246,3],[247,1,260,1],[247,2,248,2],[247,3,248,3],[249,2,250,2],[249,3,250,3],[251,2,252,2],[251,3,252,3],[253,2,254,2],[253,3,254,3],[255,2,256,2],[255,3,256,3],[257,2,258,2],[257,3,258,3],[259,2,260,2],[259,3,260,3],[261,1,274,1],[261,2,262,2],[261,3,262,3],[263,2,264,2],[263,3,264,3],[265,2,266,2],[265,3,266,3],[267,2,268,2],[267,3,268,3],[269,2,270,2],[269,3,270,3],[271,2,272,2],[271,3,272,3],[273,2,274,2],[273,3,274,3],[275,1,288,1],[275,2,276,2],[275,3,276,3],[277,2,278,2],[277,3,278,3],[279,2,280,2],[279,3,280,3],[281,2,282,2],[281,3,282,3],[283,2,284,2],[283,3,284,3],[285,2,286,2],[285,3,286,3],[287,2,288,2],[287,3,288,3],[289,1,302,1],[289,2,290,2],[289,3,290,3],[291,2,292,2],[291,3,292,3],[293,2,294,2],[293,3,294,3],[295,2,296,2],[295,3,296,3],[297,2,298,2],[297,3,298,3],[299,2,300,2],[299,3,300,3],[301,2,302,2],[301,3,302,3],[303,1,316,1],[303,2,304,2],[303,3,304,3],[305,2,306,2],[305,3,306,3],[307,2,308,2],[307,3,308,3],[309,2,310,2],[309,3,310,3],[311,2,312,2],[311,3,312,3],[313,2,314,2],[313,3,314,3],[315,2,316,2],[315,3,316,3],[317,1,330,1],[317,2,318,2],[317,3,318,3],[319,2,320,2],[319,3,320,3],[321,2,322,2],[321,3,322,3],[323,2,324,2],[323,3,324,3],[325,2,326,2],[325,3,326,3],[327,2,328,2],[327,3,328,3],[329,2,330,2],[329,3,330,3],[331,1,344,1],[331,2,332,2],[331,3,332,3],[333,2,334,2],[333,3,334,3],[335,2,336,2],[335,3,336,3],[337,2,338,2],[337,3,338,3],[339,2,340,2],[339,3,340,3],[341,2,342,2],[341,3,342,3],[343,2,344,2],[343,3,344,3],[345,1,358,1],[345,2,346,2],[345,3,346,3],[347,2,348,2],[347,3,348,3],[349,2,350,2],[349,3,350,3],[351,2,352,2],[351,3,352,3],[353,2,354,2],[353,3,354,3],[355,2,356,2],[355,3,356,3],[357,2,358,2],[357,3,358,3],[359,1,372,1],[359,2,360,2],[359,3,360,3],[361,2,362,2],[361,3,362,3],[363,2,364,2],[363,3,364,3],[365,2,366,2],[365,3,366,3],[367,2,368,2],[367,3,368,3],[369,2,370,2],[369,3,370,3],[371,2,372,2],[371,3,372,3],[373,1,386,1],[373,2,374,2],[373,3,374,3],[375,2,376,2],[375,3,376,3],[377,2,378,2],[377,3,378,3],[379,2,380,2],[379,3,380,3],[381,2,382,2],[381,3,382,3],[383,2,384,2],[383,3,384,3],[385,2,386,2],[385,3,386,3],[387,1,400,1],[387,2,388,2],[387,3,388,3],[389,2,390,2],[389,3,390,3],[391,2,392,2],[391,3,392,3],[393,2,394,2],[393,3,394,3],[395,2,396,2],[395,3,396,3],[397,2,398,2],[397,3,398,3],[399,2,400,2],[399,3,400,3],[401,1,414,1],[401,2,402,2],[401,3,402,3],[403,2,404,2],[403,3,404,3],[405,2,406,2],[405,3,406,3],[407,2,408,2],[407,3,408,3],[409,2,410,2],[409,3,410,3],[411,2,412,2],[411,3,412,3],[413,2,414,2],[413,3,414,3],[415,1,428,1],[415,2,416,2],[415,3,416,3],[417,2,418,2],[417,3,418,3],[419,2,420,2],[419,3,420,3],[421,2,422,2],[421,3,422,3],[423,2,424,2],[423,3,424,3],[425,2,426,2],[425,3,426,3],[427,2,428,2],[427,3,428,3],[429,1,442,1],[429,2,430,2],[429,3,430,3],[431,2,432,2],[431,3,432,3],[433,2,434,2],[433,3,434,3],[435,2,436,2],[435,3,436,3],[437,2,438,2],[437,3,438,3],[439,2,440,2],[439,3,440,3],[441,2,442,2],[441,3,442,3],[443,1,456,1],[443,2,444,2],[443,3,444,3],[445,2,446,2],[445,3,446,3],[447,2,448,2],[447,3,448,3],[449,2,450,2],[449,3,450,3],[451,2,452,2],[451,3,452,3],[453,2,454,2],[453,3,454,3],[455,2,456,2],[455,3,456,3],[457,1,470,1],[457,2,458,2],[457,3,458,3],[459,2,460,2],[459,3,460,3],[461,2,462,2],[461,3,462,3],[463,2,464,2],[463,3,464,3],[465,2,466,2],[465,3,466,3],[467,2,468,2],[467,3,468,3],[469,2,470,2],[469,3,470,3],[471,1,484,1],[471,2,472,2],[471,3,472,3],[473,2,474,2],[473,3,474,3],[475,2,476,2],[475,3,476,3],[477,2,478,2],[477,3,478,3],[479,2,480,2],[479,3,480,3],[481,2,482,2],[481,3,482,3],[483,2,484,2],[483,3,484,3],[485,1,498,1],[485,2,486,2],[485,3,486,3],[487,2,488,2],[487,3,488,3],[489,2,490,2],[489,3,490,3],[491,2,492,2],[491,3,492,3],[493,2,494,2],[493,3,494,3],[495,2,496,2],[495,3,496,3],[497,2,498,2],[497,3,498,3],[499,1,512,1],[499,2,500,2],[499,3,500,3],[501,2,502,2],[501,3,502,3],[503,2,504,2],[503,3,504,3],[505,2,506,2],[505,3,506,3],[507,2,508,2],[507,3,508,3],[509,2,510,2],[509,3,510,3],[511,2,512,2],[511,3,512,3],[513,1,526,1],[513,2,514,2],[513,3,514,3],[515,2,516,2],[515,3,516,3],[517,2,518,2],[517,3,518,3],[519,2,520,2],[519,3,520,3],[521,2,522,2],[521,3,522,3],[523,2,524,2],[523,3,524,3],[525,2,526,2],[525,3,526,3],[527,1,540,1],[527,2,528,2],[527,3,528,3],[529,2,530,2],[529,3,530,3],[531,2,532,2],[531,3,532,3],[533,2,534,2],[533,3,534,3],[535,2,536,2],[535,3,536,3],[537,2,538,2],[537,3,538,3],[539,2,540,2],[539,3,540,3],[541,1,554,1],[541,2,542,2],[541,3,542,3],[543,2,544,2],[543,3,544,3],[545,2,546,2],[545,3,546,3],[547,2,548,2],[547,3,548,3],[549,2,550,2],[549,3,550,3],[551,2,552,2],[551,3,552,3],[553,2,554,2],[553,3,554,3],[555,1,568,1],[555,2,556,2],[555,3,556,3],[557,2,558,2],[557,3,558,3],[559,2,560,2],[559,3,560,3],[561,2,562,2],[561,3,562,3],[563,2,564,2],[563,3,564,3],[565,2,566,2],[565,3,566,3],[567,2,568,2],[567,3,568,3],[569,1,582,1],[569,2,570,2],[569,3,570,3],[571,2,572,2],[571,3,572,3],[573,2,574,2],[573,3,574,3],[575,2,576,2],[575,3,576,3],[577,2,578,2],[577,3,578,3],[579,2,580,2],[579,3,580,3],[581,2,582,2],[581,3,582,3],[583,1,596,1],[583,2,584,2],[583,3,584,3],[585,2,586,2],[585,3,586,3],[587,2,588,2],[587,3,588,3],[589,2,590,2],[589,3,590,3],[591,2,592,2],[591,3,592,3],[593,2,594,2],[593,3,594,3],[595,2,596,2],[595,3,596,3],[597,1,610,1],[597,2,598,2],[597,3,598,3],[599,2,600,2],[599,3,600,3],[601,2,602,2],[601,3,602,3],[603,2,604,2],[603,3,604,3],[605,2,606,2],[605,3,606,3],[607,2,608,2],[607,3,608,3],[609,2,610,2],[609,3,610,3],[611,1,624,1],[611,2,612,2],[611,3,612,3],[613,2,614,2],[613,3,614,3],[615,2,616,2],[615,3,616,3],[617,2,618,2],[617,3,618,3],[619,2,620,2],[619,3,620,3],[621,2,622,2],[621,3,622,3],[623,2,624,2],[623,3,624,3],[625,1,638,1],[625,2,626,2],[625,3,626,3],[627,2,628,2],[627,3,628,3],[629,2,630,2],[629,3,630,3],[631,2,632,2],[631,3,632,3],[633,2,634,2],[633,3,634,3],[635,2,636,2],[635,3,636,3],[637,2,638,2],[637,3,638,3],[639,1,652,1],[639,2,640,2],[639,3,640,3],[641,2,642,2],[641,3,642,3],[643,2,644,2],[643,3,644,3],[645,2,646,2],[645,3,646,3],[647,2,648,2],[647,3,648,3],[649,2,650,2],[649,3,650,3],[651,2,652,2],[651,3,652,3],[653,1,666,1],[653,2,654,2],[653,3,654,3],[655,2,656,2],[655,3,656,3],[657,2,658,2],[657,3,658,3],[659,2,660,2],[659,3,660,3],[661,2,662,2],[661,3,662,3],[663,2,664,2],[663,3,664,3],[665,2,666,2],[665,3,666,3],[667,1,680,1],[667,2,668,2],[667,3,668,3],[669,2,670,2],[669,3,670,3],[671,2,672,2],[671,3,672,3],[673,2,674,2],[673,3,674,3],[675,2,676,2],[675,3,676,3],[677,2,678,2],[677,3,678,3],[679,2,680,2],[679,3,680,3],[681,1,694,1],[681,2,682,2],[681,3,682,3],[683,2,684,2],[683,3,684,3],[685,2,686,2],[685,3,686,3],[687,2,688,2],[687,3,688,3],[689,2,690,2],[689,3,690,3],[691,2,692,2],[691,3,692,3],[693,2,694,2],[693,3,694,3],[695,1,708,1],[695,2,696,2],[695,3,696,3],[697,2,698,2],[697,3,698,3],[699,2,700,2],[699,3,700,3],[701,2,702,2],[701,3,702,3],[703,2,704,2],[703,3,704,3],[705,2,706,2],[705,3,706,3],[707,2,708,2],[707,3,708,3],[709,1,722,1],[709,2,710,2],[709,3,710,3],[711,2,712,2],[711,3,712,3],[713,2,714,2],[713,3,714,3],[715,2,716,2],[715,3,716,3],[717,2,718,2],[717,3,718,3],[719,2,720,2],[719,3,720,3],[721,2,722,2],[721,3,722,3],[723,1,736,1],[723,2,724,2],[723,3,724,3],[725,2,726,2],[725,3,726,3],[727,2,728,2],[727,3,728,3],[729,2,730,2],[729,3,730,3],[731,2,732,2],[731,3,732,3],[733,2,734,2],[733,3,734,3],[735,2,736,2],[735,3,736,3],[737,1,750,1],[737,2,738,2],[737,3,738,3],[739,2,740,2],[739,3,740,3],[741,2,742,2],[741,3,742,3],[743,2,744,2],[743,3,744,3],[745,2,746,2],[745,3,746,3],[747,2,748,2],[747,3,748,3],[749,2,750,2],[749,3,750,3],[751,1,764,1],[751,2,752,2],[751,3,752,3],[753,2,754,2],[753,3,754,3],[755,2,756,2],[755,3,756,3],[757,2,758,2],[757,3,758,3],[759,2,760,2],[759,3,760,3],[761,2,762,2],[761,3,762,3],[763,2,764,2],[763,3,764,3],[765,1,778,1],[765,2,766,2],[765,3,766,3],[767,2,768,2],[767,3,768,3],[769,2,770,2],[769,3,770,3],[771,2,772,2],[771,3,772,3],[773,2,774,2],[773,3,774,3],[775,2,776,2],[775,3,776,3],[777,2,778,2],[777,3,778,3],[779,1,792,1],[779,2,780,2],[779,3,780,3],[781,2,782,2],[781,3,782,3],[783,2,784,2],[783,3,784,3],[785,2,786,2],[785,3,786,3],[787,2,788,2],[787,3,788,3],[789,2,790,2],[789,3,790,3],[791,2,792,2],[791,3,792,3],[793,1,806,1],[793,2,794,2],[793,3,794,3],[795,2,796,2],[795,3,796,3],[797,2,798,2],[797,3,798,3],[799,2,800,2],[799,3,800,3],[801,2,802,2],[801,3,802,3],[803,2,804,2],[803,3,804,3],[805,2,806,2],[805,3,806,3],[807,1,820,1],[807,2,808,2],[807,3,808,3],[809,2,810,2],[809,3,810,3],[811,2,812,2],[811,3,812,3],[813,2,814,2],[813,3,814,3],[815,2,816,2],[815,3,816,3],[817,2,818,2],[817,3,818,3],[819,2,820,2],[819,3,820,3],[821,1,834,1],[821,2,822,2],[821,3,822,3],[823,2,824,2],[823,3,824,3],[825,2,826,2],[825,3,826,3],[827,2,828,2],[827,3,828,3],[829,2,830,2],[829,3,830,3],[831,2,832,2],[831,3,832,3],[833,2,834,2],[833,3,834,3],[835,1,848,1],[835,2,836,2],[835,3,836,3],[837,2,838,2],[837,3,838,3],[839,2,840,2],[839,3,840,3],[841,2,842,2],[841,3,842,3],[843,2,844,2],[843,3,844,3],[845,2,846,2],[845,3,846,3],[847,2,848,2],[847,3,848,3],[849,1,862,1],[849,2,850,2],[849,3,850,3],[851,2,852,2],[851,3,852,3],[853,2,854,2],[853,3,854,3],[855,2,856,2],[855,3,856,3],[857,2,858,2],[857,3,858,3],[859,2,860,2],[859,3,860,3],[861,2,862,2],[861,3,862,3],[863,1,876,1],[863,2,864,2],[863,3,864,3],[865,2,866,2],[865,3,866,3],[867,2,868,2],[867,3,868,3],[869,2,870,2],[869,3,870,3],[871,2,872,2],[871,3,872,3],[873,2,874,2],[873,3,874,3],[875,2,876,2],[875,3,876,3],[877,1,890,1],[877,2,878,2],[877,3,878,3],[879,2,880,2],[879,3,880,3],[881,2,882,2],[881,3,882,3],[883,2,884,2],[883,3,884,3],[885,2,886,2],[885,3,886,3],[887,2,888,2],[887,3,888,3],[889,2,890,2],[889,3,890,3],[891,1,904,1],[891,2,892,2],[891,3,892,3],[893,2,894,2],[893,3,894,3],[895,2,896,2],[895,3,896,3],[897,2,898,2],[897,3,898,3],[899,2,900,2],[899,3,900,3],[901,2,902,2],[901,3,902,3],[903,2,904,2],[903,3,904,3],[905,1,918,1],[905,2,906,2],[905,3,906,3],[907,2,908,2],[907,3,908,3],[909,2,910,2],[909,3,910,3],[911,2,912,2],[911,3,912,3],[913,2,914,2],[913,3,914,3],[915,2,916,2],[915,3,916,3],[917,2,918,2],[917,3,918,3],[919,1,932,1],[919,2,920,2],[919,3,920,3],[921,2,922,2],[921,3,922,3],[923,2,924,2],[923,3,924,3],[925,2,926,2],[925,3,926,3],[927,2,928,2],[927,3,928,3],[929,2,930,2],[929,3,930,3],[931,2,932,2],[931,3,932,3],[933,1,946,1],[933,2,934,2],[933,3,934,3],[935,2,936,2],[935,3,936,3],[937,2,938,2],[937,3,938,3],[939,2,940,2],[939,3,940,3]],"merged_total":5221,"flags":["merged_cut"]}
[null,{"$f":"(LOOKUP(dms_Model,dms_Model_List,dms_Worksheet_List))","v":"REGULATORY REPORTING STATEMENT"}]
[null,{"$f":"INDEX(dms_TradingNameFull_List,MATCH(dms_TradingName,dms_TradingName_List))","v":"Queensland Electricity Transmission Corporation Limited trading as Powerlink Queensland"}]
[null,{"$f":"IF(SUM(dms_SingleYear_Model)>0,CRY,CONCATENATE(FRCP_y1,\" to \",dms_MultiYear_FinalYear_Result))","v":"2022-23 to 2026-27"}]
[null,"5.4 MAXIMUM DEMAND AND UTILISATION AT SPATIAL LEVEL"]
[]
[null,"There is ONE table on this worksheet. It has been sub-grouped into blocks of approximately 500 rows for ease of navigation. See the Instructions sheet on how to group or ungroup data."]
[]
[null,"5.4.1 - NON-COINCIDENT & COINCIDENT MAXIMUM DEMAND"]
[null,"CONNECTION POINT","FORECASTING ELEMENTS","UNIT","MAX DEMAND",null,"TNSP NAME","SERVICE","SERVICE SUBCATEGORY","DATA TYPE","DATA TYPE SUBCATEGORY","LOCATION","LOCATION SUBCATEGORY","MEASUREMENT","DENOMINATION",null,{"$f":"dms_y1","v":"2020-21"},{"$f":"dms_y2","v":"2021-22"},{"$f":"dms_y3","v":"2022-23"},{"$f":"dms_y4","v":"2023-24"},{"$f":"dms_y5","v":"2024-25"},{"$f":"dms_y6","v":"2025-26"},{"$f":"dms_y7","v":"2026-27"}]
[null,"Abermain (110)","CONNECTION POINT RATING","MVA","Non-coincident",null,"TNSP NAME","DEMAND FORECASTING","NON-COINCIDENT MAXIMUM DEMAND","DESCRIPTOR METRIC","CONNECTION POINT RATING","CONNECTION POINT",{"$f":"B10","v":"Abermain (110)"},"RATING","MVA",null,238.2,238.2,238.2,238.2,238.2,238.2,238.2]
[null,null,null,null,"Coincident",null,"TNSP NAME","DEMAND FORECASTING","COINCIDENT MAXIMUM DEMAND","DESCRIPTOR METRIC","CONNECTION POINT RATING","CONNECTION POINT",{"$f":"M10","v":"Abermain (110)"},"RATING","MVA",null,238.2,238.2,238.2,238.2,238.2,238.2,238.2]
[null,null,"WINTER/SUMMER PEAKING",null,"Non-coincident",null,"TNSP NAME","DEMAND FORECASTING","NON-COINCIDENT MAXIMUM DEMAND","DESCRIPTOR METRIC","WINTER/SUMMER PEAKING","CONNECTION POINT",{"$f":"#REF!","v":{"$error":"#REF!"}},"WINTER/SUMMER","WINTER/SUMMER",null,"Summer","Summer","Summer","Summer","Summer","Summer","Summer"]
[null,null,null,null,"Coincident",null,"TNSP NAME","DEMAND FORECASTING","COINCIDENT MAXIMUM DEMAND","DESCRIPTOR METRIC","WINTER/SUMMER PEAKING","CONNECTION POINT",{"$f":"M12","v":{"$error":"#REF!"}},"WINTER/SUMMER","WINTER/SUMMER",null,"Summer","Summer","Summer","Summer","Summer","Summer","Summer"]
[null,null,"ADJUSTMENTS - EMBEDDED GENERATION","MW","Non-coincident",null,"TNSP NAME","DEMAND FORECASTING","NON-COINCIDENT MAXIMUM DEMAND","DESCRIPTOR METRIC","ADJUSTMENTS - EMBEDDED GENERATION","CONNECTION POINT",{"$error":"#REF!"},"GENERATED LOAD","MW",null,"-","-","-","-","-","-","-"]
[null,null,null,null,"Coincident",null,"TNSP NAME","DEMAND FORECASTING","COINCIDENT MAXIMUM DEMAND","DESCRIPTOR METRIC","ADJUSTMENTS - EMBEDDED GENERATION","CONNECTION POINT",{"$error":"#REF!"},"GENERATED LOAD","MW",null,"-","-","-","-","-","-","-"]
[null,null,"WEATHER CORRECTED MD 10% POE","MW","Non-coincident",null,"TNSP NAME","DEMAND FORECASTING","NON-COINCIDENT MAXIMUM DEMAND","DESCRIPTOR METRIC","WEATHER CORRECTED MD 10% POE","CONNECTION POINT",{"$error":"#REF!"},"MAXIMUM DEMAND","MW",null,78.3,78.599999999999994,79.099999999999994,79.3,79.400000000000006,82.1,82.3]
[null,null,null,null,"Coincident",null,"TNSP NAME","DEMAND FORECASTING","COINCIDENT MAXIMUM DEMAND","DESCRIPTOR METRIC","WEATHER CORRECTED MD 10% POE","CONNECTION POINT",{"$error":"#REF!"},"MAXIMUM DEMAND","MW",null,66.2,68.400000000000006,69.099999999999994,69.900000000000006,70.400000000000006,73.2,73.599999999999994]
[null,null,"WEATHER CORRECTED MD 10% POE","MVA","Non-coincident",null,"TNSP NAME","DEMAND FORECASTING","NON-COINCIDENT MAXIMUM DEMAND","DESCRIPTOR METRIC","WEATHER CORRECTED MD 10% POE","CONNECTION POINT",{"$error":"#REF!"},"MAXIMUM DEMAND","MVA",null,79.3,79.5,80.099999999999994,80.3,80.400000000000006,82.9,83.2]
[null,null,null,null,"Coincident",null,"TNSP NAME","DEMAND FORECASTING","COINCIDENT MAXIMUM DEMAND","DESCRIPTOR METRIC","WEATHER CORRECTED MD 10% POE","CONNECTION POINT",{"$error":"#REF!"},"MAXIMUM DEMAND","MVA",null,67.2,69.400000000000006,70.099999999999994,71,71.400000000000006,74.400000000000006,74.8]
[null,null,"WEATHER CORRECTED MD 50% POE","MW","Non-coincident",null,"TNSP NAME","DEMAND FORECASTING","NON-COINCIDENT MAXIMUM DEMAND","DESCRIPTOR METRIC","WEATHER CORRECTED MD 50% POE","CONNECTION POINT",{"$error":"#REF!"},"MAXIMUM DEMAND","MW",null,67.900000000000006,68.2,68.599999999999994,68.8,68.8,71.5,71.7]
[null,null,null,null,"Coincident",null,"TNSP NAME","DEMAND FORECASTING","COINCIDENT MAXIMUM DEMAND","DESCRIPTOR METRIC","WEATHER CORRECTED MD 50% POE","CONNECTION POINT",{"$error":"#REF!"},"MAXIMUM DEMAND","MW",null,63.1,65.099999999999994,65.8,66.599999999999994,67,69.8,70.099999999999994]
[null,null,"WEATHER CORRECTED MD 50% POE","MVA","Non-coincident",null,"TNSP NAME","DEMAND FORECASTING","NON-COINCIDENT MAXIMUM DEMAND","DESCRIPTOR METRIC","WEATHER CORRECTED MD 50% POE","CONNECTION POINT",{"$error":"#REF!"},"MAXIMUM DEMAND","MVA",null,68.900000000000006,69.099999999999994,69.5,69.7,69.8,72.599999999999994,72.8]
[null,null,null,null,"Coincident",null,"TNSP NAME","DEMAND FORECASTING","COINCIDENT MAXIMUM DEMAND","DESCRIPTOR METRIC","WEATHER CORRECTED MD 50% POE","CONNECTION POINT",{"$error":"#REF!"},"MAXIMUM DEMAND","MVA",null,63.9,66,66.7,67.5,67.900000000000006,70.8,71.099999999999994]
[null,"Abermain (33)","CONNECTION POINT RATING","MVA","Non-coincident",null,"TNSP NAME","DEMAND FORECASTING","NON-COINCIDENT MAXIMUM DEMAND","DESCRIPTOR METRIC","CONNECTION POINT RATING","CONNECTION POINT",{"$f":"B24","v":"Abermain (33)"},"RATING","MVA",null,277,277,277,277,277,277,277]
[null,null,null,null,"Coincident",null,"TNSP NAME","DEMAND FORECASTING","COINCIDENT MAXIMUM DEMAND","DESCRIPTOR METRIC","CONNECTION POINT RATING","CONNECTION POINT",{"$f":"M24","v":"Abermain (33)"},"RATING","MVA",null,277,277,277,277,277,277,277]
[null,null,"WINTER/SUMMER PEAKING",null,"Non-coincident",null,"TNSP NAME","DEMAND FORECASTING","NON-COINCIDENT MAXIMUM DEMAND","DESCRIPTOR METRIC","WINTER/SUMMER PEAKING","CONNECTION POINT",{"$f":"#REF!","v":{"$error":"#REF!"}},"WINTER/SUMMER","WINTER/SUMMER",null,"Summer","Summer","Summer","Summer","Summer","Summer","Summer"]
[null,null,null,null,"Coincident",null,"TNSP NAME","DEMAND FORECASTING","COINCIDENT MAXIMUM DEMAND","DESCRIPTOR METRIC","WINTER/SUMMER PEAKING","CONNECTION POINT",{"$f":"M26","v":{"$error":"#REF!"}},"WINTER/SUMMER","WINTER/SUMMER",null,"Summer","Summer","Summer","Summer","Summer","Summer","Summer"]
[null,null,"ADJUSTMENTS - EMBEDDED GENERATION","MW","Non-coincident",null,"TNSP NAME","DEMAND FORECASTING","NON-COINCIDENT MAXIMUM DEMAND","DESCRIPTOR METRIC","ADJUSTMENTS - EMBEDDED GENERATION","CONNECTION POINT",{"$error":"#REF!"},"GENERATED LOAD","MW",null,"-","-","-","-","-","-","-"]
[null,null,null,null,"Coincident",null,"TNSP NAME","DEMAND FORECASTING","COINCIDENT MAXIMUM DEMAND","DESCRIPTOR METRIC","ADJUSTMENTS - EMBEDDED GENERATION","CONNECTION POINT",{"$error":"#REF!"},"GENERATED LOAD","MW",null,"-","-","-","-","-","-","-"]
[null,null,"WEATHER CORRECTED MD 10% POE","MW","Non-coincident",null,"TNSP NAME","DEMAND FORECASTING","NON-COINCIDENT MAXIMUM DEMAND","DESCRIPTOR METRIC","WEATHER CORRECTED MD 10% POE","CONNECTION POINT",{"$error":"#REF!"},"MAXIMUM DEMAND","MW",null,123.5,128.19999999999999,132.69999999999999,134.4,134.6,135,135.30000000000001]
[null,null,null,null,"Coincident",null,"TNSP NAME","DEMAND FORECASTING","COINCIDENT MAXIMUM DEMAND","DESCRIPTOR METRIC","WEATHER CORRECTED MD 10% POE","CONNECTION POINT",{"$error":"#REF!"},"MAXIMUM DEMAND","MW",null,104.7,112.4,117,119.7,120.5,121.1,121.6]
[null,null,"WEATHER CORRECTED MD 10% POE","MVA","Non-coincident",null,"TNSP NAME","DEMAND FORECASTING","NON-COINCIDENT MAXIMUM DEMAND","DESCRIPTOR METRIC","WEATHER CORRECTED MD 10% POE","CONNECTION POINT",{"$error":"#REF!"},"MAXIMUM DEMAND","MVA",null,128.6,133.69999999999999,139,140.9,141.1,141.5,141.80000000000001]
[null,null,null,null,"Coincident",null,"TNSP NAME","DEMAND FORECASTING","COINCIDENT MAXIMUM DEMAND","DESCRIPTOR METRIC","WEATHER CORRECTED MD 10% POE","CONNECTION POINT",{"$error":"#REF!"},"MAXIMUM DEMAND","MVA",null,110.2,118.5,123.3,126.3,127.1,127.8,128.19999999999999]
[null,null,"WEATHER CORRECTED MD 50% POE","MW","Non-coincident",null,"TNSP NAME","DEMAND FORECASTING","NON-COINCIDENT MAXIMUM DEMAND","DESCRIPTOR METRIC","WEATHER CORRECTED MD 50% POE","CONNECTION POINT",{"$error":"#REF!"},"MAXIMUM DEMAND","MW",null,107.4,112,116.2,117.8,117.9,118.3,118.5]
[null,null,null,null,"Coincident",null,"TNSP NAME","DEMAND FORECASTING","COINCIDENT MAXIMUM DEMAND","DESCRIPTOR METRIC","WEATHER CORRECTED MD 50% POE","CONNECTION POINT",{"$error":"#REF!"},"MAXIMUM DEMAND","MW",null,99.7,107,111.5,114,114.8,115.4,115.8]
[null,null,"WEATHER CORRECTED MD 50% POE","MVA","Non-coincident",null,"TNSP NAME","DEMAND FORECASTING","NON-COINCIDENT MAXIMUM DEMAND","DESCRIPTOR METRIC","WEATHER CORRECTED MD 50% POE","CONNECTION POINT",{"$error":"#REF!"},"MAXIMUM DEMAND","MVA",null,112.6,117.6,121.9,123.7,123.8,124.2,124.4]
[null,null,null,null,"Coincident",null,"TNSP NAME","DEMAND FORECASTING","COINCIDENT MAXIMUM DEMAND","DESCRIPTOR METRIC","WEATHER CORRECTED MD 50% POE","CONNECTION POINT",{"$error":"#REF!"},"MAXIMUM DEMAND","MVA",null,104.5,112.4,116.9,119.8,120.6,121.2,121.6]
[null,"Alan Sherriff","CONNECTION POINT RATING","MVA","Non-coincident",null,null,null,null,null,null,null,null,null,null,null,457.3,457.3,457.3,457.3,457.3,457.3,457.3]
[null,null,null,null,"Coincident",null,null,null,null,null,null,null,null,null,null,null,457.3,457.3,457.3,457.3,457.3,457.3,457.3]
[null,null,"WINTER/SUMMER PEAKING",null,"Non-coincident",null,null,null,null,null,null,null,null,null,null,null,"Summer","Summer","Summer","Summer","Summer","Summer","Summer"]
[null,null,null,null,"Coincident",null,null,null,null,null,null,null,null,null,null,null,"Summer","Summer","Summer","Summer","Summer","Summer","Summer"]
[null,null,"ADJUSTMENTS - EMBEDDED GENERATION","MW","Non-coincident",null,null,null,null,null,null,null,null,null,null,null,"-","-","-","-","-","-","-"]
[null,null,null,null,"Coincident",null,null,null,null,null,null,null,null,null,null,null,"-","-","-","-","-","-","-"]
[null,null,"WEATHER CORRECTED MD 10% POE","MW","Non-coincident",null,null,null,null,null,null,null,null,null,null,null,29.4,29.3,29.2,29.2,29.3,29.5,29.8]
[null,null,null,null,"Coincident",null,null,null,null,null,null,null,null,null,null,null,23.2,23.8,23.8,24.1,24.2,24.4,24.7]
[null,null,"WEATHER CORRECTED MD 10% POE","MVA","Non-coincident",null,null,null,null,null,null,null,null,null,null,null,30.6,30.5,30.5,30.5,30.5,30.7,31]
[null,null,null,null,"Coincident",null,null,null,null,null,null,null,null,null,null,null,24.2,24.9,24.9,25.2,25.3,25.6,25.8]
[null,null,"WEATHER CORRECTED MD 50% POE","MW","Non-coincident",null,null,null,null,null,null,null,null,null,null,null,24.8,24.7,24.6,24.6,24.7,24.8,25.1]
[null,null,null,null,"Coincident",null,null,null,null,null,null,null,null,null,null,null,22.1,22.6,22.7,22.9,23,23.3,23.5]
[null,null,"WEATHER CORRECTED MD 50% POE","MVA","Non-coincident",null,null,null,null,null,null,null,null,null,null,null,25.8,25.7,25.7,25.7,25.7,25.9,26.2]
[null,null,null,null,"Coincident",null,null,null,null,null,null,null,null,null,null,null,23,23.6,23.7,23.9,24,24.3,24.5]
[null,"Algester","CONNECTION POINT RATING","MVA","Non-coincident",null,null,null,null,null,null,null,null,null,null,null,202,202,202,202,202,202,202]
[null,null,null,null,"Coincident",null,null,null,null,null,null,null,null,null,null,null,202,202,202,202,202,202,202]
[null,null,"WINTER/SUMMER PEAKING",null,"Non-coincident",null,null,null,null,null,null,null,null,null,null,null,"Summer","Summer","Summer","Summer","Summer","Summer","Summer"]
[null,null,null,null,"Coincident",null,null,null,null,null,null,null,null,null,null,null,"Summer","Summer","Summer","Summer","Summer","Summer","Summer"]
[null,null,"ADJUSTMENTS - EMBEDDED GENERATION","MW","Non-coincident",null,null,null,null,null,null,null,null,null,null,null,"-","-","-","-","-","-","-"]
[null,null,null,null,"Coincident",null,null,null,null,null,null,null,null,null,null,null,"-","-","-","-","-","-","-"]
[null,null,"WEATHER CORRECTED MD 10% POE","MW","Non-coincident",null,null,null,null,null,null,null,null,null,null,null,79.599999999999994,78.900000000000006,78.599999999999994,78.2,77.599999999999994,77.3,77]
[null,null,null,null,"Coincident",null,null,null,null,null,null,null,null,null,null,null,68.7,70.099999999999994,70.099999999999994,70.400000000000006,70.3,70.099999999999994,69.900000000000006]
[null,null,"WEATHER CORRECTED MD 10% POE","MVA","Non-coincident",null,null,null,null,null,null,null,null,null,null,null,81.400000000000006,80.7,80.400000000000006,80,80.599999999999994,80.2,79.900000000000006]
[null,null,null,null,"Coincident",null,null,null,null,null,null,null,null,null,null,null,71.7,73.099999999999994,73.099999999999994,73.5,73.3,73.099999999999994,72.900000000000006]
[null,null,"WEATHER CORRECTED MD 50% POE","MW","Non-coincident",null,null,null,null,null,null,null,null,null,null,null,70.5,69.8,69.599999999999994,69.3,68.7,68.5,68.2]
[null,null,null,null,"Coincident",null,null,null,null,null,null,null,null,null,null,null,65.400000000000006,66.7,66.7,67.099999999999994,66.900000000000006,66.8,66.599999999999994]
[null,null,"WEATHER CORRECTED MD 50% POE","MVA","Non-coincident",null,null,null,null,null,null,null,null,null,null,null,73.3,72.599999999999994,72.3,72,71.5,71.2,70.900000000000006]
[null,null,null,null,"Coincident",null,null,null,null,null,null,null,null,null,null,null,68,69.400000000000006,69.400000000000006,69.7,69.599999999999994,69.400000000000006,69.2]
[null,"Alligator Creek (132)","CONNECTION POINT RATING","MVA","Non-coincident",null,null,null,null,null,null,null,null,null,null,null,280.10000000000002,280.10000000000002,280.10000000000002,280.10000000000002,280.10000000000002,280.10000000000002,280.10000000000002]
[null,null,null,null,"Coincident",null,null,null,null,null,null,null,null,null,null,null,280.10000000000002,280.10000000000002,280.10000000000002,280.10000000000002,280.10000000000002,280.10000000000002,280.10000000000002]
[null,null,"WINTER/SUMMER PEAKING",null,"Non-coincident",null,null,null,null,null,null,null,null,null,null,null,"Summer","Summer","Summer","Summer","Summer","Summer","Summer"]
[null,null,null,null,"Coincident",null,null,null,null,null,null,null,null,null,null,null,"Summer","Summer","Summer","Summer","Summer","Summer","Summer"]
[null,null,"ADJUSTMENTS - EMBEDDED GENERATION","MW","Non-coincident",null,null,null,null,null,null,null,null,null,null,null,"-","-","-","-","-","-","-"]
[null,null,null,null,"Coincident",null,null,null,null,null,null,null,null,null,null,null,"-","-","-","-","-","-","-"]
[null,null,"WEATHER CORRECTED MD 10% POE","MW","Non-coincident",null,null,null,null,null,null,null,null,null,null,null,46.4,46.5,46.5,46.7,46.8,47,47.1]
[null,null,null,null,"Coincident",null,null,null,null,null,null,null,null,null,null,null,23.9,24.6,24.7,25.1,25.3,25.4,25.5]
[null,null,"WEATHER CORRECTED MD 10% POE","MVA","Non-coincident",null,null,null,null,null,null,null,null,null,null,null,47.9,47.9,48,48.2,48.3,48.4,48.6]
[null,null,null,null,"Coincident",null,null,null,null,null,null,null,null,null,null,null,24.7,25.5,25.6,26,26.2,26.3,26.4]
[null,null,"WEATHER CORRECTED MD 50% POE","MW","Non-coincident",null,null,null,null,null,null,null,null,null,null,null,45.2,45.3,45.3,45.5,45.6,45.7,45.8]
[null,null,null,null,"Coincident",null,null,null,null,null,null,null,null,null,null,null,22.7,23.4,23.5,23.9,24.1,24.2,24.3]
[null,null,"WEATHER CORRECTED MD 50% POE","MVA","Non-coincident",null,null,null,null,null,null,null,null,null,null,null,46.6,46.7,46.7,46.9,47,47.2,47.3]
[null,null,null,null,"Coincident",null,null,null,null,null,null,null,null,null,null,null,23.5,24.2,24.3,24.7,24.8,25,25.1]
[null,"Alligator Creek (33)","CONNECTION POINT RATING","MVA","Non-coincident",null,null,null,null,null,null,null,null,null,null,null,250.8,250.8,250.8,250.8,250.8,250.8,250.8]
[null,null,null,null,"Coincident",null,null,null,null,null,null,null,null,null,null,null,250.8,250.8,250.8,250.8,250.8,250.8,250.8]
[null,null,"WINTER/SUMMER PEAKING",null,"Non-coincident",null,null,null,null,null,null,null,null,null,null,null,"Summer","Summer","Summer","Summer","Summer","Summer","Summer"]
[null,null,null,null,"Coincident",null,null,null,null,null,null,null,null,null,null,null,"Summer","Summer","Summer","Summer","Summer","Summer","Summer"]
[null,null,"ADJUSTMENTS - EMBEDDED GENERATION","MW","Non-coincident",null,null,null,null,null,null,null,null,null,null,null,"-","-","-","-","-","-","-"]
[null,null,null,null,"Coincident",null,null,null,null,null,null,null,null,null,null,null,"-","-","-","-","-","-","-"]
[null,null,"WEATHER CORRECTED MD 10% POE","MW","Non-coincident",null,null,null,null,null,null,null,null,null,null,null,45.2,45.4,45.6,45.9,46.1,46.5,46.9]
[null,null,null,null,"Coincident",null,null,null,null,null,null,null,null,null,null,null,38.9,40.200000000000003,40.5,41.2,41.6,42,42.5]
[null,null,"WEATHER CORRECTED MD 10% POE","MVA","Non-coincident",null,null,null,null,null,null,null,null,null,null,null,45.7,45.8,46,46.3,46.5,46.9,47.4]
[null,null,null,null,"Coincident",null,null,null,null,null,null,null,null,null,null,null,39.799999999999997,41.1,41.4,42.1,42.5,42.9,43.4]
[null,null,"WEATHER CORRECTED MD 50% POE","MW","Non-coincident",null,null,null,null,null,null,null,null,null,null,null,41.4,41.6,41.8,42,42.2,42.6,43]
[null,null,null,null,"Coincident",null,null,null,null,null,null,null,null,null,null,null,37.1,38.299999999999997,38.6,39.200000000000003,39.6,40,40.5]
[null,null,"WEATHER CORRECTED MD 50% POE","MVA","Non-coincident",null,null,null,null,null,null,null,null,null,null,null,41.8,41.9,42.2,42.4,42.6,43,43.4]
[null,null,null,null,"Coincident",null,null,null,null,null,null,null,null,null,null,null,37.9,39.1,39.4,40,40.5,40.9,41.3]
[null,"Alligator Creek (Rail 132)","CONNECTION POINT RATING","MVA","Non-coincident",null,null,null,null,null,null,null,null,null,null,null,"-","-","-","-","-","-","-"]
[null,null,null,null,"Coincident",null,null,null,null,null,null,null,null,null,null,null,"-","-","-","-","-","-","-"]
[null,null,"WINTER/SUMMER PEAKING",null,"Non-coincident",null,null,null,null,null,null,null,null,null,null,null,"Summer","Summer","Summer","Summer","Summer","Summer","Summer"]
[null,null,null,null,"Coincident",null,null,null,null,null,null,null,null,null,null,null,"Summer","Summer","Summer","Summer","Summer","Summer","Summer"]
[null,null,"ADJUSTMENTS - EMBEDDED GENERATION","MW","Non-coincident",null,null,null,null,null,null,null,null,null,null,null,"-","-","-","-","-","-","-"]
[null,null,null,null,"Coincident",null,null,null,null,null,null,null,null,null,null,null,"-","-","-","-","-","-","-"]
[null,null,"WEATHER CORRECTED MD 10% POE","MW","Non-coincident"]
[null,null,null,null,"Coincident"]
[null,null,"WEATHER CORRECTED MD 10% POE","MVA","Non-coincident"]
[null,null,null,null,"Coincident"]
[null,null,"WEATHER CORRECTED MD 50% POE","MW","Non-coincident"]
[null,null,null,null,"Coincident"]
[null,null,"WEATHER CORRECTED MD 50% POE","MVA","Non-coincident"]
[null,null,null,null,"Coincident"]
[null,"Ashgrove West (110)","CONNECTION POINT RATING","MVA","Non-coincident",null,null,null,null,null,null,null,null,null,null,null,457.3,457.3,457.3,457.3,457.3,457.3,457.3]
[null,null,null,null,"Coincident",null,null,null,null,null,null,null,null,null,null,null,457.3,457.3,457.3,457.3,457.3,457.3,457.3]
[null,null,"WINTER/SUMMER PEAKING",null,"Non-coincident",null,null,null,null,null,null,null,null,null,null,null,"Summer","Summer","Summer","Summer","Summer","Summer","Summer"]
[null,null,null,null,"Coincident",null,null,null,null,null,null,null,null,null,null,null,"Summer","Summer","Summer","Summer","Summer","Summer","Summer"]
[null,null,"ADJUSTMENTS - EMBEDDED GENERATION","MW","Non-coincident",null,null,null,null,null,null,null,null,null,null,null,"-","-","-","-","-","-","-"]
[null,null,null,null,"Coincident",null,null,null,null,null,null,null,null,null,null,null,"-","-","-","-","-","-","-"]
[null,null,"WEATHER CORRECTED MD 10% POE","MW","Non-coincident",null,null,null,null,null,null,null,null,null,null,null,132.9,134.4,139.69999999999999,142.80000000000001,143.9,143.69999999999999,143.4]
[null,null,null,null,"Coincident",null,null,null,null,null,null,null,null,null,null,null,121.4,126.5,132.19999999999999,136.69999999999999,138.6,138.6,138.6]
[null,null,"WEATHER CORRECTED MD 10% POE","MVA","Non-coincident",null,null,null,null,null,null,null,null,null,null,null,135.6,137.19999999999999,142.80000000000001,146.30000000000001,147.6,147.30000000000001,147]
[null,null,null,null,"Coincident",null,null,null,null,null,null,null,null,null,null,null,124.1,129.4,135.5,140.4,142.5,142.5,142.5]
[null,null,"WEATHER CORRECTED MD 50% POE","MW","Non-coincident",null,null,null,null,null,null,null,null,null,null,null,124.5,126.1,131.30000000000001,134.4,135.6,135.30000000000001,135.1]
[null,null,null,null,"Coincident",null,null,null,null,null,null,null,null,null,null,null,115.6,120.5,125.9,130.19999999999999,132,132,132]
[null,null,"WEATHER CORRECTED MD 50% POE","MVA","Non-coincident",null,null,null,null,null,null,null,null,null,null,null,127,128.69999999999999,134.30000000000001,137.69999999999999,139,138.80000000000001,138.6]
[null,null,null,null,"Coincident",null,null,null,null,null,null,null,null,null,null,null,117.9,123,128.80000000000001,133.4,135.4,135.4,135.4]
[null,"Ashgrove West (33)","CONNECTION POINT RATING","MVA","Non-coincident",null,null,null,null,null,null,null,null,null,null,null,179.1,179.1,179.1,179.1,179.1,179.1,179.1]
[null,null,null,null,"Coincident",null,null,null,null,null,null,null,null,null,null,null,179.1,179.1,179.1,179.1,179.1,179.1,179.1]
[null,null,"WINTER/SUMMER PEAKING",null,"Non-coincident",null,null,null,null,null,null,null,null,null,null,null,"Summer","Summer","Summer","Summer","Summer","Summer","Summer"]
[null,null,null,null,"Coincident",null,null,null,null,null,null,null,null,null,null,null,"Summer","Summer","Summer","Summer","Summer","Summer","Summer"]
[null,null,"ADJUSTMENTS - EMBEDDED GENERATION","MW","Non-coincident",null,null,null,null,null,null,null,null,null,null,null,"-","-","-","-","-","-","-"]
[null,null,null,null,"Coincident",null,null,null,null,null,null,null,null,null,null,null,"-","-","-","-","-","-","-"]
[null,null,"WEATHER CORRECTED MD 10% POE","MW","Non-coincident",null,null,null,null,null,null,null,null,null,null,null,81.2,80.900000000000006,80.900000000000006,80.8,80.400000000000006,80.2,80.099999999999994]
[null,null,null,null,"Coincident",null,null,null,null,null,null,null,null,null,null,null,66.7,68.400000000000006,68.7,69.2,69.3,69.3,69.2]
[null,null,"WEATHER CORRECTED MD 10% POE","MVA","Non-coincident",null,null,null,null,null,null,null,null,null,null,null,81.5,81.2,81.2,81,80.7,80.5,80.400000000000006]
[null,null,null,null,"Coincident",null,null,null,null,null,null,null,null,null,null,null,66.900000000000006,68.599999999999994,68.900000000000006,69.400000000000006,69.5,69.5,69.400000000000006]
[null,null,"WEATHER CORRECTED MD 50% POE","MW","Non-coincident",null,null,null,null,null,null,null,null,null,null,null,68.400000000000006,68.2,68.2,68.099999999999994,67.7,67.599999999999994,67.5]
[null,null,null,null,"Coincident",null,null,null,null,null,null,null,null,null,null,null,63.5,65.2,65.400000000000006,65.900000000000006,66,66,65.900000000000006]
[null,null,"WEATHER CORRECTED MD 50% POE","MVA","Non-coincident",null,null,null,null,null,null,null,null,null,null,null,68.599999999999994,68.400000000000006,68.400000000000006,68.3,67.900000000000006,67.8,67.7]
[null,null,null,null,"Coincident",null,null,null,null,null,null,null,null,null,null,null,63.7,65.400000000000006,65.599999999999994,66.099999999999994,66.099999999999994,66.2,66.099999999999994]
[null,"Belmont (110)","CONNECTION POINT RATING","MVA","Non-coincident",null,null,null,null,null,null,null,null,null,null,null,1622,1622,1622,1622,1622,1622,1622]
[null,null,null,null,"Coincident",null,null,null,null,null,null,null,null,null,null,null,1622,1622,1622,1622,1622,1622,1622]
[null,null,"WINTER/SUMMER PEAKING",null,"Non-coincident",null,null,null,null,null,null,null,null,null,null,null,"Summer","Summer","Summer","Summer","Summer","Summer","Summer"]
[null,null,null,null,"Coincident",null,null,null,null,null,null,null,null,null,null,null,"Summer","Summer","Summer","Summer","Summer","Summer","Summer"]
[null,null,"ADJUSTMENTS - EMBEDDED GENERATION","MW","Non-coincident",null,null,null,null,null,null,null,null,null,null,null,1.8,1.8,1.8,1.8,1.8,1.8,1.8]
[null,null,null,null,"Coincident",null,null,null,null,null,null,null,null,null,null,null,"-","-","-","-","-","-","-"]
[null,null,"WEATHER CORRECTED MD 10% POE","MW","Non-coincident",null,null,null,null,null,null,null,null,null,null,null,497.3,506.6,509.7,510.1,509.6,509.4,509.3]
[null,null,null,null,"Coincident",null,null,null,null,null,null,null,null,null,null,null,441.6,464,468.6,473.5,475.5,476.3,476.8]
[null,null,"WEATHER CORRECTED MD 10% POE","MVA","Non-coincident",null,null,null,null,null,null,null,null,null,null,null,509.8,519.9,523.20000000000005,523.6,523,522.9,522.70000000000005]
[null,null,null,null,"Coincident",null,null,null,null,null,null,null,null,null,null,null,453.8,477.4,482.3,487.3,489.3,490.2,490.7]
[null,null,"WEATHER CORRECTED MD 50% POE","MW","Non-coincident",null,null,null,null,null,null,null,null,null,null,null,452.9,462.3,465.2,465.6,465.1,465,464.8]
[null,null,null,null,"Coincident",null,null,null,null,null,null,null,null,null,null,null,420.6,441.9,446.3,450.9,452.8,453.7,454.1]
[null,null,"WEATHER CORRECTED MD 50% POE","MVA","Non-coincident",null,null,null,null,null,null,null,null,null,null,null,464.4,474.6,477.7,478.1,477.6,477.4,477.3]
[null,null,null,null,"Coincident",null,null,null,null,null,null,null,null,null,null,null,431.2,453.6,458.2,463,465,465.8,466.3]
[null,"Belmont (33)","CONNECTION POINT RATING","MVA","Non-coincident",null,null,null,null,null,null,null,null,null,null,null,307,307,307,307,307,307,307]
[null,null,null,null,"Coincident",null,null,null,null,null,null,null,null,null,null,null,307,307,307,307,307,307,307]
[null,null,"WINTER/SUMMER PEAKING",null,"Non-coincident",null,null,null,null,null,null,null,null,null,null,null,"Summer","Summer","Summer","Summer","Summer","Summer","Summer"]
[null,null,null,null,"Coincident",null,null,null,null,null,null,null,null,null,null,null,"Summer","Summer","Summer","Summer","Summer","Summer","Summer"]
[null,null,"ADJUSTMENTS - EMBEDDED GENERATION","MW","Non-coincident",null,null,null,null,null,null,null,null,null,null,null,"-","-","-","-","-","-","-"]
[null,null,null,null,"Coincident",null,null,null,null,null,null,null,null,null,null,null,"-","-","-","-","-","-","-"]
[null,null,"WEATHER CORRECTED MD 10% POE","MW","Non-coincident",null,null,null,null,null,null,null,null,null,null,null,132.6,132.30000000000001,132.30000000000001,132.1,131.4,131.4,131.4]
[null,null,null,null,"Coincident",null,null,null,null,null,null,null,null,null,null,null,115.2,118.3,118.8,119.7,119.7,119.9,120.1]
[null,null,"WEATHER CORRECTED MD 10% POE","MVA","Non-coincident",null,null,null,null,null,null,null,null,null,null,null,134.4,134.1,134.1,133.9,134.19999999999999,134.19999999999999,134.1]
[null,null,null,null,"Coincident",null,null,null,null,null,null,null,null,null,null,null,117.7,120.9,121.4,122.3,122.3,122.6,122.7]
[null,null,"WEATHER CORRECTED MD 50% POE","MW","Non-coincident",null,null,null,null,null,null,null,null,null,null,null,118.1,117.9,117.9,117.7,117.1,117.1,117]
[null,null,null,null,"Coincident",null,null,null,null,null,null,null,null,null,null,null,109.7,112.7,113.1,114,114,114.2,114.4]
[null,null,"WEATHER CORRECTED MD 50% POE","MVA","Non-coincident",null,null,null,null,null,null,null,null,null,null,null,120.5,120.2,120.3,120.1,119.4,119.4,119.4]
[null,null,null,null,"Coincident",null,null,null,null,null,null,null,null,null,null,null,111.9,114.9,115.4,116.3,116.3,116.5,116.7]
[null,"Biloela","CONNECTION POINT RATING","MVA","Non-coincident",null,null,null,null,null,null,null,null,null,null,null,200,200,200,200,200,200,200]
[null,null,null,null,"Coincident",null,null,null,null,null,null,null,null,null,null,null,200,200,200,200,200,200,200]
[null,null,"WINTER/SUMMER PEAKING",null,"Non-coincident",null,null,null,null,null,null,null,null,null,null,null,"Summer","Summer","Summer","Summer","Summer","Summer","Summer"]
[null,null,null,null,"Coincident",null,null,null,null,null,null,null,null,null,null,null,"Summer","Summer","Summer","Summer","Summer","Summer","Summer"]
[null,null,"ADJUSTMENTS - EMBEDDED GENERATION","MW","Non-coincident",null,null,null,null,null,null,null,null,null,null,null,"-","-","-","-","-","-","-"]
[null,null,null,null,"Coincident",null,null,null,null,null,null,null,null,null,null,null,"-","-","-","-","-","-","-"]
[null,null,"WEATHER CORRECTED MD 10% POE","MW","Non-coincident",null,null,null,null,null,null,null,null,null,null,null,35.4,35.299999999999997,35.299999999999997,35.299999999999997,35.299999999999997,35.299999999999997,35.4]
[null,null,null,null,"Coincident",null,null,null,null,null,null,null,null,null,null,null,26.2,26.8,26.9,27.1,27.2,27.3,27.4]
[null,null,"WEATHER CORRECTED MD 10% POE","MVA","Non-coincident",null,null,null,null,null,null,null,null,null,null,null,35.6,35.5,35.5,35.5,35.5,35.6,35.700000000000003]
[null,null,null,null,"Coincident",null,null,null,null,null,null,null,null,null,null,null,26.2,26.9,26.9,27.2,27.3,27.4,27.5]
[null,null,"WEATHER CORRECTED MD 50% POE","MW","Non-coincident",null,null,null,null,null,null,null,null,null,null,null,32.700000000000003,32.700000000000003,32.6,32.6,32.6,32.700000000000003,32.799999999999997]
[null,null,null,null,"Coincident",null,null,null,null,null,null,null,null,null,null,null,24.9,25.5,25.6,25.8,25.9,26,26.1]
[null,null,"WEATHER CORRECTED MD 50% POE","MVA","Non-coincident",null,null,null,null,null,null,null,null,null,null,null,32.9,32.799999999999997,32.799999999999997,32.799999999999997,32.799999999999997,32.9,33]
[null,null,null,null,"Coincident",null,null,null,null,null,null,null,null,null,null,null,25,25.6,25.6,25.9,26,26.1,26.2]
[null,"Blackstone","CONNECTION POINT RATING","MVA","Non-coincident",null,null,null,null,null,null,null,null,null,null,null,800.2,800.2,800.2,800.2,800.2,800.2,800.2]
[null,null,null,null,"Coincident",null,null,null,null,null,null,null,null,null,null,null,800.2,800.2,800.2,800.2,800.2,800.2,800.2]
[null,null,"WINTER/SUMMER PEAKING",null,"Non-coincident",null,null,null,null,null,null,null,null,null,null,null,"Summer","Summer","Summer","Summer","Summer","Summer","Summer"]
[null,null,null,null,"Coincident",null,null,null,null,null,null,null,null,null,null,null,"Summer","Summer","Summer","Summer","Summer","Summer","Summer"]
[null,null,"ADJUSTMENTS - EMBEDDED GENERATION","MW","Non-coincident",null,null,null,null,null,null,null,null,null,null,null,"-","-","-","-","-","-","-"]
[null,null,null,null,"Coincident",null,null,null,null,null,null,null,null,null,null,null,"-","-","-","-","-","-","-"]
[null,null,"WEATHER CORRECTED MD 10% POE","MW","Non-coincident",null,null,null,null,null,null,null,null,null,null,null,119.4,121.5,123.1,124.3,125.3,127.1,128.1]
[null,null,null,null,"Coincident",null,null,null,null,null,null,null,null,null,null,null,99.5,104.4,106,108.1,109.5,111.3,112.3]
[null,null,"WEATHER CORRECTED MD 10% POE","MVA","Non-coincident",null,null,null,null,null,null,null,null,null,null,null,120.2,122.4,123.9,125.2,126.2,128,129]
[null,null,null,null,"Coincident",null,null,null,null,null,null,null,null,null,null,null,101.1,106.1,107.7,109.8,111.2,113.1,114.1]
[null,null,"WEATHER CORRECTED MD 50% POE","MW","Non-coincident",null,null,null,null,null,null,null,null,null,null,null,102,104,105.2,106.3,107.1,108.7,109.5]
[null,null,null,null,"Coincident",null,null,null,null,null,null,null,null,null,null,null,94.7,99.4,100.9,102.9,104.3,106,107]
[null,null,"WEATHER CORRECTED MD 50% POE","MVA","Non-coincident",null,null,null,null,null,null,null,null,null,null,null,103.5,105.5,106.8,107.9,108.6,110.2,111]
[null,null,null,null,"Coincident",null,null,null,null,null,null,null,null,null,null,null,96.1,100.9,102.4,104.4,105.8,107.5,108.5]
[null,"Blackwater (66/11)","CONNECTION POINT RATING","MVA","Non-coincident",null,null,null,null,null,null,null,null,null,null,null,331.6,331.6,320,320,320,320,320]
[null,null,null,null,"Coincident",null,null,null,null,null,null,null,null,null,null,null,331.6,331.6,320,320,320,320,320]
[null,null,"WINTER/SUMMER PEAKING",null,"Non-coincident",null,null,null,null,null,null,null,null,null,null,null,"Summer","Summer","Summer","Summer","Summer","Summer","Summer"]
[null,null,null,null,"Coincident",null,null,null,null,null,null,null,null,null,null,null,"Summer","Summer","Summer","Summer","Summer","Summer","Summer"]
[null,null,"ADJUSTMENTS - EMBEDDED GENERATION","MW","Non-coincident",null,null,null,null,null,null,null,null,null,null,null,"-","-","-","-","-","-","-"]
[null,null,null,null,"Coincident",null,null,null,null,null,null,null,null,null,null,null,"-","-","-","-","-","-","-"]
[null,null,"WEATHER CORRECTED MD 10% POE","MW","Non-coincident",null,null,null,null,null,null,null,null,null,null,null,101.2,101.1,101.2,101.5,101.5,105.9,110.3]
[null,null,null,null,"Coincident",null,null,null,null,null,null,null,null,null,null,null,93.1,95.8,96.1,97.4,97.9,101.5,105]
[null,null,"WEATHER CORRECTED MD 10% POE","MVA","Non-coincident",null,null,null,null,null,null,null,null,null,null,null,103.1,103.1,103.1,103.4,103.4,107.9,112.3]
[null,null,null,null,"Coincident",null,null,null,null,null,null,null,null,null,null,null,95,97.8,98.1,99.4,100,103.5,107]
[null,null,"WEATHER CORRECTED MD 50% POE","MW","Non-coincident",null,null,null,null,null,null,null,null,null,null,null,97.5,97.5,97.5,97.8,97.9,101.2,104.5]
[null,null,null,null,"Coincident",null,null,null,null,null,null,null,null,null,null,null,88.6,91.2,91.6,92.7,93.3,96.7,100]
[null,null,"WEATHER CORRECTED MD 50% POE","MVA","Non-coincident",null,null,null,null,null,null,null,null,null,null,null,99.4,99.4,99.4,99.7,99.7,103.1,106.4]
[null,null,null,null,"Coincident",null,null,null,null,null,null,null,null,null,null,null,90.3,93,93.3,94.5,95,98.5,101.8]
[null,"Blackwater (Rail 132)","CONNECTION POINT RATING","MVA","Non-coincident",null,null,null,null,null,null,null,null,null,null,null,480.1,480.1,480.1,480.1,480.1,480.1,480.1]
[null,null,null,null,"Coincident",null,null,null,null,null,null,null,null,null,null,null,480.1,480.1,480.1,480.1,480.1,480.1,480.1]
[null,null,"WINTER/SUMMER PEAKING",null,"Non-coincident",null,null,null,null,null,null,null,null,null,null,null,"Summer","Summer","Summer","Summer","Summer","Summer","Summer"]
[null,null,null,null,"Coincident",null,null,null,null,null,null,null,null,null,null,null,"Summer","Summer","Summer","Summer","Summer","Summer","Summer"]
[null,null,"ADJUSTMENTS - EMBEDDED GENERATION","MW","Non-coincident",null,null,null,null,null,null,null,null,null,null,null,"-","-","-","-","-","-","-"]
[null,null,null,null,"Coincident",null,null,null,null,null,null,null,null,null,null,null,"-","-","-","-","-","-","-"]
[null,null,"WEATHER CORRECTED MD 10% POE","MW","Non-coincident"]
[null,null,null,null,"Coincident"]
[null,null,"WEATHER CORRECTED MD 10% POE","MVA","Non-coincident"]
[null,null,null,null,"Coincident"]
[null,null,"WEATHER CORRECTED MD 50% POE","MW","Non-coincident"]
[null,null,null,null,"Coincident"]
[null,null,"WEATHER CORRECTED MD 50% POE","MVA","Non-coincident"]
[null,null,null,null,"Coincident"]
[null,"Blackwater (Rolleston 132)","CONNECTION POINT RATING","MVA","Non-coincident",null,null,null,null,null,null,null,null,null,null,null,182.9,182.9,182.9,182.9,182.9,182.9,182.9]
[null,null,null,null,"Coincident",null,null,null,null,null,null,null,null,null,null,null,182.9,182.9,182.9,182.9,182.9,182.9,182.9]
[null,null,"WINTER/SUMMER PEAKING",null,"Non-coincident",null,null,null,null,null,null,null,null,null,null,null,"Summer","Summer","Summer","Summer","Summer","Summer","Summer"]
[null,null,null,null,"Coincident",null,null,null,null,null,null,null,null,null,null,null,"Summer","Summer","Summer","Summer","Summer","Summer","Summer"]
[null,null,"ADJUSTMENTS - EMBEDDED GENERATION","MW","Non-coincident",null,null,null,null,null,null,null,null,null,null,null,"-","-","-","-","-","-","-"]
[null,null,null,null,"Coincident",null,null,null,null,null,null,null,null,null,null,null,"-","-","-","-","-","-","-"]
[null,null,"WEATHER CORRECTED MD 10% POE","MW","Non-coincident",null,null,null,null,null,null,null,null,null,null,null,21.1,21.1,21.1,21.2,21.2,21.3,21.3]
[null,null,null,null,"Coincident",null,null,null,null,null,null,null,null,null,null,null,19.2,19.8,19.899999999999999,20.100000000000001,20.3,20.399999999999999,20.399999999999999]
[null,null,"WEATHER CORRECTED MD 10% POE","MVA","Non-coincident",null,null,null,null,null,null,null,null,null,null,null,21.3,21.3,21.3,21.4,21.4,21.5,21.5]
[null,null,null,null,"Coincident",null,null,null,null,null,null,null,null,null,null,null,19.399999999999999,20,20.100000000000001,20.399999999999999,20.5,20.6,20.7]
[null,null,"WEATHER CORRECTED MD 50% POE","MW","Non-coincident",null,null,null,null,null,null,null,null,null,null,null,20.100000000000001,20.100000000000001,20.2,20.2,20.3,20.3,20.399999999999999]
[null,null,null,null,"Coincident",null,null,null,null,null,null,null,null,null,null,null,18.3,18.8,18.899999999999999,19.2,19.3,19.399999999999999,19.5]
[null,null,"WEATHER CORRECTED MD 50% POE","MVA","Non-coincident",null,null,null,null,null,null,null,null,null,null,null,20.399999999999999,20.399999999999999,20.399999999999999,20.399999999999999,20.5,20.5,20.6]
[null,null,null,null,"Coincident",null,null,null,null,null,null,null,null,null,null,null,18.5,19.100000000000001,19.100000000000001,19.399999999999999,19.5,19.600000000000001,19.7]
[null,"Bluff (Rail)","CONNECTION POINT RATING","MVA","Non-coincident",null,null,null,null,null,null,null,null,null,null,null,0,0,0,0,0,0,0]
[null,null,null,null,"Coincident",null,null,null,null,null,null,null,null,null,null,null,0,0,0,0,0,0,0]
[null,null,"WINTER/SUMMER PEAKING",null,"Non-coincident",null,null,null,null,null,null,null,null,null,null,null,"Summer","Summer","Summer","Summer","Summer","Summer","Summer"]
[null,null,null,null,"Coincident",null,null,null,null,null,null,null,null,null,null,null,"Summer","Summer","Summer","Summer","Summer","Summer","Summer"]
[null,null,"ADJUSTMENTS - EMBEDDED GENERATION","MW","Non-coincident",null,null,null,null,null,null,null,null,null,null,null,"-","-","-","-","-","-","-"]
[null,null,null,null,"Coincident",null,null,null,null,null,null,null,null,null,null,null,"-","-","-","-","-","-","-"]
[null,null,"WEATHER CORRECTED MD 10% POE","MW","Non-coincident"]
[null,null,null,null,"Coincident"]
[null,null,"WEATHER CORRECTED MD 10% POE","MVA","Non-coincident"]
[null,null,null,null,"Coincident"]
[null,null,"WEATHER CORRECTED MD 50% POE","MW","Non-coincident"]
[null,null,null,null,"Coincident"]
[null,null,"WEATHER CORRECTED MD 50% POE","MVA","Non-coincident"]
[null,null,null,null,"Coincident"]
[null,"Bolingbroke (Rail)","CONNECTION POINT RATING","MVA","Non-coincident",null,null,null,null,null,null,null,null,null,null,null,129.19999999999999,129.19999999999999,129.19999999999999,129.19999999999999,129.19999999999999,129.19999999999999,129.19999999999999]
[null,null,null,null,"Coincident",null,null,null,null,null,null,null,null,null,null,null,129.19999999999999,129.19999999999999,129.19999999999999,129.19999999999999,129.19999999999999,129.19999999999999,129.19999999999999]
[null,null,"WINTER/SUMMER PEAKING",null,"Non-coincident",null,null,null,null,null,null,null,null,null,null,null,"Summer","Summer","Summer","Summer","Summer","Summer","Summer"]
[null,null,null,null,"Coincident",null,null,null,null,null,null,null,null,null,null,null,"Summer","Summer","Summer","Summer","Summer","Summer","Summer"]
[null,null,"ADJUSTMENTS - EMBEDDED GENERATION","MW","Non-coincident",null,null,null,null,null,null,null,null,null,null,null,"-","-","-","-","-","-","-"]
[null,null,null,null,"Coincident",null,null,null,null,null,null,null,null,null,null,null,"-","-","-","-","-","-","-"]
[null,null,"WEATHER CORRECTED MD 10% POE","MW","Non-coincident"]
[null,null,null,null,"Coincident"]
[null,null,"WEATHER CORRECTED MD 10% POE","MVA","Non-coincident"]
[null,null,null,null,"Coincident"]
[null,null,"WEATHER CORRECTED MD 50% POE","MW","Non-coincident"]
[null,null,null,null,"Coincident"]
[null,null,"WEATHER CORRECTED MD 50% POE","MVA","Non-coincident"]
[null,null,null,null,"Coincident"]
[null,"Bowen North","CONNECTION POINT RATING","MVA","Non-coincident",null,null,null,null,null,null,null,null,null,null,null,134.6,134.6,134.6,134.6,134.6,134.6,134.6]
[null,null,null,null,"Coincident",null,null,null,null,null,null,null,null,null,null,null,134.6,134.6,134.6,134.6,134.6,134.6,134.6]
[null,null,"WINTER/SUMMER PEAKING",null,"Non-coincident",null,null,null,null,null,null,null,null,null,null,null,"Summer","Summer","Summer","Summer","Summer","Summer","Summer"]
[null,null,null,null,"Coincident",null,null,null,null,null,null,null,null,null,null,null,"Summer","Summer","Summer","Summer","Summer","Summer","Summer"]
[null,null,"ADJUSTMENTS - EMBEDDED GENERATION","MW","Non-coincident",null,null,null,null,null,null,null,null,null,null,null,"-","-","-","-","-","-","-"]
[null,null,null,null,"Coincident",null,null,null,null,null,null,null,null,null,null,null,"-","-","-","-","-","-","-"]
[null,null,"WEATHER CORRECTED MD 10% POE","MW","Non-coincident",null,null,null,null,null,null,null,null,null,null,null,24.4,24.5,24.6,24.7,24.9,25,25.2]
[null,null,null,null,"Coincident",null,null,null,null,null,null,null,null,null,null,null,21.3,22,22.2,22.5,22.7,22.9,23.2]
[null,null,"WEATHER CORRECTED MD 10% POE","MVA","Non-coincident",null,null,null,null,null,null,null,null,null,null,null,24.5,24.5,24.6,24.8,24.9,25.1,25.3]
[null,null,null,null,"Coincident",null,null,null,null,null,null,null,null,null,null,null,21.4,22.1,22.3,22.6,22.8,23.1,23.3]
[null,null,"WEATHER CORRECTED MD 50% POE","MW","Non-coincident",null,null,null,null,null,null,null,null,null,null,null,22.7,22.8,22.8,23,23.1,23.2,23.4]
[null,null,null,null,"Coincident",null,null,null,null,null,null,null,null,null,null,null,20.3,21,21.1,21.4,21.6,21.8,22.1]
[null,null,"WEATHER CORRECTED MD 50% POE","MVA","Non-coincident",null,null,null,null,null,null,null,null,null,null,null,22.7,22.8,22.9,23,23.1,23.3,23.4]
[null,null,null,null,"Coincident",null,null,null,null,null,null,null,null,null,null,null,20.399999999999999,21.1,21.2,21.6,21.8,22,22.2]
[null,"Boyne Island (132)","CONNECTION POINT RATING","MVA","Non-coincident",null,null,null,null,null,null,null,null,null,null,null,816.8,816.8,816.8,816.8,816.8,816.8,816.8]
[null,null,null,null,"Coincident",null,null,null,null,null,null,null,null,null,null,null,816.8,816.8,816.8,816.8,816.8,816.8,816.8]
[null,null,"WINTER/SUMMER PEAKING",null,"Non-coincident",null,null,null,null,null,null,null,null,null,null,null,"Summer","Summer","Summer","Summer","Summer","Summer","Summer"]
[null,null,null,null,"Coincident",null,null,null,null,null,null,null,null,null,null,null,"Summer","Summer","Summer","Summer","Summer","Summer","Summer"]
[null,null,"ADJUSTMENTS - EMBEDDED GENERATION","MW","Non-coincident",null,null,null,null,null,null,null,null,null,null,null,"-","-","-","-","-","-","-"]
[null,null,null,null,"Coincident",null,null,null,null,null,null,null,null,null,null,null,"-","-","-","-","-","-","-"]
[null,null,"WEATHER CORRECTED MD 10% POE","MW","Non-coincident"]
[null,null,null,null,"Coincident"]
[null,null,"WEATHER CORRECTED MD 10% POE","MVA","Non-coincident"]
[null,null,null,null,"Coincident"]
[null,null,"WEATHER CORRECTED MD 50% POE","MW","Non-coincident"]
[null,null,null,null,"Coincident"]
[null,null,"WEATHER CORRECTED MD 50% POE","MVA","Non-coincident"]
[null,null,null,null,"Coincident"]
[null,"Boyne Island (275)","CONNECTION POINT RATING","MVA","Non-coincident",null,null,null,null,null,null,null,null,null,null,null,884.9,884.9,884.9,884.9,884.9,884.9,884.9]
[null,null,null,null,"Coincident",null,null,null,null,null,null,null,null,null,null,null,884.9,884.9,884.9,884.9,884.9,884.9,884.9]
[null,null,"WINTER/SUMMER PEAKING",null,"Non-coincident",null,null,null,null,null,null,null,null,null,null,null,"Summer","Summer","Summer","Summer","Summer","Summer","Summer"]
[null,null,null,null,"Coincident",null,null,null,null,null,null,null,null,null,null,null,"Summer","Summer","Summer","Summer","Summer","Summer","Summer"]
[null,null,"ADJUSTMENTS - EMBEDDED GENERATION","MW","Non-coincident",null,null,null,null,null,null,null,null,null,null,null,"-","-","-","-","-","-","-"]
[null,null,null,null,"Coincident",null,null,null,null,null,null,null,null,null,null,null,"-","-","-","-","-","-","-"]
[null,null,"WEATHER CORRECTED MD 10% POE","MW","Non-coincident"]
[null,null,null,null,"Coincident"]
[null,null,"WEATHER CORRECTED MD 10% POE","MVA","Non-coincident"]
[null,null,null,null,"Coincident"]
[null,null,"WEATHER CORRECTED MD 50% POE","MW","Non-coincident"]
[null,null,null,null,"Coincident"]
[null,null,"WEATHER CORRECTED MD 50% POE","MVA","Non-coincident"]
[null,null,null,null,"Coincident"]
[null,"Braemar (Kumbarilla Park)","CONNECTION POINT RATING","MVA","Non-coincident",null,null,null,null,null,null,null,null,null,null,null,0,0,0,0,0,0,0]
[null,null,null,null,"Coincident",null,null,null,null,null,null,null,null,null,null,null,0,0,0,0,0,0,0]
[null,null,"WINTER/SUMMER PEAKING",null,"Non-coincident",null,null,null,null,null,null,null,null,null,null,null,"Summer","Summer","Summer","Summer","Summer","Summer","Summer"]
[null,null,null,null,"Coincident",null,null,null,null,null,null,null,null,null,null,null,"Summer","Summer","Summer","Summer","Summer","Summer","Summer"]
[null,null,"ADJUSTMENTS - EMBEDDED GENERATION","MW","Non-coincident",null,null,null,null,null,null,null,null,null,null,null,"-","-","-","-","-","-","-"]
[null,null,null,null,"Coincident",null,null,null,null,null,null,null,null,null,null,null,"-","-","-","-","-","-","-"]
[null,null,"WEATHER CORRECTED MD 10% POE","MW","Non-coincident"]
[null,null,null,null,"Coincident"]
[null,null,"WEATHER CORRECTED MD 10% POE","MVA","Non-coincident"]
[null,null,null,null,"Coincident"]
[null,null,"WEATHER CORRECTED MD 50% POE","MW","Non-coincident"]
[null,null,null,null,"Coincident"]
[null,null,"WEATHER CORRECTED MD 50% POE","MVA","Non-coincident"]
[null,null,null,null,"Coincident"]
[null,"Bulli Creek (132)","CONNECTION POINT RATING","MVA","Non-coincident",null,null,null,null,null,null,null,null,null,null,null,110,110,110,110,110,110,110]
[null,null,null,null,"Coincident",null,null,null,null,null,null,null,null,null,null,null,110,110,110,110,110,110,110]
[null,null,"WINTER/SUMMER PEAKING",null,"Non-coincident",null,null,null,null,null,null,null,null,null,null,null,"Summer","Summer","Summer","Summer","Summer","Summer","Summer"]
[null,null,null,null,"Coincident",null,null,null,null,null,null,null,null,null,null,null,"Summer","Summer","Summer","Summer","Summer","Summer","Summer"]
[null,null,"ADJUSTMENTS - EMBEDDED GENERATION","MW","Non-coincident",null,null,null,null,null,null,null,null,null,null,null,"-","-","-","-","-","-","-"]
[null,null,null,null,"Coincident",null,null,null,null,null,null,null,null,null,null,null,"-","-","-","-","-","-","-"]
[null,null,"WEATHER CORRECTED MD 10% POE","MW","Non-coincident",null,null,null,null,null,null,null,null,null,null,null,21.1,21.1,21.1,21.2,21.2,21.3,21.3]
[null,null,null,null,"Coincident",null,null,null,null,null,null,null,null,null,null,null,15.2,15.7,15.7,15.9,16,16.100000000000001,16.2]
[null,null,"WEATHER CORRECTED MD 10% POE","MVA","Non-coincident",null,null,null,null,null,null,null,null,null,null,null,21.1,21.1,21.1,21.2,21.2,21.3,21.3]
[null,null,null,null,"Coincident",null,null,null,null,null,null,null,null,null,null,null,15.2,15.7,15.8,16,16.100000000000001,16.100000000000001,16.2]
[null,null,"WEATHER CORRECTED MD 50% POE","MW","Non-coincident",null,null,null,null,null,null,null,null,null,null,null,18.899999999999999,18.899999999999999,18.899999999999999,19,19,19.100000000000001,19.100000000000001]
[null,null,null,null,"Coincident",null,null,null,null,null,null,null,null,null,null,null,14.5,14.9,15,15.2,15.3,15.3,15.4]
[null,null,"WEATHER CORRECTED MD 50% POE","MVA","Non-coincident",null,null,null,null,null,null,null,null,null,null,null,18.899999999999999,18.899999999999999,18.899999999999999,19,19,19.100000000000001,19.100000000000001]
[null,null,null,null,"Coincident",null,null,null,null,null,null,null,null,null,null,null,14.5,14.9,15,15.2,15.3,15.4,15.4]
[null,"Bundamba","CONNECTION POINT RATING","MVA","Non-coincident",null,null,null,null,null,null,null,null,null,null,null,685.9,685.9,685.9,685.9,685.9,685.9,685.9]
[null,null,null,null,"Coincident",null,null,null,null,null,null,null,null,null,null,null,685.9,685.9,685.9,685.9,685.9,685.9,685.9]
[null,null,"WINTER/SUMMER PEAKING",null,"Non-coincident",null,null,null,null,null,null,null,null,null,null,null,"Summer","Summer","Summer","Summer","Summer","Summer","Summer"]
[null,null,null,null,"Coincident",null,null,null,null,null,null,null,null,null,null,null,"Summer","Summer","Summer","Summer","Summer","Summer","Summer"]
[null,null,"ADJUSTMENTS - EMBEDDED GENERATION","MW","Non-coincident",null,null,null,null,null,null,null,null,null,null,null,"-","-","-","-","-","-","-"]
[null,null,null,null,"Coincident",null,null,null,null,null,null,null,null,null,null,null,"-","-","-","-","-","-","-"]
[null,null,"WEATHER CORRECTED MD 10% POE","MW","Non-coincident",null,null,null,null,null,null,null,null,null,null,null,37,37.200000000000003,37.5,37.6,37.6,37.6,37.5]
[null,null,null,null,"Coincident",null,null,null,null,null,null,null,null,null,null,null,33.4,34.5,34.9,35.299999999999997,35.6,35.6,35.5]
[null,null,"WEATHER CORRECTED MD 10% POE","MVA","Non-coincident",null,null,null,null,null,null,null,null,null,null,null,37.799999999999997,37.9,38.200000000000003,38.299999999999997,38.4,38.299999999999997,38.200000000000003]
[null,null,null,null,"Coincident",null,null,null,null,null,null,null,null,null,null,null,34.200000000000003,35.4,35.799999999999997,36.200000000000003,36.5,36.5,36.4]
[null,null,"WEATHER CORRECTED MD 50% POE","MW","Non-coincident",null,null,null,null,null,null,null,null,null,null,null,34.4,34.5,34.799999999999997,34.9,34.9,34.9,34.799999999999997]
[null,null,null,null,"Coincident",null,null,null,null,null,null,null,null,null,null,null,31.8,32.9,33.200000000000003,33.700000000000003,33.9,33.9,33.799999999999997]
[null,null,"WEATHER CORRECTED MD 50% POE","MVA","Non-coincident",null,null,null,null,null,null,null,null,null,null,null,35,35.200000000000003,35.4,35.6,35.6,35.5,35.4]
[null,null,null,null,"Coincident",null,null,null,null,null,null,null,null,null,null,null,32.5,33.6,34,34.4,34.700000000000003,34.700000000000003,34.6]
[null,"Cairns","CONNECTION POINT RATING","MVA","Non-coincident",null,null,null,null,null,null,null,null,null,null,null,173.9,173.9,173.9,118.9,118.9,118.9,118.9]
[null,null,null,null,"Coincident",null,null,null,null,null,null,null,null,null,null,null,173.9,173.9,173.9,118.9,118.9,118.9,118.9]
[null,null,"WINTER/SUMMER PEAKING",null,"Non-coincident",null,null,null,null,null,null,null,null,null,null,null,"Summer","Summer","Summer","Summer","Summer","Summer","Summer"]
[null,null,null,null,"Coincident",null,null,null,null,null,null,null,null,null,null,null,"Summer","Summer","Summer","Summer","Summer","Summer","Summer"]
[null,null,"ADJUSTMENTS - EMBEDDED GENERATION","MW","Non-coincident",null,null,null,null,null,null,null,null,null,null,null,"-","-","-","-","-","-","-"]
[null,null,null,null,"Coincident",null,null,null,null,null,null,null,null,null,null,null,"-","-","-","-","-","-","-"]
[null,null,"WEATHER CORRECTED MD 10% POE","MW","Non-coincident",null,null,null,null,null,null,null,null,null,null,null,54.4,54,53.8,53.8,53.7,53.8,54]
[null,null,null,null,"Coincident",null,null,null,null,null,null,null,null,null,null,null,47.4,48.5,48.4,48.9,49.1,49.3,49.6]
[null,null,"WEATHER CORRECTED MD 10% POE","MVA","Non-coincident",null,null,null,null,null,null,null,null,null,null,null,60.2,59.8,59.5,59.5,59.5,59.6,59.8]
[null,null,null,null,"Coincident",null,null,null,null,null,null,null,null,null,null,null,52.9,54.1,54.1,54.6,54.8,55.1,55.4]
[null,null,"WEATHER CORRECTED MD 50% POE","MW","Non-coincident",null,null,null,null,null,null,null,null,null,null,null,50.5,50.1,49.9,49.9,49.8,50,50.2]
[null,null,null,null,"Coincident",null,null,null,null,null,null,null,null,null,null,null,45.2,46.2,46.1,46.6,46.8,47,47.2]
[null,null,"WEATHER CORRECTED MD 50% POE","MVA","Non-coincident",null,null,null,null,null,null,null,null,null,null,null,55.9,55.5,55.3,55.3,55.2,55.3,55.6]
[null,null,null,null,"Coincident",null,null,null,null,null,null,null,null,null,null,null,50,51.1,51.1,51.6,51.8,52,52.3]
[null,"Cairns City","CONNECTION POINT RATING","MVA","Non-coincident",null,null,null,null,null,null,null,null,null,null,null,206.1,206.1,206.1,206.1,206.1,206.1,206.1]
[null,null,null,null,"Coincident",null,null,null,null,null,null,null,null,null,null,null,206.1,206.1,206.1,206.1,206.1,206.1,206.1]
[null,null,"WINTER/SUMMER PEAKING",null,"Non-coincident",null,null,null,null,null,null,null,null,null,null,null,"Summer","Summer","Summer","Summer","Summer","Summer","Summer"]
[null,null,null,null,"Coincident",null,null,null,null,null,null,null,null,null,null,null,"Summer","Summer","Summer","Summer","Summer","Summer","Summer"]
[null,null,"ADJUSTMENTS - EMBEDDED GENERATION","MW","Non-coincident",null,null,null,null,null,null,null,null,null,null,null,"-","-","-","-","-","-","-"]
[null,null,null,null,"Coincident",null,null,null,null,null,null,null,null,null,null,null,"-","-","-","-","-","-","-"]
[null,null,"WEATHER CORRECTED MD 10% POE","MW","Non-coincident",null,null,null,null,null,null,null,null,null,null,null,37.799999999999997,37.6,37.5,37.5,37.4,37.4,37.5]
[null,null,null,null,"Coincident",null,null,null,null,null,null,null,null,null,null,null,34,34.799999999999997,34.9,35.1,35.299999999999997,35.299999999999997,35.4]
[null,null,"WEATHER CORRECTED MD 10% POE","MVA","Non-coincident",null,null,null,null,null,null,null,null,null,null,null,38.200000000000003,38,37.9,37.9,37.799999999999997,37.799999999999997,37.799999999999997]
[null,null,null,null,"Coincident",null,null,null,null,null,null,null,null,null,null,null,34.4,35.200000000000003,35.200000000000003,35.5,35.700000000000003,35.700000000000003,35.799999999999997]
[null,null,"WEATHER CORRECTED MD 50% POE","MW","Non-coincident",null,null,null,null,null,null,null,null,null,null,null,36.200000000000003,36,35.9,35.9,35.799999999999997,35.799999999999997,35.9]
[null,null,null,null,"Coincident",null,null,null,null,null,null,null,null,null,null,null,32.4,33.1,33.200000000000003,33.5,33.6,33.6,33.799999999999997]
[null,null,"WEATHER CORRECTED MD 50% POE","MVA","Non-coincident",null,null,null,null,null,null,null,null,null,null,null,36.6,36.4,36.299999999999997,36.200000000000003,36.200000000000003,36.200000000000003,36.200000000000003]
[null,null,null,null,"Coincident",null,null,null,null,null,null,null,null,null,null,null,32.700000000000003,33.5,33.5,33.799999999999997,33.9,34,34.1]
[null,"Callemondah (Rail)","CONNECTION POINT RATING","MVA","Non-coincident",null,null,null,null,null,null,null,null,null,null,null,320.10000000000002,320.10000000000002,320.10000000000002,320.10000000000002,320.10000000000002,320.10000000000002,320.10000000000002]
[null,null,null,null,"Coincident",null,null,null,null,null,null,null,null,null,null,null,320.10000000000002,320.10000000000002,320.10000000000002,320.10000000000002,320.10000000000002,320.10000000000002,320.10000000000002]
[null,null,"WINTER/SUMMER PEAKING",null,"Non-coincident",null,null,null,null,null,null,null,null,null,null,null,"Summer","Summer","Summer","Summer","Summer","Summer","Summer"]
[null,null,null,null,"Coincident",null,null,null,null,null,null,null,null,null,null,null,"Summer","Summer","Summer","Summer","Summer","Summer","Summer"]
[null,null,"ADJUSTMENTS - EMBEDDED GENERATION","MW","Non-coincident",null,null,null,null,null,null,null,null,null,null,null,"-","-","-","-","-","-","-"]
[null,null,null,null,"Coincident",null,null,null,null,null,null,null,null,null,null,null,"-","-","-","-","-","-","-"]
[null,null,"WEATHER CORRECTED MD 10% POE","MW","Non-coincident"]
[null,null,null,null,"Coincident"]
[null,null,"WEATHER CORRECTED MD 10% POE","MVA","Non-coincident"]
[null,null,null,null,"Coincident"]
[null,null,"WEATHER CORRECTED MD 50% POE","MW","Non-coincident"]
[null,null,null,null,"Coincident"]
[null,null,"WEATHER CORRECTED MD 50% POE","MVA","Non-coincident"]
[null,null,null,null,"Coincident"]
[null,"Calliope River (Ergon)","CONNECTION POINT RATING","MVA","Non-coincident",null,null,null,null,null,null,null,null,null,null,null,362.4,362.4,362.4,362.4,362.4,362.4,362.4]
[null,null,null,null,"Coincident",null,null,null,null,null,null,null,null,null,null,null,362.4,362.4,362.4,362.4,362.4,362.4,362.4]
[null,null,"WINTER/SUMMER PEAKING",null,"Non-coincident",null,null,null,null,null,null,null,null,null,null,null,"Summer","Summer","Summer","Summer","Summer","Summer","Summer"]
[null,null,null,null,"Coincident",null,null,null,null,null,null,null,null,null,null,null,"Summer","Summer","Summer","Summer","Summer","Summer","Summer"]
[null,null,"ADJUSTMENTS - EMBEDDED GENERATION","MW","Non-coincident",null,null,null,null,null,null,null,null,null,null,null,"-","-","-","-","-","-","-"]
[null,null,null,null,"Coincident",null,null,null,null,null,null,null,null,null,null,null,"-","-","-","-","-","-","-"]
[null,null,"WEATHER CORRECTED MD 10% POE","MW","Non-coincident",null,null,null,null,null,null,null,null,null,null,null,52.2,51.9,51.7,51.8,51.8,51.9,52.1]
[null,null,null,null,"Coincident",null,null,null,null,null,null,null,null,null,null,null,45.6,46.7,46.7,47.2,47.4,47.7,47.9]
[null,null,"WEATHER CORRECTED MD 10% POE","MVA","Non-coincident",null,null,null,null,null,null,null,null,null,null,null,52.3,52.1,51.9,52,51.9,52.1,52.3]
[null,null,null,null,"Coincident",null,null,null,null,null,null,null,null,null,null,null,45.8,46.9,46.9,47.5,47.7,47.9,48.2]
[null,null,"WEATHER CORRECTED MD 50% POE","MW","Non-coincident",null,null,null,null,null,null,null,null,null,null,null,49.3,49,48.9,48.9,48.9,49,49.3]
[null,null,null,null,"Coincident",null,null,null,null,null,null,null,null,null,null,null,43.4,44.5,44.5,45,45.2,45.4,45.6]
[null,null,"WEATHER CORRECTED MD 50% POE","MVA","Non-coincident",null,null,null,null,null,null,null,null,null,null,null,49.4,49.2,49,49.1,49.1,49.2,49.4]
[null,null,null,null,"Coincident",null,null,null,null,null,null,null,null,null,null,null,43.6,44.7,44.7,45.2,45.4,45.6,45.9]
[null,"Cardwell","CONNECTION POINT RATING","MVA","Non-coincident",null,null,null,null,null,null,null,null,null,null,null,64.7,64.7,64.7,64.7,64.7,64.7,64.7]
[null,null,null,null,"Coincident",null,null,null,null,null,null,null,null,null,null,null,64.7,64.7,64.7,64.7,64.7,64.7,64.7]
[null,null,"WINTER/SUMMER PEAKING",null,"Non-coincident",null,null,null,null,null,null,null,null,null,null,null,"Summer","Summer","Summer","Summer","Summer","Summer","Summer"]
[null,null,null,null,"Coincident",null,null,null,null,null,null,null,null,null,null,null,"Summer","Summer","Summer","Summer","Summer","Summer","Summer"]
[null,null,"ADJUSTMENTS - EMBEDDED GENERATION","MW","Non-coincident",null,null,null,null,null,null,null,null,null,null,null,"-","-","-","-","-","-","-"]
[null,null,null,null,"Coincident",null,null,null,null,null,null,null,null,null,null,null,"-","-","-","-","-","-","-"]
[null,null,"WEATHER CORRECTED MD 10% POE","MW","Non-coincident",null,null,null,null,null,null,null,null,null,null,null,4.2,4.2,4.2,4.2,4.2,4.3,4.3]
[null,null,null,null,"Coincident",null,null,null,null,null,null,null,null,null,null,null,3.8,4,4,4,4.0999999999999996,4.0999999999999996,4.0999999999999996]
[null,null,"WEATHER CORRECTED MD 10% POE","MVA","Non-coincident",null,null,null,null,null,null,null,null,null,null,null,4.3,4.3,4.3,4.3,4.3,4.3,4.4000000000000004]
[null,null,null,null,"Coincident",null,null,null,null,null,null,null,null,null,null,null,3.9,4,4.0999999999999996,4.0999999999999996,4.0999999999999996,4.2,4.2]
[null,null,"WEATHER CORRECTED MD 50% POE","MW","Non-coincident",null,null,null,null,null,null,null,null,null,null,null,4.0999999999999996,4.0999999999999996,4.0999999999999996,4.0999999999999996,4.0999999999999996,4.2,4.2]
[null,null,null,null,"Coincident",null,null,null,null,null,null,null,null,null,null,null,3.7,3.8,3.8,3.8,3.9,3.9,3.9]
[null,null,"WEATHER CORRECTED MD 50% POE","MVA","Non-coincident",null,null,null,null,null,null,null,null,null,null,null,4.2,4.2,4.2,4.2,4.2,4.2,4.3]
[null,null,null,null,"Coincident",null,null,null,null,null,null,null,null,null,null,null,3.7,3.8,3.9,3.9,3.9,4,4]
[null,"Chinchilla","CONNECTION POINT RATING","MVA","Non-coincident",null,null,null,null,null,null,null,null,null,null,null,403.4,403.4,403.4,403.4,403.4,403.4,403.4]
[null,null,null,null,"Coincident",null,null,null,null,null,null,null,null,null,null,null,403.4,403.4,403.4,403.4,403.4,403.4,403.4]
[null,null,"WINTER/SUMMER PEAKING",null,"Non-coincident",null,null,null,null,null,null,null,null,null,null,null,"Summer","Summer","Summer","Summer","Summer","Summer","Summer"]
[null,null,null,null,"Coincident",null,null,null,null,null,null,null,null,null,null,null,"Summer","Summer","Summer","Summer","Summer","Summer","Summer"]
[null,null,"ADJUSTMENTS - EMBEDDED GENERATION","MW","Non-coincident",null,null,null,null,null,null,null,null,null,null,null,"-","-","-","-","-","-","-"]
[null,null,null,null,"Coincident",null,null,null,null,null,null,null,null,null,null,null,"-","-","-","-","-","-","-"]
[null,null,"WEATHER CORRECTED MD 10% POE","MW","Non-coincident",null,null,null,null,null,null,null,null,null,null,null,23.5,23.6,23.6,23.8,23.9,24.1,24.2]
[null,null,null,null,"Coincident",null,null,null,null,null,null,null,null,null,null,null,22.9,23.6,23.8,24.2,24.4,24.6,24.8]
[null,null,"WEATHER CORRECTED MD 10% POE","MVA","Non-coincident",null,null,null,null,null,null,null,null,null,null,null,23.9,24,24.1,24.2,24.3,24.5,24.6]
[null,null,null,null,"Coincident",null,null,null,null,null,null,null,null,null,null,null,23.3,24.1,24.3,24.6,24.9,25.1,25.3]
[null,null,"WEATHER CORRECTED MD 50% POE","MW","Non-coincident",null,null,null,null,null,null,null,null,null,null,null,21.6,21.6,21.7,21.9,22,22.1,22.2]
[null,null,null,null,"Coincident",null,null,null,null,null,null,null,null,null,null,null,21.8,22.5,22.6,23,23.2,23.4,23.6]
[null,null,"WEATHER CORRECTED MD 50% POE","MVA","Non-coincident",null,null,null,null,null,null,null,null,null,null,null,22,22,22.1,22.3,22.4,22.5,22.6]
[null,null,null,null,"Coincident",null,null,null,null,null,null,null,null,null,null,null,22.2,22.9,23.1,23.4,23.7,23.9,24.1]
[null,"Clare South","CONNECTION POINT RATING","MVA","Non-coincident",null,null,null,null,null,null,null,null,null,null,null,416.4,416.4,416.4,416.4,416.4,416.4,416.4]
[null,null,null,null,"Coincident",null,null,null,null,null,null,null,null,null,null,null,416.4,416.4,416.4,416.4,416.4,416.4,416.4]
[null,null,"WINTER/SUMMER PEAKING",null,"Non-coincident",null,null,null,null,null,null,null,null,null,null,null,"Summer","Summer","Summer","Summer","Summer","Summer","Summer"]
[null,null,null,null,"Coincident",null,null,null,null,null,null,null,null,null,null,null,"Summer","Summer","Summer","Summer","Summer","Summer","Summer"]
[null,null,"ADJUSTMENTS - EMBEDDED GENERATION","MW","Non-coincident",null,null,null,null,null,null,null,null,null,null,null,"-","-","-","-","-","-","-"]
[null,null,null,null,"Coincident",null,null,null,null,null,null,null,null,null,null,null,"-","-","-","-","-","-","-"]
[null,null,"WEATHER CORRECTED MD 10% POE","MW","Non-coincident",null,null,null,null,null,null,null,null,null,null,null,83.3,85.7,88.2,88.4,88.6,88.8,89.1]
[null,null,null,null,"Coincident",null,null,null,null,null,null,null,null,null,null,null,74.099999999999994,78.5,81.099999999999994,82.1,82.7,83,83.4]
[null,null,"WEATHER CORRECTED MD 10% POE","MVA","Non-coincident",null,null,null,null,null,null,null,null,null,null,null,85.5,88,90.7,90.9,91,91.2,91.6]
[null,null,null,null,"Coincident",null,null,null,null,null,null,null,null,null,null,null,76.8,81.400000000000006,84.2,85.3,85.8,86.2,86.6]
[null,null,"WEATHER CORRECTED MD 50% POE","MW","Non-coincident",null,null,null,null,null,null,null,null,null,null,null,79.099999999999994,81.5,83.9,84.2,84.3,84.5,84.7]
[null,null,null,null,"Coincident",null,null,null,null,null,null,null,null,null,null,null,70.5,74.7,77.3,78.2,78.7,79.099999999999994,79.5]
[null,null,"WEATHER CORRECTED MD 50% POE","MVA","Non-coincident",null,null,null,null,null,null,null,null,null,null,null,81.2,83.7,86.3,86.5,86.6,86.8,87.1]
[null,null,null,null,"Coincident",null,null,null,null,null,null,null,null,null,null,null,73,77.400000000000006,80,81,81.5,81.900000000000006,82.3]
[null,"Collinsville Load","CONNECTION POINT RATING","MVA","Non-coincident",null,null,null,null,null,null,null,null,null,null,null,143,143,143,143,143,143,143]
[null,null,null,null,"Coincident",null,null,null,null,null,null,null,null,null,null,null,143,143,143,143,143,143,143]
[null,null,"WINTER/SUMMER PEAKING",null,"Non-coincident",null,null,null,null,null,null,null,null,null,null,null,"Summer","Summer","Summer","Summer","Summer","Summer","Summer"]
[null,null,null,null,"Coincident",null,null,null,null,null,null,null,null,null,null,null,"Summer","Summer","Summer","Summer","Summer","Summer","Summer"]
[null,null,"ADJUSTMENTS - EMBEDDED GENERATION","MW","Non-coincident",null,null,null,null,null,null,null,null,null,null,null,"-","-","-","-","-","-","-"]
[null,null,null,null,"Coincident",null,null,null,null,null,null,null,null,null,null,null,10.5,10.5,10.5,10.5,10.5,10.5,10.5]
[null,null,"WEATHER CORRECTED MD 10% POE","MW","Non-coincident",null,null,null,null,null,null,null,null,null,null,null,13.4,13.3,13.3,13.3,13.3,13.3,13.3]
[null,null,null,null,"Coincident",null,null,null,null,null,null,null,null,null,null,null,11.6,11.9,11.9,12,12.1,12.1,12.2]
[null,null,"WEATHER CORRECTED MD 10% POE","MVA","Non-coincident",null,null,null,null,null,null,null,null,null,null,null,13.5,13.5,13.4,13.4,13.4,13.4,13.4]
[null,null,null,null,"Coincident",null,null,null,null,null,null,null,null,null,null,null,14.2,14.6,14.6,14.8,14.8,14.8,14.9]
[null,null,"WEATHER CORRECTED MD 50% POE","MW","Non-coincident",null,null,null,null,null,null,null,null,null,null,null,13.1,13,13,13,13,13,13]
[null,null,null,null,"Coincident",null,null,null,null,null,null,null,null,null,null,null,11,11.3,11.3,11.5,11.5,11.5,11.6]
[null,null,"WEATHER CORRECTED MD 50% POE","MVA","Non-coincident",null,null,null,null,null,null,null,null,null,null,null,13.2,13.1,13.1,13.1,13.1,13.1,13.1]
[null,null,null,null,"Coincident",null,null,null,null,null,null,null,null,null,null,null,13.4,13.7,13.7,13.9,13.9,13.9,14]
[null,"Columboola (Condabri)","CONNECTION POINT RATING","MVA","Non-coincident",null,null,null,null,null,null,null,null,null,null,null,0,0,0,0,0,0,0]
[null,null,null,null,"Coincident",null,null,null,null,null,null,null,null,null,null,null,0,0,0,0,0,0,0]
[null,null,"WINTER/SUMMER PEAKING",null,"Non-coincident",null,null,null,null,null,null,null,null,null,null,null,"Summer","Summer","Summer","Summer","Summer","Summer","Summer"]
[null,null,null,null,"Coincident",null,null,null,null,null,null,null,null,null,null,null,"Summer","Summer","Summer","Summer","Summer","Summer","Summer"]
[null,null,"ADJUSTMENTS - EMBEDDED GENERATION","MW","Non-coincident",null,null,null,null,null,null,null,null,null,null,null,"-","-","-","-","-","-","-"]
[null,null,null,null,"Coincident",null,null,null,null,null,null,null,null,null,null,null,"-","-","-","-","-","-","-"]
[null,null,"WEATHER CORRECTED MD 10% POE","MW","Non-coincident"]
[null,null,null,null,"Coincident"]
[null,null,"WEATHER CORRECTED MD 10% POE","MVA","Non-coincident"]
[null,null,null,null,"Coincident"]
[null,null,"WEATHER CORRECTED MD 50% POE","MW","Non-coincident"]
[null,null,null,null,"Coincident"]
[null,null,"WEATHER CORRECTED MD 50% POE","MVA","Non-coincident"]
[null,null,null,null,"Coincident"]
[null,"Columboola (Ergon)","CONNECTION POINT RATING","MVA","Non-coincident",null,null,null,null,null,null,null,null,null,null,null,857.4,857.4,857.4,857.4,857.4,857.4,857.4]
[null,null,null,null,"Coincident",null,null,null,null,null,null,null,null,null,null,null,857.4,857.4,857.4,857.4,857.4,857.4,857.4]
[null,null,"WINTER/SUMMER PEAKING",null,"Non-coincident",null,null,null,null,null,null,null,null,null,null,null,"Summer","Summer","Summer","Summer","Summer","Summer","Summer"]
[null,null,null,null,"Coincident",null,null,null,null,null,null,null,null,null,null,null,"Summer","Summer","Summer","Summer","Summer","Summer","Summer"]
[null,null,"ADJUSTMENTS - EMBEDDED GENERATION","MW","Non-coincident",null,null,null,null,null,null,null,null,null,null,null,"-","-","-","-","-","-","-"]
[null,null,null,null,"Coincident",null,null,null,null,null,null,null,null,null,null,null,40.6,40.6,40.6,40.6,40.6,40.6,40.6]
[null,null,"WEATHER CORRECTED MD 10% POE","MW","Non-coincident",null,null,null,null,null,null,null,null,null,null,null,76.7,76.7,76.599999999999994,76.8,76.900000000000006,77.099999999999994,77.3]
[null,null,null,null,"Coincident",null,null,null,null,null,null,null,null,null,null,null,73.3,75.3,75.599999999999994,76.5,77,77.3,77.599999999999994]
[null,null,"WEATHER CORRECTED MD 10% POE","MVA","Non-coincident",null,null,null,null,null,null,null,null,null,null,null,78.2,78.099999999999994,78.099999999999994,78.3,78.3,78.5,78.7]
[null,null,null,null,"Coincident",null,null,null,null,null,null,null,null,null,null,null,73.3,75.400000000000006,75.599999999999994,76.599999999999994,77,77.400000000000006,77.7]
[null,null,"WEATHER CORRECTED MD 50% POE","MW","Non-coincident",null,null,null,null,null,null,null,null,null,null,null,69.099999999999994,69,69,69.2,69.3,69.400000000000006,69.599999999999994]
[null,null,null,null,"Coincident",null,null,null,null,null,null,null,null,null,null,null,69.8,71.8,72,72.900000000000006,73.3,73.599999999999994,73.900000000000006]
[null,null,"WEATHER CORRECTED MD 50% POE","MVA","Non-coincident",null,null,null,null,null,null,null,null,null,null,null,70.599999999999994,70.599999999999994,70.5,70.7,70.8,70.900000000000006,71.099999999999994]
[null,null,null,null,"Coincident",null,null,null,null,null,null,null,null,null,null,null,69.8,71.8,72,72.900000000000006,73.400000000000006,73.7,74]
[null,"Coppabella (Rail)","CONNECTION POINT RATING","MVA","Non-coincident",null,null,null,null,null,null,null,null,null,null,null,63.7,63.7,63.7,63.7,63.7,63.7,63.7]
[null,null,null,null,"Coincident",null,null,null,null,null,null,null,null,null,null,null,63.7,63.7,63.7,63.7,63.7,63.7,63.7]
[null,null,"WINTER/SUMMER PEAKING",null,"Non-coincident",null,null,null,null,null,null,null,null,null,null,null,"Summer","Summer","Summer","Summer","Summer","Summer","Summer"]
[null,null,null,null,"Coincident",null,null,null,null,null,null,null,null,null,null,null,"Summer","Summer","Summer","Summer","Summer","Summer","Summer"]
[null,null,"ADJUSTMENTS - EMBEDDED GENERATION","MW","Non-coincident",null,null,null,null,null,null,null,null,null,null,null,"-","-","-","-","-","-","-"]
[null,null,null,null,"Coincident",null,null,null,null,null,null,null,null,null,null,null,"-","-","-","-","-","-","-"]
[null,null,"WEATHER CORRECTED MD 10% POE","MW","Non-coincident"]
[null,null,null,null,"Coincident"]
[null,null,"WEATHER CORRECTED MD 10% POE","MVA","Non-coincident"]
[null,null,null,null,"Coincident"]
[null,null,"WEATHER CORRECTED MD 50% POE","MW","Non-coincident"]
[null,null,null,null,"Coincident"]
[null,null,"WEATHER CORRECTED MD 50% POE","MVA","Non-coincident"]
[null,null,null,null,"Coincident"]
[null,"Dan Gleeson","CONNECTION POINT RATING","MVA","Non-coincident",null,null,null,null,null,null,null,null,null,null,null,244.7,244.7,244.7,244.7,244.7,244.7,244.7]
[null,null,null,null,"Coincident",null,null,null,null,null,null,null,null,null,null,null,244.7,244.7,244.7,244.7,244.7,244.7,244.7]
[null,null,"WINTER/SUMMER PEAKING",null,"Non-coincident",null,null,null,null,null,null,null,null,null,null,null,"Summer","Summer","Summer","Summer","Summer","Summer","Summer"]
[null,null,null,null,"Coincident",null,null,null,null,null,null,null,null,null,null,null,"Summer","Summer","Summer","Summer","Summer","Summer","Summer"]
[null,null,"ADJUSTMENTS - EMBEDDED GENERATION","MW","Non-coincident",null,null,null,null,null,null,null,null,null,null,null,"-","-","-","-","-","-","-"]
[null,null,null,null,"Coincident",null,null,null,null,null,null,null,null,null,null,null,21.8,21.8,21.8,21.8,21.8,21.8,21.8]
[null,null,"WEATHER CORRECTED MD 10% POE","MW","Non-coincident",null,null,null,null,null,null,null,null,null,null,null,103.4,103.9,99.3,100.1,100.9,101.9,103.2]
[null,null,null,null,"Coincident",null,null,null,null,null,null,null,null,null,null,null,84.2,87.1,83.1,84.6,85.7,86.8,88]
[null,null,"WEATHER CORRECTED MD 10% POE","MVA","Non-coincident",null,null,null,null,null,null,null,null,null,null,null,103.4,103.9,99.3,100.1,100.9,102,103.2]
[null,null,null,null,"Coincident",null,null,null,null,null,null,null,null,null,null,null,84.3,87.1,83.2,84.7,85.8,86.9,88.1]
[null,null,"WEATHER CORRECTED MD 50% POE","MW","Non-coincident",null,null,null,null,null,null,null,null,null,null,null,90,90.4,86,86.7,87.3,88.3,89.4]
[null,null,null,null,"Coincident",null,null,null,null,null,null,null,null,null,null,null,80.2,82.9,79.2,80.599999999999994,81.599999999999994,82.7,83.8]
[null,null,"WEATHER CORRECTED MD 50% POE","MVA","Non-coincident",null,null,null,null,null,null,null,null,null,null,null,90,90.4,86,86.7,87.4,88.3,89.4]
[null,null,null,null,"Coincident",null,null,null,null,null,null,null,null,null,null,null,80.2,83,79.2,80.599999999999994,81.7,82.7,83.9]
[null,"Duaringa (Rail)","CONNECTION POINT RATING","MVA","Non-coincident",null,null,null,null,null,null,null,null,null,null,null,0,0,0,0,0,0,0]
[null,null,null,null,"Coincident",null,null,null,null,null,null,null,null,null,null,null,0,0,0,0,0,0,0]
[null,null,"WINTER/SUMMER PEAKING",null,"Non-coincident",null,null,null,null,null,null,null,null,null,null,null,"Summer","Summer","Summer","Summer","Summer","Summer","Summer"]
[null,null,null,null,"Coincident",null,null,null,null,null,null,null,null,null,null,null,"Summer","Summer","Summer","Summer","Summer","Summer","Summer"]
[null,null,"ADJUSTMENTS - EMBEDDED GENERATION","MW","Non-coincident",null,null,null,null,null,null,null,null,null,null,null,"-","-","-","-","-","-","-"]
[null,null,null,null,"Coincident",null,null,null,null,null,null,null,null,null,null,null,"-","-","-","-","-","-","-"]
[null,null,"WEATHER CORRECTED MD 10% POE","MW","Non-coincident"]
[null,null,null,null,"Coincident"]
[null,null,"WEATHER CORRECTED MD 10% POE","MVA","Non-coincident"]
[null,null,null,null,"Coincident"]
[null,null,"WEATHER CORRECTED MD 50% POE","MW","Non-coincident"]
[null,null,null,null,"Coincident"]
[null,null,"WEATHER CORRECTED MD 50% POE","MVA","Non-coincident"]
[null,null,null,null,"Coincident"]
[null,"Dysart (66/22)","CONNECTION POINT RATING","MVA","Non-coincident",null,null,null,null,null,null,null,null,null,null,null,160.6,160.6,160.6,160.6,160.6,160.6,160.6]
[null,null,null,null,"Coincident",null,null,null,null,null,null,null,null,null,null,null,160.6,160.6,160.6,160.6,160.6,160.6,160.6]
[null,null,"WINTER/SUMMER PEAKING",null,"Non-coincident",null,null,null,null,null,null,null,null,null,null,null,"Summer","Summer","Summer","Summer","Summer","Summer","Summer"]
[null,null,null,null,"Coincident",null,null,null,null,null,null,null,null,null,null,null,"Summer","Summer","Summer","Summer","Summer","Summer","Summer"]
[null,null,"ADJUSTMENTS - EMBEDDED GENERATION","MW","Non-coincident",null,null,null,null,null,null,null,null,null,null,null,"-","-","-","-","-","-","-"]
[null,null,null,null,"Coincident",null,null,null,null,null,null,null,null,null,null,null,"-","-","-","-","-","-","-"]
[null,null,"WEATHER CORRECTED MD 10% POE","MW","Non-coincident",null,null,null,null,null,null,null,null,null,null,null,42.9,42.9,42.9,43.1,43.1,43.2,43.3]
[null,null,null,null,"Coincident",null,null,null,null,null,null,null,null,null,null,null,39.200000000000003,40.4,40.6,41.1,41.3,41.5,41.7]
[null,null,"WEATHER CORRECTED MD 10% POE","MVA","Non-coincident",null,null,null,null,null,null,null,null,null,null,null,43.9,43.9,43.9,44,44.1,44.2,44.3]
[null,null,null,null,"Coincident",null,null,null,null,null,null,null,null,null,null,null,40.299999999999997,41.4,41.6,42.2,42.4,42.6,42.8]
[null,null,"WEATHER CORRECTED MD 50% POE","MW","Non-coincident",null,null,null,null,null,null,null,null,null,null,null,41.1,41.1,41.1,41.3,41.3,41.4,41.5]
[null,null,null,null,"Coincident",null,null,null,null,null,null,null,null,null,null,null,37.4,38.5,38.6,39.1,39.4,39.6,39.700000000000003]
[null,null,"WEATHER CORRECTED MD 50% POE","MVA","Non-coincident",null,null,null,null,null,null,null,null,null,null,null,42.1,42.1,42.1,42.3,42.3,42.4,42.5]
[null,null,null,null,"Coincident",null,null,null,null,null,null,null,null,null,null,null,38.299999999999997,39.4,39.5,40.1,40.299999999999997,40.5,40.6]
[null,"Eagle Downs","CONNECTION POINT RATING","MVA","Non-coincident",null,null,null,null,null,null,null,null,null,null,null,0,0,0,0,0,0,0]
[null,null,null,null,"Coincident",null,null,null,null,null,null,null,null,null,null,null,0,0,0,0,0,0,0]
[null,null,"WINTER/SUMMER PEAKING",null,"Non-coincident",null,null,null,null,null,null,null,null,null,null,null,"Summer","Summer","Summer","Summer","Summer","Summer","Summer"]
[null,null,null,null,"Coincident",null,null,null,null,null,null,null,null,null,null,null,"Summer","Summer","Summer","Summer","Summer","Summer","Summer"]
[null,null,"ADJUSTMENTS - EMBEDDED GENERATION","MW","Non-coincident",null,null,null,null,null,null,null,null,null,null,null,"-","-","-","-","-","-","-"]
[null,null,null,null,"Coincident",null,null,null,null,null,null,null,null,null,null,null,"-","-","-","-","-","-","-"]
[null,null,"WEATHER CORRECTED MD 10% POE","MW","Non-coincident"]
[null,null,null,null,"Coincident"]
[null,null,"WEATHER CORRECTED MD 10% POE","MVA","Non-coincident"]
[null,null,null,null,"Coincident"]
[null,null,"WEATHER CORRECTED MD 50% POE","MW","Non-coincident"]
[null,null,null,null,"Coincident"]
[null,null,"WEATHER CORRECTED MD 50% POE","MVA","Non-coincident"]
[null,null,null,null,"Coincident"]
[null,"Edmonton","CONNECTION POINT RATING","MVA","Non-coincident",null,null,null,null,null,null,null,null,null,null,null,140,140,140,140,140,140,140]
[null,null,null,null,"Coincident",null,null,null,null,null,null,null,null,null,null,null,140,140,140,140,140,140,140]
[null,null,"WINTER/SUMMER PEAKING",null,"Non-coincident",null,null,null,null,null,null,null,null,null,null,null,"Summer","Summer","Summer","Summer","Summer","Summer","Summer"]
[null,null,null,null,"Coincident",null,null,null,null,null,null,null,null,null,null,null,"Summer","Summer","Summer","Summer","Summer","Summer","Summer"]
[null,null,"ADJUSTMENTS - EMBEDDED GENERATION","MW","Non-coincident",null,null,null,null,null,null,null,null,null,null,null,"-","-","-","-","-","-","-"]
[null,null,null,null,"Coincident",null,null,null,null,null,null,null,null,null,null,null,"-","-","-","-","-","-","-"]
[null,null,"WEATHER CORRECTED MD 10% POE","MW","Non-coincident",null,null,null,null,null,null,null,null,null,null,null,39.799999999999997,40.1,40.5,41,41.4,42,42.7]
[null,null,null,null,"Coincident",null,null,null,null,null,null,null,null,null,null,null,34.200000000000003,35.5,35.9,36.700000000000003,37.299999999999997,37.9,38.6]
[null,null,"WEATHER CORRECTED MD 10% POE","MVA","Non-coincident",null,null,null,null,null,null,null,null,null,null,null,39.799999999999997,40.1,40.5,41,41.4,42,42.7]
[null,null,null,null,"Coincident",null,null,null,null,null,null,null,null,null,null,null,34.200000000000003,35.5,36,36.700000000000003,37.299999999999997,38,38.6]
[null,null,"WEATHER CORRECTED MD 50% POE","MW","Non-coincident",null,null,null,null,null,null,null,null,null,null,null,36.4,36.700000000000003,37,37.5,37.9,38.5,39.1]
[null,null,null,null,"Coincident",null,null,null,null,null,null,null,null,null,null,null,32.5,33.799999999999997,34.200000000000003,35,35.5,36.1,36.799999999999997]
[null,null,"WEATHER CORRECTED MD 50% POE","MVA","Non-coincident",null,null,null,null,null,null,null,null,null,null,null,36.4,36.700000000000003,37.1,37.5,37.9,38.5,39.1]
[null,null,null,null,"Coincident",null,null,null,null,null,null,null,null,null,null,null,32.5,33.799999999999997,34.200000000000003,35,35.5,36.200000000000003,36.799999999999997]
[null,"Egans Hill","CONNECTION POINT RATING","MVA","Non-coincident",null,null,null,null,null,null,null,null,null,null,null,90,90,90,90,90,90,90]
[null,null,null,null,"Coincident",null,null,null,null,null,null,null,null,null,null,null,90,90,90,90,90,90,90]
[null,null,"WINTER/SUMMER PEAKING",null,"Non-coincident",null,null,null,null,null,null,null,null,null,null,null,"Summer","Summer","Summer","Summer","Summer","Summer","Summer"]
[null,null,null,null,"Coincident",null,null,null,null,null,null,null,null,null,null,null,"Summer","Summer","Summer","Summer","Summer","Summer","Summer"]
[null,null,"ADJUSTMENTS - EMBEDDED GENERATION","MW","Non-coincident",null,null,null,null,null,null,null,null,null,null,null,"-","-","-","-","-","-","-"]
[null,null,null,null,"Coincident",null,null,null,null,null,null,null,null,null,null,null,"-","-","-","-","-","-","-"]
[null,null,"WEATHER CORRECTED MD 10% POE","MW","Non-coincident",null,null,null,null,null,null,null,null,null,null,null,58.3,58.3,58.4,58.7,58.9,59.2,59.7]
[null,null,null,null,"Coincident",null,null,null,null,null,null,null,null,null,null,null,50.5,52,52.3,53,53.4,53.9,54.4]
[null,null,"WEATHER CORRECTED MD 10% POE","MVA","Non-coincident",null,null,null,null,null,null,null,null,null,null,null,60,60,60.1,60.4,60.6,61,61.4]
[null,null,null,null,"Coincident",null,null,null,null,null,null,null,null,null,null,null,52.4,53.9,54.2,55,55.4,55.9,56.4]
[null,null,"WEATHER CORRECTED MD 50% POE","MW","Non-coincident",null,null,null,null,null,null,null,null,null,null,null,52.9,52.9,53,53.3,53.4,53.8,54.2]
[null,null,null,null,"Coincident",null,null,null,null,null,null,null,null,null,null,null,48.1,49.5,49.8,50.5,50.9,51.3,51.8]
[null,null,"WEATHER CORRECTED MD 50% POE","MVA","Non-coincident",null,null,null,null,null,null,null,null,null,null,null,54.7,54.7,54.8,55.1,55.2,55.6,56]
[null,null,null,null,"Coincident",null,null,null,null,null,null,null,null,null,null,null,49.7,51.2,51.5,52.2,52.6,53.1,53.6]
[null,"El Arish","CONNECTION POINT RATING","MVA","Non-coincident",null,null,null,null,null,null,null,null,null,null,null,184,184,184,184,184,184,184]
[null,null,null,null,"Coincident",null,null,null,null,null,null,null,null,null,null,null,184,184,184,184,184,184,184]
[null,null,"WINTER/SUMMER PEAKING",null,"Non-coincident",null,null,null,null,null,null,null,null,null,null,null,"Summer","Summer","Summer","Summer","Summer","Summer","Summer"]
[null,null,null,null,"Coincident",null,null,null,null,null,null,null,null,null,null,null,"Summer","Summer","Summer","Summer","Summer","Summer","Summer"]
[null,null,"ADJUSTMENTS - EMBEDDED GENERATION","MW","Non-coincident",null,null,null,null,null,null,null,null,null,null,null,"-","-","-","-","-","-","-"]
[null,null,null,null,"Coincident",null,null,null,null,null,null,null,null,null,null,null,"-","-","-","-","-","-","-"]
[null,null,"WEATHER CORRECTED MD 10% POE","MW","Non-coincident",null,null,null,null,null,null,null,null,null,null,null,5.9,5.9,6,6,6,6,6.1]
[null,null,null,null,"Coincident",null,null,null,null,null,null,null,null,null,null,null,5,5.2,5.2,5.3,5.4,5.4,5.5]
[null,null,"WEATHER CORRECTED MD 10% POE","MVA","Non-coincident",null,null,null,null,null,null,null,null,null,null,null,5.9,6,6,6,6,6.1,6.1]
[null,null,null,null,"Coincident",null,null,null,null,null,null,null,null,null,null,null,5.0999999999999996,5.2,5.2,5.3,5.4,5.4,5.5]
[null,null,"WEATHER CORRECTED MD 50% POE","MW","Non-coincident",null,null,null,null,null,null,null,null,null,null,null,5.4,5.4,5.4,5.4,5.4,5.5,5.5]
[null,null,null,null,"Coincident",null,null,null,null,null,null,null,null,null,null,null,4.8,5,5,5.0999999999999996,5.0999999999999996,5.0999999999999996,5.2]
[null,null,"WEATHER CORRECTED MD 50% POE","MVA","Non-coincident",null,null,null,null,null,null,null,null,null,null,null,5.4,5.4,5.4,5.4,5.4,5.5,5.5]
[null,null,null,null,"Coincident",null,null,null,null,null,null,null,null,null,null,null,4.8,5,5,5.0999999999999996,5.0999999999999996,5.2,5.2]
[null,"Garbutt","CONNECTION POINT RATING","MVA","Non-coincident",null,null,null,null,null,null,null,null,null,null,null,228.6,228.6,228.6,228.6,228.6,228.6,228.6]
[null,null,null,null,"Coincident",null,null,null,null,null,null,null,null,null,null,null,228.6,228.6,228.6,228.6,228.6,228.6,228.6]
[null,null,"WINTER/SUMMER PEAKING",null,"Non-coincident",null,null,null,null,null,null,null,null,null,null,null,"Summer","Summer","Summer","Summer","Summer","Summer","Summer"]
[null,null,null,null,"Coincident",null,null,null,null,null,null,null,null,null,null,null,"Summer","Summer","Summer","Summer","Summer","Summer","Summer"]
[null,null,"ADJUSTMENTS - EMBEDDED GENERATION","MW","Non-coincident",null,null,null,null,null,null,null,null,null,null,null,"-","-","-","-","-","-","-"]
[null,null,null,null,"Coincident",null,null,null,null,null,null,null,null,null,null,null,23.9,23.9,23.9,23.9,23.9,23.9,23.9]
[null,null,"WEATHER CORRECTED MD 10% POE","MW","Non-coincident",null,null,null,null,null,null,null,null,null,null,null,91.1,91.5,87.4,88.2,88.8,89.8,90.9]
[null,null,null,null,"Coincident",null,null,null,null,null,null,null,null,null,null,null,76.7,79.3,75.7,77,78,79,80.099999999999994]
[null,null,"WEATHER CORRECTED MD 10% POE","MVA","Non-coincident",null,null,null,null,null,null,null,null,null,null,null,91.1,91.5,87.4,88.2,88.8,89.8,90.9]
[null,null,null,null,"Coincident",null,null,null,null,null,null,null,null,null,null,null,76.7,79.3,75.7,77.099999999999994,78.099999999999994,79.099999999999994,80.2]
[null,null,"WEATHER CORRECTED MD 50% POE","MW","Non-coincident",null,null,null,null,null,null,null,null,null,null,null,81.900000000000006,82.3,78.3,78.900000000000006,79.5,80.400000000000006,81.400000000000006]
[null,null,null,null,"Coincident",null,null,null,null,null,null,null,null,null,null,null,73,75.5,72.099999999999994,73.400000000000006,74.3,75.3,76.3]
[null,null,"WEATHER CORRECTED MD 50% POE","MVA","Non-coincident",null,null,null,null,null,null,null,null,null,null,null,81.900000000000006,82.3,78.3,78.900000000000006,79.599999999999994,80.400000000000006,81.400000000000006]
[null,null,null,null,"Coincident",null,null,null,null,null,null,null,null,null,null,null,73.099999999999994,75.599999999999994,72.099999999999994,73.400000000000006,74.400000000000006,75.3,76.400000000000006]
[null,"Gin Gin","CONNECTION POINT RATING","MVA","Non-coincident",null,null,null,null,null,null,null,null,null,null,null,548.70000000000005,548.70000000000005,548.70000000000005,548.70000000000005,548.70000000000005,548.70000000000005,548.70000000000005]
[null,null,null,null,"Coincident",null,null,null,null,null,null,null,null,null,null,null,548.70000000000005,548.70000000000005,548.70000000000005,548.70000000000005,548.70000000000005,548.70000000000005,548.70000000000005]
[null,null,"WINTER/SUMMER PEAKING",null,"Non-coincident",null,null,null,null,null,null,null,null,null,null,null,"Summer","Summer","Summer","Summer","Summer","Summer","Summer"]
[null,null,null,null,"Coincident",null,null,null,null,null,null,null,null,null,null,null,"Summer","Summer","Summer","Summer","Summer","Summer","Summer"]
[null,null,"ADJUSTMENTS - EMBEDDED GENERATION","MW","Non-coincident",null,null,null,null,null,null,null,null,null,null,null,"-","-","-","-","-","-","-"]
[null,null,null,null,"Coincident",null,null,null,null,null,null,null,null,null,null,null,"-","-","-","-","-","-","-"]
[null,null,"WEATHER CORRECTED MD 10% POE","MW","Non-coincident",null,null,null,null,null,null,null,null,null,null,null,126.5,127.8,129.6,130.9,131.80000000000001,132.80000000000001,134.19999999999999]
[null,null,null,null,"Coincident",null,null,null,null,null,null,null,null,null,null,null,110.4,114.8,116.8,119.2,120.6,121.8,123.2]
[null,null,"WEATHER CORRECTED MD 10% POE","MVA","Non-coincident",null,null,null,null,null,null,null,null,null,null,null,126.8,128.19999999999999,130,131.4,132.19999999999999,133.30000000000001,134.5]
[null,null,null,null,"Coincident",null,null,null,null,null,null,null,null,null,null,null,111.5,116,118.1,120.5,121.9,123.1,124.6]
[null,null,"WEATHER CORRECTED MD 50% POE","MW","Non-coincident",null,null,null,null,null,null,null,null,null,null,null,116.9,118.1,119.8,121,121.8,122.8,124]
[null,null,null,null,"Coincident",null,null,null,null,null,null,null,null,null,null,null,105.1,109.4,111.3,113.5,114.8,116,117.3]
[null,null,"WEATHER CORRECTED MD 50% POE","MVA","Non-coincident",null,null,null,null,null,null,null,null,null,null,null,117.1,118.4,120,121.3,122.1,123.1,124.3]
[null,null,null,null,"Coincident",null,null,null,null,null,null,null,null,null,null,null,106.3,110.5,112.5,114.7,116.1,117.3,118.6]
[null,"Gladstone South (Ergon 66/11)","CONNECTION POINT RATING","MVA","Non-coincident",null,null,null,null,null,null,null,null,null,null,null,236,236,236,236,236,236,236]
[null,null,null,null,"Coincident",null,null,null,null,null,null,null,null,null,null,null,236,236,236,236,236,236,236]
[null,null,"WINTER/SUMMER PEAKING",null,"Non-coincident",null,null,null,null,null,null,null,null,null,null,null,"Summer","Summer","Summer","Summer","Summer","Summer","Summer"]
[null,null,null,null,"Coincident",null,null,null,null,null,null,null,null,null,null,null,"Summer","Summer","Summer","Summer","Summer","Summer","Summer"]
[null,null,"ADJUSTMENTS - EMBEDDED GENERATION","MW","Non-coincident",null,null,null,null,null,null,null,null,null,null,null,"-","-","-","-","-","-","-"]
[null,null,null,null,"Coincident",null,null,null,null,null,null,null,null,null,null,null,"-","-","-","-","-","-","-"]
[null,null,"WEATHER CORRECTED MD 10% POE","MW","Non-coincident",null,null,null,null,null,null,null,null,null,null,null,38.799999999999997,38.799999999999997,38.9,39.1,39.200000000000003,39.5,39.9]
[null,null,null,null,"Coincident",null,null,null,null,null,null,null,null,null,null,null,32.9,33.9,34.1,34.6,34.9,35.299999999999997,35.700000000000003]
[null,null,"WEATHER CORRECTED MD 10% POE","MVA","Non-coincident",null,null,null,null,null,null,null,null,null,null,null,41.4,41.5,41.5,41.7,41.9,42.2,42.6]
[null,null,null,null,"Coincident",null,null,null,null,null,null,null,null,null,null,null,35.799999999999997,36.799999999999997,37,37.6,37.9,38.299999999999997,38.700000000000003]
[null,null,"WEATHER CORRECTED MD 50% POE","MW","Non-coincident",null,null,null,null,null,null,null,null,null,null,null,35.6,35.700000000000003,35.700000000000003,35.9,36,36.299999999999997,36.700000000000003]
[null,null,null,null,"Coincident",null,null,null,null,null,null,null,null,null,null,null,31.4,32.299999999999997,32.5,33,33.299999999999997,33.6,34]
[null,null,"WEATHER CORRECTED MD 50% POE","MVA","Non-coincident",null,null,null,null,null,null,null,null,null,null,null,38.1,38.1,38.200000000000003,38.299999999999997,38.5,38.799999999999997,39.1]
[null,null,null,null,"Coincident",null,null,null,null,null,null,null,null,null,null,null,33.9,34.9,35.1,35.6,35.9,36.200000000000003,36.6]
[null,"Gladstone South (QAL)","CONNECTION POINT RATING","MVA","Non-coincident",null,null,null,null,null,null,null,null,null,null,null,379.1,379.1,379.1,379.1,379.1,379.1,379.1]
[null,null,null,null,"Coincident",null,null,null,null,null,null,null,null,null,null,null,379.1,379.1,379.1,379.1,379.1,379.1,379.1]
[null,null,"WINTER/SUMMER PEAKING",null,"Non-coincident",null,null,null,null,null,null,null,null,null,null,null,"Summer","Summer","Summer","Summer","Summer","Summer","Summer"]
[null,null,null,null,"Coincident",null,null,null,null,null,null,null,null,null,null,null,"Summer","Summer","Summer","Summer","Summer","Summer","Summer"]
[null,null,"ADJUSTMENTS - EMBEDDED GENERATION","MW","Non-coincident",null,null,null,null,null,null,null,null,null,null,null,"-","-","-","-","-","-","-"]
[null,null,null,null,"Coincident",null,null,null,null,null,null,null,null,null,null,null,"-","-","-","-","-","-","-"]
[null,null,"WEATHER CORRECTED MD 10% POE","MW","Non-coincident"]
[null,null,null,null,"Coincident"]
[null,null,"WEATHER CORRECTED MD 10% POE","MVA","Non-coincident"]
[null,null,null,null,"Coincident"]
[null,null,"WEATHER CORRECTED MD 50% POE","MW","Non-coincident"]
[null,null,null,null,"Coincident"]
[null,null,"WEATHER CORRECTED MD 50% POE","MVA","Non-coincident"]
[null,null,null,null,"Coincident"]
[null,"Goodna","CONNECTION POINT RATING","MVA","Non-coincident",null,null,null,null,null,null,null,null,null,null,null,218,218,218,218,218,218,218]
[null,null,null,null,"Coincident",null,null,null,null,null,null,null,null,null,null,null,218,218,218,218,218,218,218]
[null,null,"WINTER/SUMMER PEAKING",null,"Non-coincident",null,null,null,null,null,null,null,null,null,null,null,"Summer","Summer","Summer","Summer","Summer","Summer","Summer"]
[null,null,null,null,"Coincident",null,null,null,null,null,null,null,null,null,null,null,"Summer","Summer","Summer","Summer","Summer","Summer","Summer"]
[null,null,"ADJUSTMENTS - EMBEDDED GENERATION","MW","Non-coincident",null,null,null,null,null,null,null,null,null,null,null,"-","-","-","-","-","-","-"]
[null,null,null,null,"Coincident",null,null,null,null,null,null,null,null,null,null,null,"-","-","-","-","-","-","-"]
[null,null,"WEATHER CORRECTED MD 10% POE","MW","Non-coincident",null,null,null,null,null,null,null,null,null,null,null,151.1,154.80000000000001,158.19999999999999,161.30000000000001,164,167.8,171.7]
[null,null,null,null,"Coincident",null,null,null,null,null,null,null,null,null,null,null,130.19999999999999,137.30000000000001,140.6,144.5,147.5,151.1,154.5]
[null,null,"WEATHER CORRECTED MD 10% POE","MVA","Non-coincident",null,null,null,null,null,null,null,null,null,null,null,152.4,156.1,159.5,162.6,165.3,169.1,173]
[null,null,null,null,"Coincident",null,null,null,null,null,null,null,null,null,null,null,132.19999999999999,140.4,142.6,146.6,150.6,154.19999999999999,157.6]
[null,null,"WEATHER CORRECTED MD 50% POE","MW","Non-coincident",null,null,null,null,null,null,null,null,null,null,null,133.6,136.80000000000001,139.6,142.1,144.30000000000001,147.5,150.69999999999999]
[null,null,null,null,"Coincident",null,null,null,null,null,null,null,null,null,null,null,124,130.69999999999999,133.9,137.6,140.5,143.9,147.19999999999999]
[null,null,"WEATHER CORRECTED MD 50% POE","MVA","Non-coincident",null,null,null,null,null,null,null,null,null,null,null,135.4,139.6,141.5,144,147.1,150.30000000000001,153.4]
[null,null,null,null,"Coincident",null,null,null,null,null,null,null,null,null,null,null,125.8,133.4,135.69999999999999,139.4,143.19999999999999,146.6,149.9]
[null,"Goonyella Riverside Mine","CONNECTION POINT RATING","MVA","Non-coincident",null,null,null,null,null,null,null,null,null,null,null,0,0,0,0,0,0,0]
[null,null,null,null,"Coincident",null,null,null,null,null,null,null,null,null,null,null,0,0,0,0,0,0,0]
[null,null,"WINTER/SUMMER PEAKING",null,"Non-coincident",null,null,null,null,null,null,null,null,null,null,null,"Summer","Summer","Summer","Summer","Summer","Summer","Summer"]
[null,null,null,null,"Coincident",null,null,null,null,null,null,null,null,null,null,null,"Summer","Summer","Summer","Summer","Summer","Summer","Summer"]
[null,null,"ADJUSTMENTS - EMBEDDED GENERATION","MW","Non-coincident",null,null,null,null,null,null,null,null,null,null,null,"-","-","-","-","-","-","-"]
[null,null,null,null,"Coincident",null,null,null,null,null,null,null,null,null,null,null,"-","-","-","-","-","-","-"]
[null,null,"WEATHER CORRECTED MD 10% POE","MW","Non-coincident"]
[null,null,null,null,"Coincident"]
[null,null,"WEATHER CORRECTED MD 10% POE","MVA","Non-coincident"]
[null,null,null,null,"Coincident"]
[null,null,"WEATHER CORRECTED MD 50% POE","MW","Non-coincident"]
[null,null,null,null,"Coincident"]
[null,null,"WEATHER CORRECTED MD 50% POE","MVA","Non-coincident"]
[null,null,null,null,"Coincident"]
[null,"Grantleigh (Rail)","CONNECTION POINT RATING","MVA","Non-coincident",null,null,null,null,null,null,null,null,null,null,null,63.7,63.7,63.7,63.7,63.7,63.7,63.7]
[null,null,null,null,"Coincident",null,null,null,null,null,null,null,null,null,null,null,63.7,63.7,63.7,63.7,63.7,63.7,63.7]
[null,null,"WINTER/SUMMER PEAKING",null,"Non-coincident",null,null,null,null,null,null,null,null,null,null,null,"Summer","Summer","Summer","Summer","Summer","Summer","Summer"]
[null,null,null,null,"Coincident",null,null,null,null,null,null,null,null,null,null,null,"Summer","Summer","Summer","Summer","Summer","Summer","Summer"]
[null,null,"ADJUSTMENTS - EMBEDDED GENERATION","MW","Non-coincident",null,null,null,null,null,null,null,null,null,null,null,"-","-","-","-","-","-","-"]
[null,null,null,null,"Coincident",null,null,null,null,null,null,null,null,null,null,null,"-","-","-","-","-","-","-"]
[null,null,"WEATHER CORRECTED MD 10% POE","MW","Non-coincident"]
[null,null,null,null,"Coincident"]
[null,null,"WEATHER CORRECTED MD 10% POE","MVA","Non-coincident"]
[null,null,null,null,"Coincident"]
[null,null,"WEATHER CORRECTED MD 50% POE","MW","Non-coincident"]
[null,null,null,null,"Coincident"]
[null,null,"WEATHER CORRECTED MD 50% POE","MVA","Non-coincident"]
[null,null,null,null,"Coincident"]
[null,"Gregory (Rail)","CONNECTION POINT RATING","MVA","Non-coincident",null,null,null,null,null,null,null,null,null,null,null,57,57,57,57,57,57,57]
[null,null,null,null,"Coincident",null,null,null,null,null,null,null,null,null,null,null,57,57,57,57,57,57,57]
[null,null,"WINTER/SUMMER PEAKING",null,"Non-coincident",null,null,null,null,null,null,null,null,null,null,null,"Summer","Summer","Summer","Summer","Summer","Summer","Summer"]
[null,null,null,null,"Coincident",null,null,null,null,null,null,null,null,null,null,null,"Summer","Summer","Summer","Summer","Summer","Summer","Summer"]
[null,null,"ADJUSTMENTS - EMBEDDED GENERATION","MW","Non-coincident",null,null,null,null,null,null,null,null,null,null,null,"-","-","-","-","-","-","-"]
[null,null,null,null,"Coincident",null,null,null,null,null,null,null,null,null,null,null,"-","-","-","-","-","-","-"]
[null,null,"WEATHER CORRECTED MD 10% POE","MW","Non-coincident"]
[null,null,null,null,"Coincident"]
[null,null,"WEATHER CORRECTED MD 10% POE","MVA","Non-coincident"]
[null,null,null,null,"Coincident"]
[null,null,"WEATHER CORRECTED MD 50% POE","MW","Non-coincident"]
[null,null,null,null,"Coincident"]
[null,null,"WEATHER CORRECTED MD 50% POE","MVA","Non-coincident"]
[null,null,null,null,"Coincident"]
[null,"Ingham","CONNECTION POINT RATING","MVA","Non-coincident",null,null,null,null,null,null,null,null,null,null,null,95,95,95,95,95,95,95]
[null,null,null,null,"Coincident",null,null,null,null,null,null,null,null,null,null,null,95,95,95,95,95,95,95]
[null,null,"WINTER/SUMMER PEAKING",null,"Non-coincident",null,null,null,null,null,null,null,null,null,null,null,"Summer","Summer","Summer","Summer","Summer","Summer","Summer"]
[null,null,null,null,"Coincident",null,null,null,null,null,null,null,null,null,null,null,"Summer","Summer","Summer","Summer","Summer","Summer","Summer"]
[null,null,"ADJUSTMENTS - EMBEDDED GENERATION","MW","Non-coincident",null,null,null,null,null,null,null,null,null,null,null,"-","-","-","-","-","-","-"]
[null,null,null,null,"Coincident",null,null,null,null,null,null,null,null,null,null,null,"-","-","-","-","-","-","-"]
[null,null,"WEATHER CORRECTED MD 10% POE","MW","Non-coincident",null,null,null,null,null,null,null,null,null,null,null,19.100000000000001,19,18.899999999999999,18.899999999999999,18.8,18.8,18.8]
[null,null,null,null,"Coincident",null,null,null,null,null,null,null,null,null,null,null,15.6,16,16,16.100000000000001,16.2,16.2,16.3]
[null,null,"WEATHER CORRECTED MD 10% POE","MVA","Non-coincident",null,null,null,null,null,null,null,null,null,null,null,19.399999999999999,19.3,19.2,19.2,19.100000000000001,19.100000000000001,19.100000000000001]
[null,null,null,null,"Coincident",null,null,null,null,null,null,null,null,null,null,null,15.8,16.2,16.100000000000001,16.3,16.3,16.399999999999999,16.399999999999999]
[null,null,"WEATHER CORRECTED MD 50% POE","MW","Non-coincident",null,null,null,null,null,null,null,null,null,null,null,16.7,16.600000000000001,16.5,16.5,16.5,16.5,16.5]
[null,null,null,null,"Coincident",null,null,null,null,null,null,null,null,null,null,null,14.9,15.2,15.2,15.4,15.4,15.4,15.5]
[null,null,"WEATHER CORRECTED MD 50% POE","MVA","Non-coincident",null,null,null,null,null,null,null,null,null,null,null,17,16.899999999999999,16.8,16.8,16.7,16.7,16.7]
[null,null,null,null,"Coincident",null,null,null,null,null,null,null,null,null,null,null,15,15.4,15.4,15.5,15.5,15.6,15.6]
[null,"Innisfail","CONNECTION POINT RATING","MVA","Non-coincident",null,null,null,null,null,null,null,null,null,null,null,100,100,100,100,100,100,100]
[null,null,null,null,"Coincident",null,null,null,null,null,null,null,null,null,null,null,100,100,100,100,100,100,100]
[null,null,"WINTER/SUMMER PEAKING",null,"Non-coincident",null,null,null,null,null,null,null,null,null,null,null,"Summer","Summer","Summer","Summer","Summer","Summer","Summer"]
[null,null,null,null,"Coincident",null,null,null,null,null,null,null,null,null,null,null,"Summer","Summer","Summer","Summer","Summer","Summer","Summer"]
[null,null,"ADJUSTMENTS - EMBEDDED GENERATION","MW","Non-coincident",null,null,null,null,null,null,null,null,null,null,null,"-","-","-","-","-","-","-"]
[null,null,null,null,"Coincident",null,null,null,null,null,null,null,null,null,null,null,"-","-","-","-","-","-","-"]
[null,null,"WEATHER CORRECTED MD 10% POE","MW","Non-coincident",null,null,null,null,null,null,null,null,null,null,null,26.4,26.4,26.4,26.5,26.6,26.7,26.8]
[null,null,null,null,"Coincident",null,null,null,null,null,null,null,null,null,null,null,23,23.6,23.8,24.1,24.2,24.4,24.5]
[null,null,"WEATHER CORRECTED MD 10% POE","MVA","Non-coincident",null,null,null,null,null,null,null,null,null,null,null,26.7,26.8,26.8,26.9,26.9,27,27.2]
[null,null,null,null,"Coincident",null,null,null,null,null,null,null,null,null,null,null,23.3,24,24.1,24.4,24.6,24.7,24.9]
[null,null,"WEATHER CORRECTED MD 50% POE","MW","Non-coincident",null,null,null,null,null,null,null,null,null,null,null,24.4,24.4,24.5,24.6,24.6,24.7,24.8]
[null,null,null,null,"Coincident",null,null,null,null,null,null,null,null,null,null,null,21.9,22.5,22.6,22.9,23.1,23.2,23.4]
[null,null,"WEATHER CORRECTED MD 50% POE","MVA","Non-coincident",null,null,null,null,null,null,null,null,null,null,null,24.8,24.8,24.8,24.9,24.9,25,25.2]
[null,null,null,null,"Coincident",null,null,null,null,null,null,null,null,null,null,null,22.2,22.8,22.9,23.2,23.4,23.5,23.7]
[null,"Invicta Load","CONNECTION POINT RATING","MVA","Non-coincident",null,null,null,null,null,null,null,null,null,null,null,0,0,0,0,0,0,0]
[null,null,null,null,"Coincident",null,null,null,null,null,null,null,null,null,null,null,0,0,0,0,0,0,0]
[null,null,"WINTER/SUMMER PEAKING",null,"Non-coincident",null,null,null,null,null,null,null,null,null,null,null,"Summer","Summer","Summer","Summer","Summer","Summer","Summer"]
[null,null,null,null,"Coincident",null,null,null,null,null,null,null,null,null,null,null,"Summer","Summer","Summer","Summer","Summer","Summer","Summer"]
[null,null,"ADJUSTMENTS - EMBEDDED GENERATION","MW","Non-coincident",null,null,null,null,null,null,null,null,null,null,null,"-","-","-","-","-","-","-"]
[null,null,null,null,"Coincident",null,null,null,null,null,null,null,null,null,null,null,"-","-","-","-","-","-","-"]
[null,null,"WEATHER CORRECTED MD 10% POE","MW","Non-coincident"]
[null,null,null,null,"Coincident"]
[null,null,"WEATHER CORRECTED MD 10% POE","MVA","Non-coincident"]
[null,null,null,null,"Coincident"]
[null,null,"WEATHER CORRECTED MD 50% POE","MW","Non-coincident"]
[null,null,null,null,"Coincident"]
[null,null,"WEATHER CORRECTED MD 50% POE","MVA","Non-coincident"]
[null,null,null,null,"Coincident"]
[null,"Kamerunga","CONNECTION POINT RATING","MVA","Non-coincident",null,null,null,null,null,null,null,null,null,null,null,116,116,116,116,116,116,116]
[null,null,null,null,"Coincident",null,null,null,null,null,null,null,null,null,null,null,116,116,116,116,116,116,116]
[null,null,"WINTER/SUMMER PEAKING",null,"Non-coincident",null,null,null,null,null,null,null,null,null,null,null,"Summer","Summer","Summer","Summer","Summer","Summer","Summer"]
[null,null,null,null,"Coincident",null,null,null,null,null,null,null,null,null,null,null,"Summer","Summer","Summer","Summer","Summer","Summer","Summer"]
[null,null,"ADJUSTMENTS - EMBEDDED GENERATION","MW","Non-coincident",null,null,null,null,null,null,null,null,null,null,null,"-","-","-","-","-","-","-"]
[null,null,null,null,"Coincident",null,null,null,null,null,null,null,null,null,null,null,"-","-","-","-","-","-","-"]
[null,null,"WEATHER CORRECTED MD 10% POE","MW","Non-coincident",null,null,null,null,null,null,null,null,null,null,null,54,54.4,54.9,55.6,56.1,56.7,57.4]
[null,null,null,null,"Coincident",null,null,null,null,null,null,null,null,null,null,null,45.1,46.8,47.4,48.4,49.2,49.8,50.5]
[null,null,"WEATHER CORRECTED MD 10% POE","MVA","Non-coincident",null,null,null,null,null,null,null,null,null,null,null,54,54.5,55,55.6,56.1,56.8,57.4]
[null,null,null,null,"Coincident",null,null,null,null,null,null,null,null,null,null,null,45.1,46.9,47.4,48.4,49.2,49.9,50.5]
[null,null,"WEATHER CORRECTED MD 50% POE","MW","Non-coincident",null,null,null,null,null,null,null,null,null,null,null,48,48.4,48.9,49.4,49.9,50.5,51.1]
[null,null,null,null,"Coincident",null,null,null,null,null,null,null,null,null,null,null,43,44.6,45.2,46.1,46.8,47.5,48.1]
[null,null,"WEATHER CORRECTED MD 50% POE","MVA","Non-coincident",null,null,null,null,null,null,null,null,null,null,null,48,48.5,48.9,49.5,50,50.5,51.1]
[null,null,null,null,"Coincident",null,null,null,null,null,null,null,null,null,null,null,43,44.6,45.2,46.1,46.9,47.5,48.1]
[null,"Kemmis","CONNECTION POINT RATING","MVA","Non-coincident",null,null,null,null,null,null,null,null,null,null,null,85,85,85,85,85,85,85]
[null,null,null,null,"Coincident",null,null,null,null,null,null,null,null,null,null,null,85,85,85,85,85,85,85]
[null,null,"WINTER/SUMMER PEAKING",null,"Non-coincident",null,null,null,null,null,null,null,null,null,null,null,"Summer","Summer","Summer","Summer","Summer","Summer","Summer"]
[null,null,null,null,"Coincident",null,null,null,null,null,null,null,null,null,null,null,"Summer","Summer","Summer","Summer","Summer","Summer","Summer"]
[null,null,"ADJUSTMENTS - EMBEDDED GENERATION","MW","Non-coincident",null,null,null,null,null,null,null,null,null,null,null,"-","-","-","-","-","-","-"]
[null,null,null,null,"Coincident",null,null,null,null,null,null,null,null,null,null,null,"-","-","-","-","-","-","-"]
[null,null,"WEATHER CORRECTED MD 10% POE","MW","Non-coincident"]
[null,null,null,null,"Coincident"]
[null,null,"WEATHER CORRECTED MD 10% POE","MVA","Non-coincident"]
[null,null,null,null,"Coincident"]
[null,null,"WEATHER CORRECTED MD 50% POE","MW","Non-coincident"]
[null,null,null,null,"Coincident"]
[null,null,"WEATHER CORRECTED MD 50% POE","MVA","Non-coincident"]
[null,null,null,null,"Coincident"]
[null,"King Creek","CONNECTION POINT RATING","MVA","Non-coincident",null,null,null,null,null,null,null,null,null,null,null,156.80000000000001,156.80000000000001,156.80000000000001,156.80000000000001,156.80000000000001,156.80000000000001,156.80000000000001]
[null,null,null,null,"Coincident",null,null,null,null,null,null,null,null,null,null,null,156.80000000000001,156.80000000000001,156.80000000000001,156.80000000000001,156.80000000000001,156.80000000000001,156.80000000000001]
[null,null,"WINTER/SUMMER PEAKING",null,"Non-coincident",null,null,null,null,null,null,null,null,null,null,null,"Summer","Summer","Summer","Summer","Summer","Summer","Summer"]
[null,null,null,null,"Coincident",null,null,null,null,null,null,null,null,null,null,null,"Summer","Summer","Summer","Summer","Summer","Summer","Summer"]
[null,null,"ADJUSTMENTS - EMBEDDED GENERATION","MW","Non-coincident",null,null,null,null,null,null,null,null,null,null,null,"-","-","-","-","-","-","-"]
[null,null,null,null,"Coincident",null,null,null,null,null,null,null,null,null,null,null,"-","-","-","-","-","-","-"]
[null,null,"WEATHER CORRECTED MD 10% POE","MW","Non-coincident"]
[null,null,null,null,"Coincident"]
[null,null,"WEATHER CORRECTED MD 10% POE","MVA","Non-coincident"]
[null,null,null,null,"Coincident"]
[null,null,"WEATHER CORRECTED MD 50% POE","MW","Non-coincident"]
[null,null,null,null,"Coincident"]
[null,null,"WEATHER CORRECTED MD 50% POE","MVA","Non-coincident"]
[null,null,null,null,"Coincident"]
[null,"Lilyvale (132)","CONNECTION POINT RATING","MVA","Non-coincident",null,null,null,null,null,null,null,null,null,null,null,182.9,182.9,182.9,182.9,182.9,182.9,182.9]
[null,null,null,null,"Coincident",null,null,null,null,null,null,null,null,null,null,null,182.9,182.9,182.9,182.9,182.9,182.9,182.9]
[null,null,"WINTER/SUMMER PEAKING",null,"Non-coincident",null,null,null,null,null,null,null,null,null,null,null,"Summer","Summer","Summer","Summer","Summer","Summer","Summer"]
[null,null,null,null,"Coincident",null,null,null,null,null,null,null,null,null,null,null,"Summer","Summer","Summer","Summer","Summer","Summer","Summer"]
[null,null,"ADJUSTMENTS - EMBEDDED GENERATION","MW","Non-coincident",null,null,null,null,null,null,null,null,null,null,null,29.3,29.3,29.3,29.3,29.3,29.3,29.3]
[null,null,null,null,"Coincident",null,null,null,null,null,null,null,null,null,null,null,45.5,45.5,45.5,45.5,45.5,45.5,45.5]
[null,null,"WEATHER CORRECTED MD 10% POE","MW","Non-coincident",null,null,null,null,null,null,null,null,null,null,null,51.6,51.5,51.5,51.6,51.6,51.7,51.9]
[null,null,null,null,"Coincident",null,null,null,null,null,null,null,null,null,null,null,45.6,46.9,47,47.6,47.8,48,48.2]
[null,null,"WEATHER CORRECTED MD 10% POE","MVA","Non-coincident",null,null,null,null,null,null,null,null,null,null,null,51.8,51.7,51.7,51.8,51.8,51.9,52]
[null,null,null,null,"Coincident",null,null,null,null,null,null,null,null,null,null,null,45.8,47,47.2,47.7,48,48.2,48.4]
[null,null,"WEATHER CORRECTED MD 50% POE","MW","Non-coincident",null,null,null,null,null,null,null,null,null,null,null,47.8,47.7,47.7,47.8,47.8,47.9,48.1]
[null,null,null,null,"Coincident",null,null,null,null,null,null,null,null,null,null,null,43.5,44.6,44.8,45.3,45.6,45.8,45.9]
[null,null,"WEATHER CORRECTED MD 50% POE","MVA","Non-coincident",null,null,null,null,null,null,null,null,null,null,null,48,47.9,47.9,48,48,48.1,48.2]
[null,null,null,null,"Coincident",null,null,null,null,null,null,null,null,null,null,null,43.6,44.8,44.9,45.4,45.7,45.9,46.1]
[null,"Lilyvale (66)","CONNECTION POINT RATING","MVA","Non-coincident",null,null,null,null,null,null,null,null,null,null,null,269,269,269,413,413,413,413]
[null,null,null,null,"Coincident",null,null,null,null,null,null,null,null,null,null,null,269,269,269,413,413,413,413]
[null,null,"WINTER/SUMMER PEAKING",null,"Non-coincident",null,null,null,null,null,null,null,null,null,null,null,"Summer","Summer","Summer","Summer","Summer","Summer","Summer"]
[null,null,null,null,"Coincident",null,null,null,null,null,null,null,null,null,null,null,"Summer","Summer","Summer","Summer","Summer","Summer","Summer"]
[null,null,"ADJUSTMENTS - EMBEDDED GENERATION","MW","Non-coincident",null,null,null,null,null,null,null,null,null,null,null,"-","-","-","-","-","-","-"]
[null,null,null,null,"Coincident",null,null,null,null,null,null,null,null,null,null,null,35.5,35.5,35.5,35.5,35.5,35.5,35.5]
[null,null,"WEATHER CORRECTED MD 10% POE","MW","Non-coincident",null,null,null,null,null,null,null,null,null,null,null,142.1,142.1,142.19999999999999,142.69999999999999,142.9,143.30000000000001,143.69999999999999]
[null,null,null,null,"Coincident",null,null,null,null,null,null,null,null,null,null,null,129.1,132.9,133.5,135.30000000000001,136.19999999999999,136.9,137.4]
[null,null,"WEATHER CORRECTED MD 10% POE","MVA","Non-coincident",null,null,null,null,null,null,null,null,null,null,null,150.69999999999999,150.69999999999999,150.80000000000001,151.4,151.6,152,152.5]
[null,null,null,null,"Coincident",null,null,null,null,null,null,null,null,null,null,null,138.5,142.6,143.1,145.1,146,146.80000000000001,147.4]
[null,null,"WEATHER CORRECTED MD 50% POE","MW","Non-coincident",null,null,null,null,null,null,null,null,null,null,null,135.30000000000001,135.30000000000001,135.4,135.9,136.1,136.5,136.9]
[null,null,null,null,"Coincident",null,null,null,null,null,null,null,null,null,null,null,123,126.6,127.1,128.80000000000001,129.69999999999999,130.30000000000001,130.9]
[null,null,"WEATHER CORRECTED MD 50% POE","MVA","Non-coincident",null,null,null,null,null,null,null,null,null,null,null,143.5,143.5,143.6,144.19999999999999,144.4,144.80000000000001,145.19999999999999]
[null,null,null,null,"Coincident",null,null,null,null,null,null,null,null,null,null,null,131.19999999999999,135.1,135.69999999999999,137.5,138.4,139.1,139.69999999999999]
[null,"Loganlea (110)","CONNECTION POINT RATING","MVA","Non-coincident",null,null,null,null,null,null,null,null,null,null,null,1805.6,1805.6,1805.6,1805.6,1805.6,1805.6,1805.6]
[null,null,null,null,"Coincident",null,null,null,null,null,null,null,null,null,null,null,1805.6,1805.6,1805.6,1805.6,1805.6,1805.6,1805.6]
[null,null,"WINTER/SUMMER PEAKING",null,"Non-coincident",null,null,null,null,null,null,null,null,null,null,null,"Summer","Summer","Summer","Summer","Summer","Summer","Summer"]
[null,null,null,null,"Coincident",null,null,null,null,null,null,null,null,null,null,null,"Summer","Summer","Summer","Summer","Summer","Summer","Summer"]
[null,null,"ADJUSTMENTS - EMBEDDED GENERATION","MW","Non-coincident",null,null,null,null,null,null,null,null,null,null,null,"-","-","-","-","-","-","-"]
[null,null,null,null,"Coincident",null,null,null,null,null,null,null,null,null,null,null,"-","-","-","-","-","-","-"]
[null,null,"WEATHER CORRECTED MD 10% POE","MW","Non-coincident",null,null,null,null,null,null,null,null,null,null,null,500.8,504.6,508.2,511.2,512.6,517.4,523.20000000000005]
[null,null,null,null,"Coincident",null,null,null,null,null,null,null,null,null,null,null,429.5,445.7,450.5,457.6,461.1,466.4,472.5]
[null,null,"WEATHER CORRECTED MD 10% POE","MVA","Non-coincident",null,null,null,null,null,null,null,null,null,null,null,517.5,521.79999999999995,525.4,528.6,530.1,535,541.1]
[null,null,null,null,"Coincident",null,null,null,null,null,null,null,null,null,null,null,445.2,462.4,467.6,474.7,478.1,483.7,490]
[null,null,"WEATHER CORRECTED MD 50% POE","MW","Non-coincident",null,null,null,null,null,null,null,null,null,null,null,440.6,444.2,447.4,450.1,451.2,455.4,460.6]
[null,null,null,null,"Coincident",null,null,null,null,null,null,null,null,null,null,null,409.1,424.5,429,435.8,439.2,444.2,450]
[null,null,"WEATHER CORRECTED MD 50% POE","MVA","Non-coincident",null,null,null,null,null,null,null,null,null,null,null,455.3,459.4,462.8,465.4,466.4,470.7,476.2]
[null,null,null,null,"Coincident",null,null,null,null,null,null,null,null,null,null,null,422.8,439.1,444,450.7,454,459.3,465.3]
[null,"Loganlea (33)","CONNECTION POINT RATING","MVA","Non-coincident",null,null,null,null,null,null,null,null,null,null,null,313.3,313.3,313.3,229.7,229.7,229.7,229.7]
[null,null,null,null,"Coincident",null,null,null,null,null,null,null,null,null,null,null,313.3,313.3,313.3,229.7,229.7,229.7,229.7]
[null,null,"WINTER/SUMMER PEAKING",null,"Non-coincident",null,null,null,null,null,null,null,null,null,null,null,"Summer","Summer","Summer","Summer","Summer","Summer","Summer"]
[null,null,null,null,"Coincident",null,null,null,null,null,null,null,null,null,null,null,"Summer","Summer","Summer","Summer","Summer","Summer","Summer"]
[null,null,"ADJUSTMENTS - EMBEDDED GENERATION","MW","Non-coincident",null,null,null,null,null,null,null,null,null,null,null,"-","-","-","-","-","-","-"]
[null,null,null,null,"Coincident",null,null,null,null,null,null,null,null,null,null,null,"-","-","-","-","-","-","-"]
[null,null,"WEATHER CORRECTED MD 10% POE","MW","Non-coincident",null,null,null,null,null,null,null,null,null,null,null,110.8,107.9,107.6,107.3,106.8,106.7,106.7]
[null,null,null,null,"Coincident",null,null,null,null,null,null,null,null,null,null,null,96.3,96.3,96.3,96.9,97,97.2,97.2]
[null,null,"WEATHER CORRECTED MD 10% POE","MVA","Non-coincident",null,null,null,null,null,null,null,null,null,null,null,113.3,110.2,109.9,109.6,109,109,108.9]
[null,null,null,null,"Coincident",null,null,null,null,null,null,null,null,null,null,null,99.8,99.6,99.7,100.4,100.4,100.6,100.6]
[null,null,"WEATHER CORRECTED MD 50% POE","MW","Non-coincident",null,null,null,null,null,null,null,null,null,null,null,98.7,95.9,95.6,95.3,94.9,94.8,94.8]
[null,null,null,null,"Coincident",null,null,null,null,null,null,null,null,null,null,null,91.7,91.7,91.7,92.3,92.4,92.5,92.6]
[null,null,"WEATHER CORRECTED MD 50% POE","MVA","Non-coincident",null,null,null,null,null,null,null,null,null,null,null,102.1,99,98.7,98.4,97.9,97.9,97.8]
[null,null,null,null,"Coincident",null,null,null,null,null,null,null,null,null,null,null,94.8,94.6,94.7,95.3,95.3,95.5,95.6]
[null,"Mackay","CONNECTION POINT RATING","MVA","Non-coincident",null,null,null,null,null,null,null,null,null,null,null,302.3,302.3,302.3,302.3,302.3,302.3,302.3]
[null,null,null,null,"Coincident",null,null,null,null,null,null,null,null,null,null,null,302.3,302.3,302.3,302.3,302.3,302.3,302.3]
[null,null,"WINTER/SUMMER PEAKING",null,"Non-coincident",null,null,null,null,null,null,null,null,null,null,null,"Summer","Summer","Summer","Summer","Summer","Summer","Summer"]
[null,null,null,null,"Coincident",null,null,null,null,null,null,null,null,null,null,null,"Summer","Summer","Summer","Summer","Summer","Summer","Summer"]
[null,null,"ADJUSTMENTS - EMBEDDED GENERATION","MW","Non-coincident",null,null,null,null,null,null,null,null,null,null,null,"-","-","-","-","-","-","-"]
[null,null,null,null,"Coincident",null,null,null,null,null,null,null,null,null,null,null,"-","-","-","-","-","-","-"]
[null,null,"WEATHER CORRECTED MD 10% POE","MW","Non-coincident",null,null,null,null,null,null,null,null,null,null,null,59.7,59.3,59.1,59.1,59,59.1,59.3]
[null,null,null,null,"Coincident",null,null,null,null,null,null,null,null,null,null,null,50.8,52,52,52.5,52.7,52.9,53.1]
[null,null,"WEATHER CORRECTED MD 10% POE","MVA","Non-coincident",null,null,null,null,null,null,null,null,null,null,null,59.9,59.5,59.3,59.3,59.3,59.3,59.5]
[null,null,null,null,"Coincident",null,null,null,null,null,null,null,null,null,null,null,50.9,52,52,52.5,52.7,52.9,53.2]
[null,null,"WEATHER CORRECTED MD 50% POE","MW","Non-coincident",null,null,null,null,null,null,null,null,null,null,null,54.1,53.8,53.5,53.5,53.5,53.6,53.8]
[null,null,null,null,"Coincident",null,null,null,null,null,null,null,null,null,null,null,48.4,49.5,49.5,50,50.2,50.4,50.6]
[null,null,"WEATHER CORRECTED MD 50% POE","MVA","Non-coincident",null,null,null,null,null,null,null,null,null,null,null,54.4,54.1,53.9,53.9,53.8,53.9,54.1]
[null,null,null,null,"Coincident",null,null,null,null,null,null,null,null,null,null,null,48.4,49.5,49.5,50,50.2,50.4,50.6]
[null,"Middle Ridge (Energex)","CONNECTION POINT RATING","MVA","Non-coincident",null,null,null,null,null,null,null,null,null,null,null,380.1,380.1,380.1,380.1,380.1,380.1,380.1]
[null,null,null,null,"Coincident",null,null,null,null,null,null,null,null,null,null,null,380.1,380.1,380.1,380.1,380.1,380.1,380.1]
[null,null,"WINTER/SUMMER PEAKING",null,"Non-coincident",null,null,null,null,null,null,null,null,null,null,null,"Summer","Summer","Summer","Summer","Summer","Summer","Summer"]
[null,null,null,null,"Coincident",null,null,null,null,null,null,null,null,null,null,null,"Summer","Summer","Summer","Summer","Summer","Summer","Summer"]
[null,null,"ADJUSTMENTS - EMBEDDED GENERATION","MW","Non-coincident",null,null,null,null,null,null,null,null,null,null,null,"-","-","-","-","-","-","-"]
[null,null,null,null,"Coincident",null,null,null,null,null,null,null,null,null,null,null,"-","-","-","-","-","-","-"]
[null,null,"WEATHER CORRECTED MD 10% POE","MW","Non-coincident",null,null,null,null,null,null,null,null,null,null,null,52.7,53.5,53.6,53.6,53.5,53.5,53.5]
[null,null,null,null,"Coincident",null,null,null,null,null,null,null,null,null,null,null,39.200000000000003,41.1,41.3,41.7,41.9,42,42.1]
[null,null,"WEATHER CORRECTED MD 10% POE","MVA","Non-coincident",null,null,null,null,null,null,null,null,null,null,null,53.4,54.3,54.4,54.4,54.3,54.3,54.3]
[null,null,null,null,"Coincident",null,null,null,null,null,null,null,null,null,null,null,40.799999999999997,42.9,43.1,43.5,43.7,43.8,43.9]
[null,null,"WEATHER CORRECTED MD 50% POE","MW","Non-coincident",null,null,null,null,null,null,null,null,null,null,null,47.5,48.4,48.5,48.4,48.3,48.3,48.3]
[null,null,null,null,"Coincident",null,null,null,null,null,null,null,null,null,null,null,37.299999999999997,39.200000000000003,39.299999999999997,39.700000000000003,39.9,40,40.1]
[null,null,"WEATHER CORRECTED MD 50% POE","MVA","Non-coincident",null,null,null,null,null,null,null,null,null,null,null,48.2,49.1,49.2,49.2,49.1,49.1,49.1]
[null,null,null,null,"Coincident",null,null,null,null,null,null,null,null,null,null,null,38.799999999999997,40.799999999999997,41,41.4,41.5,41.6,41.7]
[null,"Middle Ridge (Ergon)","CONNECTION POINT RATING","MVA","Non-coincident",null,null,null,null,null,null,null,null,null,null,null,1673.8,1673.8,1673.8,1673.8,1673.8,1673.8,1673.8]
[null,null,null,null,"Coincident",null,null,null,null,null,null,null,null,null,null,null,1673.8,1673.8,1673.8,1673.8,1673.8,1673.8,1673.8]
[null,null,"WINTER/SUMMER PEAKING",null,"Non-coincident",null,null,null,null,null,null,null,null,null,null,null,"Summer","Summer","Summer","Summer","Summer","Summer","Summer"]
[null,null,null,null,"Coincident",null,null,null,null,null,null,null,null,null,null,null,"Summer","Summer","Summer","Summer","Summer","Summer","Summer"]
[null,null,"ADJUSTMENTS - EMBEDDED GENERATION","MW","Non-coincident",null,null,null,null,null,null,null,null,null,null,null,"-","-","-","-","-","-","-"]
[null,null,null,null,"Coincident",null,null,null,null,null,null,null,null,null,null,null,63.2,63.2,63.2,63.2,63.2,63.2,63.2]
[null,null,"WEATHER CORRECTED MD 10% POE","MW","Non-coincident",null,null,null,null,null,null,null,null,null,null,null,256.5,256.3,257,258.39999999999998,259.7,261.7,264.2]
[null,null,null,null,"Coincident",null,null,null,null,null,null,null,null,null,null,null,243.7,250.6,252.2,256,258.60000000000002,261.10000000000002,264]
[null,null,"WEATHER CORRECTED MD 10% POE","MVA","Non-coincident",null,null,null,null,null,null,null,null,null,null,null,262.8,262.7,263.39999999999998,264.8,266.2,268.2,270.8]
[null,null,null,null,"Coincident",null,null,null,null,null,null,null,null,null,null,null,251.5,258.7,260.3,264.2,266.89999999999998,269.5,272.5]
[null,null,"WEATHER CORRECTED MD 50% POE","MW","Non-coincident",null,null,null,null,null,null,null,null,null,null,null,229.8,229.7,230.3,231.5,232.7,234.4,236.7]
[null,null,null,null,"Coincident",null,null,null,null,null,null,null,null,null,null,null,232.1,238.7,240.2,243.8,246.3,248.7,251.5]
[null,null,"WEATHER CORRECTED MD 50% POE","MVA","Non-coincident",null,null,null,null,null,null,null,null,null,null,null,236.1,236,236.6,237.9,239.1,240.9,243.3]
[null,null,null,null,"Coincident",null,null,null,null,null,null,null,null,null,null,null,238.9,245.8,247.3,251,253.6,256.10000000000002,258.89999999999998]
[null,"Mindi (Rail)","CONNECTION POINT RATING","MVA","Non-coincident",null,null,null,null,null,null,null,null,null,null,null,129.19999999999999,129.19999999999999,129.19999999999999,129.19999999999999,129.19999999999999,129.19999999999999,129.19999999999999]
[null,null,null,null,"Coincident",null,null,null,null,null,null,null,null,null,null,null,129.19999999999999,129.19999999999999,129.19999999999999,129.19999999999999,129.19999999999999,129.19999999999999,129.19999999999999]
[null,null,"WINTER/SUMMER PEAKING",null,"Non-coincident",null,null,null,null,null,null,null,null,null,null,null,"Summer","Summer","Summer","Summer","Summer","Summer","Summer"]
[null,null,null,null,"Coincident",null,null,null,null,null,null,null,null,null,null,null,"Summer","Summer","Summer","Summer","Summer","Summer","Summer"]
[null,null,"ADJUSTMENTS - EMBEDDED GENERATION","MW","Non-coincident",null,null,null,null,null,null,null,null,null,null,null,"-","-","-","-","-","-","-"]
[null,null,null,null,"Coincident",null,null,null,null,null,null,null,null,null,null,null,"-","-","-","-","-","-","-"]
[null,null,"WEATHER CORRECTED MD 10% POE","MW","Non-coincident"]
[null,null,null,null,"Coincident"]
[null,null,"WEATHER CORRECTED MD 10% POE","MVA","Non-coincident"]
[null,null,null,null,"Coincident"]
[null,null,"WEATHER CORRECTED MD 50% POE","MW","Non-coincident"]
[null,null,null,null,"Coincident"]
[null,null,"WEATHER CORRECTED MD 50% POE","MVA","Non-coincident"]
[null,null,null,null,"Coincident"]
[null,"Molendinar","CONNECTION POINT RATING","MVA","Non-coincident",null,null,null,null,null,null,null,null,null,null,null,850.9,850.9,850.9,850.9,850.9,850.9,850.9]
[null,null,null,null,"Coincident",null,null,null,null,null,null,null,null,null,null,null,850.9,850.9,850.9,850.9,850.9,850.9,850.9]
[null,null,"WINTER/SUMMER PEAKING",null,"Non-coincident",null,null,null,null,null,null,null,null,null,null,null,"Summer","Summer","Summer","Summer","Summer","Summer","Summer"]
[null,null,null,null,"Coincident",null,null,null,null,null,null,null,null,null,null,null,"Summer","Summer","Summer","Summer","Summer","Summer","Summer"]
[null,null,"ADJUSTMENTS - EMBEDDED GENERATION","MW","Non-coincident",null,null,null,null,null,null,null,null,null,null,null,"-","-","-","-","-","-","-"]
[null,null,null,null,"Coincident",null,null,null,null,null,null,null,null,null,null,null,"-","-","-","-","-","-","-"]
[null,null,"WEATHER CORRECTED MD 10% POE","MW","Non-coincident",null,null,null,null,null,null,null,null,null,null,null,601.70000000000005,604,610.5,614.20000000000005,618.29999999999995,622.20000000000005,625.70000000000005]
[null,null,null,null,"Coincident",null,null,null,null,null,null,null,null,null,null,null,512,529,536.70000000000005,545.1,551.9,556.5,560.4]
[null,null,"WEATHER CORRECTED MD 10% POE","MVA","Non-coincident",null,null,null,null,null,null,null,null,null,null,null,614.20000000000005,616.6,623.29999999999995,627,631.29999999999995,635.29999999999995,638.9]
[null,null,null,null,"Coincident",null,null,null,null,null,null,null,null,null,null,null,525.70000000000005,543.1,549.79999999999995,558.29999999999995,565.29999999999995,570.1,574.1]
[null,null,"WEATHER CORRECTED MD 50% POE","MW","Non-coincident",null,null,null,null,null,null,null,null,null,null,null,524.4,526.29999999999995,532.1,535.29999999999995,539.1,542.5,545.5]
[null,null,null,null,"Coincident",null,null,null,null,null,null,null,null,null,null,null,487.6,503.8,511.2,519.1,525.6,530,533.70000000000005]
[null,null,"WEATHER CORRECTED MD 50% POE","MVA","Non-coincident",null,null,null,null,null,null,null,null,null,null,null,537.20000000000005,539.20000000000005,544,547.20000000000005,551.20000000000005,554.6,557.70000000000005]
[null,null,null,null,"Coincident",null,null,null,null,null,null,null,null,null,null,null,499.5,516.1,522.6,530.70000000000005,537.4,541.9,545.6]
[null,"Moranbah (11)","CONNECTION POINT RATING","MVA","Non-coincident",null,null,null,null,null,null,null,null,null,null,null,45,45,45,45,45,45,45]
[null,null,null,null,"Coincident",null,null,null,null,null,null,null,null,null,null,null,45,45,45,45,45,45,45]
[null,null,"WINTER/SUMMER PEAKING",null,"Non-coincident",null,null,null,null,null,null,null,null,null,null,null,"Summer","Summer","Summer","Summer","Summer","Summer","Summer"]
[null,null,null,null,"Coincident",null,null,null,null,null,null,null,null,null,null,null,"Summer","Summer","Summer","Summer","Summer","Summer","Summer"]
[null,null,"ADJUSTMENTS - EMBEDDED GENERATION","MW","Non-coincident",null,null,null,null,null,null,null,null,null,null,null,3.8,3.8,3.8,3.8,3.8,3.8,3.8]
[null,null,null,null,"Coincident",null,null,null,null,null,null,null,null,null,null,null,"-","-","-","-","-","-","-"]
[null,null,"WEATHER CORRECTED MD 10% POE","MW","Non-coincident",null,null,null,null,null,null,null,null,null,null,null,22.3,22.5,22.7,22.9,23.1,23.3,23.6]
[null,null,null,null,"Coincident",null,null,null,null,null,null,null,null,null,null,null,19.5,20.2,20.5,20.9,21.2,21.4,21.7]
[null,null,"WEATHER CORRECTED MD 10% POE","MVA","Non-coincident",null,null,null,null,null,null,null,null,null,null,null,22.5,22.7,22.9,23.1,23.3,23.6,23.8]
[null,null,null,null,"Coincident",null,null,null,null,null,null,null,null,null,null,null,19.7,20.5,20.7,21.1,21.4,21.7,22]
[null,null,"WEATHER CORRECTED MD 50% POE","MW","Non-coincident",null,null,null,null,null,null,null,null,null,null,null,20.8,20.9,21.1,21.3,21.5,21.7,21.9]
[null,null,null,null,"Coincident",null,null,null,null,null,null,null,null,null,null,null,18.600000000000001,19.3,19.5,19.899999999999999,20.2,20.399999999999999,20.7]
[null,null,"WEATHER CORRECTED MD 50% POE","MVA","Non-coincident",null,null,null,null,null,null,null,null,null,null,null,21,21.1,21.3,21.5,21.7,21.9,22.2]
[null,null,null,null,"Coincident",null,null,null,null,null,null,null,null,null,null,null,18.8,19.5,19.7,20.100000000000001,20.399999999999999,20.6,20.9]
[null,"Moranbah (66)","CONNECTION POINT RATING","MVA","Non-coincident",null,null,null,null,null,null,null,null,null,null,null,148.6,148.6,148.6,148.6,148.6,148.6,148.6]
[null,null,null,null,"Coincident",null,null,null,null,null,null,null,null,null,null,null,148.6,148.6,148.6,148.6,148.6,148.6,148.6]
[null,null,"WINTER/SUMMER PEAKING",null,"Non-coincident",null,null,null,null,null,null,null,null,null,null,null,"Summer","Summer","Summer","Summer","Summer","Summer","Summer"]
[null,null,null,null,"Coincident",null,null,null,null,null,null,null,null,null,null,null,"Summer","Summer","Summer","Summer","Summer","Summer","Summer"]
[null,null,"ADJUSTMENTS - EMBEDDED GENERATION","MW","Non-coincident",null,null,null,null,null,null,null,null,null,null,null,"-","-","-","-","-","-","-"]
[null,null,null,null,"Coincident",null,null,null,null,null,null,null,null,null,null,null,"-","-","-","-","-","-","-"]
[null,null,"WEATHER CORRECTED MD 10% POE","MW","Non-coincident",null,null,null,null,null,null,null,null,null,null,null,103.9,115.9,127.9,128.4,128.6,128.9,129.1]
[null,null,null,null,"Coincident",null,null,null,null,null,null,null,null,null,null,null,95.2,106.5,115.3,116.9,117.7,118.2,118.6]
[null,null,"WEATHER CORRECTED MD 10% POE","MVA","Non-coincident",null,null,null,null,null,null,null,null,null,null,null,114.4,126.2,138.1,138.6,138.80000000000001,139.19999999999999,139.4]
[null,null,null,null,"Coincident",null,null,null,null,null,null,null,null,null,null,null,105.7,117.1,125.9,127.6,128.4,129,129.4]
[null,null,"WEATHER CORRECTED MD 50% POE","MW","Non-coincident",null,null,null,null,null,null,null,null,null,null,null,101.3,110.1,118.8,119.3,119.5,119.8,120]
[null,null,null,null,"Coincident",null,null,null,null,null,null,null,null,null,null,null,90.7,101.4,109.8,111.3,112.1,112.6,112.9]
[null,null,"WEATHER CORRECTED MD 50% POE","MVA","Non-coincident",null,null,null,null,null,null,null,null,null,null,null,111.6,120.2,128.80000000000001,129.4,129.5,129.80000000000001,130.1]
[null,null,null,null,"Coincident",null,null,null,null,null,null,null,null,null,null,null,99.9,110.7,119.1,120.7,121.5,122.1,122.4]
[null,"Moranbah (Broadlea)","CONNECTION POINT RATING","MVA","Non-coincident",null,null,null,null,null,null,null,null,null,null,null,228.6,228.6,228.6,228.6,228.6,228.6,228.6]
[null,null,null,null,"Coincident",null,null,null,null,null,null,null,null,null,null,null,228.6,228.6,228.6,228.6,228.6,228.6,228.6]
[null,null,"WINTER/SUMMER PEAKING",null,"Non-coincident",null,null,null,null,null,null,null,null,null,null,null,"Summer","Summer","Summer","Summer","Summer","Summer","Summer"]
[null,null,null,null,"Coincident",null,null,null,null,null,null,null,null,null,null,null,"Summer","Summer","Summer","Summer","Summer","Summer","Summer"]
[null,null,"ADJUSTMENTS - EMBEDDED GENERATION","MW","Non-coincident",null,null,null,null,null,null,null,null,null,null,null,"-","-","-","-","-","-","-"]
[null,null,null,null,"Coincident",null,null,null,null,null,null,null,null,null,null,null,"-","-","-","-","-","-","-"]
[null,null,"WEATHER CORRECTED MD 10% POE","MW","Non-coincident",null,null,null,null,null,null,null,null,null,null,null,36.9,44.7,52.5,52.7,52.7,52.9,53]
[null,null,null,null,"Coincident",null,null,null,null,null,null,null,null,null,null,null,33.9,42.4,50,50.7,51.1,51.3,51.4]
[null,null,"WEATHER CORRECTED MD 10% POE","MVA","Non-coincident",null,null,null,null,null,null,null,null,null,null,null,37.6,45.6,53.7,53.9,54,54.1,54.2]
[null,null,null,null,"Coincident",null,null,null,null,null,null,null,null,null,null,null,34.5,43.3,51.3,52,52.4,52.6,52.8]
[null,null,"WEATHER CORRECTED MD 50% POE","MW","Non-coincident",null,null,null,null,null,null,null,null,null,null,null,36,43.8,51.6,51.8,51.8,52,52]
[null,null,null,null,"Coincident",null,null,null,null,null,null,null,null,null,null,null,32.200000000000003,40.299999999999997,47.7,48.3,48.6,48.8,49]
[null,null,"WEATHER CORRECTED MD 50% POE","MVA","Non-coincident",null,null,null,null,null,null,null,null,null,null,null,36.6,44.7,52.8,53,53.1,53.2,53.3]
[null,null,null,null,"Coincident",null,null,null,null,null,null,null,null,null,null,null,32.799999999999997,41.2,48.8,49.4,49.8,50,50.1]
[null,"Moura (66/11)","CONNECTION POINT RATING","MVA","Non-coincident",null,null,null,null,null,null,null,null,null,null,null,125.7,125.7,125.7,125.7,125.7,125.7,125.7]
[null,null,null,null,"Coincident",null,null,null,null,null,null,null,null,null,null,null,125.7,125.7,125.7,125.7,125.7,125.7,125.7]
[null,null,"WINTER/SUMMER PEAKING",null,"Non-coincident",null,null,null,null,null,null,null,null,null,null,null,"Summer","Summer","Summer","Summer","Summer","Summer","Summer"]
[null,null,null,null,"Coincident",null,null,null,null,null,null,null,null,null,null,null,"Summer","Summer","Summer","Summer","Summer","Summer","Summer"]
[null,null,"ADJUSTMENTS - EMBEDDED GENERATION","MW","Non-coincident",null,null,null,null,null,null,null,null,null,null,null,"-","-","-","-","-","-","-"]
[null,null,null,null,"Coincident",null,null,null,null,null,null,null,null,null,null,null,"-","-","-","-","-","-","-"]
[null,null,"WEATHER CORRECTED MD 10% POE","MW","Non-coincident",null,null,null,null,null,null,null,null,null,null,null,56.6,56.5,56.5,56.6,56.5,56.6,56.7]
[null,null,null,null,"Coincident",null,null,null,null,null,null,null,null,null,null,null,51.8,53.2,53.4,54,54.2,54.4,54.6]
[null,null,"WEATHER CORRECTED MD 10% POE","MVA","Non-coincident",null,null,null,null,null,null,null,null,null,null,null,59.5,59.4,59.4,59.5,59.5,59.5,59.7]
[null,null,null,null,"Coincident",null,null,null,null,null,null,null,null,null,null,null,54.7,56.3,56.5,57.1,57.4,57.6,57.8]
[null,null,"WEATHER CORRECTED MD 50% POE","MW","Non-coincident",null,null,null,null,null,null,null,null,null,null,null,54.2,54.1,54.1,54.2,54.2,54.3,54.4]
[null,null,null,null,"Coincident",null,null,null,null,null,null,null,null,null,null,null,49.3,50.7,50.8,51.4,51.7,51.8,52]
[null,null,"WEATHER CORRECTED MD 50% POE","MVA","Non-coincident",null,null,null,null,null,null,null,null,null,null,null,57.1,57,57,57.1,57.1,57.2,57.3]
[null,null,null,null,"Coincident",null,null,null,null,null,null,null,null,null,null,null,51.9,53.4,53.5,54.2,54.4,54.6,54.8]
[null,"Mt McLaren (Rail)","CONNECTION POINT RATING","MVA","Non-coincident",null,null,null,null,null,null,null,null,null,null,null,63.7,63.7,63.7,63.7,63.7,63.7,63.7]
[null,null,null,null,"Coincident",null,null,null,null,null,null,null,null,null,null,null,63.7,63.7,63.7,63.7,63.7,63.7,63.7]
[null,null,"WINTER/SUMMER PEAKING",null,"Non-coincident",null,null,null,null,null,null,null,null,null,null,null,"Summer","Summer","Summer","Summer","Summer","Summer","Summer"]
[null,null,null,null,"Coincident",null,null,null,null,null,null,null,null,null,null,null,"Summer","Summer","Summer","Summer","Summer","Summer","Summer"]
[null,null,"ADJUSTMENTS - EMBEDDED GENERATION","MW","Non-coincident",null,null,null,null,null,null,null,null,null,null,null,"-","-","-","-","-","-","-"]
[null,null,null,null,"Coincident",null,null,null,null,null,null,null,null,null,null,null,"-","-","-","-","-","-","-"]
[null,null,"WEATHER CORRECTED MD 10% POE","MW","Non-coincident"]
[null,null,null,null,"Coincident"]
[null,null,"WEATHER CORRECTED MD 10% POE","MVA","Non-coincident"]
[null,null,null,null,"Coincident"]
[null,null,"WEATHER CORRECTED MD 50% POE","MW","Non-coincident"]
[null,null,null,null,"Coincident"]
[null,null,"WEATHER CORRECTED MD 50% POE","MVA","Non-coincident"]
[null,null,null,null,"Coincident"]
[null,"Mudgeeraba (110)","CONNECTION POINT RATING","MVA","Non-coincident",null,null,null,null,null,null,null,null,null,null,null,1981.5,1981.5,1981.5,1981.5,1981.5,1981.5,1981.5]
[null,null,null,null,"Coincident",null,null,null,null,null,null,null,null,null,null,null,1981.5,1981.5,1981.5,1981.5,1981.5,1981.5,1981.5]
[null,null,"WINTER/SUMMER PEAKING",null,"Non-coincident",null,null,null,null,null,null,null,null,null,null,null,"Summer","Summer","Summer","Summer","Summer","Summer","Summer"]
[null,null,null,null,"Coincident",null,null,null,null,null,null,null,null,null,null,null,"Summer","Summer","Summer","Summer","Summer","Summer","Summer"]
[null,null,"ADJUSTMENTS - EMBEDDED GENERATION","MW","Non-coincident",null,null,null,null,null,null,null,null,null,null,null,"-","-","-","-","-","-","-"]
[null,null,null,null,"Coincident",null,null,null,null,null,null,null,null,null,null,null,"-","-","-","-","-","-","-"]
[null,null,"WEATHER CORRECTED MD 10% POE","MW","Non-coincident",null,null,null,null,null,null,null,null,null,null,null,327.10000000000002,327.8,329.8,330.7,330.9,331.8,332.5]
[null,null,null,null,"Coincident",null,null,null,null,null,null,null,null,null,null,null,289.89999999999998,299.10000000000002,302,305.7,307.60000000000002,309,310.10000000000002]
[null,null,"WEATHER CORRECTED MD 10% POE","MVA","Non-coincident",null,null,null,null,null,null,null,null,null,null,null,331.9,332.7,334.6,335.6,335.8,336.6,337.3]
[null,null,null,null,"Coincident",null,null,null,null,null,null,null,null,null,null,null,294.60000000000002,304,306.89999999999998,310.7,312.5,314,315.10000000000002]
[null,null,"WEATHER CORRECTED MD 50% POE","MW","Non-coincident",null,null,null,null,null,null,null,null,null,null,null,296.8,297.5,299.3,300.10000000000002,300.3,301.10000000000002,301.7]
[null,null,null,null,"Coincident",null,null,null,null,null,null,null,null,null,null,null,276.10000000000002,284.89999999999998,287.60000000000002,291.2,292.89999999999998,294.3,295.3]
[null,null,"WEATHER CORRECTED MD 50% POE","MVA","Non-coincident",null,null,null,null,null,null,null,null,null,null,null,301.2,301.89999999999998,303.7,304.60000000000002,304.8,305.5,306.2]
[null,null,null,null,"Coincident",null,null,null,null,null,null,null,null,null,null,null,280.2,289.10000000000002,291.89999999999998,295.5,297.3,298.60000000000002,299.7]
[null,"Mudgeeraba (33)","CONNECTION POINT RATING","MVA","Non-coincident",null,null,null,null,null,null,null,null,null,null,null,101,101,101,101,101,101,101]
[null,null,null,null,"Coincident",null,null,null,null,null,null,null,null,null,null,null,101,101,101,101,101,101,101]
[null,null,"WINTER/SUMMER PEAKING",null,"Non-coincident",null,null,null,null,null,null,null,null,null,null,null,"Summer","Summer","Summer","Summer","Summer","Summer","Summer"]
[null,null,null,null,"Coincident",null,null,null,null,null,null,null,null,null,null,null,"Summer","Summer","Summer","Summer","Summer","Summer","Summer"]
[null,null,"ADJUSTMENTS - EMBEDDED GENERATION","MW","Non-coincident",null,null,null,null,null,null,null,null,null,null,null,"-","-","-","-","-","-","-"]
[null,null,null,null,"Coincident",null,null,null,null,null,null,null,null,null,null,null,"-","-","-","-","-","-","-"]
[null,null,"WEATHER CORRECTED MD 10% POE","MW","Non-coincident",null,null,null,null,null,null,null,null,null,null,null,26.4,26.6,26.8,26.9,26.9,27,27.1]
[null,null,null,null,"Coincident",null,null,null,null,null,null,null,null,null,null,null,21.2,21.9,22.2,22.5,22.6,22.7,22.8]
[null,null,"WEATHER CORRECTED MD 10% POE","MVA","Non-coincident",null,null,null,null,null,null,null,null,null,null,null,27.2,27.3,27.6,27.6,27.7,27.8,27.8]
[null,null,null,null,"Coincident",null,null,null,null,null,null,null,null,null,null,null,21.8,22.6,22.9,23.2,23.3,23.4,23.5]
[null,null,"WEATHER CORRECTED MD 50% POE","MW","Non-coincident",null,null,null,null,null,null,null,null,null,null,null,21.7,21.8,22,22,22.1,22.2,22.2]
[null,null,null,null,"Coincident",null,null,null,null,null,null,null,null,null,null,null,20.2,20.9,21.1,21.4,21.5,21.7,21.7]
[null,null,"WEATHER CORRECTED MD 50% POE","MVA","Non-coincident",null,null,null,null,null,null,null,null,null,null,null,22.3,22.4,22.6,22.7,22.7,22.8,22.8]
[null,null,null,null,"Coincident",null,null,null,null,null,null,null,null,null,null,null,20.8,21.5,21.7,22,22.2,22.3,22.4]
[null,"Murarrie","CONNECTION POINT RATING","MVA","Non-coincident",null,null,null,null,null,null,null,null,null,null,null,3184.3,3184.3,3184.3,3184.3,3184.3,3184.3,3184.3]
[null,null,null,null,"Coincident",null,null,null,null,null,null,null,null,null,null,null,3184.3,3184.3,3184.3,3184.3,3184.3,3184.3,3184.3]
[null,null,"WINTER/SUMMER PEAKING",null,"Non-coincident",null,null,null,null,null,null,null,null,null,null,null,"Summer","Summer","Summer","Summer","Summer","Summer","Summer"]
[null,null,null,null,"Coincident",null,null,null,null,null,null,null,null,null,null,null,"Summer","Summer","Summer","Summer","Summer","Summer","Summer"]
[null,null,"ADJUSTMENTS - EMBEDDED GENERATION","MW","Non-coincident",null,null,null,null,null,null,null,null,null,null,null,"-","-","-","-","-","-","-"]
[null,null,null,null,"Coincident",null,null,null,null,null,null,null,null,null,null,null,"-","-","-","-","-","-","-"]
[null,null,"WEATHER CORRECTED MD 10% POE","MW","Non-coincident",null,null,null,null,null,null,null,null,null,null,null,388.1,394.8,396.7,405.9,416.7,418,417.8]
[null,null,null,null,"Coincident",null,null,null,null,null,null,null,null,null,null,null,349.4,367,370.2,383.1,396.2,398.5,399]
[null,null,"WEATHER CORRECTED MD 10% POE","MVA","Non-coincident",null,null,null,null,null,null,null,null,null,null,null,392.5,399.5,401.4,410.4,421,422.3,422.1]
[null,null,null,null,"Coincident",null,null,null,null,null,null,null,null,null,null,null,355.2,372.6,375.8,389.6,401.6,403.7,404.2]
[null,null,"WEATHER CORRECTED MD 50% POE","MW","Non-coincident",null,null,null,null,null,null,null,null,null,null,null,358.8,365.7,367.5,376.7,387.6,389,388.9]
[null,null,null,null,"Coincident",null,null,null,null,null,null,null,null,null,null,null,332.8,349.5,352.5,364.8,377.4,379.5,380]
[null,null,"WEATHER CORRECTED MD 50% POE","MVA","Non-coincident",null,null,null,null,null,null,null,null,null,null,null,363.7,370.8,372.7,382.6,392.4,393.7,393.6]
[null,null,null,null,"Coincident",null,null,null,null,null,null,null,null,null,null,null,337.8,354.4,357.5,370.5,382,384.1,384.5]
[null,"Nebo","CONNECTION POINT RATING","MVA","Non-coincident",null,null,null,null,null,null,null,null,null,null,null,10,10,10,10,10,10,10]
[null,null,null,null,"Coincident",null,null,null,null,null,null,null,null,null,null,null,10,10,10,10,10,10,10]
[null,null,"WINTER/SUMMER PEAKING",null,"Non-coincident",null,null,null,null,null,null,null,null,null,null,null,"Summer","Summer","Summer","Summer","Summer","Summer","Summer"]
[null,null,null,null,"Coincident",null,null,null,null,null,null,null,null,null,null,null,"Summer","Summer","Summer","Summer","Summer","Summer","Summer"]
[null,null,"ADJUSTMENTS - EMBEDDED GENERATION","MW","Non-coincident",null,null,null,null,null,null,null,null,null,null,null,"-","-","-","-","-","-","-"]
[null,null,null,null,"Coincident",null,null,null,null,null,null,null,null,null,null,null,"-","-","-","-","-","-","-"]
[null,null,"WEATHER CORRECTED MD 10% POE","MW","Non-coincident",null,null,null,null,null,null,null,null,null,null,null,3.7,3.7,3.7,3.7,3.7,3.7,3.7]
[null,null,null,null,"Coincident",null,null,null,null,null,null,null,null,null,null,null,3.1,3.2,3.2,3.3,3.3,3.3,3.3]
[null,null,"WEATHER CORRECTED MD 10% POE","MVA","Non-coincident",null,null,null,null,null,null,null,null,null,null,null,3.7,3.7,3.7,3.7,3.7,3.7,3.7]
[null,null,null,null,"Coincident",null,null,null,null,null,null,null,null,null,null,null,3.2,3.2,3.2,3.3,3.3,3.3,3.3]
[null,null,"WEATHER CORRECTED MD 50% POE","MW","Non-coincident",null,null,null,null,null,null,null,null,null,null,null,3.3,3.3,3.3,3.3,3.3,3.3,3.3]
[null,null,null,null,"Coincident",null,null,null,null,null,null,null,null,null,null,null,3,3.1,3.1,3.1,3.1,3.1,3.2]
[null,null,"WEATHER CORRECTED MD 50% POE","MVA","Non-coincident",null,null,null,null,null,null,null,null,null,null,null,3.4,3.3,3.3,3.3,3.3,3.4,3.4]
[null,null,null,null,"Coincident",null,null,null,null,null,null,null,null,null,null,null,3,3.1,3.1,3.1,3.1,3.2,3.2]
[null,"Newlands","CONNECTION POINT RATING","MVA","Non-coincident",null,null,null,null,null,null,null,null,null,null,null,152,152,152,152,152,152,152]
[null,null,null,null,"Coincident",null,null,null,null,null,null,null,null,null,null,null,152,152,152,152,152,152,152]
[null,null,"WINTER/SUMMER PEAKING",null,"Non-coincident",null,null,null,null,null,null,null,null,null,null,null,"Summer","Summer","Summer","Summer","Summer","Summer","Summer"]
[null,null,null,null,"Coincident",null,null,null,null,null,null,null,null,null,null,null,"Summer","Summer","Summer","Summer","Summer","Summer","Summer"]
[null,null,"ADJUSTMENTS - EMBEDDED GENERATION","MW","Non-coincident",null,null,null,null,null,null,null,null,null,null,null,"-","-","-","-","-","-","-"]
[null,null,null,null,"Coincident",null,null,null,null,null,null,null,null,null,null,null,"-","-","-","-","-","-","-"]
[null,null,"WEATHER CORRECTED MD 10% POE","MW","Non-coincident",null,null,null,null,null,null,null,null,null,null,null,22.9,22.9,23,23,23.1,23.1,23.2]
[null,null,null,null,"Coincident",null,null,null,null,null,null,null,null,null,null,null,20.9,21.5,21.6,21.9,22,22.1,22.2]
[null,null,"WEATHER CORRECTED MD 10% POE","MVA","Non-coincident",null,null,null,null,null,null,null,null,null,null,null,23.2,23.2,23.3,23.3,23.4,23.4,23.5]
[null,null,null,null,"Coincident",null,null,null,null,null,null,null,null,null,null,null,21.2,21.8,21.9,22.2,22.3,22.4,22.5]
[null,null,"WEATHER CORRECTED MD 50% POE","MW","Non-coincident",null,null,null,null,null,null,null,null,null,null,null,22.2,22.2,22.2,22.3,22.4,22.4,22.4]
[null,null,null,null,"Coincident",null,null,null,null,null,null,null,null,null,null,null,19.899999999999999,20.5,20.6,20.8,21,21.1,21.1]
[null,null,"WEATHER CORRECTED MD 50% POE","MVA","Non-coincident",null,null,null,null,null,null,null,null,null,null,null,22.5,22.5,22.5,22.6,22.6,22.7,22.7]
[null,null,null,null,"Coincident",null,null,null,null,null,null,null,null,null,null,null,20.2,20.8,20.8,21.1,21.2,21.3,21.4]
[null,"North Goonyella","CONNECTION POINT RATING","MVA","Non-coincident",null,null,null,null,null,null,null,null,null,null,null,85,85,85,85,85,85,85]
[null,null,null,null,"Coincident",null,null,null,null,null,null,null,null,null,null,null,85,85,85,85,85,85,85]
[null,null,"WINTER/SUMMER PEAKING",null,"Non-coincident",null,null,null,null,null,null,null,null,null,null,null,"Summer","Summer","Summer","Summer","Summer","Summer","Summer"]
[null,null,null,null,"Coincident",null,null,null,null,null,null,null,null,null,null,null,"Summer","Summer","Summer","Summer","Summer","Summer","Summer"]
[null,null,"ADJUSTMENTS - EMBEDDED GENERATION","MW","Non-coincident",null,null,null,null,null,null,null,null,null,null,null,"-","-","-","-","-","-","-"]
[null,null,null,null,"Coincident",null,null,null,null,null,null,null,null,null,null,null,"-","-","-","-","-","-","-"]
[null,null,"WEATHER CORRECTED MD 10% POE","MW","Non-coincident"]
[null,null,null,null,"Coincident"]
[null,null,"WEATHER CORRECTED MD 10% POE","MVA","Non-coincident"]
[null,null,null,null,"Coincident"]
[null,null,"WEATHER CORRECTED MD 50% POE","MW","Non-coincident"]
[null,null,null,null,"Coincident"]
[null,null,"WEATHER CORRECTED MD 50% POE","MVA","Non-coincident"]
[null,null,null,null,"Coincident"]
[null,"Norwich Park (Rail)","CONNECTION POINT RATING","MVA","Non-coincident",null,null,null,null,null,null,null,null,null,null,null,63.7,63.7,63.7,63.7,63.7,63.7,63.7]
[null,null,null,null,"Coincident",null,null,null,null,null,null,null,null,null,null,null,63.7,63.7,63.7,63.7,63.7,63.7,63.7]
[null,null,"WINTER/SUMMER PEAKING",null,"Non-coincident",null,null,null,null,null,null,null,null,null,null,null,"Summer","Summer","Summer","Summer","Summer","Summer","Summer"]
[null,null,null,null,"Coincident",null,null,null,null,null,null,null,null,null,null,null,"Summer","Summer","Summer","Summer","Summer","Summer","Summer"]
[null,null,"ADJUSTMENTS - EMBEDDED GENERATION","MW","Non-coincident",null,null,null,null,null,null,null,null,null,null,null,"-","-","-","-","-","-","-"]
[null,null,null,null,"Coincident",null,null,null,null,null,null,null,null,null,null,null,"-","-","-","-","-","-","-"]
[null,null,"WEATHER CORRECTED MD 10% POE","MW","Non-coincident"]
[null,null,null,null,"Coincident"]
[null,null,"WEATHER CORRECTED MD 10% POE","MVA","Non-coincident"]
[null,null,null,null,"Coincident"]
[null,null,"WEATHER CORRECTED MD 50% POE","MW","Non-coincident"]
[null,null,null,null,"Coincident"]
[null,null,"WEATHER CORRECTED MD 50% POE","MVA","Non-coincident"]
[null,null,null,null,"Coincident"]
[null,"Oakey","CONNECTION POINT RATING","MVA","Non-coincident",null,null,null,null,null,null,null,null,null,null,null,731.6,731.6,731.6,731.6,731.6,731.6,731.6]
[null,null,null,null,"Coincident",null,null,null,null,null,null,null,null,null,null,null,731.6,731.6,731.6,731.6,731.6,731.6,731.6]
[null,null,"WINTER/SUMMER PEAKING",null,"Non-coincident",null,null,null,null,null,null,null,null,null,null,null,"Summer","Summer","Summer","Summer","Summer","Summer","Summer"]
[null,null,null,null,"Coincident",null,null,null,null,null,null,null,null,null,null,null,"Summer","Summer","Summer","Summer","Summer","Summer","Summer"]
[null,null,"ADJUSTMENTS - EMBEDDED GENERATION","MW","Non-coincident",null,null,null,null,null,null,null,null,null,null,null,"-","-","-","-","-","-","-"]
[null,null,null,null,"Coincident",null,null,null,null,null,null,null,null,null,null,null,"-","-","-","-","-","-","-"]
[null,null,"WEATHER CORRECTED MD 10% POE","MW","Non-coincident",null,null,null,null,null,null,null,null,null,null,null,20,19.8,19.7,19.7,19.600000000000001,19.600000000000001,19.7]
[null,null,null,null,"Coincident",null,null,null,null,null,null,null,null,null,null,null,19.899999999999999,20.3,20.3,20.399999999999999,20.5,20.5,20.6]
[null,null,"WEATHER CORRECTED MD 10% POE","MVA","Non-coincident",null,null,null,null,null,null,null,null,null,null,null,21,20.8,20.7,20.7,20.6,20.6,20.7]
[null,null,null,null,"Coincident",null,null,null,null,null,null,null,null,null,null,null,21.8,22.2,22.2,22.4,22.4,22.5,22.5]
[null,null,"WEATHER CORRECTED MD 50% POE","MW","Non-coincident",null,null,null,null,null,null,null,null,null,null,null,18.7,18.600000000000001,18.5,18.5,18.399999999999999,18.399999999999999,18.5]
[null,null,null,null,"Coincident",null,null,null,null,null,null,null,null,null,null,null,18.899999999999999,19.3,19.3,19.5,19.5,19.5,19.600000000000001]
[null,null,"WEATHER CORRECTED MD 50% POE","MVA","Non-coincident",null,null,null,null,null,null,null,null,null,null,null,19.7,19.5,19.5,19.399999999999999,19.399999999999999,19.399999999999999,19.399999999999999]
[null,null,null,null,"Coincident",null,null,null,null,null,null,null,null,null,null,null,20.7,21.1,21.1,21.2,21.3,21.3,21.4]
[null,"Oonooie (Rail)","CONNECTION POINT RATING","MVA","Non-coincident",null,null,null,null,null,null,null,null,null,null,null,69.7,69.7,69.7,69.7,69.7,69.7,69.7]
[null,null,null,null,"Coincident",null,null,null,null,null,null,null,null,null,null,null,69.7,69.7,69.7,69.7,69.7,69.7,69.7]
[null,null,"WINTER/SUMMER PEAKING",null,"Non-coincident",null,null,null,null,null,null,null,null,null,null,null,"Summer","Summer","Summer","Summer","Summer","Summer","Summer"]
[null,null,null,null,"Coincident",null,null,null,null,null,null,null,null,null,null,null,"Summer","Summer","Summer","Summer","Summer","Summer","Summer"]
[null,null,"ADJUSTMENTS - EMBEDDED GENERATION","MW","Non-coincident",null,null,null,null,null,null,null,null,null,null,null,"-","-","-","-","-","-","-"]
[null,null,null,null,"Coincident",null,null,null,null,null,null,null,null,null,null,null,"-","-","-","-","-","-","-"]
[null,null,"WEATHER CORRECTED MD 10% POE","MW","Non-coincident"]
[null,null,null,null,"Coincident"]
[null,null,"WEATHER CORRECTED MD 10% POE","MVA","Non-coincident"]
[null,null,null,null,"Coincident"]
[null,null,"WEATHER CORRECTED MD 50% POE","MW","Non-coincident"]
[null,null,null,null,"Coincident"]
[null,null,"WEATHER CORRECTED MD 50% POE","MVA","Non-coincident"]
[null,null,null,null,"Coincident"]
[null,"Orana","CONNECTION POINT RATING","MVA","Non-coincident",null,null,null,null,null,null,null,null,null,null,null,0,0,0,0,0,0,0]
[null,null,null,null,"Coincident",null,null,null,null,null,null,null,null,null,null,null,0,0,0,0,0,0,0]
[null,null,"WINTER/SUMMER PEAKING",null,"Non-coincident",null,null,null,null,null,null,null,null,null,null,null,"Summer","Summer","Summer","Summer","Summer","Summer","Summer"]
[null,null,null,null,"Coincident",null,null,null,null,null,null,null,null,null,null,null,"Summer","Summer","Summer","Summer","Summer","Summer","Summer"]
[null,null,"ADJUSTMENTS - EMBEDDED GENERATION","MW","Non-coincident",null,null,null,null,null,null,null,null,null,null,null,"-","-","-","-","-","-","-"]
[null,null,null,null,"Coincident",null,null,null,null,null,null,null,null,null,null,null,"-","-","-","-","-","-","-"]
[null,null,"WEATHER CORRECTED MD 10% POE","MW","Non-coincident"]
[null,null,null,null,"Coincident"]
[null,null,"WEATHER CORRECTED MD 10% POE","MVA","Non-coincident"]
[null,null,null,null,"Coincident"]
[null,null,"WEATHER CORRECTED MD 50% POE","MW","Non-coincident"]
[null,null,null,null,"Coincident"]
[null,null,"WEATHER CORRECTED MD 50% POE","MVA","Non-coincident"]
[null,null,null,null,"Coincident"]
[null,"Palmwoods","CONNECTION POINT RATING","MVA","Non-coincident",null,null,null,null,null,null,null,null,null,null,null,827,827,827,827,827,827,827]
[null,null,null,null,"Coincident",null,null,null,null,null,null,null,null,null,null,null,827,827,827,827,827,827,827]
[null,null,"WINTER/SUMMER PEAKING",null,"Non-coincident",null,null,null,null,null,null,null,null,null,null,null,"Summer","Summer","Summer","Summer","Summer","Summer","Summer"]
[null,null,null,null,"Coincident",null,null,null,null,null,null,null,null,null,null,null,"Summer","Summer","Summer","Summer","Summer","Summer","Summer"]
[null,null,"ADJUSTMENTS - EMBEDDED GENERATION","MW","Non-coincident",null,null,null,null,null,null,null,null,null,null,null,3.5,3.5,3.5,3.5,3.5,3.5,3.5]
[null,null,null,null,"Coincident",null,null,null,null,null,null,null,null,null,null,null,"-","-","-","-","-","-","-"]
[null,null,"WEATHER CORRECTED MD 10% POE","MW","Non-coincident",null,null,null,null,null,null,null,null,null,null,null,373,383,389.2,393.9,396.2,401.5,404.8]
[null,null,null,null,"Coincident",null,null,null,null,null,null,null,null,null,null,null,327.9,347.2,354.3,362.2,366.1,371.9,375.5]
[null,null,"WEATHER CORRECTED MD 10% POE","MVA","Non-coincident",null,null,null,null,null,null,null,null,null,null,null,377.6,387.8,394.1,398.9,401.2,406.6,409.9]
[null,null,null,null,"Coincident",null,null,null,null,null,null,null,null,null,null,null,332.3,352.2,359.5,367.5,371.5,377.5,381.1]
[null,null,"WEATHER CORRECTED MD 50% POE","MW","Non-coincident",null,null,null,null,null,null,null,null,null,null,null,336.3,346.1,351.9,356.3,358.3,363.3,366.2]
[null,null,null,null,"Coincident",null,null,null,null,null,null,null,null,null,null,null,312.3,330.7,337.4,344.9,348.7,354.2,357.6]
[null,null,"WEATHER CORRECTED MD 50% POE","MVA","Non-coincident",null,null,null,null,null,null,null,null,null,null,null,340.4,350.5,356.4,361,363,368.1,371]
[null,null,null,null,"Coincident",null,null,null,null,null,null,null,null,null,null,null,316.2,335,341.9,349.6,353.4,359,362.5]
[null,"Pandoin (66)","CONNECTION POINT RATING","MVA","Non-coincident",null,null,null,null,null,null,null,null,null,null,null,116.1,116.1,116.1,116.1,116.1,116.1,116.1]
[null,null,null,null,"Coincident",null,null,null,null,null,null,null,null,null,null,null,116.1,116.1,116.1,116.1,116.1,116.1,116.1]
[null,null,"WINTER/SUMMER PEAKING",null,"Non-coincident",null,null,null,null,null,null,null,null,null,null,null,"Summer","Summer","Summer","Summer","Summer","Summer","Summer"]
[null,null,null,null,"Coincident",null,null,null,null,null,null,null,null,null,null,null,"Summer","Summer","Summer","Summer","Summer","Summer","Summer"]
[null,null,"ADJUSTMENTS - EMBEDDED GENERATION","MW","Non-coincident",null,null,null,null,null,null,null,null,null,null,null,"-","-","-","-","-","-","-"]
[null,null,null,null,"Coincident",null,null,null,null,null,null,null,null,null,null,null,"-","-","-","-","-","-","-"]
[null,null,"WEATHER CORRECTED MD 10% POE","MW","Non-coincident",null,null,null,null,null,null,null,null,null,null,null,43.1,43.2,43.3,43.5,43.7,44,44.4]
[null,null,null,null,"Coincident",null,null,null,null,null,null,null,null,null,null,null,37.5,38.6,38.799999999999997,39.5,39.799999999999997,40.200000000000003,40.6]
[null,null,"WEATHER CORRECTED MD 10% POE","MVA","Non-coincident",null,null,null,null,null,null,null,null,null,null,null,44.3,44.4,44.5,44.7,44.9,45.2,45.6]
[null,null,null,null,"Coincident",null,null,null,null,null,null,null,null,null,null,null,40.799999999999997,42,42.2,42.7,43.1,43.5,43.9]
[null,null,"WEATHER CORRECTED MD 50% POE","MW","Non-coincident",null,null,null,null,null,null,null,null,null,null,null,39.299999999999997,39.4,39.5,39.700000000000003,39.799999999999997,40.1,40.4]
[null,null,null,null,"Coincident",null,null,null,null,null,null,null,null,null,null,null,35.700000000000003,36.799999999999997,37,37.6,37.9,38.299999999999997,38.700000000000003]
[null,null,"WEATHER CORRECTED MD 50% POE","MVA","Non-coincident",null,null,null,null,null,null,null,null,null,null,null,40.700000000000003,40.700000000000003,40.799999999999997,41,41.1,41.4,41.8]
[null,null,null,null,"Coincident",null,null,null,null,null,null,null,null,null,null,null,38.799999999999997,39.9,40.1,40.6,41,41.3,41.7]
[null,"Peak Downs (Rail)","CONNECTION POINT RATING","MVA","Non-coincident",null,null,null,null,null,null,null,null,null,null,null,63.7,63.7,63.7,63.7,63.7,63.7,63.7]
[null,null,null,null,"Coincident",null,null,null,null,null,null,null,null,null,null,null,63.7,63.7,63.7,63.7,63.7,63.7,63.7]
[null,null,"WINTER/SUMMER PEAKING",null,"Non-coincident",null,null,null,null,null,null,null,null,null,null,null,"Summer","Summer","Summer","Summer","Summer","Summer","Summer"]
[null,null,null,null,"Coincident",null,null,null,null,null,null,null,null,null,null,null,"Summer","Summer","Summer","Summer","Summer","Summer","Summer"]
[null,null,"ADJUSTMENTS - EMBEDDED GENERATION","MW","Non-coincident",null,null,null,null,null,null,null,null,null,null,null,"-","-","-","-","-","-","-"]
[null,null,null,null,"Coincident",null,null,null,null,null,null,null,null,null,null,null,"-","-","-","-","-","-","-"]
[null,null,"WEATHER CORRECTED MD 10% POE","MW","Non-coincident"]
[null,null,null,null,"Coincident"]
[null,null,"WEATHER CORRECTED MD 10% POE","MVA","Non-coincident"]
[null,null,null,null,"Coincident"]
[null,null,"WEATHER CORRECTED MD 50% POE","MW","Non-coincident"]
[null,null,null,null,"Coincident"]
[null,null,"WEATHER CORRECTED MD 50% POE","MVA","Non-coincident"]
[null,null,null,null,"Coincident"]
[null,"Pioneer Valley","CONNECTION POINT RATING","MVA","Non-coincident",null,null,null,null,null,null,null,null,null,null,null,264.60000000000002,264.60000000000002,264.60000000000002,264.60000000000002,264.60000000000002,264.60000000000002,264.60000000000002]
[null,null,null,null,"Coincident",null,null,null,null,null,null,null,null,null,null,null,264.60000000000002,264.60000000000002,264.60000000000002,264.60000000000002,264.60000000000002,264.60000000000002,264.60000000000002]
[null,null,"WINTER/SUMMER PEAKING",null,"Non-coincident",null,null,null,null,null,null,null,null,null,null,null,"Summer","Summer","Summer","Summer","Summer","Summer","Summer"]
[null,null,null,null,"Coincident",null,null,null,null,null,null,null,null,null,null,null,"Summer","Summer","Summer","Summer","Summer","Summer","Summer"]
[null,null,"ADJUSTMENTS - EMBEDDED GENERATION","MW","Non-coincident",null,null,null,null,null,null,null,null,null,null,null,"-","-","-","-","-","-","-"]
[null,null,null,null,"Coincident",null,null,null,null,null,null,null,null,null,null,null,"-","-","-","-","-","-","-"]
[null,null,"WEATHER CORRECTED MD 10% POE","MW","Non-coincident",null,null,null,null,null,null,null,null,null,null,null,76.2,76.5,76.8,77.3,77.599999999999994,78.2,78.900000000000006]
[null,null,null,null,"Coincident",null,null,null,null,null,null,null,null,null,null,null,64,66.099999999999994,66.599999999999994,67.7,68.3,69,69.599999999999994]
[null,null,"WEATHER CORRECTED MD 10% POE","MVA","Non-coincident",null,null,null,null,null,null,null,null,null,null,null,77.400000000000006,77.7,77.900000000000006,78.5,78.8,79.400000000000006,80]
[null,null,null,null,"Coincident",null,null,null,null,null,null,null,null,null,null,null,65.3,67.5,67.900000000000006,69,69.7,70.400000000000006,71]
[null,null,"WEATHER CORRECTED MD 50% POE","MW","Non-coincident",null,null,null,null,null,null,null,null,null,null,null,68.099999999999994,68.400000000000006,68.599999999999994,69.099999999999994,69.400000000000006,69.900000000000006,70.400000000000006]
[null,null,null,null,"Coincident",null,null,null,null,null,null,null,null,null,null,null,61,63,63.4,64.400000000000006,65.099999999999994,65.7,66.3]
[null,null,"WEATHER CORRECTED MD 50% POE","MVA","Non-coincident",null,null,null,null,null,null,null,null,null,null,null,69.2,69.400000000000006,69.7,70.099999999999994,70.400000000000006,71,71.5]
[null,null,null,null,"Coincident",null,null,null,null,null,null,null,null,null,null,null,62.1,64.2,64.599999999999994,65.7,66.3,66.900000000000006,67.599999999999994]
[null,"Proserpine","CONNECTION POINT RATING","MVA","Non-coincident",null,null,null,null,null,null,null,null,null,null,null,190,190,190,190,190,190,190]
[null,null,null,null,"Coincident",null,null,null,null,null,null,null,null,null,null,null,190,190,190,190,190,190,190]
[null,null,"WINTER/SUMMER PEAKING",null,"Non-coincident",null,null,null,null,null,null,null,null,null,null,null,"Summer","Summer","Summer","Summer","Summer","Summer","Summer"]
[null,null,null,null,"Coincident",null,null,null,null,null,null,null,null,null,null,null,"Summer","Summer","Summer","Summer","Summer","Summer","Summer"]
[null,null,"ADJUSTMENTS - EMBEDDED GENERATION","MW","Non-coincident",null,null,null,null,null,null,null,null,null,null,null,"-","-","-","-","-","-","-"]
[null,null,null,null,"Coincident",null,null,null,null,null,null,null,null,null,null,null,"-","-","-","-","-","-","-"]
[null,null,"WEATHER CORRECTED MD 10% POE","MW","Non-coincident",null,null,null,null,null,null,null,null,null,null,null,54.1,54.4,54.7,55.1,55.4,56,56.6]
[null,null,null,null,"Coincident",null,null,null,null,null,null,null,null,null,null,null,44.4,45.9,46.4,47.2,47.7,48.2,48.8]
[null,null,"WEATHER CORRECTED MD 10% POE","MVA","Non-coincident",null,null,null,null,null,null,null,null,null,null,null,55.2,55.4,55.7,56.2,56.5,57,57.7]
[null,null,null,null,"Coincident",null,null,null,null,null,null,null,null,null,null,null,46,47.6,48,48.8,49.4,49.9,50.5]
[null,null,"WEATHER CORRECTED MD 50% POE","MW","Non-coincident",null,null,null,null,null,null,null,null,null,null,null,47.3,47.5,47.8,48.1,48.4,48.9,49.4]
[null,null,null,null,"Coincident",null,null,null,null,null,null,null,null,null,null,null,42.3,43.7,44.2,44.9,45.4,45.9,46.5]
[null,null,"WEATHER CORRECTED MD 50% POE","MVA","Non-coincident",null,null,null,null,null,null,null,null,null,null,null,48.2,48.4,48.7,49,49.3,49.8,50.3]
[null,null,null,null,"Coincident",null,null,null,null,null,null,null,null,null,null,null,43.8,45.2,45.6,46.4,46.9,47.5,48]
[null,"QGC Columboola","CONNECTION POINT RATING","MVA","Non-coincident",null,null,null,null,null,null,null,null,null,null,null,0,0,0,0,0,0,0]
[null,null,null,null,"Coincident",null,null,null,null,null,null,null,null,null,null,null,0,0,0,0,0,0,0]
[null,null,"WINTER/SUMMER PEAKING",null,"Non-coincident",null,null,null,null,null,null,null,null,null,null,null,"Summer","Summer","Summer","Summer","Summer","Summer","Summer"]
[null,null,null,null,"Coincident",null,null,null,null,null,null,null,null,null,null,null,"Summer","Summer","Summer","Summer","Summer","Summer","Summer"]
[null,null,"ADJUSTMENTS - EMBEDDED GENERATION","MW","Non-coincident",null,null,null,null,null,null,null,null,null,null,null,"-","-","-","-","-","-","-"]
[null,null,null,null,"Coincident",null,null,null,null,null,null,null,null,null,null,null,"-","-","-","-","-","-","-"]
[null,null,"WEATHER CORRECTED MD 10% POE","MW","Non-coincident"]
[null,null,null,null,"Coincident"]
[null,null,"WEATHER CORRECTED MD 10% POE","MVA","Non-coincident"]
[null,null,null,null,"Coincident"]
[null,null,"WEATHER CORRECTED MD 50% POE","MW","Non-coincident"]
[null,null,null,null,"Coincident"]
[null,null,"WEATHER CORRECTED MD 50% POE","MVA","Non-coincident"]
[null,null,null,null,"Coincident"]
[null,"QNI","CONNECTION POINT RATING","MVA","Non-coincident",null,null,null,null,null,null,null,null,null,null,null,2493,2493,2493,2493,2493,2493,2493]
[null,null,null,null,"Coincident",null,null,null,null,null,null,null,null,null,null,null,2493,2493,2493,2493,2493,2493,2493]
[null,null,"WINTER/SUMMER PEAKING",null,"Non-coincident",null,null,null,null,null,null,null,null,null,null,null,"Winter","Winter","Winter","Winter","Winter","Winter","Winter"]
[null,null,null,null,"Coincident",null,null,null,null,null,null,null,null,null,null,null,"Summer","Summer","Summer","Summer","Summer","Summer","Summer"]
[null,null,"ADJUSTMENTS - EMBEDDED GENERATION","MW","Non-coincident",null,null,null,null,null,null,null,null,null,null,null,"-","-","-","-","-","-","-"]
[null,null,null,null,"Coincident",null,null,null,null,null,null,null,null,null,null,null,"-","-","-","-","-","-","-"]
[null,null,"WEATHER CORRECTED MD 10% POE","MW","Non-coincident",null,null,null,null,null,null,null,null,null,null,null,1200,1200,1260,1450,1450,1450,1450]
[null,null,null,null,"Coincident",null,null,null,null,null,null,null,null,null,null,null,-237,-237,-237,-237,-237,-237,-237]
[null,null,"WEATHER CORRECTED MD 10% POE","MVA","Non-coincident",null,null,null,null,null,null,null,null,null,null,null,1202.0999999999999,1202.0999999999999,1262.4000000000001,1452.6,1452.6,1452.6,1452.6]
[null,null,null,null,"Coincident",null,null,null,null,null,null,null,null,null,null,null,265.10000000000002,265.10000000000002,265.10000000000002,265.10000000000002,265.10000000000002,265.10000000000002,265.10000000000002]
[null,null,"WEATHER CORRECTED MD 50% POE","MW","Non-coincident",null,null,null,null,null,null,null,null,null,null,null,1200,1200,1260.0999999999999,1450,1450,1450,1450]
[null,null,null,null,"Coincident",null,null,null,null,null,null,null,null,null,null,null,-237,-237,-237,-237,-237,-237,-237]
[null,null,"WEATHER CORRECTED MD 50% POE","MVA","Non-coincident",null,null,null,null,null,null,null,null,null,null,null,1202.0999999999999,1202.0999999999999,1262.4000000000001,1452.6,1452.6,1452.6,1452.6]
[null,null,null,null,"Coincident",null,null,null,null,null,null,null,null,null,null,null,265.10000000000002,265.10000000000002,265.10000000000002,265.10000000000002,265.10000000000002,265.10000000000002,265.10000000000002]
[null,"Raglan (Rail)","CONNECTION POINT RATING","MVA","Non-coincident",null,null,null,null,null,null,null,null,null,null,null,0,0,0,0,0,0,0]
[null,null,null,null,"Coincident",null,null,null,null,null,null,null,null,null,null,null,0,0,0,0,0,0,0]
[null,null,"WINTER/SUMMER PEAKING",null,"Non-coincident",null,null,null,null,null,null,null,null,null,null,null,"Summer","Summer","Summer","Summer","Summer","Summer","Summer"]
[null,null,null,null,"Coincident",null,null,null,null,null,null,null,null,null,null,null,"Summer","Summer","Summer","Summer","Summer","Summer","Summer"]
[null,null,"ADJUSTMENTS - EMBEDDED GENERATION","MW","Non-coincident",null,null,null,null,null,null,null,null,null,null,null,"-","-","-","-","-","-","-"]
[null,null,null,null,"Coincident",null,null,null,null,null,null,null,null,null,null,null,"-","-","-","-","-","-","-"]
[null,null,"WEATHER CORRECTED MD 10% POE","MW","Non-coincident"]
[null,null,null,null,"Coincident"]
[null,null,"WEATHER CORRECTED MD 10% POE","MVA","Non-coincident"]
[null,null,null,null,"Coincident"]
[null,null,"WEATHER CORRECTED MD 50% POE","MW","Non-coincident"]
[null,null,null,null,"Coincident"]
[null,null,"WEATHER CORRECTED MD 50% POE","MVA","Non-coincident"]
[null,null,null,null,"Coincident"]
[null,"Redbank Plains","CONNECTION POINT RATING","MVA","Non-coincident",null,null,null,null,null,null,null,null,null,null,null,65.5,65.5,65.5,65.5,65.5,65.5,65.5]
[null,null,null,null,"Coincident",null,null,null,null,null,null,null,null,null,null,null,65.5,65.5,65.5,65.5,65.5,65.5,65.5]
[null,null,"WINTER/SUMMER PEAKING",null,"Non-coincident",null,null,null,null,null,null,null,null,null,null,null,"Summer","Summer","Summer","Summer","Summer","Summer","Summer"]
[null,null,null,null,"Coincident",null,null,null,null,null,null,null,null,null,null,null,"Summer","Summer","Summer","Summer","Summer","Summer","Summer"]
[null,null,"ADJUSTMENTS - EMBEDDED GENERATION","MW","Non-coincident",null,null,null,null,null,null,null,null,null,null,null,"-","-","-","-","-","-","-"]
[null,null,null,null,"Coincident",null,null,null,null,null,null,null,null,null,null,null,"-","-","-","-","-","-","-"]
[null,null,"WEATHER CORRECTED MD 10% POE","MW","Non-coincident",null,null,null,null,null,null,null,null,null,null,null,32.799999999999997,33.299999999999997,33.9,34.299999999999997,34.700000000000003,35.4,36.1]
[null,null,null,null,"Coincident",null,null,null,null,null,null,null,null,null,null,null,26.7,27.9,28.4,29.1,29.5,30.2,30.8]
[null,null,"WEATHER CORRECTED MD 10% POE","MVA","Non-coincident",null,null,null,null,null,null,null,null,null,null,null,33,33.5,34,34.5,34.799999999999997,35.5,36.200000000000003]
[null,null,null,null,"Coincident",null,null,null,null,null,null,null,null,null,null,null,26.8,28,28.6,29.2,29.7,30.3,31]
[null,null,"WEATHER CORRECTED MD 50% POE","MW","Non-coincident",null,null,null,null,null,null,null,null,null,null,null,27.3,27.8,28.2,28.6,28.9,29.5,30.1]
[null,null,null,null,"Coincident",null,null,null,null,null,null,null,null,null,null,null,25.4,26.5,27.1,27.7,28.1,28.8,29.4]
[null,null,"WEATHER CORRECTED MD 50% POE","MVA","Non-coincident",null,null,null,null,null,null,null,null,null,null,null,27.5,27.9,28.3,28.7,29,29.6,30.2]
[null,null,null,null,"Coincident",null,null,null,null,null,null,null,null,null,null,null,25.5,26.6,27.2,27.8,28.2,28.9,29.5]
[null,"Richlands","CONNECTION POINT RATING","MVA","Non-coincident",null,null,null,null,null,null,null,null,null,null,null,335.8,335.8,335.8,335.8,335.8,335.8,335.8]
[null,null,null,null,"Coincident",null,null,null,null,null,null,null,null,null,null,null,335.8,335.8,335.8,335.8,335.8,335.8,335.8]
[null,null,"WINTER/SUMMER PEAKING",null,"Non-coincident",null,null,null,null,null,null,null,null,null,null,null,"Summer","Summer","Summer","Summer","Summer","Summer","Summer"]
[null,null,null,null,"Coincident",null,null,null,null,null,null,null,null,null,null,null,"Summer","Summer","Summer","Summer","Summer","Summer","Summer"]
[null,null,"ADJUSTMENTS - EMBEDDED GENERATION","MW","Non-coincident",null,null,null,null,null,null,null,null,null,null,null,"-","-","-","-","-","-","-"]
[null,null,null,null,"Coincident",null,null,null,null,null,null,null,null,null,null,null,"-","-","-","-","-","-","-"]
[null,null,"WEATHER CORRECTED MD 10% POE","MW","Non-coincident",null,null,null,null,null,null,null,null,null,null,null,129.9,128.6,128,127.6,126.9,126.7,126.5]
[null,null,null,null,"Coincident",null,null,null,null,null,null,null,null,null,null,null,116.4,118.6,118.4,119.2,119.2,119.3,119.2]
[null,null,"WEATHER CORRECTED MD 10% POE","MVA","Non-coincident",null,null,null,null,null,null,null,null,null,null,null,132.1,130.80000000000001,130.1,129.69999999999999,129,129.80000000000001,129.6]
[null,null,null,null,"Coincident",null,null,null,null,null,null,null,null,null,null,null,118.5,120.8,121.6,122.5,122.4,122.5,122.4]
[null,null,"WEATHER CORRECTED MD 50% POE","MW","Non-coincident",null,null,null,null,null,null,null,null,null,null,null,119.3,118.2,117.6,117.2,116.6,116.4,116.2]
[null,null,null,null,"Coincident",null,null,null,null,null,null,null,null,null,null,null,110.8,113,112.8,113.5,113.5,113.6,113.5]
[null,null,"WEATHER CORRECTED MD 50% POE","MVA","Non-coincident",null,null,null,null,null,null,null,null,null,null,null,121.4,120.1,120.5,120.2,119.5,119.3,119.1]
[null,null,null,null,"Coincident",null,null,null,null,null,null,null,null,null,null,null,112.7,114.8,115.6,116.4,116.3,116.4,116.3]
[null,"Rockhampton","CONNECTION POINT RATING","MVA","Non-coincident",null,null,null,null,null,null,null,null,null,null,null,228.6,228.6,228.6,228.6,228.6,228.6,228.6]
[null,null,null,null,"Coincident",null,null,null,null,null,null,null,null,null,null,null,228.6,228.6,228.6,228.6,228.6,228.6,228.6]
[null,null,"WINTER/SUMMER PEAKING",null,"Non-coincident",null,null,null,null,null,null,null,null,null,null,null,"Summer","Summer","Summer","Summer","Summer","Summer","Summer"]
[null,null,null,null,"Coincident",null,null,null,null,null,null,null,null,null,null,null,"Summer","Summer","Summer","Summer","Summer","Summer","Summer"]
[null,null,"ADJUSTMENTS - EMBEDDED GENERATION","MW","Non-coincident",null,null,null,null,null,null,null,null,null,null,null,"-","-","-","-","-","-","-"]
[null,null,null,null,"Coincident",null,null,null,null,null,null,null,null,null,null,null,"-","-","-","-","-","-","-"]
[null,null,"WEATHER CORRECTED MD 10% POE","MW","Non-coincident",null,null,null,null,null,null,null,null,null,null,null,102.5,102.5,102.7,103.1,103.5,104.1,105]
[null,null,null,null,"Coincident",null,null,null,null,null,null,null,null,null,null,null,88.4,91.1,91.5,92.8,93.6,94.4,95.3]
[null,null,"WEATHER CORRECTED MD 10% POE","MVA","Non-coincident",null,null,null,null,null,null,null,null,null,null,null,105.5,105.5,105.7,106.2,106.5,107.2,108.1]
[null,null,null,null,"Coincident",null,null,null,null,null,null,null,null,null,null,null,93.4,96.1,96.6,98,98.8,99.6,100.5]
[null,null,"WEATHER CORRECTED MD 50% POE","MW","Non-coincident",null,null,null,null,null,null,null,null,null,null,null,92.7,92.7,92.9,93.3,93.6,94.2,94.9]
[null,null,null,null,"Coincident",null,null,null,null,null,null,null,null,null,null,null,84.2,86.7,87.2,88.4,89.2,89.9,90.8]
[null,null,"WEATHER CORRECTED MD 50% POE","MVA","Non-coincident",null,null,null,null,null,null,null,null,null,null,null,95.9,95.9,96,96.5,96.8,97.4,98.2]
[null,null,null,null,"Coincident",null,null,null,null,null,null,null,null,null,null,null,88.8,91.3,91.8,93.1,93.8,94.6,95.5]
[null,"Rocklea","CONNECTION POINT RATING","MVA","Non-coincident",null,null,null,null,null,null,null,null,null,null,null,646.4,646.4,646.4,646.4,646.4,646.4,646.4]
[null,null,null,null,"Coincident",null,null,null,null,null,null,null,null,null,null,null,646.4,646.4,646.4,646.4,646.4,646.4,646.4]
[null,null,"WINTER/SUMMER PEAKING",null,"Non-coincident",null,null,null,null,null,null,null,null,null,null,null,"Summer","Summer","Summer","Summer","Summer","Summer","Summer"]
[null,null,null,null,"Coincident",null,null,null,null,null,null,null,null,null,null,null,"Summer","Summer","Summer","Summer","Summer","Summer","Summer"]
[null,null,"ADJUSTMENTS - EMBEDDED GENERATION","MW","Non-coincident",null,null,null,null,null,null,null,null,null,null,null,"-","-","-","-","-","-","-"]
[null,null,null,null,"Coincident",null,null,null,null,null,null,null,null,null,null,null,"-","-","-","-","-","-","-"]
[null,null,"WEATHER CORRECTED MD 10% POE","MW","Non-coincident",null,null,null,null,null,null,null,null,null,null,null,122.7,119.2,118.6,118.6,118.5,118.7,118.8]
[null,null,null,null,"Coincident",null,null,null,null,null,null,null,null,null,null,null,111.4,111.3,111.1,112.2,112.6,113,113.3]
[null,null,"WEATHER CORRECTED MD 10% POE","MVA","Non-coincident",null,null,null,null,null,null,null,null,null,null,null,126.5,122.6,122,122,121.8,122,122.1]
[null,null,null,null,"Coincident",null,null,null,null,null,null,null,null,null,null,null,115.2,114.8,114.6,115.7,116.1,116.6,116.8]
[null,null,"WEATHER CORRECTED MD 50% POE","MW","Non-coincident",null,null,null,null,null,null,null,null,null,null,null,114.3,110.9,110.3,110.3,110.2,110.4,110.4]
[null,null,null,null,"Coincident",null,null,null,null,null,null,null,null,null,null,null,106.1,106,105.8,106.8,107.3,107.7,107.9]
[null,null,"WEATHER CORRECTED MD 50% POE","MVA","Non-coincident",null,null,null,null,null,null,null,null,null,null,null,117.8,114.1,113.5,113.5,113.3,113.5,113.6]
[null,null,null,null,"Coincident",null,null,null,null,null,null,null,null,null,null,null,109.4,109,108.9,109.9,110.3,110.7,111]
[null,"Ross","CONNECTION POINT RATING","MVA","Non-coincident",null,null,null,null,null,null,null,null,null,null,null,571.6,571.6,571.6,571.6,571.6,571.6,571.6]
[null,null,null,null,"Coincident",null,null,null,null,null,null,null,null,null,null,null,571.6,571.6,571.6,571.6,571.6,571.6,571.6]
[null,null,"WINTER/SUMMER PEAKING",null,"Non-coincident",null,null,null,null,null,null,null,null,null,null,null,"Summer","Summer","Summer","Summer","Summer","Summer","Summer"]
[null,null,null,null,"Coincident",null,null,null,null,null,null,null,null,null,null,null,"Summer","Summer","Summer","Summer","Summer","Summer","Summer"]
[null,null,"ADJUSTMENTS - EMBEDDED GENERATION","MW","Non-coincident",null,null,null,null,null,null,null,null,null,null,null,"-","-","-","-","-","-","-"]
[null,null,null,null,"Coincident",null,null,null,null,null,null,null,null,null,null,null,44.3,44.3,44.3,44.3,44.3,44.3,44.3]
[null,null,"WEATHER CORRECTED MD 10% POE","MW","Non-coincident",null,null,null,null,null,null,null,null,null,null,null,37.5,37.5,37.5,37.5,37.6,37.6,37.799999999999997]
[null,null,null,null,"Coincident",null,null,null,null,null,null,null,null,null,null,null,32.799999999999997,33.700000000000003,33.799999999999997,34.200000000000003,34.4,34.6,34.700000000000003]
[null,null,"WEATHER CORRECTED MD 10% POE","MVA","Non-coincident",null,null,null,null,null,null,null,null,null,null,null,38.5,38.5,38.5,38.5,38.6,38.700000000000003,38.799999999999997]
[null,null,null,null,"Coincident",null,null,null,null,null,null,null,null,null,null,null,33.700000000000003,34.6,34.700000000000003,35.1,35.299999999999997,35.5,35.6]
[null,null,"WEATHER CORRECTED MD 50% POE","MW","Non-coincident",null,null,null,null,null,null,null,null,null,null,null,35,35,35,35,35.1,35.1,35.200000000000003]
[null,null,null,null,"Coincident",null,null,null,null,null,null,null,null,null,null,null,31.2,32.1,32.200000000000003,32.6,32.799999999999997,32.9,33.1]
[null,null,"WEATHER CORRECTED MD 50% POE","MVA","Non-coincident",null,null,null,null,null,null,null,null,null,null,null,36,36,36,36.1,36.1,36.1,36.299999999999997]
[null,null,null,null,"Coincident",null,null,null,null,null,null,null,null,null,null,null,32,32.9,33,33.4,33.6,33.700000000000003,33.799999999999997]
[null,"Runcorn","CONNECTION POINT RATING","MVA","Non-coincident",null,null,null,null,null,null,null,null,null,null,null,190,190,190,190,190,190,190]
[null,null,null,null,"Coincident",null,null,null,null,null,null,null,null,null,null,null,190,190,190,190,190,190,190]
[null,null,"WINTER/SUMMER PEAKING",null,"Non-coincident",null,null,null,null,null,null,null,null,null,null,null,"Summer","Summer","Summer","Summer","Summer","Summer","Summer"]
[null,null,null,null,"Coincident",null,null,null,null,null,null,null,null,null,null,null,"Summer","Summer","Summer","Summer","Summer","Summer","Summer"]
[null,null,"ADJUSTMENTS - EMBEDDED GENERATION","MW","Non-coincident",null,null,null,null,null,null,null,null,null,null,null,"-","-","-","-","-","-","-"]
[null,null,null,null,"Coincident",null,null,null,null,null,null,null,null,null,null,null,"-","-","-","-","-","-","-"]
[null,null,"WEATHER CORRECTED MD 10% POE","MW","Non-coincident",null,null,null,null,null,null,null,null,null,null,null,64.400000000000006,66.2,66.3,66.099999999999994,65.900000000000006,65.8,65.7]
[null,null,null,null,"Coincident",null,null,null,null,null,null,null,null,null,null,null,56.8,60.2,60.5,61,61,61.1,61.1]
[null,null,"WEATHER CORRECTED MD 10% POE","MVA","Non-coincident",null,null,null,null,null,null,null,null,null,null,null,65.2,67.2,67.2,67.099999999999994,66.8,66.7,66.7]
[null,null,null,null,"Coincident",null,null,null,null,null,null,null,null,null,null,null,57.4,61.1,61.4,61.8,61.9,62,62]
[null,null,"WEATHER CORRECTED MD 50% POE","MW","Non-coincident",null,null,null,null,null,null,null,null,null,null,null,58.2,60,60.1,59.9,59.7,59.6,59.6]
[null,null,null,null,"Coincident",null,null,null,null,null,null,null,null,null,null,null,54.1,57.4,57.6,58.1,58.1,58.2,58.2]
[null,null,"WEATHER CORRECTED MD 50% POE","MVA","Non-coincident",null,null,null,null,null,null,null,null,null,null,null,58.9,60.8,60.8,60.7,60.5,60.4,60.4]
[null,null,null,null,"Coincident",null,null,null,null,null,null,null,null,null,null,null,54.6,58.1,58.4,58.8,58.9,58.9,59]
[null,"South Pine","CONNECTION POINT RATING","MVA","Non-coincident",null,null,null,null,null,null,null,null,null,null,null,5775.2,5775.2,5775.2,5775.2,5775.2,5775.2,5775.2]
[null,null,null,null,"Coincident",null,null,null,null,null,null,null,null,null,null,null,5775.2,5775.2,5775.2,5775.2,5775.2,5775.2,5775.2]
[null,null,"WINTER/SUMMER PEAKING",null,"Non-coincident",null,null,null,null,null,null,null,null,null,null,null,"Summer","Summer","Summer","Summer","Summer","Summer","Summer"]
[null,null,null,null,"Coincident",null,null,null,null,null,null,null,null,null,null,null,"Summer","Summer","Summer","Summer","Summer","Summer","Summer"]
[null,null,"ADJUSTMENTS - EMBEDDED GENERATION","MW","Non-coincident",null,null,null,null,null,null,null,null,null,null,null,"-","-","-","-","-","-","-"]
[null,null,null,null,"Coincident",null,null,null,null,null,null,null,null,null,null,null,"-","-","-","-","-","-","-"]
[null,null,"WEATHER CORRECTED MD 10% POE","MW","Non-coincident",null,null,null,null,null,null,null,null,null,null,null,1100,1108.5,1113.0999999999999,1115,1114.5999999999999,1117.9000000000001,1121.8]
[null,null,null,null,"Coincident",null,null,null,null,null,null,null,null,null,null,null,948,984.2,991.9,1003.1,1008.2,1013.2,1018.3]
[null,null,"WEATHER CORRECTED MD 10% POE","MVA","Non-coincident",null,null,null,null,null,null,null,null,null,null,null,1119.2,1127.5,1132.4000000000001,1134.4000000000001,1134.0999999999999,1136.5,1138.7]
[null,null,null,null,"Coincident",null,null,null,null,null,null,null,null,null,null,null,966.7,1004.4,1012.5,1024,1029.3,1034.5,1039.8]
[null,null,"WEATHER CORRECTED MD 50% POE","MW","Non-coincident",null,null,null,null,null,null,null,null,null,null,null,972.3,980.7,984.8,986.5,986.3,989.1,992.6]
[null,null,null,null,"Coincident",null,null,null,null,null,null,null,null,null,null,null,902.8,937.4,944.7,955.4,960.2,965,969.8]
[null,null,"WEATHER CORRECTED MD 50% POE","MVA","Non-coincident",null,null,null,null,null,null,null,null,null,null,null,989.9,999.1,1003.6,1005.4,1005.2,1008.2,1011.9]
[null,null,null,null,"Coincident",null,null,null,null,null,null,null,null,null,null,null,919.2,955,962.7,973.6,978.6,983.6,988.6]
[null,"Stony Creek","CONNECTION POINT RATING","MVA","Non-coincident",null,null,null,null,null,null,null,null,null,null,null,22.9,22.9,22.9,22.9,22.9,22.9,22.9]
[null,null,null,null,"Coincident",null,null,null,null,null,null,null,null,null,null,null,22.9,22.9,22.9,22.9,22.9,22.9,22.9]
[null,null,"WINTER/SUMMER PEAKING",null,"Non-coincident",null,null,null,null,null,null,null,null,null,null,null,"Summer","Summer","Summer","Summer","Summer","Summer","Summer"]
[null,null,null,null,"Coincident",null,null,null,null,null,null,null,null,null,null,null,"Summer","Summer","Summer","Summer","Summer","Summer","Summer"]
[null,null,"ADJUSTMENTS - EMBEDDED GENERATION","MW","Non-coincident",null,null,null,null,null,null,null,null,null,null,null,"-","-","-","-","-","-","-"]
[null,null,null,null,"Coincident",null,null,null,null,null,null,null,null,null,null,null,"-","-","-","-","-","-","-"]
[null,null,"WEATHER CORRECTED MD 10% POE","MW","Non-coincident",null,null,null,null,null,null,null,null,null,null,null,2.7,2.7,2.7,2.7,2.7,2.7,2.7]
[null,null,null,null,"Coincident",null,null,null,null,null,null,null,null,null,null,null,2.5,2.5,2.5,2.6,2.6,2.6,2.6]
[null,null,"WEATHER CORRECTED MD 10% POE","MVA","Non-coincident",null,null,null,null,null,null,null,null,null,null,null,3.1,3.1,3.1,3.1,3.1,3.1,3.1]
[null,null,null,null,"Coincident",null,null,null,null,null,null,null,null,null,null,null,2.8,2.9,2.9,3,3,3,3]
[null,null,"WEATHER CORRECTED MD 50% POE","MW","Non-coincident",null,null,null,null,null,null,null,null,null,null,null,2.6,2.6,2.6,2.6,2.6,2.6,2.6]
[null,null,null,null,"Coincident",null,null,null,null,null,null,null,null,null,null,null,2.2999999999999998,2.4,2.4,2.5,2.5,2.5,2.5]
[null,null,"WEATHER CORRECTED MD 50% POE","MVA","Non-coincident",null,null,null,null,null,null,null,null,null,null,null,3,3,3,3,3,3,3]
[null,null,null,null,"Coincident",null,null,null,null,null,null,null,null,null,null,null,2.7,2.7,2.8,2.8,2.8,2.8,2.8]
[null,"Sumner","CONNECTION POINT RATING","MVA","Non-coincident",null,null,null,null,null,null,null,null,null,null,null,381.1,381.1,381.1,381.1,381.1,381.1,381.1]
[null,null,null,null,"Coincident",null,null,null,null,null,null,null,null,null,null,null,381.1,381.1,381.1,381.1,381.1,381.1,381.1]
[null,null,"WINTER/SUMMER PEAKING",null,"Non-coincident",null,null,null,null,null,null,null,null,null,null,null,"Summer","Summer","Summer","Summer","Summer","Summer","Summer"]
[null,null,null,null,"Coincident",null,null,null,null,null,null,null,null,null,null,null,"Summer","Summer","Summer","Summer","Summer","Summer","Summer"]
[null,null,"ADJUSTMENTS - EMBEDDED GENERATION","MW","Non-coincident",null,null,null,null,null,null,null,null,null,null,null,"-","-","-","-","-","-","-"]
[null,null,null,null,"Coincident",null,null,null,null,null,null,null,null,null,null,null,"-","-","-","-","-","-","-"]
[null,null,"WEATHER CORRECTED MD 10% POE","MW","Non-coincident",null,null,null,null,null,null,null,null,null,null,null,40.6,40.200000000000003,39.799999999999997,39.5,39.1,38.799999999999997,38.5]
[null,null,null,null,"Coincident",null,null,null,null,null,null,null,null,null,null,null,34,34.6,34.4,34.5,34.299999999999997,34.1,33.9]
[null,null,"WEATHER CORRECTED MD 10% POE","MVA","Non-coincident",null,null,null,null,null,null,null,null,null,null,null,41.2,40.700000000000003,40.299999999999997,40,39.6,39.299999999999997,39]
[null,null,null,null,"Coincident",null,null,null,null,null,null,null,null,null,null,null,34.5,35.1,34.9,34.9,34.799999999999997,34.6,34.4]
[null,null,"WEATHER CORRECTED MD 50% POE","MW","Non-coincident",null,null,null,null,null,null,null,null,null,null,null,34.799999999999997,34.4,34.1,33.9,33.5,33.299999999999997,33]
[null,null,null,null,"Coincident",null,null,null,null,null,null,null,null,null,null,null,32.4,32.9,32.700000000000003,32.799999999999997,32.6,32.5,32.299999999999997]
[null,null,"WEATHER CORRECTED MD 50% POE","MVA","Non-coincident",null,null,null,null,null,null,null,null,null,null,null,35.299999999999997,34.9,34.6,34.299999999999997,34,33.700000000000003,33.5]
[null,null,null,null,"Coincident",null,null,null,null,null,null,null,null,null,null,null,32.799999999999997,33.299999999999997,33.200000000000003,33.200000000000003,33.1,32.9,32.700000000000003]
[null,"Tangkam","CONNECTION POINT RATING","MVA","Non-coincident",null,null,null,null,null,null,null,null,null,null,null,487.4,487.4,487.4,487.4,487.4,487.4,487.4]
[null,null,null,null,"Coincident",null,null,null,null,null,null,null,null,null,null,null,487.4,487.4,487.4,487.4,487.4,487.4,487.4]
[null,null,"WINTER/SUMMER PEAKING",null,"Non-coincident",null,null,null,null,null,null,null,null,null,null,null,"Summer","Summer","Summer","Summer","Summer","Summer","Summer"]
[null,null,null,null,"Coincident",null,null,null,null,null,null,null,null,null,null,null,"Summer","Summer","Summer","Summer","Summer","Summer","Summer"]
[null,null,"ADJUSTMENTS - EMBEDDED GENERATION","MW","Non-coincident",null,null,null,null,null,null,null,null,null,null,null,"-","-","-","-","-","-","-"]
[null,null,null,null,"Coincident",null,null,null,null,null,null,null,null,null,null,null,22.4,22.4,22.4,22.4,22.4,22.4,22.4]
[null,null,"WEATHER CORRECTED MD 10% POE","MW","Non-coincident",null,null,null,null,null,null,null,null,null,null,null,35.6,35.5,35.5,35.5,35.6,35.700000000000003,35.9]
[null,null,null,null,"Coincident",null,null,null,null,null,null,null,null,null,null,null,34,34.9,35,35.4,35.6,35.799999999999997,36.1]
[null,null,"WEATHER CORRECTED MD 10% POE","MVA","Non-coincident",null,null,null,null,null,null,null,null,null,null,null,37.9,37.799999999999997,37.799999999999997,37.9,37.9,38.1,38.299999999999997]
[null,null,null,null,"Coincident",null,null,null,null,null,null,null,null,null,null,null,36.5,37.4,37.6,38,38.299999999999997,38.5,38.700000000000003]
[null,null,"WEATHER CORRECTED MD 50% POE","MW","Non-coincident",null,null,null,null,null,null,null,null,null,null,null,32,32,31.9,32,32,32.200000000000003,32.299999999999997]
[null,null,null,null,"Coincident",null,null,null,null,null,null,null,null,null,null,null,32.299999999999997,33.200000000000003,33.299999999999997,33.700000000000003,33.9,34.1,34.299999999999997]
[null,null,"WEATHER CORRECTED MD 50% POE","MVA","Non-coincident",null,null,null,null,null,null,null,null,null,null,null,34.200000000000003,34.1,34.1,34.200000000000003,34.200000000000003,34.299999999999997,34.5]
[null,null,null,null,"Coincident",null,null,null,null,null,null,null,null,null,null,null,34.5,35.5,35.6,36,36.200000000000003,36.4,36.700000000000003]
[null,"Tarong (66)","CONNECTION POINT RATING","MVA","Non-coincident",null,null,null,null,null,null,null,null,null,null,null,457.3,457.3,457.3,457.3,457.3,457.3,457.3]
[null,null,null,null,"Coincident",null,null,null,null,null,null,null,null,null,null,null,457.3,457.3,457.3,457.3,457.3,457.3,457.3]
[null,null,"WINTER/SUMMER PEAKING",null,"Non-coincident",null,null,null,null,null,null,null,null,null,null,null,"Summer","Summer","Summer","Summer","Summer","Summer","Summer"]
[null,null,null,null,"Coincident",null,null,null,null,null,null,null,null,null,null,null,"Summer","Summer","Summer","Summer","Summer","Summer","Summer"]
[null,null,"ADJUSTMENTS - EMBEDDED GENERATION","MW","Non-coincident",null,null,null,null,null,null,null,null,null,null,null,"-","-","-","-","-","-","-"]
[null,null,null,null,"Coincident",null,null,null,null,null,null,null,null,null,null,null,"-","-","-","-","-","-","-"]
[null,null,"WEATHER CORRECTED MD 10% POE","MW","Non-coincident",null,null,null,null,null,null,null,null,null,null,null,47.2,47.7,47.7,47.9,48.1,48.3,48.6]
[null,null,null,null,"Coincident",null,null,null,null,null,null,null,null,null,null,null,46.3,47.7,48,48.6,49,49.4,49.8]
[null,null,"WEATHER CORRECTED MD 10% POE","MVA","Non-coincident",null,null,null,null,null,null,null,null,null,null,null,48.9,49.4,49.5,49.7,49.9,50.1,50.5]
[null,null,null,null,"Coincident",null,null,null,null,null,null,null,null,null,null,null,48.1,49.7,49.9,50.6,51,51.4,51.8]
[null,null,"WEATHER CORRECTED MD 50% POE","MW","Non-coincident",null,null,null,null,null,null,null,null,null,null,null,43.6,43.7,43.8,44,44.1,44.3,44.6]
[null,null,null,null,"Coincident",null,null,null,null,null,null,null,null,null,null,null,44.1,45.5,45.7,46.3,46.7,47,47.4]
[null,null,"WEATHER CORRECTED MD 50% POE","MVA","Non-coincident",null,null,null,null,null,null,null,null,null,null,null,45.3,45.4,45.4,45.6,45.8,46,46.3]
[null,null,null,null,"Coincident",null,null,null,null,null,null,null,null,null,null,null,45.7,47.2,47.4,48.1,48.4,48.8,49.2]
[null,"Teebar Creek","CONNECTION POINT RATING","MVA","Non-coincident",null,null,null,null,null,null,null,null,null,null,null,905.3,905.3,905.3,905.3,905.3,905.3,905.3]
[null,null,null,null,"Coincident",null,null,null,null,null,null,null,null,null,null,null,905.3,905.3,905.3,905.3,905.3,905.3,905.3]
[null,null,"WINTER/SUMMER PEAKING",null,"Non-coincident",null,null,null,null,null,null,null,null,null,null,null,"Summer","Summer","Summer","Summer","Summer","Summer","Summer"]
[null,null,null,null,"Coincident",null,null,null,null,null,null,null,null,null,null,null,"Summer","Summer","Summer","Summer","Summer","Summer","Summer"]
[null,null,"ADJUSTMENTS - EMBEDDED GENERATION","MW","Non-coincident",null,null,null,null,null,null,null,null,null,null,null,"-","-","-","-","-","-","-"]
[null,null,null,null,"Coincident",null,null,null,null,null,null,null,null,null,null,null,24.7,24.7,24.7,24.7,24.7,24.7,24.7]
[null,null,"WEATHER CORRECTED MD 10% POE","MW","Non-coincident",null,null,null,null,null,null,null,null,null,null,null,179.6,186.3,191.4,192.5,193.4,195.1,197.2]
[null,null,null,null,"Coincident",null,null,null,null,null,null,null,null,null,null,null,155.1,165.3,170.8,173.4,175.2,177.1,179.2]
[null,null,"WEATHER CORRECTED MD 10% POE","MVA","Non-coincident",null,null,null,null,null,null,null,null,null,null,null,183.4,190.8,196.4,197.5,198.5,200.3,202.5]
[null,null,null,null,"Coincident",null,null,null,null,null,null,null,null,null,null,null,161.5,172.5,178.6,181.3,183.2,185.2,187.5]
[null,null,"WEATHER CORRECTED MD 50% POE","MW","Non-coincident",null,null,null,null,null,null,null,null,null,null,null,164.2,170,175.1,176,176.9,178.5,180.4]
[null,null,null,null,"Coincident",null,null,null,null,null,null,null,null,null,null,null,147.69999999999999,157.4,162.69999999999999,165.1,166.8,168.7,170.7]
[null,null,"WEATHER CORRECTED MD 50% POE","MVA","Non-coincident",null,null,null,null,null,null,null,null,null,null,null,167.8,174.2,179.7,180.7,181.7,183.3,185.3]
[null,null,null,null,"Coincident",null,null,null,null,null,null,null,null,null,null,null,153.5,164,169.8,172.3,174.1,176,178.2]
[null,"Tennyson (110)","CONNECTION POINT RATING","MVA","Non-coincident",null,null,null,null,null,null,null,null,null,null,null,302,302,302,302,302,302,302]
[null,null,null,null,"Coincident",null,null,null,null,null,null,null,null,null,null,null,302,302,302,302,302,302,302]
[null,null,"WINTER/SUMMER PEAKING",null,"Non-coincident",null,null,null,null,null,null,null,null,null,null,null,"Summer","Summer","Summer","Summer","Summer","Summer","Summer"]
[null,null,null,null,"Coincident",null,null,null,null,null,null,null,null,null,null,null,"Summer","Summer","Summer","Summer","Summer","Summer","Summer"]
[null,null,"ADJUSTMENTS - EMBEDDED GENERATION","MW","Non-coincident",null,null,null,null,null,null,null,null,null,null,null,"-","-","-","-","-","-","-"]
[null,null,null,null,"Coincident",null,null,null,null,null,null,null,null,null,null,null,"-","-","-","-","-","-","-"]
[null,null,"WEATHER CORRECTED MD 10% POE","MW","Non-coincident"]
[null,null,null,null,"Coincident"]
[null,null,"WEATHER CORRECTED MD 10% POE","MVA","Non-coincident"]
[null,null,null,null,"Coincident"]
[null,null,"WEATHER CORRECTED MD 50% POE","MW","Non-coincident"]
[null,null,null,null,"Coincident"]
[null,null,"WEATHER CORRECTED MD 50% POE","MVA","Non-coincident"]
[null,null,null,null,"Coincident"]
[null,"Tennyson (33)","CONNECTION POINT RATING","MVA","Non-coincident",null,null,null,null,null,null,null,null,null,null,null,264.10000000000002,264.10000000000002,264.10000000000002,264.10000000000002,264.10000000000002,264.10000000000002,264.10000000000002]
[null,null,null,null,"Coincident",null,null,null,null,null,null,null,null,null,null,null,264.10000000000002,264.10000000000002,264.10000000000002,264.10000000000002,264.10000000000002,264.10000000000002,264.10000000000002]
[null,null,"WINTER/SUMMER PEAKING",null,"Non-coincident",null,null,null,null,null,null,null,null,null,null,null,"Summer","Summer","Summer","Summer","Summer","Summer","Summer"]
[null,null,null,null,"Coincident",null,null,null,null,null,null,null,null,null,null,null,"Summer","Summer","Summer","Summer","Summer","Summer","Summer"]
[null,null,"ADJUSTMENTS - EMBEDDED GENERATION","MW","Non-coincident",null,null,null,null,null,null,null,null,null,null,null,"-","-","-","-","-","-","-"]
[null,null,null,null,"Coincident",null,null,null,null,null,null,null,null,null,null,null,"-","-","-","-","-","-","-"]
[null,null,"WEATHER CORRECTED MD 10% POE","MW","Non-coincident",null,null,null,null,null,null,null,null,null,null,null,200.4,204.1,208.4,210.2,211.2,210.8,210.2]
[null,null,null,null,"Coincident",null,null,null,null,null,null,null,null,null,null,null,172.7,181.6,186.5,190.1,192.2,192.3,192]
[null,null,"WEATHER CORRECTED MD 10% POE","MVA","Non-coincident",null,null,null,null,null,null,null,null,null,null,null,204.1,208.2,211.7,213.7,214.9,214.5,213.9]
[null,null,null,null,"Coincident",null,null,null,null,null,null,null,null,null,null,null,176.2,185.6,189.6,193.5,195.9,195.9,195.6]
[null,null,"WEATHER CORRECTED MD 50% POE","MW","Non-coincident",null,null,null,null,null,null,null,null,null,null,null,177.2,180.9,185.2,186.9,188.1,187.7,187.2]
[null,null,null,null,"Coincident",null,null,null,null,null,null,null,null,null,null,null,164.5,172.9,177.6,181,183.1,183.1,182.8]
[null,null,"WEATHER CORRECTED MD 50% POE","MVA","Non-coincident",null,null,null,null,null,null,null,null,null,null,null,180.4,184.6,188,190,191.4,191,190.4]
[null,null,null,null,"Coincident",null,null,null,null,null,null,null,null,null,null,null,167.5,176.5,180.4,184,186.3,186.3,186]
[null,"Terranora Interconnector","CONNECTION POINT RATING","MVA","Non-coincident",null,null,null,null,null,null,null,null,null,null,null,267.3,267.3,267.3,267.3,267.3,267.3,267.3]
[null,null,null,null,"Coincident",null,null,null,null,null,null,null,null,null,null,null,267.3,267.3,267.3,267.3,267.3,267.3,267.3]
[null,null,"WINTER/SUMMER PEAKING",null,"Non-coincident",null,null,null,null,null,null,null,null,null,null,null,"Summer","Summer","Summer","Summer","Summer","Summer","Summer"]
[null,null,null,null,"Coincident",null,null,null,null,null,null,null,null,null,null,null,"Summer","Summer","Summer","Summer","Summer","Summer","Summer"]
[null,null,"ADJUSTMENTS - EMBEDDED GENERATION","MW","Non-coincident",null,null,null,null,null,null,null,null,null,null,null,"-","-","-","-","-","-","-"]
[null,null,null,null,"Coincident",null,null,null,null,null,null,null,null,null,null,null,"-","-","-","-","-","-","-"]
[null,null,"WEATHER CORRECTED MD 10% POE","MW","Non-coincident",null,null,null,null,null,null,null,null,null,null,null,205,205,205,205,205,205,205]
[null,null,null,null,"Coincident",null,null,null,null,null,null,null,null,null,null,null,-6.1,-6.1,-6.1,-6.1,-6.1,-6.1,-6.1]
[null,null,"WEATHER CORRECTED MD 10% POE","MVA","Non-coincident",null,null,null,null,null,null,null,null,null,null,null,205,205,205,205,205,205,205]
[null,null,null,null,"Coincident",null,null,null,null,null,null,null,null,null,null,null,12.8,12.8,12.8,12.8,12.8,12.8,12.8]
[null,null,"WEATHER CORRECTED MD 50% POE","MW","Non-coincident",null,null,null,null,null,null,null,null,null,null,null,205,205,205,205,205,205,205]
[null,null,null,null,"Coincident",null,null,null,null,null,null,null,null,null,null,null,-6.1,-6.1,-6.1,-6.1,-6.1,-6.1,-6.1]
[null,null,"WEATHER CORRECTED MD 50% POE","MVA","Non-coincident",null,null,null,null,null,null,null,null,null,null,null,205,205,205,205,205,205,205]
[null,null,null,null,"Coincident",null,null,null,null,null,null,null,null,null,null,null,12.8,12.8,12.8,12.8,12.8,12.8,12.8]
[null,"Townsville East","CONNECTION POINT RATING","MVA","Non-coincident",null,null,null,null,null,null,null,null,null,null,null,112.5,112.5,112.5,112.5,112.5,112.5,112.5]
[null,null,null,null,"Coincident",null,null,null,null,null,null,null,null,null,null,null,112.5,112.5,112.5,112.5,112.5,112.5,112.5]
[null,null,"WINTER/SUMMER PEAKING",null,"Non-coincident",null,null,null,null,null,null,null,null,null,null,null,"Summer","Summer","Summer","Summer","Summer","Summer","Summer"]
[null,null,null,null,"Coincident",null,null,null,null,null,null,null,null,null,null,null,"Summer","Summer","Summer","Summer","Summer","Summer","Summer"]
[null,null,"ADJUSTMENTS - EMBEDDED GENERATION","MW","Non-coincident",null,null,null,null,null,null,null,null,null,null,null,"-","-","-","-","-","-","-"]
[null,null,null,null,"Coincident",null,null,null,null,null,null,null,null,null,null,null,9.4,9.4,9.4,9.4,9.4,9.4,9.4]
[null,null,"WEATHER CORRECTED MD 10% POE","MW","Non-coincident",null,null,null,null,null,null,null,null,null,null,null,24.9,25,23.8,24,24.2,24.4,24.7]
[null,null,null,null,"Coincident",null,null,null,null,null,null,null,null,null,null,null,20.6,21.3,20.3,20.7,20.9,21.2,21.4]
[null,null,"WEATHER CORRECTED MD 10% POE","MVA","Non-coincident",null,null,null,null,null,null,null,null,null,null,null,25,25,23.9,24,24.2,24.4,24.7]
[null,null,null,null,"Coincident",null,null,null,null,null,null,null,null,null,null,null,20.7,21.4,20.399999999999999,20.8,21,21.3,21.5]
[null,null,"WEATHER CORRECTED MD 50% POE","MW","Non-coincident",null,null,null,null,null,null,null,null,null,null,null,22,22.1,21,21.2,21.3,21.5,21.8]
[null,null,null,null,"Coincident",null,null,null,null,null,null,null,null,null,null,null,19.600000000000001,20.3,19.3,19.7,19.899999999999999,20.100000000000001,20.399999999999999]
[null,null,"WEATHER CORRECTED MD 50% POE","MVA","Non-coincident",null,null,null,null,null,null,null,null,null,null,null,22,22.1,21,21.2,21.3,21.5,21.8]
[null,null,null,null,"Coincident",null,null,null,null,null,null,null,null,null,null,null,19.7,20.399999999999999,19.399999999999999,19.8,20,20.3,20.5]
[null,"Townsville South (Ergon)","CONNECTION POINT RATING","MVA","Non-coincident",null,null,null,null,null,null,null,null,null,null,null,202,202,202,202,202,202,202]
[null,null,null,null,"Coincident",null,null,null,null,null,null,null,null,null,null,null,202,202,202,202,202,202,202]
[null,null,"WINTER/SUMMER PEAKING",null,"Non-coincident",null,null,null,null,null,null,null,null,null,null,null,"Summer","Summer","Summer","Summer","Summer","Summer","Summer"]
[null,null,null,null,"Coincident",null,null,null,null,null,null,null,null,null,null,null,"Summer","Summer","Summer","Summer","Summer","Summer","Summer"]
[null,null,"ADJUSTMENTS - EMBEDDED GENERATION","MW","Non-coincident",null,null,null,null,null,null,null,null,null,null,null,"-","-","-","-","-","-","-"]
[null,null,null,null,"Coincident",null,null,null,null,null,null,null,null,null,null,null,17.399999999999999,17.399999999999999,17.399999999999999,17.399999999999999,17.399999999999999,17.399999999999999,17.399999999999999]
[null,null,"WEATHER CORRECTED MD 10% POE","MW","Non-coincident",null,null,null,null,null,null,null,null,null,null,null,71.3,71.599999999999994,68.400000000000006,69,69.5,70.3,71.099999999999994]
[null,null,null,null,"Coincident",null,null,null,null,null,null,null,null,null,null,null,59.1,61.1,58.3,59.4,60.2,60.9,61.8]
[null,null,"WEATHER CORRECTED MD 10% POE","MVA","Non-coincident",null,null,null,null,null,null,null,null,null,null,null,71.3,71.599999999999994,68.400000000000006,69,69.5,70.3,71.099999999999994]
[null,null,null,null,"Coincident",null,null,null,null,null,null,null,null,null,null,null,59.2,61.2,58.4,59.4,60.2,61,61.8]
[null,null,"WEATHER CORRECTED MD 50% POE","MW","Non-coincident",null,null,null,null,null,null,null,null,null,null,null,63.1,63.4,60.3,60.8,61.3,62,62.7]
[null,null,null,null,"Coincident",null,null,null,null,null,null,null,null,null,null,null,56.3,58.2,55.6,56.6,57.3,58,58.8]
[null,null,"WEATHER CORRECTED MD 50% POE","MVA","Non-coincident",null,null,null,null,null,null,null,null,null,null,null,63.2,63.5,60.3,60.9,61.3,62,62.7]
[null,null,null,null,"Coincident",null,null,null,null,null,null,null,null,null,null,null,56.3,58.3,55.6,56.6,57.3,58.1,58.9]
[null,"Townsville South (Townsville Zinc)","CONNECTION POINT RATING","MVA","Non-coincident",null,null,null,null,null,null,null,null,null,null,null,0,0,0,0,0,0,0]
[null,null,null,null,"Coincident",null,null,null,null,null,null,null,null,null,null,null,0,0,0,0,0,0,0]
[null,null,"WINTER/SUMMER PEAKING",null,"Non-coincident",null,null,null,null,null,null,null,null,null,null,null,"Summer","Summer","Summer","Summer","Summer","Summer","Summer"]
[null,null,null,null,"Coincident",null,null,null,null,null,null,null,null,null,null,null,"Summer","Summer","Summer","Summer","Summer","Summer","Summer"]
[null,null,"ADJUSTMENTS - EMBEDDED GENERATION","MW","Non-coincident",null,null,null,null,null,null,null,null,null,null,null,"-","-","-","-","-","-","-"]
[null,null,null,null,"Coincident",null,null,null,null,null,null,null,null,null,null,null,43.5,43.5,43.5,43.5,43.5,43.5,43.5]
[null,null,"WEATHER CORRECTED MD 10% POE","MW","Non-coincident"]
[null,null,null,null,"Coincident"]
[null,null,"WEATHER CORRECTED MD 10% POE","MVA","Non-coincident"]
[null,null,null,null,"Coincident"]
[null,null,"WEATHER CORRECTED MD 50% POE","MW","Non-coincident"]
[null,null,null,null,"Coincident"]
[null,null,"WEATHER CORRECTED MD 50% POE","MVA","Non-coincident"]
[null,null,null,null,"Coincident"]
[null,"Townsville Switchyard (QLD Nickel)","CONNECTION POINT RATING","MVA","Non-coincident",null,null,null,null,null,null,null,null,null,null,null,228.6,228.6,228.6,228.6,228.6,228.6,228.6]
[null,null,null,null,"Coincident",null,null,null,null,null,null,null,null,null,null,null,228.6,228.6,228.6,228.6,228.6,228.6,228.6]
[null,null,"WINTER/SUMMER PEAKING",null,"Non-coincident",null,null,null,null,null,null,null,null,null,null,null,"Summer","Summer","Summer","Summer","Summer","Summer","Summer"]
[null,null,null,null,"Coincident",null,null,null,null,null,null,null,null,null,null,null,"Summer","Summer","Summer","Summer","Summer","Summer","Summer"]
[null,null,"ADJUSTMENTS - EMBEDDED GENERATION","MW","Non-coincident",null,null,null,null,null,null,null,null,null,null,null,"-","-","-","-","-","-","-"]
[null,null,null,null,"Coincident",null,null,null,null,null,null,null,null,null,null,null,"-","-","-","-","-","-","-"]
[null,null,"WEATHER CORRECTED MD 10% POE","MW","Non-coincident"]
[null,null,null,null,"Coincident"]
[null,null,"WEATHER CORRECTED MD 10% POE","MVA","Non-coincident"]
[null,null,null,null,"Coincident"]
[null,null,"WEATHER CORRECTED MD 50% POE","MW","Non-coincident"]
[null,null,null,null,"Coincident"]
[null,null,"WEATHER CORRECTED MD 50% POE","MVA","Non-coincident"]
[null,null,null,null,"Coincident"]
[null,"Tully","CONNECTION POINT RATING","MVA","Non-coincident",null,null,null,null,null,null,null,null,null,null,null,50,50,50,50,54,54,54]
[null,null,null,null,"Coincident",null,null,null,null,null,null,null,null,null,null,null,50,50,50,50,54,54,54]
[null,null,"WINTER/SUMMER PEAKING",null,"Non-coincident",null,null,null,null,null,null,null,null,null,null,null,"Summer","Summer","Summer","Summer","Summer","Summer","Summer"]
[null,null,null,null,"Coincident",null,null,null,null,null,null,null,null,null,null,null,"Summer","Summer","Summer","Summer","Summer","Summer","Summer"]
[null,null,"ADJUSTMENTS - EMBEDDED GENERATION","MW","Non-coincident",null,null,null,null,null,null,null,null,null,null,null,"-","-","-","-","-","-","-"]
[null,null,null,null,"Coincident",null,null,null,null,null,null,null,null,null,null,null,"-","-","-","-","-","-","-"]
[null,null,"WEATHER CORRECTED MD 10% POE","MW","Non-coincident",null,null,null,null,null,null,null,null,null,null,null,14.4,14.4,14.4,14.5,14.6,14.7,14.8]
[null,null,null,null,"Coincident",null,null,null,null,null,null,null,null,null,null,null,11.8,12.1,12.2,12.4,12.5,12.6,12.7]
[null,null,"WEATHER CORRECTED MD 10% POE","MVA","Non-coincident",null,null,null,null,null,null,null,null,null,null,null,14.4,14.4,14.4,14.5,14.6,14.7,14.8]
[null,null,null,null,"Coincident",null,null,null,null,null,null,null,null,null,null,null,11.8,12.1,12.2,12.4,12.5,12.6,12.7]
[null,null,"WEATHER CORRECTED MD 50% POE","MW","Non-coincident",null,null,null,null,null,null,null,null,null,null,null,12.6,12.6,12.6,12.7,12.8,12.8,12.9]
[null,null,null,null,"Coincident",null,null,null,null,null,null,null,null,null,null,null,11.2,11.6,11.6,11.8,11.9,12,12.1]
[null,null,"WEATHER CORRECTED MD 50% POE","MVA","Non-coincident",null,null,null,null,null,null,null,null,null,null,null,12.6,12.6,12.6,12.7,12.8,12.8,12.9]
[null,null,null,null,"Coincident",null,null,null,null,null,null,null,null,null,null,null,11.2,11.6,11.6,11.8,11.9,12,12.1]
[null,"Turkinje (132)","CONNECTION POINT RATING","MVA","Non-coincident",null,null,null,null,null,null,null,null,null,null,null,359,359,359,359,359,359,359]
[null,null,null,null,"Coincident",null,null,null,null,null,null,null,null,null,null,null,359,359,359,359,359,359,359]
[null,null,"WINTER/SUMMER PEAKING",null,"Non-coincident",null,null,null,null,null,null,null,null,null,null,null,"Summer","Summer","Summer","Summer","Summer","Summer","Summer"]
[null,null,null,null,"Coincident",null,null,null,null,null,null,null,null,null,null,null,"Summer","Summer","Summer","Summer","Summer","Summer","Summer"]
[null,null,"ADJUSTMENTS - EMBEDDED GENERATION","MW","Non-coincident",null,null,null,null,null,null,null,null,null,null,null,"-","-","-","-","-","-","-"]
[null,null,null,null,"Coincident",null,null,null,null,null,null,null,null,null,null,null,"-","-","-","-","-","-","-"]
[null,null,"WEATHER CORRECTED MD 10% POE","MW","Non-coincident",null,null,null,null,null,null,null,null,null,null,null,15.1,15.1,15.2,15.2,15.3,15.4,15.5]
[null,null,null,null,"Coincident",null,null,null,null,null,null,null,null,null,null,null,13.1,13.5,13.6,13.8,13.9,14.1,14.2]
[null,null,"WEATHER CORRECTED MD 10% POE","MVA","Non-coincident",null,null,null,null,null,null,null,null,null,null,null,15.1,15.1,15.2,15.3,15.3,15.4,15.5]
[null,null,null,null,"Coincident",null,null,null,null,null,null,null,null,null,null,null,13.1,13.5,13.6,13.8,13.9,14.1,14.2]
[null,null,"WEATHER CORRECTED MD 50% POE","MW","Non-coincident",null,null,null,null,null,null,null,null,null,null,null,14,14,14,14.1,14.1,14.2,14.4]
[null,null,null,null,"Coincident",null,null,null,null,null,null,null,null,null,null,null,12.5,12.9,13,13.2,13.3,13.4,13.5]
[null,null,"WEATHER CORRECTED MD 50% POE","MVA","Non-coincident",null,null,null,null,null,null,null,null,null,null,null,14,14,14,14.1,14.2,14.2,14.4]
[null,null,null,null,"Coincident",null,null,null,null,null,null,null,null,null,null,null,12.5,12.9,13,13.2,13.3,13.4,13.5]
[null,"Turkinje (66)","CONNECTION POINT RATING","MVA","Non-coincident",null,null,null,null,null,null,null,null,null,null,null,190,190,190,190,190,190,190]
[null,null,null,null,"Coincident",null,null,null,null,null,null,null,null,null,null,null,190,190,190,190,190,190,190]
[null,null,"WINTER/SUMMER PEAKING",null,"Non-coincident",null,null,null,null,null,null,null,null,null,null,null,"Summer","Summer","Summer","Summer","Summer","Summer","Summer"]
[null,null,null,null,"Coincident",null,null,null,null,null,null,null,null,null,null,null,"Summer","Summer","Summer","Summer","Summer","Summer","Summer"]
[null,null,"ADJUSTMENTS - EMBEDDED GENERATION","MW","Non-coincident",null,null,null,null,null,null,null,null,null,null,null,"-","-","-","-","-","-","-"]
[null,null,null,null,"Coincident",null,null,null,null,null,null,null,null,null,null,null,"-","-","-","-","-","-","-"]
[null,null,"WEATHER CORRECTED MD 10% POE","MW","Non-coincident",null,null,null,null,null,null,null,null,null,null,null,66.099999999999994,66.3,66.599999999999994,67,67.3,67.900000000000006,68.5]
[null,null,null,null,"Coincident",null,null,null,null,null,null,null,null,null,null,null,57.6,59.5,59.9,60.8,61.5,62.1,62.8]
[null,null,"WEATHER CORRECTED MD 10% POE","MVA","Non-coincident",null,null,null,null,null,null,null,null,null,null,null,66.2,66.3,66.599999999999994,67,67.400000000000006,67.900000000000006,68.599999999999994]
[null,null,null,null,"Coincident",null,null,null,null,null,null,null,null,null,null,null,57.6,59.5,59.9,60.8,61.5,62.1,62.8]
[null,null,"WEATHER CORRECTED MD 50% POE","MW","Non-coincident",null,null,null,null,null,null,null,null,null,null,null,61.4,61.5,61.8,62.1,62.5,62.9,63.6]
[null,null,null,null,"Coincident",null,null,null,null,null,null,null,null,null,null,null,54.9,56.6,57.1,57.9,58.6,59.2,59.8]
[null,null,"WEATHER CORRECTED MD 50% POE","MVA","Non-coincident",null,null,null,null,null,null,null,null,null,null,null,61.5,61.6,61.9,62.2,62.5,63,63.7]
[null,null,null,null,"Coincident",null,null,null,null,null,null,null,null,null,null,null,54.9,56.6,57.1,57.9,58.6,59.2,59.9]
[null,"Wandoan South (132)","CONNECTION POINT RATING","MVA","Non-coincident",null,null,null,null,null,null,null,null,null,null,null,0,0,0,0,0,0,0]
[null,null,null,null,"Coincident",null,null,null,null,null,null,null,null,null,null,null,0,0,0,0,0,0,0]
[null,null,"WINTER/SUMMER PEAKING",null,"Non-coincident",null,null,null,null,null,null,null,null,null,null,null,"Summer","Summer","Summer","Summer","Summer","Summer","Summer"]
[null,null,null,null,"Coincident",null,null,null,null,null,null,null,null,null,null,null,"Summer","Summer","Summer","Summer","Summer","Summer","Summer"]
[null,null,"ADJUSTMENTS - EMBEDDED GENERATION","MW","Non-coincident",null,null,null,null,null,null,null,null,null,null,null,"-","-","-","-","-","-","-"]
[null,null,null,null,"Coincident",null,null,null,null,null,null,null,null,null,null,null,"-","-","-","-","-","-","-"]
[null,null,"WEATHER CORRECTED MD 10% POE","MW","Non-coincident"]
[null,null,null,null,"Coincident"]
[null,null,"WEATHER CORRECTED MD 10% POE","MVA","Non-coincident"]
[null,null,null,null,"Coincident"]
[null,null,"WEATHER CORRECTED MD 50% POE","MW","Non-coincident"]
[null,null,null,null,"Coincident"]
[null,null,"WEATHER CORRECTED MD 50% POE","MVA","Non-coincident"]
[null,null,null,null,"Coincident"]
[null,"Wandoan South (275)","CONNECTION POINT RATING","MVA","Non-coincident",null,null,null,null,null,null,null,null,null,null,null,0,0,0,0,0,0,0]
[null,null,null,null,"Coincident",null,null,null,null,null,null,null,null,null,null,null,0,0,0,0,0,0,0]
[null,null,"WINTER/SUMMER PEAKING",null,"Non-coincident",null,null,null,null,null,null,null,null,null,null,null,"Summer","Summer","Summer","Summer","Summer","Summer","Summer"]
[null,null,null,null,"Coincident",null,null,null,null,null,null,null,null,null,null,null,"Summer","Summer","Summer","Summer","Summer","Summer","Summer"]
[null,null,"ADJUSTMENTS - EMBEDDED GENERATION","MW","Non-coincident",null,null,null,null,null,null,null,null,null,null,null,"-","-","-","-","-","-","-"]
[null,null,null,null,"Coincident",null,null,null,null,null,null,null,null,null,null,null,"-","-","-","-","-","-","-"]
[null,null,"WEATHER CORRECTED MD 10% POE","MW","Non-coincident"]
[null,null,null,null,"Coincident"]
[null,null,"WEATHER CORRECTED MD 10% POE","MVA","Non-coincident"]
[null,null,null,null,"Coincident"]
[null,null,"WEATHER CORRECTED MD 50% POE","MW","Non-coincident"]
[null,null,null,null,"Coincident"]
[null,null,"WEATHER CORRECTED MD 50% POE","MVA","Non-coincident"]
[null,null,null,null,"Coincident"]
[null,"Wandoo (Rail)","CONNECTION POINT RATING","MVA","Non-coincident",null,null,null,null,null,null,null,null,null,null,null,63.7,63.7,63.7,63.7,63.7,63.7,63.7]
[null,null,null,null,"Coincident",null,null,null,null,null,null,null,null,null,null,null,63.7,63.7,63.7,63.7,63.7,63.7,63.7]
[null,null,"WINTER/SUMMER PEAKING",null,"Non-coincident",null,null,null,null,null,null,null,null,null,null,null,"Summer","Summer","Summer","Summer","Summer","Summer","Summer"]
[null,null,null,null,"Coincident",null,null,null,null,null,null,null,null,null,null,null,"Summer","Summer","Summer","Summer","Summer","Summer","Summer"]
[null,null,"ADJUSTMENTS - EMBEDDED GENERATION","MW","Non-coincident",null,null,null,null,null,null,null,null,null,null,null,"-","-","-","-","-","-","-"]
[null,null,null,null,"Coincident",null,null,null,null,null,null,null,null,null,null,null,"-","-","-","-","-","-","-"]
[null,null,"WEATHER CORRECTED MD 10% POE","MW","Non-coincident"]
[null,null,null,null,"Coincident"]
[null,null,"WEATHER CORRECTED MD 10% POE","MVA","Non-coincident"]
[null,null,null,null,"Coincident"]
[null,null,"WEATHER CORRECTED MD 50% POE","MW","Non-coincident"]
[null,null,null,null,"Coincident"]
[null,null,"WEATHER CORRECTED MD 50% POE","MVA","Non-coincident"]
[null,null,null,null,"Coincident"]
[null,"Woolooga (Energex)","CONNECTION POINT RATING","MVA","Non-coincident",null,null,null,null,null,null,null,null,null,null,null,823.1,823.1,823.1,823.1,823.1,823.1,823.1]
[null,null,null,null,"Coincident",null,null,null,null,null,null,null,null,null,null,null,823.1,823.1,823.1,823.1,823.1,823.1,823.1]
[null,null,"WINTER/SUMMER PEAKING",null,"Non-coincident",null,null,null,null,null,null,null,null,null,null,null,"Summer","Summer","Summer","Summer","Summer","Summer","Summer"]
[null,null,null,null,"Coincident",null,null,null,null,null,null,null,null,null,null,null,"Summer","Summer","Summer","Summer","Summer","Summer","Summer"]
[null,null,"ADJUSTMENTS - EMBEDDED GENERATION","MW","Non-coincident",null,null,null,null,null,null,null,null,null,null,null,"-","-","-","-","-","-","-"]
[null,null,null,null,"Coincident",null,null,null,null,null,null,null,null,null,null,null,"-","-","-","-","-","-","-"]
[null,null,"WEATHER CORRECTED MD 10% POE","MW","Non-coincident",null,null,null,null,null,null,null,null,null,null,null,196.4,196.5,196.8,196.6,196.1,195.9,195.7]
[null,null,null,null,"Coincident",null,null,null,null,null,null,null,null,null,null,null,173,178.2,179.1,180.6,181.1,181.3,181.3]
[null,null,"WEATHER CORRECTED MD 10% POE","MVA","Non-coincident",null,null,null,null,null,null,null,null,null,null,null,196.7,196.8,197.1,196.9,196.4,196.2,196]
[null,null,null,null,"Coincident",null,null,null,null,null,null,null,null,null,null,null,173.3,178.5,179.4,180.9,181.4,181.6,181.7]
[null,null,"WEATHER CORRECTED MD 50% POE","MW","Non-coincident",null,null,null,null,null,null,null,null,null,null,null,177.4,177.5,177.8,177.6,177.2,177,176.8]
[null,null,null,null,"Coincident",null,null,null,null,null,null,null,null,null,null,null,164.7,169.7,170.6,172,172.5,172.7,172.7]
[null,null,"WEATHER CORRECTED MD 50% POE","MVA","Non-coincident",null,null,null,null,null,null,null,null,null,null,null,177.7,177.8,178.1,177.9,177.5,177.3,177.1]
[null,null,null,null,"Coincident",null,null,null,null,null,null,null,null,null,null,null,165,170,170.9,172.3,172.8,173,173]
[null,"Woolooga (Ergon)","CONNECTION POINT RATING","MVA","Non-coincident",null,null,null,null,null,null,null,null,null,null,null,714.2,714.2,714.2,714.2,714.2,714.2,714.2]
[null,null,null,null,"Coincident",null,null,null,null,null,null,null,null,null,null,null,714.2,714.2,714.2,714.2,714.2,714.2,714.2]
[null,null,"WINTER/SUMMER PEAKING",null,"Non-coincident",null,null,null,null,null,null,null,null,null,null,null,"Summer","Summer","Summer","Summer","Summer","Summer","Summer"]
[null,null,null,null,"Coincident",null,null,null,null,null,null,null,null,null,null,null,"Summer","Summer","Summer","Summer","Summer","Summer","Summer"]
[null,null,"ADJUSTMENTS - EMBEDDED GENERATION","MW","Non-coincident",null,null,null,null,null,null,null,null,null,null,null,"-","-","-","-","-","-","-"]
[null,null,null,null,"Coincident",null,null,null,null,null,null,null,null,null,null,null,"-","-","-","-","-","-","-"]
[null,null,"WEATHER CORRECTED MD 10% POE","MW","Non-coincident",null,null,null,null,null,null,null,null,null,null,null,16.7,17.100000000000001,17.100000000000001,17.2,17.3,17.399999999999999,17.600000000000001]
[null,null,null,null,"Coincident",null,null,null,null,null,null,null,null,null,null,null,14.1,14.9,15,15.2,15.3,15.5,15.7]
[null,null,"WEATHER CORRECTED MD 10% POE","MVA","Non-coincident",null,null,null,null,null,null,null,null,null,null,null,17.100000000000001,17.5,17.5,17.5,17.600000000000001,17.8,18]
[null,null,null,null,"Coincident",null,null,null,null,null,null,null,null,null,null,null,14.4,15.2,15.3,15.5,15.6,15.8,16]
[null,null,"WEATHER CORRECTED MD 50% POE","MW","Non-coincident",null,null,null,null,null,null,null,null,null,null,null,15.2,15.6,15.6,15.6,15.7,15.8,16]
[null,null,null,null,"Coincident",null,null,null,null,null,null,null,null,null,null,null,13.5,14.2,14.3,14.4,14.6,14.7,15]
[null,null,"WEATHER CORRECTED MD 50% POE","MVA","Non-coincident",null,null,null,null,null,null,null,null,null,null,null,15.5,15.9,15.9,16,16,16.2,16.399999999999999]
[null,null,null,null,"Coincident",null,null,null,null,null,null,null,null,null,null,null,13.7,14.5,14.6,14.7,14.9,15,15.3]
[null,"Woree","CONNECTION POINT RATING","MVA","Non-coincident",null,null,null,null,null,null,null,null,null,null,null,571.6,571.6,571.6,571.6,571.6,571.6,571.6]
[null,null,null,null,"Coincident",null,null,null,null,null,null,null,null,null,null,null,571.6,571.6,571.6,571.6,571.6,571.6,571.6]
[null,null,"WINTER/SUMMER PEAKING",null,"Non-coincident",null,null,null,null,null,null,null,null,null,null,null,"Summer","Summer","Summer","Summer","Summer","Summer","Summer"]
[null,null,null,null,"Coincident",null,null,null,null,null,null,null,null,null,null,null,"Summer","Summer","Summer","Summer","Summer","Summer","Summer"]
[null,null,"ADJUSTMENTS - EMBEDDED GENERATION","MW","Non-coincident",null,null,null,null,null,null,null,null,null,null,null,"-","-","-","-","-","-","-"]
[null,null,null,null,"Coincident",null,null,null,null,null,null,null,null,null,null,null,"-","-","-","-","-","-","-"]
[null,null,"WEATHER CORRECTED MD 10% POE","MW","Non-coincident",null,null,null,null,null,null,null,null,null,null,null,39,39.1,39.4,39.6,39.799999999999997,40.200000000000003,40.5]
[null,null,null,null,"Coincident",null,null,null,null,null,null,null,null,null,null,null,34.1,35.200000000000003,35.5,36.1,36.5,36.9,37.299999999999997]
[null,null,"WEATHER CORRECTED MD 10% POE","MVA","Non-coincident",null,null,null,null,null,null,null,null,null,null,null,39.200000000000003,39.299999999999997,39.5,39.799999999999997,40,40.299999999999997,40.700000000000003]
[null,null,null,null,"Coincident",null,null,null,null,null,null,null,null,null,null,null,34.200000000000003,35.4,35.700000000000003,36.299999999999997,36.700000000000003,37.1,37.5]
[null,null,"WEATHER CORRECTED MD 50% POE","MW","Non-coincident",null,null,null,null,null,null,null,null,null,null,null,36.299999999999997,36.4,36.6,36.9,37.1,37.4,37.700000000000003]
[null,null,null,null,"Coincident",null,null,null,null,null,null,null,null,null,null,null,32.5,33.5,33.9,34.4,34.799999999999997,35.1,35.5]
[null,null,"WEATHER CORRECTED MD 50% POE","MVA","Non-coincident",null,null,null,null,null,null,null,null,null,null,null,36.4,36.6,36.799999999999997,37,37.200000000000003,37.5,37.9]
[null,null,null,null,"Coincident",null,null,null,null,null,null,null,null,null,null,null,32.6,33.700000000000003,34,34.5,34.9,35.299999999999997,35.700000000000003]
[null,"Wotonga (Rail)","CONNECTION POINT RATING","MVA","Non-coincident",null,null,null,null,null,null,null,null,null,null,null,0,0,0,0,0,0,0]
[null,null,null,null,"Coincident",null,null,null,null,null,null,null,null,null,null,null,0,0,0,0,0,0,0]
[null,null,"WINTER/SUMMER PEAKING",null,"Non-coincident",null,null,null,null,null,null,null,null,null,null,null,"Summer","Summer","Summer","Summer","Summer","Summer","Summer"]
[null,null,null,null,"Coincident",null,null,null,null,null,null,null,null,null,null,null,"Summer","Summer","Summer","Summer","Summer","Summer","Summer"]
[null,null,"ADJUSTMENTS - EMBEDDED GENERATION","MW","Non-coincident",null,null,null,null,null,null,null,null,null,null,null,"-","-","-","-","-","-","-"]
[null,null,null,null,"Coincident",null,null,null,null,null,null,null,null,null,null,null,"-","-","-","-","-","-","-"]
[null,null,"WEATHER CORRECTED MD 10% POE","MW","Non-coincident"]
[null,null,null,null,"Coincident"]
[null,null,"WEATHER CORRECTED MD 10% POE","MVA","Non-coincident"]
[null,null,null,null,"Coincident"]
[null,null,"WEATHER CORRECTED MD 50% POE","MW","Non-coincident"]
[null,null,null,null,"Coincident"]
[null,null,"WEATHER CORRECTED MD 50% POE","MVA","Non-coincident"]
[null,null,null,null,"Coincident"]
[null,"Wycarbah (Rail)","CONNECTION POINT RATING","MVA","Non-coincident",null,null,null,null,null,null,null,null,null,null,null,0,0,0,0,0,0,0]
[null,null,null,null,"Coincident",null,null,null,null,null,null,null,null,null,null,null,0,0,0,0,0,0,0]
[null,null,"WINTER/SUMMER PEAKING",null,"Non-coincident",null,null,null,null,null,null,null,null,null,null,null,"Summer","Summer","Summer","Summer","Summer","Summer","Summer"]
[null,null,null,null,"Coincident",null,null,null,null,null,null,null,null,null,null,null,"Summer","Summer","Summer","Summer","Summer","Summer","Summer"]
[null,null,"ADJUSTMENTS - EMBEDDED GENERATION","MW","Non-coincident",null,null,null,null,null,null,null,null,null,null,null,"-","-","-","-","-","-","-"]
[null,null,null,null,"Coincident",null,null,null,null,null,null,null,null,null,null,null,"-","-","-","-","-","-","-"]
[null,null,"WEATHER CORRECTED MD 10% POE","MW","Non-coincident"]
[null,null,null,null,"Coincident"]
[null,null,"WEATHER CORRECTED MD 10% POE","MVA","Non-coincident"]
[null,null,null,null,"Coincident"]
[null,null,"WEATHER CORRECTED MD 50% POE","MW","Non-coincident"]
[null,null,null,null,"Coincident"]
[null,null,"WEATHER CORRECTED MD 50% POE","MVA","Non-coincident"]
[null,null,null,null,"Coincident"]
[null,"Yarwun (Ergon)","CONNECTION POINT RATING","MVA","Non-coincident",null,null,null,null,null,null,null,null,null,null,null,731.6,731.6,731.6,731.6,731.6,731.6,731.6]
[null,null,null,null,"Coincident",null,null,null,null,null,null,null,null,null,null,null,731.6,731.6,731.6,731.6,731.6,731.6,731.6]
[null,null,"WINTER/SUMMER PEAKING",null,"Non-coincident",null,null,null,null,null,null,null,null,null,null,null,"Summer","Summer","Summer","Summer","Summer","Summer","Summer"]
[null,null,null,null,"Coincident",null,null,null,null,null,null,null,null,null,null,null,"Summer","Summer","Summer","Summer","Summer","Summer","Summer"]
[null,null,"ADJUSTMENTS - EMBEDDED GENERATION","MW","Non-coincident",null,null,null,null,null,null,null,null,null,null,null,"-","-","-","-","-","-","-"]
[null,null,null,null,"Coincident",null,null,null,null,null,null,null,null,null,null,null,"-","-","-","-","-","-","-"]
[null,null,"WEATHER CORRECTED MD 10% POE","MW","Non-coincident",null,null,null,null,null,null,null,null,null,null,null,39.9,39.9,39.9,40.1,40.1,40.200000000000003,40.299999999999997]
[null,null,null,null,"Coincident",null,null,null,null,null,null,null,null,null,null,null,36,37,37.200000000000003,37.700000000000003,38,38.1,38.200000000000003]
[null,null,"WEATHER CORRECTED MD 10% POE","MVA","Non-coincident",null,null,null,null,null,null,null,null,null,null,null,42.5,42.5,42.5,42.7,42.8,42.9,42.9]
[null,null,null,null,"Coincident",null,null,null,null,null,null,null,null,null,null,null,38.5,39.700000000000003,39.799999999999997,40.4,40.700000000000003,40.9,41]
[null,null,"WEATHER CORRECTED MD 50% POE","MW","Non-coincident",null,null,null,null,null,null,null,null,null,null,null,38.9,38.9,38.9,39.1,39.200000000000003,39.200000000000003,39.299999999999997]
[null,null,null,null,"Coincident",null,null,null,null,null,null,null,null,null,null,null,34.299999999999997,35.299999999999997,35.4,35.9,36.200000000000003,36.299999999999997,36.4]
[null,null,"WEATHER CORRECTED MD 50% POE","MVA","Non-coincident",null,null,null,null,null,null,null,null,null,null,null,41.4,41.5,41.5,41.7,41.7,41.8,41.9]
[null,null,null,null,"Coincident",null,null,null,null,null,null,null,null,null,null,null,36.5,37.6,37.700000000000003,38.299999999999997,38.5,38.700000000000003,38.799999999999997]
[null,"Yarwun (Rio Tinto)","CONNECTION POINT RATING","MVA","Non-coincident",null,null,null,null,null,null,null,null,null,null,null,0,0,0,0,0,0,0]
[null,null,null,null,"Coincident",null,null,null,null,null,null,null,null,null,null,null,0,0,0,0,0,0,0]
[null,null,"WINTER/SUMMER PEAKING",null,"Non-coincident",null,null,null,null,null,null,null,null,null,null,null,"Summer","Summer","Summer","Summer","Summer","Summer","Summer"]
[null,null,null,null,"Coincident",null,null,null,null,null,null,null,null,null,null,null,"Summer","Summer","Summer","Summer","Summer","Summer","Summer"]
[null,null,"ADJUSTMENTS - EMBEDDED GENERATION","MW","Non-coincident",null,null,null,null,null,null,null,null,null,null,null,"-","-","-","-","-","-","-"]
[null,null,null,null,"Coincident",null,null,null,null,null,null,null,null,null,null,null,"-","-","-","-","-","-","-"]
[null,null,"WEATHER CORRECTED MD 10% POE","MW","Non-coincident"]
[null,null,null,null,"Coincident"]
[null,null,"WEATHER CORRECTED MD 10% POE","MVA","Non-coincident"]
[null,null,null,null,"Coincident"]
[null,null,"WEATHER CORRECTED MD 50% POE","MW","Non-coincident"]
[null,null,null,null,"Coincident"]
[null,null,"WEATHER CORRECTED MD 50% POE","MVA","Non-coincident"]
[null,null,null,null,"Coincident"]
[null,"NSP to enter name","CONNECTION POINT RATING","MVA","Non-coincident"]
[null,null,null,null,"Coincident"]
[null,null,"WINTER/SUMMER PEAKING",null,"Non-coincident"]
[null,null,null,null,"Coincident"]
[null,null,"ADJUSTMENTS - EMBEDDED GENERATION","MW","Non-coincident"]
[null,null,null,null,"Coincident"]
[null,null,"WEATHER CORRECTED MD 10% POE","MW","Non-coincident"]
[null,null,null,null,"Coincident"]
[null,null,"WEATHER CORRECTED MD 10% POE","MVA","Non-coincident"]
[null,null,null,null,"Coincident"]
[null,null,"WEATHER CORRECTED MD 50% POE","MW","Non-coincident"]
[null,null,null,null,"Coincident"]
[null,null,"WEATHER CORRECTED MD 50% POE","MVA","Non-coincident"]
[null,null,null,null,"Coincident"]
[null,"NSP to enter name","CONNECTION POINT RATING","MVA","Non-coincident"]
[null,null,null,null,"Coincident"]
[null,null,"WINTER/SUMMER PEAKING",null,"Non-coincident"]
[null,null,null,null,"Coincident"]
[null,null,"ADJUSTMENTS - EMBEDDED GENERATION","MW","Non-coincident"]
[null,null,null,null,"Coincident"]
[null,null,"WEATHER CORRECTED MD 10% POE","MW","Non-coincident"]
[null,null,null,null,"Coincident"]
[null,null,"WEATHER CORRECTED MD 10% POE","MVA","Non-coincident"]
[null,null,null,null,"Coincident"]
[null,null,"WEATHER CORRECTED MD 50% POE","MW","Non-coincident"]
[null,null,null,null,"Coincident"]
[null,null,"WEATHER CORRECTED MD 50% POE","MVA","Non-coincident"]
[null,null,null,null,"Coincident"]
[null,"NSP to enter name","CONNECTION POINT RATING","MVA","Non-coincident"]
[null,null,null,null,"Coincident"]
[null,null,"WINTER/SUMMER PEAKING",null,"Non-coincident"]
[null,null,null,null,"Coincident"]
[null,null,"ADJUSTMENTS - EMBEDDED GENERATION","MW","Non-coincident"]
[null,null,null,null,"Coincident"]
[null,null,"WEATHER CORRECTED MD 10% POE","MW","Non-coincident"]
[null,null,null,null,"Coincident"]
[null,null,"WEATHER CORRECTED MD 10% POE","MVA","Non-coincident"]
[null,null,null,null,"Coincident"]
[null,null,"WEATHER CORRECTED MD 50% POE","MW","Non-coincident"]
[null,null,null,null,"Coincident"]
[null,null,"WEATHER CORRECTED MD 50% POE","MVA","Non-coincident"]
[null,null,null,null,"Coincident"]
[null,"NSP to enter name","CONNECTION POINT RATING","MVA","Non-coincident"]
[null,null,null,null,"Coincident"]
[null,null,"WINTER/SUMMER PEAKING",null,"Non-coincident"]
[null,null,null,null,"Coincident"]
[null,null,"ADJUSTMENTS - EMBEDDED GENERATION","MW","Non-coincident"]
[null,null,null,null,"Coincident"]
[null,null,"WEATHER CORRECTED MD 10% POE","MW","Non-coincident"]
[null,null,null,null,"Coincident"]
[null,null,"WEATHER CORRECTED MD 10% POE","MVA","Non-coincident"]
[null,null,null,null,"Coincident"]
[null,null,"WEATHER CORRECTED MD 50% POE","MW","Non-coincident"]
[null,null,null,null,"Coincident"]
[null,null,"WEATHER CORRECTED MD 50% POE","MVA","Non-coincident"]
[null,null,null,null,"Coincident"]
[null,"NSP to enter name","CONNECTION POINT RATING","MVA","Non-coincident"]
[null,null,null,null,"Coincident"]
[null,null,"WINTER/SUMMER PEAKING",null,"Non-coincident"]
[null,null,null,null,"Coincident"]
[null,null,"ADJUSTMENTS - EMBEDDED GENERATION","MW","Non-coincident"]
[null,null,null,null,"Coincident"]
[null,null,"WEATHER CORRECTED MD 10% POE","MW","Non-coincident"]
[null,null,null,null,"Coincident"]
[null,null,"WEATHER CORRECTED MD 10% POE","MVA","Non-coincident"]
[null,null,null,null,"Coincident"]
[null,null,"WEATHER CORRECTED MD 50% POE","MW","Non-coincident"]
[null,null,null,null,"Coincident"]
[null,null,"WEATHER CORRECTED MD 50% POE","MVA","Non-coincident"]
[null,null,null,null,"Coincident"]
[null,"NSP to enter name","CONNECTION POINT RATING","MVA","Non-coincident"]
[null,null,null,null,"Coincident"]
[null,null,"WINTER/SUMMER PEAKING",null,"Non-coincident"]
[null,null,null,null,"Coincident"]
[null,null,"ADJUSTMENTS - EMBEDDED GENERATION","MW","Non-coincident"]
[null,null,null,null,"Coincident"]
[null,null,"WEATHER CORRECTED MD 10% POE","MW","Non-coincident"]
[null,null,null,null,"Coincident"]
[null,null,"WEATHER CORRECTED MD 10% POE","MVA","Non-coincident"]
[null,null,null,null,"Coincident"]
[null,null,"WEATHER CORRECTED MD 50% POE","MW","Non-coincident"]
[null,null,null,null,"Coincident"]
[null,null,"WEATHER CORRECTED MD 50% POE","MVA","Non-coincident"]
[null,null,null,null,"Coincident"]
[null,"NSP to enter name","CONNECTION POINT RATING","MVA","Non-coincident"]
[null,null,null,null,"Coincident"]
[null,null,"WINTER/SUMMER PEAKING",null,"Non-coincident"]
[null,null,null,null,"Coincident"]
[null,null,"ADJUSTMENTS - EMBEDDED GENERATION","MW","Non-coincident"]
[null,null,null,null,"Coincident"]
[null,null,"WEATHER CORRECTED MD 10% POE","MW","Non-coincident"]
[null,null,null,null,"Coincident"]
[null,null,"WEATHER CORRECTED MD 10% POE","MVA","Non-coincident"]
[null,null,null,null,"Coincident"]
[null,null,"WEATHER CORRECTED MD 50% POE","MW","Non-coincident"]
[null,null,null,null,"Coincident"]
[null,null,"WEATHER CORRECTED MD 50% POE","MVA","Non-coincident"]
[null,null,null,null,"Coincident"]
[null,"NSP to enter name","CONNECTION POINT RATING","MVA","Non-coincident"]
[null,null,null,null,"Coincident"]
[null,null,"WINTER/SUMMER PEAKING",null,"Non-coincident"]
[null,null,null,null,"Coincident"]
[null,null,"ADJUSTMENTS - EMBEDDED GENERATION","MW","Non-coincident"]
[null,null,null,null,"Coincident"]
[null,null,"WEATHER CORRECTED MD 10% POE","MW","Non-coincident"]
[null,null,null,null,"Coincident"]
[null,null,"WEATHER CORRECTED MD 10% POE","MVA","Non-coincident"]
[null,null,null,null,"Coincident"]
[null,null,"WEATHER CORRECTED MD 50% POE","MW","Non-coincident"]
[null,null,null,null,"Coincident"]
[null,null,"WEATHER CORRECTED MD 50% POE","MVA","Non-coincident"]
[null,null,null,null,"Coincident"]
[null,"NSP to enter name","CONNECTION POINT RATING","MVA","Non-coincident"]
[null,null,null,null,"Coincident"]
[null,null,"WINTER/SUMMER PEAKING",null,"Non-coincident"]
[null,null,null,null,"Coincident"]
[null,null,"ADJUSTMENTS - EMBEDDED GENERATION","MW","Non-coincident"]
[null,null,null,null,"Coincident"]
[null,null,"WEATHER CORRECTED MD 10% POE","MW","Non-coincident"]
[null,null,null,null,"Coincident"]
[null,null,"WEATHER CORRECTED MD 10% POE","MVA","Non-coincident"]
[null,null,null,null,"Coincident"]
[null,null,"WEATHER CORRECTED MD 50% POE","MW","Non-coincident"]
[null,null,null,null,"Coincident"]
[null,null,"WEATHER CORRECTED MD 50% POE","MVA","Non-coincident"]
[null,null,null,null,"Coincident"]
[null,"NSP to enter name","CONNECTION POINT RATING","MVA","Non-coincident"]
[null,null,null,null,"Coincident"]
[null,null,"WINTER/SUMMER PEAKING",null,"Non-coincident"]
[null,null,null,null,"Coincident"]
[null,null,"ADJUSTMENTS - EMBEDDED GENERATION","MW","Non-coincident"]
[null,null,null,null,"Coincident"]
[null,null,"WEATHER CORRECTED MD 10% POE","MW","Non-coincident"]
[null,null,null,null,"Coincident"]
[null,null,"WEATHER CORRECTED MD 10% POE","MVA","Non-coincident"]
[null,null,null,null,"Coincident"]
[null,null,"WEATHER CORRECTED MD 50% POE","MW","Non-coincident"]
[null,null,null,null,"Coincident"]
[null,null,"WEATHER CORRECTED MD 50% POE","MVA","Non-coincident"]
[null,null,null,null,"Coincident"]
[null,"NSP to enter name","CONNECTION POINT RATING","MVA","Non-coincident"]
[null,null,null,null,"Coincident"]
[null,null,"WINTER/SUMMER PEAKING",null,"Non-coincident"]
[null,null,null,null,"Coincident"]
[null,null,"ADJUSTMENTS - EMBEDDED GENERATION","MW","Non-coincident"]
[null,null,null,null,"Coincident"]
[null,null,"WEATHER CORRECTED MD 10% POE","MW","Non-coincident"]
[null,null,null,null,"Coincident"]
[null,null,"WEATHER CORRECTED MD 10% POE","MVA","Non-coincident"]
[null,null,null,null,"Coincident"]
[null,null,"WEATHER CORRECTED MD 50% POE","MW","Non-coincident"]
[null,null,null,null,"Coincident"]
[null,null,"WEATHER CORRECTED MD 50% POE","MVA","Non-coincident"]
[null,null,null,null,"Coincident"]
[null,"NSP to enter name","CONNECTION POINT RATING","MVA","Non-coincident"]
[null,null,null,null,"Coincident"]
[null,null,"WINTER/SUMMER PEAKING",null,"Non-coincident"]
[null,null,null,null,"Coincident"]
[null,null,"ADJUSTMENTS - EMBEDDED GENERATION","MW","Non-coincident"]
[null,null,null,null,"Coincident"]
[null,null,"WEATHER CORRECTED MD 10% POE","MW","Non-coincident"]
[null,null,null,null,"Coincident"]
[null,null,"WEATHER CORRECTED MD 10% POE","MVA","Non-coincident"]
[null,null,null,null,"Coincident"]
[null,null,"WEATHER CORRECTED MD 50% POE","MW","Non-coincident"]
[null,null,null,null,"Coincident"]
[null,null,"WEATHER CORRECTED MD 50% POE","MVA","Non-coincident"]
[null,null,null,null,"Coincident"]
[null,"NSP to enter name","CONNECTION POINT RATING","MVA","Non-coincident"]
[null,null,null,null,"Coincident"]
[null,null,"WINTER/SUMMER PEAKING",null,"Non-coincident"]
[null,null,null,null,"Coincident"]
[null,null,"ADJUSTMENTS - EMBEDDED GENERATION","MW","Non-coincident"]
[null,null,null,null,"Coincident"]
[null,null,"WEATHER CORRECTED MD 10% POE","MW","Non-coincident"]
[null,null,null,null,"Coincident"]
[null,null,"WEATHER CORRECTED MD 10% POE","MVA","Non-coincident"]
[null,null,null,null,"Coincident"]
[null,null,"WEATHER CORRECTED MD 50% POE","MW","Non-coincident"]
[null,null,null,null,"Coincident"]
[null,null,"WEATHER CORRECTED MD 50% POE","MVA","Non-coincident"]
[null,null,null,null,"Coincident"]
[null,"NSP to enter name","CONNECTION POINT RATING","MVA","Non-coincident"]
[null,null,null,null,"Coincident"]
[null,null,"WINTER/SUMMER PEAKING",null,"Non-coincident"]
[null,null,null,null,"Coincident"]
[null,null,"ADJUSTMENTS - EMBEDDED GENERATION","MW","Non-coincident"]
[null,null,null,null,"Coincident"]
[null,null,"WEATHER CORRECTED MD 10% POE","MW","Non-coincident"]
[null,null,null,null,"Coincident"]
[null,null,"WEATHER CORRECTED MD 10% POE","MVA","Non-coincident"]
[null,null,null,null,"Coincident"]
[null,null,"WEATHER CORRECTED MD 50% POE","MW","Non-coincident"]
[null,null,null,null,"Coincident"]
[null,null,"WEATHER CORRECTED MD 50% POE","MVA","Non-coincident"]
[null,null,null,null,"Coincident"]
[null,"NSP to enter name","CONNECTION POINT RATING","MVA","Non-coincident"]
[null,null,null,null,"Coincident"]
[null,null,"WINTER/SUMMER PEAKING",null,"Non-coincident"]
[null,null,null,null,"Coincident"]
[null,null,"ADJUSTMENTS - EMBEDDED GENERATION","MW","Non-coincident"]
[null,null,null,null,"Coincident"]
[null,null,"WEATHER CORRECTED MD 10% POE","MW","Non-coincident"]
[null,null,null,null,"Coincident"]
[null,null,"WEATHER CORRECTED MD 10% POE","MVA","Non-coincident"]
[null,null,null,null,"Coincident"]
[null,null,"WEATHER CORRECTED MD 50% POE","MW","Non-coincident"]
[null,null,null,null,"Coincident"]
[null,null,"WEATHER CORRECTED MD 50% POE","MVA","Non-coincident"]
[null,null,null,null,"Coincident"]
[null,"NSP to enter name","CONNECTION POINT RATING","MVA","Non-coincident"]
[null,null,null,null,"Coincident"]
[null,null,"WINTER/SUMMER PEAKING",null,"Non-coincident"]
[null,null,null,null,"Coincident"]
[null,null,"ADJUSTMENTS - EMBEDDED GENERATION","MW","Non-coincident"]
[null,null,null,null,"Coincident"]
[null,null,"WEATHER CORRECTED MD 10% POE","MW","Non-coincident"]
[null,null,null,null,"Coincident"]
[null,null,"WEATHER CORRECTED MD 10% POE","MVA","Non-coincident"]
[null,null,null,null,"Coincident"]
[null,null,"WEATHER CORRECTED MD 50% POE","MW","Non-coincident"]
[null,null,null,null,"Coincident"]
[null,null,"WEATHER CORRECTED MD 50% POE","MVA","Non-coincident"]
[null,null,null,null,"Coincident"]
[null,"NSP to enter name","CONNECTION POINT RATING","MVA","Non-coincident"]
[null,null,null,null,"Coincident"]
[null,null,"WINTER/SUMMER PEAKING",null,"Non-coincident"]
[null,null,null,null,"Coincident"]
[null,null,"ADJUSTMENTS - EMBEDDED GENERATION","MW","Non-coincident"]
[null,null,null,null,"Coincident"]
[null,null,"WEATHER CORRECTED MD 10% POE","MW","Non-coincident"]
[null,null,null,null,"Coincident"]
[null,null,"WEATHER CORRECTED MD 10% POE","MVA","Non-coincident"]
[null,null,null,null,"Coincident"]
[null,null,"WEATHER CORRECTED MD 50% POE","MW","Non-coincident"]
[null,null,null,null,"Coincident"]
[null,null,"WEATHER CORRECTED MD 50% POE","MVA","Non-coincident"]
[null,null,null,null,"Coincident"]
[null,"NSP to enter name","CONNECTION POINT RATING","MVA","Non-coincident"]
[null,null,null,null,"Coincident"]
[null,null,"WINTER/SUMMER PEAKING",null,"Non-coincident"]
[null,null,null,null,"Coincident"]
[null,null,"ADJUSTMENTS - EMBEDDED GENERATION","MW","Non-coincident"]
[null,null,null,null,"Coincident"]
[null,null,"WEATHER CORRECTED MD 10% POE","MW","Non-coincident"]
[null,null,null,null,"Coincident"]
[null,null,"WEATHER CORRECTED MD 10% POE","MVA","Non-coincident"]
[null,null,null,null,"Coincident"]
[null,null,"WEATHER CORRECTED MD 50% POE","MW","Non-coincident"]
[null,null,null,null,"Coincident"]
[null,null,"WEATHER CORRECTED MD 50% POE","MVA","Non-coincident"]
[null,null,null,null,"Coincident"]
[null,"NSP to enter name","CONNECTION POINT RATING","MVA","Non-coincident"]
[null,null,null,null,"Coincident"]
[null,null,"WINTER/SUMMER PEAKING",null,"Non-coincident"]
[null,null,null,null,"Coincident"]
[null,null,"ADJUSTMENTS - EMBEDDED GENERATION","MW","Non-coincident"]
[null,null,null,null,"Coincident"]
[null,null,"WEATHER CORRECTED MD 10% POE","MW","Non-coincident"]
[null,null,null,null,"Coincident"]
[null,null,"WEATHER CORRECTED MD 10% POE","MVA","Non-coincident"]
[null,null,null,null,"Coincident"]
[null,null,"WEATHER CORRECTED MD 50% POE","MW","Non-coincident"]
[null,null,null,null,"Coincident"]
[null,null,"WEATHER CORRECTED MD 50% POE","MVA","Non-coincident"]
[null,null,null,null,"Coincident"]
[null,"NSP to enter name","CONNECTION POINT RATING","MVA","Non-coincident"]
[null,null,null,null,"Coincident"]
[null,null,"WINTER/SUMMER PEAKING",null,"Non-coincident"]
[null,null,null,null,"Coincident"]
[null,null,"ADJUSTMENTS - EMBEDDED GENERATION","MW","Non-coincident"]
[null,null,null,null,"Coincident"]
[null,null,"WEATHER CORRECTED MD 10% POE","MW","Non-coincident"]
[null,null,null,null,"Coincident"]
[null,null,"WEATHER CORRECTED MD 10% POE","MVA","Non-coincident"]
[null,null,null,null,"Coincident"]
[null,null,"WEATHER CORRECTED MD 50% POE","MW","Non-coincident"]
[null,null,null,null,"Coincident"]
[null,null,"WEATHER CORRECTED MD 50% POE","MVA","Non-coincident"]
[null,null,null,null,"Coincident"]
[null,"NSP to enter name","CONNECTION POINT RATING","MVA","Non-coincident"]
[null,null,null,null,"Coincident"]
[null,null,"WINTER/SUMMER PEAKING",null,"Non-coincident"]
[null,null,null,null,"Coincident"]
[null,null,"ADJUSTMENTS - EMBEDDED GENERATION","MW","Non-coincident"]
[null,null,null,null,"Coincident"]
[null,null,"WEATHER CORRECTED MD 10% POE","MW","Non-coincident"]
[null,null,null,null,"Coincident"]
[null,null,"WEATHER CORRECTED MD 10% POE","MVA","Non-coincident"]
[null,null,null,null,"Coincident"]
[null,null,"WEATHER CORRECTED MD 50% POE","MW","Non-coincident"]
[null,null,null,null,"Coincident"]
[null,null,"WEATHER CORRECTED MD 50% POE","MVA","Non-coincident"]
[null,null,null,null,"Coincident"]
[null,"NSP to enter name","CONNECTION POINT RATING","MVA","Non-coincident"]
[null,null,null,null,"Coincident"]
[null,null,"WINTER/SUMMER PEAKING",null,"Non-coincident"]
[null,null,null,null,"Coincident"]
[null,null,"ADJUSTMENTS - EMBEDDED GENERATION","MW","Non-coincident"]
[null,null,null,null,"Coincident"]
[null,null,"WEATHER CORRECTED MD 10% POE","MW","Non-coincident"]
[null,null,null,null,"Coincident"]
[null,null,"WEATHER CORRECTED MD 10% POE","MVA","Non-coincident"]
[null,null,null,null,"Coincident"]
[null,null,"WEATHER CORRECTED MD 50% POE","MW","Non-coincident"]
[null,null,null,null,"Coincident"]
[null,null,"WEATHER CORRECTED MD 50% POE","MVA","Non-coincident"]
[null,null,null,null,"Coincident"]
[null,"NSP to enter name","CONNECTION POINT RATING","MVA","Non-coincident"]
[null,null,null,null,"Coincident"]
[null,null,"WINTER/SUMMER PEAKING",null,"Non-coincident"]
[null,null,null,null,"Coincident"]
[null,null,"ADJUSTMENTS - EMBEDDED GENERATION","MW","Non-coincident"]
[null,null,null,null,"Coincident"]
[null,null,"WEATHER CORRECTED MD 10% POE","MW","Non-coincident"]
[null,null,null,null,"Coincident"]
[null,null,"WEATHER CORRECTED MD 10% POE","MVA","Non-coincident"]
[null,null,null,null,"Coincident"]
[null,null,"WEATHER CORRECTED MD 50% POE","MW","Non-coincident"]
[null,null,null,null,"Coincident"]
[null,null,"WEATHER CORRECTED MD 50% POE","MVA","Non-coincident"]
[null,null,null,null,"Coincident"]
[null,"NSP to enter name","CONNECTION POINT RATING","MVA","Non-coincident"]
[null,null,null,null,"Coincident"]
[null,null,"WINTER/SUMMER PEAKING",null,"Non-coincident"]
[null,null,null,null,"Coincident"]
[null,null,"ADJUSTMENTS - EMBEDDED GENERATION","MW","Non-coincident"]
[null,null,null,null,"Coincident"]
[null,null,"WEATHER CORRECTED MD 10% POE","MW","Non-coincident"]
[null,null,null,null,"Coincident"]
[null,null,"WEATHER CORRECTED MD 10% POE","MVA","Non-coincident"]
[null,null,null,null,"Coincident"]
[null,null,"WEATHER CORRECTED MD 50% POE","MW","Non-coincident"]
[null,null,null,null,"Coincident"]
[null,null,"WEATHER CORRECTED MD 50% POE","MVA","Non-coincident"]
[null,null,null,null,"Coincident"]
[null,"NSP to enter name","CONNECTION POINT RATING","MVA","Non-coincident"]
[null,null,null,null,"Coincident"]
[null,null,"WINTER/SUMMER PEAKING",null,"Non-coincident"]
[null,null,null,null,"Coincident"]
[null,null,"ADJUSTMENTS - EMBEDDED GENERATION","MW","Non-coincident"]
[null,null,null,null,"Coincident"]
[null,null,"WEATHER CORRECTED MD 10% POE","MW","Non-coincident"]
[null,null,null,null,"Coincident"]
[null,null,"WEATHER CORRECTED MD 10% POE","MVA","Non-coincident"]
[null,null,null,null,"Coincident"]
[null,null,"WEATHER CORRECTED MD 50% POE","MW","Non-coincident"]
[null,null,null,null,"Coincident"]
[null,null,"WEATHER CORRECTED MD 50% POE","MVA","Non-coincident"]
[null,null,null,null,"Coincident"]
[null,"NSP to enter name","CONNECTION POINT RATING","MVA","Non-coincident"]
[null,null,null,null,"Coincident"]
[null,null,"WINTER/SUMMER PEAKING",null,"Non-coincident"]
[null,null,null,null,"Coincident"]
[null,null,"ADJUSTMENTS - EMBEDDED GENERATION","MW","Non-coincident"]
[null,null,null,null,"Coincident"]
[null,null,"WEATHER CORRECTED MD 10% POE","MW","Non-coincident"]
[null,null,null,null,"Coincident"]
[null,null,"WEATHER CORRECTED MD 10% POE","MVA","Non-coincident"]
[null,null,null,null,"Coincident"]
[null,null,"WEATHER CORRECTED MD 50% POE","MW","Non-coincident"]
[null,null,null,null,"Coincident"]
[null,null,"WEATHER CORRECTED MD 50% POE","MVA","Non-coincident"]
[null,null,null,null,"Coincident"]
[null,"NSP to enter name","CONNECTION POINT RATING","MVA","Non-coincident"]
[null,null,null,null,"Coincident"]
[null,null,"WINTER/SUMMER PEAKING",null,"Non-coincident"]
[null,null,null,null,"Coincident"]
[null,null,"ADJUSTMENTS - EMBEDDED GENERATION","MW","Non-coincident"]
[null,null,null,null,"Coincident"]
[null,null,"WEATHER CORRECTED MD 10% POE","MW","Non-coincident"]
[null,null,null,null,"Coincident"]
[null,null,"WEATHER CORRECTED MD 10% POE","MVA","Non-coincident"]
[null,null,null,null,"Coincident"]
[null,null,"WEATHER CORRECTED MD 50% POE","MW","Non-coincident"]
[null,null,null,null,"Coincident"]
[null,null,"WEATHER CORRECTED MD 50% POE","MVA","Non-coincident"]
[null,null,null,null,"Coincident"]
[null,"NSP to enter name","CONNECTION POINT RATING","MVA","Non-coincident"]
[null,null,null,null,"Coincident"]
[null,null,"WINTER/SUMMER PEAKING",null,"Non-coincident"]
[null,null,null,null,"Coincident"]
[null,null,"ADJUSTMENTS - EMBEDDED GENERATION","MW","Non-coincident"]
[null,null,null,null,"Coincident"]
[null,null,"WEATHER CORRECTED MD 10% POE","MW","Non-coincident"]
[null,null,null,null,"Coincident"]
[null,null,"WEATHER CORRECTED MD 10% POE","MVA","Non-coincident"]
[null,null,null,null,"Coincident"]
[null,null,"WEATHER CORRECTED MD 50% POE","MW","Non-coincident"]
[null,null,null,null,"Coincident"]
[null,null,"WEATHER CORRECTED MD 50% POE","MVA","Non-coincident"]
[null,null,null,null,"Coincident"]
[null,"NSP to enter name","CONNECTION POINT RATING","MVA","Non-coincident"]
[null,null,null,null,"Coincident"]
[null,null,"WINTER/SUMMER PEAKING",null,"Non-coincident"]
[null,null,null,null,"Coincident"]
[null,null,"ADJUSTMENTS - EMBEDDED GENERATION","MW","Non-coincident"]
[null,null,null,null,"Coincident"]
[null,null,"WEATHER CORRECTED MD 10% POE","MW","Non-coincident"]
[null,null,null,null,"Coincident"]
[null,null,"WEATHER CORRECTED MD 10% POE","MVA","Non-coincident"]
[null,null,null,null,"Coincident"]
[null,null,"WEATHER CORRECTED MD 50% POE","MW","Non-coincident"]
[null,null,null,null,"Coincident"]
[null,null,"WEATHER CORRECTED MD 50% POE","MVA","Non-coincident"]
[null,null,null,null,"Coincident"]
[null,"NSP to enter name","CONNECTION POINT RATING","MVA","Non-coincident"]
[null,null,null,null,"Coincident"]
[null,null,"WINTER/SUMMER PEAKING",null,"Non-coincident"]
[null,null,null,null,"Coincident"]
[null,null,"ADJUSTMENTS - EMBEDDED GENERATION","MW","Non-coincident"]
[null,null,null,null,"Coincident"]
[null,null,"WEATHER CORRECTED MD 10% POE","MW","Non-coincident"]
[null,null,null,null,"Coincident"]
[null,null,"WEATHER CORRECTED MD 10% POE","MVA","Non-coincident"]
[null,null,null,null,"Coincident"]
[null,null,"WEATHER CORRECTED MD 50% POE","MW","Non-coincident"]
[null,null,null,null,"Coincident"]
[null,null,"WEATHER CORRECTED MD 50% POE","MVA","Non-coincident"]
[null,null,null,null,"Coincident"]
[null,"NSP to enter name","CONNECTION POINT RATING","MVA","Non-coincident"]
[null,null,null,null,"Coincident"]
[null,null,"WINTER/SUMMER PEAKING",null,"Non-coincident"]
[null,null,null,null,"Coincident"]
[null,null,"ADJUSTMENTS - EMBEDDED GENERATION","MW","Non-coincident"]
[null,null,null,null,"Coincident"]
[null,null,"WEATHER CORRECTED MD 10% POE","MW","Non-coincident"]
[null,null,null,null,"Coincident"]
[null,null,"WEATHER CORRECTED MD 10% POE","MVA","Non-coincident"]
[null,null,null,null,"Coincident"]
[null,null,"WEATHER CORRECTED MD 50% POE","MW","Non-coincident"]
[null,null,null,null,"Coincident"]
[null,null,"WEATHER CORRECTED MD 50% POE","MVA","Non-coincident"]
[null,null,null,null,"Coincident"]
[null,"NSP to enter name","CONNECTION POINT RATING","MVA","Non-coincident"]
[null,null,null,null,"Coincident"]
[null,null,"WINTER/SUMMER PEAKING",null,"Non-coincident"]
[null,null,null,null,"Coincident"]
[null,null,"ADJUSTMENTS - EMBEDDED GENERATION","MW","Non-coincident"]
[null,null,null,null,"Coincident"]
[null,null,"WEATHER CORRECTED MD 10% POE","MW","Non-coincident"]
[null,null,null,null,"Coincident"]
[null,null,"WEATHER CORRECTED MD 10% POE","MVA","Non-coincident"]
[null,null,null,null,"Coincident"]
[null,null,"WEATHER CORRECTED MD 50% POE","MW","Non-coincident"]
[null,null,null,null,"Coincident"]
[null,null,"WEATHER CORRECTED MD 50% POE","MVA","Non-coincident"]
[null,null,null,null,"Coincident"]
[null,"NSP to enter name","CONNECTION POINT RATING","MVA","Non-coincident"]
[null,null,null,null,"Coincident"]
[null,null,"WINTER/SUMMER PEAKING",null,"Non-coincident"]
[null,null,null,null,"Coincident"]
[null,null,"ADJUSTMENTS - EMBEDDED GENERATION","MW","Non-coincident"]
[null,null,null,null,"Coincident"]
[null,null,"WEATHER CORRECTED MD 10% POE","MW","Non-coincident"]
[null,null,null,null,"Coincident"]
[null,null,"WEATHER CORRECTED MD 10% POE","MVA","Non-coincident"]
[null,null,null,null,"Coincident"]
[null,null,"WEATHER CORRECTED MD 50% POE","MW","Non-coincident"]
[null,null,null,null,"Coincident"]
[null,null,"WEATHER CORRECTED MD 50% POE","MVA","Non-coincident"]
[null,null,null,null,"Coincident"]
[null,"NSP to enter name","CONNECTION POINT RATING","MVA","Non-coincident"]
[null,null,null,null,"Coincident"]
[null,null,"WINTER/SUMMER PEAKING",null,"Non-coincident"]
[null,null,null,null,"Coincident"]
[null,null,"ADJUSTMENTS - EMBEDDED GENERATION","MW","Non-coincident"]
[null,null,null,null,"Coincident"]
[null,null,"WEATHER CORRECTED MD 10% POE","MW","Non-coincident"]
[null,null,null,null,"Coincident"]
[null,null,"WEATHER CORRECTED MD 10% POE","MVA","Non-coincident"]
[null,null,null,null,"Coincident"]
[null,null,"WEATHER CORRECTED MD 50% POE","MW","Non-coincident"]
[null,null,null,null,"Coincident"]
[null,null,"WEATHER CORRECTED MD 50% POE","MVA","Non-coincident"]
[null,null,null,null,"Coincident"]
[null,"NSP to enter name","CONNECTION POINT RATING","MVA","Non-coincident"]
[null,null,null,null,"Coincident"]
[null,null,"WINTER/SUMMER PEAKING",null,"Non-coincident"]
[null,null,null,null,"Coincident"]
[null,null,"ADJUSTMENTS - EMBEDDED GENERATION","MW","Non-coincident"]
[null,null,null,null,"Coincident"]
[null,null,"WEATHER CORRECTED MD 10% POE","MW","Non-coincident"]
[null,null,null,null,"Coincident"]
[null,null,"WEATHER CORRECTED MD 10% POE","MVA","Non-coincident"]
[null,null,null,null,"Coincident"]
[null,null,"WEATHER CORRECTED MD 50% POE","MW","Non-coincident"]
[null,null,null,null,"Coincident"]
[null,null,"WEATHER CORRECTED MD 50% POE","MVA","Non-coincident"]
[null,null,null,null,"Coincident"]
[null,"NSP to enter name","CONNECTION POINT RATING","MVA","Non-coincident"]
[null,null,null,null,"Coincident"]
[null,null,"WINTER/SUMMER PEAKING",null,"Non-coincident"]
[null,null,null,null,"Coincident"]
[null,null,"ADJUSTMENTS - EMBEDDED GENERATION","MW","Non-coincident"]
[null,null,null,null,"Coincident"]
[null,null,"WEATHER CORRECTED MD 10% POE","MW","Non-coincident"]
[null,null,null,null,"Coincident"]
[null,null,"WEATHER CORRECTED MD 10% POE","MVA","Non-coincident"]
[null,null,null,null,"Coincident"]
[null,null,"WEATHER CORRECTED MD 50% POE","MW","Non-coincident"]
[null,null,null,null,"Coincident"]
[null,null,"WEATHER CORRECTED MD 50% POE","MVA","Non-coincident"]
[null,null,null,null,"Coincident"]
[null,"NSP to enter name","CONNECTION POINT RATING","MVA","Non-coincident"]
[null,null,null,null,"Coincident"]
[null,null,"WINTER/SUMMER PEAKING",null,"Non-coincident"]
[null,null,null,null,"Coincident"]
[null,null,"ADJUSTMENTS - EMBEDDED GENERATION","MW","Non-coincident"]
[null,null,null,null,"Coincident"]
[null,null,"WEATHER CORRECTED MD 10% POE","MW","Non-coincident"]
[null,null,null,null,"Coincident"]
[null,null,"WEATHER CORRECTED MD 10% POE","MVA","Non-coincident"]
[null,null,null,null,"Coincident"]
[null,null,"WEATHER CORRECTED MD 50% POE","MW","Non-coincident"]
[null,null,null,null,"Coincident"]
[null,null,"WEATHER CORRECTED MD 50% POE","MVA","Non-coincident"]
[null,null,null,null,"Coincident"]
[null,"NSP to enter name","CONNECTION POINT RATING","MVA","Non-coincident"]
[null,null,null,null,"Coincident"]
[null,null,"WINTER/SUMMER PEAKING",null,"Non-coincident"]
[null,null,null,null,"Coincident"]
[null,null,"ADJUSTMENTS - EMBEDDED GENERATION","MW","Non-coincident"]
[null,null,null,null,"Coincident"]
[null,null,"WEATHER CORRECTED MD 10% POE","MW","Non-coincident"]
[null,null,null,null,"Coincident"]
[null,null,"WEATHER CORRECTED MD 10% POE","MVA","Non-coincident"]
[null,null,null,null,"Coincident"]
[null,null,"WEATHER CORRECTED MD 50% POE","MW","Non-coincident"]
[null,null,null,null,"Coincident"]
[null,null,"WEATHER CORRECTED MD 50% POE","MVA","Non-coincident"]
[null,null,null,null,"Coincident"]
[null,"NSP to enter name","CONNECTION POINT RATING","MVA","Non-coincident"]
[null,null,null,null,"Coincident"]
[null,null,"WINTER/SUMMER PEAKING",null,"Non-coincident"]
[null,null,null,null,"Coincident"]
[null,null,"ADJUSTMENTS - EMBEDDED GENERATION","MW","Non-coincident"]
[null,null,null,null,"Coincident"]
[null,null,"WEATHER CORRECTED MD 10% POE","MW","Non-coincident"]
[null,null,null,null,"Coincident"]
[null,null,"WEATHER CORRECTED MD 10% POE","MVA","Non-coincident"]
[null,null,null,null,"Coincident"]
[null,null,"WEATHER CORRECTED MD 50% POE","MW","Non-coincident"]
[null,null,null,null,"Coincident"]
[null,null,"WEATHER CORRECTED MD 50% POE","MVA","Non-coincident"]
[null,null,null,null,"Coincident"]
[null,"NSP to enter name","CONNECTION POINT RATING","MVA","Non-coincident"]
[null,null,null,null,"Coincident"]
[null,null,"WINTER/SUMMER PEAKING",null,"Non-coincident"]
[null,null,null,null,"Coincident"]
[null,null,"ADJUSTMENTS - EMBEDDED GENERATION","MW","Non-coincident"]
[null,null,null,null,"Coincident"]
[null,null,"WEATHER CORRECTED MD 10% POE","MW","Non-coincident"]
[null,null,null,null,"Coincident"]
[null,null,"WEATHER CORRECTED MD 10% POE","MVA","Non-coincident"]
[null,null,null,null,"Coincident"]
[null,null,"WEATHER CORRECTED MD 50% POE","MW","Non-coincident"]
[null,null,null,null,"Coincident"]
[null,null,"WEATHER CORRECTED MD 50% POE","MVA","Non-coincident"]
[null,null,null,null,"Coincident"]
[null,"NSP to enter name","CONNECTION POINT RATING","MVA","Non-coincident"]
[null,null,null,null,"Coincident"]
[null,null,"WINTER/SUMMER PEAKING",null,"Non-coincident"]
[null,null,null,null,"Coincident"]
[null,null,"ADJUSTMENTS - EMBEDDED GENERATION","MW","Non-coincident"]
[null,null,null,null,"Coincident"]
[null,null,"WEATHER CORRECTED MD 10% POE","MW","Non-coincident"]
[null,null,null,null,"Coincident"]
[null,null,"WEATHER CORRECTED MD 10% POE","MVA","Non-coincident"]
[null,null,null,null,"Coincident"]
[null,null,"WEATHER CORRECTED MD 50% POE","MW","Non-coincident"]
[null,null,null,null,"Coincident"]
[null,null,"WEATHER CORRECTED MD 50% POE","MVA","Non-coincident"]
[null,null,null,null,"Coincident"]
[null,"NSP to enter name","CONNECTION POINT RATING","MVA","Non-coincident"]
[null,null,null,null,"Coincident"]
[null,null,"WINTER/SUMMER PEAKING",null,"Non-coincident"]
[null,null,null,null,"Coincident"]
[null,null,"ADJUSTMENTS - EMBEDDED GENERATION","MW","Non-coincident"]
[null,null,null,null,"Coincident"]
[null,null,"WEATHER CORRECTED MD 10% POE","MW","Non-coincident"]
[null,null,null,null,"Coincident"]
[null,null,"WEATHER CORRECTED MD 10% POE","MVA","Non-coincident"]
[null,null,null,null,"Coincident"]
[null,null,"WEATHER CORRECTED MD 50% POE","MW","Non-coincident"]
[null,null,null,null,"Coincident"]
[null,null,"WEATHER CORRECTED MD 50% POE","MVA","Non-coincident"]
[null,null,null,null,"Coincident"]
[null,"NSP to enter name","CONNECTION POINT RATING","MVA","Non-coincident"]
[null,null,null,null,"Coincident"]
[null,null,"WINTER/SUMMER PEAKING",null,"Non-coincident"]
[null,null,null,null,"Coincident"]
[null,null,"ADJUSTMENTS - EMBEDDED GENERATION","MW","Non-coincident"]
[null,null,null,null,"Coincident"]
[null,null,"WEATHER CORRECTED MD 10% POE","MW","Non-coincident"]
[null,null,null,null,"Coincident"]
[null,null,"WEATHER CORRECTED MD 10% POE","MVA","Non-coincident"]
[null,null,null,null,"Coincident"]
[null,null,"WEATHER CORRECTED MD 50% POE","MW","Non-coincident"]
[null,null,null,null,"Coincident"]
[null,null,"WEATHER CORRECTED MD 50% POE","MVA","Non-coincident"]
[null,null,null,null,"Coincident"]
[null,"NSP to enter name","CONNECTION POINT RATING","MVA","Non-coincident"]
[null,null,null,null,"Coincident"]
[null,null,"WINTER/SUMMER PEAKING",null,"Non-coincident"]
[null,null,null,null,"Coincident"]
[null,null,"ADJUSTMENTS - EMBEDDED GENERATION","MW","Non-coincident"]
[null,null,null,null,"Coincident"]
[null,null,"WEATHER CORRECTED MD 10% POE","MW","Non-coincident"]
[null,null,null,null,"Coincident"]
[null,null,"WEATHER CORRECTED MD 10% POE","MVA","Non-coincident"]
[null,null,null,null,"Coincident"]
[null,null,"WEATHER CORRECTED MD 50% POE","MW","Non-coincident"]
[null,null,null,null,"Coincident"]
[null,null,"WEATHER CORRECTED MD 50% POE","MVA","Non-coincident"]
[null,null,null,null,"Coincident"]
[null,"NSP to enter name","CONNECTION POINT RATING","MVA","Non-coincident"]
[null,null,null,null,"Coincident"]
[null,null,"WINTER/SUMMER PEAKING",null,"Non-coincident"]
[null,null,null,null,"Coincident"]
[null,null,"ADJUSTMENTS - EMBEDDED GENERATION","MW","Non-coincident"]
[null,null,null,null,"Coincident"]
[null,null,"WEATHER CORRECTED MD 10% POE","MW","Non-coincident"]
[null,null,null,null,"Coincident"]
[null,null,"WEATHER CORRECTED MD 10% POE","MVA","Non-coincident"]
[null,null,null,null,"Coincident"]
[null,null,"WEATHER CORRECTED MD 50% POE","MW","Non-coincident"]
[null,null,null,null,"Coincident"]
[null,null,"WEATHER CORRECTED MD 50% POE","MVA","Non-coincident"]
[null,null,null,null,"Coincident"]
[null,"NSP to enter name","CONNECTION POINT RATING","MVA","Non-coincident"]
[null,null,null,null,"Coincident"]
[null,null,"WINTER/SUMMER PEAKING",null,"Non-coincident"]
[null,null,null,null,"Coincident"]
[null,null,"ADJUSTMENTS - EMBEDDED GENERATION","MW","Non-coincident"]
[null,null,null,null,"Coincident"]
[null,null,"WEATHER CORRECTED MD 10% POE","MW","Non-coincident"]
[null,null,null,null,"Coincident"]
[null,null,"WEATHER CORRECTED MD 10% POE","MVA","Non-coincident"]
[null,null,null,null,"Coincident"]
[null,null,"WEATHER CORRECTED MD 50% POE","MW","Non-coincident"]
[null,null,null,null,"Coincident"]
[null,null,"WEATHER CORRECTED MD 50% POE","MVA","Non-coincident"]
[null,null,null,null,"Coincident"]
[null,"NSP to enter name","CONNECTION POINT RATING","MVA","Non-coincident"]
[null,null,null,null,"Coincident"]
[null,null,"WINTER/SUMMER PEAKING",null,"Non-coincident"]
[null,null,null,null,"Coincident"]
[null,null,"ADJUSTMENTS - EMBEDDED GENERATION","MW","Non-coincident"]
[null,null,null,null,"Coincident"]
[null,null,"WEATHER CORRECTED MD 10% POE","MW","Non-coincident"]
[null,null,null,null,"Coincident"]
[null,null,"WEATHER CORRECTED MD 10% POE","MVA","Non-coincident"]
[null,null,null,null,"Coincident"]
[null,null,"WEATHER CORRECTED MD 50% POE","MW","Non-coincident"]
[null,null,null,null,"Coincident"]
[null,null,"WEATHER CORRECTED MD 50% POE","MVA","Non-coincident"]
[null,null,null,null,"Coincident"]
[null,"NSP to enter name","CONNECTION POINT RATING","MVA","Non-coincident"]
[null,null,null,null,"Coincident"]
[null,null,"WINTER/SUMMER PEAKING",null,"Non-coincident"]
[null,null,null,null,"Coincident"]
[null,null,"ADJUSTMENTS - EMBEDDED GENERATION","MW","Non-coincident"]
[null,null,null,null,"Coincident"]
[null,null,"WEATHER CORRECTED MD 10% POE","MW","Non-coincident"]
[null,null,null,null,"Coincident"]
[null,null,"WEATHER CORRECTED MD 10% POE","MVA","Non-coincident"]
[null,null,null,null,"Coincident"]
[null,null,"WEATHER CORRECTED MD 50% POE","MW","Non-coincident"]
[null,null,null,null,"Coincident"]
[null,null,"WEATHER CORRECTED MD 50% POE","MVA","Non-coincident"]
[null,null,null,null,"Coincident"]
[null,"NSP to enter name","CONNECTION POINT RATING","MVA","Non-coincident"]
[null,null,null,null,"Coincident"]
[null,null,"WINTER/SUMMER PEAKING",null,"Non-coincident"]
[null,null,null,null,"Coincident"]
[null,null,"ADJUSTMENTS - EMBEDDED GENERATION","MW","Non-coincident"]
[null,null,null,null,"Coincident"]
[null,null,"WEATHER CORRECTED MD 10% POE","MW","Non-coincident"]
[null,null,null,null,"Coincident"]
[null,null,"WEATHER CORRECTED MD 10% POE","MVA","Non-coincident"]
[null,null,null,null,"Coincident"]
[null,null,"WEATHER CORRECTED MD 50% POE","MW","Non-coincident"]
[null,null,null,null,"Coincident"]
[null,null,"WEATHER CORRECTED MD 50% POE","MVA","Non-coincident"]
[null,null,null,null,"Coincident"]
[null,"NSP to enter name","CONNECTION POINT RATING","MVA","Non-coincident"]
[null,null,null,null,"Coincident"]
[null,null,"WINTER/SUMMER PEAKING",null,"Non-coincident"]
[null,null,null,null,"Coincident"]
[null,null,"ADJUSTMENTS - EMBEDDED GENERATION","MW","Non-coincident"]
[null,null,null,null,"Coincident"]
[null,null,"WEATHER CORRECTED MD 10% POE","MW","Non-coincident"]
[null,null,null,null,"Coincident"]
[null,null,"WEATHER CORRECTED MD 10% POE","MVA","Non-coincident"]
[null,null,null,null,"Coincident"]
[null,null,"WEATHER CORRECTED MD 50% POE","MW","Non-coincident"]
[null,null,null,null,"Coincident"]
[null,null,"WEATHER CORRECTED MD 50% POE","MVA","Non-coincident"]
[null,null,null,null,"Coincident"]
[null,"NSP to enter name","CONNECTION POINT RATING","MVA","Non-coincident"]
[null,null,null,null,"Coincident"]
[null,null,"WINTER/SUMMER PEAKING",null,"Non-coincident"]
[null,null,null,null,"Coincident"]
[null,null,"ADJUSTMENTS - EMBEDDED GENERATION","MW","Non-coincident"]
[null,null,null,null,"Coincident"]
[null,null,"WEATHER CORRECTED MD 10% POE","MW","Non-coincident"]
[null,null,null,null,"Coincident"]
[null,null,"WEATHER CORRECTED MD 10% POE","MVA","Non-coincident"]
[null,null,null,null,"Coincident"]
[null,null,"WEATHER CORRECTED MD 50% POE","MW","Non-coincident"]
[null,null,null,null,"Coincident"]
[null,null,"WEATHER CORRECTED MD 50% POE","MVA","Non-coincident"]
[null,null,null,null,"Coincident"]
[null,"NSP to enter name","CONNECTION POINT RATING","MVA","Non-coincident"]
[null,null,null,null,"Coincident"]
[null,null,"WINTER/SUMMER PEAKING",null,"Non-coincident"]
[null,null,null,null,"Coincident"]
[null,null,"ADJUSTMENTS - EMBEDDED GENERATION","MW","Non-coincident"]
[null,null,null,null,"Coincident"]
[null,null,"WEATHER CORRECTED MD 10% POE","MW","Non-coincident"]
[null,null,null,null,"Coincident"]
[null,null,"WEATHER CORRECTED MD 10% POE","MVA","Non-coincident"]
[null,null,null,null,"Coincident"]
[null,null,"WEATHER CORRECTED MD 50% POE","MW","Non-coincident"]
[null,null,null,null,"Coincident"]
[null,null,"WEATHER CORRECTED MD 50% POE","MVA","Non-coincident"]
[null,null,null,null,"Coincident"]
[null,"NSP to enter name","CONNECTION POINT RATING","MVA","Non-coincident"]
[null,null,null,null,"Coincident"]
[null,null,"WINTER/SUMMER PEAKING",null,"Non-coincident"]
[null,null,null,null,"Coincident"]
[null,null,"ADJUSTMENTS - EMBEDDED GENERATION","MW","Non-coincident"]
[null,null,null,null,"Coincident"]
[null,null,"WEATHER CORRECTED MD 10% POE","MW","Non-coincident"]
[null,null,null,null,"Coincident"]
[null,null,"WEATHER CORRECTED MD 10% POE","MVA","Non-coincident"]
[null,null,null,null,"Coincident"]
[null,null,"WEATHER CORRECTED MD 50% POE","MW","Non-coincident"]
[null,null,null,null,"Coincident"]
[null,null,"WEATHER CORRECTED MD 50% POE","MVA","Non-coincident"]
[null,null,null,null,"Coincident"]
[null,"NSP to enter name","CONNECTION POINT RATING","MVA","Non-coincident"]
[null,null,null,null,"Coincident"]
[null,null,"WINTER/SUMMER PEAKING",null,"Non-coincident"]
[null,null,null,null,"Coincident"]
[null,null,"ADJUSTMENTS - EMBEDDED GENERATION","MW","Non-coincident"]
[null,null,null,null,"Coincident"]
[null,null,"WEATHER CORRECTED MD 10% POE","MW","Non-coincident"]
[null,null,null,null,"Coincident"]
[null,null,"WEATHER CORRECTED MD 10% POE","MVA","Non-coincident"]
[null,null,null,null,"Coincident"]
[null,null,"WEATHER CORRECTED MD 50% POE","MW","Non-coincident"]
[null,null,null,null,"Coincident"]
[null,null,"WEATHER CORRECTED MD 50% POE","MVA","Non-coincident"]
[null,null,null,null,"Coincident"]
[null,"NSP to enter name","CONNECTION POINT RATING","MVA","Non-coincident"]
[null,null,null,null,"Coincident"]
[null,null,"WINTER/SUMMER PEAKING",null,"Non-coincident"]
[null,null,null,null,"Coincident"]
[null,null,"ADJUSTMENTS - EMBEDDED GENERATION","MW","Non-coincident"]
[null,null,null,null,"Coincident"]
[null,null,"WEATHER CORRECTED MD 10% POE","MW","Non-coincident"]
[null,null,null,null,"Coincident"]
[null,null,"WEATHER CORRECTED MD 10% POE","MVA","Non-coincident"]
[null,null,null,null,"Coincident"]
[null,null,"WEATHER CORRECTED MD 50% POE","MW","Non-coincident"]
[null,null,null,null,"Coincident"]
[null,null,"WEATHER CORRECTED MD 50% POE","MVA","Non-coincident"]
[null,null,null,null,"Coincident"]
[null,"NSP to enter name","CONNECTION POINT RATING","MVA","Non-coincident"]
[null,null,null,null,"Coincident"]
[null,null,"WINTER/SUMMER PEAKING",null,"Non-coincident"]
[null,null,null,null,"Coincident"]
[null,null,"ADJUSTMENTS - EMBEDDED GENERATION","MW","Non-coincident"]
[null,null,null,null,"Coincident"]
[null,null,"WEATHER CORRECTED MD 10% POE","MW","Non-coincident"]
[null,null,null,null,"Coincident"]
[null,null,"WEATHER CORRECTED MD 10% POE","MVA","Non-coincident"]
[null,null,null,null,"Coincident"]
[null,null,"WEATHER CORRECTED MD 50% POE","MW","Non-coincident"]
[null,null,null,null,"Coincident"]
[null,null,"WEATHER CORRECTED MD 50% POE","MVA","Non-coincident"]
[null,null,null,null,"Coincident"]
[null,"NSP to enter name","CONNECTION POINT RATING","MVA","Non-coincident"]
[null,null,null,null,"Coincident"]
[null,null,"WINTER/SUMMER PEAKING",null,"Non-coincident"]
[null,null,null,null,"Coincident"]
[null,null,"ADJUSTMENTS - EMBEDDED GENERATION","MW","Non-coincident"]
[null,null,null,null,"Coincident"]
[null,null,"WEATHER CORRECTED MD 10% POE","MW","Non-coincident"]
[null,null,null,null,"Coincident"]
[null,null,"WEATHER CORRECTED MD 10% POE","MVA","Non-coincident"]
[null,null,null,null,"Coincident"]
[null,null,"WEATHER CORRECTED MD 50% POE","MW","Non-coincident"]
[null,null,null,null,"Coincident"]
[null,null,"WEATHER CORRECTED MD 50% POE","MVA","Non-coincident"]
[null,null,null,null,"Coincident"]
[null,"NSP to enter name","CONNECTION POINT RATING","MVA","Non-coincident"]
[null,null,null,null,"Coincident"]
[null,null,"WINTER/SUMMER PEAKING",null,"Non-coincident"]
[null,null,null,null,"Coincident"]
[null,null,"ADJUSTMENTS - EMBEDDED GENERATION","MW","Non-coincident"]
[null,null,null,null,"Coincident"]
[null,null,"WEATHER CORRECTED MD 10% POE","MW","Non-coincident"]
[null,null,null,null,"Coincident"]
[null,null,"WEATHER CORRECTED MD 10% POE","MVA","Non-coincident"]
[null,null,null,null,"Coincident"]
[null,null,"WEATHER CORRECTED MD 50% POE","MW","Non-coincident"]
[null,null,null,null,"Coincident"]
[null,null,"WEATHER CORRECTED MD 50% POE","MVA","Non-coincident"]
[null,null,null,null,"Coincident"]
[null,"NSP to enter name","CONNECTION POINT RATING","MVA","Non-coincident"]
[null,null,null,null,"Coincident"]
[null,null,"WINTER/SUMMER PEAKING",null,"Non-coincident"]
[null,null,null,null,"Coincident"]
[null,null,"ADJUSTMENTS - EMBEDDED GENERATION","MW","Non-coincident"]
[null,null,null,null,"Coincident"]
[null,null,"WEATHER CORRECTED MD 10% POE","MW","Non-coincident"]
[null,null,null,null,"Coincident"]
[null,null,"WEATHER CORRECTED MD 10% POE","MVA","Non-coincident"]
[null,null,null,null,"Coincident"]
[null,null,"WEATHER CORRECTED MD 50% POE","MW","Non-coincident"]
[null,null,null,null,"Coincident"]
[null,null,"WEATHER CORRECTED MD 50% POE","MVA","Non-coincident"]
[null,null,null,null,"Coincident"]
[null,"NSP to enter name","CONNECTION POINT RATING","MVA","Non-coincident"]
[null,null,null,null,"Coincident"]
[null,null,"WINTER/SUMMER PEAKING",null,"Non-coincident"]
[null,null,null,null,"Coincident"]
[null,null,"ADJUSTMENTS - EMBEDDED GENERATION","MW","Non-coincident"]
[null,null,null,null,"Coincident"]
[null,null,"WEATHER CORRECTED MD 10% POE","MW","Non-coincident"]
[null,null,null,null,"Coincident"]
[null,null,"WEATHER CORRECTED MD 10% POE","MVA","Non-coincident"]
[null,null,null,null,"Coincident"]
[null,null,"WEATHER CORRECTED MD 50% POE","MW","Non-coincident"]
[null,null,null,null,"Coincident"]
[null,null,"WEATHER CORRECTED MD 50% POE","MVA","Non-coincident"]
[null,null,null,null,"Coincident"]
[null,"NSP to enter name","CONNECTION POINT RATING","MVA","Non-coincident"]
[null,null,null,null,"Coincident"]
[null,null,"WINTER/SUMMER PEAKING",null,"Non-coincident"]
[null,null,null,null,"Coincident"]
[null,null,"ADJUSTMENTS - EMBEDDED GENERATION","MW","Non-coincident"]
[null,null,null,null,"Coincident"]
[null,null,"WEATHER CORRECTED MD 10% POE","MW","Non-coincident"]
[null,null,null,null,"Coincident"]
[null,null,"WEATHER CORRECTED MD 10% POE","MVA","Non-coincident"]
[null,null,null,null,"Coincident"]
[null,null,"WEATHER CORRECTED MD 50% POE","MW","Non-coincident"]
[null,null,null,null,"Coincident"]
[null,null,"WEATHER CORRECTED MD 50% POE","MVA","Non-coincident"]
[null,null,null,null,"Coincident"]
[null,"NSP to enter name","CONNECTION POINT RATING","MVA","Non-coincident"]
[null,null,null,null,"Coincident"]
[null,null,"WINTER/SUMMER PEAKING",null,"Non-coincident"]
[null,null,null,null,"Coincident"]
[null,null,"ADJUSTMENTS - EMBEDDED GENERATION","MW","Non-coincident"]
[null,null,null,null,"Coincident"]
[null,null,"WEATHER CORRECTED MD 10% POE","MW","Non-coincident"]
[null,null,null,null,"Coincident"]
[null,null,"WEATHER CORRECTED MD 10% POE","MVA","Non-coincident"]
[null,null,null,null,"Coincident"]
[null,null,"WEATHER CORRECTED MD 50% POE","MW","Non-coincident"]
[null,null,null,null,"Coincident"]
[null,null,"WEATHER CORRECTED MD 50% POE","MVA","Non-coincident"]
[null,null,null,null,"Coincident"]
[null,"NSP to enter name","CONNECTION POINT RATING","MVA","Non-coincident"]
[null,null,null,null,"Coincident"]
[null,null,"WINTER/SUMMER PEAKING",null,"Non-coincident"]
[null,null,null,null,"Coincident"]
[null,null,"ADJUSTMENTS - EMBEDDED GENERATION","MW","Non-coincident"]
[null,null,null,null,"Coincident"]
[null,null,"WEATHER CORRECTED MD 10% POE","MW","Non-coincident"]
[null,null,null,null,"Coincident"]
[null,null,"WEATHER CORRECTED MD 10% POE","MVA","Non-coincident"]
[null,null,null,null,"Coincident"]
[null,null,"WEATHER CORRECTED MD 50% POE","MW","Non-coincident"]
[null,null,null,null,"Coincident"]
[null,null,"WEATHER CORRECTED MD 50% POE","MVA","Non-coincident"]
[null,null,null,null,"Coincident"]
[null,"NSP to enter name","CONNECTION POINT RATING","MVA","Non-coincident"]
[null,null,null,null,"Coincident"]
[null,null,"WINTER/SUMMER PEAKING",null,"Non-coincident"]
[null,null,null,null,"Coincident"]
[null,null,"ADJUSTMENTS - EMBEDDED GENERATION","MW","Non-coincident"]
[null,null,null,null,"Coincident"]
[null,null,"WEATHER CORRECTED MD 10% POE","MW","Non-coincident"]
[null,null,null,null,"Coincident"]
[null,null,"WEATHER CORRECTED MD 10% POE","MVA","Non-coincident"]
[null,null,null,null,"Coincident"]
[null,null,"WEATHER CORRECTED MD 50% POE","MW","Non-coincident"]
[null,null,null,null,"Coincident"]
[null,null,"WEATHER CORRECTED MD 50% POE","MVA","Non-coincident"]
[null,null,null,null,"Coincident"]
[null,"NSP to enter name","CONNECTION POINT RATING","MVA","Non-coincident"]
[null,null,null,null,"Coincident"]
[null,null,"WINTER/SUMMER PEAKING",null,"Non-coincident"]
[null,null,null,null,"Coincident"]
[null,null,"ADJUSTMENTS - EMBEDDED GENERATION","MW","Non-coincident"]
[null,null,null,null,"Coincident"]
[null,null,"WEATHER CORRECTED MD 10% POE","MW","Non-coincident"]
[null,null,null,null,"Coincident"]
[null,null,"WEATHER CORRECTED MD 10% POE","MVA","Non-coincident"]
[null,null,null,null,"Coincident"]
[null,null,"WEATHER CORRECTED MD 50% POE","MW","Non-coincident"]
[null,null,null,null,"Coincident"]
[null,null,"WEATHER CORRECTED MD 50% POE","MVA","Non-coincident"]
[null,null,null,null,"Coincident"]
[null,"NSP to enter name","CONNECTION POINT RATING","MVA","Non-coincident"]
[null,null,null,null,"Coincident"]
[null,null,"WINTER/SUMMER PEAKING",null,"Non-coincident"]
[null,null,null,null,"Coincident"]
[null,null,"ADJUSTMENTS - EMBEDDED GENERATION","MW","Non-coincident"]
[null,null,null,null,"Coincident"]
[null,null,"WEATHER CORRECTED MD 10% POE","MW","Non-coincident"]
[null,null,null,null,"Coincident"]
[null,null,"WEATHER CORRECTED MD 10% POE","MVA","Non-coincident"]
[null,null,null,null,"Coincident"]
[null,null,"WEATHER CORRECTED MD 50% POE","MW","Non-coincident"]
[null,null,null,null,"Coincident"]
[null,null,"WEATHER CORRECTED MD 50% POE","MVA","Non-coincident"]
[null,null,null,null,"Coincident"]
[null,"NSP to enter name","CONNECTION POINT RATING","MVA","Non-coincident"]
[null,null,null,null,"Coincident"]
[null,null,"WINTER/SUMMER PEAKING",null,"Non-coincident"]
[null,null,null,null,"Coincident"]
[null,null,"ADJUSTMENTS - EMBEDDED GENERATION","MW","Non-coincident"]
[null,null,null,null,"Coincident"]
[null,null,"WEATHER CORRECTED MD 10% POE","MW","Non-coincident"]
[null,null,null,null,"Coincident"]
[null,null,"WEATHER CORRECTED MD 10% POE","MVA","Non-coincident"]
[null,null,null,null,"Coincident"]
[null,null,"WEATHER CORRECTED MD 50% POE","MW","Non-coincident"]
[null,null,null,null,"Coincident"]
[null,null,"WEATHER CORRECTED MD 50% POE","MVA","Non-coincident"]
[null,null,null,null,"Coincident"]
[null,"NSP to enter name","CONNECTION POINT RATING","MVA","Non-coincident"]
[null,null,null,null,"Coincident"]
[null,null,"WINTER/SUMMER PEAKING",null,"Non-coincident"]
[null,null,null,null,"Coincident"]
[null,null,"ADJUSTMENTS - EMBEDDED GENERATION","MW","Non-coincident"]
[null,null,null,null,"Coincident"]
[null,null,"WEATHER CORRECTED MD 10% POE","MW","Non-coincident"]
[null,null,null,null,"Coincident"]
[null,null,"WEATHER CORRECTED MD 10% POE","MVA","Non-coincident"]
[null,null,null,null,"Coincident"]
[null,null,"WEATHER CORRECTED MD 50% POE","MW","Non-coincident"]
[null,null,null,null,"Coincident"]
[null,null,"WEATHER CORRECTED MD 50% POE","MVA","Non-coincident"]
[null,null,null,null,"Coincident"]
[null,"NSP to enter name","CONNECTION POINT RATING","MVA","Non-coincident"]
[null,null,null,null,"Coincident"]
[null,null,"WINTER/SUMMER PEAKING",null,"Non-coincident"]
[null,null,null,null,"Coincident"]
[null,null,"ADJUSTMENTS - EMBEDDED GENERATION","MW","Non-coincident"]
[null,null,null,null,"Coincident"]
[null,null,"WEATHER CORRECTED MD 10% POE","MW","Non-coincident"]
[null,null,null,null,"Coincident"]
[null,null,"WEATHER CORRECTED MD 10% POE","MVA","Non-coincident"]
[null,null,null,null,"Coincident"]
[null,null,"WEATHER CORRECTED MD 50% POE","MW","Non-coincident"]
[null,null,null,null,"Coincident"]
[null,null,"WEATHER CORRECTED MD 50% POE","MVA","Non-coincident"]
[null,null,null,null,"Coincident"]
[null,"NSP to enter name","CONNECTION POINT RATING","MVA","Non-coincident"]
[null,null,null,null,"Coincident"]
[null,null,"WINTER/SUMMER PEAKING",null,"Non-coincident"]
[null,null,null,null,"Coincident"]
[null,null,"ADJUSTMENTS - EMBEDDED GENERATION","MW","Non-coincident"]
[null,null,null,null,"Coincident"]
[null,null,"WEATHER CORRECTED MD 10% POE","MW","Non-coincident"]
[null,null,null,null,"Coincident"]
[null,null,"WEATHER CORRECTED MD 10% POE","MVA","Non-coincident"]
[null,null,null,null,"Coincident"]
[null,null,"WEATHER CORRECTED MD 50% POE","MW","Non-coincident"]
[null,null,null,null,"Coincident"]
[null,null,"WEATHER CORRECTED MD 50% POE","MVA","Non-coincident"]
[null,null,null,null,"Coincident"]
[null,"NSP to enter name","CONNECTION POINT RATING","MVA","Non-coincident"]
[null,null,null,null,"Coincident"]
[null,null,"WINTER/SUMMER PEAKING",null,"Non-coincident"]
[null,null,null,null,"Coincident"]
[null,null,"ADJUSTMENTS - EMBEDDED GENERATION","MW","Non-coincident"]
[null,null,null,null,"Coincident"]
[null,null,"WEATHER CORRECTED MD 10% POE","MW","Non-coincident"]
[null,null,null,null,"Coincident"]
[null,null,"WEATHER CORRECTED MD 10% POE","MVA","Non-coincident"]
[null,null,null,null,"Coincident"]
[null,null,"WEATHER CORRECTED MD 50% POE","MW","Non-coincident"]
[null,null,null,null,"Coincident"]
[null,null,"WEATHER CORRECTED MD 50% POE","MVA","Non-coincident"]
[null,null,null,null,"Coincident"]
[null,"NSP to enter name","CONNECTION POINT RATING","MVA","Non-coincident"]
[null,null,null,null,"Coincident"]
[null,null,"WINTER/SUMMER PEAKING",null,"Non-coincident"]
[null,null,null,null,"Coincident"]
[null,null,"ADJUSTMENTS - EMBEDDED GENERATION","MW","Non-coincident"]
[null,null,null,null,"Coincident"]
[null,null,"WEATHER CORRECTED MD 10% POE","MW","Non-coincident"]
[null,null,null,null,"Coincident"]
[null,null,"WEATHER CORRECTED MD 10% POE","MVA","Non-coincident"]
[null,null,null,null,"Coincident"]
[null,null,"WEATHER CORRECTED MD 50% POE","MW","Non-coincident"]
[null,null,null,null,"Coincident"]
[null,null,"WEATHER CORRECTED MD 50% POE","MVA","Non-coincident"]
[null,null,null,null,"Coincident"]
[null,"NSP to enter name","CONNECTION POINT RATING","MVA","Non-coincident"]
[null,null,null,null,"Coincident"]
[null,null,"WINTER/SUMMER PEAKING",null,"Non-coincident"]
[null,null,null,null,"Coincident"]
[null,null,"ADJUSTMENTS - EMBEDDED GENERATION","MW","Non-coincident"]
[null,null,null,null,"Coincident"]
[null,null,"WEATHER CORRECTED MD 10% POE","MW","Non-coincident"]
[null,null,null,null,"Coincident"]
[null,null,"WEATHER CORRECTED MD 10% POE","MVA","Non-coincident"]
[null,null,null,null,"Coincident"]
[null,null,"WEATHER CORRECTED MD 50% POE","MW","Non-coincident"]
[null,null,null,null,"Coincident"]
[null,null,"WEATHER CORRECTED MD 50% POE","MVA","Non-coincident"]
[null,null,null,null,"Coincident"]
[null,"NSP to enter name","CONNECTION POINT RATING","MVA","Non-coincident"]
[null,null,null,null,"Coincident"]
[null,null,"WINTER/SUMMER PEAKING",null,"Non-coincident"]
[null,null,null,null,"Coincident"]
[null,null,"ADJUSTMENTS - EMBEDDED GENERATION","MW","Non-coincident"]
[null,null,null,null,"Coincident"]
[null,null,"WEATHER CORRECTED MD 10% POE","MW","Non-coincident"]
[null,null,null,null,"Coincident"]
[null,null,"WEATHER CORRECTED MD 10% POE","MVA","Non-coincident"]
[null,null,null,null,"Coincident"]
[null,null,"WEATHER CORRECTED MD 50% POE","MW","Non-coincident"]
[null,null,null,null,"Coincident"]
[null,null,"WEATHER CORRECTED MD 50% POE","MVA","Non-coincident"]
[null,null,null,null,"Coincident"]
[null,"NSP to enter name","CONNECTION POINT RATING","MVA","Non-coincident"]
[null,null,null,null,"Coincident"]
[null,null,"WINTER/SUMMER PEAKING",null,"Non-coincident"]
[null,null,null,null,"Coincident"]
[null,null,"ADJUSTMENTS - EMBEDDED GENERATION","MW","Non-coincident"]
[null,null,null,null,"Coincident"]
[null,null,"WEATHER CORRECTED MD 10% POE","MW","Non-coincident"]
[null,null,null,null,"Coincident"]
[null,null,"WEATHER CORRECTED MD 10% POE","MVA","Non-coincident"]
[null,null,null,null,"Coincident"]
[null,null,"WEATHER CORRECTED MD 50% POE","MW","Non-coincident"]
[null,null,null,null,"Coincident"]
[null,null,"WEATHER CORRECTED MD 50% POE","MVA","Non-coincident"]
[null,null,null,null,"Coincident"]
[null,"NSP to enter name","CONNECTION POINT RATING","MVA","Non-coincident"]
[null,null,null,null,"Coincident"]
[null,null,"WINTER/SUMMER PEAKING",null,"Non-coincident"]
[null,null,null,null,"Coincident"]
[null,null,"ADJUSTMENTS - EMBEDDED GENERATION","MW","Non-coincident"]
[null,null,null,null,"Coincident"]
[null,null,"WEATHER CORRECTED MD 10% POE","MW","Non-coincident"]
[null,null,null,null,"Coincident"]
[null,null,"WEATHER CORRECTED MD 10% POE","MVA","Non-coincident"]
[null,null,null,null,"Coincident"]
[null,null,"WEATHER CORRECTED MD 50% POE","MW","Non-coincident"]
[null,null,null,null,"Coincident"]
[null,null,"WEATHER CORRECTED MD 50% POE","MVA","Non-coincident"]
[null,null,null,null,"Coincident"]
[null,"NSP to enter name","CONNECTION POINT RATING","MVA","Non-coincident"]
[null,null,null,null,"Coincident"]
[null,null,"WINTER/SUMMER PEAKING",null,"Non-coincident"]
[null,null,null,null,"Coincident"]
[null,null,"ADJUSTMENTS - EMBEDDED GENERATION","MW","Non-coincident"]
[null,null,null,null,"Coincident"]
[null,null,"WEATHER CORRECTED MD 10% POE","MW","Non-coincident"]
[null,null,null,null,"Coincident"]
[null,null,"WEATHER CORRECTED MD 10% POE","MVA","Non-coincident"]
[null,null,null,null,"Coincident"]
[null,null,"WEATHER CORRECTED MD 50% POE","MW","Non-coincident"]
[null,null,null,null,"Coincident"]
[null,null,"WEATHER CORRECTED MD 50% POE","MVA","Non-coincident"]
[null,null,null,null,"Coincident"]
[null,"NSP to enter name","CONNECTION POINT RATING","MVA","Non-coincident"]
[null,null,null,null,"Coincident"]
[null,null,"WINTER/SUMMER PEAKING",null,"Non-coincident"]
[null,null,null,null,"Coincident"]
[null,null,"ADJUSTMENTS - EMBEDDED GENERATION","MW","Non-coincident"]
[null,null,null,null,"Coincident"]
[null,null,"WEATHER CORRECTED MD 10% POE","MW","Non-coincident"]
[null,null,null,null,"Coincident"]
[null,null,"WEATHER CORRECTED MD 10% POE","MVA","Non-coincident"]
[null,null,null,null,"Coincident"]
[null,null,"WEATHER CORRECTED MD 50% POE","MW","Non-coincident"]
[null,null,null,null,"Coincident"]
[null,null,"WEATHER CORRECTED MD 50% POE","MVA","Non-coincident"]
[null,null,null,null,"Coincident"]
[null,"NSP to enter name","CONNECTION POINT RATING","MVA","Non-coincident"]
[null,null,null,null,"Coincident"]
[null,null,"WINTER/SUMMER PEAKING",null,"Non-coincident"]
[null,null,null,null,"Coincident"]
[null,null,"ADJUSTMENTS - EMBEDDED GENERATION","MW","Non-coincident"]
[null,null,null,null,"Coincident"]
[null,null,"WEATHER CORRECTED MD 10% POE","MW","Non-coincident"]
[null,null,null,null,"Coincident"]
[null,null,"WEATHER CORRECTED MD 10% POE","MVA","Non-coincident"]
[null,null,null,null,"Coincident"]
[null,null,"WEATHER CORRECTED MD 50% POE","MW","Non-coincident"]
[null,null,null,null,"Coincident"]
[null,null,"WEATHER CORRECTED MD 50% POE","MVA","Non-coincident"]
[null,null,null,null,"Coincident"]
[null,"NSP to enter name","CONNECTION POINT RATING","MVA","Non-coincident"]
[null,null,null,null,"Coincident"]
[null,null,"WINTER/SUMMER PEAKING",null,"Non-coincident"]
[null,null,null,null,"Coincident"]
[null,null,"ADJUSTMENTS - EMBEDDED GENERATION","MW","Non-coincident"]
[null,null,null,null,"Coincident"]
[null,null,"WEATHER CORRECTED MD 10% POE","MW","Non-coincident"]
[null,null,null,null,"Coincident"]
[null,null,"WEATHER CORRECTED MD 10% POE","MVA","Non-coincident"]
[null,null,null,null,"Coincident"]
[null,null,"WEATHER CORRECTED MD 50% POE","MW","Non-coincident"]
[null,null,null,null,"Coincident"]
[null,null,"WEATHER CORRECTED MD 50% POE","MVA","Non-coincident"]
[null,null,null,null,"Coincident"]
[null,"NSP to enter name","CONNECTION POINT RATING","MVA","Non-coincident"]
[null,null,null,null,"Coincident"]
[null,null,"WINTER/SUMMER PEAKING",null,"Non-coincident"]
[null,null,null,null,"Coincident"]
[null,null,"ADJUSTMENTS - EMBEDDED GENERATION","MW","Non-coincident"]
[null,null,null,null,"Coincident"]
[null,null,"WEATHER CORRECTED MD 10% POE","MW","Non-coincident"]
[null,null,null,null,"Coincident"]
[null,null,"WEATHER CORRECTED MD 10% POE","MVA","Non-coincident"]
[null,null,null,null,"Coincident"]
[null,null,"WEATHER CORRECTED MD 50% POE","MW","Non-coincident"]
[null,null,null,null,"Coincident"]
[null,null,"WEATHER CORRECTED MD 50% POE","MVA","Non-coincident"]
[null,null,null,null,"Coincident"]
[null,"NSP to enter name","CONNECTION POINT RATING","MVA","Non-coincident"]
[null,null,null,null,"Coincident"]
[null,null,"WINTER/SUMMER PEAKING",null,"Non-coincident"]
[null,null,null,null,"Coincident"]
[null,null,"ADJUSTMENTS - EMBEDDED GENERATION","MW","Non-coincident"]
[null,null,null,null,"Coincident"]
[null,null,"WEATHER CORRECTED MD 10% POE","MW","Non-coincident"]
[null,null,null,null,"Coincident"]
[null,null,"WEATHER CORRECTED MD 10% POE","MVA","Non-coincident"]
[null,null,null,null,"Coincident"]
[null,null,"WEATHER CORRECTED MD 50% POE","MW","Non-coincident"]
[null,null,null,null,"Coincident"]
[null,null,"WEATHER CORRECTED MD 50% POE","MVA","Non-coincident"]
[null,null,null,null,"Coincident"]
[null,"NSP to enter name","CONNECTION POINT RATING","MVA","Non-coincident"]
[null,null,null,null,"Coincident"]
[null,null,"WINTER/SUMMER PEAKING",null,"Non-coincident"]
[null,null,null,null,"Coincident"]
[null,null,"ADJUSTMENTS - EMBEDDED GENERATION","MW","Non-coincident"]
[null,null,null,null,"Coincident"]
[null,null,"WEATHER CORRECTED MD 10% POE","MW","Non-coincident"]
[null,null,null,null,"Coincident"]
[null,null,"WEATHER CORRECTED MD 10% POE","MVA","Non-coincident"]
[null,null,null,null,"Coincident"]
[null,null,"WEATHER CORRECTED MD 50% POE","MW","Non-coincident"]
[null,null,null,null,"Coincident"]
[null,null,"WEATHER CORRECTED MD 50% POE","MVA","Non-coincident"]
[null,null,null,null,"Coincident"]
[null,"NSP to enter name","CONNECTION POINT RATING","MVA","Non-coincident"]
[null,null,null,null,"Coincident"]
[null,null,"WINTER/SUMMER PEAKING",null,"Non-coincident"]
[null,null,null,null,"Coincident"]
[null,null,"ADJUSTMENTS - EMBEDDED GENERATION","MW","Non-coincident"]
[null,null,null,null,"Coincident"]
[null,null,"WEATHER CORRECTED MD 10% POE","MW","Non-coincident"]
[null,null,null,null,"Coincident"]
[null,null,"WEATHER CORRECTED MD 10% POE","MVA","Non-coincident"]
[null,null,null,null,"Coincident"]
[null,null,"WEATHER CORRECTED MD 50% POE","MW","Non-coincident"]
[null,null,null,null,"Coincident"]
[null,null,"WEATHER CORRECTED MD 50% POE","MVA","Non-coincident"]
[null,null,null,null,"Coincident"]
[null,"NSP to enter name","CONNECTION POINT RATING","MVA","Non-coincident"]
[null,null,null,null,"Coincident"]
[null,null,"WINTER/SUMMER PEAKING",null,"Non-coincident"]
[null,null,null,null,"Coincident"]
[null,null,"ADJUSTMENTS - EMBEDDED GENERATION","MW","Non-coincident"]
[null,null,null,null,"Coincident"]
[null,null,"WEATHER CORRECTED MD 10% POE","MW","Non-coincident"]
[null,null,null,null,"Coincident"]
[null,null,"WEATHER CORRECTED MD 10% POE","MVA","Non-coincident"]
[null,null,null,null,"Coincident"]
[null,null,"WEATHER CORRECTED MD 50% POE","MW","Non-coincident"]
[null,null,null,null,"Coincident"]
[null,null,"WEATHER CORRECTED MD 50% POE","MVA","Non-coincident"]
[null,null,null,null,"Coincident"]
[null,"NSP to enter name","CONNECTION POINT RATING","MVA","Non-coincident"]
[null,null,null,null,"Coincident"]
[null,null,"WINTER/SUMMER PEAKING",null,"Non-coincident"]
[null,null,null,null,"Coincident"]
[null,null,"ADJUSTMENTS - EMBEDDED GENERATION","MW","Non-coincident"]
[null,null,null,null,"Coincident"]
[null,null,"WEATHER CORRECTED MD 10% POE","MW","Non-coincident"]
[null,null,null,null,"Coincident"]
[null,null,"WEATHER CORRECTED MD 10% POE","MVA","Non-coincident"]
[null,null,null,null,"Coincident"]
[null,null,"WEATHER CORRECTED MD 50% POE","MW","Non-coincident"]
[null,null,null,null,"Coincident"]
[null,null,"WEATHER CORRECTED MD 50% POE","MVA","Non-coincident"]
[null,null,null,null,"Coincident"]
[null,"NSP to enter name","CONNECTION POINT RATING","MVA","Non-coincident"]
[null,null,null,null,"Coincident"]
[null,null,"WINTER/SUMMER PEAKING",null,"Non-coincident"]
[null,null,null,null,"Coincident"]
[null,null,"ADJUSTMENTS - EMBEDDED GENERATION","MW","Non-coincident"]
[null,null,null,null,"Coincident"]
[null,null,"WEATHER CORRECTED MD 10% POE","MW","Non-coincident"]
[null,null,null,null,"Coincident"]
[null,null,"WEATHER CORRECTED MD 10% POE","MVA","Non-coincident"]
[null,null,null,null,"Coincident"]
[null,null,"WEATHER CORRECTED MD 50% POE","MW","Non-coincident"]
[null,null,null,null,"Coincident"]
[null,null,"WEATHER CORRECTED MD 50% POE","MVA","Non-coincident"]
[null,null,null,null,"Coincident"]
[null,"NSP to enter name","CONNECTION POINT RATING","MVA","Non-coincident"]
[null,null,null,null,"Coincident"]
[null,null,"WINTER/SUMMER PEAKING",null,"Non-coincident"]
[null,null,null,null,"Coincident"]
[null,null,"ADJUSTMENTS - EMBEDDED GENERATION","MW","Non-coincident"]
[null,null,null,null,"Coincident"]
[null,null,"WEATHER CORRECTED MD 10% POE","MW","Non-coincident"]
[null,null,null,null,"Coincident"]
[null,null,"WEATHER CORRECTED MD 10% POE","MVA","Non-coincident"]
[null,null,null,null,"Coincident"]
[null,null,"WEATHER CORRECTED MD 50% POE","MW","Non-coincident"]
[null,null,null,null,"Coincident"]
[null,null,"WEATHER CORRECTED MD 50% POE","MVA","Non-coincident"]
[null,null,null,null,"Coincident"]
[null,"NSP to enter name","CONNECTION POINT RATING","MVA","Non-coincident"]
[null,null,null,null,"Coincident"]
[null,null,"WINTER/SUMMER PEAKING",null,"Non-coincident"]
[null,null,null,null,"Coincident"]
[null,null,"ADJUSTMENTS - EMBEDDED GENERATION","MW","Non-coincident"]
[null,null,null,null,"Coincident"]
[null,null,"WEATHER CORRECTED MD 10% POE","MW","Non-coincident"]
[null,null,null,null,"Coincident"]
[null,null,"WEATHER CORRECTED MD 10% POE","MVA","Non-coincident"]
[null,null,null,null,"Coincident"]
[null,null,"WEATHER CORRECTED MD 50% POE","MW","Non-coincident"]
[null,null,null,null,"Coincident"]
[null,null,"WEATHER CORRECTED MD 50% POE","MVA","Non-coincident"]
[null,null,null,null,"Coincident"]
[null,"NSP to enter name","CONNECTION POINT RATING","MVA","Non-coincident"]
[null,null,null,null,"Coincident"]
[null,null,"WINTER/SUMMER PEAKING",null,"Non-coincident"]
[null,null,null,null,"Coincident"]
[null,null,"ADJUSTMENTS - EMBEDDED GENERATION","MW","Non-coincident"]
[null,null,null,null,"Coincident"]
[null,null,"WEATHER CORRECTED MD 10% POE","MW","Non-coincident"]
[null,null,null,null,"Coincident"]
[null,null,"WEATHER CORRECTED MD 10% POE","MVA","Non-coincident"]
[null,null,null,null,"Coincident"]
[null,null,"WEATHER CORRECTED MD 50% POE","MW","Non-coincident"]
[null,null,null,null,"Coincident"]
[null,null,"WEATHER CORRECTED MD 50% POE","MVA","Non-coincident"]
[null,null,null,null,"Coincident"]
[null,"NSP to enter name","CONNECTION POINT RATING","MVA","Non-coincident"]
[null,null,null,null,"Coincident"]
[null,null,"WINTER/SUMMER PEAKING",null,"Non-coincident"]
[null,null,null,null,"Coincident"]
[null,null,"ADJUSTMENTS - EMBEDDED GENERATION","MW","Non-coincident"]
[null,null,null,null,"Coincident"]
[null,null,"WEATHER CORRECTED MD 10% POE","MW","Non-coincident"]
[null,null,null,null,"Coincident"]
[null,null,"WEATHER CORRECTED MD 10% POE","MVA","Non-coincident"]
[null,null,null,null,"Coincident"]
[null,null,"WEATHER CORRECTED MD 50% POE","MW","Non-coincident"]
[null,null,null,null,"Coincident"]
[null,null,"WEATHER CORRECTED MD 50% POE","MVA","Non-coincident"]
[null,null,null,null,"Coincident"]
[null,"NSP to enter name","CONNECTION POINT RATING","MVA","Non-coincident"]
[null,null,null,null,"Coincident"]
[null,null,"WINTER/SUMMER PEAKING",null,"Non-coincident"]
[null,null,null,null,"Coincident"]
[null,null,"ADJUSTMENTS - EMBEDDED GENERATION","MW","Non-coincident"]
[null,null,null,null,"Coincident"]
[null,null,"WEATHER CORRECTED MD 10% POE","MW","Non-coincident"]
[null,null,null,null,"Coincident"]
[null,null,"WEATHER CORRECTED MD 10% POE","MVA","Non-coincident"]
[null,null,null,null,"Coincident"]
[null,null,"WEATHER CORRECTED MD 50% POE","MW","Non-coincident"]
[null,null,null,null,"Coincident"]
[null,null,"WEATHER CORRECTED MD 50% POE","MVA","Non-coincident"]
[null,null,null,null,"Coincident"]
[null,"NSP to enter name","CONNECTION POINT RATING","MVA","Non-coincident"]
[null,null,null,null,"Coincident"]
[null,null,"WINTER/SUMMER PEAKING",null,"Non-coincident"]
[null,null,null,null,"Coincident"]
[null,null,"ADJUSTMENTS - EMBEDDED GENERATION","MW","Non-coincident"]
[null,null,null,null,"Coincident"]
[null,null,"WEATHER CORRECTED MD 10% POE","MW","Non-coincident"]
[null,null,null,null,"Coincident"]
[null,null,"WEATHER CORRECTED MD 10% POE","MVA","Non-coincident"]
[null,null,null,null,"Coincident"]
[null,null,"WEATHER CORRECTED MD 50% POE","MW","Non-coincident"]
[null,null,null,null,"Coincident"]
[null,null,"WEATHER CORRECTED MD 50% POE","MVA","Non-coincident"]
[null,null,null,null,"Coincident"]
[null,"NSP to enter name","CONNECTION POINT RATING","MVA","Non-coincident"]
[null,null,null,null,"Coincident"]
[null,null,"WINTER/SUMMER PEAKING",null,"Non-coincident"]
[null,null,null,null,"Coincident"]
[null,null,"ADJUSTMENTS - EMBEDDED GENERATION","MW","Non-coincident"]
[null,null,null,null,"Coincident"]
[null,null,"WEATHER CORRECTED MD 10% POE","MW","Non-coincident"]
[null,null,null,null,"Coincident"]
[null,null,"WEATHER CORRECTED MD 10% POE","MVA","Non-coincident"]
[null,null,null,null,"Coincident"]
[null,null,"WEATHER CORRECTED MD 50% POE","MW","Non-coincident"]
[null,null,null,null,"Coincident"]
[null,null,"WEATHER CORRECTED MD 50% POE","MVA","Non-coincident"]
[null,null,null,null,"Coincident"]
[null,"NSP to enter name","CONNECTION POINT RATING","MVA","Non-coincident"]
[null,null,null,null,"Coincident"]
[null,null,"WINTER/SUMMER PEAKING",null,"Non-coincident"]
[null,null,null,null,"Coincident"]
[null,null,"ADJUSTMENTS - EMBEDDED GENERATION","MW","Non-coincident"]
[null,null,null,null,"Coincident"]
[null,null,"WEATHER CORRECTED MD 10% POE","MW","Non-coincident"]
[null,null,null,null,"Coincident"]
[null,null,"WEATHER CORRECTED MD 10% POE","MVA","Non-coincident"]
[null,null,null,null,"Coincident"]
[null,null,"WEATHER CORRECTED MD 50% POE","MW","Non-coincident"]
[null,null,null,null,"Coincident"]
[null,null,"WEATHER CORRECTED MD 50% POE","MVA","Non-coincident"]
[null,null,null,null,"Coincident"]
[null,"NSP to enter name","CONNECTION POINT RATING","MVA","Non-coincident"]
[null,null,null,null,"Coincident"]
[null,null,"WINTER/SUMMER PEAKING",null,"Non-coincident"]
[null,null,null,null,"Coincident"]
[null,null,"ADJUSTMENTS - EMBEDDED GENERATION","MW","Non-coincident"]
[null,null,null,null,"Coincident"]
[null,null,"WEATHER CORRECTED MD 10% POE","MW","Non-coincident"]
[null,null,null,null,"Coincident"]
[null,null,"WEATHER CORRECTED MD 10% POE","MVA","Non-coincident"]
[null,null,null,null,"Coincident"]
[null,null,"WEATHER CORRECTED MD 50% POE","MW","Non-coincident"]
[null,null,null,null,"Coincident"]
[null,null,"WEATHER CORRECTED MD 50% POE","MVA","Non-coincident"]
[null,null,null,null,"Coincident"]
[null,"NSP to enter name","CONNECTION POINT RATING","MVA","Non-coincident"]
[null,null,null,null,"Coincident"]
[null,null,"WINTER/SUMMER PEAKING",null,"Non-coincident"]
[null,null,null,null,"Coincident"]
[null,null,"ADJUSTMENTS - EMBEDDED GENERATION","MW","Non-coincident"]
[null,null,null,null,"Coincident"]
[null,null,"WEATHER CORRECTED MD 10% POE","MW","Non-coincident"]
[null,null,null,null,"Coincident"]
[null,null,"WEATHER CORRECTED MD 10% POE","MVA","Non-coincident"]
[null,null,null,null,"Coincident"]
[null,null,"WEATHER CORRECTED MD 50% POE","MW","Non-coincident"]
[null,null,null,null,"Coincident"]
[null,null,"WEATHER CORRECTED MD 50% POE","MVA","Non-coincident"]
[null,null,null,null,"Coincident"]
[null,"NSP to enter name","CONNECTION POINT RATING","MVA","Non-coincident"]
[null,null,null,null,"Coincident"]
[null,null,"WINTER/SUMMER PEAKING",null,"Non-coincident"]
[null,null,null,null,"Coincident"]
[null,null,"ADJUSTMENTS - EMBEDDED GENERATION","MW","Non-coincident"]
[null,null,null,null,"Coincident"]
[null,null,"WEATHER CORRECTED MD 10% POE","MW","Non-coincident"]
[null,null,null,null,"Coincident"]
[null,null,"WEATHER CORRECTED MD 10% POE","MVA","Non-coincident"]
[null,null,null,null,"Coincident"]
[null,null,"WEATHER CORRECTED MD 50% POE","MW","Non-coincident"]
[null,null,null,null,"Coincident"]
[null,null,"WEATHER CORRECTED MD 50% POE","MVA","Non-coincident"]
[null,null,null,null,"Coincident"]
[null,"NSP to enter name","CONNECTION POINT RATING","MVA","Non-coincident"]
[null,null,null,null,"Coincident"]
[null,null,"WINTER/SUMMER PEAKING",null,"Non-coincident"]
[null,null,null,null,"Coincident"]
[null,null,"ADJUSTMENTS - EMBEDDED GENERATION","MW","Non-coincident"]
[null,null,null,null,"Coincident"]
[null,null,"WEATHER CORRECTED MD 10% POE","MW","Non-coincident"]
[null,null,null,null,"Coincident"]
[null,null,"WEATHER CORRECTED MD 10% POE","MVA","Non-coincident"]
[null,null,null,null,"Coincident"]
[null,null,"WEATHER CORRECTED MD 50% POE","MW","Non-coincident"]
[null,null,null,null,"Coincident"]
[null,null,"WEATHER CORRECTED MD 50% POE","MVA","Non-coincident"]
[null,null,null,null,"Coincident"]
[null,"NSP to enter name","CONNECTION POINT RATING","MVA","Non-coincident"]
[null,null,null,null,"Coincident"]
[null,null,"WINTER/SUMMER PEAKING",null,"Non-coincident"]
[null,null,null,null,"Coincident"]
[null,null,"ADJUSTMENTS - EMBEDDED GENERATION","MW","Non-coincident"]
[null,null,null,null,"Coincident"]
[null,null,"WEATHER CORRECTED MD 10% POE","MW","Non-coincident"]
[null,null,null,null,"Coincident"]
[null,null,"WEATHER CORRECTED MD 10% POE","MVA","Non-coincident"]
[null,null,null,null,"Coincident"]
[null,null,"WEATHER CORRECTED MD 50% POE","MW","Non-coincident"]
[null,null,null,null,"Coincident"]
[null,null,"WEATHER CORRECTED MD 50% POE","MVA","Non-coincident"]
[null,null,null,null,"Coincident"]
[null,"NSP to enter name","CONNECTION POINT RATING","MVA","Non-coincident"]
[null,null,null,null,"Coincident"]
[null,null,"WINTER/SUMMER PEAKING",null,"Non-coincident"]
[null,null,null,null,"Coincident"]
[null,null,"ADJUSTMENTS - EMBEDDED GENERATION","MW","Non-coincident"]
[null,null,null,null,"Coincident"]
[null,null,"WEATHER CORRECTED MD 10% POE","MW","Non-coincident"]
[null,null,null,null,"Coincident"]
[null,null,"WEATHER CORRECTED MD 10% POE","MVA","Non-coincident"]
[null,null,null,null,"Coincident"]
[null,null,"WEATHER CORRECTED MD 50% POE","MW","Non-coincident"]
[null,null,null,null,"Coincident"]
[null,null,"WEATHER CORRECTED MD 50% POE","MVA","Non-coincident"]
[null,null,null,null,"Coincident"]
[null,"NSP to enter name","CONNECTION POINT RATING","MVA","Non-coincident"]
[null,null,null,null,"Coincident"]
[null,null,"WINTER/SUMMER PEAKING",null,"Non-coincident"]
[null,null,null,null,"Coincident"]
[null,null,"ADJUSTMENTS - EMBEDDED GENERATION","MW","Non-coincident"]
[null,null,null,null,"Coincident"]
[null,null,"WEATHER CORRECTED MD 10% POE","MW","Non-coincident"]
[null,null,null,null,"Coincident"]
[null,null,"WEATHER CORRECTED MD 10% POE","MVA","Non-coincident"]
[null,null,null,null,"Coincident"]
[null,null,"WEATHER CORRECTED MD 50% POE","MW","Non-coincident"]
[null,null,null,null,"Coincident"]
[null,null,"WEATHER CORRECTED MD 50% POE","MVA","Non-coincident"]
[null,null,null,null,"Coincident"]
[null,"NSP to enter name","CONNECTION POINT RATING","MVA","Non-coincident"]
[null,null,null,null,"Coincident"]
[null,null,"WINTER/SUMMER PEAKING",null,"Non-coincident"]
[null,null,null,null,"Coincident"]
[null,null,"ADJUSTMENTS - EMBEDDED GENERATION","MW","Non-coincident"]
[null,null,null,null,"Coincident"]
[null,null,"WEATHER CORRECTED MD 10% POE","MW","Non-coincident"]
[null,null,null,null,"Coincident"]
[null,null,"WEATHER CORRECTED MD 10% POE","MVA","Non-coincident"]
[null,null,null,null,"Coincident"]
[null,null,"WEATHER CORRECTED MD 50% POE","MW","Non-coincident"]
[null,null,null,null,"Coincident"]
[null,null,"WEATHER CORRECTED MD 50% POE","MVA","Non-coincident"]
[null,null,null,null,"Coincident"]
[null,"NSP to enter name","CONNECTION POINT RATING","MVA","Non-coincident"]
[null,null,null,null,"Coincident"]
[null,null,"WINTER/SUMMER PEAKING",null,"Non-coincident"]
[null,null,null,null,"Coincident"]
[null,null,"ADJUSTMENTS - EMBEDDED GENERATION","MW","Non-coincident"]
[null,null,null,null,"Coincident"]
[null,null,"WEATHER CORRECTED MD 10% POE","MW","Non-coincident"]
[null,null,null,null,"Coincident"]
[null,null,"WEATHER CORRECTED MD 10% POE","MVA","Non-coincident"]
[null,null,null,null,"Coincident"]
[null,null,"WEATHER CORRECTED MD 50% POE","MW","Non-coincident"]
[null,null,null,null,"Coincident"]
[null,null,"WEATHER CORRECTED MD 50% POE","MVA","Non-coincident"]
[null,null,null,null,"Coincident"]
[null,"NSP to enter name","CONNECTION POINT RATING","MVA","Non-coincident"]
[null,null,null,null,"Coincident"]
[null,null,"WINTER/SUMMER PEAKING",null,"Non-coincident"]
[null,null,null,null,"Coincident"]
[null,null,"ADJUSTMENTS - EMBEDDED GENERATION","MW","Non-coincident"]
[null,null,null,null,"Coincident"]
[null,null,"WEATHER CORRECTED MD 10% POE","MW","Non-coincident"]
[null,null,null,null,"Coincident"]
[null,null,"WEATHER CORRECTED MD 10% POE","MVA","Non-coincident"]
[null,null,null,null,"Coincident"]
[null,null,"WEATHER CORRECTED MD 50% POE","MW","Non-coincident"]
[null,null,null,null,"Coincident"]
[null,null,"WEATHER CORRECTED MD 50% POE","MVA","Non-coincident"]
[null,null,null,null,"Coincident"]
[null,"NSP to enter name","CONNECTION POINT RATING","MVA","Non-coincident"]
[null,null,null,null,"Coincident"]
[null,null,"WINTER/SUMMER PEAKING",null,"Non-coincident"]
[null,null,null,null,"Coincident"]
[null,null,"ADJUSTMENTS - EMBEDDED GENERATION","MW","Non-coincident"]
[null,null,null,null,"Coincident"]
[null,null,"WEATHER CORRECTED MD 10% POE","MW","Non-coincident"]
[null,null,null,null,"Coincident"]
[null,null,"WEATHER CORRECTED MD 10% POE","MVA","Non-coincident"]
[null,null,null,null,"Coincident"]
[null,null,"WEATHER CORRECTED MD 50% POE","MW","Non-coincident"]
[null,null,null,null,"Coincident"]
[null,null,"WEATHER CORRECTED MD 50% POE","MVA","Non-coincident"]
[null,null,null,null,"Coincident"]
[null,"NSP to enter name","CONNECTION POINT RATING","MVA","Non-coincident"]
[null,null,null,null,"Coincident"]
[null,null,"WINTER/SUMMER PEAKING",null,"Non-coincident"]
[null,null,null,null,"Coincident"]
[null,null,"ADJUSTMENTS - EMBEDDED GENERATION","MW","Non-coincident"]
[null,null,null,null,"Coincident"]
[null,null,"WEATHER CORRECTED MD 10% POE","MW","Non-coincident"]
[null,null,null,null,"Coincident"]
[null,null,"WEATHER CORRECTED MD 10% POE","MVA","Non-coincident"]
[null,null,null,null,"Coincident"]
[null,null,"WEATHER CORRECTED MD 50% POE","MW","Non-coincident"]
[null,null,null,null,"Coincident"]
[null,null,"WEATHER CORRECTED MD 50% POE","MVA","Non-coincident"]
[null,null,null,null,"Coincident"]
[null,"NSP to enter name","CONNECTION POINT RATING","MVA","Non-coincident"]
[null,null,null,null,"Coincident"]
[null,null,"WINTER/SUMMER PEAKING",null,"Non-coincident"]
[null,null,null,null,"Coincident"]
[null,null,"ADJUSTMENTS - EMBEDDED GENERATION","MW","Non-coincident"]
[null,null,null,null,"Coincident"]
[null,null,"WEATHER CORRECTED MD 10% POE","MW","Non-coincident"]
[null,null,null,null,"Coincident"]
[null,null,"WEATHER CORRECTED MD 10% POE","MVA","Non-coincident"]
[null,null,null,null,"Coincident"]
[null,null,"WEATHER CORRECTED MD 50% POE","MW","Non-coincident"]
[null,null,null,null,"Coincident"]
[null,null,"WEATHER CORRECTED MD 50% POE","MVA","Non-coincident"]
[null,null,null,null,"Coincident"]
[null,"NSP to enter name","CONNECTION POINT RATING","MVA","Non-coincident"]
[null,null,null,null,"Coincident"]
[null,null,"WINTER/SUMMER PEAKING",null,"Non-coincident"]
[null,null,null,null,"Coincident"]
[null,null,"ADJUSTMENTS - EMBEDDED GENERATION","MW","Non-coincident"]
[null,null,null,null,"Coincident"]
[null,null,"WEATHER CORRECTED MD 10% POE","MW","Non-coincident"]
[null,null,null,null,"Coincident"]
[null,null,"WEATHER CORRECTED MD 10% POE","MVA","Non-coincident"]
[null,null,null,null,"Coincident"]
[null,null,"WEATHER CORRECTED MD 50% POE","MW","Non-coincident"]
[null,null,null,null,"Coincident"]
[null,null,"WEATHER CORRECTED MD 50% POE","MVA","Non-coincident"]
[null,null,null,null,"Coincident"]
[null,"NSP to enter name","CONNECTION POINT RATING","MVA","Non-coincident"]
[null,null,null,null,"Coincident"]
[null,null,"WINTER/SUMMER PEAKING",null,"Non-coincident"]
[null,null,null,null,"Coincident"]
[null,null,"ADJUSTMENTS - EMBEDDED GENERATION","MW","Non-coincident"]
[null,null,null,null,"Coincident"]
[null,null,"WEATHER CORRECTED MD 10% POE","MW","Non-coincident"]
[null,null,null,null,"Coincident"]
[null,null,"WEATHER CORRECTED MD 10% POE","MVA","Non-coincident"]
[null,null,null,null,"Coincident"]
[null,null,"WEATHER CORRECTED MD 50% POE","MW","Non-coincident"]
[null,null,null,null,"Coincident"]
[null,null,"WEATHER CORRECTED MD 50% POE","MVA","Non-coincident"]
[null,null,null,null,"Coincident"]
[null,"NSP to enter name","CONNECTION POINT RATING","MVA","Non-coincident"]
[null,null,null,null,"Coincident"]
[null,null,"WINTER/SUMMER PEAKING",null,"Non-coincident"]
[null,null,null,null,"Coincident"]
[null,null,"ADJUSTMENTS - EMBEDDED GENERATION","MW","Non-coincident"]
[null,null,null,null,"Coincident"]
[null,null,"WEATHER CORRECTED MD 10% POE","MW","Non-coincident"]
[null,null,null,null,"Coincident"]
[null,null,"WEATHER CORRECTED MD 10% POE","MVA","Non-coincident"]
[null,null,null,null,"Coincident"]
[null,null,"WEATHER CORRECTED MD 50% POE","MW","Non-coincident"]
[null,null,null,null,"Coincident"]
[null,null,"WEATHER CORRECTED MD 50% POE","MVA","Non-coincident"]
[null,null,null,null,"Coincident"]
[null,"NSP to enter name","CONNECTION POINT RATING","MVA","Non-coincident"]
[null,null,null,null,"Coincident"]
[null,null,"WINTER/SUMMER PEAKING",null,"Non-coincident"]
[null,null,null,null,"Coincident"]
[null,null,"ADJUSTMENTS - EMBEDDED GENERATION","MW","Non-coincident"]
[null,null,null,null,"Coincident"]
[null,null,"WEATHER CORRECTED MD 10% POE","MW","Non-coincident"]
[null,null,null,null,"Coincident"]
[null,null,"WEATHER CORRECTED MD 10% POE","MVA","Non-coincident"]
[null,null,null,null,"Coincident"]
[null,null,"WEATHER CORRECTED MD 50% POE","MW","Non-coincident"]
[null,null,null,null,"Coincident"]
[null,null,"WEATHER CORRECTED MD 50% POE","MVA","Non-coincident"]
[null,null,null,null,"Coincident"]
[null,"NSP to enter name","CONNECTION POINT RATING","MVA","Non-coincident"]
[null,null,null,null,"Coincident"]
[null,null,"WINTER/SUMMER PEAKING",null,"Non-coincident"]
[null,null,null,null,"Coincident"]
[null,null,"ADJUSTMENTS - EMBEDDED GENERATION","MW","Non-coincident"]
[null,null,null,null,"Coincident"]
[null,null,"WEATHER CORRECTED MD 10% POE","MW","Non-coincident"]
[null,null,null,null,"Coincident"]
[null,null,"WEATHER CORRECTED MD 10% POE","MVA","Non-coincident"]
[null,null,null,null,"Coincident"]
[null,null,"WEATHER CORRECTED MD 50% POE","MW","Non-coincident"]
[null,null,null,null,"Coincident"]
[null,null,"WEATHER CORRECTED MD 50% POE","MVA","Non-coincident"]
[null,null,null,null,"Coincident"]
[null,"NSP to enter name","CONNECTION POINT RATING","MVA","Non-coincident"]
[null,null,null,null,"Coincident"]
[null,null,"WINTER/SUMMER PEAKING",null,"Non-coincident"]
[null,null,null,null,"Coincident"]
[null,null,"ADJUSTMENTS - EMBEDDED GENERATION","MW","Non-coincident"]
[null,null,null,null,"Coincident"]
[null,null,"WEATHER CORRECTED MD 10% POE","MW","Non-coincident"]
[null,null,null,null,"Coincident"]
[null,null,"WEATHER CORRECTED MD 10% POE","MVA","Non-coincident"]
[null,null,null,null,"Coincident"]
[null,null,"WEATHER CORRECTED MD 50% POE","MW","Non-coincident"]
[null,null,null,null,"Coincident"]
[null,null,"WEATHER CORRECTED MD 50% POE","MVA","Non-coincident"]
[null,null,null,null,"Coincident"]
[null,"NSP to enter name","CONNECTION POINT RATING","MVA","Non-coincident"]
[null,null,null,null,"Coincident"]
[null,null,"WINTER/SUMMER PEAKING",null,"Non-coincident"]
[null,null,null,null,"Coincident"]
[null,null,"ADJUSTMENTS - EMBEDDED GENERATION","MW","Non-coincident"]
[null,null,null,null,"Coincident"]
[null,null,"WEATHER CORRECTED MD 10% POE","MW","Non-coincident"]
[null,null,null,null,"Coincident"]
[null,null,"WEATHER CORRECTED MD 10% POE","MVA","Non-coincident"]
[null,null,null,null,"Coincident"]
[null,null,"WEATHER CORRECTED MD 50% POE","MW","Non-coincident"]
[null,null,null,null,"Coincident"]
[null,null,"WEATHER CORRECTED MD 50% POE","MVA","Non-coincident"]
[null,null,null,null,"Coincident"]
[null,"NSP to enter name","CONNECTION POINT RATING","MVA","Non-coincident"]
[null,null,null,null,"Coincident"]
[null,null,"WINTER/SUMMER PEAKING",null,"Non-coincident"]
[null,null,null,null,"Coincident"]
[null,null,"ADJUSTMENTS - EMBEDDED GENERATION","MW","Non-coincident"]
[null,null,null,null,"Coincident"]
[null,null,"WEATHER CORRECTED MD 10% POE","MW","Non-coincident"]
[null,null,null,null,"Coincident"]
[null,null,"WEATHER CORRECTED MD 10% POE","MVA","Non-coincident"]
[null,null,null,null,"Coincident"]
[null,null,"WEATHER CORRECTED MD 50% POE","MW","Non-coincident"]
[null,null,null,null,"Coincident"]
[null,null,"WEATHER CORRECTED MD 50% POE","MVA","Non-coincident"]
[null,null,null,null,"Coincident"]
[null,"NSP to enter name","CONNECTION POINT RATING","MVA","Non-coincident"]
[null,null,null,null,"Coincident"]
[null,null,"WINTER/SUMMER PEAKING",null,"Non-coincident"]
[null,null,null,null,"Coincident"]
[null,null,"ADJUSTMENTS - EMBEDDED GENERATION","MW","Non-coincident"]
[null,null,null,null,"Coincident"]
[null,null,"WEATHER CORRECTED MD 10% POE","MW","Non-coincident"]
[null,null,null,null,"Coincident"]
[null,null,"WEATHER CORRECTED MD 10% POE","MVA","Non-coincident"]
[null,null,null,null,"Coincident"]
[null,null,"WEATHER CORRECTED MD 50% POE","MW","Non-coincident"]
[null,null,null,null,"Coincident"]
[null,null,"WEATHER CORRECTED MD 50% POE","MVA","Non-coincident"]
[null,null,null,null,"Coincident"]
[null,"NSP to enter name","CONNECTION POINT RATING","MVA","Non-coincident"]
[null,null,null,null,"Coincident"]
[null,null,"WINTER/SUMMER PEAKING",null,"Non-coincident"]
[null,null,null,null,"Coincident"]
[null,null,"ADJUSTMENTS - EMBEDDED GENERATION","MW","Non-coincident"]
[null,null,null,null,"Coincident"]
[null,null,"WEATHER CORRECTED MD 10% POE","MW","Non-coincident"]
[null,null,null,null,"Coincident"]
[null,null,"WEATHER CORRECTED MD 10% POE","MVA","Non-coincident"]
[null,null,null,null,"Coincident"]
[null,null,"WEATHER CORRECTED MD 50% POE","MW","Non-coincident"]
[null,null,null,null,"Coincident"]
[null,null,"WEATHER CORRECTED MD 50% POE","MVA","Non-coincident"]
[null,null,null,null,"Coincident"]
[null,"NSP to enter name","CONNECTION POINT RATING","MVA","Non-coincident"]
[null,null,null,null,"Coincident"]
[null,null,"WINTER/SUMMER PEAKING",null,"Non-coincident"]
[null,null,null,null,"Coincident"]
[null,null,"ADJUSTMENTS - EMBEDDED GENERATION","MW","Non-coincident"]
[null,null,null,null,"Coincident"]
[null,null,"WEATHER CORRECTED MD 10% POE","MW","Non-coincident"]
[null,null,null,null,"Coincident"]
[null,null,"WEATHER CORRECTED MD 10% POE","MVA","Non-coincident"]
[null,null,null,null,"Coincident"]
[null,null,"WEATHER CORRECTED MD 50% POE","MW","Non-coincident"]
[null,null,null,null,"Coincident"]
[null,null,"WEATHER CORRECTED MD 50% POE","MVA","Non-coincident"]
[null,null,null,null,"Coincident"]
[null,"NSP to enter name","CONNECTION POINT RATING","MVA","Non-coincident"]
[null,null,null,null,"Coincident"]
[null,null,"WINTER/SUMMER PEAKING",null,"Non-coincident"]
[null,null,null,null,"Coincident"]
[null,null,"ADJUSTMENTS - EMBEDDED GENERATION","MW","Non-coincident"]
[null,null,null,null,"Coincident"]
[null,null,"WEATHER CORRECTED MD 10% POE","MW","Non-coincident"]
[null,null,null,null,"Coincident"]
[null,null,"WEATHER CORRECTED MD 10% POE","MVA","Non-coincident"]
[null,null,null,null,"Coincident"]
[null,null,"WEATHER CORRECTED MD 50% POE","MW","Non-coincident"]
[null,null,null,null,"Coincident"]
[null,null,"WEATHER CORRECTED MD 50% POE","MVA","Non-coincident"]
[null,null,null,null,"Coincident"]
[null,"NSP to enter name","CONNECTION POINT RATING","MVA","Non-coincident"]
[null,null,null,null,"Coincident"]
[null,null,"WINTER/SUMMER PEAKING",null,"Non-coincident"]
[null,null,null,null,"Coincident"]
[null,null,"ADJUSTMENTS - EMBEDDED GENERATION","MW","Non-coincident"]
[null,null,null,null,"Coincident"]
[null,null,"WEATHER CORRECTED MD 10% POE","MW","Non-coincident"]
[null,null,null,null,"Coincident"]
[null,null,"WEATHER CORRECTED MD 10% POE","MVA","Non-coincident"]
[null,null,null,null,"Coincident"]
[null,null,"WEATHER CORRECTED MD 50% POE","MW","Non-coincident"]
[null,null,null,null,"Coincident"]
[null,null,"WEATHER CORRECTED MD 50% POE","MVA","Non-coincident"]
[null,null,null,null,"Coincident"]
[null,"NSP to enter name","CONNECTION POINT RATING","MVA","Non-coincident"]
[null,null,null,null,"Coincident"]
[null,null,"WINTER/SUMMER PEAKING",null,"Non-coincident"]
[null,null,null,null,"Coincident"]
[null,null,"ADJUSTMENTS - EMBEDDED GENERATION","MW","Non-coincident"]
[null,null,null,null,"Coincident"]
[null,null,"WEATHER CORRECTED MD 10% POE","MW","Non-coincident"]
[null,null,null,null,"Coincident"]
[null,null,"WEATHER CORRECTED MD 10% POE","MVA","Non-coincident"]
[null,null,null,null,"Coincident"]
[null,null,"WEATHER CORRECTED MD 50% POE","MW","Non-coincident"]
[null,null,null,null,"Coincident"]
[null,null,"WEATHER CORRECTED MD 50% POE","MVA","Non-coincident"]
[null,null,null,null,"Coincident"]
[null,"NSP to enter name","CONNECTION POINT RATING","MVA","Non-coincident"]
[null,null,null,null,"Coincident"]
[null,null,"WINTER/SUMMER PEAKING",null,"Non-coincident"]
[null,null,null,null,"Coincident"]
[null,null,"ADJUSTMENTS - EMBEDDED GENERATION","MW","Non-coincident"]
[null,null,null,null,"Coincident"]
[null,null,"WEATHER CORRECTED MD 10% POE","MW","Non-coincident"]
[null,null,null,null,"Coincident"]
[null,null,"WEATHER CORRECTED MD 10% POE","MVA","Non-coincident"]
[null,null,null,null,"Coincident"]
[null,null,"WEATHER CORRECTED MD 50% POE","MW","Non-coincident"]
[null,null,null,null,"Coincident"]
[null,null,"WEATHER CORRECTED MD 50% POE","MVA","Non-coincident"]
[null,null,null,null,"Coincident"]
[null,"NSP to enter name","CONNECTION POINT RATING","MVA","Non-coincident"]
[null,null,null,null,"Coincident"]
[null,null,"WINTER/SUMMER PEAKING",null,"Non-coincident"]
[null,null,null,null,"Coincident"]
[null,null,"ADJUSTMENTS - EMBEDDED GENERATION","MW","Non-coincident"]
[null,null,null,null,"Coincident"]
[null,null,"WEATHER CORRECTED MD 10% POE","MW","Non-coincident"]
[null,null,null,null,"Coincident"]
[null,null,"WEATHER CORRECTED MD 10% POE","MVA","Non-coincident"]
[null,null,null,null,"Coincident"]
[null,null,"WEATHER CORRECTED MD 50% POE","MW","Non-coincident"]
[null,null,null,null,"Coincident"]
[null,null,"WEATHER CORRECTED MD 50% POE","MVA","Non-coincident"]
[null,null,null,null,"Coincident"]
[null,"NSP to enter name","CONNECTION POINT RATING","MVA","Non-coincident"]
[null,null,null,null,"Coincident"]
[null,null,"WINTER/SUMMER PEAKING",null,"Non-coincident"]
[null,null,null,null,"Coincident"]
[null,null,"ADJUSTMENTS - EMBEDDED GENERATION","MW","Non-coincident"]
[null,null,null,null,"Coincident"]
[null,null,"WEATHER CORRECTED MD 10% POE","MW","Non-coincident"]
[null,null,null,null,"Coincident"]
[null,null,"WEATHER CORRECTED MD 10% POE","MVA","Non-coincident"]
[null,null,null,null,"Coincident"]
[null,null,"WEATHER CORRECTED MD 50% POE","MW","Non-coincident"]
[null,null,null,null,"Coincident"]
[null,null,"WEATHER CORRECTED MD 50% POE","MVA","Non-coincident"]
[null,null,null,null,"Coincident"]
[null,"NSP to enter name","CONNECTION POINT RATING","MVA","Non-coincident"]
[null,null,null,null,"Coincident"]
[null,null,"WINTER/SUMMER PEAKING",null,"Non-coincident"]
[null,null,null,null,"Coincident"]
[null,null,"ADJUSTMENTS - EMBEDDED GENERATION","MW","Non-coincident"]
[null,null,null,null,"Coincident"]
[null,null,"WEATHER CORRECTED MD 10% POE","MW","Non-coincident"]
[null,null,null,null,"Coincident"]
[null,null,"WEATHER CORRECTED MD 10% POE","MVA","Non-coincident"]
[null,null,null,null,"Coincident"]
[null,null,"WEATHER CORRECTED MD 50% POE","MW","Non-coincident"]
[null,null,null,null,"Coincident"]
[null,null,"WEATHER CORRECTED MD 50% POE","MVA","Non-coincident"]
[null,null,null,null,"Coincident"]
[null,"NSP to enter name","CONNECTION POINT RATING","MVA","Non-coincident"]
[null,null,null,null,"Coincident"]
[null,null,"WINTER/SUMMER PEAKING",null,"Non-coincident"]
[null,null,null,null,"Coincident"]
[null,null,"ADJUSTMENTS - EMBEDDED GENERATION","MW","Non-coincident"]
[null,null,null,null,"Coincident"]
[null,null,"WEATHER CORRECTED MD 10% POE","MW","Non-coincident"]
[null,null,null,null,"Coincident"]
[null,null,"WEATHER CORRECTED MD 10% POE","MVA","Non-coincident"]
[null,null,null,null,"Coincident"]
[null,null,"WEATHER CORRECTED MD 50% POE","MW","Non-coincident"]
[null,null,null,null,"Coincident"]
[null,null,"WEATHER CORRECTED MD 50% POE","MVA","Non-coincident"]
[null,null,null,null,"Coincident"]
[null,"NSP to enter name","CONNECTION POINT RATING","MVA","Non-coincident"]
[null,null,null,null,"Coincident"]
[null,null,"WINTER/SUMMER PEAKING",null,"Non-coincident"]
[null,null,null,null,"Coincident"]
[null,null,"ADJUSTMENTS - EMBEDDED GENERATION","MW","Non-coincident"]
[null,null,null,null,"Coincident"]
[null,null,"WEATHER CORRECTED MD 10% POE","MW","Non-coincident"]
[null,null,null,null,"Coincident"]
[null,null,"WEATHER CORRECTED MD 10% POE","MVA","Non-coincident"]
[null,null,null,null,"Coincident"]
[null,null,"WEATHER CORRECTED MD 50% POE","MW","Non-coincident"]
[null,null,null,null,"Coincident"]
[null,null,"WEATHER CORRECTED MD 50% POE","MVA","Non-coincident"]
[null,null,null,null,"Coincident"]
[null,"NSP to enter name","CONNECTION POINT RATING","MVA","Non-coincident"]
[null,null,null,null,"Coincident"]
[null,null,"WINTER/SUMMER PEAKING",null,"Non-coincident"]
[null,null,null,null,"Coincident"]
[null,null,"ADJUSTMENTS - EMBEDDED GENERATION","MW","Non-coincident"]
[null,null,null,null,"Coincident"]
[null,null,"WEATHER CORRECTED MD 10% POE","MW","Non-coincident"]
[null,null,null,null,"Coincident"]
[null,null,"WEATHER CORRECTED MD 10% POE","MVA","Non-coincident"]
[null,null,null,null,"Coincident"]
[null,null,"WEATHER CORRECTED MD 50% POE","MW","Non-coincident"]
[null,null,null,null,"Coincident"]
[null,null,"WEATHER CORRECTED MD 50% POE","MVA","Non-coincident"]
[null,null,null,null,"Coincident"]
[null,"NSP to enter name","CONNECTION POINT RATING","MVA","Non-coincident"]
[null,null,null,null,"Coincident"]
[null,null,"WINTER/SUMMER PEAKING",null,"Non-coincident"]
[null,null,null,null,"Coincident"]
[null,null,"ADJUSTMENTS - EMBEDDED GENERATION","MW","Non-coincident"]
[null,null,null,null,"Coincident"]
[null,null,"WEATHER CORRECTED MD 10% POE","MW","Non-coincident"]
[null,null,null,null,"Coincident"]
[null,null,"WEATHER CORRECTED MD 10% POE","MVA","Non-coincident"]
[null,null,null,null,"Coincident"]
[null,null,"WEATHER CORRECTED MD 50% POE","MW","Non-coincident"]
[null,null,null,null,"Coincident"]
[null,null,"WEATHER CORRECTED MD 50% POE","MVA","Non-coincident"]
[null,null,null,null,"Coincident"]
[null,"NSP to enter name","CONNECTION POINT RATING","MVA","Non-coincident"]
[null,null,null,null,"Coincident"]
[null,null,"WINTER/SUMMER PEAKING",null,"Non-coincident"]
[null,null,null,null,"Coincident"]
[null,null,"ADJUSTMENTS - EMBEDDED GENERATION","MW","Non-coincident"]
[null,null,null,null,"Coincident"]
[null,null,"WEATHER CORRECTED MD 10% POE","MW","Non-coincident"]
[null,null,null,null,"Coincident"]
[null,null,"WEATHER CORRECTED MD 10% POE","MVA","Non-coincident"]
[null,null,null,null,"Coincident"]
[null,null,"WEATHER CORRECTED MD 50% POE","MW","Non-coincident"]
[null,null,null,null,"Coincident"]
[null,null,"WEATHER CORRECTED MD 50% POE","MVA","Non-coincident"]
[null,null,null,null,"Coincident"]
[null,"NSP to enter name","CONNECTION POINT RATING","MVA","Non-coincident"]
[null,null,null,null,"Coincident"]
[null,null,"WINTER/SUMMER PEAKING",null,"Non-coincident"]
[null,null,null,null,"Coincident"]
[null,null,"ADJUSTMENTS - EMBEDDED GENERATION","MW","Non-coincident"]
[null,null,null,null,"Coincident"]
[null,null,"WEATHER CORRECTED MD 10% POE","MW","Non-coincident"]
[null,null,null,null,"Coincident"]
[null,null,"WEATHER CORRECTED MD 10% POE","MVA","Non-coincident"]
[null,null,null,null,"Coincident"]
[null,null,"WEATHER CORRECTED MD 50% POE","MW","Non-coincident"]
[null,null,null,null,"Coincident"]
[null,null,"WEATHER CORRECTED MD 50% POE","MVA","Non-coincident"]
[null,null,null,null,"Coincident"]
[null,"NSP to enter name","CONNECTION POINT RATING","MVA","Non-coincident"]
[null,null,null,null,"Coincident"]
[null,null,"WINTER/SUMMER PEAKING",null,"Non-coincident"]
[null,null,null,null,"Coincident"]
[null,null,"ADJUSTMENTS - EMBEDDED GENERATION","MW","Non-coincident"]
[null,null,null,null,"Coincident"]
[null,null,"WEATHER CORRECTED MD 10% POE","MW","Non-coincident"]
[null,null,null,null,"Coincident"]
[null,null,"WEATHER CORRECTED MD 10% POE","MVA","Non-coincident"]
[null,null,null,null,"Coincident"]
[null,null,"WEATHER CORRECTED MD 50% POE","MW","Non-coincident"]
[null,null,null,null,"Coincident"]
[null,null,"WEATHER CORRECTED MD 50% POE","MVA","Non-coincident"]
[null,null,null,null,"Coincident"]
[null,"NSP to enter name","CONNECTION POINT RATING","MVA","Non-coincident"]
[null,null,null,null,"Coincident"]
[null,null,"WINTER/SUMMER PEAKING",null,"Non-coincident"]
[null,null,null,null,"Coincident"]
[null,null,"ADJUSTMENTS - EMBEDDED GENERATION","MW","Non-coincident"]
[null,null,null,null,"Coincident"]
[null,null,"WEATHER CORRECTED MD 10% POE","MW","Non-coincident"]
[null,null,null,null,"Coincident"]
[null,null,"WEATHER CORRECTED MD 10% POE","MVA","Non-coincident"]
[null,null,null,null,"Coincident"]
[null,null,"WEATHER CORRECTED MD 50% POE","MW","Non-coincident"]
[null,null,null,null,"Coincident"]
[null,null,"WEATHER CORRECTED MD 50% POE","MVA","Non-coincident"]
[null,null,null,null,"Coincident"]
[null,"NSP to enter name","CONNECTION POINT RATING","MVA","Non-coincident"]
[null,null,null,null,"Coincident"]
[null,null,"WINTER/SUMMER PEAKING",null,"Non-coincident"]
[null,null,null,null,"Coincident"]
[null,null,"ADJUSTMENTS - EMBEDDED GENERATION","MW","Non-coincident"]
[null,null,null,null,"Coincident"]
[null,null,"WEATHER CORRECTED MD 10% POE","MW","Non-coincident"]
[null,null,null,null,"Coincident"]
[null,null,"WEATHER CORRECTED MD 10% POE","MVA","Non-coincident"]
[null,null,null,null,"Coincident"]
[null,null,"WEATHER CORRECTED MD 50% POE","MW","Non-coincident"]
[null,null,null,null,"Coincident"]
[null,null,"WEATHER CORRECTED MD 50% POE","MVA","Non-coincident"]
[null,null,null,null,"Coincident"]
[null,"NSP to enter name","CONNECTION POINT RATING","MVA","Non-coincident"]
[null,null,null,null,"Coincident"]
[null,null,"WINTER/SUMMER PEAKING",null,"Non-coincident"]
[null,null,null,null,"Coincident"]
[null,null,"ADJUSTMENTS - EMBEDDED GENERATION","MW","Non-coincident"]
[null,null,null,null,"Coincident"]
[null,null,"WEATHER CORRECTED MD 10% POE","MW","Non-coincident"]
[null,null,null,null,"Coincident"]
[null,null,"WEATHER CORRECTED MD 10% POE","MVA","Non-coincident"]
[null,null,null,null,"Coincident"]
[null,null,"WEATHER CORRECTED MD 50% POE","MW","Non-coincident"]
[null,null,null,null,"Coincident"]
[null,null,"WEATHER CORRECTED MD 50% POE","MVA","Non-coincident"]
[null,null,null,null,"Coincident"]
[null,"NSP to enter name","CONNECTION POINT RATING","MVA","Non-coincident"]
[null,null,null,null,"Coincident"]
[null,null,"WINTER/SUMMER PEAKING",null,"Non-coincident"]
[null,null,null,null,"Coincident"]
[null,null,"ADJUSTMENTS - EMBEDDED GENERATION","MW","Non-coincident"]
[null,null,null,null,"Coincident"]
[null,null,"WEATHER CORRECTED MD 10% POE","MW","Non-coincident"]
[null,null,null,null,"Coincident"]
[null,null,"WEATHER CORRECTED MD 10% POE","MVA","Non-coincident"]
[null,null,null,null,"Coincident"]
[null,null,"WEATHER CORRECTED MD 50% POE","MW","Non-coincident"]
[null,null,null,null,"Coincident"]
[null,null,"WEATHER CORRECTED MD 50% POE","MVA","Non-coincident"]
[null,null,null,null,"Coincident"]
[null,"NSP to enter name","CONNECTION POINT RATING","MVA","Non-coincident"]
[null,null,null,null,"Coincident"]
[null,null,"WINTER/SUMMER PEAKING",null,"Non-coincident"]
[null,null,null,null,"Coincident"]
[null,null,"ADJUSTMENTS - EMBEDDED GENERATION","MW","Non-coincident"]
[null,null,null,null,"Coincident"]
[null,null,"WEATHER CORRECTED MD 10% POE","MW","Non-coincident"]
[null,null,null,null,"Coincident"]
[null,null,"WEATHER CORRECTED MD 10% POE","MVA","Non-coincident"]
[null,null,null,null,"Coincident"]
[null,null,"WEATHER CORRECTED MD 50% POE","MW","Non-coincident"]
[null,null,null,null,"Coincident"]
[null,null,"WEATHER CORRECTED MD 50% POE","MVA","Non-coincident"]
[null,null,null,null,"Coincident"]
[null,"NSP to enter name","CONNECTION POINT RATING","MVA","Non-coincident"]
[null,null,null,null,"Coincident"]
[null,null,"WINTER/SUMMER PEAKING",null,"Non-coincident"]
[null,null,null,null,"Coincident"]
[null,null,"ADJUSTMENTS - EMBEDDED GENERATION","MW","Non-coincident"]
[null,null,null,null,"Coincident"]
[null,null,"WEATHER CORRECTED MD 10% POE","MW","Non-coincident"]
[null,null,null,null,"Coincident"]
[null,null,"WEATHER CORRECTED MD 10% POE","MVA","Non-coincident"]
[null,null,null,null,"Coincident"]
[null,null,"WEATHER CORRECTED MD 50% POE","MW","Non-coincident"]
[null,null,null,null,"Coincident"]
[null,null,"WEATHER CORRECTED MD 50% POE","MVA","Non-coincident"]
[null,null,null,null,"Coincident"]
[null,"NSP to enter name","CONNECTION POINT RATING","MVA","Non-coincident"]
[null,null,null,null,"Coincident"]
[null,null,"WINTER/SUMMER PEAKING",null,"Non-coincident"]
[null,null,null,null,"Coincident"]
[null,null,"ADJUSTMENTS - EMBEDDED GENERATION","MW","Non-coincident"]
[null,null,null,null,"Coincident"]
[null,null,"WEATHER CORRECTED MD 10% POE","MW","Non-coincident"]
[null,null,null,null,"Coincident"]
[null,null,"WEATHER CORRECTED MD 10% POE","MVA","Non-coincident"]
[null,null,null,null,"Coincident"]
[null,null,"WEATHER CORRECTED MD 50% POE","MW","Non-coincident"]
[null,null,null,null,"Coincident"]
[null,null,"WEATHER CORRECTED MD 50% POE","MVA","Non-coincident"]
[null,null,null,null,"Coincident"]
[null,"NSP to enter name","CONNECTION POINT RATING","MVA","Non-coincident"]
[null,null,null,null,"Coincident"]
[null,null,"WINTER/SUMMER PEAKING",null,"Non-coincident"]
[null,null,null,null,"Coincident"]
[null,null,"ADJUSTMENTS - EMBEDDED GENERATION","MW","Non-coincident"]
[null,null,null,null,"Coincident"]
[null,null,"WEATHER CORRECTED MD 10% POE","MW","Non-coincident"]
[null,null,null,null,"Coincident"]
[null,null,"WEATHER CORRECTED MD 10% POE","MVA","Non-coincident"]
[null,null,null,null,"Coincident"]
[null,null,"WEATHER CORRECTED MD 50% POE","MW","Non-coincident"]
[null,null,null,null,"Coincident"]
[null,null,"WEATHER CORRECTED MD 50% POE","MVA","Non-coincident"]
[null,null,null,null,"Coincident"]
[null,"NSP to enter name","CONNECTION POINT RATING","MVA","Non-coincident"]
[null,null,null,null,"Coincident"]
[null,null,"WINTER/SUMMER PEAKING",null,"Non-coincident"]
[null,null,null,null,"Coincident"]
[null,null,"ADJUSTMENTS - EMBEDDED GENERATION","MW","Non-coincident"]
[null,null,null,null,"Coincident"]
[null,null,"WEATHER CORRECTED MD 10% POE","MW","Non-coincident"]
[null,null,null,null,"Coincident"]
[null,null,"WEATHER CORRECTED MD 10% POE","MVA","Non-coincident"]
[null,null,null,null,"Coincident"]
[null,null,"WEATHER CORRECTED MD 50% POE","MW","Non-coincident"]
[null,null,null,null,"Coincident"]
[null,null,"WEATHER CORRECTED MD 50% POE","MVA","Non-coincident"]
[null,null,null,null,"Coincident"]
[null,"NSP to enter name","CONNECTION POINT RATING","MVA","Non-coincident"]
[null,null,null,null,"Coincident"]
[null,null,"WINTER/SUMMER PEAKING",null,"Non-coincident"]
[null,null,null,null,"Coincident"]
[null,null,"ADJUSTMENTS - EMBEDDED GENERATION","MW","Non-coincident"]
[null,null,null,null,"Coincident"]
[null,null,"WEATHER CORRECTED MD 10% POE","MW","Non-coincident"]
[null,null,null,null,"Coincident"]
[null,null,"WEATHER CORRECTED MD 10% POE","MVA","Non-coincident"]
[null,null,null,null,"Coincident"]
[null,null,"WEATHER CORRECTED MD 50% POE","MW","Non-coincident"]
[null,null,null,null,"Coincident"]
[null,null,"WEATHER CORRECTED MD 50% POE","MVA","Non-coincident"]
[null,null,null,null,"Coincident"]
[null,"NSP to enter name","CONNECTION POINT RATING","MVA","Non-coincident"]
[null,null,null,null,"Coincident"]
[null,null,"WINTER/SUMMER PEAKING",null,"Non-coincident"]
[null,null,null,null,"Coincident"]
[null,null,"ADJUSTMENTS - EMBEDDED GENERATION","MW","Non-coincident"]
[null,null,null,null,"Coincident"]
[null,null,"WEATHER CORRECTED MD 10% POE","MW","Non-coincident"]
[null,null,null,null,"Coincident"]
[null,null,"WEATHER CORRECTED MD 10% POE","MVA","Non-coincident"]
[null,null,null,null,"Coincident"]
[null,null,"WEATHER CORRECTED MD 50% POE","MW","Non-coincident"]
[null,null,null,null,"Coincident"]
[null,null,"WEATHER CORRECTED MD 50% POE","MVA","Non-coincident"]
[null,null,null,null,"Coincident"]
[null,"NSP to enter name","CONNECTION POINT RATING","MVA","Non-coincident"]
[null,null,null,null,"Coincident"]
[null,null,"WINTER/SUMMER PEAKING",null,"Non-coincident"]
[null,null,null,null,"Coincident"]
[null,null,"ADJUSTMENTS - EMBEDDED GENERATION","MW","Non-coincident"]
[null,null,null,null,"Coincident"]
[null,null,"WEATHER CORRECTED MD 10% POE","MW","Non-coincident"]
[null,null,null,null,"Coincident"]
[null,null,"WEATHER CORRECTED MD 10% POE","MVA","Non-coincident"]
[null,null,null,null,"Coincident"]
[null,null,"WEATHER CORRECTED MD 50% POE","MW","Non-coincident"]
[null,null,null,null,"Coincident"]
[null,null,"WEATHER CORRECTED MD 50% POE","MVA","Non-coincident"]
[null,null,null,null,"Coincident"]
[null,"NSP to enter name","CONNECTION POINT RATING","MVA","Non-coincident"]
[null,null,null,null,"Coincident"]
[null,null,"WINTER/SUMMER PEAKING",null,"Non-coincident"]
[null,null,null,null,"Coincident"]
[null,null,"ADJUSTMENTS - EMBEDDED GENERATION","MW","Non-coincident"]
[null,null,null,null,"Coincident"]
[null,null,"WEATHER CORRECTED MD 10% POE","MW","Non-coincident"]
[null,null,null,null,"Coincident"]
[null,null,"WEATHER CORRECTED MD 10% POE","MVA","Non-coincident"]
[null,null,null,null,"Coincident"]
[null,null,"WEATHER CORRECTED MD 50% POE","MW","Non-coincident"]
[null,null,null,null,"Coincident"]
[null,null,"WEATHER CORRECTED MD 50% POE","MVA","Non-coincident"]
[null,null,null,null,"Coincident"]
[null,"NSP to enter name","CONNECTION POINT RATING","MVA","Non-coincident"]
[null,null,null,null,"Coincident"]
[null,null,"WINTER/SUMMER PEAKING",null,"Non-coincident"]
[null,null,null,null,"Coincident"]
[null,null,"ADJUSTMENTS - EMBEDDED GENERATION","MW","Non-coincident"]
[null,null,null,null,"Coincident"]
[null,null,"WEATHER CORRECTED MD 10% POE","MW","Non-coincident"]
[null,null,null,null,"Coincident"]
[null,null,"WEATHER CORRECTED MD 10% POE","MVA","Non-coincident"]
[null,null,null,null,"Coincident"]
[null,null,"WEATHER CORRECTED MD 50% POE","MW","Non-coincident"]
[null,null,null,null,"Coincident"]
[null,null,"WEATHER CORRECTED MD 50% POE","MVA","Non-coincident"]
[null,null,null,null,"Coincident"]
[null,"NSP to enter name","CONNECTION POINT RATING","MVA","Non-coincident"]
[null,null,null,null,"Coincident"]
[null,null,"WINTER/SUMMER PEAKING",null,"Non-coincident"]
[null,null,null,null,"Coincident"]
[null,null,"ADJUSTMENTS - EMBEDDED GENERATION","MW","Non-coincident"]
[null,null,null,null,"Coincident"]
[null,null,"WEATHER CORRECTED MD 10% POE","MW","Non-coincident"]
[null,null,null,null,"Coincident"]
[null,null,"WEATHER CORRECTED MD 10% POE","MVA","Non-coincident"]
[null,null,null,null,"Coincident"]
[null,null,"WEATHER CORRECTED MD 50% POE","MW","Non-coincident"]
[null,null,null,null,"Coincident"]
[null,null,"WEATHER CORRECTED MD 50% POE","MVA","Non-coincident"]
[null,null,null,null,"Coincident"]
[null,"NSP to enter name","CONNECTION POINT RATING","MVA","Non-coincident"]
[null,null,null,null,"Coincident"]
[null,null,"WINTER/SUMMER PEAKING",null,"Non-coincident"]
[null,null,null,null,"Coincident"]
[null,null,"ADJUSTMENTS - EMBEDDED GENERATION","MW","Non-coincident"]
[null,null,null,null,"Coincident"]
[null,null,"WEATHER CORRECTED MD 10% POE","MW","Non-coincident"]
[null,null,null,null,"Coincident"]
[null,null,"WEATHER CORRECTED MD 10% POE","MVA","Non-coincident"]
[null,null,null,null,"Coincident"]
[null,null,"WEATHER CORRECTED MD 50% POE","MW","Non-coincident"]
[null,null,null,null,"Coincident"]
[null,null,"WEATHER CORRECTED MD 50% POE","MVA","Non-coincident"]
[null,null,null,null,"Coincident"]
[null,"NSP to enter name","CONNECTION POINT RATING","MVA","Non-coincident"]
[null,null,null,null,"Coincident"]
[null,null,"WINTER/SUMMER PEAKING",null,"Non-coincident"]
[null,null,null,null,"Coincident"]
[null,null,"ADJUSTMENTS - EMBEDDED GENERATION","MW","Non-coincident"]
[null,null,null,null,"Coincident"]
[null,null,"WEATHER CORRECTED MD 10% POE","MW","Non-coincident"]
[null,null,null,null,"Coincident"]
[null,null,"WEATHER CORRECTED MD 10% POE","MVA","Non-coincident"]
[null,null,null,null,"Coincident"]
[null,null,"WEATHER CORRECTED MD 50% POE","MW","Non-coincident"]
[null,null,null,null,"Coincident"]
[null,null,"WEATHER CORRECTED MD 50% POE","MVA","Non-coincident"]
[null,null,null,null,"Coincident"]
[null,"NSP to enter name","CONNECTION POINT RATING","MVA","Non-coincident"]
[null,null,null,null,"Coincident"]
[null,null,"WINTER/SUMMER PEAKING",null,"Non-coincident"]
[null,null,null,null,"Coincident"]
[null,null,"ADJUSTMENTS - EMBEDDED GENERATION","MW","Non-coincident"]
[null,null,null,null,"Coincident"]
[null,null,"WEATHER CORRECTED MD 10% POE","MW","Non-coincident"]
[null,null,null,null,"Coincident"]
[null,null,"WEATHER CORRECTED MD 10% POE","MVA","Non-coincident"]
[null,null,null,null,"Coincident"]
[null,null,"WEATHER CORRECTED MD 50% POE","MW","Non-coincident"]
[null,null,null,null,"Coincident"]
[null,null,"WEATHER CORRECTED MD 50% POE","MVA","Non-coincident"]
[null,null,null,null,"Coincident"]
[null,"NSP to enter name","CONNECTION POINT RATING","MVA","Non-coincident"]
[null,null,null,null,"Coincident"]
[null,null,"WINTER/SUMMER PEAKING",null,"Non-coincident"]
[null,null,null,null,"Coincident"]
[null,null,"ADJUSTMENTS - EMBEDDED GENERATION","MW","Non-coincident"]
[null,null,null,null,"Coincident"]
[null,null,"WEATHER CORRECTED MD 10% POE","MW","Non-coincident"]
[null,null,null,null,"Coincident"]
[null,null,"WEATHER CORRECTED MD 10% POE","MVA","Non-coincident"]
[null,null,null,null,"Coincident"]
[null,null,"WEATHER CORRECTED MD 50% POE","MW","Non-coincident"]
[null,null,null,null,"Coincident"]
[null,null,"WEATHER CORRECTED MD 50% POE","MVA","Non-coincident"]
[null,null,null,null,"Coincident"]
[null,"NSP to enter name","CONNECTION POINT RATING","MVA","Non-coincident"]
[null,null,null,null,"Coincident"]
[null,null,"WINTER/SUMMER PEAKING",null,"Non-coincident"]
[null,null,null,null,"Coincident"]
[null,null,"ADJUSTMENTS - EMBEDDED GENERATION","MW","Non-coincident"]
[null,null,null,null,"Coincident"]
[null,null,"WEATHER CORRECTED MD 10% POE","MW","Non-coincident"]
[null,null,null,null,"Coincident"]
[null,null,"WEATHER CORRECTED MD 10% POE","MVA","Non-coincident"]
[null,null,null,null,"Coincident"]
[null,null,"WEATHER CORRECTED MD 50% POE","MW","Non-coincident"]
[null,null,null,null,"Coincident"]
[null,null,"WEATHER CORRECTED MD 50% POE","MVA","Non-coincident"]
[null,null,null,null,"Coincident"]
[null,"NSP to enter name","CONNECTION POINT RATING","MVA","Non-coincident"]
[null,null,null,null,"Coincident"]
[null,null,"WINTER/SUMMER PEAKING",null,"Non-coincident"]
[null,null,null,null,"Coincident"]
[null,null,"ADJUSTMENTS - EMBEDDED GENERATION","MW","Non-coincident"]
[null,null,null,null,"Coincident"]
[null,null,"WEATHER CORRECTED MD 10% POE","MW","Non-coincident"]
[null,null,null,null,"Coincident"]
[null,null,"WEATHER CORRECTED MD 10% POE","MVA","Non-coincident"]
[null,null,null,null,"Coincident"]
[null,null,"WEATHER CORRECTED MD 50% POE","MW","Non-coincident"]
[null,null,null,null,"Coincident"]
[null,null,"WEATHER CORRECTED MD 50% POE","MVA","Non-coincident"]
[null,null,null,null,"Coincident"]
[null,"NSP to enter name","CONNECTION POINT RATING","MVA","Non-coincident"]
[null,null,null,null,"Coincident"]
[null,null,"WINTER/SUMMER PEAKING",null,"Non-coincident"]
[null,null,null,null,"Coincident"]
[null,null,"ADJUSTMENTS - EMBEDDED GENERATION","MW","Non-coincident"]
[null,null,null,null,"Coincident"]
[null,null,"WEATHER CORRECTED MD 10% POE","MW","Non-coincident"]
[null,null,null,null,"Coincident"]
[null,null,"WEATHER CORRECTED MD 10% POE","MVA","Non-coincident"]
[null,null,null,null,"Coincident"]
[null,null,"WEATHER CORRECTED MD 50% POE","MW","Non-coincident"]
[null,null,null,null,"Coincident"]
[null,null,"WEATHER CORRECTED MD 50% POE","MVA","Non-coincident"]
[null,null,null,null,"Coincident"]
[null,"NSP to enter name","CONNECTION POINT RATING","MVA","Non-coincident"]
[null,null,null,null,"Coincident"]
[null,null,"WINTER/SUMMER PEAKING",null,"Non-coincident"]
[null,null,null,null,"Coincident"]
[null,null,"ADJUSTMENTS - EMBEDDED GENERATION","MW","Non-coincident"]
[null,null,null,null,"Coincident"]
[null,null,"WEATHER CORRECTED MD 10% POE","MW","Non-coincident"]
[null,null,null,null,"Coincident"]
[null,null,"WEATHER CORRECTED MD 10% POE","MVA","Non-coincident"]
[null,null,null,null,"Coincident"]
[null,null,"WEATHER CORRECTED MD 50% POE","MW","Non-coincident"]
[null,null,null,null,"Coincident"]
[null,null,"WEATHER CORRECTED MD 50% POE","MVA","Non-coincident"]
[null,null,null,null,"Coincident"]
[null,"NSP to enter name","CONNECTION POINT RATING","MVA","Non-coincident"]
[null,null,null,null,"Coincident"]
[null,null,"WINTER/SUMMER PEAKING",null,"Non-coincident"]
[null,null,null,null,"Coincident"]
[null,null,"ADJUSTMENTS - EMBEDDED GENERATION","MW","Non-coincident"]
[null,null,null,null,"Coincident"]
[null,null,"WEATHER CORRECTED MD 10% POE","MW","Non-coincident"]
[null,null,null,null,"Coincident"]
[null,null,"WEATHER CORRECTED MD 10% POE","MVA","Non-coincident"]
[null,null,null,null,"Coincident"]
[null,null,"WEATHER CORRECTED MD 50% POE","MW","Non-coincident"]
[null,null,null,null,"Coincident"]
[null,null,"WEATHER CORRECTED MD 50% POE","MVA","Non-coincident"]
[null,null,null,null,"Coincident"]
[null,"NSP to enter name","CONNECTION POINT RATING","MVA","Non-coincident"]
[null,null,null,null,"Coincident"]
[null,null,"WINTER/SUMMER PEAKING",null,"Non-coincident"]
[null,null,null,null,"Coincident"]
[null,null,"ADJUSTMENTS - EMBEDDED GENERATION","MW","Non-coincident"]
[null,null,null,null,"Coincident"]
[null,null,"WEATHER CORRECTED MD 10% POE","MW","Non-coincident"]
[null,null,null,null,"Coincident"]
[null,null,"WEATHER CORRECTED MD 10% POE","MVA","Non-coincident"]
[null,null,null,null,"Coincident"]
[null,null,"WEATHER CORRECTED MD 50% POE","MW","Non-coincident"]
[null,null,null,null,"Coincident"]
[null,null,"WEATHER CORRECTED MD 50% POE","MVA","Non-coincident"]
[null,null,null,null,"Coincident"]
[null,"NSP to enter name","CONNECTION POINT RATING","MVA","Non-coincident"]
[null,null,null,null,"Coincident"]
[null,null,"WINTER/SUMMER PEAKING",null,"Non-coincident"]
[null,null,null,null,"Coincident"]
[null,null,"ADJUSTMENTS - EMBEDDED GENERATION","MW","Non-coincident"]
[null,null,null,null,"Coincident"]
[null,null,"WEATHER CORRECTED MD 10% POE","MW","Non-coincident"]
[null,null,null,null,"Coincident"]
[null,null,"WEATHER CORRECTED MD 10% POE","MVA","Non-coincident"]
[null,null,null,null,"Coincident"]
[null,null,"WEATHER CORRECTED MD 50% POE","MW","Non-coincident"]
[null,null,null,null,"Coincident"]
[null,null,"WEATHER CORRECTED MD 50% POE","MVA","Non-coincident"]
[null,null,null,null,"Coincident"]
[null,"NSP to enter name","CONNECTION POINT RATING","MVA","Non-coincident"]
[null,null,null,null,"Coincident"]
[null,null,"WINTER/SUMMER PEAKING",null,"Non-coincident"]
[null,null,null,null,"Coincident"]
[null,null,"ADJUSTMENTS - EMBEDDED GENERATION","MW","Non-coincident"]
[null,null,null,null,"Coincident"]
[null,null,"WEATHER CORRECTED MD 10% POE","MW","Non-coincident"]
[null,null,null,null,"Coincident"]
[null,null,"WEATHER CORRECTED MD 10% POE","MVA","Non-coincident"]
[null,null,null,null,"Coincident"]
[null,null,"WEATHER CORRECTED MD 50% POE","MW","Non-coincident"]
[null,null,null,null,"Coincident"]
[null,null,"WEATHER CORRECTED MD 50% POE","MVA","Non-coincident"]
[null,null,null,null,"Coincident"]
[null,"NSP to enter name","CONNECTION POINT RATING","MVA","Non-coincident"]
[null,null,null,null,"Coincident"]
[null,null,"WINTER/SUMMER PEAKING",null,"Non-coincident"]
[null,null,null,null,"Coincident"]
[null,null,"ADJUSTMENTS - EMBEDDED GENERATION","MW","Non-coincident"]
[null,null,null,null,"Coincident"]
[null,null,"WEATHER CORRECTED MD 10% POE","MW","Non-coincident"]
[null,null,null,null,"Coincident"]
[null,null,"WEATHER CORRECTED MD 10% POE","MVA","Non-coincident"]
[null,null,null,null,"Coincident"]
[null,null,"WEATHER CORRECTED MD 50% POE","MW","Non-coincident"]
[null,null,null,null,"Coincident"]
[null,null,"WEATHER CORRECTED MD 50% POE","MVA","Non-coincident"]
[null,null,null,null,"Coincident"]
[null,"NSP to enter name","CONNECTION POINT RATING","MVA","Non-coincident"]
[null,null,null,null,"Coincident"]
[null,null,"WINTER/SUMMER PEAKING",null,"Non-coincident"]
[null,null,null,null,"Coincident"]
[null,null,"ADJUSTMENTS - EMBEDDED GENERATION","MW","Non-coincident"]
[null,null,null,null,"Coincident"]
[null,null,"WEATHER CORRECTED MD 10% POE","MW","Non-coincident"]
[null,null,null,null,"Coincident"]
[null,null,"WEATHER CORRECTED MD 10% POE","MVA","Non-coincident"]
[null,null,null,null,"Coincident"]
[null,null,"WEATHER CORRECTED MD 50% POE","MW","Non-coincident"]
[null,null,null,null,"Coincident"]
[null,null,"WEATHER CORRECTED MD 50% POE","MVA","Non-coincident"]
[null,null,null,null,"Coincident"]
[null,"NSP to enter name","CONNECTION POINT RATING","MVA","Non-coincident"]
[null,null,null,null,"Coincident"]
[null,null,"WINTER/SUMMER PEAKING",null,"Non-coincident"]
[null,null,null,null,"Coincident"]
[null,null,"ADJUSTMENTS - EMBEDDED GENERATION","MW","Non-coincident"]
[null,null,null,null,"Coincident"]
[null,null,"WEATHER CORRECTED MD 10% POE","MW","Non-coincident"]
[null,null,null,null,"Coincident"]
[null,null,"WEATHER CORRECTED MD 10% POE","MVA","Non-coincident"]
[null,null,null,null,"Coincident"]
[null,null,"WEATHER CORRECTED MD 50% POE","MW","Non-coincident"]
[null,null,null,null,"Coincident"]
[null,null,"WEATHER CORRECTED MD 50% POE","MVA","Non-coincident"]
[null,null,null,null,"Coincident"]
[null,"NSP to enter name","CONNECTION POINT RATING","MVA","Non-coincident"]
[null,null,null,null,"Coincident"]
[null,null,"WINTER/SUMMER PEAKING",null,"Non-coincident"]
[null,null,null,null,"Coincident"]
[null,null,"ADJUSTMENTS - EMBEDDED GENERATION","MW","Non-coincident"]
[null,null,null,null,"Coincident"]
[null,null,"WEATHER CORRECTED MD 10% POE","MW","Non-coincident"]
[null,null,null,null,"Coincident"]
[null,null,"WEATHER CORRECTED MD 10% POE","MVA","Non-coincident"]
[null,null,null,null,"Coincident"]
[null,null,"WEATHER CORRECTED MD 50% POE","MW","Non-coincident"]
[null,null,null,null,"Coincident"]
[null,null,"WEATHER CORRECTED MD 50% POE","MVA","Non-coincident"]
[null,null,null,null,"Coincident"]
[null,"NSP to enter name","CONNECTION POINT RATING","MVA","Non-coincident"]
[null,null,null,null,"Coincident"]
[null,null,"WINTER/SUMMER PEAKING",null,"Non-coincident"]
[null,null,null,null,"Coincident"]
[null,null,"ADJUSTMENTS - EMBEDDED GENERATION","MW","Non-coincident"]
[null,null,null,null,"Coincident"]
[null,null,"WEATHER CORRECTED MD 10% POE","MW","Non-coincident"]
[null,null,null,null,"Coincident"]
[null,null,"WEATHER CORRECTED MD 10% POE","MVA","Non-coincident"]
[null,null,null,null,"Coincident"]
[null,null,"WEATHER CORRECTED MD 50% POE","MW","Non-coincident"]
[null,null,null,null,"Coincident"]
[null,null,"WEATHER CORRECTED MD 50% POE","MVA","Non-coincident"]
[null,null,null,null,"Coincident"]
[null,"NSP to enter name","CONNECTION POINT RATING","MVA","Non-coincident"]
[null,null,null,null,"Coincident"]
[null,null,"WINTER/SUMMER PEAKING",null,"Non-coincident"]
[null,null,null,null,"Coincident"]
[null,null,"ADJUSTMENTS - EMBEDDED GENERATION","MW","Non-coincident"]
[null,null,null,null,"Coincident"]
[null,null,"WEATHER CORRECTED MD 10% POE","MW","Non-coincident"]
[null,null,null,null,"Coincident"]
[null,null,"WEATHER CORRECTED MD 10% POE","MVA","Non-coincident"]
[null,null,null,null,"Coincident"]
[null,null,"WEATHER CORRECTED MD 50% POE","MW","Non-coincident"]
[null,null,null,null,"Coincident"]
[null,null,"WEATHER CORRECTED MD 50% POE","MVA","Non-coincident"]
[null,null,null,null,"Coincident"]
[null,"NSP to enter name","CONNECTION POINT RATING","MVA","Non-coincident"]
[null,null,null,null,"Coincident"]
[null,null,"WINTER/SUMMER PEAKING",null,"Non-coincident"]
[null,null,null,null,"Coincident"]
[null,null,"ADJUSTMENTS - EMBEDDED GENERATION","MW","Non-coincident"]
[null,null,null,null,"Coincident"]
[null,null,"WEATHER CORRECTED MD 10% POE","MW","Non-coincident"]
[null,null,null,null,"Coincident"]
[null,null,"WEATHER CORRECTED MD 10% POE","MVA","Non-coincident"]
[null,null,null,null,"Coincident"]
[null,null,"WEATHER CORRECTED MD 50% POE","MW","Non-coincident"]
[null,null,null,null,"Coincident"]
[null,null,"WEATHER CORRECTED MD 50% POE","MVA","Non-coincident"]
[null,null,null,null,"Coincident"]
[null,"NSP to enter name","CONNECTION POINT RATING","MVA","Non-coincident"]
[null,null,null,null,"Coincident"]
[null,null,"WINTER/SUMMER PEAKING",null,"Non-coincident"]
[null,null,null,null,"Coincident"]
[null,null,"ADJUSTMENTS - EMBEDDED GENERATION","MW","Non-coincident"]
[null,null,null,null,"Coincident"]
[null,null,"WEATHER CORRECTED MD 10% POE","MW","Non-coincident"]
[null,null,null,null,"Coincident"]
[null,null,"WEATHER CORRECTED MD 10% POE","MVA","Non-coincident"]
[null,null,null,null,"Coincident"]
[null,null,"WEATHER CORRECTED MD 50% POE","MW","Non-coincident"]
[null,null,null,null,"Coincident"]
[null,null,"WEATHER CORRECTED MD 50% POE","MVA","Non-coincident"]
[null,null,null,null,"Coincident"]
[null,"NSP to enter name","CONNECTION POINT RATING","MVA","Non-coincident"]
[null,null,null,null,"Coincident"]
[null,null,"WINTER/SUMMER PEAKING",null,"Non-coincident"]
[null,null,null,null,"Coincident"]
[null,null,"ADJUSTMENTS - EMBEDDED GENERATION","MW","Non-coincident"]
[null,null,null,null,"Coincident"]
[null,null,"WEATHER CORRECTED MD 10% POE","MW","Non-coincident"]
[null,null,null,null,"Coincident"]
[null,null,"WEATHER CORRECTED MD 10% POE","MVA","Non-coincident"]
[null,null,null,null,"Coincident"]
[null,null,"WEATHER CORRECTED MD 50% POE","MW","Non-coincident"]
[null,null,null,null,"Coincident"]
[null,null,"WEATHER CORRECTED MD 50% POE","MVA","Non-coincident"]
[null,null,null,null,"Coincident"]
[null,"NSP to enter name","CONNECTION POINT RATING","MVA","Non-coincident"]
[null,null,null,null,"Coincident"]
[null,null,"WINTER/SUMMER PEAKING",null,"Non-coincident"]
[null,null,null,null,"Coincident"]
[null,null,"ADJUSTMENTS - EMBEDDED GENERATION","MW","Non-coincident"]
[null,null,null,null,"Coincident"]
[null,null,"WEATHER CORRECTED MD 10% POE","MW","Non-coincident"]
[null,null,null,null,"Coincident"]
[null,null,"WEATHER CORRECTED MD 10% POE","MVA","Non-coincident"]
[null,null,null,null,"Coincident"]
[null,null,"WEATHER CORRECTED MD 50% POE","MW","Non-coincident"]
[null,null,null,null,"Coincident"]
[null,null,"WEATHER CORRECTED MD 50% POE","MVA","Non-coincident"]
[null,null,null,null,"Coincident"]
[null,"NSP to enter name","CONNECTION POINT RATING","MVA","Non-coincident"]
[null,null,null,null,"Coincident"]
[null,null,"WINTER/SUMMER PEAKING",null,"Non-coincident"]
[null,null,null,null,"Coincident"]
[null,null,"ADJUSTMENTS - EMBEDDED GENERATION","MW","Non-coincident"]
[null,null,null,null,"Coincident"]
[null,null,"WEATHER CORRECTED MD 10% POE","MW","Non-coincident"]
[null,null,null,null,"Coincident"]
[null,null,"WEATHER CORRECTED MD 10% POE","MVA","Non-coincident"]
[null,null,null,null,"Coincident"]
[null,null,"WEATHER CORRECTED MD 50% POE","MW","Non-coincident"]
[null,null,null,null,"Coincident"]
[null,null,"WEATHER CORRECTED MD 50% POE","MVA","Non-coincident"]
[null,null,null,null,"Coincident"]
[null,"NSP to enter name","CONNECTION POINT RATING","MVA","Non-coincident"]
[null,null,null,null,"Coincident"]
[null,null,"WINTER/SUMMER PEAKING",null,"Non-coincident"]
[null,null,null,null,"Coincident"]
[null,null,"ADJUSTMENTS - EMBEDDED GENERATION","MW","Non-coincident"]
[null,null,null,null,"Coincident"]
[null,null,"WEATHER CORRECTED MD 10% POE","MW","Non-coincident"]
[null,null,null,null,"Coincident"]
[null,null,"WEATHER CORRECTED MD 10% POE","MVA","Non-coincident"]
[null,null,null,null,"Coincident"]
[null,null,"WEATHER CORRECTED MD 50% POE","MW","Non-coincident"]
[null,null,null,null,"Coincident"]
[null,null,"WEATHER CORRECTED MD 50% POE","MVA","Non-coincident"]
[null,null,null,null,"Coincident"]
[null,"NSP to enter name","CONNECTION POINT RATING","MVA","Non-coincident"]
[null,null,null,null,"Coincident"]
[null,null,"WINTER/SUMMER PEAKING",null,"Non-coincident"]
[null,null,null,null,"Coincident"]
[null,null,"ADJUSTMENTS - EMBEDDED GENERATION","MW","Non-coincident"]
[null,null,null,null,"Coincident"]
[null,null,"WEATHER CORRECTED MD 10% POE","MW","Non-coincident"]
[null,null,null,null,"Coincident"]
[null,null,"WEATHER CORRECTED MD 10% POE","MVA","Non-coincident"]
[null,null,null,null,"Coincident"]
[null,null,"WEATHER CORRECTED MD 50% POE","MW","Non-coincident"]
[null,null,null,null,"Coincident"]
[null,null,"WEATHER CORRECTED MD 50% POE","MVA","Non-coincident"]
[null,null,null,null,"Coincident"]
[null,"NSP to enter name","CONNECTION POINT RATING","MVA","Non-coincident"]
[null,null,null,null,"Coincident"]
[null,null,"WINTER/SUMMER PEAKING",null,"Non-coincident"]
[null,null,null,null,"Coincident"]
[null,null,"ADJUSTMENTS - EMBEDDED GENERATION","MW","Non-coincident"]
[null,null,null,null,"Coincident"]
[null,null,"WEATHER CORRECTED MD 10% POE","MW","Non-coincident"]
[null,null,null,null,"Coincident"]
[null,null,"WEATHER CORRECTED MD 10% POE","MVA","Non-coincident"]
[null,null,null,null,"Coincident"]
[null,null,"WEATHER CORRECTED MD 50% POE","MW","Non-coincident"]
[null,null,null,null,"Coincident"]
[null,null,"WEATHER CORRECTED MD 50% POE","MVA","Non-coincident"]
[null,null,null,null,"Coincident"]
[null,"NSP to enter name","CONNECTION POINT RATING","MVA","Non-coincident"]
[null,null,null,null,"Coincident"]
[null,null,"WINTER/SUMMER PEAKING",null,"Non-coincident"]
[null,null,null,null,"Coincident"]
[null,null,"ADJUSTMENTS - EMBEDDED GENERATION","MW","Non-coincident"]
[null,null,null,null,"Coincident"]
[null,null,"WEATHER CORRECTED MD 10% POE","MW","Non-coincident"]
[null,null,null,null,"Coincident"]
[null,null,"WEATHER CORRECTED MD 10% POE","MVA","Non-coincident"]
[null,null,null,null,"Coincident"]
[null,null,"WEATHER CORRECTED MD 50% POE","MW","Non-coincident"]
[null,null,null,null,"Coincident"]
[null,null,"WEATHER CORRECTED MD 50% POE","MVA","Non-coincident"]
[null,null,null,null,"Coincident"]
[null,"NSP to enter name","CONNECTION POINT RATING","MVA","Non-coincident"]
[null,null,null,null,"Coincident"]
[null,null,"WINTER/SUMMER PEAKING",null,"Non-coincident"]
[null,null,null,null,"Coincident"]
[null,null,"ADJUSTMENTS - EMBEDDED GENERATION","MW","Non-coincident"]
[null,null,null,null,"Coincident"]
[null,null,"WEATHER CORRECTED MD 10% POE","MW","Non-coincident"]
[null,null,null,null,"Coincident"]
[null,null,"WEATHER CORRECTED MD 10% POE","MVA","Non-coincident"]
[null,null,null,null,"Coincident"]
[null,null,"WEATHER CORRECTED MD 50% POE","MW","Non-coincident"]
[null,null,null,null,"Coincident"]
[null,null,"WEATHER CORRECTED MD 50% POE","MVA","Non-coincident"]
[null,null,null,null,"Coincident"]
[null,"NSP to enter name","CONNECTION POINT RATING","MVA","Non-coincident"]
[null,null,null,null,"Coincident"]
[null,null,"WINTER/SUMMER PEAKING",null,"Non-coincident"]
[null,null,null,null,"Coincident"]
[null,null,"ADJUSTMENTS - EMBEDDED GENERATION","MW","Non-coincident"]
[null,null,null,null,"Coincident"]
[null,null,"WEATHER CORRECTED MD 10% POE","MW","Non-coincident"]
[null,null,null,null,"Coincident"]
[null,null,"WEATHER CORRECTED MD 10% POE","MVA","Non-coincident"]
[null,null,null,null,"Coincident"]
[null,null,"WEATHER CORRECTED MD 50% POE","MW","Non-coincident"]
[null,null,null,null,"Coincident"]
[null,null,"WEATHER CORRECTED MD 50% POE","MVA","Non-coincident"]
[null,null,null,null,"Coincident"]
[null,"NSP to enter name","CONNECTION POINT RATING","MVA","Non-coincident"]
[null,null,null,null,"Coincident"]
[null,null,"WINTER/SUMMER PEAKING",null,"Non-coincident"]
[null,null,null,null,"Coincident"]
[null,null,"ADJUSTMENTS - EMBEDDED GENERATION","MW","Non-coincident"]
[null,null,null,null,"Coincident"]
[null,null,"WEATHER CORRECTED MD 10% POE","MW","Non-coincident"]
[null,null,null,null,"Coincident"]
[null,null,"WEATHER CORRECTED MD 10% POE","MVA","Non-coincident"]
[null,null,null,null,"Coincident"]
[null,null,"WEATHER CORRECTED MD 50% POE","MW","Non-coincident"]
[null,null,null,null,"Coincident"]
[null,null,"WEATHER CORRECTED MD 50% POE","MVA","Non-coincident"]
[null,null,null,null,"Coincident"]
[null,"NSP to enter name","CONNECTION POINT RATING","MVA","Non-coincident"]
[null,null,null,null,"Coincident"]
[null,null,"WINTER/SUMMER PEAKING",null,"Non-coincident"]
[null,null,null,null,"Coincident"]
[null,null,"ADJUSTMENTS - EMBEDDED GENERATION","MW","Non-coincident"]
[null,null,null,null,"Coincident"]
[null,null,"WEATHER CORRECTED MD 10% POE","MW","Non-coincident"]
[null,null,null,null,"Coincident"]
[null,null,"WEATHER CORRECTED MD 10% POE","MVA","Non-coincident"]
[null,null,null,null,"Coincident"]
[null,null,"WEATHER CORRECTED MD 50% POE","MW","Non-coincident"]
[null,null,null,null,"Coincident"]
[null,null,"WEATHER CORRECTED MD 50% POE","MVA","Non-coincident"]
[null,null,null,null,"Coincident"]
[null,"NSP to enter name","CONNECTION POINT RATING","MVA","Non-coincident"]
[null,null,null,null,"Coincident"]
[null,null,"WINTER/SUMMER PEAKING",null,"Non-coincident"]
[null,null,null,null,"Coincident"]
[null,null,"ADJUSTMENTS - EMBEDDED GENERATION","MW","Non-coincident"]
[null,null,null,null,"Coincident"]
[null,null,"WEATHER CORRECTED MD 10% POE","MW","Non-coincident"]
[null,null,null,null,"Coincident"]
[null,null,"WEATHER CORRECTED MD 10% POE","MVA","Non-coincident"]
[null,null,null,null,"Coincident"]
[null,null,"WEATHER CORRECTED MD 50% POE","MW","Non-coincident"]
[null,null,null,null,"Coincident"]
[null,null,"WEATHER CORRECTED MD 50% POE","MVA","Non-coincident"]
[null,null,null,null,"Coincident"]
[null,"NSP to enter name","CONNECTION POINT RATING","MVA","Non-coincident"]
[null,null,null,null,"Coincident"]
[null,null,"WINTER/SUMMER PEAKING",null,"Non-coincident"]
[null,null,null,null,"Coincident"]
[null,null,"ADJUSTMENTS - EMBEDDED GENERATION","MW","Non-coincident"]
[null,null,null,null,"Coincident"]
[null,null,"WEATHER CORRECTED MD 10% POE","MW","Non-coincident"]
[null,null,null,null,"Coincident"]
[null,null,"WEATHER CORRECTED MD 10% POE","MVA","Non-coincident"]
[null,null,null,null,"Coincident"]
[null,null,"WEATHER CORRECTED MD 50% POE","MW","Non-coincident"]
[null,null,null,null,"Coincident"]
[null,null,"WEATHER CORRECTED MD 50% POE","MVA","Non-coincident"]
[null,null,null,null,"Coincident"]
[null,"NSP to enter name","CONNECTION POINT RATING","MVA","Non-coincident"]
[null,null,null,null,"Coincident"]
[null,null,"WINTER/SUMMER PEAKING",null,"Non-coincident"]
[null,null,null,null,"Coincident"]
[null,null,"ADJUSTMENTS - EMBEDDED GENERATION","MW","Non-coincident"]
[null,null,null,null,"Coincident"]
[null,null,"WEATHER CORRECTED MD 10% POE","MW","Non-coincident"]
[null,null,null,null,"Coincident"]
[null,null,"WEATHER CORRECTED MD 10% POE","MVA","Non-coincident"]
[null,null,null,null,"Coincident"]
[null,null,"WEATHER CORRECTED MD 50% POE","MW","Non-coincident"]
[null,null,null,null,"Coincident"]
[null,null,"WEATHER CORRECTED MD 50% POE","MVA","Non-coincident"]
[null,null,null,null,"Coincident"]
[null,"NSP to enter name","CONNECTION POINT RATING","MVA","Non-coincident"]
[null,null,null,null,"Coincident"]
[null,null,"WINTER/SUMMER PEAKING",null,"Non-coincident"]
[null,null,null,null,"Coincident"]
[null,null,"ADJUSTMENTS - EMBEDDED GENERATION","MW","Non-coincident"]
[null,null,null,null,"Coincident"]
[null,null,"WEATHER CORRECTED MD 10% POE","MW","Non-coincident"]
[null,null,null,null,"Coincident"]
[null,null,"WEATHER CORRECTED MD 10% POE","MVA","Non-coincident"]
[null,null,null,null,"Coincident"]
[null,null,"WEATHER CORRECTED MD 50% POE","MW","Non-coincident"]
[null,null,null,null,"Coincident"]
[null,null,"WEATHER CORRECTED MD 50% POE","MVA","Non-coincident"]
[null,null,null,null,"Coincident"]
[null,"NSP to enter name","CONNECTION POINT RATING","MVA","Non-coincident"]
[null,null,null,null,"Coincident"]
[null,null,"WINTER/SUMMER PEAKING",null,"Non-coincident"]
[null,null,null,null,"Coincident"]
[null,null,"ADJUSTMENTS - EMBEDDED GENERATION","MW","Non-coincident"]
[null,null,null,null,"Coincident"]
[null,null,"WEATHER CORRECTED MD 10% POE","MW","Non-coincident"]
[null,null,null,null,"Coincident"]
[null,null,"WEATHER CORRECTED MD 10% POE","MVA","Non-coincident"]
[null,null,null,null,"Coincident"]
[null,null,"WEATHER CORRECTED MD 50% POE","MW","Non-coincident"]
[null,null,null,null,"Coincident"]
[null,null,"WEATHER CORRECTED MD 50% POE","MVA","Non-coincident"]
[null,null,null,null,"Coincident"]
[null,"NSP to enter name","CONNECTION POINT RATING","MVA","Non-coincident"]
[null,null,null,null,"Coincident"]
[null,null,"WINTER/SUMMER PEAKING",null,"Non-coincident"]
[null,null,null,null,"Coincident"]
[null,null,"ADJUSTMENTS - EMBEDDED GENERATION","MW","Non-coincident"]
[null,null,null,null,"Coincident"]
[null,null,"WEATHER CORRECTED MD 10% POE","MW","Non-coincident"]
[null,null,null,null,"Coincident"]
[null,null,"WEATHER CORRECTED MD 10% POE","MVA","Non-coincident"]
[null,null,null,null,"Coincident"]
[null,null,"WEATHER CORRECTED MD 50% POE","MW","Non-coincident"]
[null,null,null,null,"Coincident"]
[null,null,"WEATHER CORRECTED MD 50% POE","MVA","Non-coincident"]
[null,null,null,null,"Coincident"]
[null,"NSP to enter name","CONNECTION POINT RATING","MVA","Non-coincident"]
[null,null,null,null,"Coincident"]
[null,null,"WINTER/SUMMER PEAKING",null,"Non-coincident"]
[null,null,null,null,"Coincident"]
[null,null,"ADJUSTMENTS - EMBEDDED GENERATION","MW","Non-coincident"]
[null,null,null,null,"Coincident"]
[null,null,"WEATHER CORRECTED MD 10% POE","MW","Non-coincident"]
[null,null,null,null,"Coincident"]
[null,null,"WEATHER CORRECTED MD 10% POE","MVA","Non-coincident"]
[null,null,null,null,"Coincident"]
[null,null,"WEATHER CORRECTED MD 50% POE","MW","Non-coincident"]
[null,null,null,null,"Coincident"]
[null,null,"WEATHER CORRECTED MD 50% POE","MVA","Non-coincident"]
[null,null,null,null,"Coincident"]
[null,"NSP to enter name","CONNECTION POINT RATING","MVA","Non-coincident"]
[null,null,null,null,"Coincident"]
[null,null,"WINTER/SUMMER PEAKING",null,"Non-coincident"]
[null,null,null,null,"Coincident"]
[null,null,"ADJUSTMENTS - EMBEDDED GENERATION","MW","Non-coincident"]
[null,null,null,null,"Coincident"]
[null,null,"WEATHER CORRECTED MD 10% POE","MW","Non-coincident"]
[null,null,null,null,"Coincident"]
[null,null,"WEATHER CORRECTED MD 10% POE","MVA","Non-coincident"]
[null,null,null,null,"Coincident"]
[null,null,"WEATHER CORRECTED MD 50% POE","MW","Non-coincident"]
[null,null,null,null,"Coincident"]
[null,null,"WEATHER CORRECTED MD 50% POE","MVA","Non-coincident"]
[null,null,null,null,"Coincident"]
[null,"NSP to enter name","CONNECTION POINT RATING","MVA","Non-coincident"]
[null,null,null,null,"Coincident"]
[null,null,"WINTER/SUMMER PEAKING",null,"Non-coincident"]
[null,null,null,null,"Coincident"]
[null,null,"ADJUSTMENTS - EMBEDDED GENERATION","MW","Non-coincident"]
[null,null,null,null,"Coincident"]
[null,null,"WEATHER CORRECTED MD 10% POE","MW","Non-coincident"]
[null,null,null,null,"Coincident"]
[null,null,"WEATHER CORRECTED MD 10% POE","MVA","Non-coincident"]
[null,null,null,null,"Coincident"]
[null,null,"WEATHER CORRECTED MD 50% POE","MW","Non-coincident"]
[null,null,null,null,"Coincident"]
[null,null,"WEATHER CORRECTED MD 50% POE","MVA","Non-coincident"]
[null,null,null,null,"Coincident"]
[null,"NSP to enter name","CONNECTION POINT RATING","MVA","Non-coincident"]
[null,null,null,null,"Coincident"]
[null,null,"WINTER/SUMMER PEAKING",null,"Non-coincident"]
[null,null,null,null,"Coincident"]
[null,null,"ADJUSTMENTS - EMBEDDED GENERATION","MW","Non-coincident"]
[null,null,null,null,"Coincident"]
[null,null,"WEATHER CORRECTED MD 10% POE","MW","Non-coincident"]
[null,null,null,null,"Coincident"]
[null,null,"WEATHER CORRECTED MD 10% POE","MVA","Non-coincident"]
[null,null,null,null,"Coincident"]
[null,null,"WEATHER CORRECTED MD 50% POE","MW","Non-coincident"]
[null,null,null,null,"Coincident"]
[null,null,"WEATHER CORRECTED MD 50% POE","MVA","Non-coincident"]
[null,null,null,null,"Coincident"]
[null,"NSP to enter name","CONNECTION POINT RATING","MVA","Non-coincident"]
[null,null,null,null,"Coincident"]
[null,null,"WINTER/SUMMER PEAKING",null,"Non-coincident"]
[null,null,null,null,"Coincident"]
[null,null,"ADJUSTMENTS - EMBEDDED GENERATION","MW","Non-coincident"]
[null,null,null,null,"Coincident"]
[null,null,"WEATHER CORRECTED MD 10% POE","MW","Non-coincident"]
[null,null,null,null,"Coincident"]
[null,null,"WEATHER CORRECTED MD 10% POE","MVA","Non-coincident"]
[null,null,null,null,"Coincident"]
[null,null,"WEATHER CORRECTED MD 50% POE","MW","Non-coincident"]
[null,null,null,null,"Coincident"]
[null,null,"WEATHER CORRECTED MD 50% POE","MVA","Non-coincident"]
[null,null,null,null,"Coincident"]
[null,"NSP to enter name","CONNECTION POINT RATING","MVA","Non-coincident"]
[null,null,null,null,"Coincident"]
[null,null,"WINTER/SUMMER PEAKING",null,"Non-coincident"]
[null,null,null,null,"Coincident"]
[null,null,"ADJUSTMENTS - EMBEDDED GENERATION","MW","Non-coincident"]
[null,null,null,null,"Coincident"]
[null,null,"WEATHER CORRECTED MD 10% POE","MW","Non-coincident"]
[null,null,null,null,"Coincident"]
[null,null,"WEATHER CORRECTED MD 10% POE","MVA","Non-coincident"]
[null,null,null,null,"Coincident"]
[null,null,"WEATHER CORRECTED MD 50% POE","MW","Non-coincident"]
[null,null,null,null,"Coincident"]
[null,null,"WEATHER CORRECTED MD 50% POE","MVA","Non-coincident"]
[null,null,null,null,"Coincident"]
[null,"NSP to enter name","CONNECTION POINT RATING","MVA","Non-coincident"]
[null,null,null,null,"Coincident"]
[null,null,"WINTER/SUMMER PEAKING",null,"Non-coincident"]
[null,null,null,null,"Coincident"]
[null,null,"ADJUSTMENTS - EMBEDDED GENERATION","MW","Non-coincident"]
[null,null,null,null,"Coincident"]
[null,null,"WEATHER CORRECTED MD 10% POE","MW","Non-coincident"]
[null,null,null,null,"Coincident"]
[null,null,"WEATHER CORRECTED MD 10% POE","MVA","Non-coincident"]
[null,null,null,null,"Coincident"]
[null,null,"WEATHER CORRECTED MD 50% POE","MW","Non-coincident"]
[null,null,null,null,"Coincident"]
[null,null,"WEATHER CORRECTED MD 50% POE","MVA","Non-coincident"]
[null,null,null,null,"Coincident"]
[null,"NSP to enter name","CONNECTION POINT RATING","MVA","Non-coincident"]
[null,null,null,null,"Coincident"]
[null,null,"WINTER/SUMMER PEAKING",null,"Non-coincident"]
[null,null,null,null,"Coincident"]
[null,null,"ADJUSTMENTS - EMBEDDED GENERATION","MW","Non-coincident"]
[null,null,null,null,"Coincident"]
[null,null,"WEATHER CORRECTED MD 10% POE","MW","Non-coincident"]
[null,null,null,null,"Coincident"]
[null,null,"WEATHER CORRECTED MD 10% POE","MVA","Non-coincident"]
[null,null,null,null,"Coincident"]
[null,null,"WEATHER CORRECTED MD 50% POE","MW","Non-coincident"]
[null,null,null,null,"Coincident"]
[null,null,"WEATHER CORRECTED MD 50% POE","MVA","Non-coincident"]
[null,null,null,null,"Coincident"]
[null,"NSP to enter name","CONNECTION POINT RATING","MVA","Non-coincident"]
[null,null,null,null,"Coincident"]
[null,null,"WINTER/SUMMER PEAKING",null,"Non-coincident"]
[null,null,null,null,"Coincident"]
[null,null,"ADJUSTMENTS - EMBEDDED GENERATION","MW","Non-coincident"]
[null,null,null,null,"Coincident"]
[null,null,"WEATHER CORRECTED MD 10% POE","MW","Non-coincident"]
[null,null,null,null,"Coincident"]
[null,null,"WEATHER CORRECTED MD 10% POE","MVA","Non-coincident"]
[null,null,null,null,"Coincident"]
[null,null,"WEATHER CORRECTED MD 50% POE","MW","Non-coincident"]
[null,null,null,null,"Coincident"]
[null,null,"WEATHER CORRECTED MD 50% POE","MVA","Non-coincident"]
[null,null,null,null,"Coincident"]
[null,"NSP to enter name","CONNECTION POINT RATING","MVA","Non-coincident"]
[null,null,null,null,"Coincident"]
[null,null,"WINTER/SUMMER PEAKING",null,"Non-coincident"]
[null,null,null,null,"Coincident"]
[null,null,"ADJUSTMENTS - EMBEDDED GENERATION","MW","Non-coincident"]
[null,null,null,null,"Coincident"]
[null,null,"WEATHER CORRECTED MD 10% POE","MW","Non-coincident"]
[null,null,null,null,"Coincident"]
[null,null,"WEATHER CORRECTED MD 10% POE","MVA","Non-coincident"]
[null,null,null,null,"Coincident"]
[null,null,"WEATHER CORRECTED MD 50% POE","MW","Non-coincident"]
[null,null,null,null,"Coincident"]
[null,null,"WEATHER CORRECTED MD 50% POE","MVA","Non-coincident"]
[null,null,null,null,"Coincident"]
[null,"NSP to enter name","CONNECTION POINT RATING","MVA","Non-coincident"]
[null,null,null,null,"Coincident"]
[null,null,"WINTER/SUMMER PEAKING",null,"Non-coincident"]
[null,null,null,null,"Coincident"]
[null,null,"ADJUSTMENTS - EMBEDDED GENERATION","MW","Non-coincident"]
[null,null,null,null,"Coincident"]
[null,null,"WEATHER CORRECTED MD 10% POE","MW","Non-coincident"]
[null,null,null,null,"Coincident"]
[null,null,"WEATHER CORRECTED MD 10% POE","MVA","Non-coincident"]
[null,null,null,null,"Coincident"]
[null,null,"WEATHER CORRECTED MD 50% POE","MW","Non-coincident"]
[null,null,null,null,"Coincident"]
[null,null,"WEATHER CORRECTED MD 50% POE","MVA","Non-coincident"]
[null,null,null,null,"Coincident"]
[null,"NSP to enter name","CONNECTION POINT RATING","MVA","Non-coincident"]
[null,null,null,null,"Coincident"]
[null,null,"WINTER/SUMMER PEAKING",null,"Non-coincident"]
[null,null,null,null,"Coincident"]
[null,null,"ADJUSTMENTS - EMBEDDED GENERATION","MW","Non-coincident"]
[null,null,null,null,"Coincident"]
[null,null,"WEATHER CORRECTED MD 10% POE","MW","Non-coincident"]
[null,null,null,null,"Coincident"]
[null,null,"WEATHER CORRECTED MD 10% POE","MVA","Non-coincident"]
[null,null,null,null,"Coincident"]
[null,null,"WEATHER CORRECTED MD 50% POE","MW","Non-coincident"]
[null,null,null,null,"Coincident"]
[null,null,"WEATHER CORRECTED MD 50% POE","MVA","Non-coincident"]
[null,null,null,null,"Coincident"]
[null,"NSP to enter name","CONNECTION POINT RATING","MVA","Non-coincident"]
[null,null,null,null,"Coincident"]
[null,null,"WINTER/SUMMER PEAKING",null,"Non-coincident"]
[null,null,null,null,"Coincident"]
[null,null,"ADJUSTMENTS - EMBEDDED GENERATION","MW","Non-coincident"]
[null,null,null,null,"Coincident"]
[null,null,"WEATHER CORRECTED MD 10% POE","MW","Non-coincident"]
[null,null,null,null,"Coincident"]
[null,null,"WEATHER CORRECTED MD 10% POE","MVA","Non-coincident"]
[null,null,null,null,"Coincident"]
[null,null,"WEATHER CORRECTED MD 50% POE","MW","Non-coincident"]
[null,null,null,null,"Coincident"]
[null,null,"WEATHER CORRECTED MD 50% POE","MVA","Non-coincident"]
[null,null,null,null,"Coincident"]
[null,"NSP to enter name","CONNECTION POINT RATING","MVA","Non-coincident"]
[null,null,null,null,"Coincident"]
[null,null,"WINTER/SUMMER PEAKING",null,"Non-coincident"]
[null,null,null,null,"Coincident"]
[null,null,"ADJUSTMENTS - EMBEDDED GENERATION","MW","Non-coincident"]
[null,null,null,null,"Coincident"]
[null,null,"WEATHER CORRECTED MD 10% POE","MW","Non-coincident"]
[null,null,null,null,"Coincident"]
[null,null,"WEATHER CORRECTED MD 10% POE","MVA","Non-coincident"]
[null,null,null,null,"Coincident"]
[null,null,"WEATHER CORRECTED MD 50% POE","MW","Non-coincident"]
[null,null,null,null,"Coincident"]
[null,null,"WEATHER CORRECTED MD 50% POE","MVA","Non-coincident"]
[null,null,null,null,"Coincident"]
[null,"NSP to enter name","CONNECTION POINT RATING","MVA","Non-coincident"]
[null,null,null,null,"Coincident"]
[null,null,"WINTER/SUMMER PEAKING",null,"Non-coincident"]
[null,null,null,null,"Coincident"]
[null,null,"ADJUSTMENTS - EMBEDDED GENERATION","MW","Non-coincident"]
[null,null,null,null,"Coincident"]
[null,null,"WEATHER CORRECTED MD 10% POE","MW","Non-coincident"]
[null,null,null,null,"Coincident"]
[null,null,"WEATHER CORRECTED MD 10% POE","MVA","Non-coincident"]
[null,null,null,null,"Coincident"]
[null,null,"WEATHER CORRECTED MD 50% POE","MW","Non-coincident"]
[null,null,null,null,"Coincident"]
[null,null,"WEATHER CORRECTED MD 50% POE","MVA","Non-coincident"]
[null,null,null,null,"Coincident"]
[null,"NSP to enter name","CONNECTION POINT RATING","MVA","Non-coincident"]
[null,null,null,null,"Coincident"]
[null,null,"WINTER/SUMMER PEAKING",null,"Non-coincident"]
[null,null,null,null,"Coincident"]
[null,null,"ADJUSTMENTS - EMBEDDED GENERATION","MW","Non-coincident"]
[null,null,null,null,"Coincident"]
[null,null,"WEATHER CORRECTED MD 10% POE","MW","Non-coincident"]
[null,null,null,null,"Coincident"]
[null,null,"WEATHER CORRECTED MD 10% POE","MVA","Non-coincident"]
[null,null,null,null,"Coincident"]
[null,null,"WEATHER CORRECTED MD 50% POE","MW","Non-coincident"]
[null,null,null,null,"Coincident"]
[null,null,"WEATHER CORRECTED MD 50% POE","MVA","Non-coincident"]
[null,null,null,null,"Coincident"]
[null,"NSP to enter name","CONNECTION POINT RATING","MVA","Non-coincident"]
[null,null,null,null,"Coincident"]
[null,null,"WINTER/SUMMER PEAKING",null,"Non-coincident"]
[null,null,null,null,"Coincident"]
[null,null,"ADJUSTMENTS - EMBEDDED GENERATION","MW","Non-coincident"]
[null,null,null,null,"Coincident"]
[null,null,"WEATHER CORRECTED MD 10% POE","MW","Non-coincident"]
[null,null,null,null,"Coincident"]
[null,null,"WEATHER CORRECTED MD 10% POE","MVA","Non-coincident"]
[null,null,null,null,"Coincident"]
[null,null,"WEATHER CORRECTED MD 50% POE","MW","Non-coincident"]
[null,null,null,null,"Coincident"]
[null,null,"WEATHER CORRECTED MD 50% POE","MVA","Non-coincident"]
[null,null,null,null,"Coincident"]
[null,"NSP to enter name","CONNECTION POINT RATING","MVA","Non-coincident"]
[null,null,null,null,"Coincident"]
[null,null,"WINTER/SUMMER PEAKING",null,"Non-coincident"]
[null,null,null,null,"Coincident"]
[null,null,"ADJUSTMENTS - EMBEDDED GENERATION","MW","Non-coincident"]
[null,null,null,null,"Coincident"]
[null,null,"WEATHER CORRECTED MD 10% POE","MW","Non-coincident"]
[null,null,null,null,"Coincident"]
[null,null,"WEATHER CORRECTED MD 10% POE","MVA","Non-coincident"]
[null,null,null,null,"Coincident"]
[null,null,"WEATHER CORRECTED MD 50% POE","MW","Non-coincident"]
[null,null,null,null,"Coincident"]
[null,null,"WEATHER CORRECTED MD 50% POE","MVA","Non-coincident"]
[null,null,null,null,"Coincident"]
[null,"NSP to enter name","CONNECTION POINT RATING","MVA","Non-coincident"]
[null,null,null,null,"Coincident"]
[null,null,"WINTER/SUMMER PEAKING",null,"Non-coincident"]
[null,null,null,null,"Coincident"]
[null,null,"ADJUSTMENTS - EMBEDDED GENERATION","MW","Non-coincident"]
[null,null,null,null,"Coincident"]
[null,null,"WEATHER CORRECTED MD 10% POE","MW","Non-coincident"]
[null,null,null,null,"Coincident"]
[null,null,"WEATHER CORRECTED MD 10% POE","MVA","Non-coincident"]
[null,null,null,null,"Coincident"]
[null,null,"WEATHER CORRECTED MD 50% POE","MW","Non-coincident"]
[null,null,null,null,"Coincident"]
[null,null,"WEATHER CORRECTED MD 50% POE","MVA","Non-coincident"]
[null,null,null,null,"Coincident"]
[null,"NSP to enter name","CONNECTION POINT RATING","MVA","Non-coincident"]
[null,null,null,null,"Coincident"]
[null,null,"WINTER/SUMMER PEAKING",null,"Non-coincident"]
[null,null,null,null,"Coincident"]
[null,null,"ADJUSTMENTS - EMBEDDED GENERATION","MW","Non-coincident"]
[null,null,null,null,"Coincident"]
[null,null,"WEATHER CORRECTED MD 10% POE","MW","Non-coincident"]
[null,null,null,null,"Coincident"]
[null,null,"WEATHER CORRECTED MD 10% POE","MVA","Non-coincident"]
[null,null,null,null,"Coincident"]
[null,null,"WEATHER CORRECTED MD 50% POE","MW","Non-coincident"]
[null,null,null,null,"Coincident"]
[null,null,"WEATHER CORRECTED MD 50% POE","MVA","Non-coincident"]
[null,null,null,null,"Coincident"]
[null,"NSP to enter name","CONNECTION POINT RATING","MVA","Non-coincident"]
[null,null,null,null,"Coincident"]
[null,null,"WINTER/SUMMER PEAKING",null,"Non-coincident"]
[null,null,null,null,"Coincident"]
[null,null,"ADJUSTMENTS - EMBEDDED GENERATION","MW","Non-coincident"]
[null,null,null,null,"Coincident"]
[null,null,"WEATHER CORRECTED MD 10% POE","MW","Non-coincident"]
[null,null,null,null,"Coincident"]
[null,null,"WEATHER CORRECTED MD 10% POE","MVA","Non-coincident"]
[null,null,null,null,"Coincident"]
[null,null,"WEATHER CORRECTED MD 50% POE","MW","Non-coincident"]
[null,null,null,null,"Coincident"]
[null,null,"WEATHER CORRECTED MD 50% POE","MVA","Non-coincident"]
[null,null,null,null,"Coincident"]
[null,"NSP to enter name","CONNECTION POINT RATING","MVA","Non-coincident"]
[null,null,null,null,"Coincident"]
[null,null,"WINTER/SUMMER PEAKING",null,"Non-coincident"]
[null,null,null,null,"Coincident"]
[null,null,"ADJUSTMENTS - EMBEDDED GENERATION","MW","Non-coincident"]
[null,null,null,null,"Coincident"]
[null,null,"WEATHER CORRECTED MD 10% POE","MW","Non-coincident"]
[null,null,null,null,"Coincident"]
[null,null,"WEATHER CORRECTED MD 10% POE","MVA","Non-coincident"]
[null,null,null,null,"Coincident"]
[null,null,"WEATHER CORRECTED MD 50% POE","MW","Non-coincident"]
[null,null,null,null,"Coincident"]
[null,null,"WEATHER CORRECTED MD 50% POE","MVA","Non-coincident"]
[null,null,null,null,"Coincident"]
[null,"NSP to enter name","CONNECTION POINT RATING","MVA","Non-coincident"]
[null,null,null,null,"Coincident"]
[null,null,"WINTER/SUMMER PEAKING",null,"Non-coincident"]
[null,null,null,null,"Coincident"]
[null,null,"ADJUSTMENTS - EMBEDDED GENERATION","MW","Non-coincident"]
[null,null,null,null,"Coincident"]
[null,null,"WEATHER CORRECTED MD 10% POE","MW","Non-coincident"]
[null,null,null,null,"Coincident"]
[null,null,"WEATHER CORRECTED MD 10% POE","MVA","Non-coincident"]
[null,null,null,null,"Coincident"]
[null,null,"WEATHER CORRECTED MD 50% POE","MW","Non-coincident"]
[null,null,null,null,"Coincident"]
[null,null,"WEATHER CORRECTED MD 50% POE","MVA","Non-coincident"]
[null,null,null,null,"Coincident"]
[null,"NSP to enter name","CONNECTION POINT RATING","MVA","Non-coincident"]
[null,null,null,null,"Coincident"]
[null,null,"WINTER/SUMMER PEAKING",null,"Non-coincident"]
[null,null,null,null,"Coincident"]
[null,null,"ADJUSTMENTS - EMBEDDED GENERATION","MW","Non-coincident"]
[null,null,null,null,"Coincident"]
[null,null,"WEATHER CORRECTED MD 10% POE","MW","Non-coincident"]
[null,null,null,null,"Coincident"]
[null,null,"WEATHER CORRECTED MD 10% POE","MVA","Non-coincident"]
[null,null,null,null,"Coincident"]
[null,null,"WEATHER CORRECTED MD 50% POE","MW","Non-coincident"]
[null,null,null,null,"Coincident"]
[null,null,"WEATHER CORRECTED MD 50% POE","MVA","Non-coincident"]
[null,null,null,null,"Coincident"]
[null,"NSP to enter name","CONNECTION POINT RATING","MVA","Non-coincident"]
[null,null,null,null,"Coincident"]
[null,null,"WINTER/SUMMER PEAKING",null,"Non-coincident"]
[null,null,null,null,"Coincident"]
[null,null,"ADJUSTMENTS - EMBEDDED GENERATION","MW","Non-coincident"]
[null,null,null,null,"Coincident"]
[null,null,"WEATHER CORRECTED MD 10% POE","MW","Non-coincident"]
[null,null,null,null,"Coincident"]
[null,null,"WEATHER CORRECTED MD 10% POE","MVA","Non-coincident"]
[null,null,null,null,"Coincident"]
[null,null,"WEATHER CORRECTED MD 50% POE","MW","Non-coincident"]
[null,null,null,null,"Coincident"]
[null,null,"WEATHER CORRECTED MD 50% POE","MVA","Non-coincident"]
[null,null,null,null,"Coincident"]
[null,"NSP to enter name","CONNECTION POINT RATING","MVA","Non-coincident"]
[null,null,null,null,"Coincident"]
[null,null,"WINTER/SUMMER PEAKING",null,"Non-coincident"]
[null,null,null,null,"Coincident"]
[null,null,"ADJUSTMENTS - EMBEDDED GENERATION","MW","Non-coincident"]
[null,null,null,null,"Coincident"]
[null,null,"WEATHER CORRECTED MD 10% POE","MW","Non-coincident"]
[null,null,null,null,"Coincident"]
[null,null,"WEATHER CORRECTED MD 10% POE","MVA","Non-coincident"]
[null,null,null,null,"Coincident"]
[null,null,"WEATHER CORRECTED MD 50% POE","MW","Non-coincident"]
[null,null,null,null,"Coincident"]
[null,null,"WEATHER CORRECTED MD 50% POE","MVA","Non-coincident"]
[null,null,null,null,"Coincident"]
[null,"NSP to enter name","CONNECTION POINT RATING","MVA","Non-coincident"]
[null,null,null,null,"Coincident"]
[null,null,"WINTER/SUMMER PEAKING",null,"Non-coincident"]
[null,null,null,null,"Coincident"]
[null,null,"ADJUSTMENTS - EMBEDDED GENERATION","MW","Non-coincident"]
[null,null,null,null,"Coincident"]
[null,null,"WEATHER CORRECTED MD 10% POE","MW","Non-coincident"]
[null,null,null,null,"Coincident"]
[null,null,"WEATHER CORRECTED MD 10% POE","MVA","Non-coincident"]
[null,null,null,null,"Coincident"]
[null,null,"WEATHER CORRECTED MD 50% POE","MW","Non-coincident"]
[null,null,null,null,"Coincident"]
[null,null,"WEATHER CORRECTED MD 50% POE","MVA","Non-coincident"]
[null,null,null,null,"Coincident"]
[null,"NSP to enter name","CONNECTION POINT RATING","MVA","Non-coincident"]
[null,null,null,null,"Coincident"]
[null,null,"WINTER/SUMMER PEAKING",null,"Non-coincident"]
[null,null,null,null,"Coincident"]
[null,null,"ADJUSTMENTS - EMBEDDED GENERATION","MW","Non-coincident"]
[null,null,null,null,"Coincident"]
[null,null,"WEATHER CORRECTED MD 10% POE","MW","Non-coincident"]
[null,null,null,null,"Coincident"]
[null,null,"WEATHER CORRECTED MD 10% POE","MVA","Non-coincident"]
[null,null,null,null,"Coincident"]
[null,null,"WEATHER CORRECTED MD 50% POE","MW","Non-coincident"]
[null,null,null,null,"Coincident"]
[null,null,"WEATHER CORRECTED MD 50% POE","MVA","Non-coincident"]
[null,null,null,null,"Coincident"]
[null,"NSP to enter name","CONNECTION POINT RATING","MVA","Non-coincident"]
[null,null,null,null,"Coincident"]
[null,null,"WINTER/SUMMER PEAKING",null,"Non-coincident"]
[null,null,null,null,"Coincident"]
[null,null,"ADJUSTMENTS - EMBEDDED GENERATION","MW","Non-coincident"]
[null,null,null,null,"Coincident"]
[null,null,"WEATHER CORRECTED MD 10% POE","MW","Non-coincident"]
[null,null,null,null,"Coincident"]
[null,null,"WEATHER CORRECTED MD 10% POE","MVA","Non-coincident"]
[null,null,null,null,"Coincident"]
[null,null,"WEATHER CORRECTED MD 50% POE","MW","Non-coincident"]
[null,null,null,null,"Coincident"]
[null,null,"WEATHER CORRECTED MD 50% POE","MVA","Non-coincident"]
[null,null,null,null,"Coincident"]
[null,"NSP to enter name","CONNECTION POINT RATING","MVA","Non-coincident"]
[null,null,null,null,"Coincident"]
[null,null,"WINTER/SUMMER PEAKING",null,"Non-coincident"]
[null,null,null,null,"Coincident"]
[null,null,"ADJUSTMENTS - EMBEDDED GENERATION","MW","Non-coincident"]
[null,null,null,null,"Coincident"]
[null,null,"WEATHER CORRECTED MD 10% POE","MW","Non-coincident"]
[null,null,null,null,"Coincident"]
[null,null,"WEATHER CORRECTED MD 10% POE","MVA","Non-coincident"]
[null,null,null,null,"Coincident"]
[null,null,"WEATHER CORRECTED MD 50% POE","MW","Non-coincident"]
[null,null,null,null,"Coincident"]
[null,null,"WEATHER CORRECTED MD 50% POE","MVA","Non-coincident"]
[null,null,null,null,"Coincident"]
[null,"NSP to enter name","CONNECTION POINT RATING","MVA","Non-coincident"]
[null,null,null,null,"Coincident"]
[null,null,"WINTER/SUMMER PEAKING",null,"Non-coincident"]
[null,null,null,null,"Coincident"]
[null,null,"ADJUSTMENTS - EMBEDDED GENERATION","MW","Non-coincident"]
[null,null,null,null,"Coincident"]
[null,null,"WEATHER CORRECTED MD 10% POE","MW","Non-coincident"]
[null,null,null,null,"Coincident"]
[null,null,"WEATHER CORRECTED MD 10% POE","MVA","Non-coincident"]
[null,null,null,null,"Coincident"]
[null,null,"WEATHER CORRECTED MD 50% POE","MW","Non-coincident"]
[null,null,null,null,"Coincident"]
[null,null,"WEATHER CORRECTED MD 50% POE","MVA","Non-coincident"]
[null,null,null,null,"Coincident"]
[null,"NSP to enter name","CONNECTION POINT RATING","MVA","Non-coincident"]
[null,null,null,null,"Coincident"]
[null,null,"WINTER/SUMMER PEAKING",null,"Non-coincident"]
[null,null,null,null,"Coincident"]
[null,null,"ADJUSTMENTS - EMBEDDED GENERATION","MW","Non-coincident"]
[null,null,null,null,"Coincident"]
[null,null,"WEATHER CORRECTED MD 10% POE","MW","Non-coincident"]
[null,null,null,null,"Coincident"]
[null,null,"WEATHER CORRECTED MD 10% POE","MVA","Non-coincident"]
[null,null,null,null,"Coincident"]
[null,null,"WEATHER CORRECTED MD 50% POE","MW","Non-coincident"]
[null,null,null,null,"Coincident"]
[null,null,"WEATHER CORRECTED MD 50% POE","MVA","Non-coincident"]
[null,null,null,null,"Coincident"]
[null,"NSP to enter name","CONNECTION POINT RATING","MVA","Non-coincident"]
[null,null,null,null,"Coincident"]
[null,null,"WINTER/SUMMER PEAKING",null,"Non-coincident"]
[null,null,null,null,"Coincident"]
[null,null,"ADJUSTMENTS - EMBEDDED GENERATION","MW","Non-coincident"]
[null,null,null,null,"Coincident"]
[null,null,"WEATHER CORRECTED MD 10% POE","MW","Non-coincident"]
[null,null,null,null,"Coincident"]
[null,null,"WEATHER CORRECTED MD 10% POE","MVA","Non-coincident"]
[null,null,null,null,"Coincident"]
[null,null,"WEATHER CORRECTED MD 50% POE","MW","Non-coincident"]
[null,null,null,null,"Coincident"]
[null,null,"WEATHER CORRECTED MD 50% POE","MVA","Non-coincident"]
[null,null,null,null,"Coincident"]
[null,"NSP to enter name","CONNECTION POINT RATING","MVA","Non-coincident"]
[null,null,null,null,"Coincident"]
[null,null,"WINTER/SUMMER PEAKING",null,"Non-coincident"]
[null,null,null,null,"Coincident"]
[null,null,"ADJUSTMENTS - EMBEDDED GENERATION","MW","Non-coincident"]
[null,null,null,null,"Coincident"]
[null,null,"WEATHER CORRECTED MD 10% POE","MW","Non-coincident"]
[null,null,null,null,"Coincident"]
[null,null,"WEATHER CORRECTED MD 10% POE","MVA","Non-coincident"]
[null,null,null,null,"Coincident"]
[null,null,"WEATHER CORRECTED MD 50% POE","MW","Non-coincident"]
[null,null,null,null,"Coincident"]
[null,null,"WEATHER CORRECTED MD 50% POE","MVA","Non-coincident"]
[null,null,null,null,"Coincident"]
[null,"NSP to enter name","CONNECTION POINT RATING","MVA","Non-coincident"]
[null,null,null,null,"Coincident"]
[null,null,"WINTER/SUMMER PEAKING",null,"Non-coincident"]
[null,null,null,null,"Coincident"]
[null,null,"ADJUSTMENTS - EMBEDDED GENERATION","MW","Non-coincident"]
[null,null,null,null,"Coincident"]
[null,null,"WEATHER CORRECTED MD 10% POE","MW","Non-coincident"]
[null,null,null,null,"Coincident"]
[null,null,"WEATHER CORRECTED MD 10% POE","MVA","Non-coincident"]
[null,null,null,null,"Coincident"]
[null,null,"WEATHER CORRECTED MD 50% POE","MW","Non-coincident"]
[null,null,null,null,"Coincident"]
[null,null,"WEATHER CORRECTED MD 50% POE","MVA","Non-coincident"]
[null,null,null,null,"Coincident"]
[null,"NSP to enter name","CONNECTION POINT RATING","MVA","Non-coincident"]
[null,null,null,null,"Coincident"]
[null,null,"WINTER/SUMMER PEAKING",null,"Non-coincident"]
[null,null,null,null,"Coincident"]
[null,null,"ADJUSTMENTS - EMBEDDED GENERATION","MW","Non-coincident"]
[null,null,null,null,"Coincident"]
[null,null,"WEATHER CORRECTED MD 10% POE","MW","Non-coincident"]
[null,null,null,null,"Coincident"]
[null,null,"WEATHER CORRECTED MD 10% POE","MVA","Non-coincident"]
[null,null,null,null,"Coincident"]
[null,null,"WEATHER CORRECTED MD 50% POE","MW","Non-coincident"]
[null,null,null,null,"Coincident"]
[null,null,"WEATHER CORRECTED MD 50% POE","MVA","Non-coincident"]
[null,null,null,null,"Coincident"]
[null,"NSP to enter name","CONNECTION POINT RATING","MVA","Non-coincident"]
[null,null,null,null,"Coincident"]
[null,null,"WINTER/SUMMER PEAKING",null,"Non-coincident"]
[null,null,null,null,"Coincident"]
[null,null,"ADJUSTMENTS - EMBEDDED GENERATION","MW","Non-coincident"]
[null,null,null,null,"Coincident"]
[null,null,"WEATHER CORRECTED MD 10% POE","MW","Non-coincident"]
[null,null,null,null,"Coincident"]
[null,null,"WEATHER CORRECTED MD 10% POE","MVA","Non-coincident"]
[null,null,null,null,"Coincident"]
[null,null,"WEATHER CORRECTED MD 50% POE","MW","Non-coincident"]
[null,null,null,null,"Coincident"]
[null,null,"WEATHER CORRECTED MD 50% POE","MVA","Non-coincident"]
[null,null,null,null,"Coincident"]
[null,"NSP to enter name","CONNECTION POINT RATING","MVA","Non-coincident"]
[null,null,null,null,"Coincident"]
[null,null,"WINTER/SUMMER PEAKING",null,"Non-coincident"]
[null,null,null,null,"Coincident"]
[null,null,"ADJUSTMENTS - EMBEDDED GENERATION","MW","Non-coincident"]
[null,null,null,null,"Coincident"]
[null,null,"WEATHER CORRECTED MD 10% POE","MW","Non-coincident"]
[null,null,null,null,"Coincident"]
[null,null,"WEATHER CORRECTED MD 10% POE","MVA","Non-coincident"]
[null,null,null,null,"Coincident"]
[null,null,"WEATHER CORRECTED MD 50% POE","MW","Non-coincident"]
[null,null,null,null,"Coincident"]
[null,null,"WEATHER CORRECTED MD 50% POE","MVA","Non-coincident"]
[null,null,null,null,"Coincident"]
[null,"NSP to enter name","CONNECTION POINT RATING","MVA","Non-coincident"]
[null,null,null,null,"Coincident"]
[null,null,"WINTER/SUMMER PEAKING",null,"Non-coincident"]
[null,null,null,null,"Coincident"]
[null,null,"ADJUSTMENTS - EMBEDDED GENERATION","MW","Non-coincident"]
[null,null,null,null,"Coincident"]
[null,null,"WEATHER CORRECTED MD 10% POE","MW","Non-coincident"]
[null,null,null,null,"Coincident"]
[null,null,"WEATHER CORRECTED MD 10% POE","MVA","Non-coincident"]
[null,null,null,null,"Coincident"]
[null,null,"WEATHER CORRECTED MD 50% POE","MW","Non-coincident"]
[null,null,null,null,"Coincident"]
[null,null,"WEATHER CORRECTED MD 50% POE","MVA","Non-coincident"]
[null,null,null,null,"Coincident"]
[null,"NSP to enter name","CONNECTION POINT RATING","MVA","Non-coincident"]
[null,null,null,null,"Coincident"]
[null,null,"WINTER/SUMMER PEAKING",null,"Non-coincident"]
[null,null,null,null,"Coincident"]
[null,null,"ADJUSTMENTS - EMBEDDED GENERATION","MW","Non-coincident"]
[null,null,null,null,"Coincident"]
[null,null,"WEATHER CORRECTED MD 10% POE","MW","Non-coincident"]
[null,null,null,null,"Coincident"]
[null,null,"WEATHER CORRECTED MD 10% POE","MVA","Non-coincident"]
[null,null,null,null,"Coincident"]
[null,null,"WEATHER CORRECTED MD 50% POE","MW","Non-coincident"]
[null,null,null,null,"Coincident"]
[null,null,"WEATHER CORRECTED MD 50% POE","MVA","Non-coincident"]
[null,null,null,null,"Coincident"]
[null,"NSP to enter name","CONNECTION POINT RATING","MVA","Non-coincident"]
[null,null,null,null,"Coincident"]
[null,null,"WINTER/SUMMER PEAKING",null,"Non-coincident"]
[null,null,null,null,"Coincident"]
[null,null,"ADJUSTMENTS - EMBEDDED GENERATION","MW","Non-coincident"]
[null,null,null,null,"Coincident"]
[null,null,"WEATHER CORRECTED MD 10% POE","MW","Non-coincident"]
[null,null,null,null,"Coincident"]
[null,null,"WEATHER CORRECTED MD 10% POE","MVA","Non-coincident"]
[null,null,null,null,"Coincident"]
[null,null,"WEATHER CORRECTED MD 50% POE","MW","Non-coincident"]
[null,null,null,null,"Coincident"]
[null,null,"WEATHER CORRECTED MD 50% POE","MVA","Non-coincident"]
[null,null,null,null,"Coincident"]
[null,"NSP to enter name","CONNECTION POINT RATING","MVA","Non-coincident"]
[null,null,null,null,"Coincident"]
[null,null,"WINTER/SUMMER PEAKING",null,"Non-coincident"]
[null,null,null,null,"Coincident"]
[null,null,"ADJUSTMENTS - EMBEDDED GENERATION","MW","Non-coincident"]
[null,null,null,null,"Coincident"]
[null,null,"WEATHER CORRECTED MD 10% POE","MW","Non-coincident"]
[null,null,null,null,"Coincident"]
[null,null,"WEATHER CORRECTED MD 10% POE","MVA","Non-coincident"]
[null,null,null,null,"Coincident"]
[null,null,"WEATHER CORRECTED MD 50% POE","MW","Non-coincident"]
[null,null,null,null,"Coincident"]
[null,null,"WEATHER CORRECTED MD 50% POE","MVA","Non-coincident"]
[null,null,null,null,"Coincident"]
[null,"NSP to enter name","CONNECTION POINT RATING","MVA","Non-coincident"]
[null,null,null,null,"Coincident"]
[null,null,"WINTER/SUMMER PEAKING",null,"Non-coincident"]
[null,null,null,null,"Coincident"]
[null,null,"ADJUSTMENTS - EMBEDDED GENERATION","MW","Non-coincident"]
[null,null,null,null,"Coincident"]
[null,null,"WEATHER CORRECTED MD 10% POE","MW","Non-coincident"]
[null,null,null,null,"Coincident"]
[null,null,"WEATHER CORRECTED MD 10% POE","MVA","Non-coincident"]
[null,null,null,null,"Coincident"]
[null,null,"WEATHER CORRECTED MD 50% POE","MW","Non-coincident"]
[null,null,null,null,"Coincident"]
[null,null,"WEATHER CORRECTED MD 50% POE","MVA","Non-coincident"]
[null,null,null,null,"Coincident"]

{"sheet":"7.1  Policies and Procedures","index":30,"n_rows":225,"n_cols":5,"rows_kept":225,"cut":false,"hidden":false,"merged":[[7,1,7,3],[10,1,11,1],[12,1,12,4],[16,1,16,4],[34,1,34,4],[38,1,38,4],[39,1,39,4],[42,1,42,4],[47,1,47,4],[71,1,71,4],[207,1,207,4],[212,1,212,4],[223,1,223,4],[76,1,76,4],[156,1,156,4],[161,1,161,4],[198,1,198,4],[202,1,202,4]]}
[null,{"$f":"(LOOKUP(dms_Model,dms_Model_List,dms_Worksheet_List))","v":"REGULATORY REPORTING STATEMENT"}]
[null,{"$f":"INDEX(dms_TradingNameFull_List,MATCH(dms_TradingName,dms_TradingName_List))","v":"Queensland Electricity Transmission Corporation Limited trading as Powerlink Queensland"}]
[null,{"$f":"IF(SUM(dms_SingleYear_Model)>0,CRY,CONCATENATE(FRCP_y1,\" to \",dms_MultiYear_FinalYear_Result))","v":"2022-23 to 2026-27"}]
[null,"7.1  PLANS, POLICIES, PROCEDURES AND STRATEGIES"]
[]
[]
[null,"Instructions"]
[null,{"$f":"CONCATENATE(dms_TradingName, \" must list and provide a brief description of key internal plans, \"&\"policies, procedures or strategies that are used by it to plan and conduct its day to day operations and that have been relied upon in the development of its regulatory proposal. \"&dms_TradingName,\" must identify any internal plans, policies, procedures and strategies that have changed in the current regulatory control period \"&\"or that are expected to change before the next regulatory control period where the change has been identified as a step change.\")","v":"Powerlink must list and provide a brief description of key internal plans, policies, procedures or strategies that are used by it to plan and conduct its day to day operations and that have been relied upon in the development of its regulatory proposal. Powerlink must identify any internal plans, policies, procedures and strategies that have changed in the current regulatory control period or that are expected to change before the next regulatory control period where the change has been identified as a step change."}]
[]
[null,"7.1.1 - PLANS, POLICIES, PROCEDURES AND STRATEGIES"]
[null,null,"Brief description","Relevance to regulatory proposal","Expenditure impact"]
[null,null,"Description of the plan, policy, procedure or strategy.","Identify the element of the proposal/supporting documents that the policy, plan, procedure or strategy is relevant to e.g. replacement capex, capacity utilisation thresholds, opex ","Is this policy, plan or procedure identified in the response to section 4 'Step Changes' of the notice (yes or no)?"]
[null,"Corporate"]
[null,"Statement of Corporate Intent 2019/20","Statement of the strategic intent and performance objectives for Powerlink in the most recent full financial year.","Forecast capital expenditure\nForecast operating expenditure","No"]
[]
[]
[null,"Governance framework"]
[null,"Asset Management Framework","Defines the asset management framework for network assets.","Forecast capital expenditure\nForecast operating expenditure","No"]
[null,"Asset Management Policy ","Sets out the direction and framework for the sustainable management of all network and non-network assets.","Forecast capital expenditure\nForecast operating expenditure","No"]
[]
[]
[]
[]
[]
[]
[]
[]
[]
[]
[]
[]
[]
[]
[]
[null,"Accounting policies, procedures and methodologies (including a capitalisation policy, depreciation policy and an approved expenditure allocation methodology)"]
[null,"Depreciation of Fixed Assets","Sets out the approach to depreciation (methodology and assignment of useful life) for fixed assets.","Forecast depreciation","No"]
[null,"Powerlink Cost Allocation Methodology","Sets out Powerlink’s methodology for attributing costs to, or allocating costs between or within prescribed, negotiated and other non-regulated transmission services.","Revenue Proposal","No"]
[null,"Property Plant & Equipment - Recognition","Sets out the policies and procedures for capitalisation of asset expenditure","Forecast capital expenditure\nForecast operating expenditure","No"]
[null,"Asset management plan or equivalent documentation"]
[null,"Asset Management Policies"]
[null,"Asset Management Framework","Defines the asset management framework for network assets.","Forecast capital expenditure\nForecast operating expenditure","No"]
[null,"Asset Management Policy","Sets out the direction and framework for the sustainable management of all network and non-network assets.","Forecast capital expenditure\nForecast operating expenditure","No"]
[null,"Asset Management Strategies"]
[null,"Asset Management Strategy","Outlines the asset management strategy applied over the life cycle of network assets.","Forecast capital expenditure\nForecast operating expenditure","No"]
[]
[]
[]
[null,"Asset Management Plans"]
[null,"Asset Management Plan Volume 1 (Overview)","Overview of Powerlink's asset management planning process.","Forecast capital expenditure\nForecast operating expenditure","No"]
[null,"Asset Management Plan Volume 2 (Investment Outlook)","Summary of the outcomes from Powerlink's asset management planning process.","Forecast capital expenditure\nForecast operating expenditure","No"]
[null,"Asset Management Plan Volume 3 (Area Plan)","Detailed descriptions of Powerlink's area planning analysis and recommendations","Forecast capital expenditure\nForecast operating expenditure","No"]
[null,"Bushfire Mitigation Plan","Outlines the approach to bushfire mitigation that considers the resources and responses needed to manage risks associated with bushfires","Forecast capital expenditure\nForecast operating expenditure","No"]
[null,"Facilities Asset Management Plan","Sets out Powerlink's approach to management of commercial buildings and facilities.","Forecast capital expenditure\nForecast operating expenditure","No"]
[null,"Fleet Asset Management Plan","Sets out Powerlink's approach to the management of motor vehicle assets.","Forecast capital expenditure\nForecast operating expenditure","No"]
[null,"Operational Technology Asset Strategy 2020-2027","Outlines the approach to asset management for Operational Technology systems.","Forecast capital expenditure","No"]
[null,"Operational Technology Business Strategy 2020-2027","Outlines strategic initiatives for Operational Technology (OT) systems","Forecast capital expenditure","No"]
[null,"Operational Technology Development Plan 2020-2027","Outlines development plans for Operational Technology","Forecast capital expenditure","No"]
[null,"Secondary Systems Asset Strategy 2020-2027","Outlines the approach to asset management for Secondary systems","Forecast capital expenditure","No"]
[null,"Secondary Systems Business Strategy 2020-2027","Outlines strategic initiatives for Secondary Systems.","Forecast capital expenditure","No"]
[null,"Telecommunications Asset Strategy 2020-2027","Outlines the approach to asset management for Telecommunications systems.","Forecast capital expenditure","No"]
[null,"Telecommunications Business Strategy 2020-2027","Outlines strategic initiatives for Telecommunications systems.","Forecast capital expenditure","No"]
[null,"Transmission Annual Planning Report 2020","Provides information to interested stakeholders on the planning and development of the Queensland transmission network.","Forecast capital expenditure\nForecast operating expenditure","No"]
[]
[]
[]
[]
[]
[]
[]
[]
[]
[null,"Capital expenditure policies and procedures (including capex approval policies and procedures and replacement policy) "]
[null,"Capital Network Investment Approval – Guideline","Provides a high level overview of regulated network capital project approval process.","Forecast capital expenditure","No"]
[]
[]
[]
[null,"Internal standards for network planning, design, maintenance and operation"]
[null,"Asset End of Life Strategy","Establishes the overarching approach to network assets which have reached end of life.","Forecast capital expenditure\nForecast operating expenditure","No"]
[null,"Asset Maintenance Standard","Establishes the overarching approach to maintenance needs, plans and work.","Forecast operating expenditure","No"]
[null,"Asset Planning Criteria Framework","Outlines the criteria Powerlink applies in planning of the transmission network.","Forecast capital expenditure","No"]
[null,"Asset Refurbishment Standard","Establishes the overarching approach to operational refurbishment needs, plans & projects. ","Forecast operating expenditure","No"]
[null,"Asset Reinvestment Criteria Framework","Establishes the basis on which Powerlink idenditifes assets which require reinvestment.","Forecast capital expenditure\nForecast operating expenditure","No"]
[null,"Digital Asset Management ","Sets out the whole of life asset management philosophy for Powerlink’s Digital assets.","Forecast capital expenditure\nForecast operating expenditure","No"]
[null,"HV Underground Cable Asset Methodology","Sets out the whole of life asset management philosophy for Powerlink’s HV underground cable assets.","Forecast capital expenditure\nForecast operating expenditure","No"]
[null,"Joint Planning Framework","Outlines Powerlink's approach to jointly plan the network with other TNSPs, DNSPs and EAMO","Forecast capital expenditure","No"]
[null,"Land Asset Methodology ","Sets out the whole of life asset management philosophy for Powerlink’s Land assets.","Forecast capital expenditure\nForecast operating expenditure","No"]
[null,"Substation Asset Methodology ","Sets out the whole of life asset management philosophy for Powerlink’s Substation assets.","Forecast capital expenditure\nForecast operating expenditure","No"]
[null,"Transmission Line Asset Methodology ","Sets out the whole of life asset management philosophy for Powerlink’s Transmission Line assets.","Forecast capital expenditure\nForecast operating expenditure","No"]
[]
[]
[]
[]
[]
[]
[]
[]
[]
[]
[]
[]
[]
[]
[]
[]
[]
[]
[]
[]
[]
[]
[]
[]
[]
[]
[]
[]
[]
[]
[]
[]
[]
[]
[]
[]
[]
[]
[]
[]
[]
[]
[]
[]
[]
[]
[]
[]
[]
[]
[]
[]
[]
[]
[]
[]
[]
[]
[]
[]
[]
[]
[]
[]
[]
[]
[]
[]
[null,"Procurement and contracting out policies"]
[null,"Procurement standard","Describes approach to procurement practices.","Forecast capital expenditure\nForecast operating expenditure","No"]
[]
[]
[]
[null,"Information technology policies or strategies"]
[null,"IT Plan 2023-27","Sets out Powerlink's proposed IT investments in the 2023-27 regulatory period.","Forecast capital expenditure\nForecast operating expenditure","No"]
[]
[]
[]
[]
[]
[]
[]
[]
[]
[]
[]
[]
[]
[]
[]
[]
[]
[]
[]
[]
[]
[]
[]
[]
[]
[]
[]
[]
[]
[]
[]
[]
[]
[]
[]
[null,"Demand management policies or strategies"]
[null,"Transmission Annual Planning Report 2020","Provides information to interested parties on network developments and potential opportunities for provision of demand management solutions.","Forecast capital expenditure\nForecast operating expenditure","No"]
[]
[]
[null,"Self insurance guidelines or policy"]
[null,"Marsh - Insurance Projections ","Sets out Powerlink's independent advice on self insurance requirements for the 2023-27 regulatory period.","Forecast operating expenditure","No"]
[]
[]
[]
[null,"Land and easement acquisition polices"]
[null,"Powerlink - Strategic Network Land Acquisition – Strategy","Develops a practical framework for establishing Powerlink’s land acquisition requirements ","Forecast capital expenditure","No"]
[null,"Powerlink - Understanding Designation for Transmission Line Infrastructure","Sets out process and requirements for community infrastructure designation","Forecast capital expenditure","No"]
[null,"Powerlink - Understanding resumptions for Transmission Line Infrastructure","Sets out process and requirements for resumption of land and easements","Forecast capital expenditure","No"]
[]
[null,"Asset security plans and policies"]
[null,"Information Security Strategy","Outlines Powerlink’s security drivers and strategy in regard to information security. ","Forecast capital expenditure","No"]
[null,"Security Management - Framework","Describes how Powerlink applies security to its business operations and transmission services. ","Forecast capital expenditure\nForecast operating expenditure","No"]
[]
[]
[]
[]
[]
[]
[]
[]
[null,"Disaster recovery policy"]
[null,"Business resilience policy","Sets out Powerlink's approach to proactively plan for and management the impact of emergencies and natural disasters to the transmission network and its business operations.","Forecast capital expenditure\nForecast operating expenditure","No"]

{"sheet":"7.2 Contingent projects","index":31,"n_rows":31,"n_cols":6,"rows_kept":31,"cut":false,"hidden":false,"merged":[[3,1,3,5],[7,1,7,3]]}
[null,{"$f":"(LOOKUP(dms_Model,dms_Model_List,dms_Worksheet_List))","v":"REGULATORY REPORTING STATEMENT"}]
[null,{"$f":"INDEX(dms_TradingNameFull_List,MATCH(dms_TradingName,dms_TradingName_List))","v":"Queensland Electricity Transmission Corporation Limited trading as Powerlink Queensland"}]
[null,{"$f":"IF(SUM(dms_SingleYear_Model)>0,CRY,CONCATENATE(FRCP_y1,\" to \",dms_MultiYear_FinalYear_Result))","v":"2022-23 to 2026-27"}]
[null,"7.2 CONTINGENT PROJECTS"]
[]
[]
[null,"Instructions"]
[null,{"$f":"CONCATENATE(dms_TradingName,\" is required to populate all input cells (yellow) in table 7.2.1 presented below. Additional rows may be added by \",dms_TradingName,\"  if required.\"\n\n\n\n)","v":"Powerlink is required to populate all input cells (yellow) in table 7.2.1 presented below. Additional rows may be added by Powerlink  if required."}]
[]
[null,"7.2.1 - PROPOSED CONTINGENT PROJECTS FOR THE FORTHCOMING REGULATORY CONTROL PERIOD"]
[null,"Proposed contingent project name","Proposed contingent capital expenditure \n($0's, nominal)","Proposed trigger events",{"$f":"CONCATENATE(\"Proposed MAR for \", FRCP_y1,\" \n($0's, nominal)\")","v":"Proposed MAR for 2022-23 \n($0's, nominal)"},{"$f":"CONCATENATE(\"5 per cent of the \", FRCP_y1,\" ($0's, nominal) MAR\")","v":"5 per cent of the 2022-23 ($0's, nominal) MAR"}]
[null,"Central to North Queensland Reinforcement",57183516.084526785,"• commitment of additional load in excess of 250 MW to be connected to the Central West and/or North Queensland zones that requires the dispatch of higher cost generation in northern Queensland to maintain power transfers within limits ;\n• successful completion of the RIT-T, including a comprehensive assessment of credible options, that demonstrates a network investment by Powerlink maximises the net market benefits while meeting Powerlink’s reliability of supply obligations to North Queensland; and\n• Powerlink Board commitment to proceed with the project subject to the AER amending Powerlink’s revenue determination pursuant to the Rules.",689657739.26308596,{"$f":"+E12*0.05","v":34482886.963154301}]
[null,null,null,null,{"$f":"+$E$12","v":689657739.26308596},34482886.963154301]
[null,null,null,null,689657739.26308596,34482886.963154301]
[null,null,null,null,689657739.26308596,34482886.963154301]
[null,null,null,null,689657739.26308596,34482886.963154301]
[null,null,null,null,689657739.26308596,34482886.963154301]
[null,null,null,null,689657739.26308596,34482886.963154301]
[null,null,null,null,689657739.26308596,34482886.963154301]
[null,null,null,null,689657739.26308596,34482886.963154301]
[null,null,null,null,689657739.26308596,34482886.963154301]
[null,null,null,null,689657739.26308596,34482886.963154301]
[null,null,null,null,689657739.26308596,34482886.963154301]
[null,null,null,null,689657739.26308596,34482886.963154301]
[null,null,null,null,689657739.26308596,34482886.963154301]
[null,null,null,null,689657739.26308596,34482886.963154301]
[null,null,null,null,689657739.26308596,34482886.963154301]
[null,null,null,null,689657739.26308596,34482886.963154301]
[null,null,null,null,689657739.26308596,34482886.963154301]
[null,null,null,null,689657739.26308596,34482886.963154301]
[null,null,null,null,689657739.26308596,34482886.963154301]

{"sheet":"7.3 Obligations","index":32,"n_rows":302,"n_cols":5,"rows_kept":302,"cut":false,"hidden":false,"merged":[[3,1,3,4],[5,1,5,2],[8,1,8,2],[12,1,13,1]]}
[null,{"$f":"(LOOKUP(dms_Model,dms_Model_List,dms_Worksheet_List))","v":"REGULATORY REPORTING STATEMENT"}]
[null,{"$f":"INDEX(dms_TradingNameFull_List,MATCH(dms_TradingName,dms_TradingName_List))","v":"Queensland Electricity Transmission Corporation Limited trading as Powerlink Queensland"}]
[null,{"$f":"IF(SUM(dms_SingleYear_Model)>0,CRY,CONCATENATE(FRCP_y1,\" to \",dms_MultiYear_FinalYear_Result))","v":"2022-23 to 2026-27"}]
[null,"7.3  OBLIGATIONS, REQUIREMENTS & STANDARDS"]
[]
[null,"There is ONE table on this worksheet. It has been sub-grouped for ease of navigation. See the Instructions sheet on how to group or ungroup data."]
[]
[null,"Instructions"]
[null,{"$f":"CONCATENATE(\"Outline those obligations and requirements that \",dms_TradingName, \" identifies as having a material impact on expenditure requirements.\")","v":"Outline those obligations and requirements that Powerlink identifies as having a material impact on expenditure requirements."}]
[]
[]
[null,"7.3.1 - OBLIGATIONS OR REQUIREMENTS"]
[null,null,"Brief description","Relevance to regulatory proposal","Expenditure impact"]
[null,null,"Description of relevant obligations or requirements within the instrument (e.g. safety obligations, reliability targets) ","Identify what element of the proposal/supporting documents the obligation or requirement is relevant to e.g. replacement capex, capacity utilisation thresholds, opex ","Is the obligation or requirement identified in the response to section 4 'Step Changes' of the notice (yes or no)?"]
[null,"Legislation"]
[null,"Aboriginal Cultural Heritage Act 2003(Qld)","This Act provides a framework for the recognition, protection and conservation of Aboriginal cultural heritage which includes an obligation to avoid harm to cultural heritage which applies to Powerlink's activities related to the construction, operation and maintenance of transmission network infrastructure. \n","Forecast capital expenditure\nForecast operating expenditure","No"]
[null,"Acquisition of Land Act 1967 (Qld) and associated regulation","This Act relates to the acquisition of land or an interest in land which includes an easement for electricity works and the payment of compensation to the interest holders of the land over which an easement or other interest is taken.","Forecast capital expenditure","No"]
[null,"Anti-Discrimination Act 1991 (Qld) \nAge Discrimination Act 2004 (Cth)\nDisability Discrimination Act 1992 (Cth)\nRacial Discrimination Act 1975 (Cth)\nSex Discrimination Act 1984 (Cth) \n","These laws provide the framework to protect people from unfair discrimination and other objectionable conduct and applies to Powerlink as an employer.","Forecast operating expenditure","No"]
[null,"Biosecurity Act 2014 (Qld) and associated regulation\n\n\n\n\n\n","This Acts provides a framework for managing biosecurity risks that Powerlink must apply when constructing, operating and maintaining transmission infrastructure and for reporting and notifying of incidents. ","Forecast capital expenditure\nForecast operating expenditure","No"]
[null,"Civil Aviation Act 1998 (Cth) and associated regulations","This Act regulates the safe operation of aircraft (including drones) and aerial work (including helicopter flight operations). It provides a system of licensing and operational requirements and applies to Powerlink inspection of its transmission infrastructure network. ","Forecast operating expenditure","No"]
[null,"Coastal Protection and Management Act 1995 (Qld) ","This Act provdies a framework for the protection, conservation and management of the Queensland coast and its resources and applies to certain Powerlink activities carried out in those areas or impacting on tidal waters and associated resources. ","Forecast capital expenditure\nForecast operating expenditure","No"]
[null,"Corporations Act 2001 (Cth)","This Act includes a corporate sector whistleblower protection regime for whistleblowers who report misconduct about companies and company officers. Companies are required to have a whistleblower policy and apply particular processes including protections of whistleblowers. The regime applies to Powerlink.","Forecast operating expenditure","No"]
[null,"Crime and Corruption Act\n2001 (Qld)","This Act provides a framework for the management and notification of complaints of suspected corrupt conduct. ","Forecast operating expenditure","No"]
[null,"Economic Development Act 2012 (Qld) ","This Act facilitates economic development and development for community purposes which regulates development in declared priority development areas (PDAs). Development of Powerlink's network infrastructure in PDAs is subject to requirements and approval.","Forecast capital expenditure\nForecast operating expenditure","No"]
[null,"Electrical Safety Act 2002 (Qld)","This Act sets out compliance obligations for electricity entities to ensure electricity works are operated in a way that is electrically safe.  This includes requirements that Powerlink inspects, tests and maintains its works.","Forecast capital expenditure\nForecast operating expenditure","No"]
[null,"Electrical Safety Regulation 2013 (Qld)","This Regulation sets out the more detailed requirements for how an electricity entity complies with the Electrical Safety Act. ","Forecast capital expenditure\nForecast operating expenditure","No"]
[null,"Electricity Act 1994 (Qld)","This Act includes the following key obligations: (a) comply with technical conditions for operating the transmission grid in the transmission authority area, regulations and National Electricity Law and Rules; (b) must properly take into account the environmental impacts of its activities; (c) pay the amounts required under the authority or the regulations for administering the authority and its conditions; (d) must also pay an annual fee that is a proportion of the cost of the State’s funding commitments to national energy market regulation (AEMC Levy).\n","Forecast capital expenditure\nForecast operating expenditure","No"]
[null,"Electricity Regulation 2006 (Qld)","This Regulation is focused on ensuring a secure, efficient and economic supply of electricity to customers on fair and reasonable terms, ensuring customers' interests are adequately protected, provide for proper measurement and information provision regarding the energy efficiency and performance of electrical equipment and prescribes particular conditions of employees in the government owned electricity industry.","Forecast capital expenditure\nForecast operating expenditure","No"]
[null,"Electricity—National Scheme (Queensland) Act 1997 and the National Electricity Law (NEL)","Electricity transmission entities have a large number of obligations under the NEL. The most significant obligations are to: register with AEMO as a \"Registered Participant\"; comply with the transmission determination that applies to the electricity transmission network services provided; provide the AER with the necessary information or prepare, maintain or keep the information as is requested by the AER in either a \"relevant notice\" or a \"regulatory information instrument\"; provide information to the AER for the purpose of the preparation of a NSP's performance or financial report; comply with the guidelines established by AEMO in relation to the shedding and restoration of loads in order to ensure the safety and security of the National Electricity System; comply with a wide range of obligations relating to the determination and resolution of access disputes, as well as to the restrictions on, variation of and compliance with access determinations; and comply with the general obligation not to prevent or hinder the access of another person to a regulated network service.","Revenue Proposal","No"]
[null,"Environment Protection and Biodiversity Conservation Act 1999 (Cth) and associated regulation","This Act provides a framework to protect and manage matters of national environmental significance (MNES) which includes assessment and approval processes for activities that may impact on MNES as part of developing and constructing transmission network infrastructure.","Forecast capital expenditure\nForecast operating expenditure","No"]
[null,"Environmental Offsets Act 2014 (Qld) and associated subordinate legislation","This Act provides a framework for coordinating the assessment and implementation of environmental offsets for activities that impact on prescribed environmental matters under a range of legislation.","Forecast capital expenditure\nForecast operating expenditure","No"]
[null,"Environmental Protection Act 1994 (Qld) and subordinate legislation ","This Act sets out the obligations for the management of impacts to the environment to avoid harm that apply when constructing, operating and maintaining network infrastructure or related operations. The Act is supported by subordinate legislation which prescribes processes for environmental authorities and environment protection policies for specific environmental aspects.\n","Forecast capital expenditure\nForecast operating expenditure","No"]
[null,"Fair Work Act 2009 (Cth) and associated regulation","This Act provides a framework for cooperative workplace relations and establishes minimum terms and conditions of employment and rights and obligations for employers and employees. ","Forecast capital expenditure\nForecast operating expenditure","No"]
[null,"Fisheries Act 1994 (Qld) and associated regulation","This Act provides a framework to ensure fisheries resources are used in an ecologically sustainble way. Development of Powerlink's network in fish habitat areas or impacting marine plants is subject to requirements and approval. ","Forecast capital expenditure\nForecast operating expenditure","No"]
[null,"Forestry Act 1959 (Qld) ","This Act regulates Timber Reserves and State Forests to preserve them for timber production. Powerlink must obtain a permit to occupy these areas and approval to interfere with forest products as part of construction, operation and maintainenance of the network infrastructure. ","Forecast capital expenditure\nForecast operating expenditure","No"]
[null,"Great Barrier Reef Marine Park Act 1975 (Cth) ","This Act regulates activities in the marine park in the Great Barrier Reef region and applies to Powerlink activities related to the construction of transmission network infrastructure in marine park zones.","Forecast capital expenditure\nForecast operating expenditure","No"]
[null,"Heavy Vehicle National Law Act 2012 (Qld) and associated regulations","This Law is a national scheme for regulating the use of heavy vehicles on roads to ensure public safety, impact minimisation, promote productivity and safe business practices, including chain of resonsiblity obligations that applies to parties with a level of control or influence of heavy vehicles and associted processes.","Forecast capital expenditure\nForecast operating expenditure","No"]
[null,"Human Rights Act 2019 (Qld)","This Act establishes a framework for the protection of human rights in public sector decision making which requires all Powerlink decisions give appropriate consideration to potentially impacted human rights.","Forecast capital expenditure\nForecast operating expenditure","No"]
[null,"Income Tax Assessment Act 1997","This Act establishes obligations for corporations to pay income tax as assessed.","Maximum Allowed Revenue","No"]
[null,"Land Act 1994 (Qld)","This Act sets out a range of legal obligations and processes related to the registration and administration of easements.","Forecast capital expenditure\nForecast operating expenditure","No"]
[null,"Land Regulation 2020 (Qld)","This Regulation sets out the obligations under the Land Act relating to the issuing and managing of Trustee issued leases and permits to third parties.","Forecast capital expenditure\nForecast operating expenditure","No"]
[null,"Land Title Act 1994 (Qld)","This Act relates to the registration and administration of easements and are broadly similar to its obligations under the Land Act 1994. ","Forecast capital expenditure\nForecast operating expenditure","No"]
[null,"Marine Parks Act 2004 (Qld) ","This Act provides a regulatory framework for multi-use management to allow certain activties to occur in marine parks and applies to Powerlink activities related to the construction and maintenance of the transmission network infrastructure in marine parks.","Forecast capital expenditure\nForecast operating expenditure","No"]
[null,"Modern Slavery Act 2018 (Cth) ","This Act requires entities based, or operating, in Australia, which have an annual consolidated revenue of more than $100 million, to report annually on the risks of modern slavery in their operations and supply chains, and actions to address those risks.","Forecast capital expenditure\nForecast operating expenditure","No"]
[null,"National Greenhouse and Energy Reporting Act 2007 (Cth) and associated regulation","This Act establishes a single national reporting framework for the reporting and dissemination of information related to greenhouse gas emissions, projects, energy consumption and energy production of businesses.","Forecast operating expenditure","No"]
[null,"Nature Conservation Act 1992 (Qld) and subordinate legislation","This Act and related subordinate legislation sets out the protected area, protected plants and protected animals framework under which Powerlink may obtain permission to construct, operate and maintain network infrastructure within protected areas and the requirements for taking a protected plant and impacts to protected animals.\n","Forecast capital expenditure\nForecast operating expenditure","No"]
[null,"Ozone Protection and Synthetic Greenhouse Gas Management Act 1989 (Cth) and associated subordinate legislation","This Act provides a framework to control the manufacture, import, export, use and disposal of ozone depleting substances and synthetic greenhouse gases and products containing these gases. Approval processes apply to Powerlink’s SF6 reprocessing plant processes for recovery, storage, conditioning and dispensing of SF6 gas recovered from insulated HV Gas Insulated Switchgear (GIS), bus ducts, circuit breakers and other devices or instruments containing SF6 gas.","Forecast operating expenditure","No"]
[null,"Planning Act 2016 (Qld) and associated regulation","This Act provides a framework for the integration of planning, environment and development assessment requirements at the local, regional and State levels. The Act provides for the Infrastructure Designation process for the development of Powerlink's network infrastructure.","Forecast capital expenditure","No"]
[null,"Radiocommunications Act 1992 (Cth) and associated regulations","This Act provides for the regulation of the radiofrequency spectrum. It provides a system of licensing for commercial use of spectrum (including microwaves in communication systems). ","Forecast operating expenditure","No"]
[null,"Security of Critical Infrastructure Act 2018 (Cth)  and the Security of Critical Infrastructure Rules 2018 (Cth) ","This Act establishes a regime to manage national security risks from foreign involvement in Australia’s critical infrastructure. The related rules prescribe critical infrastructure assets which includes Powerlink's transmission infrastructure network and provides further information requirements for reporting.","Forecast capital expenditure\nForecast operating expenditure","No"]
[null,"Vegetation Management Act 1999 (Qld) and associated regulation","This Act sets out requirements for the clearing, conservation and management of native vegetation related to Powerlink constructing, operating and maintaining its transmission network infrastructure.","Forecast capital expenditure\nForecast operating expenditure","No"]
[null,"Waste Reduction and Recycling Act 2011 (Qld) and associated regulation ","This Act provides a framework for waste management and applies to Powerlink potential waste types that may be generated at a Powerlink facility or operation, or a result of construction of transmission network infrastructure.","Forecast capital expenditure\nForecast operating expenditure","No"]
[null,"Water Act 2000 (Qld) and associated regulation","This Act provides a framework for managing water use and activities that may impact on water resources that apply to Powerlink activities related to the construction of transmission network infrastructure. ","Forecast capital expenditure\nForecast operating expenditure","No"]
[null,"Wet Tropics World Heritage Protection and Management Act 1993 (Qld) and associated subordinate legislation","This Act regulates activities in the wet tropics area and applies to Powerlink as part of construction and maintenance of the network infrastructure in the wet tropics area. ","Forecast capital expenditure\nForecast operating expenditure","No"]
[null,"Work  Health and Safety Regulation 2011 (Qld)","The Regulation sets out the legal requirements to eliminate, minimise or control workplace risks.","Forecast capital expenditure\nForecast operating expenditure","No"]
[null,"Work Health and Safety Act 2011(Qld)","This Act sets out the requirements for Powerlink to maintain appropriate health and safety standards to ensure the safety of its employees and other persons.  \n","Forecast capital expenditure\nForecast operating expenditure","No"]
[]
[]
[]
[]
[]
[]
[]
[]
[]
[]
[]
[]
[]
[]
[]
[]
[]
[]
[]
[]
[]
[]
[]
[]
[]
[]
[]
[]
[]
[]
[]
[]
[]
[]
[]
[]
[]
[]
[]
[]
[]
[]
[]
[]
[]
[]
[]
[]
[]
[]
[]
[]
[]
[]
[]
[]
[]
[]
[]
[]
[]
[]
[]
[]
[]
[]
[]
[]
[]
[]
[]
[]
[]
[]
[]
[]
[]
[]
[]
[]
[]
[]
[]
[]
[]
[]
[]
[]
[]
[]
[]
[]
[]
[]
[]
[]
[]
[]
[]
[]
[]
[]
[]
[]
[]
[]
[]
[]
[]
[]
[]
[]
[]
[]
[]
[]
[]
[]
[]
[]
[]
[]
[]
[]
[]
[]
[]
[]
[]
[]
[]
[]
[]
[]
[]
[]
[]
[]
[]
[]
[]
[]
[]
[]
[]
[]
[]
[]
[]
[]
[]
[]
[]
[]
[]
[]
[]
[]
[]
[]
[]
[]
[]
[]
[]
[]
[]
[]
[]
[]
[null,"Licences"]
[null,"Electricity Act 1994 (Qld)","Powerlink's Transmission Authority sets out the licence obligations and reliability standard to which Powerlink must comply.","Forecast capital expenditure\nForecast operating expenditure","No"]
[]
[]
[]
[null,"Rules"]
[null,"National Electricity Rules\n","The Rules contain provisions that impose specific obligations on the different entities that operate within the electricity industry.  TNSPs, such as Powerlink, have a number of obligations under the Rules which apply to different parts of their operations, including registration as a NSP, technical standards of operation, network connections, economic regulation and metering.","Revenue Proposal","No"]
[]
[]
[]
[null,"Orders"]
[null,"Nil"]
[]
[]
[null,"Codes"]
[null,"Accepted Development Vegetation Clearing Code \nClearing for Infrastructure (Qld)","This Code regulates the clearing of certain categories of remnant vegetation and allows certain infrastrucuture development, including transmission infrastructure, to occur without assessment provided it meets the requirements of the Code.","Forecast capital expenditure\nForecast operating expenditure","No"]
[null,"Code of Practice - Maintenance of Electricity Corridors in Queensland's Parks and Forest (Qld) ","This Code sets out the processes and requirements for maintaining transmission infrasturcutre in Parks and Forests and in the Wet Tropics of Queensland World Heritage Area.","Forecast capital expenditure\nForecast operating expenditure","No"]
[null,"Code of Practice 2011 How to Manage and Control Asbestos in the Workplace (Qld)","This Code sets out practices to control the risks of asbestos-containing materials in workplaces.  ","Forecast capital expenditure\nForecast operating expenditure","No"]
[null,"Code of Practice 2011 How to Safely Remove Asbestos (Qld)","This Code sets out practices for the safe removal of asbestos and asbestos-containing material from buildings and structures, plant and equipment and vehicles.  ","Forecast capital expenditure\nForecast operating expenditure","No"]
[null,"Construction and Operation of Solar Farms Code of Practice 2019 (Qld)","This Code sets out how duty holders can comply with work health and safety and electrical safety duties during the design, construction, commissioning, operation, maintenance and end of life management of solar farms. This includes installers of electrical equipment or an electrical installation which can include Powerlink. ","Forecast capital expenditure\nForecast operating expenditure","No"]
[null,"Electrical Code of Practice 2013 Managing Electrical Risks in the Workplace (Qld)                                            ","This Code sets out practices to manage electrical risk when working near exposed live parts.  ","Forecast capital expenditure\nForecast operating expenditure","No"]
[null,"Electrical Code of Practice 2020 - Working Near Overhead and Underground Electric Lines (Qld)","This Code sets out compliance requirements to ensure that no person, plant or thing comes within an unsafe distance (exclusion zone) of an overhead electric line.","Forecast capital expenditure\nForecast operating expenditure","No"]
[null,"Electrical Safety Code of Practice 2020 - Works (Qld)","This Code sets out how to manage risks associated with associated with earthing systems, underground cable systems, and supporting structures for overhead lines forming parts of the works of an electricity entity. ","Forecast capital expenditure\nForecast operating expenditure","No"]
[null,"How to Manage Work Health and Safety Risks Code of Practice 2011 (Qld)","This Code applies to all types of work and all workplaces covered by the WHS Act. ","Forecast capital expenditure\nForecast operating expenditure","No"]
[null,"Queensland Electricity Supply Industry Code of Practice for Maintenance of Electricity Corridors (Qld)","This Code sets out the processes and requirements for maintaining Powerlink's transmission infrastructure in protected areas. ","Forecast capital expenditure\nForecast operating expenditure","No"]
[null,"State Government Supported  Infrastructure Koala Conservation Policy (Qld)","This policy establishes critiera to reduce adverse impacts on koalas and koala habitat and applies to the planning and delivery of all Queensland Government supported infrastructure projects within the South East Queensland Koala Protection Area (SEQKPA) that are not otherwise regulated or where no development approval is required.","Forecast capital expenditure\nForecast operating expenditure","No"]
[null,"Work Health and Safety Consultation, Co-operation and Co-ordination Code of Practice 2011 (Qld)","This Code sets out how to effectively consult with workers, includes mechanisms to facilitate worker participation and representation and consultation, co-opereration and co-ordination of activities of share duty holders.","Forecast capital expenditure\nForecast operating expenditure","No"]
[]
[]
[]
[null,"Guidelines"]
[null,"AER's Better Regulation Guidelines and Schemes","Guidelines relate to confidentiality, expenditure forecast assessment, cost allocation, capital expenditure incentives, rate of return and consumer engagement. Schemes include STPIS and EBSS.","Revenue Proposal","No"]
[null,"Corporate Goverannce Guidelines for Government Owned Corporations","This guideline sets the Government Owned Corporation Shareholder expectations for governance and reporting arrangements.","Revenue Proposal","No"]
[]
[]
[]
[]
[]
[]
[]
[]
[]
[]
[]
[]
[]
[]
[]
[]
[]
[]
[]
[]
[]
[]
[]
[]
[]
[]
[]
[]
[]
[]
[]
[]
[]
[]
[]
[]
[null,"Default agreements "]
[null,"Nil"]
[]
[]
[]
[null,"Other"]
[null,"Nil"]

{"sheet":"7.4 Shared Assets","index":33,"n_rows":26,"n_cols":19,"rows_kept":26,"cut":false,"hidden":false,"merged":[[6,1,7,1],[6,2,7,2],[6,3,6,10],[6,11,6,18],[25,2,25,8],[26,2,26,8],[27,2,27,8],[28,2,28,8],[29,2,29,8],[30,2,30,8],[31,2,31,8],[32,2,32,8],[39,2,39,8],[40,2,40,8],[33,2,33,8],[34,2,34,8],[35,2,35,8],[36,2,36,8],[37,2,37,8],[38,2,38,8]]}
[null,{"$f":"(LOOKUP(dms_Model,dms_Model_List,dms_Worksheet_List))","v":"REGULATORY REPORTING STATEMENT"}]
[null,{"$f":"INDEX(dms_TradingNameFull_List,MATCH(dms_TradingName,dms_TradingName_List))","v":"Queensland Electricity Transmission Corporation Limited trading as Powerlink Queensland"}]
[null,{"$f":"IF(SUM(dms_SingleYear_Model)>0,CRY,CONCATENATE(FRCP_y1,\" to \",dms_MultiYear_FinalYear_Result))","v":"2022-23 to 2026-27"}]
[null,"7.4 SHARED ASSETS"]
[]
[null,"7.4.1 - TOTAL UNREGULATED REVENUE EARNED WITH SHARED ASSETS "]
[null,"Name of shared asset unregulated service","Description of shared assets used to provide the service","Shared asset unregulated revenue  ($0's, nominal)",null,null,null,null,null,null,null,{"$f":"CONCATENATE(\"Shared asset unregulated revenue  ($0's, real \", dms_DollarReal,\")\")","v":"Shared asset unregulated revenue  ($0's, real June 2022)"}]
[null,null,null,{"$f":"PRCP_y1","v":"2012-13"},{"$f":"PRCP_y2","v":"2013-14"},{"$f":"PRCP_y3","v":"2014-15"},{"$f":"PRCP_y4","v":"2015-16"},{"$f":"PRCP_y5","v":"2016-17"},{"$f":"CRCP_y1","v":"2017-18"},{"$f":"CRCP_y2","v":"2018-19"},{"$f":"CRCP_y3","v":"2019-20"},{"$f":"dms_y1","v":"2020-21"},{"$f":"dms_y2","v":"2021-22"},{"$f":"dms_y3","v":"2022-23"},{"$f":"dms_y4","v":"2023-24"},{"$f":"dms_y5","v":"2024-25"},{"$f":"dms_y6","v":"2025-26"},{"$f":"dms_y7","v":"2026-27"},{"$f":"CONCATENATE(\"Total \n\",FRCP_y1, \" to \", dms_MultiYear_FinalYear_Result)","v":"Total \n2022-23 to 2026-27"}]
[null,"Oil Testing & Laboratory Services","Oil lab, tools and equipment.",347400.59999999986,260391.95999999996,423787.21999999986,387205.34000000008,254153.07000000007,15935.660000000098,120048.02999999993,247447.77999999997,258193.07216209348,256271.82833858268,257854.4199460111,257857.67525686033,257860.93060880637,257864.18600185026,257867.44143599219,{"$f":"SUM(N9:R9)","v":1289304.6532495203}]
[null,"Property Rentals ","Relevant properties and land.",1466338.19,206046.76999999993,326439.92000000004,233787.98000000007,162956.61000000019,525693.96000000054,565497.52999999991,320015.18000000034,624725.98244710453,613042.4128883743,635618.12957399676,426298.94065617432,430497.1226364348,652006.10264214443,651240.7528427951,2795661.0483515454]
[null,"Tower Access","Transmission and telecommunications towers.",2826870.66,3056775.3400000003,2724748.26,2677737.7400000002,2688241.7,2331677.7999999998,2417718.6800000002,2208640.61,2179273.3098444291,2163057.0909071062,2176414.9227868374,2176442.399171039,2176469.8759021191,2176497.3529800819,2176497.3529800819,10882321.903820161]
[null,null,null,null,null,null,null,null,null,null,null,null,null,null,null,null,null,null,0]
[null,null,null,null,null,null,null,null,null,null,null,null,null,null,null,null,null,null,0]
[null,null,null,null,null,null,null,null,null,null,null,null,null,null,null,null,null,null,0]
[null,null,null,null,null,null,null,null,null,null,null,null,null,null,null,null,null,null,0]
[null,null,null,null,null,null,null,null,null,null,null,null,null,null,null,null,null,null,0]
[null,null,null,null,null,null,null,null,null,null,null,null,null,null,null,null,null,null,0]
[null,null,null,null,null,null,null,null,null,null,null,null,null,null,null,null,null,null,0]
[null,null,null,null,null,null,null,null,null,null,null,null,null,null,null,null,null,null,0]
[null,null,null,null,null,null,null,null,null,null,null,null,null,null,null,null,null,null,0]
[null,null,null,null,null,null,null,null,null,null,null,null,null,null,null,null,null,null,0]
[null,null,null,null,null,null,null,null,null,null,null,null,null,null,null,null,null,null,0]
[null,null,null,null,null,null,null,null,null,null,null,null,null,null,null,null,null,null,0]
[]
[null,"7.4.2 - SHARED ASSET UNREGULATED SERVICES - APPORTIONMENT METHODOLOGY"]
[null,"Name of shared asset unregulated service for which revenues were apportioned","Apportionment methodology"]

{"sheet":"7.9 STPIS","index":34,"n_rows":174,"n_cols":13,"rows_kept":174,"cut":false,"hidden":false,"merged":[[5,1,5,2],[8,1,9,1],[8,8,9,8],[8,9,9,9],[8,12,9,12],[8,2,8,7],[29,1,30,1],[29,2,30,2],[29,3,30,3],[29,4,30,4],[29,5,29,11],[67,3,67,7],[68,3,68,4],[68,5,68,6],[8,10,9,10],[8,11,9,11]]}
[null,{"$f":"(LOOKUP(dms_Model,dms_Model_List,dms_Worksheet_List))","v":"REGULATORY REPORTING STATEMENT"}]
[null,{"$f":"INDEX(dms_TradingNameFull_List,MATCH(dms_TradingName,dms_TradingName_List))","v":"Queensland Electricity Transmission Corporation Limited trading as Powerlink Queensland"}]
[null,{"$f":"IF(SUM(dms_SingleYear_Model)>0,CRY,CONCATENATE(FRCP_y1,\" to \",dms_MultiYear_FinalYear_Result))","v":"2022-23 to 2026-27"}]
[null,"7.9 SERVICE TARGET PERFORMANCE INCENTIVE SCHEME (STPIS)"]
[]
[null,"There are FOUR tables on this worksheet. Each table has been grouped (and sub-grouped) for ease of navigation. See the Instructions sheet on how to group or ungroup tables. "]
[]
[null,"7.9.1 - Historical performance and proposed floor, caps and targets for the service component of the STPIS"]
[null,"Parameter","Performance actuals",null,null,null,null,null,"Average of actual performance","Floor","Target","Cap","Weighting \n(% of MAR)"]
[null,null,{"$f":"(LEFT(PRCP_y3,2)&RIGHT(PRCP_y3,2))","v":"2015"},{"$f":"LEFT(PRCP_y4,2)&RIGHT(PRCP_y4,2)","v":"2016"},{"$f":"LEFT(PRCP_y5,2)&RIGHT(PRCP_y5,2)","v":"2017"},{"$f":"(LEFT(CRCP_y1,2)&RIGHT(CRCP_y1,2))","v":"2018"},{"$f":"(LEFT(CRCP_y2,2)&RIGHT(CRCP_y2,2))","v":"2019"},{"$f":"(LEFT(CRCP_y3,2)&RIGHT(CRCP_y3,2))","v":"2020"}]
[null,"Unplanned outage circuit event rate:"]
[null,"Transmission line outage - fault",18.518518518518501,16.216216216216218,18.64406779661017,24.579124579124578,16.666666666666664,null,{"$f":"+AVERAGE(C12:H12)","v":18.924918755427228},23.85,{"$f":"I12","v":18.924918755427228},14.85,2E-3]
[null,"Transformer outage – fault ",17.9190751445087,13.372093023255813,21.052631578947366,24.561403508771928,13.450292397660817,null,{"$f":"+AVERAGE(C13:H13)","v":18.071099130628927},25.09,{"$f":"I13","v":18.071099130628927},10.44,2E-3]
[null,"Reactive plant – fault ",22.302158273381298,25.735294117647058,27.941176470588236,27.407407407407408,24.626865671641792,null,25.602580388133156,29.16,25.602580388133156,22.34,1E-3]
[null,"Transmission line outage – forced outage",17.171717171717201,13.851351351351351,20.677966101694913,13.804713804713806,18.666666666666668,null,16.834483019228792,21,16.834483019228792,11.85,1E-3]
[null,"Transformer outage – forced outage",15.028901734104,14.534883720930234,18.71345029239766,10.526315789473683,11.695906432748536,null,14.099891593930824,19.07,14.099891593930824,9.7799999999999994,1E-3]
[null,"Reactive plant – forced outage",20.143884892086302,21.323529411764707,22.794117647058822,20,21.641791044776117,null,21.180664599137188,22.8,{"$f":"I17","v":21.180664599137188},18.920000000000002,5.0000000000000001E-4]
[null,"Loss of supply event frequency (number of events):"]
[null,">  (x) system minutes",2,1,6,2,0,null,2.2000000000000002,7,{"$f":"I19","v":2.2000000000000002},0,1.5E-3]
[null,">  (y) system minutes",1,0,0,1,0,null,0.4,2,1,0,1.5E-3]
[null,"Average outage duration (minutes): ",236.2286666,30.060000000000002,27.451875000000001,36.238181818181822,15,null,68.995744683636374,147.17089999999999,{"$f":"I21","v":68.995744683636374},7.9066000000000001,2E-3]
[null,"Proper operation of equipment (number of events):"]
[null,"Failure of protection system",25,20,37,38,15,null,27,"N/A","N/A","N/A",0]
[null,"Material failure of SCADA",1,2,1,2,0,null,1.2,"N/A","N/A","N/A",0]
[null,"Incorrect operational isolation of primary or secondary equipment",8,4,3,2,5,null,4.4000000000000004,"N/A","N/A","N/A",0]
[]
[]
[]
[null,"7.9.2 - Proposed priority projects for the network capability incentive parameter"]
[null,"Project ranking","Transmission Circuit /  Injection Point","Scope of works",{"$f":"CONCATENATE((\"If applicable, the present value of quantified benefits associated with the project\n ($0's, \"),CRCP_y5,\")\")","v":"If applicable, the present value of quantified benefits associated with the project\n ($0's, 2021-22)"},{"$f":"CONCATENATE((\"Project cost ($0's, \"),CRCP_y5,\")\")","v":"Project cost ($0's, 2021-22)"}]
[null,null,null,null,null,{"$f":"FRCP_y1","v":"2022-23"},{"$f":"FRCP_y2","v":"2023-24"},{"$f":"FRCP_y3","v":"2024-25"},{"$f":"FRCP_y4","v":"2025-26"},{"$f":"FRCP_y5","v":"2026-27"},"Opex","Capex"]
[null,1,"Nil",null,null,null,""]
[null,2]
[null,3]
[null,4]
[null,5]
[null,6]
[null,7]
[null,8]
[null,9]
[null,10]
[null,11]
[null,12]
[null,13]
[null,14]
[null,15]
[null,16]
[]
[]
[]
[]
[null,"7.9.3 – Network limit information"]
[null,"Limit identification ","Define limit  ","Reason for the limit ","Is limit addressed by priority project","Supporting information reference"]
[]
[]
[]
[]
[]
[]
[]
[]
[]
[]
[]
[]
[null,"7.9.4 - Market impact component"]
[]
[null,null,null,"Market impact parameter"]
[null,null,null,"Planned outage count(DI)",null,"Unplanned outage count (DI) "]
[null,"Year","Month","without exclusions","with exclusions","without exclusions","with exclusions","Market impact parameters"]
[null,{"$f":"LEFT(PRCP_y2,4)","v":"2013"},"January",0,0,2,0,{"$f":"(E71+G71)/12","v":0}]
[null,"2013","February",0,0,19,13,{"$f":"(E72+G72)/12","v":1.0833333333333333}]
[null,"2013","March",0,0,14,0,{"$f":"(E73+G73)/12","v":0}]
[null,"2013","April",0,0,0,0,0]
[null,"2013","May",6,0,4,3,0.25]
[null,"2013","June",87,81,0,0,6.75]
[null,"2013","July",5,0,0,0,0]
[null,"2013","August",0,0,0,0,0]
[null,"2013","September",0,0,0,0,0]
[null,"2013","October",1,0,0,0,0]
[null,"2013","November",0,0,0,0,0]
[null,"2013","December",0,0,0,0,{"$f":"(E82+G82)/12","v":0}]
[null,{"$f":"CONCATENATE(\"Total \",LEFT(PRCP_y2,4))","v":"Total 2013"},null,{"$f":"+SUM(D71:D82)","v":99},{"$f":"+SUM(E71:E82)","v":81},{"$f":"+SUM(F71:F82)","v":39},{"$f":"+SUM(G71:G82)","v":16},{"$f":"+SUM(H71:H82)","v":8.0833333333333339}]
[null,{"$f":"LEFT(PRCP_y3,4)","v":"2014"},"January",39,0,0,0,{"$f":"(E84+G84)/12","v":0}]
[null,"2014","February",0,0,0,0,{"$f":"(E85+G85)/12","v":0}]
[null,"2014","March",13,0,0,0,{"$f":"(E86+G86)/12","v":0}]
[null,"2014","April",8,0,0,0,0]
[null,"2014","May",149,2,0,0,0.16666666666666666]
[null,"2014","June",25,25,0,0,2.0833333333333335]
[null,"2014","July",833,811,0,0,67.583333333333329]
[null,"2014","August",115,6,0,0,0.5]
[null,"2014","September",1850,1192,9,5,99.75]
[null,"2014","October",1930,1900,17,0,158.33333333333334]
[null,"2014","November",97,0,0,0,0]
[null,"2014","December",44,0,0,0,{"$f":"(E95+G95)/12","v":0}]
[null,{"$f":"CONCATENATE(\"Total \", LEFT(PRCP_y3,4))","v":"Total 2014"},null,{"$f":"+SUM(D84:D95)","v":5103},{"$f":"+SUM(E84:E95)","v":3936},{"$f":"+SUM(F84:F95)","v":26},{"$f":"+SUM(G84:G95)","v":5},{"$f":"+SUM(H84:H95)","v":328.41666666666663}]
[null,{"$f":"LEFT(PRCP_y4,4)","v":"2015"},"January",323,0,30,1,{"$f":"(E97+G97)/12","v":8.3333333333333329E-2}]
[null,"2015","February",15,0,337,0,{"$f":"(E98+G98)/12","v":0}]
[null,"2015","March",6,0,0,0,{"$f":"(E99+G99)/12","v":0}]
[null,"2015","April",361,2,0,0,0.16666666666666666]
[null,"2015","May",68,0,0,0,0]
[null,"2015","June",1,0,0,0,0]
[null,"2015","July",20,1,0,0,8.3333333333333329E-2]
[null,"2015","August",249,0,0,0,0]
[null,"2015","September",774,0,3,0,0]
[null,"2015","October",268,58,2,0,4.833333333333333]
[null,"2015","November",10,3,33,0,0.25]
[null,"2015","December",6,0,2,0,{"$f":"(E108+G108)/12","v":0}]
[null,{"$f":"CONCATENATE(\"Total \", LEFT(PRCP_y4,4))","v":"Total 2015"},null,{"$f":"+SUM(D97:D108)","v":2101},{"$f":"+SUM(E97:E108)","v":64},{"$f":"+SUM(F97:F108)","v":407},{"$f":"+SUM(G97:G108)","v":1},{"$f":"+SUM(H97:H108)","v":5.4166666666666661}]
[null,{"$f":"LEFT(PRCP_y5,4)","v":"2016"},"January",0,0,103,0,{"$f":"(E110+G110)/12","v":0}]
[null,"2016","February",0,0,6,0,{"$f":"(E111+G111)/12","v":0}]
[null,"2016","March",47,0,19,0,{"$f":"(E112+G112)/12","v":0}]
[null,"2016","April",0,0,15,0,0]
[null,"2016","May",30,0,32,0,0]
[null,"2016","June",923,7,1,0,0.58333333333333337]
[null,"2016","July",23,0,0,0,0]
[null,"2016","August",0,0,35,35,2.9166666666666665]
[null,"2016","September",0,0,17,0,0]
[null,"2016","October",10,0,4,0,0]
[null,"2016","November",0,0,56,0,0]
[null,"2016","December",231,0,220,0,{"$f":"(E121+G121)/12","v":0}]
[null,{"$f":"CONCATENATE(\"Total \", LEFT(PRCP_y5,4))","v":"Total 2016"},null,{"$f":"+SUM(D110:D121)","v":1264},{"$f":"+SUM(E110:E121)","v":7},{"$f":"+SUM(F110:F121)","v":508},{"$f":"+SUM(G110:G121)","v":35},{"$f":"+SUM(H110:H121)","v":3.5}]
[null,{"$f":"LEFT(CRCP_y1,4)","v":"2017"},"January",314,0,127,0,{"$f":"(E123+G123)/12","v":0}]
[null,"2017","February",143,0,0,0,{"$f":"(E124+G124)/12","v":0}]
[null,"2017","March",105,22,337,5,{"$f":"(E125+G125)/12","v":2.25}]
[null,"2017","April",333,0,9,0,0]
[null,"2017","May",120,0,21,0,0]
[null,"2017","June",396,37,48,0,3.0833333333333335]
[null,"2017","July",2,0,0,0,0]
[null,"2017","August",912,0,22,0,0]
[null,"2017","September",2460,0,22,0,0]
[null,"2017","October",4743,3,86,6,0.75]
[null,"2017","November",156,0,24,0,0]
[null,"2017","December",1474,0,615,0,{"$f":"(E134+G134)/12","v":0}]
[null,{"$f":"CONCATENATE(\"Total \", LEFT(CRCP_y1,4))","v":"Total 2017"},null,{"$f":"+SUM(D123:D134)","v":11158},{"$f":"+SUM(E123:E134)","v":62},{"$f":"+SUM(F123:F134)","v":1311},{"$f":"+SUM(G123:G134)","v":11},{"$f":"+SUM(H123:H134)","v":6.0833333333333339}]
[null,{"$f":"LEFT(CRCP_y2,4)","v":"2018"},"January",479,0,106,17,{"$f":"(E136+G136)/12","v":1.4166666666666667}]
[null,"2018","February",416,0,406,0,{"$f":"(E137+G137)/12","v":0}]
[null,"2018","March",27,0,8,0,{"$f":"(E138+G138)/12","v":0}]
[null,"2018","April",45,0,0,0,0]
[null,"2018","May",1860,0,24,10,0.83333333333333337]
[null,"2018","June",18331,45,4,0,3.75]
[null,"2018","July",14157,2,37,1,0.25]
[null,"2018","August",11306,12,290,239,20.916666666666668]
[null,"2018","September",8758,42,0,0,3.5]
[null,"2018","October",17243,0,276,19,1.5833333333333333]
[null,"2018","November",17689,2,37,0,0.16666666666666666]
[null,"2018","December",15101,57,3,0,{"$f":"(E147+G147)/12","v":4.75}]
[null,{"$f":"CONCATENATE(\"Total \", LEFT(CRCP_y2,4))","v":"Total 2018"},null,{"$f":"+SUM(D136:D147)","v":105412},{"$f":"+SUM(E136:E147)","v":160},{"$f":"+SUM(F136:F147)","v":1191},{"$f":"+SUM(G136:G147)","v":286},{"$f":"+SUM(H136:H147)","v":37.166666666666664}]
[null,{"$f":"LEFT(CRCP_y3,4)","v":"2019"},"January",9345,0,215,44,{"$f":"(E149+G149)/12","v":3.6666666666666665}]
[null,"2019","February",8892,0,102,0,{"$f":"(E150+G150)/12","v":0}]
[null,"2019","March",3484,6,17,0,{"$f":"(E151+G151)/12","v":0.5}]
[null,"2019","April",2923,430,17,0,35.833333333333336]
[null,"2019","May",4508,416,0,0,34.666666666666664]
[null,"2019","June",5888,1548,90,34,131.83333333333334]
[null,"2019","July",7331,2963,504,337,275]
[null,"2019","August",5733,41,54,21,5.166666666666667]
[null,"2019","September",4713,2513,57,0,209.41666666666666]
[null,"2019","October",5972,4288,114,20,359]
[null,"2019","November",2118,103,1676,0,8.5833333333333339]
[null,"2019","December",1335,787,391,382,{"$f":"(E160+G160)/12","v":97.416666666666671}]
[null,{"$f":"CONCATENATE(\"Total \", LEFT(CRCP_y3,4))","v":"Total 2019"},null,{"$f":"+SUM(D149:D160)","v":62242},{"$f":"+SUM(E149:E160)","v":13095},{"$f":"+SUM(F149:F160)","v":3237},{"$f":"+SUM(G149:G160)","v":838},{"$f":"+SUM(H149:H160)","v":1161.0833333333335}]
[null,{"$f":"LEFT(CRCP_y4,4)","v":"2020"},"January",null,null,null,null,{"$f":"(E162+G162)/12","v":0}]
[null,"2020","February",null,null,null,null,{"$f":"(E163+G163)/12","v":0}]
[null,"2020","March",null,null,null,null,{"$f":"(E164+G164)/12","v":0}]
[null,"2020","April",null,null,null,null,0]
[null,"2020","May",null,null,null,null,0]
[null,"2020","June",null,null,null,null,0]
[null,"2020","July",null,null,null,null,0]
[null,"2020","August",null,null,null,null,0]
[null,"2020","September",null,null,null,null,0]
[null,"2020","October",null,null,null,null,0]
[null,"2020","November",null,null,null,null,0]
[null,"2020","December",null,null,null,null,{"$f":"(E173+G173)/12","v":0}]
[null,{"$f":"CONCATENATE(\"Total \", LEFT(CRCP_y4,4))","v":"Total 2020"},null,{"$f":"+SUM(D162:D173)","v":0},{"$f":"+SUM(E162:E173)","v":0},{"$f":"+SUM(F162:F173)","v":0},{"$f":"+SUM(G162:G173)","v":0},{"$f":"+SUM(H162:H173)","v":0}]

{"sheet":"7.9 STPIS (Alternative)","index":35,"n_rows":174,"n_cols":13,"rows_kept":174,"cut":false,"hidden":false,"merged":[[5,1,5,2],[8,1,9,1],[8,2,8,7],[8,8,9,8],[8,9,9,9],[29,1,30,1],[29,2,30,2],[29,3,30,3],[29,4,30,4],[29,5,29,11],[67,3,67,7],[68,3,68,4],[68,5,68,6],[8,11,9,11],[8,12,9,12],[8,10,9,10]]}
[null,{"$f":"(LOOKUP(dms_Model,dms_Model_List,dms_Worksheet_List))","v":"REGULATORY REPORTING STATEMENT"}]
[null,{"$f":"INDEX(dms_TradingNameFull_List,MATCH(dms_TradingName,dms_TradingName_List))","v":"Queensland Electricity Transmission Corporation Limited trading as Powerlink Queensland"}]
[null,{"$f":"IF(SUM(dms_SingleYear_Model)>0,CRY,CONCATENATE(FRCP_y1,\" to \",dms_MultiYear_FinalYear_Result))","v":"2022-23 to 2026-27"}]
[null,"7.9 SERVICE TARGET PERFORMANCE INCENTIVE SCHEME (STPIS)"]
[]
[null,"There are FOUR tables on this worksheet. Each table has been grouped (and sub-grouped) for ease of navigation. See the Instructions sheet on how to group or ungroup tables. "]
[]
[null,"7.9.1 - Historical performance and proposed floor, caps and targets for the service component of the STPIS"]
[null,"Parameter","Performance actuals",null,null,null,null,null,"Average of actual performance","Floor","Target","Cap","Weighting \n(% of MAR)"]
[null,null,{"$f":"(LEFT(PRCP_y3,2)&RIGHT(PRCP_y3,2))","v":"2015"},{"$f":"LEFT(PRCP_y4,2)&RIGHT(PRCP_y4,2)","v":"2016"},{"$f":"LEFT(PRCP_y5,2)&RIGHT(PRCP_y5,2)","v":"2017"},{"$f":"(LEFT(CRCP_y1,2)&RIGHT(CRCP_y1,2))","v":"2018"},{"$f":"(LEFT(CRCP_y2,2)&RIGHT(CRCP_y2,2))","v":"2019"},{"$f":"(LEFT(CRCP_y3,2)&RIGHT(CRCP_y3,2))","v":"2020"}]
[null,"Unplanned outage circuit event rate:"]
[null,"Transmission line outage - fault",null,16.216216216216218,18.64406779661017,24.579124579124578,16.666666666666664,9.0604026845637584,{"$f":"+AVERAGE(C12:H12)","v":17.033295588636278},24.9892,{"$f":"I12","v":17.033295588636278},8.7896000000000001,2E-3]
[null,"Transformer outage – fault ",null,13.372093023255813,21.052631578947366,24.561403508771928,13.450292397660817,11.627906976744185,{"$f":"+AVERAGE(C13:H13)","v":16.812865497076022},23.939499999999999,{"$f":"I13","v":16.812865497076022},5.4920999999999998,2E-3]
[null,"Reactive plant – fault ",null,25.735294117647058,27.941176470588236,27.407407407407408,24.626865671641792,22.556390977443609,25.653426928945617,29.044699999999999,25.653426928945617,22.524799999999999,1E-3]
[null,"Transmission line outage – forced outage",null,13.851351351351351,20.677966101694913,13.804713804713806,18.666666666666668,18.120805369127517,17.02430065871085,21.127400000000002,17.02430065871085,12.1454,1E-3]
[null,"Transformer outage – forced outage",null,14.534883720930234,18.71345029239766,10.526315789473683,11.695906432748536,18.604651162790699,14.815041479668162,22.344799999999999,14.815041479668162,9.3686000000000007,1E-3]
[null,"Reactive plant – forced outage",null,21.323529411764707,22.794117647058822,20,21.641791044776117,20.300751879699249,21.212037996659781,22.7942,{"$f":"I17","v":21.212037996659781},18.997199999999999,5.0000000000000001E-4]
[null,"Loss of supply event frequency (number of events):"]
[null,">  (x) system minutes",null,1,6,2,0,0,1.8,6,{"$f":"I19","v":1.8},0,1.5E-3]
[null,">  (y) system minutes",null,0,0,1,0,0,0.2,2,1,0,1.5E-3]
[null,"Average outage duration (minutes): ",null,30.060000000000002,27.451875000000001,36.238181818181822,15,57.407499999999999,33.231511363636365,58.999200000000002,{"$f":"I21","v":33.231511363636365},14.055099999999999,2E-3]
[null,"Proper operation of equipment (number of events):"]
[null,"Failure of protection system",null,20,37,38,15,21,26.2,"N/A","N/A","N/A",0]
[null,"Material failure of SCADA",null,2,1,2,0,0,1,"N/A","N/A","N/A",0]
[null,"Incorrect operational isolation of primary or secondary equipment",null,4,3,2,5,9,4.5999999999999996,"N/A","N/A","N/A",0]
[]
[]
[]
[null,"7.9.2 - Proposed priority projects for the network capability incentive parameter"]
[null,"Project ranking","Transmission Circuit /  Injection Point","Scope of works",{"$f":"CONCATENATE((\"If applicable, the present value of quantified benefits associated with the project\n ($0's, \"),CRCP_y5,\")\")","v":"If applicable, the present value of quantified benefits associated with the project\n ($0's, 2021-22)"},{"$f":"CONCATENATE((\"Project cost ($0's, \"),CRCP_y5,\")\")","v":"Project cost ($0's, 2021-22)"}]
[null,null,null,null,null,{"$f":"FRCP_y1","v":"2022-23"},{"$f":"FRCP_y2","v":"2023-24"},{"$f":"FRCP_y3","v":"2024-25"},{"$f":"FRCP_y4","v":"2025-26"},{"$f":"FRCP_y5","v":"2026-27"},"Opex","Capex"]
[null,1,null,"Nil",null,null,""]
[null,2]
[null,3]
[null,4]
[null,5]
[null,6]
[null,7]
[null,8]
[null,9]
[null,10]
[null,11]
[null,12]
[null,13]
[null,14]
[null,15]
[null,16]
[]
[]
[]
[]
[null,"7.9.3 – Network limit information"]
[null,"Limit identification ","Define limit  ","Reason for the limit ","Is limit addressed by priority project","Supporting information reference"]
[]
[]
[]
[]
[]
[]
[]
[]
[]
[]
[]
[]
[null,"7.9.4 - Market impact component"]
[]
[null,null,null,"Market impact parameter"]
[null,null,null,"Planned outage count(DI)",null,"Unplanned outage count (DI) "]
[null,"Year","Month","without exclusions","with exclusions","without exclusions","with exclusions","Market impact parameters"]
[null,{"$f":"LEFT(PRCP_y2,4)","v":"2013"},"January",null,null,null,null,{"$f":"(E71+G71)/12","v":0}]
[null,"2013","February",null,null,null,null,{"$f":"(E72+G72)/12","v":0}]
[null,"2013","March",null,null,null,null,{"$f":"(E73+G73)/12","v":0}]
[null,"2013","April",null,null,null,null,0]
[null,"2013","May",null,null,null,null,0]
[null,"2013","June",null,null,null,null,0]
[null,"2013","July",null,null,null,null,0]
[null,"2013","August",null,null,null,null,0]
[null,"2013","September",null,null,null,null,0]
[null,"2013","October",null,null,null,null,0]
[null,"2013","November",null,null,null,null,0]
[null,"2013","December",null,null,null,null,{"$f":"(E82+G82)/12","v":0}]
[null,{"$f":"CONCATENATE(\"Total \",LEFT(PRCP_y2,4))","v":"Total 2013"},null,{"$f":"+SUM(D71:D82)","v":0},{"$f":"+SUM(E71:E82)","v":0},{"$f":"+SUM(F71:F82)","v":0},{"$f":"+SUM(G71:G82)","v":0},{"$f":"+SUM(H71:H82)","v":0}]
[null,{"$f":"LEFT(PRCP_y3,4)","v":"2014"},"January",39,0,0,0,{"$f":"(E84+G84)/12","v":0}]
[null,"2014","February",0,0,0,0,{"$f":"(E85+G85)/12","v":0}]
[null,"2014","March",13,0,0,0,{"$f":"(E86+G86)/12","v":0}]
[null,"2014","April",8,0,0,0,0]
[null,"2014","May",149,2,0,0,0.16666666666666666]
[null,"2014","June",25,25,0,0,2.0833333333333335]
[null,"2014","July",833,811,0,0,67.583333333333329]
[null,"2014","August",115,6,0,0,0.5]
[null,"2014","September",1850,1192,9,5,99.75]
[null,"2014","October",1930,1900,17,0,158.33333333333334]
[null,"2014","November",97,0,0,0,0]
[null,"2014","December",44,0,0,0,{"$f":"(E95+G95)/12","v":0}]
[null,{"$f":"CONCATENATE(\"Total \", LEFT(PRCP_y3,4))","v":"Total 2014"},null,{"$f":"+SUM(D84:D95)","v":5103},{"$f":"+SUM(E84:E95)","v":3936},{"$f":"+SUM(F84:F95)","v":26},{"$f":"+SUM(G84:G95)","v":5},{"$f":"+SUM(H84:H95)","v":328.41666666666663}]
[null,{"$f":"LEFT(PRCP_y4,4)","v":"2015"},"January",323,0,30,1,{"$f":"(E97+G97)/12","v":8.3333333333333329E-2}]
[null,"2015","February",15,0,337,0,{"$f":"(E98+G98)/12","v":0}]
[null,"2015","March",6,0,0,0,{"$f":"(E99+G99)/12","v":0}]
[null,"2015","April",361,2,0,0,0.16666666666666666]
[null,"2015","May",68,0,0,0,0]
[null,"2015","June",1,0,0,0,0]
[null,"2015","July",20,1,0,0,8.3333333333333329E-2]
[null,"2015","August",249,0,0,0,0]
[null,"2015","September",774,0,3,0,0]
[null,"2015","October",268,58,2,0,4.833333333333333]
[null,"2015","November",10,3,33,0,0.25]
[null,"2015","December",6,0,2,0,{"$f":"(E108+G108)/12","v":0}]
[null,{"$f":"CONCATENATE(\"Total \", LEFT(PRCP_y4,4))","v":"Total 2015"},null,{"$f":"+SUM(D97:D108)","v":2101},{"$f":"+SUM(E97:E108)","v":64},{"$f":"+SUM(F97:F108)","v":407},{"$f":"+SUM(G97:G108)","v":1},{"$f":"+SUM(H97:H108)","v":5.4166666666666661}]
[null,{"$f":"LEFT(PRCP_y5,4)","v":"2016"},"January",0,0,103,0,{"$f":"(E110+G110)/12","v":0}]
[null,"2016","February",0,0,6,0,{"$f":"(E111+G111)/12","v":0}]
[null,"2016","March",47,0,19,0,{"$f":"(E112+G112)/12","v":0}]
[null,"2016","April",0,0,15,0,0]
[null,"2016","May",30,0,32,0,0]
[null,"2016","June",923,7,1,0,0.58333333333333337]
[null,"2016","July",23,0,0,0,0]
[null,"2016","August",0,0,35,35,2.9166666666666665]
[null,"2016","September",0,0,17,0,0]
[null,"2016","October",10,0,4,0,0]
[null,"2016","November",0,0,56,0,0]
[null,"2016","December",231,0,220,0,{"$f":"(E121+G121)/12","v":0}]
[null,{"$f":"CONCATENATE(\"Total \", LEFT(PRCP_y5,4))","v":"Total 2016"},null,{"$f":"+SUM(D110:D121)","v":1264},{"$f":"+SUM(E110:E121)","v":7},{"$f":"+SUM(F110:F121)","v":508},{"$f":"+SUM(G110:G121)","v":35},{"$f":"+SUM(H110:H121)","v":3.5}]
[null,{"$f":"LEFT(CRCP_y1,4)","v":"2017"},"January",314,0,127,0,{"$f":"(E123+G123)/12","v":0}]
[null,"2017","February",143,0,0,0,{"$f":"(E124+G124)/12","v":0}]
[null,"2017","March",105,22,337,5,{"$f":"(E125+G125)/12","v":2.25}]
[null,"2017","April",333,0,9,0,0]
[null,"2017","May",120,0,21,0,0]
[null,"2017","June",396,37,48,0,3.0833333333333335]
[null,"2017","July",2,0,0,0,0]
[null,"2017","August",912,0,22,0,0]
[null,"2017","September",2460,0,22,0,0]
[null,"2017","October",4743,3,86,6,0.75]
[null,"2017","November",156,0,24,0,0]
[null,"2017","December",1474,0,615,0,{"$f":"(E134+G134)/12","v":0}]
[null,{"$f":"CONCATENATE(\"Total \", LEFT(CRCP_y1,4))","v":"Total 2017"},null,{"$f":"+SUM(D123:D134)","v":11158},{"$f":"+SUM(E123:E134)","v":62},{"$f":"+SUM(F123:F134)","v":1311},{"$f":"+SUM(G123:G134)","v":11},{"$f":"+SUM(H123:H134)","v":6.0833333333333339}]
[null,{"$f":"LEFT(CRCP_y2,4)","v":"2018"},"January",479,0,106,17,{"$f":"(E136+G136)/12","v":1.4166666666666667}]
[null,"2018","February",416,0,406,0,{"$f":"(E137+G137)/12","v":0}]
[null,"2018","March",27,0,8,0,{"$f":"(E138+G138)/12","v":0}]
[null,"2018","April",45,0,0,0,0]
[null,"2018","May",1860,0,24,10,0.83333333333333337]
[null,"2018","June",18331,45,4,0,3.75]
[null,"2018","July",14157,2,37,1,0.25]
[null,"2018","August",11306,12,290,239,20.916666666666668]
[null,"2018","September",8758,42,0,0,3.5]
[null,"2018","October",17243,0,276,19,1.5833333333333333]
[null,"2018","November",17689,2,37,0,0.16666666666666666]
[null,"2018","December",15101,57,3,0,{"$f":"(E147+G147)/12","v":4.75}]
[null,{"$f":"CONCATENATE(\"Total \", LEFT(CRCP_y2,4))","v":"Total 2018"},null,{"$f":"+SUM(D136:D147)","v":105412},{"$f":"+SUM(E136:E147)","v":160},{"$f":"+SUM(F136:F147)","v":1191},{"$f":"+SUM(G136:G147)","v":286},{"$f":"+SUM(H136:H147)","v":37.166666666666664}]
[null,{"$f":"LEFT(CRCP_y3,4)","v":"2019"},"January",9345,0,215,44,{"$f":"(E149+G149)/12","v":3.6666666666666665}]
[null,"2019","February",8892,0,102,0,{"$f":"(E150+G150)/12","v":0}]
[null,"2019","March",3484,6,17,0,{"$f":"(E151+G151)/12","v":0.5}]
[null,"2019","April",2923,430,17,0,35.833333333333336]
[null,"2019","May",4508,416,0,0,34.666666666666664]
[null,"2019","June",5888,1548,90,34,131.83333333333334]
[null,"2019","July",7331,2963,504,337,275]
[null,"2019","August",5733,41,54,21,5.166666666666667]
[null,"2019","September",4713,2513,57,0,209.41666666666666]
[null,"2019","October",5972,4288,114,20,359]
[null,"2019","November",2118,103,1676,0,8.5833333333333339]
[null,"2019","December",1335,787,391,382,{"$f":"(E160+G160)/12","v":97.416666666666671}]
[null,{"$f":"CONCATENATE(\"Total \", LEFT(CRCP_y3,4))","v":"Total 2019"},null,{"$f":"+SUM(D149:D160)","v":62242},{"$f":"+SUM(E149:E160)","v":13095},{"$f":"+SUM(F149:F160)","v":3237},{"$f":"+SUM(G149:G160)","v":838},{"$f":"+SUM(H149:H160)","v":1161.0833333333335}]
[null,{"$f":"LEFT(CRCP_y4,4)","v":"2020"},"January",1843,968,2039,0,{"$f":"(E162+G162)/12","v":80.666666666666671}]
[null,"2020","February",1266,384,45607,2,{"$f":"(E163+G163)/12","v":32.166666666666664}]
[null,"2020","March",3299,507,3983,744,{"$f":"(E164+G164)/12","v":104.25}]
[null,"2020","April",1470,730,175,175,75.416666666666671]
[null,"2020","May",1825,134,7,0,11.166666666666666]
[null,"2020","June",1204,658,43,1,54.916666666666664]
[null,"2020","July",5103,4058,10,0,338.16666666666669]
[null,"2020","August",4785,3194,200,24,268.16666666666669]
[null,"2020","September",1213,705,44,44,62.416666666666664]
[null,"2020","October",10650,9637,122,37,806.16666666666663]
[null,"2020","November",3189,2551,1847,0,212.58333333333334]
[null,"2020","December",1148,326,54,21,{"$f":"(E173+G173)/12","v":28.916666666666668}]
[null,{"$f":"CONCATENATE(\"Total \", LEFT(CRCP_y4,4))","v":"Total 2020"},null,{"$f":"+SUM(D162:D173)","v":36995},{"$f":"+SUM(E162:E173)","v":23852},{"$f":"+SUM(F162:F173)","v":54131},{"$f":"+SUM(G162:G173)","v":1048},{"$f":"+SUM(H162:H173)","v":2075}]

{"sheet":"8.2 Capex","index":36,"n_rows":60,"n_cols":9,"rows_kept":60,"cut":false,"hidden":false,"merged":[[7,2,7,8]]}
[null,{"$f":"(LOOKUP(dms_Model,dms_Model_List,dms_Worksheet_List))","v":"REGULATORY REPORTING STATEMENT"}]
[null,{"$f":"INDEX(dms_TradingNameFull_List,MATCH(dms_TradingName,dms_TradingName_List))","v":"Queensland Electricity Transmission Corporation Limited trading as Powerlink Queensland"}]
[null,{"$f":"IF(SUM(dms_SingleYear_Model)>0,CRY,CONCATENATE(FRCP_y1,\" to \",dms_MultiYear_FinalYear_Result))","v":"2022-23 to 2026-27"}]
[null,"8.2 - CAPEX"]
[]
[null,"8.2.7 - IMMEDIATE EXPENSING OF CAPEX"]
[null,"ESTIMATED - AS COMMISSIONED"]
[null,null,{"$f":"CONCATENATE(\"($0's, real \", dms_DollarReal,\")\")","v":"($0's, real June 2022)"}]
[null,null,{"$f":"dms_y1","v":"2020-21"},{"$f":"dms_y2","v":"2021-22"},{"$f":"dms_y3","v":"2022-23"},{"$f":"dms_y4","v":"2023-24"},{"$f":"dms_y5","v":"2024-25"},{"$f":"dms_y6","v":"2025-26"},{"$f":"dms_y7","v":"2026-27"}]
[null,"Transmission Lines - Overhead",1530151.4418091972,266135.53839883092,129965.08031751905,5542300.5030029928,2202491.3541415515,1852397.2924059019,1238410.4123826683]
[null,"Transmission Lines - Underground",16588.770598855564,0,0,0,381773.92574113392,94784.236336033588,4092138.7539601214]
[null,"Transmission Lines - Refit",10659522.691485872,262524.664086023,0,1149005.955434887,4302196.7704451932,0,0]
[null,"Substations Primary Plant",10320857.6519318,6381921.1837680135,9312770.4103232566,9185996.0180133302,7987345.7368914681,2075093.7384393299,1532985.908233179]
[null,"Substations Secondary Systems",6784217.5715274438,5629859.111008415,5649078.5528333653,5328891.2129997397,2852597.5468952898,2085288.1260949273,6525111.1820883956]
[null,"Communications Other Assets",1546326.7147185325,1420056.5978910113,485041.07856174489,706453.0262060205,153311.26750271811,1752460.2410605464,3790651.3786029969]
[null,"Comms - Civil Works",0,0,0,0,0,0,0]
[null,"Network Switching Centres",375434.04009718844,490517.57776104385,4981702.1287405826,158794.99386601601,158887.25554993199,158399.02305955329,301878.24826523633]
[null,"Land",0,0,0,0,0,0,0]
[null,"Easements",11193.166940371997,306631.84212581837,0,0,0,152361.18384631394,149779.28803902623]
[null,"Commercial Buildings",4233.0754443771993,184505.93617599635,411677.62592818437,2533291.479809986,1336632.7303861952,54375.17722517097,4529.4074880193621]
[null,"Computer Equipment",1973434.0737139718,1058703.5786227169,797648.85210665816,255227.89124592798,116210.6077285761,183346.322725073,360833.46628727834]
[null,"Office Furniture & Miscellaneous",0,0,0,0,0,0,0]
[null,"Office Machines",0,0,0,0,0,0,0]
[null,"Vehicles",515047.54919225723,362852.24818341556,332494.65564220445,243486.18877076724,339219.5614885384,453237.90599552862,440400.54856672831]
[null,"Moveable Plant",106983.54061926654,158939.97711150435,159299.36180435796,159467.2946900138,159395.36725416372,158665.44166760155,159633.68048088471]
[null,"Insurance Spares",0,0,0,0,0,0,0]
[null,"In-house software",0,0,1163961.6098159798,1563985.3296997536,1050647.5173608726,1182412.0127027575,770579.20309169719]
[]
[]
[]
[]
[]
[]
[]
[]
[]
[]
[]
[]
[]
[]
[]
[]
[]
[]
[]
[]
[]
[]
[]
[]
[]
[]
[]
[]
[]
[]
[]
[]
[null,"Total",{"$f":"SUM(C10:C59)","v":33843990.288079143},{"$f":"SUM(D10:D59)","v":16522648.255132789},{"$f":"SUM(E10:E59)","v":23423639.356073856},26826899.893739432,21040709.64138563,{"$f":"SUM(H10:H59)","v":10202820.701558737},{"$f":"SUM(I10:I59)","v":19366931.47748623}]