{"text_format":"1","workbook":"xlsx","n_sheets":18,"sheets":["AER CF","AER NRs","AER lookups","AER ETL","Instructions","CONTENTS","Business & other details","2.1 Expenditure summary","2.2 Repex","2.3 Augex","2.5 Connections","2.6 Non-network","2.7 Vegetation management","2.8 Maintenance","2.10 Overheads","2.11 Labour","2.12 Input tables","Amendments"],"not_rendered":{"charts":0,"images":5,"macros":1,"external_links":0,"defined_names":577,"comments":2,"pivot_tables":0},"unopened":[],"bounds":{"document_bytes":16777216,"sheet_cells":100000,"rows_first":2000,"rows_last":500,"rows_between":2000,"halvings":0,"cell_chars":16384,"cell_head_chars":4096},"cells_cut":0,"cells_raw":0,"read":"whole","date_system":"1900"}

{"sheet":"AER CF","index":0,"n_rows":75,"n_cols":25,"rows_kept":75,"cut":false,"hidden":true,"merged":[[40,38,40,59],[40,69,40,90],[3,1,3,22],[38,38,38,59],[38,69,38,90],[39,38,39,59],[39,69,39,90]]}
[null,"AER CONDITIONAL FORMATTING"]
[]
[null,"CELLS FLAGED \"Y\" and greyed out will be greyed out in the worksheets."]
[null,"CONDITIONAL FORMATTING MAP"]
[null,null,null,null,null,"=INDEX(dms_CF_3.6.1, MATCH(dms_TradingName,dms_CF_TradingName))=\"Y\"","=INDEX(dms_CF_3.6.5, MATCH(dms_TradingName,dms_CF_TradingName))=\"Y\"","=INDEX(dms_CF_3.6.6.1, MATCH(dms_TradingName,dms_CF_TradingName))=\"Y\"","=INDEX(dms_CF_3.6.6.2, MATCH(dms_TradingName,dms_CF_TradingName))=\"Y\"","=INDEX(dms_CF_3.6.6.3, MATCH(dms_TradingName,dms_CF_TradingName))=\"Y\"","=INDEX(dms_CF_3.6.7.1, MATCH(dms_TradingName,dms_CF_TradingName))=\"Y\"","=INDEX(dms_CF_3.6.7.2, MATCH(dms_TradingName,dms_CF_TradingName))=\"Y\"","=INDEX(dms_CF_3.6.7.3, MATCH(dms_TradingName,dms_CF_TradingName))=\"Y\"","=INDEX(dms_CF_3.6.7.4, MATCH(dms_TradingName,dms_CF_TradingName))=\"Y\"","=INDEX(dms_CF_3.6.8, MATCH(dms_TradingName,dms_CF_TradingName))=\"Y\"","=INDEX(dms_CF_4.1, MATCH(dms_TradingName,dms_CF_TradingName))=\"Y\"","=INDEX(dms_CF_6.8, MATCH(dms_TradingName,dms_CF_TradingName))=\"Y\"","=INDEX(dms_CF_7.12, MATCH(dms_TradingName,dms_CF_TradingName))=\"Y\"","=INDEX(dms_CF_8.1_A, MATCH(dms_TradingName,dms_CF_TradingName))=\"Y\"","=INDEX(dms_CF_8.1_B, MATCH(dms_TradingName,dms_CF_TradingName))=\"Y\"",{"$f":"INDEX(dms_CF_8.1_Neg, MATCH(dms_TradingName,dms_CF_TradingName))=\"Y\"","v":true},"=INDEX(dms_CF_4.4.1_Neg, MATCH(dms_TradingName,dms_CF_TradingName))=\"Y\"",null,null,"=INDEX(dms_CF_F10, MATCH(dms_TradingName,dms_CF_TradingName))=\"Y\""]
[null,"dms_CF_TradingName","JurisdictionList","Sector","Segment","dms_CF_3.6.1","dms_CF_3.6.5","dms_CF_3.6.6.1","dms_CF_3.6.6.2","dms_CF_3.6.6.3","dms_CF_3.6.7.1","dms_CF_3.6.7.2","dms_CF_3.6.7.3","dms_CF_3.6.7.4","dms_CF_3.6.8","dms_CF_4.1","dms_CF_6.8 (set from dms_MAIFI_flag)","dms_CF_7.12","dms_CF_8.1_A  (and 8.4)","dms_CF_8.1_B  (and 8.4)","dms_CF_8.1_Neg  (and 8.4)","dms_CF_4.4.1","dms_CF_MAIFI_flag (set from dms_MAIFI_flag)","9.5 TUOS (set from Jurisdiction)","dms_CF_F10"]
[null,"Ausgrid","NSW","Electricity","Distribution",null,"Y","N","Y","Y","N","N","N","Y","N","N",{"$f":"IFERROR(IF(dms_MAIFI_flag=\"Yes\",\"N\",\"Y\"),\"Y\")","v":"Y"},"Y","N","Y","Y","N",{"$f":"IFERROR(LEFT(dms_MAIFI_flag),\"N\")","v":"N"},{"$f":"IF('AER CF'!$C7=\"Vic\",\"Y\",\"N\")","v":"N"}]
[null,"Ausgrid (Tx Assets)","NSW","Electricity","Distribution",null,"Y","N","Y","Y","N","N","N","Y","N","N",{"$f":"IFERROR(IF(dms_MAIFI_flag=\"Yes\",\"N\",\"Y\"),\"Y\")","v":"Y"},"Y","N","Y","Y","N",{"$f":"IFERROR(LEFT(dms_MAIFI_flag),\"N\")","v":"N"},{"$f":"IF('AER CF'!$C8=\"Vic\",\"Y\",\"N\")","v":"N"}]
{"$rows_left_out":68}
{"sheet":"AER NRs","index":1,"n_rows":227,"n_cols":15,"rows_kept":227,"cut":false,"hidden":true,"merged":[[194,1,195,1],[198,1,199,1],[207,1,212,1],[134,1,149,1],[151,1,157,1],[159,1,173,1],[175,1,176,1],[178,1,183,1],[190,1,191,1],[64,1,77,1],[83,1,96,1],[99,1,106,1],[109,1,114,1],[117,1,131,1],[4,1,27,1],[31,1,54,1],[32,10,34,10],[32,36,32,57],[32,67,32,88],[33,36,33,57],[33,67,33,88],[34,36,34,57],[34,67,34,88],[35,10,39,10],[43,10,44,10]]}
[null,"AER NAMED RANGES"]
[]
[null,"DROP DOWN SELECTORS USED IN WORKBOOKS"]
[]
[null,"COVER SHEET","dms_DataQuality_List","dms_Confid_status_List"]
[null,null,"-- select --","-- select --"]
[null,null,"Actual","Public"]
[null,null,"Estimate","Confidential"]
{"$rows_left_out":220}
{"sheet":"AER lookups","index":2,"n_rows":87,"n_cols":37,"rows_kept":87,"cut":false,"hidden":true,"merged":[[21,1,21,4],[10,25,10,35],[11,25,11,28],[11,30,11,34],[11,35,13,35]]}
[null,"AER LOOKUP TABLES"]
[]
[null,"Data in these columns used for data validation and database purposes."]
[null,"Date last modified:","2017-01-16","added (Albury and Victora) for AGN"]
[null,null,"2016-10-17","updated TransGrid's correct legal name, corrected TasNetworks (T) to June financial year"]
[null,null,"2017-02-01","inserted Power and Water, added NRs (dms_FeederCat_1 and dms_FeederCat_2)"]
[null,null,"2017-03-03","inserted AEMO as a business"]
[null,null,"2018-03-28","major changes to accommodate STPIS"]
{"$rows_left_out":80}
{"sheet":"AER ETL","index":3,"n_rows":145,"n_cols":8,"rows_kept":145,"cut":false,"hidden":true,"merged":[[34,0,59,0],[34,37,34,58],[34,68,34,89],[32,37,32,58],[71,1,73,1],[32,68,32,89],[33,37,33,58],[33,68,33,89],[11,0,15,0],[12,4,12,8],[14,2,14,4],[18,0,25,0],[26,0,31,0]]}
["DRAFT RIN - 20200224","AER ETL INFORMATION"]
[]
[null,"USES NAMED RANGES FLAG","yes","dms_Defined_Names_Used"]
[]
[null,"IF THIS IS AN ABC RIN - make sure the the named range CRY is applied and the named range dms_dollar_nom_UOM is applied"]
[null,"IF THIS IS A RESET RIN - make sure the named ranges CRY and dms_dollar_nom_UOM are NOT present in the workbook"]
[null,"FOR ABC RINS THAT SPAN MULTIPLE YEARS - make sure MultiYear Flag is set and final year entered as required"]
[]
{"$rows_left_out":138}
{"sheet":"Instructions","index":4,"n_rows":27,"n_cols":4,"rows_kept":27,"cut":false,"hidden":false,"merged":[[7,2,7,3],[1,1,1,5],[2,1,2,5],[3,2,3,4],[4,2,4,4],[5,2,5,4],[25,2,25,3],[26,2,26,4],[8,2,8,4],[10,2,10,4],[12,2,12,4],[20,2,20,4],[22,2,22,4],[24,2,24,4]]}
[]
[null,"Transmission Network Service Provider"]
[null,"Historical Reporting RIN Template"]
[null,null,"This template is to be used by Powerlink to fulfil its reporting obligations to the AER."]
[null,null,"INSTRUCTIONS"]
[null,null,"Complete the Business & other details worksheet before entering data or values in any other worksheets. The Business & other details worksheet is linked to other worksheets within the workbook and automatically generates certain column headings and conditional formatting."]
[]
[null,null,"Identifying CONFIDENTIAL INFORMATION:\n\nPlease use the macro at the top of each \nworksheet to identify confidential information. \n\n"]
{"$rows_left_out":20}
{"sheet":"CONTENTS","index":5,"n_rows":21,"n_cols":6,"rows_kept":21,"cut":false,"hidden":false,"merged":[[5,4,5,5]]}
[null,null,null,{"$f":"INDEX(dms_Worksheet_List,MATCH(dms_Model,dms_Model_List))","v":"RECAST HISTORICAL CATEGORY ANALYSIS"}]
[null,null,null,{"$f":"INDEX(dms_TradingNameFull_List,MATCH(dms_TradingName,dms_TradingName_List))","v":"Queensland Electricity Transmission Corporation Limited trading as Powerlink Queensland"}]
[null,null,null,{"$f":"dms_Header_Span","v":"2008-09 to 2019-20"}]
[]
[]
[null,null,null,null,"CONTENTS"]
[]
[null,null,null,null,"TEMPLATE DATE","October 2020"]
{"$rows_left_out":14}
{"sheet":"Business & other details","index":6,"n_rows":74,"n_cols":79,"rows_kept":74,"cut":false,"hidden":false,"merged":[[61,25,61,34],[61,37,61,52],[69,25,71,34],[69,37,71,81],[73,25,73,34],[73,37,73,52],[63,25,63,34],[63,37,63,52],[65,25,65,34],[65,37,65,52],[67,25,67,34],[67,37,67,52],[51,37,51,44],[51,46,51,53],[51,55,51,62],[51,64,51,71],[51,73,51,80],[53,25,53,34],[53,37,53,44],[55,25,55,34],[55,37,55,44],[49,25,49,34],[49,37,49,44],[49,46,49,53],[49,55,49,62],[49,64,49,71],[49,73,49,80],[50,37,50,44],[50,46,50,53],[50,55,50,62],[50,64,50,71],[50,73,50,80],[46,37,46,44],[46,46,46,53],[46,55,46,62],[46,64,46,71],[46,73,46,80],[47,37,47,44],[47,46,47,53],[47,55,47,62],[47,64,47,71],[47,73,47,80],[43,37,43,44],[43,46,43,53],[43,55,43,62],[43,64,43,71],[43,73,43,80],[45,25,45,34],[45,37,45,44],[45,46,45,53],[45,55,45,62],[45,64,45,71],[45,73,45,80],[41,25,41,34],[41,37,41,44],[41,46,41,53],[41,55,41,62],[41,64,41,71],[41,73,41,80],[42,37,42,44],[42,46,42,53],[42,55,42,62],[42,64,42,71],[42,73,42,80],[31,21,31,35],[31,37,31,58],[31,60,31,66],[31,68,31,89],[32,21,32,35],[32,37,32,58],[32,60,32,66],[32,68,32,89],[33,21,33,35],[33,37,33,58],[33,60,33,66],[33,68,33,89],[23,21,23,35],[23,37,23,58],[23,60,23,66],[23,68,23,89],[24,21,24,35],[24,37,24,51],[24,60,24,66],[24,68,24,82],[25,21,25,35],[25,37,25,40],[25,49,25,51],[25,60,25,66],[25,68,25,71],[25,80,25,82],[0,7,2,15],[3,21,3,57],[6,21,6,75],[8,16,8,93],[15,21,15,35],[15,37,15,58],[16,21,16,35],[16,37,16,48],[22,21,22,35],[22,37,22,58],[22,60,22,66],[22,68,22,89]]}
[null,null,null,null,null,null,null,null,null,null,null,null,null,null,null,null,null,null,null,null,null,{"$f":"INDEX(dms_Worksheet_List,MATCH(dms_Model,dms_Model_List))","v":"RECAST HISTORICAL CATEGORY ANALYSIS"}]
[null,null,null,null,null,null,null,null,null,null,null,null,null,null,null,null,null,null,null,null,null,{"$f":"INDEX(dms_TradingNameFull_List,MATCH(dms_TradingName,dms_TradingName_List))","v":"Queensland Electricity Transmission Corporation Limited trading as Powerlink Queensland"}]
[null,null,null,null,null,null,null,null,null,null,null,null,null,null,null,null,null,null,null,null,null,{"$f":"dms_Header_Span","v":"2008-09 to 2019-20"}]
[null,null,null,null,null,null,null,null,null,null,null,null,null,null,null,null,null,null,null,null,null,"BUSINESS & OTHER DETAILS"]
[]
[null,null,null,null,null,null,null,null,null,null,null,null,null,null,null,null,null,null,null,null,null,"INSTRUCTIONS"]
[null,null,null,null,null,null,null,null,null,null,null,null,null,null,null,null,null,null,null,null,null,"Complete the following business details regulatory template before entering data or values in any other regulatory template. This regulatory template is linked to other cells within the spreadsheet and automatically generates column headings and conditional formatting to distinguish business specific input and non-input cells. "]
[]
{"$rows_left_out":67}
{"sheet":"2.1 Expenditure summary","index":7,"n_rows":59,"n_cols":14,"rows_kept":59,"cut":false,"hidden":false,"merged":[[8,2,8,13],[35,2,35,13]]}
[null,"REGULATORY REPORTING STATEMENT"]
[null,{"$f":"INDEX(dms_TradingNameFull_List,MATCH(dms_TradingName,dms_TradingName_List))","v":"Queensland Electricity Transmission Corporation Limited trading as Powerlink Queensland"}]
[null,{"$f":"INDEX(dms_Worksheet_List,MATCH(dms_Model,dms_Model_List))&\" \"&dms_Header_Span","v":"RECAST HISTORICAL CATEGORY ANALYSIS 2008-09 to 2019-20"}]
[null,"2.1 EXPENDITURE SUMMARY AND RECONCILIATION"]
[]
[null,"There are TWO tables on this worksheet. Each has been grouped for ease of navigation. See the Instructions sheet on how to group or ungroup tables. "]
[]
[null,"2.1.1 - PRESCRIBED TRANSMISSION SERVICES CAPEX (as incurred)"]
{"$rows_left_out":52}
{"sheet":"2.2 Repex","index":8,"n_rows":712,"n_cols":15,"rows_kept":712,"cut":false,"hidden":false,"merged":[[521,1,545,1],[546,1,567,1],[568,1,579,1],[674,3,674,14],[209,3,209,14],[409,3,409,14],[9,3,9,14],[613,3,613,14],[211,1,225,1],[226,1,240,1],[241,1,262,1],[263,1,284,1],[285,1,320,1],[321,1,345,1],[346,1,367,1],[368,1,379,1],[411,1,425,1],[426,1,440,1],[441,1,462,1],[463,1,484,1],[485,1,520,1],[168,1,179,1],[121,1,145,1],[146,1,167,1],[85,1,120,1],[11,1,25,1],[26,1,40,1],[41,1,62,1],[63,1,84,1]]}
[null,"REGULATORY REPORTING STATEMENT"]
[null,{"$f":"INDEX(dms_TradingNameFull_List,MATCH(dms_TradingName,dms_TradingName_List))","v":"Queensland Electricity Transmission Corporation Limited trading as Powerlink Queensland"}]
[null,{"$f":"INDEX(dms_Worksheet_List,MATCH(dms_Model,dms_Model_List))&\" \"&dms_Header_Span","v":"RECAST HISTORICAL CATEGORY ANALYSIS 2008-09 to 2019-20"}]
[null,"2.2 REPEX"]
[]
[null,"There are TWO tables (with three sub-tables each) on this worksheet. Each table has been grouped (and sub-grouped) for ease of navigation. See the Instructions sheet on how to group or ungroup data."]
[]
[null,"2.2.1 - REPLACEMENT EXPENDITURE, VOLUMES AND ASSET FAILURES BY ASSET CATEGORY"]
{"$rows_left_out":705}
{"sheet":"2.3 Augex","index":9,"n_rows":212,"n_cols":35,"rows_kept":212,"cut":false,"hidden":false,"merged":[[142,4,148,4],[150,4,156,4],[158,4,164,4],[166,4,172,4],[174,4,180,4],[182,4,188,4],[190,4,196,4],[190,1,196,1],[182,28,188,28],[158,1,164,1],[142,27,148,27],[150,1,156,1],[142,1,148,1],[158,27,164,27],[158,28,164,28],[182,1,188,1],[174,27,180,27],[174,28,180,28],[190,31,196,31],[190,32,196,32],[190,33,196,33],[190,27,196,27],[190,28,196,28],[190,29,196,29],[190,30,196,30],[182,31,188,31],[182,32,188,32],[182,33,188,33],[182,27,188,27],[174,29,180,29],[174,30,180,30],[174,31,180,31],[174,32,180,32],[182,29,188,29],[182,30,188,30],[166,32,172,32],[166,33,172,33],[174,1,180,1],[166,27,172,27],[166,28,172,28],[166,29,172,29],[166,30,172,30],[166,31,172,31],[166,1,172,1],[174,33,180,33],[158,29,164,29],[158,30,164,30],[150,27,156,27],[150,28,156,28],[150,29,156,29],[150,30,156,30],[150,31,156,31],[142,33,148,33],[142,28,148,28],[142,29,148,29],[142,30,148,30],[142,31,148,31],[142,32,148,32],[158,31,164,31],[158,32,164,32],[158,33,164,33],[150,32,156,32],[150,33,156,33],[139,1,141,1],[133,3,133,10],[138,1,138,10],[138,32,138,33],[138,27,141,27],[141,29,141,31],[141,32,141,33],[139,29,140,29],[139,30,140,30],[139,31,140,31],[139,32,140,32],[139,33,140,33],[138,28,141,28],[138,29,138,31],[140,21,141,21],[138,25,138,26],[139,25,140,25],[139,26,140,26],[141,25,141,26],[139,23,140,24],[139,22,140,22],[140,18,140,19],[139,11,140,14],[139,15,139,21],[124,29,130,29],[124,30,130,30],[124,31,130,31],[124,32,130,32],[124,33,130,33],[132,3,132,10],[124,9,130,9],[124,10,130,10],[124,25,130,25],[124,26,130,26],[124,27,130,27],[124,28,130,28],[124,1,130,1],[124,2,130,2],[124,3,130,3],[124,4,130,4],[124,5,130,5],[124,6,130,6],[124,7,130,7],[124,8,130,8],[116,26,122,26],[116,6,122,6],[116,7,122,7],[116,8,122,8],[116,9,122,9],[116,10,122,10],[116,25,122,25],[108,29,114,29],[108,30,114,30],[108,31,114,31],[108,32,114,32],[108,33,114,33],[116,1,122,1],[116,2,122,2],[116,3,122,3],[116,4,122,4],[116,5,122,5],[108,9,114,9],[108,10,114,10],[108,25,114,25],[108,26,114,26],[108,27,114,27],[108,28,114,28],[116,32,122,32],[116,33,122,33],[116,27,122,27],[116,28,122,28],[116,29,122,29],[116,30,122,30],[116,31,122,31],[108,1,114,1],[108,2,114,2],[108,3,114,3],[108,4,114,4],[108,5,114,5],[108,6,114,6],[108,7,114,7],[108,8,114,8],[100,26,106,26],[100,6,106,6],[100,7,106,7],[100,8,106,8],[100,9,106,9],[100,10,106,10],[100,25,106,25],[92,31,98,31],[92,32,98,32],[92,33,98,33],[100,1,106,1],[100,2,106,2],[100,3,106,3],[100,4,106,4],[100,5,106,5],[92,9,98,9],[92,10,98,10],[92,25,98,25],[92,26,98,26],[92,27,98,27],[92,28,98,28],[100,32,106,32],[100,33,106,33],[100,27,106,27],[100,28,106,28],[100,29,106,29],[100,30,106,30],[100,31,106,31],[92,1,98,1],[92,2,98,2],[92,3,98,3],[84,26,90,26],[84,6,90,6],[84,7,90,7],[84,8,90,8],[84,9,90,9],[84,10,90,10],[84,25,90,25],[92,29,98,29],[92,30,98,30],[76,29,82,29],[76,30,82,30],[76,31,82,31],[76,32,82,32],[76,33,82,33],[84,1,90,1],[84,2,90,2],[84,3,90,3],[84,4,90,4],[84,5,90,5],[76,9,82,9],[76,10,82,10],[76,25,82,25],[76,26,82,26],[76,27,82,27],[76,28,82,28],[84,32,90,32],[84,33,90,33],[84,27,90,27],[84,28,90,28],[84,29,90,29],[84,30,90,30],[84,31,90,31],[76,1,82,1],[60,1,66,1],[76,2,82,2],[76,3,82,3],[76,4,82,4],[76,5,82,5],[76,6,82,6],[76,7,82,7],[76,8,82,8],[68,26,74,26],[68,6,74,6],[68,7,74,7],[68,8,74,8],[68,9,74,9],[68,10,74,10],[68,25,74,25],[52,25,58,25],[60,29,66,29],[60,30,66,30],[60,31,66,31],[60,32,66,32],[60,33,66,33],[68,1,74,1],[68,2,74,2],[68,3,74,3],[68,4,74,4],[68,5,74,5],[60,9,66,9],[60,10,66,10],[60,25,66,25],[60,26,66,26],[60,27,66,27],[60,28,66,28],[68,32,74,32],[68,33,74,33],[68,27,74,27],[68,28,74,28],[68,29,74,29],[68,30,74,30],[68,31,74,31],[44,32,50,32],[44,33,50,33],[52,1,58,1],[52,2,58,2],[52,3,58,3],[52,4,58,4],[52,5,58,5],[44,9,50,9],[44,10,50,10],[44,25,50,25],[44,26,50,26],[44,27,50,27],[44,28,50,28],[52,32,58,32],[52,33,58,33],[52,27,58,27],[52,28,58,28],[52,29,58,29],[52,30,58,30],[52,31,58,31],[44,1,50,1],[52,26,58,26],[52,6,58,6],[52,7,58,7],[36,32,42,32],[36,33,42,33],[36,27,42,27],[36,28,42,28],[36,29,42,29],[36,30,42,30],[36,31,42,31],[44,2,50,2],[44,3,50,3],[44,4,50,4],[44,5,50,5],[44,6,50,6],[44,7,50,7],[44,8,50,8],[36,26,42,26],[36,6,42,6],[36,7,42,7],[36,8,42,8],[36,9,42,9],[36,10,42,10],[36,25,42,25],[44,29,50,29],[44,30,50,30],[44,31,50,31],[36,1,42,1],[36,2,42,2],[36,3,42,3],[36,4,42,4],[36,5,42,5],[28,9,34,9],[28,10,34,10],[28,25,34,25],[28,26,34,26],[28,1,34,1],[28,8,34,8],[28,30,34,30],[28,31,34,31],[28,32,34,32],[28,33,34,33],[28,27,34,27],[28,28,34,28],[20,32,26,32],[20,33,26,33],[20,27,26,27],[28,29,34,29],[12,33,18,33],[12,27,18,27],[12,28,18,28],[20,29,26,29],[20,30,26,30],[20,31,26,31],[12,25,18,25],[12,26,18,26],[12,29,18,29],[12,30,18,30],[12,31,18,31],[12,32,18,32],[20,26,26,26],[20,25,26,25],[20,28,26,28],[12,1,18,1],[12,2,18,2],[20,1,26,1],[20,2,26,2],[20,3,26,3],[20,4,26,4],[20,5,26,5],[12,9,18,9],[12,10,18,10],[12,3,18,3],[12,4,18,4],[12,5,18,5],[12,6,18,6],[12,7,18,7],[12,8,18,8],[5,1,5,3],[9,32,9,33],[10,1,11,1],[10,2,11,2],[10,3,11,3],[10,4,11,4],[10,5,11,5],[10,6,11,6],[10,7,10,8],[10,9,10,10],[10,11,10,14],[9,1,9,10],[9,25,9,26],[9,27,11,27],[9,28,11,28],[9,29,9,31],[10,15,10,17],[11,25,11,26],[11,29,11,31],[11,32,11,33],[92,4,98,4],[92,5,98,5],[92,6,98,6],[10,18,10,21],[9,11,9,24],[10,23,10,24],[11,20,11,21],[20,6,26,6],[20,7,26,7],[20,8,26,8],[20,9,26,9],[20,10,26,10],[92,7,98,7],[92,8,98,8],[139,3,141,3],[139,6,141,6],[139,5,141,5],[139,4,141,4],[139,7,140,10],[140,16,140,17],[140,20,141,20],[138,11,138,24],[28,2,34,2],[28,3,34,3],[28,4,34,4],[28,5,34,5],[28,6,34,6],[28,7,34,7],[60,2,66,2],[60,3,66,3],[60,4,66,4],[60,5,66,5],[60,6,66,6],[60,7,66,7],[60,8,66,8],[52,8,58,8],[52,9,58,9],[52,10,58,10]]}
[null,"REGULATORY REPORTING STATEMENT"]
[null,{"$f":"INDEX(dms_TradingNameFull_List,MATCH(dms_TradingName,dms_TradingName_List))","v":"Queensland Electricity Transmission Corporation Limited trading as Powerlink Queensland"}]
[null,{"$f":"INDEX(dms_Worksheet_List,MATCH(dms_Model,dms_Model_List))&\" \"&dms_Header_Span","v":"RECAST HISTORICAL CATEGORY ANALYSIS 2008-09 to 2019-20"}]
[null,"2.3 AUGEX PROJECTS"]
[]
[null,"There are THREE tables on this worksheet - each has been 'grouped' for easy navigation. Both ROWS and COLUMNS have been grouped.  See the Instructions sheet on how to group or ungroup tables. "]
[]
[null,"2.3.1 - AUGEX ASSET DATA - SUBSTATIONS"]
{"$rows_left_out":205}
{"sheet":"2.5 Connections","index":10,"n_rows":91,"n_cols":14,"rows_kept":91,"cut":false,"hidden":false,"merged":[[8,2,8,13]]}
[null,"REGULATORY REPORTING STATEMENT"]
[null,{"$f":"INDEX(dms_TradingNameFull_List,MATCH(dms_TradingName,dms_TradingName_List))","v":"Queensland Electricity Transmission Corporation Limited trading as Powerlink Queensland"}]
[null,{"$f":"INDEX(dms_Worksheet_List,MATCH(dms_Model,dms_Model_List))&\" \"&dms_Header_Span","v":"RECAST HISTORICAL CATEGORY ANALYSIS 2008-09 to 2019-20"}]
[null,"2.5 CONNECTIONS EXPENDITURE"]
[]
[null,"There are TWO tables on this worksheet. Each has been grouped (or sub-grouped).  See the Instructions sheet on how to group or ungroup data."]
[]
[null,"2.5.1 - EXPENDITURE ON CONNECTION PROJECTS"]
{"$rows_left_out":84}
{"sheet":"2.6 Non-network","index":11,"n_rows":93,"n_cols":16,"rows_kept":93,"cut":false,"hidden":false,"merged":[[8,4,8,15],[58,4,58,15],[66,4,66,15],[78,1,82,1],[83,1,87,1],[88,1,92,1],[5,1,5,2],[68,1,72,1],[60,2,60,3],[61,2,61,3],[62,2,62,3],[73,1,77,1]]}
[null,"REGULATORY REPORTING STATEMENT"]
[null,{"$f":"INDEX(dms_TradingNameFull_List,MATCH(dms_TradingName,dms_TradingName_List))","v":"Queensland Electricity Transmission Corporation Limited trading as Powerlink Queensland"}]
[null,{"$f":"INDEX(dms_Worksheet_List,MATCH(dms_Model,dms_Model_List))&\" \"&dms_Header_Span","v":"RECAST HISTORICAL CATEGORY ANALYSIS 2008-09 to 2019-20"}]
[null,"2.6 NON NETWORK EXPENDITURE"]
[]
[null,"There are THREE tables on this worksheet - each has been 'grouped' (and sub-grouped) for easy navigation. See the Instructions sheet on how to group or ungroup tables. "]
[]
[null,"2.6.1 - NON-NETWORK EXPENDITURE"]
{"$rows_left_out":86}
{"sheet":"2.7 Vegetation management","index":12,"n_rows":158,"n_cols":16,"rows_kept":158,"cut":false,"hidden":false,"merged":[[5,1,5,2],[149,1,149,3],[8,4,8,15],[83,4,83,15],[148,4,148,15]]}
[null,"REGULATORY REPORTING STATEMENT"]
[null,{"$f":"INDEX(dms_TradingNameFull_List,MATCH(dms_TradingName,dms_TradingName_List))","v":"Queensland Electricity Transmission Corporation Limited trading as Powerlink Queensland"}]
[null,{"$f":"INDEX(dms_Worksheet_List,MATCH(dms_Model,dms_Model_List))&\" \"&dms_Header_Span","v":"RECAST HISTORICAL CATEGORY ANALYSIS 2008-09 to 2019-20"}]
[null,"2.7 VEGETATION MANAGEMENT"]
[]
[null,"There are THREE tables on this worksheet. Each has been 'grouped' for easy navigation. See the Instructions sheet on how to group or ungroup data."]
[]
[null,"2.7.1 - DESCRIPTOR METRICS BY ZONE"]
{"$rows_left_out":151}
{"sheet":"2.8 Maintenance","index":13,"n_rows":58,"n_cols":17,"rows_kept":58,"cut":false,"hidden":false,"merged":[[5,1,5,2],[48,1,51,1],[52,1,54,1],[9,5,9,16],[46,1,47,1],[46,2,47,4],[46,5,46,16],[15,1,17,1],[9,1,10,1],[11,1,14,1],[9,2,10,4]]}
[null,"REGULATORY REPORTING STATEMENT"]
[null,{"$f":"INDEX(dms_TradingNameFull_List,MATCH(dms_TradingName,dms_TradingName_List))","v":"Queensland Electricity Transmission Corporation Limited trading as Powerlink Queensland"}]
[null,{"$f":"INDEX(dms_Worksheet_List,MATCH(dms_Model,dms_Model_List))&\" \"&dms_Header_Span","v":"RECAST HISTORICAL CATEGORY ANALYSIS 2008-09 to 2019-20"}]
[null,"2.8 MAINTENANCE"]
[]
[null,"There is ONE table on this worksheet. Each has been 'grouped' for easy navigation. See the Instructions sheet on how to group or ungroup data."]
[]
[null,"2.8.2 - COST METRICS FOR ROUTINE AND NON-ROUTINE MAINTENANCE"]
{"$rows_left_out":51}
{"sheet":"2.10 Overheads","index":14,"n_rows":30,"n_cols":10,"rows_kept":30,"cut":false,"hidden":false,"merged":[[5,1,5,2],[8,3,8,9],[21,3,21,9]]}
[null,"REGULATORY REPORTING STATEMENT"]
[null,{"$f":"INDEX(dms_TradingNameFull_List,MATCH(dms_TradingName,dms_TradingName_List))","v":"Queensland Electricity Transmission Corporation Limited trading as Powerlink Queensland"}]
[null,{"$f":"INDEX(dms_Worksheet_List,MATCH(dms_Model,dms_Model_List))&\" \"&dms_Header_Span","v":"RECAST HISTORICAL CATEGORY ANALYSIS 2008-09 to 2019-20"}]
[null,"2.10 OVERHEADS"]
[]
[null,"There are TWO tables on this worksheet. Each has been grouped (and sub-grouped)  for ease of navigation. See the Instructions sheet on how to group or ungroup tables. "]
[]
[null,"2.10.1 - NETWORK OVERHEADS EXPENDITURE"]
{"$rows_left_out":23}
{"sheet":"2.11 Labour","index":15,"n_rows":95,"n_cols":15,"rows_kept":95,"cut":false,"hidden":false,"merged":[[54,1,54,2],[75,3,75,14],[76,1,76,2],[5,1,5,3],[9,3,9,14],[10,1,10,2],[31,3,31,14],[32,1,32,2],[53,3,53,14]]}
[null,"REGULATORY REPORTING STATEMENT"]
[null,{"$f":"INDEX(dms_TradingNameFull_List,MATCH(dms_TradingName,dms_TradingName_List))","v":"Queensland Electricity Transmission Corporation Limited trading as Powerlink Queensland"}]
[null,{"$f":"INDEX(dms_Worksheet_List,MATCH(dms_Model,dms_Model_List))&\" \"&dms_Header_Span","v":"RECAST HISTORICAL CATEGORY ANALYSIS 2008-09 to 2019-20"}]
[null,"2.11 LABOUR"]
[]
[null,"There is ONE tables on this worksheet. Each table has been 'grouped' (and sub-grouped) for easy navigation.  See the Instructions sheet on how to group or ungroup data."]
[]
[null,"2.11.1 - COST METRICS PER ANNUM"]
{"$rows_left_out":88}
{"sheet":"2.12 Input tables","index":16,"n_rows":486,"n_cols":15,"rows_kept":486,"cut":false,"hidden":false,"merged":[[272,1,289,1],[332,1,351,1],[352,1,369,1],[11,1,30,1],[31,1,48,1],[92,1,111,1],[112,1,129,1],[172,1,191,1],[412,1,431,1],[432,1,449,1],[8,3,8,14],[9,3,9,14],[89,3,89,14],[90,3,90,14],[169,3,169,14],[170,3,170,14],[249,3,249,14],[250,3,250,14],[329,3,329,14],[330,3,330,14],[409,3,409,14],[410,3,410,14],[192,1,209,1],[252,1,271,1]]}
[null,"REGULATORY REPORTING STATEMENT"]
[null,{"$f":"INDEX(dms_TradingNameFull_List,MATCH(dms_TradingName,dms_TradingName_List))","v":"Queensland Electricity Transmission Corporation Limited trading as Powerlink Queensland"}]
[null,{"$f":"INDEX(dms_Worksheet_List,MATCH(dms_Model,dms_Model_List))&\" \"&dms_Header_Span","v":"RECAST HISTORICAL CATEGORY ANALYSIS 2008-09 to 2019-20"}]
[null,"2.12 INPUT TABLES"]
[]
[]
[null,"2.12  INPUT TABLES"]
[null,"DIRECT MATERIAL EXPENDITURE"]
{"$rows_left_out":479}
{"sheet":"Amendments","index":17,"n_rows":2,"n_cols":4,"rows_kept":2,"cut":false,"hidden":false,"merged":[[0,1,0,3]]}
[null,"NSP data amendments"]
[null,{"$f":"INDEX(dms_TradingNameFull_List,MATCH(dms_TradingName,dms_TradingName_List))","v":"Queensland Electricity Transmission Corporation Limited trading as Powerlink Queensland"},"Table","Comments"]