{"text_format":"1","workbook":"xlsx","n_sheets":23,"sheets":["CF","AER only","Instructions","Contents","Business & other details","2.1 Expenditure summary","2.2 Repex","2.2 Repex (Unlocked)","2.3(a) Augex","2.3(b) Augex","2.5 Connections","2.6 Non-network","2.7 Vegetation management","2.8 Maintenance","2.9 Emergency Response","2.10 Overheads","2.11 Labour","2.12 Input tables","4.1 Public lighting","4.2 Metering","4.3 Fee-based services","4.4 Quoted services","Amendments"],"not_rendered":{"charts":0,"images":5,"macros":1,"external_links":1,"defined_names":901,"comments":1,"pivot_tables":0},"unopened":[],"bounds":{"document_bytes":16777216,"sheet_cells":100000,"rows_first":2000,"rows_last":500,"rows_between":2000,"halvings":0,"cell_chars":16384,"cell_head_chars":4096},"cells_cut":0,"cells_raw":0,"read":"whole","date_system":"1900"}

{"sheet":"CF","index":0,"n_rows":25,"n_cols":21,"rows_kept":25,"cut":false,"hidden":true,"merged":[[1,1,1,20]]}
[]
[null,"CONDITIONAL FORMATTING MAP"]
[null,null,null,null,null,"=INDEX(dms_CF_3.6.5, MATCH(dms_TradingName,dms_CF_TradingName))=\"Y\"","=INDEX(dms_CF_3.6.6.1, MATCH(dms_TradingName,dms_CF_TradingName))=\"Y\"","=INDEX(dms_CF_3.6.6.2, MATCH(dms_TradingName,dms_CF_TradingName))=\"Y\"","=INDEX(dms_CF_3.6.6.3, MATCH(dms_TradingName,dms_CF_TradingName))=\"Y\"","=INDEX(dms_CF_3.6.7.1, MATCH(dms_TradingName,dms_CF_TradingName))=\"Y\"","=INDEX(dms_CF_3.6.7.2, MATCH(dms_TradingName,dms_CF_TradingName))=\"Y\"","=INDEX(dms_CF_3.6.7.3, MATCH(dms_TradingName,dms_CF_TradingName))=\"Y\"","=INDEX(dms_CF_3.6.7.4, MATCH(dms_TradingName,dms_CF_TradingName))=\"Y\"","=INDEX(dms_CF_6.6.1, MATCH(dms_TradingName,dms_CF_TradingName))=\"Y\"","=INDEX(dms_CF_6.8, MATCH(dms_TradingName,dms_CF_TradingName))=\"Y\"","=INDEX(dms_CF_7.12, MATCH(dms_TradingName,dms_CF_TradingName))=\"Y\"","=INDEX(dms_CF_8.1_A, MATCH(dms_TradingName,dms_CF_TradingName))=\"Y\"","=INDEX(dms_CF_8.1_B, MATCH(dms_TradingName,dms_CF_TradingName))=\"Y\"","=INDEX(dms_CF_8.1_Neg, MATCH(dms_TradingName,dms_CF_TradingName))=\"Y\""]
[null,"dms_CF_TradingName","JurisdictionList","Sector","Segment","dms_CF_3.6.5","dms_CF_3.6.6.1","dms_CF_3.6.6.2","dms_CF_3.6.6.3","dms_CF_3.6.7.1","dms_CF_3.6.7.2","dms_CF_3.6.7.3","dms_CF_3.6.7.4","dms_CF_6.6.1","dms_CF_6.8","dms_CF_7.12","dms_CF_8.1_A","dms_CF_8.1_B","dms_CF_8.1_Neg","Spare1","Spare2"]
[null,"ActewAGL Distribution","ACT","Electricity","Distribution","Y","N","Y","Y","Y","Y","N","Y","N","Y","Y","N","Y","Y","N","N"]
[null,"Ausgrid","NSW","Electricity","Distribution","Y","N","Y","Y","N","N","N","Y","N","Y","Y","N","Y","Y","N","N"]
[null,"AusNet (D)","Vic","Electricity","Distribution","N","N","N","N","N","N","N","N","N","Y","N","N","N","Y","N","N"]
[null,"AusNet (T)","Vic","Electricity","Transmission","N","N","N","N","N","N","N","N","N","Y","N","N","N","Y","N","N"]
[null,"CitiPower","Vic","Electricity","Distribution","N","N","N","N","N","N","N","N","N","Y","N","N","N","Y","N","N"]
[null,"Directlink","Qld","Electricity","Transmission","N","N","N","N","N","N","N","N","N","Y","N","N","Y","Y","N","N"]
[null,"ElectraNet","SA","Electricity","Transmission","N","N","N","N","N","N","N","N","N","Y","N","N","Y","Y","N","N"]
[null,"Endeavour Energy","NSW","Electricity","Distribution","Y","N","Y","Y","N","N","N","Y","N","Y","Y","N","Y","Y","N","N"]
[null,"Energex","Qld","Electricity","Distribution","Y","N","N","N","N","N","N","N","N","Y","Y","N","Y","Y","N","N"]
[null,"Ergon Energy","Qld","Electricity","Distribution","Y","N","N","N","N","N","N","N","N","Y","Y","N","Y","Y","N","N"]
[null,"Essential Energy","NSW","Electricity","Distribution","Y","N","Y","Y","N","N","N","Y","N","Y","Y","N","Y","Y","N","N"]
[null,"Jemena Electricity","Vic","Electricity","Distribution","N","N","N","N","N","N","N","N","N","Y","N","N","N","Y","N","N"]
[null,"Murraylink","SA","Electricity","Transmission","N","N","N","N","N","N","N","N","N","Y","N","N","Y","Y","N","N"]
[null,"Power and Water","NT","Electricity","Distribution","N","N","N","N","N","Y","N","N","Y","Y","Y","N","Y","Y","N","N"]
[null,"Powercor Australia","Vic","Electricity","Distribution","N","N","N","N","N","N","N","N","N","Y","N","N","N","Y","N","N"]
[null,"Powerlink","Qld","Electricity","Transmission","N","N","N","N","N","N","N","N","N","Y","N","N","Y","Y","N","N"]
[null,"SA Power Networks","SA","Electricity","Distribution","Y","N","N","N","N","N","N","N","N","Y","Y","Y","Y","N","N","N"]
[null,"TasNetworks (D)","Tas","Electricity","Distribution","Y","N","N","N","N","N","N","N","N","Y","Y","N","Y","Y","N","N"]
[null,"TasNetworks (T)","Tas","Electricity","Transmission","N","N","N","N","N","N","N","N","N","Y","N","N","Y","Y","N","N"]
[null,"TransGrid","NSW","Electricity","Transmission","N","N","N","N","N","N","N","N","N","Y","N","N","Y","Y","N","N"]
[null,"United Energy","Vic","Electricity","Distribution","N","N","N","N","N","N","N","N","N","Y","N","N","N","Y","N","N"]

{"sheet":"AER only","index":1,"n_rows":223,"n_cols":40,"rows_kept":223,"cut":false,"hidden":true,"merged":[[0,1,0,11],[4,27,4,38],[6,27,6,30],[6,33,6,37],[53,25,53,29],[53,30,53,33],[54,14,54,21],[54,25,54,29],[54,30,54,33],[72,14,72,15],[72,25,72,28],[93,1,95,1],[96,1,100,1],[104,1,105,1],[148,1,148,8],[54,1,54,5]]}
[null,"Data in these columns used for data validation and database purposes."]
[null,"Date last modified:","2017-01-16","added (Albury and Victora) for AGN"]
[null,null,"2016-10-17","updated TransGrid's correct legal name, corrected TasNetworks (T) to June financial year"]
[null,null,"2017-02-01","inserted Power and Water, added NRs (dms_FeederCat_1 and dms_FeederCat_2)"]
[null,null,"2017-03-03","inserted AEMO as a business",null,null,null,null,null,null,null,null,null,null,null,null,null,null,null,null,null,null,null,null,null,null,null,"FOR ELECTRICITY BUSINESSES ONLY"]
[null,null,"2018-03-28","major changes to accommodate STPIS"]
[null,null,"Template Version",5,null,null,null,null,null,null,null,null,null,null,null,null,null,null,null,null,null,null,null,null,null,null,null,"Feeder Types",null,null,null,"TasNetworks (D)","MAIFI flag","Feeder Names"]
[]
[null,null,null,null,null,null,null,null,null,null,null,null,null,null,null,null,null,null,null,null,null,null,null,null,null,null,null,"CBD","Urban","Short rural","long rural","EXTRA"]
[null,"dms_TradingName_List","dms_TradingNameFull_List","dms_ABN_List","dms_JurisdictionList","dms_Sector_List","dms_Segment_List","dms_FormControl_List","dms_RPT_List","dms_RPTMonth_List","dms_CRCPlength_List","dms_FRCPlength_List","dms_663_List","dms_DeterminationRef_List","dms_Addr1_List","dms_Addr2_List","dms_Suburb_List","dms_State_List","dms_PostCode_List","dms_PAddr1_List","dms_PAddr2_List","dms_PSuburb_List","dms_PState_List","dms_PPostCode_List","dms_ContactName1_List","dms_ContactPh1_List","dms_ContactEmail_List","dms_CBD_flag","dms_Urban_flag","dms_ShortRural_flag","dms_LongRural_flag","dms_FeederType_5_flag","dms_MAIFI_flag_List","dms_FeederName_1","dms_FeederName_2","dms_FeederName_3","dms_FeederName_4","dms_FeederName_5","dms_Public_Lighting_List","Column1"]
[null,"ActewAGL Distribution","ActewAGL Distribution",76670568688,"ACT","Electricity","Distribution","Revenue cap","Financial","June",5,5,5,"2014-19 Distribution Determination","40 Bunda Street",null,"CANBERRA","ACT",2600,"GPO BOX 366",null,"CANBERRA","ACT",2601,"Robert Walker","02 6248 3847","robert.walker@actewagle.com.au","NO","YES","YES","NO","NO","NO","CBD","Urban","Short rural","Long rural",null,"YES","ActewAGL Distribution"]
[null,"ActewAGL Distribution (Tx Assets)","ActewAGL Distribution (Tx Assets)",76670568688,"ACT","Electricity","Distribution","Revenue cap","Financial","June",5,5,5,"distribution determination","40 Bunda Street",null,"CANBERRA","ACT",2600,"GPO BOX 366",null,"CANBERRA","ACT",2601,"Robert Walker","02 6248 3847","robert.walker@actewagle.com.au","NO","YES","YES","NO","NO","NO","CBD","Urban","Short rural","Long rural",null,"NO","ActewAGL Distribution (Tx Assets)"]
[null,"ActewAGL Gas","ActewAGL Gas",76670568688,"ACT","Gas","Distribution","Weighted average price cap","Financial","June",5,5,"x",null,"40 Bunda Street",null,"CANBERRA","ACT",2600,"GPO BOX 366",null,"CANBERRA","ACT",2601,"Philip Deamer","02 6248 3438","GasAAReview@actewagl.com.au","NO","NO","NO","NO","NO","-","CBD","Urban","Short rural","Long rural",null,"NO","ActewAGL Gas"]
[null,"AEMO","Australian Energy Market Operator Ltd",94072010327,"Vic","Electricity","Transmission","-","Financial","March",5,5,"x","-","Level 22","530 Collins Street","MELBOURNE","VIC",3000,"GPO Box 2008",null,"MELBOURNE","VIC",3001,null,null,null,"NO","NO","NO","NO","NO","-","CBD","Urban","Short rural","Long rural",null,"NO","AEMO"]
[null,"AGN (Albury and Victoria)","Australian Gas Networks Limited (reporting data for Albury and Victoria)",19078551685,"Vic","Gas","Distribution","Weighted average price cap","Calendar","December",5,5,"x",null,"Level 6","400 King William Street","ADELAIDE","SA",5000,"PO Box 6468","Halifax Street","ADELAIDE","SA",5000,"Craig de Laine","08 8418 1129 ","craig.delaine@agn.com.au","NO","NO","NO","NO","NO","-","CBD","Urban","Short rural","Long rural",null,"NO","AGN (Albury)"]
[null,"AGN (Albury)","Australian Gas Networks Limited (reporting data for Albury)",19078551685,"Vic","Gas","Distribution","Weighted average price cap","Calendar","December",5,5,"x",null,"Level 6","400 King William Street","ADELAIDE","SA",5000,"PO Box 6468","Halifax Street","ADELAIDE","SA",5000,"Craig de Laine","08 8418 1129 ","craig.delaine@agn.com.au","NO","NO","NO","NO","NO","-","CBD","Urban","Short rural","Long rural",null,"NO"]
[null,"AGN (SA)","Australian Gas Networks Limited (reporting data for SA)",19078551685,"SA","Gas","Distribution","Weighted average price cap","Financial","June",5,5,5,"distribution determination","Level 6","400 King William Street","ADELAIDE","SA",5000,"PO Box 6468","Halifax Street","ADELAIDE","SA",5000,"Craig de Laine","08 8418 1129 ","craig.delaine@agn.com.au","NO","NO","NO","NO","NO","-","CBD","Urban","Short rural","Long rural",null,"NO","AGN (SA)"]
[null,"AGN (Victoria)","Australian Gas Networks Limited (reporting data for Victoria)",19078551685,"Vic","Gas","Distribution","Weighted average price cap","Calendar","December",5,5,"x",null,"Level 6","400 King William Street","ADELAIDE","SA",5000,"PO Box 6468","Halifax Street","ADELAIDE","SA",5000,"Craig de Laine","08 8418 1129 ","craig.delaine@agn.com.au","NO","NO","NO","NO","NO","-","CBD","Urban","Short rural","Long rural",null,"NO","AGN (Victoria)"]
[null,"Amadeus","APT Pipelines (NT) Pty Ltd",39009737393,"NT","Gas","Transmission","Weighted average price cap","Financial","June",5,5,"x","n/a","Level 19, HSBC Building","580 George Street","SYDNEY","NSW",2000,"Level 19, HSBC Building","580 George Street","SYDNEY","NSW",2000,"Alexandra Curran","02 9275 0020","alexandra.curran@apa.com.au","NO","NO","NO","NO","NO","-","CBD","Urban","Short rural","Long rural",null,"NO","Amadeus"]
[null,"APA GasNet","APA GasNet Australia (Operations) Pty Ltd","065083009","Vic","Gas","Transmission","Weighted average price cap","Calendar","December",5,5,"x",null,"Level 19, HSBC Building","580 George Street","SYDNEY","NSW",2000,"PO Box R41",null,"ROYAL EXCHANGE","NSW",1225,"Alexandra Curran","02 9275 0020","alexandra.curran@apa.com.au","NO","NO","NO","NO","NO","-","CBD","Urban","Short rural","Long rural",null,"NO","APA GasNet"]
[null,"Ausgrid","Ausgrid",78508211731,"NSW","Electricity","Distribution","Revenue cap","Financial","June",5,5,5,"2014-19 Distribution Determination","570 George St",null,"SYDNEY","NSW",2000,"GPO Box 4009",null,"SYDNEY","NSW",2001,"John Thomson","02 9269 2312","john.thomson@ausgrid.com.au","YES","YES","YES","YES","NO","NO","CBD","Urban","Short rural","Long rural",null,"YES","Ausgrid"]
[null,"Ausgrid (Tx Assets)","Ausgrid (Tx Assets)",67505337385,"NSW","Electricity","Distribution","Revenue cap","Financial","June",5,5,5,"distribution determination","570 George St",null,"SYDNEY","NSW",2000,"GPO Box 4009",null,"SYDNEY","NSW",2001,"John Thomson","02 9269 2312","john.thomson@ausgrid.com.au","YES","YES","YES","YES","NO","NO","CBD","Urban","Short rural","Long rural",null,"NO","Ausgrid (Tx Assets)"]
[null,"AusNet (D)","AusNet Electricity Services Pty Ltd",91064651118,"Vic","Electricity","Distribution","Revenue cap","Calendar","December",5,5,2,"2016-20 Distribution Determination","Level 32","2 Southbank Boulevard","SOUTHBANK","Vic",3006,"Locked Bag 14051",null,"MELBOURNE CITY MAIL CENTRE","VIC",8001,"please provide contact details",null,null,"NO","YES","YES","YES","NO","YES","CBD","Urban","Short rural","Long rural",null,"YES","AusNet (D)"]
[null,"AusNet (Gas)","AusNet Gas Services","086015036","Vic","Gas","Distribution","Weighted average price cap","Calendar","December",5,5,"X",null,"Level 19, HSBC Building","580 George Street","SYDNEY","NSW",2000,"PO Box R41",null,"ROYAL EXCHANGE","NSW",1225,"Alexandra Curran","02 9275 0020","alexandra.curran@apa.com.au","NO","NO","NO","NO","NO","-","CBD","Urban","Short rural","Long rural",null,"NO","AusNet (Gas)"]
[null,"AusNet (T)","Ausnet Services (Transmission) Ltd",48116124362,"Vic","Electricity","Transmission","Revenue cap","Financial","March",5,5,2,"transmission determination","Level 32","2 Southbank Boulevard","SOUTHBANK","Vic",3006,"Locked Bag 14051",null,"MELBOURNE CITY MAIL CENTRE","Vic",8001,"Clare Thompson","03 9695 6670","clare.e.thompson@ausnetservices.com.au","NO","NO","NO","NO","NO","-","CBD","Urban","Short rural","Long rural",null,"NO","AusNet (T)"]
[null,"Australian Distribution Co.","Australian Distribution Co.",11222333444,"-","Electricity","Distribution","Revenue cap","Financial","June",5,5,2,"distribution determination","123 Straight Street",null,"SYDNEY","NSW",2000,"PO Box 123",null,"SYDNEY","NSW",2000,"Bob Smith","02 1234 5678","bob@auselec.net.au","YES","YES","YES","YES","NO","NO","CBD","Urban","Short rural","Long rural",null,"YES","Australian Distribution Co."]
[null,"Australian Distribution Co. (Gas)","Australian Gas Distribution Co. ",11222333444,"NSW","Gas","Distribution","Weighted average price cap","Financial","June",5,5,null,null,"123 Straight Street",null,"SYDNEY","NSW",2000,"PO Box 123",null,"SYDNEY","NSW",2000,"Bob Smith","02 1234 5678","bob@auselec.net.au","NO","NO","NO","NO","NO","-","CBD","Urban","Short rural","Long rural",null,"NO","Australian Distribution Co. (Vic)"]
[null,"Australian Distribution Co. (Vic)","Australian Distribution Co. (Victoria)",11222333444,"Vic","Electricity","Distribution","Revenue cap","Calendar","December",5,5,2,"distribution determination","123 Straight Street",null,"MELBOURNE","Vic",3000,"PO Box 123",null,"MELBOURNE","VIC",3000,"Bob Smith","02 1234 5678","bob@auselec.net.au","NO","NO","NO","NO","NO","YES","CBD","Urban","Short rural","Long rural",null,"YES","Australian Distribution Co. (Vic)"]
[null,"Australian Transmission Co.","Australian Transmission Co.",11222333444,"-","Electricity","Transmission","Revenue cap","Financial","June",5,5,5,"transmission determination","123 Straight Street",null,"SYDNEY","NSW",2000,"PO Box 123",null,"SYDNEY","NSW",2000,"Bob Smith","02 1234 5678","bob@auselec.net.au","NO","NO","NO","NO","NO","-","CBD","Urban","Short rural","Long rural",null,"NO","Australian Transmission Co."]
[null,"Central Ranges Pipeline (D)","Central Ranges Pipeline Pty Ltd",108218355,"NSW","Gas","Distribution","Weighted average price cap","Financial","June",15,5,5,"distribution determination","Level 19","580 George Street","SYDNEY","NSW",2000,"PO Box R41",null,"ROYAL EXCHANGE","NSW",1225,"Scott Young","02 9275 0031","scott.young@apa.com.au","NO","NO","NO","NO","NO","-","CBD","Urban","Short rural","Long rural",null,"NO"]
[null,"Central Ranges Pipeline (T)","Central Ranges Pipeline Pty Ltd",108218355,"NSW","Gas","Distribution","Weighted average price cap","Financial","June",14,5,5,"transmission determination","Level 19","580 George Street","SYDNEY","NSW",2000,"PO Box R41",null,"ROYAL EXCHANGE","NSW",1225,"Scott Young","02 9275 0031","scott.young@apa.com.au","NO","NO","NO","NO","NO","-","CBD","Urban","Short rural","Long rural",null,"NO"]
[null,"CitiPower","CitiPower",76064651056,"Vic","Electricity","Distribution","Revenue cap","Calendar","December",5,5,2,"2016-20 Distribution Determination","40 Market Street",null,"MELBOURNE","Vic",3000,"Locked Bag 14090",null,"MELBOURNE","VIC",8001,"Hannah Williams","03 9683 4088","hwilliams@powercor.com.au","YES","YES","NO","NO","NO","YES","CBD","Urban","Short rural","Long rural",null,"YES","CitiPower"]
[null,"Directlink","Directlink",16779340889,"Qld","Electricity","Transmission","Revenue cap","Financial","June",5,5,5,"transmission determination","Level 19, HSBC Building","580 George Street","SYDNEY","NSW",2000,"PO Box R41",null,"ROYAL EXCHANGE","NSW",1225,"Scott Young","02 9275 0031","scott.young@apa.com.au","NO","NO","NO","NO","NO","-","CBD","Urban","Short rural","Long rural",null,"NO","Directlink"]
[null,"ElectraNet","ElectraNet",41094482416,"SA","Electricity","Transmission","Revenue cap","Financial","June",5,5,5,"transmission determination","52-55 East Terrace","Rymill Park","ADELAIDE","SA",5000,"PO Box 7096","Hutt Street Post Office","ADELAIDE","SA",5000,"Bill Jackson","08 8404 7969","jackson.bill@electranet.com.au","NO","NO","NO","NO","NO","-","CBD","Urban","Short rural","Long rural",null,"NO","ElectraNet"]
[null,"Endeavour Energy","Endeavour Energy",11247365823,"NSW","Electricity","Distribution","Revenue cap","Financial","June",5,5,5,"2014-19 Distribution Determination","51 Huntingwood Drive",null,"HUNTINGWOOD","NSW",2148,"PO Box 811",null,"SEVEN HILLS","NSW",1730,"Jon Hocking","02 9853 4386 / 0407 348 156","Jon.Hocking@Endeavourenergy.com.au","NO","YES","YES","YES","NO","NO","CBD","Urban","Short rural","Long rural",null,"YES","Endeavour Energy"]
[null,"Energex","Energex",40078849055,"Qld","Electricity","Distribution","Revenue cap","Financial","June",5,5,5,"2015-20 Distribution Determination","26 Reddacliff Street",null,"NEWSTEAD","Qld",4006,"26 Reddacliff Street",null,"NEWSTEAD","QLD",4006,"Jenny Doyle, Group Manager Regulatory Affairs","(07) 3851 6416","jenny.doyle@ergon.com.au","YES","YES","YES","NO","NO","NO","CBD","Urban","Short rural","Long rural",null,"YES","Energex"]
[null,"Ergon Energy","Ergon Energy",50087646062,"Qld","Electricity","Distribution","Revenue cap","Financial","June",5,5,5,"2015-20 Distribution Determination","22 Walker Street",null,"TOWNSVILLE","Qld",4810,"Po Box 264",null,"FORTITUDE VALLEY","QLD",4006,"Jenny Doyle, Group Manager Regulatory Affairs","(07) 3851 6416","jenny.doyle@ergon.com.au","NO","YES","YES","YES","NO","NO","CBD","Urban","Short rural","Long rural",null,"YES","Ergon Energy"]
[null,"Essential Energy","Essential Energy",37428185226,"NSW","Electricity","Distribution","Revenue cap","Financial","June",5,5,5,"2014-19 Distribution Determination","8 Buller Street",null,"PORT MACQUARIE","NSW",2444,"PO Box 5730",null,"PORT MACQUARIE","NSW",2444,"Catherine Waddell","02 6338 3553","catherine.waddell@essentialenergy.com.au","NO","NO","YES","YES","NO","NO","CBD","Urban","Short rural","Long rural",null,"YES","Essential Energy"]
[null,"Jemena Electricity","Jemena Electricity",82064651083,"Vic","Electricity","Distribution","Revenue cap","Calendar","December",5,5,2,"2016-20 Distribution Determination","Level 16","567 Collins Street","MELBOURNE","VIC",3000,"PO Box 16182",null,"MELBOURNE","VIC",8001,"Matthew Serpell","03 9173 8231","matthew.serpell@jemena.com.au","NO","YES","YES","NO","NO","YES","CBD","Urban","Short rural","Long rural",null,"YES","Jemena Electricity"]
[null,"JGN","Jemena Gas Networks (NSW) Ltd","003 004 322","NSW","Gas","Distribution","Weighted average price cap","Financial","June",5,5,null,null,null,null,null,null,null,null,null,null,null,null,"please provide contact details",null,null,"NO","NO","NO","NO","NO","-","CBD","Urban","Short rural","Long rural",null,"NO","JGN"]
[null,"Multinet Gas","Multinet Gas (DB No.1) Pty Ltd (ACN 086 026 986), Multinet Gas (DB No.2) Pty Ltd (ACN 086 230 122)","086026986","Vic","Gas","Distribution","Weighted average price cap","Calendar","December",5,5,"x",null,"43-45 Centreway",null,"MT WAVERLEY","Vic",3149,null,null,null,null,null,"Andrew Schille","03 8846 9860","andrew.schille@ue.com.au","NO","NO","NO","NO","NO","-","CBD","Urban","Short rural","Long rural",null,"NO","Multinet Gas"]
[null,"Murraylink","Murraylink",79181207909,"SA","Electricity","Transmission","Revenue cap","Financial","June",5,5,5,"transmission determination","Level 19","580 George Street","SYDNEY","NSW",2000,"PO Box R41",null,"ROYAL EXCHANGE","NSW",1225,"Scott Young","02 9275 0031","scott.young@apa.com.au","NO","NO","NO","NO","NO","-","CBD","Urban","Short rural","Long rural",null,"NO","Murraylink"]
[null,"Power and Water","Power and Water Corporation",15947352360,"NT","Electricity","Distribution","Revenue cap","Financial","June",5,5,"x","distribution determination","GPO Box 1921",null,"DARWIN","NT",801,"GPO Box 1921",null,"DARWIN","NT",801,"Lucy Moon","08 8924 5822","Lucy.Moon@powerwater.com.au","YES","YES","YES","YES","NO","NO","CBD","Urban","Short rural","Long rural",null,"NO","Power and Water"]
[null,"Powercor Australia","Powercor Australia",89064651109,"Vic","Electricity","Distribution","Revenue cap","Calendar","December",5,5,2,"2016-20 Distribution Determination","40 Market Street",null,"MELBOURNE","Vic",3000,"Locked bag 14090",null,"MELBOURNE","VIC",8001,"Hannah Williams","03 9683 4088","hwilliams@powercor.com.au","NO","NO","YES","YES","NO","YES","CBD","Urban","Short rural","Long rural",null,"YES","Powercor Australia"]
[null,"Powerlink","Queensland Electricity Transmission Corporation Limited trading as Powerlink Queensland",82078849233,"Qld","Electricity","Transmission","Revenue cap","Financial","June",5,5,5,"transmission determination","33 Harold St",null,"VIRGINIA","Qld",4014,"PO Box 1193",null,"VIRGINIA","QLD",4014,"Jennifer Harris","07 3860 2667","jharris@powerlink.com.au","NO","NO","NO","NO","NO","-","CBD","Urban","Short rural","Long rural",null,"NO","Powerlink"]
[null,"Roma to Brisbane Pipeline","APT Petroleum Pipelines Limited t/a Roma to Brisbane Pipeline","009 737 393","Qld","Gas","Transmission","Weighted average price cap","Financial","June",5,5,"x","n/a","580 George Street",null,"SYDNEY","NSW",2000,"PO Box R41",null,"ROYAL EXCHANGE","NSW",1225,"Mark Allen","02 9275 0010","mark.allen@apa.com.au","NO","NO","NO","NO","NO","-","CBD","Urban","Short rural","Long rural",null,"NO","Roma to Brisbane Pipeline"]
[null,"SA Power Networks","SA Power Networks",13332330749,"SA","Electricity","Distribution","Revenue cap","Financial","June",5,5,5,"2015-20 Distribution Determination","1 Anzac Highway",null,"KESWICK","SA",5035,"GPO Box 77",null,"ADELAIDE","SA",5000,"Richard Sibly","08 8404 5613","richard.sibly@sapowernetworks.com.au","NO","NO","YES","YES","NO","NO","CBD","Urban","Short rural","Long rural",null,"NO","SA Power Networks"]
[null,"TasNetworks (D)","TasNetworks (D)",24167357299,"Tas","Electricity","Distribution","Revenue cap","Financial","June",5,5,5,"distribution determination","1-7 Maria Street",null,"LENAH VALLEY","Tas",7008,"PO Box 606",null,"MOONAH","Tas",7009,"John Sayers","03 6271 6469","john.sayers@tasnetworks.com.au","YES","YES","YES","YES","YES","NO","Critical Infrastructure","High density commercial","Urban","High density rural","Low density rural","YES","TasNetworks (D)"]
[null,"TasNetworks (T)","TasNetworks (T)",24167357299,"Tas","Electricity","Transmission","Revenue cap","Financial","June",5,5,5,"transmission determination","1-7 Maria Street",null,"LENAH VALLEY","Tas",7008,"PO Box 606",null,"MOONAH","Tas",7009,"John Sayers","03 6271 6469","john.sayers@tasnetworks.com.au","NO","NO","NO","NO","NO","-","CBD","Urban","Short rural","Long rural",null,"NO","TasNetworks (T)"]
[null,"TransGrid","NSW Electricity Networks Operations Pty Ltd trading as TransGrid","70 250 995 390","NSW","Electricity","Transmission","Revenue cap","Financial","June",4,5,5,"transmission determination","180 Thomas Street",null,"SYDNEY","NSW",2000,"PO Box A1000",null,"SYDNEY SOUTH","NSW",1235,"Garrie Chubb","0408 210 221","garrie.chubb@transgrid.com.au","NO","NO","NO","NO","NO","-","CBD","Urban","Short rural","Long rural",null,"NO","TransGrid"]
[null,"United Energy","United Energy",70064651029,"Vic","Electricity","Distribution","Revenue cap","Calendar","December",5,5,2,"2016-20 Distribution Determination","Level 3","6 Nexus Court","MULGRAVE","Vic",3149,"PO Box 449",null,"MOUNT WAVERLEY","VIC",3170,"Mathew Abraham","03 8846 9758","mathew.abraham@ue.com.au","NO","NO","YES","NO","NO","YES","CBD","Urban","Short rural","Long rural",null,"YES","United Energy"]
[]
[]
[null,null,null,null,null,null,null,null,null,null,null,null,null,null,null,null,null,null,null,null,null,null,null,null,null,"For EB & Reset RINs only",null,null,null,null,"For AARs only"]
[null,"The Reg Year Ending (dms_RYE) must be set to the last year of the regulatory period. For forecast data is is usually (FRCP_y5) for actual it is a single year (CRY). For historical actual data the RYE will need to be set manually in the business details sheet by setting the dms_Multiyear_flag to 1 and putting the correct value in 'dms_Specified_FinalYear. See cells C67:C68",null,null,null,null,null,null,null,null,null,null,null,"Drop down selector box for CA & Reset RINs.","For CA & Reset RINs only",null,null,null,null,null,null,null,null,null,null,"for DNSP only",null,null,null,null,"For DNSPs only"]
[null,"dms_Model_List ","dms_Worksheet_List",null,"dms_RYE_Formula_Result",null,null,null,null,null,null,null,null,"dms_0203_ProjectType","dms_020303_01_UOM","dms_020501_01_UOM","dms_020501_02_UOM","dms_020501_03_UOM","dms_020501_04_UOM","dms_020603_01_UOM","dms_020701_01_UOM","dms_020701_02_UOM","dms_020701_01_Rows","dms_040102_01_UOM","dms_040102_04_UOM","dms_030601_01_UOM","dms_030601_02_UOM","dms_030701_01_UOM","dms_030702_01_UOM","dms_030703_01_UOM","dms_030605_UOM","dms_03060703_UOM"]
[null,"ARR","ANNUAL REPORTING STATEMENT",null,{"$f":"LEFT(dms_SingleYear_FinalYear_Result,2)&RIGHT(dms_SingleYear_FinalYear_Result,2)","v":"2009"},"=LEFT(dms_SingleYear_FinalYear_Result,2)&RIGHT(dms_SingleYear_FinalYear_Result,2)",null,"Formula errors are OK",null,null,null,null,null,"New line on new route - single circuit","Circuit line length in km","0's","0's","0's","0's","0's","km","km","Route line length within zone","0's","days","minutes/customer","minutes/customer","Customer / km","%","km","number","number"]
[null,"CA","CATEGORY ANALYSIS",null,{"$f":"LEFT(dms_SingleYear_FinalYear_Result,2)&RIGHT(dms_SingleYear_FinalYear_Result,2)","v":"2009"},"=LEFT(dms_SingleYear_FinalYear_Result,2)&RIGHT(dms_SingleYear_FinalYear_Result,2)",null,"Formula errors are OK",null,null,null,null,null,"New line on new route - dual circuit","Circuit line length in km","0's","0's","0's","0's","0's","0's","0's","Number of maintenance spans","0's","0's","minutes/customer","minutes/customer","MWh/customer","Number of spans",null,"number","number"]
[null,"CESS","CAPITLAL EXPENDITURE SHARING SCHEMING",null,"2016","=LEFT(dms_SingleYear_FinalYear_Result,2)&RIGHT(dms_SingleYear_FinalYear_Result,2)",null,null,null,null,null,null,null,"New line on new route - other","Circuit line length in km","MVA added","MVA added","MVA added","MVA added","0's","km","km","Total length of maintenance spans","0's","$0s","interruptions/customer","interruptions/customer","kVA / customer","Number of spans",null,"number","number"]
[null,"CPI","CPI",null,null,null,null,null,null,null,null,null,null,"Line rebuild over existing route - single circuit","Circuit line length in km","0's","0's","0's","0's","0's","km","km","Length of vegetation corridors","$0s","0's","interruptions/customer","interruptions/customer",null,"Number of spans",null,"number","number"]
[null,"EB","ECONOMIC BENCHMARKING",null,{"$f":"LEFT(dms_SingleYear_FinalYear_Result,2)&RIGHT(dms_SingleYear_FinalYear_Result,2)","v":"2009"},"=LEFT(dms_SingleYear_FinalYear_Result,2)&RIGHT(dms_SingleYear_FinalYear_Result,2)",null,"Formula errors are OK",null,null,null,null,null,"Line rebuild over existing route - dual circuit","Number","total spend $0s","total spend $0s","total spend $0s","total spend $0s","(per cent)","0's","0's","Average number of trees per maintenance span",null,null,null,null,null,"Number of spans",null,"number","(per cent)"]
[null,"PTRM","POST TAX REVENUE MODEL",null,{"$f":"LEFT(dms_MultiYear_FinalYear_Result,2)&RIGHT(dms_MultiYear_FinalYear_Result,2)","v":"2019"},"=LEFT(dms_MultiYear_FinalYear_Result,2)&RIGHT(dms_MultiYear_FinalYear_Result,2)",null,null,null,null,null,null,null,"Reconductor - Single circuit","Number","net circuit km added","net circuit km added","net circuit km added","net circuit km added",null,"years","years","Average frequency of cutting cycle",null,null,null,null,null,"Years",null,"number"]
[null,"Reset","REGULATORY REPORTING STATEMENT",null,{"$f":"LEFT(dms_MultiYear_FinalYear_Result,2)&RIGHT(dms_MultiYear_FinalYear_Result,2)","v":"2019"},"=LEFT(dms_MultiYear_FinalYear_Result,2)&RIGHT(dms_MultiYear_FinalYear_Result,2)",null,"Formula errors are OK",null,null,null,null,null,"Reconductor - Dual circuit","Number","total spend $0s","total spend $0s","total spend $0s","total spend $0s",null,null,null,null,null,null,null,null,null,"Years",null,"number"]
[null,"RFM","ROLL FORWARD MODEL",null,{"$f":"LEFT(dms_CRCP_FinalYear_Result,2)&RIGHT(dms_CRCP_FinalYear_Result,2)","v":"2019"},"=LEFT(dms_CRCP_FinalYear_Result,2)&RIGHT(dms_CRCP_FinalYear_Result,2)",null,null,null,null,null,null,null,"Other",null,"net circuit km added","net circuit km added","net circuit km added","net circuit km added",null,null,null,null,null,null,null,null,null,"Trees",null,"number"]
[null,"WACC","WEIGHTED AVERAGE COST OF CAPITAL",null,{"$f":"LEFT(dms_MultiYear_FinalYear_Result,2)&RIGHT(dms_MultiYear_FinalYear_Result,2)","v":"2019"},"=LEFT(dms_MultiYear_FinalYear_Result,2)&RIGHT(dms_MultiYear_FinalYear_Result,2)",null,null,null,null,null,null,null,null,null,"total spend $0s","total spend $0s","total spend $0s","total spend $0s",null,null,null,null,null,null,null,null,null,"Trees",null,"number"]
[null,null,null,null,null,null,null,null,null,null,null,null,null,null,null,"0's",null,"$0s",null,null,null,null,null,null,null,null,null,null,"Defects",null,"number"]
[null,"dms_DataQuality_List",null,null,null,null,null,null,null,null,null,null,null,null,null,"0's",null,null,null,null,null,null,null,null,null,null,null,null,"Defects",null,"number"]
[null,"Actual",null,null,null,null,null,null,null,null,null,null,null,null,null,"0's",null,null,null,null,null,null,null,null,null,null,null,null,"Spans",null,"number"]
[null,"Estimate",null,null,null,null,null,null,null,null,null,null,null,null,null,"$0s",null,null,null,null,null,null,null,null,null,null,null,null,"km",null,"(per cent)"]
[null,"Consolidated",null,null,null,null,null,null,null,null,null,null,null,null,null,null,null,null,null,null,null,null,null,null,null,null,null,null,"Spans",null,"(per cent)",""]
[null,"Recast"]
[null,"Public"]
[null,null,null,null,null,null,null,null,null,null,null,null,null,null,"For PTRM files - this field set the text for the named range \"DMS_Xfactor\" which in all cases is simply the text \"x factors\" - this saves putting in each old gas PTRM file ",null,null,null,null,null,null,null,null,null,null,"for TNSP only"]
[null,"For all files either AER or business needs to be able to specify the type of submission","For PTRM & RFM templates we must provide a choice in case they change their form of control - otherwise it is drawn from the business specific lookup table above.",null,null,null,null,null,null,null,null,null,null,null,"DMS_Xfactor",null,null,null,null,null,null,null,null,null,null,"dms_030601_01_UOM",null,"dms_030701_01_UOM","dms_030702_01_UOM"]
[null,"dms_SourceList","dms_FormControl_Choices",null,null,null,null,null,null,null,null,null,null,null,"x factors",null,null,null,null,null,null,null,null,null,null,"%",null,"Number of spans","km"]
[null,"After appeal","Revenue cap",null,null,null,null,null,null,null,null,null,null,null,null,null,null,null,null,null,null,null,null,null,null,"number",null,"Years","%"]
[null,"Draft decision","Revenue yield",null,null,null,null,null,null,null,null,null,null,null,null,null,null,null,null,null,null,null,null,null,null,"number",null,"Trees","km"]
[null,"Final decision","Weighted average price cap",null,null,null,null,null,null,null,null,null,null,null,null,null,null,null,null,null,null,null,null,null,null,"%",null,"Defects","number"]
[null,"PTRM update 1",null,null,null,null,null,null,null,null,null,null,null,null,null,null,null,null,null,null,null,null,null,null,null,"number",null,"Number of spans"]
[null,"PTRM update 2",null,null,null,null,null,null,null,null,null,null,null,null,null,null,null,null,null,null,null,null,null,null,null,"number",null,"km"]
[null,"PTRM update 3",null,null,null,null,null,null,null,null,null,null,null,null,null,null,null,null,null,null,null,null,null,null,null,"%",null,"km"]
[null,"PTRM update 4",null,null,null,null,null,null,null,null,null,null,null,null,null,null,null,null,null,null,null,null,null,null,null,"number",null,"Number of spans"]
[null,"PTRM update 5",null,null,null,null,null,null,null,null,null,null,null,null,null,null,null,null,null,null,null,null,null,null,null,"number"]
[null,"PTRM update 6",null,null,null,null,null,null,null,null,null,null,null,null,null,null,null,null,null,null,null,null,null,null,null,"%"]
[null,"PTRM update 7",null,null,null,null,null,null,null,null,null,null,null,null,null,null,null,null,null,null,null,null,null,null,null,"number"]
[null,"Regulatory proposal",null,null,null,null,null,null,null,null,null,null,null,null,null,null,null,null,null,null,null,null,null,null,null,"%"]
[null,"Reporting",null,null,null,null,null,null,null,null,null,null,null,null,null,null,null,null,null,null,null,null,null,null,null,"number"]
[null,"Revised regulatory proposal",null,null,null,null,null,null,null,null,null,null,null,null,null,null,null,null,null,null,null,null,null,null,null,"%"]
[null,null,null,null,null,null,null,null,null,null,null,null,null,null,null,null,null,null,null,null,null,null,null,null,null,"number"]
[]
[]
[]
[null,"Reason for interruption","dms_Reason_Interruption_Detailed","dms_Reason_Interruption","dms_STPIS_Exclusion_List","dms_020301_ProjectType_List","dms_020302_ProjectType_List"]
[null,"Animal","Animal impact","Animal","Weather","New substation establishment","New line on new route - single circuit"]
[null,null,"Animal nesting/burrowing, etc and other","Asset failure","Equipment failure","Capacity upgrade","New line on new route - dual circuit"]
[null,null,"Other","Other","Operational error","Voltage upgrade","New line on new route - other"]
[null,"Asset failure","LV","Overloads","Vegetation","Other","Line rebuild over existing route - single circuit"]
[null,null,"Distribution substation","Planned","Animals",null,"Line rebuild over existing route - dual circuit"]
[null,null,"HV","Network business","Third party impacts",null,"Reconductor - Single circuit"]
[null,null,"Zone substation","Third party","Transmission failure",null,"Reconductor - Dual circuit"]
[null,null,"Subtransmission","Unknown","Load shedding",null,"Reconductor - Other"]
[null,"Other","insert description of 'other'","Vegetation","Inter-distributor connection failure",null,"Line upgrade - raising/retensoring"]
[null,"Overloads","-","Weather","Other",null,"Line upgrade - voltage upgrade"]
[null,"Planned","-","2 - STPIS Exclusion (3.3)(a)",null,null,"Line upgrade - capacity"]
[null,"Network business","Network error","3 - STPIS Exclusion (3.3)(a)",null,null,"String spare circuit"]
[null,null,"Switching and protection error","4 - STPIS Exclusion (3.3)(a)",null,null,"Other"]
[null,"Third party","Fire","5 - STPIS Exclusion (3.3)(a)"]
[null,null,"Other","6 - STPIS Exclusion (3.3)(a)"]
[null,null,"Dig-in","7 - STPIS Exclusion (3.3)(a)"]
[null,null,"Unauthorised access"]
[null,null,"Vehicle impact"]
[null,"Unknown","Unknown"]
[null,"Vegetation","Blow-in/Fall-in - NSP responsibility"]
[null,null,"Grow-in - NSP responsibility"]
[null,null,"Blow-in/Fall-in - Other responsible party"]
[null,null,"Grow-in - Other responsible party"]
[null,"Weather"]
[null,"2 - STPIS Exclusion (3.3)(a)"]
[null,"3 - STPIS Exclusion (3.3)(a)"]
[null,"4 - STPIS Exclusion (3.3)(a)"]
[null,"5 - STPIS Exclusion (3.3)(a)"]
[null,"6 - STPIS Exclusion (3.3)(a)"]
[null,"7 - STPIS Exclusion (3.3)(a)"]
[]
[]
[]
[]
[]
[]
[]
[null,"These are indeces and lookup values for various dates. All step from the value placed in FRCP_y1 on the business and other details worksheet",null,null,null,null,null,null,null,null,null,null,null,null,"These date tables are currently used in the Recast templates to provide column headings and conditional formatting"]
[null,"dms_FRCPlength_Num_List","dms_FinalYear_List","dms_CRCPlength_Num_List","dms_CFinalYear_List","dms_FRCP_years",null,"dms_CRCP_years",null,"dms_CRCP_index",null,"dms_Financial_Years","dms_Calendar_Years",null,"CRY from input cell on business sheet","CRY - financial","dms_FinYears","CRY calendar","dms_CalYears"]
[null,1,"dms_FRCP_y1",1,"CRCP_y1",{"$f":"FRCP_y1","v":"2008-09"},"dms_FRCP_y1",{"$f":"IF(dms_RPT=\"financial\",VALUE(LEFT(dms_FRCP_y1,4)-1)&\"-\"&TEXT(VALUE(MID(dms_FRCP_y1,3,2)),\"00\"),VALUE(LEFT(dms_FRCP_y1,4)-1))","v":"2007-08"},"dms_CRCP_yZ",1,null,"2005-06","2006",null,{"$f":"CRY","v":"2008-09"},{"$f":"VALUE(LEFT(CRY,4))&\"-\"&TEXT(MID(CRY,3,2)+1,\"00\")","v":"2008-09"},"dms_CRYf_y1",{"$f":"VALUE(LEFT(CRY,4)+1)","v":2009},"dms_CRYc_y1"]
[null,2,"dms_FRCP_y2",2,"CRCP_y2",{"$f":"IF(dms_RPT=\"financial\",VALUE(LEFT(dms_FRCP_y1,4)+1)&\"-\"&TEXT(VALUE(RIGHT(dms_FRCP_y1,2)+1),\"00\"),VALUE(LEFT(dms_FRCP_y1,4)+1))","v":"2009-10"},"dms_FRCP_y2",{"$f":"IF(dms_RPT=\"financial\",VALUE(LEFT(dms_CRCP_yZ,4)-1)&\"-\"&TEXT(VALUE(MID(dms_CRCP_yZ,3,2)),\"00\"),VALUE(LEFT(dms_CRCP_yZ,4)-1))","v":"2006-07"},"dms_CRCP_yY",2,null,"2006-07","2007",null,null,{"$f":"VALUE(LEFT(dms_CRYf_y1,4)+1)&\"-\"&TEXT(MID(dms_CRYf_y1,3,2)+2,\"00\")","v":"2009-10"},"dms_CRYf_y2",{"$f":"VALUE(LEFT(dms_CRYc_y1,4)+1)","v":2010},"dms_CRYc_y2"]
[null,3,"dms_FRCP_y3",3,"CRCP_y3",{"$f":"IF(dms_RPT=\"financial\",VALUE(LEFT(dms_FRCP_y2,4)+1)&\"-\"&TEXT(VALUE(RIGHT(dms_FRCP_y2,2)+1),\"00\"),VALUE(LEFT(dms_FRCP_y2,4)+1))","v":"2010-11"},"dms_FRCP_y3",{"$f":"IF(dms_RPT=\"financial\",VALUE(LEFT(dms_CRCP_yY,4)-1)&\"-\"&TEXT(VALUE(MID(dms_CRCP_yY,3,2)),\"00\"),VALUE(LEFT(dms_CRCP_yY,4)-1))","v":"2005-06"},"dms_CRCP_yX",3,null,"2007-08","2008",null,null,{"$f":"VALUE(LEFT(dms_CRYf_y2,4)+1)&\"-\"&TEXT(MID(dms_CRYf_y2,3,2)+2,\"00\")","v":"2010-11"},"dms_CRYf_y3",{"$f":"VALUE(LEFT(dms_CRYc_y2,4)+1)","v":2011},"dms_CRYc_y3"]
[null,4,"dms_FRCP_y4",4,"CRCP_y4",{"$f":"IF(dms_RPT=\"financial\",VALUE(LEFT(dms_FRCP_y3,4)+1)&\"-\"&TEXT(VALUE(RIGHT(dms_FRCP_y3,2)+1),\"00\"),VALUE(LEFT(dms_FRCP_y3,4)+1))","v":"2011-12"},"dms_FRCP_y4",{"$f":"IF(dms_RPT=\"financial\",VALUE(LEFT(dms_CRCP_yX,4)-1)&\"-\"&TEXT(VALUE(MID(dms_CRCP_yX,3,2)),\"00\"),VALUE(LEFT(dms_CRCP_yX,4)-1))","v":"2004-05"},"dms_CRCP_yW",4,null,"2008-09","2009",null,null,{"$f":"VALUE(LEFT(dms_CRYf_y3,4)+1)&\"-\"&TEXT(MID(dms_CRYf_y3,3,2)+2,\"00\")","v":"2011-12"},"dms_CRYf_y4",{"$f":"VALUE(LEFT(dms_CRYc_y3,4)+1)","v":2012},"dms_CRYc_y4"]
[null,5,"dms_FRCP_y5",5,"CRCP_y5",{"$f":"IF(dms_RPT=\"financial\",VALUE(LEFT(dms_FRCP_y4,4)+1)&\"-\"&TEXT(VALUE(RIGHT(dms_FRCP_y4,2)+1),\"00\"),VALUE(LEFT(dms_FRCP_y4,4)+1))","v":"2012-13"},"dms_FRCP_y5",{"$f":"IF(dms_RPT=\"financial\",VALUE(LEFT(dms_CRCP_yW,4)-1)&\"-\"&TEXT(VALUE(MID(dms_CRCP_yW,3,2)),\"00\"),VALUE(LEFT(dms_CRCP_yW,4)-1))","v":"2003-04"},"dms_CRCP_yV",5,null,"2009-10",2010,null,null,{"$f":"VALUE(LEFT(dms_CRYf_y4,4)+1)&\"-\"&TEXT(MID(dms_CRYf_y4,3,2)+2,\"00\")","v":"2012-13"},"dms_CRYf_y5",{"$f":"VALUE(LEFT(dms_CRYc_y4,4)+1)","v":2013},"dms_CRYc_y5"]
[null,6,"dms_FRCP_y6",6,"CRCP_y6",{"$f":"IF(dms_RPT=\"financial\",VALUE(LEFT(dms_FRCP_y5,4)+1)&\"-\"&TEXT(VALUE(RIGHT(dms_FRCP_y5,2)+1),\"00\"),VALUE(LEFT(dms_FRCP_y5,4)+1))","v":"2013-14"},"dms_FRCP_y6",{"$f":"IF(dms_RPT=\"financial\",VALUE(LEFT(dms_CRCP_yV,4)-1)&\"-\"&TEXT(VALUE(MID(dms_CRCP_yV,3,2)),\"00\"),VALUE(LEFT(dms_CRCP_yV,4)-1))","v":"2002-03"},"dms_CRCP_yU",6,null,"2010-11",2011,null,null,{"$f":"VALUE(LEFT(dms_CRYf_y5,4)+1)&\"-\"&TEXT(MID(dms_CRYf_y5,3,2)+2,\"00\")","v":"2013-14"},"dms_CRYf_y6",{"$f":"VALUE(LEFT(dms_CRYc_y5,4)+1)","v":2014},"dms_CRYc_y6"]
[null,7,"dms_FRCP_y7",7,"CRCP_y7",{"$f":"IF(dms_RPT=\"financial\",VALUE(LEFT(dms_FRCP_y6,4)+1)&\"-\"&TEXT(VALUE(RIGHT(dms_FRCP_y6,2)+1),\"00\"),VALUE(LEFT(dms_FRCP_y6,4)+1))","v":"2014-15"},"dms_FRCP_y7",{"$f":"IF(dms_RPT=\"financial\",VALUE(LEFT(dms_CRCP_yU,4)-1)&\"-\"&TEXT(VALUE(MID(dms_CRCP_yU,3,2)),\"00\"),VALUE(LEFT(dms_CRCP_yU,4)-1))","v":"2001-02"},"dms_CRCP_yT",7,null,"2011-12",2012,null,null,{"$f":"VALUE(LEFT(dms_CRYf_y6,4)+1)&\"-\"&TEXT(MID(dms_CRYf_y6,3,2)+2,\"00\")","v":"2014-15"},"dms_CRYf_y7",{"$f":"VALUE(LEFT(dms_CRYc_y6,4)+1)","v":2015},"dms_CRYc_y7"]
[null,8,"dms_FRCP_y8",8,"CRCP_y8",{"$f":"IF(dms_RPT=\"financial\",VALUE(LEFT(dms_FRCP_y7,4)+1)&\"-\"&TEXT(VALUE(RIGHT(dms_FRCP_y7,2)+1),\"00\"),VALUE(LEFT(dms_FRCP_y7,4)+1))","v":"2015-16"},"dms_FRCP_y8",{"$f":"IF(dms_RPT=\"financial\",VALUE(LEFT(dms_CRCP_yT,4)-1)&\"-\"&TEXT(VALUE(MID(dms_CRCP_yT,3,2)),\"00\"),VALUE(LEFT(dms_CRCP_yT,4)-1))","v":"2000-01"},"dms_CRCP_yS",8,null,"2012-13",2013,null,null,{"$f":"VALUE(LEFT(dms_CRYf_y7,4)+1)&\"-\"&TEXT(MID(dms_CRYf_y7,3,2)+2,\"00\")","v":"2015-16"},"dms_CRYf_y8",{"$f":"VALUE(LEFT(dms_CRYc_y7,4)+1)","v":2016},"dms_CRYc_y8"]
[null,9,"dms_FRCP_y9",9,"CRCP_y9",{"$f":"IF(dms_RPT=\"financial\",VALUE(LEFT(dms_FRCP_y8,4)+1)&\"-\"&TEXT(VALUE(RIGHT(dms_FRCP_y8,2)+1),\"00\"),VALUE(LEFT(dms_FRCP_y8,4)+1))","v":"2016-17"},"dms_FRCP_y9",{"$f":"IF(dms_RPT=\"financial\",VALUE(LEFT(dms_CRCP_yS,4)-1)&\"-\"&TEXT(VALUE(MID(dms_CRCP_yS,3,2)),\"00\"),VALUE(LEFT(dms_CRCP_yS,4)-1))","v":"1999-00"},"dms_CRCP_yR",9,null,"2013-14",2014,null,null,{"$f":"VALUE(LEFT(dms_CRYf_y8,4)+1)&\"-\"&TEXT(MID(dms_CRYf_y8,3,2)+2,\"00\")","v":"2016-17"},"dms_CRYf_y9",{"$f":"VALUE(LEFT(dms_CRYc_y8,4)+1)","v":2017},"dms_CRYc_y9"]
[null,10,"dms_FRCP_y10",10,"CRCP_y10",{"$f":"IF(dms_RPT=\"financial\",VALUE(LEFT(dms_FRCP_y9,4)+1)&\"-\"&TEXT(VALUE(RIGHT(dms_FRCP_y9,2)+1),\"00\"),VALUE(LEFT(dms_FRCP_y9,4)+1))","v":"2017-18"},"dms_FRCP_y10",{"$f":"IF(dms_RPT=\"financial\",VALUE(LEFT(dms_CRCP_yR,4)-1)&\"-\"&TEXT(VALUE(MID(dms_CRCP_yR,3,2)),\"00\"),VALUE(LEFT(dms_CRCP_yR,4)-1))","v":"1998-99"},"dms_CRCP_yQ",10,null,"2014-15",2015,null,null,{"$f":"VALUE(LEFT(dms_CRYf_y9,4)+1)&\"-\"&TEXT(MID(dms_CRYf_y9,3,2)+2,\"00\")","v":"2017-18"},"dms_CRYf_y10",{"$f":"VALUE(LEFT(dms_CRYc_y9,4)+1)","v":2018},"dms_CRYc_y10"]
[null,11,"dms_FRCP_y11",11,"CRCP_y11",{"$f":"IF(dms_RPT=\"financial\",VALUE(LEFT(dms_FRCP_y10,4)+1)&\"-\"&TEXT(VALUE(RIGHT(dms_FRCP_y10,2)+1),\"00\"),VALUE(LEFT(dms_FRCP_y10,4)+1))","v":"2018-19"},"dms_FRCP_y11",{"$f":"IF(dms_RPT=\"financial\",VALUE(LEFT(dms_CRCP_yQ,4)-1)&\"-\"&TEXT(VALUE(MID(dms_CRCP_yQ,3,2)),\"00\"),VALUE(LEFT(dms_CRCP_yQ,4)-1))","v":"1997-98"},"dms_CRCP_yP",11,null,"2015-16",2016,null,null,{"$f":"VALUE(LEFT(dms_CRYf_y10,4)+1)&\"-\"&TEXT(MID(dms_CRYf_y10,3,2)+2,\"00\")","v":"2018-19"},"dms_CRYf_y11",{"$f":"VALUE(LEFT(dms_CRYc_y10,4)+1)","v":2019},"dms_CRYc_y11"]
[null,12,"dms_FRCP_y12",12,"CRCP_y12",{"$f":"IF(dms_RPT=\"financial\",VALUE(LEFT(dms_FRCP_y11,4)+1)&\"-\"&TEXT(VALUE(RIGHT(dms_FRCP_y11,2)+1),\"00\"),VALUE(LEFT(dms_FRCP_y11,4)+1))","v":"2019-20"},"dms_FRCP_y12",{"$f":"IF(dms_RPT=\"financial\",VALUE(LEFT(dms_CRCP_yP,4)-1)&\"-\"&TEXT(VALUE(MID(dms_CRCP_yP,3,2)),\"00\"),VALUE(LEFT(dms_CRCP_yP,4)-1))","v":"1996-97"},"dms_CRCP_yO",12,null,"2016-17",2017,null,null,{"$f":"VALUE(LEFT(dms_CRYf_y11,4)+1)&\"-\"&TEXT(MID(dms_CRYf_y11,3,2)+2,\"00\")","v":"2019-20"},"dms_CRYf_y12",{"$f":"VALUE(LEFT(dms_CRYc_y11,4)+1)","v":2020},"dms_CRYc_y12"]
[null,13,"dms_FRCP_y13",13,"CRCP_y13",{"$f":"IF(dms_RPT=\"financial\",VALUE(LEFT(dms_FRCP_y12,4)+1)&\"-\"&TEXT(VALUE(RIGHT(dms_FRCP_y12,2)+1),\"00\"),VALUE(LEFT(dms_FRCP_y12,4)+1))","v":"2020-21"},"dms_FRCP_y13",{"$f":"IF(dms_RPT=\"financial\",VALUE(LEFT(dms_CRCP_yO,4)-1)&\"-\"&TEXT(VALUE(MID(dms_CRCP_yO,3,2)),\"00\"),VALUE(LEFT(dms_CRCP_yO,4)-1))","v":"1995-96"},"dms_CRCP_yN",13,null,"2017-18",2018,null,null,{"$f":"VALUE(LEFT(dms_CRYf_y12,4)+1)&\"-\"&TEXT(MID(dms_CRYf_y12,3,2)+2,\"00\")","v":"2020-21"},"dms_CRYf_y13",{"$f":"VALUE(LEFT(dms_CRYc_y12,4)+1)","v":2021},"dms_CRYc_y13"]
[null,14,"dms_FRCP_y14",14,"CRCP_y14",{"$f":"IF(dms_RPT=\"financial\",VALUE(LEFT(dms_FRCP_y13,4)+1)&\"-\"&TEXT(VALUE(RIGHT(dms_FRCP_y13,2)+1),\"00\"),VALUE(LEFT(dms_FRCP_y13,4)+1))","v":"2021-22"},"dms_FRCP_y14",{"$f":"IF(dms_RPT=\"financial\",VALUE(LEFT(dms_CRCP_yN,4)-1)&\"-\"&TEXT(VALUE(MID(dms_CRCP_yN,3,2)),\"00\"),VALUE(LEFT(dms_CRCP_yN,4)-1))","v":"1994-95"},"dms_CRCP_yM",14,null,"2018-19",2019,null,null,{"$f":"VALUE(LEFT(dms_CRYf_y13,4)+1)&\"-\"&TEXT(MID(dms_CRYf_y13,3,2)+2,\"00\")","v":"2021-22"},"dms_CRYf_y14",{"$f":"VALUE(LEFT(dms_CRYc_y13,4)+1)","v":2022},"dms_CRYc_y14"]
[null,15,"dms_FRCP_y15",15,"CRCP_y15",{"$f":"IF(dms_RPT=\"financial\",VALUE(LEFT(dms_FRCP_y14,4)+1)&\"-\"&TEXT(VALUE(RIGHT(dms_FRCP_y14,2)+1),\"00\"),VALUE(LEFT(dms_FRCP_y14,4)+1))","v":"2022-23"},"dms_FRCP_y15",{"$f":"IF(dms_RPT=\"financial\",VALUE(LEFT(dms_CRCP_yM,4)-1)&\"-\"&TEXT(VALUE(MID(dms_CRCP_yM,3,2)),\"00\"),VALUE(LEFT(dms_CRCP_yM,4)-1))","v":"1993-94"},"dms_CRCP_yL",15,null,"2019-20",2020,null,null,{"$f":"VALUE(LEFT(dms_CRYf_y14,4)+1)&\"-\"&TEXT(MID(dms_CRYf_y14,3,2)+2,\"00\")","v":"2022-23"},"dms_CRYf_y15",{"$f":"VALUE(LEFT(dms_CRYc_y14,4)+1)","v":2023},"dms_CRYc_y15"]
[null,null,null,null,null,null,null,null,null,null,null,"2020-21",2021,null,null,{"$f":"VALUE(LEFT(dms_CRYf_y15,4)+1)&\"-\"&TEXT(MID(dms_CRYf_y15,3,2)+2,\"00\")","v":"2023-24"},"dms_CRYf_y16",{"$f":"VALUE(LEFT(dms_CRYc_y15,4)+1)","v":2024},"dms_CRYc_y16"]
[null,"These are drop down lists for businesses to select the correct FRCP_y1 on the business and other details worksheet.\nThis also populates the column headings in the worksheets",null,null,null,null,null,null,null,null,null,"2021-22",2022,null,null,{"$f":"VALUE(LEFT(dms_CRYf_y16,4)+1)&\"-\"&TEXT(MID(dms_CRYf_y16,3,2)+2,\"00\")","v":"2024-25"},"dms_CRYf_y17",{"$f":"VALUE(LEFT(dms_CRYc_y16,4)+1)","v":2025},"dms_CRYc_y17"]
[null,"dms_RCP_fyear_list","dms_CRY_ListF","dms_CRY_ListC","dms_RCP_cyear_list","dms_FRCP_fyear_list","dms_FRCP_ListF","dms_FRCP_ListC","dms_FRCP_cyear_list",null,null,"2022-23",2023,null,null,{"$f":"VALUE(LEFT(dms_CRYf_y17,4)+1)&\"-\"&TEXT(MID(dms_CRYf_y17,3,2)+2,\"00\")","v":"2025-26"},"dms_CRYf_y18",{"$f":"VALUE(LEFT(dms_CRYc_y17,4)+1)","v":2026},"dms_CRYc_y18"]
[null,"dms_y1",{"$f":"CRY","v":"2008-09"},"2006","dms_cy1","dms_frcp_fy1","2010-11",2011,"dms_crcp_cy1",null,null,"2023-24",2024,null,null,{"$f":"VALUE(LEFT(dms_CRYf_y18,4)+1)&\"-\"&TEXT(MID(dms_CRYf_y18,3,2)+2,\"00\")","v":"2026-27"},"dms_CRYf_y19",{"$f":"VALUE(LEFT(dms_CRYc_y18,4)+1)","v":2027},"dms_CRYc_y19"]
[null,"dms_y2",{"$f":"IF(dms_RPT=\"financial\",VALUE(LEFT(CRY,4)+1)&\"-\"&TEXT(MID(CRY,3,2)+2,\"00\"),VALUE(LEFT(CRY,4)+1))","v":"2009-10"},"2007","dms_cy2","dms_frcp_fy2","2011-12",2012,"dms_crcp_cy2",null,null,"2024-25",2025,null,null,{"$f":"VALUE(LEFT(dms_CRYf_y19,4)+1)&\"-\"&TEXT(MID(dms_CRYf_y19,3,2)+2,\"00\")","v":"2027-28"},"dms_CRYf_y20",{"$f":"VALUE(LEFT(dms_CRYc_y19,4)+1)","v":2028},"dms_CRYc_y20"]
[null,"dms_y3",{"$f":"IF(dms_RPT=\"financial\",VALUE(LEFT(dms_fy2,4)+1)&\"-\"&TEXT(MID(dms_fy2,3,2)+2,\"00\"),VALUE(LEFT(dms_fy2,4)+1))","v":"2010-11"},"2008","dms_cy3","dms_frcp_fy3","2012-13",2013,"dms_crcp_cy3",null,null,"2025-26",2026]
[null,"dms_y4",{"$f":"IF(dms_RPT=\"financial\",VALUE(LEFT(dms_fy3,4)+1)&\"-\"&TEXT(MID(dms_fy3,3,2)+2,\"00\"),VALUE(LEFT(dms_fy3,4)+1))","v":"2011-12"},"2009","dms_cy4","dms_frcp_fy4","2013-14",2014,"dms_crcp_cy4",null,null,"2026-27",2027]
[null,"dms_y5",{"$f":"IF(dms_RPT=\"financial\",VALUE(LEFT(dms_fy4,4)+1)&\"-\"&TEXT(MID(dms_fy4,3,2)+2,\"00\"),VALUE(LEFT(dms_fy4,4)+1))","v":"2012-13"},2010,"dms_cy5","dms_frcp_fy5","2014-15",2015,"dms_crcp_cy5",null,null,"2027-28",2028]
[null,"dms_y6",{"$f":"IF(dms_RPT=\"financial\",VALUE(LEFT(dms_fy5,4)+1)&\"-\"&TEXT(MID(dms_fy5,3,2)+2,\"00\"),VALUE(LEFT(dms_fy5,4)+1))","v":"2013-14"},2011,"dms_cy6","dms_frcp_fy6","2015-16",2016,"dms_crcp_cy6",null,null,"2028-29",2029]
[null,"dms_y7",{"$f":"IF(dms_RPT=\"financial\",VALUE(LEFT(dms_fy6,4)+1)&\"-\"&TEXT(MID(dms_fy6,3,2)+2,\"00\"),VALUE(LEFT(dms_fy6,4)+1))","v":"2014-15"},2012,"dms_cy7","dms_frcp_fy7","2016-17",2017,"dms_crcp_cy7",null,null,"2029-30",2030]
[null,"dms_y8",{"$f":"IF(dms_RPT=\"financial\",VALUE(LEFT(dms_fy7,4)+1)&\"-\"&TEXT(MID(dms_fy7,3,2)+2,\"00\"),VALUE(LEFT(dms_fy7,4)+1))","v":"2015-16"},2013,"dms_cy8","dms_frcp_fy8","2017-18",2018,"dms_crcp_cy8",null,null,"2030-31",2031]
[null,"dms_y9",{"$f":"IF(dms_RPT=\"financial\",VALUE(LEFT(dms_fy8,4)+1)&\"-\"&TEXT(MID(dms_fy8,3,2)+2,\"00\"),VALUE(LEFT(dms_fy8,4)+1))","v":"2016-17"},2014,"dms_cy9","dms_frcp_fy9","2018-19",2019,"dms_crcp_cy9",null,null,"2031-32",2032]
[null,"dms_y10",{"$f":"IF(dms_RPT=\"financial\",VALUE(LEFT(dms_fy9,4)+1)&\"-\"&TEXT(MID(dms_fy9,3,2)+2,\"00\"),VALUE(LEFT(dms_fy9,4)+1))","v":"2017-18"},2015,"dms_cy10","dms_frcp_fy10","2019-20",2020,"dms_crcp_cy10",null,null,"2032-33",2033]
[null,"dms_y11",{"$f":"IF(dms_RPT=\"financial\",VALUE(LEFT(dms_fy10,4)+1)&\"-\"&TEXT(MID(dms_fy10,3,2)+2,\"00\"),VALUE(LEFT(dms_fy10,4)+1))","v":"2018-19"},2016,"dms_cy11","dms_frcp_fy11","2020-21",2021,"dms_crcp_cy11",null,null,"2033-34",2034]
[null,"dms_y12",{"$f":"IF(dms_RPT=\"financial\",VALUE(LEFT(dms_fy11,4)+1)&\"-\"&TEXT(MID(dms_fy11,3,2)+2,\"00\"),VALUE(LEFT(dms_fy11,4)+1))","v":"2019-20"},2017,"dms_cy12","dms_frcp_fy12","2021-22",2022,"dms_crcp_cy12",null,null,"2034-35",2035]
[null,"dms_y13",{"$f":"IF(dms_RPT=\"financial\",VALUE(LEFT(dms_fy12,4)+1)&\"-\"&TEXT(MID(dms_fy12,3,2)+2,\"00\"),VALUE(LEFT(dms_fy12,4)+1))","v":"2020-21"},2018,"dms_cy13","dms_frcp_fy13","2022-23",2023,"dms_crcp_cy13",null,null,"2035-36",2036]
[null,"dms_y14",{"$f":"IF(dms_RPT=\"financial\",VALUE(LEFT(dms_fy13,4)+1)&\"-\"&TEXT(MID(dms_fy13,3,2)+2,\"00\"),VALUE(LEFT(dms_fy13,4)+1))","v":"2021-22"},2019,"dms_cy14","dms_frcp_fy14","2023-24",2024,"dms_crcp_cy14"]
[null,"dms_y15",{"$f":"IF(dms_RPT=\"financial\",VALUE(LEFT(dms_fy14,4)+1)&\"-\"&TEXT(MID(dms_fy14,3,2)+2,\"00\"),VALUE(LEFT(dms_fy14,4)+1))","v":"2022-23"},2020,"dms_cy15","dms_frcp_fy15","2024-25",2025,"dms_crcp_cy15"]
[null,"dms_y16",{"$f":"IF(dms_RPT=\"financial\",VALUE(LEFT(dms_fy15,4)+1)&\"-\"&TEXT(MID(dms_fy15,3,2)+2,\"00\"),VALUE(LEFT(dms_fy15,4)+1))","v":"2023-24"},2021,"dms_cy16"]
[null,"dms_y17",{"$f":"IF(dms_RPT=\"financial\",VALUE(LEFT(dms_fy16,4)+1)&\"-\"&TEXT(MID(dms_fy16,3,2)+2,\"00\"),VALUE(LEFT(dms_fy16,4)+1))","v":"2024-25"},2022,"dms_cy17"]
[null,"dms_y18",{"$f":"IF(dms_RPT=\"financial\",VALUE(LEFT(dms_fy17,4)+1)&\"-\"&TEXT(MID(dms_fy17,3,2)+2,\"00\"),VALUE(LEFT(dms_fy17,4)+1))","v":"2025-26"},2023,"dms_cy18"]
[null,"dms_y19",{"$f":"IF(dms_RPT=\"financial\",VALUE(LEFT(dms_fy18,4)+1)&\"-\"&TEXT(MID(dms_fy18,3,2)+2,\"00\"),VALUE(LEFT(dms_fy18,4)+1))","v":"2026-27"},2024,"dms_cy19"]
[null,"dms_y20",{"$f":"IF(dms_RPT=\"financial\",VALUE(LEFT(dms_fy19,4)+1)&\"-\"&TEXT(MID(dms_fy19,3,2)+2,\"00\"),VALUE(LEFT(dms_fy19)+1))","v":"2027-28"},2025,"dms_cy20"]
[]
[]
[]
[]
[]
[null,"These \"row descriptions\" are the column headings in the various templates but become row descriptions in the ETL process"]
[null,null,"Table 6.3 sustained interruptions - row descriptions"]
[null,null,"dms_060301_CustNo_Affected_Row","dms_060301_Avg_Duration_Sustained_Int_Row","dms_060301_Effect_unplanned_SAIDI_Row","dms_060301_Effect_unplanned_SAIFI_Row"]
[null,null,"Number of customers affected by the interruption","Average duration of sustained customer interruption","Effect on unplanned SAIDI","Effect on unplanned SAIFI"]
[]
[]
[]
[null,null,"Table 6.1 telephone answering - row descriptions and start date"]
[null,null,"dms_060101_Rows","dms_060102_Rows","dms_060101_StartDateTxt"]
[null,null,"Total number of calls \n(after removing excluded events)","Number of calls answered within 30 seconds \n(after excluding excluded events) ",{"$f":"dms_060701_StartDateTxt","v":"1-Jul-2008"}]
[]
[]
[]
[null,null,null,null,null,null,null,"dms_0603_FeederList",{"$f":"INDEX(dms_FeederName_1,MATCH(dms_TradingName,dms_TradingName_List))","v":"CBD"},{"$f":"INDEX(dms_FeederName_2,MATCH(dms_TradingName,dms_TradingName_List))","v":"Urban"},{"$f":"INDEX(dms_FeederName_3,MATCH(dms_TradingName,dms_TradingName_List))","v":"Short rural"},{"$f":"INDEX(dms_FeederName_4,MATCH(dms_TradingName,dms_TradingName_List))","v":"Long rural"}]
[null,null,"Table 6.7.1 - daily performance data - unplanned - MAIFI  -- row descriptions and header named range values"]
[null,null,"These headings (Lists) are determined from the INDEX/MATCH function on the NSP selected on the Business & other details sheet"]
[null,"dms_060701_Feeder_Header_Lvl4",{"$f":"INDEX(dms_FeederName_1,MATCH(dms_TradingName,dms_TradingName_List))","v":"CBD"},{"$f":"INDEX(dms_FeederName_1,MATCH(dms_TradingName,dms_TradingName_List))","v":"CBD"},{"$f":"INDEX(dms_FeederName_2,MATCH(dms_TradingName,dms_TradingName_List))","v":"Urban"},{"$f":"INDEX(dms_FeederName_2,MATCH(dms_TradingName,dms_TradingName_List))","v":"Urban"},{"$f":"INDEX(dms_FeederName_3,MATCH(dms_TradingName,dms_TradingName_List))","v":"Short rural"},{"$f":"INDEX(dms_FeederName_3,MATCH(dms_TradingName,dms_TradingName_List))","v":"Short rural"},{"$f":"INDEX(dms_FeederName_4,MATCH(dms_TradingName,dms_TradingName_List))","v":"Long rural"},{"$f":"INDEX(dms_FeederName_4,MATCH(dms_TradingName,dms_TradingName_List))","v":"Long rural"},{"$f":"IF((INDEX(dms_FeederName_5,MATCH(dms_TradingName,dms_TradingName_List))=0),\"Network\",(INDEX(dms_FeederName_5,MATCH(dms_TradingName,dms_TradingName_List))))","v":"Network"},{"$f":"IF((INDEX(dms_FeederName_5,MATCH(dms_TradingName,dms_TradingName_List))=0),\"Network\",(INDEX(dms_FeederName_5,MATCH(dms_TradingName,dms_TradingName_List))))","v":"Network"},"Network","Network"]
[]
[null,"dms_060701_Rows","All events","After removing excluded events","All events","After removing excluded events","All events","After removing excluded events","All events","After removing excluded events","All events","After removing excluded events","All events","After removing excluded events"]
[null,null,"the number of column headings changes from 10 to 12 depending on the number of feeder categories for the NSP"]
[]
[]
[]
[]
[null,null,"Table 6.8.1 - row descriptions"]
[null,null,"dms_060801_01_Rows","dms_060801_02_Rows","dms_060801_03_Rows","dms_060801_04_Rows"]
[null,null,"Number of interruptions","Duration of interruptions","Total unplanned minutes off supply","Effect on unplanned MAIFI"]
[]
[]
[]
[]
[null,null,"Table 7.9.4 - market impact component - row descriptions"]
[null,"dms_070904_01_Rows","without exclusions","with exclusions"]
[]
[]
[]
[]
[]
[null,null,"Use this to add to existing files"]
[null,null,"ARRs 6.7 STPIS daily performance"]
[null,null,"dms_060101_Values","dms_060102_Values","dms_060701_Values"]
[]
[null,null,"ARR's  6.8 STPIS exclusions"]
[null,null,"dms_060801_Event_Date","dms_060801_OutageID","dms_060801_FeederID","dms_060801_FeederClass","dms_060801_CauseID","dms_060801_01_Values","dms_060801_02_Values","dms_060801_03_Values","dms_060801_Excl_Cat","dms_060801_04_Values"]
[null,null,"dms_060801_StartCell"]
[]
[null,null,"CA 6.3 sustained interruptions"]
[null,null,"dms_060301_Event_Date","dms_060301_Event_Time","dms_060301_AssetID","dms_060301_FeederClass","dms_060301_Reason","dms_060301_DetailedReason","dms_060301_CustNo_Affected_Values","dms_060301_Avg_Duration_Sustained_Int_Values","dms_060301_Effect_unplanned_SAIDI_Values","dms_060301_Effect_unplanned_SAIFI_Values","dms_060301_MED"]

{"sheet":"Instructions","index":2,"n_rows":27,"n_cols":4,"rows_kept":27,"cut":false,"hidden":false,"merged":[[25,2,25,3],[26,2,26,4],[7,2,7,3],[1,1,1,5],[2,1,2,5],[3,2,3,4],[4,2,4,4],[5,2,5,4],[24,2,24,4],[12,2,12,4],[8,2,8,4],[10,2,10,4],[20,2,20,4],[22,2,22,4]]}
[]
[null,{"$f":"CONCATENATE(dms_Segment,\" Network Service Provider\")","v":"Distribution Network Service Provider"}]
[null,"Historical Reporting RIN Template"]
[null,null,{"$f":"CONCATENATE(\"This template is to be used by \",dms_TradingName,\" to fulfil its reporting obligations to the AER.\")","v":"This template is to be used by SA Power Networks to fulfil its reporting obligations to the AER."}]
[null,null,"INSTRUCTIONS"]
[null,null,"Complete the Business & other details worksheet before entering data or values in any other worksheets. The Business & other details worksheet is linked to other worksheets within the workbook and automatically generates certain column headings and conditional formatting."]
[]
[null,null,"Identifying CONFIDENTIAL INFORMATION:\n\nPlease use the macro at the top of each \nworksheet to identify confidential information. \n\n"]
[null,null,"-Do this by selecting the cell or cells that contain confidential information and then run the Mark selection CONFIDENTIAL macro. This will format the cells a specific colour that is identified by the AER's database which in turn marks that information as confidential.\n\n-To reverse this, select the cell or cells and run the Return selection to NON-CONFIDENTIAL macro."]
[]
[null,null,"UNITS OF MEASURE\n\nAll amounts are to be unrounded and reported on a one for one basis: that is 1000 is to be entered as '1000'. Applicable units of measure may be identified in the table column headings or row descriptors.\n\n"]
[]
[null,null,"COLOUR CODING OF INPUT / NON-INPUT CELLS:"]
[null,null,null,"Yellow = Input cell (mandatory)"]
[null,null,null,"Darker yellow = input cell (mandatory)"]
[null,null,null,"Orange = input cell (if data available)"]
[null,null,null,"Grey = Not applicable/No inputs required"]
[null,null,null,"\nPLEASE DO NOT ENTER TEXT into cells that are to contain numeric data."]
[]
[]
[null,null,"WORKSHEET NAVIGATION\n\nMany tables in the worksheets have been \"grouped\" to allow for easy navigation. To ungroup or group data use the outline symbols in the left margin of excel (for Row groupings) or above the columns (for column groupings). \n\n\n"]
[]
[null,null,"RETURNING COMPLETED RESPONSES\n\nPlease return two (2) files to the AER: \n1. A confidential version which must contain a complete set of all responses with confidential information marked using the Mark selected cells CONFIDENTIAL macro and which has been completed using the locked template file provided by the AER. \n\n2. A public version with confidential information either removed completely or aggregated in some form together with writtten consent to disclose the public version of the response.\n\nUse the drop down box on the Business and other details worksheet to identify the file as either confidential ('consolidated') or public. "]
[]
[null,null,"SUBMITTING AMENDED DATA TO THE AER\n\nIf an NSP wishes to correct data previously submitted to the AER it should resubmit that data using the original completed submission as the starting point. Please make any necessary changes to the data. Data that is not being amended should be left unchanged. \n\nNSPs must identify the reason for the amendments in the Amendment Reason box on the  Business and other details worksheet. NSPs may provide further details regarding any amendments in the Amendments worksheet. \n\n."]
[null,null,"NSP may use Amended Data macro \nto highlight cells that contain amended data.\nNB: if data is also CONFIDENTIAL, re-apply \nthe Confidentiality macro after applying the \nAmended macro"]
[null,null,"Please resubmit two (2) files - a confidential version and a public version of the amended submission to the AER"]

{"sheet":"Contents","index":3,"n_rows":27,"n_cols":19,"rows_kept":27,"cut":false,"hidden":false,"merged":[]}
[null,"REGULATORY REPORTING STATEMENT"]
[null,{"$f":"INDEX(dms_TradingNameFull_List,MATCH(dms_TradingName,dms_TradingName_List))","v":"SA Power Networks"}]
[null,{"$f":"CONCATENATE((LOOKUP(dms_Model,dms_Model_List,dms_Worksheet_List))&\" \"&CRY)","v":"CATEGORY ANALYSIS 2008-09"}]
[null,"CONTENTS"]
[]
[]
[null,null,null,null,"1. Business details",null,null,null,null,null,null,"2. Expenditure"]
[]
[]
[]
[]
[]
[]
[]
[]
[]
[]
[]
[]
[]
[]
[]
[]
[]
[]
[]
[null,null,null,null,"4. Alternative control services",null,null,null,null,null,null,"5. Network information",null,null,null,null,null,null,"6. Service & quality"]

{"sheet":"Business & other details","index":4,"n_rows":156,"n_cols":9,"rows_kept":156,"cut":false,"hidden":false,"merged":[[7,1,7,8],[11,1,11,8],[13,2,13,4],[14,2,14,4],[17,2,17,3],[17,4,17,7],[59,2,59,8],[18,4,18,7],[19,2,19,3],[19,4,19,7],[22,2,22,3],[22,4,22,7],[23,4,23,7],[24,2,24,3],[24,4,24,7],[32,1,32,8],[57,2,57,3],[58,4,58,8]]}
[null,{"$f":"IF(dms_DataQuality=\"backcast\",INDEX(dms_Worksheet_List,MATCH(dms_Model,dms_Model_List))&\" BACKCAST\",INDEX(dms_Worksheet_List,MATCH(dms_Model,dms_Model_List)))","v":"CATEGORY ANALYSIS"}]
[null,{"$f":"INDEX(dms_TradingNameFull_List,MATCH(dms_TradingName,dms_TradingName_List))","v":"SA Power Networks"}]
[null,{"$f":"IF(SUM(dms_SingleYear_Model)>0,CONCATENATE(CRY),CONCATENATE(FRCP_y1,\" to \",dms_MultiYear_FinalYear_Result))","v":"2008-09"}]
[null,"BUSINESS & OTHER DETAILS"]
[]
[]
[null,"Instructions"]
[null,"Complete the following business details regulatory template before entering data or values in any other regulatory template. This regulatory template is linked to other cells within the spreadsheet and automatically generates column headings and conditional formatting to distinguish business specific input and non-input cells. "]
[]
[null,"SUBMISSION PARTICULARS INPUT SHEETS"]
[]
[null,"ENTITY DETAILS"]
[]
[null,"Short name","SA Power Networks",null,null,"Select business name from drop down list first"]
[null,"ACN / ABN",{"$f":"INDEX(dms_ABN_List,MATCH(dms_TradingName,dms_TradingName_List))","v":13332330749}]
[]
[]
[null,"Business address","Address 1",null,{"$f":"INDEX(dms_Addr1_List,MATCH(dms_TradingName,dms_TradingName_List))","v":"1 Anzac Highway"}]
[null,null,null,"Address 2",{"$f":"IF(ISBLANK(INDEX(dms_Addr2_List,MATCH(dms_TradingName,dms_TradingName_List))),\"\",(INDEX(dms_Addr2_List,MATCH(dms_TradingName,dms_TradingName_List))))","v":""}]
[null,null,"Suburb",null,{"$f":"INDEX(dms_Suburb_List,MATCH(dms_TradingName,dms_TradingName_List))","v":"KESWICK"}]
[null,null,null,"State",{"$f":"INDEX(dms_State_List,MATCH(dms_TradingName,dms_TradingName_List))","v":"SA"},"p/code",{"$f":"INDEX(dms_PostCode_List,MATCH(dms_TradingName,dms_TradingName_List))","v":5035}]
[]
[null,"Postal address","Address 1",null,{"$f":"INDEX(dms_PAddr1_List,MATCH(dms_TradingName,dms_TradingName_List))","v":"GPO Box 77"}]
[null,null,null,"Address 2",{"$f":"IF(ISBLANK(INDEX(dms_PAddr2_List,MATCH(dms_TradingName,dms_TradingName_List))),\"\",(INDEX(dms_PAddr2_List,MATCH(dms_TradingName,dms_TradingName_List))))","v":""}]
[null,null,"Suburb",null,{"$f":"INDEX(dms_PSuburb_List,MATCH(dms_TradingName,dms_TradingName_List))","v":"ADELAIDE"}]
[null,null,null,"State",{"$f":"INDEX(dms_PState_List,MATCH(dms_TradingName,dms_TradingName_List))","v":"SA"},"p/code",{"$f":"INDEX(dms_PPostCode_List,MATCH(dms_TradingName,dms_TradingName_List))","v":5000}]
[]
[]
[null,"Contact name/s",{"$f":"INDEX(dms_ContactName1_List,MATCH(dms_TradingName,dms_TradingName_List))","v":"Richard Sibly"}]
[null,"Contact phone/s",{"$f":"INDEX(dms_ContactPh1_List,MATCH(dms_TradingName,dms_TradingName_List))","v":"08 8404 5613"}]
[null,"Contact email address/s",{"$f":"INDEX(dms_ContactEmail_List,MATCH(dms_TradingName,dms_TradingName_List))","v":"richard.sibly@sapowernetworks.com.au"}]
[]
[null,"REGULATORY CONTROL PERIODS"]
[]
[null,"Forthcoming regulatory control period","2008-09",{"$f":"dms_FRCP_y2","v":"2009-10"},{"$f":"dms_FRCP_y3","v":"2010-11"},{"$f":"dms_FRCP_y4","v":"2011-12"},{"$f":"dms_FRCP_y5","v":"2012-13"}]
[null,null,{"$f":"dms_FRCP_y6","v":"2013-14"},{"$f":"dms_FRCP_y7","v":"2014-15"},{"$f":"dms_FRCP_y8","v":"2015-16"},{"$f":"dms_FRCP_y9","v":"2016-17"},{"$f":"dms_FRCP_y10","v":"2017-18"}]
[]
[]
[null,"Current regulatory control period",{"$f":"dms_CRCP_FirstYear_Result","v":"2003-04"},{"$f":"IF(dms_RPT=\"financial\",VALUE(LEFT(CRCP_y1,4)+1)&\"-\"&TEXT(MID(CRCP_y1,3,2)+2,\"00\"),VALUE(LEFT(CRCP_y1,4)+1))","v":"2004-05"},{"$f":"IF(dms_RPT=\"financial\",VALUE(LEFT(CRCP_y1,4)+2)&\"-\"&TEXT(VALUE(MID(CRCP_y1,3,2)+3),\"00\"),VALUE(LEFT(CRCP_y1,4)+2))","v":"2005-06"},{"$f":"IF(dms_RPT=\"financial\",VALUE(LEFT(CRCP_y1,4)+3)&\"-\"&TEXT(MID(CRCP_y1,3,2)+4,\"00\"),VALUE(LEFT(CRCP_y1,4)+3))","v":"2006-07"},{"$f":"IF(dms_RPT=\"financial\",VALUE(LEFT(CRCP_y1,4)+4)&\"-\"&TEXT(MID(CRCP_y1,3,2)+5,\"00\"),VALUE(LEFT(CRCP_y1,4)+4))","v":"2007-08"}]
[null,null,{"$f":"IF(dms_RPT=\"financial\",VALUE(LEFT(CRCP_y1,4)+5)&\"-\"&TEXT(MID(CRCP_y1,3,2)+6,\"00\"),VALUE(LEFT(CRCP_y1,4)+5))","v":"2008-09"},{"$f":"IF(dms_RPT=\"financial\",VALUE(LEFT(CRCP_y1,4)+6)&\"-\"&TEXT(MID(CRCP_y1,3,2)+7,\"00\"),VALUE(LEFT(CRCP_y1,4)+6))","v":"2009-10"},{"$f":"IF(dms_RPT=\"financial\",VALUE(LEFT(CRCP_y1,4)+7)&\"-\"&TEXT(MID(CRCP_y1,3,2)+8,\"00\"),VALUE(LEFT(CRCP_y1,4)+7))","v":"2010-11"},{"$f":"IF(dms_RPT=\"financial\",VALUE(LEFT(CRCP_y1,4)+8)&\"-\"&TEXT(MID(CRCP_y1,3,2)+9,\"00\"),VALUE(LEFT(CRCP_y1,4)+8))","v":"2011-12"},{"$f":"IF(dms_RPT=\"financial\",VALUE(LEFT(CRCP_y1,4)+9)&\"-\"&TEXT(MID(CRCP_y1,3,2)+10,\"00\"),VALUE(LEFT(CRCP_y1,4)+9))","v":"2012-13"}]
[null,null,{"$f":"IF(dms_RPT=\"financial\",VALUE(LEFT(CRCP_y1,4)+10)&\"-\"&TEXT(MID(CRCP_y1,3,2)+11,\"00\"),VALUE(LEFT(CRCP_y1,4)+10))","v":"2013-14"},{"$f":"IF(dms_RPT=\"financial\",VALUE(LEFT(CRCP_y1,4)+11)&\"-\"&TEXT(MID(CRCP_y1,3,2)+12,\"00\"),VALUE(LEFT(CRCP_y1,4)+11))","v":"2014-15"},{"$f":"IF(dms_RPT=\"financial\",VALUE(LEFT(CRCP_y1,4)+12)&\"-\"&TEXT(MID(CRCP_y1,3,2)+13,\"00\"),VALUE(LEFT(CRCP_y1,4)+12))","v":"2015-16"},{"$f":"IF(dms_RPT=\"financial\",VALUE(LEFT(CRCP_y1,4)+13)&\"-\"&TEXT(MID(CRCP_y1,3,2)+14,\"00\"),VALUE(LEFT(CRCP_y1,4)+13))","v":"2016-17"},{"$f":"IF(dms_RPT=\"financial\",VALUE(LEFT(CRCP_y1,4)+14)&\"-\"&TEXT(MID(CRCP_y1,3,2)+15,\"00\"),VALUE(LEFT(CRCP_y1,4)+14))","v":"2017-18"}]
[]
[]
[null,"Previous regulatory control period",{"$f":"IF(dms_RPT=\"financial\",VALUE(LEFT(PRCP_y2,4)-1)&\"-\"&TEXT(VALUE(MID(PRCP_y2,3,2)),\"00\"),VALUE(LEFT(PRCP_y2,4)-1))","v":"1998-99"},{"$f":"IF(dms_RPT=\"financial\",VALUE(LEFT(PRCP_y3,4)-1)&\"-\"&TEXT(VALUE(MID(PRCP_y3,3,2)),\"00\"),VALUE(LEFT(PRCP_y3,4)-1))","v":"1999-00"},{"$f":"IF(dms_RPT=\"financial\",VALUE(LEFT(PRCP_y4,4)-1)&\"-\"&TEXT(VALUE(MID(PRCP_y4,3,2)),\"00\"),VALUE(LEFT(PRCP_y4,4)-1))","v":"2000-01"},{"$f":"IF(dms_RPT=\"financial\",VALUE(LEFT(PRCP_y5,4)-1)&\"-\"&TEXT(VALUE(RIGHT(PRCP_y5,2)-1),\"00\"),VALUE(LEFT(PRCP_y5,4)-1))","v":"2001-02"},{"$f":"IF(dms_RPT=\"financial\",VALUE(LEFT(CRCP_y1,4)-1)&\"-\"&TEXT(VALUE(RIGHT(CRCP_y1,2)-1),\"00\"),VALUE(LEFT(CRCP_y1,4)-1))","v":"2002-03"}]
[]
[]
[]
[null,"Commencing regulatory year","2008-09","CRY"]
[]
[null,"Last completed regulatory year","2018-19","dms_FinalYear"]
[]
[]
[]
[null,null,"IF THIS IS AN ABC RIN - make sure the the named range CRY is applied and the named range dms_dollar_nom_UOM is applied"]
[null,null,"IF THIS IS A RESET RIN - make sure the named ranges CRY and dms_dollar_nom_UOM are NOT present in the workbook"]
[null,null,"FOR ABC RINS THAT SPAN MULTIPLE YEARS - make sure MultiYear Flag is set and final year entered as required"]
[]
[null,"Source","Regulatory proposal",null,"Please select the correct submission type from the dropdown list."]
[null,"Data quality (actual, estimate, public, consolidated)","Public",null,"Use Consolidated for Consolidated Confidential version\nUse Public for Consolidated Public version"]
[null,"Amended RIN submission - amendment reason","."]
[null,"Submission Date","31/01/2019","dms_SubmissionDate","Please enter date this file submitted to AER (dd/mm/yyyy)"]
[null,"EBSS - First application of scheme in forthcoming period?","No"]
[null,"Sector",{"$f":"INDEX(dms_Sector_List,MATCH(dms_TradingName,dms_TradingName_List))","v":"Electricity"},"dms_Sector","=INDEX(dms_Sector_List,MATCH(dms_TradingName,dms_TradingName_List))"]
[null,"Segment",{"$f":"INDEX(dms_Segment_List,MATCH(dms_TradingName,dms_TradingName_List))","v":"Distribution"},"dms_Segment","=INDEX(dms_Segment_List,MATCH(dms_TradingName,dms_TradingName_List))"]
[null,"Regulatory Year Ending",{"$f":"IF(dms_MultiYear_Flag=1,LEFT(dms_Specified_FinalYear,2)&RIGHT(dms_Specified_FinalYear,2),INDEX(dms_RYE_Formula_Result,MATCH(dms_Model,dms_Model_List)))","v":"2019"},"dms_RYE","=IF(dms_MultiYear_Flag=1,LEFT(dms_Specified_FinalYear,2)&RIGHT(dms_Specified_FinalYear,2),INDEX(dms_RYE_Formula_Result,MATCH(dms_Model,dms_Model_List)))"]
[null,"Reporting Period Type",{"$f":"INDEX(dms_RPT_List,MATCH(dms_TradingName,dms_TradingName_List))","v":"Financial"},"dms_RPT","=INDEX(dms_RPT_List,MATCH(dms_TradingName,dms_TradingName_List))"]
[null,"Model or RIN Type","CA","dms_Model","Drop down selection"]
[null,"EB/CA Unit of Measure for Monetary Values","$0s","dms_dollar_nom_UOM","If the cover sheet is attached to an ABC RIN apply the NAMED RANGE to the cell"]
[null,"Security Classification","Public","dms_Classification","Always Public"]
[null,"Jurisdiction",{"$f":"INDEX(dms_JurisdictionList,MATCH(dms_TradingName,dms_TradingName_List))","v":"SA"},"dms_Jurisdiction","=INDEX(dms_JurisdictionList,MATCH(dms_TradingName,dms_TradingName_List))"]
[null,"FORECAST and MultiYear RINS"]
[null,"CRY-1  (last full calendar year before CRY)",{"$f":"IF(dms_RPT=\"financial\",VALUE(LEFT(dms_SingleYear_FinalYear_Result,4)),VALUE(LEFT(dms_SingleYear_FinalYear_Result,4)-1))","v":2008},"dms_Cal_Year_B4_CRY","'=IF(dms_RPT=\"financial\",VALUE(LEFT(dms_SingleYear_FinalYear_Result,4)),VALUE(LEFT(dms_SingleYear_FinalYear_Result,4)-1))"]
[null,"Dollar $ real month",{"$f":"INDEX(dms_RPTMonth_List,MATCH(dms_TradingName,dms_TradingName_List))","v":"June"},"dms_RPTMonth","=INDEX(dms_RPTMonth_List,MATCH(dms_TradingName,dms_TradingName_List))"]
[null,"Dollar $ real  (the last month before the FRCP_y1)",{"$f":"IF(SUM(dms_SingleYear_Model)>0,CONCATENATE(dms_RPTMonth)&\" \"&VALUE((LEFT(CRY,2))&RIGHT(CRY,2)),CONCATENATE(dms_RPTMonth)&\" \"&VALUE((LEFT(dms_CRCP_FinalYear_Result,2)&RIGHT(dms_CRCP_FinalYear_Result,2))))","v":"June 2009"},"dms_DollarReal","=IF(SUM(dms_SingleYear_Model)>0,CONCATENATE(dms_RPTMonth)&\" \"&VALUE((LEFT(CRY,2))&RIGHT(CRY,2)),CONCATENATE(dms_RPTMonth)&\" \"&VALUE((LEFT(dms_CRCP_FinalYear_Result,2)&RIGHT(dms_CRCP_FinalYear_Result,2))))"]
[null,"Dollar $ real previous year (PRCP_y5)",{"$f":"IF(SUM(dms_SingleYear_Model)>0,CONCATENATE(dms_RPTMonth)&\" \"&VALUE(((LEFT(CRY,2))&RIGHT(CRY,2))-1),CONCATENATE(dms_RPTMonth)&\" \"&VALUE(((LEFT(dms_CRCP_FirstYear_Result,2)&RIGHT(dms_CRCP_FirstYear_Result,2))))-1)","v":"June 2008"},"dms_DollarReal_Prev","=IF(SUM(dms_SingleYear_Model)>0,CONCATENATE(dms_RPTMonth)&\" \"&VALUE(((LEFT(CRY,2))&RIGHT(CRY,2))-1),CONCATENATE(dms_RPTMonth)&\" \"&VALUE(((LEFT(dms_CRCP_FirstYear_Result,2)&RIGHT(dms_CRCP_FirstYear_Result,2))))-1)"]
[null,"This block works out the various RYE's for ALL RIN types and MODELS"]
[null,"Single Year Model T/F",{"$f":"IF(dms_Model=\"EB\",1,0)","v":0},"dms_EB"]
[null,null,{"$f":"IF(dms_Model=\"CA\",1,0)","v":1},"dms_CA","=dms_SingleYear_Model"]
[null,null,{"$f":"IF(dms_Model=\"ARR\",1,0)","v":0},"dms_ARR"]
[null,"Is this a single Year RIN?",{"$f":"IF(SUM(dms_SingleYear_Model)=1,\"yes\",\"no\")","v":"yes"},"dms_SingleYearModel","=IF(SUM(dms_SingleYear_Model)=1,\"yes\",\"no\")"]
[null,"Single Year Final Year Reference","CRY","dms_SingleYear_FinalYear_Ref","This is the reference for EB, CA & ARR RINs"]
[null,"Single Year Final Year Result",{"$f":"IFERROR(IF(SUM(dms_SingleYear_Model)<>0,(INDIRECT(dms_SingleYear_FinalYear_Ref)),\"not a single year RIN\"),\"CRY not present\")","v":"2008-09"},"dms_SingleYear_FinalYear_Result","=IFERROR(IF(SUM(dms_SingleYear_Model)<>0,(INDIRECT(dms_SingleYear_FinalYear_Ref)),\"not a single year RIN\"),\"CRY not present\")"]
[null,"FRCP length in years",{"$f":"INDEX(dms_FRCPlength_List,MATCH(dms_TradingName,dms_TradingName_List))","v":5},"dms_FRCPlength_Num","=INDEX(dms_FRCPlength_List,MATCH(dms_TradingName,dms_TradingName_List))"]
[null,"Multi Year Final Year Reference",{"$f":"INDEX(dms_FinalYear_List,MATCH(dms_FRCPlength_Num,dms_FRCPlength_Num_List))","v":"dms_FRCP_y5"},"dms_MultiYear_FinalYear_Ref","=INDEX(dms_FinalYear_List,MATCH(dms_FRCPlength_Num,dms_FRCPlength_Num_List))"]
[null,"Multi Year Final Year Result",{"$f":"IF(dms_MultiYear_Flag=0,INDIRECT(dms_MultiYear_FinalYear_Ref),dms_Specified_FinalYear)","v":"2018-19"},"dms_MultiYear_FinalYear_Result","=IF(dms_MultiYear_Flag=0,INDIRECT(dms_MultiYear_FinalYear_Ref),dms_Specified_FinalYear)",null,null,null,"Formula errors OK"]
[null,"CRCP length in years",{"$f":"INDEX(dms_CRCPlength_List,MATCH(dms_TradingName,dms_TradingName_List))","v":5},"dms_CRCPlength_Num","=INDEX(dms_CRCPlength_List,MATCH(dms_TradingName,dms_TradingName_List))"]
[null,"CRCP Final Year Reference",{"$f":"INDEX(dms_CFinalYear_List,MATCH(dms_CRCPlength_Num,dms_CRCPlength_Num_List))","v":"CRCP_y5"},"dms_CRCP_FinalYear_Ref","=INDEX(dms_CFinalYear_List,MATCH(dms_CRCPlength_Num,dms_CRCPlength_Num_List))"]
[null,"CRCP First Year Result",{"$f":"INDEX(dms_CRCP_years,MATCH(dms_CRCPlength_Num,dms_CRCP_index))","v":"2003-04"},"dms_CRCP_FirstYear_Result","=INDEX(dms_CRCP_years,MATCH(dms_CRCPlength_Num,dms_CRCP_index))"]
[null,"CRCP Final Year Result",{"$f":"IF(dms_MultiYear_Flag=0,(IF(SUM(dms_SingleYear_Model)>0,CRY,dms_CRCP_yZ)),dms_Specified_FinalYear)","v":"2018-19"},"dms_CRCP_FinalYear_Result","=IF(dms_MultiYear_Flag=0,(IF(SUM(dms_SingleYear_Model)>0,CRY,dms_CRCP_yZ)),dms_Specified_FinalYear)"]
[null,"PTRM/ RFMs"]
[null,"Form of control",{"$f":"INDEX(dms_FormControl_List,MATCH(dms_TradingName,dms_TradingName_List))","v":"Revenue cap"},"dms_FormControl","=INDEX(dms_FormControl_List,MATCH(dms_TradingName,dms_TradingName_List))"]
[null,"ABC RINS THAT SPAN MULTIPLE YEARS"]
[null,"Is this a multi year ABC RIN?","Yes"]
[null,"Multiyear EB, CA or ARR?",{"$f":"IF(dms_MultiYear_ResponseFlag=\"No\",0,1)","v":1},"dms_MultiYear_Flag","This is set from the answer provided above"]
[null,null,{"$f":"IF(dms_MultiYear_Flag=1,FRY,\"not a Multiple year submission\")","v":"2018-19"},"dms_Specified_FinalYear","The result here is returned to dms_CRCP_FinalYear_Result if response to Q in C73 is \"yes\" and dms_MultiYear_Flag is set to 1"]
[null," Start year for 5.2 in Multi year ABC RINS",{"$f":"IFERROR(IF(dms_MultiYear_Flag=1,FRY,CRY),\"not an ABC\")","v":"2018-19"},"dms_0502_Inst_Year","=IF(dms_MultiYear_Flag=1,FRY,CRY)",null,"For single year RINS this is CRY - multi year RINS need to start a the end of the span of years (ie. FRY)"]
[null,"EB RINS"]
[null,"Calendar Year for table 3.6 data",{"$f":"IF(dms_RPT=\"financial\",VALUE(LEFT(dms_SingleYear_FinalYear_Result,4)),VALUE(LEFT(dms_SingleYear_FinalYear_Result,4)-1))","v":2008},"dms_0306_Year","=IF(dms_RPT=\"financial\",VALUE(LEFT(dms_SingleYear_FinalYear_Result,4)),VALUE(LEFT(dms_SingleYear_FinalYear_Result,4)-1))"]
[null,"CA RINS"]
[null,"Find how many rows in tables 6.3 sustained interruptions?",null,null,"dms_060301_MaxRows only returns a valid value when cover sheet is attached to a CA file"]
[null,null,{"$f":"IF(dms_Model<>\"CA\",\"not a CA\",\"Is a CA\")","v":"Is a CA"},null,"=IF(dms_Model<>\"CA\",\"not a CA\",\"Is a CA\")"]
[null,"dms_060301_Avg_Duration_Sustained_Int_Values present?",{"$f":"IFERROR(IF(INDEX(dms_060301_Avg_Duration_Sustained_Int_Values,1,1)<>\"\",\"yes\",\"no\"),\"no\")","v":"no"},"dms_060301_checkvalue","=IFERROR(IF(INDEX(dms_060301_Avg_Duration_Sustained_Int_Values,1,1)<>\"\",\"yes\",\"no\"),\"no\")"]
[null,null,"6.3 not collected in backcast RIN",null,"=IF(AND(dms_Model=\"CA\",(dms_060301_checkvalue=\"no\")),\"error - NR not present\",\"no errors\")"]
[null,"Table 6.3.1 - last row reference",0,"dms_060301_LastRow","=IFERROR(IF(dms_Model=\"CA\",LOOKUP(2,1/(dms_060301_Avg_Duration_Sustained_Int_Values<>\"\"),(ROW(dms_060301_Avg_Duration_Sustained_Int_Values))),\"not a CA\"),\"6.3 not present\")"]
[null,"Table 6.3.1 - max number rows",0,"dms_060301_MaxRows","=IFERROR(IF(dms_Model=\"CA\",(dms_060301_LastRow-15),\"not a CA\"),\"error\")"]
[null,"Table 6.6.3 - Public lighting repair - no. business days",{"$f":"INDEX(dms_663_List,MATCH(dms_TradingName,dms_TradingName_List))","v":5},"dms_663","=INDEX(dms_663_List,MATCH(dms_TradingName,dms_TradingName_List))"]
[null,"ARR or RESET RINS"]
[null,"How many rows in tables 6.1 or 6.7?  (leap year?)","insert dms_LeapYear NR if required",null,"'dms_LeapYear is used to determine dms_060701_Max_Rows BUT it is only found on worksheet 6.1 or 6.7 and the date value in the cell is used to determine whether it is a leap year"]
[null,"Is dms_LeapYear named range present?",{"$f":"IFERROR(IF(dms_LeapYear,\"yes\"),\"no\")","v":"no"}]
[null,"Table 6.7.1 - includes a leap year?",{"$f":"\nIFERROR(IF(MONTH(DATE(YEAR(dms_LeapYear),2,29))=2,\"is a leap year\",\"not a leap year\"),\n\"dms_LeapYear not present\")","v":"dms_LeapYear not present"},"dms_LeapYear_Result","=IFERROR(IF(MONTH(DATE(YEAR(dms_LeapYear),2,29))=2,\"is a leap year\",\"not a leap year\"),\"dms_LeapYear not present\")"]
[null,"MaxRows if Reset and leap year",{"$f":"IF(dms_LeapYear_Result=\"is a leap year\",1827,1826)","v":1826},"dms_060701_Reset_MaxRows","=IF(dms_LeapYear_Result=\"is a leap year\",1827,1826)",null,null,"number of days present in Reset RIN table"]
[null,"MaxRows if ARR and leap year",{"$f":"IF(dms_LeapYear_Result=\"is a leap year\",366,365)","v":365},"dms_060701_ARR_MaxRows","=IF(dms_LeapYear_Result=\"is a leap year\",366,365)",null,null,"number of days present in ARR RIN table"]
[null,"Table 6.7.1 - Max Rows (leap year/ non leap year)",{"$f":"IF(dms_Model=\"ARR\",dms_060701_ARR_MaxRows,IF(dms_Model=\"Reset\",dms_060701_Reset_MaxRows,\"not a relevant RIN type\"))","v":"not a relevant RIN type"},"dms_060701_MaxRows","=IF(dms_Model=\"ARR\",dms_060701_ARR_MaxRows,IF(dms_Model=\"Reset\",dms_060701_Reset_MaxRows,\"not a relevant RIN type\"))"]
[null,"How many columns in 6.7?   (4 or 5 feeder categories)",{"$f":"IF(dms_FifthFeeder_flag_NSP=\"NO\",\"This NSP has only 4 feeder categories\",\"This NSP has 5 feeder categories\")","v":"This NSP has only 4 feeder categories"}]
[null,"Table 6.7.1 - Last column (# of feeder categories > 4)",{"$f":"IF(dms_FifthFeeder_flag_NSP=\"NO\",10,12)","v":10},"dms_060701_MaxCols","=IF(dms_FifthFeeder_flag_NSP=\"NO\",8,10)"]
[null,"Table 6.7.1 - Number of offset rows",{"$f":"IF(dms_Model=\"ARR\",15,9)","v":9},"dms_060701_OffsetRows","=IF(dms_Model=\"ARR\",15,9)"]
[null,"Start date for telephone answering in 6.1 or 6.7?",null,null,"Using 060101 as naming standard not 060701 for start dates"]
[null,"Table 6.1.1 and 6.7.1 - Start Date as Text",{"$f":"IF(dms_SingleYearModel=\"yes\",(CONCATENATE(IF(LEN(CRY)=4,\"1-Jan-\",\"1-Jul-\"),LEFT(CRY,4))),(CONCATENATE(IF(LEN(PRCP_y4)=4,\"1-Jan-\",\"1-Jul-\"),LEFT(PRCP_y4,4))))","v":"1-Jul-2008"},"dms_060101_StartDateTxt","=IF(SUM(dms_SingleYear_Model)>1,(CONCATENATE(IF(LEN(CRY)=4,\"1-Jan-\",\"1-Jul-\"),LEFT(CRY,4))),(CONCATENATE(IF(LEN(CRCP_y4)=4,\"1-Jan-\",\"1-Jul-\"),LEFT(CRCP_y4,4))))"]
[null,"Table 6.1.1 and 6.7.1 - Start Date as Date Value",{"$f":"DATEVALUE(dms_060701_StartDateTxt)","v":39630},"dms_060101_StartDateVal","=DATEVALUE(dms_060701_StartDateTxt)"]
[null,"ARRs"]
[null,"How many rows in table 6.8?","insert dms_060801_StartCell NR if required",null,"dms_060801_StartCell is only found on worksheet 6.8 and is used to determine the starting date for the date range"]
[null,"Is dms_060801_StartCell named range present?","yes",null,"=IFERROR(IF((ROW(dms_060801_StartCell)-1)=1,\"yes\",\"yes\"),\"no\")"]
[null,"Table 6.8 - Number of offset rows",12,"dms_0608_OffsetRows","=IFERROR(IF(dms_Model=\"ARR\",(ROW(dms_060801_StartCell)-1),\"not an ARR\"),\"6.8 error\")"]
[null,"Table 6.8 - Last row","6.8 not present","dms_0608_LastRow","=IFERROR(IF(dms_060801_StartCell<>\"\",IF(dms_Model=\"ARR\",(LOOKUP(2,1/(dms_060801_01_Values<>\"\"),(ROW(dms_060801_01_Values)))),\"not an ARR\"),0),\"6.8 not present\")"]
[null,"Table 6.8 - MaxRows",{"$f":"IFERROR(IF(dms_Model=\"ARR\",(MAX(0,dms_0608_LastRow-dms_0608_OffsetRows)),\"not an ARR\"),\"6.8 not present\")","v":"not an ARR"},"dms_060801_MaxRows","=IFERROR(IF(dms_Model=\"ARR\",(MAX(0,dms_0608_LastRow-dms_0608_OffsetRows)),\"not an ARR\"),\"6.8 not present\")"]
[null,"TNSP RESET RINS"]
[null,"Table 7.9.4 only appears in TNSPs Reset RIN"]
[null,"Table 7.9.4 - first year",{"$f":"LEFT(PRCP_y3,4)","v":"2000"},"dms_070904_Start_Year","=LEFT(PRCP_y3,4)"]
[null,"SUBSET FILES"]
[null,"Is this Submission File a Subset File","YES","dms_Partial"]
[null,"MISC"]
[null,"Distribution Determination Reference",{"$f":"INDEX(dms_DeterminationRef_List,MATCH(dms_TradingName,dms_TradingName_List))","v":"2015-20 Distribution Determination"},"dms_DeterminationRef"]
[null,"Public lighting NSP?",{"$f":"INDEX(dms_Public_Lighting_List,MATCH(dms_TradingName,dms_TradingName_List))","v":"NO"},"dms_Public_Lighting","=INDEX(dms_Public_Lighting_List,MATCH(dms_TradingName,dms_TradingName_List))"]
[null,"CBD Feeder for this business",{"$f":"INDEX(dms_CBD_flag,MATCH(dms_TradingName,dms_TradingName_List))","v":"NO"},"dms_CBD_flag_NSP"]
[null,"Urban Feeder for this business",{"$f":"INDEX(dms_Urban_flag,MATCH(dms_TradingName,dms_TradingName_List))","v":"NO"},"dms_Urban_flag_NSP"]
[null,"Short rural Feeder for this business",{"$f":"INDEX(dms_ShortRural_flag,MATCH(dms_TradingName,dms_TradingName_List))","v":"YES"},"dms_ShortRural_flag_NSP"]
[null,"Long rural Feeder for this business",{"$f":"INDEX(dms_LongRural_flag,MATCH(dms_TradingName,dms_TradingName_List))","v":"YES"},"dms_LongRural_flag_NSP"]
[null,"Fifth Feeder Category (eg. TasNetworks (D))",{"$f":"INDEX(dms_FeederType_5_flag,MATCH(dms_TradingName,dms_TradingName_List))","v":"NO"},"dms_FifthFeeder_flag_NSP","=INDEX(dms_FeederType_5_flag,MATCH(dms_TradingName,dms_TradingName_List))"]
[]
[null,"DISCARD FILES"]
[null,"discard this record?","NO","dms_DISCARD","If record is to be discarded from DB set this flag to YES"]
[]
[null,"USES NAMED RANGES FLAG","yes","dms_Defined_Names_Used"]
[]
[null,"REGULATORY YEARS FOR MULTI RYE SUBMISSIONS"]
[null,"Multiple RYE flag","YES","dms_Multi_RYE_flag"]
[null,null,"Manually specify RYE","Named ranges to apply"]
[null,null,2013,"dms_RYE_01"]
[null,null,2014,"dms_RYE_02"]
[null,null,2015,"dms_RYE_03"]
[null,null,2016,"dms_RYE_04"]
[null,null,2017,"dms_RYE_05"]
[null,null,2018,"dms_RYE_06"]
[null,null,2019,"dms_RYE_07"]
[null,null,2020,"dms_RYE_08"]
[null,null,2021,"dms_RYE_09"]

{"sheet":"2.1 Expenditure summary","index":5,"n_rows":158,"n_cols":12,"rows_kept":158,"cut":false,"hidden":false,"merged":[[122,2,122,11],[142,2,142,11],[104,2,104,11],[8,2,8,11],[29,2,29,11],[49,2,49,11],[67,2,67,11],[85,2,85,11]]}
[null,"REGULATORY REPORTING STATEMENT"]
[null,{"$f":"INDEX(dms_TradingNameFull_List,MATCH(dms_TradingName,dms_TradingName_List))","v":"SA Power Networks"}]
[null,{"$f":"IF(SUM(dms_SingleYear_Model)>0,(\"CATEGORY ANALYSIS \"&CRY&\" to \"&FRY),(\"CATEGORY ANALYSIS \"&CRY))","v":"CATEGORY ANALYSIS 2008-09 to 2018-19"}]
[null,"2.1 EXPENDITURE SUMMARY & RECONCILIATION"]
[]
[null,"There are EIGHT tables on this worksheet - see the Instructions sheet on how to group or ungroup tables. "]
[]
[null,"2.1.1 - STANDARD CONTROL SERVICES CAPEX"]
[null,null,"EXPENDITURE ($0's)"]
[null,null,{"$f":"IF(dms_RPT=\"financial\",dms_CRYf_y1,dms_CRYc_y1)","v":"2008-09"},{"$f":"IF(dms_RPT=\"financial\",dms_CRYf_y2,dms_CRYc_y2)","v":"2009-10"},{"$f":"IF(dms_RPT=\"financial\",dms_CRYf_y3,dms_CRYc_y3)","v":"2010-11"},{"$f":"IF(dms_RPT=\"financial\",dms_CRYf_y4,dms_CRYc_y4)","v":"2011-12"},{"$f":"IF(dms_RPT=\"financial\",dms_CRYf_y5,dms_CRYc_y5)","v":"2012-13"},{"$f":"IF(dms_RPT=\"financial\",dms_CRYf_y6,dms_CRYc_y6)","v":"2013-14"},{"$f":"IF(dms_RPT=\"financial\",dms_CRYf_y7,dms_CRYc_y7)","v":"2014-15"},{"$f":"IF(dms_RPT=\"financial\",dms_CRYf_y8,dms_CRYc_y8)","v":"2015-16"},{"$f":"IF(dms_RPT=\"financial\",dms_CRYf_y9,dms_CRYc_y9)","v":"2016-17"},{"$f":"IF(dms_RPT=\"financial\",dms_CRYf_y10,dms_CRYc_y10)","v":"2017-18"}]
[null,"Replacement expenditure",27376822,32420084,48105266,62171818,75060740,68782084,78106620.670000002,74866525.349999994,83264524.76000002,129522416.88999999]
[null,"Connections",91494000,101043000,74524000,69081000,73078000,72868000.000000015,64356543,55537467.969999999,58216593.900000006,68973178.139999986]
[null,"Augmentation Expenditure",60942000,68956000,123942000,139389000,120221000,83008000,99556164.759000018,51680564.969999999,60077472.890000008,87165260.980000004]
[null,"Non-network",40161000,36922000,58502000,74591000,80458000,88839000,104617563,76417968.890000001,86239351.39000009,109262862.13999993]
[null,"capitalised network overheads",9120686.7355762236,10917801.959946061,10254869.180348087,9714721.6934171449,12031571.867857553,10830014.785620857,8803827.8800149169,7624423.6972545804,10655357.73447006,6676733.4932190822]
[null,"capitalised corporate overheads",3827000,3192000,3767000,-44000,-3730000,-7267000,-18253075.623836096,-13251556.65,-9361715.3000000007,-6939995.2358265053]
[null,"Metering",12449000,13328000,0,0,0,0,0,0,0,0]
[null,"Public Lighting",0,0,0,0,0,0,0,0,0,0]
[]
[]
[]
[]
[]
[]
[null,"balancing item",0,0,5760000,0,0,-1432000,-124098.04899997264,-237665.3599999994,-2248990.4200000018,-8978387.8099999949]
[null,"capcons (included in the above items)",85618474,109706110,70361518,48234026,41522635,49969962,37625366,30384252.998888895,27770975.236429609,29535992.120000001]
[null,"TOTAL GROSS CAPEX (includes capcons)",{"$f":"+SUM(C11:C25)","v":245370508.73557621},266778885.95994607,324855135.1803481,354903539.69341713,null,315628098.78562087,337063545.63617885,252637728.86725456]
[]
[null,"2.1.2 - STANDARD CONTROL SERVICES OPEX"]
[null,null,"EXPENDITURE ($0's)"]
[null,null,{"$f":"IF(dms_RPT=\"financial\",dms_CRYf_y1,dms_CRYc_y1)","v":"2008-09"},{"$f":"IF(dms_RPT=\"financial\",dms_CRYf_y2,dms_CRYc_y2)","v":"2009-10"},{"$f":"IF(dms_RPT=\"financial\",dms_CRYf_y3,dms_CRYc_y3)","v":"2010-11"},{"$f":"IF(dms_RPT=\"financial\",dms_CRYf_y4,dms_CRYc_y4)","v":"2011-12"},{"$f":"IF(dms_RPT=\"financial\",dms_CRYf_y5,dms_CRYc_y5)","v":"2012-13"},{"$f":"IF(dms_RPT=\"financial\",dms_CRYf_y6,dms_CRYc_y6)","v":"2013-14"},{"$f":"IF(dms_RPT=\"financial\",dms_CRYf_y7,dms_CRYc_y7)","v":"2014-15"},{"$f":"IF(dms_RPT=\"financial\",dms_CRYf_y8,dms_CRYc_y8)","v":"2015-16"},{"$f":"IF(dms_RPT=\"financial\",dms_CRYf_y9,dms_CRYc_y9)","v":"2016-17"},{"$f":"IF(dms_RPT=\"financial\",dms_CRYf_y10,dms_CRYc_y10)","v":"2017-18"}]
[null,"Vegetation management",14063212.96062565,14517424.638713237,21379813.325283486,35876503.898205325,39625933.934917033,34383322.956827246,45571826.670000002,30957006.799999997,29750410.349999994,37453791.969999999]
[null,"Maintenance",19609103.64708792,20836569.984922916,24605030.553119849,30034665.493519984,32631018.707575329,39600129.044470638,40563958.280000001,37764145.039999999,41895318.43,48445662.090000004]
[null,"Emergency response",26374994.695896834,25780475.286007747,29003967.943843767,25463049.76643585,31006356.713390753,31062481.833285879,32087787.400000006,33646840.300000004,43002001.479999989,34675799.240000002]
[null,"Non-network",18184223.553822275,19883912.268956702,25239475.799441125,28970664.804413836,30453704.515862681,36122481.875273593,34079042.522215322,28638718.766292363,35928982.085820213,41720858.20577012]
[null,"network overheads",55402632.597683281,57861008.862625808,70568200.334260687,65596180.816378459,74174236.462423757,85280970.702418014,79442045.269546852,70507151.359599963,94276825.403706625,80334962.48417747]
[null,"corporate overheads",36262960.152081028,36615216.764517188,55498211.432698108,58888731.512199491,56320348.194933325,63044474.821177721,65880082.842469603,52874705.793141983,58995611.877521463,72593463.513004869]
[null,"Metering",4991982.8581305025,5494395.7054393589,0,0,0,0,0,0,0,0]
[null,"Public Lighting",0,0,0,0,0,0,0,0,0,0]
[]
[]
[]
[]
[]
[]
[null,"balancing tem",-20460223.553822279,-21994912.268956706,-27090475.799441129,-30990664.804413836,-32445704.515862685,-38308481.875273593,-36963065.522215322,-31449097.026292369,-37995497.235820211,-49722218.205770113]
[null,"TOTAL OPEX",{"$f":"+SUM(C32:C46)","v":154428886.91150522},{"$f":"+SUM(D32:D46)","v":158994091.24222624},199204223.58920589,213839131.48673913,null,251185379.35817951,260661677.46201652,222939471.03274196]
[]
[null,"2.1.3 - ALTERNATIVE CONTROL SERVICES CAPEX"]
[null,null,"EXPENDITURE ($0's)"]
[null,null,{"$f":"IF(dms_RPT=\"financial\",dms_CRYf_y1,dms_CRYc_y1)","v":"2008-09"},{"$f":"IF(dms_RPT=\"financial\",dms_CRYf_y2,dms_CRYc_y2)","v":"2009-10"},{"$f":"IF(dms_RPT=\"financial\",dms_CRYf_y3,dms_CRYc_y3)","v":"2010-11"},{"$f":"IF(dms_RPT=\"financial\",dms_CRYf_y4,dms_CRYc_y4)","v":"2011-12"},{"$f":"IF(dms_RPT=\"financial\",dms_CRYf_y5,dms_CRYc_y5)","v":"2012-13"},{"$f":"IF(dms_RPT=\"financial\",dms_CRYf_y6,dms_CRYc_y6)","v":"2013-14"},{"$f":"IF(dms_RPT=\"financial\",dms_CRYf_y7,dms_CRYc_y7)","v":"2014-15"},{"$f":"IF(dms_RPT=\"financial\",dms_CRYf_y8,dms_CRYc_y8)","v":"2015-16"},{"$f":"IF(dms_RPT=\"financial\",dms_CRYf_y9,dms_CRYc_y9)","v":"2016-17"},{"$f":"IF(dms_RPT=\"financial\",dms_CRYf_y10,dms_CRYc_y10)","v":"2017-18"}]
[null,"Connections",0,0,0,0,0,0,0,0,0,0]
[null,"capitalised network overheads",137618.79171120145,202639.32196737899,785628.51353166101,953855.87144462229,873796.86251030012,804609.1073396682,685010.64999999991,522288.25,867230.45000000007,186279.19512843905]
[null,"capitalised corporate overheads",54000,39000,3000,-179000,-295000,-332000,-532074.50025076419,-328613.2,-271916.28000000003,-232615.59167954346]
[null,"Metering",0,0,18791000,21685000,16839000,11835000,9863000,7607631,6308184.9199999999,4927667.18]
[null,"Public lighting",2795381.2082887981,4067360.6780326208,3561371.4864683389,3787144.1285553779,3889203.1374897002,3987390.8926603319,4076071.2600000007,4038048.79,7801733.5699999994,10541625.850000001]
[null,"Fee and quoted",0,0,0,0,0,0,0,0,0,0]
[]
[]
[]
[]
[]
[]
[null,"balancing tem",0,0,-15823000,-18448000,-13510000,-8717000,-5966081.9100000001,0,0,0]
[null,"TOTAL CAPEX",{"$f":"+SUM(C52:C64)","v":2986999.9999999995},4309000,7318000,7799000,null,7578000,8125925.4997492358,11839354.84]
[]
[null,"2.1.4 - ALTERNATIVE CONTROL SERVICES OPEX"]
[null,null,"EXPENDITURE ($0's)"]
[null,null,{"$f":"IF(dms_RPT=\"financial\",dms_CRYf_y1,dms_CRYc_y1)","v":"2008-09"},{"$f":"IF(dms_RPT=\"financial\",dms_CRYf_y2,dms_CRYc_y2)","v":"2009-10"},{"$f":"IF(dms_RPT=\"financial\",dms_CRYf_y3,dms_CRYc_y3)","v":"2010-11"},{"$f":"IF(dms_RPT=\"financial\",dms_CRYf_y4,dms_CRYc_y4)","v":"2011-12"},{"$f":"IF(dms_RPT=\"financial\",dms_CRYf_y5,dms_CRYc_y5)","v":"2012-13"},{"$f":"IF(dms_RPT=\"financial\",dms_CRYf_y6,dms_CRYc_y6)","v":"2013-14"},{"$f":"IF(dms_RPT=\"financial\",dms_CRYf_y7,dms_CRYc_y7)","v":"2014-15"},{"$f":"IF(dms_RPT=\"financial\",dms_CRYf_y8,dms_CRYc_y8)","v":"2015-16"},{"$f":"IF(dms_RPT=\"financial\",dms_CRYf_y9,dms_CRYc_y9)","v":"2016-17"},{"$f":"IF(dms_RPT=\"financial\",dms_CRYf_y10,dms_CRYc_y10)","v":"2017-18"}]
[null,"Connections",0,0,0,0,0,0,0,0,0,0]
[null,"network overheads",1514162.8961888386,1834678.6941084738,1675562.0773096674,1519622.8106440317,1516834.4330504006,1590962.4377611205,1274937.8342022006,5284398.8050802434,5112147.490905622,4342617.0966974571]
[null,"corporate overheads",3087561.6434164038,3480097.4798589721,4793064.4623538004,5634173.1098131146,3989372.164826205,4463089.9486282757,4254116.4438143829,5655373.516690365,5382073.740658748,9039711.1234824136]
[null,"Metering",0,0,5584029.7825974906,6409210.066266817,6526581.249591833,6084000,5555760.3099999996,6059552.4899999993,5478694.3499999987,4670009.5199999996]
[null,"Public lighting",4316455.3531954279,4807401.383685573,4625665.0716249067,5131812.8920170711,5902043.0034523346,6592344.9073875286,6811576.3300000001,7059389.6600000011,8300711.5500000007,12980682.680000002]
[null,"Fee and quoted",12415642.810917361,13863026.404038763,22626096.038550775,16948406.431999378,16225613.649799488,15329904.90232422,16851840.579999998,42938356.57,32015000.124184716,35052684.677555539]
[null,"Non-network",0,0,0,0,0,0,0,0,0,0]
[]
[]
[]
[]
[]
[null,"balancing tem",0,0,-684957.87000000023,-1402994.7800000003,-1683216.23,-1554013.4199579044,-1011903.1500000001,0,0,0]
[null,"TOTAL OPEX",{"$f":"+SUM(C70:C82)","v":21333822.703718029},23985203.961691782,38619459.56243664,34240230.53074041,null,32506288.776143238,33736328.348016582,66997071.041770607]
[]
[null,"2.1.5 - DUAL FUNCTION ASSETS CAPEX"]
[null,null,"EXPENDITURE ($0's)"]
[null,null,{"$f":"IF(dms_RPT=\"financial\",dms_CRYf_y1,dms_CRYc_y1)","v":"2008-09"},{"$f":"IF(dms_RPT=\"financial\",dms_CRYf_y2,dms_CRYc_y2)","v":"2009-10"},{"$f":"IF(dms_RPT=\"financial\",dms_CRYf_y3,dms_CRYc_y3)","v":"2010-11"},{"$f":"IF(dms_RPT=\"financial\",dms_CRYf_y4,dms_CRYc_y4)","v":"2011-12"},{"$f":"IF(dms_RPT=\"financial\",dms_CRYf_y5,dms_CRYc_y5)","v":"2012-13"},{"$f":"IF(dms_RPT=\"financial\",dms_CRYf_y6,dms_CRYc_y6)","v":"2013-14"},{"$f":"IF(dms_RPT=\"financial\",dms_CRYf_y7,dms_CRYc_y7)","v":"2014-15"},{"$f":"IF(dms_RPT=\"financial\",dms_CRYf_y8,dms_CRYc_y8)","v":"2015-16"},{"$f":"IF(dms_RPT=\"financial\",dms_CRYf_y9,dms_CRYc_y9)","v":"2016-17"},{"$f":"IF(dms_RPT=\"financial\",dms_CRYf_y10,dms_CRYc_y10)","v":"2017-18"}]
[null,"Replacement expenditure",0,0,0,0,0,0,0,0,0,0]
[null,"Connections",0,0,0,0,0,0,0,0,0,0]
[null,"Augmentation Expenditure",0,0,0,0,0,0,0,0,0,0]
[null,"Non-network",0,0,0,0,0,0,0,0,0,0]
[null,"Capitalised network overheads",0,0,0,0,0,0,0,0,0,0]
[null,"Capitalised corporate overheads",0,0,0,0,0,0,0,0,0,0]
[]
[]
[]
[]
[]
[]
[]
[null,"capcons (included in the above items)"]
[null,"TOTAL GROSS CAPEX (includes capcons)",{"$f":"SUM(C88:C100)","v":0},0,0,0,null,0,0,0]
[]
[null,"2.1.6 - DUAL FUNCTION ASSETS OPEX"]
[null,null,"EXPENDITURE ($0's)"]
[null,null,{"$f":"IF(dms_RPT=\"financial\",dms_CRYf_y1,dms_CRYc_y1)","v":"2008-09"},{"$f":"IF(dms_RPT=\"financial\",dms_CRYf_y2,dms_CRYc_y2)","v":"2009-10"},{"$f":"IF(dms_RPT=\"financial\",dms_CRYf_y3,dms_CRYc_y3)","v":"2010-11"},{"$f":"IF(dms_RPT=\"financial\",dms_CRYf_y4,dms_CRYc_y4)","v":"2011-12"},{"$f":"IF(dms_RPT=\"financial\",dms_CRYf_y5,dms_CRYc_y5)","v":"2012-13"},{"$f":"IF(dms_RPT=\"financial\",dms_CRYf_y6,dms_CRYc_y6)","v":"2013-14"},{"$f":"IF(dms_RPT=\"financial\",dms_CRYf_y7,dms_CRYc_y7)","v":"2014-15"},{"$f":"IF(dms_RPT=\"financial\",dms_CRYf_y8,dms_CRYc_y8)","v":"2015-16"},{"$f":"IF(dms_RPT=\"financial\",dms_CRYf_y9,dms_CRYc_y9)","v":"2016-17"},{"$f":"IF(dms_RPT=\"financial\",dms_CRYf_y10,dms_CRYc_y10)","v":"2017-18"}]
[null,"Vegetation management",0,0,0,0,0,0,0,0,0,0]
[null,"Maintenance",0,0,0,0,0,0,0,0,0,0]
[null,"Emergency response",0,0,0,0,0,0,0,0,0,0]
[null,"Non-network",0,0,0,0,0,0,0,0,0,0]
[null,"network overheads",0,0,0,0,0,0,0,0,0,0]
[null,"corporate overheads",0,0,0,0,0,0,0,0,0,0]
[null,"Metering",0,0,0,0,0,0,0,0,0,0]
[]
[]
[]
[]
[]
[]
[null,"TOTAL OPEX",{"$f":"SUM(C107:C119)","v":0},0,0,0,null,0,0,0]
[]
[null,"2.1.7 - STANDARD CONTROL SERVICES CAPCONS"]
[null,null,"EXPENDITURE ($0's)"]
[null,null,{"$f":"IF(dms_RPT=\"financial\",dms_CRYf_y1,dms_CRYc_y1)","v":"2008-09"},{"$f":"IF(dms_RPT=\"financial\",dms_CRYf_y2,dms_CRYc_y2)","v":"2009-10"},{"$f":"IF(dms_RPT=\"financial\",dms_CRYf_y3,dms_CRYc_y3)","v":"2010-11"},{"$f":"IF(dms_RPT=\"financial\",dms_CRYf_y4,dms_CRYc_y4)","v":"2011-12"},{"$f":"IF(dms_RPT=\"financial\",dms_CRYf_y5,dms_CRYc_y5)","v":"2012-13"},{"$f":"IF(dms_RPT=\"financial\",dms_CRYf_y6,dms_CRYc_y6)","v":"2013-14"},{"$f":"IF(dms_RPT=\"financial\",dms_CRYf_y7,dms_CRYc_y7)","v":"2014-15"},{"$f":"IF(dms_RPT=\"financial\",dms_CRYf_y8,dms_CRYc_y8)","v":"2015-16"},{"$f":"IF(dms_RPT=\"financial\",dms_CRYf_y9,dms_CRYc_y9)","v":"2016-17"},{"$f":"IF(dms_RPT=\"financial\",dms_CRYf_y10,dms_CRYc_y10)","v":"2017-18"}]
[null,"Replacement expenditure",3265025.0732955621,3020559.3745173472,2418843.8074919628,3125636.9319185545,2946292.2563433945,3337993.8187631289,2796244.7728017122,2848880.7461830177,3397225.925442778,3031977.7252024808]
[null,"Connections",73298296.871139675,94631539.708325505,63071030.503677242,42020436.252249219,34790243.376138091,42564340.230975069,30901026.006056122,24213489.18485117,21129267.855965439,22740400.397231601]
[null,"Augmentation Expenditure",1816372.0648012992,1549819.8912496914,2089583.2546199237,1494460.0253102444,2117421.6906365082,1968132.5662691083,2653913.2789019449,2072915.1123567384,1770700.2337648221,3061677.7000505491]
[null,"Non-network",0,0,0,0,0,0,0,0,0,0]
[null,"capitalised network overheads",4101624.0760026216,5418451.9650414605,2782060.7942108703,1593492.9105219939,1668677.7568820191,2099495.0439926744,1274181.8622402227,1248967.9554979659,1473781.2212565802,701936.30025717593]
[null,"capitalised corporate overheads",0,0,0,0,0,0,0,0,0,0]
[null,"Metering",3137156.2132608322,5085738.7108659968,0,0,0,0,0,0,0,0]
[null,"Public Lighting",0,0,0,0,0,0,0,0,0,0]
[]
[]
[]
[]
[]
[]
[]
[null,"TOTAL CAPCONS",{"$f":"+SUM(C125:C139)","v":85618474.298500001},109706109.65000001,70361518.359999999,48234026.120000012,null,49969961.659999982,37625365.920000002,30384252.998888891]
[]
[null,"2.1.8 - STANDARD CONTROL SERVICES CAPITALISED OVERHEADS"]
[null,null,"EXPENDITURE ($0's)"]
[null,null,{"$f":"IF(dms_RPT=\"financial\",dms_CRYf_y1,dms_CRYc_y1)","v":"2008-09"},{"$f":"IF(dms_RPT=\"financial\",dms_CRYf_y2,dms_CRYc_y2)","v":"2009-10"},{"$f":"IF(dms_RPT=\"financial\",dms_CRYf_y3,dms_CRYc_y3)","v":"2010-11"},{"$f":"IF(dms_RPT=\"financial\",dms_CRYf_y4,dms_CRYc_y4)","v":"2011-12"},{"$f":"IF(dms_RPT=\"financial\",dms_CRYf_y5,dms_CRYc_y5)","v":"2012-13"},{"$f":"IF(dms_RPT=\"financial\",dms_CRYf_y6,dms_CRYc_y6)","v":"2013-14"},{"$f":"IF(dms_RPT=\"financial\",dms_CRYf_y7,dms_CRYc_y7)","v":"2014-15"},{"$f":"IF(dms_RPT=\"financial\",dms_CRYf_y8,dms_CRYc_y8)","v":"2015-16"},{"$f":"IF(dms_RPT=\"financial\",dms_CRYf_y9,dms_CRYc_y9)","v":"2016-17"},{"$f":"IF(dms_RPT=\"financial\",dms_CRYf_y10,dms_CRYc_y10)","v":"2017-18"}]
[null,"Vegetation management",0,0,0,0,0,0,0,0,0,0]
[null,"Maintenance",0,0,0,0,0,0,0,0,0,0]
[null,"Emergency response",0,0,0,0,0,0,0,0,0,0]
[null,"Non-network",0,0,0,0,0,0,0,0,0,0]
[null,"Metering",519338.6385869839,548175.36956110189,0,0,0,0,0,0,0,0]
[null,"Public Lighting",0,0,0,0,0,0,0,0,0,0]
[null,"Replacement expenditure",2430729.087490608,2596758.9644076517,3006316.8509048512,2381511.2301050737,2664557.2660208005,1664929.0736377742,-2484348.2101672473,-1567966.2695525768,742087.48104436044,-219179.44752573036]
[null,"Connections",6626149.2166001275,7296902.6440055696,4883439.8409316596,2566374.751185793,1938927.7663264708,949110.81121487543,-2728613.6925722016,-1543174.045705826,434140.31761391833,-237040.73350032838]
[null,"Augmentation Expenditure",3132378.6462689741,3512068.8998147221,5731992.2306082938,4489550.7521019364,3563290.9362642858,1369318.4418447015,-2392165.6385977017,-1124289.8619067536,892493.90904675331,692761.60684481519]
[null,"Non-network",239091.14662953027,155896.08215701478,400120.2579032816,233284.96002434188,134795.89924599626,-420343.54107649403,-1844120.2024840312,-1391702.7755802642,-775079.27323497355,-499803.1684261784]
[]
[]
[null,"capcons (included in the above items)",4101624.0760026216,5418451.9650414605,2782060.7942108703,1593492.9105219939,1668677.7568820191,2099495.0439926744,1274181.8622402227,1248967.9554979659,1473781.2212565802,701936.30025717593]
[null,"TOTAL CAPITALISED OVERHEADS",{"$f":"+SUM(C145:C156)","v":12947686.735576224},{"$f":"+SUM(D145:D156)","v":14109801.959946061},14021869.180348087,9670721.6934171449,null,3563014.7856208575,-9449247.7438211814,-5627132.9527454209]

{"sheet":"2.2 Repex","index":6,"n_rows":500,"n_cols":14,"rows_kept":500,"cut":false,"hidden":false,"merged":[[477,4,477,13],[452,4,452,13],[479,1,482,1],[483,1,486,1],[487,1,493,1],[494,1,497,1],[498,1,499,1],[338,1,346,1],[347,1,354,1],[355,1,370,1],[371,1,399,1],[400,1,413,1],[469,1,472,1],[473,1,474,1],[462,1,468,1],[414,1,422,1],[423,1,430,1],[454,1,457,1],[253,1,266,1],[156,4,156,13],[458,1,461,1],[303,4,303,13],[267,1,275,1],[276,1,283,1],[191,1,199,1],[200,1,207,1],[208,1,223,1],[224,1,252,1],[158,1,177,1],[178,1,184,1],[185,1,190,1],[305,1,324,1],[325,1,331,1],[332,1,337,1],[9,4,9,13],[11,1,30,1],[31,1,37,1],[44,1,52,1],[53,1,60,1],[38,1,43,1],[61,1,76,1],[77,1,105,1],[106,1,119,1],[120,1,128,1],[129,1,136,1]]}
[null,"REGULATORY REPORTING STATEMENT"]
[null,{"$f":"INDEX(dms_TradingNameFull_List,MATCH(dms_TradingName,dms_TradingName_List))","v":"SA Power Networks"}]
[null,{"$f":"IF(SUM(dms_SingleYear_Model)>0,(\"CATEGORY ANALYSIS \"&CRY&\" to \"&FRY),(\"CATEGORY ANALYSIS \"&CRY))","v":"CATEGORY ANALYSIS 2008-09 to 2018-19"}]
[null,"2.2 REPEX"]
[]
[null,"There are TWO tables on this worksheet. These tables have been 'grouped' (and sub-grouped) for ease of navigation.  See the Instructions sheet on how to group or ungroup tables. "]
[]
[null,"2.2.1 - REPLACEMENT EXPENDITURE, VOLUMES AND ASSET FAILURES BY ASSET CATEGORY"]
[null,"EXPENDITURE"]
[null,null,null,null,"EXPENDITURE ($0's)"]
[null,"ASSET GROUP","ASSET CATEGORY",null,{"$f":"IF(dms_RPT=\"financial\",dms_CRYf_y1,dms_CRYc_y1)","v":"2008-09"},{"$f":"IF(dms_RPT=\"financial\",dms_CRYf_y2,dms_CRYc_y2)","v":"2009-10"},{"$f":"IF(dms_RPT=\"financial\",dms_CRYf_y3,dms_CRYc_y3)","v":"2010-11"},{"$f":"IF(dms_RPT=\"financial\",dms_CRYf_y4,dms_CRYc_y4)","v":"2011-12"},{"$f":"IF(dms_RPT=\"financial\",dms_CRYf_y5,dms_CRYc_y5)","v":"2012-13"},{"$f":"IF(dms_RPT=\"financial\",dms_CRYf_y6,dms_CRYc_y6)","v":"2013-14"},{"$f":"IF(dms_RPT=\"financial\",dms_CRYf_y7,dms_CRYc_y7)","v":"2014-15"},{"$f":"IF(dms_RPT=\"financial\",dms_CRYf_y8,dms_CRYc_y8)","v":"2015-16"},{"$f":"IF(dms_RPT=\"financial\",dms_CRYf_y9,dms_CRYc_y9)","v":"2016-17"},{"$f":"IF(dms_RPT=\"financial\",dms_CRYf_y10,dms_CRYc_y10)","v":"2017-18"}]
[null,"POLES BY: \nHIGHEST OPERATING VOLTAGE ; MATERIAL TYPE","Staking of a wooden pole"]
[null,null,"˂ = 1 kV; Wood"]
[null,null,"> 1 kV & < = 11 kV; Wood"]
[null,null,"˃ 11 kV & < = 22 kV; Wood"]
[null,null,"> 22 kV & < = 66 kV; Wood"]
[null,null,"> 66 kV & < = 132 kV; Wood"]
[null,null,"> 132 kV; Wood"]
[null,null,"˂ = 1 kV; Concrete"]
[null,null,"> 1 kV & < = 11 kV; Concrete"]
[null,null,"˃ 11 kV & < = 22 kV; Concrete"]
[null,null,"> 22 kV & < = 66 kV; Concrete"]
[null,null,"> 66 kV & < = 132 kV; Concrete"]
[null,null,"> 132 kV; Concrete"]
[null,null,"˂ = 1 kV; Steel"]
[null,null,"> 1 kV & < = 11 kV; Steel"]
[null,null,"˃ 11 kV & < = 22 kV; Steel",null,"","","","","","",""]
[null,null,"> 22 kV & < = 66 kV; Steel",null,"","","","","","",""]
[null,null,"> 66 kV & < = 132 kV; Steel",null,"","","","","","",""]
[null,null,"> 132 kV; Steel",null,"","","","","","",""]
[null,null,"Other",null,"","","","","","",""]
[null,"POLE TOP STRUCTURES BY: \nHIGHEST OPERATING VOLTAGE","˂ = 1 kV",null,"","","","","","",""]
[null,null,"> 1 kV & < = 11 kV",null,"","","","","","",""]
[null,null,"˃ 11 kV & < = 22 kV",null,"","","","","","",""]
[null,null,"> 22 kV & < = 66 kV",null,"","","","","","",""]
[null,null,"> 66 kV & < = 132 kV",null,"","","","","","",""]
[null,null,"> 132 kV",null,"","","","","","",""]
[null,null,"Other"]
[null,"STAKING WOODEN POLES BY: \nHIGHEST OPERATING VOLTAGE","˂ = 1 Kv","for year wooden pole staked"]
[null,null,"> 1 kV & < = 11 kV","for year wooden pole staked"]
[null,null,"˃ 11 kV & < = 22 kV","for year wooden pole staked"]
[null,null,"> 22 kV & < = 66 kV","for year wooden pole staked"]
[null,null,"> 66 kV & < = 132 kV","for year wooden pole staked"]
[null,null,"> 132 kV","for year wooden pole staked"]
[null,"OVERHEAD CONDUCTORS BY: \nHIGHEST OPERATING VOLTAGE; NUMBER OF PHASES (AT HV)","˂ = 1 kV","per km","","","","","","",""]
[null,null,"> 1 kV & < = 11 kV","per km","","","","","","",""]
[null,null,"˃ 11 kV & < = 22 kV  ; SWER","per km","","","","","","",""]
[null,null,"˃ 11 kV & < = 22 kV ; Single-Phase","per km","","","","","","",""]
[null,null,"˃ 11 kV & < = 22 kV ; Multiple-Phase","per km","","","","","","",""]
[null,null,"> 22 kV & < = 66 kV","per km","","","","","","",""]
[null,null,"> 66 kV & < = 132 kV","per km","","","","","","",""]
[null,null,"> 132 kV","per km","","","","","","",""]
[null,null,"Other","per km"]
[null,"UNDERGROUND CABLES BY: \nHIGHEST OPERATING VOLTAGE","˂ = 1 kV","per km","","","","","","",""]
[null,null,"> 1 kV & < = 11 kV","per km","","","","","","",""]
[null,null,"> 11 kV & < = 22 kV","per km","","","","","","",""]
[null,null,"> 22 kV & < = 33 kV","per km","","","","","","",""]
[null,null,"> 33 kV & < = 66 kV","per km","","","","","","",""]
[null,null,"> 66 kV & < = 132 kV","per km","","","","","","",""]
[null,null,">  132 kV","per km","","","","","","",""]
[null,null,"Other","per km"]
[null,"SERVICE LINES BY: \nCONNECTION VOLTAGE; CUSTOMER TYPE; CONNECTION COMPLEXITY ","˂ = 11 kV ; Residential ; Simple Type","per number of spans","","","","","","",""]
[null,null,"˂ = 11 kV ; Commercial & Industrial ; Simple Type","per number\n of spans","","","","","","",""]
[null,null,"˂ = 11 kV ; Residential ; Complex Type","per number\n of spans","","","","","","",""]
[null,null,"˂ = 11 kV ; Commercial & Industrial ; Complex Type","per number\n of spans","","","","","","",""]
[null,null,"˂ = 11 kV ; Subdivision ; Complex Type","per number\n of spans","","","","","","",""]
[null,null,"> 11 kV  & < = 22 kV ; Commercial & Industrial  ","per number\n of spans","","","","","","",""]
[null,null,"> 11 kV  & < = 22 kV ; Subdivision  ","per number\n of spans","","","","","","",""]
[null,null,"> 22 kV & < = 33 kV ; Commercial & Industrial  ","per number\n of spans","","","","","","",""]
[null,null,"> 22 kV & < = 33 kV ; Subdivision  ","per number\n of spans","","","","","","",""]
[null,null,"> 33 kV & < = 66 kV ; Commercial & Industrial  ","per number\n of spans","","","","","","",""]
[null,null,"> 33 kV & < = 66 kV ; Subdivision  ","per number\n of spans","","","","","","",""]
[null,null,"> 66 kV & < = 132 kV ; Commercial & Industrial  ","per number\n of spans","","","","","","",""]
[null,null,"> 66 kV & < = 132 kV ; Subdivision  ","per number\n of spans","","","","","","",""]
[null,null,"> 132 kV ; Commercial & Industrial  ","per number\n of spans","","","","","","",""]
[null,null,"> 132 kV ; Subdivision  ","per number\n of spans","","","","","","",""]
[null,null,"Other","per number\n of spans"]
[null,"TRANSFORMERS BY: \nMOUNTING TYPE; HIGHEST OPERATING VOLTAGE ; AMPERE RATING; NUMBER OF PHASES (AT LV)","Pole Mounted ; < = 22kV ;  < = 60 kVA ; Single Phase",null,"","","","","","",""]
[null,null,"Pole Mounted ; < = 22kV ;  > 60 kVA and < = 600 kVA ; Single Phase",null,"","","","","","",""]
[null,null,"Pole Mounted ; < = 22kV ;  > 600 kVA ; Single Phase",null,"","","","","","",""]
[null,null,"Pole Mounted ; < = 22kV ;  < = 60 kVA  ; Multiple Phase",null,"","","","","","",""]
[null,null,"Pole Mounted ; < = 22kV ;  > 60 kVA and < = 600 kVA  ; Multiple Phase",null,"","","","","","",""]
[null,null,"Pole Mounted ; < = 22kV ;  > 600 kVA  ; Multiple Phase",null,"","","","","","",""]
[null,null,"Kiosk Mounted ; < = 22kV ;  < = 60 kVA ; Single Phase",null,"","","","","","",""]
[null,null,"Kiosk Mounted ; < = 22kV ;  > 60 kVA and < = 600 kVA ; Single Phase",null,"","","","","","",""]
[null,null,"Kiosk Mounted ; < = 22kV ;  > 600 kVA ; Single Phase",null,"","","","","","",""]
[null,null,"Kiosk Mounted ; < = 22kV ;  < = 60 kVA  ; Multiple Phase",null,"","","","","","",""]
[null,null,"Kiosk Mounted ; < = 22kV ;  > 60 kVA and < = 600 kVA  ; Multiple Phase",null,"","","","","","",""]
[null,null,"Kiosk Mounted ; < = 22kV ;  > 600 kVA  ; Multiple Phase",null,"","","","","","",""]
[null,null,"Ground Outdoor / Indoor Chamber Mounted; ˂ 22 kV ;  < = 60 kVA ; Single Phase",null,"","","","","","",""]
[null,null,"Ground Outdoor / Indoor Chamber Mounted; ˂  22 kV ;  > 60 kVA  and < = 600 kVA ; Single Phase",null,"","","","","","",""]
[null,null,"Ground Outdoor / Indoor Chamber Mounted; ˂  22 kV ;  >  600 kVA ; Single Phase",null,"","","","","","",""]
[null,null,"Ground Outdoor / Indoor Chamber Mounted; ˂  22 kV ;  < = 60 kVA ; Multiple Phase",null,"","","","","","",""]
[null,null,"Ground Outdoor / Indoor Chamber Mounted; ˂  22 kV ;  > 60 kVA  and < = 600 kVA ; Multiple Phase",null,"","","","","","",""]
[null,null,"Ground Outdoor / Indoor Chamber Mounted; ˂  22 kV ;  >  600 kVA ; Multiple Phase",null,"","","","","","",""]
[null,null,"Ground Outdoor / Indoor Chamber Mounted; > = 22 kV & < = 33 kV ;  < = 15 MVA",null,"","","","","","",""]
[null,null,"Ground Outdoor / Indoor Chamber Mounted; > = 22 kV & < = 33 kV ;  > 15 MVA and < = 40 MVA",null,"","","","","","",""]
[null,null,"Ground Outdoor / Indoor Chamber Mounted; > = 22 kV & < = 33 kV ;  > 40 MVA",null,"","","","","","",""]
[null,null,"Ground Outdoor / Indoor Chamber Mounted; > 33 kV & < = 66 kV ;  < = 15 MVA",null,"","","","","","",""]
[null,null,"Ground Outdoor / Indoor Chamber Mounted; > 33 kV & < = 66 kV ;  > 15 MVA and < = 40 MVA",null,"","","","","","",""]
[null,null,"Ground Outdoor / Indoor Chamber Mounted; > 33 kV & < = 66 kV ;  > 40 MVA",null,"","","","","","",""]
[null,null,"Ground Outdoor / Indoor Chamber Mounted; > 66 kV & < = 132 kV ;  < = 100 MVA",null,"","","","","","",""]
[null,null,"Ground Outdoor / Indoor Chamber Mounted; > 66 kV & < = 132 kV ;  > 100 MVA",null,"","","","","","",""]
[null,null,"Ground Outdoor / Indoor Chamber Mounted; > 132 kV ;  < = 100 MVA",null,"","","","","","",""]
[null,null,"Ground Outdoor / Indoor Chamber Mounted; > 132 kV ;  > 100 MVA",null,"","","","","","",""]
[null,null,"Other"]
[null,"SWITCHGEAR BY: \nHIGHEST OPERATING VOLTAGE ; SWITCH FUNCTION","˂ = 11 kV ;  FUSE",null,"","","","","","",""]
[null,null,"˂ = 11 kV  ; Switch",null,"","","","","","",""]
[null,null,"˂ = 11 kV ;  Circuit Breaker",null,"","","","","","",""]
[null,null,"> 11 kV & < = 22 kV  ; Switch",null,"","","","","","",""]
[null,null,"> 11 kV & < = 22 kV  ; Circuit Breaker",null,"","","","","","",""]
[null,null,"> 22 kV & < = 33 kV ; Switch",null,"","","","","","",""]
[null,null,"> 22 kV & < = 33 kV ; Circuit Breaker",null,"","","","","","",""]
[null,null,"> 33 kV & < = 66 kV ; Switch",null,"","","","","","",""]
[null,null,"> 33 kV & < = 66 kV ; Circuit Breaker",null,"","","","","","",""]
[null,null,"> 66 kV & < = 132 kV ; Switch",null,"","","","","","",""]
[null,null,"> 66 kV & < = 132 kV  ; Circuit Breaker",null,"","","","","","",""]
[null,null,"> 132 kV ; Switch",null,"","","","","","",""]
[null,null,"> 132 kV ; Circuit Breaker",null,"","","","","","",""]
[null,null,"Other"]
[null,"PUBLIC LIGHTING BY: \nASSET TYPE ; LIGHTING OBLIGATION","Luminaires ;  Major Road",null,"","","","","","",""]
[null,null,"Luminaires ;  Minor Road",null,"","","","","","",""]
[null,null,"Brackets ; Major Road",null,"","","","","","",""]
[null,null,"Brackets ; Minor Road",null,"","","","","","",""]
[null,null,"Lamps ; Major Road",null,"","","","","","",""]
[null,null,"Lamps ; Minor Road",null,"","","","","","",""]
[null,null,"Poles / Columns ; Major Road",null,"","","","","","",""]
[null,null,"Poles / Columns ; Minor Road",null,"","","","","","",""]
[null,null,"Other"]
[null,"SCADA, NETWORK CONTROL AND PROTECTION SYSTEMS BY: \nFUNCTION","Field Devices",null,"","","","","","",""]
[null,null,"Local Network Wiring Assets",null,"","","","","","",""]
[null,null,"Communications Network Assets",null,"","","","","","",""]
[null,null,"Master Station Assets",null,"","","","","","",""]
[null,null,"Communications Site Infrastructure",null,"","","","","","",""]
[null,null,"Communications Linear Assets",null,"","","","","","",""]
[null,null,"AFLC"]
[null,null,"Other"]
[null,"OTHER BY: \nDNSP DEFINED",null,null,"","","","","","",""]
[null,null,null,null,"","","","","","",""]
[null,null,null,null,"","","","","","",""]
[]
[]
[]
[]
[]
[]
[]
[]
[]
[]
[]
[]
[null,null,null,null,"","","","","","",""]
[]
[]
[null,"ASSET REPLACEMENTS"]
[null,null,null,null,"VOLUMES (0's)"]
[null,"ASSET GROUP","ASSET CATEGORY",null,{"$f":"IF(dms_RPT=\"financial\",dms_CRYf_y1,dms_CRYc_y1)","v":"2008-09"},{"$f":"IF(dms_RPT=\"financial\",dms_CRYf_y2,dms_CRYc_y2)","v":"2009-10"},{"$f":"IF(dms_RPT=\"financial\",dms_CRYf_y3,dms_CRYc_y3)","v":"2010-11"},{"$f":"IF(dms_RPT=\"financial\",dms_CRYf_y4,dms_CRYc_y4)","v":"2011-12"},{"$f":"IF(dms_RPT=\"financial\",dms_CRYf_y5,dms_CRYc_y5)","v":"2012-13"},{"$f":"IF(dms_RPT=\"financial\",dms_CRYf_y6,dms_CRYc_y6)","v":"2013-14"},{"$f":"IF(dms_RPT=\"financial\",dms_CRYf_y7,dms_CRYc_y7)","v":"2014-15"},{"$f":"IF(dms_RPT=\"financial\",dms_CRYf_y8,dms_CRYc_y8)","v":"2015-16"},{"$f":"IF(dms_RPT=\"financial\",dms_CRYf_y9,dms_CRYc_y9)","v":"2016-17"},{"$f":"IF(dms_RPT=\"financial\",dms_CRYf_y10,dms_CRYc_y10)","v":"2017-18"}]
[null,"POLES BY: \nHIGHEST OPERATING VOLTAGE ; MATERIAL TYPE","Staking of a wooden pole"]
[null,null,"˂ = 1 kV; Wood"]
[null,null,"> 1 kV & < = 11 kV; Wood"]
[null,null,"˃ 11 kV & < = 22 kV; Wood"]
[null,null,"> 22 kV & < = 66 kV; Wood"]
[null,null,"> 66 kV & < = 132 kV; Wood"]
[null,null,"> 132 kV; Wood"]
[null,null,"˂ = 1 kV; Concrete"]
[null,null,"> 1 kV & < = 11 kV; Concrete"]
[null,null,"˃ 11 kV & < = 22 kV; Concrete"]
[null,null,"> 22 kV & < = 66 kV; Concrete"]
[null,null,"> 66 kV & < = 132 kV; Concrete"]
[null,null,"> 132 kV; Concrete"]
[null,null,"˂ = 1 kV; Steel"]
[null,null,"> 1 kV & < = 11 kV; Steel"]
[null,null,"˃ 11 kV & < = 22 kV; Steel"]
[null,null,"> 22 kV & < = 66 kV; Steel"]
[null,null,"> 66 kV & < = 132 kV; Steel"]
[null,null,"> 132 kV; Steel",null,"","","","","","",""]
[null,null,"Other"]
[null,"POLE TOP STRUCTURES BY: \nHIGHEST OPERATING VOLTAGE","˂ = 1 kV"]
[null,null,"> 1 kV & < = 11 kV",null,"","","","","","",""]
[null,null,"˃ 11 kV & < = 22 kV",null,"","","","","","",""]
[null,null,"> 22 kV & < = 66 kV",null,"","","","","","",""]
[null,null,"> 66 kV & < = 132 kV",null,"","","","","","",""]
[null,null,"> 132 kV",null,"","","","","","",""]
[null,null,"Other",null,"","","","","","",""]
[null,"STAKING WOODEN POLES BY: \nHIGHEST OPERATING VOLTAGE","˂ = 1 Kv",null,"","","","","","",""]
[null,null,"> 1 kV & < = 11 kV",null,"","","","","","",""]
[null,null,"˃ 11 kV & < = 22 kV",null,"","","","","","",""]
[null,null,"> 22 kV & < = 66 kV",null,"","","","","","",""]
[null,null,"> 66 kV & < = 132 kV",null,"","","","","","",""]
[null,null,"> 132 kV"]
[null,"OVERHEAD CONDUCTORS BY: \nHIGHEST OPERATING VOLTAGE; NUMBER OF PHASES (AT HV)","˂ = 1 kV",null,"","","","","","",""]
[null,null,"> 1 kV & < = 11 kV",null,"","","","","","",""]
[null,null,"˃ 11 kV & < = 22 kV  ; SWER",null,"","","","","","",""]
[null,null,"˃ 11 kV & < = 22 kV ; Single-Phase",null,"","","","","","",""]
[null,null,"˃ 11 kV & < = 22 kV ; Multiple-Phase",null,"","","","","","",""]
[null,null,"> 22 kV & < = 66 kV",null,"","","","","","",""]
[null,null,"> 66 kV & < = 132 kV",null,"","","","","","",""]
[null,null,"> 132 kV",null,"","","","","","",""]
[null,null,"Other"]
[null,"UNDERGROUND CABLES BY: \nHIGHEST OPERATING VOLTAGE","˂ = 1 kV",null,"","","","","","",""]
[null,null,"> 1 kV & < = 11 kV",null,"","","","","","",""]
[null,null,"> 11 kV & < = 22 kV",null,"","","","","","",""]
[null,null,"> 22 kV & < = 33 kV",null,"","","","","","",""]
[null,null,"> 33 kV & < = 66 kV",null,"","","","","","",""]
[null,null,"> 66 kV & < = 132 kV",null,"","","","","","",""]
[null,null,">  132 kV",null,"","","","","","",""]
[null,null,"Other"]
[null,"SERVICE LINES BY: \nCONNECTION VOLTAGE; CUSTOMER TYPE; CONNECTION COMPLEXITY ","˂ = 11 kV ; Residential ; Simple Type",null,"","","","","","",""]
[null,null,"˂ = 11 kV ; Commercial & Industrial ; Simple Type",null,"","","","","","",""]
[null,null,"˂ = 11 kV ; Residential ; Complex Type",null,"","","","","","",""]
[null,null,"˂ = 11 kV ; Commercial & Industrial ; Complex Type",null,"","","","","","",""]
[null,null,"˂ = 11 kV ; Subdivision ; Complex Type",null,"","","","","","",""]
[null,null,"> 11 kV  & < = 22 kV ; Commercial & Industrial  ",null,"","","","","","",""]
[null,null,"> 11 kV  & < = 22 kV ; Subdivision  ",null,"","","","","","",""]
[null,null,"> 22 kV & < = 33 kV ; Commercial & Industrial  ",null,"","","","","","",""]
[null,null,"> 22 kV & < = 33 kV ; Subdivision  ",null,"","","","","","",""]
[null,null,"> 33 kV & < = 66 kV ; Commercial & Industrial  ",null,"","","","","","",""]
[null,null,"> 33 kV & < = 66 kV ; Subdivision  ",null,"","","","","","",""]
[null,null,"> 66 kV & < = 132 kV ; Commercial & Industrial  ",null,"","","","","","",""]
[null,null,"> 66 kV & < = 132 kV ; Subdivision  ",null,"","","","","","",""]
[null,null,"> 132 kV ; Commercial & Industrial  ",null,"","","","","","",""]
[null,null,"> 132 kV ; Subdivision  ",null,"","","","","","",""]
[null,null,"Other"]
[null,"TRANSFORMERS BY: \nMOUNTING TYPE; HIGHEST OPERATING VOLTAGE ; AMPERE RATING; NUMBER OF PHASES (AT LV)","Pole Mounted ; < = 22kV ;  < = 60 kVA ; Single Phase",null,"","","","","","",""]
[null,null,"Pole Mounted ; < = 22kV ;  > 60 kVA and < = 600 kVA ; Single Phase",null,"","","","","","",""]
[null,null,"Pole Mounted ; < = 22kV ;  > 600 kVA ; Single Phase",null,"","","","","","",""]
[null,null,"Pole Mounted ; < = 22kV ;  < = 60 kVA  ; Multiple Phase",null,"","","","","","",""]
[null,null,"Pole Mounted ; < = 22kV ;  > 60 kVA and < = 600 kVA  ; Multiple Phase",null,"","","","","","",""]
[null,null,"Pole Mounted ; < = 22kV ;  > 600 kVA  ; Multiple Phase",null,"","","","","","",""]
[null,null,"Kiosk Mounted ; < = 22kV ;  < = 60 kVA ; Single Phase",null,"","","","","","",""]
[null,null,"Kiosk Mounted ; < = 22kV ;  > 60 kVA and < = 600 kVA ; Single Phase",null,"","","","","","",""]
[null,null,"Kiosk Mounted ; < = 22kV ;  > 600 kVA ; Single Phase",null,"","","","","","",""]
[null,null,"Kiosk Mounted ; < = 22kV ;  < = 60 kVA  ; Multiple Phase",null,"","","","","","",""]
[null,null,"Kiosk Mounted ; < = 22kV ;  > 60 kVA and < = 600 kVA  ; Multiple Phase",null,"","","","","","",""]
[null,null,"Kiosk Mounted ; < = 22kV ;  > 600 kVA  ; Multiple Phase",null,"","","","","","",""]
[null,null,"Ground Outdoor / Indoor Chamber Mounted; ˂ 22 kV ;  < = 60 kVA ; Single Phase",null,"","","","","","",""]
[null,null,"Ground Outdoor / Indoor Chamber Mounted; ˂  22 kV ;  > 60 kVA  and < = 600 kVA ; Single Phase",null,"","","","","","",""]
[null,null,"Ground Outdoor / Indoor Chamber Mounted; ˂  22 kV ;  >  600 kVA ; Single Phase",null,"","","","","","",""]
[null,null,"Ground Outdoor / Indoor Chamber Mounted; ˂  22 kV ;  < = 60 kVA ; Multiple Phase",null,"","","","","","",""]
[null,null,"Ground Outdoor / Indoor Chamber Mounted; ˂  22 kV ;  > 60 kVA  and < = 600 kVA ; Multiple Phase",null,"","","","","","",""]
[null,null,"Ground Outdoor / Indoor Chamber Mounted; ˂  22 kV ;  >  600 kVA ; Multiple Phase",null,"","","","","","",""]
[null,null,"Ground Outdoor / Indoor Chamber Mounted; > = 22 kV & < = 33 kV ;  < = 15 MVA",null,"","","","","","",""]
[null,null,"Ground Outdoor / Indoor Chamber Mounted; > = 22 kV & < = 33 kV ;  > 15 MVA and < = 40 MVA",null,"","","","","","",""]
[null,null,"Ground Outdoor / Indoor Chamber Mounted; > = 22 kV & < = 33 kV ;  > 40 MVA",null,"","","","","","",""]
[null,null,"Ground Outdoor / Indoor Chamber Mounted; > 33 kV & < = 66 kV ;  < = 15 MVA",null,"","","","","","",""]
[null,null,"Ground Outdoor / Indoor Chamber Mounted; > 33 kV & < = 66 kV ;  > 15 MVA and < = 40 MVA",null,"","","","","","",""]
[null,null,"Ground Outdoor / Indoor Chamber Mounted; > 33 kV & < = 66 kV ;  > 40 MVA",null,"","","","","","",""]
[null,null,"Ground Outdoor / Indoor Chamber Mounted; > 66 kV & < = 132 kV ;  < = 100 MVA",null,"","","","","","",""]
[null,null,"Ground Outdoor / Indoor Chamber Mounted; > 66 kV & < = 132 kV ;  > 100 MVA",null,"","","","","","",""]
[null,null,"Ground Outdoor / Indoor Chamber Mounted; > 132 kV ;  < = 100 MVA",null,"","","","","","",""]
[null,null,"Ground Outdoor / Indoor Chamber Mounted; > 132 kV ;  > 100 MVA",null,"","","","","","",""]
[null,null,"Other"]
[null,"SWITCHGEAR BY: \nHIGHEST OPERATING VOLTAGE ; SWITCH FUNCTION","˂ = 11 kV ;  FUSE",null,"","","","","","",""]
[null,null,"˂ = 11 kV  ; Switch",null,"","","","","","",""]
[null,null,"˂ = 11 kV ;  Circuit Breaker",null,"","","","","","",""]
[null,null,"> 11 kV & < = 22 kV  ; Switch",null,"","","","","","",""]
[null,null,"> 11 kV & < = 22 kV  ; Circuit Breaker",null,"","","","","","",""]
[null,null,"> 22 kV & < = 33 kV ; Switch",null,"","","","","","",""]
[null,null,"> 22 kV & < = 33 kV ; Circuit Breaker",null,"","","","","","",""]
[null,null,"> 33 kV & < = 66 kV ; Switch",null,"","","","","","",""]
[null,null,"> 33 kV & < = 66 kV ; Circuit Breaker",null,"","","","","","",""]
[null,null,"> 66 kV & < = 132 kV ; Switch",null,"","","","","","",""]
[null,null,"> 66 kV & < = 132 kV  ; Circuit Breaker",null,"","","","","","",""]
[null,null,"> 132 kV ; Switch",null,"","","","","","",""]
[null,null,"> 132 kV ; Circuit Breaker",null,"","","","","","",""]
[null,null,"Other"]
[null,"PUBLIC LIGHTING BY: \nASSET TYPE ; LIGHTING OBLIGATION","Luminaires ;  Major Road",null,"","","","","","",""]
[null,null,"Luminaires ;  Minor Road",null,"","","","","","",""]
[null,null,"Brackets ; Major Road",null,"","","","","","",""]
[null,null,"Brackets ; Minor Road",null,"","","","","","",""]
[null,null,"Lamps ; Major Road",null,"","","","","","",""]
[null,null,"Lamps ; Minor Road",null,"","","","","","",""]
[null,null,"Poles / Columns ; Major Road",null,"","","","","","",""]
[null,null,"Poles / Columns ; Minor Road",null,"","","","","","",""]
[null,null,"Other"]
[null,"SCADA, NETWORK CONTROL AND PROTECTION SYSTEMS BY: \nFUNCTION","Field Devices",null,"","","","","","",""]
[null,null,"Local Network Wiring Assets",null,"","","","","","",""]
[null,null,"Communications Network Assets",null,"","","","","","",""]
[null,null,"Master Station Assets",null,"","","","","","",""]
[null,null,"Communications Site Infrastructure",null,"","","","","","",""]
[null,null,"Communications Linear Assets",null,"","","","","","",""]
[null,null,"AFLC"]
[null,null,"Other"]
[null,"OTHER BY: \nDNSP DEFINED",{"$f":"IF(ISBLANK(C138),\"\",C138)","v":""},null,"","","","","","",""]
[null,null,"",null,"","","","","","",""]
[null,null,"",null,"","","","","","",""]
[null,null,""]
[null,null,""]
[null,null,""]
[null,null,""]
[null,null,""]
[null,null,""]
[null,null,""]
[null,null,""]
[null,null,""]
[null,null,""]
[null,null,""]
[null,null,""]
[null,null,"",null,"","","","","","",""]
[]
[]
[null,"ASSET FAILURES"]
[null,null,null,null,"VOLUMES (0's)"]
[null,"ASSET GROUP","ASSET CATEGORY",null,{"$f":"IF(dms_RPT=\"financial\",dms_CRYf_y1,dms_CRYc_y1)","v":"2008-09"},{"$f":"IF(dms_RPT=\"financial\",dms_CRYf_y2,dms_CRYc_y2)","v":"2009-10"},{"$f":"IF(dms_RPT=\"financial\",dms_CRYf_y3,dms_CRYc_y3)","v":"2010-11"},{"$f":"IF(dms_RPT=\"financial\",dms_CRYf_y4,dms_CRYc_y4)","v":"2011-12"},{"$f":"IF(dms_RPT=\"financial\",dms_CRYf_y5,dms_CRYc_y5)","v":"2012-13"},{"$f":"IF(dms_RPT=\"financial\",dms_CRYf_y6,dms_CRYc_y6)","v":"2013-14"},{"$f":"IF(dms_RPT=\"financial\",dms_CRYf_y7,dms_CRYc_y7)","v":"2014-15"},{"$f":"IF(dms_RPT=\"financial\",dms_CRYf_y8,dms_CRYc_y8)","v":"2015-16"},{"$f":"IF(dms_RPT=\"financial\",dms_CRYf_y9,dms_CRYc_y9)","v":"2016-17"},{"$f":"IF(dms_RPT=\"financial\",dms_CRYf_y10,dms_CRYc_y10)","v":"2017-18"}]
[null,"POLES BY: \nHIGHEST OPERATING VOLTAGE ; MATERIAL TYPE","Staking of a wooden pole"]
[null,null,"˂ = 1 kV; Wood"]
[null,null,"> 1 kV & < = 11 kV; Wood"]
[null,null,"˃ 11 kV & < = 22 kV; Wood"]
[null,null,"> 22 kV & < = 66 kV; Wood"]
[null,null,"> 66 kV & < = 132 kV; Wood"]
[null,null,"> 132 kV; Wood"]
[null,null,"˂ = 1 kV; Concrete"]
[null,null,"> 1 kV & < = 11 kV; Concrete"]
[null,null,"˃ 11 kV & < = 22 kV; Concrete"]
[null,null,"> 22 kV & < = 66 kV; Concrete"]
[null,null,"> 66 kV & < = 132 kV; Concrete"]
[null,null,"> 132 kV; Concrete"]
[null,null,"˂ = 1 kV; Steel"]
[null,null,"> 1 kV & < = 11 kV; Steel"]
[null,null,"˃ 11 kV & < = 22 kV; Steel"]
[null,null,"> 22 kV & < = 66 kV; Steel"]
[null,null,"> 66 kV & < = 132 kV; Steel"]
[null,null,"> 132 kV; Steel"]
[null,null,"Other"]
[null,"POLE TOP STRUCTURES BY: \nHIGHEST OPERATING VOLTAGE","˂ = 1 kV"]
[null,null,"> 1 kV & < = 11 kV"]
[null,null,"˃ 11 kV & < = 22 kV"]
[null,null,"> 22 kV & < = 66 kV"]
[null,null,"> 66 kV & < = 132 kV"]
[null,null,"> 132 kV"]
[null,null,"Other"]
[null,"STAKING WOODEN POLES BY: \nHIGHEST OPERATING VOLTAGE","˂ = 1 Kv"]
[null,null,"> 1 kV & < = 11 kV"]
[null,null,"˃ 11 kV & < = 22 kV"]
[null,null,"> 22 kV & < = 66 kV"]
[null,null,"> 66 kV & < = 132 kV"]
[null,null,"> 132 kV"]
[null,"OVERHEAD CONDUCTORS BY: \nHIGHEST OPERATING VOLTAGE; NUMBER OF PHASES (AT HV)","˂ = 1 kV"]
[null,null,"> 1 kV & < = 11 kV"]
[null,null,"˃ 11 kV & < = 22 kV  ; SWER"]
[null,null,"˃ 11 kV & < = 22 kV ; Single-Phase"]
[null,null,"˃ 11 kV & < = 22 kV ; Multiple-Phase"]
[null,null,"> 22 kV & < = 66 kV"]
[null,null,"> 66 kV & < = 132 kV"]
[null,null,"> 132 kV"]
[null,null,"Other"]
[null,"UNDERGROUND CABLES BY: \nHIGHEST OPERATING VOLTAGE","˂ = 1 kV"]
[null,null,"> 1 kV & < = 11 kV"]
[null,null,"> 11 kV & < = 22 kV"]
[null,null,"> 22 kV & < = 33 kV",null,"","","","","","",""]
[null,null,"> 33 kV & < = 66 kV",null,"","","","","","",""]
[null,null,"> 66 kV & < = 132 kV",null,"","","","","","",""]
[null,null,">  132 kV",null,"","","","","","",""]
[null,null,"Other"]
[null,"SERVICE LINES BY: \nCONNECTION VOLTAGE; CUSTOMER TYPE; CONNECTION COMPLEXITY ","˂ = 11 kV ; Residential ; Simple Type",null,"","","","","","",""]
[null,null,"˂ = 11 kV ; Commercial & Industrial ; Simple Type",null,"","","","","","",""]
[null,null,"˂ = 11 kV ; Residential ; Complex Type",null,"","","","","","",""]
[null,null,"˂ = 11 kV ; Commercial & Industrial ; Complex Type",null,"","","","","","",""]
[null,null,"˂ = 11 kV ; Subdivision ; Complex Type",null,"","","","","","",""]
[null,null,"> 11 kV  & < = 22 kV ; Commercial & Industrial  ",null,"","","","","","",""]
[null,null,"> 11 kV  & < = 22 kV ; Subdivision  ",null,"","","","","","",""]
[null,null,"> 22 kV & < = 33 kV ; Commercial & Industrial  ",null,"","","","","","",""]
[null,null,"> 22 kV & < = 33 kV ; Subdivision  ",null,"","","","","","",""]
[null,null,"> 33 kV & < = 66 kV ; Commercial & Industrial  ",null,"","","","","","",""]
[null,null,"> 33 kV & < = 66 kV ; Subdivision  ",null,"","","","","","",""]
[null,null,"> 66 kV & < = 132 kV ; Commercial & Industrial  ",null,"","","","","","",""]
[null,null,"> 66 kV & < = 132 kV ; Subdivision  ",null,"","","","","","",""]
[null,null,"> 132 kV ; Commercial & Industrial  ",null,"","","","","","",""]
[null,null,"> 132 kV ; Subdivision  ",null,"","","","","","",""]
[null,null,"Other"]
[null,"TRANSFORMERS BY: \nMOUNTING TYPE; HIGHEST OPERATING VOLTAGE ; AMPERE RATING; NUMBER OF PHASES (AT LV)","Pole Mounted ; < = 22kV ;  < = 60 kVA ; Single Phase",null,"","","","","","",""]
[null,null,"Pole Mounted ; < = 22kV ;  > 60 kVA and < = 600 kVA ; Single Phase",null,"","","","","","",""]
[null,null,"Pole Mounted ; < = 22kV ;  > 600 kVA ; Single Phase",null,"","","","","","",""]
[null,null,"Pole Mounted ; < = 22kV ;  < = 60 kVA  ; Multiple Phase",null,"","","","","","",""]
[null,null,"Pole Mounted ; < = 22kV ;  > 60 kVA and < = 600 kVA  ; Multiple Phase",null,"","","","","","",""]
[null,null,"Pole Mounted ; < = 22kV ;  > 600 kVA  ; Multiple Phase",null,"","","","","","",""]
[null,null,"Kiosk Mounted ; < = 22kV ;  < = 60 kVA ; Single Phase",null,"","","","","","",""]
[null,null,"Kiosk Mounted ; < = 22kV ;  > 60 kVA and < = 600 kVA ; Single Phase",null,"","","","","","",""]
[null,null,"Kiosk Mounted ; < = 22kV ;  > 600 kVA ; Single Phase",null,"","","","","","",""]
[null,null,"Kiosk Mounted ; < = 22kV ;  < = 60 kVA  ; Multiple Phase",null,"","","","","","",""]
[null,null,"Kiosk Mounted ; < = 22kV ;  > 60 kVA and < = 600 kVA  ; Multiple Phase",null,"","","","","","",""]
[null,null,"Kiosk Mounted ; < = 22kV ;  > 600 kVA  ; Multiple Phase",null,"","","","","","",""]
[null,null,"Ground Outdoor / Indoor Chamber Mounted; ˂ 22 kV ;  < = 60 kVA ; Single Phase",null,"","","","","","",""]
[null,null,"Ground Outdoor / Indoor Chamber Mounted; ˂  22 kV ;  > 60 kVA  and < = 600 kVA ; Single Phase",null,"","","","","","",""]
[null,null,"Ground Outdoor / Indoor Chamber Mounted; ˂  22 kV ;  >  600 kVA ; Single Phase",null,"","","","","","",""]
[null,null,"Ground Outdoor / Indoor Chamber Mounted; ˂  22 kV ;  < = 60 kVA ; Multiple Phase",null,"","","","","","",""]
[null,null,"Ground Outdoor / Indoor Chamber Mounted; ˂  22 kV ;  > 60 kVA  and < = 600 kVA ; Multiple Phase",null,"","","","","","",""]
[null,null,"Ground Outdoor / Indoor Chamber Mounted; ˂  22 kV ;  >  600 kVA ; Multiple Phase",null,"","","","","","",""]
[null,null,"Ground Outdoor / Indoor Chamber Mounted; > = 22 kV & < = 33 kV ;  < = 15 MVA",null,"","","","","","",""]
[null,null,"Ground Outdoor / Indoor Chamber Mounted; > = 22 kV & < = 33 kV ;  > 15 MVA and < = 40 MVA",null,"","","","","","",""]
[null,null,"Ground Outdoor / Indoor Chamber Mounted; > = 22 kV & < = 33 kV ;  > 40 MVA",null,"","","","","","",""]
[null,null,"Ground Outdoor / Indoor Chamber Mounted; > 33 kV & < = 66 kV ;  < = 15 MVA",null,"","","","","","",""]
[null,null,"Ground Outdoor / Indoor Chamber Mounted; > 33 kV & < = 66 kV ;  > 15 MVA and < = 40 MVA",null,"","","","","","",""]
[null,null,"Ground Outdoor / Indoor Chamber Mounted; > 33 kV & < = 66 kV ;  > 40 MVA",null,"","","","","","",""]
[null,null,"Ground Outdoor / Indoor Chamber Mounted; > 66 kV & < = 132 kV ;  < = 100 MVA",null,"","","","","","",""]
[null,null,"Ground Outdoor / Indoor Chamber Mounted; > 66 kV & < = 132 kV ;  > 100 MVA",null,"","","","","","",""]
[null,null,"Ground Outdoor / Indoor Chamber Mounted; > 132 kV ;  < = 100 MVA",null,"","","","","","",""]
[null,null,"Ground Outdoor / Indoor Chamber Mounted; > 132 kV ;  > 100 MVA",null,"","","","","","",""]
[null,null,"Other"]
[null,"SWITCHGEAR BY: \nHIGHEST OPERATING VOLTAGE ; SWITCH FUNCTION","˂ = 11 kV ;  FUSE",null,"","","","","","",""]
[null,null,"˂ = 11 kV  ; Switch",null,"","","","","","",""]
[null,null,"˂ = 11 kV ;  Circuit Breaker",null,"","","","","","",""]
[null,null,"> 11 kV & < = 22 kV  ; Switch",null,"","","","","","",""]
[null,null,"> 11 kV & < = 22 kV  ; Circuit Breaker",null,"","","","","","",""]
[null,null,"> 22 kV & < = 33 kV ; Switch",null,"","","","","","",""]
[null,null,"> 22 kV & < = 33 kV ; Circuit Breaker",null,"","","","","","",""]
[null,null,"> 33 kV & < = 66 kV ; Switch",null,"","","","","","",""]
[null,null,"> 33 kV & < = 66 kV ; Circuit Breaker",null,"","","","","","",""]
[null,null,"> 66 kV & < = 132 kV ; Switch",null,"","","","","","",""]
[null,null,"> 66 kV & < = 132 kV  ; Circuit Breaker",null,"","","","","","",""]
[null,null,"> 132 kV ; Switch",null,"","","","","","",""]
[null,null,"> 132 kV ; Circuit Breaker",null,"","","","","","",""]
[null,null,"Other"]
[null,"PUBLIC LIGHTING BY: \nASSET TYPE ; LIGHTING OBLIGATION","Luminaires ;  Major Road",null,"","","","","","",""]
[null,null,"Luminaires ;  Minor Road",null,"","","","","","",""]
[null,null,"Brackets ; Major Road",null,"","","","","","",""]
[null,null,"Brackets ; Minor Road",null,"","","","","","",""]
[null,null,"Lamps ; Major Road",null,"","","","","","",""]
[null,null,"Lamps ; Minor Road",null,"","","","","","",""]
[null,null,"Poles / Columns ; Major Road",null,"","","","","","",""]
[null,null,"Poles / Columns ; Minor Road",null,"","","","","","",""]
[null,null,"Other"]
[null,"SCADA, NETWORK CONTROL AND PROTECTION SYSTEMS BY: \nFUNCTION","Field Devices",null,"","","","","","",""]
[null,null,"Local Network Wiring Assets",null,"","","","","","",""]
[null,null,"Communications Network Assets",null,"","","","","","",""]
[null,null,"Master Station Assets",null,"","","","","","",""]
[null,null,"Communications Site Infrastructure",null,"","","","","","",""]
[null,null,"Communications Linear Assets",null,"","","","","","",""]
[null,null,"AFLC"]
[null,null,"Other"]
[null,"OTHER BY: \nDNSP DEFINED",{"$f":"IF(ISBLANK(C285),\"\",C285)","v":""},null,"","","","","","",""]
[null,null,{"$f":"IF(ISBLANK(C286),\"\",C286)","v":""},null,"","","","","","",""]
[null,null,"",null,"","","","","","",""]
[null,null,"",null,"","","","","","",""]
[null,null,""]
[null,null,""]
[null,null,""]
[null,null,""]
[null,null,""]
[null,null,""]
[null,null,""]
[null,null,""]
[null,null,""]
[null,null,""]
[null,null,""]
[null,null,"",null,"","","","","","",""]
[]
[]
[]
[null,"2.2.2 - SELECTED ASSET CHARACTERISTICS"]
[null,"ASSET REPLACEMENTS"]
[null,null,null,null,"VOLUMES (0's)"]
[null,null,null,null,{"$f":"IF(dms_RPT=\"financial\",dms_CRYf_y1,dms_CRYc_y1)","v":"2008-09"},{"$f":"IF(dms_RPT=\"financial\",dms_CRYf_y2,dms_CRYc_y2)","v":"2009-10"},{"$f":"IF(dms_RPT=\"financial\",dms_CRYf_y3,dms_CRYc_y3)","v":"2010-11"},{"$f":"IF(dms_RPT=\"financial\",dms_CRYf_y4,dms_CRYc_y4)","v":"2011-12"},{"$f":"IF(dms_RPT=\"financial\",dms_CRYf_y5,dms_CRYc_y5)","v":"2012-13"},{"$f":"IF(dms_RPT=\"financial\",dms_CRYf_y6,dms_CRYc_y6)","v":"2013-14"},{"$f":"IF(dms_RPT=\"financial\",dms_CRYf_y7,dms_CRYc_y7)","v":"2014-15"},{"$f":"IF(dms_RPT=\"financial\",dms_CRYf_y8,dms_CRYc_y8)","v":"2015-16"},{"$f":"IF(dms_RPT=\"financial\",dms_CRYf_y9,dms_CRYc_y9)","v":"2016-17"},{"$f":"IF(dms_RPT=\"financial\",dms_CRYf_y10,dms_CRYc_y10)","v":"2017-18"}]
[null,"TOTAL POLES BY: \nFEEDER TYPE","Total CBD poles","Number"]
[null,null,"Total urban poles","Number"]
[null,null,"Total rural long poles","Number"]
[null,null,"Total rural short poles","Number"]
[null,"OVERHEAD CONDUCTORS BY:\nCONDUCTOR LENGTH BY FEEDER TYPE","Conductors CBD (km)","KM"]
[null,null,"Conductors urban (km)","KM"]
[null,null,"Conductors rural long (km)","KM"]
[null,null,"Conductors rural short (km)","KM"]
[null,"OVERHEAD CONDUCTORS BY: \nCONDUCTOR LENGTH MATERIAL TYPE","OH conductor LV ABC","KM"]
[null,null,"OH conductor steel","KM"]
[null,null,"OH conductor ACSR","KM"]
[null,null,"OH conductor AAAC","KM"]
[null,null,"OH conductor AAC","KM"]
[null,null,"OH conductor HDBC","KM"]
[null,null,"Other","KM"]
[null,"UNDERGROUND CABLES BY: \nCABLE LENGTH BY FEEDER TYPE","Cable CBD (km)","KM"]
[null,null,"Cable urban (km)","KM"]
[null,null,"Cable rural long (km)","KM"]
[null,null,"Cable rural short (km)","KM"]
[null,"TRANSFORMERS BY: \nTOTAL MVA","Total MVA replaced","MVA"]
[null,null,"Total MVA disposed of","MVA"]
[]
[null,"ASSETS IN COMMISSION"]
[null,null,null,null,"VOLUMES (0's)"]
[null,null,null,null,{"$f":"IF(dms_RPT=\"financial\",dms_CRYf_y1,dms_CRYc_y1)","v":"2008-09"},{"$f":"IF(dms_RPT=\"financial\",dms_CRYf_y2,dms_CRYc_y2)","v":"2009-10"},{"$f":"IF(dms_RPT=\"financial\",dms_CRYf_y3,dms_CRYc_y3)","v":"2010-11"},{"$f":"IF(dms_RPT=\"financial\",dms_CRYf_y4,dms_CRYc_y4)","v":"2011-12"},{"$f":"IF(dms_RPT=\"financial\",dms_CRYf_y5,dms_CRYc_y5)","v":"2012-13"},{"$f":"IF(dms_RPT=\"financial\",dms_CRYf_y6,dms_CRYc_y6)","v":"2013-14"},{"$f":"IF(dms_RPT=\"financial\",dms_CRYf_y7,dms_CRYc_y7)","v":"2014-15"},{"$f":"IF(dms_RPT=\"financial\",dms_CRYf_y8,dms_CRYc_y8)","v":"2015-16"},{"$f":"IF(dms_RPT=\"financial\",dms_CRYf_y9,dms_CRYc_y9)","v":"2016-17"},{"$f":"IF(dms_RPT=\"financial\",dms_CRYf_y10,dms_CRYc_y10)","v":"2017-18"}]
[null,"TOTAL POLES BY: \nFEEDER TYPE","Total CBD poles","Number"]
[null,null,"Total urban poles","Number"]
[null,null,"Total rural long poles","Number"]
[null,null,"Total rural short poles","Number"]
[null,"OVERHEAD CONDUCTORS BY:\nCONDUCTOR LENGTH BY FEEDER TYPE","Conductors CBD (km)","KM"]
[null,null,"Conductors urban (km)","KM"]
[null,null,"Conductors rural long (km)","KM"]
[null,null,"Conductors rural short (km)","KM"]
[null,"OVERHEAD CONDUCTORS BY: \nCONDUCTOR LENGTH MATERIAL TYPE","OH conductor LV ABC","KM"]
[null,null,"OH conductor steel","KM"]
[null,null,"OH conductor ACSR","KM"]
[null,null,"OH conductor AAAC","KM"]
[null,null,"OH conductor AAC","KM"]
[null,null,"OH conductor HDBC","KM"]
[null,null,"Other","KM"]
[null,"UNDERGROUND CABLES BY: \nCABLE LENGTH BY FEEDER TYPE","Cable CBD (km)","KM"]
[null,null,"Cable urban (km)","KM"]
[null,null,"Cable rural long (km)","KM"]
[null,null,"Cable rural short (km)","KM"]
[null,"TRANSFORMERS BY: \nTOTAL MVA","Total MVA replaced","MVA"]
[null,null,"Total MVA disposed of","MVA"]

{"sheet":"2.2 Repex (Unlocked)","index":7,"n_rows":517,"n_cols":14,"rows_kept":517,"cut":false,"hidden":false,"merged":[[162,4,162,13],[9,4,9,13],[11,1,30,1],[31,1,37,1],[38,1,43,1],[44,1,52,1],[53,1,60,1],[61,1,76,1],[77,1,105,1],[106,1,119,1],[120,1,128,1],[129,1,136,1],[314,4,314,13],[316,1,335,1],[164,1,183,1],[184,1,190,1],[191,1,196,1],[197,1,205,1],[206,1,213,1],[214,1,229,1],[382,1,410,1],[230,1,258,1],[259,1,272,1],[273,1,281,1],[282,1,289,1],[336,1,342,1],[343,1,348,1],[349,1,357,1],[358,1,365,1],[366,1,381,1],[494,4,494,13],[496,1,499,1],[500,1,503,1],[411,1,424,1],[425,1,433,1],[434,1,441,1],[469,4,469,13],[471,1,474,1],[475,1,478,1],[504,1,510,1],[511,1,514,1],[515,1,516,1],[479,1,485,1],[486,1,489,1],[490,1,491,1]]}
[null,"REGULATORY REPORTING STATEMENT"]
[null,{"$f":"INDEX(dms_TradingNameFull_List,MATCH(dms_TradingName,dms_TradingName_List))","v":"SA Power Networks"}]
[null,{"$f":"IF(SUM(dms_SingleYear_Model)>0,(\"CATEGORY ANALYSIS \"&CRY&\" to \"&FRY),(\"CATEGORY ANALYSIS \"&CRY))","v":"CATEGORY ANALYSIS 2008-09 to 2018-19"}]
[null,"2.2 REPEX"]
[]
[null,"There are TWO tables on this worksheet. These tables have been 'grouped' (and sub-grouped) for ease of navigation.  See the Instructions sheet on how to group or ungroup tables. "]
[]
[null,"2.2.1 - REPLACEMENT EXPENDITURE, VOLUMES AND ASSET FAILURES BY ASSET CATEGORY"]
[null,"EXPENDITURE"]
[null,null,null,null,"EXPENDITURE ($0's)"]
[null,"ASSET GROUP","ASSET CATEGORY",null,{"$f":"IF(dms_RPT=\"financial\",dms_CRYf_y1,dms_CRYc_y1)","v":"2008-09"},{"$f":"IF(dms_RPT=\"financial\",dms_CRYf_y2,dms_CRYc_y2)","v":"2009-10"},{"$f":"IF(dms_RPT=\"financial\",dms_CRYf_y3,dms_CRYc_y3)","v":"2010-11"},{"$f":"IF(dms_RPT=\"financial\",dms_CRYf_y4,dms_CRYc_y4)","v":"2011-12"},{"$f":"IF(dms_RPT=\"financial\",dms_CRYf_y5,dms_CRYc_y5)","v":"2012-13"},{"$f":"IF(dms_RPT=\"financial\",dms_CRYf_y6,dms_CRYc_y6)","v":"2013-14"},{"$f":"IF(dms_RPT=\"financial\",dms_CRYf_y7,dms_CRYc_y7)","v":"2014-15"},{"$f":"IF(dms_RPT=\"financial\",dms_CRYf_y8,dms_CRYc_y8)","v":"2015-16"},{"$f":"IF(dms_RPT=\"financial\",dms_CRYf_y9,dms_CRYc_y9)","v":"2016-17"},{"$f":"IF(dms_RPT=\"financial\",dms_CRYf_y10,dms_CRYc_y10)","v":"2017-18"}]
[null,"POLES BY: \nHIGHEST OPERATING VOLTAGE ; MATERIAL TYPE","Staking of a wooden pole",null,0,0,0,0,0,0,0,0,0,0]
[null,null,"˂ = 1 kV; Wood",null,0,0,0,0,0,0,0,0,0,0]
[null,null,"> 1 kV & < = 11 kV; Wood",null,0,0,0,0,0,0,0,0,0,0]
[null,null,"˃ 11 kV & < = 22 kV; Wood",null,0,0,0,0,0,0,0,0,0,0]
[null,null,"> 22 kV & < = 66 kV; Wood",null,0,0,0,0,0,0,0,0,0,0]
[null,null,"> 66 kV & < = 132 kV; Wood",null,0,0,0,0,0,0,0,0,0,0]
[null,null,"> 132 kV; Wood",null,0,0,0,0,0,0,0,0,0,0]
[null,null,"˂ = 1 kV; Concrete",null,0,0,0,0,0,0,0,0,0,0]
[null,null,"> 1 kV & < = 11 kV; Concrete",null,0,0,0,0,0,0,0,0,0,0]
[null,null,"˃ 11 kV & < = 22 kV; Concrete",null,0,0,0,0,0,0,0,0,0,0]
[null,null,"> 22 kV & < = 66 kV; Concrete",null,0,0,0,0,0,0,0,0,0,0]
[null,null,"> 66 kV & < = 132 kV; Concrete",null,0,0,0,0,0,0,0,0,0,0]
[null,null,"> 132 kV; Concrete",null,0,0,0,0,0,0,0,0,0,0]
[null,null,"˂ = 1 kV; Steel",null,0,0,0,0,0,0,0,0,0,0]
[null,null,"> 1 kV & < = 11 kV; Steel",null,0,0,0,0,0,0,0,0,0,0]
[null,null,"˃ 11 kV & < = 22 kV; Steel",null,0,0,0,0,0,0,0,0,0,0]
[null,null,"> 22 kV & < = 66 kV; Steel",null,0,0,0,0,0,0,0,0,0,0]
[null,null,"> 66 kV & < = 132 kV; Steel",null,0,0,0,0,0,0,0,0,0,0]
[null,null,"> 132 kV; Steel",null,0,0,0,0,0,0,0,0,0,0]
[null,null,"Other",null,0,0,0,0,0,0,0,0,0,0]
[null,"POLE TOP STRUCTURES BY: \nHIGHEST OPERATING VOLTAGE","˂ = 1 kV",null,1126355.4934345249,1359745.0735221428,1396804.4778806786,1654654.0601955755,1801497.5285617537,6906474.4294596752,3087465.6105312998,2567482.5016786628,6750082.6234143162,6273970.5599910626]
[null,null,"> 1 kV & < = 11 kV",null,3799902.0241522635,3100937.6634765808,3466881.7456229897,4438716.1691684723,5717380.1969756857,4372092.6658106586,9912894.9294495806,14648836.253363501,7154441.8571619038,11547393.461615754]
[null,null,"˃ 11 kV & < = 22 kV",null,665052.1967789554,880207.82333897345,821159.3734717631,1112487.6010313395,2108145.8457546597,2565067.1033882648,3702562.8984480998,4005431.7011709921,3075153.32186316,2887675.881050427]
[null,null,"> 22 kV & < = 66 kV",null,1769270.7665224415,1441816.3504605156,1293022.2368531418,1538460.7828703555,1534810.3701679755,1010343.223266357,1726821.99351403,2364021.9369591721,2790832.3222848279,3799179.6924586119]
[null,null,"> 66 kV & < = 132 kV",null,0,0,0,0,0,0,0,0,15429.614359154375,3059.8667171627167]
[null,null,"> 132 kV",null,0,0,0,0,0,0,0,0,0,0]
[null,null,"Other",null,0,0,0,0,0,0,0,0,0,0]
[null,"STAKING WOODEN POLES BY: \nHIGHEST OPERATING VOLTAGE","˂ = 1 Kv","for year wooden pole staked",0,0,0,0,0,0,0,0,0,0]
[null,null,"> 1 kV & < = 11 kV","for year wooden pole staked",0,0,0,0,0,0,0,0,0,0]
[null,null,"˃ 11 kV & < = 22 kV","for year wooden pole staked",0,0,0,0,0,0,0,0,0,0]
[null,null,"> 22 kV & < = 66 kV","for year wooden pole staked",0,0,0,0,0,0,0,0,0,0]
[null,null,"> 66 kV & < = 132 kV","for year wooden pole staked",0,0,0,0,0,0,0,0,0,0]
[null,null,"> 132 kV","for year wooden pole staked",0,0,0,0,0,0,0,0,0,0]
[null,"OVERHEAD CONDUCTORS BY: \nHIGHEST OPERATING VOLTAGE; NUMBER OF PHASES (AT HV)","˂ = 1 kV","per km",0,71600,82500,0,64000,95375.48,0,0,0,0]
[null,null,"> 1 kV & < = 11 kV","per km",556300,912970,995900,1836695,2597356,979294.34,699495.07,304941,80684.41,306951.48000000004]
[null,null,"˃ 11 kV & < = 22 kV  ; SWER","per km",47200,0,317000,92000,0,236336.61,24312.26,0,0,52809.68]
[null,null,"˃ 11 kV & < = 22 kV ; Single-Phase","per km",0,0,0,0,0,0,0,0,0,0]
[null,null,"˃ 11 kV & < = 22 kV ; Multiple-Phase","per km",0,0,0,0,0,0,0,0,0,0]
[null,null,"> 22 kV & < = 66 kV","per km",0,11000,265000,0,0,358703.87,92910.93,0,0,1404809.2000000002]
[null,null,"> 66 kV & < = 132 kV","per km",0,0,0,0,0,0,0,0,0,0]
[null,null,"> 132 kV","per km",0,0,0,0,0,0,0,0,0,0]
[null,null,"Other","per km",0,0,0,0,0,0,0,0,0,0]
[null,"UNDERGROUND CABLES BY: \nHIGHEST OPERATING VOLTAGE","˂ = 1 kV","per km",240312,92371,565876,889428,285189,33103,147522.17000000001,17662.349999999999,52361.79,826770.37]
[null,null,"> 1 kV & < = 11 kV","per km",119501,127731,304780,424448,403643,117455,53070.76,304343.90000000002,0,1365318.8]
[null,null,"> 11 kV & < = 22 kV","per km",0,0,0,0,0,0,0,0,0,0]
[null,null,"> 22 kV & < = 33 kV","per km",924.48,7694.35,0,0,0,0,0,0,0,0]
[null,null,"> 33 kV & < = 66 kV","per km",0,0,0,0,0,0,0,0,0,0]
[null,null,"> 66 kV & < = 132 kV","per km",0,0,0,0,0,0,0,0,0,0]
[null,null,">  132 kV","per km",0,0,0,0,0,0,0,0,0,0]
[null,null,"Other","per km",null,null,null,null,null,0,0,0,0,0]
[null,"SERVICE LINES BY: \nCONNECTION VOLTAGE; CUSTOMER TYPE; CONNECTION COMPLEXITY ","˂ = 11 kV ; Residential ; Simple Type","per number of spans",2165698.2522828658,2567265.8926921585,2739799.6894628541,2882046.5909388284,3788825.7669625841,4060537.9568043184,4569986.8272003196,5981657.9344053445,5484412.1911070487,7900886.8512728075]
[null,null,"˂ = 11 kV ; Commercial & Industrial ; Simple Type","per number\n of spans",0,0,0,0,0,0,0,0,0,0]
[null,null,"˂ = 11 kV ; Residential ; Complex Type","per number\n of spans",0,0,0,0,0,0,0,0,0,0]
[null,null,"˂ = 11 kV ; Commercial & Industrial ; Complex Type","per number\n of spans",267670.57050687098,317302.52606307581,338626.92791113921,356208.00562165299,468281.83636616211,502109.53229300701,564829.83257532003,739306.03683661565,677848.69777727558,876414.0020105195]
[null,null,"˂ = 11 kV ; Subdivision ; Complex Type","per number\n of spans",0,0,0,0,0,0,0,0,0,0]
[null,null,"> 11 kV  & < = 22 kV ; Commercial & Industrial  ","per number\n of spans",0,0,0,0,0,0,0,0,0,0]
[null,null,"> 11 kV  & < = 22 kV ; Subdivision  ","per number\n of spans",0,0,0,0,0,0,0,0,0,0]
[null,null,"> 22 kV & < = 33 kV ; Commercial & Industrial  ","per number\n of spans",0,0,0,0,0,0,0,0,0,0]
[null,null,"> 22 kV & < = 33 kV ; Subdivision  ","per number\n of spans",0,0,0,0,0,0,0,0,0,0]
[null,null,"> 33 kV & < = 66 kV ; Commercial & Industrial  ","per number\n of spans",0,0,0,0,0,0,0,0,0,0]
[null,null,"> 33 kV & < = 66 kV ; Subdivision  ","per number\n of spans",0,0,0,0,0,0,0,0,0,0]
[null,null,"> 66 kV & < = 132 kV ; Commercial & Industrial  ","per number\n of spans",0,0,0,0,0,0,0,0,0,0]
[null,null,"> 66 kV & < = 132 kV ; Subdivision  ","per number\n of spans",0,0,0,0,0,0,0,0,0,0]
[null,null,"> 132 kV ; Commercial & Industrial  ","per number\n of spans",0,0,0,0,0,0,0,0,0,0]
[null,null,"> 132 kV ; Subdivision  ","per number\n of spans",0,0,0,0,0,0,0,0,0,0]
[null,null,"Other","per number\n of spans",0,0,0,0,0,0,0,0,0,0]
[null,"TRANSFORMERS BY: \nMOUNTING TYPE; HIGHEST OPERATING VOLTAGE ; AMPERE RATING; NUMBER OF PHASES (AT LV)","Pole Mounted ; < = 22kV ;  < = 60 kVA ; Single Phase",null,1538443.7609645904,1981347.2859293018,1758696.7655510362,1510948.8285333698,2244938.1808048426,2275151.5465042102,2534828.05359367,2728767.6558363326,2688973.8329477613,4876827.590730045]
[null,null,"Pole Mounted ; < = 22kV ;  > 60 kVA and < = 600 kVA ; Single Phase",null,114429.7012287712,157249.78459756364,149966.39086094109,137358.98441212453,171224.09853596255,57844.198190985153,204421.61722529601,505820.34595990565,237043.4514556104,488969.04192013387]
[null,null,"Pole Mounted ; < = 22kV ;  > 600 kVA ; Single Phase",null,0,0,0,0,0,0,0,0,0]
[null,null,"Pole Mounted ; < = 22kV ;  < = 60 kVA  ; Multiple Phase",null,317860.28119103104,345949.52611463994,340832.70650213887,259455.85944512414,418547.79642124177,578429.61675418867,545124.31260079006,226288.04950837884,906828.47978485015,1115956.2798910919]
[null,null,"Pole Mounted ; < = 22kV ;  > 60 kVA and < = 600 kVA  ; Multiple Phase",null,495862.03865800856,770523.94452806178,327199.39824205334,549435.9376484981,684896.39414385019,829083.68719656998,858570.79234624398,252910.17297995283,628777.72018504841,4193057.071371519]
[null,null,"Pole Mounted ; < = 22kV ;  > 600 kVA  ; Multiple Phase",null,0,0,0,0,0,0,40884.323445059199,0,0,0]
[null,null,"Kiosk Mounted ; < = 22kV ;  < = 60 kVA ; Single Phase",null,0,0,0,0,35968.451832654493,0,0,0,0,10670.949134509674]
[null,null,"Kiosk Mounted ; < = 22kV ;  > 60 kVA and < = 600 kVA ; Single Phase",null,33589.222079503175,65687.740839730875,0,27667.871759160884,0,0,0,671363.92617017811,0,0]
[null,null,"Kiosk Mounted ; < = 22kV ;  > 600 kVA ; Single Phase",null,0,0,0,0,0,0,0,261085.97128840262,0,0]
[null,null,"Kiosk Mounted ; < = 22kV ;  < = 60 kVA  ; Multiple Phase",null,18575.188680256982,16658.547899774574,0,0,0,0,0,0,19959.367004876927,155134.08703402395]
[null,null,"Kiosk Mounted ; < = 22kV ;  > 60 kVA and < = 600 kVA  ; Multiple Phase",null,302302.99871552858,525501.926717847,351591.56817451294,332014.46110993071,197960.59802730317,417942.26140557899,530085.070878361,0,653853.1732474732,1502546.02623357]
[null,null,"Kiosk Mounted ; < = 22kV ;  > 600 kVA  ; Multiple Phase",null,16794.611039751588,32843.870419865438,0,0,0,0,0,0,200751.97001040174,833787.74470036372]
[null,null,"Ground Outdoor / Indoor Chamber Mounted; ˂ 22 kV ;  < = 60 kVA ; Single Phase",null,0,0,0,0,0,0,0,0,0,0]
[null,null,"Ground Outdoor / Indoor Chamber Mounted; ˂  22 kV ;  > 60 kVA  and < = 600 kVA ; Single Phase",null,0,0,0,0,0,0,0,0,0,0]
[null,null,"Ground Outdoor / Indoor Chamber Mounted; ˂  22 kV ;  >  600 kVA ; Single Phase",null,0,0,0,0,0,0,0,0,0,0]
[null,null,"Ground Outdoor / Indoor Chamber Mounted; ˂  22 kV ;  < = 60 kVA ; Multiple Phase",null,0,0,29299.297347876072,0,0,0,0,0,0,0]
[null,null,"Ground Outdoor / Indoor Chamber Mounted; ˂  22 kV ;  > 60 kVA  and < = 600 kVA ; Multiple Phase",null,283174.0514619209,61096.887190637506,227999.68312309351,32850.020059277398,131973.73201820211,0,0,0,0,0]
[null,null,"Ground Outdoor / Indoor Chamber Mounted; ˂  22 kV ;  >  600 kVA ; Multiple Phase",null,0,47.431210063684851,83394.120618436893,127955.98492620954,4017.493411146088,0,117829.8692746,0,0,0]
[null,null,"Ground Outdoor / Indoor Chamber Mounted; > = 22 kV & < = 33 kV ;  < = 15 MVA",null,173919.62982451983,1032812.1209151295,1280456.4459424377,642733.78146180557,3008206.5644486011,711837.28120107588,376757.04220764397,1250168.8212375094,790818.94511839701,348396.29590936878]
[null,null,"Ground Outdoor / Indoor Chamber Mounted; > = 22 kV & < = 33 kV ;  > 15 MVA and < = 40 MVA",null,0,0,0,0,0,0,0,0,0,0]
[null,null,"Ground Outdoor / Indoor Chamber Mounted; > = 22 kV & < = 33 kV ;  > 40 MVA",null,0,0,0,0,0,0,0,0,0,0]
[null,null,"Ground Outdoor / Indoor Chamber Mounted; > 33 kV & < = 66 kV ;  < = 15 MVA",null,593891.21347696835,1325161.5731260038,2953898.7888909625,198452.29234521347,55300.162405759205,758354.99680485658,0,2686.469734958428,0,228599.26172055316]
[null,null,"Ground Outdoor / Indoor Chamber Mounted; > 33 kV & < = 66 kV ;  > 15 MVA and < = 40 MVA",null,380767.92589048709,43186.239354803241,3756260.0040040333,714709.69775648124,1276724.5335368891,1100498.8539969386,0,0,0,267931.71743671532]
[null,null,"Ground Outdoor / Indoor Chamber Mounted; > 33 kV & < = 66 kV ;  > 40 MVA",null,0,0,0,0,0,0,0,0,0,0]
[null,null,"Ground Outdoor / Indoor Chamber Mounted; > 66 kV & < = 132 kV ;  < = 100 MVA",null,0,0,0,0,0,0,0,0,0,0]
[null,null,"Ground Outdoor / Indoor Chamber Mounted; > 66 kV & < = 132 kV ;  > 100 MVA",null,0,0,0,0,0,0,0,0,0,0]
[null,null,"Ground Outdoor / Indoor Chamber Mounted; > 132 kV ;  < = 100 MVA",null,0,0,0,0,0,0,0,0,0,0]
[null,null,"Ground Outdoor / Indoor Chamber Mounted; > 132 kV ;  > 100 MVA",null,0,0,0,0,0,0,0,0,0,0]
[null,null,"Other",null,0,0,0,0,0,0,0,0,0,0]
[null,"SWITCHGEAR BY: \nHIGHEST OPERATING VOLTAGE ; SWITCH FUNCTION","˂ = 11 kV ;  FUSE",null,0,0,0,0,0,0,0,0,0,0]
[null,null,"˂ = 11 kV  ; Switch",null,583471.0997000701,618455.48579103744,978129.97148206073,2611655.8565666089,2532737.5186312012,231823.10654678554,0,162190.66526350804,193263.66183300386,100474.12069930283]
[null,null,"˂ = 11 kV ;  Circuit Breaker",null,139158.04632176351,280104.65632379963,2050461.1243435293,9691397.1497109551,4691579.4465505695,181353.60393452126,0,1595380.5703951959,5975486.3814337878,12220623.730345415]
[null,null,"> 11 kV & < = 22 kV  ; Switch",null,0,0,0,0,0,0,0,0,0,0]
[null,null,"> 11 kV & < = 22 kV  ; Circuit Breaker",null,0,0,0,0,0,0,0,0,0,0]
[null,null,"> 22 kV & < = 33 kV ; Switch",null,366458.08446141426,389146.31785449706,557547.8479955236,668746.93940420495,768508.31073448423,686318.43362623453,790597.70505125995,213828.2894481532,0,68853.117981586547]
[null,null,"> 22 kV & < = 33 kV ; Circuit Breaker",null,381378.0539812799,597379.50250540057,998963.62270859338,941093.17472137336,1058596.0468423257,1560623.7205087058,1529891.3434094801,453676.02740923176,289728.35079833964,3039771.0207751552]
[null,null,"> 33 kV & < = 66 kV ; Switch",null,302006.72164049925,421711.65268073999,682734.55773198255,596903.84335411421,293441.91534715804,1333000.0650098438,133345.97480904899,320855.35315847857,337169.18587280257,92066.19874296528]
[null,null,"> 33 kV & < = 66 kV ; Circuit Breaker",null,976930.69446779566,1896179.4020075898,1585049.6842581471,3650937.3901557606,2537692.1834723265,5333507.125251377,761055.57445618499,1263687.8598965125,115984.66857367862,1028902.2290204855]
[null,null,"> 66 kV & < = 132 kV ; Switch",null,0,0,0,0,0,0,0,0,0,0]
[null,null,"> 66 kV & < = 132 kV  ; Circuit Breaker",null,0,0,0,0,0,0,0,0,0,0]
[null,null,"> 132 kV ; Switch",null,0,0,0,0,0,0,0,0,0,0]
[null,null,"> 132 kV ; Circuit Breaker",null,0,0,0,0,0,0,0,0,0,0]
[null,null,"Other",null,0,0,0,0,0,0,0,0,0,0]
[null,"PUBLIC LIGHTING BY: \nASSET TYPE ; LIGHTING OBLIGATION","Luminaires ;  Major Road",null,0,0,0,0,0,0,0,0,0,0]
[null,null,"Luminaires ;  Minor Road",null,0,0,0,0,0,0,0,0,0,0]
[null,null,"Brackets ; Major Road",null,0,0,0,0,0,0,0,0,0,0]
[null,null,"Brackets ; Minor Road",null,0,0,0,0,0,0,0,0,0,0]
[null,null,"Lamps ; Major Road",null,0,0,0,0,0,0,0,0,0,0]
[null,null,"Lamps ; Minor Road",null,0,0,0,0,0,0,0,0,0,0]
[null,null,"Poles / Columns ; Major Road",null,0,0,0,0,0,0,0,0,0,0]
[null,null,"Poles / Columns ; Minor Road",null,0,0,0,0,0,0,0,0,0,0]
[null,null,"Other",null,0,0,0,0,0,0,0,0,0,0]
[null,"SCADA, NETWORK CONTROL AND PROTECTION SYSTEMS BY: \nFUNCTION","Field Devices",null,212401.29405471837,887603.56214390579,1519974.3551560603,3032438.8932622131,2425434.6236826563,2068001.2249520605,1671716.5574761,987588.46748934803,3472721.5096337874,5794116.9543239949]
[null,null,"Local Network Wiring Assets",null,0,0,0,0,0,0,0,0,0,0]
[null,null,"Communications Network Assets",null,636432.42756378907,1430030.4477348174,2275416.1506607207,3486710.2832062473,1339438.0789032537,2113878.9598148749,1809293.96648881,903265.19246851024,3425504.8764945231,4355466.2464884622]
[null,null,"Master Station Assets",null,0,0,0,0,0,0,0,0,0,0]
[null,null,"Communications Site Infrastructure",null,0,0,0,0,0,0,635145.47894767602,7143.2707063005046,7187.5379123650655,0]
[null,null,"Communications Linear Assets",null,0,0,0,0,0,0,1952444.5464981201,535704.46934934822,263269.05991800188,659791.72172972269]
[null,null,"AFLC",null,0,0,0,0,0,0,0,0,0,0]
[null,null,"Other",null,0,368148.83067011234,486181.77115838876,873038.18051506276,797444.47185957874,394363.44035256002,1340367.35729285,0,0,0]
[null,"OTHER BY: \nDNSP DEFINED","˂ ≈ 11 kV ; STOBIE Pole",null,3258495.2969415369,2804297.822715132,3735258.1664696331,7160128.5424590567,17733919.513547957,14091854.378957205,16859774.607409801,14366882.175086735,15547326.099617574,15033292]
[null,null,"> 11 kV & <≈ 33 kV ; STOBIE Pole",null,590847.66911658621,733113.68423559284,884898.69389603799,966459.92690207553,1382149.6500517377,1209906.6891023864,2139057.31269091,1792843.0934243135,2376845.0884873085,3173474.0755651109]
[null,null,"> 33 kV & <≈ 66 kV ; STOBIE Pole",null,47070.110432387548,64835.564269378156,99207.526945855745,5097.1634342723655,216750.82987485413,154009.33747494212,45912.260062312002,145260.6381322727,1449265.5846122198,841103.09392683441]
[null,null,"Pole REFURBISHED; STOBIE Pole",null,673661.13311488903,454689.97954191937,229423.46849734074,1274345.8508632944,2742413.8146505174,2247136.2422480192,3937261.5684449398,2606543.3983575548,4965358.1458824445,9470902.9858348873]
[null,null,"POLE MOUNTED ; > 22 kV ;  < ≈ 60 kVA ",null,25428.822495282486,47174.935379269082,109066.46608068443,45786.328137374847,57074.699511987521,70885.247877079557,80500.017965466104,39933.185207360977,94108.197487166442,29760.525586941807]
[null,null,"POLE MOUNTED ; > 22 kV ;  > 60 kVA and < ≈ 600 kVA ",null,12714.411247641243,0,13633.308260085554,15262.10937912495,114149.39902397504,17721.311969269889,80500.017965466104,53244.246943147962,205045.99437047535,517288.55153262685]
[null,null,"KIOSK MOUNTED TRANSFORMER; > 22 kV ;  > 60 kVA and < ≈ 600 kVA ",null,0,0,0,0,0,0,0,0,12700,0]
[null,null,"OTHER - Non Category Substation asset replacement/refurbishment",null,3255392.98738334,2923161.3685749648,6887169.9999393383,6276110.0209010439,7617819.7490985012,7344825.9975898145,7883758.4026731104,5682097.8775716396,5349667.8736578654,8370326.7806621064]
[null,null,"Recloser ;SWITCHGEAR",null,795503.91100785672,1110916.1488898068,1071289.2690022467,987489.25507594796,1662360.727945247,1194455.261701846,3268340.8717079102,1865934.5664619624,1304554.0859533544,5085627.7648749333]
[null,null,"Sectionalizer ;SWITCHGEAR",null,91497.120804075283,144699.71553725022,93506.760806892096,129489.06079443834,90389.87072549756,79554.58450916197,29350.391092224501,31183.795518472125,78491.926870018506,0]
[null,null,">= 11 kV & < ≈ 22 kV  ; LOAD BREAK SWITCH; GROUND LEVEL (Switching Cubical);SWITCHGEAR",null,0,0,0,0,0,502284.91670956032,3367933.09641437,2159010.4816897814,3073540.8303051605,3791049.5975286891]
[null,null,"> 22 kV & < ≈ 33 kV  ; LOAD BREAK SWITCH; GROUND LEVEL (Switching Cubical);SWITCHGEAR",null,0,0,0,0,0,0,0,0,0,0]
[null,null,"˂ = 11 kV ;  Circuit Breaker REFURBISHED",null,0,0,0,0,0,0,0,708433.40944409778,1010842.4563113519,1305674.1711784685]
[null,null,"> 22 kV & < = 33 kV ; Circuit Breaker REFURBISHED",null,0,0,0,0,0,0,0,472420.85573491856,125839.99038143017,48472.807170462096]
[null,null,"> 33 kV & < = 66 kV ; Circuit Breaker REFURBISHED",null,0,0,0,0,0,0,0,39795.287562192607,10052.864829755985,8919.679037076603]
[null,null,"Ground Outdoor / Indoor Chamber Mounted; > 33 kV & < = 66 kV ;  > 15 MVA and < = 40 MVA REFURBISHED",null,0,0,0,0,0,0,0,0,265158.55319369456,433087.70293986815]
[null,null,"Ground Outdoor / Indoor Chamber Mounted; > = 22 kV & < = 33 kV ;  < = 15 MVA REFURBISHED",null,0,0,0,0,0,0,0,76470.394590195108,96030.178748322709,311962]
[null,null,"Ground Outdoor / Indoor Chamber Mounted; > 33 kV & < = 66 kV ;  < = 15 MVA REFURBISHED",null,0,0,0,0,0,0,0,64894.437848957765,25883.795223973997,39186.995386243914]
[null,null,"Ground Outdoor / Indoor Chamber Mounted; ˂  22 kV ;  >  600 kVA ; Multiple Phase ; REFURBISHED",null,0,0,0,0,0,0,0,342504.44328770816,12440.146787941945,1947]
[null,null,"Pipework Bus Substation Replacements",null,0,0,0,0,0,0,0,1142979,972805,2433160]
[]
[null,null,null,null,"","","","","","",""]
[]
[]
[null,"ASSET REPLACEMENTS"]
[null,null,null,null,"VOLUMES (0's)"]
[null,"ASSET GROUP","ASSET CATEGORY",null,{"$f":"IF(dms_RPT=\"financial\",dms_CRYf_y1,dms_CRYc_y1)","v":"2008-09"},{"$f":"IF(dms_RPT=\"financial\",dms_CRYf_y2,dms_CRYc_y2)","v":"2009-10"},{"$f":"IF(dms_RPT=\"financial\",dms_CRYf_y3,dms_CRYc_y3)","v":"2010-11"},{"$f":"IF(dms_RPT=\"financial\",dms_CRYf_y4,dms_CRYc_y4)","v":"2011-12"},{"$f":"IF(dms_RPT=\"financial\",dms_CRYf_y5,dms_CRYc_y5)","v":"2012-13"},{"$f":"IF(dms_RPT=\"financial\",dms_CRYf_y6,dms_CRYc_y6)","v":"2013-14"},{"$f":"IF(dms_RPT=\"financial\",dms_CRYf_y7,dms_CRYc_y7)","v":"2014-15"},{"$f":"IF(dms_RPT=\"financial\",dms_CRYf_y8,dms_CRYc_y8)","v":"2015-16"},{"$f":"IF(dms_RPT=\"financial\",dms_CRYf_y9,dms_CRYc_y9)","v":"2016-17"},{"$f":"IF(dms_RPT=\"financial\",dms_CRYf_y10,dms_CRYc_y10)","v":"2017-18"}]
[null,"POLES BY: \nHIGHEST OPERATING VOLTAGE ; MATERIAL TYPE","Staking of a wooden pole",null,0,0,0,0,0,0,0,0,0,0]
[null,null,"˂ = 1 kV; Wood",null,0,0,0,0,0,0,0,0,0,0]
[null,null,"> 1 kV & < = 11 kV; Wood",null,0,0,0,0,0,0,0,0,0,0]
[null,null,"˃ 11 kV & < = 22 kV; Wood",null,0,0,0,0,0,0,0,0,0,0]
[null,null,"> 22 kV & < = 66 kV; Wood",null,0,0,0,0,0,0,0,0,0,0]
[null,null,"> 66 kV & < = 132 kV; Wood",null,0,0,0,0,0,0,0,0,0,0]
[null,null,"> 132 kV; Wood",null,0,0,0,0,0,0,0,0,0,0]
[null,null,"˂ = 1 kV; Concrete",null,0,0,0,0,0,0,0,0,0,0]
[null,null,"> 1 kV & < = 11 kV; Concrete",null,0,0,0,0,0,0,0,0,0,0]
[null,null,"˃ 11 kV & < = 22 kV; Concrete",null,0,0,0,0,0,0,0,0,0,0]
[null,null,"> 22 kV & < = 66 kV; Concrete",null,0,0,0,0,0,0,0,0,0,0]
[null,null,"> 66 kV & < = 132 kV; Concrete",null,0,0,0,0,0,0,0,0,0,0]
[null,null,"> 132 kV; Concrete",null,0,0,0,0,0,0,0,0,0,0]
[null,null,"˂ = 1 kV; Steel",null,0,0,0,0,0,0,0,0,0,0]
[null,null,"> 1 kV & < = 11 kV; Steel",null,0,0,0,0,0,0,0,0,0,0]
[null,null,"˃ 11 kV & < = 22 kV; Steel",null,0,0,0,0,0,0,0,0,0,0]
[null,null,"> 22 kV & < = 66 kV; Steel",null,0,0,0,0,0,0,0,0,0,0]
[null,null,"> 66 kV & < = 132 kV; Steel",null,0,0,0,0,0,0,0,0,0,0]
[null,null,"> 132 kV; Steel",null,0,0,0,0,0,0,0,0,0,0]
[null,null,"Other",null,0,0,0,0,0,0,0,0,0,0]
[null,"POLE TOP STRUCTURES BY: \nHIGHEST OPERATING VOLTAGE","˂ = 1 kV",null,2469,3081,3040,3247,2665,3295,3117,3069,7860,7510]
[null,null,"> 1 kV & < = 11 kV",null,1789,1472,1786,2637,3110,2805,5282,9453,3087,6216]
[null,null,"˃ 11 kV & < = 22 kV",null,460,486,555,727,1303,1476,1607,1540,1275,1320]
[null,null,"> 22 kV & < = 66 kV",null,477,536,364,393,304,219,410,504,485,806]
[null,null,"> 66 kV & < = 132 kV",null,0,0,0,0,0,0,0,0,4,1]
[null,null,"> 132 kV",null,0,0,0,0,0,0,0,0,0,0]
[null,null,"Other",null,0,0,0,0,0,0,0,0,0,0]
[null,"STAKING WOODEN POLES BY: \nHIGHEST OPERATING VOLTAGE","˂ = 1 Kv",null,0,0,0,0,0,0,0,0,0,0]
[null,null,"> 1 kV & < = 11 kV",null,0,0,0,0,0,0,0,0,0,0]
[null,null,"˃ 11 kV & < = 22 kV",null,0,0,0,0,0,0,0,0,0,0]
[null,null,"> 22 kV & < = 66 kV",null,0,0,0,0,0,0,0,0,0,0]
[null,null,"> 66 kV & < = 132 kV",null,0,0,0,0,0,0,0,0,0,0]
[null,null,"> 132 kV",null,0,0,0,0,0,0,0,0,0,0]
[null,"OVERHEAD CONDUCTORS BY: \nHIGHEST OPERATING VOLTAGE; NUMBER OF PHASES (AT HV)","˂ = 1 kV",null,0,4.8000000000000007,2.6399999999999997,0,0.48,4.3499999999999996,0,0,0,0]
[null,null,"> 1 kV & < = 11 kV",null,28.200000000000003,78.55,68.3,89.203000000000003,120.50999999999999,54.44,64.825000000000003,8.4600000000000009,7.5,25.900000000000002]
[null,null,"˃ 11 kV & < = 22 kV  ; SWER",null,7.2,0,28,5.8000000000000007,0,12.4,26,0,0,5.8]
[null,null,"˃ 11 kV & < = 22 kV ; Single-Phase",null,0,0,0,0,0,0,0,0,0,0]
[null,null,"˃ 11 kV & < = 22 kV ; Multiple-Phase",null,0,0,0,0,0,0,0,0,0,0]
[null,null,"> 22 kV & < = 66 kV",null,0,0.5,20.100000000000001,0,0,14.85,12,0,0,9.9]
[null,null,"> 66 kV & < = 132 kV",null,0,0,0,0,0,0,0,0,0,0]
[null,null,"> 132 kV",null,0,0,0,0,0,0,0,0,0,0]
[null,null,"Other",null,0,0,0,0,0,0,0,0,0,0]
[null,"UNDERGROUND CABLES BY: \nHIGHEST OPERATING VOLTAGE","˂ = 1 kV",null,1.06,0.65,1.5649999999999999,2.34,0.62,0.32,0.26,1.45,0.21000000000000002,1.2650000000000001]
[null,null,"> 1 kV & < = 11 kV",null,0.04,0.39,1.06,1.42,0.63,0.6,0.14000000000000001,0.10100000000000001,0,2.0710000000000002]
[null,null,"> 11 kV & < = 22 kV",null,0,0,0,0,0,0,0,0,0,0]
[null,null,"> 22 kV & < = 33 kV",null,0,0.1,0,0,0,0,0,0,0,0]
[null,null,"> 33 kV & < = 66 kV",null,0,0,0,0,0,0,0,0,0,0]
[null,null,"> 66 kV & < = 132 kV",null,0,0,0,0,0,0,0,0,0,0]
[null,null,">  132 kV",null,0,0,0,0,0,0,0,0,0,0]
[null,null,"Other",null,0,0,0,0,0,0,0,0,0,0]
[null,"SERVICE LINES BY: \nCONNECTION VOLTAGE; CUSTOMER TYPE; CONNECTION COMPLEXITY ","˂ = 11 kV ; Residential ; Simple Type",null,6129,6920,7370,6930,7195,7292,8196,10820,10940.87,16209]
[null,null,"˂ = 11 kV ; Commercial & Industrial ; Simple Type",null,0,0,0,0,0,0,0,0,0,0]
[null,null,"˂ = 11 kV ; Residential ; Complex Type",null,0,0,0,0,0,0,0,0,0,0]
[null,null,"˂ = 11 kV ; Commercial & Industrial ; Complex Type",null,677,769,820,769,803,818,906,1202,1352.13,1798]
[null,null,"˂ = 11 kV ; Subdivision ; Complex Type",null,0,0,0,0,0,0,0,0,0,0]
[null,null,"> 11 kV  & < = 22 kV ; Commercial & Industrial  ",null,0,0,0,0,0,0,0,0,0,0]
[null,null,"> 11 kV  & < = 22 kV ; Subdivision  ",null,0,0,0,0,0,0,0,0,0,0]
[null,null,"> 22 kV & < = 33 kV ; Commercial & Industrial  ",null,0,0,0,0,0,0,0,0,0,0]
[null,null,"> 22 kV & < = 33 kV ; Subdivision  ",null,0,0,0,0,0,0,0,0,0,0]
[null,null,"> 33 kV & < = 66 kV ; Commercial & Industrial  ",null,0,0,0,0,0,0,0,0,0,0]
[null,null,"> 33 kV & < = 66 kV ; Subdivision  ",null,0,0,0,0,0,0,0,0,0,0]
[null,null,"> 66 kV & < = 132 kV ; Commercial & Industrial  ",null,0,0,0,0,0,0,0,0,0,0]
[null,null,"> 66 kV & < = 132 kV ; Subdivision  ",null,0,0,0,0,0,0,0,0,0,0]
[null,null,"> 132 kV ; Commercial & Industrial  ",null,0,0,0,0,0,0,0,0,0,0]
[null,null,"> 132 kV ; Subdivision  ",null,0,0,0,0,0,0,0,0,0,0]
[null,null,"Other",null,0,0,0,0,0,0,0,0,0,0]
[null,"TRANSFORMERS BY: \nMOUNTING TYPE; HIGHEST OPERATING VOLTAGE ; AMPERE RATING; NUMBER OF PHASES (AT LV)","Pole Mounted ; < = 22kV ;  < = 60 kVA ; Single Phase",null,189.90975103734439,197.75726141078837,202.46576763485479,155.38070539419087,185.20124481327801,191.52763819095478,186,205,174,302]
[null,null,"Pole Mounted ; < = 22kV ;  > 60 kVA and < = 600 kVA ; Single Phase",null,14.125518672199171,15.695020746887964,17.264522821576762,14.125518672199171,14.125518672199171,4.8693467336683414,15,38,8,14]
[null,null,"Pole Mounted ; < = 22kV ;  > 600 kVA ; Single Phase",null,0,0,0,0,0,0,0,0,0,0]
[null,null,"Pole Mounted ; < = 22kV ;  < = 60 kVA  ; Multiple Phase",null,39.237551867219921,34.529045643153523,39.237551867219921,26.681535269709542,34.529045643153523,48.693467336683412,40,17,60,60]
[null,null,"Pole Mounted ; < = 22kV ;  > 60 kVA and < = 600 kVA  ; Multiple Phase",null,61.210580912863072,76.905601659751042,37.668049792531122,56.502074688796682,56.502074688796682,69.793969849246224,63,19,46,241]
[null,null,"Pole Mounted ; < = 22kV ;  > 600 kVA  ; Multiple Phase",null,null,null,null,null,null,0,3,0,0,0]
[null,null,"Kiosk Mounted ; < = 22kV ;  < = 60 kVA ; Single Phase",null,0,0,0,0,1,0,0,0,0,1]
[null,null,"Kiosk Mounted ; < = 22kV ;  > 60 kVA and < = 600 kVA ; Single Phase",null,4.1500000000000004,4.1500000000000004,0,2.0750000000000002,0,0,0,18,0,0]
[null,null,"Kiosk Mounted ; < = 22kV ;  > 600 kVA ; Single Phase",null,0,0,0,0,0,0,0,7,0,0]
[null,null,"Kiosk Mounted ; < = 22kV ;  < = 60 kVA  ; Multiple Phase",null,1,1,0,0,0,0,0,0,2,2]
[null,null,"Kiosk Mounted ; < = 22kV ;  > 60 kVA and < = 600 kVA  ; Multiple Phase",null,37.35,33.200000000000003,24.9,24.9,12.45,28,28,0,23,60]
[null,null,"Kiosk Mounted ; < = 22kV ;  > 600 kVA  ; Multiple Phase",null,2.0750000000000002,2.0750000000000002,0,0,0,0,0,0,6,15]
[null,null,"Ground Outdoor / Indoor Chamber Mounted; ˂ 22 kV ;  < = 60 kVA ; Single Phase",null,0,0,2.0750000000000002,0,0,0,0,0,0,0]
[null,null,"Ground Outdoor / Indoor Chamber Mounted; ˂  22 kV ;  > 60 kVA  and < = 600 kVA ; Single Phase",null,3.0750000000000002,1,5.15,2.0750000000000002,8.3000000000000007,0,0,0,0,0]
[null,null,"Ground Outdoor / Indoor Chamber Mounted; ˂  22 kV ;  >  600 kVA ; Single Phase",null,0,0,2,0,0,0,0,0,0,0]
[null,null,"Ground Outdoor / Indoor Chamber Mounted; ˂  22 kV ;  < = 60 kVA ; Multiple Phase",null,4,2,2,8,5,0,0,0,0,0]
[null,null,"Ground Outdoor / Indoor Chamber Mounted; ˂  22 kV ;  > 60 kVA  and < = 600 kVA ; Multiple Phase",null,0,0,0,0,0,0,0,0,0,0]
[null,null,"Ground Outdoor / Indoor Chamber Mounted; ˂  22 kV ;  >  600 kVA ; Multiple Phase",null,0,0,0,0,0,0,1,0,0,1]
[null,null,"Ground Outdoor / Indoor Chamber Mounted; > = 22 kV & < = 33 kV ;  < = 15 MVA",null,1,2,2,1,0,1,5,3,5,3]
[null,null,"Ground Outdoor / Indoor Chamber Mounted; > = 22 kV & < = 33 kV ;  > 15 MVA and < = 40 MVA",null,1,0,1,0,2,0,0,0,0,0]
[null,null,"Ground Outdoor / Indoor Chamber Mounted; > = 22 kV & < = 33 kV ;  > 40 MVA",null,0,0,0,0,0,0,0,0,0,0]
[null,null,"Ground Outdoor / Indoor Chamber Mounted; > 33 kV & < = 66 kV ;  < = 15 MVA",null,0,0,0,0,0,1,0,0,0,1]
[null,null,"Ground Outdoor / Indoor Chamber Mounted; > 33 kV & < = 66 kV ;  > 15 MVA and < = 40 MVA",null,0,0,0,0,0,0,0,0,0,2]
[null,null,"Ground Outdoor / Indoor Chamber Mounted; > 33 kV & < = 66 kV ;  > 40 MVA",null,0,0,0,0,0,0,0,0,0,0]
[null,null,"Ground Outdoor / Indoor Chamber Mounted; > 66 kV & < = 132 kV ;  < = 100 MVA",null,0,0,0,0,0,0,0,0,0,0]
[null,null,"Ground Outdoor / Indoor Chamber Mounted; > 66 kV & < = 132 kV ;  > 100 MVA",null,0,0,0,0,0,0,0,0,0,0]
[null,null,"Ground Outdoor / Indoor Chamber Mounted; > 132 kV ;  < = 100 MVA",null,0,0,0,0,0,0,0,0,0,0]
[null,null,"Ground Outdoor / Indoor Chamber Mounted; > 132 kV ;  > 100 MVA",null,0,0,0,0,0,0,0,0,0,0]
[null,null,"Other",null,0,0,0,0,0,0,0,0,0,0]
[null,"SWITCHGEAR BY: \nHIGHEST OPERATING VOLTAGE ; SWITCH FUNCTION","˂ = 11 kV ;  FUSE",null,0,0,0,0,0,0,0,0,0,0]
[null,null,"˂ = 11 kV  ; Switch",null,17,18,25,49,45,9,0,5,0,2]
[null,null,"˂ = 11 kV ;  Circuit Breaker",null,1,2,1,20,18,2,0,1,15,29]
[null,null,"> 11 kV & < = 22 kV  ; Switch",null,0,0,0,0,0,0,0,0,0,0]
[null,null,"> 11 kV & < = 22 kV  ; Circuit Breaker",null,0,0,0,0,0,0,0,0,0,0]
[null,null,"> 22 kV & < = 33 kV ; Switch",null,2,14,6,20,8,13,8,5,0,1]
[null,null,"> 22 kV & < = 33 kV ; Circuit Breaker",null,1,8,4,6,5,4,2,2,2,3]
[null,null,"> 33 kV & < = 66 kV ; Switch",null,2,6,9,6,17,17,3,2,6,5]
[null,null,"> 33 kV & < = 66 kV ; Circuit Breaker",null,7,7,6,7,5,12,3,6,2,1]
[null,null,"> 66 kV & < = 132 kV ; Switch",null,0,0,0,0,0,0,0,0,0,0]
[null,null,"> 66 kV & < = 132 kV  ; Circuit Breaker",null,0,0,0,0,0,0,0,0,0,0]
[null,null,"> 132 kV ; Switch",null,0,0,0,0,0,0,0,0,0,0]
[null,null,"> 132 kV ; Circuit Breaker",null,0,0,0,0,0,0,0,0,0,0]
[null,null,"Other",null,0,0,0,0,0,0,0,0,0,0]
[null,"PUBLIC LIGHTING BY: \nASSET TYPE ; LIGHTING OBLIGATION","Luminaires ;  Major Road",null,0,0,0,0,0,0,0,0,0,0]
[null,null,"Luminaires ;  Minor Road",null,0,0,0,0,0,0,0,0,0,0]
[null,null,"Brackets ; Major Road",null,0,0,0,0,0,0,0,0,0,0]
[null,null,"Brackets ; Minor Road",null,0,0,0,0,0,0,0,0,0,0]
[null,null,"Lamps ; Major Road",null,0,0,0,0,0,0,0,0,0,0]
[null,null,"Lamps ; Minor Road",null,0,0,0,0,0,0,0,0,0,0]
[null,null,"Poles / Columns ; Major Road",null,0,0,0,0,0,0,0,0,0,0]
[null,null,"Poles / Columns ; Minor Road",null,0,0,0,0,0,0,0,0,0,0]
[null,null,"Other",null,0,0,0,0,0,0,0,0,0,0]
[null,"SCADA, NETWORK CONTROL AND PROTECTION SYSTEMS BY: \nFUNCTION","Field Devices",null,7,9,20,26,17,16,12,6,90,106]
[null,null,"Local Network Wiring Assets",null,0,0,0,0,0,0,0,0,0,0]
[null,null,"Communications Network Assets",null,28,34,40,39,27,95,66,22,27,10]
[null,null,"Master Station Assets",null,0,0,0,0,0,0,0,0,0,0]
[null,null,"Communications Site Infrastructure",null,0,0,0,0,0,0,5,0,0,0]
[null,null,"Communications Linear Assets",null,0,0,0,0,0,0,1.3,3.15,0.71,0.88]
[null,null,"AFLC",null,0,0,0,0,0,0,0,0,0,0]
[null,null,"Other",null,0,4,8,12,14,11,16,0,0,0]
[null,"OTHER BY: \nDNSP DEFINED",{"$f":"IF(ISBLANK(C138),\"\",C138)","v":"˂ ≈ 11 kV ; STOBIE Pole"},null,492,416,540,926,2223,2031,1889,1762,1751,1606]
[null,null,{"$f":"IF(ISBLANK(C139),\"\",C139)","v":"> 11 kV & <≈ 33 kV ; STOBIE Pole"},null,101,71,91,206,190,196,267,227,282,321]
[null,null,{"$f":"IF(ISBLANK(C140),\"\",C140)","v":"> 33 kV & <≈ 66 kV ; STOBIE Pole"},null,2,6,5,1,15,17,1,15,36,52]
[null,null,{"$f":"IF(ISBLANK(C141),\"\",C141)","v":"Pole REFURBISHED; STOBIE Pole"},null,1232,917,1811,3005,3210,2563,3717,2676,4102,6112]
[null,null,"POLE MOUNTED ; > 22 kV ;  < ≈ 60 kVA ",null,3.1390041493775933,4.7085062240663902,12.556016597510373,4.7085062240663902,4.7085062240663902,6.4924623115577891,8,3,10,3]
[null,null,"POLE MOUNTED ; > 22 kV ;  > 60 kVA and < ≈ 600 kVA ",null,1.5695020746887967,0,1.5695020746887967,1.5695020746887967,9.4170124481327804,1.6231155778894473,8,4,8,11]
[null,null,"KIOSK MOUNTED TRANSFORMER; > 22 kV ;  > 60 kVA and < ≈ 600 kVA ",null,0,0,0,0,0,0,0,0,1,0]
[null,null,"OTHER - Non Category Substation asset replacement/refurbishment",null,52,52,53,52,52,87,115,80,96,99]
[null,null,"Recloser ;SWITCHGEAR",null,214,102,95,183,211,144,182,184,161,124]
[null,null,"Sectionalizer ;SWITCHGEAR",null,28,40,29,33,30,29,15,16,18,0]
[null,null,">= 11 kV & < ≈ 22 kV  ; LOAD BREAK SWITCH; GROUND LEVEL (Switching Cubical);SWITCHGEAR",null,0,0,0,0,0,41,42,35,73,137]
[null,null,"> 22 kV & < ≈ 33 kV  ; LOAD BREAK SWITCH; GROUND LEVEL (Switching Cubical);SWITCHGEAR",null,0,0,0,0,0,0,0,0,0,0]
[null,null,"˂ = 11 kV ;  Circuit Breaker REFURBISHED",null,0,0,0,0,0,0,0,52,85,85]
[null,null,"> 22 kV & < = 33 kV ; Circuit Breaker REFURBISHED",null,0,0,0,0,0,0,0,14,2,0]
[null,null,"> 33 kV & < = 66 kV ; Circuit Breaker REFURBISHED",null,0,0,0,0,0,0,0,1,1,0]
[null,null,"Ground Outdoor / Indoor Chamber Mounted; > 33 kV & < = 66 kV ;  > 15 MVA and < = 40 MVA REFURBISHED",null,0,0,0,0,0,0,0,3,4,9]
[null,null,"Ground Outdoor / Indoor Chamber Mounted; > = 22 kV & < = 33 kV ;  < = 15 MVA REFURBISHED",null,0,0,0,0,0,0,0,1,1,1]
[null,null,"Ground Outdoor / Indoor Chamber Mounted; > 33 kV & < = 66 kV ;  < = 15 MVA REFURBISHED",null,0,0,0,0,0,0,0,1,1,4]
[null,null,"Ground Outdoor / Indoor Chamber Mounted; ˂  22 kV ;  >  600 kVA ; Multiple Phase ; REFURBISHED",null,0,0,0,0,0,0,0,0,1,0]
[null,null,"Pipework Bus Substation Replacements",null,0,0,0,0,0,0,0,1,1,3]
[null,null,{"$f":"IF(ISBLANK(C159),\"\",C159)","v":""},null,"","","","","","",""]
[]
[]
[null,"ASSET FAILURES"]
[null,null,null,null,"VOLUMES (0's)"]
[null,"ASSET GROUP","ASSET CATEGORY",null,{"$f":"IF(dms_RPT=\"financial\",dms_CRYf_y1,dms_CRYc_y1)","v":"2008-09"},{"$f":"IF(dms_RPT=\"financial\",dms_CRYf_y2,dms_CRYc_y2)","v":"2009-10"},{"$f":"IF(dms_RPT=\"financial\",dms_CRYf_y3,dms_CRYc_y3)","v":"2010-11"},{"$f":"IF(dms_RPT=\"financial\",dms_CRYf_y4,dms_CRYc_y4)","v":"2011-12"},{"$f":"IF(dms_RPT=\"financial\",dms_CRYf_y5,dms_CRYc_y5)","v":"2012-13"},{"$f":"IF(dms_RPT=\"financial\",dms_CRYf_y6,dms_CRYc_y6)","v":"2013-14"},{"$f":"IF(dms_RPT=\"financial\",dms_CRYf_y7,dms_CRYc_y7)","v":"2014-15"},{"$f":"IF(dms_RPT=\"financial\",dms_CRYf_y8,dms_CRYc_y8)","v":"2015-16"},{"$f":"IF(dms_RPT=\"financial\",dms_CRYf_y9,dms_CRYc_y9)","v":"2016-17"},{"$f":"IF(dms_RPT=\"financial\",dms_CRYf_y10,dms_CRYc_y10)","v":"2017-18"}]
[null,"POLES BY: \nHIGHEST OPERATING VOLTAGE ; MATERIAL TYPE","Staking of a wooden pole",null,0,0,0,0,0,0,0,0,0,0]
[null,null,"˂ = 1 kV; Wood",null,0,0,0,0,0,0,0,0,0,0]
[null,null,"> 1 kV & < = 11 kV; Wood",null,0,0,0,0,0,0,0,0,0,0]
[null,null,"˃ 11 kV & < = 22 kV; Wood",null,0,0,0,0,0,0,0,0,0,0]
[null,null,"> 22 kV & < = 66 kV; Wood",null,0,0,0,0,0,0,0,0,0,0]
[null,null,"> 66 kV & < = 132 kV; Wood",null,0,0,0,0,0,0,0,0,0,0]
[null,null,"> 132 kV; Wood",null,0,0,0,0,0,0,0,0,0,0]
[null,null,"˂ = 1 kV; Concrete",null,0,0,0,0,0,0,0,0,0,0]
[null,null,"> 1 kV & < = 11 kV; Concrete",null,0,0,0,0,0,0,0,0,0,0]
[null,null,"˃ 11 kV & < = 22 kV; Concrete",null,0,0,0,0,0,0,0,0,0,0]
[null,null,"> 22 kV & < = 66 kV; Concrete",null,0,0,0,0,0,0,0,0,0,0]
[null,null,"> 66 kV & < = 132 kV; Concrete",null,0,0,0,0,0,0,0,0,0,0]
[null,null,"> 132 kV; Concrete",null,0,0,0,0,0,0,0,0,0,0]
[null,null,"˂ = 1 kV; Steel",null,0,0,0,0,0,0,0,0,0,0]
[null,null,"> 1 kV & < = 11 kV; Steel",null,0,0,0,0,0,0,0,0,0,0]
[null,null,"˃ 11 kV & < = 22 kV; Steel",null,0,0,0,0,0,0,0,0,0,0]
[null,null,"> 22 kV & < = 66 kV; Steel",null,0,0,0,0,0,0,0,0,0,0]
[null,null,"> 66 kV & < = 132 kV; Steel",null,0,0,0,0,0,0,0,0,0,0]
[null,null,"> 132 kV; Steel",null,0,0,0,0,0,0,0,0,0,0]
[null,null,"Other",null,0,0,0,0,0,0,0,0,0,0]
[null,"POLE TOP STRUCTURES BY: \nHIGHEST OPERATING VOLTAGE","˂ = 1 kV",null,2463,3063,3011,3171,2622,3218,3040,2773,3516,2877]
[null,null,"> 1 kV & < = 11 kV",null,675,750,706,795,751,773,791,1332,1293,1105]
[null,null,"˃ 11 kV & < = 22 kV",null,132,189,233,203,298,407,471,538,423,376]
[null,null,"> 22 kV & < = 66 kV",null,23,42,46,28,29,54,60,70,57,109]
[null,null,"> 66 kV & < = 132 kV",null,0,0,0,0,0,0,0,0,0,"                          -  "]
[null,null,"> 132 kV",null,0,0,0,0,0,0,0,0,0,"                          -  "]
[null,null,"Other",null,0,0,0,0,0,0,0,null,0,"                          -  "]
[null,"STAKING WOODEN POLES BY: \nHIGHEST OPERATING VOLTAGE","˂ = 1 Kv",null,0,0,0,0,0,0,0,0,0,0]
[null,null,"> 1 kV & < = 11 kV",null,0,0,0,0,0,0,0,0,0,0]
[null,null,"˃ 11 kV & < = 22 kV",null,0,0,0,0,0,0,0,0,0,0]
[null,null,"> 22 kV & < = 66 kV",null,0,0,0,0,0,0,0,0,0,0]
[null,null,"> 66 kV & < = 132 kV",null,0,0,0,0,0,0,0,0,0,0]
[null,null,"> 132 kV",null,0,0,0,0,0,0,0,0,0,0]
[null,"OVERHEAD CONDUCTORS BY: \nHIGHEST OPERATING VOLTAGE; NUMBER OF PHASES (AT HV)","˂ = 1 kV",null,789,1035,1084,963,863,1215,916,895,1324,834]
[null,null,"> 1 kV & < = 11 kV",null,165,201,183,193,179,195,165,177,340,179]
[null,null,"˃ 11 kV & < = 22 kV  ; SWER",null,27,55,51,36,45,89,53,74,90,81]
[null,null,"˃ 11 kV & < = 22 kV ; Single-Phase",null,0,0,0,0,0,0,0,0,0,0]
[null,null,"˃ 11 kV & < = 22 kV ; Multiple-Phase",null,0,0,0,0,0,0,0,0,0,0]
[null,null,"> 22 kV & < = 66 kV",null,1,3,3,5,6,4,4,0,2,5]
[null,null,"> 66 kV & < = 132 kV",null,0,0,0,0,0,0,0,0,0,0]
[null,null,"> 132 kV",null,0,0,0,0,0,0,0,null,0,0]
[null,null,"Other",null,0,0,0,0,0,0,0,null,0,0]
[null,"UNDERGROUND CABLES BY: \nHIGHEST OPERATING VOLTAGE","˂ = 1 kV",null,493,684,917,856,1058,480,468,409,716,569]
[null,null,"> 1 kV & < = 11 kV",null,97,97,103,89,117,479,104,122,172,136]
[null,null,"> 11 kV & < = 22 kV",null,5,3,4,2,2,8,7,2,5,2]
[null,null,"> 22 kV & < = 33 kV",null,0,2,1,2,1,2,8,1,0,3]
[null,null,"> 33 kV & < = 66 kV",null,0,0,0,0,0,0,0,0,0,0]
[null,null,"> 66 kV & < = 132 kV",null,0,0,0,0,0,0,0,0,0,0]
[null,null,">  132 kV",null,0,0,0,0,0,0,0,0,0,0]
[null,null,"Other",null,0,0,0,0,0,0,0,null,0,0]
[null,"SERVICE LINES BY: \nCONNECTION VOLTAGE; CUSTOMER TYPE; CONNECTION COMPLEXITY ","˂ = 11 kV ; Residential ; Simple Type",null,5456,6465,6569,6063,5982,6305,5999,5309,7087.96,5973]
[null,null,"˂ = 11 kV ; Commercial & Industrial ; Simple Type",null,0,0,0,0,0,0,0,0,0,0]
[null,null,"˂ = 11 kV ; Residential ; Complex Type",null,0,0,0,0,0,0,0,0,0,0]
[null,null,"˂ = 11 kV ; Commercial & Industrial ; Complex Type",null,606,719,725,673,664,699,664,590,876.04,663]
[null,null,"˂ = 11 kV ; Subdivision ; Complex Type",null,0,0,0,0,0,0,0,0,0,0]
[null,null,"> 11 kV  & < = 22 kV ; Commercial & Industrial  ",null,0,0,0,0,0,0,0,0,0,0]
[null,null,"> 11 kV  & < = 22 kV ; Subdivision  ",null,0,0,0,0,0,0,0,0,0,0]
[null,null,"> 22 kV & < = 33 kV ; Commercial & Industrial  ",null,0,0,0,0,0,0,0,0,0,0]
[null,null,"> 22 kV & < = 33 kV ; Subdivision  ",null,0,0,0,0,0,0,0,0,0,0]
[null,null,"> 33 kV & < = 66 kV ; Commercial & Industrial  ",null,0,0,0,0,0,0,0,0,0,0]
[null,null,"> 33 kV & < = 66 kV ; Subdivision  ",null,0,0,0,0,0,0,0,0,0,0]
[null,null,"> 66 kV & < = 132 kV ; Commercial & Industrial  ",null,0,0,0,0,0,0,0,0,0,0]
[null,null,"> 66 kV & < = 132 kV ; Subdivision  ",null,0,0,0,0,0,0,0,0,0,0]
[null,null,"> 132 kV ; Commercial & Industrial  ",null,0,0,0,0,0,0,0,0,0,0]
[null,null,"> 132 kV ; Subdivision  ",null,0,0,0,0,0,0,0,0,0,0]
[null,null,"Other",null,0,0,0,0,0,0,0,0,0,0]
[null,"TRANSFORMERS BY: \nMOUNTING TYPE; HIGHEST OPERATING VOLTAGE ; AMPERE RATING; NUMBER OF PHASES (AT LV)","Pole Mounted ; < = 22kV ;  < = 60 kVA ; Single Phase",null,121,126,129,99,118,118,118,101,78,49]
[null,null,"Pole Mounted ; < = 22kV ;  > 60 kVA and < = 600 kVA ; Single Phase",null,9,10,11,9,9,3,6,14,3,2]
[null,null,"Pole Mounted ; < = 22kV ;  > 600 kVA ; Single Phase",null,0,0,0,0,0,0,0,0,0,0]
[null,null,"Pole Mounted ; < = 22kV ;  < = 60 kVA  ; Multiple Phase",null,25,22,25,17,22,30,19,5,23,10]
[null,null,"Pole Mounted ; < = 22kV ;  > 60 kVA and < = 600 kVA  ; Multiple Phase",null,39,49,24,36,36,43,30,5,9,20]
[null,null,"Pole Mounted ; < = 22kV ;  > 600 kVA  ; Multiple Phase",null,0,0,0,0,0,0,1,0,0,0]
[null,null,"Kiosk Mounted ; < = 22kV ;  < = 60 kVA ; Single Phase",null,0,0,0,0,0,0,0,0,0,0]
[null,null,"Kiosk Mounted ; < = 22kV ;  > 60 kVA and < = 600 kVA ; Single Phase",null,2,2,0,1,0,0,0,6,0,0]
[null,null,"Kiosk Mounted ; < = 22kV ;  > 600 kVA ; Single Phase",null,0,0,0,0,0,0,0,2,0,0]
[null,null,"Kiosk Mounted ; < = 22kV ;  < = 60 kVA  ; Multiple Phase",null,0,0,0,0,0,0,0,0,0,1]
[null,null,"Kiosk Mounted ; < = 22kV ;  > 60 kVA and < = 600 kVA  ; Multiple Phase",null,21,20,13,13,8,12,13,0,6,5]
[null,null,"Kiosk Mounted ; < = 22kV ;  > 600 kVA  ; Multiple Phase",null,1,2,0,0,0,0,0,0,0,4]
[null,null,"Ground Outdoor / Indoor Chamber Mounted; ˂ 22 kV ;  < = 60 kVA ; Single Phase",null,0,0,0,0,0,0,0,0,0,0]
[null,null,"Ground Outdoor / Indoor Chamber Mounted; ˂  22 kV ;  > 60 kVA  and < = 600 kVA ; Single Phase",null,0,0,0,0,0,0,0,0,0,0]
[null,null,"Ground Outdoor / Indoor Chamber Mounted; ˂  22 kV ;  >  600 kVA ; Single Phase",null,0,0,0,0,0,0,0,0,0,0]
[null,null,"Ground Outdoor / Indoor Chamber Mounted; ˂  22 kV ;  < = 60 kVA ; Multiple Phase",null,0,0,1,0,0,0,0,0,0,0]
[null,null,"Ground Outdoor / Indoor Chamber Mounted; ˂  22 kV ;  > 60 kVA  and < = 600 kVA ; Multiple Phase",null,1,0,2,1,4,0,0,0,0,0]
[null,null,"Ground Outdoor / Indoor Chamber Mounted; ˂  22 kV ;  >  600 kVA ; Multiple Phase",null,0,0,2,0,0,0,0,0,0,0]
[null,null,"Ground Outdoor / Indoor Chamber Mounted; > = 22 kV & < = 33 kV ;  < = 15 MVA",null,3,2,1,1,2,0,1,2,2,0]
[null,null,"Ground Outdoor / Indoor Chamber Mounted; > = 22 kV & < = 33 kV ;  > 15 MVA and < = 40 MVA",null,0,0,0,0,0,0,0,0,0,0]
[null,null,"Ground Outdoor / Indoor Chamber Mounted; > = 22 kV & < = 33 kV ;  > 40 MVA",null,0,0,0,0,0,0,0,0,0,0]
[null,null,"Ground Outdoor / Indoor Chamber Mounted; > 33 kV & < = 66 kV ;  < = 15 MVA",null,1,1,2,0,0,0,0,0,0,1]
[null,null,"Ground Outdoor / Indoor Chamber Mounted; > 33 kV & < = 66 kV ;  > 15 MVA and < = 40 MVA",null,1,0,0,1,1,0,0,0,0,2]
[null,null,"Ground Outdoor / Indoor Chamber Mounted; > 33 kV & < = 66 kV ;  > 40 MVA",null,0,0,0,0,0,0,0,0,0,0]
[null,null,"Ground Outdoor / Indoor Chamber Mounted; > 66 kV & < = 132 kV ;  < = 100 MVA",null,0,0,0,0,0,0,0,0,0,0]
[null,null,"Ground Outdoor / Indoor Chamber Mounted; > 66 kV & < = 132 kV ;  > 100 MVA",null,0,0,0,0,0,0,0,0,0,0]
[null,null,"Ground Outdoor / Indoor Chamber Mounted; > 132 kV ;  < = 100 MVA",null,0,0,0,0,0,0,0,0,0,0]
[null,null,"Ground Outdoor / Indoor Chamber Mounted; > 132 kV ;  > 100 MVA",null,0,0,0,0,0,0,0,0,0,0]
[null,null,"Other",null,0,0,0,0,0,0,0,0,0,0]
[null,"SWITCHGEAR BY: \nHIGHEST OPERATING VOLTAGE ; SWITCH FUNCTION","˂ = 11 kV ;  FUSE",null,0,0,0,0,0,0,0,0,0,0]
[null,null,"˂ = 11 kV  ; Switch",null,12,13,16,13,8,9,0,2,"",0]
[null,null,"˂ = 11 kV ;  Circuit Breaker",null,2,1,9,2,0,1,10,1,1,0]
[null,null,"> 11 kV & < = 22 kV  ; Switch",null,0,0,0,0,0,0,0,0,0,0]
[null,null,"> 11 kV & < = 22 kV  ; Circuit Breaker",null,0,0,0,0,0,0,0,0,0,0]
[null,null,"> 22 kV & < = 33 kV ; Switch",null,2,2,2,2,2,0,0,0,0,0]
[null,null,"> 22 kV & < = 33 kV ; Circuit Breaker",null,1,1,1,1,3,0,0,0,0,0]
[null,null,"> 33 kV & < = 66 kV ; Switch",null,0,0,0,0,0,0,3,0,0,0]
[null,null,"> 33 kV & < = 66 kV ; Circuit Breaker",null,0,1,0,0,1,1,0,1,0,0]
[null,null,"> 66 kV & < = 132 kV ; Switch",null,0,0,0,0,0,0,0,0,0,0]
[null,null,"> 66 kV & < = 132 kV  ; Circuit Breaker",null,0,0,0,0,0,0,0,0,0,0]
[null,null,"> 132 kV ; Switch",null,0,0,0,0,0,0,0,0,0,0]
[null,null,"> 132 kV ; Circuit Breaker",null,0,0,0,0,0,0,0,0,0,0]
[null,null,"Other",null,0,0,0,0,0,0,0,0,0,0]
[null,"PUBLIC LIGHTING BY: \nASSET TYPE ; LIGHTING OBLIGATION","Luminaires ;  Major Road",null,0,0,0,0,0,0,0,0,0,0]
[null,null,"Luminaires ;  Minor Road",null,0,0,0,0,0,0,0,0,0,0]
[null,null,"Brackets ; Major Road",null,0,0,0,0,0,0,0,0,0,0]
[null,null,"Brackets ; Minor Road",null,0,0,0,0,0,0,0,0,0,0]
[null,null,"Lamps ; Major Road",null,0,0,0,0,0,0,0,0,0,0]
[null,null,"Lamps ; Minor Road",null,0,0,0,0,0,0,0,0,0,0]
[null,null,"Poles / Columns ; Major Road",null,0,0,0,0,0,0,0,0,0,0]
[null,null,"Poles / Columns ; Minor Road",null,0,0,0,0,0,0,0,0,0,0]
[null,null,"Other",null,0,0,0,0,0,0,0,0,0,0]
[null,"SCADA, NETWORK CONTROL AND PROTECTION SYSTEMS BY: \nFUNCTION","Field Devices",null,14,14,15,15,15,16,37,37,47,29]
[null,null,"Local Network Wiring Assets",null,0,0,0,0,0,0,0,0,0,0]
[null,null,"Communications Network Assets",null,36,63,63,47,49,63,17,2,6,0]
[null,null,"Master Station Assets",null,0,0,0,0,0,0,0,0,0,0]
[null,null,"Communications Site Infrastructure",null,0,0,0,0,0,0,16,0,0,0]
[null,null,"Communications Linear Assets",null,0,0,0,0,0,0,0,2.35,0.71,0.74]
[null,null,"AFLC",null,0,0,0,0,0,0,0,0,0,0]
[null,null,"Other",null,0,0,0,0,0,0,0,0,0,0]
[null,"OTHER BY: \nDNSP DEFINED",{"$f":"IF(ISBLANK(C291),\"\",C291)","v":"˂ ≈ 11 kV ; STOBIE Pole"},null,67,82,106,72,132,178,107,116,340,169]
[null,null,{"$f":"IF(ISBLANK(C292),\"\",C292)","v":"> 11 kV & <≈ 33 kV ; STOBIE Pole"},null,0,3,7,6,9,21,18,25,49,40]
[null,null,{"$f":"IF(ISBLANK(C293),\"\",C293)","v":"> 33 kV & <≈ 66 kV ; STOBIE Pole"},null,0,0,0,0,0,0,0,0,1,1]
[null,null,{"$f":"IF(ISBLANK(C294),\"\",C294)","v":"Pole REFURBISHED; STOBIE Pole"},null,0,0,0,0,0,0,0,0,0,0]
[null,null,{"$f":"IF(ISBLANK(C295),\"\",C295)","v":"POLE MOUNTED ; > 22 kV ;  < ≈ 60 kVA "},null,2,3,8,3,3,4,4,1,1,0]
[null,null,"POLE MOUNTED ; > 22 kV ;  > 60 kVA and < ≈ 600 kVA ",null,1,0,1,1,6,1,4,2,6,5]
[null,null,"KIOSK MOUNTED TRANSFORMER; > 22 kV ;  > 60 kVA and < ≈ 600 kVA ",null,0,0,0,0,0,0,0,0,0,0]
[null,null,"OTHER - Non Category Substation asset replacement/refurbishment",null,7,7,7,8,8,4,4,4,4,4]
[null,null,"Recloser ;SWITCHGEAR",null,87,109,114,100,95,71,125,57,61,49]
[null,null,"Sectionalizer ;SWITCHGEAR",null,27,44,25,35,24,29,15,44,19,34]
[null,null,">= 11 kV & < ≈ 22 kV  ; LOAD BREAK SWITCH; GROUND LEVEL (Switching Cubical);SWITCHGEAR",null,0,0,0,0,0,11,9,8,8,10]
[null,null,"> 22 kV & < ≈ 33 kV  ; LOAD BREAK SWITCH; GROUND LEVEL (Switching Cubical);SWITCHGEAR",null,0,0,0,0,0,0,0,0,0,0]
[null,null,"˂ = 11 kV ;  Circuit Breaker REFURBISHED",null,0,0,0,0,0,0,0,0,0,0]
[null,null,"> 22 kV & < = 33 kV ; Circuit Breaker REFURBISHED",null,0,0,0,0,0,0,0,0,0,0]
[null,null,"> 33 kV & < = 66 kV ; Circuit Breaker REFURBISHED",null,0,0,0,0,0,0,0,0,0,0]
[null,null,"Ground Outdoor / Indoor Chamber Mounted; > 33 kV & < = 66 kV ;  > 15 MVA and < = 40 MVA REFURBISHED",null,0,0,0,0,0,0,0,0,0,0]
[null,null,"Ground Outdoor / Indoor Chamber Mounted; > = 22 kV & < = 33 kV ;  < = 15 MVA REFURBISHED",null,0,0,0,0,0,0,0,0,0,0]
[null,null,"Ground Outdoor / Indoor Chamber Mounted; > 33 kV & < = 66 kV ;  < = 15 MVA REFURBISHED",null,0,0,0,0,0,0,0,0,0,0]
[null,null,"Ground Outdoor / Indoor Chamber Mounted; ˂  22 kV ;  >  600 kVA ; Multiple Phase ; REFURBISHED",null,0,0,0,0,0,0,0,0,0,0]
[null,null,"Pipework Bus Substation Replacements",null,0,0,0,0,0,0,0,0,0,0]
[]
[null,null,{"$f":"IF(ISBLANK(C315),\"\",C315)","v":""},null,"","","","","","",""]
[]
[]
[]
[null,"2.2.2 - SELECTED ASSET CHARACTERISTICS"]
[null,"ASSET REPLACEMENTS"]
[null,null,null,null,"VOLUMES (0's)"]
[null,null,null,null,{"$f":"IF(dms_RPT=\"financial\",dms_CRYf_y1,dms_CRYc_y1)","v":"2008-09"},{"$f":"IF(dms_RPT=\"financial\",dms_CRYf_y2,dms_CRYc_y2)","v":"2009-10"},{"$f":"IF(dms_RPT=\"financial\",dms_CRYf_y3,dms_CRYc_y3)","v":"2010-11"},{"$f":"IF(dms_RPT=\"financial\",dms_CRYf_y4,dms_CRYc_y4)","v":"2011-12"},{"$f":"IF(dms_RPT=\"financial\",dms_CRYf_y5,dms_CRYc_y5)","v":"2012-13"},{"$f":"IF(dms_RPT=\"financial\",dms_CRYf_y6,dms_CRYc_y6)","v":"2013-14"},{"$f":"IF(dms_RPT=\"financial\",dms_CRYf_y7,dms_CRYc_y7)","v":"2014-15"},{"$f":"IF(dms_RPT=\"financial\",dms_CRYf_y8,dms_CRYc_y8)","v":"2015-16"},{"$f":"IF(dms_RPT=\"financial\",dms_CRYf_y9,dms_CRYc_y9)","v":"2016-17"},{"$f":"IF(dms_RPT=\"financial\",dms_CRYf_y10,dms_CRYc_y10)","v":"2017-18"}]
[null,"TOTAL POLES BY: \nFEEDER TYPE","Total CBD poles","Number"]
[null,null,"Total urban poles","Number"]
[null,null,"Total rural long poles","Number"]
[null,null,"Total rural short poles","Number"]
[null,"OVERHEAD CONDUCTORS BY:\nCONDUCTOR LENGTH BY FEEDER TYPE","Conductors CBD (km)","KM"]
[null,null,"Conductors urban (km)","KM"]
[null,null,"Conductors rural long (km)","KM"]
[null,null,"Conductors rural short (km)","KM"]
[null,"OVERHEAD CONDUCTORS BY: \nCONDUCTOR LENGTH MATERIAL TYPE","OH conductor LV ABC","KM"]
[null,null,"OH conductor steel","KM"]
[null,null,"OH conductor ACSR","KM"]
[null,null,"OH conductor AAAC","KM"]
[null,null,"OH conductor AAC","KM"]
[null,null,"OH conductor HDBC","KM"]
[null,null,"Other","KM"]
[null,"UNDERGROUND CABLES BY: \nCABLE LENGTH BY FEEDER TYPE","Cable CBD (km)","KM"]
[null,null,"Cable urban (km)","KM"]
[null,null,"Cable rural long (km)","KM"]
[null,null,"Cable rural short (km)","KM"]
[null,"TRANSFORMERS BY: \nTOTAL MVA","Total MVA replaced","MVA"]
[null,null,"Total MVA disposed of","MVA"]
[]
[null,"ASSETS IN COMMISSION"]
[null,null,null,null,"VOLUMES (0's)"]
[null,null,null,null,{"$f":"IF(dms_RPT=\"financial\",dms_CRYf_y1,dms_CRYc_y1)","v":"2008-09"},{"$f":"IF(dms_RPT=\"financial\",dms_CRYf_y2,dms_CRYc_y2)","v":"2009-10"},{"$f":"IF(dms_RPT=\"financial\",dms_CRYf_y3,dms_CRYc_y3)","v":"2010-11"},{"$f":"IF(dms_RPT=\"financial\",dms_CRYf_y4,dms_CRYc_y4)","v":"2011-12"},{"$f":"IF(dms_RPT=\"financial\",dms_CRYf_y5,dms_CRYc_y5)","v":"2012-13"},{"$f":"IF(dms_RPT=\"financial\",dms_CRYf_y6,dms_CRYc_y6)","v":"2013-14"},{"$f":"IF(dms_RPT=\"financial\",dms_CRYf_y7,dms_CRYc_y7)","v":"2014-15"},{"$f":"IF(dms_RPT=\"financial\",dms_CRYf_y8,dms_CRYc_y8)","v":"2015-16"},{"$f":"IF(dms_RPT=\"financial\",dms_CRYf_y9,dms_CRYc_y9)","v":"2016-17"},{"$f":"IF(dms_RPT=\"financial\",dms_CRYf_y10,dms_CRYc_y10)","v":"2017-18"}]
[null,"TOTAL POLES BY: \nFEEDER TYPE","Total CBD poles","Number"]
[null,null,"Total urban poles","Number"]
[null,null,"Total rural long poles","Number"]
[null,null,"Total rural short poles","Number"]
[null,"OVERHEAD CONDUCTORS BY:\nCONDUCTOR LENGTH BY FEEDER TYPE","Conductors CBD (km)","KM"]
[null,null,"Conductors urban (km)","KM"]
[null,null,"Conductors rural long (km)","KM"]
[null,null,"Conductors rural short (km)","KM"]
[null,"OVERHEAD CONDUCTORS BY: \nCONDUCTOR LENGTH MATERIAL TYPE","OH conductor LV ABC","KM"]
[null,null,"OH conductor steel","KM"]
[null,null,"OH conductor ACSR","KM"]
[null,null,"OH conductor AAAC","KM"]
[null,null,"OH conductor AAC","KM"]
[null,null,"OH conductor HDBC","KM"]
[null,null,"Other","KM"]
[null,"UNDERGROUND CABLES BY: \nCABLE LENGTH BY FEEDER TYPE","Cable CBD (km)","KM"]
[null,null,"Cable urban (km)","KM"]
[null,null,"Cable rural long (km)","KM"]
[null,null,"Cable rural short (km)","KM"]
[null,"TRANSFORMERS BY: \nTOTAL MVA","Total MVA replaced","MVA"]
[null,null,"Total MVA disposed of","MVA"]

{"sheet":"2.3(a) Augex","index":8,"n_rows":130,"n_cols":34,"rows_kept":130,"cut":false,"hidden":false,"merged":[[12,1,13,1],[12,2,13,2],[13,27,13,29],[12,6,13,6],[12,16,12,19],[13,23,13,24],[12,7,12,8],[12,9,12,10],[12,11,12,13],[12,14,12,15],[11,30,11,31],[11,23,11,24],[11,25,13,25],[11,26,13,26],[11,27,11,28],[11,29,12,29],[13,30,13,31],[72,23,72,24],[72,25,74,25],[72,26,74,26],[72,30,72,31],[74,23,74,24],[74,27,74,29],[74,30,74,31],[72,29,73,29],[72,27,72,28],[74,7,74,10],[73,7,73,10],[72,11,72,22],[73,17,73,19],[73,21,73,22],[73,5,74,5],[6,1,6,3],[12,21,12,22],[11,11,11,22],[13,17,13,19],[73,11,73,13],[73,14,73,16],[72,1,72,10],[73,1,74,1],[73,2,74,2],[73,3,74,3],[73,4,74,4],[73,6,74,6],[12,3,13,3],[12,4,13,4],[12,5,13,5]]}
[null,"REGULATORY REPORTING STATEMENT"]
[null,{"$f":"INDEX(dms_TradingNameFull_List,MATCH(dms_TradingName,dms_TradingName_List))","v":"SA Power Networks"}]
[null,{"$f":"IF(SUM(dms_SingleYear_Model)>0,(\"CATEGORY ANALYSIS \"&CRY&\" to \"&FRY),(\"CATEGORY ANALYSIS \"&CRY))","v":"CATEGORY ANALYSIS 2008-09 to 2018-19"}]
[null,"2.3 AUGEX PROJECT DATA"]
[]
[]
[null,"There are TWO tables on this worksheet - each has been 'grouped' (and sub-grouped) for easy navigation.  Both rows and columns have been grouped. See the Instructions sheet on how to group or ungroup tables. "]
[]
[null,"2.3.1 - AUGEX ASSET DATA - SUBTRANSMISSION SUBSTATIONS, SWITCHING STATIONS AND ZONE SUBSTATIONS"]
[null,"NOTE: DNSP MUST PROVIDE EXPENDITURE INFORMATION ON A PROJECT CLOSE BASIS. "]
[null,"AUG231_1","AUG231_2","AUG231_3","AUG231_4","AUG231_5","AUG231_6","ED_AUG231_00001","ED_AUG231_00002","ED_AUG231_00003","ED_AUG231_00004","ED_AUG231_00005","ED_AUG231_00006","ED_AUG231_00007","ED_AUG231_00008","ED_AUG231_00009","ED_AUG231_00010","ED_AUG231_00011",null,null,"ED_AUG231_00012","ED_AUG231_00013","ED_AUG231_00014","ED_AUG231_00015","ED_AUG231_00016","ED_AUG231_00017","ED_AUG231_00018","ED_AUG231_00019","ED_AUG231_00020","ED_AUG231_00021","ED_AUG231_00022","ED_AUG231_00023"]
[null,"PROJECT DESCRIPTION AND CHANGES",null,null,null,null,null,null,null,null,null,"PLANT AND EQUIPMENT EXPENDITURE AND VOLUME",null,null,null,null,null,null,null,null,null,null,null,"OTHER EXPENDITURE",null,"TOTAL DIRECT EXPENDITURE ($0's)","YEARS INCURRED","ALL RELATED PARTY CONTRACTS",null,"ALL NON RELATED PARTYCONTRACTS","LAND AND EASEMENTS"]
[null,"SUBSTATION ID","SUBSTATION TYPE\n(drop down)","PROJECT ID","PROJECT TYPE\n(drop down)","PROJECT TRIGGER\n(drop down)","VOLTAGE (KV)","SUBSTATION RATING\nNORMAL CYCLIC\n(MVA)",null,"SUBSTATION RATING\nN-1 EMERGENCY\n(MVA)",null,"TRANSFORMERS",null,null,"SWITCHGEAR",null,"CAPACITORS",null,null,null,"OTHER PLANT ITEM","INSTALLATION (LABOUR)",null,"CIVIL WORKS","OTHER DIRECT",null,null,"RELATED PARTY MARGINS","TOTAL",null,"LAND PURCHASE","EASEMENTS"]
[null,null,null,null,null,null,null,"PRE","POST","PRE","POST","UNITS ADDED ","MVA ADDED","EXPENDITURE ($0's)","UNITS ADDED ","EXPENDITURE ($0's)","MVAR ADDED","EXPENDITURE ($0's)",null,null,"EXPENDITURE ($0's)","VOLUME","EXPENDITURE ($0's)","EXPENDITURE ($0's)",null,null,null,"EXPENDITURE ($0's)",null,null,"EXPENDITURE ($0's)"]
[null,null,null,null,null,null,null,null,null,null,null,null,null,null,null,null,null,null,null,null,null,null,null,null,null,{"$f":"SUM(N15,P15,R15,U15,W15,X15,Y15)","v":0}]
[null,null,null,null,null,null,null,null,null,null,null,null,null,null,null,null,null,null,null,null,null,null,null,null,null,0]
[null,null,null,null,null,null,null,null,null,null,null,null,null,null,null,null,null,null,null,null,null,null,null,null,null,0]
[null,null,null,null,null,null,null,null,null,null,null,null,null,null,null,null,null,null,null,null,null,null,null,null,null,0]
[null,null,null,null,null,null,null,null,null,null,null,null,null,null,null,null,null,null,null,null,null,null,null,null,null,0]
[null,null,null,null,null,null,null,null,null,null,null,null,null,null,null,null,null,null,null,null,null,null,null,null,null,0]
[null,null,null,null,null,null,null,null,null,null,null,null,null,null,null,null,null,null,null,null,null,null,null,null,null,0]
[null,null,null,null,null,null,null,null,null,null,null,null,null,null,null,null,null,null,null,null,null,null,null,null,null,0]
[null,null,null,null,null,null,null,null,null,null,null,null,null,null,null,null,null,null,null,null,null,null,null,null,null,0]
[null,null,null,null,null,null,null,null,null,null,null,null,null,null,null,null,null,null,null,null,null,null,null,null,null,0]
[null,null,null,null,null,null,null,null,null,null,null,null,null,null,null,null,null,null,null,null,null,null,null,null,null,0]
[null,null,null,null,null,null,null,null,null,null,null,null,null,null,null,null,null,null,null,null,null,null,null,null,null,0]
[null,null,null,null,null,null,null,null,null,null,null,null,null,null,null,null,null,null,null,null,null,null,null,null,null,0]
[null,null,null,null,null,null,null,null,null,null,null,null,null,null,null,null,null,null,null,null,null,null,null,null,null,0]
[null,null,null,null,null,null,null,null,null,null,null,null,null,null,null,null,null,null,null,null,null,null,null,null,null,0]
[null,null,null,null,null,null,null,null,null,null,null,null,null,null,null,null,null,null,null,null,null,null,null,null,null,0]
[null,null,null,null,null,null,null,null,null,null,null,null,null,null,null,null,null,null,null,null,null,null,null,null,null,0]
[null,null,null,null,null,null,null,null,null,null,null,null,null,null,null,null,null,null,null,null,null,null,null,null,null,0]
[null,null,null,null,null,null,null,null,null,null,null,null,null,null,null,null,null,null,null,null,null,null,null,null,null,0]
[null,null,null,null,null,null,null,null,null,null,null,null,null,null,null,null,null,null,null,null,null,null,null,null,null,0]
[null,null,null,null,null,null,null,null,null,null,null,null,null,null,null,null,null,null,null,null,null,null,null,null,null,0]
[null,null,null,null,null,null,null,null,null,null,null,null,null,null,null,null,null,null,null,null,null,null,null,null,null,0]
[null,null,null,null,null,null,null,null,null,null,null,null,null,null,null,null,null,null,null,null,null,null,null,null,null,0]
[null,null,null,null,null,null,null,null,null,null,null,null,null,null,null,null,null,null,null,null,null,null,null,null,null,0]
[null,null,null,null,null,null,null,null,null,null,null,null,null,null,null,null,null,null,null,null,null,null,null,null,null,0]
[null,null,null,null,null,null,null,null,null,null,null,null,null,null,null,null,null,null,null,null,null,null,null,null,null,0]
[null,null,null,null,null,null,null,null,null,null,null,null,null,null,null,null,null,null,null,null,null,null,null,null,null,0]
[null,null,null,null,null,null,null,null,null,null,null,null,null,null,null,null,null,null,null,null,null,null,null,null,null,0]
[null,null,null,null,null,null,null,null,null,null,null,null,null,null,null,null,null,null,null,null,null,null,null,null,null,0]
[null,null,null,null,null,null,null,null,null,null,null,null,null,null,null,null,null,null,null,null,null,null,null,null,null,0]
[null,null,null,null,null,null,null,null,null,null,null,null,null,null,null,null,null,null,null,null,null,null,null,null,null,0]
[null,null,null,null,null,null,null,null,null,null,null,null,null,null,null,null,null,null,null,null,null,null,null,null,null,0]
[null,null,null,null,null,null,null,null,null,null,null,null,null,null,null,null,null,null,null,null,null,null,null,null,null,{"$f":"SUM(N47,P47,R47,U47,W47,X47,Y47)","v":0}]
[null,null,null,null,null,null,null,null,null,null,null,null,null,null,null,null,null,null,null,null,null,null,null,null,null,0]
[null,null,null,null,null,null,null,null,null,null,null,null,null,null,null,null,null,null,null,null,null,null,null,null,null,0]
[null,null,null,null,null,null,null,null,null,null,null,null,null,null,null,null,null,null,null,null,null,null,null,null,null,0]
[null,null,null,null,null,null,null,null,null,null,null,null,null,null,null,null,null,null,null,null,null,null,null,null,null,0]
[null,null,null,null,null,null,null,null,null,null,null,null,null,null,null,null,null,null,null,null,null,null,null,null,null,0]
[null,null,null,null,null,null,null,null,null,null,null,null,null,null,null,null,null,null,null,null,null,null,null,null,null,0]
[null,null,null,null,null,null,null,null,null,null,null,null,null,null,null,null,null,null,null,null,null,null,null,null,null,0]
[null,null,null,null,null,null,null,null,null,null,null,null,null,null,null,null,null,null,null,null,null,null,null,null,null,0]
[null,null,null,null,null,null,null,null,null,null,null,null,null,null,null,null,null,null,null,null,null,null,null,null,null,0]
[null,null,null,null,null,null,null,null,null,null,null,null,null,null,null,null,null,null,null,null,null,null,null,null,null,0]
[null,null,null,null,null,null,null,null,null,null,null,null,null,null,null,null,null,null,null,null,null,null,null,null,null,0]
[null,null,null,null,null,null,null,null,null,null,null,null,null,null,null,null,null,null,null,null,null,null,null,null,null,0]
[null,null,null,null,null,null,null,null,null,null,null,null,null,null,null,null,null,null,null,null,null,null,null,null,null,0]
[null,null,null,null,null,null,null,null,null,null,null,null,null,null,null,null,null,null,null,null,null,null,null,null,null,0]
[null,null,null,null,null,null,null,null,null,null,null,null,null,null,null,null,null,null,null,null,null,null,null,null,null,0]
[null,null,null,null,null,null,null,null,null,null,null,null,null,null,null,null,null,null,null,null,null,null,null,null,null,0]
[null,null,null,null,null,null,null,null,null,null,null,null,null,null,null,null,null,null,null,null,null,null,null,null,null,0]
[null,null,null,null,null,null,null,null,null,null,null,null,null,null,null,null,null,null,null,null,null,null,null,null,null,0]
[null,null,null,null,null,null,null,null,null,null,null,null,null,null,null,null,null,null,null,null,null,null,null,null,null,0]
[null,null,null,"Non material projects - [actual]"]
[]
[]
[null,"AUG232_1","AUG232_2","AUG232_3","AUG232_4","AUG232_5","AUG232_6","ED_AUG232_00001","ED_AUG232_00002","ED_AUG232_00003","ED_AUG232_00004","ED_AUG232_00005","ED_AUG232_00006","ED_AUG232_00007","ED_AUG232_00008","ED_AUG232_00009","ED_AUG232_00010","ED_AUG232_00011","ED_AUG232_00012","ED_AUG232_00013","ED_AUG232_00014","ED_AUG232_00015","ED_AUG232_00016","ED_AUG232_00017","ED_AUG232_00018","ED_AUG232_00019","ED_AUG232_00020","ED_AUG232_00021"]
[null,"2.3.2 - AUGEX ASSET DATA - SUBTRANSMISSION LINES"]
[null,"NOTE: DNSP MUST PROVIDE EXPENDITURE INFORMATION ON A PROJECT CLOSE BASIS."]
[null,"PROJECT DESCRIPTION AND CHANGES",null,null,null,null,null,null,null,null,null,"PLANT AND EQUIPMENT EXPENDITURE AND VOLUME",null,null,null,null,null,null,null,null,null,null,null,"OTHER EXPENDITURE",null,"TOTAL DIRECT EXPENDITURE ($0's)","YEARS INCURRED","ALL RELATED PARTY CONTRACTS",null,"ALL NON RELATED PARTYCONTRACTS","LAND AND EASEMENTS"]
[null,"LINE ID","PROJECT ID","PROJECT TYPE","PROJECT TRIGGER","PROJECT TRIGGER\n(drop down)","VOLTAGE (KV)","ROUTE LINE LENGTH ADDED",null,null,null,"POLES/TOWERS (INCLUDING STRUCTURES, AND CIVIL WORKS)",null,null,"OVERHEAD LINES",null,null,"UNDERGROUND CABLES",null,null,"OTHER PLANT ITEM","INSTALLATION (LABOUR)",null,"CIVIL WORKS","OTHER DIRECT",null,null,"RELATED PARTY MARGINS","TOTAL",null,"LAND PURCHASE","EASEMENTS"]
[null,null,null,null,null,null,null,"KM ADDED",null,null,null,"POLES/TOWERS ADDED","POLES/TOWERS UPGRADED","EXPENDITURE ($0's)","CIRCUIT KM ADDED","CIRCUIT KM UPGRADED","EXPENDITURE ($0's)","CIRCUIT KM ADDED","CIRCUIT KM UPGRADED","EXPENDITURE ($0's)","EXPENDITURE ($0's)","VOLUME","EXPENDITURE ($0's)","EXPENDITURE ($0's)",null,null,null,"EXPENDITURE ($0's)",null,null,"EXPENDITURE ($0's)"]
[null,null,null,null,null,null,null,null,null,null,null,null,null,null,null,null,null,null,null,null,null,null,null,null,null,{"$f":"SUM(N76,Q76,T76,U76,W76,X76,Y76)","v":0},null,null,null,null,null,null,null,"New line on new route - single circuit"]
[null,null,null,null,null,null,null,null,null,null,null,null,null,null,null,null,null,null,null,null,null,null,null,null,null,0,null,null,null,null,null,null,null,"New line on new route - dual circuit"]
[null,null,null,null,null,null,null,null,null,null,null,null,null,null,null,null,null,null,null,null,null,null,null,null,null,0,null,null,null,null,null,null,null,"New line on new route - other"]
[null,null,null,null,null,null,null,null,null,null,null,null,null,null,null,null,null,null,null,null,null,null,null,null,null,0,null,null,null,null,null,null,null,"Line rebuild over existing route - single circuit"]
[null,null,null,null,null,null,null,null,null,null,null,null,null,null,null,null,null,null,null,null,null,null,null,null,null,0,null,null,null,null,null,null,null,"Line rebuild over existing route - dual circuit"]
[null,null,null,null,null,null,null,null,null,null,null,null,null,null,null,null,null,null,null,null,null,null,null,null,null,0,null,null,null,null,null,null,null,"Reconductor - Single circuit"]
[null,null,null,null,null,null,null,null,null,null,null,null,null,null,null,null,null,null,null,null,null,null,null,null,null,0,null,null,null,null,null,null,null,"Reconductor - Dual circuit"]
[null,null,null,null,null,null,null,null,null,null,null,null,null,null,null,null,null,null,null,null,null,null,null,null,null,0,null,null,null,null,null,null,null,"Reconductor - Other"]
[null,null,null,null,null,null,null,null,null,null,null,null,null,null,null,null,null,null,null,null,null,null,null,null,null,0,null,null,null,null,null,null,null,"Line upgrade - raising/retensoring"]
[null,null,null,null,null,null,null,null,null,null,null,null,null,null,null,null,null,null,null,null,null,null,null,null,null,0,null,null,null,null,null,null,null,"Line upgrade - voltage upgrade"]
[null,null,null,null,null,null,null,null,null,null,null,null,null,null,null,null,null,null,null,null,null,null,null,null,null,0,null,null,null,null,null,null,null,"Line upgrade - capacity"]
[null,null,null,null,null,null,null,null,null,null,null,null,null,null,null,null,null,null,null,null,null,null,null,null,null,0,null,null,null,null,null,null,null,"String spare circuit"]
[null,null,null,null,null,null,null,null,null,null,null,null,null,null,null,null,null,null,null,null,null,null,null,null,null,0,null,null,null,null,null,null,null,"Other"]
[null,null,null,null,null,null,null,null,null,null,null,null,null,null,null,null,null,null,null,null,null,null,null,null,null,0]
[null,null,null,null,null,null,null,null,null,null,null,null,null,null,null,null,null,null,null,null,null,null,null,null,null,0]
[null,null,null,null,null,null,null,null,null,null,null,null,null,null,null,null,null,null,null,null,null,null,null,null,null,0]
[null,null,null,null,null,null,null,null,null,null,null,null,null,null,null,null,null,null,null,null,null,null,null,null,null,0]
[null,null,null,null,null,null,null,null,null,null,null,null,null,null,null,null,null,null,null,null,null,null,null,null,null,0]
[null,null,null,null,null,null,null,null,null,null,null,null,null,null,null,null,null,null,null,null,null,null,null,null,null,0]
[null,null,null,null,null,null,null,null,null,null,null,null,null,null,null,null,null,null,null,null,null,null,null,null,null,0]
[null,null,null,null,null,null,null,null,null,null,null,null,null,null,null,null,null,null,null,null,null,null,null,null,null,0]
[null,null,null,null,null,null,null,null,null,null,null,null,null,null,null,null,null,null,null,null,null,null,null,null,null,0]
[null,null,null,null,null,null,null,null,null,null,null,null,null,null,null,null,null,null,null,null,null,null,null,null,null,0]
[null,null,null,null,null,null,null,null,null,null,null,null,null,null,null,null,null,null,null,null,null,null,null,null,null,0]
[null,null,null,null,null,null,null,null,null,null,null,null,null,null,null,null,null,null,null,null,null,null,null,null,null,0]
[null,null,null,null,null,null,null,null,null,null,null,null,null,null,null,null,null,null,null,null,null,null,null,null,null,0]
[null,null,null,null,null,null,null,null,null,null,null,null,null,null,null,null,null,null,null,null,null,null,null,null,null,0]
[null,null,null,null,null,null,null,null,null,null,null,null,null,null,null,null,null,null,null,null,null,null,null,null,null,0]
[null,null,null,null,null,null,null,null,null,null,null,null,null,null,null,null,null,null,null,null,null,null,null,null,null,0]
[null,null,null,null,null,null,null,null,null,null,null,null,null,null,null,null,null,null,null,null,null,null,null,null,null,0]
[null,null,null,null,null,null,null,null,null,null,null,null,null,null,null,null,null,null,null,null,null,null,null,null,null,0]
[null,null,null,null,null,null,null,null,null,null,null,null,null,null,null,null,null,null,null,null,null,null,null,null,null,0]
[null,null,null,null,null,null,null,null,null,null,null,null,null,null,null,null,null,null,null,null,null,null,null,null,null,{"$f":"SUM(N108,Q108,T108,U108,W108,X108,Y108)","v":0}]
[null,null,null,null,null,null,null,null,null,null,null,null,null,null,null,null,null,null,null,null,null,null,null,null,null,0]
[null,null,null,null,null,null,null,null,null,null,null,null,null,null,null,null,null,null,null,null,null,null,null,null,null,0]
[null,null,null,null,null,null,null,null,null,null,null,null,null,null,null,null,null,null,null,null,null,null,null,null,null,0]
[null,null,null,null,null,null,null,null,null,null,null,null,null,null,null,null,null,null,null,null,null,null,null,null,null,0]
[null,null,null,null,null,null,null,null,null,null,null,null,null,null,null,null,null,null,null,null,null,null,null,null,null,0]
[null,null,null,null,null,null,null,null,null,null,null,null,null,null,null,null,null,null,null,null,null,null,null,null,null,0]
[null,null,null,null,null,null,null,null,null,null,null,null,null,null,null,null,null,null,null,null,null,null,null,null,null,0]
[null,null,null,null,null,null,null,null,null,null,null,null,null,null,null,null,null,null,null,null,null,null,null,null,null,0]
[null,null,null,null,null,null,null,null,null,null,null,null,null,null,null,null,null,null,null,null,null,null,null,null,null,0]
[null,null,null,null,null,null,null,null,null,null,null,null,null,null,null,null,null,null,null,null,null,null,null,null,null,0]
[null,null,null,null,null,null,null,null,null,null,null,null,null,null,null,null,null,null,null,null,null,null,null,null,null,0]
[null,null,null,null,null,null,null,null,null,null,null,null,null,null,null,null,null,null,null,null,null,null,null,null,null,0]
[null,null,null,null,null,null,null,null,null,null,null,null,null,null,null,null,null,null,null,null,null,null,null,null,null,0]
[null,null,null,null,null,null,null,null,null,null,null,null,null,null,null,null,null,null,null,null,null,null,null,null,null,0]
[null,null,null,null,null,null,null,null,null,null,null,null,null,null,null,null,null,null,null,null,null,null,null,null,null,0]
[null,null,null,null,null,null,null,null,null,null,null,null,null,null,null,null,null,null,null,null,null,null,null,null,null,0]
[null,null,null,null,null,null,null,null,null,null,null,null,null,null,null,null,null,null,null,null,null,null,null,null,null,0]
[null,null,null,null,null,null,null,null,null,null,null,null,null,null,null,null,null,null,null,null,null,null,null,null,null,0]
[null,null,null,null,null,null,null,null,null,null,null,null,null,null,null,null,null,null,null,null,null,null,null,null,null,0]
[null,null,null,null,null,null,null,null,null,null,null,null,null,null,null,null,null,null,null,null,null,null,null,null,null,0]
[null,null,null,null,null,null,null,null,null,null,null,null,null,null,null,null,null,null,null,null,null,null,null,null,null,0]
[null,null,"Non material projects - [actual]"]

{"sheet":"2.3(b) Augex","index":9,"n_rows":55,"n_cols":13,"rows_kept":55,"cut":false,"hidden":false,"merged":[[5,1,5,2],[29,3,29,12],[44,3,44,12],[29,1,30,2],[44,1,45,2],[9,1,10,1],[9,2,10,2],[9,3,9,12]]}
[null,"REGULATORY REPORTING STATEMENT"]
[null,{"$f":"INDEX(dms_TradingNameFull_List,MATCH(dms_TradingName,dms_TradingName_List))","v":"SA Power Networks"}]
[null,{"$f":"IF(SUM(dms_SingleYear_Model)>0,(\"CATEGORY ANALYSIS \"&CRY&\" to \"&FRY),(\"CATEGORY ANALYSIS \"&CRY))","v":"CATEGORY ANALYSIS 2008-09 to 2018-19"}]
[null,"2.3 AUGEX  PROJECT DATA"]
[]
[null,"There are FOUR tables on this worksheet. These tables have been 'grouped' (and sub-grouped) for easy navigation.  See the Instructions sheet on how to group or ungroup tables. "]
[]
[null,"NOTE: DNSP MUST PROVIDE EXPENDITURE INFORMATION ON AN AS INCURRED BASIS."]
[null,"2.3.3 - AUGEX DATA - HV/LV FEEDERS AND DISTRIBUTION SUBSTATIONS"]
[null,"PROJECT TYPE","Units","VOLUME (0's)"]
[null,null,null,{"$f":"IF(dms_RPT=\"financial\",dms_CRYf_y1,dms_CRYc_y1)","v":"2008-09"},{"$f":"IF(dms_RPT=\"financial\",dms_CRYf_y2,dms_CRYc_y2)","v":"2009-10"},{"$f":"IF(dms_RPT=\"financial\",dms_CRYf_y3,dms_CRYc_y3)","v":"2010-11"},{"$f":"IF(dms_RPT=\"financial\",dms_CRYf_y4,dms_CRYc_y4)","v":"2011-12"},{"$f":"IF(dms_RPT=\"financial\",dms_CRYf_y5,dms_CRYc_y5)","v":"2012-13"},{"$f":"IF(dms_RPT=\"financial\",dms_CRYf_y6,dms_CRYc_y6)","v":"2013-14"},{"$f":"IF(dms_RPT=\"financial\",dms_CRYf_y7,dms_CRYc_y7)","v":"2014-15"},{"$f":"IF(dms_RPT=\"financial\",dms_CRYf_y8,dms_CRYc_y8)","v":"2015-16"},{"$f":"IF(dms_RPT=\"financial\",dms_CRYf_y9,dms_CRYc_y9)","v":"2016-17"},{"$f":"IF(dms_RPT=\"financial\",dms_CRYf_y10,dms_CRYc_y10)","v":"2017-18"}]
[null,"DESCRIPTOR METRICS - UNITS ADDED"]
[null,"HV Feeder Augmentations - Overhead Lines","Circuit Line Length in KM"]
[null,"HV Feeder Augmentations - Underground Cables","Circuit Line Length in KM"]
[null,"LV Feeder Augmentations - Overhead Lines","Circuit Line Length in KM"]
[null,"LV Feeder Augmentations - Underground Cables","Circuit Line Length in KM"]
[null,"Distribution Substation Augmentations - Pole Mounted","Number"]
[null,"Distribution Substation Augmentations - Ground Mounted","Number"]
[null,"Distribution Substation Augmentations - Indoor","Number"]
[null,"DESCRIPTOR METRICS - UNITS UPGRADED"]
[null,"HV Feeder Augmentations - Overhead Lines","Circuit Line Length in KM"]
[null,"HV Feeder Augmentations - Underground Cables","Circuit Line Length in KM"]
[null,"LV Feeder Augmentations - Overhead Lines","Circuit Line Length in KM"]
[null,"LV Feeder Augmentations - Underground Cables","Circuit Line Length in KM"]
[null,"Distribution Substation Augmentations - Pole Mounted","Number"]
[null,"Distribution Substation Augmentations - Ground Mounted","Number"]
[null,"Distribution Substation Augmentations - Indoor","Number"]
[]
[null,"COST METRICS"]
[null,"TOTAL DIRECT EXPENDITURE - Project Type",null,"EXPENDITURE\n($0's)"]
[null,null,null,{"$f":"IF(dms_RPT=\"financial\",dms_CRYf_y1,dms_CRYc_y1)","v":"2008-09"},{"$f":"IF(dms_RPT=\"financial\",dms_CRYf_y2,dms_CRYc_y2)","v":"2009-10"},{"$f":"IF(dms_RPT=\"financial\",dms_CRYf_y3,dms_CRYc_y3)","v":"2010-11"},{"$f":"IF(dms_RPT=\"financial\",dms_CRYf_y4,dms_CRYc_y4)","v":"2011-12"},{"$f":"IF(dms_RPT=\"financial\",dms_CRYf_y5,dms_CRYc_y5)","v":"2012-13"},{"$f":"IF(dms_RPT=\"financial\",dms_CRYf_y6,dms_CRYc_y6)","v":"2013-14"},{"$f":"IF(dms_RPT=\"financial\",dms_CRYf_y7,dms_CRYc_y7)","v":"2014-15"},{"$f":"IF(dms_RPT=\"financial\",dms_CRYf_y8,dms_CRYc_y8)","v":"2015-16"},{"$f":"IF(dms_RPT=\"financial\",dms_CRYf_y9,dms_CRYc_y9)","v":"2016-17"},{"$f":"IF(dms_RPT=\"financial\",dms_CRYf_y10,dms_CRYc_y10)","v":"2017-18"}]
[null,"HV Feeder Augmentations - Overhead Lines"]
[null,"HV Feeder Augmentations - Underground Cables"]
[null,"HV Feeder Non-Material Projects"]
[null,"LV Feeder Augmentations - Overhead Lines"]
[null,"LV Feeder Augmentations - Underground Cables"]
[null,"LV Feeder Non-Material Projects"]
[null,"Distribution Substation Augmentations - Pole Mounted"]
[null,"Distribution Substation Augmentations - Ground Mounted"]
[null,"Distribution Substation Augmentations - Indoor"]
[]
[]
[]
[null,"2.3.4 - AUGEX  - TOTAL EXPENDITURE"]
[null,"AUGMENTATION CAPEX (as incurred)",null,"EXPENDITURE\n($0's)"]
[null,null,null,{"$f":"IF(dms_RPT=\"financial\",dms_CRYf_y1,dms_CRYc_y1)","v":"2008-09"},{"$f":"IF(dms_RPT=\"financial\",dms_CRYf_y2,dms_CRYc_y2)","v":"2009-10"},{"$f":"IF(dms_RPT=\"financial\",dms_CRYf_y3,dms_CRYc_y3)","v":"2010-11"},{"$f":"IF(dms_RPT=\"financial\",dms_CRYf_y4,dms_CRYc_y4)","v":"2011-12"},{"$f":"IF(dms_RPT=\"financial\",dms_CRYf_y5,dms_CRYc_y5)","v":"2012-13"},{"$f":"IF(dms_RPT=\"financial\",dms_CRYf_y6,dms_CRYc_y6)","v":"2013-14"},{"$f":"IF(dms_RPT=\"financial\",dms_CRYf_y7,dms_CRYc_y7)","v":"2014-15"},{"$f":"IF(dms_RPT=\"financial\",dms_CRYf_y8,dms_CRYc_y8)","v":"2015-16"},{"$f":"IF(dms_RPT=\"financial\",dms_CRYf_y9,dms_CRYc_y9)","v":"2016-17"},{"$f":"IF(dms_RPT=\"financial\",dms_CRYf_y10,dms_CRYc_y10)","v":"2017-18"}]
[null,"Subtransmission Substations, Switching Stations, Zone Substations"]
[null,"Subtransmission Lines"]
[null,"HV Feeders"]
[null,"HV Feeders - Land Purchases and Easements"]
[null,"Distribution Substations"]
[null,"Distribution Substations - Land Purchases And Easements"]
[null,"LV Feeders"]
[null,"LV Feeders - Land Purchases And Easements"]
[null,"Other Assets"]

{"sheet":"2.5 Connections","index":10,"n_rows":89,"n_cols":14,"rows_kept":89,"cut":false,"hidden":false,"merged":[[5,1,5,2],[73,4,73,13],[8,4,8,13],[55,4,55,13]]}
[null,"REGULATORY REPORTING STATEMENT"]
[null,{"$f":"INDEX(dms_TradingNameFull_List,MATCH(dms_TradingName,dms_TradingName_List))","v":"SA Power Networks"}]
[null,{"$f":"IF(SUM(dms_SingleYear_Model)>0,(\"CATEGORY ANALYSIS \"&CRY&\" to \"&FRY),(\"CATEGORY ANALYSIS \"&CRY))","v":"CATEGORY ANALYSIS 2008-09 to 2018-19"}]
[null,"2.5 CONNECTIONS"]
[]
[null,"There are THREE tables on this worksheet - each has been 'grouped' (and sub-grouped) for easy navigation. See the Instructions sheet on how to group or ungroup tables. "]
[]
[null,"2.5.1 - DESCRIPTOR METRICS"]
[null,null,null,null,"VOLUMES AND EXPENDITURE"]
[null,null,null,"Units",{"$f":"IF(dms_RPT=\"financial\",dms_CRYf_y1,dms_CRYc_y1)","v":"2008-09"},{"$f":"IF(dms_RPT=\"financial\",dms_CRYf_y2,dms_CRYc_y2)","v":"2009-10"},{"$f":"IF(dms_RPT=\"financial\",dms_CRYf_y3,dms_CRYc_y3)","v":"2010-11"},{"$f":"IF(dms_RPT=\"financial\",dms_CRYf_y4,dms_CRYc_y4)","v":"2011-12"},{"$f":"IF(dms_RPT=\"financial\",dms_CRYf_y5,dms_CRYc_y5)","v":"2012-13"},{"$f":"IF(dms_RPT=\"financial\",dms_CRYf_y6,dms_CRYc_y6)","v":"2013-14"},{"$f":"IF(dms_RPT=\"financial\",dms_CRYf_y7,dms_CRYc_y7)","v":"2014-15"},{"$f":"IF(dms_RPT=\"financial\",dms_CRYf_y8,dms_CRYc_y8)","v":"2015-16"},{"$f":"IF(dms_RPT=\"financial\",dms_CRYf_y9,dms_CRYc_y9)","v":"2016-17"},{"$f":"IF(dms_RPT=\"financial\",dms_CRYf_y10,dms_CRYc_y10)","v":"2017-18"}]
[null,"RESIDENTIAL","Underground connections","0's"]
[null,null,"Overhead connections","0's"]
[null,null,"Distribution substation installed (MVA added)","MVA"]
[null,null,"Distribution substations installed","0's"]
[null,null,"Distribution substation installed (total spend $0's)","total spend $0s"]
[null,null,"Augmentation HV (net circuit KM added)","KM"]
[null,null,"Augmentation HV (total spend $0's)","total spend $0s"]
[null,null,"Augmentation LV (net circuit KM added)","KM"]
[null,null,"Augmentation LV (total spend $0's)","total spend $0s"]
[null,null,"Mean days to connect residential customer with LV single phase connection","0's"]
[null,null,"Volume of GSL breaches for residential customers","0's"]
[null,null,"Volume of customer complaints relating to connection services","0's"]
[null,null,"GSL payments","$0s"]
[null,"COMMERCIAL/INDUSTRIAL","Underground connections","0's"]
[null,null,"Overhead connections","0's"]
[null,null,"Distribution substation installed (MVA added)","MVA"]
[null,null,"Distribution substations installed (0's)","0's"]
[null,null,"Distribution substation installed (total spend ($0's)","total spend $0s"]
[null,null,"Augmentation HV (net circuit KM added)","KM"]
[null,null,"Augmentation HV (total spend $0's)","total spend $0s"]
[null,null,"Augmentation LV (net circuit KM added)","KM"]
[null,null,"Augmentation LV (total spend $0's)","total spend $0s"]
[null,"SUBDIVISION","Underground connections","0's"]
[null,null,"Overhead connections","0's"]
[null,null,"Distribution substation installed (MVA added)","MVA"]
[null,null,"Distribution substations installed","0's"]
[null,null,"Distribution substation installed (total spend $0's)","total spend $0s"]
[null,null,"Augmentation HV (net circuit KM added)","KM"]
[null,null,"Augmentation HV (total spend $0's)","total spend $0s"]
[null,null,"Augmentation LV (net circuit KM added)","KM"]
[null,null,"Augmentation LV (total spend $0's)","total spend $0s"]
[null,null,"Cost per lot ($)","$0s"]
[null,"EMBEDDED GENERATION","Underground connections","0's"]
[null,null,"Overhead connections","0's"]
[null,null,"Distribution substation installed (MVA added)","MVA"]
[null,null,"Distribution substations installed","0's"]
[null,null,"Distribution substation installed (total spend $0's)","total spend $0s"]
[null,null,"Augmentation HV (net circuit KM added)","KM"]
[null,null,"Augmentation HV (total spend $0's)","total spend $0s"]
[null,null,"Augmentation LV (net circuit KM added)","KM"]
[null,null,"Augmentation LV (total spend $0's)","total spend $0s"]
[]
[]
[]
[null,"2.5.2 - COST METRICS BY CONNECTION CLASSIFICATION"]
[null,null,null,null,"EXPENDITURE\n($0's)"]
[null,null,null,null,{"$f":"IF(dms_RPT=\"financial\",dms_CRYf_y1,dms_CRYc_y1)","v":"2008-09"},{"$f":"IF(dms_RPT=\"financial\",dms_CRYf_y2,dms_CRYc_y2)","v":"2009-10"},{"$f":"IF(dms_RPT=\"financial\",dms_CRYf_y3,dms_CRYc_y3)","v":"2010-11"},{"$f":"IF(dms_RPT=\"financial\",dms_CRYf_y4,dms_CRYc_y4)","v":"2011-12"},{"$f":"IF(dms_RPT=\"financial\",dms_CRYf_y5,dms_CRYc_y5)","v":"2012-13"},{"$f":"IF(dms_RPT=\"financial\",dms_CRYf_y6,dms_CRYc_y6)","v":"2013-14"},{"$f":"IF(dms_RPT=\"financial\",dms_CRYf_y7,dms_CRYc_y7)","v":"2014-15"},{"$f":"IF(dms_RPT=\"financial\",dms_CRYf_y8,dms_CRYc_y8)","v":"2015-16"},{"$f":"IF(dms_RPT=\"financial\",dms_CRYf_y9,dms_CRYc_y9)","v":"2016-17"},{"$f":"IF(dms_RPT=\"financial\",dms_CRYf_y10,dms_CRYc_y10)","v":"2017-18"}]
[null,"RESIDENTIAL","Simple connection LV"]
[null,null,"Complex connection LV"]
[null,null,"Complex connection HV"]
[null,"COMMERCIAL/INDUSTRIAL","Simple connection LV"]
[null,null,"Complex connection HV (customer connected at LV, minor HV works)"]
[null,null,"Complex connection HV (customer connected at LV, upstream asset works)"]
[null,null,"Complex connection HV (customer connected at HV)"]
[null,null,"Complex connection sub-transmission"]
[null,"SUBDIVISION","Complex connection LV"]
[null,null,"Complex connection HV (no upstream asset works)"]
[null,null,"Complex connection HV (with upstream asset works)"]
[null,"EMBEDDED GENERATION","Simple connection LV"]
[null,null,"Complex connection HV (small capacity)"]
[null,null,"Complex connection HV (large capacity)"]
[]
[null,"2.5.3 - VOLUMES BY CONNECTION CLASSIFICATION"]
[null,null,null,null,"VOLUMES\n(0's)"]
[null,null,null,null,{"$f":"IF(dms_RPT=\"financial\",dms_CRYf_y1,dms_CRYc_y1)","v":"2008-09"},{"$f":"IF(dms_RPT=\"financial\",dms_CRYf_y2,dms_CRYc_y2)","v":"2009-10"},{"$f":"IF(dms_RPT=\"financial\",dms_CRYf_y3,dms_CRYc_y3)","v":"2010-11"},{"$f":"IF(dms_RPT=\"financial\",dms_CRYf_y4,dms_CRYc_y4)","v":"2011-12"},{"$f":"IF(dms_RPT=\"financial\",dms_CRYf_y5,dms_CRYc_y5)","v":"2012-13"},{"$f":"IF(dms_RPT=\"financial\",dms_CRYf_y6,dms_CRYc_y6)","v":"2013-14"},{"$f":"IF(dms_RPT=\"financial\",dms_CRYf_y7,dms_CRYc_y7)","v":"2014-15"},{"$f":"IF(dms_RPT=\"financial\",dms_CRYf_y8,dms_CRYc_y8)","v":"2015-16"},{"$f":"IF(dms_RPT=\"financial\",dms_CRYf_y9,dms_CRYc_y9)","v":"2016-17"},{"$f":"IF(dms_RPT=\"financial\",dms_CRYf_y10,dms_CRYc_y10)","v":"2017-18"}]
[null,"RESIDENTIAL","Simple connection LV"]
[null,null,"Complex connection LV"]
[null,null,"Complex connection HV"]
[null,"COMMERCIAL/INDUSTRIAL","Simple connection LV"]
[null,null,"Complex connection HV (customer connected at LV, minor HV works)"]
[null,null,"Complex connection HV (customer connected at LV, upstream asset works)"]
[null,null,"Complex connection HV (customer connected at HV)"]
[null,null,"Complex connection sub-transmission"]
[null,"SUBDIVISION","Complex connection LV"]
[null,null,"Complex connection HV (no upstream asset works)"]
[null,null,"Complex connection HV (with upstream asset works)"]
[null,"EMBEDDED GENERATION","Simple connection LV"]
[null,null,"Complex connection HV (small capacity)"]
[null,null,"Complex connection HV (large capacity)"]

{"sheet":"2.6 Non-network","index":11,"n_rows":93,"n_cols":15,"rows_kept":93,"cut":false,"hidden":false,"merged":[[66,5,66,14],[59,5,59,14],[8,5,8,14],[5,1,5,2],[88,1,92,1],[68,1,72,1],[73,1,77,1],[78,1,82,1],[83,1,87,1],[63,1,63,4],[62,1,62,4],[61,1,61,4],[9,2,9,4]]}
[null,"REGULATORY REPORTING STATEMENT"]
[null,{"$f":"INDEX(dms_TradingNameFull_List,MATCH(dms_TradingName,dms_TradingName_List))","v":"SA Power Networks"}]
[null,{"$f":"IF(SUM(dms_SingleYear_Model)>0,(\"CATEGORY ANALYSIS \"&CRY&\" to \"&FRY),(\"CATEGORY ANALYSIS \"&CRY))","v":"CATEGORY ANALYSIS 2008-09 to 2018-19"}]
[null,"2.6 NON-NETWORK EXPENDITURE"]
[]
[null,"There are THREE tables on this worksheet - each has been 'grouped' (and sub-grouped) for easy navigation. See the Instructions sheet on how to group or ungroup tables. "]
[]
[null,"2.6.1 - NON-NETWORK EXPENDITURE"]
[null,null,null,null,null,"EXPENDITURE\n($0's)"]
[null,"SERVICE SUBCATEGORY","ASSET CATEGORY",null,null,{"$f":"IF(dms_RPT=\"financial\",dms_CRYf_y1,dms_CRYc_y1)","v":"2008-09"},{"$f":"IF(dms_RPT=\"financial\",dms_CRYf_y2,dms_CRYc_y2)","v":"2009-10"},{"$f":"IF(dms_RPT=\"financial\",dms_CRYf_y3,dms_CRYc_y3)","v":"2010-11"},{"$f":"IF(dms_RPT=\"financial\",dms_CRYf_y4,dms_CRYc_y4)","v":"2011-12"},{"$f":"IF(dms_RPT=\"financial\",dms_CRYf_y5,dms_CRYc_y5)","v":"2012-13"},{"$f":"IF(dms_RPT=\"financial\",dms_CRYf_y6,dms_CRYc_y6)","v":"2013-14"},{"$f":"IF(dms_RPT=\"financial\",dms_CRYf_y7,dms_CRYc_y7)","v":"2014-15"},{"$f":"IF(dms_RPT=\"financial\",dms_CRYf_y8,dms_CRYc_y8)","v":"2015-16"},{"$f":"IF(dms_RPT=\"financial\",dms_CRYf_y9,dms_CRYc_y9)","v":"2016-17"},{"$f":"IF(dms_RPT=\"financial\",dms_CRYf_y10,dms_CRYc_y10)","v":"2017-18"}]
[null,"OPEX"]
[null,"IT & COMMUNICATIONS","Total",null,null,5377905.8186953049,7215261.8054736909,9455107.3489862233,11369942.77876796,10338150.969654419,15531373.686231066,11921208.589347452,10075374.625633415,17834184.498685356,22246011.731151748]
[null,"MOTOR VEHICLES","Car",null,null,984000,892000,895000,965000,1127000,1039000,484666,922012.33642784529,562751.97591124068,601594]
[null,null,"Light commercial vehicle",null,null,2960000,3039000,3572000,4503000,5376000,4573000,3955837,3762467.9174921853,1960251.1638097453,1969370]
[null,null,"Elevated work platform (LCV)  ",null,null,0,0,0,0,0,0,0,0,0,0]
[null,null,"Elevated work platform (HCV)",null,null,3084000,2933000,2995000,3305000,3718000,5220000,6478817,4171094.4715291159,4460624.4937466243,5503360]
[null,null,"Heavy commercial vehicle",null,null,641000,664000,542000,819000,731000,1007000,1209399,1399746.3270772442,1803498.421425676,1669927]
[null,"BUILDINGS AND PROPERTY","Total buildings and property expenditure",null,null,777317.73512696777,896650.46348301077,3324368.4504549047,3140722.0256458726,3801553.5462082638,3299108.1890425296,3904216.9328678655,3750186.5306589501,3717191.6771348612,4412763.1146183666]
[null,"OTHER","Other expenditure",null,null,4360000,4244000,4456000,4868000,5362000,5453000,6124898,4557836.5549223274,5590479.565566143,5317832.3599999994]
[null,"OTHER - DNSP nominated","Cranes",null,null,1131000,902000,1138000,1372000,1430000,1382000,1306030,1486672.846579592,1168588.1386603164,1405478]
[null,null,"Trailers",null,null,813000,671000,419000,379000,515000,650000,0,0,0,474622]
[null,null,"Other commercial vehicles",null,null,168000,112000,141000,141000,162000,157000,1158064,587595.46428453049,1362208.1265284421,707323]
[null,null,"TEC vehicles",null,null,0,0,0,0,0,0,505804,617651.56405820453,283423.39037738444,238857]
[null,null,"Network telephony",null,null,2248000,2559000,2758000,2976000,3255000,3264000,3155000,1865916.68,2776259.91,2491552.36]
[]
[]
[]
[]
[]
[]
[null,"CAPEX"]
[null,"IT & COMMUNICATIONS","Total",null,null,15549000,10821000,20610000,26633000,25615000,27637999.999999996,44696000,41996999.439999998,54766407.399999999,63120452.199999996]
[null,"MOTOR VEHICLES","Car",null,null,1907000,2088000,2218000,1740000,2095000,1619000,51974,642792.44999999995,180213.84999999998,657794]
[null,null,"Light commercial vehicle",null,null,6549000,3424000,4949000,3080000,5416000,4596000,4415710,4339002.3499999996,3867685.55,6205282]
[null,null,"Elevated work platform (LCV)  ",null,null,0,0,0,0,0,0,0,0,0," -   "]
[null,null,"Elevated work platform (HCV)",null,null,1951000,4962000,5639000,5605000,7410000,10925000,11155586,5902081.9899999993,7025729.120000001,4265932]
[null,null,"Heavy commercial vehicle",null,null,3042000,680000,1735000,729000,807000,1343000,989134,832398.65000000014,529069.26,3870295]
[null,"BUILDINGS AND PROPERTY","Total buildings and property expenditure",null,null,6372000,5679000,10091000,19766000,15611000,10921000.000000002,4638999.9999999991,7670788.3700000104,6839633.9200000875,11369906.989999933]
[null,"OTHER","Other expenditure",null,null,4791000,9268000,13260000,17038000,23504000,31797000,38670159,15033905.5,13030612.290000001,19773200]
[null,"OTHER - DNSP nominated","Trailers",null,null,460000,847000,642000,1145000,1223000,793000,0,0,0,448265]
[null,null,"Cranes",null,null,68000,1262000,977000,499000,1474000,3285000,3003140,336520.34,533887.52,750897]
[null,null,"Other commercial vehicles",null,null,290000,495000,385000,546000,266000,598000,2530446,1488207.4800000002,337865.65,673430]
[null,null,"TEC vehicles",null,null,0,0,0,0,0,0,1915495,1231920.74,1635073.49,1985024]
[null,null,"Plant and Tools",null,null,3456000,5555000,4584000,2092000,2616000,5627000,9791000,2427746.85,2768171.83,5043408.9999999991]
[null,null,"ADMS",null,null,0,0,0,997000,10021000,8997000,8999989,4770567.66,968968.49,238911]
[null,null,"NOC",null,null,0,178000,3920000,2226000,1428000,0,0,0,0,0]
[null,null,"SCADA / OMS",null,null,0,17000,1621000,2944000,516000,0,0,0,0,2184082]
[null,null,"Asset Condition",null,null,0,0,0,574000,1084000,2290000,0,0,0,0]
[null,null,"Vegetation Management Data",null,null,0,0,0,0,3522000,1319000,3172954,0,0,0]
[null,null,"V&V Rollout",null,null,0,0,0,0,0,0,0,0,1635844.66,1331303]
[null,null,"Non-Network Telecommunications",null,null,0,0,0,0,0,0,542923,1093717,1032681.86,1227949]
[null,null,"Asset Information",null,null,0,0,0,0,0,0,1797771,0,0,0]
[null,null,"Other Network Strategic",null,null,322000,521000,560000,5437000,903000,8888000,6916441,3685225.43,4118118.7900000005,5889930]
[null,null,"Miscellaneous Other",null,null,194999.99999999977,393000.00000000012,571000,578000,451000,0,0,0,0,0]
[]
[]
[]
[null,"2.6.2 - ANNUAL DESCRIPTOR METRICS"]
[null,"IT & COMMUNICATIONS"]
[null,null,null,null,null,"VOLUMES\n(0's)"]
[null,null,null,null,null,{"$f":"IF(dms_RPT=\"financial\",dms_CRYf_y1,dms_CRYc_y1)","v":"2008-09"},{"$f":"IF(dms_RPT=\"financial\",dms_CRYf_y2,dms_CRYc_y2)","v":"2009-10"},{"$f":"IF(dms_RPT=\"financial\",dms_CRYf_y3,dms_CRYc_y3)","v":"2010-11"},{"$f":"IF(dms_RPT=\"financial\",dms_CRYf_y4,dms_CRYc_y4)","v":"2011-12"},{"$f":"IF(dms_RPT=\"financial\",dms_CRYf_y5,dms_CRYc_y5)","v":"2012-13"},{"$f":"IF(dms_RPT=\"financial\",dms_CRYf_y6,dms_CRYc_y6)","v":"2013-14"},{"$f":"IF(dms_RPT=\"financial\",dms_CRYf_y7,dms_CRYc_y7)","v":"2014-15"},{"$f":"IF(dms_RPT=\"financial\",dms_CRYf_y8,dms_CRYc_y8)","v":"2015-16"},{"$f":"IF(dms_RPT=\"financial\",dms_CRYf_y9,dms_CRYc_y9)","v":"2016-17"},{"$f":"IF(dms_RPT=\"financial\",dms_CRYf_y10,dms_CRYc_y10)","v":"2017-18"}]
[null,"Employee numbers"]
[null,"User numbers"]
[null,"Number of devices"]
[]
[null,"MOTOR VEHICLES"]
[null,null,null,null,null,"VOLUMES / %"]
[null,"ASSET CATEGORY","DESCRIPTOR METRIC",null,"Units",{"$f":"IF(dms_RPT=\"financial\",dms_CRYf_y1,dms_CRYc_y1)","v":"2008-09"},{"$f":"IF(dms_RPT=\"financial\",dms_CRYf_y2,dms_CRYc_y2)","v":"2009-10"},{"$f":"IF(dms_RPT=\"financial\",dms_CRYf_y3,dms_CRYc_y3)","v":"2010-11"},{"$f":"IF(dms_RPT=\"financial\",dms_CRYf_y4,dms_CRYc_y4)","v":"2011-12"},{"$f":"IF(dms_RPT=\"financial\",dms_CRYf_y5,dms_CRYc_y5)","v":"2012-13"},{"$f":"IF(dms_RPT=\"financial\",dms_CRYf_y6,dms_CRYc_y6)","v":"2013-14"},{"$f":"IF(dms_RPT=\"financial\",dms_CRYf_y7,dms_CRYc_y7)","v":"2014-15"},{"$f":"IF(dms_RPT=\"financial\",dms_CRYf_y8,dms_CRYc_y8)","v":"2015-16"},{"$f":"IF(dms_RPT=\"financial\",dms_CRYf_y9,dms_CRYc_y9)","v":"2016-17"},{"$f":"IF(dms_RPT=\"financial\",dms_CRYf_y10,dms_CRYc_y10)","v":"2017-18"}]
[null,"CAR","Average kilometres travelled",null,"0's"]
[null,null,"Number purchased",null,"0's"]
[null,null,"Number leased",null,"0's"]
[null,null,"Number in fleet",null,"0's"]
[null,null,"Proportion of total fleet expenditure allocated as regulatory expenditure",null,"(per cent)"]
[null,"LIGHT COMMERCIAL VEHICLE","Average kilometres travelled",null,"0's"]
[null,null,"Number purchased",null,"0's"]
[null,null,"Number leased",null,"0's"]
[null,null,"Number in fleet",null,"0's"]
[null,null,"Proportion of total fleet expenditure allocated as regulatory expenditure",null,"(per cent)"]
[null,"ELEVATED WORK PLATFORM (LCV) ","Average kilometres travelled",null,"0's"]
[null,null,"Number purchased",null,"0's"]
[null,null,"Number leased",null,"0's"]
[null,null,"Number in fleet",null,"0's"]
[null,null,"Proportion of total fleet expenditure allocated as regulatory expenditure",null,"(per cent)"]
[null,"ELEVATED WORK PLATFORM (HCV)","Average kilometres travelled",null,"0's"]
[null,null,"Number purchased",null,"0's"]
[null,null,"Number leased",null,"0's"]
[null,null,"Number in fleet",null,"0's"]
[null,null,"Proportion of total fleet expenditure allocated as regulatory expenditure",null,"(per cent)"]
[null,"HEAVY COMMERCIAL VEHICLE ","Average kilometres travelled",null,"0's"]
[null,null,"Number purchased",null,"0's"]
[null,null,"Number leased",null,"0's"]
[null,null,"Number in fleet",null,"0's"]
[null,null,"Proportion of total fleet expenditure allocated as regulatory expenditure",null,"(per cent)"]

{"sheet":"2.7 Vegetation management","index":12,"n_rows":406,"n_cols":14,"rows_kept":406,"cut":false,"hidden":false,"merged":[[5,1,5,2],[235,2,235,3],[234,4,234,13],[400,4,400,13],[9,1,10,1],[9,2,10,2],[9,3,10,3],[9,4,9,13],[121,1,122,1],[121,2,122,2],[121,3,122,3],[121,4,121,13],[11,1,16,1],[17,1,22,1],[23,1,28,1],[29,1,34,1],[35,1,40,1],[41,1,46,1],[47,1,52,1],[53,1,58,1],[59,1,64,1],[95,1,100,1],[101,1,106,1],[107,1,112,1],[113,1,118,1],[65,1,70,1],[71,1,76,1],[77,1,82,1],[83,1,88,1],[89,1,94,1]]}
[null,"REGULATORY REPORTING STATEMENT"]
[null,{"$f":"INDEX(dms_TradingNameFull_List,MATCH(dms_TradingName,dms_TradingName_List))","v":"SA Power Networks"}]
[null,{"$f":"IF(SUM(dms_SingleYear_Model)>0,(\"CATEGORY ANALYSIS \"&CRY&\" to \"&FRY),(\"CATEGORY ANALYSIS \"&CRY))","v":"CATEGORY ANALYSIS 2008-09 to 2018-19"}]
[null,"2.7 VEGETATION MANAGEMENT"]
[]
[null,"There are THREE tables on this worksheet. Each has been 'grouped' (and sub-grouped) for easy navigation. See the Instructions sheet on how to group and ungroup data."]
[]
[null,"2.7.1 - DESCRIPTOR METRICS BY ZONE"]
[null,"URBAN AND CBD"]
[null,"ZONES","ASSET","Units","VOLUMES\n(0's)"]
[null,null,null,null,{"$f":"IF(dms_RPT=\"financial\",dms_CRYf_y1,dms_CRYc_y1)","v":"2008-09"},{"$f":"IF(dms_RPT=\"financial\",dms_CRYf_y2,dms_CRYc_y2)","v":"2009-10"},{"$f":"IF(dms_RPT=\"financial\",dms_CRYf_y3,dms_CRYc_y3)","v":"2010-11"},{"$f":"IF(dms_RPT=\"financial\",dms_CRYf_y4,dms_CRYc_y4)","v":"2011-12"},{"$f":"IF(dms_RPT=\"financial\",dms_CRYf_y5,dms_CRYc_y5)","v":"2012-13"},{"$f":"IF(dms_RPT=\"financial\",dms_CRYf_y6,dms_CRYc_y6)","v":"2013-14"},{"$f":"IF(dms_RPT=\"financial\",dms_CRYf_y7,dms_CRYc_y7)","v":"2014-15"},{"$f":"IF(dms_RPT=\"financial\",dms_CRYf_y8,dms_CRYc_y8)","v":"2015-16"},{"$f":"IF(dms_RPT=\"financial\",dms_CRYf_y9,dms_CRYc_y9)","v":"2016-17"},{"$f":"IF(dms_RPT=\"financial\",dms_CRYf_y10,dms_CRYc_y10)","v":"2017-18"}]
[null,"ZONE 1","Route line length within zone","KM"]
[null,null,"Number of maintenance spans","0's"]
[null,null,"Total length of maintenance spans","KM"]
[null,null,"Length of vegetation corridors","KM"]
[null,null,"Average number of trees per maintenance span","0's"]
[null,null,"Average frequency of cutting cycle","years"]
[null,"ZONE 2","Route line length within zone","KM"]
[null,null,"Number of maintenance spans","0's","","","","","","","",null,null,""]
[null,null,"Total length of maintenance spans","KM","","","","","","","",null,null,""]
[null,null,"Length of vegetation corridors","KM","","","","","","","",null,null,""]
[null,null,"Average number of trees per maintenance span","0's","","","","","","","",null,null,""]
[null,null,"Average frequency of cutting cycle","years","","","","","","","",null,null,""]
[null,"`","Route line length within zone","KM","","","","","","","",null,null,""]
[null,null,"Number of maintenance spans","0's"]
[null,null,"Total length of maintenance spans","KM","","","","","","","",null,null,""]
[null,null,"Length of vegetation corridors","KM","","","","","","","",null,null,""]
[null,null,"Average number of trees per maintenance span","0's","","","","","","","",null,null,""]
[null,null,"Average frequency of cutting cycle","years","","","","","","","",null,null,""]
[null,"ZONE 4","Route line length within zone","KM","","","","","","","",null,null,""]
[null,null,"Number of maintenance spans","0's","","","","","","","",null,null,""]
[null,null,"Total length of maintenance spans","KM","","","","","","","",null,null,""]
[null,null,"Length of vegetation corridors","KM","","","","","","","",null,null,""]
[null,null,"Average number of trees per maintenance span","0's","","","","","","","",null,null,""]
[null,null,"Average frequency of cutting cycle","years","","","","","","","",null,null,""]
[null,"ZONE 5","Route line length within zone","KM","","","","","","","",null,null,""]
[null,null,"Number of maintenance spans","0's","","","","","","","",null,null,""]
[null,null,"Total length of maintenance spans","KM","","","","","","","",null,null,""]
[null,null,"Length of vegetation corridors","KM","","","","","","","",null,null,""]
[null,null,"Average number of trees per maintenance span","0's","","","","","","","",null,null,""]
[null,null,"Average frequency of cutting cycle","years","","","","","","","",null,null,""]
[null,"ZONE 6","Route line length within zone","KM","","","","","","","",null,null,""]
[null,null,"Number of maintenance spans","0's","","","","","","","",null,null,""]
[null,null,"Total length of maintenance spans","KM","","","","","","","",null,null,""]
[null,null,"Length of vegetation corridors","KM","","","","","","","",null,null,""]
[null,null,"Average number of trees per maintenance span","0's","","","","","","","",null,null,""]
[null,null,"Average frequency of cutting cycle","years","","","","","","","",null,null,""]
[null,"ZONE 7","Route line length within zone","KM","","","","","","","",null,null,""]
[null,null,"Number of maintenance spans","0's","","","","","","","",null,null,""]
[null,null,"Total length of maintenance spans","KM","","","","","","","",null,null,""]
[null,null,"Length of vegetation corridors","KM","","","","","","","",null,null,""]
[null,null,"Average number of trees per maintenance span","0's","","","","","","","",null,null,""]
[null,null,"Average frequency of cutting cycle","years","","","","","","","",null,null,""]
[null,"ZONE 8","Route line length within zone","KM","","","","","","","",null,null,""]
[null,null,"Number of maintenance spans","0's","","","","","","","",null,null,""]
[null,null,"Total length of maintenance spans","KM","","","","","","","",null,null,""]
[null,null,"Length of vegetation corridors","KM","","","","","","","",null,null,""]
[null,null,"Average number of trees per maintenance span","0's","","","","","","","",null,null,""]
[null,null,"Average frequency of cutting cycle","years","","","","","","","",null,null,""]
[null,"ZONE 9","Route line length within zone","KM","","","","","","","",null,null,""]
[null,null,"Number of maintenance spans","0's","","","","","","","",null,null,""]
[null,null,"Total length of maintenance spans","KM","","","","","","","",null,null,""]
[null,null,"Length of vegetation corridors","KM","","","","","","","",null,null,""]
[null,null,"Average number of trees per maintenance span","0's","","","","","","","",null,null,""]
[null,null,"Average frequency of cutting cycle","years","","","","","","","",null,null,""]
[null,"ZONE 10","Route line length within zone","KM","","","","","","","",null,null,""]
[null,null,"Number of maintenance spans","0's","","","","","","","",null,null,""]
[null,null,"Total length of maintenance spans","KM","","","","","","","",null,null,""]
[null,null,"Length of vegetation corridors","KM","","","","","","","",null,null,""]
[null,null,"Average number of trees per maintenance span","0's","","","","","","","",null,null,""]
[null,null,"Average frequency of cutting cycle","years","","","","","","","",null,null,""]
[null,"ZONE 11","Route line length within zone","KM","","","","","","","",null,null,""]
[null,null,"Number of maintenance spans","0's","","","","","","","",null,null,""]
[null,null,"Total length of maintenance spans","KM","","","","","","","",null,null,""]
[null,null,"Length of vegetation corridors","KM","","","","","","","",null,null,""]
[null,null,"Average number of trees per maintenance span","0's","","","","","","","",null,null,""]
[null,null,"Average frequency of cutting cycle","years","","","","","","","",null,null,""]
[null,"ZONE 12","Route line length within zone","KM","","","","","","","",null,null,""]
[null,null,"Number of maintenance spans","0's","","","","","","","",null,null,""]
[null,null,"Total length of maintenance spans","KM","","","","","","","",null,null,""]
[null,null,"Length of vegetation corridors","KM","","","","","","","",null,null,""]
[null,null,"Average number of trees per maintenance span","0's","","","","","","","",null,null,""]
[null,null,"Average frequency of cutting cycle","years","","","","","","","",null,null,""]
[null,"ZONE 13","Route line length within zone","KM","","","","","","","",null,null,""]
[null,null,"Number of maintenance spans","0's","","","","","","","",null,null,""]
[null,null,"Total length of maintenance spans","KM","","","","","","","",null,null,""]
[null,null,"Length of vegetation corridors","KM","","","","","","","",null,null,""]
[null,null,"Average number of trees per maintenance span","0's","","","","","","","",null,null,""]
[null,null,"Average frequency of cutting cycle","years","","","","","","","",null,null,""]
[null,"ZONE 14","Route line length within zone","KM","","","","","","","",null,null,""]
[null,null,"Number of maintenance spans","0's","","","","","","","",null,null,""]
[null,null,"Total length of maintenance spans","KM","","","","","","","",null,null,""]
[null,null,"Length of vegetation corridors","KM","","","","","","","",null,null,""]
[null,null,"Average number of trees per maintenance span","0's","","","","","","","",null,null,""]
[null,null,"Average frequency of cutting cycle","years","","","","","","","",null,null,""]
[null,"ZONE 15","Route line length within zone","KM","","","","","","","",null,null,""]
[null,null,"Number of maintenance spans","0's","","","","","","","",null,null,""]
[null,null,"Total length of maintenance spans","KM","","","","","","","",null,null,""]
[null,null,"Length of vegetation corridors","KM","","","","","","","",null,null,""]
[null,null,"Average number of trees per maintenance span","0's","","","","","","","",null,null,""]
[null,null,"Average frequency of cutting cycle","years","","","","","","","",null,null,""]
[null,"ZONE 16","Route line length within zone","KM","","","","","","","",null,null,""]
[null,null,"Number of maintenance spans","0's","","","","","","","",null,null,""]
[null,null,"Total length of maintenance spans","KM","","","","","","","",null,null,""]
[null,null,"Length of vegetation corridors","KM","","","","","","","",null,null,""]
[null,null,"Average number of trees per maintenance span","0's","","","","","","","",null,null,""]
[null,null,"Average frequency of cutting cycle","years","","","","","","","",null,null,""]
[null,"ZONE 17","Route line length within zone","KM","","","","","","","",null,null,""]
[null,null,"Number of maintenance spans","0's","","","","","","","",null,null,""]
[null,null,"Total length of maintenance spans","KM","","","","","","","",null,null,""]
[null,null,"Length of vegetation corridors","KM","","","","","","","",null,null,""]
[null,null,"Average number of trees per maintenance span","0's","","","","","","","",null,null,""]
[null,null,"Average frequency of cutting cycle","years","","","","","","","",null,null,""]
[null,"ZONE 18","Route line length within zone","KM","","","","","","","",null,null,""]
[null,null,"Number of maintenance spans","0's","","","","","","","",null,null,""]
[null,null,"Total length of maintenance spans","KM","","","","","","","",null,null,""]
[null,null,"Length of vegetation corridors","KM","","","","","","","",null,null,""]
[null,null,"Average number of trees per maintenance span","0's","","","","","","","",null,null,""]
[null,null,"Average frequency of cutting cycle","years","","","","","","","",null,null,""]
[]
[null,"RURAL"]
[null,"ZONES","ASSET","Units","VOLUMES\n(0's)"]
[null,null,null,null,{"$f":"IF(dms_RPT=\"financial\",dms_CRYf_y1,dms_CRYc_y1)","v":"2008-09"},{"$f":"IF(dms_RPT=\"financial\",dms_CRYf_y2,dms_CRYc_y2)","v":"2009-10"},{"$f":"IF(dms_RPT=\"financial\",dms_CRYf_y3,dms_CRYc_y3)","v":"2010-11"},{"$f":"IF(dms_RPT=\"financial\",dms_CRYf_y4,dms_CRYc_y4)","v":"2011-12"},{"$f":"IF(dms_RPT=\"financial\",dms_CRYf_y5,dms_CRYc_y5)","v":"2012-13"},{"$f":"IF(dms_RPT=\"financial\",dms_CRYf_y6,dms_CRYc_y6)","v":"2013-14"},{"$f":"IF(dms_RPT=\"financial\",dms_CRYf_y7,dms_CRYc_y7)","v":"2014-15"},{"$f":"IF(dms_RPT=\"financial\",dms_CRYf_y8,dms_CRYc_y8)","v":"2015-16"},{"$f":"IF(dms_RPT=\"financial\",dms_CRYf_y9,dms_CRYc_y9)","v":"2016-17"},{"$f":"IF(dms_RPT=\"financial\",dms_CRYf_y10,dms_CRYc_y10)","v":"2017-18"}]
[null,{"$f":"IF(ISBLANK(B12),\"\",B12)","v":"ZONE 1"},"Route line length within zone","KM"]
[null,null,"Number of maintenance spans","0's"]
[null,null,"Total length of maintenance spans","KM"]
[null,null,"Length of vegetation corridors","KM"]
[null,null,"Average number of trees per maintenance span","0's"]
[null,null,"Average frequency of cutting cycle","years"]
[null,{"$f":"IF(ISBLANK(B18),\"\",B18)","v":"ZONE 2"},"Route line length within zone","KM"]
[null,null,"Number of maintenance spans","0's","","","","","","","",null,null,""]
[null,null,"Total length of maintenance spans","KM","","","","","","","",null,null,""]
[null,null,"Length of vegetation corridors","KM","","","","","","","",null,null,""]
[null,null,"Average number of trees per maintenance span","0's","","","","","","","",null,null,""]
[null,null,"Average frequency of cutting cycle","years","","","","","","","",null,null,""]
[null,{"$f":"IF(ISBLANK(B24),\"\",B24)","v":"`"},"Route line length within zone","KM","","","","","","","",null,null,""]
[null,null,"Number of maintenance spans","0's"]
[null,null,"Total length of maintenance spans","KM","","","","","","","",null,null,""]
[null,null,"Length of vegetation corridors","KM","","","","","","","",null,null,""]
[null,null,"Average number of trees per maintenance span","0's","","","","","","","",null,null,""]
[null,null,"Average frequency of cutting cycle","years","","","","","","","",null,null,""]
[null,{"$f":"IF(ISBLANK(B30),\"\",B30)","v":"ZONE 4"},"Route line length within zone","KM","","","","","","","",null,null,""]
[null,null,"Number of maintenance spans","0's","","","","","","","",null,null,""]
[null,null,"Total length of maintenance spans","KM","","","","","","","",null,null,""]
[null,null,"Length of vegetation corridors","KM","","","","","","","",null,null,""]
[null,null,"Average number of trees per maintenance span","0's","","","","","","","",null,null,""]
[null,null,"Average frequency of cutting cycle","years","","","","","","","",null,null,""]
[null,{"$f":"IF(ISBLANK(B36),\"\",B36)","v":"ZONE 5"},"Route line length within zone","KM","","","","","","","",null,null,""]
[null,null,"Number of maintenance spans","0's","","","","","","","",null,null,""]
[null,null,"Total length of maintenance spans","KM","","","","","","","",null,null,""]
[null,null,"Length of vegetation corridors","KM","","","","","","","",null,null,""]
[null,null,"Average number of trees per maintenance span","0's","","","","","","","",null,null,""]
[null,null,"Average frequency of cutting cycle","years","","","","","","","",null,null,""]
[null,{"$f":"IF(ISBLANK(B42),\"\",B42)","v":"ZONE 6"},"Route line length within zone","KM","","","","","","","",null,null,""]
[null,null,"Number of maintenance spans","0's","","","","","","","",null,null,""]
[null,null,"Total length of maintenance spans","KM","","","","","","","",null,null,""]
[null,null,"Length of vegetation corridors","KM","","","","","","","",null,null,""]
[null,null,"Average number of trees per maintenance span","0's","","","","","","","",null,null,""]
[null,null,"Average frequency of cutting cycle","years","","","","","","","",null,null,""]
[null,{"$f":"IF(ISBLANK(B48),\"\",B48)","v":"ZONE 7"},"Route line length within zone","KM","","","","","","","",null,null,""]
[null,null,"Number of maintenance spans","0's","","","","","","","",null,null,""]
[null,null,"Total length of maintenance spans","KM","","","","","","","",null,null,""]
[null,null,"Length of vegetation corridors","KM","","","","","","","",null,null,""]
[null,null,"Average number of trees per maintenance span","0's","","","","","","","",null,null,""]
[null,null,"Average frequency of cutting cycle","years","","","","","","","",null,null,""]
[null,{"$f":"IF(ISBLANK(B54),\"\",B54)","v":"ZONE 8"},"Route line length within zone","KM","","","","","","","",null,null,""]
[null,null,"Number of maintenance spans","0's","","","","","","","",null,null,""]
[null,null,"Total length of maintenance spans","KM","","","","","","","",null,null,""]
[null,null,"Length of vegetation corridors","KM","","","","","","","",null,null,""]
[null,null,"Average number of trees per maintenance span","0's","","","","","","","",null,null,""]
[null,null,"Average frequency of cutting cycle","years","","","","","","","",null,null,""]
[null,{"$f":"IF(ISBLANK(B60),\"\",B60)","v":"ZONE 9"},"Route line length within zone","KM","","","","","","","",null,null,""]
[null,null,"Number of maintenance spans","0's","","","","","","","",null,null,""]
[null,null,"Total length of maintenance spans","KM","","","","","","","",null,null,""]
[null,null,"Length of vegetation corridors","KM","","","","","","","",null,null,""]
[null,null,"Average number of trees per maintenance span","0's","","","","","","","",null,null,""]
[null,null,"Average frequency of cutting cycle","years","","","","","","","",null,null,""]
[null,{"$f":"IF(ISBLANK(B66),\"\",B66)","v":"ZONE 10"},"Route line length within zone","KM","","","","","","","",null,null,""]
[null,null,"Number of maintenance spans","0's","","","","","","","",null,null,""]
[null,null,"Total length of maintenance spans","KM","","","","","","","",null,null,""]
[null,null,"Length of vegetation corridors","KM","","","","","","","",null,null,""]
[null,null,"Average number of trees per maintenance span","0's","","","","","","","",null,null,""]
[null,null,"Average frequency of cutting cycle","years","","","","","","","",null,null,""]
[null,{"$f":"IF(ISBLANK(B72),\"\",B72)","v":"ZONE 11"},"Route line length within zone","KM","","","","","","","",null,null,""]
[null,null,"Number of maintenance spans","0's","","","","","","","",null,null,""]
[null,null,"Total length of maintenance spans","KM","","","","","","","",null,null,""]
[null,null,"Length of vegetation corridors","KM","","","","","","","",null,null,""]
[null,null,"Average number of trees per maintenance span","0's","","","","","","","",null,null,""]
[null,null,"Average frequency of cutting cycle","years","","","","","","","",null,null,""]
[null,{"$f":"IF(ISBLANK(B78),\"\",B78)","v":"ZONE 12"},"Route line length within zone","KM","","","","","","","",null,null,""]
[null,null,"Number of maintenance spans","0's","","","","","","","",null,null,""]
[null,null,"Total length of maintenance spans","KM","","","","","","","",null,null,""]
[null,null,"Length of vegetation corridors","KM","","","","","","","",null,null,""]
[null,null,"Average number of trees per maintenance span","0's","","","","","","","",null,null,""]
[null,null,"Average frequency of cutting cycle","years","","","","","","","",null,null,""]
[null,{"$f":"IF(ISBLANK(B84),\"\",B84)","v":"ZONE 13"},"Route line length within zone","KM","","","","","","","",null,null,""]
[null,null,"Number of maintenance spans","0's","","","","","","","",null,null,""]
[null,null,"Total length of maintenance spans","KM","","","","","","","",null,null,""]
[null,null,"Length of vegetation corridors","KM","","","","","","","",null,null,""]
[null,null,"Average number of trees per maintenance span","0's","","","","","","","",null,null,""]
[null,null,"Average frequency of cutting cycle","years","","","","","","","",null,null,""]
[null,{"$f":"IF(ISBLANK(B90),\"\",B90)","v":"ZONE 14"},"Route line length within zone","KM","","","","","","","",null,null,""]
[null,null,"Number of maintenance spans","0's","","","","","","","",null,null,""]
[null,null,"Total length of maintenance spans","KM","","","","","","","",null,null,""]
[null,null,"Length of vegetation corridors","KM","","","","","","","",null,null,""]
[null,null,"Average number of trees per maintenance span","0's","","","","","","","",null,null,""]
[null,null,"Average frequency of cutting cycle","years","","","","","","","",null,null,""]
[null,{"$f":"IF(ISBLANK(B96),\"\",B96)","v":"ZONE 15"},"Route line length within zone","KM","","","","","","","",null,null,""]
[null,null,"Number of maintenance spans","0's","","","","","","","",null,null,""]
[null,null,"Total length of maintenance spans","KM","","","","","","","",null,null,""]
[null,null,"Length of vegetation corridors","KM","","","","","","","",null,null,""]
[null,null,"Average number of trees per maintenance span","0's","","","","","","","",null,null,""]
[null,null,"Average frequency of cutting cycle","years","","","","","","","",null,null,""]
[null,{"$f":"IF(ISBLANK(B102),\"\",B102)","v":"ZONE 16"},"Route line length within zone","KM","","","","","","","",null,null,""]
[null,null,"Number of maintenance spans","0's","","","","","","","",null,null,""]
[null,null,"Total length of maintenance spans","KM","","","","","","","",null,null,""]
[null,null,"Length of vegetation corridors","KM","","","","","","","",null,null,""]
[null,null,"Average number of trees per maintenance span","0's","","","","","","","",null,null,""]
[null,null,"Average frequency of cutting cycle","years","","","","","","","",null,null,""]
[null,{"$f":"IF(ISBLANK(B108),\"\",B108)","v":"ZONE 17"},"Route line length within zone","KM","","","","","","","",null,null,""]
[null,null,"Number of maintenance spans","0's","","","","","","","",null,null,""]
[null,null,"Total length of maintenance spans","KM","","","","","","","",null,null,""]
[null,null,"Length of vegetation corridors","KM","","","","","","","",null,null,""]
[null,null,"Average number of trees per maintenance span","0's","","","","","","","",null,null,""]
[null,null,"Average frequency of cutting cycle","years","","","","","","","",null,null,""]
[null,{"$f":"IF(ISBLANK(B114),\"\",B114)","v":"ZONE 18"},"Route line length within zone","KM","","","","","","","",null,null,""]
[null,null,"Number of maintenance spans","0's","","","","","","","",null,null,""]
[null,null,"Total length of maintenance spans","KM","","","","","","","",null,null,""]
[null,null,"Length of vegetation corridors","KM","","","","","","","",null,null,""]
[null,null,"Average number of trees per maintenance span","0's","","","","","","","",null,null,""]
[null,null,"Average frequency of cutting cycle","years","","","","","","","",null,null,""]
[]
[]
[null,"2.7.2 - EXPENDITURE METRICS BY ZONE"]
[null,null,null,null,"EXPENDITURE\n($0's)"]
[null,"ZONES","SERVICE SUBCATEGORY",null,{"$f":"IF(dms_RPT=\"financial\",dms_CRYf_y1,dms_CRYc_y1)","v":"2008-09"},{"$f":"IF(dms_RPT=\"financial\",dms_CRYf_y2,dms_CRYc_y2)","v":"2009-10"},{"$f":"IF(dms_RPT=\"financial\",dms_CRYf_y3,dms_CRYc_y3)","v":"2010-11"},{"$f":"IF(dms_RPT=\"financial\",dms_CRYf_y4,dms_CRYc_y4)","v":"2011-12"},{"$f":"IF(dms_RPT=\"financial\",dms_CRYf_y5,dms_CRYc_y5)","v":"2012-13"},{"$f":"IF(dms_RPT=\"financial\",dms_CRYf_y6,dms_CRYc_y6)","v":"2013-14"},{"$f":"IF(dms_RPT=\"financial\",dms_CRYf_y7,dms_CRYc_y7)","v":"2014-15"},{"$f":"IF(dms_RPT=\"financial\",dms_CRYf_y8,dms_CRYc_y8)","v":"2015-16"},{"$f":"IF(dms_RPT=\"financial\",dms_CRYf_y9,dms_CRYc_y9)","v":"2016-17"},{"$f":"IF(dms_RPT=\"financial\",dms_CRYf_y10,dms_CRYc_y10)","v":"2017-18"}]
[null,{"$f":"IF(ISBLANK(B12),\"\",B12)","v":"ZONE 1"},"Tree trimming (excluding hazard trees) "]
[null,null,"Hazard tree cutting "]
[null,null,"Ground clearance "]
[null,null,"Vegetation corridor clearance "]
[null,null,"Inspection "]
[null,null,"Vegetation audit "]
[null,null,"Contractor liaison expenditure "]
[null,null,"Tree replacement program costs ",null,"","","","","","","",null,null,""]
[null,null,"Other vegetation management costs not specified in sheet ",null,"","","","","","","",null,null,""]
[null,{"$f":"IF(ISBLANK(B18),\"\",B18)","v":"ZONE 2"},"Tree trimming (excluding hazard trees) ",null,"","","","","","","",null,null,""]
[null,null,"Hazard tree cutting "]
[null,null,"Ground clearance "]
[null,null,"Vegetation corridor clearance ",null,"","","","","","","",null,null,""]
[null,null,"Inspection "]
[null,null,"Vegetation audit "]
[null,null,"Contractor liaison expenditure ",null,"","","","","","","",null,null,""]
[null,null,"Tree replacement program costs ",null,"","","","","","","",null,null,""]
[null,null,"Other vegetation management costs not specified in sheet ",null,"","","","","","","",null,null,""]
[null,{"$f":"IF(ISBLANK(B24),\"\",B24)","v":"`"},"Tree trimming (excluding hazard trees) ",null,"","","","","","","",null,null,""]
[null,null,"Hazard tree cutting "]
[null,null,"Ground clearance "]
[null,null,"Vegetation corridor clearance ",null,"","","","","","","",null,null,""]
[null,null,"Inspection "]
[null,null,"Vegetation audit "]
[null,null,"Contractor liaison expenditure ",null,"","","","","","","",null,null,""]
[null,null,"Tree replacement program costs ",null,"","","","","","","",null,null,""]
[null,null,"Other vegetation management costs not specified in sheet ",null,"","","","","","","",null,null,""]
[null,{"$f":"IF(ISBLANK(B30),\"\",B30)","v":"ZONE 4"},"Tree trimming (excluding hazard trees) ",null,"","","","","","","",null,null,""]
[null,null,"Hazard tree cutting "]
[null,null,"Ground clearance "]
[null,null,"Vegetation corridor clearance ",null,"","","","","","","",null,null,""]
[null,null,"Inspection "]
[null,null,"Vegetation audit "]
[null,null,"Contractor liaison expenditure ",null,"","","","","","","",null,null,""]
[null,null,"Tree replacement program costs ",null,"","","","","","","",null,null,""]
[null,null,"Other vegetation management costs not specified in sheet ",null,"","","","","","","",null,null,""]
[null,{"$f":"IF(ISBLANK(B36),\"\",B36)","v":"ZONE 5"},"Tree trimming (excluding hazard trees) ",null,"","","","","","","",null,null,""]
[null,null,"Hazard tree cutting "]
[null,null,"Ground clearance "]
[null,null,"Vegetation corridor clearance ",null,"","","","","","","",null,null,""]
[null,null,"Inspection "]
[null,null,"Vegetation audit "]
[null,null,"Contractor liaison expenditure ",null,"","","","","","","",null,null,""]
[null,null,"Tree replacement program costs ",null,"","","","","","","",null,null,""]
[null,null,"Other vegetation management costs not specified in sheet ",null,"","","","","","","",null,null,""]
[null,{"$f":"IF(ISBLANK(B42),\"\",B42)","v":"ZONE 6"},"Tree trimming (excluding hazard trees) ",null,"","","","","","","",null,null,""]
[null,null,"Hazard tree cutting "]
[null,null,"Ground clearance "]
[null,null,"Vegetation corridor clearance ",null,"","","","","","","",null,null,""]
[null,null,"Inspection "]
[null,null,"Vegetation audit "]
[null,null,"Contractor liaison expenditure ",null,"","","","","","","",null,null,""]
[null,null,"Tree replacement program costs ",null,"","","","","","","",null,null,""]
[null,null,"Other vegetation management costs not specified in sheet ",null,"","","","","","","",null,null,""]
[null,{"$f":"IF(ISBLANK(B48),\"\",B48)","v":"ZONE 7"},"Tree trimming (excluding hazard trees) ",null,"","","","","","","",null,null,""]
[null,null,"Hazard tree cutting "]
[null,null,"Ground clearance "]
[null,null,"Vegetation corridor clearance ",null,"","","","","","","",null,null,""]
[null,null,"Inspection "]
[null,null,"Vegetation audit "]
[null,null,"Contractor liaison expenditure ",null,"","","","","","","",null,null,""]
[null,null,"Tree replacement program costs ",null,"","","","","","","",null,null,""]
[null,null,"Other vegetation management costs not specified in sheet ",null,"","","","","","","",null,null,""]
[null,{"$f":"IF(ISBLANK(B54),\"\",B54)","v":"ZONE 8"},"Tree trimming (excluding hazard trees) ",null,"","","","","","","",null,null,""]
[null,null,"Hazard tree cutting "]
[null,null,"Ground clearance "]
[null,null,"Vegetation corridor clearance ",null,"","","","","","","",null,null,""]
[null,null,"Inspection "]
[null,null,"Vegetation audit "]
[null,null,"Contractor liaison expenditure ",null,"","","","","","","",null,null,""]
[null,null,"Tree replacement program costs ",null,"","","","","","","",null,null,""]
[null,null,"Other vegetation management costs not specified in sheet ",null,"","","","","","","",null,null,""]
[null,{"$f":"IF(ISBLANK(B60),\"\",B60)","v":"ZONE 9"},"Tree trimming (excluding hazard trees) ",null,"","","","","","","",null,null,""]
[null,null,"Hazard tree cutting "]
[null,null,"Ground clearance "]
[null,null,"Vegetation corridor clearance ",null,"","","","","","","",null,null,""]
[null,null,"Inspection "]
[null,null,"Vegetation audit "]
[null,null,"Contractor liaison expenditure ",null,"","","","","","","",null,null,""]
[null,null,"Tree replacement program costs ",null,"","","","","","","",null,null,""]
[null,null,"Other vegetation management costs not specified in sheet ",null,"","","","","","","",null,null,""]
[null,{"$f":"IF(ISBLANK(B66),\"\",B66)","v":"ZONE 10"},"Tree trimming (excluding hazard trees) ",null,"","","","","","","",null,null,""]
[null,null,"Hazard tree cutting "]
[null,null,"Ground clearance "]
[null,null,"Vegetation corridor clearance ",null,"","","","","","","",null,null,""]
[null,null,"Inspection "]
[null,null,"Vegetation audit "]
[null,null,"Contractor liaison expenditure ",null,"","","","","","","",null,null,""]
[null,null,"Tree replacement program costs ",null,"","","","","","","",null,null,""]
[null,null,"Other vegetation management costs not specified in sheet ",null,"","","","","","","",null,null,""]
[null,{"$f":"IF(ISBLANK(B72),\"\",B72)","v":"ZONE 11"},"Tree trimming (excluding hazard trees) ",null,"","","","","","","",null,null,""]
[null,null,"Hazard tree cutting "]
[null,null,"Ground clearance "]
[null,null,"Vegetation corridor clearance ",null,"","","","","","","",null,null,""]
[null,null,"Inspection "]
[null,null,"Vegetation audit "]
[null,null,"Contractor liaison expenditure ",null,"","","","","","","",null,null,""]
[null,null,"Tree replacement program costs ",null,"","","","","","","",null,null,""]
[null,null,"Other vegetation management costs not specified in sheet ",null,"","","","","","","",null,null,""]
[null,{"$f":"IF(ISBLANK(B78),\"\",B78)","v":"ZONE 12"},"Tree trimming (excluding hazard trees) ",null,"","","","","","","",null,null,""]
[null,null,"Hazard tree cutting "]
[null,null,"Ground clearance "]
[null,null,"Vegetation corridor clearance ",null,"","","","","","","",null,null,""]
[null,null,"Inspection "]
[null,null,"Vegetation audit "]
[null,null,"Contractor liaison expenditure ",null,"","","","","","","",null,null,""]
[null,null,"Tree replacement program costs ",null,"","","","","","","",null,null,""]
[null,null,"Other vegetation management costs not specified in sheet ",null,"","","","","","","",null,null,""]
[null,{"$f":"IF(ISBLANK(B84),\"\",B84)","v":"ZONE 13"},"Tree trimming (excluding hazard trees) ",null,"","","","","","","",null,null,""]
[null,null,"Hazard tree cutting "]
[null,null,"Ground clearance "]
[null,null,"Vegetation corridor clearance ",null,"","","","","","","",null,null,""]
[null,null,"Inspection "]
[null,null,"Vegetation audit "]
[null,null,"Contractor liaison expenditure ",null,"","","","","","","",null,null,""]
[null,null,"Tree replacement program costs ",null,"","","","","","","",null,null,""]
[null,null,"Other vegetation management costs not specified in sheet ",null,"","","","","","","",null,null,""]
[null,{"$f":"IF(ISBLANK(B90),\"\",B90)","v":"ZONE 14"},"Tree trimming (excluding hazard trees) ",null,"","","","","","","",null,null,""]
[null,null,"Hazard tree cutting "]
[null,null,"Ground clearance "]
[null,null,"Vegetation corridor clearance ",null,"","","","","","","",null,null,""]
[null,null,"Inspection "]
[null,null,"Vegetation audit "]
[null,null,"Contractor liaison expenditure ",null,"","","","","","","",null,null,""]
[null,null,"Tree replacement program costs ",null,"","","","","","","",null,null,""]
[null,null,"Other vegetation management costs not specified in sheet ",null,"","","","","","","",null,null,""]
[null,{"$f":"IF(ISBLANK(B96),\"\",B96)","v":"ZONE 15"},"Tree trimming (excluding hazard trees) ",null,"","","","","","","",null,null,""]
[null,null,"Hazard tree cutting "]
[null,null,"Ground clearance "]
[null,null,"Vegetation corridor clearance ",null,"","","","","","","",null,null,""]
[null,null,"Inspection "]
[null,null,"Vegetation audit "]
[null,null,"Contractor liaison expenditure ",null,"","","","","","","",null,null,""]
[null,null,"Tree replacement program costs ",null,"","","","","","","",null,null,""]
[null,null,"Other vegetation management costs not specified in sheet ",null,"","","","","","","",null,null,""]
[null,{"$f":"IF(ISBLANK(B102),\"\",B102)","v":"ZONE 16"},"Tree trimming (excluding hazard trees) ",null,"","","","","","","",null,null,""]
[null,null,"Hazard tree cutting "]
[null,null,"Ground clearance "]
[null,null,"Vegetation corridor clearance ",null,"","","","","","","",null,null,""]
[null,null,"Inspection "]
[null,null,"Vegetation audit "]
[null,null,"Contractor liaison expenditure ",null,"","","","","","","",null,null,""]
[null,null,"Tree replacement program costs ",null,"","","","","","","",null,null,""]
[null,null,"Other vegetation management costs not specified in sheet ",null,"","","","","","","",null,null,""]
[null,{"$f":"IF(ISBLANK(B108),\"\",B108)","v":"ZONE 17"},"Tree trimming (excluding hazard trees) ",null,"","","","","","","",null,null,""]
[null,null,"Hazard tree cutting "]
[null,null,"Ground clearance "]
[null,null,"Vegetation corridor clearance ",null,"","","","","","","",null,null,""]
[null,null,"Inspection "]
[null,null,"Vegetation audit "]
[null,null,"Contractor liaison expenditure ",null,"","","","","","","",null,null,""]
[null,null,"Tree replacement program costs ",null,"","","","","","","",null,null,""]
[null,null,"Other vegetation management costs not specified in sheet ",null,"","","","","","","",null,null,""]
[null,{"$f":"IF(ISBLANK(B114),\"\",B114)","v":"ZONE 18"},"Tree trimming (excluding hazard trees) ",null,"","","","","","","",null,null,""]
[null,null,"Hazard tree cutting "]
[null,null,"Ground clearance "]
[null,null,"Vegetation corridor clearance ",null,"","","","","","","",null,null,""]
[null,null,"Inspection "]
[null,null,"Vegetation audit "]
[null,null,"Contractor liaison expenditure ",null,"","","","","","","",null,null,""]
[null,null,"Tree replacement program costs ",null,"","","","","","","",null,null,""]
[null,null,"Other vegetation management costs not specified in sheet ",null,"","","","","","","",null,null,""]
[]
[null,"2.7.3 - DESCRIPTOR METRICS ACROSS ALL ZONES - UNPLANNED VEGETATION EVENTS"]
[null,null,null,null,"VOLUMES\n(0's)"]
[null,"DESCRIPTOR METRIC",null,null,{"$f":"IF(dms_RPT=\"financial\",dms_CRYf_y1,dms_CRYc_y1)","v":"2008-09"},{"$f":"IF(dms_RPT=\"financial\",dms_CRYf_y2,dms_CRYc_y2)","v":"2009-10"},{"$f":"IF(dms_RPT=\"financial\",dms_CRYf_y3,dms_CRYc_y3)","v":"2010-11"},{"$f":"IF(dms_RPT=\"financial\",dms_CRYf_y4,dms_CRYc_y4)","v":"2011-12"},{"$f":"IF(dms_RPT=\"financial\",dms_CRYf_y5,dms_CRYc_y5)","v":"2012-13"},{"$f":"IF(dms_RPT=\"financial\",dms_CRYf_y6,dms_CRYc_y6)","v":"2013-14"},{"$f":"IF(dms_RPT=\"financial\",dms_CRYf_y7,dms_CRYc_y7)","v":"2014-15"},{"$f":"IF(dms_RPT=\"financial\",dms_CRYf_y8,dms_CRYc_y8)","v":"2015-16"},{"$f":"IF(dms_RPT=\"financial\",dms_CRYf_y9,dms_CRYc_y9)","v":"2016-17"},{"$f":"IF(dms_RPT=\"financial\",dms_CRYf_y10,dms_CRYc_y10)","v":"2017-18"}]
[null,"Number of fire starts caused by vegetation grow-ins (NSP responsibility)",null,null,"","","","","","","",null,null,""]
[null,"Number of fire starts caused by vegetation blow-ins and fall-ins (NSP responsibility)",null,null,"","","","","","","",null,null,""]
[null,"Number of fire starts caused by vegetation grow-ins (other party responsibility)",null,null,"","","","","","","",null,null,""]
[null,"Number of fire starts caused by vegetation blow-ins and fall-ins (other party responsibility)",null,null,"","","","","","","",null,null,""]

{"sheet":"2.8 Maintenance","index":13,"n_rows":166,"n_cols":19,"rows_kept":166,"cut":false,"hidden":false,"merged":[[9,16,10,16],[9,17,11,17],[9,18,11,18],[10,5,10,14],[149,1,150,1],[49,5,49,14],[129,5,129,14],[130,5,130,14],[68,1,69,1],[5,1,5,2],[29,1,30,1],[90,5,90,14],[91,5,91,14],[110,1,111,1],[48,5,48,14],[9,5,9,14]]}
[null,"REGULATORY REPORTING STATEMENT"]
[null,{"$f":"INDEX(dms_TradingNameFull_List,MATCH(dms_TradingName,dms_TradingName_List))","v":"SA Power Networks"}]
[null,{"$f":"IF(SUM(dms_SingleYear_Model)>0,(\"CATEGORY ANALYSIS \"&CRY&\" to \"&FRY),(\"CATEGORY ANALYSIS \"&CRY))","v":"CATEGORY ANALYSIS 2008-09 to 2018-19"}]
[null,"2.8 MAINTENANCE"]
[]
[null,"There are TWO tables on this worksheet. It has been 'grouped' (and sub-grouped) for easy navigation.  See the Instructions sheet on how to group or ungroup data."]
[]
[null,"2.8.1 - DESCRIPTOR METRICS FOR ROUTINE AND NON-ROUTINE MAINTENANCE"]
[null,"ASSET QUANTITY AT YEAR END"]
[null,null,null,null,null,"VOLUME",null,null,null,null,null,null,null,null,null,null,"AVERAGE AGE OF ASSET GROUP ","INSPECTION \nCYCLE \n(YEARS)","MAINTENANCE \nCYCLE \n(YEARS)"]
[null,null,null,null,null,"(0's)"]
[null,"MAINTENANCE ACTIVITY","MAINTENANCE ASSET CATEGORY","ASSET QUANTITY","Units",{"$f":"IF(dms_RPT=\"financial\",dms_CRYf_y1,dms_CRYc_y1)","v":"2008-09"},{"$f":"IF(dms_RPT=\"financial\",dms_CRYf_y2,dms_CRYc_y2)","v":"2009-10"},{"$f":"IF(dms_RPT=\"financial\",dms_CRYf_y3,dms_CRYc_y3)","v":"2010-11"},{"$f":"IF(dms_RPT=\"financial\",dms_CRYf_y4,dms_CRYc_y4)","v":"2011-12"},{"$f":"IF(dms_RPT=\"financial\",dms_CRYf_y5,dms_CRYc_y5)","v":"2012-13"},{"$f":"IF(dms_RPT=\"financial\",dms_CRYf_y6,dms_CRYc_y6)","v":"2013-14"},{"$f":"IF(dms_RPT=\"financial\",dms_CRYf_y7,dms_CRYc_y7)","v":"2014-15"},{"$f":"IF(dms_RPT=\"financial\",dms_CRYf_y8,dms_CRYc_y8)","v":"2015-16"},{"$f":"IF(dms_RPT=\"financial\",dms_CRYf_y9,dms_CRYc_y9)","v":"2016-17"},{"$f":"IF(dms_RPT=\"financial\",dms_CRYf_y10,dms_CRYc_y10)","v":"2017-18"},null,{"$f":"dms_CRCP_FinalYear_Result","v":"2018-19"}]
[null,"Pole top, overhead line & service line maintenance","Pole tops and overhead lines","Number of poles","Number",730110,731860,733780,736217,739635,744856,745860,745696,745140,647497,null,45.6,5,0]
[null,null,"Service lines","Number of customers","Number",704667,714037,722809,730127,736831,751851,758917,767814,776103,796125,null,28.64,10,0]
[null,"Pole inspection and treatment","All poles","Number of poles","Number",0,0,0,0,0,744856,745860,745696,745140,647497,null,45.6,5,0]
[null,"Overhead asset inspection","All overhead assets","Line patrolled (route KM)","KM",0,0,0,0,0,65296,65355,71863,71222,65326,null,50.5,5,0]
[null,"Network underground cable maintenance: by voltage","LV - 11 to 22 KV","Length (KM)","KM",15713,15963,16263,16520,16570,16757,16800,17314,17581,17876,null,24,0,0]
[null,null,"33 KV and above","Length (KM)","KM",142,147,154,159,161,164,170,53,172,188,null,28.9,0.5,0]
[null,"Network underground cable maintenance: by location","Cbd","Length (KM)","KM",476,483,493,500,502,507,509,521,266,272,null,28.9,0,0]
[null,null,"Non-CBD","Length (KM)","KM",15380,15627,15925,16179,16230,16413,16461,16846,17487,17792,null,24,0,0]
[null,"Distribution substation equipment & property maintenance","Distribution substation transformers","Number of installed transformers","Number",70285,72181,73400,74408,75042,75559,74624,75616,77847,75945,null,30.2,5,0]
[null,null,"Distribution substation switchgear\n (within-substations and stand-alone switchgear)","Number of switches","Number",10923,11497,12046,12660,13030,13971,8235,8287,10107,9621,null,13.9,1,0]
[null,null,"Distribution substation - other equipment","Earth mat","Number",485,0,0,0,0,0,0,0,0,0,null,0,0,0]
[null,null,"Distribution substation - property","Number of distribution substation properties maintained","Number",0,0,0,0,0,1419,1420,1416,721,730,null,41,0,0]
[null,"Zone substation equipment maintenance","Transformers - zone substation","Number","Number",651,669,686,702,708,696,697,694,693,750,null,31.425000000000001,0.5,6]
[null,null,"Transformers - distribution","Number of distribution transformers within zone substation","Number",172,185,209,226,246,267,285,346,324,338,null,21,0.5,0]
[null,null,"Transformers - HV","Number of HV transformers","Number",0,0,0,0,0,0,0,0,0,0,null,0,0,0]
[null,null,"Zone substation - other equipment","<DNSP to nominate>",{"$f":"D28","v":"<DNSP to nominate>"},317,318,322,324,324,332,339,348,355,341,null,5.5,0.5,10]
[null,"Zone substation property maintenance","All zone substation properties","Number of zone substation properties maintained","Number",406,407,413,408,408,406,407,410,416,417,null,42,0.5,4.5]
[null,"Public lighting maintenance","Minor roads","Number of public lights maintained","Number",0,0,0,0,0,0,0,0,0,0,null,0,0,0]
[null,null,"Major roads","Number of public lights maintained","Number",0,0,0,0,0,0,0,0,0,0,null,0,0,0]
[null,"SCADA & network control maintenance","SCADA & network control","Number of systems","Number",235,242,255,252,272,299,319,331,340,345,null,10,0,0]
[null,"Protection systems maintenance","Protection systems","Number of systems","Number",11972,12126,12275,12426,12566,2886,2963,2989,3002,6491,null,34.6,0.5,4.5]
[null,"Subtransmission asset maintenance","Subtransmission asset maintenance\n- for DNSPs with dual function assets","<DNSP to nominate>",{"$f":"D34","v":"<DNSP to nominate>"},0,0,0,0,0,0,0,0,0,0,null,0,0,0]
[null,"Various assets"," includes rates, electricity, communications equip, metering","Various","Number",1576,1757,1943,2149,2360,42,5089,5418,5615,6045,null,11,1.5,1.5]
[null,"Ground clearance - access tracks","Access tracks","Number","Number",0,0,0,0,0,0,0,0,0,0,null,0,0,0]
[null,"Other","(1) Substation asset inspection","No. of sites",null,397,396,400,395,402,0,400,406,408,408,null,42,0.5,0]
[null,null,"(2) Zone substation equipment maintenance (switchgear) ","No. of CBs and disconnectors",null,4794,4956,5141,5421,5538,0,5901,6001,5996,5920,null,33.5,0.5,4.5]
[null,null,"(3) Numbers of signages and IDs replaced ","No. of sites",null,0,0,0,0,0,0,74624,75616,78864,75945,null,0,0,0]
[null,null,"(4) Power Station Maintenance, Asset Records Feeder Diagram Maintenance,  Compliance Audting, Asset Location Services, Customer Service Penalties","Units not quoted as various UOM",null,0,0,0,0,0,0,0,0,0,0,null,0,0,0]
[]
[]
[]
[]
[]
[]
[]
[null,"ASSET QUANTITY INSPECTED / MAINTAINED"]
[null,null,null,null,null,"VOLUME"]
[null,null,null,null,null,"(0's)"]
[null,"MAINTENANCE ACTIVITY","MAINTENANCE ASSET CATEGORY","ASSET QUANTITY","Units",{"$f":"IF(dms_RPT=\"financial\",dms_CRYf_y1,dms_CRYc_y1)","v":"2008-09"},{"$f":"IF(dms_RPT=\"financial\",dms_CRYf_y2,dms_CRYc_y2)","v":"2009-10"},{"$f":"IF(dms_RPT=\"financial\",dms_CRYf_y3,dms_CRYc_y3)","v":"2010-11"},{"$f":"IF(dms_RPT=\"financial\",dms_CRYf_y4,dms_CRYc_y4)","v":"2011-12"},{"$f":"IF(dms_RPT=\"financial\",dms_CRYf_y5,dms_CRYc_y5)","v":"2012-13"},{"$f":"IF(dms_RPT=\"financial\",dms_CRYf_y6,dms_CRYc_y6)","v":"2013-14"},{"$f":"IF(dms_RPT=\"financial\",dms_CRYf_y7,dms_CRYc_y7)","v":"2014-15"},{"$f":"IF(dms_RPT=\"financial\",dms_CRYf_y8,dms_CRYc_y8)","v":"2015-16"},{"$f":"IF(dms_RPT=\"financial\",dms_CRYf_y9,dms_CRYc_y9)","v":"2016-17"},{"$f":"IF(dms_RPT=\"financial\",dms_CRYf_y10,dms_CRYc_y10)","v":"2017-18"}]
[null,"Pole top, overhead line & service line maintenance","Pole tops and overhead lines","Number of poles","Number",1151,1317,1979,4819,6788,2802,3725,2680,88616,100102]
[null,null,"Service lines","Number of customers","Number",0,0,0,0,0,0,0,0,0,0]
[null,"Pole inspection and treatment","All poles","Number of poles","Number",15819,16949,37512,119200,133713,88402,89710,105501,88616,100102]
[null,"Overhead asset inspection","All overhead assets","Line patrolled (route KM)","KM",49861,49861,49861,49861,49861,49861,49861,49876,49876,49898]
[null,"Network underground cable maintenance: by voltage","LV - 11 to 22 KV","Length (KM)","KM",1174,1750,2026,1536,1495,970,1,1,556,835]
[null,null,"33 KV and above","Length (KM)","KM",180,156,140,144,180,150,0,0,17,12]
[null,"Network underground cable maintenance: by location","Cbd","Length (KM)","KM",1354,1906,2166,1680,1675,1,1,1,572,15]
[null,null,"Non-CBD","Length (KM)","KM",0,0,0,0,0,0,0,0,0,832]
[null,"Distribution substation equipment & property maintenance","Distribution substation transformers","Number of installed transformers","Number",562,418,785,484,648,653,400,401,405,401]
[null,null,"Distribution substation switchgear\n (within-substations and stand-alone switchgear)","Number of switches","Number",3910,3475,3417,3520,3810,4820,4623,4438,4405,1807]
[null,null,"Distribution substation - other equipment","Earth mat","Number",485,1116,716,851,742,0,0,0,0,0]
[null,null,"Distribution substation - property","Number of distribution substation properties maintained","Number",59,77,65,118,246,141,58,76,80,35]
[null,"Zone substation equipment maintenance","Transformers - zone substation","Number","Number",165,111,346,1008,703,566,668,724,594,613]
[null,null,"Transformers - distribution","Number of distribution transformers within zone substation","Number",0,0,0,0,0,0,0,0,0,0]
[null,null,"Transformers - HV","Number of HV transformers","Number",0,0,0,0,0,0,0,0,0,0]
[null,null,"Zone substation - other equipment",{"$f":"IF(ISBLANK(D28),\"\",D28)","v":"<DNSP to nominate>"},{"$f":"IF(ISBLANK(E28),\"\",E28)","v":"<DNSP to nominate>"},377,383,469,538,468,737,552,481,451,239]
[null,"Zone substation property maintenance","All zone substation properties","Number of zone substation properties maintained","Number",1157,1029,1263,1090,1079,1133,1373,1562,1197,1008]
[null,"Public lighting maintenance","Minor roads","Number of public lights maintained","Number",0,0,0,0,0,0,0,0,0,0]
[null,null,"Major roads","Number of public lights maintained","Number",0,0,0,0,0,0,0,0,0,0]
[null,"SCADA & network control maintenance","SCADA & network control","Number of systems","Number",10,10,10,11,11,0,375,0,0,0]
[null,"Protection systems maintenance","Protection systems","Number of systems","Number",395,629,639,551,705,664,600,498,342,233]
[null,"Subtransmission asset maintenance","Subtransmission asset maintenance\n- for DNSPs with dual function assets",{"$f":"IF(ISBLANK(D34),\"\",D34)","v":"<DNSP to nominate>"},{"$f":"IF(ISBLANK(E34),\"\",E34)","v":"<DNSP to nominate>"},0,0,0,0,0,0,0,0,0,0]
[null,"Various assets"," includes rates, electricity, communications equip, metering","Various","Number",1,66,336,477,52,1,345,0,350,311]
[null,"Ground clearance - access tracks","Access tracks","Number","Number",0,0,0,0,0,0,0,0,0,0]
[null,"Other",{"$f":"IF(ISBLANK(C37),\"\",C37)","v":"(1) Substation asset inspection"},"No. of sites",null,756,628,512,802,798,0,761,787,874,441]
[null,null,"(2) Zone substation equipment maintenance (switchgear) ","No. of CBs and disconnectors",null,480,455,540,289,734,0,844,525,1323,619]
[null,null,"(3) Numbers of signages and IDs replaced ","No. of sites",null,0,0,0,0,0,0,1042,1741,671,2049]
[null,null,"(4) Power Station Maintenance, Asset Records Feeder Diagram Maintenance,  Compliance Audting, Asset Location Services, Customer Service Penalties","Units not quoted as various UOM",null,0,0,0,0,0,0,0,0,0,0]
[null,null,"",""]
[null,null,"",""]
[null,null,"",""]
[null,null,"",""]
[null,null,"",""]
[null,null,"",""]
[]
[]
[]
[null,"2.8.2 - COST METRICS FOR ROUTINE AND NON-ROUTINE MAINTENANCE"]
[null,"ROUTINE MAINTENANCE"]
[null,null,null,null,null,"EXPENDITURE"]
[null,null,null,null,null,"($0'S)"]
[null,"MAINTENANCE ACTIVITY","MAINTENANCE ASSET CATEGORY","ASSET QUANTITY","Units",{"$f":"IF(dms_RPT=\"financial\",dms_CRYf_y1,dms_CRYc_y1)","v":"2008-09"},{"$f":"IF(dms_RPT=\"financial\",dms_CRYf_y2,dms_CRYc_y2)","v":"2009-10"},{"$f":"IF(dms_RPT=\"financial\",dms_CRYf_y3,dms_CRYc_y3)","v":"2010-11"},{"$f":"IF(dms_RPT=\"financial\",dms_CRYf_y4,dms_CRYc_y4)","v":"2011-12"},{"$f":"IF(dms_RPT=\"financial\",dms_CRYf_y5,dms_CRYc_y5)","v":"2012-13"},{"$f":"IF(dms_RPT=\"financial\",dms_CRYf_y6,dms_CRYc_y6)","v":"2013-14"},{"$f":"IF(dms_RPT=\"financial\",dms_CRYf_y7,dms_CRYc_y7)","v":"2014-15"},{"$f":"IF(dms_RPT=\"financial\",dms_CRYf_y8,dms_CRYc_y8)","v":"2015-16"},{"$f":"IF(dms_RPT=\"financial\",dms_CRYf_y9,dms_CRYc_y9)","v":"2016-17"},{"$f":"IF(dms_RPT=\"financial\",dms_CRYf_y10,dms_CRYc_y10)","v":"2017-18"}]
[null,"Pole top, overhead line & service line maintenance","Pole tops and overhead lines","Number of poles","Number",31259.520976068015,1099.9212931316554,929.27256561569357,39774.001882927303,0,39256,160020,3133,7284,19658.93]
[null,null,"Service lines","Number of customers","Number",0,0,0,0,0,0,0,0,0,0]
[null,"Pole inspection and treatment","All poles","Number of poles","Number",629803.34202543646,666438.3832181372,1162190.2861121262,4074341.9916659137,5222782.6073870435,4441131,6346702,6316534,5745181,5241065.129999998]
[null,"Overhead asset inspection","All overhead assets","Line patrolled (route KM)","KM",3326040.2423328408,4502456.736723219,6373237.4537934307,4308974.7660044786,6520438.5748732267,5395136,6472355,5865975,5727497,4939638.5799999991]
[null,"Network underground cable maintenance: by voltage","LV - 11 to 22 KV","Length (KM)","KM",111650.98738440355,3061.532078578432,30473.066104982456,39406.874010165149,31016.734752933498,0,183638,111695,429981,572731.5]
[null,null,"33 KV and above","Length (KM)","KM",23040.246831079185,21245.714747287246,5358.0548506491959,9993.0681805557979,18582.867790368524,90359,87835,25190,80287,10310.81]
[null,"Network underground cable maintenance: by location","Cbd","Length (KM)","KM",134691.85930384701,24308.095843453691,35831.120955631646,49399.756992684241,49598.506855342683,90359,271473,136885,510268,583042.31000000006]
[null,null,"Non-CBD","Length (KM)","KM",0,0,0,0,0,0,0,0,0,0]
[null,"Distribution substation equipment & property maintenance","Distribution substation transformers","Number of installed transformers","Number",6248.332261703441,653.87026181559224,4892.8826551737511,311.56846175067676,1753.1007349404267,1330,0,4518,8371,4550.2800000000007]
[null,null,"Distribution substation switchgear\n (within-substations and stand-alone switchgear)","Number of switches","Number",160849.26872471691,157995.83717769705,150938.73100376525,141637.27967151222,153958.40223042763,202336,302035,330985,288857,250988.66999999987]
[null,null,"Distribution substation - other equipment","Earth mat","Number",0,10857.287603170531,0,0,0,0,0,0,0,0]
[null,null,"Distribution substation - property","Number of distribution substation properties maintained","Number",0,0,0,0,0,0,0,0,0,0]
[null,"Zone substation equipment maintenance","Transformers - zone substation","Number","Number",324069.37004608713,292418.802399354,1329841.3464724151,2075935.918977892,1340785.1820094483,582667,642767,982526,1481535,1390177.1999999997]
[null,null,"Transformers - distribution","Number of distribution transformers within zone substation","Number",0,0,0,0,0,0,0,0,0,0]
[null,null,"Transformers - HV","Number of HV transformers","Number",0,0,0,0,0,0,0,0,0,0]
[null,null,"Zone substation - other equipment",{"$f":"IF(ISBLANK(D28),\"\",D28)","v":"<DNSP to nominate>"},{"$f":"IF(ISBLANK(E28),\"\",E28)","v":"<DNSP to nominate>"},1230392.0439817505,553730.53809470625,327191.60769088991,250339.21284547052,327100.04351166327,434744,930780,995167,675733,953798.54000000027]
[null,"Zone substation property maintenance","All zone substation properties","Number of zone substation properties maintained","Number",845024.28923300328,1139881.1422573281,906090.28052403976,939532.86621680635,915132.50983286474,1077934,1152193,961342,964907,1086746.9600000016]
[null,"Public lighting maintenance","Minor roads","Number of public lights maintained","Number",0,0,0,0,0,0,0,0,0,0]
[null,null,"Major roads","Number of public lights maintained","Number",0,0,0,0,0,0,0,0,0,0]
[null,"SCADA & network control maintenance","SCADA & network control","Number of systems","Number",0,0,0,0,0,0,0,0,0,0]
[null,"Protection systems maintenance","Protection systems","Number of systems","Number",356592.10530802369,699746.42030788492,620413.95149766549,475276.93532654434,1149712.4319635767,975951,1107097,736064,813357,652255.5299999998]
[null,"Subtransmission asset maintenance","Subtransmission asset maintenance\n- for DNSPs with dual function assets",{"$f":"IF(ISBLANK(D34),\"\",D34)","v":"<DNSP to nominate>"},{"$f":"IF(ISBLANK(E34),\"\",E34)","v":"<DNSP to nominate>"},0,0,0,0,0,0,0,0,0,0]
[null,"Various assets"," includes rates, electricity, communications equip, metering","Various","Number",676806.13443372922,745864.48545324057,794066.08688194829,663681.13133693032,521911.23704727704,804000,678196,762630,634506,503219.83000000025]
[null,"Ground clearance - access tracks","Access tracks","Number","Number",0,0,0,0,0,0,0,0,0,0]
[null,"Other",{"$f":"IF(ISBLANK(C37),\"\",C37)","v":"(1) Substation asset inspection"},{"$f":"IF(ISBLANK(D37),\"\",D37)","v":"No. of sites"},null,358366.98631231743,460585.7055467313,492064.29313553491,750585.85476083495,738515.59835284145,3815000,3743437,857414,940563,948743.21999999974]
[null,null,{"$f":"IF(ISBLANK(C38),\"\",C38)","v":"(2) Zone substation equipment maintenance (switchgear) "},"No. of CBs and disconnectors",null,784569.73555140267,802688.67505538836,652675.67972202424,367604.735918672,1440500.4232542617,0,0,1497201,774001,814670.01000000036]
[null,null,"(3) Numbers of signages and IDs replaced ","No. of sites",null,0,0,0,0,0,0,0,0,0,0]
[null,null,"(4) Power Station Maintenance, Asset Records Feeder Diagram Maintenance,  Compliance Audting, Asset Location Services, Customer Service Penalties","Units not quoted as various UOM",null,433929.96402923862,573209.78938274749,382054.28438159771,520055.69627137971,612625.43457676936,0,0,872965,1096115,827864.75999999978]
[null,null,"",""]
[null,null,"",""]
[null,null,"",""]
[null,null,"",""]
[null,null,"",""]
[null,null,"",""]
[]
[null,"NON-ROUTINE MAINTENANCE"]
[null,null,null,null,null,"EXPENDITURE"]
[null,null,null,null,null,"($0'S)"]
[null,"MAINTENANCE ACTIVITY","MAINTENANCE ASSET CATEGORY","ASSET QUANTITY","Units",{"$f":"IF(dms_RPT=\"financial\",dms_CRYf_y1,dms_CRYc_y1)","v":"2008-09"},{"$f":"IF(dms_RPT=\"financial\",dms_CRYf_y2,dms_CRYc_y2)","v":"2009-10"},{"$f":"IF(dms_RPT=\"financial\",dms_CRYf_y3,dms_CRYc_y3)","v":"2010-11"},{"$f":"IF(dms_RPT=\"financial\",dms_CRYf_y4,dms_CRYc_y4)","v":"2011-12"},{"$f":"IF(dms_RPT=\"financial\",dms_CRYf_y5,dms_CRYc_y5)","v":"2012-13"},{"$f":"IF(dms_RPT=\"financial\",dms_CRYf_y6,dms_CRYc_y6)","v":"2013-14"},{"$f":"IF(dms_RPT=\"financial\",dms_CRYf_y7,dms_CRYc_y7)","v":"2014-15"},{"$f":"IF(dms_RPT=\"financial\",dms_CRYf_y8,dms_CRYc_y8)","v":"2015-16"},{"$f":"IF(dms_RPT=\"financial\",dms_CRYf_y9,dms_CRYc_y9)","v":"2016-17"},{"$f":"IF(dms_RPT=\"financial\",dms_CRYf_y10,dms_CRYc_y10)","v":"2017-18"}]
[null,"Pole top, overhead line & service line maintenance","Pole tops and overhead lines","Number of poles","Number",1619036.6790736786,1951865.0693201325,2235363.2390478924,2689529.2945277099,1354837.4760966473,5614077.437736162,2729473.8339461242,3251498.958743332,5696180.9157376969,4017163.1381266052]
[null,null,"Service lines","Number of customers","Number",0,0,0,0,0,0,0,0,0,0]
[null,"Pole inspection and treatment","All poles","Number of poles","Number",0,0,0,0,0,0,0,0,0,0]
[null,"Overhead asset inspection","All overhead assets","Line patrolled (route KM)","KM",0,0,0,0,0,0,0,0,0,0]
[null,"Network underground cable maintenance: by voltage","LV - 11 to 22 KV","Length (KM)","KM",2283361.740603283,2985526.1211363114,3604629.7272717548,4721853.4987496799,5479495.5291111041,8939655.6816597916,7685759.4372796779,6641357.9688091222,10283227.331553681,10854068.873736909]
[null,null,"33 KV and above","Length (KM)","KM",61314.876662570838,98602.812634766975,135338.89205031216,57559.06768049916,169098.07538432171,90390.579391112959,601380.98462780204,334895.50174826203,0,1271081.834298332]
[null,"Network underground cable maintenance: by location","Cbd","Length (KM)","KM",2344676.617265854,3084128.9337710785,3739968.6193220671,4779412.5664301794,5648593.6044954257,9030046.2610509042,8287140.4219074799,6976253.4705573842,10283227.331553681,12125150.70803524]
[null,null,"Non-CBD","Length (KM)","KM",0,0,0,0,0,null,0,0,0]
[null,"Distribution substation equipment & property maintenance","Distribution substation transformers","Number of installed transformers","Number",450084.03332894266,292135.547322564,221622.39638399376,543478.89031369193,360818.81051360123,407663,864463,493142,550049,933998.80000000028]
[null,null,"Distribution substation switchgear\n (within-substations and stand-alone switchgear)","Number of switches","Number",29379.153121076,11289.399539757969,13301.352409793262,27821.102713946795,29552.895639258244,29896,56601,110932,84464,160069.21]
[null,null,"Distribution substation - other equipment","Earth mat","Number",91122.575225291308,234785.04284727314,148767.21287465634,176917.50566380474,154353.94558374851,0,0,0,0,0]
[null,null,"Distribution substation - property","Number of distribution substation properties maintained","Number",41499.488935376612,55004.934989591879,45410.023976286146,82663.688383361368,172060.26300664683,98591,48188,133390,139767,25289.110000000008]
[null,"Zone substation equipment maintenance","Transformers - zone substation","Number","Number",1096876.9581728261,1183258.8193947498,1243399.8229149091,2392939.2785717268,1119854.9898560205,1329203,1209551,1189864,1303438,1429181.9000000004]
[null,null,"Transformers - distribution","Number of distribution transformers within zone substation","Number",0,0,0,0,0,0,0,0,0,0]
[null,null,"Transformers - HV","Number of HV transformers","Number",0,0,0,0,0,0,0,0,0,0]
[null,null,"Zone substation - other equipment",{"$f":"IF(ISBLANK(D28),\"\",D28)","v":"<DNSP to nominate>"},{"$f":"IF(ISBLANK(E28),\"\",E28)","v":"<DNSP to nominate>"},1219134.0749720458,615602.37802379171,728553.97874404455,815533.71683304419,1181654.5409394484,752725,843950,685935,642354,670461.5199999999]
[null,"Zone substation property maintenance","All zone substation properties","Number of zone substation properties maintained","Number",955086.54437661404,578069.46468131884,898156.51149212662,1151039.6566799609,876037.7060309198,689512,614640,695641,597462,819584.58999999787]
[null,"Public lighting maintenance","Minor roads","Number of public lights maintained","Number",0,0,0,0,0,0,0,0,0,0]
[null,null,"Major roads","Number of public lights maintained","Number",0,0,0,0,0,0,0,0,0,0]
[null,"SCADA & network control maintenance","SCADA & network control","Number of systems","Number",76059.055496955611,20813.222653570851,10680.064215275721,39264.652811977903,70693.272163131827,741202,535098,459570,500344,724338.70000000019]
[null,"Protection systems maintenance","Protection systems","Number of systems","Number",144062.12523795833,253052.86008435371,208781.53229296111,213625.97891516585,313233.59741290298,425051,339057,152049,81874,168426.46]
[null,"Subtransmission asset maintenance","Subtransmission asset maintenance\n- for DNSPs with dual function assets",{"$f":"IF(ISBLANK(D34),\"\",D34)","v":"<DNSP to nominate>"},{"$f":"IF(ISBLANK(E34),\"\",E34)","v":"<DNSP to nominate>"},0,0,0,0,0,0,0,0,0,0]
[null,"Various assets"," includes rates, electricity, communications equip, metering","Various","Number",1616227.1989872076,1360031.136719984,1189444.2320053785,1536958.5066143614,1660665.2116268147,1521318,2328383,2154088,1432010,7494285]
[null,"Ground clearance - access tracks","Access tracks","Number","Number",0,0,0,0,0,0,0,0,0,0]
[null,"Other",{"$f":"IF(ISBLANK(C37),\"\",C37)","v":"(1) Substation asset inspection"},"No. of sites",null,0,0,0,0,0,1101000,900358,0,0,0]
[null,null,"(2) Zone substation equipment maintenance (switchgear) ","No. of CBs and disconnectors",null,627217.12183812028,564598.36872225348,689164.64419538633,928028.13540264626,693848.00506402692,0,0,855807,553706,498911.24]
[null,null,"(3) Numbers of signages and IDs replaced ","No. of sites",null,0,0,0,0,0,0,0,282636,362267,1162381.7099999972]
[null,null,"(4) Power Station Maintenance, Asset Records Feeder Diagram Maintenance,  Compliance Audting, Asset Location Services, Customer Service Penalties","Units not quoted as various UOM",null,0,0,0,0,0,0,0,0,0,0]
[null,null,"",""]
[null,null,"",""]
[null,null,"",""]
[null,null,"",""]
[null,null,"",""]
[null,null,"",""]

{"sheet":"2.9 Emergency Response","index":14,"n_rows":376,"n_cols":13,"rows_kept":376,"cut":false,"hidden":false,"merged":[[8,3,8,12]]}
[null,"REGULATORY REPORTING STATEMENT"]
[null,{"$f":"INDEX(dms_TradingNameFull_List,MATCH(dms_TradingName,dms_TradingName_List))","v":"SA Power Networks"}]
[null,{"$f":"IF(SUM(dms_SingleYear_Model)>0,(\"CATEGORY ANALYSIS \"&CRY&\" to \"&FRY),(\"CATEGORY ANALYSIS \"&CRY))","v":"CATEGORY ANALYSIS 2008-09 to 2018-19"}]
[null,"2.9 EMERGENCY RESPONSE"]
[]
[null,"There is ONE table on this worksheet. It has been 'sub-grouped' for easy navigation.  See the Instructions sheet on how to group or ungroup data."]
[]
[null,"2.9.1 - EMERGENCY RESPONSE EXPENDITURE (OPEX)"]
[null,null,null,"EXPENDITURE\n($0's)"]
[null,null,null,{"$f":"IF(dms_RPT=\"financial\",dms_CRYf_y1,dms_CRYc_y1)","v":"2008-09"},{"$f":"IF(dms_RPT=\"financial\",dms_CRYf_y2,dms_CRYc_y2)","v":"2009-10"},{"$f":"IF(dms_RPT=\"financial\",dms_CRYf_y3,dms_CRYc_y3)","v":"2010-11"},{"$f":"IF(dms_RPT=\"financial\",dms_CRYf_y4,dms_CRYc_y4)","v":"2011-12"},{"$f":"IF(dms_RPT=\"financial\",dms_CRYf_y5,dms_CRYc_y5)","v":"2012-13"},{"$f":"IF(dms_RPT=\"financial\",dms_CRYf_y6,dms_CRYc_y6)","v":"2013-14"},{"$f":"IF(dms_RPT=\"financial\",dms_CRYf_y7,dms_CRYc_y7)","v":"2014-15"},{"$f":"IF(dms_RPT=\"financial\",dms_CRYf_y8,dms_CRYc_y8)","v":"2015-16"},{"$f":"IF(dms_RPT=\"financial\",dms_CRYf_y9,dms_CRYc_y9)","v":"2016-17"},{"$f":"IF(dms_RPT=\"financial\",dms_CRYf_y10,dms_CRYc_y10)","v":"2017-18"}]
[null,"(A) TOTAL EMERGENCY RESPONSE EXPENDITURE","Total Expenditure"]
[null,"(B) MAJOR EVENTS O&M EXPENDITURE"]
[]
[]
[]
[]
[]
[]
[null,null,null,"","","","","","","",null,null,""]
[]
[]
[]
[]
[]
[]
[]
[null,null,null,"","","","","","","",null,null,""]
[null,null,null,"","","","","","","",null,null,""]
[null,null,null,"","","","","","","",null,null,""]
[null,null,null,"","","","","","","",null,null,""]
[]
[]
[]
[]
[]
[]
[]
[]
[]
[]
[]
[]
[null,null,null,"","","","","","","",null,null,""]
[null,null,null,"","","","","","","",null,null,""]
[null,null,null,"","","","","","","",null,null,""]
[null,null,null,"","","","","","","",null,null,""]
[null,null,null,"","","","","","","",null,null,""]
[null,null,null,"","","","","","","",null,null,""]
[null,null,null,"","","","","","","",null,null,""]
[null,null,null,"","","","","","","",null,null,""]
[null,null,null,"","","","","","","",null,null,""]
[null,null,null,"","","","","","","",null,null,""]
[null,null,null,"","","","","","","",null,null,""]
[null,null,null,"","","","","","","",null,null,""]
[null,"(C) MAJOR EVENT DAYS O&M EXPENDITURE"]
[]
[null,null,null,"","","","","","","",null,null,""]
[null,null,null,"","","","","","","",null,null,""]
[null,null,null,"","","","","","","",null,null,""]
[null,null,null,"","","","","","","",null,null,""]
[null,null,null,"","","","","","","",null,null,""]
[null,null,null,"","","","","","","",null,null,""]
[null,null,null,"","","","","","","",null,null,""]
[null,null,null,"","","","","","","",null,null,""]
[null,null,null,"","","","","","","",null,null,""]
[null,null,null,"","","","","","","",null,null,""]
[null,null,null,"","","","","","","",null,null,""]
[null,null,null,"","","","","","","",null,null,""]
[null,null,null,"","","","","","","",null,null,""]
[null,null,null,"","","","","","","",null,null,""]
[null,null,null,"","","","","","","",null,null,""]
[null,null,null,"","","","","","","",null,null,""]
[null,null,null,"","","","","","","",null,null,""]
[null,null,null,"","","","","","","",null,null,""]
[null,null,null,"","","","","","","",null,null,""]
[null,null,null,"","","","","","","",null,null,""]
[null,null,null,"","","","","","","",null,null,""]
[null,null,null,"","","","","","","",null,null,""]
[null,null,null,"","","","","","","",null,null,""]
[null,null,null,"","","","","","","",null,null,""]
[null,null,null,"","","","","","","",null,null,""]
[null,null,null,"","","","","","","",null,null,""]
[null,null,null,"","","","","","","",null,null,""]
[null,null,null,"","","","","","","",null,null,""]
[null,null,null,"","","","","","","",null,null,""]
[null,null,null,"","","","","","","",null,null,""]
[null,null,null,"","","","","","","",null,null,""]
[null,null,null,"","","","","","","",null,null,""]
[null,null,null,"","","","","","","",null,null,""]
[null,null,null,"","","","","","","",null,null,""]
[null,null,null,"","","","","","","",null,null,""]
[null,null,null,"","","","","","","",null,null,""]
[null,null,null,"","","","","","","",null,null,""]
[null,null,null,"","","","","","","",null,null,""]
[null,null,null,"","","","","","","",null,null,""]
[null,null,null,"","","","","","","",null,null,""]
[null,null,null,"","","","","","","",null,null,""]
[null,null,null,"","","","","","","",null,null,""]
[null,null,null,"","","","","","","",null,null,""]
[null,null,null,"","","","","","","",null,null,""]
[null,null,null,"","","","","","","",null,null,""]
[null,null,null,"","","","","","","",null,null,""]
[null,null,null,"","","","","","","",null,null,""]
[null,null,null,"","","","","","","",null,null,""]
[null,null,null,"","","","","","","",null,null,""]
[null,null,null,"","","","","","","",null,null,""]
[null,null,null,"","","","","","","",null,null,""]
[null,null,null,"","","","","","","",null,null,""]
[null,null,null,"","","","","","","",null,null,""]
[null,null,null,"","","","","","","",null,null,""]
[null,null,null,"","","","","","","",null,null,""]
[null,null,null,"","","","","","","",null,null,""]
[null,null,null,"","","","","","","",null,null,""]
[null,null,null,"","","","","","","",null,null,""]
[null,null,null,"","","","","","","",null,null,""]
[null,null,null,"","","","","","","",null,null,""]
[null,null,null,"","","","","","","",null,null,""]
[null,null,null,"","","","","","","",null,null,""]
[null,null,null,"","","","","","","",null,null,""]
[null,null,null,"","","","","","","",null,null,""]
[null,null,null,"","","","","","","",null,null,""]
[null,null,null,"","","","","","","",null,null,""]
[null,null,null,"","","","","","","",null,null,""]
[null,null,null,"","","","","","","",null,null,""]
[null,null,null,"","","","","","","",null,null,""]
[null,null,null,"","","","","","","",null,null,""]
[null,null,null,"","","","","","","",null,null,""]
[null,null,null,"","","","","","","",null,null,""]
[null,null,null,"","","","","","","",null,null,""]
[null,null,null,"","","","","","","",null,null,""]
[null,null,null,"","","","","","","",null,null,""]
[null,null,null,"","","","","","","",null,null,""]
[null,null,null,"","","","","","","",null,null,""]
[null,null,null,"","","","","","","",null,null,""]
[null,null,null,"","","","","","","",null,null,""]
[null,null,null,"","","","","","","",null,null,""]
[null,null,null,"","","","","","","",null,null,""]
[null,null,null,"","","","","","","",null,null,""]
[null,null,null,"","","","","","","",null,null,""]
[null,null,null,"","","","","","","",null,null,""]
[null,null,null,"","","","","","","",null,null,""]
[null,null,null,"","","","","","","",null,null,""]
[null,null,null,"","","","","","","",null,null,""]
[null,null,null,"","","","","","","",null,null,""]
[null,null,null,"","","","","","","",null,null,""]
[null,null,null,"","","","","","","",null,null,""]
[null,null,null,"","","","","","","",null,null,""]
[null,null,null,"","","","","","","",null,null,""]
[null,null,null,"","","","","","","",null,null,""]
[null,null,null,"","","","","","","",null,null,""]
[null,null,null,"","","","","","","",null,null,""]
[null,null,null,"","","","","","","",null,null,""]
[null,null,null,"","","","","","","",null,null,""]
[null,null,null,"","","","","","","",null,null,""]
[null,null,null,"","","","","","","",null,null,""]
[null,null,null,"","","","","","","",null,null,""]
[null,null,null,"","","","","","","",null,null,""]
[null,null,null,"","","","","","","",null,null,""]
[null,null,null,"","","","","","","",null,null,""]
[null,null,null,"","","","","","","",null,null,""]
[null,null,null,"","","","","","","",null,null,""]
[null,null,null,"","","","","","","",null,null,""]
[null,null,null,"","","","","","","",null,null,""]
[null,null,null,"","","","","","","",null,null,""]
[null,null,null,"","","","","","","",null,null,""]
[null,null,null,"","","","","","","",null,null,""]
[null,null,null,"","","","","","","",null,null,""]
[null,null,null,"","","","","","","",null,null,""]
[null,null,null,"","","","","","","",null,null,""]
[null,null,null,"","","","","","","",null,null,""]
[null,null,null,"","","","","","","",null,null,""]
[null,null,null,"","","","","","","",null,null,""]
[null,null,null,"","","","","","","",null,null,""]
[null,null,null,"","","","","","","",null,null,""]
[null,null,null,"","","","","","","",null,null,""]
[null,null,null,"","","","","","","",null,null,""]
[null,null,null,"","","","","","","",null,null,""]
[null,null,null,"","","","","","","",null,null,""]
[null,null,null,"","","","","","","",null,null,""]
[null,null,null,"","","","","","","",null,null,""]
[null,null,null,"","","","","","","",null,null,""]
[null,null,null,"","","","","","","",null,null,""]
[null,null,null,"","","","","","","",null,null,""]
[null,null,null,"","","","","","","",null,null,""]
[null,null,null,"","","","","","","",null,null,""]
[null,null,null,"","","","","","","",null,null,""]
[null,null,null,"","","","","","","",null,null,""]
[null,null,null,"","","","","","","",null,null,""]
[null,null,null,"","","","","","","",null,null,""]
[null,null,null,"","","","","","","",null,null,""]
[null,null,null,"","","","","","","",null,null,""]
[null,null,null,"","","","","","","",null,null,""]
[null,null,null,"","","","","","","",null,null,""]
[null,null,null,"","","","","","","",null,null,""]
[null,null,null,"","","","","","","",null,null,""]
[null,null,null,"","","","","","","",null,null,""]
[null,null,null,"","","","","","","",null,null,""]
[null,null,null,"","","","","","","",null,null,""]
[null,null,null,"","","","","","","",null,null,""]
[null,null,null,"","","","","","","",null,null,""]
[null,null,null,"","","","","","","",null,null,""]
[null,null,null,"","","","","","","",null,null,""]
[null,null,null,"","","","","","","",null,null,""]
[null,null,null,"","","","","","","",null,null,""]
[null,null,null,"","","","","","","",null,null,""]
[null,null,null,"","","","","","","",null,null,""]
[null,null,null,"","","","","","","",null,null,""]
[null,null,null,"","","","","","","",null,null,""]
[null,null,null,"","","","","","","",null,null,""]
[null,null,null,"","","","","","","",null,null,""]
[null,null,null,"","","","","","","",null,null,""]
[null,null,null,"","","","","","","",null,null,""]
[null,null,null,"","","","","","","",null,null,""]
[null,null,null,"","","","","","","",null,null,""]
[null,null,null,"","","","","","","",null,null,""]
[null,null,null,"","","","","","","",null,null,""]
[null,null,null,"","","","","","","",null,null,""]
[null,null,null,"","","","","","","",null,null,""]
[null,null,null,"","","","","","","",null,null,""]
[null,null,null,"","","","","","","",null,null,""]
[null,null,null,"","","","","","","",null,null,""]
[null,null,null,"","","","","","","",null,null,""]
[null,null,null,"","","","","","","",null,null,""]
[null,null,null,"","","","","","","",null,null,""]
[null,null,null,"","","","","","","",null,null,""]
[null,null,null,"","","","","","","",null,null,""]
[null,null,null,"","","","","","","",null,null,""]
[null,null,null,"","","","","","","",null,null,""]
[null,null,null,"","","","","","","",null,null,""]
[null,null,null,"","","","","","","",null,null,""]
[null,null,null,"","","","","","","",null,null,""]
[null,null,null,"","","","","","","",null,null,""]
[null,null,null,"","","","","","","",null,null,""]
[null,null,null,"","","","","","","",null,null,""]
[null,null,null,"","","","","","","",null,null,""]
[null,null,null,"","","","","","","",null,null,""]
[null,null,null,"","","","","","","",null,null,""]
[null,null,null,"","","","","","","",null,null,""]
[null,null,null,"","","","","","","",null,null,""]
[null,null,null,"","","","","","","",null,null,""]
[null,null,null,"","","","","","","",null,null,""]
[null,null,null,"","","","","","","",null,null,""]
[null,null,null,"","","","","","","",null,null,""]
[null,null,null,"","","","","","","",null,null,""]
[null,null,null,"","","","","","","",null,null,""]
[null,null,null,"","","","","","","",null,null,""]
[null,null,null,"","","","","","","",null,null,""]
[null,null,null,"","","","","","","",null,null,""]
[null,null,null,"","","","","","","",null,null,""]
[null,null,null,"","","","","","","",null,null,""]
[null,null,null,"","","","","","","",null,null,""]
[null,null,null,"","","","","","","",null,null,""]
[null,null,null,"","","","","","","",null,null,""]
[null,null,null,"","","","","","","",null,null,""]
[null,null,null,"","","","","","","",null,null,""]
[null,null,null,"","","","","","","",null,null,""]
[null,null,null,"","","","","","","",null,null,""]
[null,null,null,"","","","","","","",null,null,""]
[null,null,null,"","","","","","","",null,null,""]
[null,null,null,"","","","","","","",null,null,""]
[null,null,null,"","","","","","","",null,null,""]
[null,null,null,"","","","","","","",null,null,""]
[null,null,null,"","","","","","","",null,null,""]
[null,null,null,"","","","","","","",null,null,""]
[null,null,null,"","","","","","","",null,null,""]
[null,null,null,"","","","","","","",null,null,""]
[null,null,null,"","","","","","","",null,null,""]
[null,null,null,"","","","","","","",null,null,""]
[null,null,null,"","","","","","","",null,null,""]
[null,null,null,"","","","","","","",null,null,""]
[null,null,null,"","","","","","","",null,null,""]
[null,null,null,"","","","","","","",null,null,""]
[null,null,null,"","","","","","","",null,null,""]
[null,null,null,"","","","","","","",null,null,""]
[null,null,null,"","","","","","","",null,null,""]
[null,null,null,"","","","","","","",null,null,""]
[null,null,null,"","","","","","","",null,null,""]
[null,null,null,"","","","","","","",null,null,""]
[null,null,null,"","","","","","","",null,null,""]
[null,null,null,"","","","","","","",null,null,""]
[null,null,null,"","","","","","","",null,null,""]
[null,null,null,"","","","","","","",null,null,""]
[null,null,null,"","","","","","","",null,null,""]
[null,null,null,"","","","","","","",null,null,""]
[null,null,null,"","","","","","","",null,null,""]
[null,null,null,"","","","","","","",null,null,""]
[null,null,null,"","","","","","","",null,null,""]
[null,null,null,"","","","","","","",null,null,""]
[null,null,null,"","","","","","","",null,null,""]
[null,null,null,"","","","","","","",null,null,""]
[null,null,null,"","","","","","","",null,null,""]
[null,null,null,"","","","","","","",null,null,""]
[null,null,null,"","","","","","","",null,null,""]
[null,null,null,"","","","","","","",null,null,""]
[null,null,null,"","","","","","","",null,null,""]
[null,null,null,"","","","","","","",null,null,""]
[null,null,null,"","","","","","","",null,null,""]
[null,null,null,"","","","","","","",null,null,""]
[null,null,null,"","","","","","","",null,null,""]
[null,null,null,"","","","","","","",null,null,""]
[null,null,null,"","","","","","","",null,null,""]
[null,null,null,"","","","","","","",null,null,""]
[null,null,null,"","","","","","","",null,null,""]
[null,null,null,"","","","","","","",null,null,""]
[null,null,null,"","","","","","","",null,null,""]
[null,null,null,"","","","","","","",null,null,""]
[null,null,null,"","","","","","","",null,null,""]
[null,null,null,"","","","","","","",null,null,""]
[null,null,null,"","","","","","","",null,null,""]
[null,null,null,"","","","","","","",null,null,""]
[null,null,null,"","","","","","","",null,null,""]
[null,null,null,"","","","","","","",null,null,""]
[null,null,null,"","","","","","","",null,null,""]
[null,null,null,"","","","","","","",null,null,""]
[null,null,null,"","","","","","","",null,null,""]
[null,null,null,"","","","","","","",null,null,""]
[null,null,null,"","","","","","","",null,null,""]
[null,null,null,"","","","","","","",null,null,""]
[null,null,null,"","","","","","","",null,null,""]
[null,null,null,"","","","","","","",null,null,""]
[null,null,null,"","","","","","","",null,null,""]
[null,null,null,"","","","","","","",null,null,""]
[null,null,null,"","","","","","","",null,null,""]
[null,null,null,"","","","","","","",null,null,""]
[null,null,null,"","","","","","","",null,null,""]
[null,null,null,"","","","","","","",null,null,""]
[null,null,null,"","","","","","","",null,null,""]
[null,null,null,"","","","","","","",null,null,""]
[null,null,null,"","","","","","","",null,null,""]
[null,null,null,"","","","","","","",null,null,""]
[null,null,null,"","","","","","","",null,null,""]
[null,null,null,"","","","","","","",null,null,""]
[null,null,null,"","","","","","","",null,null,""]
[null,null,null,"","","","","","","",null,null,""]
[null,null,null,"","","","","","","",null,null,""]
[null,null,null,"","","","","","","",null,null,""]
[null,null,null,"","","","","","","",null,null,""]
[null,null,null,"","","","","","","",null,null,""]
[null,null,null,"","","","","","","",null,null,""]
[null,null,null,"","","","","","","",null,null,""]
[null,null,null,"","","","","","","",null,null,""]
[null,null,null,"","","","","","","",null,null,""]
[null,null,null,"","","","","","","",null,null,""]
[null,null,null,"","","","","","","",null,null,""]
[null,null,null,"","","","","","","",null,null,""]
[null,null,null,"","","","","","","",null,null,""]
[null,null,null,"","","","","","","",null,null,""]
[null,null,null,"","","","","","","",null,null,""]
[null,null,null,"","","","","","","",null,null,""]
[null,null,null,"","","","","","","",null,null,""]
[null,null,null,"","","","","","","",null,null,""]
[null,null,null,"","","","","","","",null,null,""]
[null,null,null,"","","","","","","",null,null,""]
[null,null,null,"","","","","","","",null,null,""]
[null,null,null,"","","","","","","",null,null,""]
[null,null,null,"","","","","","","",null,null,""]
[null,null,null,"","","","","","","",null,null,""]
[null,null,null,"","","","","","","",null,null,""]
[null,null,null,"","","","","","","",null,null,""]
[null,null,null,"","","","","","","",null,null,""]
[null,null,null,"","","","","","","",null,null,""]
[null,null,null,"","","","","","","",null,null,""]
[null,null,null,"","","","","","","",null,null,""]
[null,null,null,"","","","","","","",null,null,""]
[null,null,null,"","","","","","","",null,null,""]
[null,null,null,"","","","","","","",null,null,""]
[null,null,null,"","","","","","","",null,null,""]
[null,null,null,"","","","","","","",null,null,""]
[null,null,null,"","","","","","","",null,null,""]
[null,null,null,"","","","","","","",null,null,""]
[null,null,null,"","","","","","","",null,null,""]
[null,null,null,"","","","","","","",null,null,""]
[null,null,null,"","","","","","","",null,null,""]
[null,null,null,"","","","","","","",null,null,""]
[null,null,null,"","","","","","","",null,null,""]
[null,null,null,"","","","","","","",null,null,""]

{"sheet":"2.10 Overheads","index":15,"n_rows":146,"n_cols":13,"rows_kept":146,"cut":false,"hidden":false,"merged":[[5,1,5,2],[8,3,8,12],[78,3,78,12]]}
[null,"REGULATORY REPORTING STATEMENT"]
[null,{"$f":"INDEX(dms_TradingNameFull_List,MATCH(dms_TradingName,dms_TradingName_List))","v":"SA Power Networks"}]
[null,{"$f":"IF(SUM(dms_SingleYear_Model)>0,(\"CATEGORY ANALYSIS \"&CRY&\" to \"&FRY),(\"CATEGORY ANALYSIS \"&CRY))","v":"CATEGORY ANALYSIS 2008-09 to 2018-19"}]
[null,"2.10 OVERHEADS"]
[]
[null,"There are TWO tables on this worksheet. Each table has been 'grouped' (and sub-grouped) for easy navigation.  See the Instructions sheet on how to group or ungroup data."]
[]
[null,"2.10.1 - NETWORK OVERHEADS EXPENDITURE"]
[null,null,null,"EXPENDITURE\n($0's)"]
[null,null,null,{"$f":"IF(dms_RPT=\"financial\",dms_CRYf_y1,dms_CRYc_y1)","v":"2008-09"},{"$f":"IF(dms_RPT=\"financial\",dms_CRYf_y2,dms_CRYc_y2)","v":"2009-10"},{"$f":"IF(dms_RPT=\"financial\",dms_CRYf_y3,dms_CRYc_y3)","v":"2010-11"},{"$f":"IF(dms_RPT=\"financial\",dms_CRYf_y4,dms_CRYc_y4)","v":"2011-12"},{"$f":"IF(dms_RPT=\"financial\",dms_CRYf_y5,dms_CRYc_y5)","v":"2012-13"},{"$f":"IF(dms_RPT=\"financial\",dms_CRYf_y6,dms_CRYc_y6)","v":"2013-14"},{"$f":"IF(dms_RPT=\"financial\",dms_CRYf_y7,dms_CRYc_y7)","v":"2014-15"},{"$f":"IF(dms_RPT=\"financial\",dms_CRYf_y8,dms_CRYc_y8)","v":"2015-16"},{"$f":"IF(dms_RPT=\"financial\",dms_CRYf_y9,dms_CRYc_y9)","v":"2016-17"},{"$f":"IF(dms_RPT=\"financial\",dms_CRYf_y10,dms_CRYc_y10)","v":"2017-18"}]
[null,"NETWORK OVERHEADS"]
[null,"Standard Control Services",null,"","","","","","","",null,null,""]
[]
[]
[]
[]
[]
[]
[]
[]
[]
[]
[]
[]
[null,null,null,"","","","","","","",null,null,""]
[null,null,null,"","","","","","","",null,null,""]
[null,null,null,"","","","","","","",null,null,""]
[null,null,null,"","","","","","","",null,null,""]
[null,null,null,"","","","","","","",null,null,""]
[]
[null,null,null,"","","","","","","",null,null,""]
[null,"Alternative Control Services"]
[]
[]
[]
[]
[]
[]
[]
[]
[]
[]
[]
[]
[]
[null,null,null,"","","","","","","",null,null,""]
[null,null,null,"","","","","","","",null,null,""]
[null,null,null,"","","","","","","",null,null,""]
[null,null,null,"","","","","","","",null,null,""]
[null,null,null,"","","","","","","",null,null,""]
[null,null,null,"","","","","","","",null,null,""]
[null,"Negotiated Services","Total  ","","","","","","","",null,null,""]
[null,"Unregulated Services","Total  ","","","","","","","",null,null,""]
[]
[null,"CAPITALISED NETWORK OVERHEADS"]
[null,"Standard Control Services",null,"","","","","","","",null,null,""]
[]
[]
[]
[]
[]
[]
[]
[]
[]
[]
[]
[]
[null,null,null,"","","","","","","",null,null,""]
[null,null,null,"","","","","","","",null,null,""]
[null,null,null,"","","","","","","",null,null,""]
[null,null,null,"","","","","","","",null,null,""]
[null,null,null,"","","","","","","",null,null,""]
[]
[null,null,null,"","","","","","","",null,null,""]
[]
[]
[null,"2.10.2 - CORPORATE OVERHEADS EXPENDITURE"]
[null,null,null,"EXPENDITURE\n($0's)"]
[null,null,null,{"$f":"IF(dms_RPT=\"financial\",dms_CRYf_y1,dms_CRYc_y1)","v":"2008-09"},{"$f":"IF(dms_RPT=\"financial\",dms_CRYf_y2,dms_CRYc_y2)","v":"2009-10"},{"$f":"IF(dms_RPT=\"financial\",dms_CRYf_y3,dms_CRYc_y3)","v":"2010-11"},{"$f":"IF(dms_RPT=\"financial\",dms_CRYf_y4,dms_CRYc_y4)","v":"2011-12"},{"$f":"IF(dms_RPT=\"financial\",dms_CRYf_y5,dms_CRYc_y5)","v":"2012-13"},{"$f":"IF(dms_RPT=\"financial\",dms_CRYf_y6,dms_CRYc_y6)","v":"2013-14"},{"$f":"IF(dms_RPT=\"financial\",dms_CRYf_y7,dms_CRYc_y7)","v":"2014-15"},{"$f":"IF(dms_RPT=\"financial\",dms_CRYf_y8,dms_CRYc_y8)","v":"2015-16"},{"$f":"IF(dms_RPT=\"financial\",dms_CRYf_y9,dms_CRYc_y9)","v":"2016-17"},{"$f":"IF(dms_RPT=\"financial\",dms_CRYf_y10,dms_CRYc_y10)","v":"2017-18"}]
[null,"CORPORATE OVERHEADS"]
[null,"Standard Control Services",null,"","","","","","","",null,null,""]
[]
[]
[]
[]
[]
[]
[]
[]
[]
[]
[]
[]
[null,null,null,"","","","","","","",null,null,""]
[null,null,null,"","","","","","","",null,null,""]
[null,null,null,"","","","","","","",null,null,""]
[null,null,null,"","","","","","","",null,null,""]
[null,null,null,"","","","","","","",null,null,""]
[]
[null,null,null,"","","","","","","",null,null,""]
[null,"Alternative Control Services"]
[]
[]
[]
[]
[]
[]
[]
[]
[]
[]
[]
[]
[]
[null,null,null,"","","","","","","",null,null,""]
[null,null,null,"","","","","","","",null,null,""]
[null,null,null,"","","","","","","",null,null,""]
[null,null,null,"","","","","","","",null,null,""]
[null,null,null,"","","","","","","",null,null,""]
[null,null,null,"","","","","","","",null,null,""]
[null,"Negotiated Services","Total  ","","","","","","","",null,null,""]
[null,"Unregulated Services","Total  ","","","","","","","",null,null,""]
[]
[]
[null,"CAPITALISED CORPORATE OVERHEADS"]
[null,"Standard Control Services",null,"","","","","","","",null,null,""]
[]
[]
[]
[]
[]
[]
[]
[]
[]
[]
[]
[]
[null,null,null,"","","","","","","",null,null,""]
[null,null,null,"","","","","","","",null,null,""]
[null,null,null,"","","","","","","",null,null,""]
[null,null,null,"","","","","","","",null,null,""]
[null,null,null,"","","","","","","",null,null,""]
[]
[null,null,null,"","","","","","","",null,null,""]

{"sheet":"2.11 Labour","index":16,"n_rows":95,"n_cols":13,"rows_kept":95,"cut":false,"hidden":false,"merged":[[75,3,75,12],[76,1,76,2],[5,1,5,3],[32,1,32,2],[54,1,54,2],[10,1,10,2],[9,3,9,12],[31,3,31,12],[53,3,53,12]]}
[null,"REGULATORY REPORTING STATEMENT"]
[null,{"$f":"INDEX(dms_TradingNameFull_List,MATCH(dms_TradingName,dms_TradingName_List))","v":"SA Power Networks"}]
[null,{"$f":"IF(SUM(dms_SingleYear_Model)>0,(\"CATEGORY ANALYSIS \"&CRY&\" to \"&FRY),(\"CATEGORY ANALYSIS \"&CRY))","v":"CATEGORY ANALYSIS 2008-09 to 2018-19"}]
[null,"2.11 LABOUR"]
[]
[null,"There are TWO tables on this worksheet. Each table has been 'grouped' (and sub-grouped) for easy navigation.  See the Instructions sheet on how to group or ungroup data."]
[]
[null,"2.11.1 - COST METRICS PER ANNUM"]
[null,"AVERAGE STAFFING LEVEL (ASL)"]
[null,null,null,"VOLUME\n(0's)"]
[null,"INTERNAL LABOUR",null,{"$f":"IF(dms_RPT=\"financial\",dms_CRYf_y1,dms_CRYc_y1)","v":"2008-09"},{"$f":"IF(dms_RPT=\"financial\",dms_CRYf_y2,dms_CRYc_y2)","v":"2009-10"},{"$f":"IF(dms_RPT=\"financial\",dms_CRYf_y3,dms_CRYc_y3)","v":"2010-11"},{"$f":"IF(dms_RPT=\"financial\",dms_CRYf_y4,dms_CRYc_y4)","v":"2011-12"},{"$f":"IF(dms_RPT=\"financial\",dms_CRYf_y5,dms_CRYc_y5)","v":"2012-13"},{"$f":"IF(dms_RPT=\"financial\",dms_CRYf_y6,dms_CRYc_y6)","v":"2013-14"},{"$f":"IF(dms_RPT=\"financial\",dms_CRYf_y7,dms_CRYc_y7)","v":"2014-15"},{"$f":"IF(dms_RPT=\"financial\",dms_CRYf_y8,dms_CRYc_y8)","v":"2015-16"},{"$f":"IF(dms_RPT=\"financial\",dms_CRYf_y9,dms_CRYc_y9)","v":"2016-17"},{"$f":"IF(dms_RPT=\"financial\",dms_CRYf_y10,dms_CRYc_y10)","v":"2017-18"}]
[null,"CORPORATE OVERHEADS","Executive manager"]
[null,null,"Senior manager","","","","","","","",null,null,""]
[null,null,"Manager"]
[null,null,"Professional","","","","","","","",null,null,""]
[null,null,"Semi professional","","","","","","","",null,null,""]
[null,null,"Support staff","","","","","","","",null,null,""]
[null,null,"Intern, junior staff, apprentice","","","","","","","",null,null,""]
[null,"NETWORK OVERHEADS ","Executive manager","","","","","","","",null,null,""]
[null,null,"Senior manager","","","","","","","",null,null,""]
[null,null,"Manager","","","","","","","",null,null,""]
[null,null,"Professional","","","","","","","",null,null,""]
[null,null,"Semi professional","","","","","","","",null,null,""]
[null,null,"Support staff","","","","","","","",null,null,""]
[null,null,"Intern, junior staff, apprentice","","","","","","","",null,null,""]
[null,"TOTAL DIRECT NETWORK LABOUR","Skilled electrical worker","","","","","","","",null,null,""]
[null,null,"Skilled non electical worker","","","","","","","",null,null,""]
[null,null,"Apprentice","","","","","","","",null,null,""]
[null,null,"Unskilled worker","","","","","","","",null,null,""]
[]
[null,"TOTAL LABOUR EXPENDITURE"]
[null,null,null,"EXPENDITURE \n($0's)"]
[null,"INTERNAL LABOUR",null,{"$f":"IF(dms_RPT=\"financial\",dms_CRYf_y1,dms_CRYc_y1)","v":"2008-09"},{"$f":"IF(dms_RPT=\"financial\",dms_CRYf_y2,dms_CRYc_y2)","v":"2009-10"},{"$f":"IF(dms_RPT=\"financial\",dms_CRYf_y3,dms_CRYc_y3)","v":"2010-11"},{"$f":"IF(dms_RPT=\"financial\",dms_CRYf_y4,dms_CRYc_y4)","v":"2011-12"},{"$f":"IF(dms_RPT=\"financial\",dms_CRYf_y5,dms_CRYc_y5)","v":"2012-13"},{"$f":"IF(dms_RPT=\"financial\",dms_CRYf_y6,dms_CRYc_y6)","v":"2013-14"},{"$f":"IF(dms_RPT=\"financial\",dms_CRYf_y7,dms_CRYc_y7)","v":"2014-15"},{"$f":"IF(dms_RPT=\"financial\",dms_CRYf_y8,dms_CRYc_y8)","v":"2015-16"},{"$f":"IF(dms_RPT=\"financial\",dms_CRYf_y9,dms_CRYc_y9)","v":"2016-17"},{"$f":"IF(dms_RPT=\"financial\",dms_CRYf_y10,dms_CRYc_y10)","v":"2017-18"}]
[null,"CORPORATE OVERHEADS","Executive manager"]
[null,null,"Senior manager"]
[null,null,"Manager"]
[null,null,"Professional"]
[null,null,"Semi professional"]
[null,null,"Support staff"]
[null,null,"Intern, junior staff, apprentice"]
[null,"NETWORK OVERHEADS ","Executive manager"]
[null,null,"Senior manager"]
[null,null,"Manager"]
[null,null,"Professional"]
[null,null,"Semi professional"]
[null,null,"Support staff"]
[null,null,"Intern, junior staff, apprentice"]
[null,"TOTAL DIRECT NETWORK LABOUR","Skilled electrical worker"]
[null,null,"Skilled non electical worker"]
[null,null,"Apprentice"]
[null,null,"Unskilled worker"]
[]
[null,"AVERAGE PRODUCTIVE WORK HOURS PER ASL "]
[null,null,null,"VOLUME\n(0's)"]
[null,"INTERNAL LABOUR",null,{"$f":"IF(dms_RPT=\"financial\",dms_CRYf_y1,dms_CRYc_y1)","v":"2008-09"},{"$f":"IF(dms_RPT=\"financial\",dms_CRYf_y2,dms_CRYc_y2)","v":"2009-10"},{"$f":"IF(dms_RPT=\"financial\",dms_CRYf_y3,dms_CRYc_y3)","v":"2010-11"},{"$f":"IF(dms_RPT=\"financial\",dms_CRYf_y4,dms_CRYc_y4)","v":"2011-12"},{"$f":"IF(dms_RPT=\"financial\",dms_CRYf_y5,dms_CRYc_y5)","v":"2012-13"},{"$f":"IF(dms_RPT=\"financial\",dms_CRYf_y6,dms_CRYc_y6)","v":"2013-14"},{"$f":"IF(dms_RPT=\"financial\",dms_CRYf_y7,dms_CRYc_y7)","v":"2014-15"},{"$f":"IF(dms_RPT=\"financial\",dms_CRYf_y8,dms_CRYc_y8)","v":"2015-16"},{"$f":"IF(dms_RPT=\"financial\",dms_CRYf_y9,dms_CRYc_y9)","v":"2016-17"},{"$f":"IF(dms_RPT=\"financial\",dms_CRYf_y10,dms_CRYc_y10)","v":"2017-18"}]
[null,"CORPORATE OVERHEADS","Executive manager"]
[null,null,"Senior manager","","","","","","","",null,null,""]
[null,null,"Manager"]
[null,null,"Professional","","","","","","","",null,null,""]
[null,null,"Semi professional","","","","","","","",null,null,""]
[null,null,"Support staff","","","","","","","",null,null,""]
[null,null,"Intern, junior staff, apprentice","","","","","","","",null,null,""]
[null,"NETWORK OVERHEADS ","Executive manager","","","","","","","",null,null,""]
[null,null,"Senior manager","","","","","","","",null,null,""]
[null,null,"Manager","","","","","","","",null,null,""]
[null,null,"Professional","","","","","","","",null,null,""]
[null,null,"Semi professional","","","","","","","",null,null,""]
[null,null,"Support staff","","","","","","","",null,null,""]
[null,null,"Intern, junior staff, apprentice","","","","","","","",null,null,""]
[null,"TOTAL DIRECT NETWORK LABOUR","Skilled electrical worker","","","","","","","",null,null,""]
[null,null,"Skilled non electical worker","","","","","","","",null,null,""]
[null,null,"Apprentice","","","","","","","",null,null,""]
[null,null,"Unskilled worker","","","","","","","",null,null,""]
[]
[null,"STAND DOWN OCCURENCES PER ASL"]
[null,null,null,"VOLUME\n(0's)"]
[null,"INTERNAL LABOUR",null,{"$f":"IF(dms_RPT=\"financial\",dms_CRYf_y1,dms_CRYc_y1)","v":"2008-09"},{"$f":"IF(dms_RPT=\"financial\",dms_CRYf_y2,dms_CRYc_y2)","v":"2009-10"},{"$f":"IF(dms_RPT=\"financial\",dms_CRYf_y3,dms_CRYc_y3)","v":"2010-11"},{"$f":"IF(dms_RPT=\"financial\",dms_CRYf_y4,dms_CRYc_y4)","v":"2011-12"},{"$f":"IF(dms_RPT=\"financial\",dms_CRYf_y5,dms_CRYc_y5)","v":"2012-13"},{"$f":"IF(dms_RPT=\"financial\",dms_CRYf_y6,dms_CRYc_y6)","v":"2013-14"},{"$f":"IF(dms_RPT=\"financial\",dms_CRYf_y7,dms_CRYc_y7)","v":"2014-15"},{"$f":"IF(dms_RPT=\"financial\",dms_CRYf_y8,dms_CRYc_y8)","v":"2015-16"},{"$f":"IF(dms_RPT=\"financial\",dms_CRYf_y9,dms_CRYc_y9)","v":"2016-17"},{"$f":"IF(dms_RPT=\"financial\",dms_CRYf_y10,dms_CRYc_y10)","v":"2017-18"}]
[null,"CORPORATE OVERHEADS","Executive manager"]
[null,null,"Senior manager","","","","","","","",null,null,""]
[null,null,"Manager"]
[null,null,"Professional","","","","","","","",null,null,""]
[null,null,"Semi professional","","","","","","","",null,null,""]
[null,null,"Support staff","","","","","","","",null,null,""]
[null,null,"Intern, junior staff, apprentice","","","","","","","",null,null,""]
[null,"NETWORK OVERHEADS ","Executive manager","","","","","","","",null,null,""]
[null,null,"Senior manager","","","","","","","",null,null,""]
[null,null,"Manager","","","","","","","",null,null,""]
[null,null,"Professional","","","","","","","",null,null,""]
[null,null,"Semi professional","","","","","","","",null,null,""]
[null,null,"Support staff","","","","","","","",null,null,""]
[null,null,"Intern, junior staff, apprentice","","","","","","","",null,null,""]
[null,"TOTAL DIRECT NETWORK LABOUR","Skilled electrical worker","","","","","","","",null,null,""]
[null,null,"Skilled non electical worker","","","","","","","",null,null,""]
[null,null,"Apprentice","","","","","","","",null,null,""]
[null,null,"Unskilled worker","","","","","","","",null,null,""]

{"sheet":"2.12 Input tables","index":17,"n_rows":468,"n_cols":13,"rows_kept":468,"cut":false,"hidden":false,"merged":[[394,3,394,12],[395,3,395,12],[317,3,317,12],[318,3,318,12],[5,1,5,2],[240,3,240,12],[241,3,241,12],[9,3,9,12],[10,3,10,12],[86,3,86,12],[87,3,87,12],[163,3,163,12],[164,3,164,12]]}
[null,"REGULATORY REPORTING STATEMENT"]
[null,{"$f":"INDEX(dms_TradingNameFull_List,MATCH(dms_TradingName,dms_TradingName_List))","v":"SA Power Networks"}]
[null,{"$f":"IF(SUM(dms_SingleYear_Model)>0,(\"CATEGORY ANALYSIS \"&CRY&\" to \"&FRY),(\"CATEGORY ANALYSIS \"&CRY))","v":"CATEGORY ANALYSIS 2008-09 to 2018-19"}]
[null,"2.12 INPUT TABLES"]
[]
[null,"There are SIX tables on this worksheet. Each table has been 'grouped' for easy navigation.  See the Instructions sheet on how to group or ungroup data."]
[]
[null,"2.12  INPUT TABLES"]
[null,"2.12.1 - DIRECT MATERIALS EXPENDITURE"]
[null,null,null,"EXPENDITURE"]
[null,null,null,"Actual ($0's)"]
[null,null,null,{"$f":"IF(dms_RPT=\"financial\",dms_CRYf_y1,dms_CRYc_y1)","v":"2008-09"},{"$f":"IF(dms_RPT=\"financial\",dms_CRYf_y2,dms_CRYc_y2)","v":"2009-10"},{"$f":"IF(dms_RPT=\"financial\",dms_CRYf_y3,dms_CRYc_y3)","v":"2010-11"},{"$f":"IF(dms_RPT=\"financial\",dms_CRYf_y4,dms_CRYc_y4)","v":"2011-12"},{"$f":"IF(dms_RPT=\"financial\",dms_CRYf_y5,dms_CRYc_y5)","v":"2012-13"},{"$f":"IF(dms_RPT=\"financial\",dms_CRYf_y6,dms_CRYc_y6)","v":"2013-14"},{"$f":"IF(dms_RPT=\"financial\",dms_CRYf_y7,dms_CRYc_y7)","v":"2014-15"},{"$f":"IF(dms_RPT=\"financial\",dms_CRYf_y8,dms_CRYc_y8)","v":"2015-16"},{"$f":"IF(dms_RPT=\"financial\",dms_CRYf_y9,dms_CRYc_y9)","v":"2016-17"},{"$f":"IF(dms_RPT=\"financial\",dms_CRYf_y10,dms_CRYc_y10)","v":"2017-18"}]
[null,"VEGETATION MANAGEMENT","Zone 1"]
[null,null,"Zone 2",0,0,0,0,0,0,0,0,0,0]
[null,null,"Zone 3",0,0,0,0,0,0,0,0,0,0]
[null,null,"Zone 4",0,0,0,0,0,0,0,0,0,0]
[null,null,"Zone 5",0,0,0,0,0,0,0,0,0,0]
[null,null,"Zone 6",0,0,0,0,0,0,0,0,0,0]
[null,null,"Zone 7",0,0,0,0,0,0,0,0,0,0]
[null,null,"Zone 8",0,0,0,0,0,0,0,0,0,0]
[null,null,"Zone 9",0,0,0,0,0,0,0,0,0,0]
[null,null,"Zone 10",0,0,0,0,0,0,0,0,0,0]
[null,null,"Zone 11",0,0,0,0,0,0,0,0,0,0]
[null,null,"Zone 12",0,0,0,0,0,0,0,0,0,0]
[null,null,"Zone 13",0,0,0,0,0,0,0,0,0,0]
[null,null,"Zone 14",0,0,0,0,0,0,0,0,0,0]
[null,null,"Zone 15",0,0,0,0,0,0,0,0,0,0]
[null,null,"Zone 16",0,0,0,0,0,0,0,0,0,0]
[null,null,"Zone 17",0,0,0,0,0,0,0,0,0,0]
[null,null,"Zone 18",0,0,0,0,0,0,0,0,0,0]
[null,"ROUTINE MAINTENANCE","Pole top, overhead line & service line maintenance",13000,1000,0,0,0,619.16066695070799,9488,0,0,1038.5899999999999]
[null,null,"Pole inspection and treatment",1000,3000,3000,92000,1000,295.21018983937398,15,214.37590347764475,154.38999999999999,4336.45]
[null,null,"Overhead asset inspection",40000,24000,8000,43000,11000,29441.775778838921,26187,9285.4261573639851,16200.34538945637,43926.36]
[null,null,"Network underground cable maintenance",1000,0,1000,0,10000,10310.923750650112,19272,395.64476144339534,21581.475473014591,10821.7]
[null,null,"Distribution substation equipment & property maintenance",7000,12000,2000,1000,0,3709.3159289650162,650,122.73477122998773,770.67909903041891,100.93]
[null,null,"Zone substation equipment maintenance",252000,137000,305000,371000,261000,116713.75,63417,88140.586293174943,80097.079222314351,490519.21]
[null,null,"Zone substation property maintenance",383000,665000,359000,108000,315000,35093.40116646282,30285,6548.957602467075,12277.131012055057,9767.73]
[null,null,"Public lighting maintenance",0,0,0,0,0,0,0,0,0,0]
[null,null,"Scada & network control maintenance",0,0,0,0,0,0,0,0,0,0]
[null,null,"Protection systems maintenance",4000,3000,3000,14000,26000,19630.307590417582,22940,3348.0874909805934,3867.5278192318151,9908.1299999999992]
[null,null,"Subtransmission asset maintenance - for dnsps with dual function assets",0,0,0,0,0,0,0,0,0,0]
[null,null,"Other",329000,423000,417000,235000,34000,257506.4,370561,147963.0041266382,83561.216503343458,159913.78]
[null,"NON-ROUTINE MAINTENANCE","Pole top, overhead line & service line maintenance",338771.11974585964,367761.52257602691,543890.82603297941,663336.28407005151,121786.89261311654,1856399.3025479773,171636.6284284438,197005.68249836902,608452.29722019169,454882.92391177663]
[null,null,"Pole inspection and treatment",0,0,0,0,0,0,0,0,0,0]
[null,null,"Overhead asset inspection",0,0,0,0,0,0,0,0,0,0]
[null,null,"Network underground cable maintenance",713187.05017280858,882771.60859171371,865082.90816847747,704878.9664501457,980259.32406068756,1939187.9383423605,329141.58856725995,459632.83031761338,465171.71277448081,605005.5304279764]
[null,null,"Distribution substation equipment & property maintenance",176000,146000,111000,181000,75000,96833.29,113242,79960.987347829068,44181.58183414115,272088.62]
[null,null,"Zone substation equipment maintenance",380000,179000,298000,316000,279000,184489.04,51814,161765.67388722461,139141.42131240602,148619.73000000001]
[null,null,"Zone substation property maintenance",301000,199000,448000,301000,128000,71111.341847980715,60839,5041.9331934729917,9705.8039455913586,26832.52]
[null,null,"Public lighting maintenance",0,0,0,0,0,0,0,0,0,0]
[null,null,"SCADA & network control maintenance",4000,8000,1000,3000,0,128882.66981624608,88663,17922.877898886247,24137.629772359811,38916.18]
[null,null,"Protection systems maintenance",4000,5000,12000,20000,14000,77426.110540552952,73623,9370.8817726445304,2525.8714387207569,8738.5]
[null,null,"Subtransmission asset maintenance - for DNSP with dual function assets",0,0,0,0,0,0,0,0,0,0]
[null,null,"Other",239000,106000,127000,67000,66000,187036.52,150769,139437.32758265923,82940.160276935261,164719.07999999999]
[null,"OVERHEADS","Network overheads",5239118.3766968185,5791738.3511699568,9953183.3481410872,4966482.1032531867,5541747.0031651277,4391035.8654755596,3215781.2269502725,2259078.293035001,3415804.1106297891,2740081.479104409]
[null,null,"Corporate overheads",1503683.0030295993,1336880.5698468769,1831446.0223383352,1983496.1091249357,2056315.1874465365,1121520.3539274824,4365650.4370208802,3544409.7517106198,6968714.2666605152,8936410.5366846975]
[null,"AUGMENTATION","Subtransmission substations, switching stations, zone substations",20428574.285402957,18906620.419749204,39677485.561607122,31072940.295714624,23247458.159088619,11350207.614191728,12560812.105074601,4261917.221610711,7611414.3696168642,8666872.3599999994]
[null,null,"Subtransmission lines",462631.14706763416,1622157.3932012112,1777503.9943337946,5754698.8244385617,2264443.6944852951,1226849.3881037375,2756434.2005121633,280048.53534505132,441840.2356129199,17523538.059999999]
[null,null,"HV feeders",1588724.8492306971,1354051.5187499826,1676355.16271095,2879967.9107215353,1041119.5579919332,1398530.8675012605,3827113.3442677292,1254509.501999754,3885667.2436217782,7999040.7899999991]
[null,null,"Distribution substations",0,0,0,0,0,1515128.8628147671,1905284.9809752682,1583060.4863615388,920218.36402075784,758088.91000000015]
[null,null,"LV feeders",6687267.2771446137,7866241.327669479,8777248.5956572313,10434905.675265497,5242817.6625274383,546485.48942588491,96562.323854862043,157246.72051972017,294750.91573283216,795787.61]
[null,null,"Other assets",0,0,0,0,0,1201012.4635183413,5681313.572960699,1317487.1843973252,123908.89514981835,315067.89]
[null,"CONNECTIONS","Simple and complex customer connections",41847484.153901525,38854122.748688102,26755051.581218909,24185064.35861877,22022118.144754559,18770620,15753958,12037829.578797702,14934675.166970257,15741647.32]
[null,"EMERGENCY RESPONSE","Major storms",4411000,4260000,4673000,2734000,2426000,-1563000,2707848,1563389.8762126858,1878930.3931876216,1441302.5]
[null,null,"Major event days",175000,103000.00000000001,84000,22000,42000,0,0,22000.342610884167,0,0]
[null,"PUBLIC LIGHTING","All public lighting services",3285307.3237293488,3543211.8783384743,2842733.002226634,3105899.2390728621,2949505.5644728439,2778447.511243179,3002616.3266537176,3141745.2423492935,6203438.7503804946,5230289.2061406048]
[null,"METERING","All metering services",7095000,9619999.9999999981,14202000,14396000,10459000,7373683.1201191219,6411483.0623456826,4796566.751826046,4237501.7718931306,3180460.28]
[null,"FEE-BASED SERVICES","All fee-based services",1887840.1739157923,1939225.4194123123,2271726.0896091084,1879112.2704463114,1334351.7569052859,1192349.4148830299,1210529.4708033244,2143868.6201508427,1301647.8442841431,1313776.3025420948]
[null,"QUOTED SERVICES","All quoted services",2703474.5151695288,2709787.2877415023,6862535.0653130915,2586173.4382187543,1668411.1795597011,1053680.8736691361,1538502.9160587322,7809429.4642151017,4435408.7918338059,3786115.2381436378]
[null,"REPLACEMENT","Poles",1693509.0754474823,1475402.9491261686,1677570.8304746442,3138010.9778663591,6170217.8206673097,3262089.6518365941,3200765.4073047899,2658053.4254395766,3357706.0906755901,3309969.04]
[null,null,"Pole top structures",1490359.3364394377,885373.99190799566,1158006.0574491736,1597943.2912615817,1285750.0054677981,2998071.3419309896,2176898.8136480702,3712996.9982201159,3087814.9489938268,5117256.0999999996]
[null,null,"Overhead conductors",150099.93010979332,212983.00366002141,474451.41898310144,547629.17080399254,369861.0892086426,614925.08761904016,51767.769145686209,17818.779103638939,9499.3963059672387,242682.95608822338]
[null,null,"Underground cables",109244.3022697845,64758.612147792359,202559.21180402976,195085.11770888243,122076.73028929508,32716.2433623611,6449.5216309650568,21124.788783934026,2288.6054865668993,77584.729572023614]
[null,null,"Service lines",86936.504463066711,79150.704223607958,106072.51800772711,95975.989423696694,125791.00772614413,176639.16945914616,168491.94468767199,243227.79818273371,283352.39679161779,422721.74]
[null,null,"Transformers",2584781.1001567026,4103421.5290315831,7212175.2537712334,2317892.1818860853,3665633.166956123,3292265.6894809678,1988365.4967896901,2439010.9208199708,2843724.3485201602,6343935.5099999998]
[null,null,"Switchgear",1637018.2800450188,2736080.8276508157,4323874.9537591925,5895791.478322437,3464804.357855441,2938923.5141456742,3377165.7447431702,2747972.7590237223,4019763.4666147339,8574596.4299999997]
[null,null,"Public lighting",0,0,0,0,0,0,0,0,0,0]
[null,null,"SCADA network control and protection systems",366696.86680693331,985700.44760791829,2020575.4766227936,2372026.6344345412,1201509.5360038234,0,1135982.7453836701,482350.07356504351,1639294.0733870436,3296410.04]
[null,null,"Other",1121696.2745285945,1878081.7629519927,5157372.5480546849,2288190.5964441407,2450039.9400551622,3138774.2058497774,1721439.6123888199,2443288.8693066458,2302649.8873803644,4182721.39]
[null,"NON-NETWORK EXPENDITURE","IT and communications",6326971.0158512183,4546066.5306995027,6242022.3678062558,7180893.989100324,4837635.8158432571,3915939.9778041518,10728059.713020964,12436767.383362256,10579616.168190742,13565168.169454781]
[null,null,"Motor vehicles",16252000,13522000,16837000,14959000,19878000,22229000,20140971,14637500.469999999,13760088.290000001,17672400]
[null,null,"Buildings and property",1197053.2003003189,580969.11789592891,37001.016225630374,8848599.9526368268,1025862.5942272191,1467605.3564920763,103183.7394311458,219177.15415656538,335532.98508121795,1676166.1865557628]
[null,null,"Other",4883000,6864000,9353000,7831000,9456000,11152000,13661176,5520724.1708319541,5572360.9478882989,7896771]
[]
[]
[null,"2.12.2 - DIRECT LABOUR EXPENDITURE"]
[null,null,null,"EXPENDITURE"]
[null,null,null,"Actual ($0's)"]
[null,null,null,{"$f":"IF(dms_RPT=\"financial\",dms_CRYf_y1,dms_CRYc_y1)","v":"2008-09"},{"$f":"IF(dms_RPT=\"financial\",dms_CRYf_y2,dms_CRYc_y2)","v":"2009-10"},{"$f":"IF(dms_RPT=\"financial\",dms_CRYf_y3,dms_CRYc_y3)","v":"2010-11"},{"$f":"IF(dms_RPT=\"financial\",dms_CRYf_y4,dms_CRYc_y4)","v":"2011-12"},{"$f":"IF(dms_RPT=\"financial\",dms_CRYf_y5,dms_CRYc_y5)","v":"2012-13"},{"$f":"IF(dms_RPT=\"financial\",dms_CRYf_y6,dms_CRYc_y6)","v":"2013-14"},{"$f":"IF(dms_RPT=\"financial\",dms_CRYf_y7,dms_CRYc_y7)","v":"2014-15"},{"$f":"IF(dms_RPT=\"financial\",dms_CRYf_y8,dms_CRYc_y8)","v":"2015-16"},{"$f":"IF(dms_RPT=\"financial\",dms_CRYf_y9,dms_CRYc_y9)","v":"2016-17"},{"$f":"IF(dms_RPT=\"financial\",dms_CRYf_y10,dms_CRYc_y10)","v":"2017-18"}]
[null,"VEGETATION MANAGEMENT",{"$f":"IF(ISBLANK(C13),\" \",C13)","v":"Zone 1"}]
[null,null,{"$f":"IF(ISBLANK(C14),\" \",C14)","v":"Zone 2"},0,0,0,0,0,0,0,0,0,0]
[null,null,"Zone 3",0,0,0,0,0,0,0,0,0,0]
[null,null,"Zone 4",0,0,0,0,0,0,0,0,0,0]
[null,null,"Zone 5",0,0,0,0,0,0,0,0,0,0]
[null,null,"Zone 6",0,0,0,0,0,0,0,0,0,0]
[null,null,"Zone 7",0,0,0,0,0,0,0,0,0,0]
[null,null,"Zone 8",0,0,0,0,0,0,0,0,0,0]
[null,null,"Zone 9",0,0,0,0,0,0,0,0,0,0]
[null,null,"Zone 10",0,0,0,0,0,0,0,0,0,0]
[null,null,"Zone 11",0,0,0,0,0,0,0,0,0,0]
[null,null,"Zone 12",0,0,0,0,0,0,0,0,0,0]
[null,null,"Zone 13",0,0,0,0,0,0,0,0,0,0]
[null,null,"Zone 14",0,0,0,0,0,0,0,0,0,0]
[null,null,"Zone 15",0,0,0,0,0,0,0,0,0,0]
[null,null,"Zone 16",0,0,0,0,0,0,0,0,0,0]
[null,null,"Zone 17",0,0,0,0,0,0,0,0,0,0]
[null,null,"Zone 18",0,0,0,0,0,0,0,0,0,0]
[null,"ROUTINE MAINTENANCE","Pole top, overhead line & service line maintenance",16000,0,1000,31000,0,13337.790815303882,115224,1761.6476862946542,5220.8663382117466,6444.78]
[null,null,"Pole inspection and treatment",572000,582000,992000,2034000,1059000,451935.30545880698,346974,169437.02260284993,123589.13999999997,54882.82]
[null,null,"Overhead asset inspection",1560000,1285000,810000,823000,1193000,1047204.528992508,1215003,1334229.501705596,1524301.9383443035,1732057.47]
[null,null,"Network underground cable maintenance",123000,23000,32000,48000,39000,74847.664286710176,239089,109685.49951167247,263967.80484734784,209844.9]
[null,null,"Distribution substation equipment & property maintenance",153000,140000,147000,136000,151000,197392.84547936518,294926,320376.56806707534,288443.45331193937,251026.53]
[null,null,"Zone substation equipment maintenance",2025000,1619000,1992000,2425000,2990000,699202.69,1228629,1341267.6755812108,1660062.4330022712,1406288.02]
[null,null,"Zone substation property maintenance",367000,374000,429000,502000,546000,327570.09398679715,155952,156777.24126416346,166721.12936886077,181314.41]
[null,null,"Public lighting maintenance",0,0,0,0,0,0,0,0,0,0]
[null,null,"Scada & network control maintenance",0,0,0,0,0,0,0,0,0,0]
[null,null,"Protection systems maintenance",333000,671000,565000,438000,1065000,911681.79978592671,1004620,651269.28297867079,699512.51001656498,530623.43999999994]
[null,null,"Subtransmission asset maintenance - for dnsps with dual function assets",0,0,0,0,0,0,0,0,0,0]
[null,null,"Other",677000,751000,646000,552000,439000,3013676.15,3029016,2796931.4020609218,2118235.3890402094,1855604.5]
[null,"NON-ROUTINE MAINTENANCE","Pole top, overhead line & service line maintenance",1024791.3434659994,1317597.6667661746,1262076.0892744176,1451067.4816485501,883574.27962082042,2546325.815891502,1876849.8210614934,2355160.5316816708,3752415.2056961837,2147855.8222645829]
[null,null,"Pole inspection and treatment",0,0,0,0,0,0,0,0,0,0]
[null,null,"Overhead asset inspection",0,0,0,0,0,0,0,0,0,0]
[null,null,"Network underground cable maintenance",1060575.9080863299,1655162.4813988125,1736947.5244203894,2024300.782206344,2933005.9841447063,3437595.0639658379,3154079.1888890797,3082420.2735991725,3996258.5678337631,3096578.3435380552]
[null,null,"Distribution substation equipment & property maintenance",333000,376000,263000,413000,453000,252806.68,269011,213006.52757793729,217913.64282635332,375899.8]
[null,null,"Zone substation equipment maintenance",2170000,1984000,2079000,2837000,2451000,1413980.7,1625154,1279839.4622565787,1493780.4106461166,1534774.52]
[null,null,"Zone substation property maintenance",436000,305000,335000,499000,509000,340817.07953472866,179374,62687.796298173118,66600.801671302033,169512.8]
[null,null,"Public lighting maintenance",0,0,0,0,0,0,0,0,0,0]
[null,null,"SCADA & network control maintenance",67000,12000,8000,32000,65000,563119.37238148449,336570,214804.07409508637,292051.79901223734,224843.09]
[null,null,"Protection systems maintenance",118000,226000,175000,182000,278000,328235.55608620291,239951,124344.74920997805,68346.093326235845,132791.76999999999]
[null,null,"Subtransmission asset maintenance - for DNSP with dual function assets",0,0,0,0,0,0,0,0,0,0]
[null,null,"Other",711000,752000,608000,747000,789000,1737506.94,1573274,1838821.2160861443,1479245.4626621194,1607957.92]
[null,"OVERHEADS","Network overheads",23453845.029786624,28125831.917926989,29906731.25155583,33287912.803304326,37873194.593690634,39433783.129562981,37032470.64156013,36014229.136768632,37796142.680385388,36251846.597699821]
[null,null,"Corporate overheads",35008631.178856269,35016908.41133941,42073526.21329318,42549121.104775824,32191238.168856498,28776130.672031373,28079369.700813007,18231824.140821375,15816247.240922617,35592721.99162782]
[null,"AUGMENTATION","Subtransmission substations, switching stations, zone substations",11018567.701359451,14609268.738907479,20113635.587840572,19125826.530509438,23519924.391952302,19992254.168232962,21884605.904200844,13018920.364340799,14685191.913089508,9896229.9399999995]
[null,null,"Subtransmission lines",1106207.8380127966,1128840.7408194472,1704062.6399771939,4327695.8990896251,3615356.9694104735,5012182.4770223498,2718810.2145557469,584888.62554764363,1297381.4934443191,3107504.53]
[null,null,"HV feeders",1315046.1162263576,704043.50736139168,1292989.5383210278,1758846.8860454611,1222776.5484014128,1620997.3631518551,6236658.3369130259,5890765.6998958355,6391500.5799703673,8902601.2699999996]
[null,null,"Distribution substations",0,0,0,0,0,1173208.7132641824,700899.99417993426,1218253.4656668624,1064667.682808724,670431.02]
[null,null,"LV feeders",5402967.9686533222,6115329.0995389018,6776571.1376519091,9119002.3630968742,7797111.0293028159,1723776.9479434821,112235.26470508975,390895.32917190413,363305.55411880044,1004058.89]
[null,null,"Other assets",0,0,0,0,0,1838572.2375896815,4760663.6307682786,3087652.8305270583,1217740.411772042,842958.06000000017]
[null,"CONNECTIONS","Simple and complex customer connections",30291902.439456977,38835376.38299381,31325415.647966966,29518007.397817846,32758542.78453318,36714760,33035979.000000004,32727138.027925931,32410152.064720962,37086008.509999998]
[null,"EMERGENCY RESPONSE","Major storms",17217000,16840000,18559000,17029000,22029000,25609000,19735537,22064742.079040382,26763309.108253382,19771628.719999999]
[null,null,"Major event days",336000,413000,826000,282000,692000,0,0,274669.08036771626,0,0]
[null,"PUBLIC LIGHTING","All public lighting services",3384646.5030502961,4004919.2776136631,3669294.983428671,4083760.1663125828,4051100.2088948265,4398780.6808521664,3402074.6351382704,3486312.3696349342,4626224.4206437133,3580726.898276845]
[null,"METERING","All metering services",4609000,4109000,5312000,8291000,7083000.0000000009,5034645.3046904597,4082751.0215692823,3773608.8337679603,2996066.6315494981,1873199.18]
[null,"FEE-BASED SERVICES","All fee-based services",1892458.9381888311,2680168.5358975977,1800430.8099956354,2645223.976208501,3213695.6003660006,4148911.7513438156,3748414.0298836916,3930977.1357875224,2930886.2431019451,3525722.077109226]
[null,"QUOTED SERVICES","All quoted services",2710088.7994062267,3745148.2199429097,5438824.52324659,3640553.0914792027,4018255.0362790478,3666399.2151671043,4763986.3833670216,14319295.678302808,9987093.4120959975,10160626.322588863]
[null,"REPLACEMENT","Poles",1799580.6512816728,1720957.5346602907,1874769.8127155078,2235781.1052503558,5788267.6378475651,4498497.3883699514,4285357.5778709203,4804811.7083722195,8030182.8752531642,6674779.4500000002]
[null,null,"Pole top structures",4762098.1824429585,4972098.5768963322,4825281.3057870725,5721695.2069778191,7525942.944266486,7913408.1705327826,12030505.1209,14592138.915488547,12239558.798381288,12775330.34]
[null,null,"Overhead conductors",355847.77893643349,647470.01965680718,843411.10544172756,972898.59813695261,1481807.4420389838,690041.58920054487,584250.6792782566,229920.79654824384,53324.71851402428,990025.68773541693]
[null,null,"Underground cables",162074.78295782418,121390.5324073853,400576.45686745807,551288.37774787797,365752.15556130745,56824.082138188183,73125.896079590078,133948.06480650557,19791.762883885764,419096.36646194477]
[null,null,"Service lines",1987676.5149039875,2477574.5222795322,2568354.6977361278,2640334.7762763924,3405942.0260231579,3577446.2534865583,3806872.1523140199,5021451.5048339088,4708003.4553963821,5592218.4500000002]
[null,null,"Transformers",1256211.1668818998,1711966.5215098187,2184839.7822288712,1450175.7598225058,3075719.734968219,2227448.5801681848,2316804.3122875001,2448717.8645323804,2379094.2493957481,5339453.72]
[null,null,"Switchgear",1638556.924425171,2327482.6795309912,2910438.9851074051,3841792.5403281245,3999337.5819765264,5292252.3360000663,4589670.4082240202,3721105.2462534076,5466241.5801933426,10179155.720000001]
[null,null,"Public lighting",0,0,0,0,0,0,0,0,0,0]
[null,null,"SCADA network control and protection systems",411136.61853041442,1007691.0550761746,1528239.2804559665,2419496.5326302662,2023297.704201798,0,3480006.5704934401,1488388.3367878858,3839949.2858998161,4838793.13]
[null,null,"Other",1673016.9802425352,1151242.9627107973,1397060.4117515222,2468027.706402522,3431299.5911737015,6223139.1127244607,4271726.6785856197,4099174.8988903239,4341717.3504854497,5152604.7300000004]
[null,"NON-NETWORK EXPENDITURE","IT and communications",10148953.507171487,10428152.613755919,18822067.447428606,22448389.284644138,21445888.510622673,23428879.566948861,15411554.15310597,15841594.71729774,17860435.191355214,19855511.914292019]
[null,null,"Motor vehicles",883000,1116000,1081000,904000,1361000,3033000,3332397,2893898.71,2521196,2618895]
[null,null,"Buildings and property",1010044.8891422908,887952.79981339921,1348037.0235716149,1888925.9968846752,2028773.0097898215,2291699.186854044,1565958.7195265994,4132293.2496714666,1054183.2253285933,1103173.0140827568]
[null,null,"Other",873000,2276000,2447000,4990000,5797000,16106000,14669719,5792807.3430187646,3419253.541104761,4031333]
[]
[]
[null,"2.12.3 - CONTRACT EXPENDITURE"]
[null,null,null,"EXPENDITURE"]
[null,null,null,"Actual ($0's)"]
[null,null,null,{"$f":"IF(dms_RPT=\"financial\",dms_CRYf_y1,dms_CRYc_y1)","v":"2008-09"},{"$f":"IF(dms_RPT=\"financial\",dms_CRYf_y2,dms_CRYc_y2)","v":"2009-10"},{"$f":"IF(dms_RPT=\"financial\",dms_CRYf_y3,dms_CRYc_y3)","v":"2010-11"},{"$f":"IF(dms_RPT=\"financial\",dms_CRYf_y4,dms_CRYc_y4)","v":"2011-12"},{"$f":"IF(dms_RPT=\"financial\",dms_CRYf_y5,dms_CRYc_y5)","v":"2012-13"},{"$f":"IF(dms_RPT=\"financial\",dms_CRYf_y6,dms_CRYc_y6)","v":"2013-14"},{"$f":"IF(dms_RPT=\"financial\",dms_CRYf_y7,dms_CRYc_y7)","v":"2014-15"},{"$f":"IF(dms_RPT=\"financial\",dms_CRYf_y8,dms_CRYc_y8)","v":"2015-16"},{"$f":"IF(dms_RPT=\"financial\",dms_CRYf_y9,dms_CRYc_y9)","v":"2016-17"},{"$f":"IF(dms_RPT=\"financial\",dms_CRYf_y10,dms_CRYc_y10)","v":"2017-18"}]
[null,"VEGETATION MANAGEMENT",{"$f":"IF(ISBLANK(C13),\" \",C13)","v":"Zone 1"}]
[null,null,"Zone 2",0,0,0,0,0,0,0,0,0,0]
[null,null,"Zone 3",0,0,0,0,0,0,0,0,0,0]
[null,null,"Zone 4",0,0,0,0,0,0,0,0,0,0]
[null,null,"Zone 5",0,0,0,0,0,0,0,0,0,0]
[null,null,"Zone 6",0,0,0,0,0,0,0,0,0,0]
[null,null,"Zone 7",0,0,0,0,0,0,0,0,0,0]
[null,null,"Zone 8",0,0,0,0,0,0,0,0,0,0]
[null,null,"Zone 9",0,0,0,0,0,0,0,0,0,0]
[null,null,"Zone 10",0,0,0,0,0,0,0,0,0,0]
[null,null,"Zone 11",0,0,0,0,0,0,0,0,0,0]
[null,null,"Zone 12",0,0,0,0,0,0,0,0,0,0]
[null,null,"Zone 13",0,0,0,0,0,0,0,0,0,0]
[null,null,"Zone 14",0,0,0,0,0,0,0,0,0,0]
[null,null,"Zone 15",0,0,0,0,0,0,0,0,0,0]
[null,null,"Zone 16",0,0,0,0,0,0,0,0,0,0]
[null,null,"Zone 17",0,0,0,0,0,0,0,0,0,0]
[null,null,"Zone 18",0,0,0,0,0,0,0,0,0,0]
[null,"ROUTINE MAINTENANCE","Pole top, overhead line & service line maintenance",0,0,0,6000,0,23690.261406103618,3389,651.64836383897352,1005.8550811234013,10603.17]
[null,null,"Pole inspection and treatment",34000,25000,61000,1747000,4076000,3988818.9561566412,5999714,6141147.2056906223,5620718.5000000028,5098843.0599999996]
[null,null,"Overhead asset inspection",1619000,3094000,5507000,3413000,5265000,4289769.2153098667,5212298,4495177.0620370014,4174997.3424253976,3109527.78]
[null,null,"Network underground cable maintenance",0,0,0,0,0,0,5741,19978.638614259762,214734.59435932973,345814.81]
[null,null,"Distribution substation equipment & property maintenance",4000,13000,4000,4000,2000,2348.694142416301,5721,13961.054281450675,7101.0413058866261,3848.73]
[null,null,"Zone substation equipment maintenance",307000,283000,412000,563000,472000,154206.48000000001,226685,445682.22073247941,303093.10127277375,342376.28]
[null,null,"Zone substation property maintenance",43000,27000,30000,279000,42000,700989.2215030503,962325,795275.35170682077,782428.65745043394,868713.15]
[null,null,"Public lighting maintenance",0,0,0,0,0,0,0,0,0,0]
[null,null,"Scada & network control maintenance",0,0,0,0,0,0,0,0,0,0]
[null,null,"Protection systems maintenance",4000,9000,20000,9000,19000,13061.205437830611,33976,18800.889199922687,47581.374088947923,45242.37]
[null,null,"Subtransmission asset maintenance - for dnsps with dual function assets",0,0,0,0,0,0,0,0,0,0]
[null,null,"Other",99000,113000,78000,371000,645000,1265287.73,940607,905324.50979991315,1172633.8954695147,966795.71]
[null,"NON-ROUTINE MAINTENANCE","Pole top, overhead line & service line maintenance",80903.641790333189,77873.527437897166,216802.44910926957,337934.70626583166,134669.15621007539,691747.98101886956,311400.60550708568,221142.24552741746,843540.90984940738,1089397.3831523438]
[null,null,"Pole inspection and treatment",0,0,0,0,0,0,0,0,0,0]
[null,null,"Overhead asset inspection",0,0,0,0,0,0,0,0,0,0]
[null,null,"Network underground cable maintenance",432191.13701290276,358073.3694927707,919480.19157257595,1770381.1819264744,1265329.9085461283,3088264.615619747,4334247.8503495492,2908736.9304537429,5098932.4847698072,8086476.641979076]
[null,null,"Distribution substation equipment & property maintenance",54000,16000,14000,194000,121000,149164.5,525772,401620.20953646192,461728.78431236971,404462.89]
[null,null,"Zone substation equipment maintenance",265000,95000,173000,883000,142000,404745.21,314198,313665.41707675223,192407.47082044836,267341.36]
[null,null,"Zone substation property maintenance",155000,13000,28000,306000,211000,263002.52837578679,367407,622614.67843922297,516771.46200302953,604010.66]
[null,null,"Public lighting maintenance",0,0,0,0,0,0,0,0,0,0]
[null,null,"SCADA & network control maintenance",2000,1000,0,1000,1000,24192.3229529296,94567,212273.68911471276,170988.5543212695,431082.29]
[null,null,"Protection systems maintenance",17000,8000,14000,4000,12000,6966.0733817789969,10004,5841.4942885456667,5595.6506940597446,10019.56]
[null,null,"Subtransmission asset maintenance - for DNSP with dual function assets",0,0,0,0,0,0,0,0,0,0]
[null,null,"Other",659000,422000,419000,621000,703000,513941.35,1337321,1118837.4091200356,651026.1493200633,7130690.9400000004]
[null,"OVERHEADS","Network overheads",1798272.4756857413,5341683.6561433524,3790907.4252606616,4465127.2967855185,5773290.6383056557,8552947.6424232908,10273921.395423798,9560507.8298719842,12020065.835158983,16557804.623372175]
[null,null,"Corporate overheads",5393.4110582123358,1072334.9847713141,96221.190075626815,-210436.20308996868,63564.611667590005,-57350.472644018977,-74172.870678039253,1581971.1862739106,2946139.6738925381,1839332.1640360651]
[null,"AUGMENTATION","Subtransmission substations, switching stations, zone substations",6195296.624633139,9433959.420686651,30517576.580824342,32959108.641081214,30086065.796592906,27992339.688914813,15939082.992426412,6293982.9778133947,8632111.2990826387,8129463.9800000014]
[null,null,"Subtransmission lines",372442.56798267999,627655.48628915392,1036000.725024412,4111702.1389828096,3851149.4032140253,3585067.3169379267,4273510.4126761286,303967.63049783628,521527.76108731376,2433899.64]
[null,null,"HV feeders",882379.94152737164,402406.31645707472,1890271.7771970592,1907603.6344173688,1969477.0326680676,1498416.4486901064,8623199.648069527,7908816.3618725054,8895235.1814507302,11232361.579999998]
[null,null,"Distribution substations",0,1975.3282708983718,34380.500527662298,32167.026012271413,44481.361101640221,906323.29329602118,1946346.8094603806,832682.3706353649,556815.90542983706,52322.62000000001]
[null,null,"LV feeders",4477993.4587200964,5159715.917556786,7275007.234494322,14420804.542890243,14082922.724302385,373067.16078513075,16106.444621125118,21171.570801146016,190006.99873849025,78360.03]
[null,null,"Other assets",0,0,0,0,0,159150.87737324976,1137063.4628029051,64053.773678426129,154512.51289087711,728590.47]
[null,"CONNECTIONS","Simple and complex customer connections",16090168.780796045,20306007.566741105,14107637.996963786,13441034.238747798,15609001.60243647,14362669.999999998,1555764,7708859.0284223715,8949642.381492272,13928015.17]
[null,"EMERGENCY RESPONSE","Major storms",2420000,2495000,2898000,3686000,2761000,3276000,6711821,6145482.9525009319,11118534.340355791,10950127.74]
[null,null,"Major event days",2000,3000,12000,2000,11000,0,0,9178.4710254182191,0,0]
[null,"PUBLIC LIGHTING","All public lighting services",-102892.50190538065,556430.57321171416,1071476.1281917845,1108820.2252466553,1934687.4272605816,2451788.1102449321,3381850.2627026457,3781673.1141342148,4483782.1782399109,6797977.8498843051]
[null,"METERING","All metering services",4815000,4341000,4264000,4536000,4719000,4430249.8000984378,3879279.1570222704,3939085.9017668874,4033021.313572227,3710101.42]
[null,"FEE-BASED SERVICES","All fee-based services",431243.65401133336,620648.31286275689,455365.22083020379,801793.01342792448,1397887.3206544325,1175963.6030067424,736174.78503063775,1775127.0750008759,2485748.6971680117,3417911.0396120674]
[null,"QUOTED SERVICES","All quoted services",617560.87435621489,867266.3278430989,1375588.2849454875,1103486.9107550303,1747853.0840726118,1039200.7084104661,935629.47521379439,6466221.648070219,8470272.258447852,9849930.3455657978]
[null,"REPLACEMENT","Poles",598245.77052840579,490100.28396507399,947955.98295872309,3534379.1853618077,8932249.6896451432,8868232.5904479679,14402487.0391462,10194598.597716564,11464599.647415131,16443114.25]
[null,null,"Pole top structures",366925.48705441563,248432.91696655683,282479.51424467401,559900.83547222789,595301.57605939521,2402548.452176691,1684861.5306054,2356055.7440538523,2654709.8615698013,4613598.17]
[null,null,"Overhead conductors",35150.749140776883,45362.386362610501,193869.54769886195,246241.89463591488,529809.02292467188,229763.68423512217,72629.250493317348,10955.752704604165,11033.268032139167,345174.96684765606]
[null,null,"Underground cables",67989.738802165026,27411.109668856603,216833.24061132676,490283.7084747781,158584.77559765591,52893.441833381075,110161.01099174097,143111.36713701626,26606.329857571982,1202895.358020925]
[null,null,"Service lines",44231.875870294403,14040.584064960618,41212.748011423282,120948.75025056934,40264.27973039163,146081.82168143257,379409.30293968797,464535.98687645036,581285.29308564158,1895837.18]
[null,null,"Transformers",252368.50798233328,349413.53677212517,1727247.3773528188,628781.68624583655,1228369.9573602888,908287.96104579826,577787.80813965295,635769.58047666692,871478.2954125494,1998775.14]
[null,null,"Switchgear",244572.90265080944,251743.06972111203,585269.95252969442,9379477.6362382583,5795649.5449031601,2375743.9432697739,1463860.1698584601,1180648.4590465904,1482041.7265408672,5767333.0199999996]
[null,null,"Public lighting",0,0,0,0,0,0,0,0,0,0]
[null,null,"SCADA network control and protection systems",64348.272691105267,606671.43749994889,689802.43594576197,2546783.3460365986,1281837.2668100279,0,2703986.3443833101,404289.65628399962,1568360.0207768085,2376619.88]
[null,null,"Other",425558.60924924019,-109523.65483086504,310985.41026244592,1441063.1574296607,1660306.2537937267,2353048.4927510181,1785469.7209479201,1768400.6934304831,1019610.3815043687,3190583.43]
[null,"NON-NETWORK EXPENDITURE","IT and communications",209999.03798463027,75001.097624826798,-50000.17917178994,475272.1566256216,624018.1373826249,184338.14144879594,19339.629492702941,1098554.7476684963,6337670.7967741555,3058918.7883869004]
[null,null,"Motor vehicles",296000,164000,157000,176000,250000,231000,235337,232566,236420,251258]
[null,null,"Buildings and property",225010.00005645092,2999.8405399101325,45001.235950090995,497190.88078676973,112765.0517000737,207519.99602335275,-160154.45039046605,81190.504936137251,196805.12475510055,573478.27919460845]
[null,null,"Other",1830000,2461000,2881000,3485000,8288000,9985000,10347157,6052332.8175446736,6531201.4892595783,5438647]
[]
[]
[null,"2.12.4 - OTHER EXPENDITURE"]
[null,null,null,"EXPENDITURE"]
[null,null,null,"Actual ($0's)"]
[null,null,null,{"$f":"IF(dms_RPT=\"financial\",dms_CRYf_y1,dms_CRYc_y1)","v":"2008-09"},{"$f":"IF(dms_RPT=\"financial\",dms_CRYf_y2,dms_CRYc_y2)","v":"2009-10"},{"$f":"IF(dms_RPT=\"financial\",dms_CRYf_y3,dms_CRYc_y3)","v":"2010-11"},{"$f":"IF(dms_RPT=\"financial\",dms_CRYf_y4,dms_CRYc_y4)","v":"2011-12"},{"$f":"IF(dms_RPT=\"financial\",dms_CRYf_y5,dms_CRYc_y5)","v":"2012-13"},{"$f":"IF(dms_RPT=\"financial\",dms_CRYf_y6,dms_CRYc_y6)","v":"2013-14"},{"$f":"IF(dms_RPT=\"financial\",dms_CRYf_y7,dms_CRYc_y7)","v":"2014-15"},{"$f":"IF(dms_RPT=\"financial\",dms_CRYf_y8,dms_CRYc_y8)","v":"2015-16"},{"$f":"IF(dms_RPT=\"financial\",dms_CRYf_y9,dms_CRYc_y9)","v":"2016-17"},{"$f":"IF(dms_RPT=\"financial\",dms_CRYf_y10,dms_CRYc_y10)","v":"2017-18"}]
[null,"VEGETATION MANAGEMENT",{"$f":"IF(ISBLANK(C13),\" \",C13)","v":"Zone 1"}]
[null,null,"Zone 2",0,0,0,0,0,0,0,0,0,0]
[null,null,"Zone 3",0,0,0,0,0,0,0,0,0,0]
[null,null,"Zone 4",0,0,0,0,0,0,0,0,0,0]
[null,null,"Zone 5",0,0,0,0,0,0,0,0,0,0]
[null,null,"Zone 6",0,0,0,0,0,0,0,0,0,0]
[null,null,"Zone 7",0,0,0,0,0,0,0,0,0,0]
[null,null,"Zone 8",0,0,0,0,0,0,0,0,0,0]
[null,null,"Zone 9",0,0,0,0,0,0,0,0,0,0]
[null,null,"Zone 10",0,0,0,0,0,0,0,0,0,0]
[null,null,"Zone 11",0,0,0,0,0,0,0,0,0,0]
[null,null,"Zone 12",0,0,0,0,0,0,0,0,0,0]
[null,null,"Zone 13",0,0,0,0,0,0,0,0,0,0]
[null,null,"Zone 14",0,0,0,0,0,0,0,0,0,0]
[null,null,"Zone 15",0,0,0,0,0,0,0,0,0,0]
[null,null,"Zone 16",0,0,0,0,0,0,0,0,0,0]
[null,null,"Zone 17",0,0,0,0,0,0,0,0,0,0]
[null,null,"Zone 18",0,0,0,0,0,0,0,0,0,0]
[null,"ROUTINE MAINTENANCE","Pole top, overhead line & service line maintenance",2000,0,0,3000,0,1608.8710702793901,31919,719.47110440957806,1057.428580664852,1401.69]
[null,null,"Pole inspection and treatment",23000,57000,107000,201000,87000,82.221473209568387,0,5735.8112025119308,719.36,914.38]
[null,null,"Overhead asset inspection",108000,101000,48000,29000,52000,28721.343359439525,18867,27282.976530375025,11997.823840845591,4065.37]
[null,null,"Network underground cable maintenance",11000,2000,3000,2000,1000,5199.992301921674,7372,6824.8773240906548,9984.2653203077516,10993.48]
[null,null,"Distribution substation equipment & property maintenance",3000,4000,3000,1000,2000,215.19050769764269,738,1042.6436091728615,912.3462831426948,500.8]
[null,null,"Zone substation equipment maintenance",114000,71000,92000,85000,123000,47288.4,54815,102602.67782734595,114014.82650264044,99280.17]
[null,null,"Zone substation property maintenance",53000,75000,88000,51000,11000,14281.986899892105,3632,2740.4953679560376,3479.7521686515597,12965.9]
[null,null,"Public lighting maintenance",0,0,0,0,0,0,0,0,0,0]
[null,null,"Scada & network control maintenance",0,0,0,0,0,0,0,0,0,0]
[null,null,"Protection systems maintenance",16000,18000,31000,14000,39000,31578.01303821665,45561,62645.327950137158,62395.378075255408,65753.22]
[null,null,"Subtransmission asset maintenance - for dnsps with dual function assets",0,0,0,0,0,0,0,0,0,0]
[null,null,"Other",6000,32000,35000,25000,16000,82370.039999999994,81446,139990.72378353245,70754.668986933175,96619.29]
[null,"NON-ROUTINE MAINTENANCE","Pole top, overhead line & service line maintenance",175000.93648871573,189084.36224681154,212800.66362491241,236425.46621882945,214537.72389040928,519649.80514230859,369587.91533444042,478190.89807640627,491772.47044183989,315787.15877356997]
[null,null,"Pole inspection and treatment",0,0,0,0,0,0,0,0,0,0]
[null,null,"Overhead asset inspection",0,0,0,0,0,0,0,0,0,0]
[null,null,"Network underground cable maintenance",138751.09616089048,187588.04665942784,218647.12484139446,279852.09755660908,470100.13052667642,565078.52286023321,469672.4018627514,525464.59913612681,722864.9256423465,334383.42595262371]
[null,null,"Distribution substation equipment & property maintenance",49000,55000,42000,43000,67000,37345.800000000003,61227,42876.197777177913,50455.971027135805,60394.19]
[null,null,"Zone substation equipment maintenance",129000,106000,111000,101000,123000,78712.75,62335,120528.39940349555,120463.24722102923,144603.76]
[null,null,"Zone substation property maintenance",63000,62000,87000,45000,28000,14581.047564932229,7020,5296.2451192483695,4384.1223800772859,9504.39]
[null,null,"Public lighting maintenance",0,0,0,0,0,0,0,0,0,0]
[null,null,"SCADA & network control maintenance",3000,0,1000,3000,4000,25008.538602115808,15298,14569.071918226327,13165.896894133439,22556.959999999999]
[null,null,"Protection systems maintenance",5000,14000,8000,8000,9000,12423.728421996737,15478,12492.139299139872,5406.8145409836588,16715.32]
[null,null,"Subtransmission asset maintenance - for DNSP with dual function assets",0,0,0,0,0,0,0,0,0,0]
[null,null,"Other",2932,73657,36303,103488,107756,183863.94,167377,195434.22782129579,134770.24774088248,137414.43]
[null,"OVERHEADS","Network overheads",24282865.138990369,21669874.913407423,25381438.080492515,20436858.988541238,24675207.390680585,31322790.395677816,24498528.369829774,19661045.532259163,41287626.102908157,21879890.879046019]
[null,null,"Corporate overheads",6536814.2025533505,5773190.2784185568,19895082.469344772,19831723.611201815,21801602.391788911,29925264.216491159,18838844.895041272,21342217.00102644,28660581.006704532,27987593.54663267]
[null,"AUGMENTATION","Subtransmission substations, switching stations, zone substations",256361.13186512853,468054.06483880791,677618.46717598487,525088.44041940104,914003.01510614168,-1493560,2410414.5127374479,1048421.7150162214,1677690.8419854308,1184056.17]
[null,null,"Subtransmission lines",104798.5141907474,111098.41425297617,107636.07710982391,109715.61585788947,501261.91640673229,599900,369555.83536064764,18315.608103636401,113772.05297876536,234488.93]
[null,null,"HV feeders",196649.08517346747,64085.584183331106,156625.95521100803,186599.10858636606,152247.66328715882,142300,986742.97727165383,372493.52075704921,854954.77226236858,1098808.17]
[null,null,"Distribution substations",0,0,0,0,0,283830,146674.46025320981,249985.13799368445,40434.99396077951,262016.36]
[null,null,"LV feeders",446009.64492710127,380029.9657320694,451912.44625561271,662718.50312606967,666848.85253165092,61920,133976.06106023394,224259.08604934151,33060.95098677725,731954.59]
[null,null,"Other assets",0,0,0,0,0,300130,332097.26929205545,1296769.2513972023,109761.96018726252,111893.18]
[null,"CONNECTIONS","Simple and complex customer connections",3263612.7486222582,3048141.669703186,2336093.3638114696,1937396.6614165229,2688504.9280407554,3019790,14010842,3063641.3348540077,1922124.2868165006,2119031.4300000002]
[null,"EMERGENCY RESPONSE","Major storms",1788000.0000000002,1621000,1855000,1681000,2924000,3742000,2932581,3524075.6717201513,3241227.6382028908,2323369.66]
[null,null,"Major event days",27000,45000,97000,27000,120000,0,0,43301.826521718918,0,0]
[null,"PUBLIC LIGHTING","All public lighting services",544775.23660996195,770200.33255434176,603532.44424615614,620477.38994035008,855952.94031378115,950719.49770758266,1101106.3655053666,687707.7238815584,788999.77073588164,602470.35569824453]
[null,"METERING","All metering services",922000,753000,597000,871000,1105000,1080421.7750919806,1045247.0690627636,1158291.0026391062,520289.5529851428,490192.45]
[null,"FEE-BASED SERVICES","All fee-based services",893476.35600133811,542590.49411859363,1099675.5045288298,1806215.8055597546,1264316.859934499,1620957.1750007949,1725547.1661925039,1398639.4854008174,545416.79861746519,752400.28267713962]
[null,"QUOTED SERVICES","All quoted services",1279499.4998680956,758191.80621999339,3321950.5400818288,2485847.9259038977,1580842.8120279105,1432442.1608431328,2193056.3534502913,5094797.4630718166,1858526.0786354949,2168309.9093167149]
[null,"REPLACEMENT","Poles",478738.71234783938,370018.74794243136,448491.22965999128,497860.21518017707,1184498.659965001,1073950.238940109,1093395.7242861199,1254065.5734725348,1486306.3052557027,1284594.1200000001]
[null,null,"Pole top structures",743908.67709279619,694325.17246265919,712100.95634764619,865044.17251824785,1754839.4529766317,1538812.9632200757,2537479.9667895599,2924580.7354097199,1803854.9570902858,1778859.56]
[null,null,"Overhead conductors",62465.441805016686,89660.571348983969,148803.87588892647,161926.90730695688,279874.34169921896,136216.86746892869,108070.42469740758,46245.330372081313,6826.8096779441694,144481.74122643002]
[null,null,"Underground cables",21547.23143019405,14059.906771698676,50965.09476431142,77222.360715234769,58563.329304870567,9186.4162758872844,10855.893536537595,23820.918742174166,3674.6423052656464,45230.104047376255]
[null,null,"Service lines",314523.92755238537,313802.6081871533,362786.65361871454,381152.53273214522,685110.28984906117,662479.99444149365,780043.25983422599,991748.68134881393,589619.74361063784,773556.74]
[null,null,"Transformers",214393.08193332594,240440.22690916547,258032.53024536878,197782.52901926762,431259.24483778275,390839.20999040717,486543.50061644398,468770.47903710842,344564.4049630849,788746.04]
[null,null,"Switchgear",116255.62526375547,143286.30468720273,198098.94693268483,160651.01489458108,377731.26200564014,494971.02961490041,449818.19163262699,416021.14491757582,400172.31829120213,623472.13]
[null,null,"Public lighting",0,0,0,0,0,0,0,0,0,0]
[null,null,"SCADA network control and protection systems",7298.0125675727777,78233.493397878905,44521.953257763693,53011.720715758151,54987.850715532462,0,88992.776760548906,58672.916716265623,121080.69019803751,181009.35]
[null,null,"Other",31758.105167853744,-6222.934933571878,20178.442650616718,79270.305047444388,58452.729534310973,205564.47630174342,105122.302584937,218731.98329868834,204742.77385401475,270371.75]
[null,"NON-NETWORK EXPENDITURE","IT and communications",3872982.2576879668,2840041.5633934415,4943017.7129231533,7870387.3483978724,8624608.5058058649,15258216.000029257,28832264.093727812,22025009.217304926,36881126.292365238,41207801.979018033]
[null,null,"Motor vehicles",3686000,3880000,4470000,4709000,5190000,4829000,5032418,4207633.26,3872120.49,4201001]
[null,null,"Buildings and property",4717209.6456279075,5103728.7052337723,11985329.174707569,11672005.195337599,16245152.890491148,10253283.649673058,7034228.9243005849,6988313.9918947909,8970304.2619700357,11946828.064785173]
[null,null,"Other",1565000,1911000,3034000,5600000,5326000,8000,6117005,2225877.8486046065,3098276.3617473673,7724282]
[]
[]
[null,"2.12.5 - RELATED PARTY CONTRACT EXPENDITURE"]
[null,null,null,"EXPENDITURE"]
[null,null,null,"Actual ($0's)"]
[null,null,null,{"$f":"IF(dms_RPT=\"financial\",dms_CRYf_y1,dms_CRYc_y1)","v":"2008-09"},{"$f":"IF(dms_RPT=\"financial\",dms_CRYf_y2,dms_CRYc_y2)","v":"2009-10"},{"$f":"IF(dms_RPT=\"financial\",dms_CRYf_y3,dms_CRYc_y3)","v":"2010-11"},{"$f":"IF(dms_RPT=\"financial\",dms_CRYf_y4,dms_CRYc_y4)","v":"2011-12"},{"$f":"IF(dms_RPT=\"financial\",dms_CRYf_y5,dms_CRYc_y5)","v":"2012-13"},{"$f":"IF(dms_RPT=\"financial\",dms_CRYf_y6,dms_CRYc_y6)","v":"2013-14"},{"$f":"IF(dms_RPT=\"financial\",dms_CRYf_y7,dms_CRYc_y7)","v":"2014-15"},{"$f":"IF(dms_RPT=\"financial\",dms_CRYf_y8,dms_CRYc_y8)","v":"2015-16"},{"$f":"IF(dms_RPT=\"financial\",dms_CRYf_y9,dms_CRYc_y9)","v":"2016-17"},{"$f":"IF(dms_RPT=\"financial\",dms_CRYf_y10,dms_CRYc_y10)","v":"2017-18"}]
[null,"VEGETATION MANAGEMENT",{"$f":"IF(ISBLANK(C13),\" \",C13)","v":"Zone 1"}]
[null,null,"Zone 2",0,0,0,0,0,0,0,0,0]
[null,null,"Zone 3",0,0,0,0,0,0,0,0,0]
[null,null,"Zone 4",0,0,0,0,0,0,0,0,0]
[null,null,"Zone 5",0,0,0,0,0,0,0,0,0]
[null,null,"Zone 6",0,0,0,0,0,0,0,0,0]
[null,null,"Zone 7",0,0,0,0,0,0,0,0,0]
[null,null,"Zone 8",0,0,0,0,0,0,0,0,0]
[null,null,"Zone 9",0,0,0,0,0,0,0,0,0]
[null,null,"Zone 10",0,0,0,0,0,0,0,0,0]
[null,null,"Zone 11",0,0,0,0,0,0,0,0,0]
[null,null,"Zone 12",0,0,0,0,0,0,0,0,0]
[null,null,"Zone 13",0,0,0,0,0,0,0,0,0]
[null,null,"Zone 14",0,0,0,0,0,0,0,0,0]
[null,null,"Zone 15",0,0,0,0,0,0,0,0,0]
[null,null,"Zone 16",0,0,0,0,0,0,0,0,0]
[null,null,"Zone 17",0,0,0,0,0,0,0,0,0]
[null,null,"Zone 18",0,0,0,0,0,0,0,0,0]
[null,"ROUTINE MAINTENANCE","Pole top, overhead line & service line maintenance",0,0,0,0,0,0,0,0,0]
[null,null,"Pole inspection and treatment",0,0,0,0,0,0,0,0,0]
[null,null,"Overhead asset inspection",0,0,0,0,0,0,0,0,0]
[null,null,"Network underground cable maintenance",0,0,0,0,0,0,0,0,0]
[null,null,"Distribution substation equipment & property maintenance",0,0,0,0,0,0,0,0,0]
[null,null,"Zone substation equipment maintenance",0,0,0,0,0,0,0,0,0]
[null,null,"Zone substation property maintenance",0,0,0,0,0,0,0,0,0]
[null,null,"Public lighting maintenance",0,0,0,0,0,0,0,0,0]
[null,null,"Scada & network control maintenance",0,0,0,0,0,0,0,0,0]
[null,null,"Protection systems maintenance",0,0,0,0,0,0,0,0,0]
[null,null,"Subtransmission asset maintenance - for dnsps with dual function assets",0,0,0,0,0,0,0,0,0]
[null,null,"Other",0,0,0,0,0,0,0,0,0]
[null,"NON-ROUTINE MAINTENANCE","Pole top, overhead line & service line maintenance",0,0,0,0,0,0,0,0,0]
[null,null,"Pole inspection and treatment",0,0,0,0,0,0,0,0,0]
[null,null,"Overhead asset inspection",0,0,0,0,0,0,0,0,0]
[null,null,"Network underground cable maintenance",0,0,0,0,0,0,0,0,0]
[null,null,"Distribution substation equipment & property maintenance",0,0,0,0,0,0,0,0,0]
[null,null,"Zone substation equipment maintenance",0,0,0,0,0,0,0,0,0]
[null,null,"Zone substation property maintenance",0,0,0,0,0,0,0,0,0]
[null,null,"Public lighting maintenance",0,0,0,0,0,0,0,0,0]
[null,null,"SCADA & network control maintenance",0,0,0,0,0,0,0,0,0]
[null,null,"Protection systems maintenance",0,0,0,0,0,0,0,0,0]
[null,null,"Subtransmission asset maintenance - for DNSP with dual function assets",0,0,0,0,0,0,0,0,0]
[null,null,"Other",0,0,0,0,0,0,0,0,0]
[null,"OVERHEADS","Network overheads",11401000,9887000,14252000,14628000,14733000,14806000,15185120,16443401.32,16391922.35]
[null,null,"Corporate overheads",177000,127000,165000,146000,172000,143000,139357,249487.38,352371.85]
[null,"AUGMENTATION","Subtransmission substations, switching stations, zone substations",0,0,0,0,0,0,0,0,0]
[null,null,"Subtransmission lines",0,0,0,0,0,0,0,0,0]
[null,null,"HV feeders",0,0,0,0,0,0,0,0,0]
[null,null,"Distribution substations",0,0,0,0,0,0,0,0,0]
[null,null,"LV feeders",0,0,0,0,0,0,0,0,0]
[null,null,"Other assets",0,0,0,0,0,0,0,0,0]
[null,"CONNECTIONS","Simple and complex customer connections",0,0,0,0,0,0,0,0,0]
[null,"EMERGENCY RESPONSE","Major storms",0,0,0,0,0,0,0,0,0]
[null,null,"Major event days",0,0,0,0,0,0,0,0,0]
[null,"PUBLIC LIGHTING","All public lighting services",0,0,0,0,0,0,0,0,0]
[null,"METERING","All metering services",0,0,0,0,0,0,0,0,0]
[null,"FEE-BASED SERVICES","All fee-based services",0,0,0,0,0,0,0,0,0]
[null,"QUOTED SERVICES","All quoted services",0,0,0,0,0,0,0,0,0]
[null,"REPLACEMENT","Poles",0,0,0,0,0,0,0,0,0]
[null,null,"Pole top structures",0,0,0,0,0,0,0,0,0]
[null,null,"Overhead conductors",0,0,0,0,0,0,0,0,0]
[null,null,"Underground cables",0,0,0,0,0,0,0,0,0]
[null,null,"Service lines",0,0,0,0,0,0,0,0,0]
[null,null,"Transformers",0,0,0,0,0,0,0,0,0]
[null,null,"Switchgear",0,0,0,0,0,0,0,0,0]
[null,null,"Public lighting",0,0,0,0,0,0,0,0,0]
[null,null,"SCADA network control and protection systems",0,0,0,0,0,0,0,0,0]
[null,null,"Other",0,0,0,0,0,0,0,0,0]
[null,"NON-NETWORK EXPENDITURE","IT and communications",368000,147000,108000,28000,421000,382000,1625991,670448,941743.45]
[null,null,"Motor vehicles",0,0,0,0,0,0,0,0,0]
[null,null,"Buildings and property",0,0,0,0,0,0,0,0,0]
[null,null,"Other",0,0,0,0,0,0,0,0,0]
[]
[]
[null,"2.12.6 - RELATED PARTY CONTRACT MARGIN EXPENDITURE"]
[null,null,null,"EXPENDITURE"]
[null,null,null,"Actual ($0's)"]
[null,null,null,{"$f":"IF(dms_RPT=\"financial\",dms_CRYf_y1,dms_CRYc_y1)","v":"2008-09"},{"$f":"IF(dms_RPT=\"financial\",dms_CRYf_y2,dms_CRYc_y2)","v":"2009-10"},{"$f":"IF(dms_RPT=\"financial\",dms_CRYf_y3,dms_CRYc_y3)","v":"2010-11"},{"$f":"IF(dms_RPT=\"financial\",dms_CRYf_y4,dms_CRYc_y4)","v":"2011-12"},{"$f":"IF(dms_RPT=\"financial\",dms_CRYf_y5,dms_CRYc_y5)","v":"2012-13"},{"$f":"IF(dms_RPT=\"financial\",dms_CRYf_y6,dms_CRYc_y6)","v":"2013-14"},{"$f":"IF(dms_RPT=\"financial\",dms_CRYf_y7,dms_CRYc_y7)","v":"2014-15"},{"$f":"IF(dms_RPT=\"financial\",dms_CRYf_y8,dms_CRYc_y8)","v":"2015-16"},{"$f":"IF(dms_RPT=\"financial\",dms_CRYf_y9,dms_CRYc_y9)","v":"2016-17"},{"$f":"IF(dms_RPT=\"financial\",dms_CRYf_y10,dms_CRYc_y10)","v":"2017-18"}]
[null,"VEGETATION MANAGEMENT",{"$f":"IF(ISBLANK(C13),\" \",C13)","v":"Zone 1"}]
[null,null,"Zone 2",0,0,0,0,0,0,0,0,0]
[null,null,"Zone 3",0,0,0,0,0,0,0,0,0]
[null,null,"Zone 4",0,0,0,0,0,0,0,0,0]
[null,null,"Zone 5",0,0,0,0,0,0,0,0,0]
[null,null,"Zone 6",0,0,0,0,0,0,0,0,0]
[null,null,"Zone 7",0,0,0,0,0,0,0,0,0]
[null,null,"Zone 8",0,0,0,0,0,0,0,0,0]
[null,null,"Zone 9",0,0,0,0,0,0,0,0,0]
[null,null,"Zone 10",0,0,0,0,0,0,0,0,0]
[null,null,"Zone 11",0,0,0,0,0,0,0,0,0]
[null,null,"Zone 12",0,0,0,0,0,0,0,0,0]
[null,null,"Zone 13",0,0,0,0,0,0,0,0,0]
[null,null,"Zone 14",0,0,0,0,0,0,0,0,0]
[null,null,"Zone 15",0,0,0,0,0,0,0,0,0]
[null,null,"Zone 16",0,0,0,0,0,0,0,0,0]
[null,null,"Zone 17",0,0,0,0,0,0,0,0,0]
[null,null,"Zone 18",0,0,0,0,0,0,0,0,0]
[null,"ROUTINE MAINTENANCE","Pole top, overhead line & service line maintenance",0,0,0,0,0,0,0,0,0]
[null,null,"Pole inspection and treatment",0,0,0,0,0,0,0,0,0]
[null,null,"Overhead asset inspection",0,0,0,0,0,0,0,0,0]
[null,null,"Network underground cable maintenance",0,0,0,0,0,0,0,0,0]
[null,null,"Distribution substation equipment & property maintenance",0,0,0,0,0,0,0,0,0]
[null,null,"Zone substation equipment maintenance",0,0,0,0,0,0,0,0,0]
[null,null,"Zone substation property maintenance",0,0,0,0,0,0,0,0,0]
[null,null,"Public lighting maintenance",0,0,0,0,0,0,0,0,0]
[null,null,"Scada & network control maintenance",0,0,0,0,0,0,0,0,0]
[null,null,"Protection systems maintenance",0,0,0,0,0,0,0,0,0]
[null,null,"Subtransmission asset maintenance - for dnsps with dual function assets",0,0,0,0,0,0,0,0,0]
[null,null,"Other",0,0,0,0,0,0,0,0,0]
[null,"NON-ROUTINE MAINTENANCE","Pole top, overhead line & service line maintenance",0,0,0,0,0,0,0,0,0]
[null,null,"Pole inspection and treatment",0,0,0,0,0,0,0,0,0]
[null,null,"Overhead asset inspection",0,0,0,0,0,0,0,0,0]
[null,null,"Network underground cable maintenance",0,0,0,0,0,0,0,0,0]
[null,null,"Distribution substation equipment & property maintenance",0,0,0,0,0,0,0,0,0]
[null,null,"Zone substation equipment maintenance",0,0,0,0,0,0,0,0,0]
[null,null,"Zone substation property maintenance",0,0,0,0,0,0,0,0,0]
[null,null,"Public lighting maintenance",0,0,0,0,0,0,0,0,0]
[null,null,"SCADA & network control maintenance",0,0,0,0,0,0,0,0,0]
[null,null,"Protection systems maintenance",0,0,0,0,0,0,0,0,0]
[null,null,"Subtransmission asset maintenance - for DNSP with dual function assets",0,0,0,0,0,0,0,0,0]
[null,null,"Other",0,0,0,0,0,0,0,0,0]
[null,"OVERHEADS","Network overheads",0,0,0,0,0,0,0,0,0]
[null,null,"Corporate overheads",0,0,0,0,0,0,0,0,0]
[null,"AUGMENTATION","Subtransmission substations, switching stations, zone substations",0,0,0,0,0,0,0,0,0]
[null,null,"Subtransmission lines",0,0,0,0,0,0,0,0,0]
[null,null,"HV feeders",0,0,0,0,0,0,0,0,0]
[null,null,"Distribution substations",0,0,0,0,0,0,0,0,0]
[null,null,"LV feeders",0,0,0,0,0,0,0,0,0]
[null,null,"Other assets",0,0,0,0,0,0,0,0,0]
[null,"CONNECTIONS","Simple and complex customer connections",0,0,0,0,0,0,0,0,0]
[null,"EMERGENCY RESPONSE","Major storms",0,0,0,0,0,0,0,0,0]
[null,null,"Major event days",0,0,0,0,0,0,0,0,0]
[null,"PUBLIC LIGHTING","All public lighting services",0,0,0,0,0,0,0,0,0]
[null,"METERING","All metering services",0,0,0,0,0,0,0,0,0]
[null,"FEE-BASED SERVICES","All fee-based services",0,0,0,0,0,0,0,0,0]
[null,"QUOTED SERVICES","All quoted services",0,0,0,0,0,0,0,0,0]
[null,"REPLACEMENT","Poles",0,0,0,0,0,0,0,0,0]
[null,null,"Pole top structures",0,0,0,0,0,0,0,0,0]
[null,null,"Overhead conductors",0,0,0,0,0,0,0,0,0]
[null,null,"Underground cables",0,0,0,0,0,0,0,0,0]
[null,null,"Service lines",0,0,0,0,0,0,0,0,0]
[null,null,"Transformers",0,0,0,0,0,0,0,0,0]
[null,null,"Switchgear",0,0,0,0,0,0,0,0,0]
[null,null,"Public lighting",0,0,0,0,0,0,0,0,0]
[null,null,"SCADA network control and protection systems",0,0,0,0,0,0,0,0,0]
[null,null,"Other",0,0,0,0,0,0,0,0,0]
[null,"NON-NETWORK EXPENDITURE","IT and communications",0,0,0,0,0,0,0,0,0]
[null,null,"Motor vehicles",0,0,0,0,0,0,0,0,0]
[null,null,"Buildings and property",0,0,0,0,0,0,0,0,0]
[null,null,"Other",0,0,0,0,0,0,0,0,0]

{"sheet":"4.1 Public lighting","index":18,"n_rows":418,"n_cols":14,"rows_kept":418,"cut":false,"hidden":false,"merged":[[206,4,206,13],[8,2,9,2],[185,1,186,1],[185,2,186,2],[5,1,5,2],[8,4,8,13],[185,4,185,13]]}
[null,"REGULATORY REPORTING STATEMENT"]
[null,{"$f":"INDEX(dms_TradingNameFull_List,MATCH(dms_TradingName,dms_TradingName_List))","v":"SA Power Networks"}]
[null,{"$f":"IF(SUM(dms_SingleYear_Model)>0,(\"CATEGORY ANALYSIS \"&CRY&\" to \"&FRY),(\"CATEGORY ANALYSIS \"&CRY))","v":"CATEGORY ANALYSIS 2008-09 to 2018-19"}]
[null,"4.1 PUBLIC LIGHTING"]
[]
[null,"There are THREE tables on this worksheet. Each table has been 'grouped' (and 'sub-grouped') for easy navigation. See the Instructions sheet on how to group or ungroup data."]
[]
[null,"4.1.1 - DESCRIPTOR METRICS OVER YEAR"]
[null,null,"LIGHT TYPE",null,"VOLUMES\n(0's)"]
[null,null,null,null,{"$f":"IF(dms_RPT=\"financial\",dms_CRYf_y1,dms_CRYc_y1)","v":"2008-09"},{"$f":"IF(dms_RPT=\"financial\",dms_CRYf_y2,dms_CRYc_y2)","v":"2009-10"},{"$f":"IF(dms_RPT=\"financial\",dms_CRYf_y3,dms_CRYc_y3)","v":"2010-11"},{"$f":"IF(dms_RPT=\"financial\",dms_CRYf_y4,dms_CRYc_y4)","v":"2011-12"},{"$f":"IF(dms_RPT=\"financial\",dms_CRYf_y5,dms_CRYc_y5)","v":"2012-13"},{"$f":"IF(dms_RPT=\"financial\",dms_CRYf_y6,dms_CRYc_y6)","v":"2013-14"},{"$f":"IF(dms_RPT=\"financial\",dms_CRYf_y7,dms_CRYc_y7)","v":"2014-15"},{"$f":"IF(dms_RPT=\"financial\",dms_CRYf_y8,dms_CRYc_y8)","v":"2015-16"},{"$f":"IF(dms_RPT=\"financial\",dms_CRYf_y9,dms_CRYc_y9)","v":"2016-17"},{"$f":"IF(dms_RPT=\"financial\",dms_CRYf_y10,dms_CRYc_y10)","v":"2017-18"}]
[null,"POPULATION OF LIGHTS","Fluor/Gas Tube 2x8",null,25,25,25,25,25,25,25,25,25,25]
[null,null,"Fluorescent 20",null,41,41,41,41,41,41,41,41,71,73]
[null,null,"Fluorescent 2x11",null,0,0,0,0,90,90,90,90,90,90]
[null,null,"Fluorescent 2x14W",null,51,51,51,51,318,527,526,523,508,483]
[null,null,"Fluorescent 2x20",null,106,106,106,106,100,100,100,98,273,289]
[null,null,"Fluorescent 2x40",null,72,72,72,72,72,73,33,33,63,116]
[null,null,"Fluorescent 32",null,0,0,0,21,21,21,21,21,21,21]
[null,null,"Fluorescent 40",null,25242,24934,24437,21000,19730,18792,18451,17775,15879,14063]
[null,null,"Fluorescent 42",null,0,262,687,1358,3150,5624,7381,9467,10677,9505]
[null,null,"Fluorescent 4x40",null,30,28,28,28,27,27,27,23,20,23]
[null,null,"Incandescent Flood 150",null,3,3,3,3,3,3,3,3,3,3]
[null,null,"Incandescent Flood 1500",null,1,1,1,1,1,1,1,1,1,1]
[null,null,"Incandescent Flood 500",null,3,3,3,3,3,3,3,3,3,3]
[null,null,"Incandescent Flood 750",null,2,2,2,2,2,2,2,2,2,2]
[null,null,"105W LED",null,0,0,0,0,0,0,0,0,45,225]
[null,null,"117W LED",null,0,0,0,0,0,0,0,0,25,37]
[null,null,"150W LED",null,0,0,0,0,0,0,0,0,109,109]
[null,null,"158W LED",null,0,0,0,0,0,0,0,0,14,20]
[null,null,"175W LED",null,0,0,0,0,0,59,59,65,65,65]
[null,null,"178W LED",null,0,0,0,0,0,0,0,0,3,3]
[null,null,"17W LED",null,0,0,0,0,0,0,0,0,3752,30440]
[null,null,"18W LED",null,0,0,0,0,0,0,0,89,0,3]
[null,null,"198W LED",null,0,0,0,0,0,0,0,0,841,1010]
[null,null,"200W LED",null,0,0,0,0,0,586,586,577,600,583]
[null,null,"20W LED",null,0,0,0,0,0,0,0,0,9,9]
[null,null,"22W LED",null,0,0,0,0,0,0,0,103,1340,1519]
[null,null,"26W LED",null,0,0,0,0,0,0,0,0,29,29]
[null,null,"28W LED",null,0,0,0,0,0,0,0,0,40,43]
[null,null,"298W LED",null,0,0,0,0,0,0,0,0,18,18]
[null,null,"29W LED",null,0,0,0,0,0,0,0,0,214,288]
[null,null,"34W LED",null,0,0,0,0,0,0,0,0,0,174]
[null,null,"35W LED",null,0,0,0,0,0,0,0,0,19,49]
[null,null,"39W LED",null,0,0,0,0,0,0,0,0,7,7]
[null,null,"40W LED",null,0,0,0,0,0,0,0,13,0,0]
[null,null,"43W LED",null,0,0,0,0,0,131,131,139,89,92]
[null,null,"46W LED",null,0,0,0,0,0,0,0,0,756,756]
[null,null,"47W LED",null,0,0,0,0,0,705,705,705,0,0]
[null,null,"70W LED",null,0,0,0,0,0,133,133,157,206,206]
[null,null,"72W LED",null,0,0,0,0,0,0,0,0,20,20]
[null,null,"79W LED",null,0,0,0,0,0,0,0,0,3,3]
[null,null,"80W LED",null,0,0,0,0,0,0,0,0,0,2]
[null,null,"88W LED",null,0,0,0,0,0,38,38,38,38,38]
[null,null,"90W LED",null,0,0,0,0,0,0,0,0,63,63]
[null,null,"LED Ribbon Flex Strip",null,0,0,7,7,7,7,7,7,0,0]
[null,null,"RUUD LED 20x1.3W",null,0,0,24,24,24,24,24,24,0,0]
[null,null,"RUUD LED 30x1.3W",null,0,0,7,7,7,7,7,7,0,0]
[null,null,"Mercury 100",null,59,65,65,65,75,67,67,67,68,64]
[null,null,"Mercury 125",null,484,484,483,483,489,410,397,396,372,339]
[null,null,"Mercury 250",null,4727,4691,4668,4679,4552,4442,4385,4262,4102,4128]
[null,null,"Mercury 2x400",null,6,6,6,6,6,6,6,6,6,6]
[null,null,"Mercury 400",null,1194,1178,1198,1165,1102,952,943,926,877,881]
[null,null,"Mercury 50",null,5145,5078,5034,5100,5184,5415,5398,5263,5265,5199]
[null,null,"Mercury 70",null,22,24,24,24,24,24,24,24,2,2]
[null,null,"Mercury 80",null,74941,76236,77514,80405,80261,79713,79393,79266,78052,63585]
[null,null,"Mercury Flood 1000",null,99,100,100,100,100,100,100,100,117,116]
[null,null,"Mercury Flood 250",null,21,24,25,25,25,25,25,25,55,56]
[null,null,"Mercury Flood 400",null,492,501,527,527,526,524,526,526,606,613]
[null,null,"Mercury Flood 750",null,2,2,2,2,2,2,2,2,2,2]
[null,null,"Mercury Flood 80",null,4,4,4,4,4,4,4,4,4,4]
[null,null,"Metal Halide 100",null,0,0,0,0,0,0,0,0,83,1444]
[null,null,"Metal Halide 150",null,0,0,35,35,35,35,35,35,57,396]
[null,null,"Metal Halide 250",null,0,0,0,0,0,0,0,0,4,449]
[null,null,"Metal Halide 400",null,0,0,0,0,0,0,0,0,1,144]
[null,null,"Metal Halide 50",null,0,0,0,0,0,0,0,0,6,54]
[null,null,"Metal Halide 70",null,0,0,116,116,116,116,116,116,189,247]
[null,null,"Dichroic 35",null,0,0,0,0,0,0,0,0,63,63]
[null,null,"Sodium 100",null,15871,16471,16831,17034,17594,17563,17908,18415,18935,18227]
[null,null,"Sodium 135",null,945,939,930,913,891,860,842,804,749,751]
[null,null,"Sodium 150",null,11096,11278,11448,11674,12118,12265,12405,12692,13692,13824]
[null,null,"Sodium 18",null,12675,12593,12516,11666,11673,11515,11336,10915,10585,7925]
[null,null,"Sodium 250",null,10592,10862,11417,11734,12637,12611,12664,12928,14496,14598]
[null,null,"Sodium 26",null,8238,8145,8089,7559,7317,6691,6360,5934,5216,3745]
[null,null,"Sodium 400",null,41,41,53,107,169,169,169,169,238,146]
[null,null,"Sodium 50",null,23586,24131,24463,26523,26750,26710,27119,27654,27183,24704]
[null,null,"Sodium 55",null,1498,1483,1442,1417,1397,1375,1354,1320,1298,1264]
[null,null,"Sodium 70",null,931,935,858,859,887,833,832,832,951,927]
[null,null,"Sodium 90",null,12200,12113,11904,11820,11421,11215,11028,10618,10023,10328]
[null,null,"Sodium Flood 360",null,347,364,367,371,374,378,377,371,409,423]
[null,null,"Sodium Flood 400",null,13,10,10,10,12,12,12,12,21,22]
[]
[]
[]
[]
[]
[]
[]
[]
[]
[]
[]
[]
[]
[]
[]
[]
[]
[]
[]
[]
[]
[]
[]
[]
[]
[]
[]
[]
[]
[]
[]
[]
[]
[]
[]
[]
[]
[]
[]
[]
[]
[]
[]
[]
[]
[]
[]
[]
[]
[]
[]
[]
[]
[]
[]
[]
[]
[]
[]
[]
[]
[]
[]
[]
[]
[]
[]
[]
[]
[]
[]
[]
[]
[]
[]
[]
[]
[]
[]
[]
[]
[]
[]
[]
[]
[]
[]
[]
[]
[]
[]
[]
[]
[null,"4.1.2 - DESCRIPTOR METRICS ANNUALLY"]
[]
[]
[null,"SERVICE/SERVICE QUALITY ","DESCRIPTOR METRIC",null,"VOLUMES \n& EXPENDITURE"]
[null,null,null,"UNITS",{"$f":"IF(dms_RPT=\"financial\",dms_CRYf_y1,dms_CRYc_y1)","v":"2008-09"},{"$f":"IF(dms_RPT=\"financial\",dms_CRYf_y2,dms_CRYc_y2)","v":"2009-10"},{"$f":"IF(dms_RPT=\"financial\",dms_CRYf_y3,dms_CRYc_y3)","v":"2010-11"},{"$f":"IF(dms_RPT=\"financial\",dms_CRYf_y4,dms_CRYc_y4)","v":"2011-12"},{"$f":"IF(dms_RPT=\"financial\",dms_CRYf_y5,dms_CRYc_y5)","v":"2012-13"},{"$f":"IF(dms_RPT=\"financial\",dms_CRYf_y6,dms_CRYc_y6)","v":"2013-14"},{"$f":"IF(dms_RPT=\"financial\",dms_CRYf_y7,dms_CRYc_y7)","v":"2014-15"},{"$f":"IF(dms_RPT=\"financial\",dms_CRYf_y8,dms_CRYc_y8)","v":"2015-16"},{"$f":"IF(dms_RPT=\"financial\",dms_CRYf_y9,dms_CRYc_y9)","v":"2016-17"},{"$f":"IF(dms_RPT=\"financial\",dms_CRYf_y10,dms_CRYc_y10)","v":"2017-18"}]
[null,"LIGHT INSTALLATION","Major road light installation","0's",1331,913,910,677,1374,322,310,531,3598,858]
[null,null,"Minor road light installation","0's",2301,1568,1427,872,816,1367,1120,1085,2359,562]
[null,null,"Number of poles installed","0's",2337,1577,1468,1096,1125,749,1140,1313,1332,1054]
[null,null,"Total cost","$0s",1000983,1074087,835799,680982,662391,754396,777015,836748,1480527,400157]
[null,"LIGHT REPLACEMENT","Major road light replacement","0's",808,1157,1135,1089,1480,1436,1339,1347,3442,10360]
[null,null,"Minor road light replacement","0's",2170,3088,3011,2872,3835,3733,3484,3500,8580,25400]
[null,null,"Number of poles replaced","0's",80,122,95,93,53,65,58,54,61,55]
[null,null,"Total cost","$0s",1918975,3181777,2830310,3207194,3364691,3468973,3432713,3934902,8013635,11207331]
[null,"LIGHT MAINTENANCE","Major road light maintenance","0's",16133,18509,15643,19454,15478,14891,19818,17636,21113,19170]
[null,null,"Minor road light maintenance","0's",45863,52029,43890,54886,43073,41300,55971,48958,56806,51469]
[null,null,"Number of poles installed","0's"," -   "," -   "," -   "," -   "," -   "," -   "," -   "," -   "," -   "," -   "]
[null,null,"Total cost","$0s",4987589,5600319,5319811,5814384,6696773,7648271,7870899,8355637,9951035,15270226]
[null,"QUALITY OF SUPPLY","Mean days to rectify/replace public lighting assets","days",3,4,5,4,5,5,7,6,9,6]
[null,null,"GSO breaches","0's",448,1883,2647,1875,1715,1299,2486,1715,4267,1571]
[null,null,"GSL payments","$0s",16020,29720,75455,44975,75455,72775,256975,191075,444750,156535]
[null,null,"Customer complaints","0's",86,155,86,79,71,67,79,61,71,109]
[]
[]
[null,"4.1.3 - COST METRICS"]
[null,null,null,null,"AVERAGE UNIT COST \n($)"]
[null,"ACTIVITY TYPE","LIGHT TYPE",null,{"$f":"IF(dms_RPT=\"financial\",dms_CRYf_y1,dms_CRYc_y1)","v":"2008-09"},{"$f":"IF(dms_RPT=\"financial\",dms_CRYf_y2,dms_CRYc_y2)","v":"2009-10"},{"$f":"IF(dms_RPT=\"financial\",dms_CRYf_y3,dms_CRYc_y3)","v":"2010-11"},{"$f":"IF(dms_RPT=\"financial\",dms_CRYf_y4,dms_CRYc_y4)","v":"2011-12"},{"$f":"IF(dms_RPT=\"financial\",dms_CRYf_y5,dms_CRYc_y5)","v":"2012-13"},{"$f":"IF(dms_RPT=\"financial\",dms_CRYf_y6,dms_CRYc_y6)","v":"2013-14"},{"$f":"IF(dms_RPT=\"financial\",dms_CRYf_y7,dms_CRYc_y7)","v":"2014-15"},{"$f":"IF(dms_RPT=\"financial\",dms_CRYf_y8,dms_CRYc_y8)","v":"2015-16"},{"$f":"IF(dms_RPT=\"financial\",dms_CRYf_y9,dms_CRYc_y9)","v":"2016-17"},{"$f":"IF(dms_RPT=\"financial\",dms_CRYf_y10,dms_CRYc_y10)","v":"2017-18"}]
[null,"LIGHT INSTALLATION","All Types",null,276,433,358,440,302,447,543,518,249,282]
[]
[]
[]
[]
[]
[]
[]
[null,null,null,null,"","","","","","","",null,null,""]
[null,null,null,null,"","","","","","","",null,null,""]
[null,null,null,null,"","","","","","","",null,null,""]
[null,null,null,null,"","","","","","","",null,null,""]
[null,null,null,null,"","","","","","","",null,null,""]
[null,null,null,null,"","","","","","","",null,null,""]
[null,null,null,null,"","","","","","","",null,null,""]
[null,null,null,null,"","","","","","","",null,null,""]
[]
[]
[]
[]
[]
[]
[]
[]
[]
[]
[]
[]
[null,null,null,null,"","","","","","","",null,null,""]
[null,null,null,null,"","","","","","","",null,null,""]
[null,null,null,null,"","","","","","","",null,null,""]
[null,null,null,null,"","","","","","","",null,null,""]
[null,null,null,null,"","","","","","","",null,null,""]
[null,null,null,null,"","","","","","","",null,null,""]
[null,null,null,null,"","","","","","","",null,null,""]
[null,null,null,null,"","","","","","","",null,null,""]
[]
[]
[]
[]
[]
[]
[]
[]
[]
[]
[]
[]
[null,null,null,null,"","","","","","","",null,null,""]
[null,null,null,null,"","","","","","","",null,null,""]
[null,null,null,null,"","","","","","","",null,null,""]
[null,null,null,null,"","","","","","","",null,null,""]
[null,null,null,null,"","","","","","","",null,null,""]
[null,null,null,null,"","","","","","","",null,null,""]
[null,null,null,null,"","","","","","","",null,null,""]
[null,null,null,null,"","","","","","","",null,null,""]
[]
[]
[]
[]
[]
[]
[]
[]
[null,null,null,null,"","","","","","","",null,null,""]
[null,null,null,null,"","","","","","","",null,null,""]
[null,null,null,null,"","","","","","","",null,null,""]
[null,null,null,null,"","","","","","","",null,null,""]
[null,null,null,null,"","","","","","","",null,null,""]
[null,null,null,null,"","","","","","","",null,null,""]
[null,"LIGHT REPLACEMENT","All Types",null,644,750,683,810,633,671,712,812,667,313]
[null,null,null,null,"","","","","","","",null,null,""]
[]
[]
[null,null,null,null,"","","","","","","",null,null,""]
[null,null,null,null,"","","","","","","",null,null,""]
[null,null,null,null,"","","","","","","",null,null,""]
[null,null,null,null,"","","","","","","",null,null,""]
[null,null,null,null,"","","","","","","",null,null,""]
[null,null,null,null,"","","","","","","",null,null,""]
[null,null,null,null,"","","","","","","",null,null,""]
[null,null,null,null,"","","","","","","",null,null,""]
[null,null,null,null,"","","","","","","",null,null,""]
[null,null,null,null,"","","","","","","",null,null,""]
[null,null,null,null,"","","","","","","",null,null,""]
[null,null,null,null,"","","","","","","",null,null,""]
[null,null,null,null,"","","","","","","",null,null,""]
[null,null,null,null,"","","","","","","",null,null,""]
[null,null,null,null,"","","","","","","",null,null,""]
[null,null,null,null,"","","","","","","",null,null,""]
[null,null,null,null,"","","","","","","",null,null,""]
[null,null,null,null,"","","","","","","",null,null,""]
[null,null,null,null,"","","","","","","",null,null,""]
[]
[null,null,null,null,"","","","","","","",null,null,""]
[null,null,null,null,"","","","","","","",null,null,""]
[null,null,null,null,"","","","","","","",null,null,""]
[null,null,null,null,"","","","","","","",null,null,""]
[null,null,null,null,"","","","","","","",null,null,""]
[null,null,null,null,"","","","","","","",null,null,""]
[null,null,null,null,"","","","","","","",null,null,""]
[null,null,null,null,"","","","","","","",null,null,""]
[null,null,null,null,"","","","","","","",null,null,""]
[null,null,null,null,"","","","","","","",null,null,""]
[null,null,null,null,"","","","","","","",null,null,""]
[null,null,null,null,"","","","","","","",null,null,""]
[null,null,null,null,"","","","","","","",null,null,""]
[null,null,null,null,"","","","","","","",null,null,""]
[null,null,null,null,"","","","","","","",null,null,""]
[null,null,null,null,"","","","","","","",null,null,""]
[null,null,null,null,"","","","","","","",null,null,""]
[null,null,null,null,"","","","","","","",null,null,""]
[null,null,null,null,"","","","","","","",null,null,""]
[]
[null,null,null,null,"","","","","","","",null,null,""]
[null,null,null,null,"","","","","","","",null,null,""]
[null,null,null,null,"","","","","","","",null,null,""]
[null,null,null,null,"","","","","","","",null,null,""]
[null,null,null,null,"","","","","","","",null,null,""]
[null,null,null,null,"","","","","","","",null,null,""]
[null,null,null,null,"","","","","","","",null,null,""]
[null,null,null,null,"","","","","","","",null,null,""]
[null,null,null,null,"","","","","","","",null,null,""]
[null,null,null,null,"","","","","","","",null,null,""]
[null,null,null,null,"","","","","","","",null,null,""]
[null,null,null,null,"","","","","","","",null,null,""]
[null,null,null,null,"","","","","","","",null,null,""]
[null,null,null,null,"","","","","","","",null,null,""]
[null,null,null,null,"","","","","","","",null,null,""]
[null,null,null,null,"","","","","","","",null,null,""]
[null,null,null,null,"","","","","","","",null,null,""]
[null,null,null,null,"","","","","","","",null,null,""]
[null,null,null,null,"","","","","","","",null,null,""]
[null,null,null,null,"","","","","","","",null,null,""]
[null,null,null,null,"","","","","","","",null,null,""]
[null,null,null,null,"","","","","","","",null,null,""]
[null,null,null,null,"","","","","","","",null,null,""]
[null,null,null,null,"","","","","","","",null,null,""]
[null,null,null,null,"","","","","","","",null,null,""]
[null,null,null,null,"","","","","","","",null,null,""]
[null,"LIGHT MAINTENANCE","All Types",null,80,79,89,78,114,136,104,125,128,216]
[null,null,null,null,"","","","","","","",null,null,""]
[null,null,"",null,"","","","","","","",null,null,""]
[null,null,"",null,"","","","","","","",null,null,""]
[null,null,"",null,"","","","","","","",null,null,""]
[null,null,"",null,"","","","","","","",null,null,""]
[null,null,"",null,"","","","","","","",null,null,""]
[null,null,null,null,"","","","","","","",null,null,""]
[null,null,"",null,"","","","","","","",null,null,""]
[null,null,"",null,"","","","","","","",null,null,""]
[null,null,"",null,"","","","","","","",null,null,""]
[null,null,"",null,"","","","","","","",null,null,""]
[null,null,"",null,"","","","","","","",null,null,""]
[null,null,"",null,"","","","","","","",null,null,""]
[null,null,"",null,"","","","","","","",null,null,""]
[null,null,null,null,"","","","","","","",null,null,""]
[null,null,"",null,"","","","","","","",null,null,""]
[null,null,"",null,"","","","","","","",null,null,""]
[null,null,"",null,"","","","","","","",null,null,""]
[null,null,"",null,"","","","","","","",null,null,""]
[null,null,"",null,"","","","","","","",null,null,""]
[null,null,"",null,"","","","","","","",null,null,""]
[null,null,""]
[null,null,"",null,"","","","","","","",null,null,""]
[null,null,"",null,"","","","","","","",null,null,""]
[null,null,"",null,"","","","","","","",null,null,""]
[null,null,"",null,"","","","","","","",null,null,""]
[null,null,null,null,"","","","","","","",null,null,""]
[null,null,"",null,"","","","","","","",null,null,""]
[null,null,"",null,"","","","","","","",null,null,""]
[null,null,"",null,"","","","","","","",null,null,""]
[null,null,"",null,"","","","","","","",null,null,""]
[null,null,"",null,"","","","","","","",null,null,""]
[null,null,"",null,"","","","","","","",null,null,""]
[null,null,"",null,"","","","","","","",null,null,""]
[null,null,null,null,"","","","","","","",null,null,""]
[null,null,"",null,"","","","","","","",null,null,""]
[null,null,"",null,"","","","","","","",null,null,""]
[null,null,"",null,"","","","","","","",null,null,""]
[null,null,"",null,"","","","","","","",null,null,""]
[null,null,"",null,"","","","","","","",null,null,""]
[null,null,"",null,"","","","","","","",null,null,""]
[null,null,""]
[null,null,"",null,"","","","","","","",null,null,""]
[null,null,"",null,"","","","","","","",null,null,""]
[null,null,"",null,"","","","","","","",null,null,""]
[null,null,"",null,"","","","","","","",null,null,""]
[null,null,null,null,"","","","","","","",null,null,""]
[null,null,"",null,"","","","","","","",null,null,""]
[null,null,"",null,"","","","","","","",null,null,""]
[null,null,"",null,"","","","","","","",null,null,""]
[null,null,"",null,"","","","","","","",null,null,""]
[null,null,"",null,"","","","","","","",null,null,""]
[null,null,"",null,"","","","","","","",null,null,""]
[null,null,"",null,"","","","","","","",null,null,""]
[null,null,null,null,"","","","","","","",null,null,""]
[null,null,"",null,"","","","","","","",null,null,""]
[null,null,"",null,"","","","","","","",null,null,""]
[null,null,"",null,"","","","","","","",null,null,""]
[null,null,"",null,"","","","","","","",null,null,""]
[null,null,"",null,"","","","","","","",null,null,""]
[null,null,"",null,"","","","","","","",null,null,""]
[null,null,""]
[null,null,"",null,"","","","","","","",null,null,""]
[null,null,"",null,"","","","","","","",null,null,""]
[null,null,"",null,"","","","","","","",null,null,""]
[null,null,"",null,"","","","","","","",null,null,""]
[null,null,"",null,"","","","","","","",null,null,""]
[null,null,"",null,"","","","","","","",null,null,""]
[null,null,"",null,"","","","","","","",null,null,""]

{"sheet":"4.2 Metering","index":19,"n_rows":92,"n_cols":13,"rows_kept":92,"cut":false,"hidden":false,"merged":[[26,3,26,12],[8,3,8,12],[64,3,64,12],[5,1,5,2]]}
[null,"REGULATORY REPORTING STATEMENT"]
[null,{"$f":"INDEX(dms_TradingNameFull_List,MATCH(dms_TradingName,dms_TradingName_List))","v":"SA Power Networks"}]
[null,{"$f":"IF(SUM(dms_SingleYear_Model)>0,(\"CATEGORY ANALYSIS \"&CRY&\" to \"&FRY),(\"CATEGORY ANALYSIS \"&CRY))","v":"CATEGORY ANALYSIS 2008-09 to 2018-19"}]
[null,"4.2 METERING"]
[]
[null,"There are TWO tables on this worksheet. Each table has been 'grouped' (and 'sub-grouped') for easy navigation. See the Instructions sheet on how to group or ungroup data."]
[]
[null,"4.2.1 - METERING DESCRIPTOR METRIC"]
[null,null,null,"VOLUMES\n(0's)"]
[null,"ASSET CATEGORY","ASSET SUBCATEGORY",{"$f":"IF(dms_RPT=\"financial\",dms_CRYf_y1,dms_CRYc_y1)","v":"2008-09"},{"$f":"IF(dms_RPT=\"financial\",dms_CRYf_y2,dms_CRYc_y2)","v":"2009-10"},{"$f":"IF(dms_RPT=\"financial\",dms_CRYf_y3,dms_CRYc_y3)","v":"2010-11"},{"$f":"IF(dms_RPT=\"financial\",dms_CRYf_y4,dms_CRYc_y4)","v":"2011-12"},{"$f":"IF(dms_RPT=\"financial\",dms_CRYf_y5,dms_CRYc_y5)","v":"2012-13"},{"$f":"IF(dms_RPT=\"financial\",dms_CRYf_y6,dms_CRYc_y6)","v":"2013-14"},{"$f":"IF(dms_RPT=\"financial\",dms_CRYf_y7,dms_CRYc_y7)","v":"2014-15"},{"$f":"IF(dms_RPT=\"financial\",dms_CRYf_y8,dms_CRYc_y8)","v":"2015-16"},{"$f":"IF(dms_RPT=\"financial\",dms_CRYf_y9,dms_CRYc_y9)","v":"2016-17"},{"$f":"IF(dms_RPT=\"financial\",dms_CRYf_y10,dms_CRYc_y10)","v":"2017-18"}]
[null,"Meter Type 4","Single phase meter population "]
[null,null,"Multi phase meter population "]
[null,null,"Current transformer connected meter population "]
[null,null,"Direct connect meter population "]
[null,"Meter Type 5","Single phase meter population "]
[null,null,"Multi phase meter population "]
[null,null,"Current transformer connected meter population "]
[null,null,"Direct connect meter population "]
[null,"Meter Type 6","Single phase meter population "]
[null,null,"Multi phase meter population "]
[null,null,"Current transformer connected meter population "]
[null,null,"Direct connect meter population "]
[]
[]
[null,"4.2.2 - COST METRICS"]
[null,"EXPENDITURE"]
[null,null,null,"EXPENDITURE\n($0's)"]
[null,"SERVICE SUBCATEGORY","METER TYPE",{"$f":"IF(dms_RPT=\"financial\",dms_CRYf_y1,dms_CRYc_y1)","v":"2008-09"},{"$f":"IF(dms_RPT=\"financial\",dms_CRYf_y2,dms_CRYc_y2)","v":"2009-10"},{"$f":"IF(dms_RPT=\"financial\",dms_CRYf_y3,dms_CRYc_y3)","v":"2010-11"},{"$f":"IF(dms_RPT=\"financial\",dms_CRYf_y4,dms_CRYc_y4)","v":"2011-12"},{"$f":"IF(dms_RPT=\"financial\",dms_CRYf_y5,dms_CRYc_y5)","v":"2012-13"},{"$f":"IF(dms_RPT=\"financial\",dms_CRYf_y6,dms_CRYc_y6)","v":"2013-14"},{"$f":"IF(dms_RPT=\"financial\",dms_CRYf_y7,dms_CRYc_y7)","v":"2014-15"},{"$f":"IF(dms_RPT=\"financial\",dms_CRYf_y8,dms_CRYc_y8)","v":"2015-16"},{"$f":"IF(dms_RPT=\"financial\",dms_CRYf_y9,dms_CRYc_y9)","v":"2016-17"},{"$f":"IF(dms_RPT=\"financial\",dms_CRYf_y10,dms_CRYc_y10)","v":"2017-18"}]
[null,"Meter purchase ","Meter Type 4"]
[null,null,"Meter Type 5"]
[null,null,"Meter Type 6"]
[null,"Meter testing ","Meter Type 4"]
[null,null,"Meter Type 5"]
[null,null,"Meter Type 6"]
[null,"Meter investigation ","Meter Type 4"]
[null,null,"Meter Type 5"]
[null,null,"Meter Type 6"]
[null,"Scheduled meter reading ","Meter Type 4"]
[null,null,"Meter Type 5"]
[null,null,"Meter Type 6"]
[null,"Special meter reading ","Meter Type 4"]
[null,null,"Meter Type 5"]
[null,null,"Meter Type 6"]
[null,"New meter installation ","Meter Type 4"]
[null,null,"Meter Type 5"]
[null,null,"Meter Type 6"]
[null,"Meter replacement ","Meter Type 4"]
[null,null,"Meter Type 5"]
[null,null,"Meter Type 6"]
[null,"Meter maintenance ","Meter Type 4"]
[null,null,"Meter Type 5"]
[null,null,"Meter Type 6"]
[null,"Remote meter reading ","Meter Type 4"]
[null,"Remote meter re-configuration ","Meter Type 4"]
[null,"Other metering ","Meter Type 4"]
[null,null,"Meter Type 5"]
[null,null,"Meter Type 6"]
[null,null,"Meter Type 7"]
[null,"IT infrastructure capex ","Meter Type 4"]
[null,"IT infrastructure opex ","Meter Type 4"]
[null,"Communications infrastructure capex ","Meter Type 4"]
[null,"Communications infrastructure opex ","Meter Type 4"]
[]
[null,"VOLUMES"]
[null,null,null,"VOLUMES\n(0's)"]
[null,null,null,{"$f":"IF(dms_RPT=\"financial\",dms_CRYf_y1,dms_CRYc_y1)","v":"2008-09"},{"$f":"IF(dms_RPT=\"financial\",dms_CRYf_y2,dms_CRYc_y2)","v":"2009-10"},{"$f":"IF(dms_RPT=\"financial\",dms_CRYf_y3,dms_CRYc_y3)","v":"2010-11"},{"$f":"IF(dms_RPT=\"financial\",dms_CRYf_y4,dms_CRYc_y4)","v":"2011-12"},{"$f":"IF(dms_RPT=\"financial\",dms_CRYf_y5,dms_CRYc_y5)","v":"2012-13"},{"$f":"IF(dms_RPT=\"financial\",dms_CRYf_y6,dms_CRYc_y6)","v":"2013-14"},{"$f":"IF(dms_RPT=\"financial\",dms_CRYf_y7,dms_CRYc_y7)","v":"2014-15"},{"$f":"IF(dms_RPT=\"financial\",dms_CRYf_y8,dms_CRYc_y8)","v":"2015-16"},{"$f":"IF(dms_RPT=\"financial\",dms_CRYf_y9,dms_CRYc_y9)","v":"2016-17"},{"$f":"IF(dms_RPT=\"financial\",dms_CRYf_y10,dms_CRYc_y10)","v":"2017-18"}]
[null,"Meter purchase ","Meter Type 4"]
[null,null,"Meter Type 5"]
[null,null,"Meter Type 6"]
[null,"Meter testing ","Meter Type 4"]
[null,null,"Meter Type 5"]
[null,null,"Meter Type 6"]
[null,"Meter investigation ","Meter Type 4"]
[null,null,"Meter Type 5"]
[null,null,"Meter Type 6"]
[null,"Scheduled meter reading ","Meter Type 4"]
[null,null,"Meter Type 5"]
[null,null,"Meter Type 6"]
[null,"Special meter reading ","Meter Type 4"]
[null,null,"Meter Type 5"]
[null,null,"Meter Type 6"]
[null,"New meter installation ","Meter Type 4"]
[null,null,"Meter Type 5"]
[null,null,"Meter Type 6"]
[null,"Meter replacement ","Meter Type 4"]
[null,null,"Meter Type 5"]
[null,null,"Meter Type 6"]
[null,"Meter maintenance ","Meter Type 4"]
[null,null,"Meter Type 5"]
[null,null,"Meter Type 6"]
[null,"Remote meter reading ","Meter Type 4"]
[null,"Remote meter re-configuration ","Meter Type 4"]

{"sheet":"4.3 Fee-based services","index":20,"n_rows":483,"n_cols":22,"rows_kept":483,"cut":false,"hidden":false,"merged":[[9,2,9,11],[9,12,9,21],[5,1,5,2]]}
[null,"REGULATORY REPORTING STATEMENT"]
[null,{"$f":"INDEX(dms_TradingNameFull_List,MATCH(dms_TradingName,dms_TradingName_List))","v":"SA Power Networks"}]
[null,{"$f":"IF(SUM(dms_SingleYear_Model)>0,(\"CATEGORY ANALYSIS \"&CRY&\" to \"&FRY),(\"CATEGORY ANALYSIS \"&CRY))","v":"CATEGORY ANALYSIS 2008-09 to 2018-19"}]
[null,"4.3 ANCILLARY SERVICES - FEE BASED SERVICES"]
[]
[null,"There is ONE table on this worksheet. The COLUMNS AND ROWS have been 'grouped' for easy navigation. See the Instructions sheet on how to group or ungroup data."]
[]
[null,"4.3.1 - COST METRICS FOR FEE-BASED SERVICES"]
[null,"COMMON FEE-BASED SERVICES"]
[null,null,"EXPENDITURE \n($0's)",null,null,null,null,null,null,null,null,null,"VOLUMES \n(0's)"]
[null,"SERVICE SUBCATEGORY",{"$f":"IF(dms_RPT=\"financial\",dms_CRYf_y1,dms_CRYc_y1)","v":"2008-09"},{"$f":"IF(dms_RPT=\"financial\",dms_CRYf_y2,dms_CRYc_y2)","v":"2009-10"},{"$f":"IF(dms_RPT=\"financial\",dms_CRYf_y3,dms_CRYc_y3)","v":"2010-11"},{"$f":"IF(dms_RPT=\"financial\",dms_CRYf_y4,dms_CRYc_y4)","v":"2011-12"},{"$f":"IF(dms_RPT=\"financial\",dms_CRYf_y5,dms_CRYc_y5)","v":"2012-13"},{"$f":"IF(dms_RPT=\"financial\",dms_CRYf_y6,dms_CRYc_y6)","v":"2013-14"},{"$f":"IF(dms_RPT=\"financial\",dms_CRYf_y7,dms_CRYc_y7)","v":"2014-15"},{"$f":"IF(dms_RPT=\"financial\",dms_CRYf_y8,dms_CRYc_y8)","v":"2015-16"},{"$f":"IF(dms_RPT=\"financial\",dms_CRYf_y9,dms_CRYc_y9)","v":"2016-17"},{"$f":"IF(dms_RPT=\"financial\",dms_CRYf_y10,dms_CRYc_y10)","v":"2017-18"},{"$f":"IF(dms_RPT=\"financial\",dms_CRYf_y1,dms_CRYc_y1)","v":"2008-09"},{"$f":"IF(dms_RPT=\"financial\",dms_CRYf_y2,dms_CRYc_y2)","v":"2009-10"},{"$f":"IF(dms_RPT=\"financial\",dms_CRYf_y3,dms_CRYc_y3)","v":"2010-11"},{"$f":"IF(dms_RPT=\"financial\",dms_CRYf_y4,dms_CRYc_y4)","v":"2011-12"},{"$f":"IF(dms_RPT=\"financial\",dms_CRYf_y5,dms_CRYc_y5)","v":"2012-13"},{"$f":"IF(dms_RPT=\"financial\",dms_CRYf_y6,dms_CRYc_y6)","v":"2013-14"},{"$f":"IF(dms_RPT=\"financial\",dms_CRYf_y7,dms_CRYc_y7)","v":"2014-15"},{"$f":"IF(dms_RPT=\"financial\",dms_CRYf_y8,dms_CRYc_y8)","v":"2015-16"},{"$f":"IF(dms_RPT=\"financial\",dms_CRYf_y9,dms_CRYc_y9)","v":"2016-17"},{"$f":"IF(dms_RPT=\"financial\",dms_CRYf_y10,dms_CRYc_y10)","v":"2017-18"}]
[null,"Energisation"]
[null,"De-energisation"]
[null,"Re-energisation"]
[null,"MISCELLANEOUS FEE-BASED SERVICES"]
[null,"Alt/upgrade/relocate to O/under or U/ground service (diagram 1 or 2) or O/head service",0,0,0,0,0,0,0,1375136.3342953764,723409.89357861399,772237.43191114708,0,0,0,0,0,0,0,997,1109,1046]
[null,"Multiphase upgrade - O/under or O/head (diagram 1 or 3)",509245.45588876976,768375.56291165657,642699.22860519507,532931.29104638705,482024.42145389633,439071.75023523229,421572.51381281362,673029.59082836122,263407.28870662744,360097.45539875887,320.11111111111109,483,404,335,303,276,265,291,236,288]
[null,"Multiphase upgrade - existing pit/pillar (diagram 2)",26404.723270577775,35062.0095888,37186.979866909089,30457.907319563634,30103.745606545453,26562.128476363632,19478.894215999997,32197.853415477704,9962.7265963233622,16630.264349217112,74.555555555555557,99,105,86,85,75,55,64,41,61]
[null,"Additional service from existing asset - O/under or pit/pillar (diagram 1 or 2)",38607.896757847731,112831.93443621921,82059.588680886693,53851.605071831895,28207.983609054801,25643.62146277709,6410.9053656942724,20474.389963077712,8935.0527926911527,9055.9894383967749,30.111111111111111,88,64,42,22,20,5,11,10,9]
[null,"Temp supply - O/head or O/Under on existing pole (diagram 3 or 3A)",178993.00915979189,459622.46055440616,392501.88168163004,558953.41449967562,570549.25521352247,721026.38957321842,375171.51812270161,417664.59091121395,182609.7297223387,188391.47691947766,80,205,175,249,254,321,167,134,112,105]
[null,"Temp supply - Existing pit/pillar (diagram 2)",25536.596330337292,65573.47292293486,55997.506039208754,79744.833502404203,81399.190311144383,102867.48035848934,53525.015630003676,51394.330300805654,33388.419197067822,27734.718118282777,28,72,62,88,90,113,59,37,50,37]
[null,"Permanent abolishment of LV service",304266.14979847928,275800,301500,263780,263545.54000001069,309899.36000000063,334402,398120,447686,241276.1000000069,2500,2585,2741,2398,2362,2699,2845,3323,3675,1934]
[null,"Temp disconnect & reconnect - truck attendance",300163.38535049191,234943.53353777598,292728.99809722893,278282.63195736572,288927.32279726496,352035.13277666754,429589.30889593338,377715.91687199316,198472.79715276411,248774.82606743349,394.77777777777777,309,385,366,380,463,565,358,343,384]
[null,"Temp disconnect & reconnect -  single person crew",161650.4641230893,415089.86534601508,354472.56650330697,504796.691788089,515269.01717157575,651166.49564483832,338821.3333860308,316607.13212036382,175969.15632583419,219676.06605018105,453,1163,993,1414,1443,1824,949,579,670,746]
[null,"Connections specification fee - $0-$100k proj",176044.4332920076,452051.03806229919,386036.14549551334,549745.69986911106,561150.52074226132,709148.82506770582,368991.2673419069,296514,267800,211360,79,203,173,247,252,318,166,136,117,95]
[null,"Connections specification fee - $101k-$200k proj",10959.740411140567,28142.679306033759,24032.886839030754,34224.712761649069,34934.725988809478,44148.439631236215,22971.748827394866,17610,10710,19970,5,13,11,16,16,20,10,7,6,9]
[null,"Works re-inspection for compliance - Up to 3hrs normal time",766.77244897959179,766.77244897959179,766.77244897959179,1192.7571428571428,853.65000000000009,1460,300,610,620,331,2.5714285714285716,2.5714285714285716,2.5714285714285716,4,3,5,1,2,2,1]
[null,"Works re-inspection for compliance - After 3hrs normal time",0,0,0,0,0,0,0,0,0,0,0,0,0,0,0,0,0,0,0,0]
[null,"Works re-inspection for compliance - Out of hours",238.93999999999997,119.46999999999998,119.46999999999998,119.46999999999998,111.82,115,118,120,122,130,2,1,1,1,1,1,1,1,1,1]
[null,"Meter test - 1ph",10877,26727.272727272724,40909.090909090904,49309.090909090904,26689.654545454541,22958.181818181816,20909.090909090908,20781.81818181818,20991.81818181818,30285.81818181818,149,245,375,452,241,207,184,180,179,252]
[null,"Meter test - Additional 1ph meter",0,0,0,0,0,0,0,0,0,0,0,0,0,0,0,0,0,0,0,0]
[null,"Meter test - 3ph",6862,12436.363636363636,19418.181818181816,18218.181818181816,13067.963636363636,11201.81818181818,7159.0909090909081,9005.4545454545441,8091.8181818181811,12138.363636363636,94,114,178,167,118,101,63,78,69,101]
[null,"Meter test - Additional 3ph meter",0,0,0,0,0,0,0,0,0,0,0,0,0,0,0,0,0,0,0,0]
[null,"PV installation enquiry - 1ph",0,0,0,0,0,0,0,0,0,0,0,0,0,0,0,0,0,0,0,0]
[null,"PV installation enquiry - 3ph",0,0,0,0,0,0,0,0,0,0,0,0,0,0,0,0,0,0,0,0]
[null,"Meter inspection fee - 1st meter",19772.727272727272,19227.272727272724,16718.181818181816,19063.63636363636,10790.4,4903.6363636363631,15359.999999999998,18840,16443.636363636364,22050.454545454544,719,705,613,699,384,174,528,628,532,695]
[null,"Meter inspection fee - Addition meter",0,0,0,0,0,0,0,0,0,0,0,0,0,0,0,0,0,0,0,0]
[null,"Temporary line insulation (eg Tiger Tails)",63204.78172489936,162298.72569642309,138597.56799860788,197373.78975678576,201468.4333670348,254603.88528461402,132477.98907707937,98115.712146107879,43007.753422852715,137364.78278342495,108,278,237,338,345,436,227,175,159,143]
[null,"Location of U/ground mains - Provision of plans from office",0,0,0,0,0,0,0,0,0,0,0,0,0,0,0,0,0,0,0,0]
[null,"Asset info request - <1hr",0,0,0,0,0,0,0,0,0,0,0,0,0,0,0,0,0,0,0,0]
[null,"Asset info request - Ground level T/fs (site visit to open and visually see equipment)",0,0,0,0,0,0,0,0,0,0,0,0,0,0,0,0,0,0,0,0]
[null,"Network Access Management fee - <0.5 day planning req",1223786.6009321362,1223786.6009321362,1223786.6009321362,1223786.6009321362,1223786.6009321362,750201.34596704005,1259148.514596662,2054384.1760781505,1073040.7711173405,982158.19690148847,1481.2,1481.2,1481.2,1481.2,1481.2,908,1524,1700,1844,1430]
[null,"Special meter reader visit - Normal hours",299848.99999999994,201123.99999999997,244364.99999999997,585056.99999999988,754690.87272727268,588104.93636363628,665306.31818181823,783664.31818181812,945772.8,1423950.5999999999,27259,18284,22215,53187,66626,50659,55653,64475,76272,103938]
[null,"Special meter reader visit - Out of hours",0,0,0,0,0,0,0,0,0,0,0,0,0,0,0,0,0,0,0,0]
[null,"Special meter reader visit - Request cancellation",7435.9999999999991,6203.9999999999991,6390.9999999999991,18523.999999999996,20762.890909090907,27501.93636363636,29085.409090909088,41981.799999999996,91685.599999999991,77213.2,676,564,581,1684,1833,2369,2433,3454,7394,5636]
[null,"Meter read - Subsequent attempt",0,0,0,0,0,0,0,0,0,0,0,0,0,0,0,0,0,0,0,0]
[null,"Site inspection to determine nature of connection service - <2hrs",0,0,0,0,0,0,0,0,0,0,0,0,0,0,0,0,0,0,0,0]
[null,"Priority or out of hour appointment - <3hrs",0,0,0,0,0,0,0,0,0,0,0,0,0,0,0,0,0,0,0,0]
[null,"Retailer fee - disconnection & reconnection - R/C at meter",428069.99999999994,477569.99999999994,552450,657900,636387.27272727271,804384,852851.99999999988,971991.99999999988,1142610,1293556.7999999998,14269,15919,18415,21930,20589,25137,25844,28588,32646,35151]
[null,"Retailer fee - disconnection & reconnection - R/C at meter after hours",1242381,716765.99999999988,730702,1354471.9999999998,1289217.9999999998,1490502.9999999998,1886611.9999999998,1032892.0000000001,1052325,1494984.4,18543,10698,10906,20216,18158,20993,25844,13958,14031,17164]
[null,"Swing & sag calculations - up to and incld 11kV",0,0,0,0,0,0,0,0,0,0,0,0,0,0,0,0,0,0,0,0]
[null,"Embedded generation firm offer - >30kW-200kW",0,0,0,26000,81000,727000,98570,174366.89850003013,465513.3218318352,1112199.8931979863,0,2,0,2,0,61,44,42,84,251]
[null,"Swing & sag calculations - >11kV",11615.645356019346,29826.927456674417,25471.177229687179,36272.950903731602,37025.456121500698,46790.580665286172,24346.533547029801,17060,17060,17060,7,17,15,21,22,27,14,10,10,10]
[null,"Network Access Management request cancellation - <2 business days",58286.8,58286.8,58286.8,58286.8,58286.8,26884,57486,48334,64064,94666,203.8,203.8,203.8,203.8,203.8,94,201,169,224,331]
[null,"Temp disconnect & reconnect retailer O/head - truck attendance",0,0,0,0,0,0,0,0,0,13636.363636363636,0,0,0,0,0,0,0,0,0,6]
[null,"Temp disconnect & reconnect retailer - single person crew",0,0,0,0,0,0,0,0,0,2945.454545454545,0,0,0,0,0,0,0,0,0,60]
[null,"Excess kVAr Incentive",0,0,0,0,0,0,0,0,0,0,0,0,0,0,0,0,0,0,0,0]
[null,null,"","","","","","","",null,null,"","","","","","","","",null,null,""]
[null,null,"","","","","","","",null,null,"","","","","","","","",null,null,""]
[null,null,"","","","","","","",null,null,"","","","","","","","",null,null,""]
[null,null,"","","","","","","",null,null,"","","","","","","","",null,null,""]
[null,null,"","","","","","","",null,null,"","","","","","","","",null,null,""]
[null,null,"","","","","","","",null,null,"","","","","","","","",null,null,""]
[null,null,"","","","","","","",null,null,"","","","","","","","",null,null,""]
[null,null,"","","","","","","",null,null,"","","","","","","","",null,null,""]
[null,null,"","","","","","","",null,null,"","","","","","","","",null,null,""]
[null,null,"","","","","","","",null,null,"","","","","","","","",null,null,""]
[null,null,"","","","","","","",null,null,"","","","","","","","",null,null,""]
[null,null,"","","","","","","",null,null,"","","","","","","","",null,null,""]
[null,null,"","","","","","","",null,null,"","","","","","","","",null,null,""]
[null,null,"","","","","","","",null,null,"","","","","","","","",null,null,""]
[null,null,"","","","","","","",null,null,"","","","","","","","",null,null,""]
[null,null,"","","","","","","",null,null,"","","","","","","","",null,null,""]
[null,null,"","","","","","","",null,null,"","","","","","","","",null,null,""]
[null,null,"","","","","","","",null,null,"","","","","","","","",null,null,""]
[null,null,"","","","","","","",null,null,"","","","","","","","",null,null,""]
[null,null,"","","","","","","",null,null,"","","","","","","","",null,null,""]
[null,null,"","","","","","","",null,null,"","","","","","","","",null,null,""]
[null,null,"","","","","","","",null,null,"","","","","","","","",null,null,""]
[null,null,"","","","","","","",null,null,"","","","","","","","",null,null,""]
[null,null,"","","","","","","",null,null,"","","","","","","","",null,null,""]
[null,null,"","","","","","","",null,null,"","","","","","","","",null,null,""]
[null,null,"","","","","","","",null,null,"","","","","","","","",null,null,""]
[null,null,"","","","","","","",null,null,"","","","","","","","",null,null,""]
[null,null,"","","","","","","",null,null,"","","","","","","","",null,null,""]
[null,null,"","","","","","","",null,null,"","","","","","","","",null,null,""]
[null,null,"","","","","","","",null,null,"","","","","","","","",null,null,""]
[null,null,"","","","","","","",null,null,"","","","","","","","",null,null,""]
[null,null,"","","","","","","",null,null,"","","","","","","","",null,null,""]
[null,null,"","","","","","","",null,null,"","","","","","","","",null,null,""]
[null,null,"","","","","","","",null,null,"","","","","","","","",null,null,""]
[null,null,"","","","","","","",null,null,"","","","","","","","",null,null,""]
[null,null,"","","","","","","",null,null,"","","","","","","","",null,null,""]
[null,null,"","","","","","","",null,null,"","","","","","","","",null,null,""]
[null,null,"","","","","","","",null,null,"","","","","","","","",null,null,""]
[null,null,"","","","","","","",null,null,"","","","","","","","",null,null,""]
[null,null,"","","","","","","",null,null,"","","","","","","","",null,null,""]
[null,null,"","","","","","","",null,null,"","","","","","","","",null,null,""]
[null,null,"","","","","","","",null,null,"","","","","","","","",null,null,""]
[null,null,"","","","","","","",null,null,"","","","","","","","",null,null,""]
[null,null,"","","","","","","",null,null,"","","","","","","","",null,null,""]
[null,null,"","","","","","","",null,null,"","","","","","","","",null,null,""]
[null,null,"","","","","","","",null,null,"","","","","","","","",null,null,""]
[null,null,"","","","","","","",null,null,"","","","","","","","",null,null,""]
[null,null,"","","","","","","",null,null,"","","","","","","","",null,null,""]
[null,null,"","","","","","","",null,null,"","","","","","","","",null,null,""]
[null,null,"","","","","","","",null,null,"","","","","","","","",null,null,""]
[null,null,"","","","","","","",null,null,"","","","","","","","",null,null,""]
[null,null,"","","","","","","",null,null,"","","","","","","","",null,null,""]
[null,null,"","","","","","","",null,null,"","","","","","","","",null,null,""]
[null,null,"","","","","","","",null,null,"","","","","","","","",null,null,""]
[null,null,"","","","","","","",null,null,"","","","","","","","",null,null,""]
[null,null,"","","","","","","",null,null,"","","","","","","","",null,null,""]
[null,null,"","","","","","","",null,null,"","","","","","","","",null,null,""]
[null,null,"","","","","","","",null,null,"","","","","","","","",null,null,""]
[null,null,"","","","","","","",null,null,"","","","","","","","",null,null,""]
[null,null,"","","","","","","",null,null,"","","","","","","","",null,null,""]
[null,null,"","","","","","","",null,null,"","","","","","","","",null,null,""]
[null,null,"","","","","","","",null,null,"","","","","","","","",null,null,""]
[null,null,"","","","","","","",null,null,"","","","","","","","",null,null,""]
[null,null,"","","","","","","",null,null,"","","","","","","","",null,null,""]
[null,null,"","","","","","","",null,null,"","","","","","","","",null,null,""]
[null,null,"","","","","","","",null,null,"","","","","","","","",null,null,""]
[null,null,"","","","","","","",null,null,"","","","","","","","",null,null,""]
[null,null,"","","","","","","",null,null,"","","","","","","","",null,null,""]
[null,null,"","","","","","","",null,null,"","","","","","","","",null,null,""]
[null,null,"","","","","","","",null,null,"","","","","","","","",null,null,""]
[null,null,"","","","","","","",null,null,"","","","","","","","",null,null,""]
[null,null,"","","","","","","",null,null,"","","","","","","","",null,null,""]
[null,null,"","","","","","","",null,null,"","","","","","","","",null,null,""]
[null,null,"","","","","","","",null,null,"","","","","","","","",null,null,""]
[null,null,"","","","","","","",null,null,"","","","","","","","",null,null,""]
[null,null,"","","","","","","",null,null,"","","","","","","","",null,null,""]
[null,null,"","","","","","","",null,null,"","","","","","","","",null,null,""]
[null,null,"","","","","","","",null,null,"","","","","","","","",null,null,""]
[null,null,"","","","","","","",null,null,"","","","","","","","",null,null,""]
[null,null,"","","","","","","",null,null,"","","","","","","","",null,null,""]
[null,null,"","","","","","","",null,null,"","","","","","","","",null,null,""]
[null,null,"","","","","","","",null,null,"","","","","","","","",null,null,""]
[null,null,"","","","","","","",null,null,"","","","","","","","",null,null,""]
[null,null,"","","","","","","",null,null,"","","","","","","","",null,null,""]
[null,null,"","","","","","","",null,null,"","","","","","","","",null,null,""]
[null,null,"","","","","","","",null,null,"","","","","","","","",null,null,""]
[null,null,"","","","","","","",null,null,"","","","","","","","",null,null,""]
[null,null,"","","","","","","",null,null,"","","","","","","","",null,null,""]
[null,null,"","","","","","","",null,null,"","","","","","","","",null,null,""]
[null,null,"","","","","","","",null,null,"","","","","","","","",null,null,""]
[null,null,"","","","","","","",null,null,"","","","","","","","",null,null,""]
[null,null,"","","","","","","",null,null,"","","","","","","","",null,null,""]
[null,null,"","","","","","","",null,null,"","","","","","","","",null,null,""]
[null,null,"","","","","","","",null,null,"","","","","","","","",null,null,""]
[null,null,"","","","","","","",null,null,"","","","","","","","",null,null,""]
[null,null,"","","","","","","",null,null,"","","","","","","","",null,null,""]
[null,null,"","","","","","","",null,null,"","","","","","","","",null,null,""]
[null,null,"","","","","","","",null,null,"","","","","","","","",null,null,""]
[null,null,"","","","","","","",null,null,"","","","","","","","",null,null,""]
[null,null,"","","","","","","",null,null,"","","","","","","","",null,null,""]
[null,null,"","","","","","","",null,null,"","","","","","","","",null,null,""]
[null,null,"","","","","","","",null,null,"","","","","","","","",null,null,""]
[null,null,"","","","","","","",null,null,"","","","","","","","",null,null,""]
[null,null,"","","","","","","",null,null,"","","","","","","","",null,null,""]
[null,null,"","","","","","","",null,null,"","","","","","","","",null,null,""]
[null,null,"","","","","","","",null,null,"","","","","","","","",null,null,""]
[null,null,"","","","","","","",null,null,"","","","","","","","",null,null,""]
[null,null,"","","","","","","",null,null,"","","","","","","","",null,null,""]
[null,null,"","","","","","","",null,null,"","","","","","","","",null,null,""]
[null,null,"","","","","","","",null,null,"","","","","","","","",null,null,""]
[null,null,"","","","","","","",null,null,"","","","","","","","",null,null,""]
[null,null,"","","","","","","",null,null,"","","","","","","","",null,null,""]
[null,null,"","","","","","","",null,null,"","","","","","","","",null,null,""]
[null,null,"","","","","","","",null,null,"","","","","","","","",null,null,""]
[null,null,"","","","","","","",null,null,"","","","","","","","",null,null,""]
[null,null,"","","","","","","",null,null,"","","","","","","","",null,null,""]
[null,null,"","","","","","","",null,null,"","","","","","","","",null,null,""]
[null,null,"","","","","","","",null,null,"","","","","","","","",null,null,""]
[null,null,"","","","","","","",null,null,"","","","","","","","",null,null,""]
[null,null,"","","","","","","",null,null,"","","","","","","","",null,null,""]
[null,null,"","","","","","","",null,null,"","","","","","","","",null,null,""]
[null,null,"","","","","","","",null,null,"","","","","","","","",null,null,""]
[null,null,"","","","","","","",null,null,"","","","","","","","",null,null,""]
[null,null,"","","","","","","",null,null,"","","","","","","","",null,null,""]
[null,null,"","","","","","","",null,null,"","","","","","","","",null,null,""]
[null,null,"","","","","","","",null,null,"","","","","","","","",null,null,""]
[null,null,"","","","","","","",null,null,"","","","","","","","",null,null,""]
[null,null,"","","","","","","",null,null,"","","","","","","","",null,null,""]
[null,null,"","","","","","","",null,null,"","","","","","","","",null,null,""]
[null,null,"","","","","","","",null,null,"","","","","","","","",null,null,""]
[null,null,"","","","","","","",null,null,"","","","","","","","",null,null,""]
[null,null,"","","","","","","",null,null,"","","","","","","","",null,null,""]
[null,null,"","","","","","","",null,null,"","","","","","","","",null,null,""]
[null,null,"","","","","","","",null,null,"","","","","","","","",null,null,""]
[null,null,"","","","","","","",null,null,"","","","","","","","",null,null,""]
[null,null,"","","","","","","",null,null,"","","","","","","","",null,null,""]
[null,null,"","","","","","","",null,null,"","","","","","","","",null,null,""]
[null,null,"","","","","","","",null,null,"","","","","","","","",null,null,""]
[null,null,"","","","","","","",null,null,"","","","","","","","",null,null,""]
[null,null,"","","","","","","",null,null,"","","","","","","","",null,null,""]
[null,null,"","","","","","","",null,null,"","","","","","","","",null,null,""]
[null,null,"","","","","","","",null,null,"","","","","","","","",null,null,""]
[null,null,"","","","","","","",null,null,"","","","","","","","",null,null,""]
[null,null,"","","","","","","",null,null,"","","","","","","","",null,null,""]
[null,null,"","","","","","","",null,null,"","","","","","","","",null,null,""]
[null,null,"","","","","","","",null,null,"","","","","","","","",null,null,""]
[null,null,"","","","","","","",null,null,"","","","","","","","",null,null,""]
[null,null,"","","","","","","",null,null,"","","","","","","","",null,null,""]
[null,null,"","","","","","","",null,null,"","","","","","","","",null,null,""]
[null,null,"","","","","","","",null,null,"","","","","","","","",null,null,""]
[null,null,"","","","","","","",null,null,"","","","","","","","",null,null,""]
[null,null,"","","","","","","",null,null,"","","","","","","","",null,null,""]
[null,null,"","","","","","","",null,null,"","","","","","","","",null,null,""]
[null,null,"","","","","","","",null,null,"","","","","","","","",null,null,""]
[null,null,"","","","","","","",null,null,"","","","","","","","",null,null,""]
[null,null,"","","","","","","",null,null,"","","","","","","","",null,null,""]
[null,null,"","","","","","","",null,null,"","","","","","","","",null,null,""]
[null,null,"","","","","","","",null,null,"","","","","","","","",null,null,""]
[null,null,"","","","","","","",null,null,"","","","","","","","",null,null,""]
[null,null,"","","","","","","",null,null,"","","","","","","","",null,null,""]
[null,null,"","","","","","","",null,null,"","","","","","","","",null,null,""]
[null,null,"","","","","","","",null,null,"","","","","","","","",null,null,""]
[null,null,"","","","","","","",null,null,"","","","","","","","",null,null,""]
[null,null,"","","","","","","",null,null,"","","","","","","","",null,null,""]
[null,null,"","","","","","","",null,null,"","","","","","","","",null,null,""]
[null,null,"","","","","","","",null,null,"","","","","","","","",null,null,""]
[null,null,"","","","","","","",null,null,"","","","","","","","",null,null,""]
[null,null,"","","","","","","",null,null,"","","","","","","","",null,null,""]
[null,null,"","","","","","","",null,null,"","","","","","","","",null,null,""]
[null,null,"","","","","","","",null,null,"","","","","","","","",null,null,""]
[null,null,"","","","","","","",null,null,"","","","","","","","",null,null,""]
[null,null,"","","","","","","",null,null,"","","","","","","","",null,null,""]
[null,null,"","","","","","","",null,null,"","","","","","","","",null,null,""]
[null,null,"","","","","","","",null,null,"","","","","","","","",null,null,""]
[null,null,"","","","","","","",null,null,"","","","","","","","",null,null,""]
[null,null,"","","","","","","",null,null,"","","","","","","","",null,null,""]
[null,null,"","","","","","","",null,null,"","","","","","","","",null,null,""]
[null,null,"","","","","","","",null,null,"","","","","","","","",null,null,""]
[null,null,"","","","","","","",null,null,"","","","","","","","",null,null,""]
[null,null,"","","","","","","",null,null,"","","","","","","","",null,null,""]
[null,null,"","","","","","","",null,null,"","","","","","","","",null,null,""]
[null,null,"","","","","","","",null,null,"","","","","","","","",null,null,""]
[null,null,"","","","","","","",null,null,"","","","","","","","",null,null,""]
[null,null,"","","","","","","",null,null,"","","","","","","","",null,null,""]
[null,null,"","","","","","","",null,null,"","","","","","","","",null,null,""]
[null,null,"","","","","","","",null,null,"","","","","","","","",null,null,""]
[null,null,"","","","","","","",null,null,"","","","","","","","",null,null,""]
[]
[null,null,"","","","","","","",null,null,"","","","","","","","",null,null,""]
[null,null,"","","","","","","",null,null,"","","","","","","","",null,null,""]
[null,null,"","","","","","","",null,null,"","","","","","","","",null,null,""]
[null,null,"","","","","","","",null,null,"","","","","","","","",null,null,""]
[null,null,"","","","","","","",null,null,"","","","","","","","",null,null,""]
[null,null,"","","","","","","",null,null,"","","","","","","","",null,null,""]
[null,null,"","","","","","","",null,null,"","","","","","","","",null,null,""]
[null,null,"","","","","","","",null,null,"","","","","","","","",null,null,""]
[null,null,"","","","","","","",null,null,"","","","","","","","",null,null,""]
[null,null,"","","","","","","",null,null,"","","","","","","","",null,null,""]
[null,null,"","","","","","","",null,null,"","","","","","","","",null,null,""]
[null,null,"","","","","","","",null,null,"","","","","","","","",null,null,""]
[null,null,"","","","","","","",null,null,"","","","","","","","",null,null,""]
[null,null,"","","","","","","",null,null,"","","","","","","","",null,null,""]
[null,null,"","","","","","","",null,null,"","","","","","","","",null,null,""]
[null,null,"","","","","","","",null,null,"","","","","","","","",null,null,""]
[null,null,"","","","","","","",null,null,"","","","","","","","",null,null,""]
[null,null,"","","","","","","",null,null,"","","","","","","","",null,null,""]
[null,null,"","","","","","","",null,null,"","","","","","","","",null,null,""]
[null,null,"","","","","","","",null,null,"","","","","","","","",null,null,""]
[null,null,"","","","","","","",null,null,"","","","","","","","",null,null,""]
[null,null,"","","","","","","",null,null,"","","","","","","","",null,null,""]
[null,null,"","","","","","","",null,null,"","","","","","","","",null,null,""]
[null,null,"","","","","","","",null,null,"","","","","","","","",null,null,""]
[null,null,"","","","","","","",null,null,"","","","","","","","",null,null,""]
[null,null,"","","","","","","",null,null,"","","","","","","","",null,null,""]
[null,null,"","","","","","","",null,null,"","","","","","","","",null,null,""]
[null,null,"","","","","","","",null,null,"","","","","","","","",null,null,""]
[null,null,"","","","","","","",null,null,"","","","","","","","",null,null,""]
[null,null,"","","","","","","",null,null,"","","","","","","","",null,null,""]
[null,null,"","","","","","","",null,null,"","","","","","","","",null,null,""]
[null,null,"","","","","","","",null,null,"","","","","","","","",null,null,""]
[null,null,"","","","","","","",null,null,"","","","","","","","",null,null,""]
[null,null,"","","","","","","",null,null,"","","","","","","","",null,null,""]
[null,null,"","","","","","","",null,null,"","","","","","","","",null,null,""]
[null,null,"","","","","","","",null,null,"","","","","","","","",null,null,""]
[null,null,"","","","","","","",null,null,"","","","","","","","",null,null,""]
[null,null,"","","","","","","",null,null,"","","","","","","","",null,null,""]
[null,null,"","","","","","","",null,null,"","","","","","","","",null,null,""]
[null,null,"","","","","","","",null,null,"","","","","","","","",null,null,""]
[null,null,"","","","","","","",null,null,"","","","","","","","",null,null,""]
[null,null,"","","","","","","",null,null,"","","","","","","","",null,null,""]
[null,null,"","","","","","","",null,null,"","","","","","","","",null,null,""]
[null,null,"","","","","","","",null,null,"","","","","","","","",null,null,""]
[null,null,"","","","","","","",null,null,"","","","","","","","",null,null,""]
[null,null,"","","","","","","",null,null,"","","","","","","","",null,null,""]
[null,null,"","","","","","","",null,null,"","","","","","","","",null,null,""]
[null,null,"","","","","","","",null,null,"","","","","","","","",null,null,""]
[null,null,"","","","","","","",null,null,"","","","","","","","",null,null,""]
[null,null,"","","","","","","",null,null,"","","","","","","","",null,null,""]
[null,null,"","","","","","","",null,null,"","","","","","","","",null,null,""]
[null,null,"","","","","","","",null,null,"","","","","","","","",null,null,""]
[null,null,"","","","","","","",null,null,"","","","","","","","",null,null,""]
[null,null,"","","","","","","",null,null,"","","","","","","","",null,null,""]
[null,null,"","","","","","","",null,null,"","","","","","","","",null,null,""]
[null,null,"","","","","","","",null,null,"","","","","","","","",null,null,""]
[null,null,"","","","","","","",null,null,"","","","","","","","",null,null,""]
[null,null,"","","","","","","",null,null,"","","","","","","","",null,null,""]
[null,null,"","","","","","","",null,null,"","","","","","","","",null,null,""]
[null,null,"","","","","","","",null,null,"","","","","","","","",null,null,""]
[null,null,"","","","","","","",null,null,"","","","","","","","",null,null,""]
[null,null,"","","","","","","",null,null,"","","","","","","","",null,null,""]
[null,null,"","","","","","","",null,null,"","","","","","","","",null,null,""]
[null,null,"","","","","","","",null,null,"","","","","","","","",null,null,""]
[null,null,"","","","","","","",null,null,"","","","","","","","",null,null,""]
[null,null,"","","","","","","",null,null,"","","","","","","","",null,null,""]
[null,null,"","","","","","","",null,null,"","","","","","","","",null,null,""]
[null,null,"","","","","","","",null,null,"","","","","","","","",null,null,""]
[null,null,"","","","","","","",null,null,"","","","","","","","",null,null,""]
[null,null,"","","","","","","",null,null,"","","","","","","","",null,null,""]
[null,null,"","","","","","","",null,null,"","","","","","","","",null,null,""]
[null,null,"","","","","","","",null,null,"","","","","","","","",null,null,""]
[null,null,"","","","","","","",null,null,"","","","","","","","",null,null,""]
[null,null,"","","","","","","",null,null,"","","","","","","","",null,null,""]
[null,null,"","","","","","","",null,null,"","","","","","","","",null,null,""]
[null,null,"","","","","","","",null,null,"","","","","","","","",null,null,""]
[null,null,"","","","","","","",null,null,"","","","","","","","",null,null,""]
[null,null,"","","","","","","",null,null,"","","","","","","","",null,null,""]
[null,null,"","","","","","","",null,null,"","","","","","","","",null,null,""]
[null,null,"","","","","","","",null,null,"","","","","","","","",null,null,""]
[null,null,"","","","","","","",null,null,"","","","","","","","",null,null,""]
[null,null,"","","","","","","",null,null,"","","","","","","","",null,null,""]
[null,null,"","","","","","","",null,null,"","","","","","","","",null,null,""]
[null,null,"","","","","","","",null,null,"","","","","","","","",null,null,""]
[null,null,"","","","","","","",null,null,"","","","","","","","",null,null,""]
[null,null,"","","","","","","",null,null,"","","","","","","","",null,null,""]
[null,null,"","","","","","","",null,null,"","","","","","","","",null,null,""]
[null,null,"","","","","","","",null,null,"","","","","","","","",null,null,""]
[null,null,"","","","","","","",null,null,"","","","","","","","",null,null,""]
[null,null,"","","","","","","",null,null,"","","","","","","","",null,null,""]
[null,null,"","","","","","","",null,null,"","","","","","","","",null,null,""]
[null,null,"","","","","","","",null,null,"","","","","","","","",null,null,""]
[null,null,"","","","","","","",null,null,"","","","","","","","",null,null,""]
[null,null,"","","","","","","",null,null,"","","","","","","","",null,null,""]
[null,null,"","","","","","","",null,null,"","","","","","","","",null,null,""]
[null,null,"","","","","","","",null,null,"","","","","","","","",null,null,""]
[null,null,"","","","","","","",null,null,"","","","","","","","",null,null,""]
[null,null,"","","","","","","",null,null,"","","","","","","","",null,null,""]
[null,null,"","","","","","","",null,null,"","","","","","","","",null,null,""]
[null,null,"","","","","","","",null,null,"","","","","","","","",null,null,""]
[null,null,"","","","","","","",null,null,"","","","","","","","",null,null,""]
[null,null,"","","","","","","",null,null,"","","","","","","","",null,null,""]
[null,null,"","","","","","","",null,null,"","","","","","","","",null,null,""]
[null,null,"","","","","","","",null,null,"","","","","","","","",null,null,""]
[null,null,"","","","","","","",null,null,"","","","","","","","",null,null,""]
[null,null,"","","","","","","",null,null,"","","","","","","","",null,null,""]
[null,null,"","","","","","","",null,null,"","","","","","","","",null,null,""]
[null,null,"","","","","","","",null,null,"","","","","","","","",null,null,""]
[null,null,"","","","","","","",null,null,"","","","","","","","",null,null,""]
[null,null,"","","","","","","",null,null,"","","","","","","","",null,null,""]
[null,null,"","","","","","","",null,null,"","","","","","","","",null,null,""]
[null,null,"","","","","","","",null,null,"","","","","","","","",null,null,""]
[null,null,"","","","","","","",null,null,"","","","","","","","",null,null,""]
[null,null,"","","","","","","",null,null,"","","","","","","","",null,null,""]
[null,null,"","","","","","","",null,null,"","","","","","","","",null,null,""]
[null,null,"","","","","","","",null,null,"","","","","","","","",null,null,""]
[null,null,"","","","","","","",null,null,"","","","","","","","",null,null,""]
[null,null,"","","","","","","",null,null,"","","","","","","","",null,null,""]
[null,null,"","","","","","","",null,null,"","","","","","","","",null,null,""]
[null,null,"","","","","","","",null,null,"","","","","","","","",null,null,""]
[null,null,"","","","","","","",null,null,"","","","","","","","",null,null,""]
[null,null,"","","","","","","",null,null,"","","","","","","","",null,null,""]
[null,null,"","","","","","","",null,null,"","","","","","","","",null,null,""]
[null,null,"","","","","","","",null,null,"","","","","","","","",null,null,""]
[null,null,"","","","","","","",null,null,"","","","","","","","",null,null,""]
[null,null,"","","","","","","",null,null,"","","","","","","","",null,null,""]
[null,null,"","","","","","","",null,null,"","","","","","","","",null,null,""]
[null,null,"","","","","","","",null,null,"","","","","","","","",null,null,""]
[null,null,"","","","","","","",null,null,"","","","","","","","",null,null,""]
[null,null,"","","","","","","",null,null,"","","","","","","","",null,null,""]
[null,null,"","","","","","","",null,null,"","","","","","","","",null,null,""]
[null,null,"","","","","","","",null,null,"","","","","","","","",null,null,""]
[null,null,"","","","","","","",null,null,"","","","","","","","",null,null,""]
[null,null,"","","","","","","",null,null,"","","","","","","","",null,null,""]
[null,null,"","","","","","","",null,null,"","","","","","","","",null,null,""]
[null,null,"","","","","","","",null,null,"","","","","","","","",null,null,""]
[null,null,"","","","","","","",null,null,"","","","","","","","",null,null,""]
[null,null,"","","","","","","",null,null,"","","","","","","","",null,null,""]
[null,null,"","","","","","","",null,null,"","","","","","","","",null,null,""]
[null,null,"","","","","","","",null,null,"","","","","","","","",null,null,""]
[null,null,"","","","","","","",null,null,"","","","","","","","",null,null,""]
[null,null,"","","","","","","",null,null,"","","","","","","","",null,null,""]
[null,null,"","","","","","","",null,null,"","","","","","","","",null,null,""]
[null,null,"","","","","","","",null,null,"","","","","","","","",null,null,""]
[null,null,"","","","","","","",null,null,"","","","","","","","",null,null,""]
[null,null,"","","","","","","",null,null,"","","","","","","","",null,null,""]
[null,null,"","","","","","","",null,null,"","","","","","","","",null,null,""]
[null,null,"","","","","","","",null,null,"","","","","","","","",null,null,""]
[null,null,"","","","","","","",null,null,"","","","","","","","",null,null,""]
[null,null,"","","","","","","",null,null,"","","","","","","","",null,null,""]
[null,null,"","","","","","","",null,null,"","","","","","","","",null,null,""]
[null,null,"","","","","","","",null,null,"","","","","","","","",null,null,""]
[null,null,"","","","","","","",null,null,"","","","","","","","",null,null,""]
[null,null,"","","","","","","",null,null,"","","","","","","","",null,null,""]
[null,null,"","","","","","","",null,null,"","","","","","","","",null,null,""]
[null,null,"","","","","","","",null,null,"","","","","","","","",null,null,""]
[null,null,"","","","","","","",null,null,"","","","","","","","",null,null,""]
[null,null,"","","","","","","",null,null,"","","","","","","","",null,null,""]
[null,null,"","","","","","","",null,null,"","","","","","","","",null,null,""]
[null,null,"","","","","","","",null,null,"","","","","","","","",null,null,""]
[null,null,"","","","","","","",null,null,"","","","","","","","",null,null,""]
[null,null,"","","","","","","",null,null,"","","","","","","","",null,null,""]
[null,null,"","","","","","","",null,null,"","","","","","","","",null,null,""]
[null,null,"","","","","","","",null,null,"","","","","","","","",null,null,""]
[null,null,"","","","","","","",null,null,"","","","","","","","",null,null,""]
[null,null,"","","","","","","",null,null,"","","","","","","","",null,null,""]
[null,null,"","","","","","","",null,null,"","","","","","","","",null,null,""]
[null,null,"","","","","","","",null,null,"","","","","","","","",null,null,""]
[null,null,"","","","","","","",null,null,"","","","","","","","",null,null,""]
[null,null,"","","","","","","",null,null,"","","","","","","","",null,null,""]
[null,null,"","","","","","","",null,null,"","","","","","","","",null,null,""]
[null,null,"","","","","","","",null,null,"","","","","","","","",null,null,""]
[null,null,"","","","","","","",null,null,"","","","","","","","",null,null,""]
[null,null,"","","","","","","",null,null,"","","","","","","","",null,null,""]
[null,null,"","","","","","","",null,null,"","","","","","","","",null,null,""]
[null,null,"","","","","","","",null,null,"","","","","","","","",null,null,""]
[null,null,"","","","","","","",null,null,"","","","","","","","",null,null,""]
[null,null,"","","","","","","",null,null,"","","","","","","","",null,null,""]
[null,null,"","","","","","","",null,null,"","","","","","","","",null,null,""]
[null,null,"","","","","","","",null,null,"","","","","","","","",null,null,""]
[null,null,"","","","","","","",null,null,"","","","","","","","",null,null,""]
[null,null,"","","","","","","",null,null,"","","","","","","","",null,null,""]
[null,null,"","","","","","","",null,null,"","","","","","","","",null,null,""]
[null,null,"","","","","","","",null,null,"","","","","","","","",null,null,""]
[null,null,"","","","","","","",null,null,"","","","","","","","",null,null,""]
[null,null,"","","","","","","",null,null,"","","","","","","","",null,null,""]
[null,null,"","","","","","","",null,null,"","","","","","","","",null,null,""]
[null,null,"","","","","","","",null,null,"","","","","","","","",null,null,""]
[null,null,"","","","","","","",null,null,"","","","","","","","",null,null,""]
[null,null,"","","","","","","",null,null,"","","","","","","","",null,null,""]
[null,null,"","","","","","","",null,null,"","","","","","","","",null,null,""]
[null,null,"","","","","","","",null,null,"","","","","","","","",null,null,""]
[null,null,"","","","","","","",null,null,"","","","","","","","",null,null,""]
[null,null,"","","","","","","",null,null,"","","","","","","","",null,null,""]
[null,null,"","","","","","","",null,null,"","","","","","","","",null,null,""]
[null,null,"","","","","","","",null,null,"","","","","","","","",null,null,""]
[null,null,"","","","","","","",null,null,"","","","","","","","",null,null,""]
[null,null,"","","","","","","",null,null,"","","","","","","","",null,null,""]
[null,null,"","","","","","","",null,null,"","","","","","","","",null,null,""]
[null,null,"","","","","","","",null,null,"","","","","","","","",null,null,""]
[null,null,"","","","","","","",null,null,"","","","","","","","",null,null,""]
[null,null,"","","","","","","",null,null,"","","","","","","","",null,null,""]
[null,null,"","","","","","","",null,null,"","","","","","","","",null,null,""]
[null,null,"","","","","","","",null,null,"","","","","","","","",null,null,""]
[null,null,"","","","","","","",null,null,"","","","","","","","",null,null,""]
[null,null,"","","","","","","",null,null,"","","","","","","","",null,null,""]
[null,null,"","","","","","","",null,null,"","","","","","","","",null,null,""]
[null,null,"","","","","","","",null,null,"","","","","","","","",null,null,""]
[null,null,"","","","","","","",null,null,"","","","","","","","",null,null,""]
[null,null,"","","","","","","",null,null,"","","","","","","","",null,null,""]
[null,null,"","","","","","","",null,null,"","","","","","","","",null,null,""]
[null,null,"","","","","","","",null,null,"","","","","","","","",null,null,""]
[null,null,"","","","","","","",null,null,"","","","","","","","",null,null,""]
[null,null,"","","","","","","",null,null,"","","","","","","","",null,null,""]
[null,null,"","","","","","","",null,null,"","","","","","","","",null,null,""]
[null,null,"","","","","","","",null,null,"","","","","","","","",null,null,""]
[null,null,"","","","","","","",null,null,"","","","","","","","",null,null,""]
[null,null,"","","","","","","",null,null,"","","","","","","","",null,null,""]
[null,null,"","","","","","","",null,null,"","","","","","","","",null,null,""]
[null,null,"","","","","","","",null,null,"","","","","","","","",null,null,""]
[null,null,"","","","","","","",null,null,"","","","","","","","",null,null,""]
[null,null,"","","","","","","",null,null,"","","","","","","","",null,null,""]
[null,null,"","","","","","","",null,null,"","","","","","","","",null,null,""]
[null,null,"","","","","","","",null,null,"","","","","","","","",null,null,""]
[null,null,"","","","","","","",null,null,"","","","","","","","",null,null,""]
[null,null,"","","","","","","",null,null,"","","","","","","","",null,null,""]
[null,null,"","","","","","","",null,null,"","","","","","","","",null,null,""]
[null,null,"","","","","","","",null,null,"","","","","","","","",null,null,""]
[null,null,"","","","","","","",null,null,"","","","","","","","",null,null,""]
[null,null,"","","","","","","",null,null,"","","","","","","","",null,null,""]
[null,null,"","","","","","","",null,null,"","","","","","","","",null,null,""]
[null,null,"","","","","","","",null,null,"","","","","","","","",null,null,""]
[null,null,"","","","","","","",null,null,"","","","","","","","",null,null,""]
[null,null,"","","","","","","",null,null,"","","","","","","","",null,null,""]
[null,null,"","","","","","","",null,null,"","","","","","","","",null,null,""]
[null,null,"","","","","","","",null,null,"","","","","","","","",null,null,""]
[null,null,"","","","","","","",null,null,"","","","","","","","",null,null,""]
[null,null,"","","","","","","",null,null,"","","","","","","","",null,null,""]

{"sheet":"4.4 Quoted services","index":21,"n_rows":483,"n_cols":22,"rows_kept":483,"cut":false,"hidden":false,"merged":[[8,2,8,11],[8,12,8,21],[5,1,5,2],[8,1,9,1]]}
[null,"REGULATORY REPORTING STATEMENT"]
[null,{"$f":"INDEX(dms_TradingNameFull_List,MATCH(dms_TradingName,dms_TradingName_List))","v":"SA Power Networks"}]
[null,{"$f":"IF(SUM(dms_SingleYear_Model)>0,(\"CATEGORY ANALYSIS \"&CRY&\" to \"&FRY),(\"CATEGORY ANALYSIS \"&CRY))","v":"CATEGORY ANALYSIS 2008-09 to 2018-19"}]
[null,"4.4 ANCILLARY SERVICES - QUOTED SERVICES"]
[]
[null,"There is ONE table on this worksheet. The COLUMNS  have been 'grouped' for easy navigation. See the Instructions sheet on how to group or ungroup data."]
[]
[null,"4.4.1 - COST METRICS FOR QUOTED SERVICES"]
[null,"SERVICE SUBCATEGORY","EXPENDITURE \n($0's)",null,null,null,null,null,null,null,null,null,"VOLUMES \n(0's)"]
[null,null,{"$f":"IF(dms_RPT=\"financial\",dms_CRYf_y1,dms_CRYc_y1)","v":"2008-09"},{"$f":"IF(dms_RPT=\"financial\",dms_CRYf_y2,dms_CRYc_y2)","v":"2009-10"},{"$f":"IF(dms_RPT=\"financial\",dms_CRYf_y3,dms_CRYc_y3)","v":"2010-11"},{"$f":"IF(dms_RPT=\"financial\",dms_CRYf_y4,dms_CRYc_y4)","v":"2011-12"},{"$f":"IF(dms_RPT=\"financial\",dms_CRYf_y5,dms_CRYc_y5)","v":"2012-13"},{"$f":"IF(dms_RPT=\"financial\",dms_CRYf_y6,dms_CRYc_y6)","v":"2013-14"},{"$f":"IF(dms_RPT=\"financial\",dms_CRYf_y7,dms_CRYc_y7)","v":"2014-15"},{"$f":"IF(dms_RPT=\"financial\",dms_CRYf_y8,dms_CRYc_y8)","v":"2015-16"},{"$f":"IF(dms_RPT=\"financial\",dms_CRYf_y9,dms_CRYc_y9)","v":"2016-17"},{"$f":"IF(dms_RPT=\"financial\",dms_CRYf_y10,dms_CRYc_y10)","v":"2017-18"},{"$f":"IF(dms_RPT=\"financial\",dms_CRYf_y1,dms_CRYc_y1)","v":"2008-09"},{"$f":"IF(dms_RPT=\"financial\",dms_CRYf_y2,dms_CRYc_y2)","v":"2009-10"},{"$f":"IF(dms_RPT=\"financial\",dms_CRYf_y3,dms_CRYc_y3)","v":"2010-11"},{"$f":"IF(dms_RPT=\"financial\",dms_CRYf_y4,dms_CRYc_y4)","v":"2011-12"},{"$f":"IF(dms_RPT=\"financial\",dms_CRYf_y5,dms_CRYc_y5)","v":"2012-13"},{"$f":"IF(dms_RPT=\"financial\",dms_CRYf_y6,dms_CRYc_y6)","v":"2013-14"},{"$f":"IF(dms_RPT=\"financial\",dms_CRYf_y7,dms_CRYc_y7)","v":"2014-15"},{"$f":"IF(dms_RPT=\"financial\",dms_CRYf_y8,dms_CRYc_y8)","v":"2015-16"},{"$f":"IF(dms_RPT=\"financial\",dms_CRYf_y9,dms_CRYc_y9)","v":"2016-17"},{"$f":"IF(dms_RPT=\"financial\",dms_CRYf_y10,dms_CRYc_y10)","v":"2017-18"}]
[null,"Customer initiated asset relocations",6357499,6662837,12899956,8608255,7576023,4690185,8153140,31924369,21288475,16492202,103,108,209,139,123,76,132,330,356,443]
[null,"Access permits, oversight & facilitations services",459075,459075,459075,459075,459075,459075,459075,616019,267124,900881,1481,1481,1481,1481,1481,908,1524,1700,1844,1430]
[null,"High load escorts",355258,355258,355258,355258,355258,355258,355258,574871,373918,427957,163,198,169,179,172,185,126,131,183,195]
[null,"Large embedded generators (>200kW)",0,388000,2956000,188000,206000,1186000,56499,80789,2513534,7853316,0,0,1,0,2,2,1,1,5,20]
[null,"Enhanced connection service (non-embedded generation)",0,0,0,0,0,0,0,0,0,0,0,0,0,0,0,0,0,0,0,0]
[null,"Connection point alterations (non Fee-based services)",0,0,0,0,0,0,0,0,0,0,0,0,0,0,0,0,0,0,0,0]
[null,"Temporary supply (non Fee-based services)",996,996,996,996,996,996,996,996,996,996,2,2,2,2,2,2,2,2,2,2]
[null,"Technical/Engineering studies",0,0,0,0,0,0,0,0,0,0,0,0,0,0,0,0,0,0,0,0]
[null,"Specification fee (>$200k project)",0,0,0,0,0,0,0,3560,0,3700,0,0,0,0,0,0,0,2,0,2]
[null,"Specification/design compliance",0,0,0,0,0,0,0,0,0,0,0,0,0,0,0,0,0,0,0,0]
[null,"Retailer fee - disconnection & reconnection - R/C at Pole Top (non Fee-based)",137795,214227,327614,204477,418010,500209,406207,489139,307253,343756,876,1400,2147,1336,1973,2340,1853,2234,1396,1522]
[null,"Inspection and auditing services",0,0,0,0,0,0,0,0,0,0,0,0,0,0,0,0,0,0,0,0]
[null,"Third party funded network upgrades or other improvements",0,0,0,0,0,0,0,0,0,0,0,0,0,0,0,0,0,0,0,0]
[null,"Customer requested provision of electricity network or consumption data",0,0,0,0,0,0,0,0,0,0,0,0,0,0,0,0,0,0,0,0]
[null,"Security lighting",0,0,0,0,0,0,0,0,0,0,0,0,0,0,0,0,0,0,0,0]
[]
[]
[]
[]
[]
[]
[]
[]
[]
[]
[]
[]
[]
[]
[]
[]
[]
[]
[null,null,"","","","","","","",null,null,"","","","","","","","",null,null,""]
[null,null,"","","","","","","",null,null,"","","","","","","","",null,null,""]
[null,null,"","","","","","","",null,null,"","","","","","","","",null,null,""]
[null,null,"","","","","","","",null,null,"","","","","","","","",null,null,""]
[null,null,"","","","","","","",null,null,"","","","","","","","",null,null,""]
[null,null,"","","","","","","",null,null,"","","","","","","","",null,null,""]
[null,null,"","","","","","","",null,null,"","","","","","","","",null,null,""]
[null,null,"","","","","","","",null,null,"","","","","","","","",null,null,""]
[null,null,"","","","","","","",null,null,"","","","","","","","",null,null,""]
[null,null,"","","","","","","",null,null,"","","","","","","","",null,null,""]
[null,null,"","","","","","","",null,null,"","","","","","","","",null,null,""]
[null,null,"","","","","","","",null,null,"","","","","","","","",null,null,""]
[null,null,"","","","","","","",null,null,"","","","","","","","",null,null,""]
[null,null,"","","","","","","",null,null,"","","","","","","","",null,null,""]
[null,null,"","","","","","","",null,null,"","","","","","","","",null,null,""]
[null,null,"","","","","","","",null,null,"","","","","","","","",null,null,""]
[null,null,"","","","","","","",null,null,"","","","","","","","",null,null,""]
[null,null,"","","","","","","",null,null,"","","","","","","","",null,null,""]
[null,null,"","","","","","","",null,null,"","","","","","","","",null,null,""]
[null,null,"","","","","","","",null,null,"","","","","","","","",null,null,""]
[null,null,"","","","","","","",null,null,"","","","","","","","",null,null,""]
[null,null,"","","","","","","",null,null,"","","","","","","","",null,null,""]
[null,null,"","","","","","","",null,null,"","","","","","","","",null,null,""]
[null,null,"","","","","","","",null,null,"","","","","","","","",null,null,""]
[null,null,"","","","","","","",null,null,"","","","","","","","",null,null,""]
[null,null,"","","","","","","",null,null,"","","","","","","","",null,null,""]
[null,null,"","","","","","","",null,null,"","","","","","","","",null,null,""]
[null,null,"","","","","","","",null,null,"","","","","","","","",null,null,""]
[null,null,"","","","","","","",null,null,"","","","","","","","",null,null,""]
[null,null,"","","","","","","",null,null,"","","","","","","","",null,null,""]
[null,null,"","","","","","","",null,null,"","","","","","","","",null,null,""]
[null,null,"","","","","","","",null,null,"","","","","","","","",null,null,""]
[null,null,"","","","","","","",null,null,"","","","","","","","",null,null,""]
[null,null,"","","","","","","",null,null,"","","","","","","","",null,null,""]
[null,null,"","","","","","","",null,null,"","","","","","","","",null,null,""]
[null,null,"","","","","","","",null,null,"","","","","","","","",null,null,""]
[null,null,"","","","","","","",null,null,"","","","","","","","",null,null,""]
[null,null,"","","","","","","",null,null,"","","","","","","","",null,null,""]
[null,null,"","","","","","","",null,null,"","","","","","","","",null,null,""]
[null,null,"","","","","","","",null,null,"","","","","","","","",null,null,""]
[null,null,"","","","","","","",null,null,"","","","","","","","",null,null,""]
[null,null,"","","","","","","",null,null,"","","","","","","","",null,null,""]
[null,null,"","","","","","","",null,null,"","","","","","","","",null,null,""]
[null,null,"","","","","","","",null,null,"","","","","","","","",null,null,""]
[null,null,"","","","","","","",null,null,"","","","","","","","",null,null,""]
[null,null,"","","","","","","",null,null,"","","","","","","","",null,null,""]
[null,null,"","","","","","","",null,null,"","","","","","","","",null,null,""]
[null,null,"","","","","","","",null,null,"","","","","","","","",null,null,""]
[null,null,"","","","","","","",null,null,"","","","","","","","",null,null,""]
[null,null,"","","","","","","",null,null,"","","","","","","","",null,null,""]
[null,null,"","","","","","","",null,null,"","","","","","","","",null,null,""]
[null,null,"","","","","","","",null,null,"","","","","","","","",null,null,""]
[null,null,"","","","","","","",null,null,"","","","","","","","",null,null,""]
[null,null,"","","","","","","",null,null,"","","","","","","","",null,null,""]
[null,null,"","","","","","","",null,null,"","","","","","","","",null,null,""]
[null,null,"","","","","","","",null,null,"","","","","","","","",null,null,""]
[null,null,"","","","","","","",null,null,"","","","","","","","",null,null,""]
[null,null,"","","","","","","",null,null,"","","","","","","","",null,null,""]
[null,null,"","","","","","","",null,null,"","","","","","","","",null,null,""]
[null,null,"","","","","","","",null,null,"","","","","","","","",null,null,""]
[null,null,"","","","","","","",null,null,"","","","","","","","",null,null,""]
[null,null,"","","","","","","",null,null,"","","","","","","","",null,null,""]
[null,null,"","","","","","","",null,null,"","","","","","","","",null,null,""]
[null,null,"","","","","","","",null,null,"","","","","","","","",null,null,""]
[null,null,"","","","","","","",null,null,"","","","","","","","",null,null,""]
[null,null,"","","","","","","",null,null,"","","","","","","","",null,null,""]
[null,null,"","","","","","","",null,null,"","","","","","","","",null,null,""]
[null,null,"","","","","","","",null,null,"","","","","","","","",null,null,""]
[null,null,"","","","","","","",null,null,"","","","","","","","",null,null,""]
[null,null,"","","","","","","",null,null,"","","","","","","","",null,null,""]
[null,null,"","","","","","","",null,null,"","","","","","","","",null,null,""]
[null,null,"","","","","","","",null,null,"","","","","","","","",null,null,""]
[null,null,"","","","","","","",null,null,"","","","","","","","",null,null,""]
[null,null,"","","","","","","",null,null,"","","","","","","","",null,null,""]
[null,null,"","","","","","","",null,null,"","","","","","","","",null,null,""]
[null,null,"","","","","","","",null,null,"","","","","","","","",null,null,""]
[null,null,"","","","","","","",null,null,"","","","","","","","",null,null,""]
[null,null,"","","","","","","",null,null,"","","","","","","","",null,null,""]
[null,null,"","","","","","","",null,null,"","","","","","","","",null,null,""]
[null,null,"","","","","","","",null,null,"","","","","","","","",null,null,""]
[null,null,"","","","","","","",null,null,"","","","","","","","",null,null,""]
[null,null,"","","","","","","",null,null,"","","","","","","","",null,null,""]
[null,null,"","","","","","","",null,null,"","","","","","","","",null,null,""]
[null,null,"","","","","","","",null,null,"","","","","","","","",null,null,""]
[null,null,"","","","","","","",null,null,"","","","","","","","",null,null,""]
[null,null,"","","","","","","",null,null,"","","","","","","","",null,null,""]
[null,null,"","","","","","","",null,null,"","","","","","","","",null,null,""]
[null,null,"","","","","","","",null,null,"","","","","","","","",null,null,""]
[null,null,"","","","","","","",null,null,"","","","","","","","",null,null,""]
[null,null,"","","","","","","",null,null,"","","","","","","","",null,null,""]
[null,null,"","","","","","","",null,null,"","","","","","","","",null,null,""]
[null,null,"","","","","","","",null,null,"","","","","","","","",null,null,""]
[null,null,"","","","","","","",null,null,"","","","","","","","",null,null,""]
[null,null,"","","","","","","",null,null,"","","","","","","","",null,null,""]
[null,null,"","","","","","","",null,null,"","","","","","","","",null,null,""]
[null,null,"","","","","","","",null,null,"","","","","","","","",null,null,""]
[null,null,"","","","","","","",null,null,"","","","","","","","",null,null,""]
[null,null,"","","","","","","",null,null,"","","","","","","","",null,null,""]
[null,null,"","","","","","","",null,null,"","","","","","","","",null,null,""]
[null,null,"","","","","","","",null,null,"","","","","","","","",null,null,""]
[null,null,"","","","","","","",null,null,"","","","","","","","",null,null,""]
[null,null,"","","","","","","",null,null,"","","","","","","","",null,null,""]
[null,null,"","","","","","","",null,null,"","","","","","","","",null,null,""]
[null,null,"","","","","","","",null,null,"","","","","","","","",null,null,""]
[null,null,"","","","","","","",null,null,"","","","","","","","",null,null,""]
[null,null,"","","","","","","",null,null,"","","","","","","","",null,null,""]
[null,null,"","","","","","","",null,null,"","","","","","","","",null,null,""]
[null,null,"","","","","","","",null,null,"","","","","","","","",null,null,""]
[null,null,"","","","","","","",null,null,"","","","","","","","",null,null,""]
[null,null,"","","","","","","",null,null,"","","","","","","","",null,null,""]
[null,null,"","","","","","","",null,null,"","","","","","","","",null,null,""]
[null,null,"","","","","","","",null,null,"","","","","","","","",null,null,""]
[null,null,"","","","","","","",null,null,"","","","","","","","",null,null,""]
[null,null,"","","","","","","",null,null,"","","","","","","","",null,null,""]
[null,null,"","","","","","","",null,null,"","","","","","","","",null,null,""]
[null,null,"","","","","","","",null,null,"","","","","","","","",null,null,""]
[null,null,"","","","","","","",null,null,"","","","","","","","",null,null,""]
[null,null,"","","","","","","",null,null,"","","","","","","","",null,null,""]
[null,null,"","","","","","","",null,null,"","","","","","","","",null,null,""]
[null,null,"","","","","","","",null,null,"","","","","","","","",null,null,""]
[null,null,"","","","","","","",null,null,"","","","","","","","",null,null,""]
[null,null,"","","","","","","",null,null,"","","","","","","","",null,null,""]
[null,null,"","","","","","","",null,null,"","","","","","","","",null,null,""]
[null,null,"","","","","","","",null,null,"","","","","","","","",null,null,""]
[null,null,"","","","","","","",null,null,"","","","","","","","",null,null,""]
[null,null,"","","","","","","",null,null,"","","","","","","","",null,null,""]
[null,null,"","","","","","","",null,null,"","","","","","","","",null,null,""]
[null,null,"","","","","","","",null,null,"","","","","","","","",null,null,""]
[null,null,"","","","","","","",null,null,"","","","","","","","",null,null,""]
[null,null,"","","","","","","",null,null,"","","","","","","","",null,null,""]
[null,null,"","","","","","","",null,null,"","","","","","","","",null,null,""]
[null,null,"","","","","","","",null,null,"","","","","","","","",null,null,""]
[null,null,"","","","","","","",null,null,"","","","","","","","",null,null,""]
[null,null,"","","","","","","",null,null,"","","","","","","","",null,null,""]
[null,null,"","","","","","","",null,null,"","","","","","","","",null,null,""]
[null,null,"","","","","","","",null,null,"","","","","","","","",null,null,""]
[null,null,"","","","","","","",null,null,"","","","","","","","",null,null,""]
[null,null,"","","","","","","",null,null,"","","","","","","","",null,null,""]
[null,null,"","","","","","","",null,null,"","","","","","","","",null,null,""]
[null,null,"","","","","","","",null,null,"","","","","","","","",null,null,""]
[null,null,"","","","","","","",null,null,"","","","","","","","",null,null,""]
[null,null,"","","","","","","",null,null,"","","","","","","","",null,null,""]
[null,null,"","","","","","","",null,null,"","","","","","","","",null,null,""]
[null,null,"","","","","","","",null,null,"","","","","","","","",null,null,""]
[null,null,"","","","","","","",null,null,"","","","","","","","",null,null,""]
[null,null,"","","","","","","",null,null,"","","","","","","","",null,null,""]
[null,null,"","","","","","","",null,null,"","","","","","","","",null,null,""]
[null,null,"","","","","","","",null,null,"","","","","","","","",null,null,""]
[null,null,"","","","","","","",null,null,"","","","","","","","",null,null,""]
[null,null,"","","","","","","",null,null,"","","","","","","","",null,null,""]
[null,null,"","","","","","","",null,null,"","","","","","","","",null,null,""]
[null,null,"","","","","","","",null,null,"","","","","","","","",null,null,""]
[null,null,"","","","","","","",null,null,"","","","","","","","",null,null,""]
[null,null,"","","","","","","",null,null,"","","","","","","","",null,null,""]
[null,null,"","","","","","","",null,null,"","","","","","","","",null,null,""]
[null,null,"","","","","","","",null,null,"","","","","","","","",null,null,""]
[null,null,"","","","","","","",null,null,"","","","","","","","",null,null,""]
[null,null,"","","","","","","",null,null,"","","","","","","","",null,null,""]
[null,null,"","","","","","","",null,null,"","","","","","","","",null,null,""]
[null,null,"","","","","","","",null,null,"","","","","","","","",null,null,""]
[null,null,"","","","","","","",null,null,"","","","","","","","",null,null,""]
[null,null,"","","","","","","",null,null,"","","","","","","","",null,null,""]
[null,null,"","","","","","","",null,null,"","","","","","","","",null,null,""]
[null,null,"","","","","","","",null,null,"","","","","","","","",null,null,""]
[null,null,"","","","","","","",null,null,"","","","","","","","",null,null,""]
[null,null,"","","","","","","",null,null,"","","","","","","","",null,null,""]
[null,null,"","","","","","","",null,null,"","","","","","","","",null,null,""]
[null,null,"","","","","","","",null,null,"","","","","","","","",null,null,""]
[null,null,"","","","","","","",null,null,"","","","","","","","",null,null,""]
[null,null,"","","","","","","",null,null,"","","","","","","","",null,null,""]
[null,null,"","","","","","","",null,null,"","","","","","","","",null,null,""]
[null,null,"","","","","","","",null,null,"","","","","","","","",null,null,""]
[null,null,"","","","","","","",null,null,"","","","","","","","",null,null,""]
[null,null,"","","","","","","",null,null,"","","","","","","","",null,null,""]
[null,null,"","","","","","","",null,null,"","","","","","","","",null,null,""]
[null,null,"","","","","","","",null,null,"","","","","","","","",null,null,""]
[null,null,"","","","","","","",null,null,"","","","","","","","",null,null,""]
[null,null,"","","","","","","",null,null,"","","","","","","","",null,null,""]
[null,null,"","","","","","","",null,null,"","","","","","","","",null,null,""]
[null,null,"","","","","","","",null,null,"","","","","","","","",null,null,""]
[null,null,"","","","","","","",null,null,"","","","","","","","",null,null,""]
[null,null,"","","","","","","",null,null,"","","","","","","","",null,null,""]
[null,null,"","","","","","","",null,null,"","","","","","","","",null,null,""]
[null,null,"","","","","","","",null,null,"","","","","","","","",null,null,""]
[null,null,"","","","","","","",null,null,"","","","","","","","",null,null,""]
[null,null,"","","","","","","",null,null,"","","","","","","","",null,null,""]
[null,null,"","","","","","","",null,null,"","","","","","","","",null,null,""]
[null,null,"","","","","","","",null,null,"","","","","","","","",null,null,""]
[null,null,"","","","","","","",null,null,"","","","","","","","",null,null,""]
[null,null,"","","","","","","",null,null,"","","","","","","","",null,null,""]
[null,null,"","","","","","","",null,null,"","","","","","","","",null,null,""]
[null,null,"","","","","","","",null,null,"","","","","","","","",null,null,""]
[null,null,"","","","","","","",null,null,"","","","","","","","",null,null,""]
[null,null,"","","","","","","",null,null,"","","","","","","","",null,null,""]
[null,null,"","","","","","","",null,null,"","","","","","","","",null,null,""]
[null,null,"","","","","","","",null,null,"","","","","","","","",null,null,""]
[null,null,"","","","","","","",null,null,"","","","","","","","",null,null,""]
[null,null,"","","","","","","",null,null,"","","","","","","","",null,null,""]
[null,null,"","","","","","","",null,null,"","","","","","","","",null,null,""]
[null,null,"","","","","","","",null,null,"","","","","","","","",null,null,""]
[null,null,"","","","","","","",null,null,"","","","","","","","",null,null,""]
[null,null,"","","","","","","",null,null,"","","","","","","","",null,null,""]
[null,null,"","","","","","","",null,null,"","","","","","","","",null,null,""]
[null,null,"","","","","","","",null,null,"","","","","","","","",null,null,""]
[null,null,"","","","","","","",null,null,"","","","","","","","",null,null,""]
[null,null,"","","","","","","",null,null,"","","","","","","","",null,null,""]
[null,null,"","","","","","","",null,null,"","","","","","","","",null,null,""]
[null,null,"","","","","","","",null,null,"","","","","","","","",null,null,""]
[null,null,"","","","","","","",null,null,"","","","","","","","",null,null,""]
[null,null,"","","","","","","",null,null,"","","","","","","","",null,null,""]
[null,null,"","","","","","","",null,null,"","","","","","","","",null,null,""]
[null,null,"","","","","","","",null,null,"","","","","","","","",null,null,""]
[null,null,"","","","","","","",null,null,"","","","","","","","",null,null,""]
[null,null,"","","","","","","",null,null,"","","","","","","","",null,null,""]
[null,null,"","","","","","","",null,null,"","","","","","","","",null,null,""]
[null,null,"","","","","","","",null,null,"","","","","","","","",null,null,""]
[null,null,"","","","","","","",null,null,"","","","","","","","",null,null,""]
[null,null,"","","","","","","",null,null,"","","","","","","","",null,null,""]
[null,null,"","","","","","","",null,null,"","","","","","","","",null,null,""]
[null,null,"","","","","","","",null,null,"","","","","","","","",null,null,""]
[null,null,"","","","","","","",null,null,"","","","","","","","",null,null,""]
[null,null,"","","","","","","",null,null,"","","","","","","","",null,null,""]
[null,null,"","","","","","","",null,null,"","","","","","","","",null,null,""]
[null,null,"","","","","","","",null,null,"","","","","","","","",null,null,""]
[null,null,"","","","","","","",null,null,"","","","","","","","",null,null,""]
[null,null,"","","","","","","",null,null,"","","","","","","","",null,null,""]
[null,null,"","","","","","","",null,null,"","","","","","","","",null,null,""]
[null,null,"","","","","","","",null,null,"","","","","","","","",null,null,""]
[null,null,"","","","","","","",null,null,"","","","","","","","",null,null,""]
[null,null,"","","","","","","",null,null,"","","","","","","","",null,null,""]
[null,null,"","","","","","","",null,null,"","","","","","","","",null,null,""]
[null,null,"","","","","","","",null,null,"","","","","","","","",null,null,""]
[null,null,"","","","","","","",null,null,"","","","","","","","",null,null,""]
[null,null,"","","","","","","",null,null,"","","","","","","","",null,null,""]
[null,null,"","","","","","","",null,null,"","","","","","","","",null,null,""]
[null,null,"","","","","","","",null,null,"","","","","","","","",null,null,""]
[null,null,"","","","","","","",null,null,"","","","","","","","",null,null,""]
[null,null,"","","","","","","",null,null,"","","","","","","","",null,null,""]
[null,null,"","","","","","","",null,null,"","","","","","","","",null,null,""]
[null,null,"","","","","","","",null,null,"","","","","","","","",null,null,""]
[null,null,"","","","","","","",null,null,"","","","","","","","",null,null,""]
[null,null,"","","","","","","",null,null,"","","","","","","","",null,null,""]
[null,null,"","","","","","","",null,null,"","","","","","","","",null,null,""]
[null,null,"","","","","","","",null,null,"","","","","","","","",null,null,""]
[null,null,"","","","","","","",null,null,"","","","","","","","",null,null,""]
[null,null,"","","","","","","",null,null,"","","","","","","","",null,null,""]
[null,null,"","","","","","","",null,null,"","","","","","","","",null,null,""]
[null,null,"","","","","","","",null,null,"","","","","","","","",null,null,""]
[null,null,"","","","","","","",null,null,"","","","","","","","",null,null,""]
[null,null,"","","","","","","",null,null,"","","","","","","","",null,null,""]
[null,null,"","","","","","","",null,null,"","","","","","","","",null,null,""]
[null,null,"","","","","","","",null,null,"","","","","","","","",null,null,""]
[null,null,"","","","","","","",null,null,"","","","","","","","",null,null,""]
[null,null,"","","","","","","",null,null,"","","","","","","","",null,null,""]
[null,null,"","","","","","","",null,null,"","","","","","","","",null,null,""]
[null,null,"","","","","","","",null,null,"","","","","","","","",null,null,""]
[null,null,"","","","","","","",null,null,"","","","","","","","",null,null,""]
[null,null,"","","","","","","",null,null,"","","","","","","","",null,null,""]
[null,null,"","","","","","","",null,null,"","","","","","","","",null,null,""]
[null,null,"","","","","","","",null,null,"","","","","","","","",null,null,""]
[null,null,"","","","","","","",null,null,"","","","","","","","",null,null,""]
[null,null,"","","","","","","",null,null,"","","","","","","","",null,null,""]
[null,null,"","","","","","","",null,null,"","","","","","","","",null,null,""]
[null,null,"","","","","","","",null,null,"","","","","","","","",null,null,""]
[null,null,"","","","","","","",null,null,"","","","","","","","",null,null,""]
[null,null,"","","","","","","",null,null,"","","","","","","","",null,null,""]
[null,null,"","","","","","","",null,null,"","","","","","","","",null,null,""]
[null,null,"","","","","","","",null,null,"","","","","","","","",null,null,""]
[null,null,"","","","","","","",null,null,"","","","","","","","",null,null,""]
[null,null,"","","","","","","",null,null,"","","","","","","","",null,null,""]
[null,null,"","","","","","","",null,null,"","","","","","","","",null,null,""]
[null,null,"","","","","","","",null,null,"","","","","","","","",null,null,""]
[null,null,"","","","","","","",null,null,"","","","","","","","",null,null,""]
[null,null,"","","","","","","",null,null,"","","","","","","","",null,null,""]
[null,null,"","","","","","","",null,null,"","","","","","","","",null,null,""]
[null,null,"","","","","","","",null,null,"","","","","","","","",null,null,""]
[null,null,"","","","","","","",null,null,"","","","","","","","",null,null,""]
[null,null,"","","","","","","",null,null,"","","","","","","","",null,null,""]
[null,null,"","","","","","","",null,null,"","","","","","","","",null,null,""]
[null,null,"","","","","","","",null,null,"","","","","","","","",null,null,""]
[null,null,"","","","","","","",null,null,"","","","","","","","",null,null,""]
[null,null,"","","","","","","",null,null,"","","","","","","","",null,null,""]
[null,null,"","","","","","","",null,null,"","","","","","","","",null,null,""]
[null,null,"","","","","","","",null,null,"","","","","","","","",null,null,""]
[null,null,"","","","","","","",null,null,"","","","","","","","",null,null,""]
[null,null,"","","","","","","",null,null,"","","","","","","","",null,null,""]
[null,null,"","","","","","","",null,null,"","","","","","","","",null,null,""]
[null,null,"","","","","","","",null,null,"","","","","","","","",null,null,""]
[null,null,"","","","","","","",null,null,"","","","","","","","",null,null,""]
[null,null,"","","","","","","",null,null,"","","","","","","","",null,null,""]
[null,null,"","","","","","","",null,null,"","","","","","","","",null,null,""]
[null,null,"","","","","","","",null,null,"","","","","","","","",null,null,""]
[null,null,"","","","","","","",null,null,"","","","","","","","",null,null,""]
[null,null,"","","","","","","",null,null,"","","","","","","","",null,null,""]
[null,null,"","","","","","","",null,null,"","","","","","","","",null,null,""]
[null,null,"","","","","","","",null,null,"","","","","","","","",null,null,""]
[null,null,"","","","","","","",null,null,"","","","","","","","",null,null,""]
[null,null,"","","","","","","",null,null,"","","","","","","","",null,null,""]
[null,null,"","","","","","","",null,null,"","","","","","","","",null,null,""]
[null,null,"","","","","","","",null,null,"","","","","","","","",null,null,""]
[null,null,"","","","","","","",null,null,"","","","","","","","",null,null,""]
[null,null,"","","","","","","",null,null,"","","","","","","","",null,null,""]
[null,null,"","","","","","","",null,null,"","","","","","","","",null,null,""]
[null,null,"","","","","","","",null,null,"","","","","","","","",null,null,""]
[null,null,"","","","","","","",null,null,"","","","","","","","",null,null,""]
[null,null,"","","","","","","",null,null,"","","","","","","","",null,null,""]
[null,null,"","","","","","","",null,null,"","","","","","","","",null,null,""]
[null,null,"","","","","","","",null,null,"","","","","","","","",null,null,""]
[null,null,"","","","","","","",null,null,"","","","","","","","",null,null,""]
[null,null,"","","","","","","",null,null,"","","","","","","","",null,null,""]
[null,null,"","","","","","","",null,null,"","","","","","","","",null,null,""]
[null,null,"","","","","","","",null,null,"","","","","","","","",null,null,""]
[null,null,"","","","","","","",null,null,"","","","","","","","",null,null,""]
[null,null,"","","","","","","",null,null,"","","","","","","","",null,null,""]
[null,null,"","","","","","","",null,null,"","","","","","","","",null,null,""]
[null,null,"","","","","","","",null,null,"","","","","","","","",null,null,""]
[null,null,"","","","","","","",null,null,"","","","","","","","",null,null,""]
[null,null,"","","","","","","",null,null,"","","","","","","","",null,null,""]
[null,null,"","","","","","","",null,null,"","","","","","","","",null,null,""]
[null,null,"","","","","","","",null,null,"","","","","","","","",null,null,""]
[null,null,"","","","","","","",null,null,"","","","","","","","",null,null,""]
[null,null,"","","","","","","",null,null,"","","","","","","","",null,null,""]
[null,null,"","","","","","","",null,null,"","","","","","","","",null,null,""]
[null,null,"","","","","","","",null,null,"","","","","","","","",null,null,""]
[null,null,"","","","","","","",null,null,"","","","","","","","",null,null,""]
[null,null,"","","","","","","",null,null,"","","","","","","","",null,null,""]
[null,null,"","","","","","","",null,null,"","","","","","","","",null,null,""]
[null,null,"","","","","","","",null,null,"","","","","","","","",null,null,""]
[null,null,"","","","","","","",null,null,"","","","","","","","",null,null,""]
[null,null,"","","","","","","",null,null,"","","","","","","","",null,null,""]
[null,null,"","","","","","","",null,null,"","","","","","","","",null,null,""]
[null,null,"","","","","","","",null,null,"","","","","","","","",null,null,""]
[null,null,"","","","","","","",null,null,"","","","","","","","",null,null,""]
[null,null,"","","","","","","",null,null,"","","","","","","","",null,null,""]
[null,null,"","","","","","","",null,null,"","","","","","","","",null,null,""]
[null,null,"","","","","","","",null,null,"","","","","","","","",null,null,""]
[null,null,"","","","","","","",null,null,"","","","","","","","",null,null,""]
[null,null,"","","","","","","",null,null,"","","","","","","","",null,null,""]
[null,null,"","","","","","","",null,null,"","","","","","","","",null,null,""]
[null,null,"","","","","","","",null,null,"","","","","","","","",null,null,""]
[null,null,"","","","","","","",null,null,"","","","","","","","",null,null,""]
[null,null,"","","","","","","",null,null,"","","","","","","","",null,null,""]
[null,null,"","","","","","","",null,null,"","","","","","","","",null,null,""]
[null,null,"","","","","","","",null,null,"","","","","","","","",null,null,""]
[null,null,"","","","","","","",null,null,"","","","","","","","",null,null,""]
[null,null,"","","","","","","",null,null,"","","","","","","","",null,null,""]
[null,null,"","","","","","","",null,null,"","","","","","","","",null,null,""]
[null,null,"","","","","","","",null,null,"","","","","","","","",null,null,""]
[null,null,"","","","","","","",null,null,"","","","","","","","",null,null,""]
[null,null,"","","","","","","",null,null,"","","","","","","","",null,null,""]
[null,null,"","","","","","","",null,null,"","","","","","","","",null,null,""]
[null,null,"","","","","","","",null,null,"","","","","","","","",null,null,""]
[null,null,"","","","","","","",null,null,"","","","","","","","",null,null,""]
[null,null,"","","","","","","",null,null,"","","","","","","","",null,null,""]
[null,null,"","","","","","","",null,null,"","","","","","","","",null,null,""]
[null,null,"","","","","","","",null,null,"","","","","","","","",null,null,""]
[null,null,"","","","","","","",null,null,"","","","","","","","",null,null,""]
[null,null,"","","","","","","",null,null,"","","","","","","","",null,null,""]
[null,null,"","","","","","","",null,null,"","","","","","","","",null,null,""]
[null,null,"","","","","","","",null,null,"","","","","","","","",null,null,""]
[null,null,"","","","","","","",null,null,"","","","","","","","",null,null,""]
[null,null,"","","","","","","",null,null,"","","","","","","","",null,null,""]
[null,null,"","","","","","","",null,null,"","","","","","","","",null,null,""]
[null,null,"","","","","","","",null,null,"","","","","","","","",null,null,""]
[null,null,"","","","","","","",null,null,"","","","","","","","",null,null,""]
[null,null,"","","","","","","",null,null,"","","","","","","","",null,null,""]
[null,null,"","","","","","","",null,null,"","","","","","","","",null,null,""]
[null,null,"","","","","","","",null,null,"","","","","","","","",null,null,""]
[null,null,"","","","","","","",null,null,"","","","","","","","",null,null,""]
[null,null,"","","","","","","",null,null,"","","","","","","","",null,null,""]
[null,null,"","","","","","","",null,null,"","","","","","","","",null,null,""]
[null,null,"","","","","","","",null,null,"","","","","","","","",null,null,""]
[null,null,"","","","","","","",null,null,"","","","","","","","",null,null,""]
[null,null,"","","","","","","",null,null,"","","","","","","","",null,null,""]
[null,null,"","","","","","","",null,null,"","","","","","","","",null,null,""]
[null,null,"","","","","","","",null,null,"","","","","","","","",null,null,""]
[null,null,"","","","","","","",null,null,"","","","","","","","",null,null,""]
[null,null,"","","","","","","",null,null,"","","","","","","","",null,null,""]
[null,null,"","","","","","","",null,null,"","","","","","","","",null,null,""]
[null,null,"","","","","","","",null,null,"","","","","","","","",null,null,""]
[null,null,"","","","","","","",null,null,"","","","","","","","",null,null,""]
[null,null,"","","","","","","",null,null,"","","","","","","","",null,null,""]
[null,null,"","","","","","","",null,null,"","","","","","","","",null,null,""]
[null,null,"","","","","","","",null,null,"","","","","","","","",null,null,""]
[null,null,"","","","","","","",null,null,"","","","","","","","",null,null,""]
[null,null,"","","","","","","",null,null,"","","","","","","","",null,null,""]
[null,null,"","","","","","","",null,null,"","","","","","","","",null,null,""]
[null,null,"","","","","","","",null,null,"","","","","","","","",null,null,""]
[null,null,"","","","","","","",null,null,"","","","","","","","",null,null,""]
[null,null,"","","","","","","",null,null,"","","","","","","","",null,null,""]
[null,null,"","","","","","","",null,null,"","","","","","","","",null,null,""]
[null,null,"","","","","","","",null,null,"","","","","","","","",null,null,""]
[null,null,"","","","","","","",null,null,"","","","","","","","",null,null,""]
[null,null,"","","","","","","",null,null,"","","","","","","","",null,null,""]
[null,null,"","","","","","","",null,null,"","","","","","","","",null,null,""]
[null,null,"","","","","","","",null,null,"","","","","","","","",null,null,""]
[null,null,"","","","","","","",null,null,"","","","","","","","",null,null,""]
[null,null,"","","","","","","",null,null,"","","","","","","","",null,null,""]
[null,null,"","","","","","","",null,null,"","","","","","","","",null,null,""]
[null,null,"","","","","","","",null,null,"","","","","","","","",null,null,""]
[null,null,"","","","","","","",null,null,"","","","","","","","",null,null,""]
[null,null,"","","","","","","",null,null,"","","","","","","","",null,null,""]
[null,null,"","","","","","","",null,null,"","","","","","","","",null,null,""]
[null,null,"","","","","","","",null,null,"","","","","","","","",null,null,""]
[null,null,"","","","","","","",null,null,"","","","","","","","",null,null,""]
[null,null,"","","","","","","",null,null,"","","","","","","","",null,null,""]
[null,null,"","","","","","","",null,null,"","","","","","","","",null,null,""]
[null,null,"","","","","","","",null,null,"","","","","","","","",null,null,""]
[null,null,"","","","","","","",null,null,"","","","","","","","",null,null,""]
[null,null,"","","","","","","",null,null,"","","","","","","","",null,null,""]
[null,null,"","","","","","","",null,null,"","","","","","","","",null,null,""]
[null,null,"","","","","","","",null,null,"","","","","","","","",null,null,""]
[null,null,"","","","","","","",null,null,"","","","","","","","",null,null,""]
[null,null,"","","","","","","",null,null,"","","","","","","","",null,null,""]
[null,null,"","","","","","","",null,null,"","","","","","","","",null,null,""]
[null,null,"","","","","","","",null,null,"","","","","","","","",null,null,""]
[null,null,"","","","","","","",null,null,"","","","","","","","",null,null,""]
[null,null,"","","","","","","",null,null,"","","","","","","","",null,null,""]
[null,null,"","","","","","","",null,null,"","","","","","","","",null,null,""]
[null,null,"","","","","","","",null,null,"","","","","","","","",null,null,""]
[null,null,"","","","","","","",null,null,"","","","","","","","",null,null,""]
[null,null,"","","","","","","",null,null,"","","","","","","","",null,null,""]
[null,null,"","","","","","","",null,null,"","","","","","","","",null,null,""]
[null,null,"","","","","","","",null,null,"","","","","","","","",null,null,""]
[null,null,"","","","","","","",null,null,"","","","","","","","",null,null,""]
[null,null,"","","","","","","",null,null,"","","","","","","","",null,null,""]
[null,null,"","","","","","","",null,null,"","","","","","","","",null,null,""]
[null,null,"","","","","","","",null,null,"","","","","","","","",null,null,""]
[null,null,"","","","","","","",null,null,"","","","","","","","",null,null,""]
[null,null,"","","","","","","",null,null,"","","","","","","","",null,null,""]
[null,null,"","","","","","","",null,null,"","","","","","","","",null,null,""]
[null,null,"","","","","","","",null,null,"","","","","","","","",null,null,""]
[null,null,"","","","","","","",null,null,"","","","","","","","",null,null,""]
[null,null,"","","","","","","",null,null,"","","","","","","","",null,null,""]
[null,null,"","","","","","","",null,null,"","","","","","","","",null,null,""]
[null,null,"","","","","","","",null,null,"","","","","","","","",null,null,""]
[null,null,"","","","","","","",null,null,"","","","","","","","",null,null,""]
[null,null,"","","","","","","",null,null,"","","","","","","","",null,null,""]
[null,null,"","","","","","","",null,null,"","","","","","","","",null,null,""]
[null,null,"","","","","","","",null,null,"","","","","","","","",null,null,""]

{"sheet":"Amendments","index":22,"n_rows":3,"n_cols":4,"rows_kept":3,"cut":false,"hidden":false,"merged":[[1,1,1,3]]}
[null,{"$f":"CONCATENATE(\"If \",dms_TradingName,\" resubmits this Regulatory Reporting Statement, please use this worksheet to identify amendments made to data resubmitted to the AER.\")","v":"If SA Power Networks resubmits this Regulatory Reporting Statement, please use this worksheet to identify amendments made to data resubmitted to the AER."}]
[null,"NSP data amendments"]
[null,"Worksheet","Table/Cell","Reason for amendment"]