{"text_format":"1","workbook":"xlsx","n_sheets":14,"sheets":["CF","AER only","Instructions","Business & other details","Contents","3.1 Revenue","3.2 Operating expenditure","3.2.3 Provisions","3.3 Assets (RAB)","3.4 Operational data","3.5 Physical assets","3.6 Quality of service","3.7 Operating environment","NSP Amendments"],"not_rendered":{"charts":0,"images":5,"macros":1,"external_links":2,"defined_names":751,"comments":1,"pivot_tables":0},"unopened":[],"bounds":{"document_bytes":16777216,"sheet_cells":100000,"rows_first":2000,"rows_last":500,"rows_between":2000,"halvings":0,"cell_chars":16384,"cell_head_chars":4096},"cells_cut":0,"cells_raw":0,"read":"whole","date_system":"1900"}

{"sheet":"CF","index":0,"n_rows":25,"n_cols":18,"rows_kept":25,"cut":false,"hidden":true,"merged":[[1,1,1,17]]}
[]
[null,"CONDITIONAL FORMATTING MAP"]
[null,null,null,null,null,"=INDEX(dms_CF_3.6.5, MATCH(dms_TradingName,dms_CF_TradingName))=\"Y\"","=INDEX(dms_CF_3.6.7.1, MATCH(dms_TradingName,dms_CF_TradingName))=\"Y\"","=INDEX(dms_CF_3.6.7.2, MATCH(dms_TradingName,dms_CF_TradingName))=\"Y\"","=INDEX(dms_CF_3.6.7.3, MATCH(dms_TradingName,dms_CF_TradingName))=\"Y\"","=INDEX(dms_CF_3.6.7.4, MATCH(dms_TradingName,dms_CF_TradingName))=\"Y\"","=INDEX(dms_CF_6.6.1, MATCH(dms_TradingName,dms_CF_TradingName))=\"Y\"","=INDEX(dms_CF_6.8, MATCH(dms_TradingName,dms_CF_TradingName))=\"Y\"","=INDEX(dms_CF_7.12, MATCH(dms_TradingName,dms_CF_TradingName))=\"Y\"","=INDEX(dms_CF_8.1_A, MATCH(dms_TradingName,dms_CF_TradingName))=\"Y\"","=INDEX(dms_CF_8.1_B, MATCH(dms_TradingName,dms_CF_TradingName))=\"Y\"","=INDEX(dms_CF_8.1_Neg, MATCH(dms_TradingName,dms_CF_TradingName))=\"Y\""]
[null,"dms_CF_TradingName","JurisdictionList","Sector","Segment","dms_CF_3.6.5","dms_CF_3.6.7.1","dms_CF_3.6.7.2","dms_CF_3.6.7.3","dms_CF_3.6.7.4","dms_CF_6.6.1","dms_CF_6.8","dms_CF_7.12","dms_CF_8.1_A","dms_CF_8.1_B","dms_CF_8.1_Neg","Spare1","Spare2"]
[null,"ActewAGL Distribution","ACT","Electricity","Distribution","Y","Y","Y","N","Y","N","Y","Y","N","Y","Y","N","N"]
[null,"Ausgrid","NSW","Electricity","Distribution","Y","N","N","N","Y","N","Y","Y","N","Y","Y","N","N"]
[null,"AusNet (D)","Vic","Electricity","Distribution","N","N","N","N","N","N","Y","N","N","N","Y","N","N"]
[null,"AusNet (T)","Vic","Electricity","Transmission","N","N","N","N","N","N","Y","N","N","N","Y","N","N"]
[null,"CitiPower","Vic","Electricity","Distribution","N","N","N","N","N","N","Y","N","N","N","Y","N","N"]
[null,"Directlink","Qld","Electricity","Transmission","N","N","N","N","N","N","Y","N","N","Y","Y","N","N"]
[null,"ElectraNet","SA","Electricity","Transmission","N","N","N","N","N","N","Y","N","N","Y","Y","N","N"]
[null,"Endeavour Energy","NSW","Electricity","Distribution","Y","N","N","N","Y","N","Y","Y","N","Y","Y","N","N"]
[null,"Energex","Qld","Electricity","Distribution","Y","N","N","N","N","N","Y","Y","N","Y","Y","N","N"]
[null,"Ergon Energy","Qld","Electricity","Distribution","Y","N","N","N","N","N","Y","Y","N","Y","Y","N","N"]
[null,"Essential Energy","NSW","Electricity","Distribution","Y","N","N","N","Y","N","Y","Y","N","Y","Y","N","N"]
[null,"Jemena Electricity","Vic","Electricity","Distribution","N","N","N","N","N","N","Y","N","N","N","Y","N","N"]
[null,"Murraylink","SA","Electricity","Transmission","N","N","N","N","N","N","Y","N","N","Y","Y","N","N"]
[null,"Power and Water","NT","Electricity","Distribution","N","N","Y","N","N","Y","Y","Y","N","Y","Y","N","N"]
[null,"Powercor Australia","Vic","Electricity","Distribution","N","N","N","N","N","N","Y","N","N","N","Y","N","N"]
[null,"Powerlink","Qld","Electricity","Transmission","N","N","N","N","N","N","Y","N","N","Y","Y","N","N"]
[null,"SA Power Networks","SA","Electricity","Distribution","Y","N","N","N","N","N","Y","Y","Y","Y","N","N","N"]
[null,"TasNetworks (D)","Tas","Electricity","Distribution","Y","N","N","N","N","N","Y","Y","N","Y","Y","N","N"]
[null,"TasNetworks (T)","Tas","Electricity","Transmission","N","N","N","N","N","N","Y","N","N","Y","Y","N","N"]
[null,"TransGrid","NSW","Electricity","Transmission","N","N","N","N","N","N","Y","N","N","Y","Y","N","N"]
[null,"United Energy","Vic","Electricity","Distribution","N","N","N","N","N","N","Y","N","N","N","Y","N","N"]

{"sheet":"AER only","index":1,"n_rows":223,"n_cols":40,"rows_kept":223,"cut":false,"hidden":true,"merged":[[0,1,0,11],[4,27,4,38],[6,27,6,30],[6,33,6,37],[53,25,53,29],[53,30,53,33],[54,14,54,21],[54,25,54,29],[54,30,54,33],[72,14,72,15],[72,25,72,28],[93,1,95,1],[96,1,100,1],[104,1,105,1],[148,1,148,8],[54,1,54,5]]}
[null,"Data in these columns used for data validation and database purposes."]
[null,"Date last modified:","2017-01-16","added (Albury and Victora) for AGN"]
[null,null,"2016-10-17","updated TransGrid's correct legal name, corrected TasNetworks (T) to June financial year"]
[null,null,"2017-02-01","inserted Power and Water, added NRs (dms_FeederCat_1 and dms_FeederCat_2)"]
[null,null,"2017-03-03","inserted AEMO as a business",null,null,null,null,null,null,null,null,null,null,null,null,null,null,null,null,null,null,null,null,null,null,null,"FOR ELECTRICITY BUSINESSES ONLY"]
[null,null,"2018-03-28","major changes to accommodate STPIS"]
[null,null,"Template Version",5,null,null,null,null,null,null,null,null,null,null,null,null,null,null,null,null,null,null,null,null,null,null,null,"Feeder Types",null,null,null,"TasNetworks (D)","MAIFI flag","Feeder Names"]
[]
[null,null,null,null,null,null,null,null,null,null,null,null,null,null,null,null,null,null,null,null,null,null,null,null,null,null,null,"CBD","Urban","Short rural","long rural","EXTRA"]
[null,"dms_TradingName_List","dms_TradingNameFull_List","dms_ABN_List","dms_JurisdictionList","dms_Sector_List","dms_Segment_List","dms_FormControl_List","dms_RPT_List","dms_RPTMonth_List","dms_CRCPlength_List","dms_FRCPlength_List","dms_663_List","dms_DeterminationRef_List","dms_Addr1_List","dms_Addr2_List","dms_Suburb_List","dms_State_List","dms_PostCode_List","dms_PAddr1_List","dms_PAddr2_List","dms_PSuburb_List","dms_PState_List","dms_PPostCode_List","dms_ContactName1_List","dms_ContactPh1_List","dms_ContactEmail_List","dms_CBD_flag","dms_Urban_flag","dms_ShortRural_flag","dms_LongRural_flag","dms_FeederType_5_flag","dms_MAIFI_flag_List","dms_FeederName_1","dms_FeederName_2","dms_FeederName_3","dms_FeederName_4","dms_FeederName_5","dms_Public_Lighting_List","Column1"]
[null,"ActewAGL Distribution","ActewAGL Distribution",76670568688,"ACT","Electricity","Distribution","Revenue cap","Financial","June",5,5,5,"2014-19 Distribution Determination","40 Bunda Street",null,"CANBERRA","ACT",2600,"GPO BOX 366",null,"CANBERRA","ACT",2601,"Robert Walker","02 6248 3847","robert.walker@actewagle.com.au","NO","YES","YES","NO","NO","NO","CBD","Urban","Short rural","Long rural",null,"YES","ActewAGL Distribution"]
[null,"ActewAGL Distribution (Tx Assets)","ActewAGL Distribution (Tx Assets)",76670568688,"ACT","Electricity","Distribution","Revenue cap","Financial","June",5,5,5,"distribution determination","40 Bunda Street",null,"CANBERRA","ACT",2600,"GPO BOX 366",null,"CANBERRA","ACT",2601,"Robert Walker","02 6248 3847","robert.walker@actewagle.com.au","NO","YES","YES","NO","NO","NO","CBD","Urban","Short rural","Long rural",null,"NO","ActewAGL Distribution (Tx Assets)"]
[null,"ActewAGL Gas","ActewAGL Gas",76670568688,"ACT","Gas","Distribution","Weighted average price cap","Financial","June",5,5,"x",null,"40 Bunda Street",null,"CANBERRA","ACT",2600,"GPO BOX 366",null,"CANBERRA","ACT",2601,"Philip Deamer","02 6248 3438","GasAAReview@actewagl.com.au","NO","NO","NO","NO","NO","-","CBD","Urban","Short rural","Long rural",null,"NO","ActewAGL Gas"]
[null,"AEMO","Australian Energy Market Operator Ltd",94072010327,"Vic","Electricity","Transmission","-","Financial","March",5,5,"x","-","Level 22","530 Collins Street","MELBOURNE","VIC",3000,"GPO Box 2008",null,"MELBOURNE","VIC",3001,null,null,null,"NO","NO","NO","NO","NO","-","CBD","Urban","Short rural","Long rural",null,"NO","AEMO"]
[null,"AGN (Albury and Victoria)","Australian Gas Networks Limited (reporting data for Albury and Victoria)",19078551685,"Vic","Gas","Distribution","Weighted average price cap","Calendar","December",5,5,"x",null,"Level 6","400 King William Street","ADELAIDE","SA",5000,"PO Box 6468","Halifax Street","ADELAIDE","SA",5000,"Craig de Laine","08 8418 1129 ","craig.delaine@agn.com.au","NO","NO","NO","NO","NO","-","CBD","Urban","Short rural","Long rural",null,"NO","AGN (Albury)"]
[null,"AGN (Albury)","Australian Gas Networks Limited (reporting data for Albury)",19078551685,"Vic","Gas","Distribution","Weighted average price cap","Calendar","December",5,5,"x",null,"Level 6","400 King William Street","ADELAIDE","SA",5000,"PO Box 6468","Halifax Street","ADELAIDE","SA",5000,"Craig de Laine","08 8418 1129 ","craig.delaine@agn.com.au","NO","NO","NO","NO","NO","-","CBD","Urban","Short rural","Long rural",null,"NO"]
[null,"AGN (SA)","Australian Gas Networks Limited (reporting data for SA)",19078551685,"SA","Gas","Distribution","Weighted average price cap","Financial","June",5,5,5,"distribution determination","Level 6","400 King William Street","ADELAIDE","SA",5000,"PO Box 6468","Halifax Street","ADELAIDE","SA",5000,"Craig de Laine","08 8418 1129 ","craig.delaine@agn.com.au","NO","NO","NO","NO","NO","-","CBD","Urban","Short rural","Long rural",null,"NO","AGN (SA)"]
[null,"AGN (Victoria)","Australian Gas Networks Limited (reporting data for Victoria)",19078551685,"Vic","Gas","Distribution","Weighted average price cap","Calendar","December",5,5,"x",null,"Level 6","400 King William Street","ADELAIDE","SA",5000,"PO Box 6468","Halifax Street","ADELAIDE","SA",5000,"Craig de Laine","08 8418 1129 ","craig.delaine@agn.com.au","NO","NO","NO","NO","NO","-","CBD","Urban","Short rural","Long rural",null,"NO","AGN (Victoria)"]
[null,"Amadeus","APT Pipelines (NT) Pty Ltd",39009737393,"NT","Gas","Transmission","Weighted average price cap","Financial","June",5,5,"x","n/a","Level 19, HSBC Building","580 George Street","SYDNEY","NSW",2000,"Level 19, HSBC Building","580 George Street","SYDNEY","NSW",2000,"Alexandra Curran","02 9275 0020","alexandra.curran@apa.com.au","NO","NO","NO","NO","NO","-","CBD","Urban","Short rural","Long rural",null,"NO","Amadeus"]
[null,"APA GasNet","APA GasNet Australia (Operations) Pty Ltd","065083009","Vic","Gas","Transmission","Weighted average price cap","Calendar","December",5,5,"x",null,"Level 19, HSBC Building","580 George Street","SYDNEY","NSW",2000,"PO Box R41",null,"ROYAL EXCHANGE","NSW",1225,"Alexandra Curran","02 9275 0020","alexandra.curran@apa.com.au","NO","NO","NO","NO","NO","-","CBD","Urban","Short rural","Long rural",null,"NO","APA GasNet"]
[null,"Ausgrid","Ausgrid",78508211731,"NSW","Electricity","Distribution","Revenue cap","Financial","June",5,5,5,"2014-19 Distribution Determination","570 George St",null,"SYDNEY","NSW",2000,"GPO Box 4009",null,"SYDNEY","NSW",2001,"John Thomson","02 9269 2312","john.thomson@ausgrid.com.au","YES","YES","YES","YES","NO","NO","CBD","Urban","Short rural","Long rural",null,"YES","Ausgrid"]
[null,"Ausgrid (Tx Assets)","Ausgrid (Tx Assets)",67505337385,"NSW","Electricity","Distribution","Revenue cap","Financial","June",5,5,5,"distribution determination","570 George St",null,"SYDNEY","NSW",2000,"GPO Box 4009",null,"SYDNEY","NSW",2001,"John Thomson","02 9269 2312","john.thomson@ausgrid.com.au","YES","YES","YES","YES","NO","NO","CBD","Urban","Short rural","Long rural",null,"NO","Ausgrid (Tx Assets)"]
[null,"AusNet (D)","AusNet Electricity Services Pty Ltd",91064651118,"Vic","Electricity","Distribution","Revenue cap","Calendar","December",5,5,2,"2016-20 Distribution Determination","Level 32","2 Southbank Boulevard","SOUTHBANK","Vic",3006,"Locked Bag 14051",null,"MELBOURNE CITY MAIL CENTRE","VIC",8001,"please provide contact details",null,null,"NO","YES","YES","YES","NO","YES","CBD","Urban","Short rural","Long rural",null,"YES","AusNet (D)"]
[null,"AusNet (Gas)","AusNet Gas Services","086015036","Vic","Gas","Distribution","Weighted average price cap","Calendar","December",5,5,"X",null,"Level 19, HSBC Building","580 George Street","SYDNEY","NSW",2000,"PO Box R41",null,"ROYAL EXCHANGE","NSW",1225,"Alexandra Curran","02 9275 0020","alexandra.curran@apa.com.au","NO","NO","NO","NO","NO","-","CBD","Urban","Short rural","Long rural",null,"NO","AusNet (Gas)"]
[null,"AusNet (T)","Ausnet Services (Transmission) Ltd",48116124362,"Vic","Electricity","Transmission","Revenue cap","Financial","March",5,5,2,"transmission determination","Level 32","2 Southbank Boulevard","SOUTHBANK","Vic",3006,"Locked Bag 14051",null,"MELBOURNE CITY MAIL CENTRE","Vic",8001,"Clare Thompson","03 9695 6670","clare.e.thompson@ausnetservices.com.au","NO","NO","NO","NO","NO","-","CBD","Urban","Short rural","Long rural",null,"NO","AusNet (T)"]
[null,"Australian Distribution Co.","Australian Distribution Co.",11222333444,"-","Electricity","Distribution","Revenue cap","Financial","June",5,5,2,"distribution determination","123 Straight Street",null,"SYDNEY","NSW",2000,"PO Box 123",null,"SYDNEY","NSW",2000,"Bob Smith","02 1234 5678","bob@auselec.net.au","YES","YES","YES","YES","NO","NO","CBD","Urban","Short rural","Long rural",null,"YES","Australian Distribution Co."]
[null,"Australian Distribution Co. (Gas)","Australian Gas Distribution Co. ",11222333444,"NSW","Gas","Distribution","Weighted average price cap","Financial","June",5,5,null,null,"123 Straight Street",null,"SYDNEY","NSW",2000,"PO Box 123",null,"SYDNEY","NSW",2000,"Bob Smith","02 1234 5678","bob@auselec.net.au","NO","NO","NO","NO","NO","-","CBD","Urban","Short rural","Long rural",null,"NO","Australian Distribution Co. (Vic)"]
[null,"Australian Distribution Co. (Vic)","Australian Distribution Co. (Victoria)",11222333444,"Vic","Electricity","Distribution","Revenue cap","Calendar","December",5,5,2,"distribution determination","123 Straight Street",null,"MELBOURNE","Vic",3000,"PO Box 123",null,"MELBOURNE","VIC",3000,"Bob Smith","02 1234 5678","bob@auselec.net.au","NO","NO","NO","NO","NO","YES","CBD","Urban","Short rural","Long rural",null,"YES","Australian Distribution Co. (Vic)"]
[null,"Australian Transmission Co.","Australian Transmission Co.",11222333444,"-","Electricity","Transmission","Revenue cap","Financial","June",5,5,5,"transmission determination","123 Straight Street",null,"SYDNEY","NSW",2000,"PO Box 123",null,"SYDNEY","NSW",2000,"Bob Smith","02 1234 5678","bob@auselec.net.au","NO","NO","NO","NO","NO","-","CBD","Urban","Short rural","Long rural",null,"NO","Australian Transmission Co."]
[null,"Central Ranges Pipeline (D)","Central Ranges Pipeline Pty Ltd",108218355,"NSW","Gas","Distribution","Weighted average price cap","Financial","June",15,5,5,"distribution determination","Level 19","580 George Street","SYDNEY","NSW",2000,"PO Box R41",null,"ROYAL EXCHANGE","NSW",1225,"Scott Young","02 9275 0031","scott.young@apa.com.au","NO","NO","NO","NO","NO","-","CBD","Urban","Short rural","Long rural",null,"NO"]
[null,"Central Ranges Pipeline (T)","Central Ranges Pipeline Pty Ltd",108218355,"NSW","Gas","Distribution","Weighted average price cap","Financial","June",14,5,5,"transmission determination","Level 19","580 George Street","SYDNEY","NSW",2000,"PO Box R41",null,"ROYAL EXCHANGE","NSW",1225,"Scott Young","02 9275 0031","scott.young@apa.com.au","NO","NO","NO","NO","NO","-","CBD","Urban","Short rural","Long rural",null,"NO"]
[null,"CitiPower","CitiPower",76064651056,"Vic","Electricity","Distribution","Revenue cap","Calendar","December",5,5,2,"2016-20 Distribution Determination","40 Market Street",null,"MELBOURNE","Vic",3000,"Locked Bag 14090",null,"MELBOURNE","VIC",8001,"Hannah Williams","03 9683 4088","hwilliams@powercor.com.au","YES","YES","NO","NO","NO","YES","CBD","Urban","Short rural","Long rural",null,"YES","CitiPower"]
[null,"Directlink","Directlink",16779340889,"Qld","Electricity","Transmission","Revenue cap","Financial","June",5,5,5,"transmission determination","Level 19, HSBC Building","580 George Street","SYDNEY","NSW",2000,"PO Box R41",null,"ROYAL EXCHANGE","NSW",1225,"Scott Young","02 9275 0031","scott.young@apa.com.au","NO","NO","NO","NO","NO","-","CBD","Urban","Short rural","Long rural",null,"NO","Directlink"]
[null,"ElectraNet","ElectraNet",41094482416,"SA","Electricity","Transmission","Revenue cap","Financial","June",5,5,5,"transmission determination","52-55 East Terrace","Rymill Park","ADELAIDE","SA",5000,"PO Box 7096","Hutt Street Post Office","ADELAIDE","SA",5000,"Bill Jackson","08 8404 7969","jackson.bill@electranet.com.au","NO","NO","NO","NO","NO","-","CBD","Urban","Short rural","Long rural",null,"NO","ElectraNet"]
[null,"Endeavour Energy","Endeavour Energy",11247365823,"NSW","Electricity","Distribution","Revenue cap","Financial","June",5,5,5,"2014-19 Distribution Determination","51 Huntingwood Drive",null,"HUNTINGWOOD","NSW",2148,"PO Box 811",null,"SEVEN HILLS","NSW",1730,"Jon Hocking","02 9853 4386 / 0407 348 156","Jon.Hocking@Endeavourenergy.com.au","NO","YES","YES","YES","NO","NO","CBD","Urban","Short rural","Long rural",null,"YES","Endeavour Energy"]
[null,"Energex","Energex",40078849055,"Qld","Electricity","Distribution","Revenue cap","Financial","June",5,5,5,"2015-20 Distribution Determination","26 Reddacliff Street",null,"NEWSTEAD","Qld",4006,"26 Reddacliff Street",null,"NEWSTEAD","QLD",4006,"Jenny Doyle, Group Manager Regulatory Affairs","(07) 3851 6416","jenny.doyle@ergon.com.au","YES","YES","YES","NO","NO","NO","CBD","Urban","Short rural","Long rural",null,"YES","Energex"]
[null,"Ergon Energy","Ergon Energy",50087646062,"Qld","Electricity","Distribution","Revenue cap","Financial","June",5,5,5,"2015-20 Distribution Determination","22 Walker Street",null,"TOWNSVILLE","Qld",4810,"Po Box 264",null,"FORTITUDE VALLEY","QLD",4006,"Jenny Doyle, Group Manager Regulatory Affairs","(07) 3851 6416","jenny.doyle@ergon.com.au","NO","YES","YES","YES","NO","NO","CBD","Urban","Short rural","Long rural",null,"YES","Ergon Energy"]
[null,"Essential Energy","Essential Energy",37428185226,"NSW","Electricity","Distribution","Revenue cap","Financial","June",5,5,5,"2014-19 Distribution Determination","8 Buller Street",null,"PORT MACQUARIE","NSW",2444,"PO Box 5730",null,"PORT MACQUARIE","NSW",2444,"Catherine Waddell","02 6338 3553","catherine.waddell@essentialenergy.com.au","NO","NO","YES","YES","NO","NO","CBD","Urban","Short rural","Long rural",null,"YES","Essential Energy"]
[null,"Jemena Electricity","Jemena Electricity",82064651083,"Vic","Electricity","Distribution","Revenue cap","Calendar","December",5,5,2,"2016-20 Distribution Determination","Level 16","567 Collins Street","MELBOURNE","VIC",3000,"PO Box 16182",null,"MELBOURNE","VIC",8001,"Matthew Serpell","03 9173 8231","matthew.serpell@jemena.com.au","NO","YES","YES","NO","NO","YES","CBD","Urban","Short rural","Long rural",null,"YES","Jemena Electricity"]
[null,"JGN","Jemena Gas Networks (NSW) Ltd","003 004 322","NSW","Gas","Distribution","Weighted average price cap","Financial","June",5,5,null,null,null,null,null,null,null,null,null,null,null,null,"please provide contact details",null,null,"NO","NO","NO","NO","NO","-","CBD","Urban","Short rural","Long rural",null,"NO","JGN"]
[null,"Multinet Gas","Multinet Gas (DB No.1) Pty Ltd (ACN 086 026 986), Multinet Gas (DB No.2) Pty Ltd (ACN 086 230 122)","086026986","Vic","Gas","Distribution","Weighted average price cap","Calendar","December",5,5,"x",null,"43-45 Centreway",null,"MT WAVERLEY","Vic",3149,null,null,null,null,null,"Andrew Schille","03 8846 9860","andrew.schille@ue.com.au","NO","NO","NO","NO","NO","-","CBD","Urban","Short rural","Long rural",null,"NO","Multinet Gas"]
[null,"Murraylink","Murraylink",79181207909,"SA","Electricity","Transmission","Revenue cap","Financial","June",5,5,5,"transmission determination","Level 19","580 George Street","SYDNEY","NSW",2000,"PO Box R41",null,"ROYAL EXCHANGE","NSW",1225,"Scott Young","02 9275 0031","scott.young@apa.com.au","NO","NO","NO","NO","NO","-","CBD","Urban","Short rural","Long rural",null,"NO","Murraylink"]
[null,"Power and Water","Power and Water Corporation",15947352360,"NT","Electricity","Distribution","Revenue cap","Financial","June",5,5,"x","distribution determination","GPO Box 1921",null,"DARWIN","NT",801,"GPO Box 1921",null,"DARWIN","NT",801,"Lucy Moon","08 8924 5822","Lucy.Moon@powerwater.com.au","YES","YES","YES","YES","NO","NO","CBD","Urban","Short rural","Long rural",null,"NO","Power and Water"]
[null,"Powercor Australia","Powercor Australia",89064651109,"Vic","Electricity","Distribution","Revenue cap","Calendar","December",5,5,2,"2016-20 Distribution Determination","40 Market Street",null,"MELBOURNE","Vic",3000,"Locked bag 14090",null,"MELBOURNE","VIC",8001,"Hannah Williams","03 9683 4088","hwilliams@powercor.com.au","NO","NO","YES","YES","NO","YES","CBD","Urban","Short rural","Long rural",null,"YES","Powercor Australia"]
[null,"Powerlink","Queensland Electricity Transmission Corporation Limited trading as Powerlink Queensland",82078849233,"Qld","Electricity","Transmission","Revenue cap","Financial","June",5,5,5,"transmission determination","33 Harold St",null,"VIRGINIA","Qld",4014,"PO Box 1193",null,"VIRGINIA","QLD",4014,"Jennifer Harris","07 3860 2667","jharris@powerlink.com.au","NO","NO","NO","NO","NO","-","CBD","Urban","Short rural","Long rural",null,"NO","Powerlink"]
[null,"Roma to Brisbane Pipeline","APT Petroleum Pipelines Limited t/a Roma to Brisbane Pipeline","009 737 393","Qld","Gas","Transmission","Weighted average price cap","Financial","June",5,5,"x","n/a","580 George Street",null,"SYDNEY","NSW",2000,"PO Box R41",null,"ROYAL EXCHANGE","NSW",1225,"Mark Allen","02 9275 0010","mark.allen@apa.com.au","NO","NO","NO","NO","NO","-","CBD","Urban","Short rural","Long rural",null,"NO","Roma to Brisbane Pipeline"]
[null,"SA Power Networks","SA Power Networks",13332330749,"SA","Electricity","Distribution","Revenue cap","Financial","June",5,5,5,"2015-20 Distribution Determination","1 Anzac Highway",null,"KESWICK","SA",5035,"GPO Box 77",null,"ADELAIDE","SA",5000,"Richard Sibly","08 8404 5613","richard.sibly@sapowernetworks.com.au","NO","NO","YES","YES","NO","NO","CBD","Urban","Short rural","Long rural",null,"NO","SA Power Networks"]
[null,"TasNetworks (D)","TasNetworks (D)",24167357299,"Tas","Electricity","Distribution","Revenue cap","Financial","June",5,5,5,"distribution determination","1-7 Maria Street",null,"LENAH VALLEY","Tas",7008,"PO Box 606",null,"MOONAH","Tas",7009,"John Sayers","03 6271 6469","john.sayers@tasnetworks.com.au","YES","YES","YES","YES","YES","NO","Critical Infrastructure","High density commercial","Urban","High density rural","Low density rural","YES","TasNetworks (D)"]
[null,"TasNetworks (T)","TasNetworks (T)",24167357299,"Tas","Electricity","Transmission","Revenue cap","Financial","June",5,5,5,"transmission determination","1-7 Maria Street",null,"LENAH VALLEY","Tas",7008,"PO Box 606",null,"MOONAH","Tas",7009,"John Sayers","03 6271 6469","john.sayers@tasnetworks.com.au","NO","NO","NO","NO","NO","-","CBD","Urban","Short rural","Long rural",null,"NO","TasNetworks (T)"]
[null,"TransGrid","NSW Electricity Networks Operations Pty Ltd trading as TransGrid","70 250 995 390","NSW","Electricity","Transmission","Revenue cap","Financial","June",4,5,5,"transmission determination","180 Thomas Street",null,"SYDNEY","NSW",2000,"PO Box A1000",null,"SYDNEY SOUTH","NSW",1235,"Garrie Chubb","0408 210 221","garrie.chubb@transgrid.com.au","NO","NO","NO","NO","NO","-","CBD","Urban","Short rural","Long rural",null,"NO","TransGrid"]
[null,"United Energy","United Energy",70064651029,"Vic","Electricity","Distribution","Revenue cap","Calendar","December",5,5,2,"2016-20 Distribution Determination","Level 3","6 Nexus Court","MULGRAVE","Vic",3149,"PO Box 449",null,"MOUNT WAVERLEY","VIC",3170,"Mathew Abraham","03 8846 9758","mathew.abraham@ue.com.au","NO","NO","YES","NO","NO","YES","CBD","Urban","Short rural","Long rural",null,"YES","United Energy"]
[]
[]
[null,null,null,null,null,null,null,null,null,null,null,null,null,null,null,null,null,null,null,null,null,null,null,null,null,"For EB & Reset RINs only",null,null,null,null,"For AARs only"]
[null,"The Reg Year Ending (dms_RYE) must be set to the last year of the regulatory period. For forecast data is is usually (FRCP_y5) for actual it is a single year (CRY). For historical actual data the RYE will need to be set manually in the business details sheet by setting the dms_Multiyear_flag to 1 and putting the correct value in 'dms_Specified_FinalYear. See cells C67:C68",null,null,null,null,null,null,null,null,null,null,null,"Drop down selector box for CA & Reset RINs.","For CA & Reset RINs only",null,null,null,null,null,null,null,null,null,null,"for DNSP only",null,null,null,null,"For DNSPs only"]
[null,"dms_Model_List ","dms_Worksheet_List",null,"dms_RYE_Formula_Result",null,null,null,null,null,null,null,null,"dms_0203_ProjectType","dms_020303_01_UOM","dms_020501_01_UOM","dms_020501_02_UOM","dms_020501_03_UOM","dms_020501_04_UOM","dms_020603_01_UOM","dms_020701_01_UOM","dms_020701_02_UOM","dms_020701_01_Rows","dms_040102_01_UOM","dms_040102_04_UOM","dms_030601_01_UOM","dms_030601_02_UOM","dms_030701_01_UOM","dms_030702_01_UOM","dms_030703_01_UOM","dms_030605_UOM","dms_03060703_UOM"]
[null,"ARR","ANNUAL REPORTING STATEMENT",null,{"$f":"LEFT(dms_SingleYear_FinalYear_Result,2)&RIGHT(dms_SingleYear_FinalYear_Result,2)","v":"2006"},"=LEFT(dms_SingleYear_FinalYear_Result,2)&RIGHT(dms_SingleYear_FinalYear_Result,2)",null,"Formula errors are OK",null,null,null,null,null,"New line on new route - single circuit","Circuit line length in km","0's","0's","0's","0's","0's","km","km","Route line length within zone","0's","days","minutes/customer","minutes/customer","Customer / km","%","km","number","number"]
[null,"CA","CATEGORY ANALYSIS",null,{"$f":"LEFT(dms_SingleYear_FinalYear_Result,2)&RIGHT(dms_SingleYear_FinalYear_Result,2)","v":"2006"},"=LEFT(dms_SingleYear_FinalYear_Result,2)&RIGHT(dms_SingleYear_FinalYear_Result,2)",null,"Formula errors are OK",null,null,null,null,null,"New line on new route - dual circuit","Circuit line length in km","0's","0's","0's","0's","0's","0's","0's","Number of maintenance spans","0's","0's","minutes/customer","minutes/customer","MWh/customer","Number of spans",null,"number","number"]
[null,"CESS","CAPITLAL EXPENDITURE SHARING SCHEMING",null,"2016","=LEFT(dms_SingleYear_FinalYear_Result,2)&RIGHT(dms_SingleYear_FinalYear_Result,2)",null,null,null,null,null,null,null,"New line on new route - other","Circuit line length in km","MVA added","MVA added","MVA added","MVA added","0's","km","km","Total length of maintenance spans","0's","$0s","interruptions/customer","interruptions/customer","kVA / customer","Number of spans",null,"number","number"]
[null,"CPI","CPI",null,null,null,null,null,null,null,null,null,null,"Line rebuild over existing route - single circuit","Circuit line length in km","0's","0's","0's","0's","0's","km","km","Length of vegetation corridors","$0s","0's","interruptions/customer","interruptions/customer",null,"Number of spans",null,"number","number"]
[null,"EB","ECONOMIC BENCHMARKING",null,{"$f":"LEFT(dms_SingleYear_FinalYear_Result,2)&RIGHT(dms_SingleYear_FinalYear_Result,2)","v":"2006"},"=LEFT(dms_SingleYear_FinalYear_Result,2)&RIGHT(dms_SingleYear_FinalYear_Result,2)",null,"Formula errors are OK",null,null,null,null,null,"Line rebuild over existing route - dual circuit","Number","total spend $0s","total spend $0s","total spend $0s","total spend $0s","(per cent)","0's","0's","Average number of trees per maintenance span",null,null,null,null,null,"Number of spans",null,"number","(per cent)"]
[null,"PTRM","POST TAX REVENUE MODEL",null,{"$f":"LEFT(dms_MultiYear_FinalYear_Result,2)&RIGHT(dms_MultiYear_FinalYear_Result,2)","v":"2018"},"=LEFT(dms_MultiYear_FinalYear_Result,2)&RIGHT(dms_MultiYear_FinalYear_Result,2)",null,null,null,null,null,null,null,"Reconductor - Single circuit","Number","net circuit km added","net circuit km added","net circuit km added","net circuit km added",null,"years","years","Average frequency of cutting cycle",null,null,null,null,null,"Years",null,"number"]
[null,"Reset","REGULATORY REPORTING STATEMENT",null,{"$f":"LEFT(dms_MultiYear_FinalYear_Result,2)&RIGHT(dms_MultiYear_FinalYear_Result,2)","v":"2018"},"=LEFT(dms_MultiYear_FinalYear_Result,2)&RIGHT(dms_MultiYear_FinalYear_Result,2)",null,"Formula errors are OK",null,null,null,null,null,"Reconductor - Dual circuit","Number","total spend $0s","total spend $0s","total spend $0s","total spend $0s",null,null,null,null,null,null,null,null,null,"Years",null,"number"]
[null,"RFM","ROLL FORWARD MODEL",null,{"$f":"LEFT(dms_CRCP_FinalYear_Result,2)&RIGHT(dms_CRCP_FinalYear_Result,2)","v":"2018"},"=LEFT(dms_CRCP_FinalYear_Result,2)&RIGHT(dms_CRCP_FinalYear_Result,2)",null,null,null,null,null,null,null,"Other",null,"net circuit km added","net circuit km added","net circuit km added","net circuit km added",null,null,null,null,null,null,null,null,null,"Trees",null,"number"]
[null,"WACC","WEIGHTED AVERAGE COST OF CAPITAL",null,{"$f":"LEFT(dms_MultiYear_FinalYear_Result,2)&RIGHT(dms_MultiYear_FinalYear_Result,2)","v":"2018"},"=LEFT(dms_MultiYear_FinalYear_Result,2)&RIGHT(dms_MultiYear_FinalYear_Result,2)",null,null,null,null,null,null,null,null,null,"total spend $0s","total spend $0s","total spend $0s","total spend $0s",null,null,null,null,null,null,null,null,null,"Trees",null,"number"]
[null,null,null,null,null,null,null,null,null,null,null,null,null,null,null,"0's",null,"$0s",null,null,null,null,null,null,null,null,null,null,"Defects",null,"number"]
[null,"dms_DataQuality_List",null,null,null,null,null,null,null,null,null,null,null,null,null,"0's",null,null,null,null,null,null,null,null,null,null,null,null,"Defects",null,"number"]
[null,"Actual",null,null,null,null,null,null,null,null,null,null,null,null,null,"0's",null,null,null,null,null,null,null,null,null,null,null,null,"Spans",null,"number"]
[null,"Estimate",null,null,null,null,null,null,null,null,null,null,null,null,null,"$0s",null,null,null,null,null,null,null,null,null,null,null,null,"km",null,"(per cent)"]
[null,"Consolidated",null,null,null,null,null,null,null,null,null,null,null,null,null,null,null,null,null,null,null,null,null,null,null,null,null,null,"Spans",null,"(per cent)",""]
[null,"Recast"]
[null,"Public"]
[null,null,null,null,null,null,null,null,null,null,null,null,null,null,"For PTRM files - this field set the text for the named range \"DMS_Xfactor\" which in all cases is simply the text \"x factors\" - this saves putting in each old gas PTRM file ",null,null,null,null,null,null,null,null,null,null,"for TNSP only"]
[null,"For all files either AER or business needs to be able to specify the type of submission","For PTRM & RFM templates we must provide a choice in case they change their form of control - otherwise it is drawn from the business specific lookup table above.",null,null,null,null,null,null,null,null,null,null,null,"DMS_Xfactor",null,null,null,null,null,null,null,null,null,null,"dms_030601_01_UOM",null,"dms_030701_01_UOM","dms_030702_01_UOM"]
[null,"dms_SourceList","dms_FormControl_Choices",null,null,null,null,null,null,null,null,null,null,null,"x factors",null,null,null,null,null,null,null,null,null,null,"%",null,"Number of spans","km"]
[null,"After appeal","Revenue cap",null,null,null,null,null,null,null,null,null,null,null,null,null,null,null,null,null,null,null,null,null,null,"number",null,"Years","%"]
[null,"Draft decision","Revenue yield",null,null,null,null,null,null,null,null,null,null,null,null,null,null,null,null,null,null,null,null,null,null,"number",null,"Trees","km"]
[null,"Final decision","Weighted average price cap",null,null,null,null,null,null,null,null,null,null,null,null,null,null,null,null,null,null,null,null,null,null,"%",null,"Defects","number"]
[null,"PTRM update 1",null,null,null,null,null,null,null,null,null,null,null,null,null,null,null,null,null,null,null,null,null,null,null,"number",null,"Number of spans"]
[null,"PTRM update 2",null,null,null,null,null,null,null,null,null,null,null,null,null,null,null,null,null,null,null,null,null,null,null,"number",null,"km"]
[null,"PTRM update 3",null,null,null,null,null,null,null,null,null,null,null,null,null,null,null,null,null,null,null,null,null,null,null,"%",null,"km"]
[null,"PTRM update 4",null,null,null,null,null,null,null,null,null,null,null,null,null,null,null,null,null,null,null,null,null,null,null,"number",null,"Number of spans"]
[null,"PTRM update 5",null,null,null,null,null,null,null,null,null,null,null,null,null,null,null,null,null,null,null,null,null,null,null,"number"]
[null,"PTRM update 6",null,null,null,null,null,null,null,null,null,null,null,null,null,null,null,null,null,null,null,null,null,null,null,"%"]
[null,"PTRM update 7",null,null,null,null,null,null,null,null,null,null,null,null,null,null,null,null,null,null,null,null,null,null,null,"number"]
[null,"Regulatory proposal",null,null,null,null,null,null,null,null,null,null,null,null,null,null,null,null,null,null,null,null,null,null,null,"%"]
[null,"Reporting",null,null,null,null,null,null,null,null,null,null,null,null,null,null,null,null,null,null,null,null,null,null,null,"number"]
[null,"Revised regulatory proposal",null,null,null,null,null,null,null,null,null,null,null,null,null,null,null,null,null,null,null,null,null,null,null,"%"]
[null,null,null,null,null,null,null,null,null,null,null,null,null,null,null,null,null,null,null,null,null,null,null,null,null,"number"]
[]
[]
[]
[null,"Reason for interruption","dms_Reason_Interruption_Detailed","dms_Reason_Interruption","dms_STPIS_Exclusion_List","dms_020301_ProjectType_List","dms_020302_ProjectType_List"]
[null,"Animal","Animal impact","Animal","Weather","New substation establishment","New line on new route - single circuit"]
[null,null,"Animal nesting/burrowing, etc and other","Asset failure","Equipment failure","Capacity upgrade","New line on new route - dual circuit"]
[null,null,"Other","Other","Operational error","Voltage upgrade","New line on new route - other"]
[null,"Asset failure","LV","Overloads","Vegetation","Other","Line rebuild over existing route - single circuit"]
[null,null,"Distribution substation","Planned","Animals",null,"Line rebuild over existing route - dual circuit"]
[null,null,"HV","Network business","Third party impacts",null,"Reconductor - Single circuit"]
[null,null,"Zone substation","Third party","Transmission failure",null,"Reconductor - Dual circuit"]
[null,null,"Subtransmission","Unknown","Load shedding",null,"Reconductor - Other"]
[null,"Other","insert description of 'other'","Vegetation","Inter-distributor connection failure",null,"Line upgrade - raising/retensoring"]
[null,"Overloads","-","Weather","Other",null,"Line upgrade - voltage upgrade"]
[null,"Planned","-","2 - STPIS Exclusion (3.3)(a)",null,null,"Line upgrade - capacity"]
[null,"Network business","Network error","3 - STPIS Exclusion (3.3)(a)",null,null,"String spare circuit"]
[null,null,"Switching and protection error","4 - STPIS Exclusion (3.3)(a)",null,null,"Other"]
[null,"Third party","Fire","5 - STPIS Exclusion (3.3)(a)"]
[null,null,"Other","6 - STPIS Exclusion (3.3)(a)"]
[null,null,"Dig-in","7 - STPIS Exclusion (3.3)(a)"]
[null,null,"Unauthorised access"]
[null,null,"Vehicle impact"]
[null,"Unknown","Unknown"]
[null,"Vegetation","Blow-in/Fall-in - NSP responsibility"]
[null,null,"Grow-in - NSP responsibility"]
[null,null,"Blow-in/Fall-in - Other responsible party"]
[null,null,"Grow-in - Other responsible party"]
[null,"Weather"]
[null,"2 - STPIS Exclusion (3.3)(a)"]
[null,"3 - STPIS Exclusion (3.3)(a)"]
[null,"4 - STPIS Exclusion (3.3)(a)"]
[null,"5 - STPIS Exclusion (3.3)(a)"]
[null,"6 - STPIS Exclusion (3.3)(a)"]
[null,"7 - STPIS Exclusion (3.3)(a)"]
[]
[]
[]
[]
[]
[]
[]
[null,"These are indeces and lookup values for various dates. All step from the value placed in FRCP_y1 on the business and other details worksheet",{"$f":"IF(dms_FifthFeeder_flag_NSP=\"NO\",\"This NSP has only 4 feeder categories\",\"This NSP has 5 feeder categories\")","v":"This NSP has only 4 feeder categories"},null,null,null,null,null,null,null,null,null,null,null,"These date tables are currently used in the Recast templates to provide column headings and conditional formatting"]
[null,"dms_FRCPlength_Num_List","dms_FinalYear_List","dms_CRCPlength_Num_List","dms_CFinalYear_List","dms_FRCP_years",null,"dms_CRCP_years",null,"dms_CRCP_index",null,"dms_Financial_Years","dms_Calendar_Years",null,"CRY from input cell on business sheet","CRY - financial","dms_FinYears","CRY calendar","dms_CalYears"]
[null,1,"dms_FRCP_y1",1,"CRCP_y1",{"$f":"FRCP_y1","v":"2020-21"},"dms_FRCP_y1",{"$f":"IF(dms_RPT=\"financial\",VALUE(LEFT(dms_FRCP_y1,4)-1)&\"-\"&TEXT(VALUE(MID(dms_FRCP_y1,3,2)),\"00\"),VALUE(LEFT(dms_FRCP_y1,4)-1))","v":"2019-20"},"dms_CRCP_yZ",1,null,"2005-06","2006",null,{"$f":"CRY","v":"2005-06"},{"$f":"VALUE(LEFT(CRY,4))&\"-\"&TEXT(MID(CRY,3,2)+1,\"00\")","v":"2005-06"},"dms_CRYf_y1",{"$f":"VALUE(LEFT(CRY,4)+1)","v":2006},"dms_CRYc_y1"]
[null,2,"dms_FRCP_y2",2,"CRCP_y2",{"$f":"IF(dms_RPT=\"financial\",VALUE(LEFT(dms_FRCP_y1,4)+1)&\"-\"&TEXT(VALUE(RIGHT(dms_FRCP_y1,2)+1),\"00\"),VALUE(LEFT(dms_FRCP_y1,4)+1))","v":"2021-22"},"dms_FRCP_y2",{"$f":"IF(dms_RPT=\"financial\",VALUE(LEFT(dms_CRCP_yZ,4)-1)&\"-\"&TEXT(VALUE(MID(dms_CRCP_yZ,3,2)),\"00\"),VALUE(LEFT(dms_CRCP_yZ,4)-1))","v":"2018-19"},"dms_CRCP_yY",2,null,"2006-07","2007",null,null,{"$f":"VALUE(LEFT(dms_CRYf_y1,4)+1)&\"-\"&TEXT(MID(dms_CRYf_y1,3,2)+2,\"00\")","v":"2006-07"},"dms_CRYf_y2",{"$f":"VALUE(LEFT(dms_CRYc_y1,4)+1)","v":2007},"dms_CRYc_y2"]
[null,3,"dms_FRCP_y3",3,"CRCP_y3",{"$f":"IF(dms_RPT=\"financial\",VALUE(LEFT(dms_FRCP_y2,4)+1)&\"-\"&TEXT(VALUE(RIGHT(dms_FRCP_y2,2)+1),\"00\"),VALUE(LEFT(dms_FRCP_y2,4)+1))","v":"2022-23"},"dms_FRCP_y3",{"$f":"IF(dms_RPT=\"financial\",VALUE(LEFT(dms_CRCP_yY,4)-1)&\"-\"&TEXT(VALUE(MID(dms_CRCP_yY,3,2)),\"00\"),VALUE(LEFT(dms_CRCP_yY,4)-1))","v":"2017-18"},"dms_CRCP_yX",3,null,"2007-08","2008",null,null,{"$f":"VALUE(LEFT(dms_CRYf_y2,4)+1)&\"-\"&TEXT(MID(dms_CRYf_y2,3,2)+2,\"00\")","v":"2007-08"},"dms_CRYf_y3",{"$f":"VALUE(LEFT(dms_CRYc_y2,4)+1)","v":2008},"dms_CRYc_y3"]
[null,4,"dms_FRCP_y4",4,"CRCP_y4",{"$f":"IF(dms_RPT=\"financial\",VALUE(LEFT(dms_FRCP_y3,4)+1)&\"-\"&TEXT(VALUE(RIGHT(dms_FRCP_y3,2)+1),\"00\"),VALUE(LEFT(dms_FRCP_y3,4)+1))","v":"2023-24"},"dms_FRCP_y4",{"$f":"IF(dms_RPT=\"financial\",VALUE(LEFT(dms_CRCP_yX,4)-1)&\"-\"&TEXT(VALUE(MID(dms_CRCP_yX,3,2)),\"00\"),VALUE(LEFT(dms_CRCP_yX,4)-1))","v":"2016-17"},"dms_CRCP_yW",4,null,"2008-09","2009",null,null,{"$f":"VALUE(LEFT(dms_CRYf_y3,4)+1)&\"-\"&TEXT(MID(dms_CRYf_y3,3,2)+2,\"00\")","v":"2008-09"},"dms_CRYf_y4",{"$f":"VALUE(LEFT(dms_CRYc_y3,4)+1)","v":2009},"dms_CRYc_y4"]
[null,5,"dms_FRCP_y5",5,"CRCP_y5",{"$f":"IF(dms_RPT=\"financial\",VALUE(LEFT(dms_FRCP_y4,4)+1)&\"-\"&TEXT(VALUE(RIGHT(dms_FRCP_y4,2)+1),\"00\"),VALUE(LEFT(dms_FRCP_y4,4)+1))","v":"2024-25"},"dms_FRCP_y5",{"$f":"IF(dms_RPT=\"financial\",VALUE(LEFT(dms_CRCP_yW,4)-1)&\"-\"&TEXT(VALUE(MID(dms_CRCP_yW,3,2)),\"00\"),VALUE(LEFT(dms_CRCP_yW,4)-1))","v":"2015-16"},"dms_CRCP_yV",5,null,"2009-10",2010,null,null,{"$f":"VALUE(LEFT(dms_CRYf_y4,4)+1)&\"-\"&TEXT(MID(dms_CRYf_y4,3,2)+2,\"00\")","v":"2009-10"},"dms_CRYf_y5",{"$f":"VALUE(LEFT(dms_CRYc_y4,4)+1)","v":2010},"dms_CRYc_y5"]
[null,6,"dms_FRCP_y6",6,"CRCP_y6",{"$f":"IF(dms_RPT=\"financial\",VALUE(LEFT(dms_FRCP_y5,4)+1)&\"-\"&TEXT(VALUE(RIGHT(dms_FRCP_y5,2)+1),\"00\"),VALUE(LEFT(dms_FRCP_y5,4)+1))","v":"2025-26"},"dms_FRCP_y6",{"$f":"IF(dms_RPT=\"financial\",VALUE(LEFT(dms_CRCP_yV,4)-1)&\"-\"&TEXT(VALUE(MID(dms_CRCP_yV,3,2)),\"00\"),VALUE(LEFT(dms_CRCP_yV,4)-1))","v":"2014-15"},"dms_CRCP_yU",6,null,"2010-11",2011,null,null,{"$f":"VALUE(LEFT(dms_CRYf_y5,4)+1)&\"-\"&TEXT(MID(dms_CRYf_y5,3,2)+2,\"00\")","v":"2010-11"},"dms_CRYf_y6",{"$f":"VALUE(LEFT(dms_CRYc_y5,4)+1)","v":2011},"dms_CRYc_y6"]
[null,7,"dms_FRCP_y7",7,"CRCP_y7",{"$f":"IF(dms_RPT=\"financial\",VALUE(LEFT(dms_FRCP_y6,4)+1)&\"-\"&TEXT(VALUE(RIGHT(dms_FRCP_y6,2)+1),\"00\"),VALUE(LEFT(dms_FRCP_y6,4)+1))","v":"2026-27"},"dms_FRCP_y7",{"$f":"IF(dms_RPT=\"financial\",VALUE(LEFT(dms_CRCP_yU,4)-1)&\"-\"&TEXT(VALUE(MID(dms_CRCP_yU,3,2)),\"00\"),VALUE(LEFT(dms_CRCP_yU,4)-1))","v":"2013-14"},"dms_CRCP_yT",7,null,"2011-12",2012,null,null,{"$f":"VALUE(LEFT(dms_CRYf_y6,4)+1)&\"-\"&TEXT(MID(dms_CRYf_y6,3,2)+2,\"00\")","v":"2011-12"},"dms_CRYf_y7",{"$f":"VALUE(LEFT(dms_CRYc_y6,4)+1)","v":2012},"dms_CRYc_y7"]
[null,8,"dms_FRCP_y8",8,"CRCP_y8",{"$f":"IF(dms_RPT=\"financial\",VALUE(LEFT(dms_FRCP_y7,4)+1)&\"-\"&TEXT(VALUE(RIGHT(dms_FRCP_y7,2)+1),\"00\"),VALUE(LEFT(dms_FRCP_y7,4)+1))","v":"2027-28"},"dms_FRCP_y8",{"$f":"IF(dms_RPT=\"financial\",VALUE(LEFT(dms_CRCP_yT,4)-1)&\"-\"&TEXT(VALUE(MID(dms_CRCP_yT,3,2)),\"00\"),VALUE(LEFT(dms_CRCP_yT,4)-1))","v":"2012-13"},"dms_CRCP_yS",8,null,"2012-13",2013,null,null,{"$f":"VALUE(LEFT(dms_CRYf_y7,4)+1)&\"-\"&TEXT(MID(dms_CRYf_y7,3,2)+2,\"00\")","v":"2012-13"},"dms_CRYf_y8",{"$f":"VALUE(LEFT(dms_CRYc_y7,4)+1)","v":2013},"dms_CRYc_y8"]
[null,9,"dms_FRCP_y9",9,"CRCP_y9",{"$f":"IF(dms_RPT=\"financial\",VALUE(LEFT(dms_FRCP_y8,4)+1)&\"-\"&TEXT(VALUE(RIGHT(dms_FRCP_y8,2)+1),\"00\"),VALUE(LEFT(dms_FRCP_y8,4)+1))","v":"2028-29"},"dms_FRCP_y9",{"$f":"IF(dms_RPT=\"financial\",VALUE(LEFT(dms_CRCP_yS,4)-1)&\"-\"&TEXT(VALUE(MID(dms_CRCP_yS,3,2)),\"00\"),VALUE(LEFT(dms_CRCP_yS,4)-1))","v":"2011-12"},"dms_CRCP_yR",9,null,"2013-14",2014,null,null,{"$f":"VALUE(LEFT(dms_CRYf_y8,4)+1)&\"-\"&TEXT(MID(dms_CRYf_y8,3,2)+2,\"00\")","v":"2013-14"},"dms_CRYf_y9",{"$f":"VALUE(LEFT(dms_CRYc_y8,4)+1)","v":2014},"dms_CRYc_y9"]
[null,10,"dms_FRCP_y10",10,"CRCP_y10",{"$f":"IF(dms_RPT=\"financial\",VALUE(LEFT(dms_FRCP_y9,4)+1)&\"-\"&TEXT(VALUE(RIGHT(dms_FRCP_y9,2)+1),\"00\"),VALUE(LEFT(dms_FRCP_y9,4)+1))","v":"2029-30"},"dms_FRCP_y10",{"$f":"IF(dms_RPT=\"financial\",VALUE(LEFT(dms_CRCP_yR,4)-1)&\"-\"&TEXT(VALUE(MID(dms_CRCP_yR,3,2)),\"00\"),VALUE(LEFT(dms_CRCP_yR,4)-1))","v":"2010-11"},"dms_CRCP_yQ",10,null,"2014-15",2015,null,null,{"$f":"VALUE(LEFT(dms_CRYf_y9,4)+1)&\"-\"&TEXT(MID(dms_CRYf_y9,3,2)+2,\"00\")","v":"2014-15"},"dms_CRYf_y10",{"$f":"VALUE(LEFT(dms_CRYc_y9,4)+1)","v":2015},"dms_CRYc_y10"]
[null,11,"dms_FRCP_y11",11,"CRCP_y11",{"$f":"IF(dms_RPT=\"financial\",VALUE(LEFT(dms_FRCP_y10,4)+1)&\"-\"&TEXT(VALUE(RIGHT(dms_FRCP_y10,2)+1),\"00\"),VALUE(LEFT(dms_FRCP_y10,4)+1))","v":"2030-31"},"dms_FRCP_y11",{"$f":"IF(dms_RPT=\"financial\",VALUE(LEFT(dms_CRCP_yQ,4)-1)&\"-\"&TEXT(VALUE(MID(dms_CRCP_yQ,3,2)),\"00\"),VALUE(LEFT(dms_CRCP_yQ,4)-1))","v":"2009-10"},"dms_CRCP_yP",11,null,"2015-16",2016,null,null,{"$f":"VALUE(LEFT(dms_CRYf_y10,4)+1)&\"-\"&TEXT(MID(dms_CRYf_y10,3,2)+2,\"00\")","v":"2015-16"},"dms_CRYf_y11",{"$f":"VALUE(LEFT(dms_CRYc_y10,4)+1)","v":2016},"dms_CRYc_y11"]
[null,12,"dms_FRCP_y12",12,"CRCP_y12",{"$f":"IF(dms_RPT=\"financial\",VALUE(LEFT(dms_FRCP_y11,4)+1)&\"-\"&TEXT(VALUE(RIGHT(dms_FRCP_y11,2)+1),\"00\"),VALUE(LEFT(dms_FRCP_y11,4)+1))","v":"2031-32"},"dms_FRCP_y12",{"$f":"IF(dms_RPT=\"financial\",VALUE(LEFT(dms_CRCP_yP,4)-1)&\"-\"&TEXT(VALUE(MID(dms_CRCP_yP,3,2)),\"00\"),VALUE(LEFT(dms_CRCP_yP,4)-1))","v":"2008-09"},"dms_CRCP_yO",12,null,"2016-17",2017,null,null,{"$f":"VALUE(LEFT(dms_CRYf_y11,4)+1)&\"-\"&TEXT(MID(dms_CRYf_y11,3,2)+2,\"00\")","v":"2016-17"},"dms_CRYf_y12",{"$f":"VALUE(LEFT(dms_CRYc_y11,4)+1)","v":2017},"dms_CRYc_y12"]
[null,13,"dms_FRCP_y13",13,"CRCP_y13",{"$f":"IF(dms_RPT=\"financial\",VALUE(LEFT(dms_FRCP_y12,4)+1)&\"-\"&TEXT(VALUE(RIGHT(dms_FRCP_y12,2)+1),\"00\"),VALUE(LEFT(dms_FRCP_y12,4)+1))","v":"2032-33"},"dms_FRCP_y13",{"$f":"IF(dms_RPT=\"financial\",VALUE(LEFT(dms_CRCP_yO,4)-1)&\"-\"&TEXT(VALUE(MID(dms_CRCP_yO,3,2)),\"00\"),VALUE(LEFT(dms_CRCP_yO,4)-1))","v":"2007-08"},"dms_CRCP_yN",13,null,"2017-18",2018,null,null,{"$f":"VALUE(LEFT(dms_CRYf_y12,4)+1)&\"-\"&TEXT(MID(dms_CRYf_y12,3,2)+2,\"00\")","v":"2017-18"},"dms_CRYf_y13",{"$f":"VALUE(LEFT(dms_CRYc_y12,4)+1)","v":2018},"dms_CRYc_y13"]
[null,14,"dms_FRCP_y14",14,"CRCP_y14",{"$f":"IF(dms_RPT=\"financial\",VALUE(LEFT(dms_FRCP_y13,4)+1)&\"-\"&TEXT(VALUE(RIGHT(dms_FRCP_y13,2)+1),\"00\"),VALUE(LEFT(dms_FRCP_y13,4)+1))","v":"2033-34"},"dms_FRCP_y14",{"$f":"IF(dms_RPT=\"financial\",VALUE(LEFT(dms_CRCP_yN,4)-1)&\"-\"&TEXT(VALUE(MID(dms_CRCP_yN,3,2)),\"00\"),VALUE(LEFT(dms_CRCP_yN,4)-1))","v":"2006-07"},"dms_CRCP_yM",14,null,"2018-19",2019,null,null,{"$f":"VALUE(LEFT(dms_CRYf_y13,4)+1)&\"-\"&TEXT(MID(dms_CRYf_y13,3,2)+2,\"00\")","v":"2018-19"},"dms_CRYf_y14",{"$f":"VALUE(LEFT(dms_CRYc_y13,4)+1)","v":2019},"dms_CRYc_y14"]
[null,15,"dms_FRCP_y15",15,"CRCP_y15",{"$f":"IF(dms_RPT=\"financial\",VALUE(LEFT(dms_FRCP_y14,4)+1)&\"-\"&TEXT(VALUE(RIGHT(dms_FRCP_y14,2)+1),\"00\"),VALUE(LEFT(dms_FRCP_y14,4)+1))","v":"2034-35"},"dms_FRCP_y15",{"$f":"IF(dms_RPT=\"financial\",VALUE(LEFT(dms_CRCP_yM,4)-1)&\"-\"&TEXT(VALUE(MID(dms_CRCP_yM,3,2)),\"00\"),VALUE(LEFT(dms_CRCP_yM,4)-1))","v":"2005-06"},"dms_CRCP_yL",15,null,"2019-20",2020,null,null,{"$f":"VALUE(LEFT(dms_CRYf_y14,4)+1)&\"-\"&TEXT(MID(dms_CRYf_y14,3,2)+2,\"00\")","v":"2019-20"},"dms_CRYf_y15",{"$f":"VALUE(LEFT(dms_CRYc_y14,4)+1)","v":2020},"dms_CRYc_y15"]
[null,null,null,null,null,null,null,null,null,null,null,"2020-21",2021,null,null,{"$f":"VALUE(LEFT(dms_CRYf_y15,4)+1)&\"-\"&TEXT(MID(dms_CRYf_y15,3,2)+2,\"00\")","v":"2020-21"},"dms_CRYf_y16",{"$f":"VALUE(LEFT(dms_CRYc_y15,4)+1)","v":2021},"dms_CRYc_y16"]
[null,"These are drop down lists for businesses to select the correct FRCP_y1 on the business and other details worksheet.\nThis also populates the column headings in the worksheets",null,null,null,null,null,null,null,null,null,"2021-22",2022,null,null,{"$f":"VALUE(LEFT(dms_CRYf_y16,4)+1)&\"-\"&TEXT(MID(dms_CRYf_y16,3,2)+2,\"00\")","v":"2021-22"},"dms_CRYf_y17",{"$f":"VALUE(LEFT(dms_CRYc_y16,4)+1)","v":2022},"dms_CRYc_y17"]
[null,"dms_RCP_fyear_list","dms_CRY_ListF","dms_CRY_ListC","dms_RCP_cyear_list","dms_FRCP_fyear_list","dms_FRCP_ListF","dms_FRCP_ListC","dms_FRCP_cyear_list",null,null,"2022-23",2023,null,null,{"$f":"VALUE(LEFT(dms_CRYf_y17,4)+1)&\"-\"&TEXT(MID(dms_CRYf_y17,3,2)+2,\"00\")","v":"2022-23"},"dms_CRYf_y18",{"$f":"VALUE(LEFT(dms_CRYc_y17,4)+1)","v":2023},"dms_CRYc_y18"]
[null,"dms_y1",{"$f":"CRY","v":"2005-06"},"2006","dms_cy1","dms_frcp_fy1","2010-11",2011,"dms_crcp_cy1",null,null,"2023-24",2024,null,null,{"$f":"VALUE(LEFT(dms_CRYf_y18,4)+1)&\"-\"&TEXT(MID(dms_CRYf_y18,3,2)+2,\"00\")","v":"2023-24"},"dms_CRYf_y19",{"$f":"VALUE(LEFT(dms_CRYc_y18,4)+1)","v":2024},"dms_CRYc_y19"]
[null,"dms_y2",{"$f":"IF(dms_RPT=\"financial\",VALUE(LEFT(CRY,4)+1)&\"-\"&TEXT(MID(CRY,3,2)+2,\"00\"),VALUE(LEFT(CRY,4)+1))","v":"2006-07"},"2007","dms_cy2","dms_frcp_fy2","2011-12",2012,"dms_crcp_cy2",null,null,"2024-25",2025,null,null,{"$f":"VALUE(LEFT(dms_CRYf_y19,4)+1)&\"-\"&TEXT(MID(dms_CRYf_y19,3,2)+2,\"00\")","v":"2024-25"},"dms_CRYf_y20",{"$f":"VALUE(LEFT(dms_CRYc_y19,4)+1)","v":2025},"dms_CRYc_y20"]
[null,"dms_y3",{"$f":"IF(dms_RPT=\"financial\",VALUE(LEFT(dms_fy2,4)+1)&\"-\"&TEXT(MID(dms_fy2,3,2)+2,\"00\"),VALUE(LEFT(dms_fy2,4)+1))","v":"2007-08"},"2008","dms_cy3","dms_frcp_fy3","2012-13",2013,"dms_crcp_cy3",null,null,"2025-26",2026]
[null,"dms_y4",{"$f":"IF(dms_RPT=\"financial\",VALUE(LEFT(dms_fy3,4)+1)&\"-\"&TEXT(MID(dms_fy3,3,2)+2,\"00\"),VALUE(LEFT(dms_fy3,4)+1))","v":"2008-09"},"2009","dms_cy4","dms_frcp_fy4","2013-14",2014,"dms_crcp_cy4",null,null,"2026-27",2027]
[null,"dms_y5",{"$f":"IF(dms_RPT=\"financial\",VALUE(LEFT(dms_fy4,4)+1)&\"-\"&TEXT(MID(dms_fy4,3,2)+2,\"00\"),VALUE(LEFT(dms_fy4,4)+1))","v":"2009-10"},2010,"dms_cy5","dms_frcp_fy5","2014-15",2015,"dms_crcp_cy5",null,null,"2027-28",2028]
[null,"dms_y6",{"$f":"IF(dms_RPT=\"financial\",VALUE(LEFT(dms_fy5,4)+1)&\"-\"&TEXT(MID(dms_fy5,3,2)+2,\"00\"),VALUE(LEFT(dms_fy5,4)+1))","v":"2010-11"},2011,"dms_cy6","dms_frcp_fy6","2015-16",2016,"dms_crcp_cy6",null,null,"2028-29",2029]
[null,"dms_y7",{"$f":"IF(dms_RPT=\"financial\",VALUE(LEFT(dms_fy6,4)+1)&\"-\"&TEXT(MID(dms_fy6,3,2)+2,\"00\"),VALUE(LEFT(dms_fy6,4)+1))","v":"2011-12"},2012,"dms_cy7","dms_frcp_fy7","2016-17",2017,"dms_crcp_cy7",null,null,"2029-30",2030]
[null,"dms_y8",{"$f":"IF(dms_RPT=\"financial\",VALUE(LEFT(dms_fy7,4)+1)&\"-\"&TEXT(MID(dms_fy7,3,2)+2,\"00\"),VALUE(LEFT(dms_fy7,4)+1))","v":"2012-13"},2013,"dms_cy8","dms_frcp_fy8","2017-18",2018,"dms_crcp_cy8",null,null,"2030-31",2031]
[null,"dms_y9",{"$f":"IF(dms_RPT=\"financial\",VALUE(LEFT(dms_fy8,4)+1)&\"-\"&TEXT(MID(dms_fy8,3,2)+2,\"00\"),VALUE(LEFT(dms_fy8,4)+1))","v":"2013-14"},2014,"dms_cy9","dms_frcp_fy9","2018-19",2019,"dms_crcp_cy9",null,null,"2031-32",2032]
[null,"dms_y10",{"$f":"IF(dms_RPT=\"financial\",VALUE(LEFT(dms_fy9,4)+1)&\"-\"&TEXT(MID(dms_fy9,3,2)+2,\"00\"),VALUE(LEFT(dms_fy9,4)+1))","v":"2014-15"},2015,"dms_cy10","dms_frcp_fy10","2019-20",2020,"dms_crcp_cy10",null,null,"2032-33",2033]
[null,"dms_y11",{"$f":"IF(dms_RPT=\"financial\",VALUE(LEFT(dms_fy10,4)+1)&\"-\"&TEXT(MID(dms_fy10,3,2)+2,\"00\"),VALUE(LEFT(dms_fy10,4)+1))","v":"2015-16"},2016,"dms_cy11","dms_frcp_fy11","2020-21",2021,"dms_crcp_cy11",null,null,"2033-34",2034]
[null,"dms_y12",{"$f":"IF(dms_RPT=\"financial\",VALUE(LEFT(dms_fy11,4)+1)&\"-\"&TEXT(MID(dms_fy11,3,2)+2,\"00\"),VALUE(LEFT(dms_fy11,4)+1))","v":"2016-17"},2017,"dms_cy12","dms_frcp_fy12","2021-22",2022,"dms_crcp_cy12",null,null,"2034-35",2035]
[null,"dms_y13",{"$f":"IF(dms_RPT=\"financial\",VALUE(LEFT(dms_fy12,4)+1)&\"-\"&TEXT(MID(dms_fy12,3,2)+2,\"00\"),VALUE(LEFT(dms_fy12,4)+1))","v":"2017-18"},2018,"dms_cy13","dms_frcp_fy13","2022-23",2023,"dms_crcp_cy13",null,null,"2035-36",2036]
[null,"dms_y14",{"$f":"IF(dms_RPT=\"financial\",VALUE(LEFT(dms_fy13,4)+1)&\"-\"&TEXT(MID(dms_fy13,3,2)+2,\"00\"),VALUE(LEFT(dms_fy13,4)+1))","v":"2018-19"},2019,"dms_cy14","dms_frcp_fy14","2023-24",2024,"dms_crcp_cy14"]
[null,"dms_y15",{"$f":"IF(dms_RPT=\"financial\",VALUE(LEFT(dms_fy14,4)+1)&\"-\"&TEXT(MID(dms_fy14,3,2)+2,\"00\"),VALUE(LEFT(dms_fy14,4)+1))","v":"2019-20"},2020,"dms_cy15","dms_frcp_fy15","2024-25",2025,"dms_crcp_cy15"]
[null,"dms_y16",{"$f":"IF(dms_RPT=\"financial\",VALUE(LEFT(dms_fy15,4)+1)&\"-\"&TEXT(MID(dms_fy15,3,2)+2,\"00\"),VALUE(LEFT(dms_fy15,4)+1))","v":"2020-21"},2021,"dms_cy16"]
[null,"dms_y17",{"$f":"IF(dms_RPT=\"financial\",VALUE(LEFT(dms_fy16,4)+1)&\"-\"&TEXT(MID(dms_fy16,3,2)+2,\"00\"),VALUE(LEFT(dms_fy16,4)+1))","v":"2021-22"},2022,"dms_cy17"]
[null,"dms_y18",{"$f":"IF(dms_RPT=\"financial\",VALUE(LEFT(dms_fy17,4)+1)&\"-\"&TEXT(MID(dms_fy17,3,2)+2,\"00\"),VALUE(LEFT(dms_fy17,4)+1))","v":"2022-23"},2023,"dms_cy18"]
[null,"dms_y19",{"$f":"IF(dms_RPT=\"financial\",VALUE(LEFT(dms_fy18,4)+1)&\"-\"&TEXT(MID(dms_fy18,3,2)+2,\"00\"),VALUE(LEFT(dms_fy18,4)+1))","v":"2023-24"},2024,"dms_cy19"]
[null,"dms_y20",{"$f":"IF(dms_RPT=\"financial\",VALUE(LEFT(dms_fy19,4)+1)&\"-\"&TEXT(MID(dms_fy19,3,2)+2,\"00\"),VALUE(LEFT(dms_fy19)+1))","v":"2024-25"},2025,"dms_cy20"]
[]
[]
[]
[]
[]
[null,"These \"row descriptions\" are the column headings in the various templates but become row descriptions in the ETL process"]
[null,null,"Table 6.3 sustained interruptions - row descriptions"]
[null,null,"dms_060301_CustNo_Affected_Row","dms_060301_Avg_Duration_Sustained_Int_Row","dms_060301_Effect_unplanned_SAIDI_Row","dms_060301_Effect_unplanned_SAIFI_Row"]
[null,null,"Number of customers affected by the interruption","Average duration of sustained customer interruption","Effect on unplanned SAIDI","Effect on unplanned SAIFI"]
[]
[]
[]
[null,null,"Table 6.1 telephone answering - row descriptions and start date"]
[null,null,"dms_060101_Rows","dms_060102_Rows","dms_060101_StartDateTxt"]
[null,null,"Total number of calls \n(after removing excluded events)","Number of calls answered within 30 seconds \n(after excluding excluded events) ",{"$f":"dms_060701_StartDateTxt","v":"1-Jul-2005"}]
[]
[]
[]
[null,null,null,null,null,null,null,"dms_0603_FeederList",{"$f":"INDEX(dms_FeederName_1,MATCH(dms_TradingName,dms_TradingName_List))","v":"CBD"},{"$f":"INDEX(dms_FeederName_2,MATCH(dms_TradingName,dms_TradingName_List))","v":"Urban"},{"$f":"INDEX(dms_FeederName_3,MATCH(dms_TradingName,dms_TradingName_List))","v":"Short rural"},{"$f":"INDEX(dms_FeederName_4,MATCH(dms_TradingName,dms_TradingName_List))","v":"Long rural"}]
[null,null,"Table 6.7.1 - daily performance data - unplanned - MAIFI  -- row descriptions and header named range values"]
[null,null,"These headings (Lists) are determined from the INDEX/MATCH function on the NSP selected on the Business & other details sheet"]
[null,"dms_060701_Feeder_Header_Lvl4",{"$f":"INDEX(dms_FeederName_1,MATCH(dms_TradingName,dms_TradingName_List))","v":"CBD"},{"$f":"INDEX(dms_FeederName_1,MATCH(dms_TradingName,dms_TradingName_List))","v":"CBD"},{"$f":"INDEX(dms_FeederName_2,MATCH(dms_TradingName,dms_TradingName_List))","v":"Urban"},{"$f":"INDEX(dms_FeederName_2,MATCH(dms_TradingName,dms_TradingName_List))","v":"Urban"},{"$f":"INDEX(dms_FeederName_3,MATCH(dms_TradingName,dms_TradingName_List))","v":"Short rural"},{"$f":"INDEX(dms_FeederName_3,MATCH(dms_TradingName,dms_TradingName_List))","v":"Short rural"},{"$f":"INDEX(dms_FeederName_4,MATCH(dms_TradingName,dms_TradingName_List))","v":"Long rural"},{"$f":"INDEX(dms_FeederName_4,MATCH(dms_TradingName,dms_TradingName_List))","v":"Long rural"},{"$f":"IF((INDEX(dms_FeederName_5,MATCH(dms_TradingName,dms_TradingName_List))=0),\"Network\",(INDEX(dms_FeederName_5,MATCH(dms_TradingName,dms_TradingName_List))))","v":"Network"},{"$f":"IF((INDEX(dms_FeederName_5,MATCH(dms_TradingName,dms_TradingName_List))=0),\"Network\",(INDEX(dms_FeederName_5,MATCH(dms_TradingName,dms_TradingName_List))))","v":"Network"},"Network","Network"]
[]
[null,"dms_060701_Rows","All events","After removing excluded events","All events","After removing excluded events","All events","After removing excluded events","All events","After removing excluded events","All events","After removing excluded events","All events","After removing excluded events"]
[null,null,"the number of column headings changes from 10 to 12 depending on the number of feeder categories for the NSP"]
[]
[]
[]
[]
[null,null,"Table 6.8.1 - row descriptions"]
[null,null,"dms_060801_01_Rows","dms_060801_02_Rows","dms_060801_03_Rows","dms_060801_04_Rows"]
[null,null,"Number of interruptions","Duration of interruptions","Total unplanned minutes off supply","Effect on unplanned MAIFI"]
[]
[]
[]
[]
[null,null,"Table 7.9.4 - market impact component - row descriptions"]
[null,"dms_070904_01_Rows","without exclusions","with exclusions"]
[]
[]
[]
[]
[]
[null,null,"Use this to add to existing files"]
[null,null,"ARRs 6.7 STPIS daily performance"]
[null,null,"dms_060101_Values","dms_060102_Values","dms_060701_Values"]
[]
[null,null,"ARR's  6.8 STPIS exclusions"]
[null,null,"dms_060801_Event_Date","dms_060801_OutageID","dms_060801_FeederID","dms_060801_FeederClass","dms_060801_CauseID","dms_060801_01_Values","dms_060801_02_Values","dms_060801_03_Values","dms_060801_Excl_Cat","dms_060801_04_Values"]
[null,null,"dms_060801_StartCell"]
[]
[null,null,"CA 6.3 sustained interruptions"]
[null,null,"dms_060301_Event_Date","dms_060301_Event_Time","dms_060301_AssetID","dms_060301_FeederClass","dms_060301_Reason","dms_060301_DetailedReason","dms_060301_CustNo_Affected_Values","dms_060301_Avg_Duration_Sustained_Int_Values","dms_060301_Effect_unplanned_SAIDI_Values","dms_060301_Effect_unplanned_SAIFI_Values","dms_060301_MED"]

{"sheet":"Instructions","index":2,"n_rows":27,"n_cols":4,"rows_kept":27,"cut":false,"hidden":false,"merged":[[25,2,25,3],[26,2,26,4],[24,2,24,4],[1,1,1,5],[2,1,2,5],[3,2,3,4],[4,2,4,4],[5,2,5,4],[7,2,7,3],[8,2,8,4],[10,2,10,4],[12,2,12,4],[20,2,20,4],[22,2,22,4]]}
[]
[null,{"$f":"CONCATENATE(dms_Segment,\" Network Service Provider\")","v":"Distribution Network Service Provider"}]
[null,"Historical Reporting RIN Template"]
[null,null,{"$f":"CONCATENATE(\"This template is to be used by \",dms_TradingName,\" to fulfil its reporting obligations to the AER.\")","v":"This template is to be used by SA Power Networks to fulfil its reporting obligations to the AER."}]
[null,null,"INSTRUCTIONS"]
[null,null,"Complete the Business & other details worksheet before entering data or values in any other worksheets. The Business & other details worksheet is linked to other worksheets within the workbook and automatically generates certain column headings and conditional formatting."]
[]
[null,null,"Identifying CONFIDENTIAL INFORMATION:\n\nPlease use the macro at the top of each \nworksheet to identify confidential information. \n\n"]
[null,null,"-Do this by selecting the cell or cells that contain confidential information and then run the Mark selection CONFIDENTIAL macro. This will format the cells a specific colour that is identified by the AER's database which in turn marks that information as confidential.\n\n-To reverse this, select the cell or cells and run the Return selection to NON-CONFIDENTIAL macro."]
[]
[null,null,"UNITS OF MEASURE\n\nAll amounts are to be unrounded and reported on a one for one basis: that is 1000 is to be entered as '1000'. Applicable units of measure may be identified in the table column headings or row descriptors.\n\n\n"]
[]
[null,null,"COLOUR CODING OF INPUT / NON-INPUT CELLS:"]
[null,null,null,"Yellow = Input cell (mandatory)"]
[null,null,null,"Darker yellow = input cell (mandatory)"]
[null,null,null,"Orange = input cell (if data available)"]
[null,null,null,"Grey = Not applicable/No inputs required"]
[null,null,null,". \nPLEASE DO NOT ENTER TEXT into cells that are to contain numeric data."]
[]
[]
[null,null,"WORKSHEET NAVIGATION\n\nMany tables in the worksheets have been \"grouped\" to allow for easy navigation. To ungroup or group data use the outline symbols in the left margin of excel (for Row groupings) or above the columns (for column groupings). \n\n\n\n"]
[]
[null,null,"RETURNING COMPLETED RESPONSES\n\nPlease return two (2) files to the AER: \n1. A confidential version which must contain a complete set of all responses with confidential information marked using the Mark selected cells CONFIDENTIAL macro and which has been completed using the locked template file provided by the AER. \n\n2. A public version with confidential information either removed completely or aggregated in some form together with writtten consent to disclose the public version of the response.\n\nUse the drop down box on the Business and other details worksheet to identify the file as either confidential ('consolidated') or public. "]
[]
[null,null,"SUBMITTING AMENDED DATA TO THE AER\n\nIf an NSP wishes to correct data previously submitted to the AER it should resubmit that data using the original completed submission as the starting point. Please make any necessary changes to the data. Data that is not being amended should be left unchanged. \n\nNSPs must identify the reason for the amendments in the Amendment Reason box on the  Business and other details worksheet. NSPs may provide further details regarding any amendments in the Amendments worksheet. \n\n."]
[null,null,"NSP may use Amended Data macro \nto highlight cells that contain amended data.\nNB: if data is also CONFIDENTIAL, re-apply \nthe Confidentiality macro after applying the \nAmended macro"]
[null,null,"Please resubmit two (2) files - a confidential version and a public version of the amended submission to the AER"]

{"sheet":"Business & other details","index":3,"n_rows":156,"n_cols":9,"rows_kept":156,"cut":false,"hidden":false,"merged":[[7,1,7,8],[11,1,11,8],[13,2,13,4],[14,2,14,4],[17,2,17,3],[17,4,17,7],[59,2,59,8],[18,4,18,7],[19,2,19,3],[19,4,19,7],[22,2,22,3],[22,4,22,7],[23,4,23,7],[24,2,24,3],[24,4,24,7],[32,1,32,8],[57,2,57,3],[58,4,58,8]]}
[null,{"$f":"IF(dms_DataQuality=\"backcast\",INDEX(dms_Worksheet_List,MATCH(dms_Model,dms_Model_List))&\" BACKCAST\",INDEX(dms_Worksheet_List,MATCH(dms_Model,dms_Model_List)))","v":"ECONOMIC BENCHMARKING"}]
[null,{"$f":"INDEX(dms_TradingNameFull_List,MATCH(dms_TradingName,dms_TradingName_List))","v":"SA Power Networks"}]
[null,{"$f":"IF(SUM(dms_SingleYear_Model)>0,CONCATENATE(CRY),CONCATENATE(FRCP_y1,\" to \",dms_MultiYear_FinalYear_Result))","v":"2005-06"}]
[null,"BUSINESS & OTHER DETAILS"]
[]
[]
[null,"Instructions"]
[null,"Complete the following business details regulatory template before entering data or values in any other regulatory template. This regulatory template is linked to other cells within the spreadsheet and automatically generates column headings and conditional formatting to distinguish business specific input and non-input cells. "]
[]
[null,"SUBMISSION PARTICULARS INPUT SHEETS"]
[]
[null,"ENTITY DETAILS"]
[]
[null,"Short name","SA Power Networks",null,null,"Select business name from drop down list first"]
[null,"ACN / ABN",{"$f":"INDEX(dms_ABN_List,MATCH(dms_TradingName,dms_TradingName_List))","v":13332330749}]
[]
[]
[null,"Business address","Address 1",null,{"$f":"INDEX(dms_Addr1_List,MATCH(dms_TradingName,dms_TradingName_List))","v":"1 Anzac Highway"}]
[null,null,null,"Address 2",{"$f":"IF(ISBLANK(INDEX(dms_Addr2_List,MATCH(dms_TradingName,dms_TradingName_List))),\"\",(INDEX(dms_Addr2_List,MATCH(dms_TradingName,dms_TradingName_List))))","v":""}]
[null,null,"Suburb",null,{"$f":"INDEX(dms_Suburb_List,MATCH(dms_TradingName,dms_TradingName_List))","v":"KESWICK"}]
[null,null,null,"State",{"$f":"INDEX(dms_State_List,MATCH(dms_TradingName,dms_TradingName_List))","v":"SA"},"p/code",{"$f":"INDEX(dms_PostCode_List,MATCH(dms_TradingName,dms_TradingName_List))","v":5035}]
[]
[null,"Postal address","Address 1",null,{"$f":"INDEX(dms_PAddr1_List,MATCH(dms_TradingName,dms_TradingName_List))","v":"GPO Box 77"}]
[null,null,null,"Address 2",{"$f":"IF(ISBLANK(INDEX(dms_PAddr2_List,MATCH(dms_TradingName,dms_TradingName_List))),\"\",(INDEX(dms_PAddr2_List,MATCH(dms_TradingName,dms_TradingName_List))))","v":""}]
[null,null,"Suburb",null,{"$f":"INDEX(dms_PSuburb_List,MATCH(dms_TradingName,dms_TradingName_List))","v":"ADELAIDE"}]
[null,null,null,"State",{"$f":"INDEX(dms_PState_List,MATCH(dms_TradingName,dms_TradingName_List))","v":"SA"},"p/code",{"$f":"INDEX(dms_PPostCode_List,MATCH(dms_TradingName,dms_TradingName_List))","v":5000}]
[]
[]
[null,"Contact name/s",{"$f":"INDEX(dms_ContactName1_List,MATCH(dms_TradingName,dms_TradingName_List))","v":"Richard Sibly"}]
[null,"Contact phone/s",{"$f":"INDEX(dms_ContactPh1_List,MATCH(dms_TradingName,dms_TradingName_List))","v":"08 8404 5613"}]
[null,"Contact email address/s",{"$f":"INDEX(dms_ContactEmail_List,MATCH(dms_TradingName,dms_TradingName_List))","v":"richard.sibly@sapowernetworks.com.au"}]
[]
[null,"REGULATORY CONTROL PERIODS"]
[]
[null,"Forthcoming regulatory control period","2020-21",{"$f":"dms_FRCP_y2","v":"2021-22"},{"$f":"dms_FRCP_y3","v":"2022-23"},{"$f":"dms_FRCP_y4","v":"2023-24"},{"$f":"dms_FRCP_y5","v":"2024-25"}]
[null,null,{"$f":"dms_FRCP_y6","v":"2025-26"},{"$f":"dms_FRCP_y7","v":"2026-27"},{"$f":"dms_FRCP_y8","v":"2027-28"},{"$f":"dms_FRCP_y9","v":"2028-29"},{"$f":"dms_FRCP_y10","v":"2029-30"}]
[]
[]
[null,"Current regulatory control period",{"$f":"dms_CRCP_FirstYear_Result","v":"2015-16"},{"$f":"IF(dms_RPT=\"financial\",VALUE(LEFT(CRCP_y1,4)+1)&\"-\"&TEXT(MID(CRCP_y1,3,2)+2,\"00\"),VALUE(LEFT(CRCP_y1,4)+1))","v":"2016-17"},{"$f":"IF(dms_RPT=\"financial\",VALUE(LEFT(CRCP_y1,4)+2)&\"-\"&TEXT(VALUE(MID(CRCP_y1,3,2)+3),\"00\"),VALUE(LEFT(CRCP_y1,4)+2))","v":"2017-18"},{"$f":"IF(dms_RPT=\"financial\",VALUE(LEFT(CRCP_y1,4)+3)&\"-\"&TEXT(MID(CRCP_y1,3,2)+4,\"00\"),VALUE(LEFT(CRCP_y1,4)+3))","v":"2018-19"},{"$f":"IF(dms_RPT=\"financial\",VALUE(LEFT(CRCP_y1,4)+4)&\"-\"&TEXT(MID(CRCP_y1,3,2)+5,\"00\"),VALUE(LEFT(CRCP_y1,4)+4))","v":"2019-20"}]
[null,null,{"$f":"IF(dms_RPT=\"financial\",VALUE(LEFT(CRCP_y1,4)+5)&\"-\"&TEXT(MID(CRCP_y1,3,2)+6,\"00\"),VALUE(LEFT(CRCP_y1,4)+5))","v":"2020-21"},{"$f":"IF(dms_RPT=\"financial\",VALUE(LEFT(CRCP_y1,4)+6)&\"-\"&TEXT(MID(CRCP_y1,3,2)+7,\"00\"),VALUE(LEFT(CRCP_y1,4)+6))","v":"2021-22"},{"$f":"IF(dms_RPT=\"financial\",VALUE(LEFT(CRCP_y1,4)+7)&\"-\"&TEXT(MID(CRCP_y1,3,2)+8,\"00\"),VALUE(LEFT(CRCP_y1,4)+7))","v":"2022-23"},{"$f":"IF(dms_RPT=\"financial\",VALUE(LEFT(CRCP_y1,4)+8)&\"-\"&TEXT(MID(CRCP_y1,3,2)+9,\"00\"),VALUE(LEFT(CRCP_y1,4)+8))","v":"2023-24"},{"$f":"IF(dms_RPT=\"financial\",VALUE(LEFT(CRCP_y1,4)+9)&\"-\"&TEXT(MID(CRCP_y1,3,2)+10,\"00\"),VALUE(LEFT(CRCP_y1,4)+9))","v":"2024-25"}]
[null,null,{"$f":"IF(dms_RPT=\"financial\",VALUE(LEFT(CRCP_y1,4)+10)&\"-\"&TEXT(MID(CRCP_y1,3,2)+11,\"00\"),VALUE(LEFT(CRCP_y1,4)+10))","v":"2025-26"},{"$f":"IF(dms_RPT=\"financial\",VALUE(LEFT(CRCP_y1,4)+11)&\"-\"&TEXT(MID(CRCP_y1,3,2)+12,\"00\"),VALUE(LEFT(CRCP_y1,4)+11))","v":"2026-27"},{"$f":"IF(dms_RPT=\"financial\",VALUE(LEFT(CRCP_y1,4)+12)&\"-\"&TEXT(MID(CRCP_y1,3,2)+13,\"00\"),VALUE(LEFT(CRCP_y1,4)+12))","v":"2027-28"},{"$f":"IF(dms_RPT=\"financial\",VALUE(LEFT(CRCP_y1,4)+13)&\"-\"&TEXT(MID(CRCP_y1,3,2)+14,\"00\"),VALUE(LEFT(CRCP_y1,4)+13))","v":"2028-29"},{"$f":"IF(dms_RPT=\"financial\",VALUE(LEFT(CRCP_y1,4)+14)&\"-\"&TEXT(MID(CRCP_y1,3,2)+15,\"00\"),VALUE(LEFT(CRCP_y1,4)+14))","v":"2029-30"}]
[]
[]
[null,"Previous regulatory control period",{"$f":"IF(dms_RPT=\"financial\",VALUE(LEFT(PRCP_y2,4)-1)&\"-\"&TEXT(VALUE(MID(PRCP_y2,3,2)),\"00\"),VALUE(LEFT(PRCP_y2,4)-1))","v":"2010-11"},{"$f":"IF(dms_RPT=\"financial\",VALUE(LEFT(PRCP_y3,4)-1)&\"-\"&TEXT(VALUE(MID(PRCP_y3,3,2)),\"00\"),VALUE(LEFT(PRCP_y3,4)-1))","v":"2011-12"},{"$f":"IF(dms_RPT=\"financial\",VALUE(LEFT(PRCP_y4,4)-1)&\"-\"&TEXT(VALUE(MID(PRCP_y4,3,2)),\"00\"),VALUE(LEFT(PRCP_y4,4)-1))","v":"2012-13"},{"$f":"IF(dms_RPT=\"financial\",VALUE(LEFT(PRCP_y5,4)-1)&\"-\"&TEXT(VALUE(RIGHT(PRCP_y5,2)-1),\"00\"),VALUE(LEFT(PRCP_y5,4)-1))","v":"2013-14"},{"$f":"IF(dms_RPT=\"financial\",VALUE(LEFT(CRCP_y1,4)-1)&\"-\"&TEXT(VALUE(RIGHT(CRCP_y1,2)-1),\"00\"),VALUE(LEFT(CRCP_y1,4)-1))","v":"2014-15"}]
[]
[]
[]
[null,"Commencing regulatory year","2005-06","CRY"]
[]
[null,"Last completed regulatory year","2017-18","dms_FinalYear"]
[]
[]
[]
[null,null,"IF THIS IS AN ABC RIN - make sure the the named range CRY is applied and the named range dms_dollar_nom_UOM is applied"]
[null,null,"IF THIS IS A RESET RIN - make sure the named ranges CRY and dms_dollar_nom_UOM are NOT present in the workbook"]
[null,null,"FOR ABC RINS THAT SPAN MULTIPLE YEARS - make sure MultiYear Flag is set and final year entered as required"]
[]
[null,"Source","Regulatory proposal",null,"Please select the correct submission type from the dropdown list."]
[null,"Data quality (actual, estimate, public, consolidated)","Public",null,"Use Consolidated for Consolidated Confidential version\nUse Public for Consolidated Public version"]
[null,"Amended RIN submission - amendment reason","."]
[null,"Submission Date","31/01/2019","dms_SubmissionDate","Please enter date this file submitted to AER (dd/mm/yyyy)"]
[null,"EBSS - First application of scheme in forthcoming period?","No"]
[null,"Sector",{"$f":"INDEX(dms_Sector_List,MATCH(dms_TradingName,dms_TradingName_List))","v":"Electricity"},"dms_Sector","=INDEX(dms_Sector_List,MATCH(dms_TradingName,dms_TradingName_List))"]
[null,"Segment",{"$f":"INDEX(dms_Segment_List,MATCH(dms_TradingName,dms_TradingName_List))","v":"Distribution"},"dms_Segment","=INDEX(dms_Segment_List,MATCH(dms_TradingName,dms_TradingName_List))"]
[null,"Regulatory Year Ending",{"$f":"IF(dms_MultiYear_Flag=1,LEFT(dms_Specified_FinalYear,2)&RIGHT(dms_Specified_FinalYear,2),INDEX(dms_RYE_Formula_Result,MATCH(dms_Model,dms_Model_List)))","v":"2018"},"dms_RYE","=IF(dms_MultiYear_Flag=1,LEFT(dms_Specified_FinalYear,2)&RIGHT(dms_Specified_FinalYear,2),INDEX(dms_RYE_Formula_Result,MATCH(dms_Model,dms_Model_List)))"]
[null,"Reporting Period Type",{"$f":"INDEX(dms_RPT_List,MATCH(dms_TradingName,dms_TradingName_List))","v":"Financial"},"dms_RPT","=INDEX(dms_RPT_List,MATCH(dms_TradingName,dms_TradingName_List))"]
[null,"Model or RIN Type","EB","dms_Model","Drop down selection"]
[null,"EB/CA Unit of Measure for Monetary Values","$0s","dms_dollar_nom_UOM","If the cover sheet is attached to an ABC RIN apply the NAMED RANGE to the cell"]
[null,"Security Classification","Public","dms_Classification","Always Public"]
[null,"Jurisdiction",{"$f":"INDEX(dms_JurisdictionList,MATCH(dms_TradingName,dms_TradingName_List))","v":"SA"},"dms_Jurisdiction","=INDEX(dms_JurisdictionList,MATCH(dms_TradingName,dms_TradingName_List))"]
[null,"FORECAST and MultiYear RINS"]
[null,"CRY-1  (last full calendar year before CRY)",{"$f":"IF(dms_RPT=\"financial\",VALUE(LEFT(dms_SingleYear_FinalYear_Result,4)),VALUE(LEFT(dms_SingleYear_FinalYear_Result,4)-1))","v":2005},"dms_Cal_Year_B4_CRY","'=IF(dms_RPT=\"financial\",VALUE(LEFT(dms_SingleYear_FinalYear_Result,4)),VALUE(LEFT(dms_SingleYear_FinalYear_Result,4)-1))"]
[null,"Dollar $ real month",{"$f":"INDEX(dms_RPTMonth_List,MATCH(dms_TradingName,dms_TradingName_List))","v":"June"},"dms_RPTMonth","=INDEX(dms_RPTMonth_List,MATCH(dms_TradingName,dms_TradingName_List))"]
[null,"Dollar $ real  (the last month before the FRCP_y1)",{"$f":"IF(SUM(dms_SingleYear_Model)>0,CONCATENATE(dms_RPTMonth)&\" \"&VALUE((LEFT(CRY,2))&RIGHT(CRY,2)),CONCATENATE(dms_RPTMonth)&\" \"&VALUE((LEFT(dms_CRCP_FinalYear_Result,2)&RIGHT(dms_CRCP_FinalYear_Result,2))))","v":"June 2006"},"dms_DollarReal","=IF(SUM(dms_SingleYear_Model)>0,CONCATENATE(dms_RPTMonth)&\" \"&VALUE((LEFT(CRY,2))&RIGHT(CRY,2)),CONCATENATE(dms_RPTMonth)&\" \"&VALUE((LEFT(dms_CRCP_FinalYear_Result,2)&RIGHT(dms_CRCP_FinalYear_Result,2))))"]
[null,"Dollar $ real previous year (PRCP_y5)",{"$f":"IF(SUM(dms_SingleYear_Model)>0,CONCATENATE(dms_RPTMonth)&\" \"&VALUE(((LEFT(CRY,2))&RIGHT(CRY,2))-1),CONCATENATE(dms_RPTMonth)&\" \"&VALUE(((LEFT(dms_CRCP_FirstYear_Result,2)&RIGHT(dms_CRCP_FirstYear_Result,2))))-1)","v":"June 2005"},"dms_DollarReal_Prev","=IF(SUM(dms_SingleYear_Model)>0,CONCATENATE(dms_RPTMonth)&\" \"&VALUE(((LEFT(CRY,2))&RIGHT(CRY,2))-1),CONCATENATE(dms_RPTMonth)&\" \"&VALUE(((LEFT(dms_CRCP_FirstYear_Result,2)&RIGHT(dms_CRCP_FirstYear_Result,2))))-1)"]
[null,"This block works out the various RYE's for ALL RIN types and MODELS"]
[null,"Single Year Model T/F",{"$f":"IF(dms_Model=\"EB\",1,0)","v":1},"dms_EB"]
[null,null,{"$f":"IF(dms_Model=\"CA\",1,0)","v":0},"dms_CA","=dms_SingleYear_Model"]
[null,null,{"$f":"IF(dms_Model=\"ARR\",1,0)","v":0},"dms_ARR"]
[null,"Is this a single Year RIN?",{"$f":"IF(SUM(dms_SingleYear_Model)=1,\"yes\",\"no\")","v":"yes"},"dms_SingleYearModel","=IF(SUM(dms_SingleYear_Model)=1,\"yes\",\"no\")"]
[null,"Single Year Final Year Reference","CRY","dms_SingleYear_FinalYear_Ref","This is the reference for EB, CA & ARR RINs"]
[null,"Single Year Final Year Result",{"$f":"IFERROR(IF(SUM(dms_SingleYear_Model)<>0,(INDIRECT(dms_SingleYear_FinalYear_Ref)),\"not a single year RIN\"),\"CRY not present\")","v":"2005-06"},"dms_SingleYear_FinalYear_Result","=IFERROR(IF(SUM(dms_SingleYear_Model)<>0,(INDIRECT(dms_SingleYear_FinalYear_Ref)),\"not a single year RIN\"),\"CRY not present\")"]
[null,"FRCP length in years",{"$f":"INDEX(dms_FRCPlength_List,MATCH(dms_TradingName,dms_TradingName_List))","v":5},"dms_FRCPlength_Num","=INDEX(dms_FRCPlength_List,MATCH(dms_TradingName,dms_TradingName_List))"]
[null,"Multi Year Final Year Reference",{"$f":"INDEX(dms_FinalYear_List,MATCH(dms_FRCPlength_Num,dms_FRCPlength_Num_List))","v":"dms_FRCP_y5"},"dms_MultiYear_FinalYear_Ref","=INDEX(dms_FinalYear_List,MATCH(dms_FRCPlength_Num,dms_FRCPlength_Num_List))"]
[null,"Multi Year Final Year Result",{"$f":"IF(dms_MultiYear_Flag=0,INDIRECT(dms_MultiYear_FinalYear_Ref),dms_Specified_FinalYear)","v":"2017-18"},"dms_MultiYear_FinalYear_Result","=IF(dms_MultiYear_Flag=0,INDIRECT(dms_MultiYear_FinalYear_Ref),dms_Specified_FinalYear)",null,null,null,"Formula errors OK"]
[null,"CRCP length in years",{"$f":"INDEX(dms_CRCPlength_List,MATCH(dms_TradingName,dms_TradingName_List))","v":5},"dms_CRCPlength_Num","=INDEX(dms_CRCPlength_List,MATCH(dms_TradingName,dms_TradingName_List))"]
[null,"CRCP Final Year Reference",{"$f":"INDEX(dms_CFinalYear_List,MATCH(dms_CRCPlength_Num,dms_CRCPlength_Num_List))","v":"CRCP_y5"},"dms_CRCP_FinalYear_Ref","=INDEX(dms_CFinalYear_List,MATCH(dms_CRCPlength_Num,dms_CRCPlength_Num_List))"]
[null,"CRCP First Year Result",{"$f":"INDEX(dms_CRCP_years,MATCH(dms_CRCPlength_Num,dms_CRCP_index))","v":"2015-16"},"dms_CRCP_FirstYear_Result","=INDEX(dms_CRCP_years,MATCH(dms_CRCPlength_Num,dms_CRCP_index))"]
[null,"CRCP Final Year Result",{"$f":"IF(dms_MultiYear_Flag=0,(IF(SUM(dms_SingleYear_Model)>0,CRY,dms_CRCP_yZ)),dms_Specified_FinalYear)","v":"2017-18"},"dms_CRCP_FinalYear_Result","=IF(dms_MultiYear_Flag=0,(IF(SUM(dms_SingleYear_Model)>0,CRY,dms_CRCP_yZ)),dms_Specified_FinalYear)"]
[null,"PTRM/ RFMs"]
[null,"Form of control",{"$f":"INDEX(dms_FormControl_List,MATCH(dms_TradingName,dms_TradingName_List))","v":"Revenue cap"},"dms_FormControl","=INDEX(dms_FormControl_List,MATCH(dms_TradingName,dms_TradingName_List))"]
[null,"ABC RINS THAT SPAN MULTIPLE YEARS"]
[null,"Is this a multi year ABC RIN?","Yes"]
[null,"Multiyear EB, CA or ARR?",{"$f":"IF(dms_MultiYear_ResponseFlag=\"No\",0,1)","v":1},"dms_MultiYear_Flag","This is set from the answer provided above"]
[null,null,{"$f":"IF(dms_MultiYear_Flag=1,FRY,\"not a Multiple year submission\")","v":"2017-18"},"dms_Specified_FinalYear","The result here is returned to dms_CRCP_FinalYear_Result if response to Q in C73 is \"yes\" and dms_MultiYear_Flag is set to 1"]
[null," Start year for 5.2 in Multi year ABC RINS",{"$f":"IFERROR(IF(dms_MultiYear_Flag=1,FRY,CRY),\"not an ABC\")","v":"2017-18"},"dms_0502_Inst_Year","=IF(dms_MultiYear_Flag=1,FRY,CRY)",null,"For single year RINS this is CRY - multi year RINS need to start a the end of the span of years (ie. FRY)"]
[null,"EB RINS"]
[null,"Calendar Year for table 3.6 data",{"$f":"dms_SingleYear_FinalYear_Result","v":"2005-06"},"dms_0306_Year","=IF(dms_RPT=\"financial\",VALUE(LEFT(dms_SingleYear_FinalYear_Result,4)),VALUE(LEFT(dms_SingleYear_FinalYear_Result,4)-1))"]
[null,"CA RINS"]
[null,"Find how many rows in tables 6.3 sustained interruptions?",null,null,"dms_060301_MaxRows only returns a valid value when cover sheet is attached to a CA file"]
[null,null,{"$f":"IF(dms_Model<>\"CA\",\"not a CA\",\"Is a CA\")","v":"not a CA"},null,"=IF(dms_Model<>\"CA\",\"not a CA\",\"Is a CA\")"]
[null,"dms_060301_Avg_Duration_Sustained_Int_Values present?",{"$f":"IFERROR(IF(INDEX(dms_060301_Avg_Duration_Sustained_Int_Values,1,1)<>\"\",\"yes\",\"no\"),\"no\")","v":"no"},"dms_060301_checkvalue","=IFERROR(IF(INDEX(dms_060301_Avg_Duration_Sustained_Int_Values,1,1)<>\"\",\"yes\",\"no\"),\"no\")"]
[null,null,{"$f":"IF(AND(dms_Model=\"CA\",(dms_060301_checkvalue=\"no\")),\"error - NR not present\",\"no errors\")","v":"no errors"},null,"=IF(AND(dms_Model=\"CA\",(dms_060301_checkvalue=\"no\")),\"error - NR not present\",\"no errors\")"]
[null,"Table 6.3.1 - last row reference",{"$f":"IFERROR(IF(dms_Model=\"CA\",LOOKUP(2,1/(dms_060301_Avg_Duration_Sustained_Int_Values<>\"\"),(ROW(dms_060301_Avg_Duration_Sustained_Int_Values))),\"not a CA\"),\"6.3 not present\")","v":"not a CA"},"dms_060301_LastRow","=IFERROR(IF(dms_Model=\"CA\",LOOKUP(2,1/(dms_060301_Avg_Duration_Sustained_Int_Values<>\"\"),(ROW(dms_060301_Avg_Duration_Sustained_Int_Values))),\"not a CA\"),\"6.3 not present\")"]
[null,"Table 6.3.1 - max number rows",{"$f":"IFERROR(IF(dms_Model=\"CA\",(dms_060301_LastRow-15),\"not a CA\"),\"error\")","v":"not a CA"},"dms_060301_MaxRows","=IFERROR(IF(dms_Model=\"CA\",(dms_060301_LastRow-15),\"not a CA\"),\"error\")"]
[null,"Table 6.6.3 - Public lighting repair - no. business days",{"$f":"INDEX(dms_663_List,MATCH(dms_TradingName,dms_TradingName_List))","v":5},"dms_663","=INDEX(dms_663_List,MATCH(dms_TradingName,dms_TradingName_List))"]
[null,"ARR or RESET RINS"]
[null,"How many rows in tables 6.1 or 6.7?  (leap year?)","insert dms_LeapYear NR if required",null,"'dms_LeapYear is used to determine dms_060701_Max_Rows BUT it is only found on worksheet 6.1 or 6.7 and the date value in the cell is used to determine whether it is a leap year"]
[null,"Is dms_LeapYear named range present?",{"$f":"IFERROR(IF(dms_LeapYear,\"yes\"),\"no\")","v":"no"}]
[null,"Table 6.7.1 - includes a leap year?",{"$f":"\nIFERROR(IF(MONTH(DATE(YEAR(dms_LeapYear),2,29))=2,\"is a leap year\",\"not a leap year\"),\n\"dms_LeapYear not present\")","v":"dms_LeapYear not present"},"dms_LeapYear_Result","=IFERROR(IF(MONTH(DATE(YEAR(dms_LeapYear),2,29))=2,\"is a leap year\",\"not a leap year\"),\"dms_LeapYear not present\")"]
[null,"MaxRows if Reset and leap year",{"$f":"IF(dms_LeapYear_Result=\"is a leap year\",1827,1826)","v":1826},"dms_060701_Reset_MaxRows","=IF(dms_LeapYear_Result=\"is a leap year\",1827,1826)",null,null,"number of days present in Reset RIN table"]
[null,"MaxRows if ARR and leap year",{"$f":"IF(dms_LeapYear_Result=\"is a leap year\",366,365)","v":365},"dms_060701_ARR_MaxRows","=IF(dms_LeapYear_Result=\"is a leap year\",366,365)",null,null,"number of days present in ARR RIN table"]
[null,"Table 6.7.1 - Max Rows (leap year/ non leap year)",{"$f":"IF(dms_Model=\"ARR\",dms_060701_ARR_MaxRows,IF(dms_Model=\"Reset\",dms_060701_Reset_MaxRows,\"not a relevant RIN type\"))","v":"not a relevant RIN type"},"dms_060701_MaxRows","=IF(dms_Model=\"ARR\",dms_060701_ARR_MaxRows,IF(dms_Model=\"Reset\",dms_060701_Reset_MaxRows,\"not a relevant RIN type\"))"]
[null,"How many columns in 6.7?   (4 or 5 feeder categories)",{"$f":"IF(dms_FifthFeeder_flag_NSP=\"NO\",\"This NSP has only 4 feeder categories\",\"This NSP has 5 feeder categories\")","v":"This NSP has only 4 feeder categories"}]
[null,"Table 6.7.1 - Last column (# of feeder categories > 4)",{"$f":"IF(dms_FifthFeeder_flag_NSP=\"NO\",10,12)","v":10},"dms_060701_MaxCols","=IF(dms_FifthFeeder_flag_NSP=\"NO\",8,10)"]
[null,"Table 6.7.1 - Number of offset rows",{"$f":"IF(dms_Model=\"ARR\",15,9)","v":9},"dms_060701_OffsetRows","=IF(dms_Model=\"ARR\",15,9)"]
[null,"Start date for telephone answering in 6.1 or 6.7?",null,null,"Using 060101 as naming standard not 060701 for start dates"]
[null,"Table 6.1.1 and 6.7.1 - Start Date as Text",{"$f":"IF(dms_SingleYearModel=\"yes\",(CONCATENATE(IF(LEN(CRY)=4,\"1-Jan-\",\"1-Jul-\"),LEFT(CRY,4))),(CONCATENATE(IF(LEN(PRCP_y4)=4,\"1-Jan-\",\"1-Jul-\"),LEFT(PRCP_y4,4))))","v":"1-Jul-2005"},"dms_060101_StartDateTxt","=IF(SUM(dms_SingleYear_Model)>1,(CONCATENATE(IF(LEN(CRY)=4,\"1-Jan-\",\"1-Jul-\"),LEFT(CRY,4))),(CONCATENATE(IF(LEN(CRCP_y4)=4,\"1-Jan-\",\"1-Jul-\"),LEFT(CRCP_y4,4))))"]
[null,"Table 6.1.1 and 6.7.1 - Start Date as Date Value",{"$f":"DATEVALUE(dms_060701_StartDateTxt)","v":38534},"dms_060101_StartDateVal","=DATEVALUE(dms_060701_StartDateTxt)"]
[null,"ARRs"]
[null,"How many rows in table 6.8?","insert dms_060801_StartCell NR if required",null,"dms_060801_StartCell is only found on worksheet 6.8 and is used to determine the starting date for the date range"]
[null,"Is dms_060801_StartCell named range present?","yes",null,"=IFERROR(IF((ROW(dms_060801_StartCell)-1)=1,\"yes\",\"yes\"),\"no\")"]
[null,"Table 6.8 - Number of offset rows",12,"dms_0608_OffsetRows","=IFERROR(IF(dms_Model=\"ARR\",(ROW(dms_060801_StartCell)-1),\"not an ARR\"),\"6.8 error\")"]
[null,"Table 6.8 - Last row","6.8 not present","dms_0608_LastRow","=IFERROR(IF(dms_060801_StartCell<>\"\",IF(dms_Model=\"ARR\",(LOOKUP(2,1/(dms_060801_01_Values<>\"\"),(ROW(dms_060801_01_Values)))),\"not an ARR\"),0),\"6.8 not present\")"]
[null,"Table 6.8 - MaxRows",{"$f":"IFERROR(IF(dms_Model=\"ARR\",(MAX(0,dms_0608_LastRow-dms_0608_OffsetRows)),\"not an ARR\"),\"6.8 not present\")","v":"not an ARR"},"dms_060801_MaxRows","=IFERROR(IF(dms_Model=\"ARR\",(MAX(0,dms_0608_LastRow-dms_0608_OffsetRows)),\"not an ARR\"),\"6.8 not present\")"]
[null,"TNSP RESET RINS"]
[null,"Table 7.9.4 only appears in TNSPs Reset RIN"]
[null,"Table 7.9.4 - first year",{"$f":"LEFT(PRCP_y3,4)","v":"2012"},"dms_070904_Start_Year","=LEFT(PRCP_y3,4)"]
[null,"SUBSET FILES"]
[null,"Is this Submission File a Subset File","YES","dms_Partial"]
[null,"MISC"]
[null,"Distribution Determination Reference",{"$f":"INDEX(dms_DeterminationRef_List,MATCH(dms_TradingName,dms_TradingName_List))","v":"2015-20 Distribution Determination"},"dms_DeterminationRef"]
[null,"Public lighting NSP?",{"$f":"INDEX(dms_Public_Lighting_List,MATCH(dms_TradingName,dms_TradingName_List))","v":"NO"},"dms_Public_Lighting","=INDEX(dms_Public_Lighting_List,MATCH(dms_TradingName,dms_TradingName_List))"]
[null,"CBD Feeder for this business",{"$f":"INDEX(dms_CBD_flag,MATCH(dms_TradingName,dms_TradingName_List))","v":"NO"},"dms_CBD_flag_NSP"]
[null,"Urban Feeder for this business",{"$f":"INDEX(dms_Urban_flag,MATCH(dms_TradingName,dms_TradingName_List))","v":"NO"},"dms_Urban_flag_NSP"]
[null,"Short rural Feeder for this business",{"$f":"INDEX(dms_ShortRural_flag,MATCH(dms_TradingName,dms_TradingName_List))","v":"YES"},"dms_ShortRural_flag_NSP"]
[null,"Long rural Feeder for this business",{"$f":"INDEX(dms_LongRural_flag,MATCH(dms_TradingName,dms_TradingName_List))","v":"YES"},"dms_LongRural_flag_NSP"]
[null,"Fifth Feeder Category (eg. TasNetworks (D))",{"$f":"INDEX(dms_FeederType_5_flag,MATCH(dms_TradingName,dms_TradingName_List))","v":"NO"},"dms_FifthFeeder_flag_NSP","=INDEX(dms_FeederType_5_flag,MATCH(dms_TradingName,dms_TradingName_List))"]
[]
[null,"DISCARD FILES"]
[null,"discard this record?","NO","dms_DISCARD","If record is to be discarded from DB set this flag to YES"]
[]
[null,"USES NAMED RANGES FLAG","yes","dms_Defined_Names_Used"]
[]
[null,"REGULATORY YEARS FOR MULTI RYE SUBMISSIONS"]
[null,"Multiple RYE flag","YES","dms_Multi_RYE_flag"]
[null,null,"Manually specify RYE","Named ranges to apply"]
[null,null,2013,"dms_RYE_01"]
[null,null,2014,"dms_RYE_02"]
[null,null,2015,"dms_RYE_03"]
[null,null,2016,"dms_RYE_04"]
[null,null,2017,"dms_RYE_05"]
[null,null,2018,"dms_RYE_06"]
[null,null,2019,"dms_RYE_07"]
[null,null,2020,"dms_RYE_08"]
[null,null,2021,"dms_RYE_09"]

{"sheet":"Contents","index":4,"n_rows":12,"n_cols":2,"rows_kept":12,"cut":false,"hidden":false,"merged":[]}
[null,"REGULATORY REPORTING STATEMENT"]
[null,{"$f":"dms_TradingName","v":"SA Power Networks"}]
[null,{"$f":"CONCATENATE(\"Benchmarking RIN response \",CRY)","v":"Benchmarking RIN response 2005-06"}]
[]
[null,"CONTENTS"]
[]
[]
[]
[]
[]
[]
[null,"3.             ECONOMIC BENCHMARKING"]

{"sheet":"3.1 Revenue","index":5,"n_rows":48,"n_cols":29,"rows_kept":48,"cut":false,"hidden":false,"merged":[[40,16,40,28],[8,2,8,14],[28,2,28,14],[40,2,40,14],[9,2,9,14],[27,2,27,14],[39,2,39,14],[8,16,8,28],[9,16,9,28],[27,16,27,28],[39,16,39,28],[28,16,28,28]]}
[null,"REGULATORY REPORTING STATEMENT"]
[null,{"$f":"INDEX(dms_TradingNameFull_List,MATCH(dms_TradingName,dms_TradingName_List))","v":"SA Power Networks"}]
[null,{"$f":"CONCATENATE(\"ECONOMIC BENCHMARKING \",IF(SUM(dms_SingleYear_Model)>0,CRY,CONCATENATE(dms_CRCP_FirstYear_Result,\" to \",dms_CRCP_FinalYear_Result)))","v":"ECONOMIC BENCHMARKING 2005-06"}]
[null,"3.1 REVENUE"]
[]
[null,"There are THREE (x TWO) tables on this worksheet. Both ROWS and COLUMNS have been grouped for ease of navigation. see the Instructions sheet on how to group or ungroup tables. "]
[]
[null,"3.1.1 - REVENUE GROUPING BY CHARGEABLE QUANTITY"]
[null,null,"STANDARD CONTROL SERVICES",null,null,null,null,null,null,null,null,null,null,null,null,null,"ALTERNATIVE CONTROL SERVICES"]
[null,null,"REVENUE\n($0's)",null,null,null,null,null,null,null,null,null,null,null,null,null,"REVENUE\n($0's)"]
[null,null,{"$f":"IF(dms_RPT=\"financial\",dms_fy1,dms_cy1)","v":"2005-06"},{"$f":"IF(dms_RPT=\"financial\",dms_fy2,dms_cy2)","v":"2006-07"},{"$f":"IF(dms_RPT=\"financial\",dms_fy3,dms_cy3)","v":"2007-08"},{"$f":"IF(dms_RPT=\"financial\",dms_fy4,dms_cy4)","v":"2008-09"},{"$f":"IF(dms_RPT=\"financial\",dms_fy5,dms_cy5)","v":"2009-10"},{"$f":"IF(dms_RPT=\"financial\",dms_fy6,dms_cy6)","v":"2010-11"},{"$f":"IF(dms_RPT=\"financial\",dms_fy7,dms_cy7)","v":"2011-12"},{"$f":"IF(dms_RPT=\"financial\",dms_fy8,dms_cy8)","v":"2012-13"},{"$f":"IF(dms_RPT=\"financial\",dms_fy9,dms_cy9)","v":"2013-14"},{"$f":"IF(dms_RPT=\"financial\",dms_fy10,dms_cy10)","v":"2014-15"},{"$f":"IF(dms_RPT=\"financial\",dms_fy11,dms_cy11)","v":"2015-16"},{"$f":"IF(dms_RPT=\"financial\",dms_fy12,dms_cy12)","v":"2016-17"},{"$f":"IF(dms_RPT=\"financial\",dms_fy13,dms_cy13)","v":"2017-18"},null,{"$f":"IF(dms_RPT=\"financial\",dms_fy1,dms_cy1)","v":"2005-06"},{"$f":"IF(dms_RPT=\"financial\",dms_fy2,dms_cy2)","v":"2006-07"},{"$f":"IF(dms_RPT=\"financial\",dms_fy3,dms_cy3)","v":"2007-08"},{"$f":"IF(dms_RPT=\"financial\",dms_fy4,dms_cy4)","v":"2008-09"},{"$f":"IF(dms_RPT=\"financial\",dms_fy5,dms_cy5)","v":"2009-10"},{"$f":"IF(dms_RPT=\"financial\",dms_fy6,dms_cy6)","v":"2010-11"},{"$f":"IF(dms_RPT=\"financial\",dms_fy7,dms_cy7)","v":"2011-12"},{"$f":"IF(dms_RPT=\"financial\",dms_fy8,dms_cy8)","v":"2012-13"},{"$f":"IF(dms_RPT=\"financial\",dms_fy9,dms_cy9)","v":"2013-14"},{"$f":"IF(dms_RPT=\"financial\",dms_fy10,dms_cy10)","v":"2014-15"},{"$f":"IF(dms_RPT=\"financial\",dms_fy11,dms_cy11)","v":"2015-16"},{"$f":"IF(dms_RPT=\"financial\",dms_fy12,dms_cy12)","v":"2016-17"},{"$f":"IF(dms_RPT=\"financial\",dms_fy13,dms_cy13)","v":"2017-18"}]
["DREV0101","Revenue from Fixed Customer Charges ",74664482,68970076,69592647,75700128,79988029,67306360,72055893,78952501,85294000,92995326,80077619,82997063.311808631,111585535.62103264,null,0,0,0,0,0,0,0,0,0,0,0,0,0]
["DREV0102","Revenue from Energy Delivery charges where time of use is not a determinant",230658209,247448719,254428363,263350398.99999997,282511808,295043152,364761567,379332640,402270000,424592256,413907812,431147157.85078001,433387519.96559149,null,0,0,0,0,0,0,0,0,0,0,0,0,0]
["DREV0103","Revenue from On–Peak Energy Delivery charges ",81450310,88849727,87734803,90924377,94469296,79694356,104931800,113533531,121225000,126440410,32583593,26762857,26731974,null,0,0,0,0,0,0,0,0,0,0,0,0,0]
["DREV0104","Revenue from Shoulder period Energy Delivery Charges",0,0,0,0,0,0,0,0,0,0,0,0,0,null,0,0,0,0,0,0,0,0,0,0,0,0,0]
["DREV0105","Revenue from Off–Peak Energy Delivery charges ",37626841,40877518,40221607,41387226,40904178,44031707,59589417,65409209,71350000,81151267,28386840,25406872,26162886,null,0,0,0,0,0,0,0,0,0,0,0,0,0]
["DREV0106","Revenue from controlled load customer charges",11880384,11594126,11205770,11637870,11712545,15077730,18315706,18569617,20018000,21765961,16549670.999999998,17228754.275723282,20134546.316401895,null,0,0,0,0,0,0,0,0,0,0,0,0,0]
["DREV0107","Revenue from unmetered supplies",3493788,3710918,3747293,3997544,3894497,4256553,5670347,6180126,7092000,7588957,5157246,6992604.1018198347,5006654.6941663707,null,0,0,0,0,0,0,0,0,0,0,0,0,0]
["DREV0108","Revenue from Contracted Maximum Demand charges",26807606,38418963,41379213,46377626,45492299,82896531,114806995,129641902,153835000,172096271,123495566,121018958.74949205,123314975.11781934,null,0,0,0,0,0,0,0,0,0,0,0,0,0]
["DREV0109","Revenue from Measured Maximum Demand charges",0,0,0,0,0,0,0,0,0,4179,16916040,22054668.669997573,25162768.735637106,null,0,0,0,0,0,0,0,0,0,0,0,0,0]
["DREV0110","Revenue from metering charges",0,0,0,0,0,0,0,0,0,0,0,0,0,null,0,0,0,0,0,18330000,21830000,23755000,25718000,27408080,17816089.331029683,22475203.087343663,20590250.521520317]
["DREV0111","Revenue from connection charges",0,0,0,0,0,0,0,0,0,0,0,0,0,null,0,0,0,0,0,0,0,0,0,0,0,0,0]
["DREV0112","Revenue from public lighting charges",0,0,0,0,0,0,0,0,0,0,0,0,0,null,14399204,15021226,15702294,15528930,15863913,15725738,16188559,16442892,17496924,17841458,17973491,15255240,17878260]
["DREV0113","Revenue from other Sources",-9303619.9999999963,-22196047.000000022,-9522696.000000054,-6818170.0000000419,-5657652.0000000019,28710611.000000034,33726275.000000022,25435473.999999929,-11193000,1483525,-38062705.536566369,22196934.777813505,17067560.717834804,null,11401498,14395482,17958318,20438643,20744918,27720939,25348547,22481414,18597517,23077887,74341593,57163205,61382361]
["DREV01","Total revenue by chargeable quantity",{"$f":"SUM(C12:C24)","v":457278000},{"$f":"SUM(D12:D24)","v":477674000},498786999.99999994,526556999.99999994,553315000,617017000,773858000,817054999.99999988,{"$f":"SUM(K12:K24)","v":849891000},928118152,{"$f":"SUM(M12:M24)","v":679011681.46343362},755805870.73743498,788554421.16848361,null,{"$f":"SUM(Q12:Q24)","v":25800702},{"$f":"SUM(R12:R24)","v":29416708},{"$f":"SUM(S12:S24)","v":33660612},{"$f":"SUM(T12:T24)","v":35967573},{"$f":"SUM(U12:U24)","v":36608831},{"$f":"SUM(V12:V24)","v":61776677},{"$f":"SUM(W12:W24)","v":63367106},{"$f":"SUM(X12:X24)","v":62679306},61812441,68327425,110131173.33102968,94893648.087343663,99850871.521520317]
[]
[null,"3.1.2 - REVENUE GROUPING BY CUSTOMER TYPE OR CLASS"]
[null,null,"STANDARD CONTROL SERVICES",null,null,null,null,null,null,null,null,null,null,null,null,null,"ALTERNATIVE CONTROL SERVICES"]
[null,null,"REVENUE\n($0's)",null,null,null,null,null,null,null,null,null,null,null,null,null,"REVENUE\n($0's)"]
[null,null,{"$f":"IF(dms_RPT=\"financial\",dms_fy1,dms_cy1)","v":"2005-06"},{"$f":"IF(dms_RPT=\"financial\",dms_fy2,dms_cy2)","v":"2006-07"},{"$f":"IF(dms_RPT=\"financial\",dms_fy3,dms_cy3)","v":"2007-08"},{"$f":"IF(dms_RPT=\"financial\",dms_fy4,dms_cy4)","v":"2008-09"},{"$f":"IF(dms_RPT=\"financial\",dms_fy5,dms_cy5)","v":"2009-10"},{"$f":"IF(dms_RPT=\"financial\",dms_fy6,dms_cy6)","v":"2010-11"},{"$f":"IF(dms_RPT=\"financial\",dms_fy7,dms_cy7)","v":"2011-12"},{"$f":"IF(dms_RPT=\"financial\",dms_fy8,dms_cy8)","v":"2012-13"},{"$f":"IF(dms_RPT=\"financial\",dms_fy9,dms_cy9)","v":"2013-14"},{"$f":"IF(dms_RPT=\"financial\",dms_fy10,dms_cy10)","v":"2014-15"},{"$f":"IF(dms_RPT=\"financial\",dms_fy11,dms_cy11)","v":"2015-16"},{"$f":"IF(dms_RPT=\"financial\",dms_fy12,dms_cy12)","v":"2016-17"},{"$f":"IF(dms_RPT=\"financial\",dms_fy13,dms_cy13)","v":"2017-18"},null,{"$f":"IF(dms_RPT=\"financial\",dms_fy1,dms_cy1)","v":"2005-06"},{"$f":"IF(dms_RPT=\"financial\",dms_fy2,dms_cy2)","v":"2006-07"},{"$f":"IF(dms_RPT=\"financial\",dms_fy3,dms_cy3)","v":"2007-08"},{"$f":"IF(dms_RPT=\"financial\",dms_fy4,dms_cy4)","v":"2008-09"},{"$f":"IF(dms_RPT=\"financial\",dms_fy5,dms_cy5)","v":"2009-10"},{"$f":"IF(dms_RPT=\"financial\",dms_fy6,dms_cy6)","v":"2010-11"},{"$f":"IF(dms_RPT=\"financial\",dms_fy7,dms_cy7)","v":"2011-12"},{"$f":"IF(dms_RPT=\"financial\",dms_fy8,dms_cy8)","v":"2012-13"},{"$f":"IF(dms_RPT=\"financial\",dms_fy9,dms_cy9)","v":"2013-14"},{"$f":"IF(dms_RPT=\"financial\",dms_fy10,dms_cy10)","v":"2014-15"},{"$f":"IF(dms_RPT=\"financial\",dms_fy11,dms_cy11)","v":"2015-16"},{"$f":"IF(dms_RPT=\"financial\",dms_fy12,dms_cy12)","v":"2016-17"},{"$f":"IF(dms_RPT=\"financial\",dms_fy13,dms_cy13)","v":"2017-18"}]
["DREV0201","Revenue from residential Customers ",250819800,265967624,272846658,285374746,309121798,312320224,376325950,395423285.99999994,422725000,454591900,365534674,378566181,400188934,null,0,0,0,0,0,15576000,18870000,20650000,22408000,24068810,15823960.712455528,19904012.427196935,17945970.995676506]
["DREV0202","Revenue from Non residential customers not on demand tariffs ",125655090,137222958,138162346,143713447,147468918,124273783,157121648,166071055,173015000,176476676,120676612,110820832,114021664,null,0,0,0,0,0,2242000,2706000,2855000,3077000,3140510,1992128.6185741522,2571190.660146723,2644279.5258438098]
["DREV0203","Revenue from Non-residential low voltage demand tariff customers ",58568961,63195556,64523983,70520516,70066040,113948708,157920052,177423771,205593000,232765713,184240406,191669044.9658981,206141532.46071756,null,0,0,0,0,0,358000,178000,175000,163000,139130,0,0,0]
["DREV0204","Revenue from Non-residential high voltage demand tariff customers ",28043981,29772991,29029416,29768917,28421399,33507121,43093728,46521288,52659000,55211381,41465449,45560274.453060046,46128076.74691581,null,0,0,0,0,0,154000,76000,75000,70000,59630,0,0,0]
["DREV0205","Revenue from unmetered supplies",3493788,3710918,3747293,3997544,3894497,4256553,5670347,6180126,7092000,7588957,5157246,6992604.1018198347,5006654.6941663707,null,0,0,0,0,0,0,0,0,0,0,0,0,0]
["DREV0206","Revenue from Other Customers",-9303619.9999999963,-22196047.000000022,-9522696.000000054,-6818170.0000000419,-5657652.0000000019,28710611.000000034,33726275.000000022,25435473.999999929,-11193000,1483525,-38062705.536566369,22196934.777813505,17067558.717834804,null,25800702,29416708,33660612,35967573,36608831,43446677,41537106,38924306,36094441,40919345,92315084,72418445,79260621]
["DREV02","Total revenue by customer class",{"$f":"SUM(C31:C36)","v":457278000},{"$f":"SUM(D31:D36)","v":477674000},498786999.99999994,526556999.99999994,553315000,617017000,773858000,817054999.99999988,{"$f":"SUM(K31:K36)","v":849891000},928118152,679011681.46343362,755805871.29859149,788554420.61963463,null,{"$f":"SUM(Q31:Q36)","v":25800702},{"$f":"SUM(R31:R36)","v":29416708},{"$f":"SUM(S31:S36)","v":33660612},{"$f":"SUM(T31:T36)","v":35967573},{"$f":"SUM(U31:U36)","v":36608831},{"$f":"SUM(V31:V36)","v":61776677},{"$f":"SUM(W31:W36)","v":63367106},{"$f":"SUM(X31:X36)","v":62679306},61812441,68327425,110131173.33102968,94893648.087343663,99850871.521520317]
[]
[null,"3.1.3 - REVENUE (penalties) ALLOWED (deducted) THROUGH INCENTIVE SCHEMES"]
[null,null,"STANDARD CONTROL SERVICES",null,null,null,null,null,null,null,null,null,null,null,null,null,"ALTERNATIVE CONTROL SERVICES"]
[null,null,"REVENUE\n($0's)",null,null,null,null,null,null,null,null,null,null,null,null,null,"REVENUE\n($0's)"]
[null,null,{"$f":"IF(dms_RPT=\"financial\",dms_fy1,dms_cy1)","v":"2005-06"},{"$f":"IF(dms_RPT=\"financial\",dms_fy2,dms_cy2)","v":"2006-07"},{"$f":"IF(dms_RPT=\"financial\",dms_fy3,dms_cy3)","v":"2007-08"},{"$f":"IF(dms_RPT=\"financial\",dms_fy4,dms_cy4)","v":"2008-09"},{"$f":"IF(dms_RPT=\"financial\",dms_fy5,dms_cy5)","v":"2009-10"},{"$f":"IF(dms_RPT=\"financial\",dms_fy6,dms_cy6)","v":"2010-11"},{"$f":"IF(dms_RPT=\"financial\",dms_fy7,dms_cy7)","v":"2011-12"},{"$f":"IF(dms_RPT=\"financial\",dms_fy8,dms_cy8)","v":"2012-13"},{"$f":"IF(dms_RPT=\"financial\",dms_fy9,dms_cy9)","v":"2013-14"},{"$f":"IF(dms_RPT=\"financial\",dms_fy10,dms_cy10)","v":"2014-15"},{"$f":"IF(dms_RPT=\"financial\",dms_fy11,dms_cy11)","v":"2015-16"},{"$f":"IF(dms_RPT=\"financial\",dms_fy12,dms_cy12)","v":"2016-17"},{"$f":"IF(dms_RPT=\"financial\",dms_fy13,dms_cy13)","v":"2017-18"},null,{"$f":"IF(dms_RPT=\"financial\",dms_fy1,dms_cy1)","v":"2005-06"},{"$f":"IF(dms_RPT=\"financial\",dms_fy2,dms_cy2)","v":"2006-07"},{"$f":"IF(dms_RPT=\"financial\",dms_fy3,dms_cy3)","v":"2007-08"},{"$f":"IF(dms_RPT=\"financial\",dms_fy4,dms_cy4)","v":"2008-09"},{"$f":"IF(dms_RPT=\"financial\",dms_fy5,dms_cy5)","v":"2009-10"},{"$f":"IF(dms_RPT=\"financial\",dms_fy6,dms_cy6)","v":"2010-11"},{"$f":"IF(dms_RPT=\"financial\",dms_fy7,dms_cy7)","v":"2011-12"},{"$f":"IF(dms_RPT=\"financial\",dms_fy8,dms_cy8)","v":"2012-13"},{"$f":"IF(dms_RPT=\"financial\",dms_fy9,dms_cy9)","v":"2013-14"},{"$f":"IF(dms_RPT=\"financial\",dms_fy10,dms_cy10)","v":"2014-15"},{"$f":"IF(dms_RPT=\"financial\",dms_fy11,dms_cy11)","v":"2015-16"},{"$f":"IF(dms_RPT=\"financial\",dms_fy12,dms_cy12)","v":"2016-17"},{"$f":"IF(dms_RPT=\"financial\",dms_fy13,dms_cy13)","v":"2017-18"}]
["DREV0301","EBSS"]
["DREV0302","STPIS"]
["DREV0303","F-Factor "]
["DREV0304","S-Factor True up"]
["DREV0305","Other"]
["DREV03","Total revenue of incentive schemes",{"$f":"SUM(C43:C47)","v":0},{"$f":"SUM(D43:D47)","v":0},0,0,0,0,0,0,{"$f":"SUM(K43:K47)","v":0},0,0,0,0,null,{"$f":"SUM(Q43:Q47)","v":0},{"$f":"SUM(R43:R47)","v":0},{"$f":"SUM(S43:S47)","v":0},{"$f":"SUM(T43:T47)","v":0},{"$f":"SUM(U43:U47)","v":0},{"$f":"SUM(V43:V47)","v":0},{"$f":"SUM(W43:W47)","v":0},{"$f":"SUM(X43:X47)","v":0},0,0,0,0,0]

{"sheet":"3.2 Operating expenditure","index":6,"n_rows":196,"n_cols":30,"rows_kept":196,"cut":false,"hidden":false,"merged":[[61,3,61,15],[61,17,61,29],[181,3,181,15],[181,17,181,29],[108,3,108,15],[108,17,108,29],[159,3,159,15],[159,17,159,29],[170,3,170,15],[170,17,170,29],[8,1,8,3],[194,3,194,15],[13,3,13,15],[13,17,13,29],[182,3,182,15],[182,17,182,29],[109,3,109,15],[109,17,109,29],[160,3,160,15],[160,17,160,29],[171,3,171,15],[171,17,171,29],[12,3,12,15],[12,17,12,29],[60,3,60,15],[60,17,60,29]]}
[null,"REGULATORY REPORTING STATEMENT"]
[null,{"$f":"INDEX(dms_TradingNameFull_List,MATCH(dms_TradingName,dms_TradingName_List))","v":"SA Power Networks"}]
[null,{"$f":"CONCATENATE(\"ECONOMIC BENCHMARKING \",IF(SUM(dms_SingleYear_Model)>0,CRY,CONCATENATE(dms_CRCP_FirstYear_Result,\" to \",dms_CRCP_FinalYear_Result)))","v":"ECONOMIC BENCHMARKING 2005-06"}]
[null,"3.2 OPERATING EXPENDITURE"]
[]
[null,"There are THREE tables on this worksheet. Each has been grouped for ease of navigation. see the Instructions sheet on how to group or ungroup tables. "]
[]
[null,"Instructions"]
[null,{"$f":"CONCATENATE(\"Please list current opex categories in tables 3.2.1 and 3.2.2 and provide opex data as required.\",\"  Where opex categories have changed at any time during the \",CRY, \" to \",dms_MultiYear_FinalYear_Result,\" regulatory period, list previous opex categories in the 'Historical' sub-table and provide opex data as required.\")","v":"Please list current opex categories in tables 3.2.1 and 3.2.2 and provide opex data as required.  Where opex categories have changed at any time during the 2005-06 to 2017-18 regulatory period, list previous opex categories in the 'Historical' sub-table and provide opex data as required."}]
[]
[null,"3.2.1 - OPEX CATEGORIES"]
[null,"CURRENT OPEX CATEGORIES AND COST ALLOCATIONS"]
[null,null,null,"STANDARD CONTROL SERVICES",null,null,null,null,null,null,null,null,null,null,null,null,null,"ALTERNATIVE CONTROL SERVICES"]
[null,null,null,"EXPENDITURE\n($0's)",null,null,null,null,null,null,null,null,null,null,null,null,null,"EXPENDITURE\n($0's)"]
[null,null,null,{"$f":"IF(dms_RPT=\"financial\",dms_fy1,dms_cy1)","v":"2005-06"},{"$f":"IF(dms_RPT=\"financial\",dms_fy2,dms_cy2)","v":"2006-07"},{"$f":"IF(dms_RPT=\"financial\",dms_fy3,dms_cy3)","v":"2007-08"},{"$f":"IF(dms_RPT=\"financial\",dms_fy4,dms_cy4)","v":"2008-09"},{"$f":"IF(dms_RPT=\"financial\",dms_fy5,dms_cy5)","v":"2009-10"},{"$f":"IF(dms_RPT=\"financial\",dms_fy6,dms_cy6)","v":"2010-11"},{"$f":"IF(dms_RPT=\"financial\",dms_fy7,dms_cy7)","v":"2011-12"},{"$f":"IF(dms_RPT=\"financial\",dms_fy8,dms_cy8)","v":"2012-13"},{"$f":"IF(dms_RPT=\"financial\",dms_fy9,dms_cy9)","v":"2013-14"},{"$f":"IF(dms_RPT=\"financial\",dms_fy10,dms_cy10)","v":"2014-15"},{"$f":"IF(dms_RPT=\"financial\",dms_fy11,dms_cy11)","v":"2015-16"},{"$f":"IF(dms_RPT=\"financial\",dms_fy12,dms_cy12)","v":"2016-17"},{"$f":"IF(dms_RPT=\"financial\",dms_fy13,dms_cy13)","v":"2017-18"},null,{"$f":"IF(dms_RPT=\"financial\",dms_fy1,dms_cy1)","v":"2005-06"},{"$f":"IF(dms_RPT=\"financial\",dms_fy2,dms_cy2)","v":"2006-07"},{"$f":"IF(dms_RPT=\"financial\",dms_fy3,dms_cy3)","v":"2007-08"},{"$f":"IF(dms_RPT=\"financial\",dms_fy4,dms_cy4)","v":"2008-09"},{"$f":"IF(dms_RPT=\"financial\",dms_fy5,dms_cy5)","v":"2009-10"},{"$f":"IF(dms_RPT=\"financial\",dms_fy6,dms_cy6)","v":"2010-11"},{"$f":"IF(dms_RPT=\"financial\",dms_fy7,dms_cy7)","v":"2011-12"},{"$f":"IF(dms_RPT=\"financial\",dms_fy8,dms_cy8)","v":"2012-13"},{"$f":"IF(dms_RPT=\"financial\",dms_fy9,dms_cy9)","v":"2013-14"},{"$f":"IF(dms_RPT=\"financial\",dms_fy10,dms_cy10)","v":"2014-15"},{"$f":"IF(dms_RPT=\"financial\",dms_fy11,dms_cy11)","v":"2015-16"},{"$f":"IF(dms_RPT=\"financial\",dms_fy12,dms_cy12)","v":"2016-17"},{"$f":"IF(dms_RPT=\"financial\",dms_fy13,dms_cy13)","v":"2017-18"}]
["DOPEX0101","Distribution licence fee",null,3132731,3203241.64,3433783.04,3522151.27,3382368.99,3320000,3320000,3320000,3323542.46,3326815.8899999997,2558186.8199999998,2263400,2299110.1399999997,null,0,0,0,0,0,0,0,0,0,0,0,0,0]
["DOPEX0102","Network operating costs",null,12595317,14920724,15408742,17395591.170000002,18616920.539999999,20287288.109999999,20849359.650000002,23160851.859999999,27336176.469999999,27206508.059999999,26327893.280000001,25867915.960000001,35713998.703549907,null,0,0,0,0,0,0,0,0,0,0,0,0,0]
["DOPEX0103","Inspections",null,3819171,3656722,4178947,3977105.04,5036673.07,8350116.8700000001,9540735.5700000003,12957458.039999999,11491685.450000001,14446039.109999999,13641343.41,13701623.130000001,11939438.675151819,null,0,0,0,0,0,0,0,0,0,0,0,0,0]
["DOPEX0104","Maintenance and repair",null,10396545.959498011,11393743.464111309,12072915.700373184,14588350.574423777,14942293.770053938,15275542.43965191,19422958.736582857,18916503.692142446,27746730.554379135,24931363.569985077,22920361.272745412,28309164.655529939,29598223.842678782,null,806209.2,993904.61,904287.27,1062852.1600000001,1510426.67,1585809.31,1713495.9899999998,1366898.71,1155191.4300000002,1093158.55,2726925.52,1988466.6300000001,1651037.6532043852]
["DOPEX0105","Substation property maintenance",null,1941233.2228100004,2454708.1817549998,2526149.9121249998,2477025.6788349999,2754649.7133200001,4044977.8525549993,3901044.4842500011,4719734.288145001,6559950.2004150003,7388833.1031400003,6786534.6720575998,6762167.8877772288,7818000.8856300004,null,0,0,0,0,0,0,0,0,0,0,0,0,0]
["DOPEX0106","Vegetation management",null,13110560,9204002,16097835,14441385.010000002,14943809.040000001,21986577.719999999,37234678.900000006,41566007.789999999,35953469.82,46802128.289999999,32029751.129999999,31138908.849999994,38365210.349408701,null,0,0,0,0,0,0,0,0,0,0,0,0,0]
["DOPEX0107","Emergency response",null,19188515,19348890,23858840,27719580.949999999,27148980.809999999,30181240.950000007,26388299.759999998,32431747.540000003,32436176.540000003,32849401.830000006,34747494.260000005,44966413.839999989,35434504.431148127,null,0,0,0,0,0,0,0,0,0,0,0,0,0]
["DOPEX0108","Demand management",null,863317,3434796,2315092,3482231.2199999997,1557888.9,5116785.83,2257974.5499999998,3006988.31,2616143.66,2669305.17,0,0,0,null,0,0,0,0,0,0,0,0,0,0,0,0,0]
["DOPEX0109","Guaranteed service level payments",null,2026284,493257,845868,543595.44999999995,1297764,7052285,2996580,4762807,9923975,3713691.06,3389550,25515380.57,1867082.6400000006,null,0,0,0,0,0,0,0,0,0,0,0,0,0]
["DOPEX0110","Network insurance",null,3123710.2189999996,2310392.7840700001,2149102.9070000001,2603143.3819299992,2327088.2058199998,2405877.4754699999,2682356.4886999996,3282566.0392699996,2902521.7087999997,2645505.0603800002,1641531.1881209998,1827737.5352422667,1872276.6428235292,null,0,0,0,0,0,0,0,0,0,0,0,0,0]
["DOPEX0111","Call centre",null,2390498.67,2466558.66,2547589.98,2367686.37,2222958.54,2466427.08,2644297.71,2746663.94,2887267.4299999997,3158852.8600000003,3210252.2,3297340.3499999996,3579417.2399999993,null,0,0,0,0,0,0,0,0,0,0,0,0,0]
["DOPEX0112","Customer billing (previously full retail contestability)",null,10861276.5,9584756.0599999987,10879884.18,11557342.250000002,13151521.25,16072343.93,15029933.75,15739466.949999999,16595731.469999999,17340798.574999999,15865522.385866668,15528517.489400003,15155255.499533333,null,0,0,0,0,0,0,0,0,0,0,2328232.1091333334,2193106.8755999999,2224792.630466667]
["DOPEX0113","Meter reading",null,0,0,0,0,0,0,0,0,0,0,0,0,0,null,3646475.52,3145465.4,3171965.33,3331587.42,3388650.5199999996,3396889.9299999997,3383420.6799999997,3576787.2800000003,3513198.54,3566560.76,3562050.0499999993,3632790.0099999988,3097098.0399999996]
["DOPEX0114","Other customer services",null,1881862.7430491706,3029505.4334063856,3665343.0047184522,3760340.560044283,4156132.6521648085,4903555.4988308921,6289753.7350067636,6421255.7087494191,6490666.7434076406,6434012.121041771,6946344.6208092701,7679470.2457571886,9266336.7342532706,null,275169.58695082954,431314.56659361441,584236.01528154779,758859.08995571604,990066.05783519137,802856.62116910797,864019.66499323724,726764.35125058063,755008.10659236135,626472.25895822921,1138391.7691907287,1072517.9642428108,824736.38454724115]
["DOPEX0115","Corporate costs and other operating",null,31467839.59006213,28409707.154676031,32113606.308745153,42007130.156599186,42581384.933266923,57741204.832698107,61281158.152199492,58733842.854933321,64921341.851177715,67748422.762469605,52874705.793141983,58995611.877521463,72593463.513004869,null,2820573.5122487899,2653295.4080072688,3820412.7548414497,4305979.8920165822,4467571.7244906276,4793064.4623538004,5634173.1098131146,3989372.164826205,4463089.9486282757,4254116.4438143829,5655373.516690365,5382073.740658748,9039711.1234824136]
["DOPEX0116","Public lighting ",null,0,0,0,0,0,0,0,0,0,0,0,0,0,null,3252274,4757540,5890231,4553703.8040161151,5075073.8449096726,4830457.1876525925,5324120.5558776818,6175241.1734399423,6894329.3600000013,6984583.1200000001,7322865.1100000013,8687201.540000001,13325496.087399736]
["DOPEX0117","Fee-based and quoted services",null,0,0,0,0,0,0,0,0,0,0,0,0,0,null,8234851,9919009,10156680,12771953.311285926,14299984.255197937,23210382.051261138,17321000.53005638,16642164.591203531,15725471.390922602,17211437.215243969,44263232.96675618,33332470.495247528,35922833.178634971]
["DOPEX0118"]
["DOPEX0119"]
["DOPEX0120"]
["DOPEX0121"]
["DOPEX0122"]
["DOPEX0123"]
["DOPEX0124"]
["DOPEX0125"]
["DOPEX0126"]
["DOPEX0127"]
["DOPEX0128"]
["DOPEX0129"]
["DOPEX0130"]
["DOPEX0131"]
["DOPEX0132"]
["DOPEX0133"]
["DOPEX0134"]
["DOPEX0135"]
["DOPEX0136"]
["DOPEX0137"]
["DOPEX0138"]
["DOPEX0139"]
["DOPEX0140"]
["DOPEX0141"]
["DOPEX0142"]
["DOPEX01","Total opex ",null,{"$f":"SUM(D16:D57)","v":116798861.90441932},113911004.37801874,132093699.03296179,150442659.08183226,154120434.41462567,199204223.58920589,213839131.4867391,231765894.01324019,{"$f":"SUM(L16:L57)","v":251185379.35817948},260661677.46201646,222939471.03274193,null,265502319.29718229,null,{"$f":"SUM(R16:R57)","v":19035552.819199618},{"$f":"SUM(S16:S57)","v":21900528.984600883},{"$f":"SUM(T16:T57)","v":24527812.370122999},{"$f":"SUM(U16:U57)","v":26784935.677274339},{"$f":"SUM(V16:V57)","v":29731773.072433427},{"$f":"SUM(W16:W57)","v":38619459.56243664},{"$f":"SUM(X16:X57)","v":34240230.53074041},{"$f":"SUM(Y16:Y57)","v":32477228.270720258},{"$f":"SUM(Z16:Z57)","v":32506288.776143242},33736328.348016582,66997071.041770607,null,{"$f":"SUM(AD16:AD57)","v":66085705.097735412}]
[]
[null,"A: HISTORICAL OPEX CATEGORIES AND COST ALLOCATIONS"]
[null,null,null,"STANDARD CONTROL SERVICES",null,null,null,null,null,null,null,null,null,null,null,null,null,"ALTERNATIVE CONTROL SERVICES"]
[null,null,null,"EXPENDITURE\n($0's)",null,null,null,null,null,null,null,null,null,null,null,null,null,"EXPENDITURE\n($0's)"]
[null,null,null,{"$f":"IF(dms_RPT=\"financial\",dms_fy1,dms_cy1)","v":"2005-06"},{"$f":"IF(dms_RPT=\"financial\",dms_fy2,dms_cy2)","v":"2006-07"},{"$f":"IF(dms_RPT=\"financial\",dms_fy3,dms_cy3)","v":"2007-08"},{"$f":"IF(dms_RPT=\"financial\",dms_fy4,dms_cy4)","v":"2008-09"},{"$f":"IF(dms_RPT=\"financial\",dms_fy5,dms_cy5)","v":"2009-10"},{"$f":"IF(dms_RPT=\"financial\",dms_fy6,dms_cy6)","v":"2010-11"},{"$f":"IF(dms_RPT=\"financial\",dms_fy7,dms_cy7)","v":"2011-12"},{"$f":"IF(dms_RPT=\"financial\",dms_fy8,dms_cy8)","v":"2012-13"},{"$f":"IF(dms_RPT=\"financial\",dms_fy9,dms_cy9)","v":"2013-14"},{"$f":"IF(dms_RPT=\"financial\",dms_fy10,dms_cy10)","v":"2014-15"},{"$f":"IF(dms_RPT=\"financial\",dms_fy11,dms_cy11)","v":"2015-16"},{"$f":"IF(dms_RPT=\"financial\",dms_fy12,dms_cy12)","v":"2016-17"},{"$f":"IF(dms_RPT=\"financial\",dms_fy13,dms_cy13)","v":"2017-18"},null,{"$f":"IF(dms_RPT=\"financial\",dms_fy1,dms_cy1)","v":"2005-06"},{"$f":"IF(dms_RPT=\"financial\",dms_fy2,dms_cy2)","v":"2006-07"},{"$f":"IF(dms_RPT=\"financial\",dms_fy3,dms_cy3)","v":"2007-08"},{"$f":"IF(dms_RPT=\"financial\",dms_fy4,dms_cy4)","v":"2008-09"},{"$f":"IF(dms_RPT=\"financial\",dms_fy5,dms_cy5)","v":"2009-10"},{"$f":"IF(dms_RPT=\"financial\",dms_fy6,dms_cy6)","v":"2010-11"},{"$f":"IF(dms_RPT=\"financial\",dms_fy7,dms_cy7)","v":"2011-12"},{"$f":"IF(dms_RPT=\"financial\",dms_fy8,dms_cy8)","v":"2012-13"},{"$f":"IF(dms_RPT=\"financial\",dms_fy9,dms_cy9)","v":"2013-14"},{"$f":"IF(dms_RPT=\"financial\",dms_fy10,dms_cy10)","v":"2014-15"},{"$f":"IF(dms_RPT=\"financial\",dms_fy11,dms_cy11)","v":"2015-16"},{"$f":"IF(dms_RPT=\"financial\",dms_fy12,dms_cy12)","v":"2016-17"},{"$f":"IF(dms_RPT=\"financial\",dms_fy13,dms_cy13)","v":"2017-18"}]
["DOPEX0101","Distribution licence fee",null,null,null,null,null,null,3320000,3320000,3320000,3323542.46,3326815.8899999997,2558186.8199999998,2263400,2299110.1399999997,null,null,null,null,null,null,0,0,0,0,0,0,0,0]
["DOPEX0102","Network operating costs",null,null,null,null,null,null,20287288.109999999,20849359.650000002,23160851.859999999,27336176.469999999,27206508.059999999,26327893.280000001,25867915.960000001,35713998.703549907,null,null,null,null,null,null,0,0,0,0,0,0,0,0]
["DOPEX0103","Inspections",null,null,null,null,null,null,8350116.8700000001,9540735.5700000003,12957458.039999999,11491685.450000001,14446039.109999999,13641343.41,13701623.130000001,11939438.675151819,null,null,null,null,null,null,0,0,0,0,0,0,0,0]
["DOPEX0104","Maintenance and repair",null,null,null,null,null,null,15275542.43965191,19422958.736582857,18916503.692142446,27746730.554379135,24931363.569985077,22920361.272745412,28309164.655529939,29598223.842678782,null,null,null,null,null,null,1585809.31,1713495.9899999998,1366898.71,1155191.4300000002,1093158.55,2726925.52,1988466.6300000001,1651037.6532043852]
["DOPEX0105","Substation property maintenance",null,null,null,null,null,null,4044977.8525549993,3901044.4842500011,4719734.288145001,6559950.2004150003,7388833.1031400003,6786534.6720575998,6762167.8877772288,7818000.8856300004,null,null,null,null,null,null,0,0,0,0,0,0,0,0]
["DOPEX0106","Vegetation management",null,null,null,null,null,null,21986577.719999999,37234678.900000006,41566007.789999999,35953469.82,46802128.289999999,32029751.129999999,31138908.849999994,38365210.349408701,null,null,null,null,null,null,0,0,0,0,0,0,0,0]
["DOPEX0107","Emergency response",null,null,null,null,null,null,30181240.950000007,26388299.759999998,32431747.540000003,32436176.540000003,32849401.830000006,34747494.260000005,44966413.839999989,35434504.431148127,null,null,null,null,null,null,0,0,0,0,0,0,0,0]
["DOPEX0108","Demand management",null,null,null,null,null,null,5116785.83,2257974.5499999998,3006988.31,2616143.66,2669305.17,0,0,0,null,null,null,null,null,null,0,0,0,0,0,0,0,0]
["DOPEX0109","Guaranteed service level payments",null,null,null,null,null,null,7052285,2996580,4762807,9923975,3713691.06,3389550,25515380.57,1867082.6400000006,null,null,null,null,null,null,0,0,0,0,0,0,0,0]
["DOPEX0110","Network insurance",null,null,null,null,null,null,2405877.4754699999,2682356.4886999996,3282566.0392699996,2902521.7087999997,2645505.0603800002,1641531.1881209998,1827737.5352422667,1872276.6428235292,null,null,null,null,null,null,0,0,0,0,0,0,0,0]
["DOPEX0111","Call centre",null,null,null,null,null,null,2466427.08,2644297.71,2746663.94,2887267.4299999997,3158852.8600000003,3210252.2,3297340.3499999996,3579417.2399999993,null,null,null,null,null,null,0,0,0,0,0,0,0,0]
["DOPEX0112","Customer billing (previously full retail contestability)",null,null,null,null,null,null,16072343.93,15029933.75,15739466.949999999,16595731.469999999,17340798.574999999,15865522.385866668,15528517.489400003,15155255.499533333,null,null,null,null,null,null,0,0,0,0,0,2328232.1091333334,2193106.8755999999,2224792.630466667]
["DOPEX0113","Meter reading",null,null,null,null,null,null,0,0,0,0,0,0,0,0,null,null,null,null,null,null,3396889.9299999997,3383420.6799999997,3576787.2800000003,3513198.54,3566560.76,3562050.0499999993,3632790.0099999988,3097098.0399999996]
["DOPEX0114","Other customer services",null,null,null,null,null,null,4903555.4988308921,6289753.7350067636,6421255.7087494191,6490666.7434076406,6434012.121041771,6946344.6208092701,7679470.2457571886,9266336.7342532706,null,null,null,null,null,null,802856.62116910797,864019.66499323724,726764.35125058063,755008.10659236135,626472.25895822921,1138391.7691907287,1072517.9642428108,824736.38454724115]
["DOPEX0115","Corporate costs and other operating",null,null,null,null,null,null,57741204.832698107,61281158.152199492,58733842.854933321,64921341.851177715,67748422.762469605,52874705.793141983,58995611.877521463,72593463.513004869,null,null,null,null,null,null,4793064.4623538004,5634173.1098131146,3989372.164826205,4463089.9486282757,4254116.4438143829,5655373.516690365,5382073.740658748,9039711.1234824136]
["DOPEX0116","Public lighting",null,null,null,null,null,null,0,0,0,0,0,0,0,0,null,null,null,null,null,null,4830457.1876525925,5324120.5558776818,6175241.1734399423,6894329.3600000013,6984583.1200000001,7322865.1100000013,8687201.540000001,13325496.087399736]
["DOPEX0117","Fee-based and quoted services",null,null,null,null,null,null,0,0,0,0,0,0,0,0,null,null,null,null,null,null,23210382.051261138,17321000.53005638,16642164.591203531,15725471.390922602,17211437.215243969,44263232.96675618,33332470.495247528,35922833.178634971]
["DOPEX0118"]
["DOPEX0119"]
["DOPEX0120"]
["DOPEX0121"]
["DOPEX0122"]
["DOPEX0123"]
["DOPEX0124"]
["DOPEX0125"]
["DOPEX0126"]
["DOPEX0127"]
["DOPEX0128"]
["DOPEX0129"]
["DOPEX0130"]
["DOPEX0131"]
["DOPEX0132"]
["DOPEX0133"]
["DOPEX0134"]
["DOPEX0135"]
["DOPEX0136"]
["DOPEX0137"]
["DOPEX0138"]
["DOPEX0139"]
["DOPEX0140"]
["DOPEX0141"]
["DOPEX0142"]
["DOPEX01","Total opex "]
[]
[null,"B: HISTORICAL OPEX CATEGORIES AND COST ALLOCATIONS"]
[null,null,null,"STANDARD CONTROL SERVICES",null,null,null,null,null,null,null,null,null,null,null,null,null,"ALTERNATIVE CONTROL SERVICES"]
[null,null,null,"EXPENDITURE\n($0's)",null,null,null,null,null,null,null,null,null,null,null,null,null,"EXPENDITURE\n($0's)"]
[null,null,null,{"$f":"IF(dms_RPT=\"financial\",dms_fy1,dms_cy1)","v":"2005-06"},{"$f":"IF(dms_RPT=\"financial\",dms_fy2,dms_cy2)","v":"2006-07"},{"$f":"IF(dms_RPT=\"financial\",dms_fy3,dms_cy3)","v":"2007-08"},{"$f":"IF(dms_RPT=\"financial\",dms_fy4,dms_cy4)","v":"2008-09"},{"$f":"IF(dms_RPT=\"financial\",dms_fy5,dms_cy5)","v":"2009-10"},{"$f":"IF(dms_RPT=\"financial\",dms_fy6,dms_cy6)","v":"2010-11"},{"$f":"IF(dms_RPT=\"financial\",dms_fy7,dms_cy7)","v":"2011-12"},{"$f":"IF(dms_RPT=\"financial\",dms_fy8,dms_cy8)","v":"2012-13"},{"$f":"IF(dms_RPT=\"financial\",dms_fy9,dms_cy9)","v":"2013-14"},{"$f":"IF(dms_RPT=\"financial\",dms_fy10,dms_cy10)","v":"2014-15"},{"$f":"IF(dms_RPT=\"financial\",dms_fy11,dms_cy11)","v":"2015-16"},{"$f":"IF(dms_RPT=\"financial\",dms_fy12,dms_cy12)","v":"2016-17"},{"$f":"IF(dms_RPT=\"financial\",dms_fy13,dms_cy13)","v":"2017-18"},null,{"$f":"IF(dms_RPT=\"financial\",dms_fy1,dms_cy1)","v":"2005-06"},{"$f":"IF(dms_RPT=\"financial\",dms_fy2,dms_cy2)","v":"2006-07"},{"$f":"IF(dms_RPT=\"financial\",dms_fy3,dms_cy3)","v":"2007-08"},{"$f":"IF(dms_RPT=\"financial\",dms_fy4,dms_cy4)","v":"2008-09"},{"$f":"IF(dms_RPT=\"financial\",dms_fy5,dms_cy5)","v":"2009-10"},{"$f":"IF(dms_RPT=\"financial\",dms_fy6,dms_cy6)","v":"2010-11"},{"$f":"IF(dms_RPT=\"financial\",dms_fy7,dms_cy7)","v":"2011-12"},{"$f":"IF(dms_RPT=\"financial\",dms_fy8,dms_cy8)","v":"2012-13"},{"$f":"IF(dms_RPT=\"financial\",dms_fy9,dms_cy9)","v":"2013-14"},{"$f":"IF(dms_RPT=\"financial\",dms_fy10,dms_cy10)","v":"2014-15"},{"$f":"IF(dms_RPT=\"financial\",dms_fy11,dms_cy11)","v":"2015-16"},{"$f":"IF(dms_RPT=\"financial\",dms_fy12,dms_cy12)","v":"2016-17"},{"$f":"IF(dms_RPT=\"financial\",dms_fy13,dms_cy13)","v":"2017-18"}]
["DOPEX0101","Distribution licence fee",null,2956278,2996107,3212627,3329137,3184514,null,null,null,null,null,null,null,null,null,0,0,0,0,0]
["DOPEX0102","Network operating costs",null,12595317,14920724,15408742,17395591,18616921,null,null,null,null,null,null,null,null,null,0,0,0,0,0]
["DOPEX0103","Inspections",null,3819171,3656722,4178947,3977105,5036673,null,null,null,null,null,null,null,null,null,0,0,0,0,0]
["DOPEX0104","Maintenance and repair",null,7534633,8622505,9084569,12161580,11979587,null,null,null,null,null,null,null,null,null,0,0,0,0,0]
["DOPEX0105","Substation property maintenance",null,4911837,5883903,6088614,6086984,6659605,null,null,null,null,null,null,null,null,null,0,0,0,0,0]
["DOPEX0106","Vegetation management",null,13110560,9204002,16097835,14441385,14943809,null,null,null,null,null,null,null,null,null,0,0,0,0,0]
["DOPEX0107","Emergency response",null,19188515,19348890,23858840,27719581,27148981,null,null,null,null,null,null,null,null,null,0,0,0,0,0]
["DOPEX0108","Demand management",null,863317,3434796,2315092,3482231,1557889,null,null,null,null,null,null,null,null,null,0,0,0,0,0]
["DOPEX0109","Guaranteed service level payments",null,2026284,493257,845868,543595,1297764,null,null,null,null,null,null,null,null,null,0,0,0,0,0]
["DOPEX0110","Network insurance",null,5787552,3695026,3941127,4322019,4262881,null,null,null,null,null,null,null,null,null,0,0,0,0,0]
["DOPEX0111","Call centre",null,2390498,2466558,2547590,2367686,2222959,null,null,null,null,null,null,null,null,null,0,0,0,0,0]
["DOPEX0112","Customer billing (previously full retail contestability)",null,10861277,9584756,10879884,11557342,13151521,null,null,null,null,null,null,null,null,null,0,0,0,0,0]
["DOPEX0113","Meter reading",null,3646475,3145466,3171965,3331588,3388651,null,null,null,null,null,null,null,null,null,0,0,0,0,0]
["DOPEX0114","Other customer services",null,1914436,3069011,3716931,3791610,4214006,null,null,null,null,null,null,null,null,null,0,0,0,0,0]
["DOPEX0115","Corporate costs and other operating",null,23224781,20652028,26381018,36262962,36615216,null,null,null,null,null,null,null,null,null,0,0,0,0,0]
["DOPEX0116","Public lighting",null,0,0,0,0,0,null,null,null,null,null,null,null,null,null,0,0,0,0,0]
["DOPEX0117","Fee-based and quoted services",null,0,0,0,0,0,null,null,null,null,null,null,null,null,null,0,0,0,0,0]
["DOPEX0118"]
["DOPEX0119"]
["DOPEX0120"]
["DOPEX0121"]
["DOPEX0122"]
["DOPEX0123"]
["DOPEX0124"]
["DOPEX0125"]
["DOPEX0126"]
["DOPEX0127"]
["DOPEX0128"]
["DOPEX0129"]
["DOPEX0130"]
["DOPEX0131"]
["DOPEX0132"]
["DOPEX0133"]
["DOPEX0134"]
["DOPEX0135"]
["DOPEX0136"]
["DOPEX0137"]
["DOPEX0138"]
["DOPEX0139"]
["DOPEX0140"]
["DOPEX0141"]
["DOPEX0142"]
["DOPEX01","Total opex "]
[]
[]
[]
[null,"3.2.2 - OPEX CONSISTENCY"]
[null,"OPEX CONSISTENCY - CURRENT COST ALLOCATION APPROACH"]
[null,null,null,"STANDARD CONTROL SERVICES",null,null,null,null,null,null,null,null,null,null,null,null,null,"ALTERNATIVE CONTROL SERVICES"]
[null,null,null,"EXPENDITURE\n($0's)",null,null,null,null,null,null,null,null,null,null,null,null,null,"EXPENDITURE\n($0's)"]
[null,null,null,{"$f":"IF(dms_RPT=\"financial\",dms_fy1,dms_cy1)","v":"2005-06"},{"$f":"IF(dms_RPT=\"financial\",dms_fy2,dms_cy2)","v":"2006-07"},{"$f":"IF(dms_RPT=\"financial\",dms_fy3,dms_cy3)","v":"2007-08"},{"$f":"IF(dms_RPT=\"financial\",dms_fy4,dms_cy4)","v":"2008-09"},{"$f":"IF(dms_RPT=\"financial\",dms_fy5,dms_cy5)","v":"2009-10"},{"$f":"IF(dms_RPT=\"financial\",dms_fy6,dms_cy6)","v":"2010-11"},{"$f":"IF(dms_RPT=\"financial\",dms_fy7,dms_cy7)","v":"2011-12"},{"$f":"IF(dms_RPT=\"financial\",dms_fy8,dms_cy8)","v":"2012-13"},{"$f":"IF(dms_RPT=\"financial\",dms_fy9,dms_cy9)","v":"2013-14"},{"$f":"IF(dms_RPT=\"financial\",dms_fy10,dms_cy10)","v":"2014-15"},{"$f":"IF(dms_RPT=\"financial\",dms_fy11,dms_cy11)","v":"2015-16"},{"$f":"IF(dms_RPT=\"financial\",dms_fy12,dms_cy12)","v":"2016-17"},{"$f":"IF(dms_RPT=\"financial\",dms_fy13,dms_cy13)","v":"2017-18"},null,{"$f":"IF(dms_RPT=\"financial\",dms_fy1,dms_cy1)","v":"2005-06"},{"$f":"IF(dms_RPT=\"financial\",dms_fy2,dms_cy2)","v":"2006-07"},{"$f":"IF(dms_RPT=\"financial\",dms_fy3,dms_cy3)","v":"2007-08"},{"$f":"IF(dms_RPT=\"financial\",dms_fy4,dms_cy4)","v":"2008-09"},{"$f":"IF(dms_RPT=\"financial\",dms_fy5,dms_cy5)","v":"2009-10"},{"$f":"IF(dms_RPT=\"financial\",dms_fy6,dms_cy6)","v":"2010-11"},{"$f":"IF(dms_RPT=\"financial\",dms_fy7,dms_cy7)","v":"2011-12"},{"$f":"IF(dms_RPT=\"financial\",dms_fy8,dms_cy8)","v":"2012-13"},{"$f":"IF(dms_RPT=\"financial\",dms_fy9,dms_cy9)","v":"2013-14"},{"$f":"IF(dms_RPT=\"financial\",dms_fy10,dms_cy10)","v":"2014-15"},{"$f":"IF(dms_RPT=\"financial\",dms_fy11,dms_cy11)","v":"2015-16"},{"$f":"IF(dms_RPT=\"financial\",dms_fy12,dms_cy12)","v":"2016-17"},{"$f":"IF(dms_RPT=\"financial\",dms_fy13,dms_cy13)","v":"2017-18"}]
["DOPEX0201","Opex for network services",null,116302749.90441932,112914640.37801874,130933878.03296179,149173385.08183226,152669628.41462567,197231659.58920589,210494320.4867391,228733331.01324019,248266602.35817948,258182865.6296511,220390744.47805542,263810740.7207461,263297406.11594692,null,10065870.777378861,11571511.573806018,12379406.106403209,15758024.15175705,17487666.576248314,27505412.563136153,21199448.534747463,19247503.884522144,18472890.065907925,19920613.385631531,48671134.538953736,37265476.697934076,43202947.453197457]
["DOPEX0202","Opex for metering",null,0,0,0,0,0,0,0,0,0,0,0,0,0,null,4894411,4565993,4678449.0000000009,5044835.0000000009,5563616.9999999991,4982699,5932888,5626892,5458228,5458228,9776210.1758733541,8949371.8676256519,6972928.3236710522]
["DOPEX0203","Opex for connection services",null,496112,996364,1159821,1269274,1450806,1972564,3344811,3032563,2918777,2478811.832365361,2548726.5546865221,2042911.670481944,2204913.1812353758,null,74507.579806127149,150598.91961654703,192851.57456407853,275071.38885307481,357832.29319741606,336909.06384314853,468483.10287458083,353364.75749589963,349685.02890304336,250163.2576346393,433869.52531347756,296278.24951805582,201777.458657159]
["DOPEX0204","Opex for public lighting",null,0,0,0,0,0,0,0,0,0,0,0,0,0,null,4000763.46201463,5612425.491178317,7277105.689155709,5707005.1366642127,6322657.2029876988,5794438.9354573367,6639410.8931183666,7249467.628702214,8225485.6813322715,8107323.7047504103,8115856.8016300369,9777500.4406712968,15708051.862209745]
["DOPEX0205","Opex for amounts payable for easement levy or similar direct charges on DNSP",null,0,0,0,0,0,0,0,0,0,0,0,0,0,null,0,0,0,0,0,0,0,0,0,0,0,0,0]
["DOPEX0206","Opex for transmission connection point planning",null,0,0,0,0,0,0,0,0,0,0,0,0,0,null,0,0,0,0,0,0,0,0,0,0,0,0,0]
[]
[null,"OPEX CONSISTENCY - A: HISTORICAL COST ALLOCATION APPROACH"]
[null,null,null,"STANDARD CONTROL SERVICES",null,null,null,null,null,null,null,null,null,null,null,null,null,"ALTERNATIVE CONTROL SERVICES"]
[null,null,null,"EXPENDITURE\n($0's)",null,null,null,null,null,null,null,null,null,null,null,null,null,"EXPENDITURE\n($0's)"]
[null,null,null,{"$f":"IF(dms_RPT=\"financial\",dms_fy1,dms_cy1)","v":"2005-06"},{"$f":"IF(dms_RPT=\"financial\",dms_fy2,dms_cy2)","v":"2006-07"},{"$f":"IF(dms_RPT=\"financial\",dms_fy3,dms_cy3)","v":"2007-08"},{"$f":"IF(dms_RPT=\"financial\",dms_fy4,dms_cy4)","v":"2008-09"},{"$f":"IF(dms_RPT=\"financial\",dms_fy5,dms_cy5)","v":"2009-10"},{"$f":"IF(dms_RPT=\"financial\",dms_fy6,dms_cy6)","v":"2010-11"},{"$f":"IF(dms_RPT=\"financial\",dms_fy7,dms_cy7)","v":"2011-12"},{"$f":"IF(dms_RPT=\"financial\",dms_fy8,dms_cy8)","v":"2012-13"},{"$f":"IF(dms_RPT=\"financial\",dms_fy9,dms_cy9)","v":"2013-14"},{"$f":"IF(dms_RPT=\"financial\",dms_fy10,dms_cy10)","v":"2014-15"},{"$f":"IF(dms_RPT=\"financial\",dms_fy11,dms_cy11)","v":"2015-16"},{"$f":"IF(dms_RPT=\"financial\",dms_fy12,dms_cy12)","v":"2016-17"},{"$f":"IF(dms_RPT=\"financial\",dms_fy13,dms_cy13)","v":"2017-18"},null,{"$f":"IF(dms_RPT=\"financial\",dms_fy1,dms_cy1)","v":"2005-06"},{"$f":"IF(dms_RPT=\"financial\",dms_fy2,dms_cy2)","v":"2006-07"},{"$f":"IF(dms_RPT=\"financial\",dms_fy3,dms_cy3)","v":"2007-08"},{"$f":"IF(dms_RPT=\"financial\",dms_fy4,dms_cy4)","v":"2008-09"},{"$f":"IF(dms_RPT=\"financial\",dms_fy5,dms_cy5)","v":"2009-10"},{"$f":"IF(dms_RPT=\"financial\",dms_fy6,dms_cy6)","v":"2010-11"},{"$f":"IF(dms_RPT=\"financial\",dms_fy7,dms_cy7)","v":"2011-12"},{"$f":"IF(dms_RPT=\"financial\",dms_fy8,dms_cy8)","v":"2012-13"},{"$f":"IF(dms_RPT=\"financial\",dms_fy9,dms_cy9)","v":"2013-14"},{"$f":"IF(dms_RPT=\"financial\",dms_fy10,dms_cy10)","v":"2014-15"},{"$f":"IF(dms_RPT=\"financial\",dms_fy11,dms_cy11)","v":"2015-16"},{"$f":"IF(dms_RPT=\"financial\",dms_fy12,dms_cy12)","v":"2016-17"},{"$f":"IF(dms_RPT=\"financial\",dms_fy13,dms_cy13)","v":"2017-18"}]
["DOPEX0201","Opex for network services",null,null,null,null,null,null,197231659.58920589,210494320.4867391,228733331.01324019,248266602.35817948,258182865.6296511,220390744.47805542,263810740.7207461,263297406.11594692,null,null,null,null,null,null,27505412.563136153,21199448.534747463,19247503.884522144,18472890.065907925,19920613.385631531,48671134.538953736,37265476.697934076,43202947.453197457]
["DOPEX0202","Opex for metering",null,null,null,null,null,null,0,0,0,0,0,0,0,0,null,null,null,null,null,null,4982699,5932888,5626892,5458228,5458228,9776210.1758733541,8949371.8676256519,6972928.3236710522]
["DOPEX0203","Opex for connection services",null,null,null,null,null,null,1972564,3344811,3032563,2918777,2478811.832365361,2548726.5546865221,2042911.670481944,2204913.1812353758,null,null,null,null,null,null,336909.06384314853,468483.10287458083,353364.75749589963,349685.02890304336,250163.2576346393,433869.52531347756,296278.24951805582,201777.458657159]
["DOPEX0204","Opex for public lighting",null,null,null,null,null,null,0,0,0,0,0,0,0,0,null,null,null,null,null,null,5794438.9354573367,6639410.8931183666,7249467.628702214,8225485.6813322715,8107323.7047504103,8115856.8016300369,9777500.4406712968,15708051.862209745]
["DOPEX0205","Opex for amounts payable for easement levy or similar direct charges on DNSP",null,null,null,null,null,null,0,0,0,0,0,0,0,0]
["DOPEX0206","Opex for transmission connection point planning",null,null,null,null,null,null,0,0,0,0,0,0,0,0]
[]
[null,"OPEX CONSISTENCY - B: HISTORICAL COST ALLOCATION APPROACH"]
[null,null,null,"STANDARD CONTROL SERVICES",null,null,null,null,null,null,null,null,null,null,null,null,null,"ALTERNATIVE CONTROL SERVICES"]
[null,null,null,"EXPENDITURE\n($0's)",null,null,null,null,null,null,null,null,null,null,null,null,null,"EXPENDITURE\n($0's)"]
[null,null,null,{"$f":"IF(dms_RPT=\"financial\",dms_fy1,dms_cy1)","v":"2005-06"},{"$f":"IF(dms_RPT=\"financial\",dms_fy2,dms_cy2)","v":"2006-07"},{"$f":"IF(dms_RPT=\"financial\",dms_fy3,dms_cy3)","v":"2007-08"},{"$f":"IF(dms_RPT=\"financial\",dms_fy4,dms_cy4)","v":"2008-09"},{"$f":"IF(dms_RPT=\"financial\",dms_fy5,dms_cy5)","v":"2009-10"},{"$f":"IF(dms_RPT=\"financial\",dms_fy6,dms_cy6)","v":"2010-11"},{"$f":"IF(dms_RPT=\"financial\",dms_fy7,dms_cy7)","v":"2011-12"},{"$f":"IF(dms_RPT=\"financial\",dms_fy8,dms_cy8)","v":"2012-13"},{"$f":"IF(dms_RPT=\"financial\",dms_fy9,dms_cy9)","v":"2013-14"},{"$f":"IF(dms_RPT=\"financial\",dms_fy10,dms_cy10)","v":"2014-15"},{"$f":"IF(dms_RPT=\"financial\",dms_fy11,dms_cy11)","v":"2015-16"},{"$f":"IF(dms_RPT=\"financial\",dms_fy12,dms_cy12)","v":"2016-17"},{"$f":"IF(dms_RPT=\"financial\",dms_fy13,dms_cy13)","v":"2017-18"},null,{"$f":"IF(dms_RPT=\"financial\",dms_fy1,dms_cy1)","v":"2005-06"},{"$f":"IF(dms_RPT=\"financial\",dms_fy2,dms_cy2)","v":"2006-07"},{"$f":"IF(dms_RPT=\"financial\",dms_fy3,dms_cy3)","v":"2007-08"},{"$f":"IF(dms_RPT=\"financial\",dms_fy4,dms_cy4)","v":"2008-09"},{"$f":"IF(dms_RPT=\"financial\",dms_fy5,dms_cy5)","v":"2009-10"},{"$f":"IF(dms_RPT=\"financial\",dms_fy6,dms_cy6)","v":"2010-11"},{"$f":"IF(dms_RPT=\"financial\",dms_fy7,dms_cy7)","v":"2011-12"},{"$f":"IF(dms_RPT=\"financial\",dms_fy8,dms_cy8)","v":"2012-13"},{"$f":"IF(dms_RPT=\"financial\",dms_fy9,dms_cy9)","v":"2013-14"},{"$f":"IF(dms_RPT=\"financial\",dms_fy10,dms_cy10)","v":"2014-15"},{"$f":"IF(dms_RPT=\"financial\",dms_fy11,dms_cy11)","v":"2015-16"},{"$f":"IF(dms_RPT=\"financial\",dms_fy12,dms_cy12)","v":"2016-17"},{"$f":"IF(dms_RPT=\"financial\",dms_fy13,dms_cy13)","v":"2017-18"}]
["DOPEX0201","Opex for network services",null,109237266,105859353,126326594,144911380,147660900,null,null,null,null,null,null,null,null,null,0,0,0,0,0]
["DOPEX0202","Opex for metering",null,4580777,4297285,4219928,4563309,5139059,null,null,null,null,null,null,null,null,null,0,0,0,0,0]
["DOPEX0203","Opex for connection services",null,1012888,1017113,1183127,1295707,1481018,null,null,null,null,null,null,null,null,null,0,0,0,0,0]
["DOPEX0204","Opex for public lighting",null,0,0,0,0,0,null,null,null,null,null,null,null,null,null,0,0,0,0,0]
["DOPEX0205","Opex for amounts payable for easement levy or similar direct charges on DNSP",null,0,0,0,0,0,null,null,null,null,null,null,null,null,null,0,0,0,0,0]
["DOPEX0206","Opex for transmission connection point planning",null,0,0,0,0,0,null,null,null,null,null,null,null,null,null,0,0,0,0,0]
[]
[]
[]
[null,"3.2.4 - OPEX FOR HIGH VOLTAGE CUSTOMERS"]
[null,null,null,"End user costs (not standard control services)"]
["DOPEX0401","Opex for high voltage customers",null,836879.10569173528,936176.4542323231,932983.25811937719,1020619.2547423571,1118098.2448283779,1257164.3291197021,1452207.6185820289,1424653.624500219,1650269.5738179516,1608763.7244992745,1492504.5546953897,1424386.3226159322,1630270.3900908707]

{"sheet":"3.2.3 Provisions","index":7,"n_rows":371,"n_cols":15,"rows_kept":371,"cut":false,"hidden":false,"merged":[[9,2,9,14]]}
[null,"REGULATORY REPORTING STATEMENT"]
[null,{"$f":"dms_TradingName","v":"SA Power Networks"}]
[null,{"$f":"CONCATENATE(\"ECONOMIC BENCHMARKING \",IF(SUM(dms_SingleYear_Model)>0,CRY,CONCATENATE(dms_CRCP_FirstYear_Result,\" to \",dms_CRCP_FinalYear_Result)))","v":"ECONOMIC BENCHMARKING 2005-06"}]
[null,"3.2 OPERATING EXPENDITURE"]
[]
[null,"There is ONE table on this worksheet. Each Provision has been grouped for ease of navigation. see the Instructions sheet on how to group or ungroup tables. "]
[]
[null,"3.2.3 - PROVISIONS"]
[null,"For each provision report:"]
[null,null,"$0's"]
[null,null,{"$f":"IF(dms_RPT=\"financial\",dms_fy1,dms_cy1)","v":"2005-06"},{"$f":"IF(dms_RPT=\"financial\",dms_fy2,dms_cy2)","v":"2006-07"},{"$f":"IF(dms_RPT=\"financial\",dms_fy3,dms_cy3)","v":"2007-08"},{"$f":"IF(dms_RPT=\"financial\",dms_fy4,dms_cy4)","v":"2008-09"},{"$f":"IF(dms_RPT=\"financial\",dms_fy5,dms_cy5)","v":"2009-10"},{"$f":"IF(dms_RPT=\"financial\",dms_fy6,dms_cy6)","v":"2010-11"},{"$f":"IF(dms_RPT=\"financial\",dms_fy7,dms_cy7)","v":"2011-12"},{"$f":"IF(dms_RPT=\"financial\",dms_fy8,dms_cy8)","v":"2012-13"},{"$f":"IF(dms_RPT=\"financial\",dms_fy9,dms_cy9)","v":"2013-14"},{"$f":"IF(dms_RPT=\"financial\",dms_fy10,dms_cy10)","v":"2014-15"},{"$f":"IF(dms_RPT=\"financial\",dms_fy11,dms_cy11)","v":"2015-16"},{"$f":"IF(dms_RPT=\"financial\",dms_fy12,dms_cy12)","v":"2016-17"},{"$f":"IF(dms_RPT=\"financial\",dms_fy13,dms_cy13)","v":"2017-18"}]
["DOPEX03A","<Provision name>"]
[null,"<Brief description of provision>"]
["DOPEX0301A","Opening balance (the carrying amount at the beginning of the period)"]
[null,"Additional provisions made in the period, including increases to existing provisions"]
["DOPEX0302A","Opex component"]
["DOPEX0303A","Capex component"]
["DOPEX0304A","Other component"]
[null,"Amounts used (that is, incurred and charged against the provision) during the period"]
["DOPEX0305A","Opex component"]
["DOPEX0306A","Capex component"]
["DOPEX0307A","Other component"]
[null,"Unused amounts reversed during the period"]
["DOPEX0308A","Opex component"]
["DOPEX0309A","Capex component"]
["DOPEX0310A","Other component"]
[null,"The increase during the period in the discounted amount arising from the passage of time and the effect of any change in the discount rate"]
["DOPEX0311A","Opex component"]
["DOPEX0312A","Capex component"]
["DOPEX0313A","Other component"]
["DOPEX0314A","Closing balance (carrying amount at the end of the period)"]
["DOPEX03B","<Provision name>"]
[null,"<Brief description of provision>"]
["DOPEX0301B","Opening balance (the carrying amount at the beginning of the period)"]
[null,"Additional provisions made in the period, including increases to existing provisions"]
["DOPEX0302B","Opex component"]
["DOPEX0303B","Capex component"]
["DOPEX0304B","Other component"]
[null,"Amounts used (that is, incurred and charged against the provision) during the period"]
["DOPEX0305B","Opex component"]
["DOPEX0306B","Capex component"]
["DOPEX0307B","Other component"]
[null,"Unused amounts reversed during the period"]
["DOPEX0308B","Opex component"]
["DOPEX0309B","Capex component"]
["DOPEX0310B","Other component"]
[null,"The increase during the period in the discounted amount arising from the passage of time and the effect of any change in the discount rate"]
["DOPEX0311B","Opex component"]
["DOPEX0312B","Capex component"]
["DOPEX0313B","Other component"]
["DOPEX0314B","Closing balance (carrying amount at the end of the period)"]
["DOPEX03C","<Provision name>"]
[null,"<Brief description of provision>"]
["DOPEX0301C","Opening balance (the carrying amount at the beginning of the period)"]
[null,"Additional provisions made in the period, including increases to existing provisions"]
["DOPEX0302C","Opex component"]
["DOPEX0303C","Capex component"]
["DOPEX0304C","Other component"]
[null,"Amounts used (that is, incurred and charged against the provision) during the period"]
["DOPEX0305C","Opex component"]
["DOPEX0306C","Capex component"]
["DOPEX0307C","Other component"]
[null,"Unused amounts reversed during the period"]
["DOPEX0308C","Opex component"]
["DOPEX0309C","Capex component"]
["DOPEX0310C","Other component"]
[null,"The increase during the period in the discounted amount arising from the passage of time and the effect of any change in the discount rate"]
["DOPEX0311C","Opex component"]
["DOPEX0312C","Capex component"]
["DOPEX0313C","Other component"]
["DOPEX0314C","Closing balance (carrying amount at the end of the period)"]
["DOPEX03D","<Provision name>"]
[null,"<Brief description of provision>"]
["DOPEX0301D","Opening balance (the carrying amount at the beginning of the period)"]
[null,"Additional provisions made in the period, including increases to existing provisions"]
["DOPEX0302D","Opex component"]
["DOPEX0303D","Capex component"]
["DOPEX0304D","Other component"]
[null,"Amounts used (that is, incurred and charged against the provision) during the period"]
["DOPEX0305D","Opex component"]
["DOPEX0306D","Capex component"]
["DOPEX0307D","Other component"]
[null,"Unused amounts reversed during the period"]
["DOPEX0308D","Opex component"]
["DOPEX0309D","Capex component"]
["DOPEX0310D","Other component"]
[null,"The increase during the period in the discounted amount arising from the passage of time and the effect of any change in the discount rate"]
["DOPEX0311D","Opex component"]
["DOPEX0312D","Capex component"]
["DOPEX0313D","Other component"]
["DOPEX0314D","Closing balance (carrying amount at the end of the period)"]
["DOPEX03E","<Provision name>"]
[null,"<Brief description of provision>"]
["DOPEX0301E","Opening balance (the carrying amount at the beginning of the period)"]
[null,"Additional provisions made in the period, including increases to existing provisions"]
["DOPEX0302E","Opex component"]
["DOPEX0303E","Capex component"]
["DOPEX0304E","Other component"]
[null,"Amounts used (that is, incurred and charged against the provision) during the period"]
["DOPEX0305E","Opex component"]
["DOPEX0306E","Capex component"]
["DOPEX0307E","Other component"]
[null,"Unused amounts reversed during the period"]
["DOPEX0308E","Opex component"]
["DOPEX0309E","Capex component"]
["DOPEX0310E","Other component"]
[null,"The increase during the period in the discounted amount arising from the passage of time and the effect of any change in the discount rate"]
["DOPEX0311E","Opex component"]
["DOPEX0312E","Capex component"]
["DOPEX0313E","Other component"]
["DOPEX0314E","Closing balance (carrying amount at the end of the period)"]
["DOPEX03F","<Provision name>"]
[null,"<Brief description of provision>"]
["DOPEX0301F","Opening balance (the carrying amount at the beginning of the period)"]
[null,"Additional provisions made in the period, including increases to existing provisions"]
["DOPEX0302F","Opex component"]
["DOPEX0303F","Capex component"]
["DOPEX0304F","Other component"]
[null,"Amounts used (that is, incurred and charged against the provision) during the period"]
["DOPEX0305F","Opex component"]
["DOPEX0306F","Capex component"]
["DOPEX0307F","Other component"]
[null,"Unused amounts reversed during the period"]
["DOPEX0308F","Opex component"]
["DOPEX0309F","Capex component"]
["DOPEX0310F","Other component"]
[null,"The increase during the period in the discounted amount arising from the passage of time and the effect of any change in the discount rate"]
["DOPEX0311F","Opex component"]
["DOPEX0312F","Capex component"]
["DOPEX0313F","Other component"]
["DOPEX0314F","Closing balance (carrying amount at the end of the period)"]
["DOPEX03G","<Provision name>"]
[null,"<Brief description of provision>"]
["DOPEX0301G","Opening balance (the carrying amount at the beginning of the period)"]
[null,"Additional provisions made in the period, including increases to existing provisions"]
["DOPEX0302G","Opex component"]
["DOPEX0303G","Capex component"]
["DOPEX0304G","Other component"]
[null,"Amounts used (that is, incurred and charged against the provision) during the period"]
["DOPEX0305G","Opex component"]
["DOPEX0306G","Capex component"]
["DOPEX0307G","Other component"]
[null,"Unused amounts reversed during the period"]
["DOPEX0308G","Opex component"]
["DOPEX0309G","Capex component"]
["DOPEX0310G","Other component"]
[null,"The increase during the period in the discounted amount arising from the passage of time and the effect of any change in the discount rate"]
["DOPEX0311G","Opex component"]
["DOPEX0312G","Capex component"]
["DOPEX0313G","Other component"]
["DOPEX0314G","Closing balance (carrying amount at the end of the period)"]
["DOPEX03H","<Provision name>"]
[null,"<Brief description of provision>"]
["DOPEX0301H","Opening balance (the carrying amount at the beginning of the period)"]
[null,"Additional provisions made in the period, including increases to existing provisions"]
["DOPEX0302H","Opex component"]
["DOPEX0303H","Capex component"]
["DOPEX0304H","Other component"]
[null,"Amounts used (that is, incurred and charged against the provision) during the period"]
["DOPEX0305H","Opex component"]
["DOPEX0306H","Capex component"]
["DOPEX0307H","Other component"]
[null,"Unused amounts reversed during the period"]
["DOPEX0308H","Opex component"]
["DOPEX0309H","Capex component"]
["DOPEX0310H","Other component"]
[null,"The increase during the period in the discounted amount arising from the passage of time and the effect of any change in the discount rate"]
["DOPEX0311H","Opex component"]
["DOPEX0312H","Capex component"]
["DOPEX0313H","Other component"]
["DOPEX0314H","Closing balance (carrying amount at the end of the period)"]
["DOPEX03I","<Provision name>"]
[null,"<Brief description of provision>"]
["DOPEX0301I","Opening balance (the carrying amount at the beginning of the period)"]
[null,"Additional provisions made in the period, including increases to existing provisions"]
["DOPEX0302I","Opex component"]
["DOPEX0303I","Capex component"]
["DOPEX0304I","Other component"]
[null,"Amounts used (that is, incurred and charged against the provision) during the period"]
["DOPEX0305I","Opex component"]
["DOPEX0306I","Capex component"]
["DOPEX0307I","Other component"]
[null,"Unused amounts reversed during the period"]
["DOPEX0308I","Opex component"]
["DOPEX0309I","Capex component"]
["DOPEX0310I","Other component"]
[null,"The increase during the period in the discounted amount arising from the passage of time and the effect of any change in the discount rate"]
["DOPEX0311I","Opex component"]
["DOPEX0312I","Capex component"]
["DOPEX0313I","Other component"]
["DOPEX0314I","Closing balance (carrying amount at the end of the period)"]
["DOPEX03J","<Provision name>"]
[null,"<Brief description of provision>"]
["DOPEX0301J","Opening balance (the carrying amount at the beginning of the period)"]
[null,"Additional provisions made in the period, including increases to existing provisions"]
["DOPEX0302J","Opex component"]
["DOPEX0303J","Capex component"]
["DOPEX0304J","Other component"]
[null,"Amounts used (that is, incurred and charged against the provision) during the period"]
["DOPEX0305J","Opex component"]
["DOPEX0306J","Capex component"]
["DOPEX0307J","Other component"]
[null,"Unused amounts reversed during the period"]
["DOPEX0308J","Opex component"]
["DOPEX0309J","Capex component"]
["DOPEX0310J","Other component"]
[null,"The increase during the period in the discounted amount arising from the passage of time and the effect of any change in the discount rate"]
["DOPEX0311J","Opex component"]
["DOPEX0312J","Capex component"]
["DOPEX0313J","Other component"]
["DOPEX0314J","Closing balance (carrying amount at the end of the period)"]
["DOPEX03K","<Provision name>"]
[null,"<Brief description of provision>"]
["DOPEX0301K","Opening balance (the carrying amount at the beginning of the period)"]
[null,"Additional provisions made in the period, including increases to existing provisions"]
["DOPEX0302K","Opex component"]
["DOPEX0303K","Capex component"]
["DOPEX0304K","Other component"]
[null,"Amounts used (that is, incurred and charged against the provision) during the period"]
["DOPEX0305K","Opex component"]
["DOPEX0306K","Capex component"]
["DOPEX0307K","Other component"]
[null,"Unused amounts reversed during the period"]
["DOPEX0308K","Opex component"]
["DOPEX0309K","Capex component"]
["DOPEX0310K","Other component"]
[null,"The increase during the period in the discounted amount arising from the passage of time and the effect of any change in the discount rate"]
["DOPEX0311K","Opex component"]
["DOPEX0312K","Capex component"]
["DOPEX0313K","Other component"]
["DOPEX0314K","Closing balance (carrying amount at the end of the period)"]
["DOPEX03L","<Provision name>"]
[null,"<Brief description of provision>"]
["DOPEX0301L","Opening balance (the carrying amount at the beginning of the period)"]
[null,"Additional provisions made in the period, including increases to existing provisions"]
["DOPEX0302L","Opex component"]
["DOPEX0303L","Capex component"]
["DOPEX0304L","Other component"]
[null,"Amounts used (that is, incurred and charged against the provision) during the period"]
["DOPEX0305L","Opex component"]
["DOPEX0306L","Capex component"]
["DOPEX0307L","Other component"]
[null,"Unused amounts reversed during the period"]
["DOPEX0308L","Opex component"]
["DOPEX0309L","Capex component"]
["DOPEX0310L","Other component"]
[null,"The increase during the period in the discounted amount arising from the passage of time and the effect of any change in the discount rate"]
["DOPEX0311L","Opex component"]
["DOPEX0312L","Capex component"]
["DOPEX0313L","Other component"]
["DOPEX0314L","Closing balance (carrying amount at the end of the period)"]
["DOPEX03M","<Provision name>"]
[null,"<Brief description of provision>"]
["DOPEX0301M","Opening balance (the carrying amount at the beginning of the period)"]
[null,"Additional provisions made in the period, including increases to existing provisions"]
["DOPEX0302M","Opex component"]
["DOPEX0303M","Capex component"]
["DOPEX0304M","Other component"]
[null,"Amounts used (that is, incurred and charged against the provision) during the period"]
["DOPEX0305M","Opex component"]
["DOPEX0306M","Capex component"]
["DOPEX0307M","Other component"]
[null,"Unused amounts reversed during the period"]
["DOPEX0308M","Opex component"]
["DOPEX0309M","Capex component"]
["DOPEX0310M","Other component"]
[null,"The increase during the period in the discounted amount arising from the passage of time and the effect of any change in the discount rate"]
["DOPEX0311M","Opex component"]
["DOPEX0312M","Capex component"]
["DOPEX0313M","Other component"]
["DOPEX0314M","Closing balance (carrying amount at the end of the period)"]
["DOPEX03N","<Provision name>"]
[null,"<Brief description of provision>"]
["DOPEX0301N","Opening balance (the carrying amount at the beginning of the period)"]
[null,"Additional provisions made in the period, including increases to existing provisions"]
["DOPEX0302N","Opex component"]
["DOPEX0303N","Capex component"]
["DOPEX0304N","Other component"]
[null,"Amounts used (that is, incurred and charged against the provision) during the period"]
["DOPEX0305N","Opex component"]
["DOPEX0306N","Capex component"]
["DOPEX0307N","Other component"]
[null,"Unused amounts reversed during the period"]
["DOPEX0308N","Opex component"]
["DOPEX0309N","Capex component"]
["DOPEX0310N","Other component"]
[null,"The increase during the period in the discounted amount arising from the passage of time and the effect of any change in the discount rate"]
["DOPEX0311N","Opex component"]
["DOPEX0312N","Capex component"]
["DOPEX0313N","Other component"]
["DOPEX0314N","Closing balance (carrying amount at the end of the period)"]
["DOPEX03O","<Provision name>"]
[null,"<Brief description of provision>"]
["DOPEX0301O","Opening balance (the carrying amount at the beginning of the period)"]
[null,"Additional provisions made in the period, including increases to existing provisions"]
["DOPEX0302O","Opex component"]
["DOPEX0303O","Capex component"]
["DOPEX0304O","Other component"]
[null,"Amounts used (that is, incurred and charged against the provision) during the period"]
["DOPEX0305O","Opex component"]
["DOPEX0306O","Capex component"]
["DOPEX0307O","Other component"]
[null,"Unused amounts reversed during the period"]
["DOPEX0308O","Opex component"]
["DOPEX0309O","Capex component"]
["DOPEX0310O","Other component"]
[null,"The increase during the period in the discounted amount arising from the passage of time and the effect of any change in the discount rate"]
["DOPEX0311O","Opex component"]
["DOPEX0312O","Capex component"]
["DOPEX0313O","Other component"]
["DOPEX0314O","Closing balance (carrying amount at the end of the period)"]
["DOPEX03P","<Provision name>"]
[null,"<Brief description of provision>"]
["DOPEX0301P","Opening balance (the carrying amount at the beginning of the period)"]
[null,"Additional provisions made in the period, including increases to existing provisions"]
["DOPEX0302P","Opex component"]
["DOPEX0303P","Capex component"]
["DOPEX0304P","Other component"]
[null,"Amounts used (that is, incurred and charged against the provision) during the period"]
["DOPEX0305P","Opex component"]
["DOPEX0306P","Capex component"]
["DOPEX0307P","Other component"]
[null,"Unused amounts reversed during the period"]
["DOPEX0308P","Opex component"]
["DOPEX0309P","Capex component"]
["DOPEX0310P","Other component"]
[null,"The increase during the period in the discounted amount arising from the passage of time and the effect of any change in the discount rate"]
["DOPEX0311P","Opex component"]
["DOPEX0312P","Capex component"]
["DOPEX0313P","Other component"]
["DOPEX0314P","Closing balance (carrying amount at the end of the period)"]
["DOPEX03Q","<Provision name>"]
[null,"<Brief description of provision>"]
["DOPEX0301Q","Opening balance (the carrying amount at the beginning of the period)"]
[null,"Additional provisions made in the period, including increases to existing provisions"]
["DOPEX0302Q","Opex component"]
["DOPEX0303Q","Capex component"]
["DOPEX0304Q","Other component"]
[null,"Amounts used (that is, incurred and charged against the provision) during the period"]
["DOPEX0305Q","Opex component"]
["DOPEX0306Q","Capex component"]
["DOPEX0307Q","Other component"]
[null,"Unused amounts reversed during the period"]
["DOPEX0308Q","Opex component"]
["DOPEX0309Q","Capex component"]
["DOPEX0310Q","Other component"]
[null,"The increase during the period in the discounted amount arising from the passage of time and the effect of any change in the discount rate"]
["DOPEX0311Q","Opex component"]
["DOPEX0312Q","Capex component"]
["DOPEX0313Q","Other component"]
["DOPEX0314Q","Closing balance (carrying amount at the end of the period)"]
["DOPEX03R","<Provision name>"]
[null,"<Brief description of provision>"]
["DOPEX0301R","Opening balance (the carrying amount at the beginning of the period)"]
[null,"Additional provisions made in the period, including increases to existing provisions"]
["DOPEX0302R","Opex component"]
["DOPEX0303R","Capex component"]
["DOPEX0304R","Other component"]
[null,"Amounts used (that is, incurred and charged against the provision) during the period"]
["DOPEX0305R","Opex component"]
["DOPEX0306R","Capex component"]
["DOPEX0307R","Other component"]
[null,"Unused amounts reversed during the period"]
["DOPEX0308R","Opex component"]
["DOPEX0309R","Capex component"]
["DOPEX0310R","Other component"]
[null,"The increase during the period in the discounted amount arising from the passage of time and the effect of any change in the discount rate"]
["DOPEX0311R","Opex component"]
["DOPEX0312R","Capex component"]
["DOPEX0313R","Other component"]
["DOPEX0314R","Closing balance (carrying amount at the end of the period)"]

{"sheet":"3.3 Assets (RAB)","index":8,"n_rows":139,"n_cols":43,"rows_kept":139,"cut":false,"hidden":false,"merged":[[8,2,8,14],[9,2,9,14],[116,2,116,14],[8,30,8,42],[9,30,9,42],[116,30,116,42],[8,16,8,28],[9,16,9,28],[116,16,116,28],[98,2,98,14],[98,16,98,28],[98,30,98,42],[99,2,99,14],[99,16,99,28],[99,30,99,42],[21,2,21,14],[115,2,115,14],[115,16,115,28],[115,30,115,42],[21,16,21,28],[21,30,21,42],[22,2,22,14],[22,16,22,28],[22,30,22,42]]}
[null,"REGULATORY REPORTING STATEMENT"]
[null,{"$f":"dms_TradingName","v":"SA Power Networks"}]
[null,{"$f":"CONCATENATE(\"ECONOMIC BENCHMARKING \",IF(SUM(dms_SingleYear_Model)>0,CRY,CONCATENATE(dms_CRCP_FirstYear_Result,\" to \",dms_CRCP_FinalYear_Result)))","v":"ECONOMIC BENCHMARKING 2005-06"}]
[null,"3.3 ASSETS"]
[]
[null,"There are FOUR tables on this worksheet. Both ROWS and COLUMNS in each have been  grouped (and sub-grouped) for ease of navigation. see the Instructions sheet on how to group or ungroup tables. "]
[]
[null,"3.3.1 - REGULATORY ASSET BASE VALUES"]
[null,null,"Network services",null,null,null,null,null,null,null,null,null,null,null,null,null,"Standard control services",null,null,null,null,null,null,null,null,null,null,null,null,null,"Alternative control services"]
[null,null,"$0's, Nominal",null,null,null,null,null,null,null,null,null,null,null,null,null,"$0's, Nominal",null,null,null,null,null,null,null,null,null,null,null,null,null,"$0's, Nominal"]
[null,null,{"$f":"IF(dms_RPT=\"financial\",dms_fy1,dms_cy1)","v":"2005-06"},{"$f":"IF(dms_RPT=\"financial\",dms_fy2,dms_cy2)","v":"2006-07"},{"$f":"IF(dms_RPT=\"financial\",dms_fy3,dms_cy3)","v":"2007-08"},{"$f":"IF(dms_RPT=\"financial\",dms_fy4,dms_cy4)","v":"2008-09"},{"$f":"IF(dms_RPT=\"financial\",dms_fy5,dms_cy5)","v":"2009-10"},{"$f":"IF(dms_RPT=\"financial\",dms_fy6,dms_cy6)","v":"2010-11"},{"$f":"IF(dms_RPT=\"financial\",dms_fy7,dms_cy7)","v":"2011-12"},{"$f":"IF(dms_RPT=\"financial\",dms_fy8,dms_cy8)","v":"2012-13"},{"$f":"IF(dms_RPT=\"financial\",dms_fy9,dms_cy9)","v":"2013-14"},{"$f":"IF(dms_RPT=\"financial\",dms_fy10,dms_cy10)","v":"2014-15"},{"$f":"IF(dms_RPT=\"financial\",dms_fy11,dms_cy11)","v":"2015-16"},{"$f":"IF(dms_RPT=\"financial\",dms_fy12,dms_cy12)","v":"2016-17"},{"$f":"IF(dms_RPT=\"financial\",dms_fy13,dms_cy13)","v":"2017-18"},null,{"$f":"IF(dms_RPT=\"financial\",dms_fy1,dms_cy1)","v":"2005-06"},{"$f":"IF(dms_RPT=\"financial\",dms_fy2,dms_cy2)","v":"2006-07"},{"$f":"IF(dms_RPT=\"financial\",dms_fy3,dms_cy3)","v":"2007-08"},{"$f":"IF(dms_RPT=\"financial\",dms_fy4,dms_cy4)","v":"2008-09"},{"$f":"IF(dms_RPT=\"financial\",dms_fy5,dms_cy5)","v":"2009-10"},{"$f":"IF(dms_RPT=\"financial\",dms_fy6,dms_cy6)","v":"2010-11"},{"$f":"IF(dms_RPT=\"financial\",dms_fy7,dms_cy7)","v":"2011-12"},{"$f":"IF(dms_RPT=\"financial\",dms_fy8,dms_cy8)","v":"2012-13"},{"$f":"IF(dms_RPT=\"financial\",dms_fy9,dms_cy9)","v":"2013-14"},{"$f":"IF(dms_RPT=\"financial\",dms_fy10,dms_cy10)","v":"2014-15"},{"$f":"IF(dms_RPT=\"financial\",dms_fy11,dms_cy11)","v":"2015-16"},{"$f":"IF(dms_RPT=\"financial\",dms_fy12,dms_cy12)","v":"2016-17"},{"$f":"IF(dms_RPT=\"financial\",dms_fy13,dms_cy13)","v":"2017-18"},null,{"$f":"IF(dms_RPT=\"financial\",dms_fy1,dms_cy1)","v":"2005-06"},{"$f":"IF(dms_RPT=\"financial\",dms_fy2,dms_cy2)","v":"2006-07"},{"$f":"IF(dms_RPT=\"financial\",dms_fy3,dms_cy3)","v":"2007-08"},{"$f":"IF(dms_RPT=\"financial\",dms_fy4,dms_cy4)","v":"2008-09"},{"$f":"IF(dms_RPT=\"financial\",dms_fy5,dms_cy5)","v":"2009-10"},{"$f":"IF(dms_RPT=\"financial\",dms_fy6,dms_cy6)","v":"2010-11"},{"$f":"IF(dms_RPT=\"financial\",dms_fy7,dms_cy7)","v":"2011-12"},{"$f":"IF(dms_RPT=\"financial\",dms_fy8,dms_cy8)","v":"2012-13"},{"$f":"IF(dms_RPT=\"financial\",dms_fy9,dms_cy9)","v":"2013-14"},{"$f":"IF(dms_RPT=\"financial\",dms_fy10,dms_cy10)","v":"2014-15"},{"$f":"IF(dms_RPT=\"financial\",dms_fy11,dms_cy11)","v":"2015-16"},{"$f":"IF(dms_RPT=\"financial\",dms_fy12,dms_cy12)","v":"2016-17"},{"$f":"IF(dms_RPT=\"financial\",dms_fy13,dms_cy13)","v":"2017-18"}]
[null,"For total asset base:"]
["DRAB0101","Opening value",2497680901.886004,2574172258.2963648,2597655321.5982122,2655385003.1922741,2706169355.3336711,2723122619.6551509,2909040100.3326168,3092390285.954875,3296253903.498621,3456377697.9511771,3572345661.0058537,3670172554.2308435,3714128826.4488225,null,2614693952.6989408,2706427371.9843402,2744675305.9138875,2822201979.5769577,2890556185.2512875,2874932016.6159606,3069164698.9402194,3257781137.2850862,3469105425.5305729,3638144379.4071307,3761548687.7937403,3863075380.4837413,3909008814.7553091,null,39908889.299868084,41008214.002276972,40683716.868224971,41239235.380305298,40102037.736593053,119283069.33653761,119917412.34502935,118418372.47818513,117446795.61931252,115453632.48302847,112318202.96496536,105476491.24070898,98963308.886516884]
["DRAB0102","Inflation addition",74458301.01136595,62771312.729689203,110155166.8647324,65588009.578849167,78208294.369143084,90679983.234516546,45962833.58525534,77331734.102714002,96580239.372509599,45969823.38275066,60321033.675521374,54172288.623333208,70906095.777658969,null,77997659.361930534,65923496.705460139,116419395.61977684,69708388.895550877,82375146.359795615,95735236.153311551,48492802.243255481,81526808.397988468,101644788.96804582,48387320.246114843,63515831.501208067,57019562.811567836,74626531.918055564,null,1189284.901136071,1000600.4216555572,1724989.595212738,1018609.1138935385,2320876.2845541746,3972126.2089067036,1894695.1150514639,2962487.9758427199,3441191.1116458569,1535533.3120242786,1896555.0219225041,1556848.5791986582,1889299.5332880502]
["DRAB0103","Straight line depreciation",-130295087.78208467,-144004821.79874438,-151833957.55610478,-163422269.32208464,-177952340.9904021,-162869215.69505978,-175375965.03988823,-194921966.49557212,-212850371.20522112,-232846835.39084432,-196888133.69932398,-270405028.86535394,-277563139.85557067,null,-135686690.9120034,-150178572.96811095,-158783303.80346656,-171297247.52057782,-185414476.19924048,-170687198.37036425,-183583746.10413891,-203257456.58076528,-221528032.3049283,-241985608.63989559,-209730602.12000003,-285990186.63999999,-293369469.96000004,null,-3237165.0987271811,-3388973.3557075527,-3618308.6831324105,-3764430.9076057808,-5514098.8732874934,-9780543.6838687174,-10476054.801290326,-11035186.099668473,-11707937.685512271,-12409123.734744931,-13481059.46527094,-10892216.685848078,-11465516.327483654]
["DRAB0105","Actual additions (recognised in RAB)",135926143.18107954,110547572.37090237,101717472.28543434,152968611.88463196,118018310.94273908,260457713.13800931,314244317.07689142,323359849.93660384,278951926.28526777,305232975.06277025,236435436.05879238,262623569.44000006,361496634.82999992,null,153020450.83547249,128334010.19219829,122199581.84675971,174293064.299357,88736161.204118311,271535644.54131109,325188382.20575005,334960936.42826343,291480197.21344036,319390596.78039002,249782906.11879238,277338615.08000004,377377035.5999999,null,3147204.9000000004,2063875.7999999998,2448837.5999999996,1608624.1499999994,82374254.188677877,6442760.4834537432,7082319.819394635,7101121.2649531551,6273583.4375823662,7738160.9046575408,4742792.7190920608,2822185.7524573272,4646430.9721798841]
["DRAB0106","Disposals ",-3598000,-5831000,-2308999.9999999995,-4350000,-1321000,-2351000,-1481000,-1906000,-2558000,-2388000,-2041442.81,-2434556.98,-2549996.39,null,-3598000,-5831000,-2308999.9999999995,-4350000,-1321000,-2351000,-1481000,-1906000,-2558000,-2388000,-2041442.81,-2434556.98,-2549996.39,null,0,0,0,0,0,0,0,0,0,0,0,0,0]
["DRAB0107","Closing value",{"$f":"SUM(C13:C17)","v":2574172258.2963648},2597655321.5982122,2655385003.1922741,2706169355.3336711,2723122619.6551509,2909040100.3326168,3092390285.954875,{"$f":"SUM(J13:J17)","v":3296253903.498621},3456377697.9511771,3572345661.0058537,3670172554.2308435,{"$f":"SUM(N13:N17)","v":3714128826.4488225},3866418420.8109107,null,{"$f":"SUM(Q13:Q17)","v":2706427371.9843402},2744675305.9138875,2822201979.5769577,2890556185.2512875,2874932016.6159606,3069164698.9402194,3257781137.2850862,3469105425.5305729,3638144379.4071307,null,null,null,null,null,{"$f":"SUM(AE13:AE17)","v":41008214.002276972},40683716.868224971,41239235.380305298,40102037.736593053,119283069.33653761,119917412.34502935,118418372.47818513,117446795.61931252,115453632.48302847,112318202.96496536,105476491.24070898,98963308.886516884,94033523.064501166]
[]
[]
[null,"3.3.2 - ASSET VALUE ROLL FORWARD"]
[null,null,"Network services",null,null,null,null,null,null,null,null,null,null,null,null,null,"Standard control services",null,null,null,null,null,null,null,null,null,null,null,null,null,"Alternative control services"]
[null,null,"$0's, Nominal",null,null,null,null,null,null,null,null,null,null,null,null,null,"$0's, Nominal",null,null,null,null,null,null,null,null,null,null,null,null,null,"$0's, Nominal"]
[null,null,{"$f":"IF(dms_RPT=\"financial\",dms_fy1,dms_cy1)","v":"2005-06"},{"$f":"IF(dms_RPT=\"financial\",dms_fy2,dms_cy2)","v":"2006-07"},{"$f":"IF(dms_RPT=\"financial\",dms_fy3,dms_cy3)","v":"2007-08"},{"$f":"IF(dms_RPT=\"financial\",dms_fy4,dms_cy4)","v":"2008-09"},{"$f":"IF(dms_RPT=\"financial\",dms_fy5,dms_cy5)","v":"2009-10"},{"$f":"IF(dms_RPT=\"financial\",dms_fy6,dms_cy6)","v":"2010-11"},{"$f":"IF(dms_RPT=\"financial\",dms_fy7,dms_cy7)","v":"2011-12"},{"$f":"IF(dms_RPT=\"financial\",dms_fy8,dms_cy8)","v":"2012-13"},{"$f":"IF(dms_RPT=\"financial\",dms_fy9,dms_cy9)","v":"2013-14"},{"$f":"IF(dms_RPT=\"financial\",dms_fy10,dms_cy10)","v":"2014-15"},{"$f":"IF(dms_RPT=\"financial\",dms_fy11,dms_cy11)","v":"2015-16"},{"$f":"IF(dms_RPT=\"financial\",dms_fy12,dms_cy12)","v":"2016-17"},{"$f":"IF(dms_RPT=\"financial\",dms_fy13,dms_cy13)","v":"2017-18"},null,{"$f":"IF(dms_RPT=\"financial\",dms_fy1,dms_cy1)","v":"2005-06"},{"$f":"IF(dms_RPT=\"financial\",dms_fy2,dms_cy2)","v":"2006-07"},{"$f":"IF(dms_RPT=\"financial\",dms_fy3,dms_cy3)","v":"2007-08"},{"$f":"IF(dms_RPT=\"financial\",dms_fy4,dms_cy4)","v":"2008-09"},{"$f":"IF(dms_RPT=\"financial\",dms_fy5,dms_cy5)","v":"2009-10"},{"$f":"IF(dms_RPT=\"financial\",dms_fy6,dms_cy6)","v":"2010-11"},{"$f":"IF(dms_RPT=\"financial\",dms_fy7,dms_cy7)","v":"2011-12"},{"$f":"IF(dms_RPT=\"financial\",dms_fy8,dms_cy8)","v":"2012-13"},{"$f":"IF(dms_RPT=\"financial\",dms_fy9,dms_cy9)","v":"2013-14"},{"$f":"IF(dms_RPT=\"financial\",dms_fy10,dms_cy10)","v":"2014-15"},{"$f":"IF(dms_RPT=\"financial\",dms_fy11,dms_cy11)","v":"2015-16"},{"$f":"IF(dms_RPT=\"financial\",dms_fy12,dms_cy12)","v":"2016-17"},{"$f":"IF(dms_RPT=\"financial\",dms_fy13,dms_cy13)","v":"2017-18"},null,{"$f":"IF(dms_RPT=\"financial\",dms_fy1,dms_cy1)","v":"2005-06"},{"$f":"IF(dms_RPT=\"financial\",dms_fy2,dms_cy2)","v":"2006-07"},{"$f":"IF(dms_RPT=\"financial\",dms_fy3,dms_cy3)","v":"2007-08"},{"$f":"IF(dms_RPT=\"financial\",dms_fy4,dms_cy4)","v":"2008-09"},{"$f":"IF(dms_RPT=\"financial\",dms_fy5,dms_cy5)","v":"2009-10"},{"$f":"IF(dms_RPT=\"financial\",dms_fy6,dms_cy6)","v":"2010-11"},{"$f":"IF(dms_RPT=\"financial\",dms_fy7,dms_cy7)","v":"2011-12"},{"$f":"IF(dms_RPT=\"financial\",dms_fy8,dms_cy8)","v":"2012-13"},{"$f":"IF(dms_RPT=\"financial\",dms_fy9,dms_cy9)","v":"2013-14"},{"$f":"IF(dms_RPT=\"financial\",dms_fy10,dms_cy10)","v":"2014-15"},{"$f":"IF(dms_RPT=\"financial\",dms_fy11,dms_cy11)","v":"2015-16"},{"$f":"IF(dms_RPT=\"financial\",dms_fy12,dms_cy12)","v":"2016-17"},{"$f":"IF(dms_RPT=\"financial\",dms_fy13,dms_cy13)","v":"2017-18"}]
[null,"For overhead network assets less than 33kV:"]
["DRAB0201","Opening value",523135277.01085365,525653908.78396767,523753314.50121868,527163089.41620022,521459489.50706112,518995407.1217702,530949756.46962076,536528173.69923353,549953961.60939026,543342703.12237525,537773025.62776363,390841866.32422578,432227686.31362474,null,566821942.93262541,571527192.50321269,571475971.26915944,577904574.91480637,574429708.17726183,575481677.1850487,591059343.47819972,598974375.21612704,615452274.13956606,612452547.31498075,610004065.10406232,469324979.51047426,512458027.02110863,null,0,0,0,0,0,0,0,0,0,0,0,0,0]
["DRAB0202","Inflation addition",15586820.114146337,12830325.530147484,22205110.880690236,13020928.308580147,15070179.246754071,17282547.057154957,8389006.1522200089,13405710.800560256,16022049.693839919,7154815.0498616118,9080595.1794557571,5768883.6357819438,8251619.4659873247,null,16908636.853190023,13921258.0279007,24240016.052894026,14274243.000395726,16601018.566322872,19163539.850262132,9338737.6269555595,14989478.80484903,17941150.250974074,8073975.9776232652,10300256.258792877,6927305.9706343412,9783289.6067665815,null,0,0,0,0,0,0,0,0,0,0,0,0,0]
["DRAB0203","Straight line depreciation",-24127873.371474799,-24921875.401069917,-25571103.227591813,-26749516.379586834,-27392212.563327368,-28772140.033195432,-29558830.329127029,-30623157.682762001,-31572944.7032336,-32420290.548281752,-32906168.349069051,-33067112.283617064,-37001059.413950168,null,-26069822.259270623,-26999665.88714359,-27776450.173260901,-29121527.532038845,-29873370.576878656,-31479144.854544733,-32453814.321963269,-33593280.415333927,-34715304.837752767,-35787697.237837903,-37677913.579999998,-39707163.259999998,-43869216.399999999,null,0,0,0,0,0,0,0,0,0,0,0,0,0]
["DRAB0205","Actual additions (recognised in RAB)",11059685.030442491,10190955.588173462,6775767.2618831564,8024988.1618676214,9857950.9312823918,23443942.323891036,26748241.406519823,30643234.792358529,8939636.5223787334,19695798.003808454,-123105586.13392457,68684048.637234122,39085584.89542637,null,13866434.976667857,13027186.625189712,9965037.7660138439,11372417.794098468,14324321.018342596,27893271.297433645,31030108.432935074,35081700.533923946,13774427.762193408,25265239.049296275,-113301428.27238089,75912904.800000012,42946840.310000002,null,0,0,0,0,0,0,0,0,0,0,0,0,0]
["DRAB0206","Disposals ",0,0,0,0,0,0,0,0,0,0,0,0,0,null,0,0,0,0,0,0,0,0,0,0,0,0,0,null,0,0,0,0,0,0,0,0,0,0,0,0,0]
["DRAB0207","Closing value",{"$f":"SUM(C26:C30)","v":525653908.78396767},523753314.50121868,527163089.41620022,521459489.50706112,518995407.1217702,530949756.46962076,536528173.69923353,{"$f":"SUM(J26:J30)","v":549953961.60939026},543342703.12237525,537773025.62776363,390841866.32422578,{"$f":"SUM(N26:N30)","v":432227686.31362474},442563831.26108831,null,{"$f":"SUM(Q26:Q30)","v":571527192.50321269},571475971.26915944,577904574.91480637,574429708.17726183,575481677.1850487,591059343.47819972,598974375.21612704,615452274.13956606,612452547.31498075,610004065.10406232,469324979.51047426,512458027.02110863,521318940.53787524,null,{"$f":"SUM(AE26:AE30)","v":0},0,0,0,0,0,0,0,0,0,0,0,0]
[null,"For underground network assets less than 33kV:"]
["DRAB0301","Opening value",818760910.81417954,812733995.72337067,810193418.21643519,822985627.58916533,801135277.1415776,758557364.17566872,774123570.45751047,778847939.01302898,822996848.92728114,850055307.14781106,858838397.13231587,806147509.76363003,826152416.65733254,null,887459121.162184,886671205.76065683,889487361.74741101,909225784.7965647,892346788.2517401,853880491.07320082,874138582.05653441,881792588.82634652,930350058.42905736,962712144.41115928,975810384.44390345,920567222.83027828,940802064.25633383,null,0,0,0,0,0,0,0,0,0,0,0,0,0]
["DRAB0302","Inflation addition",24394591.565077059,19838445.637172595,34348514.528222024,20327745.001452379,23152809.509391591,25259960.227049775,12231152.413228666,19456747.699562266,24078069.878839493,11264265.681216981,14501961.677656412,11898856.232673407,15772000.68163991,null,26474213.575211778,21596355.659212895,37729457.706725985,22457876.884475157,25788822.180475298,28434220.352737609,13811389.596493253,22068053.99054797,27223518.917241544,12762601.616819514,16477098.424005985,13587708.086055636,17960766.681257248,null,0,0,0,0,0,0,0,0,0,0,0,0,0]
["DRAB0303","Straight line depreciation",-44565030.679271102,-46078310.641754203,-47729629.508745313,-50752741.855089672,-52272393.716237776,-51498675.675433576,-53095245.039260484,-54947510.473888934,-57305052.655420929,-59828823.017382838,-60904120.000254929,-63023017.421736881,-64407466.371620491,null,-48014684.921393998,-49922349.489556298,-51971949.44758641,-55417629.450689785,-57253370.91152484,-56609653.529388741,-58408042.11067491,-60312877.826510176,-62840353.620608926,-65600189.576877967,-68974843.190000013,-71968124.219999999,-73345639.49000001,null,0,0,0,0,0,0,0,0,0,0,0,0,0]
["DRAB0305","Actual additions (recognised in RAB)",14143524.023385189,23699287.497646119,26173324.353253376,8574646.4060496371,-13458328.759062687,41804921.730225518,45588461.181550369,79639672.688578814,60285440.997111335,57347647.320670709,-6288729.046087414,71129068.082765892,121663882.78457361,null,20752555.944655098,31142149.817097533,33980914.790014192,16080756.021390075,-7001748.4474897496,48433524.159984738,52250659.283993751,86802293.438672975,67978920.68546924,65935827.99280262,-2745416.8476310968,78615257.560000002,133683028.13999999,null,0,0,0,0,0,0,0,0,0,0,0,0,0]
["DRAB0306","Disposals ",0,0,0,0,0,0,0,0,0,0,0,0,0,null,0,0,0,0,0,0,0,0,0,0,0,0,0,null,0,0,0,0,0,0,0,0,0,0,0,0,0]
["DRAB0307","Closing value",{"$f":"SUM(C33:C37)","v":812733995.72337067},810193418.21643519,822985627.58916533,801135277.1415776,758557364.17566872,774123570.45751047,778847939.01302898,{"$f":"SUM(J33:J37)","v":822996848.92728114},850055307.14781106,858838397.13231587,806147509.76363003,{"$f":"SUM(N33:N37)","v":826152416.65733254},899180833.75192547,null,{"$f":"SUM(Q33:Q37)","v":886671205.76065683},889487361.74741101,909225784.7965647,892346788.2517401,853880491.07320082,874138582.05653441,881792588.82634652,930350058.42905736,962712144.41115928,975810384.44390345,920567222.83027828,940802064.25633383,1019100219.5875911,null,{"$f":"SUM(AE33:AE37)","v":0},0,0,0,0,0,0,0,0,0,0,0,0]
[null,"For distribution substations and transformers:"]
["DRAB0401","Opening value",483792489.07224137,504343858.89910567,524225749.485695,550638287.20413876,577102855.99837923,627286613.49240601,697201500.36697769,776715935.90938759,841871992.19511366,906423311.94034064,945913977.03000736,1149102033.2322149,1140677623.7118783,null,483792489.07224137,504343858.89910567,524225749.485695,550638287.20413876,577102855.99837923,627286613.49240601,697201500.36697769,776715935.90938759,841871992.19511366,906423311.94034064,945913977.03000736,1149102033.2322149,1140677623.7118783,null,0,0,0,0,0,0,0,0,0,0,0,0,0]
["DRAB0402","Inflation addition",14431152.443264961,12285817.468353072,22235389.514259998,13600765.693942228,16678272.538353158,20888644.229297128,11015783.70579825,19436485.512635265,24732704.391019709,12096931.732705675,15972281.038030267,16960915.619663477,21776572.816317558,null,14431152.443264961,12285817.468353072,22235389.514259998,13600765.693942228,16678272.538353158,20888644.229297128,11015783.70579825,19436485.512635265,24732704.391019709,12096931.732705675,15972281.038030267,16960915.619663477,21776572.816317558,null,0,0,0,0,0,0,0,0,0,0,0,0,0]
["DRAB0403","Straight line depreciation",-22804677.37280434,-24077676.235977996,-25267035.37183769,-27094503.018938523,-28678122.460079897,-32287357.433594357,-34613011.491364628,-37872195.434309013,-40318335.427574754,-43242921.77039548,-54299193.830000006,-56228073.390000001,-58336045.300000004,null,-22804677.37280434,-24077676.235977996,-25267035.37183769,-27094503.018938523,-28678122.460079897,-32287357.433594357,-34613011.491364628,-37872195.434309013,-40318335.427574754,-43242921.77039548,-54299193.830000006,-56228073.390000001,-58336045.300000004,null,0,0,0,0,0,0,0,0,0,0,0,0,0]
["DRAB0405","Actual additions (recognised in RAB)",28924894.756403696,31673749.35421424,29444183.576021396,39958306.119236864,62183607.415753447,81313600.078868881,103111663.3279762,83591766.207399786,80136950.781781986,70636655.127356514,241514968.99417722,30842748.25,52531678.969999999,null,28924894.756403696,31673749.35421424,29444183.576021396,39958306.119236864,62183607.415753447,81313600.078868881,103111663.3279762,83591766.207399786,80136950.781781986,70636655.127356514,241514968.99417722,30842748.25,52531678.969999999,null,0,0,0,0,0,0,0,0,0,0,0,0,0]
["DRAB0406","Disposals ",0,0,0,0,0,0,0,0,0,0,0,0,0,null,0,0,0,0,0,0,0,0,0,0,0,0,0,null,0,0,0,0,0,0,0,0,0,0,0,0,0]
["DRAB0407","Closing value",{"$f":"SUM(C40:C44)","v":504343858.89910567},524225749.485695,550638287.20413876,577102855.99837923,627286613.49240601,697201500.36697769,776715935.90938759,{"$f":"SUM(J40:J44)","v":841871992.19511366},906423311.94034064,945913977.03000736,1149102033.2322149,{"$f":"SUM(N40:N44)","v":1140677623.7118783},1156649830.1981959,null,{"$f":"SUM(Q40:Q44)","v":504343858.89910567},524225749.485695,550638287.20413876,577102855.99837923,627286613.49240601,697201500.36697769,776715935.90938759,841871992.19511366,906423311.94034064,945913977.03000736,1149102033.2322149,1140677623.7118783,1156649830.1981959,null,{"$f":"SUM(AE40:AE44)","v":0},0,0,0,0,0,0,0,0,0,0,0,0]
[null,"For overhead network assets 33kV and above:"]
["DRAB0501","Opening value",91726651.994205028,95430924.305787593,98639311.228327811,103277637.6640715,108785129.27471809,118207529.74662253,127958727.02776553,132484084.41814706,139287712.31240267,142966956.72989982,145708010.51678517,151809545.1455521,152066783.84921336,null,91726651.994205028,95430924.305787593,98639311.228327811,103277637.6640715,108785129.27471809,118207529.74662253,127958727.02776553,132484084.41814706,139287712.31240267,142966956.72989982,145708010.51678517,151809545.1455521,152066783.84921336,null,0,0,0,0,0,0,0,0,0,0,0,0,0]
["DRAB0502","Inflation addition",2736171.6993290787,2324641.4866188401,4183876.7915786146,2550957.6503025671,3143890.2360393531,3936310.7405625312,2021747.8870386959,3315222.1807961846,4072533.363797897,1894855.1160071499,2460360.4027224779,2240731.2936612666,2903093.14621225,null,2736171.6993290787,2324641.4866188401,4183876.7915786146,2550957.6503025671,3143890.2360393531,3936310.7405625312,2021747.8870386959,3315222.1807961846,4072533.363797897,1894855.1160071499,2460360.4027224779,2240731.2936612666,2903093.14621225,null,0,0,0,0,0,0,0,0,0,0,0,0,0]
["DRAB0503","Straight line depreciation",-3789726.1776970592,-3983490.8682953799,-4156270.6713938541,-4431163.2210807297,-4680197.9008942423,-5140227.1755963583,-5431248.1278819293,-5713029.0724384915,-5969616.5431098286,-6233941.0659353901,-2945221.03,-3163206.4000000004,-3413136.98,null,-3789726.1776970592,-3983490.8682953799,-4156270.6713938541,-4431163.2210807297,-4680197.9008942423,-5140227.1755963583,-5431248.1278819293,-5713029.0724384915,-5969616.5431098286,-6233941.0659353901,-2945221.03,-3163206.4000000004,-3413136.98,null,0,0,0,0,0,0,0,0,0,0,0,0,0]
["DRAB0505","Actual additions (recognised in RAB)",4757826.7899505487,4867236.3042167593,4610720.3155589178,7387697.18142475,10958708.13675932,10955113.716176827,7934857.6312247738,9201434.785897918,5576327.5968091013,7080139.7368135946,6586395.2560444474,1179713.81,1362423.46,null,4757826.7899505487,4867236.3042167593,4610720.3155589178,7387697.18142475,10958708.13675932,10955113.716176827,7934857.6312247738,9201434.785897918,5576327.5968091013,7080139.7368135946,6586395.2560444474,1179713.81,1362423.46,null,0,0,0,0,0,0,0,0,0,0,0,0,0]
["DRAB0506","Disposals ",0,0,0,0,null,0,0,0,0,0,0,0,0,null,0,0,0,0,0,0,0,0,0,0,0,0,0,null,0,0,0,0,0,0,0,0,0,0,0,0,0]
["DRAB0507","Closing value",{"$f":"SUM(C47:C51)","v":95430924.305787593},98639311.228327811,103277637.6640715,108785129.27471809,118207529.74662253,127958727.02776553,132484084.41814706,{"$f":"SUM(J47:J51)","v":139287712.31240267},142966956.72989982,145708010.51678517,151809545.1455521,{"$f":"SUM(N47:N51)","v":152066783.84921336},152919163.47542563,null,{"$f":"SUM(Q47:Q51)","v":95430924.305787593},98639311.228327811,103277637.6640715,108785129.27471809,118207529.74662253,127958727.02776553,132484084.41814706,139287712.31240267,142966956.72989982,145708010.51678517,151809545.1455521,152066783.84921336,152919163.47542563,null,{"$f":"SUM(AE47:AE51)","v":0},0,0,0,0,0,0,0,0,0,0,0,0]
[null,"For underground network assets 33kV and above:"]
["DRAB0601","Opening value",15862840.078800192,16503442.106776468,17058287.70025114,17860421.310100123,18812864.866641793,20442337.093031067,22128670.123668388,22911267.318947837,24087859.496857692,24724133.300999839,25198160.172399212,21715478.338966373,22066672.154486176,null,15862840.078800192,16503442.106776468,17058287.70025114,17860421.310100123,18812864.866641793,20442337.093031067,22128670.123668388,22911267.318947837,24087859.496857692,24724133.300999839,25198160.172399212,21715478.338966373,22066672.154486176,null,0,0,0,0,0,0,0,0,0,0,0,0,0]
["DRAB0602","Inflation addition",473182.58271694276,402014.19479595387,723542.90722840431,441152.4063594733,543691.79464594799,680729.82519793487,349632.98795396066,573321.25545128889,704287.62045719905,327688.65999400866,425484.88095983863,320523.66551980004,421272.83204018697,null,473182.58271694276,402014.19479595387,723542.90722840431,441152.4063594733,543691.79464594799,680729.82519793487,349632.98795396066,573321.25545128889,704287.62045719905,327688.65999400866,425484.88095983863,320523.66551980004,421272.83204018697,null,0,0,0,0,0,0,0,0,0,0,0,0,0]
["DRAB0603","Straight line depreciation",-655380.07757057436,-688888.96765928669,-718768.8152914755,-766307.6326333757,-809374.69345018757,-888930.31504452124,-939258.3137812221,-987988.38256250077,-1032361.5928017711,-1078072.8178746316,-421296.85,-452478.4,-495286.17,null,-655380.07757057436,-688888.96765928669,-718768.8152914755,-766307.6326333757,-809374.69345018757,-888930.31504452124,-939258.3137812221,-987988.38256250077,-1032361.5928017711,-1078072.8178746316,-421296.85,-452478.4,-495286.17,null,0,0,0,0,0,0,0,0,0,0,0,0,0]
["DRAB0605","Actual additions (recognised in RAB)",822799.52282990713,841720.36633800494,797359.51791205641,1277598.7828155705,1895155.1251935142,1894533.5204839075,1372222.5211067107,1591259.3050210651,964347.77648672229,1224411.0292799957,-3486869.8643926755,483148.55,38750.979999999996,null,822799.52282990713,841720.36633800494,797359.51791205641,1277598.7828155705,1895155.1251935142,1894533.5204839075,1372222.5211067107,1591259.3050210651,964347.77648672229,1224411.0292799957,-3486869.8643926755,483148.55,38750.979999999996,null,0,0,0,0,0,0,0,0,0,0,0,0,0]
["DRAB0606","Disposals ",0,0,0,0,0,0,0,0,0,0,0,0,0,null,0,0,0,0,0,0,0,0,0,0,0,0,0,null,0,0,0,0,0,0,0,0,0,0,0,0,0]
["DRAB0607","Closing value",{"$f":"SUM(C54:C58)","v":16503442.106776468},17058287.70025114,17860421.310100123,18812864.866641793,20442337.093031067,22128670.123668388,22911267.318947837,{"$f":"SUM(J54:J58)","v":24087859.496857692},24724133.300999839,25198160.172399212,21715478.338966373,{"$f":"SUM(N54:N58)","v":22066672.154486176},22031409.796526361,null,{"$f":"SUM(Q54:Q58)","v":16503442.106776468},17058287.70025114,17860421.310100123,18812864.866641793,20442337.093031067,22128670.123668388,22911267.318947837,24087859.496857692,24724133.300999839,25198160.172399212,21715478.338966373,22066672.154486176,22031409.796526361,null,{"$f":"SUM(AE54:AE58)","v":0},0,0,0,0,0,0,0,0,0,0,0,0]
[null,"Zone substations and transformers"]
["DRAB0701","Opening value",256902568.2934466,267827543.25858766,278410485.92920965,292407840.97314209,306447540.58536434,333206143.54169512,370787182.26221979,417184647.70702279,452316078.3080523,487685387.33362925,509264108.41311055,493546218.30279779,486096648.07309741,null,256902568.2934466,267827543.25858766,278410485.92920965,292407840.97314209,306447540.58536434,333206143.54169512,370787182.26221979,417184647.70702279,452316078.3080523,487685387.33362925,509264108.41311055,493546218.30279779,486096648.07309741,null,0,0,0,0,0,0,0,0,0,0,0,0,0]
["DRAB0702","Inflation addition",7663201.7778074415,6524281.5747743128,11808968.085062344,7222473.6720366096,8856333.9229170308,11095764.579938451,5858437.4797430737,10439601.453034196,13290157.654171884,6509822.0287805181,8599206.3334296346,7284815.0302996039,9280026.9177590609,null,7663201.7778074415,6524281.5747743128,11808968.085062344,7222473.6720366096,8856333.9229170308,11095764.579938451,5858437.4797430737,10439601.453034196,13290157.654171884,6509822.0287805181,8599206.3334296346,7284815.0302996039,9280026.9177590609,null,0,0,0,0,0,0,0,0,0,0,0,0,0]
["DRAB0703","Straight line depreciation",-12102240.000889895,-12777809.205888169,-13408991.549497664,-14378812.419906061,-15219225.210381389,-17134614.196378082,-18368818.175941691,-20098438.185019199,-21396582.981822204,-22948635.012444239,-17550050.350000001,-18259718.199999999,-18501317.129999999,null,-12102240.000889895,-12777809.205888169,-13408991.549497664,-14378812.419906061,-15219225.210381389,-17134614.196378082,-18368818.175941691,-20098438.185019199,-21396582.981822204,-22948635.012444239,-17550050.350000001,-18259718.199999999,-18501317.129999999,null,0,0,0,0,0,0,0,0,0,0,0,0,0]
["DRAB0705","Actual additions (recognised in RAB)",15364013.1882235,16836470.301735833,15597378.508367775,21196038.360091768,33121494.243795138,43619888.336964235,58907846.141001634,44790267.333014511,43475734.353227235,38017534.063145027,-6767046.0937423706,3525332.94,17489442.719999999,null,15364013.1882235,16836470.301735833,15597378.508367775,21196038.360091768,33121494.243795138,43619888.336964235,58907846.141001634,44790267.333014511,43475734.353227235,38017534.063145027,-6767046.0937423706,3525332.94,17489442.719999999,null,0,0,0,0,0,0,0,0,0,0,0,0,0]
["DRAB0706","Disposals ",0,0,0,0,0,0,0,0,0,0,0,0,0,null,0,0,0,0,0,0,0,0,0,0,0,0,0,null,0,0,0,0,0,0,0,0,0,0,0,0,0]
["DRAB0707","Closing value",{"$f":"SUM(C61:C65)","v":267827543.25858766},278410485.92920965,292407840.97314209,306447540.58536434,333206143.54169512,370787182.26221979,417184647.70702279,{"$f":"SUM(J61:J65)","v":452316078.3080523},487685387.33362925,509264108.41311055,493546218.30279779,{"$f":"SUM(N61:N65)","v":486096648.07309741},494364800.58085644,null,{"$f":"SUM(Q61:Q65)","v":267827543.25858766},278410485.92920965,292407840.97314209,306447540.58536434,333206143.54169512,370787182.26221979,417184647.70702279,452316078.3080523,487685387.33362925,null,null,null,null,null,{"$f":"SUM(AE61:AE65)","v":0},0,0,0,0,0,0,0,0,0,0,0,0]
[null,"For easements:"]
["DRAB0801","Opening value",0,0,0,0,0,803328.94858892367,1087489.5350452524,3061196.6173490006,4128583.4712921362,4946005.1557346266,6047418.3917713929,6725577.2190872049,7175246.6015460566,null,0,0,0,0,0,803328.94858892367,1087489.5350452524,3061196.6173490006,4128583.4712921362,4946005.1557346266,6047418.3917713929,6725577.2190872049,7175246.6015460566,null,0,0,0,0,0,0,0,0,0,0,0,0,0]
["DRAB0802","Inflation addition",0,0,0,0,0,26750.85398801116,17182.334653714992,76582.335425008438,120967.49570885957,65781.868571270519,102114.00661527738,99270.512458851561,136981.98057497013,null,0,0,0,0,0,26750.85398801116,17182.334653714992,76582.335425008438,120967.49570885957,65781.868571270519,102114.00661527738,99270.512458851561,136981.98057497013,null,0,0,0,0,0,0,0,0,0,0,0,0,0]
["DRAB0805","Actual additions (recognised in RAB)",0,0,0,0,803328.94858892367,257409.73246831767,1956524.7476500331,990804.51851812704,696454.1887336307,1035631.3674654964,576044.82070053462,350398.87,566310.01,null,0,0,0,0,803328.94858892367,257409.73246831767,1956524.7476500331,990804.51851812704,696454.1887336307,1035631.3674654964,576044.82070053462,350398.87,566310.01,null,0,0,0,0,0,0,0,0,0,0,0,0,0]
["DRAB0806","Disposals ",0,0,0,0,0,0,0,0,0,0,0,0,0,null,0,0,0,0,0,0,0,0,0,0,0,0,0,null,0,0,0,0,0,0,0,0,0,0,0,0,0]
["DRAB0807","Closing value",{"$f":"SUM(C68:C71)","v":0},0,0,0,803328.94858892367,1087489.5350452524,3061196.6173490006,{"$f":"SUM(J68:J71)","v":4128583.4712921362},4946005.1557346266,6047418.3917713929,6725577.2190872049,{"$f":"SUM(N68:N71)","v":7175246.6015460566},7878538.5921210265,null,{"$f":"SUM(Q68:Q71)","v":0},0,0,0,803328.94858892367,1087489.5350452524,3061196.6173490006,4128583.4712921362,4946005.1557346266,6047418.3917713929,6725577.2190872049,7175246.6015460566,7878538.5921210265,null,{"$f":"SUM(AE68:AE71)","v":0},0,0,0,0,0,0,0,0,0,0,0,0]
[null,"For meters:"]
["DRAB0901","Opening value",0,0,0,0,0,0,0,0,0,0,0,0,0,null,4628174.5431602271,12444619.931444056,20003384.016758941,29835333.678677902,0,0,0,0,0,0,0,0,0,null,0,0,0,0,40205100.137253933,79147994.520192623,79821611.687428594,79065332.253696382,78583246.360737368,77642027.063276693,75610825.325131342,70559650.135131329,62757122.885834374]
["DRAB0902","Inflation addition",0,0,0,0,0,0,0,0,0,0,0,0,0,null,137919.60138617476,303341.4559774191,848380.40433668904,736932.74186334421,0,0,0,0,0,0,0,0,0,null,0,0,0,0,1161927.3939666385,2635628.2175224139,1261181.4646613717,1978657.283273689,2302489.118369604,1032638.9599415795,1276730.6340078562,1041470.8507030457,1198090.5278204754]
["DRAB0903","Straight line depreciation",0,0,0,0,0,0,0,0,0,0,0,0,0,null,0,-251921.8354907828,-501679.36285159102,-838079.45044107316,0,0,0,0,0,0,0,0,0,null,0,0,0,0,-1540625.9124519057,-5656401.8492107224,-6106828.4229423571,-6488345.9109317353,-6934913.4137889221,-7401319.7758634901,-8283769.8999999994,-8667169.5700000003,-9018562.6600000001]
["DRAB0905","Actual additions (recognised in RAB)",0,0,0,0,0,0,0,0,0,0,0,0,0,null,7678525.7868976556,7507344.4648282491,9485248.6204338614,10470913.167153757,0,0,0,0,0,0,0,0,0,null,0,0,0,0,39321592.901423953,3694390.7989242882,4089367.5245487615,4027602.7346990337,3691204.9979586392,4337479.0777765475,1955864.0759921372,-176828.53000000003,-450698.99]
["DRAB0906","Disposals ",0,0,0,0,0,0,0,0,0,0,0,0,0,null,0,0,0,0,0,0,0,0,0,0,0,0,0,null,0,0,0,0,0,0,0,0,0,0,0,0,0]
["DRAB0907","Closing value",{"$f":"SUM(C74:C78)","v":0},0,0,0,0,0,0,{"$f":"SUM(J74:J78)","v":0},0,0,0,{"$f":"SUM(N74:N78)","v":0},0,null,{"$f":"SUM(Q74:Q78)","v":12444619.931444056},20003384.016758941,29835333.678677902,40205100.137253925,0,0,0,0,0,0,0,0,0,null,{"$f":"SUM(AE74:AE78)","v":0},0,0,0,79147994.520192623,79821611.687428594,79065332.253696382,78583246.360737368,77642027.063276693,75610825.325131342,70559650.135131329,62757122.885834374,54485951.76365485]
[null,"For “other” asset items with long lives:"]
["DRAB1001","Opening value",245148948.4092361,270486831.36117464,270778347.77505618,272602010.5406093,299203653.43398893,301388824.8907063,337259348.80931813,359259081.6786477,389339561.76334447,414193661.16306645,448565094.7490266,455754280.40624458,455524203.47504526,null,245148948.4092361,270486831.36117464,270778347.77505618,272602010.5406093,299203653.43398893,301388824.8907063,337259348.80931813,359259081.6786477,389339561.76334447,414193661.16306645,448565094.7490266,455754280.40624458,455524203.47504526,null,39908889.299868084,41008214.002276972,40683716.868224971,41239235.380305298,40102037.736593053,40135074.816344999,40095800.657600746,39353040.224488735,38863549.258575149,37811605.419751778,36707377.639834031,34916841.105577663,36482048.370682523]
["DRAB1002","Inflation addition",7313109.4276047153,6588263.3366833115,11485582.027298521,6733269.6603530478,8646985.5842422768,10036247.868860515,5328697.7111872239,8990518.8463474289,11424496.086369991,5543258.0804645298,7574269.8925727606,6727000.448800683,8696371.1572508216,null,7313109.4276047153,6588263.3366833115,11485582.027298521,6733269.6603530478,8646985.5842422768,10036247.868860515,5328697.7111872239,8990518.8463474289,11424496.086369991,5543258.0804645298,7574269.8925727606,6727000.448800683,8696371.1572508216,null,1189284.901136071,1000600.4216555572,1724989.595212738,1018609.1138935385,1158948.8905875362,1336497.9913842895,633513.65039009228,983830.69256903115,1138701.9932762529,502894.35208269907,619824.38791464781,515377.72849561245,696475.46889484744]
["DRAB1003","Straight line depreciation",-9004100.8354313374,-11769204.197536929,-12778159.046875294,-13836392.646721328,-17614318.035330083,-12416079.873333963,-14683903.019191703,-17578385.989568159,-20548341.158945411,-23588697.194875736,-28042254.019999996,-33354126.609999996,-27506259.000000004,null,-9004100.8354313374,-11769204.197536929,-12778159.046875294,-13836392.646721328,-17614318.035330083,-12416079.873333963,-14683903.019191703,-17578385.989568159,-20548341.158945411,-23588697.194875736,-28042254.019999996,-33354126.609999996,-27506259.000000004,null,-3237165.0987271811,-3388973.3557075527,-3618308.6831324105,-3764430.9076057808,-3973472.9608355877,-4124141.834657995,-4369226.3783479687,-4546840.1887367386,-4773024.2717233486,-5007803.9588814406,-5197289.5652709408,-1949184.7458480787,-2086643.5774836547]
["DRAB1005","Actual additions (recognised in RAB)",29224874.359765165,9311457.2747351006,3182239.7851299029,33984765.87974792,11152503.907805134,38250355.923085265,31354938.177333999,38668347.227917477,33977944.47229737,52416872.700371303,28613755.414645195,27088407.260000005,56419500.099999994,null,29224874.359765165,9311457.2747351006,3182239.7851299029,33984765.87974792,11152503.907805134,38250355.923085265,31354938.177333999,38668347.227917477,33977944.47229737,52416872.700371303,28613755.414645195,27088407.260000005,56419500.099999994,null,3147204.9000000004,2063875.7999999998,2448837.5999999996,1608624.1499999994,2847561.1500000004,2748369.6845294549,2992952.294845873,3073518.5302541209,2582378.439623727,3400681.8268809933,2786928.6430999236,2999014.2824573275,5097129.9621798843]
["DRAB1006","Disposals ",-2196000,-3839000,-66000,-280000,0,0,0,0,0,0,-956585.63,-691358.02999999991,-574543.31000000006,null,-2196000,-3839000,-66000,-280000,0,0,0,0,0,0,-956585.63,-691358.02999999991,-574543.31000000006,null,0,0,0,0,0,0,0,0,0,0,0,0,0]
["DRAB1007","Closing value",{"$f":"SUM(C81:C85)","v":270486831.36117464},270778347.77505618,272602010.5406093,299203653.43398893,301388824.8907063,337259348.80931813,359259081.6786477,{"$f":"SUM(J81:J85)","v":389339561.76334447},414193661.16306645,448565094.7490266,455754280.40624458,{"$f":"SUM(N81:N85)","v":455524203.47504526},492559272.42229611,null,{"$f":"SUM(Q81:Q85)","v":270486831.36117464},270778347.77505618,272602010.5406093,299203653.43398893,301388824.8907063,337259348.80931813,359259081.6786477,389339561.76334447,414193661.16306645,448565094.7490266,455754280.40624458,455524203.47504526,492559272.42229611,null,{"$f":"SUM(AE81:AE85)","v":41008214.002276972},40683716.868224971,41239235.380305298,40102037.736593053,40135074.816344999,40095800.657600746,39353040.224488735,38863549.258575149,37811605.419751778,36707377.639834031,34916841.105577663,36482048.370682523,40189010.2242736]
[null,"For “other” asset items with short lives:"]
["DRAB1101","Opening value",62351216.21304179,81191753.857594714,74596406.762018681,68450088.494847,73222544.52593945,44235070.644661799,47543855.280490845,65397959.593110956,72271305.414886832,82040232.057320535,95037468.97267437,194530045.49812531,192141545.61259949,null,62351216.21304179,81191753.857594714,74596406.762018681,68450088.494847,73222544.52593945,44235070.644661799,47543855.280490845,65397959.593110956,72271305.414886832,82040232.057320535,95037468.97267437,194530045.49812531,192141545.61259949,null,0,0,0,0,0,0,0,0,0,0,0,0,-275862.37]
["DRAB1102","Inflation addition",1860071.4014194137,1977523.5011436387,3164182.1303922529,1690717.1858227206,2116131.5367996488,1473027.8524672373,751192.91343175515,1637544.0189020932,2134973.1883046422,1112405.1651489122,1604760.2640789449,2871292.1844741702,3668156.7798768878,null,1860071.4014194137,1977523.5011436387,3164182.1303922529,1690717.1858227206,2116131.5367996488,1473027.8524672373,751192.91343175515,1637544.0189020932,2134973.1883046422,1112405.1651489122,1604760.2640789449,2871292.1844741702,3668156.7798768878,null,0,0,0,0,0,0,0,0,0,0,0,0,-5266.4634272726835]
["DRAB1103","Straight line depreciation",-13246059.266945558,-19707566.28056252,-22203999.364871673,-25412832.148128103,-31286496.410701197,-14731190.992483482,-18685650.54333955,-27101261.27502384,-34707136.142312631,-43505453.963654228,180170.72999999963,-62857296.159999996,-67902569.49000001,null,-13246059.266945558,-19707566.28056252,-22203999.364871673,-25412832.148128103,-31286496.410701197,-14731190.992483482,-18685650.54333955,-27101261.27502384,-34707136.142312631,-43505453.963654228,180170.72999999963,-62857296.159999996,-67902569.49000001,null,0,0,0,0,0,0,0,0,0,0,0,-275862.37,-360310.09]
["DRAB1105","Actual additions (recognised in RAB)",31628525.510079067,13126695.683842855,15136498.967307741,32564570.993397828,1503890.9926238921,18917947.775845289,37269561.942527905,34243063.077897623,44899089.596441679,57778285.713859141,98792502.711371988,59340703.040000007,72339060.909999996,null,31628525.510079067,13126695.683842855,15136498.967307741,32564570.993397828,1503890.9926238921,18917947.775845289,37269561.942527905,34243063.077897623,44899089.596441679,57778285.713859141,98792502.711371988,59340703.040000007,72339060.909999996,null,0,0,0,0,0,0,0,0,0,0,0,0,0]
["DRAB1106","Disposals ",-1401999.9999999998,-1992000.0000000002,-2242999.9999999995,-4070000.0000000005,-1321000,-2351000,-1481000,-1906000,-2558000,-2388000,-1084857.18,-1743198.95,-1975453.08,null,-1401999.9999999998,-1992000.0000000002,-2242999.9999999995,-4070000.0000000005,-1321000,-2351000,-1481000,-1906000,-2558000,-2388000,-1084857.18,-1743198.95,-1975453.08,null,0,0,0,0,0,0,0,0,0,0,0,0,0]
["DRAB1107","Closing value",{"$f":"SUM(C88:C92)","v":81191753.857594714},74596406.762018681,68450088.494847,73222544.52593945,44235070.644661799,47543855.280490845,65397959.593110956,{"$f":"SUM(J88:J92)","v":72271305.414886832},82040232.057320535,95037468.97267437,194530045.49812531,{"$f":"SUM(N88:N92)","v":192141545.61259949},198270740.73247635,null,{"$f":"SUM(Q88:Q92)","v":81191753.857594714},74596406.762018681,68450088.494847,73222544.52593945,44235070.644661799,47543855.280490845,65397959.593110956,72271305.414886832,82040232.057320535,95037468.97267437,194530045.49812531,192141545.61259949,198270740.73247635,null,{"$f":"SUM(AE88:AE92)","v":0},0,0,0,0,0,0,0,0,0,0,-275862.37,-641438.9234272727]
[]
[]
[]
[]
[null,"3.3.3 - TOTAL DISAGGREGATED RAB ASSET VALUES"]
[null,null,"Network services",null,null,null,null,null,null,null,null,null,null,null,null,null,"Standard control services",null,null,null,null,null,null,null,null,null,null,null,null,null,"Alternative control services"]
[null,null,"$0's, Nominal",null,null,null,null,null,null,null,null,null,null,null,null,null,"$0's, Nominal",null,null,null,null,null,null,null,null,null,null,null,null,null,"$0's, Nominal"]
[null,null,{"$f":"IF(dms_RPT=\"financial\",dms_fy1,dms_cy1)","v":"2005-06"},{"$f":"IF(dms_RPT=\"financial\",dms_fy2,dms_cy2)","v":"2006-07"},{"$f":"IF(dms_RPT=\"financial\",dms_fy3,dms_cy3)","v":"2007-08"},{"$f":"IF(dms_RPT=\"financial\",dms_fy4,dms_cy4)","v":"2008-09"},{"$f":"IF(dms_RPT=\"financial\",dms_fy5,dms_cy5)","v":"2009-10"},{"$f":"IF(dms_RPT=\"financial\",dms_fy6,dms_cy6)","v":"2010-11"},{"$f":"IF(dms_RPT=\"financial\",dms_fy7,dms_cy7)","v":"2011-12"},{"$f":"IF(dms_RPT=\"financial\",dms_fy8,dms_cy8)","v":"2012-13"},{"$f":"IF(dms_RPT=\"financial\",dms_fy9,dms_cy9)","v":"2013-14"},{"$f":"IF(dms_RPT=\"financial\",dms_fy10,dms_cy10)","v":"2014-15"},{"$f":"IF(dms_RPT=\"financial\",dms_fy11,dms_cy11)","v":"2015-16"},{"$f":"IF(dms_RPT=\"financial\",dms_fy12,dms_cy12)","v":"2016-17"},{"$f":"IF(dms_RPT=\"financial\",dms_fy13,dms_cy13)","v":"2017-18"},null,{"$f":"IF(dms_RPT=\"financial\",dms_fy1,dms_cy1)","v":"2005-06"},{"$f":"IF(dms_RPT=\"financial\",dms_fy2,dms_cy2)","v":"2006-07"},{"$f":"IF(dms_RPT=\"financial\",dms_fy3,dms_cy3)","v":"2007-08"},{"$f":"IF(dms_RPT=\"financial\",dms_fy4,dms_cy4)","v":"2008-09"},{"$f":"IF(dms_RPT=\"financial\",dms_fy5,dms_cy5)","v":"2009-10"},{"$f":"IF(dms_RPT=\"financial\",dms_fy6,dms_cy6)","v":"2010-11"},{"$f":"IF(dms_RPT=\"financial\",dms_fy7,dms_cy7)","v":"2011-12"},{"$f":"IF(dms_RPT=\"financial\",dms_fy8,dms_cy8)","v":"2012-13"},{"$f":"IF(dms_RPT=\"financial\",dms_fy9,dms_cy9)","v":"2013-14"},{"$f":"IF(dms_RPT=\"financial\",dms_fy10,dms_cy10)","v":"2014-15"},{"$f":"IF(dms_RPT=\"financial\",dms_fy11,dms_cy11)","v":"2015-16"},{"$f":"IF(dms_RPT=\"financial\",dms_fy12,dms_cy12)","v":"2016-17"},{"$f":"IF(dms_RPT=\"financial\",dms_fy13,dms_cy13)","v":"2017-18"},null,{"$f":"IF(dms_RPT=\"financial\",dms_fy1,dms_cy1)","v":"2005-06"},{"$f":"IF(dms_RPT=\"financial\",dms_fy2,dms_cy2)","v":"2006-07"},{"$f":"IF(dms_RPT=\"financial\",dms_fy3,dms_cy3)","v":"2007-08"},{"$f":"IF(dms_RPT=\"financial\",dms_fy4,dms_cy4)","v":"2008-09"},{"$f":"IF(dms_RPT=\"financial\",dms_fy5,dms_cy5)","v":"2009-10"},{"$f":"IF(dms_RPT=\"financial\",dms_fy6,dms_cy6)","v":"2010-11"},{"$f":"IF(dms_RPT=\"financial\",dms_fy7,dms_cy7)","v":"2011-12"},{"$f":"IF(dms_RPT=\"financial\",dms_fy8,dms_cy8)","v":"2012-13"},{"$f":"IF(dms_RPT=\"financial\",dms_fy9,dms_cy9)","v":"2013-14"},{"$f":"IF(dms_RPT=\"financial\",dms_fy10,dms_cy10)","v":"2014-15"},{"$f":"IF(dms_RPT=\"financial\",dms_fy11,dms_cy11)","v":"2015-16"},{"$f":"IF(dms_RPT=\"financial\",dms_fy12,dms_cy12)","v":"2016-17"},{"$f":"IF(dms_RPT=\"financial\",dms_fy13,dms_cy13)","v":"2017-18"}]
["DRAB1201","Overhead network assets less than 33kV (wires and poles)",524394592.89741063,524703611.64259315,525458201.95870948,524311289.4616307,520227448.31441569,524972581.79569548,533738965.08442712,543241067.6543119,546648332.36588275,540557864.37506938,464307445.97599471,411534776.31892526,437395758.7873565,null,569174567.71791911,571501581.88618612,574690273.09198284,576167141.5460341,574955692.6811552,583270510.33162427,595016859.34716344,607213324.67784655,613952410.72727346,611228306.20952153,539664522.30726826,490891503.26579142,516888483.7794919,null,0,0,0,0,0,0,0,0,0,0,0,0,0]
["DRAB1202","Underground network assets less than 33kV (cables)",815747453.26877511,811463706.96990299,816589522.90280032,812060452.36537147,779846320.65862322,766340467.31658959,776485754.73526978,800922393.970155,836526078.03754616,854446852.14006352,832492953.44797301,816149963.21048129,862666625.20462894,null,887065163.46142042,888079283.75403392,899356573.27198792,900786286.5241524,873113639.66247046,864009536.56486762,877965585.44144046,906071323.627702,946531101.42010832,969261264.42753136,948188803.63709092,930684643.54330611,979951141.9219625,null,0,0,0,0,0,0,0,0,0,0,0,0,0]
["DRAB1203","Distribution substations including transformers",494068173.98567355,514284804.19240034,537432018.34491682,563870571.60125899,602194734.74539256,662244056.92969179,736958718.13818264,809293964.05225062,874147652.06772709,926168644.48517394,1047508005.1311111,1144889828.4720466,1148663726.9550371,null,494068173.98567355,514284804.19240034,537432018.34491682,563870571.60125899,602194734.74539256,662244056.92969179,736958718.13818264,809293964.05225062,874147652.06772709,926168644.48517394,1047508005.1311111,1144889828.4720466,1148663726.9550371,null,0,0,0,0,0,0,0,0,0,0,0,0,0]
["DRAB1204","Overhead network assets 33kV and above (wires and towers / poles etc) ",93578788.14999631,97035117.767057702,100958474.44619966,106031383.4693948,113496329.5106703,123083128.38719404,130221405.7229563,135885898.36527485,141127334.52115124,144337483.62334251,148758777.83116865,151938164.49738273,152492973.66231948,null,93578788.14999631,97035117.767057702,100958474.44619966,106031383.4693948,113496329.5106703,123083128.38719404,130221405.7229563,135885898.36527485,141127334.52115124,144337483.62334251,148758777.83116865,151938164.49738273,152492973.66231948,null,0,0,0,0,0,0,0,0,0,0,0,0,0]
["DRAB1205","Underground network assets 33kV and above(cables, ducts etc)",16183141.092788331,16780864.903513804,17459354.505175631,18336643.088370956,19627600.97983643,21285503.608349726,22519968.721308112,23499563.407902762,24405996.398928765,24961146.736699525,23456819.255682793,21891075.246726274,22049040.975506268,null,16183141.092788331,16780864.903513804,17459354.505175631,18336643.088370956,19627600.97983643,21285503.608349726,22519968.721308112,23499563.407902762,24405996.398928765,24961146.736699525,23456819.255682793,21891075.246726274,22049040.975506268,null,0,0,0,0,0,0,0,0,0,0,0,0,0]
["DRAB1206","Zone substations and transformers",262365055.77601713,273119014.59389865,285409163.45117587,299427690.77925324,319826842.06352973,351996662.90195745,393985914.98462129,434750363.00753754,470000732.82084078,498474747.87336993,501405163.35795414,489821433.18794763,490230724.3269769,null,262365055.77601713,273119014.59389865,285409163.45117587,299427690.77925324,319826842.06352973,351996662.90195745,393985914.98462129,434750363.00753754,470000732.82084078,498474747.87336993,501405163.35795414,489821433.18794763,490230724.3269769,null,0,0,0,0,0,0,0,0,0,0,0,0,0]
["DRAB1207","Easements ",0,0,0,0,401664.47429446183,945409.2418170881,2074343.0761971264,3594890.0443205684,4537294.3135133814,5496711.7737530097,6386497.8054292984,6950411.9103166312,7526892.596833542,null,0,0,0,0,401664.47429446183,945409.2418170881,2074343.0761971264,3594890.0443205684,4537294.3135133814,5496711.7737530097,6386497.8054292984,6950411.9103166312,7526892.596833542,null,0,0,0,0,0,0,0,0,0,0,0,0,0]
["DRAB1208","Meters",0,0,0,0,0,0,0,0,0,0,0,0,0,null,8536397.2373021413,16224001.974101499,24919358.847718421,35020216.907965913,0,0,0,0,0,0,0,0,0,null,0,0,0,0,59676547.328723282,79484803.103810608,79443471.970562488,78824289.307216883,78112636.712007031,76626426.194204018,73085237.730131328,66658386.510482848,58621537.324744612]
["DRAB1209","“Other” assets with long lives",257817889.88520539,270632589.56811541,271690179.15783274,285902831.98729908,300296239.16234761,319324086.85001218,348259215.24398291,374299321.72099608,401766611.46320546,431379377.95604652,452159687.57763559,455639241.94064492,474041737.94867069,null,257817889.88520539,270632589.56811541,271690179.15783274,285902831.98729908,300296239.16234761,319324086.85001218,348259215.24398291,374299321.72099608,401766611.46320546,431379377.95604652,452159687.57763559,455639241.94064492,474041737.94867069,null,40458551.651072532,40845965.435250968,40961476.124265134,40670636.558449179,40118556.276469022,40115437.736972868,39724420.44104474,39108294.741531938,38337577.339163467,37259491.529792905,35812109.372705847,35699444.738130093,38335529.297478065]
["DRAB1210","“Other” assets with short lives",71771485.035318255,77894080.309806705,71523247.62843284,70836316.510393232,58728807.585300624,45889462.962576322,56470907.436800897,68834632.503998891,77155768.736103684,88538850.514997452,144783757.23539984,193335795.5553624,195206143.17253792,null,71771485.035318255,77894080.309806705,71523247.62843284,70836316.510393232,58728807.585300624,45889462.962576322,56470907.436800897,68834632.503998891,77155768.736103684,88538850.514997452,144783757.23539984,193335795.5553624,195206143.17253792,null,0,0,0,0,0,0,0,0,0,0,0,-137931.185,-458650.64671363635]
["DRAB13","Value of Capital Contributions or Contributed Assets (included in the above)",0,0,0,0,0,0,0,0,0,0,0,0,0,null,-53577000,-60768000,-77922000,-121499000,-152519000,-109727000,-91217000,-71926000,-82690000,-65594000,-59634008.888888888,-52883615.956429593,-53265040.6027418,null,0,0,0,0,0,0,0,0,0,0,-5858890.5454545449,-6662437.3265710212,-6083691.6685736906]
[]
[]
[null,"3.3.4 - ASSET LIVES"]
[null,null,"Network services",null,null,null,null,null,null,null,null,null,null,null,null,null,"Standard control services",null,null,null,null,null,null,null,null,null,null,null,null,null,"Alternative control services"]
[null,null,"Service Life (Years)",null,null,null,null,null,null,null,null,null,null,null,null,null,"Service Life (Years)",null,null,null,null,null,null,null,null,null,null,null,null,null,"Service Life (Years)"]
[null,null,{"$f":"IF(dms_RPT=\"financial\",dms_fy1,dms_cy1)","v":"2005-06"},{"$f":"IF(dms_RPT=\"financial\",dms_fy2,dms_cy2)","v":"2006-07"},{"$f":"IF(dms_RPT=\"financial\",dms_fy3,dms_cy3)","v":"2007-08"},{"$f":"IF(dms_RPT=\"financial\",dms_fy4,dms_cy4)","v":"2008-09"},{"$f":"IF(dms_RPT=\"financial\",dms_fy5,dms_cy5)","v":"2009-10"},{"$f":"IF(dms_RPT=\"financial\",dms_fy6,dms_cy6)","v":"2010-11"},{"$f":"IF(dms_RPT=\"financial\",dms_fy7,dms_cy7)","v":"2011-12"},{"$f":"IF(dms_RPT=\"financial\",dms_fy8,dms_cy8)","v":"2012-13"},{"$f":"IF(dms_RPT=\"financial\",dms_fy9,dms_cy9)","v":"2013-14"},{"$f":"IF(dms_RPT=\"financial\",dms_fy10,dms_cy10)","v":"2014-15"},{"$f":"IF(dms_RPT=\"financial\",dms_fy11,dms_cy11)","v":"2015-16"},{"$f":"IF(dms_RPT=\"financial\",dms_fy12,dms_cy12)","v":"2016-17"},{"$f":"IF(dms_RPT=\"financial\",dms_fy13,dms_cy13)","v":"2017-18"},null,{"$f":"IF(dms_RPT=\"financial\",dms_fy1,dms_cy1)","v":"2005-06"},{"$f":"IF(dms_RPT=\"financial\",dms_fy2,dms_cy2)","v":"2006-07"},{"$f":"IF(dms_RPT=\"financial\",dms_fy3,dms_cy3)","v":"2007-08"},{"$f":"IF(dms_RPT=\"financial\",dms_fy4,dms_cy4)","v":"2008-09"},{"$f":"IF(dms_RPT=\"financial\",dms_fy5,dms_cy5)","v":"2009-10"},{"$f":"IF(dms_RPT=\"financial\",dms_fy6,dms_cy6)","v":"2010-11"},{"$f":"IF(dms_RPT=\"financial\",dms_fy7,dms_cy7)","v":"2011-12"},{"$f":"IF(dms_RPT=\"financial\",dms_fy8,dms_cy8)","v":"2012-13"},{"$f":"IF(dms_RPT=\"financial\",dms_fy9,dms_cy9)","v":"2013-14"},{"$f":"IF(dms_RPT=\"financial\",dms_fy10,dms_cy10)","v":"2014-15"},{"$f":"IF(dms_RPT=\"financial\",dms_fy11,dms_cy11)","v":"2015-16"},{"$f":"IF(dms_RPT=\"financial\",dms_fy12,dms_cy12)","v":"2016-17"},{"$f":"IF(dms_RPT=\"financial\",dms_fy13,dms_cy13)","v":"2017-18"},null,{"$f":"IF(dms_RPT=\"financial\",dms_fy1,dms_cy1)","v":"2005-06"},{"$f":"IF(dms_RPT=\"financial\",dms_fy2,dms_cy2)","v":"2006-07"},{"$f":"IF(dms_RPT=\"financial\",dms_fy3,dms_cy3)","v":"2007-08"},{"$f":"IF(dms_RPT=\"financial\",dms_fy4,dms_cy4)","v":"2008-09"},{"$f":"IF(dms_RPT=\"financial\",dms_fy5,dms_cy5)","v":"2009-10"},{"$f":"IF(dms_RPT=\"financial\",dms_fy6,dms_cy6)","v":"2010-11"},{"$f":"IF(dms_RPT=\"financial\",dms_fy7,dms_cy7)","v":"2011-12"},{"$f":"IF(dms_RPT=\"financial\",dms_fy8,dms_cy8)","v":"2012-13"},{"$f":"IF(dms_RPT=\"financial\",dms_fy9,dms_cy9)","v":"2013-14"},{"$f":"IF(dms_RPT=\"financial\",dms_fy10,dms_cy10)","v":"2014-15"},{"$f":"IF(dms_RPT=\"financial\",dms_fy11,dms_cy11)","v":"2015-16"},{"$f":"IF(dms_RPT=\"financial\",dms_fy12,dms_cy12)","v":"2016-17"},{"$f":"IF(dms_RPT=\"financial\",dms_fy13,dms_cy13)","v":"2017-18"}]
[null,"ESTIMATED SERVICE LIFE OF NEW ASSETS"]
["DRAB1401","Overhead network assets less than 33kV (wires and poles)",53.870917176411147,53.81499876464143,53.715826257353015,53.698097261906391,55,55,55,54.999999999999993,54.999999999999993,55,55,55.000000000000007,55,null,53.872729381799822,53.808779861703421,53.707520053489347,53.685796469453841,55,55.000000000000007,55,55,54.999999999999993,55,55,55,55,null,0,0,0,0,0,0,0,0,0,0,0,0,0]
["DRAB1402","Underground network assets less than 33kV (cables)",53.870917176411147,53.81499876464143,53.715826257353015,53.698097261906391,55,55,55,54.999999999999993,54.999999999999993,55,55,55,55.000000000000007,null,53.872729381799822,53.808779861703421,53.707520053489347,53.685796469453841,55,55.000000000000007,55,55,54.999999999999993,55,55,55.000000000000007,55.000000000000007,null,0,0,0,0,0,0,0,0,0,0,0,0,0]
["DRAB1403","Distribution substations including transformers",45,45,45,45,45,45,45,45,45,45,45,44.999999999999993,45.000000000000007,null,45,45,45,45,45,45,45,45,45,45,45,44.999999999999993,45.000000000000007,null,0,0,0,0,0,0,0,0,0,0,0,0,0]
["DRAB1404","Overhead network assets 33kV and above (wires and towers / poles etc) ",55,55,55,55,55,55,55,55,55,55,55.000000000000007,55,54.999999999999986,null,55,55,55,55,55,55,55,55,55,55,55.000000000000007,55,54.999999999999986,null,0,0,0,0,0,0,0,0,0,0,0,0,0]
["DRAB1405","Underground network assets 33kV and above(cables, ducts etc)",55,55,55,55,55,55,55,55,55,55,55,55,55,null,55,55,55,55,55,55,55,55,55,55,55,55,55,null,0,0,0,0,0,0,0,0,0,0,0,0,0]
["DRAB1406","Zone substations and transformers",45,45,45,45,45,45,45,45,45,45,45,45,44.999999999999993,null,45,45,45,45,45,45,45,45,45,45,45,45,44.999999999999993,null,0,0,0,0,0,0,0,0,0,0,0,0,0]
["DRAB1407","Meters",0,0,0,0,0,0,0,0,0,0,0,0,0,null,30,30,30,30,0,0,0,0,0,0,0,0,0,null,0,0,0,0,15,15,15,15,15,15,15,15,15.000000000000002]
["DRAB1408","“Other” assets with long lives",16.401685305410364,16.505892291637494,16.724505816817718,15.20405768134848,19.229323286962803,19.630845654964663,19.575252010882139,18.902274011039175,18.615949374598451,18.05528579771358,17.891095106098437,17.754865273953552,17.118593236411733,null,16.401685305410364,16.505892291637494,16.724505816817718,15.20405768134848,19.229323286962803,19.630845654964663,19.575252010882139,18.902274011039175,18.615949374598451,18.05528579771358,17.891095106098437,17.754865273953552,17.118593236411733,null,28,28,28,28,28,27.935871562027739,27.938129803677079,27.940412411646495,27.941837712890436,27.944462745916319,27.946068512239268,27.95291459407839,27.961318407995677]
["DRAB1409","“Other” assets with short lives",5.1505955467734026,5.3348360023483234,5.7674410258890711,5.8444972880855817,4.9999999999999991,5,5,5,5,5,5.0000000000000009,5,5,null,5.1505955467734026,5.3348360023483234,5.7674410258890711,5.8444972880855817,4.9999999999999991,5,5,5,5,5,5.0000000000000009,5,5,null,0,0,0,0,0,0,0,0,0,0,0,3,3]
[]
[null,"ESTIMATED RESIDUAL SERVICE LIFE"]
["DRAB1501","Overhead network assets less than 33kV (wires and poles)",20.304563394945696,19.576622080957272,18.922810311146623,18.29011925300571,16.838918445526559,16.110393444246782,16.130423476634245,15.644713032495304,15.019477228262408,16.345395413172184,11.869655762205918,11.43049592070348,10.876234082056362,null,20.441033790125715,19.740408778926437,19.12391131446417,18.544176380482014,17.185282258626021,16.525452695389241,16.563154781323831,16.11531209700658,15.537341118116814,15.194379262098796,12.024337669654811,11.558506962477566,10.990835473998613,null,0,0,0,0,0,0,0,0,0,0,0,0,0]
["DRAB1502","Underground network assets less than 33kV (cables)",16.994245753433685,16.241218390639727,15.590497109340733,14.734698607860484,13.716853186395324,13.021271233947791,13.003436285626226,12.884340267144001,12.720415588079311,14.510630808499226,12.835729947368289,12.899176114910295,13.451327019655579,null,17.166727002013396,16.441201247387749,15.834322779379898,15.0459171978107,14.162300075110521,13.549206066325574,13.553508483971003,13.457769700765549,13.318625080590577,13.605007552031669,13.012328356008666,13.05537253317852,13.612136170797312,null,0,0,0,0,0,0,0,0,0,0,0,0,0]
["DRAB1503","Distribution substations including transformers",19.831542862734484,19.493731882492785,19.263326475406892,19.147900695123166,17.966453602224284,17.979243699736369,18.971528806903866,18.980549915295192,19.015951872944576,17.709156338800319,20.788938510247409,19.690710979307308,19.269909165246069,null,19.831542862734484,19.493731882492785,19.263326475406892,19.147900695123166,17.966453602224284,17.979243699736369,18.971528806903866,18.980549915295192,19.015951872944576,17.709156338800319,20.788938510247409,19.690710979307308,19.269909165246069,null,0,0,0,0,0,0,0,0,0,0,0,0,0]
["DRAB1504","Overhead network assets 33kV and above (wires and towers / poles etc) ",22.841570941536602,22.471674682124501,22.235221206639064,22.254685515263894,21.477404107768621,21.27851293088348,21.503684406804542,21.209561678531362,20.814970668417434,18.772868255482457,48.826894075516741,44.865870866156776,43.698831741986993,null,22.841570941536602,22.471674682124501,22.235221206639064,22.254685515263894,21.477404107768621,21.27851293088348,21.503684406804542,21.209561678531362,20.814970668417434,18.772868255482457,48.826894075516741,44.865870866156776,43.698831741986993,null,0,0,0,0,0,0,0,0,0,0,0,0,0]
["DRAB1505","Underground network assets 33kV and above (cables, ducts etc)",22.841570941536602,22.471674682124501,22.235221206639064,22.254685515263898,21.477404107768621,21.27851293088348,21.503684406804535,21.209561678531365,20.814970668417427,18.772868255482457,48.826894075516726,44.86587086615679,43.698831741986993,null,22.841570941536602,22.471674682124501,22.235221206639064,22.254685515263898,21.477404107768621,21.27851293088348,21.503684406804535,21.209561678531365,20.814970668417427,18.772868255482457,48.826894075516726,44.86587086615679,43.698831741986993,null,0,0,0,0,0,0,0,0,0,0,0,0,0]
["DRAB1506","Zone substations and transformers",19.831542862734491,19.493731882492789,19.263326475406892,19.147900695123163,17.966453602224281,17.979243699736365,18.971528806903855,18.980549915295189,19.012460049071841,17.673272993937424,26.763501462795485,25.730256394245604,25.731621501579976,null,19.831542862734491,19.493731882492789,19.263326475406892,19.147900695123163,17.966453602224281,17.979243699736365,18.971528806903855,18.980549915295189,19.012460049071841,17.673272993937424,26.763501462795485,25.730256394245604,25.731621501579976,null,0,0,0,0,0,0,0,0,0,0,0,0,0]
["DRAB1507","Meters",0,0,0,0,0,0,0,0,0,0,0,0,0,null,49.398734759136737,39.872846080528198,35.59964829465256,26.096601265953996,0,0,0,0,0,0,0,0,0,null,0,0,0,0,13.992639955599458,13.070878393693171,12.185745541168671,11.331539656210797,10.490294895307159,10.392359030687905,8.2808524725320058,7.0074685533411314,6.1778222972609598]
["DRAB1508","“Other” assets with long lives",7.5641565890320992,6.7478936830164651,5.8087210408005356,5.7676086876111725,7.2303126890584686,7.2543750176319985,7.3300007787083725,7.0798736627515177,6.840385114744441,8.9213909167449756,7.3135709262464852,8.6496142148804154,10.788754478246924,null,7.5641565890320992,6.7478936830164651,5.8087210408005356,5.7676086876111725,7.2303126890584686,7.2543750176319985,7.3300007787083725,7.0798736627515177,6.840385114744441,8.9213909167449756,7.3135709262464852,8.6496142148804154,10.788754478246924,null,12.1004828595695,11.243849110464676,10.954972050884022,10.09244007241462,9.7317396989265532,9.1865843715051962,8.6634216037335765,8.1494664027210035,7.5568407241282793,7.0681702311380068,17.942136017846629,17.515247980212944,17.417981543396333]
["DRAB1509","“Other” assets with short lives",4.0028839019395477,3.2371226781026681,2.5965472821696474,2.2636229386672908,2.7277748958841248,2.2003632155448831,2.2286709747760183,1.8928336282009008,1.7099122199125121,4.6074439377083252,3.1509799465794592,2.8495122665481802,2.7646880969552621,null,4.0028839019395477,3.2371226781026681,2.5965472821696474,2.2636229386672908,2.7277748958841248,2.2003632155448831,2.2286709747760183,1.8928336282009008,1.7099122199125121,4.6074439377083252,3.1509799465794592,2.8495122665481802,2.7646880969552621,null,0,0,0,0,0,0,0,0,0,0,0,0,0]

{"sheet":"3.4 Operational data","index":9,"n_rows":126,"n_cols":16,"rows_kept":126,"cut":false,"hidden":false,"merged":[[47,3,47,15],[68,3,68,15],[69,3,69,15],[8,3,8,15],[9,3,9,15],[46,3,46,15]]}
[null,"REGULATORY REPORTING STATEMENT"]
[null,{"$f":"dms_TradingName","v":"SA Power Networks"}]
[null,{"$f":"CONCATENATE(\"ECONOMIC BENCHMARKING \",IF(SUM(dms_SingleYear_Model)>0,CRY,CONCATENATE(dms_CRCP_FirstYear_Result,\" to \",dms_CRCP_FinalYear_Result)))","v":"ECONOMIC BENCHMARKING 2005-06"}]
[null,"3.4 OPERATIONAL DATA"]
[]
[null,"There are THREE tables on this worksheet. Each table has been grouped for ease of navigation. See the Instructions sheet on how to group or ungroup tables. "]
[]
[null," 3.4.1 - ENERGY DELIVERY"]
[null,null,null,"Standard control services"]
[null,null,null,"VOLUMES (0's) \n(GWh)"]
[null,null,"Units",{"$f":"IF(dms_RPT=\"financial\",dms_fy1,dms_cy1)","v":"2005-06"},{"$f":"IF(dms_RPT=\"financial\",dms_fy2,dms_cy2)","v":"2006-07"},{"$f":"IF(dms_RPT=\"financial\",dms_fy3,dms_cy3)","v":"2007-08"},{"$f":"IF(dms_RPT=\"financial\",dms_fy4,dms_cy4)","v":"2008-09"},{"$f":"IF(dms_RPT=\"financial\",dms_fy5,dms_cy5)","v":"2009-10"},{"$f":"IF(dms_RPT=\"financial\",dms_fy6,dms_cy6)","v":"2010-11"},{"$f":"IF(dms_RPT=\"financial\",dms_fy7,dms_cy7)","v":"2011-12"},{"$f":"IF(dms_RPT=\"financial\",dms_fy8,dms_cy8)","v":"2012-13"},{"$f":"IF(dms_RPT=\"financial\",dms_fy9,dms_cy9)","v":"2013-14"},{"$f":"IF(dms_RPT=\"financial\",dms_fy10,dms_cy10)","v":"2014-15"},{"$f":"IF(dms_RPT=\"financial\",dms_fy11,dms_cy11)","v":"2015-16"},{"$f":"IF(dms_RPT=\"financial\",dms_fy12,dms_cy12)","v":"2016-17"},{"$f":"IF(dms_RPT=\"financial\",dms_fy13,dms_cy13)","v":"2017-18"}]
["DOPED01","Total energy delivered","GWh"]
[]
[null," 3.4.1.1 - Energy grouping - delivery by chargeable quantity"]
["DOPED0201","Energy Delivery where time of use is not a determinant","GWh"]
["DOPED0202","Energy Delivery at On-peak times","GWh"]
["DOPED0203","Energy Delivery at Shoulder times ","GWh"]
["DOPED0204","Energy Delivery at Off-peak times","GWh"]
["DOPED0205","Controlled load energy deliveries","GWh"]
["DOPED0206","Energy Delivery to unmetered supplies","GWh"]
[]
[null," 3.4.1.2 - Energy - received from TNSP and other DNSPs by time of receipt"]
["DOPED0301","Energy into DNSP network at On-peak times","GWh"]
["DOPED0302","Energy into DNSP network at Shoulder times ","GWh"]
["DOPED0303","Energy into DNSP network at Off-peak times","GWh"]
["DOPED0304","Energy received from TNSP and other DNSPs not included in the above categories","GWh"]
[]
[null," 3.4.1.3 - Energy - received into DNSP system from embedded generation by time of receipt"]
["DOPED0401","Energy into DNSP network at On-peak times from non-residential embedded generation","GWh"]
["DOPED0402","Energy into DNSP network at Shoulder times from non-residential embedded generation","GWh"]
["DOPED0403","Energy into DNSP network at Off-peak times from non-residential embedded generation","GWh"]
["DOPED0404","Energy received from embedded generation not included in above categories from non-residential embedded generation","GWh"]
["DOPED0405","Energy into DNSP network at On-peak times from residential embedded generation","GWh"]
["DOPED0406","Energy into DNSP network at Shoulder times from residential embedded generation","GWh"]
["DOPED0407","Energy into DNSP network at Off-peak times from residential embedded generation","GWh"]
["DOPED0408","Energy received from embedded generation not included in above categories from residential embedded generation","GWh"]
[]
[null," 3.4.1.4 - Energy grouping  - customer type or class"]
["DOPED0501","Residential customers energy deliveries","GWh"]
["DOPED0502","Non residential customers not on demand tariffs energy deliveries","GWh"]
["DOPED0503","Non-residential low voltage demand tariff customers energy deliveries","GWh"]
["DOPED0504","Non-residential high voltage demand tariff customers energy deliveries","GWh"]
["DOPED0505","Other Customer Class Energy Deliveries","GWh"]
[]
[]
[null," 3.4.2 -  CUSTOMER NUMBERS"]
[null,null,null,"Standard control services"]
[null,null,null,"VOLUMES (0's)"]
[null,null,null,{"$f":"IF(dms_RPT=\"financial\",dms_fy1,dms_cy1)","v":"2005-06"},{"$f":"IF(dms_RPT=\"financial\",dms_fy2,dms_cy2)","v":"2006-07"},{"$f":"IF(dms_RPT=\"financial\",dms_fy3,dms_cy3)","v":"2007-08"},{"$f":"IF(dms_RPT=\"financial\",dms_fy4,dms_cy4)","v":"2008-09"},{"$f":"IF(dms_RPT=\"financial\",dms_fy5,dms_cy5)","v":"2009-10"},{"$f":"IF(dms_RPT=\"financial\",dms_fy6,dms_cy6)","v":"2010-11"},{"$f":"IF(dms_RPT=\"financial\",dms_fy7,dms_cy7)","v":"2011-12"},{"$f":"IF(dms_RPT=\"financial\",dms_fy8,dms_cy8)","v":"2012-13"},{"$f":"IF(dms_RPT=\"financial\",dms_fy9,dms_cy9)","v":"2013-14"},{"$f":"IF(dms_RPT=\"financial\",dms_fy10,dms_cy10)","v":"2014-15"},{"$f":"IF(dms_RPT=\"financial\",dms_fy11,dms_cy11)","v":"2015-16"},{"$f":"IF(dms_RPT=\"financial\",dms_fy12,dms_cy12)","v":"2016-17"},{"$f":"IF(dms_RPT=\"financial\",dms_fy13,dms_cy13)","v":"2017-18"}]
[null," 3.4.2.1 - Distribution customer numbers by customer type or class"]
["DOPCN0101","Residential customer numbers"]
["DOPCN0102","Non residential customers not on demand tariff customer numbers"]
["DOPCN0103","Low voltage demand tariff customer numbers"]
["DOPCN0104","High voltage demand tariff customer numbers"]
["DOPCN0105","Unmetered Customer Numbers"]
["DOPCN0106","Other Customer Numbers"]
["DOPCN01","Total customer numbers",null,{"$f":"SUM(D51:D56)","v":0},0,0,0,0,0,0,0,0,null,null,null,0]
[]
[null," 3.4.2.2 - Distribution customer numbers by location on the network"]
["DOPCN0201","Customers on CBD network"]
["DOPCN0202","Customers on Urban network"]
["DOPCN0203","Customers on Short rural network"]
["DOPCN0204","Customers on Long rural network"]
["DOPCN02","Total customer numbers",null,{"$f":"SUM(D60:D63)","v":0},0,0,0,0,0,0,0,0,null,null,null,0]
[]
[]
[]
[null," 3.4.3 - SYSTEM DEMAND"]
[null,null,null,"Standard control services"]
[null,null,null,"VOLUMES (0's)"]
[null,null,"Units",{"$f":"IF(dms_RPT=\"financial\",dms_fy1,dms_cy1)","v":"2005-06"},{"$f":"IF(dms_RPT=\"financial\",dms_fy2,dms_cy2)","v":"2006-07"},{"$f":"IF(dms_RPT=\"financial\",dms_fy3,dms_cy3)","v":"2007-08"},{"$f":"IF(dms_RPT=\"financial\",dms_fy4,dms_cy4)","v":"2008-09"},{"$f":"IF(dms_RPT=\"financial\",dms_fy5,dms_cy5)","v":"2009-10"},{"$f":"IF(dms_RPT=\"financial\",dms_fy6,dms_cy6)","v":"2010-11"},{"$f":"IF(dms_RPT=\"financial\",dms_fy7,dms_cy7)","v":"2011-12"},{"$f":"IF(dms_RPT=\"financial\",dms_fy8,dms_cy8)","v":"2012-13"},{"$f":"IF(dms_RPT=\"financial\",dms_fy9,dms_cy9)","v":"2013-14"},{"$f":"IF(dms_RPT=\"financial\",dms_fy10,dms_cy10)","v":"2014-15"},{"$f":"IF(dms_RPT=\"financial\",dms_fy11,dms_cy11)","v":"2015-16"},{"$f":"IF(dms_RPT=\"financial\",dms_fy12,dms_cy12)","v":"2016-17"},{"$f":"IF(dms_RPT=\"financial\",dms_fy13,dms_cy13)","v":"2017-18"}]
[null,"3.4.3.1 - Annual system maximum demand characteristics at the zone substation level – MW measure"]
["DOPSD0101","Non-coincident Summated Raw System Annual Maximum Demand","MW "]
["DOPSD0102","Non–coincident Summated Weather Adjusted System Annual Maximum Demand 10% POE","MW "]
["DOPSD0103","Non–coincident Summated Weather Adjusted System Annual Maximum Demand 50% POE","MW "]
["DOPSD0104","Coincident Raw System Annual Maximum Demand","MW "]
["DOPSD0105","Coincident Weather Adjusted System Annual Maximum Demand 10% POE","MW "]
["DOPSD0106","Coincident Weather Adjusted System Annual Maximum Demand 50% POE","MW "]
[]
[null,"3.4.3.2 - Annual system maximum demand characteristics at the transmission connection point  – MW measure"]
["DOPSD0107","Non-coincident Summated Raw System Annual Maximum Demand","MW "]
["DOPSD0108","Non–coincident Summated Weather Adjusted System Annual Maximum Demand 10% POE","MW "]
["DOPSD0109","Non–coincident Summated Weather Adjusted System Annual Maximum Demand 50% POE","MW "]
["DOPSD0110","Coincident Raw System Annual Maximum Demand","MW "]
["DOPSD0111","Coincident Weather Adjusted System Annual Maximum Demand 10% POE","MW "]
["DOPSD0112","Coincident Weather Adjusted System Annual Maximum Demand 50% POE","MW "]
[]
[null,"3.4.3.3 - Annual system maximum demand characteristics at the zone substation level – MVA measure"]
["DOPSD0201","Non–coincident Summated Raw System Annual Maximum Demand"," MVA"]
["DOPSD0202","Non–coincident Summated Weather Adjusted System Annual Maximum Demand 10% POE"," MVA"]
["DOPSD0203","Non–coincident Summated Weather Adjusted System Annual Maximum Demand 50% POE"," MVA"]
["DOPSD0204","Coincident Raw System Annual Maximum Demand"," MVA"]
["DOPSD0205","Coincident Weather Adjusted System Annual Maximum Demand 10% POE"," MVA"]
["DOPSD0206","Coincident Weather Adjusted System Annual Maximum Demand 50% POE"," MVA"]
[]
[null,"3.4.3.4 - Annual system maximum demand characteristics at the transmission connection point – MVA measure"]
["DOPSD0207","Non–coincident Summated Raw System Annual Maximum Demand"," MVA"]
["DOPSD0208","Non–coincident Summated Weather Adjusted System Annual Maximum Demand 10% POE"," MVA"]
["DOPSD0209","Non–coincident Summated Weather Adjusted System Annual Maximum Demand 50% POE"," MVA"]
["DOPSD0210","Coincident Raw System Annual Maximum Demand"," MVA"]
["DOPSD0211","Coincident Weather Adjusted System Annual Maximum Demand 10% POE"," MVA"]
["DOPSD0212","Coincident Weather Adjusted System Annual Maximum Demand 50% POE"," MVA"]
[]
[null," 3.4.3.5 - Power factor conversion between MVA and MW"]
["DOPSD0301","Average overall network power factor conversion between MVA and MW","Factor"]
["DOPSD0302","Average power factor conversion for  low voltage distribution lines","Factor"]
["DOPSD0303","Average power factor conversion for 3.3 kV lines","Factor"]
["DOPSD0304","Average power factor conversion for 6.6 kV lines","Factor"]
["DOPSD0305","Average power factor conversion for 7.6 kV lines","Factor"]
["DOPSD0306","Average power factor conversion for 11 kV lines","Factor"]
["DOPSD0307","Average power factor conversion for SWER lines","Factor"]
["DOPSD0308","Average power factor conversion for 22 kV lines","Factor"]
["DOPSD0309","Average power factor conversion for 33 kV lines","Factor"]
["DOPSD0310","Average power factor conversion for 44 kV lines","Factor"]
["DOPSD0311","Average power factor conversion for 66 kV lines","Factor"]
["DOPSD0312","Average power factor conversion for 110 kV lines","Factor"]
["DOPSD0313","Average power factor conversion for 132 kV lines","Factor"]
["DOPSD0314","Average power factor conversion for 220 kV lines","Factor"]
[]
[null," 3.4.3.6 - Demand supplied (for customers charged on this basis) – MW measure"]
["DOPSD0401","Summated Chargeable Contracted Maximum Demand","MW "]
["DOPSD0402","Summated Chargeable Measured Maximum Demand ","MW "]
[]
[null," 3.4.3.7 - Demand supplied (for customers charged on this basis) – MVA measure"]
["DOPSD0403","Summated Chargeable Contracted Maximum Demand"," MVA"]
["DOPSD0404","Summated Chargeable Measured Maximum Demand "," MVA"]

{"sheet":"3.5 Physical assets","index":10,"n_rows":98,"n_cols":16,"rows_kept":98,"cut":false,"hidden":false,"merged":[[8,3,8,15],[75,3,75,15],[93,3,93,15]]}
[null,"REGULATORY REPORTING STATEMENT"]
[null,{"$f":"dms_TradingName","v":"SA Power Networks"}]
[null,{"$f":"CONCATENATE(\"ECONOMIC BENCHMARKING \",IF(SUM(dms_SingleYear_Model)>0,CRY,CONCATENATE(dms_CRCP_FirstYear_Result,\" to \",dms_CRCP_FinalYear_Result)))","v":"ECONOMIC BENCHMARKING 2005-06"}]
[null,"3.5 PHYSICAL ASSETS"]
[]
[null,"There are THREE tables on this worksheet. Each table has been grouped (and sub-grouped) for ease of navigation. See the Instructions sheet on how to group or ungroup tables. "]
[]
[null,"3.5.1 - NETWORK CAPACITIES"]
[null,null,null,"VOLUMES (0's)"]
[null,null,null,{"$f":"IF(dms_RPT=\"financial\",dms_fy1,dms_cy1)","v":"2005-06"},{"$f":"IF(dms_RPT=\"financial\",dms_fy2,dms_cy2)","v":"2006-07"},{"$f":"IF(dms_RPT=\"financial\",dms_fy3,dms_cy3)","v":"2007-08"},{"$f":"IF(dms_RPT=\"financial\",dms_fy4,dms_cy4)","v":"2008-09"},{"$f":"IF(dms_RPT=\"financial\",dms_fy5,dms_cy5)","v":"2009-10"},{"$f":"IF(dms_RPT=\"financial\",dms_fy6,dms_cy6)","v":"2010-11"},{"$f":"IF(dms_RPT=\"financial\",dms_fy7,dms_cy7)","v":"2011-12"},{"$f":"IF(dms_RPT=\"financial\",dms_fy8,dms_cy8)","v":"2012-13"},{"$f":"IF(dms_RPT=\"financial\",dms_fy9,dms_cy9)","v":"2013-14"},{"$f":"IF(dms_RPT=\"financial\",dms_fy10,dms_cy10)","v":"2014-15"},{"$f":"IF(dms_RPT=\"financial\",dms_fy11,dms_cy11)","v":"2015-16"},{"$f":"IF(dms_RPT=\"financial\",dms_fy12,dms_cy12)","v":"2016-17"},{"$f":"IF(dms_RPT=\"financial\",dms_fy13,dms_cy13)","v":"2017-18"}]
[null,"Circuit length"]
[null,"3.5.1.1 - Overhead network length of circuit at each voltage"]
["DPA0101","Overhead low voltage distribution","km"]
["DPA0102","Overhead 2.2 kV","km"]
["DPA0103","Overhead 6.6kv","km"]
["DPA0104","Overhead 7.6 kV","km"]
["DPA0105","Overhead 11 kV","km"]
["DPA0106","Overhead SWER","km"]
["DPA0107","Overhead 22 kV","km"]
["DPA0108","Overhead 33 kV","km"]
["DPA0109","Overhead 44 kV","km"]
["DPA0110","Overhead 66 kV","km"]
["DPA0111","Overhead 110kV","km"]
["DPA0112","Overhead 132 kV","km"]
["DPA0113","Overhead 220kV","km"]
["DPA0114","Other ","km"]
["DPA01","Total overhead circuit km","km",{"$f":"SUM(D13:D26)","v":0},{"$f":"SUM(E13:E26)","v":0},0,0,0,0,0,0,0,null,null,null,0]
[null,"3.5.1.2 - Underground network circuit length at each voltage"]
["DPA0201","Underground low voltage distribution","km"]
["DPA0202","Underground 5 kV","km"]
["DPA0203","Underground 6.6 Kv","km"]
["DPA0204","Underground 7.6 kV","km"]
["DPA0205","Underground 11 kV","km"]
["DPA0206","Underground SWER","km"]
["DPA0207","Underground 22 kV","km"]
["DPA0208","Underground 33 kV","km"]
["DPA0209","Underground 66 kV","km"]
["DPA0210","Underground 110 kV","km"]
["DPA0211","Underground 132 kV","km"]
["DPA0212","Other ","km"]
["DPA02","Total underground circuit km","km",{"$f":"SUM(D29:D40)","v":0},{"$f":"SUM(E29:E40)","v":0},0,0,0,0,0,0,0,null,null,null,0]
[]
[null,"Circuit Capacity MVA"]
[null,"3.5.1.3 - Estimated overhead network weighted average MVA capacity by voltage class"]
["DPA0301","Overhead low voltage distribution","MVA"]
["DPA0302","Overhead 6.6 kV","MVA"]
["DPA0303","Overhead 7.6 kV","MVA"]
["DPA0304","Overhead 11 kV","MVA"]
["DPA0305","Overhead SWER","MVA"]
["DPA0306","Overhead 22 kV","MVA"]
["DPA0307","Overhead 33 kV","MVA"]
["DPA0308","Overhead 44 kV","MVA"]
["DPA0309","Overhead 66 kV","MVA"]
["DPA0310","Overhead 110 kV","MVA"]
["DPA0311","Overhead 132 kV","MVA"]
["DPA0312","Overhead 220 kV","MVA"]
["DPA0313","Other ","MVA"]
[null,"3.5.1.4 - Estimated underground network weighted average MVA capacity by voltage class"]
["DPA0401","Underground low voltage distribution","MVA"]
["DPA0402","Underground 5 kV","MVA"]
["DPA0403","Underground 6.6 kV","MVA"]
["DPA0404","Underground 7.6 kV","MVA"]
["DPA0405","Underground 11 kV","MVA"]
["DPA0406","Underground SWER","MVA"]
["DPA0407","Underground 12.7 kV","MVA"]
["DPA0408","Underground 22 kV","MVA"]
["DPA0409","Underground 33 kV","MVA"]
["DPA0410","Underground 66 kV","MVA"]
["DPA0411","Underground 110 kV","MVA"]
["DPA0412","Underground 132 kV","MVA"]
["DPA0413","Other","MVA"]
[]
[]
[]
[null,"3.5.2 - TRANSFORMER CAPACITIES"]
[null,null,null,"VOLUMES (0's)"]
[null,null,null,{"$f":"IF(dms_RPT=\"financial\",dms_fy1,dms_cy1)","v":"2005-06"},{"$f":"IF(dms_RPT=\"financial\",dms_fy2,dms_cy2)","v":"2006-07"},{"$f":"IF(dms_RPT=\"financial\",dms_fy3,dms_cy3)","v":"2007-08"},{"$f":"IF(dms_RPT=\"financial\",dms_fy4,dms_cy4)","v":"2008-09"},{"$f":"IF(dms_RPT=\"financial\",dms_fy5,dms_cy5)","v":"2009-10"},{"$f":"IF(dms_RPT=\"financial\",dms_fy6,dms_cy6)","v":"2010-11"},{"$f":"IF(dms_RPT=\"financial\",dms_fy7,dms_cy7)","v":"2011-12"},{"$f":"IF(dms_RPT=\"financial\",dms_fy8,dms_cy8)","v":"2012-13"},{"$f":"IF(dms_RPT=\"financial\",dms_fy9,dms_cy9)","v":"2013-14"},{"$f":"IF(dms_RPT=\"financial\",dms_fy10,dms_cy10)","v":"2014-15"},{"$f":"IF(dms_RPT=\"financial\",dms_fy11,dms_cy11)","v":"2015-16"},{"$f":"IF(dms_RPT=\"financial\",dms_fy12,dms_cy12)","v":"2016-17"},{"$f":"IF(dms_RPT=\"financial\",dms_fy13,dms_cy13)","v":"2017-18"}]
[null,"Distribution transformer total installed capacity"]
["DPA0501","Distribution transformer capacity owned by utility","MVA"]
["DPA0502","Distribution transformer capacity owned by High Voltage Customers","MVA"]
["DPA0503","Cold spare capacity included in DPA0501","MVA"]
[null,"Zone substation transformer capacity"]
["DPA0601","Total installed capacity for first step transformation where there are two steps to reach distribution voltage","MVA"]
["DPA0602","Total installed capacity for second step transformation where there are two steps to reach distribution voltage","MVA"]
["DPA0603","Total zone substation transformer capacity where there is only a single step transformation to reach distribution voltage","MVA"]
["DPA0604","Total zone substation transformer  capacity ","MVA"]
["DPA0605","Cold spare capacity of zone substation transformers included in DPA0604","MVA"]
[null,"Distribution - other transformer capacity"]
[null,"Distribution other - transformer capacity owned by utility ","MVA"]
[]
[]
[]
[null,"3.5.3 - PUBLIC LIGHTING"]
[null,null,null,"VOLUMES (0's)"]
[null,null,null,{"$f":"IF(dms_RPT=\"financial\",dms_fy1,dms_cy1)","v":"2005-06"},{"$f":"IF(dms_RPT=\"financial\",dms_fy2,dms_cy2)","v":"2006-07"},{"$f":"IF(dms_RPT=\"financial\",dms_fy3,dms_cy3)","v":"2007-08"},{"$f":"IF(dms_RPT=\"financial\",dms_fy4,dms_cy4)","v":"2008-09"},{"$f":"IF(dms_RPT=\"financial\",dms_fy5,dms_cy5)","v":"2009-10"},{"$f":"IF(dms_RPT=\"financial\",dms_fy6,dms_cy6)","v":"2010-11"},{"$f":"IF(dms_RPT=\"financial\",dms_fy7,dms_cy7)","v":"2011-12"},{"$f":"IF(dms_RPT=\"financial\",dms_fy8,dms_cy8)","v":"2012-13"},{"$f":"IF(dms_RPT=\"financial\",dms_fy9,dms_cy9)","v":"2013-14"},{"$f":"IF(dms_RPT=\"financial\",dms_fy10,dms_cy10)","v":"2014-15"},{"$f":"IF(dms_RPT=\"financial\",dms_fy11,dms_cy11)","v":"2015-16"},{"$f":"IF(dms_RPT=\"financial\",dms_fy12,dms_cy12)","v":"2016-17"},{"$f":"IF(dms_RPT=\"financial\",dms_fy13,dms_cy13)","v":"2017-18"}]
["DPA0701","Public lighting luminaires","Number"]
["DPA0702","Public lighting poles","Number"]
["DPA0703","Public lighting columns ","Number"]

{"sheet":"3.6 Quality of service","index":11,"n_rows":38,"n_cols":16,"rows_kept":38,"cut":false,"hidden":false,"merged":[[8,3,8,15],[23,3,23,15],[30,3,30,15],[35,3,35,15]]}
[null,"REGULATORY REPORTING STATEMENT"]
[null,{"$f":"dms_TradingName","v":"SA Power Networks"}]
[null,{"$f":"CONCATENATE(\"ECONOMIC BENCHMARKING \",IF(SUM(dms_SingleYear_Model)>0,CRY,CONCATENATE(dms_CRCP_FirstYear_Result,\" to \",dms_CRCP_FinalYear_Result)))","v":"ECONOMIC BENCHMARKING 2005-06"}]
[null,"3.6 QUALITY OF SERVICE DATA"]
[]
[null,"There are THREE tables on this worksheet. Each table has been grouped (and sub-grouped) for ease of navigation. See the Instructions sheet on how to group or ungroup tables. "]
[]
[null,"3.6.1 - RELIABILITY"]
[null,null,null,"(0's)"]
[null,null,"Units",{"$f":"IF(dms_RPT=\"financial\",dms_fy1,dms_cy1)","v":"2005-06"},{"$f":"IF(dms_RPT=\"financial\",dms_fy2,dms_cy2)","v":"2006-07"},{"$f":"IF(dms_RPT=\"financial\",dms_fy3,dms_cy3)","v":"2007-08"},{"$f":"IF(dms_RPT=\"financial\",dms_fy4,dms_cy4)","v":"2008-09"},{"$f":"IF(dms_RPT=\"financial\",dms_fy5,dms_cy5)","v":"2009-10"},{"$f":"IF(dms_RPT=\"financial\",dms_fy6,dms_cy6)","v":"2010-11"},{"$f":"IF(dms_RPT=\"financial\",dms_fy7,dms_cy7)","v":"2011-12"},{"$f":"IF(dms_RPT=\"financial\",dms_fy8,dms_cy8)","v":"2012-13"},{"$f":"IF(dms_RPT=\"financial\",dms_fy9,dms_cy9)","v":"2013-14"},{"$f":"IF(dms_RPT=\"financial\",dms_fy10,dms_cy10)","v":"2014-15"},{"$f":"IF(dms_RPT=\"financial\",dms_fy11,dms_cy11)","v":"2015-16"},{"$f":"IF(dms_RPT=\"financial\",dms_fy12,dms_cy12)","v":"2016-17"},{"$f":"IF(dms_RPT=\"financial\",dms_fy13,dms_cy13)","v":"2017-18"}]
[null,"INCLUSIVE OF MEDs"]
["DQS0101","Whole of network unplanned SAIDI","minutes/customer"]
["DQS0102","Whole of network unplanned SAIDI excluding excluded outages","minutes/customer"]
["DQS0103","Whole of network unplanned SAIFI","interruptions/customer"]
["DQS0104","Whole of network unplanned SAIFI excluding excluded outages","interruptions/customer"]
[null,"EXCLUSIVE OF MEDs"]
["DQS0105","Whole of network unplanned SAIDI","minutes/customer"]
["DQS0106","Whole of network unplanned SAIDI excluding excluded outages","minutes/customer"]
["DQS0107","Whole of network unplanned SAIFI","interruptions/customer"]
["DQS0108","Whole of network unplanned SAIFI excluding excluded outages","interruptions/customer"]
[]
[]
[null,"3.6.2 - ENERGY NOT SUPPLIED"]
[null,null,null,"(0's)"]
[null,null,"Unit",{"$f":"IF(dms_RPT=\"financial\",dms_fy1,dms_cy1)","v":"2005-06"},{"$f":"IF(dms_RPT=\"financial\",dms_fy2,dms_cy2)","v":"2006-07"},{"$f":"IF(dms_RPT=\"financial\",dms_fy3,dms_cy3)","v":"2007-08"},{"$f":"IF(dms_RPT=\"financial\",dms_fy4,dms_cy4)","v":"2008-09"},{"$f":"IF(dms_RPT=\"financial\",dms_fy5,dms_cy5)","v":"2009-10"},{"$f":"IF(dms_RPT=\"financial\",dms_fy6,dms_cy6)","v":"2010-11"},{"$f":"IF(dms_RPT=\"financial\",dms_fy7,dms_cy7)","v":"2011-12"},{"$f":"IF(dms_RPT=\"financial\",dms_fy8,dms_cy8)","v":"2012-13"},{"$f":"IF(dms_RPT=\"financial\",dms_fy9,dms_cy9)","v":"2013-14"},{"$f":"IF(dms_RPT=\"financial\",dms_fy10,dms_cy10)","v":"2014-15"},{"$f":"IF(dms_RPT=\"financial\",dms_fy11,dms_cy11)","v":"2015-16"},{"$f":"IF(dms_RPT=\"financial\",dms_fy12,dms_cy12)","v":"2016-17"},{"$f":"IF(dms_RPT=\"financial\",dms_fy13,dms_cy13)","v":"2017-18"}]
["DQS0201","Energy Not Supplied (planned)","GWh"]
["DQS0202","Energy Not Supplied (unplanned)","GWh"]
["DQS02","Total",null,{"$f":"SUM(D26:D27)","v":0},{"$f":"SUM(E26:E27)","v":0},0,0,0,0,0,0,0,null,null,null,{"$f":"SUM(P26:P27)","v":0}]
[]
[null,"3.6.3 - SYSTEM LOSSES"]
[null,null,null,"(0's)"]
[null,null,"Unit",{"$f":"IF(dms_RPT=\"financial\",dms_fy1,dms_cy1)","v":"2005-06"},{"$f":"IF(dms_RPT=\"financial\",dms_fy2,dms_cy2)","v":"2006-07"},{"$f":"IF(dms_RPT=\"financial\",dms_fy3,dms_cy3)","v":"2007-08"},{"$f":"IF(dms_RPT=\"financial\",dms_fy4,dms_cy4)","v":"2008-09"},{"$f":"IF(dms_RPT=\"financial\",dms_fy5,dms_cy5)","v":"2009-10"},{"$f":"IF(dms_RPT=\"financial\",dms_fy6,dms_cy6)","v":"2010-11"},{"$f":"IF(dms_RPT=\"financial\",dms_fy7,dms_cy7)","v":"2011-12"},{"$f":"IF(dms_RPT=\"financial\",dms_fy8,dms_cy8)","v":"2012-13"},{"$f":"IF(dms_RPT=\"financial\",dms_fy9,dms_cy9)","v":"2013-14"},{"$f":"IF(dms_RPT=\"financial\",dms_fy10,dms_cy10)","v":"2014-15"},{"$f":"IF(dms_RPT=\"financial\",dms_fy11,dms_cy11)","v":"2015-16"},{"$f":"IF(dms_RPT=\"financial\",dms_fy12,dms_cy12)","v":"2016-17"},{"$f":"IF(dms_RPT=\"financial\",dms_fy13,dms_cy13)","v":"2017-18"}]
["DQS03","System losses","%"]
[]
[null,"3.6.4 - CAPACITY UTILISATION"]
[null,null,null,"(0's)"]
[null,null,"Unit",{"$f":"IF(dms_RPT=\"financial\",dms_fy1,dms_cy1)","v":"2005-06"},{"$f":"IF(dms_RPT=\"financial\",dms_fy2,dms_cy2)","v":"2006-07"},{"$f":"IF(dms_RPT=\"financial\",dms_fy3,dms_cy3)","v":"2007-08"},{"$f":"IF(dms_RPT=\"financial\",dms_fy4,dms_cy4)","v":"2008-09"},{"$f":"IF(dms_RPT=\"financial\",dms_fy5,dms_cy5)","v":"2009-10"},{"$f":"IF(dms_RPT=\"financial\",dms_fy6,dms_cy6)","v":"2010-11"},{"$f":"IF(dms_RPT=\"financial\",dms_fy7,dms_cy7)","v":"2011-12"},{"$f":"IF(dms_RPT=\"financial\",dms_fy8,dms_cy8)","v":"2012-13"},{"$f":"IF(dms_RPT=\"financial\",dms_fy9,dms_cy9)","v":"2013-14"},{"$f":"IF(dms_RPT=\"financial\",dms_fy10,dms_cy10)","v":"2014-15"},{"$f":"IF(dms_RPT=\"financial\",dms_fy11,dms_cy11)","v":"2015-16"},{"$f":"IF(dms_RPT=\"financial\",dms_fy12,dms_cy12)","v":"2016-17"},{"$f":"IF(dms_RPT=\"financial\",dms_fy13,dms_cy13)","v":"2017-18"}]
["DQS04","Overall utilisation","%"]

{"sheet":"3.7 Operating environment","index":12,"n_rows":36,"n_cols":16,"rows_kept":36,"cut":false,"hidden":false,"merged":[[8,3,8,15],[15,3,15,15],[33,3,33,15]]}
[null,"REGULATORY REPORTING STATEMENT"]
[null,{"$f":"dms_TradingName","v":"SA Power Networks"}]
[null,{"$f":"CONCATENATE(\"ECONOMIC BENCHMARKING \",IF(SUM(dms_SingleYear_Model)>0,CRY,CONCATENATE(dms_CRCP_FirstYear_Result,\" to \",dms_CRCP_FinalYear_Result)))","v":"ECONOMIC BENCHMARKING 2005-06"}]
[null,"3.7 OPERATING ENVIRONMENT FACTORS"]
[]
[null,"There are THREE tables on this worksheet. Each table has been grouped (and sub-grouped) for ease of navigation. See the Instructions sheet on how to group or ungroup tables. "]
[]
[null,"3.7.1 - DENSITY FACTORS"]
[null,null,null,"(0's)"]
[null,null,"Units",{"$f":"IF(dms_RPT=\"financial\",dms_fy1,dms_cy1)","v":"2005-06"},{"$f":"IF(dms_RPT=\"financial\",dms_fy2,dms_cy2)","v":"2006-07"},{"$f":"IF(dms_RPT=\"financial\",dms_fy3,dms_cy3)","v":"2007-08"},{"$f":"IF(dms_RPT=\"financial\",dms_fy4,dms_cy4)","v":"2008-09"},{"$f":"IF(dms_RPT=\"financial\",dms_fy5,dms_cy5)","v":"2009-10"},{"$f":"IF(dms_RPT=\"financial\",dms_fy6,dms_cy6)","v":"2010-11"},{"$f":"IF(dms_RPT=\"financial\",dms_fy7,dms_cy7)","v":"2011-12"},{"$f":"IF(dms_RPT=\"financial\",dms_fy8,dms_cy8)","v":"2012-13"},{"$f":"IF(dms_RPT=\"financial\",dms_fy9,dms_cy9)","v":"2013-14"},{"$f":"IF(dms_RPT=\"financial\",dms_fy10,dms_cy10)","v":"2014-15"},{"$f":"IF(dms_RPT=\"financial\",dms_fy11,dms_cy11)","v":"2015-16"},{"$f":"IF(dms_RPT=\"financial\",dms_fy12,dms_cy12)","v":"2016-17"},{"$f":"IF(dms_RPT=\"financial\",dms_fy13,dms_cy13)","v":"2017-18"}]
["DOEF0101","Customer density","Customer / km"]
["DOEF0102","Energy density","MWh/customer"]
["DOEF0103","Demand density","kVA / customer"]
[]
[null,"3.7.2 - TERRAIN FACTORS"]
[null,null,null,"(0's)"]
[null,null,"Units",{"$f":"IF(dms_RPT=\"financial\",dms_fy1,dms_cy1)","v":"2005-06"},{"$f":"IF(dms_RPT=\"financial\",dms_fy2,dms_cy2)","v":"2006-07"},{"$f":"IF(dms_RPT=\"financial\",dms_fy3,dms_cy3)","v":"2007-08"},{"$f":"IF(dms_RPT=\"financial\",dms_fy4,dms_cy4)","v":"2008-09"},{"$f":"IF(dms_RPT=\"financial\",dms_fy5,dms_cy5)","v":"2009-10"},{"$f":"IF(dms_RPT=\"financial\",dms_fy6,dms_cy6)","v":"2010-11"},{"$f":"IF(dms_RPT=\"financial\",dms_fy7,dms_cy7)","v":"2011-12"},{"$f":"IF(dms_RPT=\"financial\",dms_fy8,dms_cy8)","v":"2012-13"},{"$f":"IF(dms_RPT=\"financial\",dms_fy9,dms_cy9)","v":"2013-14"},{"$f":"IF(dms_RPT=\"financial\",dms_fy10,dms_cy10)","v":"2014-15"},{"$f":"IF(dms_RPT=\"financial\",dms_fy11,dms_cy11)","v":"2015-16"},{"$f":"IF(dms_RPT=\"financial\",dms_fy12,dms_cy12)","v":"2016-17"},{"$f":"IF(dms_RPT=\"financial\",dms_fy13,dms_cy13)","v":"2017-18"}]
["DOEF0201","Rural proportion","%"]
["DOEF0202","Urban and CBD vegetation maintenance spans","Number of spans"]
["DOEF0203","Rural vegetation maintenance spans","Number of spans"]
["DOEF0204","Total vegetation maintenance spans","Number of spans"]
["DOEF0205","Total number of spans","Number of spans"]
["DOEF0206","Average urban and CBD vegetation maintenance span cycle","Years"]
["DOEF0207","Average rural vegetation maintenance span cycle","Years"]
["DOEF0208","Average number of trees per urban and CBD vegetation maintenance span","Trees"]
["DOEF0209","Average number of trees per rural vegetation maintenance span","Trees"]
["DOEF0210","Average number of defects per urban and CBD vegetation maintenance span","Defects"]
["DOEF0211","Average number of defects per rural vegetation maintenance span","Defects"]
["DOEF0212","Tropical proportion","Spans"]
["DOEF0213","Standard vehicle access","km"]
["DOEF0214","Bushfire risk","Spans"]
[]
[null,"3.7.3 - SERVICE AREA FACTORS"]
[null,null,null,"(0's)"]
[null,null,"Units",{"$f":"IF(dms_RPT=\"financial\",dms_fy1,dms_cy1)","v":"2005-06"},{"$f":"IF(dms_RPT=\"financial\",dms_fy2,dms_cy2)","v":"2006-07"},{"$f":"IF(dms_RPT=\"financial\",dms_fy3,dms_cy3)","v":"2007-08"},{"$f":"IF(dms_RPT=\"financial\",dms_fy4,dms_cy4)","v":"2008-09"},{"$f":"IF(dms_RPT=\"financial\",dms_fy5,dms_cy5)","v":"2009-10"},{"$f":"IF(dms_RPT=\"financial\",dms_fy6,dms_cy6)","v":"2010-11"},{"$f":"IF(dms_RPT=\"financial\",dms_fy7,dms_cy7)","v":"2011-12"},{"$f":"IF(dms_RPT=\"financial\",dms_fy8,dms_cy8)","v":"2012-13"},{"$f":"IF(dms_RPT=\"financial\",dms_fy9,dms_cy9)","v":"2013-14"},{"$f":"IF(dms_RPT=\"financial\",dms_fy10,dms_cy10)","v":"2014-15"},{"$f":"IF(dms_RPT=\"financial\",dms_fy11,dms_cy11)","v":"2015-16"},{"$f":"IF(dms_RPT=\"financial\",dms_fy12,dms_cy12)","v":"2016-17"},{"$f":"IF(dms_RPT=\"financial\",dms_fy13,dms_cy13)","v":"2017-18"}]
["DOEF0301","Route Line length","km"]

{"sheet":"NSP Amendments","index":13,"n_rows":2,"n_cols":3,"rows_kept":2,"cut":false,"hidden":false,"merged":[[0,1,0,2]]}
[null,{"$f":"CONCATENATE(dms_TradingName,\" data amendments\")","v":"SA Power Networks data amendments"}]
[null,"Amended Table","Comments"]