{"text_format":"1","workbook":"xlsx","n_sheets":11,"sheets":["Title Page","Inputs | General","Price Cap >","Inputs | Price Cap","Calc | Price Cap","Output | Price Caps","Exit Fees >","Input | Exit Fees","Calc | Exit Fees","Output | Exit Fee price caps","LUTs and Dropdowns"],"not_rendered":{"charts":0,"images":1,"macros":1,"external_links":1,"defined_names":22,"comments":0,"pivot_tables":0},"unopened":[],"bounds":{"document_bytes":16777216,"sheet_cells":100000,"rows_first":2000,"rows_last":500,"rows_between":2000,"halvings":0,"cell_chars":16384,"cell_head_chars":4096},"cells_cut":0,"cells_raw":0,"read":"whole","date_system":"1900"}

{"sheet":"Title Page","index":0,"n_rows":24,"n_cols":8,"rows_kept":24,"cut":false,"hidden":false,"merged":[[27,4,27,7],[19,1,19,23],[22,4,22,7],[25,4,25,7],[26,4,26,7],[23,4,23,7],[13,1,13,23],[7,1,8,23]]}
[]
[]
[]
[]
[]
[]
[]
[null,"Preliminary Standardised Metering Pricing Model "]
[]
[null,"Version",1]
[null,"Date","2021-10-25"]
[]
[]
[null,"Status"]
[]
{"$rows_left_out":10}
{"sheet":"Inputs | General","index":1,"n_rows":27,"n_cols":23,"rows_kept":27,"cut":false,"hidden":false,"merged":[[4,1,4,6],[1,10,1,11],[1,12,1,13],[20,1,20,6],[23,7,23,11]]}
[null,{"$f":"'Title Page'!B8&\" v\"&'Title Page'!$C$10","v":"Preliminary Standardised Metering Pricing Model  v1"},null,null,null,null,null,null,null,null,null,null,null,null,null,null,null,null,null,null,null,"Worksheet check:",{"$f":"IF(COUNTA($X$14:$X$46)=COUNTIF($X14:$X47,\"OK\"),\"OK\",\"Check\")","v":"OK"}]
[null,{"$f":"MID(CELL(\"filename\",A1),FIND(\"]\",CELL(\"filename\",A1))+1,255)","v":"Inputs | General"},null,null,null,null,null,null,"Key:","Input","External Link",null,"Internal Link"]
[]
[]
[null,"1. Inputs - General"]
[]
[null,null,"Inputs","Source","Input Format",null,"Value"]
[null,null,"NSP name","NSP",null,null,"TEST NSP"]
[null,null,"Decision stage","NSP",null,null,"draft"]
[]
[null,null,"Forecast regulatory control period, first year","NSP","YYYY-YY",null,"2021-22"]
[null,null,"Forecast regulatory control period, last year","NSP",null,null,{"$f":"LEFT(FPFirstYear,4)+4&\"-\"&RIGHT(FPFirstYear,2)+4","v":"2025-26"}]
[]
[null,null,"Regulatory Period Length, Yrs",null,null,null,{"$f":"LEFT(G12,4)-LEFT(FPFirstYear,4)+1","v":5}]
[]
{"$rows_left_out":13}
{"sheet":"Price Cap >","index":2,"n_rows":0,"n_cols":0,"rows_kept":0,"cut":false,"hidden":false,"merged":[]}

{"sheet":"Inputs | Price Cap","index":3,"n_rows":125,"n_cols":22,"rows_kept":125,"cut":false,"hidden":false,"merged":[[94,1,94,7],[1,10,1,11],[40,9,40,13],[38,1,38,7],[6,7,6,11],[4,1,4,6],[14,1,14,6],[4,9,4,11],[14,9,14,11]]}
[null,{"$f":"'Title Page'!B8&\" v\"&'Title Page'!$C$10","v":"Preliminary Standardised Metering Pricing Model  v1"},null,null,null,null,null,null,null,null,null,null,null,"DNSP:",{"$f":"IF('Inputs | General'!$G$16=\"Exit Fees (Vic)\",\"NOT USED\",NSP)","v":"TEST NSP"},null,null,null,null,null,"Worksheet check:",{"$f":"IF(COUNTA($W$4:$W$71)=COUNTIF($W4:$W72,\"OK\"),\"OK\",\"Check\")","v":"OK"}]
[null,{"$f":"MID(CELL(\"filename\",A1),FIND(\"]\",CELL(\"filename\",A1))+1,255)","v":"Inputs | Price Cap"},null,null,null,null,null,"Key:","Input","External Link","Internal Link"]
[]
[]
[null,{"$f":"LEFT('Inputs | General'!B21,1)+1&\". Linked Input -  Inflation & Discount Rates\"","v":"3. Linked Input -  Inflation & Discount Rates"},null,null,null,null,null,null,null,{"$f":"IF('Inputs | General'!$G$16=\"Exit Fees (Vic)\",\"NOT USED\",\"\")","v":""}]
[]
[null,"Linked Inputs - Discount Rates",null,null,null,null,"Base year","Regulatory period"]
[null,null,"Year",null,"Units",null,{"$f":"LEFT(H8,4)-1&\"-\"&RIGHT(H8,2)-1","v":"2020-21"},{"$f":"FPFirstYear","v":"2021-22"},{"$f":"LEFT(H8,4)+1&\"-\"&RIGHT(H8,2)+1","v":"2022-23"},{"$f":"LEFT(I8,4)+1&\"-\"&RIGHT(I8,2)+1","v":"2023-24"},"2024-25","2025-26",null,"Link from PTRM"]
[null,null,"Nominal Vanilla WACC",null,"%",null,null,0.05,0.05,0.05,0.05,0.05]
[null,null,"Cumulative Discount Index",null,"Index",null,1,{"$f":"G10*(1+H9)","v":1.05},{"$f":"H10*(1+I9)","v":1.1025},{"$f":"I10*(1+J9)","v":1.1576250000000001},{"$f":"J10*(1+K9)","v":1.2155062500000002},{"$f":"K10*(1+L9)","v":1.2762815625000004}]
[]
[]
[]
[]
[null,{"$f":"LEFT(B5,1)+1&\". Linked Input - Building Block Revenue Requirements\"","v":"4. Linked Input - Building Block Revenue Requirements"},null,null,null,null,null,null,null,{"$f":"IF('Inputs | General'!$G$16=\"Exit Fees (Vic)\",\"NOT USED\",\"\")","v":""}]
{"$rows_left_out":111}
{"sheet":"Calc | Price Cap","index":4,"n_rows":63,"n_cols":14,"rows_kept":63,"cut":false,"hidden":false,"merged":[[7,9,7,13],[4,1,4,7],[1,10,1,11],[0,13,0,14]]}
[null,{"$f":"'Title Page'!B8&\" v\"&'Title Page'!$C$10","v":"Preliminary Standardised Metering Pricing Model  v1"},null,null,null,null,null,null,null,null,null,null,"DNSP:",{"$f":"IF('Inputs | General'!$G$16=\"Exit Fees (Vic)\",\"NOT USED\",NSP)","v":"TEST NSP"}]
[null,{"$f":"MID(CELL(\"filename\",A1),FIND(\"]\",CELL(\"filename\",A1))+1,255)","v":"Calc | Price Cap"},null,null,null,null,null,"Key:","Input","External Link","Internal Link"]
[]
[]
[null,"Annual Charges Calculations"]
[]
[null,"Annual Smoothed Revenue Calculation"]
[null,null,null,null,null,null,null,null,"Base Year Revenue","Annual Revenue"]
["▼ Table Filters",null,"Tariff #","Tariff name","Application","Tariff Code","Other designation",null,{"$f":"LEFT(J9,4)-1&\"-\"&RIGHT(J9,2)-1","v":"2020-21"},{"$f":"FPFirstYear","v":"2021-22"},{"$f":"LEFT(J9,4)+1&\"-\"&RIGHT(J9,2)+1","v":"2022-23"},{"$f":"LEFT(K9,4)+1&\"-\"&RIGHT(K9,2)+1","v":"2023-24"},"2024-25","2025-26"]
[null,null,"Tariff #","Tariff name","Application","Tariff Code","Other designation","Column1","F-RP-1","F-RP0","F-RP+1","F-RP+2","F-RP+3","F-RP+4"]
[null,null,1,{"$f":"'Inputs | Price Cap'!D44","v":"Residential Non ToU"},"Non-capital",{"$f":"'Inputs | Price Cap'!F44","v":"R1"},{"$f":"'Inputs | Price Cap'!G44","v":"Primary"},null,{"$f":"'Output | Price Caps'!$I9*'Inputs | Price Cap'!I44","v":10000000},{"$f":"'Output | Price Caps'!J9*'Inputs | Price Cap'!J44","v":11736000},{"$f":"'Output | Price Caps'!K9*'Inputs | Price Cap'!K44","v":10926900},{"$f":"'Output | Price Caps'!L9*'Inputs | Price Cap'!L44","v":10176840},{"$f":"'Output | Price Caps'!M9*'Inputs | Price Cap'!M44","v":9474084},{"$f":"'Output | Price Caps'!N9*'Inputs | Price Cap'!N44","v":8821920.5999999996}]
[null,null,1,{"$f":"'Inputs | Price Cap'!D45","v":"Residential Non ToU"},"Capital",{"$f":"'Inputs | Price Cap'!F45","v":"R1"},{"$f":"'Inputs | Price Cap'!G45","v":"Primary"},null,{"$f":"'Output | Price Caps'!$I10*'Inputs | Price Cap'!I45","v":22000000},{"$f":"'Output | Price Caps'!J10*'Inputs | Price Cap'!J45","v":19712000.000000004},{"$f":"'Output | Price Caps'!K10*'Inputs | Price Cap'!K45","v":19580000},{"$f":"'Output | Price Caps'!L10*'Inputs | Price Cap'!L45","v":19448000},{"$f":"'Output | Price Caps'!M10*'Inputs | Price Cap'!M45","v":19327000},{"$f":"'Output | Price Caps'!N10*'Inputs | Price Cap'!N45","v":19206000}]
[null,null,1,{"$f":"'Inputs | Price Cap'!D46","v":"Residential Non ToU"},"Total",{"$f":"'Inputs | Price Cap'!F46","v":"R1"},{"$f":"'Inputs | Price Cap'!G46","v":"Primary"},null,{"$f":"I11+I12","v":32000000},31448000.000000004,30506900,29624840,28801084,28027920.600000001]
[null,null,2,{"$f":"'Inputs | Price Cap'!D47","v":"Residential ToU"},"Non-capital",{"$f":"'Inputs | Price Cap'!F47","v":"R2"},{"$f":"'Inputs | Price Cap'!G47","v":"Primary"},null,{"$f":"'Output | Price Caps'!$I12*'Inputs | Price Cap'!I47","v":6000000},{"$f":"'Output | Price Caps'!J12*'Inputs | Price Cap'!J47","v":7041600},{"$f":"'Output | Price Caps'!K12*'Inputs | Price Cap'!K47","v":6556140},{"$f":"'Output | Price Caps'!L12*'Inputs | Price Cap'!L47","v":6103917},{"$f":"'Output | Price Caps'!M12*'Inputs | Price Cap'!M47","v":5682482.1000000006},{"$f":"'Output | Price Caps'!N12*'Inputs | Price Cap'!N47","v":5291380.8900000006}]
[null,null,2,{"$f":"'Inputs | Price Cap'!D48","v":"Residential ToU"},"Capital",{"$f":"'Inputs | Price Cap'!F48","v":"R2"},{"$f":"'Inputs | Price Cap'!G48","v":"Primary"},null,{"$f":"'Output | Price Caps'!$I13*'Inputs | Price Cap'!I48","v":6600000},{"$f":"'Output | Price Caps'!J13*'Inputs | Price Cap'!J48","v":5913600.0000000009},{"$f":"'Output | Price Caps'!K13*'Inputs | Price Cap'!K48","v":5874000},{"$f":"'Output | Price Caps'!L13*'Inputs | Price Cap'!L48","v":5834400},{"$f":"'Output | Price Caps'!M13*'Inputs | Price Cap'!M48","v":5798100},{"$f":"'Output | Price Caps'!N13*'Inputs | Price Cap'!N48","v":5761800}]
{"$rows_left_out":49}
{"sheet":"Output | Price Caps","index":5,"n_rows":70,"n_cols":22,"rows_kept":70,"cut":false,"hidden":false,"merged":[[56,3,57,3],[65,9,65,13],[5,9,5,13],[1,10,1,11],[0,14,0,15]]}
[null,null,{"$f":"'Title Page'!B8&\" v\"&'Title Page'!$C$10","v":"Preliminary Standardised Metering Pricing Model  v1"},null,null,null,null,null,null,null,null,null,null,"DNSP:",{"$f":"IF('Inputs | General'!$G$16=\"Exit Fees (Vic)\",\"NOT USED\",NSP)","v":"TEST NSP"},null,null,null,null,null,"Worksheet check:",{"$f":"IF(COUNTA($W$5:$W$52)=COUNTIF($W5:$W53,\"OK\"),\"OK\",\"Check\")","v":"OK"}]
[null,null,{"$f":"MID(CELL(\"filename\",A1),FIND(\"]\",CELL(\"filename\",A1))+1,255)","v":"Output | Price Caps"},null,null,null,null,"Key:","Input","External Link","Internal Link"]
[]
[]
[null,"RESULT - Price Cap - Annual Charges"]
[null,null,null,null,null,null,null,null,"Base Year Charges","Price Cap - Annual Charges (nominal)"]
["▼ Table Filters",null,"Tariff #","Tariff name","Application","Tariff Code","Other designation",null,{"$f":"LEFT(J7,4)-1&\"-\"&RIGHT(J7,2)-1","v":"2020-21"},{"$f":"FPFirstYear","v":"2021-22"},{"$f":"LEFT(J7,4)+1&\"-\"&RIGHT(J7,2)+1","v":"2022-23"},{"$f":"LEFT(K7,4)+1&\"-\"&RIGHT(K7,2)+1","v":"2023-24"},"2024-25","2025-26"]
[null,null,"Tariff #","Tariff name","Application","Tariff Code","Other designation","Ca","F-RP-1","F-RP0","F-RP+1","F-RP+2","F-RP+3","F-RP+4","Column1"]
[null,null,1,{"$f":"'Inputs | Price Cap'!D44","v":"Residential Non ToU"},"Non-capital",{"$f":"'Inputs | Price Cap'!F44","v":"R1"},{"$f":"'Inputs | Price Cap'!G44","v":"Primary"},null,{"$f":"ROUND('Inputs | Price Cap'!H44,2)","v":10},{"$f":"ROUND('Output | Price Caps'!I9*(1-'Inputs | Price Cap'!F$109)*(1+'Inputs | General'!H$26),2)","v":13.04},{"$f":"ROUND('Output | Price Caps'!J9*(1-'Inputs | Price Cap'!G$109)*(1+'Inputs | General'!I$26),2)","v":13.49},{"$f":"ROUND('Output | Price Caps'!K9*(1-'Inputs | Price Cap'!H$109)*(1+'Inputs | General'!J$26),2)","v":13.96},{"$f":"ROUND('Output | Price Caps'!L9*(1-'Inputs | Price Cap'!I$109)*(1+'Inputs | General'!K$26),2)","v":14.44},{"$f":"ROUND('Output | Price Caps'!M9*(1-'Inputs | Price Cap'!J$109)*(1+'Inputs | General'!L$26),2)","v":14.94}]
[null,null,1,{"$f":"'Inputs | Price Cap'!D45","v":"Residential Non ToU"},"Capital",{"$f":"'Inputs | Price Cap'!F45","v":"R1"},{"$f":"'Inputs | Price Cap'!G45","v":"Primary"},null,{"$f":"ROUND('Inputs | Price Cap'!H45,2)","v":20},{"$f":"ROUND('Output | Price Caps'!I10*(1-'Inputs | Price Cap'!F$125)*(1+'Inputs | General'!H$26),2)","v":17.920000000000002},{"$f":"ROUND('Output | Price Caps'!J10*(1-'Inputs | Price Cap'!G$125)*(1+'Inputs | General'!I$26),2)","v":17.8},{"$f":"ROUND('Output | Price Caps'!K10*(1-'Inputs | Price Cap'!H$125)*(1+'Inputs | General'!J$26),2)","v":17.68},{"$f":"ROUND('Output | Price Caps'!L10*(1-'Inputs | Price Cap'!I$125)*(1+'Inputs | General'!K$26),2)","v":17.57},{"$f":"ROUND('Output | Price Caps'!M10*(1-'Inputs | Price Cap'!J$125)*(1+'Inputs | General'!L$26),2)","v":17.46}]
[null,null,1,{"$f":"'Inputs | Price Cap'!D46","v":"Residential Non ToU"},"Total",{"$f":"'Inputs | Price Cap'!F46","v":"R1"},{"$f":"'Inputs | Price Cap'!G46","v":"Primary"},null,{"$f":"ROUND('Inputs | Price Cap'!H46,2)","v":30},{"$f":"J9+J10","v":30.96},{"$f":"K9+K10","v":31.29},{"$f":"L9+L10","v":31.64},{"$f":"M9+M10","v":32.01},{"$f":"N9+N10","v":32.4}]
[null,null,2,{"$f":"'Inputs | Price Cap'!D47","v":"Residential ToU"},"Non-capital",{"$f":"'Inputs | Price Cap'!F47","v":"R2"},{"$f":"'Inputs | Price Cap'!G47","v":"Primary"},null,{"$f":"ROUND('Inputs | Price Cap'!H47,2)","v":20},{"$f":"ROUND('Output | Price Caps'!I12*(1-'Inputs | Price Cap'!F$109)*(1+'Inputs | General'!H$26),2)","v":26.08},{"$f":"ROUND('Output | Price Caps'!J12*(1-'Inputs | Price Cap'!G$109)*(1+'Inputs | General'!I$26),2)","v":26.98},{"$f":"ROUND('Output | Price Caps'!K12*(1-'Inputs | Price Cap'!H$109)*(1+'Inputs | General'!J$26),2)","v":27.91},{"$f":"ROUND('Output | Price Caps'!L12*(1-'Inputs | Price Cap'!I$109)*(1+'Inputs | General'!K$26),2)","v":28.87},{"$f":"ROUND('Output | Price Caps'!M12*(1-'Inputs | Price Cap'!J$109)*(1+'Inputs | General'!L$26),2)","v":29.87}]
[null,null,2,{"$f":"'Inputs | Price Cap'!D48","v":"Residential ToU"},"Capital",{"$f":"'Inputs | Price Cap'!F48","v":"R2"},{"$f":"'Inputs | Price Cap'!G48","v":"Primary"},null,{"$f":"ROUND('Inputs | Price Cap'!H48,2)","v":20},{"$f":"ROUND('Output | Price Caps'!I13*(1-'Inputs | Price Cap'!F$125)*(1+'Inputs | General'!H$26),2)","v":17.920000000000002},{"$f":"ROUND('Output | Price Caps'!J13*(1-'Inputs | Price Cap'!G$125)*(1+'Inputs | General'!I$26),2)","v":17.8},{"$f":"ROUND('Output | Price Caps'!K13*(1-'Inputs | Price Cap'!H$125)*(1+'Inputs | General'!J$26),2)","v":17.68},{"$f":"ROUND('Output | Price Caps'!L13*(1-'Inputs | Price Cap'!I$125)*(1+'Inputs | General'!K$26),2)","v":17.57},{"$f":"ROUND('Output | Price Caps'!M13*(1-'Inputs | Price Cap'!J$125)*(1+'Inputs | General'!L$26),2)","v":17.46}]
[null,null,2,{"$f":"'Inputs | Price Cap'!D49","v":"Residential ToU"},"Total",{"$f":"'Inputs | Price Cap'!F49","v":"R2"},{"$f":"'Inputs | Price Cap'!G49","v":"Primary"},null,{"$f":"ROUND('Inputs | Price Cap'!H49,2)","v":40},{"$f":"J12+J13","v":44},{"$f":"K12+K13","v":44.78},{"$f":"L12+L13","v":45.59},{"$f":"M12+M13","v":46.44},{"$f":"N12+N13","v":47.33}]
[null,null,3,{"$f":"'Inputs | Price Cap'!D50","v":"Controlled load"},"Non-capital",{"$f":"'Inputs | Price Cap'!F50","v":"B1"},{"$f":"'Inputs | Price Cap'!G50","v":"Secondary"},null,{"$f":"ROUND('Inputs | Price Cap'!H50,2)","v":1},{"$f":"ROUND('Output | Price Caps'!I15*(1-'Inputs | Price Cap'!F$109)*(1+'Inputs | General'!H$26),2)","v":1.3},{"$f":"ROUND('Output | Price Caps'!J15*(1-'Inputs | Price Cap'!G$109)*(1+'Inputs | General'!I$26),2)","v":1.34},{"$f":"ROUND('Output | Price Caps'!K15*(1-'Inputs | Price Cap'!H$109)*(1+'Inputs | General'!J$26),2)","v":1.39},{"$f":"ROUND('Output | Price Caps'!L15*(1-'Inputs | Price Cap'!I$109)*(1+'Inputs | General'!K$26),2)","v":1.44},{"$f":"ROUND('Output | Price Caps'!M15*(1-'Inputs | Price Cap'!J$109)*(1+'Inputs | General'!L$26),2)","v":1.49}]
{"$rows_left_out":56}
{"sheet":"Exit Fees >","index":6,"n_rows":0,"n_cols":0,"rows_kept":0,"cut":false,"hidden":false,"merged":[]}

{"sheet":"Input | Exit Fees","index":7,"n_rows":119,"n_cols":17,"rows_kept":119,"cut":false,"hidden":false,"merged":[[117,3,117,5],[66,9,66,14],[50,3,50,5],[51,3,51,5],[97,3,97,5],[98,3,98,5],[99,3,99,5],[100,3,100,5],[101,3,101,5],[102,3,102,5],[103,3,103,5],[104,3,104,5],[111,3,111,5],[112,3,112,5],[113,3,113,5],[114,3,114,5],[95,3,95,5],[96,3,96,5],[49,3,49,5],[116,3,116,5],[115,3,115,5],[107,3,107,5],[108,3,108,5],[109,3,109,5],[110,3,110,5],[86,1,86,7],[41,1,41,7],[6,7,6,11],[4,9,4,11],[21,1,21,3],[94,3,94,5],[0,13,0,14],[62,3,62,5],[52,3,52,5],[53,3,53,5],[54,3,54,5],[55,3,55,5],[56,3,56,5],[57,3,57,5],[58,3,58,5],[59,3,59,5],[60,3,60,5],[61,3,61,5],[47,3,47,5],[48,3,48,5],[4,1,4,6],[24,1,24,7]]}
[null,{"$f":"'Title Page'!B8&\" v\"&'Title Page'!$C$10","v":"Preliminary Standardised Metering Pricing Model  v1"},null,null,null,null,null,null,null,null,null,null,"DNSP:",{"$f":"IF('Inputs | General'!$G$16=\"Price Cap\",\"NOT USED\",NSP)","v":"TEST NSP"}]
[null,{"$f":"MID(CELL(\"filename\",A1),FIND(\"]\",CELL(\"filename\",A1))+1,255)","v":"Input | Exit Fees"},null,null,null,null,null,"Key:","Input","External Link","Internal Link"]
[]
[]
[null,{"$f":"LEFT('Inputs | General'!B21,1)+1&\". Linked Input - RAB\"","v":"3. Linked Input - RAB"},null,null,null,null,null,null,null,{"$f":"IF('Inputs | General'!$G$16=\"Price Cap\",\"NOT USED\",\"\")","v":""}]
[]
[null,"Linked Input - RAB Meters",null,null,null,null,"Base Year","Regulatory Period"]
[null,null,null,null,"Units",null,{"$f":"LEFT(H8,4)-1&\"-\"&RIGHT(H8,2)-1","v":"2020-21"},{"$f":"FPFirstYear","v":"2021-22"},{"$f":"LEFT(H8,4)+1&\"-\"&RIGHT(H8,2)+1","v":"2022-23"},{"$f":"LEFT(I8,4)+1&\"-\"&RIGHT(I8,2)+1","v":"2023-24"},{"$f":"LEFT(J8,4)+1&\"-\"&RIGHT(J8,2)+1","v":"2024-25"},{"$f":"LEFT(K8,4)+1&\"-\"&RIGHT(K8,2)+1","v":"2025-26"}]
[null,null,"Opening RAB",null,"$m",null,150,{"$f":"G9+G10-G11","v":132},{"$f":"H9+H10-H11","v":112.5},{"$f":"I9+I10-I11","v":91.5},{"$f":"J9+J10-J11","v":69},{"$f":"K9+K10-K11","v":46},null,"Opening balance of METERS row in PTRM inputs sheet of PTRM"]
[null,null,"Gross capital expenditure",null,"$m",null,7,7.5,8,8.5,9,null,null,"Gross capex from METERS row in ASSETS sheet of PTRM"]
[null,null,"Regulatory depreciation",null,"$m",null,25,27,29,31,32,null,null,"Depreciation from METERS row in ASSETS sheet of PTRM"]
[]
[]
[null,"Linked Input - RAB Comms & IT"]
[null,null,null,null,"Units",null,{"$f":"LEFT(H15,4)-1&\"-\"&RIGHT(H15,2)-1","v":"2020-21"},{"$f":"FPFirstYear","v":"2021-22"},{"$f":"LEFT(H15,4)+1&\"-\"&RIGHT(H15,2)+1","v":"2022-23"},{"$f":"LEFT(I15,4)+1&\"-\"&RIGHT(I15,2)+1","v":"2023-24"},{"$f":"LEFT(J15,4)+1&\"-\"&RIGHT(J15,2)+1","v":"2024-25"},{"$f":"LEFT(K15,4)+1&\"-\"&RIGHT(K15,2)+1","v":"2025-26"}]
{"$rows_left_out":105}
{"sheet":"Calc | Exit Fees","index":8,"n_rows":160,"n_cols":15,"rows_kept":160,"cut":false,"hidden":false,"merged":[[98,6,98,10],[95,1,95,7],[0,13,0,14],[4,1,4,7],[54,10,54,14],[97,6,97,10],[69,10,69,14],[38,10,38,14],[86,10,86,14],[82,1,82,7],[8,10,8,14],[23,10,23,14]]}
[null,{"$f":"'Title Page'!B8&\" v\"&'Title Page'!$C$10","v":"Preliminary Standardised Metering Pricing Model  v1"},null,null,null,null,null,null,null,null,null,null,"DNSP:",{"$f":"IF('Inputs | General'!$G$16=\"Price Cap\",\"NOT USED\",NSP)","v":"TEST NSP"}]
[null,{"$f":"MID(CELL(\"filename\",A1),FIND(\"]\",CELL(\"filename\",A1))+1,255)","v":"Calc | Exit Fees"},null,null,null,null,null,"Key:","Input","External Link","Internal Link"]
[]
[]
[null,"CALCULATION | Meters"]
[]
[null,"Calculation of Allocated Meters RAB by Designated Exit Fee"]
[]
[null,null,null,null,"Volume of meters",null,null,null,null,"Base Year","Regulatory period"]
[null,null,null,null,null,"Exit Fee","Units",null,null,{"$f":"LEFT(K10,4)-1&\"-\"&RIGHT(K10,2)-1","v":"2020-21"},{"$f":"FPFirstYear","v":"2021-22"},{"$f":"LEFT(K10,4)+1&\"-\"&RIGHT(K10,2)+1","v":"2022-23"},{"$f":"LEFT(L10,4)+1&\"-\"&RIGHT(L10,2)+1","v":"2023-24"},{"$f":"LEFT(M10,4)+1&\"-\"&RIGHT(M10,2)+1","v":"2024-25"},{"$f":"LEFT(N10,4)+1&\"-\"&RIGHT(N10,2)+1","v":"2025-26"}]
[null,null,null,null,null,{"$f":"'Input | Exit Fees'!$D$29:$D$38","v":"Single phase"},"$dollars",null,null,{"$f":"IF($F11=0,0,SUMPRODUCT('Input | Exit Fees'!J$69:J$83,('Input | Exit Fees'!$D$49:$D$63=$F11)/1))","v":600000},{"$f":"IF($F11=0,0,SUMPRODUCT('Input | Exit Fees'!K$69:K$83,('Input | Exit Fees'!$D$49:$D$63=$F11)/1))","v":600000},{"$f":"IF($F11=0,0,SUMPRODUCT('Input | Exit Fees'!L$69:L$83,('Input | Exit Fees'!$D$49:$D$63=$F11)/1))","v":600000},{"$f":"IF($F11=0,0,SUMPRODUCT('Input | Exit Fees'!M$69:M$83,('Input | Exit Fees'!$D$49:$D$63=$F11)/1))","v":600000},{"$f":"IF($F11=0,0,SUMPRODUCT('Input | Exit Fees'!N$69:N$83,('Input | Exit Fees'!$D$49:$D$63=$F11)/1))","v":600000},{"$f":"IF($F11=0,0,SUMPRODUCT('Input | Exit Fees'!O$69:O$83,('Input | Exit Fees'!$D$49:$D$63=$F11)/1))","v":600000}]
[null,null,null,null,null,"Multiphase","$dollars",null,null,{"$f":"IF($F12=0,0,SUMPRODUCT('Input | Exit Fees'!J$69:J$83,('Input | Exit Fees'!$D$49:$D$63=$F12)/1))","v":95000},{"$f":"IF($F12=0,0,SUMPRODUCT('Input | Exit Fees'!K$69:K$83,('Input | Exit Fees'!$D$49:$D$63=$F12)/1))","v":95000},{"$f":"IF($F12=0,0,SUMPRODUCT('Input | Exit Fees'!L$69:L$83,('Input | Exit Fees'!$D$49:$D$63=$F12)/1))","v":95000},{"$f":"IF($F12=0,0,SUMPRODUCT('Input | Exit Fees'!M$69:M$83,('Input | Exit Fees'!$D$49:$D$63=$F12)/1))","v":95000},{"$f":"IF($F12=0,0,SUMPRODUCT('Input | Exit Fees'!N$69:N$83,('Input | Exit Fees'!$D$49:$D$63=$F12)/1))","v":95000},{"$f":"IF($F12=0,0,SUMPRODUCT('Input | Exit Fees'!O$69:O$83,('Input | Exit Fees'!$D$49:$D$63=$F12)/1))","v":95000}]
[null,null,null,null,null,0,"$dollars",null,null,{"$f":"IF($F13=0,0,SUMPRODUCT('Input | Exit Fees'!J$69:J$83,('Input | Exit Fees'!$D$49:$D$63=$F13)/1))","v":0},{"$f":"IF($F13=0,0,SUMPRODUCT('Input | Exit Fees'!K$69:K$83,('Input | Exit Fees'!$D$49:$D$63=$F13)/1))","v":0},{"$f":"IF($F13=0,0,SUMPRODUCT('Input | Exit Fees'!L$69:L$83,('Input | Exit Fees'!$D$49:$D$63=$F13)/1))","v":0},{"$f":"IF($F13=0,0,SUMPRODUCT('Input | Exit Fees'!M$69:M$83,('Input | Exit Fees'!$D$49:$D$63=$F13)/1))","v":0},{"$f":"IF($F13=0,0,SUMPRODUCT('Input | Exit Fees'!N$69:N$83,('Input | Exit Fees'!$D$49:$D$63=$F13)/1))","v":0},{"$f":"IF($F13=0,0,SUMPRODUCT('Input | Exit Fees'!O$69:O$83,('Input | Exit Fees'!$D$49:$D$63=$F13)/1))","v":0}]
[null,null,null,null,null,0,"$dollars",null,null,{"$f":"IF($F14=0,0,SUMPRODUCT('Input | Exit Fees'!J$69:J$83,('Input | Exit Fees'!$D$49:$D$63=$F14)/1))","v":0},{"$f":"IF($F14=0,0,SUMPRODUCT('Input | Exit Fees'!K$69:K$83,('Input | Exit Fees'!$D$49:$D$63=$F14)/1))","v":0},{"$f":"IF($F14=0,0,SUMPRODUCT('Input | Exit Fees'!L$69:L$83,('Input | Exit Fees'!$D$49:$D$63=$F14)/1))","v":0},{"$f":"IF($F14=0,0,SUMPRODUCT('Input | Exit Fees'!M$69:M$83,('Input | Exit Fees'!$D$49:$D$63=$F14)/1))","v":0},{"$f":"IF($F14=0,0,SUMPRODUCT('Input | Exit Fees'!N$69:N$83,('Input | Exit Fees'!$D$49:$D$63=$F14)/1))","v":0},{"$f":"IF($F14=0,0,SUMPRODUCT('Input | Exit Fees'!O$69:O$83,('Input | Exit Fees'!$D$49:$D$63=$F14)/1))","v":0}]
[null,null,null,null,null,0,"$dollars",null,null,{"$f":"IF($F15=0,0,SUMPRODUCT('Input | Exit Fees'!J$69:J$83,('Input | Exit Fees'!$D$49:$D$63=$F15)/1))","v":0},{"$f":"IF($F15=0,0,SUMPRODUCT('Input | Exit Fees'!K$69:K$83,('Input | Exit Fees'!$D$49:$D$63=$F15)/1))","v":0},{"$f":"IF($F15=0,0,SUMPRODUCT('Input | Exit Fees'!L$69:L$83,('Input | Exit Fees'!$D$49:$D$63=$F15)/1))","v":0},{"$f":"IF($F15=0,0,SUMPRODUCT('Input | Exit Fees'!M$69:M$83,('Input | Exit Fees'!$D$49:$D$63=$F15)/1))","v":0},{"$f":"IF($F15=0,0,SUMPRODUCT('Input | Exit Fees'!N$69:N$83,('Input | Exit Fees'!$D$49:$D$63=$F15)/1))","v":0},{"$f":"IF($F15=0,0,SUMPRODUCT('Input | Exit Fees'!O$69:O$83,('Input | Exit Fees'!$D$49:$D$63=$F15)/1))","v":0}]
{"$rows_left_out":146}
{"sheet":"Output | Exit Fee price caps","index":9,"n_rows":62,"n_cols":14,"rows_kept":62,"cut":false,"hidden":false,"merged":[[60,3,60,4],[61,3,61,4],[59,8,59,12],[49,3,49,4],[50,3,50,4],[51,3,51,4],[52,3,52,4],[53,3,53,4],[13,3,13,4],[14,3,14,4],[48,3,48,4],[28,3,28,4],[29,3,29,4],[30,3,30,4],[31,3,31,4],[32,3,32,4],[33,3,33,4],[43,3,43,4],[44,3,44,4],[45,3,45,4],[46,3,46,4],[47,3,47,4],[15,3,15,4],[16,3,16,4],[17,3,17,4],[27,3,27,4],[0,13,0,14],[23,3,23,4],[24,3,24,4],[25,3,25,4],[26,3,26,4],[22,8,22,12],[6,8,6,12],[7,3,7,4],[8,3,8,4],[9,3,9,4],[10,3,10,4],[11,3,11,4],[12,3,12,4]]}
[null,{"$f":"'Title Page'!B8&\" v\"&'Title Page'!$C$10","v":"Preliminary Standardised Metering Pricing Model  v1"},null,null,null,null,null,null,null,null,null,null,"DNSP:","D"]
[null,{"$f":"MID(CELL(\"filename\",A1),FIND(\"]\",CELL(\"filename\",A1))+1,255)","v":"Output | Exit Fee price caps"},null,null,null,null,null,"Key:","Input","External Link","Internal Link"]
[]
[]
[null,null,"Applicable Exit Fees Price Caps"]
[]
[null,null,null,null,null,null,null,"Base Year","Regulatory Period"]
[null,null,null,"Exit Fee Name",null,"Units","Basis","2020-21","2021-22","2022-23","2023-24","2024-25","2025-26"]
[null,null,null,{"$f":"D25","v":"Single phase"},null,"$dollars","nominal",{"$f":"ROUND(H25,2)","v":300},{"$f":"IF(I25=0,0,ROUND(H9*(1-I45)*(1+I$41),2))","v":280.97000000000003},266.77999999999997,247.65,223.59,196]
[null,null,null,{"$f":"D26","v":"Multiphase"},null,"$dollars","nominal",500,351.05,327.54000000000002,298.35000000000002,263.48,224.58]
[null,null,null,0,null,"$dollars","nominal",{"$f":"ROUND(H27,2)","v":0},{"$f":"IF(I27=0,0,ROUND(H11*(1-I47)*(1+I$41),2))","v":0},{"$f":"IF(J27=0,0,ROUND(I11*(1-J47)*(1+J$41),2))","v":0},0,0,0]
[null,null,null,0,null,"$dollars","nominal",0,0,0,0,0,0]
[null,null,null,0,null,"$dollars","nominal",0,0,0,0,0,0]
[null,null,null,0,null,"$dollars","nominal",0,0,0,0,0,0]
[null,null,null,0,null,"$dollars","nominal",0,0,0,0,0,0]
{"$rows_left_out":48}
{"sheet":"LUTs and Dropdowns","index":10,"n_rows":23,"n_cols":2,"rows_kept":23,"cut":false,"hidden":false,"merged":[]}
[null,{"$f":"'Title Page'!B8&\" v\"&'Title Page'!$C$10","v":"Preliminary Standardised Metering Pricing Model  v1"}]
[null,{"$f":"MID(CELL(\"filename\",A1),FIND(\"]\",CELL(\"filename\",A1))+1,255)","v":"LUTs and Dropdowns"}]
[]
[]
[]
[]
[]
[]
[]
[]
[]
[]
[]
[null,"Model Use"]
[null,"Price Cap"]
{"$rows_left_out":8}