{"text_format":"1","workbook":"xlsx","n_sheets":29,"sheets":["AER only","Contents","Instructions","Business & other details","CPI series","2.1 Expenditure summary","2.2 Repex","2.3 Augex (a)","2.3 Augex (b)","2.5 Connections","2.6 Non-network","2.10 Overheads","2.11 Labour","2.14 Forecast price changes","2.16 Opex Summary","2.17 Step Changes","3.1 Revenue","3.2 Operating expenditure","3.3 Assets (RAB)","3.4 Operational data","3.5 Physical assets","3.7 Operating environment","5.4 MD & Utilisation - Spatial","7.1  Policies and Procedures","7.2 Contingent projects","7.3 Obligations","7.4 Shared Assets","7.6 Indicative bill impact ","7.9 STPIS"],"not_rendered":{"charts":0,"images":5,"macros":1,"external_links":2,"defined_names":555,"comments":1,"pivot_tables":0},"unopened":[],"bounds":{"document_bytes":16777216,"sheet_cells":100000,"rows_first":2000,"rows_last":500,"rows_between":2000,"halvings":0,"cell_chars":16384,"cell_head_chars":4096},"cells_cut":0,"cells_raw":0,"read":"whole","date_system":"1900"}

{"sheet":"AER only","index":0,"n_rows":145,"n_cols":40,"rows_kept":145,"cut":false,"hidden":true,"merged":[[105,1,105,8],[50,2,50,3],[50,34,52,34],[53,34,57,34],[61,34,62,34],[67,14,67,15],[67,22,67,25],[49,1,49,5],[49,14,49,21],[49,22,49,26],[0,1,0,11],[3,28,3,38],[4,28,4,31],[4,34,4,38],[48,22,48,26]]}
[null,"Data in these columns used for data validation and database purposes."]
[null,"Date last modified:","2016-09-06","added new business names, improved column heading formatting"]
[null,null,"2016-10-17","updated TransGrid's correct legal name, corrected TasNetworks (T) to June financial year"]
[null,null,"2017-02-01","inserted Power and Water ",null,null,null,null,null,null,null,null,null,null,null,null,null,null,null,null,null,null,null,null,null,null,null,null,"FOR ELECTRICITY BUSINESSES ONLY"]
[null,null,null,null,null,null,null,null,null,null,null,null,null,null,null,null,null,null,null,null,null,null,null,null,null,null,null,null,"Feeder Types",null,null,null,"TasNetworks (D)","MAIFI flag","Feeder Names"]
[null,null,null,null,null,null,null,null,null,null,null,null,null,null,null,null,null,null,null,null,null,null,null,null,null,null,null,null,"CBD","Urban","Short rural","long rural","EXTRA"]
[null,"dms_TradingName_List","dms_TradingNameFull_List","dms_ABN_List","dms_JurisdictionList","dms_Sector_List","dms_Segment_List","dms_FormControl_List","dms_RPT_List","dms_RPTMonth_List","dms_CRCPlength_List","dms_FRCPlength_List","dms_663_List","dms_DeterminationRef_List","dms_Addr1_List","dms_Addr2_List","dms_Suburb_List","dms_State_List","dms_PostCode_List","dms_PAddr1_List","dms_PAddr2_List","dms_PSuburb_List","dms_PState_List","dms_PPostCode_List","dms_ContactName1_List","dms_ContactPh1_List","dms_ContactEmail_List",null,"dms_CBD_flag","dms_Urban_flag","dms_ShortRural_flag","dms_LongRural_flag","dms_FeederType_5_flag","dms_MAIFI_flag_List","dms_FeederName_1","dms_FeederName_2","dms_FeederName_3","dms_FeederName_4","dms_FeederName_5"]
[null,"ActewAGL Distribution","ActewAGL Distribution",76670568688,"ACT","Electricity","Distribution","Revenue cap","Financial","June",5,5,5,"2014-19 Distribution Determination","40 Bunda Street",null,"CANBERRA","ACT","2600","GPO BOX 366",null,"CANBERRA","ACT",2601,"Robert Walker","02 6248 3847","robert.walker@actewagle.com.au",null,"NO","YES","YES","NO","NO",null,"CBD","Urban","Short rural","Long rural",null,"ActewAGL Distribution"]
[null,"ActewAGL Distribution (Tx Assets)","ActewAGL Distribution (Tx Assets)",76670568688,"ACT","Electricity","Distribution","Revenue cap","Financial","June",5,5,5,"distribution determination","40 Bunda Street",null,"CANBERRA","ACT","2600","GPO BOX 366",null,"CANBERRA","ACT",2601,"Robert Walker","02 6248 3847","robert.walker@actewagle.com.au",null,null,null,null,null,null,null,"CBD","Urban","Short rural","Long rural",null,"ActewAGL Distribution (Tx Assets)"]
[null,"ActewAGL Gas","ActewAGL Gas",76670568688,"ACT","Gas","Distribution","Weighted average price cap","Financial","June",5,5,"x",null,"40 Bunda Street",null,"CANBERRA","ACT","2600","GPO BOX 366",null,"CANBERRA","ACT",2601,"Philip Deamer","02 6248 3438","GasAAReview@actewagl.com.au",null,null,null,null,null,null,null,null,null,null,null,null,"ActewAGL Gas"]
[null,"AGN (Albury)","Australian Gas Networks Limited (reporting data for Albury)",19078551685,"Vic","Gas","Distribution","Weighted average price cap","Calendar","December",5,5,"x",null,"Level 10","81 Flinders Street","ADELAIDE","SA","5000",null,null,null,null,null,null,"08 8227 1500",null,null,null,null,null,null,null,null,"CBD","Urban","Short rural","Long rural",null,"AGN (SA)"]
[null,"AGN (Albury and Victoria)","Australian Gas Networks Limited (reporting data for Albury and Victoria)",19078551685,"Vic","Gas","Distribution","Weighted average price cap","Calendar","December",5,5,"x",null,"Level 6","400 King William Street","ADELAIDE","SA","5000","PO Box 6468","Halifax Street","ADELAIDE","SA","5000","Craig de Laine","08 8418 1129 ","craig.delaine@agn.com.au",null,null,null,null,null,null,null,"CBD","Urban","Short rural","Long rural"]
[null,"AGN (SA)","AGN (SA)",78551685,"SA","Gas","Distribution","Revenue cap","Financial","June",5,5,5,"distribution determination",null,null,null,"SA",null,null,null,null,null,null,null,null,null,null,null,null,null,null,null,null,null,null,null,null,null,"AGN (Victoria)"]
[null,"AGN (Victoria)","Australian Gas Networks Limited (reporting data for Victoria)",19078551685,"Vic","Gas","Distribution","Weighted average price cap","Calendar","December",5,5,"x",null,"Level 10","81 Flinders Street","ADELAIDE","SA","5000",null,null,null,null,null,null,"08 8227 1500",null,null,null,null,null,null,null,null,null,null,null,null,null,"AGN (Albury)"]
[null,"Amadeus","APT Pipelines (NT) Pty Ltd",39009737393,"NT","Gas","Transmission","Weighted average price cap","Financial","June",5,5,"x","n/a","Level 19, HSBC Building","580 George Street","SYDNEY","NSW","2000","Level 19, HSBC Building","580 George Street","SYDNEY","NSW","2000","Alexandra Curran","02 9275 0020","alexandra.curran@apa.com.au",null,null,null,null,null,null,null,null,null,null,null,null,"Amadeus"]
[null,"APA GasNet","APA GasNet Australia (Operations) Pty Ltd",65083009,"Vic","Gas","Transmission","Weighted average price cap","Calendar","December",5,5,"x",null,"Level 19, HSBC Building","580 George Street","SYDNEY","NSW","2000","PO Box R41",null,"ROYAL EXCHANGE","NSW","1225",null,"02 9693 0000",null,null,null,null,null,null,null,null,null,null,null,null,null,"APA GasNet"]
[null,"Ausgrid","Ausgrid",67505337385,"NSW","Electricity","Distribution","Revenue cap","Financial","June",5,5,5,"2014-19 Distribution Determination","570 George St",null,"SYDNEY","NSW",2000,null,null,null,null,null,"John Thomson","(02) 9269 2312","john.thomson@ausgrid.com.au",null,"YES","YES","YES","YES","NO",null,"CBD","Urban","Short rural","Long rural",null,"Ausgrid"]
[null,"Ausgrid (Tx Assets)","Ausgrid (Tx Assets)",67505337385,"NSW","Electricity","Distribution","Revenue cap","Financial","June",5,5,5,"distribution determination",null,null,null,"NSW",null,null,null,null,null,null,null,null,null,null,null,null,null,null,null,null,"CBD","Urban","Short rural","Long rural",null,"Ausgrid (Tx Assets)"]
[null,"AusNet (D)","AusNet Services (D)",91064651118,"Vic","Electricity","Distribution","Revenue cap","Calendar","December",5,5,2,"2016-20 Distribution Determination","Level 32","2 Southbank Boulevard","SOUTHBANK","Vic","3006","Locked Bag 14051",null,"MELBOURNE CITY MAIL CENTRE","VIC",8001,"Hannah Williams","03 9683 4088","hwilliams@powercor.com.au",null,null,"YES","YES","YES","NO",null,"CBD","Urban","Short rural","Long rural",null,"AusNet (D)"]
[null,"AusNet (Gas)","AusNet Gas Services",86015036,"Vic","Gas","Distribution","Weighted average price cap","Calendar","December",5,5,"X",null,null,null,null,null,null,null,null,null,null,null,null,null,null,null,null,null,null,null,null,null,null,null,null,null,null,"AusNet (Gas)"]
[null,"AusNet (T)","AusNet (T)",78079798173,"Vic","Electricity","Transmission","Revenue cap","Financial","March",5,5,2,"transmission determination","Level 32","2 Southbank Boulevard","SOUTHBANK","Vic","3006","Locked Bag 14051",null,"MELBOURNE CITY MAIL CENTRE","Vic","8001","Clare Thompson","03 9695 6670","clare.e.thompson@ausnetservices.com.au",null,null,null,null,null,null,null,"CBD","Urban","Short rural","Long rural",null,"AusNet (T)"]
[null,"Australian Distribution Co.","Australian Distribution Co.",11222333444,"-","Electricity","Distribution","Revenue cap","Financial","June",5,5,2,"distribution determination","123 Straight Street",null,"SYDNEY","NSW","2000","PO Box 123",null,"SYDNEY","NSW",2000,"Bob Smith","02 1234 5678","bob@auselec.net.au",null,null,null,null,null,null,null,"CBD","Urban","Short rural","Long rural",null,"Australian Distribution Co."]
[null,"Australian Distribution Co. (Vic)","Australian Distribution Co. (Victoria)",11222333444,"Vic","Electricity","Distribution","Revenue cap","Calendar","December",5,5,2,"distribution determination","123 Straight Street",null,"MELBOURNE","Vic","3000","PO Box 123",null,"MELBOURNE","VIC","3000","Bob Smith","02 1234 5678","bob@auselec.net.au",null,null,null,null,null,null,null,"CBD","Urban","Short rural","Long rural",null,"Australian Distribution Co. (Vic)"]
[null,"Australian Transmission Co.","Australian Transmission Co.",11222333444,"-","Electricity","Transmission","Revenue cap","Financial","June",5,5,5,"transmission determination","123 Straight Street",null,"SYDNEY","NSW","2000","PO Box 123",null,"SYDNEY","NSW",2000,"Bob Smith","02 1234 5678","bob@auselec.net.au",null,null,null,null,null,null,null,"CBD","Urban","Short rural","Long rural",null,"Australian Transmission Co."]
[null,"CitiPower","CitiPower",76064651056,"Vic","Electricity","Distribution","Revenue cap","Calendar","December",5,5,2,"2016-20 Distribution Determination","40 Market Street",null,"MELBOURNE","Vic","3000","Locked Bag 14090",null,"MELBOURNE","VIC",8001,"Hannah Williams","03 9683 4088","hwilliams@powercor.com.au",null,"YES","YES","NO","NO","NO",null,"CBD","Urban","Short rural","Long rural",null,"CitiPower"]
[null,"Directlink","Directlink",16779340889,"Qld","Electricity","Transmission","Revenue cap","Financial","June",9,5,5,"transmission determination",null,null,null,"NSW",null,null,null,null,null,null,null,null,null,null,null,null,null,null,null,null,"CBD","Urban","Short rural","Long rural",null,"Directlink"]
[null,"ElectraNet","ElectraNet",41094482416,"SA","Electricity","Transmission","Revenue cap","Financial","June",5,5,5,"transmission determination","52-55 East Terrace","Rymill Park","ADELAIDE","SA","5000","PO Box 7096","Hutt Street Post Office","ADELAIDE","SA",5000,"Bill Jackson","08 8404 7969","jackson.bill@electranet.com.au",null,null,null,null,null,null,null,"CBD","Urban","Short rural","Long rural",null,"ElectraNet"]
[null,"Endeavour Energy","Endeavour Energy",11247365823,"NSW","Electricity","Distribution","Revenue cap","Financial","June",5,5,5,"2014-19 Distribution Determination","51 Huntingwood Drive",null,"HUNTINGWOOD","NSW","2148","PO Box 811",null,"SEVEN HILLS","NSW","1730","Jon Hocking","02 9853 4386 / 0407 348 156","Jon.Hocking@Endeavourenergy.com.au",null,"NO","YES","YES","YES","NO",null,"CBD","Urban","Short rural","Long rural",null,"Endeavour Energy"]
[null,"Energex","Energex",40078849055,"Qld","Electricity","Distribution","Revenue cap","Financial","June",5,5,5,"2015-20 Distribution Determination","26 Reddacliff Street",null,"NEWSTEAD","Qld","4006","26 Reddacliff Street",null,"NEWSTEAD","QLD","4006","Nicola Roscoe","07 3664 5891","nicolaroscoe@energex.com.au",null,"YES","YES","YES","NO","NO",null,"CBD","Urban","Short rural","Long rural",null,"Energex"]
[null,"Ergon Energy","Ergon Energy",50087646062,"Qld","Electricity","Distribution","Revenue cap","Financial","June",5,5,5,"2015-20 Distribution Determination","22 Walker Street",null,"TOWNSVILLE","Qld","4810","Po Box 264",null,"FORTITUDE VALLEY","QLD",4006,"Jenny Doyle, Group Manager Regulatory Affairs","(07) 3851 6416","jenny.doyle@ergon.com.au",null,"NO","YES","YES","YES","NO",null,"CBD","Urban","Short rural","Long rural",null,"Ergon Energy"]
[null,"Essential Energy","Essential Energy",37428185226,"NSW","Electricity","Distribution","Revenue cap","Financial","June",5,5,5,"2014-19 Distribution Determination","8 Buller Street",null,"PORT MACQUARIE","NSW","2444","PO Box 5730",null,"PORT MACQUARIE","NSW","2444","Catherine Waddell","02 6338 3553","catherine.waddell@essentialenergy.com.au",null,null,null,"YES","YES","NO",null,"CBD","Urban","Short rural","Long rural",null,"Essential Energy"]
[null,"Jemena Electricity","Jemena Electricity",82064651083,"Vic","Electricity","Distribution","Revenue cap","Calendar","December",5,5,2,"2016-20 Distribution Determination","Level 16","567 Collins Street","MELBOURNE","VIC","3000","PO Box 16182",null,"MELBOURNE","VIC",8001,"Robert McMillan","03 9173 7000","robert.mcmillan@jemena.com.au",null,null,null,"YES","NO","NO",null,"CBD","Urban","Short rural","Long rural",null,"Jemena Electricity"]
[null,"JGN","Jemena Gas Networks",null,"NSW","Gas","Distribution","Weighted average price cap","Financial","June",5,5,null,null,null,null,null,null,null,null,null,null,null,null,null,null,null,null,null,null,null,null,null,null,null,null,null,null,null,"JGN"]
[null,"Multinet Gas","Multinet Gas (DB No.1) Pty Ltd (ACN 086 026 986), Multinet Gas (DB No.2) Pty Ltd (ACN 086 230 122)",86026986,"Vic","Gas","Distribution","Weighted average price cap","Calendar","December",5,5,"x",null,null,null,null,null,null,null,null,null,null,null,null,null,null,null,null,null,null,null,null,null,null,null,null,null,null,"Multinet Gas"]
[null,"Murraylink","Murraylink",79181207909,"SA","Electricity","Transmission","Revenue cap","Financial","June",5,5,5,"transmission determination",null,null,null,null,null,null,null,null,null,null,null,null,null,null,null,null,null,null,null,null,"CBD","Urban","Short rural","Long rural",null,"Murraylink"]
[null,"Power and Water","Power and Water Corporation",15947352360,"NT","Electricity","Distribution","Revenue cap","Financial","June",5,5,"x","distribution determination","GPO Box 1921",null,"DARWIN","NT","0801","GPO Box 1921",null,"DARWIN","NT","0801",null,null,null,null,"YES","YES","YES","YES","NO"]
[null,"Powercor Australia","Powercor Australia",89064651109,"Vic","Electricity","Distribution","Revenue cap","Calendar","December",5,5,2,"2016-20 Distribution Determination","40 Market Street",null,"MELBOURNE","Vic","3000","Locked bag 14090",null,"MELBOURNE","VIC",8001,"Hannah Williams","03 9683 4088","hwilliams@powercor.com.au",null,null,null,"YES","YES","NO",null,"CBD","Urban","Short rural","Long rural",null,"Powercor Australia"]
[null,"Powerlink","Queensland Electricity Transmission Corporation Limited trading as Powerlink Queensland",82078849233,"Qld","Electricity","Transmission","Revenue cap","Financial","June",5,5,5,"transmission determination","33 Harold St",null,"VIRGINIA","Qld","4014","PO Box 1193",null,"VIRGINIA","QLD",4014,"Jennifer Harris","07 3860 2667","jharris@powerlink.com.au",null,null,null,null,null,null,null,"CBD","Urban","Short rural","Long rural",null,"Powerlink"]
[null,"Roma to Brisbane Pipeline","APT Petroleum Pipelines Limited t/a Roma to Brisbane Pipeline","009 737 393","Qld","Gas","Transmission","Revenue cap","Financial","June",5,5,"x","n/a",null,null,null,null,null,null,null,null,null,null,null,null,null,null,null,null,null,null,null,null,"CBD","Urban","Short rural","Long rural",null,"Roma to Brisbane Pipeline"]
[null,"SA Power Networks","SA Power Networks",13332330749,"SA","Electricity","Distribution","Revenue cap","Financial","June",5,5,5,"2015-20 Distribution Determination","1 Anzac Highway",null,"KESWICK","SA","5035","GPO Box 77",null,"ADELAIDE","SA","5000","Damien O'Connor","08 8404 5066","damien.oconnor@sapowernetworks.com.au",null,null,null,"YES","YES","NO",null,"CBD","Urban","Short rural","Long rural",null,"SA Power Networks"]
[null,"TasNetworks (D)","TasNetworks (D)",24167357299,"Tas","Electricity","Distribution","Revenue cap","Financial","June",5,5,5,"distribution determination","21 Kirksway Place",null,"HOBART","Tas","7000","GPO Box 191",null,"HOBART","Tas","7000","Leigh Mayne","03 6270 3691","rrp2012@auroraenergy.com.au",null,null,null,"YES","YES","YES",null,"Critical Infrastructure","High density commercial","Urban","High density rural","Low density rural","TasNetworks (D)"]
[null,"TasNetworks (T)","TasNetworks (T)",24167357299,"Tas","Electricity","Transmission","Revenue cap","Financial","June",5,5,5,"transmission determination","1-7 Maria Street",null,"LENAH VALLEY","Tas","7008","PO Box 606",null,"MOONAH","Tas","7009","Heath Dillon","03 6274 3664","heath.dillon@transend.com.au",null,null,null,null,null,null,null,"CBD","Urban","Short rural","Long rural",null,"TasNetworks (T)"]
[null,"TransGrid","NSW Electricity Networks Operations Pty Ltd trading as TransGrid",609169959,"NSW","Electricity","Transmission","Revenue cap","Financial","June",5,4,5,"transmission determination","180 Thomas Street",null,"SYDNEY","NSW","2000","PO Box A1000",null,"SYDNEY SOUTH","NSW","1235","Garrie Chubb","0408 210 221","garrie.chubb@transgrid.com.au",null,null,null,null,null,null,null,"CBD","Urban","Short rural","Long rural",null,"TransGrid"]
[null,"United Energy","United Energy",70064651029,"Vic","Electricity","Distribution","Revenue cap","Calendar","December",5,5,2,"2016-20 Distribution Determination","Level 3","6 Nexus Court","MULGRAVE","Vic","3149","PO Box 449",null,"MOUNT WAVERLEY","VIC",3170,"Mathew Abraham","03 8846 9758","mathew.abraham@ue.com.au",null,null,null,"YES","NO","NO",null,"CBD","Urban","Short rural","Long rural",null,"United Energy"]
[null,"Western Power (D)","Western Power (D)",18540492861,"WA","Electricity","Distribution","Revenue cap","Financial","June",12,4,"x","distribution determination","363 Wellington Street",null,"PERTH","WA","6000","GPO Box L921",null,"PERTH","WA",6842,"Judy Hunter","08 9326 6239","judy.hunter@westernpower.com.au",null,null,null,"YES","YES","NO","NO","CBD","Urban","Short rural","Long rural",null,"Western Power (D)"]
[null,"Western Power (T)","Western Power (T)",18540492861,"WA","Electricity","Transmission","Revenue cap","Financial","June",12,4,"x","transmission determination","363 Wellington Street",null,"PERTH","WA","6000","GPO Box L921",null,"PERTH","WA",6842,"Judy Hunter","08 9326 6239","judy.hunter@westernpower.com.au",null,null,null,"YES","YES","NO",null,"CBD","Urban","Short rural","Long rural",null,"Western Power (T)"]
[]
[]
[null,null,null,null,null,null,null,null,null,null,null,null,null,null,null,null,null,null,null,null,null,null,"For EB & Reset RINs only"]
[null,"The Reg Year Ending (dms_RYE) must be set to the last year of the regulatory period. For forecast data is is usually (FRCP_y5) for actual it is a single year (CRY). For historical actual data the RYE will need to be set manually in the business details sheet by setting the dms_Multiyear_flag to 1 and putting the correct value in 'dms_Specified_FinalYear. See cells C67:C68",null,null,null,null,{"$f":"IF(dms_RPT=\"financial\",VALUE(LEFT(CRCP_y1,4)-1)&\"-\"&TEXT(VALUE(RIGHT(CRCP_y1,2)-1),\"00\"),VALUE(LEFT(CRCP_y1,4)-1))","v":"2013-14"},null,null,null,null,null,null,"Drop down selector box for CA & Reset RINs.","For CA & Reset RINs only",null,null,null,null,null,null,null,"for DNSP only",null,null,null,null,null,null,null,null,null,null,null,"Reason for interruption","dms_Reason_Interruption_Detailed","dms_Reason_Interruption"]
[null,"dms_Model_List ","DELETE NR 'CRY' IF NOT AN ANNUAL RIN (EB, CA , ARR)",null,"dms_RYE_Formula_Result",null,null,null,null,null,null,null,null,"dms_0203_ProjectType","dms_020303_01_UOM","dms_020501_01_UOM","dms_020501_02_UOM","dms_020501_03_UOM","dms_020501_04_UOM","dms_020603_01_UOM","dms_040102_01_UOM","dms_040102_04_UOM","dms_030601_01_UOM","dms_030601_02_UOM","dms_030701_01_UOM","dms_030702_01_UOM","dms_030703_01_UOM",null,null,null,null,null,null,null,"Animal","Animal impact","Animal"]
[null,"ARR","ANNUAL REPORTING STATEMENT",null,{"$f":"LEFT(dms_SingleYear_FinalYear_Result,2)&RIGHT(dms_SingleYear_FinalYear_Result,2)","v":{"$error":"#REF!"}},"=LEFT(dms_SingleYear_FinalYear_Result,2)&RIGHT(dms_SingleYear_FinalYear_Result,2)",null,"Formula errors are OK",null,null,null,null,null,"New line on new route - single circuit","Circuit line length in km","0's","0's","0's","0's","0's","0's","days","minutes/customer","minutes/customer","Customer / km","%","km",null,null,null,null,null,null,null,null,"Animal nesting/burrowing, etc and other","Asset failure"]
[null,"CA","CATEGORY ANALYSIS",null,{"$f":"LEFT(dms_SingleYear_FinalYear_Result,2)&RIGHT(dms_SingleYear_FinalYear_Result,2)","v":{"$error":"#REF!"}},"=LEFT(dms_SingleYear_FinalYear_Result,2)&RIGHT(dms_SingleYear_FinalYear_Result,2)",null,"Formula errors are OK",null,null,null,null,null,"New line on new route - dual circuit","Circuit line length in km","0's","0's","0's","0's","0's","0's","0's","minutes/customer","minutes/customer","MWh/customer","Number of spans",null,null,null,null,null,null,null,null,null,"Other","Other"]
[null,"CPI","CPI",null,null,null,null,null,null,null,null,null,null,"New line on new route - other","Circuit line length in km","MVA added","MVA added","MVA added","MVA added","0's","0's","$0s","interruptions/customer","interruptions/customer","kVA / customer","Number of spans",null,null,null,null,null,null,null,null,"Asset failure","LV","Overloads"]
[null,"EB","ECONOMIC BENCHMARKING",null,{"$f":"LEFT(dms_SingleYear_FinalYear_Result,2)&RIGHT(dms_SingleYear_FinalYear_Result,2)","v":{"$error":"#REF!"}},"=LEFT(dms_SingleYear_FinalYear_Result,2)&RIGHT(dms_SingleYear_FinalYear_Result,2)",null,"Formula errors are OK",null,null,null,null,null,"Line rebuild over existing route - single circuit","Circuit line length in km","0's","0's","0's","0's","0's","$0s","0's","interruptions/customer","interruptions/customer",null,"Number of spans",null,null,null,null,null,null,null,null,null,"Distribution substation","Planned"]
[null,"PTRM","POST TAX REVENUE MODEL",null,{"$f":"LEFT(dms_MultiYear_FinalYear_Result,2)&RIGHT(dms_MultiYear_FinalYear_Result,2)","v":"2024"},"=LEFT(dms_MultiYear_FinalYear_Result,2)&RIGHT(dms_MultiYear_FinalYear_Result,2)",null,null,null,null,null,null,null,"Line rebuild over existing route - dual circuit","Number","total spend $0s","total spend $0s","total spend $0s","total spend $0s","(per cent)",null,null,null,null,null,"Number of spans",null,null,null,null,null,null,null,null,null,"HV","Network business"]
[null,"Reset","REGULATORY REPORTING STATEMENT",null,{"$f":"LEFT(dms_MultiYear_FinalYear_Result,2)&RIGHT(dms_MultiYear_FinalYear_Result,2)","v":"2024"},"=LEFT(dms_MultiYear_FinalYear_Result,2)&RIGHT(dms_MultiYear_FinalYear_Result,2)",null,"Formula errors are OK",null,null,null,null,null,"Reconductor - Single circuit","Number","net circuit km added","net circuit km added","net circuit km added","net circuit km added",null,null,null,null,null,null,"Years",null,null,null,null,null,null,null,null,null,"Zone substation","Third party"]
[null,"RFM","ROLL FORWARD MODEL",null,{"$f":"LEFT(dms_CRCP_FinalYear_Result,2)&RIGHT(dms_CRCP_FinalYear_Result,2)","v":"2019"},"=LEFT(dms_CRCP_FinalYear_Result,2)&RIGHT(dms_CRCP_FinalYear_Result,2)",null,null,null,null,null,null,null,"Reconductor - Dual circuit","Number","total spend $0s","total spend $0s","total spend $0s","total spend $0s",null,null,null,null,null,null,"Years",null,null,null,null,null,null,null,null,null,"Subtransmission","Unknown"]
[null,"WACC","WEIGHTED AVERAGE COST OF CAPITAL",null,{"$f":"LEFT(dms_MultiYear_FinalYear_Result,2)&RIGHT(dms_MultiYear_FinalYear_Result,2)","v":"2024"},"=LEFT(dms_MultiYear_FinalYear_Result,2)&RIGHT(dms_MultiYear_FinalYear_Result,2)",null,null,null,null,null,null,null,"Other",null,"net circuit km added","net circuit km added","net circuit km added","net circuit km added",null,null,null,null,null,null,"Trees",null,null,null,null,null,null,null,null,"Other","insert description of 'other'","Vegetation"]
[null,null,null,null,null,null,null,null,null,null,null,null,null,null,null,"total spend $0s","total spend $0s","total spend $0s","total spend $0s",null,null,null,null,null,null,"Trees",null,null,null,null,null,null,null,null,"Overloads","-","Weather"]
[null,"dms_DataQuality_List",null,null,null,null,null,null,null,null,null,null,null,null,null,"0's",null,"$0s",null,null,null,null,null,null,null,"Defects",null,null,null,null,null,null,null,null,"Planned","-","2 - STPIS Exclusion (3.3)(a)"]
[null,"Actual",null,null,null,null,null,null,null,null,null,null,null,null,null,"0's",null,null,null,null,null,null,null,null,null,"Defects",null,null,null,null,null,null,null,null,"Network business","Network error","3 - STPIS Exclusion (3.3)(a)"]
[null,"Estimate",null,null,null,null,null,null,null,null,null,null,null,null,null,"0's",null,null,null,null,null,null,null,null,null,"Spans",null,null,null,null,null,null,null,null,null,"Switching and protection error","4 - STPIS Exclusion (3.3)(a)"]
[null,"Consolidated",null,null,null,null,null,null,null,null,null,null,null,null,null,"$0s",null,null,null,null,null,null,null,null,null,"km",null,null,null,null,null,null,null,null,"Third party","Fire","5 - STPIS Exclusion (3.3)(a)"]
[null,"Recast",null,null,null,null,null,null,null,null,null,null,null,null,null,null,null,null,null,null,null,null,null,null,null,"Spans",null,null,null,"",null,null,null,null,null,"Other","6 - STPIS Exclusion (3.3)(a)"]
[null,"Public",null,null,null,null,null,null,null,null,null,null,null,null,null,null,null,null,null,null,null,null,null,null,null,null,null,null,null,null,null,null,null,null,null,"Dig-in","7 - STPIS Exclusion (3.3)(a)"]
[null,null,null,null,null,null,null,null,null,null,null,null,null,null,null,null,null,null,null,null,null,null,null,null,null,null,null,null,null,null,null,null,null,null,null,"Unauthorised access"]
[null,"For all files either AER or business needs to be able to specify the type of submission","For PTRM & RFM templates we must provide a choice in case they change their form of control - otherwise it is drawn from the business specific lookup table above.",null,null,null,null,null,null,null,null,null,null,null,"For PTRM files - this field set the text for the named range \"DMS_Xfactor\" which in all cases is simply the text \"x factors\" - this saves putting in each old gas PTRM file ",null,null,null,null,null,null,null,"for TNSP only",null,null,null,null,null,null,null,null,null,null,null,null,"Vehicle impact"]
[null,"dms_SourceList","dms_FormControl_Choices",null,null,null,null,null,null,null,null,null,null,null,"DMS_Xfactor",null,null,null,null,null,null,null,"dms_030601_01_UOM",null,"dms_030701_01_UOM","dms_030702_01_UOM",null,null,null,null,null,null,null,null,"Unknown","Unknown"]
[null,"After appeal","Revenue cap",null,null,null,null,null,null,null,null,null,null,null,"x factors",null,null,null,null,null,null,null,"%",null,"Number of spans","km",null,null,null,null,null,null,null,null,"Vegetation","Blow-in/Fall-in - NSP responsibility"]
[null,"Draft decision","Revenue yield",null,null,null,null,null,null,null,null,null,null,null,null,null,null,null,null,null,null,null,"number",null,"Years","%",null,null,null,null,null,null,null,null,null,"Grow-in - NSP responsibility"]
[null,"Final decision","Weighted average price cap",null,null,null,null,null,null,null,null,null,null,null,null,null,null,null,null,null,null,null,"number",null,"Trees","km",null,null,null,null,null,null,null,null,null,"Blow-in/Fall-in - Other responsible party"]
[null,"PTRM update 1",null,null,null,null,null,null,null,null,null,null,null,null,null,null,null,null,null,null,null,null,"%",null,"Defects","number",null,null,null,null,null,null,null,null,null,"Grow-in - Other responsible party"]
[null,"PTRM update 2",null,null,null,null,null,null,null,null,null,null,null,null,null,null,null,null,null,null,null,null,"number",null,"Number of spans",null,null,null,null,null,null,null,null,null,"Weather"]
[null,"PTRM update 3",null,null,null,null,null,null,null,null,null,null,null,null,null,null,null,null,null,null,null,null,"number",null,"km",null,null,null,null,null,null,null,null,null,"2 - STPIS Exclusion (3.3)(a)"]
[null,"PTRM update 4",null,null,null,null,null,null,null,null,null,null,null,null,null,null,null,null,null,null,null,null,"%",null,"km",null,null,null,null,null,null,null,null,null,"3 - STPIS Exclusion (3.3)(a)"]
[null,"PTRM update 5",null,null,null,null,null,null,null,null,null,null,null,null,null,null,null,null,null,null,null,null,"number",null,"Number of spans",null,null,null,null,null,null,null,null,null,"4 - STPIS Exclusion (3.3)(a)"]
[null,"PTRM update 6",null,null,null,null,null,null,null,null,null,null,null,null,null,null,null,null,null,null,null,null,"number",null,null,null,null,null,null,null,null,null,null,null,"5 - STPIS Exclusion (3.3)(a)"]
[null,"PTRM update 7",null,null,null,null,null,null,null,null,null,null,null,null,null,null,null,null,null,null,null,null,"%",null,null,null,null,null,null,null,null,null,null,null,"6 - STPIS Exclusion (3.3)(a)"]
[null,"Regulatory proposal",null,null,null,null,null,null,null,null,null,null,null,null,null,null,null,null,null,null,null,null,"number",null,null,null,null,null,null,null,null,null,null,null,"7 - STPIS Exclusion (3.3)(a)"]
[null,"Reporting",null,null,null,null,null,null,null,null,null,null,null,null,null,null,null,null,null,null,null,null,"%"]
[null,"Revised regulatory proposal",null,null,null,null,null,null,null,null,null,null,null,null,null,null,null,null,null,null,null,null,"number"]
[null,null,null,null,null,null,null,null,null,null,null,null,null,null,null,null,null,null,null,null,null,null,"%"]
[null,null,null,null,null,null,null,null,null,null,null,null,null,null,null,null,null,null,null,null,null,null,"number"]
[]
[]
[]
[null,"These are indeces and lookup values for various dates. All step from the value placed in FRCP_y1 on the business and other details worksheet",null,null,null,null,null,null,null,null,null,"These date tables are currently used in the Recast templates to provide column headings and conditional formatting"]
[null,"dms_FRCPlength_Num_List","dms_FinalYear_List","dms_CRCPlength_Num_List","dms_CFinalYear_List","dms_FRCP_years",null,"dms_CRCP_years",null,"dms_CRCP_index",null,"CRY from input cell on business sheet","CRY - financial","dms_FinYears","CRY calendar","dms_CalYears"]
[null,1,"dms_FRCP_y1",1,"CRCP_y1",{"$f":"FRCP_y1","v":"2019-20"},"dms_FRCP_y1",{"$f":"IF(dms_RPT=\"financial\",VALUE(LEFT(dms_FRCP_y1,4)-1)&\"-\"&TEXT(VALUE(MID(dms_FRCP_y1,3,2)),\"00\"),VALUE(LEFT(dms_FRCP_y1,4)-1))","v":"2018-19"},"dms_CRCP_yZ",1,null,{"$f":"CRY","v":{"$error":"#NAME?"}},{"$f":"VALUE(LEFT(CRY,4))&\"-\"&TEXT(MID(CRY,3,2)+1,\"00\")","v":{"$error":"#NAME?"}},"dms_CRYf_y1",{"$f":"VALUE(LEFT(CRY,4)+1)","v":{"$error":"#NAME?"}},"dms_CRYc_y1"]
[null,2,"dms_FRCP_y2",2,"CRCP_y2",{"$f":"IF(dms_RPT=\"financial\",VALUE(LEFT(dms_FRCP_y1,4)+1)&\"-\"&TEXT(VALUE(RIGHT(dms_FRCP_y1,2)+1),\"00\"),VALUE(LEFT(dms_FRCP_y1,4)+1))","v":"2020-21"},"dms_FRCP_y2",{"$f":"IF(dms_RPT=\"financial\",VALUE(LEFT(dms_CRCP_yZ,4)-1)&\"-\"&TEXT(VALUE(MID(dms_CRCP_yZ,3,2)),\"00\"),VALUE(LEFT(dms_CRCP_yZ,4)-1))","v":"2017-18"},"dms_CRCP_yY",2,null,null,{"$f":"VALUE(LEFT(dms_CRYf_y1,4)+1)&\"-\"&TEXT(MID(dms_CRYf_y1,3,2)+2,\"00\")","v":{"$error":"#NAME?"}},"dms_CRYf_y2",{"$f":"VALUE(LEFT(dms_CRYc_y1,4)+1)","v":{"$error":"#NAME?"}},"dms_CRYc_y2"]
[null,3,"dms_FRCP_y3",3,"CRCP_y3",{"$f":"IF(dms_RPT=\"financial\",VALUE(LEFT(dms_FRCP_y2,4)+1)&\"-\"&TEXT(VALUE(RIGHT(dms_FRCP_y2,2)+1),\"00\"),VALUE(LEFT(dms_FRCP_y2,4)+1))","v":"2021-22"},"dms_FRCP_y3",{"$f":"IF(dms_RPT=\"financial\",VALUE(LEFT(dms_CRCP_yY,4)-1)&\"-\"&TEXT(VALUE(MID(dms_CRCP_yY,3,2)),\"00\"),VALUE(LEFT(dms_CRCP_yY,4)-1))","v":"2016-17"},"dms_CRCP_yX",3,null,null,{"$f":"VALUE(LEFT(dms_CRYf_y2,4)+1)&\"-\"&TEXT(MID(dms_CRYf_y2,3,2)+2,\"00\")","v":{"$error":"#NAME?"}},"dms_CRYf_y3",{"$f":"VALUE(LEFT(dms_CRYc_y2,4)+1)","v":{"$error":"#NAME?"}},"dms_CRYc_y3"]
[null,4,"dms_FRCP_y4",4,"CRCP_y4",{"$f":"IF(dms_RPT=\"financial\",VALUE(LEFT(dms_FRCP_y3,4)+1)&\"-\"&TEXT(VALUE(RIGHT(dms_FRCP_y3,2)+1),\"00\"),VALUE(LEFT(dms_FRCP_y3,4)+1))","v":"2022-23"},"dms_FRCP_y4",{"$f":"IF(dms_RPT=\"financial\",VALUE(LEFT(dms_CRCP_yX,4)-1)&\"-\"&TEXT(VALUE(MID(dms_CRCP_yX,3,2)),\"00\"),VALUE(LEFT(dms_CRCP_yX,4)-1))","v":"2015-16"},"dms_CRCP_yW",4,null,null,{"$f":"VALUE(LEFT(dms_CRYf_y3,4)+1)&\"-\"&TEXT(MID(dms_CRYf_y3,3,2)+2,\"00\")","v":{"$error":"#NAME?"}},"dms_CRYf_y4",{"$f":"VALUE(LEFT(dms_CRYc_y3,4)+1)","v":{"$error":"#NAME?"}},"dms_CRYc_y4"]
[null,5,"dms_FRCP_y5",5,"CRCP_y5",{"$f":"IF(dms_RPT=\"financial\",VALUE(LEFT(dms_FRCP_y4,4)+1)&\"-\"&TEXT(VALUE(RIGHT(dms_FRCP_y4,2)+1),\"00\"),VALUE(LEFT(dms_FRCP_y4,4)+1))","v":"2023-24"},"dms_FRCP_y5",{"$f":"IF(dms_RPT=\"financial\",VALUE(LEFT(dms_CRCP_yW,4)-1)&\"-\"&TEXT(VALUE(MID(dms_CRCP_yW,3,2)),\"00\"),VALUE(LEFT(dms_CRCP_yW,4)-1))","v":"2014-15"},"dms_CRCP_yV",5,null,null,{"$f":"VALUE(LEFT(dms_CRYf_y4,4)+1)&\"-\"&TEXT(MID(dms_CRYf_y4,3,2)+2,\"00\")","v":{"$error":"#NAME?"}},"dms_CRYf_y5",{"$f":"VALUE(LEFT(dms_CRYc_y4,4)+1)","v":{"$error":"#NAME?"}},"dms_CRYc_y5"]
[null,6,"dms_FRCP_y6",6,"CRCP_y6",{"$f":"IF(dms_RPT=\"financial\",VALUE(LEFT(dms_FRCP_y5,4)+1)&\"-\"&TEXT(VALUE(RIGHT(dms_FRCP_y5,2)+1),\"00\"),VALUE(LEFT(dms_FRCP_y5,4)+1))","v":"2024-25"},"dms_FRCP_y6",{"$f":"IF(dms_RPT=\"financial\",VALUE(LEFT(dms_CRCP_yV,4)-1)&\"-\"&TEXT(VALUE(MID(dms_CRCP_yV,3,2)),\"00\"),VALUE(LEFT(dms_CRCP_yV,4)-1))","v":"2013-14"},"dms_CRCP_yU",6,null,null,{"$f":"VALUE(LEFT(dms_CRYf_y5,4)+1)&\"-\"&TEXT(MID(dms_CRYf_y5,3,2)+2,\"00\")","v":{"$error":"#NAME?"}},"dms_CRYf_y6",{"$f":"VALUE(LEFT(dms_CRYc_y5,4)+1)","v":{"$error":"#NAME?"}},"dms_CRYc_y6"]
[null,7,"dms_FRCP_y7",7,"CRCP_y7",{"$f":"IF(dms_RPT=\"financial\",VALUE(LEFT(dms_FRCP_y6,4)+1)&\"-\"&TEXT(VALUE(RIGHT(dms_FRCP_y6,2)+1),\"00\"),VALUE(LEFT(dms_FRCP_y6,4)+1))","v":"2025-26"},"dms_FRCP_y7",{"$f":"IF(dms_RPT=\"financial\",VALUE(LEFT(dms_CRCP_yU,4)-1)&\"-\"&TEXT(VALUE(MID(dms_CRCP_yU,3,2)),\"00\"),VALUE(LEFT(dms_CRCP_yU,4)-1))","v":"2012-13"},"dms_CRCP_yT",7,null,null,{"$f":"VALUE(LEFT(dms_CRYf_y6,4)+1)&\"-\"&TEXT(MID(dms_CRYf_y6,3,2)+2,\"00\")","v":{"$error":"#NAME?"}},"dms_CRYf_y7",{"$f":"VALUE(LEFT(dms_CRYc_y6,4)+1)","v":{"$error":"#NAME?"}},"dms_CRYc_y7"]
[null,8,"dms_FRCP_y8",8,"CRCP_y8",{"$f":"IF(dms_RPT=\"financial\",VALUE(LEFT(dms_FRCP_y7,4)+1)&\"-\"&TEXT(VALUE(RIGHT(dms_FRCP_y7,2)+1),\"00\"),VALUE(LEFT(dms_FRCP_y7,4)+1))","v":"2026-27"},"dms_FRCP_y8",{"$f":"IF(dms_RPT=\"financial\",VALUE(LEFT(dms_CRCP_yT,4)-1)&\"-\"&TEXT(VALUE(MID(dms_CRCP_yT,3,2)),\"00\"),VALUE(LEFT(dms_CRCP_yT,4)-1))","v":"2011-12"},"dms_CRCP_yS",8,null,null,{"$f":"VALUE(LEFT(dms_CRYf_y7,4)+1)&\"-\"&TEXT(MID(dms_CRYf_y7,3,2)+2,\"00\")","v":{"$error":"#NAME?"}},"dms_CRYf_y8",{"$f":"VALUE(LEFT(dms_CRYc_y7,4)+1)","v":{"$error":"#NAME?"}},"dms_CRYc_y8"]
[null,9,"dms_FRCP_y9",9,"CRCP_y9",{"$f":"IF(dms_RPT=\"financial\",VALUE(LEFT(dms_FRCP_y8,4)+1)&\"-\"&TEXT(VALUE(RIGHT(dms_FRCP_y8,2)+1),\"00\"),VALUE(LEFT(dms_FRCP_y8,4)+1))","v":"2027-28"},"dms_FRCP_y9",{"$f":"IF(dms_RPT=\"financial\",VALUE(LEFT(dms_CRCP_yS,4)-1)&\"-\"&TEXT(VALUE(MID(dms_CRCP_yS,3,2)),\"00\"),VALUE(LEFT(dms_CRCP_yS,4)-1))","v":"2010-11"},"dms_CRCP_yR",9,null,null,{"$f":"VALUE(LEFT(dms_CRYf_y8,4)+1)&\"-\"&TEXT(MID(dms_CRYf_y8,3,2)+2,\"00\")","v":{"$error":"#NAME?"}},"dms_CRYf_y9",{"$f":"VALUE(LEFT(dms_CRYc_y8,4)+1)","v":{"$error":"#NAME?"}},"dms_CRYc_y9"]
[null,10,"dms_FRCP_y10",10,"CRCP_y10",{"$f":"IF(dms_RPT=\"financial\",VALUE(LEFT(dms_FRCP_y9,4)+1)&\"-\"&TEXT(VALUE(RIGHT(dms_FRCP_y9,2)+1),\"00\"),VALUE(LEFT(dms_FRCP_y9,4)+1))","v":"2028-29"},"dms_FRCP_y10",{"$f":"IF(dms_RPT=\"financial\",VALUE(LEFT(dms_CRCP_yR,4)-1)&\"-\"&TEXT(VALUE(MID(dms_CRCP_yR,3,2)),\"00\"),VALUE(LEFT(dms_CRCP_yR,4)-1))","v":"2009-10"},"dms_CRCP_yQ",10,null,null,{"$f":"VALUE(LEFT(dms_CRYf_y9,4)+1)&\"-\"&TEXT(MID(dms_CRYf_y9,3,2)+2,\"00\")","v":{"$error":"#NAME?"}},"dms_CRYf_y10",{"$f":"VALUE(LEFT(dms_CRYc_y9,4)+1)","v":{"$error":"#NAME?"}},"dms_CRYc_y10"]
[null,11,"dms_FRCP_y11",11,"CRCP_y11",{"$f":"IF(dms_RPT=\"financial\",VALUE(LEFT(dms_FRCP_y10,4)+1)&\"-\"&TEXT(VALUE(RIGHT(dms_FRCP_y10,2)+1),\"00\"),VALUE(LEFT(dms_FRCP_y10,4)+1))","v":"2029-30"},"dms_FRCP_y11",{"$f":"IF(dms_RPT=\"financial\",VALUE(LEFT(dms_CRCP_yQ,4)-1)&\"-\"&TEXT(VALUE(MID(dms_CRCP_yQ,3,2)),\"00\"),VALUE(LEFT(dms_CRCP_yQ,4)-1))","v":"2008-09"},"dms_CRCP_yP",11,null,null,{"$f":"VALUE(LEFT(dms_CRYf_y10,4)+1)&\"-\"&TEXT(MID(dms_CRYf_y10,3,2)+2,\"00\")","v":{"$error":"#NAME?"}},"dms_CRYf_y11",{"$f":"VALUE(LEFT(dms_CRYc_y10,4)+1)","v":{"$error":"#NAME?"}},"dms_CRYc_y11"]
[null,12,"dms_FRCP_y12",12,"CRCP_y12",{"$f":"IF(dms_RPT=\"financial\",VALUE(LEFT(dms_FRCP_y11,4)+1)&\"-\"&TEXT(VALUE(RIGHT(dms_FRCP_y11,2)+1),\"00\"),VALUE(LEFT(dms_FRCP_y11,4)+1))","v":"2030-31"},"dms_FRCP_y12",{"$f":"IF(dms_RPT=\"financial\",VALUE(LEFT(dms_CRCP_yP,4)-1)&\"-\"&TEXT(VALUE(MID(dms_CRCP_yP,3,2)),\"00\"),VALUE(LEFT(dms_CRCP_yP,4)-1))","v":"2007-08"},"dms_CRCP_yO",12,null,null,{"$f":"VALUE(LEFT(dms_CRYf_y11,4)+1)&\"-\"&TEXT(MID(dms_CRYf_y11,3,2)+2,\"00\")","v":{"$error":"#NAME?"}},"dms_CRYf_y12",{"$f":"VALUE(LEFT(dms_CRYc_y11,4)+1)","v":{"$error":"#NAME?"}},"dms_CRYc_y12"]
[null,13,"dms_FRCP_y13",13,"CRCP_y13",{"$f":"IF(dms_RPT=\"financial\",VALUE(LEFT(dms_FRCP_y12,4)+1)&\"-\"&TEXT(VALUE(RIGHT(dms_FRCP_y12,2)+1),\"00\"),VALUE(LEFT(dms_FRCP_y12,4)+1))","v":"2031-32"},"dms_FRCP_y13",{"$f":"IF(dms_RPT=\"financial\",VALUE(LEFT(dms_CRCP_yO,4)-1)&\"-\"&TEXT(VALUE(MID(dms_CRCP_yO,3,2)),\"00\"),VALUE(LEFT(dms_CRCP_yO,4)-1))","v":"2006-07"},"dms_CRCP_yN",13,null,null,{"$f":"VALUE(LEFT(dms_CRYf_y12,4)+1)&\"-\"&TEXT(MID(dms_CRYf_y12,3,2)+2,\"00\")","v":{"$error":"#NAME?"}},"dms_CRYf_y13",{"$f":"VALUE(LEFT(dms_CRYc_y12,4)+1)","v":{"$error":"#NAME?"}},"dms_CRYc_y13"]
[null,14,"dms_FRCP_y14",14,"CRCP_y14",{"$f":"IF(dms_RPT=\"financial\",VALUE(LEFT(dms_FRCP_y13,4)+1)&\"-\"&TEXT(VALUE(RIGHT(dms_FRCP_y13,2)+1),\"00\"),VALUE(LEFT(dms_FRCP_y13,4)+1))","v":"2032-33"},"dms_FRCP_y14",{"$f":"IF(dms_RPT=\"financial\",VALUE(LEFT(dms_CRCP_yN,4)-1)&\"-\"&TEXT(VALUE(MID(dms_CRCP_yN,3,2)),\"00\"),VALUE(LEFT(dms_CRCP_yN,4)-1))","v":"2005-06"},"dms_CRCP_yM",14,null,null,{"$f":"VALUE(LEFT(dms_CRYf_y13,4)+1)&\"-\"&TEXT(MID(dms_CRYf_y13,3,2)+2,\"00\")","v":{"$error":"#NAME?"}},"dms_CRYf_y14",{"$f":"VALUE(LEFT(dms_CRYc_y13,4)+1)","v":{"$error":"#NAME?"}},"dms_CRYc_y14"]
[null,15,"dms_FRCP_y15",15,"CRCP_y15",{"$f":"IF(dms_RPT=\"financial\",VALUE(LEFT(dms_FRCP_y14,4)+1)&\"-\"&TEXT(VALUE(RIGHT(dms_FRCP_y14,2)+1),\"00\"),VALUE(LEFT(dms_FRCP_y14,4)+1))","v":"2033-34"},"dms_FRCP_y15",{"$f":"IF(dms_RPT=\"financial\",VALUE(LEFT(dms_CRCP_yM,4)-1)&\"-\"&TEXT(VALUE(MID(dms_CRCP_yM,3,2)),\"00\"),VALUE(LEFT(dms_CRCP_yM,4)-1))","v":"2004-05"},"dms_CRCP_yL",15,null,null,{"$f":"VALUE(LEFT(dms_CRYf_y14,4)+1)&\"-\"&TEXT(MID(dms_CRYf_y14,3,2)+2,\"00\")","v":{"$error":"#NAME?"}},"dms_CRYf_y15",{"$f":"VALUE(LEFT(dms_CRYc_y14,4)+1)","v":{"$error":"#NAME?"}},"dms_CRYc_y15"]
[null,null,null,null,null,null,null,null,null,null,null,null,{"$f":"VALUE(LEFT(dms_CRYf_y15,4)+1)&\"-\"&TEXT(MID(dms_CRYf_y15,3,2)+2,\"00\")","v":{"$error":"#NAME?"}},"dms_CRYf_y16",{"$f":"VALUE(LEFT(dms_CRYc_y15,4)+1)","v":{"$error":"#NAME?"}},"dms_CRYc_y16"]
[null,"These are drop down lists for businesses to select the correct FRCP_y1 on the business and other details worksheet.\nThis also populates the column headings in the worksheets",null,null,null,null,null,null,null,null,null,null,{"$f":"VALUE(LEFT(dms_CRYf_y16,4)+1)&\"-\"&TEXT(MID(dms_CRYf_y16,3,2)+2,\"00\")","v":{"$error":"#NAME?"}},"dms_CRYf_y17",{"$f":"VALUE(LEFT(dms_CRYc_y16,4)+1)","v":{"$error":"#NAME?"}},"dms_CRYc_y17"]
[null,"dms_RCP_fyear_list","dms_CRY_ListF","dms_CRY_ListC","dms_RCP_cyear_list","dms_FRCP_fyear_list","dms_FRCP_ListF","dms_FRCP_ListC","dms_FRCP_cyear_list",null,null,null,{"$f":"VALUE(LEFT(dms_CRYf_y17,4)+1)&\"-\"&TEXT(MID(dms_CRYf_y17,3,2)+2,\"00\")","v":{"$error":"#NAME?"}},"dms_CRYf_y18",{"$f":"VALUE(LEFT(dms_CRYc_y17,4)+1)","v":{"$error":"#NAME?"}},"dms_CRYc_y18"]
[null,"dms_fy1","2006-07",2007,"dms_cy1","dms_frcp_fy1","2016-17","2017","dms_crcp_cy1",null,null,null,{"$f":"VALUE(LEFT(dms_CRYf_y18,4)+1)&\"-\"&TEXT(MID(dms_CRYf_y18,3,2)+2,\"00\")","v":{"$error":"#NAME?"}},"dms_CRYf_y19",{"$f":"VALUE(LEFT(dms_CRYc_y18,4)+1)","v":{"$error":"#NAME?"}},"dms_CRYc_y19"]
[null,"dms_fy2","2007-08","2008","dms_cy2","dms_frcp_fy2","2017-18","2018","dms_crcp_cy2",null,null,null,{"$f":"VALUE(LEFT(dms_CRYf_y19,4)+1)&\"-\"&TEXT(MID(dms_CRYf_y19,3,2)+2,\"00\")","v":{"$error":"#NAME?"}},"dms_CRYf_y20",{"$f":"VALUE(LEFT(dms_CRYc_y19,4)+1)","v":{"$error":"#NAME?"}},"dms_CRYc_y20"]
[null,"dms_fy3","2008-09","2009","dms_cy3","dms_frcp_fy3","2018-19","2019","dms_crcp_cy3"]
[null,"dms_fy4","2009-10","2010","dms_cy4","dms_frcp_fy4","2019-20","2020","dms_crcp_cy4"]
[null,"dms_fy5","2010-11","2011","dms_cy5","dms_frcp_fy5","2020-21","2021","dms_crcp_cy5"]
[null,"dms_fy6","2011-12","2012","dms_cy6","dms_frcp_fy6","2021-22","2022","dms_crcp_cy6"]
[null,"dms_fy7","2012-13","2013","dms_cy7","dms_frcp_fy7","2022-23","2023","dms_crcp_cy7"]
[null,"dms_fy8","2013-14","2014","dms_cy8","dms_frcp_fy8","2023-24","2024","dms_crcp_cy8",null,null,"2005-06","2006"]
[null,"dms_fy9","2014-15","2015","dms_cy9","dms_frcp_fy9","2024-25","2025","dms_crcp_cy9",null,null,"2006-07","2007"]
[null,"dms_fy10","2015-16","2016","dms_cy10","dms_frcp_fy10","2025-26","2026","dms_crcp_cy10",null,null,"2007-08","2008"]
[null,"dms_fy11","2016-17","2017","dms_cy11","dms_frcp_fy11","2026-27","2027","dms_crcp_cy11",null,null,"2008-09","2009"]
[null,"dms_fy12","2017-18","2018","dms_cy12","dms_frcp_fy12","2027-28","2028","dms_crcp_cy12",null,null,"2009-10",2010]
[null,"dms_fy13","2018-19",2019,"dms_cy13","dms_frcp_fy13","2028-29","2029","dms_crcp_cy13",null,null,"2010-11",2011]
[null,"dms_fy14","2019-20","2020","dms_cy14","dms_frcp_fy14","2029-30","2030","dms_crcp_cy14",null,null,"2011-12",2012]
[null,"dms_fy15","2019-20","2020","dms_cy15","dms_frcp_fy15","2030-31","2031","dms_crcp_cy15",null,null,"2012-13",2013]
[null,"dms_fy16","2020-21","2021","dms_cy16",null,null,null,null,null,null,"2013-14",2014]
[null,"dms_fy17","2021-22","2022","dms_cy17",null,null,null,null,null,null,"2014-15",2015]
[null,"dms_fy18","2022-23","2023","dms_cy18",null,null,null,null,null,null,"2015-16",2016]
[null,"dms_fy19","2023-24","2024","dms_cy19",null,null,null,null,null,null,"2016-17",2017]
[null,"dms_fy20","2024-25","2025","dms_cy20",null,null,null,null,null,null,"2017-18",2018]
[null,null,null,null,null,null,null,null,null,null,null,"2018-19",2019]
[null,null,null,null,null,null,null,null,null,null,null,"2019-20",2020]
[null,null,null,null,null,null,null,null,null,null,null,"2020-21",2021]
[null,null,null,null,null,null,null,null,null,null,null,"2021-22",2022]
[null,null,null,null,null,null,null,null,null,null,null,"2022-23",2023]
[null,null,null,null,null,null,null,null,null,null,null,"2023-24",2024]
[null,null,null,null,null,null,null,null,null,null,null,"2024-25",2025]
[null,null,null,null,null,null,null,null,null,null,null,"2025-26",2026]
[null,null,null,null,null,null,null,null,null,null,null,"2026-27",2027]
[null,null,null,null,null,null,null,null,null,null,null,"2027-28",2028]
[null,null,null,null,null,null,null,null,null,null,null,"2028-29",2029]
[null,null,null,null,null,null,null,null,null,null,null,"2029-30",2030]
[null,null,null,null,null,null,null,null,null,null,null,"2030-31",2031]
[null,null,null,null,null,null,null,null,null,null,null,"2031-32",2032]
[null,null,null,null,null,null,null,null,null,null,null,"2032-33",2033]
[null,null,null,null,null,null,null,null,null,null,null,"2033-34",2034]
[null,null,null,null,null,null,null,null,null,null,null,"2034-35",2035]
[null,null,null,null,null,null,null,null,null,null,null,"2035-36",2036]

{"sheet":"Contents","index":1,"n_rows":26,"n_cols":20,"rows_kept":26,"cut":false,"hidden":false,"merged":[[3,2,3,27]]}
[null,null,"REGULATORY REPORTING STATEMENT\n"]
[null,null,{"$f":"dms_TradingName","v":"TasNetworks (T)"}]
[null,null,{"$f":"CONCATENATE(FRCP_y1,\" to \",FRCP_y5)","v":"2019-20 to 2023-24"}]
[null,null,"Contents"]
[]
[]
[null,null,null,null,null,"1. Business details",null,null,null,null,null,null,"2. Expenditure",null,null,null,null,null,null,"3. Economic benchmarking"]
[]
[]
[]
[]
[]
[]
[]
[]
[]
[]
[]
[]
[]
[]
[]
[]
[]
[]
[null,null,null,null,null,"5. Network information",null,null,null,null,null,null,null,null,null,null,null,null,null,"7. Other templates"]

{"sheet":"Instructions","index":2,"n_rows":27,"n_cols":4,"rows_kept":27,"cut":false,"hidden":false,"merged":[[25,2,25,3],[26,2,26,4],[24,2,24,4],[1,1,1,5],[2,1,2,5],[3,2,3,4],[4,2,4,4],[5,2,5,4],[7,2,7,3],[8,2,8,4],[10,2,10,4],[12,2,12,4],[20,2,20,4],[22,2,22,4]]}
[]
[null,{"$f":"CONCATENATE(dms_Segment,\" Network Service Provider\")","v":"Transmission Network Service Provider"}]
[null,{"$f":"IF(dms_Model=\"Reset\",\"Regulatory Proposal RIN Template\",\"Annual Reporting RIN\")","v":"Regulatory Proposal RIN Template"}]
[null,null,{"$f":"CONCATENATE(\"This template is to be used by \",dms_TradingName,\" to fulfil its reporting obligations to the AER.\")","v":"This template is to be used by TasNetworks (T) to fulfil its reporting obligations to the AER."}]
[null,null,"INSTRUCTIONS"]
[null,null,"Complete the Business & other details worksheet before entering data or values in any other worksheets. The Business & other details worksheet is linked to other worksheets within the workbook and automatically generates certain column headings and conditional formatting."]
[]
[null,null,"Identifying CONFIDENTIAL INFORMATION:\n\nPlease use the macro at the top of each \nworksheet to identify confidential information. \n\n"]
[null,null,"-Do this by selecting the cell or cells that contain confidential information and then run the Mark selection CONFIDENTIAL macro. This will format the cells a specific colour that is identified by the AER's database which in turn marks that information as confidential.\n\n-To reverse this, select the cell or cells and run the Return selection to NON-CONFIDENTIAL macro."]
[]
[null,null,"UNITS OF MEASURE\n\nAll amounts are to be unrounded and reported on a one for one basis: that is 1000 is to be entered as '1000'. Applicable units of measure may be identified in the table column headings or row descriptors.\n\n"]
[]
[null,null,"COLOUR CODING OF INPUT / NON-INPUT CELLS:"]
[null,null,null,"Yellow = Input cell (mandatory)"]
[null,null,null,"Darker yellow = input cell (mandatory)"]
[null,null,null,"Orange = input cell (if data available)"]
[null,null,null,"Grey = Not applicable/No inputs required"]
[null,null,null,"\nPLEASE DO NOT ENTER TEXT into cells that are to contain numeric data."]
[]
[]
[null,null,"WORKSHEET NAVIGATION\n\nMany tables in the worksheets have been \"grouped\" to allow for easy navigation. To ungroup or group data use the outline symbols in the left margin (for Row groupings) or above the columns (for column groupings). \n\n\n"]
[]
[null,null,"RETURNING COMPLETED RESPONSES\n\nPlease return two (2) files to the AER: \n1. A confidential version which must contain a complete set of all responses with confidential information marked using the Mark selection CONFIDENTIAL macro and which has been completed using the locked template file provided by the AER. \n\n2. A public version with confidential information either removed completely or aggregated in some form together with writtten consent to disclose the public version of the response.\n\nUse the drop down box on the Business and other details worksheet to identify the file as either confidential ('consolidated') or public. "]
[]
[null,null,"SUBMITTING AMENDED DATA TO THE AER\n\nIf an NSP wishes to correct data previously submitted to the AER it should resubmit that data using the original completed submission as the starting point. Please make any necessary changes to the data. Data that is not being amended should be left unchanged. \n\nNSPs must identify the reason for the amendments in the Amendment Reason box on the  Business and other details worksheet. NSPs may provide further details regarding any amendments in the Amendments worksheet. \n\n."]
[null,null,"NSP may use Amended Data macro \nto highlight cells that contain amended data.\nNB: if data is also CONFIDENTIAL, re-apply \nthe Confidentiality macro after applying the \nAmended macro"]
[null,null,"Please resubmit two (2) files - a confidential version and a public version of the amended submission to the AER"]

{"sheet":"Business & other details","index":3,"n_rows":93,"n_cols":12,"rows_kept":93,"cut":false,"hidden":false,"merged":[[83,4,83,8],[18,4,18,7],[19,2,19,3],[19,4,19,7],[22,2,22,3],[22,4,22,7],[23,4,23,7],[24,2,24,3],[24,4,24,7],[32,1,32,8],[49,2,49,3],[51,2,51,8],[7,1,7,8],[11,1,11,8],[13,2,13,4],[14,2,14,4],[17,2,17,3],[17,4,17,7]]}
[null,{"$f":"IF(dms_DataQuality=\"backcast\",INDEX(dms_Worksheet_List,MATCH(dms_Model,dms_Model_List))&\" BACKCAST\",INDEX(dms_Worksheet_List,MATCH(dms_Model,dms_Model_List)))","v":"REGULATORY REPORTING STATEMENT"}]
[null,{"$f":"INDEX(dms_TradingNameFull_List,MATCH(dms_TradingName,dms_TradingName_List))","v":"TasNetworks (T)"}]
[null,{"$f":"IF(SUM(dms_SingleYear_Model)>0,CRY,CONCATENATE(FRCP_y1,\" to \",dms_MultiYear_FinalYear_Result))","v":"2019-20 to 2023-24"}]
[null,"BUSINESS & OTHER DETAILS"]
[]
[]
[null,"Instructions"]
[null,"Complete the following business details regulatory template before entering data or values in any other regulatory template. This regulatory template is linked to other cells within the spreadsheet and automatically generates column headings and conditional formatting to distinguish business specific input and non-input cells. "]
[]
[null,"SUBMISSION PARTICULARS INPUT SHEETS"]
[]
[null,"ENTITY DETAILS"]
[]
[null,"Short name","TasNetworks (T)"]
[null,"ACN / ABN",{"$f":"INDEX(dms_ABN_List,MATCH(dms_TradingName,dms_TradingName_List))","v":24167357299}]
[]
[]
[null,"Business address","Address 1",null,{"$f":"INDEX(dms_Addr1_List,MATCH(dms_TradingName,dms_TradingName_List))","v":"1-7 Maria Street"}]
[null,null,null,"Address 2",{"$f":"IF(ISBLANK(INDEX(dms_Addr2_List,MATCH(dms_TradingName,dms_TradingName_List))),\"\",INDEX(dms_Addr2_List,MATCH(dms_TradingName,dms_TradingName_List)))","v":""}]
[null,null,"Suburb",null,{"$f":"INDEX(dms_Suburb_List,MATCH(dms_TradingName,dms_TradingName_List))","v":"LENAH VALLEY"}]
[null,null,null,"State",{"$f":"INDEX(dms_State_List,MATCH(dms_TradingName,dms_TradingName_List))","v":"Tas"},"p/code",{"$f":"INDEX(dms_PostCode_List,MATCH(dms_TradingName,dms_TradingName_List))","v":"7008"}]
[]
[null,"Postal address","Address 1",null,{"$f":"INDEX(dms_PAddr1_List,MATCH(dms_TradingName,dms_TradingName_List))","v":"PO Box 606"}]
[null,null,null,"Address 2",{"$f":"IF(ISBLANK(INDEX(dms_PAddr2_List,MATCH(dms_TradingName,dms_TradingName_List))),\"\",INDEX(dms_PAddr2_List,MATCH(dms_TradingName,dms_TradingName_List)))","v":""}]
[null,null,"Suburb",null,{"$f":"INDEX(dms_PSuburb_List,MATCH(dms_TradingName,dms_TradingName_List))","v":"MOONAH"}]
[null,null,null,"State",{"$f":"INDEX(dms_PState_List,MATCH(dms_TradingName,dms_TradingName_List))","v":"Tas"},"p/code",{"$f":"INDEX(dms_PPostCode_List,MATCH(dms_TradingName,dms_TradingName_List))","v":"7009"}]
[]
[]
[null,"Contact name/s","John Sayers"]
[null,"Contact phone/s"]
[null,"Contact email address/s","john.sayers@tasnetworks.com.au"]
[]
[null,"REGULATORY CONTROL PERIODS"]
[]
[null,"Forthcoming regulatory control period","2019-20",{"$f":"dms_FRCP_y2","v":"2020-21"},{"$f":"dms_FRCP_y3","v":"2021-22"},{"$f":"dms_FRCP_y4","v":"2022-23"},{"$f":"dms_FRCP_y5","v":"2023-24"},{"$f":"dms_FRCP_y6","v":"2024-25"},{"$f":"dms_FRCP_y7","v":"2025-26"},{"$f":"dms_FRCP_y8","v":"2026-27"},{"$f":"dms_FRCP_y9","v":"2027-28"},{"$f":"dms_FRCP_y10","v":"2028-29"}]
[]
[]
[null,"Current regulatory control period",{"$f":"dms_CRCP_FirstYear_Result","v":"2014-15"},{"$f":"IF(dms_RPT=\"financial\",VALUE(LEFT(CRCP_y1,4)+1)&\"-\"&TEXT(MID(CRCP_y1,3,2)+2,\"00\"),VALUE(LEFT(CRCP_y1,4)+1))","v":"2015-16"},{"$f":"IF(dms_RPT=\"financial\",VALUE(LEFT(CRCP_y2,4)+1)&\"-\"&TEXT(VALUE(MID(CRCP_y2,3,2)+2),\"00\"),VALUE(LEFT(CRCP_y2,4)+1))","v":"2016-17"},{"$f":"IF(dms_RPT=\"financial\",VALUE(LEFT(CRCP_y3,4)+1)&\"-\"&TEXT(VALUE(MID(CRCP_y3,3,2)+2),\"00\"),VALUE(LEFT(CRCP_y3,4)+1))","v":"2017-18"},{"$f":"IF(dms_RPT=\"financial\",VALUE(LEFT(CRCP_y4,4)+1)&\"-\"&TEXT(VALUE(MID(CRCP_y4,3,2)+2),\"00\"),VALUE(LEFT(CRCP_y4,4)+1))","v":"2018-19"},{"$f":"IF(dms_RPT=\"financial\",VALUE(LEFT(CRCP_y5,4)+1)&\"-\"&TEXT(VALUE(MID(CRCP_y5,3,2)+2),\"00\"),VALUE(LEFT(CRCP_y5,4)+1))","v":"2019-20"},{"$f":"IF(dms_RPT=\"financial\",VALUE(LEFT(CRCP_y6,4)+1)&\"-\"&TEXT(VALUE(MID(CRCP_y6,3,2)+2),\"00\"),VALUE(LEFT(CRCP_y6,4)+1))","v":"2020-21"},{"$f":"IF(dms_RPT=\"financial\",VALUE(LEFT(CRCP_y7,4)+1)&\"-\"&TEXT(VALUE(MID(CRCP_y7,3,2)+2),\"00\"),VALUE(LEFT(CRCP_y7,4)+1))","v":"2021-22"},{"$f":"IF(dms_RPT=\"financial\",VALUE(LEFT(CRCP_y8,4)+1)&\"-\"&TEXT(VALUE(MID(CRCP_y8,3,2)+2),\"00\"),VALUE(LEFT(CRCP_y8,4)+1))","v":"2022-23"},{"$f":"IF(dms_RPT=\"financial\",VALUE(LEFT(CRCP_y9,4)+1)&\"-\"&TEXT(VALUE(MID(CRCP_y9,3,2)+2),\"00\"),VALUE(LEFT(CRCP_y9,4)+1))","v":"2023-24"}]
[]
[]
[null,"Previous regulatory control period",{"$f":"IF(dms_RPT=\"financial\",VALUE(LEFT(PRCP_y2,4)-1)&\"-\"&TEXT(VALUE(MID(PRCP_y2,3,2)),\"00\"),VALUE(LEFT(PRCP_y2,4)-1))","v":"2009-10"},{"$f":"IF(dms_RPT=\"financial\",VALUE(LEFT(PRCP_y3,4)-1)&\"-\"&TEXT(VALUE(MID(PRCP_y3,3,2)),\"00\"),VALUE(LEFT(PRCP_y3,4)-1))","v":"2010-11"},{"$f":"IF(dms_RPT=\"financial\",VALUE(LEFT(PRCP_y4,4)-1)&\"-\"&TEXT(VALUE(MID(PRCP_y4,3,2)),\"00\"),VALUE(LEFT(PRCP_y4,4)-1))","v":"2011-12"},{"$f":"IF(dms_RPT=\"financial\",VALUE(LEFT(PRCP_y5,4)-1)&\"-\"&TEXT(VALUE(RIGHT(PRCP_y5,2)-1),\"00\"),VALUE(LEFT(PRCP_y5,4)-1))","v":"2012-13"},{"$f":"IF(dms_RPT=\"financial\",VALUE(LEFT(CRCP_y1,4)-1)&\"-\"&TEXT(VALUE(RIGHT(CRCP_y1,2)-1),\"00\"),VALUE(LEFT(CRCP_y1,4)-1))","v":"2013-14"}]
[]
[]
[null,"Current regulatory year","2013-14","CRY"]
[]
[]
[]
[]
[]
[null,"Source","Regulatory proposal",null,"Please select the correct submission type from the dropdown list."]
[null,"Data quality (actual, estimate, public, consolidated)","Consolidated"]
[null,"Amended RIN submission - amendment reason"]
[null,"Submission Date","dd/mm/yyyy","dms_SubmissionDate","Please enter date this file submitted to AER (dd/mm/yyyy)"]
[null,"EBSS - First application of scheme in forthcoming period?","Yes"]
[null,"Sector",{"$f":"INDEX(dms_Sector_List,MATCH(dms_TradingName,dms_TradingName_List))","v":"Electricity"},"dms_Sector","=INDEX(dms_Sector_List,MATCH(dms_TradingName,dms_TradingName_List))"]
[null,"Segment",{"$f":"INDEX(dms_Segment_List,MATCH(dms_TradingName,dms_TradingName_List))","v":"Transmission"},"dms_Segment","=INDEX(dms_Segment_List,MATCH(dms_TradingName,dms_TradingName_List))"]
[null,"Regulatory Year Ending",{"$f":"IF(dms_MultiYear_Flag=1,LEFT(dms_Specified_FinalYear,2)&RIGHT(dms_Specified_FinalYear,2),INDEX(dms_RYE_Formula_Result,MATCH(dms_Model,dms_Model_List)))","v":"2024"},"dms_RYE","=IF(dms_MultiYear_Flag=1,LEFT(dms_Specified_FinalYear,2)&RIGHT(dms_Specified_FinalYear,2),INDEX(dms_RYE_Formula_Result,MATCH(dms_Model,dms_Model_List)))"]
[null,"Reporting Period Type",{"$f":"INDEX(dms_RPT_List,MATCH(dms_TradingName,dms_TradingName_List))","v":"Financial"},"dms_RPT","=INDEX(dms_RPT_List,MATCH(dms_TradingName,dms_TradingName_List))"]
[null,"Model or RIN Type","Reset","dms_Model","Drop down selection"]
[null,"Security Classification","Public","dms_Classification","Always Public"]
[null,"Template - version no.",5,"dms_TemplateNumber"]
[null,"Dollar $ real month",{"$f":"INDEX(dms_RPTMonth_List,MATCH(dms_TradingName,dms_TradingName_List))","v":"June"},"dms_RPTMonth","=INDEX(dms_RPTMonth_List,MATCH(dms_TradingName,dms_TradingName_List))"]
[null,"Dollar $ real  (the last month before the FRCP_y1)",{"$f":"CONCATENATE(dms_RPTMonth)&\" \"&VALUE((LEFT(dms_CRCP_FinalYear_Result,2)&RIGHT(dms_CRCP_FinalYear_Result,2)))","v":"June 2019"},"dms_DollarReal","=IF(SUM(dms_SingleYear_Model)>0,CONCATENATE(dms_RPTMonth)&\" \"&VALUE((LEFT(CRY,2))&RIGHT(CRY,2)),CONCATENATE(dms_RPTMonth)&\" \"&VALUE((LEFT(dms_CRCP_FinalYear_Result,2)&RIGHT(dms_CRCP_FinalYear_Result,2))))"]
[null,"Form of control",{"$f":"INDEX(dms_FormControl_List,MATCH(dms_TradingName,dms_TradingName_List))","v":"Revenue cap"},"dms_FormControl","=INDEX(dms_FormControl_List,MATCH(dms_TradingName,dms_TradingName_List))"]
[null,"Calendar Year for table 3.6 data",{"$f":"VALUE(dms_RYE)-1","v":2023},"dms_0306_Year","=VALUE(dms_RYE)-1"]
[null,"RIN response - version no.",1,"dms_RINversion"]
[null,"Jurisdiction",{"$f":"INDEX(dms_JurisdictionList,MATCH(dms_TradingName,dms_TradingName_List))","v":"Tas"},"dms_Jurisdiction","=INDEX(dms_JurisdictionList,MATCH(dms_TradingName,dms_TradingName_List))"]
[null,"Backcast Multiyear EB, CA or ARR?",0,"dms_MultiYear_Flag","1=y, 0-n"]
[null,null,2013,"dms_Specified_FinalYear","The result here is returned to dms_CRCP_FinalYear_Result if dms_MultiYear_Flag is set to 1"]
[null,"Single Year Model T/F",{"$f":"IF(dms_Model=\"EB\",1,0)","v":0},"dms_EB"]
[null,null,{"$f":"IF(dms_Model=\"CA\",1,0)","v":0},"dms_CA","=dms_SingleYear_Model"]
[null,null,{"$f":"IF(dms_Model=\"ARR\",1,0)","v":0},"dms_ARR"]
[null,"Single Year Final Year Reference","CRY","dms_SingleYear_FinalYear_Ref","This is the reference for EB, CA & ARR RINs"]
[null,"Single Year Final Year Result",{"$f":"INDIRECT(dms_SingleYear_FinalYear_Ref)","v":{"$error":"#REF!"}},"dms_SingleYear_FinalYear_Result","=INDIRECT(dms_SingleYear_FinalYear_Ref)",null,null,null,"Formula errors OK"]
[null,"FRCP length in years",{"$f":"INDEX(dms_FRCPlength_List,MATCH(dms_TradingName,dms_TradingName_List))","v":5},"dms_FRCPlength_Num","=INDEX(dms_FRCPlength_List,MATCH(dms_TradingName,dms_TradingName_List))"]
[null,"Multi Year Final Year Reference",{"$f":"INDEX(dms_FinalYear_List,MATCH(dms_FRCPlength_Num,dms_FRCPlength_Num_List))","v":"dms_FRCP_y5"},"dms_MultiYear_FinalYear_Ref","=INDEX(dms_FinalYear_List,MATCH(dms_FRCPlength_Num,dms_FRCPlength_Num_List))"]
[null,"Multi Year Final Year Result",{"$f":"IF(dms_MultiYear_Flag=0,INDIRECT(dms_MultiYear_FinalYear_Ref),dms_Specified_FinalYear)","v":"2023-24"},"dms_MultiYear_FinalYear_Result","=IF(dms_MultiYear_Flag=0,INDIRECT(dms_MultiYear_FinalYear_Ref),dms_Specified_FinalYear)",null,null,null,"Formula errors OK"]
[null,"CRCP length in years",{"$f":"INDEX(dms_CRCPlength_List,MATCH(dms_TradingName,dms_TradingName_List))","v":5},"dms_CRCPlength_Num","=INDEX(dms_CRCPlength_List,MATCH(dms_TradingName,dms_TradingName_List))"]
[null,"CRCP Final Year Reference",{"$f":"INDEX(dms_CFinalYear_List,MATCH(dms_CRCPlength_Num,dms_CRCPlength_Num_List))","v":"CRCP_y5"},"dms_CRCP_FinalYear_Ref","=INDEX(dms_CFinalYear_List,MATCH(dms_CRCPlength_Num,dms_CRCPlength_Num_List))"]
[null,"CRCP First Year Result",{"$f":"INDEX(dms_CRCP_years,MATCH(dms_CRCPlength_Num,dms_CRCP_index))","v":"2014-15"},"dms_CRCP_FirstYear_Result","=INDEX(dms_CRCP_years,MATCH(dms_CRCPlength_Num,dms_CRCP_index))"]
[null,"CRCP Final Year Result",{"$f":"IF(dms_MultiYear_Flag=0,(IF(SUM(dms_SingleYear_Model)>0,CRY,dms_CRCP_yZ)),dms_Specified_FinalYear)","v":"2018-19"},"dms_CRCP_FinalYear_Result","=IF(dms_MultiYear_Flag=0,(IF(SUM(dms_SingleYear_Model)>0,CRY,dms_CRCP_yZ)),dms_Specified_FinalYear)"]
[null,"Table 6.6.3 - Public lighting repair - no. business days",{"$f":"INDEX(dms_663_List,MATCH(dms_TradingName,dms_TradingName_List))","v":5},"dms_663"]
[null,"Distribution Determination Reference",{"$f":"INDEX(dms_DeterminationRef_List,MATCH(dms_TradingName,dms_TradingName_List))","v":"transmission determination"}]
[null,"Backcast templates only - unit of measure ","$0s","dms_Backcast_UOM","If the cover sheet is for Backcast data ensure to apply dms_Backcast_UOM named range to this field. Otherwise, do not apply this named range."]
[null,"EB/CA Unit of Measure for Monetary Values","$0s","dms_dollar_nom_UOM","If the cover sheet is attached to an EB files make sure this field is set"]
[]
[null,"discard this record?","NO","dms_DISCARD","If record is to be discarded from DB set this flag to YES"]
[null,"CBD Feeder for this business",{"$f":"INDEX(dms_CBD_flag,MATCH(dms_TradingName,dms_TradingName_List))","v":0},"dms_CBD_flag_NSP"]
[null,"Urban Feeder for this business",{"$f":"INDEX(dms_Urban_flag,MATCH(dms_TradingName,dms_TradingName_List))","v":0},"dms_Urban_flag_NSP"]
[null,"Short rural Feeder for this business",{"$f":"INDEX(dms_ShortRural_flag,MATCH(dms_TradingName,dms_TradingName_List))","v":0},"dms_ShortRural_flag_NSP"]
[null,"Long rural Feeder for this business",{"$f":"INDEX(dms_LongRural_flag,MATCH(dms_TradingName,dms_TradingName_List))","v":0},"dms_LongRural_flag_NSP"]
[]
[null,"USES NAMED RANGES FLAG","yes","dms_Defined_Names_Used"]

{"sheet":"CPI series","index":4,"n_rows":13,"n_cols":12,"rows_kept":13,"cut":false,"hidden":false,"merged":[[9,2,9,8]]}
[null,{"$f":"SheetHeader","v":"REGULATORY REPORTING STATEMENT"}]
[null,{"$f":"dms_TradingName","v":"TasNetworks (T)"}]
[null,{"$f":"dms_Reg_Year_Span","v":"2019-20 to 2023-24"}]
[null,"CPI SERIES"]
[]
[]
[]
[null,"NOMINATED CPI SERIES"]
[]
[null,"Name of CPI series","ABS CPI Index - June (rebased)"]
[]
[null,null,{"$f":"CRCP_y1","v":"2014-15"},{"$f":"CRCP_y2","v":"2015-16"},{"$f":"CRCP_y3","v":"2016-17"},{"$f":"CRCP_y4","v":"2017-18"},{"$f":"CRCP_y5","v":"2018-19"},{"$f":"FRCP_y1","v":"2019-20"},{"$f":"FRCP_y2","v":"2020-21"},{"$f":"FRCP_y3","v":"2021-22"},{"$f":"FRCP_y4","v":"2022-23"},{"$f":"FRCP_y5","v":"2023-24"}]
[null,"Series data",107.5,108.6,110.7,{"$f":"ROUND(113.41215,1)","v":113.4},{"$f":"ROUND(116.190747675,1)","v":116.2},{"$f":"ROUND(119.037420993038,1)","v":119},{"$f":"ROUND(121.953837807367,1)","v":122},{"$f":"ROUND(124.941706833647,1)","v":124.9},{"$f":"ROUND(128.002778651072,1)","v":128},{"$f":"ROUND(131.138846728023,1)","v":131.1}]

{"sheet":"2.1 Expenditure summary","index":5,"n_rows":37,"n_cols":9,"rows_kept":37,"cut":false,"hidden":false,"merged":[[30,2,30,8],[8,2,8,8],[19,2,19,8]]}
[null,{"$f":"(LOOKUP(dms_Model,dms_Model_List,dms_Worksheet_List))","v":"REGULATORY REPORTING STATEMENT"}]
[null,{"$f":"INDEX(dms_TradingNameFull_List,MATCH(dms_TradingName,dms_TradingName_List))","v":"TasNetworks (T)"}]
[null,{"$f":"IF(SUM(dms_SingleYear_Model)>0,CRY,CONCATENATE(FRCP_y1,\" to \",dms_MultiYear_FinalYear_Result))","v":"2019-20 to 2023-24"}]
[null,"2.1 - EXPENDITURE SUMMARY AND RECONCILIATION"]
[]
[null,"There are three tables on this worksheet. Each has been grouped for ease of navigation. See the Instructions sheet on how to group or ungroup tables. "]
[]
[null,"2.1.1 - PRESCRIBED TRANSMISSION SERVICES CAPEX (as incurred)"]
[null,null,{"$f":"CONCATENATE(\"Forecast \n($0's. real \",dms_DollarReal,\")\")","v":"Forecast \n($0's. real June 2019)"}]
[null,null,{"$f":"CRCP_y4","v":"2017-18"},{"$f":"CRCP_y5","v":"2018-19"},{"$f":"FRCP_y1","v":"2019-20"},{"$f":"FRCP_y2","v":"2020-21"},{"$f":"FRCP_y3","v":"2021-22"},{"$f":"FRCP_y4","v":"2022-23"},{"$f":"FRCP_y5","v":"2023-24"}]
[null,"Replacement expenditure",33913878.033275023,36025307.155942395,21978664.292733025,33310974.795641862,44063553.349712066,32533186.784029607,28921477.686657891]
[null,"Connections",85510.713383989321,90834.487042721827,0,906091.49889023602,1630964.698002425,0,0]
[null,"Augmentation Expenditure",1438301.7786404756,1527848.3725046781,1140318.7376917063,11641068.795633534,3693762.6631859462,467813.47088889271,312522.60161557863]
[null,"Non-network",3655561.6566541772,3212373.2401778819,5871491.9600416664,8137166.4024029318,6071528.2246958138,4620952.1144299926,3923755.141563592]
[null,"Capitalised network overheads",8740910.4483627267,8740910.4483627267,8740910.4483627267,8715953.5262062252,8629845.8150641248,8535840.9515275806,8452915.3549521007]
[null,"Capitalised corporate overheads",1571341.4032202137,1571341.4032202137,1571341.4032202137,1566854.9317807539,1551375.4674327979,1534476.342902045,1519568.922896364]
[null,"TOTAL CAPEX",{"$f":"SUM(C11:C16)","v":49405504.033536606},51168615.107250623,39302726.842049338,64278109.950555541,65641030.218093179,47692269.663778119,43130239.707685523]
[]
[null,"2.1.2 - PRESCRIBED TRANSMISSION SERVICES OPEX"]
[null,null,{"$f":"CONCATENATE(\"Forecast \n($0's. real \",dms_DollarReal,\")\")","v":"Forecast \n($0's. real June 2019)"}]
[null,null,{"$f":"CRCP_y4","v":"2017-18"},{"$f":"CRCP_y5","v":"2018-19"},{"$f":"FRCP_y1","v":"2019-20"},{"$f":"FRCP_y2","v":"2020-21"},{"$f":"FRCP_y3","v":"2021-22"},{"$f":"FRCP_y4","v":"2022-23"},{"$f":"FRCP_y5","v":"2023-24"}]
[null,"Vegetation management"]
[null,"Maintenance"]
[null,"Non-network"]
[null,"Network overheads"]
[null,"Corporate overheads"]
[null,"TOTAL OPEX",{"$f":"SUM(C22:C26)","v":0},0,0,0,0,0,0]
[]
[]
[null,"2.1.8 - PRESCRIBED TRANSMISSION SERVICES CAPITALISED OVERHEADS"]
[null,null,{"$f":"CONCATENATE(\"Forecast \n($0's. real \",dms_DollarReal,\")\")","v":"Forecast \n($0's. real June 2019)"}]
[null,null,{"$f":"CRCP_y4","v":"2017-18"},{"$f":"CRCP_y5","v":"2018-19"},{"$f":"FRCP_y1","v":"2019-20"},{"$f":"FRCP_y2","v":"2020-21"},{"$f":"FRCP_y3","v":"2021-22"},{"$f":"FRCP_y4","v":"2022-23"},{"$f":"FRCP_y5","v":"2023-24"}]
[null,"Replacement expenditure",0,0,9915168.0162665322,8019652.9424294904,9176265.1611485519,9533069.4366394524,9634722.2446224708]
[null,"Connections",0,0,397083.83531640808,2116049.0816770764,761847.80615590152,537247.8577901742,337762.03322599485]
[null,"Augmentation Expenditure",0,0,0,147106.43388041298,243108.31519246913,0,0]
[null,"Non-network",0,0,0,0,0,0,0]
[null,"TOTAL CAPITALISED OVERHEADS",{"$f":"SUM(C33:C36)","v":0},0,10312251.851582941,10282808.457986979,10181221.282496922,10070317.294429626,9972484.2778484654]

{"sheet":"2.2 Repex","index":6,"n_rows":591,"n_cols":10,"rows_kept":591,"cut":false,"hidden":false,"merged":[[5,1,5,2],[10,3,10,9],[205,3,205,9],[400,3,400,9],[9,3,9,9],[204,3,204,9],[399,3,399,9]]}
[null,{"$f":"(LOOKUP(dms_Model,dms_Model_List,dms_Worksheet_List))","v":"REGULATORY REPORTING STATEMENT"}]
[null,{"$f":"INDEX(dms_TradingNameFull_List,MATCH(dms_TradingName,dms_TradingName_List))","v":"TasNetworks (T)"}]
[null,{"$f":"IF(SUM(dms_SingleYear_Model)>0,CRY,CONCATENATE(FRCP_y1,\" to \",dms_MultiYear_FinalYear_Result))","v":"2019-20 to 2023-24"}]
[null,"2.2 REPEX"]
[]
[null,"There is ONE table (with three sub-tables) on this worksheet. See the Instructions sheet on how to group or ungroup tables. "]
[]
[null,"2.2.1 - REPLACEMENT EXPENDITURE, VOLUMES AND ASSET FAILURES BY ASSET CATEGORY"]
[null,"EXPENDITURE"]
[null,null,null,"EXPENDITURE"]
[null,null,null,{"$f":"CONCATENATE(\"($0's. real \",dms_DollarReal,\")\")","v":"($0's. real June 2019)"}]
[null,"ASSET GROUP","ASSET CATEGORY",{"$f":"CRCP_y4","v":"2017-18"},{"$f":"CRCP_y5","v":"2018-19"},{"$f":"FRCP_y1","v":"2019-20"},{"$f":"FRCP_y2","v":"2020-21"},{"$f":"FRCP_y3","v":"2021-22"},{"$f":"FRCP_y4","v":"2022-23"},{"$f":"FRCP_y5","v":"2023-24"}]
[null,"TRANSMISSION TOWERS\nHighest operating voltage; Circuit configuration","< = 33 kV; Single Circuit",0,0,0,0,0,0,0]
[null,null,"> 33 kV & < = 66 kV ; Single Circuit",0,0,0,0,0,0,0]
[null,null,"> 66 kV & < = 132 kV ; Single Circuit",0,2153226.2599946121,2467282.1876718746,0,0,2101758.9006093745,0]
[null,null,"> 132 kV & < = 275 kV ; Single Circuit",0,0,0,0,0,0,0]
[null,null,"> 275 kV & < = 330 kV ; Single Circuit",0,0,0,0,0,0,0]
[null,null,"> 330 kV & < = 500 kV  ; Single Circuit",0,0,0,0,0,0,0]
[null,null,"> 500 kV  ; Single Circuit",0,0,0,0,0,0,0]
[null,null,"< = 33 kV; Multiple Circuit",0,0,0,0,0,0,0]
[null,null,"> 33 kV & < = 66 kV ; Multiple Circuit",0,0,0,0,0,0,0]
[null,null,"> 66 kV & < = 132 kV ; Multiple Circuit",0,0,0,0,0,3364388.6413499992,0]
[null,null,"> 132 kV & < = 275 kV ; Multiple Circuit",0,791620.85678823513,0,0,0,0,0]
[null,null,"> 275 kV & < = 330 kV ; Multiple Circuit",0,0,0,0,0,0,0]
[null,null,"> 330 kV & < = 500 kV  ; Multiple Circuit",0,0,0,0,0,0,0]
[null,null,"> 500 kV  ; Multiple Circuit",0,0,0,0,0,0,0]
[null,null,"Other",0,0,0,0,0,0,0]
[null,"TRANSMISSION TOWER SUPPORT STRUCTURES BY:\nHighest operating voltage; Circuit configuration","< = 33 kV; Single Circuit",0,0,0,0,0,0,0]
[null,null,"> 33 kV & < = 66 kV ; Single Circuit",0,0,0,0,0,0,0]
[null,null,"> 66 kV & < = 132 kV ; Single Circuit",255624.81314388645,170416.54209592432,249215.29420365696,150871.16581170328,3692018.916015855,985995.60135962267,132712.52131146417]
[null,null,"> 132 kV & < = 275 kV ; Single Circuit",2673299.3160027158,2328357.468776559,345067.33043583273,208898.53727774302,874646.85026343702,2095756.3409652228,183755.7987389504]
[null,null,"> 275 kV & < = 330 kV ; Single Circuit",0,0,0,0,0,0,0]
[null,null,"> 330 kV & < = 500 kV  ; Single Circuit",0,0,0,0,0,0,0]
[null,null,"> 500 kV  ; Single Circuit",0,0,0,0,0,0,0]
[null,null,"< = 33 kV; Multiple Circuit",0,0,0,0,0,0,0]
[null,null,"> 33 kV & < = 66 kV ; Multiple Circuit",0,0,0,0,0,0,0]
[null,null,"> 66 kV & < = 132 kV ; Multiple Circuit",4485125.6718659317,456363.99068220094,3961884.1642632643,5346255.1577377943,4718046.9519018093,82510.092163985144,3242949.5592262913]
[null,null,"> 132 kV & < = 275 kV ; Multiple Circuit",101348.17457741743,101348.17457741743,977690.76956819277,143134.18294956465,311172.43711295357,499186.05759211013,1915824.3461116496]
[null,null,"> 275 kV & < = 330 kV ; Multiple Circuit",0,0,0,0,0,0,0]
[null,null,"> 330 kV & < = 500 kV  ; Multiple Circuit",0,0,0,0,0,0,0]
[null,null,"> 500 kV  ; Multiple Circuit",0,0,0,0,0,0,0]
[null,null,"Other",0,0,0,0,0,0,0]
[null,"CONDUCTORS BY: \nVoltage; Maximum continuous rating","< = 33 kV ; < = 100 MVA",0,0,0,0,0,0,0]
[null,null,"< = 33 kV ; > 100 MVA & < = 400 MVA",0,0,0,0,0,0,0]
[null,null,"< = 33 kV ; > 400 MVA",0,0,0,0,0,0,0]
[null,null,"> 33 kV & < = 66 kV  ; < = 100 MVA",0,0,0,0,0,0,0]
[null,null,"> 33 kV & < = 66 kV  ; > 100 MVA & < = 400 MVA",0,0,0,0,0,0,0]
[null,null,"> 33 kV & < = 66 kV  ; > 400 MVA",0,0,0,0,0,0,0]
[null,null,"> 66 kV & < = 132 kV  ; < = 100 MVA",0,0,0,0,0,0,0]
[null,null,"> 66 kV & < = 132 kV  ; > 100 MVA & < = 400 MVA",0,0,0,0,0,748335.48092095263,0]
[null,null,"> 66 kV & < = 132 kV  ; > 400 MVA",0,0,0,0,0,0,0]
[null,null,"> 132 kV & < = 275 kV  ; < = 200 MVA",0,0,0,0,0,0,0]
[null,null,"> 132 kV & < = 275 kV  ; > 200 MVA & < = 600 MVA",0,328432.12637146719,0,0,0,0,0]
[null,null,"> 132 kV & < = 275 kV  ; > 600 MVA",0,0,0,0,0,0,0]
[null,null,"> 275 kV & < = 330 kV  ; < = 800 MVA",0,0,0,0,0,0,0]
[null,null,"> 275 kV & < = 330 kV  ; > 800 MVA & < = 1200 MVA",0,0,0,0,0,0,0]
[null,null,"> 275 kV & < = 330 kV  ; > 1200 MVA",0,0,0,0,0,0,0]
[null,null,"> 330 kV & < = 500 kV   ; < = 1000 MVA",0,0,0,0,0,0,0]
[null,null,"> 330 kV & < = 500 kV   ; > 1000 MVA & < = 1500 MVA",0,0,0,0,0,0,0]
[null,null,"> 330 kV & < = 500 kV   ; > 1500 MVA",0,0,0,0,0,0,0]
[null,null,"> 500 kV   ; < = 2000 MVA",0,0,0,0,0,0,0]
[null,null,"> 500 kV   ; > 2000 MVA & < = 3000 MVA",0,0,0,0,0,0,0]
[null,null,"> 500 kV   ; > 3000 MVA",0,0,0,0,0,0,0]
[null,null,"Other",0,0,0,0,0,0,0]
[null,"TRANSMISSION CABLES BY: \nHighest operating voltage; Insulation type","< = 33 kV; Oil Filled",0,0,0,0,0,0,0]
[null,null,"> 33 kV & < = 66 kV ; Oil Filled",0,0,0,0,0,0,0]
[null,null,"> 66 kV & < = 132 kV ; Oil Filled",0,0,0,0,0,0,0]
[null,null,"> 132 kV & < = 275 kV ; Oil Filled",0,0,0,0,0,0,0]
[null,null,"> 275 kV & < = 330 kV ; Oil Filled",0,0,0,0,0,0,0]
[null,null,"> 330 kV & < = 500 kV  ; Oil Filled",0,0,0,0,0,0,0]
[null,null,"> 500 kV  ; Oil Filled",0,0,0,0,0,0,0]
[null,null,"< = 33 kV; XLPE Insulated",0,0,0,0,0,0,0]
[null,null,"> 33 kV & < = 66 kV ; XLPE Insulated",0,0,0,0,0,0,0]
[null,null,"> 66 kV & < = 132 kV ; XLPE Insulated",0,0,0,0,0,0,0]
[null,null,"> 132 kV & < = 275 kV ; XLPE Insulated",0,0,0,0,0,0,0]
[null,null,"> 275 kV & < = 330 kV ; XLPE Insulated",0,0,0,0,0,0,0]
[null,null,"> 330 kV & < = 500 kV  ; XLPE Insulated",0,0,0,0,0,0,0]
[null,null,"> 500 kV  ; XLPE Insulated",0,0,0,0,0,0,0]
[null,null,"< = 33 kV; Other Insulated",0,0,0,0,0,0,0]
[null,null,"> 33 kV & < = 66 kV ; Other Insulated",0,0,0,0,0,0,0]
[null,null,"> 66 kV & < = 132 kV ; Other Insulated",0,0,0,0,0,0,0]
[null,null,"> 132 kV & < = 275 kV ; Other Insulated",0,0,0,0,0,0,0]
[null,null,"> 275 kV & < = 330 kV ; Other Insulated",0,0,0,0,0,0,0]
[null,null,"> 330 kV & < = 500 kV  ; Other Insulated",0,0,0,0,0,0,0]
[null,null,"> 500 kV  ; Other Insulated",0,0,0,0,0,0,0]
[null,null,"Other",0,0,0,0,0,0,0]
[null,"SUBSTATION SWITCHBAYS BY: \nHighest operating voltage; Switch type","< = 33 kV; Air Insulated circuit Breaker",0,0,0,0,0,6916306.7515910948,1617391.6627077356]
[null,null,"> 33 kV & < = 66 kV ; Air Insulated circuit Breaker",4857850.0393495541,4857850.0393495541,0,0,24289250.196747772,0,0]
[null,null,"> 66 kV & < = 132 kV ; Air Insulated circuit Breaker",2538533.9764593663,2538533.9764593663,3998373.6002922887,8694296.2820045426,0,0,0]
[null,null,"> 132 kV & < = 275 kV ; Air Insulated circuit Breaker",1649646.3801617604,1979575.6561941125,0,9897878.2809705622,0,0,0]
[null,null,"> 275 kV & < = 330 kV ; Air Insulated circuit Breaker",0,0,0,0,0,0,0]
[null,null,"> 330 kV & < = 500 kV  ; Air Insulated circuit Breaker",0,0,0,0,0,0,0]
[null,null,"> 500 kV  ; Air Insulated circuit Breaker",0,0,0,0,0,0,0]
[null,null,"< = 33 kV; Air Insulated Isolators / Earth Switch",0,0,0,0,0,0,0]
[null,null,"> 33 kV & < = 66 kV ; Air Insulated Isolators / Earth Switch",0,0,0,0,0,0,0]
[null,null,"> 66 kV & < = 132 kV ; Air Insulated Isolators / Earth Switch",1952718.4434302817,0,0,0,0,0,0]
[null,null,"> 132 kV & < = 275 kV ; Air Insulated Isolators / Earth Switch",0,0,0,0,0,0,0]
[null,null,"> 275 kV & < = 330 kV ; Air Insulated Isolators / Earth Switch",0,0,0,0,0,0,0]
[null,null,"> 330 kV & < = 500 kV  ; Air Insulated Isolators / Earth Switch",0,0,0,0,0,0,0]
[null,null,"> 500 kV  ; Air Insulated Isolators / Earth Switch",0,0,0,0,0,0,0]
[null,null,"< = 33 kV; VT",0,0,0,0,0,0,0]
[null,null,"> 33 kV & < = 66 kV ; VT",0,0,0,0,0,0,0]
[null,null,"> 66 kV & < = 132 kV ; VT",0,0,0,0,0,0,0]
[null,null,"> 132 kV & < = 275 kV ; VT",0,0,0,0,0,1476765.0682045363,0]
[null,null,"> 275 kV & < = 330 kV ; VT",0,0,0,0,0,0,0]
[null,null,"> 330 kV & < = 500 kV  ; VT",0,0,0,0,0,0,0]
[null,null,"> 500 kV  ; VT",0,0,0,0,0,0,0]
[null,null,"< = 33 kV; CT",0,0,0,0,0,0,0]
[null,null,"> 33 kV & < = 66 kV ; CT",0,0,0,0,0,0,0]
[null,null,"> 66 kV & < = 132 kV ; CT",0,0,0,0,0,0,0]
[null,null,"> 132 kV & < = 275 kV ; CT",0,0,0,0,0,0,2401076.2827826175]
[null,null,"> 275 kV & < = 330 kV ; CT",0,0,0,0,0,0,0]
[null,null,"> 330 kV & < = 500 kV  ; CT",0,0,0,0,0,0,0]
[null,null,"> 500 kV  ; CT",0,0,0,0,0,0,0]
[null,null,"< = 33 kV; GIS Module",0,0,0,0,0,0,0]
[null,null,"> 33 kV & < = 66 kV ; GIS Module",0,0,0,0,0,0,0]
[null,null,"> 66 kV & < = 132 kV ; GIS Module",0,0,0,0,0,0,0]
[null,null,"> 132 kV & < = 275 kV ; GIS Module",0,0,0,0,0,0,0]
[null,null,"> 275 kV & < = 330 kV ; GIS Module",0,0,0,0,0,0,0]
[null,null,"> 330 kV & < = 500 kV  ; GIS Module",0,0,0,0,0,0,0]
[null,null,"> 500 kV  ; GIS Module",0,0,0,0,0,0,0]
[null,null,"Other",0,0,0,0,0,0,0]
[null,"SUBSTATION POWER TRANSFORMERS BY: \nHighest operating voltage;  Ampere rating","< = 33 kV ; < = 10 MVA",0,0,0,0,0,0,0]
[null,null,"< = 33 kV ; > 10 MVA & < =  30 MVA",0,0,0,0,0,0,0]
[null,null,"< = 33 kV ; > 30 MVA",0,0,0,0,0,0,0]
[null,null,"> 33 kV & < = 66 kV  ; < = 10 MVA",0,0,0,0,0,0,0]
[null,null,"> 33 kV & < = 66 kV  ; > 10 MVA & < =  30 MVA",0,0,0,0,0,0,0]
[null,null,"> 33 kV & < = 66 kV  ; > 30 MVA",0,0,0,0,0,0,0]
[null,null,"> 66 kV & < = 132 kV  ; < = 30 MVA",5681950.7103987103,5681950.7103987103,0,0,0,5736378.8830256611,5627522.5377717596]
[null,null,"> 66 kV & < = 132 kV  ; > 30 MVA & < =  60 MVA",0,2234334.874256047,0,0,0,0,4468669.7485120939]
[null,null,"> 66 kV & < = 132 kV  ; > 60 MVA",0,2840975.3551993552,0,0,0,0,0]
[null,null,"> 132 kV & < = 220 kV  ; < = 50 MVA",0,0,0,0,0,0,0]
[null,null,"> 132 kV & < = 220 kV  ; > 50 MVA & < =  100 MVA",0,0,0,0,0,0,0]
[null,null,"> 132 kV & < = 220 kV  ; > 100 MVA",0,0,0,0,0,0,0]
[null,null,"> 220 kV & < = 275 kV  ; < = 50 MVA",0,0,0,0,0,0,0]
[null,null,"> 220 kV & < = 275 kV  ; > 50 MVA & < =  100 MVA",0,0,0,0,0,0,0]
[null,null,"> 220 kV & < = 275 kV  ; > 100 MVA",0,0,0,0,0,0,0]
[null,null,"> 275 kV & < = 330 kV  ; < = 100 MVA",0,0,0,0,0,0,0]
[null,null,"> 275 kV & < = 330 kV  ; > 100 MVA & < =  250 MVA",0,0,0,0,0,0,0]
[null,null,"> 275 kV & < = 330 kV  ; > 250 MVA",0,0,0,0,0,0,0]
[null,null,"> 330 kV & < = 500 kV   ; < = 150 MVA",0,0,0,0,0,0,0]
[null,null,"> 330 kV & < = 500 kV   ; > 150 MVA & < =  300 MVA",0,0,0,0,0,0,0]
[null,null,"> 330 kV & < = 500 kV   ; > 300 MVA",0,0,0,0,0,0,0]
[null,null,"> 500 kV   ; < = 1000 MVA",0,0,0,0,0,0,0]
[null,null,"> 500 kV   ; > 1000 MVA & < =  1500 MVA",0,0,0,0,0,0,0]
[null,null,"> 500 kV   ; > 1500 MVA",0,0,0,0,0,0,0]
[null,null,"Other",0,0,0,0,0,0,0]
[null,"SUBSTATION REACTIVE PLANT BY: \nHighest operating voltage; Function","< = 33 kV;  SVCS",0,0,0,0,0,0,0]
[null,null,"> 33 kV & < = 66 kV ;  SVCS",0,0,0,0,0,0,0]
[null,null,"> 66 kV & < = 132 kV ;  SVCS",0,0,0,0,0,0,0]
[null,null,"> 132 kV & < = 275 kV ;  SVCS",0,0,0,0,0,0,0]
[null,null,"> 275 kV & < = 330 kV ;  SVCS",0,0,0,0,0,0,0]
[null,null,"> 330 kV & < = 500 kV  ;  SVCS",0,0,0,0,0,0,0]
[null,null,"> 500 kV  ;  SVCS",0,0,0,0,0,0,0]
[null,null,"< = 33 kV;  Capacitors",0,0,0,0,0,0,0]
[null,null,"> 33 kV & < = 66 kV ;  Capacitors",0,0,0,0,0,0,0]
[null,null,"> 66 kV & < = 132 kV ;  Capacitors",0,0,0,0,0,0,0]
[null,null,"> 132 kV & < = 275 kV ;  Capacitors",0,0,0,0,0,0,0]
[null,null,"> 275 kV & < = 330 kV ;  Capacitors",0,0,0,0,0,0,0]
[null,null,"> 330 kV & < = 500 kV  ;  Capacitors",0,0,0,0,0,0,0]
[null,null,"> 500 kV  ;  Capacitors",0,0,0,0,0,0,0]
[null,null,"< = 33 kV;  Oil Filled Reactors",0,0,0,0,0,0,0]
[null,null,"> 33 kV & < = 66 kV ;  Oil Filled Reactors",0,0,0,0,0,0,0]
[null,null,"> 66 kV & < = 132 kV ;  Oil Filled Reactors",0,0,0,0,0,0,0]
[null,null,"> 132 kV & < = 275 kV ;  Oil Filled Reactors",0,0,0,0,0,0,0]
[null,null,"> 275 kV & < = 330 kV ;  Oil Filled Reactors",0,0,0,0,0,0,0]
[null,null,"> 330 kV & < = 500 kV  ;  Oil Filled Reactors",0,0,0,0,0,0,0]
[null,null,"> 500 kV  ;  Oil Filled Reactors",0,0,0,0,0,0,0]
[null,null,"Other",0,0,0,0,0,0,0]
[null,"SCADA, NETWORK CONTROL AND PROTECTION SYSTEMS BY:\nFunction","OPGW",5679677.1905371798,5679677.1905371798,5733296.8907571863,5753292.7078554062,5357379.0848755911,5776941.0581886191,5777476.2110091001]
[null,null,"Protection Schemes / systems",9515.9229090197132,190318.45818039426,290581.30073877412,173777.0270900249,282127.11169922899,207957.70625207311,139887.98875716579]
[null,null,"Station SCADA and Control Systems",2982091.6743405391,2982091.6743405391,3596498.615034047,2302059.7491992679,4115168.8031364181,1935711.6019103401,2961019.6024226225]
[null,null,"Telecommunications Network / Systems",465583.30945022707,359152.15218974714,358774.13976790803,640511.70474525099,423742.99795899994,605194.59989601921,453191.42730643821]
[null,null,"Other",780585.19609115273,562502.91798748821,0,0,0,0,0]
[null,null,null,0,0,0,0,0,0,0]
[null,"OTHER BY: \nNSP defined","<NSP to enter description for Asset Category not listed above>"]
[]
[]
[]
[]
[]
[]
[]
[]
[]
[]
[]
[]
[]
[]
[]
[]
[]
[]
[]
[]
[]
[]
[]
[]
[]
[]
[]
[null,"ASSET REPLACEMENTS"]
[null,null,null,"VOLUMES "]
[null,null,null,"(0's)"]
[null,"ASSET GROUP","ASSET CATEGORY",{"$f":"CRCP_y4","v":"2017-18"},{"$f":"CRCP_y5","v":"2018-19"},{"$f":"FRCP_y1","v":"2019-20"},{"$f":"FRCP_y2","v":"2020-21"},{"$f":"FRCP_y3","v":"2021-22"},{"$f":"FRCP_y4","v":"2022-23"},{"$f":"FRCP_y5","v":"2023-24"}]
[null,"TRANSMISSION TOWERS\nHighest operating voltage; Circuit configuration","< = 33 kV; Single Circuit",0,0,0,0,0,0,0]
[null,null,"> 33 kV & < = 66 kV ; Single Circuit",0,0,0,0,0,0,0]
[null,null,"> 66 kV & < = 132 kV ; Single Circuit",0,41,47,0,0,40,0]
[null,null,"> 132 kV & < = 275 kV ; Single Circuit",0,0,0,0,0,0,0]
[null,null,"> 275 kV & < = 330 kV ; Single Circuit",0,0,0,0,0,0,0]
[null,null,"> 330 kV & < = 500 kV  ; Single Circuit",0,0,0,0,0,0,0]
[null,null,"> 500 kV  ; Single Circuit",0,0,0,0,0,0,0]
[null,null,"< = 33 kV; Multiple Circuit",0,0,0,0,0,0,0]
[null,null,"> 33 kV & < = 66 kV ; Multiple Circuit",0,0,0,0,0,0,0]
[null,null,"> 66 kV & < = 132 kV ; Multiple Circuit",0,0,0,0,0,17,0]
[null,null,"> 132 kV & < = 275 kV ; Multiple Circuit",0,4,0,0,0,0,0]
[null,null,"> 275 kV & < = 330 kV ; Multiple Circuit",0,0,0,0,0,0,0]
[null,null,"> 330 kV & < = 500 kV  ; Multiple Circuit",0,0,0,0,0,0,0]
[null,null,"> 500 kV  ; Multiple Circuit",0,0,0,0,0,0,0]
[null,null,"Other",0,0,0,0,0,0,0]
[null,"TRANSMISSION TOWER SUPPORT STRUCTURES BY:\nHighest operating voltage; Circuit configuration","< = 33 kV; Single Circuit",0,0,0,0,0,0,0]
[null,null,"> 33 kV & < = 66 kV ; Single Circuit",0,0,0,0,0,0,0]
[null,null,"> 66 kV & < = 132 kV ; Single Circuit",39,26,39,39,439,239,39]
[null,null,"> 132 kV & < = 275 kV ; Single Circuit",558,486,54,54,104,508,54]
[null,null,"> 275 kV & < = 330 kV ; Single Circuit",0,0,0,0,0,0,0]
[null,null,"> 330 kV & < = 500 kV  ; Single Circuit",0,0,0,0,0,0,0]
[null,null,"> 500 kV  ; Single Circuit",0,0,0,0,0,0,0]
[null,null,"< = 33 kV; Multiple Circuit",0,0,0,0,0,0,0]
[null,null,"> 33 kV & < = 66 kV ; Multiple Circuit",0,0,0,0,0,0,0]
[null,null,"> 66 kV & < = 132 kV ; Multiple Circuit",914,93,620,1382,561,20,953]
[null,null,"> 132 kV & < = 275 kV ; Multiple Circuit",24,24,153,37,37,121,563]
[null,null,"> 275 kV & < = 330 kV ; Multiple Circuit",0,0,0,0,0,0,0]
[null,null,"> 330 kV & < = 500 kV  ; Multiple Circuit",0,0,0,0,0,0,0]
[null,null,"> 500 kV  ; Multiple Circuit",0,0,0,0,0,0,0]
[null,null,"Other",0,0,0,0,0,0,0]
[null,"CONDUCTORS BY: \nVoltage; Maximum continuous rating","< = 33 kV ; < = 100 MVA",0,0,0,0,0,0,0]
[null,null,"< = 33 kV ; > 100 MVA & < = 400 MVA",0,0,0,0,0,0,0]
[null,null,"< = 33 kV ; > 400 MVA",0,0,0,0,0,0,0]
[null,null,"> 33 kV & < = 66 kV  ; < = 100 MVA",0,0,0,0,0,0,0]
[null,null,"> 33 kV & < = 66 kV  ; > 100 MVA & < = 400 MVA",0,0,0,0,0,0,0]
[null,null,"> 33 kV & < = 66 kV  ; > 400 MVA",0,0,0,0,0,0,0]
[null,null,"> 66 kV & < = 132 kV  ; < = 100 MVA",0,0,0,0,0,0,0]
[null,null,"> 66 kV & < = 132 kV  ; > 100 MVA & < = 400 MVA",0,0,0,0,0,6.234,0]
[null,null,"> 66 kV & < = 132 kV  ; > 400 MVA",0,0,0,0,0,0,0]
[null,null,"> 132 kV & < = 275 kV  ; < = 200 MVA",0,0,0,0,0,0,0]
[null,null,"> 132 kV & < = 275 kV  ; > 200 MVA & < = 600 MVA",0,2.7360000000000002,0,0,0,0,0]
[null,null,"> 132 kV & < = 275 kV  ; > 600 MVA",0,0,0,0,0,0,0]
[null,null,"> 275 kV & < = 330 kV  ; < = 800 MVA",0,0,0,0,0,0,0]
[null,null,"> 275 kV & < = 330 kV  ; > 800 MVA & < = 1200 MVA",0,0,0,0,0,0,0]
[null,null,"> 275 kV & < = 330 kV  ; > 1200 MVA",0,0,0,0,0,0,0]
[null,null,"> 330 kV & < = 500 kV   ; < = 1000 MVA",0,0,0,0,0,0,0]
[null,null,"> 330 kV & < = 500 kV   ; > 1000 MVA & < = 1500 MVA",0,0,0,0,0,0,0]
[null,null,"> 330 kV & < = 500 kV   ; > 1500 MVA",0,0,0,0,0,0,0]
[null,null,"> 500 kV   ; < = 2000 MVA",0,0,0,0,0,0,0]
[null,null,"> 500 kV   ; > 2000 MVA & < = 3000 MVA",0,0,0,0,0,0,0]
[null,null,"> 500 kV   ; > 3000 MVA",0,0,0,0,0,0,0]
[null,null,"Other",0,0,0,0,0,0,0]
[null,"TRANSMISSION CABLES BY: \nHighest operating voltage; Insulation type","< = 33 kV; Oil Filled",0,0,0,0,0,0,0]
[null,null,"> 33 kV & < = 66 kV ; Oil Filled",0,0,0,0,0,0,0]
[null,null,"> 66 kV & < = 132 kV ; Oil Filled",0,0,0,0,0,0,0]
[null,null,"> 132 kV & < = 275 kV ; Oil Filled",0,0,0,0,0,0,0]
[null,null,"> 275 kV & < = 330 kV ; Oil Filled",0,0,0,0,0,0,0]
[null,null,"> 330 kV & < = 500 kV  ; Oil Filled",0,0,0,0,0,0,0]
[null,null,"> 500 kV  ; Oil Filled",0,0,0,0,0,0,0]
[null,null,"< = 33 kV; XLPE Insulated",0,0,0,0,0,0,0]
[null,null,"> 33 kV & < = 66 kV ; XLPE Insulated",0,0,0,0,0,0,0]
[null,null,"> 66 kV & < = 132 kV ; XLPE Insulated",0,0,0,0,0,0,0]
[null,null,"> 132 kV & < = 275 kV ; XLPE Insulated",0,0,0,0,0,0,0]
[null,null,"> 275 kV & < = 330 kV ; XLPE Insulated",0,0,0,0,0,0,0]
[null,null,"> 330 kV & < = 500 kV  ; XLPE Insulated",0,0,0,0,0,0,0]
[null,null,"> 500 kV  ; XLPE Insulated",0,0,0,0,0,0,0]
[null,null,"< = 33 kV; Other Insulated",0,0,0,0,0,0,0]
[null,null,"> 33 kV & < = 66 kV ; Other Insulated",0,0,0,0,0,0,0]
[null,null,"> 66 kV & < = 132 kV ; Other Insulated",0,0,0,0,0,0,0]
[null,null,"> 132 kV & < = 275 kV ; Other Insulated",0,0,0,0,0,0,0]
[null,null,"> 275 kV & < = 330 kV ; Other Insulated",0,0,0,0,0,0,0]
[null,null,"> 330 kV & < = 500 kV  ; Other Insulated",0,0,0,0,0,0,0]
[null,null,"> 500 kV  ; Other Insulated",0,0,0,0,0,0,0]
[null,null,"Other",0,0,0,0,0,0,0]
[null,"SUBSTATION SWITCHBAYS BY: \nHighest operating voltage; Switch type","< = 33 kV; Air Insulated circuit Breaker",0,0,0,0,0,24,8]
[null,null,"> 33 kV & < = 66 kV ; Air Insulated circuit Breaker",0,0,0,0,8,0,0]
[null,null,"> 66 kV & < = 132 kV ; Air Insulated circuit Breaker",0,0,0,13,0,0,0]
[null,null,"> 132 kV & < = 275 kV ; Air Insulated circuit Breaker",1,0,0,6,0,0,0]
[null,null,"> 275 kV & < = 330 kV ; Air Insulated circuit Breaker",0,0,0,0,0,0,0]
[null,null,"> 330 kV & < = 500 kV  ; Air Insulated circuit Breaker",0,0,0,0,0,0,0]
[null,null,"> 500 kV  ; Air Insulated circuit Breaker",0,0,0,0,0,0,0]
[null,null,"< = 33 kV; Air Insulated Isolators / Earth Switch",0,0,0,0,0,0,0]
[null,null,"> 33 kV & < = 66 kV ; Air Insulated Isolators / Earth Switch",0,0,0,0,0,0,0]
[null,null,"> 66 kV & < = 132 kV ; Air Insulated Isolators / Earth Switch",2,0,0,0,0,0,0]
[null,null,"> 132 kV & < = 275 kV ; Air Insulated Isolators / Earth Switch",0,0,0,0,0,0,0]
[null,null,"> 275 kV & < = 330 kV ; Air Insulated Isolators / Earth Switch",0,0,0,0,0,0,0]
[null,null,"> 330 kV & < = 500 kV  ; Air Insulated Isolators / Earth Switch",0,0,0,0,0,0,0]
[null,null,"> 500 kV  ; Air Insulated Isolators / Earth Switch",0,0,0,0,0,0,0]
[null,null,"< = 33 kV; VT",0,0,0,0,0,0,0]
[null,null,"> 33 kV & < = 66 kV ; VT",0,0,0,0,0,0,0]
[null,null,"> 66 kV & < = 132 kV ; VT",0,0,0,0,0,0,0]
[null,null,"> 132 kV & < = 275 kV ; VT",0,0,0,0,0,21,0]
[null,null,"> 275 kV & < = 330 kV ; VT",0,0,0,0,0,0,0]
[null,null,"> 330 kV & < = 500 kV  ; VT",0,0,0,0,0,0,0]
[null,null,"> 500 kV  ; VT",0,0,0,0,0,0,0]
[null,null,"< = 33 kV; CT",0,0,0,0,0,0,0]
[null,null,"> 33 kV & < = 66 kV ; CT",0,0,0,0,0,0,0]
[null,null,"> 66 kV & < = 132 kV ; CT",0,0,0,0,0,0,0]
[null,null,"> 132 kV & < = 275 kV ; CT",0,0,0,0,0,0,17]
[null,null,"> 275 kV & < = 330 kV ; CT",0,0,0,0,0,0,0]
[null,null,"> 330 kV & < = 500 kV  ; CT",0,0,0,0,0,0,0]
[null,null,"> 500 kV  ; CT",0,0,0,0,0,0,0]
[null,null,"< = 33 kV; GIS Module",0,0,0,0,0,0,0]
[null,null,"> 33 kV & < = 66 kV ; GIS Module",0,0,0,0,0,0,0]
[null,null,"> 66 kV & < = 132 kV ; GIS Module",0,0,0,0,0,0,0]
[null,null,"> 132 kV & < = 275 kV ; GIS Module",0,0,0,0,0,0,0]
[null,null,"> 275 kV & < = 330 kV ; GIS Module",0,0,0,0,0,0,0]
[null,null,"> 330 kV & < = 500 kV  ; GIS Module",0,0,0,0,0,0,0]
[null,null,"> 500 kV  ; GIS Module",0,0,0,0,0,0,0]
[null,null,"Other",0,0,0,0,0,0,0]
[null,"SUBSTATION POWER TRANSFORMERS BY: \nHighest operating voltage;  Ampere rating","< = 33 kV ; < = 10 MVA",0,0,0,0,0,0,0]
[null,null,"< = 33 kV ; > 10 MVA & < =  30 MVA",0,0,0,0,0,0,0]
[null,null,"< = 33 kV ; > 30 MVA",0,0,0,0,0,0,0]
[null,null,"> 33 kV & < = 66 kV  ; < = 10 MVA",0,0,0,0,0,0,0]
[null,null,"> 33 kV & < = 66 kV  ; > 10 MVA & < =  30 MVA",0,0,0,0,0,0,0]
[null,null,"> 33 kV & < = 66 kV  ; > 30 MVA",0,0,0,0,0,0,0]
[null,null,"> 66 kV & < = 132 kV  ; < = 30 MVA",0,0,0,0,0,4,4]
[null,null,"> 66 kV & < = 132 kV  ; > 30 MVA & < =  60 MVA",0,0,0,0,0,0,4]
[null,null,"> 66 kV & < = 132 kV  ; > 60 MVA",0,2,0,0,0,0,0]
[null,null,"> 132 kV & < = 220 kV  ; < = 50 MVA",0,0,0,0,0,0,0]
[null,null,"> 132 kV & < = 220 kV  ; > 50 MVA & < =  100 MVA",0,0,0,0,0,0,0]
[null,null,"> 132 kV & < = 220 kV  ; > 100 MVA",0,0,0,0,0,0,0]
[null,null,"> 220 kV & < = 275 kV  ; < = 50 MVA",0,0,0,0,0,0,0]
[null,null,"> 220 kV & < = 275 kV  ; > 50 MVA & < =  100 MVA",0,0,0,0,0,0,0]
[null,null,"> 220 kV & < = 275 kV  ; > 100 MVA",0,0,0,0,0,0,0]
[null,null,"> 275 kV & < = 330 kV  ; < = 100 MVA",0,0,0,0,0,0,0]
[null,null,"> 275 kV & < = 330 kV  ; > 100 MVA & < =  250 MVA",0,0,0,0,0,0,0]
[null,null,"> 275 kV & < = 330 kV  ; > 250 MVA",0,0,0,0,0,0,0]
[null,null,"> 330 kV & < = 500 kV   ; < = 150 MVA",0,0,0,0,0,0,0]
[null,null,"> 330 kV & < = 500 kV   ; > 150 MVA & < =  300 MVA",0,0,0,0,0,0,0]
[null,null,"> 330 kV & < = 500 kV   ; > 300 MVA",0,0,0,0,0,0,0]
[null,null,"> 500 kV   ; < = 1000 MVA",0,0,0,0,0,0,0]
[null,null,"> 500 kV   ; > 1000 MVA & < =  1500 MVA",0,0,0,0,0,0,0]
[null,null,"> 500 kV   ; > 1500 MVA",0,0,0,0,0,0,0]
[null,null,"Other",0,0,0,0,0,0,0]
[null,"SUBSTATION REACTIVE PLANT BY: \nHighest operating voltage; Function","< = 33 kV;  SVCS",0,0,0,0,0,0,0]
[null,null,"> 33 kV & < = 66 kV ;  SVCS",0,0,0,0,0,0,0]
[null,null,"> 66 kV & < = 132 kV ;  SVCS",0,0,0,0,0,0,0]
[null,null,"> 132 kV & < = 275 kV ;  SVCS",0,0,0,0,0,0,0]
[null,null,"> 275 kV & < = 330 kV ;  SVCS",0,0,0,0,0,0,0]
[null,null,"> 330 kV & < = 500 kV  ;  SVCS",0,0,0,0,0,0,0]
[null,null,"> 500 kV  ;  SVCS",0,0,0,0,0,0,0]
[null,null,"< = 33 kV;  Capacitors",0,0,0,0,0,0,0]
[null,null,"> 33 kV & < = 66 kV ;  Capacitors",0,0,0,0,0,0,0]
[null,null,"> 66 kV & < = 132 kV ;  Capacitors",0,0,0,0,0,0,0]
[null,null,"> 132 kV & < = 275 kV ;  Capacitors",0,0,0,0,0,0,0]
[null,null,"> 275 kV & < = 330 kV ;  Capacitors",0,0,0,0,0,0,0]
[null,null,"> 330 kV & < = 500 kV  ;  Capacitors",0,0,0,0,0,0,0]
[null,null,"> 500 kV  ;  Capacitors",0,0,0,0,0,0,0]
[null,null,"< = 33 kV;  Oil Filled Reactors",0,0,0,0,0,0,0]
[null,null,"> 33 kV & < = 66 kV ;  Oil Filled Reactors",0,0,0,0,0,0,0]
[null,null,"> 66 kV & < = 132 kV ;  Oil Filled Reactors",0,0,0,0,0,0,0]
[null,null,"> 132 kV & < = 275 kV ;  Oil Filled Reactors",0,0,0,0,0,0,0]
[null,null,"> 275 kV & < = 330 kV ;  Oil Filled Reactors",0,0,0,0,0,0,0]
[null,null,"> 330 kV & < = 500 kV  ;  Oil Filled Reactors",0,0,0,0,0,0,0]
[null,null,"> 500 kV  ;  Oil Filled Reactors",0,0,0,0,0,0,0]
[null,null,"Other",0,0,0,0,0,0,0]
[null,"SCADA, NETWORK CONTROL AND PROTECTION SYSTEMS BY:\nFunction",{"$f":"IF(ISBLANK(C170),\"\",C170)","v":"OPGW"},0,1368,12500,5200,0,3117,0]
[null,null,{"$f":"IF(ISBLANK(C171),\"\",C171)","v":"Protection Schemes / systems"},1,20,23,23,23,23,23]
[null,null,"Station SCADA and Control Systems",17,17,18,19,17,17,17]
[null,null,"Telecommunications Network / Systems",219.6,169.4,83.2,334,354,200.2,199]
[null,null,"Other"]
[null,null,""]
[null,"OTHER BY: \nNSP defined","<NSP to enter description for Asset Category not listed above>"]
[null,null,""]
[null,null,""]
[null,null,""]
[null,null,""]
[null,null,""]
[null,null,""]
[null,null,""]
[null,null,""]
[null,null,""]
[null,null,""]
[null,null,""]
[null,null,""]
[null,null,""]
[null,null,""]
[null,null,""]
[null,null,""]
[null,null,""]
[null,null,""]
[null,null,""]
[null,null,""]
[null,null,""]
[null,null,""]
[null,null,""]
[null,null,""]
[null,null,""]
[]
[]
[null,"ASSET FAILURES"]
[null,null,null,"VOLUMES"]
[null,null,null,"(0's)"]
[null,"ASSET GROUP","ASSET CATEGORY",{"$f":"CRCP_y4","v":"2017-18"},{"$f":"CRCP_y5","v":"2018-19"},{"$f":"FRCP_y1","v":"2019-20"},{"$f":"FRCP_y2","v":"2020-21"},{"$f":"FRCP_y3","v":"2021-22"},{"$f":"FRCP_y4","v":"2022-23"},{"$f":"FRCP_y5","v":"2023-24"}]
[null,"TRANSMISSION TOWERS\nHighest operating voltage; Circuit configuration","< = 33 kV; Single Circuit"]
[null,null,"> 33 kV & < = 66 kV ; Single Circuit"]
[null,null,"> 66 kV & < = 132 kV ; Single Circuit",0,0,0,0,0,0,0]
[null,null,"> 132 kV & < = 275 kV ; Single Circuit",0,0,0,0,0,0,0]
[null,null,"> 275 kV & < = 330 kV ; Single Circuit"]
[null,null,"> 330 kV & < = 500 kV  ; Single Circuit"]
[null,null,"> 500 kV  ; Single Circuit"]
[null,null,"< = 33 kV; Multiple Circuit"]
[null,null,"> 33 kV & < = 66 kV ; Multiple Circuit"]
[null,null,"> 66 kV & < = 132 kV ; Multiple Circuit",0,0,0,0,0,0,0]
[null,null,"> 132 kV & < = 275 kV ; Multiple Circuit",0,0,0,0,0,0,0]
[null,null,"> 275 kV & < = 330 kV ; Multiple Circuit"]
[null,null,"> 330 kV & < = 500 kV  ; Multiple Circuit"]
[null,null,"> 500 kV  ; Multiple Circuit"]
[null,null,"Other"]
[null,"TRANSMISSION TOWER SUPPORT STRUCTURES BY:\nHighest operating voltage; Circuit configuration","< = 33 kV; Single Circuit"]
[null,null,"> 33 kV & < = 66 kV ; Single Circuit"]
[null,null,"> 66 kV & < = 132 kV ; Single Circuit",0,0,0,0,0,0,0]
[null,null,"> 132 kV & < = 275 kV ; Single Circuit",0,0,0,0,0,0,0]
[null,null,"> 275 kV & < = 330 kV ; Single Circuit"]
[null,null,"> 330 kV & < = 500 kV  ; Single Circuit"]
[null,null,"> 500 kV  ; Single Circuit"]
[null,null,"< = 33 kV; Multiple Circuit"]
[null,null,"> 33 kV & < = 66 kV ; Multiple Circuit"]
[null,null,"> 66 kV & < = 132 kV ; Multiple Circuit",0,0,0,0,0,0,0]
[null,null,"> 132 kV & < = 275 kV ; Multiple Circuit",0,0,0,0,0,0,0]
[null,null,"> 275 kV & < = 330 kV ; Multiple Circuit"]
[null,null,"> 330 kV & < = 500 kV  ; Multiple Circuit"]
[null,null,"> 500 kV  ; Multiple Circuit"]
[null,null,"Other"]
[null,"CONDUCTORS BY: \nVoltage; Maximum continuous rating","< = 33 kV ; < = 100 MVA"]
[null,null,"< = 33 kV ; > 100 MVA & < = 400 MVA"]
[null,null,"< = 33 kV ; > 400 MVA"]
[null,null,"> 33 kV & < = 66 kV  ; < = 100 MVA"]
[null,null,"> 33 kV & < = 66 kV  ; > 100 MVA & < = 400 MVA"]
[null,null,"> 33 kV & < = 66 kV  ; > 400 MVA"]
[null,null,"> 66 kV & < = 132 kV  ; < = 100 MVA",0,0,0,0,0,0,0]
[null,null,"> 66 kV & < = 132 kV  ; > 100 MVA & < = 400 MVA",0,0,0,0,0,0,0]
[null,null,"> 66 kV & < = 132 kV  ; > 400 MVA"]
[null,null,"> 132 kV & < = 275 kV  ; < = 200 MVA"]
[null,null,"> 132 kV & < = 275 kV  ; > 200 MVA & < = 600 MVA",0,0,0,0,0,0,0]
[null,null,"> 132 kV & < = 275 kV  ; > 600 MVA"]
[null,null,"> 275 kV & < = 330 kV  ; < = 800 MVA"]
[null,null,"> 275 kV & < = 330 kV  ; > 800 MVA & < = 1200 MVA"]
[null,null,"> 275 kV & < = 330 kV  ; > 1200 MVA"]
[null,null,"> 330 kV & < = 500 kV   ; < = 1000 MVA"]
[null,null,"> 330 kV & < = 500 kV   ; > 1000 MVA & < = 1500 MVA"]
[null,null,"> 330 kV & < = 500 kV   ; > 1500 MVA"]
[null,null,"> 500 kV   ; < = 2000 MVA"]
[null,null,"> 500 kV   ; > 2000 MVA & < = 3000 MVA"]
[null,null,"> 500 kV   ; > 3000 MVA"]
[null,null,"Other"]
[null,"TRANSMISSION CABLES BY: \nHighest operating voltage; Insulation type","< = 33 kV; Oil Filled"]
[null,null,"> 33 kV & < = 66 kV ; Oil Filled"]
[null,null,"> 66 kV & < = 132 kV ; Oil Filled","-","-","-","-","-","-","-"]
[null,null,"> 132 kV & < = 275 kV ; Oil Filled"]
[null,null,"> 275 kV & < = 330 kV ; Oil Filled"]
[null,null,"> 330 kV & < = 500 kV  ; Oil Filled"]
[null,null,"> 500 kV  ; Oil Filled"]
[null,null,"< = 33 kV; XLPE Insulated",2,"-","-","-","-","-","-"]
[null,null,"> 33 kV & < = 66 kV ; XLPE Insulated"]
[null,null,"> 66 kV & < = 132 kV ; XLPE Insulated","-","-","-","-","-","-","-"]
[null,null,"> 132 kV & < = 275 kV ; XLPE Insulated"]
[null,null,"> 275 kV & < = 330 kV ; XLPE Insulated"]
[null,null,"> 330 kV & < = 500 kV  ; XLPE Insulated"]
[null,null,"> 500 kV  ; XLPE Insulated"]
[null,null,"< = 33 kV; Other Insulated"]
[null,null,"> 33 kV & < = 66 kV ; Other Insulated"]
[null,null,"> 66 kV & < = 132 kV ; Other Insulated"]
[null,null,"> 132 kV & < = 275 kV ; Other Insulated"]
[null,null,"> 275 kV & < = 330 kV ; Other Insulated"]
[null,null,"> 330 kV & < = 500 kV  ; Other Insulated"]
[null,null,"> 500 kV  ; Other Insulated"]
[null,null,"Other"]
[null,"SUBSTATION SWITCHBAYS BY: \nHighest operating voltage; Switch type","< = 33 kV; Air Insulated circuit Breaker","-","-","-","-","-","-","-"]
[null,null,"> 33 kV & < = 66 kV ; Air Insulated circuit Breaker"]
[null,null,"> 66 kV & < = 132 kV ; Air Insulated circuit Breaker","-","-","-","-","-","-","-"]
[null,null,"> 132 kV & < = 275 kV ; Air Insulated circuit Breaker","-","-","-","-","-","-","-"]
[null,null,"> 275 kV & < = 330 kV ; Air Insulated circuit Breaker"]
[null,null,"> 330 kV & < = 500 kV  ; Air Insulated circuit Breaker"]
[null,null,"> 500 kV  ; Air Insulated circuit Breaker"]
[null,null,"< = 33 kV; Air Insulated Isolators / Earth Switch"]
[null,null,"> 33 kV & < = 66 kV ; Air Insulated Isolators / Earth Switch"]
[null,null,"> 66 kV & < = 132 kV ; Air Insulated Isolators / Earth Switch","-","-","-","-","-","-","-"]
[null,null,"> 132 kV & < = 275 kV ; Air Insulated Isolators / Earth Switch","-","-","-","-","-","-","-"]
[null,null,"> 275 kV & < = 330 kV ; Air Insulated Isolators / Earth Switch"]
[null,null,"> 330 kV & < = 500 kV  ; Air Insulated Isolators / Earth Switch"]
[null,null,"> 500 kV  ; Air Insulated Isolators / Earth Switch"]
[null,null,"< = 33 kV; VT","-","-","-","-","-","-","-"]
[null,null,"> 33 kV & < = 66 kV ; VT","-","-","-","-","-","-","-"]
[null,null,"> 66 kV & < = 132 kV ; VT","-","-","-","-","-","-","-"]
[null,null,"> 132 kV & < = 275 kV ; VT","-","-","-","-","-","-","-"]
[null,null,"> 275 kV & < = 330 kV ; VT"]
[null,null,"> 330 kV & < = 500 kV  ; VT"]
[null,null,"> 500 kV  ; VT"]
[null,null,"< = 33 kV; CT","-","-","-","-","-","-","-"]
[null,null,"> 33 kV & < = 66 kV ; CT","-","-","-","-","-","-","-"]
[null,null,"> 66 kV & < = 132 kV ; CT","-","-","-","-","-","-","-"]
[null,null,"> 132 kV & < = 275 kV ; CT","-","-","-","-","-","-","-"]
[null,null,"> 275 kV & < = 330 kV ; CT"]
[null,null,"> 330 kV & < = 500 kV  ; CT"]
[null,null,"> 500 kV  ; CT"]
[null,null,"< = 33 kV; GIS Module","-","-","-","-","-","-","-"]
[null,null,"> 33 kV & < = 66 kV ; GIS Module"]
[null,null,"> 66 kV & < = 132 kV ; GIS Module","-","-","-","-","-","-","-"]
[null,null,"> 132 kV & < = 275 kV ; GIS Module"]
[null,null,"> 275 kV & < = 330 kV ; GIS Module"]
[null,null,"> 330 kV & < = 500 kV  ; GIS Module"]
[null,null,"> 500 kV  ; GIS Module"]
[null,null,"Other"]
[null,"SUBSTATION POWER TRANSFORMERS BY: \nHighest operating voltage;  Ampere rating","< = 33 kV ; < = 10 MVA"]
[null,null,"< = 33 kV ; > 10 MVA & < =  30 MVA"]
[null,null,"< = 33 kV ; > 30 MVA"]
[null,null,"> 33 kV & < = 66 kV  ; < = 10 MVA","-","-","-","-","-","-","-"]
[null,null,"> 33 kV & < = 66 kV  ; > 10 MVA & < =  30 MVA"]
[null,null,"> 33 kV & < = 66 kV  ; > 30 MVA"]
[null,null,"> 66 kV & < = 132 kV  ; < = 30 MVA","-","-","-","-","-","-","-"]
[null,null,"> 66 kV & < = 132 kV  ; > 30 MVA & < =  60 MVA","-","-","-","-","-","-","-"]
[null,null,"> 66 kV & < = 132 kV  ; > 60 MVA","-","-","-","-","-","-","-"]
[null,null,"> 132 kV & < = 220 kV  ; < = 50 MVA","-","-","-","-","-","-","-"]
[null,null,"> 132 kV & < = 220 kV  ; > 50 MVA & < =  100 MVA"]
[null,null,"> 132 kV & < = 220 kV  ; > 100 MVA","-","-","-","-","-","-","-"]
[null,null,"> 220 kV & < = 275 kV  ; < = 50 MVA"]
[null,null,"> 220 kV & < = 275 kV  ; > 50 MVA & < =  100 MVA"]
[null,null,"> 220 kV & < = 275 kV  ; > 100 MVA"]
[null,null,"> 275 kV & < = 330 kV  ; < = 100 MVA"]
[null,null,"> 275 kV & < = 330 kV  ; > 100 MVA & < =  250 MVA"]
[null,null,"> 275 kV & < = 330 kV  ; > 250 MVA"]
[null,null,"> 330 kV & < = 500 kV   ; < = 150 MVA"]
[null,null,"> 330 kV & < = 500 kV   ; > 150 MVA & < =  300 MVA"]
[null,null,"> 330 kV & < = 500 kV   ; > 300 MVA"]
[null,null,"> 500 kV   ; < = 1000 MVA"]
[null,null,"> 500 kV   ; > 1000 MVA & < =  1500 MVA"]
[null,null,"> 500 kV   ; > 1500 MVA"]
[null,null,"Other"]
[null,"SUBSTATION REACTIVE PLANT BY: \nHighest operating voltage; Function","< = 33 kV;  SVCS"]
[null,null,"> 33 kV & < = 66 kV ;  SVCS"]
[null,null,"> 66 kV & < = 132 kV ;  SVCS"]
[null,null,"> 132 kV & < = 275 kV ;  SVCS"]
[null,null,"> 275 kV & < = 330 kV ;  SVCS"]
[null,null,"> 330 kV & < = 500 kV  ;  SVCS"]
[null,null,"> 500 kV  ;  SVCS",null,null,null,null,null,null,"-"]
[null,null,"< = 33 kV;  Capacitors","-","-","-","-","-","-","-"]
[null,null,"> 33 kV & < = 66 kV ;  Capacitors"]
[null,null,"> 66 kV & < = 132 kV ;  Capacitors",2,1,1,1,1,1,1]
[null,null,"> 132 kV & < = 275 kV ;  Capacitors","-","-","-","-","-","-","-"]
[null,null,"> 275 kV & < = 330 kV ;  Capacitors"]
[null,null,"> 330 kV & < = 500 kV  ;  Capacitors"]
[null,null,"> 500 kV  ;  Capacitors"]
[null,null,"< = 33 kV;  Oil Filled Reactors"]
[null,null,"> 33 kV & < = 66 kV ;  Oil Filled Reactors"]
[null,null,"> 66 kV & < = 132 kV ;  Oil Filled Reactors"]
[null,null,"> 132 kV & < = 275 kV ;  Oil Filled Reactors"]
[null,null,"> 275 kV & < = 330 kV ;  Oil Filled Reactors"]
[null,null,"> 330 kV & < = 500 kV  ;  Oil Filled Reactors"]
[null,null,"> 500 kV  ;  Oil Filled Reactors"]
[null,null,"Other"]
[null,"SCADA, NETWORK CONTROL AND PROTECTION SYSTEMS BY:\nFunction",{"$f":"IF(ISBLANK(C170),\"\",C170)","v":"OPGW"},0,0,0,0,0,0,0]
[null,null,"Protection Schemes / systems",28,29,30,30,30,30,30]
[null,null,"Station SCADA and Control Systems",4,4,5,5,5,5,5]
[null,null,"Telecommunications Network / Systems",44,44,44,44,44,44,44]
[null,null,"Other",null,"                                    ","                                    "]
[null,null,"","                      "]
[null,"OTHER BY: \nNSP defined","<NSP to enter description for Asset Category not listed above>"]
[null,null,""]
[null,null,""]
[null,null,""]
[null,null,""]
[null,null,""]
[null,null,""]
[null,null,""]
[null,null,""]
[null,null,""]
[null,null,""]
[null,null,""]
[null,null,""]
[null,null,""]
[null,null,""]
[null,null,""]
[null,null,""]
[null,null,""]
[null,null,""]
[null,null,""]
[null,null,""]
[null,null,""]
[null,null,""]
[null,null,""]
[null,null,""]
[null,null,""]

{"sheet":"2.3 Augex (a)","index":7,"n_rows":197,"n_cols":35,"rows_kept":197,"cut":false,"hidden":false,"merged":[[5,1,5,3],[138,22,139,22],[11,18,11,19],[10,23,10,24],[10,18,10,21],[9,11,9,24],[140,2,146,2],[139,32,139,33],[136,32,136,33],[137,33,138,33],[137,32,138,32],[9,32,9,33],[10,1,11,1],[10,2,11,2],[10,3,11,3],[10,4,11,4],[10,5,11,5],[10,6,11,6],[10,7,10,8],[10,9,10,10],[9,1,9,10],[9,25,9,26],[28,29,34,29],[28,30,34,30],[36,10,42,10],[36,24,42,24],[36,25,42,25],[44,29,50,29],[44,30,50,30],[60,1,66,1],[60,2,66,2],[60,3,66,3],[60,4,66,4],[60,5,66,5],[60,6,66,6],[60,7,66,7],[60,8,66,8],[60,9,66,9],[52,26,58,26],[52,27,58,27],[52,28,58,28],[52,29,58,29],[52,30,58,30],[12,1,18,1],[12,2,18,2],[12,3,18,3],[12,4,18,4],[12,5,18,5],[12,6,18,6],[12,7,18,7],[9,31,10,31],[20,3,26,3],[20,4,26,4],[20,5,26,5],[20,6,26,6],[9,27,11,27],[9,28,11,28],[9,29,9,30],[10,11,10,14],[10,15,10,17],[12,32,18,32],[12,8,18,8],[12,9,18,9],[12,10,18,10],[12,24,18,24],[12,25,18,25],[12,26,18,26],[11,25,11,26],[11,29,11,31],[11,32,11,33],[12,27,18,27],[12,28,18,28],[12,29,18,29],[12,30,18,30],[12,31,18,31],[20,32,26,32],[28,1,34,1],[28,2,34,2],[28,3,34,3],[28,4,34,4],[28,5,34,5],[28,6,34,6],[28,7,34,7],[28,8,34,8],[28,9,34,9],[20,26,26,26],[20,27,26,27],[20,28,26,28],[20,29,26,29],[20,30,26,30],[20,31,26,31],[20,7,26,7],[20,8,26,8],[20,9,26,9],[20,10,26,10],[20,24,26,24],[20,25,26,25],[20,1,26,1],[20,2,26,2],[28,31,34,31],[28,32,34,32],[36,1,42,1],[36,2,42,2],[36,3,42,3],[36,4,42,4],[36,5,42,5],[36,6,42,6],[28,10,34,10],[28,24,34,24],[28,25,34,25],[28,26,34,26],[28,27,34,27],[28,28,34,28],[36,32,42,32],[36,26,42,26],[36,27,42,27],[36,28,42,28],[36,29,42,29],[36,30,42,30],[36,31,42,31],[36,7,42,7],[36,8,42,8],[36,9,42,9],[44,31,50,31],[44,32,50,32],[44,26,50,26],[44,27,50,27],[44,28,50,28],[44,8,50,8],[44,9,50,9],[52,1,58,1],[52,2,58,2],[52,3,58,3],[52,4,58,4],[52,5,58,5],[52,6,58,6],[44,10,50,10],[44,24,50,24],[44,25,50,25],[44,1,50,1],[44,2,50,2],[44,3,50,3],[44,4,50,4],[44,5,50,5],[44,6,50,6],[44,7,50,7],[52,32,58,32],[52,31,58,31],[52,7,58,7],[52,8,58,8],[52,9,58,9],[52,10,58,10],[52,24,58,24],[52,25,58,25],[60,29,66,29],[60,30,66,30],[60,31,66,31],[60,32,66,32],[68,1,74,1],[68,2,74,2],[68,3,74,3],[68,4,74,4],[68,5,74,5],[68,6,74,6],[60,10,66,10],[60,24,66,24],[60,25,66,25],[60,26,66,26],[60,27,66,27],[60,28,66,28],[68,32,74,32],[68,26,74,26],[68,27,74,27],[68,28,74,28],[68,29,74,29],[68,30,74,30],[68,31,74,31],[68,7,74,7],[68,8,74,8],[68,9,74,9],[68,10,74,10],[76,1,82,1],[76,2,82,2],[76,3,82,3],[76,4,82,4],[76,5,82,5],[76,6,82,6],[76,7,82,7],[76,8,82,8],[76,9,82,9],[68,24,74,24],[68,25,74,25],[76,29,82,29],[76,30,82,30],[76,31,82,31],[76,32,82,32],[84,1,90,1],[84,2,90,2],[84,3,90,3],[84,4,90,4],[84,5,90,5],[84,6,90,6],[76,10,82,10],[76,24,82,24],[76,25,82,25],[76,26,82,26],[76,27,82,27],[76,28,82,28],[84,32,90,32],[84,26,90,26],[84,27,90,27],[84,28,90,28],[84,29,90,29],[84,30,90,30],[92,1,98,1],[92,2,98,2],[92,3,98,3],[92,4,98,4],[92,5,98,5],[92,6,98,6],[92,7,98,7],[92,8,98,8],[92,9,98,9],[84,31,90,31],[84,7,90,7],[84,8,90,8],[84,9,90,9],[84,10,90,10],[84,24,90,24],[84,25,90,25],[92,29,98,29],[92,30,98,30],[92,31,98,31],[92,32,98,32],[100,1,106,1],[100,2,106,2],[100,3,106,3],[100,4,106,4],[100,5,106,5],[100,6,106,6],[92,10,98,10],[92,24,98,24],[92,25,98,25],[92,26,98,26],[92,27,98,27],[92,28,98,28],[100,32,106,32],[100,26,106,26],[100,27,106,27],[100,28,106,28],[100,29,106,29],[100,30,106,30],[100,31,106,31],[100,7,106,7],[100,8,106,8],[100,9,106,9],[100,10,106,10],[108,1,114,1],[108,2,114,2],[108,3,114,3],[108,4,114,4],[108,5,114,5],[108,6,114,6],[108,7,114,7],[108,8,114,8],[108,9,114,9],[100,24,106,24],[100,25,106,25],[108,29,114,29],[108,30,114,30],[108,31,114,31],[108,32,114,32],[116,1,122,1],[116,2,122,2],[116,3,122,3],[116,4,122,4],[116,5,122,5],[116,6,122,6],[108,10,114,10],[108,24,114,24],[108,25,114,25],[108,26,114,26],[108,27,114,27],[108,28,114,28],[116,32,122,32],[116,26,122,26],[116,27,122,27],[116,28,122,28],[116,29,122,29],[116,30,122,30],[124,1,130,1],[124,2,130,2],[124,3,130,3],[124,4,130,4],[124,5,130,5],[124,6,130,6],[124,7,130,7],[124,8,130,8],[124,9,130,9],[116,31,122,31],[116,7,122,7],[116,8,122,8],[116,9,122,9],[116,10,122,10],[116,24,122,24],[116,25,122,25],[124,29,130,29],[124,30,130,30],[124,31,130,31],[124,32,130,32],[124,10,130,10],[124,24,130,24],[124,25,130,25],[124,26,130,26],[124,27,130,27],[124,28,130,28],[136,25,136,26],[136,27,139,27],[137,25,138,25],[139,7,139,10],[136,31,138,31],[139,29,139,31],[136,11,136,24],[137,11,138,14],[137,23,138,24],[137,15,137,21],[138,15,139,15],[138,16,138,17],[138,18,138,19],[138,20,139,20],[138,21,139,21],[136,1,136,10],[137,1,139,2],[140,1,146,1],[140,3,146,3],[140,25,146,25],[137,6,139,6],[140,4,146,4],[140,5,146,5],[140,7,140,10],[141,7,141,10],[142,7,142,10],[143,7,143,10],[144,7,144,10],[137,3,139,3],[137,4,139,4],[137,5,139,5],[137,7,138,10],[137,26,138,26],[139,25,139,26],[140,27,146,27],[136,29,136,30],[137,29,138,29],[137,30,138,30],[136,28,139,28],[140,26,146,26],[156,25,162,25],[156,26,162,26],[156,27,162,27],[148,27,154,27],[148,1,154,1],[148,3,154,3],[172,1,178,1],[172,3,178,3],[172,25,178,25],[164,25,170,25],[164,26,170,26],[164,1,170,1],[164,3,170,3],[172,26,178,26],[172,27,178,27],[164,27,170,27],[148,2,154,2],[156,2,162,2],[164,2,170,2],[172,2,178,2],[148,25,154,25],[148,26,154,26],[148,4,154,4],[148,5,154,5],[152,7,152,10],[153,7,153,10],[154,7,154,10],[156,4,162,4],[156,5,162,5],[164,4,170,4],[164,5,170,5],[172,4,178,4],[172,5,178,5],[174,7,174,10],[188,1,194,1],[188,3,194,3],[156,1,162,1],[156,3,162,3],[188,25,194,25],[188,26,194,26],[188,27,194,27],[180,27,186,27],[180,1,186,1],[180,3,186,3],[180,25,186,25],[180,26,186,26],[180,2,186,2],[188,2,194,2],[180,4,186,4],[180,5,186,5],[188,4,194,4],[188,5,194,5],[185,7,185,10],[186,7,186,10],[188,7,188,10],[189,7,189,10],[190,7,190,10],[191,7,191,10],[194,7,194,10],[175,7,175,10],[176,7,176,10],[177,7,177,10],[178,7,178,10],[180,7,180,10],[181,7,181,10],[182,7,182,10],[183,7,183,10],[184,7,184,10],[192,7,192,10],[193,7,193,10],[136,34,139,34],[9,34,11,34],[166,7,166,10],[167,7,167,10],[168,7,168,10],[169,7,169,10],[170,7,170,10],[172,7,172,10],[173,7,173,10],[156,7,156,10],[157,7,157,10],[158,7,158,10],[159,7,159,10],[160,7,160,10],[161,7,161,10],[162,7,162,10],[164,7,164,10],[165,7,165,10],[145,7,145,10],[146,7,146,10],[148,7,148,10],[149,7,149,10],[150,7,150,10],[151,7,151,10]]}
[null,{"$f":"(LOOKUP(dms_Model,dms_Model_List,dms_Worksheet_List))","v":"REGULATORY REPORTING STATEMENT"}]
[null,{"$f":"INDEX(dms_TradingNameFull_List,MATCH(dms_TradingName,dms_TradingName_List))","v":"TasNetworks (T)"}]
[null,{"$f":"IF(SUM(dms_SingleYear_Model)>0,CRY,CONCATENATE(FRCP_y1,\" to \",dms_MultiYear_FinalYear_Result))","v":"2019-20 to 2023-24"}]
[null,"2.3 AUGEX PROJECTS"]
[]
[null,"There are TWO tables on this worksheet - each has been 'grouped' for easy navigation. Both ROWS and COLUMNS have been grouped.  See the Instructions sheet on how to group or ungroup tables. "]
[]
[null,"NOTE: TNSP MUST PROVIDE EXPENDITURE INFORMATION ON A PROJECT CLOSE BASIS."]
[null,"2.3.1 - AUGEX ASSET DATA - SUBSTATIONS"]
[null,"SUBSTATION AND PROJECT SUMMARY",null,null,null,null,null,null,null,null,null,"PLANT AND EQUIPMENT EXPENDITURE AND VOLUME",null,null,null,null,null,null,null,null,null,null,null,null,null,"OTHER EXPENDITURE",null,"TOTAL DIRECT EXPENDITURE ($0's)","YEARS INCURRED","RELATED PARTY CONTRACTS",null,"ALL NON RELATED PARTYCONTRACTS","LAND AND EASEMENTS",null,"Comments"]
[null,"SUBSTATION ID","SUBSTATION TYPE\n(drop down)","PROJECT ID","PROJECT TYPE\n(drop down)","PROJECT TRIGGER\n(drop down)","VOLTAGE (KV)","SUBSTATION RATING\nNORMAL CYCLIC\n(MVA)",null,"SUBSTATION RATING\nN-1 EMERGENCY\n(MVA)",null,"TRANSFORMERS",null,null,null,"SWITCHGEAR",null,null,"REACTIVE PLANT",null,null,null,"OTHER PLANT ITEM","INSTALLATION (LABOUR)",null,"CIVIL WORKS","OTHER DIRECT",null,null,"RELATED PARTY MARGINS","TOTAL",null,"LAND PURCHASES","EASEMENTS"]
[null,null,null,null,null,null,null,"PRE","POST","PRE","POST","Units Added","MVA Added","OLTC INCLUDED?","Expenditure ($0's)","Insulation","Units Added","Expenditure\n($0's)","Plant Type",null,"Units Added","Expenditure\n($0's)","Expenditure\n($0's)","Volume","Expenditure\n($0's)","Expenditure ($0's)",null,null,null,"Expenditure ($0's)",null,null,"Expenditure\n($0's)"]
[null,"George Town Substation","Transmission substation","RR 1523 NDXXXX","Voltage upgrade","Net market benefit","220/110",780,780,520,520,1,"-","No",2200000,"Air",10,1046069,"Other","STATCOM",1,4725922,629242,null,5489678,977545,null,15068456,"2020,2021, 2022"]
[]
[]
[]
[]
[]
[]
[null,"Project Totals",null,null,null,null,null,null,null,null,null,{"$f":"SUM(L13:L18)","v":1},{"$f":"SUM(M13:M18)","v":0},null,{"$f":"SUM(O13:O18)","v":2200000},null,{"$f":"SUM(Q13:Q18)","v":10},{"$f":"SUM(R13:R18)","v":1046069},null,{"$f":"SUM(T13:T18)","v":0},1,4725922,629242,0,5489678,977545,{"$f":"O18+R18+U18+V18+SUM(X18:Z18)","v":0},null,{"$f":"SUM(AC13:AC18)","v":0},{"$f":"SUM(AD13:AD18)","v":0},{"$f":"SUM(AE13:AE18)","v":0},{"$f":"SUM(AF13:AF18)","v":0},{"$f":"SUM(AG13:AG18)","v":0},{"$f":"SUM(AH13:AH19)","v":0}]
[null,"George Town Substation","Transmission substation","ND1390","Voltage upgrade","Net market benefit","220/110",780,780,520,520,0,"-","No",0,"Air",6,254819,"Capacitor",null,1,380000,299983,null,1327823,null,null,2262625,"2017, 2018, 2019"]
[]
[]
[]
[]
[]
[]
[null,"Project Totals",null,null,null,null,null,null,null,null,null,{"$f":"SUM(L21:L26)","v":0},{"$f":"SUM(M21:M26)","v":0},null,{"$f":"SUM(O21:O26)","v":0},null,{"$f":"SUM(Q21:Q26)","v":6},{"$f":"SUM(R21:R26)","v":254819},null,{"$f":"SUM(T21:T26)","v":0},1,380000,299983,0,1327823,0,{"$f":"O26+R26+U26+V26+SUM(X26:Z26)","v":0},null,{"$f":"SUM(AC21:AC26)","v":0},{"$f":"SUM(AD21:AD26)","v":0},{"$f":"SUM(AE21:AE26)","v":0},{"$f":"SUM(AF21:AF26)","v":0},{"$f":"SUM(AG21:AG26)","v":0},{"$f":"SUM(AH21:AH27)","v":0}]
[null,"<Enter substation ID>",null,null,null,null,""]
[]
[]
[]
[]
[]
[]
[null,"Project Totals",null,null,null,null,null,null,null,null,null,{"$f":"SUM(L29:L34)","v":0},{"$f":"SUM(M29:M34)","v":0},null,{"$f":"SUM(O29:O34)","v":0},null,{"$f":"SUM(Q29:Q34)","v":0},{"$f":"SUM(R29:R34)","v":0},null,{"$f":"SUM(T29:T34)","v":0},0,0,0,0,0,0,{"$f":"O34+R34+U34+V34+SUM(X34:Z34)","v":0},null,{"$f":"SUM(AC29:AC34)","v":0},{"$f":"SUM(AD29:AD34)","v":0},{"$f":"SUM(AE29:AE34)","v":0},{"$f":"SUM(AF29:AF34)","v":0},{"$f":"SUM(AG29:AG34)","v":0},{"$f":"SUM(AH29:AH35)","v":0}]
[null,"<Enter substation ID>",null,null,null,null,""]
[]
[]
[]
[]
[]
[]
[null,"Project Totals",null,null,null,null,null,null,null,null,null,{"$f":"SUM(L37:L42)","v":0},{"$f":"SUM(M37:M42)","v":0},null,{"$f":"SUM(O37:O42)","v":0},null,{"$f":"SUM(Q37:Q42)","v":0},{"$f":"SUM(R37:R42)","v":0},null,{"$f":"SUM(T37:T42)","v":0},0,0,0,0,0,0,{"$f":"O42+R42+U42+V42+SUM(X42:Z42)","v":0},null,{"$f":"SUM(AC37:AC42)","v":0},{"$f":"SUM(AD37:AD42)","v":0},{"$f":"SUM(AE37:AE42)","v":0},{"$f":"SUM(AF37:AF42)","v":0},{"$f":"SUM(AG37:AG42)","v":0},{"$f":"SUM(AH37:AH43)","v":0}]
[null,"<Enter substation ID>",null,null,null,null,""]
[]
[]
[]
[]
[]
[]
[null,"Project Totals",null,null,null,null,null,null,null,null,null,{"$f":"SUM(L45:L50)","v":0},{"$f":"SUM(M45:M50)","v":0},null,{"$f":"SUM(O45:O50)","v":0},null,{"$f":"SUM(Q45:Q50)","v":0},{"$f":"SUM(R45:R50)","v":0},null,{"$f":"SUM(T45:T50)","v":0},0,0,0,0,0,0,{"$f":"O50+R50+U50+V50+SUM(X50:Z50)","v":0},null,{"$f":"SUM(AC45:AC50)","v":0},{"$f":"SUM(AD45:AD50)","v":0},{"$f":"SUM(AE45:AE50)","v":0},{"$f":"SUM(AF45:AF50)","v":0},{"$f":"SUM(AG45:AG50)","v":0},{"$f":"SUM(AH45:AH51)","v":0}]
[null,"<Enter substation ID>",null,null,null,null,""]
[]
[]
[]
[]
[]
[]
[null,"Project Totals",null,null,null,null,null,null,null,null,null,{"$f":"SUM(L53:L58)","v":0},{"$f":"SUM(M53:M58)","v":0},null,{"$f":"SUM(O53:O58)","v":0},null,{"$f":"SUM(Q53:Q58)","v":0},{"$f":"SUM(R53:R58)","v":0},null,{"$f":"SUM(T53:T58)","v":0},0,0,0,0,0,0,{"$f":"O58+R58+U58+V58+SUM(X58:Z58)","v":0},null,{"$f":"SUM(AC53:AC58)","v":0},{"$f":"SUM(AD53:AD58)","v":0},{"$f":"SUM(AE53:AE58)","v":0},{"$f":"SUM(AF53:AF58)","v":0},{"$f":"SUM(AG53:AG58)","v":0},{"$f":"SUM(AH53:AH59)","v":0}]
[null,"<Enter substation ID>",null,null,null,null,""]
[]
[]
[]
[]
[]
[]
[null,"Project Totals",null,null,null,null,null,null,null,null,null,{"$f":"SUM(L61:L66)","v":0},{"$f":"SUM(M61:M66)","v":0},null,{"$f":"SUM(O61:O66)","v":0},null,{"$f":"SUM(Q61:Q66)","v":0},{"$f":"SUM(R61:R66)","v":0},null,{"$f":"SUM(T61:T66)","v":0},0,0,0,0,0,0,{"$f":"O66+R66+U66+V66+SUM(X66:Z66)","v":0},null,{"$f":"SUM(AC61:AC66)","v":0},{"$f":"SUM(AD61:AD66)","v":0},{"$f":"SUM(AE61:AE66)","v":0},{"$f":"SUM(AF61:AF66)","v":0},{"$f":"SUM(AG61:AG66)","v":0},{"$f":"SUM(AH61:AH67)","v":0}]
[null,"<Enter substation ID>",null,null,null,null,""]
[]
[]
[]
[]
[]
[]
[null,"Project Totals",null,null,null,null,null,null,null,null,null,{"$f":"SUM(L69:L74)","v":0},{"$f":"SUM(M69:M74)","v":0},null,{"$f":"SUM(O69:O74)","v":0},null,{"$f":"SUM(Q69:Q74)","v":0},{"$f":"SUM(R69:R74)","v":0},null,{"$f":"SUM(T69:T74)","v":0},0,0,0,0,0,0,{"$f":"O74+R74+U74+V74+SUM(X74:Z74)","v":0},null,{"$f":"SUM(AC69:AC74)","v":0},{"$f":"SUM(AD69:AD74)","v":0},{"$f":"SUM(AE69:AE74)","v":0},{"$f":"SUM(AF69:AF74)","v":0},{"$f":"SUM(AG69:AG74)","v":0},{"$f":"SUM(AH69:AH75)","v":0}]
[null,"<Enter substation ID>",null,null,null,null,""]
[]
[]
[]
[]
[]
[]
[null,"Project Totals",null,null,null,null,null,null,null,null,null,{"$f":"SUM(L77:L82)","v":0},{"$f":"SUM(M77:M82)","v":0},null,{"$f":"SUM(O77:O82)","v":0},null,{"$f":"SUM(Q77:Q82)","v":0},{"$f":"SUM(R77:R82)","v":0},null,{"$f":"SUM(T77:T82)","v":0},0,0,0,0,0,0,{"$f":"O82+R82+U82+V82+SUM(X82:Z82)","v":0},null,{"$f":"SUM(AC77:AC82)","v":0},{"$f":"SUM(AD77:AD82)","v":0},{"$f":"SUM(AE77:AE82)","v":0},{"$f":"SUM(AF77:AF82)","v":0},{"$f":"SUM(AG77:AG82)","v":0},{"$f":"SUM(AH77:AH83)","v":0}]
[null,"<Enter substation ID>",null,null,null,null,""]
[]
[]
[]
[]
[]
[]
[null,"Project Totals",null,null,null,null,null,null,null,null,null,{"$f":"SUM(L85:L90)","v":0},{"$f":"SUM(M85:M90)","v":0},null,{"$f":"SUM(O85:O90)","v":0},null,{"$f":"SUM(Q85:Q90)","v":0},{"$f":"SUM(R85:R90)","v":0},null,{"$f":"SUM(T85:T90)","v":0},0,0,0,0,0,0,{"$f":"O90+R90+U90+V90+SUM(X90:Z90)","v":0},null,{"$f":"SUM(AC85:AC90)","v":0},{"$f":"SUM(AD85:AD90)","v":0},{"$f":"SUM(AE85:AE90)","v":0},{"$f":"SUM(AF85:AF90)","v":0},{"$f":"SUM(AG85:AG90)","v":0},{"$f":"SUM(AH85:AH91)","v":0}]
[null,"<Enter substation ID>",null,null,null,null,""]
[]
[]
[]
[]
[]
[]
[null,"Project Totals",null,null,null,null,null,null,null,null,null,{"$f":"SUM(L93:L98)","v":0},{"$f":"SUM(M93:M98)","v":0},null,{"$f":"SUM(O93:O98)","v":0},null,{"$f":"SUM(Q93:Q98)","v":0},{"$f":"SUM(R93:R98)","v":0},null,{"$f":"SUM(T93:T98)","v":0},0,0,0,0,0,0,{"$f":"O98+R98+U98+V98+SUM(X98:Z98)","v":0},null,{"$f":"SUM(AC93:AC98)","v":0},{"$f":"SUM(AD93:AD98)","v":0},{"$f":"SUM(AE93:AE98)","v":0},{"$f":"SUM(AF93:AF98)","v":0},{"$f":"SUM(AG93:AG98)","v":0},{"$f":"SUM(AH93:AH99)","v":0}]
[null,"<Enter substation ID>",null,null,null,null,""]
[]
[]
[]
[]
[]
[]
[null,"Project Totals",null,null,null,null,null,null,null,null,null,{"$f":"SUM(L101:L106)","v":0},{"$f":"SUM(M101:M106)","v":0},null,{"$f":"SUM(O101:O106)","v":0},null,{"$f":"SUM(Q101:Q106)","v":0},{"$f":"SUM(R101:R106)","v":0},null,{"$f":"SUM(T101:T106)","v":0},0,0,0,0,0,0,{"$f":"O106+R106+U106+V106+SUM(X106:Z106)","v":0},null,{"$f":"SUM(AC101:AC106)","v":0},{"$f":"SUM(AD101:AD106)","v":0},{"$f":"SUM(AE101:AE106)","v":0},{"$f":"SUM(AF101:AF106)","v":0},{"$f":"SUM(AG101:AG106)","v":0},{"$f":"SUM(AH101:AH107)","v":0}]
[null,"<Enter substation ID>",null,null,null,null,""]
[]
[]
[]
[]
[]
[]
[null,"Project Totals",null,null,null,null,null,null,null,null,null,{"$f":"SUM(L109:L114)","v":0},{"$f":"SUM(M109:M114)","v":0},null,{"$f":"SUM(O109:O114)","v":0},null,{"$f":"SUM(Q109:Q114)","v":0},{"$f":"SUM(R109:R114)","v":0},null,{"$f":"SUM(T109:T114)","v":0},0,0,0,0,0,0,{"$f":"O114+R114+U114+V114+SUM(X114:Z114)","v":0},null,{"$f":"SUM(AC109:AC114)","v":0},{"$f":"SUM(AD109:AD114)","v":0},{"$f":"SUM(AE109:AE114)","v":0},{"$f":"SUM(AF109:AF114)","v":0},{"$f":"SUM(AG109:AG114)","v":0},{"$f":"SUM(AH109:AH115)","v":0}]
[null,"<Enter substation ID>",null,null,null,null,""]
[]
[]
[]
[]
[]
[]
[null,"Project Totals",null,null,null,null,null,null,null,null,null,{"$f":"SUM(L117:L122)","v":0},{"$f":"SUM(M117:M122)","v":0},null,{"$f":"SUM(O117:O122)","v":0},null,{"$f":"SUM(Q117:Q122)","v":0},{"$f":"SUM(R117:R122)","v":0},null,{"$f":"SUM(T117:T122)","v":0},0,0,0,0,0,0,{"$f":"O122+R122+U122+V122+SUM(X122:Z122)","v":0},null,{"$f":"SUM(AC117:AC122)","v":0},{"$f":"SUM(AD117:AD122)","v":0},{"$f":"SUM(AE117:AE122)","v":0},{"$f":"SUM(AF117:AF122)","v":0},{"$f":"SUM(AG117:AG122)","v":0},{"$f":"SUM(AH117:AH123)","v":0}]
[null,"<Enter substation ID>",null,null,null,null,""]
[]
[]
[]
[]
[]
[]
[null,"Project Totals",null,null,null,null,null,null,null,null,null,{"$f":"SUM(L125:L130)","v":0},{"$f":"SUM(M125:M130)","v":0},null,{"$f":"SUM(O125:O130)","v":0},null,{"$f":"SUM(Q125:Q130)","v":0},{"$f":"SUM(R125:R130)","v":0},null,{"$f":"SUM(T125:T130)","v":0},0,0,0,0,0,0,{"$f":"O130+R130+U130+V130+SUM(X130:Z130)","v":0},null,{"$f":"SUM(AC125:AC130)","v":0},{"$f":"SUM(AD125:AD130)","v":0},{"$f":"SUM(AE125:AE130)","v":0},{"$f":"SUM(AF125:AF130)","v":0},{"$f":"SUM(AG125:AG130)","v":0},{"$f":"SUM(AH125:AH131)","v":0}]
[null,null,null,null,null,null,null,null,null,null,"Non material projects"]
[]
[null,"NOTE: TNSP MUST PROVIDE EXPENDITURE INFORMATION ON A PROJECT CLOSE BASIS."]
[null,"2.3.2 - AUGEX ASSET DATA - LINES"]
[null,"LINE AND PROJECT SUMMARY",null,null,null,null,null,null,null,null,null,"PLANT AND EQUIPMENT EXPENDITURE AND VOLUME",null,null,null,null,null,null,null,null,null,null,null,null,null,"OTHER EXPENDITURE",null,"TOTAL DIRECT EXPENDITURE ($0's)","YEARS INCURRED","ALL RELATED PARTY CONTRACTS",null,"ALL NON RELATED PARTYCONTRACTS","LAND AND EASEMENTS",null,"Comments"]
[null,"LINE ID",null,"PROJECT ID","PROJECT TYPE\n(drop down)","PROJECT TRIGGER\n(drop down)","VOLTAGE (KV)\n(drop down)","ROUTE LINE LENGTH ADDED",null,null,null,"TOWERS/POLES (INCLUDING STRUCTURES, AND CIVIL WORKS)",null,null,null,"LINES AND CABLES",null,null,null,null,null,null,"OTHER PLANT ITEM","INSTALLATION (LABOUR)",null,"CIVIL WORKS","OTHER DIRECT",null,null,"RELATED PARTY MARGINS","TOTAL",null,"LAND PURCHASES","EASEMENTS"]
[null,null,null,null,null,null,null,null,null,null,null,null,null,null,null,"Type","Rating (MVA)",null,"N-1 Emergency Rating (MVA)",null,"Circuit KM Added","Expenditure\n($0's)","Expenditure\n($0's)"]
[null,null,null,null,null,null,null,"KM ADDED",null,null,null,"Configuration","Towers/Poles Added","Towers/Poles Upgraded","Expenditure\n($0's)",null,"PRE","POST","PRE","POST",null,null,null,"Volume","Expenditure\n($0's)","Expenditure ($0's)",null,null,null,"Expenditure ($0's)",null,null,"Expenditure\n($0's)"]
[null,"<Enter line ID>"]
[]
[]
[]
[]
[]
[]
[null,"Project Totals",null,null,null,null,null,null,null,null,null,null,{"$f":"SUM(M141:M147)","v":0},{"$f":"SUM(N141:N147)","v":0},{"$f":"SUM(O141:O147)","v":0},null,null,null,null,null,{"$f":"SUM(U141:U147)","v":0},{"$f":"SUM(V141:V147)","v":0},{"$f":"SUM(W141:W146)","v":0},{"$f":"SUM(X141:X146)","v":0},{"$f":"SUM(Y141:Y147)","v":0},{"$f":"SUM(Z141:Z147)","v":0},{"$f":"SUM(AA141:AA147)","v":0},{"$f":"K92+R92+S92+SUM(U92:W92)","v":0},null,{"$f":"SUM(AD141:AD147)","v":0},{"$f":"SUM(AE141:AE147)","v":0},{"$f":"SUM(AF141:AF147)","v":0},{"$f":"SUM(AG141:AG147)","v":0},{"$f":"SUM(AH141:AH147)","v":0}]
[null,"<Enter line ID>"]
[]
[]
[]
[]
[]
[]
[null,"Project Totals",null,null,null,null,null,null,null,null,null,null,{"$f":"SUM(M149:M155)","v":0},{"$f":"SUM(N149:N155)","v":0},{"$f":"SUM(O149:O155)","v":0},null,null,null,null,null,{"$f":"SUM(U149:U155)","v":0},{"$f":"SUM(V149:V155)","v":0},{"$f":"SUM(W149:W154)","v":0},{"$f":"SUM(X149:X154)","v":0},{"$f":"SUM(Y149:Y155)","v":0},{"$f":"SUM(Z149:Z155)","v":0},{"$f":"SUM(AA149:AA155)","v":0},{"$f":"K84+R84+S84+SUM(U84:W84)","v":0},null,{"$f":"SUM(AD149:AD155)","v":0},{"$f":"SUM(AE149:AE155)","v":0},{"$f":"SUM(AF149:AF155)","v":0},{"$f":"SUM(AG149:AG155)","v":0},{"$f":"SUM(AH149:AH155)","v":0}]
[null,"<Enter line ID>"]
[]
[]
[]
[]
[]
[]
[null,"Project Totals",null,null,null,null,null,null,null,null,null,null,{"$f":"SUM(M157:M163)","v":0},{"$f":"SUM(N157:N163)","v":0},{"$f":"SUM(O157:O163)","v":0},null,null,null,null,null,{"$f":"SUM(U157:U163)","v":0},{"$f":"SUM(V157:V163)","v":0},{"$f":"SUM(W157:W162)","v":0},{"$f":"SUM(X157:X162)","v":0},{"$f":"SUM(Y157:Y163)","v":0},{"$f":"SUM(Z157:Z163)","v":0},{"$f":"SUM(AA157:AA163)","v":0},{"$f":"K92+R92+S92+SUM(U92:W92)","v":0},null,{"$f":"SUM(AD157:AD163)","v":0},{"$f":"SUM(AE157:AE163)","v":0},{"$f":"SUM(AF157:AF163)","v":0},{"$f":"SUM(AG157:AG163)","v":0},{"$f":"SUM(AH157:AH163)","v":0}]
[null,"<Enter line ID>"]
[]
[]
[]
[]
[]
[]
[null,"Project Totals",null,null,null,null,null,null,null,null,null,null,{"$f":"SUM(M165:M171)","v":0},{"$f":"SUM(N165:N171)","v":0},{"$f":"SUM(O165:O171)","v":0},null,null,null,null,null,{"$f":"SUM(U165:U171)","v":0},{"$f":"SUM(V165:V171)","v":0},{"$f":"SUM(W165:W170)","v":0},{"$f":"SUM(X165:X170)","v":0},{"$f":"SUM(Y165:Y171)","v":0},{"$f":"SUM(Z165:Z171)","v":0},{"$f":"SUM(AA165:AA171)","v":0},{"$f":"K100+R100+S100+SUM(U100:W100)","v":0},null,{"$f":"SUM(AD165:AD171)","v":0},{"$f":"SUM(AE165:AE171)","v":0},{"$f":"SUM(AF165:AF171)","v":0},{"$f":"SUM(AG165:AG171)","v":0},{"$f":"SUM(AH165:AH171)","v":0}]
[null,"<Enter line ID>"]
[]
[]
[]
[]
[]
[]
[null,"Project Totals",null,null,null,null,null,null,null,null,null,null,{"$f":"SUM(M173:M179)","v":0},{"$f":"SUM(N173:N179)","v":0},{"$f":"SUM(O173:O179)","v":0},null,null,null,null,null,{"$f":"SUM(U173:U179)","v":0},{"$f":"SUM(V173:V179)","v":0},{"$f":"SUM(W173:W178)","v":0},{"$f":"SUM(X173:X178)","v":0},{"$f":"SUM(Y173:Y179)","v":0},{"$f":"SUM(Z173:Z179)","v":0},{"$f":"SUM(AA173:AA179)","v":0},{"$f":"K108+R108+S108+SUM(U108:W108)","v":0},null,{"$f":"SUM(AD173:AD179)","v":0},{"$f":"SUM(AE173:AE179)","v":0},{"$f":"SUM(AF173:AF179)","v":0},{"$f":"SUM(AG173:AG179)","v":0},{"$f":"SUM(AH173:AH179)","v":0}]
[null,"<Enter line ID>"]
[]
[]
[]
[]
[]
[]
[null,"Project Totals",null,null,null,null,null,null,null,null,null,null,{"$f":"SUM(M181:M187)","v":0},{"$f":"SUM(N181:N187)","v":0},{"$f":"SUM(O181:O187)","v":0},null,null,null,null,null,{"$f":"SUM(U181:U187)","v":0},{"$f":"SUM(V181:V187)","v":0},{"$f":"SUM(W181:W186)","v":0},{"$f":"SUM(X181:X186)","v":0},{"$f":"SUM(Y181:Y187)","v":0},{"$f":"SUM(Z181:Z187)","v":0},{"$f":"SUM(AA181:AA187)","v":0},{"$f":"K116+R116+S116+SUM(U116:W116)","v":0},null,{"$f":"SUM(AD181:AD187)","v":0},{"$f":"SUM(AE181:AE187)","v":0},{"$f":"SUM(AF181:AF187)","v":0},{"$f":"SUM(AG181:AG187)","v":0},{"$f":"SUM(AH181:AH187)","v":0}]
[null,"<Enter line ID>"]
[]
[]
[]
[]
[]
[]
[null,"Project Totals",null,null,null,null,null,null,null,null,null,null,{"$f":"SUM(M189:M195)","v":0},{"$f":"SUM(N189:N195)","v":0},{"$f":"SUM(O189:O195)","v":0},null,null,null,null,null,{"$f":"SUM(U189:U195)","v":0},{"$f":"SUM(V189:V195)","v":0},{"$f":"SUM(W189:W194)","v":0},{"$f":"SUM(X189:X194)","v":0},{"$f":"SUM(Y189:Y195)","v":0},{"$f":"SUM(Z189:Z195)","v":0},{"$f":"SUM(AA189:AA195)","v":0},{"$f":"K124+R124+S124+SUM(U124:W124)","v":0},null,{"$f":"SUM(AD189:AD195)","v":0},{"$f":"SUM(AE189:AE195)","v":0},{"$f":"SUM(AF189:AF195)","v":0},{"$f":"SUM(AG189:AG195)","v":0},{"$f":"SUM(AH189:AH195)","v":0}]
[null,null,null,null,null,null,null,null,null,null,"Non material projects"]

{"sheet":"2.3 Augex (b)","index":8,"n_rows":31,"n_cols":9,"rows_kept":31,"cut":false,"hidden":false,"merged":[[8,2,8,8],[17,2,17,8],[25,2,25,8],[5,1,5,3]]}
[null,{"$f":"(LOOKUP(dms_Model,dms_Model_List,dms_Worksheet_List))","v":"REGULATORY REPORTING STATEMENT"}]
[null,{"$f":"INDEX(dms_TradingNameFull_List,MATCH(dms_TradingName,dms_TradingName_List))","v":"TasNetworks (T)"}]
[null,{"$f":"IF(SUM(dms_SingleYear_Model)>0,CRY,CONCATENATE(FRCP_y1,\" to \",dms_MultiYear_FinalYear_Result))","v":"2019-20 to 2023-24"}]
[null,"2.3 AUGEX PROJECTS"]
[]
[null,"There are THREE tables on this worksheet - each has been 'grouped' for easy navigation. See the Instructions sheet on how to group or ungroup tables. "]
[]
[null,"2.3.4 - AUGEX - TOTAL EXPENDITURE"]
[null,null,{"$f":"CONCATENATE(\"EXPENDITURE\nForecast ($0's. real \",dms_DollarReal,\")\")","v":"EXPENDITURE\nForecast ($0's. real June 2019)"}]
[null,"As incurred",{"$f":"CRCP_y4","v":"2017-18"},{"$f":"CRCP_y5","v":"2018-19"},{"$f":"FRCP_y1","v":"2019-20"},{"$f":"FRCP_y2","v":"2020-21"},{"$f":"FRCP_y3","v":"2021-22"},{"$f":"FRCP_y4","v":"2022-23"},{"$f":"FRCP_y5","v":"2023-24"}]
[null,"Substations",1311712.2535296152,1393377.5661766871,1101574.31361533,11330478.654329108,3304722.9408459896,0,0]
[null,"Lines",0,0,0,0,0,0,0]
[null,"Other assets",126589.5251108605,134470.80632799095,38744.42407637625,310590.14130442642,389039.72233995656,467813.47088889271,312522.60161557863]
[null,"Total ",{"$f":"SUM(C11:C13)","v":1438301.7786404758},{"$f":"SUM(D11:D13)","v":1527848.3725046781},1140318.7376917063,11641068.795633534,3693762.6631859462,467813.47088889271,312522.60161557863]
[]
[]
[null,"2.3.5 - AUGEX - BY DRIVER"]
[null,null,{"$f":"CONCATENATE(\"EXPENDITURE\nForecast ($0's. real \",dms_DollarReal,\")\")","v":"EXPENDITURE\nForecast ($0's. real June 2019)"}]
[null,"As incurred",{"$f":"CRCP_y4","v":"2017-18"},{"$f":"CRCP_y5","v":"2018-19"},{"$f":"FRCP_y1","v":"2019-20"},{"$f":"FRCP_y2","v":"2020-21"},{"$f":"FRCP_y3","v":"2021-22"},{"$f":"FRCP_y4","v":"2022-23"},{"$f":"FRCP_y5","v":"2023-24"}]
[null,"\"Greenfield\" driven augex (network expansion capex)",0,0,0,0,0,0,0]
[null,"Reinforcement driven augex (augmentation of the existing network)",1438301.7786404758,1527848.3725046781,1140318.7376917063,11641068.795633534,3693762.6631859462,467813.47088889271,312522.60161557863]
[null,"Total ",{"$f":"SUM(C20:C21)","v":1438301.7786404758},1527848.3725046781,1140318.7376917063,11641068.795633534,3693762.6631859462,467813.47088889271,312522.60161557863]
[]
[]
[null,"2.3.6 - AUGEX - GREENFIELDS DRIVEN"]
[null,null,{"$f":"CONCATENATE(\"EXPENDITURE\nForecast ($0's. real \",dms_DollarReal,\")\")","v":"EXPENDITURE\nForecast ($0's. real June 2019)"}]
[null,"As incurred",{"$f":"CRCP_y4","v":"2017-18"},{"$f":"CRCP_y5","v":"2018-19"},{"$f":"FRCP_y1","v":"2019-20"},{"$f":"FRCP_y2","v":"2020-21"},{"$f":"FRCP_y3","v":"2021-22"},{"$f":"FRCP_y4","v":"2022-23"},{"$f":"FRCP_y5","v":"2023-24"}]
[null,"Substations",0,0,0,0,0,0,0]
[null,"Lines",0,0,0,0,0,0,0]
[null,"Other assets",0,0,0,0,0,0,0]
[null,"Total ",{"$f":"SUM(C28:C30)","v":0},{"$f":"SUM(D28:D30)","v":0},{"$f":"SUM(E28:E30)","v":0},0,0,0,0]

{"sheet":"2.5 Connections","index":9,"n_rows":92,"n_cols":9,"rows_kept":92,"cut":false,"hidden":false,"merged":[[8,2,8,8]]}
[null,{"$f":"(LOOKUP(dms_Model,dms_Model_List,dms_Worksheet_List))","v":"REGULATORY REPORTING STATEMENT"}]
[null,{"$f":"INDEX(dms_TradingNameFull_List,MATCH(dms_TradingName,dms_TradingName_List))","v":"TasNetworks (T)"}]
[null,{"$f":"IF(SUM(dms_SingleYear_Model)>0,CRY,CONCATENATE(FRCP_y1,\" to \",dms_MultiYear_FinalYear_Result))","v":"2019-20 to 2023-24"}]
[null,"2.5 CONNECTIONS EXPENDITURE"]
[]
[null,"There are TWO tables on this worksheet. Each has been grouped (or sub-grouped).  See the Instructions sheet on how to group or ungroup data."]
[]
[null,"2.5.1 - EXPENDITURE ON CONNECTION PROJECTS"]
[null,null,{"$f":"CONCATENATE(\"EXPENDITURE\nForecast \n($0's. real \",dms_DollarReal,\")\")","v":"EXPENDITURE\nForecast \n($0's. real June 2019)"}]
[null,null,{"$f":"CRCP_y4","v":"2017-18"},{"$f":"CRCP_y5","v":"2018-19"},{"$f":"FRCP_y1","v":"2019-20"},{"$f":"FRCP_y2","v":"2020-21"},{"$f":"FRCP_y3","v":"2021-22"},{"$f":"FRCP_y4","v":"2022-23"},{"$f":"FRCP_y5","v":"2023-24"}]
[null,"DIRECT MATERIALS EXPENDITURE"]
[null,"Sheffield Substation ",0,0,0,906091.49889023602,1630964.698002425,0,0]
[]
[]
[]
[]
[]
[]
[]
[]
[]
[]
[]
[]
[]
[]
[]
[]
[]
[]
[]
[]
[]
[]
[]
[]
[null,"DIRECT LABOUR EXPENDITURE"]
[null,{"$f":"IF(ISBLANK(B12),\"\",B12)","v":"Sheffield Substation "}]
[null,{"$f":"IF(ISBLANK(B13),\"\",B13)","v":""}]
[null,""]
[null,""]
[null,""]
[null,""]
[null,""]
[null,""]
[null,""]
[null,""]
[null,""]
[null,""]
[null,""]
[null,""]
[null,""]
[null,""]
[null,""]
[null,""]
[null,""]
[null,""]
[null,""]
[null,""]
[null,""]
[null,""]
[null,""]
[]
[]
[]
[null,"2.5.2 - DESCRIPTION OF CONNECTION PROJECTS"]
[null,null,"CONNECTION RATING \n(MVA)","CONNECTION \nVOLTAGE \n(KV)","UNDERGROUND / OVERHEAD\n(drop down)","YEAR CONNECTION PROJECT COMPLETED "]
[null,{"$f":"IF(ISBLANK(B12),\"\",B12)","v":"Sheffield Substation "},30,22,"Overhead",2022]
[null,{"$f":"IF(ISBLANK(B13),\"\",B13)","v":""}]
[null,{"$f":"IF(ISBLANK(B14),\"\",B14)","v":""}]
[null,""]
[null,""]
[null,""]
[null,""]
[null,""]
[null,""]
[null,""]
[null,""]
[null,""]
[null,""]
[null,""]
[null,""]
[null,""]
[null,""]
[null,""]
[null,""]
[null,""]
[null,""]
[null,""]
[null,""]
[null,""]
[null,""]

{"sheet":"2.6 Non-network","index":10,"n_rows":119,"n_cols":11,"rows_kept":119,"cut":false,"hidden":false,"merged":[[94,4,94,10],[5,1,5,2],[39,1,49,1],[19,1,29,1],[63,4,63,10],[55,4,55,10],[8,4,8,10],[59,1,59,3],[58,1,58,3],[57,1,57,3],[97,1,97,3],[98,1,98,3],[99,1,99,3],[100,1,100,3],[108,1,108,3],[107,1,107,3],[101,1,101,3],[102,1,102,3],[104,1,104,3],[105,1,105,3],[106,1,106,3],[109,1,109,3],[111,1,111,3],[112,1,112,3],[113,1,113,3],[120,1,120,3],[121,1,121,3],[122,1,122,3],[123,1,123,3],[114,1,114,3],[115,1,115,3],[116,1,116,3],[118,1,118,3],[119,1,119,3]]}
[null,{"$f":"(LOOKUP(dms_Model,dms_Model_List,dms_Worksheet_List))","v":"REGULATORY REPORTING STATEMENT"}]
[null,{"$f":"INDEX(dms_TradingNameFull_List,MATCH(dms_TradingName,dms_TradingName_List))","v":"TasNetworks (T)"}]
[null,{"$f":"IF(SUM(dms_SingleYear_Model)>0,CRY,CONCATENATE(FRCP_y1,\" to \",dms_MultiYear_FinalYear_Result))","v":"2019-20 to 2023-24"}]
[null,"2.6 NON NETWORK EXPENDITURE"]
[]
[null,"There are THREE tables on this worksheet - each has been 'grouped' for easy navigation. See the Instructions sheet on how to group or ungroup tables. "]
[]
[null,"2.6.1 - NON-NETWORK EXPENDITURE"]
[null,null,null,null,{"$f":"CONCATENATE(\"EXPENDITURE\nForecast \n($0's. real \",dms_DollarReal,\")\")","v":"EXPENDITURE\nForecast \n($0's. real June 2019)"}]
[null,"SERVICE SUBCATEGORY","ASSET CATEGORY",null,{"$f":"CRCP_y4","v":"2017-18"},{"$f":"CRCP_y5","v":"2018-19"},{"$f":"FRCP_y1","v":"2019-20"},{"$f":"FRCP_y2","v":"2020-21"},{"$f":"FRCP_y3","v":"2021-22"},{"$f":"FRCP_y4","v":"2022-23"},{"$f":"FRCP_y5","v":"2023-24"}]
[null,"OPEX"]
[null,"IT & COMMUNICATIONS","Total IT and communications",null,10306254.661505744,10306254.661505744,10306254.661505744,10306254.661505744,10306254.661505744,10306254.661505744,10306254.661505744]
[null,"MOTOR VEHICLES","Car",null,280212.91679002921,280212.91679002921,280212.91679002921,280212.91679002921,280212.91679002921,280212.91679002921,280212.91679002921]
[null,null,"Light commercial vehicle",null,1027447.3615634404,1027447.3615634404,1027447.3615634404,1027447.3615634404,1027447.3615634404,1027447.3615634404,1027447.3615634404]
[null,null,"Elevated work platform (LCV)  ",null,0,0,0,0,0,0,0]
[null,null,"Elevated work platform (HCV)",null,0,0,0,0,0,0,0]
[null,null,"Heavy commercial vehicle",null,93404.305596676393,93404.305596676393,93404.305596676393,93404.305596676393,93404.305596676393,93404.305596676393,93404.305596676393]
[null,"BUILDINGS AND PROPERTY","Total buildings and property expenditure",null,1997007.8115061468,1997007.8115061468,1997007.8115061468,1997007.8115061468,1997007.8115061468,1997007.8115061468,1997007.8115061468]
[null,"OTHER","Other expenditure"]
[null,"OTHER - TNSP nominated"]
[]
[]
[]
[]
[]
[]
[]
[]
[]
[]
[null,"CAPEX"]
[null,"IT & COMMUNICATIONS","Total IT and communications",null,2468615.7811720273,2028275.158834405,3870779.5979134273,5341314.96364656,3804655.9621583354,3188810.0292729298,2501877.3743911064]
[null,"MOTOR VEHICLES","Car",null,159556.93132356449,158028.0882435955,241064.33860480771,436281.64639749395,509722.47281257407,317820.89206238277,378028.28907145187]
[null,null,"Light commercial vehicle",null,445079.86123786098,440815.19369730045,332665.79483421484,602063.25626758474,703410.68506627565,438588.88579193258,521674.34628285916]
[null,null,"Elevated work platform (LCV)  ",null,0,0,0,0,0,0,0]
[null,null,"Elevated work platform (HCV)",null,442290.03515005985,456102.07329203136,147538.94409134556,267018.06583446392,311966.15747335152,194516.36478643501,231365.18212962928]
[null,null,"Heavy commercial vehicle",null,71146.507131685925,65013.301768739359,84792.861224718697,153459.31842088196,179291.66607746045,111791.49496326398,132969.06726134144]
[null,"BUILDINGS AND PROPERTY","Total buildings and property expenditure",null,68872.540638978695,64139.42434181038,1194650.4233731525,1337029.1518359475,562481.28110781708,369424.44755304873,157840.88242720332]
[null,"OTHER","Other expenditure"]
[null,"OTHER - TNSP nominated"]
[]
[]
[]
[]
[]
[]
[]
[]
[]
[]
[]
[]
[]
[null,"2.6.3 - ANNUAL DESCRIPTOR METRICS"]
[null,"IT & COMMUNICATIONS"]
[null,null,null,null,"VOLUMES  (0's)"]
[null,null,null,null,{"$f":"CRCP_y4","v":"2017-18"},{"$f":"CRCP_y5","v":"2018-19"},{"$f":"FRCP_y1","v":"2019-20"},{"$f":"FRCP_y2","v":"2020-21"},{"$f":"FRCP_y3","v":"2021-22"},{"$f":"FRCP_y4","v":"2022-23"},{"$f":"FRCP_y5","v":"2023-24"}]
[null,"Employee numbers",null,null,204,204,204,204,204,204,204]
[null,"User numbers",null,null,164,164,164,164,164,164,164]
[null,"Number of devices",null,null,342,342,342,342,342,342,342]
[]
[]
[null,"MOTOR VEHICLES"]
[null,null,null,null,"VOLUMES  (0's or %)"]
[null,null,null,"Units",{"$f":"CRCP_y4","v":"2017-18"},{"$f":"CRCP_y5","v":"2018-19"},{"$f":"FRCP_y1","v":"2019-20"},{"$f":"FRCP_y2","v":"2020-21"},{"$f":"FRCP_y3","v":"2021-22"},{"$f":"FRCP_y4","v":"2022-23"},{"$f":"FRCP_y5","v":"2023-24"}]
[null,"CAR","Average kilometres travelled ","0's",971829,971829,971829,971829,971829,971829,971829]
[null,null,"Number purchased","0's",5,2,7,13,8,3,5]
[null,null,"Number leased","0's"]
[null,null,"Number in fleet","0's",40,40,40,40,40,40,40]
[null,null,"Proportion of total fleet expenditure allocated as regulatory expenditure","%",0.24399999999999999,0.24399999999999999,0.24399999999999999,0.24399999999999999,0.24399999999999999,0.24399999999999999,0.24399999999999999]
[null,"LIGHT COMMERCIAL VEHICLE","Average kilometres travelled ","0's",1493298,1493298,1493298,1493298,1493298,1493298,1493298]
[null,null,"Number purchased","0's",10,2,11,15,11,12,10]
[null,null,"Number leased","0's"]
[null,null,"Number in fleet","0's",61,61,61,61,61,61,61]
[null,null,"Proportion of total fleet expenditure allocated as regulatory expenditure","%",0.24399999999999999,0.24399999999999999,0.24399999999999999,0.24399999999999999,0.24399999999999999,0.24399999999999999,0.24399999999999999]
[null,"ELEVATED WORK PLATFORM (LCV) ","Average kilometres travelled ","0's"]
[null,null,"Number purchased","0's"]
[null,null,"Number leased","0's"]
[null,null,"Number in fleet","0's"]
[null,null,"Proportion of total fleet expenditure allocated as regulatory expenditure","%"]
[null,"ELEVATED WORK PLATFORM (HCV)","Average kilometres travelled ","0's",854000,854000,854000,854000,854000,854000,854000]
[null,null,"Number purchased","0's",0,0,3,1,1,1,3]
[null,null,"Number leased","0's"]
[null,null,"Number in fleet","0's",12,12,12,12,12,12,12]
[null,null,"Proportion of total fleet expenditure allocated as regulatory expenditure","%",0.24399999999999999,0.24399999999999999,0.24399999999999999,0.24399999999999999,0.24399999999999999,0.24399999999999999,0.24399999999999999]
[null,"HEAVY COMMERCIAL VEHICLE ","Average kilometres travelled ","0's",415616,415616,415616,415616,415616,415616,415616]
[null,null,"Number purchased","0's",0,2,0,1,1,0,0]
[null,null,"Number leased","0's"]
[null,null,"Number in fleet","0's",8,8,8,8,8,8,8]
[null,null,"Proportion of total fleet expenditure allocated as regulatory expenditure","%",0.24399999999999999,0.24399999999999999,0.24399999999999999,0.24399999999999999,0.24399999999999999,0.24399999999999999,0.24399999999999999]
[]
[]
[]
[null,"2.6.4 -  INFORMATION & COMMUNICATIONS TECHNOLOGY - CAPEX BY PURPOSE"]
[null,null,null,null,{"$f":"CONCATENATE(\"EXPENDITURE\nForecast \n($0's. real \",dms_DollarReal,\")\")","v":"EXPENDITURE\nForecast \n($0's. real June 2019)"}]
[null,null,null,null,{"$f":"CRCP_y4","v":"2017-18"},{"$f":"CRCP_y5","v":"2018-19"},{"$f":"FRCP_y1","v":"2019-20"},{"$f":"FRCP_y2","v":"2020-21"},{"$f":"FRCP_y3","v":"2021-22"},{"$f":"FRCP_y4","v":"2022-23"},{"$f":"FRCP_y5","v":"2023-24"}]
[null,"ICT CAPABILITY GROWTH"]
[null,"Customer Information Systems",null,null,0,0,0,172072.0870408231,0,0,0]
[null,"Digital Customer Engagement",null,null,0,0,0,151856.28985694674,0,0,0]
[null,"IT Infrastructure, Security & Support",null,null,1176473.7175521213,340294.5692827446,849178.61090485926,1073143.8131485898,3087978.3378395285,1573821.7473581883,1647672.1468347774]
[null,"Mobility",null,null,78171.631327458468,0,0,204741.66132338686,0,331463.87186907144,87061.067310397251]
[null,"Data Warehouses, Bus Intelligence & Analytics",null,null,0,0,0,0,344064.43875649344,139879.6445456105,101326.31913025813]
[null,"Enterprise Architecture Evolution",null,null,0,0,0,0,0,69939.82227280525,50663.159565129063]
[null,"ITC ASSET EXTENSIONS"]
[null,"Digital Customer Engagement",null,null,0,0,0,10566.895106820857,0,0,0]
[null,"Finance, HR, Asset & Works Systems",null,null,6413.8597328568621,13251.398275896958,23484.406969744752,29258.90481386381,0,0,0]
[null,"Market Systems",null,null,0,0,0,0,0,0,0]
[]
[]
[]
[null,"ITC ASSET REMEDIATION"]
[null,"Business Systems Upgrades",null,null,293354.79755662999,15789.609509985234,60873.378078160546,40203.75865439792,372613.18556231348,250949.46230115386,83331.154569336315]
[null,"Enterprise Information Management",null,null,112007.11354382109,1559.8764789460893,0,0,0,822755.48092610086,531823.52698120766]
[null,"Finance, HR, Asset & Works Systems",null,null,66016.79617451418,136394.44818627767,241721.1122124767,301157.06233662745,0,0,0]
[]
[]
[]
[null,"ITC ASSET REPLACEMENT"]
[null,"Finance, HR, Asset & Works Systems",null,null,736177.86528462544,1520985.2571005544,2695522.0897481861,3358314.491365104,0,0,0]

{"sheet":"2.10 Overheads","index":11,"n_rows":125,"n_cols":10,"rows_kept":125,"cut":false,"hidden":false,"merged":[[5,1,5,2],[8,3,8,9],[95,3,95,9],[98,1,122,1],[63,1,88,1],[39,1,59,1],[11,1,35,1]]}
[null,{"$f":"(LOOKUP(dms_Model,dms_Model_List,dms_Worksheet_List))","v":"REGULATORY REPORTING STATEMENT"}]
[null,{"$f":"INDEX(dms_TradingNameFull_List,MATCH(dms_TradingName,dms_TradingName_List))","v":"TasNetworks (T)"}]
[null,{"$f":"IF(SUM(dms_SingleYear_Model)>0,CRY,CONCATENATE(FRCP_y1,\" to \",dms_MultiYear_FinalYear_Result))","v":"2019-20 to 2023-24"}]
[null,"2.10 OVERHEADS"]
[]
[null,"There are TWO tables on this worksheet. Each table has been 'grouped' (and sub-grouped) for easy navigation.  See the Instructions sheet on how to group or ungroup data."]
[]
[null,"2.10.1 - NETWORK OVERHEADS EXPENDITURE"]
[null,null,null,{"$f":"CONCATENATE(\"EXPENDITURE\nForecast \n($0's. real \",dms_DollarReal,\")\")","v":"EXPENDITURE\nForecast \n($0's. real June 2019)"}]
[null,null,null,{"$f":"CRCP_y4","v":"2017-18"},{"$f":"CRCP_y5","v":"2018-19"},{"$f":"FRCP_y1","v":"2019-20"},{"$f":"FRCP_y2","v":"2020-21"},{"$f":"FRCP_y3","v":"2021-22"},{"$f":"FRCP_y4","v":"2022-23"},{"$f":"FRCP_y5","v":"2023-24"}]
[null,"MAINTENANCE SUPPORT"]
[null,"Prescribed Services","Capitalised Overheads",2791685.686978979,2791685.686978979,2791685.686978979,2783714.9060418042,2756213.6902183495,2726190.269478403,2699705.3623956032]
[]
[]
[]
[]
[]
[]
[]
[]
[]
[]
[]
[]
[]
[]
[]
[]
[]
[]
[]
[]
[]
[]
[]
[]
[null,"Negotiated Services","Total"]
[null,"Unregulated Services","Total",59161.518985472765,59161.518985472765,59161.518985472765,58865.71139054541,58277.054276639938,57694.283733873541,57117.340896534814]
[null,"NETWORK MONITORING AND CONTROL"]
[null,"Prescribed Services","Capitalised Overheads",2025419.4759986412,2025419.4759986412,2025419.4759986412,2019636.5273578356,1999683.8878460624,1977901.3421295371,1958686.053361278]
[]
[]
[]
[]
[]
[]
[]
[]
[]
[]
[]
[]
[]
[]
[]
[]
[]
[]
[]
[]
[null,"Negotiated Services","Total"]
[null,"Unregulated Services","Total",89509.773400996637,89509.773400996637,89509.773400996637,89062.22453399167,88171.602288651717,87289.886265765206,86416.987403107574]
[null,"ASSET MANAGEMENT SUPPORT"]
[null,"Prescribed Services","Capitalised Overheads",3923805.2853851076,3923805.2853851076,3923805.2853851076,3912602.0928065842,3873948.2369997138,3831749.3399196398,3794523.9391952185]
[]
[]
[]
[]
[]
[]
[]
[]
[]
[]
[]
[]
[]
[]
[]
[]
[]
[]
[]
[]
[]
[]
[]
[]
[]
[null,"Negotiated Services","Total"]
[null,"Unregulated Services","Total",825445.0548553369,825445.0548553369,825445.0548553369,821317.82958106021,813104.65128524939,804973.60477239697,796923.86872467306]
[]
[]
[]
[null,"2.10.2 - CORPORATE OVERHEADS EXPENDITURE"]
[null,null,null,{"$f":"CONCATENATE(\"EXPENDITURE\nForecast \n($0's. real \",dms_DollarReal,\")\")","v":"EXPENDITURE\nForecast \n($0's. real June 2019)"}]
[null,null,null,{"$f":"CRCP_y4","v":"2017-18"},{"$f":"CRCP_y5","v":"2018-19"},{"$f":"FRCP_y1","v":"2019-20"},{"$f":"FRCP_y2","v":"2020-21"},{"$f":"FRCP_y3","v":"2021-22"},{"$f":"FRCP_y4","v":"2022-23"},{"$f":"FRCP_y5","v":"2023-24"}]
[null,"CORPORATE OVERHEADS"]
[null,"Prescribed Services","Capitalised Overheads",1571341.4032202137,1571341.4032202137,1571341.4032202137,1566854.9317807539,1551375.4674327979,1534476.342902045,1519568.922896364]
[]
[]
[]
[]
[]
[]
[]
[]
[]
[]
[]
[]
[]
[]
[]
[]
[]
[]
[]
[]
[]
[]
[]
[]
[null,"Negotiated Services","Total"]
[null,"Unregulated Services","Total",825445.0548553369,825445.0548553369,825445.0548553369,821317.82958106021,813104.65128524939,804973.60477239697,796923.86872467306]

{"sheet":"2.11 Labour","index":12,"n_rows":31,"n_cols":14,"rows_kept":31,"cut":false,"hidden":false,"merged":[[5,1,5,2],[23,2,23,6],[23,7,23,13],[7,1,7,2],[12,7,12,13],[11,2,11,13],[12,2,12,6],[22,2,22,13]]}
[null,{"$f":"(LOOKUP(dms_Model,dms_Model_List,dms_Worksheet_List))","v":"REGULATORY REPORTING STATEMENT"}]
[null,{"$f":"INDEX(dms_TradingNameFull_List,MATCH(dms_TradingName,dms_TradingName_List))","v":"TasNetworks (T)"}]
[null,{"$f":"IF(SUM(dms_SingleYear_Model)>0,CRY,CONCATENATE(FRCP_y1,\" to \",dms_MultiYear_FinalYear_Result))","v":"2019-20 to 2023-24"}]
[null,"2.11 LABOUR"]
[]
[null,"There is ONE table on this worksheet. The table has been 'grouped' (and sub-grouped) for easy navigation.  See the Instructions sheet on how to group or ungroup data."]
[]
[null,"Table numbering in this template starts at 2.11.3.\n\nTables 2.11.1 & 2.11.2 appear in the Category Analysis RIN and are not required for this RIN."]
[]
[null,"2.11.3 - LABOUR / NON-LABOUR EXPENDITURE SPLIT"]
[null,"OPEX"]
[null,null,"EXPENDITURE"]
[null,null,"($0's, nominal)",null,null,null,null,{"$f":"CONCATENATE(\"($0's, real \", dms_DollarReal,\")\")","v":"($0's, real June 2019)"}]
[null,null,{"$f":"PRCP_y4","v":"2012-13"},{"$f":"PRCP_y5","v":"2013-14"},{"$f":"CRCP_y1","v":"2014-15"},{"$f":"CRCP_y2","v":"2015-16"},{"$f":"CRCP_y3","v":"2016-17"},{"$f":"CRCP_y4","v":"2017-18"},{"$f":"CRCP_y5","v":"2018-19"},{"$f":"FRCP_y1","v":"2019-20"},{"$f":"FRCP_y2","v":"2020-21"},{"$f":"FRCP_y3","v":"2021-22"},{"$f":"FRCP_y4","v":"2022-23"},{"$f":"FRCP_y5","v":"2023-24"}]
[null,"In-house labour expenditure"]
[null,"Labour expenditure outsourced to related parties"]
[null,"Labour expenditure outsourced to unrelated parties"]
[null,"Controllable non-labour expenditure"]
[null,"Uncontrollable non-labour expenditure"]
[null,"Total",{"$f":"SUM(C15:C19)","v":0},{"$f":"SUM(D15:D19)","v":0},0,0,0,0,{"$f":"SUM(I15:I19)","v":0},0,0,0,0,0]
[]
[null,"CAPEX"]
[null,null,"EXPENDITURE"]
[null,null,"($0's, nominal)",null,null,null,null,{"$f":"CONCATENATE(\"($0's, real \", dms_DollarReal,\")\")","v":"($0's, real June 2019)"}]
[null,null,{"$f":"PRCP_y4","v":"2012-13"},{"$f":"PRCP_y5","v":"2013-14"},{"$f":"CRCP_y1","v":"2014-15"},{"$f":"CRCP_y2","v":"2015-16"},{"$f":"CRCP_y3","v":"2016-17"},{"$f":"CRCP_y4","v":"2017-18"},{"$f":"CRCP_y5","v":"2018-19"},{"$f":"FRCP_y1","v":"2019-20"},{"$f":"FRCP_y2","v":"2020-21"},{"$f":"FRCP_y3","v":"2021-22"},{"$f":"FRCP_y4","v":"2022-23"},{"$f":"FRCP_y5","v":"2023-24"}]
[null,"In-house labour expenditure"]
[null,"Labour expenditure outsourced to related parties"]
[null,"Labour expenditure outsourced to unrelated parties"]
[null,"Controllable non-labour expenditure"]
[null,"Uncontrollable non-labour expenditure"]
[null,"Total",{"$f":"SUM(C26:C30)","v":0},{"$f":"SUM(D26:D30)","v":0},0,0,0,0,{"$f":"SUM(I26:I30)","v":0},0,0,0,0,0]

{"sheet":"2.14 Forecast price changes","index":13,"n_rows":18,"n_cols":9,"rows_kept":18,"cut":false,"hidden":false,"merged":[[9,4,9,8],[10,2,10,8],[6,1,6,4],[9,2,9,3]]}
[null,{"$f":"(LOOKUP(dms_Model,dms_Model_List,dms_Worksheet_List))","v":"REGULATORY REPORTING STATEMENT"}]
[null,{"$f":"INDEX(dms_TradingNameFull_List,MATCH(dms_TradingName,dms_TradingName_List))","v":"TasNetworks (T)"}]
[null,{"$f":"IF(SUM(dms_SingleYear_Model)>0,CRY,CONCATENATE(FRCP_y1,\" to \",dms_MultiYear_FinalYear_Result))","v":"2019-20 to 2023-24"}]
[null,"2.14 FORECAST PRICE CHANGES"]
[]
[null,"Instructions"]
[null,{"$f":"CONCATENATE(dms_TradingName, \"  must provide all forecast price changes used to forecast opex and capex, including forecast changes in CPI. \"&\"Forecast price changes must be expressed in real terms, except for CPI. If the same escalators are not used for capex and opex, report capex and opex escalators separately. \"&\"If price changes for a given year were not used to forecast either opex or capex enter '0' for that year.\")","v":"TasNetworks (T)  must provide all forecast price changes used to forecast opex and capex, including forecast changes in CPI. Forecast price changes must be expressed in real terms, except for CPI. If the same escalators are not used for capex and opex, report capex and opex escalators separately. If price changes for a given year were not used to forecast either opex or capex enter '0' for that year."}]
[]
[null,"2.14.2 - FORECAST CAPEX AND OPEX PRICE CHANGES"]
[null,null,"Price changes\n(% YoY real)\nCurrent regulatory period",null,"Price changes\n(%YoY real)\nForthcoming regulatory period "]
[null,null,"Forecast"]
[null,null,{"$f":"CRCP_y4","v":"2017-18"},{"$f":"CRCP_y5","v":"2018-19"},{"$f":"FRCP_y1","v":"2019-20"},{"$f":"FRCP_y2","v":"2020-21"},{"$f":"FRCP_y3","v":"2021-22"},{"$f":"FRCP_y4","v":"2022-23"},{"$f":"FRCP_y5","v":"2023-24"}]
[null,"OPEX"]
[null,"WPI",null,null,0,4.8999999999999998E-3,4.8999999999999998E-3,4.8999999999999998E-3,4.8999999999999998E-3]
[]
[]
[null,"CAPEX"]
[null,"WPI (labour component)",null,null,0,4.8999999999999998E-3,4.8999999999999998E-3,4.8999999999999998E-3,4.8999999999999998E-3]

{"sheet":"2.16 Opex Summary","index":14,"n_rows":58,"n_cols":13,"rows_kept":58,"cut":false,"hidden":false,"merged":[[25,2,25,11],[7,1,7,8],[22,1,22,8],[6,1,6,8],[11,2,11,11],[5,10,5,12],[6,10,6,11],[6,12,7,12],[7,10,7,11],[8,10,8,11]]}
[null,{"$f":"(LOOKUP(dms_Model,dms_Model_List,dms_Worksheet_List))","v":"REGULATORY REPORTING STATEMENT"}]
[null,{"$f":"INDEX(dms_TradingNameFull_List,MATCH(dms_TradingName,dms_TradingName_List))","v":"TasNetworks (T)"}]
[null,{"$f":"IF(SUM(dms_SingleYear_Model)>0,CRY,CONCATENATE(FRCP_y1,\" to \",dms_MultiYear_FinalYear_Result))","v":"2019-20 to 2023-24"}]
[null,"2.16 OPEX SUMMARY"]
[]
[null,"Instructions",null,null,null,null,null,null,null,null,"IMPORTANT!"]
[null,{"$f":"CONCATENATE(\"Complete the tables below in accordance with the regulatory information notice.\n\n\",dms_TradingName, \"'s total forecast opex must reconcile to Table 2.16.1. If \",dms_TradingName,\" did not forecast its total opex using a Base Year approach, total forecast opex must reconcile to Table 2.16.2\")","v":"Complete the tables below in accordance with the regulatory information notice.\n\nTasNetworks (T)'s total forecast opex must reconcile to Table 2.16.1. If TasNetworks (T) did not forecast its total opex using a Base Year approach, total forecast opex must reconcile to Table 2.16.2"},null,null,null,null,null,null,null,null,{"$f":"CONCATENATE(\"Has \",dms_TradingName,\" used a base-step-trend model to derive its opex forecast? \")","v":"Has TasNetworks (T) used a base-step-trend model to derive its opex forecast? "},null,"Yes"]
[null,"The total step changes and category specific forecasts in Table 2.16.1 must reconcile (in each year) to the total step changes and category secific forecasts for each year in Tables 2.17.1 and 2.17.5 of worksheet 2.17 Step Changes.\")",null,null,null,null,null,null,null,null,"Yes /  No"]
[null,null,null,null,null,null,null,null,null,null,"Please nominate the base year.",null,"2017-18"]
[]
[null,"2.16.1 - PRESCRIBED TRANSMISSION SERVICES - OPEX BY DRIVER"]
[null,null,{"$f":"CONCATENATE(\"Forecast ($0's, real \", dms_DollarReal, \")\")","v":"Forecast ($0's, real June 2019)"}]
[null,null,{"$f":"CRCP_y1","v":"2014-15"},{"$f":"CRCP_y2","v":"2015-16"},{"$f":"CRCP_y3","v":"2016-17"},{"$f":"CRCP_y4","v":"2017-18"},{"$f":"CRCP_y5","v":"2018-19"},{"$f":"FRCP_y1","v":"2019-20"},{"$f":"FRCP_y2","v":"2020-21"},{"$f":"FRCP_y3","v":"2021-22"},{"$f":"FRCP_y4","v":"2022-23"},{"$f":"FRCP_y5","v":"2023-24"}]
[null,"Base year total opex, excluding category specific",null,null,null,38441219.896483779,38441219.896483779,38441219.896483779,38441219.896483779,38441219.896483779,38441219.896483779,38441219.896483779]
[null,"Increment from base year to final year",null,null,null,null,-530635.2857471779,-530635.2857471779,-530635.2857471779,-530635.2857471779,-530635.2857471779,-530635.2857471779]
[null,"Price growth",null,null,null,null,null,0,115172.35604742382,230694.60571251455,346567.81197209342,462793.04103228467]
[null,"Output growth",null,null,null,null,null,48917.481014278506,88174.54321258112,177818.53185547903,217654.41560854271,258567.70631786931]
[null,"Productivity growth",null,null,null,null,null,-48917.481014278506,-393167.69657595793,-792724.49532052036,-1328600.9390476323,-1862335.3488127422]
[null,"Step changes",null,null,null,null,null,0,0,0,0,0]
[null,"Category specific",null,null,null,null,null,0,0,0,0,0]
[null,"Total opex",{"$f":"SUM(C14:C20)","v":0},0,0,38441219.896483779,37910584.610736601,37910584.610736601,37720763.813420646,37526373.252984077,37146205.899269603,36769610.009274013]
[]
[]
[]
[null,"2.16.2 - PRESCRIBED TRANSMISSION SERVICES - OPEX BY CATEGORY"]
[null,null,{"$f":"CONCATENATE(\"Forecast ($0's, real \", dms_DollarReal, \")\")","v":"Forecast ($0's, real June 2019)"}]
[null,null,{"$f":"CRCP_y1","v":"2014-15"},{"$f":"CRCP_y2","v":"2015-16"},{"$f":"CRCP_y3","v":"2016-17"},{"$f":"CRCP_y4","v":"2017-18"},{"$f":"CRCP_y5","v":"2018-19"},{"$f":"FRCP_y1","v":"2019-20"},{"$f":"FRCP_y2","v":"2020-21"},{"$f":"FRCP_y3","v":"2021-22"},{"$f":"FRCP_y4","v":"2022-23"},{"$f":"FRCP_y5","v":"2023-24"}]
[]
[]
[]
[]
[]
[]
[]
[]
[]
[]
[]
[]
[]
[]
[]
[]
[]
[]
[]
[]
[]
[]
[]
[]
[]
[]
[]
[]
[]
[]
[null,"Total opex",{"$f":"SUM(C28:C57)","v":0},{"$f":"SUM(D28:D57)","v":0},{"$f":"SUM(E28:E57)","v":0},0,0,0,0,0,0,0]

{"sheet":"2.17 Step Changes","index":15,"n_rows":72,"n_cols":12,"rows_kept":72,"cut":false,"hidden":false,"merged":[[9,5,9,11],[6,1,6,4],[54,5,54,11],[70,1,70,2],[71,1,71,2],[53,5,53,11],[10,5,10,11],[26,1,26,2],[27,1,27,2],[49,1,49,2],[32,5,32,11],[31,5,31,11]]}
[null,{"$f":"(LOOKUP(dms_Model,dms_Model_List,dms_Worksheet_List))","v":"REGULATORY REPORTING STATEMENT"}]
[null,{"$f":"INDEX(dms_TradingNameFull_List,MATCH(dms_TradingName,dms_TradingName_List))","v":"TasNetworks (T)"}]
[null,{"$f":"IF(SUM(dms_SingleYear_Model)>0,CRY,CONCATENATE(FRCP_y1,\" to \",dms_MultiYear_FinalYear_Result))","v":"2019-20 to 2023-24"}]
[null,"2.17 STEP CHANGES"]
[]
[null,"Instructions"]
[null,"Complete the Tables below in accordance with the regulatory information notice.\n\nThe total step changes and category specifici forecasts in Tables 2.17.1 and 2.17.5 must reconcile (in each year) to the total step changes and category specific forecasts for each year in Table 2.16.1 of worksheet 2.16 Opex Summary."]
[]
[null,"2.17.1 - STEP CHANGES FOR PRESCRIBED TRANSMISSION SERVICES - FORECAST OPEX "]
[null,null,null,null,null,"EXPENDITURE"]
[null,null,null,null,null,{"$f":"CONCATENATE(\"Forecast ($0's, real \", dms_DollarReal, \")\")","v":"Forecast ($0's, real June 2019)"}]
[null,"Step change","Description",{"$f":"CRCP_y1","v":"2014-15"},{"$f":"CRCP_y2","v":"2015-16"},{"$f":"CRCP_y4","v":"2017-18"},{"$f":"CRCP_y5","v":"2018-19"},{"$f":"FRCP_y1","v":"2019-20"},{"$f":"FRCP_y2","v":"2020-21"},{"$f":"FRCP_y3","v":"2021-22"},{"$f":"FRCP_y4","v":"2022-23"},{"$f":"FRCP_y5","v":"2023-24"}]
[]
[]
[]
[]
[]
[]
[]
[]
[]
[]
[]
[]
[]
[]
[null,"Total",null,{"$f":"SUM(D20:D26)","v":0},0,0,0,0,0,0,0,0]
[null,"Check",null,null,null,null,null,{"$f":"IF(H$27-'2.16 Opex Summary'!C$19=0,\"OK\",\"Error\")","v":"OK"},{"$f":"IF(I$27-'2.16 Opex Summary'!G$19=0,\"OK\",\"Error\")","v":"OK"},{"$f":"IF(J$27-'2.16 Opex Summary'!H$19=0,\"OK\",\"Error\")","v":"OK"},{"$f":"IF(K$27-'2.16 Opex Summary'!I$19=0,\"OK\",\"Error\")","v":"OK"},{"$f":"IF(L$27-'2.16 Opex Summary'!J$19=0,\"OK\",\"Error\")","v":"OK"}]
[]
[]
[null,"2.17.2 - STEP CHANGES FOR PRESCRIBED TRANSMISSION SERVICES - FORECAST CAPEX"]
[null,null,null,null,null,"EXPENDITURE"]
[null,null,null,null,null,{"$f":"CONCATENATE(\"Forecast ($0's, real \", dms_DollarReal, \")\")","v":"Forecast ($0's, real June 2019)"}]
[null,"Step change","Description",{"$f":"CRCP_y1","v":"2014-15"},{"$f":"CRCP_y2","v":"2015-16"},{"$f":"CRCP_y4","v":"2017-18"},{"$f":"CRCP_y5","v":"2018-19"},{"$f":"FRCP_y1","v":"2019-20"},{"$f":"FRCP_y2","v":"2020-21"},{"$f":"FRCP_y3","v":"2021-22"},{"$f":"FRCP_y4","v":"2022-23"},{"$f":"FRCP_y5","v":"2023-24"}]
[]
[]
[]
[]
[]
[]
[]
[]
[]
[]
[]
[]
[]
[]
[]
[null,"Total",null,{"$f":"SUM(D35:D49)","v":0},{"$f":"SUM(E35:E49)","v":0},0,0,0,0,0,0,0]
[]
[]
[null,"2.17.5 - CATEGORY SPECIFIC OPEX FOR PRESCRIBED TRANSMISSION SERVICES"]
[null,null,null,null,null,"EXPENDITURE"]
[null,null,null,null,null,{"$f":"CONCATENATE(\"Forecast ($0's, real \", dms_DollarReal, \")\")","v":"Forecast ($0's, real June 2019)"}]
[null,"Category","Description",{"$f":"CRCP_y1","v":"2014-15"},{"$f":"CRCP_y2","v":"2015-16"},{"$f":"CRCP_y4","v":"2017-18"},{"$f":"CRCP_y5","v":"2018-19"},{"$f":"FRCP_y1","v":"2019-20"},{"$f":"FRCP_y2","v":"2020-21"},{"$f":"FRCP_y3","v":"2021-22"},{"$f":"FRCP_y4","v":"2022-23"},{"$f":"FRCP_y5","v":"2023-24"}]
[]
[]
[]
[]
[]
[]
[]
[]
[]
[]
[]
[]
[]
[]
[null,"Total",null,{"$f":"SUM(D64:D70)","v":0},0,0,0,0,0,0,0,0]
[null,"Check",null,null,null,null,null,{"$f":"IF(H$71-'2.16 Opex Summary'!C$20=0,\"OK\",\"Error\")","v":"OK"},{"$f":"IF(I$71-'2.16 Opex Summary'!G$20=0,\"OK\",\"Error\")","v":"OK"},{"$f":"IF(J$71-'2.16 Opex Summary'!H$20=0,\"OK\",\"Error\")","v":"OK"},{"$f":"IF(K$71-'2.16 Opex Summary'!I$20=0,\"OK\",\"Error\")","v":"OK"},{"$f":"IF(L$71-'2.16 Opex Summary'!J$20=0,\"OK\",\"Error\")","v":"OK"}]

{"sheet":"3.1 Revenue","index":16,"n_rows":43,"n_cols":9,"rows_kept":43,"cut":false,"hidden":false,"merged":[[9,2,9,8],[26,2,26,8],[37,2,37,8],[8,2,8,8],[25,2,25,8]]}
[null,{"$f":"(LOOKUP(dms_Model,dms_Model_List,dms_Worksheet_List))","v":"REGULATORY REPORTING STATEMENT"}]
[null,{"$f":"INDEX(dms_TradingNameFull_List,MATCH(dms_TradingName,dms_TradingName_List))","v":"TasNetworks (T)"}]
[null,{"$f":"IF(SUM(dms_SingleYear_Model)>0,CRY,CONCATENATE(FRCP_y1,\" to \",dms_MultiYear_FinalYear_Result))","v":"2019-20 to 2023-24"}]
[null,"3.1 REVENUE"]
[]
[]
[]
[null,"3.1.1 - REVENUE GROUPING BY CHARGEABLE QUANTITY"]
[null,null,"REVENUE"]
[null,null,{"$f":"CONCATENATE(\"Forecast ($0's, real \",dms_DollarReal,\")\")","v":"Forecast ($0's, real June 2019)"}]
[null,null,{"$f":"CRCP_y4","v":"2017-18"},{"$f":"CRCP_y5","v":"2018-19"},{"$f":"FRCP_y1","v":"2019-20"},{"$f":"FRCP_y2","v":"2020-21"},{"$f":"FRCP_y3","v":"2021-22"},{"$f":"FRCP_y4","v":"2022-23"},{"$f":"FRCP_y5","v":"2023-24"}]
["TREV0101","From Fixed Customer (Exit Point) Charges",27502743.019665048,28394202.423852745,28061838.346448112,26473117.406108182,25005948.666737832,23618553.153520361,22286389.370163333]
["TREV0102","From Variable Customer (Exit Point) Charges",0,0,0,0,0,0,0]
["TREV0103","From Fixed Generator (Entry Point) Charges",11220681.692815159,10968687.428014763,10842581.478835734,10239787.200268175,9683112.3934136126,9156705.2341562584,8651254.1583045479]
["TREV0104","From Variable Generator (Entry Point) Charges",0,0,0,0,0,0,0]
["TREV0105","From Fixed Energy Usage Charges (Charge per day basis)",0,0,0,0,0,0,0]
["TREV0106","From Variable Energy Usage charges (Charge per kWh basis)",10578385.540454835,10240301.629027642,9927676.939661311,9484234.4610660486,9054034.1600080896,8637303.3122594096,8233818.0149999792]
["TREV0107","From Energy based Common Service and General Charges",8815100.506322233,8668964.5761351455,7457397.4431774914,7329168.865692772,7164913.1863350859,7005004.4451417271,6849166.403027433]
["TREV0108","From Fixed Demand based Usage Charges",105050885.83339927,100998112.93259667,96501744.55348514,92798862.96639511,88976825.212343857,84749697.380428553,80749815.572335541]
["TREV0109","From Variable Demand based Usage Charges",0,0,0,0,0,0,0]
["TREV0110","Revenue from other Sources",7581300,7400000,9760858.9555880912,9527436.7550884262,9299596.6374704,9077205.1122209877,8860131.8811332248]
["TREV01","Total revenue by chargeable quantity",{"$f":"SUM(C12:C21)","v":170749096.59265655},{"$f":"SUM(D12:D21)","v":166670268.98962697},162552097.7171959,155852607.65461871,149184430.25630888,142244468.63772732,135630575.39996406]
[]
[]
[null,"3.1.2 - REVENUE GROUPING BY TYPE OF CONNECTED EQUIPMENT"]
[null,null,"REVENUE"]
[null,null,{"$f":"CONCATENATE(\"Forecast ($0's, real \",dms_DollarReal,\")\")","v":"Forecast ($0's, real June 2019)"}]
[null,null,{"$f":"CRCP_y4","v":"2017-18"},{"$f":"CRCP_y5","v":"2018-19"},{"$f":"FRCP_y1","v":"2019-20"},{"$f":"FRCP_y2","v":"2020-21"},{"$f":"FRCP_y3","v":"2021-22"},{"$f":"FRCP_y4","v":"2022-23"},{"$f":"FRCP_y5","v":"2023-24"}]
["TREV0201","From Other connected transmission networks",0,0,0,0,0,0,0]
["TREV0202","From Distribution networks",97422099.619110316,94033875.11711365,89844156.018918067,85848275.397490844,82001339.858585402,78330706.789727151,74817925.614125624]
["TREV0203","From Directly connected end–users",54525015.280731037,54267706.444498539,52104501.263853997,50237108.301771291,48200381.366839454,45679851.5016229,43301263.746400662]
["TREV0204","From Generators",11220681.692815159,10968687.428014763,10842581.478835734,10239787.200268175,9683112.3934136126,9156705.2341562584,8651254.1583045479]
["TREV0205","Other revenue",7581300,7400000,9760858.9555880912,9527436.7550884262,9299596.6374704,9077205.1122209877,8860131.8811332248]
["TREV02","Total revenue by type of connected equipment",{"$f":"SUM(C29:C33)","v":170749096.59265652},{"$f":"SUM(D29:D33)","v":166670268.98962694},162552097.7171959,155852607.65461874,149184430.25630885,142244468.63772732,135630575.39996406]
[]
[]
[null,"3.1.3 - REVENUE (penalties) ALLOWED (deducted) THROUGH INCENTIVE SCHEMES"]
[null,null,{"$f":"CONCATENATE(\"Forecast ($0's, real \",dms_DollarReal,\")\")","v":"Forecast ($0's, real June 2019)"}]
[null,null,{"$f":"CRCP_y4","v":"2017-18"},{"$f":"CRCP_y5","v":"2018-19"},{"$f":"FRCP_y1","v":"2019-20"},{"$f":"FRCP_y2","v":"2020-21"},{"$f":"FRCP_y3","v":"2021-22"},{"$f":"FRCP_y4","v":"2022-23"},{"$f":"FRCP_y5","v":"2023-24"}]
["TREV0301","EBSS",4567009,0,6919687,1400021,123058,4808614,244324]
["TREV0302","STPIS",1164593.2035000001,1136743,0,0,0,0,0]
["TREV0303","Other",2626780.0935,2563963,1760714.7877013178,1718608.8703770794,1677509.878357325,1637393.7319251588,1598236.9272085493]
["TREV03","Total revenue of incentive schemes",{"$f":"SUM(C40:C42)","v":8358382.2970000003},{"$f":"SUM(D40:D42)","v":3700706},8680401.787701318,3118629.8703770796,1800567.878357325,6446007.7319251588,1842560.9272085493]

{"sheet":"3.2 Operating expenditure","index":17,"n_rows":101,"n_cols":9,"rows_kept":101,"cut":false,"hidden":false,"merged":[[63,2,63,8],[59,1,59,3],[8,2,8,8],[7,2,7,8],[51,2,51,8],[52,2,52,8],[62,2,62,8]]}
[null,{"$f":"(LOOKUP(dms_Model,dms_Model_List,dms_Worksheet_List))","v":"REGULATORY REPORTING STATEMENT"}]
[null,{"$f":"INDEX(dms_TradingNameFull_List,MATCH(dms_TradingName,dms_TradingName_List))","v":"TasNetworks (T)"}]
[null,{"$f":"IF(SUM(dms_SingleYear_Model)>0,CRY,CONCATENATE(FRCP_y1,\" to \",dms_MultiYear_FinalYear_Result))","v":"2019-20 to 2023-24"}]
[null,"3.2 OPERATING EXPENDITURE"]
[]
[]
[null,"3.2.1 - OPEX CATEGORIES"]
[null,null,"EXPENDITURE"]
[null,null,{"$f":"CONCATENATE(\"Forecast ($0's, real \",dms_DollarReal,\")\")","v":"Forecast ($0's, real June 2019)"}]
[null,null,{"$f":"CRCP_y4","v":"2017-18"},{"$f":"CRCP_y5","v":"2018-19"},{"$f":"FRCP_y1","v":"2019-20"},{"$f":"FRCP_y2","v":"2020-21"},{"$f":"FRCP_y3","v":"2021-22"},{"$f":"FRCP_y4","v":"2022-23"},{"$f":"FRCP_y5","v":"2023-24"}]
[null,"OPEX CATEGORIES AND COST ALLOCATIONS - approved CAM"]
[null,"Maintenance and vegetation management",19302288.824545335,19035839.111154314,19035839.111154314,18940659.915598538,18843460.449081734,18653024.811496094,18464512.573850077]
[null,"Emergency response",440903.79403336695,434817.53708109219,434817.53708109219,432643.44939568668,430423.21458546148,426073.27474703663,421767.26930097991]
[null,"Network operations",2613628.3764964277,2577549.7260235082,2577549.7260235082,2564661.9773933901,2551500.6737688393,2525714.716941942,2500189.1982789976]
[null,"Network asset services",1619700.3945708997,1597341.9732543589,1597341.9732543589,1589355.263388087,1581199.0278400443,1565219.1261744143,1549400.6215156075]
[null,"Business services",14464707.777657446,14265036.263223326,14265036.263223326,14193711.081907211,14120871.954273708,13978163.704844486,13836896.808734495]
[]
[]
[]
[]
[]
[]
[]
[]
[]
[]
[]
[]
[]
[]
[]
[]
[]
[]
[]
[]
[]
[]
[]
[]
[]
[]
[]
[]
[]
[null,"Total opex ",{"$f":"SUM(C12:C45)","v":38441229.167303473},{"$f":"SUM(D12:D45)","v":37910584.610736601},37910584.610736601,37721031.687682912,37527455.319549784,37148195.63420397,36772766.471680149]
[]
[]
[]
[null,"3.2.2 - OPEX CONSISTENCY"]
[null,"CURRENT COST ALLOCATION APPROACH"]
[null,null,"EXPENDITURE"]
[null,null,{"$f":"CONCATENATE(\"Forecast ($0's, real \",dms_DollarReal,\")\")","v":"Forecast ($0's, real June 2019)"}]
[null,null,{"$f":"CRCP_y4","v":"2017-18"},{"$f":"CRCP_y5","v":"2018-19"},{"$f":"FRCP_y1","v":"2019-20"},{"$f":"FRCP_y2","v":"2020-21"},{"$f":"FRCP_y3","v":"2021-22"},{"$f":"FRCP_y4","v":"2022-23"},{"$f":"FRCP_y5","v":"2023-24"}]
["TOPEX0201","Opex for subtransmission assets"]
["TOPEX0202","Opex for HV assets"]
[]
[]
[]
[null,"Instructions\nTable 3.2.3 must be completed if there are any proposed changes to the CAM reported in response to Schedule 1, paragraph 1.3."]
[]
[null,"3.2.3 - OPEX CATEGORIES - Revised CAM"]
[null,null,"EXPENDITURE"]
[null,null,{"$f":"CONCATENATE(\"Forecast ($0's, real \",dms_DollarReal,\")\")","v":"Forecast ($0's, real June 2019)"}]
[null,null,{"$f":"CRCP_y4","v":"2017-18"},{"$f":"CRCP_y5","v":"2018-19"},{"$f":"FRCP_y1","v":"2019-20"},{"$f":"FRCP_y2","v":"2020-21"},{"$f":"FRCP_y3","v":"2021-22"},{"$f":"FRCP_y4","v":"2022-23"},{"$f":"FRCP_y5","v":"2023-24"}]
[null,"OPEX CATEGORIES AND COST ALLOCATIONS - revised CAM"]
[]
[]
[]
[]
[]
[]
[]
[]
[]
[]
[]
[]
[]
[]
[]
[]
[]
[]
[]
[]
[]
[]
[]
[]
[]
[]
[]
[]
[]
[]
[]
[]
[]
[]
[null,"Total opex ",{"$f":"SUM(C67:C100)","v":0},{"$f":"SUM(D67:D100)","v":0},{"$f":"SUM(E67:E100)","v":0},0,0,0,0]

{"sheet":"3.3 Assets (RAB)","index":18,"n_rows":93,"n_cols":9,"rows_kept":93,"cut":false,"hidden":false,"merged":[[8,2,8,8],[68,2,68,8],[79,2,79,8],[20,2,20,8]]}
[null,{"$f":"(LOOKUP(dms_Model,dms_Model_List,dms_Worksheet_List))","v":"REGULATORY REPORTING STATEMENT"}]
[null,{"$f":"INDEX(dms_TradingNameFull_List,MATCH(dms_TradingName,dms_TradingName_List))","v":"TasNetworks (T)"}]
[null,{"$f":"IF(SUM(dms_SingleYear_Model)>0,CRY,CONCATENATE(FRCP_y1,\" to \",dms_MultiYear_FinalYear_Result))","v":"2019-20 to 2023-24"}]
[null,"3.3 ASSETS"]
[]
[null,"There are FOUR tables on this worksheet. Each table has been grouped (and sub-grouped) for ease of navigation. See the Instructions sheet on how to group or ungroup tables. "]
[]
[null,"3.3.1 - REGULATORY ASSET BASE VALUES"]
[null,null,{"$f":"CONCATENATE(\"Forecast ($0's, real \",dms_DollarReal,\")\")","v":"Forecast ($0's, real June 2019)"}]
[null,null,{"$f":"CRCP_y4","v":"2017-18"},{"$f":"CRCP_y5","v":"2018-19"},{"$f":"FRCP_y1","v":"2019-20"},{"$f":"FRCP_y2","v":"2020-21"},{"$f":"FRCP_y3","v":"2021-22"},{"$f":"FRCP_y4","v":"2022-23"},{"$f":"FRCP_y5","v":"2023-24"}]
[null,"For total asset base:"]
["TRAB0101","Opening value",1480907628.2019982,1473917722.2303326,1467448073.8442562,1454113947.2572856,1463583717.6790006,1472663371.0538251,1460607097.3973918]
["TRAB0102","Inflation addition",0,0,0,0,0,0,0]
["TRAB0103","Straight line depreciation",-62907590.559996888,-63136926.404696912,-53541210.390485369,-56140095.204725534,-57924109.072317451,-60826351.621127076,-63399428.500735112]
["TRAB0105","Actual additions (recognised in RAB)",55917684.588331111,56667278.018620506,40207083.803514794,65609865.626440585,67003762.447141871,48770077.964693695,44144182.657729745]
["TRAB0106","Disposals ",0,0,0,0,0,0,0]
["TRAB0107","Closing value ",{"$f":"SUM(C12:C16)","v":1473917722.2303326},{"$f":"SUM(D12:D16)","v":1467448073.8442562},1454113947.2572856,1463583717.6790006,1472663371.0538251,1460607097.3973918,1441351851.5543866]
[]
[]
[null,"3.3.2 - ASSET VALUE ROLL FORWARD"]
[null,null,{"$f":"CONCATENATE(\"Forecast ($0's, real \",dms_DollarReal,\")\")","v":"Forecast ($0's, real June 2019)"}]
[null,null,{"$f":"CRCP_y4","v":"2017-18"},{"$f":"CRCP_y5","v":"2018-19"},{"$f":"FRCP_y1","v":"2019-20"},{"$f":"FRCP_y2","v":"2020-21"},{"$f":"FRCP_y3","v":"2021-22"},{"$f":"FRCP_y4","v":"2022-23"},{"$f":"FRCP_y5","v":"2023-24"}]
[null,"For overhead assets:"]
["TRAB0201","Opening value",510055619.62901628,507682904.08358818,511473929.82258606,508023487.68325788,500452106.96889859,497231483.76844871,494611882.99908298]
["TRAB0202","Inflation addition",0,0,0,0,0,0,0]
["TRAB0203","Straight line depreciation",-12747487.107119652,-13029308.353401104,-14252540.913146019,-14500154.2778436,-14658980.536629565,-14735633.081576576,-14893304.444526449]
["TRAB0205","Actual additions (recognised in RAB)",10374771.561691554,16820334.092398979,10802098.773817837,6928773.5634843111,11438357.336179649,12116032.312210863,6947194.5605856739]
["TRAB0206","Disposals ",0,0,0,0,0,0,0]
["TRAB0207","Closing value ",{"$f":"SUM(C24:C28)","v":507682904.08358818},{"$f":"SUM(D24:D28)","v":511473929.82258606},{"$f":"SUM(E24:E28)","v":508023487.68325788},{"$f":"SUM(F24:F28)","v":500452106.96889859},{"$f":"SUM(G24:G28)","v":497231483.76844871},{"$f":"SUM(H24:H28)","v":494611882.99908298},{"$f":"SUM(I24:I28)","v":486665773.11514223}]
[null,"For underground assets:"]
["TRAB0301","Opening value",30438407.25,29677680.009580906,28900134.623187348,28049590.823714726,27184270.289813239,26309471.537927531,25430098.419462856]
["TRAB0302","Inflation addition",0,0,0,0,0,0,0]
["TRAB0303","Straight line depreciation",-760727.24041909352,-777545.38639355928,-850543.79947262094,-865320.53390148503,-874798.75188570702,-879373.11846467562,-888782.41614209651]
["TRAB0305","Actual additions (recognised in RAB)",0,0,0,0,0,0,0]
["TRAB0306","Disposals ",0,0,0,0,0,0,0]
["TRAB0307","Closing value ",{"$f":"SUM(C31:C35)","v":29677680.009580906},{"$f":"SUM(D31:D35)","v":28900134.623187348},{"$f":"SUM(E31:E35)","v":28049590.823714726},{"$f":"SUM(F31:F35)","v":27184270.289813239},{"$f":"SUM(G31:G35)","v":26309471.537927531},{"$f":"SUM(H31:H35)","v":25430098.419462856},{"$f":"SUM(I31:I35)","v":24541316.003320761}]
[null,"For switchyards, substations"]
["TRAB0401","Opening value",725146090.36525905,716387601.42239952,705065732.23935401,690777348.77402127,704839766.99002624,715181057.45768905,707333251.40089977]
["TRAB0402","Inflation addition",0,0,0,0,0,0,0]
["TRAB0403","Straight line depreciation",-36155707.754615702,-33475389.870818399,-29951183.628166217,-30642057.054611214,-31276634.734412223,-33535690.535904154,-35046559.507406533]
["TRAB0405","Actual additions (recognised in RAB)",27397218.811756101,22153520.687772911,15662800.162833463,44704475.270616226,41617925.20207496,25687884.47911492,25848882.386395626]
["TRAB0406","Disposals ",0,0,0,0,0,0,0]
["TRAB0407","Closing value ",{"$f":"SUM(C38:C42)","v":716387601.42239952},{"$f":"SUM(D38:D42)","v":705065732.23935401},{"$f":"SUM(E38:E42)","v":690777348.77402127},{"$f":"SUM(F38:F42)","v":704839766.99002624},{"$f":"SUM(G38:G42)","v":715181057.45768905},{"$f":"SUM(H38:H42)","v":707333251.40089977},{"$f":"SUM(I38:I42)","v":698135574.27988875}]
[null,"For easements:"]
["TRAB0501","Opening value",6824333.9959745742,6881874.1996518569,7479814.8205318628,7621341.2870443454,8252550.68644151,8981880.671026459,10059129.402004108]
["TRAB0502","Inflation addition",0,0,0,0,0,0,0]
["TRAB0503","Straight line depreciation",0,0,0,0,0,0,0]
["TRAB0505","Actual additions (recognised in RAB)",57540.203677282669,597940.62088000623,141526.46651248218,631209.39939716458,729329.98458494863,1077248.7309776491,694801.53209833696]
["TRAB0506","Disposals ",0,0,0,0,0,0,0]
["TRAB0507","Closing value ",{"$f":"SUM(C45:C49)","v":6881874.1996518569},{"$f":"SUM(D45:D49)","v":7479814.8205318628},{"$f":"SUM(E45:E49)","v":7621341.2870443454},{"$f":"SUM(F45:F49)","v":8252550.68644151},{"$f":"SUM(G45:G49)","v":8981880.671026459},{"$f":"SUM(H45:H49)","v":10059129.402004108},{"$f":"SUM(I45:I49)","v":10753930.934102444}]
[null,"For “other” assets with long lives:"]
["TRAB0601","Opening value",190093507.4656122,197319401.2625581,199335501.39093348,201217557.73706791,200489386.13819313,199964030.06909439,197930407.50196871]
["TRAB0602","Inflation addition",0,0,0,0,0,0,0]
["TRAB0603","Straight line depreciation",-4379491.5042999974,-5217989.27950822,-5768061.5734544732,-6388056.8689481905,-6720573.5276922155,-6306316.5702762362,-6467924.6311123483]
["TRAB0605","Actual additions (recognised in RAB)",11605385.301245909,7234089.4078836022,7650117.9195888983,5659885.2700734204,6195217.4585934831,4272694.0031505497,5667703.1096417177]
["TRAB0606","Disposals ",0,0,0,0,0,0,0]
["TRAB0607","Closing value ",{"$f":"SUM(C52:C56)","v":197319401.2625581},{"$f":"SUM(D52:D56)","v":199335501.39093348},{"$f":"SUM(E52:E56)","v":201217557.73706791},{"$f":"SUM(F52:F56)","v":200489386.13819313},{"$f":"SUM(G52:G56)","v":199964030.06909439},{"$f":"SUM(H52:H56)","v":197930407.50196871},{"$f":"SUM(I52:I56)","v":197130185.98049811}]
[null,"For “other” assets with short lives:"]
["TRAB0701","Opening value",18349669.496136434,15968261.252554253,15192960.947663626,18424620.952179704,22365636.605628122,24995447.549639195,25242327.673973478]
["TRAB0702","Inflation addition",0,0,0,0,0,0,0]
["TRAB0703","Straight line depreciation",-8864176.9535424411,-10636693.514575636,-2718880.4762460394,-3744506.4694210379,-4393121.5216977401,-5369338.3149054274,-6102857.5015476849]
["TRAB0705","Actual additions (recognised in RAB)",6482768.7099602586,9861393.209685009,5950540.4807621166,7685522.1228694553,7022932.4657088127,5616218.4392397106,4985601.0690084016]
["TRAB0706","Disposals ",0,0,0,0,0,0,0]
["TRAB0707","Closing value ",{"$f":"SUM(C59:C63)","v":15968261.252554253},{"$f":"SUM(D59:D63)","v":15192960.947663626},{"$f":"SUM(E59:E63)","v":18424620.952179704},{"$f":"SUM(F59:F63)","v":22365636.605628122},{"$f":"SUM(G59:G63)","v":24995447.549639195},{"$f":"SUM(H59:H63)","v":25242327.673973478},{"$f":"SUM(I59:I63)","v":24125071.241434194}]
[]
[]
[]
[null,"3.3.3 - TOTAL DISAGGREGATED RAB ASSET VALUES"]
[null,null,{"$f":"CONCATENATE(\"Forecast ($0's, real \",dms_DollarReal,\")\")","v":"Forecast ($0's, real June 2019)"}]
[null,null,{"$f":"CRCP_y4","v":"2017-18"},{"$f":"CRCP_y5","v":"2018-19"},{"$f":"FRCP_y1","v":"2019-20"},{"$f":"FRCP_y2","v":"2020-21"},{"$f":"FRCP_y3","v":"2021-22"},{"$f":"FRCP_y4","v":"2022-23"},{"$f":"FRCP_y5","v":"2023-24"}]
["TRAB0801","Overhead transmission assets (wires and towers/poles etc)",508869261.8563022,509578416.95308709,509748708.75292194,504237797.32607818,498841795.36867362,495921683.38376582,490638828.05711257]
["TRAB0802","Underground transmission assets (cables, ducts etc)",30058043.629790451,29288907.316384133,28474862.723451041,27616930.556763988,26746870.913870394,25869784.978695199,24985707.21139181]
["TRAB0803","Substations, switchyards, Transformers etc with transmission function",720766845.89382935,710726666.83087683,697921540.50668776,697808557.88202369,710010412.22385776,711257154.42929435,702734412.84039426]
["TRAB0804","Easements",6853104.097813216,7180844.5100918608,7550578.053788106,7936945.9867429286,8617215.678733984,9520505.0365152862,10406530.168053279]
["TRAB0805","Other assets with long lives",193706454.36408517,198327451.32674581,200276529.56400073,200853471.93763056,200226708.10364377,198947218.78553158,197530296.74123341]
["TRAB0806","Other assets with short lives",17158965.374345344,15580611.100108938,16808790.949921664,20395128.778903913,23680542.077633653,25118887.611806329,24683699.457703829]
[]
[]
[null,"3.3.4 - ASSET LIVES"]
[null,null,"Asset Life"]
[null,null,{"$f":"CRCP_y4","v":"2017-18"},{"$f":"CRCP_y5","v":"2018-19"},{"$f":"FRCP_y1","v":"2019-20"},{"$f":"FRCP_y2","v":"2020-21"},{"$f":"FRCP_y3","v":"2021-22"},{"$f":"FRCP_y4","v":"2022-23"},{"$f":"FRCP_y5","v":"2023-24"}]
[null,"ESTIMATED SERVICE LIFE OF NEW ASSETS"]
["TRAB0901","Overhead transmission assets (wires and towers/poles etc)",57.311502369989654,57.311502369989654,57.311502369989654,57.311502369989654,57.311502369989654,57.311502369989654,57.311502369989654]
["TRAB0902","Underground transmission assets (cables, ducts etc)",45.798817488851249,45.798817488851249,45.798817488851249,45.798817488851249,45.798817488851249,45.798817488851249,45.798817488851249]
["TRAB0903","Substations, switchyards, Transformers etc with transmission function",40.927186431281207,40.927186431281207,40.927186431281207,40.927186431281207,40.927186431281207,40.927186431281207,40.927186431281207]
["TRAB0904","Other assets with long lives",29.641675967301328,29.641675967301328,29.641675967301328,29.641675967301328,29.641675967301328,29.641675967301328,29.641675967301328]
["TRAB0905","Other assets with short lives",6.8898522439534773,6.8898522439534773,6.8898522439534773,6.8898522439534773,6.8898522439534773,6.8898522439534773,6.8898522439534773]
[null,"ESTIMATED RESIDUAL SERVICE LIFE"]
["TRAB1001","Overhead transmission assets ",39.889060150895638,39.660617286747105,39.077677158021885,38.430246667131968,37.900532218417403,37.482971296464846,36.892462547058457]
["TRAB1002","Underground transmission assets",28.516666666666666,28.033333333333331,27.549999999999997,27.066666666666663,26.583333333333329,26.099999999999994,25.61666666666666]
["TRAB1003","Switchyard, substation and transformer assets",31.748056235566747,31.345274959737864,30.518473041494058,30.019459163729667,30.108126671806495,29.823262911844729,29.381226949219482]
["TRAB1004","Other assets with long lives",23.965830990358651,23.140305231384112,22.251463613039999,22.306071226838817,22.262304406195675,21.813034099050352,20.906728215535932]
["TRAB1005","Other assets with short lives",5.4711862114128866,5.6147265656045224,5.0531925837970304,4.4493258253845109,4.2908318790060171,4.3569031408694459,4.31444439338311]

{"sheet":"3.4 Operational data","index":19,"n_rows":90,"n_cols":10,"rows_kept":90,"cut":false,"hidden":false,"merged":[[8,3,8,9],[28,3,28,9],[59,3,59,9]]}
[null,{"$f":"(LOOKUP(dms_Model,dms_Model_List,dms_Worksheet_List))","v":"REGULATORY REPORTING STATEMENT"}]
[null,{"$f":"INDEX(dms_TradingNameFull_List,MATCH(dms_TradingName,dms_TradingName_List))","v":"TasNetworks (T)"}]
[null,{"$f":"IF(SUM(dms_SingleYear_Model)>0,CRY,CONCATENATE(FRCP_y1,\" to \",dms_MultiYear_FinalYear_Result))","v":"2019-20 to 2023-24"}]
[null,"3.4 OPERATIONAL DATA"]
[]
[null,"There are THREE tables on this worksheet. Each table has been grouped for ease of navigation. See the Instructions sheet on how to group or ungroup tables. "]
[]
[null,"3.4.1 - ENERGY DELIVERY"]
[null,null,null,"Forecast (0's)"]
[null,null,"Units",{"$f":"CRCP_y4","v":"2017-18"},{"$f":"CRCP_y5","v":"2018-19"},{"$f":"FRCP_y1","v":"2019-20"},{"$f":"FRCP_y2","v":"2020-21"},{"$f":"FRCP_y3","v":"2021-22"},{"$f":"FRCP_y4","v":"2022-23"},{"$f":"FRCP_y5","v":"2023-24"}]
[null,"Energy grouping by downstream connection type"]
["TOPED0101","To Other connected transmission networks","GWh",2388.5978689499971,2388.5978689499971,2388.5978689499971,2388.5978689499971,2388.5978689499971,2388.5978689499971,2388.5978689499971]
["TOPED0102","To Distribution networks","GWh",4121.7279973190216,4185.8837189921614,4259.2937157575161,4332.9072676274072,4404.6659642786817,4474.0730274702928,4546.0039838688717]
["TOPED0103","To Directly connected end–users (330 kV)","GWh",0,0,0,0,0,0,0]
["TOPED0104","To Directly connected end–users (275 kV)","GWh",0,0,0,0,0,0,0]
["TOPED0105","To Directly connected end–users (220 kV)","GWh",2992.8502726584311,2992.8502726584311,2992.8502726584311,2992.8502726584311,3009.7458427215147,3009.7458427215147,3009.7458427215147]
["TOPED0106","To Directly connected end–users (132 kV)","GWh",0,0,0,0,0,0,0]
["TOPED0107","To Directly connected end–users (110 kV)","GWh",868.20542156699707,868.20542156699707,868.20542156699707,868.20542156699707,868.20542156699707,868.20542156699707,868.20542156699707]
["TOPED0108","To Directly connected end–users (44 kV) ","GWh",120.33794930629999,124.12270872881896,127.90746815133794,127.90746815133794,127.90746815133794,127.90746815133794,127.90746815133794]
["TOPED0109","To Directly connected end–users (33 kV)","GWh",0,0,0,0,0,0,0]
["TOPED0110","To Directly connected end–users (22 kV)","GWh",193.61598839200298,193.61598839200298,193.61598839200298,193.61598839200298,193.61598839200298,193.61598839200298,193.61598839200298]
["TOPED0111","To Directly connected end–users (11 kV)","GWh",1000.5817247900194,1000.5817247900194,1000.5817247900194,1000.5817247900194,1000.5817247900194,1000.5817247900194,1000.5817247900194]
["TOPED0112","To Directly connected end–users (6.6 kV)","GWh",734.38861281499408,734.38861281499408,734.38861281499408,734.38861281499408,734.38861281499408,734.38861281499408,734.38861281499408]
["TOPED0113","Pumping and Power Station Auxillaries","GWh",25.884955105999957,25.884955105999957,25.884955105999957,25.884955105999957,25.884955105999957,25.884955105999957,25.884955105999957]
["TOPED01","Total energy transported","GWh",{"$f":"SUM(D12:D24)","v":12446.190790903764},{"$f":"SUM(E12:E24)","v":12514.13127199942},{"$f":"SUM(F12:F24)","v":12591.326028187295},12664.939580057186,12753.593846771544,12823.000909963155,12894.931866361734]
[]
[]
[null,"3.4.2 -  CONNECTION POINTS"]
[null,null,null,"Forecast (0's)"]
[null,null,"Units",{"$f":"CRCP_y4","v":"2017-18"},{"$f":"CRCP_y5","v":"2018-19"},{"$f":"FRCP_y1","v":"2019-20"},{"$f":"FRCP_y2","v":"2020-21"},{"$f":"FRCP_y3","v":"2021-22"},{"$f":"FRCP_y4","v":"2022-23"},{"$f":"FRCP_y5","v":"2023-24"}]
[null,"Number of entry points at each transmission voltage level"]
["TOPCP0101","500kV","number",0,0,0,0,0,0,0]
["TOPCP0102","330kV","number",0,0,0,0,0,0,0]
["TOPCP0103","275kV","number",0,0,0,0,0,0,0]
["TOPCP0104","220kV","number",13,13,13,13,13,13,13]
["TOPCP0105","132 kV","number",0,0,0,0,0,0,0]
["TOPCP0106","110kV","number",13,13,13,13,13,13,13]
["TOPCP0107","66 kV","number",0,0,0,0,0,0,0]
["TOPCP0108","33 kV","number",0,0,0,0,0,0,0]
["TOPCP0109","22 kV","number",0,0,0,0,0,0,0]
["TOPCP0110","11 kV","number",0,0,0,0,0,0,0]
["TOPCP0111","6.6 kV","number",0,0,0,0,0,0,0]
[null,"Number of exit points at each transmission voltage level "]
["TOPCP0201","500kV","number",0,0,0,0,0,0,0]
["TOPCP0202","330kV","number",0,0,0,0,0,0,0]
["TOPCP0203","275kV","number",0,0,0,0,0,0,0]
["TOPCP0204","220kV","number",2,2,2,2,2,2,2]
["TOPCP0205","132 kV","number",0,0,0,0,0,0,0]
["TOPCP0206","110kV","number",3,3,3,3,3,3,3]
["TOPCP0207","66 kV","number",0,0,0,0,0,0,0]
["TOPCP0208","44 kV","number",1,1,1,1,1,1,1]
["TOPCP0209","33kV","number",5,5,5,5,5,5,5]
["TOPCP0210","22kV","number",28,28,28,28,28,29,29]
["TOPCP0211","11kV","number",14,14,14,14,14,14,14]
["TOPCP0212","6.6kV","number",3,3,3,3,3,3,3]
[]
[]
[]
[null,"3.4.3 - SYSTEM DEMAND"]
[null,null,null,"Forecast (0's)"]
[null,null,"Units",{"$f":"CRCP_y4","v":"2017-18"},{"$f":"CRCP_y5","v":"2018-19"},{"$f":"FRCP_y1","v":"2019-20"},{"$f":"FRCP_y2","v":"2020-21"},{"$f":"FRCP_y3","v":"2021-22"},{"$f":"FRCP_y4","v":"2022-23"},{"$f":"FRCP_y5","v":"2023-24"}]
[null,"Annual system maximum demand characteristics – MW measure"]
["TOPSD0101","Transmission System coincident maximum demand","MW",1854.3130124824088,1869.4827949707076,1886.7896262324905,1903.6849602179002,1922.1177729749368,1938.047644379468,1954.5567246347177]
["TOPSD0102","Transmission System coincident weather adjusted maximum demand 10% POE","MW",1902.7693186824886,1918.3355130064879,1936.0946007693733,1953.4314381425274,1972.345931183891,1988.6920768211487,2005.6325670069466]
["TOPSD0103","Transmission System coincident weather adjusted maximum demand 50% POE","MW",1880.0876438917473,1895.4682837431578,1913.0156769778296,1930.1458531948797,1948.8348788736032,1964.9861727462323,1981.7247263728177]
["TOPSD0104","Transmission System non-coincident summated maximum demand","MW",2318.7331366730623,2337.7022519707284,2359.3436484703316,2380.4704865518279,2403.5198711239682,2423.439442652606,2444.0832882095087]
["TOPSD0105","Transmission System non-coincident weather adjusted summated maximum demand 10% POE","MW",2367.1894428731421,2386.5549700065089,2408.6486230072146,2430.2169644764549,2453.7480293329227,2474.0838750942867,2495.1591305817378]
["TOPSD0106","Transmission System non-coincident weather adjusted summated maximum demand 50% POE","MW",2344.5077680824011,2363.6877407431789,2385.5696992156704,2406.9313795288076,2430.2369770226346,2450.3779710193703,2471.2512899476087]
[null,"Annual system maximum demand characteristics – MVA measure"]
["TOPSD0201","Transmission System coincident maximum demand","MVA",1870.1034755749013,1885.4024368420201,1902.8566449913337,1919.8958517457615,1938.4856297225704,1954.5511524679421,1971.2008163359403]
["TOPSD0202","Transmission System coincident weather adjusted maximum demand 10% POE","MVA",1918.9724130349143,1934.671161795683,1952.5814776511224,1970.0659474298297,1989.1415074551774,2005.6268492301165,2022.7115967140335]
["TOPSD0203","Transmission System coincident weather adjusted maximum demand 50% POE","MVA",1896.0975917008179,1911.6092058938191,1929.3060245293675,1946.5820733221385,1965.4302460101467,1981.7190767538841,1998.6001680812153]
["TOPSD0204","Transmission System non-coincident summated maximum demand","MVA",2383.0776637089971,2402.5731693587109,2424.8151116477975,2446.528216593133,2470.2172184309725,2490.6895553419204,2511.9062647862424]
["TOPSD0205","Transmission System non-coincident weather adjusted summated maximum demand 10% POE","MVA",2431.9466011690101,2451.8418943123738,2474.5399443075862,2496.6983122772021,2520.8730961635797,2541.765252104095,2563.4170451643358]
["TOPSD0206","Transmission System non-coincident weather adjusted summated maximum demand 50% POE","MVA",2409.0717798349137,2428.7799384105097,2451.264491185831,2473.2144381695107,2497.161834718549,2517.8574796278622,2539.3056165315174]
[null,"Power factor"]
[null,"Power factor conversion between MVA and MW"]
["TOPSD0301","Average overall network power factor conversion between MVA and MW","Factor",0.98121146300673123,0.98121146300673123,0.98121146300673123,0.98121146300673123,0.98121146300673123,0.98121146300673123,0.98121146300673123]
["TOPSD0302","Average power factor conversion for 500 kV lines","Factor"]
["TOPSD0303","Average power factor conversion for 330 kV lines","Factor"]
["TOPSD0304","Average power factor conversion for  275 kV lines","Factor"]
["TOPSD0305","Average power factor conversion for  220 kV lines","Factor",0.96714878129192738,0.96714878129192738,0.96714878129192738,0.96714878129192738,0.96714878129192738,0.96714878129192738,0.96714878129192738]
["TOPSD0306","Average power factor conversion for  132 kV lines","Factor"]
["TOPSD0307","Average power factor conversion for  110 kV lines","Factor",0.99471834526204195,0.99471834526204195,0.99471834526204195,0.99471834526204195,0.99471834526204195,0.99471834526204195,0.99471834526204195]
["TOPSD0308","Average power factor conversion for  88 kV lines","Factor"]
["TOPSD0309","Average power factor conversion for  66 kV lines","Factor"]
["TOPSD0310","Average power factor conversion for  33 kV lines","Factor",0.9945381004842484,0.9945381004842484,0.9945381004842484,0.9945381004842484,0.9945381004842484,0.9945381004842484,0.9945381004842484]
["TOPSD0311","Average power factor conversion for  22 kV lines","Factor",0.99444449324738959,0.99444449324738959,0.99444449324738959,0.99444449324738959,0.99444449324738959,0.99444449324738959,0.99444449324738959]
["TOPSD0311","Average power factor conversion for  11 kV lines","Factor",0.96756749805746267,0.96756749805746267,0.96756749805746267,0.96756749805746267,0.96756749805746267,0.96756749805746267,0.96756749805746267]
["TOPSD0312","Average power factor conversion for  6.6 kV lines","Factor",0.96969239333448309,0.96969239333448309,0.96969239333448309,0.96969239333448309,0.96969239333448309,0.96969239333448309,0.96969239333448309]

{"sheet":"3.5 Physical assets","index":20,"n_rows":75,"n_cols":10,"rows_kept":75,"cut":false,"hidden":false,"merged":[[9,3,9,9],[6,1,6,2]]}
[null,{"$f":"(LOOKUP(dms_Model,dms_Model_List,dms_Worksheet_List))","v":"REGULATORY REPORTING STATEMENT"}]
[null,{"$f":"INDEX(dms_TradingNameFull_List,MATCH(dms_TradingName,dms_TradingName_List))","v":"TasNetworks (T)"}]
[null,{"$f":"IF(SUM(dms_SingleYear_Model)>0,CRY,CONCATENATE(FRCP_y1,\" to \",dms_MultiYear_FinalYear_Result))","v":"2019-20 to 2023-24"}]
[null,"3.5 PHYSICAL ASSETS"]
[]
[]
[null,"There is ONE table on this worksheet. It has been sub-grouped for ease of navigation. See the Instructions sheet on how to group or ungroup tables. "]
[]
[null,"3.5.1 - TRANSMISSION SYSTEM CAPACITIES "]
[null,null,null,"Forecast (0's)"]
[null,null,"Units",{"$f":"CRCP_y4","v":"2017-18"},{"$f":"CRCP_y5","v":"2018-19"},{"$f":"FRCP_y1","v":"2019-20"},{"$f":"FRCP_y2","v":"2020-21"},{"$f":"FRCP_y3","v":"2021-22"},{"$f":"FRCP_y4","v":"2022-23"},{"$f":"FRCP_y5","v":"2023-24"}]
[null,"Overhead network length of circuit at each voltage"]
["TPA0101","500 kV","km",0,0,0,0,0,0,0]
["TPA0102","330 kV","km",0,0,0,0,0,0,0]
["TPA0103","275 kV","km",0,0,0,0,0,0,0]
["TPA0104","220 kV","km",1710.3,1710.3,1710.3,1710.3,1710.3,1710.3,1710.3]
["TPA0105","132 kV","km",0,0,0,0,0,0,0]
["TPA0106","110 kV","km",1829.6,1829.6,1829.6,1829.6,1829.6,1829.6,1829.6]
["TPA0107","88 kV","km",0,0,0,0,0,0,0]
["TPA0108","66 kV","km",0,0,0,0,0,0,0]
["TPA0109","33 kV","km",0,0,0,0,0,0,0]
["TPA0109","22 kV","km",0,0,0,0,0,0,0]
["TPA0109","11 kV","km",0,0,0,0,0,0,0]
["TPA01","Total",null,{"$f":"SUM(D13:D23)","v":3539.8999999999996},{"$f":"SUM(E13:E23)","v":3539.8999999999996},{"$f":"SUM(F13:F23)","v":3539.8999999999996},3539.8999999999996,3539.8999999999996,3539.8999999999996,3539.8999999999996]
[]
[null,"Underground cable circuit length at each voltage"]
["TPA0201","500 kV","km",0,0,0,0,0,0,0]
["TPA0202","330 kV","km",0,0,0,0,0,0,0]
["TPA0203","275 kV","km",0,0,0,0,0,0,0]
["TPA0204","220 kV","km",0,0,0,0,0,0,0]
["TPA0205","132 kV","km",0,0,0,0,0,0,0]
["TPA0206","110 kV","km",23.8,23.8,23.8,23.8,23.8,23.8,23.8]
["TPA0207","88 kV","km",0,0,0,0,0,0,0]
["TPA0208","66 kV","km",0,0,0,0,0,0,0]
["TPA0209","33 kV","km",0,0,0,0,0,0,0]
["TPA0210","22 kV","km",0,0,0,0,0,0,0]
["TPA0211","11 kV","km",0,0,0,0,0,0,0]
["TPA02","Total",null,{"$f":"SUM(D27:D37)","v":23.8},{"$f":"SUM(E27:E37)","v":23.8},{"$f":"SUM(F27:F37)","v":23.8},23.8,23.8,23.8,23.8]
[]
[null,"Estimated overhead network weighted average MVA capacity by voltage class"]
["TPA0301","500 kV","MVA",0,0,0,0,0,0,0]
["TPA0302","330 kV","MVA",0,0,0,0,0,0,0]
["TPA0303","275 kV","MVA",0,0,0,0,0,0,0]
["TPA0304","220 kV","MVA",397.6,397.6,397.6,397.6,397.6,397.6,397.6]
["TPA0305","132 kV","MVA",0,0,0,0,0,0,0]
["TPA0306","110 kV","MVA",105.8,105.8,105.8,105.8,105.8,105.8,105.8]
["TPA0307","88 kV","MVA",0,0,0,0,0,0,0]
["TPA0308","66 kV","MVA",0,0,0,0,0,0,0]
["TPA0309","33 kV","MVA",0,0,0,0,0,0,0]
["TPA0310","22 kV","MVA",0,0,0,0,0,0,0]
["TPA0311","11 kV","MVA",0,0,0,0,0,0,0]
[]
[null,"Estimated underground network weighted average MVA capacity by voltage class"]
["TPA0401","500 kV","MVA",0,0,0,0,0,0,0]
["TPA0402","330 kV","MVA",0,0,0,0,0,0,0]
["TPA0403","275 kV","MVA",0,0,0,0,0,0,0]
["TPA0404","220 kV","MVA",0,0,0,0,0,0,0]
["TPA0405","132 kV","MVA",0,0,0,0,0,0,0]
["TPA0406","110 kV","MVA",142.6,142.6,142.6,142.6,142.6,142.6,142.6]
["TPA0407","88 kV","MVA",0,0,0,0,0,0,0]
["TPA0408","66 kV","MVA",0,0,0,0,0,0,0]
["TPA0409","33 kV","MVA",0,0,0,0,0,0,0]
["TPA0410","22 kV","MVA",0,0,0,0,0,0,0]
["TPA0411","11 kV","MVA",0,0,0,0,0,0,0]
[]
[null,"Installed transmission system transformer capacity"]
["TPA0501","Transmission substations (eg 500 kV to 330 kV)","MVA",3640,3640,3640,3640,3640,3640,3640]
["TPA0502","Terminal points to DNSP systems","MVA",3339,3369,3369,3369,3369,3369,3447]
["TPA0503","Transformer capacity for directly connected end–users owned by the TNSP","MVA",605,605,605,605,605,605,605]
["TPA0504","Transformer capacity for directly connected end–users owned by the end–user","MVA",467,467,467,467,467,467,467]
["TPA0505","Interconnector capacity","MVA",520,520,520,520,520,520,520]
["TPA0506","Other","MVA",0,0,0,0,0,0,0]
[]
[null,"Cold spare capacity"]
["TPA06","Cold spare capacity included in 3.5.1.5","MVA",370,498.5,498.5,498.5,498.5,498.5,498.5]

{"sheet":"3.7 Operating environment","index":21,"n_rows":25,"n_cols":10,"rows_kept":25,"cut":false,"hidden":false,"merged":[[7,3,7,9],[19,3,19,9]]}
[null,{"$f":"(LOOKUP(dms_Model,dms_Model_List,dms_Worksheet_List))","v":"REGULATORY REPORTING STATEMENT"}]
[null,{"$f":"INDEX(dms_TradingNameFull_List,MATCH(dms_TradingName,dms_TradingName_List))","v":"TasNetworks (T)"}]
[null,{"$f":"IF(SUM(dms_SingleYear_Model)>0,CRY,CONCATENATE(FRCP_y1,\" to \",dms_MultiYear_FinalYear_Result))","v":"2019-20 to 2023-24"}]
[null,"3.7 OPERATING ENVIRONMENT FACTORS"]
[]
[]
["TEF01","3.7.1 - TERRAIN FACTORS"]
[null,null,null,"Forecast (0's)"]
[null,null,"Units",{"$f":"CRCP_y4","v":"2017-18"},{"$f":"CRCP_y5","v":"2018-19"},{"$f":"FRCP_y1","v":"2019-20"},{"$f":"FRCP_y2","v":"2020-21"},{"$f":"FRCP_y3","v":"2021-22"},{"$f":"FRCP_y4","v":"2022-23"},{"$f":"FRCP_y5","v":"2023-24"}]
["TEF0101","Total number of vegetation maintenance spans","Number of spans",940]
["TEF0102","Average vegetation maintenance span cycle","Years",5]
["TEF0103","Average number of trees per vegetation maintenance span","Trees",1266]
["TEF0104","Average number of defects per vegetation maintenance span","Defects",1]
["TEF0105","Tropical proportion","Number of spans",0]
["TEF0106","Standard vehicle access","km",2302]
["TEF0107","Altitude","km",492]
["TEF0108","Bushfire risk","Number of spans",204]
[]
["TEF02","3.7.2 - NETWORK CHARACTERISTICS"]
[null,null,null,"Forecast (0's)"]
[null,null,"Units",{"$f":"CRCP_y4","v":"2017-18"},{"$f":"CRCP_y5","v":"2018-19"},{"$f":"FRCP_y1","v":"2019-20"},{"$f":"FRCP_y2","v":"2020-21"},{"$f":"FRCP_y3","v":"2021-22"},{"$f":"FRCP_y4","v":"2022-23"},{"$f":"FRCP_y5","v":"2023-24"}]
["TEF0201","Route line length","km",2340,2317,2294,2294,2294,2294,2294]
["TEF0202","Variability of dispatch","%",0.92359999999999998,0.92359999999999998,0.92359999999999998,0.92359999999999998,0.92359999999999998,0.92359999999999998,0.92359999999999998]
["TEF0203","Concentrated load distance","km",319,319,319,319,319,319,319]
["TEF0204","Total number of spans","number",7802,7705,7608,7608,7608,7608,7608]

{"sheet":"5.4 MD & Utilisation - Spatial","index":22,"n_rows":4881,"n_cols":23,"rows_kept":4881,"cut":false,"hidden":false,"merged":[[5,1,5,2],[17,2,18,2],[17,3,18,3],[19,2,20,2],[19,3,20,3],[21,2,22,2],[21,3,22,3],[4879,3,4880,3],[9,1,22,1],[9,2,10,2],[9,3,10,3],[11,2,12,2],[11,3,12,3],[13,2,14,2],[13,3,14,3],[15,2,16,2],[15,3,16,3],[4867,3,4868,3],[4869,3,4870,3],[4871,3,4872,3],[4873,3,4874,3],[4875,3,4876,3],[4877,3,4878,3],[4867,1,4880,1],[4867,2,4868,2],[4869,2,4870,2],[4871,2,4872,2],[4873,2,4874,2],[4875,2,4876,2],[4877,2,4878,2],[4879,2,4880,2],[41,2,42,2],[41,3,42,3],[43,2,44,2],[43,3,44,3],[45,2,46,2],[45,3,46,3],[31,3,32,3],[33,2,34,2],[33,3,34,3],[35,2,36,2],[35,3,36,3],[37,1,50,1],[37,2,38,2],[37,3,38,3],[39,2,40,2],[39,3,40,3],[23,1,36,1],[23,2,24,2],[23,3,24,3],[25,2,26,2],[25,3,26,3],[27,2,28,2],[27,3,28,3],[29,2,30,2],[29,3,30,3],[31,2,32,2],[55,3,56,3],[57,2,58,2],[57,3,58,3],[59,2,60,2],[59,3,60,3],[61,2,62,2],[61,3,62,3],[47,2,48,2],[47,3,48,3],[49,2,50,2],[49,3,50,3],[51,1,64,1],[51,2,52,2],[51,3,52,3],[53,2,54,2],[53,3,54,3],[55,2,56,2],[71,3,72,3],[73,2,74,2],[73,3,74,3],[75,2,76,2],[75,3,76,3],[77,2,78,2],[77,3,78,3],[63,2,64,2],[63,3,64,3],[65,1,78,1],[65,2,66,2],[65,3,66,3],[67,2,68,2],[67,3,68,3],[69,2,70,2],[69,3,70,3],[71,2,72,2],[97,2,98,2],[97,3,98,3],[99,2,100,2],[99,3,100,3],[101,2,102,2],[101,3,102,3],[87,3,88,3],[89,2,90,2],[89,3,90,3],[91,2,92,2],[91,3,92,3],[93,1,106,1],[93,2,94,2],[93,3,94,3],[95,2,96,2],[95,3,96,3],[79,1,92,1],[79,2,80,2],[79,3,80,3],[81,2,82,2],[81,3,82,3],[83,2,84,2],[83,3,84,3],[85,2,86,2],[85,3,86,3],[87,2,88,2],[111,3,112,3],[113,2,114,2],[113,3,114,3],[115,2,116,2],[115,3,116,3],[117,2,118,2],[117,3,118,3],[103,2,104,2],[103,3,104,3],[105,2,106,2],[105,3,106,3],[107,1,120,1],[107,2,108,2],[107,3,108,3],[109,2,110,2],[109,3,110,3],[111,2,112,2],[127,3,128,3],[129,2,130,2],[129,3,130,3],[131,2,132,2],[131,3,132,3],[133,2,134,2],[133,3,134,3],[119,2,120,2],[119,3,120,3],[121,1,134,1],[121,2,122,2],[121,3,122,3],[123,2,124,2],[123,3,124,3],[125,2,126,2],[125,3,126,3],[127,2,128,2],[153,2,154,2],[153,3,154,3],[155,2,156,2],[155,3,156,3],[157,2,158,2],[157,3,158,3],[143,3,144,3],[145,2,146,2],[145,3,146,3],[147,2,148,2],[147,3,148,3],[149,1,162,1],[149,2,150,2],[149,3,150,3],[151,2,152,2],[151,3,152,3],[135,1,148,1],[135,2,136,2],[135,3,136,3],[137,2,138,2],[137,3,138,3],[139,2,140,2],[139,3,140,3],[141,2,142,2],[141,3,142,3],[143,2,144,2],[167,3,168,3],[169,2,170,2],[169,3,170,3],[171,2,172,2],[171,3,172,3],[173,2,174,2],[173,3,174,3],[159,2,160,2],[159,3,160,3],[161,2,162,2],[161,3,162,3],[163,1,176,1],[163,2,164,2],[163,3,164,3],[165,2,166,2],[165,3,166,3],[167,2,168,2],[183,3,184,3],[185,2,186,2],[185,3,186,3],[187,2,188,2],[187,3,188,3],[189,2,190,2],[189,3,190,3],[175,2,176,2],[175,3,176,3],[177,1,190,1],[177,2,178,2],[177,3,178,3],[179,2,180,2],[179,3,180,3],[181,2,182,2],[181,3,182,3],[183,2,184,2],[209,2,210,2],[209,3,210,3],[211,2,212,2],[211,3,212,3],[213,2,214,2],[213,3,214,3],[199,3,200,3],[201,2,202,2],[201,3,202,3],[203,2,204,2],[203,3,204,3],[205,1,218,1],[205,2,206,2],[205,3,206,3],[207,2,208,2],[207,3,208,3],[191,1,204,1],[191,2,192,2],[191,3,192,3],[193,2,194,2],[193,3,194,3],[195,2,196,2],[195,3,196,3],[197,2,198,2],[197,3,198,3],[199,2,200,2],[223,3,224,3],[225,2,226,2],[225,3,226,3],[227,2,228,2],[227,3,228,3],[229,2,230,2],[229,3,230,3],[215,2,216,2],[215,3,216,3],[217,2,218,2],[217,3,218,3],[219,1,232,1],[219,2,220,2],[219,3,220,3],[221,2,222,2],[221,3,222,3],[223,2,224,2],[239,3,240,3],[241,2,242,2],[241,3,242,3],[243,2,244,2],[243,3,244,3],[245,2,246,2],[245,3,246,3],[231,2,232,2],[231,3,232,3],[233,1,246,1],[233,2,234,2],[233,3,234,3],[235,2,236,2],[235,3,236,3],[237,2,238,2],[237,3,238,3],[239,2,240,2],[265,2,266,2],[265,3,266,3],[267,2,268,2],[267,3,268,3],[269,2,270,2],[269,3,270,3],[255,3,256,3],[257,2,258,2],[257,3,258,3],[259,2,260,2],[259,3,260,3],[261,1,274,1],[261,2,262,2],[261,3,262,3],[263,2,264,2],[263,3,264,3],[247,1,260,1],[247,2,248,2],[247,3,248,3],[249,2,250,2],[249,3,250,3],[251,2,252,2],[251,3,252,3],[253,2,254,2],[253,3,254,3],[255,2,256,2],[279,3,280,3],[281,2,282,2],[281,3,282,3],[283,2,284,2],[283,3,284,3],[285,2,286,2],[285,3,286,3],[271,2,272,2],[271,3,272,3],[273,2,274,2],[273,3,274,3],[275,1,288,1],[275,2,276,2],[275,3,276,3],[277,2,278,2],[277,3,278,3],[279,2,280,2],[295,3,296,3],[297,2,298,2],[297,3,298,3],[299,2,300,2],[299,3,300,3],[301,2,302,2],[301,3,302,3],[287,2,288,2],[287,3,288,3],[289,1,302,1],[289,2,290,2],[289,3,290,3],[291,2,292,2],[291,3,292,3],[293,2,294,2],[293,3,294,3],[295,2,296,2],[321,2,322,2],[321,3,322,3],[323,2,324,2],[323,3,324,3],[325,2,326,2],[325,3,326,3],[311,3,312,3],[313,2,314,2],[313,3,314,3],[315,2,316,2],[315,3,316,3],[317,1,330,1],[317,2,318,2],[317,3,318,3],[319,2,320,2],[319,3,320,3],[303,1,316,1],[303,2,304,2],[303,3,304,3],[305,2,306,2],[305,3,306,3],[307,2,308,2],[307,3,308,3],[309,2,310,2],[309,3,310,3],[311,2,312,2],[335,3,336,3],[337,2,338,2],[337,3,338,3],[339,2,340,2],[339,3,340,3],[341,2,342,2],[341,3,342,3],[327,2,328,2],[327,3,328,3],[329,2,330,2],[329,3,330,3],[331,1,344,1],[331,2,332,2],[331,3,332,3],[333,2,334,2],[333,3,334,3],[335,2,336,2],[351,3,352,3],[353,2,354,2],[353,3,354,3],[355,2,356,2],[355,3,356,3],[357,2,358,2],[357,3,358,3],[343,2,344,2],[343,3,344,3],[345,1,358,1],[345,2,346,2],[345,3,346,3],[347,2,348,2],[347,3,348,3],[349,2,350,2],[349,3,350,3],[351,2,352,2],[377,2,378,2],[377,3,378,3],[379,2,380,2],[379,3,380,3],[381,2,382,2],[381,3,382,3],[367,3,368,3],[369,2,370,2],[369,3,370,3],[371,2,372,2],[371,3,372,3],[373,1,386,1],[373,2,374,2],[373,3,374,3],[375,2,376,2],[375,3,376,3],[359,1,372,1],[359,2,360,2],[359,3,360,3],[361,2,362,2],[361,3,362,3],[363,2,364,2],[363,3,364,3],[365,2,366,2],[365,3,366,3],[367,2,368,2],[391,3,392,3],[393,2,394,2],[393,3,394,3],[395,2,396,2],[395,3,396,3],[397,2,398,2],[397,3,398,3],[383,2,384,2],[383,3,384,3],[385,2,386,2],[385,3,386,3],[387,1,400,1],[387,2,388,2],[387,3,388,3],[389,2,390,2],[389,3,390,3],[391,2,392,2],[407,3,408,3],[409,2,410,2],[409,3,410,3],[411,2,412,2],[411,3,412,3],[413,2,414,2],[413,3,414,3],[399,2,400,2],[399,3,400,3],[401,1,414,1],[401,2,402,2],[401,3,402,3],[403,2,404,2],[403,3,404,3],[405,2,406,2],[405,3,406,3],[407,2,408,2],[433,2,434,2],[433,3,434,3],[435,2,436,2],[435,3,436,3],[437,2,438,2],[437,3,438,3],[423,3,424,3],[425,2,426,2],[425,3,426,3],[427,2,428,2],[427,3,428,3],[429,1,442,1],[429,2,430,2],[429,3,430,3],[431,2,432,2],[431,3,432,3],[415,1,428,1],[415,2,416,2],[415,3,416,3],[417,2,418,2],[417,3,418,3],[419,2,420,2],[419,3,420,3],[421,2,422,2],[421,3,422,3],[423,2,424,2],[447,3,448,3],[449,2,450,2],[449,3,450,3],[451,2,452,2],[451,3,452,3],[453,2,454,2],[453,3,454,3],[439,2,440,2],[439,3,440,3],[441,2,442,2],[441,3,442,3],[443,1,456,1],[443,2,444,2],[443,3,444,3],[445,2,446,2],[445,3,446,3],[447,2,448,2],[463,3,464,3],[465,2,466,2],[465,3,466,3],[467,2,468,2],[467,3,468,3],[469,2,470,2],[469,3,470,3],[455,2,456,2],[455,3,456,3],[457,1,470,1],[457,2,458,2],[457,3,458,3],[459,2,460,2],[459,3,460,3],[461,2,462,2],[461,3,462,3],[463,2,464,2],[489,2,490,2],[489,3,490,3],[491,2,492,2],[491,3,492,3],[493,2,494,2],[493,3,494,3],[479,3,480,3],[481,2,482,2],[481,3,482,3],[483,2,484,2],[483,3,484,3],[485,1,498,1],[485,2,486,2],[485,3,486,3],[487,2,488,2],[487,3,488,3],[471,1,484,1],[471,2,472,2],[471,3,472,3],[473,2,474,2],[473,3,474,3],[475,2,476,2],[475,3,476,3],[477,2,478,2],[477,3,478,3],[479,2,480,2],[503,3,504,3],[505,2,506,2],[505,3,506,3],[507,2,508,2],[507,3,508,3],[509,2,510,2],[509,3,510,3],[495,2,496,2],[495,3,496,3],[497,2,498,2],[497,3,498,3],[499,1,512,1],[499,2,500,2],[499,3,500,3],[501,2,502,2],[501,3,502,3],[503,2,504,2],[519,3,520,3],[521,2,522,2],[521,3,522,3],[523,2,524,2],[523,3,524,3],[525,2,526,2],[525,3,526,3],[511,2,512,2],[511,3,512,3],[513,1,526,1],[513,2,514,2],[513,3,514,3],[515,2,516,2],[515,3,516,3],[517,2,518,2],[517,3,518,3],[519,2,520,2],[545,2,546,2],[545,3,546,3],[547,2,548,2],[547,3,548,3],[549,2,550,2],[549,3,550,3],[535,3,536,3],[537,2,538,2],[537,3,538,3],[539,2,540,2],[539,3,540,3],[541,1,554,1],[541,2,542,2],[541,3,542,3],[543,2,544,2],[543,3,544,3],[527,1,540,1],[527,2,528,2],[527,3,528,3],[529,2,530,2],[529,3,530,3],[531,2,532,2],[531,3,532,3],[533,2,534,2],[533,3,534,3],[535,2,536,2],[559,3,560,3],[561,2,562,2],[561,3,562,3],[563,2,564,2],[563,3,564,3],[565,2,566,2],[565,3,566,3],[551,2,552,2],[551,3,552,3],[553,2,554,2],[553,3,554,3],[555,1,568,1],[555,2,556,2],[555,3,556,3],[557,2,558,2],[557,3,558,3],[559,2,560,2],[575,3,576,3],[577,2,578,2],[577,3,578,3],[579,2,580,2],[579,3,580,3],[581,2,582,2],[581,3,582,3],[567,2,568,2],[567,3,568,3],[569,1,582,1],[569,2,570,2],[569,3,570,3],[571,2,572,2],[571,3,572,3],[573,2,574,2],[573,3,574,3],[575,2,576,2],[601,2,602,2],[601,3,602,3],[603,2,604,2],[603,3,604,3],[605,2,606,2],[605,3,606,3],[591,3,592,3],[593,2,594,2],[593,3,594,3],[595,2,596,2],[595,3,596,3],[597,1,610,1],[597,2,598,2],[597,3,598,3],[599,2,600,2],[599,3,600,3],[583,1,596,1],[583,2,584,2],[583,3,584,3],[585,2,586,2],[585,3,586,3],[587,2,588,2],[587,3,588,3],[589,2,590,2],[589,3,590,3],[591,2,592,2],[615,3,616,3],[617,2,618,2],[617,3,618,3],[619,2,620,2],[619,3,620,3],[621,2,622,2],[621,3,622,3],[607,2,608,2],[607,3,608,3],[609,2,610,2],[609,3,610,3],[611,1,624,1],[611,2,612,2],[611,3,612,3],[613,2,614,2],[613,3,614,3],[615,2,616,2],[631,3,632,3],[633,2,634,2],[633,3,634,3],[635,2,636,2],[635,3,636,3],[637,2,638,2],[637,3,638,3],[623,2,624,2],[623,3,624,3],[625,1,638,1],[625,2,626,2],[625,3,626,3],[627,2,628,2],[627,3,628,3],[629,2,630,2],[629,3,630,3],[631,2,632,2],[657,2,658,2],[657,3,658,3],[659,2,660,2],[659,3,660,3],[661,2,662,2],[661,3,662,3],[647,3,648,3],[649,2,650,2],[649,3,650,3],[651,2,652,2],[651,3,652,3],[653,1,666,1],[653,2,654,2],[653,3,654,3],[655,2,656,2],[655,3,656,3],[639,1,652,1],[639,2,640,2],[639,3,640,3],[641,2,642,2],[641,3,642,3],[643,2,644,2],[643,3,644,3],[645,2,646,2],[645,3,646,3],[647,2,648,2],[671,3,672,3],[673,2,674,2],[673,3,674,3],[675,2,676,2],[675,3,676,3],[677,2,678,2],[677,3,678,3],[663,2,664,2],[663,3,664,3],[665,2,666,2],[665,3,666,3],[667,1,680,1],[667,2,668,2],[667,3,668,3],[669,2,670,2],[669,3,670,3],[671,2,672,2],[687,3,688,3],[689,2,690,2],[689,3,690,3],[691,2,692,2],[691,3,692,3],[693,2,694,2],[693,3,694,3],[679,2,680,2],[679,3,680,3],[681,1,694,1],[681,2,682,2],[681,3,682,3],[683,2,684,2],[683,3,684,3],[685,2,686,2],[685,3,686,3],[687,2,688,2],[713,2,714,2],[713,3,714,3],[715,2,716,2],[715,3,716,3],[717,2,718,2],[717,3,718,3],[703,3,704,3],[705,2,706,2],[705,3,706,3],[707,2,708,2],[707,3,708,3],[709,1,722,1],[709,2,710,2],[709,3,710,3],[711,2,712,2],[711,3,712,3],[695,1,708,1],[695,2,696,2],[695,3,696,3],[697,2,698,2],[697,3,698,3],[699,2,700,2],[699,3,700,3],[701,2,702,2],[701,3,702,3],[703,2,704,2],[727,3,728,3],[729,2,730,2],[729,3,730,3],[731,2,732,2],[731,3,732,3],[733,2,734,2],[733,3,734,3],[719,2,720,2],[719,3,720,3],[721,2,722,2],[721,3,722,3],[723,1,736,1],[723,2,724,2],[723,3,724,3],[725,2,726,2],[725,3,726,3],[727,2,728,2],[743,3,744,3],[745,2,746,2],[745,3,746,3],[747,2,748,2],[747,3,748,3],[749,2,750,2],[749,3,750,3],[735,2,736,2],[735,3,736,3],[737,1,750,1],[737,2,738,2],[737,3,738,3],[739,2,740,2],[739,3,740,3],[741,2,742,2],[741,3,742,3],[743,2,744,2],[769,2,770,2],[769,3,770,3],[771,2,772,2],[771,3,772,3],[773,2,774,2],[773,3,774,3],[759,3,760,3],[761,2,762,2],[761,3,762,3],[763,2,764,2],[763,3,764,3],[765,1,778,1],[765,2,766,2],[765,3,766,3],[767,2,768,2],[767,3,768,3],[751,1,764,1],[751,2,752,2],[751,3,752,3],[753,2,754,2],[753,3,754,3],[755,2,756,2],[755,3,756,3],[757,2,758,2],[757,3,758,3],[759,2,760,2],[783,3,784,3],[785,2,786,2],[785,3,786,3],[787,2,788,2],[787,3,788,3],[789,2,790,2],[789,3,790,3],[775,2,776,2],[775,3,776,3],[777,2,778,2],[777,3,778,3],[779,1,792,1],[779,2,780,2],[779,3,780,3],[781,2,782,2],[781,3,782,3],[783,2,784,2],[799,3,800,3],[801,2,802,2],[801,3,802,3],[803,2,804,2],[803,3,804,3],[805,2,806,2],[805,3,806,3],[791,2,792,2],[791,3,792,3],[793,1,806,1],[793,2,794,2],[793,3,794,3],[795,2,796,2],[795,3,796,3],[797,2,798,2],[797,3,798,3],[799,2,800,2],[825,2,826,2],[825,3,826,3],[827,2,828,2],[827,3,828,3],[829,2,830,2],[829,3,830,3],[815,3,816,3],[817,2,818,2],[817,3,818,3],[819,2,820,2],[819,3,820,3],[821,1,834,1],[821,2,822,2],[821,3,822,3],[823,2,824,2],[823,3,824,3],[807,1,820,1],[807,2,808,2],[807,3,808,3],[809,2,810,2],[809,3,810,3],[811,2,812,2],[811,3,812,3],[813,2,814,2],[813,3,814,3],[815,2,816,2],[839,3,840,3],[841,2,842,2],[841,3,842,3],[843,2,844,2],[843,3,844,3],[845,2,846,2],[845,3,846,3],[831,2,832,2],[831,3,832,3],[833,2,834,2],[833,3,834,3],[835,1,848,1],[835,2,836,2],[835,3,836,3],[837,2,838,2],[837,3,838,3],[839,2,840,2],[855,3,856,3],[857,2,858,2],[857,3,858,3],[859,2,860,2],[859,3,860,3],[861,2,862,2],[861,3,862,3],[847,2,848,2],[847,3,848,3],[849,1,862,1],[849,2,850,2],[849,3,850,3],[851,2,852,2],[851,3,852,3],[853,2,854,2],[853,3,854,3],[855,2,856,2],[881,2,882,2],[881,3,882,3],[883,2,884,2],[883,3,884,3],[885,2,886,2],[885,3,886,3],[871,3,872,3],[873,2,874,2],[873,3,874,3],[875,2,876,2],[875,3,876,3],[877,1,890,1],[877,2,878,2],[877,3,878,3],[879,2,880,2],[879,3,880,3],[863,1,876,1],[863,2,864,2],[863,3,864,3],[865,2,866,2],[865,3,866,3],[867,2,868,2],[867,3,868,3],[869,2,870,2],[869,3,870,3],[871,2,872,2],[895,3,896,3],[897,2,898,2],[897,3,898,3],[899,2,900,2],[899,3,900,3],[901,2,902,2],[901,3,902,3],[887,2,888,2],[887,3,888,3],[889,2,890,2],[889,3,890,3],[891,1,904,1],[891,2,892,2],[891,3,892,3],[893,2,894,2],[893,3,894,3],[895,2,896,2],[911,3,912,3],[913,2,914,2],[913,3,914,3],[915,2,916,2],[915,3,916,3],[917,2,918,2],[917,3,918,3],[903,2,904,2],[903,3,904,3],[905,1,918,1],[905,2,906,2],[905,3,906,3],[907,2,908,2],[907,3,908,3],[909,2,910,2],[909,3,910,3],[911,2,912,2],[937,2,938,2],[937,3,938,3],[939,2,940,2],[939,3,940,3],[941,2,942,2],[941,3,942,3],[927,3,928,3],[929,2,930,2],[929,3,930,3]],"merged_total":5221,"flags":["merged_cut"]}
[null,{"$f":"(LOOKUP(dms_Model,dms_Model_List,dms_Worksheet_List))","v":"REGULATORY REPORTING STATEMENT"}]
[null,{"$f":"INDEX(dms_TradingNameFull_List,MATCH(dms_TradingName,dms_TradingName_List))","v":"TasNetworks (T)"}]
[null,{"$f":"IF(SUM(dms_SingleYear_Model)>0,CRY,CONCATENATE(FRCP_y1,\" to \",dms_MultiYear_FinalYear_Result))","v":"2019-20 to 2023-24"}]
[null,"5.4 MAXIMUM DEMAND AND UTILISATION AT SPATIAL LEVEL"]
[]
[null,"There is ONE table on this worksheet. It has been sub-grouped into blocks of approximately 500 rows for ease of navigation. See the Instructions sheet on how to group or ungroup data."]
[]
[null,"5.4.1 - NON-COINCIDENT & COINCIDENT MAXIMUM DEMAND"]
[null,"CONNECTION POINT","FORECASTING ELEMENTS","UNIT","MAX DEMAND",null,"TNSP NAME","SERVICE","SERVICE SUBCATEGORY","DATA TYPE","DATA TYPE SUBCATEGORY","LOCATION","LOCATION SUBCATEGORY","MEASUREMENT","DENOMINATION",null,{"$f":"CRCP_y4","v":"2017-18"},{"$f":"CRCP_y5","v":"2018-19"},{"$f":"FRCP_y1","v":"2019-20"},{"$f":"FRCP_y2","v":"2020-21"},{"$f":"FRCP_y3","v":"2021-22"},{"$f":"FRCP_y4","v":"2022-23"},{"$f":"FRCP_y5","v":"2023-24"}]
[null,"Arthurs Lake 6.6 kV","CONNECTION POINT RATING","MVA","Non-coincident",null,"TNSP NAME","DEMAND FORECASTING","NON-COINCIDENT MAXIMUM DEMAND","DESCRIPTOR METRIC","CONNECTION POINT RATING","CONNECTION POINT",{"$f":"B10","v":"Arthurs Lake 6.6 kV"},"RATING","MVA",null,30,30,30,30,30,30,30]
[null,null,null,null,"Coincident",null,"TNSP NAME","DEMAND FORECASTING","COINCIDENT MAXIMUM DEMAND","DESCRIPTOR METRIC","CONNECTION POINT RATING","CONNECTION POINT",{"$f":"M10","v":"Arthurs Lake 6.6 kV"},"RATING","MVA",null,30,30,30,30,30,30,30]
[null,null,"WINTER/SUMMER PEAKING",null,"Non-coincident",null,"TNSP NAME","DEMAND FORECASTING","NON-COINCIDENT MAXIMUM DEMAND","DESCRIPTOR METRIC","WINTER/SUMMER PEAKING","CONNECTION POINT",{"$f":"#REF!","v":{"$error":"#REF!"}},"WINTER/SUMMER","WINTER/SUMMER",null,"SUMMER","SUMMER","SUMMER","SUMMER","SUMMER","SUMMER","SUMMER"]
[null,null,null,null,"Coincident",null,"TNSP NAME","DEMAND FORECASTING","COINCIDENT MAXIMUM DEMAND","DESCRIPTOR METRIC","WINTER/SUMMER PEAKING","CONNECTION POINT",{"$error":"#REF!"},"WINTER/SUMMER","WINTER/SUMMER",null,"WINTER","WINTER","WINTER","WINTER","WINTER","WINTER","WINTER"]
[null,null,"ADJUSTMENTS - EMBEDDED GENERATION","MW","Non-coincident",null,"TNSP NAME","DEMAND FORECASTING","NON-COINCIDENT MAXIMUM DEMAND","DESCRIPTOR METRIC","ADJUSTMENTS - EMBEDDED GENERATION","CONNECTION POINT",{"$error":"#REF!"},"GENERATED LOAD","MW",null,1.183924,1.183924,1.183924,1.183924,1.183924,1.183924,1.183924]
[null,null,null,null,"Coincident",null,"TNSP NAME","DEMAND FORECASTING","COINCIDENT MAXIMUM DEMAND","DESCRIPTOR METRIC","ADJUSTMENTS - EMBEDDED GENERATION","CONNECTION POINT",{"$error":"#REF!"},"GENERATED LOAD","MW",null,1.2538820000000002,1.2538820000000002,1.2538820000000002,1.2538820000000002,1.2538820000000002,1.2538820000000002,1.2538820000000002]
[null,null,"WEATHER CORRECTED MD 10% POE","MW","Non-coincident",null,"TNSP NAME","DEMAND FORECASTING","NON-COINCIDENT MAXIMUM DEMAND","DESCRIPTOR METRIC","WEATHER CORRECTED MD 10% POE","CONNECTION POINT",{"$error":"#REF!"},"MAXIMUM DEMAND","MW",null,6.4920758530000002,6.4920758530000002,6.4920758530000002,6.4920758530000002,6.4920758530000002,6.4920758530000002,6.4920758530000002]
[null,null,null,null,"Coincident",null,"TNSP NAME","DEMAND FORECASTING","COINCIDENT MAXIMUM DEMAND","DESCRIPTOR METRIC","WEATHER CORRECTED MD 10% POE","CONNECTION POINT",{"$error":"#REF!"},"MAXIMUM DEMAND","MW",null,3.8193492779999998,3.8193492779999998,3.8193492779999998,3.8193492779999998,3.8193492779999998,3.8193492779999998,3.8193492779999998]
[null,null,"WEATHER CORRECTED MD 10% POE","MVA","Non-coincident",null,"TNSP NAME","DEMAND FORECASTING","NON-COINCIDENT MAXIMUM DEMAND","DESCRIPTOR METRIC","WEATHER CORRECTED MD 10% POE","CONNECTION POINT",{"$error":"#REF!"},"MAXIMUM DEMAND","MVA",null,6.7607640914744174,6.7607640914744174,6.7607640914744174,6.7607640914744174,6.7607640914744174,6.7607640914744174,6.7607640914744174]
[null,null,null,null,"Coincident",null,"TNSP NAME","DEMAND FORECASTING","COINCIDENT MAXIMUM DEMAND","DESCRIPTOR METRIC","WEATHER CORRECTED MD 10% POE","CONNECTION POINT",{"$error":"#REF!"},"MAXIMUM DEMAND","MVA",null,3.8814595670086303,3.8814595670086303,3.8814595670086303,3.8814595670086303,3.8814595670086303,3.8814595670086303,3.8814595670086303]
[null,null,"WEATHER CORRECTED MD 50% POE","MW","Non-coincident",null,"TNSP NAME","DEMAND FORECASTING","NON-COINCIDENT MAXIMUM DEMAND","DESCRIPTOR METRIC","WEATHER CORRECTED MD 50% POE","CONNECTION POINT",{"$error":"#REF!"},"MAXIMUM DEMAND","MW",null,6.4753132759999996,6.4753132759999996,6.4753132759999996,6.4753132759999996,6.4753132759999996,6.4753132759999996,6.4753132759999996]
[null,null,null,null,"Coincident",null,"TNSP NAME","DEMAND FORECASTING","COINCIDENT MAXIMUM DEMAND","DESCRIPTOR METRIC","WEATHER CORRECTED MD 50% POE","CONNECTION POINT",{"$error":"#REF!"},"MAXIMUM DEMAND","MW",null,3.8076850759999998,3.8076850759999998,3.8076850759999998,3.8076850759999998,3.8076850759999998,3.8076850759999998,3.8076850759999998]
[null,null,"WEATHER CORRECTED MD 50% POE","MVA","Non-coincident",null,"TNSP NAME","DEMAND FORECASTING","NON-COINCIDENT MAXIMUM DEMAND","DESCRIPTOR METRIC","WEATHER CORRECTED MD 50% POE","CONNECTION POINT",{"$error":"#REF!"},"MAXIMUM DEMAND","MVA",null,6.743307759905246,6.743307759905246,6.743307759905246,6.743307759905246,6.743307759905246,6.743307759905246,6.743307759905246]
[null,null,null,null,"Coincident",null,"TNSP NAME","DEMAND FORECASTING","COINCIDENT MAXIMUM DEMAND","DESCRIPTOR METRIC","WEATHER CORRECTED MD 50% POE","CONNECTION POINT",{"$error":"#REF!"},"MAXIMUM DEMAND","MVA",null,3.869605681660881,3.869605681660881,3.869605681660881,3.869605681660881,3.869605681660881,3.869605681660881,3.869605681660881]
[null,"Avoca 22 kV","CONNECTION POINT RATING","MVA","Non-coincident",null,"TNSP NAME","DEMAND FORECASTING","NON-COINCIDENT MAXIMUM DEMAND","DESCRIPTOR METRIC","CONNECTION POINT RATING","CONNECTION POINT",{"$f":"B24","v":"Avoca 22 kV"},"RATING","MVA",null,20.399999999999999,20.399999999999999,20.399999999999999,20.399999999999999,20.399999999999999,20.399999999999999,20.399999999999999]
[null,null,null,null,"Coincident",null,"TNSP NAME","DEMAND FORECASTING","COINCIDENT MAXIMUM DEMAND","DESCRIPTOR METRIC","CONNECTION POINT RATING","CONNECTION POINT","Avoca 22 kV","RATING","MVA",null,20.399999999999999,20.399999999999999,20.399999999999999,20.399999999999999,20.399999999999999,20.399999999999999,20.399999999999999]
[null,null,"WINTER/SUMMER PEAKING",null,"Non-coincident",null,"TNSP NAME","DEMAND FORECASTING","NON-COINCIDENT MAXIMUM DEMAND","DESCRIPTOR METRIC","WINTER/SUMMER PEAKING","CONNECTION POINT",{"$f":"#REF!","v":{"$error":"#REF!"}},"WINTER/SUMMER","WINTER/SUMMER",null,"SUMMER","SUMMER","SUMMER","SUMMER","SUMMER","SUMMER","SUMMER"]
[null,null,null,null,"Coincident",null,"TNSP NAME","DEMAND FORECASTING","COINCIDENT MAXIMUM DEMAND","DESCRIPTOR METRIC","WINTER/SUMMER PEAKING","CONNECTION POINT",{"$error":"#REF!"},"WINTER/SUMMER","WINTER/SUMMER",null,"WINTER","WINTER","WINTER","WINTER","WINTER","WINTER","WINTER"]
[null,null,"ADJUSTMENTS - EMBEDDED GENERATION","MW","Non-coincident",null,"TNSP NAME","DEMAND FORECASTING","NON-COINCIDENT MAXIMUM DEMAND","DESCRIPTOR METRIC","ADJUSTMENTS - EMBEDDED GENERATION","CONNECTION POINT",{"$error":"#REF!"},"GENERATED LOAD","MW",null,8.3599091269999999,8.3493866949999997,8.0312799130000005,8.0758898830000003,8.3322774929999994,8.338049711,8.4666744749999996]
[null,null,null,null,"Coincident",null,"TNSP NAME","DEMAND FORECASTING","COINCIDENT MAXIMUM DEMAND","DESCRIPTOR METRIC","ADJUSTMENTS - EMBEDDED GENERATION","CONNECTION POINT",{"$error":"#REF!"},"GENERATED LOAD","MW",null,3.8076850759999998,3.8076850759999998,3.8076850759999998,3.8076850759999998,3.8076850759999998,3.8076850759999998,3.8076850759999998]
[null,null,"WEATHER CORRECTED MD 10% POE","MW","Non-coincident",null,"TNSP NAME","DEMAND FORECASTING","NON-COINCIDENT MAXIMUM DEMAND","DESCRIPTOR METRIC","WEATHER CORRECTED MD 10% POE","CONNECTION POINT",{"$error":"#REF!"},"MAXIMUM DEMAND","MW",null,3.8076850759999998,3.8076850759999998,3.8076850759999998,3.8076850759999998,3.8076850759999998,3.8076850759999998,3.8076850759999998]
[null,null,null,null,"Coincident",null,"TNSP NAME","DEMAND FORECASTING","COINCIDENT MAXIMUM DEMAND","DESCRIPTOR METRIC","WEATHER CORRECTED MD 10% POE","CONNECTION POINT",{"$error":"#REF!"},"MAXIMUM DEMAND","MW",null,3.3144206767955446,3.3567406461298952,3.4278725189109061,3.499578873296517,3.5746875381597571,3.6478507262015918,3.722984808746864]
[null,null,"WEATHER CORRECTED MD 10% POE","MVA","Non-coincident",null,"TNSP NAME","DEMAND FORECASTING","NON-COINCIDENT MAXIMUM DEMAND","DESCRIPTOR METRIC","WEATHER CORRECTED MD 10% POE","CONNECTION POINT",{"$error":"#REF!"},"MAXIMUM DEMAND","MVA",null,3.9776230050592147,3.9776230050592147,3.9776230050592147,3.9776230050592147,3.9776230050592147,3.9776230050592147,3.9776230050592147]
[null,null,null,null,"Coincident",null,"TNSP NAME","DEMAND FORECASTING","COINCIDENT MAXIMUM DEMAND","DESCRIPTOR METRIC","WEATHER CORRECTED MD 10% POE","CONNECTION POINT",{"$error":"#REF!"},"MAXIMUM DEMAND","MVA",null,3.6600367886242249,3.7067697352720614,3.7853189891567389,3.8645026295639067,3.9474433613993383,4.0282357489441329,4.1112045489279341]
[null,null,"WEATHER CORRECTED MD 50% POE","MW","Non-coincident",null,"TNSP NAME","DEMAND FORECASTING","NON-COINCIDENT MAXIMUM DEMAND","DESCRIPTOR METRIC","WEATHER CORRECTED MD 50% POE","CONNECTION POINT",{"$error":"#REF!"},"MAXIMUM DEMAND","MW",null,7.7929472329999996,7.798083675,7.4292624639999998,7.4770406329999997,7.6595469410000003,7.8163985709999997,7.8955731829999998]
[null,null,null,null,"Coincident",null,"TNSP NAME","DEMAND FORECASTING","COINCIDENT MAXIMUM DEMAND","DESCRIPTOR METRIC","WEATHER CORRECTED MD 50% POE","CONNECTION POINT",{"$error":"#REF!"},"MAXIMUM DEMAND","MW",null,5.2729948999999998E-2,5.2729948999999998E-2,5.2729948999999998E-2,5.2729948999999998E-2,5.2729948999999998E-2,5.2729948999999998E-2,5.2729948999999998E-2]
[null,null,"WEATHER CORRECTED MD 50% POE","MVA","Non-coincident",null,"TNSP NAME","DEMAND FORECASTING","NON-COINCIDENT MAXIMUM DEMAND","DESCRIPTOR METRIC","WEATHER CORRECTED MD 50% POE","CONNECTION POINT",{"$error":"#REF!"},"MAXIMUM DEMAND","MVA",null,8.1407484002737807,8.1461140829538259,7.7608322898575004,7.8107428103865892,8.0013944201651572,8.1652463773034931,8.2479545718684353]
[null,null,null,null,"Coincident",null,"TNSP NAME","DEMAND FORECASTING","COINCIDENT MAXIMUM DEMAND","DESCRIPTOR METRIC","WEATHER CORRECTED MD 50% POE","CONNECTION POINT",{"$error":"#REF!"},"MAXIMUM DEMAND","MVA",null,5.8228442319781082E-2,5.8228442319781082E-2,5.8228442319781082E-2,5.8228442319781082E-2,5.8228442319781082E-2,5.8228442319781082E-2,5.8228442319781082E-2]
[null,"Boyer 6.6 kV 'A'","CONNECTION POINT RATING","MVA","Non-coincident",null,null,null,null,null,null,null,null,null,null,null,56.4,56.4,58.8,58.8,58.8,58.8,58.8]
[null,null,null,null,"Coincident",null,null,null,null,null,null,null,null,null,null,null,56.4,56.4,58.8,58.8,58.8,58.8,58.8]
[null,null,"WINTER/SUMMER PEAKING",null,"Non-coincident",null,null,null,null,null,null,null,null,null,null,null,"WINTER","WINTER","WINTER","WINTER","WINTER","WINTER","WINTER"]
[null,null,null,null,"Coincident",null,null,null,null,null,null,null,null,null,null,null,"WINTER","WINTER","WINTER","WINTER","WINTER","WINTER","WINTER"]
[null,null,"ADJUSTMENTS - EMBEDDED GENERATION","MW","Non-coincident",null,null,null,null,null,null,null,null,null,null,null,0,0,0,0,0,0,0]
[null,null,null,null,"Coincident",null,null,null,null,null,null,null,null,null,null,null,0,0,0,0,0,0,0]
[null,null,"WEATHER CORRECTED MD 10% POE","MW","Non-coincident",null,null,null,null,null,null,null,null,null,null,null,26.411472,26.411472,26.411472,26.411472,26.411472,26.411472,26.411472]
[null,null,null,null,"Coincident",null,null,null,null,null,null,null,null,null,null,null,25.808413999999996,25.808413999999996,25.808413999999996,25.808413999999996,25.808413999999996,25.808413999999996,25.808413999999996]
[null,null,"WEATHER CORRECTED MD 10% POE","MVA","Non-coincident",null,null,null,null,null,null,null,null,null,null,null,31.932114623481858,31.932114623481858,31.932114623481858,31.932114623481858,31.932114623481858,31.932114623481858,31.932114623481858]
[null,null,null,null,"Coincident",null,null,null,null,null,null,null,null,null,null,null,31.260099298724558,31.260099298724558,31.260099298724558,31.260099298724558,31.260099298724558,31.260099298724558,31.260099298724558]
[null,null,"WEATHER CORRECTED MD 50% POE","MW","Non-coincident",null,null,null,null,null,null,null,null,null,null,null,26.411472,26.411472,26.411472,26.411472,26.411472,26.411472,26.411472]
[null,null,null,null,"Coincident",null,null,null,null,null,null,null,null,null,null,null,25.808413999999996,25.808413999999996,25.808413999999996,25.808413999999996,25.808413999999996,25.808413999999996,25.808413999999996]
[null,null,"WEATHER CORRECTED MD 50% POE","MVA","Non-coincident",null,null,null,null,null,null,null,null,null,null,null,31.932114623481858,31.932114623481858,31.932114623481858,31.932114623481858,31.932114623481858,31.932114623481858,31.932114623481858]
[null,null,null,null,"Coincident",null,null,null,null,null,null,null,null,null,null,null,31.260099298724558,31.260099298724558,31.260099298724558,31.260099298724558,31.260099298724558,31.260099298724558,31.260099298724558]
[null,"Boyer 6.6 kV 'B'","CONNECTION POINT RATING","MVA","Non-coincident",null,null,null,null,null,null,null,null,null,null,null,151.19999999999999,151.19999999999999,151.19999999999999,151.19999999999999,151.19999999999999,151.19999999999999,151.19999999999999]
[null,null,null,null,"Coincident",null,null,null,null,null,null,null,null,null,null,null,151.19999999999999,151.19999999999999,151.19999999999999,151.19999999999999,151.19999999999999,151.19999999999999,151.19999999999999]
[null,null,"WINTER/SUMMER PEAKING",null,"Non-coincident",null,null,null,null,null,null,null,null,null,null,null,"WINTER","WINTER","WINTER","WINTER","WINTER","WINTER","WINTER"]
[null,null,null,null,"Coincident",null,null,null,null,null,null,null,null,null,null,null,"WINTER","WINTER","WINTER","WINTER","WINTER","WINTER","WINTER"]
[null,null,"ADJUSTMENTS - EMBEDDED GENERATION","MW","Non-coincident",null,null,null,null,null,null,null,null,null,null,null,0,0,0,0,0,0,0]
[null,null,null,null,"Coincident",null,null,null,null,null,null,null,null,null,null,null,0,0,0,0,0,0,0]
[null,null,"WEATHER CORRECTED MD 10% POE","MW","Non-coincident",null,null,null,null,null,null,null,null,null,null,null,73.725019999999986,73.725019999999986,73.725019999999986,73.725019999999986,73.725019999999986,73.725019999999986,73.725019999999986]
[null,null,null,null,"Coincident",null,null,null,null,null,null,null,null,null,null,null,71.031195999999994,71.031195999999994,71.031195999999994,71.031195999999994,71.031195999999994,71.031195999999994,71.031195999999994]
[null,null,"WEATHER CORRECTED MD 10% POE","MVA","Non-coincident",null,null,null,null,null,null,null,null,null,null,null,74.795305780790827,74.795305780790827,74.795305780790827,74.795305780790827,74.795305780790827,74.795305780790827,74.795305780790827]
[null,null,null,null,"Coincident",null,null,null,null,null,null,null,null,null,null,null,72.131670826008872,72.131670826008872,72.131670826008872,72.131670826008872,72.131670826008872,72.131670826008872,72.131670826008872]
[null,null,"WEATHER CORRECTED MD 50% POE","MW","Non-coincident",null,null,null,null,null,null,null,null,null,null,null,73.725019999999986,73.725019999999986,73.725019999999986,73.725019999999986,73.725019999999986,73.725019999999986,73.725019999999986]
[null,null,null,null,"Coincident",null,null,null,null,null,null,null,null,null,null,null,71.031195999999994,71.031195999999994,71.031195999999994,71.031195999999994,71.031195999999994,71.031195999999994,71.031195999999994]
[null,null,"WEATHER CORRECTED MD 50% POE","MVA","Non-coincident",null,null,null,null,null,null,null,null,null,null,null,74.795305780790827,74.795305780790827,74.795305780790827,74.795305780790827,74.795305780790827,74.795305780790827,74.795305780790827]
[null,null,null,null,"Coincident",null,null,null,null,null,null,null,null,null,null,null,72.131670826008872,72.131670826008872,72.131670826008872,72.131670826008872,72.131670826008872,72.131670826008872,72.131670826008872]
[null,"Bridgewater 11 kV","CONNECTION POINT RATING","MVA","Non-coincident",null,null,null,null,null,null,null,null,null,null,null,84,84,84,84,84,84,84]
[null,null,null,null,"Coincident",null,null,null,null,null,null,null,null,null,null,null,84,84,84,84,84,84,84]
[null,null,"WINTER/SUMMER PEAKING",null,"Non-coincident",null,null,null,null,null,null,null,null,null,null,null,"WINTER","WINTER","WINTER","WINTER","WINTER","WINTER","WINTER"]
[null,null,null,null,"Coincident",null,null,null,null,null,null,null,null,null,null,null,"WINTER","WINTER","WINTER","WINTER","WINTER","WINTER","WINTER"]
[null,null,"ADJUSTMENTS - EMBEDDED GENERATION","MW","Non-coincident",null,null,null,null,null,null,null,null,null,null,null,0,0,0,0,0,0,0]
[null,null,null,null,"Coincident",null,null,null,null,null,null,null,null,null,null,null,0,0,0,0,0,0,0]
[null,null,"WEATHER CORRECTED MD 10% POE","MW","Non-coincident",null,null,null,null,null,null,null,null,null,null,null,32.406350879999998,31.541686670000001,31.21553046,31.11806318,31.514642760000001,31.956947240000002,32.488016379999998]
[null,null,null,null,"Coincident",null,null,null,null,null,null,null,null,null,null,null,32.406350879999998,31.541686670000001,31.21553046,31.11806318,31.514642760000001,31.956947240000002,32.488016379999998]
[null,null,"WEATHER CORRECTED MD 10% POE","MVA","Non-coincident",null,null,null,null,null,null,null,null,null,null,null,32.515410882520811,31.64783674041302,31.320582887632547,31.222787592243161,31.620701817114309,32.064494824097252,32.597351218761055]
[null,null,null,null,"Coincident",null,null,null,null,null,null,null,null,null,null,null,32.573700844865904,31.704571413659721,31.376730897071596,31.278760285303576,31.677387845930131,32.121976434975977,32.65578807450175]
[null,null,"WEATHER CORRECTED MD 50% POE","MW","Non-coincident",null,null,null,null,null,null,null,null,null,null,null,30.04674434,29.540989700000001,29.179746529999999,29.007973629999999,29.353229970000001,29.743793719999999,30.217087549999999]
[null,null,null,null,"Coincident",null,null,null,null,null,null,null,null,null,null,null,29.054431829999999,28.252872119999999,27.984454929999998,27.93516936,28.27150344,28.65134153,29.110710009999998]
[null,null,"WEATHER CORRECTED MD 50% POE","MVA","Non-coincident",null,null,null,null,null,null,null,null,null,null,null,30.147863346752622,29.64040664524877,29.277947751171201,29.10559676840661,29.452015030569655,29.843893179827912,30.318779828053078]
[null,null,null,null,"Coincident",null,null,null,null,null,null,null,null,null,null,null,29.204472115743805,28.39877306312534,28.128969737195312,28.079429651083998,28.417500597313694,28.799300213042144,29.261040922463259]
[null,"Burnie 22kV","CONNECTION POINT RATING","MVA","Non-coincident",null,null,null,null,null,null,null,null,null,null,null,144,144,144,144,144,144,144]
[null,null,null,null,"Coincident",null,null,null,null,null,null,null,null,null,null,null,144,144,144,144,144,144,144]
[null,null,"WINTER/SUMMER PEAKING",null,"Non-coincident",null,null,null,null,null,null,null,null,null,null,null,"WINTER","WINTER","WINTER","WINTER","WINTER","WINTER","WINTER"]
[null,null,null,null,"Coincident",null,null,null,null,null,null,null,null,null,null,null,"WINTER","WINTER","WINTER","WINTER","WINTER","WINTER","WINTER"]
[null,null,"ADJUSTMENTS - EMBEDDED GENERATION","MW","Non-coincident",null,null,null,null,null,null,null,null,null,null,null,0,0,0,0,0,0,0]
[null,null,null,null,"Coincident",null,null,null,null,null,null,null,null,null,null,null,0,0,0,0,0,0,0]
[null,null,"WEATHER CORRECTED MD 10% POE","MW","Non-coincident",null,null,null,null,null,null,null,null,null,null,null,63.79070814,61.373143489999997,59.949016350000001,58.897283530000003,58.69952207,58.495175269999997,58.362907999999997]
[null,null,null,null,"Coincident",null,null,null,null,null,null,null,null,null,null,null,63.79070814,61.373143489999997,59.949016350000001,58.897283530000003,58.69952207,58.495175269999997,58.362907999999997]
[null,null,"WEATHER CORRECTED MD 10% POE","MVA","Non-coincident",null,null,null,null,null,null,null,null,null,null,null,64.203558108541301,61.770347112563947,60.337003099729465,59.278463522533762,59.079422161198281,58.873752839903069,58.740629543377409]
[null,null,null,null,"Coincident",null,null,null,null,null,null,null,null,null,null,null,64.311682250843603,61.874373524775713,60.438615641174913,59.378293395117097,59.178916831541876,58.972901145970013,58.839553658719076]
[null,null,"WEATHER CORRECTED MD 50% POE","MW","Non-coincident",null,null,null,null,null,null,null,null,null,null,null,57.420207609999999,55.228307659999999,54.024419379999998,53.176922640000001,52.985218150000001,52.788796750000003,52.65360708]
[null,null,null,null,"Coincident",null,null,null,null,null,null,null,null,null,null,null,57.420207609999999,55.228307659999999,54.024419379999998,53.176922640000001,52.985218150000001,52.788796750000003,52.65360708]
[null,null,"WEATHER CORRECTED MD 50% POE","MVA","Non-coincident",null,null,null,null,null,null,null,null,null,null,null,57.791828048095731,55.585742241694561,54.374062462697019,53.521080770222746,53.3281355792653,53.130442950724735,52.994378340586358]
[null,null,null,null,"Coincident",null,null,null,null,null,null,null,null,null,null,null,57.889154302650319,55.679353263905497,54.465632915183953,53.61121473045575,53.417944603717501,53.219919044315624,53.083625290034746]
[null,"Chapel St 11 kV","CONNECTION POINT RATING","MVA","Non-coincident",null,null,null,null,null,null,null,null,null,null,null,144,144,144,144,144,144,144]
[null,null,null,null,"Coincident",null,null,null,null,null,null,null,null,null,null,null,144,144,144,144,144,144,144]
[null,null,"WINTER/SUMMER PEAKING",null,"Non-coincident",null,null,null,null,null,null,null,null,null,null,null,"WINTER","WINTER","WINTER","WINTER","WINTER","WINTER","WINTER"]
[null,null,null,null,"Coincident",null,null,null,null,null,null,null,null,null,null,null,"WINTER","WINTER","WINTER","WINTER","WINTER","WINTER","WINTER"]
[null,null,"ADJUSTMENTS - EMBEDDED GENERATION","MW","Non-coincident",null,null,null,null,null,null,null,null,null,null,null,0.83199999999999996,0.83199999999999996,0.83199999999999996,0.83199999999999996,0.83199999999999996,0.83199999999999996,0.83199999999999996]
[null,null,null,null,"Coincident",null,null,null,null,null,null,null,null,null,null,null,0.83199999999999996,0.83199999999999996,0.83199999999999996,0.83199999999999996,0.83199999999999996,0.83199999999999996,0.83199999999999996]
[null,null,"WEATHER CORRECTED MD 10% POE","MW","Non-coincident",null,null,null,null,null,null,null,null,null,null,null,40.10212696,38.544555709999997,37.638712769999998,36.991570699999997,36.904273179999997,36.835698309999998,36.834644390000001]
[null,null,null,null,"Coincident",null,null,null,null,null,null,null,null,null,null,null,40.10212696,38.544555709999997,37.638712769999998,36.991570699999997,36.904273179999997,36.835698309999998,36.834644390000001]
[null,null,"WEATHER CORRECTED MD 10% POE","MVA","Non-coincident",null,null,null,null,null,null,null,null,null,null,null,40.201119694029678,38.639703554788831,37.731624527178781,37.082884976753896,36.995371961446438,36.926627813296335,36.925571291678168]
[null,null,null,null,"Coincident",null,null,null,null,null,null,null,null,null,null,null,40.239373407213961,38.67647148932798,37.767528371490208,37.118171507495902,37.030575218443502,36.961765656221694,36.960708129261505]
[null,null,"WEATHER CORRECTED MD 50% POE","MW","Non-coincident",null,null,null,null,null,null,null,null,null,null,null,36.027044060000001,34.953789520000001,34.046216620000003,33.350512870000003,33.2299279,33.133601030000001,33.102488430000001]
[null,null,null,null,"Coincident",null,null,null,null,null,null,null,null,null,null,null,35.679631499999999,34.23801624,33.441131179999999,32.893735650000004,32.779261910000002,32.688425600000002,32.661610969999998]
[null,null,"WEATHER CORRECTED MD 50% POE","MVA","Non-coincident",null,null,null,null,null,null,null,null,null,null,null,36.115977387503165,35.040073501713344,34.130260243669703,33.43283913797044,33.3119565020667,33.215391847666105,33.184202445721418]
[null,null,null,null,"Coincident",null,null,null,null,null,null,null,null,null,null,null,35.801742296421409,34.355193218998672,33.555580881130538,33.006311932002724,32.891446414426184,32.800299224137014,32.773392823126848]
[null,"Comalco 220 kV","CONNECTION POINT RATING","MVA","Non-coincident",null,null,null,null,null,null,null,null,null,null,null,943.2,943.2,943.2,943.2,943.2,943.2,943.2]
[null,null,null,null,"Coincident",null,null,null,null,null,null,null,null,null,null,null,943.2,943.2,943.2,943.2,943.2,943.2,943.2]
[null,null,"WINTER/SUMMER PEAKING",null,"Non-coincident",null,null,null,null,null,null,null,null,null,null,null,"WINTER","WINTER","WINTER","WINTER","WINTER","WINTER","WINTER"]
[null,null,null,null,"Coincident",null,null,null,null,null,null,null,null,null,null,null,"WINTER","WINTER","WINTER","WINTER","WINTER","WINTER","WINTER"]
[null,null,"ADJUSTMENTS - EMBEDDED GENERATION","MW","Non-coincident",null,null,null,null,null,null,null,null,null,null,null,0,0,0,0,0,0,0]
[null,null,null,null,"Coincident",null,null,null,null,null,null,null,null,null,null,null,0,0,0,0,0,0,0]
[null,null,"WEATHER CORRECTED MD 10% POE","MW","Non-coincident",null,null,null,null,null,null,null,null,null,null,null,354.98989868164063,354.98989868164063,354.98989868164063,354.98989868164063,356.99392700195313,356.99392700195313,356.99392700195313]
[null,null,null,null,"Coincident",null,null,null,null,null,null,null,null,null,null,null,354.56305729978823,354.56305729978823,354.56305729978823,354.56305729978823,356.5646759678242,356.5646759678242,356.5646759678242]
[null,null,"WEATHER CORRECTED MD 10% POE","MVA","Non-coincident",null,null,null,null,null,null,null,null,null,null,null,369.25989131929333,369.25989131929333,369.25989131929333,369.25989131929333,371.34447818361713,371.34447818361713,371.34447818361713]
[null,null,null,null,"Coincident",null,null,null,null,null,null,null,null,null,null,null,367.29265723195027,367.29265723195027,367.29265723195027,367.29265723195027,369.36613844837149,369.36613844837149,369.36613844837149]
[null,null,"WEATHER CORRECTED MD 50% POE","MW","Non-coincident",null,null,null,null,null,null,null,null,null,null,null,354.98989868164063,354.98989868164063,354.98989868164063,354.98989868164063,356.99392700195313,356.99392700195313,356.99392700195313]
[null,null,null,null,"Coincident",null,null,null,null,null,null,null,null,null,null,null,354.56305729978823,354.56305729978823,354.56305729978823,354.56305729978823,356.5646759678242,356.5646759678242,356.5646759678242]
[null,null,"WEATHER CORRECTED MD 50% POE","MVA","Non-coincident",null,null,null,null,null,null,null,null,null,null,null,369.25989131929333,369.25989131929333,369.25989131929333,369.25989131929333,371.34447818361713,371.34447818361713,371.34447818361713]
[null,null,null,null,"Coincident",null,null,null,null,null,null,null,null,null,null,null,367.29265723195027,367.29265723195027,367.29265723195027,367.29265723195027,369.36613844837149,369.36613844837149,369.36613844837149]
[null,"Creek Rd 33 kV","CONNECTION POINT RATING","MVA","Non-coincident",null,null,null,null,null,null,null,null,null,null,null,216,216,216,216,216,216,216]
[null,null,null,null,"Coincident",null,null,null,null,null,null,null,null,null,null,null,216,216,216,216,216,216,216]
[null,null,"WINTER/SUMMER PEAKING",null,"Non-coincident",null,null,null,null,null,null,null,null,null,null,null,"WINTER","WINTER","WINTER","WINTER","WINTER","WINTER","WINTER"]
[null,null,null,null,"Coincident",null,null,null,null,null,null,null,null,null,null,null,"WINTER","WINTER","WINTER","WINTER","WINTER","WINTER","WINTER"]
[null,null,"ADJUSTMENTS - EMBEDDED GENERATION","MW","Non-coincident",null,null,null,null,null,null,null,null,null,null,null,0.82,0.82,0.82,0.82,0.82,0.82,0.82]
[null,null,null,null,"Coincident",null,null,null,null,null,null,null,null,null,null,null,0.38800000000000001,0.38800000000000001,0.38800000000000001,0.38800000000000001,0.38800000000000001,0.38800000000000001,0.38800000000000001]
[null,null,"WEATHER CORRECTED MD 10% POE","MW","Non-coincident",null,null,null,null,null,null,null,null,null,null,null,93.96187338,92.718499730000005,90.335888929999996,88.590332309999994,88.194255960000007,87.846427939999998,87.660745019999993]
[null,null,null,null,"Coincident",null,null,null,null,null,null,null,null,null,null,null,93.96187338,92.718499730000005,90.335888929999996,88.590332309999994,88.194255960000007,87.846427939999998,87.660745019999993]
[null,null,"WEATHER CORRECTED MD 10% POE","MVA","Non-coincident",null,null,null,null,null,null,null,null,null,null,null,95.898243094679657,94.629245955137748,92.197534224845185,90.416005110336087,90.011766404465021,89.656770331938858,89.467260851549113]
[null,null,null,null,"Coincident",null,null,null,null,null,null,null,null,null,null,null,95.929052094308958,94.659647267085404,92.22715430657027,90.445052844455446,90.040684269780343,89.685574148513396,89.496003784865295]
[null,null,"WEATHER CORRECTED MD 50% POE","MW","Non-coincident",null,null,null,null,null,null,null,null,null,null,null,84.347017550000004,83.275232849999995,81.229392950000005,79.791091080000001,79.398733669999999,79.05521641,78.855508529999994]
[null,null,null,null,"Coincident",null,null,null,null,null,null,null,null,null,null,null,84.347017550000004,83.275232849999995,81.229392950000005,79.791091080000001,79.398733669999999,79.05521641,78.855508529999994]
[null,null,"WEATHER CORRECTED MD 50% POE","MVA","Non-coincident",null,null,null,null,null,null,null,null,null,null,null,86.085243964950749,84.991371886750599,82.903371243451872,81.435428796040526,81.034985670220635,80.684389193993823,80.480565726716719]
[null,null,null,null,"Coincident",null,null,null,null,null,null,null,null,null,null,null,86.112900365775388,85.018676861903984,82.930005411623085,81.461591361845947,81.061019586618983,80.710310475099192,80.506421525943338]
[null,"Derby 22 kV","CONNECTION POINT RATING","MVA","Non-coincident",null,null,null,null,null,null,null,null,null,null,null,30,30,30,30,30,30,30]
[null,null,null,null,"Coincident",null,null,null,null,null,null,null,null,null,null,null,30,30,30,30,30,30,30]
[null,null,"WINTER/SUMMER PEAKING",null,"Non-coincident",null,null,null,null,null,null,null,null,null,null,null,"WINTER","WINTER","WINTER","WINTER","WINTER","WINTER","WINTER"]
[null,null,null,null,"Coincident",null,null,null,null,null,null,null,null,null,null,null,"WINTER","WINTER","WINTER","WINTER","WINTER","WINTER","WINTER"]
[null,null,"ADJUSTMENTS - EMBEDDED GENERATION","MW","Non-coincident",null,null,null,null,null,null,null,null,null,null,null,0,0,0,0,0,0,0]
[null,null,null,null,"Coincident",null,null,null,null,null,null,null,null,null,null,null,0.46134199999999997,0.46134199999999997,0.46134199999999997,0.46134199999999997,0.46134199999999997,0.46134199999999997,0.46134199999999997]
[null,null,"WEATHER CORRECTED MD 10% POE","MW","Non-coincident",null,null,null,null,null,null,null,null,null,null,null,3.1413640589999998,3.0871037120000002,3.0393796989999999,3.0025507309999999,3.01727949,3.029420574,3.0429080289999999]
[null,null,null,null,"Coincident",null,null,null,null,null,null,null,null,null,null,null,1.83074527,1.779662335,1.7554347269999999,1.7404419250000001,1.749243903,1.7565279899999999,1.7645807440000001]
[null,null,"WEATHER CORRECTED MD 10% POE","MVA","Non-coincident",null,null,null,null,null,null,null,null,null,null,null,3.1672325403730328,3.1125253706713973,3.0644083603243373,3.0272761134127553,3.0421261606877477,3.0543672239959094,3.0679657453899614]
[null,null,null,null,"Coincident",null,null,null,null,null,null,null,null,null,null,null,1.8448803958759341,1.7934030511630321,1.7689883825739021,1.7538798216275455,1.7627497594191264,1.7700900866226783,1.7782050156796365]
[null,null,"WEATHER CORRECTED MD 50% POE","MW","Non-coincident",null,null,null,null,null,null,null,null,null,null,null,3.0374306419999999,2.99201534,2.9552603990000001,2.9316933019999998,2.954213942,2.9748723429999999,2.9972818280000002]
[null,null,null,null,"Coincident",null,null,null,null,null,null,null,null,null,null,null,1.6534786850000001,1.6109373250000001,1.595542427,1.589387222,1.6018144839999999,1.6132222409999999,1.625567625]
[null,null,"WEATHER CORRECTED MD 50% POE","MVA","Non-coincident",null,null,null,null,null,null,null,null,null,null,null,3.0624432532442594,3.0166539656533593,2.9795963553387663,2.9558351881837917,2.978541280982451,2.9993697996292532,3.0219638220895457]
[null,null,null,null,"Coincident",null,null,null,null,null,null,null,null,null,null,null,1.6662451412233983,1.6233753207388146,1.6078615592220584,1.6016588300804462,1.6141820425742379,1.6256778785024204,1.6381185808187839]
[null,"Derwent Bridge 22 kV","CONNECTION POINT RATING","MVA","Non-coincident",null,null,null,null,null,null,null,null,null,null,null,7.2,7.2,7.2,7.2,7.2,7.2,7.2]
[null,null,null,null,"Coincident",null,null,null,null,null,null,null,null,null,null,null,7.2,7.2,7.2,7.2,7.2,7.2,7.2]
[null,null,"WINTER/SUMMER PEAKING",null,"Non-coincident",null,null,null,null,null,null,null,null,null,null,null,"SUMMER","SUMMER","SUMMER","SUMMER","SUMMER","SUMMER","SUMMER"]
[null,null,null,null,"Coincident",null,null,null,null,null,null,null,null,null,null,null,"WINTER","WINTER","WINTER","WINTER","WINTER","WINTER","WINTER"]
[null,null,"ADJUSTMENTS - EMBEDDED GENERATION","MW","Non-coincident"]
[null,null,null,null,"Coincident"]
[null,null,"WEATHER CORRECTED MD 10% POE","MW","Non-coincident",null,null,null,null,null,null,null,null,null,null,null,0.25954232599999999,0.25904975000000002,0.24902052899999999,0.250243259,0.25802224699999998,0.25803532200000001,0.26184761099999998]
[null,null,null,null,"Coincident",null,null,null,null,null,null,null,null,null,null,null,0.22060562,0.218381408,0.219367117,0.22150113099999999,0.226734984,0.23189886000000001,0.237293326]
[null,null,"WEATHER CORRECTED MD 10% POE","MVA","Non-coincident",null,null,null,null,null,null,null,null,null,null,null,0.25954232599999999,0.25904975000000002,0.24902052899999999,0.250243259,0.25802224699999998,0.25803532200000001,0.26184761099999998]
[null,null,null,null,"Coincident",null,null,null,null,null,null,null,null,null,null,null,0.22060562,0.218381408,0.219367117,0.22150113099999999,0.226734984,0.23189886000000001,0.23729332599999997]
[null,null,"WEATHER CORRECTED MD 50% POE","MW","Non-coincident",null,null,null,null,null,null,null,null,null,null,null,0.24326904599999999,0.24275395599999999,0.23062908300000001,0.23146465199999999,0.23645101499999999,0.24061602300000001,0.242369417]
[null,null,null,null,"Coincident",null,null,null,null,null,null,null,null,null,null,null,0.19665334100000001,0.194154086,0.19487001000000001,0.196715797,0.20090892399999999,0.205051924,0.20939339900000001]
[null,null,"WEATHER CORRECTED MD 50% POE","MVA","Non-coincident",null,null,null,null,null,null,null,null,null,null,null,0.24326904599999999,0.24275395599999999,0.23062908299999998,0.23146465199999997,0.23645101499999996,0.24061602299999998,0.242369417]
[null,null,null,null,"Coincident",null,null,null,null,null,null,null,null,null,null,null,0.19665334100000001,0.194154086,0.19487001000000001,0.196715797,0.20090892399999999,0.205051924,0.20939339900000001]
[null,"Devonport 22 kV","CONNECTION POINT RATING","MVA","Non-coincident",null,null,null,null,null,null,null,null,null,null,null,108,108,108,108,108,108,108]
[null,null,null,null,"Coincident",null,null,null,null,null,null,null,null,null,null,null,108,108,108,108,108,108,108]
[null,null,"WINTER/SUMMER PEAKING",null,"Non-coincident",null,null,null,null,null,null,null,null,null,null,null,"WINTER","WINTER","WINTER","WINTER","WINTER","WINTER","WINTER"]
[null,null,null,null,"Coincident",null,null,null,null,null,null,null,null,null,null,null,"WINTER","WINTER","WINTER","WINTER","WINTER","WINTER","WINTER"]
[null,null,"ADJUSTMENTS - EMBEDDED GENERATION","MW","Non-coincident",null,null,null,null,null,null,null,null,null,null,null,0,0,0,0,0,0,0]
[null,null,null,null,"Coincident",null,null,null,null,null,null,null,null,null,null,null,0,0,0,0,0,0,0]
[null,null,"WEATHER CORRECTED MD 10% POE","MW","Non-coincident",null,null,null,null,null,null,null,null,null,null,null,52.470096290000001,51.81801377,50.918034759999998,50.284738849999997,50.333695310000003,50.330858839999998,50.341498649999998]
[null,null,null,null,"Coincident",null,null,null,null,null,null,null,null,null,null,null,52.470096290000001,51.81801377,50.918034759999998,50.284738849999997,50.333695310000003,50.330858839999998,50.341498649999998]
[null,null,"WEATHER CORRECTED MD 10% POE","MVA","Non-coincident",null,null,null,null,null,null,null,null,null,null,null,53.038408629274933,52.379263295052269,51.469536462718487,50.829381219393156,50.878867934953419,50.87600074267511,50.886755794226737]
[null,null,null,null,"Coincident",null,null,null,null,null,null,null,null,null,null,null,53.040167617973275,52.381000423569972,51.471243420662482,50.831066946952085,50.880555303711169,50.877688016344052,50.888443424580863]
[null,null,"WEATHER CORRECTED MD 50% POE","MW","Non-coincident",null,null,null,null,null,null,null,null,null,null,null,48.463382160000002,48.390738880000001,47.459398380000003,46.740584269999999,46.750169,46.718403160000001,46.701745819999999]
[null,null,null,null,"Coincident",null,null,null,null,null,null,null,null,null,null,null,46.632301730000002,46.053006070000002,45.291398770000001,44.790532050000003,44.805812799999998,44.781100160000001,44.770451950000002]
[null,null,"WEATHER CORRECTED MD 50% POE","MVA","Non-coincident",null,null,null,null,null,null,null,null,null,null,null,48.988297112171985,48.91486702072492,47.973439016877187,47.246839311705024,47.256527855509702,47.224417954413653,47.207580195993806]
[null,null,null,null,"Coincident",null,null,null,null,null,null,null,null,null,null,null,47.13894723007197,46.553357702335198,45.783475775155061,45.277167293534696,45.292614064145681,45.26763292897418,45.256869029473982]
[null,"Electrona 11 kV","CONNECTION POINT RATING","MVA","Non-coincident",null,null,null,null,null,null,null,null,null,null,null,60,60,60,60,60,60,60]
[null,null,null,null,"Coincident",null,null,null,null,null,null,null,null,null,null,null,60,60,60,60,60,60,60]
[null,null,"WINTER/SUMMER PEAKING",null,"Non-coincident",null,null,null,null,null,null,null,null,null,null,null,"WINTER","WINTER","WINTER","WINTER","WINTER","WINTER","WINTER"]
[null,null,null,null,"Coincident",null,null,null,null,null,null,null,null,null,null,null,"WINTER","WINTER","WINTER","WINTER","WINTER","WINTER","WINTER"]
[null,null,"ADJUSTMENTS - EMBEDDED GENERATION","MW","Non-coincident",null,null,null,null,null,null,null,null,null,null,null,0,0,0,0,0,0,0]
[null,null,null,null,"Coincident",null,null,null,null,null,null,null,null,null,null,null,0,0,0,0,0,0,0]
[null,null,"WEATHER CORRECTED MD 10% POE","MW","Non-coincident",null,null,null,null,null,null,null,null,null,null,null,14.26163566,13.66480836,13.308501440000001,13.05511297,13.01245145,12.991185310000001,13.010090979999999]
[null,null,null,null,"Coincident",null,null,null,null,null,null,null,null,null,null,null,14.26163566,13.66480836,13.308501440000001,13.05511297,13.01245145,12.991185310000001,13.010090979999999]
[null,null,"WEATHER CORRECTED MD 10% POE","MVA","Non-coincident",null,null,null,null,null,null,null,null,null,null,null,14.355141943938026,13.75440155119704,13.395758508130591,13.140708698941502,13.097767469075299,13.076361897822633,13.095391522675301]
[null,null,null,null,"Coincident",null,null,null,null,null,null,null,null,null,null,null,14.323186118068422,13.723783027003606,13.365938355327586,13.111456309753956,13.068610670894067,13.047252750351531,13.066240013562597]
[null,null,"WEATHER CORRECTED MD 50% POE","MW","Non-coincident",null,null,null,null,null,null,null,null,null,null,null,12.954678749999999,12.561069079999999,12.2309316,11.983072849999999,11.94978981,11.934712640000001,11.95380973]
[null,null,null,null,"Coincident",null,null,null,null,null,null,null,null,null,null,null,12.87624922,12.34843521,12.057093679999999,11.86178033,11.830443730000001,11.817029740000001,11.83734471]
[null,null,"WEATHER CORRECTED MD 50% POE","MVA","Non-coincident",null,null,null,null,null,null,null,null,null,null,null,13.039615982895445,12.643425614689347,12.311123591317227,12.061639757686811,12.028138497739061,12.012962474411673,12.032184774307822]
[null,null,null,null,"Coincident",null,null,null,null,null,null,null,null,null,null,null,12.931820618441838,12.401728665373811,12.109129761741967,11.912973477141339,11.881501634443357,11.868029752259828,11.888432397736819]
[null,"Emu Bay 11 kV","CONNECTION POINT RATING","MVA","Non-coincident",null,null,null,null,null,null,null,null,null,null,null,96,96,96,96,96,96,96]
[null,null,null,null,"Coincident",null,null,null,null,null,null,null,null,null,null,null,96,96,96,96,96,96,96]
[null,null,"WINTER/SUMMER PEAKING",null,"Non-coincident",null,null,null,null,null,null,null,null,null,null,null,"WINTER","WINTER","WINTER","WINTER","WINTER","WINTER","WINTER"]
[null,null,null,null,"Coincident",null,null,null,null,null,null,null,null,null,null,null,"WINTER","WINTER","WINTER","WINTER","WINTER","WINTER","WINTER"]
[null,null,"ADJUSTMENTS - EMBEDDED GENERATION","MW","Non-coincident",null,null,null,null,null,null,null,null,null,null,null,0,0,0,0,0,0,0]
[null,null,null,null,"Coincident",null,null,null,null,null,null,null,null,null,null,null,0,0,0,0,0,0,0]
[null,null,"WEATHER CORRECTED MD 10% POE","MW","Non-coincident",null,null,null,null,null,null,null,null,null,null,null,8.9926965089999999,8.7502446979999995,8.5271129779999999,8.3349129810000004,8.2842988700000006,8.2234820160000002,8.1631154539999997]
[null,null,null,null,"Coincident",null,null,null,null,null,null,null,null,null,null,null,7.2062333499999998,6.9360996100000003,6.7718990989999996,6.6432253790000004,6.6038822479999997,6.5563176280000004,6.5090466300000003]
[null,null,"WEATHER CORRECTED MD 10% POE","MVA","Non-coincident",null,null,null,null,null,null,null,null,null,null,null,9.5703468774371991,9.3123210528126688,9.0748563549189942,8.8703102947587897,8.8164449609650468,8.7517215058599014,8.6874772674871146]
[null,null,null,null,"Coincident",null,null,null,null,null,null,null,null,null,null,null,7.6309321295874044,7.3448780794709716,7.1710004246369703,7.0347433293568784,6.9930815141137632,6.9427136770814508,6.8926567666379581]
[null,null,"WEATHER CORRECTED MD 50% POE","MW","Non-coincident",null,null,null,null,null,null,null,null,null,null,null,8.6328826700000008,8.3857903619999998,8.1642844080000003,7.9797236089999997,7.9186550650000003,7.8487398519999996,7.7794640419999999]
[null,null,null,null,"Coincident",null,null,null,null,null,null,null,null,null,null,null,6.4618489769999998,6.2082266490000002,6.0609327100000003,5.9485041069999998,5.9037836339999998,5.8524071949999996,5.8014409049999998]
[null,null,"WEATHER CORRECTED MD 50% POE","MVA","Non-coincident",null,null,null,null,null,null,null,null,null,null,null,9.1874202161086416,8.9244558098329616,8.6887213098333209,8.4923051553862958,8.4273138428478251,8.3529075910911637,8.2791818147067495]
[null,null,null,null,"Coincident",null,null,null,null,null,null,null,null,null,null,null,6.8426775237761071,6.5741079843903254,6.4181332890096128,6.2990787153858854,6.2517226449269625,6.1973183396502129,6.1433483554716037]
[null,"George Town 220 kV (Basslink)","CONNECTION POINT RATING","MVA","Non-coincident",null,null,null,null,null,null,null,null,null,null,null,1911.6,1911.6,1911.6,1911.6,1911.6,1911.6,1911.6]
[null,null,null,null,"Coincident",null,null,null,null,null,null,null,null,null,null,null,1911.6,1911.6,1911.6,1911.6,1911.6,1911.6,1911.6]
[null,null,"WINTER/SUMMER PEAKING",null,"Non-coincident",null,null,null,null,null,null,null,null,null,null,null,"SUMMER","SUMMER","SUMMER","SUMMER","SUMMER","SUMMER","SUMMER"]
[null,null,null,null,"Coincident",null,null,null,null,null,null,null,null,null,null,null,"WINTER","WINTER","WINTER","WINTER","WINTER","WINTER","WINTER"]
[null,null,"ADJUSTMENTS - EMBEDDED GENERATION","MW","Non-coincident"]
[null,null,null,null,"Coincident"]
[null,null,"WEATHER CORRECTED MD 10% POE","MW","Non-coincident",null,null,null,null,null,null,null,null,null,null,null,630.43716799999993,630.43716799999993,630.43716799999993,630.43716799999993,630.43716799999993,630.43716799999993,630.43716799999993]
[null,null,null,null,"Coincident",null,null,null,null,null,null,null,null,null,null,null,97.353847999999999,97.353847999999999,97.353847999999999,97.353847999999999,97.353847999999999,97.353847999999999,97.353847999999999]
[null,null,"WEATHER CORRECTED MD 10% POE","MVA","Non-coincident",null,null,null,null,null,null,null,null,null,null,null,635.18161070016981,635.18161070016981,635.18161070016981,635.18161070016981,635.18161070016981,635.18161070016981,635.18161070016981]
[null,null,null,null,"Coincident",null,null,null,null,null,null,null,null,null,null,null,147.59345399625283,147.59345399625283,147.59345399625283,147.59345399625283,147.59345399625283,147.59345399625283,147.59345399625283]
[null,null,"WEATHER CORRECTED MD 50% POE","MW","Non-coincident",null,null,null,null,null,null,null,null,null,null,null,630.43716799999993,630.43716799999993,630.43716799999993,630.43716799999993,630.43716799999993,630.43716799999993,630.43716799999993]
[null,null,null,null,"Coincident",null,null,null,null,null,null,null,null,null,null,null,97.353847999999999,97.353847999999999,97.353847999999999,97.353847999999999,97.353847999999999,97.353847999999999,97.353847999999999]
[null,null,"WEATHER CORRECTED MD 50% POE","MVA","Non-coincident",null,null,null,null,null,null,null,null,null,null,null,635.18161070016981,635.18161070016981,635.18161070016981,635.18161070016981,635.18161070016981,635.18161070016981,635.18161070016981]
[null,null,null,null,"Coincident",null,null,null,null,null,null,null,null,null,null,null,147.59345399625283,147.59345399625283,147.59345399625283,147.59345399625283,147.59345399625283,147.59345399625283,147.59345399625283]
[null,"George Town 22 kV","CONNECTION POINT RATING","MVA","Non-coincident",null,null,null,null,null,null,null,null,null,null,null,120,120,120,120,120,120,120]
[null,null,null,null,"Coincident",null,null,null,null,null,null,null,null,null,null,null,120,120,120,120,120,120,120]
[null,null,"WINTER/SUMMER PEAKING",null,"Non-coincident",null,null,null,null,null,null,null,null,null,null,null,"WINTER","WINTER","WINTER","WINTER","WINTER","WINTER","WINTER"]
[null,null,null,null,"Coincident",null,null,null,null,null,null,null,null,null,null,null,"WINTER","WINTER","WINTER","WINTER","WINTER","WINTER","WINTER"]
[null,null,"ADJUSTMENTS - EMBEDDED GENERATION","MW","Non-coincident",null,null,null,null,null,null,null,null,null,null,null,2E-3,2E-3,2E-3,2E-3,2E-3,2E-3,2E-3]
[null,null,null,null,"Coincident",null,null,null,null,null,null,null,null,null,null,null,4.0000000000000001E-3,4.0000000000000001E-3,4.0000000000000001E-3,4.0000000000000001E-3,4.0000000000000001E-3,4.0000000000000001E-3,4.0000000000000001E-3]
[null,null,"WEATHER CORRECTED MD 10% POE","MW","Non-coincident",null,null,null,null,null,null,null,null,null,null,null,20.82494337,19.920442319999999,19.323575720000001,18.828835120000001,18.58563045,18.31586896,18.043500829999999]
[null,null,null,null,"Coincident",null,null,null,null,null,null,null,null,null,null,null,20.82494337,19.920442319999999,19.323575720000001,18.828835120000001,18.58563045,18.31586896,18.043500829999999]
[null,null,"WEATHER CORRECTED MD 10% POE","MVA","Non-coincident",null,null,null,null,null,null,null,null,null,null,null,21.023549387791267,20.110422175,19.507863300285372,19.008404394037914,18.762880298234023,18.490546111908735,18.215580426241406]
[null,null,null,null,"Coincident",null,null,null,null,null,null,null,null,null,null,null,20.850476640811728,19.94486659042461,19.347268177796575,18.851920980914318,18.608418119913676,18.338325877841203,18.065623799791492]
[null,null,"WEATHER CORRECTED MD 50% POE","MW","Non-coincident",null,null,null,null,null,null,null,null,null,null,null,18.833052049999999,18.204303719999999,17.632981260000001,17.142580160000001,16.91678959,16.669962689999998,16.42236368]
[null,null,null,null,"Coincident",null,null,null,null,null,null,null,null,null,null,null,20.82494337,19.920442319999999,19.323575720000001,18.828835120000001,18.58563045,18.31586896,18.043500829999999]
[null,null,"WEATHER CORRECTED MD 50% POE","MVA","Non-coincident",null,null,null,null,null,null,null,null,null,null,null,19.012661540602238,18.377916882074686,17.80114576002364,17.306067739281961,17.078123820522936,16.828942949766724,16.578982605451838]
[null,null,null,null,"Coincident",null,null,null,null,null,null,null,null,null,null,null,20.850476640811728,19.944866590424606,19.347268177796572,18.851920980914318,18.608418119913679,18.338325877841207,18.065623799791492]
[null,"Hadspen 22 kV","CONNECTION POINT RATING","MVA","Non-coincident",null,null,null,null,null,null,null,null,null,null,null,120,120,120,120,120,120,120]
[null,null,null,null,"Coincident",null,null,null,null,null,null,null,null,null,null,null,120,120,120,120,120,120,120]
[null,null,"WINTER/SUMMER PEAKING",null,"Non-coincident",null,null,null,null,null,null,null,null,null,null,null,"WINTER","WINTER","WINTER","WINTER","WINTER","WINTER","WINTER"]
[null,null,null,null,"Coincident",null,null,null,null,null,null,null,null,null,null,null,"WINTER","WINTER","WINTER","WINTER","WINTER","WINTER","WINTER"]
[null,null,"ADJUSTMENTS - EMBEDDED GENERATION","MW","Non-coincident",null,null,null,null,null,null,null,null,null,null,null,0,0,0,0,0,0,0]
[null,null,null,null,"Coincident",null,null,null,null,null,null,null,null,null,null,null,0,0,0,0,0,0,0]
[null,null,"WEATHER CORRECTED MD 10% POE","MW","Non-coincident",null,null,null,null,null,null,null,null,null,null,null,54.161066290000001,55.658078539999998,54.924411040000003,54.553001680000001,55.003692360000002,55.486784800000002,56.076218230000002]
[null,null,null,null,"Coincident",null,null,null,null,null,null,null,null,null,null,null,54.161066290000001,55.658078539999998,54.924411040000003,54.553001680000001,55.003692360000002,55.486784800000002,56.076218230000002]
[null,null,"WEATHER CORRECTED MD 10% POE","MVA","Non-coincident",null,null,null,null,null,null,null,null,null,null,null,54.305059224032782,55.806051439733722,55.070433406940225,54.698036615799424,55.149925504730675,55.634302297174401,56.225302798408713]
[null,null,null,null,"Coincident",null,null,null,null,null,null,null,null,null,null,null,54.305059224032782,55.806051439733722,55.070433406940225,54.698036615799424,55.149925504730675,55.634302297174401,56.225302798408713]
[null,null,"WEATHER CORRECTED MD 50% POE","MW","Non-coincident",null,null,null,null,null,null,null,null,null,null,null,49.766435289999997,51.779316770000001,51.007246100000003,50.531542219999999,50.91757982,51.339485619999998,51.860728279999996]
[null,null,null,null,"Coincident",null,null,null,null,null,null,null,null,null,null,null,48.605434260000003,50.018101870000002,49.408371780000003,49.150710289999999,49.532938010000002,49.94976423,50.462891849999998]
[null,null,"WEATHER CORRECTED MD 50% POE","MVA","Non-coincident",null,null,null,null,null,null,null,null,null,null,null,49.898744631832194,51.916977570546344,51.142854268855928,50.665885679681892,51.052949601548853,51.475977082826354,51.99860552167263]
[null,null,null,null,"Coincident",null,null,null,null,null,null,null,null,null,null,null,48.734656957565825,50.151080294103551,49.539729172047842,49.281382661672993,49.664626574570242,50.082560971246053,50.597052795398554]
[null,"Hampshire 110 kV","CONNECTION POINT RATING","MVA","Non-coincident",null,null,null,null,null,null,null,null,null,null,null,206.4,206.4,206.4,206.4,206.4,206.4,206.4]
[null,null,null,null,"Coincident",null,null,null,null,null,null,null,null,null,null,null,206.4,206.4,206.4,206.4,206.4,206.4,206.4]
[null,null,"WINTER/SUMMER PEAKING",null,"Non-coincident",null,null,null,null,null,null,null,null,null,null,null,"WINTER","WINTER","WINTER","WINTER","WINTER","WINTER","WINTER"]
[null,null,null,null,"Coincident",null,null,null,null,null,null,null,null,null,null,null,"WINTER","WINTER","WINTER","WINTER","WINTER","WINTER","WINTER"]
[null,null,"ADJUSTMENTS - EMBEDDED GENERATION","MW","Non-coincident"]
[null,null,null,null,"Coincident"]
[null,null,"WEATHER CORRECTED MD 10% POE","MW","Non-coincident",null,null,null,null,null,null,null,null,null,null,null,1.615,1.615,1.615,1.615,1.615,1.615,1.615]
[null,null,null,null,"Coincident",null,null,null,null,null,null,null,null,null,null,null,9.8799999999999999E-2,9.8799999999999999E-2,9.8799999999999999E-2,9.8799999999999999E-2,9.8799999999999999E-2,9.8799999999999999E-2,9.8799999999999999E-2]
[null,null,"WEATHER CORRECTED MD 10% POE","MVA","Non-coincident",null,null,null,null,null,null,null,null,null,null,null,1.9606948360211489,1.9606948360211489,1.9606948360211489,1.9606948360211489,1.9606948360211489,1.9606948360211489,1.9606948360211489]
[null,null,null,null,"Coincident",null,null,null,null,null,null,null,null,null,null,null,0.13190981767859433,0.13190981767859433,0.13190981767859433,0.13190981767859433,0.13190981767859433,0.13190981767859433,0.13190981767859433]
[null,null,"WEATHER CORRECTED MD 50% POE","MW","Non-coincident",null,null,null,null,null,null,null,null,null,null,null,1.615,1.615,1.615,1.615,1.615,1.615,1.615]
[null,null,null,null,"Coincident",null,null,null,null,null,null,null,null,null,null,null,9.8799999999999999E-2,9.8799999999999999E-2,9.8799999999999999E-2,9.8799999999999999E-2,9.8799999999999999E-2,9.8799999999999999E-2,9.8799999999999999E-2]
[null,null,"WEATHER CORRECTED MD 50% POE","MVA","Non-coincident",null,null,null,null,null,null,null,null,null,null,null,1.9606948360211489,1.9606948360211489,1.9606948360211489,1.9606948360211489,1.9606948360211489,1.9606948360211489,1.9606948360211489]
[null,null,null,null,"Coincident",null,null,null,null,null,null,null,null,null,null,null,0.13190981767859433,0.13190981767859433,0.13190981767859433,0.13190981767859433,0.13190981767859433,0.13190981767859433,0.13190981767859433]
[null,"Huon River 11 kV","CONNECTION POINT RATING","MVA","Non-coincident",null,null,null,null,null,null,null,null,null,null,null,30,30,30,30,30,30,30]
[null,null,null,null,"Coincident",null,null,null,null,null,null,null,null,null,null,null,30,30,30,30,30,30,30]
[null,null,"WINTER/SUMMER PEAKING",null,"Non-coincident",null,null,null,null,null,null,null,null,null,null,null,"WINTER","WINTER","WINTER","WINTER","WINTER","WINTER","WINTER"]
[null,null,null,null,"Coincident",null,null,null,null,null,null,null,null,null,null,null,"WINTER","WINTER","WINTER","WINTER","WINTER","WINTER","WINTER"]
[null,null,"ADJUSTMENTS - EMBEDDED GENERATION","MW","Non-coincident"]
[null,null,null,null,"Coincident"]
[null,null,"WEATHER CORRECTED MD 10% POE","MW","Non-coincident",null,null,null,null,null,null,null,null,null,null,null,1.606932,1.606932,1.606932,1.606932,1.606932,1.606932,1.606932]
[null,null,null,null,"Coincident",null,null,null,null,null,null,null,null,null,null,null,1.1833800000000001,1.1833800000000001,1.1833800000000001,1.1833800000000001,1.1833800000000001,1.1833800000000001,1.1833800000000001]
[null,null,"WEATHER CORRECTED MD 10% POE","MVA","Non-coincident",null,null,null,null,null,null,null,null,null,null,null,1.8542382768188128,1.8542382768188128,1.8542382768188128,1.8542382768188128,1.8542382768188128,1.8542382768188128,1.8542382768188128]
[null,null,null,null,"Coincident",null,null,null,null,null,null,null,null,null,null,null,1.4390031139424269,1.4390031139424269,1.4390031139424269,1.4390031139424269,1.4390031139424269,1.4390031139424269,1.4390031139424269]
[null,null,"WEATHER CORRECTED MD 50% POE","MW","Non-coincident",null,null,null,null,null,null,null,null,null,null,null,1.606932,1.606932,1.606932,1.606932,1.606932,1.606932,1.606932]
[null,null,null,null,"Coincident",null,null,null,null,null,null,null,null,null,null,null,1.1833800000000001,1.1833800000000001,1.1833800000000001,1.1833800000000001,1.1833800000000001,1.1833800000000001,1.1833800000000001]
[null,null,"WEATHER CORRECTED MD 50% POE","MVA","Non-coincident",null,null,null,null,null,null,null,null,null,null,null,1.8542382768188128,1.8542382768188128,1.8542382768188128,1.8542382768188128,1.8542382768188128,1.8542382768188128,1.8542382768188128]
[null,null,null,null,"Coincident",null,null,null,null,null,null,null,null,null,null,null,1.4390031139424269,1.4390031139424269,1.4390031139424269,1.4390031139424269,1.4390031139424269,1.4390031139424269,1.4390031139424269]
[null,"Kermandie 11 kV","CONNECTION POINT RATING","MVA","Non-coincident",null,null,null,null,null,null,null,null,null,null,null,24,24,24,24,24,24,24]
[null,null,null,null,"Coincident",null,null,null,null,null,null,null,null,null,null,null,24,24,24,24,24,24,24]
[null,null,"WINTER/SUMMER PEAKING",null,"Non-coincident",null,null,null,null,null,null,null,null,null,null,null,"WINTER","WINTER","WINTER","WINTER","WINTER","WINTER","WINTER"]
[null,null,null,null,"Coincident",null,null,null,null,null,null,null,null,null,null,null,"WINTER","WINTER","WINTER","WINTER","WINTER","WINTER","WINTER"]
[null,null,"ADJUSTMENTS - EMBEDDED GENERATION","MW","Non-coincident"]
[null,null,null,null,"Coincident"]
[null,null,"WEATHER CORRECTED MD 10% POE","MW","Non-coincident",null,null,null,null,null,null,null,null,null,null,null,6.3579681910000003,6.1744273730000003,6.0841928469999997,6.0259743290000003,6.0500293940000001,6.0686367450000001,6.0896982639999999]
[null,null,null,null,"Coincident",null,null,null,null,null,null,null,null,null,null,null,6.3579681910000003,6.1744273730000003,6.0841928469999997,6.0259743290000003,6.0500293940000001,6.0686367450000001,6.0896982639999999]
[null,null,"WEATHER CORRECTED MD 10% POE","MVA","Non-coincident",null,null,null,null,null,null,null,null,null,null,null,6.4493114484592819,6.2631337477808513,6.1716028460689056,6.1125479179267321,6.1369485757213926,6.1558232536412456,6.1771873579475436]
[null,null,null,null,"Coincident",null,null,null,null,null,null,null,null,null,null,null,6.4372855275195766,6.2514549892207256,6.1600947636183649,6.1011499541923699,6.1255051124970681,6.1443445951272793,6.1656688621530549]
[null,null,"WEATHER CORRECTED MD 50% POE","MW","Non-coincident",null,null,null,null,null,null,null,null,null,null,null,6.0502363409999997,5.9319069510000002,5.8311273899999998,5.7565485670000003,5.7720739679999999,5.7831282249999996,5.7967369409999998]
[null,null,null,null,"Coincident",null,null,null,null,null,null,null,null,null,null,null,5.7275814079999998,5.5541276650000002,5.4748450479999997,5.4272528490000003,5.442630619,5.4537520370000001,5.4672351389999996]
[null,null,"WEATHER CORRECTED MD 50% POE","MVA","Non-coincident",null,null,null,null,null,null,null,null,null,null,null,6.1371584958745338,6.0171290986377777,5.914901664180328,5.8392513868374234,5.8549998371918868,5.8662129077959877,5.8800171366409613]
[null,null,null,null,"Coincident",null,null,null,null,null,null,null,null,null,null,null,5.7990345025003291,5.6234168781327583,5.5431451894948021,5.494959265211758,5.5105288769639289,5.5217890375979879,5.5354403448652256]
[null,"Kingston 11 kV","CONNECTION POINT RATING","MVA","Non-coincident",null,null,null,null,null,null,null,null,null,null,null,84,84,84,84,84,84,84]
[null,null,null,null,"Coincident",null,null,null,null,null,null,null,null,null,null,null,84,84,84,84,84,84,84]
[null,null,"WINTER/SUMMER PEAKING",null,"Non-coincident",null,null,null,null,null,null,null,null,null,null,null,"WINTER","WINTER","WINTER","WINTER","WINTER","WINTER","WINTER"]
[null,null,null,null,"Coincident",null,null,null,null,null,null,null,null,null,null,null,"WINTER","WINTER","WINTER","WINTER","WINTER","WINTER","WINTER"]
[null,null,"ADJUSTMENTS - EMBEDDED GENERATION","MW","Non-coincident"]
[null,null,null,null,"Coincident"]
[null,null,"WEATHER CORRECTED MD 10% POE","MW","Non-coincident",null,null,null,null,null,null,null,null,null,null,null,28.107970569999999,27.04516546,26.40725548,25.919226299999998,25.791353480000001,25.64352744,25.509424509999999]
[null,null,null,null,"Coincident",null,null,null,null,null,null,null,null,null,null,null,28.107970569999999,27.04516546,26.40725548,25.919226299999998,25.791353480000001,25.64352744,25.509424509999999]
[null,null,"WEATHER CORRECTED MD 10% POE","MVA","Non-coincident",null,null,null,null,null,null,null,null,null,null,null,28.131946685043239,27.06823500167387,26.429780884094466,25.941335414923575,25.813353519334658,25.665401383637612,25.531184063761287]
[null,null,null,null,"Coincident",null,null,null,null,null,null,null,null,null,null,null,28.146428368905166,27.082169111047214,26.443386331864883,25.954689422118346,25.826641644371588,25.678613346293041,25.544326934404811]
[null,null,"WEATHER CORRECTED MD 50% POE","MW","Non-coincident",null,null,null,null,null,null,null,null,null,null,null,25.011685150000002,24.038965780000002,23.488137129999998,23.082558120000002,22.950417850000001,22.803758970000001,22.670436429999999]
[null,null,null,null,"Coincident",null,null,null,null,null,null,null,null,null,null,null,25.011685150000002,24.038965780000002,23.488137129999998,23.082558120000002,22.950417850000001,22.803758970000001,22.670436429999999]
[null,null,"WEATHER CORRECTED MD 50% POE","MVA","Non-coincident",null,null,null,null,null,null,null,null,null,null,null,25.033020131801276,24.059471031619871,23.508172524464989,23.102247555336472,22.96999456961025,22.823210589501361,22.689774325298149]
[null,null,null,null,"Coincident",null,null,null,null,null,null,null,null,null,null,null,25.045906559026403,24.071856297995708,23.520273994956256,23.114140064921461,22.981818998377708,22.834959457227139,22.701454503081653]
[null,"Kingston 33 kV","CONNECTION POINT RATING","MVA","Non-coincident",null,null,null,null,null,null,null,null,null,null,null,144,144,144,144,144,144,144]
[null,null,null,null,"Coincident",null,null,null,null,null,null,null,null,null,null,null,144,144,144,144,144,144,144]
[null,null,"WINTER/SUMMER PEAKING",null,"Non-coincident",null,null,null,null,null,null,null,null,null,null,null,"WINTER","WINTER","WINTER","WINTER","WINTER","WINTER","WINTER"]
[null,null,null,null,"Coincident",null,null,null,null,null,null,null,null,null,null,null,"WINTER","WINTER","WINTER","WINTER","WINTER","WINTER","WINTER"]
[null,null,"ADJUSTMENTS - EMBEDDED GENERATION","MW","Non-coincident"]
[null,null,null,null,"Coincident"]
[null,null,"WEATHER CORRECTED MD 10% POE","MW","Non-coincident",null,null,null,null,null,null,null,null,null,null,null,12.105371809999999,12.09311308,12.103213240000001,12.15465771,12.41683394,12.680247,12.96030554]
[null,null,null,null,"Coincident",null,null,null,null,null,null,null,null,null,null,null,11.12084009,10.98940846,11.01920404,11.1061038,11.34737778,11.5897223,11.84725572]
[null,null,"WEATHER CORRECTED MD 10% POE","MVA","Non-coincident",null,null,null,null,null,null,null,null,null,null,null,12.364445250876866,12.351924165336555,12.362240484182866,12.414785944393341,12.682573146041987,12.951623647741192,13.237675868129003]
[null,null,null,null,"Coincident",null,null,null,null,null,null,null,null,null,null,null,11.23563671769648,11.102848363944087,11.132951513523057,11.220748310016242,11.464512878769499,11.709359038340931,11.969550887730788]
[null,null,"WEATHER CORRECTED MD 50% POE","MW","Non-coincident",null,null,null,null,null,null,null,null,null,null,null,11.55400695,11.53431275,11.545133379999999,11.60583229,11.85063907,12.102773170000001,12.36650768]
[null,null,null,null,"Coincident",null,null,null,null,null,null,null,null,null,null,null,9.9145879140000002,9.7894065300000008,9.8256518120000003,9.9183010379999992,10.12889004,10.3457165,10.572418470000001]
[null,null,"WEATHER CORRECTED MD 50% POE","MVA","Non-coincident",null,null,null,null,null,null,null,null,null,null,null,11.801280340973335,11.781164655021527,11.792216863025949,11.854214822383375,12.104260841279961,12.361790996012905,12.631169827232947]
[null,null,null,null,"Coincident",null,null,null,null,null,null,null,null,null,null,null,10.016932813154778,9.8904592245535721,9.9270786541997786,10.020684266463533,10.233447106686539,10.452511792054578,10.681553928933839]
[null,"Knights Rd 11 kV","CONNECTION POINT RATING","MVA","Non-coincident",null,null,null,null,null,null,null,null,null,null,null,48,48,48,48,48,48,48]
[null,null,null,null,"Coincident",null,null,null,null,null,null,null,null,null,null,null,48,48,48,48,48,48,48]
[null,null,"WINTER/SUMMER PEAKING",null,"Non-coincident",null,null,null,null,null,null,null,null,null,null,null,"WINTER","WINTER","WINTER","WINTER","WINTER","WINTER","WINTER"]
[null,null,null,null,"Coincident",null,null,null,null,null,null,null,null,null,null,null,"WINTER","WINTER","WINTER","WINTER","WINTER","WINTER","WINTER"]
[null,null,"ADJUSTMENTS - EMBEDDED GENERATION","MW","Non-coincident"]
[null,null,null,null,"Coincident"]
[null,null,"WEATHER CORRECTED MD 10% POE","MW","Non-coincident",null,null,null,null,null,null,null,null,null,null,null,20.876603540000001,20.431422869999999,20.32609227,20.362634270000001,20.717034479999999,21.096968960000002,21.53063083]
[null,null,null,null,"Coincident",null,null,null,null,null,null,null,null,null,null,null,20.876603540000001,20.431422869999999,20.32609227,20.362634270000001,20.717034479999999,21.096968960000002,21.53063083]
[null,null,"WEATHER CORRECTED MD 10% POE","MVA","Non-coincident",null,null,null,null,null,null,null,null,null,null,null,21.191757185189328,20.739856058451736,20.632935385503504,20.670029024302433,21.029779267310595,21.415449246194584,21.855657684885617]
[null,null,null,null,"Coincident",null,null,null,null,null,null,null,null,null,null,null,21.175571672656922,20.724015691972408,20.617176681242025,20.654241989235238,21.013717467767012,21.399092885599643,21.838965108698027]
[null,null,"WEATHER CORRECTED MD 50% POE","MW","Non-coincident",null,null,null,null,null,null,null,null,null,null,null,18.915595870000001,18.49151531,18.408883289999999,18.464835489999999,18.771410450000001,19.103266130000002,19.484275149999998]
[null,null,null,null,"Coincident",null,null,null,null,null,null,null,null,null,null,null,18.915595870000001,18.49151531,18.408883289999999,18.464835489999999,18.771410450000001,19.103266130000002,19.484275149999998]
[null,null,"WEATHER CORRECTED MD 50% POE","MVA","Non-coincident",null,null,null,null,null,null,null,null,null,null,null,19.201146102246195,18.770663613212008,18.686784178503839,18.743581034089342,19.054784056119772,19.391649436429901,19.778410176592278]
[null,null,null,null,"Coincident",null,null,null,null,null,null,null,null,null,null,null,19.186480947858161,18.756327246081224,18.672511875510342,18.729265351671955,19.04023068787156,19.376838782351776,19.763304128378014]
[null,"Lindisfarne 33 kV","CONNECTION POINT RATING","MVA","Non-coincident",null,null,null,null,null,null,null,null,null,null,null,108,108,144,144,144,144,144]
[null,null,null,null,"Coincident",null,null,null,null,null,null,null,null,null,null,null,108,108,144,144,144,144,144]
[null,null,"WINTER/SUMMER PEAKING",null,"Non-coincident",null,null,null,null,null,null,null,null,null,null,null,"WINTER","WINTER","WINTER","WINTER","WINTER","WINTER","WINTER"]
[null,null,null,null,"Coincident",null,null,null,null,null,null,null,null,null,null,null,"WINTER","WINTER","WINTER","WINTER","WINTER","WINTER","WINTER"]
[null,null,"ADJUSTMENTS - EMBEDDED GENERATION","MW","Non-coincident"]
[null,null,null,null,"Coincident"]
[null,null,"WEATHER CORRECTED MD 10% POE","MW","Non-coincident",null,null,null,null,null,null,null,null,null,null,null,39.038536690000001,38.041844560000001,37.617373950000001,37.391015609999997,37.677769240000003,37.934998960000001,38.211898220000002]
[null,null,null,null,"Coincident",null,null,null,null,null,null,null,null,null,null,null,39.038536690000001,38.041844560000001,37.617373950000001,37.391015609999997,37.677769240000003,37.934998960000001,38.211898220000002]
[null,null,"WEATHER CORRECTED MD 10% POE","MVA","Non-coincident",null,null,null,null,null,null,null,null,null,null,null,39.417849348069744,38.4114729938861,37.982878072654096,37.754320352480001,38.043860185315175,38.30358924307474,38.583178957257545]
[null,null,null,null,"Coincident",null,null,null,null,null,null,null,null,null,null,null,39.278564333481825,38.275744062328876,37.84866360347479,37.620913503856237,37.909430232678702,38.168241524345063,38.446843293775359]
[null,null,"WEATHER CORRECTED MD 50% POE","MW","Non-coincident",null,null,null,null,null,null,null,null,null,null,null,34.368719640000002,33.448489850000001,33.092823039999999,32.92905519,33.149774549999997,33.348417699999999,33.565295550000002]
[null,null,null,null,"Coincident",null,null,null,null,null,null,null,null,null,null,null,34.368719640000002,33.448489850000001,33.092823039999999,32.92905519,33.149774549999997,33.348417699999999,33.565295550000002]
[null,null,"WEATHER CORRECTED MD 50% POE","MVA","Non-coincident",null,null,null,null,null,null,null,null,null,null,null,34.702658652740759,33.773487574534911,33.414364976113333,33.249005897964004,33.471869847752131,33.672443087033713,33.891428201309864]
[null,null,null,null,"Coincident",null,null,null,null,null,null,null,null,null,null,null,34.580035008969503,33.654147204948401,33.296293584849778,33.131518811577379,33.353595260042866,33.553459763383209,33.771671082403124]
[null,"Meadowbank 22 kV","CONNECTION POINT RATING","MVA","Non-coincident",null,null,null,null,null,null,null,null,null,null,null,12,12,12,12,12,12,12]
[null,null,null,null,"Coincident",null,null,null,null,null,null,null,null,null,null,null,12,12,12,12,12,12,12]
[null,null,"WINTER/SUMMER PEAKING",null,"Non-coincident",null,null,null,null,null,null,null,null,null,null,null,"SUMMER","SUMMER","SUMMER","SUMMER","SUMMER","SUMMER","SUMMER"]
[null,null,null,null,"Coincident",null,null,null,null,null,null,null,null,null,null,null,"WINTER","WINTER","WINTER","WINTER","WINTER","WINTER","WINTER"]
[null,null,"ADJUSTMENTS - EMBEDDED GENERATION","MW","Non-coincident"]
[null,null,null,null,"Coincident"]
[null,null,"WEATHER CORRECTED MD 10% POE","MW","Non-coincident",null,null,null,null,null,null,null,null,null,null,null,8.9172877509999999,8.9867171960000007,8.7219090799999996,8.8483666789999997,9.2097664980000005,9.2966905230000005,9.521889925]
[null,null,null,null,"Coincident",null,null,null,null,null,null,null,null,null,null,null,4.7364610520000001,4.6653229280000001,4.6632582579999999,4.6856367819999996,4.7731864179999999,4.8585619099999997,4.9480675969999997]
[null,null,"WEATHER CORRECTED MD 10% POE","MVA","Non-coincident",null,null,null,null,null,null,null,null,null,null,null,9.5136683330808438,9.5877411600125324,9.3052229035786187,9.4401378787008277,9.8257078086625338,9.9184452381498467,10.158705783649893]
[null,null,null,null,"Coincident",null,null,null,null,null,null,null,null,null,null,null,4.7370544815686326,4.6659074446976572,4.6638425160158663,4.686223843813405,4.7737844488770493,4.8591706375429427,4.9486875386795406]
[null,null,"WEATHER CORRECTED MD 50% POE","MW","Non-coincident",null,null,null,null,null,null,null,null,null,null,null,8.4100281070000005,8.4893084909999992,8.1580445519999998,8.2812110679999993,8.5557735259999994,8.8048884140000006,8.9687347890000009]
[null,null,null,null,"Coincident",null,null,null,null,null,null,null,null,null,null,null,4.2479753560000004,4.1743987090000001,4.1703770139999996,4.1905250069999997,4.2603284280000002,4.32850483,4.4003032150000001]
[null,null,"WEATHER CORRECTED MD 50% POE","MVA","Non-coincident",null,null,null,null,null,null,null,null,null,null,null,8.9724835977075266,9.0570661860187194,8.7036475979505585,8.8350513852550208,9.1279763457436545,9.393751824503866,9.5685561050041539]
[null,null,null,null,"Coincident",null,null,null,null,null,null,null,null,null,null,null,4.2485075833645665,4.1749217179718858,4.1708995190951086,4.1910500364301901,4.2608622030766892,4.3290471468745384,4.4008545274693871]
[null,"Mornington 33 kV","CONNECTION POINT RATING","MVA","Non-coincident",null,null,null,null,null,null,null,null,null,null,null,144,144,144,144,144,144,144]
[null,null,null,null,"Coincident",null,null,null,null,null,null,null,null,null,null,null,144,144,144,144,144,144,144]
[null,null,"WINTER/SUMMER PEAKING",null,"Non-coincident",null,null,null,null,null,null,null,null,null,null,null,"WINTER","WINTER","WINTER","WINTER","WINTER","WINTER","WINTER"]
[null,null,null,null,"Coincident",null,null,null,null,null,null,null,null,null,null,null,"WINTER","WINTER","WINTER","WINTER","WINTER","WINTER","WINTER"]
[null,null,"ADJUSTMENTS - EMBEDDED GENERATION","MW","Non-coincident"]
[null,null,null,null,"Coincident"]
[null,null,"WEATHER CORRECTED MD 10% POE","MW","Non-coincident",null,null,null,null,null,null,null,null,null,null,null,42.282130719999998,41.522586060000002,41.380323930000003,41.455003720000001,42.103929460000003,42.729690490000003,43.387741329999997]
[null,null,null,null,"Coincident",null,null,null,null,null,null,null,null,null,null,null,42.282130719999998,41.522586060000002,41.380323930000003,41.455003720000001,42.103929460000003,42.729690490000003,43.387741329999997]
[null,null,"WEATHER CORRECTED MD 10% POE","MVA","Non-coincident",null,null,null,null,null,null,null,null,null,null,null,42.682696865165831,41.915956544224521,41.772346672470576,41.847733952729286,42.502807388641116,43.134496660177525,43.798781644101048]
[null,null,null,null,"Coincident",null,null,null,null,null,null,null,null,null,null,null,42.554376827716659,41.789941612917261,41.646763485768858,41.72192412386724,42.375028165762245,43.004818344763905,43.667106241336469]
[null,null,"WEATHER CORRECTED MD 50% POE","MW","Non-coincident",null,null,null,null,null,null,null,null,null,null,null,39.864549689999997,39.537575920000002,39.321217529999998,39.278466979999997,39.856820249999998,40.417914109999998,41.010799800000001]
[null,null,null,null,"Coincident",null,null,null,null,null,null,null,null,null,null,null,38.477241460000002,37.744154569999999,37.641280979999998,37.756397219999997,38.317552040000002,38.861950870000001,39.436697090000003]
[null,null,"WEATHER CORRECTED MD 50% POE","MVA","Non-coincident",null,null,null,null,null,null,null,null,null,null,null,40.242212516498519,39.9121411111526,39.693733017299436,39.650577463513542,40.234409850482415,40.800819317826445,41.399321799868929]
[null,null,null,null,"Coincident",null,null,null,null,null,null,null,null,null,null,null,38.724988653549168,37.98718156499195,37.883645592704504,37.999503042944895,38.564271025597058,39.112175129810758,39.690622024744954]
[null,"Mowbray 22 kV","CONNECTION POINT RATING","MVA","Non-coincident",null,null,null,null,null,null,null,null,null,null,null,120,120,120,120,120,120,120]
[null,null,null,null,"Coincident",null,null,null,null,null,null,null,null,null,null,null,120,120,120,120,120,120,120]
[null,null,"WINTER/SUMMER PEAKING",null,"Non-coincident",null,null,null,null,null,null,null,null,null,null,null,"WINTER","WINTER","WINTER","WINTER","WINTER","WINTER","WINTER"]
[null,null,null,null,"Coincident",null,null,null,null,null,null,null,null,null,null,null,"WINTER","WINTER","WINTER","WINTER","WINTER","WINTER","WINTER"]
[null,null,"ADJUSTMENTS - EMBEDDED GENERATION","MW","Non-coincident"]
[null,null,null,null,"Coincident"]
[null,null,"WEATHER CORRECTED MD 10% POE","MW","Non-coincident",null,null,null,null,null,null,null,null,null,null,null,38.956050040000001,44.122287030000003,43.864060790000003,43.75914633,44.4105226,45.035969700000003,45.693635700000002]
[null,null,null,null,"Coincident",null,null,null,null,null,null,null,null,null,null,null,38.76208089,43.427709380000003,43.254478499999998,43.307243489999998,43.958537030000002,44.5838471,45.240869459999999]
[null,null,"WEATHER CORRECTED MD 10% POE","MVA","Non-coincident",null,null,null,null,null,null,null,null,null,null,null,39.455649165850872,44.688141525209218,44.426603614656287,44.32034365960606,44.980073626009002,45.613541888937618,46.279642249155465]
[null,null,null,null,"Coincident",null,null,null,null,null,null,null,null,null,null,null,39.215256293674301,43.935431599165206,43.76017544156992,43.813557317843674,44.472465263626937,45.105085961356082,45.7697897039439]
[null,null,"WEATHER CORRECTED MD 50% POE","MW","Non-coincident",null,null,null,null,null,null,null,null,null,null,null,37.472446959999999,42.604976180000001,42.347051700000002,42.275437269999998,42.871025449999998,43.446278479999997,44.053751310000003]
[null,null,null,null,"Coincident",null,null,null,null,null,null,null,null,null,null,null,34.827861030000001,39.164958749999997,39.035370010000001,39.13107772,39.687766860000004,40.225455140000001,40.792739769999997]
[null,null,"WEATHER CORRECTED MD 50% POE","MVA","Non-coincident",null,null,null,null,null,null,null,null,null,null,null,37.953019341580941,43.151371639359184,42.890139358783628,42.817606496175863,43.420832907818692,44.003463377539504,44.618726856091776]
[null,null,null,null,"Coincident",null,null,null,null,null,null,null,null,null,null,null,35.235040665844956,39.622844281011254,39.491740492587311,39.588567140970341,40.151764647393101,40.695739150881238,41.26965602134139]
[null,"New Norfolk 22 kV","CONNECTION POINT RATING","MVA","Non-coincident",null,null,null,null,null,null,null,null,null,null,null,75.599999999999994,75.599999999999994,75.599999999999994,75.599999999999994,75.599999999999994,75.599999999999994,75.599999999999994]
[null,null,null,null,"Coincident",null,null,null,null,null,null,null,null,null,null,null,75.599999999999994,75.599999999999994,75.599999999999994,75.599999999999994,75.599999999999994,75.599999999999994,75.599999999999994]
[null,null,"WINTER/SUMMER PEAKING",null,"Non-coincident",null,null,null,null,null,null,null,null,null,null,null,"WINTER","WINTER","WINTER","WINTER","WINTER","WINTER","WINTER"]
[null,null,null,null,"Coincident",null,null,null,null,null,null,null,null,null,null,null,"WINTER","WINTER","WINTER","WINTER","WINTER","WINTER","WINTER"]
[null,null,"ADJUSTMENTS - EMBEDDED GENERATION","MW","Non-coincident"]
[null,null,null,null,"Coincident"]
[null,null,"WEATHER CORRECTED MD 10% POE","MW","Non-coincident",null,null,null,null,null,null,null,null,null,null,null,16.388512609999999,15.74205647,15.33726319,15.013429800000001,14.89141263,14.75037352,14.60957664]
[null,null,null,null,"Coincident",null,null,null,null,null,null,null,null,null,null,null,16.388512609999999,15.74205647,15.33726319,15.013429800000001,14.89141263,14.75037352,14.60957664]
[null,null,"WEATHER CORRECTED MD 10% POE","MVA","Non-coincident",null,null,null,null,null,null,null,null,null,null,null,16.60572244647145,15.9506983152329,15.540539991787782,15.212414583386856,15.088780223946111,14.945871811786228,14.803208840090887]
[null,null,null,null,"Coincident",null,null,null,null,null,null,null,null,null,null,null,16.595597016438692,15.940972289744685,15.531064062579317,15.203138730439781,15.079579757725519,14.936758484751122,14.794182502582604]
[null,null,"WEATHER CORRECTED MD 50% POE","MW","Non-coincident",null,null,null,null,null,null,null,null,null,null,null,14.9935963,14.54404317,14.13966067,13.799826810000001,13.673765530000001,13.532351050000001,13.39203075]
[null,null,null,null,"Coincident",null,null,null,null,null,null,null,null,null,null,null,14.56526137,13.97398334,13.62297087,13.35073132,13.23057257,13.095417830000001,12.9611679]
[null,null,"WEATHER CORRECTED MD 50% POE","MVA","Non-coincident",null,null,null,null,null,null,null,null,null,null,null,15.192318214425274,14.736806803513746,14.327064704458776,13.982726759255033,13.854994690046411,13.711705932812931,13.569525857606848]
[null,null,null,null,"Coincident",null,null,null,null,null,null,null,null,null,null,null,14.74930726709931,14.150557878178789,13.795110032575627,13.519430477557325,13.397753407743055,13.260890859366768,13.124944554123323]
[null,"Newton 22 kV","CONNECTION POINT RATING","MVA","Non-coincident",null,null,null,null,null,null,null,null,null,null,null,27.6,27.6,27.6,27.6,27.6,27.6,27.6]
[null,null,null,null,"Coincident",null,null,null,null,null,null,null,null,null,null,null,27.6,27.6,27.6,27.6,27.6,27.6,27.6]
[null,null,"WINTER/SUMMER PEAKING",null,"Non-coincident",null,null,null,null,null,null,null,null,null,null,null,"WINTER","WINTER","WINTER","WINTER","WINTER","WINTER","WINTER"]
[null,null,null,null,"Coincident",null,null,null,null,null,null,null,null,null,null,null,"WINTER","WINTER","WINTER","WINTER","WINTER","WINTER","WINTER"]
[null,null,"ADJUSTMENTS - EMBEDDED GENERATION","MW","Non-coincident",null,null,null,null,null,null,null,null,null,null,null,0,0,0,0,0,0,0]
[null,null,null,null,"Coincident",null,null,null,null,null,null,null,null,null,null,null,0,0,0,0,0,0,0]
[null,null,"WEATHER CORRECTED MD 10% POE","MW","Non-coincident",null,null,null,null,null,null,null,null,null,null,null,2.6993407340000002,2.5829370360000001,2.4791114620000001,2.39141242,2.3512107549999999,2.31493824,2.2860111729999999]
[null,null,null,null,"Coincident",null,null,null,null,null,null,null,null,null,null,null,2.3143273390000001,2.1905725220000001,2.1064599550000001,2.0392998630000001,2.005320599,1.9746600510000001,1.950241911]
[null,null,"WEATHER CORRECTED MD 10% POE","MVA","Non-coincident",null,null,null,null,null,null,null,null,null,null,null,2.6993407358901877,2.5829370378086769,2.4791114637359741,2.3914124216745636,2.3512107566464127,2.3149382416210131,2.2860111746007572]
[null,null,null,null,"Coincident",null,null,null,null,null,null,null,null,null,null,null,2.3143273399044353,2.1905725228560722,2.1064599558232011,2.039299863796955,2.0053205997836758,1.9746600517716937,1.9502419117621512]
[null,null,"WEATHER CORRECTED MD 50% POE","MW","Non-coincident",null,null,null,null,null,null,null,null,null,null,null,2.4687170200000002,2.3480517129999998,2.2426546109999999,2.1556195470000001,2.1097955069999998,2.0693761930000001,2.037259514]
[null,null,null,null,"Coincident",null,null,null,null,null,null,null,null,null,null,null,1.977065098,1.8598585379999999,1.78128095,1.719256688,1.6829377919999999,1.6509075070000001,1.625478548]
[null,null,"WEATHER CORRECTED MD 50% POE","MVA","Non-coincident",null,null,null,null,null,null,null,null,null,null,null,2.4687170217286956,2.3480517146442001,2.242654612570397,2.1556195485094518,2.1097955084773634,2.0693761944490605,2.0372595154265714]
[null,null,null,null,"Coincident",null,null,null,null,null,null,null,null,null,null,null,1.9770650987726337,1.8598585387268296,1.7812809506961216,1.7192566886718827,1.6829377926576894,1.650907507645172,1.6254785486352343]
[null,"Newton 11 kV","CONNECTION POINT RATING","MVA","Non-coincident",null,null,null,null,null,null,null,null,null,null,null,18,18,18,18,18,18,18]
[null,null,null,null,"Coincident",null,null,null,null,null,null,null,null,null,null,null,18,18,18,18,18,18,18]
[null,null,"WINTER/SUMMER PEAKING",null,"Non-coincident",null,null,null,null,null,null,null,null,null,null,null,"WINTER","WINTER","WINTER","WINTER","WINTER","WINTER","WINTER"]
[null,null,null,null,"Coincident",null,null,null,null,null,null,null,null,null,null,null,"WINTER","WINTER","WINTER","WINTER","WINTER","WINTER","WINTER"]
[null,null,"ADJUSTMENTS - EMBEDDED GENERATION","MW","Non-coincident"]
[null,null,null,null,"Coincident"]
[null,null,"WEATHER CORRECTED MD 10% POE","MW","Non-coincident",null,null,null,null,null,null,null,null,null,null,null,4.651478,4.651478,4.651478,4.651478,4.651478,4.651478,4.651478]
[null,null,null,null,"Coincident",null,null,null,null,null,null,null,null,null,null,null,0,0,0,0,0,0,0]
[null,null,"WEATHER CORRECTED MD 10% POE","MVA","Non-coincident",null,null,null,null,null,null,null,null,null,null,null,5.5194711940536481,5.5194711940536481,5.5194711940536481,5.5194711940536481,5.5194711940536481,5.5194711940536481,5.5194711940536481]
[null,null,null,null,"Coincident",null,null,null,null,null,null,null,null,null,null,null,0,0,0,0,0,0,0]
[null,null,"WEATHER CORRECTED MD 50% POE","MW","Non-coincident",null,null,null,null,null,null,null,null,null,null,null,4.651478,4.651478,4.651478,4.651478,4.651478,4.651478,4.651478]
[null,null,null,null,"Coincident",null,null,null,null,null,null,null,null,null,null,null,0,0,0,0,0,0,0]
[null,null,"WEATHER CORRECTED MD 50% POE","MVA","Non-coincident",null,null,null,null,null,null,null,null,null,null,null,5.5194711940536481,5.5194711940536481,5.5194711940536481,5.5194711940536481,5.5194711940536481,5.5194711940536481,5.5194711940536481]
[null,null,null,null,"Coincident",null,null,null,null,null,null,null,null,null,null,null,0,0,0,0,0,0,0]
[null,"North Hobart 11 kV","CONNECTION POINT RATING","MVA","Non-coincident",null,null,null,null,null,null,null,null,null,null,null,108,108,108,108,108,108,108]
[null,null,null,null,"Coincident",null,null,null,null,null,null,null,null,null,null,null,108,108,108,108,108,108,108]
[null,null,"WINTER/SUMMER PEAKING",null,"Non-coincident",null,null,null,null,null,null,null,null,null,null,null,"WINTER","WINTER","WINTER","WINTER","WINTER","WINTER","WINTER"]
[null,null,null,null,"Coincident",null,null,null,null,null,null,null,null,null,null,null,"WINTER","WINTER","WINTER","WINTER","WINTER","WINTER","WINTER"]
[null,null,"ADJUSTMENTS - EMBEDDED GENERATION","MW","Non-coincident"]
[null,null,null,null,"Coincident"]
[null,null,"WEATHER CORRECTED MD 10% POE","MW","Non-coincident",null,null,null,null,null,null,null,null,null,null,null,41.730337749999997,45.554824689999997,46.63841832,45.906460590000002,45.965977219999999,45.986361899999999,46.027060480000003]
[null,null,null,null,"Coincident",null,null,null,null,null,null,null,null,null,null,null,41.730337749999997,45.263249279999997,46.426773089999998,45.863579870000002,45.929982940000002,45.956771879999998,46.00350349]
[null,null,"WEATHER CORRECTED MD 10% POE","MVA","Non-coincident",null,null,null,null,null,null,null,null,null,null,null,43.041702021494999,46.98637240117769,48.104017659988237,47.349058361654016,47.4104452852186,47.431470548124928,47.473448069695742]
[null,null,null,null,"Coincident",null,null,null,null,null,null,null,null,null,null,null,42.858504313152537,46.486926995796438,47.681906306246447,47.103487334583363,47.171685590707035,47.199198761278829,47.247193745665115]
[null,null,"WEATHER CORRECTED MD 50% POE","MW","Non-coincident",null,null,null,null,null,null,null,null,null,null,null,39.844194889999997,43.846339489999998,44.953359290000002,44.281554040000003,44.306673920000001,44.299690239999997,44.314084170000001]
[null,null,null,null,"Coincident",null,null,null,null,null,null,null,null,null,null,null,37.383696739999998,40.688635769999998,41.831141189999997,41.37699954,41.406105109999999,41.404878500000002,41.423252609999999]
[null,null,"WEATHER CORRECTED MD 50% POE","MVA","Non-coincident",null,null,null,null,null,null,null,null,null,null,null,41.096287646072398,45.224198528368952,46.366006118064178,45.673089574704164,45.698998839955088,45.69179569975109,45.706641955002844]
[null,null,null,null,"Coincident",null,null,null,null,null,null,null,null,null,null,null,38.394353229812438,41.788640247581931,42.962032942465406,42.495613715716942,42.525506145652564,42.52424637463681,42.543117222924757]
[null,"Norwood 22 kV","CONNECTION POINT RATING","MVA","Non-coincident",null,null,null,null,null,null,null,null,null,null,null,120,120,120,120,120,120,120]
[null,null,null,null,"Coincident",null,null,null,null,null,null,null,null,null,null,null,120,120,120,120,120,120,120]
[null,null,"WINTER/SUMMER PEAKING",null,"Non-coincident",null,null,null,null,null,null,null,null,null,null,null,"WINTER","WINTER","WINTER","WINTER","WINTER","WINTER","WINTER"]
[null,null,null,null,"Coincident",null,null,null,null,null,null,null,null,null,null,null,"WINTER","WINTER","WINTER","WINTER","WINTER","WINTER","WINTER"]
[null,null,"ADJUSTMENTS - EMBEDDED GENERATION","MW","Non-coincident"]
[null,null,null,null,"Coincident"]
[null,null,"WEATHER CORRECTED MD 10% POE","MW","Non-coincident",null,null,null,null,null,null,null,null,null,null,null,27.11968388,26.321137440000001,25.59305745,24.969475769999999,24.780584229999999,24.582064469999999,24.410071899999998]
[null,null,null,null,"Coincident",null,null,null,null,null,null,null,null,null,null,null,26.261829299999999,25.212838560000002,24.56137069,24.04968032,23.871354950000001,23.683427720000001,23.52082059]
[null,null,"WEATHER CORRECTED MD 10% POE","MVA","Non-coincident",null,null,null,null,null,null,null,null,null,null,null,27.158368831005685,26.358683302141529,25.62956474034748,25.005093550468022,24.815932565587964,24.617129626505818,24.44489171721008]
[null,null,null,null,"Coincident",null,null,null,null,null,null,null,null,null,null,null,26.314281439191067,25.26319557445029,24.610426542866858,24.097714185624334,23.919032650521675,23.730730077847976,23.567798176419501]
[null,null,"WEATHER CORRECTED MD 50% POE","MW","Non-coincident",null,null,null,null,null,null,null,null,null,null,null,25.737101540000001,24.95137952,24.253397759999999,23.67613287,23.47550494,23.27955485,23.100553590000001]
[null,null,null,null,"Coincident",null,null,null,null,null,null,null,null,null,null,null,23.27997813,22.32235915,21.75784573,21.32812375,21.150270020000001,20.97641368,20.817594710000002]
[null,null,"WEATHER CORRECTED MD 50% POE","MVA","Non-coincident",null,null,null,null,null,null,null,null,null,null,null,25.773814302453601,24.98697148702021,24.287994088932834,23.709905757771583,23.508991641484279,23.312762037915288,23.133505441053558]
[null,null,null,null,"Coincident",null,null,null,null,null,null,null,null,null,null,null,23.326474687390988,22.366943077335513,21.80130216784714,21.370721914158327,21.192512961051243,21.01830938183798,20.859173206413129]
[null,"Palmerston 22 kV","CONNECTION POINT RATING","MVA","Non-coincident",null,null,null,null,null,null,null,null,null,null,null,60,60,60,60,60,60,60]
[null,null,null,null,"Coincident",null,null,null,null,null,null,null,null,null,null,null,60,60,60,60,60,60,60]
[null,null,"WINTER/SUMMER PEAKING",null,"Non-coincident",null,null,null,null,null,null,null,null,null,null,null,"SUMMER","SUMMER","SUMMER","SUMMER","SUMMER","SUMMER","SUMMER"]
[null,null,null,null,"Coincident",null,null,null,null,null,null,null,null,null,null,null,"WINTER","WINTER","WINTER","WINTER","WINTER","WINTER","WINTER"]
[null,null,"ADJUSTMENTS - EMBEDDED GENERATION","MW","Non-coincident"]
[null,null,null,null,"Coincident"]
[null,null,"WEATHER CORRECTED MD 10% POE","MW","Non-coincident",null,null,null,null,null,null,null,null,null,null,null,12.599657430000001,12.58379852,12.10436311,12.17159713,12.55801235,12.566711959999999,12.760569090000001]
[null,null,null,null,"Coincident",null,null,null,null,null,null,null,null,null,null,null,4.8580959740000003,4.771283554,4.7554105660000001,4.7644834249999999,4.8395818730000002,4.9120525669999999,4.9882735619999998]
[null,null,"WEATHER CORRECTED MD 10% POE","MVA","Non-coincident",null,null,null,null,null,null,null,null,null,null,null,13.679331519607091,13.662113647721693,13.141595058064389,13.214590411635358,13.634117841485638,13.643562927587578,13.854031820368387]
[null,null,null,null,"Coincident",null,null,null,null,null,null,null,null,null,null,null,4.9031143187630146,4.8154974372056083,4.7994773595536078,4.8086342936926396,4.8844286538033366,4.9575709093997249,5.0344982187766849]
[null,null,"WEATHER CORRECTED MD 50% POE","MW","Non-coincident",null,null,null,null,null,null,null,null,null,null,null,11.780566049999999,11.78833079,11.23078529,11.30301135,11.57890538,11.81601734,11.935705280000001]
[null,null,null,null,"Coincident",null,null,null,null,null,null,null,null,null,null,null,4.510396858,4.4248975330000002,4.4132886710000001,4.4272533950000001,4.4935455040000001,4.5579051420000001,4.6258599419999999]
[null,null,"WEATHER CORRECTED MD 50% POE","MVA","Non-coincident",null,null,null,null,null,null,null,null,null,null,null,12.790051585281724,12.798481691672606,12.193159699853572,12.271574865074065,12.571110461308955,12.828540722895344,12.958484812189434]
[null,null,null,null,"Coincident",null,null,null,null,null,null,null,null,null,null,null,4.5521931917608329,4.4659015732140492,4.4541851357864291,4.4682792661964541,4.5351856819194998,4.6001417190824254,4.6687262334048825]
[null,"Port Latta 22 kV","CONNECTION POINT RATING","MVA","Non-coincident",null,null,null,null,null,null,null,null,null,null,null,54,54,54,54,54,54,54]
[null,null,null,null,"Coincident",null,null,null,null,null,null,null,null,null,null,null,54,54,54,54,54,54,54]
[null,null,"WINTER/SUMMER PEAKING",null,"Non-coincident",null,null,null,null,null,null,null,null,null,null,null,"SUMMER","SUMMER","SUMMER","SUMMER","SUMMER","SUMMER","SUMMER"]
[null,null,null,null,"Coincident",null,null,null,null,null,null,null,null,null,null,null,"WINTER","WINTER","WINTER","WINTER","WINTER","WINTER","WINTER"]
[null,null,"ADJUSTMENTS - EMBEDDED GENERATION","MW","Non-coincident"]
[null,null,null,null,"Coincident"]
[null,null,"WEATHER CORRECTED MD 10% POE","MW","Non-coincident",null,null,null,null,null,null,null,null,null,null,null,16.454731930000001,16.43981862,16.456346929999999,16.52997117,16.891271620000001,17.246638820000001,17.618385589999999]
[null,null,null,null,"Coincident",null,null,null,null,null,null,null,null,null,null,null,15.24679693,15.068206569999999,15.111630160000001,15.234192289999999,15.56952375,15.8993045,16.24414938]
[null,null,"WEATHER CORRECTED MD 10% POE","MVA","Non-coincident",null,null,null,null,null,null,null,null,null,null,null,17.979022341269925,17.962727531071074,17.980786947415112,18.06123139716064,18.456001053092731,18.84428783013259,19.250471504929465]
[null,null,null,null,"Coincident",null,null,null,null,null,null,null,null,null,null,null,15.732847952421213,15.548564329274134,15.593372215294709,15.719841490439363,16.06586294649108,16.406156742047351,16.761994895406357]
[null,null,"WEATHER CORRECTED MD 50% POE","MW","Non-coincident",null,null,null,null,null,null,null,null,null,null,null,15.48885551,15.4232823,15.40008795,15.44454805,15.734137949999999,16.01876983,16.317892310000001]
[null,null,null,null,"Coincident",null,null,null,null,null,null,null,null,null,null,null,13.40570672,13.202913880000001,13.21946741,13.31265082,13.56411243,13.811256220000001,14.07082877]
[null,null,"WEATHER CORRECTED MD 50% POE","MVA","Non-coincident",null,null,null,null,null,null,null,null,null,null,null,16.923671588188054,16.852023978698323,16.826681011178994,16.875259689616033,17.191675861210637,17.502674724718567,17.82950653052217]
[null,null,null,null,"Coincident",null,null,null,null,null,null,null,null,null,null,null,13.833065822862725,13.623808171422379,13.640889409649759,13.737043403695127,13.996521331693019,14.251543792365036,14.51939122815903]
[null,"Que 22 kV","CONNECTION POINT RATING","MVA","Non-coincident",null,null,null,null,null,null,null,null,null,null,null,60,60,60,60,60,60,60]
[null,null,null,null,"Coincident",null,null,null,null,null,null,null,null,null,null,null,60,60,60,60,60,60,60]
[null,null,"WINTER/SUMMER PEAKING",null,"Non-coincident",null,null,null,null,null,null,null,null,null,null,null,"SUMMER","SUMMER","SUMMER","SUMMER","SUMMER","SUMMER","SUMMER"]
[null,null,null,null,"Coincident",null,null,null,null,null,null,null,null,null,null,null,"WINTER","WINTER","WINTER","WINTER","WINTER","WINTER","WINTER"]
[null,null,"ADJUSTMENTS - EMBEDDED GENERATION","MW","Non-coincident"]
[null,null,null,null,"Coincident"]
[null,null,"WEATHER CORRECTED MD 10% POE","MW","Non-coincident",null,null,null,null,null,null,null,null,null,null,null,1.552664,1.552664,1.552664,1.552664,1.552664,1.552664,1.552664]
[null,null,null,null,"Coincident",null,null,null,null,null,null,null,null,null,null,null,0.21750999999999998,0.21750999999999998,0.21750999999999998,0.21750999999999998,0.21750999999999998,0.21750999999999998,0.21750999999999998]
[null,null,"WEATHER CORRECTED MD 10% POE","MVA","Non-coincident",null,null,null,null,null,null,null,null,null,null,null,2.1682836071187737,2.1682836071187737,2.1682836071187737,2.1682836071187737,2.1682836071187737,2.1682836071187737,2.1682836071187737]
[null,null,null,null,"Coincident",null,null,null,null,null,null,null,null,null,null,null,0.3067793925608433,0.3067793925608433,0.3067793925608433,0.3067793925608433,0.3067793925608433,0.3067793925608433,0.3067793925608433]
[null,null,"WEATHER CORRECTED MD 50% POE","MW","Non-coincident",null,null,null,null,null,null,null,null,null,null,null,1.552664,1.552664,1.552664,1.552664,1.552664,1.552664,1.552664]
[null,null,null,null,"Coincident",null,null,null,null,null,null,null,null,null,null,null,0.21750999999999998,0.21750999999999998,0.21750999999999998,0.21750999999999998,0.21750999999999998,0.21750999999999998,0.21750999999999998]
[null,null,"WEATHER CORRECTED MD 50% POE","MVA","Non-coincident",null,null,null,null,null,null,null,null,null,null,null,2.1682836071187737,2.1682836071187737,2.1682836071187737,2.1682836071187737,2.1682836071187737,2.1682836071187737,2.1682836071187737]
[null,null,null,null,"Coincident",null,null,null,null,null,null,null,null,null,null,null,0.3067793925608433,0.3067793925608433,0.3067793925608433,0.3067793925608433,0.3067793925608433,0.3067793925608433,0.3067793925608433]
[null,"Queenstown 11 kV","CONNECTION POINT RATING","MVA","Non-coincident",null,null,null,null,null,null,null,null,null,null,null,60,60,60,60,60,60,60]
[null,null,null,null,"Coincident",null,null,null,null,null,null,null,null,null,null,null,60,60,60,60,60,60,60]
[null,null,"WINTER/SUMMER PEAKING",null,"Non-coincident",null,null,null,null,null,null,null,null,null,null,null,"SUMMER","SUMMER","SUMMER","SUMMER","SUMMER","SUMMER","SUMMER"]
[null,null,null,null,"Coincident",null,null,null,null,null,null,null,null,null,null,null,"WINTER","WINTER","WINTER","WINTER","WINTER","WINTER","WINTER"]
[null,null,"ADJUSTMENTS - EMBEDDED GENERATION","MW","Non-coincident"]
[null,null,null,null,"Coincident"]
[null,null,"WEATHER CORRECTED MD 10% POE","MW","Non-coincident",null,null,null,null,null,null,null,null,null,null,null,4.3987160000000003,4.3987160000000003,4.3987160000000003,4.3987160000000003,4.3987160000000003,4.3987160000000003,4.3987160000000003]
[null,null,null,null,"Coincident",null,null,null,null,null,null,null,null,null,null,null,-6.6615180000000001,-6.6615180000000001,-6.6615180000000001,-6.6615180000000001,-6.6615180000000001,-6.6615180000000001,-6.6615180000000001]
[null,null,"WEATHER CORRECTED MD 10% POE","MVA","Non-coincident",null,null,null,null,null,null,null,null,null,null,null,5.625253174814091,5.625253174814091,5.625253174814091,5.625253174814091,5.625253174814091,5.625253174814091,5.625253174814091]
[null,null,null,null,"Coincident",null,null,null,null,null,null,null,null,null,null,null,7.0005082274260628,7.0005082274260628,7.0005082274260628,7.0005082274260628,7.0005082274260628,7.0005082274260628,7.0005082274260628]
[null,null,"WEATHER CORRECTED MD 50% POE","MW","Non-coincident",null,null,null,null,null,null,null,null,null,null,null,4.3987160000000003,4.3987160000000003,4.3987160000000003,4.3987160000000003,4.3987160000000003,4.3987160000000003,4.3987160000000003]
[null,null,null,null,"Coincident",null,null,null,null,null,null,null,null,null,null,null,-6.6615180000000001,-6.6615180000000001,-6.6615180000000001,-6.6615180000000001,-6.6615180000000001,-6.6615180000000001,-6.6615180000000001]
[null,null,"WEATHER CORRECTED MD 50% POE","MVA","Non-coincident",null,null,null,null,null,null,null,null,null,null,null,5.625253174814091,5.625253174814091,5.625253174814091,5.625253174814091,5.625253174814091,5.625253174814091,5.625253174814091]
[null,null,null,null,"Coincident",null,null,null,null,null,null,null,null,null,null,null,7.0005082274260628,7.0005082274260628,7.0005082274260628,7.0005082274260628,7.0005082274260628,7.0005082274260628,7.0005082274260628]
[null,"Quenstown 22 kV","CONNECTION POINT RATING","MVA","Non-coincident",null,null,null,null,null,null,null,null,null,null,null,60,60,60,60,60,60,60]
[null,null,null,null,"Coincident",null,null,null,null,null,null,null,null,null,null,null,60,60,60,60,60,60,60]
[null,null,"WINTER/SUMMER PEAKING",null,"Non-coincident",null,null,null,null,null,null,null,null,null,null,null,"WINTER","WINTER","WINTER","WINTER","WINTER","WINTER","WINTER"]
[null,null,null,null,"Coincident",null,null,null,null,null,null,null,null,null,null,null,"WINTER","WINTER","WINTER","WINTER","WINTER","WINTER","WINTER"]
[null,null,"ADJUSTMENTS - EMBEDDED GENERATION","MW","Non-coincident"]
[null,null,null,null,"Coincident"]
[null,null,"WEATHER CORRECTED MD 10% POE","MW","Non-coincident",null,null,null,null,null,null,null,null,null,null,null,5.3673311249999998,5.0823440580000003,4.8769904520000003,4.6974899470000002,4.5797511340000003,4.4536778269999999,4.3251125520000002]
[null,null,null,null,"Coincident",null,null,null,null,null,null,null,null,null,null,null,5.3673311249999998,5.0823440580000003,4.8769904520000003,4.6974899470000002,4.5797511340000003,4.4536778269999999,4.3251125520000002]
[null,null,"WEATHER CORRECTED MD 10% POE","MVA","Non-coincident",null,null,null,null,null,null,null,null,null,null,null,5.6068764439410685,5.3091703334781792,5.0946517451248745,4.9071400880794886,4.7841465626619035,4.6524465727105566,4.5181433976094851]
[null,null,null,null,"Coincident",null,null,null,null,null,null,null,null,null,null,null,5.9270175061847343,5.6123129918167596,5.3855458352217465,5.1873276499213192,5.0573114482828538,4.9180916609715943,4.7761200520162301]
[null,null,"WEATHER CORRECTED MD 50% POE","MW","Non-coincident",null,null,null,null,null,null,null,null,null,null,null,4.9641363959999998,4.7537686570000002,4.5590170519999997,4.3854862409999997,4.2789838800000002,4.1657164069999997,4.0507500930000004]
[null,null,null,null,"Coincident",null,null,null,null,null,null,null,null,null,null,null,4.7883548620000003,4.5352712049999999,4.3614832699999999,4.212882306,4.1111309909999996,4.0028190590000001,3.8928108560000001]
[null,null,"WEATHER CORRECTED MD 50% POE","MVA","Non-coincident",null,null,null,null,null,null,null,null,null,null,null,5.1856870342134727,4.9659305308611215,4.7624871134412174,4.5812115793192394,4.4699559915404992,4.3516333631357851,4.2315360740360131]
[null,null,null,null,"Coincident",null,null,null,null,null,null,null,null,null,null,null,5.2876676381501966,5.0081933089847395,4.8162833803591427,4.6521868313384358,4.5398252476691736,4.4202189289715017,4.2987394581097282]
[null,"Railton 22 kV","CONNECTION POINT RATING","MVA","Non-coincident",null,null,null,null,null,null,null,null,null,null,null,120,120,120,120,120,120,120]
[null,null,null,null,"Coincident",null,null,null,null,null,null,null,null,null,null,null,120,120,120,120,120,120,120]
[null,null,"WINTER/SUMMER PEAKING",null,"Non-coincident",null,null,null,null,null,null,null,null,null,null,null,"WINTER","WINTER","WINTER","WINTER","WINTER","WINTER","WINTER"]
[null,null,null,null,"Coincident",null,null,null,null,null,null,null,null,null,null,null,"WINTER","WINTER","WINTER","WINTER","WINTER","WINTER","WINTER"]
[null,null,"ADJUSTMENTS - EMBEDDED GENERATION","MW","Non-coincident",null,null,null,null,null,null,null,null,null,null,null,1.070576,1.070576,1.070576,1.070576,1.070576,1.070576,1.070576]
[null,null,null,null,"Coincident",null,null,null,null,null,null,null,null,null,null,null,0.464422,0.464422,0.464422,0.464422,0.464422,0.464422,0.464422]
[null,null,"WEATHER CORRECTED MD 10% POE","MW","Non-coincident",null,null,null,null,null,null,null,null,null,null,null,54.094522830000003,52.361494440000001,51.42306052,50.755126730000001,50.776618460000002,50.746377129999999,50.73046197]
[null,null,null,null,"Coincident",null,null,null,null,null,null,null,null,null,null,null,54.094522830000003,52.361494440000001,51.42306052,50.755126730000001,50.776618460000002,50.746377129999999,50.73046197]
[null,null,"WEATHER CORRECTED MD 10% POE","MVA","Non-coincident",null,null,null,null,null,null,null,null,null,null,null,55.778744359948881,53.991758497477534,53.024106635811506,52.335376868495402,52.357537738964488,52.32635485154951,52.309944176408194]
[null,null,null,null,"Coincident",null,null,null,null,null,null,null,null,null,null,null,55.778744359948881,53.991758497477534,53.024106635811506,52.335376868495402,52.357537738964488,52.32635485154951,52.309944176408194]
[null,null,"WEATHER CORRECTED MD 50% POE","MW","Non-coincident",null,null,null,null,null,null,null,null,null,null,null,48.803221530000002,47.720573729999998,46.810527989999997,46.111129740000003,46.131699060000003,46.113110300000002,46.111319760000001]
[null,null,null,null,"Coincident",null,null,null,null,null,null,null,null,null,null,null,48.803221530000002,47.227980250000002,46.455274520000003,45.951091650000002,45.977844939999997,45.965201790000002,45.968877740000003]
[null,null,"WEATHER CORRECTED MD 50% POE","MVA","Non-coincident",null,null,null,null,null,null,null,null,null,null,null,50.32269951282651,49.206343702500909,48.26796388081646,47.546790014191465,47.567999755620257,47.548832238508268,47.546985950423988]
[null,null,null,null,"Coincident",null,null,null,null,null,null,null,null,null,null,null,50.32269951282651,48.6984134286607,47.901649669146863,47.381769172099588,47.409355420126708,47.396318628324885,47.400109028250853]
[null,"Risdon 33 kV","CONNECTION POINT RATING","MVA","Non-coincident",null,null,null,null,null,null,null,null,null,null,null,180,180,180,180,180,180,180]
[null,null,null,null,"Coincident",null,null,null,null,null,null,null,null,null,null,null,180,180,180,180,180,180,180]
[null,null,"WINTER/SUMMER PEAKING",null,"Non-coincident",null,null,null,null,null,null,null,null,null,null,null,"WINTER","WINTER","WINTER","WINTER","WINTER","WINTER","WINTER"]
[null,null,null,null,"Coincident",null,null,null,null,null,null,null,null,null,null,null,"WINTER","WINTER","WINTER","WINTER","WINTER","WINTER","WINTER"]
[null,null,"ADJUSTMENTS - EMBEDDED GENERATION","MW","Non-coincident",null,null,null,null,null,null,null,null,null,null,null,0,0,0,0,0,0,0]
[null,null,null,null,"Coincident",null,null,null,null,null,null,null,null,null,null,null,0,0,0,0,0,0,0]
[null,null,"WEATHER CORRECTED MD 10% POE","MW","Non-coincident",null,null,null,null,null,null,null,null,null,null,null,69.04797619,69.263051869999998,68.611586689999996,68.198225190000002,68.956139219999997,69.661836210000004,70.477995620000002]
[null,null,null,null,"Coincident",null,null,null,null,null,null,null,null,null,null,null,67.67912905,67.155590119999999,66.648648489999999,66.486950219999997,67.236008470000002,67.933592070000003,68.738557029999996]
[null,null,"WEATHER CORRECTED MD 10% POE","MVA","Non-coincident",null,null,null,null,null,null,null,null,null,null,null,71.618633280287909,71.841716230772107,71.165996993282661,70.737246039029827,71.523377218648903,72.2553473171604,73.101892353067058]
[null,null,null,null,"Coincident",null,null,null,null,null,null,null,null,null,null,null,69.80515563200322,69.26517060262934,68.74230424966035,68.575526499100988,69.348115160519143,70.067612181947396,70.897863769103552]
[null,null,"WEATHER CORRECTED MD 50% POE","MW","Non-coincident",null,null,null,null,null,null,null,null,null,null,null,66.206153299999997,66.368149560000006,65.712545230000003,65.344251700000001,65.999736780000006,66.639858489999995,67.363928310000006]
[null,null,null,null,"Coincident",null,null,null,null,null,null,null,null,null,null,null,60.615646779999999,60.099200490000001,59.669864150000002,59.581677790000001,60.187545610000001,60.779075540000001,61.44676492]
[null,null,"WEATHER CORRECTED MD 50% POE","MVA","Non-coincident",null,null,null,null,null,null,null,null,null,null,null,68.671009285539824,68.839036668497343,68.159024180397239,67.777019077278908,68.456907875699898,69.120861325647354,69.871888274869008]
[null,null,null,null,"Coincident",null,null,null,null,null,null,null,null,null,null,null,62.519785886819619,61.987116300862233,61.544293078210629,61.453336491285995,62.078236634966593,62.688348487826467,63.377012212359652]
[null,"Risdon 11 kV","CONNECTION POINT RATING","MVA","Non-coincident",null,null,null,null,null,null,null,null,null,null,null,324,324,324,324,324,324,324]
[null,null,null,null,"Coincident",null,null,null,null,null,null,null,null,null,null,null,324,324,324,324,324,324,324]
[null,null,"WINTER/SUMMER PEAKING",null,"Non-coincident",null,null,null,null,null,null,null,null,null,null,null,"SUMMER","SUMMER","SUMMER","SUMMER","SUMMER","SUMMER","SUMMER"]
[null,null,null,null,"Coincident",null,null,null,null,null,null,null,null,null,null,null,"WINTER","WINTER","WINTER","WINTER","WINTER","WINTER","WINTER"]
[null,null,"ADJUSTMENTS - EMBEDDED GENERATION","MW","Non-coincident",null,null,null,null,null,null,null,null,null,null,null,0,0,0,0,0,0,0]
[null,null,null,null,"Coincident",null,null,null,null,null,null,null,null,null,null,null,0,0,0,0,0,0,0]
[null,null,"WEATHER CORRECTED MD 10% POE","MW","Non-coincident",null,null,null,null,null,null,null,null,null,null,null,146.01536560058594,146.01536560058594,146.01536560058594,146.01536560058594,146.01536560058594,146.01536560058594,146.01536560058594]
[null,null,null,null,"Coincident",null,null,null,null,null,null,null,null,null,null,null,130.95746686367124,130.95746686367124,130.95746686367124,130.95746686367124,130.95746686367124,130.95746686367124,130.95746686367124]
[null,null,"WEATHER CORRECTED MD 10% POE","MVA","Non-coincident",null,null,null,null,null,null,null,null,null,null,null,151.88684898362553,151.88684898362553,151.88684898362553,151.88684898362553,151.88684898362553,151.88684898362553,151.88684898362553]
[null,null,null,null,"Coincident",null,null,null,null,null,null,null,null,null,null,null,138.3724967949679,138.3724967949679,138.3724967949679,138.3724967949679,138.3724967949679,138.3724967949679,138.3724967949679]
[null,null,"WEATHER CORRECTED MD 50% POE","MW","Non-coincident",null,null,null,null,null,null,null,null,null,null,null,146.01536560058594,146.01536560058594,146.01536560058594,146.01536560058594,146.01536560058594,146.01536560058594,146.01536560058594]
[null,null,null,null,"Coincident",null,null,null,null,null,null,null,null,null,null,null,130.95746686367124,130.95746686367124,130.95746686367124,130.95746686367124,130.95746686367124,130.95746686367124,130.95746686367124]
[null,null,"WEATHER CORRECTED MD 50% POE","MVA","Non-coincident",null,null,null,null,null,null,null,null,null,null,null,151.88684898362553,151.88684898362553,151.88684898362553,151.88684898362553,151.88684898362553,151.88684898362553,151.88684898362553]
[null,null,null,null,"Coincident",null,null,null,null,null,null,null,null,null,null,null,138.3724967949679,138.3724967949679,138.3724967949679,138.3724967949679,138.3724967949679,138.3724967949679,138.3724967949679]
[null,"Rokeby 11 kV","CONNECTION POINT RATING","MVA","Non-coincident",null,null,null,null,null,null,null,null,null,null,null,84,84,84,84,84,84,84]
[null,null,null,null,"Coincident",null,null,null,null,null,null,null,null,null,null,null,84,84,84,84,84,84,84]
[null,null,"WINTER/SUMMER PEAKING",null,"Non-coincident",null,null,null,null,null,null,null,null,null,null,null,"WINTER","WINTER","WINTER","WINTER","WINTER","WINTER","WINTER"]
[null,null,null,null,"Coincident",null,null,null,null,null,null,null,null,null,null,null,"WINTER","WINTER","WINTER","WINTER","WINTER","WINTER","WINTER"]
[null,null,"ADJUSTMENTS - EMBEDDED GENERATION","MW","Non-coincident",null,null,null,null,null,null,null,null,null,null,null,0,0,0,0,0,0,0]
[null,null,null,null,"Coincident",null,null,null,null,null,null,null,null,null,null,null,0,0,0,0,0,0,0]
[null,null,"WEATHER CORRECTED MD 10% POE","MW","Non-coincident",null,null,null,null,null,null,null,null,null,null,null,22.935795030000001,22.52594066,22.45100192,22.49383624,22.848387200000001,23.190532149999999,23.550382819999999]
[null,null,null,null,"Coincident",null,null,null,null,null,null,null,null,null,null,null,22.935795030000001,22.52594066,22.45100192,22.49383624,22.848387200000001,23.190532149999999,23.550382819999999]
[null,null,"WEATHER CORRECTED MD 10% POE","MVA","Non-coincident",null,null,null,null,null,null,null,null,null,null,null,23.059107523920321,22.647049604209368,22.571707961981275,22.614772577326072,22.9712297526128,23.315214217964744,23.676999596724503]
[null,null,null,null,"Coincident",null,null,null,null,null,null,null,null,null,null,null,22.976298324582213,22.565720175342722,22.490649097838926,22.533559060783894,22.888736137382793,23.231485295681725,23.591971441263606]
[null,null,"WEATHER CORRECTED MD 50% POE","MW","Non-coincident",null,null,null,null,null,null,null,null,null,null,null,10.34752112,9.915966826,9.6551634370000006,9.4501832740000005,9.3526287180000001,9.2441012970000003,9.1358262190000001]
[null,null,null,null,"Coincident",null,null,null,null,null,null,null,null,null,null,null,20.574651450000001,20.184637250000002,20.1316822,20.195383759999999,20.497782220000001,20.791365500000001,21.1013485]
[null,null,"WEATHER CORRECTED MD 50% POE","MVA","Non-coincident",null,null,null,null,null,null,null,null,null,null,null,10.403153751593168,9.9692792399514616,9.7070736620899734,9.5009914394024548,9.4029123890224735,9.293801478898823,9.1849442684774214]
[null,null,null,null,"Coincident",null,null,null,null,null,null,null,null,null,null,null,20.610985100850812,20.220282158210185,20.167233592638258,20.231047645928619,20.533980124212732,20.828081855396078,21.138612267541507]
[null,"Rosebery 44 kV","CONNECTION POINT RATING","MVA","Non-coincident",null,null,null,null,null,null,null,null,null,null,null,72,72,72,72,72,72,72]
[null,null,null,null,"Coincident",null,null,null,null,null,null,null,null,null,null,null,72,72,72,72,72,72,72]
[null,null,"WINTER/SUMMER PEAKING",null,"Non-coincident",null,null,null,null,null,null,null,null,null,null,null,"WINTER","WINTER","WINTER","WINTER","WINTER","WINTER","WINTER"]
[null,null,null,null,"Coincident",null,null,null,null,null,null,null,null,null,null,null,"WINTER","WINTER","WINTER","WINTER","WINTER","WINTER","WINTER"]
[null,null,"ADJUSTMENTS - EMBEDDED GENERATION","MW","Non-coincident",null,null,null,null,null,null,null,null,null,null,null,0,0,0,0,0,0,0]
[null,null,null,null,"Coincident",null,null,null,null,null,null,null,null,null,null,null,0,0,0,0,0,0,0]
[null,null,"WEATHER CORRECTED MD 10% POE","MW","Non-coincident",null,null,null,null,null,null,null,null,null,null,null,30.341463789820217,30.842516749738735,31.343569709657253,31.343569709657253,31.343569709657253,31.343569709657253,31.343569709657253]
[null,null,null,null,"Coincident",null,null,null,null,null,null,null,null,null,null,null,27.292427923532507,27.743129705396996,28.193831487261484,28.193831487261484,28.193831487261484,28.193831487261484,28.193831487261484]
[null,null,"WEATHER CORRECTED MD 10% POE","MVA","Non-coincident",null,null,null,null,null,null,null,null,null,null,null,34.069796869707893,34.632418788137464,35.195040706567021,35.195040706567021,35.195040706567021,35.195040706567021,35.195040706567021]
[null,null,null,null,"Coincident",null,null,null,null,null,null,null,null,null,null,null,31.544751112526086,32.065674922409215,32.586598732292344,32.586598732292344,32.586598732292344,32.586598732292344,32.586598732292344]
[null,null,"WEATHER CORRECTED MD 50% POE","MW","Non-coincident",null,null,null,null,null,null,null,null,null,null,null,30.277701377868652,30.777701377868652,31.277701377868652,31.277701377868652,31.277701377868652,31.277701377868652,31.277701377868652]
[null,null,null,null,"Coincident",null,null,null,null,null,null,null,null,null,null,null,27.228665511580942,27.678314333526913,28.12796315547288,28.12796315547288,28.12796315547288,28.12796315547288,28.12796315547288]
[null,null,"WEATHER CORRECTED MD 50% POE","MVA","Non-coincident",null,null,null,null,null,null,null,null,null,null,null,33.99819938719483,34.559638958893061,35.121078530591291,35.121078530591291,35.121078530591291,35.121078530591291,35.121078530591291]
[null,null,null,null,"Coincident",null,null,null,null,null,null,null,null,null,null,null,31.471054136171251,31.990760928695057,32.510467721218859,32.510467721218859,32.510467721218859,32.510467721218859,32.510467721218859]
[null,"Savage River 22 kV","CONNECTION POINT RATING","MVA","Non-coincident",null,null,null,null,null,null,null,null,null,null,null,54,54,54,54,54,54,54]
[null,null,null,null,"Coincident",null,null,null,null,null,null,null,null,null,null,null,54,54,54,54,54,54,54]
[null,null,"WINTER/SUMMER PEAKING",null,"Non-coincident",null,null,null,null,null,null,null,null,null,null,null,"WINTER","WINTER","WINTER","WINTER","WINTER","WINTER","WINTER"]
[null,null,null,null,"Coincident",null,null,null,null,null,null,null,null,null,null,null,"WINTER","WINTER","WINTER","WINTER","WINTER","WINTER","WINTER"]
[null,null,"ADJUSTMENTS - EMBEDDED GENERATION","MW","Non-coincident",null,null,null,null,null,null,null,null,null,null,null,0,0,0,0,0,0,0]
[null,null,null,null,"Coincident",null,null,null,null,null,null,null,null,null,null,null,0,0,0,0,0,0,0]
[null,null,"WEATHER CORRECTED MD 10% POE","MW","Non-coincident",null,null,null,null,null,null,null,null,null,null,null,22.272285788774937,22.272285788774937,22.272285788774937,22.272285788774937,22.272285788774937,22.272285788774937,22.272285788774937]
[null,null,null,null,"Coincident",null,null,null,null,null,null,null,null,null,null,null,15.550907550931882,15.550907550931882,15.550907550931882,15.550907550931882,15.550907550931882,15.550907550931882,15.550907550931882]
[null,null,"WEATHER CORRECTED MD 10% POE","MVA","Non-coincident",null,null,null,null,null,null,null,null,null,null,null,23.240257667831212,23.240257667831212,23.240257667831212,23.240257667831212,23.240257667831212,23.240257667831212,23.240257667831212]
[null,null,null,null,"Coincident",null,null,null,null,null,null,null,null,null,null,null,16.111455359394949,16.111455359394949,16.111455359394949,16.111455359394949,16.111455359394949,16.111455359394949,16.111455359394949]
[null,null,"WEATHER CORRECTED MD 50% POE","MW","Non-coincident",null,null,null,null,null,null,null,null,null,null,null,22.269999980926514,22.269999980926514,22.269999980926514,22.269999980926514,22.269999980926514,22.269999980926514,22.269999980926514]
[null,null,null,null,"Coincident",null,null,null,null,null,null,null,null,null,null,null,15.548621743083457,15.548621743083457,15.548621743083457,15.548621743083457,15.548621743083457,15.548621743083457,15.548621743083457]
[null,null,"WEATHER CORRECTED MD 50% POE","MVA","Non-coincident",null,null,null,null,null,null,null,null,null,null,null,23.237872516891589,23.237872516891589,23.237872516891589,23.237872516891589,23.237872516891589,23.237872516891589,23.237872516891589]
[null,null,null,null,"Coincident",null,null,null,null,null,null,null,null,null,null,null,16.10908715734697,16.10908715734697,16.10908715734697,16.10908715734697,16.10908715734697,16.10908715734697,16.10908715734697]
[null,"Scottsdale 22 kV","CONNECTION POINT RATING","MVA","Non-coincident",null,null,null,null,null,null,null,null,null,null,null,75.599999999999994,75.599999999999994,75.599999999999994,75.599999999999994,75.599999999999994,75.599999999999994,75.599999999999994]
[null,null,null,null,"Coincident",null,null,null,null,null,null,null,null,null,null,null,75.599999999999994,75.599999999999994,75.599999999999994,75.599999999999994,75.599999999999994,75.599999999999994,75.599999999999994]
[null,null,"WINTER/SUMMER PEAKING",null,"Non-coincident",null,null,null,null,null,null,null,null,null,null,null,"WINTER","WINTER","WINTER","WINTER","WINTER","WINTER","WINTER"]
[null,null,null,null,"Coincident",null,null,null,null,null,null,null,null,null,null,null,"WINTER","WINTER","WINTER","WINTER","WINTER","WINTER","WINTER"]
[null,null,"ADJUSTMENTS - EMBEDDED GENERATION","MW","Non-coincident",null,null,null,null,null,null,null,null,null,null,null,0,0,0,0,0,0,0]
[null,null,null,null,"Coincident",null,null,null,null,null,null,null,null,null,null,null,0,0,0,0,0,0,0]
[null,null,"WEATHER CORRECTED MD 10% POE","MW","Non-coincident",null,null,null,null,null,null,null,null,null,null,null,11.39074014,10.908445739999999,10.59433713,10.33620138,10.21638594,10.08240206,9.9474291889999993]
[null,null,null,null,"Coincident",null,null,null,null,null,null,null,null,null,null,null,11.39074014,10.908445739999999,10.59433713,10.33620138,10.21638594,10.08240206,9.9474291889999993]
[null,null,"WEATHER CORRECTED MD 10% POE","MVA","Non-coincident",null,null,null,null,null,null,null,null,null,null,null,11.408600834105389,10.925550195911796,10.610949063237227,10.352408556073799,10.232405245321186,10.098211278437775,9.9630267698153006]
[null,null,null,null,"Coincident",null,null,null,null,null,null,null,null,null,null,null,11.440293716204078,10.955901172272299,10.64042608347016,10.381167355559908,10.260830677829658,10.126263922588356,9.9907038739013583]
[null,null,"WEATHER CORRECTED MD 50% POE","MW","Non-coincident",null,null,null,null,null,null,null,null,null,null,null,10.34752112,9.915966826,9.6551634370000006,9.4501832740000005,9.3526287180000001,9.2441012970000003,9.1358262190000001]
[null,null,null,null,"Coincident",null,null,null,null,null,null,null,null,null,null,null,10.34752112,9.915966826,9.6551634370000006,9.4501832740000005,9.3526287180000001,9.2441012970000003,9.1358262190000001]
[null,null,"WEATHER CORRECTED MD 50% POE","MVA","Non-coincident",null,null,null,null,null,null,null,null,null,null,null,10.363746045439601,9.9315150737926459,9.6703027447680903,9.4650011726283836,9.3672936509683922,9.258596058843013,9.150151205391758]
[null,null,null,null,"Coincident",null,null,null,null,null,null,null,null,null,null,null,10.392536340261465,9.9591046389700093,9.6971666669269183,9.4912947708171558,9.3933158194692332,9.2843162674434474,9.1755701561951497]
[null,"Smithton 22 kV","CONNECTION POINT RATING","MVA","Non-coincident",null,null,null,null,null,null,null,null,null,null,null,84,84,84,84,84,84,84]
[null,null,null,null,"Coincident",null,null,null,null,null,null,null,null,null,null,null,84,84,84,84,84,84,84]
[null,null,"WINTER/SUMMER PEAKING",null,"Non-coincident",null,null,null,null,null,null,null,null,null,null,null,"SUMMER","SUMMER","SUMMER","SUMMER","SUMMER","SUMMER","SUMMER"]
[null,null,null,null,"Coincident",null,null,null,null,null,null,null,null,null,null,null,"WINTER","WINTER","WINTER","WINTER","WINTER","WINTER","WINTER"]
[null,null,"ADJUSTMENTS - EMBEDDED GENERATION","MW","Non-coincident",null,null,null,null,null,null,null,null,null,null,null,0,0,0,0,0,0,0]
[null,null,null,null,"Coincident",null,null,null,null,null,null,null,null,null,null,null,0,0,0,0,0,0,0]
[null,null,"WEATHER CORRECTED MD 10% POE","MW","Non-coincident",null,null,null,null,null,null,null,null,null,null,null,24.338781869999998,23.780985810000001,22.41980693,22.405873639999999,22.67452952,22.24591641,22.13637246]
[null,null,null,null,"Coincident",null,null,null,null,null,null,null,null,null,null,null,24.104004719999999,24.508159859999999,24.161816470000002,23.9015916,24.05194066,24.182348770000001,24.324152770000001]
[null,null,"WEATHER CORRECTED MD 10% POE","MVA","Non-coincident",null,null,null,null,null,null,null,null,null,null,null,25.326592386826654,24.74615769120161,23.329734188848356,23.315235404220502,23.594794915515152,23.148786171667521,23.034796285694114]
[null,null,null,null,"Coincident",null,null,null,null,null,null,null,null,null,null,null,24.82897913850951,25.245290023623767,24.888529688361494,24.620478053639136,24.775349151516789,24.909679536873703,25.05574856559555]
[null,null,"WEATHER CORRECTED MD 50% POE","MW","Non-coincident",null,null,null,null,null,null,null,null,null,null,null,22.900784959999999,22.586005610000001,21.392845860000001,21.115278889999999,21.204824169999998,21.20381394,20.978240339999999]
[null,null,null,null,"Coincident",null,null,null,null,null,null,null,null,null,null,null,23.09418629,23.455821329999999,23.084848409999999,22.817159109999999,22.90669677,22.978983809999999,23.061878740000001]
[null,null,"WEATHER CORRECTED MD 50% POE","MVA","Non-coincident",null,null,null,null,null,null,null,null,null,null,null,23.83023312827325,23.502678186048847,22.261093015434145,21.972260749843173,22.065440302494476,22.064389071436011,21.829660371744147]
[null,null,null,null,"Coincident",null,null,null,null,null,null,null,null,null,null,null,23.788788472128314,24.161300383249195,23.779169737382315,23.503429165535042,23.595659843303135,23.670121055412647,23.7555092102677]
[null,"Sorrell 22 kV","CONNECTION POINT RATING","MVA","Non-coincident",null,null,null,null,null,null,null,null,null,null,null,144,144,144,144,144,144,144]
[null,null,null,null,"Coincident",null,null,null,null,null,null,null,null,null,null,null,144,144,144,144,144,144,144]
[null,null,"WINTER/SUMMER PEAKING",null,"Non-coincident",null,null,null,null,null,null,null,null,null,null,null,"WINTER","WINTER","WINTER","WINTER","WINTER","WINTER","WINTER"]
[null,null,null,null,"Coincident",null,null,null,null,null,null,null,null,null,null,null,"WINTER","WINTER","WINTER","WINTER","WINTER","WINTER","WINTER"]
[null,null,"ADJUSTMENTS - EMBEDDED GENERATION","MW","Non-coincident",null,null,null,null,null,null,null,null,null,null,null,0,0,0,0,0,0,0]
[null,null,null,null,"Coincident",null,null,null,null,null,null,null,null,null,null,null,0,0,0,0,0,0,0]
[null,null,"WEATHER CORRECTED MD 10% POE","MW","Non-coincident",null,null,null,null,null,null,null,null,null,null,null,32.824487859999998,31.983592000000002,31.62370177,31.43006506,31.667495330000001,31.879864860000001,32.108648289999998]
[null,null,null,null,"Coincident",null,null,null,null,null,null,null,null,null,null,null,32.824487859999998,31.983592000000002,31.62370177,31.43006506,31.667495330000001,31.879864860000001,32.108648289999998]
[null,null,"WEATHER CORRECTED MD 10% POE","MVA","Non-coincident",null,null,null,null,null,null,null,null,null,null,null,32.847498755589733,32.006013403777438,31.645870880534002,31.452098425716439,31.689695141059811,31.902213548114712,32.131157361778357]
[null,null,null,null,"Coincident",null,null,null,null,null,null,null,null,null,null,null,32.824499864870063,31.98360369732999,31.623713335707659,31.430076554889084,31.667506911724242,31.879876519393957,32.108660033066712]
[null,null,"WEATHER CORRECTED MD 50% POE","MW","Non-coincident",null,null,null,null,null,null,null,null,null,null,null,29.572026789999999,34.722348061760179,35.345712239857846,35.971150229587323,36.580395278739282,37.169993499729735,37.780633187292793]
[null,null,null,null,"Coincident",null,null,null,null,null,null,null,null,null,null,null,29.452800629999999,31.693532535662118,32.262520923917542,32.833402226105761,33.389503090976532,33.927670912078149,34.485044761649689]
[null,null,"WEATHER CORRECTED MD 50% POE","MVA","Non-coincident",null,null,null,null,null,null,null,null,null,null,null,29.592757618268937,34.746689411099347,35.370490585139734,35.99636702461261,36.606039171798038,37.196050717839007,37.807118481116568]
[null,null,null,null,"Coincident",null,null,null,null,null,null,null,null,null,null,null,29.452811401745961,31.693544126908922,32.262532723259952,32.833414234236066,33.389515302489102,33.927683320414346,34.485057373833719]
[null,"St Leonards 22 kV","CONNECTION POINT RATING","MVA","Non-coincident",null,null,null,null,null,null,null,null,null,null,null,144,144,144,144,144,144,144]
[null,null,null,null,"Coincident",null,null,null,null,null,null,null,null,null,null,null,144,144,144,144,144,144,144]
[null,null,"WINTER/SUMMER PEAKING",null,"Non-coincident",null,null,null,null,null,null,null,null,null,null,null,"WINTER","WINTER","WINTER","WINTER","WINTER","WINTER","WINTER"]
[null,null,null,null,"Coincident",null,null,null,null,null,null,null,null,null,null,null,"WINTER","WINTER","WINTER","WINTER","WINTER","WINTER","WINTER"]
[null,null,"ADJUSTMENTS - EMBEDDED GENERATION","MW","Non-coincident",null,null,null,null,null,null,null,null,null,null,null,0,0,0,0,0,0,0]
[null,null,null,null,"Coincident",null,null,null,null,null,null,null,null,null,null,null,0,0,0,0,0,0,0]
[null,null,"WEATHER CORRECTED MD 10% POE","MW","Non-coincident",null,null,null,null,null,null,null,null,null,null,null,30.145346419999999,29.58105406,29.456088770000001,29.484805489999999,29.920625019999999,30.338245140000001,30.776879300000001]
[null,null,null,null,"Coincident",null,null,null,null,null,null,null,null,null,null,null,30.145346419999999,29.58105406,29.456088770000001,29.484805489999999,29.920625019999999,30.338245140000001,30.776879300000001]
[null,null,"WEATHER CORRECTED MD 10% POE","MVA","Non-coincident",null,null,null,null,null,null,null,null,null,null,null,30.25152578760148,29.685245850312025,29.559840401646092,29.588658269038021,30.026012863237948,30.445103944613596,30.885283082636683]
[null,null,null,null,"Coincident",null,null,null,null,null,null,null,null,null,null,null,30.25152578760148,29.685245850312025,29.559840401646092,29.588658269038021,30.026012863237948,30.445103944613596,30.885283082636683]
[null,null,"WEATHER CORRECTED MD 50% POE","MW","Non-coincident",null,null,null,null,null,null,null,null,null,null,null,28.302641040000001,31.417513607324796,31.981546676541988,32.547456174307321,33.098713957562104,33.6321948758996,34.184714557433274]
[null,null,null,null,"Coincident",null,null,null,null,null,null,null,null,null,null,null,26.736199419999998,31.417513607324796,31.981546676541988,32.547456174307321,33.098713957562104,33.6321948758996,34.184714557433274]
[null,null,"WEATHER CORRECTED MD 50% POE","MVA","Non-coincident",null,null,null,null,null,null,null,null,null,null,null,28.402329943395223,31.528173862475271,32.094193595695636,32.66209636670969,33.21529581625007,33.750655786357193,34.305121578894379]
[null,null,null,null,"Coincident",null,null,null,null,null,null,null,null,null,null,null,26.830370928495228,31.528173862475271,32.094193595695636,32.66209636670969,33.21529581625007,33.750655786357193,34.305121578894379]
[null,"St Marys 22 kV","CONNECTION POINT RATING","MVA","Non-coincident",null,null,null,null,null,null,null,null,null,null,null,24,24,24,24,24,24,24]
[null,null,null,null,"Coincident",null,null,null,null,null,null,null,null,null,null,null,24,24,24,24,24,24,24]
[null,null,"WINTER/SUMMER PEAKING",null,"Non-coincident",null,null,null,null,null,null,null,null,null,null,null,"WINTER","WINTER","WINTER","WINTER","WINTER","WINTER","WINTER"]
[null,null,null,null,"Coincident",null,null,null,null,null,null,null,null,null,null,null,"WINTER","WINTER","WINTER","WINTER","WINTER","WINTER","WINTER"]
[null,null,"ADJUSTMENTS - EMBEDDED GENERATION","MW","Non-coincident",null,null,null,null,null,null,null,null,null,null,null,0,0,0,0,0,0,0]
[null,null,null,null,"Coincident",null,null,null,null,null,null,null,null,null,null,null,0,0,0,0,0,0,0]
[null,null,"WEATHER CORRECTED MD 10% POE","MW","Non-coincident",null,null,null,null,null,null,null,null,null,null,null,13.08290036,12.86950736,12.68320567,12.54228004,12.616901,12.68110121,12.751344570000001]
[null,null,null,null,"Coincident",null,null,null,null,null,null,null,null,null,null,null,12.58111901,12.24204293,12.08744048,11.996408949999999,12.06960647,12.132716759999999,12.20152959]
[null,null,"WEATHER CORRECTED MD 10% POE","MVA","Non-coincident",null,null,null,null,null,null,null,null,null,null,null,13.157097007807655,12.942493798692709,12.755135541685506,12.613410684522684,12.688454840063113,12.753019146726654,12.823660875719717]
[null,null,null,null,"Coincident",null,null,null,null,null,null,null,null,null,null,null,12.586365735312969,12.247148249842555,12.092481325721673,12.001411832688945,12.074639878374358,12.137776487365203,12.206618014495936]
[null,null,"WEATHER CORRECTED MD 50% POE","MW","Non-coincident",null,null,null,null,null,null,null,null,null,null,null,12.599635109999999,12.38412566,12.204831759999999,12.080176440000001,12.14504653,12.201450449999999,12.26420955]
[null,null,null,null,"Coincident",null,null,null,null,null,null,null,null,null,null,null,11.31763765,11.002357809999999,10.873014980000001,10.806624129999999,10.86613365,10.91799557,10.975456919999999]
[null,null,"WEATHER CORRECTED MD 50% POE","MVA","Non-coincident",null,null,null,null,null,null,null,null,null,null,null,12.671091030555647,12.454359368483335,12.27404864453862,12.148686370681228,12.213924356414477,12.270648158219892,12.333763181960904]
[null,null,null,null,"Coincident",null,null,null,null,null,null,null,null,null,null,null,11.322357463547114,11.006946141862862,10.877549371803982,10.811130834715655,10.870665172071305,10.92254872013541,10.980034033339264]
[null,"Starwood 110 kV","CONNECTION POINT RATING","MVA","Non-coincident",null,null,null,null,null,null,null,null,null,null,null,96,96,96,96,96,96,96]
[null,null,null,null,"Coincident",null,null,null,null,null,null,null,null,null,null,null,96,96,96,96,96,96,96]
[null,null,"WINTER/SUMMER PEAKING",null,"Non-coincident",null,null,null,null,null,null,null,null,null,null,null,"WINTER","WINTER","WINTER","WINTER","WINTER","WINTER","WINTER"]
[null,null,null,null,"Coincident",null,null,null,null,null,null,null,null,null,null,null,"WINTER","WINTER","WINTER","WINTER","WINTER","WINTER","WINTER"]
[null,null,"ADJUSTMENTS - EMBEDDED GENERATION","MW","Non-coincident",null,null,null,null,null,null,null,null,null,null,null,0,0,0,0,0,0,0]
[null,null,null,null,"Coincident",null,null,null,null,null,null,null,null,null,null,null,0,0,0,0,0,0,0]
[null,null,"WEATHER CORRECTED MD 10% POE","MW","Non-coincident",null,null,null,null,null,null,null,null,null,null,null,3.6292620000000002,3.6292620000000002,3.6292620000000002,3.6292620000000002,3.6292620000000002,3.6292620000000002,3.6292620000000002]
[null,null,null,null,"Coincident",null,null,null,null,null,null,null,null,null,null,null,2.8708679999999998,2.8708679999999998,2.8708679999999998,2.8708679999999998,2.8708679999999998,2.8708679999999998,2.8708679999999998]
[null,null,"WEATHER CORRECTED MD 10% POE","MVA","Non-coincident",null,null,null,null,null,null,null,null,null,null,null,3.8646383351666951,3.8646383351666951,3.8646383351666951,3.8646383351666951,3.8646383351666951,3.8646383351666951,3.8646383351666951]
[null,null,null,null,"Coincident",null,null,null,null,null,null,null,null,null,null,null,3.0658035255247524,3.0658035255247524,3.0658035255247524,3.0658035255247524,3.0658035255247524,3.0658035255247524,3.0658035255247524]
[null,null,"WEATHER CORRECTED MD 50% POE","MW","Non-coincident",null,null,null,null,null,null,null,null,null,null,null,3.6292620000000002,3.6292620000000002,3.6292620000000002,3.6292620000000002,3.6292620000000002,3.6292620000000002,3.6292620000000002]
[null,null,null,null,"Coincident",null,null,null,null,null,null,null,null,null,null,null,2.8708679999999998,2.8708679999999998,2.8708679999999998,2.8708679999999998,2.8708679999999998,2.8708679999999998,2.8708679999999998]
[null,null,"WEATHER CORRECTED MD 50% POE","MVA","Non-coincident",null,null,null,null,null,null,null,null,null,null,null,3.8646383351666951,3.8646383351666951,3.8646383351666951,3.8646383351666951,3.8646383351666951,3.8646383351666951,3.8646383351666951]
[null,null,null,null,"Coincident",null,null,null,null,null,null,null,null,null,null,null,3.0658035255247524,3.0658035255247524,3.0658035255247524,3.0658035255247524,3.0658035255247524,3.0658035255247524,3.0658035255247524]
[null,"TEMCO 110 kV","CONNECTION POINT RATING","MVA","Non-coincident",null,null,null,null,null,null,null,null,null,null,null,276,276,276,276,276,276,276]
[null,null,null,null,"Coincident",null,null,null,null,null,null,null,null,null,null,null,276,276,276,276,276,276,276]
[null,null,"WINTER/SUMMER PEAKING",null,"Non-coincident",null,null,null,null,null,null,null,null,null,null,null,"SUMMER","SUMMER","SUMMER","SUMMER","SUMMER","SUMMER","SUMMER"]
[null,null,null,null,"Coincident",null,null,null,null,null,null,null,null,null,null,null,"WINTER","WINTER","WINTER","WINTER","WINTER","WINTER","WINTER"]
[null,null,"ADJUSTMENTS - EMBEDDED GENERATION","MW","Non-coincident",null,null,null,null,null,null,null,null,null,null,null,0,0,0,0,0,0,0]
[null,null,null,null,"Coincident",null,null,null,null,null,null,null,null,null,null,null,0,0,0,0,0,0,0]
[null,null,"WEATHER CORRECTED MD 10% POE","MW","Non-coincident",null,null,null,null,null,null,null,null,null,null,null,112.814438,112.814438,112.814438,112.814438,112.814438,112.814438,112.814438]
[null,null,null,null,"Coincident",null,null,null,null,null,null,null,null,null,null,null,111.01575,111.01575,111.01575,111.01575,111.01575,111.01575,111.01575]
[null,null,"WEATHER CORRECTED MD 10% POE","MVA","Non-coincident",null,null,null,null,null,null,null,null,null,null,null,113.26893827867897,113.26893827867897,113.26893827867897,113.26893827867897,113.26893827867897,113.26893827867897,113.26893827867897]
[null,null,null,null,"Coincident",null,null,null,null,null,null,null,null,null,null,null,111.70940207065473,111.70940207065473,111.70940207065473,111.70940207065473,111.70940207065473,111.70940207065473,111.70940207065473]
[null,null,"WEATHER CORRECTED MD 50% POE","MW","Non-coincident",null,null,null,null,null,null,null,null,null,null,null,112.814438,112.814438,112.814438,112.814438,112.814438,112.814438,112.814438]
[null,null,null,null,"Coincident",null,null,null,null,null,null,null,null,null,null,null,111.01575,111.01575,111.01575,111.01575,111.01575,111.01575,111.01575]
[null,null,"WEATHER CORRECTED MD 50% POE","MVA","Non-coincident",null,null,null,null,null,null,null,null,null,null,null,113.26893827867897,113.26893827867897,113.26893827867897,113.26893827867897,113.26893827867897,113.26893827867897,113.26893827867897]
[null,null,null,null,"Coincident",null,null,null,null,null,null,null,null,null,null,null,111.70940207065473,111.70940207065473,111.70940207065473,111.70940207065473,111.70940207065473,111.70940207065473,111.70940207065473]
[null,"Trevallyn 22 kV","CONNECTION POINT RATING","MVA","Non-coincident",null,null,null,null,null,null,null,null,null,null,null,180,180,180,180,180,180,180]
[null,null,null,null,"Coincident",null,null,null,null,null,null,null,null,null,null,null,180,180,180,180,180,180,180]
[null,null,"WINTER/SUMMER PEAKING",null,"Non-coincident",null,null,null,null,null,null,null,null,null,null,null,"WINTER","WINTER","WINTER","WINTER","WINTER","WINTER","WINTER"]
[null,null,null,null,"Coincident",null,null,null,null,null,null,null,null,null,null,null,"WINTER","WINTER","WINTER","WINTER","WINTER","WINTER","WINTER"]
[null,null,"ADJUSTMENTS - EMBEDDED GENERATION","MW","Non-coincident",null,null,null,null,null,null,null,null,null,null,null,0,0,0,0,0,0,0]
[null,null,null,null,"Coincident",null,null,null,null,null,null,null,null,null,null,null,0,0,0,0,0,0,0]
[null,null,"WEATHER CORRECTED MD 10% POE","MW","Non-coincident",null,null,null,null,null,null,null,null,null,null,null,73.075442280000004,70.543067910000005,69.167117309999995,68.231159109999993,68.292593740000001,68.352419960000006,68.497510610000006]
[null,null,null,null,"Coincident",null,null,null,null,null,null,null,null,null,null,null,73.075442280000004,70.543067910000005,69.167117309999995,68.231159109999993,68.292593740000001,68.352419960000006,68.497510610000006]
[null,null,"WEATHER CORRECTED MD 10% POE","MVA","Non-coincident",null,null,null,null,null,null,null,null,null,null,null,73.077230490545389,70.544794151456841,69.16880988091998,68.232828777325111,68.294264910676318,68.354092594668529,68.499186795144894]
[null,null,null,null,"Coincident",null,null,null,null,null,null,null,null,null,null,null,73.292307171767675,70.752417512410133,69.372383524494339,68.433647695411182,68.49526464403931,68.555268409413245,68.700789642754614]
[null,null,"WEATHER CORRECTED MD 50% POE","MW","Non-coincident",null,null,null,null,null,null,null,null,null,null,null,67.259157329999994,65.716993819999999,64.426081769999996,63.473936029999997,63.557032659999997,63.627902519999999,63.761327479999999]
[null,null,null,null,"Coincident",null,null,null,null,null,null,null,null,null,null,null,66.053996749999996,63.833398189999997,62.75231763,62.08147975,62.171211939999999,62.248504429999997,62.386447889999999]
[null,null,"WEATHER CORRECTED MD 50% POE","MVA","Non-coincident",null,null,null,null,null,null,null,null,null,null,null,67.260803211717018,65.718601963826345,64.427658324246195,63.47548928453017,63.55858794796665,63.629459542204962,63.762887767213179]
[null,null,null,null,"Coincident",null,null,null,null,null,null,null,null,null,null,null,66.250024203397047,64.022835606424991,62.93854673989518,62.265718024401053,62.355716511272689,62.43323838103359,62.571591213766609]
[null,"Triabunna 22 kV","CONNECTION POINT RATING","MVA","Non-coincident",null,null,null,null,null,null,null,null,null,null,null,60,60,60,60,60,60,60]
[null,null,null,null,"Coincident",null,null,null,null,null,null,null,null,null,null,null,60,60,60,60,60,60,60]
[null,null,"WINTER/SUMMER PEAKING",null,"Non-coincident",null,null,null,null,null,null,null,null,null,null,null,"SUMMER","SUMMER","SUMMER","SUMMER","SUMMER","SUMMER","SUMMER"]
[null,null,null,null,"Coincident",null,null,null,null,null,null,null,null,null,null,null,"WINTER","WINTER","WINTER","WINTER","WINTER","WINTER","WINTER"]
[null,null,"ADJUSTMENTS - EMBEDDED GENERATION","MW","Non-coincident",null,null,null,null,null,null,null,null,null,null,null,0,0,0,0,0,0,0]
[null,null,null,null,"Coincident",null,null,null,null,null,null,null,null,null,null,null,0,0,0,0,0,0,0]
[null,null,"WEATHER CORRECTED MD 10% POE","MW","Non-coincident",null,null,null,null,null,null,null,null,null,null,null,8.1978837910000006,8.1815604119999996,8.180993849,8.2088720669999997,8.3794913310000005,8.5469029249999995,8.7221669399999993]
[null,null,null,null,"Coincident",null,null,null,null,null,null,null,null,null,null,null,7.1952631419999999,7.103261517,7.1160840140000001,7.1661838070000003,7.3162368710000001,7.4634486459999998,7.6174985079999997]
[null,null,"WEATHER CORRECTED MD 10% POE","MVA","Non-coincident",null,null,null,null,null,null,null,null,null,null,null,8.408603703386806,8.3918607452514529,8.3912796192119217,8.4198744240536261,8.5948793169888713,8.7665940893846113,8.9463631228536347]
[null,null,null,null,"Coincident",null,null,null,null,null,null,null,null,null,null,null,7.2258985455273859,7.1335052035253206,7.1463822951054041,7.1966953989107081,7.3473873465867374,7.4952259078546062,7.6499316707706067]
[null,null,"WEATHER CORRECTED MD 50% POE","MW","Non-coincident",null,null,null,null,null,null,null,null,null,null,null,7.9337115679999997,7.9205933760000002,7.9289626499999999,7.9720358999999998,8.1419166829999998,8.3098174149999995,8.4858262520000007]
[null,null,null,null,"Coincident",null,null,null,null,null,null,null,null,null,null,null,6.5043501419999998,6.4225548229999996,6.4470976550000003,6.5090214350000002,6.6486305420000003,6.7866057670000002,6.9311750859999997]
[null,null,"WEATHER CORRECTED MD 50% POE","MVA","Non-coincident",null,null,null,null,null,null,null,null,null,null,null,8.1376411489909497,8.1241857645716156,8.1327701639294503,8.1769505766677391,8.3511980065515665,8.5234144898404018,8.7039474903510694]
[null,null,null,null,"Coincident",null,null,null,null,null,null,null,null,null,null,null,6.5320438326060382,6.4499002521797681,6.4745475806446215,6.5367350146557124,6.6769385379049355,6.8155012225448734,6.9606860769794832]
[null,"Tungatinah 22 kV","CONNECTION POINT RATING","MVA","Non-coincident",null,null,null,null,null,null,null,null,null,null,null,30,30,30,30,30,30,30]
[null,null,null,null,"Coincident",null,null,null,null,null,null,null,null,null,null,null,30,30,30,30,30,30,30]
[null,null,"WINTER/SUMMER PEAKING",null,"Non-coincident",null,null,null,null,null,null,null,null,null,null,null,"WINTER","WINTER","WINTER","WINTER","WINTER","WINTER","WINTER"]
[null,null,null,null,"Coincident",null,null,null,null,null,null,null,null,null,null,null,"WINTER","WINTER","WINTER","WINTER","WINTER","WINTER","WINTER"]
[null,null,"ADJUSTMENTS - EMBEDDED GENERATION","MW","Non-coincident",null,null,null,null,null,null,null,null,null,null,null,0,0,0,0,0,0,0]
[null,null,null,null,"Coincident",null,null,null,null,null,null,null,null,null,null,null,0,0,0,0,0,0,0]
[null,null,"WEATHER CORRECTED MD 10% POE","MW","Non-coincident",null,null,null,null,null,null,null,null,null,null,null,1.2161283919999999,1.2263811819999999,1.2366339710000001,1.2468867610000001,1.2571395510000001,1.26739234,1.27764513]
[null,null,null,null,"Coincident",null,null,null,null,null,null,null,null,null,null,null,0.72049893200000004,0.72657322800000002,0.73264752499999997,0.73872182099999995,0.74479611700000004,0.75087041300000001,0.75694470899999999]
[null,null,"WEATHER CORRECTED MD 10% POE","MVA","Non-coincident",null,null,null,null,null,null,null,null,null,null,null,1.2368761229513765,1.2473038304434936,1.2577315369185502,1.2681592444106673,1.2785869519027844,1.2890146583778408,1.2994423658699579]
[null,null,null,null,"Coincident",null,null,null,null,null,null,null,null,null,null,null,0.72049895770380346,0.72657325392050398,0.73264755113720459,0.73872184735390511,0.74479614357060575,0.75087043978730628,0.7569447360040068]
[null,null,"WEATHER CORRECTED MD 50% POE","MW","Non-coincident",null,null,null,null,null,null,null,null,null,null,null,1.111075577,1.1100000143051147,1.1100000143051147,1.1100000143051147,1.1100000143051147,1.1100000143051147,1.1100000143051147]
[null,null,null,null,"Coincident",null,null,null,null,null,null,null,null,null,null,null,0.65826007499999994,0.45666286903557562,0.45666286903557562,0.45666286903557562,0.45666286903557562,0.45666286903557562,0.45666286903557562]
[null,null,"WEATHER CORRECTED MD 50% POE","MVA","Non-coincident",null,null,null,null,null,null,null,null,null,null,null,1.1300310567749032,1.128937144466966,1.128937144466966,1.128937144466966,1.128937144466966,1.128937144466966,1.128937144466966]
[null,null,null,null,"Coincident",null,null,null,null,null,null,null,null,null,null,null,0.65826009848343181,0.45666288532702604,0.45666288532702604,0.45666288532702604,0.45666288532702604,0.45666288532702604,0.45666288532702604]
[null,"Ulverstone 22 kV","CONNECTION POINT RATING","MVA","Non-coincident",null,null,null,null,null,null,null,null,null,null,null,108,108,108,108,108,108,108]
[null,null,null,null,"Coincident",null,null,null,null,null,null,null,null,null,null,null,108,108,108,108,108,108,108]
[null,null,"WINTER/SUMMER PEAKING",null,"Non-coincident",null,null,null,null,null,null,null,null,null,null,null,"WINTER","WINTER","WINTER","WINTER","WINTER","WINTER","WINTER"]
[null,null,null,null,"Coincident",null,null,null,null,null,null,null,null,null,null,null,"WINTER","WINTER","WINTER","WINTER","WINTER","WINTER","WINTER"]
[null,null,"ADJUSTMENTS - EMBEDDED GENERATION","MW","Non-coincident",null,null,null,null,null,null,null,null,null,null,null,1.95695,1.95695,1.95695,1.95695,1.95695,1.95695,1.95695]
[null,null,null,null,"Coincident",null,null,null,null,null,null,null,null,null,null,null,1.28,1.28,1.28,1.28,1.28,1.28,1.28]
[null,null,"WEATHER CORRECTED MD 10% POE","MW","Non-coincident",null,null,null,null,null,null,null,null,null,null,null,28.276956120000001,27.579187510000001,26.942429300000001,26.403721919999999,26.315419930000001,26.19790068,26.085250340000002]
[null,null,null,null,"Coincident",null,null,null,null,null,null,null,null,null,null,null,27.50624603,26.537308419999999,25.973202069999999,25.546025879999998,25.464441069999999,25.354264149999999,25.248566969999999]
[null,null,"WEATHER CORRECTED MD 10% POE","MVA","Non-coincident",null,null,null,null,null,null,null,null,null,null,null,28.370015122145031,27.669950167011589,27.031096396111085,26.490616138895511,26.40202354848428,26.284117544546145,26.171096474111543]
[null,null,null,null,"Coincident",null,null,null,null,null,null,null,null,null,null,null,27.721929603086032,26.745394303252446,26.176864649794904,25.746338861056635,25.664114323508532,25.55307347784775,25.446547498984295]
[null,null,"WEATHER CORRECTED MD 50% POE","MW","Non-coincident",null,null,null,null,null,null,null,null,null,null,null,26.790467159999999,30.175501628154045,30.717237075816204,31.260774772167338,31.790239972502572,32.30263107133635,32.833308283992011]
[null,null,null,null,"Coincident",null,null,null,null,null,null,null,null,null,null,null,24.342295660000001,29.087931490289883,29.610141983478702,30.134089769622562,30.644472253520515,31.138396012030807,31.649946825515332]
[null,null,"WEATHER CORRECTED MD 50% POE","MVA","Non-coincident",null,null,null,null,null,null,null,null,null,null,null,26.878634151182808,30.27480871265157,30.818327002850676,31.363653472909842,31.894861134597868,32.408938504194424,32.941362166915688]
[null,null,null,null,"Coincident",null,null,null,null,null,null,null,null,null,null,null,24.533169881780001,29.316017467222721,29.84232274764463,30.370378943583951,30.884763468241943,31.38256021039934,31.89812222581768]
[null,"Waddamana 22 kV","CONNECTION POINT RATING","MVA","Non-coincident",null,null,null,null,null,null,null,null,null,null,null,6,6,6,6,6,6,6]
[null,null,null,null,"Coincident",null,null,null,null,null,null,null,null,null,null,null,6,6,6,6,6,6,6]
[null,null,"WINTER/SUMMER PEAKING",null,"Non-coincident",null,null,null,null,null,null,null,null,null,null,null,"WINTER","WINTER","WINTER","WINTER","WINTER","WINTER","WINTER"]
[null,null,null,null,"Coincident",null,null,null,null,null,null,null,null,null,null,null,"WINTER","WINTER","WINTER","WINTER","WINTER","WINTER","WINTER"]
[null,null,"ADJUSTMENTS - EMBEDDED GENERATION","MW","Non-coincident",null,null,null,null,null,null,null,null,null,null,null,0,0,0,0,0,0,0]
[null,null,null,null,"Coincident",null,null,null,null,null,null,null,null,null,null,null,0,0,0,0,0,0,0]
[null,null,"WEATHER CORRECTED MD 10% POE","MW","Non-coincident",null,null,null,null,null,null,null,null,null,null,null,0.68600168900000003,0.70046564200000005,0.71492959499999997,0.72939354899999997,0.743857502,0.75832145500000003,0.77278540799999995]
[null,null,null,null,"Coincident",null,null,null,null,null,null,null,null,null,null,null,0.35765127800000002,0.36519215100000002,0.372733023,0.380273896,0.38781476799999998,0.39535564099999998,0.40289651300000001]
[null,null,"WEATHER CORRECTED MD 10% POE","MVA","Non-coincident",null,null,null,null,null,null,null,null,null,null,null,0.68600168900000003,0.70046564200000005,0.71492959499999997,0.72939354899999997,0.743857502,0.75832145500000003,0.77278540799999995]
[null,null,null,null,"Coincident",null,null,null,null,null,null,null,null,null,null,null,0.35765127800000002,0.36519215100000002,0.372733023,0.380273896,0.38781476799999998,0.39535564099999998,0.40289651300000001]
[null,null,"WEATHER CORRECTED MD 50% POE","MW","Non-coincident",null,null,null,null,null,null,null,null,null,null,null,0.62241115800000002,0.63483205799999998,0.64725295900000002,0.65967385899999997,0.67209476000000001,0.68451565999999997,0.69693656100000001]
[null,null,null,null,"Coincident",null,null,null,null,null,null,null,null,null,null,null,0.32449795599999998,0.33097367,0.33744938499999999,0.34392509900000001,0.35040081299999998,0.35687652800000003,0.36335224199999999]
[null,null,"WEATHER CORRECTED MD 50% POE","MVA","Non-coincident",null,null,null,null,null,null,null,null,null,null,null,0.62241115800000002,0.63483205799999998,0.64725295900000002,0.65967385899999997,0.67209476000000001,0.68451565999999997,0.69693656100000001]
[null,null,null,null,"Coincident",null,null,null,null,null,null,null,null,null,null,null,0.32449795599999998,0.33097367,0.33744938499999999,0.34392509900000001,0.35040081300000003,0.35687652800000003,0.36335224200000005]
[null,"Wesley Vale 11 kV","CONNECTION POINT RATING","MVA","Non-coincident",null,null,null,null,null,null,null,null,null,null,null,60]
[null,null,null,null,"Coincident",null,null,null,null,null,null,null,null,null,null,null,60]
[null,null,"WINTER/SUMMER PEAKING",null,"Non-coincident",null,null,null,null,null,null,null,null,null,null,null,"WINTER"]
[null,null,null,null,"Coincident",null,null,null,null,null,null,null,null,null,null,null,"WINTER"]
[null,null,"ADJUSTMENTS - EMBEDDED GENERATION","MW","Non-coincident",null,null,null,null,null,null,null,null,null,null,null,0]
[null,null,null,null,"Coincident",null,null,null,null,null,null,null,null,null,null,null,0]
[null,null,"WEATHER CORRECTED MD 10% POE","MW","Non-coincident",null,null,null,null,null,null,null,null,null,null,null,13.417965219999999]
[null,null,null,null,"Coincident",null,null,null,null,null,null,null,null,null,null,null,5.9765297559999997]
[null,null,"WEATHER CORRECTED MD 10% POE","MVA","Non-coincident",null,null,null,null,null,null,null,null,null,null,null,15.900259276410521]
[null,null,null,null,"Coincident",null,null,null,null,null,null,null,null,null,null,null,5.9765325738197781]
[null,null,"WEATHER CORRECTED MD 50% POE","MW","Non-coincident",null,null,null,null,null,null,null,null,null,null,null,13.34687682]
[null,null,null,null,"Coincident",null,null,null,null,null,null,null,null,null,null,null,5.9448660929999999]
[null,null,"WEATHER CORRECTED MD 50% POE","MVA","Non-coincident",null,null,null,null,null,null,null,null,null,null,null,15.816019678750783]
[null,null,null,null,"Coincident",null,null,null,null,null,null,null,null,null,null,null,5.9448688958909655]
[null,"Wesley Vale 22 kV","CONNECTION POINT RATING","MVA","Non-coincident",null,null,null,null,null,null,null,null,null,null,null,null,60,60,60,60,60,60]
[null,null,null,null,"Coincident",null,null,null,null,null,null,null,null,null,null,null,null,60,60,60,60,60,60]
[null,null,"WINTER/SUMMER PEAKING",null,"Non-coincident",null,null,null,null,null,null,null,null,null,null,null,null,"WINTER","WINTER","WINTER","WINTER","WINTER","WINTER"]
[null,null,null,null,"Coincident",null,null,null,null,null,null,null,null,null,null,null,null,"WINTER","WINTER","WINTER","WINTER","WINTER","WINTER"]
[null,null,"ADJUSTMENTS - EMBEDDED GENERATION","MW","Non-coincident",null,null,null,null,null,null,null,null,null,null,null,null,0,0,0,0,0,0]
[null,null,null,null,"Coincident",null,null,null,null,null,null,null,null,null,null,null,null,0,0,0,0,0,0]
[null,null,"WEATHER CORRECTED MD 10% POE","MW","Non-coincident",null,null,null,null,null,null,null,null,null,null,null,null,13.417965219999999,13.417965219999999,13.417965219999999,13.417965219999999,13.417965219999999,13.417965219999999]
[null,null,null,null,"Coincident",null,null,null,null,null,null,null,null,null,null,null,null,5.9765297559999997,5.9765297559999997,5.9765297559999997,5.9765297559999997,5.9765297559999997,5.9765297559999997]
[null,null,"WEATHER CORRECTED MD 10% POE","MVA","Non-coincident",null,null,null,null,null,null,null,null,null,null,null,null,15.900259276410521,15.900259276410521,15.900259276410521,15.900259276410521,15.900259276410521,15.900259276410521]
[null,null,null,null,"Coincident",null,null,null,null,null,null,null,null,null,null,null,null,5.9765325738197781,5.9765325738197781,5.9765325738197781,5.9765325738197781,5.9765325738197781,5.9765325738197781]
[null,null,"WEATHER CORRECTED MD 50% POE","MW","Non-coincident",null,null,null,null,null,null,null,null,null,null,null,null,13.34687682,13.34687682,13.34687682,13.34687682,13.34687682,13.34687682]
[null,null,null,null,"Coincident",null,null,null,null,null,null,null,null,null,null,null,null,5.9448660929999999,5.9448660929999999,5.9448660929999999,5.9448660929999999,5.9448660929999999,5.9448660929999999]
[null,null,"WEATHER CORRECTED MD 50% POE","MVA","Non-coincident",null,null,null,null,null,null,null,null,null,null,null,null,15.816019678750783,15.816019678750783,15.816019678750783,15.816019678750783,15.816019678750783,15.816019678750783]
[null,null,null,null,"Coincident",null,null,null,null,null,null,null,null,null,null,null,null,5.9448688958909655,5.9448688958909655,5.9448688958909655,5.9448688958909655,5.9448688958909655,5.9448688958909655]
[null,"NSP to enter name","CONNECTION POINT RATING","MVA","Non-coincident"]
[null,null,null,null,"Coincident"]
[null,null,"WINTER/SUMMER PEAKING",null,"Non-coincident"]
[null,null,null,null,"Coincident"]
[null,null,"ADJUSTMENTS - EMBEDDED GENERATION","MW","Non-coincident"]
[null,null,null,null,"Coincident"]
[null,null,"WEATHER CORRECTED MD 10% POE","MW","Non-coincident"]
[null,null,null,null,"Coincident"]
[null,null,"WEATHER CORRECTED MD 10% POE","MVA","Non-coincident"]
[null,null,null,null,"Coincident"]
[null,null,"WEATHER CORRECTED MD 50% POE","MW","Non-coincident"]
[null,null,null,null,"Coincident"]
[null,null,"WEATHER CORRECTED MD 50% POE","MVA","Non-coincident"]
[null,null,null,null,"Coincident"]
[null,"NSP to enter name","CONNECTION POINT RATING","MVA","Non-coincident"]
[null,null,null,null,"Coincident"]
[null,null,"WINTER/SUMMER PEAKING",null,"Non-coincident"]
[null,null,null,null,"Coincident"]
[null,null,"ADJUSTMENTS - EMBEDDED GENERATION","MW","Non-coincident"]
[null,null,null,null,"Coincident"]
[null,null,"WEATHER CORRECTED MD 10% POE","MW","Non-coincident"]
[null,null,null,null,"Coincident"]
[null,null,"WEATHER CORRECTED MD 10% POE","MVA","Non-coincident"]
[null,null,null,null,"Coincident"]
[null,null,"WEATHER CORRECTED MD 50% POE","MW","Non-coincident"]
[null,null,null,null,"Coincident"]
[null,null,"WEATHER CORRECTED MD 50% POE","MVA","Non-coincident"]
[null,null,null,null,"Coincident"]
[null,"NSP to enter name","CONNECTION POINT RATING","MVA","Non-coincident"]
[null,null,null,null,"Coincident"]
[null,null,"WINTER/SUMMER PEAKING",null,"Non-coincident"]
[null,null,null,null,"Coincident"]
[null,null,"ADJUSTMENTS - EMBEDDED GENERATION","MW","Non-coincident"]
[null,null,null,null,"Coincident"]
[null,null,"WEATHER CORRECTED MD 10% POE","MW","Non-coincident"]
[null,null,null,null,"Coincident"]
[null,null,"WEATHER CORRECTED MD 10% POE","MVA","Non-coincident"]
[null,null,null,null,"Coincident"]
[null,null,"WEATHER CORRECTED MD 50% POE","MW","Non-coincident"]
[null,null,null,null,"Coincident"]
[null,null,"WEATHER CORRECTED MD 50% POE","MVA","Non-coincident"]
[null,null,null,null,"Coincident"]
[null,"NSP to enter name","CONNECTION POINT RATING","MVA","Non-coincident"]
[null,null,null,null,"Coincident"]
[null,null,"WINTER/SUMMER PEAKING",null,"Non-coincident"]
[null,null,null,null,"Coincident"]
[null,null,"ADJUSTMENTS - EMBEDDED GENERATION","MW","Non-coincident"]
[null,null,null,null,"Coincident"]
[null,null,"WEATHER CORRECTED MD 10% POE","MW","Non-coincident"]
[null,null,null,null,"Coincident"]
[null,null,"WEATHER CORRECTED MD 10% POE","MVA","Non-coincident"]
[null,null,null,null,"Coincident"]
[null,null,"WEATHER CORRECTED MD 50% POE","MW","Non-coincident"]
[null,null,null,null,"Coincident"]
[null,null,"WEATHER CORRECTED MD 50% POE","MVA","Non-coincident"]
[null,null,null,null,"Coincident"]
[null,"NSP to enter name","CONNECTION POINT RATING","MVA","Non-coincident"]
[null,null,null,null,"Coincident"]
[null,null,"WINTER/SUMMER PEAKING",null,"Non-coincident"]
[null,null,null,null,"Coincident"]
[null,null,"ADJUSTMENTS - EMBEDDED GENERATION","MW","Non-coincident"]
[null,null,null,null,"Coincident"]
[null,null,"WEATHER CORRECTED MD 10% POE","MW","Non-coincident"]
[null,null,null,null,"Coincident"]
[null,null,"WEATHER CORRECTED MD 10% POE","MVA","Non-coincident"]
[null,null,null,null,"Coincident"]
[null,null,"WEATHER CORRECTED MD 50% POE","MW","Non-coincident"]
[null,null,null,null,"Coincident"]
[null,null,"WEATHER CORRECTED MD 50% POE","MVA","Non-coincident"]
[null,null,null,null,"Coincident"]
[null,"NSP to enter name","CONNECTION POINT RATING","MVA","Non-coincident"]
[null,null,null,null,"Coincident"]
[null,null,"WINTER/SUMMER PEAKING",null,"Non-coincident"]
[null,null,null,null,"Coincident"]
[null,null,"ADJUSTMENTS - EMBEDDED GENERATION","MW","Non-coincident"]
[null,null,null,null,"Coincident"]
[null,null,"WEATHER CORRECTED MD 10% POE","MW","Non-coincident"]
[null,null,null,null,"Coincident"]
[null,null,"WEATHER CORRECTED MD 10% POE","MVA","Non-coincident"]
[null,null,null,null,"Coincident"]
[null,null,"WEATHER CORRECTED MD 50% POE","MW","Non-coincident"]
[null,null,null,null,"Coincident"]
[null,null,"WEATHER CORRECTED MD 50% POE","MVA","Non-coincident"]
[null,null,null,null,"Coincident"]
[null,"NSP to enter name","CONNECTION POINT RATING","MVA","Non-coincident"]
[null,null,null,null,"Coincident"]
[null,null,"WINTER/SUMMER PEAKING",null,"Non-coincident"]
[null,null,null,null,"Coincident"]
[null,null,"ADJUSTMENTS - EMBEDDED GENERATION","MW","Non-coincident"]
[null,null,null,null,"Coincident"]
[null,null,"WEATHER CORRECTED MD 10% POE","MW","Non-coincident"]
[null,null,null,null,"Coincident"]
[null,null,"WEATHER CORRECTED MD 10% POE","MVA","Non-coincident"]
[null,null,null,null,"Coincident"]
[null,null,"WEATHER CORRECTED MD 50% POE","MW","Non-coincident"]
[null,null,null,null,"Coincident"]
[null,null,"WEATHER CORRECTED MD 50% POE","MVA","Non-coincident"]
[null,null,null,null,"Coincident"]
[null,"NSP to enter name","CONNECTION POINT RATING","MVA","Non-coincident"]
[null,null,null,null,"Coincident"]
[null,null,"WINTER/SUMMER PEAKING",null,"Non-coincident"]
[null,null,null,null,"Coincident"]
[null,null,"ADJUSTMENTS - EMBEDDED GENERATION","MW","Non-coincident"]
[null,null,null,null,"Coincident"]
[null,null,"WEATHER CORRECTED MD 10% POE","MW","Non-coincident"]
[null,null,null,null,"Coincident"]
[null,null,"WEATHER CORRECTED MD 10% POE","MVA","Non-coincident"]
[null,null,null,null,"Coincident"]
[null,null,"WEATHER CORRECTED MD 50% POE","MW","Non-coincident"]
[null,null,null,null,"Coincident"]
[null,null,"WEATHER CORRECTED MD 50% POE","MVA","Non-coincident"]
[null,null,null,null,"Coincident"]
[null,"NSP to enter name","CONNECTION POINT RATING","MVA","Non-coincident"]
[null,null,null,null,"Coincident"]
[null,null,"WINTER/SUMMER PEAKING",null,"Non-coincident"]
[null,null,null,null,"Coincident"]
[null,null,"ADJUSTMENTS - EMBEDDED GENERATION","MW","Non-coincident"]
[null,null,null,null,"Coincident"]
[null,null,"WEATHER CORRECTED MD 10% POE","MW","Non-coincident"]
[null,null,null,null,"Coincident"]
[null,null,"WEATHER CORRECTED MD 10% POE","MVA","Non-coincident"]
[null,null,null,null,"Coincident"]
[null,null,"WEATHER CORRECTED MD 50% POE","MW","Non-coincident"]
[null,null,null,null,"Coincident"]
[null,null,"WEATHER CORRECTED MD 50% POE","MVA","Non-coincident"]
[null,null,null,null,"Coincident"]
[null,"NSP to enter name","CONNECTION POINT RATING","MVA","Non-coincident"]
[null,null,null,null,"Coincident"]
[null,null,"WINTER/SUMMER PEAKING",null,"Non-coincident"]
[null,null,null,null,"Coincident"]
[null,null,"ADJUSTMENTS - EMBEDDED GENERATION","MW","Non-coincident"]
[null,null,null,null,"Coincident"]
[null,null,"WEATHER CORRECTED MD 10% POE","MW","Non-coincident"]
[null,null,null,null,"Coincident"]
[null,null,"WEATHER CORRECTED MD 10% POE","MVA","Non-coincident"]
[null,null,null,null,"Coincident"]
[null,null,"WEATHER CORRECTED MD 50% POE","MW","Non-coincident"]
[null,null,null,null,"Coincident"]
[null,null,"WEATHER CORRECTED MD 50% POE","MVA","Non-coincident"]
[null,null,null,null,"Coincident"]
[null,"NSP to enter name","CONNECTION POINT RATING","MVA","Non-coincident"]
[null,null,null,null,"Coincident"]
[null,null,"WINTER/SUMMER PEAKING",null,"Non-coincident"]
[null,null,null,null,"Coincident"]
[null,null,"ADJUSTMENTS - EMBEDDED GENERATION","MW","Non-coincident"]
[null,null,null,null,"Coincident"]
[null,null,"WEATHER CORRECTED MD 10% POE","MW","Non-coincident"]
[null,null,null,null,"Coincident"]
[null,null,"WEATHER CORRECTED MD 10% POE","MVA","Non-coincident"]
[null,null,null,null,"Coincident"]
[null,null,"WEATHER CORRECTED MD 50% POE","MW","Non-coincident"]
[null,null,null,null,"Coincident"]
[null,null,"WEATHER CORRECTED MD 50% POE","MVA","Non-coincident"]
[null,null,null,null,"Coincident"]
[null,"NSP to enter name","CONNECTION POINT RATING","MVA","Non-coincident"]
[null,null,null,null,"Coincident"]
[null,null,"WINTER/SUMMER PEAKING",null,"Non-coincident"]
[null,null,null,null,"Coincident"]
[null,null,"ADJUSTMENTS - EMBEDDED GENERATION","MW","Non-coincident"]
[null,null,null,null,"Coincident"]
[null,null,"WEATHER CORRECTED MD 10% POE","MW","Non-coincident"]
[null,null,null,null,"Coincident"]
[null,null,"WEATHER CORRECTED MD 10% POE","MVA","Non-coincident"]
[null,null,null,null,"Coincident"]
[null,null,"WEATHER CORRECTED MD 50% POE","MW","Non-coincident"]
[null,null,null,null,"Coincident"]
[null,null,"WEATHER CORRECTED MD 50% POE","MVA","Non-coincident"]
[null,null,null,null,"Coincident"]
[null,"NSP to enter name","CONNECTION POINT RATING","MVA","Non-coincident"]
[null,null,null,null,"Coincident"]
[null,null,"WINTER/SUMMER PEAKING",null,"Non-coincident"]
[null,null,null,null,"Coincident"]
[null,null,"ADJUSTMENTS - EMBEDDED GENERATION","MW","Non-coincident"]
[null,null,null,null,"Coincident"]
[null,null,"WEATHER CORRECTED MD 10% POE","MW","Non-coincident"]
[null,null,null,null,"Coincident"]
[null,null,"WEATHER CORRECTED MD 10% POE","MVA","Non-coincident"]
[null,null,null,null,"Coincident"]
[null,null,"WEATHER CORRECTED MD 50% POE","MW","Non-coincident"]
[null,null,null,null,"Coincident"]
[null,null,"WEATHER CORRECTED MD 50% POE","MVA","Non-coincident"]
[null,null,null,null,"Coincident"]
[null,"NSP to enter name","CONNECTION POINT RATING","MVA","Non-coincident"]
[null,null,null,null,"Coincident"]
[null,null,"WINTER/SUMMER PEAKING",null,"Non-coincident"]
[null,null,null,null,"Coincident"]
[null,null,"ADJUSTMENTS - EMBEDDED GENERATION","MW","Non-coincident"]
[null,null,null,null,"Coincident"]
[null,null,"WEATHER CORRECTED MD 10% POE","MW","Non-coincident"]
[null,null,null,null,"Coincident"]
[null,null,"WEATHER CORRECTED MD 10% POE","MVA","Non-coincident"]
[null,null,null,null,"Coincident"]
[null,null,"WEATHER CORRECTED MD 50% POE","MW","Non-coincident"]
[null,null,null,null,"Coincident"]
[null,null,"WEATHER CORRECTED MD 50% POE","MVA","Non-coincident"]
[null,null,null,null,"Coincident"]
[null,"NSP to enter name","CONNECTION POINT RATING","MVA","Non-coincident"]
[null,null,null,null,"Coincident"]
[null,null,"WINTER/SUMMER PEAKING",null,"Non-coincident"]
[null,null,null,null,"Coincident"]
[null,null,"ADJUSTMENTS - EMBEDDED GENERATION","MW","Non-coincident"]
[null,null,null,null,"Coincident"]
[null,null,"WEATHER CORRECTED MD 10% POE","MW","Non-coincident"]
[null,null,null,null,"Coincident"]
[null,null,"WEATHER CORRECTED MD 10% POE","MVA","Non-coincident"]
[null,null,null,null,"Coincident"]
[null,null,"WEATHER CORRECTED MD 50% POE","MW","Non-coincident"]
[null,null,null,null,"Coincident"]
[null,null,"WEATHER CORRECTED MD 50% POE","MVA","Non-coincident"]
[null,null,null,null,"Coincident"]
[null,"NSP to enter name","CONNECTION POINT RATING","MVA","Non-coincident"]
[null,null,null,null,"Coincident"]
[null,null,"WINTER/SUMMER PEAKING",null,"Non-coincident"]
[null,null,null,null,"Coincident"]
[null,null,"ADJUSTMENTS - EMBEDDED GENERATION","MW","Non-coincident"]
[null,null,null,null,"Coincident"]
[null,null,"WEATHER CORRECTED MD 10% POE","MW","Non-coincident"]
[null,null,null,null,"Coincident"]
[null,null,"WEATHER CORRECTED MD 10% POE","MVA","Non-coincident"]
[null,null,null,null,"Coincident"]
[null,null,"WEATHER CORRECTED MD 50% POE","MW","Non-coincident"]
[null,null,null,null,"Coincident"]
[null,null,"WEATHER CORRECTED MD 50% POE","MVA","Non-coincident"]
[null,null,null,null,"Coincident"]
[null,"NSP to enter name","CONNECTION POINT RATING","MVA","Non-coincident"]
[null,null,null,null,"Coincident"]
[null,null,"WINTER/SUMMER PEAKING",null,"Non-coincident"]
[null,null,null,null,"Coincident"]
[null,null,"ADJUSTMENTS - EMBEDDED GENERATION","MW","Non-coincident"]
[null,null,null,null,"Coincident"]
[null,null,"WEATHER CORRECTED MD 10% POE","MW","Non-coincident"]
[null,null,null,null,"Coincident"]
[null,null,"WEATHER CORRECTED MD 10% POE","MVA","Non-coincident"]
[null,null,null,null,"Coincident"]
[null,null,"WEATHER CORRECTED MD 50% POE","MW","Non-coincident"]
[null,null,null,null,"Coincident"]
[null,null,"WEATHER CORRECTED MD 50% POE","MVA","Non-coincident"]
[null,null,null,null,"Coincident"]
[null,"NSP to enter name","CONNECTION POINT RATING","MVA","Non-coincident"]
[null,null,null,null,"Coincident"]
[null,null,"WINTER/SUMMER PEAKING",null,"Non-coincident"]
[null,null,null,null,"Coincident"]
[null,null,"ADJUSTMENTS - EMBEDDED GENERATION","MW","Non-coincident"]
[null,null,null,null,"Coincident"]
[null,null,"WEATHER CORRECTED MD 10% POE","MW","Non-coincident"]
[null,null,null,null,"Coincident"]
[null,null,"WEATHER CORRECTED MD 10% POE","MVA","Non-coincident"]
[null,null,null,null,"Coincident"]
[null,null,"WEATHER CORRECTED MD 50% POE","MW","Non-coincident"]
[null,null,null,null,"Coincident"]
[null,null,"WEATHER CORRECTED MD 50% POE","MVA","Non-coincident"]
[null,null,null,null,"Coincident"]
[null,"NSP to enter name","CONNECTION POINT RATING","MVA","Non-coincident"]
[null,null,null,null,"Coincident"]
[null,null,"WINTER/SUMMER PEAKING",null,"Non-coincident"]
[null,null,null,null,"Coincident"]
[null,null,"ADJUSTMENTS - EMBEDDED GENERATION","MW","Non-coincident"]
[null,null,null,null,"Coincident"]
[null,null,"WEATHER CORRECTED MD 10% POE","MW","Non-coincident"]
[null,null,null,null,"Coincident"]
[null,null,"WEATHER CORRECTED MD 10% POE","MVA","Non-coincident"]
[null,null,null,null,"Coincident"]
[null,null,"WEATHER CORRECTED MD 50% POE","MW","Non-coincident"]
[null,null,null,null,"Coincident"]
[null,null,"WEATHER CORRECTED MD 50% POE","MVA","Non-coincident"]
[null,null,null,null,"Coincident"]
[null,"NSP to enter name","CONNECTION POINT RATING","MVA","Non-coincident"]
[null,null,null,null,"Coincident"]
[null,null,"WINTER/SUMMER PEAKING",null,"Non-coincident"]
[null,null,null,null,"Coincident"]
[null,null,"ADJUSTMENTS - EMBEDDED GENERATION","MW","Non-coincident"]
[null,null,null,null,"Coincident"]
[null,null,"WEATHER CORRECTED MD 10% POE","MW","Non-coincident"]
[null,null,null,null,"Coincident"]
[null,null,"WEATHER CORRECTED MD 10% POE","MVA","Non-coincident"]
[null,null,null,null,"Coincident"]
[null,null,"WEATHER CORRECTED MD 50% POE","MW","Non-coincident"]
[null,null,null,null,"Coincident"]
[null,null,"WEATHER CORRECTED MD 50% POE","MVA","Non-coincident"]
[null,null,null,null,"Coincident"]
[null,"NSP to enter name","CONNECTION POINT RATING","MVA","Non-coincident"]
[null,null,null,null,"Coincident"]
[null,null,"WINTER/SUMMER PEAKING",null,"Non-coincident"]
[null,null,null,null,"Coincident"]
[null,null,"ADJUSTMENTS - EMBEDDED GENERATION","MW","Non-coincident"]
[null,null,null,null,"Coincident"]
[null,null,"WEATHER CORRECTED MD 10% POE","MW","Non-coincident"]
[null,null,null,null,"Coincident"]
[null,null,"WEATHER CORRECTED MD 10% POE","MVA","Non-coincident"]
[null,null,null,null,"Coincident"]
[null,null,"WEATHER CORRECTED MD 50% POE","MW","Non-coincident"]
[null,null,null,null,"Coincident"]
[null,null,"WEATHER CORRECTED MD 50% POE","MVA","Non-coincident"]
[null,null,null,null,"Coincident"]
[null,"NSP to enter name","CONNECTION POINT RATING","MVA","Non-coincident"]
[null,null,null,null,"Coincident"]
[null,null,"WINTER/SUMMER PEAKING",null,"Non-coincident"]
[null,null,null,null,"Coincident"]
[null,null,"ADJUSTMENTS - EMBEDDED GENERATION","MW","Non-coincident"]
[null,null,null,null,"Coincident"]
[null,null,"WEATHER CORRECTED MD 10% POE","MW","Non-coincident"]
[null,null,null,null,"Coincident"]
[null,null,"WEATHER CORRECTED MD 10% POE","MVA","Non-coincident"]
[null,null,null,null,"Coincident"]
[null,null,"WEATHER CORRECTED MD 50% POE","MW","Non-coincident"]
[null,null,null,null,"Coincident"]
[null,null,"WEATHER CORRECTED MD 50% POE","MVA","Non-coincident"]
[null,null,null,null,"Coincident"]
[null,"NSP to enter name","CONNECTION POINT RATING","MVA","Non-coincident"]
[null,null,null,null,"Coincident"]
[null,null,"WINTER/SUMMER PEAKING",null,"Non-coincident"]
[null,null,null,null,"Coincident"]
[null,null,"ADJUSTMENTS - EMBEDDED GENERATION","MW","Non-coincident"]
[null,null,null,null,"Coincident"]
[null,null,"WEATHER CORRECTED MD 10% POE","MW","Non-coincident"]
[null,null,null,null,"Coincident"]
[null,null,"WEATHER CORRECTED MD 10% POE","MVA","Non-coincident"]
[null,null,null,null,"Coincident"]
[null,null,"WEATHER CORRECTED MD 50% POE","MW","Non-coincident"]
[null,null,null,null,"Coincident"]
[null,null,"WEATHER CORRECTED MD 50% POE","MVA","Non-coincident"]
[null,null,null,null,"Coincident"]
[null,"NSP to enter name","CONNECTION POINT RATING","MVA","Non-coincident"]
[null,null,null,null,"Coincident"]
[null,null,"WINTER/SUMMER PEAKING",null,"Non-coincident"]
[null,null,null,null,"Coincident"]
[null,null,"ADJUSTMENTS - EMBEDDED GENERATION","MW","Non-coincident"]
[null,null,null,null,"Coincident"]
[null,null,"WEATHER CORRECTED MD 10% POE","MW","Non-coincident"]
[null,null,null,null,"Coincident"]
[null,null,"WEATHER CORRECTED MD 10% POE","MVA","Non-coincident"]
[null,null,null,null,"Coincident"]
[null,null,"WEATHER CORRECTED MD 50% POE","MW","Non-coincident"]
[null,null,null,null,"Coincident"]
[null,null,"WEATHER CORRECTED MD 50% POE","MVA","Non-coincident"]
[null,null,null,null,"Coincident"]
[null,"NSP to enter name","CONNECTION POINT RATING","MVA","Non-coincident"]
[null,null,null,null,"Coincident"]
[null,null,"WINTER/SUMMER PEAKING",null,"Non-coincident"]
[null,null,null,null,"Coincident"]
[null,null,"ADJUSTMENTS - EMBEDDED GENERATION","MW","Non-coincident"]
[null,null,null,null,"Coincident"]
[null,null,"WEATHER CORRECTED MD 10% POE","MW","Non-coincident"]
[null,null,null,null,"Coincident"]
[null,null,"WEATHER CORRECTED MD 10% POE","MVA","Non-coincident"]
[null,null,null,null,"Coincident"]
[null,null,"WEATHER CORRECTED MD 50% POE","MW","Non-coincident"]
[null,null,null,null,"Coincident"]
[null,null,"WEATHER CORRECTED MD 50% POE","MVA","Non-coincident"]
[null,null,null,null,"Coincident"]
[null,"NSP to enter name","CONNECTION POINT RATING","MVA","Non-coincident"]
[null,null,null,null,"Coincident"]
[null,null,"WINTER/SUMMER PEAKING",null,"Non-coincident"]
[null,null,null,null,"Coincident"]
[null,null,"ADJUSTMENTS - EMBEDDED GENERATION","MW","Non-coincident"]
[null,null,null,null,"Coincident"]
[null,null,"WEATHER CORRECTED MD 10% POE","MW","Non-coincident"]
[null,null,null,null,"Coincident"]
[null,null,"WEATHER CORRECTED MD 10% POE","MVA","Non-coincident"]
[null,null,null,null,"Coincident"]
[null,null,"WEATHER CORRECTED MD 50% POE","MW","Non-coincident"]
[null,null,null,null,"Coincident"]
[null,null,"WEATHER CORRECTED MD 50% POE","MVA","Non-coincident"]
[null,null,null,null,"Coincident"]
[null,"NSP to enter name","CONNECTION POINT RATING","MVA","Non-coincident"]
[null,null,null,null,"Coincident"]
[null,null,"WINTER/SUMMER PEAKING",null,"Non-coincident"]
[null,null,null,null,"Coincident"]
[null,null,"ADJUSTMENTS - EMBEDDED GENERATION","MW","Non-coincident"]
[null,null,null,null,"Coincident"]
[null,null,"WEATHER CORRECTED MD 10% POE","MW","Non-coincident"]
[null,null,null,null,"Coincident"]
[null,null,"WEATHER CORRECTED MD 10% POE","MVA","Non-coincident"]
[null,null,null,null,"Coincident"]
[null,null,"WEATHER CORRECTED MD 50% POE","MW","Non-coincident"]
[null,null,null,null,"Coincident"]
[null,null,"WEATHER CORRECTED MD 50% POE","MVA","Non-coincident"]
[null,null,null,null,"Coincident"]
[null,"NSP to enter name","CONNECTION POINT RATING","MVA","Non-coincident"]
[null,null,null,null,"Coincident"]
[null,null,"WINTER/SUMMER PEAKING",null,"Non-coincident"]
[null,null,null,null,"Coincident"]
[null,null,"ADJUSTMENTS - EMBEDDED GENERATION","MW","Non-coincident"]
[null,null,null,null,"Coincident"]
[null,null,"WEATHER CORRECTED MD 10% POE","MW","Non-coincident"]
[null,null,null,null,"Coincident"]
[null,null,"WEATHER CORRECTED MD 10% POE","MVA","Non-coincident"]
[null,null,null,null,"Coincident"]
[null,null,"WEATHER CORRECTED MD 50% POE","MW","Non-coincident"]
[null,null,null,null,"Coincident"]
[null,null,"WEATHER CORRECTED MD 50% POE","MVA","Non-coincident"]
[null,null,null,null,"Coincident"]
[null,"NSP to enter name","CONNECTION POINT RATING","MVA","Non-coincident"]
[null,null,null,null,"Coincident"]
[null,null,"WINTER/SUMMER PEAKING",null,"Non-coincident"]
[null,null,null,null,"Coincident"]
[null,null,"ADJUSTMENTS - EMBEDDED GENERATION","MW","Non-coincident"]
[null,null,null,null,"Coincident"]
[null,null,"WEATHER CORRECTED MD 10% POE","MW","Non-coincident"]
[null,null,null,null,"Coincident"]
[null,null,"WEATHER CORRECTED MD 10% POE","MVA","Non-coincident"]
[null,null,null,null,"Coincident"]
[null,null,"WEATHER CORRECTED MD 50% POE","MW","Non-coincident"]
[null,null,null,null,"Coincident"]
[null,null,"WEATHER CORRECTED MD 50% POE","MVA","Non-coincident"]
[null,null,null,null,"Coincident"]
[null,"NSP to enter name","CONNECTION POINT RATING","MVA","Non-coincident"]
[null,null,null,null,"Coincident"]
[null,null,"WINTER/SUMMER PEAKING",null,"Non-coincident"]
[null,null,null,null,"Coincident"]
[null,null,"ADJUSTMENTS - EMBEDDED GENERATION","MW","Non-coincident"]
[null,null,null,null,"Coincident"]
[null,null,"WEATHER CORRECTED MD 10% POE","MW","Non-coincident"]
[null,null,null,null,"Coincident"]
[null,null,"WEATHER CORRECTED MD 10% POE","MVA","Non-coincident"]
[null,null,null,null,"Coincident"]
[null,null,"WEATHER CORRECTED MD 50% POE","MW","Non-coincident"]
[null,null,null,null,"Coincident"]
[null,null,"WEATHER CORRECTED MD 50% POE","MVA","Non-coincident"]
[null,null,null,null,"Coincident"]
[null,"NSP to enter name","CONNECTION POINT RATING","MVA","Non-coincident"]
[null,null,null,null,"Coincident"]
[null,null,"WINTER/SUMMER PEAKING",null,"Non-coincident"]
[null,null,null,null,"Coincident"]
[null,null,"ADJUSTMENTS - EMBEDDED GENERATION","MW","Non-coincident"]
[null,null,null,null,"Coincident"]
[null,null,"WEATHER CORRECTED MD 10% POE","MW","Non-coincident"]
[null,null,null,null,"Coincident"]
[null,null,"WEATHER CORRECTED MD 10% POE","MVA","Non-coincident"]
[null,null,null,null,"Coincident"]
[null,null,"WEATHER CORRECTED MD 50% POE","MW","Non-coincident"]
[null,null,null,null,"Coincident"]
[null,null,"WEATHER CORRECTED MD 50% POE","MVA","Non-coincident"]
[null,null,null,null,"Coincident"]
[null,"NSP to enter name","CONNECTION POINT RATING","MVA","Non-coincident"]
[null,null,null,null,"Coincident"]
[null,null,"WINTER/SUMMER PEAKING",null,"Non-coincident"]
[null,null,null,null,"Coincident"]
[null,null,"ADJUSTMENTS - EMBEDDED GENERATION","MW","Non-coincident"]
[null,null,null,null,"Coincident"]
[null,null,"WEATHER CORRECTED MD 10% POE","MW","Non-coincident"]
[null,null,null,null,"Coincident"]
[null,null,"WEATHER CORRECTED MD 10% POE","MVA","Non-coincident"]
[null,null,null,null,"Coincident"]
[null,null,"WEATHER CORRECTED MD 50% POE","MW","Non-coincident"]
[null,null,null,null,"Coincident"]
[null,null,"WEATHER CORRECTED MD 50% POE","MVA","Non-coincident"]
[null,null,null,null,"Coincident"]
[null,"NSP to enter name","CONNECTION POINT RATING","MVA","Non-coincident"]
[null,null,null,null,"Coincident"]
[null,null,"WINTER/SUMMER PEAKING",null,"Non-coincident"]
[null,null,null,null,"Coincident"]
[null,null,"ADJUSTMENTS - EMBEDDED GENERATION","MW","Non-coincident"]
[null,null,null,null,"Coincident"]
[null,null,"WEATHER CORRECTED MD 10% POE","MW","Non-coincident"]
[null,null,null,null,"Coincident"]
[null,null,"WEATHER CORRECTED MD 10% POE","MVA","Non-coincident"]
[null,null,null,null,"Coincident"]
[null,null,"WEATHER CORRECTED MD 50% POE","MW","Non-coincident"]
[null,null,null,null,"Coincident"]
[null,null,"WEATHER CORRECTED MD 50% POE","MVA","Non-coincident"]
[null,null,null,null,"Coincident"]
[null,"NSP to enter name","CONNECTION POINT RATING","MVA","Non-coincident"]
[null,null,null,null,"Coincident"]
[null,null,"WINTER/SUMMER PEAKING",null,"Non-coincident"]
[null,null,null,null,"Coincident"]
[null,null,"ADJUSTMENTS - EMBEDDED GENERATION","MW","Non-coincident"]
[null,null,null,null,"Coincident"]
[null,null,"WEATHER CORRECTED MD 10% POE","MW","Non-coincident"]
[null,null,null,null,"Coincident"]
[null,null,"WEATHER CORRECTED MD 10% POE","MVA","Non-coincident"]
[null,null,null,null,"Coincident"]
[null,null,"WEATHER CORRECTED MD 50% POE","MW","Non-coincident"]
[null,null,null,null,"Coincident"]
[null,null,"WEATHER CORRECTED MD 50% POE","MVA","Non-coincident"]
[null,null,null,null,"Coincident"]
[null,"NSP to enter name","CONNECTION POINT RATING","MVA","Non-coincident"]
[null,null,null,null,"Coincident"]
[null,null,"WINTER/SUMMER PEAKING",null,"Non-coincident"]
[null,null,null,null,"Coincident"]
[null,null,"ADJUSTMENTS - EMBEDDED GENERATION","MW","Non-coincident"]
[null,null,null,null,"Coincident"]
[null,null,"WEATHER CORRECTED MD 10% POE","MW","Non-coincident"]
[null,null,null,null,"Coincident"]
[null,null,"WEATHER CORRECTED MD 10% POE","MVA","Non-coincident"]
[null,null,null,null,"Coincident"]
[null,null,"WEATHER CORRECTED MD 50% POE","MW","Non-coincident"]
[null,null,null,null,"Coincident"]
[null,null,"WEATHER CORRECTED MD 50% POE","MVA","Non-coincident"]
[null,null,null,null,"Coincident"]
[null,"NSP to enter name","CONNECTION POINT RATING","MVA","Non-coincident"]
[null,null,null,null,"Coincident"]
[null,null,"WINTER/SUMMER PEAKING",null,"Non-coincident"]
[null,null,null,null,"Coincident"]
[null,null,"ADJUSTMENTS - EMBEDDED GENERATION","MW","Non-coincident"]
[null,null,null,null,"Coincident"]
[null,null,"WEATHER CORRECTED MD 10% POE","MW","Non-coincident"]
[null,null,null,null,"Coincident"]
[null,null,"WEATHER CORRECTED MD 10% POE","MVA","Non-coincident"]
[null,null,null,null,"Coincident"]
[null,null,"WEATHER CORRECTED MD 50% POE","MW","Non-coincident"]
[null,null,null,null,"Coincident"]
[null,null,"WEATHER CORRECTED MD 50% POE","MVA","Non-coincident"]
[null,null,null,null,"Coincident"]
[null,"NSP to enter name","CONNECTION POINT RATING","MVA","Non-coincident"]
[null,null,null,null,"Coincident"]
[null,null,"WINTER/SUMMER PEAKING",null,"Non-coincident"]
[null,null,null,null,"Coincident"]
[null,null,"ADJUSTMENTS - EMBEDDED GENERATION","MW","Non-coincident"]
[null,null,null,null,"Coincident"]
[null,null,"WEATHER CORRECTED MD 10% POE","MW","Non-coincident"]
[null,null,null,null,"Coincident"]
[null,null,"WEATHER CORRECTED MD 10% POE","MVA","Non-coincident"]
[null,null,null,null,"Coincident"]
[null,null,"WEATHER CORRECTED MD 50% POE","MW","Non-coincident"]
[null,null,null,null,"Coincident"]
[null,null,"WEATHER CORRECTED MD 50% POE","MVA","Non-coincident"]
[null,null,null,null,"Coincident"]
[null,"NSP to enter name","CONNECTION POINT RATING","MVA","Non-coincident"]
[null,null,null,null,"Coincident"]
[null,null,"WINTER/SUMMER PEAKING",null,"Non-coincident"]
[null,null,null,null,"Coincident"]
[null,null,"ADJUSTMENTS - EMBEDDED GENERATION","MW","Non-coincident"]
[null,null,null,null,"Coincident"]
[null,null,"WEATHER CORRECTED MD 10% POE","MW","Non-coincident"]
[null,null,null,null,"Coincident"]
[null,null,"WEATHER CORRECTED MD 10% POE","MVA","Non-coincident"]
[null,null,null,null,"Coincident"]
[null,null,"WEATHER CORRECTED MD 50% POE","MW","Non-coincident"]
[null,null,null,null,"Coincident"]
[null,null,"WEATHER CORRECTED MD 50% POE","MVA","Non-coincident"]
[null,null,null,null,"Coincident"]
[null,"NSP to enter name","CONNECTION POINT RATING","MVA","Non-coincident"]
[null,null,null,null,"Coincident"]
[null,null,"WINTER/SUMMER PEAKING",null,"Non-coincident"]
[null,null,null,null,"Coincident"]
[null,null,"ADJUSTMENTS - EMBEDDED GENERATION","MW","Non-coincident"]
[null,null,null,null,"Coincident"]
[null,null,"WEATHER CORRECTED MD 10% POE","MW","Non-coincident"]
[null,null,null,null,"Coincident"]
[null,null,"WEATHER CORRECTED MD 10% POE","MVA","Non-coincident"]
[null,null,null,null,"Coincident"]
[null,null,"WEATHER CORRECTED MD 50% POE","MW","Non-coincident"]
[null,null,null,null,"Coincident"]
[null,null,"WEATHER CORRECTED MD 50% POE","MVA","Non-coincident"]
[null,null,null,null,"Coincident"]
[null,"NSP to enter name","CONNECTION POINT RATING","MVA","Non-coincident"]
[null,null,null,null,"Coincident"]
[null,null,"WINTER/SUMMER PEAKING",null,"Non-coincident"]
[null,null,null,null,"Coincident"]
[null,null,"ADJUSTMENTS - EMBEDDED GENERATION","MW","Non-coincident"]
[null,null,null,null,"Coincident"]
[null,null,"WEATHER CORRECTED MD 10% POE","MW","Non-coincident"]
[null,null,null,null,"Coincident"]
[null,null,"WEATHER CORRECTED MD 10% POE","MVA","Non-coincident"]
[null,null,null,null,"Coincident"]
[null,null,"WEATHER CORRECTED MD 50% POE","MW","Non-coincident"]
[null,null,null,null,"Coincident"]
[null,null,"WEATHER CORRECTED MD 50% POE","MVA","Non-coincident"]
[null,null,null,null,"Coincident"]
[null,"NSP to enter name","CONNECTION POINT RATING","MVA","Non-coincident"]
[null,null,null,null,"Coincident"]
[null,null,"WINTER/SUMMER PEAKING",null,"Non-coincident"]
[null,null,null,null,"Coincident"]
[null,null,"ADJUSTMENTS - EMBEDDED GENERATION","MW","Non-coincident"]
[null,null,null,null,"Coincident"]
[null,null,"WEATHER CORRECTED MD 10% POE","MW","Non-coincident"]
[null,null,null,null,"Coincident"]
[null,null,"WEATHER CORRECTED MD 10% POE","MVA","Non-coincident"]
[null,null,null,null,"Coincident"]
[null,null,"WEATHER CORRECTED MD 50% POE","MW","Non-coincident"]
[null,null,null,null,"Coincident"]
[null,null,"WEATHER CORRECTED MD 50% POE","MVA","Non-coincident"]
[null,null,null,null,"Coincident"]
[null,"NSP to enter name","CONNECTION POINT RATING","MVA","Non-coincident"]
[null,null,null,null,"Coincident"]
[null,null,"WINTER/SUMMER PEAKING",null,"Non-coincident"]
[null,null,null,null,"Coincident"]
[null,null,"ADJUSTMENTS - EMBEDDED GENERATION","MW","Non-coincident"]
[null,null,null,null,"Coincident"]
[null,null,"WEATHER CORRECTED MD 10% POE","MW","Non-coincident"]
[null,null,null,null,"Coincident"]
[null,null,"WEATHER CORRECTED MD 10% POE","MVA","Non-coincident"]
[null,null,null,null,"Coincident"]
[null,null,"WEATHER CORRECTED MD 50% POE","MW","Non-coincident"]
[null,null,null,null,"Coincident"]
[null,null,"WEATHER CORRECTED MD 50% POE","MVA","Non-coincident"]
[null,null,null,null,"Coincident"]
[null,"NSP to enter name","CONNECTION POINT RATING","MVA","Non-coincident"]
[null,null,null,null,"Coincident"]
[null,null,"WINTER/SUMMER PEAKING",null,"Non-coincident"]
[null,null,null,null,"Coincident"]
[null,null,"ADJUSTMENTS - EMBEDDED GENERATION","MW","Non-coincident"]
[null,null,null,null,"Coincident"]
[null,null,"WEATHER CORRECTED MD 10% POE","MW","Non-coincident"]
[null,null,null,null,"Coincident"]
[null,null,"WEATHER CORRECTED MD 10% POE","MVA","Non-coincident"]
[null,null,null,null,"Coincident"]
[null,null,"WEATHER CORRECTED MD 50% POE","MW","Non-coincident"]
[null,null,null,null,"Coincident"]
[null,null,"WEATHER CORRECTED MD 50% POE","MVA","Non-coincident"]
[null,null,null,null,"Coincident"]
[null,"NSP to enter name","CONNECTION POINT RATING","MVA","Non-coincident"]
[null,null,null,null,"Coincident"]
[null,null,"WINTER/SUMMER PEAKING",null,"Non-coincident"]
[null,null,null,null,"Coincident"]
[null,null,"ADJUSTMENTS - EMBEDDED GENERATION","MW","Non-coincident"]
[null,null,null,null,"Coincident"]
[null,null,"WEATHER CORRECTED MD 10% POE","MW","Non-coincident"]
[null,null,null,null,"Coincident"]
[null,null,"WEATHER CORRECTED MD 10% POE","MVA","Non-coincident"]
[null,null,null,null,"Coincident"]
[null,null,"WEATHER CORRECTED MD 50% POE","MW","Non-coincident"]
[null,null,null,null,"Coincident"]
[null,null,"WEATHER CORRECTED MD 50% POE","MVA","Non-coincident"]
[null,null,null,null,"Coincident"]
[null,"NSP to enter name","CONNECTION POINT RATING","MVA","Non-coincident"]
[null,null,null,null,"Coincident"]
[null,null,"WINTER/SUMMER PEAKING",null,"Non-coincident"]
[null,null,null,null,"Coincident"]
[null,null,"ADJUSTMENTS - EMBEDDED GENERATION","MW","Non-coincident"]
[null,null,null,null,"Coincident"]
[null,null,"WEATHER CORRECTED MD 10% POE","MW","Non-coincident"]
[null,null,null,null,"Coincident"]
[null,null,"WEATHER CORRECTED MD 10% POE","MVA","Non-coincident"]
[null,null,null,null,"Coincident"]
[null,null,"WEATHER CORRECTED MD 50% POE","MW","Non-coincident"]
[null,null,null,null,"Coincident"]
[null,null,"WEATHER CORRECTED MD 50% POE","MVA","Non-coincident"]
[null,null,null,null,"Coincident"]
[null,"NSP to enter name","CONNECTION POINT RATING","MVA","Non-coincident"]
[null,null,null,null,"Coincident"]
[null,null,"WINTER/SUMMER PEAKING",null,"Non-coincident"]
[null,null,null,null,"Coincident"]
[null,null,"ADJUSTMENTS - EMBEDDED GENERATION","MW","Non-coincident"]
[null,null,null,null,"Coincident"]
[null,null,"WEATHER CORRECTED MD 10% POE","MW","Non-coincident"]
[null,null,null,null,"Coincident"]
[null,null,"WEATHER CORRECTED MD 10% POE","MVA","Non-coincident"]
[null,null,null,null,"Coincident"]
[null,null,"WEATHER CORRECTED MD 50% POE","MW","Non-coincident"]
[null,null,null,null,"Coincident"]
[null,null,"WEATHER CORRECTED MD 50% POE","MVA","Non-coincident"]
[null,null,null,null,"Coincident"]
[null,"NSP to enter name","CONNECTION POINT RATING","MVA","Non-coincident"]
[null,null,null,null,"Coincident"]
[null,null,"WINTER/SUMMER PEAKING",null,"Non-coincident"]
[null,null,null,null,"Coincident"]
[null,null,"ADJUSTMENTS - EMBEDDED GENERATION","MW","Non-coincident"]
[null,null,null,null,"Coincident"]
[null,null,"WEATHER CORRECTED MD 10% POE","MW","Non-coincident"]
[null,null,null,null,"Coincident"]
[null,null,"WEATHER CORRECTED MD 10% POE","MVA","Non-coincident"]
[null,null,null,null,"Coincident"]
[null,null,"WEATHER CORRECTED MD 50% POE","MW","Non-coincident"]
[null,null,null,null,"Coincident"]
[null,null,"WEATHER CORRECTED MD 50% POE","MVA","Non-coincident"]
[null,null,null,null,"Coincident"]
[null,"NSP to enter name","CONNECTION POINT RATING","MVA","Non-coincident"]
[null,null,null,null,"Coincident"]
[null,null,"WINTER/SUMMER PEAKING",null,"Non-coincident"]
[null,null,null,null,"Coincident"]
[null,null,"ADJUSTMENTS - EMBEDDED GENERATION","MW","Non-coincident"]
[null,null,null,null,"Coincident"]
[null,null,"WEATHER CORRECTED MD 10% POE","MW","Non-coincident"]
[null,null,null,null,"Coincident"]
[null,null,"WEATHER CORRECTED MD 10% POE","MVA","Non-coincident"]
[null,null,null,null,"Coincident"]
[null,null,"WEATHER CORRECTED MD 50% POE","MW","Non-coincident"]
[null,null,null,null,"Coincident"]
[null,null,"WEATHER CORRECTED MD 50% POE","MVA","Non-coincident"]
[null,null,null,null,"Coincident"]
[null,"NSP to enter name","CONNECTION POINT RATING","MVA","Non-coincident"]
[null,null,null,null,"Coincident"]
[null,null,"WINTER/SUMMER PEAKING",null,"Non-coincident"]
[null,null,null,null,"Coincident"]
[null,null,"ADJUSTMENTS - EMBEDDED GENERATION","MW","Non-coincident"]
[null,null,null,null,"Coincident"]
[null,null,"WEATHER CORRECTED MD 10% POE","MW","Non-coincident"]
[null,null,null,null,"Coincident"]
[null,null,"WEATHER CORRECTED MD 10% POE","MVA","Non-coincident"]
[null,null,null,null,"Coincident"]
[null,null,"WEATHER CORRECTED MD 50% POE","MW","Non-coincident"]
[null,null,null,null,"Coincident"]
[null,null,"WEATHER CORRECTED MD 50% POE","MVA","Non-coincident"]
[null,null,null,null,"Coincident"]
[null,"NSP to enter name","CONNECTION POINT RATING","MVA","Non-coincident"]
[null,null,null,null,"Coincident"]
[null,null,"WINTER/SUMMER PEAKING",null,"Non-coincident"]
[null,null,null,null,"Coincident"]
[null,null,"ADJUSTMENTS - EMBEDDED GENERATION","MW","Non-coincident"]
[null,null,null,null,"Coincident"]
[null,null,"WEATHER CORRECTED MD 10% POE","MW","Non-coincident"]
[null,null,null,null,"Coincident"]
[null,null,"WEATHER CORRECTED MD 10% POE","MVA","Non-coincident"]
[null,null,null,null,"Coincident"]
[null,null,"WEATHER CORRECTED MD 50% POE","MW","Non-coincident"]
[null,null,null,null,"Coincident"]
[null,null,"WEATHER CORRECTED MD 50% POE","MVA","Non-coincident"]
[null,null,null,null,"Coincident"]
[null,"NSP to enter name","CONNECTION POINT RATING","MVA","Non-coincident"]
[null,null,null,null,"Coincident"]
[null,null,"WINTER/SUMMER PEAKING",null,"Non-coincident"]
[null,null,null,null,"Coincident"]
[null,null,"ADJUSTMENTS - EMBEDDED GENERATION","MW","Non-coincident"]
[null,null,null,null,"Coincident"]
[null,null,"WEATHER CORRECTED MD 10% POE","MW","Non-coincident"]
[null,null,null,null,"Coincident"]
[null,null,"WEATHER CORRECTED MD 10% POE","MVA","Non-coincident"]
[null,null,null,null,"Coincident"]
[null,null,"WEATHER CORRECTED MD 50% POE","MW","Non-coincident"]
[null,null,null,null,"Coincident"]
[null,null,"WEATHER CORRECTED MD 50% POE","MVA","Non-coincident"]
[null,null,null,null,"Coincident"]
[null,"NSP to enter name","CONNECTION POINT RATING","MVA","Non-coincident"]
[null,null,null,null,"Coincident"]
[null,null,"WINTER/SUMMER PEAKING",null,"Non-coincident"]
[null,null,null,null,"Coincident"]
[null,null,"ADJUSTMENTS - EMBEDDED GENERATION","MW","Non-coincident"]
[null,null,null,null,"Coincident"]
[null,null,"WEATHER CORRECTED MD 10% POE","MW","Non-coincident"]
[null,null,null,null,"Coincident"]
[null,null,"WEATHER CORRECTED MD 10% POE","MVA","Non-coincident"]
[null,null,null,null,"Coincident"]
[null,null,"WEATHER CORRECTED MD 50% POE","MW","Non-coincident"]
[null,null,null,null,"Coincident"]
[null,null,"WEATHER CORRECTED MD 50% POE","MVA","Non-coincident"]
[null,null,null,null,"Coincident"]
[null,"NSP to enter name","CONNECTION POINT RATING","MVA","Non-coincident"]
[null,null,null,null,"Coincident"]
[null,null,"WINTER/SUMMER PEAKING",null,"Non-coincident"]
[null,null,null,null,"Coincident"]
[null,null,"ADJUSTMENTS - EMBEDDED GENERATION","MW","Non-coincident"]
[null,null,null,null,"Coincident"]
[null,null,"WEATHER CORRECTED MD 10% POE","MW","Non-coincident"]
[null,null,null,null,"Coincident"]
[null,null,"WEATHER CORRECTED MD 10% POE","MVA","Non-coincident"]
[null,null,null,null,"Coincident"]
[null,null,"WEATHER CORRECTED MD 50% POE","MW","Non-coincident"]
[null,null,null,null,"Coincident"]
[null,null,"WEATHER CORRECTED MD 50% POE","MVA","Non-coincident"]
[null,null,null,null,"Coincident"]
[null,"NSP to enter name","CONNECTION POINT RATING","MVA","Non-coincident"]
[null,null,null,null,"Coincident"]
[null,null,"WINTER/SUMMER PEAKING",null,"Non-coincident"]
[null,null,null,null,"Coincident"]
[null,null,"ADJUSTMENTS - EMBEDDED GENERATION","MW","Non-coincident"]
[null,null,null,null,"Coincident"]
[null,null,"WEATHER CORRECTED MD 10% POE","MW","Non-coincident"]
[null,null,null,null,"Coincident"]
[null,null,"WEATHER CORRECTED MD 10% POE","MVA","Non-coincident"]
[null,null,null,null,"Coincident"]
[null,null,"WEATHER CORRECTED MD 50% POE","MW","Non-coincident"]
[null,null,null,null,"Coincident"]
[null,null,"WEATHER CORRECTED MD 50% POE","MVA","Non-coincident"]
[null,null,null,null,"Coincident"]
[null,"NSP to enter name","CONNECTION POINT RATING","MVA","Non-coincident"]
[null,null,null,null,"Coincident"]
[null,null,"WINTER/SUMMER PEAKING",null,"Non-coincident"]
[null,null,null,null,"Coincident"]
[null,null,"ADJUSTMENTS - EMBEDDED GENERATION","MW","Non-coincident"]
[null,null,null,null,"Coincident"]
[null,null,"WEATHER CORRECTED MD 10% POE","MW","Non-coincident"]
[null,null,null,null,"Coincident"]
[null,null,"WEATHER CORRECTED MD 10% POE","MVA","Non-coincident"]
[null,null,null,null,"Coincident"]
[null,null,"WEATHER CORRECTED MD 50% POE","MW","Non-coincident"]
[null,null,null,null,"Coincident"]
[null,null,"WEATHER CORRECTED MD 50% POE","MVA","Non-coincident"]
[null,null,null,null,"Coincident"]
[null,"NSP to enter name","CONNECTION POINT RATING","MVA","Non-coincident"]
[null,null,null,null,"Coincident"]
[null,null,"WINTER/SUMMER PEAKING",null,"Non-coincident"]
[null,null,null,null,"Coincident"]
[null,null,"ADJUSTMENTS - EMBEDDED GENERATION","MW","Non-coincident"]
[null,null,null,null,"Coincident"]
[null,null,"WEATHER CORRECTED MD 10% POE","MW","Non-coincident"]
[null,null,null,null,"Coincident"]
[null,null,"WEATHER CORRECTED MD 10% POE","MVA","Non-coincident"]
[null,null,null,null,"Coincident"]
[null,null,"WEATHER CORRECTED MD 50% POE","MW","Non-coincident"]
[null,null,null,null,"Coincident"]
[null,null,"WEATHER CORRECTED MD 50% POE","MVA","Non-coincident"]
[null,null,null,null,"Coincident"]
[null,"NSP to enter name","CONNECTION POINT RATING","MVA","Non-coincident"]
[null,null,null,null,"Coincident"]
[null,null,"WINTER/SUMMER PEAKING",null,"Non-coincident"]
[null,null,null,null,"Coincident"]
[null,null,"ADJUSTMENTS - EMBEDDED GENERATION","MW","Non-coincident"]
[null,null,null,null,"Coincident"]
[null,null,"WEATHER CORRECTED MD 10% POE","MW","Non-coincident"]
[null,null,null,null,"Coincident"]
[null,null,"WEATHER CORRECTED MD 10% POE","MVA","Non-coincident"]
[null,null,null,null,"Coincident"]
[null,null,"WEATHER CORRECTED MD 50% POE","MW","Non-coincident"]
[null,null,null,null,"Coincident"]
[null,null,"WEATHER CORRECTED MD 50% POE","MVA","Non-coincident"]
[null,null,null,null,"Coincident"]
[null,"NSP to enter name","CONNECTION POINT RATING","MVA","Non-coincident"]
[null,null,null,null,"Coincident"]
[null,null,"WINTER/SUMMER PEAKING",null,"Non-coincident"]
[null,null,null,null,"Coincident"]
[null,null,"ADJUSTMENTS - EMBEDDED GENERATION","MW","Non-coincident"]
[null,null,null,null,"Coincident"]
[null,null,"WEATHER CORRECTED MD 10% POE","MW","Non-coincident"]
[null,null,null,null,"Coincident"]
[null,null,"WEATHER CORRECTED MD 10% POE","MVA","Non-coincident"]
[null,null,null,null,"Coincident"]
[null,null,"WEATHER CORRECTED MD 50% POE","MW","Non-coincident"]
[null,null,null,null,"Coincident"]
[null,null,"WEATHER CORRECTED MD 50% POE","MVA","Non-coincident"]
[null,null,null,null,"Coincident"]
[null,"NSP to enter name","CONNECTION POINT RATING","MVA","Non-coincident"]
[null,null,null,null,"Coincident"]
[null,null,"WINTER/SUMMER PEAKING",null,"Non-coincident"]
[null,null,null,null,"Coincident"]
[null,null,"ADJUSTMENTS - EMBEDDED GENERATION","MW","Non-coincident"]
[null,null,null,null,"Coincident"]
[null,null,"WEATHER CORRECTED MD 10% POE","MW","Non-coincident"]
[null,null,null,null,"Coincident"]
[null,null,"WEATHER CORRECTED MD 10% POE","MVA","Non-coincident"]
[null,null,null,null,"Coincident"]
[null,null,"WEATHER CORRECTED MD 50% POE","MW","Non-coincident"]
[null,null,null,null,"Coincident"]
[null,null,"WEATHER CORRECTED MD 50% POE","MVA","Non-coincident"]
[null,null,null,null,"Coincident"]
[null,"NSP to enter name","CONNECTION POINT RATING","MVA","Non-coincident"]
[null,null,null,null,"Coincident"]
[null,null,"WINTER/SUMMER PEAKING",null,"Non-coincident"]
[null,null,null,null,"Coincident"]
[null,null,"ADJUSTMENTS - EMBEDDED GENERATION","MW","Non-coincident"]
[null,null,null,null,"Coincident"]
[null,null,"WEATHER CORRECTED MD 10% POE","MW","Non-coincident"]
[null,null,null,null,"Coincident"]
[null,null,"WEATHER CORRECTED MD 10% POE","MVA","Non-coincident"]
[null,null,null,null,"Coincident"]
[null,null,"WEATHER CORRECTED MD 50% POE","MW","Non-coincident"]
[null,null,null,null,"Coincident"]
[null,null,"WEATHER CORRECTED MD 50% POE","MVA","Non-coincident"]
[null,null,null,null,"Coincident"]
[null,"NSP to enter name","CONNECTION POINT RATING","MVA","Non-coincident"]
[null,null,null,null,"Coincident"]
[null,null,"WINTER/SUMMER PEAKING",null,"Non-coincident"]
[null,null,null,null,"Coincident"]
[null,null,"ADJUSTMENTS - EMBEDDED GENERATION","MW","Non-coincident"]
[null,null,null,null,"Coincident"]
[null,null,"WEATHER CORRECTED MD 10% POE","MW","Non-coincident"]
[null,null,null,null,"Coincident"]
[null,null,"WEATHER CORRECTED MD 10% POE","MVA","Non-coincident"]
[null,null,null,null,"Coincident"]
[null,null,"WEATHER CORRECTED MD 50% POE","MW","Non-coincident"]
[null,null,null,null,"Coincident"]
[null,null,"WEATHER CORRECTED MD 50% POE","MVA","Non-coincident"]
[null,null,null,null,"Coincident"]
[null,"NSP to enter name","CONNECTION POINT RATING","MVA","Non-coincident"]
[null,null,null,null,"Coincident"]
[null,null,"WINTER/SUMMER PEAKING",null,"Non-coincident"]
[null,null,null,null,"Coincident"]
[null,null,"ADJUSTMENTS - EMBEDDED GENERATION","MW","Non-coincident"]
[null,null,null,null,"Coincident"]
[null,null,"WEATHER CORRECTED MD 10% POE","MW","Non-coincident"]
[null,null,null,null,"Coincident"]
[null,null,"WEATHER CORRECTED MD 10% POE","MVA","Non-coincident"]
[null,null,null,null,"Coincident"]
[null,null,"WEATHER CORRECTED MD 50% POE","MW","Non-coincident"]
[null,null,null,null,"Coincident"]
[null,null,"WEATHER CORRECTED MD 50% POE","MVA","Non-coincident"]
[null,null,null,null,"Coincident"]
[null,"NSP to enter name","CONNECTION POINT RATING","MVA","Non-coincident"]
[null,null,null,null,"Coincident"]
[null,null,"WINTER/SUMMER PEAKING",null,"Non-coincident"]
[null,null,null,null,"Coincident"]
[null,null,"ADJUSTMENTS - EMBEDDED GENERATION","MW","Non-coincident"]
[null,null,null,null,"Coincident"]
[null,null,"WEATHER CORRECTED MD 10% POE","MW","Non-coincident"]
[null,null,null,null,"Coincident"]
[null,null,"WEATHER CORRECTED MD 10% POE","MVA","Non-coincident"]
[null,null,null,null,"Coincident"]
[null,null,"WEATHER CORRECTED MD 50% POE","MW","Non-coincident"]
[null,null,null,null,"Coincident"]
[null,null,"WEATHER CORRECTED MD 50% POE","MVA","Non-coincident"]
[null,null,null,null,"Coincident"]
[null,"NSP to enter name","CONNECTION POINT RATING","MVA","Non-coincident"]
[null,null,null,null,"Coincident"]
[null,null,"WINTER/SUMMER PEAKING",null,"Non-coincident"]
[null,null,null,null,"Coincident"]
[null,null,"ADJUSTMENTS - EMBEDDED GENERATION","MW","Non-coincident"]
[null,null,null,null,"Coincident"]
[null,null,"WEATHER CORRECTED MD 10% POE","MW","Non-coincident"]
[null,null,null,null,"Coincident"]
[null,null,"WEATHER CORRECTED MD 10% POE","MVA","Non-coincident"]
[null,null,null,null,"Coincident"]
[null,null,"WEATHER CORRECTED MD 50% POE","MW","Non-coincident"]
[null,null,null,null,"Coincident"]
[null,null,"WEATHER CORRECTED MD 50% POE","MVA","Non-coincident"]
[null,null,null,null,"Coincident"]
[null,"NSP to enter name","CONNECTION POINT RATING","MVA","Non-coincident"]
[null,null,null,null,"Coincident"]
[null,null,"WINTER/SUMMER PEAKING",null,"Non-coincident"]
[null,null,null,null,"Coincident"]
[null,null,"ADJUSTMENTS - EMBEDDED GENERATION","MW","Non-coincident"]
[null,null,null,null,"Coincident"]
[null,null,"WEATHER CORRECTED MD 10% POE","MW","Non-coincident"]
[null,null,null,null,"Coincident"]
[null,null,"WEATHER CORRECTED MD 10% POE","MVA","Non-coincident"]
[null,null,null,null,"Coincident"]
[null,null,"WEATHER CORRECTED MD 50% POE","MW","Non-coincident"]
[null,null,null,null,"Coincident"]
[null,null,"WEATHER CORRECTED MD 50% POE","MVA","Non-coincident"]
[null,null,null,null,"Coincident"]
[null,"NSP to enter name","CONNECTION POINT RATING","MVA","Non-coincident"]
[null,null,null,null,"Coincident"]
[null,null,"WINTER/SUMMER PEAKING",null,"Non-coincident"]
[null,null,null,null,"Coincident"]
[null,null,"ADJUSTMENTS - EMBEDDED GENERATION","MW","Non-coincident"]
[null,null,null,null,"Coincident"]
[null,null,"WEATHER CORRECTED MD 10% POE","MW","Non-coincident"]
[null,null,null,null,"Coincident"]
[null,null,"WEATHER CORRECTED MD 10% POE","MVA","Non-coincident"]
[null,null,null,null,"Coincident"]
[null,null,"WEATHER CORRECTED MD 50% POE","MW","Non-coincident"]
[null,null,null,null,"Coincident"]
[null,null,"WEATHER CORRECTED MD 50% POE","MVA","Non-coincident"]
[null,null,null,null,"Coincident"]
[null,"NSP to enter name","CONNECTION POINT RATING","MVA","Non-coincident"]
[null,null,null,null,"Coincident"]
[null,null,"WINTER/SUMMER PEAKING",null,"Non-coincident"]
[null,null,null,null,"Coincident"]
[null,null,"ADJUSTMENTS - EMBEDDED GENERATION","MW","Non-coincident"]
[null,null,null,null,"Coincident"]
[null,null,"WEATHER CORRECTED MD 10% POE","MW","Non-coincident"]
[null,null,null,null,"Coincident"]
[null,null,"WEATHER CORRECTED MD 10% POE","MVA","Non-coincident"]
[null,null,null,null,"Coincident"]
[null,null,"WEATHER CORRECTED MD 50% POE","MW","Non-coincident"]
[null,null,null,null,"Coincident"]
[null,null,"WEATHER CORRECTED MD 50% POE","MVA","Non-coincident"]
[null,null,null,null,"Coincident"]
[null,"NSP to enter name","CONNECTION POINT RATING","MVA","Non-coincident"]
[null,null,null,null,"Coincident"]
[null,null,"WINTER/SUMMER PEAKING",null,"Non-coincident"]
[null,null,null,null,"Coincident"]
[null,null,"ADJUSTMENTS - EMBEDDED GENERATION","MW","Non-coincident"]
[null,null,null,null,"Coincident"]
[null,null,"WEATHER CORRECTED MD 10% POE","MW","Non-coincident"]
[null,null,null,null,"Coincident"]
[null,null,"WEATHER CORRECTED MD 10% POE","MVA","Non-coincident"]
[null,null,null,null,"Coincident"]
[null,null,"WEATHER CORRECTED MD 50% POE","MW","Non-coincident"]
[null,null,null,null,"Coincident"]
[null,null,"WEATHER CORRECTED MD 50% POE","MVA","Non-coincident"]
[null,null,null,null,"Coincident"]
[null,"NSP to enter name","CONNECTION POINT RATING","MVA","Non-coincident"]
[null,null,null,null,"Coincident"]
[null,null,"WINTER/SUMMER PEAKING",null,"Non-coincident"]
[null,null,null,null,"Coincident"]
[null,null,"ADJUSTMENTS - EMBEDDED GENERATION","MW","Non-coincident"]
[null,null,null,null,"Coincident"]
[null,null,"WEATHER CORRECTED MD 10% POE","MW","Non-coincident"]
[null,null,null,null,"Coincident"]
[null,null,"WEATHER CORRECTED MD 10% POE","MVA","Non-coincident"]
[null,null,null,null,"Coincident"]
[null,null,"WEATHER CORRECTED MD 50% POE","MW","Non-coincident"]
[null,null,null,null,"Coincident"]
[null,null,"WEATHER CORRECTED MD 50% POE","MVA","Non-coincident"]
[null,null,null,null,"Coincident"]
[null,"NSP to enter name","CONNECTION POINT RATING","MVA","Non-coincident"]
[null,null,null,null,"Coincident"]
[null,null,"WINTER/SUMMER PEAKING",null,"Non-coincident"]
[null,null,null,null,"Coincident"]
[null,null,"ADJUSTMENTS - EMBEDDED GENERATION","MW","Non-coincident"]
[null,null,null,null,"Coincident"]
[null,null,"WEATHER CORRECTED MD 10% POE","MW","Non-coincident"]
[null,null,null,null,"Coincident"]
[null,null,"WEATHER CORRECTED MD 10% POE","MVA","Non-coincident"]
[null,null,null,null,"Coincident"]
[null,null,"WEATHER CORRECTED MD 50% POE","MW","Non-coincident"]
[null,null,null,null,"Coincident"]
[null,null,"WEATHER CORRECTED MD 50% POE","MVA","Non-coincident"]
[null,null,null,null,"Coincident"]
[null,"NSP to enter name","CONNECTION POINT RATING","MVA","Non-coincident"]
[null,null,null,null,"Coincident"]
[null,null,"WINTER/SUMMER PEAKING",null,"Non-coincident"]
[null,null,null,null,"Coincident"]
[null,null,"ADJUSTMENTS - EMBEDDED GENERATION","MW","Non-coincident"]
[null,null,null,null,"Coincident"]
[null,null,"WEATHER CORRECTED MD 10% POE","MW","Non-coincident"]
[null,null,null,null,"Coincident"]
[null,null,"WEATHER CORRECTED MD 10% POE","MVA","Non-coincident"]
[null,null,null,null,"Coincident"]
[null,null,"WEATHER CORRECTED MD 50% POE","MW","Non-coincident"]
[null,null,null,null,"Coincident"]
[null,null,"WEATHER CORRECTED MD 50% POE","MVA","Non-coincident"]
[null,null,null,null,"Coincident"]
[null,"NSP to enter name","CONNECTION POINT RATING","MVA","Non-coincident"]
[null,null,null,null,"Coincident"]
[null,null,"WINTER/SUMMER PEAKING",null,"Non-coincident"]
[null,null,null,null,"Coincident"]
[null,null,"ADJUSTMENTS - EMBEDDED GENERATION","MW","Non-coincident"]
[null,null,null,null,"Coincident"]
[null,null,"WEATHER CORRECTED MD 10% POE","MW","Non-coincident"]
[null,null,null,null,"Coincident"]
[null,null,"WEATHER CORRECTED MD 10% POE","MVA","Non-coincident"]
[null,null,null,null,"Coincident"]
[null,null,"WEATHER CORRECTED MD 50% POE","MW","Non-coincident"]
[null,null,null,null,"Coincident"]
[null,null,"WEATHER CORRECTED MD 50% POE","MVA","Non-coincident"]
[null,null,null,null,"Coincident"]
[null,"NSP to enter name","CONNECTION POINT RATING","MVA","Non-coincident"]
[null,null,null,null,"Coincident"]
[null,null,"WINTER/SUMMER PEAKING",null,"Non-coincident"]
[null,null,null,null,"Coincident"]
[null,null,"ADJUSTMENTS - EMBEDDED GENERATION","MW","Non-coincident"]
[null,null,null,null,"Coincident"]
[null,null,"WEATHER CORRECTED MD 10% POE","MW","Non-coincident"]
[null,null,null,null,"Coincident"]
[null,null,"WEATHER CORRECTED MD 10% POE","MVA","Non-coincident"]
[null,null,null,null,"Coincident"]
[null,null,"WEATHER CORRECTED MD 50% POE","MW","Non-coincident"]
[null,null,null,null,"Coincident"]
[null,null,"WEATHER CORRECTED MD 50% POE","MVA","Non-coincident"]
[null,null,null,null,"Coincident"]
[null,"NSP to enter name","CONNECTION POINT RATING","MVA","Non-coincident"]
[null,null,null,null,"Coincident"]
[null,null,"WINTER/SUMMER PEAKING",null,"Non-coincident"]
[null,null,null,null,"Coincident"]
[null,null,"ADJUSTMENTS - EMBEDDED GENERATION","MW","Non-coincident"]
[null,null,null,null,"Coincident"]
[null,null,"WEATHER CORRECTED MD 10% POE","MW","Non-coincident"]
[null,null,null,null,"Coincident"]
[null,null,"WEATHER CORRECTED MD 10% POE","MVA","Non-coincident"]
[null,null,null,null,"Coincident"]
[null,null,"WEATHER CORRECTED MD 50% POE","MW","Non-coincident"]
[null,null,null,null,"Coincident"]
[null,null,"WEATHER CORRECTED MD 50% POE","MVA","Non-coincident"]
[null,null,null,null,"Coincident"]
[null,"NSP to enter name","CONNECTION POINT RATING","MVA","Non-coincident"]
[null,null,null,null,"Coincident"]
[null,null,"WINTER/SUMMER PEAKING",null,"Non-coincident"]
[null,null,null,null,"Coincident"]
[null,null,"ADJUSTMENTS - EMBEDDED GENERATION","MW","Non-coincident"]
[null,null,null,null,"Coincident"]
[null,null,"WEATHER CORRECTED MD 10% POE","MW","Non-coincident"]
[null,null,null,null,"Coincident"]
[null,null,"WEATHER CORRECTED MD 10% POE","MVA","Non-coincident"]
[null,null,null,null,"Coincident"]
[null,null,"WEATHER CORRECTED MD 50% POE","MW","Non-coincident"]
[null,null,null,null,"Coincident"]
[null,null,"WEATHER CORRECTED MD 50% POE","MVA","Non-coincident"]
[null,null,null,null,"Coincident"]
[null,"NSP to enter name","CONNECTION POINT RATING","MVA","Non-coincident"]
[null,null,null,null,"Coincident"]
[null,null,"WINTER/SUMMER PEAKING",null,"Non-coincident"]
[null,null,null,null,"Coincident"]
[null,null,"ADJUSTMENTS - EMBEDDED GENERATION","MW","Non-coincident"]
[null,null,null,null,"Coincident"]
[null,null,"WEATHER CORRECTED MD 10% POE","MW","Non-coincident"]
[null,null,null,null,"Coincident"]
[null,null,"WEATHER CORRECTED MD 10% POE","MVA","Non-coincident"]
[null,null,null,null,"Coincident"]
[null,null,"WEATHER CORRECTED MD 50% POE","MW","Non-coincident"]
[null,null,null,null,"Coincident"]
[null,null,"WEATHER CORRECTED MD 50% POE","MVA","Non-coincident"]
[null,null,null,null,"Coincident"]
[null,"NSP to enter name","CONNECTION POINT RATING","MVA","Non-coincident"]
[null,null,null,null,"Coincident"]
[null,null,"WINTER/SUMMER PEAKING",null,"Non-coincident"]
[null,null,null,null,"Coincident"]
[null,null,"ADJUSTMENTS - EMBEDDED GENERATION","MW","Non-coincident"]
[null,null,null,null,"Coincident"]
[null,null,"WEATHER CORRECTED MD 10% POE","MW","Non-coincident"]
[null,null,null,null,"Coincident"]
[null,null,"WEATHER CORRECTED MD 10% POE","MVA","Non-coincident"]
[null,null,null,null,"Coincident"]
[null,null,"WEATHER CORRECTED MD 50% POE","MW","Non-coincident"]
[null,null,null,null,"Coincident"]
[null,null,"WEATHER CORRECTED MD 50% POE","MVA","Non-coincident"]
[null,null,null,null,"Coincident"]
[null,"NSP to enter name","CONNECTION POINT RATING","MVA","Non-coincident"]
[null,null,null,null,"Coincident"]
[null,null,"WINTER/SUMMER PEAKING",null,"Non-coincident"]
[null,null,null,null,"Coincident"]
[null,null,"ADJUSTMENTS - EMBEDDED GENERATION","MW","Non-coincident"]
[null,null,null,null,"Coincident"]
[null,null,"WEATHER CORRECTED MD 10% POE","MW","Non-coincident"]
[null,null,null,null,"Coincident"]
[null,null,"WEATHER CORRECTED MD 10% POE","MVA","Non-coincident"]
[null,null,null,null,"Coincident"]
[null,null,"WEATHER CORRECTED MD 50% POE","MW","Non-coincident"]
[null,null,null,null,"Coincident"]
[null,null,"WEATHER CORRECTED MD 50% POE","MVA","Non-coincident"]
[null,null,null,null,"Coincident"]
[null,"NSP to enter name","CONNECTION POINT RATING","MVA","Non-coincident"]
[null,null,null,null,"Coincident"]
[null,null,"WINTER/SUMMER PEAKING",null,"Non-coincident"]
[null,null,null,null,"Coincident"]
[null,null,"ADJUSTMENTS - EMBEDDED GENERATION","MW","Non-coincident"]
[null,null,null,null,"Coincident"]
[null,null,"WEATHER CORRECTED MD 10% POE","MW","Non-coincident"]
[null,null,null,null,"Coincident"]
[null,null,"WEATHER CORRECTED MD 10% POE","MVA","Non-coincident"]
[null,null,null,null,"Coincident"]
[null,null,"WEATHER CORRECTED MD 50% POE","MW","Non-coincident"]
[null,null,null,null,"Coincident"]
[null,null,"WEATHER CORRECTED MD 50% POE","MVA","Non-coincident"]
[null,null,null,null,"Coincident"]
[null,"NSP to enter name","CONNECTION POINT RATING","MVA","Non-coincident"]
[null,null,null,null,"Coincident"]
[null,null,"WINTER/SUMMER PEAKING",null,"Non-coincident"]
[null,null,null,null,"Coincident"]
[null,null,"ADJUSTMENTS - EMBEDDED GENERATION","MW","Non-coincident"]
[null,null,null,null,"Coincident"]
[null,null,"WEATHER CORRECTED MD 10% POE","MW","Non-coincident"]
[null,null,null,null,"Coincident"]
[null,null,"WEATHER CORRECTED MD 10% POE","MVA","Non-coincident"]
[null,null,null,null,"Coincident"]
[null,null,"WEATHER CORRECTED MD 50% POE","MW","Non-coincident"]
[null,null,null,null,"Coincident"]
[null,null,"WEATHER CORRECTED MD 50% POE","MVA","Non-coincident"]
[null,null,null,null,"Coincident"]
[null,"NSP to enter name","CONNECTION POINT RATING","MVA","Non-coincident"]
[null,null,null,null,"Coincident"]
[null,null,"WINTER/SUMMER PEAKING",null,"Non-coincident"]
[null,null,null,null,"Coincident"]
[null,null,"ADJUSTMENTS - EMBEDDED GENERATION","MW","Non-coincident"]
[null,null,null,null,"Coincident"]
[null,null,"WEATHER CORRECTED MD 10% POE","MW","Non-coincident"]
[null,null,null,null,"Coincident"]
[null,null,"WEATHER CORRECTED MD 10% POE","MVA","Non-coincident"]
[null,null,null,null,"Coincident"]
[null,null,"WEATHER CORRECTED MD 50% POE","MW","Non-coincident"]
[null,null,null,null,"Coincident"]
[null,null,"WEATHER CORRECTED MD 50% POE","MVA","Non-coincident"]
[null,null,null,null,"Coincident"]
[null,"NSP to enter name","CONNECTION POINT RATING","MVA","Non-coincident"]
[null,null,null,null,"Coincident"]
[null,null,"WINTER/SUMMER PEAKING",null,"Non-coincident"]
[null,null,null,null,"Coincident"]
[null,null,"ADJUSTMENTS - EMBEDDED GENERATION","MW","Non-coincident"]
[null,null,null,null,"Coincident"]
[null,null,"WEATHER CORRECTED MD 10% POE","MW","Non-coincident"]
[null,null,null,null,"Coincident"]
[null,null,"WEATHER CORRECTED MD 10% POE","MVA","Non-coincident"]
[null,null,null,null,"Coincident"]
[null,null,"WEATHER CORRECTED MD 50% POE","MW","Non-coincident"]
[null,null,null,null,"Coincident"]
[null,null,"WEATHER CORRECTED MD 50% POE","MVA","Non-coincident"]
[null,null,null,null,"Coincident"]
[null,"NSP to enter name","CONNECTION POINT RATING","MVA","Non-coincident"]
[null,null,null,null,"Coincident"]
[null,null,"WINTER/SUMMER PEAKING",null,"Non-coincident"]
[null,null,null,null,"Coincident"]
[null,null,"ADJUSTMENTS - EMBEDDED GENERATION","MW","Non-coincident"]
[null,null,null,null,"Coincident"]
[null,null,"WEATHER CORRECTED MD 10% POE","MW","Non-coincident"]
[null,null,null,null,"Coincident"]
[null,null,"WEATHER CORRECTED MD 10% POE","MVA","Non-coincident"]
[null,null,null,null,"Coincident"]
[null,null,"WEATHER CORRECTED MD 50% POE","MW","Non-coincident"]
[null,null,null,null,"Coincident"]
[null,null,"WEATHER CORRECTED MD 50% POE","MVA","Non-coincident"]
[null,null,null,null,"Coincident"]
[null,"NSP to enter name","CONNECTION POINT RATING","MVA","Non-coincident"]
[null,null,null,null,"Coincident"]
[null,null,"WINTER/SUMMER PEAKING",null,"Non-coincident"]
[null,null,null,null,"Coincident"]
[null,null,"ADJUSTMENTS - EMBEDDED GENERATION","MW","Non-coincident"]
[null,null,null,null,"Coincident"]
[null,null,"WEATHER CORRECTED MD 10% POE","MW","Non-coincident"]
[null,null,null,null,"Coincident"]
[null,null,"WEATHER CORRECTED MD 10% POE","MVA","Non-coincident"]
[null,null,null,null,"Coincident"]
[null,null,"WEATHER CORRECTED MD 50% POE","MW","Non-coincident"]
[null,null,null,null,"Coincident"]
[null,null,"WEATHER CORRECTED MD 50% POE","MVA","Non-coincident"]
[null,null,null,null,"Coincident"]
[null,"NSP to enter name","CONNECTION POINT RATING","MVA","Non-coincident"]
[null,null,null,null,"Coincident"]
[null,null,"WINTER/SUMMER PEAKING",null,"Non-coincident"]
[null,null,null,null,"Coincident"]
[null,null,"ADJUSTMENTS - EMBEDDED GENERATION","MW","Non-coincident"]
[null,null,null,null,"Coincident"]
[null,null,"WEATHER CORRECTED MD 10% POE","MW","Non-coincident"]
[null,null,null,null,"Coincident"]
[null,null,"WEATHER CORRECTED MD 10% POE","MVA","Non-coincident"]
[null,null,null,null,"Coincident"]
[null,null,"WEATHER CORRECTED MD 50% POE","MW","Non-coincident"]
[null,null,null,null,"Coincident"]
[null,null,"WEATHER CORRECTED MD 50% POE","MVA","Non-coincident"]
[null,null,null,null,"Coincident"]
[null,"NSP to enter name","CONNECTION POINT RATING","MVA","Non-coincident"]
[null,null,null,null,"Coincident"]
[null,null,"WINTER/SUMMER PEAKING",null,"Non-coincident"]
[null,null,null,null,"Coincident"]
[null,null,"ADJUSTMENTS - EMBEDDED GENERATION","MW","Non-coincident"]
[null,null,null,null,"Coincident"]
[null,null,"WEATHER CORRECTED MD 10% POE","MW","Non-coincident"]
[null,null,null,null,"Coincident"]
[null,null,"WEATHER CORRECTED MD 10% POE","MVA","Non-coincident"]
[null,null,null,null,"Coincident"]
[null,null,"WEATHER CORRECTED MD 50% POE","MW","Non-coincident"]
[null,null,null,null,"Coincident"]
[null,null,"WEATHER CORRECTED MD 50% POE","MVA","Non-coincident"]
[null,null,null,null,"Coincident"]
[null,"NSP to enter name","CONNECTION POINT RATING","MVA","Non-coincident"]
[null,null,null,null,"Coincident"]
[null,null,"WINTER/SUMMER PEAKING",null,"Non-coincident"]
[null,null,null,null,"Coincident"]
[null,null,"ADJUSTMENTS - EMBEDDED GENERATION","MW","Non-coincident"]
[null,null,null,null,"Coincident"]
[null,null,"WEATHER CORRECTED MD 10% POE","MW","Non-coincident"]
[null,null,null,null,"Coincident"]
[null,null,"WEATHER CORRECTED MD 10% POE","MVA","Non-coincident"]
[null,null,null,null,"Coincident"]
[null,null,"WEATHER CORRECTED MD 50% POE","MW","Non-coincident"]
[null,null,null,null,"Coincident"]
[null,null,"WEATHER CORRECTED MD 50% POE","MVA","Non-coincident"]
[null,null,null,null,"Coincident"]
[null,"NSP to enter name","CONNECTION POINT RATING","MVA","Non-coincident"]
[null,null,null,null,"Coincident"]
[null,null,"WINTER/SUMMER PEAKING",null,"Non-coincident"]
[null,null,null,null,"Coincident"]
[null,null,"ADJUSTMENTS - EMBEDDED GENERATION","MW","Non-coincident"]
[null,null,null,null,"Coincident"]
[null,null,"WEATHER CORRECTED MD 10% POE","MW","Non-coincident"]
[null,null,null,null,"Coincident"]
[null,null,"WEATHER CORRECTED MD 10% POE","MVA","Non-coincident"]
[null,null,null,null,"Coincident"]
[null,null,"WEATHER CORRECTED MD 50% POE","MW","Non-coincident"]
[null,null,null,null,"Coincident"]
[null,null,"WEATHER CORRECTED MD 50% POE","MVA","Non-coincident"]
[null,null,null,null,"Coincident"]
[null,"NSP to enter name","CONNECTION POINT RATING","MVA","Non-coincident"]
[null,null,null,null,"Coincident"]
[null,null,"WINTER/SUMMER PEAKING",null,"Non-coincident"]
[null,null,null,null,"Coincident"]
[null,null,"ADJUSTMENTS - EMBEDDED GENERATION","MW","Non-coincident"]
[null,null,null,null,"Coincident"]
[null,null,"WEATHER CORRECTED MD 10% POE","MW","Non-coincident"]
[null,null,null,null,"Coincident"]
[null,null,"WEATHER CORRECTED MD 10% POE","MVA","Non-coincident"]
[null,null,null,null,"Coincident"]
[null,null,"WEATHER CORRECTED MD 50% POE","MW","Non-coincident"]
[null,null,null,null,"Coincident"]
[null,null,"WEATHER CORRECTED MD 50% POE","MVA","Non-coincident"]
[null,null,null,null,"Coincident"]
[null,"NSP to enter name","CONNECTION POINT RATING","MVA","Non-coincident"]
[null,null,null,null,"Coincident"]
[null,null,"WINTER/SUMMER PEAKING",null,"Non-coincident"]
[null,null,null,null,"Coincident"]
[null,null,"ADJUSTMENTS - EMBEDDED GENERATION","MW","Non-coincident"]
[null,null,null,null,"Coincident"]
[null,null,"WEATHER CORRECTED MD 10% POE","MW","Non-coincident"]
[null,null,null,null,"Coincident"]
[null,null,"WEATHER CORRECTED MD 10% POE","MVA","Non-coincident"]
[null,null,null,null,"Coincident"]
[null,null,"WEATHER CORRECTED MD 50% POE","MW","Non-coincident"]
[null,null,null,null,"Coincident"]
[null,null,"WEATHER CORRECTED MD 50% POE","MVA","Non-coincident"]
[null,null,null,null,"Coincident"]
[null,"NSP to enter name","CONNECTION POINT RATING","MVA","Non-coincident"]
[null,null,null,null,"Coincident"]
[null,null,"WINTER/SUMMER PEAKING",null,"Non-coincident"]
[null,null,null,null,"Coincident"]
[null,null,"ADJUSTMENTS - EMBEDDED GENERATION","MW","Non-coincident"]
[null,null,null,null,"Coincident"]
[null,null,"WEATHER CORRECTED MD 10% POE","MW","Non-coincident"]
[null,null,null,null,"Coincident"]
[null,null,"WEATHER CORRECTED MD 10% POE","MVA","Non-coincident"]
[null,null,null,null,"Coincident"]
[null,null,"WEATHER CORRECTED MD 50% POE","MW","Non-coincident"]
[null,null,null,null,"Coincident"]
[null,null,"WEATHER CORRECTED MD 50% POE","MVA","Non-coincident"]
[null,null,null,null,"Coincident"]
[null,"NSP to enter name","CONNECTION POINT RATING","MVA","Non-coincident"]
[null,null,null,null,"Coincident"]
[null,null,"WINTER/SUMMER PEAKING",null,"Non-coincident"]
[null,null,null,null,"Coincident"]
[null,null,"ADJUSTMENTS - EMBEDDED GENERATION","MW","Non-coincident"]
[null,null,null,null,"Coincident"]
[null,null,"WEATHER CORRECTED MD 10% POE","MW","Non-coincident"]
[null,null,null,null,"Coincident"]
[null,null,"WEATHER CORRECTED MD 10% POE","MVA","Non-coincident"]
[null,null,null,null,"Coincident"]
[null,null,"WEATHER CORRECTED MD 50% POE","MW","Non-coincident"]
[null,null,null,null,"Coincident"]
[null,null,"WEATHER CORRECTED MD 50% POE","MVA","Non-coincident"]
[null,null,null,null,"Coincident"]
[null,"NSP to enter name","CONNECTION POINT RATING","MVA","Non-coincident"]
[null,null,null,null,"Coincident"]
[null,null,"WINTER/SUMMER PEAKING",null,"Non-coincident"]
[null,null,null,null,"Coincident"]
[null,null,"ADJUSTMENTS - EMBEDDED GENERATION","MW","Non-coincident"]
[null,null,null,null,"Coincident"]
[null,null,"WEATHER CORRECTED MD 10% POE","MW","Non-coincident"]
[null,null,null,null,"Coincident"]
[null,null,"WEATHER CORRECTED MD 10% POE","MVA","Non-coincident"]
[null,null,null,null,"Coincident"]
[null,null,"WEATHER CORRECTED MD 50% POE","MW","Non-coincident"]
[null,null,null,null,"Coincident"]
[null,null,"WEATHER CORRECTED MD 50% POE","MVA","Non-coincident"]
[null,null,null,null,"Coincident"]
[null,"NSP to enter name","CONNECTION POINT RATING","MVA","Non-coincident"]
[null,null,null,null,"Coincident"]
[null,null,"WINTER/SUMMER PEAKING",null,"Non-coincident"]
[null,null,null,null,"Coincident"]
[null,null,"ADJUSTMENTS - EMBEDDED GENERATION","MW","Non-coincident"]
[null,null,null,null,"Coincident"]
[null,null,"WEATHER CORRECTED MD 10% POE","MW","Non-coincident"]
[null,null,null,null,"Coincident"]
[null,null,"WEATHER CORRECTED MD 10% POE","MVA","Non-coincident"]
[null,null,null,null,"Coincident"]
[null,null,"WEATHER CORRECTED MD 50% POE","MW","Non-coincident"]
[null,null,null,null,"Coincident"]
[null,null,"WEATHER CORRECTED MD 50% POE","MVA","Non-coincident"]
[null,null,null,null,"Coincident"]
[null,"NSP to enter name","CONNECTION POINT RATING","MVA","Non-coincident"]
[null,null,null,null,"Coincident"]
[null,null,"WINTER/SUMMER PEAKING",null,"Non-coincident"]
[null,null,null,null,"Coincident"]
[null,null,"ADJUSTMENTS - EMBEDDED GENERATION","MW","Non-coincident"]
[null,null,null,null,"Coincident"]
[null,null,"WEATHER CORRECTED MD 10% POE","MW","Non-coincident"]
[null,null,null,null,"Coincident"]
[null,null,"WEATHER CORRECTED MD 10% POE","MVA","Non-coincident"]
[null,null,null,null,"Coincident"]
[null,null,"WEATHER CORRECTED MD 50% POE","MW","Non-coincident"]
[null,null,null,null,"Coincident"]
[null,null,"WEATHER CORRECTED MD 50% POE","MVA","Non-coincident"]
[null,null,null,null,"Coincident"]
[null,"NSP to enter name","CONNECTION POINT RATING","MVA","Non-coincident"]
[null,null,null,null,"Coincident"]
[null,null,"WINTER/SUMMER PEAKING",null,"Non-coincident"]
[null,null,null,null,"Coincident"]
[null,null,"ADJUSTMENTS - EMBEDDED GENERATION","MW","Non-coincident"]
[null,null,null,null,"Coincident"]
[null,null,"WEATHER CORRECTED MD 10% POE","MW","Non-coincident"]
[null,null,null,null,"Coincident"]
[null,null,"WEATHER CORRECTED MD 10% POE","MVA","Non-coincident"]
[null,null,null,null,"Coincident"]
[null,null,"WEATHER CORRECTED MD 50% POE","MW","Non-coincident"]
[null,null,null,null,"Coincident"]
[null,null,"WEATHER CORRECTED MD 50% POE","MVA","Non-coincident"]
[null,null,null,null,"Coincident"]
[null,"NSP to enter name","CONNECTION POINT RATING","MVA","Non-coincident"]
[null,null,null,null,"Coincident"]
[null,null,"WINTER/SUMMER PEAKING",null,"Non-coincident"]
[null,null,null,null,"Coincident"]
[null,null,"ADJUSTMENTS - EMBEDDED GENERATION","MW","Non-coincident"]
[null,null,null,null,"Coincident"]
[null,null,"WEATHER CORRECTED MD 10% POE","MW","Non-coincident"]
[null,null,null,null,"Coincident"]
[null,null,"WEATHER CORRECTED MD 10% POE","MVA","Non-coincident"]
[null,null,null,null,"Coincident"]
[null,null,"WEATHER CORRECTED MD 50% POE","MW","Non-coincident"]
[null,null,null,null,"Coincident"]
[null,null,"WEATHER CORRECTED MD 50% POE","MVA","Non-coincident"]
[null,null,null,null,"Coincident"]
[null,"NSP to enter name","CONNECTION POINT RATING","MVA","Non-coincident"]
[null,null,null,null,"Coincident"]
[null,null,"WINTER/SUMMER PEAKING",null,"Non-coincident"]
[null,null,null,null,"Coincident"]
[null,null,"ADJUSTMENTS - EMBEDDED GENERATION","MW","Non-coincident"]
[null,null,null,null,"Coincident"]
[null,null,"WEATHER CORRECTED MD 10% POE","MW","Non-coincident"]
[null,null,null,null,"Coincident"]
[null,null,"WEATHER CORRECTED MD 10% POE","MVA","Non-coincident"]
[null,null,null,null,"Coincident"]
[null,null,"WEATHER CORRECTED MD 50% POE","MW","Non-coincident"]
[null,null,null,null,"Coincident"]
[null,null,"WEATHER CORRECTED MD 50% POE","MVA","Non-coincident"]
[null,null,null,null,"Coincident"]
[null,"NSP to enter name","CONNECTION POINT RATING","MVA","Non-coincident"]
[null,null,null,null,"Coincident"]
[null,null,"WINTER/SUMMER PEAKING",null,"Non-coincident"]
[null,null,null,null,"Coincident"]
[null,null,"ADJUSTMENTS - EMBEDDED GENERATION","MW","Non-coincident"]
[null,null,null,null,"Coincident"]
[null,null,"WEATHER CORRECTED MD 10% POE","MW","Non-coincident"]
[null,null,null,null,"Coincident"]
[null,null,"WEATHER CORRECTED MD 10% POE","MVA","Non-coincident"]
[null,null,null,null,"Coincident"]
[null,null,"WEATHER CORRECTED MD 50% POE","MW","Non-coincident"]
[null,null,null,null,"Coincident"]
[null,null,"WEATHER CORRECTED MD 50% POE","MVA","Non-coincident"]
[null,null,null,null,"Coincident"]
[null,"NSP to enter name","CONNECTION POINT RATING","MVA","Non-coincident"]
[null,null,null,null,"Coincident"]
[null,null,"WINTER/SUMMER PEAKING",null,"Non-coincident"]
[null,null,null,null,"Coincident"]
[null,null,"ADJUSTMENTS - EMBEDDED GENERATION","MW","Non-coincident"]
[null,null,null,null,"Coincident"]
[null,null,"WEATHER CORRECTED MD 10% POE","MW","Non-coincident"]
[null,null,null,null,"Coincident"]
[null,null,"WEATHER CORRECTED MD 10% POE","MVA","Non-coincident"]
[null,null,null,null,"Coincident"]
[null,null,"WEATHER CORRECTED MD 50% POE","MW","Non-coincident"]
[null,null,null,null,"Coincident"]
[null,null,"WEATHER CORRECTED MD 50% POE","MVA","Non-coincident"]
[null,null,null,null,"Coincident"]
[null,"NSP to enter name","CONNECTION POINT RATING","MVA","Non-coincident"]
[null,null,null,null,"Coincident"]
[null,null,"WINTER/SUMMER PEAKING",null,"Non-coincident"]
[null,null,null,null,"Coincident"]
[null,null,"ADJUSTMENTS - EMBEDDED GENERATION","MW","Non-coincident"]
[null,null,null,null,"Coincident"]
[null,null,"WEATHER CORRECTED MD 10% POE","MW","Non-coincident"]
[null,null,null,null,"Coincident"]
[null,null,"WEATHER CORRECTED MD 10% POE","MVA","Non-coincident"]
[null,null,null,null,"Coincident"]
[null,null,"WEATHER CORRECTED MD 50% POE","MW","Non-coincident"]
[null,null,null,null,"Coincident"]
[null,null,"WEATHER CORRECTED MD 50% POE","MVA","Non-coincident"]
[null,null,null,null,"Coincident"]
[null,"NSP to enter name","CONNECTION POINT RATING","MVA","Non-coincident"]
[null,null,null,null,"Coincident"]
[null,null,"WINTER/SUMMER PEAKING",null,"Non-coincident"]
[null,null,null,null,"Coincident"]
[null,null,"ADJUSTMENTS - EMBEDDED GENERATION","MW","Non-coincident"]
[null,null,null,null,"Coincident"]
[null,null,"WEATHER CORRECTED MD 10% POE","MW","Non-coincident"]
[null,null,null,null,"Coincident"]
[null,null,"WEATHER CORRECTED MD 10% POE","MVA","Non-coincident"]
[null,null,null,null,"Coincident"]
[null,null,"WEATHER CORRECTED MD 50% POE","MW","Non-coincident"]
[null,null,null,null,"Coincident"]
[null,null,"WEATHER CORRECTED MD 50% POE","MVA","Non-coincident"]
[null,null,null,null,"Coincident"]
[null,"NSP to enter name","CONNECTION POINT RATING","MVA","Non-coincident"]
[null,null,null,null,"Coincident"]
[null,null,"WINTER/SUMMER PEAKING",null,"Non-coincident"]
[null,null,null,null,"Coincident"]
[null,null,"ADJUSTMENTS - EMBEDDED GENERATION","MW","Non-coincident"]
[null,null,null,null,"Coincident"]
[null,null,"WEATHER CORRECTED MD 10% POE","MW","Non-coincident"]
[null,null,null,null,"Coincident"]
[null,null,"WEATHER CORRECTED MD 10% POE","MVA","Non-coincident"]
[null,null,null,null,"Coincident"]
[null,null,"WEATHER CORRECTED MD 50% POE","MW","Non-coincident"]
[null,null,null,null,"Coincident"]
[null,null,"WEATHER CORRECTED MD 50% POE","MVA","Non-coincident"]
[null,null,null,null,"Coincident"]
[null,"NSP to enter name","CONNECTION POINT RATING","MVA","Non-coincident"]
[null,null,null,null,"Coincident"]
[null,null,"WINTER/SUMMER PEAKING",null,"Non-coincident"]
[null,null,null,null,"Coincident"]
[null,null,"ADJUSTMENTS - EMBEDDED GENERATION","MW","Non-coincident"]
[null,null,null,null,"Coincident"]
[null,null,"WEATHER CORRECTED MD 10% POE","MW","Non-coincident"]
[null,null,null,null,"Coincident"]
[null,null,"WEATHER CORRECTED MD 10% POE","MVA","Non-coincident"]
[null,null,null,null,"Coincident"]
[null,null,"WEATHER CORRECTED MD 50% POE","MW","Non-coincident"]
[null,null,null,null,"Coincident"]
[null,null,"WEATHER CORRECTED MD 50% POE","MVA","Non-coincident"]
[null,null,null,null,"Coincident"]
[null,"NSP to enter name","CONNECTION POINT RATING","MVA","Non-coincident"]
[null,null,null,null,"Coincident"]
[null,null,"WINTER/SUMMER PEAKING",null,"Non-coincident"]
[null,null,null,null,"Coincident"]
[null,null,"ADJUSTMENTS - EMBEDDED GENERATION","MW","Non-coincident"]
[null,null,null,null,"Coincident"]
[null,null,"WEATHER CORRECTED MD 10% POE","MW","Non-coincident"]
[null,null,null,null,"Coincident"]
[null,null,"WEATHER CORRECTED MD 10% POE","MVA","Non-coincident"]
[null,null,null,null,"Coincident"]
[null,null,"WEATHER CORRECTED MD 50% POE","MW","Non-coincident"]
[null,null,null,null,"Coincident"]
[null,null,"WEATHER CORRECTED MD 50% POE","MVA","Non-coincident"]
[null,null,null,null,"Coincident"]
[null,"NSP to enter name","CONNECTION POINT RATING","MVA","Non-coincident"]
[null,null,null,null,"Coincident"]
[null,null,"WINTER/SUMMER PEAKING",null,"Non-coincident"]
[null,null,null,null,"Coincident"]
[null,null,"ADJUSTMENTS - EMBEDDED GENERATION","MW","Non-coincident"]
[null,null,null,null,"Coincident"]
[null,null,"WEATHER CORRECTED MD 10% POE","MW","Non-coincident"]
[null,null,null,null,"Coincident"]
[null,null,"WEATHER CORRECTED MD 10% POE","MVA","Non-coincident"]
[null,null,null,null,"Coincident"]
[null,null,"WEATHER CORRECTED MD 50% POE","MW","Non-coincident"]
[null,null,null,null,"Coincident"]
[null,null,"WEATHER CORRECTED MD 50% POE","MVA","Non-coincident"]
[null,null,null,null,"Coincident"]
[null,"NSP to enter name","CONNECTION POINT RATING","MVA","Non-coincident"]
[null,null,null,null,"Coincident"]
[null,null,"WINTER/SUMMER PEAKING",null,"Non-coincident"]
[null,null,null,null,"Coincident"]
[null,null,"ADJUSTMENTS - EMBEDDED GENERATION","MW","Non-coincident"]
[null,null,null,null,"Coincident"]
[null,null,"WEATHER CORRECTED MD 10% POE","MW","Non-coincident"]
[null,null,null,null,"Coincident"]
[null,null,"WEATHER CORRECTED MD 10% POE","MVA","Non-coincident"]
[null,null,null,null,"Coincident"]
[null,null,"WEATHER CORRECTED MD 50% POE","MW","Non-coincident"]
[null,null,null,null,"Coincident"]
[null,null,"WEATHER CORRECTED MD 50% POE","MVA","Non-coincident"]
[null,null,null,null,"Coincident"]
[null,"NSP to enter name","CONNECTION POINT RATING","MVA","Non-coincident"]
[null,null,null,null,"Coincident"]
[null,null,"WINTER/SUMMER PEAKING",null,"Non-coincident"]
[null,null,null,null,"Coincident"]
[null,null,"ADJUSTMENTS - EMBEDDED GENERATION","MW","Non-coincident"]
[null,null,null,null,"Coincident"]
[null,null,"WEATHER CORRECTED MD 10% POE","MW","Non-coincident"]
[null,null,null,null,"Coincident"]
[null,null,"WEATHER CORRECTED MD 10% POE","MVA","Non-coincident"]
[null,null,null,null,"Coincident"]
[null,null,"WEATHER CORRECTED MD 50% POE","MW","Non-coincident"]
[null,null,null,null,"Coincident"]
[null,null,"WEATHER CORRECTED MD 50% POE","MVA","Non-coincident"]
[null,null,null,null,"Coincident"]
[null,"NSP to enter name","CONNECTION POINT RATING","MVA","Non-coincident"]
[null,null,null,null,"Coincident"]
[null,null,"WINTER/SUMMER PEAKING",null,"Non-coincident"]
[null,null,null,null,"Coincident"]
[null,null,"ADJUSTMENTS - EMBEDDED GENERATION","MW","Non-coincident"]
[null,null,null,null,"Coincident"]
[null,null,"WEATHER CORRECTED MD 10% POE","MW","Non-coincident"]
[null,null,null,null,"Coincident"]
[null,null,"WEATHER CORRECTED MD 10% POE","MVA","Non-coincident"]
[null,null,null,null,"Coincident"]
[null,null,"WEATHER CORRECTED MD 50% POE","MW","Non-coincident"]
[null,null,null,null,"Coincident"]
[null,null,"WEATHER CORRECTED MD 50% POE","MVA","Non-coincident"]
[null,null,null,null,"Coincident"]
[null,"NSP to enter name","CONNECTION POINT RATING","MVA","Non-coincident"]
[null,null,null,null,"Coincident"]
[null,null,"WINTER/SUMMER PEAKING",null,"Non-coincident"]
[null,null,null,null,"Coincident"]
[null,null,"ADJUSTMENTS - EMBEDDED GENERATION","MW","Non-coincident"]
[null,null,null,null,"Coincident"]
[null,null,"WEATHER CORRECTED MD 10% POE","MW","Non-coincident"]
[null,null,null,null,"Coincident"]
[null,null,"WEATHER CORRECTED MD 10% POE","MVA","Non-coincident"]
[null,null,null,null,"Coincident"]
[null,null,"WEATHER CORRECTED MD 50% POE","MW","Non-coincident"]
[null,null,null,null,"Coincident"]
[null,null,"WEATHER CORRECTED MD 50% POE","MVA","Non-coincident"]
[null,null,null,null,"Coincident"]
[null,"NSP to enter name","CONNECTION POINT RATING","MVA","Non-coincident"]
[null,null,null,null,"Coincident"]
[null,null,"WINTER/SUMMER PEAKING",null,"Non-coincident"]
[null,null,null,null,"Coincident"]
[null,null,"ADJUSTMENTS - EMBEDDED GENERATION","MW","Non-coincident"]
[null,null,null,null,"Coincident"]
[null,null,"WEATHER CORRECTED MD 10% POE","MW","Non-coincident"]
[null,null,null,null,"Coincident"]
[null,null,"WEATHER CORRECTED MD 10% POE","MVA","Non-coincident"]
[null,null,null,null,"Coincident"]
[null,null,"WEATHER CORRECTED MD 50% POE","MW","Non-coincident"]
[null,null,null,null,"Coincident"]
[null,null,"WEATHER CORRECTED MD 50% POE","MVA","Non-coincident"]
[null,null,null,null,"Coincident"]
[null,"NSP to enter name","CONNECTION POINT RATING","MVA","Non-coincident"]
[null,null,null,null,"Coincident"]
[null,null,"WINTER/SUMMER PEAKING",null,"Non-coincident"]
[null,null,null,null,"Coincident"]
[null,null,"ADJUSTMENTS - EMBEDDED GENERATION","MW","Non-coincident"]
[null,null,null,null,"Coincident"]
[null,null,"WEATHER CORRECTED MD 10% POE","MW","Non-coincident"]
[null,null,null,null,"Coincident"]
[null,null,"WEATHER CORRECTED MD 10% POE","MVA","Non-coincident"]
[null,null,null,null,"Coincident"]
[null,null,"WEATHER CORRECTED MD 50% POE","MW","Non-coincident"]
[null,null,null,null,"Coincident"]
[null,null,"WEATHER CORRECTED MD 50% POE","MVA","Non-coincident"]
[null,null,null,null,"Coincident"]
[null,"NSP to enter name","CONNECTION POINT RATING","MVA","Non-coincident"]
[null,null,null,null,"Coincident"]
[null,null,"WINTER/SUMMER PEAKING",null,"Non-coincident"]
[null,null,null,null,"Coincident"]
[null,null,"ADJUSTMENTS - EMBEDDED GENERATION","MW","Non-coincident"]
[null,null,null,null,"Coincident"]
[null,null,"WEATHER CORRECTED MD 10% POE","MW","Non-coincident"]
[null,null,null,null,"Coincident"]
[null,null,"WEATHER CORRECTED MD 10% POE","MVA","Non-coincident"]
[null,null,null,null,"Coincident"]
[null,null,"WEATHER CORRECTED MD 50% POE","MW","Non-coincident"]
[null,null,null,null,"Coincident"]
[null,null,"WEATHER CORRECTED MD 50% POE","MVA","Non-coincident"]
[null,null,null,null,"Coincident"]
[null,"NSP to enter name","CONNECTION POINT RATING","MVA","Non-coincident"]
[null,null,null,null,"Coincident"]
[null,null,"WINTER/SUMMER PEAKING",null,"Non-coincident"]
[null,null,null,null,"Coincident"]
[null,null,"ADJUSTMENTS - EMBEDDED GENERATION","MW","Non-coincident"]
[null,null,null,null,"Coincident"]
[null,null,"WEATHER CORRECTED MD 10% POE","MW","Non-coincident"]
[null,null,null,null,"Coincident"]
[null,null,"WEATHER CORRECTED MD 10% POE","MVA","Non-coincident"]
[null,null,null,null,"Coincident"]
[null,null,"WEATHER CORRECTED MD 50% POE","MW","Non-coincident"]
[null,null,null,null,"Coincident"]
[null,null,"WEATHER CORRECTED MD 50% POE","MVA","Non-coincident"]
[null,null,null,null,"Coincident"]
[null,"NSP to enter name","CONNECTION POINT RATING","MVA","Non-coincident"]
[null,null,null,null,"Coincident"]
[null,null,"WINTER/SUMMER PEAKING",null,"Non-coincident"]
[null,null,null,null,"Coincident"]
[null,null,"ADJUSTMENTS - EMBEDDED GENERATION","MW","Non-coincident"]
[null,null,null,null,"Coincident"]
[null,null,"WEATHER CORRECTED MD 10% POE","MW","Non-coincident"]
[null,null,null,null,"Coincident"]
[null,null,"WEATHER CORRECTED MD 10% POE","MVA","Non-coincident"]
[null,null,null,null,"Coincident"]
[null,null,"WEATHER CORRECTED MD 50% POE","MW","Non-coincident"]
[null,null,null,null,"Coincident"]
[null,null,"WEATHER CORRECTED MD 50% POE","MVA","Non-coincident"]
[null,null,null,null,"Coincident"]
[null,"NSP to enter name","CONNECTION POINT RATING","MVA","Non-coincident"]
[null,null,null,null,"Coincident"]
[null,null,"WINTER/SUMMER PEAKING",null,"Non-coincident"]
[null,null,null,null,"Coincident"]
[null,null,"ADJUSTMENTS - EMBEDDED GENERATION","MW","Non-coincident"]
[null,null,null,null,"Coincident"]
[null,null,"WEATHER CORRECTED MD 10% POE","MW","Non-coincident"]
[null,null,null,null,"Coincident"]
[null,null,"WEATHER CORRECTED MD 10% POE","MVA","Non-coincident"]
[null,null,null,null,"Coincident"]
[null,null,"WEATHER CORRECTED MD 50% POE","MW","Non-coincident"]
[null,null,null,null,"Coincident"]
[null,null,"WEATHER CORRECTED MD 50% POE","MVA","Non-coincident"]
[null,null,null,null,"Coincident"]
[null,"NSP to enter name","CONNECTION POINT RATING","MVA","Non-coincident"]
[null,null,null,null,"Coincident"]
[null,null,"WINTER/SUMMER PEAKING",null,"Non-coincident"]
[null,null,null,null,"Coincident"]
[null,null,"ADJUSTMENTS - EMBEDDED GENERATION","MW","Non-coincident"]
[null,null,null,null,"Coincident"]
[null,null,"WEATHER CORRECTED MD 10% POE","MW","Non-coincident"]
[null,null,null,null,"Coincident"]
[null,null,"WEATHER CORRECTED MD 10% POE","MVA","Non-coincident"]
[null,null,null,null,"Coincident"]
[null,null,"WEATHER CORRECTED MD 50% POE","MW","Non-coincident"]
[null,null,null,null,"Coincident"]
[null,null,"WEATHER CORRECTED MD 50% POE","MVA","Non-coincident"]
[null,null,null,null,"Coincident"]
[null,"NSP to enter name","CONNECTION POINT RATING","MVA","Non-coincident"]
[null,null,null,null,"Coincident"]
[null,null,"WINTER/SUMMER PEAKING",null,"Non-coincident"]
[null,null,null,null,"Coincident"]
[null,null,"ADJUSTMENTS - EMBEDDED GENERATION","MW","Non-coincident"]
[null,null,null,null,"Coincident"]
[null,null,"WEATHER CORRECTED MD 10% POE","MW","Non-coincident"]
[null,null,null,null,"Coincident"]
[null,null,"WEATHER CORRECTED MD 10% POE","MVA","Non-coincident"]
[null,null,null,null,"Coincident"]
[null,null,"WEATHER CORRECTED MD 50% POE","MW","Non-coincident"]
[null,null,null,null,"Coincident"]
[null,null,"WEATHER CORRECTED MD 50% POE","MVA","Non-coincident"]
[null,null,null,null,"Coincident"]
[null,"NSP to enter name","CONNECTION POINT RATING","MVA","Non-coincident"]
[null,null,null,null,"Coincident"]
[null,null,"WINTER/SUMMER PEAKING",null,"Non-coincident"]
[null,null,null,null,"Coincident"]
[null,null,"ADJUSTMENTS - EMBEDDED GENERATION","MW","Non-coincident"]
[null,null,null,null,"Coincident"]
[null,null,"WEATHER CORRECTED MD 10% POE","MW","Non-coincident"]
[null,null,null,null,"Coincident"]
[null,null,"WEATHER CORRECTED MD 10% POE","MVA","Non-coincident"]
[null,null,null,null,"Coincident"]
[null,null,"WEATHER CORRECTED MD 50% POE","MW","Non-coincident"]
[null,null,null,null,"Coincident"]
[null,null,"WEATHER CORRECTED MD 50% POE","MVA","Non-coincident"]
[null,null,null,null,"Coincident"]
[null,"NSP to enter name","CONNECTION POINT RATING","MVA","Non-coincident"]
[null,null,null,null,"Coincident"]
[null,null,"WINTER/SUMMER PEAKING",null,"Non-coincident"]
[null,null,null,null,"Coincident"]
[null,null,"ADJUSTMENTS - EMBEDDED GENERATION","MW","Non-coincident"]
[null,null,null,null,"Coincident"]
[null,null,"WEATHER CORRECTED MD 10% POE","MW","Non-coincident"]
[null,null,null,null,"Coincident"]
[null,null,"WEATHER CORRECTED MD 10% POE","MVA","Non-coincident"]
[null,null,null,null,"Coincident"]
[null,null,"WEATHER CORRECTED MD 50% POE","MW","Non-coincident"]
[null,null,null,null,"Coincident"]
[null,null,"WEATHER CORRECTED MD 50% POE","MVA","Non-coincident"]
[null,null,null,null,"Coincident"]
[null,"NSP to enter name","CONNECTION POINT RATING","MVA","Non-coincident"]
[null,null,null,null,"Coincident"]
[null,null,"WINTER/SUMMER PEAKING",null,"Non-coincident"]
[null,null,null,null,"Coincident"]
[null,null,"ADJUSTMENTS - EMBEDDED GENERATION","MW","Non-coincident"]
[null,null,null,null,"Coincident"]
[null,null,"WEATHER CORRECTED MD 10% POE","MW","Non-coincident"]
[null,null,null,null,"Coincident"]
[null,null,"WEATHER CORRECTED MD 10% POE","MVA","Non-coincident"]
[null,null,null,null,"Coincident"]
[null,null,"WEATHER CORRECTED MD 50% POE","MW","Non-coincident"]
[null,null,null,null,"Coincident"]
[null,null,"WEATHER CORRECTED MD 50% POE","MVA","Non-coincident"]
[null,null,null,null,"Coincident"]
[null,"NSP to enter name","CONNECTION POINT RATING","MVA","Non-coincident"]
[null,null,null,null,"Coincident"]
[null,null,"WINTER/SUMMER PEAKING",null,"Non-coincident"]
[null,null,null,null,"Coincident"]
[null,null,"ADJUSTMENTS - EMBEDDED GENERATION","MW","Non-coincident"]
[null,null,null,null,"Coincident"]
[null,null,"WEATHER CORRECTED MD 10% POE","MW","Non-coincident"]
[null,null,null,null,"Coincident"]
[null,null,"WEATHER CORRECTED MD 10% POE","MVA","Non-coincident"]
[null,null,null,null,"Coincident"]
[null,null,"WEATHER CORRECTED MD 50% POE","MW","Non-coincident"]
[null,null,null,null,"Coincident"]
[null,null,"WEATHER CORRECTED MD 50% POE","MVA","Non-coincident"]
[null,null,null,null,"Coincident"]
[null,"NSP to enter name","CONNECTION POINT RATING","MVA","Non-coincident"]
[null,null,null,null,"Coincident"]
[null,null,"WINTER/SUMMER PEAKING",null,"Non-coincident"]
[null,null,null,null,"Coincident"]
[null,null,"ADJUSTMENTS - EMBEDDED GENERATION","MW","Non-coincident"]
[null,null,null,null,"Coincident"]
[null,null,"WEATHER CORRECTED MD 10% POE","MW","Non-coincident"]
[null,null,null,null,"Coincident"]
[null,null,"WEATHER CORRECTED MD 10% POE","MVA","Non-coincident"]
[null,null,null,null,"Coincident"]
[null,null,"WEATHER CORRECTED MD 50% POE","MW","Non-coincident"]
[null,null,null,null,"Coincident"]
[null,null,"WEATHER CORRECTED MD 50% POE","MVA","Non-coincident"]
[null,null,null,null,"Coincident"]
[null,"NSP to enter name","CONNECTION POINT RATING","MVA","Non-coincident"]
[null,null,null,null,"Coincident"]
[null,null,"WINTER/SUMMER PEAKING",null,"Non-coincident"]
[null,null,null,null,"Coincident"]
[null,null,"ADJUSTMENTS - EMBEDDED GENERATION","MW","Non-coincident"]
[null,null,null,null,"Coincident"]
[null,null,"WEATHER CORRECTED MD 10% POE","MW","Non-coincident"]
[null,null,null,null,"Coincident"]
[null,null,"WEATHER CORRECTED MD 10% POE","MVA","Non-coincident"]
[null,null,null,null,"Coincident"]
[null,null,"WEATHER CORRECTED MD 50% POE","MW","Non-coincident"]
[null,null,null,null,"Coincident"]
[null,null,"WEATHER CORRECTED MD 50% POE","MVA","Non-coincident"]
[null,null,null,null,"Coincident"]
[null,"NSP to enter name","CONNECTION POINT RATING","MVA","Non-coincident"]
[null,null,null,null,"Coincident"]
[null,null,"WINTER/SUMMER PEAKING",null,"Non-coincident"]
[null,null,null,null,"Coincident"]
[null,null,"ADJUSTMENTS - EMBEDDED GENERATION","MW","Non-coincident"]
[null,null,null,null,"Coincident"]
[null,null,"WEATHER CORRECTED MD 10% POE","MW","Non-coincident"]
[null,null,null,null,"Coincident"]
[null,null,"WEATHER CORRECTED MD 10% POE","MVA","Non-coincident"]
[null,null,null,null,"Coincident"]
[null,null,"WEATHER CORRECTED MD 50% POE","MW","Non-coincident"]
[null,null,null,null,"Coincident"]
[null,null,"WEATHER CORRECTED MD 50% POE","MVA","Non-coincident"]
[null,null,null,null,"Coincident"]
[null,"NSP to enter name","CONNECTION POINT RATING","MVA","Non-coincident"]
[null,null,null,null,"Coincident"]
[null,null,"WINTER/SUMMER PEAKING",null,"Non-coincident"]
[null,null,null,null,"Coincident"]
[null,null,"ADJUSTMENTS - EMBEDDED GENERATION","MW","Non-coincident"]
[null,null,null,null,"Coincident"]
[null,null,"WEATHER CORRECTED MD 10% POE","MW","Non-coincident"]
[null,null,null,null,"Coincident"]
[null,null,"WEATHER CORRECTED MD 10% POE","MVA","Non-coincident"]
[null,null,null,null,"Coincident"]
[null,null,"WEATHER CORRECTED MD 50% POE","MW","Non-coincident"]
[null,null,null,null,"Coincident"]
[null,null,"WEATHER CORRECTED MD 50% POE","MVA","Non-coincident"]
[null,null,null,null,"Coincident"]
[null,"NSP to enter name","CONNECTION POINT RATING","MVA","Non-coincident"]
[null,null,null,null,"Coincident"]
[null,null,"WINTER/SUMMER PEAKING",null,"Non-coincident"]
[null,null,null,null,"Coincident"]
[null,null,"ADJUSTMENTS - EMBEDDED GENERATION","MW","Non-coincident"]
[null,null,null,null,"Coincident"]
[null,null,"WEATHER CORRECTED MD 10% POE","MW","Non-coincident"]
[null,null,null,null,"Coincident"]
[null,null,"WEATHER CORRECTED MD 10% POE","MVA","Non-coincident"]
[null,null,null,null,"Coincident"]
[null,null,"WEATHER CORRECTED MD 50% POE","MW","Non-coincident"]
[null,null,null,null,"Coincident"]
[null,null,"WEATHER CORRECTED MD 50% POE","MVA","Non-coincident"]
[null,null,null,null,"Coincident"]
[null,"NSP to enter name","CONNECTION POINT RATING","MVA","Non-coincident"]
[null,null,null,null,"Coincident"]
[null,null,"WINTER/SUMMER PEAKING",null,"Non-coincident"]
[null,null,null,null,"Coincident"]
[null,null,"ADJUSTMENTS - EMBEDDED GENERATION","MW","Non-coincident"]
[null,null,null,null,"Coincident"]
[null,null,"WEATHER CORRECTED MD 10% POE","MW","Non-coincident"]
[null,null,null,null,"Coincident"]
[null,null,"WEATHER CORRECTED MD 10% POE","MVA","Non-coincident"]
[null,null,null,null,"Coincident"]
[null,null,"WEATHER CORRECTED MD 50% POE","MW","Non-coincident"]
[null,null,null,null,"Coincident"]
[null,null,"WEATHER CORRECTED MD 50% POE","MVA","Non-coincident"]
[null,null,null,null,"Coincident"]
[null,"NSP to enter name","CONNECTION POINT RATING","MVA","Non-coincident"]
[null,null,null,null,"Coincident"]
[null,null,"WINTER/SUMMER PEAKING",null,"Non-coincident"]
[null,null,null,null,"Coincident"]
[null,null,"ADJUSTMENTS - EMBEDDED GENERATION","MW","Non-coincident"]
[null,null,null,null,"Coincident"]
[null,null,"WEATHER CORRECTED MD 10% POE","MW","Non-coincident"]
[null,null,null,null,"Coincident"]
[null,null,"WEATHER CORRECTED MD 10% POE","MVA","Non-coincident"]
[null,null,null,null,"Coincident"]
[null,null,"WEATHER CORRECTED MD 50% POE","MW","Non-coincident"]
[null,null,null,null,"Coincident"]
[null,null,"WEATHER CORRECTED MD 50% POE","MVA","Non-coincident"]
[null,null,null,null,"Coincident"]
[null,"NSP to enter name","CONNECTION POINT RATING","MVA","Non-coincident"]
[null,null,null,null,"Coincident"]
[null,null,"WINTER/SUMMER PEAKING",null,"Non-coincident"]
[null,null,null,null,"Coincident"]
[null,null,"ADJUSTMENTS - EMBEDDED GENERATION","MW","Non-coincident"]
[null,null,null,null,"Coincident"]
[null,null,"WEATHER CORRECTED MD 10% POE","MW","Non-coincident"]
[null,null,null,null,"Coincident"]
[null,null,"WEATHER CORRECTED MD 10% POE","MVA","Non-coincident"]
[null,null,null,null,"Coincident"]
[null,null,"WEATHER CORRECTED MD 50% POE","MW","Non-coincident"]
[null,null,null,null,"Coincident"]
[null,null,"WEATHER CORRECTED MD 50% POE","MVA","Non-coincident"]
[null,null,null,null,"Coincident"]
[null,"NSP to enter name","CONNECTION POINT RATING","MVA","Non-coincident"]
[null,null,null,null,"Coincident"]
[null,null,"WINTER/SUMMER PEAKING",null,"Non-coincident"]
[null,null,null,null,"Coincident"]
[null,null,"ADJUSTMENTS - EMBEDDED GENERATION","MW","Non-coincident"]
[null,null,null,null,"Coincident"]
[null,null,"WEATHER CORRECTED MD 10% POE","MW","Non-coincident"]
[null,null,null,null,"Coincident"]
[null,null,"WEATHER CORRECTED MD 10% POE","MVA","Non-coincident"]
[null,null,null,null,"Coincident"]
[null,null,"WEATHER CORRECTED MD 50% POE","MW","Non-coincident"]
[null,null,null,null,"Coincident"]
[null,null,"WEATHER CORRECTED MD 50% POE","MVA","Non-coincident"]
[null,null,null,null,"Coincident"]
[null,"NSP to enter name","CONNECTION POINT RATING","MVA","Non-coincident"]
[null,null,null,null,"Coincident"]
[null,null,"WINTER/SUMMER PEAKING",null,"Non-coincident"]
[null,null,null,null,"Coincident"]
[null,null,"ADJUSTMENTS - EMBEDDED GENERATION","MW","Non-coincident"]
[null,null,null,null,"Coincident"]
[null,null,"WEATHER CORRECTED MD 10% POE","MW","Non-coincident"]
[null,null,null,null,"Coincident"]
[null,null,"WEATHER CORRECTED MD 10% POE","MVA","Non-coincident"]
[null,null,null,null,"Coincident"]
[null,null,"WEATHER CORRECTED MD 50% POE","MW","Non-coincident"]
[null,null,null,null,"Coincident"]
[null,null,"WEATHER CORRECTED MD 50% POE","MVA","Non-coincident"]
[null,null,null,null,"Coincident"]
[null,"NSP to enter name","CONNECTION POINT RATING","MVA","Non-coincident"]
[null,null,null,null,"Coincident"]
[null,null,"WINTER/SUMMER PEAKING",null,"Non-coincident"]
[null,null,null,null,"Coincident"]
[null,null,"ADJUSTMENTS - EMBEDDED GENERATION","MW","Non-coincident"]
[null,null,null,null,"Coincident"]
[null,null,"WEATHER CORRECTED MD 10% POE","MW","Non-coincident"]
[null,null,null,null,"Coincident"]
[null,null,"WEATHER CORRECTED MD 10% POE","MVA","Non-coincident"]
[null,null,null,null,"Coincident"]
[null,null,"WEATHER CORRECTED MD 50% POE","MW","Non-coincident"]
[null,null,null,null,"Coincident"]
[null,null,"WEATHER CORRECTED MD 50% POE","MVA","Non-coincident"]
[null,null,null,null,"Coincident"]
[null,"NSP to enter name","CONNECTION POINT RATING","MVA","Non-coincident"]
[null,null,null,null,"Coincident"]
[null,null,"WINTER/SUMMER PEAKING",null,"Non-coincident"]
[null,null,null,null,"Coincident"]
[null,null,"ADJUSTMENTS - EMBEDDED GENERATION","MW","Non-coincident"]
[null,null,null,null,"Coincident"]
[null,null,"WEATHER CORRECTED MD 10% POE","MW","Non-coincident"]
[null,null,null,null,"Coincident"]
[null,null,"WEATHER CORRECTED MD 10% POE","MVA","Non-coincident"]
[null,null,null,null,"Coincident"]
[null,null,"WEATHER CORRECTED MD 50% POE","MW","Non-coincident"]
[null,null,null,null,"Coincident"]
[null,null,"WEATHER CORRECTED MD 50% POE","MVA","Non-coincident"]
[null,null,null,null,"Coincident"]
[null,"NSP to enter name","CONNECTION POINT RATING","MVA","Non-coincident"]
[null,null,null,null,"Coincident"]
[null,null,"WINTER/SUMMER PEAKING",null,"Non-coincident"]
[null,null,null,null,"Coincident"]
[null,null,"ADJUSTMENTS - EMBEDDED GENERATION","MW","Non-coincident"]
[null,null,null,null,"Coincident"]
[null,null,"WEATHER CORRECTED MD 10% POE","MW","Non-coincident"]
[null,null,null,null,"Coincident"]
[null,null,"WEATHER CORRECTED MD 10% POE","MVA","Non-coincident"]
[null,null,null,null,"Coincident"]
[null,null,"WEATHER CORRECTED MD 50% POE","MW","Non-coincident"]
[null,null,null,null,"Coincident"]
[null,null,"WEATHER CORRECTED MD 50% POE","MVA","Non-coincident"]
[null,null,null,null,"Coincident"]
[null,"NSP to enter name","CONNECTION POINT RATING","MVA","Non-coincident"]
[null,null,null,null,"Coincident"]
[null,null,"WINTER/SUMMER PEAKING",null,"Non-coincident"]
[null,null,null,null,"Coincident"]
[null,null,"ADJUSTMENTS - EMBEDDED GENERATION","MW","Non-coincident"]
[null,null,null,null,"Coincident"]
[null,null,"WEATHER CORRECTED MD 10% POE","MW","Non-coincident"]
[null,null,null,null,"Coincident"]
[null,null,"WEATHER CORRECTED MD 10% POE","MVA","Non-coincident"]
[null,null,null,null,"Coincident"]
[null,null,"WEATHER CORRECTED MD 50% POE","MW","Non-coincident"]
[null,null,null,null,"Coincident"]
[null,null,"WEATHER CORRECTED MD 50% POE","MVA","Non-coincident"]
[null,null,null,null,"Coincident"]
[null,"NSP to enter name","CONNECTION POINT RATING","MVA","Non-coincident"]
[null,null,null,null,"Coincident"]
[null,null,"WINTER/SUMMER PEAKING",null,"Non-coincident"]
[null,null,null,null,"Coincident"]
[null,null,"ADJUSTMENTS - EMBEDDED GENERATION","MW","Non-coincident"]
[null,null,null,null,"Coincident"]
[null,null,"WEATHER CORRECTED MD 10% POE","MW","Non-coincident"]
[null,null,null,null,"Coincident"]
[null,null,"WEATHER CORRECTED MD 10% POE","MVA","Non-coincident"]
[null,null,null,null,"Coincident"]
[null,null,"WEATHER CORRECTED MD 50% POE","MW","Non-coincident"]
[null,null,null,null,"Coincident"]
[null,null,"WEATHER CORRECTED MD 50% POE","MVA","Non-coincident"]
[null,null,null,null,"Coincident"]
[null,"NSP to enter name","CONNECTION POINT RATING","MVA","Non-coincident"]
[null,null,null,null,"Coincident"]
[null,null,"WINTER/SUMMER PEAKING",null,"Non-coincident"]
[null,null,null,null,"Coincident"]
[null,null,"ADJUSTMENTS - EMBEDDED GENERATION","MW","Non-coincident"]
[null,null,null,null,"Coincident"]
[null,null,"WEATHER CORRECTED MD 10% POE","MW","Non-coincident"]
[null,null,null,null,"Coincident"]
[null,null,"WEATHER CORRECTED MD 10% POE","MVA","Non-coincident"]
[null,null,null,null,"Coincident"]
[null,null,"WEATHER CORRECTED MD 50% POE","MW","Non-coincident"]
[null,null,null,null,"Coincident"]
[null,null,"WEATHER CORRECTED MD 50% POE","MVA","Non-coincident"]
[null,null,null,null,"Coincident"]
[null,"NSP to enter name","CONNECTION POINT RATING","MVA","Non-coincident"]
[null,null,null,null,"Coincident"]
[null,null,"WINTER/SUMMER PEAKING",null,"Non-coincident"]
[null,null,null,null,"Coincident"]
[null,null,"ADJUSTMENTS - EMBEDDED GENERATION","MW","Non-coincident"]
[null,null,null,null,"Coincident"]
[null,null,"WEATHER CORRECTED MD 10% POE","MW","Non-coincident"]
[null,null,null,null,"Coincident"]
[null,null,"WEATHER CORRECTED MD 10% POE","MVA","Non-coincident"]
[null,null,null,null,"Coincident"]
[null,null,"WEATHER CORRECTED MD 50% POE","MW","Non-coincident"]
[null,null,null,null,"Coincident"]
[null,null,"WEATHER CORRECTED MD 50% POE","MVA","Non-coincident"]
[null,null,null,null,"Coincident"]
[null,"NSP to enter name","CONNECTION POINT RATING","MVA","Non-coincident"]
[null,null,null,null,"Coincident"]
[null,null,"WINTER/SUMMER PEAKING",null,"Non-coincident"]
[null,null,null,null,"Coincident"]
[null,null,"ADJUSTMENTS - EMBEDDED GENERATION","MW","Non-coincident"]
[null,null,null,null,"Coincident"]
[null,null,"WEATHER CORRECTED MD 10% POE","MW","Non-coincident"]
[null,null,null,null,"Coincident"]
[null,null,"WEATHER CORRECTED MD 10% POE","MVA","Non-coincident"]
[null,null,null,null,"Coincident"]
[null,null,"WEATHER CORRECTED MD 50% POE","MW","Non-coincident"]
[null,null,null,null,"Coincident"]
[null,null,"WEATHER CORRECTED MD 50% POE","MVA","Non-coincident"]
[null,null,null,null,"Coincident"]
[null,"NSP to enter name","CONNECTION POINT RATING","MVA","Non-coincident"]
[null,null,null,null,"Coincident"]
[null,null,"WINTER/SUMMER PEAKING",null,"Non-coincident"]
[null,null,null,null,"Coincident"]
[null,null,"ADJUSTMENTS - EMBEDDED GENERATION","MW","Non-coincident"]
[null,null,null,null,"Coincident"]
[null,null,"WEATHER CORRECTED MD 10% POE","MW","Non-coincident"]
[null,null,null,null,"Coincident"]
[null,null,"WEATHER CORRECTED MD 10% POE","MVA","Non-coincident"]
[null,null,null,null,"Coincident"]
[null,null,"WEATHER CORRECTED MD 50% POE","MW","Non-coincident"]
[null,null,null,null,"Coincident"]
[null,null,"WEATHER CORRECTED MD 50% POE","MVA","Non-coincident"]
[null,null,null,null,"Coincident"]
[null,"NSP to enter name","CONNECTION POINT RATING","MVA","Non-coincident"]
[null,null,null,null,"Coincident"]
[null,null,"WINTER/SUMMER PEAKING",null,"Non-coincident"]
[null,null,null,null,"Coincident"]
[null,null,"ADJUSTMENTS - EMBEDDED GENERATION","MW","Non-coincident"]
[null,null,null,null,"Coincident"]
[null,null,"WEATHER CORRECTED MD 10% POE","MW","Non-coincident"]
[null,null,null,null,"Coincident"]
[null,null,"WEATHER CORRECTED MD 10% POE","MVA","Non-coincident"]
[null,null,null,null,"Coincident"]
[null,null,"WEATHER CORRECTED MD 50% POE","MW","Non-coincident"]
[null,null,null,null,"Coincident"]
[null,null,"WEATHER CORRECTED MD 50% POE","MVA","Non-coincident"]
[null,null,null,null,"Coincident"]
[null,"NSP to enter name","CONNECTION POINT RATING","MVA","Non-coincident"]
[null,null,null,null,"Coincident"]
[null,null,"WINTER/SUMMER PEAKING",null,"Non-coincident"]
[null,null,null,null,"Coincident"]
[null,null,"ADJUSTMENTS - EMBEDDED GENERATION","MW","Non-coincident"]
[null,null,null,null,"Coincident"]
[null,null,"WEATHER CORRECTED MD 10% POE","MW","Non-coincident"]
[null,null,null,null,"Coincident"]
[null,null,"WEATHER CORRECTED MD 10% POE","MVA","Non-coincident"]
[null,null,null,null,"Coincident"]
[null,null,"WEATHER CORRECTED MD 50% POE","MW","Non-coincident"]
[null,null,null,null,"Coincident"]
[null,null,"WEATHER CORRECTED MD 50% POE","MVA","Non-coincident"]
[null,null,null,null,"Coincident"]
[null,"NSP to enter name","CONNECTION POINT RATING","MVA","Non-coincident"]
[null,null,null,null,"Coincident"]
[null,null,"WINTER/SUMMER PEAKING",null,"Non-coincident"]
[null,null,null,null,"Coincident"]
[null,null,"ADJUSTMENTS - EMBEDDED GENERATION","MW","Non-coincident"]
[null,null,null,null,"Coincident"]
[null,null,"WEATHER CORRECTED MD 10% POE","MW","Non-coincident"]
[null,null,null,null,"Coincident"]
[null,null,"WEATHER CORRECTED MD 10% POE","MVA","Non-coincident"]
[null,null,null,null,"Coincident"]
[null,null,"WEATHER CORRECTED MD 50% POE","MW","Non-coincident"]
[null,null,null,null,"Coincident"]
[null,null,"WEATHER CORRECTED MD 50% POE","MVA","Non-coincident"]
[null,null,null,null,"Coincident"]
[null,"NSP to enter name","CONNECTION POINT RATING","MVA","Non-coincident"]
[null,null,null,null,"Coincident"]
[null,null,"WINTER/SUMMER PEAKING",null,"Non-coincident"]
[null,null,null,null,"Coincident"]
[null,null,"ADJUSTMENTS - EMBEDDED GENERATION","MW","Non-coincident"]
[null,null,null,null,"Coincident"]
[null,null,"WEATHER CORRECTED MD 10% POE","MW","Non-coincident"]
[null,null,null,null,"Coincident"]
[null,null,"WEATHER CORRECTED MD 10% POE","MVA","Non-coincident"]
[null,null,null,null,"Coincident"]
[null,null,"WEATHER CORRECTED MD 50% POE","MW","Non-coincident"]
[null,null,null,null,"Coincident"]
[null,null,"WEATHER CORRECTED MD 50% POE","MVA","Non-coincident"]
[null,null,null,null,"Coincident"]
[null,"NSP to enter name","CONNECTION POINT RATING","MVA","Non-coincident"]
[null,null,null,null,"Coincident"]
[null,null,"WINTER/SUMMER PEAKING",null,"Non-coincident"]
[null,null,null,null,"Coincident"]
[null,null,"ADJUSTMENTS - EMBEDDED GENERATION","MW","Non-coincident"]
[null,null,null,null,"Coincident"]
[null,null,"WEATHER CORRECTED MD 10% POE","MW","Non-coincident"]
[null,null,null,null,"Coincident"]
[null,null,"WEATHER CORRECTED MD 10% POE","MVA","Non-coincident"]
[null,null,null,null,"Coincident"]
[null,null,"WEATHER CORRECTED MD 50% POE","MW","Non-coincident"]
[null,null,null,null,"Coincident"]
[null,null,"WEATHER CORRECTED MD 50% POE","MVA","Non-coincident"]
[null,null,null,null,"Coincident"]
[null,"NSP to enter name","CONNECTION POINT RATING","MVA","Non-coincident"]
[null,null,null,null,"Coincident"]
[null,null,"WINTER/SUMMER PEAKING",null,"Non-coincident"]
[null,null,null,null,"Coincident"]
[null,null,"ADJUSTMENTS - EMBEDDED GENERATION","MW","Non-coincident"]
[null,null,null,null,"Coincident"]
[null,null,"WEATHER CORRECTED MD 10% POE","MW","Non-coincident"]
[null,null,null,null,"Coincident"]
[null,null,"WEATHER CORRECTED MD 10% POE","MVA","Non-coincident"]
[null,null,null,null,"Coincident"]
[null,null,"WEATHER CORRECTED MD 50% POE","MW","Non-coincident"]
[null,null,null,null,"Coincident"]
[null,null,"WEATHER CORRECTED MD 50% POE","MVA","Non-coincident"]
[null,null,null,null,"Coincident"]
[null,"NSP to enter name","CONNECTION POINT RATING","MVA","Non-coincident"]
[null,null,null,null,"Coincident"]
[null,null,"WINTER/SUMMER PEAKING",null,"Non-coincident"]
[null,null,null,null,"Coincident"]
[null,null,"ADJUSTMENTS - EMBEDDED GENERATION","MW","Non-coincident"]
[null,null,null,null,"Coincident"]
[null,null,"WEATHER CORRECTED MD 10% POE","MW","Non-coincident"]
[null,null,null,null,"Coincident"]
[null,null,"WEATHER CORRECTED MD 10% POE","MVA","Non-coincident"]
[null,null,null,null,"Coincident"]
[null,null,"WEATHER CORRECTED MD 50% POE","MW","Non-coincident"]
[null,null,null,null,"Coincident"]
[null,null,"WEATHER CORRECTED MD 50% POE","MVA","Non-coincident"]
[null,null,null,null,"Coincident"]
[null,"NSP to enter name","CONNECTION POINT RATING","MVA","Non-coincident"]
[null,null,null,null,"Coincident"]
[null,null,"WINTER/SUMMER PEAKING",null,"Non-coincident"]
[null,null,null,null,"Coincident"]
[null,null,"ADJUSTMENTS - EMBEDDED GENERATION","MW","Non-coincident"]
[null,null,null,null,"Coincident"]
[null,null,"WEATHER CORRECTED MD 10% POE","MW","Non-coincident"]
[null,null,null,null,"Coincident"]
[null,null,"WEATHER CORRECTED MD 10% POE","MVA","Non-coincident"]
[null,null,null,null,"Coincident"]
[null,null,"WEATHER CORRECTED MD 50% POE","MW","Non-coincident"]
[null,null,null,null,"Coincident"]
[null,null,"WEATHER CORRECTED MD 50% POE","MVA","Non-coincident"]
[null,null,null,null,"Coincident"]
[null,"NSP to enter name","CONNECTION POINT RATING","MVA","Non-coincident"]
[null,null,null,null,"Coincident"]
[null,null,"WINTER/SUMMER PEAKING",null,"Non-coincident"]
[null,null,null,null,"Coincident"]
[null,null,"ADJUSTMENTS - EMBEDDED GENERATION","MW","Non-coincident"]
[null,null,null,null,"Coincident"]
[null,null,"WEATHER CORRECTED MD 10% POE","MW","Non-coincident"]
[null,null,null,null,"Coincident"]
[null,null,"WEATHER CORRECTED MD 10% POE","MVA","Non-coincident"]
[null,null,null,null,"Coincident"]
[null,null,"WEATHER CORRECTED MD 50% POE","MW","Non-coincident"]
[null,null,null,null,"Coincident"]
[null,null,"WEATHER CORRECTED MD 50% POE","MVA","Non-coincident"]
[null,null,null,null,"Coincident"]
[null,"NSP to enter name","CONNECTION POINT RATING","MVA","Non-coincident"]
[null,null,null,null,"Coincident"]
[null,null,"WINTER/SUMMER PEAKING",null,"Non-coincident"]
[null,null,null,null,"Coincident"]
[null,null,"ADJUSTMENTS - EMBEDDED GENERATION","MW","Non-coincident"]
[null,null,null,null,"Coincident"]
[null,null,"WEATHER CORRECTED MD 10% POE","MW","Non-coincident"]
[null,null,null,null,"Coincident"]
[null,null,"WEATHER CORRECTED MD 10% POE","MVA","Non-coincident"]
[null,null,null,null,"Coincident"]
[null,null,"WEATHER CORRECTED MD 50% POE","MW","Non-coincident"]
[null,null,null,null,"Coincident"]
[null,null,"WEATHER CORRECTED MD 50% POE","MVA","Non-coincident"]
[null,null,null,null,"Coincident"]
[null,"NSP to enter name","CONNECTION POINT RATING","MVA","Non-coincident"]
[null,null,null,null,"Coincident"]
[null,null,"WINTER/SUMMER PEAKING",null,"Non-coincident"]
[null,null,null,null,"Coincident"]
[null,null,"ADJUSTMENTS - EMBEDDED GENERATION","MW","Non-coincident"]
[null,null,null,null,"Coincident"]
[null,null,"WEATHER CORRECTED MD 10% POE","MW","Non-coincident"]
[null,null,null,null,"Coincident"]
[null,null,"WEATHER CORRECTED MD 10% POE","MVA","Non-coincident"]
[null,null,null,null,"Coincident"]
[null,null,"WEATHER CORRECTED MD 50% POE","MW","Non-coincident"]
[null,null,null,null,"Coincident"]
[null,null,"WEATHER CORRECTED MD 50% POE","MVA","Non-coincident"]
[null,null,null,null,"Coincident"]
[null,"NSP to enter name","CONNECTION POINT RATING","MVA","Non-coincident"]
[null,null,null,null,"Coincident"]
[null,null,"WINTER/SUMMER PEAKING",null,"Non-coincident"]
[null,null,null,null,"Coincident"]
[null,null,"ADJUSTMENTS - EMBEDDED GENERATION","MW","Non-coincident"]
[null,null,null,null,"Coincident"]
[null,null,"WEATHER CORRECTED MD 10% POE","MW","Non-coincident"]
[null,null,null,null,"Coincident"]
[null,null,"WEATHER CORRECTED MD 10% POE","MVA","Non-coincident"]
[null,null,null,null,"Coincident"]
[null,null,"WEATHER CORRECTED MD 50% POE","MW","Non-coincident"]
[null,null,null,null,"Coincident"]
[null,null,"WEATHER CORRECTED MD 50% POE","MVA","Non-coincident"]
[null,null,null,null,"Coincident"]
[null,"NSP to enter name","CONNECTION POINT RATING","MVA","Non-coincident"]
[null,null,null,null,"Coincident"]
[null,null,"WINTER/SUMMER PEAKING",null,"Non-coincident"]
[null,null,null,null,"Coincident"]
[null,null,"ADJUSTMENTS - EMBEDDED GENERATION","MW","Non-coincident"]
[null,null,null,null,"Coincident"]
[null,null,"WEATHER CORRECTED MD 10% POE","MW","Non-coincident"]
[null,null,null,null,"Coincident"]
[null,null,"WEATHER CORRECTED MD 10% POE","MVA","Non-coincident"]
[null,null,null,null,"Coincident"]
[null,null,"WEATHER CORRECTED MD 50% POE","MW","Non-coincident"]
[null,null,null,null,"Coincident"]
[null,null,"WEATHER CORRECTED MD 50% POE","MVA","Non-coincident"]
[null,null,null,null,"Coincident"]
[null,"NSP to enter name","CONNECTION POINT RATING","MVA","Non-coincident"]
[null,null,null,null,"Coincident"]
[null,null,"WINTER/SUMMER PEAKING",null,"Non-coincident"]
[null,null,null,null,"Coincident"]
[null,null,"ADJUSTMENTS - EMBEDDED GENERATION","MW","Non-coincident"]
[null,null,null,null,"Coincident"]
[null,null,"WEATHER CORRECTED MD 10% POE","MW","Non-coincident"]
[null,null,null,null,"Coincident"]
[null,null,"WEATHER CORRECTED MD 10% POE","MVA","Non-coincident"]
[null,null,null,null,"Coincident"]
[null,null,"WEATHER CORRECTED MD 50% POE","MW","Non-coincident"]
[null,null,null,null,"Coincident"]
[null,null,"WEATHER CORRECTED MD 50% POE","MVA","Non-coincident"]
[null,null,null,null,"Coincident"]
[null,"NSP to enter name","CONNECTION POINT RATING","MVA","Non-coincident"]
[null,null,null,null,"Coincident"]
[null,null,"WINTER/SUMMER PEAKING",null,"Non-coincident"]
[null,null,null,null,"Coincident"]
[null,null,"ADJUSTMENTS - EMBEDDED GENERATION","MW","Non-coincident"]
[null,null,null,null,"Coincident"]
[null,null,"WEATHER CORRECTED MD 10% POE","MW","Non-coincident"]
[null,null,null,null,"Coincident"]
[null,null,"WEATHER CORRECTED MD 10% POE","MVA","Non-coincident"]
[null,null,null,null,"Coincident"]
[null,null,"WEATHER CORRECTED MD 50% POE","MW","Non-coincident"]
[null,null,null,null,"Coincident"]
[null,null,"WEATHER CORRECTED MD 50% POE","MVA","Non-coincident"]
[null,null,null,null,"Coincident"]
[null,"NSP to enter name","CONNECTION POINT RATING","MVA","Non-coincident"]
[null,null,null,null,"Coincident"]
[null,null,"WINTER/SUMMER PEAKING",null,"Non-coincident"]
[null,null,null,null,"Coincident"]
[null,null,"ADJUSTMENTS - EMBEDDED GENERATION","MW","Non-coincident"]
[null,null,null,null,"Coincident"]
[null,null,"WEATHER CORRECTED MD 10% POE","MW","Non-coincident"]
[null,null,null,null,"Coincident"]
[null,null,"WEATHER CORRECTED MD 10% POE","MVA","Non-coincident"]
[null,null,null,null,"Coincident"]
[null,null,"WEATHER CORRECTED MD 50% POE","MW","Non-coincident"]
[null,null,null,null,"Coincident"]
[null,null,"WEATHER CORRECTED MD 50% POE","MVA","Non-coincident"]
[null,null,null,null,"Coincident"]
[null,"NSP to enter name","CONNECTION POINT RATING","MVA","Non-coincident"]
[null,null,null,null,"Coincident"]
[null,null,"WINTER/SUMMER PEAKING",null,"Non-coincident"]
[null,null,null,null,"Coincident"]
[null,null,"ADJUSTMENTS - EMBEDDED GENERATION","MW","Non-coincident"]
[null,null,null,null,"Coincident"]
[null,null,"WEATHER CORRECTED MD 10% POE","MW","Non-coincident"]
[null,null,null,null,"Coincident"]
[null,null,"WEATHER CORRECTED MD 10% POE","MVA","Non-coincident"]
[null,null,null,null,"Coincident"]
[null,null,"WEATHER CORRECTED MD 50% POE","MW","Non-coincident"]
[null,null,null,null,"Coincident"]
[null,null,"WEATHER CORRECTED MD 50% POE","MVA","Non-coincident"]
[null,null,null,null,"Coincident"]
[null,"NSP to enter name","CONNECTION POINT RATING","MVA","Non-coincident"]
[null,null,null,null,"Coincident"]
[null,null,"WINTER/SUMMER PEAKING",null,"Non-coincident"]
[null,null,null,null,"Coincident"]
[null,null,"ADJUSTMENTS - EMBEDDED GENERATION","MW","Non-coincident"]
[null,null,null,null,"Coincident"]
[null,null,"WEATHER CORRECTED MD 10% POE","MW","Non-coincident"]
[null,null,null,null,"Coincident"]
[null,null,"WEATHER CORRECTED MD 10% POE","MVA","Non-coincident"]
[null,null,null,null,"Coincident"]
[null,null,"WEATHER CORRECTED MD 50% POE","MW","Non-coincident"]
[null,null,null,null,"Coincident"]
[null,null,"WEATHER CORRECTED MD 50% POE","MVA","Non-coincident"]
[null,null,null,null,"Coincident"]
[null,"NSP to enter name","CONNECTION POINT RATING","MVA","Non-coincident"]
[null,null,null,null,"Coincident"]
[null,null,"WINTER/SUMMER PEAKING",null,"Non-coincident"]
[null,null,null,null,"Coincident"]
[null,null,"ADJUSTMENTS - EMBEDDED GENERATION","MW","Non-coincident"]
[null,null,null,null,"Coincident"]
[null,null,"WEATHER CORRECTED MD 10% POE","MW","Non-coincident"]
[null,null,null,null,"Coincident"]
[null,null,"WEATHER CORRECTED MD 10% POE","MVA","Non-coincident"]
[null,null,null,null,"Coincident"]
[null,null,"WEATHER CORRECTED MD 50% POE","MW","Non-coincident"]
[null,null,null,null,"Coincident"]
[null,null,"WEATHER CORRECTED MD 50% POE","MVA","Non-coincident"]
[null,null,null,null,"Coincident"]
[null,"NSP to enter name","CONNECTION POINT RATING","MVA","Non-coincident"]
[null,null,null,null,"Coincident"]
[null,null,"WINTER/SUMMER PEAKING",null,"Non-coincident"]
[null,null,null,null,"Coincident"]
[null,null,"ADJUSTMENTS - EMBEDDED GENERATION","MW","Non-coincident"]
[null,null,null,null,"Coincident"]
[null,null,"WEATHER CORRECTED MD 10% POE","MW","Non-coincident"]
[null,null,null,null,"Coincident"]
[null,null,"WEATHER CORRECTED MD 10% POE","MVA","Non-coincident"]
[null,null,null,null,"Coincident"]
[null,null,"WEATHER CORRECTED MD 50% POE","MW","Non-coincident"]
[null,null,null,null,"Coincident"]
[null,null,"WEATHER CORRECTED MD 50% POE","MVA","Non-coincident"]
[null,null,null,null,"Coincident"]
[null,"NSP to enter name","CONNECTION POINT RATING","MVA","Non-coincident"]
[null,null,null,null,"Coincident"]
[null,null,"WINTER/SUMMER PEAKING",null,"Non-coincident"]
[null,null,null,null,"Coincident"]
[null,null,"ADJUSTMENTS - EMBEDDED GENERATION","MW","Non-coincident"]
[null,null,null,null,"Coincident"]
[null,null,"WEATHER CORRECTED MD 10% POE","MW","Non-coincident"]
[null,null,null,null,"Coincident"]
[null,null,"WEATHER CORRECTED MD 10% POE","MVA","Non-coincident"]
[null,null,null,null,"Coincident"]
[null,null,"WEATHER CORRECTED MD 50% POE","MW","Non-coincident"]
[null,null,null,null,"Coincident"]
[null,null,"WEATHER CORRECTED MD 50% POE","MVA","Non-coincident"]
[null,null,null,null,"Coincident"]
[null,"NSP to enter name","CONNECTION POINT RATING","MVA","Non-coincident"]
[null,null,null,null,"Coincident"]
[null,null,"WINTER/SUMMER PEAKING",null,"Non-coincident"]
[null,null,null,null,"Coincident"]
[null,null,"ADJUSTMENTS - EMBEDDED GENERATION","MW","Non-coincident"]
[null,null,null,null,"Coincident"]
[null,null,"WEATHER CORRECTED MD 10% POE","MW","Non-coincident"]
[null,null,null,null,"Coincident"]
[null,null,"WEATHER CORRECTED MD 10% POE","MVA","Non-coincident"]
[null,null,null,null,"Coincident"]
[null,null,"WEATHER CORRECTED MD 50% POE","MW","Non-coincident"]
[null,null,null,null,"Coincident"]
[null,null,"WEATHER CORRECTED MD 50% POE","MVA","Non-coincident"]
[null,null,null,null,"Coincident"]
[null,"NSP to enter name","CONNECTION POINT RATING","MVA","Non-coincident"]
[null,null,null,null,"Coincident"]
[null,null,"WINTER/SUMMER PEAKING",null,"Non-coincident"]
[null,null,null,null,"Coincident"]
[null,null,"ADJUSTMENTS - EMBEDDED GENERATION","MW","Non-coincident"]
[null,null,null,null,"Coincident"]
[null,null,"WEATHER CORRECTED MD 10% POE","MW","Non-coincident"]
[null,null,null,null,"Coincident"]
[null,null,"WEATHER CORRECTED MD 10% POE","MVA","Non-coincident"]
[null,null,null,null,"Coincident"]
[null,null,"WEATHER CORRECTED MD 50% POE","MW","Non-coincident"]
[null,null,null,null,"Coincident"]
[null,null,"WEATHER CORRECTED MD 50% POE","MVA","Non-coincident"]
[null,null,null,null,"Coincident"]
[null,"NSP to enter name","CONNECTION POINT RATING","MVA","Non-coincident"]
[null,null,null,null,"Coincident"]
[null,null,"WINTER/SUMMER PEAKING",null,"Non-coincident"]
[null,null,null,null,"Coincident"]
[null,null,"ADJUSTMENTS - EMBEDDED GENERATION","MW","Non-coincident"]
[null,null,null,null,"Coincident"]
[null,null,"WEATHER CORRECTED MD 10% POE","MW","Non-coincident"]
[null,null,null,null,"Coincident"]
[null,null,"WEATHER CORRECTED MD 10% POE","MVA","Non-coincident"]
[null,null,null,null,"Coincident"]
[null,null,"WEATHER CORRECTED MD 50% POE","MW","Non-coincident"]
[null,null,null,null,"Coincident"]
[null,null,"WEATHER CORRECTED MD 50% POE","MVA","Non-coincident"]
[null,null,null,null,"Coincident"]
[null,"NSP to enter name","CONNECTION POINT RATING","MVA","Non-coincident"]
[null,null,null,null,"Coincident"]
[null,null,"WINTER/SUMMER PEAKING",null,"Non-coincident"]
[null,null,null,null,"Coincident"]
[null,null,"ADJUSTMENTS - EMBEDDED GENERATION","MW","Non-coincident"]
[null,null,null,null,"Coincident"]
[null,null,"WEATHER CORRECTED MD 10% POE","MW","Non-coincident"]
[null,null,null,null,"Coincident"]
[null,null,"WEATHER CORRECTED MD 10% POE","MVA","Non-coincident"]
[null,null,null,null,"Coincident"]
[null,null,"WEATHER CORRECTED MD 50% POE","MW","Non-coincident"]
[null,null,null,null,"Coincident"]
[null,null,"WEATHER CORRECTED MD 50% POE","MVA","Non-coincident"]
[null,null,null,null,"Coincident"]
[null,"NSP to enter name","CONNECTION POINT RATING","MVA","Non-coincident"]
[null,null,null,null,"Coincident"]
[null,null,"WINTER/SUMMER PEAKING",null,"Non-coincident"]
[null,null,null,null,"Coincident"]
[null,null,"ADJUSTMENTS - EMBEDDED GENERATION","MW","Non-coincident"]
[null,null,null,null,"Coincident"]
[null,null,"WEATHER CORRECTED MD 10% POE","MW","Non-coincident"]
[null,null,null,null,"Coincident"]
[null,null,"WEATHER CORRECTED MD 10% POE","MVA","Non-coincident"]
[null,null,null,null,"Coincident"]
[null,null,"WEATHER CORRECTED MD 50% POE","MW","Non-coincident"]
[null,null,null,null,"Coincident"]
[null,null,"WEATHER CORRECTED MD 50% POE","MVA","Non-coincident"]
[null,null,null,null,"Coincident"]
[null,"NSP to enter name","CONNECTION POINT RATING","MVA","Non-coincident"]
[null,null,null,null,"Coincident"]
[null,null,"WINTER/SUMMER PEAKING",null,"Non-coincident"]
[null,null,null,null,"Coincident"]
[null,null,"ADJUSTMENTS - EMBEDDED GENERATION","MW","Non-coincident"]
[null,null,null,null,"Coincident"]
[null,null,"WEATHER CORRECTED MD 10% POE","MW","Non-coincident"]
[null,null,null,null,"Coincident"]
[null,null,"WEATHER CORRECTED MD 10% POE","MVA","Non-coincident"]
[null,null,null,null,"Coincident"]
[null,null,"WEATHER CORRECTED MD 50% POE","MW","Non-coincident"]
[null,null,null,null,"Coincident"]
[null,null,"WEATHER CORRECTED MD 50% POE","MVA","Non-coincident"]
[null,null,null,null,"Coincident"]
[null,"NSP to enter name","CONNECTION POINT RATING","MVA","Non-coincident"]
[null,null,null,null,"Coincident"]
[null,null,"WINTER/SUMMER PEAKING",null,"Non-coincident"]
[null,null,null,null,"Coincident"]
[null,null,"ADJUSTMENTS - EMBEDDED GENERATION","MW","Non-coincident"]
[null,null,null,null,"Coincident"]
[null,null,"WEATHER CORRECTED MD 10% POE","MW","Non-coincident"]
[null,null,null,null,"Coincident"]
[null,null,"WEATHER CORRECTED MD 10% POE","MVA","Non-coincident"]
[null,null,null,null,"Coincident"]
[null,null,"WEATHER CORRECTED MD 50% POE","MW","Non-coincident"]
[null,null,null,null,"Coincident"]
[null,null,"WEATHER CORRECTED MD 50% POE","MVA","Non-coincident"]
[null,null,null,null,"Coincident"]
[null,"NSP to enter name","CONNECTION POINT RATING","MVA","Non-coincident"]
[null,null,null,null,"Coincident"]
[null,null,"WINTER/SUMMER PEAKING",null,"Non-coincident"]
[null,null,null,null,"Coincident"]
[null,null,"ADJUSTMENTS - EMBEDDED GENERATION","MW","Non-coincident"]
[null,null,null,null,"Coincident"]
[null,null,"WEATHER CORRECTED MD 10% POE","MW","Non-coincident"]
[null,null,null,null,"Coincident"]
[null,null,"WEATHER CORRECTED MD 10% POE","MVA","Non-coincident"]
[null,null,null,null,"Coincident"]
[null,null,"WEATHER CORRECTED MD 50% POE","MW","Non-coincident"]
[null,null,null,null,"Coincident"]
[null,null,"WEATHER CORRECTED MD 50% POE","MVA","Non-coincident"]
[null,null,null,null,"Coincident"]
[null,"NSP to enter name","CONNECTION POINT RATING","MVA","Non-coincident"]
[null,null,null,null,"Coincident"]
[null,null,"WINTER/SUMMER PEAKING",null,"Non-coincident"]
[null,null,null,null,"Coincident"]
[null,null,"ADJUSTMENTS - EMBEDDED GENERATION","MW","Non-coincident"]
[null,null,null,null,"Coincident"]
[null,null,"WEATHER CORRECTED MD 10% POE","MW","Non-coincident"]
[null,null,null,null,"Coincident"]
[null,null,"WEATHER CORRECTED MD 10% POE","MVA","Non-coincident"]
[null,null,null,null,"Coincident"]
[null,null,"WEATHER CORRECTED MD 50% POE","MW","Non-coincident"]
[null,null,null,null,"Coincident"]
[null,null,"WEATHER CORRECTED MD 50% POE","MVA","Non-coincident"]
[null,null,null,null,"Coincident"]
[null,"NSP to enter name","CONNECTION POINT RATING","MVA","Non-coincident"]
[null,null,null,null,"Coincident"]
[null,null,"WINTER/SUMMER PEAKING",null,"Non-coincident"]
[null,null,null,null,"Coincident"]
[null,null,"ADJUSTMENTS - EMBEDDED GENERATION","MW","Non-coincident"]
[null,null,null,null,"Coincident"]
[null,null,"WEATHER CORRECTED MD 10% POE","MW","Non-coincident"]
[null,null,null,null,"Coincident"]
[null,null,"WEATHER CORRECTED MD 10% POE","MVA","Non-coincident"]
[null,null,null,null,"Coincident"]
[null,null,"WEATHER CORRECTED MD 50% POE","MW","Non-coincident"]
[null,null,null,null,"Coincident"]
[null,null,"WEATHER CORRECTED MD 50% POE","MVA","Non-coincident"]
[null,null,null,null,"Coincident"]
[null,"NSP to enter name","CONNECTION POINT RATING","MVA","Non-coincident"]
[null,null,null,null,"Coincident"]
[null,null,"WINTER/SUMMER PEAKING",null,"Non-coincident"]
[null,null,null,null,"Coincident"]
[null,null,"ADJUSTMENTS - EMBEDDED GENERATION","MW","Non-coincident"]
[null,null,null,null,"Coincident"]
[null,null,"WEATHER CORRECTED MD 10% POE","MW","Non-coincident"]
[null,null,null,null,"Coincident"]
[null,null,"WEATHER CORRECTED MD 10% POE","MVA","Non-coincident"]
[null,null,null,null,"Coincident"]
[null,null,"WEATHER CORRECTED MD 50% POE","MW","Non-coincident"]
[null,null,null,null,"Coincident"]
[null,null,"WEATHER CORRECTED MD 50% POE","MVA","Non-coincident"]
[null,null,null,null,"Coincident"]
[null,"NSP to enter name","CONNECTION POINT RATING","MVA","Non-coincident"]
[null,null,null,null,"Coincident"]
[null,null,"WINTER/SUMMER PEAKING",null,"Non-coincident"]
[null,null,null,null,"Coincident"]
[null,null,"ADJUSTMENTS - EMBEDDED GENERATION","MW","Non-coincident"]
[null,null,null,null,"Coincident"]
[null,null,"WEATHER CORRECTED MD 10% POE","MW","Non-coincident"]
[null,null,null,null,"Coincident"]
[null,null,"WEATHER CORRECTED MD 10% POE","MVA","Non-coincident"]
[null,null,null,null,"Coincident"]
[null,null,"WEATHER CORRECTED MD 50% POE","MW","Non-coincident"]
[null,null,null,null,"Coincident"]
[null,null,"WEATHER CORRECTED MD 50% POE","MVA","Non-coincident"]
[null,null,null,null,"Coincident"]
[null,"NSP to enter name","CONNECTION POINT RATING","MVA","Non-coincident"]
[null,null,null,null,"Coincident"]
[null,null,"WINTER/SUMMER PEAKING",null,"Non-coincident"]
[null,null,null,null,"Coincident"]
[null,null,"ADJUSTMENTS - EMBEDDED GENERATION","MW","Non-coincident"]
[null,null,null,null,"Coincident"]
[null,null,"WEATHER CORRECTED MD 10% POE","MW","Non-coincident"]
[null,null,null,null,"Coincident"]
[null,null,"WEATHER CORRECTED MD 10% POE","MVA","Non-coincident"]
[null,null,null,null,"Coincident"]
[null,null,"WEATHER CORRECTED MD 50% POE","MW","Non-coincident"]
[null,null,null,null,"Coincident"]
[null,null,"WEATHER CORRECTED MD 50% POE","MVA","Non-coincident"]
[null,null,null,null,"Coincident"]
[null,"NSP to enter name","CONNECTION POINT RATING","MVA","Non-coincident"]
[null,null,null,null,"Coincident"]
[null,null,"WINTER/SUMMER PEAKING",null,"Non-coincident"]
[null,null,null,null,"Coincident"]
[null,null,"ADJUSTMENTS - EMBEDDED GENERATION","MW","Non-coincident"]
[null,null,null,null,"Coincident"]
[null,null,"WEATHER CORRECTED MD 10% POE","MW","Non-coincident"]
[null,null,null,null,"Coincident"]
[null,null,"WEATHER CORRECTED MD 10% POE","MVA","Non-coincident"]
[null,null,null,null,"Coincident"]
[null,null,"WEATHER CORRECTED MD 50% POE","MW","Non-coincident"]
[null,null,null,null,"Coincident"]
[null,null,"WEATHER CORRECTED MD 50% POE","MVA","Non-coincident"]
[null,null,null,null,"Coincident"]
[null,"NSP to enter name","CONNECTION POINT RATING","MVA","Non-coincident"]
[null,null,null,null,"Coincident"]
[null,null,"WINTER/SUMMER PEAKING",null,"Non-coincident"]
[null,null,null,null,"Coincident"]
[null,null,"ADJUSTMENTS - EMBEDDED GENERATION","MW","Non-coincident"]
[null,null,null,null,"Coincident"]
[null,null,"WEATHER CORRECTED MD 10% POE","MW","Non-coincident"]
[null,null,null,null,"Coincident"]
[null,null,"WEATHER CORRECTED MD 10% POE","MVA","Non-coincident"]
[null,null,null,null,"Coincident"]
[null,null,"WEATHER CORRECTED MD 50% POE","MW","Non-coincident"]
[null,null,null,null,"Coincident"]
[null,null,"WEATHER CORRECTED MD 50% POE","MVA","Non-coincident"]
[null,null,null,null,"Coincident"]
[null,"NSP to enter name","CONNECTION POINT RATING","MVA","Non-coincident"]
[null,null,null,null,"Coincident"]
[null,null,"WINTER/SUMMER PEAKING",null,"Non-coincident"]
[null,null,null,null,"Coincident"]
[null,null,"ADJUSTMENTS - EMBEDDED GENERATION","MW","Non-coincident"]
[null,null,null,null,"Coincident"]
[null,null,"WEATHER CORRECTED MD 10% POE","MW","Non-coincident"]
[null,null,null,null,"Coincident"]
[null,null,"WEATHER CORRECTED MD 10% POE","MVA","Non-coincident"]
[null,null,null,null,"Coincident"]
[null,null,"WEATHER CORRECTED MD 50% POE","MW","Non-coincident"]
[null,null,null,null,"Coincident"]
[null,null,"WEATHER CORRECTED MD 50% POE","MVA","Non-coincident"]
[null,null,null,null,"Coincident"]
[null,"NSP to enter name","CONNECTION POINT RATING","MVA","Non-coincident"]
[null,null,null,null,"Coincident"]
[null,null,"WINTER/SUMMER PEAKING",null,"Non-coincident"]
[null,null,null,null,"Coincident"]
[null,null,"ADJUSTMENTS - EMBEDDED GENERATION","MW","Non-coincident"]
[null,null,null,null,"Coincident"]
[null,null,"WEATHER CORRECTED MD 10% POE","MW","Non-coincident"]
[null,null,null,null,"Coincident"]
[null,null,"WEATHER CORRECTED MD 10% POE","MVA","Non-coincident"]
[null,null,null,null,"Coincident"]
[null,null,"WEATHER CORRECTED MD 50% POE","MW","Non-coincident"]
[null,null,null,null,"Coincident"]
[null,null,"WEATHER CORRECTED MD 50% POE","MVA","Non-coincident"]
[null,null,null,null,"Coincident"]
[null,"NSP to enter name","CONNECTION POINT RATING","MVA","Non-coincident"]
[null,null,null,null,"Coincident"]
[null,null,"WINTER/SUMMER PEAKING",null,"Non-coincident"]
[null,null,null,null,"Coincident"]
[null,null,"ADJUSTMENTS - EMBEDDED GENERATION","MW","Non-coincident"]
[null,null,null,null,"Coincident"]
[null,null,"WEATHER CORRECTED MD 10% POE","MW","Non-coincident"]
[null,null,null,null,"Coincident"]
[null,null,"WEATHER CORRECTED MD 10% POE","MVA","Non-coincident"]
[null,null,null,null,"Coincident"]
[null,null,"WEATHER CORRECTED MD 50% POE","MW","Non-coincident"]
[null,null,null,null,"Coincident"]
[null,null,"WEATHER CORRECTED MD 50% POE","MVA","Non-coincident"]
[null,null,null,null,"Coincident"]
[null,"NSP to enter name","CONNECTION POINT RATING","MVA","Non-coincident"]
[null,null,null,null,"Coincident"]
[null,null,"WINTER/SUMMER PEAKING",null,"Non-coincident"]
[null,null,null,null,"Coincident"]
[null,null,"ADJUSTMENTS - EMBEDDED GENERATION","MW","Non-coincident"]
[null,null,null,null,"Coincident"]
[null,null,"WEATHER CORRECTED MD 10% POE","MW","Non-coincident"]
[null,null,null,null,"Coincident"]
[null,null,"WEATHER CORRECTED MD 10% POE","MVA","Non-coincident"]
[null,null,null,null,"Coincident"]
[null,null,"WEATHER CORRECTED MD 50% POE","MW","Non-coincident"]
[null,null,null,null,"Coincident"]
[null,null,"WEATHER CORRECTED MD 50% POE","MVA","Non-coincident"]
[null,null,null,null,"Coincident"]
[null,"NSP to enter name","CONNECTION POINT RATING","MVA","Non-coincident"]
[null,null,null,null,"Coincident"]
[null,null,"WINTER/SUMMER PEAKING",null,"Non-coincident"]
[null,null,null,null,"Coincident"]
[null,null,"ADJUSTMENTS - EMBEDDED GENERATION","MW","Non-coincident"]
[null,null,null,null,"Coincident"]
[null,null,"WEATHER CORRECTED MD 10% POE","MW","Non-coincident"]
[null,null,null,null,"Coincident"]
[null,null,"WEATHER CORRECTED MD 10% POE","MVA","Non-coincident"]
[null,null,null,null,"Coincident"]
[null,null,"WEATHER CORRECTED MD 50% POE","MW","Non-coincident"]
[null,null,null,null,"Coincident"]
[null,null,"WEATHER CORRECTED MD 50% POE","MVA","Non-coincident"]
[null,null,null,null,"Coincident"]
[null,"NSP to enter name","CONNECTION POINT RATING","MVA","Non-coincident"]
[null,null,null,null,"Coincident"]
[null,null,"WINTER/SUMMER PEAKING",null,"Non-coincident"]
[null,null,null,null,"Coincident"]
[null,null,"ADJUSTMENTS - EMBEDDED GENERATION","MW","Non-coincident"]
[null,null,null,null,"Coincident"]
[null,null,"WEATHER CORRECTED MD 10% POE","MW","Non-coincident"]
[null,null,null,null,"Coincident"]
[null,null,"WEATHER CORRECTED MD 10% POE","MVA","Non-coincident"]
[null,null,null,null,"Coincident"]
[null,null,"WEATHER CORRECTED MD 50% POE","MW","Non-coincident"]
[null,null,null,null,"Coincident"]
[null,null,"WEATHER CORRECTED MD 50% POE","MVA","Non-coincident"]
[null,null,null,null,"Coincident"]
[null,"NSP to enter name","CONNECTION POINT RATING","MVA","Non-coincident"]
[null,null,null,null,"Coincident"]
[null,null,"WINTER/SUMMER PEAKING",null,"Non-coincident"]
[null,null,null,null,"Coincident"]
[null,null,"ADJUSTMENTS - EMBEDDED GENERATION","MW","Non-coincident"]
[null,null,null,null,"Coincident"]
[null,null,"WEATHER CORRECTED MD 10% POE","MW","Non-coincident"]
[null,null,null,null,"Coincident"]
[null,null,"WEATHER CORRECTED MD 10% POE","MVA","Non-coincident"]
[null,null,null,null,"Coincident"]
[null,null,"WEATHER CORRECTED MD 50% POE","MW","Non-coincident"]
[null,null,null,null,"Coincident"]
[null,null,"WEATHER CORRECTED MD 50% POE","MVA","Non-coincident"]
[null,null,null,null,"Coincident"]
[null,"NSP to enter name","CONNECTION POINT RATING","MVA","Non-coincident"]
[null,null,null,null,"Coincident"]
[null,null,"WINTER/SUMMER PEAKING",null,"Non-coincident"]
[null,null,null,null,"Coincident"]
[null,null,"ADJUSTMENTS - EMBEDDED GENERATION","MW","Non-coincident"]
[null,null,null,null,"Coincident"]
[null,null,"WEATHER CORRECTED MD 10% POE","MW","Non-coincident"]
[null,null,null,null,"Coincident"]
[null,null,"WEATHER CORRECTED MD 10% POE","MVA","Non-coincident"]
[null,null,null,null,"Coincident"]
[null,null,"WEATHER CORRECTED MD 50% POE","MW","Non-coincident"]
[null,null,null,null,"Coincident"]
[null,null,"WEATHER CORRECTED MD 50% POE","MVA","Non-coincident"]
[null,null,null,null,"Coincident"]
[null,"NSP to enter name","CONNECTION POINT RATING","MVA","Non-coincident"]
[null,null,null,null,"Coincident"]
[null,null,"WINTER/SUMMER PEAKING",null,"Non-coincident"]
[null,null,null,null,"Coincident"]
[null,null,"ADJUSTMENTS - EMBEDDED GENERATION","MW","Non-coincident"]
[null,null,null,null,"Coincident"]
[null,null,"WEATHER CORRECTED MD 10% POE","MW","Non-coincident"]
[null,null,null,null,"Coincident"]
[null,null,"WEATHER CORRECTED MD 10% POE","MVA","Non-coincident"]
[null,null,null,null,"Coincident"]
[null,null,"WEATHER CORRECTED MD 50% POE","MW","Non-coincident"]
[null,null,null,null,"Coincident"]
[null,null,"WEATHER CORRECTED MD 50% POE","MVA","Non-coincident"]
[null,null,null,null,"Coincident"]
[null,"NSP to enter name","CONNECTION POINT RATING","MVA","Non-coincident"]
[null,null,null,null,"Coincident"]
[null,null,"WINTER/SUMMER PEAKING",null,"Non-coincident"]
[null,null,null,null,"Coincident"]
[null,null,"ADJUSTMENTS - EMBEDDED GENERATION","MW","Non-coincident"]
[null,null,null,null,"Coincident"]
[null,null,"WEATHER CORRECTED MD 10% POE","MW","Non-coincident"]
[null,null,null,null,"Coincident"]
[null,null,"WEATHER CORRECTED MD 10% POE","MVA","Non-coincident"]
[null,null,null,null,"Coincident"]
[null,null,"WEATHER CORRECTED MD 50% POE","MW","Non-coincident"]
[null,null,null,null,"Coincident"]
[null,null,"WEATHER CORRECTED MD 50% POE","MVA","Non-coincident"]
[null,null,null,null,"Coincident"]
[null,"NSP to enter name","CONNECTION POINT RATING","MVA","Non-coincident"]
[null,null,null,null,"Coincident"]
[null,null,"WINTER/SUMMER PEAKING",null,"Non-coincident"]
[null,null,null,null,"Coincident"]
[null,null,"ADJUSTMENTS - EMBEDDED GENERATION","MW","Non-coincident"]
[null,null,null,null,"Coincident"]
[null,null,"WEATHER CORRECTED MD 10% POE","MW","Non-coincident"]
[null,null,null,null,"Coincident"]
[null,null,"WEATHER CORRECTED MD 10% POE","MVA","Non-coincident"]
[null,null,null,null,"Coincident"]
[null,null,"WEATHER CORRECTED MD 50% POE","MW","Non-coincident"]
[null,null,null,null,"Coincident"]
[null,null,"WEATHER CORRECTED MD 50% POE","MVA","Non-coincident"]
[null,null,null,null,"Coincident"]
[null,"NSP to enter name","CONNECTION POINT RATING","MVA","Non-coincident"]
[null,null,null,null,"Coincident"]
[null,null,"WINTER/SUMMER PEAKING",null,"Non-coincident"]
[null,null,null,null,"Coincident"]
[null,null,"ADJUSTMENTS - EMBEDDED GENERATION","MW","Non-coincident"]
[null,null,null,null,"Coincident"]
[null,null,"WEATHER CORRECTED MD 10% POE","MW","Non-coincident"]
[null,null,null,null,"Coincident"]
[null,null,"WEATHER CORRECTED MD 10% POE","MVA","Non-coincident"]
[null,null,null,null,"Coincident"]
[null,null,"WEATHER CORRECTED MD 50% POE","MW","Non-coincident"]
[null,null,null,null,"Coincident"]
[null,null,"WEATHER CORRECTED MD 50% POE","MVA","Non-coincident"]
[null,null,null,null,"Coincident"]
[null,"NSP to enter name","CONNECTION POINT RATING","MVA","Non-coincident"]
[null,null,null,null,"Coincident"]
[null,null,"WINTER/SUMMER PEAKING",null,"Non-coincident"]
[null,null,null,null,"Coincident"]
[null,null,"ADJUSTMENTS - EMBEDDED GENERATION","MW","Non-coincident"]
[null,null,null,null,"Coincident"]
[null,null,"WEATHER CORRECTED MD 10% POE","MW","Non-coincident"]
[null,null,null,null,"Coincident"]
[null,null,"WEATHER CORRECTED MD 10% POE","MVA","Non-coincident"]
[null,null,null,null,"Coincident"]
[null,null,"WEATHER CORRECTED MD 50% POE","MW","Non-coincident"]
[null,null,null,null,"Coincident"]
[null,null,"WEATHER CORRECTED MD 50% POE","MVA","Non-coincident"]
[null,null,null,null,"Coincident"]
[null,"NSP to enter name","CONNECTION POINT RATING","MVA","Non-coincident"]
[null,null,null,null,"Coincident"]
[null,null,"WINTER/SUMMER PEAKING",null,"Non-coincident"]
[null,null,null,null,"Coincident"]
[null,null,"ADJUSTMENTS - EMBEDDED GENERATION","MW","Non-coincident"]
[null,null,null,null,"Coincident"]
[null,null,"WEATHER CORRECTED MD 10% POE","MW","Non-coincident"]
[null,null,null,null,"Coincident"]
[null,null,"WEATHER CORRECTED MD 10% POE","MVA","Non-coincident"]
[null,null,null,null,"Coincident"]
[null,null,"WEATHER CORRECTED MD 50% POE","MW","Non-coincident"]
[null,null,null,null,"Coincident"]
[null,null,"WEATHER CORRECTED MD 50% POE","MVA","Non-coincident"]
[null,null,null,null,"Coincident"]
[null,"NSP to enter name","CONNECTION POINT RATING","MVA","Non-coincident"]
[null,null,null,null,"Coincident"]
[null,null,"WINTER/SUMMER PEAKING",null,"Non-coincident"]
[null,null,null,null,"Coincident"]
[null,null,"ADJUSTMENTS - EMBEDDED GENERATION","MW","Non-coincident"]
[null,null,null,null,"Coincident"]
[null,null,"WEATHER CORRECTED MD 10% POE","MW","Non-coincident"]
[null,null,null,null,"Coincident"]
[null,null,"WEATHER CORRECTED MD 10% POE","MVA","Non-coincident"]
[null,null,null,null,"Coincident"]
[null,null,"WEATHER CORRECTED MD 50% POE","MW","Non-coincident"]
[null,null,null,null,"Coincident"]
[null,null,"WEATHER CORRECTED MD 50% POE","MVA","Non-coincident"]
[null,null,null,null,"Coincident"]
[null,"NSP to enter name","CONNECTION POINT RATING","MVA","Non-coincident"]
[null,null,null,null,"Coincident"]
[null,null,"WINTER/SUMMER PEAKING",null,"Non-coincident"]
[null,null,null,null,"Coincident"]
[null,null,"ADJUSTMENTS - EMBEDDED GENERATION","MW","Non-coincident"]
[null,null,null,null,"Coincident"]
[null,null,"WEATHER CORRECTED MD 10% POE","MW","Non-coincident"]
[null,null,null,null,"Coincident"]
[null,null,"WEATHER CORRECTED MD 10% POE","MVA","Non-coincident"]
[null,null,null,null,"Coincident"]
[null,null,"WEATHER CORRECTED MD 50% POE","MW","Non-coincident"]
[null,null,null,null,"Coincident"]
[null,null,"WEATHER CORRECTED MD 50% POE","MVA","Non-coincident"]
[null,null,null,null,"Coincident"]
[null,"NSP to enter name","CONNECTION POINT RATING","MVA","Non-coincident"]
[null,null,null,null,"Coincident"]
[null,null,"WINTER/SUMMER PEAKING",null,"Non-coincident"]
[null,null,null,null,"Coincident"]
[null,null,"ADJUSTMENTS - EMBEDDED GENERATION","MW","Non-coincident"]
[null,null,null,null,"Coincident"]
[null,null,"WEATHER CORRECTED MD 10% POE","MW","Non-coincident"]
[null,null,null,null,"Coincident"]
[null,null,"WEATHER CORRECTED MD 10% POE","MVA","Non-coincident"]
[null,null,null,null,"Coincident"]
[null,null,"WEATHER CORRECTED MD 50% POE","MW","Non-coincident"]
[null,null,null,null,"Coincident"]
[null,null,"WEATHER CORRECTED MD 50% POE","MVA","Non-coincident"]
[null,null,null,null,"Coincident"]
[null,"NSP to enter name","CONNECTION POINT RATING","MVA","Non-coincident"]
[null,null,null,null,"Coincident"]
[null,null,"WINTER/SUMMER PEAKING",null,"Non-coincident"]
[null,null,null,null,"Coincident"]
[null,null,"ADJUSTMENTS - EMBEDDED GENERATION","MW","Non-coincident"]
[null,null,null,null,"Coincident"]
[null,null,"WEATHER CORRECTED MD 10% POE","MW","Non-coincident"]
[null,null,null,null,"Coincident"]
[null,null,"WEATHER CORRECTED MD 10% POE","MVA","Non-coincident"]
[null,null,null,null,"Coincident"]
[null,null,"WEATHER CORRECTED MD 50% POE","MW","Non-coincident"]
[null,null,null,null,"Coincident"]
[null,null,"WEATHER CORRECTED MD 50% POE","MVA","Non-coincident"]
[null,null,null,null,"Coincident"]
[null,"NSP to enter name","CONNECTION POINT RATING","MVA","Non-coincident"]
[null,null,null,null,"Coincident"]
[null,null,"WINTER/SUMMER PEAKING",null,"Non-coincident"]
[null,null,null,null,"Coincident"]
[null,null,"ADJUSTMENTS - EMBEDDED GENERATION","MW","Non-coincident"]
[null,null,null,null,"Coincident"]
[null,null,"WEATHER CORRECTED MD 10% POE","MW","Non-coincident"]
[null,null,null,null,"Coincident"]
[null,null,"WEATHER CORRECTED MD 10% POE","MVA","Non-coincident"]
[null,null,null,null,"Coincident"]
[null,null,"WEATHER CORRECTED MD 50% POE","MW","Non-coincident"]
[null,null,null,null,"Coincident"]
[null,null,"WEATHER CORRECTED MD 50% POE","MVA","Non-coincident"]
[null,null,null,null,"Coincident"]
[null,"NSP to enter name","CONNECTION POINT RATING","MVA","Non-coincident"]
[null,null,null,null,"Coincident"]
[null,null,"WINTER/SUMMER PEAKING",null,"Non-coincident"]
[null,null,null,null,"Coincident"]
[null,null,"ADJUSTMENTS - EMBEDDED GENERATION","MW","Non-coincident"]
[null,null,null,null,"Coincident"]
[null,null,"WEATHER CORRECTED MD 10% POE","MW","Non-coincident"]
[null,null,null,null,"Coincident"]
[null,null,"WEATHER CORRECTED MD 10% POE","MVA","Non-coincident"]
[null,null,null,null,"Coincident"]
[null,null,"WEATHER CORRECTED MD 50% POE","MW","Non-coincident"]
[null,null,null,null,"Coincident"]
[null,null,"WEATHER CORRECTED MD 50% POE","MVA","Non-coincident"]
[null,null,null,null,"Coincident"]
[null,"NSP to enter name","CONNECTION POINT RATING","MVA","Non-coincident"]
[null,null,null,null,"Coincident"]
[null,null,"WINTER/SUMMER PEAKING",null,"Non-coincident"]
[null,null,null,null,"Coincident"]
[null,null,"ADJUSTMENTS - EMBEDDED GENERATION","MW","Non-coincident"]
[null,null,null,null,"Coincident"]
[null,null,"WEATHER CORRECTED MD 10% POE","MW","Non-coincident"]
[null,null,null,null,"Coincident"]
[null,null,"WEATHER CORRECTED MD 10% POE","MVA","Non-coincident"]
[null,null,null,null,"Coincident"]
[null,null,"WEATHER CORRECTED MD 50% POE","MW","Non-coincident"]
[null,null,null,null,"Coincident"]
[null,null,"WEATHER CORRECTED MD 50% POE","MVA","Non-coincident"]
[null,null,null,null,"Coincident"]
[null,"NSP to enter name","CONNECTION POINT RATING","MVA","Non-coincident"]
[null,null,null,null,"Coincident"]
[null,null,"WINTER/SUMMER PEAKING",null,"Non-coincident"]
[null,null,null,null,"Coincident"]
[null,null,"ADJUSTMENTS - EMBEDDED GENERATION","MW","Non-coincident"]
[null,null,null,null,"Coincident"]
[null,null,"WEATHER CORRECTED MD 10% POE","MW","Non-coincident"]
[null,null,null,null,"Coincident"]
[null,null,"WEATHER CORRECTED MD 10% POE","MVA","Non-coincident"]
[null,null,null,null,"Coincident"]
[null,null,"WEATHER CORRECTED MD 50% POE","MW","Non-coincident"]
[null,null,null,null,"Coincident"]
[null,null,"WEATHER CORRECTED MD 50% POE","MVA","Non-coincident"]
[null,null,null,null,"Coincident"]
[null,"NSP to enter name","CONNECTION POINT RATING","MVA","Non-coincident"]
[null,null,null,null,"Coincident"]
[null,null,"WINTER/SUMMER PEAKING",null,"Non-coincident"]
[null,null,null,null,"Coincident"]
[null,null,"ADJUSTMENTS - EMBEDDED GENERATION","MW","Non-coincident"]
[null,null,null,null,"Coincident"]
[null,null,"WEATHER CORRECTED MD 10% POE","MW","Non-coincident"]
[null,null,null,null,"Coincident"]
[null,null,"WEATHER CORRECTED MD 10% POE","MVA","Non-coincident"]
[null,null,null,null,"Coincident"]
[null,null,"WEATHER CORRECTED MD 50% POE","MW","Non-coincident"]
[null,null,null,null,"Coincident"]
[null,null,"WEATHER CORRECTED MD 50% POE","MVA","Non-coincident"]
[null,null,null,null,"Coincident"]
[null,"NSP to enter name","CONNECTION POINT RATING","MVA","Non-coincident"]
[null,null,null,null,"Coincident"]
[null,null,"WINTER/SUMMER PEAKING",null,"Non-coincident"]
[null,null,null,null,"Coincident"]
[null,null,"ADJUSTMENTS - EMBEDDED GENERATION","MW","Non-coincident"]
[null,null,null,null,"Coincident"]
[null,null,"WEATHER CORRECTED MD 10% POE","MW","Non-coincident"]
[null,null,null,null,"Coincident"]
[null,null,"WEATHER CORRECTED MD 10% POE","MVA","Non-coincident"]
[null,null,null,null,"Coincident"]
[null,null,"WEATHER CORRECTED MD 50% POE","MW","Non-coincident"]
[null,null,null,null,"Coincident"]
[null,null,"WEATHER CORRECTED MD 50% POE","MVA","Non-coincident"]
[null,null,null,null,"Coincident"]
[null,"NSP to enter name","CONNECTION POINT RATING","MVA","Non-coincident"]
[null,null,null,null,"Coincident"]
[null,null,"WINTER/SUMMER PEAKING",null,"Non-coincident"]
[null,null,null,null,"Coincident"]
[null,null,"ADJUSTMENTS - EMBEDDED GENERATION","MW","Non-coincident"]
[null,null,null,null,"Coincident"]
[null,null,"WEATHER CORRECTED MD 10% POE","MW","Non-coincident"]
[null,null,null,null,"Coincident"]
[null,null,"WEATHER CORRECTED MD 10% POE","MVA","Non-coincident"]
[null,null,null,null,"Coincident"]
[null,null,"WEATHER CORRECTED MD 50% POE","MW","Non-coincident"]
[null,null,null,null,"Coincident"]
[null,null,"WEATHER CORRECTED MD 50% POE","MVA","Non-coincident"]
[null,null,null,null,"Coincident"]
[null,"NSP to enter name","CONNECTION POINT RATING","MVA","Non-coincident"]
[null,null,null,null,"Coincident"]
[null,null,"WINTER/SUMMER PEAKING",null,"Non-coincident"]
[null,null,null,null,"Coincident"]
[null,null,"ADJUSTMENTS - EMBEDDED GENERATION","MW","Non-coincident"]
[null,null,null,null,"Coincident"]
[null,null,"WEATHER CORRECTED MD 10% POE","MW","Non-coincident"]
[null,null,null,null,"Coincident"]
[null,null,"WEATHER CORRECTED MD 10% POE","MVA","Non-coincident"]
[null,null,null,null,"Coincident"]
[null,null,"WEATHER CORRECTED MD 50% POE","MW","Non-coincident"]
[null,null,null,null,"Coincident"]
[null,null,"WEATHER CORRECTED MD 50% POE","MVA","Non-coincident"]
[null,null,null,null,"Coincident"]
[null,"NSP to enter name","CONNECTION POINT RATING","MVA","Non-coincident"]
[null,null,null,null,"Coincident"]
[null,null,"WINTER/SUMMER PEAKING",null,"Non-coincident"]
[null,null,null,null,"Coincident"]
[null,null,"ADJUSTMENTS - EMBEDDED GENERATION","MW","Non-coincident"]
[null,null,null,null,"Coincident"]
[null,null,"WEATHER CORRECTED MD 10% POE","MW","Non-coincident"]
[null,null,null,null,"Coincident"]
[null,null,"WEATHER CORRECTED MD 10% POE","MVA","Non-coincident"]
[null,null,null,null,"Coincident"]
[null,null,"WEATHER CORRECTED MD 50% POE","MW","Non-coincident"]
[null,null,null,null,"Coincident"]
[null,null,"WEATHER CORRECTED MD 50% POE","MVA","Non-coincident"]
[null,null,null,null,"Coincident"]
[null,"NSP to enter name","CONNECTION POINT RATING","MVA","Non-coincident"]
[null,null,null,null,"Coincident"]
[null,null,"WINTER/SUMMER PEAKING",null,"Non-coincident"]
[null,null,null,null,"Coincident"]
[null,null,"ADJUSTMENTS - EMBEDDED GENERATION","MW","Non-coincident"]
[null,null,null,null,"Coincident"]
[null,null,"WEATHER CORRECTED MD 10% POE","MW","Non-coincident"]
[null,null,null,null,"Coincident"]
[null,null,"WEATHER CORRECTED MD 10% POE","MVA","Non-coincident"]
[null,null,null,null,"Coincident"]
[null,null,"WEATHER CORRECTED MD 50% POE","MW","Non-coincident"]
[null,null,null,null,"Coincident"]
[null,null,"WEATHER CORRECTED MD 50% POE","MVA","Non-coincident"]
[null,null,null,null,"Coincident"]
[null,"NSP to enter name","CONNECTION POINT RATING","MVA","Non-coincident"]
[null,null,null,null,"Coincident"]
[null,null,"WINTER/SUMMER PEAKING",null,"Non-coincident"]
[null,null,null,null,"Coincident"]
[null,null,"ADJUSTMENTS - EMBEDDED GENERATION","MW","Non-coincident"]
[null,null,null,null,"Coincident"]
[null,null,"WEATHER CORRECTED MD 10% POE","MW","Non-coincident"]
[null,null,null,null,"Coincident"]
[null,null,"WEATHER CORRECTED MD 10% POE","MVA","Non-coincident"]
[null,null,null,null,"Coincident"]
[null,null,"WEATHER CORRECTED MD 50% POE","MW","Non-coincident"]
[null,null,null,null,"Coincident"]
[null,null,"WEATHER CORRECTED MD 50% POE","MVA","Non-coincident"]
[null,null,null,null,"Coincident"]
[null,"NSP to enter name","CONNECTION POINT RATING","MVA","Non-coincident"]
[null,null,null,null,"Coincident"]
[null,null,"WINTER/SUMMER PEAKING",null,"Non-coincident"]
[null,null,null,null,"Coincident"]
[null,null,"ADJUSTMENTS - EMBEDDED GENERATION","MW","Non-coincident"]
[null,null,null,null,"Coincident"]
[null,null,"WEATHER CORRECTED MD 10% POE","MW","Non-coincident"]
[null,null,null,null,"Coincident"]
[null,null,"WEATHER CORRECTED MD 10% POE","MVA","Non-coincident"]
[null,null,null,null,"Coincident"]
[null,null,"WEATHER CORRECTED MD 50% POE","MW","Non-coincident"]
[null,null,null,null,"Coincident"]
[null,null,"WEATHER CORRECTED MD 50% POE","MVA","Non-coincident"]
[null,null,null,null,"Coincident"]
[null,"NSP to enter name","CONNECTION POINT RATING","MVA","Non-coincident"]
[null,null,null,null,"Coincident"]
[null,null,"WINTER/SUMMER PEAKING",null,"Non-coincident"]
[null,null,null,null,"Coincident"]
[null,null,"ADJUSTMENTS - EMBEDDED GENERATION","MW","Non-coincident"]
[null,null,null,null,"Coincident"]
[null,null,"WEATHER CORRECTED MD 10% POE","MW","Non-coincident"]
[null,null,null,null,"Coincident"]
[null,null,"WEATHER CORRECTED MD 10% POE","MVA","Non-coincident"]
[null,null,null,null,"Coincident"]
[null,null,"WEATHER CORRECTED MD 50% POE","MW","Non-coincident"]
[null,null,null,null,"Coincident"]
[null,null,"WEATHER CORRECTED MD 50% POE","MVA","Non-coincident"]
[null,null,null,null,"Coincident"]
[null,"NSP to enter name","CONNECTION POINT RATING","MVA","Non-coincident"]
[null,null,null,null,"Coincident"]
[null,null,"WINTER/SUMMER PEAKING",null,"Non-coincident"]
[null,null,null,null,"Coincident"]
[null,null,"ADJUSTMENTS - EMBEDDED GENERATION","MW","Non-coincident"]
[null,null,null,null,"Coincident"]
[null,null,"WEATHER CORRECTED MD 10% POE","MW","Non-coincident"]
[null,null,null,null,"Coincident"]
[null,null,"WEATHER CORRECTED MD 10% POE","MVA","Non-coincident"]
[null,null,null,null,"Coincident"]
[null,null,"WEATHER CORRECTED MD 50% POE","MW","Non-coincident"]
[null,null,null,null,"Coincident"]
[null,null,"WEATHER CORRECTED MD 50% POE","MVA","Non-coincident"]
[null,null,null,null,"Coincident"]
[null,"NSP to enter name","CONNECTION POINT RATING","MVA","Non-coincident"]
[null,null,null,null,"Coincident"]
[null,null,"WINTER/SUMMER PEAKING",null,"Non-coincident"]
[null,null,null,null,"Coincident"]
[null,null,"ADJUSTMENTS - EMBEDDED GENERATION","MW","Non-coincident"]
[null,null,null,null,"Coincident"]
[null,null,"WEATHER CORRECTED MD 10% POE","MW","Non-coincident"]
[null,null,null,null,"Coincident"]
[null,null,"WEATHER CORRECTED MD 10% POE","MVA","Non-coincident"]
[null,null,null,null,"Coincident"]
[null,null,"WEATHER CORRECTED MD 50% POE","MW","Non-coincident"]
[null,null,null,null,"Coincident"]
[null,null,"WEATHER CORRECTED MD 50% POE","MVA","Non-coincident"]
[null,null,null,null,"Coincident"]
[null,"NSP to enter name","CONNECTION POINT RATING","MVA","Non-coincident"]
[null,null,null,null,"Coincident"]
[null,null,"WINTER/SUMMER PEAKING",null,"Non-coincident"]
[null,null,null,null,"Coincident"]
[null,null,"ADJUSTMENTS - EMBEDDED GENERATION","MW","Non-coincident"]
[null,null,null,null,"Coincident"]
[null,null,"WEATHER CORRECTED MD 10% POE","MW","Non-coincident"]
[null,null,null,null,"Coincident"]
[null,null,"WEATHER CORRECTED MD 10% POE","MVA","Non-coincident"]
[null,null,null,null,"Coincident"]
[null,null,"WEATHER CORRECTED MD 50% POE","MW","Non-coincident"]
[null,null,null,null,"Coincident"]
[null,null,"WEATHER CORRECTED MD 50% POE","MVA","Non-coincident"]
[null,null,null,null,"Coincident"]
[null,"NSP to enter name","CONNECTION POINT RATING","MVA","Non-coincident"]
[null,null,null,null,"Coincident"]
[null,null,"WINTER/SUMMER PEAKING",null,"Non-coincident"]
[null,null,null,null,"Coincident"]
[null,null,"ADJUSTMENTS - EMBEDDED GENERATION","MW","Non-coincident"]
[null,null,null,null,"Coincident"]
[null,null,"WEATHER CORRECTED MD 10% POE","MW","Non-coincident"]
[null,null,null,null,"Coincident"]
[null,null,"WEATHER CORRECTED MD 10% POE","MVA","Non-coincident"]
[null,null,null,null,"Coincident"]
[null,null,"WEATHER CORRECTED MD 50% POE","MW","Non-coincident"]
[null,null,null,null,"Coincident"]
[null,null,"WEATHER CORRECTED MD 50% POE","MVA","Non-coincident"]
[null,null,null,null,"Coincident"]
[null,"NSP to enter name","CONNECTION POINT RATING","MVA","Non-coincident"]
[null,null,null,null,"Coincident"]
[null,null,"WINTER/SUMMER PEAKING",null,"Non-coincident"]
[null,null,null,null,"Coincident"]
[null,null,"ADJUSTMENTS - EMBEDDED GENERATION","MW","Non-coincident"]
[null,null,null,null,"Coincident"]
[null,null,"WEATHER CORRECTED MD 10% POE","MW","Non-coincident"]
[null,null,null,null,"Coincident"]
[null,null,"WEATHER CORRECTED MD 10% POE","MVA","Non-coincident"]
[null,null,null,null,"Coincident"]
[null,null,"WEATHER CORRECTED MD 50% POE","MW","Non-coincident"]
[null,null,null,null,"Coincident"]
[null,null,"WEATHER CORRECTED MD 50% POE","MVA","Non-coincident"]
[null,null,null,null,"Coincident"]
[null,"NSP to enter name","CONNECTION POINT RATING","MVA","Non-coincident"]
[null,null,null,null,"Coincident"]
[null,null,"WINTER/SUMMER PEAKING",null,"Non-coincident"]
[null,null,null,null,"Coincident"]
[null,null,"ADJUSTMENTS - EMBEDDED GENERATION","MW","Non-coincident"]
[null,null,null,null,"Coincident"]
[null,null,"WEATHER CORRECTED MD 10% POE","MW","Non-coincident"]
[null,null,null,null,"Coincident"]
[null,null,"WEATHER CORRECTED MD 10% POE","MVA","Non-coincident"]
[null,null,null,null,"Coincident"]
[null,null,"WEATHER CORRECTED MD 50% POE","MW","Non-coincident"]
[null,null,null,null,"Coincident"]
[null,null,"WEATHER CORRECTED MD 50% POE","MVA","Non-coincident"]
[null,null,null,null,"Coincident"]
[null,"NSP to enter name","CONNECTION POINT RATING","MVA","Non-coincident"]
[null,null,null,null,"Coincident"]
[null,null,"WINTER/SUMMER PEAKING",null,"Non-coincident"]
[null,null,null,null,"Coincident"]
[null,null,"ADJUSTMENTS - EMBEDDED GENERATION","MW","Non-coincident"]
[null,null,null,null,"Coincident"]
[null,null,"WEATHER CORRECTED MD 10% POE","MW","Non-coincident"]
[null,null,null,null,"Coincident"]
[null,null,"WEATHER CORRECTED MD 10% POE","MVA","Non-coincident"]
[null,null,null,null,"Coincident"]
[null,null,"WEATHER CORRECTED MD 50% POE","MW","Non-coincident"]
[null,null,null,null,"Coincident"]
[null,null,"WEATHER CORRECTED MD 50% POE","MVA","Non-coincident"]
[null,null,null,null,"Coincident"]
[null,"NSP to enter name","CONNECTION POINT RATING","MVA","Non-coincident"]
[null,null,null,null,"Coincident"]
[null,null,"WINTER/SUMMER PEAKING",null,"Non-coincident"]
[null,null,null,null,"Coincident"]
[null,null,"ADJUSTMENTS - EMBEDDED GENERATION","MW","Non-coincident"]
[null,null,null,null,"Coincident"]
[null,null,"WEATHER CORRECTED MD 10% POE","MW","Non-coincident"]
[null,null,null,null,"Coincident"]
[null,null,"WEATHER CORRECTED MD 10% POE","MVA","Non-coincident"]
[null,null,null,null,"Coincident"]
[null,null,"WEATHER CORRECTED MD 50% POE","MW","Non-coincident"]
[null,null,null,null,"Coincident"]
[null,null,"WEATHER CORRECTED MD 50% POE","MVA","Non-coincident"]
[null,null,null,null,"Coincident"]
[null,"NSP to enter name","CONNECTION POINT RATING","MVA","Non-coincident"]
[null,null,null,null,"Coincident"]
[null,null,"WINTER/SUMMER PEAKING",null,"Non-coincident"]
[null,null,null,null,"Coincident"]
[null,null,"ADJUSTMENTS - EMBEDDED GENERATION","MW","Non-coincident"]
[null,null,null,null,"Coincident"]
[null,null,"WEATHER CORRECTED MD 10% POE","MW","Non-coincident"]
[null,null,null,null,"Coincident"]
[null,null,"WEATHER CORRECTED MD 10% POE","MVA","Non-coincident"]
[null,null,null,null,"Coincident"]
[null,null,"WEATHER CORRECTED MD 50% POE","MW","Non-coincident"]
[null,null,null,null,"Coincident"]
[null,null,"WEATHER CORRECTED MD 50% POE","MVA","Non-coincident"]
[null,null,null,null,"Coincident"]
[null,"NSP to enter name","CONNECTION POINT RATING","MVA","Non-coincident"]
[null,null,null,null,"Coincident"]
[null,null,"WINTER/SUMMER PEAKING",null,"Non-coincident"]
[null,null,null,null,"Coincident"]
[null,null,"ADJUSTMENTS - EMBEDDED GENERATION","MW","Non-coincident"]
[null,null,null,null,"Coincident"]
[null,null,"WEATHER CORRECTED MD 10% POE","MW","Non-coincident"]
[null,null,null,null,"Coincident"]
[null,null,"WEATHER CORRECTED MD 10% POE","MVA","Non-coincident"]
[null,null,null,null,"Coincident"]
[null,null,"WEATHER CORRECTED MD 50% POE","MW","Non-coincident"]
[null,null,null,null,"Coincident"]
[null,null,"WEATHER CORRECTED MD 50% POE","MVA","Non-coincident"]
[null,null,null,null,"Coincident"]
[null,"NSP to enter name","CONNECTION POINT RATING","MVA","Non-coincident"]
[null,null,null,null,"Coincident"]
[null,null,"WINTER/SUMMER PEAKING",null,"Non-coincident"]
[null,null,null,null,"Coincident"]
[null,null,"ADJUSTMENTS - EMBEDDED GENERATION","MW","Non-coincident"]
[null,null,null,null,"Coincident"]
[null,null,"WEATHER CORRECTED MD 10% POE","MW","Non-coincident"]
[null,null,null,null,"Coincident"]
[null,null,"WEATHER CORRECTED MD 10% POE","MVA","Non-coincident"]
[null,null,null,null,"Coincident"]
[null,null,"WEATHER CORRECTED MD 50% POE","MW","Non-coincident"]
[null,null,null,null,"Coincident"]
[null,null,"WEATHER CORRECTED MD 50% POE","MVA","Non-coincident"]
[null,null,null,null,"Coincident"]
[null,"NSP to enter name","CONNECTION POINT RATING","MVA","Non-coincident"]
[null,null,null,null,"Coincident"]
[null,null,"WINTER/SUMMER PEAKING",null,"Non-coincident"]
[null,null,null,null,"Coincident"]
[null,null,"ADJUSTMENTS - EMBEDDED GENERATION","MW","Non-coincident"]
[null,null,null,null,"Coincident"]
[null,null,"WEATHER CORRECTED MD 10% POE","MW","Non-coincident"]
[null,null,null,null,"Coincident"]
[null,null,"WEATHER CORRECTED MD 10% POE","MVA","Non-coincident"]
[null,null,null,null,"Coincident"]
[null,null,"WEATHER CORRECTED MD 50% POE","MW","Non-coincident"]
[null,null,null,null,"Coincident"]
[null,null,"WEATHER CORRECTED MD 50% POE","MVA","Non-coincident"]
[null,null,null,null,"Coincident"]
[null,"NSP to enter name","CONNECTION POINT RATING","MVA","Non-coincident"]
[null,null,null,null,"Coincident"]
[null,null,"WINTER/SUMMER PEAKING",null,"Non-coincident"]
[null,null,null,null,"Coincident"]
[null,null,"ADJUSTMENTS - EMBEDDED GENERATION","MW","Non-coincident"]
[null,null,null,null,"Coincident"]
[null,null,"WEATHER CORRECTED MD 10% POE","MW","Non-coincident"]
[null,null,null,null,"Coincident"]
[null,null,"WEATHER CORRECTED MD 10% POE","MVA","Non-coincident"]
[null,null,null,null,"Coincident"]
[null,null,"WEATHER CORRECTED MD 50% POE","MW","Non-coincident"]
[null,null,null,null,"Coincident"]
[null,null,"WEATHER CORRECTED MD 50% POE","MVA","Non-coincident"]
[null,null,null,null,"Coincident"]
[null,"NSP to enter name","CONNECTION POINT RATING","MVA","Non-coincident"]
[null,null,null,null,"Coincident"]
[null,null,"WINTER/SUMMER PEAKING",null,"Non-coincident"]
[null,null,null,null,"Coincident"]
[null,null,"ADJUSTMENTS - EMBEDDED GENERATION","MW","Non-coincident"]
[null,null,null,null,"Coincident"]
[null,null,"WEATHER CORRECTED MD 10% POE","MW","Non-coincident"]
[null,null,null,null,"Coincident"]
[null,null,"WEATHER CORRECTED MD 10% POE","MVA","Non-coincident"]
[null,null,null,null,"Coincident"]
[null,null,"WEATHER CORRECTED MD 50% POE","MW","Non-coincident"]
[null,null,null,null,"Coincident"]
[null,null,"WEATHER CORRECTED MD 50% POE","MVA","Non-coincident"]
[null,null,null,null,"Coincident"]
[null,"NSP to enter name","CONNECTION POINT RATING","MVA","Non-coincident"]
[null,null,null,null,"Coincident"]
[null,null,"WINTER/SUMMER PEAKING",null,"Non-coincident"]
[null,null,null,null,"Coincident"]
[null,null,"ADJUSTMENTS - EMBEDDED GENERATION","MW","Non-coincident"]
[null,null,null,null,"Coincident"]
[null,null,"WEATHER CORRECTED MD 10% POE","MW","Non-coincident"]
[null,null,null,null,"Coincident"]
[null,null,"WEATHER CORRECTED MD 10% POE","MVA","Non-coincident"]
[null,null,null,null,"Coincident"]
[null,null,"WEATHER CORRECTED MD 50% POE","MW","Non-coincident"]
[null,null,null,null,"Coincident"]
[null,null,"WEATHER CORRECTED MD 50% POE","MVA","Non-coincident"]
[null,null,null,null,"Coincident"]
[null,"NSP to enter name","CONNECTION POINT RATING","MVA","Non-coincident"]
[null,null,null,null,"Coincident"]
[null,null,"WINTER/SUMMER PEAKING",null,"Non-coincident"]
[null,null,null,null,"Coincident"]
[null,null,"ADJUSTMENTS - EMBEDDED GENERATION","MW","Non-coincident"]
[null,null,null,null,"Coincident"]
[null,null,"WEATHER CORRECTED MD 10% POE","MW","Non-coincident"]
[null,null,null,null,"Coincident"]
[null,null,"WEATHER CORRECTED MD 10% POE","MVA","Non-coincident"]
[null,null,null,null,"Coincident"]
[null,null,"WEATHER CORRECTED MD 50% POE","MW","Non-coincident"]
[null,null,null,null,"Coincident"]
[null,null,"WEATHER CORRECTED MD 50% POE","MVA","Non-coincident"]
[null,null,null,null,"Coincident"]
[null,"NSP to enter name","CONNECTION POINT RATING","MVA","Non-coincident"]
[null,null,null,null,"Coincident"]
[null,null,"WINTER/SUMMER PEAKING",null,"Non-coincident"]
[null,null,null,null,"Coincident"]
[null,null,"ADJUSTMENTS - EMBEDDED GENERATION","MW","Non-coincident"]
[null,null,null,null,"Coincident"]
[null,null,"WEATHER CORRECTED MD 10% POE","MW","Non-coincident"]
[null,null,null,null,"Coincident"]
[null,null,"WEATHER CORRECTED MD 10% POE","MVA","Non-coincident"]
[null,null,null,null,"Coincident"]
[null,null,"WEATHER CORRECTED MD 50% POE","MW","Non-coincident"]
[null,null,null,null,"Coincident"]
[null,null,"WEATHER CORRECTED MD 50% POE","MVA","Non-coincident"]
[null,null,null,null,"Coincident"]
[null,"NSP to enter name","CONNECTION POINT RATING","MVA","Non-coincident"]
[null,null,null,null,"Coincident"]
[null,null,"WINTER/SUMMER PEAKING",null,"Non-coincident"]
[null,null,null,null,"Coincident"]
[null,null,"ADJUSTMENTS - EMBEDDED GENERATION","MW","Non-coincident"]
[null,null,null,null,"Coincident"]
[null,null,"WEATHER CORRECTED MD 10% POE","MW","Non-coincident"]
[null,null,null,null,"Coincident"]
[null,null,"WEATHER CORRECTED MD 10% POE","MVA","Non-coincident"]
[null,null,null,null,"Coincident"]
[null,null,"WEATHER CORRECTED MD 50% POE","MW","Non-coincident"]
[null,null,null,null,"Coincident"]
[null,null,"WEATHER CORRECTED MD 50% POE","MVA","Non-coincident"]
[null,null,null,null,"Coincident"]
[null,"NSP to enter name","CONNECTION POINT RATING","MVA","Non-coincident"]
[null,null,null,null,"Coincident"]
[null,null,"WINTER/SUMMER PEAKING",null,"Non-coincident"]
[null,null,null,null,"Coincident"]
[null,null,"ADJUSTMENTS - EMBEDDED GENERATION","MW","Non-coincident"]
[null,null,null,null,"Coincident"]
[null,null,"WEATHER CORRECTED MD 10% POE","MW","Non-coincident"]
[null,null,null,null,"Coincident"]
[null,null,"WEATHER CORRECTED MD 10% POE","MVA","Non-coincident"]
[null,null,null,null,"Coincident"]
[null,null,"WEATHER CORRECTED MD 50% POE","MW","Non-coincident"]
[null,null,null,null,"Coincident"]
[null,null,"WEATHER CORRECTED MD 50% POE","MVA","Non-coincident"]
[null,null,null,null,"Coincident"]
[null,"NSP to enter name","CONNECTION POINT RATING","MVA","Non-coincident"]
[null,null,null,null,"Coincident"]
[null,null,"WINTER/SUMMER PEAKING",null,"Non-coincident"]
[null,null,null,null,"Coincident"]
[null,null,"ADJUSTMENTS - EMBEDDED GENERATION","MW","Non-coincident"]
[null,null,null,null,"Coincident"]
[null,null,"WEATHER CORRECTED MD 10% POE","MW","Non-coincident"]
[null,null,null,null,"Coincident"]
[null,null,"WEATHER CORRECTED MD 10% POE","MVA","Non-coincident"]
[null,null,null,null,"Coincident"]
[null,null,"WEATHER CORRECTED MD 50% POE","MW","Non-coincident"]
[null,null,null,null,"Coincident"]
[null,null,"WEATHER CORRECTED MD 50% POE","MVA","Non-coincident"]
[null,null,null,null,"Coincident"]
[null,"NSP to enter name","CONNECTION POINT RATING","MVA","Non-coincident"]
[null,null,null,null,"Coincident"]
[null,null,"WINTER/SUMMER PEAKING",null,"Non-coincident"]
[null,null,null,null,"Coincident"]
[null,null,"ADJUSTMENTS - EMBEDDED GENERATION","MW","Non-coincident"]
[null,null,null,null,"Coincident"]
[null,null,"WEATHER CORRECTED MD 10% POE","MW","Non-coincident"]
[null,null,null,null,"Coincident"]
[null,null,"WEATHER CORRECTED MD 10% POE","MVA","Non-coincident"]
[null,null,null,null,"Coincident"]
[null,null,"WEATHER CORRECTED MD 50% POE","MW","Non-coincident"]
[null,null,null,null,"Coincident"]
[null,null,"WEATHER CORRECTED MD 50% POE","MVA","Non-coincident"]
[null,null,null,null,"Coincident"]
[null,"NSP to enter name","CONNECTION POINT RATING","MVA","Non-coincident"]
[null,null,null,null,"Coincident"]
[null,null,"WINTER/SUMMER PEAKING",null,"Non-coincident"]
[null,null,null,null,"Coincident"]
[null,null,"ADJUSTMENTS - EMBEDDED GENERATION","MW","Non-coincident"]
[null,null,null,null,"Coincident"]
[null,null,"WEATHER CORRECTED MD 10% POE","MW","Non-coincident"]
[null,null,null,null,"Coincident"]
[null,null,"WEATHER CORRECTED MD 10% POE","MVA","Non-coincident"]
[null,null,null,null,"Coincident"]
[null,null,"WEATHER CORRECTED MD 50% POE","MW","Non-coincident"]
[null,null,null,null,"Coincident"]
[null,null,"WEATHER CORRECTED MD 50% POE","MVA","Non-coincident"]
[null,null,null,null,"Coincident"]
[null,"NSP to enter name","CONNECTION POINT RATING","MVA","Non-coincident"]
[null,null,null,null,"Coincident"]
[null,null,"WINTER/SUMMER PEAKING",null,"Non-coincident"]
[null,null,null,null,"Coincident"]
[null,null,"ADJUSTMENTS - EMBEDDED GENERATION","MW","Non-coincident"]
[null,null,null,null,"Coincident"]
[null,null,"WEATHER CORRECTED MD 10% POE","MW","Non-coincident"]
[null,null,null,null,"Coincident"]
[null,null,"WEATHER CORRECTED MD 10% POE","MVA","Non-coincident"]
[null,null,null,null,"Coincident"]
[null,null,"WEATHER CORRECTED MD 50% POE","MW","Non-coincident"]
[null,null,null,null,"Coincident"]
[null,null,"WEATHER CORRECTED MD 50% POE","MVA","Non-coincident"]
[null,null,null,null,"Coincident"]
[null,"NSP to enter name","CONNECTION POINT RATING","MVA","Non-coincident"]
[null,null,null,null,"Coincident"]
[null,null,"WINTER/SUMMER PEAKING",null,"Non-coincident"]
[null,null,null,null,"Coincident"]
[null,null,"ADJUSTMENTS - EMBEDDED GENERATION","MW","Non-coincident"]
[null,null,null,null,"Coincident"]
[null,null,"WEATHER CORRECTED MD 10% POE","MW","Non-coincident"]
[null,null,null,null,"Coincident"]
[null,null,"WEATHER CORRECTED MD 10% POE","MVA","Non-coincident"]
[null,null,null,null,"Coincident"]
[null,null,"WEATHER CORRECTED MD 50% POE","MW","Non-coincident"]
[null,null,null,null,"Coincident"]
[null,null,"WEATHER CORRECTED MD 50% POE","MVA","Non-coincident"]
[null,null,null,null,"Coincident"]
[null,"NSP to enter name","CONNECTION POINT RATING","MVA","Non-coincident"]
[null,null,null,null,"Coincident"]
[null,null,"WINTER/SUMMER PEAKING",null,"Non-coincident"]
[null,null,null,null,"Coincident"]
[null,null,"ADJUSTMENTS - EMBEDDED GENERATION","MW","Non-coincident"]
[null,null,null,null,"Coincident"]
[null,null,"WEATHER CORRECTED MD 10% POE","MW","Non-coincident"]
[null,null,null,null,"Coincident"]
[null,null,"WEATHER CORRECTED MD 10% POE","MVA","Non-coincident"]
[null,null,null,null,"Coincident"]
[null,null,"WEATHER CORRECTED MD 50% POE","MW","Non-coincident"]
[null,null,null,null,"Coincident"]
[null,null,"WEATHER CORRECTED MD 50% POE","MVA","Non-coincident"]
[null,null,null,null,"Coincident"]
[null,"NSP to enter name","CONNECTION POINT RATING","MVA","Non-coincident"]
[null,null,null,null,"Coincident"]
[null,null,"WINTER/SUMMER PEAKING",null,"Non-coincident"]
[null,null,null,null,"Coincident"]
[null,null,"ADJUSTMENTS - EMBEDDED GENERATION","MW","Non-coincident"]
[null,null,null,null,"Coincident"]
[null,null,"WEATHER CORRECTED MD 10% POE","MW","Non-coincident"]
[null,null,null,null,"Coincident"]
[null,null,"WEATHER CORRECTED MD 10% POE","MVA","Non-coincident"]
[null,null,null,null,"Coincident"]
[null,null,"WEATHER CORRECTED MD 50% POE","MW","Non-coincident"]
[null,null,null,null,"Coincident"]
[null,null,"WEATHER CORRECTED MD 50% POE","MVA","Non-coincident"]
[null,null,null,null,"Coincident"]
[null,"NSP to enter name","CONNECTION POINT RATING","MVA","Non-coincident"]
[null,null,null,null,"Coincident"]
[null,null,"WINTER/SUMMER PEAKING",null,"Non-coincident"]
[null,null,null,null,"Coincident"]
[null,null,"ADJUSTMENTS - EMBEDDED GENERATION","MW","Non-coincident"]
[null,null,null,null,"Coincident"]
[null,null,"WEATHER CORRECTED MD 10% POE","MW","Non-coincident"]
[null,null,null,null,"Coincident"]
[null,null,"WEATHER CORRECTED MD 10% POE","MVA","Non-coincident"]
[null,null,null,null,"Coincident"]
[null,null,"WEATHER CORRECTED MD 50% POE","MW","Non-coincident"]
[null,null,null,null,"Coincident"]
[null,null,"WEATHER CORRECTED MD 50% POE","MVA","Non-coincident"]
[null,null,null,null,"Coincident"]
[null,"NSP to enter name","CONNECTION POINT RATING","MVA","Non-coincident"]
[null,null,null,null,"Coincident"]
[null,null,"WINTER/SUMMER PEAKING",null,"Non-coincident"]
[null,null,null,null,"Coincident"]
[null,null,"ADJUSTMENTS - EMBEDDED GENERATION","MW","Non-coincident"]
[null,null,null,null,"Coincident"]
[null,null,"WEATHER CORRECTED MD 10% POE","MW","Non-coincident"]
[null,null,null,null,"Coincident"]
[null,null,"WEATHER CORRECTED MD 10% POE","MVA","Non-coincident"]
[null,null,null,null,"Coincident"]
[null,null,"WEATHER CORRECTED MD 50% POE","MW","Non-coincident"]
[null,null,null,null,"Coincident"]
[null,null,"WEATHER CORRECTED MD 50% POE","MVA","Non-coincident"]
[null,null,null,null,"Coincident"]
[null,"NSP to enter name","CONNECTION POINT RATING","MVA","Non-coincident"]
[null,null,null,null,"Coincident"]
[null,null,"WINTER/SUMMER PEAKING",null,"Non-coincident"]
[null,null,null,null,"Coincident"]
[null,null,"ADJUSTMENTS - EMBEDDED GENERATION","MW","Non-coincident"]
[null,null,null,null,"Coincident"]
[null,null,"WEATHER CORRECTED MD 10% POE","MW","Non-coincident"]
[null,null,null,null,"Coincident"]
[null,null,"WEATHER CORRECTED MD 10% POE","MVA","Non-coincident"]
[null,null,null,null,"Coincident"]
[null,null,"WEATHER CORRECTED MD 50% POE","MW","Non-coincident"]
[null,null,null,null,"Coincident"]
[null,null,"WEATHER CORRECTED MD 50% POE","MVA","Non-coincident"]
[null,null,null,null,"Coincident"]
[null,"NSP to enter name","CONNECTION POINT RATING","MVA","Non-coincident"]
[null,null,null,null,"Coincident"]
[null,null,"WINTER/SUMMER PEAKING",null,"Non-coincident"]
[null,null,null,null,"Coincident"]
[null,null,"ADJUSTMENTS - EMBEDDED GENERATION","MW","Non-coincident"]
[null,null,null,null,"Coincident"]
[null,null,"WEATHER CORRECTED MD 10% POE","MW","Non-coincident"]
[null,null,null,null,"Coincident"]
[null,null,"WEATHER CORRECTED MD 10% POE","MVA","Non-coincident"]
[null,null,null,null,"Coincident"]
[null,null,"WEATHER CORRECTED MD 50% POE","MW","Non-coincident"]
[null,null,null,null,"Coincident"]
[null,null,"WEATHER CORRECTED MD 50% POE","MVA","Non-coincident"]
[null,null,null,null,"Coincident"]
[null,"NSP to enter name","CONNECTION POINT RATING","MVA","Non-coincident"]
[null,null,null,null,"Coincident"]
[null,null,"WINTER/SUMMER PEAKING",null,"Non-coincident"]
[null,null,null,null,"Coincident"]
[null,null,"ADJUSTMENTS - EMBEDDED GENERATION","MW","Non-coincident"]
[null,null,null,null,"Coincident"]
[null,null,"WEATHER CORRECTED MD 10% POE","MW","Non-coincident"]
[null,null,null,null,"Coincident"]
[null,null,"WEATHER CORRECTED MD 10% POE","MVA","Non-coincident"]
[null,null,null,null,"Coincident"]
[null,null,"WEATHER CORRECTED MD 50% POE","MW","Non-coincident"]
[null,null,null,null,"Coincident"]
[null,null,"WEATHER CORRECTED MD 50% POE","MVA","Non-coincident"]
[null,null,null,null,"Coincident"]
[null,"NSP to enter name","CONNECTION POINT RATING","MVA","Non-coincident"]
[null,null,null,null,"Coincident"]
[null,null,"WINTER/SUMMER PEAKING",null,"Non-coincident"]
[null,null,null,null,"Coincident"]
[null,null,"ADJUSTMENTS - EMBEDDED GENERATION","MW","Non-coincident"]
[null,null,null,null,"Coincident"]
[null,null,"WEATHER CORRECTED MD 10% POE","MW","Non-coincident"]
[null,null,null,null,"Coincident"]
[null,null,"WEATHER CORRECTED MD 10% POE","MVA","Non-coincident"]
[null,null,null,null,"Coincident"]
[null,null,"WEATHER CORRECTED MD 50% POE","MW","Non-coincident"]
[null,null,null,null,"Coincident"]
[null,null,"WEATHER CORRECTED MD 50% POE","MVA","Non-coincident"]
[null,null,null,null,"Coincident"]
[null,"NSP to enter name","CONNECTION POINT RATING","MVA","Non-coincident"]
[null,null,null,null,"Coincident"]
[null,null,"WINTER/SUMMER PEAKING",null,"Non-coincident"]
[null,null,null,null,"Coincident"]
[null,null,"ADJUSTMENTS - EMBEDDED GENERATION","MW","Non-coincident"]
[null,null,null,null,"Coincident"]
[null,null,"WEATHER CORRECTED MD 10% POE","MW","Non-coincident"]
[null,null,null,null,"Coincident"]
[null,null,"WEATHER CORRECTED MD 10% POE","MVA","Non-coincident"]
[null,null,null,null,"Coincident"]
[null,null,"WEATHER CORRECTED MD 50% POE","MW","Non-coincident"]
[null,null,null,null,"Coincident"]
[null,null,"WEATHER CORRECTED MD 50% POE","MVA","Non-coincident"]
[null,null,null,null,"Coincident"]
[null,"NSP to enter name","CONNECTION POINT RATING","MVA","Non-coincident"]
[null,null,null,null,"Coincident"]
[null,null,"WINTER/SUMMER PEAKING",null,"Non-coincident"]
[null,null,null,null,"Coincident"]
[null,null,"ADJUSTMENTS - EMBEDDED GENERATION","MW","Non-coincident"]
[null,null,null,null,"Coincident"]
[null,null,"WEATHER CORRECTED MD 10% POE","MW","Non-coincident"]
[null,null,null,null,"Coincident"]
[null,null,"WEATHER CORRECTED MD 10% POE","MVA","Non-coincident"]
[null,null,null,null,"Coincident"]
[null,null,"WEATHER CORRECTED MD 50% POE","MW","Non-coincident"]
[null,null,null,null,"Coincident"]
[null,null,"WEATHER CORRECTED MD 50% POE","MVA","Non-coincident"]
[null,null,null,null,"Coincident"]
[null,"NSP to enter name","CONNECTION POINT RATING","MVA","Non-coincident"]
[null,null,null,null,"Coincident"]
[null,null,"WINTER/SUMMER PEAKING",null,"Non-coincident"]
[null,null,null,null,"Coincident"]
[null,null,"ADJUSTMENTS - EMBEDDED GENERATION","MW","Non-coincident"]
[null,null,null,null,"Coincident"]
[null,null,"WEATHER CORRECTED MD 10% POE","MW","Non-coincident"]
[null,null,null,null,"Coincident"]
[null,null,"WEATHER CORRECTED MD 10% POE","MVA","Non-coincident"]
[null,null,null,null,"Coincident"]
[null,null,"WEATHER CORRECTED MD 50% POE","MW","Non-coincident"]
[null,null,null,null,"Coincident"]
[null,null,"WEATHER CORRECTED MD 50% POE","MVA","Non-coincident"]
[null,null,null,null,"Coincident"]
[null,"NSP to enter name","CONNECTION POINT RATING","MVA","Non-coincident"]
[null,null,null,null,"Coincident"]
[null,null,"WINTER/SUMMER PEAKING",null,"Non-coincident"]
[null,null,null,null,"Coincident"]
[null,null,"ADJUSTMENTS - EMBEDDED GENERATION","MW","Non-coincident"]
[null,null,null,null,"Coincident"]
[null,null,"WEATHER CORRECTED MD 10% POE","MW","Non-coincident"]
[null,null,null,null,"Coincident"]
[null,null,"WEATHER CORRECTED MD 10% POE","MVA","Non-coincident"]
[null,null,null,null,"Coincident"]
[null,null,"WEATHER CORRECTED MD 50% POE","MW","Non-coincident"]
[null,null,null,null,"Coincident"]
[null,null,"WEATHER CORRECTED MD 50% POE","MVA","Non-coincident"]
[null,null,null,null,"Coincident"]
[null,"NSP to enter name","CONNECTION POINT RATING","MVA","Non-coincident"]
[null,null,null,null,"Coincident"]
[null,null,"WINTER/SUMMER PEAKING",null,"Non-coincident"]
[null,null,null,null,"Coincident"]
[null,null,"ADJUSTMENTS - EMBEDDED GENERATION","MW","Non-coincident"]
[null,null,null,null,"Coincident"]
[null,null,"WEATHER CORRECTED MD 10% POE","MW","Non-coincident"]
[null,null,null,null,"Coincident"]
[null,null,"WEATHER CORRECTED MD 10% POE","MVA","Non-coincident"]
[null,null,null,null,"Coincident"]
[null,null,"WEATHER CORRECTED MD 50% POE","MW","Non-coincident"]
[null,null,null,null,"Coincident"]
[null,null,"WEATHER CORRECTED MD 50% POE","MVA","Non-coincident"]
[null,null,null,null,"Coincident"]
[null,"NSP to enter name","CONNECTION POINT RATING","MVA","Non-coincident"]
[null,null,null,null,"Coincident"]
[null,null,"WINTER/SUMMER PEAKING",null,"Non-coincident"]
[null,null,null,null,"Coincident"]
[null,null,"ADJUSTMENTS - EMBEDDED GENERATION","MW","Non-coincident"]
[null,null,null,null,"Coincident"]
[null,null,"WEATHER CORRECTED MD 10% POE","MW","Non-coincident"]
[null,null,null,null,"Coincident"]
[null,null,"WEATHER CORRECTED MD 10% POE","MVA","Non-coincident"]
[null,null,null,null,"Coincident"]
[null,null,"WEATHER CORRECTED MD 50% POE","MW","Non-coincident"]
[null,null,null,null,"Coincident"]
[null,null,"WEATHER CORRECTED MD 50% POE","MVA","Non-coincident"]
[null,null,null,null,"Coincident"]
[null,"NSP to enter name","CONNECTION POINT RATING","MVA","Non-coincident"]
[null,null,null,null,"Coincident"]
[null,null,"WINTER/SUMMER PEAKING",null,"Non-coincident"]
[null,null,null,null,"Coincident"]
[null,null,"ADJUSTMENTS - EMBEDDED GENERATION","MW","Non-coincident"]
[null,null,null,null,"Coincident"]
[null,null,"WEATHER CORRECTED MD 10% POE","MW","Non-coincident"]
[null,null,null,null,"Coincident"]
[null,null,"WEATHER CORRECTED MD 10% POE","MVA","Non-coincident"]
[null,null,null,null,"Coincident"]
[null,null,"WEATHER CORRECTED MD 50% POE","MW","Non-coincident"]
[null,null,null,null,"Coincident"]
[null,null,"WEATHER CORRECTED MD 50% POE","MVA","Non-coincident"]
[null,null,null,null,"Coincident"]
[null,"NSP to enter name","CONNECTION POINT RATING","MVA","Non-coincident"]
[null,null,null,null,"Coincident"]
[null,null,"WINTER/SUMMER PEAKING",null,"Non-coincident"]
[null,null,null,null,"Coincident"]
[null,null,"ADJUSTMENTS - EMBEDDED GENERATION","MW","Non-coincident"]
[null,null,null,null,"Coincident"]
[null,null,"WEATHER CORRECTED MD 10% POE","MW","Non-coincident"]
[null,null,null,null,"Coincident"]
[null,null,"WEATHER CORRECTED MD 10% POE","MVA","Non-coincident"]
[null,null,null,null,"Coincident"]
[null,null,"WEATHER CORRECTED MD 50% POE","MW","Non-coincident"]
[null,null,null,null,"Coincident"]
[null,null,"WEATHER CORRECTED MD 50% POE","MVA","Non-coincident"]
[null,null,null,null,"Coincident"]
[null,"NSP to enter name","CONNECTION POINT RATING","MVA","Non-coincident"]
[null,null,null,null,"Coincident"]
[null,null,"WINTER/SUMMER PEAKING",null,"Non-coincident"]
[null,null,null,null,"Coincident"]
[null,null,"ADJUSTMENTS - EMBEDDED GENERATION","MW","Non-coincident"]
[null,null,null,null,"Coincident"]
[null,null,"WEATHER CORRECTED MD 10% POE","MW","Non-coincident"]
[null,null,null,null,"Coincident"]
[null,null,"WEATHER CORRECTED MD 10% POE","MVA","Non-coincident"]
[null,null,null,null,"Coincident"]
[null,null,"WEATHER CORRECTED MD 50% POE","MW","Non-coincident"]
[null,null,null,null,"Coincident"]
[null,null,"WEATHER CORRECTED MD 50% POE","MVA","Non-coincident"]
[null,null,null,null,"Coincident"]
[null,"NSP to enter name","CONNECTION POINT RATING","MVA","Non-coincident"]
[null,null,null,null,"Coincident"]
[null,null,"WINTER/SUMMER PEAKING",null,"Non-coincident"]
[null,null,null,null,"Coincident"]
[null,null,"ADJUSTMENTS - EMBEDDED GENERATION","MW","Non-coincident"]
[null,null,null,null,"Coincident"]
[null,null,"WEATHER CORRECTED MD 10% POE","MW","Non-coincident"]
[null,null,null,null,"Coincident"]
[null,null,"WEATHER CORRECTED MD 10% POE","MVA","Non-coincident"]
[null,null,null,null,"Coincident"]
[null,null,"WEATHER CORRECTED MD 50% POE","MW","Non-coincident"]
[null,null,null,null,"Coincident"]
[null,null,"WEATHER CORRECTED MD 50% POE","MVA","Non-coincident"]
[null,null,null,null,"Coincident"]
[null,"NSP to enter name","CONNECTION POINT RATING","MVA","Non-coincident"]
[null,null,null,null,"Coincident"]
[null,null,"WINTER/SUMMER PEAKING",null,"Non-coincident"]
[null,null,null,null,"Coincident"]
[null,null,"ADJUSTMENTS - EMBEDDED GENERATION","MW","Non-coincident"]
[null,null,null,null,"Coincident"]
[null,null,"WEATHER CORRECTED MD 10% POE","MW","Non-coincident"]
[null,null,null,null,"Coincident"]
[null,null,"WEATHER CORRECTED MD 10% POE","MVA","Non-coincident"]
[null,null,null,null,"Coincident"]
[null,null,"WEATHER CORRECTED MD 50% POE","MW","Non-coincident"]
[null,null,null,null,"Coincident"]
[null,null,"WEATHER CORRECTED MD 50% POE","MVA","Non-coincident"]
[null,null,null,null,"Coincident"]
[null,"NSP to enter name","CONNECTION POINT RATING","MVA","Non-coincident"]
[null,null,null,null,"Coincident"]
[null,null,"WINTER/SUMMER PEAKING",null,"Non-coincident"]
[null,null,null,null,"Coincident"]
[null,null,"ADJUSTMENTS - EMBEDDED GENERATION","MW","Non-coincident"]
[null,null,null,null,"Coincident"]
[null,null,"WEATHER CORRECTED MD 10% POE","MW","Non-coincident"]
[null,null,null,null,"Coincident"]
[null,null,"WEATHER CORRECTED MD 10% POE","MVA","Non-coincident"]
[null,null,null,null,"Coincident"]
[null,null,"WEATHER CORRECTED MD 50% POE","MW","Non-coincident"]
[null,null,null,null,"Coincident"]
[null,null,"WEATHER CORRECTED MD 50% POE","MVA","Non-coincident"]
[null,null,null,null,"Coincident"]
[null,"NSP to enter name","CONNECTION POINT RATING","MVA","Non-coincident"]
[null,null,null,null,"Coincident"]
[null,null,"WINTER/SUMMER PEAKING",null,"Non-coincident"]
[null,null,null,null,"Coincident"]
[null,null,"ADJUSTMENTS - EMBEDDED GENERATION","MW","Non-coincident"]
[null,null,null,null,"Coincident"]
[null,null,"WEATHER CORRECTED MD 10% POE","MW","Non-coincident"]
[null,null,null,null,"Coincident"]
[null,null,"WEATHER CORRECTED MD 10% POE","MVA","Non-coincident"]
[null,null,null,null,"Coincident"]
[null,null,"WEATHER CORRECTED MD 50% POE","MW","Non-coincident"]
[null,null,null,null,"Coincident"]
[null,null,"WEATHER CORRECTED MD 50% POE","MVA","Non-coincident"]
[null,null,null,null,"Coincident"]
[null,"NSP to enter name","CONNECTION POINT RATING","MVA","Non-coincident"]
[null,null,null,null,"Coincident"]
[null,null,"WINTER/SUMMER PEAKING",null,"Non-coincident"]
[null,null,null,null,"Coincident"]
[null,null,"ADJUSTMENTS - EMBEDDED GENERATION","MW","Non-coincident"]
[null,null,null,null,"Coincident"]
[null,null,"WEATHER CORRECTED MD 10% POE","MW","Non-coincident"]
[null,null,null,null,"Coincident"]
[null,null,"WEATHER CORRECTED MD 10% POE","MVA","Non-coincident"]
[null,null,null,null,"Coincident"]
[null,null,"WEATHER CORRECTED MD 50% POE","MW","Non-coincident"]
[null,null,null,null,"Coincident"]
[null,null,"WEATHER CORRECTED MD 50% POE","MVA","Non-coincident"]
[null,null,null,null,"Coincident"]
[null,"NSP to enter name","CONNECTION POINT RATING","MVA","Non-coincident"]
[null,null,null,null,"Coincident"]
[null,null,"WINTER/SUMMER PEAKING",null,"Non-coincident"]
[null,null,null,null,"Coincident"]
[null,null,"ADJUSTMENTS - EMBEDDED GENERATION","MW","Non-coincident"]
[null,null,null,null,"Coincident"]
[null,null,"WEATHER CORRECTED MD 10% POE","MW","Non-coincident"]
[null,null,null,null,"Coincident"]
[null,null,"WEATHER CORRECTED MD 10% POE","MVA","Non-coincident"]
[null,null,null,null,"Coincident"]
[null,null,"WEATHER CORRECTED MD 50% POE","MW","Non-coincident"]
[null,null,null,null,"Coincident"]
[null,null,"WEATHER CORRECTED MD 50% POE","MVA","Non-coincident"]
[null,null,null,null,"Coincident"]
[null,"NSP to enter name","CONNECTION POINT RATING","MVA","Non-coincident"]
[null,null,null,null,"Coincident"]
[null,null,"WINTER/SUMMER PEAKING",null,"Non-coincident"]
[null,null,null,null,"Coincident"]
[null,null,"ADJUSTMENTS - EMBEDDED GENERATION","MW","Non-coincident"]
[null,null,null,null,"Coincident"]
[null,null,"WEATHER CORRECTED MD 10% POE","MW","Non-coincident"]
[null,null,null,null,"Coincident"]
[null,null,"WEATHER CORRECTED MD 10% POE","MVA","Non-coincident"]
[null,null,null,null,"Coincident"]
[null,null,"WEATHER CORRECTED MD 50% POE","MW","Non-coincident"]
[null,null,null,null,"Coincident"]
[null,null,"WEATHER CORRECTED MD 50% POE","MVA","Non-coincident"]
[null,null,null,null,"Coincident"]
[null,"NSP to enter name","CONNECTION POINT RATING","MVA","Non-coincident"]
[null,null,null,null,"Coincident"]
[null,null,"WINTER/SUMMER PEAKING",null,"Non-coincident"]
[null,null,null,null,"Coincident"]
[null,null,"ADJUSTMENTS - EMBEDDED GENERATION","MW","Non-coincident"]
[null,null,null,null,"Coincident"]
[null,null,"WEATHER CORRECTED MD 10% POE","MW","Non-coincident"]
[null,null,null,null,"Coincident"]
[null,null,"WEATHER CORRECTED MD 10% POE","MVA","Non-coincident"]
[null,null,null,null,"Coincident"]
[null,null,"WEATHER CORRECTED MD 50% POE","MW","Non-coincident"]
[null,null,null,null,"Coincident"]
[null,null,"WEATHER CORRECTED MD 50% POE","MVA","Non-coincident"]
[null,null,null,null,"Coincident"]
[null,"NSP to enter name","CONNECTION POINT RATING","MVA","Non-coincident"]
[null,null,null,null,"Coincident"]
[null,null,"WINTER/SUMMER PEAKING",null,"Non-coincident"]
[null,null,null,null,"Coincident"]
[null,null,"ADJUSTMENTS - EMBEDDED GENERATION","MW","Non-coincident"]
[null,null,null,null,"Coincident"]
[null,null,"WEATHER CORRECTED MD 10% POE","MW","Non-coincident"]
[null,null,null,null,"Coincident"]
[null,null,"WEATHER CORRECTED MD 10% POE","MVA","Non-coincident"]
[null,null,null,null,"Coincident"]
[null,null,"WEATHER CORRECTED MD 50% POE","MW","Non-coincident"]
[null,null,null,null,"Coincident"]
[null,null,"WEATHER CORRECTED MD 50% POE","MVA","Non-coincident"]
[null,null,null,null,"Coincident"]
[null,"NSP to enter name","CONNECTION POINT RATING","MVA","Non-coincident"]
[null,null,null,null,"Coincident"]
[null,null,"WINTER/SUMMER PEAKING",null,"Non-coincident"]
[null,null,null,null,"Coincident"]
[null,null,"ADJUSTMENTS - EMBEDDED GENERATION","MW","Non-coincident"]
[null,null,null,null,"Coincident"]
[null,null,"WEATHER CORRECTED MD 10% POE","MW","Non-coincident"]
[null,null,null,null,"Coincident"]
[null,null,"WEATHER CORRECTED MD 10% POE","MVA","Non-coincident"]
[null,null,null,null,"Coincident"]
[null,null,"WEATHER CORRECTED MD 50% POE","MW","Non-coincident"]
[null,null,null,null,"Coincident"]
[null,null,"WEATHER CORRECTED MD 50% POE","MVA","Non-coincident"]
[null,null,null,null,"Coincident"]
[null,"NSP to enter name","CONNECTION POINT RATING","MVA","Non-coincident"]
[null,null,null,null,"Coincident"]
[null,null,"WINTER/SUMMER PEAKING",null,"Non-coincident"]
[null,null,null,null,"Coincident"]
[null,null,"ADJUSTMENTS - EMBEDDED GENERATION","MW","Non-coincident"]
[null,null,null,null,"Coincident"]
[null,null,"WEATHER CORRECTED MD 10% POE","MW","Non-coincident"]
[null,null,null,null,"Coincident"]
[null,null,"WEATHER CORRECTED MD 10% POE","MVA","Non-coincident"]
[null,null,null,null,"Coincident"]
[null,null,"WEATHER CORRECTED MD 50% POE","MW","Non-coincident"]
[null,null,null,null,"Coincident"]
[null,null,"WEATHER CORRECTED MD 50% POE","MVA","Non-coincident"]
[null,null,null,null,"Coincident"]
[null,"NSP to enter name","CONNECTION POINT RATING","MVA","Non-coincident"]
[null,null,null,null,"Coincident"]
[null,null,"WINTER/SUMMER PEAKING",null,"Non-coincident"]
[null,null,null,null,"Coincident"]
[null,null,"ADJUSTMENTS - EMBEDDED GENERATION","MW","Non-coincident"]
[null,null,null,null,"Coincident"]
[null,null,"WEATHER CORRECTED MD 10% POE","MW","Non-coincident"]
[null,null,null,null,"Coincident"]
[null,null,"WEATHER CORRECTED MD 10% POE","MVA","Non-coincident"]
[null,null,null,null,"Coincident"]
[null,null,"WEATHER CORRECTED MD 50% POE","MW","Non-coincident"]
[null,null,null,null,"Coincident"]
[null,null,"WEATHER CORRECTED MD 50% POE","MVA","Non-coincident"]
[null,null,null,null,"Coincident"]
[null,"NSP to enter name","CONNECTION POINT RATING","MVA","Non-coincident"]
[null,null,null,null,"Coincident"]
[null,null,"WINTER/SUMMER PEAKING",null,"Non-coincident"]
[null,null,null,null,"Coincident"]
[null,null,"ADJUSTMENTS - EMBEDDED GENERATION","MW","Non-coincident"]
[null,null,null,null,"Coincident"]
[null,null,"WEATHER CORRECTED MD 10% POE","MW","Non-coincident"]
[null,null,null,null,"Coincident"]
[null,null,"WEATHER CORRECTED MD 10% POE","MVA","Non-coincident"]
[null,null,null,null,"Coincident"]
[null,null,"WEATHER CORRECTED MD 50% POE","MW","Non-coincident"]
[null,null,null,null,"Coincident"]
[null,null,"WEATHER CORRECTED MD 50% POE","MVA","Non-coincident"]
[null,null,null,null,"Coincident"]
[null,"NSP to enter name","CONNECTION POINT RATING","MVA","Non-coincident"]
[null,null,null,null,"Coincident"]
[null,null,"WINTER/SUMMER PEAKING",null,"Non-coincident"]
[null,null,null,null,"Coincident"]
[null,null,"ADJUSTMENTS - EMBEDDED GENERATION","MW","Non-coincident"]
[null,null,null,null,"Coincident"]
[null,null,"WEATHER CORRECTED MD 10% POE","MW","Non-coincident"]
[null,null,null,null,"Coincident"]
[null,null,"WEATHER CORRECTED MD 10% POE","MVA","Non-coincident"]
[null,null,null,null,"Coincident"]
[null,null,"WEATHER CORRECTED MD 50% POE","MW","Non-coincident"]
[null,null,null,null,"Coincident"]
[null,null,"WEATHER CORRECTED MD 50% POE","MVA","Non-coincident"]
[null,null,null,null,"Coincident"]
[null,"NSP to enter name","CONNECTION POINT RATING","MVA","Non-coincident"]
[null,null,null,null,"Coincident"]
[null,null,"WINTER/SUMMER PEAKING",null,"Non-coincident"]
[null,null,null,null,"Coincident"]
[null,null,"ADJUSTMENTS - EMBEDDED GENERATION","MW","Non-coincident"]
[null,null,null,null,"Coincident"]
[null,null,"WEATHER CORRECTED MD 10% POE","MW","Non-coincident"]
[null,null,null,null,"Coincident"]
[null,null,"WEATHER CORRECTED MD 10% POE","MVA","Non-coincident"]
[null,null,null,null,"Coincident"]
[null,null,"WEATHER CORRECTED MD 50% POE","MW","Non-coincident"]
[null,null,null,null,"Coincident"]
[null,null,"WEATHER CORRECTED MD 50% POE","MVA","Non-coincident"]
[null,null,null,null,"Coincident"]
[null,"NSP to enter name","CONNECTION POINT RATING","MVA","Non-coincident"]
[null,null,null,null,"Coincident"]
[null,null,"WINTER/SUMMER PEAKING",null,"Non-coincident"]
[null,null,null,null,"Coincident"]
[null,null,"ADJUSTMENTS - EMBEDDED GENERATION","MW","Non-coincident"]
[null,null,null,null,"Coincident"]
[null,null,"WEATHER CORRECTED MD 10% POE","MW","Non-coincident"]
[null,null,null,null,"Coincident"]
[null,null,"WEATHER CORRECTED MD 10% POE","MVA","Non-coincident"]
[null,null,null,null,"Coincident"]
[null,null,"WEATHER CORRECTED MD 50% POE","MW","Non-coincident"]
[null,null,null,null,"Coincident"]
[null,null,"WEATHER CORRECTED MD 50% POE","MVA","Non-coincident"]
[null,null,null,null,"Coincident"]
[null,"NSP to enter name","CONNECTION POINT RATING","MVA","Non-coincident"]
[null,null,null,null,"Coincident"]
[null,null,"WINTER/SUMMER PEAKING",null,"Non-coincident"]
[null,null,null,null,"Coincident"]
[null,null,"ADJUSTMENTS - EMBEDDED GENERATION","MW","Non-coincident"]
[null,null,null,null,"Coincident"]
[null,null,"WEATHER CORRECTED MD 10% POE","MW","Non-coincident"]
[null,null,null,null,"Coincident"]
[null,null,"WEATHER CORRECTED MD 10% POE","MVA","Non-coincident"]
[null,null,null,null,"Coincident"]
[null,null,"WEATHER CORRECTED MD 50% POE","MW","Non-coincident"]
[null,null,null,null,"Coincident"]
[null,null,"WEATHER CORRECTED MD 50% POE","MVA","Non-coincident"]
[null,null,null,null,"Coincident"]
[null,"NSP to enter name","CONNECTION POINT RATING","MVA","Non-coincident"]
[null,null,null,null,"Coincident"]
[null,null,"WINTER/SUMMER PEAKING",null,"Non-coincident"]
[null,null,null,null,"Coincident"]
[null,null,"ADJUSTMENTS - EMBEDDED GENERATION","MW","Non-coincident"]
[null,null,null,null,"Coincident"]
[null,null,"WEATHER CORRECTED MD 10% POE","MW","Non-coincident"]
[null,null,null,null,"Coincident"]
[null,null,"WEATHER CORRECTED MD 10% POE","MVA","Non-coincident"]
[null,null,null,null,"Coincident"]
[null,null,"WEATHER CORRECTED MD 50% POE","MW","Non-coincident"]
[null,null,null,null,"Coincident"]
[null,null,"WEATHER CORRECTED MD 50% POE","MVA","Non-coincident"]
[null,null,null,null,"Coincident"]
[null,"NSP to enter name","CONNECTION POINT RATING","MVA","Non-coincident"]
[null,null,null,null,"Coincident"]
[null,null,"WINTER/SUMMER PEAKING",null,"Non-coincident"]
[null,null,null,null,"Coincident"]
[null,null,"ADJUSTMENTS - EMBEDDED GENERATION","MW","Non-coincident"]
[null,null,null,null,"Coincident"]
[null,null,"WEATHER CORRECTED MD 10% POE","MW","Non-coincident"]
[null,null,null,null,"Coincident"]
[null,null,"WEATHER CORRECTED MD 10% POE","MVA","Non-coincident"]
[null,null,null,null,"Coincident"]
[null,null,"WEATHER CORRECTED MD 50% POE","MW","Non-coincident"]
[null,null,null,null,"Coincident"]
[null,null,"WEATHER CORRECTED MD 50% POE","MVA","Non-coincident"]
[null,null,null,null,"Coincident"]
[null,"NSP to enter name","CONNECTION POINT RATING","MVA","Non-coincident"]
[null,null,null,null,"Coincident"]
[null,null,"WINTER/SUMMER PEAKING",null,"Non-coincident"]
[null,null,null,null,"Coincident"]
[null,null,"ADJUSTMENTS - EMBEDDED GENERATION","MW","Non-coincident"]
[null,null,null,null,"Coincident"]
[null,null,"WEATHER CORRECTED MD 10% POE","MW","Non-coincident"]
[null,null,null,null,"Coincident"]
[null,null,"WEATHER CORRECTED MD 10% POE","MVA","Non-coincident"]
[null,null,null,null,"Coincident"]
[null,null,"WEATHER CORRECTED MD 50% POE","MW","Non-coincident"]
[null,null,null,null,"Coincident"]
[null,null,"WEATHER CORRECTED MD 50% POE","MVA","Non-coincident"]
[null,null,null,null,"Coincident"]
[null,"NSP to enter name","CONNECTION POINT RATING","MVA","Non-coincident"]
[null,null,null,null,"Coincident"]
[null,null,"WINTER/SUMMER PEAKING",null,"Non-coincident"]
[null,null,null,null,"Coincident"]
[null,null,"ADJUSTMENTS - EMBEDDED GENERATION","MW","Non-coincident"]
[null,null,null,null,"Coincident"]
[null,null,"WEATHER CORRECTED MD 10% POE","MW","Non-coincident"]
[null,null,null,null,"Coincident"]
[null,null,"WEATHER CORRECTED MD 10% POE","MVA","Non-coincident"]
[null,null,null,null,"Coincident"]
[null,null,"WEATHER CORRECTED MD 50% POE","MW","Non-coincident"]
[null,null,null,null,"Coincident"]
[null,null,"WEATHER CORRECTED MD 50% POE","MVA","Non-coincident"]
[null,null,null,null,"Coincident"]
[null,"NSP to enter name","CONNECTION POINT RATING","MVA","Non-coincident"]
[null,null,null,null,"Coincident"]
[null,null,"WINTER/SUMMER PEAKING",null,"Non-coincident"]
[null,null,null,null,"Coincident"]
[null,null,"ADJUSTMENTS - EMBEDDED GENERATION","MW","Non-coincident"]
[null,null,null,null,"Coincident"]
[null,null,"WEATHER CORRECTED MD 10% POE","MW","Non-coincident"]
[null,null,null,null,"Coincident"]
[null,null,"WEATHER CORRECTED MD 10% POE","MVA","Non-coincident"]
[null,null,null,null,"Coincident"]
[null,null,"WEATHER CORRECTED MD 50% POE","MW","Non-coincident"]
[null,null,null,null,"Coincident"]
[null,null,"WEATHER CORRECTED MD 50% POE","MVA","Non-coincident"]
[null,null,null,null,"Coincident"]
[null,"NSP to enter name","CONNECTION POINT RATING","MVA","Non-coincident"]
[null,null,null,null,"Coincident"]
[null,null,"WINTER/SUMMER PEAKING",null,"Non-coincident"]
[null,null,null,null,"Coincident"]
[null,null,"ADJUSTMENTS - EMBEDDED GENERATION","MW","Non-coincident"]
[null,null,null,null,"Coincident"]
[null,null,"WEATHER CORRECTED MD 10% POE","MW","Non-coincident"]
[null,null,null,null,"Coincident"]
[null,null,"WEATHER CORRECTED MD 10% POE","MVA","Non-coincident"]
[null,null,null,null,"Coincident"]
[null,null,"WEATHER CORRECTED MD 50% POE","MW","Non-coincident"]
[null,null,null,null,"Coincident"]
[null,null,"WEATHER CORRECTED MD 50% POE","MVA","Non-coincident"]
[null,null,null,null,"Coincident"]
[null,"NSP to enter name","CONNECTION POINT RATING","MVA","Non-coincident"]
[null,null,null,null,"Coincident"]
[null,null,"WINTER/SUMMER PEAKING",null,"Non-coincident"]
[null,null,null,null,"Coincident"]
[null,null,"ADJUSTMENTS - EMBEDDED GENERATION","MW","Non-coincident"]
[null,null,null,null,"Coincident"]
[null,null,"WEATHER CORRECTED MD 10% POE","MW","Non-coincident"]
[null,null,null,null,"Coincident"]
[null,null,"WEATHER CORRECTED MD 10% POE","MVA","Non-coincident"]
[null,null,null,null,"Coincident"]
[null,null,"WEATHER CORRECTED MD 50% POE","MW","Non-coincident"]
[null,null,null,null,"Coincident"]
[null,null,"WEATHER CORRECTED MD 50% POE","MVA","Non-coincident"]
[null,null,null,null,"Coincident"]
[null,"NSP to enter name","CONNECTION POINT RATING","MVA","Non-coincident"]
[null,null,null,null,"Coincident"]
[null,null,"WINTER/SUMMER PEAKING",null,"Non-coincident"]
[null,null,null,null,"Coincident"]
[null,null,"ADJUSTMENTS - EMBEDDED GENERATION","MW","Non-coincident"]
[null,null,null,null,"Coincident"]
[null,null,"WEATHER CORRECTED MD 10% POE","MW","Non-coincident"]
[null,null,null,null,"Coincident"]
[null,null,"WEATHER CORRECTED MD 10% POE","MVA","Non-coincident"]
[null,null,null,null,"Coincident"]
[null,null,"WEATHER CORRECTED MD 50% POE","MW","Non-coincident"]
[null,null,null,null,"Coincident"]
[null,null,"WEATHER CORRECTED MD 50% POE","MVA","Non-coincident"]
[null,null,null,null,"Coincident"]
[null,"NSP to enter name","CONNECTION POINT RATING","MVA","Non-coincident"]
[null,null,null,null,"Coincident"]
[null,null,"WINTER/SUMMER PEAKING",null,"Non-coincident"]
[null,null,null,null,"Coincident"]
[null,null,"ADJUSTMENTS - EMBEDDED GENERATION","MW","Non-coincident"]
[null,null,null,null,"Coincident"]
[null,null,"WEATHER CORRECTED MD 10% POE","MW","Non-coincident"]
[null,null,null,null,"Coincident"]
[null,null,"WEATHER CORRECTED MD 10% POE","MVA","Non-coincident"]
[null,null,null,null,"Coincident"]
[null,null,"WEATHER CORRECTED MD 50% POE","MW","Non-coincident"]
[null,null,null,null,"Coincident"]
[null,null,"WEATHER CORRECTED MD 50% POE","MVA","Non-coincident"]
[null,null,null,null,"Coincident"]
[null,"NSP to enter name","CONNECTION POINT RATING","MVA","Non-coincident"]
[null,null,null,null,"Coincident"]
[null,null,"WINTER/SUMMER PEAKING",null,"Non-coincident"]
[null,null,null,null,"Coincident"]
[null,null,"ADJUSTMENTS - EMBEDDED GENERATION","MW","Non-coincident"]
[null,null,null,null,"Coincident"]
[null,null,"WEATHER CORRECTED MD 10% POE","MW","Non-coincident"]
[null,null,null,null,"Coincident"]
[null,null,"WEATHER CORRECTED MD 10% POE","MVA","Non-coincident"]
[null,null,null,null,"Coincident"]
[null,null,"WEATHER CORRECTED MD 50% POE","MW","Non-coincident"]
[null,null,null,null,"Coincident"]
[null,null,"WEATHER CORRECTED MD 50% POE","MVA","Non-coincident"]
[null,null,null,null,"Coincident"]
[null,"NSP to enter name","CONNECTION POINT RATING","MVA","Non-coincident"]
[null,null,null,null,"Coincident"]
[null,null,"WINTER/SUMMER PEAKING",null,"Non-coincident"]
[null,null,null,null,"Coincident"]
[null,null,"ADJUSTMENTS - EMBEDDED GENERATION","MW","Non-coincident"]
[null,null,null,null,"Coincident"]
[null,null,"WEATHER CORRECTED MD 10% POE","MW","Non-coincident"]
[null,null,null,null,"Coincident"]
[null,null,"WEATHER CORRECTED MD 10% POE","MVA","Non-coincident"]
[null,null,null,null,"Coincident"]
[null,null,"WEATHER CORRECTED MD 50% POE","MW","Non-coincident"]
[null,null,null,null,"Coincident"]
[null,null,"WEATHER CORRECTED MD 50% POE","MVA","Non-coincident"]
[null,null,null,null,"Coincident"]
[null,"NSP to enter name","CONNECTION POINT RATING","MVA","Non-coincident"]
[null,null,null,null,"Coincident"]
[null,null,"WINTER/SUMMER PEAKING",null,"Non-coincident"]
[null,null,null,null,"Coincident"]
[null,null,"ADJUSTMENTS - EMBEDDED GENERATION","MW","Non-coincident"]
[null,null,null,null,"Coincident"]
[null,null,"WEATHER CORRECTED MD 10% POE","MW","Non-coincident"]
[null,null,null,null,"Coincident"]
[null,null,"WEATHER CORRECTED MD 10% POE","MVA","Non-coincident"]
[null,null,null,null,"Coincident"]
[null,null,"WEATHER CORRECTED MD 50% POE","MW","Non-coincident"]
[null,null,null,null,"Coincident"]
[null,null,"WEATHER CORRECTED MD 50% POE","MVA","Non-coincident"]
[null,null,null,null,"Coincident"]
[null,"NSP to enter name","CONNECTION POINT RATING","MVA","Non-coincident"]
[null,null,null,null,"Coincident"]
[null,null,"WINTER/SUMMER PEAKING",null,"Non-coincident"]
[null,null,null,null,"Coincident"]
[null,null,"ADJUSTMENTS - EMBEDDED GENERATION","MW","Non-coincident"]
[null,null,null,null,"Coincident"]
[null,null,"WEATHER CORRECTED MD 10% POE","MW","Non-coincident"]
[null,null,null,null,"Coincident"]
[null,null,"WEATHER CORRECTED MD 10% POE","MVA","Non-coincident"]
[null,null,null,null,"Coincident"]
[null,null,"WEATHER CORRECTED MD 50% POE","MW","Non-coincident"]
[null,null,null,null,"Coincident"]
[null,null,"WEATHER CORRECTED MD 50% POE","MVA","Non-coincident"]
[null,null,null,null,"Coincident"]
[null,"NSP to enter name","CONNECTION POINT RATING","MVA","Non-coincident"]
[null,null,null,null,"Coincident"]
[null,null,"WINTER/SUMMER PEAKING",null,"Non-coincident"]
[null,null,null,null,"Coincident"]
[null,null,"ADJUSTMENTS - EMBEDDED GENERATION","MW","Non-coincident"]
[null,null,null,null,"Coincident"]
[null,null,"WEATHER CORRECTED MD 10% POE","MW","Non-coincident"]
[null,null,null,null,"Coincident"]
[null,null,"WEATHER CORRECTED MD 10% POE","MVA","Non-coincident"]
[null,null,null,null,"Coincident"]
[null,null,"WEATHER CORRECTED MD 50% POE","MW","Non-coincident"]
[null,null,null,null,"Coincident"]
[null,null,"WEATHER CORRECTED MD 50% POE","MVA","Non-coincident"]
[null,null,null,null,"Coincident"]
[null,"NSP to enter name","CONNECTION POINT RATING","MVA","Non-coincident"]
[null,null,null,null,"Coincident"]
[null,null,"WINTER/SUMMER PEAKING",null,"Non-coincident"]
[null,null,null,null,"Coincident"]
[null,null,"ADJUSTMENTS - EMBEDDED GENERATION","MW","Non-coincident"]
[null,null,null,null,"Coincident"]
[null,null,"WEATHER CORRECTED MD 10% POE","MW","Non-coincident"]
[null,null,null,null,"Coincident"]
[null,null,"WEATHER CORRECTED MD 10% POE","MVA","Non-coincident"]
[null,null,null,null,"Coincident"]
[null,null,"WEATHER CORRECTED MD 50% POE","MW","Non-coincident"]
[null,null,null,null,"Coincident"]
[null,null,"WEATHER CORRECTED MD 50% POE","MVA","Non-coincident"]
[null,null,null,null,"Coincident"]
[null,"NSP to enter name","CONNECTION POINT RATING","MVA","Non-coincident"]
[null,null,null,null,"Coincident"]
[null,null,"WINTER/SUMMER PEAKING",null,"Non-coincident"]
[null,null,null,null,"Coincident"]
[null,null,"ADJUSTMENTS - EMBEDDED GENERATION","MW","Non-coincident"]
[null,null,null,null,"Coincident"]
[null,null,"WEATHER CORRECTED MD 10% POE","MW","Non-coincident"]
[null,null,null,null,"Coincident"]
[null,null,"WEATHER CORRECTED MD 10% POE","MVA","Non-coincident"]
[null,null,null,null,"Coincident"]
[null,null,"WEATHER CORRECTED MD 50% POE","MW","Non-coincident"]
[null,null,null,null,"Coincident"]
[null,null,"WEATHER CORRECTED MD 50% POE","MVA","Non-coincident"]
[null,null,null,null,"Coincident"]
[null,"NSP to enter name","CONNECTION POINT RATING","MVA","Non-coincident"]
[null,null,null,null,"Coincident"]
[null,null,"WINTER/SUMMER PEAKING",null,"Non-coincident"]
[null,null,null,null,"Coincident"]
[null,null,"ADJUSTMENTS - EMBEDDED GENERATION","MW","Non-coincident"]
[null,null,null,null,"Coincident"]
[null,null,"WEATHER CORRECTED MD 10% POE","MW","Non-coincident"]
[null,null,null,null,"Coincident"]
[null,null,"WEATHER CORRECTED MD 10% POE","MVA","Non-coincident"]
[null,null,null,null,"Coincident"]
[null,null,"WEATHER CORRECTED MD 50% POE","MW","Non-coincident"]
[null,null,null,null,"Coincident"]
[null,null,"WEATHER CORRECTED MD 50% POE","MVA","Non-coincident"]
[null,null,null,null,"Coincident"]
[null,"NSP to enter name","CONNECTION POINT RATING","MVA","Non-coincident"]
[null,null,null,null,"Coincident"]
[null,null,"WINTER/SUMMER PEAKING",null,"Non-coincident"]
[null,null,null,null,"Coincident"]
[null,null,"ADJUSTMENTS - EMBEDDED GENERATION","MW","Non-coincident"]
[null,null,null,null,"Coincident"]
[null,null,"WEATHER CORRECTED MD 10% POE","MW","Non-coincident"]
[null,null,null,null,"Coincident"]
[null,null,"WEATHER CORRECTED MD 10% POE","MVA","Non-coincident"]
[null,null,null,null,"Coincident"]
[null,null,"WEATHER CORRECTED MD 50% POE","MW","Non-coincident"]
[null,null,null,null,"Coincident"]
[null,null,"WEATHER CORRECTED MD 50% POE","MVA","Non-coincident"]
[null,null,null,null,"Coincident"]
[null,"NSP to enter name","CONNECTION POINT RATING","MVA","Non-coincident"]
[null,null,null,null,"Coincident"]
[null,null,"WINTER/SUMMER PEAKING",null,"Non-coincident"]
[null,null,null,null,"Coincident"]
[null,null,"ADJUSTMENTS - EMBEDDED GENERATION","MW","Non-coincident"]
[null,null,null,null,"Coincident"]
[null,null,"WEATHER CORRECTED MD 10% POE","MW","Non-coincident"]
[null,null,null,null,"Coincident"]
[null,null,"WEATHER CORRECTED MD 10% POE","MVA","Non-coincident"]
[null,null,null,null,"Coincident"]
[null,null,"WEATHER CORRECTED MD 50% POE","MW","Non-coincident"]
[null,null,null,null,"Coincident"]
[null,null,"WEATHER CORRECTED MD 50% POE","MVA","Non-coincident"]
[null,null,null,null,"Coincident"]
[null,"NSP to enter name","CONNECTION POINT RATING","MVA","Non-coincident"]
[null,null,null,null,"Coincident"]
[null,null,"WINTER/SUMMER PEAKING",null,"Non-coincident"]
[null,null,null,null,"Coincident"]
[null,null,"ADJUSTMENTS - EMBEDDED GENERATION","MW","Non-coincident"]
[null,null,null,null,"Coincident"]
[null,null,"WEATHER CORRECTED MD 10% POE","MW","Non-coincident"]
[null,null,null,null,"Coincident"]
[null,null,"WEATHER CORRECTED MD 10% POE","MVA","Non-coincident"]
[null,null,null,null,"Coincident"]
[null,null,"WEATHER CORRECTED MD 50% POE","MW","Non-coincident"]
[null,null,null,null,"Coincident"]
[null,null,"WEATHER CORRECTED MD 50% POE","MVA","Non-coincident"]
[null,null,null,null,"Coincident"]
[null,"NSP to enter name","CONNECTION POINT RATING","MVA","Non-coincident"]
[null,null,null,null,"Coincident"]
[null,null,"WINTER/SUMMER PEAKING",null,"Non-coincident"]
[null,null,null,null,"Coincident"]
[null,null,"ADJUSTMENTS - EMBEDDED GENERATION","MW","Non-coincident"]
[null,null,null,null,"Coincident"]
[null,null,"WEATHER CORRECTED MD 10% POE","MW","Non-coincident"]
[null,null,null,null,"Coincident"]
[null,null,"WEATHER CORRECTED MD 10% POE","MVA","Non-coincident"]
[null,null,null,null,"Coincident"]
[null,null,"WEATHER CORRECTED MD 50% POE","MW","Non-coincident"]
[null,null,null,null,"Coincident"]
[null,null,"WEATHER CORRECTED MD 50% POE","MVA","Non-coincident"]
[null,null,null,null,"Coincident"]
[null,"NSP to enter name","CONNECTION POINT RATING","MVA","Non-coincident"]
[null,null,null,null,"Coincident"]
[null,null,"WINTER/SUMMER PEAKING",null,"Non-coincident"]
[null,null,null,null,"Coincident"]
[null,null,"ADJUSTMENTS - EMBEDDED GENERATION","MW","Non-coincident"]
[null,null,null,null,"Coincident"]
[null,null,"WEATHER CORRECTED MD 10% POE","MW","Non-coincident"]
[null,null,null,null,"Coincident"]
[null,null,"WEATHER CORRECTED MD 10% POE","MVA","Non-coincident"]
[null,null,null,null,"Coincident"]
[null,null,"WEATHER CORRECTED MD 50% POE","MW","Non-coincident"]
[null,null,null,null,"Coincident"]
[null,null,"WEATHER CORRECTED MD 50% POE","MVA","Non-coincident"]
[null,null,null,null,"Coincident"]
[null,"NSP to enter name","CONNECTION POINT RATING","MVA","Non-coincident"]
[null,null,null,null,"Coincident"]
[null,null,"WINTER/SUMMER PEAKING",null,"Non-coincident"]
[null,null,null,null,"Coincident"]
[null,null,"ADJUSTMENTS - EMBEDDED GENERATION","MW","Non-coincident"]
[null,null,null,null,"Coincident"]
[null,null,"WEATHER CORRECTED MD 10% POE","MW","Non-coincident"]
[null,null,null,null,"Coincident"]
[null,null,"WEATHER CORRECTED MD 10% POE","MVA","Non-coincident"]
[null,null,null,null,"Coincident"]
[null,null,"WEATHER CORRECTED MD 50% POE","MW","Non-coincident"]
[null,null,null,null,"Coincident"]
[null,null,"WEATHER CORRECTED MD 50% POE","MVA","Non-coincident"]
[null,null,null,null,"Coincident"]
[null,"NSP to enter name","CONNECTION POINT RATING","MVA","Non-coincident"]
[null,null,null,null,"Coincident"]
[null,null,"WINTER/SUMMER PEAKING",null,"Non-coincident"]
[null,null,null,null,"Coincident"]
[null,null,"ADJUSTMENTS - EMBEDDED GENERATION","MW","Non-coincident"]
[null,null,null,null,"Coincident"]
[null,null,"WEATHER CORRECTED MD 10% POE","MW","Non-coincident"]
[null,null,null,null,"Coincident"]
[null,null,"WEATHER CORRECTED MD 10% POE","MVA","Non-coincident"]
[null,null,null,null,"Coincident"]
[null,null,"WEATHER CORRECTED MD 50% POE","MW","Non-coincident"]
[null,null,null,null,"Coincident"]
[null,null,"WEATHER CORRECTED MD 50% POE","MVA","Non-coincident"]
[null,null,null,null,"Coincident"]
[null,"NSP to enter name","CONNECTION POINT RATING","MVA","Non-coincident"]
[null,null,null,null,"Coincident"]
[null,null,"WINTER/SUMMER PEAKING",null,"Non-coincident"]
[null,null,null,null,"Coincident"]
[null,null,"ADJUSTMENTS - EMBEDDED GENERATION","MW","Non-coincident"]
[null,null,null,null,"Coincident"]
[null,null,"WEATHER CORRECTED MD 10% POE","MW","Non-coincident"]
[null,null,null,null,"Coincident"]
[null,null,"WEATHER CORRECTED MD 10% POE","MVA","Non-coincident"]
[null,null,null,null,"Coincident"]
[null,null,"WEATHER CORRECTED MD 50% POE","MW","Non-coincident"]
[null,null,null,null,"Coincident"]
[null,null,"WEATHER CORRECTED MD 50% POE","MVA","Non-coincident"]
[null,null,null,null,"Coincident"]

{"sheet":"7.1  Policies and Procedures","index":23,"n_rows":225,"n_cols":5,"rows_kept":225,"cut":false,"hidden":false,"merged":[[7,1,7,3],[207,1,207,4],[212,1,212,4],[10,1,11,1],[223,1,223,4],[16,1,16,4],[12,1,12,4],[47,1,47,4],[42,1,42,4],[39,1,39,4],[76,1,76,4],[156,1,156,4],[161,1,161,4],[198,1,198,4],[202,1,202,4],[34,1,34,4],[38,1,38,4],[71,1,71,4]]}
[null,{"$f":"(LOOKUP(dms_Model,dms_Model_List,dms_Worksheet_List))","v":"REGULATORY REPORTING STATEMENT"}]
[null,{"$f":"INDEX(dms_TradingNameFull_List,MATCH(dms_TradingName,dms_TradingName_List))","v":"TasNetworks (T)"}]
[null,{"$f":"IF(SUM(dms_SingleYear_Model)>0,CRY,CONCATENATE(FRCP_y1,\" to \",dms_MultiYear_FinalYear_Result))","v":"2019-20 to 2023-24"}]
[null,"7.1  PLANS, POLICIES, PROCEDURES AND STRATEGIES"]
[]
[]
[null,"Instructions"]
[null,{"$f":"CONCATENATE(dms_TradingName, \" must list and provide a brief description of key internal plans, \"&\"policies, procedures or strategies that are used by it to plan and conduct its day to day operations and that have been relied upon in the development of its regulatory proposal. \"&dms_TradingName,\" must identify any internal plans, policies, procedures and strategies that have changed in the current regulatory control period \"&\"or that are expected to change before the next regulatory control period where the change has been identified as a step change.\")","v":"TasNetworks (T) must list and provide a brief description of key internal plans, policies, procedures or strategies that are used by it to plan and conduct its day to day operations and that have been relied upon in the development of its regulatory proposal. TasNetworks (T) must identify any internal plans, policies, procedures and strategies that have changed in the current regulatory control period or that are expected to change before the next regulatory control period where the change has been identified as a step change."}]
[]
[null,"7.1.1 - PLANS, POLICIES, PROCEDURES AND STRATEGIES"]
[null,null,"Brief description","Relevance to regulatory proposal","Expenditure impact"]
[null,null,"Description of the plan, policy, procedure or strategy.","Identify the element of the proposal/supporting documents that the policy, plan, procedure or strategy is relevant to e.g. replacement capex, capacity utilisation thresholds, opex ","Is this policy, plan or procedure identified in the response to section 4 'Step Changes' of the notice (yes or no)?"]
[null,"Corporate"]
[null,"See attachments to the Regulatory Proposal"]
[]
[]
[null,"Governance framework"]
[null,"See attachments to the Regulatory Proposal"]
[]
[]
[]
[]
[]
[]
[]
[]
[]
[]
[]
[]
[]
[]
[]
[]
[null,"Accounting policies, procedures and methodologies (including a capitalisation policy, depreciation policy and an approved expenditure allocation methodology)"]
[null,"See attachments to the Regulatory Proposal"]
[]
[]
[null,"Asset management plan or equivalent documentation"]
[null,"Asset Management Policies"]
[null,"See attachments to the Regulatory Proposal"]
[]
[null,"Asset Management Strategies"]
[null,"See attachments to the Regulatory Proposal"]
[]
[]
[]
[null,"Asset Management Plans"]
[null,"See attachments to the Regulatory Proposal"]
[]
[]
[]
[]
[]
[]
[]
[]
[]
[]
[]
[]
[]
[]
[]
[]
[]
[]
[]
[]
[]
[]
[null,"Capital expenditure policies and procedures (including capex approval policies and procedures and replacement policy) "]
[null,"See attachments to the Regulatory Proposal"]
[]
[]
[]
[null,"Internal standards for network planning, design, maintenance and operation"]
[null,"See attachments to the Regulatory Proposal"]
[]
[]
[]
[]
[]
[]
[]
[]
[]
[]
[]
[]
[]
[]
[]
[]
[]
[]
[]
[]
[]
[]
[]
[]
[]
[]
[]
[]
[]
[]
[]
[]
[]
[]
[]
[]
[]
[]
[]
[]
[]
[]
[]
[]
[]
[]
[]
[]
[]
[]
[]
[]
[]
[]
[]
[]
[]
[]
[]
[]
[]
[]
[]
[]
[]
[]
[]
[]
[]
[]
[]
[]
[]
[]
[]
[]
[]
[]
[null,"Procurement and contracting out policies"]
[null,"See attachments to the Regulatory Proposal"]
[]
[]
[]
[null,"Information technology policies or strategies"]
[null,"See attachments to the Regulatory Proposal"]
[]
[]
[]
[]
[]
[]
[]
[]
[]
[]
[]
[]
[]
[]
[]
[]
[]
[]
[]
[]
[]
[]
[]
[]
[]
[]
[]
[]
[]
[]
[]
[]
[]
[]
[]
[null,"Demand management policies or strategies"]
[null,"See attachments to the Regulatory Proposal"]
[]
[]
[null,"Self insurance guidelines or policy"]
[null,"See attachments to the Regulatory Proposal"]
[]
[]
[]
[null,"Land and easement acquisition polices"]
[null,"See attachments to the Regulatory Proposal"]
[]
[]
[]
[null,"Asset security plans and policies"]
[null,"See attachments to the Regulatory Proposal"]
[]
[]
[]
[]
[]
[]
[]
[]
[]
[null,"Disaster recovery policy"]
[null,"See attachments to the Regulatory Proposal"]

{"sheet":"7.2 Contingent projects","index":24,"n_rows":31,"n_cols":6,"rows_kept":31,"cut":false,"hidden":false,"merged":[[3,1,3,5],[7,1,7,3]]}
[null,{"$f":"(LOOKUP(dms_Model,dms_Model_List,dms_Worksheet_List))","v":"REGULATORY REPORTING STATEMENT"}]
[null,{"$f":"INDEX(dms_TradingNameFull_List,MATCH(dms_TradingName,dms_TradingName_List))","v":"TasNetworks (T)"}]
[null,{"$f":"IF(SUM(dms_SingleYear_Model)>0,CRY,CONCATENATE(FRCP_y1,\" to \",dms_MultiYear_FinalYear_Result))","v":"2019-20 to 2023-24"}]
[null,"7.2 CONTINGENT PROJECTS"]
[]
[]
[null,"Instructions"]
[null,{"$f":"CONCATENATE(dms_TradingName,\" is required to populate all input cells (yellow) in table 7.2.1 presented below. Additional rows may be added by \",dms_TradingName,\"  if required.\"\n\n\n\n)","v":"TasNetworks (T) is required to populate all input cells (yellow) in table 7.2.1 presented below. Additional rows may be added by TasNetworks (T)  if required."}]
[]
[null,"7.2.1 - PROPOSED CONTINGENT PROJECTS FOR THE FORTHCOMING REGULATORY CONTROL PERIOD"]
[null,"Proposed contingent project name","Proposed contingent capital expenditure  ($0's, nominal)","Proposed trigger events",{"$f":"CONCATENATE(\"Proposed MAR for \", FRCP_y1,\" ($0's, nominal)\")","v":"Proposed MAR for 2019-20 ($0's, nominal)"},{"$f":"CONCATENATE(\"5 per cent of the \", FRCP_y1,\" ($0's, nominal) MAR\")","v":"5 per cent of the 2019-20 ($0's, nominal) MAR"}]
[null,"Second Bass Strait Interconnector ",550000000,"1. Approval of a business case for construction of a second Bass Strait interconnector; and \n2. Successful completion of the Regulatory Investment Test for Transmission (RIT-T); and\n3. Determination by the AER that the proposed investment satisfies the RIT-T or alternative applicable decision-making framework; and\n4. TasNetworks Board approval to proceed with the project, subject to the AER amending the revenue determination pursuant to the Rules\n",168410000,{"$f":"+E12*0.05","v":8420500}]
[null,"Sheffield to Palmerston 220 kV Augmentation ",120000000,"1. The connection of an additional 340 MW of generation in the North West and West Coast networks connecting into Sheffield or an application to connect a second Bass Strait interconnector, with an expected connection to the Tasmanian transmission system at Sheffield; and\n2.  Successful completion of the RIT-T; and \n3. Determination by the AER that the proposed investment satisfies the RIT-T.\n3. TasNetworks Board approval to proceed with the project subject to the AER amending the revenue determination pursuant to the Rules. \n",{"$f":"+$E$12","v":168410000},{"$f":"+E13*0.05","v":8420500}]
[null,"Rationalisation of Upper Derwent 110 kV Network",118000000,"1. Hydro Tasmania confirms its connection requirements for the replacement and relocation of the Tarraleah power station, thereby clarifying the required rationalisation and augmentation of the Upper Derwent 110 kV network;\n2.  Successful completion of the RIT-T; and \n3. Determination by the AER that the proposed investment satisfies the RIT-T.\n4. TasNetworks Board approval to proceed with the project subject to the AER amending the revenue determination pursuant to the Rules. \n",{"$f":"+$E$12","v":168410000},8420500]
[null,"North West 110 kV Network Redevelopment ",70000000,"1. When the flows through the 110 kV transmission corridor between Burnie and Smithton exceed the firm capacity of the corridor by at least 150 MW; and \n2.  Successful completion of the RIT-T; and \n3.  Determination by the AER that the proposed investment satisfies the RIT-T or alternative applicable decision-making framework.\n4. TasNetworks Board approval to proceed with the project subject to the AER amending the revenue determination pursuant to the Rules. \n",168410000,8420500]
[null,"North West 220 kV Network Redevelopment ",80000000,"1.  When the amount of new generation, capable of exporting into the transmission network exceeds 200 MW, connects or applies to connect, to the transmission network in North West Tasmania; and \n2.  Successful completion of the RIT-T; and \n3. Determination by the AER that the proposed investment satisfies the RIT-T or alternative applicable decision-making framework; and\n4.  TasNetworks Board approval to proceed with the project subject to the AER amending the revenue determination pursuant to the Rules. \n",168410000,8420500]
[null,null,null,null,168410000,8420500]
[null,null,null,null,168410000,8420500]
[null,null,null,null,168410000,8420500]
[null,null,null,null,168410000,8420500]
[null,null,null,null,168410000,8420500]
[null,null,null,null,168410000,8420500]
[null,null,null,null,168410000,8420500]
[null,null,null,null,168410000,8420500]
[null,null,null,null,168410000,8420500]
[null,null,null,null,168410000,8420500]
[null,null,null,null,168410000,8420500]
[null,null,null,null,168410000,8420500]
[null,null,null,null,168410000,8420500]
[null,null,null,null,168410000,8420500]
[null,null,null,null,168410000,8420500]

{"sheet":"7.3 Obligations","index":25,"n_rows":302,"n_cols":5,"rows_kept":302,"cut":false,"hidden":false,"merged":[[3,1,3,4],[12,1,13,1],[8,1,8,2],[5,1,5,2]]}
[null,{"$f":"(LOOKUP(dms_Model,dms_Model_List,dms_Worksheet_List))","v":"REGULATORY REPORTING STATEMENT"}]
[null,{"$f":"INDEX(dms_TradingNameFull_List,MATCH(dms_TradingName,dms_TradingName_List))","v":"TasNetworks (T)"}]
[null,{"$f":"IF(SUM(dms_SingleYear_Model)>0,CRY,CONCATENATE(FRCP_y1,\" to \",dms_MultiYear_FinalYear_Result))","v":"2019-20 to 2023-24"}]
[null,"7.3  OBLIGATIONS, REQUIREMENTS & STANDARDS"]
[]
[null,"There is ONE table on this worksheet. It has been sub-grouped for ease of navigation. See the Instructions sheet on how to group or ungroup data."]
[]
[null,"Instructions"]
[null,{"$f":"CONCATENATE(\"Outline those obligations and requirements that \",dms_TradingName, \" identifies as having a material impact on expenditure requirements.\")","v":"Outline those obligations and requirements that TasNetworks (T) identifies as having a material impact on expenditure requirements."}]
[]
[]
[null,"7.3.1 - OBLIGATIONS OR REQUIREMENTS"]
[null,null,"Brief description","Relevance to regulatory proposal","Expenditure impact"]
[null,null,"Description of relevant obligations or requirements within the instrument (e.g. safety obligations, reliability targets) ","Identify what element of the proposal/supporting documents the obligation or requirement is relevant to e.g. replacement capex, capacity utilisation thresholds, opex ","Is the obligation or requirement identified in the response to section 4 'Step Changes' of the notice (yes or no)?"]
[null,"Legislation"]
[null,"See Asset Management Plans"]
[]
[]
[]
[]
[]
[]
[]
[]
[]
[]
[]
[]
[]
[]
[]
[]
[]
[]
[]
[]
[]
[]
[]
[]
[]
[]
[]
[]
[]
[]
[]
[]
[]
[]
[]
[]
[]
[]
[]
[]
[]
[]
[]
[]
[]
[]
[]
[]
[]
[]
[]
[]
[]
[]
[]
[]
[]
[]
[]
[]
[]
[]
[]
[]
[]
[]
[]
[]
[]
[]
[]
[]
[]
[]
[]
[]
[]
[]
[]
[]
[]
[]
[]
[]
[]
[]
[]
[]
[]
[]
[]
[]
[]
[]
[]
[]
[]
[]
[]
[]
[]
[]
[]
[]
[]
[]
[]
[]
[]
[]
[]
[]
[]
[]
[]
[]
[]
[]
[]
[]
[]
[]
[]
[]
[]
[]
[]
[]
[]
[]
[]
[]
[]
[]
[]
[]
[]
[]
[]
[]
[]
[]
[]
[]
[]
[]
[]
[]
[]
[]
[]
[]
[]
[]
[]
[]
[]
[]
[]
[]
[]
[]
[]
[]
[]
[]
[]
[]
[]
[]
[]
[]
[]
[]
[]
[]
[]
[]
[]
[]
[]
[]
[]
[]
[]
[]
[]
[]
[]
[]
[]
[]
[]
[]
[]
[]
[]
[]
[]
[]
[]
[]
[]
[]
[]
[]
[]
[]
[]
[]
[null,"Licences"]
[null,"See Asset Management Plans"]
[]
[]
[]
[null,"Rules"]
[null,"See Asset Management Plans"]
[]
[]
[]
[null,"Orders"]
[null,"See Asset Management Plans"]
[]
[]
[null,"Codes"]
[null,"See Asset Management Plans"]
[]
[]
[]
[]
[]
[]
[]
[]
[]
[]
[]
[]
[]
[]
[null,"Guidelines"]
[null,"See Asset Management Plans"]
[]
[]
[]
[]
[]
[]
[]
[]
[]
[]
[]
[]
[]
[]
[]
[]
[]
[]
[]
[]
[]
[]
[]
[]
[]
[]
[]
[]
[]
[]
[]
[]
[]
[]
[]
[]
[]
[null,"Default agreements "]
[]
[]
[]
[]
[null,"Other"]
[null,"See Asset Management Plans"]

{"sheet":"7.4 Shared Assets","index":26,"n_rows":26,"n_cols":19,"rows_kept":26,"cut":false,"hidden":false,"merged":[[36,2,36,8],[37,2,37,8],[38,2,38,8],[39,2,39,8],[40,2,40,8],[31,2,31,8],[32,2,32,8],[33,2,33,8],[34,2,34,8],[35,2,35,8],[26,2,26,8],[27,2,27,8],[28,2,28,8],[29,2,29,8],[30,2,30,8],[6,1,7,1],[6,2,7,2],[25,2,25,8],[6,11,6,18],[6,3,6,10]]}
[null,{"$f":"(LOOKUP(dms_Model,dms_Model_List,dms_Worksheet_List))","v":"REGULATORY REPORTING STATEMENT"}]
[null,{"$f":"INDEX(dms_TradingNameFull_List,MATCH(dms_TradingName,dms_TradingName_List))","v":"TasNetworks (T)"}]
[null,{"$f":"IF(SUM(dms_SingleYear_Model)>0,CRY,CONCATENATE(FRCP_y1,\" to \",dms_MultiYear_FinalYear_Result))","v":"2019-20 to 2023-24"}]
[null,"7.4 SHARED ASSETS"]
[]
[null,"7.4.1 - TOTAL UNREGULATED REVENUE EARNED WITH SHARED ASSETS "]
[null,"Name of shared asset unregulated service","Description of shared assets used to provide the service","Shared asset unregulated revenue  ($0's, nominal)",null,null,null,null,null,null,null,{"$f":"CONCATENATE(\"Shared asset unregulated revenue  ($0's, real \", dms_DollarReal,\")\")","v":"Shared asset unregulated revenue  ($0's, real June 2019)"}]
[null,null,null,{"$f":"PRCP_y1","v":"2009-10"},{"$f":"PRCP_y2","v":"2010-11"},{"$f":"PRCP_y3","v":"2011-12"},{"$f":"PRCP_y4","v":"2012-13"},{"$f":"PRCP_y5","v":"2013-14"},{"$f":"CRCP_y1","v":"2014-15"},{"$f":"CRCP_y2","v":"2015-16"},{"$f":"CRCP_y3","v":"2016-17"},{"$f":"CRCP_y4","v":"2017-18"},{"$f":"CRCP_y5","v":"2018-19"},{"$f":"FRCP_y1","v":"2019-20"},{"$f":"FRCP_y2","v":"2020-21"},{"$f":"FRCP_y3","v":"2021-22"},{"$f":"FRCP_y4","v":"2022-23"},{"$f":"FRCP_y5","v":"2023-24"},{"$f":"CONCATENATE(\"Total \n\",FRCP_y1, \" to \", dms_MultiYear_FinalYear_Result)","v":"Total \n2019-20 to 2023-24"}]
[null,"OPGW dark fibre lease","OPGW",0,27750,115000,115819,118277.048,null,null,null,null,null,null,null,null,null,null,{"$f":"SUM(N9:R9)","v":0}]
[null,null,null,null,null,null,null,null,null,null,null,null,null,null,null,null,null,null,{"$f":"SUM(N10:R10)","v":0}]
[null,null,null,null,null,null,null,null,null,null,null,null,null,null,null,null,null,null,0]
[null,null,null,null,null,null,null,null,null,null,null,null,null,null,null,null,null,null,0]
[null,null,null,null,null,null,null,null,null,null,null,null,null,null,null,null,null,null,0]
[null,null,null,null,null,null,null,null,null,null,null,null,null,null,null,null,null,null,0]
[null,null,null,null,null,null,null,null,null,null,null,null,null,null,null,null,null,null,0]
[null,null,null,null,null,null,null,null,null,null,null,null,null,null,null,null,null,null,0]
[null,null,null,null,null,null,null,null,null,null,null,null,null,null,null,null,null,null,0]
[null,null,null,null,null,null,null,null,null,null,null,null,null,null,null,null,null,null,0]
[null,null,null,null,null,null,null,null,null,null,null,null,null,null,null,null,null,null,0]
[null,null,null,null,null,null,null,null,null,null,null,null,null,null,null,null,null,null,{"$f":"SUM(N20:R20)","v":0}]
[null,null,null,null,null,null,null,null,null,null,null,null,null,null,null,null,null,null,{"$f":"SUM(N21:R21)","v":0}]
[null,null,null,null,null,null,null,null,null,null,null,null,null,null,null,null,null,null,{"$f":"SUM(N22:R22)","v":0}]
[null,null,null,null,null,null,null,null,null,null,null,null,null,null,null,null,null,null,{"$f":"SUM(N23:R23)","v":0}]
[]
[null,"7.4.2 - SHARED ASSET UNREGULATED SERVICES - APPORTIONMENT METHODOLOGY"]
[null,"Name of shared asset unregulated service for which revenues were apportioned","Apportionment methodology"]

{"sheet":"7.6 Indicative bill impact ","index":27,"n_rows":70,"n_cols":11,"rows_kept":70,"cut":false,"hidden":false,"merged":[[21,2,21,3],[29,2,29,3],[6,1,6,2]]}
[null,{"$f":"(LOOKUP(dms_Model,dms_Model_List,dms_Worksheet_List))","v":"REGULATORY REPORTING STATEMENT"}]
[null,{"$f":"INDEX(dms_TradingNameFull_List,MATCH(dms_TradingName,dms_TradingName_List))","v":"TasNetworks (T)"}]
[null,{"$f":"IF(SUM(dms_SingleYear_Model)>0,CRY,CONCATENATE(FRCP_y1,\" to \",dms_MultiYear_FinalYear_Result))","v":"2019-20 to 2023-24"}]
[null,"7.6 INDICATIVE IMPACT ON TRANSMISSION CHARGES AND ELECTRICITY BILLS"]
[]
[null,"Instructions"]
[null,{"$f":"CONCATENATE(dms_TradingName,\" is required to populate all input cells (yellow) in table 7.6.1 presented below.\nTransmission pricing impact should refer to \",dms_TradingName,\"'s related transmission costs only.\")","v":"TasNetworks (T) is required to populate all input cells (yellow) in table 7.6.1 presented below.\nTransmission pricing impact should refer to TasNetworks (T)'s related transmission costs only."}]
[]
[null,"7.6.1 - Indicative impact of the revenue proposal on the average residential electricity bills"]
[]
[null,"Transmission costs as a proportion of a typical residential customer's electricity bill (per cent)",0.112547421198909]
[null,"Transmission costs as a proportion of a typical business customer's electricity bill (per cent)",0.11012425564114735]
[null,"Source data:","Aurora Energy, Typical electricity cost breakdown July 2017"]
[]
[null,"Typical electricity bill - Residential customer"]
[null,"Tariff type","Description of tariff type",{"$f":"CONCATENATE(\"Annual bill amount \n($\",  dms_CRCP_FinalYear_Result,\")\")","v":"Annual bill amount \n($2018-19)"}]
[null,"TAS31/TAS41","Medium consumption",1923.2828000772536]
[]
[]
[null,"<NSP to insert any additional items>"]
[null,"<NSP to insert any additional items>"]
[null,"Source data:","Office of the Tasmanian Economic Regulator, Typical Electricity Customers 2017 / Aurora Energy Standing Offer Tariffs 2017-18"]
[]
[null,"Typical electricity bill - Business customer"]
[null,"Tariff type","Description of tariff type",{"$f":"CONCATENATE(\"Annual bill amount \n($\",  dms_CRCP_FinalYear_Result,\")\")","v":"Annual bill amount \n($2018-19)"}]
[null,"TAS22","High consumption",6511.0854269249994]
[]
[null,"<NSP to insert any additional items>"]
[null,"<NSP to insert any additional items>"]
[null,"Source data:","Office of the Tasmanian Economic Regulator, Typical Electricity Customers 2017 / Aurora Energy Standing Offer Tariffs 2017-18"]
[]
[null,"Indicative annual average transmission price impact as shown in the proposed PTRM (per cent)"]
[null,null,{"$f":"CRCP_y5","v":"2018-19"},{"$f":"FRCP_y1","v":"2019-20"},{"$f":"FRCP_y2","v":"2020-21"},{"$f":"FRCP_y3","v":"2021-22"},{"$f":"FRCP_y4","v":"2022-23"},{"$f":"FRCP_y5","v":"2023-24"},"Average"]
[null,"Annual price path (per cent, nominal)",null,1.0134429246313026E-2,-2.3803474670250346E-2,-2.4393915303299152E-2,-2.4422090227126603E-2,-2.4580822121567203E-2,{"$f":"+AVERAGE(D34:H34)","v":-1.7413174615186055E-2}]
[null,{"$f":"CONCATENATE(\"Annual price path (per cent, $\",dms_DollarReal)","v":"Annual price path (per cent, $June 2019"},null,-1.4022030994325863E-2,-4.714834033211357E-2,-4.772466110619733E-2,-4.7752162251953778E-2,-4.7907098215292487E-2,{"$f":"+AVERAGE(D35:H35)","v":-4.0910858579976603E-2}]
[]
[]
[null,"Transmission bill component - Residential customer",{"$f":"CONCATENATE(\"Real \", dms_DollarReal)","v":"Real June 2019"}]
[null,"Tariff type",{"$f":"CRCP_y5","v":"2018-19"},{"$f":"FRCP_y1","v":"2019-20"},{"$f":"FRCP_y2","v":"2020-21"},{"$f":"FRCP_y3","v":"2021-22"},{"$f":"FRCP_y4","v":"2022-23"},{"$f":"FRCP_y5","v":"2023-24"},{"$f":"CONCATENATE(\"Total \",FRCP_y1,\" to \", IF(SUM(dms_SingleYear_Model)>0,\"\",dms_MultiYear_FinalYear_Result))","v":"Total 2019-20 to 2023-24"},"Annual average","Annual impact on customer bill (%)"]
[]
[null,{"$f":"+B17","v":"TAS31/TAS41"},{"$f":"+D17*$C$11","v":216.46051938491175},{"$f":"+C41*(1+IF($C$38=\"Nominal\",D$34,D$35))","v":213.42530327304866},{"$f":"+D41*(1+IF($C$38=\"Nominal\",E$34,E$35))","v":203.36265443884639},{"$f":"+E41*(1+IF($C$38=\"Nominal\",F$34,F$35))","v":193.65724067409573},{"$f":"+F41*(1+IF($C$38=\"Nominal\",G$34,G$35))","v":184.40968869616066},{"$f":"+G41*(1+IF($C$38=\"Nominal\",H$34,H$35))","v":175.57515562794217},{"$f":"+SUM(D41:H41)","v":970.43004271009363},{"$f":"+AVERAGE(D41:H41)","v":194.08600854201873}]
[null,"Annual change",null,{"$f":"+D41-C41","v":-3.0352161118630931},{"$f":"+E41-D41","v":-10.062648834202264},{"$f":"+F41-E41","v":-9.7054137647506593},{"$f":"+G41-F41","v":-9.2475519779350748},{"$f":"+H41-G41","v":-8.8345330682184908},{"$f":"+SUM(D42:H42)","v":-40.885363756969582},{"$f":"+AVERAGE(D42:H42)","v":-8.1770727513939168},{"$f":"+J42/D17","v":-4.251622668837606E-3}]
[]
[null,{"$f":"+B18","v":0},{"$f":"+D18*$C$11","v":0},{"$f":"+C44*(1+IF($C$38=\"Nominal\",D$34,D$35))","v":0},{"$f":"+D44*(1+IF($C$38=\"Nominal\",E$34,E$35))","v":0},{"$f":"+E44*(1+IF($C$38=\"Nominal\",F$34,F$35))","v":0},{"$f":"+F44*(1+IF($C$38=\"Nominal\",G$34,G$35))","v":0},{"$f":"+G44*(1+IF($C$38=\"Nominal\",H$34,H$35))","v":0},0,{"$f":"+AVERAGE(D44:H44)","v":0}]
[null,"Annual change",null,{"$f":"+D44-C44","v":0},{"$f":"+E44-D44","v":0},{"$f":"+F44-E44","v":0},{"$f":"+G44-F44","v":0},{"$f":"+H44-G44","v":0},0,0,{"$f":"+J45/D18","v":{"$error":"#DIV/0!"}}]
[]
[null,{"$f":"+B19","v":0},{"$f":"+D19*$C$11","v":0},{"$f":"+C47*(1+IF($C$38=\"Nominal\",D$34,D$35))","v":0},{"$f":"+D47*(1+IF($C$38=\"Nominal\",E$34,E$35))","v":0},{"$f":"+E47*(1+IF($C$38=\"Nominal\",F$34,F$35))","v":0},{"$f":"+F47*(1+IF($C$38=\"Nominal\",G$34,G$35))","v":0},{"$f":"+G47*(1+IF($C$38=\"Nominal\",H$34,H$35))","v":0},0,0]
[null,"Annual change",null,{"$f":"+D47-C47","v":0},{"$f":"+E47-D47","v":0},{"$f":"+F47-E47","v":0},{"$f":"+G47-F47","v":0},{"$f":"+H47-G47","v":0},0,0,{"$f":"+J48/D19","v":{"$error":"#DIV/0!"}}]
[]
[null,{"$f":"+B20","v":"<NSP to insert any additional items>"},{"$f":"+D20*$C$11","v":0},{"$f":"+C50*(1+IF($C$38=\"Nominal\",D$34,D$35))","v":0},{"$f":"+D50*(1+IF($C$38=\"Nominal\",E$34,E$35))","v":0},{"$f":"+E50*(1+IF($C$38=\"Nominal\",F$34,F$35))","v":0},{"$f":"+F50*(1+IF($C$38=\"Nominal\",G$34,G$35))","v":0},{"$f":"+G50*(1+IF($C$38=\"Nominal\",H$34,H$35))","v":0},0,0]
[null,"Annual change",null,{"$f":"+D50-C50","v":0},{"$f":"+E50-D50","v":0},{"$f":"+F50-E50","v":0},{"$f":"+G50-F50","v":0},{"$f":"+H50-G50","v":0},0,0,{"$f":"+J51/D20","v":{"$error":"#DIV/0!"}}]
[]
[null,{"$f":"+B21","v":"<NSP to insert any additional items>"},{"$f":"+D21*$C$11","v":0},{"$f":"+C53*(1+IF($C$38=\"Nominal\",D$34,D$35))","v":0},{"$f":"+D53*(1+IF($C$38=\"Nominal\",E$34,E$35))","v":0},{"$f":"+E53*(1+IF($C$38=\"Nominal\",F$34,F$35))","v":0},{"$f":"+F53*(1+IF($C$38=\"Nominal\",G$34,G$35))","v":0},{"$f":"+G53*(1+IF($C$38=\"Nominal\",H$34,H$35))","v":0},{"$f":"+SUM(D53:H53)","v":0},{"$f":"+AVERAGE(D53:H53)","v":0}]
[null,"Annual change",null,{"$f":"+D53-C53","v":0},{"$f":"+E53-D53","v":0},{"$f":"+F53-E53","v":0},{"$f":"+G53-F53","v":0},{"$f":"+H53-G53","v":0},{"$f":"+SUM(D54:H54)","v":0},{"$f":"+AVERAGE(D54:H54)","v":0},{"$f":"+J54/D21","v":{"$error":"#DIV/0!"}}]
[]
[]
[null,"Transmission bill component - Business customer",{"$f":"CONCATENATE(\"Real \", dms_DollarReal)","v":"Real June 2019"}]
[null,"Tariff type",{"$f":"CRCP_y5","v":"2018-19"},{"$f":"FRCP_y1","v":"2019-20"},{"$f":"FRCP_y2","v":"2020-21"},{"$f":"FRCP_y3","v":"2021-22"},{"$f":"FRCP_y4","v":"2022-23"},{"$f":"FRCP_y5","v":"2023-24"},{"$f":"CONCATENATE(\"Total \",FRCP_y1,\" to \", IF(SUM(dms_SingleYear_Model)>0,\"\",dms_MultiYear_FinalYear_Result))","v":"Total 2019-20 to 2023-24"},"Annual average","Annual impact on customer bill (%)"]
[]
[null,{"$f":"+B26","v":"TAS22"},{"$f":"+D26*$C$12","v":717.02843605603766},{"$f":"+C60*(1+IF($C$57=\"Nominal\",D$34,D$35))","v":706.97424110184693},{"$f":"+D60*(1+IF(D57=\"Nominal\",E$34,E$35))","v":673.64157897633936},{"$f":"+E60*(1+IF(E57=\"Nominal\",F$34,F$35))","v":641.49226291264995},{"$f":"+F60*(1+IF(F57=\"Nominal\",G$34,G$35))","v":610.85962029067207},{"$f":"+G60*(1+IF(G57=\"Nominal\",H$34,H$35))","v":581.59510846565058},{"$f":"+SUM(D60:H60)","v":3214.5628117471588},{"$f":"+AVERAGE(D60:H60)","v":642.91256234943171}]
[null,"Annual change",null,{"$f":"+D60-C60","v":-10.054194954190734},{"$f":"+E60-D60","v":-33.332662125507568},{"$f":"+F60-E60","v":-32.149316063689412},{"$f":"+G60-F60","v":-30.63264262197788},{"$f":"+H60-G60","v":-29.264511825021486},{"$f":"+SUM(D61:H61)","v":-135.43332759038708},{"$f":"+AVERAGE(D61:H61)","v":-27.086665518077417},{"$f":"+J61/D26","v":-4.1600844931425941E-3}]
[]
[null,{"$f":"+B27","v":0},{"$f":"+D27*$C$12","v":0},{"$f":"+C63*(1+IF(C60=\"Nominal\",D$34,D$35))","v":0},{"$f":"+D63*(1+IF(D60=\"Nominal\",E$34,E$35))","v":0},{"$f":"+E63*(1+IF(E60=\"Nominal\",F$34,F$35))","v":0},{"$f":"+F63*(1+IF(F60=\"Nominal\",G$34,G$35))","v":0},{"$f":"+G63*(1+IF(G60=\"Nominal\",H$34,H$35))","v":0},0,0]
[null,"Annual change",null,{"$f":"+D63-C63","v":0},{"$f":"+E63-D63","v":0},{"$f":"+F63-E63","v":0},{"$f":"+G63-F63","v":0},{"$f":"+H63-G63","v":0},0,0,{"$f":"+J64/D27","v":{"$error":"#DIV/0!"}}]
[]
[null,{"$f":"+B28","v":"<NSP to insert any additional items>"},{"$f":"+D28*$C$12","v":0},{"$f":"+C66*(1+IF(C63=\"Nominal\",D$34,D$35))","v":0},{"$f":"+D66*(1+IF(D63=\"Nominal\",E$34,E$35))","v":0},{"$f":"+E66*(1+IF(E63=\"Nominal\",F$34,F$35))","v":0},{"$f":"+F66*(1+IF(F63=\"Nominal\",G$34,G$35))","v":0},{"$f":"+G66*(1+IF(G63=\"Nominal\",H$34,H$35))","v":0},0,0]
[null,"Annual change",null,{"$f":"+D66-C66","v":0},{"$f":"+E66-D66","v":0},{"$f":"+F66-E66","v":0},{"$f":"+G66-F66","v":0},{"$f":"+H66-G66","v":0},0,0,{"$f":"+J67/D28","v":{"$error":"#DIV/0!"}}]
[]
[null,{"$f":"+B29","v":"<NSP to insert any additional items>"},{"$f":"+D29*$C$12","v":0},{"$f":"+C69*(1+IF(C66=\"Nominal\",D$34,D$35))","v":0},{"$f":"+D69*(1+IF(D66=\"Nominal\",E$34,E$35))","v":0},{"$f":"+E69*(1+IF(E66=\"Nominal\",F$34,F$35))","v":0},{"$f":"+F69*(1+IF(F66=\"Nominal\",G$34,G$35))","v":0},{"$f":"+G69*(1+IF(G66=\"Nominal\",H$34,H$35))","v":0},{"$f":"+SUM(D69:H69)","v":0},{"$f":"+AVERAGE(D69:H69)","v":0}]
[null,"Annual change",null,{"$f":"+D69-C69","v":0},{"$f":"+E69-D69","v":0},{"$f":"+F69-E69","v":0},{"$f":"+G69-F69","v":0},{"$f":"+H69-G69","v":0},{"$f":"+SUM(D70:H70)","v":0},{"$f":"+AVERAGE(D70:H70)","v":0},{"$f":"+J70/D29","v":{"$error":"#DIV/0!"}}]

{"sheet":"7.9 STPIS","index":28,"n_rows":187,"n_cols":12,"rows_kept":187,"cut":false,"hidden":false,"merged":[[5,1,5,2],[11,11,12,11],[32,1,33,1],[32,2,33,2],[32,4,33,4],[32,5,32,11],[11,7,12,7],[11,8,12,8],[11,9,12,9],[11,10,12,10],[32,3,33,3],[75,3,75,4],[75,5,75,6],[8,1,8,5],[11,1,12,1],[11,2,11,6],[71,1,71,3],[74,3,74,7]]}
[null,{"$f":"(LOOKUP(dms_Model,dms_Model_List,dms_Worksheet_List))","v":"REGULATORY REPORTING STATEMENT"}]
[null,{"$f":"INDEX(dms_TradingNameFull_List,MATCH(dms_TradingName,dms_TradingName_List))","v":"TasNetworks (T)"}]
[null,{"$f":"IF(SUM(dms_SingleYear_Model)>0,CRY,CONCATENATE(FRCP_y1,\" to \",dms_MultiYear_FinalYear_Result))","v":"2019-20 to 2023-24"}]
[null,"7.9 SERVICE TARGET PERFORMANCE INCENTIVE SCHEME (STPIS)"]
[]
[null,"There are FOUR tables on this worksheet. Each table has been grouped (and sub-grouped) for ease of navigation. See the Instructions sheet on how to group or ungroup tables. "]
[]
[null,"Instructions"]
[null,{"$f":"dms_TradingName&\" is required to provide the performance actuals for the most recent five years, and the proposed floor, target and cap for the next regulatory control period for the parameters under the service component of the STPIS in table 7.9.1 below.\"","v":"TasNetworks (T) is required to provide the performance actuals for the most recent five years, and the proposed floor, target and cap for the next regulatory control period for the parameters under the service component of the STPIS in table 7.9.1 below."}]
[]
[null,"7.9.1 - Historical performance and proposed floor, caps and targets for the service component of the STPIS"]
[null,"Parameter","Performance actuals",null,null,null,null,"Average of actual performance","Floor","Target","Cap","Weighting \n(% of MAR)"]
[null,null,"2012-13","2013-14","2014-15","2015-16","2016-17"]
[null,"Unplanned outage circuit event rate:"]
[null,"Transmission line outage - fault",0.45,0.17,0.17,0.2,0.17,{"$f":"+AVERAGE(C15:G15)","v":0.23199999999999998},35,23,11,2E-3]
[null,"Transformer outage – fault ",0.16,0.1,0.09,7.0000000000000007E-2,0.08,{"$f":"+AVERAGE(C16:G16)","v":0.1},14,10,6,2E-3]
[null,"Reactive plant – fault ",0.17,0.08,0.25,0,0.17,0.13400000000000001,23,13,3,1E-3]
[null,"Transmission line outage – forced outage",0.06,7.0000000000000007E-2,0.08,0.15,7.0000000000000007E-2,8.5999999999999993E-2,13,9,5,1E-3]
[null,"Transformer outage – forced outage",0.02,0.13,0.11,0.12,0.12,0.1,15,10,5,1E-3]
[null,"Reactive plant – forced outage",0.33,0.5,1,0,0.08,0.38200000000000001,76,38,0,5.0000000000000001E-4]
[null,"Loss of supply event frequency (number of events):"]
[null,">  (x) system minutes",17,8,7,0,3,7,14,7,0,1.5E-3]
[null,">  (y) system minutes",4,4,2,0,2,2.4,4,2,0,1.5E-3]
[null,"Average outage duration (minutes): ",191,56,228,60,65,120,200,153,100,2E-3]
[null,"Proper operation of equipment (number of events):"]
[null,"Failure of protection system",13,0,4,1,3,4.2,8,4,0,0]
[null,"Material failure of SCADA",2,2,2,4,4,2.8,4,3,2,0]
[null,"Incorrect operational isolation of primary or secondary equipment",2,4,6,6,3,4.2,6,4,2,0]
[]
[]
[]
[null,"7.9.2 - Proposed priority projects for the network capability incentive parameter"]
[null,"Project ranking","Transmission Circuit /  Injection Point","Scope of works",{"$f":"CONCATENATE((\"If applicable, the present value of quantified benefits associated with the project\n ($0's, \"),CRCP_y5,\")\")","v":"If applicable, the present value of quantified benefits associated with the project\n ($0's, 2018-19)"},{"$f":"CONCATENATE((\"Project cost ($0's, \"),CRCP_y5,\")\")","v":"Project cost ($0's, 2018-19)"}]
[null,null,null,null,null,{"$f":"FRCP_y1","v":"2019-20"},{"$f":"FRCP_y2","v":"2020-21"},{"$f":"FRCP_y3","v":"2021-22"},{"$f":"FRCP_y4","v":"2022-23"},{"$f":"FRCP_y5","v":"2023-24"},"Opex","Capex"]
[null,1,"Farrell-Que-Savage River-Hampshire-Burnie 110 kV transmission circuit ","(1) Replace manually operated disconnectors A129, B129 and C129 at Waratah Tee Switching Station with remotely-operated, motorised disconnectors. \n(2) Provision of AC/DC supplies and telecommunications to Waratah Tee Switching Station.","Following an outage of the Farrell-Que-Waratah Tee 110 kV circuit immediate supply restoration to Savage River and Que substations.\n",null,200000,410000]
[null,2,"Burnie-Smithton 110 kV transmission line","Install a new weather station near Smithton to enable dynamic rating of Burnie Smithton 110 kV transmission line","Prevents loss of supply to west coast load, loss of generation and potential full or partial system black following  failure to open a single bus-couple circuit breaker at Farrell 220 kV substation. \nSupply restoration time of 0 minutes.",null,365000]
[null,3,"Norwood-Scottsdale-Derby 110 kV transmission circuit","Improve footing earthing at selected towers on the Norwood Scottsdale Derby transmission circuits.","Transmission line lightning performance able to withstand 98% of lightning strikes, and the removal of Norwood-Scottsdale 110 kV double transmission circuits from the re-classification list.",null,300000,500000]
[null,4,"Farrell Substation","Install a second 220 kV bus coupler in series with the existing bus coupler A752B and modify protection and control schemes as required at Farrell 220 kV Substation.","Prevents loss of supply to west coast load, loss of generation and potential full or partial system black following  failure to open a single bus-couple circuit breaker at Farrell 220 kV substation. \nSupply restoration time of 0 minutes.",null,240000,1000000]
[null,5,"Sheffield–Fisher 220 kV transmission line\nFarrell–Mackintosh 220 kV transmission line\nSheffield–Devils Gate transmission line\nTungatinah–Butlers Gorge 110 kV transmission lines\nBurnie–Smithton 110kV transmission line\nFarrell–Que–Waratah Tee 110 kV transmission line\nSheffield–Railton 110 kV transmission line\nNew Norfolk–Creek Rd 110 kV transmission line\nGeorge Town–Starwood 110 kV transmission line","Improve ground clearances at identified sites on the 110 kV and 220 kV transmission lines by ground profiling, conductor tensioning, waist extension and raising tower heights. \nTransmission lines are listed in the 'Transmission circuit/Injection point' column.","Improved ground clearances to re-establish transmission circuit operation to its design temperature; thereby increasing transmission capacity, decreasing safety and environmental risks and meeting transmission circuit clearance compliance.",5000,1000000,1000000,500000]
[null,6]
[null,7]
[null,8]
[null,9]
[null,10]
[null,11]
[null,12]
[null,13]
[null,14]
[null,15]
[null,16]
[]
[]
[]
[]
[null,"7.9.3 – Network limit information"]
[null,"Limit identification ","Define limit  ","Reason for the limit ","Is limit addressed by priority project","Supporting information reference"]
[null,"Following an outage of the Farrell-Que-Waratah Tee 110 kV circuit, approximately 228 minutes to restore supply to Savage River and Que substations.","Circuit restoration time is approximately 228 minutes due to current limit presented by existing manual disconnectors. ","Manual disconnectors preventing real time switching","Yes"]
[null,"Thermal ratings of Burnie-Smithton and Burnie-Port Latta-Smithton 110 kV circuits are static rating for a given discreate ambient temperature. ","Currently static thermal rating is applied to Burnie-Smiththon 110 kV transmission circuits in absence of a weather station","Absence of real time weather station data prevents this transmisison circuits to be dynamically rated.  ","Yes"]
[null,"Sub-optimal transmission line lightning performance, with an average of 4.5 outages per year due to lightning strikes, and an average re-classification twice a month for an average of two hours.","High footing resistance of transmission towers do not allow a discharge path for lightning strikes to dissipate to ground and results a back flashover converting a single phase fault into multiphase fault incident. TasNetworks has policy not to auto-reclose circuit breakers during a multi-phase faults.Reducing  footing resistance of exposed towers will improve service reliability and minimise extended outage duration allowing low cost wind generation to be dispatched into the NEM.  ","High footing impedance of few exposed transmission towers","Yes"]
[null,"A failure to open the circuit breaker of Farrell Substation 220 kV bus coupler (circuit breaker stuck condition) will disconnect  all the 220 kV circuits connected at Farrell Substation. This will result in \n(1) loss of supply to Roseberry, Newton, Queenstown, Que and Savage River substation,.\n(2) loss of generation from John Butters, Reece, Tribute, Bastyan and Mackintosh, and \n(3) potential full or partial system black.  \nExpected outage time is 240 minutes.","Prevent widespread disturbance durign a circuit fail incident","A single bus coupler circuit breaekr at Farrell Substation","Yes"]
[null,"Sub-optimal ground clearance, resulting in transmission line capacities less than their design temperatures. This results in  constrained flows, increased safety and environmental risks, and unmet transmission circuit clearance compliance along these lines.","\nSub-optimal ground clearance results into potential de-rating to transmission circuits that connects various Hydro generator resulting into constrained flow preventing low cost generation to be fed into NEM \n","Sub-standard ground clearance identified during LiDAR survey ","Yes"]
[]
[]
[]
[]
[]
[]
[]
[null,"7.9.4 - Market impact component"]
[]
[null,"Instructions"]
[null,{"$f":"dms_TradingName&\" is required to provide performance data in accordance with Appendix C of the STPIS for the preceding six calendar years in table 7.9.4 below.\n\n\"&dms_TradingName&\" is also required to provide relevant information in the MIC workbook attached to Appendix A of the Notice.\"","v":"TasNetworks (T) is required to provide performance data in accordance with Appendix C of the STPIS for the preceding six calendar years in table 7.9.4 below.\n\nTasNetworks (T) is also required to provide relevant information in the MIC workbook attached to Appendix A of the Notice."}]
[]
[]
[null,null,null,"Market impact parameter"]
[null,null,null,"Planned outage count(DI)",null,"Unplanned outage count (DI) "]
[null,"Year","Month","without exclusions","with exclusions","without exclusions","with exclusions","Market impact parameters"]
[null,{"$f":"LEFT(PRCP_y3,4)","v":"2011"},"January",null,null,8,8,{"$f":"+E78/12","v":0}]
[null,"2011","February",14,3,null,null,0.25]
[null,"2011","March",9,9,null,null,0.75]
[null,"2011","April",3,3,null,null,0.25]
[null,"2011","May",49,49,null,null,4.083333333333333]
[null,"2011","June",4,0,null,null,0]
[null,"2011","July",null,null,54,54,0]
[null,"2011","August",171,0,null,null,0]
[null,"2011","September",63,63,null,null,5.25]
[null,"2011","October",69,69,null,null,5.75]
[null,"2011","November",107,107,null,null,8.9166666666666661]
[null,"2011","December",364,364,null,null,30.333333333333332]
[null,{"$f":"CONCATENATE(\"Total \",LEFT(PRCP_y3,4))","v":"Total 2011"},null,{"$f":"+SUM(D78:D89)","v":853},{"$f":"+SUM(E78:E89)","v":667},{"$f":"+SUM(F78:F89)","v":62},{"$f":"+SUM(G78:G89)","v":62},{"$f":"+SUM(H78:H89)","v":55.583333333333329}]
[null,{"$f":"LEFT(PRCP_y4,4)","v":"2012"},"January",130,130,31,31,{"$f":"+E91/12","v":10.833333333333334}]
[null,"2012","February",20,20,3,3,1.6666666666666667]
[null,"2012","March",null,null,null,null,0]
[null,"2012","April",173,173,3,3,14.416666666666666]
[null,"2012","May",198,198,null,null,16.5]
[null,"2012","June",null,null,null,null,0]
[null,"2012","July",292,292,2,0,24.333333333333332]
[null,"2012","August",422,422,null,null,35.166666666666664]
[null,"2012","September",26,26,null,null,2.1666666666666665]
[null,"2012","October",80,80,4,4,6.666666666666667]
[null,"2012","November",47,47,1,1,3.9166666666666665]
[null,"2012","December",null,null,null,null,0]
[null,{"$f":"CONCATENATE(\"Total \", LEFT(PRCP_y4,4))","v":"Total 2012"},null,{"$f":"+SUM(D91:D102)","v":1388},{"$f":"+SUM(E91:E102)","v":1388},{"$f":"+SUM(F91:F102)","v":44},{"$f":"+SUM(G91:G102)","v":42},{"$f":"+SUM(H91:H102)","v":115.66666666666667}]
[null,{"$f":"LEFT(PRCP_y5,4)","v":"2013"},"January",229,229,null,null,{"$f":"+E104/12","v":19.083333333333332}]
[null,"2013","February",70,70,21,null,5.833333333333333]
[null,"2013","March",33,33,56,56,2.75]
[null,"2013","April",28,28,null,null,2.3333333333333335]
[null,"2013","May",306,306,null,null,25.5]
[null,"2013","June",105,35,null,null,2.9166666666666665]
[null,"2013","July",3,3,8,8,0.25]
[null,"2013","August",null,null,null,null,0]
[null,"2013","September",32,32,null,null,2.6666666666666665]
[null,"2013","October",287,287,null,null,23.916666666666668]
[null,"2013","November",502,502,null,null,41.833333333333336]
[null,"2013","December",171,171,null,null,14.25]
[null,{"$f":"CONCATENATE(\"Total \", LEFT(PRCP_y5,4))","v":"Total 2013"},null,{"$f":"+SUM(D104:D115)","v":1766},{"$f":"+SUM(E104:E115)","v":1696},{"$f":"+SUM(F104:F115)","v":85},{"$f":"+SUM(G104:G115)","v":64},{"$f":"+SUM(H104:H115)","v":141.33333333333334}]
[null,{"$f":"LEFT(CRCP_y1,4)","v":"2014"},"January",110,109,null,null,{"$f":"+E117/12","v":9.0833333333333339}]
[null,"2014","February",87,87,18,18,7.25]
[null,"2014","March",412,392,null,null,32.666666666666664]
[null,"2014","April",11,11,null,null,0.91666666666666663]
[null,"2014","May",null,null,null,null,0]
[null,"2014","June",3,3,3,3,0.25]
[null,"2014","July",123,72,28,28,6]
[null,"2014","August",37,35,null,null,2.9166666666666665]
[null,"2014","September",35,35,5,5,2.9166666666666665]
[null,"2014","October",1,null,null,null,0]
[null,"2014","November",27,21,null,null,1.75]
[null,"2014","December",376,357,54,54,29.75]
[null,{"$f":"CONCATENATE(\"Total \", LEFT(CRCP_y1,4))","v":"Total 2014"},null,{"$f":"+SUM(D117:D128)","v":1222},{"$f":"+SUM(E117:E128)","v":1122},{"$f":"+SUM(F117:F128)","v":108},{"$f":"+SUM(G117:G128)","v":108},{"$f":"+SUM(H117:H128)","v":93.5}]
[null,{"$f":"LEFT(CRCP_y2,4)","v":"2015"},"January",null,null,null,null,{"$f":"+E130/12","v":0}]
[null,"2015","February",61,61,24,24,5.083333333333333]
[null,"2015","March",3,3,null,null,0.25]
[null,"2015","April",88,88,null,null,7.333333333333333]
[null,"2015","May",null,null,32,32,0]
[null,"2015","June",null,null,16,16,0]
[null,"2015","July",null,null,null,null,0]
[null,"2015","August",null,null,null,null,0]
[null,"2015","September",null,null,15,15,0]
[null,"2015","October",8,8,null,null,0.66666666666666663]
[null,"2015","November",null,null,null,null,0]
[null,"2015","December",null,null,null,null,0]
[null,{"$f":"CONCATENATE(\"Total \", LEFT(CRCP_y2,4))","v":"Total 2015"},null,{"$f":"+SUM(D130:D141)","v":160},{"$f":"+SUM(E130:E141)","v":160},{"$f":"+SUM(F130:F141)","v":87},{"$f":"+SUM(G130:G141)","v":87},{"$f":"+SUM(H130:H141)","v":13.333333333333332}]
[null,{"$f":"LEFT(CRCP_y3,4)","v":"2016"},"January",73,null,null,null,{"$f":"+E143/12","v":0}]
[null,"2016","February",34,34,4,4,2.8333333333333335]
[null,"2016","March",null,null,null,null,0]
[null,"2016","April",null,null,null,null,0]
[null,"2016","May",4,4,23,23,0.33333333333333331]
[null,"2016","June",null,null,null,null,0]
[null,"2016","July",10,null,525,525,0]
[null,"2016","August",39,39,null,null,3.25]
[null,"2016","September",52,46,31,31,3.8333333333333335]
[null,"2016","October",547,469,null,null,39.083333333333336]
[null,"2016","November",993,993,null,null,82.75]
[null,"2016","December",795,795,14,14,66.25]
[null,{"$f":"CONCATENATE(\"Total \", LEFT(CRCP_y3,4))","v":"Total 2016"},null,{"$f":"+SUM(D143:D154)","v":2547},{"$f":"+SUM(E143:E154)","v":2380},{"$f":"+SUM(F143:F154)","v":597},{"$f":"+SUM(G143:G154)","v":597},{"$f":"+SUM(H143:H154)","v":198.33333333333334}]
[null,{"$f":"LEFT(CRCP_y4,4)","v":"2017"},"January",null,null,null,null,{"$f":"+E156/12","v":0}]
[null,"2017","February",836,836,null,null,69.666666666666671]
[null,"2017","March",14,14,null,null,1.1666666666666667]
[null,"2017","April",1043,1043,39,39,86.916666666666671]
[null,"2017","May",62,60,87,87,5]
[null,"2017","June",235,235,null,null,19.583333333333332]
[null,"2017","July",98,98,null,null,8.1666666666666661]
[null,"2017","August",null,null,null,null,0]
[null,"2017","September",null,null,144,144,0]
[null,"2017","October",45,45,null,null,3.75]
[null,"2017","November",100,100,1,1,8.3333333333333339]
[null,"2017","December",0,0,0,0,0]
[null,{"$f":"CONCATENATE(\"Total \", LEFT(CRCP_y4,4))","v":"Total 2017"},null,{"$f":"+SUM(D156:D167)","v":2433},{"$f":"+SUM(E156:E167)","v":2431},{"$f":"+SUM(F156:F167)","v":271},{"$f":"+SUM(G156:G167)","v":271},{"$f":"+SUM(H156:H167)","v":202.58333333333334}]
[null,{"$f":"LEFT(CRCP_y5,4)","v":"2018"},"January",null,null,null,null,{"$f":"+E169/12","v":0}]
[null,"2018","February",null,null,null,null,0]
[null,"2018","March",null,null,null,null,0]
[null,"2018","April",null,null,null,null,0]
[null,"2018","May",null,null,null,null,0]
[null,"2018","June",null,null,null,null,0]
[null,"2018","July",null,null,null,null,0]
[null,"2018","August",null,null,null,null,0]
[null,"2018","September",null,null,null,null,0]
[null,"2018","October",null,null,null,null,0]
[null,"2018","November",null,null,null,null,0]
[null,"2018","December",null,null,null,null,0]
[null,{"$f":"CONCATENATE(\"Total \", LEFT(CRCP_y5,4))","v":"Total 2018"},null,{"$f":"+SUM(D169:D180)","v":0},{"$f":"+SUM(E169:E180)","v":0},{"$f":"+SUM(F169:F180)","v":0},{"$f":"+SUM(G169:G180)","v":0},{"$f":"+SUM(H169:H180)","v":0}]
[null,{"$f":"LEFT(FRCP_y1,4)","v":"2019"},"January",null,null,null,null,{"$f":"+E182/12","v":0}]
[null,"2019","February",null,null,null,null,0]
[null,"2019","March",null,null,null,null,0]
[null,"2019","April",null,null,null,null,0]
[null,"2019","May",null,null,null,null,0]
[null,"2019","June",null,null,null,null,0]