{"text_format":"1","workbook":"xlsx","n_sheets":17,"sheets":["Introduction","Contents","Dashboard","Calculations","1. Revenue","2. RAB - Closing","3. Capex","4. Capex by Driver","5. Opex","6. Reliability -outage events","7. Reliability -outage duration","8. Market impact","9. Maximum demand","10. Energy delivered","11. Circuit length","12. Return on assets","Data sheet"],"not_rendered":{"charts":24,"images":1,"macros":1,"external_links":5,"defined_names":327,"comments":0,"pivot_tables":0},"unopened":[],"bounds":{"document_bytes":16777216,"sheet_cells":100000,"rows_first":2000,"rows_last":500,"rows_between":2000,"halvings":0,"cell_chars":16384,"cell_head_chars":4096},"cells_cut":0,"cells_raw":0,"read":"whole","date_system":"1900"}

{"sheet":"Introduction","index":0,"n_rows":24,"n_cols":10,"rows_kept":24,"cut":false,"hidden":false,"merged":[[10,2,10,14],[12,2,13,14],[16,2,16,14],[14,2,14,14]]}
[]
[null,null,null,"Electricity Transmission Network Service Provider"]
[null,null,null,null,"Performance Data"]
[]
[]
[null,"Introduction"]
[]
[]
[]
[]
[null,null,"This workbook contains performance data for electricity transmission businesses in the National Energy Market (NEM). The charts and data are presented for a range of financial and network performance measures.  "]
[null,null,"Interpretation"]
[null,null,"The data covers the regulatory years from 2006 to 2018. It is reported on an end of year basis. All transmission businesses report on a financial year basis, hence the label 2015 refers to data collected for the year ending 30 June 2015 (or 31 March 2015 for AusNet (T)). Exceptions to this are tables 6,7 and 8, which are reported on a calendar year basis, in line with STPIS reporting timeframes.\n\nAll financial values have been converted to June 2018 dollars (or March 2018 dollars for AusNet (T))."]
[]
[null,null,"These data series are provided to facilitate general stakeholder engagement in the AER's regulatory processes. The data is subject to revisions, arising from changes from improved data collation, or regulatory updates that apply from time to time. Information to aid interpretation of the data is available with the transmission businesses RIN responses, and AER Guidelines and Explanatory material associated with our models and data collections - available on the AER website."]
{"$rows_left_out":10}
{"sheet":"Contents","index":1,"n_rows":26,"n_cols":5,"rows_kept":26,"cut":false,"hidden":false,"merged":[[12,2,12,12],[25,2,25,12],[11,2,11,12],[24,2,24,12],[13,2,13,12],[14,2,14,12],[15,2,15,12],[16,2,16,12],[17,2,17,12],[18,2,18,12],[19,2,19,12],[20,2,20,12],[21,2,21,12],[22,2,22,12],[23,2,23,12]]}
[]
[]
[null,null,"Electricity Transmission Network Service Provider"]
[null,null,null,null,"Performance Data"]
[]
[null,"Contents"]
[]
[]
[]
[]
[]
[]
[null,null,"Dashboard"]
[null,null,"1. Revenue"]
[null,null,"2. Regulated asset base"]
{"$rows_left_out":12}
{"sheet":"Dashboard","index":2,"n_rows":128,"n_cols":17,"rows_kept":128,"cut":false,"hidden":false,"merged":[[2,5,2,9]]}
[]
[]
[null,null,null,null,null,"Transmission total"]
[]
[]
[null,null,null,null,null,null,"Summary statistics"]
[]
[]
[null,null,null,null,null,null,null,"2018 value","5 year trend"]
[null,null,null,null,null,null,"Actual revenue",{"$f":"\"$\"&TEXT(Calculations!Q10,\"#,##0\")&\"m\"","v":"$2,634m"}]
[null,null,null,null,null,null,"Actual closing RAB",{"$f":"\"$\"&TEXT(Calculations!Q11,\"#,##0\")&\"m\"","v":"$20,718m"}]
[null,null,null,null,null,null,"Forecast closing RAB",{"$f":"\"$\"&TEXT(Calculations!Q12,\"#,##0\")&\"m\"","v":"$20,988m"}]
[null,null,null,null,null,null,"Actual annual capex",{"$f":"\"$\"&TEXT(Calculations!Q13,\"#,##0\")&\"m\"","v":"$744m"}]
[null,null,null,null,null,null,"Forecast annual capex",{"$f":"\"$\"&TEXT(Calculations!Q14,\"#,##0\")&\"m\"","v":"$708m"}]
[null,null,null,null,null,null,"Actual annual opex",{"$f":"\"$\"&TEXT(Calculations!Q15,\"#,##0\")&\"m\"","v":"$550m"}]
{"$rows_left_out":114}
{"sheet":"Calculations","index":3,"n_rows":34,"n_cols":21,"rows_kept":34,"cut":false,"hidden":true,"merged":[]}
[]
[]
[null,null,null,"Calculations"]
[]
[null,null,null,"Summary statistics"]
[]
[null,null,null,"Match",{"$f":"Dashboard!F3","v":"Transmission total"}]
[]
[null,null,null,null,"2006","2007","2008","2009","2010","2011","2012","2013","2014","2015",2016,2017,"2018","2019","2020","2021","2022"]
[null,null,null,"Actual revenue",{"$f":"INDEX('Data sheet'!$F:$K,MATCH($D10&E$9,'Data sheet'!$L:$L,0),MATCH($E$7,'Data sheet'!$F$6:$K$6,0))","v":2151.2422632778757},{"$f":"INDEX('Data sheet'!$F:$K,MATCH($D10&F$9,'Data sheet'!$L:$L,0),MATCH($E$7,'Data sheet'!$F$6:$K$6,0))","v":2217.0856919452858},{"$f":"INDEX('Data sheet'!$F:$K,MATCH($D10&G$9,'Data sheet'!$L:$L,0),MATCH($E$7,'Data sheet'!$F$6:$K$6,0))","v":2278.1691470757951},{"$f":"INDEX('Data sheet'!$F:$K,MATCH($D10&H$9,'Data sheet'!$L:$L,0),MATCH($E$7,'Data sheet'!$F$6:$K$6,0))","v":2484.2967535367652},{"$f":"INDEX('Data sheet'!$F:$K,MATCH($D10&I$9,'Data sheet'!$L:$L,0),MATCH($E$7,'Data sheet'!$F$6:$K$6,0))","v":2698.4285847159849},{"$f":"INDEX('Data sheet'!$F:$K,MATCH($D10&J$9,'Data sheet'!$L:$L,0),MATCH($E$7,'Data sheet'!$F$6:$K$6,0))","v":2869.741445584436},{"$f":"INDEX('Data sheet'!$F:$K,MATCH($D10&K$9,'Data sheet'!$L:$L,0),MATCH($E$7,'Data sheet'!$F$6:$K$6,0))","v":3043.934877863685},{"$f":"INDEX('Data sheet'!$F:$K,MATCH($D10&L$9,'Data sheet'!$L:$L,0),MATCH($E$7,'Data sheet'!$F$6:$K$6,0))","v":3144.060494085858},{"$f":"INDEX('Data sheet'!$F:$K,MATCH($D10&M$9,'Data sheet'!$L:$L,0),MATCH($E$7,'Data sheet'!$F$6:$K$6,0))","v":3101.4778453343251},{"$f":"INDEX('Data sheet'!$F:$K,MATCH($D10&N$9,'Data sheet'!$L:$L,0),MATCH($E$7,'Data sheet'!$F$6:$K$6,0))","v":3059.1511007369777},{"$f":"INDEX('Data sheet'!$F:$K,MATCH($D10&O$9,'Data sheet'!$L:$L,0),MATCH($E$7,'Data sheet'!$F$6:$K$6,0))","v":2932.1258387194566},{"$f":"INDEX('Data sheet'!$F:$K,MATCH($D10&P$9,'Data sheet'!$L:$L,0),MATCH($E$7,'Data sheet'!$F$6:$K$6,0))","v":2923.7820399568373},{"$f":"INDEX('Data sheet'!$F:$K,MATCH($D10&Q$9,'Data sheet'!$L:$L,0),MATCH($E$7,'Data sheet'!$F$6:$K$6,0))","v":2634.2295083171634},{"$f":"INDEX('Data sheet'!$F:$K,MATCH($D10&R$9,'Data sheet'!$L:$L,0),MATCH($E$7,'Data sheet'!$F$6:$K$6,0))","v":{"$error":"#N/A"}},{"$f":"INDEX('Data sheet'!$F:$K,MATCH($D10&S$9,'Data sheet'!$L:$L,0),MATCH($E$7,'Data sheet'!$F$6:$K$6,0))","v":{"$error":"#N/A"}},{"$f":"INDEX('Data sheet'!$F:$K,MATCH($D10&T$9,'Data sheet'!$L:$L,0),MATCH($E$7,'Data sheet'!$F$6:$K$6,0))","v":{"$error":"#N/A"}},{"$f":"INDEX('Data sheet'!$F:$K,MATCH($D10&U$9,'Data sheet'!$L:$L,0),MATCH($E$7,'Data sheet'!$F$6:$K$6,0))","v":{"$error":"#N/A"}}]
[null,null,null,"Actual closing RAB",{"$f":"INDEX('Data sheet'!$F:$K,MATCH($D11&E$9,'Data sheet'!$L:$L,0),MATCH($E$7,'Data sheet'!$F$6:$K$6,0))","v":13216.349231033579},{"$f":"INDEX('Data sheet'!$F:$K,MATCH($D11&F$9,'Data sheet'!$L:$L,0),MATCH($E$7,'Data sheet'!$F$6:$K$6,0))","v":14306.715589866149},{"$f":"INDEX('Data sheet'!$F:$K,MATCH($D11&G$9,'Data sheet'!$L:$L,0),MATCH($E$7,'Data sheet'!$F$6:$K$6,0))","v":15674.169789277743},{"$f":"INDEX('Data sheet'!$F:$K,MATCH($D11&H$9,'Data sheet'!$L:$L,0),MATCH($E$7,'Data sheet'!$F$6:$K$6,0))","v":16847.280214226426},{"$f":"INDEX('Data sheet'!$F:$K,MATCH($D11&I$9,'Data sheet'!$L:$L,0),MATCH($E$7,'Data sheet'!$F$6:$K$6,0))","v":17631.505231431893},{"$f":"INDEX('Data sheet'!$F:$K,MATCH($D11&J$9,'Data sheet'!$L:$L,0),MATCH($E$7,'Data sheet'!$F$6:$K$6,0))","v":18394.405866874193},{"$f":"INDEX('Data sheet'!$F:$K,MATCH($D11&K$9,'Data sheet'!$L:$L,0),MATCH($E$7,'Data sheet'!$F$6:$K$6,0))","v":19382.180572759768},{"$f":"INDEX('Data sheet'!$F:$K,MATCH($D11&L$9,'Data sheet'!$L:$L,0),MATCH($E$7,'Data sheet'!$F$6:$K$6,0))","v":20261.014706456015},{"$f":"INDEX('Data sheet'!$F:$K,MATCH($D11&M$9,'Data sheet'!$L:$L,0),MATCH($E$7,'Data sheet'!$F$6:$K$6,0))","v":21063.541218025977},{"$f":"INDEX('Data sheet'!$F:$K,MATCH($D11&N$9,'Data sheet'!$L:$L,0),MATCH($E$7,'Data sheet'!$F$6:$K$6,0))","v":20982.259122544543},{"$f":"INDEX('Data sheet'!$F:$K,MATCH($D11&O$9,'Data sheet'!$L:$L,0),MATCH($E$7,'Data sheet'!$F$6:$K$6,0))","v":20858.070635070188},{"$f":"INDEX('Data sheet'!$F:$K,MATCH($D11&P$9,'Data sheet'!$L:$L,0),MATCH($E$7,'Data sheet'!$F$6:$K$6,0))","v":20761.27651065624},{"$f":"INDEX('Data sheet'!$F:$K,MATCH($D11&Q$9,'Data sheet'!$L:$L,0),MATCH($E$7,'Data sheet'!$F$6:$K$6,0))","v":20718.205594379262},{"$f":"INDEX('Data sheet'!$F:$K,MATCH($D11&R$9,'Data sheet'!$L:$L,0),MATCH($E$7,'Data sheet'!$F$6:$K$6,0))","v":{"$error":"#N/A"}},{"$f":"INDEX('Data sheet'!$F:$K,MATCH($D11&S$9,'Data sheet'!$L:$L,0),MATCH($E$7,'Data sheet'!$F$6:$K$6,0))","v":{"$error":"#N/A"}},{"$f":"INDEX('Data sheet'!$F:$K,MATCH($D11&T$9,'Data sheet'!$L:$L,0),MATCH($E$7,'Data sheet'!$F$6:$K$6,0))","v":{"$error":"#N/A"}},{"$f":"INDEX('Data sheet'!$F:$K,MATCH($D11&U$9,'Data sheet'!$L:$L,0),MATCH($E$7,'Data sheet'!$F$6:$K$6,0))","v":{"$error":"#N/A"}}]
[null,null,null,"Forecast closing RAB",{"$f":"INDEX('Data sheet'!$F:$K,MATCH($D12&E$9,'Data sheet'!$L:$L,0),MATCH($E$7,'Data sheet'!$F$6:$K$6,0))","v":13461.307041121947},{"$f":"INDEX('Data sheet'!$F:$K,MATCH($D12&F$9,'Data sheet'!$L:$L,0),MATCH($E$7,'Data sheet'!$F$6:$K$6,0))","v":13627.164983037586},{"$f":"INDEX('Data sheet'!$F:$K,MATCH($D12&G$9,'Data sheet'!$L:$L,0),MATCH($E$7,'Data sheet'!$F$6:$K$6,0))","v":15614.461648109893},{"$f":"INDEX('Data sheet'!$F:$K,MATCH($D12&H$9,'Data sheet'!$L:$L,0),MATCH($E$7,'Data sheet'!$F$6:$K$6,0))","v":16954.245660464112},{"$f":"INDEX('Data sheet'!$F:$K,MATCH($D12&I$9,'Data sheet'!$L:$L,0),MATCH($E$7,'Data sheet'!$F$6:$K$6,0))","v":18176.90074788707},{"$f":"INDEX('Data sheet'!$F:$K,MATCH($D12&J$9,'Data sheet'!$L:$L,0),MATCH($E$7,'Data sheet'!$F$6:$K$6,0))","v":19282.688265525347},{"$f":"INDEX('Data sheet'!$F:$K,MATCH($D12&K$9,'Data sheet'!$L:$L,0),MATCH($E$7,'Data sheet'!$F$6:$K$6,0))","v":20278.761080189819},{"$f":"INDEX('Data sheet'!$F:$K,MATCH($D12&L$9,'Data sheet'!$L:$L,0),MATCH($E$7,'Data sheet'!$F$6:$K$6,0))","v":21318.007609229313},{"$f":"INDEX('Data sheet'!$F:$K,MATCH($D12&M$9,'Data sheet'!$L:$L,0),MATCH($E$7,'Data sheet'!$F$6:$K$6,0))","v":22169.476644733622},{"$f":"INDEX('Data sheet'!$F:$K,MATCH($D12&N$9,'Data sheet'!$L:$L,0),MATCH($E$7,'Data sheet'!$F$6:$K$6,0))","v":21979.730744142213},{"$f":"INDEX('Data sheet'!$F:$K,MATCH($D12&O$9,'Data sheet'!$L:$L,0),MATCH($E$7,'Data sheet'!$F$6:$K$6,0))","v":22396.580784047874},{"$f":"INDEX('Data sheet'!$F:$K,MATCH($D12&P$9,'Data sheet'!$L:$L,0),MATCH($E$7,'Data sheet'!$F$6:$K$6,0))","v":22690.231359391077},{"$f":"INDEX('Data sheet'!$F:$K,MATCH($D12&Q$9,'Data sheet'!$L:$L,0),MATCH($E$7,'Data sheet'!$F$6:$K$6,0))","v":20987.973671858002},{"$f":"INDEX('Data sheet'!$F:$K,MATCH($D12&R$9,'Data sheet'!$L:$L,0),MATCH($E$7,'Data sheet'!$F$6:$K$6,0))","v":{"$error":"#N/A"}},{"$f":"INDEX('Data sheet'!$F:$K,MATCH($D12&S$9,'Data sheet'!$L:$L,0),MATCH($E$7,'Data sheet'!$F$6:$K$6,0))","v":{"$error":"#N/A"}},{"$f":"INDEX('Data sheet'!$F:$K,MATCH($D12&T$9,'Data sheet'!$L:$L,0),MATCH($E$7,'Data sheet'!$F$6:$K$6,0))","v":{"$error":"#N/A"}},{"$f":"INDEX('Data sheet'!$F:$K,MATCH($D12&U$9,'Data sheet'!$L:$L,0),MATCH($E$7,'Data sheet'!$F$6:$K$6,0))","v":{"$error":"#N/A"}}]
[null,null,null,"Actual annual capex",{"$f":"INDEX('Data sheet'!$F:$K,MATCH($D13&E$9,'Data sheet'!$L:$L,0),MATCH($E$7,'Data sheet'!$F$6:$K$6,0))","v":897.33836880747879},{"$f":"INDEX('Data sheet'!$F:$K,MATCH($D13&F$9,'Data sheet'!$L:$L,0),MATCH($E$7,'Data sheet'!$F$6:$K$6,0))","v":989.41006957992533},{"$f":"INDEX('Data sheet'!$F:$K,MATCH($D13&G$9,'Data sheet'!$L:$L,0),MATCH($E$7,'Data sheet'!$F$6:$K$6,0))","v":1685.0445790037609},{"$f":"INDEX('Data sheet'!$F:$K,MATCH($D13&H$9,'Data sheet'!$L:$L,0),MATCH($E$7,'Data sheet'!$F$6:$K$6,0))","v":1782.5254459788271},{"$f":"INDEX('Data sheet'!$F:$K,MATCH($D13&I$9,'Data sheet'!$L:$L,0),MATCH($E$7,'Data sheet'!$F$6:$K$6,0))","v":1451.6376231994898},{"$f":"INDEX('Data sheet'!$F:$K,MATCH($D13&J$9,'Data sheet'!$L:$L,0),MATCH($E$7,'Data sheet'!$F$6:$K$6,0))","v":1448.08539939445},{"$f":"INDEX('Data sheet'!$F:$K,MATCH($D13&K$9,'Data sheet'!$L:$L,0),MATCH($E$7,'Data sheet'!$F$6:$K$6,0))","v":1613.1331716735799},{"$f":"INDEX('Data sheet'!$F:$K,MATCH($D13&L$9,'Data sheet'!$L:$L,0),MATCH($E$7,'Data sheet'!$F$6:$K$6,0))","v":1573.2220958448472},{"$f":"INDEX('Data sheet'!$F:$K,MATCH($D13&M$9,'Data sheet'!$L:$L,0),MATCH($E$7,'Data sheet'!$F$6:$K$6,0))","v":1245.7647463317419},{"$f":"INDEX('Data sheet'!$F:$K,MATCH($D13&N$9,'Data sheet'!$L:$L,0),MATCH($E$7,'Data sheet'!$F$6:$K$6,0))","v":746.30173326627403},{"$f":"INDEX('Data sheet'!$F:$K,MATCH($D13&O$9,'Data sheet'!$L:$L,0),MATCH($E$7,'Data sheet'!$F$6:$K$6,0))","v":742.55101538406268},{"$f":"INDEX('Data sheet'!$F:$K,MATCH($D13&P$9,'Data sheet'!$L:$L,0),MATCH($E$7,'Data sheet'!$F$6:$K$6,0))","v":753.40578669891033},{"$f":"INDEX('Data sheet'!$F:$K,MATCH($D13&Q$9,'Data sheet'!$L:$L,0),MATCH($E$7,'Data sheet'!$F$6:$K$6,0))","v":744.4902941705983},{"$f":"INDEX('Data sheet'!$F:$K,MATCH($D13&R$9,'Data sheet'!$L:$L,0),MATCH($E$7,'Data sheet'!$F$6:$K$6,0))","v":{"$error":"#N/A"}},{"$f":"INDEX('Data sheet'!$F:$K,MATCH($D13&S$9,'Data sheet'!$L:$L,0),MATCH($E$7,'Data sheet'!$F$6:$K$6,0))","v":{"$error":"#N/A"}},{"$f":"INDEX('Data sheet'!$F:$K,MATCH($D13&T$9,'Data sheet'!$L:$L,0),MATCH($E$7,'Data sheet'!$F$6:$K$6,0))","v":{"$error":"#N/A"}},{"$f":"INDEX('Data sheet'!$F:$K,MATCH($D13&U$9,'Data sheet'!$L:$L,0),MATCH($E$7,'Data sheet'!$F$6:$K$6,0))","v":{"$error":"#N/A"}}]
[null,null,null,"Forecast annual capex",{"$f":"INDEX('Data sheet'!$F:$K,MATCH($D14&E$9,'Data sheet'!$L:$L,0),MATCH($E$7,'Data sheet'!$F$6:$K$6,0))","v":788.40136684582967},{"$f":"INDEX('Data sheet'!$F:$K,MATCH($D14&F$9,'Data sheet'!$L:$L,0),MATCH($E$7,'Data sheet'!$F$6:$K$6,0))","v":748.94485791134878},{"$f":"INDEX('Data sheet'!$F:$K,MATCH($D14&G$9,'Data sheet'!$L:$L,0),MATCH($E$7,'Data sheet'!$F$6:$K$6,0))","v":1631.7953983171899},{"$f":"INDEX('Data sheet'!$F:$K,MATCH($D14&H$9,'Data sheet'!$L:$L,0),MATCH($E$7,'Data sheet'!$F$6:$K$6,0))","v":1601.0285403729831},{"$f":"INDEX('Data sheet'!$F:$K,MATCH($D14&I$9,'Data sheet'!$L:$L,0),MATCH($E$7,'Data sheet'!$F$6:$K$6,0))","v":1767.9609819508166},{"$f":"INDEX('Data sheet'!$F:$K,MATCH($D14&J$9,'Data sheet'!$L:$L,0),MATCH($E$7,'Data sheet'!$F$6:$K$6,0))","v":1814.291787728552},{"$f":"INDEX('Data sheet'!$F:$K,MATCH($D14&K$9,'Data sheet'!$L:$L,0),MATCH($E$7,'Data sheet'!$F$6:$K$6,0))","v":1719.0530827238954},{"$f":"INDEX('Data sheet'!$F:$K,MATCH($D14&L$9,'Data sheet'!$L:$L,0),MATCH($E$7,'Data sheet'!$F$6:$K$6,0))","v":1759.7203140098452},{"$f":"INDEX('Data sheet'!$F:$K,MATCH($D14&M$9,'Data sheet'!$L:$L,0),MATCH($E$7,'Data sheet'!$F$6:$K$6,0))","v":1638.0975513108319},{"$f":"INDEX('Data sheet'!$F:$K,MATCH($D14&N$9,'Data sheet'!$L:$L,0),MATCH($E$7,'Data sheet'!$F$6:$K$6,0))","v":1100.6420398689254},{"$f":"INDEX('Data sheet'!$F:$K,MATCH($D14&O$9,'Data sheet'!$L:$L,0),MATCH($E$7,'Data sheet'!$F$6:$K$6,0))","v":1287.0301116243149},{"$f":"INDEX('Data sheet'!$F:$K,MATCH($D14&P$9,'Data sheet'!$L:$L,0),MATCH($E$7,'Data sheet'!$F$6:$K$6,0))","v":1207.6897596195845},{"$f":"INDEX('Data sheet'!$F:$K,MATCH($D14&Q$9,'Data sheet'!$L:$L,0),MATCH($E$7,'Data sheet'!$F$6:$K$6,0))","v":708.37101225790718},{"$f":"INDEX('Data sheet'!$F:$K,MATCH($D14&R$9,'Data sheet'!$L:$L,0),MATCH($E$7,'Data sheet'!$F$6:$K$6,0))","v":{"$error":"#N/A"}},{"$f":"INDEX('Data sheet'!$F:$K,MATCH($D14&S$9,'Data sheet'!$L:$L,0),MATCH($E$7,'Data sheet'!$F$6:$K$6,0))","v":{"$error":"#N/A"}},{"$f":"INDEX('Data sheet'!$F:$K,MATCH($D14&T$9,'Data sheet'!$L:$L,0),MATCH($E$7,'Data sheet'!$F$6:$K$6,0))","v":{"$error":"#N/A"}},{"$f":"INDEX('Data sheet'!$F:$K,MATCH($D14&U$9,'Data sheet'!$L:$L,0),MATCH($E$7,'Data sheet'!$F$6:$K$6,0))","v":{"$error":"#N/A"}}]
[null,null,null,"Actual annual opex",{"$f":"INDEX('Data sheet'!$F:$K,MATCH($D15&E$9,'Data sheet'!$L:$L,0),MATCH($E$7,'Data sheet'!$F$6:$K$6,0))","v":521.26798503898522},{"$f":"INDEX('Data sheet'!$F:$K,MATCH($D15&F$9,'Data sheet'!$L:$L,0),MATCH($E$7,'Data sheet'!$F$6:$K$6,0))","v":531.78893652840179},{"$f":"INDEX('Data sheet'!$F:$K,MATCH($D15&G$9,'Data sheet'!$L:$L,0),MATCH($E$7,'Data sheet'!$F$6:$K$6,0))","v":532.76406774452846},{"$f":"INDEX('Data sheet'!$F:$K,MATCH($D15&H$9,'Data sheet'!$L:$L,0),MATCH($E$7,'Data sheet'!$F$6:$K$6,0))","v":550.31987979858854},{"$f":"INDEX('Data sheet'!$F:$K,MATCH($D15&I$9,'Data sheet'!$L:$L,0),MATCH($E$7,'Data sheet'!$F$6:$K$6,0))","v":577.25379879935053},{"$f":"INDEX('Data sheet'!$F:$K,MATCH($D15&J$9,'Data sheet'!$L:$L,0),MATCH($E$7,'Data sheet'!$F$6:$K$6,0))","v":553.77383537423475},{"$f":"INDEX('Data sheet'!$F:$K,MATCH($D15&K$9,'Data sheet'!$L:$L,0),MATCH($E$7,'Data sheet'!$F$6:$K$6,0))","v":574.14448958817252},{"$f":"INDEX('Data sheet'!$F:$K,MATCH($D15&L$9,'Data sheet'!$L:$L,0),MATCH($E$7,'Data sheet'!$F$6:$K$6,0))","v":559.16516619277354},{"$f":"INDEX('Data sheet'!$F:$K,MATCH($D15&M$9,'Data sheet'!$L:$L,0),MATCH($E$7,'Data sheet'!$F$6:$K$6,0))","v":606.50975876429925},{"$f":"INDEX('Data sheet'!$F:$K,MATCH($D15&N$9,'Data sheet'!$L:$L,0),MATCH($E$7,'Data sheet'!$F$6:$K$6,0))","v":613.58085764821669},{"$f":"INDEX('Data sheet'!$F:$K,MATCH($D15&O$9,'Data sheet'!$L:$L,0),MATCH($E$7,'Data sheet'!$F$6:$K$6,0))","v":626.06328101674865},{"$f":"INDEX('Data sheet'!$F:$K,MATCH($D15&P$9,'Data sheet'!$L:$L,0),MATCH($E$7,'Data sheet'!$F$6:$K$6,0))","v":622.94443556646615},{"$f":"INDEX('Data sheet'!$F:$K,MATCH($D15&Q$9,'Data sheet'!$L:$L,0),MATCH($E$7,'Data sheet'!$F$6:$K$6,0))","v":550.22046002515219},{"$f":"INDEX('Data sheet'!$F:$K,MATCH($D15&R$9,'Data sheet'!$L:$L,0),MATCH($E$7,'Data sheet'!$F$6:$K$6,0))","v":{"$error":"#N/A"}},{"$f":"INDEX('Data sheet'!$F:$K,MATCH($D15&S$9,'Data sheet'!$L:$L,0),MATCH($E$7,'Data sheet'!$F$6:$K$6,0))","v":{"$error":"#N/A"}},{"$f":"INDEX('Data sheet'!$F:$K,MATCH($D15&T$9,'Data sheet'!$L:$L,0),MATCH($E$7,'Data sheet'!$F$6:$K$6,0))","v":{"$error":"#N/A"}},{"$f":"INDEX('Data sheet'!$F:$K,MATCH($D15&U$9,'Data sheet'!$L:$L,0),MATCH($E$7,'Data sheet'!$F$6:$K$6,0))","v":{"$error":"#N/A"}}]
{"$rows_left_out":20}
{"sheet":"1. Revenue","index":4,"n_rows":41,"n_cols":16,"rows_kept":41,"cut":false,"hidden":false,"merged":[[3,1,3,13],[26,1,26,13],[28,1,28,15],[40,1,40,12]]}
[]
[]
[]
[null,"Revenue"]
[]
[]
[]
[]
[]
[]
[]
[]
[]
[]
[]
{"$rows_left_out":27}
{"sheet":"2. RAB - Closing","index":5,"n_rows":58,"n_cols":16,"rows_kept":58,"cut":false,"hidden":false,"merged":[[56,1,56,15],[57,1,57,15],[3,1,3,13],[26,1,26,13],[28,1,28,13],[40,1,41,15],[53,1,53,15],[55,1,55,15]]}
[]
[]
[]
[null,"Regulatory Asset Base"]
[]
[]
[]
[]
[]
[]
[]
[]
[]
[]
[]
{"$rows_left_out":44}
{"sheet":"3. Capex","index":6,"n_rows":55,"n_cols":16,"rows_kept":55,"cut":false,"hidden":false,"merged":[[3,1,3,13],[26,1,26,13],[28,1,28,13],[40,1,42,15],[54,1,54,15]]}
[]
[]
[]
[null,"Capital expenditure"]
[]
[]
[]
[]
[]
[]
[]
[]
[]
[]
[]
{"$rows_left_out":41}
{"sheet":"4. Capex by Driver","index":7,"n_rows":92,"n_cols":18,"rows_kept":92,"cut":false,"hidden":false,"merged":[[3,1,3,12],[33,1,33,12],[44,1,44,12],[47,11,48,12],[74,11,75,12]]}
[]
[]
[]
[null,"Capital expenditure by driver"]
[]
[]
[]
[null,null,null,null,null,null,null,null,null,null,null,null,null,null,null,null,null," "]
[]
[]
[]
[]
[]
[]
[]
{"$rows_left_out":78}
{"sheet":"5. Opex","index":8,"n_rows":56,"n_cols":18,"rows_kept":56,"cut":false,"hidden":false,"merged":[[3,1,3,13],[31,1,31,13],[43,1,43,13],[55,1,55,15]]}
[]
[]
[]
[null,"Operating expenditure"]
[]
[]
[]
[]
[]
[]
[]
[]
[]
[]
[]
{"$rows_left_out":42}
{"sheet":"6. Reliability -outage events","index":9,"n_rows":45,"n_cols":15,"rows_kept":45,"cut":false,"hidden":false,"merged":[[3,1,3,12],[28,1,32,12],[44,1,44,12]]}
[]
[]
[]
[null,"Network Reliability - Outage events"]
[]
[]
[]
[]
[]
[]
[]
[]
[]
[]
[]
{"$rows_left_out":31}
{"sheet":"7. Reliability -outage duration","index":10,"n_rows":46,"n_cols":15,"rows_kept":46,"cut":false,"hidden":false,"merged":[[3,1,3,12],[28,1,34,13],[45,1,45,12]]}
[]
[]
[]
[null,"Network Reliability - Outage Duration"]
[]
[]
[]
[]
[]
[]
[]
[]
[]
[]
[]
{"$rows_left_out":32}
{"sheet":"8. Market impact","index":11,"n_rows":41,"n_cols":15,"rows_kept":41,"cut":false,"hidden":false,"merged":[[3,1,3,12],[40,1,40,12],[29,1,29,14]]}
[]
[]
[]
[null,"Quality of Services - Market impact"]
[]
[]
[]
[]
[]
[]
[]
[]
[]
[]
[]
{"$rows_left_out":27}
{"sheet":"9. Maximum demand","index":12,"n_rows":43,"n_cols":16,"rows_kept":43,"cut":false,"hidden":false,"merged":[[3,1,3,13],[26,1,27,14],[39,1,39,13],[42,1,42,13]]}
[]
[]
[]
[null,"Maximum demand"]
[]
[]
[]
[]
[]
[]
[]
[]
[]
[]
[]
{"$rows_left_out":29}
{"sheet":"10. Energy delivered","index":13,"n_rows":39,"n_cols":16,"rows_kept":39,"cut":false,"hidden":false,"merged":[[3,1,3,13],[26,1,26,13],[38,1,38,15]]}
[]
[]
[]
[null,"Energy delivered"]
[]
[]
[]
[]
[]
[]
[]
[]
[]
[]
[]
{"$rows_left_out":25}
{"sheet":"11. Circuit length","index":14,"n_rows":57,"n_cols":16,"rows_kept":57,"cut":false,"hidden":false,"merged":[[3,1,3,13],[26,1,26,13],[56,1,56,13]]}
[]
[]
[]
[null,"Circuit length"]
[]
[]
[]
[]
[]
[]
[]
[]
[]
[]
[]
{"$rows_left_out":43}
{"sheet":"12. Return on assets","index":15,"n_rows":65,"n_cols":8,"rows_kept":65,"cut":false,"hidden":false,"merged":[[57,1,57,11],[56,1,56,11],[3,1,3,11],[18,1,18,10],[47,1,47,11],[49,1,49,11],[50,1,50,11],[51,1,51,11],[52,1,52,11],[53,1,53,11],[54,1,54,11],[55,1,55,11],[58,1,58,11],[59,1,59,11],[60,1,60,11],[63,1,63,11],[64,1,64,11]]}
[]
[]
[]
[null,"Return on assets"]
[]
[]
[]
[]
[]
[]
[]
[]
[]
[]
[]
{"$rows_left_out":51}
{"sheet":"Data sheet","index":16,"n_rows":213,"n_cols":12,"rows_kept":213,"cut":false,"hidden":false,"merged":[[0,3,0,12]]}
[null,null,null,"This sheet contains the data, as reported in the tables on worksheets 1-12, reformatted for presentation on the Dashboard."]
[]
[]
[null,null,null,"Raw data"]
[]
[null,null,null,"Category","Year","Powerlink","Transgrid","AusNet (T)","ElectraNet","TasNetworks (T)","Transmission total",{"$f":"D6&E6","v":"CategoryYear"}]
[null,null,null,"Actual Revenue","2006",641.12712484478629,621.84236245640568,501.27423359501086,230.27290281480938,156.72563956686338,2151.2422632778757,{"$f":"D7&E7","v":"Actual Revenue2006"}]
[null,null,null,"Actual Revenue","2007",675.48525049510101,641.08297539077489,502.3382352012726,235.63517693874255,162.54405391939477,2217.0856919452858,{"$f":"D8&E8","v":"Actual Revenue2007"}]
[null,null,null,"Actual Revenue","2008",687.93848779847337,663.62650636061051,522.65895584170414,237.91465965680024,166.03053741820685,2278.1691470757951,"Actual Revenue2008"]
[null,null,null,"Actual Revenue","2009",741.87784478298363,704.05023650800945,576.38746313250522,284.02603791959757,177.95517119366912,2484.2967535367652,"Actual Revenue2009"]
[null,null,null,"Actual Revenue","2010",787.37679819077573,811.15276068282174,601.2468487828296,299.3644335846783,199.28774347487939,2698.4285847159849,"Actual Revenue2010"]
[null,null,null,"Actual Revenue","2011",847.91763611880435,861.55431179496543,607.59429385324734,318.22289358663653,234.45231023078225,2869.741445584436,"Actual Revenue2011"]
[null,null,null,"Actual Revenue","2012",935.64561671394279,918.05889258324237,611.66903115655293,338.1663790099887,240.39495839995789,3043.934877863685,"Actual Revenue2012"]
[null,null,null,"Actual Revenue","2013",950.62747120424842,963.54731169618333,625.24771194705875,361.22311790031978,243.41488133804796,3144.060494085858,"Actual Revenue2013"]
[null,null,null,"Actual Revenue","2014",978.17209186033006,952.88682755736556,629.8700498895804,307.51599110148567,233.03288492556339,3101.4778453343251,"Actual Revenue2014"]
{"$rows_left_out":198}